0,0
1,1
2,3
3,7
4,15
5,30
6,61
7,122
8,244
9,232
10,208
11,161
12,67
13,135
14,14
15,28
16,57
17,114
18,229
19,203
20,151
21,47
22,95
23,191
24,127
25,254
26,253
27,251
28,247
29,238
30,220
31,184
32,113
33,227
34,199
35,142
36,29
37,59
38,118
39,237
40,218
41,180
42,104
43,209
44,163
45,71
46,143
47,31
48,63
49,126
50,252
51,249
52,243
53,230
54,205
55,155
56,54
57,109
58,219
59,182
60,108
61,217
62,178
63,100
64,200
65,145
66,35
67,70
68,141
69,27
70,55
71,111
72,223
73,190
74,125
75,250
76,245
77,234
78,212
79,169
80,82
81,164
82,73
83,146
84,37
85,74
86,148
87,41
88,83
89,166
90,77
91,154
92,52
93,105
94,211
95,167
96,79
97,158
98,60
99,120
100,240
101,224
102,193
103,130
104,4
105,9
106,18
107,36
108,72
109,144
110,33
111,66
112,133
113,10
114,20
115,40
116,81
117,162
118,69
119,139
120,23
121,46
122,93
123,187
124,119
125,239
126,222
127,188
128,121
129,242
130,228
131,201
132,147
133,39
134,78
135,156
136,56
137,112
138,225
139,195
140,134
141,12
142,24
143,49
144,99
145,198
146,140
147,25
148,51
149,103
150,206
151,157
152,58
153,116
154,233
155,210
156,165
157,75
158,150
159,45
160,91
161,183
162,110
163,221
164,186
165,117
166,235
167,214
168,173
169,90
170,181
171,106
172,213
173,171
174,86
175,172
176,88
177,177
178,98
179,196
180,136
181,17
182,34
183,68
184,137
185,19
186,38
187,76
188,152
189,48
190,97
191,194
192,132
193,8
194,16
195,32
196,64
197,129
198,2
199,5
200,11
201,22
202,44
203,89
204,179
205,102
206,204
207,153
208,50
209,101
210,202
211,149
212,43
213,87
214,174
215,92
216,185
217,115
218,231
219,207
220,159
221,62
222,124
223,248
224,241
225,226
226,197
227,138
228,21
229,42
230,85
231,170
232,84
233,168
234,80
235,160
236,65
237,131
238,6
239,13
240,26
241,53
242,107
243,215
244,175
245,94
246,189
247,123
248,246
249,236
250,216
251,176
252,96
253,192
254,128
