0 0 0.967741965255 0.699999988079 1.47619044781
0 1 0.805824880855 0.877650380135 1.41396212578
0 2 0.805555587565 0.896551728249 1.3846154213
1 0 0.758620658471 0.909090936184 1.45000004768
1 1 0.715141712775 0.904814720154 1.54542613029
1 2 0.72340425165 0.794117629528 1.74074077606
2 0 0.793103412414 0.869565188885 1.45000004768
2 1 0.762941901019 0.896522462368 1.4620000124
2 2 0.743589773137 0.896551728249 1.5
3 0 0.729729720325 0.888888895512 1.54166662693
3 1 0.711206730641 0.922992944717 1.52337121964
3 2 0.775510222949 0.868421077728 1.4848484993
4 0 0.634146319338 0.923076927662 1.70833337307
4 1 0.72361929032 0.894370555878 1.54515612125
4 2 0.647058841679 0.939393937588 1.6451612711
5 0 0.78787881634 0.884615361691 1.43478262424
5 1 0.679773755795 0.90922665596 1.61794388294
5 2 0.829268321617 0.882352948189 1.36666667461
6 0 1.09999996722 0.818181812763 1.11111116409
6 1 0.625907156373 0.914256036282 1.74752044678
6 2 0.791666698125 0.842105269432 1.5
7 0 1.0 0.846153855324 1.18181812763
7 1 0.716904822827 0.867718219757 1.60753262043
7 2 0.560000005341 0.952380955219 1.875
8 0 0.794117669333 0.814814805984 1.54545450211
8 1 0.757974670048 0.876606822014 1.5050137043
8 2 0.972222167493 0.771428585052 1.33333337307
9 0 0.764705893078 0.923076927662 1.41666662693
9 1 0.753222355722 0.886797368526 1.49710547924
9 2 0.71153846317 0.891891896725 1.57575762272
10 0 0.666666666667 0.785714268684 1.90909087658
10 1 0.663176519687 0.909824669361 1.657345891
10 2 0.820512820513 0.9375 1.29999995232
11 0 0.68181816704 0.933333337307 1.57142853737
11 1 0.661978857669 0.917697608471 1.64610028267
11 2 0.687499979511 0.939393937588 1.54838705063
12 0 0.878048821335 0.888888895512 1.28125
12 1 0.827139325899 0.851893305779 1.41917562485
12 2 0.648148136701 0.942857146263 1.63636362553
13 0 0.645833352581 0.903225779533 1.71428573132
13 1 0.697868419408 0.914556980133 1.56680762768
13 2 0.795918377029 0.846153855324 1.4848484993
14 0 0.692307705005 0.888888895512 1.625
14 1 0.717785342633 0.893513858318 1.55920827389
14 2 0.770833367792 0.918918907642 1.41176474094
15 0 1.04000002975 0.75 1.28205132484
15 1 0.687327212785 0.904745936394 1.60808813572
15 2 0.706896570612 0.902438998222 1.5675675869
16 0 1.25531913779 0.677966117859 1.17499995232
16 1 0.63522317715 0.927705943584 1.69692766666
16 2 0.953488414387 0.780487775803 1.34375
17 0 0.847222205389 0.786885261536 1.5
17 1 0.641224800423 0.925452411175 1.68513858318
17 2 0.678571437238 0.947368443012 1.55555558205
18 0 0.729999989557 0.890410959721 1.53846156597
18 1 1.12424409178 0.699793279171 1.27107036114
18 2 0.84615388495 0.886363625526 1.33333337307
19 0 0.819819828624 0.901098906994 1.35365855694
19 1 0.745237903599 0.886498987675 1.51365470886
19 2 0.723076946947 0.893617033958 1.54761910439
20 0 0.793388454765 0.875 1.44047617912
20 1 0.892873104871 0.822662115097 1.36140954494
20 2 0.702380947397 0.830508470535 1.71428573132
21 0 0.91851848932 0.790322601795 1.3775510788
21 1 0.72619215913 0.897348105907 1.53457283974
21 2 0.83333330022 0.923076927662 1.29999995232
22 0 0.762500007953 0.901639342308 1.45454549789
22 1 0.793497575174 0.872837007046 1.44384717941
22 2 0.958333342854 0.826086938381 1.26315784454
23 0 0.777251205912 0.87804877758 1.46527779102
23 1 0.674912369528 0.918555915356 1.61304700375
23 2 0.77358493002 0.963414609432 1.34177219868
24 0 0.834782636386 0.828125 1.44654083252
24 1 0.727874307266 0.877299427986 1.56601440907
24 2 0.818965507142 0.873684227467 1.39759039879
25 0 0.799283174613 0.896860957146 1.39499998093
25 1 0.745201293259 0.905858397484 1.48137867451
25 2 0.839694616754 0.909090936184 1.30999994278
26 0 0.812138754906 0.861209988594 1.42975211143
26 1 0.944626682171 0.788961350918 1.34178841114
26 2 0.703296703297 0.9140625 1.55555558205
27 0 0.714942528344 0.906752407551 1.54255318642
27 1 0.689189626624 0.896585404873 1.61833930016
27 2 0.697674445683 0.946666657925 1.51408445835
28 0 0.623467587164 0.910112380981 1.76234567165
28 1 0.763769363833 0.856757044792 1.5281996727
28 2 0.797169777253 0.828402340412 1.51428568363
29 0 0.846698091545 0.855153203011 1.38110744953
29 1 0.751563201768 0.890540003777 1.494104743
29 2 0.763888921773 0.933333337307 1.40259742737
30 0 1.06117023363 0.709273159504 1.32862186432
30 1 0.882077202239 0.803232848644 1.41140592098
30 2 0.949494901476 0.728723406792 1.44525551796
31 0 0.831081050288 0.81842815876 1.47019863129
31 1 0.72447747136 0.845522582531 1.63248765469
31 2 0.712598409478 0.889502763748 1.57763969898
32 0 0.917737793703 0.806722700596 1.35069441795
32 1 0.707469733361 0.907391190529 1.55774927139
32 2 0.658181800207 0.939226508141 1.61764705181
33 0 0.790476224579 0.897590339184 1.40939593315
33 1 32140.0012352 3.11138755933e-05 1.0
33 2 0.842794797556 0.834196865559 1.42236030102
34 0 0.771739100435 0.870422542095 1.48867309093
34 1 0.830903651184 0.875771045685 1.37422776222
34 2 0.806034481516 0.898395717144 1.38095235825
35 0 0.776162760304 0.880149841309 1.46382975578
35 1 0.935361795872 0.807241559029 1.32439291477
35 2 0.770491824359 0.851063847542 1.52499997616
36 0 0.812749042585 0.838235318661 1.4678362608
36 1 1.0 0.0 0.0
36 2 0.82812498766 0.830188691616 1.45454549789
37 0 1.25954195665 0.648484826088 1.22429907322
37 1 0.795986650635 0.886084020138 1.41781425476
37 2 0.867724887428 0.823170721531 1.39999997616
38 0 1.0 0.0 0.0
38 1 1.13306581429 0.727146267891 1.21373283863
38 2 1.12745099159 0.739130437374 1.20000004768
39 0 1.39024390648 0.635964930058 1.13103449345
39 1 0.720721810547 0.920286715031 1.50768005848
39 2 1.18902437685 0.69743591547 1.20588231087
40 0 1.02006691485 0.691803276539 1.41706156731
40 1 0.743115100877 0.89591729641 1.50202095509
40 2 0.757042247801 0.879069745541 1.50264549255
41 0 0.849765242522 0.828729271889 1.41999995708
41 1 0.834087650014 0.881270468235 1.36043906212
41 2 0.922727299727 0.822660088539 1.31736528873
42 0 0.888446227798 0.811659216881 1.38674032688
42 1 0.653807717458 0.920564472675 1.66148245335
42 2 0.956521778792 0.787878811359 1.32692313194
43 0 0.892376721209 0.763819098473 1.46710526943
43 1 0.792848173396 0.854226410389 1.47651195526
43 2 0.953757267495 0.812121212482 1.29104483128
44 0 1.0 0.0 0.0
44 1 0.561982295089 0.950377106667 1.8723256588
44 2 0.841772153169 0.849624037743 1.39823007584
45 0 1.06422016952 0.767241358757 1.22471904755
45 1 0.731326608604 0.905824661255 1.50953948498
45 2 0.963963944294 0.757009327412 1.37037038803
46 0 1.03000001412 0.737864077091 1.31578946114
46 1 1.08569931674 0.738494753838 1.24721992016
46 2 1.37037040365 0.540540516376 1.35000002384
47 0 1.36363633408 0.606060624123 1.21000003815
47 1 1.02166054452 0.786651551723 1.24425959587
47 2 1.17073168009 0.666666686535 1.28125
48 0 0.789297643758 0.728813588619 1.73837208748
48 1 0.949222323258 0.771725594997 1.36511468887
48 2 0.93103452103 0.685185194016 1.5675675869
49 0 0.764705893078 0.849650323391 1.53909468651
49 1 0.714454909903 0.887131333351 1.57774662971
49 2 0.779220798523 0.899999976158 1.42592597008
50 0 0.929203543744 0.780952394009 1.37804877758
50 1 0.843654529402 0.844342708588 1.40383684635
50 2 1.02752295376 0.741071403027 1.31325304508
51 0 1.0266940693 0.751999974251 1.29521274567
51 1 0.707338194624 0.925303220749 1.52787852287
51 2 0.992307688668 0.798449635506 1.2621358633
52 0 1.19959675992 0.653781533241 1.27506422997
52 1 0.738949896873 0.894119679928 1.51352405548
52 2 1.87499990221 0.37948718667 1.40540540218
53 0 1.14462084931 0.591679513454 1.4765625
53 1 0.953826456646 0.753887534142 1.39067006111
53 2 1.43076925307 0.521505355835 1.34020614624
