196608
196864
197120
197376
197632
197888
198144
198400
198656
198912
199168
199424
199680
199936
200192
200448
200704
200960
201216
201472
201728
201984
202240
202496
202752
203008
203264
203520
203776
204032
204288
204544
196609
196865
197121
197377
197633
197889
198145
198401
198657
198913
199169
199425
199681
199937
200193
200449
200705
200961
201217
201473
201729
201985
202241
202497
202753
203009
203265
203521
203777
204033
204289
204545
196610
196866
197122
197378
197634
197890
198146
198402
198658
198914
199170
199426
199682
199938
200194
200450
200706
200962
201218
201474
201730
201986
202242
202498
202754
203010
203266
203522
203778
204034
204290
204546
196611
196867
197123
197379
197635
197891
198147
198403
198659
198915
199171
199427
199683
199939
200195
200451
200707
200963
201219
201475
201731
201987
202243
202499
202755
203011
203267
203523
203779
204035
204291
204547
196612
196868
197124
197380
197636
197892
198148
198404
198660
198916
199172
199428
199684
199940
200196
200452
200708
200964
201220
201476
201732
201988
202244
202500
202756
203012
203268
203524
203780
204036
204292
204548
196613
196869
197125
197381
197637
197893
198149
198405
198661
198917
199173
199429
199685
199941
200197
200453
200709
200965
201221
201477
201733
201989
202245
202501
202757
203013
203269
203525
203781
204037
204293
204549
196614
196870
197126
197382
197638
197894
198150
198406
198662
198918
199174
199430
199686
199942
200198
200454
200710
200966
201222
201478
201734
201990
202246
202502
202758
203014
203270
203526
203782
204038
204294
204550
196615
196871
197127
197383
197639
197895
198151
198407
198663
198919
199175
199431
199687
199943
200199
200455
200711
200967
201223
201479
201735
201991
202247
202503
202759
203015
203271
203527
203783
204039
204295
204551
196616
196872
197128
197384
197640
197896
198152
198408
198664
198920
199176
199432
199688
199944
200200
200456
200712
200968
201224
201480
201736
201992
202248
202504
202760
203016
203272
203528
203784
204040
204296
204552
196617
196873
197129
197385
197641
197897
198153
198409
198665
198921
199177
199433
199689
199945
200201
200457
200713
200969
201225
201481
201737
201993
202249
202505
202761
203017
203273
203529
203785
204041
204297
204553
196618
196874
197130
197386
197642
197898
198154
198410
198666
198922
199178
199434
199690
199946
200202
200458
200714
200970
201226
201482
201738
201994
202250
202506
202762
203018
203274
203530
203786
204042
204298
204554
196619
196875
197131
197387
197643
197899
198155
198411
198667
198923
199179
199435
199691
199947
200203
200459
200715
200971
201227
201483
201739
201995
202251
202507
202763
203019
203275
203531
203787
204043
204299
204555
196620
196876
197132
197388
197644
197900
198156
198412
198668
198924
199180
199436
199692
199948
200204
200460
200716
200972
201228
201484
201740
201996
202252
202508
202764
203020
203276
203532
203788
204044
204300
204556
196621
196877
197133
197389
197645
197901
198157
198413
198669
198925
199181
199437
199693
199949
200205
200461
200717
200973
201229
201485
201741
201997
202253
202509
202765
203021
203277
203533
203789
204045
204301
204557
196622
196878
197134
197390
197646
197902
198158
198414
198670
198926
199182
199438
199694
199950
200206
200462
200718
200974
201230
201486
201742
201998
202254
202510
202766
203022
203278
203534
203790
204046
204302
204558
196623
196879
197135
197391
197647
197903
198159
198415
198671
198927
199183
199439
199695
199951
200207
200463
200719
200975
201231
201487
201743
201999
202255
202511
202767
203023
203279
203535
203791
204047
204303
204559
196624
196880
197136
197392
197648
197904
198160
198416
198672
198928
199184
199440
199696
199952
200208
200464
200720
200976
201232
201488
201744
202000
202256
202512
202768
203024
203280
203536
203792
204048
204304
204560
196625
196881
197137
197393
197649
197905
198161
198417
198673
198929
199185
199441
199697
199953
200209
200465
200721
200977
201233
201489
201745
202001
202257
202513
202769
203025
203281
203537
203793
204049
204305
204561
196626
196882
197138
197394
197650
197906
198162
198418
198674
198930
199186
199442
199698
199954
200210
200466
200722
200978
201234
201490
201746
202002
202258
202514
202770
203026
203282
203538
203794
204050
204306
204562
196627
196883
197139
197395
197651
197907
198163
198419
198675
198931
199187
199443
199699
199955
200211
200467
200723
200979
201235
201491
201747
202003
202259
202515
202771
203027
203283
203539
203795
204051
204307
204563
196628
196884
197140
197396
197652
197908
198164
198420
198676
198932
199188
199444
199700
199956
200212
200468
200724
200980
201236
201492
201748
202004
202260
202516
202772
203028
203284
203540
203796
204052
204308
204564
196629
196885
197141
197397
197653
197909
198165
198421
198677
198933
199189
199445
199701
199957
200213
200469
200725
200981
201237
201493
201749
202005
202261
202517
202773
203029
203285
203541
203797
204053
204309
204565
196630
196886
197142
197398
197654
197910
198166
198422
198678
198934
199190
199446
199702
199958
200214
200470
200726
200982
201238
201494
201750
202006
202262
202518
202774
203030
203286
203542
203798
204054
204310
204566
196631
196887
197143
197399
197655
197911
198167
198423
198679
198935
199191
199447
199703
199959
200215
200471
200727
200983
201239
201495
201751
202007
202263
202519
202775
203031
203287
203543
203799
204055
204311
204567
196632
196888
197144
197400
197656
197912
198168
198424
198680
198936
199192
199448
199704
199960
200216
200472
200728
200984
201240
201496
201752
202008
202264
202520
202776
203032
203288
203544
203800
204056
204312
204568
196633
196889
197145
197401
197657
197913
198169
198425
198681
198937
199193
199449
199705
199961
200217
200473
200729
200985
201241
201497
201753
202009
202265
202521
202777
203033
203289
203545
203801
204057
204313
204569
196634
196890
197146
197402
197658
197914
198170
198426
198682
198938
199194
199450
199706
199962
200218
200474
200730
200986
201242
201498
201754
202010
202266
202522
202778
203034
203290
203546
203802
204058
204314
204570
196635
196891
197147
197403
197659
197915
198171
198427
198683
198939
199195
199451
199707
199963
200219
200475
200731
200987
201243
201499
201755
202011
202267
202523
202779
203035
203291
203547
203803
204059
204315
204571
196636
196892
197148
197404
197660
197916
198172
198428
198684
198940
199196
199452
199708
199964
200220
200476
200732
200988
201244
201500
201756
202012
202268
202524
202780
203036
203292
203548
203804
204060
204316
204572
196637
196893
197149
197405
197661
197917
198173
198429
198685
198941
199197
199453
199709
199965
200221
200477
200733
200989
201245
201501
201757
202013
202269
202525
202781
203037
203293
203549
203805
204061
204317
204573
196638
196894
197150
197406
197662
197918
198174
198430
198686
198942
199198
199454
199710
199966
200222
200478
200734
200990
201246
201502
201758
202014
202270
202526
202782
203038
203294
203550
203806
204062
204318
204574
196639
196895
197151
197407
197663
197919
198175
198431
198687
198943
199199
199455
199711
199967
200223
200479
200735
200991
201247
201503
201759
202015
202271
202527
202783
203039
203295
203551
203807
204063
204319
204575
196640
196896
197152
197408
197664
197920
198176
198432
198688
198944
199200
199456
199712
199968
200224
200480
200736
200992
201248
201504
201760
202016
202272
202528
202784
203040
203296
203552
203808
204064
204320
204576
196641
196897
197153
197409
197665
197921
198177
198433
198689
198945
199201
199457
199713
199969
200225
200481
200737
200993
201249
201505
201761
202017
202273
202529
202785
203041
203297
203553
203809
204065
204321
204577
196642
196898
197154
197410
197666
197922
198178
198434
198690
198946
199202
199458
199714
199970
200226
200482
200738
200994
201250
201506
201762
202018
202274
202530
202786
203042
203298
203554
203810
204066
204322
204578
196643
196899
197155
197411
197667
197923
198179
198435
198691
198947
199203
199459
199715
199971
200227
200483
200739
200995
201251
201507
201763
202019
202275
202531
202787
203043
203299
203555
203811
204067
204323
204579
196644
196900
197156
197412
197668
197924
198180
198436
198692
198948
199204
199460
199716
199972
200228
200484
200740
200996
201252
201508
201764
202020
202276
202532
202788
203044
203300
203556
203812
204068
204324
204580
196645
196901
197157
197413
197669
197925
198181
198437
198693
198949
199205
199461
199717
199973
200229
200485
200741
200997
201253
201509
201765
202021
202277
202533
202789
203045
203301
203557
203813
204069
204325
204581
196646
196902
197158
197414
197670
197926
198182
198438
198694
198950
199206
199462
199718
199974
200230
200486
200742
200998
201254
201510
201766
202022
202278
202534
202790
203046
203302
203558
203814
204070
204326
204582
196647
196903
197159
197415
197671
197927
198183
198439
198695
198951
199207
199463
199719
199975
200231
200487
200743
200999
201255
201511
201767
202023
202279
202535
202791
203047
203303
203559
203815
204071
204327
204583
196648
196904
197160
197416
197672
197928
198184
198440
198696
198952
199208
199464
199720
199976
200232
200488
200744
201000
201256
201512
201768
202024
202280
202536
202792
203048
203304
203560
203816
204072
204328
204584
196649
196905
197161
197417
197673
197929
198185
198441
198697
198953
199209
199465
199721
199977
200233
200489
200745
201001
201257
201513
201769
202025
202281
202537
202793
203049
203305
203561
203817
204073
204329
204585
196650
196906
197162
197418
197674
197930
198186
198442
198698
198954
199210
199466
199722
199978
200234
200490
200746
201002
201258
201514
201770
202026
202282
202538
202794
203050
203306
203562
203818
204074
204330
204586
196651
196907
197163
197419
197675
197931
198187
198443
198699
198955
199211
199467
199723
199979
200235
200491
200747
201003
201259
201515
201771
202027
202283
202539
202795
203051
203307
203563
203819
204075
204331
204587
196652
196908
197164
197420
197676
197932
198188
198444
198700
198956
199212
199468
199724
199980
200236
200492
200748
201004
201260
201516
201772
202028
202284
202540
202796
203052
203308
203564
203820
204076
204332
204588
196653
196909
197165
197421
197677
197933
198189
198445
198701
198957
199213
199469
199725
199981
200237
200493
200749
201005
201261
201517
201773
202029
202285
202541
202797
203053
203309
203565
203821
204077
204333
204589
196654
196910
197166
197422
197678
197934
198190
198446
198702
198958
199214
199470
199726
199982
200238
200494
200750
201006
201262
201518
201774
202030
202286
202542
202798
203054
203310
203566
203822
204078
204334
204590
196655
196911
197167
197423
197679
197935
198191
198447
198703
198959
199215
199471
199727
199983
200239
200495
200751
201007
201263
201519
201775
202031
202287
202543
202799
203055
203311
203567
203823
204079
204335
204591
196656
196912
197168
197424
197680
197936
198192
198448
198704
198960
199216
199472
199728
199984
200240
200496
200752
201008
201264
201520
201776
202032
202288
202544
202800
203056
203312
203568
203824
204080
204336
204592
196657
196913
197169
197425
197681
197937
198193
198449
198705
198961
199217
199473
199729
199985
200241
200497
200753
201009
201265
201521
201777
202033
202289
202545
202801
203057
203313
203569
203825
204081
204337
204593
196658
196914
197170
197426
197682
197938
198194
198450
198706
198962
199218
199474
199730
199986
200242
200498
200754
201010
201266
201522
201778
202034
202290
202546
202802
203058
203314
203570
203826
204082
204338
204594
196659
196915
197171
197427
197683
197939
198195
198451
198707
198963
199219
199475
199731
199987
200243
200499
200755
201011
201267
201523
201779
202035
202291
202547
202803
203059
203315
203571
203827
204083
204339
204595
196660
196916
197172
197428
197684
197940
198196
198452
198708
198964
199220
199476
199732
199988
200244
200500
200756
201012
201268
201524
201780
202036
202292
202548
202804
203060
203316
203572
203828
204084
204340
204596
196661
196917
197173
197429
197685
197941
198197
198453
198709
198965
199221
199477
199733
199989
200245
200501
200757
201013
201269
201525
201781
202037
202293
202549
202805
203061
203317
203573
203829
204085
204341
204597
196662
196918
197174
197430
197686
197942
198198
198454
198710
198966
199222
199478
199734
199990
200246
200502
200758
201014
201270
201526
201782
202038
202294
202550
202806
203062
203318
203574
203830
204086
204342
204598
196663
196919
197175
197431
197687
197943
198199
198455
198711
198967
199223
199479
199735
199991
200247
200503
200759
201015
201271
201527
201783
202039
202295
202551
202807
203063
203319
203575
203831
204087
204343
204599
196664
196920
197176
197432
197688
197944
198200
198456
198712
198968
199224
199480
199736
199992
200248
200504
200760
201016
201272
201528
201784
202040
202296
202552
202808
203064
203320
203576
203832
204088
204344
204600
196665
196921
197177
197433
197689
197945
198201
198457
198713
198969
199225
199481
199737
199993
200249
200505
200761
201017
201273
201529
201785
202041
202297
202553
202809
203065
203321
203577
203833
204089
204345
204601
196666
196922
197178
197434
197690
197946
198202
198458
198714
198970
199226
199482
199738
199994
200250
200506
200762
201018
201274
201530
201786
202042
202298
202554
202810
203066
203322
203578
203834
204090
204346
204602
196667
196923
197179
197435
197691
197947
198203
198459
198715
198971
199227
199483
199739
199995
200251
200507
200763
201019
201275
201531
201787
202043
202299
202555
202811
203067
203323
203579
203835
204091
204347
204603
196668
196924
197180
197436
197692
197948
198204
198460
198716
198972
199228
199484
199740
199996
200252
200508
200764
201020
201276
201532
201788
202044
202300
202556
202812
203068
203324
203580
203836
204092
204348
204604
196669
196925
197181
197437
197693
197949
198205
198461
198717
198973
199229
199485
199741
199997
200253
200509
200765
201021
201277
201533
201789
202045
202301
202557
202813
203069
203325
203581
203837
204093
204349
204605
196670
196926
197182
197438
197694
197950
198206
198462
198718
198974
199230
199486
199742
199998
200254
200510
200766
201022
201278
201534
201790
202046
202302
202558
202814
203070
203326
203582
203838
204094
204350
204606
196671
196927
197183
197439
197695
197951
198207
198463
198719
198975
199231
199487
199743
199999
200255
200511
200767
201023
201279
201535
201791
202047
202303
202559
202815
203071
203327
203583
203839
204095
204351
204607
196672
196928
197184
197440
197696
197952
198208
198464
198720
198976
199232
199488
199744
200000
200256
200512
200768
201024
201280
201536
201792
202048
202304
202560
202816
203072
203328
203584
203840
204096
204352
204608
196673
196929
197185
197441
197697
197953
198209
198465
198721
198977
199233
199489
199745
200001
200257
200513
200769
201025
201281
201537
201793
202049
202305
202561
202817
203073
203329
203585
203841
204097
204353
204609
196674
196930
197186
197442
197698
197954
198210
198466
198722
198978
199234
199490
199746
200002
200258
200514
200770
201026
201282
201538
201794
202050
202306
202562
202818
203074
203330
203586
203842
204098
204354
204610
196675
196931
197187
197443
197699
197955
198211
198467
198723
198979
199235
199491
199747
200003
200259
200515
200771
201027
201283
201539
201795
202051
202307
202563
202819
203075
203331
203587
203843
204099
204355
204611
196676
196932
197188
197444
197700
197956
198212
198468
198724
198980
199236
199492
199748
200004
200260
200516
200772
201028
201284
201540
201796
202052
202308
202564
202820
203076
203332
203588
203844
204100
204356
204612
196677
196933
197189
197445
197701
197957
198213
198469
198725
198981
199237
199493
199749
200005
200261
200517
200773
201029
201285
201541
201797
202053
202309
202565
202821
203077
203333
203589
203845
204101
204357
204613
196678
196934
197190
197446
197702
197958
198214
198470
198726
198982
199238
199494
199750
200006
200262
200518
200774
201030
201286
201542
201798
202054
202310
202566
202822
203078
203334
203590
203846
204102
204358
204614
196679
196935
197191
197447
197703
197959
198215
198471
198727
198983
199239
199495
199751
200007
200263
200519
200775
201031
201287
201543
201799
202055
202311
202567
202823
203079
203335
203591
203847
204103
204359
204615
196680
196936
197192
197448
197704
197960
198216
198472
198728
198984
199240
199496
199752
200008
200264
200520
200776
201032
201288
201544
201800
202056
202312
202568
202824
203080
203336
203592
203848
204104
204360
204616
196681
196937
197193
197449
197705
197961
198217
198473
198729
198985
199241
199497
199753
200009
200265
200521
200777
201033
201289
201545
201801
202057
202313
202569
202825
203081
203337
203593
203849
204105
204361
204617
196682
196938
197194
197450
197706
197962
198218
198474
198730
198986
199242
199498
199754
200010
200266
200522
200778
201034
201290
201546
201802
202058
202314
202570
202826
203082
203338
203594
203850
204106
204362
204618
196683
196939
197195
197451
197707
197963
198219
198475
198731
198987
199243
199499
199755
200011
200267
200523
200779
201035
201291
201547
201803
202059
202315
202571
202827
203083
203339
203595
203851
204107
204363
204619
196684
196940
197196
197452
197708
197964
198220
198476
198732
198988
199244
199500
199756
200012
200268
200524
200780
201036
201292
201548
201804
202060
202316
202572
202828
203084
203340
203596
203852
204108
204364
204620
196685
196941
197197
197453
197709
197965
198221
198477
198733
198989
199245
199501
199757
200013
200269
200525
200781
201037
201293
201549
201805
202061
202317
202573
202829
203085
203341
203597
203853
204109
204365
204621
196686
196942
197198
197454
197710
197966
198222
198478
198734
198990
199246
199502
199758
200014
200270
200526
200782
201038
201294
201550
201806
202062
202318
202574
202830
203086
203342
203598
203854
204110
204366
204622
196687
196943
197199
197455
197711
197967
198223
198479
198735
198991
199247
199503
199759
200015
200271
200527
200783
201039
201295
201551
201807
202063
202319
202575
202831
203087
203343
203599
203855
204111
204367
204623
196688
196944
197200
197456
197712
197968
198224
198480
198736
198992
199248
199504
199760
200016
200272
200528
200784
201040
201296
201552
201808
202064
202320
202576
202832
203088
203344
203600
203856
204112
204368
204624
196689
196945
197201
197457
197713
197969
198225
198481
198737
198993
199249
199505
199761
200017
200273
200529
200785
201041
201297
201553
201809
202065
202321
202577
202833
203089
203345
203601
203857
204113
204369
204625
196690
196946
197202
197458
197714
197970
198226
198482
198738
198994
199250
199506
199762
200018
200274
200530
200786
201042
201298
201554
201810
202066
202322
202578
202834
203090
203346
203602
203858
204114
204370
204626
196691
196947
197203
197459
197715
197971
198227
198483
198739
198995
199251
199507
199763
200019
200275
200531
200787
201043
201299
201555
201811
202067
202323
202579
202835
203091
203347
203603
203859
204115
204371
204627
196692
196948
197204
197460
197716
197972
198228
198484
198740
198996
199252
199508
199764
200020
200276
200532
200788
201044
201300
201556
201812
202068
202324
202580
202836
203092
203348
203604
203860
204116
204372
204628
196693
196949
197205
197461
197717
197973
198229
198485
198741
198997
199253
199509
199765
200021
200277
200533
200789
201045
201301
201557
201813
202069
202325
202581
202837
203093
203349
203605
203861
204117
204373
204629
196694
196950
197206
197462
197718
197974
198230
198486
198742
198998
199254
199510
199766
200022
200278
200534
200790
201046
201302
201558
201814
202070
202326
202582
202838
203094
203350
203606
203862
204118
204374
204630
196695
196951
197207
197463
197719
197975
198231
198487
198743
198999
199255
199511
199767
200023
200279
200535
200791
201047
201303
201559
201815
202071
202327
202583
202839
203095
203351
203607
203863
204119
204375
204631
196696
196952
197208
197464
197720
197976
198232
198488
198744
199000
199256
199512
199768
200024
200280
200536
200792
201048
201304
201560
201816
202072
202328
202584
202840
203096
203352
203608
203864
204120
204376
204632
196697
196953
197209
197465
197721
197977
198233
198489
198745
199001
199257
199513
199769
200025
200281
200537
200793
201049
201305
201561
201817
202073
202329
202585
202841
203097
203353
203609
203865
204121
204377
204633
196698
196954
197210
197466
197722
197978
198234
198490
198746
199002
199258
199514
199770
200026
200282
200538
200794
201050
201306
201562
201818
202074
202330
202586
202842
203098
203354
203610
203866
204122
204378
204634
196699
196955
197211
197467
197723
197979
198235
198491
198747
199003
199259
199515
199771
200027
200283
200539
200795
201051
201307
201563
201819
202075
202331
202587
202843
203099
203355
203611
203867
204123
204379
204635
196700
196956
197212
197468
197724
197980
198236
198492
198748
199004
199260
199516
199772
200028
200284
200540
200796
201052
201308
201564
201820
202076
202332
202588
202844
203100
203356
203612
203868
204124
204380
204636
196701
196957
197213
197469
197725
197981
198237
198493
198749
199005
199261
199517
199773
200029
200285
200541
200797
201053
201309
201565
201821
202077
202333
202589
202845
203101
203357
203613
203869
204125
204381
204637
196702
196958
197214
197470
197726
197982
198238
198494
198750
199006
199262
199518
199774
200030
200286
200542
200798
201054
201310
201566
201822
202078
202334
202590
202846
203102
203358
203614
203870
204126
204382
204638
196703
196959
197215
197471
197727
197983
198239
198495
198751
199007
199263
199519
199775
200031
200287
200543
200799
201055
201311
201567
201823
202079
202335
202591
202847
203103
203359
203615
203871
204127
204383
204639
2170880
2171136
2171392
2171648
2171904
2172160
2172416
2172672
2172928
2173184
2173440
2173696
2173952
2174208
2174464
2174720
2174976
2175232
2175488
2175744
2176000
2176256
2176512
2176768
2177024
2177280
2177536
2177792
2178048
2178304
2178560
2178816
2170881
2171137
2171393
2171649
2171905
2172161
2172417
2172673
2172929
2173185
2173441
2173697
2173953
2174209
2174465
2174721
2174977
2175233
2175489
2175745
2176001
2176257
2176513
2176769
2177025
2177281
2177537
2177793
2178049
2178305
2178561
2178817
2170882
2171138
2171394
2171650
2171906
2172162
2172418
2172674
2172930
2173186
2173442
2173698
2173954
2174210
2174466
2174722
2174978
2175234
2175490
2175746
2176002
2176258
2176514
2176770
2177026
2177282
2177538
2177794
2178050
2178306
2178562
2178818
2170883
2171139
2171395
2171651
2171907
2172163
2172419
2172675
2172931
2173187
2173443
2173699
2173955
2174211
2174467
2174723
2174979
2175235
2175491
2175747
2176003
2176259
2176515
2176771
2177027
2177283
2177539
2177795
2178051
2178307
2178563
2178819
2170884
2171140
2171396
2171652
2171908
2172164
2172420
2172676
2172932
2173188
2173444
2173700
2173956
2174212
2174468
2174724
2174980
2175236
2175492
2175748
2176004
2176260
2176516
2176772
2177028
2177284
2177540
2177796
2178052
2178308
2178564
2178820
2170885
2171141
2171397
2171653
2171909
2172165
2172421
2172677
2172933
2173189
2173445
2173701
2173957
2174213
2174469
2174725
2174981
2175237
2175493
2175749
2176005
2176261
2176517
2176773
2177029
2177285
2177541
2177797
2178053
2178309
2178565
2178821
2170886
2171142
2171398
2171654
2171910
2172166
2172422
2172678
2172934
2173190
2173446
2173702
2173958
2174214
2174470
2174726
2174982
2175238
2175494
2175750
2176006
2176262
2176518
2176774
2177030
2177286
2177542
2177798
2178054
2178310
2178566
2178822
2170887
2171143
2171399
2171655
2171911
2172167
2172423
2172679
2172935
2173191
2173447
2173703
2173959
2174215
2174471
2174727
2174983
2175239
2175495
2175751
2176007
2176263
2176519
2176775
2177031
2177287
2177543
2177799
2178055
2178311
2178567
2178823
2170888
2171144
2171400
2171656
2171912
2172168
2172424
2172680
2172936
2173192
2173448
2173704
2173960
2174216
2174472
2174728
2174984
2175240
2175496
2175752
2176008
2176264
2176520
2176776
2177032
2177288
2177544
2177800
2178056
2178312
2178568
2178824
2170889
2171145
2171401
2171657
2171913
2172169
2172425
2172681
2172937
2173193
2173449
2173705
2173961
2174217
2174473
2174729
2174985
2175241
2175497
2175753
2176009
2176265
2176521
2176777
2177033
2177289
2177545
2177801
2178057
2178313
2178569
2178825
2170890
2171146
2171402
2171658
2171914
2172170
2172426
2172682
2172938
2173194
2173450
2173706
2173962
2174218
2174474
2174730
2174986
2175242
2175498
2175754
2176010
2176266
2176522
2176778
2177034
2177290
2177546
2177802
2178058
2178314
2178570
2178826
2170891
2171147
2171403
2171659
2171915
2172171
2172427
2172683
2172939
2173195
2173451
2173707
2173963
2174219
2174475
2174731
2174987
2175243
2175499
2175755
2176011
2176267
2176523
2176779
2177035
2177291
2177547
2177803
2178059
2178315
2178571
2178827
2170892
2171148
2171404
2171660
2171916
2172172
2172428
2172684
2172940
2173196
2173452
2173708
2173964
2174220
2174476
2174732
2174988
2175244
2175500
2175756
2176012
2176268
2176524
2176780
2177036
2177292
2177548
2177804
2178060
2178316
2178572
2178828
2170893
2171149
2171405
2171661
2171917
2172173
2172429
2172685
2172941
2173197
2173453
2173709
2173965
2174221
2174477
2174733
2174989
2175245
2175501
2175757
2176013
2176269
2176525
2176781
2177037
2177293
2177549
2177805
2178061
2178317
2178573
2178829
2170894
2171150
2171406
2171662
2171918
2172174
2172430
2172686
2172942
2173198
2173454
2173710
2173966
2174222
2174478
2174734
2174990
2175246
2175502
2175758
2176014
2176270
2176526
2176782
2177038
2177294
2177550
2177806
2178062
2178318
2178574
2178830
2170895
2171151
2171407
2171663
2171919
2172175
2172431
2172687
2172943
2173199
2173455
2173711
2173967
2174223
2174479
2174735
2174991
2175247
2175503
2175759
2176015
2176271
2176527
2176783
2177039
2177295
2177551
2177807
2178063
2178319
2178575
2178831
2170896
2171152
2171408
2171664
2171920
2172176
2172432
2172688
2172944
2173200
2173456
2173712
2173968
2174224
2174480
2174736
2174992
2175248
2175504
2175760
2176016
2176272
2176528
2176784
2177040
2177296
2177552
2177808
2178064
2178320
2178576
2178832
2170897
2171153
2171409
2171665
2171921
2172177
2172433
2172689
2172945
2173201
2173457
2173713
2173969
2174225
2174481
2174737
2174993
2175249
2175505
2175761
2176017
2176273
2176529
2176785
2177041
2177297
2177553
2177809
2178065
2178321
2178577
2178833
2170898
2171154
2171410
2171666
2171922
2172178
2172434
2172690
2172946
2173202
2173458
2173714
2173970
2174226
2174482
2174738
2174994
2175250
2175506
2175762
2176018
2176274
2176530
2176786
2177042
2177298
2177554
2177810
2178066
2178322
2178578
2178834
2170899
2171155
2171411
2171667
2171923
2172179
2172435
2172691
2172947
2173203
2173459
2173715
2173971
2174227
2174483
2174739
2174995
2175251
2175507
2175763
2176019
2176275
2176531
2176787
2177043
2177299
2177555
2177811
2178067
2178323
2178579
2178835
2170900
2171156
2171412
2171668
2171924
2172180
2172436
2172692
2172948
2173204
2173460
2173716
2173972
2174228
2174484
2174740
2174996
2175252
2175508
2175764
2176020
2176276
2176532
2176788
2177044
2177300
2177556
2177812
2178068
2178324
2178580
2178836
2170901
2171157
2171413
2171669
2171925
2172181
2172437
2172693
2172949
2173205
2173461
2173717
2173973
2174229
2174485
2174741
2174997
2175253
2175509
2175765
2176021
2176277
2176533
2176789
2177045
2177301
2177557
2177813
2178069
2178325
2178581
2178837
2170902
2171158
2171414
2171670
2171926
2172182
2172438
2172694
2172950
2173206
2173462
2173718
2173974
2174230
2174486
2174742
2174998
2175254
2175510
2175766
2176022
2176278
2176534
2176790
2177046
2177302
2177558
2177814
2178070
2178326
2178582
2178838
2170903
2171159
2171415
2171671
2171927
2172183
2172439
2172695
2172951
2173207
2173463
2173719
2173975
2174231
2174487
2174743
2174999
2175255
2175511
2175767
2176023
2176279
2176535
2176791
2177047
2177303
2177559
2177815
2178071
2178327
2178583
2178839
2170904
2171160
2171416
2171672
2171928
2172184
2172440
2172696
2172952
2173208
2173464
2173720
2173976
2174232
2174488
2174744
2175000
2175256
2175512
2175768
2176024
2176280
2176536
2176792
2177048
2177304
2177560
2177816
2178072
2178328
2178584
2178840
2170905
2171161
2171417
2171673
2171929
2172185
2172441
2172697
2172953
2173209
2173465
2173721
2173977
2174233
2174489
2174745
2175001
2175257
2175513
2175769
2176025
2176281
2176537
2176793
2177049
2177305
2177561
2177817
2178073
2178329
2178585
2178841
2170906
2171162
2171418
2171674
2171930
2172186
2172442
2172698
2172954
2173210
2173466
2173722
2173978
2174234
2174490
2174746
2175002
2175258
2175514
2175770
2176026
2176282
2176538
2176794
2177050
2177306
2177562
2177818
2178074
2178330
2178586
2178842
2170907
2171163
2171419
2171675
2171931
2172187
2172443
2172699
2172955
2173211
2173467
2173723
2173979
2174235
2174491
2174747
2175003
2175259
2175515
2175771
2176027
2176283
2176539
2176795
2177051
2177307
2177563
2177819
2178075
2178331
2178587
2178843
2170908
2171164
2171420
2171676
2171932
2172188
2172444
2172700
2172956
2173212
2173468
2173724
2173980
2174236
2174492
2174748
2175004
2175260
2175516
2175772
2176028
2176284
2176540
2176796
2177052
2177308
2177564
2177820
2178076
2178332
2178588
2178844
2170909
2171165
2171421
2171677
2171933
2172189
2172445
2172701
2172957
2173213
2173469
2173725
2173981
2174237
2174493
2174749
2175005
2175261
2175517
2175773
2176029
2176285
2176541
2176797
2177053
2177309
2177565
2177821
2178077
2178333
2178589
2178845
2170910
2171166
2171422
2171678
2171934
2172190
2172446
2172702
2172958
2173214
2173470
2173726
2173982
2174238
2174494
2174750
2175006
2175262
2175518
2175774
2176030
2176286
2176542
2176798
2177054
2177310
2177566
2177822
2178078
2178334
2178590
2178846
2170911
2171167
2171423
2171679
2171935
2172191
2172447
2172703
2172959
2173215
2173471
2173727
2173983
2174239
2174495
2174751
2175007
2175263
2175519
2175775
2176031
2176287
2176543
2176799
2177055
2177311
2177567
2177823
2178079
2178335
2178591
2178847
2170912
2171168
2171424
2171680
2171936
2172192
2172448
2172704
2172960
2173216
2173472
2173728
2173984
2174240
2174496
2174752
2175008
2175264
2175520
2175776
2176032
2176288
2176544
2176800
2177056
2177312
2177568
2177824
2178080
2178336
2178592
2178848
2170913
2171169
2171425
2171681
2171937
2172193
2172449
2172705
2172961
2173217
2173473
2173729
2173985
2174241
2174497
2174753
2175009
2175265
2175521
2175777
2176033
2176289
2176545
2176801
2177057
2177313
2177569
2177825
2178081
2178337
2178593
2178849
2170914
2171170
2171426
2171682
2171938
2172194
2172450
2172706
2172962
2173218
2173474
2173730
2173986
2174242
2174498
2174754
2175010
2175266
2175522
2175778
2176034
2176290
2176546
2176802
2177058
2177314
2177570
2177826
2178082
2178338
2178594
2178850
2170915
2171171
2171427
2171683
2171939
2172195
2172451
2172707
2172963
2173219
2173475
2173731
2173987
2174243
2174499
2174755
2175011
2175267
2175523
2175779
2176035
2176291
2176547
2176803
2177059
2177315
2177571
2177827
2178083
2178339
2178595
2178851
2170916
2171172
2171428
2171684
2171940
2172196
2172452
2172708
2172964
2173220
2173476
2173732
2173988
2174244
2174500
2174756
2175012
2175268
2175524
2175780
2176036
2176292
2176548
2176804
2177060
2177316
2177572
2177828
2178084
2178340
2178596
2178852
2170917
2171173
2171429
2171685
2171941
2172197
2172453
2172709
2172965
2173221
2173477
2173733
2173989
2174245
2174501
2174757
2175013
2175269
2175525
2175781
2176037
2176293
2176549
2176805
2177061
2177317
2177573
2177829
2178085
2178341
2178597
2178853
2170918
2171174
2171430
2171686
2171942
2172198
2172454
2172710
2172966
2173222
2173478
2173734
2173990
2174246
2174502
2174758
2175014
2175270
2175526
2175782
2176038
2176294
2176550
2176806
2177062
2177318
2177574
2177830
2178086
2178342
2178598
2178854
2170919
2171175
2171431
2171687
2171943
2172199
2172455
2172711
2172967
2173223
2173479
2173735
2173991
2174247
2174503
2174759
2175015
2175271
2175527
2175783
2176039
2176295
2176551
2176807
2177063
2177319
2177575
2177831
2178087
2178343
2178599
2178855
2170920
2171176
2171432
2171688
2171944
2172200
2172456
2172712
2172968
2173224
2173480
2173736
2173992
2174248
2174504
2174760
2175016
2175272
2175528
2175784
2176040
2176296
2176552
2176808
2177064
2177320
2177576
2177832
2178088
2178344
2178600
2178856
2170921
2171177
2171433
2171689
2171945
2172201
2172457
2172713
2172969
2173225
2173481
2173737
2173993
2174249
2174505
2174761
2175017
2175273
2175529
2175785
2176041
2176297
2176553
2176809
2177065
2177321
2177577
2177833
2178089
2178345
2178601
2178857
2170922
2171178
2171434
2171690
2171946
2172202
2172458
2172714
2172970
2173226
2173482
2173738
2173994
2174250
2174506
2174762
2175018
2175274
2175530
2175786
2176042
2176298
2176554
2176810
2177066
2177322
2177578
2177834
2178090
2178346
2178602
2178858
2170923
2171179
2171435
2171691
2171947
2172203
2172459
2172715
2172971
2173227
2173483
2173739
2173995
2174251
2174507
2174763
2175019
2175275
2175531
2175787
2176043
2176299
2176555
2176811
2177067
2177323
2177579
2177835
2178091
2178347
2178603
2178859
2170924
2171180
2171436
2171692
2171948
2172204
2172460
2172716
2172972
2173228
2173484
2173740
2173996
2174252
2174508
2174764
2175020
2175276
2175532
2175788
2176044
2176300
2176556
2176812
2177068
2177324
2177580
2177836
2178092
2178348
2178604
2178860
2170925
2171181
2171437
2171693
2171949
2172205
2172461
2172717
2172973
2173229
2173485
2173741
2173997
2174253
2174509
2174765
2175021
2175277
2175533
2175789
2176045
2176301
2176557
2176813
2177069
2177325
2177581
2177837
2178093
2178349
2178605
2178861
2170926
2171182
2171438
2171694
2171950
2172206
2172462
2172718
2172974
2173230
2173486
2173742
2173998
2174254
2174510
2174766
2175022
2175278
2175534
2175790
2176046
2176302
2176558
2176814
2177070
2177326
2177582
2177838
2178094
2178350
2178606
2178862
2170927
2171183
2171439
2171695
2171951
2172207
2172463
2172719
2172975
2173231
2173487
2173743
2173999
2174255
2174511
2174767
2175023
2175279
2175535
2175791
2176047
2176303
2176559
2176815
2177071
2177327
2177583
2177839
2178095
2178351
2178607
2178863
2170928
2171184
2171440
2171696
2171952
2172208
2172464
2172720
2172976
2173232
2173488
2173744
2174000
2174256
2174512
2174768
2175024
2175280
2175536
2175792
2176048
2176304
2176560
2176816
2177072
2177328
2177584
2177840
2178096
2178352
2178608
2178864
2170929
2171185
2171441
2171697
2171953
2172209
2172465
2172721
2172977
2173233
2173489
2173745
2174001
2174257
2174513
2174769
2175025
2175281
2175537
2175793
2176049
2176305
2176561
2176817
2177073
2177329
2177585
2177841
2178097
2178353
2178609
2178865
2170930
2171186
2171442
2171698
2171954
2172210
2172466
2172722
2172978
2173234
2173490
2173746
2174002
2174258
2174514
2174770
2175026
2175282
2175538
2175794
2176050
2176306
2176562
2176818
2177074
2177330
2177586
2177842
2178098
2178354
2178610
2178866
2170931
2171187
2171443
2171699
2171955
2172211
2172467
2172723
2172979
2173235
2173491
2173747
2174003
2174259
2174515
2174771
2175027
2175283
2175539
2175795
2176051
2176307
2176563
2176819
2177075
2177331
2177587
2177843
2178099
2178355
2178611
2178867
2170932
2171188
2171444
2171700
2171956
2172212
2172468
2172724
2172980
2173236
2173492
2173748
2174004
2174260
2174516
2174772
2175028
2175284
2175540
2175796
2176052
2176308
2176564
2176820
2177076
2177332
2177588
2177844
2178100
2178356
2178612
2178868
2170933
2171189
2171445
2171701
2171957
2172213
2172469
2172725
2172981
2173237
2173493
2173749
2174005
2174261
2174517
2174773
2175029
2175285
2175541
2175797
2176053
2176309
2176565
2176821
2177077
2177333
2177589
2177845
2178101
2178357
2178613
2178869
2170934
2171190
2171446
2171702
2171958
2172214
2172470
2172726
2172982
2173238
2173494
2173750
2174006
2174262
2174518
2174774
2175030
2175286
2175542
2175798
2176054
2176310
2176566
2176822
2177078
2177334
2177590
2177846
2178102
2178358
2178614
2178870
2170935
2171191
2171447
2171703
2171959
2172215
2172471
2172727
2172983
2173239
2173495
2173751
2174007
2174263
2174519
2174775
2175031
2175287
2175543
2175799
2176055
2176311
2176567
2176823
2177079
2177335
2177591
2177847
2178103
2178359
2178615
2178871
2170936
2171192
2171448
2171704
2171960
2172216
2172472
2172728
2172984
2173240
2173496
2173752
2174008
2174264
2174520
2174776
2175032
2175288
2175544
2175800
2176056
2176312
2176568
2176824
2177080
2177336
2177592
2177848
2178104
2178360
2178616
2178872
2170937
2171193
2171449
2171705
2171961
2172217
2172473
2172729
2172985
2173241
2173497
2173753
2174009
2174265
2174521
2174777
2175033
2175289
2175545
2175801
2176057
2176313
2176569
2176825
2177081
2177337
2177593
2177849
2178105
2178361
2178617
2178873
2170938
2171194
2171450
2171706
2171962
2172218
2172474
2172730
2172986
2173242
2173498
2173754
2174010
2174266
2174522
2174778
2175034
2175290
2175546
2175802
2176058
2176314
2176570
2176826
2177082
2177338
2177594
2177850
2178106
2178362
2178618
2178874
2170939
2171195
2171451
2171707
2171963
2172219
2172475
2172731
2172987
2173243
2173499
2173755
2174011
2174267
2174523
2174779
2175035
2175291
2175547
2175803
2176059
2176315
2176571
2176827
2177083
2177339
2177595
2177851
2178107
2178363
2178619
2178875
2170940
2171196
2171452
2171708
2171964
2172220
2172476
2172732
2172988
2173244
2173500
2173756
2174012
2174268
2174524
2174780
2175036
2175292
2175548
2175804
2176060
2176316
2176572
2176828
2177084
2177340
2177596
2177852
2178108
2178364
2178620
2178876
2170941
2171197
2171453
2171709
2171965
2172221
2172477
2172733
2172989
2173245
2173501
2173757
2174013
2174269
2174525
2174781
2175037
2175293
2175549
2175805
2176061
2176317
2176573
2176829
2177085
2177341
2177597
2177853
2178109
2178365
2178621
2178877
2170942
2171198
2171454
2171710
2171966
2172222
2172478
2172734
2172990
2173246
2173502
2173758
2174014
2174270
2174526
2174782
2175038
2175294
2175550
2175806
2176062
2176318
2176574
2176830
2177086
2177342
2177598
2177854
2178110
2178366
2178622
2178878
2170943
2171199
2171455
2171711
2171967
2172223
2172479
2172735
2172991
2173247
2173503
2173759
2174015
2174271
2174527
2174783
2175039
2175295
2175551
2175807
2176063
2176319
2176575
2176831
2177087
2177343
2177599
2177855
2178111
2178367
2178623
2178879
2170944
2171200
2171456
2171712
2171968
2172224
2172480
2172736
2172992
2173248
2173504
2173760
2174016
2174272
2174528
2174784
2175040
2175296
2175552
2175808
2176064
2176320
2176576
2176832
2177088
2177344
2177600
2177856
2178112
2178368
2178624
2178880
2170945
2171201
2171457
2171713
2171969
2172225
2172481
2172737
2172993
2173249
2173505
2173761
2174017
2174273
2174529
2174785
2175041
2175297
2175553
2175809
2176065
2176321
2176577
2176833
2177089
2177345
2177601
2177857
2178113
2178369
2178625
2178881
2170946
2171202
2171458
2171714
2171970
2172226
2172482
2172738
2172994
2173250
2173506
2173762
2174018
2174274
2174530
2174786
2175042
2175298
2175554
2175810
2176066
2176322
2176578
2176834
2177090
2177346
2177602
2177858
2178114
2178370
2178626
2178882
2170947
2171203
2171459
2171715
2171971
2172227
2172483
2172739
2172995
2173251
2173507
2173763
2174019
2174275
2174531
2174787
2175043
2175299
2175555
2175811
2176067
2176323
2176579
2176835
2177091
2177347
2177603
2177859
2178115
2178371
2178627
2178883
2170948
2171204
2171460
2171716
2171972
2172228
2172484
2172740
2172996
2173252
2173508
2173764
2174020
2174276
2174532
2174788
2175044
2175300
2175556
2175812
2176068
2176324
2176580
2176836
2177092
2177348
2177604
2177860
2178116
2178372
2178628
2178884
2170949
2171205
2171461
2171717
2171973
2172229
2172485
2172741
2172997
2173253
2173509
2173765
2174021
2174277
2174533
2174789
2175045
2175301
2175557
2175813
2176069
2176325
2176581
2176837
2177093
2177349
2177605
2177861
2178117
2178373
2178629
2178885
2170950
2171206
2171462
2171718
2171974
2172230
2172486
2172742
2172998
2173254
2173510
2173766
2174022
2174278
2174534
2174790
2175046
2175302
2175558
2175814
2176070
2176326
2176582
2176838
2177094
2177350
2177606
2177862
2178118
2178374
2178630
2178886
2170951
2171207
2171463
2171719
2171975
2172231
2172487
2172743
2172999
2173255
2173511
2173767
2174023
2174279
2174535
2174791
2175047
2175303
2175559
2175815
2176071
2176327
2176583
2176839
2177095
2177351
2177607
2177863
2178119
2178375
2178631
2178887
2170952
2171208
2171464
2171720
2171976
2172232
2172488
2172744
2173000
2173256
2173512
2173768
2174024
2174280
2174536
2174792
2175048
2175304
2175560
2175816
2176072
2176328
2176584
2176840
2177096
2177352
2177608
2177864
2178120
2178376
2178632
2178888
2170953
2171209
2171465
2171721
2171977
2172233
2172489
2172745
2173001
2173257
2173513
2173769
2174025
2174281
2174537
2174793
2175049
2175305
2175561
2175817
2176073
2176329
2176585
2176841
2177097
2177353
2177609
2177865
2178121
2178377
2178633
2178889
2170954
2171210
2171466
2171722
2171978
2172234
2172490
2172746
2173002
2173258
2173514
2173770
2174026
2174282
2174538
2174794
2175050
2175306
2175562
2175818
2176074
2176330
2176586
2176842
2177098
2177354
2177610
2177866
2178122
2178378
2178634
2178890
2170955
2171211
2171467
2171723
2171979
2172235
2172491
2172747
2173003
2173259
2173515
2173771
2174027
2174283
2174539
2174795
2175051
2175307
2175563
2175819
2176075
2176331
2176587
2176843
2177099
2177355
2177611
2177867
2178123
2178379
2178635
2178891
2170956
2171212
2171468
2171724
2171980
2172236
2172492
2172748
2173004
2173260
2173516
2173772
2174028
2174284
2174540
2174796
2175052
2175308
2175564
2175820
2176076
2176332
2176588
2176844
2177100
2177356
2177612
2177868
2178124
2178380
2178636
2178892
2170957
2171213
2171469
2171725
2171981
2172237
2172493
2172749
2173005
2173261
2173517
2173773
2174029
2174285
2174541
2174797
2175053
2175309
2175565
2175821
2176077
2176333
2176589
2176845
2177101
2177357
2177613
2177869
2178125
2178381
2178637
2178893
2170958
2171214
2171470
2171726
2171982
2172238
2172494
2172750
2173006
2173262
2173518
2173774
2174030
2174286
2174542
2174798
2175054
2175310
2175566
2175822
2176078
2176334
2176590
2176846
2177102
2177358
2177614
2177870
2178126
2178382
2178638
2178894
2170959
2171215
2171471
2171727
2171983
2172239
2172495
2172751
2173007
2173263
2173519
2173775
2174031
2174287
2174543
2174799
2175055
2175311
2175567
2175823
2176079
2176335
2176591
2176847
2177103
2177359
2177615
2177871
2178127
2178383
2178639
2178895
2170960
2171216
2171472
2171728
2171984
2172240
2172496
2172752
2173008
2173264
2173520
2173776
2174032
2174288
2174544
2174800
2175056
2175312
2175568
2175824
2176080
2176336
2176592
2176848
2177104
2177360
2177616
2177872
2178128
2178384
2178640
2178896
2170961
2171217
2171473
2171729
2171985
2172241
2172497
2172753
2173009
2173265
2173521
2173777
2174033
2174289
2174545
2174801
2175057
2175313
2175569
2175825
2176081
2176337
2176593
2176849
2177105
2177361
2177617
2177873
2178129
2178385
2178641
2178897
2170962
2171218
2171474
2171730
2171986
2172242
2172498
2172754
2173010
2173266
2173522
2173778
2174034
2174290
2174546
2174802
2175058
2175314
2175570
2175826
2176082
2176338
2176594
2176850
2177106
2177362
2177618
2177874
2178130
2178386
2178642
2178898
2170963
2171219
2171475
2171731
2171987
2172243
2172499
2172755
2173011
2173267
2173523
2173779
2174035
2174291
2174547
2174803
2175059
2175315
2175571
2175827
2176083
2176339
2176595
2176851
2177107
2177363
2177619
2177875
2178131
2178387
2178643
2178899
2170964
2171220
2171476
2171732
2171988
2172244
2172500
2172756
2173012
2173268
2173524
2173780
2174036
2174292
2174548
2174804
2175060
2175316
2175572
2175828
2176084
2176340
2176596
2176852
2177108
2177364
2177620
2177876
2178132
2178388
2178644
2178900
2170965
2171221
2171477
2171733
2171989
2172245
2172501
2172757
2173013
2173269
2173525
2173781
2174037
2174293
2174549
2174805
2175061
2175317
2175573
2175829
2176085
2176341
2176597
2176853
2177109
2177365
2177621
2177877
2178133
2178389
2178645
2178901
2170966
2171222
2171478
2171734
2171990
2172246
2172502
2172758
2173014
2173270
2173526
2173782
2174038
2174294
2174550
2174806
2175062
2175318
2175574
2175830
2176086
2176342
2176598
2176854
2177110
2177366
2177622
2177878
2178134
2178390
2178646
2178902
2170967
2171223
2171479
2171735
2171991
2172247
2172503
2172759
2173015
2173271
2173527
2173783
2174039
2174295
2174551
2174807
2175063
2175319
2175575
2175831
2176087
2176343
2176599
2176855
2177111
2177367
2177623
2177879
2178135
2178391
2178647
2178903
2170968
2171224
2171480
2171736
2171992
2172248
2172504
2172760
2173016
2173272
2173528
2173784
2174040
2174296
2174552
2174808
2175064
2175320
2175576
2175832
2176088
2176344
2176600
2176856
2177112
2177368
2177624
2177880
2178136
2178392
2178648
2178904
2170969
2171225
2171481
2171737
2171993
2172249
2172505
2172761
2173017
2173273
2173529
2173785
2174041
2174297
2174553
2174809
2175065
2175321
2175577
2175833
2176089
2176345
2176601
2176857
2177113
2177369
2177625
2177881
2178137
2178393
2178649
2178905
2170970
2171226
2171482
2171738
2171994
2172250
2172506
2172762
2173018
2173274
2173530
2173786
2174042
2174298
2174554
2174810
2175066
2175322
2175578
2175834
2176090
2176346
2176602
2176858
2177114
2177370
2177626
2177882
2178138
2178394
2178650
2178906
2170971
2171227
2171483
2171739
2171995
2172251
2172507
2172763
2173019
2173275
2173531
2173787
2174043
2174299
2174555
2174811
2175067
2175323
2175579
2175835
2176091
2176347
2176603
2176859
2177115
2177371
2177627
2177883
2178139
2178395
2178651
2178907
2170972
2171228
2171484
2171740
2171996
2172252
2172508
2172764
2173020
2173276
2173532
2173788
2174044
2174300
2174556
2174812
2175068
2175324
2175580
2175836
2176092
2176348
2176604
2176860
2177116
2177372
2177628
2177884
2178140
2178396
2178652
2178908
2170973
2171229
2171485
2171741
2171997
2172253
2172509
2172765
2173021
2173277
2173533
2173789
2174045
2174301
2174557
2174813
2175069
2175325
2175581
2175837
2176093
2176349
2176605
2176861
2177117
2177373
2177629
2177885
2178141
2178397
2178653
2178909
2170974
2171230
2171486
2171742
2171998
2172254
2172510
2172766
2173022
2173278
2173534
2173790
2174046
2174302
2174558
2174814
2175070
2175326
2175582
2175838
2176094
2176350
2176606
2176862
2177118
2177374
2177630
2177886
2178142
2178398
2178654
2178910
2170975
2171231
2171487
2171743
2171999
2172255
2172511
2172767
2173023
2173279
2173535
2173791
2174047
2174303
2174559
2174815
2175071
2175327
2175583
2175839
2176095
2176351
2176607
2176863
2177119
2177375
2177631
2177887
2178143
2178399
2178655
2178911
2367488
2367744
2368000
2368256
2368512
2368768
2369024
2369280
2369536
2369792
2370048
2370304
2370560
2370816
2371072
2371328
2371584
2371840
2372096
2372352
2372608
2372864
2373120
2373376
2373632
2373888
2374144
2374400
2374656
2374912
2375168
2375424
2367489
2367745
2368001
2368257
2368513
2368769
2369025
2369281
2369537
2369793
2370049
2370305
2370561
2370817
2371073
2371329
2371585
2371841
2372097
2372353
2372609
2372865
2373121
2373377
2373633
2373889
2374145
2374401
2374657
2374913
2375169
2375425
2367490
2367746
2368002
2368258
2368514
2368770
2369026
2369282
2369538
2369794
2370050
2370306
2370562
2370818
2371074
2371330
2371586
2371842
2372098
2372354
2372610
2372866
2373122
2373378
2373634
2373890
2374146
2374402
2374658
2374914
2375170
2375426
2367491
2367747
2368003
2368259
2368515
2368771
2369027
2369283
2369539
2369795
2370051
2370307
2370563
2370819
2371075
2371331
2371587
2371843
2372099
2372355
2372611
2372867
2373123
2373379
2373635
2373891
2374147
2374403
2374659
2374915
2375171
2375427
2367492
2367748
2368004
2368260
2368516
2368772
2369028
2369284
2369540
2369796
2370052
2370308
2370564
2370820
2371076
2371332
2371588
2371844
2372100
2372356
2372612
2372868
2373124
2373380
2373636
2373892
2374148
2374404
2374660
2374916
2375172
2375428
2367493
2367749
2368005
2368261
2368517
2368773
2369029
2369285
2369541
2369797
2370053
2370309
2370565
2370821
2371077
2371333
2371589
2371845
2372101
2372357
2372613
2372869
2373125
2373381
2373637
2373893
2374149
2374405
2374661
2374917
2375173
2375429
2367494
2367750
2368006
2368262
2368518
2368774
2369030
2369286
2369542
2369798
2370054
2370310
2370566
2370822
2371078
2371334
2371590
2371846
2372102
2372358
2372614
2372870
2373126
2373382
2373638
2373894
2374150
2374406
2374662
2374918
2375174
2375430
2367495
2367751
2368007
2368263
2368519
2368775
2369031
2369287
2369543
2369799
2370055
2370311
2370567
2370823
2371079
2371335
2371591
2371847
2372103
2372359
2372615
2372871
2373127
2373383
2373639
2373895
2374151
2374407
2374663
2374919
2375175
2375431
2367496
2367752
2368008
2368264
2368520
2368776
2369032
2369288
2369544
2369800
2370056
2370312
2370568
2370824
2371080
2371336
2371592
2371848
2372104
2372360
2372616
2372872
2373128
2373384
2373640
2373896
2374152
2374408
2374664
2374920
2375176
2375432
2367497
2367753
2368009
2368265
2368521
2368777
2369033
2369289
2369545
2369801
2370057
2370313
2370569
2370825
2371081
2371337
2371593
2371849
2372105
2372361
2372617
2372873
2373129
2373385
2373641
2373897
2374153
2374409
2374665
2374921
2375177
2375433
2367498
2367754
2368010
2368266
2368522
2368778
2369034
2369290
2369546
2369802
2370058
2370314
2370570
2370826
2371082
2371338
2371594
2371850
2372106
2372362
2372618
2372874
2373130
2373386
2373642
2373898
2374154
2374410
2374666
2374922
2375178
2375434
2367499
2367755
2368011
2368267
2368523
2368779
2369035
2369291
2369547
2369803
2370059
2370315
2370571
2370827
2371083
2371339
2371595
2371851
2372107
2372363
2372619
2372875
2373131
2373387
2373643
2373899
2374155
2374411
2374667
2374923
2375179
2375435
2367500
2367756
2368012
2368268
2368524
2368780
2369036
2369292
2369548
2369804
2370060
2370316
2370572
2370828
2371084
2371340
2371596
2371852
2372108
2372364
2372620
2372876
2373132
2373388
2373644
2373900
2374156
2374412
2374668
2374924
2375180
2375436
2367501
2367757
2368013
2368269
2368525
2368781
2369037
2369293
2369549
2369805
2370061
2370317
2370573
2370829
2371085
2371341
2371597
2371853
2372109
2372365
2372621
2372877
2373133
2373389
2373645
2373901
2374157
2374413
2374669
2374925
2375181
2375437
2367502
2367758
2368014
2368270
2368526
2368782
2369038
2369294
2369550
2369806
2370062
2370318
2370574
2370830
2371086
2371342
2371598
2371854
2372110
2372366
2372622
2372878
2373134
2373390
2373646
2373902
2374158
2374414
2374670
2374926
2375182
2375438
2367503
2367759
2368015
2368271
2368527
2368783
2369039
2369295
2369551
2369807
2370063
2370319
2370575
2370831
2371087
2371343
2371599
2371855
2372111
2372367
2372623
2372879
2373135
2373391
2373647
2373903
2374159
2374415
2374671
2374927
2375183
2375439
2367504
2367760
2368016
2368272
2368528
2368784
2369040
2369296
2369552
2369808
2370064
2370320
2370576
2370832
2371088
2371344
2371600
2371856
2372112
2372368
2372624
2372880
2373136
2373392
2373648
2373904
2374160
2374416
2374672
2374928
2375184
2375440
2367505
2367761
2368017
2368273
2368529
2368785
2369041
2369297
2369553
2369809
2370065
2370321
2370577
2370833
2371089
2371345
2371601
2371857
2372113
2372369
2372625
2372881
2373137
2373393
2373649
2373905
2374161
2374417
2374673
2374929
2375185
2375441
2367506
2367762
2368018
2368274
2368530
2368786
2369042
2369298
2369554
2369810
2370066
2370322
2370578
2370834
2371090
2371346
2371602
2371858
2372114
2372370
2372626
2372882
2373138
2373394
2373650
2373906
2374162
2374418
2374674
2374930
2375186
2375442
2367507
2367763
2368019
2368275
2368531
2368787
2369043
2369299
2369555
2369811
2370067
2370323
2370579
2370835
2371091
2371347
2371603
2371859
2372115
2372371
2372627
2372883
2373139
2373395
2373651
2373907
2374163
2374419
2374675
2374931
2375187
2375443
2367508
2367764
2368020
2368276
2368532
2368788
2369044
2369300
2369556
2369812
2370068
2370324
2370580
2370836
2371092
2371348
2371604
2371860
2372116
2372372
2372628
2372884
2373140
2373396
2373652
2373908
2374164
2374420
2374676
2374932
2375188
2375444
2367509
2367765
2368021
2368277
2368533
2368789
2369045
2369301
2369557
2369813
2370069
2370325
2370581
2370837
2371093
2371349
2371605
2371861
2372117
2372373
2372629
2372885
2373141
2373397
2373653
2373909
2374165
2374421
2374677
2374933
2375189
2375445
2367510
2367766
2368022
2368278
2368534
2368790
2369046
2369302
2369558
2369814
2370070
2370326
2370582
2370838
2371094
2371350
2371606
2371862
2372118
2372374
2372630
2372886
2373142
2373398
2373654
2373910
2374166
2374422
2374678
2374934
2375190
2375446
2367511
2367767
2368023
2368279
2368535
2368791
2369047
2369303
2369559
2369815
2370071
2370327
2370583
2370839
2371095
2371351
2371607
2371863
2372119
2372375
2372631
2372887
2373143
2373399
2373655
2373911
2374167
2374423
2374679
2374935
2375191
2375447
2367512
2367768
2368024
2368280
2368536
2368792
2369048
2369304
2369560
2369816
2370072
2370328
2370584
2370840
2371096
2371352
2371608
2371864
2372120
2372376
2372632
2372888
2373144
2373400
2373656
2373912
2374168
2374424
2374680
2374936
2375192
2375448
2367513
2367769
2368025
2368281
2368537
2368793
2369049
2369305
2369561
2369817
2370073
2370329
2370585
2370841
2371097
2371353
2371609
2371865
2372121
2372377
2372633
2372889
2373145
2373401
2373657
2373913
2374169
2374425
2374681
2374937
2375193
2375449
2367514
2367770
2368026
2368282
2368538
2368794
2369050
2369306
2369562
2369818
2370074
2370330
2370586
2370842
2371098
2371354
2371610
2371866
2372122
2372378
2372634
2372890
2373146
2373402
2373658
2373914
2374170
2374426
2374682
2374938
2375194
2375450
2367515
2367771
2368027
2368283
2368539
2368795
2369051
2369307
2369563
2369819
2370075
2370331
2370587
2370843
2371099
2371355
2371611
2371867
2372123
2372379
2372635
2372891
2373147
2373403
2373659
2373915
2374171
2374427
2374683
2374939
2375195
2375451
2367516
2367772
2368028
2368284
2368540
2368796
2369052
2369308
2369564
2369820
2370076
2370332
2370588
2370844
2371100
2371356
2371612
2371868
2372124
2372380
2372636
2372892
2373148
2373404
2373660
2373916
2374172
2374428
2374684
2374940
2375196
2375452
2367517
2367773
2368029
2368285
2368541
2368797
2369053
2369309
2369565
2369821
2370077
2370333
2370589
2370845
2371101
2371357
2371613
2371869
2372125
2372381
2372637
2372893
2373149
2373405
2373661
2373917
2374173
2374429
2374685
2374941
2375197
2375453
2367518
2367774
2368030
2368286
2368542
2368798
2369054
2369310
2369566
2369822
2370078
2370334
2370590
2370846
2371102
2371358
2371614
2371870
2372126
2372382
2372638
2372894
2373150
2373406
2373662
2373918
2374174
2374430
2374686
2374942
2375198
2375454
2367519
2367775
2368031
2368287
2368543
2368799
2369055
2369311
2369567
2369823
2370079
2370335
2370591
2370847
2371103
2371359
2371615
2371871
2372127
2372383
2372639
2372895
2373151
2373407
2373663
2373919
2374175
2374431
2374687
2374943
2375199
2375455
2367520
2367776
2368032
2368288
2368544
2368800
2369056
2369312
2369568
2369824
2370080
2370336
2370592
2370848
2371104
2371360
2371616
2371872
2372128
2372384
2372640
2372896
2373152
2373408
2373664
2373920
2374176
2374432
2374688
2374944
2375200
2375456
2367521
2367777
2368033
2368289
2368545
2368801
2369057
2369313
2369569
2369825
2370081
2370337
2370593
2370849
2371105
2371361
2371617
2371873
2372129
2372385
2372641
2372897
2373153
2373409
2373665
2373921
2374177
2374433
2374689
2374945
2375201
2375457
2367522
2367778
2368034
2368290
2368546
2368802
2369058
2369314
2369570
2369826
2370082
2370338
2370594
2370850
2371106
2371362
2371618
2371874
2372130
2372386
2372642
2372898
2373154
2373410
2373666
2373922
2374178
2374434
2374690
2374946
2375202
2375458
2367523
2367779
2368035
2368291
2368547
2368803
2369059
2369315
2369571
2369827
2370083
2370339
2370595
2370851
2371107
2371363
2371619
2371875
2372131
2372387
2372643
2372899
2373155
2373411
2373667
2373923
2374179
2374435
2374691
2374947
2375203
2375459
2367524
2367780
2368036
2368292
2368548
2368804
2369060
2369316
2369572
2369828
2370084
2370340
2370596
2370852
2371108
2371364
2371620
2371876
2372132
2372388
2372644
2372900
2373156
2373412
2373668
2373924
2374180
2374436
2374692
2374948
2375204
2375460
2367525
2367781
2368037
2368293
2368549
2368805
2369061
2369317
2369573
2369829
2370085
2370341
2370597
2370853
2371109
2371365
2371621
2371877
2372133
2372389
2372645
2372901
2373157
2373413
2373669
2373925
2374181
2374437
2374693
2374949
2375205
2375461
2367526
2367782
2368038
2368294
2368550
2368806
2369062
2369318
2369574
2369830
2370086
2370342
2370598
2370854
2371110
2371366
2371622
2371878
2372134
2372390
2372646
2372902
2373158
2373414
2373670
2373926
2374182
2374438
2374694
2374950
2375206
2375462
2367527
2367783
2368039
2368295
2368551
2368807
2369063
2369319
2369575
2369831
2370087
2370343
2370599
2370855
2371111
2371367
2371623
2371879
2372135
2372391
2372647
2372903
2373159
2373415
2373671
2373927
2374183
2374439
2374695
2374951
2375207
2375463
2367528
2367784
2368040
2368296
2368552
2368808
2369064
2369320
2369576
2369832
2370088
2370344
2370600
2370856
2371112
2371368
2371624
2371880
2372136
2372392
2372648
2372904
2373160
2373416
2373672
2373928
2374184
2374440
2374696
2374952
2375208
2375464
2367529
2367785
2368041
2368297
2368553
2368809
2369065
2369321
2369577
2369833
2370089
2370345
2370601
2370857
2371113
2371369
2371625
2371881
2372137
2372393
2372649
2372905
2373161
2373417
2373673
2373929
2374185
2374441
2374697
2374953
2375209
2375465
2367530
2367786
2368042
2368298
2368554
2368810
2369066
2369322
2369578
2369834
2370090
2370346
2370602
2370858
2371114
2371370
2371626
2371882
2372138
2372394
2372650
2372906
2373162
2373418
2373674
2373930
2374186
2374442
2374698
2374954
2375210
2375466
2367531
2367787
2368043
2368299
2368555
2368811
2369067
2369323
2369579
2369835
2370091
2370347
2370603
2370859
2371115
2371371
2371627
2371883
2372139
2372395
2372651
2372907
2373163
2373419
2373675
2373931
2374187
2374443
2374699
2374955
2375211
2375467
2367532
2367788
2368044
2368300
2368556
2368812
2369068
2369324
2369580
2369836
2370092
2370348
2370604
2370860
2371116
2371372
2371628
2371884
2372140
2372396
2372652
2372908
2373164
2373420
2373676
2373932
2374188
2374444
2374700
2374956
2375212
2375468
2367533
2367789
2368045
2368301
2368557
2368813
2369069
2369325
2369581
2369837
2370093
2370349
2370605
2370861
2371117
2371373
2371629
2371885
2372141
2372397
2372653
2372909
2373165
2373421
2373677
2373933
2374189
2374445
2374701
2374957
2375213
2375469
2367534
2367790
2368046
2368302
2368558
2368814
2369070
2369326
2369582
2369838
2370094
2370350
2370606
2370862
2371118
2371374
2371630
2371886
2372142
2372398
2372654
2372910
2373166
2373422
2373678
2373934
2374190
2374446
2374702
2374958
2375214
2375470
2367535
2367791
2368047
2368303
2368559
2368815
2369071
2369327
2369583
2369839
2370095
2370351
2370607
2370863
2371119
2371375
2371631
2371887
2372143
2372399
2372655
2372911
2373167
2373423
2373679
2373935
2374191
2374447
2374703
2374959
2375215
2375471
2367536
2367792
2368048
2368304
2368560
2368816
2369072
2369328
2369584
2369840
2370096
2370352
2370608
2370864
2371120
2371376
2371632
2371888
2372144
2372400
2372656
2372912
2373168
2373424
2373680
2373936
2374192
2374448
2374704
2374960
2375216
2375472
2367537
2367793
2368049
2368305
2368561
2368817
2369073
2369329
2369585
2369841
2370097
2370353
2370609
2370865
2371121
2371377
2371633
2371889
2372145
2372401
2372657
2372913
2373169
2373425
2373681
2373937
2374193
2374449
2374705
2374961
2375217
2375473
2367538
2367794
2368050
2368306
2368562
2368818
2369074
2369330
2369586
2369842
2370098
2370354
2370610
2370866
2371122
2371378
2371634
2371890
2372146
2372402
2372658
2372914
2373170
2373426
2373682
2373938
2374194
2374450
2374706
2374962
2375218
2375474
2367539
2367795
2368051
2368307
2368563
2368819
2369075
2369331
2369587
2369843
2370099
2370355
2370611
2370867
2371123
2371379
2371635
2371891
2372147
2372403
2372659
2372915
2373171
2373427
2373683
2373939
2374195
2374451
2374707
2374963
2375219
2375475
2367540
2367796
2368052
2368308
2368564
2368820
2369076
2369332
2369588
2369844
2370100
2370356
2370612
2370868
2371124
2371380
2371636
2371892
2372148
2372404
2372660
2372916
2373172
2373428
2373684
2373940
2374196
2374452
2374708
2374964
2375220
2375476
2367541
2367797
2368053
2368309
2368565
2368821
2369077
2369333
2369589
2369845
2370101
2370357
2370613
2370869
2371125
2371381
2371637
2371893
2372149
2372405
2372661
2372917
2373173
2373429
2373685
2373941
2374197
2374453
2374709
2374965
2375221
2375477
2367542
2367798
2368054
2368310
2368566
2368822
2369078
2369334
2369590
2369846
2370102
2370358
2370614
2370870
2371126
2371382
2371638
2371894
2372150
2372406
2372662
2372918
2373174
2373430
2373686
2373942
2374198
2374454
2374710
2374966
2375222
2375478
2367543
2367799
2368055
2368311
2368567
2368823
2369079
2369335
2369591
2369847
2370103
2370359
2370615
2370871
2371127
2371383
2371639
2371895
2372151
2372407
2372663
2372919
2373175
2373431
2373687
2373943
2374199
2374455
2374711
2374967
2375223
2375479
2367544
2367800
2368056
2368312
2368568
2368824
2369080
2369336
2369592
2369848
2370104
2370360
2370616
2370872
2371128
2371384
2371640
2371896
2372152
2372408
2372664
2372920
2373176
2373432
2373688
2373944
2374200
2374456
2374712
2374968
2375224
2375480
2367545
2367801
2368057
2368313
2368569
2368825
2369081
2369337
2369593
2369849
2370105
2370361
2370617
2370873
2371129
2371385
2371641
2371897
2372153
2372409
2372665
2372921
2373177
2373433
2373689
2373945
2374201
2374457
2374713
2374969
2375225
2375481
2367546
2367802
2368058
2368314
2368570
2368826
2369082
2369338
2369594
2369850
2370106
2370362
2370618
2370874
2371130
2371386
2371642
2371898
2372154
2372410
2372666
2372922
2373178
2373434
2373690
2373946
2374202
2374458
2374714
2374970
2375226
2375482
2367547
2367803
2368059
2368315
2368571
2368827
2369083
2369339
2369595
2369851
2370107
2370363
2370619
2370875
2371131
2371387
2371643
2371899
2372155
2372411
2372667
2372923
2373179
2373435
2373691
2373947
2374203
2374459
2374715
2374971
2375227
2375483
2367548
2367804
2368060
2368316
2368572
2368828
2369084
2369340
2369596
2369852
2370108
2370364
2370620
2370876
2371132
2371388
2371644
2371900
2372156
2372412
2372668
2372924
2373180
2373436
2373692
2373948
2374204
2374460
2374716
2374972
2375228
2375484
2367549
2367805
2368061
2368317
2368573
2368829
2369085
2369341
2369597
2369853
2370109
2370365
2370621
2370877
2371133
2371389
2371645
2371901
2372157
2372413
2372669
2372925
2373181
2373437
2373693
2373949
2374205
2374461
2374717
2374973
2375229
2375485
2367550
2367806
2368062
2368318
2368574
2368830
2369086
2369342
2369598
2369854
2370110
2370366
2370622
2370878
2371134
2371390
2371646
2371902
2372158
2372414
2372670
2372926
2373182
2373438
2373694
2373950
2374206
2374462
2374718
2374974
2375230
2375486
2367551
2367807
2368063
2368319
2368575
2368831
2369087
2369343
2369599
2369855
2370111
2370367
2370623
2370879
2371135
2371391
2371647
2371903
2372159
2372415
2372671
2372927
2373183
2373439
2373695
2373951
2374207
2374463
2374719
2374975
2375231
2375487
2367552
2367808
2368064
2368320
2368576
2368832
2369088
2369344
2369600
2369856
2370112
2370368
2370624
2370880
2371136
2371392
2371648
2371904
2372160
2372416
2372672
2372928
2373184
2373440
2373696
2373952
2374208
2374464
2374720
2374976
2375232
2375488
2367553
2367809
2368065
2368321
2368577
2368833
2369089
2369345
2369601
2369857
2370113
2370369
2370625
2370881
2371137
2371393
2371649
2371905
2372161
2372417
2372673
2372929
2373185
2373441
2373697
2373953
2374209
2374465
2374721
2374977
2375233
2375489
2367554
2367810
2368066
2368322
2368578
2368834
2369090
2369346
2369602
2369858
2370114
2370370
2370626
2370882
2371138
2371394
2371650
2371906
2372162
2372418
2372674
2372930
2373186
2373442
2373698
2373954
2374210
2374466
2374722
2374978
2375234
2375490
2367555
2367811
2368067
2368323
2368579
2368835
2369091
2369347
2369603
2369859
2370115
2370371
2370627
2370883
2371139
2371395
2371651
2371907
2372163
2372419
2372675
2372931
2373187
2373443
2373699
2373955
2374211
2374467
2374723
2374979
2375235
2375491
2367556
2367812
2368068
2368324
2368580
2368836
2369092
2369348
2369604
2369860
2370116
2370372
2370628
2370884
2371140
2371396
2371652
2371908
2372164
2372420
2372676
2372932
2373188
2373444
2373700
2373956
2374212
2374468
2374724
2374980
2375236
2375492
2367557
2367813
2368069
2368325
2368581
2368837
2369093
2369349
2369605
2369861
2370117
2370373
2370629
2370885
2371141
2371397
2371653
2371909
2372165
2372421
2372677
2372933
2373189
2373445
2373701
2373957
2374213
2374469
2374725
2374981
2375237
2375493
2367558
2367814
2368070
2368326
2368582
2368838
2369094
2369350
2369606
2369862
2370118
2370374
2370630
2370886
2371142
2371398
2371654
2371910
2372166
2372422
2372678
2372934
2373190
2373446
2373702
2373958
2374214
2374470
2374726
2374982
2375238
2375494
2367559
2367815
2368071
2368327
2368583
2368839
2369095
2369351
2369607
2369863
2370119
2370375
2370631
2370887
2371143
2371399
2371655
2371911
2372167
2372423
2372679
2372935
2373191
2373447
2373703
2373959
2374215
2374471
2374727
2374983
2375239
2375495
2367560
2367816
2368072
2368328
2368584
2368840
2369096
2369352
2369608
2369864
2370120
2370376
2370632
2370888
2371144
2371400
2371656
2371912
2372168
2372424
2372680
2372936
2373192
2373448
2373704
2373960
2374216
2374472
2374728
2374984
2375240
2375496
2367561
2367817
2368073
2368329
2368585
2368841
2369097
2369353
2369609
2369865
2370121
2370377
2370633
2370889
2371145
2371401
2371657
2371913
2372169
2372425
2372681
2372937
2373193
2373449
2373705
2373961
2374217
2374473
2374729
2374985
2375241
2375497
2367562
2367818
2368074
2368330
2368586
2368842
2369098
2369354
2369610
2369866
2370122
2370378
2370634
2370890
2371146
2371402
2371658
2371914
2372170
2372426
2372682
2372938
2373194
2373450
2373706
2373962
2374218
2374474
2374730
2374986
2375242
2375498
2367563
2367819
2368075
2368331
2368587
2368843
2369099
2369355
2369611
2369867
2370123
2370379
2370635
2370891
2371147
2371403
2371659
2371915
2372171
2372427
2372683
2372939
2373195
2373451
2373707
2373963
2374219
2374475
2374731
2374987
2375243
2375499
2367564
2367820
2368076
2368332
2368588
2368844
2369100
2369356
2369612
2369868
2370124
2370380
2370636
2370892
2371148
2371404
2371660
2371916
2372172
2372428
2372684
2372940
2373196
2373452
2373708
2373964
2374220
2374476
2374732
2374988
2375244
2375500
2367565
2367821
2368077
2368333
2368589
2368845
2369101
2369357
2369613
2369869
2370125
2370381
2370637
2370893
2371149
2371405
2371661
2371917
2372173
2372429
2372685
2372941
2373197
2373453
2373709
2373965
2374221
2374477
2374733
2374989
2375245
2375501
2367566
2367822
2368078
2368334
2368590
2368846
2369102
2369358
2369614
2369870
2370126
2370382
2370638
2370894
2371150
2371406
2371662
2371918
2372174
2372430
2372686
2372942
2373198
2373454
2373710
2373966
2374222
2374478
2374734
2374990
2375246
2375502
2367567
2367823
2368079
2368335
2368591
2368847
2369103
2369359
2369615
2369871
2370127
2370383
2370639
2370895
2371151
2371407
2371663
2371919
2372175
2372431
2372687
2372943
2373199
2373455
2373711
2373967
2374223
2374479
2374735
2374991
2375247
2375503
2367568
2367824
2368080
2368336
2368592
2368848
2369104
2369360
2369616
2369872
2370128
2370384
2370640
2370896
2371152
2371408
2371664
2371920
2372176
2372432
2372688
2372944
2373200
2373456
2373712
2373968
2374224
2374480
2374736
2374992
2375248
2375504
2367569
2367825
2368081
2368337
2368593
2368849
2369105
2369361
2369617
2369873
2370129
2370385
2370641
2370897
2371153
2371409
2371665
2371921
2372177
2372433
2372689
2372945
2373201
2373457
2373713
2373969
2374225
2374481
2374737
2374993
2375249
2375505
2367570
2367826
2368082
2368338
2368594
2368850
2369106
2369362
2369618
2369874
2370130
2370386
2370642
2370898
2371154
2371410
2371666
2371922
2372178
2372434
2372690
2372946
2373202
2373458
2373714
2373970
2374226
2374482
2374738
2374994
2375250
2375506
2367571
2367827
2368083
2368339
2368595
2368851
2369107
2369363
2369619
2369875
2370131
2370387
2370643
2370899
2371155
2371411
2371667
2371923
2372179
2372435
2372691
2372947
2373203
2373459
2373715
2373971
2374227
2374483
2374739
2374995
2375251
2375507
2367572
2367828
2368084
2368340
2368596
2368852
2369108
2369364
2369620
2369876
2370132
2370388
2370644
2370900
2371156
2371412
2371668
2371924
2372180
2372436
2372692
2372948
2373204
2373460
2373716
2373972
2374228
2374484
2374740
2374996
2375252
2375508
2367573
2367829
2368085
2368341
2368597
2368853
2369109
2369365
2369621
2369877
2370133
2370389
2370645
2370901
2371157
2371413
2371669
2371925
2372181
2372437
2372693
2372949
2373205
2373461
2373717
2373973
2374229
2374485
2374741
2374997
2375253
2375509
2367574
2367830
2368086
2368342
2368598
2368854
2369110
2369366
2369622
2369878
2370134
2370390
2370646
2370902
2371158
2371414
2371670
2371926
2372182
2372438
2372694
2372950
2373206
2373462
2373718
2373974
2374230
2374486
2374742
2374998
2375254
2375510
2367575
2367831
2368087
2368343
2368599
2368855
2369111
2369367
2369623
2369879
2370135
2370391
2370647
2370903
2371159
2371415
2371671
2371927
2372183
2372439
2372695
2372951
2373207
2373463
2373719
2373975
2374231
2374487
2374743
2374999
2375255
2375511
2367576
2367832
2368088
2368344
2368600
2368856
2369112
2369368
2369624
2369880
2370136
2370392
2370648
2370904
2371160
2371416
2371672
2371928
2372184
2372440
2372696
2372952
2373208
2373464
2373720
2373976
2374232
2374488
2374744
2375000
2375256
2375512
2367577
2367833
2368089
2368345
2368601
2368857
2369113
2369369
2369625
2369881
2370137
2370393
2370649
2370905
2371161
2371417
2371673
2371929
2372185
2372441
2372697
2372953
2373209
2373465
2373721
2373977
2374233
2374489
2374745
2375001
2375257
2375513
2367578
2367834
2368090
2368346
2368602
2368858
2369114
2369370
2369626
2369882
2370138
2370394
2370650
2370906
2371162
2371418
2371674
2371930
2372186
2372442
2372698
2372954
2373210
2373466
2373722
2373978
2374234
2374490
2374746
2375002
2375258
2375514
2367579
2367835
2368091
2368347
2368603
2368859
2369115
2369371
2369627
2369883
2370139
2370395
2370651
2370907
2371163
2371419
2371675
2371931
2372187
2372443
2372699
2372955
2373211
2373467
2373723
2373979
2374235
2374491
2374747
2375003
2375259
2375515
2367580
2367836
2368092
2368348
2368604
2368860
2369116
2369372
2369628
2369884
2370140
2370396
2370652
2370908
2371164
2371420
2371676
2371932
2372188
2372444
2372700
2372956
2373212
2373468
2373724
2373980
2374236
2374492
2374748
2375004
2375260
2375516
2367581
2367837
2368093
2368349
2368605
2368861
2369117
2369373
2369629
2369885
2370141
2370397
2370653
2370909
2371165
2371421
2371677
2371933
2372189
2372445
2372701
2372957
2373213
2373469
2373725
2373981
2374237
2374493
2374749
2375005
2375261
2375517
2367582
2367838
2368094
2368350
2368606
2368862
2369118
2369374
2369630
2369886
2370142
2370398
2370654
2370910
2371166
2371422
2371678
2371934
2372190
2372446
2372702
2372958
2373214
2373470
2373726
2373982
2374238
2374494
2374750
2375006
2375262
2375518
2367583
2367839
2368095
2368351
2368607
2368863
2369119
2369375
2369631
2369887
2370143
2370399
2370655
2370911
2371167
2371423
2371679
2371935
2372191
2372447
2372703
2372959
2373215
2373471
2373727
2373983
2374239
2374495
2374751
2375007
2375263
2375519
