2087
4391
2088
4392
2089
4393
2090
4394
2091
4395
2092
4396
2093
4397
2094
4398
2095
4399
2096
4400
2097
4401
2098
4402
2099
4403
2100
4404
2101
4405
2102
4406
2103
4407
2104
4408
2105
4409
2106
4410
2107
4411
2108
4412
2109
4413
2110
4414
2111
4415
5632
5888
14080
14336
21504
21760
5727
5983
14175
14431
21599
21855
68136
72232
72488
72744
73512
68137
72233
72489
72745
73513
68138
72234
72490
72746
73514
68139
72235
72491
72747
73515
68140
72236
72492
72748
73516
68141
72237
72493
72749
73517
68142
72238
72494
72750
73518
68143
72239
72495
72751
73519
68144
72240
72496
72752
73520
68145
72241
72497
72753
73521
68146
72242
72498
72754
73522
68147
72243
72499
72755
73523
68148
72244
72500
72756
73524
68149
72245
72501
72757
73525
68150
72246
72502
72758
73526
68151
72247
72503
72759
73527
68152
72248
72504
72760
73528
68153
72761
73529
68154
72250
72506
72762
73530
68155
72251
72507
72763
73531
68156
72252
72508
72764
73532
68157
72253
72509
72765
73533
68158
72254
72510
72766
73534
68159
72255
72511
72767
73535
71168
71424
79616
79872
87040
87296
71263
71519
79711
79967
87135
87391
138279
138791
139047
138280
138792
139048
138281
138793
139049
138282
138794
139050
138283
138795
139051
138284
138796
139052
138285
138797
139053
138286
138798
139054
138287
138799
139055
138800
139056
138289
138801
139057
138290
138802
139058
138291
138803
139059
138292
138804
139060
138293
138805
139061
138294
138806
139062
138295
138807
139063
138296
138808
139064
138297
138809
139065
138298
138810
139066
138299
138811
139067
138300
138812
139068
138301
138813
139069
138302
138814
139070
138303
138815
139071
136704
136960
145152
145408
152576
152832
136799
137055
145247
145503
152671
152927
202790
203558
204326
197415
199719
202791
203559
204327
204583
198952
201256
202792
204072
204328
204584
198697
198953
199721
201257
203561
204073
204329
204585
198954
199722
201258
203562
204074
204330
204586
198955
201259
202795
203563
204075
204331
204587
198956
199724
202796
203564
204076
204332
204588
198957
199725
201261
202797
203565
204077
204333
204589
198958
199726
201262
202798
203566
204078
204334
204590
198959
199727
201263
202799
203567
204079
204335
204591
198960
199728
201264
202800
203568
204080
204336
204592
198961
199729
201265
202801
203569
204081
204337
204593
198962
199730
201266
202802
203570
204082
204338
204594
198963
199731
201267
202803
203571
204083
204339
204595
198964
199732
201268
202804
203572
204084
204340
204596
198965
199733
201269
202805
203573
204085
204341
204597
198966
199734
201270
202806
203574
204086
204342
204598
198967
199735
201271
202807
203575
204087
204343
204599
198968
199736
201272
202808
203576
204088
204344
204600
198969
199737
201273
202809
203577
204089
204345
204601
198970
199738
201274
202810
203578
204090
204346
204602
198971
199739
201275
202811
203579
204091
204347
204603
198972
199740
201276
202812
203580
204092
204348
204604
198973
199741
201277
202813
203581
204093
204349
204605
198974
199742
201278
202814
203582
204094
204350
204606
198975
199743
201279
202815
203583
204095
204351
204607
202240
202496
210688
210944
218112
218368
202335
202591
210783
211039
218207
218463
269096
269352
269608
269864
270120
269097
269353
269609
269865
270121
269098
269354
269610
269866
270122
269099
269355
269611
269867
270123
269100
269356
269612
269868
270124
269101
269357
269613
269869
270125
269102
269358
269614
269870
270126
269103
269359
269615
269871
269104
269360
269616
269872
270128
269105
269361
269617
269873
270129
269106
269362
269618
269874
270130
269107
269363
269619
269875
270131
269108
269364
269620
269876
270132
269109
269365
269621
269877
270133
269110
269366
269622
269878
270134
269111
269367
269623
269879
270135
269112
269368
269624
269880
270136
269113
269369
269625
269881
270137
269114
269370
269626
269882
270138
269115
269371
269627
269883
270139
269116
269372
269628
269884
270140
269117
269373
269629
269885
270141
269118
269374
269630
269886
270142
269119
269375
269631
269887
270143
267776
268032
276224
276480
283648
283904
267871
268127
276319
276575
283743
283999
332800
332801
333057
334375
334887
335143
335399
335655
334376
334888
335144
335400
335656
334377
334889
335145
335401
335657
334378
334890
335146
335402
335658
334379
334891
335147
335403
335659
334380
334892
335148
335404
335660
334381
334893
335149
335405
335661
334382
334894
335150
335406
335662
334383
334895
335151
335407
335663
334384
334896
335152
335408
335664
334385
334897
335153
335409
335665
334386
334898
335154
335410
335666
334387
334899
335155
335411
335667
334388
334900
335156
335412
335668
334389
334901
335157
335413
335669
334390
334902
335158
335414
335670
334391
334903
335159
335415
335671
334392
334904
335160
335416
335672
334393
334905
335161
335417
335673
334394
334906
335162
335418
335674
334395
334907
335163
335419
335675
334396
334908
335164
335420
335676
334397
334909
335165
335421
335677
334398
334910
335166
335422
335678
334399
334911
335167
335423
335679
333312
333568
341760
342016
349184
349440
333407
333663
341855
342111
349279
349535
399143
399399
399911
400423
400679
400935
399144
399400
399912
400424
400680
400936
399145
399401
399913
400425
400681
400937
399146
399402
399914
400426
400682
400938
399147
399403
399915
400427
400683
400939
399148
399404
399916
400428
400684
400940
399149
399405
399917
400429
400685
400941
399150
399406
399918
400430
400686
400942
399151
399407
399919
400431
400687
400943
399152
399408
399920
400432
400688
400944
399153
399409
399921
400433
400689
400945
399154
399410
399922
400434
400690
400946
399155
399411
399923
400435
400691
400947
399156
399412
399924
400436
400692
400948
399157
399413
399925
400437
400693
400949
399158
399414
399926
400438
400694
400950
399159
399415
399927
400439
400695
400951
399160
399416
399928
400440
400696
400952
399161
399417
399929
400441
400697
400953
399162
399418
399930
400442
400698
400954
399163
399419
399931
400443
400699
400955
399164
399420
399932
400444
400700
400956
399165
399421
399933
400445
400701
400957
399166
399422
399934
400446
400702
400958
399167
399423
399935
400447
400703
400959
398848
399104
407296
407552
414720
414976
398943
399199
407391
407647
414815
415071
465447
465703
466215
466727
465448
465704
466216
466728
465449
465705
466217
466729
465450
465706
466218
466730
465451
465707
466219
466731
465452
465708
466220
466732
465453
465709
466221
466733
465454
465710
466222
466734
465455
465711
466223
466735
465456
465712
466224
466736
465457
465713
466225
466737
465458
465714
466226
466738
465459
465715
466227
466739
465460
465716
466228
466740
465461
465717
466229
466741
465462
465718
466230
466742
465463
465719
466231
466743
465464
465720
466232
466744
465465
465721
466233
466745
465466
465722
466234
466746
465467
465723
466235
466747
465468
465724
466236
466748
465469
465725
466237
466749
465470
465726
466238
466750
465471
465727
466239
466751
464384
464640
472832
473088
480256
480512
464479
464735
472927
473183
480351
480607
526375
531495
531751
532007
532263
526376
531496
531752
532008
532264
526377
531497
531753
532009
532265
526378
531498
531754
532010
532266
526379
531499
531755
532011
532267
526380
531500
531756
532012
532268
526381
531501
531757
532013
532269
526382
531502
531758
532014
532270
526383
531503
531759
532015
532271
526384
531504
531760
532016
532272
526385
531505
531761
532017
532273
526386
531506
531762
532018
532274
526387
531507
531763
532019
532275
526388
531508
531764
532020
532276
526389
531509
531765
532021
532277
526390
531510
531766
532022
532278
526391
531511
531767
532023
532279
526392
531512
531768
532024
532280
526393
531513
531769
532025
532281
526394
531514
531770
532026
532282
526395
531515
531771
532027
532283
526396
531516
531772
532028
532284
526397
531517
531773
532029
532285
526398
531518
531774
532030
532286
526399
531519
531775
532031
532287
529920
530176
538368
538624
545792
546048
530015
530271
538463
538719
545887
546143
596775
597543
597799
596776
597544
597800
596777
597545
597801
596778
597546
597802
596779
597547
597803
596780
597548
597804
596781
597549
597805
596782
597550
597806
596783
597551
597807
596784
597552
597808
596785
597553
597809
596786
597554
597810
596787
597555
597811
596788
597556
597812
596789
597557
597813
596790
597558
597814
596791
597559
597815
596792
597560
597816
596793
597561
597817
596794
597562
597818
596795
597563
597819
596796
597564
597820
596797
597565
597821
596798
597566
597822
596799
597567
597823
595456
595712
603904
604160
611328
611584
595551
595807
603999
604255
611423
611679
660992
661248
669440
669696
676864
677120
661087
661343
669535
669791
676959
677215
725031
725287
725543
725799
726055
726311
726567
726823
727079
728359
728615
728871
725032
725288
725544
725800
726056
726312
726568
726824
727080
728360
728616
728872
725033
725289
725545
725801
726057
726313
726569
726825
727081
728361
728617
728873
725034
725290
725546
725802
726058
726314
726570
726826
727082
728362
728618
728874
725035
725291
725547
725803
726059
726315
726571
726827
727083
728363
728619
728875
725036
725292
725548
725804
726060
726316
726572
726828
727084
728364
728620
728876
725037
725293
725549
725805
726061
726317
726573
726829
727085
728365
728621
728877
725038
725294
725550
725806
726062
726318
726574
726830
727086
728366
728622
728878
725039
725295
725551
725807
726063
726319
726575
726831
727087
728367
728623
728879
725040
725296
725552
725808
726064
726320
726576
726832
727088
728368
728624
728880
725041
725297
725553
725809
726065
726321
726577
726833
727089
728369
728625
728881
725042
725298
725554
725810
726066
726322
726578
726834
727090
728370
728626
728882
725043
725299
725555
725811
726067
726323
726579
726835
727091
728371
728627
728883
725044
725300
725556
725812
726068
726324
726580
726836
727092
728372
728628
728884
725045
725301
725557
725813
726069
726325
726581
726837
727093
728373
728629
728885
725046
725302
725558
725814
726070
726326
726582
726838
727094
728374
728630
728886
725047
725303
725559
725815
726071
726327
726583
726839
727095
728375
728631
728887
727096
728376
728632
728888
727097
728377
728633
728889
727098
728378
728634
728890
727099
728379
728635
728891
727100
728380
728636
728892
727101
728381
728637
728893
727102
728382
728638
728894
727103
728383
728639
728895
726528
726784
734976
735232
742400
742656
726623
726879
735071
735327
742495
742751
792358
793126
793638
793894
794406
792359
793127
793639
793895
794407
792360
793128
793640
793896
794408
792361
793129
793641
793897
794409
792362
793130
793642
793898
794410
792363
793131
793643
793899
794411
792364
793132
793644
793900
794412
792365
793133
793645
793901
794413
792366
793134
793646
793902
794414
792367
793135
793647
793903
794415
792368
793136
793648
793904
794416
792369
793137
793649
793905
794417
792370
793138
793650
793906
794418
792371
793139
793651
793907
794419
792372
793140
793652
793908
794420
792373
793141
793653
793909
794421
792374
793142
793654
793910
794422
792375
793143
793655
793911
794423
792376
793144
793656
793912
794424
792377
793145
793657
793913
794425
792378
793146
793658
793914
794426
792379
793147
793659
793915
794427
792380
793148
793660
793916
794428
792381
793149
793661
793917
794429
792382
793150
793662
793918
794430
792383
793151
793663
793919
794431
792064
792320
800512
800768
807936
808192
792159
792415
800607
800863
808031
808287
853287
857895
859687
859943
857896
859688
859944
857897
859689
859945
853290
853546
857898
859690
859946
853291
853547
857899
859691
859947
853292
853548
857900
859692
859948
853293
853549
857901
859693
859949
853294
857902
859694
859950
853295
857903
859695
859951
853296
853552
857904
859696
859952
853297
853553
857905
859697
859953
853298
853554
857906
859698
859954
853299
853555
857907
859699
859955
853300
853556
857908
859700
859956
853301
853557
857909
859701
853302
853558
857910
859702
859958
853303
853559
857911
859703
853304
853560
857912
859704
859960
853305
853561
857913
859705
859961
853306
853562
857914
859706
859962
853307
853563
857915
859707
859963
853308
853564
857916
859708
859964
853309
853565
857917
859709
859965
853310
853566
857918
859710
859966
853311
853567
857919
859711
859967
857600
857856
866048
866304
873472
873728
857695
857951
866143
866399
873567
873823
920870
924198
924966
925222
925478
920871
924199
924967
925223
925479
920872
924200
924968
925224
925480
920873
924201
924969
925225
925481
920874
924202
924970
925226
925482
920875
924203
924971
925227
925483
920876
924204
924972
925228
925484
920877
924205
924973
925229
925485
920878
924206
924974
925230
925486
920879
924207
924975
925231
925487
920880
924208
925488
920881
924209
924465
920882
924210
924466
924722
924978
925490
920883
924211
924467
924723
924979
925235
925491
920884
924212
924468
924724
924980
925236
925492
920885
924213
924469
924725
924981
925237
925493
920886
924214
924470
924726
924982
925238
925494
920887
924215
924471
924727
924983
925239
925495
920888
924216
924472
924728
924984
925240
925496
920889
924217
924473
924729
924985
925241
925497
920890
924218
924474
924730
924986
925242
925498
920891
924219
924475
924731
924987
925243
925499
920892
924220
924476
924732
924988
925244
925500
920893
924221
924477
924733
924989
925245
925501
920894
924222
924478
924734
924990
925246
925502
920895
924223
924479
924735
924991
925247
925503
923136
923392
931584
931840
939008
939264
923231
923487
931679
931935
939103
939359
987687
988455
989223
989735
989991
990247
990503
990759
991015
987688
988456
989224
989736
989992
990248
990504
990760
991016
987689
988457
989225
989737
989993
990249
990505
991017
987690
988458
989226
989738
989994
990250
990506
990762
991018
987691
988459
989227
989739
989995
990251
990507
990763
991019
987692
988460
989228
989740
989996
990252
990508
990764
991020
987693
988461
989229
989741
989997
990253
990509
990765
991021
987694
988462
989230
989742
989998
990254
990510
990766
991022
987695
988463
989231
989743
989999
990255
990511
990767
991023
987696
988464
989232
989744
990000
990256
990512
990768
991024
987697
988465
989233
989745
990001
990257
990513
990769
991025
987698
988466
989234
989746
990002
990258
990514
990770
991026
987699
988467
989235
989747
990003
990259
990515
990771
991027
987700
988468
989236
989748
990004
990260
990516
990772
991028
987701
988469
989237
989749
990005
990261
990517
990773
991029
987702
988470
989238
989750
990006
990262
990518
990774
991030
987703
988471
989239
989751
990007
990263
990519
990775
991031
987704
988472
989240
989752
990008
990264
990520
990776
991032
987705
988473
989241
989753
990009
990265
990521
990777
991033
987706
988474
989242
989754
990010
990266
990522
990778
991034
987707
988475
989243
989755
990011
990267
990523
990779
991035
987708
988476
989244
989756
990012
990268
990524
990780
991036
987709
988477
989245
989757
990013
990269
990525
990781
991037
987710
988478
989246
989758
990014
990270
990526
990782
991038
987711
988479
989247
989759
990015
990271
990527
990783
991039
988672
988928
997120
997376
1004544
1004800
988767
989023
997215
997471
1004639
1004895
1054246
1055270
1056294
1052199
1054247
1055271
1056295
1052200
1054248
1055272
1056296
1052201
1054249
1055273
1056297
1052202
1054250
1055274
1056298
1052203
1054251
1055275
1056299
1052204
1054252
1055276
1056300
1052205
1054253
1055277
1056301
1052206
1054254
1055278
1052207
1054255
1055279
1056303
1052208
1054256
1055280
1056304
1052209
1054257
1055281
1056305
1052210
1054258
1055282
1056306
1052211
1054259
1055283
1056307
1052212
1054260
1055284
1056308
1052213
1054261
1055285
1056309
1052214
1054262
1055286
1056310
1052215
1054263
1055287
1056311
1052216
1054264
1055288
1056312
1052217
1054265
1055289
1056313
1052218
1054266
1055290
1056314
1052219
1054267
1055291
1056315
1052220
1054268
1055292
1056316
1052221
1054269
1055293
1056317
1052222
1054270
1055294
1056318
1052223
1054271
1055295
1056319
1054208
1054464
1062656
1062912
1070080
1070336
1054303
1054559
1062751
1063007
1070175
1070431
1120038
1120806
1121062
1121574
1121830
1122086
1120041
1120809
1121065
1121577
1121833
1122089
1120042
1120810
1121066
1121578
1121834
1122090
1120043
1120811
1121067
1121579
1121835
1122091
1120044
1120812
1121068
1121580
1121836
1122092
1120045
1120813
1121069
1121581
1121837
1122093
1120046
1120814
1121070
1121582
1121838
1122094
1120047
1120815
1121071
1121583
1121839
1122095
1120048
1120816
1121072
1121584
1121840
1122096
1120049
1120817
1121073
1121585
1121841
1122097
1120050
1120818
1121074
1121586
1121842
1122098
1120051
1120819
1121075
1121587
1121843
1122099
1120052
1120820
1121076
1121588
1121844
1122100
1120053
1120821
1121077
1121589
1121845
1122101
1120054
1120822
1121078
1121590
1121846
1122102
1120055
1120823
1121079
1121591
1121847
1122103
1120056
1120824
1121080
1121592
1121848
1122104
1120057
1120825
1121081
1121593
1121849
1122105
1120058
1120826
1121082
1121594
1121850
1122106
1120059
1120827
1121083
1121595
1121851
1122107
1120060
1120828
1121084
1121596
1121852
1122108
1120061
1120829
1121085
1121597
1121853
1122109
1120062
1120830
1121086
1121598
1121854
1122110
1120063
1120831
1121087
1121599
1121855
1122111
1119744
1120000
1128192
1128448
1135616
1135872
1119839
1120095
1128287
1128543
1135711
1135967
1186343
1186599
1186855
1187111
1187367
1187623
1186344
1186600
1186856
1187112
1187368
1187624
1186345
1186601
1186857
1187113
1187369
1187625
1186346
1186602
1186858
1187114
1187370
1187626
1186347
1186603
1186859
1187115
1187371
1187627
1186348
1186604
1186860
1187116
1187372
1187628
1186349
1186605
1186861
1187117
1187373
1187629
1186350
1186606
1186862
1187118
1187374
1187630
1186351
1186607
1186863
1187119
1187375
1187631
1186352
1186608
1186864
1187120
1187376
1187632
1186353
1186609
1186865
1187121
1187377
1187633
1186354
1186610
1186866
1187122
1187378
1187634
1186355
1186611
1186867
1187123
1187379
1187635
1186356
1186612
1186868
1187124
1187380
1187636
1186357
1186613
1186869
1187125
1187381
1187637
1186358
1186614
1186870
1187126
1187382
1187638
1186359
1186615
1186871
1187127
1187383
1187639
1186360
1186616
1186872
1187128
1187384
1187640
1186361
1186617
1186873
1187129
1187385
1187641
1186362
1186618
1186874
1187130
1187386
1187642
1186363
1186619
1186875
1187131
1187387
1187643
1186364
1186620
1186876
1187132
1187388
1187644
1186365
1186621
1186877
1187133
1187389
1187645
1186366
1186622
1186878
1187134
1187390
1187646
1186367
1186623
1186879
1187135
1187391
1187647
1185280
1185536
1193728
1193984
1201152
1201408
1185375
1185631
1193823
1194079
1201247
1201503
1247015
1247271
1247783
1248039
1250599
1251111
1251623
1251879
1252135
1252391
1252647
1252903
1253159
1247016
1247272
1247784
1248040
1250600
1251112
1251624
1251880
1252136
1252392
1252648
1252904
1253160
1247017
1247273
1247785
1248041
1250601
1251113
1251625
1251881
1252137
1252393
1252649
1252905
1253161
1247018
1247274
1247786
1248042
1250602
1251114
1251626
1251882
1252138
1252394
1252650
1252906
1253162
1247019
1247275
1247787
1248043
1250603
1251115
1251627
1251883
1252139
1252395
1252651
1252907
1253163
1247020
1247276
1247788
1248044
1250604
1251116
1251628
1251884
1252140
1252396
1252652
1252908
1253164
1247021
1247277
1247789
1248045
1250605
1251117
1251629
1251885
1252141
1252397
1252653
1252909
1253165
1247022
1247278
1247790
1248046
1250606
1251118
1251630
1251886
1252142
1252398
1252654
1252910
1253166
1247023
1247279
1247791
1248047
1250607
1251119
1251631
1251887
1252143
1252399
1252655
1252911
1253167
1247024
1247280
1247792
1248048
1250608
1251120
1251632
1251888
1252144
1252400
1252656
1252912
1253168
1247025
1247281
1247793
1248049
1250609
1251121
1251633
1251889
1252145
1252401
1252657
1252913
1253169
1247026
1247282
1247794
1248050
1250610
1251122
1251634
1251890
1252146
1252402
1252658
1252914
1253170
1247027
1247283
1247795
1248051
1250611
1251123
1251635
1251891
1252147
1252403
1252659
1252915
1253171
1247028
1247284
1247796
1248052
1250612
1251124
1251636
1251892
1252148
1252404
1252660
1252916
1253172
1247029
1247285
1247797
1248053
1250613
1251125
1251637
1251893
1252149
1252405
1252661
1252917
1253173
1247286
1247798
1248054
1250614
1251126
1251638
1251894
1252150
1252406
1252662
1252918
1253174
1247287
1247799
1248055
1250615
1251127
1251639
1251895
1252151
1252407
1252663
1252919
1253175
1247032
1247288
1247800
1250616
1251128
1251640
1251896
1252152
1252408
1252664
1252920
1253176
1247033
1247289
1247801
1250617
1251129
1251641
1251897
1252153
1252409
1252665
1252921
1253177
1247034
1247290
1247802
1248058
1250618
1251898
1252154
1252410
1252666
1252922
1253178
1247035
1247291
1247803
1248059
1250619
1251131
1251643
1251899
1252155
1252411
1252667
1252923
1253179
1247036
1247292
1247804
1248060
1250620
1251132
1251644
1251900
1252156
1252412
1252668
1252924
1253180
1247037
1247293
1247805
1248061
1251133
1251645
1251901
1252157
1252413
1252669
1252925
1253181
1247038
1247806
1248062
1250622
1251134
1251646
1251902
1252158
1252414
1252670
1252926
1253182
1247039
1248063
1250623
1251135
1251647
1251903
1252159
1252415
1252671
1252927
1253183
1250816
1251072
1259264
1259520
1266688
1266944
1250911
1251167
1259359
1259615
1266783
1267039
1316391
1317415
1318183
1318695
1316392
1317416
1318184
1318696
1316393
1317417
1318185
1318697
1316394
1317418
1318186
1318698
1316395
1317419
1318187
1318699
1316396
1317420
1318188
1318700
1316397
1317421
1318189
1318701
1316398
1317422
1318190
1318702
1316399
1317423
1318191
1318703
1316400
1317424
1318192
1318704
1316401
1317425
1318193
1318705
1316402
1317426
1318194
1318706
1316403
1317427
1318195
1318707
1316404
1317428
1318196
1318708
1316405
1317429
1318197
1318709
1316406
1317430
1318198
1318710
1316407
1317431
1318199
1318711
1316408
1317432
1318200
1318712
1316409
1317433
1318201
1318713
1316410
1317434
1318202
1318714
1316411
1317435
1318203
1318715
1316412
1317436
1318204
1318716
1316413
1317437
1318205
1318717
1316414
1317438
1318206
1318718
1316415
1317439
1318207
1318719
1316352
1316608
1324800
1325056
1332224
1332480
1316447
1316703
1324895
1325151
1332319
1332575
1377063
1377575
1381927
1382183
1382951
1383207
1383463
1383975
1384231
1377064
1377576
1381928
1382184
1382952
1383208
1383464
1383976
1384232
1376809
1377065
1377577
1381929
1382185
1382953
1383209
1383465
1383977
1384233
1376810
1377066
1377578
1381930
1382186
1382954
1383210
1383466
1383978
1384234
1376811
1377067
1377579
1381931
1382187
1382955
1383211
1383467
1383979
1384235
1376812
1377068
1377580
1381932
1382188
1382956
1383212
1383468
1383980
1384236
1376813
1377069
1377581
1381933
1382189
1382957
1383213
1383469
1383981
1384237
1376814
1377070
1377582
1381934
1382190
1382958
1383214
1383470
1383982
1384238
1376815
1377071
1377583
1381935
1382191
1382959
1383215
1383471
1383983
1384239
1376816
1377072
1381936
1382192
1382960
1383216
1383472
1383984
1376817
1377073
1381937
1382193
1382961
1383217
1383473
1383985
1376818
1377074
1377586
1381938
1382194
1382706
1382962
1383218
1383474
1383986
1384242
1377075
1377587
1381939
1382195
1382707
1382963
1383219
1383475
1383987
1384243
1376820
1377076
1377588
1381940
1382196
1382708
1382964
1383220
1383476
1383988
1384244
1376821
1377077
1377589
1381941
1382197
1382709
1382965
1383221
1383477
1383989
1384245
1376822
1377078
1377590
1381942
1382198
1382710
1382966
1383222
1383478
1383990
1384246
1376823
1377079
1377591
1381943
1382199
1382711
1382967
1383223
1383479
1383991
1384247
1376824
1377080
1377592
1381944
1382200
1382712
1382968
1383224
1383480
1383992
1384248
1376825
1377081
1377593
1381945
1382201
1382713
1382969
1383225
1383481
1383993
1384249
1376826
1377082
1377594
1381946
1382202
1382714
1382970
1383226
1383482
1383994
1384250
1376827
1377083
1377595
1381947
1382203
1382715
1382971
1383227
1383483
1383995
1384251
1376828
1377084
1377596
1381948
1382204
1382716
1382972
1383228
1383484
1383996
1384252
1376829
1377085
1377597
1381949
1382205
1382717
1382973
1383229
1383485
1383997
1384253
1376830
1377086
1377598
1381950
1382206
1382718
1382974
1383230
1383486
1383998
1384254
1376831
1377087
1377599
1381951
1382207
1382719
1382975
1383231
1383487
1383999
1384255
1381888
1382144
1390336
1390592
1397760
1398016
1381983
1382239
1390431
1390687
1397855
1398111
1447207
1447463
1447719
1447975
1448231
1448487
1448743
1449255
1449511
1447208
1447464
1447720
1447976
1448232
1448488
1448744
1449256
1449512
1447209
1447465
1447721
1447977
1448233
1448489
1448745
1449257
1449513
1447210
1447466
1447722
1447978
1448234
1448490
1448746
1449258
1449514
1447211
1447467
1447723
1447979
1448235
1448491
1448747
1449259
1449515
1447212
1447468
1447724
1447980
1448236
1448492
1448748
1449260
1449516
1447213
1447469
1447725
1447981
1448237
1448493
1448749
1449261
1449517
1447214
1447470
1447726
1447982
1448238
1448494
1448750
1449262
1449518
1447215
1447471
1447727
1447983
1448239
1448495
1448751
1449263
1449519
1447216
1447472
1447728
1447984
1448240
1448496
1448752
1449264
1449520
1447217
1447473
1447729
1447985
1448241
1448497
1448753
1449265
1449521
1447218
1447474
1447730
1447986
1448242
1448498
1448754
1449266
1449522
1447219
1447475
1447731
1447987
1448243
1448499
1448755
1449267
1449523
1447220
1447476
1447732
1447988
1448244
1448500
1448756
1449268
1449524
1447221
1447477
1447733
1447989
1448245
1448501
1448757
1449269
1449525
1447222
1447478
1447734
1447990
1448246
1448502
1448758
1449270
1449526
1447223
1447479
1447735
1447991
1448247
1448503
1448759
1449271
1449527
1447224
1447480
1447736
1447992
1448248
1448504
1448760
1449272
1449528
1447225
1447481
1447737
1447993
1448249
1448505
1448761
1449273
1449529
1447226
1447482
1447738
1447994
1448250
1448506
1448762
1449274
1449530
1447227
1447483
1447739
1447995
1448251
1448507
1448763
1449275
1449531
1447228
1447484
1447740
1447996
1448252
1448508
1448764
1449276
1449532
1447229
1447485
1447741
1447997
1448253
1448509
1448765
1449277
1449533
1447230
1447486
1447742
1447998
1448254
1448510
1448766
1449278
1449534
1447231
1447487
1447743
1447999
1448255
1448511
1448767
1449279
1449535
1447424
1447680
1455872
1456128
1463296
1463552
1447519
1447775
1455967
1456223
1463391
1463647
1508647
1513511
1514279
1514535
1514791
1508648
1513512
1514280
1514536
1514792
1508649
1513513
1514281
1514537
1514793
1508650
1513514
1514282
1514538
1514794
1508651
1513515
1514283
1514539
1514795
1508652
1513516
1514284
1514540
1514796
1508653
1513517
1514285
1514541
1514797
1508654
1513518
1514286
1514542
1514798
1508655
1513519
1514287
1514543
1514799
1508656
1513520
1514288
1514544
1514800
1508657
1513521
1514289
1514545
1514801
1508658
1513522
1514290
1514546
1514802
1508659
1513523
1514291
1514547
1514803
1508660
1513524
1514292
1514548
1514804
1508661
1513525
1514293
1514549
1514805
1508662
1513526
1514294
1514550
1514806
1508663
1513527
1514295
1514551
1514807
1508664
1513528
1514296
1514552
1514808
1508665
1513529
1514297
1514553
1514809
1508666
1513530
1514298
1514554
1514810
1508667
1513531
1514299
1514555
1514811
1508668
1513532
1514300
1514556
1514812
1508669
1513533
1514301
1514557
1514813
1508670
1513534
1514302
1514558
1514814
1508671
1513535
1514303
1514559
1514815
1512960
1513216
1521408
1521664
1528832
1529088
1513055
1513311
1521503
1521759
1528927
1529183
1579047
1579559
1579815
1580071
1580327
1580583
1579048
1579560
1579816
1580072
1580328
1580584
1579049
1579561
1579817
1580073
1580329
1580585
1579050
1579562
1579818
1580074
1580330
1580586
1579051
1579563
1579819
1580075
1580331
1580587
1579052
1579564
1579820
1580076
1580332
1580588
1579053
1579565
1579821
1580077
1580333
1580589
1579054
1579566
1579822
1580078
1580334
1580590
1579055
1579567
1579823
1580079
1580335
1580591
1579057
1579569
1579825
1580081
1580337
1580593
1579058
1579570
1579826
1580082
1580338
1580594
1579059
1579571
1579827
1580083
1580339
1580595
1579060
1579572
1579828
1580084
1580340
1580596
1579061
1579573
1579829
1580085
1580341
1580597
1579062
1579574
1579830
1580086
1580342
1580598
1579063
1579575
1579831
1580087
1580343
1580599
1579064
1579576
1579832
1580088
1580344
1580600
1579065
1579577
1579833
1580089
1580345
1580601
1579066
1579578
1579834
1580090
1580346
1580602
1579068
1579580
1579836
1580092
1580348
1580604
1580860
1579069
1579581
1579837
1580093
1580349
1580605
1580861
1579070
1579582
1579838
1580094
1580350
1580606
1580862
1579071
1579583
1579839
1580095
1580351
1580607
1580863
1578496
1578752
1586944
1587200
1594368
1594624
1578591
1578847
1587039
1587295
1594463
1594719
1642023
1643047
1643815
1644071
1645095
1645351
1645607
1645863
1642024
1643048
1643816
1644072
1645096
1645352
1645608
1645864
1642025
1643049
1643817
1644073
1645097
1645353
1645609
1645865
1642026
1643050
1643818
1644074
1645098
1645354
1645610
1645866
1642027
1643051
1643819
1644075
1645099
1645355
1645611
1645867
1642028
1643052
1643820
1644076
1645100
1645356
1645612
1645868
1642029
1643053
1643821
1644077
1645101
1645357
1645613
1645869
1642030
1643054
1643822
1644078
1645102
1645358
1645614
1645870
1642031
1643055
1643823
1644079
1645103
1645359
1645615
1645871
1642032
1643056
1643824
1644080
1645104
1645360
1645616
1645872
1642033
1643057
1643825
1644081
1645105
1645361
1645617
1645873
1642034
1643058
1643826
1644082
1645106
1645362
1645618
1645874
1642035
1643059
1643827
1644083
1645107
1645363
1645875
1642036
1643060
1643828
1644084
1645108
1645364
1645620
1645876
1642037
1643061
1643829
1644085
1645109
1645365
1645621
1645877
1642038
1643062
1643830
1644086
1645110
1645366
1645622
1645878
1642039
1643063
1643831
1644087
1645111
1645367
1645623
1645879
1642040
1643064
1643832
1644088
1645112
1645368
1645624
1645880
1642041
1643065
1643833
1644089
1645113
1645369
1645625
1645881
1642042
1643066
1643834
1644090
1645114
1645370
1645626
1645882
1642043
1643067
1643835
1644091
1645115
1645371
1645627
1645883
1642044
1643068
1643836
1644092
1645116
1645372
1645628
1645884
1642045
1643069
1643837
1644093
1645117
1645373
1645629
1645885
1642046
1643070
1643838
1644094
1645118
1645374
1645630
1645886
1642047
1643071
1643839
1644095
1645119
1645375
1645631
1645887
1644032
1644288
1652480
1652736
1659904
1660160
1644127
1644383
1652575
1652831
1659999
1660255
1710630
1710886
1711142
1711398
1711654
1710631
1710887
1711143
1711399
1711655
1711911
1710632
1710888
1711144
1711400
1711656
1711912
1710633
1710889
1711145
1711401
1711657
1711913
1710634
1710890
1711146
1711402
1711658
1711914
1710635
1710891
1711147
1711403
1711659
1711915
1710636
1710892
1711148
1711404
1711660
1711916
1710637
1710893
1711149
1711405
1711661
1711917
1710638
1710894
1711150
1711406
1711662
1711918
1710639
1710895
1711151
1711407
1711663
1711919
1710640
1710896
1711152
1711408
1711664
1711920
1710641
1710897
1711153
1711409
1711665
1711921
1710642
1710898
1711154
1711410
1711666
1711922
1710643
1710899
1711155
1711411
1711667
1711923
1710644
1710900
1711156
1711412
1711668
1711924
1710645
1710901
1711157
1711413
1711669
1711925
1710646
1710902
1711158
1711414
1711670
1711926
1710647
1710903
1711159
1711415
1711671
1711927
1710648
1710904
1711160
1711416
1711672
1711928
1710649
1710905
1711161
1711417
1711673
1711929
1710650
1710906
1711162
1711418
1711674
1711930
1710651
1710907
1711163
1711419
1711675
1711931
1710652
1710908
1711164
1711420
1711676
1711932
1710653
1710909
1711165
1711421
1711677
1711933
1710654
1710910
1711166
1711422
1711678
1711934
1710655
1710911
1711167
1711423
1711679
1711935
1709568
1709824
1718016
1718272
1725440
1725696
1709663
1709919
1718111
1718367
1725535
1725791
1773094
1773350
1776166
1776934
1773095
1773351
1773607
1773863
1776167
1776935
1777447
1773096
1773352
1773608
1773864
1776168
1776936
1777448
1773097
1773353
1773609
1773865
1776169
1776937
1777449
1773098
1773354
1773610
1773866
1776170
1776938
1777450
1773099
1773355
1773611
1773867
1776171
1776939
1777451
1773100
1773356
1773612
1773868
1776172
1776940
1777452
1773101
1773357
1773613
1773869
1776173
1776941
1777453
1773102
1773358
1773614
1773870
1776174
1776942
1777454
1773103
1773359
1773615
1773871
1776175
1776943
1777455
1773104
1773360
1773616
1773872
1776176
1776944
1777456
1773105
1773361
1773617
1773873
1776177
1776945
1777457
1773106
1773362
1773618
1773874
1776178
1776946
1777458
1773107
1773363
1773619
1773875
1776179
1776947
1777459
1773108
1773364
1773620
1773876
1776180
1776948
1777460
1773109
1773365
1773621
1773877
1776181
1776949
1777461
1773110
1773366
1773622
1773878
1776182
1776950
1777462
1773111
1773367
1773623
1773879
1776183
1776951
1777463
1773112
1773368
1773624
1773880
1776184
1776952
1777464
1773369
1773625
1773881
1776185
1776953
1777465
1773114
1773626
1773882
1776186
1776954
1777466
1773115
1773627
1773883
1776187
1776955
1777467
1773116
1773628
1773884
1776188
1776956
1777468
1773117
1773629
1773885
1776189
1776957
1777469
1773118
1773630
1773886
1776190
1776958
1777470
1773119
1773631
1773887
1776191
1776959
1777471
1775104
1775360
1783552
1783808
1790976
1791232
1775199
1775455
1783647
1783903
1791071
1791327
1841702
1842470
1841703
1842471
1841704
1842472
1841705
1842473
1841706
1842474
1841707
1842475
1841708
1842476
1841709
1842477
1841710
1842478
1841711
1842479
1841712
1842480
1841713
1842481
1841714
1842482
1841715
1842483
1841716
1842484
1841717
1842485
1841718
1842486
1841719
1842487
1841720
1842488
1841721
1842489
1841722
1842490
1841723
1842491
1841724
1842492
1841725
1842493
1841726
1842494
1841727
1842495
1840640
1840896
1849088
1849344
1856512
1856768
1840735
1840991
1849183
1849439
1856607
1856863
1904167
1906215
1906471
1906983
1907239
1907495
1907751
1908007
1904168
1906216
1906472
1906984
1907240
1907496
1907752
1908008
1904169
1906217
1906473
1906985
1907241
1907497
1907753
1908009
1904170
1906218
1906474
1906986
1907242
1907498
1907754
1908010
1904171
1906219
1906475
1906987
1907243
1907499
1907755
1908011
1904172
1906220
1906476
1906988
1907244
1907500
1907756
1908012
1904173
1906221
1906477
1906989
1907245
1907501
1907757
1908013
1904174
1906222
1906478
1906990
1907246
1907502
1907758
1908014
1904175
1906223
1906479
1906991
1907247
1907503
1907759
1908015
1904176
1906224
1906480
1906992
1907248
1907504
1907760
1908016
1904177
1906225
1906481
1906993
1907249
1907505
1907761
1908017
1904178
1906226
1906482
1906994
1907250
1907506
1907762
1908018
1904179
1906227
1906483
1906995
1907251
1907507
1907763
1908019
1904180
1906228
1906484
1906996
1907252
1907508
1907764
1908020
1904181
1906229
1906485
1906997
1907253
1907509
1907765
1908021
1904182
1906230
1906486
1906998
1907254
1907510
1907766
1908022
1904183
1906231
1906487
1906999
1907255
1907511
1907767
1908023
1904184
1906232
1906488
1907000
1907256
1907512
1907768
1908024
1904185
1906233
1906489
1907001
1907257
1907513
1907769
1908025
1904186
1906234
1906490
1907002
1907258
1907514
1907770
1908026
1904187
1906235
1906491
1907003
1907259
1907515
1907771
1908027
1904188
1906236
1906492
1907004
1907260
1907516
1907772
1908028
1904189
1906237
1906493
1907005
1907261
1907517
1907773
1908029
1904190
1906238
1906494
1907006
1907262
1907518
1907774
1908030
1904191
1906239
1906495
1907007
1907263
1907519
1907775
1908031
1906176
1906432
1914624
1914880
1922048
1922304
1906271
1906527
1914719
1914975
1922143
1922399
1972775
1973031
1973287
1973543
1973799
1972776
1973032
1973288
1973544
1973800
1972777
1973033
1973289
1973545
1973801
1972778
1973034
1973290
1973546
1973802
1972779
1973035
1973291
1973547
1973803
1972780
1973036
1973292
1973548
1973804
1972782
1973038
1973550
1973806
1972783
1972784
1973040
1973296
1973552
1973808
1972787
1973043
1973299
1973555
1973811
1972788
1973044
1973300
1973556
1973812
1972789
1973045
1973301
1973557
1973813
1972793
1973049
1973305
1973561
1973817
1972795
1973051
1973307
1973563
1973819
1972796
1973052
1973308
1973564
1973820
1972798
1973054
1973310
1973566
1973822
1971712
1971968
1980160
1980416
1987584
1987840
1971807
1972063
1980255
1980511
1987679
1987935
2037031
2037287
2037799
2038311
2038823
2039079
2039335
2039591
2037032
2037288
2037800
2038312
2038824
2039080
2039592
2037033
2037289
2037801
2038313
2038825
2039081
2039337
2039593
2037034
2037290
2037802
2038314
2038826
2039082
2039338
2039594
2037291
2037803
2038315
2038827
2039083
2039339
2039595
2037036
2037292
2037804
2038316
2038828
2039084
2039340
2039596
2037037
2037293
2037805
2038317
2038829
2039085
2039341
2039597
2037038
2037294
2037806
2038318
2038830
2039086
2039342
2039598
2037039
2037295
2037807
2038319
2038831
2039087
2039343
2037040
2037296
2037808
2038320
2038832
2039088
2039344
2039600
2037041
2037297
2037809
2038321
2038833
2039089
2039345
2039601
2037042
2037298
2037810
2038322
2038834
2039090
2039346
2039602
2037043
2037299
2037811
2038323
2038835
2039091
2039347
2039603
2037044
2037300
2037812
2038324
2038836
2039092
2039348
2039604
2037045
2037301
2037813
2038325
2038837
2039093
2039349
2039605
2037046
2037302
2037814
2038326
2038838
2039094
2039350
2039606
2037047
2037303
2037815
2038327
2038839
2039095
2039351
2039607
2037048
2037304
2037816
2038328
2038840
2039096
2039352
2039608
2037049
2037305
2037817
2038329
2038841
2039097
2039353
2039609
2037050
2037306
2037818
2038330
2038842
2039098
2039354
2039610
2037051
2037307
2037819
2038331
2038843
2039099
2039355
2039611
2037052
2037308
2037820
2038332
2038844
2039100
2039356
2039612
2037053
2037309
2037821
2038333
2038845
2039101
2039357
2037054
2037822
2038334
2038846
2039102
2039358
2037055
2037311
2037823
2038335
2038847
2039103
2039359
2037248
2037504
2045696
2045952
2053120
2053376
2037343
2037599
2045791
2046047
2053215
2053471
2102272
2102528
2102273
2102529
2102823
2103847
2104103
2104359
2104615
2104871
2102824
2103848
2104104
2104360
2104616
2104872
2102825
2103849
2104105
2104361
2104617
2104873
2102826
2103850
2104106
2104362
2104618
2104874
2102827
2103851
2104107
2104363
2104619
2104875
2102828
2103852
2104108
2104364
2104620
2104876
2102829
2103853
2104109
2104365
2104621
2104877
2102830
2103854
2104110
2104366
2104622
2104878
2102831
2103855
2104111
2104367
2104623
2104879
2102832
2103856
2104112
2104368
2104624
2104880
2102833
2103857
2104113
2104369
2104625
2104881
2102834
2103858
2104114
2104370
2104626
2104882
2102835
2103859
2104115
2104371
2104627
2104883
2102836
2103860
2104116
2104372
2104628
2104884
2102837
2103861
2104117
2104373
2104629
2104885
2102838
2103862
2104118
2104374
2104630
2104886
2102839
2103863
2104119
2104375
2104631
2104887
2102840
2103864
2104120
2104376
2104632
2104888
2102841
2103865
2104121
2104377
2104633
2104889
2102842
2103866
2104122
2104378
2104634
2104890
2102843
2103867
2104123
2104379
2104635
2104891
2102844
2103868
2104124
2104380
2104636
2104892
2102845
2103869
2104125
2104381
2104637
2104893
2102846
2103870
2104126
2104382
2104638
2104894
2102847
2103871
2104127
2104383
2104639
2104895
2102784
2103040
2111232
2111488
2118656
2118912
2102879
2103135
2111327
2111583
2118751
2119007
2168103
2168359
2169383
2169895
2170151
2170407
2168104
2168360
2169384
2169896
2170152
2170408
2168105
2168361
2169385
2169897
2170153
2170409
2168106
2168362
2169386
2169898
2170154
2170410
2168107
2168363
2169387
2169899
2170155
2170411
2168108
2168364
2169388
2169900
2170156
2170412
2168109
2168365
2169389
2169901
2170157
2170413
2168110
2168366
2169390
2169902
2170158
2170414
2168111
2168367
2169391
2169903
2170159
2170415
2168112
2168368
2169392
2169904
2170160
2170416
2168113
2168369
2169393
2169905
2170161
2170417
2168114
2168370
2169394
2169906
2170162
2170418
2168115
2168371
2169395
2169907
2170163
2170419
2168116
2168372
2169396
2169908
2170164
2170420
2168117
2168373
2169397
2169909
2170165
2170421
2168118
2168374
2169398
2169910
2170166
2170422
2168119
2168375
2169399
2169911
2170167
2170423
2168120
2168376
2169400
2169912
2170168
2170424
2168121
2168377
2169401
2169913
2170169
2170425
2168122
2168378
2169402
2169914
2170170
2170426
2168123
2168379
2169403
2169915
2170171
2170427
2168124
2168380
2169404
2169916
2170172
2170428
2168125
2168381
2169405
2169917
2170173
2170429
2168126
2168382
2169406
2169918
2170174
2170430
2168127
2168383
2169407
2169919
2170175
2170431
2168320
2168576
2176768
2177024
2184192
2184448
2168415
2168671
2176863
2177119
2184287
2184543
2234407
2234919
2235175
2235431
2235687
2235943
2234408
2234920
2235176
2235432
2235688
2235944
2234409
2234921
2235177
2235433
2235689
2235945
2234410
2234922
2235178
2235434
2235690
2235946
2234411
2234923
2235179
2235435
2235691
2235947
2234412
2234924
2235180
2235436
2235692
2235948
2234413
2234925
2235181
2235437
2235693
2235949
2234414
2234926
2235182
2235438
2235694
2235950
2234415
2234927
2235183
2235439
2235695
2235951
2234416
2234928
2235184
2235440
2235696
2235952
2234417
2234929
2235185
2235441
2235697
2235953
2234418
2234930
2235186
2235442
2235698
2235954
2234419
2234931
2235187
2235443
2235699
2235955
2234420
2234932
2235188
2235444
2235700
2235956
2234421
2234933
2235189
2235445
2235701
2235957
2234422
2234934
2235190
2235446
2235702
2235958
2234423
2234935
2235191
2235447
2235703
2235959
2234424
2234936
2235192
2235448
2235704
2235960
2234425
2234937
2235193
2235449
2235705
2235961
2234426
2234938
2235194
2235450
2235706
2235962
2234427
2234939
2235195
2235451
2235707
2235963
2234428
2234940
2235196
2235452
2235708
2235964
2234429
2234941
2235197
2235453
2235709
2235965
2234430
2234942
2235198
2235454
2235710
2235966
2234431
2234943
2235199
2235455
2235711
2235967
2233856
2234112
2242304
2242560
2249728
2249984
2233951
2234207
2242399
2242655
2249823
2250079
2299136
2299137
2299687
2300455
2300711
2300967
2301223
2301479
2299688
2300456
2300712
2300968
2301224
2301480
2299691
2300459
2300715
2300971
2301227
2301483
2299692
2300460
2300716
2300972
2301228
2301484
2299693
2300461
2300717
2300973
2301229
2301485
2299694
2300462
2300718
2300974
2301230
2301486
2299695
2300463
2300719
2300975
2301231
2301487
2299698
2300466
2300722
2300978
2301234
2301490
2299699
2300467
2300723
2300979
2301235
2301491
2299700
2300468
2300724
2300980
2301236
2301492
2299701
2300469
2300725
2300981
2301237
2301493
2299702
2300470
2300726
2300982
2301238
2301494
2300471
2300727
2300983
2301239
2301495
2299704
2299960
2300472
2300728
2300984
2301240
2301496
2299705
2299961
2300473
2300729
2300985
2301241
2301497
2299706
2299962
2300474
2300730
2300986
2301242
2301498
2299707
2299963
2300475
2300731
2300987
2301243
2301499
2299708
2299964
2300476
2300732
2300988
2301244
2301500
2299709
2299965
2300477
2300733
2300989
2301245
2301501
2299710
2299966
2300478
2300734
2300990
2301246
2301502
2299392
2299648
2307840
2308096
2315264
2315520
2299487
2299743
2307935
2308191
2315359
2315615
2364455
2364967
2365223
2365479
2365735
2365991
2366247
2366503
2366759
2367015
2364456
2364968
2365224
2365480
2365736
2365992
2366248
2366504
2366760
2367016
2364457
2364969
2365225
2365481
2365737
2365993
2366249
2366505
2366761
2367017
2364458
2364970
2365226
2365482
2365738
2365994
2366250
2366506
2366762
2367018
2364459
2364971
2365227
2365483
2365739
2365995
2366251
2366507
2366763
2367019
2364460
2364972
2365228
2365484
2365740
2365996
2366252
2366508
2366764
2367020
2364461
2364973
2365229
2365485
2365741
2365997
2366253
2366509
2366765
2367021
2364462
2364974
2365230
2365486
2365742
2365998
2366254
2366510
2366766
2367022
2364463
2364975
2365231
2365487
2365743
2365999
2366255
2366511
2367023
2364464
2364976
2365232
2365488
2365744
2366000
2366256
2366512
2366768
2367024
2364465
2364977
2365489
2365745
2366001
2366257
2366513
2366769
2367025
2364466
2364978
2365234
2365490
2365746
2366002
2366258
2366514
2366770
2367026
2364467
2364979
2365235
2365491
2365747
2366003
2366259
2366515
2366771
2367027
2364468
2364980
2365236
2365492
2365748
2366004
2366260
2366516
2366772
2367028
2364469
2364981
2365237
2365493
2365749
2366005
2366261
2366517
2366773
2367029
2364470
2364982
2365238
2365494
2365750
2366006
2366262
2366518
2366774
2367030
2364471
2364983
2365239
2365495
2365751
2366007
2366263
2366519
2366775
2367031
2364472
2364984
2365240
2365496
2365752
2366008
2366264
2366520
2366776
2367032
2364473
2364985
2365241
2365497
2365753
2366009
2366265
2366521
2366777
2367033
2364474
2364986
2365242
2365498
2365754
2366010
2366266
2366522
2366778
2367034
2364475
2364987
2365243
2365499
2365755
2366011
2366267
2366523
2366779
2367035
2364476
2364988
2365244
2365500
2365756
2366012
2366268
2366524
2366780
2367036
2364477
2364989
2365245
2365501
2365757
2366013
2366269
2366525
2366781
2367037
2364478
2364990
2365246
2365502
2365758
2366014
2366270
2366526
2366782
2367038
2364479
2364991
2365247
2365503
2365759
2366015
2366271
2366527
2366783
2367039
2364928
2365184
2373376
2373632
2380800
2381056
2365023
2365279
2373471
2373727
2380895
2381151
2431015
2431527
2431783
2432039
2432551
2431016
2431528
2431784
2432040
2432552
2431017
2431529
2431785
2432041
2432553
2431019
2431531
2431787
2432043
2432555
2431020
2431532
2431788
2432044
2432556
2431021
2431533
2431789
2432045
2432557
2431022
2431534
2431790
2432046
2432558
2431023
2431535
2431791
2432047
2432559
2431024
2431536
2431792
2432048
2432560
2431025
2431537
2431793
2432049
2432561
2431026
2431538
2431794
2432050
2432562
2431027
2431539
2431795
2432051
2432563
2431028
2431540
2431796
2432052
2432564
2431029
2431541
2431797
2432053
2432565
2431030
2431542
2431798
2432054
2432566
2431031
2431543
2431799
2432055
2432567
2431032
2431544
2431800
2432056
2432568
2431033
2431545
2431801
2432057
2432569
2431034
2431546
2431802
2432058
2432570
2431035
2431547
2431803
2432059
2432571
2431036
2431548
2431804
2432060
2432572
2431037
2431549
2431805
2432061
2432573
2431038
2431550
2431806
2432062
2432574
2431039
2431551
2431807
2432063
2432575
2430464
2430720
2438912
2439168
2446336
2446592
2430559
2430815
2439007
2439263
2446431
2446687
2495527
2497063
2497319
2497575
2497831
2495528
2497064
2497320
2497576
2497832
2495529
2497065
2497321
2497577
2497833
2495530
2497066
2497322
2497578
2497834
2495531
2497067
2497323
2497579
2497835
2495532
2497068
2497324
2497580
2497836
2495533
2497069
2497325
2497581
2497837
2495534
2497070
2497326
2497582
2497838
2495535
2497071
2497327
2497583
2497839
2495536
2497072
2497328
2497584
2497840
2495537
2497073
2497329
2497585
2497841
2495538
2497074
2497330
2497586
2497842
2495539
2497075
2497331
2497587
2497843
2495540
2497076
2497332
2497588
2497844
2498357
2495543
2497079
2497335
2497591
2497847
2498103
2495544
2497080
2497336
2497592
2497848
2498104
2495545
2497081
2497337
2497593
2497849
2498105
2495546
2497082
2497338
2497594
2497850
2498106
2495547
2497083
2497339
2497595
2497851
2498107
2495548
2497084
2497340
2497596
2497852
2498108
2495550
2497086
2497342
2497598
2497854
2498110
2495552
2497088
2497344
2497600
2497856
2498112
2496000
2496256
2504448
2504704
2511872
2512128
2496095
2496351
2504543
2504799
2511967
2512223
2561536
2561792
2569984
2570240
2577408
2577664
2561631
2561887
2570079
2570335
2577503
2577759
2628135
2628391
2628136
2628392
2628137
2628393
2628138
2628394
2628139
2628395
2628140
2628396
2628141
2628397
2628142
2628398
2628143
2628399
2628144
2628400
2628145
2628401
2628146
2628402
2628147
2628403
2628148
2628404
2628149
2628405
2628150
2628406
2628151
2628407
2628152
2628408
2628153
2628409
2628154
2628410
2628156
2628412
2628157
2628413
2628158
2628414
2628159
2628415
2627072
2627328
2635520
2635776
2642944
2643200
2627167
2627423
2635615
2635871
2643039
2643295
2693668
2691627
2692139
2692395
2693675
2691631
2692143
2692399
2693679
2691376
2691632
2692400
2693680
2691377
2691633
2692145
2692401
2693681
2694705
2691379
2691635
2692147
2692403
2693683
2694451
2694707
2690612
2691380
2691636
2692148
2692404
2693684
2694452
2694708
2690613
2691381
2691637
2692149
2692405
2693685
2694453
2694709
2690614
2691382
2691638
2692150
2692406
2693686
2694454
2694710
2688823
2690615
2691383
2691639
2692151
2692407
2693687
2694455
2694711
2688825
2690617
2691385
2691641
2692153
2692409
2693689
2694457
2694713
2688826
2690618
2691386
2691642
2692154
2692410
2693690
2694458
2694714
2688827
2690619
2691387
2691643
2692155
2692411
2693691
2694459
2694715
2688828
2690620
2691388
2691644
2692156
2692412
2693692
2694460
2694716
2688829
2691389
2691645
2692157
2692413
2693693
2694461
2694717
2688830
2690622
2691390
2691646
2692158
2692414
2693694
2694462
2694718
2688831
2690623
2691391
2691647
2692159
2692415
2693695
2694463
2694719
2692608
2692864
2701056
2701312
2708480
2708736
2692703
2692959
2701151
2701407
2708575
2708831
2758400
2758144
2758400
2766592
2766848
2774016
2774272
2758239
2758495
2766687
2766943
2774111
2774367
2820902
2825766
2820903
2825767
2826023
2820904
2825768
2826024
2820905
2825769
2826025
2820906
2825770
2826026
2820907
2825771
2826027
2820908
2825772
2820909
2825773
2820910
2825774
2820911
2825775
2826031
2820912
2825776
2820913
2825777
2826033
2820914
2825778
2826034
2820915
2825779
2820916
2825780
2826036
2820917
2825781
2826037
2820918
2825782
2826038
2820919
2825783
2826039
2820920
2825784
2826040
2820922
2825786
2826042
2820923
2825787
2826043
2825788
2826044
2820925
2825789
2820927
2825791
2823680
2823936
2832128
2832384
2839552
2839808
2823775
2824031
2832223
2832479
2839647
2839903
2891302
2891303
2891304
2891305
2891306
2891307
2891308
2891309
2891310
2891311
2891312
2891314
2891315
2891316
2891317
2891318
2891319
2891321
2891322
2891323
2891324
2891325
2891326
2891327
2889216
2889472
2897664
2897920
2905088
2905344
2889311
2889567
2897759
2898015
2905183
2905439
2956838
2956839
2956840
2956841
2956842
2956843
2956844
2956845
2956846
2956847
2956848
2956849
2956850
2956851
2956852
2956853
2956854
2956855
2956856
2956857
2956858
2956859
2956860
2956861
2956862
2954752
2955008
2963200
2963456
2970624
2970880
2954847
2955103
2963295
2963551
2970719
2970975
3016230
3016231
3016232
3021352
3016233
3016234
3016235
3021355
3016236
3016237
3016238
3016239
3021359
3016240
3016241
3016242
3016243
3021363
3016244
3021364
3016245
3021365
3016246
3016247
3016248
3016249
3016505
3016250
3021370
3016251
3020347
3020603
3021371
3016252
3020348
3020604
3021372
3016254
3016255
3020288
3020544
3028736
3028992
3036160
3036416
3020383
3020639
3028831
3029087
3036255
3036511
3087654
3087910
3087655
3087911
3087656
3087912
3087657
3087913
3087658
3087914
3087659
3087915
3087660
3087916
3087661
3087917
3087662
3087918
3087663
3087919
3087664
3087920
3087665
3087921
3087666
3087922
3087667
3087923
3087668
3087924
3087669
3087925
3087670
3087926
3087671
3087927
3087672
3087928
3087673
3087929
3087674
3087930
3087675
3087931
3087676
3087932
3087677
3087933
3087678
3087934
3087679
3087935
3085824
3086080
3094272
3094528
3101696
3101952
3085919
3086175
3094367
3094623
3101791
3102047
3153190
3153446
3153191
3153447
3153192
3153448
3153193
3153449
3153194
3153450
3153195
3153451
3153196
3153452
3153197
3153453
3153198
3153454
3153199
3153455
3153200
3153456
3153201
3153457
3153202
3153458
3153203
3153459
3153204
3153460
3153205
3153461
3153206
3153462
3153207
3153463
3153208
3153464
3153209
3153465
3153210
3153466
3153211
3153467
3153212
3153468
3153213
3153469
3153214
3153470
3153215
3153471
3151360
3151616
3159808
3160064
3167232
3167488
3151455
3151711
3159903
3160159
3167327
3167583
3218726
3218982
3218727
3218983
3218728
3218984
3218729
3218985
3218730
3218986
3218731
3218987
3218732
3218988
3218733
3218989
3218734
3218990
3218735
3218991
3218736
3218992
3218737
3218993
3218738
3218994
3218739
3218995
3218740
3218996
3218741
3218997
3218742
3218998
3218743
3218999
3218744
3219000
3218745
3219001
3218746
3219002
3218747
3219003
3218748
3219004
3218749
3219005
3218750
3219006
3218751
3219007
3216896
3217152
3225344
3225600
3232768
3233024
3216991
3217247
3225439
3225695
3232863
3233119
3284518
3284519
3284520
3284521
3284522
3284523
3284524
3284525
3284526
3284527
3284528
3284529
3284530
3284531
3284532
3284533
3284534
3284535
3284536
3284537
3284538
3284539
3284540
3284541
3284542
3284543
3282432
3282688
3290880
3291136
3298304
3298560
3282527
3282783
3290975
3291231
3298399
3298655
3349030
3349798
3350054
3349031
3349799
3350055
3349032
3349800
3350056
3349033
3349801
3350057
3349034
3349802
3350058
3349035
3349803
3350059
3349036
3349804
3350060
3349037
3349805
3350061
3350317
3349038
3349806
3350062
3350318
3349039
3349807
3350063
3350319
3349040
3349808
3350064
3350320
3349041
3349809
3350065
3350321
3349042
3349810
3350066
3350322
3349043
3349811
3350067
3350323
3349044
3349812
3350068
3350324
3349045
3349813
3350069
3350325
3349046
3349814
3350070
3350326
3349047
3349815
3350071
3350327
3349048
3349816
3350072
3350328
3349049
3349817
3350073
3350329
3349050
3349818
3350074
3349051
3349819
3350075
3349052
3349820
3350076
3349053
3349821
3350077
3349054
3349822
3350078
3349055
3349823
3350079
3347968
3348224
3356416
3356672
3363840
3364096
3348063
3348319
3356511
3356767
3363935
3364191
3408422
3408678
3408934
3409190
3409446
3409702
3409958
3410214
3410470
3410726
3410982
3411238
3411494
3411750
3412006
3412262
3412518
3412774
3413030
3413286
3413542
3413798
3414054
3414310
3414566
3414822
3415078
3415334
3415590
3408423
3408679
3408935
3409191
3409447
3409703
3409959
3410215
3410471
3410727
3410983
3411239
3411495
3411751
3412007
3412263
3412519
3412775
3413031
3413287
3413543
3413799
3414055
3414311
3414567
3414823
3415079
3415335
3415591
3408424
3408680
3408936
3409192
3409448
3409704
3409960
3410216
3410472
3410728
3410984
3411240
3411496
3411752
3412008
3412264
3412520
3412776
3413032
3413288
3413544
3413800
3414056
3414312
3414568
3414824
3415080
3415336
3415592
3408425
3408681
3408937
3409193
3409449
3409705
3409961
3410217
3410473
3410729
3410985
3411241
3411497
3411753
3412009
3412265
3412521
3412777
3413033
3413289
3413545
3413801
3414057
3414313
3414569
3414825
3415081
3415337
3415593
3408426
3408682
3408938
3409194
3409450
3409706
3409962
3410218
3410474
3410730
3410986
3411242
3411498
3411754
3412010
3412266
3412522
3412778
3413034
3413290
3413546
3413802
3414058
3414314
3414570
3414826
3415082
3415338
3415594
3408427
3408683
3408939
3409195
3409451
3409707
3409963
3410219
3410475
3410731
3410987
3411243
3411499
3411755
3412011
3412267
3412523
3412779
3413035
3413291
3413547
3413803
3414059
3414315
3414571
3414827
3415083
3415339
3415595
3408428
3408684
3408940
3409196
3409452
3409708
3409964
3410220
3410476
3410732
3410988
3411244
3411500
3411756
3412012
3412268
3412524
3412780
3413036
3413292
3413548
3413804
3414060
3414316
3414572
3414828
3415084
3415340
3415596
3408173
3408429
3408685
3408941
3409197
3409453
3409709
3409965
3410221
3410477
3410733
3410989
3411245
3411501
3411757
3412013
3412269
3412525
3412781
3413037
3413293
3413549
3413805
3414061
3414317
3414573
3414829
3415085
3415341
3415597
3408174
3408430
3408686
3408942
3409198
3409454
3409710
3409966
3410222
3410478
3410734
3410990
3411246
3411502
3411758
3412014
3412270
3412526
3412782
3413038
3413294
3413550
3413806
3414062
3414318
3414574
3414830
3415086
3415342
3415598
3408175
3408431
3408687
3408943
3409199
3409455
3409711
3409967
3410223
3410479
3410735
3410991
3411247
3411503
3411759
3412015
3412271
3412527
3412783
3413039
3413295
3413551
3413807
3414063
3414319
3414575
3414831
3415087
3415343
3415599
3413504
3413760
3421952
3422208
3429376
3429632
3413599
3413855
3422047
3422303
3429471
3429727
3479040
3479296
3487488
3487744
3494912
3495168
3479135
3479391
3487583
3487839
3495007
3495263
