2558024
2558280
2558536
2558792
2559048
2559304
2559560
2559816
2558025
2558281
2558537
2558793
2559049
2559305
2559561
2559817
2558026
2558282
2558538
2558794
2559050
2559306
2559562
2559818
2558027
2558283
2558539
2558795
2559051
2559307
2559563
2559819
2558028
2558284
2558540
2558796
2559052
2559308
2559564
2559820
2558029
2558285
2558541
2558797
2559053
2559309
2559565
2559821
2558030
2558286
2558542
2558798
2559054
2559310
2559566
2559822
2558031
2558287
2558543
2558799
2559055
2559311
2559567
2559823
