6156
6668
6924
7180
7436
6164
6676
6932
7188
7444
7700
7956
6165
6677
6933
7189
7445
7701
7957
6166
6678
6934
7190
7446
7702
7958
6167
6679
6935
7191
7447
7703
7959
6168
6680
6936
7192
7448
7704
7960
6169
6681
6937
7193
7449
7705
7961
6170
6682
6938
7194
7450
7706
7962
6171
6683
6939
7195
7451
7707
7963
6172
6684
6940
7196
7452
7708
7964
6173
6685
6941
7197
7453
7709
7965
6174
6686
6942
7198
7454
7710
7966
6175
6687
6943
7199
7455
7711
7967
6176
6688
6944
7200
7456
7712
7968
6177
6689
6945
7201
7457
7713
7969
5632
5888
14080
14336
21504
21760
5727
5983
14175
14431
21599
21855
71696
72208
72464
72720
72976
73232
71700
72212
72468
72724
72980
73236
73492
71701
72213
72469
72725
72981
73237
73493
71702
72214
72470
72726
72982
73238
73494
71703
72215
72471
72727
72983
73239
73495
71704
72216
72472
72728
72984
73240
73496
71705
72217
72473
72729
72985
73241
73497
71706
72218
72474
72730
72986
73242
73498
71707
72219
72475
72731
72987
73243
73499
71708
72220
72476
72732
72988
73244
73500
71709
72221
72477
72733
72989
73245
73501
71710
72222
72478
72734
72990
73246
73502
71711
72223
72479
72735
72991
73247
73503
71712
72224
72480
72736
72992
73248
73504
71713
72225
72481
72737
72993
73249
73505
71168
71424
79616
79872
87040
87296
71263
71519
79711
79967
87135
87391
132109
137229
137997
138765
139021
132110
137230
137998
138766
139022
132111
137231
137999
138767
139023
132112
137232
138000
138768
139024
132113
137233
138001
138769
139025
132114
137234
138002
138770
139026
132115
137235
138003
138771
139027
132116
137236
138004
138772
139028
132117
137237
138005
138773
139029
132118
137238
138006
138774
139030
132119
137239
138007
138775
139031
132120
137240
138008
138776
139032
132121
137241
138009
138777
139033
132122
137242
138010
138778
139034
137243
138011
138779
139035
132124
137244
138012
138780
139036
132125
137245
138013
138781
139037
132126
137246
138014
138782
139038
132127
137247
138015
138783
139039
132128
137248
138016
138784
139040
132129
137249
138017
138785
139041
136704
136960
145152
145408
152576
152832
136799
137055
145247
145503
152671
152927
202758
197641
198153
198409
198665
198921
199177
199689
199945
200457
200713
200969
201225
201993
202249
202505
202761
203017
203785
204041
197386
197642
197898
198154
198666
198922
199178
199434
199690
199946
200202
200458
200714
200970
201226
201482
201994
202250
202506
203018
203530
203786
204298
197387
197643
197899
198155
198411
198667
198923
199179
199691
199947
200203
200715
201227
201483
201995
202251
202507
203019
203275
203531
203787
204043
204299
204555
197388
197644
197900
198156
198412
198668
199180
199692
199948
200460
200716
201228
201484
201996
202252
202508
203020
203276
203532
203788
204044
204300
204556
197645
197901
198157
198413
199181
199437
199693
199949
200461
200717
200973
201485
201741
201997
202253
202509
202765
203021
203277
203533
203789
204045
204301
204557
197390
197646
197902
198158
198414
198670
198926
199182
199438
199694
199950
200206
200462
201230
201486
201742
202254
202510
202766
203022
203278
203534
203790
204046
204302
204558
197391
197647
197903
198159
198415
198671
198927
199183
199439
199695
199951
200207
200463
200975
201231
201487
201743
201999
202255
202511
203023
203279
203535
203791
204047
204303
204559
198160
198928
199184
199440
199696
199952
200208
200464
200720
200976
201232
201488
201744
202000
202256
202512
202768
203024
203280
203536
203792
204048
204304
204560
197393
197905
198161
198673
198929
199185
199441
199697
199953
200209
200465
200721
200977
201233
201489
202001
202257
202769
203025
203281
203537
203793
204049
204305
204561
197650
197906
198162
198418
198674
198930
199186
199442
199698
199954
200210
200466
200722
200978
201234
201490
201746
202002
202514
202770
203026
203282
203538
203794
204050
204306
204562
197907
198163
198419
198675
198931
199443
199699
199955
200467
200723
200979
201235
201491
201747
202003
202259
202515
202771
203027
203283
203539
203795
204051
204307
204563
197908
198164
198420
198676
198932
199188
199444
199700
199956
200212
200468
200724
200980
201236
202004
202260
202516
202772
203028
203284
203540
203796
204052
204308
204564
197909
198165
198933
199189
199701
200213
200469
200725
200981
201749
202005
202261
202517
202773
203029
203285
203541
203797
204053
204309
204565
197910
198166
198422
198678
198934
199190
199446
199702
199958
200470
200726
200982
201238
201494
202006
202262
202518
202774
203030
203286
203542
203798
204054
204310
204566
197911
198167
198679
198935
199191
199447
199703
199959
200215
200471
200727
200983
201239
202007
202519
202775
203031
203287
203543
203799
204055
204311
204567
197912
198168
198424
198936
199192
199448
200216
200472
200728
200984
201240
201496
201752
202008
202520
202776
203032
203288
203544
203800
204056
204312
204568
197913
198169
198425
198681
198937
199193
199449
199705
199961
200217
200473
200985
201241
201497
201753
202009
202265
202521
202777
203033
203289
203545
203801
204057
204313
204569
197914
198170
198426
198938
199194
199450
199706
200218
200474
200986
201242
201498
201754
202010
202266
202522
202778
203034
203546
203802
204058
204314
204570
197915
198427
198683
198939
199195
199451
199707
199963
200219
200475
200731
200987
201243
201499
201755
202011
202267
202523
202779
203035
203291
203547
203803
204059
204315
204571
197916
198172
198428
198684
198940
199196
199452
199708
199964
200476
200732
200988
201500
202012
202268
202524
202780
203036
203548
203804
204060
204316
204572
197917
198173
198429
198685
198941
199197
199709
200221
200989
201245
201501
202013
202269
202525
202781
203293
203549
203805
204061
204317
204573
197918
198430
198686
198942
199454
199710
199966
200222
200734
201502
201758
202014
202270
202526
202782
203294
203550
203806
204062
204318
204574
197919
198687
198943
199199
199455
199711
200223
200479
200991
201247
202015
202271
202783
203295
203551
203807
204063
204319
204575
198176
198432
198688
198944
199200
199456
199712
200224
200480
200736
201504
201760
202016
202272
202784
203296
203552
203808
204064
204320
204576
197921
198177
198689
198945
199201
199457
199713
199969
200993
201249
201505
202017
202785
203297
203553
203809
204065
204321
204577
200994
201251
202531
202240
202496
210688
210944
218112
218368
202335
202591
210783
211039
218207
218463
268300
268812
269068
269324
269580
269836
268303
268815
269071
269327
269583
269839
268304
268816
269072
269328
269584
269840
268308
268820
269076
269332
269588
269844
268309
268821
269077
269333
269589
269845
268310
268822
269078
269334
269590
269846
268311
268823
269079
269335
269591
269847
268312
268824
269080
269336
269592
269848
268313
268825
269081
269337
269593
269849
268314
268826
269082
269338
269594
269850
268315
268827
269083
269339
269595
269851
268316
268828
269084
269340
269596
269852
268317
268829
269085
269341
269597
269853
268318
268830
269086
269342
269598
269854
268319
268831
269087
269343
269599
269855
268320
268832
269088
269344
269600
269856
267776
268032
276224
276480
283648
283904
267871
268127
276319
276575
283743
283999
332800
333056
332801
333057
335370
335626
335371
335627
335372
335628
335373
335629
335374
335630
335375
335631
335376
335632
335377
335633
335378
335634
335379
335635
335380
335636
335381
335637
335382
335638
335383
335639
335384
335640
335385
335641
335386
335642
328219
335387
335643
335388
335644
335389
335645
335390
335646
335391
335647
335392
335648
335393
335649
333312
333568
341760
342016
349184
349440
333407
333663
341855
342111
349279
349535
399370
399882
400138
400394
400650
400906
401162
399371
399883
400139
400395
400651
400907
401163
399372
399884
400140
400396
400652
400908
401164
399373
399885
400141
400397
400653
400909
401165
399374
399886
400142
400398
400654
400910
401166
399375
399887
400143
400399
400655
400911
401167
399376
399888
400144
400400
400656
400912
401168
399377
399889
400145
400401
400657
400913
401169
399378
399890
400146
400402
400658
400914
401170
399379
399891
400147
400403
400659
400915
401171
399380
399892
400148
400404
400660
400916
401172
399381
399893
400149
400405
400661
400917
401173
399382
399894
400150
400406
400662
400918
401174
399383
399895
400151
400407
400663
400919
401175
399384
399896
400152
400408
400664
400920
401176
399385
399897
400153
400409
400665
400921
401177
399386
399898
400154
400410
400666
400922
401178
399387
399899
400155
400411
400667
400923
401179
399388
399900
400156
400412
400668
400924
401180
399389
399901
400157
400413
400669
400925
401181
399390
399902
400158
400414
400670
400926
401182
399391
399903
400159
400415
400671
400927
401183
399392
399904
400160
400416
400672
400928
401184
399393
399905
400161
400417
400673
400929
401185
398848
399104
407296
407552
414720
414976
398943
399199
407391
407647
414815
415071
465162
465418
465674
466186
466442
466698
465163
465419
465675
466187
466443
466699
465164
465420
465676
466188
466444
466700
465165
465421
465677
466189
466445
466701
465166
465422
465678
466190
466446
466702
465167
465423
465679
466191
466447
466703
465168
465424
465680
466192
466448
466704
465169
465425
465681
466193
466449
466705
465170
465426
465682
466194
466450
466706
465171
465427
465683
466195
466451
466707
465172
465428
465684
466196
466452
466708
465173
465429
465685
466197
466453
466709
465174
465430
465686
466198
466454
466710
465175
465431
465687
466199
466455
466711
465176
465432
465688
466200
466456
466712
465177
465433
465689
466201
466457
466713
465178
465434
465690
466202
466458
466714
465179
465435
465691
466203
466459
466715
465180
465436
465692
466204
466460
466716
465181
465437
465693
466205
466461
466717
465182
465438
465694
466206
466462
466718
465183
465439
465695
466207
466463
466719
465184
465440
465696
466208
466464
466720
465185
465441
465697
466209
466465
466721
464384
464640
472832
473088
480256
480512
464479
464735
472927
473183
480351
480607
530186
531466
531978
530187
531467
531979
530189
531469
531981
532237
530190
531470
531982
532238
530191
531471
531983
532239
530192
531472
531984
532240
530193
531473
531985
532241
530194
531474
531986
532242
530195
531475
531987
532243
530196
531476
531988
532244
530197
531477
531989
532245
530198
531478
531990
532246
530199
531479
531991
532247
530200
531480
531992
532248
530201
531481
531993
532249
530202
531482
531994
532250
530203
531483
531995
532251
530204
531484
531996
532252
530205
531485
531997
532253
530206
531486
531998
532254
530207
531487
531999
532255
530208
531488
532000
532256
530209
531489
532001
532257
529920
530176
538368
538624
545792
546048
530015
530271
538463
538719
545887
546143
595456
595722
596490
597002
597258
597514
595727
596495
597007
597263
597519
595733
596501
597013
597269
597525
597781
595734
596502
597014
597270
597526
597782
595735
596503
597015
597271
597527
597783
595736
596504
597016
597272
597528
597784
595737
596505
597017
597273
597529
597785
595738
596506
597018
597274
597530
597786
595739
596507
597019
597275
597531
597787
595740
596508
597020
597276
597532
597788
595741
596509
597021
597277
597533
597789
595742
596510
597022
597278
597534
597790
595743
596511
597023
597279
597535
597791
595744
596512
597024
597280
597536
597792
595745
596513
597025
597281
597537
597793
595456
595712
603904
604160
611328
611584
595551
595807
603999
604255
611423
611679
658192
658448
662032
662288
662800
663056
658193
658449
662033
662289
662801
663057
658194
658450
662034
662290
662802
663058
658195
658451
662035
662291
662803
663059
658196
658452
662036
662292
662804
663060
658197
658453
662037
662293
662805
663061
662038
662294
662806
663062
658199
658455
662039
662295
662807
663063
658200
658456
662040
662296
662808
663064
658201
658457
662041
662297
662809
663065
658202
658458
662042
662298
662810
663066
658203
658459
662043
662299
662811
663067
658204
662044
662300
662812
663068
658205
658461
662045
662301
662813
663069
658206
658462
662046
662302
662814
663070
658207
658463
662047
662303
662815
663071
658208
658464
662048
662304
662816
663072
660992
661248
669440
669696
676864
677120
661087
661343
669535
669791
676959
677215
727050
727051
727054
727055
727058
727059
727062
727063
727064
727066
727067
727068
727069
727070
728862
727071
728863
727072
728864
727073
726528
726784
734976
735232
742400
742656
726623
726879
735071
735327
742495
742751
792586
794122
792587
794123
792588
794124
792589
794125
792590
794126
792591
794127
792592
794128
792593
794129
792594
794130
792595
794131
792596
794132
792597
794133
792598
794134
792599
794135
792600
794136
792601
794137
792602
794138
792603
794139
792604
794140
792605
794141
792606
794142
792607
794143
792608
794144
792609
794145
792064
792320
800512
800768
807936
808192
792159
792415
800607
800863
808031
808287
856586
857610
858122
859914
856587
857611
858123
859915
856588
857612
858124
859916
856589
857613
858125
859917
856590
857614
858126
859918
856591
857615
858127
859919
856592
857616
858128
859920
856593
857617
858129
859921
856594
857618
858130
859922
856595
857619
858131
859923
856596
857620
858132
859924
856597
857621
858133
859925
856598
857622
858134
859926
856599
857623
858135
859927
856600
857624
858136
859928
856601
857625
858137
859929
856602
857626
858138
859930
856603
857627
858139
859931
856604
857628
858140
859932
856605
857629
858141
859933
856606
857630
858142
859934
856607
857631
858143
859935
856608
857632
858144
859936
857600
857856
866048
866304
873472
873728
857695
857951
866143
866399
873567
873823
924684
924940
925196
925452
924685
924941
925197
925453
924686
924942
925198
925454
924687
924943
925199
925455
924688
924944
925200
925456
924689
924945
925201
925457
924690
924946
925202
925458
924691
924947
925203
925459
924692
924948
925204
925460
924693
924949
925205
925461
924694
924950
925206
925462
924695
924951
925207
925463
924696
924952
925208
925464
924697
924953
925209
925465
924698
924954
925210
925466
924699
924955
925211
925467
924700
924956
925212
925468
924701
924957
925213
925469
924702
924958
925214
925470
924703
924959
925215
925471
924704
924960
925216
925472
923136
923392
931584
931840
939008
939264
923231
923487
931679
931935
939103
939359
989705
989961
990217
990473
990729
989706
989962
990218
990474
990730
989707
989963
990219
990475
990731
989712
989968
990224
990480
990736
990992
989713
989969
990225
990481
990737
990993
989714
989970
990226
990482
990738
990994
989715
989971
990227
990483
990739
990995
989716
989972
990228
990484
990740
990996
989717
989973
990229
990485
990741
990997
989718
989974
990230
990486
990742
990998
989719
989975
990231
990487
990743
990999
989720
989976
990232
990488
990744
991000
989721
989977
990233
990489
990745
991001
989722
989978
990234
990490
990746
991002
989723
989979
990235
990491
990747
991003
989724
989980
990236
990492
990748
991004
989725
989981
990237
990493
990749
991005
989726
989982
990238
990494
990750
991006
989727
989983
990239
990495
990751
991007
989728
989984
990240
990496
990752
991008
988672
988928
997120
997376
1004544
1004800
988767
989023
997215
997471
1004639
1004895
1056266
1056267
1056268
1056269
1056270
1056271
1056272
1056273
1056274
1056275
1056276
1056277
1056278
1056279
1056280
1056281
1056282
1056283
1056284
1056285
1056541
1056286
1056542
1056287
1056543
1056288
1056544
1054208
1054464
1062656
1062912
1070080
1070336
1054303
1054559
1062751
1063007
1070175
1070431
1115146
1115147
1115148
1115149
1115150
1115152
1115153
1115154
1115155
1115156
1115157
1115158
1115159
1115160
1115161
1115162
1115163
1115164
1115165
1115166
1115167
1115168
1119744
1120000
1128192
1128448
1135616
1135872
1119839
1120095
1128287
1128543
1135711
1135967
1184768
1184769
1187337
1187339
1187344
1187345
1187347
1187603
1187348
1187604
1187349
1187605
1187350
1187606
1187351
1187607
1187352
1187608
1187353
1187609
1187354
1187610
1187355
1187611
1187356
1187612
1187357
1187613
1187358
1187614
1187359
1187615
1187360
1187616
1185280
1185536
1193728
1193984
1201152
1201408
1185375
1185631
1193823
1194079
1201247
1201503
1252371
1252627
1252883
1252374
1252630
1252886
1253142
1252375
1252631
1252887
1253143
1252376
1252632
1252888
1253144
1252377
1252633
1252889
1253145
1252378
1252634
1252890
1253146
1252379
1252635
1252891
1253147
1252380
1252636
1252892
1253148
1252381
1252637
1252893
1253149
1252382
1252638
1252894
1253150
1252383
1252639
1252895
1253151
1252384
1252640
1252896
1253152
1250816
1251072
1259264
1259520
1266688
1266944
1250911
1251167
1259359
1259615
1266783
1267039
1317898
1318410
1318666
1317899
1318411
1318667
1317900
1318412
1318668
1317901
1318413
1318669
1317902
1318414
1318670
1317903
1318415
1318671
1317904
1318416
1318672
1317905
1318417
1318673
1317906
1318418
1318674
1317907
1318419
1318675
1317908
1318420
1318676
1317909
1318421
1318677
1317910
1318422
1318678
1317911
1318423
1318679
1317912
1318424
1318680
1317913
1318425
1318681
1317914
1318426
1318682
1317915
1318427
1318683
1317916
1318428
1318684
1317917
1318429
1318685
1317918
1318430
1318686
1317919
1318431
1318687
1317920
1318432
1318688
1317921
1318433
1318689
1316352
1316608
1324800
1325056
1332224
1332480
1316447
1316703
1324895
1325151
1332319
1332575
1380879
1383439
1383695
1383951
1379347
1383443
1383699
1383955
1379348
1380884
1383444
1383700
1383956
1384212
1379349
1380885
1383445
1383701
1383957
1384213
1379350
1380886
1383446
1383702
1383958
1384214
1379351
1380887
1383447
1383703
1383959
1384215
1379352
1380888
1383448
1383704
1383960
1384216
1379353
1380889
1383449
1383705
1383961
1384217
1379354
1380890
1383450
1383706
1383962
1384218
1379355
1380891
1383451
1383707
1383963
1384219
1379356
1380892
1383452
1383708
1383964
1384220
1379357
1380893
1383453
1383709
1383965
1384221
1379358
1380894
1383454
1383710
1383966
1384222
1379359
1380895
1383455
1383711
1383967
1384223
1379360
1380896
1383456
1383712
1383968
1384224
1379361
1380897
1383457
1383713
1383969
1384225
1381888
1382144
1390336
1390592
1397760
1398016
1381983
1382239
1390431
1390687
1397855
1398111
1448970
1449482
1448971
1449483
1448972
1449484
1448973
1449485
1448974
1449486
1448975
1449487
1448976
1449488
1448977
1449489
1448978
1449490
1448979
1449491
1448980
1449492
1448981
1449493
1448982
1449494
1448983
1449495
1448984
1449496
1448985
1449497
1448986
1449498
1448987
1449499
1449755
1448988
1449500
1449756
1448989
1449501
1449757
1448990
1449502
1449758
1448991
1449503
1449759
1448992
1449504
1449760
1448993
1449505
1449761
1447424
1447680
1455872
1456128
1463296
1463552
1447519
1447775
1455967
1456223
1463391
1463647
1512704
1512705
1512457
1515017
1512458
1515018
1512459
1515019
1512461
1515021
1515277
1512462
1515022
1515278
1512463
1515023
1515279
1512464
1515024
1512465
1515025
1512466
1515026
1512467
1515027
1512468
1515028
1515284
1512469
1515029
1515285
1512470
1515030
1515286
1507863
1512471
1515031
1515287
1512472
1515032
1515288
1512473
1515033
1515289
1512474
1515034
1512475
1515035
1512476
1515036
1512477
1515037
1512478
1515038
1512479
1515039
1512480
1515040
1512960
1513216
1521408
1521664
1528832
1529088
1513055
1513311
1521503
1521759
1528927
1529183
1580556
1580557
1580558
1580560
1580561
1580562
1580563
1580564
1580565
1580566
1580567
1580568
1580569
1580570
1580571
1580572
1580573
1580574
1580575
1580576
1578496
1578752
1586944
1587200
1594368
1594624
1578591
1578847
1587039
1587295
1594463
1594719
1646091
1646093
1646094
1646095
1646096
1646097
1646098
1646099
1646100
1646101
1646102
1646103
1646104
1646105
1646106
1646107
1646108
1646109
1646110
1646111
1646112
1646113
1644032
1644288
1652480
1652736
1659904
1660160
1644127
1644383
1652575
1652831
1659999
1660255
1711117
1711629
1711118
1711630
1711120
1711632
1711888
1711121
1711633
1711889
1711122
1711634
1711890
1711123
1711635
1711891
1711124
1711636
1711892
1711125
1711637
1711893
1711126
1711638
1711894
1711127
1711639
1711895
1711128
1711640
1711896
1711129
1711641
1711897
1711130
1711642
1711898
1711131
1711643
1711899
1711132
1711644
1711900
1711133
1711645
1711901
1711134
1711646
1711902
1711135
1711647
1711903
1711136
1711648
1711904
1711137
1711649
1711905
1709568
1709824
1718016
1718272
1725440
1725696
1709663
1709919
1718111
1718367
1725535
1725791
1777430
1777431
1777432
1777433
1777434
1777435
1777436
1777437
1777438
1777439
1777440
1775104
1775360
1783552
1783808
1790976
1791232
1775199
1775455
1783647
1783903
1791071
1791327
1838858
1838859
1838860
1838861
1838863
1838864
1838865
1838866
1838867
1838868
1838872
1838873
1838874
1838875
1838876
1838877
1838878
1838879
1838880
1840640
1840896
1849088
1849344
1856512
1856768
1840735
1840991
1849183
1849439
1856607
1856863
1908237
1908238
1908239
1908240
1908241
1908243
1908244
1908245
1908246
1908247
1908248
1908249
1908250
1908251
1908252
1908253
1908254
1908255
1908256
1906176
1906432
1914624
1914880
1922048
1922304
1906271
1906527
1914719
1914975
1922143
1922399
1973783
1973784
1973785
1973786
1973787
1973788
1973789
1973790
1973791
1973792
1973793
1971712
1971968
1980160
1980416
1987584
1987840
1971807
1972063
1980255
1980511
1987679
1987935
2037005
2039053
2039309
2037006
2039054
2039310
2037007
2039055
2039311
2037008
2039056
2039312
2037009
2039057
2039313
2037010
2039058
2039314
2037011
2039059
2039315
2037012
2039060
2039316
2037013
2039061
2039317
2037014
2039062
2039318
2037015
2039063
2039319
2037016
2039064
2039320
2037017
2039065
2039321
2037018
2039066
2039322
2037019
2039067
2039323
2037020
2039068
2039324
2037021
2039069
2039325
2039070
2039326
2037023
2039071
2039327
2037024
2039072
2039328
2037025
2039073
2039329
2037248
2037504
2045696
2045952
2053120
2053376
2037343
2037599
2045791
2046047
2053215
2053471
2102272
2102528
2102273
2102529
2102784
2103040
2111232
2111488
2118656
2118912
2102879
2103135
2111327
2111583
2118751
2119007
2170378
2170379
2170380
2170381
2170387
2170388
2170389
2170390
2170391
2170392
2170393
2170395
2170396
2170397
2170398
2170399
2170400
2170401
2168320
2168576
2176768
2177024
2184192
2184448
2168415
2168671
2176863
2177119
2184287
2184543
2230025
2230026
2230027
2230028
2230029
2230030
2230031
2230032
2230288
2230544
2230800
2231056
2231312
2231568
2231824
2232080
2230033
2230289
2230545
2230801
2231057
2231313
2231569
2231825
2232081
2230290
2230546
2230802
2231058
2231314
2231570
2231826
2232082
2230035
2230291
2230547
2230803
2231059
2231315
2231571
2231827
2232083
2230036
2230292
2230548
2230804
2231060
2231316
2231572
2231828
2232084
2230037
2230293
2230549
2230805
2231061
2231317
2231573
2231829
2232085
2230038
2230294
2230550
2230806
2231062
2231318
2231574
2231830
2232086
2230039
2230295
2230551
2230807
2231063
2231319
2231575
2231831
2232087
2230040
2230296
2230552
2230808
2231064
2231320
2231576
2231832
2232088
2230041
2230297
2230553
2230809
2231065
2231321
2231577
2231833
2232089
2230042
2230298
2230554
2230810
2231066
2231322
2231578
2231834
2232090
2230043
2230299
2230555
2230811
2231067
2231323
2231579
2231835
2232091
2230044
2230300
2230556
2230812
2231068
2231324
2231580
2231836
2232092
2230045
2230301
2230557
2230813
2231069
2231325
2231581
2231837
2232093
2230046
2230302
2230558
2230814
2231070
2231326
2231582
2231838
2232094
2230047
2230303
2230559
2230815
2231071
2231327
2231583
2231839
2232095
2230048
2230304
2230560
2230816
2231072
2231328
2231584
2231840
2232096
2233856
2234112
2242304
2242560
2249728
2249984
2233951
2234207
2242399
2242655
2249823
2250079
2299136
2299137
2301450
2301452
2301453
2301454
2301455
2301456
2301457
2301458
2301459
2301460
2301461
2301462
2301463
2301464
2301465
2301466
2301467
2301468
2301469
2301470
2301471
2301472
2299392
2299648
2307840
2308096
2315264
2315520
2299487
2299743
2307935
2308191
2315359
2315615
2364673
2366219
2366987
2366222
2366990
2366224
2366992
2366225
2366993
2366226
2366994
2366227
2366995
2366228
2366996
2366229
2366997
2366230
2366998
2366231
2366999
2366232
2367000
2366233
2367001
2366234
2367002
2366235
2367003
2366236
2367004
2366237
2367005
2366238
2367006
2366239
2367007
2366240
2367008
2366241
2367009
2364928
2365184
2373376
2373632
2380800
2381056
2365023
2365279
2373471
2373727
2380895
2381151
2430464
2430720
2438912
2439168
2446336
2446592
2430559
2430815
2439007
2439263
2446431
2446687
2497549
2498061
2497550
2498062
2497551
2498063
2497552
2498064
2497553
2498065
2497554
2498066
2497555
2498067
2497556
2498068
2497557
2498069
2497558
2498070
2497559
2498071
2497560
2498072
2497561
2498073
2497562
2498074
2497563
2498075
2497564
2498076
2497565
2498077
2497566
2498078
2497567
2498079
2497568
2498080
2497569
2498081
2496000
2496256
2504448
2504704
2511872
2512128
2496095
2496351
2504543
2504799
2511967
2512223
2560528
2563088
2563344
2560530
2563090
2563346
2560531
2563091
2563347
2560532
2563092
2563348
2560533
2563093
2563349
2560534
2563094
2563350
2560535
2563095
2563351
2560536
2563096
2563352
2560538
2563098
2563354
2560539
2563099
2563355
2560540
2563100
2563356
2560541
2563101
2563357
2560542
2563102
2563358
2560543
2563103
2563359
2560544
2563104
2563360
2561536
2561792
2569984
2570240
2577408
2577664
2561631
2561887
2570079
2570335
2577503
2577759
2629130
2629131
2629132
2629133
2629134
2629135
2629136
2629137
2629138
2629139
2629140
2629141
2629142
2629143
2629144
2629145
2629146
2629147
2629148
2629149
2629150
2629151
2629152
2627072
2627328
2635520
2635776
2642944
2643200
2627167
2627423
2635615
2635871
2643039
2643295
2691594
2691850
2692874
2694154
2688523
2689803
2691596
2691852
2692876
2694156
2688526
2689806
2691598
2691854
2692878
2694158
2688527
2689807
2691599
2691855
2692879
2694159
2691600
2691856
2692880
2694160
2689809
2691601
2691857
2692881
2694161
2689810
2691602
2691858
2692882
2694162
2689811
2691603
2691859
2692883
2694163
2691604
2691860
2692884
2694164
2688533
2689814
2691606
2691862
2692886
2694166
2688535
2689815
2691607
2691863
2692887
2694167
2691608
2691864
2692888
2694168
2688537
2691609
2691865
2692889
2694169
2688538
2689818
2691611
2691867
2692891
2694171
2688541
2688542
2689822
2688543
2689823
2691615
2691871
2692895
2694175
2688544
2688545
2691873
2692897
2688546
2693667
2692608
2692864
2701056
2701312
2708480
2708736
2692703
2692959
2701151
2701407
2708575
2708831
2758144
2758400
2757386
2757642
2759946
2759948
2757389
2757645
2759949
2757390
2757646
2759950
2757391
2757647
2759951
2757392
2757648
2759952
2757393
2757649
2759953
2757394
2757650
2759954
2757395
2757651
2759955
2757396
2757652
2759956
2757397
2757653
2759957
2757398
2757654
2759958
2757399
2757655
2759959
2757400
2757656
2759960
2757401
2757657
2759961
2757402
2757658
2759962
2757403
2757659
2759963
2757404
2757660
2759964
2757405
2757661
2759965
2757406
2757662
2759966
2757407
2757663
2759967
2757408
2757664
2759968
2758144
2758400
2766592
2766848
2774016
2774272
2758239
2758495
2766687
2766943
2774111
2774367
2821644
2824716
2821649
2824721
2821651
2824723
2821652
2824724
2821654
2824726
2821655
2824727
2821656
2824728
2821657
2824729
2821658
2824730
2821659
2824731
2821660
2824732
2821661
2824733
2821662
2824734
2821663
2824735
2821664
2824736
2821665
2824737
2823680
2823936
2832128
2832384
2839552
2839808
2823775
2824031
2832223
2832479
2839647
2839903
2887177
2891017
2891273
2887179
2891019
2891275
2887180
2891020
2891276
2887181
2891021
2891277
2887182
2891022
2891278
2887183
2891023
2891279
2887184
2891024
2891280
2887186
2891026
2891282
2887187
2891027
2891283
2887188
2891028
2891284
2887189
2891029
2891285
2887190
2891030
2891286
2887192
2891032
2891288
2887193
2891033
2891289
2887194
2891034
2891290
2887195
2891035
2891291
2887196
2891036
2891292
2887197
2891037
2891293
2887198
2891038
2891294
2887199
2891039
2891295
2887200
2891040
2891296
2889216
2889472
2897664
2897920
2905088
2905344
2889311
2889567
2897759
2898015
2905183
2905439
2956815
2956816
2956820
2956821
2956823
2956824
2956825
2956826
2956827
2956828
2956829
2956830
2956831
2956832
2954752
2955008
2963200
2963456
2970624
2970880
2954847
2955103
2963295
2963551
2970719
2970975
3016200
3016201
3016202
3018762
3019274
3019530
3016203
3018763
3019275
3019531
3016204
3016205
3016206
3016718
3016974
3018766
3019278
3019534
3016207
3016208
3016720
3016976
3018768
3019280
3019536
3016209
3016721
3016977
3018769
3019281
3019537
3016210
3016722
3016978
3018770
3019282
3019538
3016211
3016723
3016979
3018771
3019283
3019539
3016213
3016725
3016981
3018773
3019285
3019541
3016216
3016728
3016984
3018776
3019288
3019544
3016218
3016730
3016986
3018778
3019290
3019546
3016219
3016731
3016987
3018779
3019291
3019547
3016223
3016735
3016991
3018783
3019295
3019551
3016224
3020288
3020544
3028736
3028992
3036160
3036416
3020383
3020639
3028831
3029087
3036255
3036511
3084041
3084042
3084043
3084044
3084045
3084046
3084047
3084049
3084050
3084051
3084054
3084055
3084056
3084057
3084058
3084059
3084060
3084061
3084062
3084063
3084064
3085824
3086080
3094272
3094528
3101696
3101952
3085919
3086175
3094367
3094623
3101791
3102047
3147529
3148041
3148297
3149321
3149577
3151113
3152905
3153161
3147530
3148042
3148298
3149322
3149578
3151114
3152906
3153162
3147531
3148043
3148299
3149323
3149579
3151115
3152907
3153163
3147532
3148044
3148300
3149324
3149580
3151116
3152908
3153164
3147533
3148045
3148301
3149325
3149581
3151117
3152909
3153165
3147534
3148046
3148302
3149326
3149582
3151118
3152910
3153166
3147535
3148047
3148303
3149327
3149583
3151119
3152911
3153167
3147536
3148048
3148304
3149328
3149584
3151120
3152912
3153168
3147537
3148049
3148305
3149329
3149585
3151121
3152913
3153169
3147538
3148050
3148306
3149330
3149586
3151122
3152914
3153170
3147539
3148051
3148307
3149331
3149587
3151123
3152915
3153171
3147540
3148052
3148308
3149588
3151124
3152916
3153172
3147541
3148053
3148309
3149333
3149589
3151125
3152917
3153173
3147542
3148054
3148310
3149334
3149590
3151126
3152918
3153174
3147543
3148055
3148311
3149335
3149591
3151127
3152919
3153175
3147544
3148056
3148312
3149336
3149592
3151128
3152920
3153176
3147545
3148057
3148313
3149337
3149593
3151129
3152921
3153177
3147546
3148058
3148314
3149338
3149594
3151130
3152922
3153178
3147547
3148059
3148315
3149339
3149595
3151131
3152923
3153179
3147548
3148060
3148316
3149340
3149596
3151132
3152924
3153180
3147549
3148061
3148317
3149341
3149597
3151133
3152925
3153181
3147550
3148062
3148318
3149342
3149598
3151134
3152926
3153182
3147551
3148063
3148319
3149343
3149599
3151135
3152927
3153183
3147552
3148064
3148320
3149344
3149600
3151136
3152928
3153184
3151360
3151616
3159808
3160064
3167232
3167488
3151455
3151711
3159903
3160159
3167327
3167583
3213325
3213581
3213837
3214093
3214349
3214605
3214861
3215117
3215885
3216397
3216653
3217933
3218701
3218957
3213326
3213582
3213838
3214094
3214350
3214606
3214862
3215118
3215886
3216398
3216654
3217934
3218702
3218958
3213327
3213583
3213839
3214095
3214351
3214607
3214863
3215119
3215887
3216399
3216655
3217935
3218703
3218959
3213329
3213585
3213841
3214097
3214353
3214609
3214865
3215121
3215889
3216401
3216657
3217937
3218705
3218961
3213330
3213586
3213842
3214098
3214354
3214610
3214866
3215122
3215890
3216402
3216658
3217938
3218706
3218962
3213331
3213587
3213843
3214099
3214355
3214611
3214867
3215123
3215891
3216403
3216659
3217939
3218707
3218963
3213332
3213588
3213844
3214100
3214356
3214612
3214868
3215124
3215892
3216404
3216660
3217940
3218708
3218964
3213333
3213589
3213845
3214101
3214357
3214613
3214869
3215125
3215893
3216405
3216661
3217941
3218709
3218965
3213334
3213590
3213846
3214102
3214358
3214614
3214870
3215126
3215894
3216406
3216662
3217942
3218710
3218966
3213336
3213592
3213848
3214104
3214360
3214616
3214872
3215128
3215896
3216408
3216664
3217944
3218712
3218968
3213337
3213593
3213849
3214105
3214361
3214617
3214873
3215129
3215897
3216409
3216665
3217945
3218713
3218969
3213338
3213594
3213850
3214106
3214362
3214618
3214874
3215130
3215898
3216410
3216666
3217946
3218714
3218970
3213339
3213595
3213851
3214107
3214363
3214619
3214875
3215131
3215899
3216411
3216667
3217947
3218715
3218971
3213340
3213596
3213852
3214108
3214364
3214620
3214876
3215132
3215900
3216412
3216668
3217948
3218716
3218972
3213341
3213597
3213853
3214109
3214365
3214621
3214877
3215133
3215901
3216413
3216669
3217949
3218717
3218973
3213342
3213598
3213854
3214110
3214366
3214622
3214878
3215134
3215902
3216414
3216670
3217950
3218718
3218974
3213343
3213599
3213855
3214111
3214367
3214623
3214879
3215135
3215903
3216415
3216671
3217951
3218719
3218975
3213344
3213600
3213856
3214112
3214368
3214624
3214880
3215136
3215904
3216416
3216672
3217952
3218720
3218976
3216896
3217152
3225344
3225600
3232768
3233024
3216991
3217247
3225439
3225695
3232863
3233119
3277577
3278345
3278601
3279369
3279881
3280137
3280649
3280905
3281417
3281673
3282697
3282953
3283209
3283465
3283977
3284233
3277578
3278346
3278602
3279370
3279882
3280138
3280650
3280906
3281418
3281674
3282698
3282954
3283210
3283466
3283978
3284234
3277579
3278347
3278603
3279371
3279883
3280139
3280651
3280907
3281419
3281675
3282699
3282955
3283211
3283467
3283979
3284235
3277580
3278348
3278604
3279372
3279884
3280140
3280652
3280908
3281420
3281676
3282700
3282956
3283212
3283468
3283980
3284236
3277581
3278349
3278605
3279373
3279885
3280141
3280653
3280909
3281421
3281677
3282701
3282957
3283213
3283469
3283981
3284237
3277582
3278350
3278606
3279374
3279886
3280142
3280654
3280910
3281422
3281678
3282702
3282958
3283214
3283470
3283982
3284238
3277583
3278351
3278607
3279375
3279887
3280143
3280655
3280911
3281423
3281679
3282703
3282959
3283215
3283471
3283983
3284239
3277584
3278352
3278608
3279376
3279888
3280144
3280656
3280912
3281424
3281680
3282704
3282960
3283216
3283472
3283984
3284240
3277585
3278353
3278609
3279377
3279889
3280145
3280657
3280913
3281425
3281681
3282705
3282961
3283217
3283473
3283985
3284241
3277586
3278354
3278610
3279378
3279890
3280146
3280658
3280914
3281426
3281682
3282706
3282962
3283218
3283474
3283986
3284242
3277587
3278355
3278611
3279379
3279891
3280147
3280659
3280915
3281427
3281683
3282707
3282963
3283219
3283475
3283987
3284243
3277588
3278356
3278612
3279380
3279892
3280148
3280660
3280916
3281428
3281684
3282708
3282964
3283220
3283476
3283988
3284244
3277590
3278358
3278614
3279382
3279894
3280150
3280662
3280918
3281430
3281686
3282710
3282966
3283222
3283478
3283990
3284246
3277591
3278359
3278615
3279383
3279895
3280151
3280663
3280919
3281431
3281687
3282711
3282967
3283223
3283479
3283991
3284247
3277592
3278360
3278616
3279384
3279896
3280152
3280664
3280920
3281432
3281688
3282712
3282968
3283224
3283480
3283992
3284248
3277593
3278361
3278617
3279385
3279897
3280153
3280665
3280921
3281433
3281689
3282713
3282969
3283225
3283481
3283993
3284249
3277594
3278362
3278618
3279386
3279898
3280154
3280666
3280922
3281434
3281690
3282714
3282970
3283226
3283482
3283994
3284250
3277595
3278363
3278619
3279387
3279899
3280155
3280667
3280923
3281435
3281691
3282715
3282971
3283227
3283483
3283995
3284251
3277596
3278364
3278620
3279388
3279900
3280156
3280668
3280924
3281436
3281692
3282716
3282972
3283228
3283484
3283996
3284252
3277597
3278365
3278621
3279389
3279901
3280157
3280669
3280925
3281437
3281693
3282717
3282973
3283229
3283485
3283997
3284253
3277598
3278366
3278622
3279390
3279902
3280158
3280670
3280926
3281438
3281694
3282718
3282974
3283230
3283486
3283998
3284254
3277599
3278367
3278623
3279391
3279903
3280159
3280671
3280927
3281439
3281695
3282719
3282975
3283231
3283487
3283999
3284255
3277600
3278368
3278624
3279392
3279904
3280160
3280672
3280928
3281440
3281696
3282720
3282976
3283232
3283488
3284000
3284256
3282432
3282688
3290880
3291136
3298304
3298560
3282527
3282783
3290975
3291231
3298399
3298655
3347457
3343112
3344136
3344392
3345672
3346184
3346952
3348488
3348744
3349000
3349512
3349768
3350024
3343118
3344142
3344398
3345678
3346190
3346958
3348494
3348750
3349006
3349518
3349774
3350030
3343119
3344143
3344399
3345679
3346191
3346959
3348495
3348751
3349007
3349519
3349775
3350031
3343120
3344144
3344400
3345680
3346192
3346960
3348496
3348752
3349008
3349520
3349776
3350032
3343121
3344145
3344401
3345681
3346193
3346961
3348497
3348753
3349009
3349521
3349777
3350033
3343123
3344147
3344403
3345683
3346195
3346963
3348499
3348755
3349011
3349523
3349779
3350035
3343124
3344148
3344404
3345684
3346196
3346964
3348500
3348756
3349012
3349524
3349780
3350036
3343125
3344149
3344405
3345685
3346197
3346965
3348501
3348757
3349013
3349525
3349781
3350037
3343126
3344150
3344406
3345686
3346198
3346966
3348502
3348758
3349014
3349526
3349782
3350038
3343127
3344151
3344407
3345687
3346199
3346967
3348503
3348759
3349015
3349527
3349783
3350039
3343128
3344152
3344408
3345688
3346200
3346968
3348504
3348760
3349016
3349528
3349784
3350040
3343129
3344153
3344409
3345689
3346201
3346969
3348505
3348761
3349017
3349529
3349785
3350041
3343130
3344154
3344410
3345690
3346202
3346970
3348506
3348762
3349018
3349530
3349786
3350042
3343131
3344155
3344411
3345691
3346203
3346971
3348507
3348763
3349019
3349531
3349787
3350043
3343132
3344156
3344412
3345692
3346204
3346972
3348508
3348764
3349020
3349532
3349788
3350044
3343133
3344157
3344413
3345693
3346205
3346973
3348509
3348765
3349021
3349533
3349789
3350045
3343134
3344158
3344414
3345694
3346206
3346974
3348510
3348766
3349022
3349534
3349790
3350046
3343135
3344159
3344415
3345695
3346207
3346975
3348511
3348767
3349023
3349535
3349791
3350047
3343136
3344160
3344416
3345696
3346208
3346976
3348512
3348768
3349024
3349536
3349792
3350048
3347968
3348224
3356416
3356672
3363840
3364096
3348063
3348319
3356511
3356767
3363935
3364191
3408653
3409933
3410189
3411725
3413005
3413773
3414029
3414797
3415053
3415309
3415565
3408654
3409934
3410190
3411726
3413006
3413774
3414030
3414798
3415054
3415310
3415566
3408655
3409935
3410191
3411727
3413007
3413775
3414031
3414799
3415055
3415311
3415567
3408656
3409936
3410192
3411728
3413008
3413776
3414032
3414800
3415056
3415312
3415568
3408657
3409937
3410193
3411729
3413009
3413777
3414033
3414801
3415057
3415313
3415569
3408658
3409938
3410194
3411730
3413010
3413778
3414034
3414802
3415058
3415314
3415570
3408659
3409939
3410195
3411731
3413011
3413779
3414035
3414803
3415059
3415315
3415571
3408660
3409940
3410196
3411732
3413012
3413780
3414036
3414804
3415060
3415316
3415572
3408661
3409941
3410197
3411733
3413013
3413781
3414037
3414805
3415061
3415317
3415573
3408662
3409942
3410198
3411734
3413014
3413782
3414038
3414806
3415062
3415318
3415574
3408663
3409943
3410199
3411735
3413015
3413783
3414039
3414807
3415063
3415319
3415575
3408664
3409944
3410200
3411736
3413016
3413784
3414040
3414808
3415064
3415320
3415576
3408665
3409945
3410201
3411737
3413017
3413785
3414041
3414809
3415065
3415321
3415577
3408666
3409946
3410202
3411738
3413018
3413786
3414042
3414810
3415066
3415322
3415578
3408667
3409947
3410203
3411739
3413019
3413787
3414043
3414811
3415067
3415323
3415579
3408668
3409948
3410204
3411740
3413020
3413788
3414044
3414812
3415068
3415324
3415580
3408669
3409949
3410205
3411741
3413021
3413789
3414045
3414813
3415069
3415325
3415581
3408670
3409950
3410206
3411742
3413022
3413790
3414046
3414814
3415070
3415326
3415582
3408671
3409951
3410207
3411743
3413023
3413791
3414047
3414815
3415071
3415327
3415583
3408672
3409952
3410208
3411744
3413024
3413792
3414048
3414816
3415072
3415328
3415584
3413504
3413760
3421952
3422208
3429376
3429632
3413599
3413855
3422047
3422303
3429471
3429727
3479040
3479296
3487488
3487744
3494912
3495168
3479135
3479391
3487583
3487839
3495007
3495263
