140849
404025
603440
863040
931359
1128231
1129770
1259564
1387567
1522735
1584676
1583398
1583654
1583911
1585707
1653808
1846843
2762035
2764349
3029039
3029040
3090737
3089202
3090738
3090740
3089205
3090485
3090997
3089462
3090742
3090998
3091254
3092534
3089975
3090231
3091255
3091511
3092535
3090232
3091256
3094329
