140849
140594
210177
601135
1254434
1254690
1254182
1254185
1259564
1387567
1450287
1583136
1584160
1583394
1584162
1583139
1583651
1583907
1584419
1583396
1584676
1583398
1583654
1583911
1585707
1653808
1910309
2307100
2368303
2368304
2432810
2629680
2639920
2628155
2703152
2703154
2765851
2766108
2768681
2761264
2762035
2764349
2763070
2764606
2762822
2961432
2957353
2957355
2957611
2957357
2957613
2957358
2957359
2957615
2958127
2958383
3030312
3029039
3029040
3090737
3089202
3090738
3090740
3089205
3090485
3090997
3089462
3089974
3090742
3091254
3092022
3092534
3097398
3089719
3089975
3090231
3091255
3092535
3090232
3090488
3091256
3089465
3090233
3091769
3091258
3089467
3089468
3089982
3089983
3089730
