808960
809216
809472
809728
809984
810240
810496
810752
808961
809217
809473
809729
809985
810241
810497
810753
808962
809218
809474
809730
809986
810242
810498
810754
808963
809219
809475
809731
809987
810243
810499
810755
808964
809220
809476
809732
809988
810244
810500
810756
808965
809221
809477
809733
809989
810245
810501
810757
808966
809222
809478
809734
809990
810246
810502
810758
808967
809223
809479
809735
809991
810247
810503
810759
1579064
1579320
1579576
1579832
1580088
1580344
1580600
1580856
1579065
1579321
1579577
1579833
1580089
1580345
1580601
1580857
1579066
1579322
1579578
1579834
1580090
1580346
1580602
1580858
1579067
1579323
1579579
1579835
1580091
1580347
1580603
1580859
1579068
1579324
1579580
1579836
1580092
1580348
1580604
1580860
1579069
1579325
1579581
1579837
1580093
1580349
1580605
1580861
1579070
1579326
1579582
1579838
1580094
1580350
1580606
1580862
1579071
1579327
1579583
1579839
1580095
1580351
1580607
1580863
2639912
2640168
2640424
2640680
2640936
2641192
2641448
2641704
2639913
2640169
2640425
2640681
2640937
2641193
2641449
2641705
2639914
2640170
2640426
2640682
2640938
2641194
2641450
2641706
2639915
2640171
2640427
2640683
2640939
2641195
2641451
2641707
2639916
2640172
2640428
2640684
2640940
2641196
2641452
2641708
2639917
2640173
2640429
2640685
2640941
2641197
2641453
2641709
2639918
2640174
2640430
2640686
2640942
2641198
2641454
2641710
2639919
2640175
2640431
2640687
2640943
2641199
2641455
2641711
3276816
3277072
3277328
3277584
3277840
3278096
3278352
3278608
3276817
3277073
3277329
3277585
3277841
3278097
3278353
3278609
3276818
3277074
3277330
3277586
3277842
3278098
3278354
3278610
3276819
3277075
3277331
3277587
3277843
3278099
3278355
3278611
3276820
3277076
3277332
3277588
3277844
3278100
3278356
3278612
3276821
3277077
3277333
3277589
3277845
3278101
3278357
3278613
3276822
3277078
3277334
3277590
3277846
3278102
3278358
3278614
3276823
3277079
3277335
3277591
3277847
3278103
3278359
3278615
