206872
207128
207384
207640
207896
208152
208408
208664
206873
207129
207385
207641
207897
208153
208409
208665
206874
207130
207386
207642
207898
208154
208410
208666
206875
207131
207387
207643
207899
208155
208411
208667
206876
207132
207388
207644
207900
208156
208412
208668
206877
207133
207389
207645
207901
208157
208413
208669
206878
207134
207390
207646
207902
208158
208414
208670
206879
207135
207391
207647
207903
208159
208415
208671
473160
473416
473672
473928
474184
474440
474696
474952
473161
473417
473673
473929
474185
474441
474697
474953
473162
473418
473674
473930
474186
474442
474698
474954
473163
473419
473675
473931
474187
474443
474699
474955
473164
473420
473676
473932
474188
474444
474700
474956
473165
473421
473677
473933
474189
474445
474701
474957
473166
473422
473678
473934
474190
474446
474702
474958
473167
473423
473679
473935
474191
474447
474703
474959
542760
543016
543272
543528
543784
544040
544296
544552
542761
543017
543273
543529
543785
544041
544297
544553
542762
543018
543274
543530
543786
544042
544298
544554
542763
543019
543275
543531
543787
544043
544299
544555
542764
543020
543276
543532
543788
544044
544300
544556
542765
543021
543277
543533
543789
544045
544301
544557
542766
543022
543278
543534
543790
544046
544302
544558
542767
543023
543279
543535
543791
544047
544303
544559
2033712
2033968
2034224
2034480
2034736
2034992
2035248
2035504
2033713
2033969
2034225
2034481
2034737
2034993
2035249
2035505
2033714
2033970
2034226
2034482
2034738
2034994
2035250
2035506
2033715
2033971
2034227
2034483
2034739
2034995
2035251
2035507
2033716
2033972
2034228
2034484
2034740
2034996
2035252
2035508
2033717
2033973
2034229
2034485
2034741
2034997
2035253
2035509
2033718
2033974
2034230
2034486
2034742
2034998
2035254
2035510
2033719
2033975
2034231
2034487
2034743
2034999
2035255
2035511
3035184
3035440
3035696
3035952
3036208
3036464
3036720
3036976
3037232
3037488
3037744
3038000
3038256
3038512
3038768
3039024
3035185
3035441
3035697
3035953
3036209
3036465
3036721
3036977
3037233
3037489
3037745
3038001
3038257
3038513
3038769
3039025
3035186
3035442
3035698
3035954
3036210
3036466
3036722
3036978
3037234
3037490
3037746
3038002
3038258
3038514
3038770
3039026
3035187
3035443
3035699
3035955
3036211
3036467
3036723
3036979
3037235
3037491
3037747
3038003
3038259
3038515
3038771
3039027
3035188
3035444
3035700
3035956
3036212
3036468
3036724
3036980
3037236
3037492
3037748
3038004
3038260
3038516
3038772
3039028
3035189
3035445
3035701
3035957
3036213
3036469
3036725
3036981
3037237
3037493
3037749
3038005
3038261
3038517
3038773
3039029
3035190
3035446
3035702
3035958
3036214
3036470
3036726
3036982
3037238
3037494
3037750
3038006
3038262
3038518
3038774
3039030
3035191
3035447
3035703
3035959
3036215
3036471
3036727
3036983
3037239
3037495
3037751
3038007
3038263
3038519
3038775
3039031
3414064
3414320
3414576
3414832
3415088
3415344
3415600
3415856
3414065
3414321
3414577
3414833
3415089
3415345
3415601
3415857
3414066
3414322
3414578
3414834
3415090
3415346
3415602
3415858
3414067
3414323
3414579
3414835
3415091
3415347
3415603
3415859
3414068
3414324
3414580
3414836
3415092
3415348
3415604
3415860
3414069
3414325
3414581
3414837
3415093
3415349
3415605
3415861
3414070
3414326
3414582
3414838
3415094
3415350
3415606
3415862
3414071
3414327
3414583
3414839
3415095
3415351
3415607
3415863
