140849
140594
601135
863040
991786
1064752
1387567
1583136
1584160
1583394
1584162
1583139
1583651
1583907
1584419
1583396
1584676
1583398
1583654
1583911
1585707
1653808
1779751
1785401
1910309
2307100
2368303
2368304
2365233
2498356
2498101
2564399
2637871
2638127
2629680
2637872
2638128
2639920
2628155
2703152
2703154
2765851
2766108
2761264
2762035
2764349
2763070
2764606
2762822
2891576
2961432
2963224
2957357
2957613
2958127
2958383
3030312
3029039
3029040
3090737
3097137
3097393
3089202
3090738
3097394
3090740
3098164
3089205
3090485
3090997
3089974
3090742
3091254
3097398
3089719
3090232
3090233
3091769
3094329
3097401
3091258
3089467
3089468
3089982
3089983
3090496
3089730
3089986
3091267
3091523
3089220
3091013
3157569
