0 0 1.24999998137 0.800000011921 1.0
0 1 0.740090341295 0.911326706409 1.48265862465
0 2 0.636363650156 1.0 1.57142853737
1 0 0.71428572645 1.0 1.39999997616
1 1 0.658773579408 0.930380344391 1.63156092167
1 2 0.899999957085 0.777777791023 1.42857146263
2 0 0.8 1.0 1.25
2 1 0.692537238516 0.922536194324 1.56521308422
2 2 0.727272727273 1.0 1.375
3 0 0.749999977648 0.833333313465 1.60000002384
3 1 0.647860108194 0.910879015923 1.69456446171
3 2 0.727272727273 1.0 1.375
4 0 1.33333333333 0.75 1.0
4 1 0.747433401009 0.881628155708 1.51754653454
4 2 1.12499999162 0.777777791023 1.14285719395
5 0 0.83333330022 1.0 1.20000004768
5 1 0.659460919553 0.918164670467 1.65154469013
5 2 0.857142886337 1.0 1.16666662693
6 0 2.0 0.5 1.0
6 1 0.628695642529 0.911030709743 1.74592888355
6 2 0.888888888889 0.875 1.28571426868
7 0 0.666666666667 1.0 1.5
7 1 0.721072459951 0.865343153477 1.60262799263
7 2 0.666666666667 1.0 1.5
8 0 0.5 1.0 2.0
8 1 0.725083082898 0.884948432446 1.55845499039
8 2 1.0 0.714285731316 1.39999997616
9 0 1.0 1.0 1.0
9 1 0.750741872162 0.8876734972 1.50056958199
9 2 1.14285714286 0.625 1.39999997616
10 0 0.749999977648 1.0 1.33333337307
10 1 0.692460519899 0.90191257 1.60118150711
10 2 0.5 0.857142865658 2.33333325386
11 0 1.33333333333 0.75 1.0
11 1 0.687266959201 0.911659657955 1.59603273869
11 2 0.857142886337 0.5 2.33333325386
12 0 1.4999999553 0.666666686535 1.0
12 1 0.61122140991 0.942804694176 1.73532056808
12 2 1.0 0.833333313465 1.20000004768
13 0 0.666666666667 1.0 1.5
13 1 0.724525214725 0.910278081894 1.51625549793
13 2 0.83333330022 0.800000011921 1.5
14 0 0.600000014305 1.0 1.66666662693
14 1 0.74980737747 0.888805866241 1.50052547455
14 2 0.428571443168 0.833333313465 2.79999995232
15 0 1.0 0.75 1.33333337307
15 1 1.48618820355 0.549955010414 1.22348606586
15 2 0.545454533632 1.0 1.83333337307
16 0 0.8 0.75 1.66666662693
16 1 0.723237849808 0.907237052917 1.52404594421
16 2 0.749999977648 0.833333313465 1.60000002384
17 0 0.4 1.0 2.5
17 1 0.664318964029 0.931607365608 1.61581063271
17 2 1.0 1.0 1.0
18 0 0.600000014305 0.666666686535 2.5
18 1 0.632164835056 0.937617063522 1.68711292744
18 2 0.600000014305 1.0 1.66666662693
19 0 1.0 1.0 1.0
19 1 0.873844919186 0.833228766918 1.37341368198
19 2 1.0 1.0 1.0
20 0 2.0 0.5 1.0
20 1 0.689065193263 0.924153506756 1.57034683228
20 2 0.857142886337 1.0 1.16666662693
21 0 1.0 1.0 1.0
21 1 0.623767956103 0.938515841961 1.70818662643
21 2 0.857142886337 1.0 1.16666662693
22 0 1.0 1.0 1.0
22 1 0.777332016993 0.87254858017 1.47436094284
22 2 0.857142886337 0.833333313465 1.39999997616
23 0 1.0 1.0 1.0
23 1 0.65524026508 0.937221348286 1.62838554382
23 2 0.666666666667 1.0 1.5
24 0 1.0 0.0 0.0
24 1 0.67180623655 0.899747014046 1.65438115597
24 2 0.857142886337 1.0 1.16666662693
25 0 1.0 1.0 1.0
25 1 0.702126977508 0.938446640968 1.51766085625
25 2 0.749999977648 1.0 1.33333337307
26 0 1.0 0.5 2.0
26 1 0.9984826259 0.761185348034 1.31573688984
26 2 0.545454533632 1.0 1.83333337307
27 0 0.285714285714 1.0 3.5
27 1 0.688757529763 0.90711158514 1.60056352615
27 2 0.857142886337 0.833333313465 1.39999997616
28 0 2.0 0.5 1.0
28 1 0.768912943328 0.873515069485 1.48885500431
28 2 0.874999960884 0.857142865658 1.33333337307
29 0 0.666666666667 1.0 1.5
29 1 0.631490973262 0.954660654068 1.65876102448
29 2 0.8 0.875 1.42857146263
30 0 0.666666666667 1.0 1.5
30 1 0.64394571013 0.925116539001 1.67862737179
30 2 0.899999957085 0.888888895512 1.25
31 0 1.0 0.5 2.0
31 1 4.31000389969 0.191972479224 1.20860219002
31 2 0.899999957085 0.777777791023 1.42857146263
32 0 2.0 0.5 1.0
32 1 0.967563593548 0.664285719395 1.55584228039
32 2 0.888888888889 0.875 1.28571426868
33 0 1.0 1.0 1.0
33 1 0.52968231783 0.975370705128 1.93559634686
33 2 0.8 0.833333313465 1.5
34 0 0.5 1.0 2.0
34 1 0.714812521026 0.930278897285 1.50381600857
34 2 0.666666666667 0.833333313465 1.79999995232
35 0 1.0 1.0 1.0
35 1 0.714812338294 0.912790954113 1.53262746334
35 2 1.0 0.800000011921 1.25
36 0 0.5 0.666666686535 3.0
36 1 0.568969918947 0.954582154751 1.8411847353
36 2 0.71428572645 1.0 1.39999997616
37 0 0.333333333333 1.0 3.0
37 1 0.74623916228 0.90486240387 1.48094666004
37 2 1.0 0.666666686535 1.5
38 0 1.0 1.0 1.0
38 1 0.897384924448 0.796501338482 1.3990547657
38 2 1.57142859819 0.636363625526 1.0
39 0 1.0 1.0 1.0
39 1 0.676839446972 0.944815814495 1.56374943256
39 2 1.22222223032 0.727272748947 1.125
40 0 1.0 0.5 2.0
40 1 0.883792548003 0.82813757658 1.36630356312
40 2 0.785714299095 0.909090936184 1.39999997616
41 0 0.666666666667 1.0 1.5
41 1 0.648172225762 0.964318335056 1.59988641739
41 2 0.608695633245 1.0 1.64285719395
42 0 1.0 1.0 1.0
42 1 0.598524018887 0.947484493256 1.76338160038
42 2 0.736842133002 1.0 1.35714280605
43 0 1.0 1.0 1.0
43 1 0.695889472755 0.903123438358 1.59115552902
43 2 1.13333332433 0.529411792755 1.66666662693
44 0 0.666666666667 1.0 1.5
44 1 0.729694046535 0.88715004921 1.54476392269
44 2 0.666666666667 1.0 1.5
45 0 2.0 0.5 1.0
45 1 0.661223137885 0.925450801849 1.63417518139
45 2 0.684210539194 1.0 1.46153843403
46 0 2.0 0.5 1.0
46 1 0.719956153488 0.885628581047 1.56834757328
46 2 1.07692310655 0.785714268684 1.18181812763
47 0 1.0 1.0 1.0
47 1 0.937084811758 0.819154858589 1.30273211002
47 2 1.4999999553 0.600000023842 1.11111116409
48 0 1.0 1.0 1.0
48 1 0.571609593323 0.932292640209 1.87649857998
48 2 0.8 0.833333313465 1.5
49 0 1.4999999553 0.666666686535 1.0
49 1 0.91886227945 0.767140746117 1.41864752769
49 2 0.72222220309 0.923076927662 1.5
50 0 1.0 0.0 0.0
50 1 0.856644132541 0.836517572403 1.39548277855
50 2 0.687499979511 0.818181812763 1.77777779102
51 0 1.0 0.0 0.0
51 1 0.652653070402 0.954037129879 1.60602509975
51 2 1.66666660044 0.533333361149 1.125
52 0 1.0 0.0 0.0
52 1 0.499282675409 0.945242583752 2.11889886856
52 2 3.49999984354 0.285714298487 1.0
53 0 1.0 0.0 0.0
53 1 1.0 0.0 0.0
53 2 1.0 0.0 0.0
