0 0 0.8 0.875 1.42857146263
0 1 0.815715603884 0.876720190048 1.39829957485
0 2 0.84615388495 0.909090936184 1.29999995232
1 0 0.571428571429 1.0 1.75
1 1 0.749568993325 0.899942517281 1.48242807388
1 2 0.8 0.916666686535 1.36363637447
2 0 0.571428571429 1.0 1.75
2 1 0.789521620153 0.908251583576 1.39453625679
2 2 0.923076889219 0.916666686535 1.18181812763
3 0 0.642857131909 0.888888895512 1.75
3 1 0.717852663633 0.928695678711 1.5
3 2 1.0 0.785714268684 1.27272725105
4 0 0.615384615385 0.875 1.85714280605
4 1 0.737822955555 0.905281305313 1.49714648724
4 2 0.666666666667 1.0 1.5
5 0 0.687499979511 0.909090936184 1.60000002384
5 1 0.727652440508 0.904707252979 1.51903557777
5 2 0.705882372741 1.0 1.41666662693
6 0 0.916666639348 0.909090936184 1.20000004768
6 1 0.678405597136 0.905305206776 1.62822937965
6 2 0.8 0.833333313465 1.5
7 0 0.687499979511 1.0 1.45454549789
7 1 0.741371945984 0.872988522053 1.54509544373
7 2 0.705882372741 1.0 1.41666662693
8 0 0.785714299095 0.909090936184 1.39999997616
8 1 0.726021707583 0.90924757719 1.51484525204
8 2 0.923076889219 0.75 1.44444441795
9 0 0.916666639348 0.909090936184 1.20000004768
9 1 0.774666653369 0.897877216339 1.43769967556
9 2 0.666666666667 1.0 1.5
10 0 0.916666639348 0.818181812763 1.33333337307
10 1 0.665132353172 0.928489029408 1.61925470829
10 2 0.83333330022 1.0 1.20000004768
11 0 0.769230797446 0.899999976158 1.44444441795
11 1 0.671785039243 0.928571403027 1.60307693481
11 2 0.749999977648 1.0 1.33333337307
12 0 0.83333330022 0.899999976158 1.33333337307
12 1 0.855468785454 0.855022847652 1.36715626717
12 2 0.785714299095 0.909090936184 1.39999997616
13 0 1.09999996722 0.727272748947 1.25
13 1 0.730478595124 0.925287365913 1.47950315475
13 2 0.83333330022 0.899999976158 1.33333337307
14 0 1.22222223032 0.727272748947 1.125
14 1 0.75484707536 0.904680371284 1.46435332298
14 2 0.899999957085 0.888888895512 1.25
15 0 1.12499999162 0.777777791023 1.14285719395
15 1 0.723368445089 0.905122220516 1.52733123302
15 2 0.909090889387 0.699999988079 1.57142853737
16 0 1.33333333333 0.5 1.5
16 1 0.662567230337 0.942575395107 1.60123074055
16 2 0.749999977648 0.888888895512 1.5
17 0 0.84615388495 0.818181812763 1.44444441795
17 1 0.6865912666 0.937058806419 1.55430006981
17 2 0.733333327505 0.909090936184 1.5
18 0 0.769230797446 1.0 1.29999995232
18 1 1.10862619281 0.742939472198 1.21411943436
18 2 0.909090889387 0.800000011921 1.375
19 0 0.812499969732 0.846153855324 1.45454549789
19 1 0.780420857124 0.887456059456 1.4438573122
19 2 0.857142886337 0.833333313465 1.39999997616
20 0 0.684210539194 0.846153855324 1.72727274895
20 1 0.860231267304 0.876095831394 1.32688462734
20 2 0.71428572645 1.0 1.39999997616
21 0 0.565217405952 1.0 1.76923072338
21 1 0.804532600726 0.888497650623 1.39894318581
21 2 0.785714299095 0.909090936184 1.39999997616
22 0 0.72222220309 0.846153855324 1.63636362553
22 1 0.836914054218 0.891481935978 1.34031414986
22 2 1.0 0.833333313465 1.20000004768
23 0 0.684210539194 0.923076927662 1.58333337307
23 1 0.726535819439 0.930710494518 1.47886431217
23 2 1.08333332795 0.846153855324 1.09090912342
24 0 0.749999977648 1.0 1.33333337307
24 1 0.785583103808 0.883109271526 1.44142949581
24 2 0.705882372741 0.916666686535 1.54545450211
25 0 1.20000002861 0.777777791023 1.07142853737
25 1 0.862595459095 0.87728613615 1.32145261765
25 2 0.928571381131 0.923076927662 1.16666662693
26 0 0.807692278066 0.857142865658 1.44444441795
26 1 0.903499503585 0.851525843143 1.29979324341
26 2 1.09090906726 0.666666686535 1.375
27 0 0.913043482993 0.761904776096 1.4375
27 1 0.709525870104 0.91691750288 1.5370978117
27 2 0.649999988377 1.0 1.53846156597
28 0 0.540540533574 1.0 1.85000002384
28 1 0.797752835702 0.884262084961 1.41759002209
28 2 0.937499951106 0.866666674614 1.23076927662
29 0 0.729729720325 0.888888895512 1.54166662693
29 1 0.795704267229 0.89265537262 1.40787625313
29 2 1.15384614327 0.800000011921 1.08333337307
30 0 0.829268321617 0.705882370472 1.70833337307
30 1 0.994374156301 0.774398863316 1.29863011837
30 2 1.23076923077 0.75 1.08333337307
31 0 1.0294117629 0.800000011921 1.21428573132
31 1 0.782693537695 0.857855379581 1.48934113979
31 2 0.874999960884 0.928571403027 1.23076927662
32 0 1.10344827586 0.78125 1.15999996662
32 1 0.830998227174 0.869336128235 1.38424241543
32 2 1.07142856687 0.733333349228 1.27272725105
33 0 0.769230797446 0.899999976158 1.44444441795
33 1 1.0 0.0 0.0
33 2 1.45454545455 0.625 1.10000002384
34 0 0.779999973965 0.948717951775 1.35135138035
34 1 0.812499969732 0.893665134907 1.37721514702
34 2 0.823529400215 0.928571403027 1.30769228935
35 0 0.918918948525 0.882352948189 1.23333334923
35 1 0.857142886337 0.861979186535 1.35347437859
35 2 1.15384614327 0.600000023842 1.44444441795
36 0 0.785714299095 0.909090936184 1.39999997616
36 1 1.0 0.0 0.0
36 2 1.08333332795 0.846153855324 1.09090912342
37 0 0.935483838591 0.827586233616 1.29166662693
37 1 0.890876589613 0.843373477459 1.33095240593
37 2 0.857142886337 0.916666686535 1.27272725105
38 0 1.0 0.0 0.0
38 1 1.12709833455 0.725531935692 1.22287392616
38 2 1.74999992177 0.5 1.14285719395
39 0 1.16666665508 0.714285731316 1.20000004768
39 1 0.793319425715 0.884210526943 1.42559528351
39 2 0.840000008011 0.761904776096 1.5625
40 0 0.96721306939 0.796610176563 1.29787230492
40 1 0.840236687576 0.859154939651 1.38524591923
40 2 0.862068990323 0.800000011921 1.45000004768
41 0 0.954545402822 0.833333313465 1.25714290142
41 1 0.864678901447 0.870026528835 1.3292683363
41 2 0.749999977648 0.952380955219 1.39999997616
42 0 0.910714241125 0.901960790157 1.21739125252
42 1 0.774774763126 0.87209302187 1.48000001907
42 2 0.913043482993 0.809523820877 1.35294115543
43 0 0.896551753621 0.884615361691 1.26086962223
43 1 0.927899636588 0.800675690174 1.34599161148
43 2 0.888888888889 0.8125 1.3846154213
44 0 1.0 0.0 0.0
44 1 0.670241294146 0.927999973297 1.60775864124
44 2 1.05882355911 0.777777791023 1.21428573132
45 0 1.0 0.800000011921 1.25
45 1 0.843373523047 0.87619048357 1.35326087475
45 2 0.941176470588 0.75 1.41666662693
46 0 0.83333330022 0.899999976158 1.33333337307
46 1 0.885496163867 0.86206895113 1.30999994278
46 2 1.62499993946 0.538461565971 1.14285719395
47 0 0.899999957085 0.777777791023 1.42857146263
47 1 1.20370368909 0.661538481712 1.25581395626
47 2 0.818181827049 0.777777791023 1.57142853737
48 0 1.22222223032 0.727272748947 1.125
48 1 1.06249999604 0.764705896378 1.23076927662
48 2 0.8 1.0 1.25
49 0 0.874999960884 0.714285731316 1.60000002384
49 1 1.0 0.0 0.0
49 2 1.0 0.75 1.33333337307
50 0 0.749999977648 0.666666686535 2.0
50 1 1.0 0.0 0.0
50 2 0.600000014305 1.0 1.66666662693
51 0 2.99999991059 0.333333343267 1.0
51 1 0.857142886337 0.666666686535 1.75
51 2 1.33333333333 0.75 1.0
52 0 4.0 0.25 1.0
52 1 0.5 1.0 2.0
52 2 0.83333330022 0.600000023842 2.0
53 0 1.0 0.0 0.0
53 1 3.33333320088 0.300000011921 1.0
53 2 1.0 0.666666686535 1.5
