0 0 1.05555553109 0.842105269432 1.125
0 1 0.783711565718 0.886353850365 1.4395827055
0 2 0.71428572645 0.933333337307 1.5
1 0 0.818181827049 0.888888895512 1.375
1 1 0.700831830765 0.914109647274 1.5609459877
1 2 0.77777778808 0.857142865658 1.5
2 0 0.708333315742 1.0 1.41176474094
2 1 0.759617227029 0.899548113346 1.46345984936
2 2 0.653846141855 0.941176474094 1.625
3 0 0.71428572645 0.850000023842 1.64705884457
3 1 0.697619732326 0.929072976112 1.54287743568
3 2 1.0 0.857142865658 1.16666662693
4 0 0.606060614818 0.850000023842 1.94117641449
4 1 0.711455123904 0.901463270187 1.55920946598
4 2 1.0 1.0 1.0
5 0 0.612903235234 0.947368443012 1.72222220898
5 1 0.676807227919 0.912680745125 1.61888539791
5 2 0.758620658471 0.818181812763 1.61111116409
6 0 0.941176470588 0.8125 1.30769228935
6 1 0.616083610911 0.917719602585 1.76868438721
6 2 0.620689634761 0.888888895512 1.8125
7 0 0.809523818715 0.823529422283 1.5
7 1 0.711339470976 0.871218621731 1.61360025406
7 2 0.549999983609 0.95454543829 1.90476191044
8 0 0.542857141008 0.789473712444 2.33333325386
8 1 0.69055914855 0.905864536762 1.59858548641
8 2 0.703703731666 1.0 1.42105257511
9 0 0.620689634761 0.833333313465 1.9333332777
9 1 0.740231666542 0.89346408844 1.51201200485
9 2 0.740740727659 0.850000023842 1.58823525906
10 0 0.83333330022 0.866666674614 1.3846154213
10 1 0.640361190054 0.920422255993 1.69663286209
10 2 0.692307705005 0.888888895512 1.625
11 0 0.807692278066 0.952380955219 1.29999995232
11 1 0.65472598995 0.921034216881 1.65830588341
11 2 0.740740727659 0.899999976158 1.5
12 0 0.896551753621 0.730769217014 1.5263158083
12 1 0.836354162938 0.850442171097 1.40593421459
12 2 0.724137942941 0.952380955219 1.45000004768
13 0 0.781250017462 0.920000016689 1.39130437374
13 1 0.693590147037 0.920944452286 1.56553804874
13 2 0.874999960884 0.857142865658 1.33333337307
14 0 0.793103412414 0.869565188885 1.45000004768
14 1 0.713170430873 0.900677323341 1.55681657791
14 2 0.884615408951 0.869565188885 1.29999995232
15 0 0.888888888889 0.71875 1.56521737576
15 1 0.679147842959 0.908811569214 1.62017464638
15 2 0.756756776262 0.785714268684 1.68181812763
16 0 1.16666665508 0.714285731316 1.20000004768
16 1 0.62421726425 0.933257162571 1.71657550335
16 2 1.0 0.695652186871 1.4375
17 0 0.794871799731 0.903225779533 1.39285719395
17 1 0.634510817255 0.935551941395 1.68458557129
17 2 0.749999977648 0.916666686535 1.45454549789
18 0 0.739999984121 0.918918907642 1.47058820724
18 1 1.28427910133 0.639867067337 1.21688866615
18 2 0.870967718491 0.888888895512 1.29166662693
19 0 0.872727242462 0.854166686535 1.34146344662
19 1 0.728533949931 0.896577477455 1.53095495701
19 2 1.0 0.742857158184 1.34615385532
20 0 0.824999975413 0.833333313465 1.45454549789
20 1 0.850500408389 0.852001547813 1.38001906872
20 2 0.619047633104 0.974358975887 1.65789473057
21 0 0.903614443555 0.759999990463 1.45614039898
21 1 0.740054300239 0.896803021431 1.5067435503
21 2 0.865384577691 0.844444453716 1.36842107773
22 0 0.663461539222 0.942028999329 1.60000002384
22 1 0.785352974098 0.887376904488 1.43491768837
22 2 0.8 0.923076927662 1.35416662693
23 0 0.790909089195 0.873563230038 1.44736838341
23 1 0.669294128582 0.925597131252 1.61421346664
23 2 0.703296703297 0.9375 1.51666665077
24 0 0.937499951106 0.809523820877 1.31764709949
24 1 0.729342509909 0.877223014832 1.56299817562
24 2 0.793103412414 0.797101438046 1.581818223
25 0 3.74418592455 0.217391297221 1.22857141495
25 1 0.768073249173 0.893019616604 1.45792901516
25 2 0.827957020025 0.922077894211 1.30985915661
26 0 0.783625762679 0.850746273994 1.5
26 1 0.914212677232 0.811418652534 1.34805548191
26 2 0.641379333546 0.903225779533 1.72619044781
27 0 0.689393923829 0.923076927662 1.57142853737
27 1 0.672784487491 0.907129943371 1.63853049278
27 2 0.729729720325 0.879629611969 1.55789470673
28 0 0.581920900427 0.907766997814 1.89304816723
28 1 0.721254361992 0.879253029823 1.57687652111
28 2 0.7935483932 0.87804877758 1.43518519402
29 0 0.820339021505 0.87190079689 1.39810431004
29 1 0.72844234399 0.90335893631 1.5196532011
29 2 0.78260868754 0.9126983881 1.39999997616
30 0 0.938775523907 0.760869562626 1.39999997616
30 1 0.827090067702 0.836609840393 1.44518768787
30 2 0.792553185459 0.771812081337 1.63478255272
31 0 0.751308896069 0.829268276691 1.60504198074
31 1 0.71416264582 0.852957606316 1.64163041115
31 2 0.716346127571 0.899328887463 1.55223882198
32 0 0.944827556689 0.835766434669 1.26637554169
32 1 0.719079733802 0.906540930271 1.53403604031
32 2 0.826815666686 0.885135114193 1.36641216278
33 0 0.775147905483 0.904580175877 1.42616033554
33 1 1.0 0.0 0.0
33 2 0.847133738665 0.819548845291 1.44036698341
34 0 0.715847002463 0.916030526161 1.52499997616
34 1 0.778595412839 0.897375643253 1.43124461174
34 2 0.783625762679 0.858208954334 1.48695647717
35 0 0.755395694467 0.904761910439 1.46315789223
35 1 0.776469172576 0.885421454906 1.45454025269
35 2 0.779141113981 0.874015748501 1.46846842766
36 0 0.778260892961 0.849161982536 1.51315784454
36 1 1.0 0.0 0.0
36 2 0.806896561011 0.871794879436 1.42156863213
37 0 1.11538461027 0.682758629322 1.3131313324
37 1 0.790085726753 0.888910531998 1.42386138439
37 2 0.838709664518 0.875 1.36263740063
38 0 1.0 0.0 0.0
38 1 1.06071321092 0.760765254498 1.23922836781
38 2 1.02857144258 0.722222208977 1.34615385532
39 0 1.14438506176 0.672897219658 1.29861116409
39 1 0.712452552256 0.922524273396 1.52148008347
39 2 0.992647039681 0.748148143291 1.34653460979
40 0 0.964157724219 0.806691467762 1.28571426868
40 1 0.748197183297 0.894360601902 1.49441516399
40 2 0.849462344903 0.797468364239 1.47619044781
41 0 0.785714299095 0.887700557709 1.4337348938
41 1 0.800880255217 0.898351430893 1.38990843296
41 2 0.818681288652 0.885906040668 1.37878787518
42 0 0.921397364564 0.810426533222 1.33918130398
42 1 0.657789917066 0.922444522381 1.64805817604
42 2 0.865497078437 0.864864885807 1.3359375
43 0 0.815315309186 0.801104962826 1.5310344696
43 1 0.790175555466 0.856816709042 1.47702717781
43 2 0.892617435381 0.781954884529 1.43269228935
44 0 1.0 0.0 0.0
44 1 0.546990784121 0.955146849155 1.91403484344
44 2 0.811688316087 0.824000000954 1.49514567852
45 0 1.72916673108 0.427710831165 1.35211265087
45 1 0.751419334334 0.899400770664 1.47966837883
45 2 0.929824611964 0.792452812195 1.35714280605
46 0 0.977099236641 0.7109375 1.43956041336
46 1 1.00390751173 0.765560269356 1.30114865303
46 2 1.55357136243 0.574712634087 1.12000000477
47 0 1.37704923415 0.646825373173 1.12269937992
47 1 0.979892974193 0.803542196751 1.27002620697
47 2 1.29411768336 0.636363625526 1.21428573132
48 0 0.898635518512 0.750542283058 1.48265898228
48 1 0.926911763357 0.792321145535 1.36163401604
48 2 0.866197204187 0.780487775803 1.47916662693
49 0 0.826993851725 0.821958482265 1.47111916542
49 1 2.87218881527 0.262852072716 1.32457208633
49 2 0.793939391645 0.900763332844 1.39830505848
50 0 0.869776483231 0.813407838345 1.41346156597
50 1 0.89900061483 0.82128405571 1.35439884663
50 2 1.0131578995 0.735930740833 1.34117650986
51 0 0.90509668015 0.802912592888 1.37605798244
51 1 0.702434175015 0.922018527985 1.54402637482
51 2 0.821656061561 0.833333313465 1.46046507359
52 0 0.889915992418 0.797922551632 1.40828406811
52 1 0.722261503084 0.898068606853 1.54168641567
52 2 1.79702963192 0.380165278912 1.46376812458
53 0 1.05478180877 0.624119699001 1.51904094219
53 1 0.967970998054 0.73202931881 1.41126692295
53 2 1.16349812786 0.588235318661 1.46111106873
