0 0 1.33333333333 0.5 1.5
0 1 42.1292512907 0.0069433231838 3.41860461235
0 2 1.0 0.0 0.0
1 0 1.4999999553 0.666666686535 1.0
1 1 0.723610676331 0.839809119701 1.64556276798
1 2 1.0 0.0 0.0
2 0 0.666666666667 0.75 2.0
2 1 0.838921286225 0.788444817066 1.51184570789
2 2 0.25 1.0 4.0
3 0 2.99999991059 0.333333343267 1.0
3 1 0.768456927941 0.822942078114 1.58128881454
3 2 0.333333333333 0.5 6.0
4 0 0.600000014305 0.666666686535 2.5
4 1 1.01874689976 0.653753042221 1.50148153305
4 2 2.0 0.5 1.0
5 0 1.0 0.0 0.0
5 1 0.779746864623 0.775461375713 1.65381228924
5 2 2.0 0.5 1.0
6 0 0.333333333333 1.0 3.0
6 1 0.769261835439 0.756434977055 1.71851849556
6 2 1.0 1.0 1.0
7 0 1.0 1.0 1.0
7 1 0.953367913335 0.651472628117 1.61006462574
7 2 1.0 1.0 1.0
8 0 0.272727266816 1.0 3.66666674614
8 1 0.490171454082 0.902398824692 2.26075482368
8 2 1.0 1.0 1.0
9 0 0.749999977648 0.666666686535 2.0
9 1 1.00987603551 0.678619384766 1.45916926861
9 2 0.2 1.0 5.0
10 0 1.0 0.666666686535 1.5
10 1 0.84814081757 0.74005818367 1.59318482876
10 2 0.5 1.0 2.0
11 0 0.666666666667 1.0 1.5
11 1 0.853735866877 0.73334634304 1.59722959995
11 2 1.0 0.0 0.0
12 0 0.5 1.0 2.0
12 1 1.38425794639 0.521611392498 1.38495576382
12 2 1.0 1.0 1.0
13 0 0.749999977648 1.0 1.33333337307
13 1 0.877610736708 0.75200176239 1.51523220539
13 2 1.0 1.0 1.0
14 0 0.428571443168 1.0 2.33333325386
14 1 1.05679216277 0.641535460949 1.47499227524
14 2 0.5 1.0 2.0
15 0 0.600000014305 1.0 1.66666662693
15 1 1.58734410011 0.445629805326 1.41369175911
15 2 1.0 0.5 2.0
16 0 0.600000014305 1.0 1.66666662693
16 1 0.664482672224 0.851068198681 1.76828384399
16 2 1.0 1.0 1.0
17 0 0.5 1.0 2.0
17 1 0.716226005009 0.82973575592 1.6827133894
17 2 1.0 1.0 1.0
18 0 0.5 1.0 2.0
18 1 1.08896149837 0.626875638962 1.46489357948
18 2 0.5 1.0 2.0
19 0 1.0 0.5 2.0
19 1 0.973108966848 0.688044905663 1.4935567379
19 2 0.5 1.0 2.0
20 0 2.0 0.5 1.0
20 1 0.87243171049 0.755403161049 1.51736390591
20 2 1.0 1.0 1.0
21 0 1.0 1.0 1.0
21 1 0.61076646145 0.869823396206 1.88232123852
21 2 0.333333333333 1.0 3.0
22 0 1.0 1.0 1.0
22 1 0.605719314648 0.886258006096 1.86280941963
22 2 1.0 0.0 0.0
23 0 1.0 0.0 0.0
23 1 0.707133139524 0.84510487318 1.67335534096
23 2 1.0 1.0 1.0
24 0 1.0 1.0 1.0
24 1 0.780944837526 0.772727251053 1.65711784363
24 2 1.0 1.0 1.0
25 0 0.666666666667 1.0 1.5
25 1 0.726456794065 0.865044653416 1.59129858017
25 2 1.0 1.0 1.0
26 0 1.0 1.0 1.0
26 1 1.0 0.0 0.0
26 2 1.0 1.0 1.0
27 0 0.666666666667 1.0 1.5
27 1 0.870076896859 0.747880995274 1.53677356243
27 2 1.0 0.5 2.0
28 0 0.5 1.0 2.0
28 1 0.901507938939 0.743383467197 1.49216747284
28 2 1.0 1.0 1.0
29 0 0.5 1.0 2.0
29 1 0.71566793947 0.871916532516 1.60255718231
29 2 2.0 0.5 1.0
30 0 0.333333333333 1.0 3.0
30 1 0.418597182309 0.945272862911 2.52724027634
30 2 1.0 0.0 0.0
31 0 2.0 0.5 1.0
31 1 0.25753183026 0.971786856651 3.99574780464
31 2 2.0 0.5 1.0
32 0 1.0 0.0 0.0
32 1 0.734172885708 0.829547226429 1.64195227623
32 2 1.0 1.0 1.0
33 0 1.0 1.0 1.0
33 1 0.712829664073 0.877439856529 1.59881019592
33 2 0.333333333333 1.0 3.0
34 0 1.4999999553 0.666666686535 1.0
34 1 0.961685877781 0.750774681568 1.3850235939
34 2 1.0 1.0 1.0
35 0 1.0 1.0 1.0
35 1 0.849364465665 0.780158877373 1.50911676884
35 2 0.666666666667 1.0 1.5
36 0 1.0 1.0 1.0
36 1 32.9999990165 0.00693854410201 4.36734676361
36 2 0.666666666667 1.0 1.5
37 0 1.0 1.0 1.0
37 1 0.997216009887 0.723804235458 1.38544607162
37 2 2.0 0.5 1.0
38 0 1.0 0.0 0.0
38 1 0.418300194704 0.930831730366 2.56827044487
38 2 1.0 0.0 0.0
39 0 1.0 1.0 1.0
39 1 0.67812798827 0.905105650425 1.62925505638
39 2 0.5 1.0 2.0
40 0 1.0 1.0 1.0
40 1 0.860274318191 0.760321557522 1.52885305882
40 2 0.5 1.0 2.0
41 0 1.0 1.0 1.0
41 1 0.661062125643 0.909520506859 1.66320288181
41 2 0.5 1.0 2.0
42 0 1.0 0.0 0.0
42 1 0.513200181773 0.920794785023 2.11616897583
42 2 1.0 0.0 0.0
43 0 1.0 1.0 1.0
43 1 0.70119333821 0.831041514874 1.71608781815
43 2 2.0 0.5 1.0
44 0 0.5 1.0 2.0
44 1 0.76420514123 0.79864025116 1.63847124577
44 2 1.0 0.666666686535 1.5
45 0 1.0 1.0 1.0
45 1 0.726251383375 0.837953746319 1.64320969582
45 2 0.5 1.0 2.0
46 0 1.0 1.0 1.0
46 1 0.684954083314 0.873667955399 1.67106044292
46 2 1.0 1.0 1.0
47 0 0.666666666667 1.0 1.5
47 1 1.89897518687 0.41110253334 1.28094518185
47 2 0.25 1.0 4.0
48 0 2.0 0.5 1.0
48 1 0.72131545057 0.77857863903 1.78062427044
48 2 2.0 0.5 1.0
49 0 1.4999999553 0.666666686535 1.0
49 1 0.999841119264 0.629647254944 1.58844304085
49 2 1.0 1.0 1.0
50 0 0.666666666667 1.0 1.5
50 1 1.05042237994 0.659210860729 1.44414794445
50 2 1.0 0.0 0.0
51 0 1.0 1.0 1.0
51 1 0.579292031866 0.934616565704 1.84700882435
51 2 1.0 0.0 0.0
52 0 2.0 0.5 1.0
52 1 0.587653460624 0.865060925484 1.96712517738
52 2 1.0 0.0 0.0
53 0 1.0 0.0 0.0
53 1 1.0 0.0 0.0
53 2 1.0 0.0 0.0
