0 0 1.0 0.0 0.0
0 1 1.0 0.0 0.0
0 2 1.0 0.0 0.0
1 0 1.0 0.0 0.0
1 1 0.705882372741 0.916666686535 1.54545450211
1 2 1.0 0.0 0.0
2 0 1.0 0.0 0.0
2 1 0.928571381131 0.769230782986 1.39999997616
2 2 1.0 0.0 0.0
3 0 1.0 0.0 0.0
3 1 0.600000014305 0.916666686535 1.81818187237
3 2 1.0 0.0 0.0
4 0 1.0 0.0 0.0
4 1 0.749999977648 0.733333349228 1.81818187237
4 2 1.0 0.0 0.0
5 0 1.0 0.0 0.0
5 1 0.615384615385 0.9375 1.73333334923
5 2 1.0 0.0 0.0
6 0 1.0 0.0 0.0
6 1 0.5 0.833333313465 2.40000009537
6 2 1.0 0.0 0.0
7 0 1.0 0.0 0.0
7 1 0.857142886337 0.833333313465 1.39999997616
7 2 1.0 0.0 0.0
8 0 1.0 0.0 0.0
8 1 0.454545444693 0.949999988079 2.31578946114
8 2 1.0 0.0 0.0
9 0 1.0 0.0 0.0
9 1 0.736842133002 0.928571403027 1.46153843403
9 2 1.0 0.0 0.0
10 0 1.0 0.0 0.0
10 1 1.12499999162 0.722222208977 1.23076927662
10 2 1.0 0.0 0.0
11 0 1.0 0.0 0.0
11 1 0.761904761905 0.875 1.5
11 2 1.0 0.0 0.0
12 0 1.0 0.0 0.0
12 1 1.4999999553 0.555555582047 1.20000004768
12 2 1.0 0.0 0.0
13 0 1.0 0.0 0.0
13 1 0.874999960884 0.857142865658 1.33333337307
13 2 1.0 0.0 0.0
14 0 1.0 0.0 0.0
14 1 1.0 0.526315808296 1.89999997616
14 2 1.0 0.0 0.0
15 0 1.0 0.0 0.0
15 1 1.20000002861 0.5 1.66666662693
15 2 1.0 0.0 0.0
16 0 1.0 0.0 0.0
16 1 0.642857131909 0.944444417953 1.64705884457
16 2 1.0 0.0 0.0
17 0 1.0 0.0 0.0
17 1 0.695652173913 0.9375 1.53333330154
17 2 1.0 0.0 0.0
18 0 1.0 0.0 0.0
18 1 0.857142886337 0.777777791023 1.5
18 2 1.0 0.0 0.0
19 0 1.0 0.0 0.0
19 1 1.0 0.684210538864 1.46153843403
19 2 1.0 0.0 0.0
20 0 1.0 0.0 0.0
20 1 0.949999966025 0.789473712444 1.33333337307
20 2 1.0 0.0 0.0
21 0 1.0 0.0 0.0
21 1 0.68000001297 0.823529422283 1.78571426868
21 2 1.0 0.0 0.0
22 0 1.0 0.0 0.0
22 1 0.551724137931 0.8125 2.23076915741
22 2 1.0 0.0 0.0
23 0 1.0 0.0 0.0
23 1 0.687499979511 0.818181812763 1.77777779102
23 2 1.0 0.0 0.0
24 0 1.0 0.0 0.0
24 1 0.72222220309 0.769230782986 1.79999995232
24 2 1.0 0.0 0.0
25 0 1.0 0.0 0.0
25 1 0.84615388495 0.818181812763 1.44444441795
25 2 1.0 0.0 0.0
26 0 1.0 0.0 0.0
26 1 1.0 0.0 0.0
26 2 1.0 0.0 0.0
27 0 1.0 0.0 0.0
27 1 0.636363650156 0.857142865658 1.83333337307
27 2 1.0 0.0 0.0
28 0 1.0 0.0 0.0
28 1 0.842105263158 0.8125 1.46153843403
28 2 1.0 0.0 0.0
29 0 1.0 0.0 0.0
29 1 0.560000005341 0.928571403027 1.92307686806
29 2 1.0 0.0 0.0
30 0 1.0 0.0 0.0
30 1 0.333333333333 1.0 3.0
30 2 1.0 0.0 0.0
31 0 1.0 0.0 0.0
31 1 0.222222222222 1.0 4.5
31 2 1.0 0.0 0.0
32 0 1.0 0.0 0.0
32 1 0.678571437238 0.89473682642 1.64705884457
32 2 1.0 0.0 0.0
33 0 1.0 0.0 0.0
33 1 0.551724137931 0.9375 1.9333332777
33 2 1.0 0.0 0.0
34 0 1.0 0.0 0.0
34 1 0.736842133002 0.857142865658 1.58333337307
34 2 1.0 0.0 0.0
35 0 1.0 0.0 0.0
35 1 0.874999960884 0.928571403027 1.23076927662
35 2 1.0 0.0 0.0
36 0 1.0 0.0 0.0
36 1 1.0 0.0 0.0
36 2 1.0 0.0 0.0
37 0 1.0 0.0 0.0
37 1 1.13333332433 0.647058844566 1.36363637447
37 2 1.0 0.0 0.0
38 0 1.0 0.0 0.0
38 1 0.378378388131 0.928571403027 2.84615373611
38 2 1.0 0.0 0.0
39 0 1.0 0.0 0.0
39 1 0.483870982628 1.0 2.06666660309
39 2 1.0 0.0 0.0
40 0 1.0 0.0 0.0
40 1 0.863636368316 0.789473712444 1.46666669846
40 2 1.0 0.0 0.0
41 0 1.0 0.0 0.0
41 1 0.826086935114 0.842105269432 1.4375
41 2 1.0 0.0 0.0
42 0 1.0 0.0 0.0
42 1 0.358490554749 1.0 2.78947377205
42 2 1.0 0.0 0.0
43 0 1.0 0.0 0.0
43 1 0.5 1.0 2.0
43 2 1.0 0.0 0.0
44 0 1.0 0.0 0.0
44 1 0.580645165756 0.888888895512 1.9375
44 2 1.0 0.0 0.0
45 0 1.0 0.0 0.0
45 1 0.678571437238 0.842105269432 1.75
45 2 1.0 0.0 0.0
46 0 1.0 0.0 0.0
46 1 0.600000014305 0.933333337307 1.78571426868
46 2 1.0 0.0 0.0
47 0 1.0 0.0 0.0
47 1 0.947368397277 0.5 2.11111116409
47 2 1.0 0.0 0.0
48 0 1.0 0.0 0.0
48 1 0.514285721292 0.888888895512 2.1875
48 2 1.0 0.0 0.0
49 0 1.0 0.0 0.0
49 1 0.909090889387 0.600000023842 1.83333337307
49 2 1.0 0.0 0.0
50 0 1.0 0.0 0.0
50 1 0.761904761905 0.8125 1.6153845787
50 2 1.0 0.0 0.0
51 0 1.0 0.0 0.0
51 1 0.653846141855 0.941176474094 1.625
51 2 1.0 0.0 0.0
52 0 1.0 0.0 0.0
52 1 0.941176470588 0.75 1.41666662693
52 2 1.0 0.0 0.0
