140849
140594
601135
603440
931359
1129770
1255971
1254182
1254185
1259564
1387567
1522735
1583136
1584160
1583394
1584162
1583139
1583651
1583907
1584419
1583396
1584676
1583398
1583654
1583911
1585707
1653808
1779751
1846843
1910309
2173466
2368303
2368304
2629680
2703152
2703154
2761264
2762035
2764349
2763070
2764606
2958127
2958383
3029039
3029040
3090737
3090738
3090740
3090485
3090997
3090742
3090998
3091254
3092022
3092534
3091255
3092535
3091256
