2562136
2562392
2562648
2562904
2563160
2563416
2563672
2563928
2562137
2562393
2562649
2562905
2563161
2563417
2563673
2563929
2562138
2562394
2562650
2562906
2563162
2563418
2563674
2563930
2562139
2562395
2562651
2562907
2563163
2563419
2563675
2563931
2562140
2562396
2562652
2562908
2563164
2563420
2563676
2563932
2562141
2562397
2562653
2562909
2563165
2563421
2563677
2563933
2562142
2562398
2562654
2562910
2563166
2563422
2563678
2563934
2562143
2562399
2562655
2562911
2563167
2563423
2563679
2563935
