5632
5888
14080
14336
21504
21760
5727
5983
14175
14431
21599
21855
71168
71424
79616
79872
87040
87296
71263
71519
79711
79967
87135
87391
136704
136960
145152
145408
152576
152832
136799
137055
145247
145503
152671
152927
202240
202496
210688
210944
218112
218368
202335
202591
210783
211039
218207
218463
267776
268032
276224
276480
283648
283904
267871
268127
276319
276575
283743
283999
333312
333568
341760
342016
349184
349440
333407
333663
341855
342111
349279
349535
398848
399104
407296
407552
414720
414976
398943
399199
407391
407647
414815
415071
464384
464640
472832
473088
480256
480512
464479
464735
472927
473183
480351
480607
529920
530176
538368
538624
545792
546048
530015
530271
538463
538719
545887
546143
595456
595712
603904
604160
611328
611584
595551
595807
603999
604255
611423
611679
660992
661248
669440
669696
676864
677120
661087
661343
669535
669791
676959
677215
726528
726784
734976
735232
742400
742656
726623
726879
735071
735327
742495
742751
792064
792320
800512
800768
807936
808192
792159
792415
800607
800863
808031
808287
857600
857856
866048
866304
873472
873728
857695
857951
866143
866399
873567
873823
923136
923392
931584
931840
939008
939264
923231
923487
931679
931935
939103
939359
988672
988928
997120
997376
1004544
1004800
988767
989023
997215
997471
1004639
1004895
1054208
1054464
1062656
1062912
1070080
1070336
1054303
1054559
1062751
1063007
1070175
1070431
1119744
1120000
1128192
1128448
1135616
1135872
1119839
1120095
1128287
1128543
1135711
1135967
1185280
1185536
1193728
1193984
1201152
1201408
1185375
1185631
1193823
1194079
1201247
1201503
1250816
1251072
1259264
1259520
1266688
1266944
1250911
1251167
1259359
1259615
1266783
1267039
1316352
1316608
1324800
1325056
1332224
1332480
1316447
1316703
1324895
1325151
1332319
1332575
1381888
1382144
1390336
1390592
1397760
1398016
1381983
1382239
1390431
1390687
1397855
1398111
1450034
1447424
1447680
1455872
1456128
1463296
1463552
1447519
1447775
1455967
1456223
1463391
1463647
1512960
1513216
1521408
1521664
1528832
1529088
1513055
1513311
1521503
1521759
1528927
1529183
1578496
1578752
1586944
1587200
1594368
1594624
1578591
1578847
1587039
1587295
1594463
1594719
1644032
1644288
1652480
1652736
1659904
1660160
1644127
1644383
1652575
1652831
1659999
1660255
1709568
1709824
1718016
1718272
1725440
1725696
1709663
1709919
1718111
1718367
1725535
1725791
1787673
1775104
1775360
1783552
1783808
1790976
1791232
1775199
1775455
1783647
1783903
1791071
1791327
1840640
1840896
1849088
1849344
1856512
1856768
1840735
1840991
1849183
1849439
1856607
1856863
1906176
1906432
1914624
1914880
1922048
1922304
1906271
1906527
1914719
1914975
1922143
1922399
1971712
1971968
1980160
1980416
1987584
1987840
1971807
1972063
1980255
1980511
1987679
1987935
2037248
2037504
2045696
2045952
2053120
2053376
2037343
2037599
2045791
2046047
2053215
2053471
2102784
2103040
2111232
2111488
2118656
2118912
2102879
2103135
2111327
2111583
2118751
2119007
2168320
2168576
2176768
2177024
2184192
2184448
2168415
2168671
2176863
2177119
2184287
2184543
2233856
2234112
2242304
2242560
2249728
2249984
2233951
2234207
2242399
2242655
2249823
2250079
2299392
2299648
2307840
2308096
2315264
2315520
2299487
2299743
2307935
2308191
2315359
2315615
2364928
2365184
2373376
2373632
2380800
2381056
2365023
2365279
2373471
2373727
2380895
2381151
2430464
2430720
2438912
2439168
2446336
2446592
2430559
2430815
2439007
2439263
2446431
2446687
2496000
2496256
2504448
2504704
2511872
2512128
2496095
2496351
2504543
2504799
2511967
2512223
2561536
2561792
2569984
2570240
2577408
2577664
2561631
2561887
2570079
2570335
2577503
2577759
2627072
2627328
2635520
2635776
2642944
2643200
2627167
2627423
2635615
2635871
2643039
2643295
2692608
2692864
2701056
2701312
2708480
2708736
2692703
2692959
2701151
2701407
2708575
2708831
2758144
2758400
2766592
2766848
2774016
2774272
2758239
2758495
2766687
2766943
2774111
2774367
2823680
2823936
2832128
2832384
2839552
2839808
2823775
2824031
2832223
2832479
2839647
2839903
2889216
2889472
2897664
2897920
2905088
2905344
2889311
2889567
2897759
2898015
2905183
2905439
2954752
2955008
2963200
2963456
2970624
2970880
2954847
2955103
2963295
2963551
2970719
2970975
3024948
3025204
3025460
3025716
3025972
3026228
3026484
3026740
3024949
3025205
3025461
3025717
3025973
3026229
3026485
3026741
3020288
3020544
3028736
3028992
3036160
3036416
3020383
3020639
3028831
3029087
3036255
3036511
3089967
3091247
3097138
3089463
3097149
3085824
3086080
3094272
3094528
3101696
3101952
3085919
3086175
3094367
3094623
3101791
3102047
3161410
3151360
3151616
3159808
3160064
3167232
3167488
3151455
3151711
3159903
3160159
3167327
3167583
3224576
3224832
3224577
3224833
3216896
3217152
3225344
3225600
3232768
3233024
3216991
3217247
3225439
3225695
3232863
3233119
3293224
3282432
3282688
3290880
3291136
3298304
3298560
3282527
3282783
3290975
3291231
3298399
3298655
3347968
3348224
3356416
3356672
3363840
3364096
3348063
3348319
3356511
3356767
3363935
3364191
3413504
3413760
3421952
3422208
3429376
3429632
3413599
3413855
3422047
3422303
3429471
3429727
3491119
3492144
3479040
3479296
3487488
3487744
3494912
3495168
3479135
3479391
3487583
3487839
3495007
3495263
