0 0 1.0 0.0 0.0
0 1 42.4285720269 0.0050505050458 4.66666650772
0 2 1.0 0.0 0.0
1 0 1.0 0.0 0.0
1 1 0.666206889103 0.898550748825 1.67050695419
1 2 1.0 0.0 0.0
2 0 1.0 0.0 0.0
2 1 0.788732362583 0.813492059708 1.55853652954
2 2 1.0 0.0 0.0
3 0 1.0 0.0 0.0
3 1 0.664411358995 0.902240335941 1.668171525
3 2 1.0 0.0 0.0
4 0 1.0 0.0 0.0
4 1 0.910334334795 0.739565968513 1.48532736301
4 2 1.0 0.0 0.0
5 0 1.0 0.0 0.0
5 1 0.672661861562 0.85204988718 1.74476993084
5 2 1.0 0.0 0.0
6 0 1.0 0.0 0.0
6 1 0.647127776332 0.849637687206 1.81876337528
6 2 1.0 0.0 0.0
7 0 1.0 0.0 0.0
7 1 0.70365698118 0.802867412567 1.77008926868
7 2 1.0 0.0 0.0
8 0 1.0 0.0 0.0
8 1 0.411592081558 0.955436706543 2.54291033745
8 2 1.0 0.0 0.0
9 0 1.0 0.0 0.0
9 1 0.835962184721 0.777358472347 1.53883492947
9 2 1.0 0.0 0.0
10 0 1.0 0.0 0.0
10 1 0.785060964625 0.807766973972 1.57692313194
10 2 1.0 0.0 0.0
11 0 1.0 0.0 0.0
11 1 0.80472439132 0.818003892899 1.51913881302
11 2 1.0 0.0 0.0
12 0 1.0 0.0 0.0
12 1 1.27272730031 0.583333313465 1.34693872929
12 2 1.0 0.0 0.0
13 0 1.0 0.0 0.0
13 1 0.72061067758 0.841101706028 1.64987409115
13 2 1.0 0.0 0.0
14 0 1.0 0.0 0.0
14 1 1.0879828052 0.666666686535 1.37869822979
14 2 1.0 0.0 0.0
15 0 1.0 0.0 0.0
15 1 1.16411378374 0.562030076981 1.5284280777
15 2 1.0 0.0 0.0
16 0 1.0 0.0 0.0
16 1 0.55117272421 0.914893627167 1.98308670521
16 2 1.0 0.0 0.0
17 0 1.0 0.0 0.0
17 1 0.617224858556 0.87596899271 1.84955751896
17 2 1.0 0.0 0.0
18 0 1.0 0.0 0.0
18 1 0.934959384933 0.714782595634 1.4963504076
18 2 1.0 0.0 0.0
19 0 1.0 0.0 0.0
19 1 0.878702396857 0.768860340118 1.48016703129
19 2 1.0 0.0 0.0
20 0 1.0 0.0 0.0
20 1 0.741233394368 0.817292034626 1.6506986618
20 2 1.0 0.0 0.0
21 0 1.0 0.0 0.0
21 1 0.525089614933 0.936860084534 2.03278684616
21 2 1.0 0.0 0.0
22 0 1.0 0.0 0.0
22 1 0.518549760757 0.938211381435 2.05545926094
22 2 1.0 0.0 0.0
23 0 1.0 0.0 0.0
23 1 0.659493685814 0.879078686237 1.72489082813
23 2 1.0 0.0 0.0
24 0 1.0 0.0 0.0
24 1 0.676322401483 0.843575417995 1.75275933743
24 2 1.0 0.0 0.0
25 0 1.0 0.0 0.0
25 1 0.6831683128 0.892339527607 1.64037120342
25 2 1.0 0.0 0.0
26 0 1.0 0.0 0.0
26 1 1.0 0.0 0.0
26 2 1.0 0.0 0.0
27 0 1.0 0.0 0.0
27 1 0.854014605971 0.769230782986 1.5222222805
27 2 1.0 0.0 0.0
28 0 1.0 0.0 0.0
28 1 0.826291094611 0.792613625526 1.52688169479
28 2 1.0 0.0 0.0
29 0 1.0 0.0 0.0
29 1 0.670781904851 0.880368113518 1.69337975979
29 2 1.0 0.0 0.0
30 0 1.0 0.0 0.0
30 1 0.364721484373 0.963636338711 2.84528303146
30 2 1.0 0.0 0.0
31 0 1.0 0.0 0.0
31 1 0.232334857009 0.985123991966 4.3691277504
31 2 1.0 0.0 0.0
32 0 1.0 0.0 0.0
32 1 0.75833330998 0.85989010334 1.53354632854
32 2 1.0 0.0 0.0
33 0 1.0 0.0 0.0
33 1 0.725888331023 0.90209788084 1.52713179588
33 2 1.0 0.0 0.0
34 0 1.0 0.0 0.0
34 1 0.857988188073 0.855172395706 1.36290323734
34 2 1.0 0.0 0.0
35 0 1.0 0.0 0.0
35 1 21.0434788335 0.0103305783123 4.59999990463
35 2 1.0 0.0 0.0
36 0 1.0 0.0 0.0
36 1 8.68421037988 0.0444444455206 2.59090900421
36 2 1.0 0.0 0.0
37 0 1.0 0.0 0.0
37 1 0.87962960924 0.75789475441 1.5
37 2 1.0 0.0 0.0
38 0 1.0 0.0 0.0
38 1 0.396766164448 0.946708440781 2.66225171089
38 2 1.0 0.0 0.0
39 0 1.0 0.0 0.0
39 1 0.684895810796 0.920152068138 1.58677685261
39 2 1.0 0.0 0.0
40 0 1.0 0.0 0.0
40 1 0.808652221555 0.786008238792 1.57329845428
40 2 1.0 0.0 0.0
41 0 1.0 0.0 0.0
41 1 0.660689649197 0.92901879549 1.62921345234
41 2 1.0 0.0 0.0
42 0 1.0 0.0 0.0
42 1 1.0 0.0 0.0
42 2 1.0 0.0 0.0
43 0 1.0 0.0 0.0
43 1 0.718881122237 0.826848268509 1.68235290051
43 2 1.0 0.0 0.0
44 0 1.0 0.0 0.0
44 1 0.768402163608 0.815420567989 1.59598851204
44 2 1.0 0.0 0.0
45 0 1.0 0.0 0.0
45 1 0.863534662258 0.808290183544 1.43269228935
45 2 1.0 0.0 0.0
46 0 1.0 0.0 0.0
46 1 0.780821916533 0.84795320034 1.51034486294
46 2 1.0 0.0 0.0
47 0 1.0 0.0 0.0
47 1 1.81290327042 0.435943067074 1.26530611515
47 2 1.0 0.0 0.0
48 0 1.0 0.0 0.0
48 1 0.691135722775 0.807615220547 1.79156327248
48 2 1.0 0.0 0.0
49 0 1.0 0.0 0.0
49 1 0.981617651361 0.632958829403 1.60946750641
49 2 1.0 0.0 0.0
50 0 1.0 0.0 0.0
50 1 0.98863633819 0.675287365913 1.4978723526
50 2 1.0 0.0 0.0
51 0 1.0 0.0 0.0
51 1 0.524734975812 0.93265992403 2.04332137108
51 2 1.0 0.0 0.0
52 0 1.0 0.0 0.0
52 1 0.601886779727 0.849529802799 1.95571959019
52 2 1.0 0.0 0.0
53 0 1.0 0.0 0.0
53 1 1.0 0.0 0.0
53 2 1.0 0.0 0.0
