475208
475464
475720
475976
476232
476488
476744
477000
475209
475465
475721
475977
476233
476489
476745
477001
475210
475466
475722
475978
476234
476490
476746
477002
475211
475467
475723
475979
476235
476491
476747
477003
475212
475468
475724
475980
476236
476492
476748
477004
475213
475469
475725
475981
476237
476493
476749
477005
475214
475470
475726
475982
476238
476494
476750
477006
475215
475471
475727
475983
476239
476495
476751
477007
864344
864600
864856
865112
865368
865624
865880
866136
864345
864601
864857
865113
865369
865625
865881
866137
864346
864602
864858
865114
865370
865626
865882
866138
864347
864603
864859
865115
865371
865627
865883
866139
864348
864604
864860
865116
865372
865628
865884
866140
864349
864605
864861
865117
865373
865629
865885
866141
864350
864606
864862
865118
865374
865630
865886
866142
864351
864607
864863
865119
865375
865631
865887
866143
1060952
1061208
1061464
1061720
1061976
1062232
1062488
1062744
1060953
1061209
1061465
1061721
1061977
1062233
1062489
1062745
1060954
1061210
1061466
1061722
1061978
1062234
1062490
1062746
1060955
1061211
1061467
1061723
1061979
1062235
1062491
1062747
1060956
1061212
1061468
1061724
1061980
1062236
1062492
1062748
1060957
1061213
1061469
1061725
1061981
1062237
1062493
1062749
1060958
1061214
1061470
1061726
1061982
1062238
1062494
1062750
1060959
1061215
1061471
1061727
1061983
1062239
1062495
1062751
3024952
3025208
3025464
3025720
3025976
3026232
3026488
3026744
3024953
3025209
3025465
3025721
3025977
3026233
3026489
3026745
3024954
3025210
3025466
3025722
3025978
3026234
3026490
3026746
3024955
3025211
3025467
3025723
3025979
3026235
3026491
3026747
3024956
3025212
3025468
3025724
3025980
3026236
3026492
3026748
3024957
3025213
3025469
3025725
3025981
3026237
3026493
3026749
3024958
3025214
3025470
3025726
3025982
3026238
3026494
3026750
3024959
3025215
3025471
3025727
3025983
3026239
3026495
3026751
