9029
9285
10309
10565
11077
11333
9030
9286
10310
10566
11078
11334
9031
9287
10311
10567
11079
11335
9032
9288
10312
10568
11080
11336
9033
9289
10313
10569
11081
11337
9034
9290
10314
10570
11082
11338
9035
9291
10315
10571
11083
11339
9036
9292
10316
10572
11084
11340
9037
9293
10317
10573
11085
11341
9038
9294
10318
10574
11086
11342
9039
9295
10319
10575
11087
11343
9040
9296
10320
10576
11088
11344
9041
9297
10321
10577
11089
11345
9042
9298
10322
10578
11090
11346
9043
9299
10323
10579
11091
11347
9044
9300
10324
10580
11092
11348
9045
9301
10325
10581
11093
11349
9046
9302
10326
10582
11094
11350
9047
9303
10327
10583
11095
11351
9048
9304
10328
10584
11096
11352
9049
9305
10329
10585
11097
11353
9050
9306
10330
10586
11098
11354
9051
9307
10331
10587
11099
11355
5632
5888
14080
14336
21504
21760
5727
5983
14175
14431
21599
21855
74821
75077
75333
77125
74822
75078
75334
77126
74823
75079
75335
77127
74824
75080
75336
77128
74825
75081
75337
77129
74826
75082
75338
77130
74827
75339
77131
74828
75084
75340
77132
74829
75085
75341
77133
74830
75086
77134
74831
75087
77135
74832
75088
75344
77136
74838
75094
75350
77142
74839
75095
75351
77143
75357
77149
71168
71424
79616
79872
87040
87296
71263
71519
79711
79967
87135
87391
141380
141636
141381
141637
141382
141638
141383
141639
141385
141641
141386
141642
141387
141643
141388
141644
141389
141645
141390
141646
141391
141647
141392
141648
141393
141649
141394
141650
141395
141651
141396
141652
141397
141653
141398
141654
136704
136960
145152
145408
152576
152832
136799
137055
145247
145503
152671
152927
205125
205893
207685
208197
205126
205894
207686
208198
205127
205895
207687
208199
205128
205896
207688
208200
205129
205897
207689
208201
205130
205898
207690
208202
205131
205899
207691
208203
205132
205900
207692
208204
205133
205901
207693
208205
205134
205902
207694
208206
205135
205903
207695
208207
205136
205904
207696
208208
205137
205905
207697
208209
205138
205906
207698
208210
205139
205907
207699
208211
205140
205908
207700
208212
205141
205909
207701
208213
205142
205910
207702
208214
205143
205911
207703
208215
202240
202496
210688
210944
218112
218368
202335
202591
210783
211039
218207
218463
270916
271172
271428
271684
273220
270917
271173
271429
271685
273221
270918
271174
271430
271686
273222
270919
271175
271431
271687
273223
270920
271176
271432
271688
273224
270921
271177
271433
271689
273225
270922
271178
271434
271690
273226
270923
271179
271435
271691
273227
270924
271180
271436
271692
273228
270925
271181
271437
271693
273229
270926
271182
271438
271694
273230
270927
271183
271439
271695
273231
270928
271184
271440
271696
273232
270929
271185
271441
271697
273233
270930
271186
271442
271698
273234
270931
271187
271443
271699
273235
270932
271188
271444
271700
273236
270933
271189
271445
271701
273237
270934
271190
271446
271702
273238
270935
271191
271447
271703
273239
270936
271192
271448
271704
273240
270937
271193
271449
271705
273241
270938
271194
271450
271706
273242
270939
271195
271451
271707
273243
267776
268032
276224
276480
283648
283904
267871
268127
276319
276575
283743
283999
336708
342084
342340
342596
336709
342085
342341
342597
336710
342086
342342
342598
336711
342087
342343
342599
336712
342088
342344
342600
336713
342089
342345
342601
336714
342090
342346
342602
336715
342091
342347
342603
336716
342092
342348
342604
336717
342093
342349
342605
336718
342094
342350
342606
336719
342095
342351
342607
336720
342096
342352
342608
336721
342097
342353
342609
336722
342098
342354
342610
336723
342099
342355
342611
336724
342100
342356
342612
336725
342101
342357
342613
336726
342102
342358
342614
336727
342103
342359
342615
336728
342104
342360
342616
336729
342105
342361
342617
343129
336730
342106
342362
342618
343130
336731
342107
342363
342619
343131
336732
342108
342364
342620
333312
333568
341760
342016
349184
349440
333407
333663
341855
342111
349279
349535
403013
403269
403525
403781
403014
403270
403526
403782
403015
403271
403527
403783
403016
403272
403528
403784
403017
403273
403529
403785
403018
403274
403530
403786
403019
403275
403531
403787
403020
403276
403532
403788
403021
403277
403533
403789
403022
403278
403534
403790
403023
403279
403535
403791
403024
403280
403536
403792
403025
403281
403537
403793
403026
403282
403538
403794
403027
403283
403539
403795
403028
403284
403540
403796
403029
403285
403541
403797
403030
403286
403542
403798
403031
403287
403543
403799
403032
403288
403544
403800
403033
403289
403545
403801
403034
403290
403546
403802
398848
399104
407296
407552
414720
414976
398943
399199
407391
407647
414815
415071
472644
472645
472646
472647
472648
472649
472650
472651
472652
472653
472654
472655
472656
472657
472658
472659
472660
472661
472662
472663
464384
464640
472832
473088
480256
480512
464479
464735
472927
473183
480351
480607
533316
539460
533317
539461
533318
539462
533319
539463
533320
539464
533321
539465
533322
539466
533323
539467
533324
539468
533325
539469
533326
539470
533327
539471
533328
539472
533329
539473
533330
539474
533331
539475
533332
539476
533333
539477
533334
539478
533335
539479
533336
539480
533337
539481
533338
539482
533339
539483
533340
539484
529920
530176
538368
538624
545792
546048
530015
530271
538463
538719
545887
546143
599109
600645
600901
601413
599110
600646
600902
601414
599111
600647
600903
601415
599112
600648
600904
601416
599113
600649
600905
601417
599114
600650
600906
601418
599115
600651
600907
601419
599116
600652
600908
601420
599117
600653
600909
601421
599118
600654
600910
601422
599119
600655
600911
601423
599120
600656
600912
601424
599121
600657
600913
601425
599122
600658
600914
601426
599123
600659
600915
601427
599124
600660
600916
601428
595456
595712
603904
604160
611328
611584
595551
595807
603999
604255
611423
611679
660992
661248
669440
669696
676864
677120
661087
661343
669535
669791
676959
677215
729413
730181
735813
729414
730182
735814
729415
730183
735815
729416
730184
735816
729417
730185
735817
729418
730186
735818
729419
730187
735819
730188
735820
729421
730189
735821
729422
730190
735822
729423
730191
735823
729424
730192
735824
729425
730193
735825
729426
730194
735826
729427
730195
735827
729428
735828
729429
735829
729430
730198
735830
729431
730199
735831
729433
730201
729434
730202
735834
726528
726784
734976
735232
742400
742656
726623
726879
735071
735327
742495
742751
795460
796996
795461
796997
795462
796998
795463
796999
795464
797000
795465
797001
795466
797002
795467
797003
795468
797004
795469
797005
795470
797006
795471
797007
795472
797008
795473
797009
795474
797010
795475
797011
795476
797012
795477
797013
795478
797014
795479
797015
795480
797016
795481
797017
795482
797018
795483
797019
795484
797020
795485
797021
792064
792320
800512
800768
807936
808192
792159
792415
800607
800863
808031
808287
862790
863046
863814
865606
865862
862279
862791
863047
863815
865607
865863
862281
862793
863049
863817
865609
862283
862795
863051
863819
862286
862798
863054
863822
864334
864590
865102
865358
865614
865870
862296
862808
863064
863832
862297
862809
863065
863833
862298
862810
863066
863834
862299
862811
863067
863835
862300
862812
863068
863836
862813
863069
863837
857600
857856
866048
866304
873472
873728
857695
857951
866143
866399
873567
873823
928068
929092
929348
929604
929860
928069
929093
929349
929605
929861
928070
929094
929350
929606
929862
928071
929095
929351
929607
929863
928072
929096
929352
929608
929864
928073
929097
929353
929609
929865
928074
929098
929354
929610
929866
928075
929099
929355
929611
929867
928076
929100
929356
929612
929868
928077
929101
929357
929613
929869
928078
929102
929358
929614
929870
928079
929103
929359
929615
929871
928080
929104
929360
929616
929872
928081
929105
929361
929617
929873
928082
929106
929362
929618
929874
928083
929107
929363
929619
929875
928084
929108
929364
929620
929876
928085
929109
929365
929621
929877
928086
929110
929366
929622
929878
928087
929111
929367
929623
929879
928088
929112
929368
929624
929880
928089
929113
929369
929625
929881
928090
929114
929370
929626
929882
928091
929115
929371
929627
929883
923136
923392
931584
931840
939008
939264
923231
923487
931679
931935
939103
939359
994628
995396
995908
996164
994629
995397
995909
996165
994630
995398
995910
996166
994631
995399
995911
996167
994632
995400
995912
996168
994633
995401
995913
996169
994634
995402
995914
996170
994635
995403
995915
996171
994636
995404
995916
996172
994637
995405
995917
996173
994638
995406
995918
996174
994639
995407
995919
996175
994640
995408
995920
996176
994641
995409
995921
996177
994642
995410
995922
996178
994643
995411
995923
996179
994644
995412
995924
996180
994645
995413
995925
996181
994646
995414
995926
996182
988672
988928
997120
997376
1004544
1004800
988767
989023
997215
997471
1004639
1004895
1060932
1061188
1061444
1061700
1061956
1062212
1062468
1062724
1060933
1061189
1061445
1061701
1061957
1062213
1062469
1062725
1060934
1061190
1061446
1061702
1061958
1062214
1062470
1062726
1060935
1061191
1061447
1061703
1061959
1062215
1062471
1062727
1060936
1061192
1061448
1061704
1061960
1062216
1062472
1062728
1060937
1061193
1061449
1061705
1061961
1062217
1062473
1062729
1060938
1061194
1061450
1061706
1061962
1062218
1062474
1062730
1060939
1061195
1061451
1061707
1061963
1062219
1062475
1062731
1060940
1061196
1061452
1061708
1061964
1062220
1062476
1062732
1060941
1061197
1061453
1061709
1061965
1062221
1062477
1062733
1060942
1061198
1061454
1061710
1061966
1062222
1062478
1062734
1060943
1061199
1061455
1061711
1061967
1062223
1062479
1062735
1060944
1061200
1061456
1061712
1061968
1062224
1062480
1062736
1060945
1061201
1061457
1061713
1061969
1062225
1062481
1062737
1060946
1061202
1061458
1061714
1061970
1062226
1062482
1062738
1060947
1061203
1061459
1061715
1061971
1062227
1062483
1062739
1060948
1061204
1061460
1061716
1061972
1062228
1062484
1062740
1060949
1061205
1061461
1061717
1061973
1062229
1062485
1062741
1060950
1061206
1061462
1061718
1061974
1062230
1062486
1062742
1060951
1061207
1061463
1061719
1061975
1062231
1062487
1062743
1054208
1054464
1062656
1062912
1070080
1070336
1054303
1054559
1062751
1063007
1070175
1070431
1125444
1125445
1125446
1125447
1125448
1125449
1125450
1125451
1125452
1125453
1125454
1125455
1125456
1125457
1125458
1125459
1125460
1125461
1125462
1125463
1125464
1125465
1125467
1125468
1119744
1120000
1128192
1128448
1135616
1135872
1119839
1120095
1128287
1128543
1135711
1135967
1189956
1190212
1189957
1190213
1189958
1190214
1189959
1190215
1189960
1190216
1189961
1190217
1189962
1190218
1189963
1190219
1189964
1190220
1189965
1190221
1189966
1190222
1189967
1190223
1189968
1190224
1189969
1190225
1189970
1190226
1189971
1190227
1189972
1190228
1189973
1190229
1189974
1190230
1189975
1190231
1189976
1190232
1189977
1190233
1189978
1190234
1189979
1190235
1189980
1190236
1185280
1185536
1193728
1193984
1201152
1201408
1185375
1185631
1193823
1194079
1201247
1201503
1253445
1253701
1254725
1255749
1253702
1254726
1255750
1253703
1254727
1255751
1253704
1254728
1255752
1253705
1254729
1255753
1253706
1254730
1255754
1253707
1254731
1255755
1253708
1254732
1255756
1253709
1254733
1255757
1253710
1254734
1255758
1253711
1254735
1255759
1253712
1254736
1255760
1253713
1254737
1255761
1253714
1254738
1255762
1253715
1254739
1255763
1253716
1254740
1255764
1253717
1254741
1255765
1253718
1254742
1255766
1253719
1254743
1255767
1254747
1255771
1250816
1251072
1259264
1259520
1266688
1266944
1250911
1251167
1259359
1259615
1266783
1267039
1322052
1322564
1323588
1324100
1324356
1324612
1322053
1322565
1323589
1324101
1324357
1324613
1322054
1322566
1323590
1324102
1324358
1324614
1322055
1322567
1323591
1324103
1324359
1324615
1322056
1322568
1323592
1324104
1324360
1324616
1322057
1322569
1323593
1324105
1324361
1324617
1322058
1322570
1323594
1324106
1324362
1324618
1322059
1322571
1323595
1324107
1324363
1324619
1322060
1322572
1323596
1324108
1324364
1324620
1322061
1322573
1323597
1324109
1324365
1324621
1322062
1322574
1323598
1324110
1324366
1324622
1322063
1322575
1323599
1324111
1324367
1324623
1322064
1322576
1323600
1324112
1324368
1324624
1322065
1322577
1323601
1324113
1324369
1324625
1322066
1322578
1323602
1324114
1324370
1324626
1322067
1322579
1323603
1324115
1324371
1324627
1322068
1322580
1323604
1324116
1324372
1324628
1322069
1322581
1323605
1324117
1324373
1324629
1322070
1322582
1323606
1324118
1324374
1324630
1322071
1322583
1323607
1324119
1324375
1324631
1322072
1322584
1323608
1324120
1324376
1324632
1316352
1316608
1324800
1325056
1332224
1332480
1316447
1316703
1324895
1325151
1332319
1332575
1385797
1386053
1387077
1387333
1387589
1385798
1386054
1387078
1387334
1387590
1385799
1386055
1387079
1387335
1387591
1385800
1386056
1387080
1387336
1387592
1385801
1386057
1387081
1387337
1387593
1385802
1386058
1387082
1387338
1387594
1385803
1386059
1387083
1387339
1387595
1385804
1386060
1387084
1387340
1387596
1385805
1386061
1387085
1387341
1387597
1385806
1386062
1387086
1387342
1387598
1385807
1386063
1387087
1387343
1387599
1385808
1386064
1387088
1387344
1387600
1385809
1386065
1387089
1387345
1387601
1385810
1386066
1387090
1387346
1387602
1385811
1386067
1387091
1387347
1387603
1385812
1386068
1387092
1387348
1387604
1385813
1386069
1387093
1387349
1387605
1385814
1386070
1387094
1387350
1387606
1385815
1386071
1387095
1387351
1387607
1385816
1386072
1387096
1387352
1387608
1385819
1386075
1387099
1387355
1387611
1381888
1382144
1390336
1390592
1397760
1398016
1381983
1382239
1390431
1390687
1397855
1398111
1451845
1452101
1452357
1452613
1452869
1453125
1453381
1453637
1451846
1452102
1452358
1452614
1452870
1453126
1453382
1453638
1451858
1452114
1452370
1452626
1452882
1453138
1453394
1453650
1451859
1452115
1452371
1452627
1452883
1453139
1453395
1453651
1451865
1452121
1452377
1452633
1452889
1453145
1453401
1453657
1447424
1447680
1455872
1456128
1463296
1463552
1447519
1447775
1455967
1456223
1463391
1463647
1516612
1516868
1517124
1517636
1517892
1518404
1518660
1516613
1516869
1517125
1517637
1517893
1518405
1518661
1516614
1516870
1517126
1517638
1517894
1518406
1518662
1516615
1516871
1517127
1517639
1517895
1518407
1518663
1516616
1516872
1517128
1517640
1517896
1518408
1518664
1516617
1516873
1517129
1517641
1517897
1518409
1518665
1516618
1516874
1517130
1517642
1517898
1518410
1518666
1516619
1516875
1517131
1517643
1517899
1518411
1518667
1516620
1516876
1517132
1517644
1517900
1518412
1518668
1516621
1516877
1517133
1517645
1517901
1518413
1518669
1516622
1516878
1517134
1517646
1517902
1518414
1518670
1516623
1516879
1517135
1517647
1517903
1518415
1518671
1516624
1516880
1517136
1517648
1517904
1518416
1518672
1516625
1516881
1517137
1517649
1517905
1518417
1518673
1516626
1516882
1517138
1517650
1517906
1518418
1518674
1516627
1516883
1517139
1517651
1517907
1518419
1518675
1516628
1516884
1517140
1517652
1517908
1518420
1518676
1516629
1516885
1517141
1517653
1517909
1518421
1518677
1516630
1516886
1517142
1517654
1517910
1518422
1518678
1516631
1516887
1517143
1517655
1517911
1518423
1518679
1516632
1516888
1517144
1517656
1517912
1518424
1518680
1516633
1516889
1517145
1517657
1517913
1518425
1518681
1516634
1516890
1517146
1517658
1517914
1518426
1518682
1516635
1516891
1517147
1517659
1517915
1518427
1518683
1516636
1516892
1517148
1517660
1517916
1518428
1518684
1512960
1513216
1521408
1521664
1528832
1529088
1513055
1513311
1521503
1521759
1528927
1529183
1581381
1582149
1582405
1582661
1582917
1583173
1583429
1583685
1583941
1584197
1584453
1585221
1581382
1582150
1582406
1582662
1582918
1583174
1583430
1583686
1583942
1584198
1584454
1585222
1581383
1582151
1582407
1582663
1582919
1583175
1583431
1583687
1583943
1584199
1584455
1585223
1581384
1582152
1582408
1582664
1582920
1583176
1583432
1583688
1583944
1584200
1584456
1585224
1581385
1582153
1582409
1582665
1582921
1583177
1583433
1583689
1583945
1584201
1584457
1585225
1581386
1582154
1582410
1582666
1582922
1583178
1583434
1583690
1583946
1584202
1584458
1585226
1581387
1582155
1582411
1582667
1582923
1583179
1583435
1583691
1583947
1584203
1584459
1585227
1581388
1582156
1582412
1582668
1582924
1583180
1583436
1583692
1583948
1584204
1584460
1585228
1581389
1582157
1582413
1582669
1582925
1583181
1583437
1583693
1583949
1584205
1584461
1585229
1581390
1582158
1582414
1582670
1582926
1583182
1583438
1583694
1583950
1584206
1584462
1585230
1581391
1582159
1582415
1582671
1582927
1583183
1583439
1583695
1583951
1584207
1584463
1585231
1581392
1582160
1582416
1582672
1582928
1583184
1583440
1583696
1583952
1584208
1584464
1585232
1581393
1582161
1582417
1582673
1582929
1583185
1583441
1583697
1583953
1584209
1584465
1585233
1581394
1582162
1582418
1582674
1582930
1583186
1583442
1583698
1583954
1584210
1584466
1585234
1581395
1582163
1582419
1582675
1582931
1583187
1583443
1583699
1583955
1584211
1584467
1585235
1581396
1582164
1582420
1582676
1582932
1583188
1583444
1583700
1583956
1584212
1584468
1585236
1581397
1582165
1582421
1582677
1582933
1583189
1583445
1583701
1583957
1584213
1584469
1585237
1581398
1582166
1582422
1582678
1582934
1583190
1583446
1583702
1583958
1584214
1584470
1585238
1581399
1582167
1582423
1582679
1582935
1583191
1583447
1583703
1583959
1584215
1584471
1585239
1581401
1582169
1582425
1582681
1582937
1583193
1583449
1583705
1583961
1584217
1584473
1585241
1582171
1582427
1582683
1582939
1583195
1583451
1583707
1583963
1584219
1584475
1585243
1581404
1582172
1582428
1582684
1582940
1583196
1583452
1583708
1583964
1584220
1584476
1585244
1578496
1578752
1586944
1587200
1594368
1594624
1578591
1578847
1587039
1587295
1594463
1594719
1644032
1644288
1652480
1652736
1659904
1660160
1644127
1644383
1652575
1652831
1659999
1660255
1709568
1709824
1718016
1718272
1725440
1725696
1709663
1709919
1718111
1718367
1725535
1725791
1780804
1780805
1780806
1780807
1780808
1780809
1780810
1780811
1780812
1780813
1780814
1780815
1780816
1780817
1780818
1780819
1780820
1780821
1775104
1775360
1783552
1783808
1790976
1791232
1775199
1775455
1783647
1783903
1791071
1791327
1844549
1845317
1845573
1845829
1846085
1846341
1844550
1845318
1845574
1845830
1846086
1846342
1844551
1845319
1845575
1845831
1846087
1846343
1844552
1845320
1845576
1845832
1846088
1846344
1844553
1845321
1845577
1845833
1846089
1846345
1844554
1845322
1845578
1845834
1846090
1846346
1844555
1845323
1845579
1845835
1846091
1846347
1844556
1845324
1845580
1845836
1846092
1846348
1844557
1845325
1845581
1845837
1846093
1846349
1844558
1845326
1845582
1845838
1846094
1846350
1844559
1845327
1845583
1845839
1846095
1846351
1844560
1845328
1845584
1845840
1846096
1846352
1844561
1845329
1845585
1845841
1846097
1846353
1844562
1845330
1845586
1845842
1846098
1846354
1844563
1845331
1845587
1845843
1846099
1846355
1844564
1845332
1845588
1845844
1846100
1846356
1844565
1845333
1845589
1845845
1846101
1846357
1844566
1845334
1845590
1845846
1846102
1846358
1844567
1845335
1845591
1845847
1846103
1846359
1840640
1840896
1849088
1849344
1856512
1856768
1840735
1840991
1849183
1849439
1856607
1856863
1908805
1912901
1908806
1912902
1908807
1912903
1908808
1912904
1908809
1912905
1908810
1912906
1908811
1912907
1908812
1912908
1908813
1912909
1912910
1908815
1912911
1908816
1912912
1908818
1912914
1908819
1912915
1908820
1912916
1912918
1906176
1906432
1914624
1914880
1922048
1922304
1906271
1906527
1914719
1914975
1922143
1922399
1974853
1975621
1977413
1979717
1974854
1975622
1977414
1979718
1974855
1975623
1977415
1979719
1974856
1975624
1977416
1979720
1974857
1975625
1977417
1979721
1974858
1975626
1977418
1979722
1974859
1975627
1977419
1979723
1974860
1975628
1977420
1979724
1974861
1975629
1977421
1979725
1974862
1975630
1977422
1979726
1974863
1975631
1977423
1979727
1974864
1975632
1977424
1979728
1974865
1975633
1977425
1979729
1974866
1975634
1977426
1979730
1974867
1975635
1977427
1979731
1974868
1975636
1977428
1979732
1974869
1975637
1977429
1979733
1974870
1975638
1977430
1979734
1974871
1975639
1977431
1979735
1974872
1975640
1977432
1979736
1974873
1975641
1977433
1979737
1974874
1975642
1977434
1979738
1974875
1975643
1977435
1979739
1974876
1975644
1977436
1979740
1974877
1975645
1977437
1979741
1971712
1971968
1980160
1980416
1987584
1987840
1971807
1972063
1980255
1980511
1987679
1987935
2040389
2040645
2041925
2040390
2040646
2041926
2040391
2040647
2041927
2040392
2040648
2041928
2040393
2040649
2041929
2040394
2040650
2041930
2040395
2040651
2041931
2040396
2040652
2041932
2040397
2040653
2041933
2040398
2040654
2041934
2040399
2040655
2041935
2040400
2040656
2041936
2040401
2040657
2041937
2040402
2040658
2041938
2040403
2040659
2041939
2040404
2040660
2041940
2040405
2040661
2041941
2040406
2040662
2041942
2040407
2040663
2041943
2040408
2040664
2041944
2040409
2040665
2041945
2040410
2040666
2041946
2040411
2040667
2041947
2040412
2040668
2041948
2040413
2040669
2041949
2037248
2037504
2045696
2045952
2053120
2053376
2037343
2037599
2045791
2046047
2053215
2053471
2102784
2103040
2111232
2111488
2118656
2118912
2102879
2103135
2111327
2111583
2118751
2119007
2171461
2171462
2171463
2171464
2171465
2171466
2171467
2171468
2171469
2171470
2171471
2171472
2171473
2171474
2171475
2171476
2171477
2171478
2171479
2171480
2171481
2171482
2171483
2171484
2171485
2168320
2168576
2176768
2177024
2184192
2184448
2168415
2168671
2176863
2177119
2184287
2184543
2233856
2234112
2242304
2242560
2249728
2249984
2233951
2234207
2242399
2242655
2249823
2250079
2303301
2303302
2303303
2303304
2303305
2303306
2303307
2303308
2303309
2303310
2303311
2303312
2303313
2303314
2303315
2303316
2303317
2303318
2303319
2303320
2303321
2303322
2303323
2303325
2299392
2299648
2307840
2308096
2315264
2315520
2299487
2299743
2307935
2308191
2315359
2315615
2367813
2368069
2367814
2368070
2367815
2368071
2367816
2368072
2367817
2368073
2367818
2368074
2367819
2368075
2367820
2368076
2367821
2368077
2367822
2368078
2367823
2368079
2367824
2368080
2367825
2368081
2367826
2368082
2367827
2368083
2367828
2368084
2367829
2368085
2367830
2368086
2367831
2368087
2367832
2368088
2367833
2368089
2367834
2368090
2367835
2368091
2367836
2368092
2367837
2368093
2364928
2365184
2373376
2373632
2380800
2381056
2365023
2365279
2373471
2373727
2380895
2381151
2435141
2435142
2435143
2435144
2435145
2435146
2435147
2435148
2435149
2435150
2435151
2435153
2435154
2435155
2435156
2435159
2435160
2435161
2435164
2430464
2430720
2438912
2439168
2446336
2446592
2430559
2430815
2439007
2439263
2446431
2446687
2499909
2501189
2501957
2502213
2502725
2499910
2501190
2501958
2502214
2502726
2499911
2501191
2501959
2502215
2502727
2499912
2501192
2501960
2502216
2502728
2499913
2501193
2501961
2502217
2502729
2499914
2501194
2501962
2502218
2502730
2499915
2501195
2501963
2502219
2502731
2499916
2501196
2501964
2502220
2502732
2499917
2501197
2501965
2502221
2502733
2499918
2501198
2501966
2502222
2502734
2499919
2501199
2501967
2502223
2502735
2499920
2501200
2501968
2502224
2502736
2499921
2501201
2501969
2502225
2502737
2499922
2501202
2501970
2502226
2502738
2499923
2501203
2501971
2502227
2502739
2499924
2501204
2501972
2502228
2502740
2499925
2501205
2501973
2502229
2502741
2499926
2501206
2501974
2502230
2502742
2499927
2501207
2501975
2502231
2502743
2499928
2501208
2501976
2502232
2502744
2499929
2501209
2501977
2502233
2502745
2499930
2501210
2501978
2502234
2502746
2496000
2496256
2504448
2504704
2511872
2512128
2496095
2496351
2504543
2504799
2511967
2512223
2564165
2566981
2567493
2568261
2568517
2570053
2571333
2564166
2566982
2567494
2568262
2568518
2570054
2571334
2566985
2567497
2568265
2568521
2570057
2571337
2561536
2561792
2569984
2570240
2577408
2577664
2561631
2561887
2570079
2570335
2577503
2577759
2629956
2630212
2630468
2630724
2630980
2631748
2632004
2632260
2632516
2633028
2629701
2629957
2630213
2630469
2630725
2630981
2631749
2632005
2632261
2632517
2633029
2629702
2629958
2630214
2630470
2630726
2630982
2631750
2632006
2632262
2632518
2633030
2629704
2629960
2630216
2630472
2630728
2630984
2631752
2632008
2632264
2632520
2633032
2629705
2629961
2630217
2630473
2630729
2630985
2631753
2632009
2632265
2632521
2633033
2629962
2630218
2630474
2630730
2630986
2631754
2632010
2632266
2632522
2633034
2629707
2630219
2630475
2630731
2630987
2631755
2632011
2632267
2632523
2633035
2629708
2629964
2630220
2630476
2630732
2630988
2631756
2632012
2632268
2632524
2633036
2630223
2630479
2630735
2630991
2631759
2632015
2632271
2632527
2633039
2629712
2630224
2630480
2630736
2630992
2631760
2632016
2632272
2632528
2633040
2629969
2630225
2630481
2630737
2630993
2631761
2632017
2632273
2632529
2633041
2629970
2630482
2630738
2630994
2631762
2632018
2632274
2632530
2633042
2630227
2630483
2630739
2630995
2631763
2632019
2632275
2632531
2633043
2629717
2630741
2630997
2631765
2632021
2632277
2632533
2633045
2629974
2630742
2631766
2632022
2632278
2632534
2633046
2629719
2631767
2632023
2632279
2632535
2633047
2629720
2630745
2631769
2632025
2632281
2632537
2633049
2632026
2632282
2632538
2633050
2629723
2631771
2632027
2632283
2632539
2633051
2631772
2632284
2632540
2633052
2631262
2627072
2627328
2635520
2635776
2642944
2643200
2627167
2627423
2635615
2635871
2643039
2643295
2695748
2696004
2696260
2696516
2696772
2697028
2697540
2697796
2698052
2698308
2698564
2698820
2695749
2696005
2696261
2696517
2696773
2697029
2697541
2697797
2698053
2698309
2698565
2698821
2695750
2696006
2696262
2696518
2696774
2697030
2697542
2697798
2698054
2698310
2698566
2698822
2695751
2696007
2696263
2696519
2696775
2697031
2697543
2697799
2698055
2698311
2698567
2698823
2695752
2696008
2696264
2696520
2696776
2697032
2697544
2697800
2698056
2698312
2698568
2698824
2695753
2696009
2696265
2696521
2696777
2697033
2697545
2697801
2698057
2698313
2698569
2698825
2695754
2696010
2696266
2696522
2696778
2697034
2697546
2697802
2698058
2698314
2698570
2698826
2695755
2696011
2696267
2696523
2696779
2697035
2697547
2697803
2698059
2698315
2698571
2698827
2695756
2696012
2696268
2696524
2696780
2697036
2697548
2697804
2698060
2698316
2698572
2698828
2695757
2696013
2696269
2696525
2696781
2697037
2697549
2697805
2698061
2698317
2698573
2698829
2695758
2696014
2696270
2696526
2696782
2697038
2697550
2697806
2698062
2698318
2698574
2698830
2695759
2696015
2696271
2696527
2696783
2697039
2697551
2697807
2698063
2698319
2698575
2698831
2695760
2696016
2696272
2696528
2696784
2697040
2697552
2697808
2698064
2698320
2698576
2698832
2695761
2696017
2696273
2696529
2696785
2697041
2697553
2697809
2698065
2698321
2698577
2698833
2695762
2696018
2696274
2696530
2696786
2697042
2697554
2697810
2698066
2698322
2698578
2698834
2695763
2696019
2696275
2696531
2696787
2697043
2697555
2697811
2698067
2698323
2698579
2698835
2695764
2696020
2696276
2696532
2696788
2697044
2697556
2697812
2698068
2698324
2698580
2698836
2695765
2696021
2696277
2696533
2696789
2697045
2697557
2697813
2698069
2698325
2698581
2698837
2695766
2696022
2696278
2696534
2696790
2697046
2697558
2697814
2698070
2698326
2698582
2698838
2695767
2696023
2696279
2696535
2696791
2697047
2697559
2697815
2698071
2698327
2698583
2698839
2695768
2696024
2696280
2696536
2696792
2697048
2697560
2697816
2698072
2698328
2698584
2698840
2695769
2696025
2696281
2696537
2696793
2697049
2697561
2697817
2698073
2698329
2698585
2698841
2695770
2696026
2696282
2696538
2696794
2697050
2697562
2697818
2698074
2698330
2698586
2698842
2695771
2696027
2696283
2696539
2696795
2697051
2697563
2697819
2698075
2698331
2698587
2698843
2695772
2696028
2696284
2696540
2696796
2697052
2697564
2697820
2698076
2698332
2698588
2698844
2692608
2692864
2701056
2701312
2708480
2708736
2692703
2692959
2701151
2701407
2708575
2708831
2761285
2761541
2761797
2762309
2762565
2763077
2763333
2763845
2765125
2763078
2763334
2763846
2765126
2761288
2761544
2761800
2762312
2762568
2763080
2763336
2763848
2765128
2761289
2761545
2761801
2762313
2762569
2763081
2763337
2763849
2765129
2761290
2761546
2761802
2762314
2762570
2763082
2763338
2763850
2765130
2761294
2761550
2761806
2762318
2762574
2762830
2763086
2763342
2763854
2765134
2761040
2761296
2761552
2762320
2762576
2762832
2763088
2763344
2763856
2765136
2761041
2761297
2761553
2761809
2762321
2762577
2762833
2763089
2763345
2763857
2765137
2761042
2761298
2761554
2761810
2762322
2762578
2762834
2763090
2763346
2763858
2765138
2761043
2761299
2761555
2761811
2762323
2762579
2762835
2763091
2763347
2763859
2765139
2761044
2761300
2761556
2761812
2762324
2762580
2762836
2763092
2763348
2761816
2762328
2762584
2762840
2763096
2763352
2763608
2763864
2765144
2761049
2761817
2762329
2762585
2762841
2763097
2763353
2763609
2763865
2765145
2761818
2762330
2762586
2762842
2763098
2763354
2763610
2763866
2765146
2761819
2762331
2762587
2762843
2763099
2763355
2763611
2763867
2765147
2758144
2758400
2766592
2766848
2774016
2774272
2758239
2758495
2766687
2766943
2774111
2774367
2828356
2828868
2829636
2829892
2828357
2828869
2829637
2829893
2828358
2828870
2829638
2829894
2828359
2828871
2829639
2829895
2828360
2828872
2829640
2829896
2828361
2828873
2829641
2829897
2828362
2828874
2829642
2829898
2828363
2828875
2829643
2829899
2828364
2828876
2829644
2829900
2828365
2828877
2829645
2829901
2828366
2828878
2829646
2829902
2828367
2828879
2829647
2829903
2828368
2828880
2829648
2829904
2828369
2828881
2829649
2829905
2828370
2828882
2829650
2829906
2828371
2828883
2829651
2829907
2828372
2828884
2829652
2829908
2828373
2828885
2829653
2829909
2828374
2828886
2829654
2829910
2828375
2828887
2829655
2829911
2828376
2828888
2829656
2829912
2828377
2828889
2829657
2829913
2823680
2823936
2832128
2832384
2839552
2839808
2823775
2824031
2832223
2832479
2839647
2839903
2895942
2895943
2895944
2895946
2895949
2895950
2895952
2895954
2895955
2889216
2889472
2897664
2897920
2905088
2905344
2889311
2889567
2897759
2898015
2905183
2905439
2954752
2955008
2963200
2963456
2970624
2970880
2954847
2955103
2963295
2963551
2970719
2970975
3023429
3023685
3024197
3025733
3027269
3023430
3023686
3024198
3025734
3027270
3023431
3023687
3024199
3025735
3027271
3023432
3023688
3024200
3025736
3027272
3023433
3023689
3024201
3025737
3027273
3023434
3023690
3024202
3025738
3027274
3023435
3023691
3024203
3025739
3027275
3023436
3023692
3024204
3025740
3027276
3023437
3023693
3024205
3025741
3027277
3023438
3023694
3024206
3025742
3027278
3023439
3023695
3024207
3025743
3027279
3023440
3023696
3024208
3025744
3027280
3023441
3023697
3024209
3025745
3027281
3023442
3023698
3024210
3025746
3027282
3023443
3023699
3024211
3025747
3027283
3023444
3023700
3024212
3025748
3027284
3023445
3023701
3024213
3025749
3027285
3023446
3023702
3024214
3025750
3027286
3023447
3023703
3024215
3025751
3027287
3023448
3023704
3024216
3025752
3027288
3023449
3023705
3024217
3025753
3027289
3023450
3023706
3024218
3025754
3027290
3023451
3023707
3024219
3025755
3027291
3023452
3023708
3024220
3025756
3027292
3020288
3020544
3028736
3028992
3036160
3036416
3020383
3020639
3028831
3029087
3036255
3036511
3089731
3089987
3090755
3091011
3092035
3092547
3088452
3089476
3089988
3090244
3090756
3091012
3091268
3091524
3092548
3094340
3095108
3088453
3089477
3089989
3090245
3090501
3090757
3091781
3092549
3094341
3095109
3088454
3088710
3089478
3089734
3089990
3090758
3091782
3092038
3094342
3095110
3088455
3088711
3089479
3089735
3090503
3091015
3091271
3092039
3092551
3094343
3095111
3088456
3088712
3089224
3089480
3089736
3089992
3090248
3090504
3090760
3091016
3091272
3091528
3091784
3092040
3092552
3094344
3095112
3088457
3088713
3089737
3090761
3091017
3092553
3094345
3095113
3088458
3088714
3088970
3089226
3089994
3090250
3090506
3090762
3091786
3092554
3094346
3095114
3088459
3089227
3089739
3089995
3090251
3090507
3090763
3091019
3091531
3091787
3092555
3094347
3095115
3088716
3089740
3090252
3090508
3090764
3088461
3088973
3090253
3090509
3090765
3091021
3091789
3092557
3094349
3095117
3088974
3090254
3091022
3091278
3091534
3091790
3092558
3094350
3095118
3088463
3089743
3090255
3090511
3091023
3091279
3091791
3092559
3094351
3095119
3089232
3090256
3091024
3091280
3091536
3091792
3092560
3094352
3095120
3088465
3088721
3089234
3089490
3089746
3090002
3090258
3090770
3091026
3091282
3091538
3091794
3092562
3094354
3095122
3088467
3089491
3089747
3090003
3090259
3090771
3091027
3091283
3091539
3091795
3092563
3094355
3095123
3088468
3089236
3089748
3090004
3090260
3090772
3091028
3091284
3091540
3091796
3092564
3094356
3095124
3088469
3089237
3089493
3090005
3090261
3090773
3091029
3091285
3091541
3091797
3092565
3094357
3095125
3089238
3089494
3089750
3090006
3090262
3090774
3091542
3091798
3092566
3094358
3095126
3088471
3089239
3089495
3089751
3090007
3090263
3090775
3091543
3091799
3092567
3094359
3095127
3088472
3089240
3089496
3089752
3090008
3090264
3090776
3091032
3091288
3091544
3091800
3092568
3094360
3095128
3088473
3089241
3089497
3089753
3090009
3090265
3090777
3091033
3091289
3091545
3091801
3092569
3094361
3095129
3088474
3089242
3089498
3089754
3090010
3090266
3090778
3091034
3091290
3091546
3091802
3092570
3094362
3095130
3085824
3086080
3094272
3094528
3101696
3101952
3085919
3086175
3094367
3094623
3101791
3102047
3155268
3156548
3156804
3160644
3155269
3156549
3156805
3160645
3155270
3156550
3156806
3160646
3155271
3156551
3156807
3160647
3155272
3156552
3156808
3160648
3155273
3156553
3156809
3160649
3155274
3156554
3156810
3160650
3155275
3156555
3156811
3160651
3155276
3156556
3156812
3160652
3155277
3156557
3156813
3160653
3155278
3156558
3156814
3160654
3155279
3156559
3156815
3160655
3155280
3156560
3156816
3160656
3155281
3156561
3156817
3160657
3155282
3156562
3156818
3160658
3155283
3156563
3156819
3160659
3155284
3156564
3156820
3160660
3155285
3156565
3156821
3160661
3155286
3156566
3156822
3160662
3155287
3156567
3156823
3160663
3155288
3156568
3156824
3160664
3155289
3156569
3156825
3160665
3155290
3156570
3156826
3160666
3155291
3156571
3156827
3160667
3155292
3156572
3156828
3160668
3151360
3151616
3159808
3160064
3167232
3167488
3151455
3151711
3159903
3160159
3167327
3167583
3221060
3219781
3221061
3219782
3221062
3219783
3221063
3219784
3221064
3219785
3221065
3219786
3221066
3219787
3221067
3219788
3221068
3219789
3221069
3219790
3221070
3219791
3221071
3219792
3221072
3219793
3221073
3219794
3221074
3219795
3221075
3219796
3221076
3219797
3221077
3221078
3221079
3221080
3221081
3221082
3221083
3216896
3217152
3225344
3225600
3232768
3233024
3216991
3217247
3225439
3225695
3232863
3233119
3291972
3285061
3291973
3285062
3291974
3285063
3291975
3285064
3291976
3285065
3291977
3285066
3291978
3285067
3291979
3285068
3291980
3285069
3291981
3285070
3291982
3285071
3291983
3291985
3291986
3291987
3291988
3282432
3282688
3290880
3291136
3298304
3298560
3282527
3282783
3290975
3291231
3298399
3298655
3351877
3353413
3353669
3353925
3354181
3355205
3355461
3355717
3357509
3351878
3353414
3353670
3353926
3354182
3355206
3355462
3355718
3357510
3351879
3353415
3353671
3353927
3354183
3355207
3355463
3355719
3357511
3351880
3353416
3353672
3353928
3354184
3355208
3355464
3355720
3357512
3351881
3353417
3353673
3353929
3354185
3355209
3355465
3355721
3357513
3351882
3353418
3353674
3353930
3354186
3355210
3355466
3355722
3357514
3351883
3353419
3353675
3353931
3354187
3355211
3355467
3355723
3357515
3351885
3353421
3353677
3353933
3354189
3355213
3355469
3355725
3357517
3351886
3353422
3353678
3353934
3354190
3355214
3355470
3355726
3357518
3351887
3353423
3353679
3353935
3354191
3355215
3355471
3355727
3357519
3351889
3353425
3353681
3353937
3354193
3355217
3355473
3355729
3357521
3351890
3353426
3353682
3353938
3354194
3355218
3355474
3355730
3357522
3351891
3353427
3353683
3353939
3354195
3355219
3355475
3355731
3357523
3351892
3353428
3353684
3353940
3354196
3355220
3355476
3355732
3357524
3351893
3353429
3353685
3353941
3354197
3355221
3355477
3355733
3357525
3351894
3353430
3353686
3353942
3354198
3355222
3355478
3355734
3357526
3351895
3353431
3353687
3353943
3354199
3355223
3355479
3355735
3357527
3351896
3353432
3353688
3353944
3354200
3355224
3355480
3355736
3357528
3351897
3353433
3353689
3353945
3354201
3355225
3355481
3355737
3357529
3351898
3353434
3353690
3353946
3354202
3355226
3355482
3355738
3357530
3351899
3353435
3353691
3353947
3354203
3355227
3355483
3355739
3357531
3351900
3353436
3353692
3353948
3354204
3355228
3355484
3355740
3357532
3347968
3348224
3356416
3356672
3363840
3364096
3348063
3348319
3356511
3356767
3363935
3364191
3422533
3422534
3422535
3422536
3422537
3422538
3422539
3422540
3422541
3422542
3422543
3422544
3422545
3422546
3422547
3422548
3422550
3422551
3422552
3422553
3422554
3422555
3422556
3413504
3413760
3421952
3422208
3429376
3429632
3413599
3413855
3422047
3422303
3429471
3429727
3479040
3479296
3487488
3487744
3494912
3495168
3479135
3479391
3487583
3487839
3495007
3495263
