1064752
1128231
1129770
1259564
1387567
1522735
1584676
1583654
1585707
1653808
2700080
2700081
3029039
3029040
3090737
3090993
3090740
3090485
3090997
3090742
3092022
3092534
3091255
3091511
3092535
3091256
3094329
