17702
17958
18214
18470
18726
18982
19238
19750
20006
20262
20518
5632
5888
14080
14336
21504
21760
5727
5983
14175
14431
21599
21855
83752
84008
84264
84520
84776
85032
85288
85544
85800
86312
86568
86824
87080
87336
87592
87848
88104
71168
71424
79616
79872
87040
87296
71263
71519
79711
79967
87135
87391
149307
149563
149819
150075
150587
150843
151099
151355
151867
152123
152379
152635
152891
153147
153403
153659
136704
136960
145152
145408
152576
152832
136799
137055
145247
145503
152671
152927
214832
216368
217392
217648
217904
218160
218416
218672
218928
219184
213297
214833
216369
217393
217649
217905
218161
218417
218673
218929
219185
202240
202496
210688
210944
218112
218368
202335
202591
210783
211039
218207
218463
279088
279344
279600
280368
281904
282160
282416
282672
282928
283184
283440
283696
283952
284208
284464
284720
279089
279345
279601
280369
281905
282161
282417
282673
282929
283185
283441
283697
283953
284209
284465
284721
279099
279355
279611
280379
281915
282171
282427
282683
282939
283195
283451
283707
283963
284219
284475
284731
279360
267776
268032
276224
276480
283648
283904
267871
268127
276319
276575
283743
283999
345902
346158
346670
346926
347438
347694
347950
348206
348462
348718
348974
349230
349486
349742
349998
350254
333312
333568
341760
342016
349184
349440
333407
333663
341855
342111
349279
349535
409381
409382
409383
409384
409385
409386
409387
409388
409389
409390
412974
409391
409392
414256
414512
409393
412977
409394
409395
412979
409396
409397
412469
412981
413237
413493
413749
414005
414261
414517
414773
415029
415285
409398
409399
412215
412471
412983
413239
413495
413751
414007
414263
414519
414775
415031
415287
409400
411448
411704
411960
412216
412472
412984
413240
413496
413752
414008
414264
414520
414776
415032
415288
409401
411449
411705
411961
412217
412473
412985
413241
413497
413753
414009
414265
414521
414777
415033
415289
409402
411450
411706
411962
412218
412474
412986
413242
413498
413754
414010
414266
414522
414778
415034
415290
409403
409404
409405
411453
411709
411965
412221
412477
412989
413245
413501
413757
414013
414269
414525
414781
415037
415293
409406
411454
411710
411966
412222
412478
412990
413246
413502
413758
414014
414270
414526
414782
415038
415294
409407
411455
411711
411967
412223
412479
412991
413247
413503
413759
414015
414271
414527
414783
415039
415295
409408
398848
399104
407296
407552
414720
414976
398943
399199
407391
407647
414815
415071
476968
477224
477480
477736
477992
478248
478504
478760
479016
479272
479528
479784
480040
480296
480552
480808
481064
481320
476980
477236
477492
477748
478004
478260
478516
478772
479028
479284
479540
479796
480052
480308
480564
480820
481076
481332
476986
477242
477498
477754
478010
478266
478522
478778
479034
479290
479546
479802
480058
480314
480570
480826
481082
481338
464384
464640
472832
473088
480256
480512
464479
464735
472927
473183
480351
480607
542504
544808
545064
545320
545576
545832
546088
546344
546600
546856
542505
544809
545065
545321
545577
545833
546089
546345
546601
546857
542506
544810
545066
545322
545578
545834
546090
546346
546602
546858
542507
544811
545067
545323
545579
545835
546091
546347
546603
542508
544812
545068
545324
545580
545836
546092
546348
546604
542509
544813
545069
545325
545581
545837
546093
546349
546605
546861
542510
544814
545070
545326
545582
545838
546094
546350
546606
546862
542511
544815
545071
545327
545583
545839
546095
546351
546607
546863
529920
530176
538368
538624
545792
546048
530015
530271
538463
538719
545887
546143
595456
595712
603904
604160
611328
611584
595551
595807
603999
604255
611423
611679
673068
673580
673836
674092
674348
675116
675372
675628
675884
676140
676396
676908
677164
677420
677676
677932
673586
673842
674098
674354
675122
675378
675634
675890
676146
676402
676914
677170
677426
677682
677938
660992
661248
669440
669696
676864
677120
661087
661343
669535
669791
676959
677215
726528
726784
734976
735232
742400
742656
726623
726879
735071
735327
742495
742751
792064
792320
800512
800768
807936
808192
792159
792415
800607
800863
808031
808287
857600
857856
866048
866304
873472
873728
857695
857951
866143
866399
873567
873823
934195
935219
935987
936243
936499
936755
937011
937267
937523
937779
938035
938291
938547
939059
939315
923136
923392
931584
931840
939008
939264
923231
923487
931679
931935
939103
939359
1003576
1003832
1004088
1004344
1004600
1004856
1005112
1005368
1005624
1003577
1003833
1004089
1004345
1004601
1004857
1005113
1005369
1005625
1003578
1003834
1004090
1004346
1004602
1004858
1005114
1005370
1005626
1003579
1003835
1004091
1004347
1004603
1004859
1005115
1005371
1005627
1003580
1003836
1004092
1004348
1004604
1004860
1005116
1005372
1005628
1003581
1003837
1004093
1004349
1004605
1004861
1005117
1005373
1005629
1003582
1003838
1004094
1004350
1004606
1004862
1005118
1005374
1005630
1003583
1003839
1004095
1004351
1004607
1004863
1005119
1005375
1005631
988672
988928
997120
997376
1004544
1004800
988767
989023
997215
997471
1004639
1004895
1067056
1067312
1067568
1067824
1068080
1068336
1068592
1068848
1069104
1069360
1069616
1069872
1070128
1070384
1070640
1070896
1071152
1054208
1054464
1062656
1062912
1070080
1070336
1054303
1054559
1062751
1063007
1070175
1070431
1130796
1131052
1131308
1131564
1131820
1132332
1132588
1132844
1133100
1133356
1133868
1134636
1136428
1130800
1131056
1131312
1131568
1131824
1132336
1132592
1132848
1133104
1133360
1133872
1134640
1136432
1119744
1120000
1128192
1128448
1135616
1135872
1119839
1120095
1128287
1128543
1135711
1135967
1196849
1197361
1197873
1198641
1198897
1199409
1199665
1199921
1200177
1200433
1200689
1201201
1201457
1199412
1199668
1199924
1200180
1200436
1200692
1201204
1201460
1202484
1185280
1185536
1193728
1193984
1201152
1201408
1185375
1185631
1193823
1194079
1201247
1201503
1264937
1265193
1265449
1265705
1265961
1266217
1266473
1266729
1266985
1267241
1267497
1267753
1264941
1265197
1265453
1265709
1265965
1266221
1266477
1266733
1266989
1267245
1267501
1267757
1264942
1265198
1265454
1265710
1265966
1266222
1266478
1266734
1266990
1267246
1267502
1267758
1264955
1265211
1265467
1265723
1265979
1266235
1266491
1266747
1267003
1267259
1267515
1267771
1250816
1251072
1259264
1259520
1266688
1266944
1250911
1251167
1259359
1259615
1266783
1267039
1328956
1329212
1329468
1329724
1329980
1330492
1330748
1331004
1331260
1331516
1331772
1332284
1332540
1328957
1329213
1329469
1329725
1329981
1330493
1330749
1331005
1331261
1331517
1331773
1332285
1332541
1316352
1316608
1324800
1325056
1332224
1332480
1316447
1316703
1324895
1325151
1332319
1332575
1381888
1382144
1390336
1390592
1397760
1398016
1381983
1382239
1390431
1390687
1397855
1398111
1447424
1447680
1455872
1456128
1463296
1463552
1447519
1447775
1455967
1456223
1463391
1463647
1524015
1525807
1526063
1526319
1526575
1527087
1527343
1527599
1527855
1528111
1528367
1528623
1528879
1529135
1529391
1529903
1512960
1513216
1521408
1521664
1528832
1529088
1513055
1513311
1521503
1521759
1528927
1529183
1594624
1594625
1589543
1592615
1592871
1593127
1593383
1593639
1593895
1594151
1594407
1594663
1594919
1595175
1595431
1589544
1592616
1592872
1593128
1593384
1593640
1593896
1594152
1594408
1594664
1594920
1595176
1595432
1589552
1592624
1592880
1593136
1593392
1593648
1593904
1594160
1594416
1594672
1594928
1595184
1595440
1592625
1592881
1593137
1593393
1593649
1593905
1594161
1594417
1594673
1594929
1595185
1595441
1589554
1592626
1592882
1593138
1593394
1593650
1593906
1594162
1594418
1594674
1594930
1595186
1595442
1589555
1592627
1592883
1593139
1593395
1593651
1593907
1594163
1594419
1594675
1594931
1595187
1595443
1592628
1592884
1593140
1593396
1593652
1593908
1594164
1594420
1594676
1594932
1595188
1595444
1589563
1592635
1592891
1593147
1593403
1593659
1593915
1594171
1594427
1594683
1594939
1595195
1595451
1589564
1592636
1592892
1593148
1593404
1593660
1593916
1594172
1594428
1594684
1594940
1595196
1595452
1589565
1592637
1592893
1593149
1593405
1593661
1593917
1594173
1594429
1594685
1594941
1595197
1595453
1589566
1592638
1592894
1593150
1593406
1593662
1593918
1594174
1594430
1594686
1594942
1595198
1595454
1578496
1578752
1586944
1587200
1594368
1594624
1578591
1578847
1587039
1587295
1594463
1594719
1657382
1658150
1658406
1658662
1658918
1659174
1659430
1659686
1657383
1658151
1658407
1658663
1658919
1659175
1659431
1659687
1659943
1660199
1660455
1660711
1660967
1657384
1658152
1658408
1658664
1658920
1659176
1659432
1659688
1659944
1660200
1660456
1660712
1660968
1657385
1658153
1658409
1658665
1658921
1659177
1659433
1659689
1659945
1660201
1660457
1660713
1660969
1657386
1658154
1658410
1658666
1658922
1659178
1659434
1659690
1659946
1660202
1660458
1660714
1660970
1657387
1658155
1658411
1658667
1658923
1659179
1659435
1659691
1659947
1660203
1660459
1660715
1660971
1657388
1658156
1658412
1658668
1658924
1659180
1659436
1659692
1659948
1660204
1660460
1660716
1660972
1657389
1658157
1658413
1658669
1658925
1659181
1659437
1659693
1659949
1660205
1660461
1660717
1660973
1657390
1658158
1658414
1658670
1658926
1659182
1659438
1659694
1659950
1660206
1660462
1660718
1660974
1657391
1658159
1658415
1658671
1658927
1659183
1659439
1659695
1659951
1660207
1660463
1660719
1660975
1657393
1658161
1658417
1658673
1658929
1659185
1659441
1659697
1659953
1660209
1660465
1660721
1660977
1657394
1658162
1658418
1658674
1658930
1659186
1659442
1659698
1659954
1660210
1660466
1660722
1660978
1657395
1658163
1658419
1658675
1658931
1659187
1659443
1659699
1659955
1660211
1660467
1660723
1660979
1657396
1658164
1658420
1658676
1658932
1659188
1659444
1659700
1659956
1660212
1660468
1660724
1660980
1657397
1658165
1658421
1658677
1658933
1659189
1659445
1659701
1659957
1660213
1660469
1660725
1660981
1657398
1658166
1658422
1658678
1658934
1659190
1659446
1659702
1659958
1660214
1660470
1660726
1660982
1657399
1658167
1658423
1658679
1658935
1659191
1659447
1659703
1659959
1660215
1660471
1660727
1660983
1657400
1658168
1658424
1658680
1658936
1659192
1659448
1659704
1659960
1660216
1660472
1660728
1660984
1657401
1658169
1658425
1658681
1658937
1659193
1659449
1659705
1659961
1660217
1660473
1660729
1660985
1657402
1658170
1658426
1658682
1658938
1659194
1659450
1659706
1659962
1660218
1660474
1660730
1660986
1657403
1658171
1658427
1658683
1658939
1659195
1659451
1659707
1659963
1660219
1660475
1660731
1660987
1657404
1658172
1658428
1658684
1658940
1659196
1659452
1659708
1659964
1660220
1660476
1660732
1660988
1644032
1644288
1652480
1652736
1659904
1660160
1644127
1644383
1652575
1652831
1659999
1660255
1720619
1720875
1724715
1724971
1725483
1725739
1725995
1726251
1726507
1720620
1720876
1724716
1724972
1725484
1725740
1725996
1726252
1726508
1720621
1720877
1724717
1724973
1725485
1725741
1725997
1726253
1726509
1720622
1720878
1724718
1724974
1725486
1725742
1725998
1726254
1726510
1720633
1720889
1724729
1724985
1725497
1725753
1726009
1726265
1726521
1720634
1720890
1724730
1724986
1725498
1725754
1726010
1726266
1726522
1720635
1720891
1724731
1724987
1725499
1725755
1726011
1726267
1726523
1720636
1720892
1724732
1724988
1725500
1725756
1726012
1726268
1726524
1709568
1709824
1718016
1718272
1725440
1725696
1709663
1709919
1718111
1718367
1725535
1725791
1787673
1787687
1789223
1789479
1789735
1789991
1790247
1790503
1791015
1791271
1791527
1791783
1792039
1787688
1789224
1789480
1789736
1789992
1790248
1790504
1791016
1791272
1791528
1791784
1792040
1787434
1789226
1789482
1789738
1789994
1790250
1790506
1791018
1791274
1791530
1791786
1792042
1789227
1789483
1789739
1789995
1790251
1790507
1791019
1791275
1791531
1791787
1792043
1775104
1775360
1783552
1783808
1790976
1791232
1775199
1775455
1783647
1783903
1791071
1791327
1851695
1855023
1855279
1855535
1855791
1856047
1856559
1856815
1857071
1857327
1857583
1851696
1855024
1855280
1855536
1855792
1856048
1856560
1856816
1857072
1857328
1857584
1851697
1855025
1855281
1855537
1855793
1856049
1856561
1856817
1857073
1857329
1857585
1851698
1855026
1855282
1855538
1855794
1856050
1856562
1856818
1857074
1857330
1857586
1851699
1855027
1855283
1855539
1855795
1856051
1856563
1856819
1857075
1857331
1857587
1851700
1855028
1855284
1855540
1855796
1856052
1856564
1856820
1857076
1857332
1857588
1851701
1855029
1855285
1855541
1855797
1856053
1856565
1856821
1857077
1857333
1857589
1851702
1855030
1855286
1855542
1855798
1856054
1856566
1856822
1857078
1857334
1857590
1851703
1855031
1855287
1855543
1855799
1856055
1856567
1856823
1857079
1857335
1857591
1851705
1855033
1855289
1855545
1855801
1856057
1856569
1856825
1857081
1857337
1857593
1851706
1855034
1855290
1855546
1855802
1856058
1856570
1856826
1857082
1857338
1857594
1851707
1855035
1855291
1855547
1855803
1856059
1856571
1856827
1857083
1857339
1857595
1851708
1855036
1855292
1855548
1855804
1856060
1856572
1856828
1857340
1857596
1851710
1855038
1855294
1855550
1855806
1856574
1856830
1857086
1857342
1857598
1840640
1840896
1849088
1849344
1856512
1856768
1840735
1840991
1849183
1849439
1856607
1856863
1906176
1906432
1914624
1914880
1922048
1922304
1906271
1906527
1914719
1914975
1922143
1922399
1971712
1971968
1980160
1980416
1987584
1987840
1971807
1972063
1980255
1980511
1987679
1987935
2048563
2052659
2053171
2053427
2053683
2053939
2054195
2048308
2048564
2052660
2053172
2053428
2053684
2053940
2054196
2037248
2037504
2045696
2045952
2053120
2053376
2037343
2037599
2045791
2046047
2053215
2053471
2110720
2110465
2110721
2117182
2117438
2117694
2117950
2118206
2118974
2119230
2119486
2119742
2117183
2117439
2117695
2117951
2118207
2118975
2119231
2119487
2119743
2102784
2103040
2111232
2111488
2118656
2118912
2102879
2103135
2111327
2111583
2118751
2119007
2179380
2179636
2183476
2183732
2184244
2184500
2185268
2168320
2168576
2176768
2177024
2184192
2184448
2168415
2168671
2176863
2177119
2184287
2184543
2233856
2234112
2242304
2242560
2249728
2249984
2233951
2234207
2242399
2242655
2249823
2250079
2299392
2299648
2307840
2308096
2315264
2315520
2299487
2299743
2307935
2308191
2315359
2315615
2376233
2377769
2380585
2380841
2381609
2376236
2377772
2380588
2380844
2381612
2376252
2377788
2380604
2380860
2381116
2381628
2364928
2365184
2373376
2373632
2380800
2381056
2365023
2365279
2373471
2373727
2380895
2381151
2441520
2442544
2443312
2445104
2445616
2445872
2446384
2446640
2446896
2447408
2430464
2430720
2438912
2439168
2446336
2446592
2430559
2430815
2439007
2439263
2446431
2446687
2507305
2508329
2512425
2512681
2512937
2507311
2512175
2512431
2512687
2512943
2496000
2496256
2504448
2504704
2511872
2512128
2496095
2496351
2504543
2504799
2511967
2512223
2578224
2572849
2573105
2578225
2572601
2572857
2573113
2578233
2572603
2572859
2573115
2578235
2561536
2561792
2569984
2570240
2577408
2577664
2561631
2561887
2570079
2570335
2577503
2577759
2644007
2644011
2644013
2644019
2627072
2627328
2635520
2635776
2642944
2643200
2627167
2627423
2635615
2635871
2643039
2643295
2707239
2709031
2709287
2709543
2707242
2709034
2709290
2709546
2707248
2709040
2709296
2709552
2707250
2709042
2709298
2709554
2709044
2709300
2709556
2707254
2709046
2709302
2709558
2692608
2692864
2701056
2701312
2708480
2708736
2692703
2692959
2701151
2701407
2708575
2708831
2773545
2773558
2758144
2758400
2766592
2766848
2774016
2774272
2758239
2758495
2766687
2766943
2774111
2774367
2840103
2840359
2840615
2840106
2840362
2840618
2840108
2840364
2840620
2840110
2840366
2840622
2840114
2840370
2840626
2840118
2840374
2840630
2840121
2840377
2840633
2840122
2840378
2840634
2840126
2840382
2840638
2823680
2823936
2832128
2832384
2839552
2839808
2823775
2824031
2832223
2832479
2839647
2839903
2902310
2902822
2902311
2902823
2902319
2902831
2902320
2902832
2903606
2903609
2903610
2903611
2903612
2903613
2903614
2889216
2889472
2897664
2897920
2905088
2905344
2889311
2889567
2897759
2898015
2905183
2905439
2968615
2968871
2969383
2971431
2968616
2968872
2969384
2971432
2968617
2969385
2971433
2968874
2969386
2971434
2968619
2971435
2968621
2968877
2969389
2971437
2968630
2968886
2969398
2971446
2968631
2968887
2969399
2971447
2968632
2968888
2969400
2971448
2968633
2968889
2969401
2971449
2968634
2968890
2969402
2971450
2968637
2968893
2969405
2971453
2968638
2968894
2969406
2971454
2954752
2955008
2963200
2963456
2970624
2970880
2954847
2955103
2963295
2963551
2970719
2970975
3035194
3035450
3035706
3035962
3036218
3036474
3036730
3036986
3035195
3035451
3035707
3035963
3036219
3036475
3036731
3036987
3035196
3035452
3035708
3035964
3036220
3036476
3036732
3036988
3020288
3020544
3028736
3028992
3036160
3036416
3020383
3020639
3028831
3029087
3036255
3036511
3096615
3097127
3097383
3097639
3097895
3098151
3098663
3098919
3099175
3099431
3099687
3099943
3100199
3100455
3100711
3100967
3102247
3102503
3102759
3096616
3097128
3097384
3097640
3097896
3098152
3100712
3100968
3102248
3102504
3102760
3096617
3097129
3097385
3097641
3097897
3098153
3100713
3100969
3102249
3102505
3102761
3096618
3097130
3097386
3097642
3097898
3098154
3100714
3100970
3102250
3102506
3102762
3096619
3097131
3097387
3097643
3097899
3098155
3100715
3100971
3102251
3102507
3102763
3096620
3097132
3097388
3097644
3097900
3098156
3100716
3100972
3102252
3102508
3102764
3096621
3097133
3097389
3097645
3097901
3098157
3100717
3100973
3102253
3102509
3102765
3096622
3097134
3097390
3097646
3097902
3098158
3100718
3100974
3102254
3102510
3102766
3096623
3097135
3097391
3097647
3097903
3098159
3100719
3100975
3102255
3102511
3102767
3096625
3097649
3097905
3098161
3098673
3098929
3099185
3099441
3099697
3099953
3100209
3100465
3100721
3100977
3102257
3102513
3102769
3096626
3097138
3098418
3098674
3098930
3099186
3099442
3099698
3099954
3100210
3100466
3100722
3100978
3102258
3102514
3102770
3096627
3097139
3097395
3097651
3098419
3098675
3098931
3099187
3099443
3099699
3099955
3100211
3100467
3100723
3100979
3102259
3102515
3102771
3096628
3097140
3097396
3097652
3096629
3097653
3098933
3099189
3099701
3099957
3100469
3100725
3100981
3102261
3102517
3102773
3096630
3097142
3097910
3098166
3098934
3099190
3099446
3099702
3100470
3100726
3100982
3102262
3102518
3102774
3097143
3097655
3098167
3098423
3098679
3099447
3099703
3099959
3100215
3100471
3102263
3102519
3102775
3097144
3097400
3097912
3098424
3098680
3099192
3099704
3099960
3100216
3100472
3100728
3100984
3102264
3102520
3102776
3096633
3097145
3097913
3099449
3099961
3100217
3100473
3100729
3100985
3102265
3102521
3102777
3096634
3096890
3097146
3097658
3098170
3098426
3098682
3098938
3099706
3099962
3100218
3100474
3100730
3100986
3102266
3102522
3102778
3096635
3096891
3097403
3098683
3098939
3099195
3099451
3099707
3099963
3100219
3100475
3100731
3100987
3102267
3102523
3102779
3096636
3096892
3098172
3098428
3098684
3099196
3099452
3099708
3099964
3100220
3100476
3100732
3100988
3102268
3102524
3102780
3096637
3097149
3097405
3097661
3097917
3098173
3098429
3098685
3098941
3099197
3099453
3099709
3099965
3100221
3100477
3100733
3100989
3102269
3102525
3102781
3096638
3096894
3097918
3098174
3098430
3098686
3098942
3099198
3099454
3099710
3099966
3100222
3100478
3100734
3100990
3102270
3102526
3102782
3096639
3096895
3098687
3098943
3099199
3099455
3099711
3099967
3100223
3100479
3100735
3100991
3102271
3102527
3102783
3096896
3097664
3097920
3098432
3098944
3099200
3099456
3099712
3085824
3086080
3094272
3094528
3101696
3101952
3085919
3086175
3094367
3094623
3101791
3102047
3167796
3168308
3168564
3167803
3168315
3168571
3167804
3168316
3168572
3151360
3151616
3159808
3160064
3167232
3167488
3151455
3151711
3159903
3160159
3167327
3167583
3233843
3233844
3233847
3233848
3233849
3233850
3233851
3233852
3233853
3233854
3233855
3216896
3217152
3225344
3225600
3232768
3233024
3216991
3217247
3225439
3225695
3232863
3233119
3293222
3293478
3293734
3298854
3299366
3299622
3293223
3293479
3293735
3298855
3299367
3299623
3293224
3293480
3293736
3298856
3299368
3299624
3293481
3293737
3298857
3299369
3299625
3293226
3293482
3293738
3298858
3299370
3299626
3293227
3293483
3293739
3298859
3299371
3299627
3293228
3293484
3293740
3298860
3299372
3299628
3293229
3293485
3293741
3298861
3299373
3299629
3293230
3293486
3293742
3298862
3299374
3299630
3293231
3293487
3293743
3298863
3299375
3299631
3293233
3293489
3293745
3298865
3299377
3299633
3293236
3293492
3293748
3298868
3299380
3299636
3293242
3293498
3293754
3298874
3299386
3299642
3293243
3293499
3293755
3298875
3299387
3299643
3293244
3293500
3293756
3298876
3299388
3299644
3282432
3282688
3290880
3291136
3298304
3298560
3282527
3282783
3290975
3291231
3298399
3298655
3359016
3364648
3364904
3359018
3364650
3364906
3359020
3364652
3364908
3359027
3364659
3364915
3359028
3364660
3364916
3359035
3364667
3364923
3347968
3348224
3356416
3356672
3363840
3364096
3348063
3348319
3356511
3356767
3363935
3364191
3424037
3424038
3424039
3424040
3424041
3424042
3424043
3424044
3424045
3424046
3424047
3424048
3424049
3424050
3424051
3424052
3424053
3424054
3424055
3424056
3424057
3424058
3424059
3424060
3424061
3424062
3424063
3424064
3413504
3413760
3421952
3422208
3429376
3429632
3413599
3413855
3422047
3422303
3429471
3429727
3479040
3479296
3487488
3487744
3494912
3495168
3479135
3479391
3487583
3487839
3495007
3495263
