0 0 0.71428572645 0.800000011921 1.75
0 1 0.77536564233 0.898276627064 1.43576490879
0 2 0.769230797446 0.899999976158 1.44444441795
1 0 0.624999990687 0.800000011921 2.0
1 1 0.645563572783 0.940026581287 1.64786195755
1 2 0.692307705005 0.777777791023 1.85714280605
2 0 0.600000014305 1.0 1.66666662693
2 1 0.678230570685 0.931033372879 1.58364343643
2 2 0.611111115158 0.818181812763 2.0
3 0 0.437499980442 1.0 2.28571438789
3 1 0.622035931465 0.928932845592 1.73061394691
3 2 0.733333327505 0.909090936184 1.5
4 0 0.71428572645 1.0 1.39999997616
4 1 0.720877082608 0.899598538876 1.54202020168
4 2 0.899999957085 0.777777791023 1.42857146263
5 0 1.0 0.833333313465 1.20000004768
5 1 0.637777035228 0.929021239281 1.68773972988
5 2 0.874999960884 0.714285731316 1.60000002384
6 0 8.0 0.125 1.0
6 1 0.603556465637 0.924036443233 1.79305243492
6 2 1.16666665508 0.714285731316 1.20000004768
7 0 0.444444444444 1.0 2.25
7 1 0.682273448847 0.883224189281 1.65947461128
7 2 0.666666666667 0.833333313465 1.79999995232
8 0 0.41666665011 1.0 2.40000009537
8 1 0.694759772416 0.902055382729 1.59562969208
8 2 1.0 0.800000011921 1.25
9 0 0.624999990687 1.0 1.60000002384
9 1 0.72439876799 0.900234043598 1.53344023228
9 2 0.461538444609 1.0 2.16666674614
10 0 0.470588235294 0.875 2.42857146263
10 1 0.663894572193 0.918404638767 1.64008677006
10 2 0.83333330022 1.0 1.20000004768
11 0 0.727272727273 0.75 1.83333337307
11 1 0.688030933886 0.909573435783 1.59791719913
11 2 1.0 0.800000011921 1.25
12 0 0.8 0.875 1.42857146263
12 1 0.579531075343 0.951041400433 1.81436169147
12 2 1.0 0.800000011921 1.25
13 0 0.615384615385 1.0 1.625
13 1 0.696669508343 0.921766757965 1.55722773075
13 2 1.24999998137 0.800000011921 1.0
14 0 0.615384615385 0.875 1.85714280605
14 1 0.736731667312 0.891983091831 1.52171742916
14 2 0.71428572645 1.0 1.39999997616
15 0 0.727272727273 0.875 1.57142853737
15 1 0.880033427936 0.813115298748 1.39749002457
15 2 0.5 0.800000011921 2.5
16 0 1.0 0.714285731316 1.39999997616
16 1 0.610593480342 0.94281232357 1.73709106445
16 2 0.83333330022 0.800000011921 1.5
17 0 0.571428571429 1.0 1.75
17 1 0.653644082152 0.93597215414 1.63454079628
17 2 0.8 1.0 1.25
18 0 0.8 0.875 1.42857146263
18 1 0.599315523826 0.946119725704 1.76359295845
18 2 0.5 1.0 2.0
19 0 0.545454533632 0.833333313465 2.20000004768
19 1 0.723083429057 0.905153036118 1.52788114548
19 2 0.461538444609 0.833333313465 2.59999990463
20 0 0.818181827049 0.777777791023 1.57142853737
20 1 0.691845727606 0.923196971416 1.56565606594
20 2 1.20000002861 0.833333313465 1.0
21 0 1.33333333333 0.5 1.5
21 1 0.602105248954 0.948238670826 1.75149905682
21 2 0.857142886337 1.0 1.16666662693
22 0 0.600000014305 0.666666686535 2.5
22 1 0.782560283 0.867121756077 1.47367632389
22 2 0.71428572645 1.0 1.39999997616
23 0 0.5 1.0 2.0
23 1 0.653567132599 0.938778877258 1.6298456192
23 2 0.624999990687 1.0 1.60000002384
24 0 4.49999996647 0.222222223878 1.0
24 1 0.647757953147 0.911819756031 1.69308304787
24 2 1.0 0.800000011921 1.25
25 0 0.588235277618 0.899999976158 1.88888883591
25 1 0.685568000711 0.943424999714 1.54611599445
25 2 0.624999990687 1.0 1.60000002384
26 0 0.692307705005 1.0 1.44444441795
26 1 1.00885910851 0.751980245113 1.31814455986
26 2 0.5 1.0 2.0
27 0 0.699999983311 1.0 1.42857146263
27 1 0.681331339303 0.90840369463 1.61570751667
27 2 0.454545444693 0.800000011921 2.75
28 0 0.624999990687 1.0 1.60000002384
28 1 0.771073138726 0.870382010937 1.49002838135
28 2 0.363636363636 1.0 2.75
29 0 0.666666666667 0.899999976158 1.66666662693
29 1 0.633897805065 0.957617223263 1.64736115932
29 2 0.71428572645 1.0 1.39999997616
30 0 0.83333330022 0.800000011921 1.5
30 1 0.497155903026 0.968293309212 2.07730603218
30 2 0.888888888889 0.625 1.79999995232
31 0 1.09090906726 0.666666686535 1.375
31 1 0.383552023223 0.974856615067 2.6744530201
31 2 1.0 0.875 1.14285719395
32 0 0.916666639348 0.727272748947 1.5
32 1 1.01011231206 0.637635648251 1.55259346962
32 2 0.699999983311 0.857142865658 1.66666662693
33 0 0.666666666667 0.928571403027 1.6153845787
33 1 0.540919063726 0.974804520607 1.89648830891
33 2 0.888888888889 1.0 1.125
34 0 0.649999988377 1.0 1.53846156597
34 1 0.718175746648 0.925356447697 1.50473570824
34 2 0.727272727273 0.875 1.57142853737
35 0 0.684210539194 0.923076927662 1.58333337307
35 1 0.733074165946 0.906563222408 1.50471413136
35 2 1.16666665508 0.857142865658 1.0
36 0 0.812499969732 0.846153855324 1.45454549789
36 1 0.58001560978 0.953019022942 1.80908405781
36 2 0.77777778808 1.0 1.28571426868
37 0 1.16666665508 0.785714268684 1.09090912342
37 1 0.745551986661 0.905232429504 1.4817057848
37 2 0.874999960884 0.857142865658 1.33333337307
38 0 1.22222223032 0.818181812763 1.0
38 1 1.11178515527 0.692697823048 1.29848015308
38 2 0.5 0.666666686535 3.0
39 0 1.0 0.0 0.0
39 1 0.701137661344 0.939449191093 1.51818048954
39 2 0.71428572645 1.0 1.39999997616
40 0 0.857142886337 0.833333313465 1.39999997616
40 1 0.780660527926 0.879693567753 1.45615077019
40 2 1.24999998137 0.600000023842 1.33333337307
41 0 0.666666666667 1.0 1.5
41 1 0.692490930908 0.95055025816 1.51918554306
41 2 5.99999982119 0.166666671634 1.0
42 0 1.0 0.923076927662 1.08333337307
42 1 0.6099909686 0.941899240017 1.74049246311
42 2 6.333333585 0.0526315793395 3.0
43 0 0.888888888889 0.9375 1.20000004768
43 1 0.716354691817 0.892244756222 1.56454432011
43 2 0.857142886337 1.0 1.16666662693
44 0 0.77777778808 0.928571403027 1.3846154213
44 1 0.761249440312 0.875874519348 1.49979233742
44 2 0.699999983311 0.857142865658 1.66666662693
45 0 0.8 0.916666686535 1.36363637447
45 1 0.670026085832 0.925329089165 1.61291730404
45 2 0.818181827049 1.0 1.22222220898
46 0 0.666666666667 1.0 1.5
46 1 0.74010868963 0.879111886024 1.53695213795
46 2 8.3333335196 0.119999997318 1.0
47 0 1.33333333333 0.583333313465 1.28571426868
47 1 1.01931193654 0.771489739418 1.2716357708
47 2 1.05263159216 0.800000011921 1.1875
48 0 0.649999988377 0.846153855324 1.81818187237
48 1 0.595427690946 0.925518035889 1.81462156773
48 2 0.909090889387 0.800000011921 1.375
49 0 0.666666666667 1.0 1.5
49 1 1.24549267298 0.599478185177 1.33932328224
49 2 1.05882355911 0.777777791023 1.21428573132
50 0 0.749999977648 1.0 1.33333337307
50 1 0.943253069679 0.787865936756 1.34561085701
50 2 0.941176470588 0.9375 1.13333332539
51 0 1.4999999553 0.5 1.33333337307
51 1 0.68019200328 0.951689898968 1.5448025465
51 2 0.64 1.0 1.5625
52 0 1.0 0.0 0.0
52 1 0.544379870177 0.941783308983 1.9505045414
52 2 1.53846159489 0.449999988079 1.44444441795
53 0 1.0 0.0 0.0
53 1 1.0 0.0 0.0
53 2 1.0 0.0 0.0
