0 0 1.0 0.0 0.0
0 1 0.814846776586 0.880826294422 1.39326512814
0 2 1.0 1.0 1.0
1 0 1.0 0.0 0.0
1 1 0.742442075041 0.893707036972 1.50710058212
1 2 1.0 1.0 1.0
2 0 1.0 0.0 0.0
2 1 0.964409344389 0.752434670925 1.37806534767
2 2 1.0 0.0 0.0
3 0 0.5 1.0 2.0
3 1 0.73082823549 0.884575009346 1.54685652256
3 2 1.0 0.0 0.0
4 0 0.333333333333 1.0 3.0
4 1 0.767923765381 0.844576358795 1.54185307026
4 2 1.0 0.0 0.0
5 0 1.0 1.0 1.0
5 1 0.698354639876 0.892670154572 1.60410559177
5 2 0.5 0.5 4.0
6 0 1.0 1.0 1.0
6 1 0.644191728527 0.901639342308 1.7216783762
6 2 1.0 0.0 0.0
7 0 1.0 1.0 1.0
7 1 0.886278658017 0.751204848289 1.50200486183
7 2 0.666666666667 1.0 1.5
8 0 0.5 1.0 2.0
8 1 3.78728068418 0.219455704093 1.20316624641
8 2 1.0 1.0 1.0
9 0 1.0 0.0 0.0
9 1 0.849641992203 0.820224702358 1.43493151665
9 2 0.666666666667 1.0 1.5
10 0 1.0 0.0 0.0
10 1 0.670993519959 0.897321403027 1.66086232662
10 2 0.666666666667 1.0 1.5
11 0 1.0 0.0 0.0
11 1 1.26140061559 0.634602963924 1.24923706055
11 2 1.0 0.5 2.0
12 0 1.0 0.0 0.0
12 1 0.79609089621 0.863304555416 1.45503461361
12 2 0.666666666667 1.0 1.5
13 0 1.0 0.0 0.0
13 1 0.961193975808 0.780124247074 1.33359873295
13 2 1.0 1.0 1.0
14 0 1.0 0.0 0.0
14 1 0.962721904628 0.760295033455 1.36620855331
14 2 0.666666666667 1.0 1.5
15 0 1.0 0.0 0.0
15 1 1.53672789165 0.517653465271 1.25708293915
15 2 0.666666666667 1.0 1.5
16 0 1.0 0.0 0.0
16 1 0.719201370533 0.888954520226 1.56411957741
16 2 0.5 1.0 2.0
17 0 1.0 0.0 0.0
17 1 0.628707422362 0.924868941307 1.71977329254
17 2 0.25 1.0 4.0
18 0 1.0 0.0 0.0
18 1 0.779404330361 0.871114015579 1.47286248207
18 2 0.222222222222 1.0 4.5
19 0 1.0 0.0 0.0
19 1 0.733207184455 0.876774191856 1.55555558205
19 2 1.0 1.0 1.0
20 0 1.0 0.0 0.0
20 1 0.754436422068 0.869675755501 1.52412283421
20 2 1.0 1.0 1.0
21 0 1.0 0.0 0.0
21 1 3.46880908408 0.229972749949 1.25355446339
21 2 0.5 1.0 2.0
22 0 1.0 0.0 0.0
22 1 1.62250452597 0.503355681896 1.22444438934
22 2 1.0 1.0 1.0
23 0 1.0 0.0 0.0
23 1 0.652093571599 0.925401329994 1.65714287758
23 2 0.181818181818 1.0 5.5
24 0 1.0 0.0 0.0
24 1 0.688973849966 0.889916718006 1.63097715378
24 2 0.666666666667 1.0 1.5
25 0 1.0 0.0 0.0
25 1 0.679830168235 0.93191754818 1.57841825485
25 2 1.0 0.0 0.0
26 0 1.0 0.0 0.0
26 1 3.42294504547 0.238619312644 1.22431862354
26 2 1.0 1.0 1.0
27 0 1.0 0.0 0.0
27 1 0.697443698266 0.883479237556 1.62291026115
27 2 2.0 0.5 1.0
28 0 1.0 0.0 0.0
28 1 0.691426137789 0.899324715137 1.60819113255
28 2 1.0 1.0 1.0
29 0 1.0 0.0 0.0
29 1 0.654679797919 0.9382994771 1.62790691853
29 2 1.0 1.0 1.0
30 0 1.0 0.0 0.0
30 1 0.727418723917 0.878587186337 1.56469845772
30 2 1.0 0.0 0.0
31 0 1.0 0.0 0.0
31 1 1.28226856428 0.493645131588 1.57981467247
31 2 1.0 0.0 0.0
32 0 1.0 0.0 0.0
32 1 1.0502828409 0.687612235546 1.38468229771
32 2 1.0 0.0 0.0
33 0 1.0 0.0 0.0
33 1 0.670854270352 0.919475674629 1.62118124962
33 2 1.0 0.0 0.0
34 0 1.0 0.0 0.0
34 1 0.702310205382 0.911654114723 1.56185567379
34 2 1.0 0.0 0.0
35 0 1.0 0.0 0.0
35 1 3.4432989733 0.228293418884 1.27213120461
35 2 1.0 1.0 1.0
36 0 1.0 0.0 0.0
36 1 1.65864830554 0.470303863287 1.28193831444
36 2 1.0 1.0 1.0
37 0 1.0 0.0 0.0
37 1 0.750629752223 0.875838935375 1.52107274532
37 2 1.0 1.0 1.0
38 0 1.0 0.0 0.0
38 1 12.5781252372 0.0621118023992 1.27999997139
38 2 1.0 1.0 1.0
39 0 1.0 0.0 0.0
39 1 0.715290807994 0.93639343977 1.49299716949
39 2 2.0 0.5 1.0
40 0 1.0 0.0 0.0
40 1 0.832346275406 0.857142865658 1.40166032314
40 2 0.5 1.0 2.0
41 0 1.0 0.0 0.0
41 1 0.657934115827 0.952218413353 1.59617686272
41 2 1.0 0.0 0.0
42 0 1.0 0.0 0.0
42 1 0.653625645202 0.916924655437 1.66854250431
42 2 4.0 0.25 1.0
43 0 0.333333333333 1.0 3.0
43 1 0.726482840339 0.880395233631 1.56349670887
43 2 1.0 1.0 1.0
44 0 0.5 1.0 2.0
44 1 0.752718491485 0.875334382057 1.51772618294
44 2 1.0 0.0 0.0
45 0 0.666666666667 1.0 1.5
45 1 0.954361004459 0.76992559433 1.36093854904
45 2 0.5 1.0 2.0
46 0 0.666666666667 1.0 1.5
46 1 0.824345963577 0.858160614967 1.41358494759
46 2 1.0 0.0 0.0
47 0 0.5 1.0 2.0
47 1 1.01591693725 0.752724766731 1.30769228935
47 2 2.99999991059 0.333333343267 1.0
48 0 2.99999991059 0.333333343267 1.0
48 1 0.639647557475 0.892561972141 1.75154316425
48 2 1.33333333333 0.75 1.0
49 0 1.0 1.0 1.0
49 1 26.4142844224 0.0183883178979 2.05882358551
49 2 1.20000002861 0.833333313465 1.0
50 0 1.0 1.0 1.0
50 1 1.15376108066 0.69511026144 1.24689650536
50 2 0.8 0.75 1.66666662693
51 0 1.0 1.0 1.0
51 1 0.706422003669 0.948051929474 1.49315071106
51 2 1.0 0.800000011921 1.25
52 0 1.0 0.0 0.0
52 1 0.544854875354 0.939467310905 1.95360827446
52 2 0.8 1.0 1.25
53 0 1.0 0.0 0.0
53 1 1.0 0.0 0.0
53 2 1.0 0.0 0.0
