4135
4391
6951
7207
7463
7719
7975
4136
4392
6952
7208
7464
7720
7976
4137
4393
6953
7209
7465
7721
7977
4138
4394
6954
7210
7466
7722
7978
4139
4395
6955
7211
7467
7723
7979
4140
4396
6956
7212
7468
7724
7980
4141
4397
6957
7213
7469
7725
7981
4142
4398
6958
7214
7470
7726
7982
4143
4399
6959
7215
7471
7727
7983
4144
4400
6960
7216
7472
7728
7984
4145
4401
6961
7217
7473
7729
7985
4146
4402
6962
7218
7474
7730
7986
4147
4403
6963
7219
7475
7731
7987
4148
4404
6964
7220
7476
7732
7988
4149
4405
6965
7221
7477
7733
7989
4150
4406
6966
7222
7478
7734
7990
4151
4407
6967
7223
7479
7735
7991
4152
4408
6968
7224
7480
7736
7992
4153
4409
6969
7225
7481
7737
7993
4154
4410
6970
7226
7482
7738
7994
4155
4411
6971
7227
7483
7739
7995
4156
4412
6972
7228
7484
7740
7996
5632
5888
14080
14336
21504
21760
5727
5983
14175
14431
21599
21855
88333
86807
71168
71424
79616
79872
87040
87296
71263
71519
79711
79967
87135
87391
138279
138791
138280
138792
138281
138793
138282
138794
138283
138795
138284
138796
138286
138798
138287
138799
138800
138289
138545
138801
138290
138546
138802
138291
138547
138803
138292
138548
138804
138293
138549
138805
138294
138550
138806
138295
138551
138807
138296
138552
138808
138297
138553
138809
138298
138554
138810
138299
138555
138811
138300
138556
138812
136704
136960
145152
145408
152576
152832
136799
137055
145247
145503
152671
152927
201984
201985
209921
198694
199719
202791
203559
198952
201256
202792
198697
198953
199721
201257
203561
198954
199722
201258
203562
198955
201259
202795
203563
198956
199724
202796
203564
202240
202496
210688
210944
218112
218368
202335
202591
210783
211039
218207
218463
264491
268843
269099
269355
269611
264493
268845
269101
269357
269613
264495
268847
269103
269359
269615
264497
269105
269361
269617
264504
268856
269112
269368
269624
264507
268859
269115
269371
269627
267776
268032
276224
276480
283648
283904
267871
268127
276319
276575
283743
283999
332800
333056
332801
333057
328999
329511
334631
334887
329000
329512
334632
334888
329001
329513
334633
334889
329002
329514
334634
334890
329003
329515
334635
334891
329004
329516
334636
334892
329005
329517
334637
334893
329006
329518
334638
334894
329007
329519
334639
334895
334640
334896
334641
334897
334642
334898
334643
334899
334644
334900
334645
334901
334646
334902
333312
333568
341760
342016
349184
349440
333407
333663
341855
342111
349279
349535
395559
398375
398631
398887
399143
400167
400423
400679
400935
401191
395560
398376
398632
398888
399144
400168
400424
400680
400936
401192
395561
398377
398633
398889
399145
400169
400425
400681
400937
401193
395562
398378
398634
398890
399146
400170
400426
400682
400938
401194
395563
398379
398635
398891
399147
400171
400427
400683
400939
401195
395564
398380
398636
398892
399148
400172
400428
400684
400940
401196
395565
398381
398637
398893
399149
400173
400429
400685
400941
401197
395566
398382
398638
398894
399150
400174
400430
400686
400942
401198
395567
398383
398639
398895
399151
400175
400431
400687
400943
401199
395568
398384
398640
398896
399152
400176
400432
400688
400944
401200
395569
398385
398641
398897
399153
400177
400433
400689
400945
401201
395570
398386
398642
398898
399154
400178
400434
400690
400946
401202
395571
398387
398643
398899
399155
400179
400435
400691
400947
401203
395572
398388
398644
398900
399156
400180
400436
400692
400948
401204
395573
398389
398645
398901
399157
400181
400437
400693
400949
401205
395574
398390
398646
398902
399158
400182
400438
400694
400950
401206
395575
398391
398647
398903
399159
400183
400439
400695
400951
401207
395576
398392
398648
398904
399160
400184
400440
400696
400952
401208
395577
398393
398649
398905
399161
400185
400441
400697
400953
401209
395578
398394
398650
398906
399162
400186
400442
400698
400954
401210
395579
398395
398651
398907
399163
400187
400443
400699
400955
401211
395580
398396
398652
398908
399164
400188
400444
400700
400956
401212
395581
398397
398653
398909
399165
400189
400445
400701
400957
401213
398848
399104
407296
407552
414720
414976
398943
399199
407391
407647
414815
415071
464679
465703
465959
466215
464680
465704
465960
466216
464681
465705
465961
466217
464682
465706
465962
466218
464683
465707
465963
466219
464684
465708
465964
466220
464685
465709
465965
466221
464686
465710
465966
466222
464687
465711
465967
466223
464688
465712
465968
466224
464689
465713
465969
466225
464690
465714
465970
466226
464691
465715
465971
466227
464692
465716
465972
466228
464693
465717
465973
466229
464694
465718
465974
466230
464695
465719
465975
466231
464696
465720
465976
466232
464698
465722
465978
466234
464699
465723
465979
466235
464700
465724
465980
466236
464384
464640
472832
473088
480256
480512
464479
464735
472927
473183
480351
480607
527653
528677
528933
529445
530469
527654
528678
528934
529446
530470
527656
528680
528936
529448
530472
527657
528681
528937
529449
530473
527658
528682
528938
529450
530474
527659
528683
528939
529451
530475
527660
528684
528940
529452
530476
527661
528685
528941
529453
530477
528686
528942
529454
530478
530479
530480
530481
530482
530483
525620
526388
526644
527668
528180
528692
528948
529460
529716
530484
530485
525622
526390
526646
527670
528182
528694
528950
529462
529718
529974
530230
530486
525623
526391
526647
527671
528183
528695
528951
529463
529719
529975
530231
530487
525624
526392
526648
527672
528184
528696
528952
529464
529720
529976
530232
530488
525625
526393
526649
527673
528185
528697
528953
529465
529721
529977
530233
530489
525626
526394
526650
527674
528186
528698
528954
529466
529722
529978
530234
530490
525627
526395
526651
527675
528187
528699
528955
529467
529723
529979
530235
530491
525628
526396
526652
527676
528188
528700
528956
529468
529724
529980
530236
530492
530494
530495
529920
530176
538368
538624
545792
546048
530015
530271
538463
538719
545887
546143
595456
595968
596791
597047
597303
596792
597048
597304
596795
597051
597307
596796
597052
597308
595456
595712
603904
604160
611328
611584
595551
595807
603999
604255
611423
611679
662312
662824
663080
662313
662825
663081
662314
662826
663082
662318
662830
663086
660992
661248
669440
669696
676864
677120
661087
661343
669535
669791
676959
677215
721703
725031
725287
725543
725799
726055
726311
726567
726823
727079
727847
728103
728359
728615
721704
725032
725288
725544
725800
726056
726312
726568
726824
727080
727848
728104
728360
728616
721705
725033
725289
725545
725801
726057
726313
726569
726825
727081
727849
728105
728361
728617
721706
725034
725290
725546
725802
726058
726314
726570
726826
727082
727850
728106
728362
728618
721707
725035
725291
725547
725803
726059
726315
726571
726827
727083
727851
728107
728363
721708
725036
725292
725548
725804
726060
726316
726572
726828
727084
727852
728108
728364
721709
725037
725293
725549
725805
726061
726317
726573
726829
727085
727853
728109
728365
721711
725039
725295
725551
725807
726063
726319
726575
726831
727087
727855
728111
728367
721716
725044
725300
725556
725812
726068
726324
726580
726836
727092
727860
728116
728372
721717
725045
725301
725557
725813
726069
726325
726581
726837
727093
727861
728117
728373
721718
725046
725302
725558
725814
726070
726326
726582
726838
727094
727862
728118
728374
721719
725047
725303
725559
725815
726071
726327
726583
726839
727095
727863
728119
728375
721720
727096
727864
728120
728376
721721
727097
727865
728121
728377
721722
727098
727866
728122
728378
721723
727099
727867
728123
728379
721724
727100
727868
728124
728380
721725
727101
727869
728125
728381
727102
727103
726528
726784
734976
735232
742400
742656
726623
726879
735071
735327
742495
742751
792615
793383
793639
793895
794151
794407
792616
793384
793640
793896
794152
794408
792617
793385
793641
793897
794153
794409
792618
793386
793642
793898
794154
794410
792619
793387
793643
793899
794155
794411
792620
793388
793644
793900
794156
794412
792623
793391
793647
793903
794159
794415
792626
793394
793650
793906
794162
794418
792627
793395
793651
793907
794163
794419
792628
793396
793652
793908
794164
794420
792629
793397
793653
793909
794165
794421
792631
793399
793655
793911
794167
794423
792632
793400
793656
793912
794168
794424
792633
793401
793657
793913
794169
794425
792634
793402
793658
793914
794170
794426
792635
793403
793659
793915
794171
794427
792636
793404
793660
793916
794172
794428
792064
792320
800512
800768
807936
808192
792159
792415
800607
800863
808031
808287
857088
857344
857089
857345
857896
858920
859176
859432
859688
857897
858921
859177
859433
859689
853290
857898
858922
859178
859434
859690
853291
857899
858923
859179
859435
859691
853292
857900
858924
859180
859436
859692
853293
857901
858925
859181
859437
859693
857902
858926
859182
859438
859694
857903
858927
859183
859439
859695
853296
853552
857904
858928
859184
859440
859696
853297
853553
857905
858929
859185
859441
859697
853298
853554
857906
858930
859186
859442
859698
853299
853555
857907
858931
859187
859443
853301
853557
857909
858933
859189
859445
859701
853303
853559
857911
858935
859191
859447
859703
853305
853561
857913
858937
859193
859449
859705
853306
853562
857914
858938
859194
859450
859706
853308
853564
857916
858940
859196
859452
859708
857600
857856
866048
866304
873472
873728
857695
857951
866143
866399
873567
873823
924711
924967
925223
925479
924712
924968
925224
925480
924713
924969
925225
925481
924714
924970
925226
925482
924715
924971
925227
925483
924716
924972
925228
925484
924717
924973
925229
925485
924718
924974
925230
925486
924719
924975
925231
925487
925488
924465
924466
924978
925490
924467
924979
925235
925491
924468
924980
925236
925492
924469
924981
925237
925493
924470
924982
925238
925494
924471
924983
925239
925495
924472
924984
925240
925496
924473
924985
925241
925497
924474
924986
925242
925498
924475
924987
925243
925499
924476
924988
925244
925500
923136
923392
931584
931840
939008
939264
923231
923487
931679
931935
939103
939359
987687
990247
990759
987689
990249
987691
990251
990763
987692
990252
990764
987699
990259
990771
987700
990260
990772
987701
990261
990773
987703
990263
990775
987704
990264
990776
987705
990265
990777
987707
990267
988672
988928
997120
997376
1004544
1004800
988767
989023
997215
997471
1004639
1004895
1055525
1055526
1052199
1055527
1056295
1052200
1055528
1056296
1052201
1055529
1056297
1052202
1055530
1056298
1052203
1055531
1056299
1052204
1055532
1056300
1052205
1055533
1056301
1052206
1055534
1052207
1055535
1056303
1052214
1055542
1054208
1054464
1062656
1062912
1070080
1070336
1054303
1054559
1062751
1063007
1070175
1070431
1121061
1121317
1121062
1121318
1121574
1122086
1121064
1121320
1121576
1121065
1121321
1121577
1121075
1121331
1121587
1121076
1121332
1121588
1121078
1121334
1121590
1121079
1121335
1121591
1121084
1121340
1121596
1119744
1120000
1128192
1128448
1135616
1135872
1119839
1120095
1128287
1128543
1135711
1135967
1184768
1185024
1184769
1185025
1186599
1186855
1187111
1187367
1187623
1186600
1186856
1187112
1187368
1187624
1186601
1186857
1187113
1187369
1187625
1186602
1186858
1187114
1187370
1187626
1186603
1186859
1187115
1187371
1187627
1186604
1186860
1187116
1187372
1187628
1186605
1186861
1187117
1187373
1187629
1186606
1186862
1187118
1187374
1187630
1186607
1186863
1187119
1187375
1187631
1186608
1186864
1187120
1187376
1187632
1186609
1186865
1187121
1187377
1187633
1186610
1186866
1187122
1187378
1187634
1186611
1186867
1187123
1187379
1187635
1186612
1186868
1187124
1187380
1187636
1186613
1186869
1187125
1187381
1187637
1186614
1186870
1187126
1187382
1187638
1186615
1186871
1187127
1187383
1187639
1186616
1186872
1187128
1187384
1187640
1186617
1186873
1187129
1187385
1187641
1186618
1186874
1187130
1187386
1187642
1185280
1185536
1193728
1193984
1201152
1201408
1185375
1185631
1193823
1194079
1201247
1201503
1250560
1250561
1247026
1247282
1248050
1250610
1251634
1251890
1252146
1252402
1252658
1247286
1248054
1250614
1251638
1251894
1252150
1252406
1252662
1247287
1248055
1250615
1251639
1251895
1252151
1252407
1252663
1247033
1247289
1250617
1251641
1251897
1252153
1252409
1252665
1247035
1247291
1248059
1250619
1251131
1251899
1252155
1252411
1252667
1247036
1247292
1248060
1250620
1251132
1251900
1252156
1252412
1252668
1247037
1247293
1248061
1250816
1251072
1259264
1259520
1266688
1266944
1250911
1251167
1259359
1259615
1266783
1267039
1317927
1318183
1318439
1318695
1317928
1318184
1318440
1318696
1317929
1318185
1318441
1318697
1317930
1318186
1318442
1318698
1317931
1318187
1318443
1318699
1317932
1318188
1318444
1318700
1317933
1318189
1318445
1318701
1317934
1318190
1318446
1318702
1317935
1318191
1318447
1318703
1317936
1318192
1318448
1318704
1317937
1318193
1318449
1318705
1317938
1318194
1318450
1318706
1317939
1318195
1318451
1318707
1317940
1318196
1318452
1318708
1317941
1318197
1318453
1318709
1317942
1318198
1318454
1318710
1317943
1318199
1318455
1318711
1317944
1318200
1318456
1318712
1317945
1318201
1318457
1318713
1317946
1318202
1318458
1318714
1317947
1318203
1318459
1318715
1317948
1318204
1318460
1318716
1316352
1316608
1324800
1325056
1332224
1332480
1316447
1316703
1324895
1325151
1332319
1332575
1382439
1383207
1383719
1383975
1376808
1382440
1383208
1383720
1383976
1376809
1382441
1383209
1383721
1383977
1376810
1382442
1383210
1383722
1383978
1376811
1382443
1383211
1383723
1383979
1376812
1382444
1383212
1383724
1383980
1376813
1382445
1383213
1383725
1383981
1376814
1382446
1383214
1383726
1383982
1376815
1382447
1383215
1383727
1383983
1376817
1382449
1383217
1383729
1383985
1376818
1377586
1382450
1383218
1383730
1383986
1377587
1382451
1383219
1383731
1383987
1376820
1377588
1382452
1383220
1383732
1383988
1376821
1377589
1382453
1383221
1383733
1383989
1376822
1377590
1382454
1383222
1383734
1383990
1376823
1377591
1382455
1383223
1383735
1383991
1376824
1377592
1382456
1383224
1383736
1383992
1376825
1377593
1382457
1383225
1383737
1383993
1376826
1377594
1382458
1383226
1383738
1383994
1376827
1377595
1382459
1383227
1383739
1383995
1376828
1377596
1382460
1383228
1383740
1383996
1381888
1382144
1390336
1390592
1397760
1398016
1381983
1382239
1390431
1390687
1397855
1398111
1451540
1450276
1450022
1450278
1450023
1450279
1450024
1450280
1450025
1450281
1450026
1450282
1450027
1450283
1450028
1450284
1450029
1450285
1450030
1450286
1450288
1450033
1450289
1450034
1450290
1450291
1450036
1450292
1450037
1450293
1450038
1450294
1450039
1450040
1447424
1447680
1455872
1456128
1463296
1463552
1447519
1447775
1455967
1456223
1463391
1463647
1512704
1512705
1509415
1514279
1514535
1514791
1515047
1515303
1509416
1514280
1514536
1514792
1515048
1515304
1509417
1514281
1514537
1514793
1515049
1515305
1509418
1514282
1514538
1514794
1515050
1515306
1509419
1514283
1514539
1514795
1515051
1515307
1509420
1514284
1514540
1514796
1515052
1515308
1509421
1514285
1514541
1514797
1515053
1515309
1509422
1514286
1514542
1514798
1515054
1515310
1509423
1514287
1514543
1514799
1515055
1515311
1509424
1514288
1514544
1514800
1515056
1515312
1509425
1514289
1514545
1514801
1515057
1515313
1509426
1514290
1514546
1514802
1515058
1515314
1509427
1514291
1514547
1514803
1515059
1509428
1514292
1514548
1514804
1515060
1509429
1514293
1514549
1514805
1515061
1509430
1514294
1514550
1514806
1515062
1509431
1514295
1514551
1514807
1515063
1509432
1514296
1514552
1514808
1515064
1509433
1514297
1514553
1514809
1515065
1512960
1513216
1521408
1521664
1528832
1529088
1513055
1513311
1521503
1521759
1528927
1529183
1578279
1578535
1578791
1579815
1580327
1580583
1580839
1578280
1578536
1578792
1579816
1580328
1580584
1580840
1578281
1578537
1578793
1579817
1580329
1580585
1580841
1578282
1578538
1578794
1579818
1580330
1580586
1580842
1578283
1578539
1578795
1579819
1580331
1580587
1580843
1578284
1578540
1578796
1579820
1580332
1580588
1580844
1578285
1578541
1578797
1579821
1580333
1580589
1580845
1578286
1578542
1578798
1579822
1580334
1580590
1580846
1578287
1578543
1578799
1579823
1580335
1580591
1580847
1578289
1578545
1578801
1579825
1580337
1580593
1578290
1578546
1578802
1579826
1580338
1580594
1578291
1578547
1578803
1579827
1580339
1580595
1578292
1578548
1578804
1579828
1580340
1580596
1578293
1578549
1578805
1579829
1580341
1580597
1578294
1578550
1578806
1579830
1580342
1580598
1578299
1578555
1578811
1579835
1580347
1580603
1578496
1578752
1586944
1587200
1594368
1594624
1578591
1578847
1587039
1587295
1594463
1594719
1643776
1643521
1643777
1639719
1642535
1643559
1643815
1644071
1644327
1645095
1645351
1645863
1646119
1639720
1642536
1643560
1643816
1644072
1644328
1645096
1645352
1645864
1646120
1639721
1642537
1643561
1643817
1644073
1644329
1645097
1645353
1645865
1646121
1639722
1642538
1643562
1643818
1644074
1644330
1645098
1645354
1645866
1646122
1639723
1642539
1643563
1643819
1644075
1644331
1645099
1645355
1645867
1646123
1639724
1642540
1643564
1643820
1644076
1644332
1645100
1645356
1645868
1646124
1639725
1642541
1643565
1643821
1644077
1644333
1645101
1645357
1645869
1646125
1639726
1642542
1643566
1643822
1644078
1644334
1645102
1645358
1645870
1646126
1639727
1642543
1643567
1643823
1644079
1644335
1645103
1645359
1645871
1646127
1639728
1642544
1643568
1643824
1644080
1644336
1645104
1645360
1645872
1646128
1639729
1642545
1643569
1643825
1644081
1644337
1645105
1645361
1645873
1646129
1639730
1642546
1643570
1643826
1644082
1644338
1645106
1645362
1645874
1646130
1645875
1646131
1639732
1642548
1643572
1643828
1644084
1644340
1645108
1645364
1645620
1645876
1646132
1639733
1642549
1643573
1643829
1644085
1644341
1645109
1645365
1645621
1645877
1646133
1639734
1642550
1643574
1643830
1644086
1644342
1645110
1645366
1645622
1645878
1646134
1639735
1642551
1643575
1643831
1644087
1644343
1645111
1645367
1645623
1645879
1646135
1639736
1642552
1643576
1643832
1644088
1644344
1645112
1645368
1645624
1645880
1646136
1639737
1642553
1643577
1643833
1644089
1644345
1645113
1645369
1645625
1645881
1646137
1639738
1642554
1643578
1643834
1644090
1644346
1645114
1645370
1645626
1645882
1646138
1639739
1642555
1643579
1643835
1644091
1644347
1645115
1645371
1645627
1645883
1646139
1644032
1644288
1652480
1652736
1659904
1660160
1644127
1644383
1652575
1652831
1659999
1660255
1709057
1710119
1711143
1711399
1711655
1711911
1710120
1711144
1711400
1711656
1711912
1710121
1711145
1711401
1711657
1711913
1710122
1711146
1711402
1711658
1711914
1710123
1711147
1711403
1711659
1711915
1710124
1711148
1711404
1711660
1711916
1710125
1711149
1711405
1711661
1711917
1710126
1711150
1711406
1711662
1711918
1710127
1711151
1711407
1711663
1711919
1710128
1711152
1711408
1711664
1711920
1710129
1711153
1711409
1711665
1711921
1710130
1711154
1711410
1711666
1711922
1710131
1711155
1711411
1711667
1711923
1710132
1711156
1711412
1711668
1711924
1710133
1711157
1711413
1711669
1711925
1710134
1711158
1711414
1711670
1711926
1710135
1711159
1711415
1711671
1711927
1710141
1711165
1711421
1711677
1709568
1709824
1718016
1718272
1725440
1725696
1709663
1709919
1718111
1718367
1725535
1725791
1773094
1776678
1776934
1773095
1773607
1776679
1776935
1773097
1773609
1776681
1776937
1773098
1773610
1776682
1776938
1773103
1773615
1776687
1776943
1773111
1773623
1776695
1776951
1773112
1773624
1776696
1776952
1773625
1776697
1776953
1773114
1773626
1776698
1776954
1773115
1773627
1776699
1776955
1773116
1773628
1776700
1776956
1775104
1775360
1783552
1783808
1790976
1791232
1775199
1775455
1783647
1783903
1791071
1791327
1839142
1839398
1840166
1840678
1840934
1842214
1837095
1837351
1839143
1839399
1840167
1840679
1840935
1842215
1837096
1837352
1839144
1839400
1840168
1840680
1840936
1842216
1837097
1837353
1839145
1839401
1840169
1840681
1840937
1842217
1837098
1837354
1839146
1839402
1840170
1840682
1840938
1842218
1837099
1837355
1839147
1839403
1840171
1840683
1840939
1842219
1837100
1837356
1839148
1839404
1840172
1840684
1840940
1842220
1837101
1837357
1839149
1839405
1840173
1840685
1840941
1842221
1837102
1837358
1839150
1839406
1840174
1840686
1840942
1842222
1837103
1837359
1839151
1839407
1840175
1840687
1840943
1842223
1837105
1837361
1839153
1839409
1840177
1840689
1840945
1842225
1837107
1837363
1839155
1839411
1840179
1840691
1840947
1842227
1837109
1837365
1839157
1839413
1840181
1840693
1840949
1842229
1837113
1837369
1839161
1839417
1840185
1840697
1840953
1842233
1840640
1840896
1849088
1849344
1856512
1856768
1840735
1840991
1849183
1849439
1856607
1856863
1907751
1908007
1908263
1908519
1907752
1908008
1908264
1908520
1907753
1908009
1908265
1908521
1907754
1908010
1908266
1908522
1907755
1908011
1908267
1908523
1907756
1908012
1908268
1908524
1907757
1908013
1908269
1908525
1907758
1908014
1908270
1908526
1907759
1908015
1908271
1908527
1907760
1908016
1908272
1908528
1907761
1908017
1908273
1908529
1907762
1908018
1908274
1908530
1907763
1908019
1908275
1908531
1907764
1908020
1908276
1908532
1907765
1908021
1908277
1908533
1907766
1908022
1908278
1908534
1907767
1908023
1908279
1908535
1907768
1908024
1908280
1908536
1907769
1908025
1908281
1908537
1907770
1908026
1908282
1908538
1907771
1908027
1908283
1908539
1907772
1908028
1908284
1908540
1906176
1906432
1914624
1914880
1922048
1922304
1906271
1906527
1914719
1914975
1922143
1922399
1970215
1970471
1970727
1970983
1971239
1971495
1971751
1972007
1973287
1973543
1970216
1970472
1970728
1970984
1971240
1971496
1971752
1972008
1973288
1973544
1970217
1970473
1970729
1970985
1971241
1971497
1971753
1972009
1973289
1973545
1970219
1970475
1970731
1970987
1971243
1971499
1971755
1972011
1973291
1973547
1970222
1970478
1970734
1970990
1971246
1971502
1971758
1972014
1970223
1970479
1970735
1970991
1971247
1971503
1971759
1972015
1973048
1973049
1973050
1973051
1973052
1973053
1971712
1971968
1980160
1980416
1987584
1987840
1971807
1972063
1980255
1980511
1987679
1987935
2033704
2033960
2034216
2034472
2035240
2035496
2037032
2037288
2038568
2038824
2039080
2039592
2033705
2033961
2034217
2034473
2035241
2035497
2037033
2037289
2038569
2038825
2039081
2039337
2039593
2033707
2033963
2034219
2034475
2035243
2035499
2037291
2038571
2038827
2039083
2039339
2039595
2033711
2033967
2034223
2034479
2035247
2035503
2037039
2037295
2038575
2038831
2039087
2039343
2037040
2037296
2038576
2038832
2039088
2039344
2037041
2037297
2038577
2038833
2039089
2039345
2037042
2037298
2038578
2038834
2039090
2039346
2037043
2037299
2038579
2038835
2039091
2039347
2037044
2037300
2038580
2038836
2039092
2039348
2037046
2037302
2038582
2038838
2039094
2039350
2033722
2033978
2037050
2037306
2038586
2038842
2039098
2039354
2033723
2033979
2037051
2037307
2038587
2038843
2039099
2039355
2033724
2033980
2037052
2037308
2038588
2038844
2039100
2039356
2033725
2033981
2037053
2037309
2038589
2038845
2039101
2039357
2037248
2037504
2045696
2045952
2053120
2053376
2037343
2037599
2045791
2046047
2053215
2053471
2102272
2102528
2102273
2102529
2104358
2104614
2105126
2104359
2104615
2104871
2105127
2104360
2104616
2104872
2105128
2104361
2104617
2104873
2105129
2104362
2104618
2104874
2105130
2104363
2104619
2104875
2105131
2104364
2104620
2104876
2105132
2104365
2104621
2104877
2105133
2104366
2104622
2104878
2105134
2104367
2104623
2104879
2105135
2104368
2104624
2104880
2105136
2104369
2104625
2104881
2105137
2104370
2104626
2104882
2105138
2104371
2104627
2104883
2105139
2104372
2104628
2104884
2105140
2104373
2104629
2104885
2105141
2104374
2104630
2104886
2105142
2104375
2104631
2104887
2105143
2104376
2104632
2104888
2105144
2104377
2104633
2104889
2105145
2104378
2104634
2104890
2105146
2104379
2104635
2104891
2105147
2104380
2104636
2104892
2105148
2104381
2104637
2104893
2105149
2102784
2103040
2111232
2111488
2118656
2118912
2102879
2103135
2111327
2111583
2118751
2119007
2166823
2167079
2167335
2169895
2170151
2170407
2166824
2167080
2167336
2169896
2170152
2170408
2166825
2167081
2167337
2169897
2170153
2170409
2166826
2167082
2167338
2169898
2170154
2170410
2166827
2167083
2167339
2169899
2170155
2170411
2166828
2167084
2167340
2169900
2170156
2170412
2166829
2167085
2167341
2169901
2170157
2170413
2166832
2167088
2167344
2169904
2170160
2170416
2166844
2167100
2167356
2169916
2170172
2170428
2168320
2168576
2176768
2177024
2184192
2184448
2168415
2168671
2176863
2177119
2184287
2184543
2233344
2233600
2233345
2233601
2235431
2235687
2235943
2235439
2235695
2235951
2235440
2235696
2235952
2235441
2235697
2235953
2235442
2235698
2235954
2235443
2235699
2235955
2235444
2235700
2235956
2235445
2235701
2235957
2235446
2235702
2235958
2235447
2235703
2235959
2235448
2235704
2235960
2235449
2235705
2235961
2235451
2235707
2235963
2235452
2235708
2235964
2233856
2234112
2242304
2242560
2249728
2249984
2233951
2234207
2242399
2242655
2249823
2250079
2298880
2299136
2298881
2299137
2299944
2300968
2299945
2300969
2299947
2300971
2299948
2300972
2299949
2300973
2293808
2299963
2300987
2301243
2299392
2299648
2307840
2308096
2315264
2315520
2299487
2299743
2307935
2308191
2315359
2315615
2364672
2364417
2364673
2365223
2366247
2366759
2367015
2367271
2365224
2366248
2366760
2367016
2367272
2365225
2366249
2366761
2367017
2367273
2365226
2366250
2366762
2367018
2367274
2365227
2366251
2366763
2367019
2367275
2365228
2366252
2366764
2367020
2367276
2365229
2366253
2366765
2367021
2367277
2365230
2366254
2366766
2367022
2367278
2365231
2366255
2367023
2367279
2365232
2366256
2366768
2367024
2367280
2366257
2366769
2367025
2367281
2365234
2366258
2366770
2367026
2367282
2365235
2366259
2366771
2367027
2367283
2365236
2366260
2366772
2367028
2367284
2365237
2366261
2366773
2367029
2367285
2365238
2366262
2366774
2367030
2367286
2365239
2366263
2366775
2367031
2367287
2365240
2366264
2366776
2367032
2367288
2365241
2366265
2366777
2367033
2367289
2365242
2366266
2366778
2367034
2367290
2365243
2366267
2366779
2367035
2367291
2365244
2366268
2366780
2367036
2367292
2364928
2365184
2373376
2373632
2380800
2381056
2365023
2365279
2373471
2373727
2380895
2381151
2431014
2432294
2431015
2432295
2432551
2431016
2432296
2432552
2431017
2432297
2432553
2431019
2432299
2432555
2432811
2431020
2432300
2432556
2432812
2431021
2432301
2432557
2432813
2431022
2432302
2432558
2432814
2431023
2432303
2432559
2432815
2431024
2432304
2432560
2432816
2431025
2432305
2432561
2432817
2431026
2432306
2432562
2432818
2431027
2432307
2432563
2432819
2431028
2432308
2432564
2432820
2431029
2432309
2432565
2432821
2431030
2432310
2432566
2432822
2431031
2432311
2432567
2432823
2431032
2432312
2432568
2432824
2431033
2432313
2432569
2432825
2431034
2432314
2432570
2432826
2431035
2432315
2432571
2432827
2431036
2432316
2432572
2432828
2431037
2432317
2432573
2432829
2430464
2430720
2438912
2439168
2446336
2446592
2430559
2430815
2439007
2439263
2446431
2446687
2512128
2512129
2498087
2498088
2498089
2498091
2498092
2498093
2498094
2496000
2496256
2504448
2504704
2511872
2512128
2496095
2496351
2504543
2504799
2511967
2512223
2577664
2577665
2562086
2562087
2563623
2563879
2562088
2563624
2563880
2562089
2563625
2563881
2562090
2563626
2563882
2562091
2563627
2563883
2562092
2563628
2563884
2562093
2563629
2563885
2562094
2563630
2563886
2562095
2563631
2563887
2562097
2563633
2562098
2563634
2562099
2563635
2562100
2563636
2561536
2561792
2569984
2570240
2577408
2577664
2561631
2561887
2570079
2570335
2577503
2577759
2628134
2628390
2628902
2629158
2628135
2628391
2628903
2629159
2628136
2628392
2628904
2629160
2628137
2628393
2628905
2629161
2628138
2628394
2628906
2629162
2628139
2628395
2628907
2629163
2628140
2628396
2628908
2629164
2628141
2628397
2628909
2629165
2628142
2628398
2628910
2629166
2628143
2628399
2628911
2629167
2628144
2628400
2628912
2629168
2628145
2628401
2628913
2629169
2628146
2628402
2628914
2629170
2628147
2628403
2628915
2629171
2628148
2628404
2628916
2629172
2628149
2628405
2628917
2629173
2628150
2628406
2628918
2629174
2628151
2628407
2628919
2629175
2628152
2628408
2628920
2629176
2628153
2628409
2628921
2629177
2628154
2628410
2628922
2629178
2628923
2629179
2627072
2627328
2635520
2635776
2642944
2643200
2627167
2627423
2635615
2635871
2643039
2643295
2692096
2692352
2692097
2692353
2693159
2693671
2693927
2694183
2694439
2694695
2693160
2693672
2693928
2694184
2694440
2694696
2694200
2694456
2694712
2694201
2694457
2694713
2694202
2694458
2694714
2694203
2694459
2694715
2694204
2694460
2694716
2692608
2692864
2701056
2701312
2708480
2708736
2692703
2692959
2701151
2701407
2708575
2708831
2758144
2758400
2758144
2758400
2766592
2766848
2774016
2774272
2758239
2758495
2766687
2766943
2774111
2774367
2823168
2823169
2820902
2820903
2820904
2820906
2820907
2820908
2820909
2820916
2820917
2820918
2820920
2820923
2823680
2823936
2832128
2832384
2839552
2839808
2823775
2824031
2832223
2832479
2839647
2839903
2891047
2891303
2891048
2891304
2891049
2891305
2891050
2891306
2891051
2891307
2891052
2891308
2891053
2891309
2891054
2891310
2891055
2891311
2891057
2891059
2891315
2891061
2891317
2891062
2891318
2891063
2891319
2891064
2891320
2889216
2889472
2897664
2897920
2905088
2905344
2889311
2889567
2897759
2898015
2905183
2905439
2957095
2957096
2957097
2957098
2957099
2957100
2957101
2957102
2954752
2955008
2963200
2963456
2970624
2970880
2954847
2955103
2963295
2963551
2970719
2970975
3020288
3020544
3028736
3028992
3036160
3036416
3020383
3020639
3028831
3029087
3036255
3036511
3087142
3087143
3087144
3087145
3087146
3087147
3087148
3087149
3087150
3087151
3087152
3087153
3087154
3087155
3087156
3087158
3087159
3087160
3087161
3087162
3085824
3086080
3094272
3094528
3101696
3101952
3085919
3086175
3094367
3094623
3101791
3102047
3153446
3153447
3153448
3153449
3153450
3153451
3153452
3153453
3153454
3153455
3153456
3153457
3153458
3153459
3153460
3153461
3153462
3153463
3153464
3153465
3153466
3153467
3151360
3151616
3159808
3160064
3167232
3167488
3151455
3151711
3159903
3160159
3167327
3167583
3216896
3217152
3225344
3225600
3232768
3233024
3216991
3217247
3225439
3225695
3232863
3233119
3282432
3282688
3290880
3291136
3298304
3298560
3282527
3282783
3290975
3291231
3298399
3298655
3347457
3347713
3342631
3342632
3342633
3350313
3342634
3350314
3342635
3342636
3342637
3342638
3342640
3342641
3342642
3342643
3342644
3342645
3347968
3348224
3356416
3356672
3363840
3364096
3348063
3348319
3356511
3356767
3363935
3364191
3408934
3409190
3409446
3409702
3409958
3410214
3410470
3410726
3410982
3411238
3411494
3411750
3412006
3412262
3412518
3412774
3413030
3413286
3413542
3413798
3414054
3414310
3414566
3414822
3415078
3415334
3408679
3408935
3409191
3409447
3409703
3409959
3410215
3410471
3410727
3410983
3411239
3411495
3411751
3412007
3412263
3412519
3412775
3413031
3413287
3413543
3413799
3414055
3414311
3414567
3414823
3415079
3415335
3408680
3408936
3409192
3409448
3409704
3409960
3410216
3410472
3410728
3410984
3411240
3411496
3411752
3412008
3412264
3412520
3412776
3413032
3413288
3413544
3413800
3414056
3414312
3414568
3414824
3415080
3415336
3408681
3408937
3409193
3409449
3409705
3409961
3410217
3410473
3410729
3410985
3411241
3411497
3411753
3412009
3412265
3412521
3412777
3413033
3413289
3413545
3413801
3414057
3414313
3414569
3414825
3415081
3415337
3408682
3408938
3409194
3409450
3409706
3409962
3410218
3410474
3410730
3410986
3411242
3411498
3411754
3412010
3412266
3412522
3412778
3413034
3413290
3413546
3413802
3414058
3414314
3414570
3414826
3415082
3415338
3408683
3408939
3409195
3409451
3409707
3409963
3410219
3410475
3410731
3410987
3411243
3411499
3411755
3412011
3412267
3412523
3412779
3413035
3413291
3413547
3413803
3414059
3414315
3414571
3414827
3415083
3415339
3408428
3408684
3408940
3409196
3409452
3409708
3409964
3410220
3410476
3410732
3410988
3411244
3411500
3411756
3412012
3412268
3412524
3412780
3413036
3413292
3413548
3413804
3414060
3414316
3414572
3414828
3415084
3415340
3408429
3408685
3408941
3409197
3409453
3409709
3409965
3410221
3410477
3410733
3410989
3411245
3411501
3411757
3412013
3412269
3412525
3412781
3413037
3413293
3413549
3413805
3414061
3414317
3414573
3414829
3415085
3415341
3408431
3408687
3408943
3409199
3409455
3409711
3409967
3410223
3410479
3410735
3410991
3411247
3411503
3411759
3412015
3412271
3412527
3412783
3413039
3413295
3413551
3413807
3414063
3414319
3414575
3414831
3415087
3415343
3413504
3413760
3421952
3422208
3429376
3429632
3413599
3413855
3422047
3422303
3429471
3429727
3479040
3479296
3487488
3487744
3494912
3495168
3479135
3479391
3487583
3487839
3495007
3495263
