0 0 1.0 1.0 1.0
0 1 2.15010464276 0.407200187445 1.14217448235
0 2 0.5 1.0 2.0
1 0 0.555555570273 0.800000011921 2.25
1 1 0.596980442977 0.945290327072 1.77204477787
1 2 1.0 1.0 1.0
2 0 0.749999977648 0.666666686535 2.0
2 1 0.622200873837 0.940359890461 1.7091306448
2 2 0.749999977648 0.666666686535 2.0
3 0 0.749999977648 0.666666686535 2.0
3 1 0.567965352021 0.932164609432 1.88879799843
3 2 1.4999999553 0.666666686535 1.0
4 0 0.333333333333 1.0 3.0
4 1 0.641465310123 0.915917396545 1.70204293728
4 2 0.333333333333 1.0 3.0
5 0 0.5 1.0 2.0
5 1 0.589244179124 0.935125827789 1.81482458115
5 2 0.214285721584 1.0 4.66666650772
6 0 0.5 1.0 2.0
6 1 0.560401760501 0.920451760292 1.93865025043
6 2 1.0 0.666666686535 1.5
7 0 4.0 0.25 1.0
7 1 0.618514601947 0.895328938961 1.80579078197
7 2 0.374999988824 1.0 2.66666674614
8 0 0.5 1.0 2.0
8 1 0.499619118659 0.955273211002 2.09523820877
8 2 0.272727266816 1.0 3.66666674614
9 0 0.666666666667 1.0 1.5
9 1 0.642444260435 0.916966557503 1.69750487804
9 2 0.5 1.0 2.0
10 0 1.0 1.0 1.0
10 1 0.57784864659 0.933266460896 1.85430109501
10 2 0.749999977648 1.0 1.33333337307
11 0 1.0 1.0 1.0
11 1 1.24598929846 0.603958010674 1.32885909081
11 2 1.0 1.0 1.0
12 0 1.0 1.0 1.0
12 1 0.682515588997 0.901679813862 1.62493145466
12 2 0.666666666667 1.0 1.5
13 0 0.749999977648 0.666666686535 2.0
13 1 0.626812697163 0.923947811127 1.72669148445
13 2 0.5 1.0 2.0
14 0 0.600000014305 1.0 1.66666662693
14 1 0.641405374217 0.918693184853 1.69705879688
14 2 0.5 1.0 2.0
15 0 1.4999999553 0.333333343267 2.0
15 1 0.649938044196 0.908722579479 1.69315505028
15 2 0.333333333333 1.0 3.0
16 0 0.749999977648 1.0 1.33333337307
16 1 0.566002145902 0.948119938374 1.86345386505
16 2 1.0 1.0 1.0
17 0 1.0 1.0 1.0
17 1 0.575745150893 0.950843036175 1.82667326927
17 2 0.4 1.0 2.5
18 0 2.0 0.5 1.0
18 1 0.662113349252 0.91534268856 1.64999997616
18 2 0.666666666667 1.0 1.5
19 0 2.0 0.5 1.0
19 1 0.64628280651 0.923150837421 1.67611861229
19 2 2.0 0.5 1.0
20 0 2.0 0.5 1.0
20 1 0.634339716324 0.936057686806 1.68412947655
20 2 0.666666666667 1.0 1.5
21 0 1.0 0.0 0.0
21 1 0.59382182658 0.931284785271 1.80826187134
21 2 2.0 0.5 1.0
22 0 1.0 0.0 0.0
22 1 0.470425935661 0.835796415806 2.54336237907
22 2 0.666666666667 1.0 1.5
23 0 1.0 0.0 0.0
23 1 0.59425612467 0.949704945087 1.77189350128
23 2 0.666666666667 1.0 1.5
24 0 2.0 0.5 1.0
24 1 0.609784603459 0.919496178627 1.7835021019
24 2 0.666666666667 1.0 1.5
25 0 2.0 0.5 1.0
25 1 0.660037188527 0.950436472893 1.59407413006
25 2 0.666666666667 1.0 1.5
26 0 0.666666666667 1.0 1.5
26 1 1.0 0.0 0.0
26 2 0.4 1.0 2.5
27 0 0.4 1.0 2.5
27 1 0.58119920808 0.945646464825 1.81947541237
27 2 0.25 1.0 4.0
28 0 0.5 1.0 2.0
28 1 0.66295104847 0.926759779453 1.62761378288
28 2 0.4 1.0 2.5
29 0 0.5 1.0 2.0
29 1 0.620402224914 0.95560747385 1.68673598766
29 2 1.0 1.0 1.0
30 0 2.99999991059 0.333333343267 1.0
30 1 0.481451403047 0.96219599247 2.1586587429
30 2 0.666666666667 1.0 1.5
31 0 2.0 0.5 1.0
31 1 0.283623000253 0.972896516323 3.62403106689
31 2 1.4999999553 0.666666686535 1.0
32 0 1.0 0.0 0.0
32 1 0.628414471184 0.932005822659 1.70739972591
32 2 1.4999999553 0.666666686535 1.0
33 0 0.5 1.0 2.0
33 1 0.600425950865 0.966712117195 1.72283375263
33 2 1.0 1.0 1.0
34 0 0.571428571429 1.0 1.75
34 1 0.625470616121 0.951845049858 1.6796810627
34 2 1.0 1.0 1.0
35 0 0.666666666667 1.0 1.5
35 1 0.594432229044 0.946019232273 1.77826988697
35 2 1.0 1.0 1.0
36 0 0.749999977648 1.0 1.33333337307
36 1 3.00559845295 0.269150167704 1.23615920544
36 2 0.624999990687 1.0 1.60000002384
37 0 0.666666666667 1.0 1.5
37 1 0.654208592877 0.93408203125 1.63643491268
37 2 0.333333333333 1.0 3.0
38 0 1.0 0.0 0.0
38 1 0.566053286532 0.934740424156 1.88995587826
38 2 1.0 0.800000011921 1.25
39 0 1.66666660044 0.600000023842 1.0
39 1 0.631537469222 0.956597626209 1.65528035164
39 2 0.8 0.875 1.42857146263
40 0 1.20000002861 0.666666686535 1.25
40 1 0.678910888317 0.915994286537 1.60803103447
40 2 0.785714299095 0.909090936184 1.39999997616
41 0 1.4999999553 0.666666686535 1.0
41 1 0.604312452422 0.963137984276 1.71810603142
41 2 0.916666639348 0.909090936184 1.20000004768
42 0 1.0 1.0 1.0
42 1 0.535822414699 0.953154444695 1.95801436901
42 2 0.933333363003 0.857142865658 1.25
43 0 0.5 1.0 2.0
43 1 0.596850383841 0.937634944916 1.78690207005
43 2 0.736842133002 0.785714268684 1.72727274895
44 0 1.0 0.833333313465 1.20000004768
44 1 0.661580041164 0.909418523312 1.66208720207
44 2 0.736842133002 0.857142865658 1.58333337307
45 0 0.600000014305 1.0 1.66666662693
45 1 0.584220842873 0.944111287594 1.8130081892
45 2 0.705882372741 0.833333313465 1.70000004768
46 0 1.39999996662 0.571428596973 1.25
46 1 0.605518276838 0.920935988426 1.79326021671
46 2 0.647058841679 0.909090936184 1.70000004768
47 0 1.0 0.555555582047 1.79999995232
47 1 0.728130689465 0.898803591728 1.52800881863
47 2 0.705882372741 0.916666686535 1.54545450211
48 0 0.71428572645 1.0 1.39999997616
48 1 0.548011915325 0.923988163471 1.97489321232
48 2 0.666666666667 1.0 1.5
49 0 0.699999983311 0.857142865658 1.66666662693
49 1 1.13839779139 0.616112589836 1.4257581234
49 2 0.8 0.75 1.66666662693
50 0 0.624999990687 1.0 1.60000002384
50 1 0.749046860522 0.86706584692 1.53970992565
50 2 0.909090889387 0.800000011921 1.375
51 0 0.624999990687 1.0 1.60000002384
51 1 0.587246474291 0.954884886742 1.78331708908
51 2 0.562499995809 0.888888895512 2.0
52 0 0.749999977648 0.833333313465 1.60000002384
52 1 0.497885209572 0.936286389828 2.1451716423
52 2 2.99999991059 0.333333343267 1.0
53 0 1.0 0.0 0.0
53 1 1.0 0.0 0.0
53 2 1.0 0.0 0.0
