0 0 2.24999998324 0.444444447756 1.0
0 1 2.05353290751 0.426735848188 1.14114069939
0 2 1.0 0.642857134342 1.55555558205
1 0 1.0 0.714285731316 1.39999997616
1 1 0.604117263423 0.945974230766 1.74984443188
1 2 0.71428572645 0.866666674614 1.6153845787
2 0 0.71428572645 1.0 1.39999997616
2 1 0.63118791897 0.939780175686 1.68583488464
2 2 0.823529400215 0.857142865658 1.41666662693
3 0 0.699999983311 0.857142865658 1.66666662693
3 1 0.596475644752 0.934369921684 1.79427266121
3 2 0.649999988377 0.769230782986 2.0
4 0 1.12499999162 0.777777791023 1.14285719395
4 1 0.653246390682 0.907428085804 1.68698322773
4 2 0.866666673554 0.769230782986 1.5
5 0 0.39130434377 0.888888895512 2.875
5 1 0.599047050064 0.931358397007 1.79234755039
5 2 0.857142886337 0.75 1.55555558205
6 0 2.74999991804 0.272727280855 1.33333337307
6 1 0.555267446681 0.924782037735 1.9474145174
6 2 0.692307705005 0.777777791023 1.85714280605
7 0 0.41666665011 0.899999976158 2.66666674614
7 1 0.618974091599 0.897050559521 1.80098712444
7 2 0.71428572645 0.899999976158 1.55555558205
8 0 0.687499979511 0.818181812763 1.77777779102
8 1 0.514004725094 0.945693254471 2.05722880363
8 2 0.666666666667 0.875 1.71428573132
9 0 0.526315796078 1.0 1.89999997616
9 1 0.653247967665 0.910735607147 1.68085253239
9 2 1.0 1.0 1.0
10 0 0.857142886337 0.75 1.55555558205
10 1 0.617247385093 0.916861414909 1.7670019865
10 2 0.533333333333 0.875 2.14285707474
11 0 1.09999996722 0.727272748947 1.25
11 1 0.598224085004 0.931280910969 1.79496264458
11 2 0.8 0.875 1.42857146263
12 0 0.909090889387 0.899999976158 1.22222220898
12 1 0.678063143246 0.896743059158 1.64460587502
12 2 0.727272727273 1.0 1.375
13 0 0.71428572645 1.0 1.39999997616
13 1 0.628636043339 0.931354045868 1.7079924345
13 2 0.749999977648 0.888888895512 1.5
14 0 0.687499979511 1.0 1.45454549789
14 1 0.66458264177 0.90531462431 1.66207826138
14 2 0.769230797446 0.899999976158 1.44444441795
15 0 0.733333327505 1.0 1.36363637447
15 1 0.646754975578 0.912515997887 1.69441473484
15 2 0.526315796078 1.0 1.89999997616
16 0 0.84615388495 0.909090936184 1.29999995232
16 1 0.55515485269 0.947122395039 1.90186524391
16 2 0.769230797446 0.899999976158 1.44444441795
17 0 0.407407400212 1.0 2.45454549789
17 1 0.578324669089 0.948825359344 1.82239282131
17 2 0.83333330022 1.0 1.20000004768
18 0 3.33333320088 0.300000011921 1.0
18 1 0.668218827238 0.906077682972 1.6516418457
18 2 0.84615388495 0.909090936184 1.29999995232
19 0 0.727272727273 0.875 1.57142853737
19 1 0.675937109851 0.909505903721 1.62662780285
19 2 0.909090889387 1.0 1.10000002384
20 0 1.12499999162 0.666666686535 1.33333337307
20 1 0.625353953907 0.931591510773 1.71651887894
20 2 0.588235277618 1.0 1.70000004768
21 0 0.749999977648 0.777777791023 1.71428573132
21 1 0.611955479891 0.92082130909 1.77461779118
21 2 0.818181827049 1.0 1.22222220898
22 0 0.360000013733 0.888888895512 3.125
22 1 0.434274151047 0.840155601501 2.74079346657
22 2 1.66666660044 0.5 1.20000004768
23 0 0.899999957085 0.888888895512 1.25
23 1 0.608857994964 0.949293971062 1.7301479578
23 2 1.12499999162 0.666666686535 1.33333337307
24 0 0.888888888889 0.875 1.28571426868
24 1 0.607464332342 0.929964363575 1.77016162872
24 2 0.83333330022 0.800000011921 1.5
25 0 0.899999957085 0.777777791023 1.42857146263
25 1 0.666571101009 0.947160899639 1.5839073658
25 2 0.727272727273 1.0 1.375
26 0 0.692307705005 0.888888895512 1.625
26 1 1.0 0.0 0.0
26 2 0.692307705005 1.0 1.44444441795
27 0 0.642857131909 1.0 1.55555558205
27 1 0.59870445692 0.932211339474 1.79173231125
27 2 0.769230797446 1.0 1.29999995232
28 0 0.77777778808 1.0 1.28571426868
28 1 0.677523596514 0.913981676102 1.61487185955
28 2 0.83333330022 0.899999976158 1.33333337307
29 0 0.636363650156 0.571428596973 2.75
29 1 0.625754806785 0.956687629223 1.67041993141
29 2 0.555555570273 0.899999976158 2.0
30 0 0.699999983311 0.857142865658 1.66666662693
30 1 0.479096941449 0.96468770504 2.16366434097
30 2 0.692307705005 0.888888895512 1.625
31 0 0.899999957085 0.666666686535 1.66666662693
31 1 0.294123929399 0.975080132484 3.48681855202
31 2 0.600000014305 0.888888895512 1.875
32 0 1.0 0.0 0.0
32 1 0.610490476224 0.944475769997 1.73432421684
32 2 0.624999990687 0.899999976158 1.77777779102
33 0 0.769230797446 1.0 1.29999995232
33 1 0.578236767623 0.958285987377 1.80467569828
33 2 0.71428572645 0.899999976158 1.55555558205
34 0 0.733333327505 1.0 1.36363637447
34 1 0.625009723159 0.946265339851 1.69083142281
34 2 0.687499979511 0.909090936184 1.60000002384
35 0 0.600000014305 1.0 1.66666662693
35 1 0.570076858297 0.95026665926 1.84595501423
35 2 0.526315796078 1.0 1.89999997616
36 0 0.83333330022 1.0 1.20000004768
36 1 0.88233447856 0.811958193779 1.39583182335
36 2 0.52380953273 0.909090936184 2.09999990463
37 0 0.899999957085 0.888888895512 1.25
37 1 0.680124722655 0.921881496906 1.59491050243
37 2 0.749999977648 0.833333313465 1.60000002384
38 0 1.0 0.0 0.0
38 1 0.533679423658 0.942050337791 1.98904883862
38 2 0.642857131909 1.0 1.55555558205
39 0 1.0 0.75 1.33333337307
39 1 0.630408671053 0.957102000713 1.65737056732
39 2 0.916666639348 0.818181812763 1.33333337307
40 0 0.923076889219 0.75 1.44444441795
40 1 0.731475895919 0.890468597412 1.53525817394
40 2 0.560000005341 0.928571403027 1.92307686806
41 0 0.916666639348 0.909090936184 1.20000004768
41 1 0.61920825185 0.961089491844 1.68034875393
41 2 4.24999998417 0.235294118524 1.0
42 0 1.0 0.846153855324 1.18181812763
42 1 0.543368486277 0.956161797047 1.92474925518
42 2 0.576923071633 0.933333337307 1.85714280605
43 0 0.72222220309 1.0 1.3846154213
43 1 0.602641574226 0.930467128754 1.78336346149
43 2 0.83333330022 0.866666674614 1.3846154213
44 0 0.77777778808 0.928571403027 1.3846154213
44 1 0.651113569557 0.911297142506 1.68532347679
44 2 0.684210539194 1.0 1.46153843403
45 0 0.874999960884 0.928571403027 1.23076927662
45 1 0.589891242993 0.947637975216 1.78889811039
45 2 0.571428571429 0.875 2.0
46 0 0.933333363003 0.857142865658 1.25
46 1 0.713454237541 0.896642625332 1.56319987774
46 2 0.600000014305 1.0 1.66666662693
47 0 1.16666665508 0.642857134342 1.33333337307
47 1 0.768428700106 0.879078567028 1.48036468029
47 2 4.99999992549 0.20000000298 1.0
48 0 0.560000005341 0.928571403027 1.92307686806
48 1 0.564850439616 0.925793945789 1.91228306293
48 2 0.78260868754 0.944444417953 1.35294115543
49 0 0.545454533632 0.916666686535 2.0
49 1 1.1247114432 0.518138468266 1.7159832716
49 2 0.620689634761 1.0 1.61111116409
50 0 0.857142886337 0.916666686535 1.27272725105
50 1 0.789962515285 0.856664597988 1.4776879549
50 2 0.727272727273 0.875 1.57142853737
51 0 0.8 1.0 1.25
51 1 0.597843145681 0.960396826267 1.74165451527
51 2 0.666666666667 0.875 1.71428573132
52 0 0.8 0.833333313465 1.5
52 1 0.484751206821 0.942052960396 2.18980669975
52 2 1.69999992907 0.352941185236 1.66666662693
53 0 1.0 0.0 0.0
53 1 1.0 0.0 0.0
53 2 1.0 0.0 0.0
