0 0 0.809523818715 0.764705896378 1.6153845787
0 1 0.817252480953 0.870291650295 1.40597939491
0 2 0.734693848953 0.888888895512 1.53125
1 0 1.0 0.75 1.33333337307
1 1 0.699404273811 0.914035320282 1.56425917149
1 2 0.770833367792 0.891891896725 1.45454549789
2 0 0.695652173913 0.9375 1.53333330154
2 1 0.750916063731 0.897347688675 1.48404765129
2 2 0.772727247605 0.911764681339 1.41935479641
3 0 0.925000041351 0.810810804367 1.33333337307
3 1 0.701299031361 0.923916101456 1.54334926605
3 2 0.851063864325 0.875 1.34285712242
4 0 0.71428572645 0.933333337307 1.5
4 1 0.724406212171 0.891762912273 1.54799091816
4 2 0.689655149734 0.899999976158 1.61111116409
5 0 0.874999960884 0.828571438789 1.37931036949
5 1 0.674841406065 0.90956312418 1.62916636467
5 2 0.78723406851 0.837837815285 1.51612901688
6 0 0.755555583577 0.852941155434 1.55172419548
6 1 0.628908218593 0.90814602375 1.75088262558
6 2 0.704545475543 0.903225779533 1.57142853737
7 0 0.792452858707 0.904761910439 1.39473688602
7 1 0.715417511551 0.861238956451 1.62299346924
7 2 0.659574474777 0.838709652424 1.80769228935
8 0 0.709090921386 0.871794879436 1.61764705181
8 1 0.768634789877 0.864279389381 1.50530946255
8 2 0.878048821335 0.75 1.51851856709
9 0 0.685185201824 0.864864885807 1.6875
9 1 0.758880831415 0.879328429699 1.4985640049
9 2 0.702127682726 0.909090936184 1.5666667223
10 0 0.711864403903 0.904761910439 1.55263161659
10 1 0.670406434412 0.899589121342 1.65812635422
10 2 0.735849068189 0.846153855324 1.60606062412
11 0 0.738461560131 0.854166686535 1.58536589146
11 1 0.665221914888 0.91083753109 1.65041255951
11 2 0.749999977648 0.861111104488 1.54838705063
12 0 0.827586179681 0.791666686535 1.5263158083
12 1 0.845312563611 0.836943626404 1.41346955299
12 2 0.77358493002 0.853658556938 1.51428568363
13 0 0.877551060972 0.837209284306 1.36111116409
13 1 0.698566560041 0.909949541092 1.57316720486
13 2 0.842105263158 0.90625 1.31034481525
14 0 0.761194040686 0.921568632126 1.42553186417
14 1 0.720233576422 0.884838521481 1.56914329529
14 2 0.823529400215 0.833333313465 1.4571428299
15 0 1.13333332433 0.705882370472 1.25
15 1 0.691060908386 0.891494870186 1.62317299843
15 2 0.862745122239 0.818181812763 1.41666662693
16 0 0.98437494316 0.809523820877 1.2549020052
16 1 0.631976570647 0.919856488705 1.7202000618
16 2 0.814814800425 0.79545456171 1.5428571701
17 0 0.720000027466 0.888888895512 1.5625
17 1 0.641952717196 0.918905258179 1.69522058964
17 2 0.749999977648 0.911111116409 1.46341466904
18 0 0.944444394406 0.800000011921 1.32352936268
18 1 1.16651309896 0.67027682066 1.27895772457
18 2 0.737499982417 0.898305058479 1.50943398476
19 0 0.781021910043 0.897196233273 1.42708337307
19 1 0.754122945674 0.875605940819 1.51442968845
19 2 0.806818177446 0.83098590374 1.49152541161
20 0 0.825806451613 0.8359375 1.44859814644
20 1 0.891500044157 0.814779877663 1.37669694424
20 2 0.679611677229 0.971428573132 1.51470589638
21 0 0.840236687576 0.809859156609 1.46956527233
21 1 0.730311275666 0.884009957314 1.54894089699
21 2 0.844036686171 0.836956501007 1.415584445
22 0 0.809278357975 0.87261146307 1.41605842113
22 1 0.823673253611 0.852992296219 1.42331135273
22 2 0.882352947364 0.885714292526 1.27956986427
23 0 0.793893106653 0.850961565971 1.48022603989
23 1 0.676896301967 0.912648916245 1.61872887611
23 2 0.757396449704 0.9140625 1.44444441795
24 0 0.856643345217 0.795918345451 1.46666669846
24 1 0.731723141544 0.866548478603 1.57710409164
24 2 0.848314587425 0.860927164555 1.36923074722
25 0 0.753056218916 0.899350643158 1.4765342474
25 1 0.746088300995 0.899678170681 1.48978161812
25 2 0.83490568479 0.870056509972 1.37662339211
26 0 0.805555587565 0.864721477032 1.43558287621
26 1 0.949758818598 0.77846044302 1.35254001617
26 2 0.724264736355 0.91878169775 1.50276243687
27 0 0.74301676423 0.887218058109 1.51694917679
27 1 0.68862138108 0.890247285366 1.63120615482
27 2 0.780405392519 0.900432884693 1.42307686806
28 0 0.716857588376 0.869863033295 1.60367453098
28 1 0.83277388909 0.819919764996 1.4645409584
28 2 0.776073648011 0.857707500458 1.50230419636
29 0 0.791366914619 0.872727274895 1.44791662693
29 1 0.762502849634 0.879873812199 1.49052107334
29 2 0.844522988831 0.874476969242 1.35406696796
30 0 0.947269333825 0.735586464405 1.43513512611
30 1 0.86101320607 0.809391140938 1.434933424
30 2 1.00664453641 0.69636964798 1.42654025555
31 0 1.20873784379 0.616465866566 1.34201955795
31 1 0.742315932177 0.836477458477 1.61048614979
31 2 0.820588268669 0.824372768402 1.47826087475
32 0 0.925690065278 0.811926603317 1.33050847054
32 1 0.717707963654 0.902517616749 1.54381966591
32 2 0.727710829995 0.887417197227 1.54850745201
33 0 0.819188160171 0.864864885807 1.41145837307
33 1 40744.9992491 2.45428891503e-05 1.0
33 2 0.797297293444 0.864406764507 1.45098042488
34 0 0.771720641185 0.874172210693 1.48232328892
34 1 0.844334281413 0.867093980312 1.36590158939
34 2 0.838624307945 0.864353299141 1.3795620203
35 0 0.823144098162 0.880636632442 1.37951803207
35 1 1.14956444628 0.693742454052 1.25391590595
35 2 0.715328442256 0.894557833672 1.56273758411
36 0 0.78201634471 0.867595791817 1.47389554977
36 1 1.0 0.0 0.0
36 2 0.908127203508 0.821011662483 1.3412321806
37 0 1.32142852642 0.617117106915 1.22627735138
37 1 0.8120123427 0.876159608364 1.40557539463
37 2 0.81914896318 0.848484873772 1.4387755394
38 0 242.000010142 0.00413223123178 1.0
38 1 1.1910247146 0.693368494511 1.21091914177
38 2 1.08982038884 0.708791196346 1.29457366467
39 0 1.27165351257 0.631578922272 1.2450979948
39 1 0.73627158834 0.911510288715 1.49004840851
39 2 1.20901640644 0.671186447144 1.23232328892
40 0 1.07142856687 0.716666638851 1.30232560635
40 1 0.763161442798 0.884790301323 1.48095965385
40 2 0.812064931057 0.831428587437 1.48109960556
41 0 0.853658544032 0.839285731316 1.39574468136
41 1 0.824949592526 0.885896265507 1.36832642555
41 2 0.95977014782 0.796407163143 1.30827069283
42 0 0.886649899614 0.821022748947 1.37370240688
42 1 0.653836102153 0.919764339924 1.66285562515
42 2 1.00628933232 0.765625 1.29795920849
43 0 0.851648385676 0.832258045673 1.41085267067
43 1 0.796565634179 0.851584255695 1.47418093681
43 2 0.821428606401 0.809364557266 1.50413227081
44 0 423.999993682 0.00235849060118 1.0
44 1 0.567817953484 0.948603570461 1.85654771328
44 2 0.912408795645 0.819999992847 1.33658540249
45 0 1.0 0.785234928131 1.2735042572
45 1 0.736123244145 0.90215331316 1.50580632687
45 2 0.858638771323 0.841463387012 1.38405799866
46 0 0.933333363003 0.76530611515 1.39999997616
46 1 1.38725312947 0.605026602745 1.19143354893
46 2 1.75438598693 0.5 1.13999998569
47 0 1.66666660044 0.508333325386 1.1803278923
47 1 1.10202402758 0.74529248476 1.21753704548
47 2 1.14285714286 0.696428596973 1.25641024113
48 0 1.04026848093 0.638709664345 1.50505053997
48 1 0.985004776716 0.752399623394 1.34931409359
48 2 0.928571381131 0.743589758873 1.44827580452
49 0 0.804020115915 0.862500011921 1.44202899933
49 1 0.733134966587 0.87734746933 1.55469226837
49 2 0.823529400215 0.821428596973 1.47826087475
50 0 0.967741965255 0.75 1.37777781487
50 1 0.858414451099 0.838688254356 1.38900053501
50 2 1.13888889266 0.707317054272 1.24137926102
51 0 1.06692911458 0.697416961193 1.34391534328
51 1 0.701203654053 0.932015001774 1.53014612198
51 2 1.09999996722 0.659090936184 1.37931036949
52 0 1.00668899231 0.740863800049 1.34080719948
52 1 0.726988785095 0.896707892418 1.53398561478
52 2 3.11999989586 0.205128207803 1.5625
53 0 1.13149850436 0.616216242313 1.43421053886
53 1 0.922253548132 0.776623904705 1.39617204666
53 2 1.84848481176 0.377049177885 1.43478262424
