1703984
1704240
1704496
1704752
1705008
1705264
1705520
1705776
1703985
1704241
1704497
1704753
1705009
1705265
1705521
1705777
1703986
1704242
1704498
1704754
1705010
1705266
1705522
1705778
1703987
1704243
1704499
1704755
1705011
1705267
1705523
1705779
1703988
1704244
1704500
1704756
1705012
1705268
1705524
1705780
1703989
1704245
1704501
1704757
1705013
1705269
1705525
1705781
1703990
1704246
1704502
1704758
1705014
1705270
1705526
1705782
1703991
1704247
1704503
1704759
1705015
1705271
1705527
1705783
2699264
2699520
2699776
2700032
2700288
2700544
2700800
2701056
2699265
2699521
2699777
2700033
2700289
2700545
2700801
2701057
2699266
2699522
2699778
2700034
2700290
2700546
2700802
2701058
2699267
2699523
2699779
2700035
2700291
2700547
2700803
2701059
2699268
2699524
2699780
2700036
2700292
2700548
2700804
2701060
2699269
2699525
2699781
2700037
2700293
2700549
2700805
2701061
2699270
2699526
2699782
2700038
2700294
2700550
2700806
2701062
2699271
2699527
2699783
2700039
2700295
2700551
2700807
2701063
