0 0 2.49999996275 0.40000000596 1.0
0 1 0.770492815133 0.897900402546 1.44545054436
0 2 0.684210539194 0.923076927662 1.58333337307
1 0 1.0 1.0 1.0
1 1 0.64126808376 0.938889086246 1.66090989113
1 2 0.785714299095 0.818181812763 1.55555558205
2 0 0.666666666667 1.0 1.5
2 1 0.673536865682 0.928515911102 1.59900295734
2 2 0.619047633104 1.0 1.6153845787
3 0 0.4 1.0 2.5
3 1 0.613377384891 0.92871850729 1.755448699
3 2 1.09090906726 0.75 1.22222220898
4 0 0.333333333333 1.0 3.0
4 1 0.713171400975 0.899087429047 1.55956733227
4 2 0.928571381131 0.769230782986 1.39999997616
5 0 0.666666666667 1.0 1.5
5 1 0.627691881295 0.931366503239 1.71053862572
5 2 0.83333330022 0.899999976158 1.33333337307
6 0 1.0 1.0 1.0
6 1 0.59660257044 0.923872113228 1.81427466869
6 2 0.84615388495 1.0 1.18181812763
7 0 0.5 1.0 2.0
7 1 0.678648732589 0.881259679794 1.67205703259
7 2 0.555555570273 1.0 1.79999995232
8 0 0.749999977648 0.666666686535 2.0
8 1 0.689592163092 0.902414619923 1.60694694519
8 2 0.749999977648 0.777777791023 1.71428573132
9 0 0.749999977648 0.666666686535 2.0
9 1 0.721617634547 0.899149656296 1.54120671749
9 2 0.588235277618 0.899999976158 1.88888883591
10 0 0.5 1.0 2.0
10 1 0.670053862419 0.904433608055 1.65011274815
10 2 1.0 0.75 1.33333337307
11 0 0.666666666667 1.0 1.5
11 1 0.679174896316 0.911730825901 1.61492264271
11 2 1.14285714286 0.75 1.16666662693
12 0 1.0 0.5 2.0
12 1 0.573958984475 0.95107614994 1.83190882206
12 2 0.77777778808 1.0 1.28571426868
13 0 1.0 0.666666686535 1.5
13 1 0.692919197914 0.922615885735 1.56421518326
13 2 0.77777778808 0.857142865658 1.5
14 0 0.666666666667 1.0 1.5
14 1 0.728145162942 0.893503069878 1.53704285622
14 2 0.727272727273 0.875 1.57142853737
15 0 0.666666666667 1.0 1.5
15 1 0.869550903498 0.815978586674 1.40937387943
15 2 0.615384615385 0.875 1.85714280605
16 0 0.5 1.0 2.0
16 1 0.606492878708 0.944630622864 1.74546957016
16 2 0.615384615385 1.0 1.625
17 0 1.0 1.0 1.0
17 1 0.652309789233 0.933226108551 1.64270365238
17 2 0.636363650156 0.857142865658 1.83333337307
18 0 1.0 1.0 1.0
18 1 0.598181554339 0.947056412697 1.765188694
18 2 0.466666681502 1.0 2.14285707474
19 0 1.0 1.0 1.0
19 1 0.719659001756 0.904063224792 1.53700208664
19 2 0.899999957085 0.666666686535 1.66666662693
20 0 0.666666666667 1.0 1.5
20 1 0.683481638425 0.922964692116 1.58521461487
20 2 0.615384615385 0.625 2.59999990463
21 0 1.0 1.0 1.0
21 1 0.591566570251 0.947790145874 1.78354537487
21 2 0.727272727273 1.0 1.375
22 0 1.0 1.0 1.0
22 1 0.830099021815 0.839429676533 1.4351118803
22 2 1.16666665508 0.714285731316 1.20000004768
23 0 0.333333333333 1.0 3.0
23 1 0.647282171346 0.940606296062 1.64247393608
23 2 0.642857131909 1.0 1.55555558205
24 0 0.666666666667 0.5 3.0
24 1 0.647944978412 0.910920381546 1.69426548481
24 2 1.14285714286 0.625 1.39999997616
25 0 0.5 1.0 2.0
25 1 0.686306021048 0.942441940308 1.54606437683
25 2 0.888888888889 1.0 1.125
26 0 0.5 1.0 2.0
26 1 0.997350222539 0.757118880749 1.32430565357
26 2 0.692307705005 0.888888895512 1.625
27 0 0.5 1.0 2.0
27 1 0.67026496479 0.913742959499 1.63278663158
27 2 0.476190497816 1.0 2.09999990463
28 0 1.0 1.0 1.0
28 1 0.756478819272 0.874694108963 1.51128721237
28 2 0.733333327505 1.0 1.36363637447
29 0 1.0 0.5 2.0
29 1 0.62989553788 0.956410646439 1.65991961956
29 2 1.0 0.909090936184 1.10000002384
30 0 0.666666666667 1.0 1.5
30 1 0.601251283247 0.927943944931 1.79234755039
30 2 0.866666673554 0.769230782986 1.5
31 0 0.600000014305 1.0 1.66666662693
31 1 0.378199505888 0.974043667316 2.71456742287
31 2 0.705882372741 1.0 1.41666662693
32 0 0.666666666667 1.0 1.5
32 1 0.974810618298 0.657733559608 1.55965936184
32 2 0.72222220309 0.923076927662 1.5
33 0 0.83333330022 1.0 1.20000004768
33 1 0.532626534714 0.974300503731 1.92701137066
33 2 0.882352947364 0.800000011921 1.41666662693
34 0 0.5 1.0 2.0
34 1 0.710355260279 0.92725944519 1.51817941666
34 2 0.789473694117 0.933333337307 1.35714280605
35 0 0.8 0.75 1.66666662693
35 1 0.727217749346 0.9065964818 1.51677620411
35 2 1.05555553109 0.684210538864 1.3846154213
36 0 1.0 1.0 1.0
36 1 0.574612096448 0.953845918179 1.82451331615
36 2 1.58333339625 0.578947365284 1.09090912342
37 0 2.0 0.25 2.0
37 1 0.758944615082 0.898775577545 1.46601581573
37 2 1.4999999553 0.555555582047 1.20000004768
38 0 1.4999999553 0.666666686535 1.0
38 1 1.14906268047 0.674179017544 1.29086565971
38 2 0.909090889387 0.899999976158 1.22222220898
39 0 8.0 0.125 1.0
39 1 0.696193084137 0.938970148563 1.52974319458
39 2 1.52941178616 0.615384638309 1.0625
40 0 1.0 1.0 1.0
40 1 0.771016654425 0.884010195732 1.46716499329
40 2 0.724137942941 0.857142865658 1.61111116409
41 0 1.14285714286 0.625 1.39999997616
41 1 0.660498575716 0.958826184273 1.57902216911
41 2 3.54545438216 0.282051295042 1.0
42 0 1.4285714529 0.699999988079 1.0
42 1 0.605730336673 0.942973613739 1.7507379055
42 2 0.874999960884 0.800000011921 1.42857146263
43 0 0.699999983311 0.857142865658 1.66666662693
43 1 0.711367521049 0.893478691578 1.57333695889
43 2 1.27777779047 0.739130437374 1.05882358551
44 0 0.77777778808 1.0 1.28571426868
44 1 0.751574581562 0.87613427639 1.51864850521
44 2 0.814814800425 0.909090936184 1.35000002384
45 0 0.77777778808 1.0 1.28571426868
45 1 0.662978555921 0.927069425583 1.62700271606
45 2 0.911764683505 0.870967745781 1.25925922394
46 0 0.666666666667 0.875 1.71428573132
46 1 0.671029213653 0.932671010494 1.597828269
46 2 7.19999965668 0.138888895512 1.0
47 0 1.44444440618 0.615384638309 1.125
47 1 0.996644232708 0.781349241734 1.28414666653
47 2 1.33333333333 0.666666686535 1.125
48 0 1.05882355911 0.833333313465 1.13333332539
48 1 0.590561098685 0.924569427967 1.83145236969
48 2 0.941176470588 0.75 1.41666662693
49 0 1.0 0.833333313465 1.20000004768
49 1 1.21414773275 0.612235307693 1.345271945
49 2 0.937499951106 0.766666650772 1.39130437374
50 0 0.888888888889 0.75 1.5
50 1 0.941347146538 0.789451479912 1.34562718868
50 2 0.769230797446 0.899999976158 1.44444441795
51 0 0.888888888889 0.75 1.5
51 1 0.675192514116 0.951545536518 1.55647742748
51 2 0.84615388495 0.818181812763 1.44444441795
52 0 8.0 0.125 1.0
52 1 0.538958068079 0.941416144371 1.97089457512
52 2 2.35714278689 0.333333343267 1.27272725105
53 0 1.0 0.0 0.0
53 1 1.0 0.0 0.0
53 2 1.0 0.0 0.0
