0 0 0.842105263158 0.875 1.35714280605
0 1 0.794462501445 0.880866348743 1.42894852161
0 2 0.941176470588 0.6875 1.54545450211
1 0 0.794117669333 0.925925910473 1.36000001431
1 1 0.708924987431 0.907968938351 1.55356252193
1 2 0.684210539194 0.923076927662 1.58333337307
2 0 0.707317081397 0.965517222881 1.46428573132
2 1 0.765049860526 0.895649313927 1.45939302444
2 2 0.566666662163 0.882352948189 2.0
3 0 0.731707312818 0.899999976158 1.51851856709
3 1 0.705888669028 0.922746896744 1.53525733948
3 2 1.0 0.800000011921 1.25
4 0 0.68888886699 0.967741906643 1.5
4 1 0.730624036433 0.88865250349 1.5401892662
4 2 0.636363650156 0.714285731316 2.20000004768
5 0 0.891891889018 0.878787875175 1.27586209774
5 1 0.678208691874 0.911594212055 1.61746573448
5 2 0.600000014305 1.0 1.66666662693
6 0 0.578947361156 0.939393937588 1.83870971203
6 1 0.618231434982 0.916751205921 1.76440155506
6 2 0.666666666667 0.833333313465 1.79999995232
7 0 0.724999987036 0.965517222881 1.42857146263
7 1 0.713441495064 0.865548789501 1.61938488483
7 2 0.708333315742 0.882352948189 1.60000002384
8 0 0.710526318018 0.925925910473 1.51999998093
8 1 0.755644878774 0.876171171665 1.51040458679
8 2 1.0 0.823529422283 1.21428573132
9 0 0.852941152546 0.896551728249 1.30769228935
9 1 0.754183084184 0.885198295116 1.49789941311
9 2 0.720000027466 0.888888895512 1.5625
10 0 0.775000023097 0.93548387289 1.37931036949
10 1 0.667922207831 0.908681690693 1.64763998985
10 2 0.740740727659 0.899999976158 1.5
11 0 0.749999977648 0.939393937588 1.41935479641
11 1 0.657117378289 0.921079099178 1.65219056606
11 2 0.77777778808 0.904761910439 1.42105257511
12 0 0.909090889387 0.774999976158 1.41935479641
12 1 0.814586924244 0.859793901443 1.42780268192
12 2 0.78260868754 0.944444417953 1.35294115543
13 0 0.739999984121 0.864864885807 1.5625
13 1 0.701825333121 0.914480447769 1.55810439587
13 2 0.656249987776 0.904761910439 1.68421053886
14 0 0.83333330022 0.875 1.37142860889
14 1 0.708576712947 0.89499348402 1.57686042786
14 2 0.741935463899 0.913043498993 1.47619044781
15 0 1.06521735818 0.755102038383 1.24324321747
15 1 0.679609640036 0.902289450169 1.63077712059
15 2 0.843749993714 0.962962985039 1.23076927662
16 0 0.855072460814 0.796610176563 1.46808505058
16 1 0.629085978376 0.926130414009 1.71639740467
16 2 1.07142856687 0.800000011921 1.16666662693
17 0 0.747474760076 0.837837815285 1.59677422047
17 1 0.633493535368 0.928536534309 1.7000387907
17 2 0.68888886699 0.967741906643 1.5
18 0 0.772277220431 0.897435903549 1.44285714626
18 1 1.08434361636 0.719487309456 1.28176951408
18 2 0.970588262518 0.787878811359 1.30769228935
19 0 0.832061030844 0.889908254147 1.35051548481
19 1 0.738865870244 0.888428449631 1.52339291573
19 2 0.791666698125 0.868421077728 1.45454549789
20 0 0.802816890625 0.903508782387 1.37864077091
20 1 0.903096811895 0.818951904774 1.35209512711
20 2 0.83333330022 0.888888895512 1.35000002384
21 0 0.892617435381 0.857142865658 1.30701756477
21 1 0.724585356542 0.897383987904 1.53791427612
21 2 0.852459056375 0.865384638309 1.35555553436
22 0 0.756756776262 0.914285719395 1.4453125
22 1 0.808225575325 0.869389712811 1.42315733433
22 2 0.93103452103 0.814814805984 1.31818187237
23 0 0.785714299095 0.871657729149 1.46012270451
23 1 0.668046516495 0.92085981369 1.6255480051
23 2 0.8048780441 0.878787875175 1.41379308701
24 0 0.93220334651 0.7909091115 1.35632181168
24 1 0.719117521244 0.88014703989 1.57995557785
24 2 0.824742284258 0.800000011921 1.515625
25 0 0.851063864325 0.887499988079 1.32394361496
25 1 0.738675107687 0.908849537373 1.48954820633
25 2 0.865384577691 0.87777775526 1.31645572186
26 0 0.751918157651 0.908163249493 1.46441948414
26 1 0.92781250432 0.795002639294 1.35572373867
26 2 0.765100658898 0.877192974091 1.49000000954
27 0 0.745495469275 0.891238689423 1.50508475304
27 1 0.67230890756 0.902701258659 1.64773392677
27 2 0.728395031713 0.898305058479 1.52830183506
28 0 0.645101673821 0.919770777225 1.6853582859
28 1 0.763689679329 0.854621469975 1.53217816353
28 2 0.721311481048 0.893939375877 1.55084741116
29 0 0.782978745647 0.888586938381 1.43730890751
29 1 0.740399511379 0.894443273544 1.51001441479
29 2 0.809523818715 0.926470577717 1.33333337307
30 0 0.964370539765 0.75123155117 1.38032782078
30 1 0.862664916918 0.814781904221 1.4227104187
30 2 0.803030310282 0.811320781708 1.53488373756
31 0 0.845991578415 0.800498723984 1.47663545609
31 1 0.709079473105 0.849734902382 1.65966963768
31 2 0.783653873551 0.840490818024 1.51824820042
32 0 0.871111074189 0.844387769699 1.35951662064
32 1 0.710815552581 0.909829139709 1.54626250267
32 2 0.671171167207 0.939597308636 1.58571434021
33 0 0.812362037746 0.872282624245 1.4112149477
33 1 1.0 0.0 0.0
33 2 0.814606779216 0.868965506554 1.4126983881
34 0 0.7660943963 0.882352948189 1.4793651104
34 1 0.826947464054 0.879306435585 1.37525057793
34 2 0.790000010359 0.892405092716 1.4184397459
35 0 0.811797736499 0.903114199638 1.36398470402
35 1 1.01767647986 0.766936600208 1.28124094009
35 2 0.789189155626 0.821917831898 1.54166662693
36 0 0.727868875787 0.909909904003 1.50990104675
36 1 1.0 0.0 0.0
36 2 0.900709262503 0.834645688534 1.33018863201
37 0 1.2714285855 0.679775297642 1.15702474117
37 1 0.795719589314 0.890106260777 1.41188097
37 2 0.868055592923 0.864000022411 1.33333337307
38 0 1.0 0.0 0.0
38 1 1.10197784644 0.738710582256 1.22843670845
38 2 1.05952379449 0.752808988094 1.25373136997
39 0 1.2918918869 0.635983288288 1.21710526943
39 1 0.722354733307 0.917356014252 1.50907766819
39 2 1.07843136121 0.733333349228 1.26446282864
40 0 0.89802627318 0.805860817432 1.38181817532
40 1 0.73888513415 0.896507143974 1.50962591171
40 2 0.76888891048 0.878612697124 1.48026311398
41 0 0.916279049446 0.812182724476 1.34375
41 1 0.99029889087 0.784042596817 1.28793537617
41 2 0.919354819265 0.77192980051 1.40909087658
42 0 0.951417052722 0.808510661125 1.29999995232
42 1 0.646533155583 0.925249636173 1.67166888714
42 2 0.87309648474 0.825581371784 1.38732397556
43 0 0.809734488502 0.885245919228 1.39506173134
43 1 0.781718506124 0.862268507481 1.48356664181
43 2 0.731707312818 0.833333313465 1.63999998569
44 0 1.0 0.0 0.0
44 1 0.55972051233 0.950747311115 1.87915956974
44 2 0.842105263158 0.8203125 1.44761908054
45 0 0.909090889387 0.744444429874 1.47761189938
45 1 0.722990509153 0.911438703537 1.51753926277
45 2 0.897435902922 0.790476202965 1.40963852406
46 0 3.29411760086 0.294642865658 1.0303030014
46 1 1.08661035044 0.739000916481 1.24532055855
46 2 1.27118640087 0.653333306313 1.20408165455
47 0 1.3655913821 0.614173233509 1.19230771065
47 1 1.01113908109 0.792004287243 1.24871003628
47 2 1.01886791307 0.833333313465 1.17777776718
48 0 0.977064183852 0.704225361347 1.45333337784
48 1 0.926217054077 0.782484650612 1.37978494167
48 2 0.897058837683 0.836065590382 1.33333337307
49 0 0.742857137797 0.833333313465 1.6153845787
49 1 0.718315407006 0.886494576931 1.57039439678
49 2 0.736842133002 0.910714268684 1.49019610882
50 0 0.840319342282 0.828978598118 1.43553006649
50 1 0.848410337072 0.851007521152 1.38503468037
50 2 0.930693025367 0.829787254333 1.2948718071
51 0 0.964879904853 0.743295013905 1.39432990551
51 1 0.711198047857 0.926442921162 1.51771688461
51 2 0.847328235793 0.828828811646 1.42391300201
52 0 1.06890456055 0.717355370522 1.30414748192
52 1 0.732924481748 0.891399741173 1.53062319756
52 2 2.18518519001 0.316384166479 1.44642853737
53 0 1.09165303826 0.668665647507 1.36995518208
53 1 0.940400971005 0.759966433048 1.39924097061
53 2 1.10489512884 0.588607609272 1.53763437271
