0 0 1.0 0.0 0.0
0 1 0.666666666667 1.0 1.5
0 2 1.0 0.0 0.0
1 0 1.0 0.0 0.0
1 1 0.666666666667 1.0 1.5
1 2 1.0 0.0 0.0
2 0 1.0 0.0 0.0
2 1 0.5 0.666666686535 3.0
2 2 1.0 0.0 0.0
3 0 1.0 0.0 0.0
3 1 0.466666681502 1.0 2.14285707474
3 2 1.0 0.0 0.0
4 0 1.0 0.0 0.0
4 1 0.666666666667 0.833333313465 1.79999995232
4 2 1.0 0.0 0.0
5 0 1.0 0.0 0.0
5 1 0.749999977648 1.0 1.33333337307
5 2 1.0 0.0 0.0
6 0 1.0 0.0 0.0
6 1 0.749999977648 1.0 1.33333337307
6 2 1.0 0.0 0.0
7 0 1.0 0.0 0.0
7 1 1.0 0.833333313465 1.20000004768
7 2 1.0 0.0 0.0
8 0 1.0 0.0 0.0
8 1 1.0 1.0 1.0
8 2 1.0 0.0 0.0
9 0 1.0 0.0 0.0
9 1 0.71428572645 0.800000011921 1.75
9 2 1.0 0.0 0.0
10 0 1.0 0.0 0.0
10 1 0.555555570273 1.0 1.79999995232
10 2 1.0 0.0 0.0
11 0 1.0 0.0 0.0
11 1 1.20000002861 0.666666686535 1.25
11 2 1.0 0.0 0.0
12 0 1.0 0.0 0.0
12 1 0.857142886337 1.0 1.16666662693
12 2 1.0 0.0 0.0
13 0 1.0 0.0 0.0
13 1 0.874999960884 0.857142865658 1.33333337307
13 2 1.0 0.0 0.0
14 0 1.0 0.0 0.0
14 1 0.749999977648 1.0 1.33333337307
14 2 1.0 0.0 0.0
15 0 1.0 0.0 0.0
15 1 0.699999983311 1.0 1.42857146263
15 2 1.0 0.0 0.0
16 0 1.0 0.0 0.0
16 1 0.538461553275 1.0 1.85714280605
16 2 1.0 0.0 0.0
17 0 1.0 0.0 0.0
17 1 0.636363650156 0.857142865658 1.83333337307
17 2 1.0 0.0 0.0
18 0 1.0 0.0 0.0
18 1 0.461538444609 1.0 2.16666674614
18 2 1.0 0.0 0.0
19 0 1.0 0.0 0.0
19 1 0.874999960884 0.857142865658 1.33333337307
19 2 1.0 0.0 0.0
20 0 1.0 0.0 0.0
20 1 0.749999977648 1.0 1.33333337307
20 2 1.0 0.0 0.0
21 0 1.0 0.0 0.0
21 1 0.77777778808 0.857142865658 1.5
21 2 1.0 0.0 0.0
22 0 1.0 0.0 0.0
22 1 0.874999960884 0.857142865658 1.33333337307
22 2 1.0 0.0 0.0
23 0 1.0 0.0 0.0
23 1 0.538461553275 1.0 1.85714280605
23 2 1.0 0.0 0.0
24 0 1.0 0.0 0.0
24 1 0.699999983311 1.0 1.42857146263
24 2 1.0 0.0 0.0
25 0 1.0 0.0 0.0
25 1 0.749999977648 1.0 1.33333337307
25 2 1.0 0.0 0.0
26 0 1.0 0.0 0.0
26 1 2.33333331015 0.428571432829 1.0
26 2 1.0 0.0 0.0
27 0 1.0 0.0 0.0
27 1 1.0 0.833333313465 1.20000004768
27 2 1.0 0.0 0.0
28 0 1.0 0.0 0.0
28 1 0.83333330022 1.0 1.20000004768
28 2 1.0 0.0 0.0
29 0 1.0 0.0 0.0
29 1 0.666666666667 1.0 1.5
29 2 1.0 0.0 0.0
30 0 1.0 0.0 0.0
30 1 0.437499980442 1.0 2.28571438789
30 2 1.0 0.0 0.0
31 0 1.0 0.0 0.0
31 1 1.0 0.0 0.0
31 2 1.0 0.0 0.0
32 0 1.0 0.0 0.0
32 1 1.20000002861 0.666666686535 1.25
32 2 1.0 0.0 0.0
33 0 1.0 0.0 0.0
33 1 0.71428572645 1.0 1.39999997616
33 2 1.0 0.0 0.0
34 0 1.0 0.0 0.0
34 1 0.545454533632 1.0 1.83333337307
34 2 1.0 0.0 0.0
35 0 1.0 0.0 0.0
35 1 0.411764700108 1.0 2.42857146263
35 2 1.0 0.0 0.0
36 0 1.0 0.0 0.0
36 1 0.583333327538 0.857142865658 2.0
36 2 1.0 0.0 0.0
37 0 1.0 0.0 0.0
37 1 0.583333327538 1.0 1.71428573132
37 2 1.0 0.0 0.0
38 0 1.0 0.0 0.0
38 1 0.874999960884 0.857142865658 1.33333337307
38 2 1.0 0.0 0.0
39 0 1.0 0.0 0.0
39 1 0.636363650156 1.0 1.57142853737
39 2 1.0 0.0 0.0
40 0 1.0 0.0 0.0
40 1 0.600000014305 1.0 1.66666662693
40 2 1.0 0.0 0.0
41 0 1.0 0.0 0.0
41 1 0.666666666667 0.833333313465 1.79999995232
41 2 1.0 0.0 0.0
42 0 1.0 0.0 0.0
42 1 0.5 0.857142865658 2.33333325386
42 2 1.0 0.0 0.0
43 0 1.0 0.0 0.0
43 1 0.71428572645 0.800000011921 1.75
43 2 1.0 0.0 0.0
44 0 1.0 0.0 0.0
44 1 0.71428572645 1.0 1.39999997616
44 2 1.0 0.0 0.0
45 0 1.0 0.0 0.0
45 1 0.600000014305 0.833333313465 2.0
45 2 1.0 0.0 0.0
46 0 1.0 0.0 0.0
46 1 0.857142886337 0.666666686535 1.75
46 2 1.0 0.0 0.0
47 0 1.0 0.0 0.0
47 1 0.71428572645 0.800000011921 1.75
47 2 1.0 0.0 0.0
48 0 1.0 0.0 0.0
48 1 0.666666666667 1.0 1.5
48 2 1.0 0.0 0.0
49 0 1.0 0.0 0.0
49 1 1.0 0.666666686535 1.5
49 2 1.0 0.0 0.0
50 0 1.0 0.0 0.0
50 1 0.666666666667 0.833333313465 1.79999995232
50 2 1.0 0.0 0.0
51 0 1.0 0.0 0.0
51 1 0.5 1.0 2.0
51 2 1.0 0.0 0.0
52 0 1.0 0.0 0.0
52 1 0.749999977648 1.0 1.33333337307
52 2 1.0 0.0 0.0
