0 0 0.68000001297 0.823529422283 1.78571426868
0 1 0.790242102909 0.886050462723 1.42817485332
0 2 0.600000014305 1.0 1.66666662693
1 0 0.941176470588 0.75 1.41666662693
1 1 0.705820781971 0.911013484001 1.55518019199
1 2 0.842105263158 0.875 1.35714280605
2 0 0.809523818715 0.882352948189 1.39999997616
2 1 0.740373437842 0.909123957157 1.4856826067
2 2 0.761904761905 0.875 1.5
3 0 0.793103412414 0.826086938381 1.5263158083
3 1 0.705864910042 0.929422974586 1.52428090572
3 2 0.809523818715 0.823529422283 1.5
4 0 0.68000001297 1.0 1.47058820724
4 1 0.725439558306 0.898425221443 1.53432309628
4 2 0.593749995576 0.947368443012 1.77777779102
5 0 0.676470585863 0.956521749496 1.54545450211
5 1 0.6680609344 0.920740067959 1.62572419643
5 2 0.699999983311 0.785714268684 1.81818187237
6 0 0.956521778792 0.863636374474 1.21052634716
6 1 0.621151856993 0.920948147774 1.74810290337
6 2 0.944444394406 0.764705896378 1.3846154213
7 0 0.793103412414 0.826086938381 1.5263158083
7 1 0.715606216485 0.874266088009 1.59838819504
7 2 0.482758628627 1.0 2.07142853737
8 0 0.909090889387 0.850000023842 1.29411768913
8 1 0.758480043104 0.8829459548 1.4932128191
8 2 0.8 0.875 1.42857146263
9 0 0.699999983311 1.0 1.42857146263
9 1 0.739482357554 0.898117661476 1.50570178032
9 2 0.749999977648 0.888888895512 1.5
10 0 0.71428572645 0.800000011921 1.75
10 1 0.665941974048 0.916873633862 1.63777470589
10 2 0.818181827049 0.888888895512 1.375
11 0 0.840000008011 0.904761910439 1.31578946114
11 1 0.672156885495 0.920674204826 1.61593306065
11 2 0.807692278066 0.904761910439 1.36842107773
12 0 1.0434782825 0.708333313465 1.35294115543
12 1 0.821785333449 0.860861122608 1.41354131699
12 2 0.666666666667 0.949999988079 1.57894742489
13 0 0.793103412414 0.826086938381 1.5263158083
13 1 0.69770015174 0.924031257629 1.55111682415
13 2 0.77777778808 0.952380955219 1.35000002384
14 0 1.10526315096 0.809523820877 1.11764705181
14 1 0.712502475911 0.902644574642 1.55487990379
14 2 0.793103412414 0.869565188885 1.45000004768
15 0 1.33333333333 0.607142865658 1.23529410362
15 1 0.685660124405 0.911960482597 1.59924530983
15 2 0.827586179681 0.958333313465 1.26086962223
16 0 1.0 0.740740716457 1.35000002384
16 1 0.630094538127 0.934474110603 1.69834923744
16 2 0.843749993714 0.925925910473 1.27999997139
17 0 0.815789458329 0.870967745781 1.40740740299
17 1 0.648835452621 0.933660805225 1.65073096752
17 2 0.843749993714 0.962962985039 1.23076927662
18 0 0.883720949832 0.89473682642 1.26470589638
18 1 1.10428147922 0.724921286106 1.24919259548
18 2 0.756756776262 0.821428596973 1.60869562626
19 0 0.85185188194 0.869565188885 1.35000002384
19 1 0.747008686597 0.894790768623 1.496073246
19 2 0.848484823964 0.821428596973 1.43478262424
20 0 0.981481438148 0.811320781708 1.25581395626
20 1 0.912755971791 0.821329295635 1.33391451836
20 2 0.761904761905 0.90625 1.44827580452
21 0 0.859154897842 0.803278684616 1.44897961617
21 1 0.729720706334 0.905528068542 1.51335716248
21 2 0.863636368316 0.89473682642 1.29411768913
22 0 0.816091917122 0.91549295187 1.33846151829
22 1 0.780694456866 0.891648292542 1.43656504154
22 2 0.916666639348 0.863636374474 1.26315784454
23 0 0.69444441685 0.973333358765 1.47945201397
23 1 0.677074356473 0.926318764687 1.59442162514
23 2 0.849999964535 0.86274510622 1.36363637447
24 0 0.89108913836 0.866666674614 1.2948718071
24 1 0.719027713218 0.885803759098 1.57006216049
24 2 0.746987932496 0.887096762657 1.50909090042
25 0 0.74305552972 0.925233662128 1.45454549789
25 1 0.745408026666 0.915329217911 1.46564435959
25 2 0.79761903064 0.925373136997 1.3548387289
26 0 0.678756470395 0.87786257267 1.67826092243
26 1 0.962249914026 0.788560390472 1.31788384914
26 2 0.793814449574 0.883116900921 1.42647063732
27 0 0.713567847745 0.91549295187 1.53076922894
27 1 0.688455056491 0.905228018761 1.6045986414
27 2 0.756097532397 0.903225779533 1.46428573132
28 0 0.645739888222 0.902777791023 1.71538460255
28 1 0.753846852032 0.867468476295 1.52919614315
28 2 0.789473694117 0.819047629833 1.54651165009
29 0 0.764423042313 0.893081784248 1.46478867531
29 1 0.735705023664 0.904083013535 1.50344645977
29 2 0.817460342209 0.90291261673 1.3548387289
30 0 0.95384619583 0.790322601795 1.32653057575
30 1 0.856514855953 0.820696532726 1.42259895802
30 2 0.966942150666 0.786324799061 1.31521737576
31 0 0.838095200035 0.806818187237 1.47887325287
31 1 0.711616992535 0.855065226555 1.64344227314
31 2 0.758389253857 0.893805325031 1.47524750233
32 0 0.783783766107 0.856321811676 1.48993289471
32 1 0.704481159686 0.914222717285 1.55266797543
32 2 0.676470585863 0.92173910141 1.6037735939
33 0 0.768181847735 0.917159736156 1.41935479641
33 1 1.0 0.0 0.0
33 2 0.875912420954 0.858333349228 1.33009707928
34 0 0.756756776262 0.880952358246 1.5
34 1 0.850325483395 0.863847851753 1.3613743782
34 2 0.897058837683 0.827868878841 1.34653460979
35 0 0.829113902782 0.870229005814 1.38596487045
35 1 0.940338142969 0.802922785282 1.32447004318
35 2 0.737179494503 0.834782600403 1.625
36 0 0.732026125539 0.866071403027 1.57731962204
36 1 1.0 0.0 0.0
36 2 0.826446254937 0.889999985695 1.35955059528
37 0 1.32432432859 0.571428596973 1.32142853737
37 1 0.806759128205 0.881233692169 1.40658187866
37 2 0.808695643791 0.892473101616 1.38554215431
38 0 113.999999151 0.00877192988992 1.0
38 1 1.0775101788 0.752671420574 1.23302876949
38 2 0.970588262518 0.803030312061 1.28301882744
39 0 1.21138212321 0.664429545403 1.24242424965
39 1 0.72806528158 0.915283977985 1.50063073635
39 2 1.05454545226 0.706896543503 1.34146344662
40 0 0.933333363003 0.730158746243 1.46739125252
40 1 0.760688218784 0.888384699821 1.47976315022
40 2 0.854304663414 0.821705400944 1.42452836037
41 0 0.825112121738 0.858695626259 1.41139245033
41 1 1.420487867 0.6109354496 1.15230417252
41 2 1.22641507779 0.623076915741 1.30864202976
42 0 0.935114470204 0.840816318989 1.27184462547
42 1 0.675045758235 0.917283833027 1.61496472359
42 2 0.978260813791 0.800000011921 1.27777779102
43 0 0.784431161242 0.874045789242 1.45851528645
43 1 0.813576707168 0.852631986141 1.44158387184
43 2 0.798780472128 0.824427485466 1.51851856709
44 0 182.499995156 0.00547945220023 1.0
44 1 0.579658261356 0.951208055019 1.81364572048
44 2 0.782352934045 0.849624037743 1.50442481041
45 0 0.849829377814 0.819277107716 1.4362745285
45 1 0.76367354976 0.892117261887 1.46781146526
45 2 1.04316549178 0.751724123955 1.27522933483
46 0 1.11439117676 0.652317881584 1.37563455105
46 1 1.06349524302 0.744855344296 1.26238703728
46 2 1.9473684516 0.479729741812 1.07042253017
47 0 1.32398749248 0.639999985695 1.18014705181
47 1 1.06125454271 0.764608025551 1.23237133026
47 2 1.03409090699 0.714285731316 1.35384619236
48 0 0.844696980377 0.747384130955 1.58399999142
48 1 0.940691079726 0.780257821083 1.36243200302
48 2 0.88518519691 0.807531356812 1.3989636898
49 0 0.799808395511 0.797604799271 1.5675675869
49 1 0.718616190137 0.882625281811 1.57661855221
49 2 0.868327403609 0.807377040386 1.4263958931
50 0 0.885286741723 0.799061059952 1.41363108158
50 1 0.867833149341 0.830225408077 1.38793063164
50 2 1.01616626609 0.731818199158 1.34472048283
51 0 0.961193975808 0.75388199091 1.38002061844
51 1 0.74812391737 0.893636763096 1.49577212334
51 2 0.97764230698 0.754677772522 1.35537195206
52 0 1.04890148724 0.699324309826 1.3632850647
52 1 0.805358838739 0.837361395359 1.48285138607
52 2 2.14402179035 0.323193907738 1.44313728809
53 0 1.33947154747 0.512253463268 1.45740962029
53 1 1.10529140329 0.650194168091 1.39149022102
53 2 1.3046874514 0.497005999088 1.54216861725
