2179072
2179328
2179584
2179840
2180096
2180352
2180608
2180864
2179073
2179329
2179585
2179841
2180097
2180353
2180609
2180865
2179074
2179330
2179586
2179842
2180098
2180354
2180610
2180866
2179075
2179331
2179587
2179843
2180099
2180355
2180611
2180867
2179076
2179332
2179588
2179844
2180100
2180356
2180612
2180868
2179077
2179333
2179589
2179845
2180101
2180357
2180613
2180869
2179078
2179334
2179590
2179846
2180102
2180358
2180614
2180870
2179079
2179335
2179591
2179847
2180103
2180359
2180615
2180871
2639912
2640168
2640424
2640680
2640936
2641192
2641448
2641704
2639913
2640169
2640425
2640681
2640937
2641193
2641449
2641705
2639914
2640170
2640426
2640682
2640938
2641194
2641450
2641706
2639915
2640171
2640427
2640683
2640939
2641195
2641451
2641707
2639916
2640172
2640428
2640684
2640940
2641196
2641452
2641708
2639917
2640173
2640429
2640685
2640941
2641197
2641453
2641709
2639918
2640174
2640430
2640686
2640942
2641198
2641454
2641710
2639919
2640175
2640431
2640687
2640943
2641199
2641455
2641711
