404025
1064752
1128231
1129770
1255206
1387567
1454112
1583136
1584160
1584162
1583651
1583907
1584419
1583396
1584676
1583398
1583654
1583911
1585707
1653808
1654326
1779751
1846843
1910309
2047536
2700080
2764349
3029039
3029040
3090737
3090738
3090740
3090485
3090997
3092022
3092534
3091255
3091511
3092535
3091256
