0 0 0.893939353574 0.792372882366 1.41176474094
0 1 0.75847695701 0.916941463947 1.43785786629
0 2 1.09999996722 0.636363625526 1.42857146263
1 0 0.797752835702 0.840375602245 1.49162006378
1 1 0.738384468855 0.902990996838 1.499802351
1 2 0.722379615353 0.815686285496 1.6971154213
2 0 0.776632283953 0.902654886246 1.42647063732
2 1 0.709613920351 0.948678195477 1.48545312881
2 2 0.738341965036 0.821052610874 1.64957261086
3 0 0.766784442607 0.861751139164 1.5133689642
3 1 0.475814083394 0.920570552349 2.28299856186
3 2 0.693820244932 0.862348198891 1.67136144638
4 0 0.653950940084 0.891666650772 1.71495330334
4 1 0.596001932532 0.958294928074 1.75086688995
4 2 0.859649092243 0.70068025589 1.66019415855
5 0 0.790613753797 0.817351579666 1.54748606682
5 1 0.625147500418 0.961706519127 1.66331672668
5 2 0.76204817307 0.770750999451 1.70256412029
6 0 1.0 0.0 0.0
6 1 0.611336021472 0.953789114952 1.71501398087
6 2 0.807407435926 0.825688064098 1.5
7 0 0.759615369813 0.917721509933 1.43448281288
7 1 0.695541024618 0.934584677219 1.53836226463
7 2 0.647272731762 0.870786488056 1.77419352531
8 0 0.742616051685 0.92045456171 1.46296298504
8 1 0.662185058626 0.948276400566 1.59252297878
8 2 0.856481449811 0.78918915987 1.47945201397
9 0 0.79012345679 0.869791686535 1.45508980751
9 1 0.650330758532 0.950674772263 1.61746072769
9 2 0.822222228757 0.816216230392 1.49006617069
10 0 0.741071456178 0.907630503178 1.48672568798
10 1 0.664231749085 0.92664206028 1.62468206882
10 2 0.906250003376 0.793103456497 1.39130437374
11 0 0.856630835719 0.857740581036 1.36097562313
11 1 0.626653914372 0.95712441206 1.66726195812
11 2 0.809523818715 0.823529422283 1.5
12 0 0.858208949116 0.852173924446 1.36734688282
12 1 0.577299143295 0.96763086319 1.79014980793
12 2 0.733333327505 0.836363613605 1.63043475151
13 0 0.807971017634 0.887892365456 1.39393937588
13 1 0.772825489527 0.752409040928 1.71974694729
13 2 0.925000041351 0.790540516376 1.36752140522
14 0 0.890151507916 0.863829791546 1.30049264431
14 1 0.618622293493 0.951291501522 1.69926381111
14 2 0.837438410859 0.794117629528 1.50370371342
15 0 0.951965107129 0.807339429855 1.30113637447
15 1 0.714529945689 0.904087305069 1.54799365997
15 2 0.790575902414 0.854304611683 1.4806201458
16 0 0.896551753621 0.831730782986 1.34104049206
16 1 0.694866527869 0.918397247791 1.56699645519
16 2 0.891304345516 0.768292665482 1.46031749249
17 0 0.828947335915 0.910052895546 1.32558143139
17 1 0.626377746355 0.963894486427 1.65628159046
17 2 0.769633498246 0.91836732626 1.41481482983
18 0 1.238372078 0.680751144886 1.18620693684
18 1 0.481295994632 0.975021898746 2.1309504509
18 2 0.831578912933 0.848101258278 1.41791045666
19 0 0.839130412602 0.880829036236 1.35294115543
19 1 0.863908709964 0.797625660896 1.4512193203
19 2 0.896969728076 0.824324309826 1.35245907307
20 0 1.04830920531 0.728110611439 1.31012654305
20 1 0.867376944645 0.724894881248 1.59043931961
20 2 0.721951199361 0.905405402184 1.52985072136
21 0 0.779735702884 0.932203412056 1.37575757504
21 1 0.578903372309 0.963194012642 1.79341232777
21 2 0.902857118256 0.816455721855 1.35658919811
22 0 0.66557374916 0.906403958797 1.65760874748
22 1 0.651379460826 0.901359319687 1.70320916176
22 2 0.923076889219 0.805555582047 1.34482753277
23 0 0.801652883085 0.89175260067 1.39884388447
23 1 0.621218050097 0.963747560978 1.67029285431
23 2 0.877300603231 0.846153855324 1.34710741043
24 0 1.22162160115 0.646017670631 1.26712334156
24 1 0.657314947088 0.935398757458 1.62640869617
24 2 0.958620710146 0.791366934776 1.31818187237
25 0 0.690391432129 0.97422683239 1.48677253723
25 1 0.673349045813 0.945273220539 1.57109475136
25 2 0.755681841727 0.857142865658 1.54385960102
26 0 0.793103412414 0.898550748825 1.40322577953
26 1 0.807517726223 0.827313601971 1.4968483448
26 2 0.806060582766 0.812030076981 1.52777779102
27 0 0.800751896207 0.868544578552 1.43783783913
27 1 0.674612546096 0.839808821678 1.76508307457
27 2 0.785714299095 0.848484873772 1.5
28 0 0.620320838215 0.956896543503 1.68468463421
28 1 0.706414091687 0.900643527508 1.57176542282
28 2 0.793939391645 0.81679391861 1.54205608368
29 0 0.754166675657 0.895027637482 1.48148143291
29 1 0.69301422402 0.920765757561 1.56714320183
29 2 0.845679002389 0.839416086674 1.40869569778
30 0 0.859030844222 0.841025650501 1.38414633274
30 1 0.50268658355 0.966861307621 2.05749368668
30 2 1.30252103711 0.658064544201 1.16666662693
31 0 0.82173912575 0.846560835838 1.4375
31 1 0.399981690291 0.95882165432 2.60748648643
31 2 0.761627920701 0.854961812496 1.53571426868
32 0 2.23469391901 0.369863003492 1.20987653732
32 1 0.759902107642 0.868461310863 1.51527643204
32 2 0.770491824359 0.907801389694 1.4296875
33 0 0.66800002166 0.96407186985 1.55279505253
33 1 0.485196337577 0.974456369877 2.11504721642
33 2 0.785310699027 0.834532380104 1.52586209774
34 0 0.670454550904 0.966101706028 1.54385960102
34 1 0.669733474498 0.956855773926 1.56045591831
34 2 0.859756141307 0.843971610069 1.37815129757
35 0 0.623655915577 0.977011501789 1.64117646217
35 1 0.706765840375 0.923280179501 1.53246641159
35 2 0.904761940714 0.774436116219 1.42718446255
36 0 0.948717977717 0.806306302547 1.30726253986
36 1 0.568578294667 0.970454692841 1.81231832504
36 2 0.941176470588 0.848214268684 1.25263154507
37 0 0.944444394406 0.789215683937 1.34161496162
37 1 0.691571778925 0.941143512726 1.53640925884
37 2 1.01739130329 0.786324799061 1.25
38 0 0.902222244211 0.832512319088 1.33136093616
38 1 1.02691339039 0.719638347626 1.35316848755
38 2 1.1714285435 0.658536612988 1.2962962389
39 0 1.11229949928 0.745192289352 1.20645165443
39 1 0.753911215144 0.910423517227 1.45692205429
39 2 2.01923076807 0.409523814917 1.20930230618
40 0 0.820512820513 0.916666686535 1.32954549789
40 1 0.829661513142 0.887310028076 1.35838747025
40 2 0.791666698125 0.89473682642 1.41176474094
41 0 0.877118608623 0.893719792366 1.27567565441
41 1 0.599595081075 0.971237003803 1.71718358994
41 2 11.2222218135 0.079207919538 1.125
42 0 0.958904084535 0.785714268684 1.32727277279
42 1 0.706306197076 0.91669011116 1.54448759556
42 2 0.944444394406 0.705882370472 1.5
43 0 0.714828906411 0.920212745667 1.52023124695
43 1 0.721018973166 0.934503257275 1.48413181305
43 2 1.22222223032 0.70454543829 1.16129028797
44 0 0.736625503924 0.932960867882 1.45508980751
44 1 0.822871340129 0.85199701786 1.42636275291
44 2 1.11764707842 0.631578922272 1.41666662693
45 0 0.885572163463 0.887640476227 1.27215194702
45 1 0.746141258105 0.903608679771 1.48319602013
45 2 0.874999960884 0.809523820877 1.41176474094
46 0 1.07853403545 0.694174766541 1.33566439152
46 1 0.635207784896 0.954789757729 1.64883208275
46 2 1.0 0.0 0.0
47 0 0.979487139967 0.806282699108 1.26623380184
47 1 0.858850018879 0.861339211464 1.35178756714
47 2 2.66666666667 0.25 1.5
48 0 0.789256205345 0.90575915575 1.39884388447
48 1 0.597457414658 0.943463563919 1.77405846119
48 2 0.939393888492 0.806451618671 1.32000005245
49 0 0.670212752358 0.928571403027 1.60683763027
49 1 0.772375490181 0.83886307478 1.54340696335
49 2 1.17241382202 0.705882370472 1.20833337307
50 0 0.692307705005 0.944444417953 1.52941179276
50 1 0.908514223369 0.784576535225 1.40292012691
50 2 0.763636357016 0.952380955219 1.375
51 0 1.06666666667 0.6640625 1.41176474094
51 1 0.719703086511 0.874549925327 1.58877372742
51 2 0.913793114717 0.792452812195 1.38095235825
52 0 1.0 0.0 0.0
52 1 0.545124320992 0.93195515871 1.96838212013
52 2 1.15873017737 0.479452043772 1.79999995232
53 0 1.0 0.0 0.0
53 1 1.0 0.0 0.0
53 2 1.0 0.0 0.0
