475208
475464
475720
475976
476232
476488
476744
477000
475209
475465
475721
475977
476233
476489
476745
477001
475210
475466
475722
475978
476234
476490
476746
477002
475211
475467
475723
475979
476235
476491
476747
477003
475212
475468
475724
475980
476236
476492
476748
477004
475213
475469
475725
475981
476237
476493
476749
477005
475214
475470
475726
475982
476238
476494
476750
477006
475215
475471
475727
475983
476239
476495
476751
477007
542760
543016
543272
543528
543784
544040
544296
544552
542761
543017
543273
543529
543785
544041
544297
544553
542762
543018
543274
543530
543786
544042
544298
544554
542763
543019
543275
543531
543787
544043
544299
544555
542764
543020
543276
543532
543788
544044
544300
544556
542765
543021
543277
543533
543789
544045
544301
544557
542766
543022
543278
543534
543790
544046
544302
544558
542767
543023
543279
543535
543791
544047
544303
544559
540744
541000
541256
541512
541768
542024
542280
542536
540745
541001
541257
541513
541769
542025
542281
542537
540746
541002
541258
541514
541770
542026
542282
542538
540747
541003
541259
541515
541771
542027
542283
542539
540748
541004
541260
541516
541772
542028
542284
542540
540749
541005
541261
541517
541773
542029
542285
542541
540750
541006
541262
541518
541774
542030
542286
542542
540751
541007
541263
541519
541775
542031
542287
542543
540760
541016
541272
541528
541784
542040
542296
542552
540761
541017
541273
541529
541785
542041
542297
542553
540762
541018
541274
541530
541786
542042
542298
542554
540763
541019
541275
541531
541787
542043
542299
542555
540764
541020
541276
541532
541788
542044
542300
542556
540765
541021
541277
541533
541789
542045
542301
542557
540766
541022
541278
541534
541790
542046
542302
542558
540767
541023
541279
541535
541791
542047
542303
542559
735312
735568
735824
736080
736336
736592
736848
737104
735313
735569
735825
736081
736337
736593
736849
737105
735314
735570
735826
736082
736338
736594
736850
737106
735315
735571
735827
736083
736339
736595
736851
737107
735316
735572
735828
736084
736340
736596
736852
737108
735317
735573
735829
736085
736341
736597
736853
737109
735318
735574
735830
736086
736342
736598
736854
737110
735319
735575
735831
736087
736343
736599
736855
737111
856064
856320
856576
856832
857088
857344
857600
857856
856065
856321
856577
856833
857089
857345
857601
857857
856066
856322
856578
856834
857090
857346
857602
857858
856067
856323
856579
856835
857091
857347
857603
857859
856068
856324
856580
856836
857092
857348
857604
857860
856069
856325
856581
856837
857093
857349
857605
857861
856070
856326
856582
856838
857094
857350
857606
857862
856071
856327
856583
856839
857095
857351
857607
857863
1060952
1061208
1061464
1061720
1061976
1062232
1062488
1062744
1060953
1061209
1061465
1061721
1061977
1062233
1062489
1062745
1060954
1061210
1061466
1061722
1061978
1062234
1062490
1062746
1060955
1061211
1061467
1061723
1061979
1062235
1062491
1062747
1060956
1061212
1061468
1061724
1061980
1062236
1062492
1062748
1060957
1061213
1061469
1061725
1061981
1062237
1062493
1062749
1060958
1061214
1061470
1061726
1061982
1062238
1062494
1062750
1060959
1061215
1061471
1061727
1061983
1062239
1062495
1062751
1187888
1188144
1188400
1188656
1188912
1189168
1189424
1189680
1187889
1188145
1188401
1188657
1188913
1189169
1189425
1189681
1187890
1188146
1188402
1188658
1188914
1189170
1189426
1189682
1187891
1188147
1188403
1188659
1188915
1189171
1189427
1189683
1187892
1188148
1188404
1188660
1188916
1189172
1189428
1189684
1187893
1188149
1188405
1188661
1188917
1189173
1189429
1189685
1187894
1188150
1188406
1188662
1188918
1189174
1189430
1189686
1187895
1188151
1188407
1188663
1188919
1189175
1189431
1189687
1185864
1186120
1186376
1186632
1186888
1187144
1187400
1187656
1185865
1186121
1186377
1186633
1186889
1187145
1187401
1187657
1185866
1186122
1186378
1186634
1186890
1187146
1187402
1187658
1185867
1186123
1186379
1186635
1186891
1187147
1187403
1187659
1185868
1186124
1186380
1186636
1186892
1187148
1187404
1187660
1185869
1186125
1186381
1186637
1186893
1187149
1187405
1187661
1185870
1186126
1186382
1186638
1186894
1187150
1187406
1187662
1185871
1186127
1186383
1186639
1186895
1187151
1187407
1187663
1323040
1323296
1323552
1323808
1324064
1324320
1324576
1324832
1323041
1323297
1323553
1323809
1324065
1324321
1324577
1324833
1323042
1323298
1323554
1323810
1324066
1324322
1324578
1324834
1323043
1323299
1323555
1323811
1324067
1324323
1324579
1324835
1323044
1323300
1323556
1323812
1324068
1324324
1324580
1324836
1323045
1323301
1323557
1323813
1324069
1324325
1324581
1324837
1323046
1323302
1323558
1323814
1324070
1324326
1324582
1324838
1323047
1323303
1323559
1323815
1324071
1324327
1324583
1324839
2107440
2107696
2107952
2108208
2108464
2108720
2108976
2109232
2107441
2107697
2107953
2108209
2108465
2108721
2108977
2109233
2107442
2107698
2107954
2108210
2108466
2108722
2108978
2109234
2107443
2107699
2107955
2108211
2108467
2108723
2108979
2109235
2107444
2107700
2107956
2108212
2108468
2108724
2108980
2109236
2107445
2107701
2107957
2108213
2108469
2108725
2108981
2109237
2107446
2107702
2107958
2108214
2108470
2108726
2108982
2109238
2107447
2107703
2107959
2108215
2108471
2108727
2108983
2109239
3024952
3025208
3025464
3025720
3025976
3026232
3026488
3026744
3024953
3025209
3025465
3025721
3025977
3026233
3026489
3026745
3024954
3025210
3025466
3025722
3025978
3026234
3026490
3026746
3024955
3025211
3025467
3025723
3025979
3026235
3026491
3026747
3024956
3025212
3025468
3025724
3025980
3026236
3026492
3026748
3024957
3025213
3025469
3025725
3025981
3026237
3026493
3026749
3024958
3025214
3025470
3025726
3025982
3026238
3026494
3026750
3024959
3025215
3025471
3025727
3025983
3026239
3026495
3026751
