542760
543016
543272
543528
543784
544040
544296
544552
542761
543017
543273
543529
543785
544041
544297
544553
542762
543018
543274
543530
543786
544042
544298
544554
542763
543019
543275
543531
543787
544043
544299
544555
542764
543020
543276
543532
543788
544044
544300
544556
542765
543021
543277
543533
543789
544045
544301
544557
542766
543022
543278
543534
543790
544046
544302
544558
542767
543023
543279
543535
543791
544047
544303
544559
3035184
3035440
3035696
3035952
3036208
3036464
3036720
3036976
3037232
3037488
3037744
3038000
3038256
3038512
3038768
3039024
3035185
3035441
3035697
3035953
3036209
3036465
3036721
3036977
3037233
3037489
3037745
3038001
3038257
3038513
3038769
3039025
3035186
3035442
3035698
3035954
3036210
3036466
3036722
3036978
3037234
3037490
3037746
3038002
3038258
3038514
3038770
3039026
3035187
3035443
3035699
3035955
3036211
3036467
3036723
3036979
3037235
3037491
3037747
3038003
3038259
3038515
3038771
3039027
3035188
3035444
3035700
3035956
3036212
3036468
3036724
3036980
3037236
3037492
3037748
3038004
3038260
3038516
3038772
3039028
3035189
3035445
3035701
3035957
3036213
3036469
3036725
3036981
3037237
3037493
3037749
3038005
3038261
3038517
3038773
3039029
3035190
3035446
3035702
3035958
3036214
3036470
3036726
3036982
3037238
3037494
3037750
3038006
3038262
3038518
3038774
3039030
3035191
3035447
3035703
3035959
3036215
3036471
3036727
3036983
3037239
3037495
3037751
3038007
3038263
3038519
3038775
3039031
3098664
3098920
3099176
3099432
3099688
3099944
3100200
3100456
3098665
3098921
3099177
3099433
3099689
3099945
3100201
3100457
3098666
3098922
3099178
3099434
3099690
3099946
3100202
3100458
3098667
3098923
3099179
3099435
3099691
3099947
3100203
3100459
3098668
3098924
3099180
3099436
3099692
3099948
3100204
3100460
3098669
3098925
3099181
3099437
3099693
3099949
3100205
3100461
3098670
3098926
3099182
3099438
3099694
3099950
3100206
3100462
3098671
3098927
3099183
3099439
3099695
3099951
3100207
3100463
