863040
1064752
1129770
1255206
1254185
1259564
1387567
1522735
1584160
1584162
1583651
1583907
1584419
1583396
1584676
1583398
1583654
1583911
1585707
1589039
1589040
1653808
1656112
1654326
1783065
1779751
1846843
2700080
3029039
3029040
3090737
3090740
3090485
3090997
3090742
3092022
3092534
3091255
3091511
3092535
3091256
3358256
3487022
