0 0 0.749999977648 1.0 1.33333337307
0 1 43.4967331122 0.00773854227737 2.9708738327
0 2 1.0 0.0 0.0
1 0 0.749999977648 1.0 1.33333337307
1 1 0.817716451539 0.859419465065 1.4229580164
1 2 1.0 0.0 0.0
2 0 0.749999977648 1.0 1.33333337307
2 1 0.85107198078 0.826090872288 1.42234802246
2 2 1.0 0.0 0.0
3 0 1.0 0.666666686535 1.5
3 1 0.718302490294 0.865088760853 1.6092813015
3 2 1.0 0.0 0.0
4 0 0.333333333333 1.0 3.0
4 1 0.853064234193 0.800124526024 1.46507787704
4 2 1.0 0.0 0.0
5 0 0.666666666667 1.0 1.5
5 1 0.845007979549 0.804042935371 1.47183787823
5 2 1.0 0.0 0.0
6 0 1.0 0.0 0.0
6 1 0.674179131071 0.856445908546 1.73190772533
6 2 1.0 0.0 0.0
7 0 1.0 0.0 0.0
7 1 1.12487010388 0.642648220062 1.38332533836
7 2 2.0 0.5 1.0
8 0 2.0 0.5 1.0
8 1 0.603514215478 0.886509478092 1.86908531189
8 2 2.99999991059 0.333333343267 1.0
9 0 0.5 1.0 2.0
9 1 0.860330961373 0.805898964405 1.44229424
9 2 0.5 0.75 2.66666674614
10 0 0.749999977648 1.0 1.33333337307
10 1 0.755760340431 0.840420424938 1.57441532612
10 2 2.99999991059 0.333333343267 1.0
11 0 1.0 0.666666686535 1.5
11 1 0.771696645479 0.834619283676 1.55261933804
11 2 2.0 0.5 1.0
12 0 2.0 0.5 1.0
12 1 1.03662020565 0.714791476727 1.34958720207
12 2 1.0 1.0 1.0
13 0 0.5 1.0 2.0
13 1 0.813194668552 0.842618525028 1.45940053463
13 2 1.0 1.0 1.0
14 0 1.0 1.0 1.0
14 1 0.931031937697 0.77046251297 1.39406776428
14 2 2.0 0.5 1.0
15 0 0.5 1.0 2.0
15 1 1.0573269 0.686102092266 1.37848472595
15 2 1.0 0.666666686535 1.5
16 0 0.5 1.0 2.0
16 1 0.677587517397 0.884772360325 1.66802692413
16 2 2.0 0.5 1.0
17 0 1.0 1.0 1.0
17 1 0.749281030853 0.864651024342 1.54352748394
17 2 0.363636363636 1.0 2.75
18 0 1.0 0.0 0.0
18 1 0.885839621216 0.783587098122 1.44064712524
18 2 1.0 0.75 1.33333337307
19 0 0.666666666667 1.0 1.5
19 1 0.886703977131 0.795344412327 1.41796696186
19 2 1.33333333333 0.75 1.0
20 0 0.666666666667 1.0 1.5
20 1 0.798110096579 0.836100995541 1.49857497215
20 2 0.749999977648 1.0 1.33333337307
21 0 0.600000014305 1.0 1.66666662693
21 1 0.676945136072 0.880523622036 1.67766606808
21 2 1.0 1.0 1.0
22 0 0.749999977648 1.0 1.33333337307
22 1 0.937662483409 0.774137079716 1.37763953209
22 2 1.0 0.0 0.0
23 0 1.0 0.666666686535 1.5
23 1 0.765265241705 0.872281908989 1.49806678295
23 2 2.0 0.5 1.0
24 0 1.0 1.0 1.0
24 1 0.802582006589 0.821319878101 1.5170443058
24 2 2.99999991059 0.333333343267 1.0
25 0 1.4999999553 0.666666686535 1.0
25 1 0.78914913913 0.875151157379 1.44796431065
25 2 1.0 1.0 1.0
26 0 0.666666666667 1.0 1.5
26 1 1.0 0.0 0.0
26 2 2.0 0.5 1.0
27 0 1.0 1.0 1.0
27 1 0.810184873531 0.81274586916 1.51866197586
27 2 1.0 1.0 1.0
28 0 2.99999991059 0.333333343267 1.0
28 1 0.845194433527 0.800889730453 1.47730660439
28 2 2.99999991059 0.333333343267 1.0
29 0 1.0 1.0 1.0
29 1 0.692366217024 0.89853477478 1.60741949081
29 2 0.749999977648 1.0 1.33333337307
30 0 2.0 0.5 1.0
30 1 0.530933965918 0.889075636864 2.11846256256
30 2 1.33333333333 0.75 1.0
31 0 1.0 0.0 0.0
31 1 0.157425123018 0.861672520638 7.37197256088
31 2 1.24999998137 0.600000023842 1.33333337307
32 0 1.0 0.0 0.0
32 1 0.911095454226 0.79716104269 1.37686097622
32 2 0.749999977648 0.833333313465 1.60000002384
33 0 1.0 0.0 0.0
33 1 0.763687524046 0.880482852459 1.48717951775
33 2 0.83333330022 0.800000011921 1.5
34 0 0.125 1.0 8.0
34 1 0.87683311003 0.825443267822 1.38164305687
34 2 1.33333333333 0.75 1.0
35 0 1.0 0.0 0.0
35 1 0.604901306847 0.918302297592 1.80023753643
35 2 1.16666665508 0.714285731316 1.20000004768
36 0 2.0 0.5 1.0
36 1 1.86995753556 0.420475333929 1.27182602882
36 2 0.874999960884 0.857142865658 1.33333337307
37 0 1.0 1.0 1.0
37 1 0.964065311725 0.771180510521 1.34504723549
37 2 0.874999960884 0.857142865658 1.33333337307
38 0 1.0 0.0 0.0
38 1 0.284203156242 0.939446210861 3.745408535
38 2 1.4999999553 0.666666686535 1.0
39 0 1.0 0.0 0.0
39 1 0.806717853186 0.875717878342 1.4155138731
39 2 1.85714276226 0.461538463831 1.16666662693
40 0 2.0 0.5 1.0
40 1 1.29665343752 0.595091104507 1.29596304893
40 2 0.83333330022 1.0 1.20000004768
41 0 1.33333333333 0.75 1.0
41 1 0.639514382427 0.920493245125 1.69874846935
41 2 0.916666639348 0.818181812763 1.33333337307
42 0 1.20000002861 0.666666686535 1.25
42 1 0.663224285595 0.886400222778 1.70102107525
42 2 1.09999996722 0.54545456171 1.66666662693
43 0 0.624999990687 1.0 1.60000002384
43 1 0.961133074056 0.756547033787 1.37524652481
43 2 1.53846159489 0.550000011921 1.18181812763
44 0 1.6 0.625 1.0
44 1 0.914339428379 0.777667760849 1.40636634827
44 2 1.20000002861 0.666666686535 1.25
45 0 1.24999998137 0.800000011921 1.0
45 1 0.816896813681 0.84825772047 1.44312846661
45 2 1.4999999553 0.5 1.33333337307
46 0 0.600000014305 1.0 1.66666662693
46 1 0.551352154278 0.939393937588 1.93073713779
46 2 0.526315796078 0.800000011921 2.375
47 0 1.0 0.666666686535 1.5
47 1 1.56336737374 0.523574233055 1.22168910503
47 2 1.28571426382 0.666666686535 1.16666662693
48 0 2.49999996275 0.40000000596 1.0
48 1 0.644710094392 0.868845105171 1.78522586823
48 2 0.541666663976 0.769230782986 2.40000009537
49 0 0.83333330022 0.600000023842 2.0
49 1 1.38293446061 0.526377379894 1.37372934818
49 2 0.769230797446 0.899999976158 1.44444441795
50 0 1.0 1.0 1.0
50 1 1.18246870519 0.644753158092 1.31164669991
50 2 1.0 0.857142865658 1.16666662693
51 0 1.0 1.0 1.0
51 1 0.683764596293 0.886302769184 1.65010392666
51 2 0.818181827049 0.666666686535 1.83333337307
52 0 1.33333333333 0.75 1.0
52 1 0.380320657622 0.888080775738 2.9607219696
52 2 2.59999995351 0.307692319155 1.25
53 0 1.0 0.0 0.0
53 1 1.0 0.0 0.0
53 2 1.0 0.0 0.0
