0 0 0.961538496807 0.620000004768 1.67741930485
0 1 8.28342762459 0.0934224277735 1.29222679138
0 2 2.28571428571 0.375 1.16666662693
1 0 0.747747738111 0.722891569138 1.85000002384
1 1 0.573173658963 0.909714400768 1.9178237915
1 2 1.0 0.0 0.0
2 0 0.690140833483 0.857142865658 1.69047617912
2 1 0.542115852515 0.941349029541 1.95955395699
2 2 0.666666666667 0.75 2.0
3 0 0.710144905452 0.714285731316 1.97142851353
3 1 0.469288869664 0.952613890171 2.23688077927
3 2 0.916666639348 0.636363625526 1.71428573132
4 0 0.546874996944 0.800000011921 2.28571438789
4 1 0.496027690389 0.943499624729 2.13674330711
4 2 0.531914894966 0.72000002861 2.61111116409
5 0 1.0 0.0 0.0
5 1 0.463914615813 0.943106174469 2.28560614586
5 2 0.720000027466 0.555555582047 2.5
6 0 0.578947361156 1.0 1.72727274895
6 1 0.425619201118 0.949075579643 2.47558569908
6 2 1.24999998137 0.600000023842 1.33333337307
7 0 0.571428571429 1.0 1.75
7 1 0.492184237235 0.929808020592 2.18513870239
7 2 0.5 0.809523820877 2.47058820724
8 0 0.703703731666 0.736842095852 1.92857146263
8 1 0.319518791127 0.969812095165 3.22712635994
8 2 1.38461541001 0.388888895512 1.85714280605
9 0 1.13636364252 0.680000007153 1.29411768913
9 1 0.520607209416 0.931713163853 2.06161522865
9 2 0.457142857143 0.75 2.91666674614
10 0 0.431372561119 0.909090936184 2.54999995232
10 1 0.471540320858 0.945030927658 2.2440636158
10 2 0.476190497816 0.699999988079 3.0
11 0 0.617647050161 0.809523820877 2.0
11 1 0.461869358367 0.94668674469 2.28704428673
11 2 1.4285714529 0.300000011921 2.33333325386
12 0 1.04545453412 0.565217375755 1.69230771065
12 1 0.570565303669 0.93490254879 1.87468504906
12 2 0.52380953273 0.636363625526 3.0
13 0 0.48571427248 0.882352948189 2.33333325386
13 1 0.544388525579 0.946712732315 1.94031763077
13 2 0.818181827049 0.555555582047 2.20000004768
14 0 0.709677435729 0.681818187237 2.06666660309
14 1 0.572804779637 0.917599737644 1.90256750584
14 2 0.538461553275 0.714285731316 2.59999990463
15 0 1.0 0.636363625526 1.57142853737
15 1 0.601825116902 0.907025337219 1.83193588257
15 2 0.533333333333 0.875 2.14285707474
16 0 0.687499979511 0.681818187237 2.1333334446
16 1 0.430846053961 0.954534947872 2.43156576157
16 2 0.600000014305 0.833333313465 2.0
17 0 0.558823539208 0.842105269432 2.125
17 1 0.430023116425 0.958394706249 2.42640781403
17 2 0.699999983311 0.857142865658 1.66666662693
18 0 0.535714283433 1.0 1.86666667461
18 1 0.519527697589 0.913164138794 2.10786342621
18 2 0.8 0.75 1.66666662693
19 0 0.655172405714 0.89473682642 1.70588231087
19 1 0.531521509442 0.930187284946 2.02259421349
19 2 2.99999991059 0.333333343267 1.0
20 0 0.562499995809 0.777777791023 2.28571438789
20 1 0.52941101109 0.89655393362 2.1068353653
20 2 0.571428571429 1.0 1.75
21 0 0.558823539208 0.89473682642 2.0
21 1 0.397328975725 0.951704382896 2.64452505112
21 2 0.71428572645 0.800000011921 1.75
22 0 0.600000014305 0.933333337307 1.78571426868
22 1 0.410683739846 0.956427454948 2.54589486122
22 2 1.0 0.0 0.0
23 0 0.542857141008 0.842105269432 2.1875
23 1 0.459550138063 0.950941562653 2.28830170631
23 2 0.749999977648 1.0 1.33333337307
24 0 0.542857141008 0.89473682642 2.05882358551
24 1 0.462732234698 0.951757252216 2.27061772346
24 2 0.749999977648 0.666666686535 2.0
25 0 0.904761940714 0.789473712444 1.39999997616
25 1 0.61658884524 0.938086092472 1.72886717319
25 2 0.555555570273 1.0 1.79999995232
26 0 0.486486480217 0.888888895512 2.3125
26 1 25874.0008029 1.54595345521e-05 2.5
26 2 0.41666665011 1.0 2.40000009537
27 0 0.642857131909 0.944444417953 1.64705884457
27 1 0.509612931226 0.928891539574 2.1124894619
27 2 0.77777778808 0.714285731316 1.79999995232
28 0 0.772727247605 0.823529422283 1.57142853737
28 1 0.553646269963 0.904005348682 1.99800527096
28 2 0.727272727273 0.625 2.20000004768
29 0 0.8 0.6875 1.81818187237
29 1 0.487388204573 0.932930827141 2.19925475121
29 2 0.857142886337 0.666666686535 1.75
30 0 0.538461553275 0.928571403027 2.0
30 1 0.329993096925 0.962374985218 3.14884161949
30 2 1.16666665508 0.428571432829 2.0
31 0 0.433333336777 0.923076927662 2.5
31 1 0.206486575899 0.979736506939 4.94309425354
31 2 0.874999960884 0.571428596973 2.0
32 0 1.0 0.0 0.0
32 1 0.563447192509 0.929809808731 1.90876591206
32 2 0.533333333333 0.625 3.0
33 0 0.520000014877 1.0 1.92307686806
33 1 0.506009391138 0.949637234211 2.08105564117
33 2 1.74999992177 0.571428596973 1.0
34 0 0.377777791789 1.0 2.64705872536
34 1 0.561242184878 0.948891639709 1.87772965431
34 2 1.20000002861 0.666666686535 1.25
35 0 0.529411779555 1.0 1.88888883591
35 1 0.483669049973 0.955513775349 2.16378831863
35 2 1.4999999553 0.666666686535 1.0
36 0 0.615384615385 0.875 1.85714280605
36 1 2.72263590995 0.277080625296 1.32557487488
36 2 2.0 0.5 1.0
37 0 0.64 1.0 1.5625
37 1 0.587796222429 0.937945902348 1.81382513046
37 2 2.99999991059 0.333333343267 1.0
38 0 1.0 0.0 0.0
38 1 0.307732039847 0.971124708652 3.34620285034
38 2 1.0 0.0 0.0
39 0 1.0 0.0 0.0
39 1 0.643762715272 0.92913633585 1.67184007168
39 2 1.0 0.0 0.0
40 0 1.0 0.0 0.0
40 1 0.615900912632 0.919369101524 1.76603472233
40 2 0.666666666667 1.0 1.5
41 0 1.0 0.0 0.0
41 1 0.466082353916 0.965807557106 2.22150230408
41 2 1.0 0.0 0.0
42 0 1.0 0.0 0.0
42 1 1.0 0.0 0.0
42 2 4.99999992549 0.20000000298 1.0
43 0 0.666666666667 1.0 1.5
43 1 0.56152883822 0.931372344494 1.912073493
43 2 2.66666666667 0.25 1.5
44 0 0.368421066501 1.0 2.71428561211
44 1 0.612364232783 0.881423056126 1.85270297527
44 2 1.24999998137 0.600000023842 1.33333337307
45 0 0.578947361156 1.0 1.72727274895
45 1 0.623455122474 0.897979021072 1.78619384766
45 2 2.49999996275 0.40000000596 1.0
46 0 0.727272727273 0.75 1.83333337307
46 1 0.628155046603 0.711471438408 2.23756504059
46 2 0.857142886337 0.666666686535 1.75
47 0 0.8 0.75 1.66666662693
47 1 0.791390954646 0.836465656757 1.51063930988
47 2 1.0 0.800000011921 1.25
48 0 0.565217405952 0.769230782986 2.29999995232
48 1 0.408841287989 0.95618969202 2.55800390244
48 2 0.5 0.714285731316 2.79999995232
49 0 0.611111115158 0.727272748947 2.25
49 1 0.590004882591 0.879930734634 1.92617571354
49 2 0.666666666667 1.0 1.5
50 0 0.476190497816 0.800000011921 2.625
50 1 0.633726316403 0.893565773964 1.76592290401
50 2 0.749999977648 1.0 1.33333337307
51 0 0.666666666667 0.800000011921 1.875
51 1 0.463114918816 0.953387737274 2.26486158371
51 2 1.33333333333 0.5 1.5
52 0 0.916666639348 0.636363625526 1.71428573132
52 1 0.498539079707 0.904156446457 2.21848869324
52 2 3.49999984354 0.285714298487 1.0
53 0 1.0 0.0 0.0
53 1 1.0 0.0 0.0
53 2 1.0 0.0 0.0
