603440
863040
1129770
1255971
1255206
1259564
1387567
1583907
1584419
1583398
1583911
1585707
1653808
1846843
2700080
2762035
2764606
3029039
3029040
3024952
3025208
3025464
3025720
3025976
3026232
3026488
3026744
3024953
3025209
3024954
3025210
3025722
3025978
3026234
3026490
3026746
3024955
3025211
3025723
3025979
3026235
3026491
3026747
3090737
3090993
3089202
3090738
3090740
3090485
3090997
3090742
3090998
3091254
3092022
3092534
3089975
3090231
3091255
3091511
3092535
3090232
3090488
3091256
3091769
3094329
3487022
