0 0 0.857142886337 0.809523820877 1.44117641449
0 1 0.812521061009 0.870171964169 1.41436100006
0 2 0.735294109913 0.899999976158 1.51111114025
1 0 0.865248187448 0.877049207687 1.31775701046
1 1 0.688971869432 0.913498461246 1.58887851238
1 2 0.699346431929 0.915887832642 1.5612244606
2 0 0.793103412414 0.904347836971 1.39423072338
2 1 0.722844415828 0.904588758945 1.52933979034
2 2 0.682432413743 0.881188094616 1.66292130947
3 0 0.839694616754 0.881818175316 1.35051548481
3 1 0.686056920114 0.917310833931 1.58899784088
3 2 0.811023630421 0.883495151997 1.39560437202
4 0 0.664670633536 0.918918907642 1.63725495338
4 1 0.700231899529 0.893520832062 1.59828209877
4 2 0.890909137253 0.806122422218 1.39240503311
5 0 1.0 0.763358771801 1.30999994278
5 1 0.6629012265 0.908536732197 1.66038453579
5 2 0.832061030844 0.880733966827 1.36458337307
6 0 1.07438019493 0.769230782986 1.21000003815
6 1 0.611286928786 0.907780766487 1.80207931995
6 2 0.920634906699 0.844827592373 1.28571426868
7 0 0.838028135245 0.873949587345 1.3653845787
7 1 0.683615372147 0.860429227352 1.70009446144
7 2 0.741258742495 0.886792480946 1.52127659321
8 0 0.745222941253 0.897435903549 1.49523806572
8 1 1.25362698677 0.619469225407 1.28769183159
8 2 0.719178063401 0.933333337307 1.48979592323
9 0 0.758241733409 0.920289874077 1.43307089806
9 1 0.728784655486 0.877401053905 1.56387710571
9 2 0.834532414181 0.870689630508 1.37623763084
10 0 0.715686256945 0.904109597206 1.54545450211
10 1 0.632249883704 0.905890226364 1.74596560001
10 2 0.746478887026 0.867924511433 1.5434782505
11 0 0.775000023097 0.832258045673 1.55038762093
11 1 0.663307459786 0.904025971889 1.66764736176
11 2 0.775193821373 0.910000026226 1.41758239269
12 0 0.931972804987 0.832116782665 1.28947365284
12 1 0.561564699876 0.936435759068 1.90161323547
12 2 0.824561420754 0.882978737354 1.37349402905
13 0 0.684210539194 0.899999976158 1.62393164635
13 1 0.686816462259 0.900682151318 1.61654484272
13 2 0.900900889291 0.810000002384 1.37037038803
14 0 0.84662579783 0.884057998657 1.33606553078
14 1 0.71301003658 0.877996087074 1.59739303589
14 2 0.776923092597 0.891089081764 1.44444441795
15 0 1.24806202127 0.633540391922 1.26470589638
15 1 0.673366450158 0.887801527977 1.67275619507
15 2 0.877049188041 0.803738296032 1.41860461235
16 0 1.07638887953 0.729032278061 1.27433633804
16 1 0.618347095498 0.914770841599 1.76789045334
16 2 0.786764703124 0.897196233273 1.41666662693
17 0 0.865030659031 0.865248203278 1.33606553078
17 1 0.624428170061 0.915347456932 1.74957084656
17 2 0.805369122362 0.850000023842 1.46078431606
18 0 0.976470603299 0.777108430862 1.31782948971
18 1 0.595269708666 0.922160029411 1.82171285152
18 2 0.850340136744 0.879999995232 1.33636367321
19 0 0.818565372023 0.85051548481 1.43636357784
19 1 0.730588656926 0.876411318779 1.56177723408
19 2 0.8 0.878787875175 1.42241382599
20 0 0.932384359041 0.778625965118 1.37745094299
20 1 0.715960092812 0.885812222958 1.57677423954
20 2 0.720379172967 0.907894730568 1.52898550034
21 0 0.914893579893 0.817829430103 1.33649289608
21 1 0.584382418108 0.921277761459 1.85742914677
21 2 0.851063864325 0.875 1.34285712242
22 0 0.794871799731 0.878136217594 1.4326530695
22 1 1.73883630575 0.45987740159 1.25054478645
22 2 0.91397849931 0.829411745071 1.31914889812
23 0 0.792016807516 0.901856780052 1.39999997616
23 1 0.658819419596 0.899925768375 1.68665754795
23 2 0.74496642388 0.914414405823 1.46798026562
24 0 0.90748902205 0.793689310551 1.38837921619
24 1 0.703140129661 0.868503808975 1.63751924038
24 2 0.802816890625 0.820175409317 1.51871657372
25 0 0.791814956025 0.907865166664 1.39108908176
25 1 0.72544689842 0.897956550121 1.53510832787
25 2 0.89513106616 0.866108775139 1.28985512257
26 0 0.803738319548 0.862403094769 1.44269657135
26 1 0.914592038981 0.781917452812 1.39833641052
26 2 0.747190999727 0.879699230194 1.5213675499
27 0 0.749663511451 0.895870745182 1.48897790909
27 1 0.662188247232 0.890659511089 1.69553518295
27 2 0.783854148659 0.853820621967 1.49416339397
28 0 0.671296312227 0.899999976158 1.65517246723
28 1 0.858197974214 0.797070026398 1.46189439297
28 2 0.935483838591 0.79623824358 1.34251964092
29 0 0.81538465277 0.840480268002 1.45918369293
29 1 0.723629964459 0.885060191154 1.56138730049
29 2 0.83080810932 0.851063847542 1.41428565979
30 0 0.892458084214 0.760563373566 1.47325098515
30 1 0.888773521046 0.790771961212 1.4228451252
30 2 0.940149603856 0.750663101673 1.41696107388
31 0 1.25590551328 0.584639489651 1.36193025112
31 1 0.720944922872 0.838594138622 1.65404033661
31 2 0.760000007248 0.847645401955 1.55228757858
32 0 0.962162170842 0.816479384899 1.2729357481
32 1 0.706028107106 0.895262122154 1.58207762241
32 2 0.695327074296 0.946236550808 1.51988637447
33 0 0.788990820511 0.862403094769 1.46966290474
33 1 18273.999795 2.73612786259e-05 2.0
33 2 0.840425504204 0.858227849007 1.38643062115
34 0 1.77653627854 0.481132090092 1.16993463039
34 1 0.822271553633 0.868125617504 1.40088391304
34 2 0.853413636028 0.854117631912 1.37190079689
35 0 0.794258348742 0.897590339184 1.40268456936
35 1 1.03619623971 0.751476824284 1.28422880173
35 2 0.760223026092 0.865525662899 1.51977396011
36 0 0.703296703297 0.921875 1.54237282276
36 1 1.0 0.0 0.0
36 2 0.928176844485 0.800595223904 1.3457249403
37 0 1.87804873953 0.431818187237 1.23308265209
37 1 0.803380388845 0.878364443779 1.417111516
37 2 0.828715335378 0.848024308681 1.42293906212
38 0 369.999991041 0.00270270276815 1.0
38 1 1.15398399988 0.71065735817 1.21938252449
38 2 1.06282725133 0.729064047337 1.29054057598
39 0 1.19726031659 0.686498880386 1.21666669846
39 1 0.725927591288 0.909583210945 1.51448261738
39 2 1.17083331734 0.654804289341 1.30434787273
40 0 0.954385977687 0.777573525906 1.34751772881
40 1 0.762528009829 0.883290946484 1.48470580578
40 2 0.848396522393 0.831615149975 1.41735541821
41 0 0.867678933656 0.852500021458 1.35190618038
41 1 0.872997989586 0.860700011253 1.33086788654
41 2 5.9841267704 0.153846159577 1.08620691299
42 0 1.13131309862 0.728571414948 1.21323525906
42 1 0.641770804054 0.919369518757 1.69484484196
42 2 1.0 0.790262162685 1.26540279388
43 0 0.800369662311 0.815242469311 1.53257787228
43 1 0.752528813225 0.86913639307 1.52893471718
43 2 0.764350464459 0.869565188885 1.50454545021
44 0 625.000015789 0.00159999995958 1.0
44 1 0.562768982299 0.941759824753 1.88681662083
44 2 1.25268814515 0.652360498905 1.2236841917
45 0 0.768115939375 0.849056601524 1.53333330154
45 1 0.703167301033 0.910463750362 1.56199157238
45 2 0.929752059704 0.804444432259 1.33701658249
46 0 0.902912607774 0.790322601795 1.40136051178
46 1 0.80064252919 0.877223432064 1.42380690575
46 2 1.08943088375 0.716417908669 1.28125
47 0 1.34399995898 0.636904776096 1.16822433472
47 1 1.01688398441 0.779646158218 1.26133680344
47 2 0.943925249419 0.772277235985 1.37179481983
48 0 0.989690760571 0.713541686535 1.41605842113
48 1 0.96947148911 0.753550946712 1.3688390255
48 2 1.03614459617 0.709302306175 1.36065578461
49 0 0.871794855806 0.794117629528 1.44444441795
49 1 0.689558435102 0.85116481781 1.70378684998
49 2 0.955223880597 0.8125 1.28846156597
50 0 0.881720436889 0.780487775803 1.453125
50 1 0.829586192287 0.848056554794 1.42139136791
50 2 1.0 0.744680821896 1.34285712242
51 0 1.05527641162 0.680952370167 1.39160835743
51 1 0.675630444047 0.938575863838 1.57696259022
51 2 1.48979591293 0.534246563911 1.25641024113
52 0 1.22564098218 0.577405869961 1.41304349899
52 1 0.759987475792 0.881685674191 1.4923812151
52 2 2.47058820065 0.25 1.61904764175
53 0 1.69753093727 0.447272717953 1.31707322598
53 1 0.884655897173 0.803218007088 1.40731775761
53 2 2.58823536672 0.215909093618 1.78947365284
