0 0 1.0 0.0 0.0
0 1 0.761156881864 0.903983652592 1.45333337784
0 2 1.0 1.0 1.0
1 0 1.0 0.0 0.0
1 1 0.653912605318 0.934376299381 1.63666009903
1 2 1.0 0.0 0.0
2 0 1.0 0.0 0.0
2 1 0.681169457529 0.92046380043 1.59491717815
2 2 0.5 1.0 2.0
3 0 1.0 0.0 0.0
3 1 0.618452312142 0.928441464901 1.74156320095
3 2 1.0 1.0 1.0
4 0 1.0 0.0 0.0
4 1 0.723379111829 0.890159249306 1.55298161507
4 2 1.0 0.0 0.0
5 0 1.0 0.0 0.0
5 1 0.652296144624 0.922208547592 1.66236364841
5 2 0.5 1.0 2.0
6 0 1.0 0.0 0.0
6 1 0.612672520766 0.926889181137 1.76093685627
6 2 0.25 1.0 4.0
7 0 1.0 0.0 0.0
7 1 0.686367454075 0.877944767475 1.65949571133
7 2 1.0 0.0 0.0
8 0 1.0 0.0 0.0
8 1 0.731506449618 0.890071630478 1.53587853909
8 2 1.0 0.0 0.0
9 0 1.0 0.0 0.0
9 1 0.711983611644 0.906378626823 1.54960274696
9 2 0.5 1.0 2.0
10 0 1.0 0.0 0.0
10 1 0.662466139717 0.916342794895 1.64732146263
10 2 1.0 0.0 0.0
11 0 1.0 0.0 0.0
11 1 0.686919102877 0.91377222538 1.59314918518
11 2 0.5 1.0 2.0
12 0 1.0 0.0 0.0
12 1 0.573804808735 0.951956212521 1.830706954
12 2 1.0 0.0 0.0
13 0 1.0 0.0 0.0
13 1 0.71209935324 0.911597728729 1.54048037529
13 2 0.25 1.0 4.0
14 0 1.0 0.0 0.0
14 1 0.765091238361 0.878695189953 1.48747098446
14 2 1.0 0.0 0.0
15 0 1.0 0.0 0.0
15 1 0.863240436405 0.829667031765 1.39625394344
15 2 0.25 1.0 4.0
16 0 1.0 0.0 0.0
16 1 0.616331664088 0.944761514664 1.7173678875
16 2 1.0 0.0 0.0
17 0 1.0 0.0 0.0
17 1 0.665492011898 0.92790222168 1.61940300465
17 2 1.0 0.0 0.0
18 0 1.0 0.0 0.0
18 1 0.612118200885 0.944421887398 1.72981095314
18 2 1.0 0.0 0.0
19 0 1.0 0.0 0.0
19 1 0.722845910728 0.902178287506 1.53342270851
19 2 1.0 0.0 0.0
20 0 1.0 0.0 0.0
20 1 0.692951824422 0.917220532894 1.57334208488
20 2 1.0 0.0 0.0
21 0 1.0 0.0 0.0
21 1 0.596627435874 0.946319639683 1.77116453648
21 2 1.0 0.0 0.0
22 0 1.0 0.0 0.0
22 1 0.804712734635 0.848375439644 1.46477544308
22 2 1.0 0.0 0.0
23 0 1.0 0.0 0.0
23 1 0.654286101819 0.933772087097 1.6367841959
23 2 1.0 0.0 0.0
24 0 1.0 0.0 0.0
24 1 0.661582076053 0.907365858555 1.66584217548
24 2 1.0 0.0 0.0
25 0 1.0 0.0 0.0
25 1 0.683991956746 0.943688511848 1.54924583435
25 2 1.0 0.0 0.0
26 0 1.0 0.0 0.0
26 1 1.01244646812 0.755340576172 1.30763077736
26 2 1.0 0.0 0.0
27 0 1.0 0.0 0.0
27 1 0.6737826386 0.908469676971 1.63369047642
27 2 1.0 0.0 0.0
28 0 1.0 0.0 0.0
28 1 0.835664966469 0.814579367638 1.46904265881
28 2 1.0 0.0 0.0
29 0 1.0 0.0 0.0
29 1 0.630982199889 0.960326731205 1.65030372143
29 2 1.0 0.0 0.0
30 0 1.0 0.0 0.0
30 1 0.472984121786 0.972531080246 2.17395210266
30 2 1.0 0.0 0.0
31 0 1.0 0.0 0.0
31 1 0.382485861177 0.974256157875 2.68356084824
31 2 1.0 1.0 1.0
32 0 1.0 0.0 0.0
32 1 0.997291055442 0.647304654121 1.54906392097
32 2 1.0 1.0 1.0
33 0 1.0 0.0 0.0
33 1 0.54790453462 0.972264349461 1.8772008419
33 2 0.666666666667 1.0 1.5
34 0 1.0 0.0 0.0
34 1 0.714024656239 0.927063345909 1.51069700718
34 2 1.0 1.0 1.0
35 0 1.0 0.0 0.0
35 1 0.728235809069 0.912291824818 1.50519990921
35 2 0.5 1.0 2.0
36 0 1.0 0.0 0.0
36 1 0.57577522398 0.951204717159 1.82588338852
36 2 0.666666666667 1.0 1.5
37 0 1.0 0.0 0.0
37 1 0.74981146576 0.904263854027 1.47486650944
37 2 1.0 1.0 1.0
38 0 1.0 0.0 0.0
38 1 1.04585064395 0.724856197834 1.3191024065
38 2 1.0 1.0 1.0
39 0 1.0 0.0 0.0
39 1 0.698983913703 0.939834415913 1.52223420143
39 2 1.0 1.0 1.0
40 0 1.0 0.0 0.0
40 1 0.773811354443 0.881748616695 1.46561574936
40 2 1.0 0.0 0.0
41 0 1.0 0.0 0.0
41 1 0.692057197995 0.950491011143 1.52023243904
41 2 1.0 0.0 0.0
42 0 1.0 0.0 0.0
42 1 0.604278062154 0.947103798389 1.74729239941
42 2 1.0 0.0 0.0
43 0 1.0 0.0 0.0
43 1 0.70444193692 0.894704937935 1.58662748337
43 2 1.0 0.0 0.0
44 0 1.0 0.0 0.0
44 1 0.744597245847 0.884513914585 1.5183570385
44 2 1.0 1.0 1.0
45 0 1.0 0.0 0.0
45 1 0.659488034438 0.922776758671 1.64322280884
45 2 1.0 1.0 1.0
46 0 1.0 0.0 0.0
46 1 0.674116772542 0.930267393589 1.59461939335
46 2 1.0 0.0 0.0
47 0 1.0 0.0 0.0
47 1 0.995113643872 0.788001716137 1.27526414394
47 2 2.0 0.5 1.0
48 0 1.0 0.0 0.0
48 1 0.583040640992 0.933519780636 1.83728969097
48 2 0.5 1.0 2.0
49 0 1.0 0.0 0.0
49 1 1.20827107328 0.608041226864 1.36113941669
49 2 0.666666666667 1.0 1.5
50 0 1.0 0.0 0.0
50 1 0.919105411931 0.782034695148 1.39126121998
50 2 0.666666666667 1.0 1.5
51 0 1.0 0.0 0.0
51 1 0.669070189054 0.950935900211 1.57172679901
51 2 1.0 1.0 1.0
52 0 1.0 0.0 0.0
52 1 0.539254260526 0.939226508141 1.97440421581
52 2 1.0 1.0 1.0
53 0 1.0 0.0 0.0
53 1 1.0 0.0 0.0
53 2 1.0 0.0 0.0
