1390648
1390904
1391160
1391416
1391672
1391928
1392184
1392440
1390649
1390905
1391161
1391417
1391673
1391929
1392185
1392441
1390650
1390906
1391162
1391418
1391674
1391930
1392186
1392442
1390651
1390907
1391163
1391419
1391675
1391931
1392187
1392443
1390652
1390908
1391164
1391420
1391676
1391932
1392188
1392444
1390653
1390909
1391165
1391421
1391677
1391933
1392189
1392445
1390654
1390910
1391166
1391422
1391678
1391934
1392190
1392446
1390655
1390911
1391167
1391423
1391679
1391935
1392191
1392447
1450032
1450288
1450544
1450800
1451056
1451312
1451568
1451824
1450033
1450289
1450545
1450801
1451057
1451313
1451569
1451825
1450034
1450290
1450546
1450802
1451058
1451314
1451570
1451826
1450035
1450291
1450547
1450803
1451059
1451315
1451571
1451827
1450036
1450292
1450548
1450804
1451060
1451316
1451572
1451828
1450037
1450293
1450549
1450805
1451061
1451317
1451573
1451829
1450038
1450294
1450550
1450806
1451062
1451318
1451574
1451830
1450039
1450295
1450551
1450807
1451063
1451319
1451575
1451831
