8203
8204
8205
8206
8207
8208
8209
8210
8211
8212
8213
8214
8215
8216
8217
8218
8219
8220
8221
8222
8223
8224
8225
5632
5888
14080
14336
21504
21760
5727
5983
14175
14431
21599
21855
77322
77323
77324
77325
77326
77327
77328
77329
77330
77331
77332
77333
77334
77335
77336
77338
77339
77340
77341
77342
77343
77344
77345
71168
71424
79616
79872
87040
87296
71263
71519
79711
79967
87135
87391
144384
144385
139274
139275
139276
139277
139278
139279
139280
139281
139282
139283
139284
139285
139286
139287
139288
139289
139290
139291
139292
139293
139294
139295
139296
139297
136704
136960
145152
145408
152576
152832
136799
137055
145247
145503
152671
152927
209920
210176
210944
209921
209418
209421
209427
209428
209429
209430
209431
209432
209433
209434
209435
204828
209436
204829
209437
204830
209438
204831
209439
204832
209440
204833
209441
202240
202496
210688
210944
218112
218368
202335
202591
210783
211039
218207
218463
270348
270349
270350
270351
270352
270353
270354
270355
270356
270357
270358
270359
270360
270361
270362
270363
270364
270365
270366
270367
270368
270369
267776
268032
276224
276480
283648
283904
267871
268127
276319
276575
283743
283999
349185
335882
335883
335884
335885
335886
335887
335888
335889
335890
335891
335892
335893
335894
335895
335896
335897
335898
335899
335900
335901
335902
335903
335904
335905
333312
333568
341760
342016
349184
349440
333407
333663
341855
342111
349279
349535
401418
401419
401420
401421
401422
401423
401424
401425
401426
401427
401428
401429
401430
401431
401432
401433
401434
401435
401436
401437
401438
401439
401440
401441
398848
399104
407296
407552
414720
414976
398943
399199
407391
407647
414815
415071
466954
466955
466956
466957
466958
466959
466960
466961
466962
466963
466964
466965
466966
466967
466968
466969
466970
466971
466972
466973
466974
466975
466976
466977
464384
464640
472832
473088
480256
480512
464479
464735
472927
473183
480351
480607
546048
532490
532491
532492
532493
532494
532495
532496
532497
532498
532499
532500
532501
532502
532503
532504
532505
532506
532507
532508
532509
532510
532511
532512
532513
529920
530176
538368
538624
545792
546048
530015
530271
538463
538719
545887
546143
595456
595712
603904
604160
611328
611584
595551
595807
603999
604255
611423
611679
669440
669696
663572
667924
663573
667925
663574
667926
663575
667927
663576
667928
663577
667929
663578
667930
663579
667931
663580
667932
663581
667933
663582
663583
667935
663584
667936
663585
667937
660992
661248
669440
669696
676864
677120
661087
661343
669535
669791
676959
677215
729098
729099
729100
729101
729102
729103
729104
729105
729106
729107
729108
729109
729110
729111
729112
729113
729114
729115
729116
729117
729118
729119
729120
729121
726528
726784
734976
735232
742400
742656
726623
726879
735071
735327
742495
742751
792064
792320
800512
800768
807936
808192
792159
792415
800607
800863
808031
808287
860185
860441
860697
860953
861209
861465
861721
861977
860186
860442
860698
860954
861210
861466
861722
861978
860443
860699
860955
861211
861467
861723
861979
860444
860700
860956
861212
861468
861724
861980
860189
860445
860701
860957
861213
861469
861725
861981
860190
860446
860702
860958
861214
861470
861726
861982
860191
860447
860703
860959
861215
861471
861727
861983
860192
860448
860704
860960
861216
861472
861728
861984
857600
857856
866048
866304
873472
873728
857695
857951
866143
866399
873567
873823
930816
931072
930817
931073
923136
923392
931584
931840
939008
939264
923231
923487
931679
931935
939103
939359
991255
991256
991257
991258
991259
991260
991261
991262
991263
991264
991265
988672
988928
997120
997376
1004544
1004800
988767
989023
997215
997471
1004639
1004895
1060108
1060109
1060110
1060111
1060112
1060113
1060114
1060115
1060116
1060117
1060118
1056791
1060119
1056792
1060120
1056793
1060121
1060122
1060123
1060124
1060125
1060126
1060127
1060128
1054208
1054464
1062656
1062912
1070080
1070336
1054303
1054559
1062751
1063007
1070175
1070431
1119744
1120000
1128192
1128448
1135616
1135872
1119839
1120095
1128287
1128543
1135711
1135967
1187849
1187850
1187851
1187852
1187853
1187854
1187855
1187857
1187858
1187859
1187860
1187861
1187862
1187863
1187864
1187865
1187866
1187867
1187868
1187869
1187870
1187871
1187872
1185280
1185536
1193728
1193984
1201152
1201408
1185375
1185631
1193823
1194079
1201247
1201503
1258753
1255432
1257736
1258248
1258504
1253386
1255434
1256202
1257738
1258250
1253387
1255435
1256203
1257739
1258251
1258507
1253388
1256204
1257740
1258252
1258508
1253389
1255437
1256205
1257741
1258253
1258509
1253390
1255438
1256206
1257742
1258254
1258510
1253391
1255439
1256207
1257743
1258255
1258511
1253392
1255440
1256208
1257744
1258512
1253393
1256209
1257745
1258257
1258513
1253394
1255442
1257746
1258258
1258514
1253395
1255443
1256211
1257747
1258259
1258515
1260563
1255444
1256212
1257748
1258260
1258516
1260564
1253397
1255445
1256213
1257749
1258261
1258517
1260565
1253398
1255446
1256214
1257750
1258262
1258518
1260566
1253399
1255447
1256215
1257751
1258263
1258519
1260567
1253400
1255448
1256216
1257752
1258264
1258520
1260568
1253401
1255449
1256217
1257753
1258265
1258521
1260569
1253402
1255450
1256218
1257754
1258266
1258522
1260570
1253403
1255451
1256219
1257755
1258267
1258523
1260571
1253404
1255452
1256220
1257756
1258268
1258524
1260572
1253405
1255453
1256221
1257757
1258269
1258525
1260573
1253406
1255454
1256222
1257758
1258270
1258526
1260574
1253407
1255455
1256223
1257759
1258271
1258527
1260575
1253408
1255456
1256224
1257760
1258272
1258528
1260576
1250816
1251072
1259264
1259520
1266688
1266944
1250911
1251167
1259359
1259615
1266783
1267039
1323018
1323274
1323530
1323786
1324042
1324298
1324554
1324810
1323019
1323275
1323531
1323787
1324043
1324299
1324555
1324811
1323022
1323278
1323534
1323790
1324046
1324302
1324558
1324814
1323023
1323279
1323535
1323791
1324047
1324303
1324559
1324815
1323024
1323280
1323536
1323792
1324048
1324304
1324560
1324816
1323025
1323281
1323537
1323793
1324049
1324305
1324561
1324817
1323026
1323282
1323538
1323794
1324050
1324306
1324562
1324818
1323027
1323283
1323539
1323795
1324051
1324307
1324563
1324819
1323028
1323284
1323540
1323796
1324052
1324308
1324564
1324820
1323029
1323285
1323541
1323797
1324053
1324309
1324565
1324821
1323030
1323286
1323542
1323798
1324054
1324310
1324566
1324822
1323031
1323287
1323543
1323799
1324055
1324311
1324567
1324823
1323032
1323288
1323544
1323800
1324056
1324312
1324568
1324824
1323033
1323289
1323545
1323801
1324057
1324313
1324569
1324825
1323034
1323290
1323546
1323802
1324058
1324314
1324570
1324826
1323035
1323291
1323547
1323803
1324059
1324315
1324571
1324827
1323036
1323292
1323548
1323804
1324060
1324316
1324572
1324828
1323037
1323293
1323549
1323805
1324061
1324317
1324573
1324829
1323038
1323294
1323550
1323806
1324062
1324318
1324574
1324830
1323039
1323295
1323551
1323807
1324063
1324319
1324575
1324831
1316352
1316608
1324800
1325056
1332224
1332480
1316447
1316703
1324895
1325151
1332319
1332575
1381888
1382144
1390336
1390592
1397760
1398016
1381983
1382239
1390431
1390687
1397855
1398111
1447424
1447680
1455872
1456128
1463296
1463552
1447519
1447775
1455967
1456223
1463391
1463647
1512960
1513216
1521408
1521664
1528832
1529088
1513055
1513311
1521503
1521759
1528927
1529183
1586176
1586432
1594624
1586177
1586433
1594625
1578496
1578752
1586944
1587200
1594368
1594624
1578591
1578847
1587039
1587295
1594463
1594719
1644032
1644288
1652480
1652736
1659904
1660160
1644127
1644383
1652575
1652831
1659999
1660255
1709568
1709824
1718016
1718272
1725440
1725696
1709663
1709919
1718111
1718367
1725535
1725791
1779211
1779467
1780747
1779212
1779468
1780748
1779213
1779469
1780749
1779214
1779470
1780750
1779215
1779471
1780751
1779216
1779472
1780752
1779217
1779473
1780753
1779218
1779474
1780754
1779219
1779475
1780755
1779220
1779476
1779221
1779477
1780757
1779222
1779478
1780758
1779223
1779479
1780759
1779224
1779480
1780760
1779225
1779481
1780761
1779226
1779482
1780762
1782298
1779227
1779483
1780763
1782299
1780764
1782300
1779229
1779485
1780765
1782301
1779230
1779486
1780766
1782302
1779231
1779487
1780767
1782303
1779232
1779488
1780768
1782304
1775104
1775360
1783552
1783808
1790976
1791232
1775199
1775455
1783647
1783903
1791071
1791327
1845779
1845780
1845781
1845782
1845783
1845784
1845785
1845786
1845787
1845788
1845789
1845790
1845791
1845792
1840640
1840896
1849088
1849344
1856512
1856768
1840735
1840991
1849183
1849439
1856607
1856863
1906176
1906432
1914624
1914880
1922048
1922304
1906271
1906527
1914719
1914975
1922143
1922399
1971712
1971968
1980160
1980416
1987584
1987840
1971807
1972063
1980255
1980511
1987679
1987935
2043658
2043659
2043660
2043661
2043663
2043664
2043665
2043666
2043667
2043668
2043669
2043670
2043671
2043672
2043673
2043674
2043675
2043676
2043677
2043678
2043679
2043680
2043681
2037248
2037504
2045696
2045952
2053120
2053376
2037343
2037599
2045791
2046047
2053215
2053471
2110464
2110720
2110465
2110721
2108687
2109199
2109455
2108688
2109200
2109456
2108689
2109201
2109457
2108694
2109206
2109462
2108695
2109207
2109463
2108696
2109208
2109464
2108697
2109209
2109465
2108698
2109210
2109466
2108699
2109211
2109467
2108700
2109212
2109468
2108701
2109213
2109469
2108702
2109214
2109470
2108703
2109215
2109471
2108704
2109216
2109472
2102784
2103040
2111232
2111488
2118656
2118912
2102879
2103135
2111327
2111583
2118751
2119007
2168320
2168576
2176768
2177024
2184192
2184448
2168415
2168671
2176863
2177119
2184287
2184543
2241536
2241792
2241537
2241793
2233856
2234112
2242304
2242560
2249728
2249984
2233951
2234207
2242399
2242655
2249823
2250079
2302217
2302218
2302219
2302220
2302221
2302222
2302223
2302224
2302225
2302226
2302227
2302228
2302229
2302230
2302231
2302233
2302234
2302235
2302236
2302237
2302238
2302239
2302240
2302241
2299392
2299648
2307840
2308096
2315264
2315520
2299487
2299743
2307935
2308191
2315359
2315615
2372608
2372864
2372609
2372865
2364928
2365184
2373376
2373632
2380800
2381056
2365023
2365279
2373471
2373727
2380895
2381151
2430464
2430720
2438912
2439168
2446336
2446592
2430559
2430815
2439007
2439263
2446431
2446687
2499593
2499594
2501386
2502410
2502666
2502922
2504202
2498828
2499084
2499596
2501388
2502412
2502668
2502924
2504204
2499599
2501391
2502415
2502671
2502927
2504207
2499600
2501392
2502416
2502672
2502928
2504208
2499601
2501393
2502417
2502673
2502929
2504209
2499602
2501394
2502418
2502674
2502930
2504210
2499603
2501395
2502419
2502675
2502931
2504211
2499604
2501396
2502420
2502676
2502932
2504212
2499605
2501397
2502421
2502677
2502933
2504213
2499606
2501398
2502422
2502678
2502934
2504214
2499607
2501399
2502423
2502679
2502935
2504215
2499608
2501400
2502424
2502680
2502936
2504216
2499609
2501401
2502425
2502681
2502937
2504217
2499610
2501402
2502426
2502682
2502938
2504218
2499611
2501403
2502427
2502683
2502939
2504219
2499612
2501404
2502428
2502684
2502940
2504220
2499613
2501405
2502429
2502685
2502941
2504221
2499614
2501406
2502430
2502686
2502942
2504222
2499615
2501407
2502431
2502687
2502943
2504223
2499616
2501408
2502432
2502688
2502944
2504224
2499617
2501409
2502433
2502689
2502945
2504225
2496000
2496256
2504448
2504704
2511872
2512128
2496095
2496351
2504543
2504799
2511967
2512223
2564386
2561536
2561792
2569984
2570240
2577408
2577664
2561631
2561887
2570079
2570335
2577503
2577759
2627072
2627328
2635520
2635776
2642944
2643200
2627167
2627423
2635615
2635871
2643039
2643295
2700544
2700545
2692608
2692864
2701056
2701312
2708480
2708736
2692703
2692959
2701151
2701407
2708575
2708831
2758144
2758400
2758144
2758400
2766592
2766848
2774016
2774272
2758239
2758495
2766687
2766943
2774111
2774367
2823680
2823936
2832128
2832384
2839552
2839808
2823775
2824031
2832223
2832479
2839647
2839903
2889216
2889472
2897664
2897920
2905088
2905344
2889311
2889567
2897759
2898015
2905183
2905439
2958347
2958348
2958351
2958352
2958353
2958354
2958356
2958361
2958362
2957341
2958365
2957343
2958367
2958368
2954752
2955008
2963200
2963456
2970624
2970880
2954847
2955103
2963295
2963551
2970719
2970975
3020288
3020544
3028736
3028992
3036160
3036416
3020383
3020639
3028831
3029087
3036255
3036511
3085824
3086080
3094272
3094528
3101696
3101952
3085919
3086175
3094367
3094623
3101791
3102047
3159296
3167488
3159297
3167233
3167489
3157512
3157513
3157514
3157515
3157516
3157517
3157518
3157519
3157520
3157521
3157522
3157523
3157524
3157525
3157526
3157527
3157528
3157529
3157530
3157531
3157532
3157533
3157534
3157535
3157536
3151360
3151616
3159808
3160064
3167232
3167488
3151455
3151711
3159903
3160159
3167327
3167583
3224576
3224832
3224577
3224833
3223050
3225610
3226122
3223054
3225614
3226126
3223055
3225615
3226127
3223058
3225618
3226130
3223059
3225619
3226131
3223060
3225620
3226132
3223061
3225621
3226133
3223062
3225622
3226134
3223063
3225623
3226135
3223065
3225625
3226137
3223066
3225626
3226138
3223067
3225627
3226139
3223068
3225628
3226140
3223069
3225629
3226141
3223070
3225630
3226142
3223071
3225631
3226143
3216896
3217152
3225344
3225600
3232768
3233024
3216991
3217247
3225439
3225695
3232863
3233119
3285519
3286287
3286799
3288591
3289103
3290127
3290639
3291151
3285521
3286289
3286801
3288593
3289105
3290129
3290641
3291153
3285522
3286290
3286802
3288594
3289106
3290130
3290642
3291154
3285523
3286291
3286803
3288595
3289107
3290131
3290643
3291155
3285524
3286292
3286804
3288596
3289108
3290132
3290644
3291156
3285525
3286293
3286805
3288597
3289109
3290133
3290645
3291157
3285526
3286294
3286806
3288598
3289110
3290134
3290646
3291158
3285527
3286295
3286807
3288599
3289111
3290135
3290647
3291159
3285528
3286296
3286808
3288600
3289112
3290136
3290648
3291160
3285529
3286297
3286809
3288601
3289113
3290137
3290649
3291161
3285530
3286298
3286810
3288602
3289114
3290138
3290650
3291162
3285531
3286299
3286811
3288603
3289115
3290139
3290651
3291163
3285532
3286300
3286812
3288604
3289116
3290140
3290652
3291164
3282432
3282688
3290880
3291136
3298304
3298560
3282527
3282783
3290975
3291231
3298399
3298655
3355649
3355905
3350792
3351560
3354376
3356936
3350793
3351561
3354377
3356937
3350794
3351562
3354378
3356938
3350795
3351563
3354379
3356939
3350796
3351564
3354380
3356940
3350798
3351566
3354382
3356942
3350799
3351567
3354383
3356943
3350800
3351568
3354384
3356944
3350801
3351569
3354385
3356945
3350802
3351570
3354386
3356946
3350803
3351571
3354387
3356947
3350804
3351572
3354388
3356948
3350805
3351573
3354389
3356949
3350806
3351574
3354390
3356950
3350807
3351575
3354391
3356951
3350808
3351576
3354392
3356952
3350809
3351577
3354393
3356953
3350810
3351578
3354394
3356954
3350811
3351579
3354395
3356955
3350812
3351580
3354396
3356956
3347968
3348224
3356416
3356672
3363840
3364096
3348063
3348319
3356511
3356767
3363935
3364191
3422984
3422985
3422986
3422987
3422988
3422989
3422990
3422991
3422992
3422993
3422994
3422995
3422996
3422997
3422998
3422999
3423000
3423001
3423002
3423003
3423004
3423005
3423006
3423007
3423008
3413504
3413760
3421952
3422208
3429376
3429632
3413599
3413855
3422047
3422303
3429471
3429727
3479040
3479296
3487488
3487744
3494912
3495168
3479135
3479391
3487583
3487839
3495007
3495263
