999424
999680
999936
1000192
1000448
1000704
1000960
1001216
1001472
1001728
1001984
1002240
1002496
1002752
1003008
1003264
1003520
1003776
1004032
1004288
1004544
1004800
1005056
1005312
1005568
1005824
1006080
1006336
1006592
1006848
1007104
1007360
999425
999681
999937
1000193
1000449
1000705
1000961
1001217
1001473
1001729
1001985
1002241
1002497
1002753
1003009
1003265
1003521
1003777
1004033
1004289
1004545
1004801
1005057
1005313
1005569
1005825
1006081
1006337
1006593
1006849
1007105
1007361
999426
999682
999938
1000194
1000450
1000706
1000962
1001218
1001474
1001730
1001986
1002242
1002498
1002754
1003010
1003266
1003522
1003778
1004034
1004290
1004546
1004802
1005058
1005314
1005570
1005826
1006082
1006338
1006594
1006850
1007106
1007362
999427
999683
999939
1000195
1000451
1000707
1000963
1001219
1001475
1001731
1001987
1002243
1002499
1002755
1003011
1003267
1003523
1003779
1004035
1004291
1004547
1004803
1005059
1005315
1005571
1005827
1006083
1006339
1006595
1006851
1007107
1007363
999428
999684
999940
1000196
1000452
1000708
1000964
1001220
1001476
1001732
1001988
1002244
1002500
1002756
1003012
1003268
1003524
1003780
1004036
1004292
1004548
1004804
1005060
1005316
1005572
1005828
1006084
1006340
1006596
1006852
1007108
1007364
999429
999685
999941
1000197
1000453
1000709
1000965
1001221
1001477
1001733
1001989
1002245
1002501
1002757
1003013
1003269
1003525
1003781
1004037
1004293
1004549
1004805
1005061
1005317
1005573
1005829
1006085
1006341
1006597
1006853
1007109
1007365
999430
999686
999942
1000198
1000454
1000710
1000966
1001222
1001478
1001734
1001990
1002246
1002502
1002758
1003014
1003270
1003526
1003782
1004038
1004294
1004550
1004806
1005062
1005318
1005574
1005830
1006086
1006342
1006598
1006854
1007110
1007366
999431
999687
999943
1000199
1000455
1000711
1000967
1001223
1001479
1001735
1001991
1002247
1002503
1002759
1003015
1003271
1003527
1003783
1004039
1004295
1004551
1004807
1005063
1005319
1005575
1005831
1006087
1006343
1006599
1006855
1007111
1007367
999432
999688
999944
1000200
1000456
1000712
1000968
1001224
1001480
1001736
1001992
1002248
1002504
1002760
1003016
1003272
1003528
1003784
1004040
1004296
1004552
1004808
1005064
1005320
1005576
1005832
1006088
1006344
1006600
1006856
1007112
1007368
999433
999689
999945
1000201
1000457
1000713
1000969
1001225
1001481
1001737
1001993
1002249
1002505
1002761
1003017
1003273
1003529
1003785
1004041
1004297
1004553
1004809
1005065
1005321
1005577
1005833
1006089
1006345
1006601
1006857
1007113
1007369
999434
999690
999946
1000202
1000458
1000714
1000970
1001226
1001482
1001738
1001994
1002250
1002506
1002762
1003018
1003274
1003530
1003786
1004042
1004298
1004554
1004810
1005066
1005322
1005578
1005834
1006090
1006346
1006602
1006858
1007114
1007370
999435
999691
999947
1000203
1000459
1000715
1000971
1001227
1001483
1001739
1001995
1002251
1002507
1002763
1003019
1003275
1003531
1003787
1004043
1004299
1004555
1004811
1005067
1005323
1005579
1005835
1006091
1006347
1006603
1006859
1007115
1007371
999436
999692
999948
1000204
1000460
1000716
1000972
1001228
1001484
1001740
1001996
1002252
1002508
1002764
1003020
1003276
1003532
1003788
1004044
1004300
1004556
1004812
1005068
1005324
1005580
1005836
1006092
1006348
1006604
1006860
1007116
1007372
999437
999693
999949
1000205
1000461
1000717
1000973
1001229
1001485
1001741
1001997
1002253
1002509
1002765
1003021
1003277
1003533
1003789
1004045
1004301
1004557
1004813
1005069
1005325
1005581
1005837
1006093
1006349
1006605
1006861
1007117
1007373
999438
999694
999950
1000206
1000462
1000718
1000974
1001230
1001486
1001742
1001998
1002254
1002510
1002766
1003022
1003278
1003534
1003790
1004046
1004302
1004558
1004814
1005070
1005326
1005582
1005838
1006094
1006350
1006606
1006862
1007118
1007374
999439
999695
999951
1000207
1000463
1000719
1000975
1001231
1001487
1001743
1001999
1002255
1002511
1002767
1003023
1003279
1003535
1003791
1004047
1004303
1004559
1004815
1005071
1005327
1005583
1005839
1006095
1006351
1006607
1006863
1007119
1007375
999440
999696
999952
1000208
1000464
1000720
1000976
1001232
1001488
1001744
1002000
1002256
1002512
1002768
1003024
1003280
1003536
1003792
1004048
1004304
1004560
1004816
1005072
1005328
1005584
1005840
1006096
1006352
1006608
1006864
1007120
1007376
999441
999697
999953
1000209
1000465
1000721
1000977
1001233
1001489
1001745
1002001
1002257
1002513
1002769
1003025
1003281
1003537
1003793
1004049
1004305
1004561
1004817
1005073
1005329
1005585
1005841
1006097
1006353
1006609
1006865
1007121
1007377
999442
999698
999954
1000210
1000466
1000722
1000978
1001234
1001490
1001746
1002002
1002258
1002514
1002770
1003026
1003282
1003538
1003794
1004050
1004306
1004562
1004818
1005074
1005330
1005586
1005842
1006098
1006354
1006610
1006866
1007122
1007378
999443
999699
999955
1000211
1000467
1000723
1000979
1001235
1001491
1001747
1002003
1002259
1002515
1002771
1003027
1003283
1003539
1003795
1004051
1004307
1004563
1004819
1005075
1005331
1005587
1005843
1006099
1006355
1006611
1006867
1007123
1007379
999444
999700
999956
1000212
1000468
1000724
1000980
1001236
1001492
1001748
1002004
1002260
1002516
1002772
1003028
1003284
1003540
1003796
1004052
1004308
1004564
1004820
1005076
1005332
1005588
1005844
1006100
1006356
1006612
1006868
1007124
1007380
999445
999701
999957
1000213
1000469
1000725
1000981
1001237
1001493
1001749
1002005
1002261
1002517
1002773
1003029
1003285
1003541
1003797
1004053
1004309
1004565
1004821
1005077
1005333
1005589
1005845
1006101
1006357
1006613
1006869
1007125
1007381
999446
999702
999958
1000214
1000470
1000726
1000982
1001238
1001494
1001750
1002006
1002262
1002518
1002774
1003030
1003286
1003542
1003798
1004054
1004310
1004566
1004822
1005078
1005334
1005590
1005846
1006102
1006358
1006614
1006870
1007126
1007382
999447
999703
999959
1000215
1000471
1000727
1000983
1001239
1001495
1001751
1002007
1002263
1002519
1002775
1003031
1003287
1003543
1003799
1004055
1004311
1004567
1004823
1005079
1005335
1005591
1005847
1006103
1006359
1006615
1006871
1007127
1007383
999448
999704
999960
1000216
1000472
1000728
1000984
1001240
1001496
1001752
1002008
1002264
1002520
1002776
1003032
1003288
1003544
1003800
1004056
1004312
1004568
1004824
1005080
1005336
1005592
1005848
1006104
1006360
1006616
1006872
1007128
1007384
999449
999705
999961
1000217
1000473
1000729
1000985
1001241
1001497
1001753
1002009
1002265
1002521
1002777
1003033
1003289
1003545
1003801
1004057
1004313
1004569
1004825
1005081
1005337
1005593
1005849
1006105
1006361
1006617
1006873
1007129
1007385
999450
999706
999962
1000218
1000474
1000730
1000986
1001242
1001498
1001754
1002010
1002266
1002522
1002778
1003034
1003290
1003546
1003802
1004058
1004314
1004570
1004826
1005082
1005338
1005594
1005850
1006106
1006362
1006618
1006874
1007130
1007386
999451
999707
999963
1000219
1000475
1000731
1000987
1001243
1001499
1001755
1002011
1002267
1002523
1002779
1003035
1003291
1003547
1003803
1004059
1004315
1004571
1004827
1005083
1005339
1005595
1005851
1006107
1006363
1006619
1006875
1007131
1007387
999452
999708
999964
1000220
1000476
1000732
1000988
1001244
1001500
1001756
1002012
1002268
1002524
1002780
1003036
1003292
1003548
1003804
1004060
1004316
1004572
1004828
1005084
1005340
1005596
1005852
1006108
1006364
1006620
1006876
1007132
1007388
999453
999709
999965
1000221
1000477
1000733
1000989
1001245
1001501
1001757
1002013
1002269
1002525
1002781
1003037
1003293
1003549
1003805
1004061
1004317
1004573
1004829
1005085
1005341
1005597
1005853
1006109
1006365
1006621
1006877
1007133
1007389
999454
999710
999966
1000222
1000478
1000734
1000990
1001246
1001502
1001758
1002014
1002270
1002526
1002782
1003038
1003294
1003550
1003806
1004062
1004318
1004574
1004830
1005086
1005342
1005598
1005854
1006110
1006366
1006622
1006878
1007134
1007390
999455
999711
999967
1000223
1000479
1000735
1000991
1001247
1001503
1001759
1002015
1002271
1002527
1002783
1003039
1003295
1003551
1003807
1004063
1004319
1004575
1004831
1005087
1005343
1005599
1005855
1006111
1006367
1006623
1006879
1007135
1007391
999456
999712
999968
1000224
1000480
1000736
1000992
1001248
1001504
1001760
1002016
1002272
1002528
1002784
1003040
1003296
1003552
1003808
1004064
1004320
1004576
1004832
1005088
1005344
1005600
1005856
1006112
1006368
1006624
1006880
1007136
1007392
999457
999713
999969
1000225
1000481
1000737
1000993
1001249
1001505
1001761
1002017
1002273
1002529
1002785
1003041
1003297
1003553
1003809
1004065
1004321
1004577
1004833
1005089
1005345
1005601
1005857
1006113
1006369
1006625
1006881
1007137
1007393
999458
999714
999970
1000226
1000482
1000738
1000994
1001250
1001506
1001762
1002018
1002274
1002530
1002786
1003042
1003298
1003554
1003810
1004066
1004322
1004578
1004834
1005090
1005346
1005602
1005858
1006114
1006370
1006626
1006882
1007138
1007394
999459
999715
999971
1000227
1000483
1000739
1000995
1001251
1001507
1001763
1002019
1002275
1002531
1002787
1003043
1003299
1003555
1003811
1004067
1004323
1004579
1004835
1005091
1005347
1005603
1005859
1006115
1006371
1006627
1006883
1007139
1007395
999460
999716
999972
1000228
1000484
1000740
1000996
1001252
1001508
1001764
1002020
1002276
1002532
1002788
1003044
1003300
1003556
1003812
1004068
1004324
1004580
1004836
1005092
1005348
1005604
1005860
1006116
1006372
1006628
1006884
1007140
1007396
999461
999717
999973
1000229
1000485
1000741
1000997
1001253
1001509
1001765
1002021
1002277
1002533
1002789
1003045
1003301
1003557
1003813
1004069
1004325
1004581
1004837
1005093
1005349
1005605
1005861
1006117
1006373
1006629
1006885
1007141
1007397
999462
999718
999974
1000230
1000486
1000742
1000998
1001254
1001510
1001766
1002022
1002278
1002534
1002790
1003046
1003302
1003558
1003814
1004070
1004326
1004582
1004838
1005094
1005350
1005606
1005862
1006118
1006374
1006630
1006886
1007142
1007398
999463
999719
999975
1000231
1000487
1000743
1000999
1001255
1001511
1001767
1002023
1002279
1002535
1002791
1003047
1003303
1003559
1003815
1004071
1004327
1004583
1004839
1005095
1005351
1005607
1005863
1006119
1006375
1006631
1006887
1007143
1007399
999464
999720
999976
1000232
1000488
1000744
1001000
1001256
1001512
1001768
1002024
1002280
1002536
1002792
1003048
1003304
1003560
1003816
1004072
1004328
1004584
1004840
1005096
1005352
1005608
1005864
1006120
1006376
1006632
1006888
1007144
1007400
999465
999721
999977
1000233
1000489
1000745
1001001
1001257
1001513
1001769
1002025
1002281
1002537
1002793
1003049
1003305
1003561
1003817
1004073
1004329
1004585
1004841
1005097
1005353
1005609
1005865
1006121
1006377
1006633
1006889
1007145
1007401
999466
999722
999978
1000234
1000490
1000746
1001002
1001258
1001514
1001770
1002026
1002282
1002538
1002794
1003050
1003306
1003562
1003818
1004074
1004330
1004586
1004842
1005098
1005354
1005610
1005866
1006122
1006378
1006634
1006890
1007146
1007402
999467
999723
999979
1000235
1000491
1000747
1001003
1001259
1001515
1001771
1002027
1002283
1002539
1002795
1003051
1003307
1003563
1003819
1004075
1004331
1004587
1004843
1005099
1005355
1005611
1005867
1006123
1006379
1006635
1006891
1007147
1007403
999468
999724
999980
1000236
1000492
1000748
1001004
1001260
1001516
1001772
1002028
1002284
1002540
1002796
1003052
1003308
1003564
1003820
1004076
1004332
1004588
1004844
1005100
1005356
1005612
1005868
1006124
1006380
1006636
1006892
1007148
1007404
999469
999725
999981
1000237
1000493
1000749
1001005
1001261
1001517
1001773
1002029
1002285
1002541
1002797
1003053
1003309
1003565
1003821
1004077
1004333
1004589
1004845
1005101
1005357
1005613
1005869
1006125
1006381
1006637
1006893
1007149
1007405
999470
999726
999982
1000238
1000494
1000750
1001006
1001262
1001518
1001774
1002030
1002286
1002542
1002798
1003054
1003310
1003566
1003822
1004078
1004334
1004590
1004846
1005102
1005358
1005614
1005870
1006126
1006382
1006638
1006894
1007150
1007406
999471
999727
999983
1000239
1000495
1000751
1001007
1001263
1001519
1001775
1002031
1002287
1002543
1002799
1003055
1003311
1003567
1003823
1004079
1004335
1004591
1004847
1005103
1005359
1005615
1005871
1006127
1006383
1006639
1006895
1007151
1007407
999472
999728
999984
1000240
1000496
1000752
1001008
1001264
1001520
1001776
1002032
1002288
1002544
1002800
1003056
1003312
1003568
1003824
1004080
1004336
1004592
1004848
1005104
1005360
1005616
1005872
1006128
1006384
1006640
1006896
1007152
1007408
999473
999729
999985
1000241
1000497
1000753
1001009
1001265
1001521
1001777
1002033
1002289
1002545
1002801
1003057
1003313
1003569
1003825
1004081
1004337
1004593
1004849
1005105
1005361
1005617
1005873
1006129
1006385
1006641
1006897
1007153
1007409
999474
999730
999986
1000242
1000498
1000754
1001010
1001266
1001522
1001778
1002034
1002290
1002546
1002802
1003058
1003314
1003570
1003826
1004082
1004338
1004594
1004850
1005106
1005362
1005618
1005874
1006130
1006386
1006642
1006898
1007154
1007410
999475
999731
999987
1000243
1000499
1000755
1001011
1001267
1001523
1001779
1002035
1002291
1002547
1002803
1003059
1003315
1003571
1003827
1004083
1004339
1004595
1004851
1005107
1005363
1005619
1005875
1006131
1006387
1006643
1006899
1007155
1007411
999476
999732
999988
1000244
1000500
1000756
1001012
1001268
1001524
1001780
1002036
1002292
1002548
1002804
1003060
1003316
1003572
1003828
1004084
1004340
1004596
1004852
1005108
1005364
1005620
1005876
1006132
1006388
1006644
1006900
1007156
1007412
999477
999733
999989
1000245
1000501
1000757
1001013
1001269
1001525
1001781
1002037
1002293
1002549
1002805
1003061
1003317
1003573
1003829
1004085
1004341
1004597
1004853
1005109
1005365
1005621
1005877
1006133
1006389
1006645
1006901
1007157
1007413
999478
999734
999990
1000246
1000502
1000758
1001014
1001270
1001526
1001782
1002038
1002294
1002550
1002806
1003062
1003318
1003574
1003830
1004086
1004342
1004598
1004854
1005110
1005366
1005622
1005878
1006134
1006390
1006646
1006902
1007158
1007414
999479
999735
999991
1000247
1000503
1000759
1001015
1001271
1001527
1001783
1002039
1002295
1002551
1002807
1003063
1003319
1003575
1003831
1004087
1004343
1004599
1004855
1005111
1005367
1005623
1005879
1006135
1006391
1006647
1006903
1007159
1007415
999480
999736
999992
1000248
1000504
1000760
1001016
1001272
1001528
1001784
1002040
1002296
1002552
1002808
1003064
1003320
1003576
1003832
1004088
1004344
1004600
1004856
1005112
1005368
1005624
1005880
1006136
1006392
1006648
1006904
1007160
1007416
999481
999737
999993
1000249
1000505
1000761
1001017
1001273
1001529
1001785
1002041
1002297
1002553
1002809
1003065
1003321
1003577
1003833
1004089
1004345
1004601
1004857
1005113
1005369
1005625
1005881
1006137
1006393
1006649
1006905
1007161
1007417
999482
999738
999994
1000250
1000506
1000762
1001018
1001274
1001530
1001786
1002042
1002298
1002554
1002810
1003066
1003322
1003578
1003834
1004090
1004346
1004602
1004858
1005114
1005370
1005626
1005882
1006138
1006394
1006650
1006906
1007162
1007418
999483
999739
999995
1000251
1000507
1000763
1001019
1001275
1001531
1001787
1002043
1002299
1002555
1002811
1003067
1003323
1003579
1003835
1004091
1004347
1004603
1004859
1005115
1005371
1005627
1005883
1006139
1006395
1006651
1006907
1007163
1007419
999484
999740
999996
1000252
1000508
1000764
1001020
1001276
1001532
1001788
1002044
1002300
1002556
1002812
1003068
1003324
1003580
1003836
1004092
1004348
1004604
1004860
1005116
1005372
1005628
1005884
1006140
1006396
1006652
1006908
1007164
1007420
999485
999741
999997
1000253
1000509
1000765
1001021
1001277
1001533
1001789
1002045
1002301
1002557
1002813
1003069
1003325
1003581
1003837
1004093
1004349
1004605
1004861
1005117
1005373
1005629
1005885
1006141
1006397
1006653
1006909
1007165
1007421
999486
999742
999998
1000254
1000510
1000766
1001022
1001278
1001534
1001790
1002046
1002302
1002558
1002814
1003070
1003326
1003582
1003838
1004094
1004350
1004606
1004862
1005118
1005374
1005630
1005886
1006142
1006398
1006654
1006910
1007166
1007422
999487
999743
999999
1000255
1000511
1000767
1001023
1001279
1001535
1001791
1002047
1002303
1002559
1002815
1003071
1003327
1003583
1003839
1004095
1004351
1004607
1004863
1005119
1005375
1005631
1005887
1006143
1006399
1006655
1006911
1007167
1007423
999488
999744
1000000
1000256
1000512
1000768
1001024
1001280
1001536
1001792
1002048
1002304
1002560
1002816
1003072
1003328
1003584
1003840
1004096
1004352
1004608
1004864
1005120
1005376
1005632
1005888
1006144
1006400
1006656
1006912
1007168
1007424
999489
999745
1000001
1000257
1000513
1000769
1001025
1001281
1001537
1001793
1002049
1002305
1002561
1002817
1003073
1003329
1003585
1003841
1004097
1004353
1004609
1004865
1005121
1005377
1005633
1005889
1006145
1006401
1006657
1006913
1007169
1007425
999490
999746
1000002
1000258
1000514
1000770
1001026
1001282
1001538
1001794
1002050
1002306
1002562
1002818
1003074
1003330
1003586
1003842
1004098
1004354
1004610
1004866
1005122
1005378
1005634
1005890
1006146
1006402
1006658
1006914
1007170
1007426
999491
999747
1000003
1000259
1000515
1000771
1001027
1001283
1001539
1001795
1002051
1002307
1002563
1002819
1003075
1003331
1003587
1003843
1004099
1004355
1004611
1004867
1005123
1005379
1005635
1005891
1006147
1006403
1006659
1006915
1007171
1007427
999492
999748
1000004
1000260
1000516
1000772
1001028
1001284
1001540
1001796
1002052
1002308
1002564
1002820
1003076
1003332
1003588
1003844
1004100
1004356
1004612
1004868
1005124
1005380
1005636
1005892
1006148
1006404
1006660
1006916
1007172
1007428
999493
999749
1000005
1000261
1000517
1000773
1001029
1001285
1001541
1001797
1002053
1002309
1002565
1002821
1003077
1003333
1003589
1003845
1004101
1004357
1004613
1004869
1005125
1005381
1005637
1005893
1006149
1006405
1006661
1006917
1007173
1007429
999494
999750
1000006
1000262
1000518
1000774
1001030
1001286
1001542
1001798
1002054
1002310
1002566
1002822
1003078
1003334
1003590
1003846
1004102
1004358
1004614
1004870
1005126
1005382
1005638
1005894
1006150
1006406
1006662
1006918
1007174
1007430
999495
999751
1000007
1000263
1000519
1000775
1001031
1001287
1001543
1001799
1002055
1002311
1002567
1002823
1003079
1003335
1003591
1003847
1004103
1004359
1004615
1004871
1005127
1005383
1005639
1005895
1006151
1006407
1006663
1006919
1007175
1007431
999496
999752
1000008
1000264
1000520
1000776
1001032
1001288
1001544
1001800
1002056
1002312
1002568
1002824
1003080
1003336
1003592
1003848
1004104
1004360
1004616
1004872
1005128
1005384
1005640
1005896
1006152
1006408
1006664
1006920
1007176
1007432
999497
999753
1000009
1000265
1000521
1000777
1001033
1001289
1001545
1001801
1002057
1002313
1002569
1002825
1003081
1003337
1003593
1003849
1004105
1004361
1004617
1004873
1005129
1005385
1005641
1005897
1006153
1006409
1006665
1006921
1007177
1007433
999498
999754
1000010
1000266
1000522
1000778
1001034
1001290
1001546
1001802
1002058
1002314
1002570
1002826
1003082
1003338
1003594
1003850
1004106
1004362
1004618
1004874
1005130
1005386
1005642
1005898
1006154
1006410
1006666
1006922
1007178
1007434
999499
999755
1000011
1000267
1000523
1000779
1001035
1001291
1001547
1001803
1002059
1002315
1002571
1002827
1003083
1003339
1003595
1003851
1004107
1004363
1004619
1004875
1005131
1005387
1005643
1005899
1006155
1006411
1006667
1006923
1007179
1007435
999500
999756
1000012
1000268
1000524
1000780
1001036
1001292
1001548
1001804
1002060
1002316
1002572
1002828
1003084
1003340
1003596
1003852
1004108
1004364
1004620
1004876
1005132
1005388
1005644
1005900
1006156
1006412
1006668
1006924
1007180
1007436
999501
999757
1000013
1000269
1000525
1000781
1001037
1001293
1001549
1001805
1002061
1002317
1002573
1002829
1003085
1003341
1003597
1003853
1004109
1004365
1004621
1004877
1005133
1005389
1005645
1005901
1006157
1006413
1006669
1006925
1007181
1007437
999502
999758
1000014
1000270
1000526
1000782
1001038
1001294
1001550
1001806
1002062
1002318
1002574
1002830
1003086
1003342
1003598
1003854
1004110
1004366
1004622
1004878
1005134
1005390
1005646
1005902
1006158
1006414
1006670
1006926
1007182
1007438
999503
999759
1000015
1000271
1000527
1000783
1001039
1001295
1001551
1001807
1002063
1002319
1002575
1002831
1003087
1003343
1003599
1003855
1004111
1004367
1004623
1004879
1005135
1005391
1005647
1005903
1006159
1006415
1006671
1006927
1007183
1007439
999504
999760
1000016
1000272
1000528
1000784
1001040
1001296
1001552
1001808
1002064
1002320
1002576
1002832
1003088
1003344
1003600
1003856
1004112
1004368
1004624
1004880
1005136
1005392
1005648
1005904
1006160
1006416
1006672
1006928
1007184
1007440
999505
999761
1000017
1000273
1000529
1000785
1001041
1001297
1001553
1001809
1002065
1002321
1002577
1002833
1003089
1003345
1003601
1003857
1004113
1004369
1004625
1004881
1005137
1005393
1005649
1005905
1006161
1006417
1006673
1006929
1007185
1007441
999506
999762
1000018
1000274
1000530
1000786
1001042
1001298
1001554
1001810
1002066
1002322
1002578
1002834
1003090
1003346
1003602
1003858
1004114
1004370
1004626
1004882
1005138
1005394
1005650
1005906
1006162
1006418
1006674
1006930
1007186
1007442
999507
999763
1000019
1000275
1000531
1000787
1001043
1001299
1001555
1001811
1002067
1002323
1002579
1002835
1003091
1003347
1003603
1003859
1004115
1004371
1004627
1004883
1005139
1005395
1005651
1005907
1006163
1006419
1006675
1006931
1007187
1007443
999508
999764
1000020
1000276
1000532
1000788
1001044
1001300
1001556
1001812
1002068
1002324
1002580
1002836
1003092
1003348
1003604
1003860
1004116
1004372
1004628
1004884
1005140
1005396
1005652
1005908
1006164
1006420
1006676
1006932
1007188
1007444
999509
999765
1000021
1000277
1000533
1000789
1001045
1001301
1001557
1001813
1002069
1002325
1002581
1002837
1003093
1003349
1003605
1003861
1004117
1004373
1004629
1004885
1005141
1005397
1005653
1005909
1006165
1006421
1006677
1006933
1007189
1007445
999510
999766
1000022
1000278
1000534
1000790
1001046
1001302
1001558
1001814
1002070
1002326
1002582
1002838
1003094
1003350
1003606
1003862
1004118
1004374
1004630
1004886
1005142
1005398
1005654
1005910
1006166
1006422
1006678
1006934
1007190
1007446
999511
999767
1000023
1000279
1000535
1000791
1001047
1001303
1001559
1001815
1002071
1002327
1002583
1002839
1003095
1003351
1003607
1003863
1004119
1004375
1004631
1004887
1005143
1005399
1005655
1005911
1006167
1006423
1006679
1006935
1007191
1007447
999512
999768
1000024
1000280
1000536
1000792
1001048
1001304
1001560
1001816
1002072
1002328
1002584
1002840
1003096
1003352
1003608
1003864
1004120
1004376
1004632
1004888
1005144
1005400
1005656
1005912
1006168
1006424
1006680
1006936
1007192
1007448
999513
999769
1000025
1000281
1000537
1000793
1001049
1001305
1001561
1001817
1002073
1002329
1002585
1002841
1003097
1003353
1003609
1003865
1004121
1004377
1004633
1004889
1005145
1005401
1005657
1005913
1006169
1006425
1006681
1006937
1007193
1007449
999514
999770
1000026
1000282
1000538
1000794
1001050
1001306
1001562
1001818
1002074
1002330
1002586
1002842
1003098
1003354
1003610
1003866
1004122
1004378
1004634
1004890
1005146
1005402
1005658
1005914
1006170
1006426
1006682
1006938
1007194
1007450
999515
999771
1000027
1000283
1000539
1000795
1001051
1001307
1001563
1001819
1002075
1002331
1002587
1002843
1003099
1003355
1003611
1003867
1004123
1004379
1004635
1004891
1005147
1005403
1005659
1005915
1006171
1006427
1006683
1006939
1007195
1007451
999516
999772
1000028
1000284
1000540
1000796
1001052
1001308
1001564
1001820
1002076
1002332
1002588
1002844
1003100
1003356
1003612
1003868
1004124
1004380
1004636
1004892
1005148
1005404
1005660
1005916
1006172
1006428
1006684
1006940
1007196
1007452
999517
999773
1000029
1000285
1000541
1000797
1001053
1001309
1001565
1001821
1002077
1002333
1002589
1002845
1003101
1003357
1003613
1003869
1004125
1004381
1004637
1004893
1005149
1005405
1005661
1005917
1006173
1006429
1006685
1006941
1007197
1007453
999518
999774
1000030
1000286
1000542
1000798
1001054
1001310
1001566
1001822
1002078
1002334
1002590
1002846
1003102
1003358
1003614
1003870
1004126
1004382
1004638
1004894
1005150
1005406
1005662
1005918
1006174
1006430
1006686
1006942
1007198
1007454
999519
999775
1000031
1000287
1000543
1000799
1001055
1001311
1001567
1001823
1002079
1002335
1002591
1002847
1003103
1003359
1003615
1003871
1004127
1004383
1004639
1004895
1005151
1005407
1005663
1005919
1006175
1006431
1006687
1006943
1007199
1007455
1589248
1589504
1589760
1590016
1590272
1590528
1590784
1591040
1591296
1591552
1591808
1592064
1592320
1592576
1592832
1593088
1593344
1593600
1593856
1594112
1594368
1594624
1594880
1595136
1595392
1595648
1595904
1596160
1596416
1596672
1596928
1597184
1589249
1589505
1589761
1590017
1590273
1590529
1590785
1591041
1591297
1591553
1591809
1592065
1592321
1592577
1592833
1593089
1593345
1593601
1593857
1594113
1594369
1594625
1594881
1595137
1595393
1595649
1595905
1596161
1596417
1596673
1596929
1597185
1589250
1589506
1589762
1590018
1590274
1590530
1590786
1591042
1591298
1591554
1591810
1592066
1592322
1592578
1592834
1593090
1593346
1593602
1593858
1594114
1594370
1594626
1594882
1595138
1595394
1595650
1595906
1596162
1596418
1596674
1596930
1597186
1589251
1589507
1589763
1590019
1590275
1590531
1590787
1591043
1591299
1591555
1591811
1592067
1592323
1592579
1592835
1593091
1593347
1593603
1593859
1594115
1594371
1594627
1594883
1595139
1595395
1595651
1595907
1596163
1596419
1596675
1596931
1597187
1589252
1589508
1589764
1590020
1590276
1590532
1590788
1591044
1591300
1591556
1591812
1592068
1592324
1592580
1592836
1593092
1593348
1593604
1593860
1594116
1594372
1594628
1594884
1595140
1595396
1595652
1595908
1596164
1596420
1596676
1596932
1597188
1589253
1589509
1589765
1590021
1590277
1590533
1590789
1591045
1591301
1591557
1591813
1592069
1592325
1592581
1592837
1593093
1593349
1593605
1593861
1594117
1594373
1594629
1594885
1595141
1595397
1595653
1595909
1596165
1596421
1596677
1596933
1597189
1589254
1589510
1589766
1590022
1590278
1590534
1590790
1591046
1591302
1591558
1591814
1592070
1592326
1592582
1592838
1593094
1593350
1593606
1593862
1594118
1594374
1594630
1594886
1595142
1595398
1595654
1595910
1596166
1596422
1596678
1596934
1597190
1589255
1589511
1589767
1590023
1590279
1590535
1590791
1591047
1591303
1591559
1591815
1592071
1592327
1592583
1592839
1593095
1593351
1593607
1593863
1594119
1594375
1594631
1594887
1595143
1595399
1595655
1595911
1596167
1596423
1596679
1596935
1597191
1589256
1589512
1589768
1590024
1590280
1590536
1590792
1591048
1591304
1591560
1591816
1592072
1592328
1592584
1592840
1593096
1593352
1593608
1593864
1594120
1594376
1594632
1594888
1595144
1595400
1595656
1595912
1596168
1596424
1596680
1596936
1597192
1589257
1589513
1589769
1590025
1590281
1590537
1590793
1591049
1591305
1591561
1591817
1592073
1592329
1592585
1592841
1593097
1593353
1593609
1593865
1594121
1594377
1594633
1594889
1595145
1595401
1595657
1595913
1596169
1596425
1596681
1596937
1597193
1589258
1589514
1589770
1590026
1590282
1590538
1590794
1591050
1591306
1591562
1591818
1592074
1592330
1592586
1592842
1593098
1593354
1593610
1593866
1594122
1594378
1594634
1594890
1595146
1595402
1595658
1595914
1596170
1596426
1596682
1596938
1597194
1589259
1589515
1589771
1590027
1590283
1590539
1590795
1591051
1591307
1591563
1591819
1592075
1592331
1592587
1592843
1593099
1593355
1593611
1593867
1594123
1594379
1594635
1594891
1595147
1595403
1595659
1595915
1596171
1596427
1596683
1596939
1597195
1589260
1589516
1589772
1590028
1590284
1590540
1590796
1591052
1591308
1591564
1591820
1592076
1592332
1592588
1592844
1593100
1593356
1593612
1593868
1594124
1594380
1594636
1594892
1595148
1595404
1595660
1595916
1596172
1596428
1596684
1596940
1597196
1589261
1589517
1589773
1590029
1590285
1590541
1590797
1591053
1591309
1591565
1591821
1592077
1592333
1592589
1592845
1593101
1593357
1593613
1593869
1594125
1594381
1594637
1594893
1595149
1595405
1595661
1595917
1596173
1596429
1596685
1596941
1597197
1589262
1589518
1589774
1590030
1590286
1590542
1590798
1591054
1591310
1591566
1591822
1592078
1592334
1592590
1592846
1593102
1593358
1593614
1593870
1594126
1594382
1594638
1594894
1595150
1595406
1595662
1595918
1596174
1596430
1596686
1596942
1597198
1589263
1589519
1589775
1590031
1590287
1590543
1590799
1591055
1591311
1591567
1591823
1592079
1592335
1592591
1592847
1593103
1593359
1593615
1593871
1594127
1594383
1594639
1594895
1595151
1595407
1595663
1595919
1596175
1596431
1596687
1596943
1597199
1589264
1589520
1589776
1590032
1590288
1590544
1590800
1591056
1591312
1591568
1591824
1592080
1592336
1592592
1592848
1593104
1593360
1593616
1593872
1594128
1594384
1594640
1594896
1595152
1595408
1595664
1595920
1596176
1596432
1596688
1596944
1597200
1589265
1589521
1589777
1590033
1590289
1590545
1590801
1591057
1591313
1591569
1591825
1592081
1592337
1592593
1592849
1593105
1593361
1593617
1593873
1594129
1594385
1594641
1594897
1595153
1595409
1595665
1595921
1596177
1596433
1596689
1596945
1597201
1589266
1589522
1589778
1590034
1590290
1590546
1590802
1591058
1591314
1591570
1591826
1592082
1592338
1592594
1592850
1593106
1593362
1593618
1593874
1594130
1594386
1594642
1594898
1595154
1595410
1595666
1595922
1596178
1596434
1596690
1596946
1597202
1589267
1589523
1589779
1590035
1590291
1590547
1590803
1591059
1591315
1591571
1591827
1592083
1592339
1592595
1592851
1593107
1593363
1593619
1593875
1594131
1594387
1594643
1594899
1595155
1595411
1595667
1595923
1596179
1596435
1596691
1596947
1597203
1589268
1589524
1589780
1590036
1590292
1590548
1590804
1591060
1591316
1591572
1591828
1592084
1592340
1592596
1592852
1593108
1593364
1593620
1593876
1594132
1594388
1594644
1594900
1595156
1595412
1595668
1595924
1596180
1596436
1596692
1596948
1597204
1589269
1589525
1589781
1590037
1590293
1590549
1590805
1591061
1591317
1591573
1591829
1592085
1592341
1592597
1592853
1593109
1593365
1593621
1593877
1594133
1594389
1594645
1594901
1595157
1595413
1595669
1595925
1596181
1596437
1596693
1596949
1597205
1589270
1589526
1589782
1590038
1590294
1590550
1590806
1591062
1591318
1591574
1591830
1592086
1592342
1592598
1592854
1593110
1593366
1593622
1593878
1594134
1594390
1594646
1594902
1595158
1595414
1595670
1595926
1596182
1596438
1596694
1596950
1597206
1589271
1589527
1589783
1590039
1590295
1590551
1590807
1591063
1591319
1591575
1591831
1592087
1592343
1592599
1592855
1593111
1593367
1593623
1593879
1594135
1594391
1594647
1594903
1595159
1595415
1595671
1595927
1596183
1596439
1596695
1596951
1597207
1589272
1589528
1589784
1590040
1590296
1590552
1590808
1591064
1591320
1591576
1591832
1592088
1592344
1592600
1592856
1593112
1593368
1593624
1593880
1594136
1594392
1594648
1594904
1595160
1595416
1595672
1595928
1596184
1596440
1596696
1596952
1597208
1589273
1589529
1589785
1590041
1590297
1590553
1590809
1591065
1591321
1591577
1591833
1592089
1592345
1592601
1592857
1593113
1593369
1593625
1593881
1594137
1594393
1594649
1594905
1595161
1595417
1595673
1595929
1596185
1596441
1596697
1596953
1597209
1589274
1589530
1589786
1590042
1590298
1590554
1590810
1591066
1591322
1591578
1591834
1592090
1592346
1592602
1592858
1593114
1593370
1593626
1593882
1594138
1594394
1594650
1594906
1595162
1595418
1595674
1595930
1596186
1596442
1596698
1596954
1597210
1589275
1589531
1589787
1590043
1590299
1590555
1590811
1591067
1591323
1591579
1591835
1592091
1592347
1592603
1592859
1593115
1593371
1593627
1593883
1594139
1594395
1594651
1594907
1595163
1595419
1595675
1595931
1596187
1596443
1596699
1596955
1597211
1589276
1589532
1589788
1590044
1590300
1590556
1590812
1591068
1591324
1591580
1591836
1592092
1592348
1592604
1592860
1593116
1593372
1593628
1593884
1594140
1594396
1594652
1594908
1595164
1595420
1595676
1595932
1596188
1596444
1596700
1596956
1597212
1589277
1589533
1589789
1590045
1590301
1590557
1590813
1591069
1591325
1591581
1591837
1592093
1592349
1592605
1592861
1593117
1593373
1593629
1593885
1594141
1594397
1594653
1594909
1595165
1595421
1595677
1595933
1596189
1596445
1596701
1596957
1597213
1589278
1589534
1589790
1590046
1590302
1590558
1590814
1591070
1591326
1591582
1591838
1592094
1592350
1592606
1592862
1593118
1593374
1593630
1593886
1594142
1594398
1594654
1594910
1595166
1595422
1595678
1595934
1596190
1596446
1596702
1596958
1597214
1589279
1589535
1589791
1590047
1590303
1590559
1590815
1591071
1591327
1591583
1591839
1592095
1592351
1592607
1592863
1593119
1593375
1593631
1593887
1594143
1594399
1594655
1594911
1595167
1595423
1595679
1595935
1596191
1596447
1596703
1596959
1597215
1589280
1589536
1589792
1590048
1590304
1590560
1590816
1591072
1591328
1591584
1591840
1592096
1592352
1592608
1592864
1593120
1593376
1593632
1593888
1594144
1594400
1594656
1594912
1595168
1595424
1595680
1595936
1596192
1596448
1596704
1596960
1597216
1589281
1589537
1589793
1590049
1590305
1590561
1590817
1591073
1591329
1591585
1591841
1592097
1592353
1592609
1592865
1593121
1593377
1593633
1593889
1594145
1594401
1594657
1594913
1595169
1595425
1595681
1595937
1596193
1596449
1596705
1596961
1597217
1589282
1589538
1589794
1590050
1590306
1590562
1590818
1591074
1591330
1591586
1591842
1592098
1592354
1592610
1592866
1593122
1593378
1593634
1593890
1594146
1594402
1594658
1594914
1595170
1595426
1595682
1595938
1596194
1596450
1596706
1596962
1597218
1589283
1589539
1589795
1590051
1590307
1590563
1590819
1591075
1591331
1591587
1591843
1592099
1592355
1592611
1592867
1593123
1593379
1593635
1593891
1594147
1594403
1594659
1594915
1595171
1595427
1595683
1595939
1596195
1596451
1596707
1596963
1597219
1589284
1589540
1589796
1590052
1590308
1590564
1590820
1591076
1591332
1591588
1591844
1592100
1592356
1592612
1592868
1593124
1593380
1593636
1593892
1594148
1594404
1594660
1594916
1595172
1595428
1595684
1595940
1596196
1596452
1596708
1596964
1597220
1589285
1589541
1589797
1590053
1590309
1590565
1590821
1591077
1591333
1591589
1591845
1592101
1592357
1592613
1592869
1593125
1593381
1593637
1593893
1594149
1594405
1594661
1594917
1595173
1595429
1595685
1595941
1596197
1596453
1596709
1596965
1597221
1589286
1589542
1589798
1590054
1590310
1590566
1590822
1591078
1591334
1591590
1591846
1592102
1592358
1592614
1592870
1593126
1593382
1593638
1593894
1594150
1594406
1594662
1594918
1595174
1595430
1595686
1595942
1596198
1596454
1596710
1596966
1597222
1589287
1589543
1589799
1590055
1590311
1590567
1590823
1591079
1591335
1591591
1591847
1592103
1592359
1592615
1592871
1593127
1593383
1593639
1593895
1594151
1594407
1594663
1594919
1595175
1595431
1595687
1595943
1596199
1596455
1596711
1596967
1597223
1589288
1589544
1589800
1590056
1590312
1590568
1590824
1591080
1591336
1591592
1591848
1592104
1592360
1592616
1592872
1593128
1593384
1593640
1593896
1594152
1594408
1594664
1594920
1595176
1595432
1595688
1595944
1596200
1596456
1596712
1596968
1597224
1589289
1589545
1589801
1590057
1590313
1590569
1590825
1591081
1591337
1591593
1591849
1592105
1592361
1592617
1592873
1593129
1593385
1593641
1593897
1594153
1594409
1594665
1594921
1595177
1595433
1595689
1595945
1596201
1596457
1596713
1596969
1597225
1589290
1589546
1589802
1590058
1590314
1590570
1590826
1591082
1591338
1591594
1591850
1592106
1592362
1592618
1592874
1593130
1593386
1593642
1593898
1594154
1594410
1594666
1594922
1595178
1595434
1595690
1595946
1596202
1596458
1596714
1596970
1597226
1589291
1589547
1589803
1590059
1590315
1590571
1590827
1591083
1591339
1591595
1591851
1592107
1592363
1592619
1592875
1593131
1593387
1593643
1593899
1594155
1594411
1594667
1594923
1595179
1595435
1595691
1595947
1596203
1596459
1596715
1596971
1597227
1589292
1589548
1589804
1590060
1590316
1590572
1590828
1591084
1591340
1591596
1591852
1592108
1592364
1592620
1592876
1593132
1593388
1593644
1593900
1594156
1594412
1594668
1594924
1595180
1595436
1595692
1595948
1596204
1596460
1596716
1596972
1597228
1589293
1589549
1589805
1590061
1590317
1590573
1590829
1591085
1591341
1591597
1591853
1592109
1592365
1592621
1592877
1593133
1593389
1593645
1593901
1594157
1594413
1594669
1594925
1595181
1595437
1595693
1595949
1596205
1596461
1596717
1596973
1597229
1589294
1589550
1589806
1590062
1590318
1590574
1590830
1591086
1591342
1591598
1591854
1592110
1592366
1592622
1592878
1593134
1593390
1593646
1593902
1594158
1594414
1594670
1594926
1595182
1595438
1595694
1595950
1596206
1596462
1596718
1596974
1597230
1589295
1589551
1589807
1590063
1590319
1590575
1590831
1591087
1591343
1591599
1591855
1592111
1592367
1592623
1592879
1593135
1593391
1593647
1593903
1594159
1594415
1594671
1594927
1595183
1595439
1595695
1595951
1596207
1596463
1596719
1596975
1597231
1589296
1589552
1589808
1590064
1590320
1590576
1590832
1591088
1591344
1591600
1591856
1592112
1592368
1592624
1592880
1593136
1593392
1593648
1593904
1594160
1594416
1594672
1594928
1595184
1595440
1595696
1595952
1596208
1596464
1596720
1596976
1597232
1589297
1589553
1589809
1590065
1590321
1590577
1590833
1591089
1591345
1591601
1591857
1592113
1592369
1592625
1592881
1593137
1593393
1593649
1593905
1594161
1594417
1594673
1594929
1595185
1595441
1595697
1595953
1596209
1596465
1596721
1596977
1597233
1589298
1589554
1589810
1590066
1590322
1590578
1590834
1591090
1591346
1591602
1591858
1592114
1592370
1592626
1592882
1593138
1593394
1593650
1593906
1594162
1594418
1594674
1594930
1595186
1595442
1595698
1595954
1596210
1596466
1596722
1596978
1597234
1589299
1589555
1589811
1590067
1590323
1590579
1590835
1591091
1591347
1591603
1591859
1592115
1592371
1592627
1592883
1593139
1593395
1593651
1593907
1594163
1594419
1594675
1594931
1595187
1595443
1595699
1595955
1596211
1596467
1596723
1596979
1597235
1589300
1589556
1589812
1590068
1590324
1590580
1590836
1591092
1591348
1591604
1591860
1592116
1592372
1592628
1592884
1593140
1593396
1593652
1593908
1594164
1594420
1594676
1594932
1595188
1595444
1595700
1595956
1596212
1596468
1596724
1596980
1597236
1589301
1589557
1589813
1590069
1590325
1590581
1590837
1591093
1591349
1591605
1591861
1592117
1592373
1592629
1592885
1593141
1593397
1593653
1593909
1594165
1594421
1594677
1594933
1595189
1595445
1595701
1595957
1596213
1596469
1596725
1596981
1597237
1589302
1589558
1589814
1590070
1590326
1590582
1590838
1591094
1591350
1591606
1591862
1592118
1592374
1592630
1592886
1593142
1593398
1593654
1593910
1594166
1594422
1594678
1594934
1595190
1595446
1595702
1595958
1596214
1596470
1596726
1596982
1597238
1589303
1589559
1589815
1590071
1590327
1590583
1590839
1591095
1591351
1591607
1591863
1592119
1592375
1592631
1592887
1593143
1593399
1593655
1593911
1594167
1594423
1594679
1594935
1595191
1595447
1595703
1595959
1596215
1596471
1596727
1596983
1597239
1589304
1589560
1589816
1590072
1590328
1590584
1590840
1591096
1591352
1591608
1591864
1592120
1592376
1592632
1592888
1593144
1593400
1593656
1593912
1594168
1594424
1594680
1594936
1595192
1595448
1595704
1595960
1596216
1596472
1596728
1596984
1597240
1589305
1589561
1589817
1590073
1590329
1590585
1590841
1591097
1591353
1591609
1591865
1592121
1592377
1592633
1592889
1593145
1593401
1593657
1593913
1594169
1594425
1594681
1594937
1595193
1595449
1595705
1595961
1596217
1596473
1596729
1596985
1597241
1589306
1589562
1589818
1590074
1590330
1590586
1590842
1591098
1591354
1591610
1591866
1592122
1592378
1592634
1592890
1593146
1593402
1593658
1593914
1594170
1594426
1594682
1594938
1595194
1595450
1595706
1595962
1596218
1596474
1596730
1596986
1597242
1589307
1589563
1589819
1590075
1590331
1590587
1590843
1591099
1591355
1591611
1591867
1592123
1592379
1592635
1592891
1593147
1593403
1593659
1593915
1594171
1594427
1594683
1594939
1595195
1595451
1595707
1595963
1596219
1596475
1596731
1596987
1597243
1589308
1589564
1589820
1590076
1590332
1590588
1590844
1591100
1591356
1591612
1591868
1592124
1592380
1592636
1592892
1593148
1593404
1593660
1593916
1594172
1594428
1594684
1594940
1595196
1595452
1595708
1595964
1596220
1596476
1596732
1596988
1597244
1589309
1589565
1589821
1590077
1590333
1590589
1590845
1591101
1591357
1591613
1591869
1592125
1592381
1592637
1592893
1593149
1593405
1593661
1593917
1594173
1594429
1594685
1594941
1595197
1595453
1595709
1595965
1596221
1596477
1596733
1596989
1597245
1589310
1589566
1589822
1590078
1590334
1590590
1590846
1591102
1591358
1591614
1591870
1592126
1592382
1592638
1592894
1593150
1593406
1593662
1593918
1594174
1594430
1594686
1594942
1595198
1595454
1595710
1595966
1596222
1596478
1596734
1596990
1597246
1589311
1589567
1589823
1590079
1590335
1590591
1590847
1591103
1591359
1591615
1591871
1592127
1592383
1592639
1592895
1593151
1593407
1593663
1593919
1594175
1594431
1594687
1594943
1595199
1595455
1595711
1595967
1596223
1596479
1596735
1596991
1597247
1589312
1589568
1589824
1590080
1590336
1590592
1590848
1591104
1591360
1591616
1591872
1592128
1592384
1592640
1592896
1593152
1593408
1593664
1593920
1594176
1594432
1594688
1594944
1595200
1595456
1595712
1595968
1596224
1596480
1596736
1596992
1597248
1589313
1589569
1589825
1590081
1590337
1590593
1590849
1591105
1591361
1591617
1591873
1592129
1592385
1592641
1592897
1593153
1593409
1593665
1593921
1594177
1594433
1594689
1594945
1595201
1595457
1595713
1595969
1596225
1596481
1596737
1596993
1597249
1589314
1589570
1589826
1590082
1590338
1590594
1590850
1591106
1591362
1591618
1591874
1592130
1592386
1592642
1592898
1593154
1593410
1593666
1593922
1594178
1594434
1594690
1594946
1595202
1595458
1595714
1595970
1596226
1596482
1596738
1596994
1597250
1589315
1589571
1589827
1590083
1590339
1590595
1590851
1591107
1591363
1591619
1591875
1592131
1592387
1592643
1592899
1593155
1593411
1593667
1593923
1594179
1594435
1594691
1594947
1595203
1595459
1595715
1595971
1596227
1596483
1596739
1596995
1597251
1589316
1589572
1589828
1590084
1590340
1590596
1590852
1591108
1591364
1591620
1591876
1592132
1592388
1592644
1592900
1593156
1593412
1593668
1593924
1594180
1594436
1594692
1594948
1595204
1595460
1595716
1595972
1596228
1596484
1596740
1596996
1597252
1589317
1589573
1589829
1590085
1590341
1590597
1590853
1591109
1591365
1591621
1591877
1592133
1592389
1592645
1592901
1593157
1593413
1593669
1593925
1594181
1594437
1594693
1594949
1595205
1595461
1595717
1595973
1596229
1596485
1596741
1596997
1597253
1589318
1589574
1589830
1590086
1590342
1590598
1590854
1591110
1591366
1591622
1591878
1592134
1592390
1592646
1592902
1593158
1593414
1593670
1593926
1594182
1594438
1594694
1594950
1595206
1595462
1595718
1595974
1596230
1596486
1596742
1596998
1597254
1589319
1589575
1589831
1590087
1590343
1590599
1590855
1591111
1591367
1591623
1591879
1592135
1592391
1592647
1592903
1593159
1593415
1593671
1593927
1594183
1594439
1594695
1594951
1595207
1595463
1595719
1595975
1596231
1596487
1596743
1596999
1597255
1589320
1589576
1589832
1590088
1590344
1590600
1590856
1591112
1591368
1591624
1591880
1592136
1592392
1592648
1592904
1593160
1593416
1593672
1593928
1594184
1594440
1594696
1594952
1595208
1595464
1595720
1595976
1596232
1596488
1596744
1597000
1597256
1589321
1589577
1589833
1590089
1590345
1590601
1590857
1591113
1591369
1591625
1591881
1592137
1592393
1592649
1592905
1593161
1593417
1593673
1593929
1594185
1594441
1594697
1594953
1595209
1595465
1595721
1595977
1596233
1596489
1596745
1597001
1597257
1589322
1589578
1589834
1590090
1590346
1590602
1590858
1591114
1591370
1591626
1591882
1592138
1592394
1592650
1592906
1593162
1593418
1593674
1593930
1594186
1594442
1594698
1594954
1595210
1595466
1595722
1595978
1596234
1596490
1596746
1597002
1597258
1589323
1589579
1589835
1590091
1590347
1590603
1590859
1591115
1591371
1591627
1591883
1592139
1592395
1592651
1592907
1593163
1593419
1593675
1593931
1594187
1594443
1594699
1594955
1595211
1595467
1595723
1595979
1596235
1596491
1596747
1597003
1597259
1589324
1589580
1589836
1590092
1590348
1590604
1590860
1591116
1591372
1591628
1591884
1592140
1592396
1592652
1592908
1593164
1593420
1593676
1593932
1594188
1594444
1594700
1594956
1595212
1595468
1595724
1595980
1596236
1596492
1596748
1597004
1597260
1589325
1589581
1589837
1590093
1590349
1590605
1590861
1591117
1591373
1591629
1591885
1592141
1592397
1592653
1592909
1593165
1593421
1593677
1593933
1594189
1594445
1594701
1594957
1595213
1595469
1595725
1595981
1596237
1596493
1596749
1597005
1597261
1589326
1589582
1589838
1590094
1590350
1590606
1590862
1591118
1591374
1591630
1591886
1592142
1592398
1592654
1592910
1593166
1593422
1593678
1593934
1594190
1594446
1594702
1594958
1595214
1595470
1595726
1595982
1596238
1596494
1596750
1597006
1597262
1589327
1589583
1589839
1590095
1590351
1590607
1590863
1591119
1591375
1591631
1591887
1592143
1592399
1592655
1592911
1593167
1593423
1593679
1593935
1594191
1594447
1594703
1594959
1595215
1595471
1595727
1595983
1596239
1596495
1596751
1597007
1597263
1589328
1589584
1589840
1590096
1590352
1590608
1590864
1591120
1591376
1591632
1591888
1592144
1592400
1592656
1592912
1593168
1593424
1593680
1593936
1594192
1594448
1594704
1594960
1595216
1595472
1595728
1595984
1596240
1596496
1596752
1597008
1597264
1589329
1589585
1589841
1590097
1590353
1590609
1590865
1591121
1591377
1591633
1591889
1592145
1592401
1592657
1592913
1593169
1593425
1593681
1593937
1594193
1594449
1594705
1594961
1595217
1595473
1595729
1595985
1596241
1596497
1596753
1597009
1597265
1589330
1589586
1589842
1590098
1590354
1590610
1590866
1591122
1591378
1591634
1591890
1592146
1592402
1592658
1592914
1593170
1593426
1593682
1593938
1594194
1594450
1594706
1594962
1595218
1595474
1595730
1595986
1596242
1596498
1596754
1597010
1597266
1589331
1589587
1589843
1590099
1590355
1590611
1590867
1591123
1591379
1591635
1591891
1592147
1592403
1592659
1592915
1593171
1593427
1593683
1593939
1594195
1594451
1594707
1594963
1595219
1595475
1595731
1595987
1596243
1596499
1596755
1597011
1597267
1589332
1589588
1589844
1590100
1590356
1590612
1590868
1591124
1591380
1591636
1591892
1592148
1592404
1592660
1592916
1593172
1593428
1593684
1593940
1594196
1594452
1594708
1594964
1595220
1595476
1595732
1595988
1596244
1596500
1596756
1597012
1597268
1589333
1589589
1589845
1590101
1590357
1590613
1590869
1591125
1591381
1591637
1591893
1592149
1592405
1592661
1592917
1593173
1593429
1593685
1593941
1594197
1594453
1594709
1594965
1595221
1595477
1595733
1595989
1596245
1596501
1596757
1597013
1597269
1589334
1589590
1589846
1590102
1590358
1590614
1590870
1591126
1591382
1591638
1591894
1592150
1592406
1592662
1592918
1593174
1593430
1593686
1593942
1594198
1594454
1594710
1594966
1595222
1595478
1595734
1595990
1596246
1596502
1596758
1597014
1597270
1589335
1589591
1589847
1590103
1590359
1590615
1590871
1591127
1591383
1591639
1591895
1592151
1592407
1592663
1592919
1593175
1593431
1593687
1593943
1594199
1594455
1594711
1594967
1595223
1595479
1595735
1595991
1596247
1596503
1596759
1597015
1597271
1589336
1589592
1589848
1590104
1590360
1590616
1590872
1591128
1591384
1591640
1591896
1592152
1592408
1592664
1592920
1593176
1593432
1593688
1593944
1594200
1594456
1594712
1594968
1595224
1595480
1595736
1595992
1596248
1596504
1596760
1597016
1597272
1589337
1589593
1589849
1590105
1590361
1590617
1590873
1591129
1591385
1591641
1591897
1592153
1592409
1592665
1592921
1593177
1593433
1593689
1593945
1594201
1594457
1594713
1594969
1595225
1595481
1595737
1595993
1596249
1596505
1596761
1597017
1597273
1589338
1589594
1589850
1590106
1590362
1590618
1590874
1591130
1591386
1591642
1591898
1592154
1592410
1592666
1592922
1593178
1593434
1593690
1593946
1594202
1594458
1594714
1594970
1595226
1595482
1595738
1595994
1596250
1596506
1596762
1597018
1597274
1589339
1589595
1589851
1590107
1590363
1590619
1590875
1591131
1591387
1591643
1591899
1592155
1592411
1592667
1592923
1593179
1593435
1593691
1593947
1594203
1594459
1594715
1594971
1595227
1595483
1595739
1595995
1596251
1596507
1596763
1597019
1597275
1589340
1589596
1589852
1590108
1590364
1590620
1590876
1591132
1591388
1591644
1591900
1592156
1592412
1592668
1592924
1593180
1593436
1593692
1593948
1594204
1594460
1594716
1594972
1595228
1595484
1595740
1595996
1596252
1596508
1596764
1597020
1597276
1589341
1589597
1589853
1590109
1590365
1590621
1590877
1591133
1591389
1591645
1591901
1592157
1592413
1592669
1592925
1593181
1593437
1593693
1593949
1594205
1594461
1594717
1594973
1595229
1595485
1595741
1595997
1596253
1596509
1596765
1597021
1597277
1589342
1589598
1589854
1590110
1590366
1590622
1590878
1591134
1591390
1591646
1591902
1592158
1592414
1592670
1592926
1593182
1593438
1593694
1593950
1594206
1594462
1594718
1594974
1595230
1595486
1595742
1595998
1596254
1596510
1596766
1597022
1597278
1589343
1589599
1589855
1590111
1590367
1590623
1590879
1591135
1591391
1591647
1591903
1592159
1592415
1592671
1592927
1593183
1593439
1593695
1593951
1594207
1594463
1594719
1594975
1595231
1595487
1595743
1595999
1596255
1596511
1596767
1597023
1597279
1916928
1917184
1917440
1917696
1917952
1918208
1918464
1918720
1918976
1919232
1919488
1919744
1920000
1920256
1920512
1920768
1921024
1921280
1921536
1921792
1922048
1922304
1922560
1922816
1923072
1923328
1923584
1923840
1924096
1924352
1924608
1924864
1916929
1917185
1917441
1917697
1917953
1918209
1918465
1918721
1918977
1919233
1919489
1919745
1920001
1920257
1920513
1920769
1921025
1921281
1921537
1921793
1922049
1922305
1922561
1922817
1923073
1923329
1923585
1923841
1924097
1924353
1924609
1924865
1916930
1917186
1917442
1917698
1917954
1918210
1918466
1918722
1918978
1919234
1919490
1919746
1920002
1920258
1920514
1920770
1921026
1921282
1921538
1921794
1922050
1922306
1922562
1922818
1923074
1923330
1923586
1923842
1924098
1924354
1924610
1924866
1916931
1917187
1917443
1917699
1917955
1918211
1918467
1918723
1918979
1919235
1919491
1919747
1920003
1920259
1920515
1920771
1921027
1921283
1921539
1921795
1922051
1922307
1922563
1922819
1923075
1923331
1923587
1923843
1924099
1924355
1924611
1924867
1916932
1917188
1917444
1917700
1917956
1918212
1918468
1918724
1918980
1919236
1919492
1919748
1920004
1920260
1920516
1920772
1921028
1921284
1921540
1921796
1922052
1922308
1922564
1922820
1923076
1923332
1923588
1923844
1924100
1924356
1924612
1924868
1916933
1917189
1917445
1917701
1917957
1918213
1918469
1918725
1918981
1919237
1919493
1919749
1920005
1920261
1920517
1920773
1921029
1921285
1921541
1921797
1922053
1922309
1922565
1922821
1923077
1923333
1923589
1923845
1924101
1924357
1924613
1924869
1916934
1917190
1917446
1917702
1917958
1918214
1918470
1918726
1918982
1919238
1919494
1919750
1920006
1920262
1920518
1920774
1921030
1921286
1921542
1921798
1922054
1922310
1922566
1922822
1923078
1923334
1923590
1923846
1924102
1924358
1924614
1924870
1916935
1917191
1917447
1917703
1917959
1918215
1918471
1918727
1918983
1919239
1919495
1919751
1920007
1920263
1920519
1920775
1921031
1921287
1921543
1921799
1922055
1922311
1922567
1922823
1923079
1923335
1923591
1923847
1924103
1924359
1924615
1924871
1916936
1917192
1917448
1917704
1917960
1918216
1918472
1918728
1918984
1919240
1919496
1919752
1920008
1920264
1920520
1920776
1921032
1921288
1921544
1921800
1922056
1922312
1922568
1922824
1923080
1923336
1923592
1923848
1924104
1924360
1924616
1924872
1916937
1917193
1917449
1917705
1917961
1918217
1918473
1918729
1918985
1919241
1919497
1919753
1920009
1920265
1920521
1920777
1921033
1921289
1921545
1921801
1922057
1922313
1922569
1922825
1923081
1923337
1923593
1923849
1924105
1924361
1924617
1924873
1916938
1917194
1917450
1917706
1917962
1918218
1918474
1918730
1918986
1919242
1919498
1919754
1920010
1920266
1920522
1920778
1921034
1921290
1921546
1921802
1922058
1922314
1922570
1922826
1923082
1923338
1923594
1923850
1924106
1924362
1924618
1924874
1916939
1917195
1917451
1917707
1917963
1918219
1918475
1918731
1918987
1919243
1919499
1919755
1920011
1920267
1920523
1920779
1921035
1921291
1921547
1921803
1922059
1922315
1922571
1922827
1923083
1923339
1923595
1923851
1924107
1924363
1924619
1924875
1916940
1917196
1917452
1917708
1917964
1918220
1918476
1918732
1918988
1919244
1919500
1919756
1920012
1920268
1920524
1920780
1921036
1921292
1921548
1921804
1922060
1922316
1922572
1922828
1923084
1923340
1923596
1923852
1924108
1924364
1924620
1924876
1916941
1917197
1917453
1917709
1917965
1918221
1918477
1918733
1918989
1919245
1919501
1919757
1920013
1920269
1920525
1920781
1921037
1921293
1921549
1921805
1922061
1922317
1922573
1922829
1923085
1923341
1923597
1923853
1924109
1924365
1924621
1924877
1916942
1917198
1917454
1917710
1917966
1918222
1918478
1918734
1918990
1919246
1919502
1919758
1920014
1920270
1920526
1920782
1921038
1921294
1921550
1921806
1922062
1922318
1922574
1922830
1923086
1923342
1923598
1923854
1924110
1924366
1924622
1924878
1916943
1917199
1917455
1917711
1917967
1918223
1918479
1918735
1918991
1919247
1919503
1919759
1920015
1920271
1920527
1920783
1921039
1921295
1921551
1921807
1922063
1922319
1922575
1922831
1923087
1923343
1923599
1923855
1924111
1924367
1924623
1924879
1916944
1917200
1917456
1917712
1917968
1918224
1918480
1918736
1918992
1919248
1919504
1919760
1920016
1920272
1920528
1920784
1921040
1921296
1921552
1921808
1922064
1922320
1922576
1922832
1923088
1923344
1923600
1923856
1924112
1924368
1924624
1924880
1916945
1917201
1917457
1917713
1917969
1918225
1918481
1918737
1918993
1919249
1919505
1919761
1920017
1920273
1920529
1920785
1921041
1921297
1921553
1921809
1922065
1922321
1922577
1922833
1923089
1923345
1923601
1923857
1924113
1924369
1924625
1924881
1916946
1917202
1917458
1917714
1917970
1918226
1918482
1918738
1918994
1919250
1919506
1919762
1920018
1920274
1920530
1920786
1921042
1921298
1921554
1921810
1922066
1922322
1922578
1922834
1923090
1923346
1923602
1923858
1924114
1924370
1924626
1924882
1916947
1917203
1917459
1917715
1917971
1918227
1918483
1918739
1918995
1919251
1919507
1919763
1920019
1920275
1920531
1920787
1921043
1921299
1921555
1921811
1922067
1922323
1922579
1922835
1923091
1923347
1923603
1923859
1924115
1924371
1924627
1924883
1916948
1917204
1917460
1917716
1917972
1918228
1918484
1918740
1918996
1919252
1919508
1919764
1920020
1920276
1920532
1920788
1921044
1921300
1921556
1921812
1922068
1922324
1922580
1922836
1923092
1923348
1923604
1923860
1924116
1924372
1924628
1924884
1916949
1917205
1917461
1917717
1917973
1918229
1918485
1918741
1918997
1919253
1919509
1919765
1920021
1920277
1920533
1920789
1921045
1921301
1921557
1921813
1922069
1922325
1922581
1922837
1923093
1923349
1923605
1923861
1924117
1924373
1924629
1924885
1916950
1917206
1917462
1917718
1917974
1918230
1918486
1918742
1918998
1919254
1919510
1919766
1920022
1920278
1920534
1920790
1921046
1921302
1921558
1921814
1922070
1922326
1922582
1922838
1923094
1923350
1923606
1923862
1924118
1924374
1924630
1924886
1916951
1917207
1917463
1917719
1917975
1918231
1918487
1918743
1918999
1919255
1919511
1919767
1920023
1920279
1920535
1920791
1921047
1921303
1921559
1921815
1922071
1922327
1922583
1922839
1923095
1923351
1923607
1923863
1924119
1924375
1924631
1924887
1916952
1917208
1917464
1917720
1917976
1918232
1918488
1918744
1919000
1919256
1919512
1919768
1920024
1920280
1920536
1920792
1921048
1921304
1921560
1921816
1922072
1922328
1922584
1922840
1923096
1923352
1923608
1923864
1924120
1924376
1924632
1924888
1916953
1917209
1917465
1917721
1917977
1918233
1918489
1918745
1919001
1919257
1919513
1919769
1920025
1920281
1920537
1920793
1921049
1921305
1921561
1921817
1922073
1922329
1922585
1922841
1923097
1923353
1923609
1923865
1924121
1924377
1924633
1924889
1916954
1917210
1917466
1917722
1917978
1918234
1918490
1918746
1919002
1919258
1919514
1919770
1920026
1920282
1920538
1920794
1921050
1921306
1921562
1921818
1922074
1922330
1922586
1922842
1923098
1923354
1923610
1923866
1924122
1924378
1924634
1924890
1916955
1917211
1917467
1917723
1917979
1918235
1918491
1918747
1919003
1919259
1919515
1919771
1920027
1920283
1920539
1920795
1921051
1921307
1921563
1921819
1922075
1922331
1922587
1922843
1923099
1923355
1923611
1923867
1924123
1924379
1924635
1924891
1916956
1917212
1917468
1917724
1917980
1918236
1918492
1918748
1919004
1919260
1919516
1919772
1920028
1920284
1920540
1920796
1921052
1921308
1921564
1921820
1922076
1922332
1922588
1922844
1923100
1923356
1923612
1923868
1924124
1924380
1924636
1924892
1916957
1917213
1917469
1917725
1917981
1918237
1918493
1918749
1919005
1919261
1919517
1919773
1920029
1920285
1920541
1920797
1921053
1921309
1921565
1921821
1922077
1922333
1922589
1922845
1923101
1923357
1923613
1923869
1924125
1924381
1924637
1924893
1916958
1917214
1917470
1917726
1917982
1918238
1918494
1918750
1919006
1919262
1919518
1919774
1920030
1920286
1920542
1920798
1921054
1921310
1921566
1921822
1922078
1922334
1922590
1922846
1923102
1923358
1923614
1923870
1924126
1924382
1924638
1924894
1916959
1917215
1917471
1917727
1917983
1918239
1918495
1918751
1919007
1919263
1919519
1919775
1920031
1920287
1920543
1920799
1921055
1921311
1921567
1921823
1922079
1922335
1922591
1922847
1923103
1923359
1923615
1923871
1924127
1924383
1924639
1924895
1916960
1917216
1917472
1917728
1917984
1918240
1918496
1918752
1919008
1919264
1919520
1919776
1920032
1920288
1920544
1920800
1921056
1921312
1921568
1921824
1922080
1922336
1922592
1922848
1923104
1923360
1923616
1923872
1924128
1924384
1924640
1924896
1916961
1917217
1917473
1917729
1917985
1918241
1918497
1918753
1919009
1919265
1919521
1919777
1920033
1920289
1920545
1920801
1921057
1921313
1921569
1921825
1922081
1922337
1922593
1922849
1923105
1923361
1923617
1923873
1924129
1924385
1924641
1924897
1916962
1917218
1917474
1917730
1917986
1918242
1918498
1918754
1919010
1919266
1919522
1919778
1920034
1920290
1920546
1920802
1921058
1921314
1921570
1921826
1922082
1922338
1922594
1922850
1923106
1923362
1923618
1923874
1924130
1924386
1924642
1924898
1916963
1917219
1917475
1917731
1917987
1918243
1918499
1918755
1919011
1919267
1919523
1919779
1920035
1920291
1920547
1920803
1921059
1921315
1921571
1921827
1922083
1922339
1922595
1922851
1923107
1923363
1923619
1923875
1924131
1924387
1924643
1924899
1916964
1917220
1917476
1917732
1917988
1918244
1918500
1918756
1919012
1919268
1919524
1919780
1920036
1920292
1920548
1920804
1921060
1921316
1921572
1921828
1922084
1922340
1922596
1922852
1923108
1923364
1923620
1923876
1924132
1924388
1924644
1924900
1916965
1917221
1917477
1917733
1917989
1918245
1918501
1918757
1919013
1919269
1919525
1919781
1920037
1920293
1920549
1920805
1921061
1921317
1921573
1921829
1922085
1922341
1922597
1922853
1923109
1923365
1923621
1923877
1924133
1924389
1924645
1924901
1916966
1917222
1917478
1917734
1917990
1918246
1918502
1918758
1919014
1919270
1919526
1919782
1920038
1920294
1920550
1920806
1921062
1921318
1921574
1921830
1922086
1922342
1922598
1922854
1923110
1923366
1923622
1923878
1924134
1924390
1924646
1924902
1916967
1917223
1917479
1917735
1917991
1918247
1918503
1918759
1919015
1919271
1919527
1919783
1920039
1920295
1920551
1920807
1921063
1921319
1921575
1921831
1922087
1922343
1922599
1922855
1923111
1923367
1923623
1923879
1924135
1924391
1924647
1924903
1916968
1917224
1917480
1917736
1917992
1918248
1918504
1918760
1919016
1919272
1919528
1919784
1920040
1920296
1920552
1920808
1921064
1921320
1921576
1921832
1922088
1922344
1922600
1922856
1923112
1923368
1923624
1923880
1924136
1924392
1924648
1924904
1916969
1917225
1917481
1917737
1917993
1918249
1918505
1918761
1919017
1919273
1919529
1919785
1920041
1920297
1920553
1920809
1921065
1921321
1921577
1921833
1922089
1922345
1922601
1922857
1923113
1923369
1923625
1923881
1924137
1924393
1924649
1924905
1916970
1917226
1917482
1917738
1917994
1918250
1918506
1918762
1919018
1919274
1919530
1919786
1920042
1920298
1920554
1920810
1921066
1921322
1921578
1921834
1922090
1922346
1922602
1922858
1923114
1923370
1923626
1923882
1924138
1924394
1924650
1924906
1916971
1917227
1917483
1917739
1917995
1918251
1918507
1918763
1919019
1919275
1919531
1919787
1920043
1920299
1920555
1920811
1921067
1921323
1921579
1921835
1922091
1922347
1922603
1922859
1923115
1923371
1923627
1923883
1924139
1924395
1924651
1924907
1916972
1917228
1917484
1917740
1917996
1918252
1918508
1918764
1919020
1919276
1919532
1919788
1920044
1920300
1920556
1920812
1921068
1921324
1921580
1921836
1922092
1922348
1922604
1922860
1923116
1923372
1923628
1923884
1924140
1924396
1924652
1924908
1916973
1917229
1917485
1917741
1917997
1918253
1918509
1918765
1919021
1919277
1919533
1919789
1920045
1920301
1920557
1920813
1921069
1921325
1921581
1921837
1922093
1922349
1922605
1922861
1923117
1923373
1923629
1923885
1924141
1924397
1924653
1924909
1916974
1917230
1917486
1917742
1917998
1918254
1918510
1918766
1919022
1919278
1919534
1919790
1920046
1920302
1920558
1920814
1921070
1921326
1921582
1921838
1922094
1922350
1922606
1922862
1923118
1923374
1923630
1923886
1924142
1924398
1924654
1924910
1916975
1917231
1917487
1917743
1917999
1918255
1918511
1918767
1919023
1919279
1919535
1919791
1920047
1920303
1920559
1920815
1921071
1921327
1921583
1921839
1922095
1922351
1922607
1922863
1923119
1923375
1923631
1923887
1924143
1924399
1924655
1924911
1916976
1917232
1917488
1917744
1918000
1918256
1918512
1918768
1919024
1919280
1919536
1919792
1920048
1920304
1920560
1920816
1921072
1921328
1921584
1921840
1922096
1922352
1922608
1922864
1923120
1923376
1923632
1923888
1924144
1924400
1924656
1924912
1916977
1917233
1917489
1917745
1918001
1918257
1918513
1918769
1919025
1919281
1919537
1919793
1920049
1920305
1920561
1920817
1921073
1921329
1921585
1921841
1922097
1922353
1922609
1922865
1923121
1923377
1923633
1923889
1924145
1924401
1924657
1924913
1916978
1917234
1917490
1917746
1918002
1918258
1918514
1918770
1919026
1919282
1919538
1919794
1920050
1920306
1920562
1920818
1921074
1921330
1921586
1921842
1922098
1922354
1922610
1922866
1923122
1923378
1923634
1923890
1924146
1924402
1924658
1924914
1916979
1917235
1917491
1917747
1918003
1918259
1918515
1918771
1919027
1919283
1919539
1919795
1920051
1920307
1920563
1920819
1921075
1921331
1921587
1921843
1922099
1922355
1922611
1922867
1923123
1923379
1923635
1923891
1924147
1924403
1924659
1924915
1916980
1917236
1917492
1917748
1918004
1918260
1918516
1918772
1919028
1919284
1919540
1919796
1920052
1920308
1920564
1920820
1921076
1921332
1921588
1921844
1922100
1922356
1922612
1922868
1923124
1923380
1923636
1923892
1924148
1924404
1924660
1924916
1916981
1917237
1917493
1917749
1918005
1918261
1918517
1918773
1919029
1919285
1919541
1919797
1920053
1920309
1920565
1920821
1921077
1921333
1921589
1921845
1922101
1922357
1922613
1922869
1923125
1923381
1923637
1923893
1924149
1924405
1924661
1924917
1916982
1917238
1917494
1917750
1918006
1918262
1918518
1918774
1919030
1919286
1919542
1919798
1920054
1920310
1920566
1920822
1921078
1921334
1921590
1921846
1922102
1922358
1922614
1922870
1923126
1923382
1923638
1923894
1924150
1924406
1924662
1924918
1916983
1917239
1917495
1917751
1918007
1918263
1918519
1918775
1919031
1919287
1919543
1919799
1920055
1920311
1920567
1920823
1921079
1921335
1921591
1921847
1922103
1922359
1922615
1922871
1923127
1923383
1923639
1923895
1924151
1924407
1924663
1924919
1916984
1917240
1917496
1917752
1918008
1918264
1918520
1918776
1919032
1919288
1919544
1919800
1920056
1920312
1920568
1920824
1921080
1921336
1921592
1921848
1922104
1922360
1922616
1922872
1923128
1923384
1923640
1923896
1924152
1924408
1924664
1924920
1916985
1917241
1917497
1917753
1918009
1918265
1918521
1918777
1919033
1919289
1919545
1919801
1920057
1920313
1920569
1920825
1921081
1921337
1921593
1921849
1922105
1922361
1922617
1922873
1923129
1923385
1923641
1923897
1924153
1924409
1924665
1924921
1916986
1917242
1917498
1917754
1918010
1918266
1918522
1918778
1919034
1919290
1919546
1919802
1920058
1920314
1920570
1920826
1921082
1921338
1921594
1921850
1922106
1922362
1922618
1922874
1923130
1923386
1923642
1923898
1924154
1924410
1924666
1924922
1916987
1917243
1917499
1917755
1918011
1918267
1918523
1918779
1919035
1919291
1919547
1919803
1920059
1920315
1920571
1920827
1921083
1921339
1921595
1921851
1922107
1922363
1922619
1922875
1923131
1923387
1923643
1923899
1924155
1924411
1924667
1924923
1916988
1917244
1917500
1917756
1918012
1918268
1918524
1918780
1919036
1919292
1919548
1919804
1920060
1920316
1920572
1920828
1921084
1921340
1921596
1921852
1922108
1922364
1922620
1922876
1923132
1923388
1923644
1923900
1924156
1924412
1924668
1924924
1916989
1917245
1917501
1917757
1918013
1918269
1918525
1918781
1919037
1919293
1919549
1919805
1920061
1920317
1920573
1920829
1921085
1921341
1921597
1921853
1922109
1922365
1922621
1922877
1923133
1923389
1923645
1923901
1924157
1924413
1924669
1924925
1916990
1917246
1917502
1917758
1918014
1918270
1918526
1918782
1919038
1919294
1919550
1919806
1920062
1920318
1920574
1920830
1921086
1921342
1921598
1921854
1922110
1922366
1922622
1922878
1923134
1923390
1923646
1923902
1924158
1924414
1924670
1924926
1916991
1917247
1917503
1917759
1918015
1918271
1918527
1918783
1919039
1919295
1919551
1919807
1920063
1920319
1920575
1920831
1921087
1921343
1921599
1921855
1922111
1922367
1922623
1922879
1923135
1923391
1923647
1923903
1924159
1924415
1924671
1924927
1916992
1917248
1917504
1917760
1918016
1918272
1918528
1918784
1919040
1919296
1919552
1919808
1920064
1920320
1920576
1920832
1921088
1921344
1921600
1921856
1922112
1922368
1922624
1922880
1923136
1923392
1923648
1923904
1924160
1924416
1924672
1924928
1916993
1917249
1917505
1917761
1918017
1918273
1918529
1918785
1919041
1919297
1919553
1919809
1920065
1920321
1920577
1920833
1921089
1921345
1921601
1921857
1922113
1922369
1922625
1922881
1923137
1923393
1923649
1923905
1924161
1924417
1924673
1924929
1916994
1917250
1917506
1917762
1918018
1918274
1918530
1918786
1919042
1919298
1919554
1919810
1920066
1920322
1920578
1920834
1921090
1921346
1921602
1921858
1922114
1922370
1922626
1922882
1923138
1923394
1923650
1923906
1924162
1924418
1924674
1924930
1916995
1917251
1917507
1917763
1918019
1918275
1918531
1918787
1919043
1919299
1919555
1919811
1920067
1920323
1920579
1920835
1921091
1921347
1921603
1921859
1922115
1922371
1922627
1922883
1923139
1923395
1923651
1923907
1924163
1924419
1924675
1924931
1916996
1917252
1917508
1917764
1918020
1918276
1918532
1918788
1919044
1919300
1919556
1919812
1920068
1920324
1920580
1920836
1921092
1921348
1921604
1921860
1922116
1922372
1922628
1922884
1923140
1923396
1923652
1923908
1924164
1924420
1924676
1924932
1916997
1917253
1917509
1917765
1918021
1918277
1918533
1918789
1919045
1919301
1919557
1919813
1920069
1920325
1920581
1920837
1921093
1921349
1921605
1921861
1922117
1922373
1922629
1922885
1923141
1923397
1923653
1923909
1924165
1924421
1924677
1924933
1916998
1917254
1917510
1917766
1918022
1918278
1918534
1918790
1919046
1919302
1919558
1919814
1920070
1920326
1920582
1920838
1921094
1921350
1921606
1921862
1922118
1922374
1922630
1922886
1923142
1923398
1923654
1923910
1924166
1924422
1924678
1924934
1916999
1917255
1917511
1917767
1918023
1918279
1918535
1918791
1919047
1919303
1919559
1919815
1920071
1920327
1920583
1920839
1921095
1921351
1921607
1921863
1922119
1922375
1922631
1922887
1923143
1923399
1923655
1923911
1924167
1924423
1924679
1924935
1917000
1917256
1917512
1917768
1918024
1918280
1918536
1918792
1919048
1919304
1919560
1919816
1920072
1920328
1920584
1920840
1921096
1921352
1921608
1921864
1922120
1922376
1922632
1922888
1923144
1923400
1923656
1923912
1924168
1924424
1924680
1924936
1917001
1917257
1917513
1917769
1918025
1918281
1918537
1918793
1919049
1919305
1919561
1919817
1920073
1920329
1920585
1920841
1921097
1921353
1921609
1921865
1922121
1922377
1922633
1922889
1923145
1923401
1923657
1923913
1924169
1924425
1924681
1924937
1917002
1917258
1917514
1917770
1918026
1918282
1918538
1918794
1919050
1919306
1919562
1919818
1920074
1920330
1920586
1920842
1921098
1921354
1921610
1921866
1922122
1922378
1922634
1922890
1923146
1923402
1923658
1923914
1924170
1924426
1924682
1924938
1917003
1917259
1917515
1917771
1918027
1918283
1918539
1918795
1919051
1919307
1919563
1919819
1920075
1920331
1920587
1920843
1921099
1921355
1921611
1921867
1922123
1922379
1922635
1922891
1923147
1923403
1923659
1923915
1924171
1924427
1924683
1924939
1917004
1917260
1917516
1917772
1918028
1918284
1918540
1918796
1919052
1919308
1919564
1919820
1920076
1920332
1920588
1920844
1921100
1921356
1921612
1921868
1922124
1922380
1922636
1922892
1923148
1923404
1923660
1923916
1924172
1924428
1924684
1924940
1917005
1917261
1917517
1917773
1918029
1918285
1918541
1918797
1919053
1919309
1919565
1919821
1920077
1920333
1920589
1920845
1921101
1921357
1921613
1921869
1922125
1922381
1922637
1922893
1923149
1923405
1923661
1923917
1924173
1924429
1924685
1924941
1917006
1917262
1917518
1917774
1918030
1918286
1918542
1918798
1919054
1919310
1919566
1919822
1920078
1920334
1920590
1920846
1921102
1921358
1921614
1921870
1922126
1922382
1922638
1922894
1923150
1923406
1923662
1923918
1924174
1924430
1924686
1924942
1917007
1917263
1917519
1917775
1918031
1918287
1918543
1918799
1919055
1919311
1919567
1919823
1920079
1920335
1920591
1920847
1921103
1921359
1921615
1921871
1922127
1922383
1922639
1922895
1923151
1923407
1923663
1923919
1924175
1924431
1924687
1924943
1917008
1917264
1917520
1917776
1918032
1918288
1918544
1918800
1919056
1919312
1919568
1919824
1920080
1920336
1920592
1920848
1921104
1921360
1921616
1921872
1922128
1922384
1922640
1922896
1923152
1923408
1923664
1923920
1924176
1924432
1924688
1924944
1917009
1917265
1917521
1917777
1918033
1918289
1918545
1918801
1919057
1919313
1919569
1919825
1920081
1920337
1920593
1920849
1921105
1921361
1921617
1921873
1922129
1922385
1922641
1922897
1923153
1923409
1923665
1923921
1924177
1924433
1924689
1924945
1917010
1917266
1917522
1917778
1918034
1918290
1918546
1918802
1919058
1919314
1919570
1919826
1920082
1920338
1920594
1920850
1921106
1921362
1921618
1921874
1922130
1922386
1922642
1922898
1923154
1923410
1923666
1923922
1924178
1924434
1924690
1924946
1917011
1917267
1917523
1917779
1918035
1918291
1918547
1918803
1919059
1919315
1919571
1919827
1920083
1920339
1920595
1920851
1921107
1921363
1921619
1921875
1922131
1922387
1922643
1922899
1923155
1923411
1923667
1923923
1924179
1924435
1924691
1924947
1917012
1917268
1917524
1917780
1918036
1918292
1918548
1918804
1919060
1919316
1919572
1919828
1920084
1920340
1920596
1920852
1921108
1921364
1921620
1921876
1922132
1922388
1922644
1922900
1923156
1923412
1923668
1923924
1924180
1924436
1924692
1924948
1917013
1917269
1917525
1917781
1918037
1918293
1918549
1918805
1919061
1919317
1919573
1919829
1920085
1920341
1920597
1920853
1921109
1921365
1921621
1921877
1922133
1922389
1922645
1922901
1923157
1923413
1923669
1923925
1924181
1924437
1924693
1924949
1917014
1917270
1917526
1917782
1918038
1918294
1918550
1918806
1919062
1919318
1919574
1919830
1920086
1920342
1920598
1920854
1921110
1921366
1921622
1921878
1922134
1922390
1922646
1922902
1923158
1923414
1923670
1923926
1924182
1924438
1924694
1924950
1917015
1917271
1917527
1917783
1918039
1918295
1918551
1918807
1919063
1919319
1919575
1919831
1920087
1920343
1920599
1920855
1921111
1921367
1921623
1921879
1922135
1922391
1922647
1922903
1923159
1923415
1923671
1923927
1924183
1924439
1924695
1924951
1917016
1917272
1917528
1917784
1918040
1918296
1918552
1918808
1919064
1919320
1919576
1919832
1920088
1920344
1920600
1920856
1921112
1921368
1921624
1921880
1922136
1922392
1922648
1922904
1923160
1923416
1923672
1923928
1924184
1924440
1924696
1924952
1917017
1917273
1917529
1917785
1918041
1918297
1918553
1918809
1919065
1919321
1919577
1919833
1920089
1920345
1920601
1920857
1921113
1921369
1921625
1921881
1922137
1922393
1922649
1922905
1923161
1923417
1923673
1923929
1924185
1924441
1924697
1924953
1917018
1917274
1917530
1917786
1918042
1918298
1918554
1918810
1919066
1919322
1919578
1919834
1920090
1920346
1920602
1920858
1921114
1921370
1921626
1921882
1922138
1922394
1922650
1922906
1923162
1923418
1923674
1923930
1924186
1924442
1924698
1924954
1917019
1917275
1917531
1917787
1918043
1918299
1918555
1918811
1919067
1919323
1919579
1919835
1920091
1920347
1920603
1920859
1921115
1921371
1921627
1921883
1922139
1922395
1922651
1922907
1923163
1923419
1923675
1923931
1924187
1924443
1924699
1924955
1917020
1917276
1917532
1917788
1918044
1918300
1918556
1918812
1919068
1919324
1919580
1919836
1920092
1920348
1920604
1920860
1921116
1921372
1921628
1921884
1922140
1922396
1922652
1922908
1923164
1923420
1923676
1923932
1924188
1924444
1924700
1924956
1917021
1917277
1917533
1917789
1918045
1918301
1918557
1918813
1919069
1919325
1919581
1919837
1920093
1920349
1920605
1920861
1921117
1921373
1921629
1921885
1922141
1922397
1922653
1922909
1923165
1923421
1923677
1923933
1924189
1924445
1924701
1924957
1917022
1917278
1917534
1917790
1918046
1918302
1918558
1918814
1919070
1919326
1919582
1919838
1920094
1920350
1920606
1920862
1921118
1921374
1921630
1921886
1922142
1922398
1922654
1922910
1923166
1923422
1923678
1923934
1924190
1924446
1924702
1924958
1917023
1917279
1917535
1917791
1918047
1918303
1918559
1918815
1919071
1919327
1919583
1919839
1920095
1920351
1920607
1920863
1921119
1921375
1921631
1921887
1922143
1922399
1922655
1922911
1923167
1923423
1923679
1923935
1924191
1924447
1924703
1924959
