0 0 0.860000030756 0.767441868782 1.5151515007
0 1 0.724035502788 0.894497215748 1.544049263
0 2 0.720000027466 0.833333313465 1.66666662693
1 0 0.666666666667 1.0 1.5
1 1 0.71157165948 0.889245033264 1.58037424088
1 2 0.64516131017 0.850000023842 1.82352936268
2 0 0.770833367792 0.94594591856 1.37142860889
2 1 0.696865354986 0.906265735626 1.58341801167
2 2 0.703703731666 0.842105269432 1.6875
3 0 0.66071426321 0.94594591856 1.60000002384
3 1 0.682912866536 0.901113033295 1.6250077486
3 2 1.09523807037 0.695652186871 1.3125
4 0 0.644067780994 0.921052634716 1.68571424484
4 1 0.638063979761 0.896602094173 1.74797821045
4 2 0.619047633104 1.0 1.6153845787
5 0 0.888888888889 0.8125 1.3846154213
5 1 0.63648885144 0.906035721302 1.73405909538
5 2 0.5 0.928571403027 2.15384626389
6 0 0.727272727273 0.875 1.57142853737
6 1 0.573685317702 0.911268889904 1.91284477711
6 2 0.68000001297 0.941176474094 1.5625
7 0 0.764705893078 0.846153855324 1.54545450211
7 1 0.676202516197 0.861137449741 1.71731805801
7 2 0.633333310684 0.89473682642 1.76470589638
8 0 0.640625023865 0.804878056049 1.93939399719
8 1 0.657053864329 0.895532429218 1.69948637486
8 2 0.749999977648 0.809523820877 1.64705884457
9 0 0.704918052073 0.883720934391 1.60526311398
9 1 0.675592518057 0.883144974709 1.676035285
9 2 0.823529400215 0.928571403027 1.30769228935
10 0 0.712328771776 0.846153855324 1.65909087658
10 1 0.579066736056 0.915805578232 1.88568043709
10 2 0.874999960884 0.857142865658 1.33333337307
11 0 0.647058841679 0.854545474052 1.80851066113
11 1 0.572982721738 0.921624898911 1.89366984367
11 2 0.68000001297 0.705882370472 2.08333325386
12 0 0.847222205389 0.885245919228 1.33333337307
12 1 0.698270349551 0.884102404118 1.61984634399
12 2 1.11764707842 0.631578922272 1.41666662693
13 0 0.837209320894 0.805555582047 1.48275864124
13 1 0.64315167481 0.904468476772 1.71906840801
13 2 0.666666666667 0.928571403027 1.6153845787
14 0 0.818181827049 0.888888895512 1.375
14 1 0.637494660381 0.896775066853 1.7492017746
14 2 0.708333315742 0.882352948189 1.60000002384
15 0 1.08163265438 0.726415097713 1.27272725105
15 1 0.595226667855 0.906950294971 1.85239732265
15 2 0.906250003376 0.827586233616 1.33333337307
16 0 1.03636362064 0.701754391193 1.375
16 1 0.558072301981 0.915860950947 1.95650064945
16 2 0.764705893078 0.961538434029 1.36000001431
17 0 0.851612937284 0.856060624123 1.3716814518
17 1 0.556962630437 0.920365810394 1.95080327988
17 2 0.73809522762 0.870967745781 1.55555558205
18 0 0.770334960305 0.857142865658 1.51449275017
18 1 0.681922700543 0.885353684425 1.65633451939
18 2 0.71428572645 0.866666674614 1.6153845787
19 0 0.712177099529 0.886010348797 1.5847953558
19 1 0.622062500885 0.900083363056 1.78600752354
19 2 0.765957431267 0.777777791023 1.67857146263
20 0 0.750853219104 0.899999976158 1.47979795933
20 1 0.742490046858 0.862542271614 1.56145310402
20 2 0.619047633104 0.923076927662 1.75
21 0 0.757142828776 0.864150941372 1.52838432789
21 1 0.645220610151 0.887185096741 1.74693822861
21 2 0.736111100142 0.962264180183 1.41176474094
22 0 0.677852359297 0.910891115665 1.61956524849
22 1 0.680418649387 0.887559533119 1.6558701992
22 2 0.874999960884 0.873015880585 1.30909085274
23 0 0.731203003259 0.871465325356 1.56932151318
23 1 0.595542163218 0.908879995346 1.84748506546
23 2 0.711864403903 0.916666686535 1.53246748447
24 0 0.751962306363 0.851774513721 1.5612745285
24 1 0.624099629674 0.878375709057 1.82417190075
24 2 0.762589912361 0.905660390854 1.44791662693
25 0 0.829268321617 0.849264681339 1.41991341114
25 1 0.705501774896 0.882408559322 1.60632038116
25 2 0.743902468224 0.909836053848 1.4774774313
26 0 0.669205655894 0.891056895256 1.67700731754
26 1 0.833476955605 0.814563810825 1.47292721272
26 2 0.595348837209 0.9375 1.79166662693
27 0 0.714880321192 0.860262036324 1.62605750561
27 1 0.584902425363 0.904217839241 1.89079093933
27 2 0.698744791134 0.880239546299 1.62585031986
28 0 0.782241021502 0.83378380537 1.53322529793
28 1 0.629179166709 0.87909924984 1.80795550346
28 2 0.772727247605 0.839572191238 1.54140126705
29 0 0.743927141573 0.870748281479 1.54375004768
29 1 0.668447310559 0.89310759306 1.6750549078
29 2 0.693486592572 0.922651946545 1.56287419796
30 0 0.807768886994 0.782983958721 1.58110237122
30 1 0.724459514475 0.855601489544 1.61329710484
30 2 0.929824611964 0.740566015244 1.4522292614
31 0 0.75098039795 0.828981697559 1.60629916191
31 1 0.594797656179 0.874784529209 1.92189514637
31 2 0.665551834423 0.859296500683 1.74853801727
32 0 0.846578377808 0.83572357893 1.41341650486
32 1 0.672772077202 0.897481381893 1.65617632866
32 2 0.769547290749 0.887700557709 1.46385538578
33 0 0.85081586902 0.853424668312 1.37720704079
33 1 8811.66640895 7.56572699174e-05 1.5
33 2 0.85446007955 0.868131875992 1.34810125828
34 0 0.679035253768 0.909836053848 1.61861860752
34 1 0.691385506023 0.910797297955 1.58802747726
34 2 0.821428606401 0.891304373741 1.36585366726
35 0 0.766708682694 0.879934191704 1.48224294186
35 1 0.728154959727 0.891623675823 1.54026210308
35 2 0.60443036675 0.926701545715 1.78531074524
36 0 0.721958903996 0.903719902039 1.53268766403
36 1 1.0 0.0 0.0
36 2 0.730434770494 0.928571403027 1.47435891628
37 0 1.08333332795 0.689655184746 1.33846151829
37 1 0.695348918752 0.911256253719 1.57818067074
37 2 0.770731736897 0.886075973511 1.46428573132
38 0 143.333333867 0.00465116277337 1.5
38 1 0.782807844308 0.868905305862 1.47018635273
38 2 0.763513542418 0.858407080173 1.52577316761
39 0 1.08836209679 0.685148537159 1.34104049206
39 1 0.671868006888 0.923543989658 1.61160433292
39 2 0.9777777985 0.772727251053 1.32352936268
40 0 0.819624780147 0.823943674564 1.48076927662
40 1 0.686106130995 0.911201059818 1.59953761101
40 2 0.688829809947 0.876447856426 1.65638768673
41 0 0.780952398685 0.873170733452 1.46648049355
41 1 0.729298504464 0.916292846203 1.49644374847
41 2 0.757763988621 0.872950792313 1.51173710823
42 0 0.874015722599 0.826576590538 1.38419616222
42 1 0.59317786006 0.929516732693 1.81366825104
42 2 0.874509843986 0.829596400261 1.37837839127
43 0 0.7098039 0.828729271889 1.70000004768
43 1 0.680658977487 0.892370998859 1.64636063576
43 2 1.57241374915 0.570175409317 1.1153845787
44 0 1.0 0.0 0.0
44 1 0.766446266902 0.869029641151 1.50135612488
44 2 0.840796060292 0.875739634037 1.35810816288
45 0 0.872727242462 0.763888895512 1.5
45 1 0.660007224305 0.926931858063 1.63456988335
45 2 0.889705890152 0.826446294785 1.36000001431
46 0 1.0 0.76543211937 1.30645155907
46 1 0.736068405527 0.907332718372 1.49732220173
46 2 1.20512817566 0.680851042271 1.21875
47 0 1.15384614327 0.677777767181 1.27868855
47 1 0.825967773444 0.870299756527 1.39113104343
47 2 1.09677422307 0.647058844566 1.40909087658
48 0 0.86923076684 0.761061966419 1.51162791252
48 1 0.783806981431 0.853881716728 1.49414646626
48 2 0.892857139056 0.680000007153 1.64705884457
49 0 0.628205145487 0.877551019192 1.81395351887
49 1 1.27017627112 0.611779093742 1.28688979149
49 2 0.882352947364 0.800000011921 1.41666662693
50 0 0.902438979784 0.828828811646 1.33695650101
50 1 0.756023256214 0.887660741806 1.49010825157
50 2 0.78260868754 0.833333313465 1.53333330154
51 0 0.84615388495 0.769230782986 1.53636360168
51 1 0.632050377123 0.948346555233 1.66832709312
51 2 1.19047622764 0.560000002384 1.5
52 0 0.982352890201 0.724550902843 1.40495872498
52 1 0.691460048738 0.907486915588 1.59364843369
52 2 4.6000001508 0.173913046718 1.25
53 0 1.03108810137 0.603015065193 1.60833334923
53 1 0.778973475034 0.839872658253 1.52849459648
53 2 2.87499994645 0.282608687878 1.23076927662
