7748
7749
7750
7751
7752
7753
7754
7755
7756
7757
7758
7759
7760
7761
7762
7763
7764
7765
7766
7767
7768
7769
5632
5888
14080
14336
21504
21760
5727
5983
14175
14431
21599
21855
67909
67910
67911
67912
67913
67914
67915
67916
67917
67918
67919
67920
67921
67922
73042
67923
73043
67925
73045
67926
73046
67927
73047
67928
73048
67929
73049
67930
71168
71424
79616
79872
87040
87296
71263
71519
79711
79967
87135
87391
138308
138564
138820
139076
138309
138565
138821
139077
138310
138566
138822
139078
138311
138567
138823
139079
138312
138568
138824
139080
138313
138569
138825
139081
138314
138570
138826
139082
138315
138571
138827
139083
138316
138572
138828
139084
138317
138573
138829
139085
138318
138574
138830
138319
138575
138831
139087
138320
138576
138832
138321
138577
138833
138322
138578
138834
138323
138579
138835
139091
138324
138580
138836
139092
138325
138581
138837
139093
138326
138582
138838
139094
138327
138583
138839
139095
138328
138584
138840
139096
138329
138585
138841
139097
138330
138586
138842
139098
136704
136960
145152
145408
152576
152832
136799
137055
145247
145503
152671
152927
202240
202496
210688
210944
218112
218368
202335
202591
210783
211039
218207
218463
265797
266821
269381
262726
265798
266822
269382
262727
265799
266823
269383
262728
265800
266824
269384
262729
265801
266825
269385
262730
265802
266826
269386
262731
265803
266827
269387
262732
265804
266828
269388
262733
265805
266829
269389
262734
265806
266830
269390
262735
265807
266831
269391
262736
265808
266832
269392
262737
265809
266833
269393
262738
265810
266834
269394
262739
265811
266835
269395
262740
265812
266836
269396
262741
265813
266837
269397
262742
265814
266838
269398
262743
265815
266839
269399
262744
265816
266840
269400
262745
265817
266841
269401
265818
266842
269402
269403
267776
268032
276224
276480
283648
283904
267871
268127
276319
276575
283743
283999
328516
328772
329796
330308
331588
328261
328517
328773
329797
330309
331589
328262
328518
328774
329798
330310
331590
328263
328519
328775
329799
330311
331591
328264
328520
328776
329800
330312
331592
328265
328521
328777
329801
330313
331593
328266
328522
328778
329802
330314
331594
328267
328523
328779
329803
330315
331595
328268
328524
328780
329804
330316
331596
328269
328525
328781
329805
330317
331597
328270
328526
328782
329806
330318
331598
328271
328527
328783
329807
330319
331599
328272
328528
328784
329808
330320
331600
328273
328529
328785
329809
330321
331601
328274
328530
328786
329810
330322
331602
328275
328531
328787
329811
330323
331603
328276
328532
328788
329812
330324
331604
328277
328533
328789
329813
330325
331605
328278
328534
328790
329814
330326
331606
328279
328535
328791
329815
330327
331607
328280
328536
328792
329816
330328
331608
328537
329817
330329
331609
329818
330330
331610
328283
329819
330331
331611
333312
333568
341760
342016
349184
349440
333407
333663
341855
342111
349279
349535
395076
401220
395077
401221
395078
401222
395079
401223
395080
401224
395081
401225
395082
401226
395083
401227
395084
401228
395085
401229
395086
401230
395087
401231
395088
401232
395089
401233
395090
401234
395091
401235
395092
401236
395093
401237
395094
401238
395095
401239
395096
401240
395097
401241
395098
401242
395099
401243
398848
399104
407296
407552
414720
414976
398943
399199
407391
407647
414815
415071
464196
464197
464198
464199
464200
464201
464202
464203
464204
464205
464206
464207
464208
464209
464210
464212
464213
464214
464215
464216
464217
464384
464640
472832
473088
480256
480512
464479
464735
472927
473183
480351
480607
531524
525125
531525
525126
531526
525127
531527
525128
531528
525129
531529
525130
531530
525131
531531
525132
531532
525133
531533
525134
531534
525135
531535
525136
531536
525137
531537
525138
531538
525139
531539
525140
531540
525141
531541
525142
531542
525143
531543
525144
531544
525145
531545
529920
530176
538368
538624
545792
546048
530015
530271
538463
538719
545887
546143
595456
595712
603904
604160
611328
611584
595551
595807
603999
604255
611423
611679
660992
661248
669440
669696
676864
677120
661087
661343
669535
669791
676959
677215
727877
727878
727879
727880
727881
727882
727883
727884
727886
727887
727888
727889
727890
727891
727892
727893
727894
727897
726528
726784
734976
735232
742400
742656
726623
726879
735071
735327
742495
742751
792064
792320
800512
800768
807936
808192
792159
792415
800607
800863
808031
808287
859975
859976
859977
859978
859979
859980
859981
859982
859983
859984
859985
859986
859987
859988
859989
859990
859991
859992
859993
857600
857856
866048
866304
873472
873728
857695
857951
866143
866399
873567
873823
918852
924228
924740
918853
924229
924741
918854
924230
924742
918855
924231
924743
918856
924232
924744
918857
924233
924745
918858
924234
924746
918859
924235
924747
918860
924236
924748
918861
924237
924749
918862
924238
924750
918863
924239
924751
918864
924240
924752
918865
924241
924753
918866
924242
924754
918867
924243
924755
918868
924244
924756
918869
924245
924757
918870
924246
924758
923136
923392
931584
931840
939008
939264
923231
923487
931679
931935
939103
939359
988228
988229
988230
988231
988232
988233
988234
988235
988236
988237
988238
988239
988240
988242
988244
988245
988248
988672
988928
997120
997376
1004544
1004800
988767
989023
997215
997471
1004639
1004895
1055556
1056324
1055557
1056325
1055558
1056326
1055559
1056327
1055560
1056328
1055561
1056329
1055562
1056330
1055563
1056331
1055564
1056332
1055565
1055566
1056334
1055567
1056335
1055568
1056336
1055569
1055570
1055571
1055572
1055573
1055574
1055575
1055576
1054208
1054464
1062656
1062912
1070080
1070336
1054303
1054559
1062751
1063007
1070175
1070431
1116229
1116230
1116231
1116232
1116233
1116234
1116235
1116236
1116237
1116238
1116239
1116240
1116241
1116242
1116245
1116248
1116250
1119744
1120000
1128192
1128448
1135616
1135872
1119839
1120095
1128287
1128543
1135711
1135967
1180484
1185092
1186884
1180485
1185093
1186885
1180486
1185094
1186886
1180487
1185095
1186887
1180488
1186888
1180489
1185097
1186889
1180490
1186890
1180491
1185099
1186891
1180492
1185100
1186892
1180493
1185101
1186893
1180494
1185102
1186894
1180495
1185103
1186895
1180496
1185104
1186896
1180498
1185106
1186898
1180499
1185107
1186899
1180500
1185108
1186900
1180501
1185109
1186901
1180502
1185110
1186902
1180503
1185111
1186903
1180505
1185113
1186905
1185280
1185536
1193728
1193984
1201152
1201408
1185375
1185631
1193823
1194079
1201247
1201503
1249348
1250116
1250372
1250628
1252164
1249349
1250117
1250373
1250629
1251909
1252165
1252421
1249350
1250118
1250374
1250630
1251910
1252166
1252422
1249351
1250119
1250631
1251911
1252167
1252423
1249352
1249864
1250120
1250376
1250632
1251912
1252168
1252424
1249353
1249865
1250377
1250633
1251913
1252169
1252425
1249354
1249866
1250122
1250378
1250634
1251914
1252170
1252426
1249355
1249867
1250123
1250379
1250635
1251915
1252171
1252427
1249356
1249868
1250124
1250380
1250636
1251916
1252172
1252428
1249357
1249869
1250125
1250381
1250637
1251917
1252173
1252429
1249358
1249870
1250126
1250382
1250638
1251918
1252174
1252430
1249362
1249874
1250130
1250386
1250642
1251922
1252178
1252434
1249363
1249875
1250131
1250387
1250643
1251923
1252179
1252435
1249364
1249876
1250132
1250388
1250644
1251924
1252180
1252436
1249365
1249877
1250133
1250389
1250645
1251925
1252181
1252437
1249366
1249878
1250134
1250390
1250646
1251926
1252182
1252438
1249368
1249880
1250136
1250392
1250648
1251928
1252184
1252440
1249369
1249881
1250137
1250393
1250649
1251929
1252185
1252441
1250816
1251072
1259264
1259520
1266688
1266944
1250911
1251167
1259359
1259615
1266783
1267039
1312068
1317956
1318212
1318468
1312069
1317957
1318213
1318469
1312070
1317958
1318214
1318470
1312071
1317959
1318215
1318471
1312072
1317960
1318216
1318472
1312073
1317961
1318217
1318473
1312074
1317962
1318218
1318474
1312075
1317963
1318219
1318475
1312076
1317964
1318220
1318476
1312077
1317965
1318221
1318477
1312078
1317966
1318222
1318478
1312079
1317967
1318223
1318479
1312080
1317968
1318224
1318480
1312081
1317969
1318225
1318481
1312082
1317970
1318226
1318482
1312083
1317971
1318227
1318483
1312084
1317972
1318228
1318484
1312085
1317973
1318229
1318485
1312086
1317974
1318230
1318486
1312087
1317975
1318231
1318487
1312088
1317976
1318232
1318488
1312089
1317977
1318233
1318489
1316352
1316608
1324800
1325056
1332224
1332480
1316447
1316703
1324895
1325151
1332319
1332575
1378629
1378630
1378631
1378632
1378633
1378634
1378635
1378636
1378637
1378638
1378639
1378640
1378641
1378642
1378643
1378644
1378645
1378646
1378647
1378648
1378649
1381888
1382144
1390336
1390592
1397760
1398016
1381983
1382239
1390431
1390687
1397855
1398111
1449541
1449542
1449543
1449544
1449545
1449546
1449547
1449548
1449549
1449550
1449551
1449552
1449553
1449554
1449555
1449556
1449557
1449558
1449559
1449560
1449561
1447424
1447680
1455872
1456128
1463296
1463552
1447519
1447775
1455967
1456223
1463391
1463647
1509189
1509190
1509191
1509192
1509193
1509194
1509195
1509196
1509197
1509198
1509199
1509200
1509201
1509202
1509203
1509204
1509205
1509206
1509207
1509208
1512960
1513216
1521408
1521664
1528832
1529088
1513055
1513311
1521503
1521759
1528927
1529183
1573445
1575237
1578053
1573446
1575238
1578054
1573447
1575239
1578055
1573448
1575240
1578056
1573449
1575241
1578057
1573450
1575242
1578058
1573451
1575243
1578059
1573452
1575244
1578060
1573453
1575245
1578061
1573454
1575246
1578062
1573455
1575247
1578063
1573457
1575249
1578065
1573458
1575250
1578066
1573459
1575251
1578067
1573460
1575252
1578068
1573461
1575253
1578069
1573462
1575254
1578070
1573463
1575255
1578071
1575259
1578075
1578496
1578752
1586944
1587200
1594368
1594624
1578591
1578847
1587039
1587295
1594463
1594719
1644101
1644102
1644103
1644104
1644105
1644106
1644107
1644108
1644109
1644110
1644111
1644112
1644113
1644114
1644116
1644117
1644118
1644119
1644120
1644121
1644123
1644032
1644288
1652480
1652736
1659904
1660160
1644127
1644383
1652575
1652831
1659999
1660255
1709568
1709824
1718016
1718272
1725440
1725696
1709663
1709919
1718111
1718367
1725535
1725791
1775104
1775360
1783552
1783808
1790976
1791232
1775199
1775455
1783647
1783903
1791071
1791327
1837125
1837381
1839429
1837126
1837382
1839430
1837127
1837383
1839431
1837128
1837384
1839432
1837129
1837385
1839433
1837130
1837386
1839434
1837133
1837389
1837137
1837393
1839441
1837138
1837394
1839442
1837139
1837395
1839443
1837140
1837396
1839444
1837141
1837397
1839445
1837142
1837398
1839446
1837143
1837399
1839447
1837145
1837401
1839449
1837146
1837402
1839450
1840640
1840896
1849088
1849344
1856512
1856768
1840735
1840991
1849183
1849439
1856607
1856863
1901637
1901638
1901639
1901640
1901641
1901642
1901643
1901644
1901645
1901646
1901647
1901648
1901649
1901650
1901651
1901652
1901653
1901654
1906176
1906432
1914624
1914880
1922048
1922304
1906271
1906527
1914719
1914975
1922143
1922399
1971712
1971968
1980160
1980416
1987584
1987840
1971807
1972063
1980255
1980511
1987679
1987935
2033732
2033988
2034500
2035012
2036292
2039108
2033225
2033737
2033993
2034505
2035017
2036297
2039113
2039625
2033226
2033738
2033994
2034506
2035018
2036298
2039114
2039626
2033227
2033739
2033995
2034507
2035019
2036299
2039115
2033228
2033740
2033996
2034508
2035020
2036300
2039116
2033229
2033741
2033997
2034509
2035021
2036301
2039117
2033230
2033742
2033998
2034510
2035022
2036302
2039118
2033231
2033743
2033999
2034511
2035023
2036303
2039119
2033232
2033744
2034000
2034512
2035024
2036304
2039120
2033233
2033745
2034001
2034513
2035025
2036305
2039121
2033236
2033748
2034004
2034516
2035028
2036308
2039124
2033237
2033749
2034005
2034517
2035029
2036309
2039125
2033241
2033753
2034009
2034521
2035033
2036313
2039129
2033242
2033754
2034010
2034522
2035034
2036314
2039130
2033243
2033755
2034011
2034523
2035035
2036315
2039131
2037248
2037504
2045696
2045952
2053120
2053376
2037343
2037599
2045791
2046047
2053215
2053471
2102784
2103040
2111232
2111488
2118656
2118912
2102879
2103135
2111327
2111583
2118751
2119007
2165829
2168133
2168645
2168901
2169157
2169669
2170437
2165830
2168134
2168646
2168902
2169158
2169670
2170438
2165831
2168135
2168647
2168903
2169159
2169671
2170439
2165832
2168136
2168648
2168904
2169160
2169672
2170440
2165833
2168137
2168649
2168905
2169161
2169673
2170441
2165834
2168138
2168650
2168906
2169162
2169674
2170442
2165835
2168139
2168651
2168907
2169163
2169675
2170443
2165836
2168140
2168652
2168908
2169164
2169676
2170444
2165837
2168141
2168653
2168909
2169165
2169677
2170445
2165838
2168142
2168654
2168910
2169166
2169678
2170446
2165839
2168143
2168655
2168911
2169167
2169679
2170447
2165840
2168144
2168656
2169168
2169680
2170448
2165841
2168145
2168657
2169169
2169681
2170449
2165842
2168146
2168658
2169170
2169682
2170450
2165843
2168147
2168659
2169683
2170195
2170451
2165844
2168148
2168660
2169684
2170196
2170452
2165845
2168149
2168661
2169685
2170197
2170453
2165846
2168150
2168662
2169686
2170198
2170454
2165847
2168151
2168663
2169687
2170199
2170455
2170456
2165850
2168154
2168666
2168922
2169178
2168667
2168923
2168320
2168576
2176768
2177024
2184192
2184448
2168415
2168671
2176863
2177119
2184287
2184543
2233856
2234112
2242304
2242560
2249728
2249984
2233951
2234207
2242399
2242655
2249823
2250079
2299392
2299648
2307840
2308096
2315264
2315520
2299487
2299743
2307935
2308191
2315359
2315615
2363461
2364229
2363462
2364230
2363463
2364231
2363465
2364233
2363466
2364234
2364235
2360141
2363469
2364237
2360142
2363470
2364238
2360143
2363471
2364239
2360144
2363472
2360145
2363473
2364241
2360148
2363476
2364244
2360149
2363477
2364245
2360150
2363478
2364246
2360153
2363481
2364249
2360154
2363482
2364250
2364928
2365184
2373376
2373632
2380800
2381056
2365023
2365279
2373471
2373727
2380895
2381151
2425413
2428229
2431813
2425414
2428230
2431814
2425415
2428231
2431815
2425416
2428232
2431816
2425417
2428233
2431817
2425418
2428234
2431818
2425419
2428235
2431819
2425420
2428236
2431820
2425421
2428237
2431821
2425422
2428238
2431822
2425423
2428239
2431823
2425424
2428240
2431824
2425425
2428241
2431825
2425426
2428242
2431826
2425427
2428243
2431827
2425429
2428245
2431829
2425430
2428246
2431830
2425431
2428247
2431831
2425433
2428249
2431833
2430464
2430720
2438912
2439168
2446336
2446592
2430559
2430815
2439007
2439263
2446431
2446687
2497861
2498117
2497862
2498118
2497863
2498119
2497864
2498120
2497865
2498121
2497866
2498122
2497867
2498123
2497868
2498124
2497869
2498125
2497870
2498126
2497871
2498127
2497872
2498128
2497873
2498129
2497874
2498130
2497875
2498131
2497878
2498134
2497880
2498136
2496000
2496256
2504448
2504704
2511872
2512128
2496095
2496351
2504543
2504799
2511967
2512223
2559048
2559052
2559057
2559062
2561536
2561792
2569984
2570240
2577408
2577664
2561631
2561887
2570079
2570335
2577503
2577759
2627072
2627328
2635520
2635776
2642944
2643200
2627167
2627423
2635615
2635871
2643039
2643295
2689861
2692165
2689097
2689865
2692169
2689098
2689866
2692170
2689099
2689867
2692171
2689100
2689868
2692172
2689102
2689870
2692174
2689103
2689871
2692175
2689104
2689872
2692176
2689106
2689107
2689875
2692179
2689879
2692608
2692864
2701056
2701312
2708480
2708736
2692703
2692959
2701151
2701407
2708575
2708831
2753604
2754372
2753605
2754373
2753606
2754374
2753607
2754375
2753608
2754376
2753609
2754377
2753610
2754378
2753611
2754379
2753612
2754380
2753613
2754381
2753614
2754382
2753615
2754383
2753616
2754384
2753617
2754385
2753618
2754386
2753619
2754387
2753620
2754388
2758144
2758400
2766592
2766848
2774016
2774272
2758239
2758495
2766687
2766943
2774111
2774367
2819141
2819397
2820677
2819142
2819398
2820678
2819143
2819399
2820679
2819144
2819400
2820680
2819145
2819401
2820681
2819146
2819402
2820682
2819147
2819403
2820683
2819148
2819404
2820684
2819149
2819405
2820685
2819150
2819406
2820686
2819151
2819407
2820687
2819152
2819408
2820688
2819153
2819409
2820689
2819154
2819410
2820690
2819158
2819414
2820694
2819160
2819416
2820696
2819161
2819417
2820697
2819162
2819418
2820698
2823680
2823936
2832128
2832384
2839552
2839808
2823775
2824031
2832223
2832479
2839647
2839903
2889216
2889472
2897664
2897920
2905088
2905344
2889311
2889567
2897759
2898015
2905183
2905439
2952261
2952517
2952262
2952518
2952263
2952519
2952264
2952520
2952265
2952521
2952266
2952522
2952267
2952523
2952268
2952524
2952269
2952525
2952270
2952526
2952271
2952527
2952272
2952528
2952273
2952529
2952274
2952530
2952275
2952531
2952276
2952532
2952277
2952533
2952278
2952534
2954752
2955008
2963200
2963456
2970624
2970880
2954847
2955103
2963295
2963551
2970719
2970975
3016260
3021380
3016261
3016517
3016773
3017797
3019333
3019589
3020101
3021381
3016263
3016519
3016775
3017799
3019335
3019591
3020103
3016264
3016520
3016776
3017800
3019336
3019592
3020104
3021384
3021896
3016265
3016521
3016777
3017801
3019337
3019593
3020105
3021385
3016266
3016522
3016778
3017802
3019338
3019594
3020106
3021386
3016267
3016268
3016269
3016270
3016271
3016272
3016273
3016274
3017810
3016275
3017811
3019347
3019603
3020115
3021395
3016276
3017812
3016277
3017813
3016278
3017814
3019350
3019606
3016279
3017815
3019351
3019607
3016280
3017816
3019352
3019608
3016281
3017817
3019353
3019609
3016282
3019354
3019610
3016283
3019611
3016284
3019612
3020288
3020544
3028736
3028992
3036160
3036416
3020383
3020639
3028831
3029087
3036255
3036511
3081029
3081030
3081031
3081032
3081033
3081034
3081035
3081036
3081037
3081038
3081039
3081040
3081041
3081042
3081043
3081044
3081045
3081046
3085824
3086080
3094272
3094528
3101696
3101952
3085919
3086175
3094367
3094623
3101791
3102047
3151360
3151616
3159808
3160064
3167232
3167488
3151455
3151711
3159903
3160159
3167327
3167583
3212101
3215429
3216709
3212102
3215430
3216710
3212103
3215431
3216711
3212104
3215432
3216712
3212105
3215433
3216713
3212106
3215434
3216714
3212107
3215435
3216715
3212108
3215436
3216716
3212109
3215437
3216717
3212110
3215438
3216718
3212111
3215439
3216719
3212112
3215440
3216720
3212113
3215441
3216721
3212114
3215442
3216722
3212115
3215443
3216723
3212116
3215444
3216724
3212117
3215445
3216725
3212118
3215446
3216726
3212119
3215447
3216727
3212120
3215448
3216728
3212121
3215449
3216729
3212122
3215450
3216730
3216896
3217152
3225344
3225600
3232768
3233024
3216991
3217247
3225439
3225695
3232863
3233119
3284036
3284292
3284548
3277125
3284037
3284293
3284549
3277126
3284038
3284294
3284550
3277127
3284039
3284295
3284551
3277128
3284040
3284296
3284552
3277129
3284041
3284297
3284553
3277130
3284042
3284298
3284554
3277131
3284043
3284299
3284555
3277132
3284044
3284300
3284556
3277133
3284045
3284301
3284557
3277134
3284046
3284302
3284558
3277135
3284047
3284303
3284559
3277136
3284048
3284304
3277137
3284305
3284561
3277138
3284050
3284306
3284562
3277139
3284051
3284307
3284563
3277140
3284052
3284308
3277141
3284053
3284309
3284565
3277142
3284054
3284310
3284566
3277143
3284055
3284311
3284567
3282432
3282688
3290880
3291136
3298304
3298560
3282527
3282783
3290975
3291231
3298399
3298655
3347968
3348224
3356416
3356672
3363840
3364096
3348063
3348319
3356511
3356767
3363935
3364191
3413504
3413760
3421952
3422208
3429376
3429632
3413599
3413855
3422047
3422303
3429471
3429727
3479040
3479296
3487488
3487744
3494912
3495168
3479135
3479391
3487583
3487839
3495007
3495263
