0 0 0.809523818715 0.764705896378 1.6153845787
0 1 0.81495190403 0.873622119427 1.40457332134
0 2 0.938775523907 0.695652186871 1.53125
1 0 0.627906975003 0.925925910473 1.72000002861
1 1 0.699069017228 0.915865242481 1.56188249588
1 2 0.614035101845 0.942857146263 1.72727274895
2 0 0.591836730374 0.931034505367 1.81481480598
2 1 0.747560356579 0.901499450207 1.48384416103
2 2 0.865384577691 0.844444453716 1.36842107773
3 0 0.742857137797 0.846153855324 1.59090912342
3 1 0.703032407881 0.922951221466 1.54115355015
3 2 0.793103412414 0.913043498993 1.38095235825
4 0 0.68571426703 0.791666686535 1.84210526943
4 1 0.728349559527 0.888854265213 1.54464817047
4 2 0.895833288837 0.883720934391 1.26315784454
5 0 0.793103412414 0.869565188885 1.45000004768
5 1 0.672691475432 0.909872770309 1.63381707668
5 2 0.882352947364 0.888888895512 1.27499997616
6 0 1.0 0.714285731316 1.39999997616
6 1 0.626455724411 0.910480618477 1.7532299757
6 2 0.763636357016 0.952380955219 1.375
7 0 0.928571381131 0.730769217014 1.4736841917
7 1 0.713686776661 0.862805187702 1.6239759922
7 2 0.68181816704 0.933333337307 1.57142853737
8 0 0.774193572204 0.833333313465 1.54999995232
8 1 0.770916604687 0.865451812744 1.49882078171
8 2 0.890909137253 0.714285731316 1.57142853737
9 0 0.589743605967 0.956521749496 1.77272725105
9 1 0.758216581143 0.882262349129 1.49488914013
9 2 0.711864403903 0.880952358246 1.59459459782
10 0 0.724999987036 0.793103456497 1.73913037777
10 1 0.674810625486 0.902720928192 1.64158952236
10 2 0.83333330022 0.875 1.37142860889
11 0 0.868421071702 0.909090936184 1.26666665077
11 1 0.667135355993 0.908494472504 1.64992332458
11 2 0.903846164206 0.808510661125 1.36842107773
12 0 1.0487805122 0.720930218697 1.32258069515
12 1 0.846016748062 0.834894895554 1.41575872898
12 2 0.976190498356 0.829268276691 1.23529410362
13 0 0.823529400215 0.880952358246 1.37837839127
13 1 0.697730270274 0.910286486149 1.57446980476
13 2 0.857142886337 0.833333313465 1.39999997616
14 0 0.821428606401 0.891304373741 1.36585366726
14 1 0.720327026063 0.887262165546 1.56465399265
14 2 0.749999977648 0.928571403027 1.43589746952
15 0 1.08771927777 0.693548381329 1.32558143139
15 1 0.693583552116 0.894221782684 1.61233758926
15 2 0.890909137253 0.836734712124 1.34146344662
16 0 1.17307692711 0.639344274998 1.33333337307
16 1 0.630202133877 0.919945597649 1.72487640381
16 2 0.784615394688 0.86274510622 1.47727274895
17 0 0.84615388495 0.833333313465 1.418181777
17 1 0.641211762647 0.918323397636 1.69825494289
17 2 0.868852457318 0.905660390854 1.27083337307
18 0 0.957142891373 0.791044771671 1.32075476646
18 1 1.19076840942 0.66108071804 1.27033483982
18 2 0.961538496807 0.853333353996 1.21875
19 0 0.882352947364 0.911111116409 1.24390244484
19 1 0.751841870111 0.874987721443 1.52009785175
19 2 0.915789498966 0.850574731827 1.28378379345
20 0 0.883720949832 0.77192980051 1.46590912342
20 1 0.887005976494 0.815623939037 1.3822401762
20 2 0.801724136283 0.913978517056 1.36470592022
21 0 0.891304345516 0.756097555161 1.48387098312
21 1 1.02043787212 0.667218267918 1.46874201298
21 2 0.794117669333 0.907407402992 1.38775515556
22 0 0.849462344903 0.860759496689 1.36764705181
22 1 0.785934699819 0.868338227272 1.46529352665
22 2 0.884058000034 0.811475396156 1.39393937588
23 0 0.840816286437 0.868932068348 1.36871504784
23 1 0.676799856194 0.912946105003 1.61843240261
23 2 0.760000007248 0.917293250561 1.43442618847
24 0 0.84280936186 0.813492059708 1.45853662491
24 1 0.731363972543 0.866605937481 1.57777392864
24 2 0.834254132108 0.807947039604 1.48360657692
25 0 0.742705602231 0.917857170105 1.46692609787
25 1 0.738834503466 0.901758015156 1.50093829632
25 2 0.836842085836 0.899371087551 1.32867133617
26 0 0.792710689791 0.836206912994 1.50859105587
26 1 0.950962763006 0.77814245224 1.35137963295
26 2 0.691803277877 0.905213296413 1.59685862064
27 0 0.791666698125 0.884711802006 1.42776203156
27 1 0.696632828278 0.88727581501 1.61784696579
27 2 0.739273946007 0.901785731316 1.5
28 0 0.629737600575 0.888888895512 1.78645837307
28 1 0.783991507935 0.840255558491 1.51801919937
28 2 0.904593639576 0.8203125 1.3476190567
29 0 0.811722874982 0.844638943672 1.45854926109
29 1 0.752300907162 0.883558928967 1.50443303585
29 2 0.812101880613 0.874509811401 1.40807175636
30 0 1.02631578786 0.729783058167 1.33513510227
30 1 0.8599540981 0.808799445629 1.43775165081
30 2 0.952681357202 0.754966914654 1.39035081863
31 0 1.0662526022 0.691262125969 1.35674154758
31 1 0.73252338373 0.834647476673 1.63559365273
31 2 0.798798803374 0.890977442265 1.40506327152
32 0 0.86973184486 0.830396473408 1.3846154213
32 1 0.712871098656 0.903774380684 1.55213308334
32 2 0.708121825269 0.913978517056 1.54509806633
33 0 0.781411358763 0.876652002335 1.45979905128
33 1 1.0 0.0 0.0
33 2 0.884984044434 0.830324888229 1.36086952686
34 0 0.768595070097 0.888172030449 1.46489107609
34 1 0.839058566104 0.865823745728 1.37650644779
34 2 0.839779014374 0.875 1.36090230942
35 0 0.791397823493 0.888586938381 1.42201828957
35 1 1.55326126042 0.533761799335 1.20616853237
35 2 0.790960471155 0.850000023842 1.48739492893
36 0 0.742105264089 0.890070915222 1.51394426823
36 1 1.0 0.0 0.0
36 2 0.88518519691 0.86192470789 1.31067955494
37 0 1.1169590982 0.685863852501 1.30534350872
37 1 0.809746838278 0.878474354744 1.40579390526
37 2 0.873239451281 0.838709652424 1.3653845787
38 0 237.000011478 0.00421940907836 1.0
38 1 1.18404528518 0.697965145111 1.21003508568
38 2 1.18243245291 0.702857136726 1.2032520771
39 0 1.25855515048 0.649546802044 1.22325587273
39 1 0.72849668479 0.913301646709 1.50299727917
39 2 1.24124517994 0.642633199692 1.2536585331
40 0 1.01975306211 0.726392269135 1.35000002384
40 1 0.75772011425 0.88811814785 1.48600566387
40 2 0.759637175477 0.874626874924 1.50511944294
41 0 0.886287647326 0.837735831738 1.34684681892
41 1 1.02707979757 0.740902602673 1.31411898136
41 2 0.826086935114 0.835913300514 1.44814813137
42 0 0.849104825163 0.843373477459 1.39642858505
42 1 0.651212185387 0.920624613762 1.66799557209
42 2 0.97101451624 0.805970132351 1.27777779102
43 0 0.787292806272 0.800000011921 1.58771932125
43 1 0.797466847823 0.851578235626 1.47252547741
43 2 0.824797832005 0.846405208111 1.4324324131
44 0 1.0 0.0 0.0
44 1 0.557134897701 0.950683832169 1.88800668716
44 2 0.803174626883 0.865612626076 1.43835616112
45 0 0.977941144754 0.751879692078 1.36000001431
45 1 0.733896885862 0.904111027718 1.50710380077
45 2 0.872641539366 0.854054033756 1.34177219868
46 0 1.0 0.73584908247 1.35897433758
46 1 1.22156734312 0.669161558151 1.22335243225
46 2 1.43055551174 0.563106775284 1.24137926102
47 0 1.72857150658 0.54545456171 1.06060600281
47 1 1.08867665616 0.752778708935 1.22020769119
47 2 1.05797104739 0.671232879162 1.4081633091
48 0 0.767567587352 0.788732409477 1.65178573132
48 1 0.978432766491 0.749748289585 1.36318099499
48 2 0.980769174559 0.745098054409 1.36842107773
49 0 0.79611650854 0.798780500889 1.57251906395
49 1 0.739431384278 0.870735168457 1.55315935612
49 2 0.785714299095 0.939393937588 1.3548387289
50 0 0.923076889219 0.807017564774 1.34239125252
50 1 0.862065712434 0.835399985313 1.38856160641
50 2 1.06122446914 0.673076927662 1.39999997616
51 0 1.07434944167 0.667820096016 1.39378237724
51 1 0.70449861315 0.931688427925 1.5235234499
51 2 0.835820919316 0.785714268684 1.52272725105
52 0 0.933933970711 0.752411603928 1.42307686806
52 1 0.722603257457 0.89608168602 1.54437398911
52 2 2.34374994325 0.360000014305 1.18518519402
53 0 1.25657892273 0.573298454285 1.3881278038
53 1 0.920732418748 0.775803148746 1.39995801449
53 2 1.224137965 0.549295783043 1.48717951775
