2240512
2240768
2241024
2241280
2241536
2241792
2242048
2242304
2240513
2240769
2241025
2241281
2241537
2241793
2242049
2242305
2240514
2240770
2241026
2241282
2241538
2241794
2242050
2242306
2240515
2240771
2241027
2241283
2241539
2241795
2242051
2242307
2240516
2240772
2241028
2241284
2241540
2241796
2242052
2242308
2240517
2240773
2241029
2241285
2241541
2241797
2242053
2242309
2240518
2240774
2241030
2241286
2241542
2241798
2242054
2242310
2240519
2240775
2241031
2241287
2241543
2241799
2242055
2242311
3084336
3084592
3084848
3085104
3085360
3085616
3085872
3086128
3084337
3084593
3084849
3085105
3085361
3085617
3085873
3086129
3084338
3084594
3084850
3085106
3085362
3085618
3085874
3086130
3084339
3084595
3084851
3085107
3085363
3085619
3085875
3086131
3084340
3084596
3084852
3085108
3085364
3085620
3085876
3086132
3084341
3084597
3084853
3085109
3085365
3085621
3085877
3086133
3084342
3084598
3084854
3085110
3085366
3085622
3085878
3086134
3084343
3084599
3084855
3085111
3085367
3085623
3085879
3086135
3213344
3213600
3213856
3214112
3214368
3214624
3214880
3215136
3213345
3213601
3213857
3214113
3214369
3214625
3214881
3215137
3213346
3213602
3213858
3214114
3214370
3214626
3214882
3215138
3213347
3213603
3213859
3214115
3214371
3214627
3214883
3215139
3213348
3213604
3213860
3214116
3214372
3214628
3214884
3215140
3213349
3213605
3213861
3214117
3214373
3214629
3214885
3215141
3213350
3213606
3213862
3214118
3214374
3214630
3214886
3215142
3213351
3213607
3213863
3214119
3214375
3214631
3214887
3215143
3227704
3227960
3228216
3228472
3228728
3228984
3229240
3229496
3227705
3227961
3228217
3228473
3228729
3228985
3229241
3229497
3227706
3227962
3228218
3228474
3228730
3228986
3229242
3229498
3227707
3227963
3228219
3228475
3228731
3228987
3229243
3229499
3227708
3227964
3228220
3228476
3228732
3228988
3229244
3229500
3227709
3227965
3228221
3228477
3228733
3228989
3229245
3229501
3227710
3227966
3228222
3228478
3228734
3228990
3229246
3229502
3227711
3227967
3228223
3228479
3228735
3228991
3229247
3229503
