0 0 1.0 0.8125 1.23076927662
0 1 0.783588284654 0.892220854759 1.43034136295
0 2 0.896551753621 0.769230782986 1.45000004768
1 0 0.764705893078 1.0 1.30769228935
1 1 0.656171704904 0.9363951087 1.6275087595
1 2 0.729729720325 0.814814805984 1.68181812763
2 0 0.71428572645 0.866666674614 1.6153845787
2 1 0.704932269054 0.914913594723 1.5505027771
2 2 1.04545453412 0.826086938381 1.15789473057
3 0 0.857142886337 0.777777791023 1.5
3 1 0.584749244545 0.936028122902 1.82701218128
3 2 0.676470585863 0.869565188885 1.70000004768
4 0 0.619047633104 0.923076927662 1.75
4 1 0.700791315496 0.908720076084 1.57029473782
4 2 0.682926821326 0.892857134342 1.63999998569
5 0 0.736842133002 1.0 1.35714280605
5 1 0.631274272629 0.933029651642 1.69779980183
5 2 0.627906975003 0.962962985039 1.65384614468
6 0 6.49999975786 0.153846159577 1.0
6 1 0.586713592892 0.929923593998 1.8328486681
6 2 0.756756776262 0.928571403027 1.42307686806
7 0 0.83333330022 1.0 1.20000004768
7 1 0.6598414576 0.894247174263 1.6947388649
7 2 0.892857139056 0.920000016689 1.21739125252
8 0 1.15384614327 0.733333349228 1.18181812763
8 1 0.705202559965 0.90202921629 1.57204699516
8 2 0.8 1.0 1.25
9 0 0.866666673554 1.0 1.15384614468
9 1 0.711021182285 0.910578727722 1.54454290867
9 2 0.595238113822 0.879999995232 1.90909087658
10 0 0.583333327538 1.0 1.71428573132
10 1 0.640580995703 0.923595249653 1.69022393227
10 2 0.862068990323 0.800000011921 1.45000004768
11 0 0.882352947364 0.866666674614 1.30769228935
11 1 0.66098154476 0.925925910473 1.63393366337
11 2 1.0 0.869565188885 1.14999997616
12 0 0.874999960884 0.928571403027 1.23076927662
12 1 0.570512607326 0.958674788475 1.82836735249
12 2 0.958333342854 0.869565188885 1.20000004768
13 0 0.8 0.8125 1.53846156597
13 1 0.702468762587 0.928655266762 1.53291630745
13 2 0.85185188194 0.739130437374 1.58823525906
14 0 0.83333330022 0.866666674614 1.3846154213
14 1 0.701589367794 0.905812799931 1.57354271412
14 2 0.84615388495 0.909090936184 1.29999995232
15 0 1.39999996662 0.642857134342 1.11111116409
15 1 0.771885527772 0.872110664845 1.48550963402
15 2 1.0 0.800000011921 1.25
16 0 0.823529400215 0.928571403027 1.30769228935
16 1 0.618047506343 0.944984793663 1.71219539642
16 2 0.916666639348 0.772727251053 1.41176474094
17 0 1.07692310655 0.857142865658 1.08333337307
17 1 0.63760644626 0.941593468189 1.66565048695
17 2 0.869565235419 0.949999988079 1.21052634716
18 0 1.29999997675 0.615384638309 1.25
18 1 0.569112163212 0.955866932869 1.83825051785
18 2 0.913043482993 0.904761910439 1.21052634716
19 0 0.874999960884 0.785714268684 1.45454549789
19 1 0.727732862626 0.906598865986 1.51569855213
19 2 1.0 0.809523820877 1.23529410362
20 0 1.15384614327 0.666666686535 1.29999995232
20 1 0.689438514892 0.922178089619 1.57285857201
20 2 0.64516131017 0.899999976158 1.72222220898
21 0 0.789473694117 0.800000011921 1.58333337307
21 1 0.573492275165 0.953085541725 1.82953429222
21 2 0.947368397277 0.777777791023 1.35714280605
22 0 0.624999990687 0.866666674614 1.84615385532
22 1 0.792305559187 0.857457399368 1.47195565701
22 2 1.12499999162 0.611111104488 1.45454549789
23 0 0.749999977648 1.0 1.33333337307
23 1 0.650619171911 0.939745426178 1.63554656506
23 2 0.761904761905 0.9375 1.39999997616
24 0 1.0 0.777777791023 1.28571426868
24 1 0.69161431429 0.894497871399 1.61642932892
24 2 1.12499999162 0.666666686535 1.33333337307
25 0 0.863636368316 0.947368443012 1.22222220898
25 1 0.726972278521 0.929050028324 1.48061811924
25 2 0.899999957085 0.888888895512 1.25
26 0 1.0 0.842105269432 1.1875
26 1 0.942682898187 0.790544450283 1.34186267853
26 2 0.807692278066 0.904761910439 1.36842107773
27 0 0.8 0.850000023842 1.47058820724
27 1 0.667092701351 0.916357338428 1.6358705759
27 2 0.64516131017 1.0 1.54999995232
28 0 0.580645165756 0.944444417953 1.82352936268
28 1 0.712012437755 0.896028161049 1.5674393177
28 2 0.617647050161 0.904761910439 1.78947365284
29 0 0.882352947364 0.866666674614 1.30769228935
29 1 0.66082288859 0.947836101055 1.59654688835
29 2 0.774193572204 0.833333313465 1.54999995232
30 0 0.941176470588 0.75 1.41666662693
30 1 0.473370387625 0.969331860542 2.17934703827
30 2 0.774193572204 0.833333313465 1.54999995232
31 0 1.35714287448 0.421052634716 1.75
31 1 0.402335255462 0.973502397537 2.55314159393
31 2 0.84615388495 0.818181812763 1.44444441795
32 0 3.39999985814 0.29411765933 1.0
32 1 0.878208492398 0.753247559071 1.51169657707
32 2 0.617647050161 0.952380955219 1.70000004768
33 0 0.583333327538 0.928571403027 1.84615385532
33 1 0.538484469944 0.973245561123 1.90811431408
33 2 0.709677435729 0.95454543829 1.47619044781
34 0 0.624999990687 0.933333337307 1.71428573132
34 1 0.735897224681 0.922248601913 1.47344815731
34 2 0.676470585863 0.826086938381 1.78947365284
35 0 0.655172405714 0.89473682642 1.70588231087
35 1 0.743289722425 0.902541637421 1.49064648151
35 2 0.657142859381 0.956521749496 1.59090912342
36 0 1.31818183604 0.586206912994 1.29411768913
36 1 0.580746063373 0.959538578987 1.79453229904
36 2 0.827586179681 0.875 1.38095235825
37 0 1.4285714529 0.566666662693 1.23529410362
37 1 0.747142085829 0.909139037132 1.47219884396
37 2 0.892857139056 0.800000011921 1.39999997616
38 0 1.0 0.633333325386 1.57894742489
38 1 0.921134406587 0.795606613159 1.36451590061
38 2 1.21052634237 0.652173936367 1.26666665077
39 0 0.926829219786 0.736842095852 1.46428573132
39 1 0.697877940943 0.938457787037 1.52688312531
39 2 0.913043482993 0.761904776096 1.4375
40 0 1.08510637747 0.647058844566 1.42424237728
40 1 0.853939492776 0.84208625555 1.39064514637
40 2 0.739130446275 0.941176474094 1.4375
41 0 0.983870986659 0.803278684616 1.26530611515
41 1 1.1141503642 0.735508978367 1.22030448914
41 2 1.0 0.0 0.0
42 0 0.971428544959 0.794117629528 1.2962962389
42 1 0.620466009574 0.936801195145 1.72042036057
42 2 1.44999997407 0.655172407627 1.05263161659
43 0 0.736263704435 0.880596995354 1.54237282276
43 1 0.703687734273 0.899356424809 1.58011317253
43 2 0.947368397277 0.777777791023 1.35714280605
44 0 0.775280868762 0.840579688549 1.53448271751
44 1 0.768487973916 0.871713161469 1.49275767803
44 2 0.809523818715 1.0 1.23529410362
45 0 1.05555553109 0.776315808296 1.22033894062
45 1 0.704112354354 0.909830629826 1.56098043919
45 2 0.83333330022 0.920000016689 1.30434787273
46 0 1.01351350045 0.733333349228 1.34545457363
46 1 0.681331671334 0.922078728676 1.59174466133
46 2 1.0 0.0 0.0
47 0 1.22580647047 0.657894730568 1.24000000954
47 1 0.96705083439 0.797129511833 1.29724442959
47 2 0.916666639348 0.878787875175 1.24137926102
48 0 0.807339442478 0.840909063816 1.47297298908
48 1 0.567835249819 0.936566710472 1.88035106659
48 2 0.977272716682 0.813953459263 1.25714290142
49 0 0.722627720878 0.868686854839 1.59302330017
49 1 0.978154158189 0.733647406101 1.39349460602
49 2 0.826923090193 0.860465109348 1.40540540218
50 0 0.869565235419 0.837499976158 1.37313437462
50 1 0.877224457186 0.815820217133 1.39731669426
50 2 0.746031768618 0.87234044075 1.53658533096
51 0 0.880000008392 0.738636374474 1.53846156597
51 1 0.670002057463 0.941422283649 1.58540189266
51 2 0.916666639348 0.818181812763 1.33333337307
52 0 1.46153843473 0.5 1.36842107773
52 1 0.555306556584 0.93839943409 1.91901981831
52 2 1.54285721117 0.444444447756 1.45833337307
53 0 1.0 0.0 0.0
53 1 1.0 0.0 0.0
53 2 1.0 0.0 0.0
