409600
409856
410112
410368
410624
410880
411136
411392
411648
411904
412160
412416
412672
412928
413184
413440
413696
413952
414208
414464
414720
414976
415232
415488
415744
416000
416256
416512
416768
417024
417280
417536
409601
409857
410113
410369
410625
410881
411137
411393
411649
411905
412161
412417
412673
412929
413185
413441
413697
413953
414209
414465
414721
414977
415233
415489
415745
416001
416257
416513
416769
417025
417281
417537
409602
409858
410114
410370
410626
410882
411138
411394
411650
411906
412162
412418
412674
412930
413186
413442
413698
413954
414210
414466
414722
414978
415234
415490
415746
416002
416258
416514
416770
417026
417282
417538
409603
409859
410115
410371
410627
410883
411139
411395
411651
411907
412163
412419
412675
412931
413187
413443
413699
413955
414211
414467
414723
414979
415235
415491
415747
416003
416259
416515
416771
417027
417283
417539
409604
409860
410116
410372
410628
410884
411140
411396
411652
411908
412164
412420
412676
412932
413188
413444
413700
413956
414212
414468
414724
414980
415236
415492
415748
416004
416260
416516
416772
417028
417284
417540
409605
409861
410117
410373
410629
410885
411141
411397
411653
411909
412165
412421
412677
412933
413189
413445
413701
413957
414213
414469
414725
414981
415237
415493
415749
416005
416261
416517
416773
417029
417285
417541
409606
409862
410118
410374
410630
410886
411142
411398
411654
411910
412166
412422
412678
412934
413190
413446
413702
413958
414214
414470
414726
414982
415238
415494
415750
416006
416262
416518
416774
417030
417286
417542
409607
409863
410119
410375
410631
410887
411143
411399
411655
411911
412167
412423
412679
412935
413191
413447
413703
413959
414215
414471
414727
414983
415239
415495
415751
416007
416263
416519
416775
417031
417287
417543
409608
409864
410120
410376
410632
410888
411144
411400
411656
411912
412168
412424
412680
412936
413192
413448
413704
413960
414216
414472
414728
414984
415240
415496
415752
416008
416264
416520
416776
417032
417288
417544
409609
409865
410121
410377
410633
410889
411145
411401
411657
411913
412169
412425
412681
412937
413193
413449
413705
413961
414217
414473
414729
414985
415241
415497
415753
416009
416265
416521
416777
417033
417289
417545
409610
409866
410122
410378
410634
410890
411146
411402
411658
411914
412170
412426
412682
412938
413194
413450
413706
413962
414218
414474
414730
414986
415242
415498
415754
416010
416266
416522
416778
417034
417290
417546
409611
409867
410123
410379
410635
410891
411147
411403
411659
411915
412171
412427
412683
412939
413195
413451
413707
413963
414219
414475
414731
414987
415243
415499
415755
416011
416267
416523
416779
417035
417291
417547
409612
409868
410124
410380
410636
410892
411148
411404
411660
411916
412172
412428
412684
412940
413196
413452
413708
413964
414220
414476
414732
414988
415244
415500
415756
416012
416268
416524
416780
417036
417292
417548
409613
409869
410125
410381
410637
410893
411149
411405
411661
411917
412173
412429
412685
412941
413197
413453
413709
413965
414221
414477
414733
414989
415245
415501
415757
416013
416269
416525
416781
417037
417293
417549
409614
409870
410126
410382
410638
410894
411150
411406
411662
411918
412174
412430
412686
412942
413198
413454
413710
413966
414222
414478
414734
414990
415246
415502
415758
416014
416270
416526
416782
417038
417294
417550
409615
409871
410127
410383
410639
410895
411151
411407
411663
411919
412175
412431
412687
412943
413199
413455
413711
413967
414223
414479
414735
414991
415247
415503
415759
416015
416271
416527
416783
417039
417295
417551
409616
409872
410128
410384
410640
410896
411152
411408
411664
411920
412176
412432
412688
412944
413200
413456
413712
413968
414224
414480
414736
414992
415248
415504
415760
416016
416272
416528
416784
417040
417296
417552
409617
409873
410129
410385
410641
410897
411153
411409
411665
411921
412177
412433
412689
412945
413201
413457
413713
413969
414225
414481
414737
414993
415249
415505
415761
416017
416273
416529
416785
417041
417297
417553
409618
409874
410130
410386
410642
410898
411154
411410
411666
411922
412178
412434
412690
412946
413202
413458
413714
413970
414226
414482
414738
414994
415250
415506
415762
416018
416274
416530
416786
417042
417298
417554
409619
409875
410131
410387
410643
410899
411155
411411
411667
411923
412179
412435
412691
412947
413203
413459
413715
413971
414227
414483
414739
414995
415251
415507
415763
416019
416275
416531
416787
417043
417299
417555
409620
409876
410132
410388
410644
410900
411156
411412
411668
411924
412180
412436
412692
412948
413204
413460
413716
413972
414228
414484
414740
414996
415252
415508
415764
416020
416276
416532
416788
417044
417300
417556
409621
409877
410133
410389
410645
410901
411157
411413
411669
411925
412181
412437
412693
412949
413205
413461
413717
413973
414229
414485
414741
414997
415253
415509
415765
416021
416277
416533
416789
417045
417301
417557
409622
409878
410134
410390
410646
410902
411158
411414
411670
411926
412182
412438
412694
412950
413206
413462
413718
413974
414230
414486
414742
414998
415254
415510
415766
416022
416278
416534
416790
417046
417302
417558
409623
409879
410135
410391
410647
410903
411159
411415
411671
411927
412183
412439
412695
412951
413207
413463
413719
413975
414231
414487
414743
414999
415255
415511
415767
416023
416279
416535
416791
417047
417303
417559
409624
409880
410136
410392
410648
410904
411160
411416
411672
411928
412184
412440
412696
412952
413208
413464
413720
413976
414232
414488
414744
415000
415256
415512
415768
416024
416280
416536
416792
417048
417304
417560
409625
409881
410137
410393
410649
410905
411161
411417
411673
411929
412185
412441
412697
412953
413209
413465
413721
413977
414233
414489
414745
415001
415257
415513
415769
416025
416281
416537
416793
417049
417305
417561
409626
409882
410138
410394
410650
410906
411162
411418
411674
411930
412186
412442
412698
412954
413210
413466
413722
413978
414234
414490
414746
415002
415258
415514
415770
416026
416282
416538
416794
417050
417306
417562
409627
409883
410139
410395
410651
410907
411163
411419
411675
411931
412187
412443
412699
412955
413211
413467
413723
413979
414235
414491
414747
415003
415259
415515
415771
416027
416283
416539
416795
417051
417307
417563
409628
409884
410140
410396
410652
410908
411164
411420
411676
411932
412188
412444
412700
412956
413212
413468
413724
413980
414236
414492
414748
415004
415260
415516
415772
416028
416284
416540
416796
417052
417308
417564
409629
409885
410141
410397
410653
410909
411165
411421
411677
411933
412189
412445
412701
412957
413213
413469
413725
413981
414237
414493
414749
415005
415261
415517
415773
416029
416285
416541
416797
417053
417309
417565
409630
409886
410142
410398
410654
410910
411166
411422
411678
411934
412190
412446
412702
412958
413214
413470
413726
413982
414238
414494
414750
415006
415262
415518
415774
416030
416286
416542
416798
417054
417310
417566
409631
409887
410143
410399
410655
410911
411167
411423
411679
411935
412191
412447
412703
412959
413215
413471
413727
413983
414239
414495
414751
415007
415263
415519
415775
416031
416287
416543
416799
417055
417311
417567
409632
409888
410144
410400
410656
410912
411168
411424
411680
411936
412192
412448
412704
412960
413216
413472
413728
413984
414240
414496
414752
415008
415264
415520
415776
416032
416288
416544
416800
417056
417312
417568
409633
409889
410145
410401
410657
410913
411169
411425
411681
411937
412193
412449
412705
412961
413217
413473
413729
413985
414241
414497
414753
415009
415265
415521
415777
416033
416289
416545
416801
417057
417313
417569
409634
409890
410146
410402
410658
410914
411170
411426
411682
411938
412194
412450
412706
412962
413218
413474
413730
413986
414242
414498
414754
415010
415266
415522
415778
416034
416290
416546
416802
417058
417314
417570
409635
409891
410147
410403
410659
410915
411171
411427
411683
411939
412195
412451
412707
412963
413219
413475
413731
413987
414243
414499
414755
415011
415267
415523
415779
416035
416291
416547
416803
417059
417315
417571
409636
409892
410148
410404
410660
410916
411172
411428
411684
411940
412196
412452
412708
412964
413220
413476
413732
413988
414244
414500
414756
415012
415268
415524
415780
416036
416292
416548
416804
417060
417316
417572
409637
409893
410149
410405
410661
410917
411173
411429
411685
411941
412197
412453
412709
412965
413221
413477
413733
413989
414245
414501
414757
415013
415269
415525
415781
416037
416293
416549
416805
417061
417317
417573
409638
409894
410150
410406
410662
410918
411174
411430
411686
411942
412198
412454
412710
412966
413222
413478
413734
413990
414246
414502
414758
415014
415270
415526
415782
416038
416294
416550
416806
417062
417318
417574
409639
409895
410151
410407
410663
410919
411175
411431
411687
411943
412199
412455
412711
412967
413223
413479
413735
413991
414247
414503
414759
415015
415271
415527
415783
416039
416295
416551
416807
417063
417319
417575
409640
409896
410152
410408
410664
410920
411176
411432
411688
411944
412200
412456
412712
412968
413224
413480
413736
413992
414248
414504
414760
415016
415272
415528
415784
416040
416296
416552
416808
417064
417320
417576
409641
409897
410153
410409
410665
410921
411177
411433
411689
411945
412201
412457
412713
412969
413225
413481
413737
413993
414249
414505
414761
415017
415273
415529
415785
416041
416297
416553
416809
417065
417321
417577
409642
409898
410154
410410
410666
410922
411178
411434
411690
411946
412202
412458
412714
412970
413226
413482
413738
413994
414250
414506
414762
415018
415274
415530
415786
416042
416298
416554
416810
417066
417322
417578
409643
409899
410155
410411
410667
410923
411179
411435
411691
411947
412203
412459
412715
412971
413227
413483
413739
413995
414251
414507
414763
415019
415275
415531
415787
416043
416299
416555
416811
417067
417323
417579
409644
409900
410156
410412
410668
410924
411180
411436
411692
411948
412204
412460
412716
412972
413228
413484
413740
413996
414252
414508
414764
415020
415276
415532
415788
416044
416300
416556
416812
417068
417324
417580
409645
409901
410157
410413
410669
410925
411181
411437
411693
411949
412205
412461
412717
412973
413229
413485
413741
413997
414253
414509
414765
415021
415277
415533
415789
416045
416301
416557
416813
417069
417325
417581
409646
409902
410158
410414
410670
410926
411182
411438
411694
411950
412206
412462
412718
412974
413230
413486
413742
413998
414254
414510
414766
415022
415278
415534
415790
416046
416302
416558
416814
417070
417326
417582
409647
409903
410159
410415
410671
410927
411183
411439
411695
411951
412207
412463
412719
412975
413231
413487
413743
413999
414255
414511
414767
415023
415279
415535
415791
416047
416303
416559
416815
417071
417327
417583
409648
409904
410160
410416
410672
410928
411184
411440
411696
411952
412208
412464
412720
412976
413232
413488
413744
414000
414256
414512
414768
415024
415280
415536
415792
416048
416304
416560
416816
417072
417328
417584
409649
409905
410161
410417
410673
410929
411185
411441
411697
411953
412209
412465
412721
412977
413233
413489
413745
414001
414257
414513
414769
415025
415281
415537
415793
416049
416305
416561
416817
417073
417329
417585
409650
409906
410162
410418
410674
410930
411186
411442
411698
411954
412210
412466
412722
412978
413234
413490
413746
414002
414258
414514
414770
415026
415282
415538
415794
416050
416306
416562
416818
417074
417330
417586
409651
409907
410163
410419
410675
410931
411187
411443
411699
411955
412211
412467
412723
412979
413235
413491
413747
414003
414259
414515
414771
415027
415283
415539
415795
416051
416307
416563
416819
417075
417331
417587
409652
409908
410164
410420
410676
410932
411188
411444
411700
411956
412212
412468
412724
412980
413236
413492
413748
414004
414260
414516
414772
415028
415284
415540
415796
416052
416308
416564
416820
417076
417332
417588
409653
409909
410165
410421
410677
410933
411189
411445
411701
411957
412213
412469
412725
412981
413237
413493
413749
414005
414261
414517
414773
415029
415285
415541
415797
416053
416309
416565
416821
417077
417333
417589
409654
409910
410166
410422
410678
410934
411190
411446
411702
411958
412214
412470
412726
412982
413238
413494
413750
414006
414262
414518
414774
415030
415286
415542
415798
416054
416310
416566
416822
417078
417334
417590
409655
409911
410167
410423
410679
410935
411191
411447
411703
411959
412215
412471
412727
412983
413239
413495
413751
414007
414263
414519
414775
415031
415287
415543
415799
416055
416311
416567
416823
417079
417335
417591
409656
409912
410168
410424
410680
410936
411192
411448
411704
411960
412216
412472
412728
412984
413240
413496
413752
414008
414264
414520
414776
415032
415288
415544
415800
416056
416312
416568
416824
417080
417336
417592
409657
409913
410169
410425
410681
410937
411193
411449
411705
411961
412217
412473
412729
412985
413241
413497
413753
414009
414265
414521
414777
415033
415289
415545
415801
416057
416313
416569
416825
417081
417337
417593
409658
409914
410170
410426
410682
410938
411194
411450
411706
411962
412218
412474
412730
412986
413242
413498
413754
414010
414266
414522
414778
415034
415290
415546
415802
416058
416314
416570
416826
417082
417338
417594
409659
409915
410171
410427
410683
410939
411195
411451
411707
411963
412219
412475
412731
412987
413243
413499
413755
414011
414267
414523
414779
415035
415291
415547
415803
416059
416315
416571
416827
417083
417339
417595
409660
409916
410172
410428
410684
410940
411196
411452
411708
411964
412220
412476
412732
412988
413244
413500
413756
414012
414268
414524
414780
415036
415292
415548
415804
416060
416316
416572
416828
417084
417340
417596
409661
409917
410173
410429
410685
410941
411197
411453
411709
411965
412221
412477
412733
412989
413245
413501
413757
414013
414269
414525
414781
415037
415293
415549
415805
416061
416317
416573
416829
417085
417341
417597
409662
409918
410174
410430
410686
410942
411198
411454
411710
411966
412222
412478
412734
412990
413246
413502
413758
414014
414270
414526
414782
415038
415294
415550
415806
416062
416318
416574
416830
417086
417342
417598
409663
409919
410175
410431
410687
410943
411199
411455
411711
411967
412223
412479
412735
412991
413247
413503
413759
414015
414271
414527
414783
415039
415295
415551
415807
416063
416319
416575
416831
417087
417343
417599
409664
409920
410176
410432
410688
410944
411200
411456
411712
411968
412224
412480
412736
412992
413248
413504
413760
414016
414272
414528
414784
415040
415296
415552
415808
416064
416320
416576
416832
417088
417344
417600
409665
409921
410177
410433
410689
410945
411201
411457
411713
411969
412225
412481
412737
412993
413249
413505
413761
414017
414273
414529
414785
415041
415297
415553
415809
416065
416321
416577
416833
417089
417345
417601
409666
409922
410178
410434
410690
410946
411202
411458
411714
411970
412226
412482
412738
412994
413250
413506
413762
414018
414274
414530
414786
415042
415298
415554
415810
416066
416322
416578
416834
417090
417346
417602
409667
409923
410179
410435
410691
410947
411203
411459
411715
411971
412227
412483
412739
412995
413251
413507
413763
414019
414275
414531
414787
415043
415299
415555
415811
416067
416323
416579
416835
417091
417347
417603
409668
409924
410180
410436
410692
410948
411204
411460
411716
411972
412228
412484
412740
412996
413252
413508
413764
414020
414276
414532
414788
415044
415300
415556
415812
416068
416324
416580
416836
417092
417348
417604
409669
409925
410181
410437
410693
410949
411205
411461
411717
411973
412229
412485
412741
412997
413253
413509
413765
414021
414277
414533
414789
415045
415301
415557
415813
416069
416325
416581
416837
417093
417349
417605
409670
409926
410182
410438
410694
410950
411206
411462
411718
411974
412230
412486
412742
412998
413254
413510
413766
414022
414278
414534
414790
415046
415302
415558
415814
416070
416326
416582
416838
417094
417350
417606
409671
409927
410183
410439
410695
410951
411207
411463
411719
411975
412231
412487
412743
412999
413255
413511
413767
414023
414279
414535
414791
415047
415303
415559
415815
416071
416327
416583
416839
417095
417351
417607
409672
409928
410184
410440
410696
410952
411208
411464
411720
411976
412232
412488
412744
413000
413256
413512
413768
414024
414280
414536
414792
415048
415304
415560
415816
416072
416328
416584
416840
417096
417352
417608
409673
409929
410185
410441
410697
410953
411209
411465
411721
411977
412233
412489
412745
413001
413257
413513
413769
414025
414281
414537
414793
415049
415305
415561
415817
416073
416329
416585
416841
417097
417353
417609
409674
409930
410186
410442
410698
410954
411210
411466
411722
411978
412234
412490
412746
413002
413258
413514
413770
414026
414282
414538
414794
415050
415306
415562
415818
416074
416330
416586
416842
417098
417354
417610
409675
409931
410187
410443
410699
410955
411211
411467
411723
411979
412235
412491
412747
413003
413259
413515
413771
414027
414283
414539
414795
415051
415307
415563
415819
416075
416331
416587
416843
417099
417355
417611
409676
409932
410188
410444
410700
410956
411212
411468
411724
411980
412236
412492
412748
413004
413260
413516
413772
414028
414284
414540
414796
415052
415308
415564
415820
416076
416332
416588
416844
417100
417356
417612
409677
409933
410189
410445
410701
410957
411213
411469
411725
411981
412237
412493
412749
413005
413261
413517
413773
414029
414285
414541
414797
415053
415309
415565
415821
416077
416333
416589
416845
417101
417357
417613
409678
409934
410190
410446
410702
410958
411214
411470
411726
411982
412238
412494
412750
413006
413262
413518
413774
414030
414286
414542
414798
415054
415310
415566
415822
416078
416334
416590
416846
417102
417358
417614
409679
409935
410191
410447
410703
410959
411215
411471
411727
411983
412239
412495
412751
413007
413263
413519
413775
414031
414287
414543
414799
415055
415311
415567
415823
416079
416335
416591
416847
417103
417359
417615
409680
409936
410192
410448
410704
410960
411216
411472
411728
411984
412240
412496
412752
413008
413264
413520
413776
414032
414288
414544
414800
415056
415312
415568
415824
416080
416336
416592
416848
417104
417360
417616
409681
409937
410193
410449
410705
410961
411217
411473
411729
411985
412241
412497
412753
413009
413265
413521
413777
414033
414289
414545
414801
415057
415313
415569
415825
416081
416337
416593
416849
417105
417361
417617
409682
409938
410194
410450
410706
410962
411218
411474
411730
411986
412242
412498
412754
413010
413266
413522
413778
414034
414290
414546
414802
415058
415314
415570
415826
416082
416338
416594
416850
417106
417362
417618
409683
409939
410195
410451
410707
410963
411219
411475
411731
411987
412243
412499
412755
413011
413267
413523
413779
414035
414291
414547
414803
415059
415315
415571
415827
416083
416339
416595
416851
417107
417363
417619
409684
409940
410196
410452
410708
410964
411220
411476
411732
411988
412244
412500
412756
413012
413268
413524
413780
414036
414292
414548
414804
415060
415316
415572
415828
416084
416340
416596
416852
417108
417364
417620
409685
409941
410197
410453
410709
410965
411221
411477
411733
411989
412245
412501
412757
413013
413269
413525
413781
414037
414293
414549
414805
415061
415317
415573
415829
416085
416341
416597
416853
417109
417365
417621
409686
409942
410198
410454
410710
410966
411222
411478
411734
411990
412246
412502
412758
413014
413270
413526
413782
414038
414294
414550
414806
415062
415318
415574
415830
416086
416342
416598
416854
417110
417366
417622
409687
409943
410199
410455
410711
410967
411223
411479
411735
411991
412247
412503
412759
413015
413271
413527
413783
414039
414295
414551
414807
415063
415319
415575
415831
416087
416343
416599
416855
417111
417367
417623
409688
409944
410200
410456
410712
410968
411224
411480
411736
411992
412248
412504
412760
413016
413272
413528
413784
414040
414296
414552
414808
415064
415320
415576
415832
416088
416344
416600
416856
417112
417368
417624
409689
409945
410201
410457
410713
410969
411225
411481
411737
411993
412249
412505
412761
413017
413273
413529
413785
414041
414297
414553
414809
415065
415321
415577
415833
416089
416345
416601
416857
417113
417369
417625
409690
409946
410202
410458
410714
410970
411226
411482
411738
411994
412250
412506
412762
413018
413274
413530
413786
414042
414298
414554
414810
415066
415322
415578
415834
416090
416346
416602
416858
417114
417370
417626
409691
409947
410203
410459
410715
410971
411227
411483
411739
411995
412251
412507
412763
413019
413275
413531
413787
414043
414299
414555
414811
415067
415323
415579
415835
416091
416347
416603
416859
417115
417371
417627
409692
409948
410204
410460
410716
410972
411228
411484
411740
411996
412252
412508
412764
413020
413276
413532
413788
414044
414300
414556
414812
415068
415324
415580
415836
416092
416348
416604
416860
417116
417372
417628
409693
409949
410205
410461
410717
410973
411229
411485
411741
411997
412253
412509
412765
413021
413277
413533
413789
414045
414301
414557
414813
415069
415325
415581
415837
416093
416349
416605
416861
417117
417373
417629
409694
409950
410206
410462
410718
410974
411230
411486
411742
411998
412254
412510
412766
413022
413278
413534
413790
414046
414302
414558
414814
415070
415326
415582
415838
416094
416350
416606
416862
417118
417374
417630
409695
409951
410207
410463
410719
410975
411231
411487
411743
411999
412255
412511
412767
413023
413279
413535
413791
414047
414303
414559
414815
415071
415327
415583
415839
416095
416351
416607
416863
417119
417375
417631
