0 0 0.859060402685 0.859375 1.35454547405
0 1 0.834057380142 0.85691255331 1.39916062355
0 2 0.800847454391 0.878306865692 1.42168676853
1 0 0.865131557914 0.828897356987 1.394495368
1 1 0.701267665954 0.905153155327 1.57541191578
1 2 0.742537301873 0.87939697504 1.53142857552
2 0 0.733918138888 0.908366560936 1.5
2 1 0.725187763162 0.903354823589 1.52648019791
2 2 0.730627281847 0.888888895512 1.53977274895
3 0 0.80180183969 0.880149841309 1.41702127457
3 1 0.67896825673 0.91465729475 1.61024558544
3 2 0.796000019737 0.844221115112 1.48809528351
4 0 0.644999990004 0.937984466553 1.65289258957
4 1 0.697156260721 0.887109816074 1.61693477631
4 2 0.86324789843 0.80198019743 1.44444441795
5 0 0.772853186872 0.892473101616 1.44979918003
5 1 0.674485348214 0.894400835037 1.65765929222
5 2 0.800847454391 0.888888895512 1.40476191044
6 0 0.937293696922 0.82746475935 1.28936171532
6 1 0.616186157589 0.901017189026 1.80117118359
6 2 0.858407072401 0.865979373455 1.34523808956
7 0 0.805389226444 0.881040871143 1.40928268433
7 1 0.702510884026 0.852713167667 1.66933679581
7 2 0.666666666667 0.917475700378 1.63492059708
8 0 0.694235564497 0.888086616993 1.62195122242
8 1 1.10117145886 0.683877229691 1.32790470123
8 2 0.81318678549 0.828828811646 1.48369562626
9 0 0.676470585863 0.906354486942 1.63099634647
9 1 0.724223592403 0.87138235569 1.58459615707
9 2 0.746527780559 0.906976759434 1.4769231081
10 0 0.821522324877 0.862619817257 1.41111111641
10 1 0.64273172753 0.897684335709 1.7331918478
10 2 0.80575537357 0.861607134342 1.44041454792
11 0 0.747663564729 0.909375011921 1.4707903862
11 1 0.653564433837 0.90020519495 1.69969141483
11 2 0.725752491868 0.91244238615 1.51010096073
12 0 0.897959174935 0.821428596973 1.35573124886
12 1 0.57489496146 0.922490954399 1.88559913635
12 2 0.770270238008 0.903508782387 1.43689322472
13 0 0.708133959983 0.895270287991 1.57735848427
13 1 0.688052830228 0.890017092228 1.63297629356
13 2 0.837545100402 0.86206895113 1.38499999046
14 0 0.73708919899 0.901273906231 1.50530040264
14 1 0.707461081919 0.871893107891 1.62119102478
14 2 0.800675695346 0.894514739513 1.3962264061
15 0 1.03374231466 0.738872408867 1.30923700333
15 1 0.675768362944 0.875700414181 1.68984389305
15 2 0.916030507676 0.833333313465 1.30999994278
16 0 1.01238390803 0.76146787405 1.29718875885
16 1 0.625848878448 0.897913992405 1.77949094772
16 2 0.770226530085 0.886554598808 1.46445500851
17 0 0.774038482832 0.906832277775 1.42465758324
17 1 0.625390738372 0.897500753403 1.7816144228
17 2 0.719197732548 0.924302816391 1.50431036949
18 0 0.971052620917 0.791327893734 1.30136990547
18 1 0.593841247894 0.908063232899 1.85444331169
18 2 0.876582237476 0.866425991058 1.3166667223
19 0 0.784067057737 0.866310179234 1.47222220898
19 1 0.729298758082 0.861499488354 1.59162032604
19 2 0.852941152546 0.851724147797 1.37651824951
20 0 0.839388103607 0.845102488995 1.40970349312
20 1 0.741524707566 0.861153781414 1.56600689888
20 2 0.735714315158 0.912621378899 1.48936164379
21 0 0.884393069678 0.810457527637 1.3951612711
21 1 0.596194327069 0.904598236084 1.85419940948
21 2 0.795673096532 0.873111784458 1.43944633007
22 0 0.788432277326 0.88223940134 1.43763673306
22 1 0.747797731274 0.859682917595 1.55552697182
22 2 0.844827563634 0.868804693222 1.36241614819
23 0 0.789405716001 0.87234044075 1.45215761662
23 1 0.658424709827 0.889106452465 1.7082054615
23 2 0.75625001465 0.89807164669 1.47239267826
24 0 0.861595991918 0.804630994797 1.44244599342
24 1 0.704947730671 0.85503757 1.65904402733
24 2 0.834024873576 0.843283593655 1.421828866
25 0 0.71092278089 0.915231764317 1.53690302372
25 1 0.742986425981 0.866741299629 1.55285048485
25 2 0.829702953649 0.878281593323 1.37228262424
26 0 0.834942082828 0.836994230747 1.43093919754
26 1 0.877506171806 0.790577471256 1.4414691925
26 2 0.747252766831 0.850840330124 1.57283949852
27 0 0.7202521902 0.886214435101 1.5666667223
27 1 0.645933856947 0.879834592342 1.75958764553
27 2 0.75951296185 0.87975949049 1.49658310413
28 0 0.67924528913 0.889957249165 1.65426170826
28 1 0.920894344474 0.750925719738 1.44608294964
28 2 0.86473434334 0.819366872311 1.41136360168
29 0 0.839854431778 0.862405180931 1.38065326214
29 1 0.723519368179 0.862626612186 1.60223782063
29 2 0.801762143169 0.893772900105 1.39549183846
30 0 0.930608361644 0.776302337646 1.38421046734
30 1 0.981479945295 0.731804430485 1.39227020741
30 2 0.928460383802 0.788944721222 1.3651804924
31 0 1.14321295466 0.671023964882 1.30357146263
31 1 0.704616609419 0.832593023777 1.70456814766
31 2 0.746666657172 0.883928596973 1.5151515007
32 0 0.935897455922 0.811955153942 1.31595087051
32 1 0.732208036405 0.868447005749 1.57261407375
32 2 0.703517592997 0.914285719395 1.5546875
33 0 0.806004587206 0.885386824608 1.40129446983
33 1 20311.0002951 4.92344042868e-05 1.0
33 2 1.15151511824 0.652960538864 1.32997477055
34 0 1.64222217589 0.499323397875 1.2195122242
34 1 0.805529519009 0.860550165176 1.4425880909
34 2 0.824858740396 0.897260248661 1.35114502907
35 0 0.78723406851 0.891891896725 1.42424237728
35 1 0.785843918615 0.858475744724 1.48229849339
35 2 0.750328490899 0.851138353348 1.56584358215
36 0 0.79399139356 0.864864885807 1.45624995232
36 1 1.0 0.0 0.0
36 2 0.90333916204 0.826848268509 1.3388235569
37 0 6.35820924936 0.119718313217 1.3137254715
37 1 0.805654075408 0.858571231365 1.44568955898
37 2 0.851729841697 0.841392636299 1.39540231228
38 0 1.0 0.0 0.0
38 1 1.11932369354 0.717738449574 1.24473845959
38 2 1.10826207759 0.766066849232 1.1778523922
39 0 1.29649592042 0.640332639217 1.20454549789
39 1 0.747208037908 0.880290567875 1.52031099796
39 2 0.94918698658 0.790149867535 1.33333337307
40 0 0.939157569097 0.777408659458 1.36965811253
40 1 0.75528503641 0.879732608795 1.50500679016
40 2 0.773809498552 0.878846168518 1.47045946121
41 0 0.85082872704 0.857142865658 1.37121212482
41 1 0.789133920563 0.889725148678 1.42427361012
41 2 3.05188668091 0.28438949585 1.15217387676
42 0 1.22689077105 0.639726042747 1.27408993244
42 1 0.66408861473 0.906233429909 1.66162836552
42 2 0.918533575674 0.82483369112 1.31989252567
43 0 0.77777778808 0.818027198315 1.57172560692
43 1 0.775457889578 0.855746924877 1.50694155693
43 2 0.819548868508 0.869266033173 1.40369391441
44 0 1.0 0.0 0.0
44 1 0.556686603646 0.936556100845 1.91803014278
44 2 1.12573099945 0.706493496895 1.25735294819
45 0 0.756823822235 0.849180340767 1.55598449707
45 1 0.717564181327 0.902153253555 1.54475259781
45 2 0.956873327047 0.797183096409 1.31095409393
46 0 0.917647038232 0.759615361691 1.43459916115
46 1 0.830473762426 0.855721831322 1.40715348721
46 2 1.18981482828 0.677042782307 1.24137926102
47 0 1.29203535189 0.626712322235 1.23497271538
47 1 0.994247224624 0.784106314182 1.28271651268
47 2 1.00523558202 0.770833313465 1.29054057598
48 0 0.881305624577 0.754208743572 1.50446426868
48 1 0.953723760997 0.772175908089 1.35787928104
48 2 0.982658989331 0.752941191196 1.3515625
49 0 0.805232595811 0.841155230999 1.47639489174
49 1 0.60481442959 0.926153540611 1.78523278236
49 2 0.915492962358 0.807692289352 1.35238099098
50 0 0.801775170551 0.826568245888 1.50892853737
50 1 0.822584565969 0.860541164875 1.41269290447
50 2 0.88028166132 0.776000022888 1.46391749382
51 0 0.957020045538 0.682634711266 1.53070175648
51 1 0.698850096689 0.924149692059 1.54836606979
51 2 1.07086614575 0.683823525906 1.36559140682
52 0 1.18238995306 0.595744669437 1.41964280605
52 1 0.711793188324 0.895747900009 1.56841278076
52 2 2.99999991059 0.266666680574 1.25
53 0 1.42704623096 0.468827933073 1.4946808815
53 1 0.932821275146 0.7750223279 1.38320744038
53 2 1.65656560071 0.426829278469 1.41428565979
