0 0 3.40909104302 0.280000001192 1.04761910439
0 1 1.63393158008 0.524908840656 1.16595625877
0 2 1.00751879067 0.567164182663 1.75
1 0 0.742268048535 0.722222208977 1.8653845787
1 1 0.661285323147 0.928401529789 1.62882816792
1 2 0.734767017869 0.653658509254 2.08208966255
2 0 0.67010310596 0.800000011921 1.8653845787
2 1 0.619036349515 0.946643948555 1.70646417141
2 2 0.801136331621 0.695035457611 1.79591834545
3 0 0.844827563634 0.775510191917 1.5263158083
3 1 0.510242987739 0.945361077785 2.07312369347
3 2 0.916666639348 0.622377634048 1.7528090477
4 0 0.585106369622 0.690909087658 2.47368431091
4 1 0.599618953619 0.948951900005 1.75743973255
4 2 0.713286740639 0.72549021244 1.9324324131
5 0 0.613333345032 0.652173936367 2.5
5 1 0.582141838003 0.951109886169 1.80609464645
5 2 0.575757559119 0.705263137817 2.4626865387
6 0 1.0 0.0 0.0
6 1 0.548427803876 0.947596549988 1.92423033714
6 2 0.8 0.734375 1.70212769508
7 0 0.699999983311 0.857142865658 1.66666662693
7 1 0.604030785192 0.921683430672 1.79621839523
7 2 0.685393235476 0.688524603844 2.11904764175
8 0 0.621621631636 0.826086938381 1.94736838341
8 1 0.526948265384 0.960942804813 1.97485172749
8 2 0.730158713579 0.673913061619 2.03225803375
9 0 0.696969689416 0.782608687878 1.83333337307
9 1 0.611939408967 0.945226252079 1.72884392738
9 2 0.588235277618 0.725000023842 2.34482765198
10 0 0.692307705005 0.85185188055 1.69565212727
10 1 0.585454737572 0.947211444378 1.80326581001
10 2 0.882352947364 0.533333361149 2.125
11 0 0.684210539194 0.692307710648 2.11111116409
11 1 0.561533236101 0.954445421696 1.86583590508
11 2 0.687499979511 0.727272748947 2.0
12 0 0.8 0.678571403027 1.84210526943
12 1 0.62883325852 0.942162334919 1.68786919117
12 2 0.749999977648 0.833333313465 1.60000002384
13 0 0.478260889396 0.95454543829 2.19047617912
13 1 0.612939644361 0.951138436794 1.71529388428
13 2 1.0 0.0 0.0
14 0 0.624999990687 0.949999988079 1.68421053886
14 1 0.62783817409 0.934668362141 1.70409870148
14 2 2.0 0.5 1.0
15 0 1.06666666667 0.5625 1.66666662693
15 1 0.606338086757 0.939055085182 1.75628125668
15 2 1.0 0.555555582047 1.79999995232
16 0 0.83333330022 0.699999988079 1.71428573132
16 1 0.550769369962 0.959025800228 1.89321506023
16 2 1.0 0.800000011921 1.25
17 0 0.272727266816 0.833333313465 4.40000009537
17 1 0.560844323762 0.962589323521 1.85232269764
17 2 0.533333333333 0.875 2.14285707474
18 0 6.99999968708 0.142857149243 1.0
18 1 0.804698222147 0.855219006538 1.45308017731
18 2 0.83333330022 0.800000011921 1.5
19 0 0.562499995809 1.0 1.77777779102
19 1 0.653323366487 0.928005099297 1.64938282967
19 2 0.8 0.875 1.42857146263
20 0 1.6 0.625 1.0
20 1 0.79043198104 0.728878557682 1.73572266102
20 2 0.699999983311 0.857142865658 1.66666662693
21 0 0.705882372741 0.75 1.88888883591
21 1 0.570906163454 0.941618800163 1.86020207405
21 2 0.857142886337 0.833333313465 1.39999997616
22 0 0.267857141717 0.866666674614 4.30769252777
22 1 0.363090484611 0.844056963921 3.26297235489
22 2 1.6 0.625 1.0
23 0 0.736842133002 0.857142865658 1.58333337307
23 1 0.595629230495 0.956966519356 1.75439441204
23 2 0.899999957085 0.777777791023 1.42857146263
24 0 0.636363650156 1.0 1.57142853737
24 1 0.629473728918 0.933619022369 1.7015812397
24 2 1.0 0.857142865658 1.16666662693
25 0 1.66666660044 0.533333361149 1.125
25 1 0.675405942852 0.95160639286 1.5558860302
25 2 0.909090889387 0.800000011921 1.375
26 0 0.590909084505 0.769230782986 2.20000004768
26 1 155060.001067 6.44911642667e-06 1.0
26 2 0.83333330022 1.0 1.20000004768
27 0 0.72222220309 0.923076927662 1.5
27 1 0.600144888571 0.941488802433 1.76981842518
27 2 0.636363650156 1.0 1.57142853737
28 0 0.84615388495 0.818181812763 1.44444441795
28 1 0.6700443357 0.915655314922 1.62991309166
28 2 1.24999998137 0.800000011921 1.0
29 0 0.699999983311 1.0 1.42857146263
29 1 0.605056631591 0.96123021841 1.71939861774
29 2 0.857142886337 0.666666686535 1.75
30 0 0.818181827049 0.888888895512 1.375
30 1 0.493223025896 0.963787019253 2.10366034508
30 2 2.0 0.375 1.33333337307
31 0 1.79999991417 0.444444447756 1.25
31 1 0.416926630506 0.793747365475 3.02174687386
31 2 1.0 1.0 1.0
32 0 1.0 0.0 0.0
32 1 0.673677610002 0.932485640049 1.59186327457
32 2 1.0 1.0 1.0
33 0 0.533333333333 1.0 1.875
33 1 0.580411226282 0.961202383041 1.79245960712
33 2 0.857142886337 0.833333313465 1.39999997616
34 0 1.0 0.800000011921 1.25
34 1 0.621489041456 0.953294277191 1.68787205219
34 2 0.699999983311 1.0 1.42857146263
35 0 1.0 0.0 0.0
35 1 0.539658763267 0.962956309319 1.92430627346
35 2 1.39999996662 0.571428596973 1.25
36 0 0.583333327538 0.857142865658 2.0
36 1 0.618457282098 0.92390203476 1.75010609627
36 2 1.0 0.75 1.33333337307
37 0 13.9999993742 0.0714285746217 1.0
37 1 0.668183006107 0.93670296669 1.59772729874
37 2 1.0 0.666666686535 1.5
38 0 1.0 0.0 0.0
38 1 0.523448878732 0.954001128674 2.00251984596
38 2 4.0 0.25 1.0
39 0 1.57142859819 0.54545456171 1.16666662693
39 1 0.653599875959 0.946999907494 1.61561584473
39 2 1.0 0.0 0.0
40 0 0.83333330022 0.800000011921 1.5
40 1 0.835840073973 0.847959280014 1.41091799736
40 2 1.0 0.0 0.0
41 0 1.36363633408 0.600000023842 1.22222220898
41 1 0.612239985642 0.96344846487 1.69531273842
41 2 1.0 0.0 0.0
42 0 1.23076923077 0.5625 1.44444441795
42 1 0.598068026662 0.933058738708 1.79200994968
42 2 1.0 0.0 0.0
43 0 0.83333330022 0.899999976158 1.33333337307
43 1 0.641221663466 0.934827685356 1.66824650764
43 2 2.99999991059 0.333333343267 1.0
44 0 0.687499979511 0.818181812763 1.77777779102
44 1 0.680640752318 0.90630543232 1.6210912466
44 2 1.0 0.0 0.0
45 0 1.09999996722 0.727272748947 1.25
45 1 0.626523941891 0.935244441032 1.70662140846
45 2 1.0 0.0 0.0
46 0 2.0 0.300000011921 1.66666662693
46 1 0.896221388673 0.693842589855 1.60813951492
46 2 1.0 0.0 0.0
47 0 0.666666666667 0.875 1.71428573132
47 1 0.755155919663 0.893839359283 1.48150753975
47 2 1.0 0.0 0.0
48 0 0.600000014305 0.833333313465 2.0
48 1 0.580371913391 0.933937966824 1.84491169453
48 2 1.4999999553 0.333333343267 2.0
49 0 0.769230797446 0.899999976158 1.44444441795
49 1 5.50999147255 0.107553638518 1.68742311001
49 2 1.0 0.0 0.0
50 0 0.84615388495 0.727272748947 1.625
50 1 0.750542779896 0.881253182888 1.51190268993
50 2 0.333333333333 1.0 3.0
51 0 0.71428572645 0.699999988079 2.0
51 1 0.596765846069 0.959969520569 1.74557518959
51 2 1.0 0.0 0.0
52 0 0.357142863225 0.899999976158 3.11111116409
52 1 0.53043588451 0.937433958054 2.01106643677
52 2 1.0 0.0 0.0
53 0 1.0 0.0 0.0
53 1 1.0 0.0 0.0
53 2 1.0 0.0 0.0
