1450032
1450288
1450544
1450800
1451056
1451312
1451568
1451824
1450033
1450289
1450545
1450801
1451057
1451313
1451569
1451825
1450034
1450290
1450546
1450802
1451058
1451314
1451570
1451826
1450035
1450291
1450547
1450803
1451059
1451315
1451571
1451827
1450036
1450292
1450548
1450804
1451060
1451316
1451572
1451828
1450037
1450293
1450549
1450805
1451061
1451317
1451573
1451829
1450038
1450294
1450550
1450806
1451062
1451318
1451574
1451830
1450039
1450295
1450551
1450807
1451063
1451319
1451575
1451831
1579064
1579320
1579576
1579832
1580088
1580344
1580600
1580856
1579065
1579321
1579577
1579833
1580089
1580345
1580601
1580857
1579066
1579322
1579578
1579834
1580090
1580346
1580602
1580858
1579067
1579323
1579579
1579835
1580091
1580347
1580603
1580859
1579068
1579324
1579580
1579836
1580092
1580348
1580604
1580860
1579069
1579325
1579581
1579837
1580093
1580349
1580605
1580861
1579070
1579326
1579582
1579838
1580094
1580350
1580606
1580862
1579071
1579327
1579583
1579839
1580095
1580351
1580607
1580863
2310168
2310424
2310680
2310936
2311192
2311448
2311704
2311960
2310169
2310425
2310681
2310937
2311193
2311449
2311705
2311961
2310170
2310426
2310682
2310938
2311194
2311450
2311706
2311962
2310171
2310427
2310683
2310939
2311195
2311451
2311707
2311963
2310172
2310428
2310684
2310940
2311196
2311452
2311708
2311964
2310173
2310429
2310685
2310941
2311197
2311453
2311709
2311965
2310174
2310430
2310686
2310942
2311198
2311454
2311710
2311966
2310175
2310431
2310687
2310943
2311199
2311455
2311711
2311967
2639912
2640168
2640424
2640680
2640936
2641192
2641448
2641704
2639913
2640169
2640425
2640681
2640937
2641193
2641449
2641705
2639914
2640170
2640426
2640682
2640938
2641194
2641450
2641706
2639915
2640171
2640427
2640683
2640939
2641195
2641451
2641707
2639916
2640172
2640428
2640684
2640940
2641196
2641452
2641708
2639917
2640173
2640429
2640685
2640941
2641197
2641453
2641709
2639918
2640174
2640430
2640686
2640942
2641198
2641454
2641710
2639919
2640175
2640431
2640687
2640943
2641199
2641455
2641711
2709536
2709792
2710048
2710304
2710560
2710816
2711072
2711328
2709537
2709793
2710049
2710305
2710561
2710817
2711073
2711329
2709538
2709794
2710050
2710306
2710562
2710818
2711074
2711330
2709539
2709795
2710051
2710307
2710563
2710819
2711075
2711331
2709540
2709796
2710052
2710308
2710564
2710820
2711076
2711332
2709541
2709797
2710053
2710309
2710565
2710821
2711077
2711333
2709542
2709798
2710054
2710310
2710566
2710822
2711078
2711334
2709543
2709799
2710055
2710311
2710567
2710823
2711079
2711335
