140849
140594
210177
210945
601135
863040
1129770
1255206
1387567
1522735
1583136
1584160
1583394
1584162
1583139
1583651
1583907
1584419
1583396
1584676
1583398
1583654
1583911
1585707
1589039
1589040
1653808
1654326
1779751
1785401
1910309
2564399
2564144
2564400
2563640
2563641
2572345
2637871
2638127
2629680
2637872
2638128
2639920
2703152
2703154
2766108
2768681
2761264
2762035
2761015
2764349
2763070
2764606
2762822
2899759
2899760
2961432
2963224
2957353
2957355
2957611
2957357
2957613
2957358
2957359
2957615
2958127
2958383
3030312
3029039
3029040
3090737
3097137
3097393
3089202
3090738
3089205
3090485
3089462
3089974
3089719
3089975
3090231
3091255
3096887
3090232
3091256
3090233
3091769
3094329
3091258
3089467
3089468
3157569
