0 0 2.99999991059 0.333333343267 1.0
0 1 1.95533771069 0.450417816639 1.13543593884
0 2 1.0 0.666666686535 1.5
1 0 1.0 1.0 1.0
1 1 0.5903321053 0.942562580109 1.79718744755
1 2 0.600000014305 1.0 1.66666662693
2 0 1.0 1.0 1.0
2 1 0.607660634109 0.944624423981 1.74212658405
2 2 0.749999977648 1.0 1.33333337307
3 0 1.0 1.0 1.0
3 1 0.57486135593 0.938322126865 1.85389411449
3 2 1.4999999553 0.666666686535 1.0
4 0 0.374999988824 1.0 2.66666674614
4 1 0.639657312496 0.910993278027 1.7160795927
4 2 1.0 0.666666686535 1.5
5 0 1.0 1.0 1.0
5 1 0.592486532644 0.934319019318 1.80645155907
5 2 0.666666666667 1.0 1.5
6 0 2.0 0.5 1.0
6 1 0.545552298824 0.926217973232 1.97902095318
6 2 0.666666666667 1.0 1.5
7 0 0.666666666667 1.0 1.5
7 1 0.605764280031 0.905692458153 1.82270169258
7 2 0.5 1.0 2.0
8 0 0.600000014305 0.666666686535 2.5
8 1 0.471243796835 0.961751818657 2.20643591881
8 2 1.0 0.5 2.0
9 0 1.0 0.666666686535 1.5
9 1 0.623448774478 0.932560920715 1.71997451782
9 2 0.5 1.0 2.0
10 0 0.333333333333 1.0 3.0
10 1 0.615658989566 0.922074139118 1.76154565811
10 2 0.5 1.0 2.0
11 0 0.5 1.0 2.0
11 1 1.27377621079 0.600329399109 1.30772745609
11 2 0.5 1.0 2.0
12 0 1.0 1.0 1.0
12 1 0.670855236046 0.912216961384 1.6340790987
12 2 0.5 1.0 2.0
13 0 2.0 0.5 1.0
13 1 0.622284508805 0.938907682896 1.71154427528
13 2 0.600000014305 1.0 1.66666662693
14 0 2.0 0.5 1.0
14 1 0.657836652209 0.907997786999 1.67416071892
14 2 0.5 1.0 2.0
15 0 2.0 0.5 1.0
15 1 0.640013867488 0.91698217392 1.70392215252
15 2 1.4999999553 0.666666686535 1.0
16 0 1.0 1.0 1.0
16 1 0.548798579351 0.948108136654 1.92189276218
16 2 0.666666666667 1.0 1.5
17 0 0.5 1.0 2.0
17 1 0.574027991895 0.945001363754 1.84346330166
17 2 0.5 1.0 2.0
18 0 1.0 0.0 0.0
18 1 0.644885844721 0.91542828083 1.69391965866
18 2 0.5 1.0 2.0
19 0 1.0 0.0 0.0
19 1 0.621649501649 0.929519057274 1.73059773445
19 2 0.5 1.0 2.0
20 0 1.0 0.0 0.0
20 1 0.632197803581 0.928610503674 1.70338737965
20 2 0.666666666667 1.0 1.5
21 0 1.0 0.0 0.0
21 1 0.624287457435 0.925013840199 1.73167812824
21 2 1.0 1.0 1.0
22 0 1.0 0.0 0.0
22 1 0.409749654659 0.845927119255 2.88501739502
22 2 1.0 1.0 1.0
23 0 1.0 0.0 0.0
23 1 0.599500595312 0.951618075371 1.75286197662
23 2 0.666666666667 1.0 1.5
24 0 1.0 0.0 0.0
24 1 0.602626638147 0.935242831707 1.77430093288
24 2 1.0 1.0 1.0
25 0 1.0 0.0 0.0
25 1 0.649625934583 0.952975034714 1.61530709267
25 2 0.666666666667 1.0 1.5
26 0 0.5 1.0 2.0
26 1 1.0 0.0 0.0
26 2 1.0 1.0 1.0
27 0 0.5 1.0 2.0
27 1 0.589263426337 0.941283285618 1.80289387703
27 2 0.666666666667 1.0 1.5
28 0 0.5 1.0 2.0
28 1 0.652509654312 0.921761989594 1.66262483597
28 2 0.666666666667 1.0 1.5
29 0 1.0 1.0 1.0
29 1 0.624685129535 0.960685491562 1.66631686687
29 2 0.666666666667 1.0 1.5
30 0 0.5 1.0 2.0
30 1 0.474270003353 0.967145204544 2.18013119698
30 2 1.0 1.0 1.0
31 0 0.5 1.0 2.0
31 1 0.290853030079 0.970916032791 3.54115343094
31 2 1.4999999553 0.666666686535 1.0
32 0 1.0 0.0 0.0
32 1 0.617647050161 0.94308257103 1.71676123142
32 2 0.600000014305 1.0 1.66666662693
33 0 1.0 1.0 1.0
33 1 0.60618481935 0.966195464134 1.70737910271
33 2 0.333333333333 1.0 3.0
34 0 1.0 1.0 1.0
34 1 0.627819566598 0.951197624207 1.67453575134
34 2 1.4999999553 0.666666686535 1.0
35 0 1.0 1.0 1.0
35 1 0.566965705657 0.958745419979 1.83966994286
35 2 0.5 0.75 2.66666674614
36 0 1.0 1.0 1.0
36 1 2.3158551351 0.333153635263 1.29611647129
36 2 0.5 1.0 2.0
37 0 2.0 0.5 1.0
37 1 0.658721383171 0.932398319244 1.62815880775
37 2 2.0 0.5 1.0
38 0 1.0 0.0 0.0
38 1 0.521256664446 0.947193801403 2.02539396286
38 2 1.0 1.0 1.0
39 0 1.0 1.0 1.0
39 1 0.631410263407 0.956006765366 1.65663719177
39 2 0.624999990687 1.0 1.60000002384
40 0 1.24999998137 0.600000023842 1.33333337307
40 1 0.712599922833 0.90705126524 1.54711425304
40 2 0.727272727273 0.875 1.57142853737
41 0 1.39999996662 0.714285731316 1.0
41 1 0.616658375805 0.959720730782 1.68970346451
41 2 11.9999996424 0.0833333358169 1.0
42 0 1.16666665508 0.714285731316 1.20000004768
42 1 0.541781725583 0.95708155632 1.92853140831
42 2 0.611111115158 1.0 1.63636362553
43 0 0.749999977648 0.833333313465 1.60000002384
43 1 0.600358141925 0.939262449741 1.77338337898
43 2 1.29999997675 0.769230782986 1.0
44 0 0.8 1.0 1.25
44 1 0.659229937243 0.91102617979 1.66506886482
44 2 0.600000014305 0.888888895512 1.875
45 0 0.624999990687 0.800000011921 2.0
45 1 0.590566337272 0.945938587189 1.79006314278
45 2 0.84615388495 0.909090936184 1.29999995232
46 0 2.0 0.25 2.0
46 1 0.68399245869 0.912995576859 1.60132694244
46 2 0.624999990687 1.0 1.60000002384
47 0 1.0 0.5 2.0
47 1 0.758098449499 0.879578232765 1.49968457222
47 2 1.0 0.0 0.0
48 0 0.666666666667 1.0 1.5
48 1 0.55286547836 0.929046571255 1.9468973875
48 2 0.874999960884 0.571428596973 2.0
49 0 1.0 0.666666686535 1.5
49 1 0.847648028048 0.776366651058 1.51955902576
49 2 0.538461553275 0.857142865658 2.16666674614
50 0 0.428571443168 1.0 2.33333325386
50 1 0.720212057372 0.873920023441 1.5887953043
50 2 1.4999999553 0.666666686535 1.0
51 0 0.428571443168 1.0 2.33333325386
51 1 0.59474414172 0.952823936939 1.76464438438
51 2 0.8 0.75 1.66666662693
52 0 1.0 1.0 1.0
52 1 0.491336804305 0.931413769722 2.1851336956
52 2 1.20000002861 0.5 1.66666662693
53 0 1.0 0.0 0.0
53 1 1.0 0.0 0.0
53 2 1.0 0.0 0.0
