2375760
2376016
2376272
2376528
2376784
2377040
2377296
2377552
2375761
2376017
2376273
2376529
2376785
2377041
2377297
2377553
2375762
2376018
2376274
2376530
2376786
2377042
2377298
2377554
2375763
2376019
2376275
2376531
2376787
2377043
2377299
2377555
2375764
2376020
2376276
2376532
2376788
2377044
2377300
2377556
2375765
2376021
2376277
2376533
2376789
2377045
2377301
2377557
2375766
2376022
2376278
2376534
2376790
2377046
2377302
2377558
2375767
2376023
2376279
2376535
2376791
2377047
2377303
2377559
