210177
210945
332802
333058
931359
1129770
1188394
1259265
1259564
1387567
1522735
1583394
1583651
1584419
1585707
1779751
1846843
1910309
2512385
2512641
2512897
2513153
2513409
2513665
2513921
2514177
2514433
2514689
3029039
3029040
