140849
140594
601135
863040
1064752
1129770
1188394
1254185
1387567
1522735
1584160
1583394
1584162
1583139
1583651
1583907
1584419
1583396
1584676
1583398
1583654
1583911
1585707
1653808
1654326
1779751
1785401
1910309
2307100
2368304
2564399
2563888
2564144
2564400
2637871
2638127
2629680
2637872
2638128
2639920
2703152
2703154
2765851
2766108
2768681
2761264
2762035
2764349
2763070
2764606
2762822
2961432
2957353
2957357
2957613
2957358
2957359
2957615
2958127
2958383
3030312
3029039
3029040
3090737
3090738
3089205
3090485
3090997
3097141
3089462
3089974
3090742
3089719
3089975
3090231
3091255
3089208
3089464
3090232
3089465
3090233
3091769
3094329
3089467
3089468
3089982
3089983
3089216
3089730
