1450032
1450288
1450544
1450800
1451056
1451312
1451568
1451824
1450033
1450289
1450545
1450801
1451057
1451313
1451569
1451825
1450034
1450290
1450546
1450802
1451058
1451314
1451570
1451826
1450035
1450291
1450547
1450803
1451059
1451315
1451571
1451827
1450036
1450292
1450548
1450804
1451060
1451316
1451572
1451828
1450037
1450293
1450549
1450805
1451061
1451317
1451573
1451829
1450038
1450294
1450550
1450806
1451062
1451318
1451574
1451830
1450039
1450295
1450551
1450807
1451063
1451319
1451575
1451831
1579064
1579320
1579576
1579832
1580088
1580344
1580600
1580856
1579065
1579321
1579577
1579833
1580089
1580345
1580601
1580857
1579066
1579322
1579578
1579834
1580090
1580346
1580602
1580858
1579067
1579323
1579579
1579835
1580091
1580347
1580603
1580859
1579068
1579324
1579580
1579836
1580092
1580348
1580604
1580860
1579069
1579325
1579581
1579837
1580093
1580349
1580605
1580861
1579070
1579326
1579582
1579838
1580094
1580350
1580606
1580862
1579071
1579327
1579583
1579839
1580095
1580351
1580607
1580863
1857536
1857792
1858048
1858304
1858560
1858816
1859072
1859328
1857537
1857793
1858049
1858305
1858561
1858817
1859073
1859329
1857538
1857794
1858050
1858306
1858562
1858818
1859074
1859330
1857539
1857795
1858051
1858307
1858563
1858819
1859075
1859331
1857540
1857796
1858052
1858308
1858564
1858820
1859076
1859332
1857541
1857797
1858053
1858309
1858565
1858821
1859077
1859333
1857542
1857798
1858054
1858310
1858566
1858822
1859078
1859334
1857543
1857799
1858055
1858311
1858567
1858823
1859079
1859335
2639912
2640168
2640424
2640680
2640936
2641192
2641448
2641704
2639913
2640169
2640425
2640681
2640937
2641193
2641449
2641705
2639914
2640170
2640426
2640682
2640938
2641194
2641450
2641706
2639915
2640171
2640427
2640683
2640939
2641195
2641451
2641707
2639916
2640172
2640428
2640684
2640940
2641196
2641452
2641708
2639917
2640173
2640429
2640685
2640941
2641197
2641453
2641709
2639918
2640174
2640430
2640686
2640942
2641198
2641454
2641710
2639919
2640175
2640431
2640687
2640943
2641199
2641455
2641711
3278920
3279176
3279432
3279688
3279944
3280200
3280456
3280712
3278921
3279177
3279433
3279689
3279945
3280201
3280457
3280713
3278922
3279178
3279434
3279690
3279946
3280202
3280458
3280714
3278923
3279179
3279435
3279691
3279947
3280203
3280459
3280715
3278924
3279180
3279436
3279692
3279948
3280204
3280460
3280716
3278925
3279181
3279437
3279693
3279949
3280205
3280461
3280717
3278926
3279182
3279438
3279694
3279950
3280206
3280462
3280718
3278927
3279183
3279439
3279695
3279951
3280207
3280463
3280719
