404025
863040
931359
1064752
1129770
1255971
1255206
1259564
1387567
1522735
1584162
1583651
1583907
1583396
1584676
1583398
1583654
1583911
1585707
1589039
1589040
1653808
1846843
2700080
3029039
3029040
3090737
3090738
3090740
3090485
3090997
3090742
3092022
3092534
3091255
3092535
3358252
3358256
3487022
