0 0 0.666666666667 1.0 1.5
0 1 0.773023900447 0.893058180809 1.44852936268
0 2 0.5 1.0 2.0
1 0 0.666666666667 1.0 1.5
1 1 0.703873903937 0.914179086685 1.55408167839
1 2 0.5 1.0 2.0
2 0 0.666666666667 1.0 1.5
2 1 0.75871884576 0.893058180809 1.47584033012
2 2 1.0 1.0 1.0
3 0 0.666666666667 1.0 1.5
3 1 0.531343275641 0.919475674629 2.04684329033
3 2 1.0 1.0 1.0
4 0 1.0 0.5 2.0
4 1 0.685732652806 0.909090936184 1.60412371159
4 2 1.0 0.0 0.0
5 0 1.0 1.0 1.0
5 1 0.616947181514 0.939793050289 1.72472476959
5 2 1.0 0.0 0.0
6 0 1.4999999553 0.333333343267 2.0
6 1 0.583558667952 0.932344734669 1.83797216415
6 2 1.0 1.0 1.0
7 0 2.0 0.5 1.0
7 1 0.6289566457 0.920782864094 1.72672069073
7 2 1.0 0.0 0.0
8 0 1.0 1.0 1.0
8 1 0.676710589164 0.908163249493 1.62717056274
8 2 1.0 0.0 0.0
9 0 1.0 1.0 1.0
9 1 0.69528730823 0.93036210537 1.54590821266
9 2 1.0 1.0 1.0
10 0 0.4 1.0 2.5
10 1 0.665434364354 0.934259235859 1.60852324963
10 2 1.0 1.0 1.0
11 0 0.333333333333 1.0 3.0
11 1 0.67164180419 0.93240737915 1.59682226181
11 2 1.0 0.0 0.0
12 0 0.666666666667 1.0 1.5
12 1 0.566283935167 0.967741906643 1.82476186752
12 2 0.5 1.0 2.0
13 0 1.0 1.0 1.0
13 1 0.702614385381 0.928372085094 1.53306615353
13 2 1.0 1.0 1.0
14 0 0.5 1.0 2.0
14 1 0.702860875473 0.917668819427 1.55040323734
14 2 1.0 0.5 2.0
15 0 2.0 0.5 1.0
15 1 0.816066035464 0.862925469875 1.42004263401
15 2 2.0 0.5 1.0
16 0 2.0 0.5 1.0
16 1 0.611898030222 0.958333313465 1.70531404018
16 2 1.0 0.5 2.0
17 0 1.0 1.0 1.0
17 1 0.642729954684 0.942751586437 1.65034282207
17 2 0.5 1.0 2.0
18 0 2.0 0.5 1.0
18 1 0.622349558381 0.925414383411 1.73631834984
18 2 0.5 1.0 2.0
19 0 0.5 1.0 2.0
19 1 0.700898585788 0.934065937996 1.52745103836
19 2 0.666666666667 1.0 1.5
20 0 1.0 1.0 1.0
20 1 0.679950185992 0.944139182568 1.55771100521
20 2 0.666666666667 1.0 1.5
21 0 2.0 0.5 1.0
21 1 0.608501134147 0.962316155434 1.70773637295
21 2 0.666666666667 1.0 1.5
22 0 0.5 1.0 2.0
22 1 0.762403888451 0.876260340214 1.49686193466
22 2 2.0 0.5 1.0
23 0 0.666666666667 1.0 1.5
23 1 0.672337735939 0.947516381741 1.56973290443
23 2 2.0 0.5 1.0
24 0 1.0 0.0 0.0
24 1 0.647235575439 0.922934055328 1.67404425144
24 2 2.0 0.5 1.0
25 0 0.666666666667 1.0 1.5
25 1 0.71603263363 0.946869075298 1.47494995594
25 2 0.666666666667 1.0 1.5
26 0 0.666666666667 1.0 1.5
26 1 0.987179482653 0.76530611515 1.32363641262
26 2 0.666666666667 1.0 1.5
27 0 0.666666666667 1.0 1.5
27 1 0.667297960514 0.925260186195 1.61963188648
27 2 1.4999999553 0.666666686535 1.0
28 0 0.666666666667 1.0 1.5
28 1 0.778767660721 0.876072466373 1.46572363377
28 2 1.0 0.666666686535 1.5
29 0 2.0 0.5 1.0
29 1 0.64784054516 0.957948744297 1.61134898663
29 2 0.749999977648 1.0 1.33333337307
30 0 1.0 1.0 1.0
30 1 0.503940882912 0.971652030945 2.04225349426
30 2 1.0 0.5 2.0
31 0 0.666666666667 1.0 1.5
31 1 0.415457051848 0.958451390266 2.51133012772
31 2 1.0 0.5 2.0
32 0 1.0 1.0 1.0
32 1 0.955210284186 0.692822992802 1.51104974747
32 2 0.8 1.0 1.25
33 0 0.666666666667 1.0 1.5
33 1 0.567447027911 0.958742618561 1.83811473846
33 2 0.666666666667 0.833333313465 1.79999995232
34 0 0.333333333333 1.0 3.0
34 1 0.693351433442 0.951076328754 1.51646089554
34 2 0.749999977648 1.0 1.33333337307
35 0 1.0 1.0 1.0
35 1 0.780757091479 0.891919195652 1.43601357937
35 2 1.39999996662 0.571428596973 1.25
36 0 1.0 1.0 1.0
36 1 0.582623506293 0.95321637392 1.80061352253
36 2 0.749999977648 1.0 1.33333337307
37 0 1.0 0.0 0.0
37 1 0.729361090171 0.909448802471 1.50757575035
37 2 1.12499999162 0.777777791023 1.14285719395
38 0 0.666666666667 1.0 1.5
38 1 2.10020044094 0.418893128633 1.13667428493
38 2 1.0 0.625 1.60000002384
39 0 1.4999999553 0.666666686535 1.0
39 1 0.697592059802 0.939086318016 1.526486516
39 2 1.0 0.714285731316 1.39999997616
40 0 0.666666666667 1.0 1.5
40 1 0.7876322531 0.894628107548 1.4191685915
40 2 1.08333332795 0.692307710648 1.33333337307
41 0 1.0 0.5 2.0
41 1 0.703402382741 0.95162987709 1.49392271042
41 2 29.9999984354 0.0333333350718 1.0
42 0 2.0 0.5 1.0
42 1 0.698947397189 0.929718852043 1.53887689114
42 2 0.83333330022 0.839999973774 1.42857146263
43 0 1.0 1.0 1.0
43 1 0.751173735826 0.887499988079 1.5
43 2 0.818181827049 0.833333313465 1.46666669846
44 0 1.0 1.0 1.0
44 1 0.814273407329 0.840549111366 1.46105527878
44 2 1.33333333333 0.625 1.20000004768
45 0 0.666666666667 1.0 1.5
45 1 0.680709516016 0.921824097633 1.5936396122
45 2 0.809523818715 0.823529422283 1.5
46 0 0.454545444693 0.800000011921 2.75
46 1 0.614517262376 0.922018349171 1.76492536068
46 2 4.0 0.25 1.0
47 0 1.24999998137 0.600000023842 1.33333337307
47 1 0.998827641373 0.781690120697 1.28078079224
47 2 6.66666640176 0.15000000596 1.0
48 0 0.666666666667 1.0 1.5
48 1 0.57734805432 0.946172237396 1.83059418201
48 2 0.769230797446 0.899999976158 1.44444441795
49 0 1.0 0.666666686535 1.5
49 1 1.08281830153 0.7100456357 1.30064308643
49 2 0.888888888889 1.0 1.125
50 0 1.0 1.0 1.0
50 1 0.845252089147 0.830790579319 1.42404007912
50 2 0.8 0.875 1.42857146263
51 0 1.4999999553 0.666666686535 1.0
51 1 0.687878770236 0.929515421391 1.56398105621
51 2 1.14285714286 0.75 1.16666662693
52 0 1.0 0.20000000298 5.0
52 1 0.596219921257 0.912103772163 1.83886253834
52 2 2.79999993324 0.285714298487 1.25
53 0 1.0 0.0 0.0
53 1 1.0 0.0 0.0
53 2 1.0 0.0 0.0
