16424
16680
16936
17192
17448
17704
17960
18216
16425
16681
16937
17193
17449
17705
17961
18217
16426
16682
16938
17194
17450
17706
17962
18218
16427
16683
16939
17195
17451
17707
17963
18219
16428
16684
16940
17196
17452
17708
17964
18220
16429
16685
16941
17197
17453
17709
17965
18221
16430
16686
16942
17198
17454
17710
17966
18222
16431
16687
16943
17199
17455
17711
17967
18223
215112
215368
215624
215880
216136
216392
216648
216904
215113
215369
215625
215881
216137
216393
216649
216905
215114
215370
215626
215882
216138
216394
216650
216906
215115
215371
215627
215883
216139
216395
216651
216907
215116
215372
215628
215884
216140
216396
216652
216908
215117
215373
215629
215885
216141
216397
216653
216909
215118
215374
215630
215886
216142
216398
216654
216910
215119
215375
215631
215887
216143
216399
216655
216911
276488
276744
277000
277256
277512
277768
278024
278280
276489
276745
277001
277257
277513
277769
278025
278281
276490
276746
277002
277258
277514
277770
278026
278282
276491
276747
277003
277259
277515
277771
278027
278283
276492
276748
277004
277260
277516
277772
278028
278284
276493
276749
277005
277261
277517
277773
278029
278285
276494
276750
277006
277262
277518
277774
278030
278286
276495
276751
277007
277263
277519
277775
278031
278287
475208
475464
475720
475976
476232
476488
476744
477000
475209
475465
475721
475977
476233
476489
476745
477001
475210
475466
475722
475978
476234
476490
476746
477002
475211
475467
475723
475979
476235
476491
476747
477003
475212
475468
475724
475980
476236
476492
476748
477004
475213
475469
475725
475981
476237
476493
476749
477005
475214
475470
475726
475982
476238
476494
476750
477006
475215
475471
475727
475983
476239
476495
476751
477007
542760
543016
543272
543528
543784
544040
544296
544552
542761
543017
543273
543529
543785
544041
544297
544553
542762
543018
543274
543530
543786
544042
544298
544554
542763
543019
543275
543531
543787
544043
544299
544555
542764
543020
543276
543532
543788
544044
544300
544556
542765
543021
543277
543533
543789
544045
544301
544557
542766
543022
543278
543534
543790
544046
544302
544558
542767
543023
543279
543535
543791
544047
544303
544559
534584
534840
535096
535352
535608
535864
536120
536376
534585
534841
535097
535353
535609
535865
536121
536377
534586
534842
535098
535354
535610
535866
536122
536378
534587
534843
535099
535355
535611
535867
536123
536379
534588
534844
535100
535356
535612
535868
536124
536380
534589
534845
535101
535357
535613
535869
536125
536381
534590
534846
535102
535358
535614
535870
536126
536382
534591
534847
535103
535359
535615
535871
536127
536383
860176
860432
860688
860944
861200
861456
861712
861968
860177
860433
860689
860945
861201
861457
861713
861969
860178
860434
860690
860946
861202
861458
861714
861970
860179
860435
860691
860947
861203
861459
861715
861971
860180
860436
860692
860948
861204
861460
861716
861972
860181
860437
860693
860949
861205
861461
861717
861973
860182
860438
860694
860950
861206
861462
861718
861974
860183
860439
860695
860951
861207
861463
861719
861975
1001528
1001784
1002040
1002296
1002552
1002808
1003064
1003320
1001529
1001785
1002041
1002297
1002553
1002809
1003065
1003321
1001530
1001786
1002042
1002298
1002554
1002810
1003066
1003322
1001531
1001787
1002043
1002299
1002555
1002811
1003067
1003323
1001532
1001788
1002044
1002300
1002556
1002812
1003068
1003324
1001533
1001789
1002045
1002301
1002557
1002813
1003069
1003325
1001534
1001790
1002046
1002302
1002558
1002814
1003070
1003326
1001535
1001791
1002047
1002303
1002559
1002815
1003071
1003327
1067072
1067328
1067584
1067840
1068096
1068352
1068608
1068864
1067073
1067329
1067585
1067841
1068097
1068353
1068609
1068865
1067074
1067330
1067586
1067842
1068098
1068354
1068610
1068866
1067075
1067331
1067587
1067843
1068099
1068355
1068611
1068867
1067076
1067332
1067588
1067844
1068100
1068356
1068612
1068868
1067077
1067333
1067589
1067845
1068101
1068357
1068613
1068869
1067078
1067334
1067590
1067846
1068102
1068358
1068614
1068870
1067079
1067335
1067591
1067847
1068103
1068359
1068615
1068871
1187888
1188144
1188400
1188656
1188912
1189168
1189424
1189680
1187889
1188145
1188401
1188657
1188913
1189169
1189425
1189681
1187890
1188146
1188402
1188658
1188914
1189170
1189426
1189682
1187891
1188147
1188403
1188659
1188915
1189171
1189427
1189683
1187892
1188148
1188404
1188660
1188916
1189172
1189428
1189684
1187893
1188149
1188405
1188661
1188917
1189173
1189429
1189685
1187894
1188150
1188406
1188662
1188918
1189174
1189430
1189686
1187895
1188151
1188407
1188663
1188919
1189175
1189431
1189687
1323040
1323296
1323552
1323808
1324064
1324320
1324576
1324832
1323041
1323297
1323553
1323809
1324065
1324321
1324577
1324833
1323042
1323298
1323554
1323810
1324066
1324322
1324578
1324834
1323043
1323299
1323555
1323811
1324067
1324323
1324579
1324835
1323044
1323300
1323556
1323812
1324068
1324324
1324580
1324836
1323045
1323301
1323557
1323813
1324069
1324325
1324581
1324837
1323046
1323302
1323558
1323814
1324070
1324326
1324582
1324838
1323047
1323303
1323559
1323815
1324071
1324327
1324583
1324839
1712208
1712464
1712720
1712976
1713232
1713488
1713744
1714000
1712209
1712465
1712721
1712977
1713233
1713489
1713745
1714001
1712210
1712466
1712722
1712978
1713234
1713490
1713746
1714002
1712211
1712467
1712723
1712979
1713235
1713491
1713747
1714003
1712212
1712468
1712724
1712980
1713236
1713492
1713748
1714004
1712213
1712469
1712725
1712981
1713237
1713493
1713749
1714005
1712214
1712470
1712726
1712982
1713238
1713494
1713750
1714006
1712215
1712471
1712727
1712983
1713239
1713495
1713751
1714007
1849392
1849648
1849904
1850160
1850416
1850672
1850928
1851184
1849393
1849649
1849905
1850161
1850417
1850673
1850929
1851185
1849394
1849650
1849906
1850162
1850418
1850674
1850930
1851186
1849395
1849651
1849907
1850163
1850419
1850675
1850931
1851187
1849396
1849652
1849908
1850164
1850420
1850676
1850932
1851188
1849397
1849653
1849909
1850165
1850421
1850677
1850933
1851189
1849398
1849654
1849910
1850166
1850422
1850678
1850934
1851190
1849399
1849655
1849911
1850167
1850423
1850679
1850935
1851191
1845320
1845576
1845832
1846088
1846344
1846600
1846856
1847112
1845321
1845577
1845833
1846089
1846345
1846601
1846857
1847113
1845322
1845578
1845834
1846090
1846346
1846602
1846858
1847114
1845323
1845579
1845835
1846091
1846347
1846603
1846859
1847115
1845324
1845580
1845836
1846092
1846348
1846604
1846860
1847116
1845325
1845581
1845837
1846093
1846349
1846605
1846861
1847117
1845326
1845582
1845838
1846094
1846350
1846606
1846862
1847118
1845327
1845583
1845839
1846095
1846351
1846607
1846863
1847119
1972272
1972528
1972784
1973040
1973296
1973552
1973808
1974064
1972273
1972529
1972785
1973041
1973297
1973553
1973809
1974065
1972274
1972530
1972786
1973042
1973298
1973554
1973810
1974066
1972275
1972531
1972787
1973043
1973299
1973555
1973811
1974067
1972276
1972532
1972788
1973044
1973300
1973556
1973812
1974068
1972277
1972533
1972789
1973045
1973301
1973557
1973813
1974069
1972278
1972534
1972790
1973046
1973302
1973558
1973814
1974070
1972279
1972535
1972791
1973047
1973303
1973559
1973815
1974071
2107440
2107696
2107952
2108208
2108464
2108720
2108976
2109232
2107441
2107697
2107953
2108209
2108465
2108721
2108977
2109233
2107442
2107698
2107954
2108210
2108466
2108722
2108978
2109234
2107443
2107699
2107955
2108211
2108467
2108723
2108979
2109235
2107444
2107700
2107956
2108212
2108468
2108724
2108980
2109236
2107445
2107701
2107957
2108213
2108469
2108725
2108981
2109237
2107446
2107702
2107958
2108214
2108470
2108726
2108982
2109238
2107447
2107703
2107959
2108215
2108471
2108727
2108983
2109239
2299952
2300208
2300464
2300720
2300976
2301232
2301488
2301744
2299953
2300209
2300465
2300721
2300977
2301233
2301489
2301745
2299954
2300210
2300466
2300722
2300978
2301234
2301490
2301746
2299955
2300211
2300467
2300723
2300979
2301235
2301491
2301747
2299956
2300212
2300468
2300724
2300980
2301236
2301492
2301748
2299957
2300213
2300469
2300725
2300981
2301237
2301493
2301749
2299958
2300214
2300470
2300726
2300982
2301238
2301494
2301750
2299959
2300215
2300471
2300727
2300983
2301239
2301495
2301751
2498560
2498816
2499072
2499328
2499584
2499840
2500096
2500352
2498561
2498817
2499073
2499329
2499585
2499841
2500097
2500353
2498562
2498818
2499074
2499330
2499586
2499842
2500098
2500354
2498563
2498819
2499075
2499331
2499587
2499843
2500099
2500355
2498564
2498820
2499076
2499332
2499588
2499844
2500100
2500356
2498565
2498821
2499077
2499333
2499589
2499845
2500101
2500357
2498566
2498822
2499078
2499334
2499590
2499846
2500102
2500358
2498567
2498823
2499079
2499335
2499591
2499847
2500103
2500359
2498600
2498856
2499112
2499368
2499624
2499880
2500136
2500392
2498601
2498857
2499113
2499369
2499625
2499881
2500137
2500393
2498602
2498858
2499114
2499370
2499626
2499882
2500138
2500394
2498603
2498859
2499115
2499371
2499627
2499883
2500139
2500395
2498604
2498860
2499116
2499372
2499628
2499884
2500140
2500396
2498605
2498861
2499117
2499373
2499629
2499885
2500141
2500397
2498606
2498862
2499118
2499374
2499630
2499886
2500142
2500398
2498607
2498863
2499119
2499375
2499631
2499887
2500143
2500399
