20292
20548
22084
22340
20293
20549
22085
22341
20294
20550
22086
22342
20295
20551
22087
22343
20296
20552
22088
22344
20298
20554
22090
22346
20301
20557
22093
22349
20304
20560
22096
22352
20305
20561
22097
22353
20306
20562
22098
22354
20307
20563
22099
22355
20309
20565
22101
22357
20311
20567
22103
22359
20314
20570
22106
22362
5632
5888
14080
14336
21504
21760
5727
5983
14175
14431
21599
21855
85828
87108
87620
87876
88132
85829
87109
87621
87877
88133
85830
87110
87622
87878
88134
85831
87111
87623
87879
88135
85832
87112
87624
87880
88136
85836
87116
87628
87884
88140
85837
87117
87629
87885
88141
85839
87119
87631
87887
88143
85840
87120
87632
87888
88144
85841
87121
87633
87889
88145
85842
87122
87634
87890
88146
85847
87127
87639
87895
88151
85848
87128
87640
87896
88152
85849
87129
87641
87897
88153
71168
71424
79616
79872
87040
87296
71263
71519
79711
79967
87135
87391
153156
153412
153668
153157
153413
153669
153158
153414
153670
153159
153415
153671
153160
153416
153672
153161
153417
153673
153162
153418
153674
153165
153421
153677
153167
153423
153679
153168
153424
153680
153169
153425
153681
153174
153430
153686
153176
153432
153688
153177
153433
153689
153178
153434
153690
136704
136960
145152
145408
152576
152832
136799
137055
145247
145503
152671
152927
216901
218949
219205
216902
218950
219206
216903
218951
219207
216904
218952
219208
216905
218953
219209
216906
218954
219210
216909
218957
219213
216911
218959
219215
216912
218960
219216
216913
218961
219217
216917
218965
219221
216920
218968
219224
216921
218969
219225
216922
218970
219226
202240
202496
210688
210944
218112
218368
202335
202591
210783
211039
218207
218463
284228
284484
284740
284229
284485
284741
284230
284486
284742
284231
284487
284743
284232
284488
284744
284233
284489
284745
284239
284495
284751
284240
284496
284752
284241
284497
284753
284249
284505
284761
267776
268032
276224
276480
283648
283904
267871
268127
276319
276575
283743
283999
347716
347972
348228
348484
348996
349764
350020
350276
347717
347973
348229
348485
348997
349765
350021
350277
347718
347974
348230
348486
348998
349766
350022
350278
347719
347975
348231
348487
348999
349767
350023
350279
347720
347976
348232
348488
349000
349768
350024
350280
347721
347977
348233
348489
349001
349769
350025
350281
347724
347980
348236
348492
349004
349772
350028
350284
347725
347981
348237
348493
349005
349773
350029
350285
347727
347983
348239
348495
349007
349775
350031
350287
347728
347984
348240
348496
349008
349776
350032
350288
347734
347990
348246
348502
349014
349782
350038
350294
347735
347991
348247
348503
349015
349783
350039
350295
347736
347992
348248
348504
349016
349784
350040
350296
347737
347993
348249
348505
349017
349785
350041
350297
333312
333568
341760
342016
349184
349440
333407
333663
341855
342111
349279
349535
398848
399104
407296
407552
414720
414976
398943
399199
407391
407647
414815
415071
475204
475460
475716
475972
476228
476484
476740
476996
481092
481348
475205
475461
475717
475973
476229
476485
476741
476997
481093
481349
475206
475462
475718
475974
476230
476486
476742
476998
481094
481350
475207
475463
475719
475975
476231
476487
476743
476999
481095
481351
481096
481352
481097
481353
481098
481354
481099
481355
481100
481356
481101
481357
481102
481358
481103
481359
475216
475472
475728
475984
476240
476496
476752
477008
481104
481360
475473
475729
475985
476241
476497
476753
477009
481105
481361
475478
475734
475990
476246
476502
476758
477014
481110
481366
475479
475735
475991
476247
476503
476759
477015
481111
481367
475736
475992
476248
476504
476760
477016
481112
481368
464384
464640
472832
473088
480256
480512
464479
464735
472927
473183
480351
480607
540740
540996
541252
541508
541764
542020
542276
542532
546372
546628
546884
540741
540997
541253
541509
541765
542021
542277
542533
546373
546629
546885
540742
540998
541254
541510
541766
542022
542278
542534
546374
546630
546886
540743
540999
541255
541511
541767
542023
542279
542535
546375
546631
546887
540744
541000
541256
541512
541768
542024
542280
542536
546376
546632
546888
540745
541001
541257
541513
541769
542025
542281
542537
546377
546633
546889
540752
541008
541264
541520
541776
542032
542288
542544
546384
546640
546896
540753
541009
541265
541521
541777
542033
542289
542545
546385
546641
546897
540758
541014
541270
541526
541782
542038
542294
542550
546390
546646
546902
546392
546648
546904
546393
546649
546905
546394
546650
546906
546395
546651
546907
529920
530176
538368
538624
545792
546048
530015
530271
538463
538719
545887
546143
611908
612420
611909
612421
611910
612422
611911
612423
611912
612424
611913
612425
611917
612429
611919
612431
611920
612432
611924
612436
611927
612439
611928
612440
595456
595712
603904
604160
611328
611584
595551
595807
603999
604255
611423
611679
675908
676676
676932
677188
677444
677700
677956
675909
676677
676933
677189
677445
677701
677957
675910
676678
676934
677190
677446
677702
677958
675911
676679
676935
677191
677447
677703
677959
675912
676680
676936
677192
677448
677704
677960
675913
676681
676937
677193
677449
677705
677961
675920
676688
676944
677200
677456
677712
677968
660992
661248
669440
669696
676864
677120
661087
661343
669535
669791
676959
677215
743492
743493
743494
743495
743496
743497
743498
743504
743505
743511
743512
743513
726528
726784
734976
735232
742400
742656
726623
726879
735071
735327
742495
742751
809028
803141
809029
803142
809030
809031
809032
802889
803145
809033
803146
809034
809035
809036
809037
802895
809039
802896
809040
802897
809041
809042
802901
809045
809046
809048
809049
792064
792320
800512
800768
807936
808192
792159
792415
800607
800863
808031
808287
873284
874308
874564
873285
874309
874565
873286
874310
874566
873287
874311
874567
873288
874312
874568
873289
874313
874569
873296
874320
874576
873297
874321
874577
873299
874323
874579
857600
857856
866048
866304
873472
873728
857695
857951
866143
866399
873567
873823
933956
933957
933958
933959
933960
933961
933967
933968
933970
933973
933975
933977
923136
923392
931584
931840
939008
939264
923231
923487
931679
931935
939103
939359
1005636
1005637
1005638
1005639
1005640
1005641
1005642
1005644
1005645
1005647
1005648
1005649
1005650
1005651
1005653
1005654
1005655
1005656
1005657
988672
988928
997120
997376
1004544
1004800
988767
989023
997215
997471
1004639
1004895
1071171
1071172
1071173
1071174
1071175
1067080
1067336
1067592
1067848
1068104
1068360
1068616
1068872
1071176
1067081
1067337
1067593
1067849
1068105
1068361
1068617
1068873
1071177
1067083
1067339
1067595
1067851
1068107
1068363
1068619
1068875
1071179
1067084
1067340
1067596
1068108
1068364
1068620
1068876
1071180
1067089
1067345
1067601
1067857
1068113
1068369
1068625
1068881
1071185
1067094
1067350
1067606
1067862
1068118
1068374
1068630
1068886
1071190
1067096
1067352
1067608
1067864
1068120
1068376
1068632
1068888
1071192
1067097
1067353
1067609
1067865
1068121
1068377
1068633
1068889
1071193
1054208
1054464
1062656
1062912
1070080
1070336
1054303
1054559
1062751
1063007
1070175
1070431
1119744
1120000
1128192
1128448
1135616
1135872
1119839
1120095
1128287
1128543
1135711
1135967
1199684
1199940
1200196
1200452
1201476
1202244
1199692
1199948
1200204
1200460
1201484
1202252
1199693
1199949
1200205
1200461
1201485
1202253
1199696
1199952
1200208
1200464
1201488
1202256
1199704
1199960
1200216
1200472
1201496
1202264
1199705
1199961
1200217
1200473
1201497
1202265
1199706
1199962
1200218
1200474
1201498
1202266
1185280
1185536
1193728
1193984
1201152
1201408
1185375
1185631
1193823
1194079
1201247
1201503
1261636
1267780
1268036
1261637
1267781
1268037
1267782
1268038
1261640
1267784
1268040
1261641
1267785
1268041
1261648
1267792
1268048
1250816
1251072
1259264
1259520
1266688
1266944
1250911
1251167
1259359
1259615
1266783
1267039
1332039
1332295
1332551
1332807
1332043
1332299
1332555
1332811
1332044
1332300
1332556
1332812
1332047
1332303
1332559
1332815
1332051
1332307
1332563
1332819
1332054
1332310
1332566
1332822
1332055
1332311
1332567
1332823
1316352
1316608
1324800
1325056
1332224
1332480
1316447
1316703
1324895
1325151
1332319
1332575
1381888
1382144
1390336
1390592
1397760
1398016
1381983
1382239
1390431
1390687
1397855
1398111
1462598
1462599
1462600
1462601
1462617
1447424
1447680
1455872
1456128
1463296
1463552
1447519
1447775
1455967
1456223
1463391
1463647
1529924
1529925
1529926
1529927
1529928
1529929
1529932
1512960
1513216
1521408
1521664
1528832
1529088
1513055
1513311
1521503
1521759
1528927
1529183
1590340
1595204
1595460
1590341
1595205
1595461
1590086
1590342
1595206
1595462
1590343
1595207
1595463
1595208
1595464
1590345
1595209
1595465
1590346
1595210
1595466
1595211
1595467
1589836
1590092
1590348
1595212
1595468
1590093
1595213
1595469
1589582
1590350
1595214
1595470
1589583
1589839
1590095
1590351
1595215
1595471
1589840
1590096
1590352
1595216
1595472
1590097
1590353
1595217
1595473
1589586
1590354
1595218
1595474
1589587
1590099
1590355
1595219
1595475
1589844
1590100
1590356
1595220
1595476
1589846
1590102
1590358
1595222
1595478
1595225
1595481
1578496
1578752
1586944
1587200
1594368
1594624
1578591
1578847
1587039
1587295
1594463
1594719
1660996
1660997
1660998
1661000
1661001
1661008
1661009
1661010
1661016
1661017
1661018
1644032
1644288
1652480
1652736
1659904
1660160
1644127
1644383
1652575
1652831
1659999
1660255
1725766
1726534
1726536
1725769
1726537
1725776
1726544
1725777
1726545
1725778
1726546
1725779
1726547
1725780
1726548
1725781
1726549
1725782
1726550
1725783
1726551
1725784
1726552
1725785
1726553
1709568
1709824
1718016
1718272
1725440
1725696
1709663
1709919
1718111
1718367
1725535
1725791
1791044
1792068
1791045
1792069
1791046
1792070
1791047
1792071
1791048
1792072
1791049
1792073
1791051
1792075
1791052
1792076
1791057
1792081
1791058
1792082
1775104
1775360
1783552
1783808
1790976
1791232
1775199
1775455
1783647
1783903
1791071
1791327
1853509
1853765
1854021
1854277
1854533
1854789
1855045
1855301
1856325
1853510
1853766
1854022
1854278
1854534
1854790
1855046
1855302
1853511
1853767
1854023
1854279
1854535
1854791
1855047
1855303
1856327
1853512
1853768
1854024
1854280
1854536
1854792
1855048
1855304
1856328
1853513
1853769
1854025
1854281
1854537
1854793
1855049
1855305
1856329
1853524
1853780
1854036
1854292
1854548
1854804
1855060
1855316
1856340
1856344
1856345
1856346
1856347
1840640
1840896
1849088
1849344
1856512
1856768
1840735
1840991
1849183
1849439
1856607
1856863
1922116
1922117
1922118
1922119
1922120
1922121
1922122
1922123
1922128
1922134
1922136
1922137
1906176
1906432
1914624
1914880
1922048
1922304
1906271
1906527
1914719
1914975
1922143
1922399
1988932
1988933
1988934
1988935
1988936
1988937
1988938
1988945
1988952
1988953
1971712
1971968
1980160
1980416
1987584
1987840
1971807
1972063
1980255
1980511
1987679
1987935
2054212
2054213
2048070
2048326
2054214
2048327
2054215
2048072
2048328
2054216
2048329
2054217
2048330
2054218
2048331
2054219
2048332
2054220
2048334
2054222
2048337
2054225
2054233
2037248
2037504
2045696
2045952
2053120
2053376
2037343
2037599
2045791
2046047
2053215
2053471
2113860
2119748
2113861
2119749
2113862
2119750
2113863
2119751
2113864
2119752
2113865
2119753
2113866
2119754
2113867
2119755
2113870
2119758
2113874
2119762
2119763
2119764
2119765
2102784
2103040
2111232
2111488
2118656
2118912
2102879
2103135
2111327
2111583
2118751
2119007
2168320
2168576
2176768
2177024
2184192
2184448
2168415
2168671
2176863
2177119
2184287
2184543
2233856
2234112
2242304
2242560
2249728
2249984
2233951
2234207
2242399
2242655
2249823
2250079
2299392
2299648
2307840
2308096
2315264
2315520
2299487
2299743
2307935
2308191
2315359
2315615
2364928
2365184
2373376
2373632
2380800
2381056
2365023
2365279
2373471
2373727
2380895
2381151
2445893
2447429
2445894
2447430
2445896
2447432
2445897
2447433
2445898
2447434
2445899
2447435
2447445
2447446
2445913
2447449
2445914
2447450
2430464
2430720
2438912
2439168
2446336
2446592
2430559
2430815
2439007
2439263
2446431
2446687
2508612
2509380
2512964
2508613
2509381
2512965
2508614
2509382
2512966
2508615
2509383
2512967
2508616
2509384
2512968
2508617
2509385
2512969
2508618
2509386
2512970
2508619
2509387
2512971
2508620
2509388
2512972
2508622
2509390
2512974
2508625
2509393
2512977
2508627
2509395
2512979
2508632
2509400
2512984
2508633
2509401
2512985
2508634
2509402
2512986
2496000
2496256
2504448
2504704
2511872
2512128
2496095
2496351
2504543
2504799
2511967
2512223
2572613
2572869
2573125
2574661
2578501
2572615
2572871
2573127
2574663
2578503
2572626
2572882
2573138
2574674
2578514
2572627
2572883
2573139
2574675
2578515
2572628
2572884
2573140
2574676
2578516
2572629
2572885
2573141
2574677
2578517
2572886
2573142
2574678
2578518
2572887
2573143
2574679
2578519
2572632
2572888
2573144
2574680
2578520
2572633
2573145
2574681
2578521
2561536
2561792
2569984
2570240
2577408
2577664
2561631
2561887
2570079
2570335
2577503
2577759
2637893
2644037
2637894
2644038
2637895
2644039
2637896
2644040
2637897
2644041
2637901
2644045
2637905
2644049
2644050
2637907
2644051
2637908
2644052
2637909
2644053
2637910
2644054
2637911
2644055
2644057
2627072
2627328
2635520
2635776
2642944
2643200
2627167
2627423
2635615
2635871
2643039
2643295
2709316
2709572
2709317
2709573
2709318
2709574
2709319
2709575
2709321
2709577
2709322
2709578
2709323
2709579
2709324
2709580
2709325
2709581
2709329
2709585
2709330
2709586
2709331
2709587
2709335
2709591
2709336
2709592
2709337
2709593
2692608
2692864
2701056
2701312
2708480
2708736
2692703
2692959
2701151
2701407
2708575
2708831
2758144
2758400
2766592
2766848
2774016
2774272
2758239
2758495
2766687
2766943
2774111
2774367
2835780
2840644
2835781
2840645
2835782
2840646
2835783
2840647
2835784
2840648
2835785
2840649
2835787
2840651
2835788
2840652
2835789
2840653
2835792
2840656
2835793
2840657
2835794
2840658
2835796
2840660
2835798
2840662
2835799
2840663
2835800
2840664
2835801
2840665
2823680
2823936
2832128
2832384
2839552
2839808
2823775
2824031
2832223
2832479
2839647
2839903
2904389
2905669
2905925
2906181
2906437
2904390
2905670
2905926
2906182
2906438
2904391
2905671
2905927
2906183
2906439
2904392
2905672
2905928
2906184
2906440
2904393
2905673
2905929
2906185
2906441
2904394
2905674
2905930
2906186
2906442
2904395
2905675
2905931
2906187
2906443
2904396
2905676
2905932
2906188
2906444
2904397
2905677
2905933
2906189
2906445
2904398
2905678
2905934
2906190
2906446
2904399
2905679
2905935
2906191
2906447
2904400
2905680
2905936
2906192
2906448
2904401
2905681
2905937
2906193
2906449
2904402
2905682
2905938
2906194
2906450
2904403
2905683
2905939
2906195
2906451
2904404
2905684
2905940
2906196
2906452
2904405
2905685
2905941
2906197
2906453
2904406
2905686
2905942
2906198
2906454
2904407
2905687
2905943
2906199
2906455
2904408
2905688
2906200
2906456
2904409
2905689
2905945
2906201
2905690
2905946
2906202
2904411
2905691
2905947
2905948
2906204
2889216
2889472
2897664
2897920
2905088
2905344
2889311
2889567
2897759
2898015
2905183
2905439
2965572
2971460
2971716
2971972
2965573
2971461
2971717
2971973
2965574
2971462
2971718
2971974
2965575
2971463
2971719
2971975
2971465
2971721
2971977
2971467
2971723
2971979
2971469
2971725
2971981
2971471
2971727
2971983
2965584
2971472
2971728
2971984
2971473
2971729
2971985
2971474
2971730
2971986
2971480
2971736
2971992
2954752
2955008
2963200
2963456
2970624
2970880
2954847
2955103
2963295
2963551
2970719
2970975
3032901
3037253
3032902
3037254
3032904
3037256
3032905
3037257
3032906
3037258
3032907
3037259
3032908
3037260
3032909
3037261
3032910
3037262
3032912
3037264
3032913
3037265
3032914
3037266
3032915
3037267
3032918
3037270
3032919
3037271
3032920
3037272
3032921
3032922
3020288
3020544
3028736
3028992
3036160
3036416
3020383
3020639
3028831
3029087
3036255
3036511
3098691
3098947
3099203
3099715
3100227
3100483
3096900
3097412
3097924
3098180
3098436
3098948
3099204
3099460
3100228
3100484
3102276
3102532
3102788
3103044
3096645
3098693
3098949
3099205
3099717
3099973
3100229
3100485
3102277
3102533
3102789
3103045
3096646
3096902
3098950
3099206
3099462
3099718
3099974
3100230
3100486
3102278
3102534
3102790
3103046
3096647
3097159
3098183
3098439
3098695
3098951
3099207
3099463
3099719
3099975
3100231
3100487
3102279
3102535
3102791
3103047
3096648
3097672
3098184
3098440
3098696
3098952
3099208
3099464
3099720
3100488
3102280
3102536
3102792
3103048
3098697
3099465
3099977
3100233
3100489
3102281
3102537
3102793
3103049
3096650
3096906
3098698
3098954
3099210
3099722
3099978
3100234
3100490
3102282
3102538
3102794
3103050
3096651
3098699
3098955
3099467
3099723
3099979
3100235
3100491
3102283
3102539
3102795
3103051
3098188
3098444
3099212
3099468
3099724
3099980
3102284
3102540
3102796
3103052
3096653
3096909
3097421
3097933
3098957
3099213
3099469
3099981
3100237
3100493
3102285
3102541
3102797
3103053
3096654
3097422
3097678
3098702
3099214
3099726
3099982
3100238
3100494
3102286
3102542
3102798
3103054
3096655
3097935
3099215
3099471
3099727
3099983
3102287
3102543
3102799
3103055
3096656
3096912
3097680
3097936
3098960
3099216
3099728
3100240
3100496
3102288
3102544
3102800
3103056
3097425
3097681
3098449
3098705
3099217
3099729
3099985
3100241
3100497
3102289
3102545
3102801
3103057
3096658
3097170
3097938
3098194
3098450
3098706
3098962
3099218
3099474
3099730
3099986
3100242
3100498
3102290
3102546
3102802
3103058
3097683
3098451
3098707
3098963
3099219
3099731
3099987
3100243
3100499
3102291
3102547
3102803
3103059
3098452
3098708
3099476
3099732
3099988
3100244
3100500
3102292
3102548
3102804
3103060
3096661
3097429
3097941
3098453
3098709
3098965
3099221
3099477
3099733
3099989
3100245
3100501
3102293
3102549
3102805
3103061
3097942
3098454
3099478
3099734
3099990
3100246
3100502
3102294
3102550
3102806
3103062
3098967
3099735
3099991
3100247
3100503
3102295
3102551
3102807
3103063
3097432
3097688
3098456
3098712
3098968
3099480
3099736
3099992
3100248
3100504
3102296
3102552
3102808
3103064
3097433
3097945
3098457
3098713
3098969
3099481
3099737
3099993
3100249
3100505
3102297
3102553
3102809
3103065
3097434
3098202
3098458
3098714
3098970
3099482
3099738
3099994
3100250
3100506
3102298
3102554
3102810
3103066
3097947
3098203
3098459
3098715
3098971
3099483
3099739
3099995
3100251
3100507
3102299
3102555
3102811
3085824
3086080
3094272
3094528
3101696
3101952
3085919
3086175
3094367
3094623
3101791
3102047
3167812
3168068
3168324
3167813
3168069
3168325
3167814
3168070
3168326
3167815
3168071
3168327
3167816
3168072
3168328
3167817
3168073
3168329
3167818
3168074
3168330
3167819
3168075
3168331
3167820
3168076
3168332
3167821
3168077
3168333
3167822
3168078
3168334
3167823
3168079
3168335
3167824
3168080
3168336
3167825
3168081
3168337
3167828
3168084
3168340
3167834
3168090
3168346
3151360
3151616
3159808
3160064
3167232
3167488
3151455
3151711
3159903
3160159
3167327
3167583
3233348
3233604
3233860
3234372
3233349
3233605
3233861
3234373
3233350
3233606
3233862
3233351
3233607
3233863
3233352
3233608
3233864
3233353
3233609
3233865
3233354
3233610
3233866
3233355
3233611
3233867
3233356
3233612
3233868
3233357
3233613
3233869
3233359
3233615
3233871
3233360
3233616
3233872
3233361
3233617
3233873
3233362
3233618
3233874
3233363
3233619
3233875
3233364
3233620
3233876
3233368
3233624
3233880
3233369
3233625
3233881
3233370
3233626
3233882
3233371
3233627
3233883
3216896
3217152
3225344
3225600
3232768
3233024
3216991
3217247
3225439
3225695
3232863
3233119
3293253
3293509
3298373
3299397
3293254
3293510
3298374
3299398
3293255
3293511
3298375
3299399
3293259
3293515
3298379
3299403
3293260
3293516
3298380
3299404
3293265
3293521
3298385
3299409
3293266
3293522
3298386
3299410
3293523
3298387
3299411
3293525
3298389
3299413
3282432
3282688
3290880
3291136
3298304
3298560
3282527
3282783
3290975
3291231
3298399
3298655
3359300
3364676
3364932
3365444
3359301
3364677
3364933
3365445
3359302
3364678
3364934
3365446
3359303
3364679
3364935
3365447
3359306
3364682
3364938
3365450
3359307
3364683
3364939
3365451
3359308
3364684
3364940
3365452
3359309
3364685
3364941
3365453
3359311
3364687
3364943
3365455
3359313
3364689
3364945
3365457
3359314
3364690
3364946
3365458
3359315
3364691
3364947
3365459
3359316
3364692
3364948
3365460
3359321
3364697
3364953
3347968
3348224
3356416
3356672
3363840
3364096
3348063
3348319
3356511
3356767
3363935
3364191
3429444
3430212
3430468
3429445
3430213
3430469
3429446
3430214
3430470
3429447
3430215
3430471
3429448
3430216
3430472
3429449
3430217
3430473
3429450
3430218
3430474
3429451
3430219
3430475
3429452
3430220
3430476
3429453
3430221
3430477
3429454
3430222
3430478
3429455
3430223
3430479
3429456
3430224
3430480
3429457
3430225
3430481
3429458
3430226
3430482
3429459
3430227
3430483
3429460
3430228
3430484
3429466
3430234
3430490
3413504
3413760
3421952
3422208
3429376
3429632
3413599
3413855
3422047
3422303
3429471
3429727
3479040
3479296
3487488
3487744
3494912
3495168
3479135
3479391
3487583
3487839
3495007
3495263
