2361416
2361672
2361928
2362184
2362440
2362696
2362952
2363208
2361417
2361673
2361929
2362185
2362441
2362697
2362953
2363209
2361418
2361674
2361930
2362186
2362442
2362698
2362954
2363210
2361419
2361675
2361931
2362187
2362443
2362699
2362955
2363211
2361420
2361676
2361932
2362188
2362444
2362700
2362956
2363212
2361421
2361677
2361933
2362189
2362445
2362701
2362957
2363213
2361422
2361678
2361934
2362190
2362446
2362702
2362958
2363214
2361423
2361679
2361935
2362191
2362447
2362703
2362959
2363215
2639912
2640168
2640424
2640680
2640936
2641192
2641448
2641704
2639913
2640169
2640425
2640681
2640937
2641193
2641449
2641705
2639914
2640170
2640426
2640682
2640938
2641194
2641450
2641706
2639915
2640171
2640427
2640683
2640939
2641195
2641451
2641707
2639916
2640172
2640428
2640684
2640940
2641196
2641452
2641708
2639917
2640173
2640429
2640685
2640941
2641197
2641453
2641709
2639918
2640174
2640430
2640686
2640942
2641198
2641454
2641710
2639919
2640175
2640431
2640687
2640943
2641199
2641455
2641711
