140849
140594
210177
404025
601135
603440
669185
669441
669697
1129770
1188394
1259265
1387567
1522735
1584160
1584162
1583651
1583907
1584419
1583396
1584676
1583398
1583654
1583911
1585707
1653808
1779751
1846843
2762035
2764349
2764606
3029039
3029040
3090737
3090485
3091254
3092534
3091255
3091511
