16422
16678
19750
16425
16681
19753
20777
16426
16682
19754
20778
16427
16683
19755
20779
16428
16684
19756
20780
16430
16686
19758
20782
16432
16688
19760
20784
16698
19770
20794
5632
5888
14080
14336
21504
21760
5727
5983
14175
14431
21599
21855
82472
82984
83240
84520
85032
85288
71168
71424
79616
79872
87040
87296
71263
71519
79711
79967
87135
87391
147515
147771
148027
148283
148539
148795
149051
149307
149563
150587
150843
136704
136960
145152
145408
152576
152832
136799
137055
145247
145503
152671
152927
213552
213808
214064
214320
214576
214832
215088
213297
213553
213809
214065
214321
214577
214833
215089
202240
202496
210688
210944
218112
218368
202335
202591
210783
211039
218207
218463
278832
279088
279344
279600
279856
280112
280368
280624
280880
281392
281648
281904
282160
282928
283184
278833
279089
279345
279601
279857
280113
280369
280625
280881
281393
281649
281905
282161
282929
283185
278843
279099
279355
279611
279867
280123
280379
280635
280891
281403
281659
281915
282171
282939
283195
279103
279615
279871
280127
280383
280639
280895
281407
281663
281919
282175
282943
283199
267776
268032
276224
276480
283648
283904
267871
268127
276319
276575
283743
283999
344110
344366
344622
344878
345134
345390
345646
346158
346414
346670
346926
347438
347694
348206
333312
333568
341760
342016
349184
349440
333407
333663
341855
342111
349279
349535
409380
409381
409382
409383
409384
410920
411176
411432
412968
413224
414248
409385
409386
409387
409388
409389
409390
409391
410927
411183
409392
409393
409394
409395
409396
409397
409398
409399
409400
409401
409402
409403
409404
410172
410428
410684
410940
411196
411452
411964
412220
412988
413244
414012
414268
409405
409406
409407
398848
399104
407296
407552
414720
414976
398943
399199
407391
407647
414815
415071
475176
475432
475688
475944
476200
476456
476712
477224
477736
477992
478504
475185
475441
475697
475953
476209
476465
476721
477233
477745
478001
478513
475188
475444
475700
475956
476212
476468
476724
477236
477748
478004
478516
475194
475450
475706
475962
476218
476474
476730
477242
477754
478010
478522
464384
464640
472832
473088
480256
480512
464479
464735
472927
473183
480351
480607
540712
541480
541736
541992
542248
542504
545320
546088
546856
540713
541481
541737
541993
542249
542505
545321
546089
546857
540714
541482
541738
541994
542250
542506
545322
546090
546858
540715
541483
541739
541995
542251
542507
545323
546091
540716
541484
541740
541996
542252
542508
545324
546092
540717
541485
541741
541997
542253
542509
545325
546093
546861
540718
541486
541742
541998
542254
542510
545326
546094
546862
540719
541487
541743
541999
542255
542511
545327
546095
546863
529920
530176
538368
538624
545792
546048
530015
530271
538463
538719
545887
546143
607037
607293
607549
607805
608061
608317
608573
609597
609853
610109
610365
595456
595712
603904
604160
611328
611584
595551
595807
603999
604255
611423
611679
671788
672044
672300
672556
672812
673068
673324
673580
673836
671792
672048
672304
672560
672816
671794
672050
672306
672562
672818
673330
673586
673842
660992
661248
669440
669696
676864
677120
661087
661343
669535
669791
676959
677215
726528
726784
734976
735232
742400
742656
726623
726879
735071
735327
742495
742751
808448
808704
808960
802598
802599
804391
805159
805671
805927
806183
806439
806695
802600
802601
802602
802603
802604
802605
804397
805165
805677
805933
806189
806445
806701
802606
804398
802607
804399
804655
805167
805679
805935
806191
806447
806703
806959
807215
802608
802609
804401
804657
805169
805681
805937
806193
806449
806705
806961
802610
804402
804658
805170
805682
805938
806194
806450
806706
806962
807218
802611
802612
802613
804405
804661
805173
805685
805941
806197
806453
806709
806965
807221
807477
802614
804406
804662
805174
805686
805942
806198
806454
806710
806966
807222
807478
802615
804407
804663
805175
805687
805943
806199
806455
806711
806967
807223
807479
808247
802616
804152
804408
804664
805176
805688
805944
806200
806456
806712
806968
807224
807480
808248
802617
802618
802619
804155
804411
804667
805179
805691
805947
806203
806459
806715
806971
807227
807483
808251
802620
802621
804157
804413
804669
805181
805693
805949
806205
806461
806717
806973
807229
807485
808253
802622
802623
792064
792320
800512
800768
807936
808192
792159
792415
800607
800863
808031
808287
857600
857856
866048
866304
873472
873728
857695
857951
866143
866399
873567
873823
933939
934451
934707
935219
935475
935987
936755
940083
923136
923392
931584
931840
939008
939264
923231
923487
931679
931935
939103
939359
999719
999975
1000231
1000487
1000743
1001255
1001511
1002791
1003047
1003303
1003559
1003815
1004071
999722
999978
1000234
1000490
1000746
1001258
1001514
1002794
1003050
1003306
1003562
1003818
1004074
999723
999979
1000235
1000491
1000747
1001259
1001515
1002795
1003051
1003307
1003563
1003819
1004075
999724
999980
1000236
1000492
1000748
1001260
1001516
1002796
1003052
1003308
1003564
1003820
1004076
999725
999981
1000237
1000493
1000749
1001261
1001517
1002797
1003053
1003309
1003565
1003821
1004077
999726
999982
1000238
1000494
1000750
1001262
1001518
1002798
1003054
1003310
1003566
1003822
1004078
999727
999983
1000239
1000495
1000751
1001263
1001519
1002799
1003055
1003311
1003567
1003823
1004079
999728
999984
1000240
1000496
1000752
1001264
1001520
1002800
1003056
1003312
1003568
1003824
1004080
999729
999985
1000241
1000497
1000753
1001265
1001521
1002801
1003057
1003313
1003569
1003825
1004081
999730
999986
1000242
1000498
1000754
1001266
1001522
1002802
1003058
1003314
1003570
1003826
1004082
999731
999987
1000243
1000499
1000755
1001267
1001523
1002803
1003059
1003315
1003571
1003827
1004083
999732
999988
1000244
1000500
1000756
1001268
1001524
1002804
1003060
1003316
1003572
1003828
1004084
999733
999989
1000245
1000501
1000757
1001269
1001525
1002805
1003061
1003317
1003573
1003829
1004085
999734
999990
1000246
1000502
1000758
1001270
1001526
1002806
1003062
1003318
1003574
1003830
1004086
999735
999991
1000247
1000503
1000759
1001271
1001527
1002807
1003063
1003319
1003575
1003831
1004087
999736
999992
1000248
1000504
1000760
1001272
1001528
1002808
1003064
1003320
1003576
1003832
1004088
999737
999993
1000249
1000505
1000761
1001273
1001529
1002809
1003065
1003321
1003577
1003833
1004089
999738
999994
1000250
1000506
1000762
1001274
1001530
1002810
1003066
1003322
1003578
1003834
1004090
999739
999995
1000251
1000507
1000763
1001275
1001531
1002811
1003067
1003323
1003579
1003835
1004091
999740
999996
1000252
1000508
1000764
1001276
1001532
1002812
1003068
1003324
1003580
1003836
1004092
999741
999997
1000253
1000509
1000765
1001277
1001533
1002813
1003069
1003325
1003581
1003837
1004093
999742
999998
1000254
1000510
1000766
1001278
1001534
1002814
1003070
1003326
1003582
1003838
1004094
988672
988928
997120
997376
1004544
1004800
988767
989023
997215
997471
1004639
1004895
1065264
1065520
1065776
1066032
1066288
1066800
1067056
1067312
1067568
1067824
1068080
1068336
1068592
1068848
1069104
1069360
1054208
1054464
1062656
1062912
1070080
1070336
1054303
1054559
1062751
1063007
1070175
1070431
1130796
1131052
1131308
1131564
1131820
1135404
1136684
1130800
1131056
1131312
1131568
1131824
1135408
1136688
1119744
1120000
1128192
1128448
1135616
1135872
1119839
1120095
1128287
1128543
1135711
1135967
1202177
1202178
1197351
1199911
1201959
1199922
1197372
1199932
1197373
1199933
1185280
1185536
1193728
1193984
1201152
1201408
1185375
1185631
1193823
1194079
1201247
1201503
1261614
1261870
1262126
1262382
1262638
1262894
1263406
1263662
1263918
1264686
1264942
1265198
1266222
1266478
1266990
1250816
1251072
1259264
1259520
1266688
1266944
1250911
1251167
1259359
1259615
1266783
1267039
1327932
1328444
1329468
1331516
1327933
1328445
1329469
1331517
1316352
1316608
1324800
1325056
1332224
1332480
1316447
1316703
1324895
1325151
1332319
1332575
1381888
1382144
1390336
1390592
1397760
1398016
1381983
1382239
1390431
1390687
1397855
1398111
1447424
1447680
1455872
1456128
1463296
1463552
1447519
1447775
1455967
1456223
1463391
1463647
1512960
1513216
1521408
1521664
1528832
1529088
1513055
1513311
1521503
1521759
1528927
1529183
1589295
1589551
1590063
1590319
1590575
1591087
1591599
1591855
1592367
1592623
1592879
1593135
1593647
1593903
1594671
1589552
1590064
1590320
1590576
1591088
1591600
1591856
1592368
1592624
1592880
1593136
1593648
1593904
1594672
1589554
1590066
1590322
1590578
1591090
1591602
1591858
1592370
1592626
1592882
1593138
1593650
1593906
1594674
1589555
1590067
1590323
1590579
1591091
1591603
1591859
1592371
1592627
1592883
1593139
1593651
1593907
1594675
1589563
1590075
1590331
1590587
1591099
1591611
1591867
1592379
1592635
1592891
1593147
1593659
1593915
1594683
1578496
1578752
1586944
1587200
1594368
1594624
1578591
1578847
1587039
1587295
1594463
1594719
1659904
1660160
1659905
1660161
1660673
1654566
1654567
1658663
1659687
1654568
1654569
1653802
1654570
1653803
1654571
1659435
1659691
1653804
1654572
1659436
1659692
1653805
1654573
1659437
1659693
1661229
1653806
1654574
1659438
1659694
1653807
1654575
1656111
1659439
1659695
1654576
1659440
1659696
1653809
1654577
1656113
1659441
1659697
1653810
1654578
1659442
1659698
1653811
1654579
1659443
1659699
1654580
1654581
1654582
1659446
1659702
1660214
1660470
1654583
1654584
1654585
1659449
1659705
1660217
1660473
1654586
1654587
1654588
1659452
1659708
1660220
1660476
1654589
1654590
1655102
1654591
1654592
1644032
1644288
1652480
1652736
1659904
1660160
1644127
1644383
1652575
1652831
1659999
1660255
1720358
1720614
1720870
1721126
1721638
1721894
1722150
1722406
1723686
1723942
1724966
1725222
1725478
1720359
1720615
1720871
1721127
1721639
1721895
1722151
1722407
1723687
1723943
1724967
1725223
1725479
1725735
1720360
1720616
1720872
1721128
1721640
1721896
1722152
1722408
1723688
1723944
1724968
1725224
1725480
1725736
1720361
1720617
1720873
1721129
1721641
1721897
1722153
1722409
1723689
1723945
1724969
1725225
1725481
1725737
1720362
1720618
1720874
1721130
1721642
1721898
1722154
1722410
1723690
1723946
1724970
1725226
1725482
1725738
1720363
1720619
1720875
1721131
1721643
1721899
1722155
1722411
1723691
1723947
1724971
1725227
1725483
1725739
1720364
1720620
1720876
1721132
1721644
1721900
1722156
1722412
1723692
1723948
1724972
1725228
1725484
1725740
1720365
1720621
1720877
1721133
1721645
1721901
1722157
1722413
1723693
1723949
1724973
1725229
1725485
1725741
1720366
1720622
1720878
1721134
1721646
1721902
1722158
1722414
1723694
1723950
1724974
1725230
1725486
1725742
1720367
1720623
1720879
1721135
1721647
1721903
1722159
1722415
1723695
1723951
1724975
1725231
1725487
1725743
1720368
1720624
1720880
1721136
1721648
1721904
1722160
1722416
1723696
1723952
1724976
1725232
1725488
1725744
1720369
1720625
1720881
1721137
1721649
1721905
1722161
1722417
1723697
1723953
1724977
1725233
1725489
1725745
1720370
1720626
1720882
1721138
1721650
1721906
1722162
1722418
1723698
1723954
1724978
1725234
1725490
1725746
1720371
1720627
1720883
1721139
1721651
1721907
1722163
1722419
1723699
1723955
1724979
1725235
1725491
1725747
1720372
1720628
1720884
1721140
1721652
1721908
1722164
1722420
1723700
1723956
1724980
1725236
1725492
1725748
1720373
1720629
1720885
1721141
1721653
1721909
1722165
1722421
1723701
1723957
1724981
1725237
1725493
1725749
1720374
1720630
1720886
1721142
1721654
1721910
1722166
1722422
1723702
1723958
1724982
1725238
1725494
1725750
1720375
1720631
1720887
1721143
1721655
1721911
1722167
1722423
1723703
1723959
1724983
1725239
1725495
1725751
1720376
1720632
1720888
1721144
1721656
1721912
1722168
1722424
1723704
1723960
1724984
1725240
1725496
1725752
1720377
1720633
1720889
1721145
1721657
1721913
1722169
1722425
1723705
1723961
1724985
1725241
1725497
1725753
1720378
1720634
1720890
1721146
1721658
1721914
1722170
1722426
1723706
1723962
1724986
1725242
1725498
1725754
1720379
1720635
1720891
1721147
1721659
1721915
1722171
1722427
1723707
1723963
1724987
1725243
1725499
1725755
1720380
1720636
1720892
1721148
1721660
1721916
1722172
1722428
1723708
1723964
1724988
1725244
1725500
1725756
1720381
1720637
1720893
1721149
1721661
1721917
1722173
1722429
1723709
1723965
1724989
1725245
1725501
1725757
1720382
1720638
1720894
1721150
1721662
1721918
1722174
1722430
1723710
1723966
1724990
1725246
1725502
1725758
1720383
1720639
1720895
1721151
1721663
1721919
1722175
1722431
1723711
1723967
1724991
1725247
1725503
1725759
1709568
1709824
1718016
1718272
1725440
1725696
1709663
1709919
1718111
1718367
1725535
1725791
1787673
1786660
1787172
1787428
1786149
1786661
1787173
1787429
1785895
1786151
1786663
1787175
1787687
1788967
1789223
1789735
1785896
1786152
1786664
1787176
1787688
1788968
1789224
1789736
1785898
1786154
1786666
1787178
1788970
1789226
1789738
1785899
1786155
1786667
1787179
1788971
1789227
1789739
1785900
1786156
1786668
1787180
1787692
1788972
1789228
1789740
1785901
1786157
1786669
1787181
1787693
1788973
1789229
1789741
1775104
1775360
1783552
1783808
1790976
1791232
1775199
1775455
1783647
1783903
1791071
1791327
1851440
1851696
1851952
1852208
1852464
1852720
1852976
1853232
1853744
1854000
1854512
1854768
1855280
1855536
1856048
1857584
1851441
1851697
1851953
1852209
1852465
1852721
1852977
1853233
1853745
1854001
1854513
1854769
1855281
1855537
1856049
1857585
1851442
1851698
1851954
1852210
1852466
1852722
1852978
1853234
1853746
1854002
1854514
1854770
1855282
1855538
1856050
1857586
1851443
1851699
1851955
1852211
1852467
1852723
1852979
1853235
1853747
1854003
1854515
1854771
1855283
1855539
1856051
1857587
1851444
1851700
1851956
1852212
1852468
1852724
1852980
1853236
1853748
1854004
1854516
1854772
1855284
1855540
1856052
1857588
1851445
1851701
1851957
1852213
1852469
1852725
1852981
1853237
1853749
1854005
1854517
1854773
1855285
1855541
1856053
1857589
1851446
1851702
1851958
1852214
1852470
1852726
1852982
1853238
1853750
1854006
1854518
1854774
1855286
1855542
1856054
1857590
1851447
1851703
1851959
1852215
1852471
1852727
1852983
1853239
1853751
1854007
1854519
1854775
1855287
1855543
1856055
1857591
1851454
1851710
1851966
1852222
1852478
1852734
1852990
1853246
1853758
1854014
1854526
1854782
1855294
1855550
1857598
1840640
1840896
1849088
1849344
1856512
1856768
1840735
1840991
1849183
1849439
1856607
1856863
1906176
1906432
1914624
1914880
1922048
1922304
1906271
1906527
1914719
1914975
1922143
1922399
1971712
1971968
1980160
1980416
1987584
1987840
1971807
1972063
1980255
1980511
1987679
1987935
2037248
2037504
2045696
2045952
2053120
2053376
2037343
2037599
2045791
2046047
2053215
2053471
2110720
2102273
2102529
2110465
2110721
2113316
2113317
2113318
2113319
2113320
2113321
2113322
2113323
2113324
2113325
2113326
2113327
2113328
2113329
2113330
2113331
2113332
2113333
2113334
2113335
2113336
2113337
2113338
2113339
2113340
2113341
2113342
2113343
2102784
2103040
2111232
2111488
2118656
2118912
2102879
2103135
2111327
2111583
2118751
2119007
2184192
2184448
2184193
2184449
2184228
2184484
2184740
2179109
2179365
2179621
2179877
2180133
2180389
2180645
2180901
2181157
2181413
2181669
2181925
2179110
2179366
2179622
2179878
2180134
2180390
2180646
2180902
2181158
2181414
2181670
2181926
2182438
2182694
2182950
2183206
2183462
2184486
2184742
2184998
2179111
2179367
2179623
2179879
2180135
2180391
2180647
2180903
2181159
2181415
2181671
2181927
2182439
2182695
2182951
2183207
2183463
2184487
2184743
2184999
2179112
2179368
2179624
2179880
2180136
2180392
2180648
2180904
2181160
2181416
2181672
2181928
2182440
2182696
2182952
2183208
2183464
2184488
2184744
2185000
2179113
2179369
2179625
2179881
2180137
2180393
2180649
2180905
2181161
2181417
2181673
2181929
2182441
2182697
2182953
2183209
2183465
2184489
2184745
2185001
2179114
2179370
2179626
2179882
2180138
2180394
2180650
2180906
2181162
2181418
2181674
2181930
2182442
2182698
2182954
2183210
2183466
2184490
2184746
2185002
2179115
2179371
2179627
2179883
2180139
2180395
2180651
2180907
2181163
2181419
2181675
2181931
2182443
2182699
2182955
2183211
2183467
2184491
2184747
2185003
2179116
2179372
2179628
2179884
2180140
2180396
2180652
2180908
2181164
2181420
2181676
2181932
2182444
2182700
2182956
2183212
2183468
2184492
2184748
2185004
2179117
2179373
2179629
2179885
2180141
2180397
2180653
2180909
2181165
2181421
2181677
2181933
2182445
2182701
2182957
2183213
2183469
2184493
2184749
2185005
2179118
2179374
2179630
2179886
2180142
2180398
2180654
2180910
2181166
2181422
2181678
2181934
2182446
2182702
2182958
2183214
2183470
2184494
2184750
2185006
2179119
2179375
2179631
2179887
2180143
2180399
2180655
2180911
2181167
2181423
2181679
2181935
2182447
2182703
2182959
2183215
2183471
2184495
2184751
2185007
2187055
2179120
2179376
2179632
2179888
2180144
2180400
2180656
2180912
2181168
2181424
2181680
2181936
2182448
2182704
2182960
2183216
2183472
2184496
2184752
2185008
2179121
2179377
2179633
2179889
2180145
2180401
2180657
2180913
2181169
2181425
2181681
2181937
2182449
2182705
2182961
2183217
2183473
2184497
2184753
2185009
2179122
2179378
2179634
2179890
2180146
2180402
2180658
2180914
2181170
2181426
2181682
2181938
2182450
2182706
2182962
2183218
2183474
2184498
2184754
2185010
2179123
2179379
2179635
2179891
2180147
2180403
2180659
2180915
2181171
2181427
2181683
2181939
2182451
2182707
2182963
2183219
2183475
2184499
2184755
2185011
2179126
2179382
2179638
2179894
2180150
2180406
2180662
2180918
2181174
2181430
2181686
2181942
2182454
2182710
2182966
2183222
2183478
2184502
2184758
2185014
2179127
2179383
2179639
2179895
2180151
2180407
2180663
2180919
2181175
2181431
2181687
2181943
2182455
2182711
2182967
2183223
2183479
2184503
2184759
2185015
2179128
2179384
2179640
2179896
2180152
2180408
2180664
2180920
2181176
2181432
2181688
2181944
2182456
2182712
2182968
2183224
2183480
2184504
2184760
2185016
2179129
2179385
2179641
2179897
2180153
2180409
2180665
2180921
2181177
2181433
2181689
2181945
2182457
2182713
2182969
2183225
2183481
2184505
2184761
2185017
2179130
2179386
2179642
2179898
2180154
2180410
2180666
2180922
2181178
2181434
2181690
2181946
2182458
2182714
2182970
2183226
2183482
2184506
2184762
2185018
2179131
2179387
2179643
2179899
2180155
2180411
2180667
2180923
2181179
2181435
2181691
2181947
2182459
2182715
2182971
2183227
2183483
2184507
2184763
2185019
2179132
2179388
2179644
2179900
2180156
2180412
2180668
2180924
2181180
2181436
2181692
2181948
2182460
2182716
2182972
2183228
2183484
2184508
2184764
2185020
2179133
2179389
2179645
2179901
2180157
2180413
2180669
2180925
2181181
2181437
2181693
2181949
2182461
2182717
2182973
2183229
2183485
2184509
2184765
2185021
2179134
2179390
2179646
2179902
2180158
2180414
2180670
2180926
2181182
2181438
2181694
2181950
2182462
2182718
2182974
2183230
2183486
2184510
2184766
2185022
2179135
2179391
2179647
2179903
2180159
2180415
2180671
2180927
2181183
2181439
2181695
2181951
2182463
2182719
2182975
2183231
2183487
2184511
2184767
2185023
2168320
2168576
2176768
2177024
2184192
2184448
2168415
2168671
2176863
2177119
2184287
2184543
2233856
2234112
2242304
2242560
2249728
2249984
2233951
2234207
2242399
2242655
2249823
2250079
2299392
2299648
2307840
2308096
2315264
2315520
2299487
2299743
2307935
2308191
2315359
2315615
2375975
2376231
2376487
2376743
2376999
2377255
2377511
2378279
2379303
2379559
2380327
2380583
2380839
2375976
2376232
2376488
2376744
2377000
2377256
2377512
2378280
2379304
2379560
2380328
2380584
2380840
2375977
2376233
2376489
2376745
2377001
2377257
2377513
2378281
2379305
2379561
2380329
2380585
2380841
2375978
2376234
2376490
2376746
2377002
2377258
2377514
2378282
2379306
2379562
2380330
2380586
2380842
2375979
2376235
2376491
2376747
2377003
2377259
2377515
2378283
2379307
2379563
2380331
2380587
2380843
2375980
2376236
2376492
2376748
2377004
2377260
2377516
2378284
2379308
2379564
2380332
2380588
2380844
2375981
2376237
2376493
2376749
2377005
2377261
2377517
2378285
2379309
2379565
2380333
2380589
2380845
2375740
2375996
2376252
2376508
2376764
2377020
2377276
2377532
2378300
2379324
2379580
2380348
2380604
2380860
2381116
2364928
2365184
2373376
2373632
2380800
2381056
2365023
2365279
2373471
2373727
2380895
2381151
2441520
2441776
2442032
2442544
2442800
2443056
2443824
2444592
2444848
2445104
2445872
2446128
2446640
2441279
2441535
2441791
2442047
2442559
2442815
2443071
2443839
2444607
2444863
2445119
2445887
2446143
2446655
2430464
2430720
2438912
2439168
2446336
2446592
2430559
2430815
2439007
2439263
2446431
2446687
2506529
2506530
2506531
2506532
2506533
2506534
2506535
2506536
2506537
2506538
2506539
2506540
2506541
2506542
2506543
2506544
2506545
2506546
2506547
2506548
2506549
2506550
2506551
2506552
2506553
2506554
2506555
2506556
2506557
2506558
2506559
2496000
2496256
2504448
2504704
2511872
2512128
2496095
2496351
2504543
2504799
2511967
2512223
2572849
2573105
2572601
2572857
2573113
2572603
2572859
2573115
2561536
2561792
2569984
2570240
2577408
2577664
2561631
2561887
2570079
2570335
2577503
2577759
2639661
2644013
2627072
2627328
2635520
2635776
2642944
2643200
2627167
2627423
2635615
2635871
2643039
2643295
2704176
2704178
2692608
2692864
2701056
2701312
2708480
2708736
2692703
2692959
2701151
2701407
2708575
2708831
2769191
2769447
2773543
2769193
2769449
2773545
2769197
2769453
2773549
2769200
2769456
2773552
2769207
2769463
2769210
2769466
2773562
2769212
2769468
2773564
2769213
2769469
2773565
2769214
2769470
2769215
2769471
2758144
2758400
2766592
2766848
2774016
2774272
2758239
2758495
2766687
2766943
2774111
2774367
2834739
2835251
2834746
2835258
2834748
2835260
2823680
2823936
2832128
2832384
2839552
2839808
2823775
2824031
2832223
2832479
2839647
2839903
2900005
2900261
2901541
2900015
2900271
2901551
2903087
2900016
2900272
2901552
2900017
2900273
2889216
2889472
2897664
2897920
2905088
2905344
2889311
2889567
2897759
2898015
2905183
2905439
2965542
2965798
2968614
2968870
2969382
2965545
2965801
2968617
2969385
2965546
2965802
2968874
2969386
2965547
2965803
2968619
2965548
2965804
2968620
2968876
2969388
2965549
2965805
2968621
2968877
2969389
2965556
2965812
2968628
2968884
2969396
2965562
2965818
2968634
2968890
2969402
2965564
2965820
2968636
2968892
2969404
2954752
2955008
2963200
2963456
2970624
2970880
2954847
2955103
2963295
2963551
2970719
2970975
3031846
3033126
3033382
3035174
3035430
3035686
3035942
3036198
3036454
3036710
3036966
3037222
3031848
3033128
3033384
3035176
3035432
3035688
3035944
3036200
3036456
3036712
3036968
3037224
3031849
3033129
3033385
3035177
3035433
3035689
3035945
3036201
3036457
3036713
3036969
3037225
3031853
3033133
3033389
3035181
3035437
3035693
3035949
3036205
3036461
3036717
3036973
3037229
3031856
3033136
3033392
3037232
3031857
3033137
3033393
3037233
3031858
3033138
3033394
3037234
3031859
3033139
3033395
3037235
3031860
3033140
3033396
3037236
3031861
3033141
3033397
3037237
3031862
3033142
3033398
3037238
3031863
3033143
3033399
3037239
3031865
3033145
3033401
3035193
3035449
3035705
3035961
3036217
3036473
3036729
3036985
3037241
3031866
3033146
3033402
3035194
3035450
3035706
3035962
3036218
3036474
3036730
3036986
3037242
3020288
3020544
3028736
3028992
3036160
3036416
3020383
3020639
3028831
3029087
3036255
3036511
3096615
3096871
3097127
3097639
3097895
3098151
3098407
3098663
3098919
3099175
3099431
3099687
3099943
3100199
3101479
3101991
3102247
3102503
3102759
3096616
3096872
3097128
3097640
3097896
3098152
3098408
3098664
3098920
3099176
3099432
3099688
3099944
3100200
3101480
3101992
3102248
3102504
3102760
3096619
3096875
3097131
3097643
3097899
3098155
3098411
3098667
3098923
3099179
3099435
3099691
3099947
3100203
3101483
3101995
3102251
3102507
3102763
3096624
3096880
3097136
3097648
3097904
3098160
3098416
3098672
3098928
3099184
3099440
3099696
3099952
3100208
3101488
3102000
3102256
3102512
3102768
3096625
3096881
3097649
3097905
3098161
3098673
3098929
3099185
3099441
3099697
3099953
3100209
3101489
3102001
3102257
3102513
3102769
3096626
3096882
3097138
3097650
3098418
3098674
3098930
3099186
3099442
3099698
3099954
3100210
3101490
3102002
3102258
3102514
3102770
3096627
3096883
3097139
3097395
3097651
3098419
3098675
3098931
3099187
3099443
3099699
3099955
3100211
3101491
3102003
3102259
3102515
3102771
3098420
3098676
3098932
3099188
3099444
3099700
3099956
3100212
3101492
3102004
3102260
3102516
3102772
3096629
3096885
3097653
3098933
3099189
3099701
3099957
3101493
3102005
3102261
3102517
3102773
3096630
3096886
3097142
3097910
3098166
3098934
3099190
3099446
3099702
3101494
3102006
3102262
3102518
3102774
3096631
3097143
3097655
3098167
3098423
3098679
3099447
3099703
3099959
3100215
3096888
3097144
3097400
3097912
3098424
3098680
3099192
3096633
3097145
3097913
3099449
3099961
3100217
3101497
3102009
3102265
3102521
3102777
3096634
3096890
3097146
3097658
3098170
3098426
3098682
3098938
3099706
3099962
3100218
3101498
3102010
3102266
3102522
3102778
3096635
3096891
3097403
3098683
3098939
3099195
3099451
3099707
3099963
3100219
3101499
3102011
3102267
3102523
3102779
3096636
3096892
3098172
3098428
3098684
3099196
3099452
3099708
3099964
3100220
3101500
3102012
3102268
3102524
3102780
3096637
3097149
3097405
3097661
3097917
3098173
3098429
3098685
3098941
3099197
3099453
3099709
3099965
3100221
3101501
3102013
3102269
3102525
3102781
3096638
3096894
3097918
3098174
3098430
3098686
3098942
3099198
3099454
3099710
3099966
3100222
3101502
3102014
3102270
3102526
3102782
3096639
3096895
3098687
3098943
3099199
3099455
3099711
3099967
3100223
3097664
3085824
3086080
3094272
3094528
3101696
3101952
3085919
3086175
3094367
3094623
3101791
3102047
3151360
3151616
3159808
3160064
3167232
3167488
3151455
3151711
3159903
3160159
3167327
3167583
3227685
3229477
3229733
3227686
3229478
3229734
3233830
3234086
3227689
3229481
3229737
3233833
3234089
3227705
3229497
3229753
3233849
3234105
3227706
3229498
3229754
3233850
3234106
3227707
3229499
3229755
3233851
3227708
3229500
3229756
3233852
3216896
3217152
3225344
3225600
3232768
3233024
3216991
3217247
3225439
3225695
3232863
3233119
3293222
3298086
3299366
3299622
3293223
3298087
3299367
3299623
3293224
3298088
3299368
3299624
3298089
3299369
3299625
3293226
3298090
3299370
3299626
3293227
3298091
3299371
3299627
3293228
3298092
3299372
3299628
3293229
3298093
3299373
3299629
3293230
3298094
3299374
3299630
3293231
3298095
3299375
3299631
3293235
3298099
3299379
3299635
3293242
3298106
3299386
3299642
3282432
3282688
3290880
3291136
3298304
3298560
3282527
3282783
3290975
3291231
3298399
3298655
3358758
3360294
3360806
3364902
3358760
3360296
3360808
3364904
3358762
3360298
3360810
3364906
3358764
3360300
3360812
3364908
3358769
3360305
3360817
3364913
3358770
3360306
3360818
3364914
3358774
3360310
3360822
3364918
3358780
3360316
3360828
3364924
3347968
3348224
3356416
3356672
3363840
3364096
3348063
3348319
3356511
3356767
3363935
3364191
3426088
3430440
3426091
3430443
3426108
3430460
3426109
3430461
3426110
3430462
3413504
3413760
3421952
3422208
3429376
3429632
3413599
3413855
3422047
3422303
3429471
3429727
3479040
3479296
3487488
3487744
3494912
3495168
3479135
3479391
3487583
3487839
3495007
3495263
