534584
534840
535096
535352
535608
535864
536120
536376
534585
534841
535097
535353
535609
535865
536121
536377
534586
534842
535098
535354
535610
535866
536122
536378
534587
534843
535099
535355
535611
535867
536123
536379
534588
534844
535100
535356
535612
535868
536124
536380
534589
534845
535101
535357
535613
535869
536125
536381
534590
534846
535102
535358
535614
535870
536126
536382
534591
534847
535103
535359
535615
535871
536127
536383
1001528
1001784
1002040
1002296
1002552
1002808
1003064
1003320
1001529
1001785
1002041
1002297
1002553
1002809
1003065
1003321
1001530
1001786
1002042
1002298
1002554
1002810
1003066
1003322
1001531
1001787
1002043
1002299
1002555
1002811
1003067
1003323
1001532
1001788
1002044
1002300
1002556
1002812
1003068
1003324
1001533
1001789
1002045
1002301
1002557
1002813
1003069
1003325
1001534
1001790
1002046
1002302
1002558
1002814
1003070
1003326
1001535
1001791
1002047
1002303
1002559
1002815
1003071
1003327
1187888
1188144
1188400
1188656
1188912
1189168
1189424
1189680
1187889
1188145
1188401
1188657
1188913
1189169
1189425
1189681
1187890
1188146
1188402
1188658
1188914
1189170
1189426
1189682
1187891
1188147
1188403
1188659
1188915
1189171
1189427
1189683
1187892
1188148
1188404
1188660
1188916
1189172
1189428
1189684
1187893
1188149
1188405
1188661
1188917
1189173
1189429
1189685
1187894
1188150
1188406
1188662
1188918
1189174
1189430
1189686
1187895
1188151
1188407
1188663
1188919
1189175
1189431
1189687
1323040
1323296
1323552
1323808
1324064
1324320
1324576
1324832
1323041
1323297
1323553
1323809
1324065
1324321
1324577
1324833
1323042
1323298
1323554
1323810
1324066
1324322
1324578
1324834
1323043
1323299
1323555
1323811
1324067
1324323
1324579
1324835
1323044
1323300
1323556
1323812
1324068
1324324
1324580
1324836
1323045
1323301
1323557
1323813
1324069
1324325
1324581
1324837
1323046
1323302
1323558
1323814
1324070
1324326
1324582
1324838
1323047
1323303
1323559
1323815
1324071
1324327
1324583
1324839
1849392
1849648
1849904
1850160
1850416
1850672
1850928
1851184
1849393
1849649
1849905
1850161
1850417
1850673
1850929
1851185
1849394
1849650
1849906
1850162
1850418
1850674
1850930
1851186
1849395
1849651
1849907
1850163
1850419
1850675
1850931
1851187
1849396
1849652
1849908
1850164
1850420
1850676
1850932
1851188
1849397
1849653
1849909
1850165
1850421
1850677
1850933
1851189
1849398
1849654
1849910
1850166
1850422
1850678
1850934
1851190
1849399
1849655
1849911
1850167
1850423
1850679
1850935
1851191
1845320
1845576
1845832
1846088
1846344
1846600
1846856
1847112
1845321
1845577
1845833
1846089
1846345
1846601
1846857
1847113
1845322
1845578
1845834
1846090
1846346
1846602
1846858
1847114
1845323
1845579
1845835
1846091
1846347
1846603
1846859
1847115
1845324
1845580
1845836
1846092
1846348
1846604
1846860
1847116
1845325
1845581
1845837
1846093
1846349
1846605
1846861
1847117
1845326
1845582
1845838
1846094
1846350
1846606
1846862
1847118
1845327
1845583
1845839
1846095
1846351
1846607
1846863
1847119
2107440
2107696
2107952
2108208
2108464
2108720
2108976
2109232
2107441
2107697
2107953
2108209
2108465
2108721
2108977
2109233
2107442
2107698
2107954
2108210
2108466
2108722
2108978
2109234
2107443
2107699
2107955
2108211
2108467
2108723
2108979
2109235
2107444
2107700
2107956
2108212
2108468
2108724
2108980
2109236
2107445
2107701
2107957
2108213
2108469
2108725
2108981
2109237
2107446
2107702
2107958
2108214
2108470
2108726
2108982
2109238
2107447
2107703
2107959
2108215
2108471
2108727
2108983
2109239
2299952
2300208
2300464
2300720
2300976
2301232
2301488
2301744
2299953
2300209
2300465
2300721
2300977
2301233
2301489
2301745
2299954
2300210
2300466
2300722
2300978
2301234
2301490
2301746
2299955
2300211
2300467
2300723
2300979
2301235
2301491
2301747
2299956
2300212
2300468
2300724
2300980
2301236
2301492
2301748
2299957
2300213
2300469
2300725
2300981
2301237
2301493
2301749
2299958
2300214
2300470
2300726
2300982
2301238
2301494
2301750
2299959
2300215
2300471
2300727
2300983
2301239
2301495
2301751
2498600
2498856
2499112
2499368
2499624
2499880
2500136
2500392
2498601
2498857
2499113
2499369
2499625
2499881
2500137
2500393
2498602
2498858
2499114
2499370
2499626
2499882
2500138
2500394
2498603
2498859
2499115
2499371
2499627
2499883
2500139
2500395
2498604
2498860
2499116
2499372
2499628
2499884
2500140
2500396
2498605
2498861
2499117
2499373
2499629
2499885
2500141
2500397
2498606
2498862
2499118
2499374
2499630
2499886
2500142
2500398
2498607
2498863
2499119
2499375
2499631
2499887
2500143
2500399
3024952
3025208
3025464
3025720
3025976
3026232
3026488
3026744
3024953
3025209
3025465
3025721
3025977
3026233
3026489
3026745
3024954
3025210
3025466
3025722
3025978
3026234
3026490
3026746
3024955
3025211
3025467
3025723
3025979
3026235
3026491
3026747
3024956
3025212
3025468
3025724
3025980
3026236
3026492
3026748
3024957
3025213
3025469
3025725
3025981
3026237
3026493
3026749
3024958
3025214
3025470
3025726
3025982
3026238
3026494
3026750
3024959
3025215
3025471
3025727
3025983
3026239
3026495
3026751
3225640
3225896
3226152
3226408
3226664
3226920
3227176
3227432
3225641
3225897
3226153
3226409
3226665
3226921
3227177
3227433
3225642
3225898
3226154
3226410
3226666
3226922
3227178
3227434
3225643
3225899
3226155
3226411
3226667
3226923
3227179
3227435
3225644
3225900
3226156
3226412
3226668
3226924
3227180
3227436
3225645
3225901
3226157
3226413
3226669
3226925
3227181
3227437
3225646
3225902
3226158
3226414
3226670
3226926
3227182
3227438
3225647
3225903
3226159
3226415
3226671
3226927
3227183
3227439
3422272
3422528
3422784
3423040
3423296
3423552
3423808
3424064
3422273
3422529
3422785
3423041
3423297
3423553
3423809
3424065
3422274
3422530
3422786
3423042
3423298
3423554
3423810
3424066
3422275
3422531
3422787
3423043
3423299
3423555
3423811
3424067
3422276
3422532
3422788
3423044
3423300
3423556
3423812
3424068
3422277
3422533
3422789
3423045
3423301
3423557
3423813
3424069
3422278
3422534
3422790
3423046
3423302
3423558
3423814
3424070
3422279
3422535
3422791
3423047
3423303
3423559
3423815
3424071
