0 0 1.0 0.0 0.0
0 1 1.92307699361 0.439999997616 1.18181812763
0 2 1.0 0.0 0.0
1 0 1.0 0.0 0.0
1 1 0.637065615661 0.951515138149 1.64968156815
1 2 1.0 0.0 0.0
2 0 1.0 0.0 0.0
2 1 0.602787467212 0.947976887226 1.75
2 2 1.0 0.0 0.0
3 0 1.0 0.0 0.0
3 1 0.575342450721 0.940476179123 1.84810125828
3 2 1.0 0.0 0.0
4 0 1.0 0.0 0.0
4 1 0.628571415726 0.931818187237 1.70731711388
4 2 1.0 0.0 0.0
5 0 1.0 0.0 0.0
5 1 0.582491577816 0.947976887226 1.81097555161
5 2 1.0 0.0 0.0
6 0 1.0 0.0 0.0
6 1 0.501416422636 0.977401137352 2.0404624939
6 2 1.0 0.0 0.0
7 0 1.0 0.0 0.0
7 1 0.57371796187 0.944134056568 1.84615385532
7 2 1.0 0.0 0.0
8 0 1.0 0.0 0.0
8 1 0.483516498718 0.948863625526 2.17964076996
8 2 1.0 0.0 0.0
9 0 1.0 0.0 0.0
9 1 0.678431384284 0.924855470657 1.59375
9 2 1.0 0.0 0.0
10 0 1.0 0.0 0.0
10 1 0.58783782458 0.954023003578 1.7831325531
10 2 1.0 0.0 0.0
11 0 1.0 0.0 0.0
11 1 0.591216226455 0.959999978542 1.76190471649
11 2 1.0 0.0 0.0
12 0 1.0 0.0 0.0
12 1 0.63604239854 0.899999976158 1.74691355228
12 2 1.0 0.0 0.0
13 0 1.0 0.0 0.0
13 1 0.610921520845 0.949720680714 1.72352945805
13 2 1.0 0.0 0.0
14 0 1.0 0.0 0.0
14 1 0.657794662495 0.895953774452 1.69677424431
14 2 1.0 0.0 0.0
15 0 1.0 0.0 0.0
15 1 0.662921342987 0.954802274704 1.57988166809
15 2 1.0 0.0 0.0
16 0 1.0 0.0 0.0
16 1 0.548589342103 0.977142870426 1.86549711227
16 2 1.0 0.0 0.0
17 0 1.0 0.0 0.0
17 1 0.637010659131 0.932960867882 1.68263471127
17 2 1.0 0.0 0.0
18 0 1.0 0.0 0.0
18 1 0.687258682198 0.893258452415 1.62893080711
18 2 1.0 0.0 0.0
19 0 1.0 0.0 0.0
19 1 0.699619749031 0.918478250504 1.55621302128
19 2 1.0 0.0 0.0
20 0 1.0 0.0 0.0
20 1 0.611486467031 0.950276255608 1.7209302187
20 2 1.0 0.0 0.0
21 0 1.0 0.0 0.0
21 1 0.643356624049 0.923913061619 1.68235290051
21 2 1.0 0.0 0.0
22 0 1.0 0.0 0.0
22 1 0.458128065366 0.838709652424 2.60256409645
22 2 1.0 0.0 0.0
23 0 1.0 0.0 0.0
23 1 0.627615050866 0.980000019073 1.62585031986
23 2 1.0 0.0 0.0
24 0 1.0 0.0 0.0
24 1 0.623134316717 0.922155678272 1.74025976658
24 2 1.0 0.0 0.0
25 0 1.0 0.0 0.0
25 1 0.639344276039 0.955128192902 1.63758385181
25 2 1.0 0.0 0.0
26 0 1.0 0.0 0.0
26 1 1.0 0.0 0.0
26 2 1.0 0.0 0.0
27 0 1.0 0.0 0.0
27 1 0.620300747154 0.951515138149 1.69426751137
27 2 1.0 0.0 0.0
28 0 1.0 0.0 0.0
28 1 0.6007752074 0.948387086391 1.75510203838
28 2 1.0 0.0 0.0
29 0 1.0 0.0 0.0
29 1 0.650224194044 0.931034505367 1.65185189247
29 2 1.0 0.0 0.0
30 0 1.0 0.0 0.0
30 1 0.492957761377 0.988571405411 2.05202317238
30 2 1.0 0.0 0.0
31 0 1.0 0.0 0.0
31 1 0.285714285714 0.971910119057 3.60115599632
31 2 1.0 0.0 0.0
32 0 1.0 0.0 0.0
32 1 0.686274522637 0.902857124805 1.61392402649
32 2 0.5 1.0 2.0
33 0 1.0 0.0 0.0
33 1 0.565693436071 0.974193572998 1.81456959248
33 2 1.0 1.0 1.0
34 0 1.0 0.0 0.0
34 1 0.635245882087 0.961290299892 1.63758385181
34 2 1.0 1.0 1.0
35 0 1.0 0.0 0.0
35 1 0.687499979511 0.915151536465 1.58940398693
35 2 1.0 1.0 1.0
36 0 1.0 0.0 0.0
36 1 3.19642855102 0.273743003607 1.14285719395
36 2 0.5 1.0 2.0
37 0 1.0 0.0 0.0
37 1 0.682926821326 0.928571403027 1.57692313194
37 2 1.0 0.0 0.0
38 0 1.0 0.0 0.0
38 1 0.593639571971 0.922619044781 1.82580649853
38 2 0.5 1.0 2.0
39 0 0.5 1.0 2.0
39 1 0.629343622971 0.957055211067 1.6602563858
39 2 0.5 1.0 2.0
40 0 0.5 1.0 2.0
40 1 0.656603751137 0.948275864124 1.60606062412
40 2 0.749999977648 1.0 1.33333337307
41 0 1.0 1.0 1.0
41 1 0.612903235234 0.97076022625 1.68072283268
41 2 1.0 0.0 0.0
42 0 1.0 1.0 1.0
42 1 0.559105416191 0.937142848969 1.90853655338
42 2 0.8 1.0 1.25
43 0 1.0 1.0 1.0
43 1 0.594501697269 0.936416208744 1.7962962389
43 2 1.0 1.0 1.0
44 0 0.5 1.0 2.0
44 1 0.664122157952 0.925287365913 1.62732923031
44 2 0.666666666667 1.0 1.5
45 0 0.5 1.0 2.0
45 1 0.655430714829 0.925714313984 1.64814817905
45 2 1.0 1.0 1.0
46 0 1.0 1.0 1.0
46 1 0.596226404902 0.949367105961 1.76666665077
46 2 1.0 0.0 0.0
47 0 1.0 1.0 1.0
47 1 0.795918377029 0.903846144676 1.39007091522
47 2 1.0 0.5 2.0
48 0 1.0 1.0 1.0
48 1 0.587786255263 0.928571403027 1.83216786385
48 2 2.0 0.5 1.0
49 0 1.0 0.0 0.0
49 1 1.40517239502 0.441717803478 1.61111116409
49 2 1.0 1.0 1.0
50 0 0.333333333333 1.0 3.0
50 1 0.815068462537 0.890756309032 1.37735843658
50 2 0.5 1.0 2.0
51 0 1.0 0.0 0.0
51 1 0.666666666667 0.88983052969 1.68571424484
51 2 1.0 0.5 2.0
52 0 1.0 0.0 0.0
52 1 0.674418595303 0.896551728249 1.65384614468
52 2 1.0 0.5 2.0
53 0 1.0 0.0 0.0
53 1 1.0 0.0 0.0
53 2 1.0 0.0 0.0
