0 0 0.8 0.5 2.5
0 1 50.6177760518 0.00640969350934 3.0821917057
0 2 1.0 0.5 2.0
1 0 0.312499995343 1.0 3.20000004768
1 1 0.663807153468 0.876893937588 1.71795201302
1 2 1.0 0.0 0.0
2 0 0.4 1.0 2.5
2 1 0.762882300194 0.834731459618 1.5703471899
2 2 0.5 1.0 2.0
3 0 0.749999977648 0.833333313465 1.60000002384
3 1 0.65710322298 0.888901233673 1.7120360136
3 2 0.83333330022 0.600000023842 2.0
4 0 0.71428572645 1.0 1.39999997616
4 1 0.867253912569 0.741388440132 1.55527758598
4 2 0.600000014305 1.0 1.66666662693
5 0 1.0 0.0 0.0
5 1 0.66520529826 0.844054579735 1.78104031086
5 2 0.624999990687 1.0 1.60000002384
6 0 0.749999977648 0.666666686535 2.0
6 1 0.643827984517 0.832933485508 1.86474657059
6 2 0.600000014305 1.0 1.66666662693
7 0 0.5 1.0 2.0
7 1 0.761357914299 0.756569564342 1.73605012894
7 2 0.571428571429 0.75 2.33333325386
8 0 0.5 1.0 2.0
8 1 0.394975380805 0.949976563454 2.66512179375
8 2 1.24999998137 0.600000023842 1.33333337307
9 0 0.600000014305 1.0 1.66666662693
9 1 0.86436189615 0.754412829876 1.53354072571
9 2 0.4 1.0 2.5
10 0 1.4999999553 0.666666686535 1.0
10 1 0.724760519346 0.808134198189 1.70734775066
10 2 0.5 1.0 2.0
11 0 0.666666666667 1.0 1.5
11 1 0.750409506216 0.806257128716 1.65282964706
11 2 0.666666666667 1.0 1.5
12 0 1.66666660044 0.40000000596 1.5
12 1 1.19312138853 0.580876767635 1.44288384914
12 2 0.666666666667 1.0 1.5
13 0 2.0 0.5 1.0
13 1 0.741652811048 0.827602505684 1.62921190262
13 2 0.666666666667 1.0 1.5
14 0 0.83333330022 1.0 1.20000004768
14 1 1.00742017828 0.672822356224 1.47532916069
14 2 0.571428571429 1.0 1.75
15 0 0.384615398723 1.0 2.59999990463
15 1 1.6838259743 0.423367977142 1.40276455879
15 2 0.444444444444 1.0 2.25
16 0 1.0 0.833333313465 1.20000004768
16 1 0.556544151127 0.90121281147 1.99376070499
16 2 0.277777785136 1.0 3.59999990463
17 0 0.857142886337 1.0 1.16666662693
17 1 0.624854412323 0.878412425518 1.8218921423
17 2 0.357142863225 1.0 2.79999995232
18 0 0.857142886337 1.0 1.16666662693
18 1 0.95311931364 0.693939685822 1.51192760468
18 2 0.555555570273 1.0 1.79999995232
19 0 1.0 0.833333313465 1.20000004768
19 1 0.859186400848 0.755896627903 1.53974986076
19 2 0.454545444693 0.600000023842 3.66666674614
20 0 0.857142886337 0.833333313465 1.39999997616
20 1 0.751726389993 0.822309732437 1.61772525311
20 2 0.5 1.0 2.0
21 0 0.624999990687 0.800000011921 2.0
21 1 0.542473789609 0.907537341118 2.03121900558
21 2 1.0 0.75 1.33333337307
22 0 0.857142886337 0.833333313465 1.39999997616
22 1 0.527166593182 0.924872219563 2.05102229118
22 2 1.0 0.0 0.0
23 0 0.83333330022 0.800000011921 1.5
23 1 0.65114288329 0.883156299591 1.73894619942
23 2 0.444444444444 1.0 2.25
24 0 1.24999998137 0.600000023842 1.33333337307
24 1 0.690829223219 0.822237670422 1.76048338413
24 2 1.0 0.75 1.33333337307
25 0 0.8 1.0 1.25
25 1 0.682391111272 0.898020148277 1.63185119629
25 2 0.749999977648 1.0 1.33333337307
26 0 0.8 0.75 1.66666662693
26 1 1.0 0.0 0.0
26 2 0.8 0.75 1.66666662693
27 0 1.33333333333 0.5 1.5
27 1 0.816820611132 0.773765087128 1.58221018314
27 2 0.5 0.666666686535 3.0
28 0 0.71428572645 0.800000011921 1.75
28 1 0.841367148599 0.770135879517 1.54328846931
28 2 0.749999977648 0.666666686535 2.0
29 0 2.0 0.5 1.0
29 1 0.68423866714 0.895764946938 1.63154220581
29 2 0.600000014305 1.0 1.66666662693
30 0 2.99999991059 0.333333343267 1.0
30 1 0.385656529435 0.95692306757 2.70970654488
30 2 0.600000014305 1.0 1.66666662693
31 0 0.600000014305 1.0 1.66666662693
31 1 0.226139460244 0.981135427952 4.50707435608
31 2 0.428571443168 1.0 2.33333325386
32 0 1.0 0.0 0.0
32 1 0.693973900597 0.861444592476 1.67274415493
32 2 0.312499995343 0.800000011921 4.0
33 0 1.0 1.0 1.0
33 1 0.682753677755 0.890128135681 1.64544534683
33 2 0.8 1.0 1.25
34 0 1.0 0.75 1.33333337307
34 1 0.905994934011 0.771645784378 1.43039596081
34 2 0.8 0.75 1.66666662693
35 0 1.0 1.0 1.0
35 1 0.805718457539 0.79606461525 1.55907988548
35 2 0.571428571429 0.75 2.33333325386
36 0 2.0 0.5 1.0
36 1 25.075387265 0.00963834114373 4.13761472702
36 2 1.4999999553 0.666666686535 1.0
37 0 1.33333333333 0.75 1.0
37 1 0.966918633608 0.735584020615 1.40597569942
37 2 0.2 0.75 6.66666650772
38 0 1.0 0.0 0.0
38 1 0.384683021328 0.942747294903 2.75741219521
38 2 0.571428571429 1.0 1.75
39 0 1.0 1.0 1.0
39 1 0.656620351987 0.909090936184 1.67524504662
39 2 0.727272727273 0.5 2.75
40 0 1.0 1.0 1.0
40 1 0.829289144692 0.781927704811 1.54215276241
40 2 0.8 0.875 1.42857146263
41 0 2.99999991059 0.333333343267 1.0
41 1 0.647992727682 0.915120780468 1.68636453152
41 2 1.0 0.875 1.14285719395
42 0 1.0 0.0 0.0
42 1 0.489331902699 0.928956210613 2.19989132881
42 2 1.79999991417 0.333333343267 1.66666662693
43 0 0.555555570273 1.0 1.79999995232
43 1 0.682334550541 0.838019192219 1.74883437157
43 2 1.09999996722 0.727272748947 1.25
44 0 0.749999977648 0.833333313465 1.60000002384
44 1 0.719377147556 0.817498385906 1.70042097569
44 2 0.473684198638 1.0 2.11111116409
45 0 0.624999990687 1.0 1.60000002384
45 1 0.69916229958 0.849164187908 1.68434226513
45 2 0.642857131909 0.777777791023 2.0
46 0 0.727272727273 0.75 1.83333337307
46 1 0.659352067699 0.883464574814 1.71669638157
46 2 0.608695633245 0.857142865658 1.91666662693
47 0 1.39999996662 0.571428596973 1.25
47 1 1.89565993584 0.408947825432 1.28994631767
47 2 0.764705893078 0.846153855324 1.54545450211
48 0 0.687499979511 0.818181812763 1.77777779102
48 1 0.706952927578 0.791215717793 1.78778219223
48 2 0.789473694117 0.800000011921 1.58333337307
49 0 0.4 1.0 2.5
49 1 1.00697883709 0.637504994869 1.55774378777
49 2 0.631578931518 0.833333313465 1.89999997616
50 0 1.0 0.571428596973 1.75
50 1 1.02718097585 0.673902690411 1.444627285
50 2 0.666666666667 0.833333313465 1.79999995232
51 0 0.545454533632 1.0 1.83333337307
51 1 0.561209105219 0.937895357609 1.89985692501
51 2 0.624999990687 1.0 1.60000002384
52 0 1.20000002861 0.666666686535 1.25
52 1 0.67083780033 0.821637928486 1.81427025795
52 2 0.43478261771 1.0 2.29999995232
53 0 1.0 0.0 0.0
53 1 1.0 0.0 0.0
53 2 1.0 0.0 0.0
