0 0 0.805194800208 0.887096762657 1.39999997616
0 1 0.831980570278 0.850880503654 1.41259682178
0 2 0.789473694117 0.888888895512 1.42499995232
1 0 0.772151895239 0.885245919228 1.46296298504
1 1 0.710870548229 0.89885789156 1.56501483917
1 2 0.652173926564 0.911111116409 1.68292677402
2 0 0.865671601745 0.86206895113 1.34000003338
2 1 0.725979609829 0.900265455246 1.53004777431
2 2 0.600000014305 0.854166686535 1.95121955872
3 0 0.901408450704 0.859375 1.2909090519
3 1 0.681334825642 0.914097189903 1.60563576221
3 2 0.925925889133 0.800000011921 1.35000002384
4 0 0.753246771905 0.948275864124 1.39999997616
4 1 0.692619006572 0.886828422546 1.62804353237
4 2 0.814814800425 0.818181812763 1.5
5 0 0.840000008011 0.873015880585 1.36363637447
5 1 0.671300287555 0.901479125023 1.65244686604
5 2 0.709677435729 0.909090936184 1.54999995232
6 0 1.01492538758 0.794117629528 1.24074077606
6 1 0.620068555925 0.898329019547 1.79524970055
6 2 0.764705893078 0.923076927662 1.41666662693
7 0 0.77777778808 0.888888895512 1.44642853737
7 1 0.710162099598 0.851904094219 1.6529198885
7 2 0.735294109913 0.860000014305 1.58139538765
8 0 0.684782593611 0.873015880585 1.67272722721
8 1 0.804080383423 0.794338881969 1.56565010548
8 2 0.83606558194 0.784313738346 1.52499997616
9 0 0.672897172272 0.902777791023 1.64615380764
9 1 0.736054132033 0.871356368065 1.55917334557
9 2 0.691176496034 0.87234044075 1.65853655338
10 0 0.78787881634 0.910256385803 1.39436614513
10 1 0.640949796134 0.897705435753 1.7379693985
10 2 0.822580613529 0.843137264252 1.44186043739
11 0 0.742857137797 0.910256385803 1.47887325287
11 1 0.654297227059 0.895916044712 1.70591592789
11 2 0.73809522762 0.870967745781 1.55555558205
12 0 0.844444435496 0.934210538864 1.26760566235
12 1 0.577265415011 0.925935268402 1.87087082863
12 2 0.722891570418 0.933333337307 1.48214280605
13 0 0.725663718345 0.914634168148 1.50666666031
13 1 0.684948210874 0.892348766327 1.63609170914
13 2 0.791666698125 0.877192974091 1.44000005722
14 0 0.749999977648 0.923076927662 1.44444441795
14 1 0.70278968348 0.874809145927 1.626527071
14 2 0.779220798523 0.916666686535 1.39999997616
15 0 1.03333336413 0.784946262836 1.23287665844
15 1 0.676007922613 0.884028494358 1.67333137989
15 2 0.840579701431 0.896551728249 1.32692313194
16 0 1.07317072547 0.738636374474 1.26153850555
16 1 0.624384062747 0.901349306107 1.7768676281
16 2 0.75903615548 0.857142865658 1.53703701496
17 0 0.847826051802 0.858974337578 1.37313437462
17 1 0.624632009102 0.899375855923 1.78005945683
17 2 0.788235285274 0.805970132351 1.57407402992
18 0 1.04494384052 0.763440847397 1.25352108479
18 1 0.58689650521 0.913159549236 1.86591482162
18 2 0.744444471068 0.940298497677 1.42857146263
19 0 0.857142886337 0.822916686535 1.41772150993
19 1 0.721602922813 0.862760126591 1.60624444485
19 2 0.827586179681 0.875 1.38095235825
20 0 0.95312505326 0.811475396156 1.29292929173
20 1 0.721420038389 0.864227414131 1.60392391682
20 2 0.736842133002 0.928571403027 1.46153843403
21 0 0.795031055901 0.8828125 1.42477881908
21 1 0.600711922365 0.906221807003 1.83695805073
21 2 0.790000010359 0.886075973511 1.42857146263
22 0 0.742268048535 0.909722208977 1.48091602325
22 1 0.736581650103 0.860335946083 1.57801473141
22 2 0.81188117662 0.890243887901 1.38356161118
23 0 0.806282705403 0.883116900921 1.40441179276
23 1 0.659298898859 0.891959130764 1.70048451424
23 2 0.828828821708 0.891304373741 1.35365855694
24 0 0.939890683443 0.837209284306 1.27083337307
24 1 0.70714088879 0.852128326893 1.65954506397
24 2 0.854545469363 0.840425550938 1.39240503311
25 0 0.800884919422 0.906077325344 1.37804877758
25 1 0.751513915751 0.861402094364 1.54474592209
25 2 0.90350874831 0.825242698193 1.34117650986
26 0 0.719723154891 0.899038434029 1.54545450211
26 1 0.881996422643 0.787523567677 1.43969202042
26 2 0.795454517438 0.838095247746 1.5
27 0 0.78671327458 0.906666696072 1.40196073055
27 1 0.65301541956 0.870704472065 1.75875675678
27 2 0.662921342987 0.898305058479 1.67924523354
28 0 0.666666666667 0.92173910141 1.62735843658
28 1 0.891111951263 0.771876811981 1.45385050774
28 2 0.818181827049 0.825396835804 1.48076927662
29 0 0.79078017895 0.878923773766 1.4387755394
29 1 0.744875004506 0.856041133404 1.56827414036
29 2 0.79605259412 0.900826454163 1.394495368
30 0 0.777408666199 0.867521345615 1.48275864124
30 1 1.02769069169 0.709879696369 1.37073290348
30 2 0.894409916696 0.798611104488 1.39999997616
31 0 1.24210523354 0.622881352901 1.292517066
31 1 0.699669991221 0.838679254055 1.70416200161
31 2 0.780219792485 0.852112650871 1.50413227081
32 0 0.876106176205 0.848484873772 1.34523808956
32 1 0.732898035568 0.874063551426 1.56103777885
32 2 0.688372065543 0.939189195633 1.54676258564
33 0 0.812499969732 0.879120886326 1.39999997616
33 1 1.0 0.0 0.0
33 2 0.886792464798 0.851063847542 1.32500004768
34 0 1.81578951356 0.449275374413 1.22580647469
34 1 0.783947401204 0.868412196636 1.46888291836
34 2 0.848684235153 0.87596899271 1.34513270855
35 0 0.804123701458 0.897435903549 1.38571429253
35 1 0.807506066205 0.850449800491 1.45614802837
35 2 0.755434810017 0.805755376816 1.64285719395
36 0 0.696969689416 0.913043498993 1.57142853737
36 1 1.0 0.0 0.0
36 2 0.869565235419 0.858333349228 1.33980584145
37 0 5.87500018603 0.148936167359 1.14285719395
37 1 0.766087609851 0.868590593338 1.5028181076
37 2 0.960317426701 0.809917330742 1.28571426868
38 0 1.0 0.0 0.0
38 1 1.13049689203 0.714321792126 1.23833096027
38 2 1.10126585851 0.747126460075 1.21538460255
39 0 1.31521742709 0.652892589569 1.16455698013
39 1 0.736652543247 0.893586397171 1.51915025711
39 2 1.03508770739 0.745762705803 1.29545450211
40 0 0.908602197124 0.798816561699 1.37777781487
40 1 0.753074539729 0.875733613968 1.51631700993
40 2 0.791139204095 0.871999979019 1.44954133034
41 0 0.854430401665 0.829629600048 1.41071426868
41 1 0.783082097145 0.889304816723 1.43595910072
41 2 3.18749988719 0.267973870039 1.1707316637
42 0 0.844339635461 0.837988853455 1.41333329678
42 1 0.659627324992 0.893462479115 1.69677805901
42 2 0.911504420932 0.766990303993 1.43037974834
43 0 0.686098667545 0.869281053543 1.67669177055
43 1 0.767528469372 0.859548985958 1.51577544212
43 2 0.829268321617 0.882352948189 1.36666667461
44 0 1.0 0.0 0.0
44 1 0.553036569101 0.938360273838 1.92697703838
44 2 0.918918948525 0.735294103622 1.48000001907
45 0 0.775862043451 0.888888895512 1.45000004768
45 1 0.71250846722 0.899365067482 1.56053650379
45 2 0.912621319086 0.797872364521 1.37333333492
46 0 0.811111146565 0.849315047264 1.45161294937
46 1 0.765538935301 0.88523465395 1.47561919689
46 2 1.03333336413 0.741935491562 1.30434787273
47 0 1.35087714495 0.675324678421 1.09615385532
47 1 0.967253552998 0.803785920143 1.28623187542
47 2 0.94230771823 0.795918345451 1.33333337307
48 0 0.790000010359 0.860759496689 1.47058820724
48 1 0.945047041636 0.777352690697 1.36122047901
48 2 1.0 0.642857134342 1.55555558205
49 0 0.866666673554 0.78205126524 1.47540986538
49 1 0.602755978837 0.927867531776 1.78802037239
49 2 1.14285714286 0.71875 1.21739125252
50 0 0.940298510809 0.777777791023 1.36734688282
50 1 0.817704893679 0.875701665878 1.39652013779
50 2 0.78787881634 0.769230782986 1.64999997616
51 0 0.880952350947 0.635135114193 1.78723406792
51 1 0.67943773394 0.927383363247 1.58705163002
51 2 1.0 0.703703701496 1.42105257511
52 0 1.14285714286 0.67045456171 1.30508470535
52 1 0.709494004542 0.892227590084 1.57970368862
52 2 2.71428574895 0.210526317358 1.75
53 0 1.48437493641 0.484210520983 1.39130437374
53 1 0.91053017823 0.792155265808 1.38642168045
53 2 1.45833329349 0.40000000596 1.71428573132
