3147864
3148120
3148376
3148632
3148888
3149144
3149400
3149656
3147865
3148121
3148377
3148633
3148889
3149145
3149401
3149657
3147866
3148122
3148378
3148634
3148890
3149146
3149402
3149658
3147867
3148123
3148379
3148635
3148891
3149147
3149403
3149659
3147868
3148124
3148380
3148636
3148892
3149148
3149404
3149660
3147869
3148125
3148381
3148637
3148893
3149149
3149405
3149661
3147870
3148126
3148382
3148638
3148894
3149150
3149406
3149662
3147871
3148127
3148383
3148639
3148895
3149151
3149407
3149663
