0 0 0.935897455922 0.739726006985 1.44444441795
0 1 0.827295376101 0.864831387997 1.39768064022
0 2 0.759493638796 0.866666674614 1.51923072338
1 0 0.916666639348 0.833333313465 1.30909085274
1 1 0.701546300707 0.910164952278 1.56611466408
1 2 0.578947361156 0.927272737026 1.86274504662
2 0 0.807228890156 0.835820913315 1.48214280605
2 1 0.738898476295 0.901735067368 1.50084650517
2 2 0.838235308813 0.877192974091 1.36000001431
3 0 0.934210530712 0.774647891521 1.38181817532
3 1 0.703148675745 0.917255222797 1.55046737194
3 2 0.914285714286 0.859375 1.27272725105
4 0 0.6120689825 0.901408433914 1.8125
4 1 0.722425651658 0.886387646198 1.56164801121
4 2 0.756410265659 0.915254235268 1.44444441795
5 0 0.71428572645 0.837499976158 1.67164182663
5 1 0.670663868332 0.903837382793 1.64969933033
5 2 0.811594236551 0.857142865658 1.4375
6 0 0.862068990323 0.800000011921 1.45000004768
6 1 0.62250510461 0.906317293644 1.77246153355
6 2 0.843749993714 0.888888895512 1.33333337307
7 0 0.818181827049 0.822222232819 1.48648643494
7 1 0.711781833807 0.855996847153 1.64127337933
7 2 0.614457845446 0.941176474094 1.72916662693
8 0 0.801886763595 0.847058832645 1.47222220898
8 1 0.764245035204 0.860971331596 1.51977288723
8 2 0.895522381686 0.816666662693 1.36734688282
9 0 0.814814800425 0.897727251053 1.36708855629
9 1 0.75422085363 0.874680757523 1.51583492756
9 2 0.71428572645 0.892307698727 1.56896555424
10 0 0.796296294538 0.87209302187 1.44000005722
10 1 0.649480275363 0.904259026051 1.70271193981
10 2 0.733333327505 0.818181812763 1.66666662693
11 0 0.8 0.807692289352 1.54761910439
11 1 0.67213022677 0.901737749577 1.64993298054
11 2 0.716216220831 0.962264180183 1.45098042488
12 0 0.914285714286 0.78125 1.39999997616
12 1 0.569540521792 0.937445163727 1.87296438217
12 2 0.830985879217 0.864406764507 1.39215683937
13 0 0.890109853963 0.839506149292 1.33823525906
13 1 0.702476586439 0.900761187077 1.58036887646
13 2 0.824324334948 0.868852436543 1.3962264061
14 0 0.83653848551 0.873563230038 1.36842107773
14 1 0.72259952273 0.878519177437 1.57525587082
14 2 0.797468364057 0.873015880585 1.43636357784
15 0 1.2077922293 0.677419364452 1.22222220898
15 1 0.686937722079 0.88636225462 1.64237141609
15 2 0.880000008392 0.863636374474 1.31578946114
16 0 1.16455699717 0.695652186871 1.234375
16 1 0.625933917421 0.916200101376 1.74373781681
16 2 0.946666627545 0.760563373566 1.38888883591
17 0 0.792792799604 0.863636374474 1.46052634716
17 1 0.639165347741 0.911813735962 1.71585524082
17 2 0.762886601688 0.918918907642 1.42647063732
18 0 1.0080000298 0.817460298538 1.21359229088
18 1 0.594752870371 0.928295075893 1.81124591827
18 2 0.885416625986 0.823529422283 1.37142860889
19 0 0.74866307106 0.87142854929 1.53278684616
19 1 0.746511371282 0.870623648167 1.538626194
19 2 0.849056611412 0.844444453716 1.39473688602
20 0 0.988826760984 0.779660999775 1.29710149765
20 1 0.768668315439 0.865296125412 1.50347518921
20 2 0.758064537992 0.936170220375 1.40909087658
21 0 0.79399139356 0.827027022839 1.52287578583
21 1 0.602511503666 0.921048283577 1.80198955536
21 2 0.809859176006 0.904347836971 1.3653845787
22 0 0.753424631697 0.859090924263 1.54497349262
22 1 0.792851320718 0.859783530235 1.46696293354
22 2 0.936170165277 0.856060624123 1.2477875948
23 0 0.84969328478 0.848375439644 1.38723409176
23 1 0.673519019913 0.906680583954 1.63755464554
23 2 0.784946219454 0.88356167078 1.44186043739
24 0 0.929378553607 0.811550140381 1.32584273815
24 1 0.728185299831 0.859168708324 1.59837853909
24 2 0.817733988227 0.87349396944 1.39999997616
25 0 0.796714597778 0.881443321705 1.42397665977
25 1 0.73995944808 0.894971430302 1.51002061367
25 2 0.862244881178 0.881656825542 1.31543624401
26 0 0.820183499335 0.843400418758 1.44562339783
26 1 0.936497291801 0.780638694763 1.36786544323
26 2 0.882882839267 0.826530635357 1.37037038803
27 0 0.781102343435 0.854838728905 1.49764156342
27 1 0.677750274559 0.886851966381 1.6637159586
27 2 0.847908749475 0.843049347401 1.39893615246
28 0 0.60476188794 0.901574790478 1.83406114578
28 1 0.802131978822 0.830410480499 1.50127875805
28 2 0.855704661702 0.811764717102 1.4396135807
29 0 0.831563003085 0.822992682457 1.46119737625
29 1 0.740368733038 0.883219718933 1.52926647663
29 2 0.837209320894 0.873015880585 1.36818182468
30 0 1.02920961989 0.679465770721 1.42997539043
30 1 0.914869832445 0.780163943768 1.40105378628
30 2 0.983922801673 0.754901945591 1.3463203907
31 0 0.844135804643 0.811700165272 1.45945942402
31 1 0.74479240239 0.830987393856 1.61573576927
31 2 0.798270881031 0.830324888229 1.50869560242
32 0 0.9757365358 0.80106574297 1.27937912941
32 1 0.715181038607 0.896293818951 1.56003236771
32 2 0.67605635619 0.888888895512 1.6640625
33 0 0.818452362949 0.874545454979 1.39708936214
33 1 1.0 0.0 0.0
33 2 0.906542051025 0.824742257595 1.33749997616
34 0 0.822840426041 0.868327379227 1.39959013462
34 1 0.847016552985 0.859109401703 1.37423062325
34 2 0.881019799978 0.819935679436 1.38431370258
35 0 0.821073555145 0.881355941296 1.38186812401
35 1 0.839536374921 0.855230271816 1.39276361465
35 2 0.800561765048 0.838596463203 1.48953974247
36 0 0.807197975108 0.86305731535 1.43542432785
36 1 32851.9999374 3.04395471176e-05 1.0
36 2 0.945098042308 0.825726151466 1.28140699863
37 0 1.53608250443 0.523489952087 1.24358975887
37 1 0.806536432844 0.876503705978 1.41456282139
37 2 0.89338231457 0.8106995821 1.38071060181
38 0 1.0 0.0 0.0
38 1 1.24214707655 0.668315708637 1.20460677147
38 2 1.38461541001 0.62222224474 1.16071426868
39 0 1.42248063626 0.583106279373 1.20560753345
39 1 0.73153687828 0.911964595318 1.49894535542
39 2 1.16967509428 0.645061731339 1.32535886765
40 0 0.887351732665 0.772828519344 1.45821321011
40 1 0.811285058601 0.861940383911 1.43004357815
40 2 0.813364033629 0.844192624092 1.45637583733
41 0 0.852054783111 0.864951789379 1.35687732697
41 1 0.813972057786 0.887813091278 1.38378620148
41 2 0.949206319391 0.812709033489 1.2962962389
42 0 0.975550099787 0.812030076981 1.26234567165
42 1 0.654792019079 0.917468607426 1.66458284855
42 2 0.993174021834 0.80068731308 1.25751078129
43 0 0.847031947794 0.789757430553 1.49488055706
43 1 0.796163204285 0.85457277298 1.46976804733
43 2 0.992031916798 0.787148594856 1.2806122303
44 0 1.0 0.0 0.0
44 1 0.565751159965 0.947733879089 1.86503994465
44 2 3.26436766849 0.253521114588 1.20833337307
45 0 0.797872342449 0.879999995232 1.42424237728
45 1 0.726144007257 0.904844105244 1.52196085453
45 2 0.991452942965 0.741379320621 1.36046516895
46 0 0.821656061561 0.821705400944 1.48113203049
46 1 1.9311336473 0.377809286118 1.37061357498
46 2 1.06896551504 0.790322601795 1.18367350101
47 0 1.60714279898 0.540740728378 1.15068495274
47 1 1.08708827637 0.748516440392 1.22894895077
47 2 0.841269860372 0.792452812195 1.5
48 0 0.810055861606 0.737931013107 1.67289721966
48 1 1.02248300068 0.732982933521 1.33428943157
48 2 1.51162786088 0.538461565971 1.22857141495
49 0 0.830188649369 0.772727251053 1.55882358551
49 1 4.75146930931 0.145679444075 1.44468700886
49 2 1.04999999687 0.761904776096 1.25
50 0 1.0 0.740963876247 1.34959352016
50 1 0.86454914886 0.834459483624 1.3861335516
50 2 0.925000041351 0.837837815285 1.29032254219
51 0 1.12195118689 0.690217375755 1.29133856297
51 1 0.696423120269 0.934489786625 1.53656971455
51 2 1.16666665508 0.642857134342 1.33333337307
52 0 1.17499997549 0.632978737354 1.34453785419
52 1 0.721765840614 0.902170062065 1.53573143482
52 2 3.73684212285 0.14084507525 1.89999997616
53 0 1.47222220028 0.471698105335 1.44000005722
53 1 0.90409934284 0.786762475967 1.40585398674
53 2 2.24999998324 0.277777791023 1.60000002384
