140849
140594
863040
991786
1129770
1254434
1254690
1254182
1259564
1387567
1450287
1583136
1584160
1583394
1584162
1583139
1583651
1583907
1584419
1583396
1584676
1583398
1583654
1583911
1585707
1653808
1846843
1910309
2173466
2299959
2368303
2368304
2564399
2564144
2564400
2563640
2639919
2639920
2694959
2694448
2694704
2694960
2700080
2700081
2765851
2766108
2768681
2761264
2762035
2764349
2763070
2764606
2961432
2957357
2957613
2957359
2957615
2958127
2958383
3030312
3029039
3029040
3090737
3089202
3090738
3090740
3089205
3090485
3090997
3090742
3091254
3092022
3092534
3091255
3091511
3092535
3090232
3090488
3091256
3090233
3091769
3089473
