329760
330016
330272
330528
330784
331040
331296
331552
329761
330017
330273
330529
330785
331041
331297
331553
329762
330018
330274
330530
330786
331042
331298
331554
329763
330019
330275
330531
330787
331043
331299
331555
329764
330020
330276
330532
330788
331044
331300
331556
329765
330021
330277
330533
330789
331045
331301
331557
329766
330022
330278
330534
330790
331046
331302
331558
329767
330023
330279
330535
330791
331047
331303
331559
542760
543016
543272
543528
543784
544040
544296
544552
542761
543017
543273
543529
543785
544041
544297
544553
542762
543018
543274
543530
543786
544042
544298
544554
542763
543019
543275
543531
543787
544043
544299
544555
542764
543020
543276
543532
543788
544044
544300
544556
542765
543021
543277
543533
543789
544045
544301
544557
542766
543022
543278
543534
543790
544046
544302
544558
542767
543023
543279
543535
543791
544047
544303
544559
860176
860432
860688
860944
861200
861456
861712
861968
860177
860433
860689
860945
861201
861457
861713
861969
860178
860434
860690
860946
861202
861458
861714
861970
860179
860435
860691
860947
861203
861459
861715
861971
860180
860436
860692
860948
861204
861460
861716
861972
860181
860437
860693
860949
861205
861461
861717
861973
860182
860438
860694
860950
861206
861462
861718
861974
860183
860439
860695
860951
861207
861463
861719
861975
1067072
1067328
1067584
1067840
1068096
1068352
1068608
1068864
1067073
1067329
1067585
1067841
1068097
1068353
1068609
1068865
1067074
1067330
1067586
1067842
1068098
1068354
1068610
1068866
1067075
1067331
1067587
1067843
1068099
1068355
1068611
1068867
1067076
1067332
1067588
1067844
1068100
1068356
1068612
1068868
1067077
1067333
1067589
1067845
1068101
1068357
1068613
1068869
1067078
1067334
1067590
1067846
1068102
1068358
1068614
1068870
1067079
1067335
1067591
1067847
1068103
1068359
1068615
1068871
1187888
1188144
1188400
1188656
1188912
1189168
1189424
1189680
1187889
1188145
1188401
1188657
1188913
1189169
1189425
1189681
1187890
1188146
1188402
1188658
1188914
1189170
1189426
1189682
1187891
1188147
1188403
1188659
1188915
1189171
1189427
1189683
1187892
1188148
1188404
1188660
1188916
1189172
1189428
1189684
1187893
1188149
1188405
1188661
1188917
1189173
1189429
1189685
1187894
1188150
1188406
1188662
1188918
1189174
1189430
1189686
1187895
1188151
1188407
1188663
1188919
1189175
1189431
1189687
1323040
1323296
1323552
1323808
1324064
1324320
1324576
1324832
1323041
1323297
1323553
1323809
1324065
1324321
1324577
1324833
1323042
1323298
1323554
1323810
1324066
1324322
1324578
1324834
1323043
1323299
1323555
1323811
1324067
1324323
1324579
1324835
1323044
1323300
1323556
1323812
1324068
1324324
1324580
1324836
1323045
1323301
1323557
1323813
1324069
1324325
1324581
1324837
1323046
1323302
1323558
1323814
1324070
1324326
1324582
1324838
1323047
1323303
1323559
1323815
1324071
1324327
1324583
1324839
1579072
1579328
1579584
1579840
1580096
1580352
1580608
1580864
1579073
1579329
1579585
1579841
1580097
1580353
1580609
1580865
1579074
1579330
1579586
1579842
1580098
1580354
1580610
1580866
1579075
1579331
1579587
1579843
1580099
1580355
1580611
1580867
1579076
1579332
1579588
1579844
1580100
1580356
1580612
1580868
1579077
1579333
1579589
1579845
1580101
1580357
1580613
1580869
1579078
1579334
1579590
1579846
1580102
1580358
1580614
1580870
1579079
1579335
1579591
1579847
1580103
1580359
1580615
1580871
1849392
1849648
1849904
1850160
1850416
1850672
1850928
1851184
1849393
1849649
1849905
1850161
1850417
1850673
1850929
1851185
1849394
1849650
1849906
1850162
1850418
1850674
1850930
1851186
1849395
1849651
1849907
1850163
1850419
1850675
1850931
1851187
1849396
1849652
1849908
1850164
1850420
1850676
1850932
1851188
1849397
1849653
1849909
1850165
1850421
1850677
1850933
1851189
1849398
1849654
1849910
1850166
1850422
1850678
1850934
1851190
1849399
1849655
1849911
1850167
1850423
1850679
1850935
1851191
1972272
1972528
1972784
1973040
1973296
1973552
1973808
1974064
1972273
1972529
1972785
1973041
1973297
1973553
1973809
1974065
1972274
1972530
1972786
1973042
1973298
1973554
1973810
1974066
1972275
1972531
1972787
1973043
1973299
1973555
1973811
1974067
1972276
1972532
1972788
1973044
1973300
1973556
1973812
1974068
1972277
1972533
1972789
1973045
1973301
1973557
1973813
1974069
1972278
1972534
1972790
1973046
1973302
1973558
1973814
1974070
1972279
1972535
1972791
1973047
1973303
1973559
1973815
1974071
1982536
1982792
1983048
1983304
1983560
1983816
1984072
1984328
1982537
1982793
1983049
1983305
1983561
1983817
1984073
1984329
1982538
1982794
1983050
1983306
1983562
1983818
1984074
1984330
1982539
1982795
1983051
1983307
1983563
1983819
1984075
1984331
1982540
1982796
1983052
1983308
1983564
1983820
1984076
1984332
1982541
1982797
1983053
1983309
1983565
1983821
1984077
1984333
1982542
1982798
1983054
1983310
1983566
1983822
1984078
1984334
1982543
1982799
1983055
1983311
1983567
1983823
1984079
1984335
2046000
2046256
2046512
2046768
2047024
2047280
2047536
2047792
2046001
2046257
2046513
2046769
2047025
2047281
2047537
2047793
2046002
2046258
2046514
2046770
2047026
2047282
2047538
2047794
2046003
2046259
2046515
2046771
2047027
2047283
2047539
2047795
2046004
2046260
2046516
2046772
2047028
2047284
2047540
2047796
2046005
2046261
2046517
2046773
2047029
2047285
2047541
2047797
2046006
2046262
2046518
2046774
2047030
2047286
2047542
2047798
2046007
2046263
2046519
2046775
2047031
2047287
2047543
2047799
2170888
2171144
2171400
2171656
2171912
2172168
2172424
2172680
2170889
2171145
2171401
2171657
2171913
2172169
2172425
2172681
2170890
2171146
2171402
2171658
2171914
2172170
2172426
2172682
2170891
2171147
2171403
2171659
2171915
2172171
2172427
2172683
2170892
2171148
2171404
2171660
2171916
2172172
2172428
2172684
2170893
2171149
2171405
2171661
2171917
2172173
2172429
2172685
2170894
2171150
2171406
2171662
2171918
2172174
2172430
2172686
2170895
2171151
2171407
2171663
2171919
2172175
2172431
2172687
2373672
2373928
2374184
2374440
2374696
2374952
2375208
2375464
2373673
2373929
2374185
2374441
2374697
2374953
2375209
2375465
2373674
2373930
2374186
2374442
2374698
2374954
2375210
2375466
2373675
2373931
2374187
2374443
2374699
2374955
2375211
2375467
2373676
2373932
2374188
2374444
2374700
2374956
2375212
2375468
2373677
2373933
2374189
2374445
2374701
2374957
2375213
2375469
2373678
2373934
2374190
2374446
2374702
2374958
2375214
2375470
2373679
2373935
2374191
2374447
2374703
2374959
2375215
2375471
3024952
3025208
3025464
3025720
3025976
3026232
3026488
3026744
3024953
3025209
3025465
3025721
3025977
3026233
3026489
3026745
3024954
3025210
3025466
3025722
3025978
3026234
3026490
3026746
3024955
3025211
3025467
3025723
3025979
3026235
3026491
3026747
3024956
3025212
3025468
3025724
3025980
3026236
3026492
3026748
3024957
3025213
3025469
3025725
3025981
3026237
3026493
3026749
3024958
3025214
3025470
3025726
3025982
3026238
3026494
3026750
3024959
3025215
3025471
3025727
3025983
3026239
3026495
3026751
3029080
3029336
3029592
3029848
3030104
3030360
3030616
3030872
3029081
3029337
3029593
3029849
3030105
3030361
3030617
3030873
3029082
3029338
3029594
3029850
3030106
3030362
3030618
3030874
3029083
3029339
3029595
3029851
3030107
3030363
3030619
3030875
3029084
3029340
3029596
3029852
3030108
3030364
3030620
3030876
3029085
3029341
3029597
3029853
3030109
3030365
3030621
3030877
3029086
3029342
3029598
3029854
3030110
3030366
3030622
3030878
3029087
3029343
3029599
3029855
3030111
3030367
3030623
3030879
