0 0 1.0 0.0 0.0
0 1 4.99999992549 0.10000000149 2.0
0 2 1.0 0.0 0.0
1 0 1.0 0.0 0.0
1 1 0.692307705005 0.888888895512 1.625
1 2 1.0 0.0 0.0
2 0 1.0 0.0 0.0
2 1 0.818181827049 1.0 1.22222220898
2 2 1.0 0.0 0.0
3 0 1.0 0.0 0.0
3 1 0.600000014305 0.888888895512 1.875
3 2 1.0 0.0 0.0
4 0 1.0 0.0 0.0
4 1 0.899999957085 0.555555582047 2.0
4 2 1.0 0.0 0.0
5 0 1.0 0.0 0.0
5 1 0.615384615385 1.0 1.625
5 2 1.0 0.0 0.0
6 0 1.0 0.0 0.0
6 1 0.473684198638 1.0 2.11111116409
6 2 1.0 0.0 0.0
7 0 1.0 0.0 0.0
7 1 0.600000014305 0.777777791023 2.14285707474
7 2 1.0 0.0 0.0
8 0 1.0 0.0 0.0
8 1 0.322580655085 0.899999976158 3.44444441795
8 2 1.0 0.0 0.0
9 0 1.0 0.0 0.0
9 1 0.699999983311 1.0 1.42857146263
9 2 1.0 0.0 0.0
10 0 1.0 0.0 0.0
10 1 0.476190497816 0.899999976158 2.33333325386
10 2 1.0 0.0 0.0
11 0 1.0 0.0 0.0
11 1 0.4 1.0 2.5
11 2 1.0 0.0 0.0
12 0 1.0 0.0 0.0
12 1 0.83333330022 0.899999976158 1.33333337307
12 2 1.0 0.0 0.0
13 0 1.0 0.0 0.0
13 1 0.769230797446 0.800000011921 1.625
13 2 1.0 0.0 0.0
14 0 1.0 0.0 0.0
14 1 0.666666666667 0.899999976158 1.66666662693
14 2 1.0 0.0 0.0
15 0 1.0 0.0 0.0
15 1 0.647058841679 0.54545456171 2.83333325386
15 2 1.0 0.0 0.0
16 0 1.0 0.0 0.0
16 1 0.5 0.909090936184 2.20000004768
16 2 1.0 0.0 0.0
17 0 1.0 0.0 0.0
17 1 0.642857131909 0.777777791023 2.0
17 2 1.0 0.0 0.0
18 0 1.0 0.0 0.0
18 1 0.769230797446 0.800000011921 1.625
18 2 1.0 0.0 0.0
19 0 1.0 0.0 0.0
19 1 0.749999977648 0.777777791023 1.71428573132
19 2 1.0 0.0 0.0
20 0 1.0 0.0 0.0
20 1 0.733333327505 0.818181812763 1.66666662693
20 2 1.0 0.0 0.0
21 0 1.0 0.0 0.0
21 1 0.666666666667 1.0 1.5
21 2 1.0 0.0 0.0
22 0 1.0 0.0 0.0
22 1 0.647058841679 0.909090936184 1.70000004768
22 2 1.0 0.0 0.0
23 0 1.0 0.0 0.0
23 1 0.583333327538 0.857142865658 2.0
23 2 1.0 0.0 0.0
24 0 1.0 0.0 0.0
24 1 0.71428572645 0.800000011921 1.75
24 2 1.0 0.0 0.0
25 0 1.0 0.0 0.0
25 1 2.99999991059 0.333333343267 1.0
25 2 1.0 0.0 0.0
26 0 1.0 0.0 0.0
26 1 1.0 0.0 0.0
26 2 1.0 0.0 0.0
27 0 1.0 0.0 0.0
27 1 0.5 0.75 2.66666674614
27 2 1.0 0.0 0.0
28 0 1.0 0.0 0.0
28 1 0.5 1.0 2.0
28 2 1.0 0.0 0.0
29 0 1.0 0.0 0.0
29 1 0.571428571429 1.0 1.75
29 2 1.0 0.0 0.0
30 0 1.0 0.0 0.0
30 1 0.349999991655 0.857142865658 3.33333325386
30 2 1.0 0.0 0.0
31 0 1.0 0.0 0.0
31 1 0.281249997905 0.888888895512 4.0
31 2 1.0 0.0 0.0
32 0 1.0 0.0 0.0
32 1 0.600000014305 0.777777791023 2.14285707474
32 2 1.0 0.0 0.0
33 0 1.0 0.0 0.0
33 1 0.5 0.857142865658 2.33333325386
33 2 1.0 0.0 0.0
34 0 1.0 0.0 0.0
34 1 0.874999960884 0.714285731316 1.60000002384
34 2 1.0 0.0 0.0
35 0 1.0 0.0 0.0
35 1 0.449999978542 1.0 2.22222232819
35 2 1.0 0.0 0.0
36 0 1.0 0.0 0.0
36 1 1.0 0.0 0.0
36 2 1.0 0.0 0.0
37 0 1.0 0.0 0.0
37 1 1.22222223032 0.727272748947 1.125
37 2 1.0 0.0 0.0
38 0 1.0 0.0 0.0
38 1 0.32 0.875 3.57142853737
38 2 1.0 0.0 0.0
39 0 1.0 0.0 0.0
39 1 0.555555570273 1.0 1.79999995232
39 2 1.0 0.0 0.0
40 0 1.0 0.0 0.0
40 1 0.642857131909 0.888888895512 1.75
40 2 1.0 0.0 0.0
41 0 1.0 0.0 0.0
41 1 0.615384615385 0.875 1.85714280605
41 2 1.0 0.0 0.0
42 0 1.0 0.0 0.0
42 1 1.0 0.0 0.0
42 2 1.0 0.0 0.0
43 0 1.0 0.0 0.0
43 1 1.0 0.0 0.0
43 2 1.0 0.0 0.0
44 0 1.0 0.0 0.0
44 1 0.5 1.0 2.0
44 2 1.0 0.0 0.0
45 0 1.0 0.0 0.0
45 1 1.0 0.666666686535 1.5
45 2 1.0 0.0 0.0
46 0 1.0 0.0 0.0
46 1 0.727272727273 0.75 1.83333337307
46 2 1.0 0.0 0.0
47 0 1.0 0.0 0.0
47 1 1.79999991417 0.555555582047 1.0
47 2 1.0 0.0 0.0
48 0 1.0 0.0 0.0
48 1 0.699999983311 1.0 1.42857146263
48 2 1.0 0.0 0.0
49 0 1.0 0.0 0.0
49 1 1.0 0.75 1.33333337307
49 2 1.0 0.0 0.0
50 0 1.0 0.0 0.0
50 1 0.699999983311 0.857142865658 1.66666662693
50 2 1.0 0.0 0.0
51 0 1.0 0.0 0.0
51 1 0.727272727273 0.875 1.57142853737
51 2 1.0 0.0 0.0
52 0 1.0 0.0 0.0
52 1 0.38888889404 1.0 2.57142853737
52 2 1.0 0.0 0.0
