1114112
1114368
1114624
1114880
1115136
1115392
1115648
1115904
1116160
1116416
1116672
1116928
1117184
1117440
1117696
1117952
1118208
1118464
1118720
1118976
1119232
1119488
1119744
1120000
1120256
1120512
1120768
1121024
1121280
1121536
1121792
1122048
1122304
1122560
1122816
1123072
1123328
1123584
1123840
1124096
1124352
1124608
1124864
1125120
1125376
1125632
1125888
1126144
1126400
1126656
1126912
1127168
1127424
1127680
1127936
1128192
1128448
1128704
1128960
1129216
1129472
1129728
1129984
1130240
1114113
1114369
1114625
1114881
1115137
1115393
1115649
1115905
1116161
1116417
1116673
1116929
1117185
1117441
1117697
1117953
1118209
1118465
1118721
1118977
1119233
1119489
1119745
1120001
1120257
1120513
1120769
1121025
1121281
1121537
1121793
1122049
1122305
1122561
1122817
1123073
1123329
1123585
1123841
1124097
1124353
1124609
1124865
1125121
1125377
1125633
1125889
1126145
1126401
1126657
1126913
1127169
1127425
1127681
1127937
1128193
1128449
1128705
1128961
1129217
1129473
1129729
1129985
1130241
1114114
1114370
1114626
1114882
1115138
1115394
1115650
1115906
1116162
1116418
1116674
1116930
1117186
1117442
1117698
1117954
1118210
1118466
1118722
1118978
1119234
1119490
1119746
1120002
1120258
1120514
1120770
1121026
1121282
1121538
1121794
1122050
1122306
1122562
1122818
1123074
1123330
1123586
1123842
1124098
1124354
1124610
1124866
1125122
1125378
1125634
1125890
1126146
1126402
1126658
1126914
1127170
1127426
1127682
1127938
1128194
1128450
1128706
1128962
1129218
1129474
1129730
1129986
1130242
1114115
1114371
1114627
1114883
1115139
1115395
1115651
1115907
1116163
1116419
1116675
1116931
1117187
1117443
1117699
1117955
1118211
1118467
1118723
1118979
1119235
1119491
1119747
1120003
1120259
1120515
1120771
1121027
1121283
1121539
1121795
1122051
1122307
1122563
1122819
1123075
1123331
1123587
1123843
1124099
1124355
1124611
1124867
1125123
1125379
1125635
1125891
1126147
1126403
1126659
1126915
1127171
1127427
1127683
1127939
1128195
1128451
1128707
1128963
1129219
1129475
1129731
1129987
1130243
1114116
1114372
1114628
1114884
1115140
1115396
1115652
1115908
1116164
1116420
1116676
1116932
1117188
1117444
1117700
1117956
1118212
1118468
1118724
1118980
1119236
1119492
1119748
1120004
1120260
1120516
1120772
1121028
1121284
1121540
1121796
1122052
1122308
1122564
1122820
1123076
1123332
1123588
1123844
1124100
1124356
1124612
1124868
1125124
1125380
1125636
1125892
1126148
1126404
1126660
1126916
1127172
1127428
1127684
1127940
1128196
1128452
1128708
1128964
1129220
1129476
1129732
1129988
1130244
1114117
1114373
1114629
1114885
1115141
1115397
1115653
1115909
1116165
1116421
1116677
1116933
1117189
1117445
1117701
1117957
1118213
1118469
1118725
1118981
1119237
1119493
1119749
1120005
1120261
1120517
1120773
1121029
1121285
1121541
1121797
1122053
1122309
1122565
1122821
1123077
1123333
1123589
1123845
1124101
1124357
1124613
1124869
1125125
1125381
1125637
1125893
1126149
1126405
1126661
1126917
1127173
1127429
1127685
1127941
1128197
1128453
1128709
1128965
1129221
1129477
1129733
1129989
1130245
1114118
1114374
1114630
1114886
1115142
1115398
1115654
1115910
1116166
1116422
1116678
1116934
1117190
1117446
1117702
1117958
1118214
1118470
1118726
1118982
1119238
1119494
1119750
1120006
1120262
1120518
1120774
1121030
1121286
1121542
1121798
1122054
1122310
1122566
1122822
1123078
1123334
1123590
1123846
1124102
1124358
1124614
1124870
1125126
1125382
1125638
1125894
1126150
1126406
1126662
1126918
1127174
1127430
1127686
1127942
1128198
1128454
1128710
1128966
1129222
1129478
1129734
1129990
1130246
1114119
1114375
1114631
1114887
1115143
1115399
1115655
1115911
1116167
1116423
1116679
1116935
1117191
1117447
1117703
1117959
1118215
1118471
1118727
1118983
1119239
1119495
1119751
1120007
1120263
1120519
1120775
1121031
1121287
1121543
1121799
1122055
1122311
1122567
1122823
1123079
1123335
1123591
1123847
1124103
1124359
1124615
1124871
1125127
1125383
1125639
1125895
1126151
1126407
1126663
1126919
1127175
1127431
1127687
1127943
1128199
1128455
1128711
1128967
1129223
1129479
1129735
1129991
1130247
1114120
1114376
1114632
1114888
1115144
1115400
1115656
1115912
1116168
1116424
1116680
1116936
1117192
1117448
1117704
1117960
1118216
1118472
1118728
1118984
1119240
1119496
1119752
1120008
1120264
1120520
1120776
1121032
1121288
1121544
1121800
1122056
1122312
1122568
1122824
1123080
1123336
1123592
1123848
1124104
1124360
1124616
1124872
1125128
1125384
1125640
1125896
1126152
1126408
1126664
1126920
1127176
1127432
1127688
1127944
1128200
1128456
1128712
1128968
1129224
1129480
1129736
1129992
1130248
1114121
1114377
1114633
1114889
1115145
1115401
1115657
1115913
1116169
1116425
1116681
1116937
1117193
1117449
1117705
1117961
1118217
1118473
1118729
1118985
1119241
1119497
1119753
1120009
1120265
1120521
1120777
1121033
1121289
1121545
1121801
1122057
1122313
1122569
1122825
1123081
1123337
1123593
1123849
1124105
1124361
1124617
1124873
1125129
1125385
1125641
1125897
1126153
1126409
1126665
1126921
1127177
1127433
1127689
1127945
1128201
1128457
1128713
1128969
1129225
1129481
1129737
1129993
1130249
1114122
1114378
1114634
1114890
1115146
1115402
1115658
1115914
1116170
1116426
1116682
1116938
1117194
1117450
1117706
1117962
1118218
1118474
1118730
1118986
1119242
1119498
1119754
1120010
1120266
1120522
1120778
1121034
1121290
1121546
1121802
1122058
1122314
1122570
1122826
1123082
1123338
1123594
1123850
1124106
1124362
1124618
1124874
1125130
1125386
1125642
1125898
1126154
1126410
1126666
1126922
1127178
1127434
1127690
1127946
1128202
1128458
1128714
1128970
1129226
1129482
1129738
1129994
1130250
1114123
1114379
1114635
1114891
1115147
1115403
1115659
1115915
1116171
1116427
1116683
1116939
1117195
1117451
1117707
1117963
1118219
1118475
1118731
1118987
1119243
1119499
1119755
1120011
1120267
1120523
1120779
1121035
1121291
1121547
1121803
1122059
1122315
1122571
1122827
1123083
1123339
1123595
1123851
1124107
1124363
1124619
1124875
1125131
1125387
1125643
1125899
1126155
1126411
1126667
1126923
1127179
1127435
1127691
1127947
1128203
1128459
1128715
1128971
1129227
1129483
1129739
1129995
1130251
1114124
1114380
1114636
1114892
1115148
1115404
1115660
1115916
1116172
1116428
1116684
1116940
1117196
1117452
1117708
1117964
1118220
1118476
1118732
1118988
1119244
1119500
1119756
1120012
1120268
1120524
1120780
1121036
1121292
1121548
1121804
1122060
1122316
1122572
1122828
1123084
1123340
1123596
1123852
1124108
1124364
1124620
1124876
1125132
1125388
1125644
1125900
1126156
1126412
1126668
1126924
1127180
1127436
1127692
1127948
1128204
1128460
1128716
1128972
1129228
1129484
1129740
1129996
1130252
1114125
1114381
1114637
1114893
1115149
1115405
1115661
1115917
1116173
1116429
1116685
1116941
1117197
1117453
1117709
1117965
1118221
1118477
1118733
1118989
1119245
1119501
1119757
1120013
1120269
1120525
1120781
1121037
1121293
1121549
1121805
1122061
1122317
1122573
1122829
1123085
1123341
1123597
1123853
1124109
1124365
1124621
1124877
1125133
1125389
1125645
1125901
1126157
1126413
1126669
1126925
1127181
1127437
1127693
1127949
1128205
1128461
1128717
1128973
1129229
1129485
1129741
1129997
1130253
1114126
1114382
1114638
1114894
1115150
1115406
1115662
1115918
1116174
1116430
1116686
1116942
1117198
1117454
1117710
1117966
1118222
1118478
1118734
1118990
1119246
1119502
1119758
1120014
1120270
1120526
1120782
1121038
1121294
1121550
1121806
1122062
1122318
1122574
1122830
1123086
1123342
1123598
1123854
1124110
1124366
1124622
1124878
1125134
1125390
1125646
1125902
1126158
1126414
1126670
1126926
1127182
1127438
1127694
1127950
1128206
1128462
1128718
1128974
1129230
1129486
1129742
1129998
1130254
1114127
1114383
1114639
1114895
1115151
1115407
1115663
1115919
1116175
1116431
1116687
1116943
1117199
1117455
1117711
1117967
1118223
1118479
1118735
1118991
1119247
1119503
1119759
1120015
1120271
1120527
1120783
1121039
1121295
1121551
1121807
1122063
1122319
1122575
1122831
1123087
1123343
1123599
1123855
1124111
1124367
1124623
1124879
1125135
1125391
1125647
1125903
1126159
1126415
1126671
1126927
1127183
1127439
1127695
1127951
1128207
1128463
1128719
1128975
1129231
1129487
1129743
1129999
1130255
1114128
1114384
1114640
1114896
1115152
1115408
1115664
1115920
1116176
1116432
1116688
1116944
1117200
1117456
1117712
1117968
1118224
1118480
1118736
1118992
1119248
1119504
1119760
1120016
1120272
1120528
1120784
1121040
1121296
1121552
1121808
1122064
1122320
1122576
1122832
1123088
1123344
1123600
1123856
1124112
1124368
1124624
1124880
1125136
1125392
1125648
1125904
1126160
1126416
1126672
1126928
1127184
1127440
1127696
1127952
1128208
1128464
1128720
1128976
1129232
1129488
1129744
1130000
1130256
1114129
1114385
1114641
1114897
1115153
1115409
1115665
1115921
1116177
1116433
1116689
1116945
1117201
1117457
1117713
1117969
1118225
1118481
1118737
1118993
1119249
1119505
1119761
1120017
1120273
1120529
1120785
1121041
1121297
1121553
1121809
1122065
1122321
1122577
1122833
1123089
1123345
1123601
1123857
1124113
1124369
1124625
1124881
1125137
1125393
1125649
1125905
1126161
1126417
1126673
1126929
1127185
1127441
1127697
1127953
1128209
1128465
1128721
1128977
1129233
1129489
1129745
1130001
1130257
1114130
1114386
1114642
1114898
1115154
1115410
1115666
1115922
1116178
1116434
1116690
1116946
1117202
1117458
1117714
1117970
1118226
1118482
1118738
1118994
1119250
1119506
1119762
1120018
1120274
1120530
1120786
1121042
1121298
1121554
1121810
1122066
1122322
1122578
1122834
1123090
1123346
1123602
1123858
1124114
1124370
1124626
1124882
1125138
1125394
1125650
1125906
1126162
1126418
1126674
1126930
1127186
1127442
1127698
1127954
1128210
1128466
1128722
1128978
1129234
1129490
1129746
1130002
1130258
1114131
1114387
1114643
1114899
1115155
1115411
1115667
1115923
1116179
1116435
1116691
1116947
1117203
1117459
1117715
1117971
1118227
1118483
1118739
1118995
1119251
1119507
1119763
1120019
1120275
1120531
1120787
1121043
1121299
1121555
1121811
1122067
1122323
1122579
1122835
1123091
1123347
1123603
1123859
1124115
1124371
1124627
1124883
1125139
1125395
1125651
1125907
1126163
1126419
1126675
1126931
1127187
1127443
1127699
1127955
1128211
1128467
1128723
1128979
1129235
1129491
1129747
1130003
1130259
1114132
1114388
1114644
1114900
1115156
1115412
1115668
1115924
1116180
1116436
1116692
1116948
1117204
1117460
1117716
1117972
1118228
1118484
1118740
1118996
1119252
1119508
1119764
1120020
1120276
1120532
1120788
1121044
1121300
1121556
1121812
1122068
1122324
1122580
1122836
1123092
1123348
1123604
1123860
1124116
1124372
1124628
1124884
1125140
1125396
1125652
1125908
1126164
1126420
1126676
1126932
1127188
1127444
1127700
1127956
1128212
1128468
1128724
1128980
1129236
1129492
1129748
1130004
1130260
1114133
1114389
1114645
1114901
1115157
1115413
1115669
1115925
1116181
1116437
1116693
1116949
1117205
1117461
1117717
1117973
1118229
1118485
1118741
1118997
1119253
1119509
1119765
1120021
1120277
1120533
1120789
1121045
1121301
1121557
1121813
1122069
1122325
1122581
1122837
1123093
1123349
1123605
1123861
1124117
1124373
1124629
1124885
1125141
1125397
1125653
1125909
1126165
1126421
1126677
1126933
1127189
1127445
1127701
1127957
1128213
1128469
1128725
1128981
1129237
1129493
1129749
1130005
1130261
1114134
1114390
1114646
1114902
1115158
1115414
1115670
1115926
1116182
1116438
1116694
1116950
1117206
1117462
1117718
1117974
1118230
1118486
1118742
1118998
1119254
1119510
1119766
1120022
1120278
1120534
1120790
1121046
1121302
1121558
1121814
1122070
1122326
1122582
1122838
1123094
1123350
1123606
1123862
1124118
1124374
1124630
1124886
1125142
1125398
1125654
1125910
1126166
1126422
1126678
1126934
1127190
1127446
1127702
1127958
1128214
1128470
1128726
1128982
1129238
1129494
1129750
1130006
1130262
1114135
1114391
1114647
1114903
1115159
1115415
1115671
1115927
1116183
1116439
1116695
1116951
1117207
1117463
1117719
1117975
1118231
1118487
1118743
1118999
1119255
1119511
1119767
1120023
1120279
1120535
1120791
1121047
1121303
1121559
1121815
1122071
1122327
1122583
1122839
1123095
1123351
1123607
1123863
1124119
1124375
1124631
1124887
1125143
1125399
1125655
1125911
1126167
1126423
1126679
1126935
1127191
1127447
1127703
1127959
1128215
1128471
1128727
1128983
1129239
1129495
1129751
1130007
1130263
1114136
1114392
1114648
1114904
1115160
1115416
1115672
1115928
1116184
1116440
1116696
1116952
1117208
1117464
1117720
1117976
1118232
1118488
1118744
1119000
1119256
1119512
1119768
1120024
1120280
1120536
1120792
1121048
1121304
1121560
1121816
1122072
1122328
1122584
1122840
1123096
1123352
1123608
1123864
1124120
1124376
1124632
1124888
1125144
1125400
1125656
1125912
1126168
1126424
1126680
1126936
1127192
1127448
1127704
1127960
1128216
1128472
1128728
1128984
1129240
1129496
1129752
1130008
1130264
1114137
1114393
1114649
1114905
1115161
1115417
1115673
1115929
1116185
1116441
1116697
1116953
1117209
1117465
1117721
1117977
1118233
1118489
1118745
1119001
1119257
1119513
1119769
1120025
1120281
1120537
1120793
1121049
1121305
1121561
1121817
1122073
1122329
1122585
1122841
1123097
1123353
1123609
1123865
1124121
1124377
1124633
1124889
1125145
1125401
1125657
1125913
1126169
1126425
1126681
1126937
1127193
1127449
1127705
1127961
1128217
1128473
1128729
1128985
1129241
1129497
1129753
1130009
1130265
1114138
1114394
1114650
1114906
1115162
1115418
1115674
1115930
1116186
1116442
1116698
1116954
1117210
1117466
1117722
1117978
1118234
1118490
1118746
1119002
1119258
1119514
1119770
1120026
1120282
1120538
1120794
1121050
1121306
1121562
1121818
1122074
1122330
1122586
1122842
1123098
1123354
1123610
1123866
1124122
1124378
1124634
1124890
1125146
1125402
1125658
1125914
1126170
1126426
1126682
1126938
1127194
1127450
1127706
1127962
1128218
1128474
1128730
1128986
1129242
1129498
1129754
1130010
1130266
1114139
1114395
1114651
1114907
1115163
1115419
1115675
1115931
1116187
1116443
1116699
1116955
1117211
1117467
1117723
1117979
1118235
1118491
1118747
1119003
1119259
1119515
1119771
1120027
1120283
1120539
1120795
1121051
1121307
1121563
1121819
1122075
1122331
1122587
1122843
1123099
1123355
1123611
1123867
1124123
1124379
1124635
1124891
1125147
1125403
1125659
1125915
1126171
1126427
1126683
1126939
1127195
1127451
1127707
1127963
1128219
1128475
1128731
1128987
1129243
1129499
1129755
1130011
1130267
1114140
1114396
1114652
1114908
1115164
1115420
1115676
1115932
1116188
1116444
1116700
1116956
1117212
1117468
1117724
1117980
1118236
1118492
1118748
1119004
1119260
1119516
1119772
1120028
1120284
1120540
1120796
1121052
1121308
1121564
1121820
1122076
1122332
1122588
1122844
1123100
1123356
1123612
1123868
1124124
1124380
1124636
1124892
1125148
1125404
1125660
1125916
1126172
1126428
1126684
1126940
1127196
1127452
1127708
1127964
1128220
1128476
1128732
1128988
1129244
1129500
1129756
1130012
1130268
1114141
1114397
1114653
1114909
1115165
1115421
1115677
1115933
1116189
1116445
1116701
1116957
1117213
1117469
1117725
1117981
1118237
1118493
1118749
1119005
1119261
1119517
1119773
1120029
1120285
1120541
1120797
1121053
1121309
1121565
1121821
1122077
1122333
1122589
1122845
1123101
1123357
1123613
1123869
1124125
1124381
1124637
1124893
1125149
1125405
1125661
1125917
1126173
1126429
1126685
1126941
1127197
1127453
1127709
1127965
1128221
1128477
1128733
1128989
1129245
1129501
1129757
1130013
1130269
1114142
1114398
1114654
1114910
1115166
1115422
1115678
1115934
1116190
1116446
1116702
1116958
1117214
1117470
1117726
1117982
1118238
1118494
1118750
1119006
1119262
1119518
1119774
1120030
1120286
1120542
1120798
1121054
1121310
1121566
1121822
1122078
1122334
1122590
1122846
1123102
1123358
1123614
1123870
1124126
1124382
1124638
1124894
1125150
1125406
1125662
1125918
1126174
1126430
1126686
1126942
1127198
1127454
1127710
1127966
1128222
1128478
1128734
1128990
1129246
1129502
1129758
1130014
1130270
1114143
1114399
1114655
1114911
1115167
1115423
1115679
1115935
1116191
1116447
1116703
1116959
1117215
1117471
1117727
1117983
1118239
1118495
1118751
1119007
1119263
1119519
1119775
1120031
1120287
1120543
1120799
1121055
1121311
1121567
1121823
1122079
1122335
1122591
1122847
1123103
1123359
1123615
1123871
1124127
1124383
1124639
1124895
1125151
1125407
1125663
1125919
1126175
1126431
1126687
1126943
1127199
1127455
1127711
1127967
1128223
1128479
1128735
1128991
1129247
1129503
1129759
1130015
1130271
1114144
1114400
1114656
1114912
1115168
1115424
1115680
1115936
1116192
1116448
1116704
1116960
1117216
1117472
1117728
1117984
1118240
1118496
1118752
1119008
1119264
1119520
1119776
1120032
1120288
1120544
1120800
1121056
1121312
1121568
1121824
1122080
1122336
1122592
1122848
1123104
1123360
1123616
1123872
1124128
1124384
1124640
1124896
1125152
1125408
1125664
1125920
1126176
1126432
1126688
1126944
1127200
1127456
1127712
1127968
1128224
1128480
1128736
1128992
1129248
1129504
1129760
1130016
1130272
1114145
1114401
1114657
1114913
1115169
1115425
1115681
1115937
1116193
1116449
1116705
1116961
1117217
1117473
1117729
1117985
1118241
1118497
1118753
1119009
1119265
1119521
1119777
1120033
1120289
1120545
1120801
1121057
1121313
1121569
1121825
1122081
1122337
1122593
1122849
1123105
1123361
1123617
1123873
1124129
1124385
1124641
1124897
1125153
1125409
1125665
1125921
1126177
1126433
1126689
1126945
1127201
1127457
1127713
1127969
1128225
1128481
1128737
1128993
1129249
1129505
1129761
1130017
1130273
1114146
1114402
1114658
1114914
1115170
1115426
1115682
1115938
1116194
1116450
1116706
1116962
1117218
1117474
1117730
1117986
1118242
1118498
1118754
1119010
1119266
1119522
1119778
1120034
1120290
1120546
1120802
1121058
1121314
1121570
1121826
1122082
1122338
1122594
1122850
1123106
1123362
1123618
1123874
1124130
1124386
1124642
1124898
1125154
1125410
1125666
1125922
1126178
1126434
1126690
1126946
1127202
1127458
1127714
1127970
1128226
1128482
1128738
1128994
1129250
1129506
1129762
1130018
1130274
1114147
1114403
1114659
1114915
1115171
1115427
1115683
1115939
1116195
1116451
1116707
1116963
1117219
1117475
1117731
1117987
1118243
1118499
1118755
1119011
1119267
1119523
1119779
1120035
1120291
1120547
1120803
1121059
1121315
1121571
1121827
1122083
1122339
1122595
1122851
1123107
1123363
1123619
1123875
1124131
1124387
1124643
1124899
1125155
1125411
1125667
1125923
1126179
1126435
1126691
1126947
1127203
1127459
1127715
1127971
1128227
1128483
1128739
1128995
1129251
1129507
1129763
1130019
1130275
1114148
1114404
1114660
1114916
1115172
1115428
1115684
1115940
1116196
1116452
1116708
1116964
1117220
1117476
1117732
1117988
1118244
1118500
1118756
1119012
1119268
1119524
1119780
1120036
1120292
1120548
1120804
1121060
1121316
1121572
1121828
1122084
1122340
1122596
1122852
1123108
1123364
1123620
1123876
1124132
1124388
1124644
1124900
1125156
1125412
1125668
1125924
1126180
1126436
1126692
1126948
1127204
1127460
1127716
1127972
1128228
1128484
1128740
1128996
1129252
1129508
1129764
1130020
1130276
1114149
1114405
1114661
1114917
1115173
1115429
1115685
1115941
1116197
1116453
1116709
1116965
1117221
1117477
1117733
1117989
1118245
1118501
1118757
1119013
1119269
1119525
1119781
1120037
1120293
1120549
1120805
1121061
1121317
1121573
1121829
1122085
1122341
1122597
1122853
1123109
1123365
1123621
1123877
1124133
1124389
1124645
1124901
1125157
1125413
1125669
1125925
1126181
1126437
1126693
1126949
1127205
1127461
1127717
1127973
1128229
1128485
1128741
1128997
1129253
1129509
1129765
1130021
1130277
1114150
1114406
1114662
1114918
1115174
1115430
1115686
1115942
1116198
1116454
1116710
1116966
1117222
1117478
1117734
1117990
1118246
1118502
1118758
1119014
1119270
1119526
1119782
1120038
1120294
1120550
1120806
1121062
1121318
1121574
1121830
1122086
1122342
1122598
1122854
1123110
1123366
1123622
1123878
1124134
1124390
1124646
1124902
1125158
1125414
1125670
1125926
1126182
1126438
1126694
1126950
1127206
1127462
1127718
1127974
1128230
1128486
1128742
1128998
1129254
1129510
1129766
1130022
1130278
1114151
1114407
1114663
1114919
1115175
1115431
1115687
1115943
1116199
1116455
1116711
1116967
1117223
1117479
1117735
1117991
1118247
1118503
1118759
1119015
1119271
1119527
1119783
1120039
1120295
1120551
1120807
1121063
1121319
1121575
1121831
1122087
1122343
1122599
1122855
1123111
1123367
1123623
1123879
1124135
1124391
1124647
1124903
1125159
1125415
1125671
1125927
1126183
1126439
1126695
1126951
1127207
1127463
1127719
1127975
1128231
1128487
1128743
1128999
1129255
1129511
1129767
1130023
1130279
1114152
1114408
1114664
1114920
1115176
1115432
1115688
1115944
1116200
1116456
1116712
1116968
1117224
1117480
1117736
1117992
1118248
1118504
1118760
1119016
1119272
1119528
1119784
1120040
1120296
1120552
1120808
1121064
1121320
1121576
1121832
1122088
1122344
1122600
1122856
1123112
1123368
1123624
1123880
1124136
1124392
1124648
1124904
1125160
1125416
1125672
1125928
1126184
1126440
1126696
1126952
1127208
1127464
1127720
1127976
1128232
1128488
1128744
1129000
1129256
1129512
1129768
1130024
1130280
1114153
1114409
1114665
1114921
1115177
1115433
1115689
1115945
1116201
1116457
1116713
1116969
1117225
1117481
1117737
1117993
1118249
1118505
1118761
1119017
1119273
1119529
1119785
1120041
1120297
1120553
1120809
1121065
1121321
1121577
1121833
1122089
1122345
1122601
1122857
1123113
1123369
1123625
1123881
1124137
1124393
1124649
1124905
1125161
1125417
1125673
1125929
1126185
1126441
1126697
1126953
1127209
1127465
1127721
1127977
1128233
1128489
1128745
1129001
1129257
1129513
1129769
1130025
1130281
1114154
1114410
1114666
1114922
1115178
1115434
1115690
1115946
1116202
1116458
1116714
1116970
1117226
1117482
1117738
1117994
1118250
1118506
1118762
1119018
1119274
1119530
1119786
1120042
1120298
1120554
1120810
1121066
1121322
1121578
1121834
1122090
1122346
1122602
1122858
1123114
1123370
1123626
1123882
1124138
1124394
1124650
1124906
1125162
1125418
1125674
1125930
1126186
1126442
1126698
1126954
1127210
1127466
1127722
1127978
1128234
1128490
1128746
1129002
1129258
1129514
1129770
1130026
1130282
1114155
1114411
1114667
1114923
1115179
1115435
1115691
1115947
1116203
1116459
1116715
1116971
1117227
1117483
1117739
1117995
1118251
1118507
1118763
1119019
1119275
1119531
1119787
1120043
1120299
1120555
1120811
1121067
1121323
1121579
1121835
1122091
1122347
1122603
1122859
1123115
1123371
1123627
1123883
1124139
1124395
1124651
1124907
1125163
1125419
1125675
1125931
1126187
1126443
1126699
1126955
1127211
1127467
1127723
1127979
1128235
1128491
1128747
1129003
1129259
1129515
1129771
1130027
1130283
1114156
1114412
1114668
1114924
1115180
1115436
1115692
1115948
1116204
1116460
1116716
1116972
1117228
1117484
1117740
1117996
1118252
1118508
1118764
1119020
1119276
1119532
1119788
1120044
1120300
1120556
1120812
1121068
1121324
1121580
1121836
1122092
1122348
1122604
1122860
1123116
1123372
1123628
1123884
1124140
1124396
1124652
1124908
1125164
1125420
1125676
1125932
1126188
1126444
1126700
1126956
1127212
1127468
1127724
1127980
1128236
1128492
1128748
1129004
1129260
1129516
1129772
1130028
1130284
1114157
1114413
1114669
1114925
1115181
1115437
1115693
1115949
1116205
1116461
1116717
1116973
1117229
1117485
1117741
1117997
1118253
1118509
1118765
1119021
1119277
1119533
1119789
1120045
1120301
1120557
1120813
1121069
1121325
1121581
1121837
1122093
1122349
1122605
1122861
1123117
1123373
1123629
1123885
1124141
1124397
1124653
1124909
1125165
1125421
1125677
1125933
1126189
1126445
1126701
1126957
1127213
1127469
1127725
1127981
1128237
1128493
1128749
1129005
1129261
1129517
1129773
1130029
1130285
1114158
1114414
1114670
1114926
1115182
1115438
1115694
1115950
1116206
1116462
1116718
1116974
1117230
1117486
1117742
1117998
1118254
1118510
1118766
1119022
1119278
1119534
1119790
1120046
1120302
1120558
1120814
1121070
1121326
1121582
1121838
1122094
1122350
1122606
1122862
1123118
1123374
1123630
1123886
1124142
1124398
1124654
1124910
1125166
1125422
1125678
1125934
1126190
1126446
1126702
1126958
1127214
1127470
1127726
1127982
1128238
1128494
1128750
1129006
1129262
1129518
1129774
1130030
1130286
1114159
1114415
1114671
1114927
1115183
1115439
1115695
1115951
1116207
1116463
1116719
1116975
1117231
1117487
1117743
1117999
1118255
1118511
1118767
1119023
1119279
1119535
1119791
1120047
1120303
1120559
1120815
1121071
1121327
1121583
1121839
1122095
1122351
1122607
1122863
1123119
1123375
1123631
1123887
1124143
1124399
1124655
1124911
1125167
1125423
1125679
1125935
1126191
1126447
1126703
1126959
1127215
1127471
1127727
1127983
1128239
1128495
1128751
1129007
1129263
1129519
1129775
1130031
1130287
1114160
1114416
1114672
1114928
1115184
1115440
1115696
1115952
1116208
1116464
1116720
1116976
1117232
1117488
1117744
1118000
1118256
1118512
1118768
1119024
1119280
1119536
1119792
1120048
1120304
1120560
1120816
1121072
1121328
1121584
1121840
1122096
1122352
1122608
1122864
1123120
1123376
1123632
1123888
1124144
1124400
1124656
1124912
1125168
1125424
1125680
1125936
1126192
1126448
1126704
1126960
1127216
1127472
1127728
1127984
1128240
1128496
1128752
1129008
1129264
1129520
1129776
1130032
1130288
1114161
1114417
1114673
1114929
1115185
1115441
1115697
1115953
1116209
1116465
1116721
1116977
1117233
1117489
1117745
1118001
1118257
1118513
1118769
1119025
1119281
1119537
1119793
1120049
1120305
1120561
1120817
1121073
1121329
1121585
1121841
1122097
1122353
1122609
1122865
1123121
1123377
1123633
1123889
1124145
1124401
1124657
1124913
1125169
1125425
1125681
1125937
1126193
1126449
1126705
1126961
1127217
1127473
1127729
1127985
1128241
1128497
1128753
1129009
1129265
1129521
1129777
1130033
1130289
1114162
1114418
1114674
1114930
1115186
1115442
1115698
1115954
1116210
1116466
1116722
1116978
1117234
1117490
1117746
1118002
1118258
1118514
1118770
1119026
1119282
1119538
1119794
1120050
1120306
1120562
1120818
1121074
1121330
1121586
1121842
1122098
1122354
1122610
1122866
1123122
1123378
1123634
1123890
1124146
1124402
1124658
1124914
1125170
1125426
1125682
1125938
1126194
1126450
1126706
1126962
1127218
1127474
1127730
1127986
1128242
1128498
1128754
1129010
1129266
1129522
1129778
1130034
1130290
1114163
1114419
1114675
1114931
1115187
1115443
1115699
1115955
1116211
1116467
1116723
1116979
1117235
1117491
1117747
1118003
1118259
1118515
1118771
1119027
1119283
1119539
1119795
1120051
1120307
1120563
1120819
1121075
1121331
1121587
1121843
1122099
1122355
1122611
1122867
1123123
1123379
1123635
1123891
1124147
1124403
1124659
1124915
1125171
1125427
1125683
1125939
1126195
1126451
1126707
1126963
1127219
1127475
1127731
1127987
1128243
1128499
1128755
1129011
1129267
1129523
1129779
1130035
1130291
1114164
1114420
1114676
1114932
1115188
1115444
1115700
1115956
1116212
1116468
1116724
1116980
1117236
1117492
1117748
1118004
1118260
1118516
1118772
1119028
1119284
1119540
1119796
1120052
1120308
1120564
1120820
1121076
1121332
1121588
1121844
1122100
1122356
1122612
1122868
1123124
1123380
1123636
1123892
1124148
1124404
1124660
1124916
1125172
1125428
1125684
1125940
1126196
1126452
1126708
1126964
1127220
1127476
1127732
1127988
1128244
1128500
1128756
1129012
1129268
1129524
1129780
1130036
1130292
1114165
1114421
1114677
1114933
1115189
1115445
1115701
1115957
1116213
1116469
1116725
1116981
1117237
1117493
1117749
1118005
1118261
1118517
1118773
1119029
1119285
1119541
1119797
1120053
1120309
1120565
1120821
1121077
1121333
1121589
1121845
1122101
1122357
1122613
1122869
1123125
1123381
1123637
1123893
1124149
1124405
1124661
1124917
1125173
1125429
1125685
1125941
1126197
1126453
1126709
1126965
1127221
1127477
1127733
1127989
1128245
1128501
1128757
1129013
1129269
1129525
1129781
1130037
1130293
1114166
1114422
1114678
1114934
1115190
1115446
1115702
1115958
1116214
1116470
1116726
1116982
1117238
1117494
1117750
1118006
1118262
1118518
1118774
1119030
1119286
1119542
1119798
1120054
1120310
1120566
1120822
1121078
1121334
1121590
1121846
1122102
1122358
1122614
1122870
1123126
1123382
1123638
1123894
1124150
1124406
1124662
1124918
1125174
1125430
1125686
1125942
1126198
1126454
1126710
1126966
1127222
1127478
1127734
1127990
1128246
1128502
1128758
1129014
1129270
1129526
1129782
1130038
1130294
1114167
1114423
1114679
1114935
1115191
1115447
1115703
1115959
1116215
1116471
1116727
1116983
1117239
1117495
1117751
1118007
1118263
1118519
1118775
1119031
1119287
1119543
1119799
1120055
1120311
1120567
1120823
1121079
1121335
1121591
1121847
1122103
1122359
1122615
1122871
1123127
1123383
1123639
1123895
1124151
1124407
1124663
1124919
1125175
1125431
1125687
1125943
1126199
1126455
1126711
1126967
1127223
1127479
1127735
1127991
1128247
1128503
1128759
1129015
1129271
1129527
1129783
1130039
1130295
1114168
1114424
1114680
1114936
1115192
1115448
1115704
1115960
1116216
1116472
1116728
1116984
1117240
1117496
1117752
1118008
1118264
1118520
1118776
1119032
1119288
1119544
1119800
1120056
1120312
1120568
1120824
1121080
1121336
1121592
1121848
1122104
1122360
1122616
1122872
1123128
1123384
1123640
1123896
1124152
1124408
1124664
1124920
1125176
1125432
1125688
1125944
1126200
1126456
1126712
1126968
1127224
1127480
1127736
1127992
1128248
1128504
1128760
1129016
1129272
1129528
1129784
1130040
1130296
1114169
1114425
1114681
1114937
1115193
1115449
1115705
1115961
1116217
1116473
1116729
1116985
1117241
1117497
1117753
1118009
1118265
1118521
1118777
1119033
1119289
1119545
1119801
1120057
1120313
1120569
1120825
1121081
1121337
1121593
1121849
1122105
1122361
1122617
1122873
1123129
1123385
1123641
1123897
1124153
1124409
1124665
1124921
1125177
1125433
1125689
1125945
1126201
1126457
1126713
1126969
1127225
1127481
1127737
1127993
1128249
1128505
1128761
1129017
1129273
1129529
1129785
1130041
1130297
1114170
1114426
1114682
1114938
1115194
1115450
1115706
1115962
1116218
1116474
1116730
1116986
1117242
1117498
1117754
1118010
1118266
1118522
1118778
1119034
1119290
1119546
1119802
1120058
1120314
1120570
1120826
1121082
1121338
1121594
1121850
1122106
1122362
1122618
1122874
1123130
1123386
1123642
1123898
1124154
1124410
1124666
1124922
1125178
1125434
1125690
1125946
1126202
1126458
1126714
1126970
1127226
1127482
1127738
1127994
1128250
1128506
1128762
1129018
1129274
1129530
1129786
1130042
1130298
1114171
1114427
1114683
1114939
1115195
1115451
1115707
1115963
1116219
1116475
1116731
1116987
1117243
1117499
1117755
1118011
1118267
1118523
1118779
1119035
1119291
1119547
1119803
1120059
1120315
1120571
1120827
1121083
1121339
1121595
1121851
1122107
1122363
1122619
1122875
1123131
1123387
1123643
1123899
1124155
1124411
1124667
1124923
1125179
1125435
1125691
1125947
1126203
1126459
1126715
1126971
1127227
1127483
1127739
1127995
1128251
1128507
1128763
1129019
1129275
1129531
1129787
1130043
1130299
1114172
1114428
1114684
1114940
1115196
1115452
1115708
1115964
1116220
1116476
1116732
1116988
1117244
1117500
1117756
1118012
1118268
1118524
1118780
1119036
1119292
1119548
1119804
1120060
1120316
1120572
1120828
1121084
1121340
1121596
1121852
1122108
1122364
1122620
1122876
1123132
1123388
1123644
1123900
1124156
1124412
1124668
1124924
1125180
1125436
1125692
1125948
1126204
1126460
1126716
1126972
1127228
1127484
1127740
1127996
1128252
1128508
1128764
1129020
1129276
1129532
1129788
1130044
1130300
1114173
1114429
1114685
1114941
1115197
1115453
1115709
1115965
1116221
1116477
1116733
1116989
1117245
1117501
1117757
1118013
1118269
1118525
1118781
1119037
1119293
1119549
1119805
1120061
1120317
1120573
1120829
1121085
1121341
1121597
1121853
1122109
1122365
1122621
1122877
1123133
1123389
1123645
1123901
1124157
1124413
1124669
1124925
1125181
1125437
1125693
1125949
1126205
1126461
1126717
1126973
1127229
1127485
1127741
1127997
1128253
1128509
1128765
1129021
1129277
1129533
1129789
1130045
1130301
1114174
1114430
1114686
1114942
1115198
1115454
1115710
1115966
1116222
1116478
1116734
1116990
1117246
1117502
1117758
1118014
1118270
1118526
1118782
1119038
1119294
1119550
1119806
1120062
1120318
1120574
1120830
1121086
1121342
1121598
1121854
1122110
1122366
1122622
1122878
1123134
1123390
1123646
1123902
1124158
1124414
1124670
1124926
1125182
1125438
1125694
1125950
1126206
1126462
1126718
1126974
1127230
1127486
1127742
1127998
1128254
1128510
1128766
1129022
1129278
1129534
1129790
1130046
1130302
1114175
1114431
1114687
1114943
1115199
1115455
1115711
1115967
1116223
1116479
1116735
1116991
1117247
1117503
1117759
1118015
1118271
1118527
1118783
1119039
1119295
1119551
1119807
1120063
1120319
1120575
1120831
1121087
1121343
1121599
1121855
1122111
1122367
1122623
1122879
1123135
1123391
1123647
1123903
1124159
1124415
1124671
1124927
1125183
1125439
1125695
1125951
1126207
1126463
1126719
1126975
1127231
1127487
1127743
1127999
1128255
1128511
1128767
1129023
1129279
1129535
1129791
1130047
1130303
1114176
1114432
1114688
1114944
1115200
1115456
1115712
1115968
1116224
1116480
1116736
1116992
1117248
1117504
1117760
1118016
1118272
1118528
1118784
1119040
1119296
1119552
1119808
1120064
1120320
1120576
1120832
1121088
1121344
1121600
1121856
1122112
1122368
1122624
1122880
1123136
1123392
1123648
1123904
1124160
1124416
1124672
1124928
1125184
1125440
1125696
1125952
1126208
1126464
1126720
1126976
1127232
1127488
1127744
1128000
1128256
1128512
1128768
1129024
1129280
1129536
1129792
1130048
1130304
1114177
1114433
1114689
1114945
1115201
1115457
1115713
1115969
1116225
1116481
1116737
1116993
1117249
1117505
1117761
1118017
1118273
1118529
1118785
1119041
1119297
1119553
1119809
1120065
1120321
1120577
1120833
1121089
1121345
1121601
1121857
1122113
1122369
1122625
1122881
1123137
1123393
1123649
1123905
1124161
1124417
1124673
1124929
1125185
1125441
1125697
1125953
1126209
1126465
1126721
1126977
1127233
1127489
1127745
1128001
1128257
1128513
1128769
1129025
1129281
1129537
1129793
1130049
1130305
1114178
1114434
1114690
1114946
1115202
1115458
1115714
1115970
1116226
1116482
1116738
1116994
1117250
1117506
1117762
1118018
1118274
1118530
1118786
1119042
1119298
1119554
1119810
1120066
1120322
1120578
1120834
1121090
1121346
1121602
1121858
1122114
1122370
1122626
1122882
1123138
1123394
1123650
1123906
1124162
1124418
1124674
1124930
1125186
1125442
1125698
1125954
1126210
1126466
1126722
1126978
1127234
1127490
1127746
1128002
1128258
1128514
1128770
1129026
1129282
1129538
1129794
1130050
1130306
1114179
1114435
1114691
1114947
1115203
1115459
1115715
1115971
1116227
1116483
1116739
1116995
1117251
1117507
1117763
1118019
1118275
1118531
1118787
1119043
1119299
1119555
1119811
1120067
1120323
1120579
1120835
1121091
1121347
1121603
1121859
1122115
1122371
1122627
1122883
1123139
1123395
1123651
1123907
1124163
1124419
1124675
1124931
1125187
1125443
1125699
1125955
1126211
1126467
1126723
1126979
1127235
1127491
1127747
1128003
1128259
1128515
1128771
1129027
1129283
1129539
1129795
1130051
1130307
1114180
1114436
1114692
1114948
1115204
1115460
1115716
1115972
1116228
1116484
1116740
1116996
1117252
1117508
1117764
1118020
1118276
1118532
1118788
1119044
1119300
1119556
1119812
1120068
1120324
1120580
1120836
1121092
1121348
1121604
1121860
1122116
1122372
1122628
1122884
1123140
1123396
1123652
1123908
1124164
1124420
1124676
1124932
1125188
1125444
1125700
1125956
1126212
1126468
1126724
1126980
1127236
1127492
1127748
1128004
1128260
1128516
1128772
1129028
1129284
1129540
1129796
1130052
1130308
1114181
1114437
1114693
1114949
1115205
1115461
1115717
1115973
1116229
1116485
1116741
1116997
1117253
1117509
1117765
1118021
1118277
1118533
1118789
1119045
1119301
1119557
1119813
1120069
1120325
1120581
1120837
1121093
1121349
1121605
1121861
1122117
1122373
1122629
1122885
1123141
1123397
1123653
1123909
1124165
1124421
1124677
1124933
1125189
1125445
1125701
1125957
1126213
1126469
1126725
1126981
1127237
1127493
1127749
1128005
1128261
1128517
1128773
1129029
1129285
1129541
1129797
1130053
1130309
1114182
1114438
1114694
1114950
1115206
1115462
1115718
1115974
1116230
1116486
1116742
1116998
1117254
1117510
1117766
1118022
1118278
1118534
1118790
1119046
1119302
1119558
1119814
1120070
1120326
1120582
1120838
1121094
1121350
1121606
1121862
1122118
1122374
1122630
1122886
1123142
1123398
1123654
1123910
1124166
1124422
1124678
1124934
1125190
1125446
1125702
1125958
1126214
1126470
1126726
1126982
1127238
1127494
1127750
1128006
1128262
1128518
1128774
1129030
1129286
1129542
1129798
1130054
1130310
1114183
1114439
1114695
1114951
1115207
1115463
1115719
1115975
1116231
1116487
1116743
1116999
1117255
1117511
1117767
1118023
1118279
1118535
1118791
1119047
1119303
1119559
1119815
1120071
1120327
1120583
1120839
1121095
1121351
1121607
1121863
1122119
1122375
1122631
1122887
1123143
1123399
1123655
1123911
1124167
1124423
1124679
1124935
1125191
1125447
1125703
1125959
1126215
1126471
1126727
1126983
1127239
1127495
1127751
1128007
1128263
1128519
1128775
1129031
1129287
1129543
1129799
1130055
1130311
1114184
1114440
1114696
1114952
1115208
1115464
1115720
1115976
1116232
1116488
1116744
1117000
1117256
1117512
1117768
1118024
1118280
1118536
1118792
1119048
1119304
1119560
1119816
1120072
1120328
1120584
1120840
1121096
1121352
1121608
1121864
1122120
1122376
1122632
1122888
1123144
1123400
1123656
1123912
1124168
1124424
1124680
1124936
1125192
1125448
1125704
1125960
1126216
1126472
1126728
1126984
1127240
1127496
1127752
1128008
1128264
1128520
1128776
1129032
1129288
1129544
1129800
1130056
1130312
1114185
1114441
1114697
1114953
1115209
1115465
1115721
1115977
1116233
1116489
1116745
1117001
1117257
1117513
1117769
1118025
1118281
1118537
1118793
1119049
1119305
1119561
1119817
1120073
1120329
1120585
1120841
1121097
1121353
1121609
1121865
1122121
1122377
1122633
1122889
1123145
1123401
1123657
1123913
1124169
1124425
1124681
1124937
1125193
1125449
1125705
1125961
1126217
1126473
1126729
1126985
1127241
1127497
1127753
1128009
1128265
1128521
1128777
1129033
1129289
1129545
1129801
1130057
1130313
1114186
1114442
1114698
1114954
1115210
1115466
1115722
1115978
1116234
1116490
1116746
1117002
1117258
1117514
1117770
1118026
1118282
1118538
1118794
1119050
1119306
1119562
1119818
1120074
1120330
1120586
1120842
1121098
1121354
1121610
1121866
1122122
1122378
1122634
1122890
1123146
1123402
1123658
1123914
1124170
1124426
1124682
1124938
1125194
1125450
1125706
1125962
1126218
1126474
1126730
1126986
1127242
1127498
1127754
1128010
1128266
1128522
1128778
1129034
1129290
1129546
1129802
1130058
1130314
1114187
1114443
1114699
1114955
1115211
1115467
1115723
1115979
1116235
1116491
1116747
1117003
1117259
1117515
1117771
1118027
1118283
1118539
1118795
1119051
1119307
1119563
1119819
1120075
1120331
1120587
1120843
1121099
1121355
1121611
1121867
1122123
1122379
1122635
1122891
1123147
1123403
1123659
1123915
1124171
1124427
1124683
1124939
1125195
1125451
1125707
1125963
1126219
1126475
1126731
1126987
1127243
1127499
1127755
1128011
1128267
1128523
1128779
1129035
1129291
1129547
1129803
1130059
1130315
1114188
1114444
1114700
1114956
1115212
1115468
1115724
1115980
1116236
1116492
1116748
1117004
1117260
1117516
1117772
1118028
1118284
1118540
1118796
1119052
1119308
1119564
1119820
1120076
1120332
1120588
1120844
1121100
1121356
1121612
1121868
1122124
1122380
1122636
1122892
1123148
1123404
1123660
1123916
1124172
1124428
1124684
1124940
1125196
1125452
1125708
1125964
1126220
1126476
1126732
1126988
1127244
1127500
1127756
1128012
1128268
1128524
1128780
1129036
1129292
1129548
1129804
1130060
1130316
1114189
1114445
1114701
1114957
1115213
1115469
1115725
1115981
1116237
1116493
1116749
1117005
1117261
1117517
1117773
1118029
1118285
1118541
1118797
1119053
1119309
1119565
1119821
1120077
1120333
1120589
1120845
1121101
1121357
1121613
1121869
1122125
1122381
1122637
1122893
1123149
1123405
1123661
1123917
1124173
1124429
1124685
1124941
1125197
1125453
1125709
1125965
1126221
1126477
1126733
1126989
1127245
1127501
1127757
1128013
1128269
1128525
1128781
1129037
1129293
1129549
1129805
1130061
1130317
1114190
1114446
1114702
1114958
1115214
1115470
1115726
1115982
1116238
1116494
1116750
1117006
1117262
1117518
1117774
1118030
1118286
1118542
1118798
1119054
1119310
1119566
1119822
1120078
1120334
1120590
1120846
1121102
1121358
1121614
1121870
1122126
1122382
1122638
1122894
1123150
1123406
1123662
1123918
1124174
1124430
1124686
1124942
1125198
1125454
1125710
1125966
1126222
1126478
1126734
1126990
1127246
1127502
1127758
1128014
1128270
1128526
1128782
1129038
1129294
1129550
1129806
1130062
1130318
1114191
1114447
1114703
1114959
1115215
1115471
1115727
1115983
1116239
1116495
1116751
1117007
1117263
1117519
1117775
1118031
1118287
1118543
1118799
1119055
1119311
1119567
1119823
1120079
1120335
1120591
1120847
1121103
1121359
1121615
1121871
1122127
1122383
1122639
1122895
1123151
1123407
1123663
1123919
1124175
1124431
1124687
1124943
1125199
1125455
1125711
1125967
1126223
1126479
1126735
1126991
1127247
1127503
1127759
1128015
1128271
1128527
1128783
1129039
1129295
1129551
1129807
1130063
1130319
1114192
1114448
1114704
1114960
1115216
1115472
1115728
1115984
1116240
1116496
1116752
1117008
1117264
1117520
1117776
1118032
1118288
1118544
1118800
1119056
1119312
1119568
1119824
1120080
1120336
1120592
1120848
1121104
1121360
1121616
1121872
1122128
1122384
1122640
1122896
1123152
1123408
1123664
1123920
1124176
1124432
1124688
1124944
1125200
1125456
1125712
1125968
1126224
1126480
1126736
1126992
1127248
1127504
1127760
1128016
1128272
1128528
1128784
1129040
1129296
1129552
1129808
1130064
1130320
1114193
1114449
1114705
1114961
1115217
1115473
1115729
1115985
1116241
1116497
1116753
1117009
1117265
1117521
1117777
1118033
1118289
1118545
1118801
1119057
1119313
1119569
1119825
1120081
1120337
1120593
1120849
1121105
1121361
1121617
1121873
1122129
1122385
1122641
1122897
1123153
1123409
1123665
1123921
1124177
1124433
1124689
1124945
1125201
1125457
1125713
1125969
1126225
1126481
1126737
1126993
1127249
1127505
1127761
1128017
1128273
1128529
1128785
1129041
1129297
1129553
1129809
1130065
1130321
1114194
1114450
1114706
1114962
1115218
1115474
1115730
1115986
1116242
1116498
1116754
1117010
1117266
1117522
1117778
1118034
1118290
1118546
1118802
1119058
1119314
1119570
1119826
1120082
1120338
1120594
1120850
1121106
1121362
1121618
1121874
1122130
1122386
1122642
1122898
1123154
1123410
1123666
1123922
1124178
1124434
1124690
1124946
1125202
1125458
1125714
1125970
1126226
1126482
1126738
1126994
1127250
1127506
1127762
1128018
1128274
1128530
1128786
1129042
1129298
1129554
1129810
1130066
1130322
1114195
1114451
1114707
1114963
1115219
1115475
1115731
1115987
1116243
1116499
1116755
1117011
1117267
1117523
1117779
1118035
1118291
1118547
1118803
1119059
1119315
1119571
1119827
1120083
1120339
1120595
1120851
1121107
1121363
1121619
1121875
1122131
1122387
1122643
1122899
1123155
1123411
1123667
1123923
1124179
1124435
1124691
1124947
1125203
1125459
1125715
1125971
1126227
1126483
1126739
1126995
1127251
1127507
1127763
1128019
1128275
1128531
1128787
1129043
1129299
1129555
1129811
1130067
1130323
1114196
1114452
1114708
1114964
1115220
1115476
1115732
1115988
1116244
1116500
1116756
1117012
1117268
1117524
1117780
1118036
1118292
1118548
1118804
1119060
1119316
1119572
1119828
1120084
1120340
1120596
1120852
1121108
1121364
1121620
1121876
1122132
1122388
1122644
1122900
1123156
1123412
1123668
1123924
1124180
1124436
1124692
1124948
1125204
1125460
1125716
1125972
1126228
1126484
1126740
1126996
1127252
1127508
1127764
1128020
1128276
1128532
1128788
1129044
1129300
1129556
1129812
1130068
1130324
1114197
1114453
1114709
1114965
1115221
1115477
1115733
1115989
1116245
1116501
1116757
1117013
1117269
1117525
1117781
1118037
1118293
1118549
1118805
1119061
1119317
1119573
1119829
1120085
1120341
1120597
1120853
1121109
1121365
1121621
1121877
1122133
1122389
1122645
1122901
1123157
1123413
1123669
1123925
1124181
1124437
1124693
1124949
1125205
1125461
1125717
1125973
1126229
1126485
1126741
1126997
1127253
1127509
1127765
1128021
1128277
1128533
1128789
1129045
1129301
1129557
1129813
1130069
1130325
1114198
1114454
1114710
1114966
1115222
1115478
1115734
1115990
1116246
1116502
1116758
1117014
1117270
1117526
1117782
1118038
1118294
1118550
1118806
1119062
1119318
1119574
1119830
1120086
1120342
1120598
1120854
1121110
1121366
1121622
1121878
1122134
1122390
1122646
1122902
1123158
1123414
1123670
1123926
1124182
1124438
1124694
1124950
1125206
1125462
1125718
1125974
1126230
1126486
1126742
1126998
1127254
1127510
1127766
1128022
1128278
1128534
1128790
1129046
1129302
1129558
1129814
1130070
1130326
1114199
1114455
1114711
1114967
1115223
1115479
1115735
1115991
1116247
1116503
1116759
1117015
1117271
1117527
1117783
1118039
1118295
1118551
1118807
1119063
1119319
1119575
1119831
1120087
1120343
1120599
1120855
1121111
1121367
1121623
1121879
1122135
1122391
1122647
1122903
1123159
1123415
1123671
1123927
1124183
1124439
1124695
1124951
1125207
1125463
1125719
1125975
1126231
1126487
1126743
1126999
1127255
1127511
1127767
1128023
1128279
1128535
1128791
1129047
1129303
1129559
1129815
1130071
1130327
1114200
1114456
1114712
1114968
1115224
1115480
1115736
1115992
1116248
1116504
1116760
1117016
1117272
1117528
1117784
1118040
1118296
1118552
1118808
1119064
1119320
1119576
1119832
1120088
1120344
1120600
1120856
1121112
1121368
1121624
1121880
1122136
1122392
1122648
1122904
1123160
1123416
1123672
1123928
1124184
1124440
1124696
1124952
1125208
1125464
1125720
1125976
1126232
1126488
1126744
1127000
1127256
1127512
1127768
1128024
1128280
1128536
1128792
1129048
1129304
1129560
1129816
1130072
1130328
1114201
1114457
1114713
1114969
1115225
1115481
1115737
1115993
1116249
1116505
1116761
1117017
1117273
1117529
1117785
1118041
1118297
1118553
1118809
1119065
1119321
1119577
1119833
1120089
1120345
1120601
1120857
1121113
1121369
1121625
1121881
1122137
1122393
1122649
1122905
1123161
1123417
1123673
1123929
1124185
1124441
1124697
1124953
1125209
1125465
1125721
1125977
1126233
1126489
1126745
1127001
1127257
1127513
1127769
1128025
1128281
1128537
1128793
1129049
1129305
1129561
1129817
1130073
1130329
1114202
1114458
1114714
1114970
1115226
1115482
1115738
1115994
1116250
1116506
1116762
1117018
1117274
1117530
1117786
1118042
1118298
1118554
1118810
1119066
1119322
1119578
1119834
1120090
1120346
1120602
1120858
1121114
1121370
1121626
1121882
1122138
1122394
1122650
1122906
1123162
1123418
1123674
1123930
1124186
1124442
1124698
1124954
1125210
1125466
1125722
1125978
1126234
1126490
1126746
1127002
1127258
1127514
1127770
1128026
1128282
1128538
1128794
1129050
1129306
1129562
1129818
1130074
1130330
1114203
1114459
1114715
1114971
1115227
1115483
1115739
1115995
1116251
1116507
1116763
1117019
1117275
1117531
1117787
1118043
1118299
1118555
1118811
1119067
1119323
1119579
1119835
1120091
1120347
1120603
1120859
1121115
1121371
1121627
1121883
1122139
1122395
1122651
1122907
1123163
1123419
1123675
1123931
1124187
1124443
1124699
1124955
1125211
1125467
1125723
1125979
1126235
1126491
1126747
1127003
1127259
1127515
1127771
1128027
1128283
1128539
1128795
1129051
1129307
1129563
1129819
1130075
1130331
1114204
1114460
1114716
1114972
1115228
1115484
1115740
1115996
1116252
1116508
1116764
1117020
1117276
1117532
1117788
1118044
1118300
1118556
1118812
1119068
1119324
1119580
1119836
1120092
1120348
1120604
1120860
1121116
1121372
1121628
1121884
1122140
1122396
1122652
1122908
1123164
1123420
1123676
1123932
1124188
1124444
1124700
1124956
1125212
1125468
1125724
1125980
1126236
1126492
1126748
1127004
1127260
1127516
1127772
1128028
1128284
1128540
1128796
1129052
1129308
1129564
1129820
1130076
1130332
1114205
1114461
1114717
1114973
1115229
1115485
1115741
1115997
1116253
1116509
1116765
1117021
1117277
1117533
1117789
1118045
1118301
1118557
1118813
1119069
1119325
1119581
1119837
1120093
1120349
1120605
1120861
1121117
1121373
1121629
1121885
1122141
1122397
1122653
1122909
1123165
1123421
1123677
1123933
1124189
1124445
1124701
1124957
1125213
1125469
1125725
1125981
1126237
1126493
1126749
1127005
1127261
1127517
1127773
1128029
1128285
1128541
1128797
1129053
1129309
1129565
1129821
1130077
1130333
1114206
1114462
1114718
1114974
1115230
1115486
1115742
1115998
1116254
1116510
1116766
1117022
1117278
1117534
1117790
1118046
1118302
1118558
1118814
1119070
1119326
1119582
1119838
1120094
1120350
1120606
1120862
1121118
1121374
1121630
1121886
1122142
1122398
1122654
1122910
1123166
1123422
1123678
1123934
1124190
1124446
1124702
1124958
1125214
1125470
1125726
1125982
1126238
1126494
1126750
1127006
1127262
1127518
1127774
1128030
1128286
1128542
1128798
1129054
1129310
1129566
1129822
1130078
1130334
1114207
1114463
1114719
1114975
1115231
1115487
1115743
1115999
1116255
1116511
1116767
1117023
1117279
1117535
1117791
1118047
1118303
1118559
1118815
1119071
1119327
1119583
1119839
1120095
1120351
1120607
1120863
1121119
1121375
1121631
1121887
1122143
1122399
1122655
1122911
1123167
1123423
1123679
1123935
1124191
1124447
1124703
1124959
1125215
1125471
1125727
1125983
1126239
1126495
1126751
1127007
1127263
1127519
1127775
1128031
1128287
1128543
1128799
1129055
1129311
1129567
1129823
1130079
1130335
2498560
2498816
2499072
2499328
2499584
2499840
2500096
2500352
2500608
2500864
2501120
2501376
2501632
2501888
2502144
2502400
2502656
2502912
2503168
2503424
2503680
2503936
2504192
2504448
2504704
2504960
2505216
2505472
2505728
2505984
2506240
2506496
2498561
2498817
2499073
2499329
2499585
2499841
2500097
2500353
2500609
2500865
2501121
2501377
2501633
2501889
2502145
2502401
2502657
2502913
2503169
2503425
2503681
2503937
2504193
2504449
2504705
2504961
2505217
2505473
2505729
2505985
2506241
2506497
2498562
2498818
2499074
2499330
2499586
2499842
2500098
2500354
2500610
2500866
2501122
2501378
2501634
2501890
2502146
2502402
2502658
2502914
2503170
2503426
2503682
2503938
2504194
2504450
2504706
2504962
2505218
2505474
2505730
2505986
2506242
2506498
2498563
2498819
2499075
2499331
2499587
2499843
2500099
2500355
2500611
2500867
2501123
2501379
2501635
2501891
2502147
2502403
2502659
2502915
2503171
2503427
2503683
2503939
2504195
2504451
2504707
2504963
2505219
2505475
2505731
2505987
2506243
2506499
2498564
2498820
2499076
2499332
2499588
2499844
2500100
2500356
2500612
2500868
2501124
2501380
2501636
2501892
2502148
2502404
2502660
2502916
2503172
2503428
2503684
2503940
2504196
2504452
2504708
2504964
2505220
2505476
2505732
2505988
2506244
2506500
2498565
2498821
2499077
2499333
2499589
2499845
2500101
2500357
2500613
2500869
2501125
2501381
2501637
2501893
2502149
2502405
2502661
2502917
2503173
2503429
2503685
2503941
2504197
2504453
2504709
2504965
2505221
2505477
2505733
2505989
2506245
2506501
2498566
2498822
2499078
2499334
2499590
2499846
2500102
2500358
2500614
2500870
2501126
2501382
2501638
2501894
2502150
2502406
2502662
2502918
2503174
2503430
2503686
2503942
2504198
2504454
2504710
2504966
2505222
2505478
2505734
2505990
2506246
2506502
2498567
2498823
2499079
2499335
2499591
2499847
2500103
2500359
2500615
2500871
2501127
2501383
2501639
2501895
2502151
2502407
2502663
2502919
2503175
2503431
2503687
2503943
2504199
2504455
2504711
2504967
2505223
2505479
2505735
2505991
2506247
2506503
2498568
2498824
2499080
2499336
2499592
2499848
2500104
2500360
2500616
2500872
2501128
2501384
2501640
2501896
2502152
2502408
2502664
2502920
2503176
2503432
2503688
2503944
2504200
2504456
2504712
2504968
2505224
2505480
2505736
2505992
2506248
2506504
2498569
2498825
2499081
2499337
2499593
2499849
2500105
2500361
2500617
2500873
2501129
2501385
2501641
2501897
2502153
2502409
2502665
2502921
2503177
2503433
2503689
2503945
2504201
2504457
2504713
2504969
2505225
2505481
2505737
2505993
2506249
2506505
2498570
2498826
2499082
2499338
2499594
2499850
2500106
2500362
2500618
2500874
2501130
2501386
2501642
2501898
2502154
2502410
2502666
2502922
2503178
2503434
2503690
2503946
2504202
2504458
2504714
2504970
2505226
2505482
2505738
2505994
2506250
2506506
2498571
2498827
2499083
2499339
2499595
2499851
2500107
2500363
2500619
2500875
2501131
2501387
2501643
2501899
2502155
2502411
2502667
2502923
2503179
2503435
2503691
2503947
2504203
2504459
2504715
2504971
2505227
2505483
2505739
2505995
2506251
2506507
2498572
2498828
2499084
2499340
2499596
2499852
2500108
2500364
2500620
2500876
2501132
2501388
2501644
2501900
2502156
2502412
2502668
2502924
2503180
2503436
2503692
2503948
2504204
2504460
2504716
2504972
2505228
2505484
2505740
2505996
2506252
2506508
2498573
2498829
2499085
2499341
2499597
2499853
2500109
2500365
2500621
2500877
2501133
2501389
2501645
2501901
2502157
2502413
2502669
2502925
2503181
2503437
2503693
2503949
2504205
2504461
2504717
2504973
2505229
2505485
2505741
2505997
2506253
2506509
2498574
2498830
2499086
2499342
2499598
2499854
2500110
2500366
2500622
2500878
2501134
2501390
2501646
2501902
2502158
2502414
2502670
2502926
2503182
2503438
2503694
2503950
2504206
2504462
2504718
2504974
2505230
2505486
2505742
2505998
2506254
2506510
2498575
2498831
2499087
2499343
2499599
2499855
2500111
2500367
2500623
2500879
2501135
2501391
2501647
2501903
2502159
2502415
2502671
2502927
2503183
2503439
2503695
2503951
2504207
2504463
2504719
2504975
2505231
2505487
2505743
2505999
2506255
2506511
2498576
2498832
2499088
2499344
2499600
2499856
2500112
2500368
2500624
2500880
2501136
2501392
2501648
2501904
2502160
2502416
2502672
2502928
2503184
2503440
2503696
2503952
2504208
2504464
2504720
2504976
2505232
2505488
2505744
2506000
2506256
2506512
2498577
2498833
2499089
2499345
2499601
2499857
2500113
2500369
2500625
2500881
2501137
2501393
2501649
2501905
2502161
2502417
2502673
2502929
2503185
2503441
2503697
2503953
2504209
2504465
2504721
2504977
2505233
2505489
2505745
2506001
2506257
2506513
2498578
2498834
2499090
2499346
2499602
2499858
2500114
2500370
2500626
2500882
2501138
2501394
2501650
2501906
2502162
2502418
2502674
2502930
2503186
2503442
2503698
2503954
2504210
2504466
2504722
2504978
2505234
2505490
2505746
2506002
2506258
2506514
2498579
2498835
2499091
2499347
2499603
2499859
2500115
2500371
2500627
2500883
2501139
2501395
2501651
2501907
2502163
2502419
2502675
2502931
2503187
2503443
2503699
2503955
2504211
2504467
2504723
2504979
2505235
2505491
2505747
2506003
2506259
2506515
2498580
2498836
2499092
2499348
2499604
2499860
2500116
2500372
2500628
2500884
2501140
2501396
2501652
2501908
2502164
2502420
2502676
2502932
2503188
2503444
2503700
2503956
2504212
2504468
2504724
2504980
2505236
2505492
2505748
2506004
2506260
2506516
2498581
2498837
2499093
2499349
2499605
2499861
2500117
2500373
2500629
2500885
2501141
2501397
2501653
2501909
2502165
2502421
2502677
2502933
2503189
2503445
2503701
2503957
2504213
2504469
2504725
2504981
2505237
2505493
2505749
2506005
2506261
2506517
2498582
2498838
2499094
2499350
2499606
2499862
2500118
2500374
2500630
2500886
2501142
2501398
2501654
2501910
2502166
2502422
2502678
2502934
2503190
2503446
2503702
2503958
2504214
2504470
2504726
2504982
2505238
2505494
2505750
2506006
2506262
2506518
2498583
2498839
2499095
2499351
2499607
2499863
2500119
2500375
2500631
2500887
2501143
2501399
2501655
2501911
2502167
2502423
2502679
2502935
2503191
2503447
2503703
2503959
2504215
2504471
2504727
2504983
2505239
2505495
2505751
2506007
2506263
2506519
2498584
2498840
2499096
2499352
2499608
2499864
2500120
2500376
2500632
2500888
2501144
2501400
2501656
2501912
2502168
2502424
2502680
2502936
2503192
2503448
2503704
2503960
2504216
2504472
2504728
2504984
2505240
2505496
2505752
2506008
2506264
2506520
2498585
2498841
2499097
2499353
2499609
2499865
2500121
2500377
2500633
2500889
2501145
2501401
2501657
2501913
2502169
2502425
2502681
2502937
2503193
2503449
2503705
2503961
2504217
2504473
2504729
2504985
2505241
2505497
2505753
2506009
2506265
2506521
2498586
2498842
2499098
2499354
2499610
2499866
2500122
2500378
2500634
2500890
2501146
2501402
2501658
2501914
2502170
2502426
2502682
2502938
2503194
2503450
2503706
2503962
2504218
2504474
2504730
2504986
2505242
2505498
2505754
2506010
2506266
2506522
2498587
2498843
2499099
2499355
2499611
2499867
2500123
2500379
2500635
2500891
2501147
2501403
2501659
2501915
2502171
2502427
2502683
2502939
2503195
2503451
2503707
2503963
2504219
2504475
2504731
2504987
2505243
2505499
2505755
2506011
2506267
2506523
2498588
2498844
2499100
2499356
2499612
2499868
2500124
2500380
2500636
2500892
2501148
2501404
2501660
2501916
2502172
2502428
2502684
2502940
2503196
2503452
2503708
2503964
2504220
2504476
2504732
2504988
2505244
2505500
2505756
2506012
2506268
2506524
2498589
2498845
2499101
2499357
2499613
2499869
2500125
2500381
2500637
2500893
2501149
2501405
2501661
2501917
2502173
2502429
2502685
2502941
2503197
2503453
2503709
2503965
2504221
2504477
2504733
2504989
2505245
2505501
2505757
2506013
2506269
2506525
2498590
2498846
2499102
2499358
2499614
2499870
2500126
2500382
2500638
2500894
2501150
2501406
2501662
2501918
2502174
2502430
2502686
2502942
2503198
2503454
2503710
2503966
2504222
2504478
2504734
2504990
2505246
2505502
2505758
2506014
2506270
2506526
2498591
2498847
2499103
2499359
2499615
2499871
2500127
2500383
2500639
2500895
2501151
2501407
2501663
2501919
2502175
2502431
2502687
2502943
2503199
2503455
2503711
2503967
2504223
2504479
2504735
2504991
2505247
2505503
2505759
2506015
2506271
2506527
2498592
2498848
2499104
2499360
2499616
2499872
2500128
2500384
2500640
2500896
2501152
2501408
2501664
2501920
2502176
2502432
2502688
2502944
2503200
2503456
2503712
2503968
2504224
2504480
2504736
2504992
2505248
2505504
2505760
2506016
2506272
2506528
2498593
2498849
2499105
2499361
2499617
2499873
2500129
2500385
2500641
2500897
2501153
2501409
2501665
2501921
2502177
2502433
2502689
2502945
2503201
2503457
2503713
2503969
2504225
2504481
2504737
2504993
2505249
2505505
2505761
2506017
2506273
2506529
2498594
2498850
2499106
2499362
2499618
2499874
2500130
2500386
2500642
2500898
2501154
2501410
2501666
2501922
2502178
2502434
2502690
2502946
2503202
2503458
2503714
2503970
2504226
2504482
2504738
2504994
2505250
2505506
2505762
2506018
2506274
2506530
2498595
2498851
2499107
2499363
2499619
2499875
2500131
2500387
2500643
2500899
2501155
2501411
2501667
2501923
2502179
2502435
2502691
2502947
2503203
2503459
2503715
2503971
2504227
2504483
2504739
2504995
2505251
2505507
2505763
2506019
2506275
2506531
2498596
2498852
2499108
2499364
2499620
2499876
2500132
2500388
2500644
2500900
2501156
2501412
2501668
2501924
2502180
2502436
2502692
2502948
2503204
2503460
2503716
2503972
2504228
2504484
2504740
2504996
2505252
2505508
2505764
2506020
2506276
2506532
2498597
2498853
2499109
2499365
2499621
2499877
2500133
2500389
2500645
2500901
2501157
2501413
2501669
2501925
2502181
2502437
2502693
2502949
2503205
2503461
2503717
2503973
2504229
2504485
2504741
2504997
2505253
2505509
2505765
2506021
2506277
2506533
2498598
2498854
2499110
2499366
2499622
2499878
2500134
2500390
2500646
2500902
2501158
2501414
2501670
2501926
2502182
2502438
2502694
2502950
2503206
2503462
2503718
2503974
2504230
2504486
2504742
2504998
2505254
2505510
2505766
2506022
2506278
2506534
2498599
2498855
2499111
2499367
2499623
2499879
2500135
2500391
2500647
2500903
2501159
2501415
2501671
2501927
2502183
2502439
2502695
2502951
2503207
2503463
2503719
2503975
2504231
2504487
2504743
2504999
2505255
2505511
2505767
2506023
2506279
2506535
2498600
2498856
2499112
2499368
2499624
2499880
2500136
2500392
2500648
2500904
2501160
2501416
2501672
2501928
2502184
2502440
2502696
2502952
2503208
2503464
2503720
2503976
2504232
2504488
2504744
2505000
2505256
2505512
2505768
2506024
2506280
2506536
2498601
2498857
2499113
2499369
2499625
2499881
2500137
2500393
2500649
2500905
2501161
2501417
2501673
2501929
2502185
2502441
2502697
2502953
2503209
2503465
2503721
2503977
2504233
2504489
2504745
2505001
2505257
2505513
2505769
2506025
2506281
2506537
2498602
2498858
2499114
2499370
2499626
2499882
2500138
2500394
2500650
2500906
2501162
2501418
2501674
2501930
2502186
2502442
2502698
2502954
2503210
2503466
2503722
2503978
2504234
2504490
2504746
2505002
2505258
2505514
2505770
2506026
2506282
2506538
2498603
2498859
2499115
2499371
2499627
2499883
2500139
2500395
2500651
2500907
2501163
2501419
2501675
2501931
2502187
2502443
2502699
2502955
2503211
2503467
2503723
2503979
2504235
2504491
2504747
2505003
2505259
2505515
2505771
2506027
2506283
2506539
2498604
2498860
2499116
2499372
2499628
2499884
2500140
2500396
2500652
2500908
2501164
2501420
2501676
2501932
2502188
2502444
2502700
2502956
2503212
2503468
2503724
2503980
2504236
2504492
2504748
2505004
2505260
2505516
2505772
2506028
2506284
2506540
2498605
2498861
2499117
2499373
2499629
2499885
2500141
2500397
2500653
2500909
2501165
2501421
2501677
2501933
2502189
2502445
2502701
2502957
2503213
2503469
2503725
2503981
2504237
2504493
2504749
2505005
2505261
2505517
2505773
2506029
2506285
2506541
2498606
2498862
2499118
2499374
2499630
2499886
2500142
2500398
2500654
2500910
2501166
2501422
2501678
2501934
2502190
2502446
2502702
2502958
2503214
2503470
2503726
2503982
2504238
2504494
2504750
2505006
2505262
2505518
2505774
2506030
2506286
2506542
2498607
2498863
2499119
2499375
2499631
2499887
2500143
2500399
2500655
2500911
2501167
2501423
2501679
2501935
2502191
2502447
2502703
2502959
2503215
2503471
2503727
2503983
2504239
2504495
2504751
2505007
2505263
2505519
2505775
2506031
2506287
2506543
2498608
2498864
2499120
2499376
2499632
2499888
2500144
2500400
2500656
2500912
2501168
2501424
2501680
2501936
2502192
2502448
2502704
2502960
2503216
2503472
2503728
2503984
2504240
2504496
2504752
2505008
2505264
2505520
2505776
2506032
2506288
2506544
2498609
2498865
2499121
2499377
2499633
2499889
2500145
2500401
2500657
2500913
2501169
2501425
2501681
2501937
2502193
2502449
2502705
2502961
2503217
2503473
2503729
2503985
2504241
2504497
2504753
2505009
2505265
2505521
2505777
2506033
2506289
2506545
2498610
2498866
2499122
2499378
2499634
2499890
2500146
2500402
2500658
2500914
2501170
2501426
2501682
2501938
2502194
2502450
2502706
2502962
2503218
2503474
2503730
2503986
2504242
2504498
2504754
2505010
2505266
2505522
2505778
2506034
2506290
2506546
2498611
2498867
2499123
2499379
2499635
2499891
2500147
2500403
2500659
2500915
2501171
2501427
2501683
2501939
2502195
2502451
2502707
2502963
2503219
2503475
2503731
2503987
2504243
2504499
2504755
2505011
2505267
2505523
2505779
2506035
2506291
2506547
2498612
2498868
2499124
2499380
2499636
2499892
2500148
2500404
2500660
2500916
2501172
2501428
2501684
2501940
2502196
2502452
2502708
2502964
2503220
2503476
2503732
2503988
2504244
2504500
2504756
2505012
2505268
2505524
2505780
2506036
2506292
2506548
2498613
2498869
2499125
2499381
2499637
2499893
2500149
2500405
2500661
2500917
2501173
2501429
2501685
2501941
2502197
2502453
2502709
2502965
2503221
2503477
2503733
2503989
2504245
2504501
2504757
2505013
2505269
2505525
2505781
2506037
2506293
2506549
2498614
2498870
2499126
2499382
2499638
2499894
2500150
2500406
2500662
2500918
2501174
2501430
2501686
2501942
2502198
2502454
2502710
2502966
2503222
2503478
2503734
2503990
2504246
2504502
2504758
2505014
2505270
2505526
2505782
2506038
2506294
2506550
2498615
2498871
2499127
2499383
2499639
2499895
2500151
2500407
2500663
2500919
2501175
2501431
2501687
2501943
2502199
2502455
2502711
2502967
2503223
2503479
2503735
2503991
2504247
2504503
2504759
2505015
2505271
2505527
2505783
2506039
2506295
2506551
2498616
2498872
2499128
2499384
2499640
2499896
2500152
2500408
2500664
2500920
2501176
2501432
2501688
2501944
2502200
2502456
2502712
2502968
2503224
2503480
2503736
2503992
2504248
2504504
2504760
2505016
2505272
2505528
2505784
2506040
2506296
2506552
2498617
2498873
2499129
2499385
2499641
2499897
2500153
2500409
2500665
2500921
2501177
2501433
2501689
2501945
2502201
2502457
2502713
2502969
2503225
2503481
2503737
2503993
2504249
2504505
2504761
2505017
2505273
2505529
2505785
2506041
2506297
2506553
2498618
2498874
2499130
2499386
2499642
2499898
2500154
2500410
2500666
2500922
2501178
2501434
2501690
2501946
2502202
2502458
2502714
2502970
2503226
2503482
2503738
2503994
2504250
2504506
2504762
2505018
2505274
2505530
2505786
2506042
2506298
2506554
2498619
2498875
2499131
2499387
2499643
2499899
2500155
2500411
2500667
2500923
2501179
2501435
2501691
2501947
2502203
2502459
2502715
2502971
2503227
2503483
2503739
2503995
2504251
2504507
2504763
2505019
2505275
2505531
2505787
2506043
2506299
2506555
2498620
2498876
2499132
2499388
2499644
2499900
2500156
2500412
2500668
2500924
2501180
2501436
2501692
2501948
2502204
2502460
2502716
2502972
2503228
2503484
2503740
2503996
2504252
2504508
2504764
2505020
2505276
2505532
2505788
2506044
2506300
2506556
2498621
2498877
2499133
2499389
2499645
2499901
2500157
2500413
2500669
2500925
2501181
2501437
2501693
2501949
2502205
2502461
2502717
2502973
2503229
2503485
2503741
2503997
2504253
2504509
2504765
2505021
2505277
2505533
2505789
2506045
2506301
2506557
2498622
2498878
2499134
2499390
2499646
2499902
2500158
2500414
2500670
2500926
2501182
2501438
2501694
2501950
2502206
2502462
2502718
2502974
2503230
2503486
2503742
2503998
2504254
2504510
2504766
2505022
2505278
2505534
2505790
2506046
2506302
2506558
2498623
2498879
2499135
2499391
2499647
2499903
2500159
2500415
2500671
2500927
2501183
2501439
2501695
2501951
2502207
2502463
2502719
2502975
2503231
2503487
2503743
2503999
2504255
2504511
2504767
2505023
2505279
2505535
2505791
2506047
2506303
2506559
2498624
2498880
2499136
2499392
2499648
2499904
2500160
2500416
2500672
2500928
2501184
2501440
2501696
2501952
2502208
2502464
2502720
2502976
2503232
2503488
2503744
2504000
2504256
2504512
2504768
2505024
2505280
2505536
2505792
2506048
2506304
2506560
2498625
2498881
2499137
2499393
2499649
2499905
2500161
2500417
2500673
2500929
2501185
2501441
2501697
2501953
2502209
2502465
2502721
2502977
2503233
2503489
2503745
2504001
2504257
2504513
2504769
2505025
2505281
2505537
2505793
2506049
2506305
2506561
2498626
2498882
2499138
2499394
2499650
2499906
2500162
2500418
2500674
2500930
2501186
2501442
2501698
2501954
2502210
2502466
2502722
2502978
2503234
2503490
2503746
2504002
2504258
2504514
2504770
2505026
2505282
2505538
2505794
2506050
2506306
2506562
2498627
2498883
2499139
2499395
2499651
2499907
2500163
2500419
2500675
2500931
2501187
2501443
2501699
2501955
2502211
2502467
2502723
2502979
2503235
2503491
2503747
2504003
2504259
2504515
2504771
2505027
2505283
2505539
2505795
2506051
2506307
2506563
2498628
2498884
2499140
2499396
2499652
2499908
2500164
2500420
2500676
2500932
2501188
2501444
2501700
2501956
2502212
2502468
2502724
2502980
2503236
2503492
2503748
2504004
2504260
2504516
2504772
2505028
2505284
2505540
2505796
2506052
2506308
2506564
2498629
2498885
2499141
2499397
2499653
2499909
2500165
2500421
2500677
2500933
2501189
2501445
2501701
2501957
2502213
2502469
2502725
2502981
2503237
2503493
2503749
2504005
2504261
2504517
2504773
2505029
2505285
2505541
2505797
2506053
2506309
2506565
2498630
2498886
2499142
2499398
2499654
2499910
2500166
2500422
2500678
2500934
2501190
2501446
2501702
2501958
2502214
2502470
2502726
2502982
2503238
2503494
2503750
2504006
2504262
2504518
2504774
2505030
2505286
2505542
2505798
2506054
2506310
2506566
2498631
2498887
2499143
2499399
2499655
2499911
2500167
2500423
2500679
2500935
2501191
2501447
2501703
2501959
2502215
2502471
2502727
2502983
2503239
2503495
2503751
2504007
2504263
2504519
2504775
2505031
2505287
2505543
2505799
2506055
2506311
2506567
2498632
2498888
2499144
2499400
2499656
2499912
2500168
2500424
2500680
2500936
2501192
2501448
2501704
2501960
2502216
2502472
2502728
2502984
2503240
2503496
2503752
2504008
2504264
2504520
2504776
2505032
2505288
2505544
2505800
2506056
2506312
2506568
2498633
2498889
2499145
2499401
2499657
2499913
2500169
2500425
2500681
2500937
2501193
2501449
2501705
2501961
2502217
2502473
2502729
2502985
2503241
2503497
2503753
2504009
2504265
2504521
2504777
2505033
2505289
2505545
2505801
2506057
2506313
2506569
2498634
2498890
2499146
2499402
2499658
2499914
2500170
2500426
2500682
2500938
2501194
2501450
2501706
2501962
2502218
2502474
2502730
2502986
2503242
2503498
2503754
2504010
2504266
2504522
2504778
2505034
2505290
2505546
2505802
2506058
2506314
2506570
2498635
2498891
2499147
2499403
2499659
2499915
2500171
2500427
2500683
2500939
2501195
2501451
2501707
2501963
2502219
2502475
2502731
2502987
2503243
2503499
2503755
2504011
2504267
2504523
2504779
2505035
2505291
2505547
2505803
2506059
2506315
2506571
2498636
2498892
2499148
2499404
2499660
2499916
2500172
2500428
2500684
2500940
2501196
2501452
2501708
2501964
2502220
2502476
2502732
2502988
2503244
2503500
2503756
2504012
2504268
2504524
2504780
2505036
2505292
2505548
2505804
2506060
2506316
2506572
2498637
2498893
2499149
2499405
2499661
2499917
2500173
2500429
2500685
2500941
2501197
2501453
2501709
2501965
2502221
2502477
2502733
2502989
2503245
2503501
2503757
2504013
2504269
2504525
2504781
2505037
2505293
2505549
2505805
2506061
2506317
2506573
2498638
2498894
2499150
2499406
2499662
2499918
2500174
2500430
2500686
2500942
2501198
2501454
2501710
2501966
2502222
2502478
2502734
2502990
2503246
2503502
2503758
2504014
2504270
2504526
2504782
2505038
2505294
2505550
2505806
2506062
2506318
2506574
2498639
2498895
2499151
2499407
2499663
2499919
2500175
2500431
2500687
2500943
2501199
2501455
2501711
2501967
2502223
2502479
2502735
2502991
2503247
2503503
2503759
2504015
2504271
2504527
2504783
2505039
2505295
2505551
2505807
2506063
2506319
2506575
2498640
2498896
2499152
2499408
2499664
2499920
2500176
2500432
2500688
2500944
2501200
2501456
2501712
2501968
2502224
2502480
2502736
2502992
2503248
2503504
2503760
2504016
2504272
2504528
2504784
2505040
2505296
2505552
2505808
2506064
2506320
2506576
2498641
2498897
2499153
2499409
2499665
2499921
2500177
2500433
2500689
2500945
2501201
2501457
2501713
2501969
2502225
2502481
2502737
2502993
2503249
2503505
2503761
2504017
2504273
2504529
2504785
2505041
2505297
2505553
2505809
2506065
2506321
2506577
2498642
2498898
2499154
2499410
2499666
2499922
2500178
2500434
2500690
2500946
2501202
2501458
2501714
2501970
2502226
2502482
2502738
2502994
2503250
2503506
2503762
2504018
2504274
2504530
2504786
2505042
2505298
2505554
2505810
2506066
2506322
2506578
2498643
2498899
2499155
2499411
2499667
2499923
2500179
2500435
2500691
2500947
2501203
2501459
2501715
2501971
2502227
2502483
2502739
2502995
2503251
2503507
2503763
2504019
2504275
2504531
2504787
2505043
2505299
2505555
2505811
2506067
2506323
2506579
2498644
2498900
2499156
2499412
2499668
2499924
2500180
2500436
2500692
2500948
2501204
2501460
2501716
2501972
2502228
2502484
2502740
2502996
2503252
2503508
2503764
2504020
2504276
2504532
2504788
2505044
2505300
2505556
2505812
2506068
2506324
2506580
2498645
2498901
2499157
2499413
2499669
2499925
2500181
2500437
2500693
2500949
2501205
2501461
2501717
2501973
2502229
2502485
2502741
2502997
2503253
2503509
2503765
2504021
2504277
2504533
2504789
2505045
2505301
2505557
2505813
2506069
2506325
2506581
2498646
2498902
2499158
2499414
2499670
2499926
2500182
2500438
2500694
2500950
2501206
2501462
2501718
2501974
2502230
2502486
2502742
2502998
2503254
2503510
2503766
2504022
2504278
2504534
2504790
2505046
2505302
2505558
2505814
2506070
2506326
2506582
2498647
2498903
2499159
2499415
2499671
2499927
2500183
2500439
2500695
2500951
2501207
2501463
2501719
2501975
2502231
2502487
2502743
2502999
2503255
2503511
2503767
2504023
2504279
2504535
2504791
2505047
2505303
2505559
2505815
2506071
2506327
2506583
2498648
2498904
2499160
2499416
2499672
2499928
2500184
2500440
2500696
2500952
2501208
2501464
2501720
2501976
2502232
2502488
2502744
2503000
2503256
2503512
2503768
2504024
2504280
2504536
2504792
2505048
2505304
2505560
2505816
2506072
2506328
2506584
2498649
2498905
2499161
2499417
2499673
2499929
2500185
2500441
2500697
2500953
2501209
2501465
2501721
2501977
2502233
2502489
2502745
2503001
2503257
2503513
2503769
2504025
2504281
2504537
2504793
2505049
2505305
2505561
2505817
2506073
2506329
2506585
2498650
2498906
2499162
2499418
2499674
2499930
2500186
2500442
2500698
2500954
2501210
2501466
2501722
2501978
2502234
2502490
2502746
2503002
2503258
2503514
2503770
2504026
2504282
2504538
2504794
2505050
2505306
2505562
2505818
2506074
2506330
2506586
2498651
2498907
2499163
2499419
2499675
2499931
2500187
2500443
2500699
2500955
2501211
2501467
2501723
2501979
2502235
2502491
2502747
2503003
2503259
2503515
2503771
2504027
2504283
2504539
2504795
2505051
2505307
2505563
2505819
2506075
2506331
2506587
2498652
2498908
2499164
2499420
2499676
2499932
2500188
2500444
2500700
2500956
2501212
2501468
2501724
2501980
2502236
2502492
2502748
2503004
2503260
2503516
2503772
2504028
2504284
2504540
2504796
2505052
2505308
2505564
2505820
2506076
2506332
2506588
2498653
2498909
2499165
2499421
2499677
2499933
2500189
2500445
2500701
2500957
2501213
2501469
2501725
2501981
2502237
2502493
2502749
2503005
2503261
2503517
2503773
2504029
2504285
2504541
2504797
2505053
2505309
2505565
2505821
2506077
2506333
2506589
2498654
2498910
2499166
2499422
2499678
2499934
2500190
2500446
2500702
2500958
2501214
2501470
2501726
2501982
2502238
2502494
2502750
2503006
2503262
2503518
2503774
2504030
2504286
2504542
2504798
2505054
2505310
2505566
2505822
2506078
2506334
2506590
2498655
2498911
2499167
2499423
2499679
2499935
2500191
2500447
2500703
2500959
2501215
2501471
2501727
2501983
2502239
2502495
2502751
2503007
2503263
2503519
2503775
2504031
2504287
2504543
2504799
2505055
2505311
2505567
2505823
2506079
2506335
2506591
3014656
3014912
3015168
3015424
3015680
3015936
3016192
3016448
3016704
3016960
3017216
3017472
3017728
3017984
3018240
3018496
3018752
3019008
3019264
3019520
3019776
3020032
3020288
3020544
3020800
3021056
3021312
3021568
3021824
3022080
3022336
3022592
3014657
3014913
3015169
3015425
3015681
3015937
3016193
3016449
3016705
3016961
3017217
3017473
3017729
3017985
3018241
3018497
3018753
3019009
3019265
3019521
3019777
3020033
3020289
3020545
3020801
3021057
3021313
3021569
3021825
3022081
3022337
3022593
3014658
3014914
3015170
3015426
3015682
3015938
3016194
3016450
3016706
3016962
3017218
3017474
3017730
3017986
3018242
3018498
3018754
3019010
3019266
3019522
3019778
3020034
3020290
3020546
3020802
3021058
3021314
3021570
3021826
3022082
3022338
3022594
3014659
3014915
3015171
3015427
3015683
3015939
3016195
3016451
3016707
3016963
3017219
3017475
3017731
3017987
3018243
3018499
3018755
3019011
3019267
3019523
3019779
3020035
3020291
3020547
3020803
3021059
3021315
3021571
3021827
3022083
3022339
3022595
3014660
3014916
3015172
3015428
3015684
3015940
3016196
3016452
3016708
3016964
3017220
3017476
3017732
3017988
3018244
3018500
3018756
3019012
3019268
3019524
3019780
3020036
3020292
3020548
3020804
3021060
3021316
3021572
3021828
3022084
3022340
3022596
3014661
3014917
3015173
3015429
3015685
3015941
3016197
3016453
3016709
3016965
3017221
3017477
3017733
3017989
3018245
3018501
3018757
3019013
3019269
3019525
3019781
3020037
3020293
3020549
3020805
3021061
3021317
3021573
3021829
3022085
3022341
3022597
3014662
3014918
3015174
3015430
3015686
3015942
3016198
3016454
3016710
3016966
3017222
3017478
3017734
3017990
3018246
3018502
3018758
3019014
3019270
3019526
3019782
3020038
3020294
3020550
3020806
3021062
3021318
3021574
3021830
3022086
3022342
3022598
3014663
3014919
3015175
3015431
3015687
3015943
3016199
3016455
3016711
3016967
3017223
3017479
3017735
3017991
3018247
3018503
3018759
3019015
3019271
3019527
3019783
3020039
3020295
3020551
3020807
3021063
3021319
3021575
3021831
3022087
3022343
3022599
3014664
3014920
3015176
3015432
3015688
3015944
3016200
3016456
3016712
3016968
3017224
3017480
3017736
3017992
3018248
3018504
3018760
3019016
3019272
3019528
3019784
3020040
3020296
3020552
3020808
3021064
3021320
3021576
3021832
3022088
3022344
3022600
3014665
3014921
3015177
3015433
3015689
3015945
3016201
3016457
3016713
3016969
3017225
3017481
3017737
3017993
3018249
3018505
3018761
3019017
3019273
3019529
3019785
3020041
3020297
3020553
3020809
3021065
3021321
3021577
3021833
3022089
3022345
3022601
3014666
3014922
3015178
3015434
3015690
3015946
3016202
3016458
3016714
3016970
3017226
3017482
3017738
3017994
3018250
3018506
3018762
3019018
3019274
3019530
3019786
3020042
3020298
3020554
3020810
3021066
3021322
3021578
3021834
3022090
3022346
3022602
3014667
3014923
3015179
3015435
3015691
3015947
3016203
3016459
3016715
3016971
3017227
3017483
3017739
3017995
3018251
3018507
3018763
3019019
3019275
3019531
3019787
3020043
3020299
3020555
3020811
3021067
3021323
3021579
3021835
3022091
3022347
3022603
3014668
3014924
3015180
3015436
3015692
3015948
3016204
3016460
3016716
3016972
3017228
3017484
3017740
3017996
3018252
3018508
3018764
3019020
3019276
3019532
3019788
3020044
3020300
3020556
3020812
3021068
3021324
3021580
3021836
3022092
3022348
3022604
3014669
3014925
3015181
3015437
3015693
3015949
3016205
3016461
3016717
3016973
3017229
3017485
3017741
3017997
3018253
3018509
3018765
3019021
3019277
3019533
3019789
3020045
3020301
3020557
3020813
3021069
3021325
3021581
3021837
3022093
3022349
3022605
3014670
3014926
3015182
3015438
3015694
3015950
3016206
3016462
3016718
3016974
3017230
3017486
3017742
3017998
3018254
3018510
3018766
3019022
3019278
3019534
3019790
3020046
3020302
3020558
3020814
3021070
3021326
3021582
3021838
3022094
3022350
3022606
3014671
3014927
3015183
3015439
3015695
3015951
3016207
3016463
3016719
3016975
3017231
3017487
3017743
3017999
3018255
3018511
3018767
3019023
3019279
3019535
3019791
3020047
3020303
3020559
3020815
3021071
3021327
3021583
3021839
3022095
3022351
3022607
3014672
3014928
3015184
3015440
3015696
3015952
3016208
3016464
3016720
3016976
3017232
3017488
3017744
3018000
3018256
3018512
3018768
3019024
3019280
3019536
3019792
3020048
3020304
3020560
3020816
3021072
3021328
3021584
3021840
3022096
3022352
3022608
3014673
3014929
3015185
3015441
3015697
3015953
3016209
3016465
3016721
3016977
3017233
3017489
3017745
3018001
3018257
3018513
3018769
3019025
3019281
3019537
3019793
3020049
3020305
3020561
3020817
3021073
3021329
3021585
3021841
3022097
3022353
3022609
3014674
3014930
3015186
3015442
3015698
3015954
3016210
3016466
3016722
3016978
3017234
3017490
3017746
3018002
3018258
3018514
3018770
3019026
3019282
3019538
3019794
3020050
3020306
3020562
3020818
3021074
3021330
3021586
3021842
3022098
3022354
3022610
3014675
3014931
3015187
3015443
3015699
3015955
3016211
3016467
3016723
3016979
3017235
3017491
3017747
3018003
3018259
3018515
3018771
3019027
3019283
3019539
3019795
3020051
3020307
3020563
3020819
3021075
3021331
3021587
3021843
3022099
3022355
3022611
3014676
3014932
3015188
3015444
3015700
3015956
3016212
3016468
3016724
3016980
3017236
3017492
3017748
3018004
3018260
3018516
3018772
3019028
3019284
3019540
3019796
3020052
3020308
3020564
3020820
3021076
3021332
3021588
3021844
3022100
3022356
3022612
3014677
3014933
3015189
3015445
3015701
3015957
3016213
3016469
3016725
3016981
3017237
3017493
3017749
3018005
3018261
3018517
3018773
3019029
3019285
3019541
3019797
3020053
3020309
3020565
3020821
3021077
3021333
3021589
3021845
3022101
3022357
3022613
3014678
3014934
3015190
3015446
3015702
3015958
3016214
3016470
3016726
3016982
3017238
3017494
3017750
3018006
3018262
3018518
3018774
3019030
3019286
3019542
3019798
3020054
3020310
3020566
3020822
3021078
3021334
3021590
3021846
3022102
3022358
3022614
3014679
3014935
3015191
3015447
3015703
3015959
3016215
3016471
3016727
3016983
3017239
3017495
3017751
3018007
3018263
3018519
3018775
3019031
3019287
3019543
3019799
3020055
3020311
3020567
3020823
3021079
3021335
3021591
3021847
3022103
3022359
3022615
3014680
3014936
3015192
3015448
3015704
3015960
3016216
3016472
3016728
3016984
3017240
3017496
3017752
3018008
3018264
3018520
3018776
3019032
3019288
3019544
3019800
3020056
3020312
3020568
3020824
3021080
3021336
3021592
3021848
3022104
3022360
3022616
3014681
3014937
3015193
3015449
3015705
3015961
3016217
3016473
3016729
3016985
3017241
3017497
3017753
3018009
3018265
3018521
3018777
3019033
3019289
3019545
3019801
3020057
3020313
3020569
3020825
3021081
3021337
3021593
3021849
3022105
3022361
3022617
3014682
3014938
3015194
3015450
3015706
3015962
3016218
3016474
3016730
3016986
3017242
3017498
3017754
3018010
3018266
3018522
3018778
3019034
3019290
3019546
3019802
3020058
3020314
3020570
3020826
3021082
3021338
3021594
3021850
3022106
3022362
3022618
3014683
3014939
3015195
3015451
3015707
3015963
3016219
3016475
3016731
3016987
3017243
3017499
3017755
3018011
3018267
3018523
3018779
3019035
3019291
3019547
3019803
3020059
3020315
3020571
3020827
3021083
3021339
3021595
3021851
3022107
3022363
3022619
3014684
3014940
3015196
3015452
3015708
3015964
3016220
3016476
3016732
3016988
3017244
3017500
3017756
3018012
3018268
3018524
3018780
3019036
3019292
3019548
3019804
3020060
3020316
3020572
3020828
3021084
3021340
3021596
3021852
3022108
3022364
3022620
3014685
3014941
3015197
3015453
3015709
3015965
3016221
3016477
3016733
3016989
3017245
3017501
3017757
3018013
3018269
3018525
3018781
3019037
3019293
3019549
3019805
3020061
3020317
3020573
3020829
3021085
3021341
3021597
3021853
3022109
3022365
3022621
3014686
3014942
3015198
3015454
3015710
3015966
3016222
3016478
3016734
3016990
3017246
3017502
3017758
3018014
3018270
3018526
3018782
3019038
3019294
3019550
3019806
3020062
3020318
3020574
3020830
3021086
3021342
3021598
3021854
3022110
3022366
3022622
3014687
3014943
3015199
3015455
3015711
3015967
3016223
3016479
3016735
3016991
3017247
3017503
3017759
3018015
3018271
3018527
3018783
3019039
3019295
3019551
3019807
3020063
3020319
3020575
3020831
3021087
3021343
3021599
3021855
3022111
3022367
3022623
3014688
3014944
3015200
3015456
3015712
3015968
3016224
3016480
3016736
3016992
3017248
3017504
3017760
3018016
3018272
3018528
3018784
3019040
3019296
3019552
3019808
3020064
3020320
3020576
3020832
3021088
3021344
3021600
3021856
3022112
3022368
3022624
3014689
3014945
3015201
3015457
3015713
3015969
3016225
3016481
3016737
3016993
3017249
3017505
3017761
3018017
3018273
3018529
3018785
3019041
3019297
3019553
3019809
3020065
3020321
3020577
3020833
3021089
3021345
3021601
3021857
3022113
3022369
3022625
3014690
3014946
3015202
3015458
3015714
3015970
3016226
3016482
3016738
3016994
3017250
3017506
3017762
3018018
3018274
3018530
3018786
3019042
3019298
3019554
3019810
3020066
3020322
3020578
3020834
3021090
3021346
3021602
3021858
3022114
3022370
3022626
3014691
3014947
3015203
3015459
3015715
3015971
3016227
3016483
3016739
3016995
3017251
3017507
3017763
3018019
3018275
3018531
3018787
3019043
3019299
3019555
3019811
3020067
3020323
3020579
3020835
3021091
3021347
3021603
3021859
3022115
3022371
3022627
3014692
3014948
3015204
3015460
3015716
3015972
3016228
3016484
3016740
3016996
3017252
3017508
3017764
3018020
3018276
3018532
3018788
3019044
3019300
3019556
3019812
3020068
3020324
3020580
3020836
3021092
3021348
3021604
3021860
3022116
3022372
3022628
3014693
3014949
3015205
3015461
3015717
3015973
3016229
3016485
3016741
3016997
3017253
3017509
3017765
3018021
3018277
3018533
3018789
3019045
3019301
3019557
3019813
3020069
3020325
3020581
3020837
3021093
3021349
3021605
3021861
3022117
3022373
3022629
3014694
3014950
3015206
3015462
3015718
3015974
3016230
3016486
3016742
3016998
3017254
3017510
3017766
3018022
3018278
3018534
3018790
3019046
3019302
3019558
3019814
3020070
3020326
3020582
3020838
3021094
3021350
3021606
3021862
3022118
3022374
3022630
3014695
3014951
3015207
3015463
3015719
3015975
3016231
3016487
3016743
3016999
3017255
3017511
3017767
3018023
3018279
3018535
3018791
3019047
3019303
3019559
3019815
3020071
3020327
3020583
3020839
3021095
3021351
3021607
3021863
3022119
3022375
3022631
3014696
3014952
3015208
3015464
3015720
3015976
3016232
3016488
3016744
3017000
3017256
3017512
3017768
3018024
3018280
3018536
3018792
3019048
3019304
3019560
3019816
3020072
3020328
3020584
3020840
3021096
3021352
3021608
3021864
3022120
3022376
3022632
3014697
3014953
3015209
3015465
3015721
3015977
3016233
3016489
3016745
3017001
3017257
3017513
3017769
3018025
3018281
3018537
3018793
3019049
3019305
3019561
3019817
3020073
3020329
3020585
3020841
3021097
3021353
3021609
3021865
3022121
3022377
3022633
3014698
3014954
3015210
3015466
3015722
3015978
3016234
3016490
3016746
3017002
3017258
3017514
3017770
3018026
3018282
3018538
3018794
3019050
3019306
3019562
3019818
3020074
3020330
3020586
3020842
3021098
3021354
3021610
3021866
3022122
3022378
3022634
3014699
3014955
3015211
3015467
3015723
3015979
3016235
3016491
3016747
3017003
3017259
3017515
3017771
3018027
3018283
3018539
3018795
3019051
3019307
3019563
3019819
3020075
3020331
3020587
3020843
3021099
3021355
3021611
3021867
3022123
3022379
3022635
3014700
3014956
3015212
3015468
3015724
3015980
3016236
3016492
3016748
3017004
3017260
3017516
3017772
3018028
3018284
3018540
3018796
3019052
3019308
3019564
3019820
3020076
3020332
3020588
3020844
3021100
3021356
3021612
3021868
3022124
3022380
3022636
3014701
3014957
3015213
3015469
3015725
3015981
3016237
3016493
3016749
3017005
3017261
3017517
3017773
3018029
3018285
3018541
3018797
3019053
3019309
3019565
3019821
3020077
3020333
3020589
3020845
3021101
3021357
3021613
3021869
3022125
3022381
3022637
3014702
3014958
3015214
3015470
3015726
3015982
3016238
3016494
3016750
3017006
3017262
3017518
3017774
3018030
3018286
3018542
3018798
3019054
3019310
3019566
3019822
3020078
3020334
3020590
3020846
3021102
3021358
3021614
3021870
3022126
3022382
3022638
3014703
3014959
3015215
3015471
3015727
3015983
3016239
3016495
3016751
3017007
3017263
3017519
3017775
3018031
3018287
3018543
3018799
3019055
3019311
3019567
3019823
3020079
3020335
3020591
3020847
3021103
3021359
3021615
3021871
3022127
3022383
3022639
3014704
3014960
3015216
3015472
3015728
3015984
3016240
3016496
3016752
3017008
3017264
3017520
3017776
3018032
3018288
3018544
3018800
3019056
3019312
3019568
3019824
3020080
3020336
3020592
3020848
3021104
3021360
3021616
3021872
3022128
3022384
3022640
3014705
3014961
3015217
3015473
3015729
3015985
3016241
3016497
3016753
3017009
3017265
3017521
3017777
3018033
3018289
3018545
3018801
3019057
3019313
3019569
3019825
3020081
3020337
3020593
3020849
3021105
3021361
3021617
3021873
3022129
3022385
3022641
3014706
3014962
3015218
3015474
3015730
3015986
3016242
3016498
3016754
3017010
3017266
3017522
3017778
3018034
3018290
3018546
3018802
3019058
3019314
3019570
3019826
3020082
3020338
3020594
3020850
3021106
3021362
3021618
3021874
3022130
3022386
3022642
3014707
3014963
3015219
3015475
3015731
3015987
3016243
3016499
3016755
3017011
3017267
3017523
3017779
3018035
3018291
3018547
3018803
3019059
3019315
3019571
3019827
3020083
3020339
3020595
3020851
3021107
3021363
3021619
3021875
3022131
3022387
3022643
3014708
3014964
3015220
3015476
3015732
3015988
3016244
3016500
3016756
3017012
3017268
3017524
3017780
3018036
3018292
3018548
3018804
3019060
3019316
3019572
3019828
3020084
3020340
3020596
3020852
3021108
3021364
3021620
3021876
3022132
3022388
3022644
3014709
3014965
3015221
3015477
3015733
3015989
3016245
3016501
3016757
3017013
3017269
3017525
3017781
3018037
3018293
3018549
3018805
3019061
3019317
3019573
3019829
3020085
3020341
3020597
3020853
3021109
3021365
3021621
3021877
3022133
3022389
3022645
3014710
3014966
3015222
3015478
3015734
3015990
3016246
3016502
3016758
3017014
3017270
3017526
3017782
3018038
3018294
3018550
3018806
3019062
3019318
3019574
3019830
3020086
3020342
3020598
3020854
3021110
3021366
3021622
3021878
3022134
3022390
3022646
3014711
3014967
3015223
3015479
3015735
3015991
3016247
3016503
3016759
3017015
3017271
3017527
3017783
3018039
3018295
3018551
3018807
3019063
3019319
3019575
3019831
3020087
3020343
3020599
3020855
3021111
3021367
3021623
3021879
3022135
3022391
3022647
3014712
3014968
3015224
3015480
3015736
3015992
3016248
3016504
3016760
3017016
3017272
3017528
3017784
3018040
3018296
3018552
3018808
3019064
3019320
3019576
3019832
3020088
3020344
3020600
3020856
3021112
3021368
3021624
3021880
3022136
3022392
3022648
3014713
3014969
3015225
3015481
3015737
3015993
3016249
3016505
3016761
3017017
3017273
3017529
3017785
3018041
3018297
3018553
3018809
3019065
3019321
3019577
3019833
3020089
3020345
3020601
3020857
3021113
3021369
3021625
3021881
3022137
3022393
3022649
3014714
3014970
3015226
3015482
3015738
3015994
3016250
3016506
3016762
3017018
3017274
3017530
3017786
3018042
3018298
3018554
3018810
3019066
3019322
3019578
3019834
3020090
3020346
3020602
3020858
3021114
3021370
3021626
3021882
3022138
3022394
3022650
3014715
3014971
3015227
3015483
3015739
3015995
3016251
3016507
3016763
3017019
3017275
3017531
3017787
3018043
3018299
3018555
3018811
3019067
3019323
3019579
3019835
3020091
3020347
3020603
3020859
3021115
3021371
3021627
3021883
3022139
3022395
3022651
3014716
3014972
3015228
3015484
3015740
3015996
3016252
3016508
3016764
3017020
3017276
3017532
3017788
3018044
3018300
3018556
3018812
3019068
3019324
3019580
3019836
3020092
3020348
3020604
3020860
3021116
3021372
3021628
3021884
3022140
3022396
3022652
3014717
3014973
3015229
3015485
3015741
3015997
3016253
3016509
3016765
3017021
3017277
3017533
3017789
3018045
3018301
3018557
3018813
3019069
3019325
3019581
3019837
3020093
3020349
3020605
3020861
3021117
3021373
3021629
3021885
3022141
3022397
3022653
3014718
3014974
3015230
3015486
3015742
3015998
3016254
3016510
3016766
3017022
3017278
3017534
3017790
3018046
3018302
3018558
3018814
3019070
3019326
3019582
3019838
3020094
3020350
3020606
3020862
3021118
3021374
3021630
3021886
3022142
3022398
3022654
3014719
3014975
3015231
3015487
3015743
3015999
3016255
3016511
3016767
3017023
3017279
3017535
3017791
3018047
3018303
3018559
3018815
3019071
3019327
3019583
3019839
3020095
3020351
3020607
3020863
3021119
3021375
3021631
3021887
3022143
3022399
3022655
3014720
3014976
3015232
3015488
3015744
3016000
3016256
3016512
3016768
3017024
3017280
3017536
3017792
3018048
3018304
3018560
3018816
3019072
3019328
3019584
3019840
3020096
3020352
3020608
3020864
3021120
3021376
3021632
3021888
3022144
3022400
3022656
3014721
3014977
3015233
3015489
3015745
3016001
3016257
3016513
3016769
3017025
3017281
3017537
3017793
3018049
3018305
3018561
3018817
3019073
3019329
3019585
3019841
3020097
3020353
3020609
3020865
3021121
3021377
3021633
3021889
3022145
3022401
3022657
3014722
3014978
3015234
3015490
3015746
3016002
3016258
3016514
3016770
3017026
3017282
3017538
3017794
3018050
3018306
3018562
3018818
3019074
3019330
3019586
3019842
3020098
3020354
3020610
3020866
3021122
3021378
3021634
3021890
3022146
3022402
3022658
3014723
3014979
3015235
3015491
3015747
3016003
3016259
3016515
3016771
3017027
3017283
3017539
3017795
3018051
3018307
3018563
3018819
3019075
3019331
3019587
3019843
3020099
3020355
3020611
3020867
3021123
3021379
3021635
3021891
3022147
3022403
3022659
3014724
3014980
3015236
3015492
3015748
3016004
3016260
3016516
3016772
3017028
3017284
3017540
3017796
3018052
3018308
3018564
3018820
3019076
3019332
3019588
3019844
3020100
3020356
3020612
3020868
3021124
3021380
3021636
3021892
3022148
3022404
3022660
3014725
3014981
3015237
3015493
3015749
3016005
3016261
3016517
3016773
3017029
3017285
3017541
3017797
3018053
3018309
3018565
3018821
3019077
3019333
3019589
3019845
3020101
3020357
3020613
3020869
3021125
3021381
3021637
3021893
3022149
3022405
3022661
3014726
3014982
3015238
3015494
3015750
3016006
3016262
3016518
3016774
3017030
3017286
3017542
3017798
3018054
3018310
3018566
3018822
3019078
3019334
3019590
3019846
3020102
3020358
3020614
3020870
3021126
3021382
3021638
3021894
3022150
3022406
3022662
3014727
3014983
3015239
3015495
3015751
3016007
3016263
3016519
3016775
3017031
3017287
3017543
3017799
3018055
3018311
3018567
3018823
3019079
3019335
3019591
3019847
3020103
3020359
3020615
3020871
3021127
3021383
3021639
3021895
3022151
3022407
3022663
3014728
3014984
3015240
3015496
3015752
3016008
3016264
3016520
3016776
3017032
3017288
3017544
3017800
3018056
3018312
3018568
3018824
3019080
3019336
3019592
3019848
3020104
3020360
3020616
3020872
3021128
3021384
3021640
3021896
3022152
3022408
3022664
3014729
3014985
3015241
3015497
3015753
3016009
3016265
3016521
3016777
3017033
3017289
3017545
3017801
3018057
3018313
3018569
3018825
3019081
3019337
3019593
3019849
3020105
3020361
3020617
3020873
3021129
3021385
3021641
3021897
3022153
3022409
3022665
3014730
3014986
3015242
3015498
3015754
3016010
3016266
3016522
3016778
3017034
3017290
3017546
3017802
3018058
3018314
3018570
3018826
3019082
3019338
3019594
3019850
3020106
3020362
3020618
3020874
3021130
3021386
3021642
3021898
3022154
3022410
3022666
3014731
3014987
3015243
3015499
3015755
3016011
3016267
3016523
3016779
3017035
3017291
3017547
3017803
3018059
3018315
3018571
3018827
3019083
3019339
3019595
3019851
3020107
3020363
3020619
3020875
3021131
3021387
3021643
3021899
3022155
3022411
3022667
3014732
3014988
3015244
3015500
3015756
3016012
3016268
3016524
3016780
3017036
3017292
3017548
3017804
3018060
3018316
3018572
3018828
3019084
3019340
3019596
3019852
3020108
3020364
3020620
3020876
3021132
3021388
3021644
3021900
3022156
3022412
3022668
3014733
3014989
3015245
3015501
3015757
3016013
3016269
3016525
3016781
3017037
3017293
3017549
3017805
3018061
3018317
3018573
3018829
3019085
3019341
3019597
3019853
3020109
3020365
3020621
3020877
3021133
3021389
3021645
3021901
3022157
3022413
3022669
3014734
3014990
3015246
3015502
3015758
3016014
3016270
3016526
3016782
3017038
3017294
3017550
3017806
3018062
3018318
3018574
3018830
3019086
3019342
3019598
3019854
3020110
3020366
3020622
3020878
3021134
3021390
3021646
3021902
3022158
3022414
3022670
3014735
3014991
3015247
3015503
3015759
3016015
3016271
3016527
3016783
3017039
3017295
3017551
3017807
3018063
3018319
3018575
3018831
3019087
3019343
3019599
3019855
3020111
3020367
3020623
3020879
3021135
3021391
3021647
3021903
3022159
3022415
3022671
3014736
3014992
3015248
3015504
3015760
3016016
3016272
3016528
3016784
3017040
3017296
3017552
3017808
3018064
3018320
3018576
3018832
3019088
3019344
3019600
3019856
3020112
3020368
3020624
3020880
3021136
3021392
3021648
3021904
3022160
3022416
3022672
3014737
3014993
3015249
3015505
3015761
3016017
3016273
3016529
3016785
3017041
3017297
3017553
3017809
3018065
3018321
3018577
3018833
3019089
3019345
3019601
3019857
3020113
3020369
3020625
3020881
3021137
3021393
3021649
3021905
3022161
3022417
3022673
3014738
3014994
3015250
3015506
3015762
3016018
3016274
3016530
3016786
3017042
3017298
3017554
3017810
3018066
3018322
3018578
3018834
3019090
3019346
3019602
3019858
3020114
3020370
3020626
3020882
3021138
3021394
3021650
3021906
3022162
3022418
3022674
3014739
3014995
3015251
3015507
3015763
3016019
3016275
3016531
3016787
3017043
3017299
3017555
3017811
3018067
3018323
3018579
3018835
3019091
3019347
3019603
3019859
3020115
3020371
3020627
3020883
3021139
3021395
3021651
3021907
3022163
3022419
3022675
3014740
3014996
3015252
3015508
3015764
3016020
3016276
3016532
3016788
3017044
3017300
3017556
3017812
3018068
3018324
3018580
3018836
3019092
3019348
3019604
3019860
3020116
3020372
3020628
3020884
3021140
3021396
3021652
3021908
3022164
3022420
3022676
3014741
3014997
3015253
3015509
3015765
3016021
3016277
3016533
3016789
3017045
3017301
3017557
3017813
3018069
3018325
3018581
3018837
3019093
3019349
3019605
3019861
3020117
3020373
3020629
3020885
3021141
3021397
3021653
3021909
3022165
3022421
3022677
3014742
3014998
3015254
3015510
3015766
3016022
3016278
3016534
3016790
3017046
3017302
3017558
3017814
3018070
3018326
3018582
3018838
3019094
3019350
3019606
3019862
3020118
3020374
3020630
3020886
3021142
3021398
3021654
3021910
3022166
3022422
3022678
3014743
3014999
3015255
3015511
3015767
3016023
3016279
3016535
3016791
3017047
3017303
3017559
3017815
3018071
3018327
3018583
3018839
3019095
3019351
3019607
3019863
3020119
3020375
3020631
3020887
3021143
3021399
3021655
3021911
3022167
3022423
3022679
3014744
3015000
3015256
3015512
3015768
3016024
3016280
3016536
3016792
3017048
3017304
3017560
3017816
3018072
3018328
3018584
3018840
3019096
3019352
3019608
3019864
3020120
3020376
3020632
3020888
3021144
3021400
3021656
3021912
3022168
3022424
3022680
3014745
3015001
3015257
3015513
3015769
3016025
3016281
3016537
3016793
3017049
3017305
3017561
3017817
3018073
3018329
3018585
3018841
3019097
3019353
3019609
3019865
3020121
3020377
3020633
3020889
3021145
3021401
3021657
3021913
3022169
3022425
3022681
3014746
3015002
3015258
3015514
3015770
3016026
3016282
3016538
3016794
3017050
3017306
3017562
3017818
3018074
3018330
3018586
3018842
3019098
3019354
3019610
3019866
3020122
3020378
3020634
3020890
3021146
3021402
3021658
3021914
3022170
3022426
3022682
3014747
3015003
3015259
3015515
3015771
3016027
3016283
3016539
3016795
3017051
3017307
3017563
3017819
3018075
3018331
3018587
3018843
3019099
3019355
3019611
3019867
3020123
3020379
3020635
3020891
3021147
3021403
3021659
3021915
3022171
3022427
3022683
3014748
3015004
3015260
3015516
3015772
3016028
3016284
3016540
3016796
3017052
3017308
3017564
3017820
3018076
3018332
3018588
3018844
3019100
3019356
3019612
3019868
3020124
3020380
3020636
3020892
3021148
3021404
3021660
3021916
3022172
3022428
3022684
3014749
3015005
3015261
3015517
3015773
3016029
3016285
3016541
3016797
3017053
3017309
3017565
3017821
3018077
3018333
3018589
3018845
3019101
3019357
3019613
3019869
3020125
3020381
3020637
3020893
3021149
3021405
3021661
3021917
3022173
3022429
3022685
3014750
3015006
3015262
3015518
3015774
3016030
3016286
3016542
3016798
3017054
3017310
3017566
3017822
3018078
3018334
3018590
3018846
3019102
3019358
3019614
3019870
3020126
3020382
3020638
3020894
3021150
3021406
3021662
3021918
3022174
3022430
3022686
3014751
3015007
3015263
3015519
3015775
3016031
3016287
3016543
3016799
3017055
3017311
3017567
3017823
3018079
3018335
3018591
3018847
3019103
3019359
3019615
3019871
3020127
3020383
3020639
3020895
3021151
3021407
3021663
3021919
3022175
3022431
3022687
