0 0 0.8 1.0 1.25
0 1 0.824742608603 0.869974732399 1.39371800423
0 2 0.870967718491 0.85185188055 1.34782612324
1 0 0.687499979511 0.863636374474 1.68421053886
1 1 0.722980352356 0.904007136822 1.5300359726
1 2 0.649999988377 0.923076927662 1.66666662693
2 0 0.758620658471 0.727272748947 1.8125
2 1 0.770055423816 0.893051445484 1.45412433147
2 2 0.649999988377 0.923076927662 1.66666662693
3 0 0.696969689416 0.869565188885 1.64999997616
3 1 0.720133597935 0.920776247978 1.50810933113
3 2 0.692307705005 0.814814805984 1.77272725105
4 0 0.720000027466 0.944444417953 1.47058820724
4 1 0.740370889399 0.88605517149 1.52436828613
4 2 0.8 0.857142865658 1.45833337307
5 0 0.727272727273 0.833333313465 1.64999997616
5 1 0.689658154785 0.909763634205 1.59381377697
5 2 0.634146319338 0.961538434029 1.63999998569
6 0 0.5 1.0 2.0
6 1 0.643645501027 0.907808184624 1.71142995358
6 2 0.843749993714 0.925925910473 1.27999997139
7 0 0.937499951106 0.733333349228 1.45454549789
7 1 0.757209259669 0.8460277915 1.56098759174
7 2 0.682926821326 0.928571403027 1.57692313194
8 0 0.857142886337 0.833333313465 1.39999997616
8 1 0.77566353585 0.868237137794 1.48486948013
8 2 0.968750028871 0.870967745781 1.18518519402
9 0 0.903225848131 0.857142865658 1.29166662693
9 1 0.772507290539 0.87736004591 1.4754332304
9 2 0.749999977648 0.899999976158 1.48148143291
10 0 0.731707312818 0.899999976158 1.51851856709
10 1 0.660729199034 0.909432411194 1.66420209408
10 2 0.837837800046 0.903225779533 1.32142853737
11 0 0.775510222949 0.815789461136 1.58064520359
11 1 0.676445929414 0.912845909595 1.61945700645
11 2 1.08823530747 0.810810804367 1.13333332539
12 0 0.909090889387 0.866666674614 1.26923072338
12 1 0.853916283384 0.837176501751 1.39883875847
12 2 0.709090921386 0.948717951775 1.48648643494
13 0 0.642857131909 0.814814805984 1.90909087658
13 1 0.709987431391 0.911705434322 1.54488015175
13 2 0.701754409447 0.899999976158 1.58333337307
14 0 0.969696969697 0.8125 1.26923072338
14 1 0.731638134004 0.886961519718 1.54098665714
14 2 0.767857128146 0.883720934391 1.4736841917
15 0 1.26470585131 0.604651153088 1.30769228935
15 1 0.699189630606 0.897391676903 1.593760252
15 2 0.746031768618 0.914893627167 1.46511626244
16 0 1.27272730031 0.714285731316 1.10000002384
16 1 0.639073998003 0.92357301712 1.69425046444
16 2 0.9777777985 0.681818187237 1.5
17 0 0.918367351407 0.844444453716 1.28947365284
17 1 0.646468084031 0.923347532749 1.67528116703
17 2 0.872727242462 0.875 1.30952382088
18 0 0.984126999024 0.854838728905 1.18867921829
18 1 1.17404871403 0.67787528038 1.25650453568
18 2 0.964285734813 0.85185188055 1.21739125252
19 0 0.724770663604 0.886075973511 1.55714285374
19 1 0.7602705671 0.882266759872 1.49084305763
19 2 0.794520516806 0.896551728249 1.40384614468
20 0 0.855999973877 0.831775724888 1.40449440479
20 1 0.913154005411 0.813892126083 1.34551680088
20 2 0.726190461762 0.918032765388 1.5
21 0 1.13725487006 0.75 1.17241382599
21 1 0.741354190142 0.890875279903 1.51410961151
21 2 0.835164861422 0.881578922272 1.35820901394
22 0 0.759493638796 0.908333361149 1.44954133034
22 1 0.821290440825 0.864332914352 1.40871191025
22 2 0.877777780103 0.822784781456 1.3846154213
23 0 0.814634150605 0.868263483047 1.41379308701
23 1 0.681758764614 0.916812419891 1.59988510609
23 2 0.7943925331 0.929411768913 1.35443043709
24 0 0.861344563269 0.800000011921 1.45121955872
24 1 0.74210079985 0.870878100395 1.54731857777
24 2 0.854838675161 0.849056601524 1.37777781487
25 0 0.782334401333 0.891129016876 1.43438911438
25 1 0.750578036518 0.903508961201 1.47459125519
25 2 0.826666640388 0.854838728905 1.41509437561
26 0 0.751336889535 0.879003584385 1.51417005062
26 1 0.95500334022 0.782253861427 1.33858931065
26 2 0.761658002391 0.891156435013 1.4732824564
27 0 0.775609747528 0.86163520813 1.4963504076
27 1 0.69011795242 0.897278189659 1.61491465569
27 2 0.803108805314 0.916129052639 1.35915493965
28 0 0.703124982974 0.885714292526 1.60573482513
28 1 0.79659120142 0.838509202003 1.49712026119
28 2 0.876847316386 0.786516845226 1.45000004768
29 0 0.819905246622 0.85549134016 1.42567563057
29 1 0.776065678448 0.876098752022 1.47078251839
29 2 0.780172408582 0.867403328419 1.47770702839
30 0 0.812641097517 0.786111116409 1.56537103653
30 1 0.907050301961 0.789723038673 1.39602696896
30 2 1.06896551504 0.714285731316 1.30967736244
31 0 1.36531366695 0.575675666332 1.2723004818
31 1 0.745291998154 0.831359803677 1.6139292717
31 2 0.734317359324 0.889447212219 1.53107345104
32 0 0.845144363831 0.835403740406 1.4163569212
32 1 0.717283106633 0.905651688576 1.53938829899
32 2 0.673981205579 0.91627907753 1.61928939819
33 0 0.855769260197 0.848314583302 1.37748348713
33 1 35056.0009397 2.85257865471e-05 1.0
33 2 0.88744588882 0.843902468681 1.33526015282
34 0 0.754940687274 0.897905766964 1.47521865368
34 1 0.852483312843 0.867356598377 1.35243499279
34 2 0.821576795997 0.863636374474 1.40935671329
35 0 0.804597729814 0.897142827511 1.38535034657
35 1 1.09347938941 0.731365144253 1.25041770935
35 2 0.717557245379 0.845744669437 1.64779877663
36 0 0.733153612429 0.889705896378 1.53305780888
36 1 1.0 0.0 0.0
36 2 0.988235338468 0.797619044781 1.26865673065
37 0 1.30263157384 0.601010084152 1.27731096745
37 1 0.810916691889 0.880967319012 1.39979350567
37 2 0.876288666255 0.852941155434 1.33793103695
38 0 1.0 0.0 0.0
38 1 1.21269756137 0.688508689404 1.19767248631
38 2 1.0542635542 0.742647051811 1.27722775936
39 0 1.29166670516 0.68951612711 1.12280702591
39 1 0.740207825551 0.910230815411 1.48420810699
39 2 1.14070349162 0.678414106369 1.2922078371
40 0 1.12244899871 0.645454525948 1.38028168678
40 1 0.768920625699 0.884417653084 1.47048664093
40 2 0.857142886337 0.849206328392 1.37383174896
41 0 0.842105263158 0.8125 1.46153843403
41 1 0.816708321808 0.889240682125 1.37693572044
41 2 0.916666639348 0.826839804649 1.31937170029
42 0 0.973782787187 0.776923060417 1.32178223133
42 1 0.661511488355 0.91659450531 1.64924561977
42 2 1.0353982279 0.760683774948 1.26966297626
43 0 0.857142886337 0.802631556988 1.45355188847
43 1 0.820041583692 0.844557106495 1.44389331341
43 2 0.860000030756 0.804651141167 1.44508671761
44 0 1.0 0.0 0.0
44 1 0.584270404816 0.9469140172 1.80748867989
44 2 0.905940630415 0.814207673073 1.35570466518
45 0 1.07377048079 0.717557251453 1.29787230492
45 1 0.75565345549 0.898535609245 1.47279417515
45 2 1.03623188764 0.748251736164 1.2897195816
46 0 0.975806453489 0.719008266926 1.42528736591
46 1 1.2675886139 0.654023528099 1.20622503757
46 2 1.41666663148 0.57647061348 1.22448980808
47 0 1.41935487146 0.596590936184 1.18095242977
47 1 1.08034092666 0.756721615791 1.2232156992
47 2 1.2291667094 0.677966117859 1.20000004768
48 0 0.992673939358 0.701107025146 1.43684208393
48 1 0.982145518642 0.758626878262 1.34213423729
48 2 1.10714289014 0.709677398205 1.27272725105
49 0 0.89812328536 0.791044771671 1.40754711628
49 1 0.690893972428 0.897392392159 1.61289548874
49 2 0.806451606701 0.819999992847 1.51219511032
50 0 0.924151682973 0.792656600475 1.36512255669
50 1 0.871075524811 0.832639217377 1.37875568867
50 2 1.04000002975 0.711538434029 1.35135138035
51 0 0.960573425809 0.74253731966 1.4020100832
51 1 0.719446248361 0.922567009926 1.50662004948
51 2 0.945736388663 0.74590164423 1.41758239269
52 0 1.42584749382 0.542347669601 1.29315066338
52 1 0.747969492047 0.887051999569 1.50718653202
52 2 1.84313727213 0.377659589052 1.43661975861
53 0 1.15198620134 0.587706148624 1.47704076767
53 1 0.956225967131 0.751178205013 1.39218354225
53 2 1.22388060355 0.573170721531 1.42553186417
