3364880
3365136
3365392
3365648
3365904
3366160
3366416
3366672
3364881
3365137
3365393
3365649
3365905
3366161
3366417
3366673
3364882
3365138
3365394
3365650
3365906
3366162
3366418
3366674
3364883
3365139
3365395
3365651
3365907
3366163
3366419
3366675
3364884
3365140
3365396
3365652
3365908
3366164
3366420
3366676
3364885
3365141
3365397
3365653
3365909
3366165
3366421
3366677
3364886
3365142
3365398
3365654
3365910
3366166
3366422
3366678
3364887
3365143
3365399
3365655
3365911
3366167
3366423
3366679
