0 0 1.0 1.0 1.0
0 1 0.805724726061 0.876795172691 1.41551721096
0 2 1.0 0.0 0.0
1 0 1.0 0.0 0.0
1 1 0.726132001715 0.90157777071 1.52750003338
1 2 1.0 0.0 0.0
2 0 1.0 1.0 1.0
2 1 0.766360491846 0.904119849205 1.4432476759
2 2 1.0 1.0 1.0
3 0 1.0 1.0 1.0
3 1 0.57009344016 0.918777942657 1.90916466713
3 2 1.0 1.0 1.0
4 0 1.0 1.0 1.0
4 1 0.705505097637 0.913636386395 1.55140960217
4 2 1.0 0.0 0.0
5 0 1.0 1.0 1.0
5 1 0.629857843249 0.937547028065 1.69341897964
5 2 1.0 0.0 0.0
6 0 1.0 1.0 1.0
6 1 0.581999144271 0.939033448696 1.82977044582
6 2 1.0 0.0 0.0
7 0 1.0 0.0 0.0
7 1 0.644198357551 0.91479820013 1.69689548016
7 2 1.0 0.0 0.0
8 0 0.5 1.0 2.0
8 1 0.656833822204 0.925149679184 1.64563107491
8 2 0.5 1.0 2.0
9 0 0.5 1.0 2.0
9 1 0.711477148676 0.919342815876 1.52883839607
9 2 1.0 0.0 0.0
10 0 0.5 1.0 2.0
10 1 0.638077278124 0.938700139523 1.66955149174
10 2 0.5 1.0 2.0
11 0 0.5 1.0 2.0
11 1 0.740379384276 0.868228375912 1.55564928055
11 2 0.5 1.0 2.0
12 0 1.0 0.0 0.0
12 1 0.56443514284 0.959229052067 1.84698605537
12 2 0.333333333333 1.0 3.0
13 0 0.5 1.0 2.0
13 1 0.669322698991 0.939732134342 1.58986544609
13 2 1.0 1.0 1.0
14 0 0.5 1.0 2.0
14 1 0.684290799248 0.919019341469 1.59013748169
14 2 1.0 0.0 0.0
15 0 0.333333333333 1.0 3.0
15 1 0.84740458727 0.856088578701 1.37844824791
15 2 0.5 1.0 2.0
16 0 1.0 0.0 0.0
16 1 0.621072066828 0.948660731316 1.69725489616
16 2 1.0 0.0 0.0
17 0 0.5 1.0 2.0
17 1 0.626337852674 0.939078748226 1.70015823841
17 2 1.0 1.0 1.0
18 0 1.0 1.0 1.0
18 1 0.608851145305 0.926578581333 1.77258324623
18 2 1.0 1.0 1.0
19 0 0.5 1.0 2.0
19 1 0.689428428988 0.922230362892 1.57279241085
19 2 0.5 1.0 2.0
20 0 1.0 1.0 1.0
20 1 0.670804379936 0.930421888828 1.60222756863
20 2 0.5 1.0 2.0
21 0 1.0 0.0 0.0
21 1 0.616894960581 0.961510002613 1.68591225147
21 2 1.0 1.0 1.0
22 0 1.0 1.0 1.0
22 1 0.72813991703 0.888646304607 1.54545450211
22 2 1.0 1.0 1.0
23 0 0.5 1.0 2.0
23 1 0.649659843926 0.943904280663 1.63074481487
23 2 0.5 1.0 2.0
24 0 1.0 1.0 1.0
24 1 0.695697232084 0.896423220634 1.6034913063
24 2 1.0 1.0 1.0
25 0 0.4 1.0 2.5
25 1 0.724629733961 0.942467808723 1.46425700188
25 2 1.0 1.0 1.0
26 0 1.0 1.0 1.0
26 1 1.03984674652 0.762711882591 1.26086962223
26 2 0.5 1.0 2.0
27 0 0.333333333333 1.0 3.0
27 1 0.714978419666 0.889977395535 1.5715495348
27 2 1.0 1.0 1.0
28 0 1.0 1.0 1.0
28 1 0.783424067774 0.861003875732 1.48251116276
28 2 1.0 1.0 1.0
29 0 1.0 1.0 1.0
29 1 0.654838687014 0.95073890686 1.60621762276
29 2 2.0 0.5 1.0
30 0 1.0 1.0 1.0
30 1 0.519049557225 0.958168923855 2.01070833206
30 2 1.4999999553 0.333333343267 2.0
31 0 1.0 1.0 1.0
31 1 0.387851851331 0.963330805302 2.67644715309
31 2 0.749999977648 1.0 1.33333337307
32 0 1.0 1.0 1.0
32 1 0.99009901925 0.678461551666 1.48866212368
32 2 0.77777778808 0.857142865658 1.5
33 0 1.0 1.0 1.0
33 1 0.564414407322 0.970470845699 1.82565784454
33 2 1.0 0.75 1.33333337307
34 0 0.5 1.0 2.0
34 1 0.734420479356 0.923076927662 1.47508585453
34 2 0.727272727273 1.0 1.375
35 0 0.5 1.0 2.0
35 1 0.737034799175 0.909768223763 1.49135577679
35 2 0.642857131909 0.888888895512 1.75
36 0 1.0 1.0 1.0
36 1 0.567010313459 0.960474312305 1.83621394634
36 2 0.899999957085 0.888888895512 1.25
37 0 0.5 1.0 2.0
37 1 0.753790153849 0.894609808922 1.48291361332
37 2 0.916666639348 0.818181812763 1.33333337307
38 0 1.0 0.5 2.0
38 1 2.20236084214 0.386676877737 1.17425739765
38 2 0.909090889387 0.899999976158 1.22222220898
39 0 1.0 1.0 1.0
39 1 0.687675877287 0.936170220375 1.55332171917
39 2 1.09999996722 0.681818187237 1.33333337307
40 0 1.0 1.0 1.0
40 1 0.855143414731 0.87234044075 1.34052526951
40 2 1.05555553109 0.789473712444 1.20000004768
41 0 1.4999999553 0.666666686535 1.0
41 1 0.663400570398 0.956559538841 1.57584011555
41 2 12.9999995157 0.0769230797887 1.0
42 0 1.0 0.0 0.0
42 1 0.65760000138 0.923763155937 1.64618086815
42 2 0.840000008011 0.904761910439 1.31578946114
43 0 1.24999998137 0.800000011921 1.0
43 1 0.734413985282 0.887945652008 1.53346085548
43 2 0.944444394406 0.882352948189 1.20000004768
44 0 1.20000002861 0.666666686535 1.25
44 1 0.809458514591 0.841659605503 1.4678068161
44 2 0.899999957085 0.777777791023 1.42857146263
45 0 0.370370363829 0.800000011921 3.375
45 1 0.696256011081 0.923677384853 1.55492961407
45 2 1.0 0.785714268684 1.27272725105
46 0 0.888888888889 0.875 1.28571426868
46 1 0.649049866211 0.917657852173 1.67896306515
46 2 9.99999985099 0.10000000149 1.0
47 0 2.0 0.375 1.33333337307
47 1 1.03421310692 0.776937603951 1.2445255518
47 2 3.83333337141 0.217391297221 1.20000004768
48 0 2.33333331015 0.428571432829 1.0
48 1 0.554229925322 0.934442281723 1.93089008331
48 2 0.8 0.75 1.66666662693
49 0 0.615384615385 0.875 1.85714280605
49 1 1.0963114564 0.689719617367 1.32249319553
49 2 0.857142886337 1.0 1.16666662693
50 0 0.749999977648 0.666666686535 2.0
50 1 0.888888888889 0.807954549789 1.39240503311
50 2 0.857142886337 0.916666686535 1.27272725105
51 0 1.0 1.0 1.0
51 1 0.692567541907 0.931707322598 1.54973816872
51 2 0.600000014305 0.916666686535 1.81818187237
52 0 6.99999968708 0.142857149243 1.0
52 1 0.626231993029 0.899515748024 1.77523553371
52 2 2.22222228109 0.300000011921 1.5
53 0 1.0 0.0 0.0
53 1 1.0 0.0 0.0
53 2 1.0 0.0 0.0
