0 0 0.71428572645 0.933333337307 1.5
0 1 0.791781398846 0.875595629215 1.44241797924
0 2 0.944444394406 0.941176474094 1.125
1 0 1.0 0.823529422283 1.21428573132
1 1 0.709679657172 0.90231347084 1.56163752079
1 2 0.720000027466 0.833333313465 1.66666662693
2 0 0.882352947364 0.866666674614 1.30769228935
2 1 0.746506654578 0.902380883694 1.48448717594
2 2 0.749999977648 0.809523820877 1.64705884457
3 0 0.666666666667 1.0 1.5
3 1 0.698627065789 0.929517269135 1.53991639614
3 2 0.809523818715 1.0 1.23529410362
4 0 0.703703731666 0.89473682642 1.58823525906
4 1 0.703509509941 0.901003539562 1.57762420177
4 2 0.571428571429 0.899999976158 1.94444441795
5 0 0.888888888889 0.875 1.28571426868
5 1 0.671964074797 0.918631672859 1.61999082565
5 2 0.84615388495 0.863636374474 1.36842107773
6 0 0.761904761905 0.875 1.5
6 1 0.61515094672 0.920843422413 1.76535701752
6 2 0.702702729871 0.884615361691 1.60869562626
7 0 0.708333315742 0.941176474094 1.5
7 1 0.706152620105 0.875375986099 1.6177328825
7 2 0.696969689416 0.913043498993 1.57142853737
8 0 0.761904761905 0.875 1.5
8 1 5.37002413151 0.122889004648 1.51534223557
8 2 0.677419367864 0.952380955219 1.54999995232
9 0 0.593749995576 0.947368443012 1.77777779102
9 1 0.729321711285 0.899669408798 1.52404534817
9 2 0.622222242002 1.0 1.60714280605
10 0 0.761904761905 0.875 1.5
10 1 0.650581125844 0.921023845673 1.66888988018
10 2 0.842105263158 0.875 1.35714280605
11 0 0.624999990687 0.933333337307 1.71428573132
11 1 0.662006597963 0.919396460056 1.64298975468
11 2 0.731707312818 0.933333337307 1.46428573132
12 0 0.749999977648 0.866666674614 1.53846156597
12 1 0.802741448524 0.864287793636 1.4413383007
12 2 0.870967718491 0.925925910473 1.24000000954
13 0 0.736842133002 0.785714268684 1.72727274895
13 1 0.693285076872 0.921534061432 1.56522500515
13 2 0.806451606701 0.920000016689 1.34782612324
14 0 0.666666666667 0.916666686535 1.63636362553
14 1 0.706041418094 0.903772473335 1.56715047359
14 2 0.615384615385 0.875 1.85714280605
15 0 0.928571381131 0.769230782986 1.39999997616
15 1 0.678610741481 0.907960951328 1.62297606468
15 2 1.0 0.807692289352 1.23809528351
16 0 1.23076923077 0.625 1.29999995232
16 1 0.633414512945 0.927135825157 1.70281946659
16 2 0.928571381131 0.846153855324 1.27272725105
17 0 0.866666673554 0.846153855324 1.36363637447
17 1 0.642607159694 0.928413033485 1.67615127563
17 2 0.843749993714 0.85185188055 1.39130437374
18 0 0.83333330022 0.850000023842 1.41176474094
18 1 1.01038563328 0.764705896378 1.29425060749
18 2 0.823529400215 0.928571403027 1.30769228935
19 0 0.880000008392 0.863636374474 1.31578946114
19 1 0.73981333326 0.892934918404 1.51376342773
19 2 0.775000023097 0.93548387289 1.37931036949
20 0 0.666666666667 1.0 1.5
20 1 0.857691415017 0.84696406126 1.37658786774
20 2 0.702127682726 0.969696998596 1.46875
21 0 0.742857137797 1.0 1.34615385532
21 1 0.73795952091 0.903151929379 1.50039863586
21 2 0.853658544032 0.914285719395 1.28125
22 0 0.764705893078 0.923076927662 1.41666662693
22 1 0.794752437116 0.888506352901 1.41614460945
22 2 0.897435902922 0.800000011921 1.39285719395
23 0 0.697674445683 0.933333337307 1.53571426868
23 1 0.682664222231 0.924081623554 1.58519434929
23 2 0.794871799731 0.838709652424 1.5
24 0 1.12121211514 0.675675690174 1.32000005245
24 1 0.735810082832 0.873919188976 1.55511665344
24 2 0.794871799731 0.870967745781 1.44444441795
25 0 0.57500001885 0.978260874748 1.77777779102
25 1 0.783114628544 0.893334209919 1.42942273617
25 2 0.868421071702 0.878787875175 1.31034481525
26 0 0.71428572645 0.939999997616 1.48936164379
26 1 0.952817377184 0.79717862606 1.31654179096
26 2 0.627450980392 0.90625 1.75862073898
27 0 0.756097532397 0.903225779533 1.46428573132
27 1 0.698474250791 0.904777765274 1.5823687315
27 2 0.749999977648 0.833333313465 1.60000002384
28 0 0.617391303068 0.929577469826 1.74242424965
28 1 0.748817181341 0.870925664902 1.53335630894
28 2 0.795454517438 0.942857146263 1.33333337307
29 0 0.862745122239 0.818181812763 1.41666662693
29 1 0.750170604941 0.899343073368 1.48222649097
29 2 0.83333330022 0.914285719395 1.3125
30 0 0.991452942965 0.681034505367 1.48101270199
30 1 0.890622440296 0.807044327259 1.39126217365
30 2 1.02439027369 0.809523820877 1.20588231087
31 0 1.02816902962 0.739726006985 1.31481480598
31 1 0.725676587277 0.849683821201 1.62180829048
31 2 0.754385944402 0.860465109348 1.54054057598
32 0 0.887700576636 0.801204800606 1.40601503849
32 1 0.741349407348 0.89830082655 1.50160336494
32 2 0.672413779283 0.923076927662 1.61111116409
33 0 0.891191663606 0.848837196827 1.32191777229
33 1 1.0 0.0 0.0
33 2 0.893617003144 0.785714268684 1.42424237728
34 0 0.72631577398 0.932367146015 1.47668397427
34 1 0.797345795156 0.880562901497 1.42427194118
34 2 0.940000006723 0.808510661125 1.31578946114
35 0 0.864628813759 0.868686854839 1.33139538765
35 1 1.01194675312 0.765226721764 1.29137444496
35 2 0.816901427653 0.86206895113 1.41999995708
36 0 0.830769191155 0.837962985039 1.43646407127
36 1 1.0 0.0 0.0
36 2 0.893939353574 0.898305058479 1.24528300762
37 0 1.13983047134 0.706319689751 1.24210524559
37 1 0.81002910988 0.880054593086 1.40278065205
37 2 0.913043482993 0.833333313465 1.31428575516
38 0 177.50000624 0.00563380261883 1.0
38 1 1.04540053055 0.767329990864 1.24662292004
38 2 1.01162793362 0.8045976758 1.22857141495
39 0 1.13286711965 0.725925922394 1.21598637104
39 1 0.758411263453 0.894050836563 1.47479951382
39 2 1.04177548497 0.754385948181 1.27242529392
40 0 0.944606365406 0.787037014961 1.34509801865
40 1 0.802743599426 0.87311154604 1.42676818371
40 2 0.740166874886 0.901771306992 1.49821424484
41 0 0.868592729118 0.880901277065 1.30694270134
41 1 0.818995810908 0.887196838856 1.37625312805
41 2 0.864801828035 0.857142865658 1.34905660152
42 0 0.922868707898 0.848240494728 1.27744162083
42 1 0.747245777583 0.887933731079 1.50714826584
42 2 0.924708417731 0.842889904976 1.28299319744
43 0 0.786124134136 0.858659565449 1.48145282269
43 1 0.859263848223 0.836697161198 1.39092957973
43 2 0.798399965584 0.880761504173 1.42207050323
44 0 1039.00000169 0.000481231953017 2.0
44 1 0.661315612074 0.915696918964 1.65135133266
44 2 0.864031595638 0.854528844357 1.35438966751
45 0 0.831358866992 0.857502102852 1.40273702145
45 1 0.808884666691 0.872224807739 1.41737556458
45 2 0.907679026928 0.824144482613 1.33679354191
46 0 0.923234356973 0.77937912941 1.38975822926
46 1 1.05860275448 0.748363792896 1.2622756958
46 2 1.27132867557 0.668866872787 1.17598688602
47 0 1.41290326112 0.582191765308 1.21568632126
47 1 1.09691491503 0.73731058836 1.2364500761
47 2 0.995260634268 0.792063474655 1.26853704453
48 0 0.659620997042 0.718232035637 2.11076927185
48 1 0.98372803322 0.750701546669 1.35412156582
48 2 0.958441523423 0.764227628708 1.36524820328
49 0 0.832752642641 0.757322192192 1.58563530445
49 1 0.750316611913 0.825898230076 1.613722682
49 2 0.846743302754 0.769230782986 1.53529417515
50 0 0.879411797081 0.826086938381 1.37651824951
50 1 0.939122346973 0.783810436726 1.35852229595
50 2 0.927835081194 0.783333361149 1.37588655949
51 0 1.40935669076 0.450207471848 1.57603681087
51 1 1.08121678598 0.623326957226 1.48378610611
51 2 1.69398914718 0.412903219461 1.4296875
52 0 14.4150938533 0.054973822087 1.26190471649
52 1 1.46664139685 0.454380989075 1.50056886673
52 2 3.84297535048 0.182795703411 1.42352938652
53 0 5.48529399745 0.111260056496 1.63855421543
53 1 3.08564433354 0.234469994903 1.38218712807
53 2 5.04123720711 0.128834351897 1.53968250751
