140849
140594
601135
863040
1188394
1259564
1387567
1522735
1583136
1584160
1583394
1584162
1583139
1583651
1583907
1584419
1583396
1584676
1583398
1583654
1583911
1585707
1653808
1779751
1910309
2307100
2368303
2368304
2628155
2703152
2703154
2765851
2766108
2762035
2764349
2763070
2764606
2762822
2901296
2961432
2958127
2958383
3030312
3029039
3029040
3090737
3089202
3090738
3097394
3090740
3089205
3090485
3090997
3097141
3089462
3089974
3090742
3092022
3092534
3089719
3089975
3090231
3092535
3090232
3090488
3089465
3090233
3094329
3091258
3089468
3090239
3091007
3091263
3089216
3090240
3090496
3089217
3089473
3097665
3089730
3091267
3091523
3089732
3090500
3092550
