0 0 3.02190932606 0.283476918936 1.16734933853
0 1 13.9999993742 0.0714285746217 1.0
0 2 1.0 0.0 0.0
1 0 0.718920983644 0.910229623318 1.52815651894
1 1 1.0 0.0 0.0
1 2 1.0 0.0 0.0
2 0 0.683855176689 0.941274642944 1.55352950096
2 1 1.0 0.0 0.0
2 2 1.0 0.0 0.0
3 0 0.694834584119 0.914135277271 1.57437467575
3 1 1.0 0.0 0.0
3 2 1.0 0.0 0.0
4 0 0.626640666599 0.918293297291 1.73780083656
4 1 5.49999983609 0.0909090936184 2.0
4 2 1.0 0.0 0.0
5 0 0.692244461435 0.920828402042 1.56877911091
5 1 8.99999993294 0.111111111939 1.0
5 2 1.0 0.0 0.0
6 0 5.03763192011 0.162563949823 1.22109460831
6 1 1.0 0.0 0.0
6 2 1.0 0.0 0.0
7 0 0.727307407992 0.863336503506 1.59258234501
7 1 29.000000108 0.0344827584922 1.0
7 2 1.0 0.0 0.0
8 0 0.720470308992 0.78719419241 1.76320183277
8 1 2.33333331015 0.285714298487 1.5
8 2 1.0 0.0 0.0
9 0 0.642062533797 0.938839614391 1.6589422226
9 1 1.0 0.0 0.0
9 2 1.0 0.0 0.0
10 0 0.632175458931 0.931598782539 1.69798338413
10 1 2.99999991059 0.333333343267 1.0
10 2 1.0 0.0 0.0
11 0 0.569178812803 0.954909324646 1.8398784399
11 1 1.0 0.0 0.0
11 2 1.0 0.0 0.0
12 0 6.97398051222 0.124334640801 1.15325975418
12 1 1.0 0.0 0.0
12 2 1.0 0.0 0.0
13 0 0.583674429016 0.938907146454 1.82476401329
13 1 1.0 0.0 0.0
13 2 1.0 0.0 0.0
14 0 0.666878396606 0.933600366116 1.60617315769
14 1 1.0 0.0 0.0
14 2 1.0 0.0 0.0
15 0 1.06723649674 0.639603674412 1.46496880054
15 1 1.0 0.0 0.0
15 2 1.0 0.0 0.0
16 0 0.665628938446 0.919587373734 1.63370943069
16 1 1.0 0.0 0.0
16 2 1.0 0.0 0.0
17 0 0.692937285213 0.904140233994 1.59613740444
17 1 1.0 0.0 0.0
17 2 1.0 0.0 0.0
18 0 1.98519330152 0.402439415455 1.25168979168
18 1 1.0 0.0 0.0
18 2 1.0 0.0 0.0
19 0 0.634319330471 0.929964542389 1.69521856308
19 1 1.0 0.0 0.0
19 2 1.0 0.0 0.0
20 0 0.901630513058 0.792265295982 1.39991211891
20 1 1.0 0.0 0.0
20 2 1.0 0.0 0.0
21 0 0.620898392916 0.922640621662 1.7456086874
21 1 1.0 0.0 0.0
21 2 1.0 0.0 0.0
22 0 0.685931259591 0.944271922112 1.54391121864
22 1 1.0 0.0 0.0
22 2 1.0 0.0 0.0
23 0 0.631205159314 0.949338972569 1.66881477833
23 1 1.0 0.0 0.0
23 2 1.0 0.0 0.0
24 0 0.716756768857 0.851015210152 1.6394225359
24 1 1.0 0.0 0.0
24 2 1.0 0.0 0.0
25 0 19.3074639817 0.0454155653715 1.14043366909
25 1 1.0 0.0 0.0
25 2 1.0 0.0 0.0
26 0 1.05754243967 0.479442477226 1.97226691246
26 1 1.0 0.0 0.0
26 2 1.0 0.0 0.0
27 0 0.647117542526 0.870781838894 1.7746284008
27 1 1.0 0.0 0.0
27 2 1.0 0.0 0.0
28 0 0.733650158373 0.815607309341 1.67120552063
28 1 1.0 0.0 0.0
28 2 1.0 0.0 0.0
29 0 0.662781391067 0.945442438126 1.59585928917
29 1 1.0 0.0 0.0
29 2 1.0 0.0 0.0
30 0 0.626588195943 0.869853615761 1.83472764492
30 1 1.0 0.0 0.0
30 2 1.0 0.0 0.0
31 0 1.191498984 0.501624107361 1.67312312126
31 1 8.0 0.125 1.0
31 2 1.0 0.0 0.0
32 0 1948.76713269 0.000449880491942 1.140625
32 1 1.0 0.0 0.0
32 2 1.0 0.0 0.0
33 0 0.461533823003 0.611274778843 3.54454088211
33 1 13.9999993742 0.0714285746217 1.0
33 2 1.0 0.0 0.0
34 0 0.58216377534 0.94815993309 1.81164550781
34 1 2.49999996275 0.40000000596 1.0
34 2 1.0 0.0 0.0
35 0 0.599246039105 0.965095639229 1.72911739349
35 1 1.0 1.0 1.0
35 2 1.0 0.0 0.0
36 0 0.93523405022 0.709129214287 1.50783669949
36 1 2.0 0.5 1.0
36 2 1.0 0.0 0.0
37 0 0.749025926134 0.902161240578 1.47985446453
37 1 6.99999968708 0.142857149243 1.0
37 2 1.0 0.0 0.0
38 0 1.0 0.0 0.0
38 1 1.0 0.0 0.0
38 2 1.0 0.0 0.0
39 0 0.9705003395 0.80768185854 1.27574527264
39 1 2.0 0.5 1.0
39 2 1.0 0.0 0.0
40 0 0.644293157639 0.933928489685 1.66189229488
40 1 1.0 0.0 0.0
40 2 1.0 0.0 0.0
41 0 0.746264322824 0.904780328274 1.48103106022
41 1 1.0 0.0 0.0
41 2 1.0 0.0 0.0
42 0 1.18370419361 0.684284031391 1.23458325863
42 1 1.0 0.0 0.0
42 2 1.0 0.0 0.0
43 0 0.658046887698 0.934634804726 1.62592768669
43 1 1.0 0.0 0.0
43 2 1.0 0.0 0.0
44 0 0.681904185912 0.894926667213 1.63866126537
44 1 1.0 0.0 0.0
44 2 1.0 0.0 0.0
45 0 0.652273979692 0.931293487549 1.64620304108
45 1 1.0 0.0 0.0
45 2 1.0 0.0 0.0
46 0 0.971706373656 0.687306404114 1.49731969833
46 1 1.0 0.0 0.0
46 2 1.0 0.0 0.0
47 0 1.47040945341 0.508006215096 1.33872902393
47 1 1.0 0.0 0.0
47 2 1.0 0.0 0.0
48 0 0.625443288454 0.921862244606 1.73438704014
48 1 1.0 0.0 0.0
48 2 1.0 0.0 0.0
49 0 0.593958138899 0.923061192036 1.8239531517
49 1 1.0 0.0 0.0
49 2 1.0 0.0 0.0
50 0 0.66285444991 0.897864460945 1.68023884296
50 1 1.0 0.0 0.0
50 2 1.0 0.0 0.0
51 0 0.698839500664 0.865592300892 1.65313827991
51 1 1.0 0.0 0.0
51 2 1.0 0.0 0.0
52 0 0.704630281551 0.876867473125 1.61847031116
52 1 1.0 0.0 0.0
52 2 1.0 0.0 0.0
53 0 1.0 0.0 0.0
53 1 1.0 0.0 0.0
53 2 1.0 0.0 0.0
