2441216
2441472
2441728
2441984
2442240
2442496
2442752
2443008
2443264
2443520
2443776
2444032
2444288
2444544
2444800
2445056
2445312
2445568
2445824
2446080
2446336
2446592
2446848
2447104
2447360
2447616
2447872
2448128
2448384
2448640
2448896
2449152
2441217
2441473
2441729
2441985
2442241
2442497
2442753
2443009
2443265
2443521
2443777
2444033
2444289
2444545
2444801
2445057
2445313
2445569
2445825
2446081
2446337
2446593
2446849
2447105
2447361
2447617
2447873
2448129
2448385
2448641
2448897
2449153
2441218
2441474
2441730
2441986
2442242
2442498
2442754
2443010
2443266
2443522
2443778
2444034
2444290
2444546
2444802
2445058
2445314
2445570
2445826
2446082
2446338
2446594
2446850
2447106
2447362
2447618
2447874
2448130
2448386
2448642
2448898
2449154
2441219
2441475
2441731
2441987
2442243
2442499
2442755
2443011
2443267
2443523
2443779
2444035
2444291
2444547
2444803
2445059
2445315
2445571
2445827
2446083
2446339
2446595
2446851
2447107
2447363
2447619
2447875
2448131
2448387
2448643
2448899
2449155
2441220
2441476
2441732
2441988
2442244
2442500
2442756
2443012
2443268
2443524
2443780
2444036
2444292
2444548
2444804
2445060
2445316
2445572
2445828
2446084
2446340
2446596
2446852
2447108
2447364
2447620
2447876
2448132
2448388
2448644
2448900
2449156
2441221
2441477
2441733
2441989
2442245
2442501
2442757
2443013
2443269
2443525
2443781
2444037
2444293
2444549
2444805
2445061
2445317
2445573
2445829
2446085
2446341
2446597
2446853
2447109
2447365
2447621
2447877
2448133
2448389
2448645
2448901
2449157
2441222
2441478
2441734
2441990
2442246
2442502
2442758
2443014
2443270
2443526
2443782
2444038
2444294
2444550
2444806
2445062
2445318
2445574
2445830
2446086
2446342
2446598
2446854
2447110
2447366
2447622
2447878
2448134
2448390
2448646
2448902
2449158
2441223
2441479
2441735
2441991
2442247
2442503
2442759
2443015
2443271
2443527
2443783
2444039
2444295
2444551
2444807
2445063
2445319
2445575
2445831
2446087
2446343
2446599
2446855
2447111
2447367
2447623
2447879
2448135
2448391
2448647
2448903
2449159
2441224
2441480
2441736
2441992
2442248
2442504
2442760
2443016
2443272
2443528
2443784
2444040
2444296
2444552
2444808
2445064
2445320
2445576
2445832
2446088
2446344
2446600
2446856
2447112
2447368
2447624
2447880
2448136
2448392
2448648
2448904
2449160
2441225
2441481
2441737
2441993
2442249
2442505
2442761
2443017
2443273
2443529
2443785
2444041
2444297
2444553
2444809
2445065
2445321
2445577
2445833
2446089
2446345
2446601
2446857
2447113
2447369
2447625
2447881
2448137
2448393
2448649
2448905
2449161
2441226
2441482
2441738
2441994
2442250
2442506
2442762
2443018
2443274
2443530
2443786
2444042
2444298
2444554
2444810
2445066
2445322
2445578
2445834
2446090
2446346
2446602
2446858
2447114
2447370
2447626
2447882
2448138
2448394
2448650
2448906
2449162
2441227
2441483
2441739
2441995
2442251
2442507
2442763
2443019
2443275
2443531
2443787
2444043
2444299
2444555
2444811
2445067
2445323
2445579
2445835
2446091
2446347
2446603
2446859
2447115
2447371
2447627
2447883
2448139
2448395
2448651
2448907
2449163
2441228
2441484
2441740
2441996
2442252
2442508
2442764
2443020
2443276
2443532
2443788
2444044
2444300
2444556
2444812
2445068
2445324
2445580
2445836
2446092
2446348
2446604
2446860
2447116
2447372
2447628
2447884
2448140
2448396
2448652
2448908
2449164
2441229
2441485
2441741
2441997
2442253
2442509
2442765
2443021
2443277
2443533
2443789
2444045
2444301
2444557
2444813
2445069
2445325
2445581
2445837
2446093
2446349
2446605
2446861
2447117
2447373
2447629
2447885
2448141
2448397
2448653
2448909
2449165
2441230
2441486
2441742
2441998
2442254
2442510
2442766
2443022
2443278
2443534
2443790
2444046
2444302
2444558
2444814
2445070
2445326
2445582
2445838
2446094
2446350
2446606
2446862
2447118
2447374
2447630
2447886
2448142
2448398
2448654
2448910
2449166
2441231
2441487
2441743
2441999
2442255
2442511
2442767
2443023
2443279
2443535
2443791
2444047
2444303
2444559
2444815
2445071
2445327
2445583
2445839
2446095
2446351
2446607
2446863
2447119
2447375
2447631
2447887
2448143
2448399
2448655
2448911
2449167
2441232
2441488
2441744
2442000
2442256
2442512
2442768
2443024
2443280
2443536
2443792
2444048
2444304
2444560
2444816
2445072
2445328
2445584
2445840
2446096
2446352
2446608
2446864
2447120
2447376
2447632
2447888
2448144
2448400
2448656
2448912
2449168
2441233
2441489
2441745
2442001
2442257
2442513
2442769
2443025
2443281
2443537
2443793
2444049
2444305
2444561
2444817
2445073
2445329
2445585
2445841
2446097
2446353
2446609
2446865
2447121
2447377
2447633
2447889
2448145
2448401
2448657
2448913
2449169
2441234
2441490
2441746
2442002
2442258
2442514
2442770
2443026
2443282
2443538
2443794
2444050
2444306
2444562
2444818
2445074
2445330
2445586
2445842
2446098
2446354
2446610
2446866
2447122
2447378
2447634
2447890
2448146
2448402
2448658
2448914
2449170
2441235
2441491
2441747
2442003
2442259
2442515
2442771
2443027
2443283
2443539
2443795
2444051
2444307
2444563
2444819
2445075
2445331
2445587
2445843
2446099
2446355
2446611
2446867
2447123
2447379
2447635
2447891
2448147
2448403
2448659
2448915
2449171
2441236
2441492
2441748
2442004
2442260
2442516
2442772
2443028
2443284
2443540
2443796
2444052
2444308
2444564
2444820
2445076
2445332
2445588
2445844
2446100
2446356
2446612
2446868
2447124
2447380
2447636
2447892
2448148
2448404
2448660
2448916
2449172
2441237
2441493
2441749
2442005
2442261
2442517
2442773
2443029
2443285
2443541
2443797
2444053
2444309
2444565
2444821
2445077
2445333
2445589
2445845
2446101
2446357
2446613
2446869
2447125
2447381
2447637
2447893
2448149
2448405
2448661
2448917
2449173
2441238
2441494
2441750
2442006
2442262
2442518
2442774
2443030
2443286
2443542
2443798
2444054
2444310
2444566
2444822
2445078
2445334
2445590
2445846
2446102
2446358
2446614
2446870
2447126
2447382
2447638
2447894
2448150
2448406
2448662
2448918
2449174
2441239
2441495
2441751
2442007
2442263
2442519
2442775
2443031
2443287
2443543
2443799
2444055
2444311
2444567
2444823
2445079
2445335
2445591
2445847
2446103
2446359
2446615
2446871
2447127
2447383
2447639
2447895
2448151
2448407
2448663
2448919
2449175
2441240
2441496
2441752
2442008
2442264
2442520
2442776
2443032
2443288
2443544
2443800
2444056
2444312
2444568
2444824
2445080
2445336
2445592
2445848
2446104
2446360
2446616
2446872
2447128
2447384
2447640
2447896
2448152
2448408
2448664
2448920
2449176
2441241
2441497
2441753
2442009
2442265
2442521
2442777
2443033
2443289
2443545
2443801
2444057
2444313
2444569
2444825
2445081
2445337
2445593
2445849
2446105
2446361
2446617
2446873
2447129
2447385
2447641
2447897
2448153
2448409
2448665
2448921
2449177
2441242
2441498
2441754
2442010
2442266
2442522
2442778
2443034
2443290
2443546
2443802
2444058
2444314
2444570
2444826
2445082
2445338
2445594
2445850
2446106
2446362
2446618
2446874
2447130
2447386
2447642
2447898
2448154
2448410
2448666
2448922
2449178
2441243
2441499
2441755
2442011
2442267
2442523
2442779
2443035
2443291
2443547
2443803
2444059
2444315
2444571
2444827
2445083
2445339
2445595
2445851
2446107
2446363
2446619
2446875
2447131
2447387
2447643
2447899
2448155
2448411
2448667
2448923
2449179
2441244
2441500
2441756
2442012
2442268
2442524
2442780
2443036
2443292
2443548
2443804
2444060
2444316
2444572
2444828
2445084
2445340
2445596
2445852
2446108
2446364
2446620
2446876
2447132
2447388
2447644
2447900
2448156
2448412
2448668
2448924
2449180
2441245
2441501
2441757
2442013
2442269
2442525
2442781
2443037
2443293
2443549
2443805
2444061
2444317
2444573
2444829
2445085
2445341
2445597
2445853
2446109
2446365
2446621
2446877
2447133
2447389
2447645
2447901
2448157
2448413
2448669
2448925
2449181
2441246
2441502
2441758
2442014
2442270
2442526
2442782
2443038
2443294
2443550
2443806
2444062
2444318
2444574
2444830
2445086
2445342
2445598
2445854
2446110
2446366
2446622
2446878
2447134
2447390
2447646
2447902
2448158
2448414
2448670
2448926
2449182
2441247
2441503
2441759
2442015
2442271
2442527
2442783
2443039
2443295
2443551
2443807
2444063
2444319
2444575
2444831
2445087
2445343
2445599
2445855
2446111
2446367
2446623
2446879
2447135
2447391
2447647
2447903
2448159
2448415
2448671
2448927
2449183
2441248
2441504
2441760
2442016
2442272
2442528
2442784
2443040
2443296
2443552
2443808
2444064
2444320
2444576
2444832
2445088
2445344
2445600
2445856
2446112
2446368
2446624
2446880
2447136
2447392
2447648
2447904
2448160
2448416
2448672
2448928
2449184
2441249
2441505
2441761
2442017
2442273
2442529
2442785
2443041
2443297
2443553
2443809
2444065
2444321
2444577
2444833
2445089
2445345
2445601
2445857
2446113
2446369
2446625
2446881
2447137
2447393
2447649
2447905
2448161
2448417
2448673
2448929
2449185
2441250
2441506
2441762
2442018
2442274
2442530
2442786
2443042
2443298
2443554
2443810
2444066
2444322
2444578
2444834
2445090
2445346
2445602
2445858
2446114
2446370
2446626
2446882
2447138
2447394
2447650
2447906
2448162
2448418
2448674
2448930
2449186
2441251
2441507
2441763
2442019
2442275
2442531
2442787
2443043
2443299
2443555
2443811
2444067
2444323
2444579
2444835
2445091
2445347
2445603
2445859
2446115
2446371
2446627
2446883
2447139
2447395
2447651
2447907
2448163
2448419
2448675
2448931
2449187
2441252
2441508
2441764
2442020
2442276
2442532
2442788
2443044
2443300
2443556
2443812
2444068
2444324
2444580
2444836
2445092
2445348
2445604
2445860
2446116
2446372
2446628
2446884
2447140
2447396
2447652
2447908
2448164
2448420
2448676
2448932
2449188
2441253
2441509
2441765
2442021
2442277
2442533
2442789
2443045
2443301
2443557
2443813
2444069
2444325
2444581
2444837
2445093
2445349
2445605
2445861
2446117
2446373
2446629
2446885
2447141
2447397
2447653
2447909
2448165
2448421
2448677
2448933
2449189
2441254
2441510
2441766
2442022
2442278
2442534
2442790
2443046
2443302
2443558
2443814
2444070
2444326
2444582
2444838
2445094
2445350
2445606
2445862
2446118
2446374
2446630
2446886
2447142
2447398
2447654
2447910
2448166
2448422
2448678
2448934
2449190
2441255
2441511
2441767
2442023
2442279
2442535
2442791
2443047
2443303
2443559
2443815
2444071
2444327
2444583
2444839
2445095
2445351
2445607
2445863
2446119
2446375
2446631
2446887
2447143
2447399
2447655
2447911
2448167
2448423
2448679
2448935
2449191
2441256
2441512
2441768
2442024
2442280
2442536
2442792
2443048
2443304
2443560
2443816
2444072
2444328
2444584
2444840
2445096
2445352
2445608
2445864
2446120
2446376
2446632
2446888
2447144
2447400
2447656
2447912
2448168
2448424
2448680
2448936
2449192
2441257
2441513
2441769
2442025
2442281
2442537
2442793
2443049
2443305
2443561
2443817
2444073
2444329
2444585
2444841
2445097
2445353
2445609
2445865
2446121
2446377
2446633
2446889
2447145
2447401
2447657
2447913
2448169
2448425
2448681
2448937
2449193
2441258
2441514
2441770
2442026
2442282
2442538
2442794
2443050
2443306
2443562
2443818
2444074
2444330
2444586
2444842
2445098
2445354
2445610
2445866
2446122
2446378
2446634
2446890
2447146
2447402
2447658
2447914
2448170
2448426
2448682
2448938
2449194
2441259
2441515
2441771
2442027
2442283
2442539
2442795
2443051
2443307
2443563
2443819
2444075
2444331
2444587
2444843
2445099
2445355
2445611
2445867
2446123
2446379
2446635
2446891
2447147
2447403
2447659
2447915
2448171
2448427
2448683
2448939
2449195
2441260
2441516
2441772
2442028
2442284
2442540
2442796
2443052
2443308
2443564
2443820
2444076
2444332
2444588
2444844
2445100
2445356
2445612
2445868
2446124
2446380
2446636
2446892
2447148
2447404
2447660
2447916
2448172
2448428
2448684
2448940
2449196
2441261
2441517
2441773
2442029
2442285
2442541
2442797
2443053
2443309
2443565
2443821
2444077
2444333
2444589
2444845
2445101
2445357
2445613
2445869
2446125
2446381
2446637
2446893
2447149
2447405
2447661
2447917
2448173
2448429
2448685
2448941
2449197
2441262
2441518
2441774
2442030
2442286
2442542
2442798
2443054
2443310
2443566
2443822
2444078
2444334
2444590
2444846
2445102
2445358
2445614
2445870
2446126
2446382
2446638
2446894
2447150
2447406
2447662
2447918
2448174
2448430
2448686
2448942
2449198
2441263
2441519
2441775
2442031
2442287
2442543
2442799
2443055
2443311
2443567
2443823
2444079
2444335
2444591
2444847
2445103
2445359
2445615
2445871
2446127
2446383
2446639
2446895
2447151
2447407
2447663
2447919
2448175
2448431
2448687
2448943
2449199
2441264
2441520
2441776
2442032
2442288
2442544
2442800
2443056
2443312
2443568
2443824
2444080
2444336
2444592
2444848
2445104
2445360
2445616
2445872
2446128
2446384
2446640
2446896
2447152
2447408
2447664
2447920
2448176
2448432
2448688
2448944
2449200
2441265
2441521
2441777
2442033
2442289
2442545
2442801
2443057
2443313
2443569
2443825
2444081
2444337
2444593
2444849
2445105
2445361
2445617
2445873
2446129
2446385
2446641
2446897
2447153
2447409
2447665
2447921
2448177
2448433
2448689
2448945
2449201
2441266
2441522
2441778
2442034
2442290
2442546
2442802
2443058
2443314
2443570
2443826
2444082
2444338
2444594
2444850
2445106
2445362
2445618
2445874
2446130
2446386
2446642
2446898
2447154
2447410
2447666
2447922
2448178
2448434
2448690
2448946
2449202
2441267
2441523
2441779
2442035
2442291
2442547
2442803
2443059
2443315
2443571
2443827
2444083
2444339
2444595
2444851
2445107
2445363
2445619
2445875
2446131
2446387
2446643
2446899
2447155
2447411
2447667
2447923
2448179
2448435
2448691
2448947
2449203
2441268
2441524
2441780
2442036
2442292
2442548
2442804
2443060
2443316
2443572
2443828
2444084
2444340
2444596
2444852
2445108
2445364
2445620
2445876
2446132
2446388
2446644
2446900
2447156
2447412
2447668
2447924
2448180
2448436
2448692
2448948
2449204
2441269
2441525
2441781
2442037
2442293
2442549
2442805
2443061
2443317
2443573
2443829
2444085
2444341
2444597
2444853
2445109
2445365
2445621
2445877
2446133
2446389
2446645
2446901
2447157
2447413
2447669
2447925
2448181
2448437
2448693
2448949
2449205
2441270
2441526
2441782
2442038
2442294
2442550
2442806
2443062
2443318
2443574
2443830
2444086
2444342
2444598
2444854
2445110
2445366
2445622
2445878
2446134
2446390
2446646
2446902
2447158
2447414
2447670
2447926
2448182
2448438
2448694
2448950
2449206
2441271
2441527
2441783
2442039
2442295
2442551
2442807
2443063
2443319
2443575
2443831
2444087
2444343
2444599
2444855
2445111
2445367
2445623
2445879
2446135
2446391
2446647
2446903
2447159
2447415
2447671
2447927
2448183
2448439
2448695
2448951
2449207
2441272
2441528
2441784
2442040
2442296
2442552
2442808
2443064
2443320
2443576
2443832
2444088
2444344
2444600
2444856
2445112
2445368
2445624
2445880
2446136
2446392
2446648
2446904
2447160
2447416
2447672
2447928
2448184
2448440
2448696
2448952
2449208
2441273
2441529
2441785
2442041
2442297
2442553
2442809
2443065
2443321
2443577
2443833
2444089
2444345
2444601
2444857
2445113
2445369
2445625
2445881
2446137
2446393
2446649
2446905
2447161
2447417
2447673
2447929
2448185
2448441
2448697
2448953
2449209
2441274
2441530
2441786
2442042
2442298
2442554
2442810
2443066
2443322
2443578
2443834
2444090
2444346
2444602
2444858
2445114
2445370
2445626
2445882
2446138
2446394
2446650
2446906
2447162
2447418
2447674
2447930
2448186
2448442
2448698
2448954
2449210
2441275
2441531
2441787
2442043
2442299
2442555
2442811
2443067
2443323
2443579
2443835
2444091
2444347
2444603
2444859
2445115
2445371
2445627
2445883
2446139
2446395
2446651
2446907
2447163
2447419
2447675
2447931
2448187
2448443
2448699
2448955
2449211
2441276
2441532
2441788
2442044
2442300
2442556
2442812
2443068
2443324
2443580
2443836
2444092
2444348
2444604
2444860
2445116
2445372
2445628
2445884
2446140
2446396
2446652
2446908
2447164
2447420
2447676
2447932
2448188
2448444
2448700
2448956
2449212
2441277
2441533
2441789
2442045
2442301
2442557
2442813
2443069
2443325
2443581
2443837
2444093
2444349
2444605
2444861
2445117
2445373
2445629
2445885
2446141
2446397
2446653
2446909
2447165
2447421
2447677
2447933
2448189
2448445
2448701
2448957
2449213
2441278
2441534
2441790
2442046
2442302
2442558
2442814
2443070
2443326
2443582
2443838
2444094
2444350
2444606
2444862
2445118
2445374
2445630
2445886
2446142
2446398
2446654
2446910
2447166
2447422
2447678
2447934
2448190
2448446
2448702
2448958
2449214
2441279
2441535
2441791
2442047
2442303
2442559
2442815
2443071
2443327
2443583
2443839
2444095
2444351
2444607
2444863
2445119
2445375
2445631
2445887
2446143
2446399
2446655
2446911
2447167
2447423
2447679
2447935
2448191
2448447
2448703
2448959
2449215
2441280
2441536
2441792
2442048
2442304
2442560
2442816
2443072
2443328
2443584
2443840
2444096
2444352
2444608
2444864
2445120
2445376
2445632
2445888
2446144
2446400
2446656
2446912
2447168
2447424
2447680
2447936
2448192
2448448
2448704
2448960
2449216
2441281
2441537
2441793
2442049
2442305
2442561
2442817
2443073
2443329
2443585
2443841
2444097
2444353
2444609
2444865
2445121
2445377
2445633
2445889
2446145
2446401
2446657
2446913
2447169
2447425
2447681
2447937
2448193
2448449
2448705
2448961
2449217
2441282
2441538
2441794
2442050
2442306
2442562
2442818
2443074
2443330
2443586
2443842
2444098
2444354
2444610
2444866
2445122
2445378
2445634
2445890
2446146
2446402
2446658
2446914
2447170
2447426
2447682
2447938
2448194
2448450
2448706
2448962
2449218
2441283
2441539
2441795
2442051
2442307
2442563
2442819
2443075
2443331
2443587
2443843
2444099
2444355
2444611
2444867
2445123
2445379
2445635
2445891
2446147
2446403
2446659
2446915
2447171
2447427
2447683
2447939
2448195
2448451
2448707
2448963
2449219
2441284
2441540
2441796
2442052
2442308
2442564
2442820
2443076
2443332
2443588
2443844
2444100
2444356
2444612
2444868
2445124
2445380
2445636
2445892
2446148
2446404
2446660
2446916
2447172
2447428
2447684
2447940
2448196
2448452
2448708
2448964
2449220
2441285
2441541
2441797
2442053
2442309
2442565
2442821
2443077
2443333
2443589
2443845
2444101
2444357
2444613
2444869
2445125
2445381
2445637
2445893
2446149
2446405
2446661
2446917
2447173
2447429
2447685
2447941
2448197
2448453
2448709
2448965
2449221
2441286
2441542
2441798
2442054
2442310
2442566
2442822
2443078
2443334
2443590
2443846
2444102
2444358
2444614
2444870
2445126
2445382
2445638
2445894
2446150
2446406
2446662
2446918
2447174
2447430
2447686
2447942
2448198
2448454
2448710
2448966
2449222
2441287
2441543
2441799
2442055
2442311
2442567
2442823
2443079
2443335
2443591
2443847
2444103
2444359
2444615
2444871
2445127
2445383
2445639
2445895
2446151
2446407
2446663
2446919
2447175
2447431
2447687
2447943
2448199
2448455
2448711
2448967
2449223
2441288
2441544
2441800
2442056
2442312
2442568
2442824
2443080
2443336
2443592
2443848
2444104
2444360
2444616
2444872
2445128
2445384
2445640
2445896
2446152
2446408
2446664
2446920
2447176
2447432
2447688
2447944
2448200
2448456
2448712
2448968
2449224
2441289
2441545
2441801
2442057
2442313
2442569
2442825
2443081
2443337
2443593
2443849
2444105
2444361
2444617
2444873
2445129
2445385
2445641
2445897
2446153
2446409
2446665
2446921
2447177
2447433
2447689
2447945
2448201
2448457
2448713
2448969
2449225
2441290
2441546
2441802
2442058
2442314
2442570
2442826
2443082
2443338
2443594
2443850
2444106
2444362
2444618
2444874
2445130
2445386
2445642
2445898
2446154
2446410
2446666
2446922
2447178
2447434
2447690
2447946
2448202
2448458
2448714
2448970
2449226
2441291
2441547
2441803
2442059
2442315
2442571
2442827
2443083
2443339
2443595
2443851
2444107
2444363
2444619
2444875
2445131
2445387
2445643
2445899
2446155
2446411
2446667
2446923
2447179
2447435
2447691
2447947
2448203
2448459
2448715
2448971
2449227
2441292
2441548
2441804
2442060
2442316
2442572
2442828
2443084
2443340
2443596
2443852
2444108
2444364
2444620
2444876
2445132
2445388
2445644
2445900
2446156
2446412
2446668
2446924
2447180
2447436
2447692
2447948
2448204
2448460
2448716
2448972
2449228
2441293
2441549
2441805
2442061
2442317
2442573
2442829
2443085
2443341
2443597
2443853
2444109
2444365
2444621
2444877
2445133
2445389
2445645
2445901
2446157
2446413
2446669
2446925
2447181
2447437
2447693
2447949
2448205
2448461
2448717
2448973
2449229
2441294
2441550
2441806
2442062
2442318
2442574
2442830
2443086
2443342
2443598
2443854
2444110
2444366
2444622
2444878
2445134
2445390
2445646
2445902
2446158
2446414
2446670
2446926
2447182
2447438
2447694
2447950
2448206
2448462
2448718
2448974
2449230
2441295
2441551
2441807
2442063
2442319
2442575
2442831
2443087
2443343
2443599
2443855
2444111
2444367
2444623
2444879
2445135
2445391
2445647
2445903
2446159
2446415
2446671
2446927
2447183
2447439
2447695
2447951
2448207
2448463
2448719
2448975
2449231
2441296
2441552
2441808
2442064
2442320
2442576
2442832
2443088
2443344
2443600
2443856
2444112
2444368
2444624
2444880
2445136
2445392
2445648
2445904
2446160
2446416
2446672
2446928
2447184
2447440
2447696
2447952
2448208
2448464
2448720
2448976
2449232
2441297
2441553
2441809
2442065
2442321
2442577
2442833
2443089
2443345
2443601
2443857
2444113
2444369
2444625
2444881
2445137
2445393
2445649
2445905
2446161
2446417
2446673
2446929
2447185
2447441
2447697
2447953
2448209
2448465
2448721
2448977
2449233
2441298
2441554
2441810
2442066
2442322
2442578
2442834
2443090
2443346
2443602
2443858
2444114
2444370
2444626
2444882
2445138
2445394
2445650
2445906
2446162
2446418
2446674
2446930
2447186
2447442
2447698
2447954
2448210
2448466
2448722
2448978
2449234
2441299
2441555
2441811
2442067
2442323
2442579
2442835
2443091
2443347
2443603
2443859
2444115
2444371
2444627
2444883
2445139
2445395
2445651
2445907
2446163
2446419
2446675
2446931
2447187
2447443
2447699
2447955
2448211
2448467
2448723
2448979
2449235
2441300
2441556
2441812
2442068
2442324
2442580
2442836
2443092
2443348
2443604
2443860
2444116
2444372
2444628
2444884
2445140
2445396
2445652
2445908
2446164
2446420
2446676
2446932
2447188
2447444
2447700
2447956
2448212
2448468
2448724
2448980
2449236
2441301
2441557
2441813
2442069
2442325
2442581
2442837
2443093
2443349
2443605
2443861
2444117
2444373
2444629
2444885
2445141
2445397
2445653
2445909
2446165
2446421
2446677
2446933
2447189
2447445
2447701
2447957
2448213
2448469
2448725
2448981
2449237
2441302
2441558
2441814
2442070
2442326
2442582
2442838
2443094
2443350
2443606
2443862
2444118
2444374
2444630
2444886
2445142
2445398
2445654
2445910
2446166
2446422
2446678
2446934
2447190
2447446
2447702
2447958
2448214
2448470
2448726
2448982
2449238
2441303
2441559
2441815
2442071
2442327
2442583
2442839
2443095
2443351
2443607
2443863
2444119
2444375
2444631
2444887
2445143
2445399
2445655
2445911
2446167
2446423
2446679
2446935
2447191
2447447
2447703
2447959
2448215
2448471
2448727
2448983
2449239
2441304
2441560
2441816
2442072
2442328
2442584
2442840
2443096
2443352
2443608
2443864
2444120
2444376
2444632
2444888
2445144
2445400
2445656
2445912
2446168
2446424
2446680
2446936
2447192
2447448
2447704
2447960
2448216
2448472
2448728
2448984
2449240
2441305
2441561
2441817
2442073
2442329
2442585
2442841
2443097
2443353
2443609
2443865
2444121
2444377
2444633
2444889
2445145
2445401
2445657
2445913
2446169
2446425
2446681
2446937
2447193
2447449
2447705
2447961
2448217
2448473
2448729
2448985
2449241
2441306
2441562
2441818
2442074
2442330
2442586
2442842
2443098
2443354
2443610
2443866
2444122
2444378
2444634
2444890
2445146
2445402
2445658
2445914
2446170
2446426
2446682
2446938
2447194
2447450
2447706
2447962
2448218
2448474
2448730
2448986
2449242
2441307
2441563
2441819
2442075
2442331
2442587
2442843
2443099
2443355
2443611
2443867
2444123
2444379
2444635
2444891
2445147
2445403
2445659
2445915
2446171
2446427
2446683
2446939
2447195
2447451
2447707
2447963
2448219
2448475
2448731
2448987
2449243
2441308
2441564
2441820
2442076
2442332
2442588
2442844
2443100
2443356
2443612
2443868
2444124
2444380
2444636
2444892
2445148
2445404
2445660
2445916
2446172
2446428
2446684
2446940
2447196
2447452
2447708
2447964
2448220
2448476
2448732
2448988
2449244
2441309
2441565
2441821
2442077
2442333
2442589
2442845
2443101
2443357
2443613
2443869
2444125
2444381
2444637
2444893
2445149
2445405
2445661
2445917
2446173
2446429
2446685
2446941
2447197
2447453
2447709
2447965
2448221
2448477
2448733
2448989
2449245
2441310
2441566
2441822
2442078
2442334
2442590
2442846
2443102
2443358
2443614
2443870
2444126
2444382
2444638
2444894
2445150
2445406
2445662
2445918
2446174
2446430
2446686
2446942
2447198
2447454
2447710
2447966
2448222
2448478
2448734
2448990
2449246
2441311
2441567
2441823
2442079
2442335
2442591
2442847
2443103
2443359
2443615
2443871
2444127
2444383
2444639
2444895
2445151
2445407
2445663
2445919
2446175
2446431
2446687
2446943
2447199
2447455
2447711
2447967
2448223
2448479
2448735
2448991
2449247
2506752
2507008
2507264
2507520
2507776
2508032
2508288
2508544
2508800
2509056
2509312
2509568
2509824
2510080
2510336
2510592
2510848
2511104
2511360
2511616
2511872
2512128
2512384
2512640
2512896
2513152
2513408
2513664
2513920
2514176
2514432
2514688
2506753
2507009
2507265
2507521
2507777
2508033
2508289
2508545
2508801
2509057
2509313
2509569
2509825
2510081
2510337
2510593
2510849
2511105
2511361
2511617
2511873
2512129
2512385
2512641
2512897
2513153
2513409
2513665
2513921
2514177
2514433
2514689
2506754
2507010
2507266
2507522
2507778
2508034
2508290
2508546
2508802
2509058
2509314
2509570
2509826
2510082
2510338
2510594
2510850
2511106
2511362
2511618
2511874
2512130
2512386
2512642
2512898
2513154
2513410
2513666
2513922
2514178
2514434
2514690
2506755
2507011
2507267
2507523
2507779
2508035
2508291
2508547
2508803
2509059
2509315
2509571
2509827
2510083
2510339
2510595
2510851
2511107
2511363
2511619
2511875
2512131
2512387
2512643
2512899
2513155
2513411
2513667
2513923
2514179
2514435
2514691
2506756
2507012
2507268
2507524
2507780
2508036
2508292
2508548
2508804
2509060
2509316
2509572
2509828
2510084
2510340
2510596
2510852
2511108
2511364
2511620
2511876
2512132
2512388
2512644
2512900
2513156
2513412
2513668
2513924
2514180
2514436
2514692
2506757
2507013
2507269
2507525
2507781
2508037
2508293
2508549
2508805
2509061
2509317
2509573
2509829
2510085
2510341
2510597
2510853
2511109
2511365
2511621
2511877
2512133
2512389
2512645
2512901
2513157
2513413
2513669
2513925
2514181
2514437
2514693
2506758
2507014
2507270
2507526
2507782
2508038
2508294
2508550
2508806
2509062
2509318
2509574
2509830
2510086
2510342
2510598
2510854
2511110
2511366
2511622
2511878
2512134
2512390
2512646
2512902
2513158
2513414
2513670
2513926
2514182
2514438
2514694
2506759
2507015
2507271
2507527
2507783
2508039
2508295
2508551
2508807
2509063
2509319
2509575
2509831
2510087
2510343
2510599
2510855
2511111
2511367
2511623
2511879
2512135
2512391
2512647
2512903
2513159
2513415
2513671
2513927
2514183
2514439
2514695
2506760
2507016
2507272
2507528
2507784
2508040
2508296
2508552
2508808
2509064
2509320
2509576
2509832
2510088
2510344
2510600
2510856
2511112
2511368
2511624
2511880
2512136
2512392
2512648
2512904
2513160
2513416
2513672
2513928
2514184
2514440
2514696
2506761
2507017
2507273
2507529
2507785
2508041
2508297
2508553
2508809
2509065
2509321
2509577
2509833
2510089
2510345
2510601
2510857
2511113
2511369
2511625
2511881
2512137
2512393
2512649
2512905
2513161
2513417
2513673
2513929
2514185
2514441
2514697
2506762
2507018
2507274
2507530
2507786
2508042
2508298
2508554
2508810
2509066
2509322
2509578
2509834
2510090
2510346
2510602
2510858
2511114
2511370
2511626
2511882
2512138
2512394
2512650
2512906
2513162
2513418
2513674
2513930
2514186
2514442
2514698
2506763
2507019
2507275
2507531
2507787
2508043
2508299
2508555
2508811
2509067
2509323
2509579
2509835
2510091
2510347
2510603
2510859
2511115
2511371
2511627
2511883
2512139
2512395
2512651
2512907
2513163
2513419
2513675
2513931
2514187
2514443
2514699
2506764
2507020
2507276
2507532
2507788
2508044
2508300
2508556
2508812
2509068
2509324
2509580
2509836
2510092
2510348
2510604
2510860
2511116
2511372
2511628
2511884
2512140
2512396
2512652
2512908
2513164
2513420
2513676
2513932
2514188
2514444
2514700
2506765
2507021
2507277
2507533
2507789
2508045
2508301
2508557
2508813
2509069
2509325
2509581
2509837
2510093
2510349
2510605
2510861
2511117
2511373
2511629
2511885
2512141
2512397
2512653
2512909
2513165
2513421
2513677
2513933
2514189
2514445
2514701
2506766
2507022
2507278
2507534
2507790
2508046
2508302
2508558
2508814
2509070
2509326
2509582
2509838
2510094
2510350
2510606
2510862
2511118
2511374
2511630
2511886
2512142
2512398
2512654
2512910
2513166
2513422
2513678
2513934
2514190
2514446
2514702
2506767
2507023
2507279
2507535
2507791
2508047
2508303
2508559
2508815
2509071
2509327
2509583
2509839
2510095
2510351
2510607
2510863
2511119
2511375
2511631
2511887
2512143
2512399
2512655
2512911
2513167
2513423
2513679
2513935
2514191
2514447
2514703
2506768
2507024
2507280
2507536
2507792
2508048
2508304
2508560
2508816
2509072
2509328
2509584
2509840
2510096
2510352
2510608
2510864
2511120
2511376
2511632
2511888
2512144
2512400
2512656
2512912
2513168
2513424
2513680
2513936
2514192
2514448
2514704
2506769
2507025
2507281
2507537
2507793
2508049
2508305
2508561
2508817
2509073
2509329
2509585
2509841
2510097
2510353
2510609
2510865
2511121
2511377
2511633
2511889
2512145
2512401
2512657
2512913
2513169
2513425
2513681
2513937
2514193
2514449
2514705
2506770
2507026
2507282
2507538
2507794
2508050
2508306
2508562
2508818
2509074
2509330
2509586
2509842
2510098
2510354
2510610
2510866
2511122
2511378
2511634
2511890
2512146
2512402
2512658
2512914
2513170
2513426
2513682
2513938
2514194
2514450
2514706
2506771
2507027
2507283
2507539
2507795
2508051
2508307
2508563
2508819
2509075
2509331
2509587
2509843
2510099
2510355
2510611
2510867
2511123
2511379
2511635
2511891
2512147
2512403
2512659
2512915
2513171
2513427
2513683
2513939
2514195
2514451
2514707
2506772
2507028
2507284
2507540
2507796
2508052
2508308
2508564
2508820
2509076
2509332
2509588
2509844
2510100
2510356
2510612
2510868
2511124
2511380
2511636
2511892
2512148
2512404
2512660
2512916
2513172
2513428
2513684
2513940
2514196
2514452
2514708
2506773
2507029
2507285
2507541
2507797
2508053
2508309
2508565
2508821
2509077
2509333
2509589
2509845
2510101
2510357
2510613
2510869
2511125
2511381
2511637
2511893
2512149
2512405
2512661
2512917
2513173
2513429
2513685
2513941
2514197
2514453
2514709
2506774
2507030
2507286
2507542
2507798
2508054
2508310
2508566
2508822
2509078
2509334
2509590
2509846
2510102
2510358
2510614
2510870
2511126
2511382
2511638
2511894
2512150
2512406
2512662
2512918
2513174
2513430
2513686
2513942
2514198
2514454
2514710
2506775
2507031
2507287
2507543
2507799
2508055
2508311
2508567
2508823
2509079
2509335
2509591
2509847
2510103
2510359
2510615
2510871
2511127
2511383
2511639
2511895
2512151
2512407
2512663
2512919
2513175
2513431
2513687
2513943
2514199
2514455
2514711
2506776
2507032
2507288
2507544
2507800
2508056
2508312
2508568
2508824
2509080
2509336
2509592
2509848
2510104
2510360
2510616
2510872
2511128
2511384
2511640
2511896
2512152
2512408
2512664
2512920
2513176
2513432
2513688
2513944
2514200
2514456
2514712
2506777
2507033
2507289
2507545
2507801
2508057
2508313
2508569
2508825
2509081
2509337
2509593
2509849
2510105
2510361
2510617
2510873
2511129
2511385
2511641
2511897
2512153
2512409
2512665
2512921
2513177
2513433
2513689
2513945
2514201
2514457
2514713
2506778
2507034
2507290
2507546
2507802
2508058
2508314
2508570
2508826
2509082
2509338
2509594
2509850
2510106
2510362
2510618
2510874
2511130
2511386
2511642
2511898
2512154
2512410
2512666
2512922
2513178
2513434
2513690
2513946
2514202
2514458
2514714
2506779
2507035
2507291
2507547
2507803
2508059
2508315
2508571
2508827
2509083
2509339
2509595
2509851
2510107
2510363
2510619
2510875
2511131
2511387
2511643
2511899
2512155
2512411
2512667
2512923
2513179
2513435
2513691
2513947
2514203
2514459
2514715
2506780
2507036
2507292
2507548
2507804
2508060
2508316
2508572
2508828
2509084
2509340
2509596
2509852
2510108
2510364
2510620
2510876
2511132
2511388
2511644
2511900
2512156
2512412
2512668
2512924
2513180
2513436
2513692
2513948
2514204
2514460
2514716
2506781
2507037
2507293
2507549
2507805
2508061
2508317
2508573
2508829
2509085
2509341
2509597
2509853
2510109
2510365
2510621
2510877
2511133
2511389
2511645
2511901
2512157
2512413
2512669
2512925
2513181
2513437
2513693
2513949
2514205
2514461
2514717
2506782
2507038
2507294
2507550
2507806
2508062
2508318
2508574
2508830
2509086
2509342
2509598
2509854
2510110
2510366
2510622
2510878
2511134
2511390
2511646
2511902
2512158
2512414
2512670
2512926
2513182
2513438
2513694
2513950
2514206
2514462
2514718
2506783
2507039
2507295
2507551
2507807
2508063
2508319
2508575
2508831
2509087
2509343
2509599
2509855
2510111
2510367
2510623
2510879
2511135
2511391
2511647
2511903
2512159
2512415
2512671
2512927
2513183
2513439
2513695
2513951
2514207
2514463
2514719
2506784
2507040
2507296
2507552
2507808
2508064
2508320
2508576
2508832
2509088
2509344
2509600
2509856
2510112
2510368
2510624
2510880
2511136
2511392
2511648
2511904
2512160
2512416
2512672
2512928
2513184
2513440
2513696
2513952
2514208
2514464
2514720
2506785
2507041
2507297
2507553
2507809
2508065
2508321
2508577
2508833
2509089
2509345
2509601
2509857
2510113
2510369
2510625
2510881
2511137
2511393
2511649
2511905
2512161
2512417
2512673
2512929
2513185
2513441
2513697
2513953
2514209
2514465
2514721
2506786
2507042
2507298
2507554
2507810
2508066
2508322
2508578
2508834
2509090
2509346
2509602
2509858
2510114
2510370
2510626
2510882
2511138
2511394
2511650
2511906
2512162
2512418
2512674
2512930
2513186
2513442
2513698
2513954
2514210
2514466
2514722
2506787
2507043
2507299
2507555
2507811
2508067
2508323
2508579
2508835
2509091
2509347
2509603
2509859
2510115
2510371
2510627
2510883
2511139
2511395
2511651
2511907
2512163
2512419
2512675
2512931
2513187
2513443
2513699
2513955
2514211
2514467
2514723
2506788
2507044
2507300
2507556
2507812
2508068
2508324
2508580
2508836
2509092
2509348
2509604
2509860
2510116
2510372
2510628
2510884
2511140
2511396
2511652
2511908
2512164
2512420
2512676
2512932
2513188
2513444
2513700
2513956
2514212
2514468
2514724
2506789
2507045
2507301
2507557
2507813
2508069
2508325
2508581
2508837
2509093
2509349
2509605
2509861
2510117
2510373
2510629
2510885
2511141
2511397
2511653
2511909
2512165
2512421
2512677
2512933
2513189
2513445
2513701
2513957
2514213
2514469
2514725
2506790
2507046
2507302
2507558
2507814
2508070
2508326
2508582
2508838
2509094
2509350
2509606
2509862
2510118
2510374
2510630
2510886
2511142
2511398
2511654
2511910
2512166
2512422
2512678
2512934
2513190
2513446
2513702
2513958
2514214
2514470
2514726
2506791
2507047
2507303
2507559
2507815
2508071
2508327
2508583
2508839
2509095
2509351
2509607
2509863
2510119
2510375
2510631
2510887
2511143
2511399
2511655
2511911
2512167
2512423
2512679
2512935
2513191
2513447
2513703
2513959
2514215
2514471
2514727
2506792
2507048
2507304
2507560
2507816
2508072
2508328
2508584
2508840
2509096
2509352
2509608
2509864
2510120
2510376
2510632
2510888
2511144
2511400
2511656
2511912
2512168
2512424
2512680
2512936
2513192
2513448
2513704
2513960
2514216
2514472
2514728
2506793
2507049
2507305
2507561
2507817
2508073
2508329
2508585
2508841
2509097
2509353
2509609
2509865
2510121
2510377
2510633
2510889
2511145
2511401
2511657
2511913
2512169
2512425
2512681
2512937
2513193
2513449
2513705
2513961
2514217
2514473
2514729
2506794
2507050
2507306
2507562
2507818
2508074
2508330
2508586
2508842
2509098
2509354
2509610
2509866
2510122
2510378
2510634
2510890
2511146
2511402
2511658
2511914
2512170
2512426
2512682
2512938
2513194
2513450
2513706
2513962
2514218
2514474
2514730
2506795
2507051
2507307
2507563
2507819
2508075
2508331
2508587
2508843
2509099
2509355
2509611
2509867
2510123
2510379
2510635
2510891
2511147
2511403
2511659
2511915
2512171
2512427
2512683
2512939
2513195
2513451
2513707
2513963
2514219
2514475
2514731
2506796
2507052
2507308
2507564
2507820
2508076
2508332
2508588
2508844
2509100
2509356
2509612
2509868
2510124
2510380
2510636
2510892
2511148
2511404
2511660
2511916
2512172
2512428
2512684
2512940
2513196
2513452
2513708
2513964
2514220
2514476
2514732
2506797
2507053
2507309
2507565
2507821
2508077
2508333
2508589
2508845
2509101
2509357
2509613
2509869
2510125
2510381
2510637
2510893
2511149
2511405
2511661
2511917
2512173
2512429
2512685
2512941
2513197
2513453
2513709
2513965
2514221
2514477
2514733
2506798
2507054
2507310
2507566
2507822
2508078
2508334
2508590
2508846
2509102
2509358
2509614
2509870
2510126
2510382
2510638
2510894
2511150
2511406
2511662
2511918
2512174
2512430
2512686
2512942
2513198
2513454
2513710
2513966
2514222
2514478
2514734
2506799
2507055
2507311
2507567
2507823
2508079
2508335
2508591
2508847
2509103
2509359
2509615
2509871
2510127
2510383
2510639
2510895
2511151
2511407
2511663
2511919
2512175
2512431
2512687
2512943
2513199
2513455
2513711
2513967
2514223
2514479
2514735
2506800
2507056
2507312
2507568
2507824
2508080
2508336
2508592
2508848
2509104
2509360
2509616
2509872
2510128
2510384
2510640
2510896
2511152
2511408
2511664
2511920
2512176
2512432
2512688
2512944
2513200
2513456
2513712
2513968
2514224
2514480
2514736
2506801
2507057
2507313
2507569
2507825
2508081
2508337
2508593
2508849
2509105
2509361
2509617
2509873
2510129
2510385
2510641
2510897
2511153
2511409
2511665
2511921
2512177
2512433
2512689
2512945
2513201
2513457
2513713
2513969
2514225
2514481
2514737
2506802
2507058
2507314
2507570
2507826
2508082
2508338
2508594
2508850
2509106
2509362
2509618
2509874
2510130
2510386
2510642
2510898
2511154
2511410
2511666
2511922
2512178
2512434
2512690
2512946
2513202
2513458
2513714
2513970
2514226
2514482
2514738
2506803
2507059
2507315
2507571
2507827
2508083
2508339
2508595
2508851
2509107
2509363
2509619
2509875
2510131
2510387
2510643
2510899
2511155
2511411
2511667
2511923
2512179
2512435
2512691
2512947
2513203
2513459
2513715
2513971
2514227
2514483
2514739
2506804
2507060
2507316
2507572
2507828
2508084
2508340
2508596
2508852
2509108
2509364
2509620
2509876
2510132
2510388
2510644
2510900
2511156
2511412
2511668
2511924
2512180
2512436
2512692
2512948
2513204
2513460
2513716
2513972
2514228
2514484
2514740
2506805
2507061
2507317
2507573
2507829
2508085
2508341
2508597
2508853
2509109
2509365
2509621
2509877
2510133
2510389
2510645
2510901
2511157
2511413
2511669
2511925
2512181
2512437
2512693
2512949
2513205
2513461
2513717
2513973
2514229
2514485
2514741
2506806
2507062
2507318
2507574
2507830
2508086
2508342
2508598
2508854
2509110
2509366
2509622
2509878
2510134
2510390
2510646
2510902
2511158
2511414
2511670
2511926
2512182
2512438
2512694
2512950
2513206
2513462
2513718
2513974
2514230
2514486
2514742
2506807
2507063
2507319
2507575
2507831
2508087
2508343
2508599
2508855
2509111
2509367
2509623
2509879
2510135
2510391
2510647
2510903
2511159
2511415
2511671
2511927
2512183
2512439
2512695
2512951
2513207
2513463
2513719
2513975
2514231
2514487
2514743
2506808
2507064
2507320
2507576
2507832
2508088
2508344
2508600
2508856
2509112
2509368
2509624
2509880
2510136
2510392
2510648
2510904
2511160
2511416
2511672
2511928
2512184
2512440
2512696
2512952
2513208
2513464
2513720
2513976
2514232
2514488
2514744
2506809
2507065
2507321
2507577
2507833
2508089
2508345
2508601
2508857
2509113
2509369
2509625
2509881
2510137
2510393
2510649
2510905
2511161
2511417
2511673
2511929
2512185
2512441
2512697
2512953
2513209
2513465
2513721
2513977
2514233
2514489
2514745
2506810
2507066
2507322
2507578
2507834
2508090
2508346
2508602
2508858
2509114
2509370
2509626
2509882
2510138
2510394
2510650
2510906
2511162
2511418
2511674
2511930
2512186
2512442
2512698
2512954
2513210
2513466
2513722
2513978
2514234
2514490
2514746
2506811
2507067
2507323
2507579
2507835
2508091
2508347
2508603
2508859
2509115
2509371
2509627
2509883
2510139
2510395
2510651
2510907
2511163
2511419
2511675
2511931
2512187
2512443
2512699
2512955
2513211
2513467
2513723
2513979
2514235
2514491
2514747
2506812
2507068
2507324
2507580
2507836
2508092
2508348
2508604
2508860
2509116
2509372
2509628
2509884
2510140
2510396
2510652
2510908
2511164
2511420
2511676
2511932
2512188
2512444
2512700
2512956
2513212
2513468
2513724
2513980
2514236
2514492
2514748
2506813
2507069
2507325
2507581
2507837
2508093
2508349
2508605
2508861
2509117
2509373
2509629
2509885
2510141
2510397
2510653
2510909
2511165
2511421
2511677
2511933
2512189
2512445
2512701
2512957
2513213
2513469
2513725
2513981
2514237
2514493
2514749
2506814
2507070
2507326
2507582
2507838
2508094
2508350
2508606
2508862
2509118
2509374
2509630
2509886
2510142
2510398
2510654
2510910
2511166
2511422
2511678
2511934
2512190
2512446
2512702
2512958
2513214
2513470
2513726
2513982
2514238
2514494
2514750
2506815
2507071
2507327
2507583
2507839
2508095
2508351
2508607
2508863
2509119
2509375
2509631
2509887
2510143
2510399
2510655
2510911
2511167
2511423
2511679
2511935
2512191
2512447
2512703
2512959
2513215
2513471
2513727
2513983
2514239
2514495
2514751
2506816
2507072
2507328
2507584
2507840
2508096
2508352
2508608
2508864
2509120
2509376
2509632
2509888
2510144
2510400
2510656
2510912
2511168
2511424
2511680
2511936
2512192
2512448
2512704
2512960
2513216
2513472
2513728
2513984
2514240
2514496
2514752
2506817
2507073
2507329
2507585
2507841
2508097
2508353
2508609
2508865
2509121
2509377
2509633
2509889
2510145
2510401
2510657
2510913
2511169
2511425
2511681
2511937
2512193
2512449
2512705
2512961
2513217
2513473
2513729
2513985
2514241
2514497
2514753
2506818
2507074
2507330
2507586
2507842
2508098
2508354
2508610
2508866
2509122
2509378
2509634
2509890
2510146
2510402
2510658
2510914
2511170
2511426
2511682
2511938
2512194
2512450
2512706
2512962
2513218
2513474
2513730
2513986
2514242
2514498
2514754
2506819
2507075
2507331
2507587
2507843
2508099
2508355
2508611
2508867
2509123
2509379
2509635
2509891
2510147
2510403
2510659
2510915
2511171
2511427
2511683
2511939
2512195
2512451
2512707
2512963
2513219
2513475
2513731
2513987
2514243
2514499
2514755
2506820
2507076
2507332
2507588
2507844
2508100
2508356
2508612
2508868
2509124
2509380
2509636
2509892
2510148
2510404
2510660
2510916
2511172
2511428
2511684
2511940
2512196
2512452
2512708
2512964
2513220
2513476
2513732
2513988
2514244
2514500
2514756
2506821
2507077
2507333
2507589
2507845
2508101
2508357
2508613
2508869
2509125
2509381
2509637
2509893
2510149
2510405
2510661
2510917
2511173
2511429
2511685
2511941
2512197
2512453
2512709
2512965
2513221
2513477
2513733
2513989
2514245
2514501
2514757
2506822
2507078
2507334
2507590
2507846
2508102
2508358
2508614
2508870
2509126
2509382
2509638
2509894
2510150
2510406
2510662
2510918
2511174
2511430
2511686
2511942
2512198
2512454
2512710
2512966
2513222
2513478
2513734
2513990
2514246
2514502
2514758
2506823
2507079
2507335
2507591
2507847
2508103
2508359
2508615
2508871
2509127
2509383
2509639
2509895
2510151
2510407
2510663
2510919
2511175
2511431
2511687
2511943
2512199
2512455
2512711
2512967
2513223
2513479
2513735
2513991
2514247
2514503
2514759
2506824
2507080
2507336
2507592
2507848
2508104
2508360
2508616
2508872
2509128
2509384
2509640
2509896
2510152
2510408
2510664
2510920
2511176
2511432
2511688
2511944
2512200
2512456
2512712
2512968
2513224
2513480
2513736
2513992
2514248
2514504
2514760
2506825
2507081
2507337
2507593
2507849
2508105
2508361
2508617
2508873
2509129
2509385
2509641
2509897
2510153
2510409
2510665
2510921
2511177
2511433
2511689
2511945
2512201
2512457
2512713
2512969
2513225
2513481
2513737
2513993
2514249
2514505
2514761
2506826
2507082
2507338
2507594
2507850
2508106
2508362
2508618
2508874
2509130
2509386
2509642
2509898
2510154
2510410
2510666
2510922
2511178
2511434
2511690
2511946
2512202
2512458
2512714
2512970
2513226
2513482
2513738
2513994
2514250
2514506
2514762
2506827
2507083
2507339
2507595
2507851
2508107
2508363
2508619
2508875
2509131
2509387
2509643
2509899
2510155
2510411
2510667
2510923
2511179
2511435
2511691
2511947
2512203
2512459
2512715
2512971
2513227
2513483
2513739
2513995
2514251
2514507
2514763
2506828
2507084
2507340
2507596
2507852
2508108
2508364
2508620
2508876
2509132
2509388
2509644
2509900
2510156
2510412
2510668
2510924
2511180
2511436
2511692
2511948
2512204
2512460
2512716
2512972
2513228
2513484
2513740
2513996
2514252
2514508
2514764
2506829
2507085
2507341
2507597
2507853
2508109
2508365
2508621
2508877
2509133
2509389
2509645
2509901
2510157
2510413
2510669
2510925
2511181
2511437
2511693
2511949
2512205
2512461
2512717
2512973
2513229
2513485
2513741
2513997
2514253
2514509
2514765
2506830
2507086
2507342
2507598
2507854
2508110
2508366
2508622
2508878
2509134
2509390
2509646
2509902
2510158
2510414
2510670
2510926
2511182
2511438
2511694
2511950
2512206
2512462
2512718
2512974
2513230
2513486
2513742
2513998
2514254
2514510
2514766
2506831
2507087
2507343
2507599
2507855
2508111
2508367
2508623
2508879
2509135
2509391
2509647
2509903
2510159
2510415
2510671
2510927
2511183
2511439
2511695
2511951
2512207
2512463
2512719
2512975
2513231
2513487
2513743
2513999
2514255
2514511
2514767
2506832
2507088
2507344
2507600
2507856
2508112
2508368
2508624
2508880
2509136
2509392
2509648
2509904
2510160
2510416
2510672
2510928
2511184
2511440
2511696
2511952
2512208
2512464
2512720
2512976
2513232
2513488
2513744
2514000
2514256
2514512
2514768
2506833
2507089
2507345
2507601
2507857
2508113
2508369
2508625
2508881
2509137
2509393
2509649
2509905
2510161
2510417
2510673
2510929
2511185
2511441
2511697
2511953
2512209
2512465
2512721
2512977
2513233
2513489
2513745
2514001
2514257
2514513
2514769
2506834
2507090
2507346
2507602
2507858
2508114
2508370
2508626
2508882
2509138
2509394
2509650
2509906
2510162
2510418
2510674
2510930
2511186
2511442
2511698
2511954
2512210
2512466
2512722
2512978
2513234
2513490
2513746
2514002
2514258
2514514
2514770
2506835
2507091
2507347
2507603
2507859
2508115
2508371
2508627
2508883
2509139
2509395
2509651
2509907
2510163
2510419
2510675
2510931
2511187
2511443
2511699
2511955
2512211
2512467
2512723
2512979
2513235
2513491
2513747
2514003
2514259
2514515
2514771
2506836
2507092
2507348
2507604
2507860
2508116
2508372
2508628
2508884
2509140
2509396
2509652
2509908
2510164
2510420
2510676
2510932
2511188
2511444
2511700
2511956
2512212
2512468
2512724
2512980
2513236
2513492
2513748
2514004
2514260
2514516
2514772
2506837
2507093
2507349
2507605
2507861
2508117
2508373
2508629
2508885
2509141
2509397
2509653
2509909
2510165
2510421
2510677
2510933
2511189
2511445
2511701
2511957
2512213
2512469
2512725
2512981
2513237
2513493
2513749
2514005
2514261
2514517
2514773
2506838
2507094
2507350
2507606
2507862
2508118
2508374
2508630
2508886
2509142
2509398
2509654
2509910
2510166
2510422
2510678
2510934
2511190
2511446
2511702
2511958
2512214
2512470
2512726
2512982
2513238
2513494
2513750
2514006
2514262
2514518
2514774
2506839
2507095
2507351
2507607
2507863
2508119
2508375
2508631
2508887
2509143
2509399
2509655
2509911
2510167
2510423
2510679
2510935
2511191
2511447
2511703
2511959
2512215
2512471
2512727
2512983
2513239
2513495
2513751
2514007
2514263
2514519
2514775
2506840
2507096
2507352
2507608
2507864
2508120
2508376
2508632
2508888
2509144
2509400
2509656
2509912
2510168
2510424
2510680
2510936
2511192
2511448
2511704
2511960
2512216
2512472
2512728
2512984
2513240
2513496
2513752
2514008
2514264
2514520
2514776
2506841
2507097
2507353
2507609
2507865
2508121
2508377
2508633
2508889
2509145
2509401
2509657
2509913
2510169
2510425
2510681
2510937
2511193
2511449
2511705
2511961
2512217
2512473
2512729
2512985
2513241
2513497
2513753
2514009
2514265
2514521
2514777
2506842
2507098
2507354
2507610
2507866
2508122
2508378
2508634
2508890
2509146
2509402
2509658
2509914
2510170
2510426
2510682
2510938
2511194
2511450
2511706
2511962
2512218
2512474
2512730
2512986
2513242
2513498
2513754
2514010
2514266
2514522
2514778
2506843
2507099
2507355
2507611
2507867
2508123
2508379
2508635
2508891
2509147
2509403
2509659
2509915
2510171
2510427
2510683
2510939
2511195
2511451
2511707
2511963
2512219
2512475
2512731
2512987
2513243
2513499
2513755
2514011
2514267
2514523
2514779
2506844
2507100
2507356
2507612
2507868
2508124
2508380
2508636
2508892
2509148
2509404
2509660
2509916
2510172
2510428
2510684
2510940
2511196
2511452
2511708
2511964
2512220
2512476
2512732
2512988
2513244
2513500
2513756
2514012
2514268
2514524
2514780
2506845
2507101
2507357
2507613
2507869
2508125
2508381
2508637
2508893
2509149
2509405
2509661
2509917
2510173
2510429
2510685
2510941
2511197
2511453
2511709
2511965
2512221
2512477
2512733
2512989
2513245
2513501
2513757
2514013
2514269
2514525
2514781
2506846
2507102
2507358
2507614
2507870
2508126
2508382
2508638
2508894
2509150
2509406
2509662
2509918
2510174
2510430
2510686
2510942
2511198
2511454
2511710
2511966
2512222
2512478
2512734
2512990
2513246
2513502
2513758
2514014
2514270
2514526
2514782
2506847
2507103
2507359
2507615
2507871
2508127
2508383
2508639
2508895
2509151
2509407
2509663
2509919
2510175
2510431
2510687
2510943
2511199
2511455
2511711
2511967
2512223
2512479
2512735
2512991
2513247
2513503
2513759
2514015
2514271
2514527
2514783
3014656
3014912
3015168
3015424
3015680
3015936
3016192
3016448
3016704
3016960
3017216
3017472
3017728
3017984
3018240
3018496
3018752
3019008
3019264
3019520
3019776
3020032
3020288
3020544
3020800
3021056
3021312
3021568
3021824
3022080
3022336
3022592
3014657
3014913
3015169
3015425
3015681
3015937
3016193
3016449
3016705
3016961
3017217
3017473
3017729
3017985
3018241
3018497
3018753
3019009
3019265
3019521
3019777
3020033
3020289
3020545
3020801
3021057
3021313
3021569
3021825
3022081
3022337
3022593
3014658
3014914
3015170
3015426
3015682
3015938
3016194
3016450
3016706
3016962
3017218
3017474
3017730
3017986
3018242
3018498
3018754
3019010
3019266
3019522
3019778
3020034
3020290
3020546
3020802
3021058
3021314
3021570
3021826
3022082
3022338
3022594
3014659
3014915
3015171
3015427
3015683
3015939
3016195
3016451
3016707
3016963
3017219
3017475
3017731
3017987
3018243
3018499
3018755
3019011
3019267
3019523
3019779
3020035
3020291
3020547
3020803
3021059
3021315
3021571
3021827
3022083
3022339
3022595
3014660
3014916
3015172
3015428
3015684
3015940
3016196
3016452
3016708
3016964
3017220
3017476
3017732
3017988
3018244
3018500
3018756
3019012
3019268
3019524
3019780
3020036
3020292
3020548
3020804
3021060
3021316
3021572
3021828
3022084
3022340
3022596
3014661
3014917
3015173
3015429
3015685
3015941
3016197
3016453
3016709
3016965
3017221
3017477
3017733
3017989
3018245
3018501
3018757
3019013
3019269
3019525
3019781
3020037
3020293
3020549
3020805
3021061
3021317
3021573
3021829
3022085
3022341
3022597
3014662
3014918
3015174
3015430
3015686
3015942
3016198
3016454
3016710
3016966
3017222
3017478
3017734
3017990
3018246
3018502
3018758
3019014
3019270
3019526
3019782
3020038
3020294
3020550
3020806
3021062
3021318
3021574
3021830
3022086
3022342
3022598
3014663
3014919
3015175
3015431
3015687
3015943
3016199
3016455
3016711
3016967
3017223
3017479
3017735
3017991
3018247
3018503
3018759
3019015
3019271
3019527
3019783
3020039
3020295
3020551
3020807
3021063
3021319
3021575
3021831
3022087
3022343
3022599
3014664
3014920
3015176
3015432
3015688
3015944
3016200
3016456
3016712
3016968
3017224
3017480
3017736
3017992
3018248
3018504
3018760
3019016
3019272
3019528
3019784
3020040
3020296
3020552
3020808
3021064
3021320
3021576
3021832
3022088
3022344
3022600
3014665
3014921
3015177
3015433
3015689
3015945
3016201
3016457
3016713
3016969
3017225
3017481
3017737
3017993
3018249
3018505
3018761
3019017
3019273
3019529
3019785
3020041
3020297
3020553
3020809
3021065
3021321
3021577
3021833
3022089
3022345
3022601
3014666
3014922
3015178
3015434
3015690
3015946
3016202
3016458
3016714
3016970
3017226
3017482
3017738
3017994
3018250
3018506
3018762
3019018
3019274
3019530
3019786
3020042
3020298
3020554
3020810
3021066
3021322
3021578
3021834
3022090
3022346
3022602
3014667
3014923
3015179
3015435
3015691
3015947
3016203
3016459
3016715
3016971
3017227
3017483
3017739
3017995
3018251
3018507
3018763
3019019
3019275
3019531
3019787
3020043
3020299
3020555
3020811
3021067
3021323
3021579
3021835
3022091
3022347
3022603
3014668
3014924
3015180
3015436
3015692
3015948
3016204
3016460
3016716
3016972
3017228
3017484
3017740
3017996
3018252
3018508
3018764
3019020
3019276
3019532
3019788
3020044
3020300
3020556
3020812
3021068
3021324
3021580
3021836
3022092
3022348
3022604
3014669
3014925
3015181
3015437
3015693
3015949
3016205
3016461
3016717
3016973
3017229
3017485
3017741
3017997
3018253
3018509
3018765
3019021
3019277
3019533
3019789
3020045
3020301
3020557
3020813
3021069
3021325
3021581
3021837
3022093
3022349
3022605
3014670
3014926
3015182
3015438
3015694
3015950
3016206
3016462
3016718
3016974
3017230
3017486
3017742
3017998
3018254
3018510
3018766
3019022
3019278
3019534
3019790
3020046
3020302
3020558
3020814
3021070
3021326
3021582
3021838
3022094
3022350
3022606
3014671
3014927
3015183
3015439
3015695
3015951
3016207
3016463
3016719
3016975
3017231
3017487
3017743
3017999
3018255
3018511
3018767
3019023
3019279
3019535
3019791
3020047
3020303
3020559
3020815
3021071
3021327
3021583
3021839
3022095
3022351
3022607
3014672
3014928
3015184
3015440
3015696
3015952
3016208
3016464
3016720
3016976
3017232
3017488
3017744
3018000
3018256
3018512
3018768
3019024
3019280
3019536
3019792
3020048
3020304
3020560
3020816
3021072
3021328
3021584
3021840
3022096
3022352
3022608
3014673
3014929
3015185
3015441
3015697
3015953
3016209
3016465
3016721
3016977
3017233
3017489
3017745
3018001
3018257
3018513
3018769
3019025
3019281
3019537
3019793
3020049
3020305
3020561
3020817
3021073
3021329
3021585
3021841
3022097
3022353
3022609
3014674
3014930
3015186
3015442
3015698
3015954
3016210
3016466
3016722
3016978
3017234
3017490
3017746
3018002
3018258
3018514
3018770
3019026
3019282
3019538
3019794
3020050
3020306
3020562
3020818
3021074
3021330
3021586
3021842
3022098
3022354
3022610
3014675
3014931
3015187
3015443
3015699
3015955
3016211
3016467
3016723
3016979
3017235
3017491
3017747
3018003
3018259
3018515
3018771
3019027
3019283
3019539
3019795
3020051
3020307
3020563
3020819
3021075
3021331
3021587
3021843
3022099
3022355
3022611
3014676
3014932
3015188
3015444
3015700
3015956
3016212
3016468
3016724
3016980
3017236
3017492
3017748
3018004
3018260
3018516
3018772
3019028
3019284
3019540
3019796
3020052
3020308
3020564
3020820
3021076
3021332
3021588
3021844
3022100
3022356
3022612
3014677
3014933
3015189
3015445
3015701
3015957
3016213
3016469
3016725
3016981
3017237
3017493
3017749
3018005
3018261
3018517
3018773
3019029
3019285
3019541
3019797
3020053
3020309
3020565
3020821
3021077
3021333
3021589
3021845
3022101
3022357
3022613
3014678
3014934
3015190
3015446
3015702
3015958
3016214
3016470
3016726
3016982
3017238
3017494
3017750
3018006
3018262
3018518
3018774
3019030
3019286
3019542
3019798
3020054
3020310
3020566
3020822
3021078
3021334
3021590
3021846
3022102
3022358
3022614
3014679
3014935
3015191
3015447
3015703
3015959
3016215
3016471
3016727
3016983
3017239
3017495
3017751
3018007
3018263
3018519
3018775
3019031
3019287
3019543
3019799
3020055
3020311
3020567
3020823
3021079
3021335
3021591
3021847
3022103
3022359
3022615
3014680
3014936
3015192
3015448
3015704
3015960
3016216
3016472
3016728
3016984
3017240
3017496
3017752
3018008
3018264
3018520
3018776
3019032
3019288
3019544
3019800
3020056
3020312
3020568
3020824
3021080
3021336
3021592
3021848
3022104
3022360
3022616
3014681
3014937
3015193
3015449
3015705
3015961
3016217
3016473
3016729
3016985
3017241
3017497
3017753
3018009
3018265
3018521
3018777
3019033
3019289
3019545
3019801
3020057
3020313
3020569
3020825
3021081
3021337
3021593
3021849
3022105
3022361
3022617
3014682
3014938
3015194
3015450
3015706
3015962
3016218
3016474
3016730
3016986
3017242
3017498
3017754
3018010
3018266
3018522
3018778
3019034
3019290
3019546
3019802
3020058
3020314
3020570
3020826
3021082
3021338
3021594
3021850
3022106
3022362
3022618
3014683
3014939
3015195
3015451
3015707
3015963
3016219
3016475
3016731
3016987
3017243
3017499
3017755
3018011
3018267
3018523
3018779
3019035
3019291
3019547
3019803
3020059
3020315
3020571
3020827
3021083
3021339
3021595
3021851
3022107
3022363
3022619
3014684
3014940
3015196
3015452
3015708
3015964
3016220
3016476
3016732
3016988
3017244
3017500
3017756
3018012
3018268
3018524
3018780
3019036
3019292
3019548
3019804
3020060
3020316
3020572
3020828
3021084
3021340
3021596
3021852
3022108
3022364
3022620
3014685
3014941
3015197
3015453
3015709
3015965
3016221
3016477
3016733
3016989
3017245
3017501
3017757
3018013
3018269
3018525
3018781
3019037
3019293
3019549
3019805
3020061
3020317
3020573
3020829
3021085
3021341
3021597
3021853
3022109
3022365
3022621
3014686
3014942
3015198
3015454
3015710
3015966
3016222
3016478
3016734
3016990
3017246
3017502
3017758
3018014
3018270
3018526
3018782
3019038
3019294
3019550
3019806
3020062
3020318
3020574
3020830
3021086
3021342
3021598
3021854
3022110
3022366
3022622
3014687
3014943
3015199
3015455
3015711
3015967
3016223
3016479
3016735
3016991
3017247
3017503
3017759
3018015
3018271
3018527
3018783
3019039
3019295
3019551
3019807
3020063
3020319
3020575
3020831
3021087
3021343
3021599
3021855
3022111
3022367
3022623
3014688
3014944
3015200
3015456
3015712
3015968
3016224
3016480
3016736
3016992
3017248
3017504
3017760
3018016
3018272
3018528
3018784
3019040
3019296
3019552
3019808
3020064
3020320
3020576
3020832
3021088
3021344
3021600
3021856
3022112
3022368
3022624
3014689
3014945
3015201
3015457
3015713
3015969
3016225
3016481
3016737
3016993
3017249
3017505
3017761
3018017
3018273
3018529
3018785
3019041
3019297
3019553
3019809
3020065
3020321
3020577
3020833
3021089
3021345
3021601
3021857
3022113
3022369
3022625
3014690
3014946
3015202
3015458
3015714
3015970
3016226
3016482
3016738
3016994
3017250
3017506
3017762
3018018
3018274
3018530
3018786
3019042
3019298
3019554
3019810
3020066
3020322
3020578
3020834
3021090
3021346
3021602
3021858
3022114
3022370
3022626
3014691
3014947
3015203
3015459
3015715
3015971
3016227
3016483
3016739
3016995
3017251
3017507
3017763
3018019
3018275
3018531
3018787
3019043
3019299
3019555
3019811
3020067
3020323
3020579
3020835
3021091
3021347
3021603
3021859
3022115
3022371
3022627
3014692
3014948
3015204
3015460
3015716
3015972
3016228
3016484
3016740
3016996
3017252
3017508
3017764
3018020
3018276
3018532
3018788
3019044
3019300
3019556
3019812
3020068
3020324
3020580
3020836
3021092
3021348
3021604
3021860
3022116
3022372
3022628
3014693
3014949
3015205
3015461
3015717
3015973
3016229
3016485
3016741
3016997
3017253
3017509
3017765
3018021
3018277
3018533
3018789
3019045
3019301
3019557
3019813
3020069
3020325
3020581
3020837
3021093
3021349
3021605
3021861
3022117
3022373
3022629
3014694
3014950
3015206
3015462
3015718
3015974
3016230
3016486
3016742
3016998
3017254
3017510
3017766
3018022
3018278
3018534
3018790
3019046
3019302
3019558
3019814
3020070
3020326
3020582
3020838
3021094
3021350
3021606
3021862
3022118
3022374
3022630
3014695
3014951
3015207
3015463
3015719
3015975
3016231
3016487
3016743
3016999
3017255
3017511
3017767
3018023
3018279
3018535
3018791
3019047
3019303
3019559
3019815
3020071
3020327
3020583
3020839
3021095
3021351
3021607
3021863
3022119
3022375
3022631
3014696
3014952
3015208
3015464
3015720
3015976
3016232
3016488
3016744
3017000
3017256
3017512
3017768
3018024
3018280
3018536
3018792
3019048
3019304
3019560
3019816
3020072
3020328
3020584
3020840
3021096
3021352
3021608
3021864
3022120
3022376
3022632
3014697
3014953
3015209
3015465
3015721
3015977
3016233
3016489
3016745
3017001
3017257
3017513
3017769
3018025
3018281
3018537
3018793
3019049
3019305
3019561
3019817
3020073
3020329
3020585
3020841
3021097
3021353
3021609
3021865
3022121
3022377
3022633
3014698
3014954
3015210
3015466
3015722
3015978
3016234
3016490
3016746
3017002
3017258
3017514
3017770
3018026
3018282
3018538
3018794
3019050
3019306
3019562
3019818
3020074
3020330
3020586
3020842
3021098
3021354
3021610
3021866
3022122
3022378
3022634
3014699
3014955
3015211
3015467
3015723
3015979
3016235
3016491
3016747
3017003
3017259
3017515
3017771
3018027
3018283
3018539
3018795
3019051
3019307
3019563
3019819
3020075
3020331
3020587
3020843
3021099
3021355
3021611
3021867
3022123
3022379
3022635
3014700
3014956
3015212
3015468
3015724
3015980
3016236
3016492
3016748
3017004
3017260
3017516
3017772
3018028
3018284
3018540
3018796
3019052
3019308
3019564
3019820
3020076
3020332
3020588
3020844
3021100
3021356
3021612
3021868
3022124
3022380
3022636
3014701
3014957
3015213
3015469
3015725
3015981
3016237
3016493
3016749
3017005
3017261
3017517
3017773
3018029
3018285
3018541
3018797
3019053
3019309
3019565
3019821
3020077
3020333
3020589
3020845
3021101
3021357
3021613
3021869
3022125
3022381
3022637
3014702
3014958
3015214
3015470
3015726
3015982
3016238
3016494
3016750
3017006
3017262
3017518
3017774
3018030
3018286
3018542
3018798
3019054
3019310
3019566
3019822
3020078
3020334
3020590
3020846
3021102
3021358
3021614
3021870
3022126
3022382
3022638
3014703
3014959
3015215
3015471
3015727
3015983
3016239
3016495
3016751
3017007
3017263
3017519
3017775
3018031
3018287
3018543
3018799
3019055
3019311
3019567
3019823
3020079
3020335
3020591
3020847
3021103
3021359
3021615
3021871
3022127
3022383
3022639
3014704
3014960
3015216
3015472
3015728
3015984
3016240
3016496
3016752
3017008
3017264
3017520
3017776
3018032
3018288
3018544
3018800
3019056
3019312
3019568
3019824
3020080
3020336
3020592
3020848
3021104
3021360
3021616
3021872
3022128
3022384
3022640
3014705
3014961
3015217
3015473
3015729
3015985
3016241
3016497
3016753
3017009
3017265
3017521
3017777
3018033
3018289
3018545
3018801
3019057
3019313
3019569
3019825
3020081
3020337
3020593
3020849
3021105
3021361
3021617
3021873
3022129
3022385
3022641
3014706
3014962
3015218
3015474
3015730
3015986
3016242
3016498
3016754
3017010
3017266
3017522
3017778
3018034
3018290
3018546
3018802
3019058
3019314
3019570
3019826
3020082
3020338
3020594
3020850
3021106
3021362
3021618
3021874
3022130
3022386
3022642
3014707
3014963
3015219
3015475
3015731
3015987
3016243
3016499
3016755
3017011
3017267
3017523
3017779
3018035
3018291
3018547
3018803
3019059
3019315
3019571
3019827
3020083
3020339
3020595
3020851
3021107
3021363
3021619
3021875
3022131
3022387
3022643
3014708
3014964
3015220
3015476
3015732
3015988
3016244
3016500
3016756
3017012
3017268
3017524
3017780
3018036
3018292
3018548
3018804
3019060
3019316
3019572
3019828
3020084
3020340
3020596
3020852
3021108
3021364
3021620
3021876
3022132
3022388
3022644
3014709
3014965
3015221
3015477
3015733
3015989
3016245
3016501
3016757
3017013
3017269
3017525
3017781
3018037
3018293
3018549
3018805
3019061
3019317
3019573
3019829
3020085
3020341
3020597
3020853
3021109
3021365
3021621
3021877
3022133
3022389
3022645
3014710
3014966
3015222
3015478
3015734
3015990
3016246
3016502
3016758
3017014
3017270
3017526
3017782
3018038
3018294
3018550
3018806
3019062
3019318
3019574
3019830
3020086
3020342
3020598
3020854
3021110
3021366
3021622
3021878
3022134
3022390
3022646
3014711
3014967
3015223
3015479
3015735
3015991
3016247
3016503
3016759
3017015
3017271
3017527
3017783
3018039
3018295
3018551
3018807
3019063
3019319
3019575
3019831
3020087
3020343
3020599
3020855
3021111
3021367
3021623
3021879
3022135
3022391
3022647
3014712
3014968
3015224
3015480
3015736
3015992
3016248
3016504
3016760
3017016
3017272
3017528
3017784
3018040
3018296
3018552
3018808
3019064
3019320
3019576
3019832
3020088
3020344
3020600
3020856
3021112
3021368
3021624
3021880
3022136
3022392
3022648
3014713
3014969
3015225
3015481
3015737
3015993
3016249
3016505
3016761
3017017
3017273
3017529
3017785
3018041
3018297
3018553
3018809
3019065
3019321
3019577
3019833
3020089
3020345
3020601
3020857
3021113
3021369
3021625
3021881
3022137
3022393
3022649
3014714
3014970
3015226
3015482
3015738
3015994
3016250
3016506
3016762
3017018
3017274
3017530
3017786
3018042
3018298
3018554
3018810
3019066
3019322
3019578
3019834
3020090
3020346
3020602
3020858
3021114
3021370
3021626
3021882
3022138
3022394
3022650
3014715
3014971
3015227
3015483
3015739
3015995
3016251
3016507
3016763
3017019
3017275
3017531
3017787
3018043
3018299
3018555
3018811
3019067
3019323
3019579
3019835
3020091
3020347
3020603
3020859
3021115
3021371
3021627
3021883
3022139
3022395
3022651
3014716
3014972
3015228
3015484
3015740
3015996
3016252
3016508
3016764
3017020
3017276
3017532
3017788
3018044
3018300
3018556
3018812
3019068
3019324
3019580
3019836
3020092
3020348
3020604
3020860
3021116
3021372
3021628
3021884
3022140
3022396
3022652
3014717
3014973
3015229
3015485
3015741
3015997
3016253
3016509
3016765
3017021
3017277
3017533
3017789
3018045
3018301
3018557
3018813
3019069
3019325
3019581
3019837
3020093
3020349
3020605
3020861
3021117
3021373
3021629
3021885
3022141
3022397
3022653
3014718
3014974
3015230
3015486
3015742
3015998
3016254
3016510
3016766
3017022
3017278
3017534
3017790
3018046
3018302
3018558
3018814
3019070
3019326
3019582
3019838
3020094
3020350
3020606
3020862
3021118
3021374
3021630
3021886
3022142
3022398
3022654
3014719
3014975
3015231
3015487
3015743
3015999
3016255
3016511
3016767
3017023
3017279
3017535
3017791
3018047
3018303
3018559
3018815
3019071
3019327
3019583
3019839
3020095
3020351
3020607
3020863
3021119
3021375
3021631
3021887
3022143
3022399
3022655
3014720
3014976
3015232
3015488
3015744
3016000
3016256
3016512
3016768
3017024
3017280
3017536
3017792
3018048
3018304
3018560
3018816
3019072
3019328
3019584
3019840
3020096
3020352
3020608
3020864
3021120
3021376
3021632
3021888
3022144
3022400
3022656
3014721
3014977
3015233
3015489
3015745
3016001
3016257
3016513
3016769
3017025
3017281
3017537
3017793
3018049
3018305
3018561
3018817
3019073
3019329
3019585
3019841
3020097
3020353
3020609
3020865
3021121
3021377
3021633
3021889
3022145
3022401
3022657
3014722
3014978
3015234
3015490
3015746
3016002
3016258
3016514
3016770
3017026
3017282
3017538
3017794
3018050
3018306
3018562
3018818
3019074
3019330
3019586
3019842
3020098
3020354
3020610
3020866
3021122
3021378
3021634
3021890
3022146
3022402
3022658
3014723
3014979
3015235
3015491
3015747
3016003
3016259
3016515
3016771
3017027
3017283
3017539
3017795
3018051
3018307
3018563
3018819
3019075
3019331
3019587
3019843
3020099
3020355
3020611
3020867
3021123
3021379
3021635
3021891
3022147
3022403
3022659
3014724
3014980
3015236
3015492
3015748
3016004
3016260
3016516
3016772
3017028
3017284
3017540
3017796
3018052
3018308
3018564
3018820
3019076
3019332
3019588
3019844
3020100
3020356
3020612
3020868
3021124
3021380
3021636
3021892
3022148
3022404
3022660
3014725
3014981
3015237
3015493
3015749
3016005
3016261
3016517
3016773
3017029
3017285
3017541
3017797
3018053
3018309
3018565
3018821
3019077
3019333
3019589
3019845
3020101
3020357
3020613
3020869
3021125
3021381
3021637
3021893
3022149
3022405
3022661
3014726
3014982
3015238
3015494
3015750
3016006
3016262
3016518
3016774
3017030
3017286
3017542
3017798
3018054
3018310
3018566
3018822
3019078
3019334
3019590
3019846
3020102
3020358
3020614
3020870
3021126
3021382
3021638
3021894
3022150
3022406
3022662
3014727
3014983
3015239
3015495
3015751
3016007
3016263
3016519
3016775
3017031
3017287
3017543
3017799
3018055
3018311
3018567
3018823
3019079
3019335
3019591
3019847
3020103
3020359
3020615
3020871
3021127
3021383
3021639
3021895
3022151
3022407
3022663
3014728
3014984
3015240
3015496
3015752
3016008
3016264
3016520
3016776
3017032
3017288
3017544
3017800
3018056
3018312
3018568
3018824
3019080
3019336
3019592
3019848
3020104
3020360
3020616
3020872
3021128
3021384
3021640
3021896
3022152
3022408
3022664
3014729
3014985
3015241
3015497
3015753
3016009
3016265
3016521
3016777
3017033
3017289
3017545
3017801
3018057
3018313
3018569
3018825
3019081
3019337
3019593
3019849
3020105
3020361
3020617
3020873
3021129
3021385
3021641
3021897
3022153
3022409
3022665
3014730
3014986
3015242
3015498
3015754
3016010
3016266
3016522
3016778
3017034
3017290
3017546
3017802
3018058
3018314
3018570
3018826
3019082
3019338
3019594
3019850
3020106
3020362
3020618
3020874
3021130
3021386
3021642
3021898
3022154
3022410
3022666
3014731
3014987
3015243
3015499
3015755
3016011
3016267
3016523
3016779
3017035
3017291
3017547
3017803
3018059
3018315
3018571
3018827
3019083
3019339
3019595
3019851
3020107
3020363
3020619
3020875
3021131
3021387
3021643
3021899
3022155
3022411
3022667
3014732
3014988
3015244
3015500
3015756
3016012
3016268
3016524
3016780
3017036
3017292
3017548
3017804
3018060
3018316
3018572
3018828
3019084
3019340
3019596
3019852
3020108
3020364
3020620
3020876
3021132
3021388
3021644
3021900
3022156
3022412
3022668
3014733
3014989
3015245
3015501
3015757
3016013
3016269
3016525
3016781
3017037
3017293
3017549
3017805
3018061
3018317
3018573
3018829
3019085
3019341
3019597
3019853
3020109
3020365
3020621
3020877
3021133
3021389
3021645
3021901
3022157
3022413
3022669
3014734
3014990
3015246
3015502
3015758
3016014
3016270
3016526
3016782
3017038
3017294
3017550
3017806
3018062
3018318
3018574
3018830
3019086
3019342
3019598
3019854
3020110
3020366
3020622
3020878
3021134
3021390
3021646
3021902
3022158
3022414
3022670
3014735
3014991
3015247
3015503
3015759
3016015
3016271
3016527
3016783
3017039
3017295
3017551
3017807
3018063
3018319
3018575
3018831
3019087
3019343
3019599
3019855
3020111
3020367
3020623
3020879
3021135
3021391
3021647
3021903
3022159
3022415
3022671
3014736
3014992
3015248
3015504
3015760
3016016
3016272
3016528
3016784
3017040
3017296
3017552
3017808
3018064
3018320
3018576
3018832
3019088
3019344
3019600
3019856
3020112
3020368
3020624
3020880
3021136
3021392
3021648
3021904
3022160
3022416
3022672
3014737
3014993
3015249
3015505
3015761
3016017
3016273
3016529
3016785
3017041
3017297
3017553
3017809
3018065
3018321
3018577
3018833
3019089
3019345
3019601
3019857
3020113
3020369
3020625
3020881
3021137
3021393
3021649
3021905
3022161
3022417
3022673
3014738
3014994
3015250
3015506
3015762
3016018
3016274
3016530
3016786
3017042
3017298
3017554
3017810
3018066
3018322
3018578
3018834
3019090
3019346
3019602
3019858
3020114
3020370
3020626
3020882
3021138
3021394
3021650
3021906
3022162
3022418
3022674
3014739
3014995
3015251
3015507
3015763
3016019
3016275
3016531
3016787
3017043
3017299
3017555
3017811
3018067
3018323
3018579
3018835
3019091
3019347
3019603
3019859
3020115
3020371
3020627
3020883
3021139
3021395
3021651
3021907
3022163
3022419
3022675
3014740
3014996
3015252
3015508
3015764
3016020
3016276
3016532
3016788
3017044
3017300
3017556
3017812
3018068
3018324
3018580
3018836
3019092
3019348
3019604
3019860
3020116
3020372
3020628
3020884
3021140
3021396
3021652
3021908
3022164
3022420
3022676
3014741
3014997
3015253
3015509
3015765
3016021
3016277
3016533
3016789
3017045
3017301
3017557
3017813
3018069
3018325
3018581
3018837
3019093
3019349
3019605
3019861
3020117
3020373
3020629
3020885
3021141
3021397
3021653
3021909
3022165
3022421
3022677
3014742
3014998
3015254
3015510
3015766
3016022
3016278
3016534
3016790
3017046
3017302
3017558
3017814
3018070
3018326
3018582
3018838
3019094
3019350
3019606
3019862
3020118
3020374
3020630
3020886
3021142
3021398
3021654
3021910
3022166
3022422
3022678
3014743
3014999
3015255
3015511
3015767
3016023
3016279
3016535
3016791
3017047
3017303
3017559
3017815
3018071
3018327
3018583
3018839
3019095
3019351
3019607
3019863
3020119
3020375
3020631
3020887
3021143
3021399
3021655
3021911
3022167
3022423
3022679
3014744
3015000
3015256
3015512
3015768
3016024
3016280
3016536
3016792
3017048
3017304
3017560
3017816
3018072
3018328
3018584
3018840
3019096
3019352
3019608
3019864
3020120
3020376
3020632
3020888
3021144
3021400
3021656
3021912
3022168
3022424
3022680
3014745
3015001
3015257
3015513
3015769
3016025
3016281
3016537
3016793
3017049
3017305
3017561
3017817
3018073
3018329
3018585
3018841
3019097
3019353
3019609
3019865
3020121
3020377
3020633
3020889
3021145
3021401
3021657
3021913
3022169
3022425
3022681
3014746
3015002
3015258
3015514
3015770
3016026
3016282
3016538
3016794
3017050
3017306
3017562
3017818
3018074
3018330
3018586
3018842
3019098
3019354
3019610
3019866
3020122
3020378
3020634
3020890
3021146
3021402
3021658
3021914
3022170
3022426
3022682
3014747
3015003
3015259
3015515
3015771
3016027
3016283
3016539
3016795
3017051
3017307
3017563
3017819
3018075
3018331
3018587
3018843
3019099
3019355
3019611
3019867
3020123
3020379
3020635
3020891
3021147
3021403
3021659
3021915
3022171
3022427
3022683
3014748
3015004
3015260
3015516
3015772
3016028
3016284
3016540
3016796
3017052
3017308
3017564
3017820
3018076
3018332
3018588
3018844
3019100
3019356
3019612
3019868
3020124
3020380
3020636
3020892
3021148
3021404
3021660
3021916
3022172
3022428
3022684
3014749
3015005
3015261
3015517
3015773
3016029
3016285
3016541
3016797
3017053
3017309
3017565
3017821
3018077
3018333
3018589
3018845
3019101
3019357
3019613
3019869
3020125
3020381
3020637
3020893
3021149
3021405
3021661
3021917
3022173
3022429
3022685
3014750
3015006
3015262
3015518
3015774
3016030
3016286
3016542
3016798
3017054
3017310
3017566
3017822
3018078
3018334
3018590
3018846
3019102
3019358
3019614
3019870
3020126
3020382
3020638
3020894
3021150
3021406
3021662
3021918
3022174
3022430
3022686
3014751
3015007
3015263
3015519
3015775
3016031
3016287
3016543
3016799
3017055
3017311
3017567
3017823
3018079
3018335
3018591
3018847
3019103
3019359
3019615
3019871
3020127
3020383
3020639
3020895
3021151
3021407
3021663
3021919
3022175
3022431
3022687
