605501
1129770
1255971
1255206
1387567
1583394
1583139
1583651
1583396
1584676
1583398
1583654
1583911
1585707
1589039
1589040
1653808
1787679
1779751
1846843
3029039
3029040
3090737
3090738
3090740
3090485
3090997
3090742
3092022
3092534
3091255
3092535
3091256
3091769
3094329
