0 0 1.0 0.0 0.0
0 1 1.99613010122 0.440093070269 1.13832604885
0 2 1.0 0.0 0.0
1 0 1.0 1.0 1.0
1 1 0.604062189413 0.942714810371 1.75605463982
1 2 1.0 1.0 1.0
2 0 1.0 1.0 1.0
2 1 0.630813186198 0.934925854206 1.69559466839
2 2 2.0 0.5 1.0
3 0 1.0 1.0 1.0
3 1 0.603162852233 0.926259756088 1.7899159193
3 2 1.0 0.0 0.0
4 0 0.5 1.0 2.0
4 1 0.62682927777 0.919455230236 1.73508250713
4 2 1.0 0.0 0.0
5 0 0.5 1.0 2.0
5 1 0.590285829487 0.929133832455 1.82330513
5 2 0.5 1.0 2.0
6 0 1.0 0.0 0.0
6 1 0.552461135418 0.925361454487 1.95608103275
6 2 1.0 1.0 1.0
7 0 1.0 1.0 1.0
7 1 0.611787178839 0.890795648098 1.83493864536
7 2 0.25 1.0 4.0
8 0 0.5 1.0 2.0
8 1 0.52025369274 0.942980706692 2.03836536407
8 2 1.0 1.0 1.0
9 0 1.0 1.0 1.0
9 1 0.649601234308 0.908118784428 1.69515919685
9 2 0.5 1.0 2.0
10 0 1.0 1.0 1.0
10 1 0.577977524312 0.924183487892 1.87210774422
10 2 0.5 1.0 2.0
11 0 0.5 1.0 2.0
11 1 0.59773830736 0.927413105965 1.80391335487
11 2 1.0 1.0 1.0
12 0 1.0 1.0 1.0
12 1 0.679611677229 0.89729732275 1.63984513283
12 2 1.0 1.0 1.0
13 0 0.5 1.0 2.0
13 1 0.629836940518 0.928516209126 1.70994591713
13 2 1.0 1.0 1.0
14 0 0.5 1.0 2.0
14 1 0.66409266287 0.898061990738 1.67673718929
14 2 1.0 1.0 1.0
15 0 0.5 1.0 2.0
15 1 0.630987278344 0.918667674065 1.7251265049
15 2 1.0 1.0 1.0
16 0 1.0 1.0 1.0
16 1 0.547528532994 0.948688268661 1.92517280579
16 2 1.0 1.0 1.0
17 0 0.2 1.0 5.0
17 1 0.578369925841 0.946960926056 1.82583808899
17 2 1.0 1.0 1.0
18 0 1.0 1.0 1.0
18 1 0.65018634534 0.910584628582 1.68904745579
18 2 2.0 0.5 1.0
19 0 0.5 1.0 2.0
19 1 0.62693796335 0.927357017994 1.72000002861
19 2 1.0 1.0 1.0
20 0 1.0 1.0 1.0
20 1 0.634897357375 0.92879140377 1.69581437111
20 2 1.0 1.0 1.0
21 0 0.5 1.0 2.0
21 1 0.626840472517 0.921062767506 1.73202335835
21 2 0.5 1.0 2.0
22 0 1.0 0.0 0.0
22 1 0.451060231964 0.835652530193 2.65301537514
22 2 0.5 1.0 2.0
23 0 1.0 1.0 1.0
23 1 0.602577852114 0.946969687939 1.75247061253
23 2 0.5 1.0 2.0
24 0 1.0 1.0 1.0
24 1 0.592418287619 0.935127973557 1.80509674549
24 2 0.5 1.0 2.0
25 0 1.0 0.0 0.0
25 1 0.649632877157 0.951175391674 1.61834597588
25 2 0.5 1.0 2.0
26 0 1.0 1.0 1.0
26 1 1.0 0.0 0.0
26 2 1.0 1.0 1.0
27 0 0.5 1.0 2.0
27 1 0.587649385086 0.922881364822 1.84389352798
27 2 0.5 1.0 2.0
28 0 0.5 1.0 2.0
28 1 0.65418502237 0.91630589962 1.66824150085
28 2 1.0 1.0 1.0
29 0 1.0 1.0 1.0
29 1 0.620742086741 0.953454196453 1.68961977959
29 2 0.5 1.0 2.0
30 0 1.0 1.0 1.0
30 1 0.467637827486 0.971214532852 2.2017865181
30 2 1.0 0.0 0.0
31 0 1.0 1.0 1.0
31 1 0.359400983508 0.797839522362 3.48742747307
31 2 1.0 0.0 0.0
32 0 1.0 0.0 0.0
32 1 0.594873031328 0.94844943285 1.77239918709
32 2 0.666666666667 1.0 1.5
33 0 0.2 1.0 5.0
33 1 0.576550659721 0.966863393784 1.79389667511
33 2 0.666666666667 1.0 1.5
34 0 1.0 0.0 0.0
34 1 0.625137204616 0.948639154434 1.68625640869
34 2 1.0 1.0 1.0
35 0 1.0 0.0 0.0
35 1 0.557462191777 0.955447554588 1.87749052048
35 2 1.0 0.666666686535 1.5
36 0 1.0 0.0 0.0
36 1 3.49066674268 0.221925139427 1.29087781906
36 2 0.666666666667 1.0 1.5
37 0 1.0 1.0 1.0
37 1 0.639471627981 0.942891836166 1.65850520134
37 2 0.272727266816 0.666666686535 5.5
38 0 1.0 0.0 0.0
38 1 0.50759697422 0.952343463898 2.06865167618
38 2 1.0 1.0 1.0
39 0 1.0 0.5 2.0
39 1 0.627406304243 0.960839748383 1.65882349014
39 2 1.0 1.0 1.0
40 0 0.333333333333 1.0 3.0
40 1 0.753872663708 0.88089799881 1.50583148003
40 2 0.600000014305 0.666666686535 2.5
41 0 1.0 1.0 1.0
41 1 0.596351189563 0.967112839222 1.73388695717
41 2 4.0 0.25 1.0
42 0 1.0 1.0 1.0
42 1 0.531910611507 0.951930344105 1.97495031357
42 2 1.0 1.0 1.0
43 0 1.0 1.0 1.0
43 1 0.578294568299 0.92723095417 1.86493182182
43 2 1.33333333333 0.75 1.0
44 0 1.0 1.0 1.0
44 1 0.654997448678 0.906274199486 1.68461537361
44 2 1.4999999553 0.666666686535 1.0
45 0 0.4 1.0 2.5
45 1 0.569044988809 0.949459850788 1.85087358952
45 2 1.4999999553 0.666666686535 1.0
46 0 1.0 1.0 1.0
46 1 0.591158938489 0.938008546829 1.80338704586
46 2 0.5 1.0 2.0
47 0 0.5 1.0 2.0
47 1 0.748182635733 0.879518091679 1.51966416836
47 2 1.0 0.0 0.0
48 0 0.666666666667 1.0 1.5
48 1 0.551459621888 0.92310667038 1.9644203186
48 2 1.0 1.0 1.0
49 0 1.0 1.0 1.0
49 1 0.734867882294 0.832559943199 1.63446354866
49 2 1.0 0.800000011921 1.25
50 0 1.0 1.0 1.0
50 1 0.757012529599 0.875 1.50969386101
50 2 1.0 1.0 1.0
51 0 1.0 1.0 1.0
51 1 0.578025474964 0.951790630817 1.81765556335
51 2 0.749999977648 1.0 1.33333337307
52 0 0.5 1.0 2.0
52 1 0.489301305281 0.930388212204 2.19664263725
52 2 1.24999998137 0.600000023842 1.33333337307
53 0 1.0 0.0 0.0
53 1 1.0 0.0 0.0
53 2 1.0 0.0 0.0
