1131866
1132122
1132378
1132634
1132890
1133146
1133402
1133658
1133914
1134170
1134426
1134682
1134938
1135194
1135450
1135706
1135962
1136218
1136474
1136730
1136986
1137242
1137498
1137754
1138010
1138266
1138522
1131611
1131867
1132123
1132379
1132635
1132891
1133147
1133403
1133659
1133915
1134171
1134427
1134683
1134939
1135195
1135451
1135707
1135963
1136219
1136475
1136731
1136987
1137243
1137499
1137755
1138011
1138267
1138523
1131612
1131868
1132124
1132380
1132636
1132892
1133148
1133404
1133660
1133916
1134172
1134428
1134684
1134940
1135196
1135452
1135708
1135964
1136220
1136476
1136732
1136988
1137244
1137500
1137756
1138012
1138268
1138524
1131613
1131869
1132125
1132381
1132637
1132893
1133149
1133405
1133661
1133917
1134173
1134429
1134685
1134941
1135197
1135453
1135709
1135965
1136221
1136477
1136733
1136989
1137245
1137501
1137757
1138013
1138269
1138525
1131614
1131870
1132126
1132382
1132638
1132894
1133150
1133406
1133662
1133918
1134174
1134430
1134686
1134942
1135198
1135454
1135710
1135966
1136222
1136478
1136734
1136990
1137246
1137502
1137758
1138014
1138270
1138526
1131615
1131871
1132127
1132383
1132639
1132895
1133151
1133407
1133663
1133919
1134175
1134431
1134687
1134943
1135199
1135455
1135711
1135967
1136223
1136479
1136735
1136991
1137247
1137503
1137759
1138015
1138271
1138527
