0 0 1.0 0.0 0.0
0 1 0.779467699687 0.902438998222 1.42162168026
0 2 1.0 0.0 0.0
1 0 1.0 0.0 0.0
1 1 0.702098828732 0.904532313347 1.57462692261
1 2 1.0 0.0 0.0
2 0 1.0 0.0 0.0
2 1 0.704005457074 0.917068481445 1.54889595509
2 2 1.0 0.0 0.0
3 0 1.0 0.0 0.0
3 1 0.533059968204 0.921153843403 2.03653454781
3 2 1.0 0.0 0.0
4 0 1.0 0.0 0.0
4 1 0.682666666667 0.908203125 1.61290323734
4 2 1.0 0.0 0.0
5 0 1.0 0.0 0.0
5 1 0.618084483697 0.933589994907 1.73298966885
5 2 1.0 0.0 0.0
6 0 1.0 0.0 0.0
6 1 0.568712670343 0.936962723732 1.87665653229
6 2 1.0 0.0 0.0
7 0 1.0 0.0 0.0
7 1 0.636421343818 0.899302065372 1.74722838402
7 2 1.0 0.0 0.0
8 0 1.0 0.0 0.0
8 1 0.677506797393 0.920000016689 1.60434782505
8 2 0.25 1.0 4.0
9 0 1.0 0.0 0.0
9 1 0.703448273549 0.926470577717 1.53439152241
9 2 0.125 1.0 8.0
10 0 1.0 0.0 0.0
10 1 1.14940023962 0.616698265076 1.41076922417
10 2 1.0 0.0 0.0
11 0 1.0 0.0 0.0
11 1 0.639650874149 0.950292408466 1.64512825012
11 2 1.0 0.0 0.0
12 0 1.0 0.0 0.0
12 1 0.564444447734 0.965551197529 1.83486235142
12 2 1.0 0.0 0.0
13 0 1.0 0.0 0.0
13 1 0.67536815081 0.926660060883 1.59786093235
13 2 1.0 1.0 1.0
14 0 1.0 0.0 0.0
14 1 0.696547160082 0.898951411247 1.59703075886
14 2 1.0 0.0 0.0
15 0 1.0 0.0 0.0
15 1 0.846586323495 0.846299827099 1.39573991299
15 2 1.0 0.0 0.0
16 0 1.0 0.0 0.0
16 1 0.615339564625 0.94100856781 1.72699701786
16 2 1.0 0.0 0.0
17 0 1.0 0.0 0.0
17 1 0.615249257269 0.954242110252 1.70329666138
17 2 1.0 1.0 1.0
18 0 1.0 0.0 0.0
18 1 0.588857927964 0.941343426704 1.80402004719
18 2 1.0 0.0 0.0
19 0 1.0 0.0 0.0
19 1 0.718367324569 0.90625 1.53605020046
19 2 1.0 1.0 1.0
20 0 1.0 0.0 0.0
20 1 0.683495170945 0.922348499298 1.58624231815
20 2 1.0 0.0 0.0
21 0 1.0 0.0 0.0
21 1 0.610139865226 0.954154729843 1.71771776676
21 2 1.0 0.0 0.0
22 0 1.0 0.0 0.0
22 1 0.757834773278 0.880639076233 1.49839913845
22 2 1.0 1.0 1.0
23 0 1.0 0.0 0.0
23 1 0.670096468365 0.944337785244 1.58028459549
23 2 0.5 1.0 2.0
24 0 1.0 0.0 0.0
24 1 0.667305232867 0.909090936184 1.64842104912
24 2 0.333333333333 1.0 3.0
25 0 1.0 0.0 0.0
25 1 0.719971601462 0.936821341515 1.48261332512
25 2 1.0 1.0 1.0
26 0 1.0 0.0 0.0
26 1 1.0 0.784015238285 1.27548539639
26 2 0.5 1.0 2.0
27 0 1.0 0.0 0.0
27 1 0.690169507925 0.906679749489 1.59804987907
27 2 0.600000014305 1.0 1.66666662693
28 0 1.0 0.0 0.0
28 1 0.788897551379 0.842418253422 1.50470590591
28 2 0.571428571429 1.0 1.75
29 0 1.0 0.0 0.0
29 1 0.65804198377 0.943676948547 1.61036038399
29 2 0.666666666667 0.75 2.0
30 0 1.0 0.0 0.0
30 1 0.486022534562 0.974772930145 2.11076593399
30 2 1.0 1.0 1.0
31 0 1.0 0.0 0.0
31 1 0.392400151036 0.964426875114 2.64241814613
31 2 1.0 1.0 1.0
32 0 1.0 0.0 0.0
32 1 1.02206622127 0.672227680683 1.45547449589
32 2 1.0 0.75 1.33333337307
33 0 1.0 0.0 0.0
33 1 0.565714303826 0.972727298737 1.817237854
33 2 2.49999996275 0.40000000596 1.0
34 0 1.0 0.0 0.0
34 1 0.70310294188 0.925777316093 1.53629469872
34 2 0.41666665011 1.0 2.40000009537
35 0 1.0 0.0 0.0
35 1 0.749601278197 0.907446801662 1.47010552883
35 2 1.0 0.75 1.33333337307
36 0 1.0 0.0 0.0
36 1 0.5877088359 0.962436556816 1.76793253422
36 2 0.83333330022 1.0 1.20000004768
37 0 1.0 0.0 0.0
37 1 0.72509361224 0.931818187237 1.48004436493
37 2 0.874999960884 0.857142865658 1.33333337307
38 0 1.0 0.0 0.0
38 1 2.26973683053 0.385507255793 1.14285719395
38 2 1.33333333333 0.625 1.20000004768
39 0 1.4999999553 0.666666686535 1.0
39 1 0.730596992437 0.927477002144 1.47577095032
39 2 1.66666660044 0.600000023842 1.0
40 0 1.33333333333 0.75 1.0
40 1 0.750579178217 0.890946507454 1.49538111687
40 2 0.909090889387 0.800000011921 1.375
41 0 0.666666666667 1.0 1.5
41 1 0.65750526503 0.959271192551 1.58547484875
41 2 2.14285713373 0.40000000596 1.16666662693
42 0 1.0 0.666666686535 1.5
42 1 0.631005741826 0.931979715824 1.70043575764
42 2 1.0 0.625 1.60000002384
43 0 0.428571443168 1.0 2.33333325386
43 1 0.717341500012 0.908413231373 1.53458380699
43 2 1.27272730031 0.571428596973 1.375
44 0 1.0 1.0 1.0
44 1 0.81618291291 0.857758641243 1.42839193344
44 2 0.699999983311 1.0 1.42857146263
45 0 1.0 0.5 2.0
45 1 0.678143721772 0.92494481802 1.59427201748
45 2 0.727272727273 0.875 1.57142853737
46 0 1.4999999553 0.666666686535 1.0
46 1 0.647668381381 0.914285719395 1.68875002861
46 2 2.74999991804 0.272727280855 1.33333337307
47 0 1.24999998137 0.600000023842 1.33333337307
47 1 1.00954655173 0.775413691998 1.27743899822
47 2 3.66666655739 0.181818187237 1.5
48 0 0.857142886337 0.666666686535 1.75
48 1 0.582733795958 0.944444417953 1.81699347496
48 2 0.888888888889 0.75 1.5
49 0 1.4999999553 0.666666686535 1.0
49 1 1.02256532537 0.703832745552 1.38943898678
49 2 0.642857131909 1.0 1.55555558205
50 0 1.0 1.0 1.0
50 1 0.874999960884 0.835714280605 1.36752140522
50 2 0.899999957085 0.888888895512 1.25
51 0 1.0 1.0 1.0
51 1 0.716756768857 0.923076927662 1.51143789291
51 2 1.0 0.888888895512 1.125
52 0 1.0 0.0 0.0
52 1 0.587673592138 0.909896612167 1.87012982368
52 2 1.15384614327 0.533333361149 1.625
53 0 1.0 0.0 0.0
53 1 1.0 0.0 0.0
53 2 1.0 0.0 0.0
