140849
140594
601135
863040
1129770
1254434
1254182
1387567
1450031
1450287
1450032
1583136
1584160
1583394
1584162
1583139
1583651
1583907
1584419
1583396
1584676
1583398
1583654
1583911
1585707
1653808
1910309
2039336
2307100
2368303
2368304
2564399
2563888
2564144
2564400
2563640
2563641
2637871
2638127
2629680
2628155
2703152
2703154
2765851
2766108
2761264
2762035
2764349
2763070
2764606
2762822
2826296
2961432
2963224
2957353
2957355
2957611
2957357
2957613
2957358
2957359
2957615
2958127
2958383
3030312
3029039
3029040
3097137
3097393
3089202
3089205
3090485
3090997
3089974
3090742
3091254
3092534
3089719
3091255
3092535
3090232
3090233
3094329
3097401
3091258
3089467
3089468
3089982
3088959
3089983
3090239
3089216
3090240
3090496
3089730
3089986
3089220
3092037
