808976
809232
809488
809744
810000
810256
810512
810768
808977
809233
809489
809745
810001
810257
810513
810769
808978
809234
809490
809746
810002
810258
810514
810770
808979
809235
809491
809747
810003
810259
810515
810771
808980
809236
809492
809748
810004
810260
810516
810772
808981
809237
809493
809749
810005
810261
810517
810773
808982
809238
809494
809750
810006
810262
810518
810774
808983
809239
809495
809751
810007
810263
810519
810775
2639912
2640168
2640424
2640680
2640936
2641192
2641448
2641704
2639913
2640169
2640425
2640681
2640937
2641193
2641449
2641705
2639914
2640170
2640426
2640682
2640938
2641194
2641450
2641706
2639915
2640171
2640427
2640683
2640939
2641195
2641451
2641707
2639916
2640172
2640428
2640684
2640940
2641196
2641452
2641708
2639917
2640173
2640429
2640685
2640941
2641197
2641453
2641709
2639918
2640174
2640430
2640686
2640942
2641198
2641454
2641710
2639919
2640175
2640431
2640687
2640943
2641199
2641455
2641711
