71768
72024
72280
72536
72792
73048
73304
73560
71769
72025
72281
72537
72793
73049
73305
73561
71770
72026
72282
72538
72794
73050
73306
73562
71771
72027
72283
72539
72795
73051
73307
73563
71772
72028
72284
72540
72796
73052
73308
73564
71773
72029
72285
72541
72797
73053
73309
73565
71774
72030
72286
72542
72798
73054
73310
73566
71775
72031
72287
72543
72799
73055
73311
73567
725048
725304
725560
725816
726072
726328
726584
726840
725049
725305
725561
725817
726073
726329
726585
726841
725050
725306
725562
725818
726074
726330
726586
726842
725051
725307
725563
725819
726075
726331
726587
726843
725052
725308
725564
725820
726076
726332
726588
726844
725053
725309
725565
725821
726077
726333
726589
726845
725054
725310
725566
725822
726078
726334
726590
726846
725055
725311
725567
725823
726079
726335
726591
726847
1970232
1970488
1970744
1971000
1971256
1971512
1971768
1972024
1970233
1970489
1970745
1971001
1971257
1971513
1971769
1972025
1970234
1970490
1970746
1971002
1971258
1971514
1971770
1972026
1970235
1970491
1970747
1971003
1971259
1971515
1971771
1972027
1970236
1970492
1970748
1971004
1971260
1971516
1971772
1972028
1970237
1970493
1970749
1971005
1971261
1971517
1971773
1972029
1970238
1970494
1970750
1971006
1971262
1971518
1971774
1972030
1970239
1970495
1970751
1971007
1971263
1971519
1971775
1972031
2033712
2033968
2034224
2034480
2034736
2034992
2035248
2035504
2033713
2033969
2034225
2034481
2034737
2034993
2035249
2035505
2033714
2033970
2034226
2034482
2034738
2034994
2035250
2035506
2033715
2033971
2034227
2034483
2034739
2034995
2035251
2035507
2033716
2033972
2034228
2034484
2034740
2034996
2035252
2035508
2033717
2033973
2034229
2034485
2034741
2034997
2035253
2035509
2033718
2033974
2034230
2034486
2034742
2034998
2035254
2035510
2033719
2033975
2034231
2034487
2034743
2034999
2035255
2035511
2555928
2556184
2556440
2556696
2556952
2557208
2557464
2557720
2555929
2556185
2556441
2556697
2556953
2557209
2557465
2557721
2555930
2556186
2556442
2556698
2556954
2557210
2557466
2557722
2555931
2556187
2556443
2556699
2556955
2557211
2557467
2557723
2555932
2556188
2556444
2556700
2556956
2557212
2557468
2557724
2555933
2556189
2556445
2556701
2556957
2557213
2557469
2557725
2555934
2556190
2556446
2556702
2556958
2557214
2557470
2557726
2555935
2556191
2556447
2556703
2556959
2557215
2557471
2557727
3414064
3414320
3414576
3414832
3415088
3415344
3415600
3415856
3414065
3414321
3414577
3414833
3415089
3415345
3415601
3415857
3414066
3414322
3414578
3414834
3415090
3415346
3415602
3415858
3414067
3414323
3414579
3414835
3415091
3415347
3415603
3415859
3414068
3414324
3414580
3414836
3415092
3415348
3415604
3415860
3414069
3414325
3414581
3414837
3415093
3415349
3415605
3415861
3414070
3414326
3414582
3414838
3415094
3415350
3415606
3415862
3414071
3414327
3414583
3414839
3415095
3415351
3415607
3415863
