605499
1064752
1129770
1255206
1259564
1387567
1522735
1584676
1583911
1585707
1653808
1846843
2700080
2703152
2703154
2762035
2764349
2763070
2764606
2897180
2896929
2958127
2958383
3030312
3029039
3029040
3090737
3097137
3097393
3089202
3090738
3097394
3098163
3090740
3098164
3089205
3090485
3090997
3097141
3097397
3090742
3092534
3097398
3089975
3090231
3091255
3092535
3096887
3089208
3089464
3090232
3090488
3091256
3096632
3090233
3091769
3094329
3089467
3089730
3157569
