0 0 0.986111158459 0.732394337654 1.3846154213
0 1 0.755255931994 0.896236479282 1.47734940052
0 2 0.794117669333 0.888888895512 1.41666662693
1 0 0.78749997301 0.857142865658 1.48148143291
1 1 0.682201317428 0.917736172676 1.59723782539
1 2 0.6419753162 0.923076927662 1.6875
2 0 0.826666640388 0.887096762657 1.36363637447
2 1 0.728161596409 0.905896544456 1.51598060131
2 2 0.637499989551 0.901960790157 1.73913037777
3 0 0.824999975413 0.878787875175 1.37931036949
3 1 0.676984689214 0.931617021561 1.58556389809
3 2 0.838235308813 0.877192974091 1.36000001431
4 0 0.67326733309 0.926470577717 1.60317456722
4 1 0.674129503364 0.907945036888 1.63379335403
4 2 0.980000009346 0.755102038383 1.35135138035
5 0 0.822222228757 0.824324309826 1.47540986538
5 1 0.641382030693 0.920643627644 1.69352531433
5 2 0.874999960884 0.775510191917 1.4736841917
6 0 0.911392416065 0.763888895512 1.43636357784
6 1 0.584688597823 0.925191283226 1.84860372543
6 2 0.810344845907 0.893617033958 1.38095235825
7 0 0.874999960884 0.818181812763 1.39682543278
7 1 0.680804482466 0.87433296442 1.67996692657
7 2 0.657534229395 0.833333313465 1.82500004768
8 0 0.72222220309 0.884615361691 1.56521737576
8 1 0.663082423677 0.90946418047 1.65823805332
8 2 0.779660985443 0.891304373741 1.43902444839
9 0 0.739130446275 0.89411765337 1.51315784454
9 1 0.705100428342 0.900652348995 1.57467830181
9 2 0.607594922039 0.895833313465 1.83720934391
10 0 0.728813528398 0.802325606346 1.71014487743
10 1 0.611409452472 0.92096310854 1.77592909336
10 2 0.8 0.854166686535 1.46341466904
11 0 0.67669175601 0.87777775526 1.68354427814
11 1 0.619230329162 0.92563688755 1.74464523792
11 2 0.655172405714 0.912280678749 1.67307686806
12 0 0.862903269773 0.831775724888 1.39325845242
12 1 0.758569550758 0.878726661205 1.50020563602
12 2 0.708333315742 0.843137264252 1.67441856861
13 0 0.75625001465 0.892561972141 1.48148143291
13 1 0.663923786947 0.92148578167 1.63453090191
13 2 0.868852457318 0.830188691616 1.38636362553
14 0 0.767441890251 0.946969687939 1.37600004673
14 1 0.673936967198 0.90382373333 1.64171206951
14 2 0.721519009117 0.912280678749 1.51923072338
15 0 1.04605265947 0.748427689075 1.27731096745
15 1 0.645461594318 0.911516606808 1.69967150688
15 2 0.793103412414 0.884057998657 1.42622947693
16 0 0.972067033927 0.741379320621 1.38759684563
16 1 0.595948497527 0.931509137154 1.80137503147
16 2 0.808510605487 0.842105269432 1.46875
17 0 0.748987872687 0.89729732275 1.48795175552
17 1 0.603294202121 0.931500017643 1.77945899963
17 2 0.771739100435 0.901408433914 1.4375
18 0 0.80405402491 0.869747877121 1.42995166779
18 1 0.986973668373 0.765313267708 1.32390010357
18 2 0.747826063701 0.860465109348 1.55405402184
19 0 0.751381239223 0.878676474094 1.51464438438
19 1 0.690777682877 0.903023719788 1.60310709476
19 2 0.905660409951 0.822916686535 1.34177219868
20 0 0.754672888578 0.869969069958 1.52313172817
20 1 0.805473751889 0.860186994076 1.44329702854
20 2 0.762237763509 0.880733966827 1.48958337307
21 0 0.826923090193 0.852713167667 1.418181777
21 1 0.68133144998 0.905586063862 1.62073433399
21 2 0.8 0.916666686535 1.36363637447
22 0 0.763513542418 0.904867231846 1.44743275642
22 1 0.742327230727 0.893960475922 1.5069065094
22 2 0.842105263158 0.899999976158 1.31944441795
23 0 0.771509132818 0.888482630253 1.45884776115
23 1 0.63788295392 0.923954725266 1.69671273232
23 2 0.756653977305 0.894472360611 1.47752809525
24 0 0.908839732616 0.793313086033 1.38697314262
24 1 0.6799331561 0.884141564369 1.66345846653
24 2 0.740983608295 0.889380514622 1.51741290092
25 0 0.531227053785 0.911479949951 2.06525039673
25 1 0.744703604058 0.894460380077 1.50125837326
25 2 0.784090876164 0.898550748825 1.41935479641
26 0 0.699503303596 0.900591731071 1.5873850584
26 1 0.881500754497 0.814852237701 1.39218974113
26 2 0.697368439648 0.911949694157 1.57241380215
27 0 0.726855367912 0.88526314497 1.5541023016
27 1 0.634098096362 0.912610173225 1.72805762291
27 2 0.750519747358 0.900277018547 1.48000001907
28 0 0.571271939308 0.905950069427 1.93220341206
28 1 0.689047930127 0.882354080677 1.64477932453
28 2 0.775665400646 0.872548997402 1.47752809525
29 0 0.770106747714 0.86691313982 1.49786782265
29 1 0.713544175969 0.902276337147 1.55324351788
29 2 0.776951660123 0.906698584557 1.41952502728
30 0 0.89939483949 0.764508008957 1.45434546471
30 1 0.780534355584 0.849371314049 1.50837874413
30 2 0.822380137567 0.829373657703 1.46614587307
31 0 0.776809634779 0.823123395443 1.56394124031
31 1 0.661793198619 0.867135822773 1.74257135391
31 2 0.671664175599 0.872767865658 1.70588231087
32 0 0.887738811206 0.835874438286 1.34763944149
32 1 0.673385963553 0.918381810188 1.61700987816
32 2 0.672699836833 0.92825114727 1.60144925117
33 0 0.794911344149 0.87972843647 1.42998898029
33 1 41672.4987755 2.39966411755e-05 1.0
33 2 1.01339283746 0.733480155468 1.34534537792
34 0 0.760470235342 0.88792270422 1.48095750809
34 1 0.76238725884 0.900207400322 1.45707464218
34 2 0.805504612351 0.915717542171 1.35572135448
35 0 0.759597829888 0.871239483356 1.51104974747
35 1 0.914186673676 0.823169827461 1.32884907722
35 2 0.714057537902 0.832214772701 1.68279564381
36 0 0.765196691831 0.86448597908 1.51171171665
36 1 79297.9982048 1.26106588141e-05 1.0
36 2 0.826966295679 0.875 1.38198757172
37 0 1.19164615447 0.653608262539 1.28391170502
37 1 0.741471420638 0.907517135143 1.48610937595
37 2 0.79605259412 0.845730006695 1.48534202576
38 0 91.6666680041 0.00909090880305 1.20000004768
38 1 0.981386593602 0.793171584606 1.28467333317
38 2 1.13537115067 0.715384602547 1.23118281364
39 0 1.20242215748 0.654676258564 1.27032971382
39 1 0.686171401013 0.928684771061 1.56927502155
39 2 1.00420170733 0.746861934662 1.33333337307
40 0 0.848156167518 0.79156011343 1.48949921131
40 1 0.704105144119 0.908036530018 1.56408071518
40 2 0.741978579354 0.841441452503 1.60171306133
41 0 0.817910433209 0.848540127277 1.44086027145
41 1 0.763063560007 0.909169077873 1.44143366814
41 2 0.852575500008 0.84375 1.39012348652
42 0 0.85498112716 0.823008835316 1.42114698887
42 1 0.615577668009 0.932441174984 1.74219071865
42 2 0.935871770316 0.826552450657 1.29274606705
43 0 0.781094561181 0.794586002827 1.61122238636
43 1 0.723776250626 0.882260918617 1.56602478027
43 2 0.769811340147 0.848039209843 1.53179192543
44 0 1.0 0.0 0.0
44 1 0.521557807863 0.956612110138 2.0042951107
44 2 2.12953368928 0.372262775898 1.26143789291
45 0 0.89108913836 0.80740737915 1.38990831375
45 1 0.706837482894 0.914720594883 1.54664969444
45 2 0.866108754643 0.845410645008 1.3657143116
46 0 0.936507956001 0.75 1.42372882366
46 1 1.00949066656 0.77909129858 1.27147948742
46 2 1.07200000409 0.671641767025 1.38888883591
47 0 1.23371643227 0.661490678787 1.22535216808
47 1 0.911483325074 0.836628258228 1.31135046482
47 2 0.971428544959 0.784313738346 1.3125
48 0 0.76661262019 0.765327692032 1.7044198513
48 1 0.859989979813 0.805781185627 1.44307696819
48 2 0.925925889133 0.808000028133 1.33663368225
49 0 0.742659772271 0.865116298199 1.55645155907
49 1 0.663271638835 0.900714993477 1.67386782169
49 2 0.8 0.883928596973 1.41414141655
50 0 0.79856117094 0.834234237671 1.50107991695
50 1 0.782591602901 0.874002218246 1.46201646328
50 2 0.944099367697 0.75 1.41228067875
51 0 0.87291395917 0.767647087574 1.49233710766
51 1 0.66879403442 0.938099741936 1.59389090538
51 2 0.904761940714 0.789473712444 1.39999997616
52 0 5.80975605364 0.146935343742 1.17142856121
52 1 0.677526770383 0.913427174091 1.61584472656
52 2 2.22377617836 0.333333343267 1.34905660152
53 0 1.15018318233 0.565817415714 1.53658533096
53 1 0.877790180031 0.775435984135 1.46914041042
53 2 1.16363636364 0.590624988079 1.45502650738
