868432
868688
868944
869200
869456
869712
869968
870224
868433
868689
868945
869201
869457
869713
869969
870225
868434
868690
868946
869202
869458
869714
869970
870226
868435
868691
868947
869203
869459
869715
869971
870227
868436
868692
868948
869204
869460
869716
869972
870228
868437
868693
868949
869205
869461
869717
869973
870229
868438
868694
868950
869206
869462
869718
869974
870230
868439
868695
868951
869207
869463
869719
869975
870231
1187888
1188144
1188400
1188656
1188912
1189168
1189424
1189680
1187889
1188145
1188401
1188657
1188913
1189169
1189425
1189681
1187890
1188146
1188402
1188658
1188914
1189170
1189426
1189682
1187891
1188147
1188403
1188659
1188915
1189171
1189427
1189683
1187892
1188148
1188404
1188660
1188916
1189172
1189428
1189684
1187893
1188149
1188405
1188661
1188917
1189173
1189429
1189685
1187894
1188150
1188406
1188662
1188918
1189174
1189430
1189686
1187895
1188151
1188407
1188663
1188919
1189175
1189431
1189687
2107440
2107696
2107952
2108208
2108464
2108720
2108976
2109232
2107441
2107697
2107953
2108209
2108465
2108721
2108977
2109233
2107442
2107698
2107954
2108210
2108466
2108722
2108978
2109234
2107443
2107699
2107955
2108211
2108467
2108723
2108979
2109235
2107444
2107700
2107956
2108212
2108468
2108724
2108980
2109236
2107445
2107701
2107957
2108213
2108469
2108725
2108981
2109237
2107446
2107702
2107958
2108214
2108470
2108726
2108982
2109238
2107447
2107703
2107959
2108215
2108471
2108727
2108983
2109239
3350584
3350840
3351096
3351352
3351608
3351864
3352120
3352376
3350585
3350841
3351097
3351353
3351609
3351865
3352121
3352377
3350586
3350842
3351098
3351354
3351610
3351866
3352122
3352378
3350587
3350843
3351099
3351355
3351611
3351867
3352123
3352379
3350588
3350844
3351100
3351356
3351612
3351868
3352124
3352380
3350589
3350845
3351101
3351357
3351613
3351869
3352125
3352381
3350590
3350846
3351102
3351358
3351614
3351870
3352126
3352382
3350591
3350847
3351103
3351359
3351615
3351871
3352127
3352383
