0 0 1.0 1.0 1.0
0 1 0.746033493658 0.907987356186 1.47625672817
0 2 0.71428572645 0.800000011921 1.75
1 0 1.0 1.0 1.0
1 1 0.662565294047 0.932150125504 1.61914396286
1 2 0.600000014305 1.0 1.66666662693
2 0 0.222222222222 1.0 4.5
2 1 0.70911148127 0.921713888645 1.52999269962
2 2 0.8 1.0 1.25
3 0 1.0 1.0 1.0
3 1 0.621688109202 0.925237715244 1.73849761486
3 2 0.428571443168 1.0 2.33333325386
4 0 1.0 1.0 1.0
4 1 0.728997203541 0.899668633938 1.52472507954
4 2 0.600000014305 0.666666686535 2.5
5 0 1.4999999553 0.666666686535 1.0
5 1 0.656159797278 0.927820920944 1.64257872105
5 2 0.428571443168 1.0 2.33333325386
6 0 2.0 0.5 1.0
6 1 0.61375709843 0.919257342815 1.77241885662
6 2 1.33333333333 0.75 1.0
7 0 0.666666666667 1.0 1.5
7 1 0.707213501707 0.874860823154 1.6162571907
7 2 0.5 1.0 2.0
8 0 1.0 0.666666686535 1.5
8 1 0.722585393359 0.896249830723 1.5441224575
8 2 0.666666666667 1.0 1.5
9 0 1.0 0.0 0.0
9 1 0.722630335387 0.907829165459 1.52433252335
9 2 0.333333333333 1.0 3.0
10 0 2.0 0.5 1.0
10 1 0.676215707494 0.915755867958 1.61486053467
10 2 1.0 1.0 1.0
11 0 2.0 0.5 1.0
11 1 0.682793912603 0.917363703251 1.59649944305
11 2 1.0 1.0 1.0
12 0 1.0 0.0 0.0
12 1 0.62004618965 0.943044781685 1.71018707752
12 2 1.0 0.0 0.0
13 0 2.0 0.5 1.0
13 1 0.705684453371 0.925885856152 1.53049528599
13 2 1.0 0.0 0.0
14 0 1.0 0.666666686535 1.5
14 1 0.76005509547 0.891472518444 1.47586619854
14 2 1.0 0.0 0.0
15 0 2.0 0.5 1.0
15 1 1.14604012271 0.677045226097 1.28879094124
15 2 1.0 0.0 0.0
16 0 1.0 1.0 1.0
16 1 0.708559475785 0.914843559265 1.54268360138
16 2 0.2 1.0 5.0
17 0 0.749999977648 1.0 1.33333337307
17 1 0.658959928981 0.941640675068 1.61159455776
17 2 1.0 1.0 1.0
18 0 1.4999999553 0.666666686535 1.0
18 1 0.626698249332 0.942671060562 1.69270527363
18 2 0.666666666667 1.0 1.5
19 0 0.374999988824 0.666666686535 4.0
19 1 0.986541412743 0.776698112488 1.30506598949
19 2 2.0 0.5 1.0
20 0 1.33333333333 0.5 1.5
20 1 0.692426053506 0.926707923412 1.55841720104
20 2 1.0 1.0 1.0
21 0 0.5 1.0 2.0
21 1 0.634291176166 0.938895940781 1.67916691303
21 2 0.25 1.0 4.0
22 0 1.0 0.5 2.0
22 1 0.755340055325 0.892191886902 1.48388147354
22 2 1.0 0.0 0.0
23 0 0.5 1.0 2.0
23 1 0.663254752408 0.939535558224 1.60474634171
23 2 1.0 0.0 0.0
24 0 1.0 0.0 0.0
24 1 0.668527537744 0.906984627247 1.64922833443
24 2 1.0 1.0 1.0
25 0 1.0 1.0 1.0
25 1 0.716786411508 0.93479436636 1.49243056774
25 2 1.0 0.0 0.0
26 0 1.0 0.0 0.0
26 1 1.02212020715 0.749904453754 1.30464422703
26 2 1.0 1.0 1.0
27 0 2.0 0.5 1.0
27 1 0.693405823211 0.905049026012 1.59345722198
27 2 1.0 1.0 1.0
28 0 0.4 1.0 2.5
28 1 0.738888713703 0.883660256863 1.53156578541
28 2 1.0 1.0 1.0
29 0 1.4999999553 0.666666686535 1.0
29 1 0.675283827271 0.9451841712 1.56674098969
29 2 1.0 1.0 1.0
30 0 2.0 0.5 1.0
30 1 0.779460094824 0.86505651474 1.48307001591
30 2 1.0 1.0 1.0
31 0 0.666666666667 1.0 1.5
31 1 1.12548563909 0.676118135452 1.31412732601
31 2 1.0 1.0 1.0
32 0 2.0 0.5 1.0
32 1 1.07845721858 0.622309207916 1.49001574516
32 2 1.0 0.0 0.0
33 0 2.0 0.5 1.0
33 1 0.580670406971 0.967686712742 1.77965378761
33 2 1.0 0.0 0.0
34 0 2.99999991059 0.333333343267 1.0
34 1 0.737128384785 0.918981254101 1.47621703148
34 2 1.0 1.0 1.0
35 0 2.0 0.5 1.0
35 1 0.743797723672 0.900332033634 1.49328410625
35 2 2.0 0.5 1.0
36 0 1.0 1.0 1.0
36 1 0.583794055058 0.953367114067 1.79671895504
36 2 2.0 0.5 1.0
37 0 1.0 0.0 0.0
37 1 0.768534230734 0.900697290897 1.44463431835
37 2 1.0 1.0 1.0
38 0 1.0 0.0 0.0
38 1 0.808512241933 0.846501648426 1.46111893654
38 2 0.5 1.0 2.0
39 0 1.0 0.0 0.0
39 1 0.695660885089 0.940310657024 1.5287309885
39 2 1.08333332795 0.769230782986 1.20000004768
40 0 1.0 0.0 0.0
40 1 0.878432883764 0.832592368126 1.36728489399
40 2 0.83333330022 0.866666674614 1.3846154213
41 0 1.0 0.0 0.0
41 1 0.650485122201 0.963859558105 1.59495663643
41 2 0.812499969732 0.923076927662 1.33333337307
42 0 1.0 0.0 0.0
42 1 0.615030300951 0.938493490219 1.73249590397
42 2 1.20000002861 0.666666686535 1.25
43 0 1.0 0.0 0.0
43 1 0.724810241445 0.890019357204 1.55015897751
43 2 0.8 0.833333313465 1.5
44 0 1.0 0.0 0.0
44 1 0.759365347659 0.870514690876 1.51277077198
44 2 0.83333330022 0.899999976158 1.33333337307
45 0 1.0 0.0 0.0
45 1 0.670978653179 0.923437952995 1.61392581463
45 2 0.888888888889 1.0 1.125
46 0 1.0 0.0 0.0
46 1 0.832224558151 0.713814616203 1.68334853649
46 2 0.692307705005 0.777777791023 1.85714280605
47 0 1.0 0.0 0.0
47 1 0.951407880666 0.794368505478 1.32315647602
47 2 0.692307705005 0.888888895512 1.625
48 0 1.0 0.0 0.0
48 1 0.575436224227 0.91878092289 1.89143240452
48 2 1.11111114055 0.800000011921 1.125
49 0 1.0 0.0 0.0
49 1 0.913147146676 0.758091449738 1.44456684589
49 2 0.705882372741 0.75 1.88888883591
50 0 1.0 0.0 0.0
50 1 0.837559316578 0.837874412537 1.42496919632
50 2 0.727272727273 0.875 1.57142853737
51 0 9.99999985099 0.10000000149 1.0
51 1 0.661773933645 0.93990367651 1.60770726204
51 2 0.899999957085 0.777777791023 1.42857146263
52 0 1.0 0.0 0.0
52 1 1.16572405457 0.642076313496 1.33603417873
52 2 4.49999996647 0.166666671634 1.33333337307
53 0 1.0 0.0 0.0
53 1 1.0 0.0 0.0
53 2 1.0 0.0 0.0
