0 0 0.956953667315 0.778546690941 1.34222221375
0 1 0.919632086124 0.776559114456 1.4002686739
0 2 1.02790697503 0.678733050823 1.4333332777
1 0 0.82544378902 0.867383539677 1.39669418335
1 1 0.813337457254 0.850402235985 1.44578874111
1 2 0.655052278957 0.87234044075 1.75
2 0 0.772727247605 0.904411792755 1.43089425564
2 1 0.664883574151 0.952012360096 1.57983529568
2 2 0.741007172002 0.800970852375 1.68484842777
3 0 0.836858031359 0.866425991058 1.3791667223
3 1 0.649019435052 0.876905560493 1.75707173347
3 2 0.655063276806 0.835748791695 1.82658958435
4 0 0.618604638815 0.917293250561 1.76229512691
4 1 0.902995709036 0.752003014088 1.47263383865
4 2 0.767999976563 0.78125 1.66666662693
5 0 0.749340399562 0.866197168827 1.54065036774
5 1 0.710926456141 0.851963341236 1.65102791786
5 2 0.673835138116 0.765957474709 1.9375
6 0 1.0 0.0 0.0
6 1 0.930074302983 0.665918946266 1.61458528042
6 2 0.650793665571 0.829268276691 1.85294115543
7 0 0.812286678844 0.865546226501 1.42233014107
7 1 0.76304023845 0.877022981644 1.49431300163
7 2 0.627062717126 0.778947353363 2.0472972393
8 0 0.638961015615 0.93902438879 1.66666662693
8 1 0.773098776117 0.876599490643 1.4755834341
8 2 0.755102015098 0.797297298908 1.66101694107
9 0 0.753799365877 0.895161271095 1.48198199272
9 1 0.75971388358 0.865910053253 1.52011752129
9 2 0.68571426703 0.881944417953 1.65354335308
10 0 0.732673288081 0.881756782532 1.5478926897
10 1 0.768766091551 0.824985682964 1.57673740387
10 2 0.880503139373 0.75 1.51428568363
11 0 0.759803889157 0.835483849049 1.57528960705
11 1 0.6921031621 0.911718070507 1.5847786665
11 2 0.79069766565 0.786764681339 1.60747659206
12 0 0.862686563787 0.833910048008 1.39004147053
12 1 0.664510043728 0.909752428532 1.65415132046
12 2 0.795774617825 0.858407080173 1.46391749382
13 0 0.701970454274 0.891228079796 1.59842514992
13 1 0.884033124601 0.763425469398 1.48171544075
13 2 0.828358211903 0.792792797089 1.52272725105
14 0 0.779891271252 0.909407675266 1.40996170044
14 1 0.904681831319 0.767836332321 1.43957877159
14 2 0.767741946112 0.84033614397 1.54999995232
15 0 0.862804842301 0.844522953033 1.37238490582
15 1 0.858090873912 0.801950871944 1.45317852497
15 2 0.884353724285 0.800000011921 1.41346156597
16 0 0.830409391459 0.873239457607 1.37903225422
16 1 0.979610902648 0.677203536034 1.5073953867
16 2 0.91129033835 0.769911527634 1.42528736591
17 0 0.724999987036 0.92337167263 1.49377596378
17 1 0.72302615367 0.895773887634 1.54400098324
17 2 0.848920851661 0.813559293747 1.44791662693
18 0 1.0 0.766917288303 1.30392158031
18 1 0.635269262171 0.828426599503 1.90015113354
18 2 0.816793887927 0.869158864021 1.40860211849
19 0 0.746951216526 0.946938753128 1.41379308701
19 1 0.774060553022 0.874831497669 1.47672843933
19 2 0.929133866989 0.779660999775 1.38043475151
20 0 0.911971850509 0.772200763226 1.41999995708
20 1 0.932385602644 0.720956981182 1.48763048649
20 2 0.687499979511 0.878787875175 1.65517246723
21 0 0.682080947416 0.906779646873 1.61682248116
21 1 0.665869078735 0.903742015362 1.6617538929
21 2 0.888888888889 0.816666662693 1.3775510788
22 0 0.433164128596 0.88671875 2.60352420807
22 1 0.739792128893 0.867865502834 1.55753517151
22 2 0.984126999024 0.774193525314 1.3125
23 0 0.753709219609 0.885826766491 1.49777781963
23 1 0.886066806581 0.747280478477 1.51025366783
23 2 0.841726626646 0.846153855324 1.40404045582
24 0 1.09311739097 0.729629635811 1.25380706787
24 1 1.13779189832 0.60366153717 1.45594060421
24 2 0.944444394406 0.756302535534 1.39999997616
25 0 0.643589749098 0.972111582756 1.59836065769
25 1 0.762056964989 0.889282405376 1.47561430931
25 2 0.905797124141 0.815999984741 1.35294115543
26 0 0.766081872947 0.885496199131 1.47413790226
26 1 0.972722830497 0.722720861435 1.42246079445
26 2 0.794520516806 0.836206912994 1.50515460968
27 0 0.873786391586 0.785185158253 1.45754718781
27 1 0.597619923894 0.882430195808 1.89624547958
27 2 0.725714255064 0.834645688534 1.65094339848
28 0 0.596069862169 0.94505494833 1.77519381046
28 1 0.993905954496 0.692438840866 1.45302569866
28 2 0.918699155828 0.796460151672 1.36666667461
29 0 0.794326262625 0.888392865658 1.41708540916
29 1 0.8710513746 0.795619249344 1.44294893742
29 2 0.952000002724 0.789915978909 1.32978725433
30 0 0.825095078726 0.880184352398 1.376963377
30 1 0.752382551443 0.762132227421 1.74393761158
30 2 1.1711712001 0.67692309618 1.26136362553
31 0 0.79194629732 0.877118647099 1.4396135807
31 1 0.446765620458 0.908733487129 2.46310949326
31 2 0.86923076684 0.840707957745 1.36842107773
32 0 1.0 0.0 0.0
32 1 0.789270091927 0.89793753624 1.41100394726
32 2 0.682634723717 0.947368443012 1.5462962389
33 0 0.532338319508 0.957943916321 1.96097564697
33 1 0.558985114402 0.956378281116 1.87055313587
33 2 0.990740764799 0.831775724888 1.21348309517
34 0 0.669515653144 0.944680869579 1.58108103275
34 1 0.711478657272 0.927755713463 1.51497149467
34 2 1.01834861272 0.792792797089 1.23863637447
35 0 0.602067177157 0.95708155632 1.73542606831
35 1 0.658802603888 0.938812971115 1.61683475971
35 2 0.899999957085 0.808080792427 1.375
36 0 0.736694658683 0.908745229244 1.49372386932
36 1 0.637059568043 0.901258289814 1.74168932438
36 2 0.990000048387 0.868686854839 1.16279065609
37 0 0.842592558181 0.846153855324 1.40259742737
37 1 0.766068020777 0.876247107983 1.48972499371
37 2 0.830769191155 0.842592597008 1.42857146263
38 0 0.869706867408 0.891385793686 1.2899159193
38 1 0.926695604105 0.807012677193 1.33715748787
38 2 1.01052633608 0.729166686535 1.35714280605
39 0 1.10843370628 0.699275374413 1.29015541077
39 1 0.85113760887 0.831498742104 1.41298854351
39 2 1.61797745874 0.472222208977 1.30882358551
40 0 0.785046711479 0.888888895512 1.43303573132
40 1 1.16550653587 0.629080414772 1.36388921738
40 2 0.913043482993 0.821428596973 1.33333337307
41 0 0.771341428092 0.893280625343 1.45132744312
41 1 1.3563509302 0.500402629375 1.4733581543
41 2 11.3000000421 0.0530973449349 1.66666662693
42 0 1.14912280942 0.721374034882 1.20634925365
42 1 0.850886549785 0.81939804554 1.43427824974
42 2 0.967741965255 0.766666650772 1.34782612324
43 0 0.717791423117 0.893162369728 1.55980861187
43 1 0.776411176364 0.877496778965 1.46778583527
43 2 0.863636368316 0.868421077728 1.33333337307
44 0 0.789682530717 0.909547746181 1.39226520061
44 1 0.96200118441 0.757089555264 1.37302076817
44 2 0.806451606701 0.879999995232 1.40909087658
45 0 0.834024873576 0.880596995354 1.36158192158
45 1 0.732006514979 0.916018188 1.4913547039
45 2 1.02083332319 0.73469388485 1.33333337307
46 0 1.20408163851 0.635593235493 1.30666661263
46 1 0.733019332289 0.877725541592 1.55426776409
46 2 1.0 0.0 0.0
47 0 1.38271608194 0.638392865658 1.13286709785
47 1 2.36771225518 0.343233913183 1.23049795628
47 2 1.07142856687 0.600000023842 1.55555558205
48 0 0.803636373042 0.864253401756 1.4397906065
48 1 0.651528756409 0.923901259899 1.66127240658
48 2 0.844827563634 0.775510191917 1.5263158083
49 0 0.612903235234 0.929824590683 1.75471699238
49 1 0.693669697406 0.911818861961 1.58102488518
49 2 0.857142886337 0.800000011921 1.45833337307
50 0 0.688524617075 0.936507940292 1.55084741116
50 1 0.827510990262 0.825170040131 1.46447765827
50 2 0.857142886337 0.916666686535 1.27272725105
51 0 0.779069766362 0.873134315014 1.47008550167
51 1 0.957422442191 0.704702556133 1.48214435577
51 2 0.678571437238 0.921052634716 1.60000002384
52 0 4.13999988032 0.188405796885 1.28205132484
52 1 0.602638500364 0.915287494659 1.8129491806
52 2 3.09090899042 0.308823525906 1.04761910439
53 0 1.0 0.0 0.0
53 1 1.0 0.0 0.0
53 2 1.0 0.0 0.0
