542760
543016
543272
543528
543784
544040
544296
544552
542761
543017
543273
543529
543785
544041
544297
544553
542762
543018
543274
543530
543786
544042
544298
544554
542763
543019
543275
543531
543787
544043
544299
544555
542764
543020
543276
543532
543788
544044
544300
544556
542765
543021
543277
543533
543789
544045
544301
544557
542766
543022
543278
543534
543790
544046
544302
544558
542767
543023
543279
543535
543791
544047
544303
544559
540760
541016
541272
541528
541784
542040
542296
542552
540761
541017
541273
541529
541785
542041
542297
542553
540762
541018
541274
541530
541786
542042
542298
542554
540763
541019
541275
541531
541787
542043
542299
542555
540764
541020
541276
541532
541788
542044
542300
542556
540765
541021
541277
541533
541789
542045
542301
542557
540766
541022
541278
541534
541790
542046
542302
542558
540767
541023
541279
541535
541791
542047
542303
542559
800776
801032
801288
801544
801800
802056
802312
802568
800777
801033
801289
801545
801801
802057
802313
802569
800778
801034
801290
801546
801802
802058
802314
802570
800779
801035
801291
801547
801803
802059
802315
802571
800780
801036
801292
801548
801804
802060
802316
802572
800781
801037
801293
801549
801805
802061
802317
802573
800782
801038
801294
801550
801806
802062
802318
802574
800783
801039
801295
801551
801807
802063
802319
802575
800848
801104
801360
801616
801872
802128
802384
802640
800849
801105
801361
801617
801873
802129
802385
802641
800850
801106
801362
801618
801874
802130
802386
802642
800851
801107
801363
801619
801875
802131
802387
802643
800852
801108
801364
801620
801876
802132
802388
802644
800853
801109
801365
801621
801877
802133
802389
802645
800854
801110
801366
801622
801878
802134
802390
802646
800855
801111
801367
801623
801879
802135
802391
802647
856064
856320
856576
856832
857088
857344
857600
857856
856065
856321
856577
856833
857089
857345
857601
857857
856066
856322
856578
856834
857090
857346
857602
857858
856067
856323
856579
856835
857091
857347
857603
857859
856068
856324
856580
856836
857092
857348
857604
857860
856069
856325
856581
856837
857093
857349
857605
857861
856070
856326
856582
856838
857094
857350
857606
857862
856071
856327
856583
856839
857095
857351
857607
857863
933960
934216
934472
934728
934984
935240
935496
935752
933961
934217
934473
934729
934985
935241
935497
935753
933962
934218
934474
934730
934986
935242
935498
935754
933963
934219
934475
934731
934987
935243
935499
935755
933964
934220
934476
934732
934988
935244
935500
935756
933965
934221
934477
934733
934989
935245
935501
935757
933966
934222
934478
934734
934990
935246
935502
935758
933967
934223
934479
934735
934991
935247
935503
935759
1054736
1054992
1055248
1055504
1055760
1056016
1056272
1056528
1054737
1054993
1055249
1055505
1055761
1056017
1056273
1056529
1054738
1054994
1055250
1055506
1055762
1056018
1056274
1056530
1054739
1054995
1055251
1055507
1055763
1056019
1056275
1056531
1054740
1054996
1055252
1055508
1055764
1056020
1056276
1056532
1054741
1054997
1055253
1055509
1055765
1056021
1056277
1056533
1054742
1054998
1055254
1055510
1055766
1056022
1056278
1056534
1054743
1054999
1055255
1055511
1055767
1056023
1056279
1056535
1187888
1188144
1188400
1188656
1188912
1189168
1189424
1189680
1187889
1188145
1188401
1188657
1188913
1189169
1189425
1189681
1187890
1188146
1188402
1188658
1188914
1189170
1189426
1189682
1187891
1188147
1188403
1188659
1188915
1189171
1189427
1189683
1187892
1188148
1188404
1188660
1188916
1189172
1189428
1189684
1187893
1188149
1188405
1188661
1188917
1189173
1189429
1189685
1187894
1188150
1188406
1188662
1188918
1189174
1189430
1189686
1187895
1188151
1188407
1188663
1188919
1189175
1189431
1189687
1323040
1323296
1323552
1323808
1324064
1324320
1324576
1324832
1323041
1323297
1323553
1323809
1324065
1324321
1324577
1324833
1323042
1323298
1323554
1323810
1324066
1324322
1324578
1324834
1323043
1323299
1323555
1323811
1324067
1324323
1324579
1324835
1323044
1323300
1323556
1323812
1324068
1324324
1324580
1324836
1323045
1323301
1323557
1323813
1324069
1324325
1324581
1324837
1323046
1323302
1323558
1323814
1324070
1324326
1324582
1324838
1323047
1323303
1323559
1323815
1324071
1324327
1324583
1324839
2107440
2107696
2107952
2108208
2108464
2108720
2108976
2109232
2107441
2107697
2107953
2108209
2108465
2108721
2108977
2109233
2107442
2107698
2107954
2108210
2108466
2108722
2108978
2109234
2107443
2107699
2107955
2108211
2108467
2108723
2108979
2109235
2107444
2107700
2107956
2108212
2108468
2108724
2108980
2109236
2107445
2107701
2107957
2108213
2108469
2108725
2108981
2109237
2107446
2107702
2107958
2108214
2108470
2108726
2108982
2109238
2107447
2107703
2107959
2108215
2108471
2108727
2108983
2109239
3024952
3025208
3025464
3025720
3025976
3026232
3026488
3026744
3024953
3025209
3025465
3025721
3025977
3026233
3026489
3026745
3024954
3025210
3025466
3025722
3025978
3026234
3026490
3026746
3024955
3025211
3025467
3025723
3025979
3026235
3026491
3026747
3024956
3025212
3025468
3025724
3025980
3026236
3026492
3026748
3024957
3025213
3025469
3025725
3025981
3026237
3026493
3026749
3024958
3025214
3025470
3025726
3025982
3026238
3026494
3026750
3024959
3025215
3025471
3025727
3025983
3026239
3026495
3026751
