140849
140594
601135
863040
1064752
1129770
1255206
1387567
1522735
1584160
1583394
1584162
1583139
1583651
1583907
1584419
1583396
1584676
1583398
1583654
1583911
1585707
1653808
1654326
1779751
1910309
2564399
2564144
2564400
2637871
2638127
2629680
2639920
2628155
2703152
2703154
2765851
2766108
2761264
2762035
2764349
2763070
2764606
2899759
2899760
2963224
2958127
2958383
3030312
3029039
3029040
3090737
3089202
3090738
3090740
3089205
3090485
3090997
3089462
3089974
3090742
3091254
3089719
3089975
3090231
3091255
3091256
3094329
3091258
3157569
