2367488
2367744
2368000
2368256
2368512
2368768
2369024
2369280
2369536
2369792
2370048
2370304
2370560
2370816
2371072
2371328
2371584
2371840
2372096
2372352
2372608
2372864
2373120
2373376
2373632
2373888
2374144
2374400
2374656
2374912
2375168
2375424
2367489
2367745
2368001
2368257
2368513
2368769
2369025
2369281
2369537
2369793
2370049
2370305
2370561
2370817
2371073
2371329
2371585
2371841
2372097
2372353
2372609
2372865
2373121
2373377
2373633
2373889
2374145
2374401
2374657
2374913
2375169
2375425
2367490
2367746
2368002
2368258
2368514
2368770
2369026
2369282
2369538
2369794
2370050
2370306
2370562
2370818
2371074
2371330
2371586
2371842
2372098
2372354
2372610
2372866
2373122
2373378
2373634
2373890
2374146
2374402
2374658
2374914
2375170
2375426
2367491
2367747
2368003
2368259
2368515
2368771
2369027
2369283
2369539
2369795
2370051
2370307
2370563
2370819
2371075
2371331
2371587
2371843
2372099
2372355
2372611
2372867
2373123
2373379
2373635
2373891
2374147
2374403
2374659
2374915
2375171
2375427
2367492
2367748
2368004
2368260
2368516
2368772
2369028
2369284
2369540
2369796
2370052
2370308
2370564
2370820
2371076
2371332
2371588
2371844
2372100
2372356
2372612
2372868
2373124
2373380
2373636
2373892
2374148
2374404
2374660
2374916
2375172
2375428
2367493
2367749
2368005
2368261
2368517
2368773
2369029
2369285
2369541
2369797
2370053
2370309
2370565
2370821
2371077
2371333
2371589
2371845
2372101
2372357
2372613
2372869
2373125
2373381
2373637
2373893
2374149
2374405
2374661
2374917
2375173
2375429
2367494
2367750
2368006
2368262
2368518
2368774
2369030
2369286
2369542
2369798
2370054
2370310
2370566
2370822
2371078
2371334
2371590
2371846
2372102
2372358
2372614
2372870
2373126
2373382
2373638
2373894
2374150
2374406
2374662
2374918
2375174
2375430
2367495
2367751
2368007
2368263
2368519
2368775
2369031
2369287
2369543
2369799
2370055
2370311
2370567
2370823
2371079
2371335
2371591
2371847
2372103
2372359
2372615
2372871
2373127
2373383
2373639
2373895
2374151
2374407
2374663
2374919
2375175
2375431
2367496
2367752
2368008
2368264
2368520
2368776
2369032
2369288
2369544
2369800
2370056
2370312
2370568
2370824
2371080
2371336
2371592
2371848
2372104
2372360
2372616
2372872
2373128
2373384
2373640
2373896
2374152
2374408
2374664
2374920
2375176
2375432
2367497
2367753
2368009
2368265
2368521
2368777
2369033
2369289
2369545
2369801
2370057
2370313
2370569
2370825
2371081
2371337
2371593
2371849
2372105
2372361
2372617
2372873
2373129
2373385
2373641
2373897
2374153
2374409
2374665
2374921
2375177
2375433
2367498
2367754
2368010
2368266
2368522
2368778
2369034
2369290
2369546
2369802
2370058
2370314
2370570
2370826
2371082
2371338
2371594
2371850
2372106
2372362
2372618
2372874
2373130
2373386
2373642
2373898
2374154
2374410
2374666
2374922
2375178
2375434
2367499
2367755
2368011
2368267
2368523
2368779
2369035
2369291
2369547
2369803
2370059
2370315
2370571
2370827
2371083
2371339
2371595
2371851
2372107
2372363
2372619
2372875
2373131
2373387
2373643
2373899
2374155
2374411
2374667
2374923
2375179
2375435
2367500
2367756
2368012
2368268
2368524
2368780
2369036
2369292
2369548
2369804
2370060
2370316
2370572
2370828
2371084
2371340
2371596
2371852
2372108
2372364
2372620
2372876
2373132
2373388
2373644
2373900
2374156
2374412
2374668
2374924
2375180
2375436
2367501
2367757
2368013
2368269
2368525
2368781
2369037
2369293
2369549
2369805
2370061
2370317
2370573
2370829
2371085
2371341
2371597
2371853
2372109
2372365
2372621
2372877
2373133
2373389
2373645
2373901
2374157
2374413
2374669
2374925
2375181
2375437
2367502
2367758
2368014
2368270
2368526
2368782
2369038
2369294
2369550
2369806
2370062
2370318
2370574
2370830
2371086
2371342
2371598
2371854
2372110
2372366
2372622
2372878
2373134
2373390
2373646
2373902
2374158
2374414
2374670
2374926
2375182
2375438
2367503
2367759
2368015
2368271
2368527
2368783
2369039
2369295
2369551
2369807
2370063
2370319
2370575
2370831
2371087
2371343
2371599
2371855
2372111
2372367
2372623
2372879
2373135
2373391
2373647
2373903
2374159
2374415
2374671
2374927
2375183
2375439
2367504
2367760
2368016
2368272
2368528
2368784
2369040
2369296
2369552
2369808
2370064
2370320
2370576
2370832
2371088
2371344
2371600
2371856
2372112
2372368
2372624
2372880
2373136
2373392
2373648
2373904
2374160
2374416
2374672
2374928
2375184
2375440
2367505
2367761
2368017
2368273
2368529
2368785
2369041
2369297
2369553
2369809
2370065
2370321
2370577
2370833
2371089
2371345
2371601
2371857
2372113
2372369
2372625
2372881
2373137
2373393
2373649
2373905
2374161
2374417
2374673
2374929
2375185
2375441
2367506
2367762
2368018
2368274
2368530
2368786
2369042
2369298
2369554
2369810
2370066
2370322
2370578
2370834
2371090
2371346
2371602
2371858
2372114
2372370
2372626
2372882
2373138
2373394
2373650
2373906
2374162
2374418
2374674
2374930
2375186
2375442
2367507
2367763
2368019
2368275
2368531
2368787
2369043
2369299
2369555
2369811
2370067
2370323
2370579
2370835
2371091
2371347
2371603
2371859
2372115
2372371
2372627
2372883
2373139
2373395
2373651
2373907
2374163
2374419
2374675
2374931
2375187
2375443
2367508
2367764
2368020
2368276
2368532
2368788
2369044
2369300
2369556
2369812
2370068
2370324
2370580
2370836
2371092
2371348
2371604
2371860
2372116
2372372
2372628
2372884
2373140
2373396
2373652
2373908
2374164
2374420
2374676
2374932
2375188
2375444
2367509
2367765
2368021
2368277
2368533
2368789
2369045
2369301
2369557
2369813
2370069
2370325
2370581
2370837
2371093
2371349
2371605
2371861
2372117
2372373
2372629
2372885
2373141
2373397
2373653
2373909
2374165
2374421
2374677
2374933
2375189
2375445
2367510
2367766
2368022
2368278
2368534
2368790
2369046
2369302
2369558
2369814
2370070
2370326
2370582
2370838
2371094
2371350
2371606
2371862
2372118
2372374
2372630
2372886
2373142
2373398
2373654
2373910
2374166
2374422
2374678
2374934
2375190
2375446
2367511
2367767
2368023
2368279
2368535
2368791
2369047
2369303
2369559
2369815
2370071
2370327
2370583
2370839
2371095
2371351
2371607
2371863
2372119
2372375
2372631
2372887
2373143
2373399
2373655
2373911
2374167
2374423
2374679
2374935
2375191
2375447
2367512
2367768
2368024
2368280
2368536
2368792
2369048
2369304
2369560
2369816
2370072
2370328
2370584
2370840
2371096
2371352
2371608
2371864
2372120
2372376
2372632
2372888
2373144
2373400
2373656
2373912
2374168
2374424
2374680
2374936
2375192
2375448
2367513
2367769
2368025
2368281
2368537
2368793
2369049
2369305
2369561
2369817
2370073
2370329
2370585
2370841
2371097
2371353
2371609
2371865
2372121
2372377
2372633
2372889
2373145
2373401
2373657
2373913
2374169
2374425
2374681
2374937
2375193
2375449
2367514
2367770
2368026
2368282
2368538
2368794
2369050
2369306
2369562
2369818
2370074
2370330
2370586
2370842
2371098
2371354
2371610
2371866
2372122
2372378
2372634
2372890
2373146
2373402
2373658
2373914
2374170
2374426
2374682
2374938
2375194
2375450
2367515
2367771
2368027
2368283
2368539
2368795
2369051
2369307
2369563
2369819
2370075
2370331
2370587
2370843
2371099
2371355
2371611
2371867
2372123
2372379
2372635
2372891
2373147
2373403
2373659
2373915
2374171
2374427
2374683
2374939
2375195
2375451
2367516
2367772
2368028
2368284
2368540
2368796
2369052
2369308
2369564
2369820
2370076
2370332
2370588
2370844
2371100
2371356
2371612
2371868
2372124
2372380
2372636
2372892
2373148
2373404
2373660
2373916
2374172
2374428
2374684
2374940
2375196
2375452
2367517
2367773
2368029
2368285
2368541
2368797
2369053
2369309
2369565
2369821
2370077
2370333
2370589
2370845
2371101
2371357
2371613
2371869
2372125
2372381
2372637
2372893
2373149
2373405
2373661
2373917
2374173
2374429
2374685
2374941
2375197
2375453
2367518
2367774
2368030
2368286
2368542
2368798
2369054
2369310
2369566
2369822
2370078
2370334
2370590
2370846
2371102
2371358
2371614
2371870
2372126
2372382
2372638
2372894
2373150
2373406
2373662
2373918
2374174
2374430
2374686
2374942
2375198
2375454
2367519
2367775
2368031
2368287
2368543
2368799
2369055
2369311
2369567
2369823
2370079
2370335
2370591
2370847
2371103
2371359
2371615
2371871
2372127
2372383
2372639
2372895
2373151
2373407
2373663
2373919
2374175
2374431
2374687
2374943
2375199
2375455
2367520
2367776
2368032
2368288
2368544
2368800
2369056
2369312
2369568
2369824
2370080
2370336
2370592
2370848
2371104
2371360
2371616
2371872
2372128
2372384
2372640
2372896
2373152
2373408
2373664
2373920
2374176
2374432
2374688
2374944
2375200
2375456
2367521
2367777
2368033
2368289
2368545
2368801
2369057
2369313
2369569
2369825
2370081
2370337
2370593
2370849
2371105
2371361
2371617
2371873
2372129
2372385
2372641
2372897
2373153
2373409
2373665
2373921
2374177
2374433
2374689
2374945
2375201
2375457
2367522
2367778
2368034
2368290
2368546
2368802
2369058
2369314
2369570
2369826
2370082
2370338
2370594
2370850
2371106
2371362
2371618
2371874
2372130
2372386
2372642
2372898
2373154
2373410
2373666
2373922
2374178
2374434
2374690
2374946
2375202
2375458
2367523
2367779
2368035
2368291
2368547
2368803
2369059
2369315
2369571
2369827
2370083
2370339
2370595
2370851
2371107
2371363
2371619
2371875
2372131
2372387
2372643
2372899
2373155
2373411
2373667
2373923
2374179
2374435
2374691
2374947
2375203
2375459
2367524
2367780
2368036
2368292
2368548
2368804
2369060
2369316
2369572
2369828
2370084
2370340
2370596
2370852
2371108
2371364
2371620
2371876
2372132
2372388
2372644
2372900
2373156
2373412
2373668
2373924
2374180
2374436
2374692
2374948
2375204
2375460
2367525
2367781
2368037
2368293
2368549
2368805
2369061
2369317
2369573
2369829
2370085
2370341
2370597
2370853
2371109
2371365
2371621
2371877
2372133
2372389
2372645
2372901
2373157
2373413
2373669
2373925
2374181
2374437
2374693
2374949
2375205
2375461
2367526
2367782
2368038
2368294
2368550
2368806
2369062
2369318
2369574
2369830
2370086
2370342
2370598
2370854
2371110
2371366
2371622
2371878
2372134
2372390
2372646
2372902
2373158
2373414
2373670
2373926
2374182
2374438
2374694
2374950
2375206
2375462
2367527
2367783
2368039
2368295
2368551
2368807
2369063
2369319
2369575
2369831
2370087
2370343
2370599
2370855
2371111
2371367
2371623
2371879
2372135
2372391
2372647
2372903
2373159
2373415
2373671
2373927
2374183
2374439
2374695
2374951
2375207
2375463
2367528
2367784
2368040
2368296
2368552
2368808
2369064
2369320
2369576
2369832
2370088
2370344
2370600
2370856
2371112
2371368
2371624
2371880
2372136
2372392
2372648
2372904
2373160
2373416
2373672
2373928
2374184
2374440
2374696
2374952
2375208
2375464
2367529
2367785
2368041
2368297
2368553
2368809
2369065
2369321
2369577
2369833
2370089
2370345
2370601
2370857
2371113
2371369
2371625
2371881
2372137
2372393
2372649
2372905
2373161
2373417
2373673
2373929
2374185
2374441
2374697
2374953
2375209
2375465
2367530
2367786
2368042
2368298
2368554
2368810
2369066
2369322
2369578
2369834
2370090
2370346
2370602
2370858
2371114
2371370
2371626
2371882
2372138
2372394
2372650
2372906
2373162
2373418
2373674
2373930
2374186
2374442
2374698
2374954
2375210
2375466
2367531
2367787
2368043
2368299
2368555
2368811
2369067
2369323
2369579
2369835
2370091
2370347
2370603
2370859
2371115
2371371
2371627
2371883
2372139
2372395
2372651
2372907
2373163
2373419
2373675
2373931
2374187
2374443
2374699
2374955
2375211
2375467
2367532
2367788
2368044
2368300
2368556
2368812
2369068
2369324
2369580
2369836
2370092
2370348
2370604
2370860
2371116
2371372
2371628
2371884
2372140
2372396
2372652
2372908
2373164
2373420
2373676
2373932
2374188
2374444
2374700
2374956
2375212
2375468
2367533
2367789
2368045
2368301
2368557
2368813
2369069
2369325
2369581
2369837
2370093
2370349
2370605
2370861
2371117
2371373
2371629
2371885
2372141
2372397
2372653
2372909
2373165
2373421
2373677
2373933
2374189
2374445
2374701
2374957
2375213
2375469
2367534
2367790
2368046
2368302
2368558
2368814
2369070
2369326
2369582
2369838
2370094
2370350
2370606
2370862
2371118
2371374
2371630
2371886
2372142
2372398
2372654
2372910
2373166
2373422
2373678
2373934
2374190
2374446
2374702
2374958
2375214
2375470
2367535
2367791
2368047
2368303
2368559
2368815
2369071
2369327
2369583
2369839
2370095
2370351
2370607
2370863
2371119
2371375
2371631
2371887
2372143
2372399
2372655
2372911
2373167
2373423
2373679
2373935
2374191
2374447
2374703
2374959
2375215
2375471
2367536
2367792
2368048
2368304
2368560
2368816
2369072
2369328
2369584
2369840
2370096
2370352
2370608
2370864
2371120
2371376
2371632
2371888
2372144
2372400
2372656
2372912
2373168
2373424
2373680
2373936
2374192
2374448
2374704
2374960
2375216
2375472
2367537
2367793
2368049
2368305
2368561
2368817
2369073
2369329
2369585
2369841
2370097
2370353
2370609
2370865
2371121
2371377
2371633
2371889
2372145
2372401
2372657
2372913
2373169
2373425
2373681
2373937
2374193
2374449
2374705
2374961
2375217
2375473
2367538
2367794
2368050
2368306
2368562
2368818
2369074
2369330
2369586
2369842
2370098
2370354
2370610
2370866
2371122
2371378
2371634
2371890
2372146
2372402
2372658
2372914
2373170
2373426
2373682
2373938
2374194
2374450
2374706
2374962
2375218
2375474
2367539
2367795
2368051
2368307
2368563
2368819
2369075
2369331
2369587
2369843
2370099
2370355
2370611
2370867
2371123
2371379
2371635
2371891
2372147
2372403
2372659
2372915
2373171
2373427
2373683
2373939
2374195
2374451
2374707
2374963
2375219
2375475
2367540
2367796
2368052
2368308
2368564
2368820
2369076
2369332
2369588
2369844
2370100
2370356
2370612
2370868
2371124
2371380
2371636
2371892
2372148
2372404
2372660
2372916
2373172
2373428
2373684
2373940
2374196
2374452
2374708
2374964
2375220
2375476
2367541
2367797
2368053
2368309
2368565
2368821
2369077
2369333
2369589
2369845
2370101
2370357
2370613
2370869
2371125
2371381
2371637
2371893
2372149
2372405
2372661
2372917
2373173
2373429
2373685
2373941
2374197
2374453
2374709
2374965
2375221
2375477
2367542
2367798
2368054
2368310
2368566
2368822
2369078
2369334
2369590
2369846
2370102
2370358
2370614
2370870
2371126
2371382
2371638
2371894
2372150
2372406
2372662
2372918
2373174
2373430
2373686
2373942
2374198
2374454
2374710
2374966
2375222
2375478
2367543
2367799
2368055
2368311
2368567
2368823
2369079
2369335
2369591
2369847
2370103
2370359
2370615
2370871
2371127
2371383
2371639
2371895
2372151
2372407
2372663
2372919
2373175
2373431
2373687
2373943
2374199
2374455
2374711
2374967
2375223
2375479
2367544
2367800
2368056
2368312
2368568
2368824
2369080
2369336
2369592
2369848
2370104
2370360
2370616
2370872
2371128
2371384
2371640
2371896
2372152
2372408
2372664
2372920
2373176
2373432
2373688
2373944
2374200
2374456
2374712
2374968
2375224
2375480
2367545
2367801
2368057
2368313
2368569
2368825
2369081
2369337
2369593
2369849
2370105
2370361
2370617
2370873
2371129
2371385
2371641
2371897
2372153
2372409
2372665
2372921
2373177
2373433
2373689
2373945
2374201
2374457
2374713
2374969
2375225
2375481
2367546
2367802
2368058
2368314
2368570
2368826
2369082
2369338
2369594
2369850
2370106
2370362
2370618
2370874
2371130
2371386
2371642
2371898
2372154
2372410
2372666
2372922
2373178
2373434
2373690
2373946
2374202
2374458
2374714
2374970
2375226
2375482
2367547
2367803
2368059
2368315
2368571
2368827
2369083
2369339
2369595
2369851
2370107
2370363
2370619
2370875
2371131
2371387
2371643
2371899
2372155
2372411
2372667
2372923
2373179
2373435
2373691
2373947
2374203
2374459
2374715
2374971
2375227
2375483
2367548
2367804
2368060
2368316
2368572
2368828
2369084
2369340
2369596
2369852
2370108
2370364
2370620
2370876
2371132
2371388
2371644
2371900
2372156
2372412
2372668
2372924
2373180
2373436
2373692
2373948
2374204
2374460
2374716
2374972
2375228
2375484
2367549
2367805
2368061
2368317
2368573
2368829
2369085
2369341
2369597
2369853
2370109
2370365
2370621
2370877
2371133
2371389
2371645
2371901
2372157
2372413
2372669
2372925
2373181
2373437
2373693
2373949
2374205
2374461
2374717
2374973
2375229
2375485
2367550
2367806
2368062
2368318
2368574
2368830
2369086
2369342
2369598
2369854
2370110
2370366
2370622
2370878
2371134
2371390
2371646
2371902
2372158
2372414
2372670
2372926
2373182
2373438
2373694
2373950
2374206
2374462
2374718
2374974
2375230
2375486
2367551
2367807
2368063
2368319
2368575
2368831
2369087
2369343
2369599
2369855
2370111
2370367
2370623
2370879
2371135
2371391
2371647
2371903
2372159
2372415
2372671
2372927
2373183
2373439
2373695
2373951
2374207
2374463
2374719
2374975
2375231
2375487
2367552
2367808
2368064
2368320
2368576
2368832
2369088
2369344
2369600
2369856
2370112
2370368
2370624
2370880
2371136
2371392
2371648
2371904
2372160
2372416
2372672
2372928
2373184
2373440
2373696
2373952
2374208
2374464
2374720
2374976
2375232
2375488
2367553
2367809
2368065
2368321
2368577
2368833
2369089
2369345
2369601
2369857
2370113
2370369
2370625
2370881
2371137
2371393
2371649
2371905
2372161
2372417
2372673
2372929
2373185
2373441
2373697
2373953
2374209
2374465
2374721
2374977
2375233
2375489
2367554
2367810
2368066
2368322
2368578
2368834
2369090
2369346
2369602
2369858
2370114
2370370
2370626
2370882
2371138
2371394
2371650
2371906
2372162
2372418
2372674
2372930
2373186
2373442
2373698
2373954
2374210
2374466
2374722
2374978
2375234
2375490
2367555
2367811
2368067
2368323
2368579
2368835
2369091
2369347
2369603
2369859
2370115
2370371
2370627
2370883
2371139
2371395
2371651
2371907
2372163
2372419
2372675
2372931
2373187
2373443
2373699
2373955
2374211
2374467
2374723
2374979
2375235
2375491
2367556
2367812
2368068
2368324
2368580
2368836
2369092
2369348
2369604
2369860
2370116
2370372
2370628
2370884
2371140
2371396
2371652
2371908
2372164
2372420
2372676
2372932
2373188
2373444
2373700
2373956
2374212
2374468
2374724
2374980
2375236
2375492
2367557
2367813
2368069
2368325
2368581
2368837
2369093
2369349
2369605
2369861
2370117
2370373
2370629
2370885
2371141
2371397
2371653
2371909
2372165
2372421
2372677
2372933
2373189
2373445
2373701
2373957
2374213
2374469
2374725
2374981
2375237
2375493
2367558
2367814
2368070
2368326
2368582
2368838
2369094
2369350
2369606
2369862
2370118
2370374
2370630
2370886
2371142
2371398
2371654
2371910
2372166
2372422
2372678
2372934
2373190
2373446
2373702
2373958
2374214
2374470
2374726
2374982
2375238
2375494
2367559
2367815
2368071
2368327
2368583
2368839
2369095
2369351
2369607
2369863
2370119
2370375
2370631
2370887
2371143
2371399
2371655
2371911
2372167
2372423
2372679
2372935
2373191
2373447
2373703
2373959
2374215
2374471
2374727
2374983
2375239
2375495
2367560
2367816
2368072
2368328
2368584
2368840
2369096
2369352
2369608
2369864
2370120
2370376
2370632
2370888
2371144
2371400
2371656
2371912
2372168
2372424
2372680
2372936
2373192
2373448
2373704
2373960
2374216
2374472
2374728
2374984
2375240
2375496
2367561
2367817
2368073
2368329
2368585
2368841
2369097
2369353
2369609
2369865
2370121
2370377
2370633
2370889
2371145
2371401
2371657
2371913
2372169
2372425
2372681
2372937
2373193
2373449
2373705
2373961
2374217
2374473
2374729
2374985
2375241
2375497
2367562
2367818
2368074
2368330
2368586
2368842
2369098
2369354
2369610
2369866
2370122
2370378
2370634
2370890
2371146
2371402
2371658
2371914
2372170
2372426
2372682
2372938
2373194
2373450
2373706
2373962
2374218
2374474
2374730
2374986
2375242
2375498
2367563
2367819
2368075
2368331
2368587
2368843
2369099
2369355
2369611
2369867
2370123
2370379
2370635
2370891
2371147
2371403
2371659
2371915
2372171
2372427
2372683
2372939
2373195
2373451
2373707
2373963
2374219
2374475
2374731
2374987
2375243
2375499
2367564
2367820
2368076
2368332
2368588
2368844
2369100
2369356
2369612
2369868
2370124
2370380
2370636
2370892
2371148
2371404
2371660
2371916
2372172
2372428
2372684
2372940
2373196
2373452
2373708
2373964
2374220
2374476
2374732
2374988
2375244
2375500
2367565
2367821
2368077
2368333
2368589
2368845
2369101
2369357
2369613
2369869
2370125
2370381
2370637
2370893
2371149
2371405
2371661
2371917
2372173
2372429
2372685
2372941
2373197
2373453
2373709
2373965
2374221
2374477
2374733
2374989
2375245
2375501
2367566
2367822
2368078
2368334
2368590
2368846
2369102
2369358
2369614
2369870
2370126
2370382
2370638
2370894
2371150
2371406
2371662
2371918
2372174
2372430
2372686
2372942
2373198
2373454
2373710
2373966
2374222
2374478
2374734
2374990
2375246
2375502
2367567
2367823
2368079
2368335
2368591
2368847
2369103
2369359
2369615
2369871
2370127
2370383
2370639
2370895
2371151
2371407
2371663
2371919
2372175
2372431
2372687
2372943
2373199
2373455
2373711
2373967
2374223
2374479
2374735
2374991
2375247
2375503
2367568
2367824
2368080
2368336
2368592
2368848
2369104
2369360
2369616
2369872
2370128
2370384
2370640
2370896
2371152
2371408
2371664
2371920
2372176
2372432
2372688
2372944
2373200
2373456
2373712
2373968
2374224
2374480
2374736
2374992
2375248
2375504
2367569
2367825
2368081
2368337
2368593
2368849
2369105
2369361
2369617
2369873
2370129
2370385
2370641
2370897
2371153
2371409
2371665
2371921
2372177
2372433
2372689
2372945
2373201
2373457
2373713
2373969
2374225
2374481
2374737
2374993
2375249
2375505
2367570
2367826
2368082
2368338
2368594
2368850
2369106
2369362
2369618
2369874
2370130
2370386
2370642
2370898
2371154
2371410
2371666
2371922
2372178
2372434
2372690
2372946
2373202
2373458
2373714
2373970
2374226
2374482
2374738
2374994
2375250
2375506
2367571
2367827
2368083
2368339
2368595
2368851
2369107
2369363
2369619
2369875
2370131
2370387
2370643
2370899
2371155
2371411
2371667
2371923
2372179
2372435
2372691
2372947
2373203
2373459
2373715
2373971
2374227
2374483
2374739
2374995
2375251
2375507
2367572
2367828
2368084
2368340
2368596
2368852
2369108
2369364
2369620
2369876
2370132
2370388
2370644
2370900
2371156
2371412
2371668
2371924
2372180
2372436
2372692
2372948
2373204
2373460
2373716
2373972
2374228
2374484
2374740
2374996
2375252
2375508
2367573
2367829
2368085
2368341
2368597
2368853
2369109
2369365
2369621
2369877
2370133
2370389
2370645
2370901
2371157
2371413
2371669
2371925
2372181
2372437
2372693
2372949
2373205
2373461
2373717
2373973
2374229
2374485
2374741
2374997
2375253
2375509
2367574
2367830
2368086
2368342
2368598
2368854
2369110
2369366
2369622
2369878
2370134
2370390
2370646
2370902
2371158
2371414
2371670
2371926
2372182
2372438
2372694
2372950
2373206
2373462
2373718
2373974
2374230
2374486
2374742
2374998
2375254
2375510
2367575
2367831
2368087
2368343
2368599
2368855
2369111
2369367
2369623
2369879
2370135
2370391
2370647
2370903
2371159
2371415
2371671
2371927
2372183
2372439
2372695
2372951
2373207
2373463
2373719
2373975
2374231
2374487
2374743
2374999
2375255
2375511
2367576
2367832
2368088
2368344
2368600
2368856
2369112
2369368
2369624
2369880
2370136
2370392
2370648
2370904
2371160
2371416
2371672
2371928
2372184
2372440
2372696
2372952
2373208
2373464
2373720
2373976
2374232
2374488
2374744
2375000
2375256
2375512
2367577
2367833
2368089
2368345
2368601
2368857
2369113
2369369
2369625
2369881
2370137
2370393
2370649
2370905
2371161
2371417
2371673
2371929
2372185
2372441
2372697
2372953
2373209
2373465
2373721
2373977
2374233
2374489
2374745
2375001
2375257
2375513
2367578
2367834
2368090
2368346
2368602
2368858
2369114
2369370
2369626
2369882
2370138
2370394
2370650
2370906
2371162
2371418
2371674
2371930
2372186
2372442
2372698
2372954
2373210
2373466
2373722
2373978
2374234
2374490
2374746
2375002
2375258
2375514
2367579
2367835
2368091
2368347
2368603
2368859
2369115
2369371
2369627
2369883
2370139
2370395
2370651
2370907
2371163
2371419
2371675
2371931
2372187
2372443
2372699
2372955
2373211
2373467
2373723
2373979
2374235
2374491
2374747
2375003
2375259
2375515
2367580
2367836
2368092
2368348
2368604
2368860
2369116
2369372
2369628
2369884
2370140
2370396
2370652
2370908
2371164
2371420
2371676
2371932
2372188
2372444
2372700
2372956
2373212
2373468
2373724
2373980
2374236
2374492
2374748
2375004
2375260
2375516
2367581
2367837
2368093
2368349
2368605
2368861
2369117
2369373
2369629
2369885
2370141
2370397
2370653
2370909
2371165
2371421
2371677
2371933
2372189
2372445
2372701
2372957
2373213
2373469
2373725
2373981
2374237
2374493
2374749
2375005
2375261
2375517
2367582
2367838
2368094
2368350
2368606
2368862
2369118
2369374
2369630
2369886
2370142
2370398
2370654
2370910
2371166
2371422
2371678
2371934
2372190
2372446
2372702
2372958
2373214
2373470
2373726
2373982
2374238
2374494
2374750
2375006
2375262
2375518
2367583
2367839
2368095
2368351
2368607
2368863
2369119
2369375
2369631
2369887
2370143
2370399
2370655
2370911
2371167
2371423
2371679
2371935
2372191
2372447
2372703
2372959
2373215
2373471
2373727
2373983
2374239
2374495
2374751
2375007
2375263
2375519
