0 0 0.555555570273 0.800000011921 2.25
0 1 0.810580223411 0.888421058655 1.3886256218
0 2 0.333333333333 1.0 3.0
1 0 1.4999999553 0.5 1.33333337307
1 1 0.717987835148 0.917197465897 1.51851856709
1 2 1.0 1.0 1.0
2 0 0.571428571429 1.0 1.75
2 1 0.792580068358 0.897872328758 1.40521323681
2 2 1.0 1.0 1.0
3 0 0.624999990687 0.800000011921 2.0
3 1 0.684057996542 0.944915235043 1.54708516598
3 2 1.0 0.0 0.0
4 0 0.5 1.0 2.0
4 1 0.726429680243 0.893617033958 1.54047620296
4 2 0.5 1.0 2.0
5 0 1.0 0.833333313465 1.20000004768
5 1 0.738724740712 0.920000016689 1.47139585018
5 2 0.5 1.0 2.0
6 0 0.666666666667 1.0 1.5
6 1 0.640434181071 0.919491529465 1.69815671444
6 2 0.5 1.0 2.0
7 0 1.16666665508 0.714285731316 1.20000004768
7 1 0.7472353938 0.871035933495 1.53640770912
7 2 1.0 1.0 1.0
8 0 0.666666666667 1.0 1.5
8 1 0.720789064185 0.926315784454 1.49772727489
8 2 1.0 0.5 2.0
9 0 1.0 1.0 1.0
9 1 0.757234755278 0.910828053951 1.449883461
9 2 0.666666666667 1.0 1.5
10 0 0.583333327538 1.0 1.71428573132
10 1 0.69264708663 0.910828053951 1.5850815773
10 2 1.0 1.0 1.0
11 0 1.0 0.833333313465 1.20000004768
11 1 0.684671537374 0.931769728661 1.56750571728
11 2 1.0 1.0 1.0
12 0 1.20000002861 0.666666686535 1.25
12 1 0.911196894421 0.830508470535 1.32142853737
12 2 1.0 0.666666686535 1.5
13 0 1.20000002861 0.833333313465 1.0
13 1 0.701807248571 0.937768220901 1.51945078373
13 2 2.0 0.5 1.0
14 0 0.624999990687 1.0 1.60000002384
14 1 0.707646149593 0.938559293747 1.50564336777
14 2 0.666666666667 1.0 1.5
15 0 1.4999999553 0.666666686535 1.0
15 1 0.721003108391 0.906521737576 1.52997601032
15 2 1.0 1.0 1.0
16 0 1.6 0.625 1.0
16 1 0.657514438521 0.936263740063 1.62441313267
16 2 2.0 0.5 1.0
17 0 0.428571443168 1.0 2.33333325386
17 1 0.666666666667 0.915584445 1.63829791546
17 2 1.4999999553 0.666666686535 1.0
18 0 0.71428572645 0.800000011921 1.75
18 1 1.10514018276 0.758985221386 1.1922005415
18 2 2.99999991059 0.333333343267 1.0
19 0 1.0 1.0 1.0
19 1 0.75404532897 0.881974220276 1.5036495924
19 2 0.5 1.0 2.0
20 0 0.874999960884 0.714285731316 1.60000002384
20 1 0.888671833825 0.850549459457 1.32299745083
20 2 0.8 0.75 1.66666662693
21 0 0.857142886337 0.833333313465 1.39999997616
21 1 0.775510222949 0.901315808296 1.43065690994
21 2 0.8 0.75 1.66666662693
22 0 1.0 0.625 1.60000002384
22 1 0.815929191661 0.889370918274 1.37804877758
22 2 0.571428571429 1.0 1.75
23 0 0.83333330022 1.0 1.20000004768
23 1 0.73237181432 0.92560172081 1.47517728806
23 2 1.0 1.0 1.0
24 0 1.16666665508 0.428571432829 2.0
24 1 0.769230797446 0.884782612324 1.46928751469
24 2 0.8 1.0 1.25
25 0 1.16666665508 0.714285731316 1.20000004768
25 1 0.858736074702 0.889610409737 1.30900239944
25 2 0.8 1.0 1.25
26 0 0.666666666667 1.0 1.5
26 1 0.956158718138 0.827510893345 1.26385223866
26 2 1.0 0.75 1.33333337307
27 0 0.642857131909 1.0 1.55555558205
27 1 0.710937482123 0.894505500793 1.57248151302
27 2 0.428571443168 1.0 2.33333325386
28 0 0.529411779555 1.0 1.88888883591
28 1 0.75420878327 0.901785731316 1.47029697895
28 2 0.571428571429 1.0 1.75
29 0 0.84615388495 0.818181812763 1.44444441795
29 1 0.774597481817 0.900692820549 1.4333332777
29 2 0.555555570273 1.0 1.79999995232
30 0 1.18181816901 0.692307710648 1.22222220898
30 1 0.887290161778 0.81351351738 1.38538205624
30 2 0.8 1.0 1.25
31 0 0.761904761905 0.875 1.5
31 1 0.797530837906 0.829721391201 1.51119399071
31 2 0.83333330022 0.800000011921 1.5
32 0 0.749999977648 0.933333337307 1.42857146263
32 1 0.835570490522 0.871485948563 1.37327194214
32 2 1.66666660044 0.600000023842 1.0
33 0 0.857142886337 0.888888895512 1.3125
33 1 1.0 0.0 0.0
33 2 1.33333333333 0.5 1.5
34 0 0.739130446275 1.0 1.35294115543
34 1 0.859259271399 0.836206912994 1.39175260067
34 2 0.666666666667 1.0 1.5
35 0 0.727272727273 0.9375 1.46666669846
35 1 0.831858382508 0.87234044075 1.37804877758
35 2 0.749999977648 1.0 1.33333337307
36 0 0.874999960884 0.785714268684 1.45454549789
36 1 1.0 0.0 0.0
36 2 0.8 1.0 1.25
37 0 1.08333332795 0.692307710648 1.33333337307
37 1 0.822085890773 0.858208954334 1.4173913002
37 2 0.8 0.75 1.66666662693
38 0 1.0 0.0 0.0
38 1 1.15887848918 0.68548387289 1.25882351398
38 2 1.0 1.0 1.0
39 0 0.952380995631 0.850000023842 1.23529410362
39 1 0.741935463899 0.891304373741 1.51219511032
39 2 2.0 0.5 1.0
40 0 0.869565235419 0.949999988079 1.21052634716
40 1 0.772413823585 0.892857134342 1.45000004768
40 2 2.24999998324 0.444444447756 1.0
41 0 1.0 1.0 1.0
41 1 0.867924555632 0.847826063633 1.35897433758
41 2 0.818181827049 0.888888895512 1.375
42 0 0.727272727273 0.9375 1.46666669846
42 1 0.8 0.886363625526 1.4102563858
42 2 1.14285714286 0.75 1.16666662693
43 0 0.629629643529 0.823529422283 1.92857146263
43 1 1.0131578995 0.766233742237 1.28813564777
43 2 0.874999960884 0.857142865658 1.33333337307
44 0 1.0 0.0 0.0
44 1 0.595959590219 0.94915252924 1.76785719395
44 2 1.6 0.5 1.25
45 0 0.857142886337 0.833333313465 1.39999997616
45 1 0.796610188806 0.787234067917 1.59459459782
45 2 2.0 0.5 1.0
46 0 0.636363650156 1.0 1.57142853737
46 1 1.03846151465 0.814814805984 1.18181812763
46 2 0.666666666667 1.0 1.5
47 0 0.624999990687 1.0 1.60000002384
47 1 1.20000002861 0.666666686535 1.25
47 2 1.4999999553 0.333333343267 2.0
48 0 0.411764700108 1.0 2.42857146263
48 1 1.0 0.777777791023 1.28571426868
48 2 2.0 0.5 1.0
49 0 1.0 0.800000011921 1.25
49 1 1.0 0.0 0.0
49 2 0.666666666667 1.0 1.5
50 0 0.749999977648 1.0 1.33333337307
50 1 1.24999998137 0.800000011921 1.0
50 2 1.0 1.0 1.0
51 0 1.0 0.75 1.33333337307
51 1 0.555555570273 1.0 1.79999995232
51 2 0.5 1.0 2.0
52 0 1.0 0.75 1.33333337307
52 1 1.0 0.600000023842 1.66666662693
52 2 1.0 0.0 0.0
53 0 1.33333333333 0.5 1.5
53 1 2.0 0.5 1.0
53 2 1.4999999553 0.333333343267 2.0
