1712128
1712384
1712640
1712896
1713152
1713408
1713664
1713920
1714176
1714432
1714688
1714944
1715200
1715456
1715712
1715968
1716224
1716480
1716736
1716992
1717248
1717504
1717760
1718016
1718272
1718528
1718784
1719040
1719296
1719552
1719808
1720064
1712129
1712385
1712641
1712897
1713153
1713409
1713665
1713921
1714177
1714433
1714689
1714945
1715201
1715457
1715713
1715969
1716225
1716481
1716737
1716993
1717249
1717505
1717761
1718017
1718273
1718529
1718785
1719041
1719297
1719553
1719809
1720065
1712130
1712386
1712642
1712898
1713154
1713410
1713666
1713922
1714178
1714434
1714690
1714946
1715202
1715458
1715714
1715970
1716226
1716482
1716738
1716994
1717250
1717506
1717762
1718018
1718274
1718530
1718786
1719042
1719298
1719554
1719810
1720066
1712131
1712387
1712643
1712899
1713155
1713411
1713667
1713923
1714179
1714435
1714691
1714947
1715203
1715459
1715715
1715971
1716227
1716483
1716739
1716995
1717251
1717507
1717763
1718019
1718275
1718531
1718787
1719043
1719299
1719555
1719811
1720067
1712132
1712388
1712644
1712900
1713156
1713412
1713668
1713924
1714180
1714436
1714692
1714948
1715204
1715460
1715716
1715972
1716228
1716484
1716740
1716996
1717252
1717508
1717764
1718020
1718276
1718532
1718788
1719044
1719300
1719556
1719812
1720068
1712133
1712389
1712645
1712901
1713157
1713413
1713669
1713925
1714181
1714437
1714693
1714949
1715205
1715461
1715717
1715973
1716229
1716485
1716741
1716997
1717253
1717509
1717765
1718021
1718277
1718533
1718789
1719045
1719301
1719557
1719813
1720069
1712134
1712390
1712646
1712902
1713158
1713414
1713670
1713926
1714182
1714438
1714694
1714950
1715206
1715462
1715718
1715974
1716230
1716486
1716742
1716998
1717254
1717510
1717766
1718022
1718278
1718534
1718790
1719046
1719302
1719558
1719814
1720070
1712135
1712391
1712647
1712903
1713159
1713415
1713671
1713927
1714183
1714439
1714695
1714951
1715207
1715463
1715719
1715975
1716231
1716487
1716743
1716999
1717255
1717511
1717767
1718023
1718279
1718535
1718791
1719047
1719303
1719559
1719815
1720071
1712136
1712392
1712648
1712904
1713160
1713416
1713672
1713928
1714184
1714440
1714696
1714952
1715208
1715464
1715720
1715976
1716232
1716488
1716744
1717000
1717256
1717512
1717768
1718024
1718280
1718536
1718792
1719048
1719304
1719560
1719816
1720072
1712137
1712393
1712649
1712905
1713161
1713417
1713673
1713929
1714185
1714441
1714697
1714953
1715209
1715465
1715721
1715977
1716233
1716489
1716745
1717001
1717257
1717513
1717769
1718025
1718281
1718537
1718793
1719049
1719305
1719561
1719817
1720073
1712138
1712394
1712650
1712906
1713162
1713418
1713674
1713930
1714186
1714442
1714698
1714954
1715210
1715466
1715722
1715978
1716234
1716490
1716746
1717002
1717258
1717514
1717770
1718026
1718282
1718538
1718794
1719050
1719306
1719562
1719818
1720074
1712139
1712395
1712651
1712907
1713163
1713419
1713675
1713931
1714187
1714443
1714699
1714955
1715211
1715467
1715723
1715979
1716235
1716491
1716747
1717003
1717259
1717515
1717771
1718027
1718283
1718539
1718795
1719051
1719307
1719563
1719819
1720075
1712140
1712396
1712652
1712908
1713164
1713420
1713676
1713932
1714188
1714444
1714700
1714956
1715212
1715468
1715724
1715980
1716236
1716492
1716748
1717004
1717260
1717516
1717772
1718028
1718284
1718540
1718796
1719052
1719308
1719564
1719820
1720076
1712141
1712397
1712653
1712909
1713165
1713421
1713677
1713933
1714189
1714445
1714701
1714957
1715213
1715469
1715725
1715981
1716237
1716493
1716749
1717005
1717261
1717517
1717773
1718029
1718285
1718541
1718797
1719053
1719309
1719565
1719821
1720077
1712142
1712398
1712654
1712910
1713166
1713422
1713678
1713934
1714190
1714446
1714702
1714958
1715214
1715470
1715726
1715982
1716238
1716494
1716750
1717006
1717262
1717518
1717774
1718030
1718286
1718542
1718798
1719054
1719310
1719566
1719822
1720078
1712143
1712399
1712655
1712911
1713167
1713423
1713679
1713935
1714191
1714447
1714703
1714959
1715215
1715471
1715727
1715983
1716239
1716495
1716751
1717007
1717263
1717519
1717775
1718031
1718287
1718543
1718799
1719055
1719311
1719567
1719823
1720079
1712144
1712400
1712656
1712912
1713168
1713424
1713680
1713936
1714192
1714448
1714704
1714960
1715216
1715472
1715728
1715984
1716240
1716496
1716752
1717008
1717264
1717520
1717776
1718032
1718288
1718544
1718800
1719056
1719312
1719568
1719824
1720080
1712145
1712401
1712657
1712913
1713169
1713425
1713681
1713937
1714193
1714449
1714705
1714961
1715217
1715473
1715729
1715985
1716241
1716497
1716753
1717009
1717265
1717521
1717777
1718033
1718289
1718545
1718801
1719057
1719313
1719569
1719825
1720081
1712146
1712402
1712658
1712914
1713170
1713426
1713682
1713938
1714194
1714450
1714706
1714962
1715218
1715474
1715730
1715986
1716242
1716498
1716754
1717010
1717266
1717522
1717778
1718034
1718290
1718546
1718802
1719058
1719314
1719570
1719826
1720082
1712147
1712403
1712659
1712915
1713171
1713427
1713683
1713939
1714195
1714451
1714707
1714963
1715219
1715475
1715731
1715987
1716243
1716499
1716755
1717011
1717267
1717523
1717779
1718035
1718291
1718547
1718803
1719059
1719315
1719571
1719827
1720083
1712148
1712404
1712660
1712916
1713172
1713428
1713684
1713940
1714196
1714452
1714708
1714964
1715220
1715476
1715732
1715988
1716244
1716500
1716756
1717012
1717268
1717524
1717780
1718036
1718292
1718548
1718804
1719060
1719316
1719572
1719828
1720084
1712149
1712405
1712661
1712917
1713173
1713429
1713685
1713941
1714197
1714453
1714709
1714965
1715221
1715477
1715733
1715989
1716245
1716501
1716757
1717013
1717269
1717525
1717781
1718037
1718293
1718549
1718805
1719061
1719317
1719573
1719829
1720085
1712150
1712406
1712662
1712918
1713174
1713430
1713686
1713942
1714198
1714454
1714710
1714966
1715222
1715478
1715734
1715990
1716246
1716502
1716758
1717014
1717270
1717526
1717782
1718038
1718294
1718550
1718806
1719062
1719318
1719574
1719830
1720086
1712151
1712407
1712663
1712919
1713175
1713431
1713687
1713943
1714199
1714455
1714711
1714967
1715223
1715479
1715735
1715991
1716247
1716503
1716759
1717015
1717271
1717527
1717783
1718039
1718295
1718551
1718807
1719063
1719319
1719575
1719831
1720087
1712152
1712408
1712664
1712920
1713176
1713432
1713688
1713944
1714200
1714456
1714712
1714968
1715224
1715480
1715736
1715992
1716248
1716504
1716760
1717016
1717272
1717528
1717784
1718040
1718296
1718552
1718808
1719064
1719320
1719576
1719832
1720088
1712153
1712409
1712665
1712921
1713177
1713433
1713689
1713945
1714201
1714457
1714713
1714969
1715225
1715481
1715737
1715993
1716249
1716505
1716761
1717017
1717273
1717529
1717785
1718041
1718297
1718553
1718809
1719065
1719321
1719577
1719833
1720089
1712154
1712410
1712666
1712922
1713178
1713434
1713690
1713946
1714202
1714458
1714714
1714970
1715226
1715482
1715738
1715994
1716250
1716506
1716762
1717018
1717274
1717530
1717786
1718042
1718298
1718554
1718810
1719066
1719322
1719578
1719834
1720090
1712155
1712411
1712667
1712923
1713179
1713435
1713691
1713947
1714203
1714459
1714715
1714971
1715227
1715483
1715739
1715995
1716251
1716507
1716763
1717019
1717275
1717531
1717787
1718043
1718299
1718555
1718811
1719067
1719323
1719579
1719835
1720091
1712156
1712412
1712668
1712924
1713180
1713436
1713692
1713948
1714204
1714460
1714716
1714972
1715228
1715484
1715740
1715996
1716252
1716508
1716764
1717020
1717276
1717532
1717788
1718044
1718300
1718556
1718812
1719068
1719324
1719580
1719836
1720092
1712157
1712413
1712669
1712925
1713181
1713437
1713693
1713949
1714205
1714461
1714717
1714973
1715229
1715485
1715741
1715997
1716253
1716509
1716765
1717021
1717277
1717533
1717789
1718045
1718301
1718557
1718813
1719069
1719325
1719581
1719837
1720093
1712158
1712414
1712670
1712926
1713182
1713438
1713694
1713950
1714206
1714462
1714718
1714974
1715230
1715486
1715742
1715998
1716254
1716510
1716766
1717022
1717278
1717534
1717790
1718046
1718302
1718558
1718814
1719070
1719326
1719582
1719838
1720094
1712159
1712415
1712671
1712927
1713183
1713439
1713695
1713951
1714207
1714463
1714719
1714975
1715231
1715487
1715743
1715999
1716255
1716511
1716767
1717023
1717279
1717535
1717791
1718047
1718303
1718559
1718815
1719071
1719327
1719583
1719839
1720095
1712160
1712416
1712672
1712928
1713184
1713440
1713696
1713952
1714208
1714464
1714720
1714976
1715232
1715488
1715744
1716000
1716256
1716512
1716768
1717024
1717280
1717536
1717792
1718048
1718304
1718560
1718816
1719072
1719328
1719584
1719840
1720096
1712161
1712417
1712673
1712929
1713185
1713441
1713697
1713953
1714209
1714465
1714721
1714977
1715233
1715489
1715745
1716001
1716257
1716513
1716769
1717025
1717281
1717537
1717793
1718049
1718305
1718561
1718817
1719073
1719329
1719585
1719841
1720097
1712162
1712418
1712674
1712930
1713186
1713442
1713698
1713954
1714210
1714466
1714722
1714978
1715234
1715490
1715746
1716002
1716258
1716514
1716770
1717026
1717282
1717538
1717794
1718050
1718306
1718562
1718818
1719074
1719330
1719586
1719842
1720098
1712163
1712419
1712675
1712931
1713187
1713443
1713699
1713955
1714211
1714467
1714723
1714979
1715235
1715491
1715747
1716003
1716259
1716515
1716771
1717027
1717283
1717539
1717795
1718051
1718307
1718563
1718819
1719075
1719331
1719587
1719843
1720099
1712164
1712420
1712676
1712932
1713188
1713444
1713700
1713956
1714212
1714468
1714724
1714980
1715236
1715492
1715748
1716004
1716260
1716516
1716772
1717028
1717284
1717540
1717796
1718052
1718308
1718564
1718820
1719076
1719332
1719588
1719844
1720100
1712165
1712421
1712677
1712933
1713189
1713445
1713701
1713957
1714213
1714469
1714725
1714981
1715237
1715493
1715749
1716005
1716261
1716517
1716773
1717029
1717285
1717541
1717797
1718053
1718309
1718565
1718821
1719077
1719333
1719589
1719845
1720101
1712166
1712422
1712678
1712934
1713190
1713446
1713702
1713958
1714214
1714470
1714726
1714982
1715238
1715494
1715750
1716006
1716262
1716518
1716774
1717030
1717286
1717542
1717798
1718054
1718310
1718566
1718822
1719078
1719334
1719590
1719846
1720102
1712167
1712423
1712679
1712935
1713191
1713447
1713703
1713959
1714215
1714471
1714727
1714983
1715239
1715495
1715751
1716007
1716263
1716519
1716775
1717031
1717287
1717543
1717799
1718055
1718311
1718567
1718823
1719079
1719335
1719591
1719847
1720103
1712168
1712424
1712680
1712936
1713192
1713448
1713704
1713960
1714216
1714472
1714728
1714984
1715240
1715496
1715752
1716008
1716264
1716520
1716776
1717032
1717288
1717544
1717800
1718056
1718312
1718568
1718824
1719080
1719336
1719592
1719848
1720104
1712169
1712425
1712681
1712937
1713193
1713449
1713705
1713961
1714217
1714473
1714729
1714985
1715241
1715497
1715753
1716009
1716265
1716521
1716777
1717033
1717289
1717545
1717801
1718057
1718313
1718569
1718825
1719081
1719337
1719593
1719849
1720105
1712170
1712426
1712682
1712938
1713194
1713450
1713706
1713962
1714218
1714474
1714730
1714986
1715242
1715498
1715754
1716010
1716266
1716522
1716778
1717034
1717290
1717546
1717802
1718058
1718314
1718570
1718826
1719082
1719338
1719594
1719850
1720106
1712171
1712427
1712683
1712939
1713195
1713451
1713707
1713963
1714219
1714475
1714731
1714987
1715243
1715499
1715755
1716011
1716267
1716523
1716779
1717035
1717291
1717547
1717803
1718059
1718315
1718571
1718827
1719083
1719339
1719595
1719851
1720107
1712172
1712428
1712684
1712940
1713196
1713452
1713708
1713964
1714220
1714476
1714732
1714988
1715244
1715500
1715756
1716012
1716268
1716524
1716780
1717036
1717292
1717548
1717804
1718060
1718316
1718572
1718828
1719084
1719340
1719596
1719852
1720108
1712173
1712429
1712685
1712941
1713197
1713453
1713709
1713965
1714221
1714477
1714733
1714989
1715245
1715501
1715757
1716013
1716269
1716525
1716781
1717037
1717293
1717549
1717805
1718061
1718317
1718573
1718829
1719085
1719341
1719597
1719853
1720109
1712174
1712430
1712686
1712942
1713198
1713454
1713710
1713966
1714222
1714478
1714734
1714990
1715246
1715502
1715758
1716014
1716270
1716526
1716782
1717038
1717294
1717550
1717806
1718062
1718318
1718574
1718830
1719086
1719342
1719598
1719854
1720110
1712175
1712431
1712687
1712943
1713199
1713455
1713711
1713967
1714223
1714479
1714735
1714991
1715247
1715503
1715759
1716015
1716271
1716527
1716783
1717039
1717295
1717551
1717807
1718063
1718319
1718575
1718831
1719087
1719343
1719599
1719855
1720111
1712176
1712432
1712688
1712944
1713200
1713456
1713712
1713968
1714224
1714480
1714736
1714992
1715248
1715504
1715760
1716016
1716272
1716528
1716784
1717040
1717296
1717552
1717808
1718064
1718320
1718576
1718832
1719088
1719344
1719600
1719856
1720112
1712177
1712433
1712689
1712945
1713201
1713457
1713713
1713969
1714225
1714481
1714737
1714993
1715249
1715505
1715761
1716017
1716273
1716529
1716785
1717041
1717297
1717553
1717809
1718065
1718321
1718577
1718833
1719089
1719345
1719601
1719857
1720113
1712178
1712434
1712690
1712946
1713202
1713458
1713714
1713970
1714226
1714482
1714738
1714994
1715250
1715506
1715762
1716018
1716274
1716530
1716786
1717042
1717298
1717554
1717810
1718066
1718322
1718578
1718834
1719090
1719346
1719602
1719858
1720114
1712179
1712435
1712691
1712947
1713203
1713459
1713715
1713971
1714227
1714483
1714739
1714995
1715251
1715507
1715763
1716019
1716275
1716531
1716787
1717043
1717299
1717555
1717811
1718067
1718323
1718579
1718835
1719091
1719347
1719603
1719859
1720115
1712180
1712436
1712692
1712948
1713204
1713460
1713716
1713972
1714228
1714484
1714740
1714996
1715252
1715508
1715764
1716020
1716276
1716532
1716788
1717044
1717300
1717556
1717812
1718068
1718324
1718580
1718836
1719092
1719348
1719604
1719860
1720116
1712181
1712437
1712693
1712949
1713205
1713461
1713717
1713973
1714229
1714485
1714741
1714997
1715253
1715509
1715765
1716021
1716277
1716533
1716789
1717045
1717301
1717557
1717813
1718069
1718325
1718581
1718837
1719093
1719349
1719605
1719861
1720117
1712182
1712438
1712694
1712950
1713206
1713462
1713718
1713974
1714230
1714486
1714742
1714998
1715254
1715510
1715766
1716022
1716278
1716534
1716790
1717046
1717302
1717558
1717814
1718070
1718326
1718582
1718838
1719094
1719350
1719606
1719862
1720118
1712183
1712439
1712695
1712951
1713207
1713463
1713719
1713975
1714231
1714487
1714743
1714999
1715255
1715511
1715767
1716023
1716279
1716535
1716791
1717047
1717303
1717559
1717815
1718071
1718327
1718583
1718839
1719095
1719351
1719607
1719863
1720119
1712184
1712440
1712696
1712952
1713208
1713464
1713720
1713976
1714232
1714488
1714744
1715000
1715256
1715512
1715768
1716024
1716280
1716536
1716792
1717048
1717304
1717560
1717816
1718072
1718328
1718584
1718840
1719096
1719352
1719608
1719864
1720120
1712185
1712441
1712697
1712953
1713209
1713465
1713721
1713977
1714233
1714489
1714745
1715001
1715257
1715513
1715769
1716025
1716281
1716537
1716793
1717049
1717305
1717561
1717817
1718073
1718329
1718585
1718841
1719097
1719353
1719609
1719865
1720121
1712186
1712442
1712698
1712954
1713210
1713466
1713722
1713978
1714234
1714490
1714746
1715002
1715258
1715514
1715770
1716026
1716282
1716538
1716794
1717050
1717306
1717562
1717818
1718074
1718330
1718586
1718842
1719098
1719354
1719610
1719866
1720122
1712187
1712443
1712699
1712955
1713211
1713467
1713723
1713979
1714235
1714491
1714747
1715003
1715259
1715515
1715771
1716027
1716283
1716539
1716795
1717051
1717307
1717563
1717819
1718075
1718331
1718587
1718843
1719099
1719355
1719611
1719867
1720123
1712188
1712444
1712700
1712956
1713212
1713468
1713724
1713980
1714236
1714492
1714748
1715004
1715260
1715516
1715772
1716028
1716284
1716540
1716796
1717052
1717308
1717564
1717820
1718076
1718332
1718588
1718844
1719100
1719356
1719612
1719868
1720124
1712189
1712445
1712701
1712957
1713213
1713469
1713725
1713981
1714237
1714493
1714749
1715005
1715261
1715517
1715773
1716029
1716285
1716541
1716797
1717053
1717309
1717565
1717821
1718077
1718333
1718589
1718845
1719101
1719357
1719613
1719869
1720125
1712190
1712446
1712702
1712958
1713214
1713470
1713726
1713982
1714238
1714494
1714750
1715006
1715262
1715518
1715774
1716030
1716286
1716542
1716798
1717054
1717310
1717566
1717822
1718078
1718334
1718590
1718846
1719102
1719358
1719614
1719870
1720126
1712191
1712447
1712703
1712959
1713215
1713471
1713727
1713983
1714239
1714495
1714751
1715007
1715263
1715519
1715775
1716031
1716287
1716543
1716799
1717055
1717311
1717567
1717823
1718079
1718335
1718591
1718847
1719103
1719359
1719615
1719871
1720127
1712192
1712448
1712704
1712960
1713216
1713472
1713728
1713984
1714240
1714496
1714752
1715008
1715264
1715520
1715776
1716032
1716288
1716544
1716800
1717056
1717312
1717568
1717824
1718080
1718336
1718592
1718848
1719104
1719360
1719616
1719872
1720128
1712193
1712449
1712705
1712961
1713217
1713473
1713729
1713985
1714241
1714497
1714753
1715009
1715265
1715521
1715777
1716033
1716289
1716545
1716801
1717057
1717313
1717569
1717825
1718081
1718337
1718593
1718849
1719105
1719361
1719617
1719873
1720129
1712194
1712450
1712706
1712962
1713218
1713474
1713730
1713986
1714242
1714498
1714754
1715010
1715266
1715522
1715778
1716034
1716290
1716546
1716802
1717058
1717314
1717570
1717826
1718082
1718338
1718594
1718850
1719106
1719362
1719618
1719874
1720130
1712195
1712451
1712707
1712963
1713219
1713475
1713731
1713987
1714243
1714499
1714755
1715011
1715267
1715523
1715779
1716035
1716291
1716547
1716803
1717059
1717315
1717571
1717827
1718083
1718339
1718595
1718851
1719107
1719363
1719619
1719875
1720131
1712196
1712452
1712708
1712964
1713220
1713476
1713732
1713988
1714244
1714500
1714756
1715012
1715268
1715524
1715780
1716036
1716292
1716548
1716804
1717060
1717316
1717572
1717828
1718084
1718340
1718596
1718852
1719108
1719364
1719620
1719876
1720132
1712197
1712453
1712709
1712965
1713221
1713477
1713733
1713989
1714245
1714501
1714757
1715013
1715269
1715525
1715781
1716037
1716293
1716549
1716805
1717061
1717317
1717573
1717829
1718085
1718341
1718597
1718853
1719109
1719365
1719621
1719877
1720133
1712198
1712454
1712710
1712966
1713222
1713478
1713734
1713990
1714246
1714502
1714758
1715014
1715270
1715526
1715782
1716038
1716294
1716550
1716806
1717062
1717318
1717574
1717830
1718086
1718342
1718598
1718854
1719110
1719366
1719622
1719878
1720134
1712199
1712455
1712711
1712967
1713223
1713479
1713735
1713991
1714247
1714503
1714759
1715015
1715271
1715527
1715783
1716039
1716295
1716551
1716807
1717063
1717319
1717575
1717831
1718087
1718343
1718599
1718855
1719111
1719367
1719623
1719879
1720135
1712200
1712456
1712712
1712968
1713224
1713480
1713736
1713992
1714248
1714504
1714760
1715016
1715272
1715528
1715784
1716040
1716296
1716552
1716808
1717064
1717320
1717576
1717832
1718088
1718344
1718600
1718856
1719112
1719368
1719624
1719880
1720136
1712201
1712457
1712713
1712969
1713225
1713481
1713737
1713993
1714249
1714505
1714761
1715017
1715273
1715529
1715785
1716041
1716297
1716553
1716809
1717065
1717321
1717577
1717833
1718089
1718345
1718601
1718857
1719113
1719369
1719625
1719881
1720137
1712202
1712458
1712714
1712970
1713226
1713482
1713738
1713994
1714250
1714506
1714762
1715018
1715274
1715530
1715786
1716042
1716298
1716554
1716810
1717066
1717322
1717578
1717834
1718090
1718346
1718602
1718858
1719114
1719370
1719626
1719882
1720138
1712203
1712459
1712715
1712971
1713227
1713483
1713739
1713995
1714251
1714507
1714763
1715019
1715275
1715531
1715787
1716043
1716299
1716555
1716811
1717067
1717323
1717579
1717835
1718091
1718347
1718603
1718859
1719115
1719371
1719627
1719883
1720139
1712204
1712460
1712716
1712972
1713228
1713484
1713740
1713996
1714252
1714508
1714764
1715020
1715276
1715532
1715788
1716044
1716300
1716556
1716812
1717068
1717324
1717580
1717836
1718092
1718348
1718604
1718860
1719116
1719372
1719628
1719884
1720140
1712205
1712461
1712717
1712973
1713229
1713485
1713741
1713997
1714253
1714509
1714765
1715021
1715277
1715533
1715789
1716045
1716301
1716557
1716813
1717069
1717325
1717581
1717837
1718093
1718349
1718605
1718861
1719117
1719373
1719629
1719885
1720141
1712206
1712462
1712718
1712974
1713230
1713486
1713742
1713998
1714254
1714510
1714766
1715022
1715278
1715534
1715790
1716046
1716302
1716558
1716814
1717070
1717326
1717582
1717838
1718094
1718350
1718606
1718862
1719118
1719374
1719630
1719886
1720142
1712207
1712463
1712719
1712975
1713231
1713487
1713743
1713999
1714255
1714511
1714767
1715023
1715279
1715535
1715791
1716047
1716303
1716559
1716815
1717071
1717327
1717583
1717839
1718095
1718351
1718607
1718863
1719119
1719375
1719631
1719887
1720143
1712208
1712464
1712720
1712976
1713232
1713488
1713744
1714000
1714256
1714512
1714768
1715024
1715280
1715536
1715792
1716048
1716304
1716560
1716816
1717072
1717328
1717584
1717840
1718096
1718352
1718608
1718864
1719120
1719376
1719632
1719888
1720144
1712209
1712465
1712721
1712977
1713233
1713489
1713745
1714001
1714257
1714513
1714769
1715025
1715281
1715537
1715793
1716049
1716305
1716561
1716817
1717073
1717329
1717585
1717841
1718097
1718353
1718609
1718865
1719121
1719377
1719633
1719889
1720145
1712210
1712466
1712722
1712978
1713234
1713490
1713746
1714002
1714258
1714514
1714770
1715026
1715282
1715538
1715794
1716050
1716306
1716562
1716818
1717074
1717330
1717586
1717842
1718098
1718354
1718610
1718866
1719122
1719378
1719634
1719890
1720146
1712211
1712467
1712723
1712979
1713235
1713491
1713747
1714003
1714259
1714515
1714771
1715027
1715283
1715539
1715795
1716051
1716307
1716563
1716819
1717075
1717331
1717587
1717843
1718099
1718355
1718611
1718867
1719123
1719379
1719635
1719891
1720147
1712212
1712468
1712724
1712980
1713236
1713492
1713748
1714004
1714260
1714516
1714772
1715028
1715284
1715540
1715796
1716052
1716308
1716564
1716820
1717076
1717332
1717588
1717844
1718100
1718356
1718612
1718868
1719124
1719380
1719636
1719892
1720148
1712213
1712469
1712725
1712981
1713237
1713493
1713749
1714005
1714261
1714517
1714773
1715029
1715285
1715541
1715797
1716053
1716309
1716565
1716821
1717077
1717333
1717589
1717845
1718101
1718357
1718613
1718869
1719125
1719381
1719637
1719893
1720149
1712214
1712470
1712726
1712982
1713238
1713494
1713750
1714006
1714262
1714518
1714774
1715030
1715286
1715542
1715798
1716054
1716310
1716566
1716822
1717078
1717334
1717590
1717846
1718102
1718358
1718614
1718870
1719126
1719382
1719638
1719894
1720150
1712215
1712471
1712727
1712983
1713239
1713495
1713751
1714007
1714263
1714519
1714775
1715031
1715287
1715543
1715799
1716055
1716311
1716567
1716823
1717079
1717335
1717591
1717847
1718103
1718359
1718615
1718871
1719127
1719383
1719639
1719895
1720151
1712216
1712472
1712728
1712984
1713240
1713496
1713752
1714008
1714264
1714520
1714776
1715032
1715288
1715544
1715800
1716056
1716312
1716568
1716824
1717080
1717336
1717592
1717848
1718104
1718360
1718616
1718872
1719128
1719384
1719640
1719896
1720152
1712217
1712473
1712729
1712985
1713241
1713497
1713753
1714009
1714265
1714521
1714777
1715033
1715289
1715545
1715801
1716057
1716313
1716569
1716825
1717081
1717337
1717593
1717849
1718105
1718361
1718617
1718873
1719129
1719385
1719641
1719897
1720153
1712218
1712474
1712730
1712986
1713242
1713498
1713754
1714010
1714266
1714522
1714778
1715034
1715290
1715546
1715802
1716058
1716314
1716570
1716826
1717082
1717338
1717594
1717850
1718106
1718362
1718618
1718874
1719130
1719386
1719642
1719898
1720154
1712219
1712475
1712731
1712987
1713243
1713499
1713755
1714011
1714267
1714523
1714779
1715035
1715291
1715547
1715803
1716059
1716315
1716571
1716827
1717083
1717339
1717595
1717851
1718107
1718363
1718619
1718875
1719131
1719387
1719643
1719899
1720155
1712220
1712476
1712732
1712988
1713244
1713500
1713756
1714012
1714268
1714524
1714780
1715036
1715292
1715548
1715804
1716060
1716316
1716572
1716828
1717084
1717340
1717596
1717852
1718108
1718364
1718620
1718876
1719132
1719388
1719644
1719900
1720156
1712221
1712477
1712733
1712989
1713245
1713501
1713757
1714013
1714269
1714525
1714781
1715037
1715293
1715549
1715805
1716061
1716317
1716573
1716829
1717085
1717341
1717597
1717853
1718109
1718365
1718621
1718877
1719133
1719389
1719645
1719901
1720157
1712222
1712478
1712734
1712990
1713246
1713502
1713758
1714014
1714270
1714526
1714782
1715038
1715294
1715550
1715806
1716062
1716318
1716574
1716830
1717086
1717342
1717598
1717854
1718110
1718366
1718622
1718878
1719134
1719390
1719646
1719902
1720158
1712223
1712479
1712735
1712991
1713247
1713503
1713759
1714015
1714271
1714527
1714783
1715039
1715295
1715551
1715807
1716063
1716319
1716575
1716831
1717087
1717343
1717599
1717855
1718111
1718367
1718623
1718879
1719135
1719391
1719647
1719903
1720159
2113536
2113792
2114048
2114304
2114560
2114816
2115072
2115328
2115584
2115840
2116096
2116352
2116608
2116864
2117120
2117376
2117632
2117888
2118144
2118400
2118656
2118912
2119168
2119424
2119680
2119936
2120192
2120448
2120704
2120960
2121216
2121472
2113537
2113793
2114049
2114305
2114561
2114817
2115073
2115329
2115585
2115841
2116097
2116353
2116609
2116865
2117121
2117377
2117633
2117889
2118145
2118401
2118657
2118913
2119169
2119425
2119681
2119937
2120193
2120449
2120705
2120961
2121217
2121473
2113538
2113794
2114050
2114306
2114562
2114818
2115074
2115330
2115586
2115842
2116098
2116354
2116610
2116866
2117122
2117378
2117634
2117890
2118146
2118402
2118658
2118914
2119170
2119426
2119682
2119938
2120194
2120450
2120706
2120962
2121218
2121474
2113539
2113795
2114051
2114307
2114563
2114819
2115075
2115331
2115587
2115843
2116099
2116355
2116611
2116867
2117123
2117379
2117635
2117891
2118147
2118403
2118659
2118915
2119171
2119427
2119683
2119939
2120195
2120451
2120707
2120963
2121219
2121475
2113540
2113796
2114052
2114308
2114564
2114820
2115076
2115332
2115588
2115844
2116100
2116356
2116612
2116868
2117124
2117380
2117636
2117892
2118148
2118404
2118660
2118916
2119172
2119428
2119684
2119940
2120196
2120452
2120708
2120964
2121220
2121476
2113541
2113797
2114053
2114309
2114565
2114821
2115077
2115333
2115589
2115845
2116101
2116357
2116613
2116869
2117125
2117381
2117637
2117893
2118149
2118405
2118661
2118917
2119173
2119429
2119685
2119941
2120197
2120453
2120709
2120965
2121221
2121477
2113542
2113798
2114054
2114310
2114566
2114822
2115078
2115334
2115590
2115846
2116102
2116358
2116614
2116870
2117126
2117382
2117638
2117894
2118150
2118406
2118662
2118918
2119174
2119430
2119686
2119942
2120198
2120454
2120710
2120966
2121222
2121478
2113543
2113799
2114055
2114311
2114567
2114823
2115079
2115335
2115591
2115847
2116103
2116359
2116615
2116871
2117127
2117383
2117639
2117895
2118151
2118407
2118663
2118919
2119175
2119431
2119687
2119943
2120199
2120455
2120711
2120967
2121223
2121479
2113544
2113800
2114056
2114312
2114568
2114824
2115080
2115336
2115592
2115848
2116104
2116360
2116616
2116872
2117128
2117384
2117640
2117896
2118152
2118408
2118664
2118920
2119176
2119432
2119688
2119944
2120200
2120456
2120712
2120968
2121224
2121480
2113545
2113801
2114057
2114313
2114569
2114825
2115081
2115337
2115593
2115849
2116105
2116361
2116617
2116873
2117129
2117385
2117641
2117897
2118153
2118409
2118665
2118921
2119177
2119433
2119689
2119945
2120201
2120457
2120713
2120969
2121225
2121481
2113546
2113802
2114058
2114314
2114570
2114826
2115082
2115338
2115594
2115850
2116106
2116362
2116618
2116874
2117130
2117386
2117642
2117898
2118154
2118410
2118666
2118922
2119178
2119434
2119690
2119946
2120202
2120458
2120714
2120970
2121226
2121482
2113547
2113803
2114059
2114315
2114571
2114827
2115083
2115339
2115595
2115851
2116107
2116363
2116619
2116875
2117131
2117387
2117643
2117899
2118155
2118411
2118667
2118923
2119179
2119435
2119691
2119947
2120203
2120459
2120715
2120971
2121227
2121483
2113548
2113804
2114060
2114316
2114572
2114828
2115084
2115340
2115596
2115852
2116108
2116364
2116620
2116876
2117132
2117388
2117644
2117900
2118156
2118412
2118668
2118924
2119180
2119436
2119692
2119948
2120204
2120460
2120716
2120972
2121228
2121484
2113549
2113805
2114061
2114317
2114573
2114829
2115085
2115341
2115597
2115853
2116109
2116365
2116621
2116877
2117133
2117389
2117645
2117901
2118157
2118413
2118669
2118925
2119181
2119437
2119693
2119949
2120205
2120461
2120717
2120973
2121229
2121485
2113550
2113806
2114062
2114318
2114574
2114830
2115086
2115342
2115598
2115854
2116110
2116366
2116622
2116878
2117134
2117390
2117646
2117902
2118158
2118414
2118670
2118926
2119182
2119438
2119694
2119950
2120206
2120462
2120718
2120974
2121230
2121486
2113551
2113807
2114063
2114319
2114575
2114831
2115087
2115343
2115599
2115855
2116111
2116367
2116623
2116879
2117135
2117391
2117647
2117903
2118159
2118415
2118671
2118927
2119183
2119439
2119695
2119951
2120207
2120463
2120719
2120975
2121231
2121487
2113552
2113808
2114064
2114320
2114576
2114832
2115088
2115344
2115600
2115856
2116112
2116368
2116624
2116880
2117136
2117392
2117648
2117904
2118160
2118416
2118672
2118928
2119184
2119440
2119696
2119952
2120208
2120464
2120720
2120976
2121232
2121488
2113553
2113809
2114065
2114321
2114577
2114833
2115089
2115345
2115601
2115857
2116113
2116369
2116625
2116881
2117137
2117393
2117649
2117905
2118161
2118417
2118673
2118929
2119185
2119441
2119697
2119953
2120209
2120465
2120721
2120977
2121233
2121489
2113554
2113810
2114066
2114322
2114578
2114834
2115090
2115346
2115602
2115858
2116114
2116370
2116626
2116882
2117138
2117394
2117650
2117906
2118162
2118418
2118674
2118930
2119186
2119442
2119698
2119954
2120210
2120466
2120722
2120978
2121234
2121490
2113555
2113811
2114067
2114323
2114579
2114835
2115091
2115347
2115603
2115859
2116115
2116371
2116627
2116883
2117139
2117395
2117651
2117907
2118163
2118419
2118675
2118931
2119187
2119443
2119699
2119955
2120211
2120467
2120723
2120979
2121235
2121491
2113556
2113812
2114068
2114324
2114580
2114836
2115092
2115348
2115604
2115860
2116116
2116372
2116628
2116884
2117140
2117396
2117652
2117908
2118164
2118420
2118676
2118932
2119188
2119444
2119700
2119956
2120212
2120468
2120724
2120980
2121236
2121492
2113557
2113813
2114069
2114325
2114581
2114837
2115093
2115349
2115605
2115861
2116117
2116373
2116629
2116885
2117141
2117397
2117653
2117909
2118165
2118421
2118677
2118933
2119189
2119445
2119701
2119957
2120213
2120469
2120725
2120981
2121237
2121493
2113558
2113814
2114070
2114326
2114582
2114838
2115094
2115350
2115606
2115862
2116118
2116374
2116630
2116886
2117142
2117398
2117654
2117910
2118166
2118422
2118678
2118934
2119190
2119446
2119702
2119958
2120214
2120470
2120726
2120982
2121238
2121494
2113559
2113815
2114071
2114327
2114583
2114839
2115095
2115351
2115607
2115863
2116119
2116375
2116631
2116887
2117143
2117399
2117655
2117911
2118167
2118423
2118679
2118935
2119191
2119447
2119703
2119959
2120215
2120471
2120727
2120983
2121239
2121495
2113560
2113816
2114072
2114328
2114584
2114840
2115096
2115352
2115608
2115864
2116120
2116376
2116632
2116888
2117144
2117400
2117656
2117912
2118168
2118424
2118680
2118936
2119192
2119448
2119704
2119960
2120216
2120472
2120728
2120984
2121240
2121496
2113561
2113817
2114073
2114329
2114585
2114841
2115097
2115353
2115609
2115865
2116121
2116377
2116633
2116889
2117145
2117401
2117657
2117913
2118169
2118425
2118681
2118937
2119193
2119449
2119705
2119961
2120217
2120473
2120729
2120985
2121241
2121497
2113562
2113818
2114074
2114330
2114586
2114842
2115098
2115354
2115610
2115866
2116122
2116378
2116634
2116890
2117146
2117402
2117658
2117914
2118170
2118426
2118682
2118938
2119194
2119450
2119706
2119962
2120218
2120474
2120730
2120986
2121242
2121498
2113563
2113819
2114075
2114331
2114587
2114843
2115099
2115355
2115611
2115867
2116123
2116379
2116635
2116891
2117147
2117403
2117659
2117915
2118171
2118427
2118683
2118939
2119195
2119451
2119707
2119963
2120219
2120475
2120731
2120987
2121243
2121499
2113564
2113820
2114076
2114332
2114588
2114844
2115100
2115356
2115612
2115868
2116124
2116380
2116636
2116892
2117148
2117404
2117660
2117916
2118172
2118428
2118684
2118940
2119196
2119452
2119708
2119964
2120220
2120476
2120732
2120988
2121244
2121500
2113565
2113821
2114077
2114333
2114589
2114845
2115101
2115357
2115613
2115869
2116125
2116381
2116637
2116893
2117149
2117405
2117661
2117917
2118173
2118429
2118685
2118941
2119197
2119453
2119709
2119965
2120221
2120477
2120733
2120989
2121245
2121501
2113566
2113822
2114078
2114334
2114590
2114846
2115102
2115358
2115614
2115870
2116126
2116382
2116638
2116894
2117150
2117406
2117662
2117918
2118174
2118430
2118686
2118942
2119198
2119454
2119710
2119966
2120222
2120478
2120734
2120990
2121246
2121502
2113567
2113823
2114079
2114335
2114591
2114847
2115103
2115359
2115615
2115871
2116127
2116383
2116639
2116895
2117151
2117407
2117663
2117919
2118175
2118431
2118687
2118943
2119199
2119455
2119711
2119967
2120223
2120479
2120735
2120991
2121247
2121503
2113568
2113824
2114080
2114336
2114592
2114848
2115104
2115360
2115616
2115872
2116128
2116384
2116640
2116896
2117152
2117408
2117664
2117920
2118176
2118432
2118688
2118944
2119200
2119456
2119712
2119968
2120224
2120480
2120736
2120992
2121248
2121504
2113569
2113825
2114081
2114337
2114593
2114849
2115105
2115361
2115617
2115873
2116129
2116385
2116641
2116897
2117153
2117409
2117665
2117921
2118177
2118433
2118689
2118945
2119201
2119457
2119713
2119969
2120225
2120481
2120737
2120993
2121249
2121505
2113570
2113826
2114082
2114338
2114594
2114850
2115106
2115362
2115618
2115874
2116130
2116386
2116642
2116898
2117154
2117410
2117666
2117922
2118178
2118434
2118690
2118946
2119202
2119458
2119714
2119970
2120226
2120482
2120738
2120994
2121250
2121506
2113571
2113827
2114083
2114339
2114595
2114851
2115107
2115363
2115619
2115875
2116131
2116387
2116643
2116899
2117155
2117411
2117667
2117923
2118179
2118435
2118691
2118947
2119203
2119459
2119715
2119971
2120227
2120483
2120739
2120995
2121251
2121507
2113572
2113828
2114084
2114340
2114596
2114852
2115108
2115364
2115620
2115876
2116132
2116388
2116644
2116900
2117156
2117412
2117668
2117924
2118180
2118436
2118692
2118948
2119204
2119460
2119716
2119972
2120228
2120484
2120740
2120996
2121252
2121508
2113573
2113829
2114085
2114341
2114597
2114853
2115109
2115365
2115621
2115877
2116133
2116389
2116645
2116901
2117157
2117413
2117669
2117925
2118181
2118437
2118693
2118949
2119205
2119461
2119717
2119973
2120229
2120485
2120741
2120997
2121253
2121509
2113574
2113830
2114086
2114342
2114598
2114854
2115110
2115366
2115622
2115878
2116134
2116390
2116646
2116902
2117158
2117414
2117670
2117926
2118182
2118438
2118694
2118950
2119206
2119462
2119718
2119974
2120230
2120486
2120742
2120998
2121254
2121510
2113575
2113831
2114087
2114343
2114599
2114855
2115111
2115367
2115623
2115879
2116135
2116391
2116647
2116903
2117159
2117415
2117671
2117927
2118183
2118439
2118695
2118951
2119207
2119463
2119719
2119975
2120231
2120487
2120743
2120999
2121255
2121511
2113576
2113832
2114088
2114344
2114600
2114856
2115112
2115368
2115624
2115880
2116136
2116392
2116648
2116904
2117160
2117416
2117672
2117928
2118184
2118440
2118696
2118952
2119208
2119464
2119720
2119976
2120232
2120488
2120744
2121000
2121256
2121512
2113577
2113833
2114089
2114345
2114601
2114857
2115113
2115369
2115625
2115881
2116137
2116393
2116649
2116905
2117161
2117417
2117673
2117929
2118185
2118441
2118697
2118953
2119209
2119465
2119721
2119977
2120233
2120489
2120745
2121001
2121257
2121513
2113578
2113834
2114090
2114346
2114602
2114858
2115114
2115370
2115626
2115882
2116138
2116394
2116650
2116906
2117162
2117418
2117674
2117930
2118186
2118442
2118698
2118954
2119210
2119466
2119722
2119978
2120234
2120490
2120746
2121002
2121258
2121514
2113579
2113835
2114091
2114347
2114603
2114859
2115115
2115371
2115627
2115883
2116139
2116395
2116651
2116907
2117163
2117419
2117675
2117931
2118187
2118443
2118699
2118955
2119211
2119467
2119723
2119979
2120235
2120491
2120747
2121003
2121259
2121515
2113580
2113836
2114092
2114348
2114604
2114860
2115116
2115372
2115628
2115884
2116140
2116396
2116652
2116908
2117164
2117420
2117676
2117932
2118188
2118444
2118700
2118956
2119212
2119468
2119724
2119980
2120236
2120492
2120748
2121004
2121260
2121516
2113581
2113837
2114093
2114349
2114605
2114861
2115117
2115373
2115629
2115885
2116141
2116397
2116653
2116909
2117165
2117421
2117677
2117933
2118189
2118445
2118701
2118957
2119213
2119469
2119725
2119981
2120237
2120493
2120749
2121005
2121261
2121517
2113582
2113838
2114094
2114350
2114606
2114862
2115118
2115374
2115630
2115886
2116142
2116398
2116654
2116910
2117166
2117422
2117678
2117934
2118190
2118446
2118702
2118958
2119214
2119470
2119726
2119982
2120238
2120494
2120750
2121006
2121262
2121518
2113583
2113839
2114095
2114351
2114607
2114863
2115119
2115375
2115631
2115887
2116143
2116399
2116655
2116911
2117167
2117423
2117679
2117935
2118191
2118447
2118703
2118959
2119215
2119471
2119727
2119983
2120239
2120495
2120751
2121007
2121263
2121519
2113584
2113840
2114096
2114352
2114608
2114864
2115120
2115376
2115632
2115888
2116144
2116400
2116656
2116912
2117168
2117424
2117680
2117936
2118192
2118448
2118704
2118960
2119216
2119472
2119728
2119984
2120240
2120496
2120752
2121008
2121264
2121520
2113585
2113841
2114097
2114353
2114609
2114865
2115121
2115377
2115633
2115889
2116145
2116401
2116657
2116913
2117169
2117425
2117681
2117937
2118193
2118449
2118705
2118961
2119217
2119473
2119729
2119985
2120241
2120497
2120753
2121009
2121265
2121521
2113586
2113842
2114098
2114354
2114610
2114866
2115122
2115378
2115634
2115890
2116146
2116402
2116658
2116914
2117170
2117426
2117682
2117938
2118194
2118450
2118706
2118962
2119218
2119474
2119730
2119986
2120242
2120498
2120754
2121010
2121266
2121522
2113587
2113843
2114099
2114355
2114611
2114867
2115123
2115379
2115635
2115891
2116147
2116403
2116659
2116915
2117171
2117427
2117683
2117939
2118195
2118451
2118707
2118963
2119219
2119475
2119731
2119987
2120243
2120499
2120755
2121011
2121267
2121523
2113588
2113844
2114100
2114356
2114612
2114868
2115124
2115380
2115636
2115892
2116148
2116404
2116660
2116916
2117172
2117428
2117684
2117940
2118196
2118452
2118708
2118964
2119220
2119476
2119732
2119988
2120244
2120500
2120756
2121012
2121268
2121524
2113589
2113845
2114101
2114357
2114613
2114869
2115125
2115381
2115637
2115893
2116149
2116405
2116661
2116917
2117173
2117429
2117685
2117941
2118197
2118453
2118709
2118965
2119221
2119477
2119733
2119989
2120245
2120501
2120757
2121013
2121269
2121525
2113590
2113846
2114102
2114358
2114614
2114870
2115126
2115382
2115638
2115894
2116150
2116406
2116662
2116918
2117174
2117430
2117686
2117942
2118198
2118454
2118710
2118966
2119222
2119478
2119734
2119990
2120246
2120502
2120758
2121014
2121270
2121526
2113591
2113847
2114103
2114359
2114615
2114871
2115127
2115383
2115639
2115895
2116151
2116407
2116663
2116919
2117175
2117431
2117687
2117943
2118199
2118455
2118711
2118967
2119223
2119479
2119735
2119991
2120247
2120503
2120759
2121015
2121271
2121527
2113592
2113848
2114104
2114360
2114616
2114872
2115128
2115384
2115640
2115896
2116152
2116408
2116664
2116920
2117176
2117432
2117688
2117944
2118200
2118456
2118712
2118968
2119224
2119480
2119736
2119992
2120248
2120504
2120760
2121016
2121272
2121528
2113593
2113849
2114105
2114361
2114617
2114873
2115129
2115385
2115641
2115897
2116153
2116409
2116665
2116921
2117177
2117433
2117689
2117945
2118201
2118457
2118713
2118969
2119225
2119481
2119737
2119993
2120249
2120505
2120761
2121017
2121273
2121529
2113594
2113850
2114106
2114362
2114618
2114874
2115130
2115386
2115642
2115898
2116154
2116410
2116666
2116922
2117178
2117434
2117690
2117946
2118202
2118458
2118714
2118970
2119226
2119482
2119738
2119994
2120250
2120506
2120762
2121018
2121274
2121530
2113595
2113851
2114107
2114363
2114619
2114875
2115131
2115387
2115643
2115899
2116155
2116411
2116667
2116923
2117179
2117435
2117691
2117947
2118203
2118459
2118715
2118971
2119227
2119483
2119739
2119995
2120251
2120507
2120763
2121019
2121275
2121531
2113596
2113852
2114108
2114364
2114620
2114876
2115132
2115388
2115644
2115900
2116156
2116412
2116668
2116924
2117180
2117436
2117692
2117948
2118204
2118460
2118716
2118972
2119228
2119484
2119740
2119996
2120252
2120508
2120764
2121020
2121276
2121532
2113597
2113853
2114109
2114365
2114621
2114877
2115133
2115389
2115645
2115901
2116157
2116413
2116669
2116925
2117181
2117437
2117693
2117949
2118205
2118461
2118717
2118973
2119229
2119485
2119741
2119997
2120253
2120509
2120765
2121021
2121277
2121533
2113598
2113854
2114110
2114366
2114622
2114878
2115134
2115390
2115646
2115902
2116158
2116414
2116670
2116926
2117182
2117438
2117694
2117950
2118206
2118462
2118718
2118974
2119230
2119486
2119742
2119998
2120254
2120510
2120766
2121022
2121278
2121534
2113599
2113855
2114111
2114367
2114623
2114879
2115135
2115391
2115647
2115903
2116159
2116415
2116671
2116927
2117183
2117439
2117695
2117951
2118207
2118463
2118719
2118975
2119231
2119487
2119743
2119999
2120255
2120511
2120767
2121023
2121279
2121535
2113600
2113856
2114112
2114368
2114624
2114880
2115136
2115392
2115648
2115904
2116160
2116416
2116672
2116928
2117184
2117440
2117696
2117952
2118208
2118464
2118720
2118976
2119232
2119488
2119744
2120000
2120256
2120512
2120768
2121024
2121280
2121536
2113601
2113857
2114113
2114369
2114625
2114881
2115137
2115393
2115649
2115905
2116161
2116417
2116673
2116929
2117185
2117441
2117697
2117953
2118209
2118465
2118721
2118977
2119233
2119489
2119745
2120001
2120257
2120513
2120769
2121025
2121281
2121537
2113602
2113858
2114114
2114370
2114626
2114882
2115138
2115394
2115650
2115906
2116162
2116418
2116674
2116930
2117186
2117442
2117698
2117954
2118210
2118466
2118722
2118978
2119234
2119490
2119746
2120002
2120258
2120514
2120770
2121026
2121282
2121538
2113603
2113859
2114115
2114371
2114627
2114883
2115139
2115395
2115651
2115907
2116163
2116419
2116675
2116931
2117187
2117443
2117699
2117955
2118211
2118467
2118723
2118979
2119235
2119491
2119747
2120003
2120259
2120515
2120771
2121027
2121283
2121539
2113604
2113860
2114116
2114372
2114628
2114884
2115140
2115396
2115652
2115908
2116164
2116420
2116676
2116932
2117188
2117444
2117700
2117956
2118212
2118468
2118724
2118980
2119236
2119492
2119748
2120004
2120260
2120516
2120772
2121028
2121284
2121540
2113605
2113861
2114117
2114373
2114629
2114885
2115141
2115397
2115653
2115909
2116165
2116421
2116677
2116933
2117189
2117445
2117701
2117957
2118213
2118469
2118725
2118981
2119237
2119493
2119749
2120005
2120261
2120517
2120773
2121029
2121285
2121541
2113606
2113862
2114118
2114374
2114630
2114886
2115142
2115398
2115654
2115910
2116166
2116422
2116678
2116934
2117190
2117446
2117702
2117958
2118214
2118470
2118726
2118982
2119238
2119494
2119750
2120006
2120262
2120518
2120774
2121030
2121286
2121542
2113607
2113863
2114119
2114375
2114631
2114887
2115143
2115399
2115655
2115911
2116167
2116423
2116679
2116935
2117191
2117447
2117703
2117959
2118215
2118471
2118727
2118983
2119239
2119495
2119751
2120007
2120263
2120519
2120775
2121031
2121287
2121543
2113608
2113864
2114120
2114376
2114632
2114888
2115144
2115400
2115656
2115912
2116168
2116424
2116680
2116936
2117192
2117448
2117704
2117960
2118216
2118472
2118728
2118984
2119240
2119496
2119752
2120008
2120264
2120520
2120776
2121032
2121288
2121544
2113609
2113865
2114121
2114377
2114633
2114889
2115145
2115401
2115657
2115913
2116169
2116425
2116681
2116937
2117193
2117449
2117705
2117961
2118217
2118473
2118729
2118985
2119241
2119497
2119753
2120009
2120265
2120521
2120777
2121033
2121289
2121545
2113610
2113866
2114122
2114378
2114634
2114890
2115146
2115402
2115658
2115914
2116170
2116426
2116682
2116938
2117194
2117450
2117706
2117962
2118218
2118474
2118730
2118986
2119242
2119498
2119754
2120010
2120266
2120522
2120778
2121034
2121290
2121546
2113611
2113867
2114123
2114379
2114635
2114891
2115147
2115403
2115659
2115915
2116171
2116427
2116683
2116939
2117195
2117451
2117707
2117963
2118219
2118475
2118731
2118987
2119243
2119499
2119755
2120011
2120267
2120523
2120779
2121035
2121291
2121547
2113612
2113868
2114124
2114380
2114636
2114892
2115148
2115404
2115660
2115916
2116172
2116428
2116684
2116940
2117196
2117452
2117708
2117964
2118220
2118476
2118732
2118988
2119244
2119500
2119756
2120012
2120268
2120524
2120780
2121036
2121292
2121548
2113613
2113869
2114125
2114381
2114637
2114893
2115149
2115405
2115661
2115917
2116173
2116429
2116685
2116941
2117197
2117453
2117709
2117965
2118221
2118477
2118733
2118989
2119245
2119501
2119757
2120013
2120269
2120525
2120781
2121037
2121293
2121549
2113614
2113870
2114126
2114382
2114638
2114894
2115150
2115406
2115662
2115918
2116174
2116430
2116686
2116942
2117198
2117454
2117710
2117966
2118222
2118478
2118734
2118990
2119246
2119502
2119758
2120014
2120270
2120526
2120782
2121038
2121294
2121550
2113615
2113871
2114127
2114383
2114639
2114895
2115151
2115407
2115663
2115919
2116175
2116431
2116687
2116943
2117199
2117455
2117711
2117967
2118223
2118479
2118735
2118991
2119247
2119503
2119759
2120015
2120271
2120527
2120783
2121039
2121295
2121551
2113616
2113872
2114128
2114384
2114640
2114896
2115152
2115408
2115664
2115920
2116176
2116432
2116688
2116944
2117200
2117456
2117712
2117968
2118224
2118480
2118736
2118992
2119248
2119504
2119760
2120016
2120272
2120528
2120784
2121040
2121296
2121552
2113617
2113873
2114129
2114385
2114641
2114897
2115153
2115409
2115665
2115921
2116177
2116433
2116689
2116945
2117201
2117457
2117713
2117969
2118225
2118481
2118737
2118993
2119249
2119505
2119761
2120017
2120273
2120529
2120785
2121041
2121297
2121553
2113618
2113874
2114130
2114386
2114642
2114898
2115154
2115410
2115666
2115922
2116178
2116434
2116690
2116946
2117202
2117458
2117714
2117970
2118226
2118482
2118738
2118994
2119250
2119506
2119762
2120018
2120274
2120530
2120786
2121042
2121298
2121554
2113619
2113875
2114131
2114387
2114643
2114899
2115155
2115411
2115667
2115923
2116179
2116435
2116691
2116947
2117203
2117459
2117715
2117971
2118227
2118483
2118739
2118995
2119251
2119507
2119763
2120019
2120275
2120531
2120787
2121043
2121299
2121555
2113620
2113876
2114132
2114388
2114644
2114900
2115156
2115412
2115668
2115924
2116180
2116436
2116692
2116948
2117204
2117460
2117716
2117972
2118228
2118484
2118740
2118996
2119252
2119508
2119764
2120020
2120276
2120532
2120788
2121044
2121300
2121556
2113621
2113877
2114133
2114389
2114645
2114901
2115157
2115413
2115669
2115925
2116181
2116437
2116693
2116949
2117205
2117461
2117717
2117973
2118229
2118485
2118741
2118997
2119253
2119509
2119765
2120021
2120277
2120533
2120789
2121045
2121301
2121557
2113622
2113878
2114134
2114390
2114646
2114902
2115158
2115414
2115670
2115926
2116182
2116438
2116694
2116950
2117206
2117462
2117718
2117974
2118230
2118486
2118742
2118998
2119254
2119510
2119766
2120022
2120278
2120534
2120790
2121046
2121302
2121558
2113623
2113879
2114135
2114391
2114647
2114903
2115159
2115415
2115671
2115927
2116183
2116439
2116695
2116951
2117207
2117463
2117719
2117975
2118231
2118487
2118743
2118999
2119255
2119511
2119767
2120023
2120279
2120535
2120791
2121047
2121303
2121559
2113624
2113880
2114136
2114392
2114648
2114904
2115160
2115416
2115672
2115928
2116184
2116440
2116696
2116952
2117208
2117464
2117720
2117976
2118232
2118488
2118744
2119000
2119256
2119512
2119768
2120024
2120280
2120536
2120792
2121048
2121304
2121560
2113625
2113881
2114137
2114393
2114649
2114905
2115161
2115417
2115673
2115929
2116185
2116441
2116697
2116953
2117209
2117465
2117721
2117977
2118233
2118489
2118745
2119001
2119257
2119513
2119769
2120025
2120281
2120537
2120793
2121049
2121305
2121561
2113626
2113882
2114138
2114394
2114650
2114906
2115162
2115418
2115674
2115930
2116186
2116442
2116698
2116954
2117210
2117466
2117722
2117978
2118234
2118490
2118746
2119002
2119258
2119514
2119770
2120026
2120282
2120538
2120794
2121050
2121306
2121562
2113627
2113883
2114139
2114395
2114651
2114907
2115163
2115419
2115675
2115931
2116187
2116443
2116699
2116955
2117211
2117467
2117723
2117979
2118235
2118491
2118747
2119003
2119259
2119515
2119771
2120027
2120283
2120539
2120795
2121051
2121307
2121563
2113628
2113884
2114140
2114396
2114652
2114908
2115164
2115420
2115676
2115932
2116188
2116444
2116700
2116956
2117212
2117468
2117724
2117980
2118236
2118492
2118748
2119004
2119260
2119516
2119772
2120028
2120284
2120540
2120796
2121052
2121308
2121564
2113629
2113885
2114141
2114397
2114653
2114909
2115165
2115421
2115677
2115933
2116189
2116445
2116701
2116957
2117213
2117469
2117725
2117981
2118237
2118493
2118749
2119005
2119261
2119517
2119773
2120029
2120285
2120541
2120797
2121053
2121309
2121565
2113630
2113886
2114142
2114398
2114654
2114910
2115166
2115422
2115678
2115934
2116190
2116446
2116702
2116958
2117214
2117470
2117726
2117982
2118238
2118494
2118750
2119006
2119262
2119518
2119774
2120030
2120286
2120542
2120798
2121054
2121310
2121566
2113631
2113887
2114143
2114399
2114655
2114911
2115167
2115423
2115679
2115935
2116191
2116447
2116703
2116959
2117215
2117471
2117727
2117983
2118239
2118495
2118751
2119007
2119263
2119519
2119775
2120031
2120287
2120543
2120799
2121055
2121311
2121567
2506752
2507008
2507264
2507520
2507776
2508032
2508288
2508544
2508800
2509056
2509312
2509568
2509824
2510080
2510336
2510592
2510848
2511104
2511360
2511616
2511872
2512128
2512384
2512640
2512896
2513152
2513408
2513664
2513920
2514176
2514432
2514688
2506753
2507009
2507265
2507521
2507777
2508033
2508289
2508545
2508801
2509057
2509313
2509569
2509825
2510081
2510337
2510593
2510849
2511105
2511361
2511617
2511873
2512129
2512385
2512641
2512897
2513153
2513409
2513665
2513921
2514177
2514433
2514689
2506754
2507010
2507266
2507522
2507778
2508034
2508290
2508546
2508802
2509058
2509314
2509570
2509826
2510082
2510338
2510594
2510850
2511106
2511362
2511618
2511874
2512130
2512386
2512642
2512898
2513154
2513410
2513666
2513922
2514178
2514434
2514690
2506755
2507011
2507267
2507523
2507779
2508035
2508291
2508547
2508803
2509059
2509315
2509571
2509827
2510083
2510339
2510595
2510851
2511107
2511363
2511619
2511875
2512131
2512387
2512643
2512899
2513155
2513411
2513667
2513923
2514179
2514435
2514691
2506756
2507012
2507268
2507524
2507780
2508036
2508292
2508548
2508804
2509060
2509316
2509572
2509828
2510084
2510340
2510596
2510852
2511108
2511364
2511620
2511876
2512132
2512388
2512644
2512900
2513156
2513412
2513668
2513924
2514180
2514436
2514692
2506757
2507013
2507269
2507525
2507781
2508037
2508293
2508549
2508805
2509061
2509317
2509573
2509829
2510085
2510341
2510597
2510853
2511109
2511365
2511621
2511877
2512133
2512389
2512645
2512901
2513157
2513413
2513669
2513925
2514181
2514437
2514693
2506758
2507014
2507270
2507526
2507782
2508038
2508294
2508550
2508806
2509062
2509318
2509574
2509830
2510086
2510342
2510598
2510854
2511110
2511366
2511622
2511878
2512134
2512390
2512646
2512902
2513158
2513414
2513670
2513926
2514182
2514438
2514694
2506759
2507015
2507271
2507527
2507783
2508039
2508295
2508551
2508807
2509063
2509319
2509575
2509831
2510087
2510343
2510599
2510855
2511111
2511367
2511623
2511879
2512135
2512391
2512647
2512903
2513159
2513415
2513671
2513927
2514183
2514439
2514695
2506760
2507016
2507272
2507528
2507784
2508040
2508296
2508552
2508808
2509064
2509320
2509576
2509832
2510088
2510344
2510600
2510856
2511112
2511368
2511624
2511880
2512136
2512392
2512648
2512904
2513160
2513416
2513672
2513928
2514184
2514440
2514696
2506761
2507017
2507273
2507529
2507785
2508041
2508297
2508553
2508809
2509065
2509321
2509577
2509833
2510089
2510345
2510601
2510857
2511113
2511369
2511625
2511881
2512137
2512393
2512649
2512905
2513161
2513417
2513673
2513929
2514185
2514441
2514697
2506762
2507018
2507274
2507530
2507786
2508042
2508298
2508554
2508810
2509066
2509322
2509578
2509834
2510090
2510346
2510602
2510858
2511114
2511370
2511626
2511882
2512138
2512394
2512650
2512906
2513162
2513418
2513674
2513930
2514186
2514442
2514698
2506763
2507019
2507275
2507531
2507787
2508043
2508299
2508555
2508811
2509067
2509323
2509579
2509835
2510091
2510347
2510603
2510859
2511115
2511371
2511627
2511883
2512139
2512395
2512651
2512907
2513163
2513419
2513675
2513931
2514187
2514443
2514699
2506764
2507020
2507276
2507532
2507788
2508044
2508300
2508556
2508812
2509068
2509324
2509580
2509836
2510092
2510348
2510604
2510860
2511116
2511372
2511628
2511884
2512140
2512396
2512652
2512908
2513164
2513420
2513676
2513932
2514188
2514444
2514700
2506765
2507021
2507277
2507533
2507789
2508045
2508301
2508557
2508813
2509069
2509325
2509581
2509837
2510093
2510349
2510605
2510861
2511117
2511373
2511629
2511885
2512141
2512397
2512653
2512909
2513165
2513421
2513677
2513933
2514189
2514445
2514701
2506766
2507022
2507278
2507534
2507790
2508046
2508302
2508558
2508814
2509070
2509326
2509582
2509838
2510094
2510350
2510606
2510862
2511118
2511374
2511630
2511886
2512142
2512398
2512654
2512910
2513166
2513422
2513678
2513934
2514190
2514446
2514702
2506767
2507023
2507279
2507535
2507791
2508047
2508303
2508559
2508815
2509071
2509327
2509583
2509839
2510095
2510351
2510607
2510863
2511119
2511375
2511631
2511887
2512143
2512399
2512655
2512911
2513167
2513423
2513679
2513935
2514191
2514447
2514703
2506768
2507024
2507280
2507536
2507792
2508048
2508304
2508560
2508816
2509072
2509328
2509584
2509840
2510096
2510352
2510608
2510864
2511120
2511376
2511632
2511888
2512144
2512400
2512656
2512912
2513168
2513424
2513680
2513936
2514192
2514448
2514704
2506769
2507025
2507281
2507537
2507793
2508049
2508305
2508561
2508817
2509073
2509329
2509585
2509841
2510097
2510353
2510609
2510865
2511121
2511377
2511633
2511889
2512145
2512401
2512657
2512913
2513169
2513425
2513681
2513937
2514193
2514449
2514705
2506770
2507026
2507282
2507538
2507794
2508050
2508306
2508562
2508818
2509074
2509330
2509586
2509842
2510098
2510354
2510610
2510866
2511122
2511378
2511634
2511890
2512146
2512402
2512658
2512914
2513170
2513426
2513682
2513938
2514194
2514450
2514706
2506771
2507027
2507283
2507539
2507795
2508051
2508307
2508563
2508819
2509075
2509331
2509587
2509843
2510099
2510355
2510611
2510867
2511123
2511379
2511635
2511891
2512147
2512403
2512659
2512915
2513171
2513427
2513683
2513939
2514195
2514451
2514707
2506772
2507028
2507284
2507540
2507796
2508052
2508308
2508564
2508820
2509076
2509332
2509588
2509844
2510100
2510356
2510612
2510868
2511124
2511380
2511636
2511892
2512148
2512404
2512660
2512916
2513172
2513428
2513684
2513940
2514196
2514452
2514708
2506773
2507029
2507285
2507541
2507797
2508053
2508309
2508565
2508821
2509077
2509333
2509589
2509845
2510101
2510357
2510613
2510869
2511125
2511381
2511637
2511893
2512149
2512405
2512661
2512917
2513173
2513429
2513685
2513941
2514197
2514453
2514709
2506774
2507030
2507286
2507542
2507798
2508054
2508310
2508566
2508822
2509078
2509334
2509590
2509846
2510102
2510358
2510614
2510870
2511126
2511382
2511638
2511894
2512150
2512406
2512662
2512918
2513174
2513430
2513686
2513942
2514198
2514454
2514710
2506775
2507031
2507287
2507543
2507799
2508055
2508311
2508567
2508823
2509079
2509335
2509591
2509847
2510103
2510359
2510615
2510871
2511127
2511383
2511639
2511895
2512151
2512407
2512663
2512919
2513175
2513431
2513687
2513943
2514199
2514455
2514711
2506776
2507032
2507288
2507544
2507800
2508056
2508312
2508568
2508824
2509080
2509336
2509592
2509848
2510104
2510360
2510616
2510872
2511128
2511384
2511640
2511896
2512152
2512408
2512664
2512920
2513176
2513432
2513688
2513944
2514200
2514456
2514712
2506777
2507033
2507289
2507545
2507801
2508057
2508313
2508569
2508825
2509081
2509337
2509593
2509849
2510105
2510361
2510617
2510873
2511129
2511385
2511641
2511897
2512153
2512409
2512665
2512921
2513177
2513433
2513689
2513945
2514201
2514457
2514713
2506778
2507034
2507290
2507546
2507802
2508058
2508314
2508570
2508826
2509082
2509338
2509594
2509850
2510106
2510362
2510618
2510874
2511130
2511386
2511642
2511898
2512154
2512410
2512666
2512922
2513178
2513434
2513690
2513946
2514202
2514458
2514714
2506779
2507035
2507291
2507547
2507803
2508059
2508315
2508571
2508827
2509083
2509339
2509595
2509851
2510107
2510363
2510619
2510875
2511131
2511387
2511643
2511899
2512155
2512411
2512667
2512923
2513179
2513435
2513691
2513947
2514203
2514459
2514715
2506780
2507036
2507292
2507548
2507804
2508060
2508316
2508572
2508828
2509084
2509340
2509596
2509852
2510108
2510364
2510620
2510876
2511132
2511388
2511644
2511900
2512156
2512412
2512668
2512924
2513180
2513436
2513692
2513948
2514204
2514460
2514716
2506781
2507037
2507293
2507549
2507805
2508061
2508317
2508573
2508829
2509085
2509341
2509597
2509853
2510109
2510365
2510621
2510877
2511133
2511389
2511645
2511901
2512157
2512413
2512669
2512925
2513181
2513437
2513693
2513949
2514205
2514461
2514717
2506782
2507038
2507294
2507550
2507806
2508062
2508318
2508574
2508830
2509086
2509342
2509598
2509854
2510110
2510366
2510622
2510878
2511134
2511390
2511646
2511902
2512158
2512414
2512670
2512926
2513182
2513438
2513694
2513950
2514206
2514462
2514718
2506783
2507039
2507295
2507551
2507807
2508063
2508319
2508575
2508831
2509087
2509343
2509599
2509855
2510111
2510367
2510623
2510879
2511135
2511391
2511647
2511903
2512159
2512415
2512671
2512927
2513183
2513439
2513695
2513951
2514207
2514463
2514719
2506784
2507040
2507296
2507552
2507808
2508064
2508320
2508576
2508832
2509088
2509344
2509600
2509856
2510112
2510368
2510624
2510880
2511136
2511392
2511648
2511904
2512160
2512416
2512672
2512928
2513184
2513440
2513696
2513952
2514208
2514464
2514720
2506785
2507041
2507297
2507553
2507809
2508065
2508321
2508577
2508833
2509089
2509345
2509601
2509857
2510113
2510369
2510625
2510881
2511137
2511393
2511649
2511905
2512161
2512417
2512673
2512929
2513185
2513441
2513697
2513953
2514209
2514465
2514721
2506786
2507042
2507298
2507554
2507810
2508066
2508322
2508578
2508834
2509090
2509346
2509602
2509858
2510114
2510370
2510626
2510882
2511138
2511394
2511650
2511906
2512162
2512418
2512674
2512930
2513186
2513442
2513698
2513954
2514210
2514466
2514722
2506787
2507043
2507299
2507555
2507811
2508067
2508323
2508579
2508835
2509091
2509347
2509603
2509859
2510115
2510371
2510627
2510883
2511139
2511395
2511651
2511907
2512163
2512419
2512675
2512931
2513187
2513443
2513699
2513955
2514211
2514467
2514723
2506788
2507044
2507300
2507556
2507812
2508068
2508324
2508580
2508836
2509092
2509348
2509604
2509860
2510116
2510372
2510628
2510884
2511140
2511396
2511652
2511908
2512164
2512420
2512676
2512932
2513188
2513444
2513700
2513956
2514212
2514468
2514724
2506789
2507045
2507301
2507557
2507813
2508069
2508325
2508581
2508837
2509093
2509349
2509605
2509861
2510117
2510373
2510629
2510885
2511141
2511397
2511653
2511909
2512165
2512421
2512677
2512933
2513189
2513445
2513701
2513957
2514213
2514469
2514725
2506790
2507046
2507302
2507558
2507814
2508070
2508326
2508582
2508838
2509094
2509350
2509606
2509862
2510118
2510374
2510630
2510886
2511142
2511398
2511654
2511910
2512166
2512422
2512678
2512934
2513190
2513446
2513702
2513958
2514214
2514470
2514726
2506791
2507047
2507303
2507559
2507815
2508071
2508327
2508583
2508839
2509095
2509351
2509607
2509863
2510119
2510375
2510631
2510887
2511143
2511399
2511655
2511911
2512167
2512423
2512679
2512935
2513191
2513447
2513703
2513959
2514215
2514471
2514727
2506792
2507048
2507304
2507560
2507816
2508072
2508328
2508584
2508840
2509096
2509352
2509608
2509864
2510120
2510376
2510632
2510888
2511144
2511400
2511656
2511912
2512168
2512424
2512680
2512936
2513192
2513448
2513704
2513960
2514216
2514472
2514728
2506793
2507049
2507305
2507561
2507817
2508073
2508329
2508585
2508841
2509097
2509353
2509609
2509865
2510121
2510377
2510633
2510889
2511145
2511401
2511657
2511913
2512169
2512425
2512681
2512937
2513193
2513449
2513705
2513961
2514217
2514473
2514729
2506794
2507050
2507306
2507562
2507818
2508074
2508330
2508586
2508842
2509098
2509354
2509610
2509866
2510122
2510378
2510634
2510890
2511146
2511402
2511658
2511914
2512170
2512426
2512682
2512938
2513194
2513450
2513706
2513962
2514218
2514474
2514730
2506795
2507051
2507307
2507563
2507819
2508075
2508331
2508587
2508843
2509099
2509355
2509611
2509867
2510123
2510379
2510635
2510891
2511147
2511403
2511659
2511915
2512171
2512427
2512683
2512939
2513195
2513451
2513707
2513963
2514219
2514475
2514731
2506796
2507052
2507308
2507564
2507820
2508076
2508332
2508588
2508844
2509100
2509356
2509612
2509868
2510124
2510380
2510636
2510892
2511148
2511404
2511660
2511916
2512172
2512428
2512684
2512940
2513196
2513452
2513708
2513964
2514220
2514476
2514732
2506797
2507053
2507309
2507565
2507821
2508077
2508333
2508589
2508845
2509101
2509357
2509613
2509869
2510125
2510381
2510637
2510893
2511149
2511405
2511661
2511917
2512173
2512429
2512685
2512941
2513197
2513453
2513709
2513965
2514221
2514477
2514733
2506798
2507054
2507310
2507566
2507822
2508078
2508334
2508590
2508846
2509102
2509358
2509614
2509870
2510126
2510382
2510638
2510894
2511150
2511406
2511662
2511918
2512174
2512430
2512686
2512942
2513198
2513454
2513710
2513966
2514222
2514478
2514734
2506799
2507055
2507311
2507567
2507823
2508079
2508335
2508591
2508847
2509103
2509359
2509615
2509871
2510127
2510383
2510639
2510895
2511151
2511407
2511663
2511919
2512175
2512431
2512687
2512943
2513199
2513455
2513711
2513967
2514223
2514479
2514735
2506800
2507056
2507312
2507568
2507824
2508080
2508336
2508592
2508848
2509104
2509360
2509616
2509872
2510128
2510384
2510640
2510896
2511152
2511408
2511664
2511920
2512176
2512432
2512688
2512944
2513200
2513456
2513712
2513968
2514224
2514480
2514736
2506801
2507057
2507313
2507569
2507825
2508081
2508337
2508593
2508849
2509105
2509361
2509617
2509873
2510129
2510385
2510641
2510897
2511153
2511409
2511665
2511921
2512177
2512433
2512689
2512945
2513201
2513457
2513713
2513969
2514225
2514481
2514737
2506802
2507058
2507314
2507570
2507826
2508082
2508338
2508594
2508850
2509106
2509362
2509618
2509874
2510130
2510386
2510642
2510898
2511154
2511410
2511666
2511922
2512178
2512434
2512690
2512946
2513202
2513458
2513714
2513970
2514226
2514482
2514738
2506803
2507059
2507315
2507571
2507827
2508083
2508339
2508595
2508851
2509107
2509363
2509619
2509875
2510131
2510387
2510643
2510899
2511155
2511411
2511667
2511923
2512179
2512435
2512691
2512947
2513203
2513459
2513715
2513971
2514227
2514483
2514739
2506804
2507060
2507316
2507572
2507828
2508084
2508340
2508596
2508852
2509108
2509364
2509620
2509876
2510132
2510388
2510644
2510900
2511156
2511412
2511668
2511924
2512180
2512436
2512692
2512948
2513204
2513460
2513716
2513972
2514228
2514484
2514740
2506805
2507061
2507317
2507573
2507829
2508085
2508341
2508597
2508853
2509109
2509365
2509621
2509877
2510133
2510389
2510645
2510901
2511157
2511413
2511669
2511925
2512181
2512437
2512693
2512949
2513205
2513461
2513717
2513973
2514229
2514485
2514741
2506806
2507062
2507318
2507574
2507830
2508086
2508342
2508598
2508854
2509110
2509366
2509622
2509878
2510134
2510390
2510646
2510902
2511158
2511414
2511670
2511926
2512182
2512438
2512694
2512950
2513206
2513462
2513718
2513974
2514230
2514486
2514742
2506807
2507063
2507319
2507575
2507831
2508087
2508343
2508599
2508855
2509111
2509367
2509623
2509879
2510135
2510391
2510647
2510903
2511159
2511415
2511671
2511927
2512183
2512439
2512695
2512951
2513207
2513463
2513719
2513975
2514231
2514487
2514743
2506808
2507064
2507320
2507576
2507832
2508088
2508344
2508600
2508856
2509112
2509368
2509624
2509880
2510136
2510392
2510648
2510904
2511160
2511416
2511672
2511928
2512184
2512440
2512696
2512952
2513208
2513464
2513720
2513976
2514232
2514488
2514744
2506809
2507065
2507321
2507577
2507833
2508089
2508345
2508601
2508857
2509113
2509369
2509625
2509881
2510137
2510393
2510649
2510905
2511161
2511417
2511673
2511929
2512185
2512441
2512697
2512953
2513209
2513465
2513721
2513977
2514233
2514489
2514745
2506810
2507066
2507322
2507578
2507834
2508090
2508346
2508602
2508858
2509114
2509370
2509626
2509882
2510138
2510394
2510650
2510906
2511162
2511418
2511674
2511930
2512186
2512442
2512698
2512954
2513210
2513466
2513722
2513978
2514234
2514490
2514746
2506811
2507067
2507323
2507579
2507835
2508091
2508347
2508603
2508859
2509115
2509371
2509627
2509883
2510139
2510395
2510651
2510907
2511163
2511419
2511675
2511931
2512187
2512443
2512699
2512955
2513211
2513467
2513723
2513979
2514235
2514491
2514747
2506812
2507068
2507324
2507580
2507836
2508092
2508348
2508604
2508860
2509116
2509372
2509628
2509884
2510140
2510396
2510652
2510908
2511164
2511420
2511676
2511932
2512188
2512444
2512700
2512956
2513212
2513468
2513724
2513980
2514236
2514492
2514748
2506813
2507069
2507325
2507581
2507837
2508093
2508349
2508605
2508861
2509117
2509373
2509629
2509885
2510141
2510397
2510653
2510909
2511165
2511421
2511677
2511933
2512189
2512445
2512701
2512957
2513213
2513469
2513725
2513981
2514237
2514493
2514749
2506814
2507070
2507326
2507582
2507838
2508094
2508350
2508606
2508862
2509118
2509374
2509630
2509886
2510142
2510398
2510654
2510910
2511166
2511422
2511678
2511934
2512190
2512446
2512702
2512958
2513214
2513470
2513726
2513982
2514238
2514494
2514750
2506815
2507071
2507327
2507583
2507839
2508095
2508351
2508607
2508863
2509119
2509375
2509631
2509887
2510143
2510399
2510655
2510911
2511167
2511423
2511679
2511935
2512191
2512447
2512703
2512959
2513215
2513471
2513727
2513983
2514239
2514495
2514751
2506816
2507072
2507328
2507584
2507840
2508096
2508352
2508608
2508864
2509120
2509376
2509632
2509888
2510144
2510400
2510656
2510912
2511168
2511424
2511680
2511936
2512192
2512448
2512704
2512960
2513216
2513472
2513728
2513984
2514240
2514496
2514752
2506817
2507073
2507329
2507585
2507841
2508097
2508353
2508609
2508865
2509121
2509377
2509633
2509889
2510145
2510401
2510657
2510913
2511169
2511425
2511681
2511937
2512193
2512449
2512705
2512961
2513217
2513473
2513729
2513985
2514241
2514497
2514753
2506818
2507074
2507330
2507586
2507842
2508098
2508354
2508610
2508866
2509122
2509378
2509634
2509890
2510146
2510402
2510658
2510914
2511170
2511426
2511682
2511938
2512194
2512450
2512706
2512962
2513218
2513474
2513730
2513986
2514242
2514498
2514754
2506819
2507075
2507331
2507587
2507843
2508099
2508355
2508611
2508867
2509123
2509379
2509635
2509891
2510147
2510403
2510659
2510915
2511171
2511427
2511683
2511939
2512195
2512451
2512707
2512963
2513219
2513475
2513731
2513987
2514243
2514499
2514755
2506820
2507076
2507332
2507588
2507844
2508100
2508356
2508612
2508868
2509124
2509380
2509636
2509892
2510148
2510404
2510660
2510916
2511172
2511428
2511684
2511940
2512196
2512452
2512708
2512964
2513220
2513476
2513732
2513988
2514244
2514500
2514756
2506821
2507077
2507333
2507589
2507845
2508101
2508357
2508613
2508869
2509125
2509381
2509637
2509893
2510149
2510405
2510661
2510917
2511173
2511429
2511685
2511941
2512197
2512453
2512709
2512965
2513221
2513477
2513733
2513989
2514245
2514501
2514757
2506822
2507078
2507334
2507590
2507846
2508102
2508358
2508614
2508870
2509126
2509382
2509638
2509894
2510150
2510406
2510662
2510918
2511174
2511430
2511686
2511942
2512198
2512454
2512710
2512966
2513222
2513478
2513734
2513990
2514246
2514502
2514758
2506823
2507079
2507335
2507591
2507847
2508103
2508359
2508615
2508871
2509127
2509383
2509639
2509895
2510151
2510407
2510663
2510919
2511175
2511431
2511687
2511943
2512199
2512455
2512711
2512967
2513223
2513479
2513735
2513991
2514247
2514503
2514759
2506824
2507080
2507336
2507592
2507848
2508104
2508360
2508616
2508872
2509128
2509384
2509640
2509896
2510152
2510408
2510664
2510920
2511176
2511432
2511688
2511944
2512200
2512456
2512712
2512968
2513224
2513480
2513736
2513992
2514248
2514504
2514760
2506825
2507081
2507337
2507593
2507849
2508105
2508361
2508617
2508873
2509129
2509385
2509641
2509897
2510153
2510409
2510665
2510921
2511177
2511433
2511689
2511945
2512201
2512457
2512713
2512969
2513225
2513481
2513737
2513993
2514249
2514505
2514761
2506826
2507082
2507338
2507594
2507850
2508106
2508362
2508618
2508874
2509130
2509386
2509642
2509898
2510154
2510410
2510666
2510922
2511178
2511434
2511690
2511946
2512202
2512458
2512714
2512970
2513226
2513482
2513738
2513994
2514250
2514506
2514762
2506827
2507083
2507339
2507595
2507851
2508107
2508363
2508619
2508875
2509131
2509387
2509643
2509899
2510155
2510411
2510667
2510923
2511179
2511435
2511691
2511947
2512203
2512459
2512715
2512971
2513227
2513483
2513739
2513995
2514251
2514507
2514763
2506828
2507084
2507340
2507596
2507852
2508108
2508364
2508620
2508876
2509132
2509388
2509644
2509900
2510156
2510412
2510668
2510924
2511180
2511436
2511692
2511948
2512204
2512460
2512716
2512972
2513228
2513484
2513740
2513996
2514252
2514508
2514764
2506829
2507085
2507341
2507597
2507853
2508109
2508365
2508621
2508877
2509133
2509389
2509645
2509901
2510157
2510413
2510669
2510925
2511181
2511437
2511693
2511949
2512205
2512461
2512717
2512973
2513229
2513485
2513741
2513997
2514253
2514509
2514765
2506830
2507086
2507342
2507598
2507854
2508110
2508366
2508622
2508878
2509134
2509390
2509646
2509902
2510158
2510414
2510670
2510926
2511182
2511438
2511694
2511950
2512206
2512462
2512718
2512974
2513230
2513486
2513742
2513998
2514254
2514510
2514766
2506831
2507087
2507343
2507599
2507855
2508111
2508367
2508623
2508879
2509135
2509391
2509647
2509903
2510159
2510415
2510671
2510927
2511183
2511439
2511695
2511951
2512207
2512463
2512719
2512975
2513231
2513487
2513743
2513999
2514255
2514511
2514767
2506832
2507088
2507344
2507600
2507856
2508112
2508368
2508624
2508880
2509136
2509392
2509648
2509904
2510160
2510416
2510672
2510928
2511184
2511440
2511696
2511952
2512208
2512464
2512720
2512976
2513232
2513488
2513744
2514000
2514256
2514512
2514768
2506833
2507089
2507345
2507601
2507857
2508113
2508369
2508625
2508881
2509137
2509393
2509649
2509905
2510161
2510417
2510673
2510929
2511185
2511441
2511697
2511953
2512209
2512465
2512721
2512977
2513233
2513489
2513745
2514001
2514257
2514513
2514769
2506834
2507090
2507346
2507602
2507858
2508114
2508370
2508626
2508882
2509138
2509394
2509650
2509906
2510162
2510418
2510674
2510930
2511186
2511442
2511698
2511954
2512210
2512466
2512722
2512978
2513234
2513490
2513746
2514002
2514258
2514514
2514770
2506835
2507091
2507347
2507603
2507859
2508115
2508371
2508627
2508883
2509139
2509395
2509651
2509907
2510163
2510419
2510675
2510931
2511187
2511443
2511699
2511955
2512211
2512467
2512723
2512979
2513235
2513491
2513747
2514003
2514259
2514515
2514771
2506836
2507092
2507348
2507604
2507860
2508116
2508372
2508628
2508884
2509140
2509396
2509652
2509908
2510164
2510420
2510676
2510932
2511188
2511444
2511700
2511956
2512212
2512468
2512724
2512980
2513236
2513492
2513748
2514004
2514260
2514516
2514772
2506837
2507093
2507349
2507605
2507861
2508117
2508373
2508629
2508885
2509141
2509397
2509653
2509909
2510165
2510421
2510677
2510933
2511189
2511445
2511701
2511957
2512213
2512469
2512725
2512981
2513237
2513493
2513749
2514005
2514261
2514517
2514773
2506838
2507094
2507350
2507606
2507862
2508118
2508374
2508630
2508886
2509142
2509398
2509654
2509910
2510166
2510422
2510678
2510934
2511190
2511446
2511702
2511958
2512214
2512470
2512726
2512982
2513238
2513494
2513750
2514006
2514262
2514518
2514774
2506839
2507095
2507351
2507607
2507863
2508119
2508375
2508631
2508887
2509143
2509399
2509655
2509911
2510167
2510423
2510679
2510935
2511191
2511447
2511703
2511959
2512215
2512471
2512727
2512983
2513239
2513495
2513751
2514007
2514263
2514519
2514775
2506840
2507096
2507352
2507608
2507864
2508120
2508376
2508632
2508888
2509144
2509400
2509656
2509912
2510168
2510424
2510680
2510936
2511192
2511448
2511704
2511960
2512216
2512472
2512728
2512984
2513240
2513496
2513752
2514008
2514264
2514520
2514776
2506841
2507097
2507353
2507609
2507865
2508121
2508377
2508633
2508889
2509145
2509401
2509657
2509913
2510169
2510425
2510681
2510937
2511193
2511449
2511705
2511961
2512217
2512473
2512729
2512985
2513241
2513497
2513753
2514009
2514265
2514521
2514777
2506842
2507098
2507354
2507610
2507866
2508122
2508378
2508634
2508890
2509146
2509402
2509658
2509914
2510170
2510426
2510682
2510938
2511194
2511450
2511706
2511962
2512218
2512474
2512730
2512986
2513242
2513498
2513754
2514010
2514266
2514522
2514778
2506843
2507099
2507355
2507611
2507867
2508123
2508379
2508635
2508891
2509147
2509403
2509659
2509915
2510171
2510427
2510683
2510939
2511195
2511451
2511707
2511963
2512219
2512475
2512731
2512987
2513243
2513499
2513755
2514011
2514267
2514523
2514779
2506844
2507100
2507356
2507612
2507868
2508124
2508380
2508636
2508892
2509148
2509404
2509660
2509916
2510172
2510428
2510684
2510940
2511196
2511452
2511708
2511964
2512220
2512476
2512732
2512988
2513244
2513500
2513756
2514012
2514268
2514524
2514780
2506845
2507101
2507357
2507613
2507869
2508125
2508381
2508637
2508893
2509149
2509405
2509661
2509917
2510173
2510429
2510685
2510941
2511197
2511453
2511709
2511965
2512221
2512477
2512733
2512989
2513245
2513501
2513757
2514013
2514269
2514525
2514781
2506846
2507102
2507358
2507614
2507870
2508126
2508382
2508638
2508894
2509150
2509406
2509662
2509918
2510174
2510430
2510686
2510942
2511198
2511454
2511710
2511966
2512222
2512478
2512734
2512990
2513246
2513502
2513758
2514014
2514270
2514526
2514782
2506847
2507103
2507359
2507615
2507871
2508127
2508383
2508639
2508895
2509151
2509407
2509663
2509919
2510175
2510431
2510687
2510943
2511199
2511455
2511711
2511967
2512223
2512479
2512735
2512991
2513247
2513503
2513759
2514015
2514271
2514527
2514783
3080192
3080448
3080704
3080960
3081216
3081472
3081728
3081984
3082240
3082496
3082752
3083008
3083264
3083520
3083776
3084032
3084288
3084544
3084800
3085056
3085312
3085568
3085824
3086080
3086336
3086592
3086848
3087104
3087360
3087616
3087872
3088128
3080193
3080449
3080705
3080961
3081217
3081473
3081729
3081985
3082241
3082497
3082753
3083009
3083265
3083521
3083777
3084033
3084289
3084545
3084801
3085057
3085313
3085569
3085825
3086081
3086337
3086593
3086849
3087105
3087361
3087617
3087873
3088129
3080194
3080450
3080706
3080962
3081218
3081474
3081730
3081986
3082242
3082498
3082754
3083010
3083266
3083522
3083778
3084034
3084290
3084546
3084802
3085058
3085314
3085570
3085826
3086082
3086338
3086594
3086850
3087106
3087362
3087618
3087874
3088130
3080195
3080451
3080707
3080963
3081219
3081475
3081731
3081987
3082243
3082499
3082755
3083011
3083267
3083523
3083779
3084035
3084291
3084547
3084803
3085059
3085315
3085571
3085827
3086083
3086339
3086595
3086851
3087107
3087363
3087619
3087875
3088131
3080196
3080452
3080708
3080964
3081220
3081476
3081732
3081988
3082244
3082500
3082756
3083012
3083268
3083524
3083780
3084036
3084292
3084548
3084804
3085060
3085316
3085572
3085828
3086084
3086340
3086596
3086852
3087108
3087364
3087620
3087876
3088132
3080197
3080453
3080709
3080965
3081221
3081477
3081733
3081989
3082245
3082501
3082757
3083013
3083269
3083525
3083781
3084037
3084293
3084549
3084805
3085061
3085317
3085573
3085829
3086085
3086341
3086597
3086853
3087109
3087365
3087621
3087877
3088133
3080198
3080454
3080710
3080966
3081222
3081478
3081734
3081990
3082246
3082502
3082758
3083014
3083270
3083526
3083782
3084038
3084294
3084550
3084806
3085062
3085318
3085574
3085830
3086086
3086342
3086598
3086854
3087110
3087366
3087622
3087878
3088134
3080199
3080455
3080711
3080967
3081223
3081479
3081735
3081991
3082247
3082503
3082759
3083015
3083271
3083527
3083783
3084039
3084295
3084551
3084807
3085063
3085319
3085575
3085831
3086087
3086343
3086599
3086855
3087111
3087367
3087623
3087879
3088135
3080200
3080456
3080712
3080968
3081224
3081480
3081736
3081992
3082248
3082504
3082760
3083016
3083272
3083528
3083784
3084040
3084296
3084552
3084808
3085064
3085320
3085576
3085832
3086088
3086344
3086600
3086856
3087112
3087368
3087624
3087880
3088136
3080201
3080457
3080713
3080969
3081225
3081481
3081737
3081993
3082249
3082505
3082761
3083017
3083273
3083529
3083785
3084041
3084297
3084553
3084809
3085065
3085321
3085577
3085833
3086089
3086345
3086601
3086857
3087113
3087369
3087625
3087881
3088137
3080202
3080458
3080714
3080970
3081226
3081482
3081738
3081994
3082250
3082506
3082762
3083018
3083274
3083530
3083786
3084042
3084298
3084554
3084810
3085066
3085322
3085578
3085834
3086090
3086346
3086602
3086858
3087114
3087370
3087626
3087882
3088138
3080203
3080459
3080715
3080971
3081227
3081483
3081739
3081995
3082251
3082507
3082763
3083019
3083275
3083531
3083787
3084043
3084299
3084555
3084811
3085067
3085323
3085579
3085835
3086091
3086347
3086603
3086859
3087115
3087371
3087627
3087883
3088139
3080204
3080460
3080716
3080972
3081228
3081484
3081740
3081996
3082252
3082508
3082764
3083020
3083276
3083532
3083788
3084044
3084300
3084556
3084812
3085068
3085324
3085580
3085836
3086092
3086348
3086604
3086860
3087116
3087372
3087628
3087884
3088140
3080205
3080461
3080717
3080973
3081229
3081485
3081741
3081997
3082253
3082509
3082765
3083021
3083277
3083533
3083789
3084045
3084301
3084557
3084813
3085069
3085325
3085581
3085837
3086093
3086349
3086605
3086861
3087117
3087373
3087629
3087885
3088141
3080206
3080462
3080718
3080974
3081230
3081486
3081742
3081998
3082254
3082510
3082766
3083022
3083278
3083534
3083790
3084046
3084302
3084558
3084814
3085070
3085326
3085582
3085838
3086094
3086350
3086606
3086862
3087118
3087374
3087630
3087886
3088142
3080207
3080463
3080719
3080975
3081231
3081487
3081743
3081999
3082255
3082511
3082767
3083023
3083279
3083535
3083791
3084047
3084303
3084559
3084815
3085071
3085327
3085583
3085839
3086095
3086351
3086607
3086863
3087119
3087375
3087631
3087887
3088143
3080208
3080464
3080720
3080976
3081232
3081488
3081744
3082000
3082256
3082512
3082768
3083024
3083280
3083536
3083792
3084048
3084304
3084560
3084816
3085072
3085328
3085584
3085840
3086096
3086352
3086608
3086864
3087120
3087376
3087632
3087888
3088144
3080209
3080465
3080721
3080977
3081233
3081489
3081745
3082001
3082257
3082513
3082769
3083025
3083281
3083537
3083793
3084049
3084305
3084561
3084817
3085073
3085329
3085585
3085841
3086097
3086353
3086609
3086865
3087121
3087377
3087633
3087889
3088145
3080210
3080466
3080722
3080978
3081234
3081490
3081746
3082002
3082258
3082514
3082770
3083026
3083282
3083538
3083794
3084050
3084306
3084562
3084818
3085074
3085330
3085586
3085842
3086098
3086354
3086610
3086866
3087122
3087378
3087634
3087890
3088146
3080211
3080467
3080723
3080979
3081235
3081491
3081747
3082003
3082259
3082515
3082771
3083027
3083283
3083539
3083795
3084051
3084307
3084563
3084819
3085075
3085331
3085587
3085843
3086099
3086355
3086611
3086867
3087123
3087379
3087635
3087891
3088147
3080212
3080468
3080724
3080980
3081236
3081492
3081748
3082004
3082260
3082516
3082772
3083028
3083284
3083540
3083796
3084052
3084308
3084564
3084820
3085076
3085332
3085588
3085844
3086100
3086356
3086612
3086868
3087124
3087380
3087636
3087892
3088148
3080213
3080469
3080725
3080981
3081237
3081493
3081749
3082005
3082261
3082517
3082773
3083029
3083285
3083541
3083797
3084053
3084309
3084565
3084821
3085077
3085333
3085589
3085845
3086101
3086357
3086613
3086869
3087125
3087381
3087637
3087893
3088149
3080214
3080470
3080726
3080982
3081238
3081494
3081750
3082006
3082262
3082518
3082774
3083030
3083286
3083542
3083798
3084054
3084310
3084566
3084822
3085078
3085334
3085590
3085846
3086102
3086358
3086614
3086870
3087126
3087382
3087638
3087894
3088150
3080215
3080471
3080727
3080983
3081239
3081495
3081751
3082007
3082263
3082519
3082775
3083031
3083287
3083543
3083799
3084055
3084311
3084567
3084823
3085079
3085335
3085591
3085847
3086103
3086359
3086615
3086871
3087127
3087383
3087639
3087895
3088151
3080216
3080472
3080728
3080984
3081240
3081496
3081752
3082008
3082264
3082520
3082776
3083032
3083288
3083544
3083800
3084056
3084312
3084568
3084824
3085080
3085336
3085592
3085848
3086104
3086360
3086616
3086872
3087128
3087384
3087640
3087896
3088152
3080217
3080473
3080729
3080985
3081241
3081497
3081753
3082009
3082265
3082521
3082777
3083033
3083289
3083545
3083801
3084057
3084313
3084569
3084825
3085081
3085337
3085593
3085849
3086105
3086361
3086617
3086873
3087129
3087385
3087641
3087897
3088153
3080218
3080474
3080730
3080986
3081242
3081498
3081754
3082010
3082266
3082522
3082778
3083034
3083290
3083546
3083802
3084058
3084314
3084570
3084826
3085082
3085338
3085594
3085850
3086106
3086362
3086618
3086874
3087130
3087386
3087642
3087898
3088154
3080219
3080475
3080731
3080987
3081243
3081499
3081755
3082011
3082267
3082523
3082779
3083035
3083291
3083547
3083803
3084059
3084315
3084571
3084827
3085083
3085339
3085595
3085851
3086107
3086363
3086619
3086875
3087131
3087387
3087643
3087899
3088155
3080220
3080476
3080732
3080988
3081244
3081500
3081756
3082012
3082268
3082524
3082780
3083036
3083292
3083548
3083804
3084060
3084316
3084572
3084828
3085084
3085340
3085596
3085852
3086108
3086364
3086620
3086876
3087132
3087388
3087644
3087900
3088156
3080221
3080477
3080733
3080989
3081245
3081501
3081757
3082013
3082269
3082525
3082781
3083037
3083293
3083549
3083805
3084061
3084317
3084573
3084829
3085085
3085341
3085597
3085853
3086109
3086365
3086621
3086877
3087133
3087389
3087645
3087901
3088157
3080222
3080478
3080734
3080990
3081246
3081502
3081758
3082014
3082270
3082526
3082782
3083038
3083294
3083550
3083806
3084062
3084318
3084574
3084830
3085086
3085342
3085598
3085854
3086110
3086366
3086622
3086878
3087134
3087390
3087646
3087902
3088158
3080223
3080479
3080735
3080991
3081247
3081503
3081759
3082015
3082271
3082527
3082783
3083039
3083295
3083551
3083807
3084063
3084319
3084575
3084831
3085087
3085343
3085599
3085855
3086111
3086367
3086623
3086879
3087135
3087391
3087647
3087903
3088159
3080224
3080480
3080736
3080992
3081248
3081504
3081760
3082016
3082272
3082528
3082784
3083040
3083296
3083552
3083808
3084064
3084320
3084576
3084832
3085088
3085344
3085600
3085856
3086112
3086368
3086624
3086880
3087136
3087392
3087648
3087904
3088160
3080225
3080481
3080737
3080993
3081249
3081505
3081761
3082017
3082273
3082529
3082785
3083041
3083297
3083553
3083809
3084065
3084321
3084577
3084833
3085089
3085345
3085601
3085857
3086113
3086369
3086625
3086881
3087137
3087393
3087649
3087905
3088161
3080226
3080482
3080738
3080994
3081250
3081506
3081762
3082018
3082274
3082530
3082786
3083042
3083298
3083554
3083810
3084066
3084322
3084578
3084834
3085090
3085346
3085602
3085858
3086114
3086370
3086626
3086882
3087138
3087394
3087650
3087906
3088162
3080227
3080483
3080739
3080995
3081251
3081507
3081763
3082019
3082275
3082531
3082787
3083043
3083299
3083555
3083811
3084067
3084323
3084579
3084835
3085091
3085347
3085603
3085859
3086115
3086371
3086627
3086883
3087139
3087395
3087651
3087907
3088163
3080228
3080484
3080740
3080996
3081252
3081508
3081764
3082020
3082276
3082532
3082788
3083044
3083300
3083556
3083812
3084068
3084324
3084580
3084836
3085092
3085348
3085604
3085860
3086116
3086372
3086628
3086884
3087140
3087396
3087652
3087908
3088164
3080229
3080485
3080741
3080997
3081253
3081509
3081765
3082021
3082277
3082533
3082789
3083045
3083301
3083557
3083813
3084069
3084325
3084581
3084837
3085093
3085349
3085605
3085861
3086117
3086373
3086629
3086885
3087141
3087397
3087653
3087909
3088165
3080230
3080486
3080742
3080998
3081254
3081510
3081766
3082022
3082278
3082534
3082790
3083046
3083302
3083558
3083814
3084070
3084326
3084582
3084838
3085094
3085350
3085606
3085862
3086118
3086374
3086630
3086886
3087142
3087398
3087654
3087910
3088166
3080231
3080487
3080743
3080999
3081255
3081511
3081767
3082023
3082279
3082535
3082791
3083047
3083303
3083559
3083815
3084071
3084327
3084583
3084839
3085095
3085351
3085607
3085863
3086119
3086375
3086631
3086887
3087143
3087399
3087655
3087911
3088167
3080232
3080488
3080744
3081000
3081256
3081512
3081768
3082024
3082280
3082536
3082792
3083048
3083304
3083560
3083816
3084072
3084328
3084584
3084840
3085096
3085352
3085608
3085864
3086120
3086376
3086632
3086888
3087144
3087400
3087656
3087912
3088168
3080233
3080489
3080745
3081001
3081257
3081513
3081769
3082025
3082281
3082537
3082793
3083049
3083305
3083561
3083817
3084073
3084329
3084585
3084841
3085097
3085353
3085609
3085865
3086121
3086377
3086633
3086889
3087145
3087401
3087657
3087913
3088169
3080234
3080490
3080746
3081002
3081258
3081514
3081770
3082026
3082282
3082538
3082794
3083050
3083306
3083562
3083818
3084074
3084330
3084586
3084842
3085098
3085354
3085610
3085866
3086122
3086378
3086634
3086890
3087146
3087402
3087658
3087914
3088170
3080235
3080491
3080747
3081003
3081259
3081515
3081771
3082027
3082283
3082539
3082795
3083051
3083307
3083563
3083819
3084075
3084331
3084587
3084843
3085099
3085355
3085611
3085867
3086123
3086379
3086635
3086891
3087147
3087403
3087659
3087915
3088171
3080236
3080492
3080748
3081004
3081260
3081516
3081772
3082028
3082284
3082540
3082796
3083052
3083308
3083564
3083820
3084076
3084332
3084588
3084844
3085100
3085356
3085612
3085868
3086124
3086380
3086636
3086892
3087148
3087404
3087660
3087916
3088172
3080237
3080493
3080749
3081005
3081261
3081517
3081773
3082029
3082285
3082541
3082797
3083053
3083309
3083565
3083821
3084077
3084333
3084589
3084845
3085101
3085357
3085613
3085869
3086125
3086381
3086637
3086893
3087149
3087405
3087661
3087917
3088173
3080238
3080494
3080750
3081006
3081262
3081518
3081774
3082030
3082286
3082542
3082798
3083054
3083310
3083566
3083822
3084078
3084334
3084590
3084846
3085102
3085358
3085614
3085870
3086126
3086382
3086638
3086894
3087150
3087406
3087662
3087918
3088174
3080239
3080495
3080751
3081007
3081263
3081519
3081775
3082031
3082287
3082543
3082799
3083055
3083311
3083567
3083823
3084079
3084335
3084591
3084847
3085103
3085359
3085615
3085871
3086127
3086383
3086639
3086895
3087151
3087407
3087663
3087919
3088175
3080240
3080496
3080752
3081008
3081264
3081520
3081776
3082032
3082288
3082544
3082800
3083056
3083312
3083568
3083824
3084080
3084336
3084592
3084848
3085104
3085360
3085616
3085872
3086128
3086384
3086640
3086896
3087152
3087408
3087664
3087920
3088176
3080241
3080497
3080753
3081009
3081265
3081521
3081777
3082033
3082289
3082545
3082801
3083057
3083313
3083569
3083825
3084081
3084337
3084593
3084849
3085105
3085361
3085617
3085873
3086129
3086385
3086641
3086897
3087153
3087409
3087665
3087921
3088177
3080242
3080498
3080754
3081010
3081266
3081522
3081778
3082034
3082290
3082546
3082802
3083058
3083314
3083570
3083826
3084082
3084338
3084594
3084850
3085106
3085362
3085618
3085874
3086130
3086386
3086642
3086898
3087154
3087410
3087666
3087922
3088178
3080243
3080499
3080755
3081011
3081267
3081523
3081779
3082035
3082291
3082547
3082803
3083059
3083315
3083571
3083827
3084083
3084339
3084595
3084851
3085107
3085363
3085619
3085875
3086131
3086387
3086643
3086899
3087155
3087411
3087667
3087923
3088179
3080244
3080500
3080756
3081012
3081268
3081524
3081780
3082036
3082292
3082548
3082804
3083060
3083316
3083572
3083828
3084084
3084340
3084596
3084852
3085108
3085364
3085620
3085876
3086132
3086388
3086644
3086900
3087156
3087412
3087668
3087924
3088180
3080245
3080501
3080757
3081013
3081269
3081525
3081781
3082037
3082293
3082549
3082805
3083061
3083317
3083573
3083829
3084085
3084341
3084597
3084853
3085109
3085365
3085621
3085877
3086133
3086389
3086645
3086901
3087157
3087413
3087669
3087925
3088181
3080246
3080502
3080758
3081014
3081270
3081526
3081782
3082038
3082294
3082550
3082806
3083062
3083318
3083574
3083830
3084086
3084342
3084598
3084854
3085110
3085366
3085622
3085878
3086134
3086390
3086646
3086902
3087158
3087414
3087670
3087926
3088182
3080247
3080503
3080759
3081015
3081271
3081527
3081783
3082039
3082295
3082551
3082807
3083063
3083319
3083575
3083831
3084087
3084343
3084599
3084855
3085111
3085367
3085623
3085879
3086135
3086391
3086647
3086903
3087159
3087415
3087671
3087927
3088183
3080248
3080504
3080760
3081016
3081272
3081528
3081784
3082040
3082296
3082552
3082808
3083064
3083320
3083576
3083832
3084088
3084344
3084600
3084856
3085112
3085368
3085624
3085880
3086136
3086392
3086648
3086904
3087160
3087416
3087672
3087928
3088184
3080249
3080505
3080761
3081017
3081273
3081529
3081785
3082041
3082297
3082553
3082809
3083065
3083321
3083577
3083833
3084089
3084345
3084601
3084857
3085113
3085369
3085625
3085881
3086137
3086393
3086649
3086905
3087161
3087417
3087673
3087929
3088185
3080250
3080506
3080762
3081018
3081274
3081530
3081786
3082042
3082298
3082554
3082810
3083066
3083322
3083578
3083834
3084090
3084346
3084602
3084858
3085114
3085370
3085626
3085882
3086138
3086394
3086650
3086906
3087162
3087418
3087674
3087930
3088186
3080251
3080507
3080763
3081019
3081275
3081531
3081787
3082043
3082299
3082555
3082811
3083067
3083323
3083579
3083835
3084091
3084347
3084603
3084859
3085115
3085371
3085627
3085883
3086139
3086395
3086651
3086907
3087163
3087419
3087675
3087931
3088187
3080252
3080508
3080764
3081020
3081276
3081532
3081788
3082044
3082300
3082556
3082812
3083068
3083324
3083580
3083836
3084092
3084348
3084604
3084860
3085116
3085372
3085628
3085884
3086140
3086396
3086652
3086908
3087164
3087420
3087676
3087932
3088188
3080253
3080509
3080765
3081021
3081277
3081533
3081789
3082045
3082301
3082557
3082813
3083069
3083325
3083581
3083837
3084093
3084349
3084605
3084861
3085117
3085373
3085629
3085885
3086141
3086397
3086653
3086909
3087165
3087421
3087677
3087933
3088189
3080254
3080510
3080766
3081022
3081278
3081534
3081790
3082046
3082302
3082558
3082814
3083070
3083326
3083582
3083838
3084094
3084350
3084606
3084862
3085118
3085374
3085630
3085886
3086142
3086398
3086654
3086910
3087166
3087422
3087678
3087934
3088190
3080255
3080511
3080767
3081023
3081279
3081535
3081791
3082047
3082303
3082559
3082815
3083071
3083327
3083583
3083839
3084095
3084351
3084607
3084863
3085119
3085375
3085631
3085887
3086143
3086399
3086655
3086911
3087167
3087423
3087679
3087935
3088191
3080256
3080512
3080768
3081024
3081280
3081536
3081792
3082048
3082304
3082560
3082816
3083072
3083328
3083584
3083840
3084096
3084352
3084608
3084864
3085120
3085376
3085632
3085888
3086144
3086400
3086656
3086912
3087168
3087424
3087680
3087936
3088192
3080257
3080513
3080769
3081025
3081281
3081537
3081793
3082049
3082305
3082561
3082817
3083073
3083329
3083585
3083841
3084097
3084353
3084609
3084865
3085121
3085377
3085633
3085889
3086145
3086401
3086657
3086913
3087169
3087425
3087681
3087937
3088193
3080258
3080514
3080770
3081026
3081282
3081538
3081794
3082050
3082306
3082562
3082818
3083074
3083330
3083586
3083842
3084098
3084354
3084610
3084866
3085122
3085378
3085634
3085890
3086146
3086402
3086658
3086914
3087170
3087426
3087682
3087938
3088194
3080259
3080515
3080771
3081027
3081283
3081539
3081795
3082051
3082307
3082563
3082819
3083075
3083331
3083587
3083843
3084099
3084355
3084611
3084867
3085123
3085379
3085635
3085891
3086147
3086403
3086659
3086915
3087171
3087427
3087683
3087939
3088195
3080260
3080516
3080772
3081028
3081284
3081540
3081796
3082052
3082308
3082564
3082820
3083076
3083332
3083588
3083844
3084100
3084356
3084612
3084868
3085124
3085380
3085636
3085892
3086148
3086404
3086660
3086916
3087172
3087428
3087684
3087940
3088196
3080261
3080517
3080773
3081029
3081285
3081541
3081797
3082053
3082309
3082565
3082821
3083077
3083333
3083589
3083845
3084101
3084357
3084613
3084869
3085125
3085381
3085637
3085893
3086149
3086405
3086661
3086917
3087173
3087429
3087685
3087941
3088197
3080262
3080518
3080774
3081030
3081286
3081542
3081798
3082054
3082310
3082566
3082822
3083078
3083334
3083590
3083846
3084102
3084358
3084614
3084870
3085126
3085382
3085638
3085894
3086150
3086406
3086662
3086918
3087174
3087430
3087686
3087942
3088198
3080263
3080519
3080775
3081031
3081287
3081543
3081799
3082055
3082311
3082567
3082823
3083079
3083335
3083591
3083847
3084103
3084359
3084615
3084871
3085127
3085383
3085639
3085895
3086151
3086407
3086663
3086919
3087175
3087431
3087687
3087943
3088199
3080264
3080520
3080776
3081032
3081288
3081544
3081800
3082056
3082312
3082568
3082824
3083080
3083336
3083592
3083848
3084104
3084360
3084616
3084872
3085128
3085384
3085640
3085896
3086152
3086408
3086664
3086920
3087176
3087432
3087688
3087944
3088200
3080265
3080521
3080777
3081033
3081289
3081545
3081801
3082057
3082313
3082569
3082825
3083081
3083337
3083593
3083849
3084105
3084361
3084617
3084873
3085129
3085385
3085641
3085897
3086153
3086409
3086665
3086921
3087177
3087433
3087689
3087945
3088201
3080266
3080522
3080778
3081034
3081290
3081546
3081802
3082058
3082314
3082570
3082826
3083082
3083338
3083594
3083850
3084106
3084362
3084618
3084874
3085130
3085386
3085642
3085898
3086154
3086410
3086666
3086922
3087178
3087434
3087690
3087946
3088202
3080267
3080523
3080779
3081035
3081291
3081547
3081803
3082059
3082315
3082571
3082827
3083083
3083339
3083595
3083851
3084107
3084363
3084619
3084875
3085131
3085387
3085643
3085899
3086155
3086411
3086667
3086923
3087179
3087435
3087691
3087947
3088203
3080268
3080524
3080780
3081036
3081292
3081548
3081804
3082060
3082316
3082572
3082828
3083084
3083340
3083596
3083852
3084108
3084364
3084620
3084876
3085132
3085388
3085644
3085900
3086156
3086412
3086668
3086924
3087180
3087436
3087692
3087948
3088204
3080269
3080525
3080781
3081037
3081293
3081549
3081805
3082061
3082317
3082573
3082829
3083085
3083341
3083597
3083853
3084109
3084365
3084621
3084877
3085133
3085389
3085645
3085901
3086157
3086413
3086669
3086925
3087181
3087437
3087693
3087949
3088205
3080270
3080526
3080782
3081038
3081294
3081550
3081806
3082062
3082318
3082574
3082830
3083086
3083342
3083598
3083854
3084110
3084366
3084622
3084878
3085134
3085390
3085646
3085902
3086158
3086414
3086670
3086926
3087182
3087438
3087694
3087950
3088206
3080271
3080527
3080783
3081039
3081295
3081551
3081807
3082063
3082319
3082575
3082831
3083087
3083343
3083599
3083855
3084111
3084367
3084623
3084879
3085135
3085391
3085647
3085903
3086159
3086415
3086671
3086927
3087183
3087439
3087695
3087951
3088207
3080272
3080528
3080784
3081040
3081296
3081552
3081808
3082064
3082320
3082576
3082832
3083088
3083344
3083600
3083856
3084112
3084368
3084624
3084880
3085136
3085392
3085648
3085904
3086160
3086416
3086672
3086928
3087184
3087440
3087696
3087952
3088208
3080273
3080529
3080785
3081041
3081297
3081553
3081809
3082065
3082321
3082577
3082833
3083089
3083345
3083601
3083857
3084113
3084369
3084625
3084881
3085137
3085393
3085649
3085905
3086161
3086417
3086673
3086929
3087185
3087441
3087697
3087953
3088209
3080274
3080530
3080786
3081042
3081298
3081554
3081810
3082066
3082322
3082578
3082834
3083090
3083346
3083602
3083858
3084114
3084370
3084626
3084882
3085138
3085394
3085650
3085906
3086162
3086418
3086674
3086930
3087186
3087442
3087698
3087954
3088210
3080275
3080531
3080787
3081043
3081299
3081555
3081811
3082067
3082323
3082579
3082835
3083091
3083347
3083603
3083859
3084115
3084371
3084627
3084883
3085139
3085395
3085651
3085907
3086163
3086419
3086675
3086931
3087187
3087443
3087699
3087955
3088211
3080276
3080532
3080788
3081044
3081300
3081556
3081812
3082068
3082324
3082580
3082836
3083092
3083348
3083604
3083860
3084116
3084372
3084628
3084884
3085140
3085396
3085652
3085908
3086164
3086420
3086676
3086932
3087188
3087444
3087700
3087956
3088212
3080277
3080533
3080789
3081045
3081301
3081557
3081813
3082069
3082325
3082581
3082837
3083093
3083349
3083605
3083861
3084117
3084373
3084629
3084885
3085141
3085397
3085653
3085909
3086165
3086421
3086677
3086933
3087189
3087445
3087701
3087957
3088213
3080278
3080534
3080790
3081046
3081302
3081558
3081814
3082070
3082326
3082582
3082838
3083094
3083350
3083606
3083862
3084118
3084374
3084630
3084886
3085142
3085398
3085654
3085910
3086166
3086422
3086678
3086934
3087190
3087446
3087702
3087958
3088214
3080279
3080535
3080791
3081047
3081303
3081559
3081815
3082071
3082327
3082583
3082839
3083095
3083351
3083607
3083863
3084119
3084375
3084631
3084887
3085143
3085399
3085655
3085911
3086167
3086423
3086679
3086935
3087191
3087447
3087703
3087959
3088215
3080280
3080536
3080792
3081048
3081304
3081560
3081816
3082072
3082328
3082584
3082840
3083096
3083352
3083608
3083864
3084120
3084376
3084632
3084888
3085144
3085400
3085656
3085912
3086168
3086424
3086680
3086936
3087192
3087448
3087704
3087960
3088216
3080281
3080537
3080793
3081049
3081305
3081561
3081817
3082073
3082329
3082585
3082841
3083097
3083353
3083609
3083865
3084121
3084377
3084633
3084889
3085145
3085401
3085657
3085913
3086169
3086425
3086681
3086937
3087193
3087449
3087705
3087961
3088217
3080282
3080538
3080794
3081050
3081306
3081562
3081818
3082074
3082330
3082586
3082842
3083098
3083354
3083610
3083866
3084122
3084378
3084634
3084890
3085146
3085402
3085658
3085914
3086170
3086426
3086682
3086938
3087194
3087450
3087706
3087962
3088218
3080283
3080539
3080795
3081051
3081307
3081563
3081819
3082075
3082331
3082587
3082843
3083099
3083355
3083611
3083867
3084123
3084379
3084635
3084891
3085147
3085403
3085659
3085915
3086171
3086427
3086683
3086939
3087195
3087451
3087707
3087963
3088219
3080284
3080540
3080796
3081052
3081308
3081564
3081820
3082076
3082332
3082588
3082844
3083100
3083356
3083612
3083868
3084124
3084380
3084636
3084892
3085148
3085404
3085660
3085916
3086172
3086428
3086684
3086940
3087196
3087452
3087708
3087964
3088220
3080285
3080541
3080797
3081053
3081309
3081565
3081821
3082077
3082333
3082589
3082845
3083101
3083357
3083613
3083869
3084125
3084381
3084637
3084893
3085149
3085405
3085661
3085917
3086173
3086429
3086685
3086941
3087197
3087453
3087709
3087965
3088221
3080286
3080542
3080798
3081054
3081310
3081566
3081822
3082078
3082334
3082590
3082846
3083102
3083358
3083614
3083870
3084126
3084382
3084638
3084894
3085150
3085406
3085662
3085918
3086174
3086430
3086686
3086942
3087198
3087454
3087710
3087966
3088222
3080287
3080543
3080799
3081055
3081311
3081567
3081823
3082079
3082335
3082591
3082847
3083103
3083359
3083615
3083871
3084127
3084383
3084639
3084895
3085151
3085407
3085663
3085919
3086175
3086431
3086687
3086943
3087199
3087455
3087711
3087967
3088223
