1450032
1450288
1450544
1450800
1451056
1451312
1451568
1451824
1450033
1450289
1450545
1450801
1451057
1451313
1451569
1451825
1450034
1450290
1450546
1450802
1451058
1451314
1451570
1451826
1450035
1450291
1450547
1450803
1451059
1451315
1451571
1451827
1450036
1450292
1450548
1450804
1451060
1451316
1451572
1451828
1450037
1450293
1450549
1450805
1451061
1451317
1451573
1451829
1450038
1450294
1450550
1450806
1451062
1451318
1451574
1451830
1450039
1450295
1450551
1450807
1451063
1451319
1451575
1451831
2564144
2564400
2564656
2564912
2565168
2565424
2565680
2565936
2564145
2564401
2564657
2564913
2565169
2565425
2565681
2565937
2564146
2564402
2564658
2564914
2565170
2565426
2565682
2565938
2564147
2564403
2564659
2564915
2565171
2565427
2565683
2565939
2564148
2564404
2564660
2564916
2565172
2565428
2565684
2565940
2564149
2564405
2564661
2564917
2565173
2565429
2565685
2565941
2564150
2564406
2564662
2564918
2565174
2565430
2565686
2565942
2564151
2564407
2564663
2564919
2565175
2565431
2565687
2565943
