5632
5888
14080
14336
21504
21760
5727
5983
14175
14431
21599
21855
77322
77323
73741
77325
73742
77326
73743
77327
73744
77328
73745
77329
73746
77330
73747
77331
73748
77332
73749
77333
73750
77334
73751
77335
73752
77336
73753
73754
77338
73755
77339
73756
77340
73757
77341
73758
77342
73759
77343
73760
77344
73761
77345
71168
71424
79616
79872
87040
87296
71263
71519
79711
79967
87135
87391
144384
144385
144641
136704
136960
145152
145408
152576
152832
136799
137055
145247
145503
152671
152927
209920
210176
210944
209921
207117
207125
207126
207127
207128
207129
207130
207131
204828
207132
204829
207133
204830
207134
204831
207135
204832
207136
204833
207137
202240
202496
210688
210944
218112
218368
202335
202591
210783
211039
218207
218463
270349
270350
270351
270352
270353
270354
270355
270356
270357
270358
270359
270360
270361
270362
270363
270364
270365
270366
270367
270368
270369
267776
268032
276224
276480
283648
283904
267871
268127
276319
276575
283743
283999
349185
335882
335883
335884
335885
335886
335887
335888
335889
335890
335891
335892
335893
335894
335895
335896
335897
335898
335899
335900
335901
335902
335903
335904
335905
333312
333568
341760
342016
349184
349440
333407
333663
341855
342111
349279
349535
398848
399104
407296
407552
414720
414976
398943
399199
407391
407647
414815
415071
464384
464640
472832
473088
480256
480512
464479
464735
472927
473183
480351
480607
546048
529920
530176
538368
538624
545792
546048
530015
530271
538463
538719
545887
546143
595456
595712
603904
604160
611328
611584
595551
595807
603999
604255
611423
611679
669440
669696
663574
663575
663576
663577
663578
663579
663580
663581
663582
663583
663584
663585
660992
661248
669440
669696
676864
677120
661087
661343
669535
669791
676959
677215
726528
726784
734976
735232
742400
742656
726623
726879
735071
735327
742495
742751
792064
792320
800512
800768
807936
808192
792159
792415
800607
800863
808031
808287
860186
860442
860698
860954
861210
861466
861722
861978
860443
860699
860955
861211
861467
861723
861979
860444
860700
860956
861212
861468
861724
861980
860189
860445
860701
860957
861213
861469
861725
861981
860190
860446
860702
860958
861214
861470
861726
861982
860191
860447
860703
860959
861215
861471
861727
861983
860192
860448
860704
860960
861216
861472
861728
861984
857600
857856
866048
866304
873472
873728
857695
857951
866143
866399
873567
873823
930816
931072
930817
931073
925710
925712
925713
925714
925715
925716
925717
925718
925719
925720
925721
925722
925723
925724
925725
925726
925727
925728
923136
923392
931584
931840
939008
939264
923231
923487
931679
931935
939103
939359
988672
988928
997120
997376
1004544
1004800
988767
989023
997215
997471
1004639
1004895
1060109
1060365
1060110
1056784
1060112
1056785
1060113
1056786
1060114
1056787
1060115
1056788
1060116
1056789
1060117
1060118
1056791
1060119
1056792
1060120
1056793
1060121
1060122
1060123
1060124
1060125
1060126
1060127
1060128
1054208
1054464
1062656
1062912
1070080
1070336
1054303
1054559
1062751
1063007
1070175
1070431
1119744
1120000
1128192
1128448
1135616
1135872
1119839
1120095
1128287
1128543
1135711
1135967
1187850
1187851
1187852
1187853
1187854
1187855
1187857
1187858
1187859
1187860
1187861
1187862
1187863
1187864
1187865
1187866
1187867
1187868
1187869
1187870
1187871
1187872
1187873
1185280
1185536
1193728
1193984
1201152
1201408
1185375
1185631
1193823
1194079
1201247
1201503
1258753
1255432
1255434
1256202
1258250
1256204
1258252
1258508
1253389
1255437
1256205
1258253
1258509
1253390
1255438
1256206
1258254
1258510
1253391
1255439
1256207
1258255
1258511
1253392
1255440
1256208
1258512
1253393
1256209
1258257
1258513
1253394
1255442
1258258
1258514
1253395
1255443
1256211
1258259
1258515
1255444
1256212
1258260
1258516
1253397
1255445
1256213
1258261
1258517
1253398
1255446
1256214
1258262
1258518
1253399
1255447
1256215
1258263
1258519
1253400
1255448
1256216
1258264
1258520
1253401
1255449
1256217
1258265
1258521
1253402
1255450
1256218
1258266
1258522
1253403
1255451
1256219
1258267
1258523
1253404
1255452
1256220
1258268
1258524
1253405
1255453
1256221
1258269
1258525
1253406
1255454
1256222
1258270
1258526
1253407
1255455
1256223
1258271
1258527
1253408
1255456
1256224
1258272
1258528
1250816
1251072
1259264
1259520
1266688
1266944
1250911
1251167
1259359
1259615
1266783
1267039
1323018
1323274
1323530
1323786
1324042
1324298
1324554
1324810
1323019
1323275
1323531
1323787
1324043
1324299
1324555
1324811
1323024
1323280
1323536
1323792
1324048
1324304
1324560
1324816
1323028
1323284
1323540
1323796
1324052
1324308
1324564
1324820
1323029
1323285
1323541
1323797
1324053
1324309
1324565
1324821
1323030
1323286
1323542
1323798
1324054
1324310
1324566
1324822
1323031
1323287
1323543
1323799
1324055
1324311
1324567
1324823
1323032
1323288
1323544
1323800
1324056
1324312
1324568
1324824
1323033
1323289
1323545
1323801
1324057
1324313
1324569
1324825
1323034
1323290
1323546
1323802
1324058
1324314
1324570
1324826
1323035
1323291
1323547
1323803
1324059
1324315
1324571
1324827
1323036
1323292
1323548
1323804
1324060
1324316
1324572
1324828
1323037
1323293
1323549
1323805
1324061
1324317
1324573
1324829
1323038
1323294
1323550
1323806
1324062
1324318
1324574
1324830
1323039
1323295
1323551
1323807
1324063
1324319
1324575
1324831
1316352
1316608
1324800
1325056
1332224
1332480
1316447
1316703
1324895
1325151
1332319
1332575
1384459
1384460
1384461
1384462
1384463
1384464
1384465
1384466
1384467
1384468
1384469
1384470
1384471
1384472
1384473
1384474
1384475
1384476
1384477
1384478
1384479
1384480
1384481
1381888
1382144
1390336
1390592
1397760
1398016
1381983
1382239
1390431
1390687
1397855
1398111
1450002
1450003
1450004
1450005
1450006
1450007
1450009
1450010
1450012
1450014
1450015
1450016
1450017
1447424
1447680
1455872
1456128
1463296
1463552
1447519
1447775
1455967
1456223
1463391
1463647
1515530
1515531
1515532
1515533
1515534
1515535
1515536
1515537
1515538
1515539
1515540
1515541
1515542
1515543
1515544
1515545
1515546
1515547
1515548
1515549
1515550
1515551
1515552
1515553
1512960
1513216
1521408
1521664
1528832
1529088
1513055
1513311
1521503
1521759
1528927
1529183
1586176
1586432
1594624
1586177
1586433
1594625
1583882
1583885
1583886
1583887
1583888
1583889
1583890
1583891
1583892
1583893
1583894
1583895
1583896
1583897
1583899
1583900
1583901
1583902
1583903
1583905
1578496
1578752
1586944
1587200
1594368
1594624
1578591
1578847
1587039
1587295
1594463
1594719
1646606
1646607
1646608
1646609
1646610
1646611
1646612
1646613
1646614
1646615
1646616
1646617
1646618
1646619
1646620
1646621
1646622
1646623
1646624
1646625
1644032
1644288
1652480
1652736
1659904
1660160
1644127
1644383
1652575
1652831
1659999
1660255
1709568
1709824
1718016
1718272
1725440
1725696
1709663
1709919
1718111
1718367
1725535
1725791
1779212
1779468
1780748
1779213
1779469
1780749
1779214
1779470
1780750
1779215
1779471
1780751
1779216
1779472
1780752
1779217
1779473
1780753
1779218
1779474
1780754
1779219
1779475
1780755
1779220
1779476
1779221
1779477
1780757
1779222
1779478
1780758
1779223
1779479
1780759
1779224
1779480
1780760
1779225
1779481
1780761
1779226
1779482
1780762
1782298
1779227
1779483
1780763
1782299
1780764
1782300
1779229
1779485
1780765
1782301
1779230
1779486
1780766
1782302
1779231
1779487
1780767
1782303
1779232
1779488
1780768
1782304
1775104
1775360
1783552
1783808
1790976
1791232
1775199
1775455
1783647
1783903
1791071
1791327
1843222
1843223
1843224
1843225
1843226
1843227
1843228
1843229
1843230
1843231
1843232
1843233
1840640
1840896
1849088
1849344
1856512
1856768
1840735
1840991
1849183
1849439
1856607
1856863
1908750
1908752
1908753
1908754
1908755
1908756
1908757
1908758
1908759
1908760
1908761
1908762
1908763
1908764
1908765
1908766
1908767
1908768
1908769
1906176
1906432
1914624
1914880
1922048
1922304
1906271
1906527
1914719
1914975
1922143
1922399
1974281
1974282
1974283
1974284
1974285
1974286
1974287
1974288
1974289
1974290
1974291
1974292
1974293
1974294
1974295
1974296
1974297
1974298
1974299
1974300
1974301
1974302
1974303
1974304
1974305
1971712
1971968
1980160
1980416
1987584
1987840
1971807
1972063
1980255
1980511
1987679
1987935
2039818
2043658
2039819
2043659
2039820
2043660
2039821
2043661
2039822
2039823
2043663
2039824
2043664
2039825
2043665
2039826
2043666
2039827
2043667
2039828
2043668
2039829
2043669
2039830
2043670
2039831
2043671
2039832
2043672
2039833
2043673
2039834
2043674
2039835
2043675
2039836
2043676
2039837
2043677
2039838
2043678
2039839
2043679
2039840
2043680
2039841
2043681
2037248
2037504
2045696
2045952
2053120
2053376
2037343
2037599
2045791
2046047
2053215
2053471
2110464
2110720
2110465
2110721
2105354
2109194
2109450
2105357
2109197
2109453
2105361
2109201
2109457
2105365
2109205
2109461
2105366
2109206
2109462
2105368
2109208
2109464
2105369
2109209
2109465
2105370
2109210
2109466
2105371
2109211
2109467
2105372
2109212
2109468
2105373
2109213
2109469
2105374
2109214
2109470
2105375
2109215
2109471
2105376
2109216
2109472
2105377
2109217
2109473
2102784
2103040
2111232
2111488
2118656
2118912
2102879
2103135
2111327
2111583
2118751
2119007
2170889
2170890
2170891
2170892
2170893
2170894
2170895
2170896
2170897
2170898
2170900
2170901
2170902
2170904
2170905
2170906
2170907
2170908
2170909
2170910
2170911
2170912
2170913
2168320
2168576
2176768
2177024
2184192
2184448
2168415
2168671
2176863
2177119
2184287
2184543
2241536
2241792
2241537
2241793
2236427
2236428
2236429
2236430
2236433
2236434
2236435
2236436
2236437
2236438
2236439
2236440
2236441
2236442
2236443
2236444
2236445
2236446
2236447
2236448
2236449
2233856
2234112
2242304
2242560
2249728
2249984
2233951
2234207
2242399
2242655
2249823
2250079
2301961
2302217
2301962
2302218
2301963
2302219
2301964
2302220
2301965
2302221
2301966
2302222
2301967
2302223
2301968
2302224
2301969
2302225
2301970
2302226
2301971
2302227
2301972
2302228
2301973
2302229
2301974
2302230
2301975
2302231
2301976
2301977
2302233
2301978
2302234
2301979
2302235
2301980
2302236
2301981
2302237
2301982
2302238
2301983
2302239
2301984
2302240
2301985
2302241
2299392
2299648
2307840
2308096
2315264
2315520
2299487
2299743
2307935
2308191
2315359
2315615
2372608
2372864
2372609
2372865
2367501
2367502
2367505
2367510
2367512
2367513
2367517
2367518
2367519
2367520
2364928
2365184
2373376
2373632
2380800
2381056
2365023
2365279
2373471
2373727
2380895
2381151
2438145
2433034
2433035
2433037
2433038
2433040
2433041
2433042
2433043
2433044
2433045
2433046
2433047
2433048
2433049
2433050
2433051
2433052
2433053
2433054
2433055
2433056
2433057
2430464
2430720
2438912
2439168
2446336
2446592
2430559
2430815
2439007
2439263
2446431
2446687
2498570
2498826
2498571
2498828
2499084
2498574
2498575
2501391
2502671
2502927
2503695
2498576
2501392
2502672
2502928
2503696
2498577
2501393
2502673
2502929
2503697
2498578
2501394
2502674
2502930
2503698
2498579
2501395
2502675
2502931
2503699
2498580
2501396
2502676
2502932
2503700
2498581
2501397
2502677
2502933
2503701
2498582
2501398
2502678
2502934
2503702
2498583
2501399
2502679
2502935
2503703
2498584
2501400
2502680
2502936
2503704
2498585
2501401
2502681
2502937
2503705
2498586
2501402
2502682
2502938
2503706
2498587
2501403
2502683
2502939
2503707
2498588
2501404
2502684
2502940
2503708
2498589
2501405
2502685
2502941
2503709
2498590
2501406
2502686
2502942
2503710
2498591
2501407
2502687
2502943
2503711
2498592
2501408
2502688
2502944
2503712
2498593
2501409
2502689
2502945
2503713
2496000
2496256
2504448
2504704
2511872
2512128
2496095
2496351
2504543
2504799
2511967
2512223
2577665
2564876
2564879
2564882
2564884
2564885
2564886
2564887
2564888
2564889
2564890
2564891
2564892
2564893
2564894
2564895
2564897
2564386
2561536
2561792
2569984
2570240
2577408
2577664
2561631
2561887
2570079
2570335
2577503
2577759
2629901
2629909
2629911
2629912
2629913
2629915
2629916
2629920
2627072
2627328
2635520
2635776
2642944
2643200
2627167
2627423
2635615
2635871
2643039
2643295
2700288
2700544
2700289
2700545
2692608
2692864
2701056
2701312
2708480
2708736
2692703
2692959
2701151
2701407
2708575
2708831
2758144
2758400
2758144
2758400
2766592
2766848
2774016
2774272
2758239
2758495
2766687
2766943
2774111
2774367
2826505
2831113
2826506
2831114
2826507
2831115
2826508
2831116
2826509
2831117
2826510
2831118
2826511
2831119
2826512
2831120
2826513
2831121
2826514
2831122
2826515
2831123
2826516
2831124
2826517
2831125
2826518
2831126
2826519
2831127
2826520
2831128
2826521
2831129
2826522
2831130
2826523
2831131
2826524
2831132
2826525
2831133
2826526
2831134
2826527
2831135
2826528
2831136
2823680
2823936
2832128
2832384
2839552
2839808
2823775
2824031
2832223
2832479
2839647
2839903
2889216
2889472
2897664
2897920
2905088
2905344
2889311
2889567
2897759
2898015
2905183
2905439
2958603
2960651
2961675
2961931
2958604
2960652
2961676
2961932
2958607
2960655
2961679
2961935
2958608
2960656
2961680
2961936
2958609
2960657
2961681
2961937
2958614
2960662
2961686
2961942
2958615
2960663
2961687
2961943
2958618
2960666
2961690
2961946
2958619
2960667
2961691
2961947
2958620
2960668
2961692
2961948
2957341
2958621
2960669
2961693
2961949
2957342
2958622
2960670
2961694
2961950
2958624
2960672
2961696
2961952
2954752
2955008
2963200
2963456
2970624
2970880
2954847
2955103
2963295
2963551
2970719
2970975
3023113
3023114
3023115
3023116
3023117
3023118
3023119
3023120
3023121
3023122
3023123
3023124
3023125
3023126
3023127
3023128
3023129
3023130
3023131
3023132
3023133
3023134
3023135
3023136
3020288
3020544
3028736
3028992
3036160
3036416
3020383
3020639
3028831
3029087
3036255
3036511
3088392
3091720
3093512
3094024
3088393
3091721
3093513
3094025
3088394
3091722
3093514
3094026
3088395
3091723
3093515
3094027
3088396
3091724
3093516
3094028
3088397
3091725
3093517
3094029
3088398
3091726
3093518
3094030
3088399
3091727
3093519
3094031
3088400
3091728
3093520
3094032
3088401
3091729
3093521
3094033
3088402
3091730
3093522
3094034
3088403
3091731
3093523
3094035
3088404
3091732
3093524
3094036
3088405
3091733
3093525
3094037
3088406
3091734
3093526
3094038
3088407
3091735
3093527
3094039
3088408
3091736
3093528
3094040
3088409
3091737
3093529
3094041
3088410
3091738
3093530
3094042
3088411
3091739
3093531
3094043
3088412
3091740
3093532
3094044
3088414
3091742
3093534
3094046
3088415
3091743
3093535
3094047
3085824
3086080
3094272
3094528
3101696
3101952
3085919
3086175
3094367
3094623
3101791
3102047
3159296
3167488
3159297
3167233
3167489
3154697
3155209
3156745
3158537
3154698
3155210
3156746
3158538
3154699
3155211
3156747
3158539
3154700
3155212
3156748
3158540
3154701
3155213
3156749
3158541
3154702
3155214
3156750
3158542
3154703
3155215
3156751
3158543
3154704
3155216
3156752
3158544
3154705
3155217
3156753
3158545
3154706
3155218
3156754
3158546
3154707
3155219
3156755
3158547
3154708
3155220
3156756
3158548
3154709
3155221
3156757
3158549
3154710
3155222
3156758
3158550
3154711
3155223
3156759
3158551
3154712
3155224
3156760
3158552
3154713
3155225
3156761
3158553
3154714
3155226
3156762
3158554
3154715
3155227
3156763
3158555
3154716
3155228
3156764
3158556
3154717
3155229
3156765
3158557
3154718
3155230
3156766
3158558
3154719
3155231
3156767
3158559
3154720
3155232
3156768
3158560
3151360
3151616
3159808
3160064
3167232
3167488
3151455
3151711
3159903
3160159
3167327
3167583
3224576
3224832
3224577
3224833
3220241
3222289
3224081
3225105
3225361
3220243
3222291
3224083
3225107
3225363
3220246
3222294
3224086
3225110
3225366
3220247
3222295
3224087
3225111
3225367
3220248
3222296
3224088
3225112
3225368
3220249
3222297
3224089
3225113
3225369
3220250
3222298
3224090
3225114
3225370
3220251
3222299
3224091
3225115
3225371
3220252
3222300
3224092
3225116
3225372
3220253
3222301
3224093
3225117
3225373
3220254
3222302
3224094
3225118
3225374
3216896
3217152
3225344
3225600
3232768
3233024
3216991
3217247
3225439
3225695
3232863
3233119
3285773
3286285
3286541
3286797
3289613
3289869
3290125
3290381
3290637
3291405
3285776
3286288
3286544
3286800
3289616
3289872
3290128
3290384
3290640
3291408
3285777
3286289
3286545
3286801
3289617
3289873
3290129
3290385
3290641
3291409
3285778
3286290
3286546
3286802
3289618
3289874
3290130
3290386
3290642
3291410
3285779
3286291
3286547
3286803
3289619
3289875
3290131
3290387
3290643
3291411
3285781
3286293
3286549
3286805
3289621
3289877
3290133
3290389
3290645
3291413
3285782
3286294
3286550
3286806
3289622
3289878
3290134
3290390
3290646
3291414
3285783
3286295
3286551
3286807
3289623
3289879
3290135
3290391
3290647
3291415
3285784
3286296
3286552
3286808
3289624
3289880
3290136
3290392
3290648
3291416
3285785
3286297
3286553
3286809
3289625
3289881
3290137
3290393
3290649
3291417
3285786
3286298
3286554
3286810
3289626
3289882
3290138
3290394
3290650
3291418
3285787
3286299
3286555
3286811
3289627
3289883
3290139
3290395
3290651
3291419
3285788
3286300
3286556
3286812
3289628
3289884
3290140
3290396
3290652
3291420
3285790
3286302
3286558
3286814
3289630
3289886
3290142
3290398
3290654
3291422
3282432
3282688
3290880
3291136
3298304
3298560
3282527
3282783
3290975
3291231
3298399
3298655
3355904
3355649
3355905
3350792
3351048
3351816
3353864
3355144
3350793
3351049
3351817
3353865
3355145
3350795
3351051
3351819
3353867
3355147
3350796
3351052
3351820
3353868
3355148
3350797
3351053
3351821
3353869
3355149
3350798
3351054
3351822
3353870
3355150
3350799
3351055
3351823
3353871
3355151
3350800
3351056
3351824
3353872
3355152
3350801
3351057
3351825
3353873
3355153
3350803
3351059
3351827
3353875
3355155
3350805
3351061
3351829
3353877
3355157
3350806
3351062
3351830
3353878
3355158
3350807
3351063
3351831
3353879
3355159
3350808
3351064
3351832
3353880
3355160
3350553
3350809
3351065
3351833
3353881
3355161
3350810
3351066
3351834
3353882
3355162
3350555
3350811
3351067
3351835
3353883
3355163
3350556
3350812
3351068
3351836
3353884
3355164
3350814
3351070
3351838
3353886
3355166
3350815
3351071
3351839
3353887
3355167
3347968
3348224
3356416
3356672
3363840
3364096
3348063
3348319
3356511
3356767
3363935
3364191
3413504
3413760
3421952
3422208
3429376
3429632
3413599
3413855
3422047
3422303
3429471
3429727
3479040
3479296
3487488
3487744
3494912
3495168
3479135
3479391
3487583
3487839
3495007
3495263
