0 0 1.0 0.0 0.0
0 1 8.2710398214 0.100553646684 1.20238089561
0 2 1.0 0.666666686535 1.5
1 0 1.0 0.5 2.0
1 1 0.639322641485 0.935844540596 1.67138397694
1 2 1.0 0.0 0.0
2 0 0.4 1.0 2.5
2 1 0.686696763001 0.911313414574 1.59796488285
2 2 0.666666666667 1.0 1.5
3 0 1.0 1.0 1.0
3 1 0.635546635044 0.904508411884 1.73956227303
3 2 2.0 0.5 1.0
4 0 1.0 1.0 1.0
4 1 0.709528930789 0.866304516792 1.62689423561
4 2 0.666666666667 0.75 2.0
5 0 0.5 1.0 2.0
5 1 0.657780013782 0.896286010742 1.69618296623
5 2 1.0 0.666666686535 1.5
6 0 1.0 0.5 2.0
6 1 0.616875725905 0.894177436829 1.81291985512
6 2 0.8 1.0 1.25
7 0 0.5 1.0 2.0
7 1 0.707509473049 0.839492976665 1.68364560604
7 2 0.600000014305 1.0 1.66666662693
8 0 1.0 0.0 0.0
8 1 0.55024249124 0.92732334137 1.95981323719
8 2 1.4999999553 0.666666686535 1.0
9 0 1.0 0.0 0.0
9 1 0.737106945429 0.862705528736 1.57255887985
9 2 0.428571443168 1.0 2.33333325386
10 0 0.5 1.0 2.0
10 1 0.659100032238 0.893629968166 1.69781720638
10 2 0.600000014305 1.0 1.66666662693
11 0 0.5 1.0 2.0
11 1 0.672312948772 0.884823024273 1.681016922
11 2 1.0 1.0 1.0
12 0 0.333333333333 1.0 3.0
12 1 0.776593243129 0.852617263794 1.51026189327
12 2 0.333333333333 1.0 3.0
13 0 0.5 1.0 2.0
13 1 0.692694673516 0.895294308662 1.61247253418
13 2 1.0 0.666666686535 1.5
14 0 0.5 1.0 2.0
14 1 0.767789378091 0.849827826023 1.53259336948
14 2 0.749999977648 0.666666686535 2.0
15 0 0.666666666667 1.0 1.5
15 1 0.785273941794 0.840023696423 1.51595842838
15 2 0.749999977648 1.0 1.33333337307
16 0 1.0 0.5 2.0
16 1 0.599220740907 0.928328633308 1.79767584801
16 2 0.5 1.0 2.0
17 0 0.5 1.0 2.0
17 1 0.627990411638 0.922783911228 1.72562718391
17 2 0.600000014305 1.0 1.66666662693
18 0 0.5 1.0 2.0
18 1 0.718368185824 0.88786393404 1.56785714626
18 2 0.749999977648 1.0 1.33333337307
19 0 1.0 1.0 1.0
19 1 0.6828061396 0.901094198227 1.62529563904
19 2 0.749999977648 1.0 1.33333337307
20 0 2.0 0.5 1.0
20 1 0.656392176698 0.911315441132 1.67173671722
20 2 0.600000014305 1.0 1.66666662693
21 0 0.749999977648 1.0 1.33333337307
21 1 0.606096916167 0.918621063232 1.7960627079
21 2 0.666666666667 1.0 1.5
22 0 0.666666666667 1.0 1.5
22 1 0.588113742264 0.944342911243 1.8005656004
22 2 1.0 0.0 0.0
23 0 0.666666666667 1.0 1.5
23 1 0.625351296641 0.938788175583 1.70336747169
23 2 1.0 1.0 1.0
24 0 0.666666666667 1.0 1.5
24 1 0.632372851611 0.912538230419 1.73290884495
24 2 0.666666666667 1.0 1.5
25 0 0.5 1.0 2.0
25 1 0.654685111715 0.944939792156 1.61645424366
25 2 0.666666666667 1.0 1.5
26 0 0.25 1.0 4.0
26 1 1.0 0.0 0.0
26 2 0.5 0.666666686535 3.0
27 0 0.666666666667 1.0 1.5
27 1 0.643517123119 0.916061878204 1.69634854794
27 2 0.600000014305 1.0 1.66666662693
28 0 1.0 1.0 1.0
28 1 0.666931893603 0.91545933485 1.63787007332
28 2 0.5 1.0 2.0
29 0 0.5 1.0 2.0
29 1 0.623258811456 0.949410974979 1.68996345997
29 2 0.600000014305 1.0 1.66666662693
30 0 0.285714285714 1.0 3.5
30 1 0.508635967888 0.947757959366 2.07441425323
30 2 0.749999977648 0.666666686535 2.0
31 0 0.4 1.0 2.5
31 1 0.305852680115 0.973841369152 3.35737228394
31 2 0.600000014305 1.0 1.66666662693
32 0 1.0 0.0 0.0
32 1 0.620768132305 0.938865244389 1.71580266953
32 2 0.666666666667 1.0 1.5
33 0 1.0 1.0 1.0
33 1 0.617813767985 0.955439031124 1.69410145283
33 2 0.571428571429 1.0 1.75
34 0 0.666666666667 1.0 1.5
34 1 0.658768768111 0.939627468586 1.61551606655
34 2 0.71428572645 1.0 1.39999997616
35 0 0.5 1.0 2.0
35 1 0.577253577278 0.957921922207 1.80843639374
35 2 0.624999990687 1.0 1.60000002384
36 0 0.4 1.0 2.5
36 1 6.67570078388 0.115917682648 1.29227054119
36 2 0.454545444693 1.0 2.20000004768
37 0 1.0 1.0 1.0
37 1 0.664698231205 0.925764203072 1.62508130074
37 2 1.0 1.0 1.0
38 0 1.0 0.0 0.0
38 1 0.461881310833 0.960380136967 2.25437664986
38 2 0.83333330022 0.800000011921 1.5
39 0 1.0 1.0 1.0
39 1 0.662888654315 0.953699529171 1.58178639412
39 2 0.666666666667 0.75 2.0
40 0 1.4999999553 0.666666686535 1.0
40 1 0.711479622777 0.904966711998 1.55311977863
40 2 0.588235277618 0.800000011921 2.125
41 0 2.99999991059 0.333333343267 1.0
41 1 0.622466811226 0.958040952682 1.67687129974
41 2 1.0 0.888888895512 1.125
42 0 1.0 0.0 0.0
42 1 0.564488317796 0.946973919868 1.87071239948
42 2 0.749999977648 0.888888895512 1.5
43 0 1.0 1.0 1.0
43 1 0.628060609595 0.923713386059 1.72369813919
43 2 0.818181827049 0.888888895512 1.375
44 0 0.666666666667 1.0 1.5
44 1 0.672844171184 0.902051687241 1.64760863781
44 2 0.785714299095 0.909090936184 1.39999997616
45 0 2.0 0.5 1.0
45 1 0.658265367338 0.919763505459 1.65166819096
45 2 0.77777778808 1.0 1.28571426868
46 0 0.666666666667 1.0 1.5
46 1 0.679873089829 0.885007083416 1.66197860241
46 2 0.874999960884 1.0 1.14285719395
47 0 0.83333330022 0.800000011921 1.5
47 1 0.799818766652 0.863314449787 1.44823622704
47 2 1.0 0.600000023842 1.66666662693
48 0 1.20000002861 0.666666686535 1.25
48 1 0.541504107787 0.937411725521 1.9700075388
48 2 0.71428572645 0.800000011921 1.75
49 0 0.555555570273 1.0 1.79999995232
49 1 0.67496645729 0.873013615608 1.69705832005
49 2 0.363636363636 0.5 5.5
50 0 0.666666666667 1.0 1.5
50 1 0.699662521542 0.900321543217 1.58749997616
50 2 0.749999977648 1.0 1.33333337307
51 0 1.16666665508 0.714285731316 1.20000004768
51 1 0.601324639083 0.959395051003 1.73337900639
51 2 1.33333333333 0.75 1.0
52 0 0.874999960884 0.714285731316 1.60000002384
52 1 0.484839125184 0.940172314644 2.1937892437
52 2 1.33333333333 0.75 1.0
53 0 1.0 0.0 0.0
53 1 1.0 0.0 0.0
53 2 1.0 0.0 0.0
