2441216
2441472
2441728
2441984
2442240
2442496
2442752
2443008
2443264
2443520
2443776
2444032
2444288
2444544
2444800
2445056
2445312
2445568
2445824
2446080
2446336
2446592
2446848
2447104
2447360
2447616
2447872
2448128
2448384
2448640
2448896
2449152
2441217
2441473
2441729
2441985
2442241
2442497
2442753
2443009
2443265
2443521
2443777
2444033
2444289
2444545
2444801
2445057
2445313
2445569
2445825
2446081
2446337
2446593
2446849
2447105
2447361
2447617
2447873
2448129
2448385
2448641
2448897
2449153
2441218
2441474
2441730
2441986
2442242
2442498
2442754
2443010
2443266
2443522
2443778
2444034
2444290
2444546
2444802
2445058
2445314
2445570
2445826
2446082
2446338
2446594
2446850
2447106
2447362
2447618
2447874
2448130
2448386
2448642
2448898
2449154
2441219
2441475
2441731
2441987
2442243
2442499
2442755
2443011
2443267
2443523
2443779
2444035
2444291
2444547
2444803
2445059
2445315
2445571
2445827
2446083
2446339
2446595
2446851
2447107
2447363
2447619
2447875
2448131
2448387
2448643
2448899
2449155
2441220
2441476
2441732
2441988
2442244
2442500
2442756
2443012
2443268
2443524
2443780
2444036
2444292
2444548
2444804
2445060
2445316
2445572
2445828
2446084
2446340
2446596
2446852
2447108
2447364
2447620
2447876
2448132
2448388
2448644
2448900
2449156
2441221
2441477
2441733
2441989
2442245
2442501
2442757
2443013
2443269
2443525
2443781
2444037
2444293
2444549
2444805
2445061
2445317
2445573
2445829
2446085
2446341
2446597
2446853
2447109
2447365
2447621
2447877
2448133
2448389
2448645
2448901
2449157
2441222
2441478
2441734
2441990
2442246
2442502
2442758
2443014
2443270
2443526
2443782
2444038
2444294
2444550
2444806
2445062
2445318
2445574
2445830
2446086
2446342
2446598
2446854
2447110
2447366
2447622
2447878
2448134
2448390
2448646
2448902
2449158
2441223
2441479
2441735
2441991
2442247
2442503
2442759
2443015
2443271
2443527
2443783
2444039
2444295
2444551
2444807
2445063
2445319
2445575
2445831
2446087
2446343
2446599
2446855
2447111
2447367
2447623
2447879
2448135
2448391
2448647
2448903
2449159
2441224
2441480
2441736
2441992
2442248
2442504
2442760
2443016
2443272
2443528
2443784
2444040
2444296
2444552
2444808
2445064
2445320
2445576
2445832
2446088
2446344
2446600
2446856
2447112
2447368
2447624
2447880
2448136
2448392
2448648
2448904
2449160
2441225
2441481
2441737
2441993
2442249
2442505
2442761
2443017
2443273
2443529
2443785
2444041
2444297
2444553
2444809
2445065
2445321
2445577
2445833
2446089
2446345
2446601
2446857
2447113
2447369
2447625
2447881
2448137
2448393
2448649
2448905
2449161
2441226
2441482
2441738
2441994
2442250
2442506
2442762
2443018
2443274
2443530
2443786
2444042
2444298
2444554
2444810
2445066
2445322
2445578
2445834
2446090
2446346
2446602
2446858
2447114
2447370
2447626
2447882
2448138
2448394
2448650
2448906
2449162
2441227
2441483
2441739
2441995
2442251
2442507
2442763
2443019
2443275
2443531
2443787
2444043
2444299
2444555
2444811
2445067
2445323
2445579
2445835
2446091
2446347
2446603
2446859
2447115
2447371
2447627
2447883
2448139
2448395
2448651
2448907
2449163
2441228
2441484
2441740
2441996
2442252
2442508
2442764
2443020
2443276
2443532
2443788
2444044
2444300
2444556
2444812
2445068
2445324
2445580
2445836
2446092
2446348
2446604
2446860
2447116
2447372
2447628
2447884
2448140
2448396
2448652
2448908
2449164
2441229
2441485
2441741
2441997
2442253
2442509
2442765
2443021
2443277
2443533
2443789
2444045
2444301
2444557
2444813
2445069
2445325
2445581
2445837
2446093
2446349
2446605
2446861
2447117
2447373
2447629
2447885
2448141
2448397
2448653
2448909
2449165
2441230
2441486
2441742
2441998
2442254
2442510
2442766
2443022
2443278
2443534
2443790
2444046
2444302
2444558
2444814
2445070
2445326
2445582
2445838
2446094
2446350
2446606
2446862
2447118
2447374
2447630
2447886
2448142
2448398
2448654
2448910
2449166
2441231
2441487
2441743
2441999
2442255
2442511
2442767
2443023
2443279
2443535
2443791
2444047
2444303
2444559
2444815
2445071
2445327
2445583
2445839
2446095
2446351
2446607
2446863
2447119
2447375
2447631
2447887
2448143
2448399
2448655
2448911
2449167
2441232
2441488
2441744
2442000
2442256
2442512
2442768
2443024
2443280
2443536
2443792
2444048
2444304
2444560
2444816
2445072
2445328
2445584
2445840
2446096
2446352
2446608
2446864
2447120
2447376
2447632
2447888
2448144
2448400
2448656
2448912
2449168
2441233
2441489
2441745
2442001
2442257
2442513
2442769
2443025
2443281
2443537
2443793
2444049
2444305
2444561
2444817
2445073
2445329
2445585
2445841
2446097
2446353
2446609
2446865
2447121
2447377
2447633
2447889
2448145
2448401
2448657
2448913
2449169
2441234
2441490
2441746
2442002
2442258
2442514
2442770
2443026
2443282
2443538
2443794
2444050
2444306
2444562
2444818
2445074
2445330
2445586
2445842
2446098
2446354
2446610
2446866
2447122
2447378
2447634
2447890
2448146
2448402
2448658
2448914
2449170
2441235
2441491
2441747
2442003
2442259
2442515
2442771
2443027
2443283
2443539
2443795
2444051
2444307
2444563
2444819
2445075
2445331
2445587
2445843
2446099
2446355
2446611
2446867
2447123
2447379
2447635
2447891
2448147
2448403
2448659
2448915
2449171
2441236
2441492
2441748
2442004
2442260
2442516
2442772
2443028
2443284
2443540
2443796
2444052
2444308
2444564
2444820
2445076
2445332
2445588
2445844
2446100
2446356
2446612
2446868
2447124
2447380
2447636
2447892
2448148
2448404
2448660
2448916
2449172
2441237
2441493
2441749
2442005
2442261
2442517
2442773
2443029
2443285
2443541
2443797
2444053
2444309
2444565
2444821
2445077
2445333
2445589
2445845
2446101
2446357
2446613
2446869
2447125
2447381
2447637
2447893
2448149
2448405
2448661
2448917
2449173
2441238
2441494
2441750
2442006
2442262
2442518
2442774
2443030
2443286
2443542
2443798
2444054
2444310
2444566
2444822
2445078
2445334
2445590
2445846
2446102
2446358
2446614
2446870
2447126
2447382
2447638
2447894
2448150
2448406
2448662
2448918
2449174
2441239
2441495
2441751
2442007
2442263
2442519
2442775
2443031
2443287
2443543
2443799
2444055
2444311
2444567
2444823
2445079
2445335
2445591
2445847
2446103
2446359
2446615
2446871
2447127
2447383
2447639
2447895
2448151
2448407
2448663
2448919
2449175
2441240
2441496
2441752
2442008
2442264
2442520
2442776
2443032
2443288
2443544
2443800
2444056
2444312
2444568
2444824
2445080
2445336
2445592
2445848
2446104
2446360
2446616
2446872
2447128
2447384
2447640
2447896
2448152
2448408
2448664
2448920
2449176
2441241
2441497
2441753
2442009
2442265
2442521
2442777
2443033
2443289
2443545
2443801
2444057
2444313
2444569
2444825
2445081
2445337
2445593
2445849
2446105
2446361
2446617
2446873
2447129
2447385
2447641
2447897
2448153
2448409
2448665
2448921
2449177
2441242
2441498
2441754
2442010
2442266
2442522
2442778
2443034
2443290
2443546
2443802
2444058
2444314
2444570
2444826
2445082
2445338
2445594
2445850
2446106
2446362
2446618
2446874
2447130
2447386
2447642
2447898
2448154
2448410
2448666
2448922
2449178
2441243
2441499
2441755
2442011
2442267
2442523
2442779
2443035
2443291
2443547
2443803
2444059
2444315
2444571
2444827
2445083
2445339
2445595
2445851
2446107
2446363
2446619
2446875
2447131
2447387
2447643
2447899
2448155
2448411
2448667
2448923
2449179
2441244
2441500
2441756
2442012
2442268
2442524
2442780
2443036
2443292
2443548
2443804
2444060
2444316
2444572
2444828
2445084
2445340
2445596
2445852
2446108
2446364
2446620
2446876
2447132
2447388
2447644
2447900
2448156
2448412
2448668
2448924
2449180
2441245
2441501
2441757
2442013
2442269
2442525
2442781
2443037
2443293
2443549
2443805
2444061
2444317
2444573
2444829
2445085
2445341
2445597
2445853
2446109
2446365
2446621
2446877
2447133
2447389
2447645
2447901
2448157
2448413
2448669
2448925
2449181
2441246
2441502
2441758
2442014
2442270
2442526
2442782
2443038
2443294
2443550
2443806
2444062
2444318
2444574
2444830
2445086
2445342
2445598
2445854
2446110
2446366
2446622
2446878
2447134
2447390
2447646
2447902
2448158
2448414
2448670
2448926
2449182
2441247
2441503
2441759
2442015
2442271
2442527
2442783
2443039
2443295
2443551
2443807
2444063
2444319
2444575
2444831
2445087
2445343
2445599
2445855
2446111
2446367
2446623
2446879
2447135
2447391
2447647
2447903
2448159
2448415
2448671
2448927
2449183
2441248
2441504
2441760
2442016
2442272
2442528
2442784
2443040
2443296
2443552
2443808
2444064
2444320
2444576
2444832
2445088
2445344
2445600
2445856
2446112
2446368
2446624
2446880
2447136
2447392
2447648
2447904
2448160
2448416
2448672
2448928
2449184
2441249
2441505
2441761
2442017
2442273
2442529
2442785
2443041
2443297
2443553
2443809
2444065
2444321
2444577
2444833
2445089
2445345
2445601
2445857
2446113
2446369
2446625
2446881
2447137
2447393
2447649
2447905
2448161
2448417
2448673
2448929
2449185
2441250
2441506
2441762
2442018
2442274
2442530
2442786
2443042
2443298
2443554
2443810
2444066
2444322
2444578
2444834
2445090
2445346
2445602
2445858
2446114
2446370
2446626
2446882
2447138
2447394
2447650
2447906
2448162
2448418
2448674
2448930
2449186
2441251
2441507
2441763
2442019
2442275
2442531
2442787
2443043
2443299
2443555
2443811
2444067
2444323
2444579
2444835
2445091
2445347
2445603
2445859
2446115
2446371
2446627
2446883
2447139
2447395
2447651
2447907
2448163
2448419
2448675
2448931
2449187
2441252
2441508
2441764
2442020
2442276
2442532
2442788
2443044
2443300
2443556
2443812
2444068
2444324
2444580
2444836
2445092
2445348
2445604
2445860
2446116
2446372
2446628
2446884
2447140
2447396
2447652
2447908
2448164
2448420
2448676
2448932
2449188
2441253
2441509
2441765
2442021
2442277
2442533
2442789
2443045
2443301
2443557
2443813
2444069
2444325
2444581
2444837
2445093
2445349
2445605
2445861
2446117
2446373
2446629
2446885
2447141
2447397
2447653
2447909
2448165
2448421
2448677
2448933
2449189
2441254
2441510
2441766
2442022
2442278
2442534
2442790
2443046
2443302
2443558
2443814
2444070
2444326
2444582
2444838
2445094
2445350
2445606
2445862
2446118
2446374
2446630
2446886
2447142
2447398
2447654
2447910
2448166
2448422
2448678
2448934
2449190
2441255
2441511
2441767
2442023
2442279
2442535
2442791
2443047
2443303
2443559
2443815
2444071
2444327
2444583
2444839
2445095
2445351
2445607
2445863
2446119
2446375
2446631
2446887
2447143
2447399
2447655
2447911
2448167
2448423
2448679
2448935
2449191
2441256
2441512
2441768
2442024
2442280
2442536
2442792
2443048
2443304
2443560
2443816
2444072
2444328
2444584
2444840
2445096
2445352
2445608
2445864
2446120
2446376
2446632
2446888
2447144
2447400
2447656
2447912
2448168
2448424
2448680
2448936
2449192
2441257
2441513
2441769
2442025
2442281
2442537
2442793
2443049
2443305
2443561
2443817
2444073
2444329
2444585
2444841
2445097
2445353
2445609
2445865
2446121
2446377
2446633
2446889
2447145
2447401
2447657
2447913
2448169
2448425
2448681
2448937
2449193
2441258
2441514
2441770
2442026
2442282
2442538
2442794
2443050
2443306
2443562
2443818
2444074
2444330
2444586
2444842
2445098
2445354
2445610
2445866
2446122
2446378
2446634
2446890
2447146
2447402
2447658
2447914
2448170
2448426
2448682
2448938
2449194
2441259
2441515
2441771
2442027
2442283
2442539
2442795
2443051
2443307
2443563
2443819
2444075
2444331
2444587
2444843
2445099
2445355
2445611
2445867
2446123
2446379
2446635
2446891
2447147
2447403
2447659
2447915
2448171
2448427
2448683
2448939
2449195
2441260
2441516
2441772
2442028
2442284
2442540
2442796
2443052
2443308
2443564
2443820
2444076
2444332
2444588
2444844
2445100
2445356
2445612
2445868
2446124
2446380
2446636
2446892
2447148
2447404
2447660
2447916
2448172
2448428
2448684
2448940
2449196
2441261
2441517
2441773
2442029
2442285
2442541
2442797
2443053
2443309
2443565
2443821
2444077
2444333
2444589
2444845
2445101
2445357
2445613
2445869
2446125
2446381
2446637
2446893
2447149
2447405
2447661
2447917
2448173
2448429
2448685
2448941
2449197
2441262
2441518
2441774
2442030
2442286
2442542
2442798
2443054
2443310
2443566
2443822
2444078
2444334
2444590
2444846
2445102
2445358
2445614
2445870
2446126
2446382
2446638
2446894
2447150
2447406
2447662
2447918
2448174
2448430
2448686
2448942
2449198
2441263
2441519
2441775
2442031
2442287
2442543
2442799
2443055
2443311
2443567
2443823
2444079
2444335
2444591
2444847
2445103
2445359
2445615
2445871
2446127
2446383
2446639
2446895
2447151
2447407
2447663
2447919
2448175
2448431
2448687
2448943
2449199
2441264
2441520
2441776
2442032
2442288
2442544
2442800
2443056
2443312
2443568
2443824
2444080
2444336
2444592
2444848
2445104
2445360
2445616
2445872
2446128
2446384
2446640
2446896
2447152
2447408
2447664
2447920
2448176
2448432
2448688
2448944
2449200
2441265
2441521
2441777
2442033
2442289
2442545
2442801
2443057
2443313
2443569
2443825
2444081
2444337
2444593
2444849
2445105
2445361
2445617
2445873
2446129
2446385
2446641
2446897
2447153
2447409
2447665
2447921
2448177
2448433
2448689
2448945
2449201
2441266
2441522
2441778
2442034
2442290
2442546
2442802
2443058
2443314
2443570
2443826
2444082
2444338
2444594
2444850
2445106
2445362
2445618
2445874
2446130
2446386
2446642
2446898
2447154
2447410
2447666
2447922
2448178
2448434
2448690
2448946
2449202
2441267
2441523
2441779
2442035
2442291
2442547
2442803
2443059
2443315
2443571
2443827
2444083
2444339
2444595
2444851
2445107
2445363
2445619
2445875
2446131
2446387
2446643
2446899
2447155
2447411
2447667
2447923
2448179
2448435
2448691
2448947
2449203
2441268
2441524
2441780
2442036
2442292
2442548
2442804
2443060
2443316
2443572
2443828
2444084
2444340
2444596
2444852
2445108
2445364
2445620
2445876
2446132
2446388
2446644
2446900
2447156
2447412
2447668
2447924
2448180
2448436
2448692
2448948
2449204
2441269
2441525
2441781
2442037
2442293
2442549
2442805
2443061
2443317
2443573
2443829
2444085
2444341
2444597
2444853
2445109
2445365
2445621
2445877
2446133
2446389
2446645
2446901
2447157
2447413
2447669
2447925
2448181
2448437
2448693
2448949
2449205
2441270
2441526
2441782
2442038
2442294
2442550
2442806
2443062
2443318
2443574
2443830
2444086
2444342
2444598
2444854
2445110
2445366
2445622
2445878
2446134
2446390
2446646
2446902
2447158
2447414
2447670
2447926
2448182
2448438
2448694
2448950
2449206
2441271
2441527
2441783
2442039
2442295
2442551
2442807
2443063
2443319
2443575
2443831
2444087
2444343
2444599
2444855
2445111
2445367
2445623
2445879
2446135
2446391
2446647
2446903
2447159
2447415
2447671
2447927
2448183
2448439
2448695
2448951
2449207
2441272
2441528
2441784
2442040
2442296
2442552
2442808
2443064
2443320
2443576
2443832
2444088
2444344
2444600
2444856
2445112
2445368
2445624
2445880
2446136
2446392
2446648
2446904
2447160
2447416
2447672
2447928
2448184
2448440
2448696
2448952
2449208
2441273
2441529
2441785
2442041
2442297
2442553
2442809
2443065
2443321
2443577
2443833
2444089
2444345
2444601
2444857
2445113
2445369
2445625
2445881
2446137
2446393
2446649
2446905
2447161
2447417
2447673
2447929
2448185
2448441
2448697
2448953
2449209
2441274
2441530
2441786
2442042
2442298
2442554
2442810
2443066
2443322
2443578
2443834
2444090
2444346
2444602
2444858
2445114
2445370
2445626
2445882
2446138
2446394
2446650
2446906
2447162
2447418
2447674
2447930
2448186
2448442
2448698
2448954
2449210
2441275
2441531
2441787
2442043
2442299
2442555
2442811
2443067
2443323
2443579
2443835
2444091
2444347
2444603
2444859
2445115
2445371
2445627
2445883
2446139
2446395
2446651
2446907
2447163
2447419
2447675
2447931
2448187
2448443
2448699
2448955
2449211
2441276
2441532
2441788
2442044
2442300
2442556
2442812
2443068
2443324
2443580
2443836
2444092
2444348
2444604
2444860
2445116
2445372
2445628
2445884
2446140
2446396
2446652
2446908
2447164
2447420
2447676
2447932
2448188
2448444
2448700
2448956
2449212
2441277
2441533
2441789
2442045
2442301
2442557
2442813
2443069
2443325
2443581
2443837
2444093
2444349
2444605
2444861
2445117
2445373
2445629
2445885
2446141
2446397
2446653
2446909
2447165
2447421
2447677
2447933
2448189
2448445
2448701
2448957
2449213
2441278
2441534
2441790
2442046
2442302
2442558
2442814
2443070
2443326
2443582
2443838
2444094
2444350
2444606
2444862
2445118
2445374
2445630
2445886
2446142
2446398
2446654
2446910
2447166
2447422
2447678
2447934
2448190
2448446
2448702
2448958
2449214
2441279
2441535
2441791
2442047
2442303
2442559
2442815
2443071
2443327
2443583
2443839
2444095
2444351
2444607
2444863
2445119
2445375
2445631
2445887
2446143
2446399
2446655
2446911
2447167
2447423
2447679
2447935
2448191
2448447
2448703
2448959
2449215
2441280
2441536
2441792
2442048
2442304
2442560
2442816
2443072
2443328
2443584
2443840
2444096
2444352
2444608
2444864
2445120
2445376
2445632
2445888
2446144
2446400
2446656
2446912
2447168
2447424
2447680
2447936
2448192
2448448
2448704
2448960
2449216
2441281
2441537
2441793
2442049
2442305
2442561
2442817
2443073
2443329
2443585
2443841
2444097
2444353
2444609
2444865
2445121
2445377
2445633
2445889
2446145
2446401
2446657
2446913
2447169
2447425
2447681
2447937
2448193
2448449
2448705
2448961
2449217
2441282
2441538
2441794
2442050
2442306
2442562
2442818
2443074
2443330
2443586
2443842
2444098
2444354
2444610
2444866
2445122
2445378
2445634
2445890
2446146
2446402
2446658
2446914
2447170
2447426
2447682
2447938
2448194
2448450
2448706
2448962
2449218
2441283
2441539
2441795
2442051
2442307
2442563
2442819
2443075
2443331
2443587
2443843
2444099
2444355
2444611
2444867
2445123
2445379
2445635
2445891
2446147
2446403
2446659
2446915
2447171
2447427
2447683
2447939
2448195
2448451
2448707
2448963
2449219
2441284
2441540
2441796
2442052
2442308
2442564
2442820
2443076
2443332
2443588
2443844
2444100
2444356
2444612
2444868
2445124
2445380
2445636
2445892
2446148
2446404
2446660
2446916
2447172
2447428
2447684
2447940
2448196
2448452
2448708
2448964
2449220
2441285
2441541
2441797
2442053
2442309
2442565
2442821
2443077
2443333
2443589
2443845
2444101
2444357
2444613
2444869
2445125
2445381
2445637
2445893
2446149
2446405
2446661
2446917
2447173
2447429
2447685
2447941
2448197
2448453
2448709
2448965
2449221
2441286
2441542
2441798
2442054
2442310
2442566
2442822
2443078
2443334
2443590
2443846
2444102
2444358
2444614
2444870
2445126
2445382
2445638
2445894
2446150
2446406
2446662
2446918
2447174
2447430
2447686
2447942
2448198
2448454
2448710
2448966
2449222
2441287
2441543
2441799
2442055
2442311
2442567
2442823
2443079
2443335
2443591
2443847
2444103
2444359
2444615
2444871
2445127
2445383
2445639
2445895
2446151
2446407
2446663
2446919
2447175
2447431
2447687
2447943
2448199
2448455
2448711
2448967
2449223
2441288
2441544
2441800
2442056
2442312
2442568
2442824
2443080
2443336
2443592
2443848
2444104
2444360
2444616
2444872
2445128
2445384
2445640
2445896
2446152
2446408
2446664
2446920
2447176
2447432
2447688
2447944
2448200
2448456
2448712
2448968
2449224
2441289
2441545
2441801
2442057
2442313
2442569
2442825
2443081
2443337
2443593
2443849
2444105
2444361
2444617
2444873
2445129
2445385
2445641
2445897
2446153
2446409
2446665
2446921
2447177
2447433
2447689
2447945
2448201
2448457
2448713
2448969
2449225
2441290
2441546
2441802
2442058
2442314
2442570
2442826
2443082
2443338
2443594
2443850
2444106
2444362
2444618
2444874
2445130
2445386
2445642
2445898
2446154
2446410
2446666
2446922
2447178
2447434
2447690
2447946
2448202
2448458
2448714
2448970
2449226
2441291
2441547
2441803
2442059
2442315
2442571
2442827
2443083
2443339
2443595
2443851
2444107
2444363
2444619
2444875
2445131
2445387
2445643
2445899
2446155
2446411
2446667
2446923
2447179
2447435
2447691
2447947
2448203
2448459
2448715
2448971
2449227
2441292
2441548
2441804
2442060
2442316
2442572
2442828
2443084
2443340
2443596
2443852
2444108
2444364
2444620
2444876
2445132
2445388
2445644
2445900
2446156
2446412
2446668
2446924
2447180
2447436
2447692
2447948
2448204
2448460
2448716
2448972
2449228
2441293
2441549
2441805
2442061
2442317
2442573
2442829
2443085
2443341
2443597
2443853
2444109
2444365
2444621
2444877
2445133
2445389
2445645
2445901
2446157
2446413
2446669
2446925
2447181
2447437
2447693
2447949
2448205
2448461
2448717
2448973
2449229
2441294
2441550
2441806
2442062
2442318
2442574
2442830
2443086
2443342
2443598
2443854
2444110
2444366
2444622
2444878
2445134
2445390
2445646
2445902
2446158
2446414
2446670
2446926
2447182
2447438
2447694
2447950
2448206
2448462
2448718
2448974
2449230
2441295
2441551
2441807
2442063
2442319
2442575
2442831
2443087
2443343
2443599
2443855
2444111
2444367
2444623
2444879
2445135
2445391
2445647
2445903
2446159
2446415
2446671
2446927
2447183
2447439
2447695
2447951
2448207
2448463
2448719
2448975
2449231
2441296
2441552
2441808
2442064
2442320
2442576
2442832
2443088
2443344
2443600
2443856
2444112
2444368
2444624
2444880
2445136
2445392
2445648
2445904
2446160
2446416
2446672
2446928
2447184
2447440
2447696
2447952
2448208
2448464
2448720
2448976
2449232
2441297
2441553
2441809
2442065
2442321
2442577
2442833
2443089
2443345
2443601
2443857
2444113
2444369
2444625
2444881
2445137
2445393
2445649
2445905
2446161
2446417
2446673
2446929
2447185
2447441
2447697
2447953
2448209
2448465
2448721
2448977
2449233
2441298
2441554
2441810
2442066
2442322
2442578
2442834
2443090
2443346
2443602
2443858
2444114
2444370
2444626
2444882
2445138
2445394
2445650
2445906
2446162
2446418
2446674
2446930
2447186
2447442
2447698
2447954
2448210
2448466
2448722
2448978
2449234
2441299
2441555
2441811
2442067
2442323
2442579
2442835
2443091
2443347
2443603
2443859
2444115
2444371
2444627
2444883
2445139
2445395
2445651
2445907
2446163
2446419
2446675
2446931
2447187
2447443
2447699
2447955
2448211
2448467
2448723
2448979
2449235
2441300
2441556
2441812
2442068
2442324
2442580
2442836
2443092
2443348
2443604
2443860
2444116
2444372
2444628
2444884
2445140
2445396
2445652
2445908
2446164
2446420
2446676
2446932
2447188
2447444
2447700
2447956
2448212
2448468
2448724
2448980
2449236
2441301
2441557
2441813
2442069
2442325
2442581
2442837
2443093
2443349
2443605
2443861
2444117
2444373
2444629
2444885
2445141
2445397
2445653
2445909
2446165
2446421
2446677
2446933
2447189
2447445
2447701
2447957
2448213
2448469
2448725
2448981
2449237
2441302
2441558
2441814
2442070
2442326
2442582
2442838
2443094
2443350
2443606
2443862
2444118
2444374
2444630
2444886
2445142
2445398
2445654
2445910
2446166
2446422
2446678
2446934
2447190
2447446
2447702
2447958
2448214
2448470
2448726
2448982
2449238
2441303
2441559
2441815
2442071
2442327
2442583
2442839
2443095
2443351
2443607
2443863
2444119
2444375
2444631
2444887
2445143
2445399
2445655
2445911
2446167
2446423
2446679
2446935
2447191
2447447
2447703
2447959
2448215
2448471
2448727
2448983
2449239
2441304
2441560
2441816
2442072
2442328
2442584
2442840
2443096
2443352
2443608
2443864
2444120
2444376
2444632
2444888
2445144
2445400
2445656
2445912
2446168
2446424
2446680
2446936
2447192
2447448
2447704
2447960
2448216
2448472
2448728
2448984
2449240
2441305
2441561
2441817
2442073
2442329
2442585
2442841
2443097
2443353
2443609
2443865
2444121
2444377
2444633
2444889
2445145
2445401
2445657
2445913
2446169
2446425
2446681
2446937
2447193
2447449
2447705
2447961
2448217
2448473
2448729
2448985
2449241
2441306
2441562
2441818
2442074
2442330
2442586
2442842
2443098
2443354
2443610
2443866
2444122
2444378
2444634
2444890
2445146
2445402
2445658
2445914
2446170
2446426
2446682
2446938
2447194
2447450
2447706
2447962
2448218
2448474
2448730
2448986
2449242
2441307
2441563
2441819
2442075
2442331
2442587
2442843
2443099
2443355
2443611
2443867
2444123
2444379
2444635
2444891
2445147
2445403
2445659
2445915
2446171
2446427
2446683
2446939
2447195
2447451
2447707
2447963
2448219
2448475
2448731
2448987
2449243
2441308
2441564
2441820
2442076
2442332
2442588
2442844
2443100
2443356
2443612
2443868
2444124
2444380
2444636
2444892
2445148
2445404
2445660
2445916
2446172
2446428
2446684
2446940
2447196
2447452
2447708
2447964
2448220
2448476
2448732
2448988
2449244
2441309
2441565
2441821
2442077
2442333
2442589
2442845
2443101
2443357
2443613
2443869
2444125
2444381
2444637
2444893
2445149
2445405
2445661
2445917
2446173
2446429
2446685
2446941
2447197
2447453
2447709
2447965
2448221
2448477
2448733
2448989
2449245
2441310
2441566
2441822
2442078
2442334
2442590
2442846
2443102
2443358
2443614
2443870
2444126
2444382
2444638
2444894
2445150
2445406
2445662
2445918
2446174
2446430
2446686
2446942
2447198
2447454
2447710
2447966
2448222
2448478
2448734
2448990
2449246
2441311
2441567
2441823
2442079
2442335
2442591
2442847
2443103
2443359
2443615
2443871
2444127
2444383
2444639
2444895
2445151
2445407
2445663
2445919
2446175
2446431
2446687
2446943
2447199
2447455
2447711
2447967
2448223
2448479
2448735
2448991
2449247
3014656
3014912
3015168
3015424
3015680
3015936
3016192
3016448
3016704
3016960
3017216
3017472
3017728
3017984
3018240
3018496
3018752
3019008
3019264
3019520
3019776
3020032
3020288
3020544
3020800
3021056
3021312
3021568
3021824
3022080
3022336
3022592
3014657
3014913
3015169
3015425
3015681
3015937
3016193
3016449
3016705
3016961
3017217
3017473
3017729
3017985
3018241
3018497
3018753
3019009
3019265
3019521
3019777
3020033
3020289
3020545
3020801
3021057
3021313
3021569
3021825
3022081
3022337
3022593
3014658
3014914
3015170
3015426
3015682
3015938
3016194
3016450
3016706
3016962
3017218
3017474
3017730
3017986
3018242
3018498
3018754
3019010
3019266
3019522
3019778
3020034
3020290
3020546
3020802
3021058
3021314
3021570
3021826
3022082
3022338
3022594
3014659
3014915
3015171
3015427
3015683
3015939
3016195
3016451
3016707
3016963
3017219
3017475
3017731
3017987
3018243
3018499
3018755
3019011
3019267
3019523
3019779
3020035
3020291
3020547
3020803
3021059
3021315
3021571
3021827
3022083
3022339
3022595
3014660
3014916
3015172
3015428
3015684
3015940
3016196
3016452
3016708
3016964
3017220
3017476
3017732
3017988
3018244
3018500
3018756
3019012
3019268
3019524
3019780
3020036
3020292
3020548
3020804
3021060
3021316
3021572
3021828
3022084
3022340
3022596
3014661
3014917
3015173
3015429
3015685
3015941
3016197
3016453
3016709
3016965
3017221
3017477
3017733
3017989
3018245
3018501
3018757
3019013
3019269
3019525
3019781
3020037
3020293
3020549
3020805
3021061
3021317
3021573
3021829
3022085
3022341
3022597
3014662
3014918
3015174
3015430
3015686
3015942
3016198
3016454
3016710
3016966
3017222
3017478
3017734
3017990
3018246
3018502
3018758
3019014
3019270
3019526
3019782
3020038
3020294
3020550
3020806
3021062
3021318
3021574
3021830
3022086
3022342
3022598
3014663
3014919
3015175
3015431
3015687
3015943
3016199
3016455
3016711
3016967
3017223
3017479
3017735
3017991
3018247
3018503
3018759
3019015
3019271
3019527
3019783
3020039
3020295
3020551
3020807
3021063
3021319
3021575
3021831
3022087
3022343
3022599
3014664
3014920
3015176
3015432
3015688
3015944
3016200
3016456
3016712
3016968
3017224
3017480
3017736
3017992
3018248
3018504
3018760
3019016
3019272
3019528
3019784
3020040
3020296
3020552
3020808
3021064
3021320
3021576
3021832
3022088
3022344
3022600
3014665
3014921
3015177
3015433
3015689
3015945
3016201
3016457
3016713
3016969
3017225
3017481
3017737
3017993
3018249
3018505
3018761
3019017
3019273
3019529
3019785
3020041
3020297
3020553
3020809
3021065
3021321
3021577
3021833
3022089
3022345
3022601
3014666
3014922
3015178
3015434
3015690
3015946
3016202
3016458
3016714
3016970
3017226
3017482
3017738
3017994
3018250
3018506
3018762
3019018
3019274
3019530
3019786
3020042
3020298
3020554
3020810
3021066
3021322
3021578
3021834
3022090
3022346
3022602
3014667
3014923
3015179
3015435
3015691
3015947
3016203
3016459
3016715
3016971
3017227
3017483
3017739
3017995
3018251
3018507
3018763
3019019
3019275
3019531
3019787
3020043
3020299
3020555
3020811
3021067
3021323
3021579
3021835
3022091
3022347
3022603
3014668
3014924
3015180
3015436
3015692
3015948
3016204
3016460
3016716
3016972
3017228
3017484
3017740
3017996
3018252
3018508
3018764
3019020
3019276
3019532
3019788
3020044
3020300
3020556
3020812
3021068
3021324
3021580
3021836
3022092
3022348
3022604
3014669
3014925
3015181
3015437
3015693
3015949
3016205
3016461
3016717
3016973
3017229
3017485
3017741
3017997
3018253
3018509
3018765
3019021
3019277
3019533
3019789
3020045
3020301
3020557
3020813
3021069
3021325
3021581
3021837
3022093
3022349
3022605
3014670
3014926
3015182
3015438
3015694
3015950
3016206
3016462
3016718
3016974
3017230
3017486
3017742
3017998
3018254
3018510
3018766
3019022
3019278
3019534
3019790
3020046
3020302
3020558
3020814
3021070
3021326
3021582
3021838
3022094
3022350
3022606
3014671
3014927
3015183
3015439
3015695
3015951
3016207
3016463
3016719
3016975
3017231
3017487
3017743
3017999
3018255
3018511
3018767
3019023
3019279
3019535
3019791
3020047
3020303
3020559
3020815
3021071
3021327
3021583
3021839
3022095
3022351
3022607
3014672
3014928
3015184
3015440
3015696
3015952
3016208
3016464
3016720
3016976
3017232
3017488
3017744
3018000
3018256
3018512
3018768
3019024
3019280
3019536
3019792
3020048
3020304
3020560
3020816
3021072
3021328
3021584
3021840
3022096
3022352
3022608
3014673
3014929
3015185
3015441
3015697
3015953
3016209
3016465
3016721
3016977
3017233
3017489
3017745
3018001
3018257
3018513
3018769
3019025
3019281
3019537
3019793
3020049
3020305
3020561
3020817
3021073
3021329
3021585
3021841
3022097
3022353
3022609
3014674
3014930
3015186
3015442
3015698
3015954
3016210
3016466
3016722
3016978
3017234
3017490
3017746
3018002
3018258
3018514
3018770
3019026
3019282
3019538
3019794
3020050
3020306
3020562
3020818
3021074
3021330
3021586
3021842
3022098
3022354
3022610
3014675
3014931
3015187
3015443
3015699
3015955
3016211
3016467
3016723
3016979
3017235
3017491
3017747
3018003
3018259
3018515
3018771
3019027
3019283
3019539
3019795
3020051
3020307
3020563
3020819
3021075
3021331
3021587
3021843
3022099
3022355
3022611
3014676
3014932
3015188
3015444
3015700
3015956
3016212
3016468
3016724
3016980
3017236
3017492
3017748
3018004
3018260
3018516
3018772
3019028
3019284
3019540
3019796
3020052
3020308
3020564
3020820
3021076
3021332
3021588
3021844
3022100
3022356
3022612
3014677
3014933
3015189
3015445
3015701
3015957
3016213
3016469
3016725
3016981
3017237
3017493
3017749
3018005
3018261
3018517
3018773
3019029
3019285
3019541
3019797
3020053
3020309
3020565
3020821
3021077
3021333
3021589
3021845
3022101
3022357
3022613
3014678
3014934
3015190
3015446
3015702
3015958
3016214
3016470
3016726
3016982
3017238
3017494
3017750
3018006
3018262
3018518
3018774
3019030
3019286
3019542
3019798
3020054
3020310
3020566
3020822
3021078
3021334
3021590
3021846
3022102
3022358
3022614
3014679
3014935
3015191
3015447
3015703
3015959
3016215
3016471
3016727
3016983
3017239
3017495
3017751
3018007
3018263
3018519
3018775
3019031
3019287
3019543
3019799
3020055
3020311
3020567
3020823
3021079
3021335
3021591
3021847
3022103
3022359
3022615
3014680
3014936
3015192
3015448
3015704
3015960
3016216
3016472
3016728
3016984
3017240
3017496
3017752
3018008
3018264
3018520
3018776
3019032
3019288
3019544
3019800
3020056
3020312
3020568
3020824
3021080
3021336
3021592
3021848
3022104
3022360
3022616
3014681
3014937
3015193
3015449
3015705
3015961
3016217
3016473
3016729
3016985
3017241
3017497
3017753
3018009
3018265
3018521
3018777
3019033
3019289
3019545
3019801
3020057
3020313
3020569
3020825
3021081
3021337
3021593
3021849
3022105
3022361
3022617
3014682
3014938
3015194
3015450
3015706
3015962
3016218
3016474
3016730
3016986
3017242
3017498
3017754
3018010
3018266
3018522
3018778
3019034
3019290
3019546
3019802
3020058
3020314
3020570
3020826
3021082
3021338
3021594
3021850
3022106
3022362
3022618
3014683
3014939
3015195
3015451
3015707
3015963
3016219
3016475
3016731
3016987
3017243
3017499
3017755
3018011
3018267
3018523
3018779
3019035
3019291
3019547
3019803
3020059
3020315
3020571
3020827
3021083
3021339
3021595
3021851
3022107
3022363
3022619
3014684
3014940
3015196
3015452
3015708
3015964
3016220
3016476
3016732
3016988
3017244
3017500
3017756
3018012
3018268
3018524
3018780
3019036
3019292
3019548
3019804
3020060
3020316
3020572
3020828
3021084
3021340
3021596
3021852
3022108
3022364
3022620
3014685
3014941
3015197
3015453
3015709
3015965
3016221
3016477
3016733
3016989
3017245
3017501
3017757
3018013
3018269
3018525
3018781
3019037
3019293
3019549
3019805
3020061
3020317
3020573
3020829
3021085
3021341
3021597
3021853
3022109
3022365
3022621
3014686
3014942
3015198
3015454
3015710
3015966
3016222
3016478
3016734
3016990
3017246
3017502
3017758
3018014
3018270
3018526
3018782
3019038
3019294
3019550
3019806
3020062
3020318
3020574
3020830
3021086
3021342
3021598
3021854
3022110
3022366
3022622
3014687
3014943
3015199
3015455
3015711
3015967
3016223
3016479
3016735
3016991
3017247
3017503
3017759
3018015
3018271
3018527
3018783
3019039
3019295
3019551
3019807
3020063
3020319
3020575
3020831
3021087
3021343
3021599
3021855
3022111
3022367
3022623
3014688
3014944
3015200
3015456
3015712
3015968
3016224
3016480
3016736
3016992
3017248
3017504
3017760
3018016
3018272
3018528
3018784
3019040
3019296
3019552
3019808
3020064
3020320
3020576
3020832
3021088
3021344
3021600
3021856
3022112
3022368
3022624
3014689
3014945
3015201
3015457
3015713
3015969
3016225
3016481
3016737
3016993
3017249
3017505
3017761
3018017
3018273
3018529
3018785
3019041
3019297
3019553
3019809
3020065
3020321
3020577
3020833
3021089
3021345
3021601
3021857
3022113
3022369
3022625
3014690
3014946
3015202
3015458
3015714
3015970
3016226
3016482
3016738
3016994
3017250
3017506
3017762
3018018
3018274
3018530
3018786
3019042
3019298
3019554
3019810
3020066
3020322
3020578
3020834
3021090
3021346
3021602
3021858
3022114
3022370
3022626
3014691
3014947
3015203
3015459
3015715
3015971
3016227
3016483
3016739
3016995
3017251
3017507
3017763
3018019
3018275
3018531
3018787
3019043
3019299
3019555
3019811
3020067
3020323
3020579
3020835
3021091
3021347
3021603
3021859
3022115
3022371
3022627
3014692
3014948
3015204
3015460
3015716
3015972
3016228
3016484
3016740
3016996
3017252
3017508
3017764
3018020
3018276
3018532
3018788
3019044
3019300
3019556
3019812
3020068
3020324
3020580
3020836
3021092
3021348
3021604
3021860
3022116
3022372
3022628
3014693
3014949
3015205
3015461
3015717
3015973
3016229
3016485
3016741
3016997
3017253
3017509
3017765
3018021
3018277
3018533
3018789
3019045
3019301
3019557
3019813
3020069
3020325
3020581
3020837
3021093
3021349
3021605
3021861
3022117
3022373
3022629
3014694
3014950
3015206
3015462
3015718
3015974
3016230
3016486
3016742
3016998
3017254
3017510
3017766
3018022
3018278
3018534
3018790
3019046
3019302
3019558
3019814
3020070
3020326
3020582
3020838
3021094
3021350
3021606
3021862
3022118
3022374
3022630
3014695
3014951
3015207
3015463
3015719
3015975
3016231
3016487
3016743
3016999
3017255
3017511
3017767
3018023
3018279
3018535
3018791
3019047
3019303
3019559
3019815
3020071
3020327
3020583
3020839
3021095
3021351
3021607
3021863
3022119
3022375
3022631
3014696
3014952
3015208
3015464
3015720
3015976
3016232
3016488
3016744
3017000
3017256
3017512
3017768
3018024
3018280
3018536
3018792
3019048
3019304
3019560
3019816
3020072
3020328
3020584
3020840
3021096
3021352
3021608
3021864
3022120
3022376
3022632
3014697
3014953
3015209
3015465
3015721
3015977
3016233
3016489
3016745
3017001
3017257
3017513
3017769
3018025
3018281
3018537
3018793
3019049
3019305
3019561
3019817
3020073
3020329
3020585
3020841
3021097
3021353
3021609
3021865
3022121
3022377
3022633
3014698
3014954
3015210
3015466
3015722
3015978
3016234
3016490
3016746
3017002
3017258
3017514
3017770
3018026
3018282
3018538
3018794
3019050
3019306
3019562
3019818
3020074
3020330
3020586
3020842
3021098
3021354
3021610
3021866
3022122
3022378
3022634
3014699
3014955
3015211
3015467
3015723
3015979
3016235
3016491
3016747
3017003
3017259
3017515
3017771
3018027
3018283
3018539
3018795
3019051
3019307
3019563
3019819
3020075
3020331
3020587
3020843
3021099
3021355
3021611
3021867
3022123
3022379
3022635
3014700
3014956
3015212
3015468
3015724
3015980
3016236
3016492
3016748
3017004
3017260
3017516
3017772
3018028
3018284
3018540
3018796
3019052
3019308
3019564
3019820
3020076
3020332
3020588
3020844
3021100
3021356
3021612
3021868
3022124
3022380
3022636
3014701
3014957
3015213
3015469
3015725
3015981
3016237
3016493
3016749
3017005
3017261
3017517
3017773
3018029
3018285
3018541
3018797
3019053
3019309
3019565
3019821
3020077
3020333
3020589
3020845
3021101
3021357
3021613
3021869
3022125
3022381
3022637
3014702
3014958
3015214
3015470
3015726
3015982
3016238
3016494
3016750
3017006
3017262
3017518
3017774
3018030
3018286
3018542
3018798
3019054
3019310
3019566
3019822
3020078
3020334
3020590
3020846
3021102
3021358
3021614
3021870
3022126
3022382
3022638
3014703
3014959
3015215
3015471
3015727
3015983
3016239
3016495
3016751
3017007
3017263
3017519
3017775
3018031
3018287
3018543
3018799
3019055
3019311
3019567
3019823
3020079
3020335
3020591
3020847
3021103
3021359
3021615
3021871
3022127
3022383
3022639
3014704
3014960
3015216
3015472
3015728
3015984
3016240
3016496
3016752
3017008
3017264
3017520
3017776
3018032
3018288
3018544
3018800
3019056
3019312
3019568
3019824
3020080
3020336
3020592
3020848
3021104
3021360
3021616
3021872
3022128
3022384
3022640
3014705
3014961
3015217
3015473
3015729
3015985
3016241
3016497
3016753
3017009
3017265
3017521
3017777
3018033
3018289
3018545
3018801
3019057
3019313
3019569
3019825
3020081
3020337
3020593
3020849
3021105
3021361
3021617
3021873
3022129
3022385
3022641
3014706
3014962
3015218
3015474
3015730
3015986
3016242
3016498
3016754
3017010
3017266
3017522
3017778
3018034
3018290
3018546
3018802
3019058
3019314
3019570
3019826
3020082
3020338
3020594
3020850
3021106
3021362
3021618
3021874
3022130
3022386
3022642
3014707
3014963
3015219
3015475
3015731
3015987
3016243
3016499
3016755
3017011
3017267
3017523
3017779
3018035
3018291
3018547
3018803
3019059
3019315
3019571
3019827
3020083
3020339
3020595
3020851
3021107
3021363
3021619
3021875
3022131
3022387
3022643
3014708
3014964
3015220
3015476
3015732
3015988
3016244
3016500
3016756
3017012
3017268
3017524
3017780
3018036
3018292
3018548
3018804
3019060
3019316
3019572
3019828
3020084
3020340
3020596
3020852
3021108
3021364
3021620
3021876
3022132
3022388
3022644
3014709
3014965
3015221
3015477
3015733
3015989
3016245
3016501
3016757
3017013
3017269
3017525
3017781
3018037
3018293
3018549
3018805
3019061
3019317
3019573
3019829
3020085
3020341
3020597
3020853
3021109
3021365
3021621
3021877
3022133
3022389
3022645
3014710
3014966
3015222
3015478
3015734
3015990
3016246
3016502
3016758
3017014
3017270
3017526
3017782
3018038
3018294
3018550
3018806
3019062
3019318
3019574
3019830
3020086
3020342
3020598
3020854
3021110
3021366
3021622
3021878
3022134
3022390
3022646
3014711
3014967
3015223
3015479
3015735
3015991
3016247
3016503
3016759
3017015
3017271
3017527
3017783
3018039
3018295
3018551
3018807
3019063
3019319
3019575
3019831
3020087
3020343
3020599
3020855
3021111
3021367
3021623
3021879
3022135
3022391
3022647
3014712
3014968
3015224
3015480
3015736
3015992
3016248
3016504
3016760
3017016
3017272
3017528
3017784
3018040
3018296
3018552
3018808
3019064
3019320
3019576
3019832
3020088
3020344
3020600
3020856
3021112
3021368
3021624
3021880
3022136
3022392
3022648
3014713
3014969
3015225
3015481
3015737
3015993
3016249
3016505
3016761
3017017
3017273
3017529
3017785
3018041
3018297
3018553
3018809
3019065
3019321
3019577
3019833
3020089
3020345
3020601
3020857
3021113
3021369
3021625
3021881
3022137
3022393
3022649
3014714
3014970
3015226
3015482
3015738
3015994
3016250
3016506
3016762
3017018
3017274
3017530
3017786
3018042
3018298
3018554
3018810
3019066
3019322
3019578
3019834
3020090
3020346
3020602
3020858
3021114
3021370
3021626
3021882
3022138
3022394
3022650
3014715
3014971
3015227
3015483
3015739
3015995
3016251
3016507
3016763
3017019
3017275
3017531
3017787
3018043
3018299
3018555
3018811
3019067
3019323
3019579
3019835
3020091
3020347
3020603
3020859
3021115
3021371
3021627
3021883
3022139
3022395
3022651
3014716
3014972
3015228
3015484
3015740
3015996
3016252
3016508
3016764
3017020
3017276
3017532
3017788
3018044
3018300
3018556
3018812
3019068
3019324
3019580
3019836
3020092
3020348
3020604
3020860
3021116
3021372
3021628
3021884
3022140
3022396
3022652
3014717
3014973
3015229
3015485
3015741
3015997
3016253
3016509
3016765
3017021
3017277
3017533
3017789
3018045
3018301
3018557
3018813
3019069
3019325
3019581
3019837
3020093
3020349
3020605
3020861
3021117
3021373
3021629
3021885
3022141
3022397
3022653
3014718
3014974
3015230
3015486
3015742
3015998
3016254
3016510
3016766
3017022
3017278
3017534
3017790
3018046
3018302
3018558
3018814
3019070
3019326
3019582
3019838
3020094
3020350
3020606
3020862
3021118
3021374
3021630
3021886
3022142
3022398
3022654
3014719
3014975
3015231
3015487
3015743
3015999
3016255
3016511
3016767
3017023
3017279
3017535
3017791
3018047
3018303
3018559
3018815
3019071
3019327
3019583
3019839
3020095
3020351
3020607
3020863
3021119
3021375
3021631
3021887
3022143
3022399
3022655
3014720
3014976
3015232
3015488
3015744
3016000
3016256
3016512
3016768
3017024
3017280
3017536
3017792
3018048
3018304
3018560
3018816
3019072
3019328
3019584
3019840
3020096
3020352
3020608
3020864
3021120
3021376
3021632
3021888
3022144
3022400
3022656
3014721
3014977
3015233
3015489
3015745
3016001
3016257
3016513
3016769
3017025
3017281
3017537
3017793
3018049
3018305
3018561
3018817
3019073
3019329
3019585
3019841
3020097
3020353
3020609
3020865
3021121
3021377
3021633
3021889
3022145
3022401
3022657
3014722
3014978
3015234
3015490
3015746
3016002
3016258
3016514
3016770
3017026
3017282
3017538
3017794
3018050
3018306
3018562
3018818
3019074
3019330
3019586
3019842
3020098
3020354
3020610
3020866
3021122
3021378
3021634
3021890
3022146
3022402
3022658
3014723
3014979
3015235
3015491
3015747
3016003
3016259
3016515
3016771
3017027
3017283
3017539
3017795
3018051
3018307
3018563
3018819
3019075
3019331
3019587
3019843
3020099
3020355
3020611
3020867
3021123
3021379
3021635
3021891
3022147
3022403
3022659
3014724
3014980
3015236
3015492
3015748
3016004
3016260
3016516
3016772
3017028
3017284
3017540
3017796
3018052
3018308
3018564
3018820
3019076
3019332
3019588
3019844
3020100
3020356
3020612
3020868
3021124
3021380
3021636
3021892
3022148
3022404
3022660
3014725
3014981
3015237
3015493
3015749
3016005
3016261
3016517
3016773
3017029
3017285
3017541
3017797
3018053
3018309
3018565
3018821
3019077
3019333
3019589
3019845
3020101
3020357
3020613
3020869
3021125
3021381
3021637
3021893
3022149
3022405
3022661
3014726
3014982
3015238
3015494
3015750
3016006
3016262
3016518
3016774
3017030
3017286
3017542
3017798
3018054
3018310
3018566
3018822
3019078
3019334
3019590
3019846
3020102
3020358
3020614
3020870
3021126
3021382
3021638
3021894
3022150
3022406
3022662
3014727
3014983
3015239
3015495
3015751
3016007
3016263
3016519
3016775
3017031
3017287
3017543
3017799
3018055
3018311
3018567
3018823
3019079
3019335
3019591
3019847
3020103
3020359
3020615
3020871
3021127
3021383
3021639
3021895
3022151
3022407
3022663
3014728
3014984
3015240
3015496
3015752
3016008
3016264
3016520
3016776
3017032
3017288
3017544
3017800
3018056
3018312
3018568
3018824
3019080
3019336
3019592
3019848
3020104
3020360
3020616
3020872
3021128
3021384
3021640
3021896
3022152
3022408
3022664
3014729
3014985
3015241
3015497
3015753
3016009
3016265
3016521
3016777
3017033
3017289
3017545
3017801
3018057
3018313
3018569
3018825
3019081
3019337
3019593
3019849
3020105
3020361
3020617
3020873
3021129
3021385
3021641
3021897
3022153
3022409
3022665
3014730
3014986
3015242
3015498
3015754
3016010
3016266
3016522
3016778
3017034
3017290
3017546
3017802
3018058
3018314
3018570
3018826
3019082
3019338
3019594
3019850
3020106
3020362
3020618
3020874
3021130
3021386
3021642
3021898
3022154
3022410
3022666
3014731
3014987
3015243
3015499
3015755
3016011
3016267
3016523
3016779
3017035
3017291
3017547
3017803
3018059
3018315
3018571
3018827
3019083
3019339
3019595
3019851
3020107
3020363
3020619
3020875
3021131
3021387
3021643
3021899
3022155
3022411
3022667
3014732
3014988
3015244
3015500
3015756
3016012
3016268
3016524
3016780
3017036
3017292
3017548
3017804
3018060
3018316
3018572
3018828
3019084
3019340
3019596
3019852
3020108
3020364
3020620
3020876
3021132
3021388
3021644
3021900
3022156
3022412
3022668
3014733
3014989
3015245
3015501
3015757
3016013
3016269
3016525
3016781
3017037
3017293
3017549
3017805
3018061
3018317
3018573
3018829
3019085
3019341
3019597
3019853
3020109
3020365
3020621
3020877
3021133
3021389
3021645
3021901
3022157
3022413
3022669
3014734
3014990
3015246
3015502
3015758
3016014
3016270
3016526
3016782
3017038
3017294
3017550
3017806
3018062
3018318
3018574
3018830
3019086
3019342
3019598
3019854
3020110
3020366
3020622
3020878
3021134
3021390
3021646
3021902
3022158
3022414
3022670
3014735
3014991
3015247
3015503
3015759
3016015
3016271
3016527
3016783
3017039
3017295
3017551
3017807
3018063
3018319
3018575
3018831
3019087
3019343
3019599
3019855
3020111
3020367
3020623
3020879
3021135
3021391
3021647
3021903
3022159
3022415
3022671
3014736
3014992
3015248
3015504
3015760
3016016
3016272
3016528
3016784
3017040
3017296
3017552
3017808
3018064
3018320
3018576
3018832
3019088
3019344
3019600
3019856
3020112
3020368
3020624
3020880
3021136
3021392
3021648
3021904
3022160
3022416
3022672
3014737
3014993
3015249
3015505
3015761
3016017
3016273
3016529
3016785
3017041
3017297
3017553
3017809
3018065
3018321
3018577
3018833
3019089
3019345
3019601
3019857
3020113
3020369
3020625
3020881
3021137
3021393
3021649
3021905
3022161
3022417
3022673
3014738
3014994
3015250
3015506
3015762
3016018
3016274
3016530
3016786
3017042
3017298
3017554
3017810
3018066
3018322
3018578
3018834
3019090
3019346
3019602
3019858
3020114
3020370
3020626
3020882
3021138
3021394
3021650
3021906
3022162
3022418
3022674
3014739
3014995
3015251
3015507
3015763
3016019
3016275
3016531
3016787
3017043
3017299
3017555
3017811
3018067
3018323
3018579
3018835
3019091
3019347
3019603
3019859
3020115
3020371
3020627
3020883
3021139
3021395
3021651
3021907
3022163
3022419
3022675
3014740
3014996
3015252
3015508
3015764
3016020
3016276
3016532
3016788
3017044
3017300
3017556
3017812
3018068
3018324
3018580
3018836
3019092
3019348
3019604
3019860
3020116
3020372
3020628
3020884
3021140
3021396
3021652
3021908
3022164
3022420
3022676
3014741
3014997
3015253
3015509
3015765
3016021
3016277
3016533
3016789
3017045
3017301
3017557
3017813
3018069
3018325
3018581
3018837
3019093
3019349
3019605
3019861
3020117
3020373
3020629
3020885
3021141
3021397
3021653
3021909
3022165
3022421
3022677
3014742
3014998
3015254
3015510
3015766
3016022
3016278
3016534
3016790
3017046
3017302
3017558
3017814
3018070
3018326
3018582
3018838
3019094
3019350
3019606
3019862
3020118
3020374
3020630
3020886
3021142
3021398
3021654
3021910
3022166
3022422
3022678
3014743
3014999
3015255
3015511
3015767
3016023
3016279
3016535
3016791
3017047
3017303
3017559
3017815
3018071
3018327
3018583
3018839
3019095
3019351
3019607
3019863
3020119
3020375
3020631
3020887
3021143
3021399
3021655
3021911
3022167
3022423
3022679
3014744
3015000
3015256
3015512
3015768
3016024
3016280
3016536
3016792
3017048
3017304
3017560
3017816
3018072
3018328
3018584
3018840
3019096
3019352
3019608
3019864
3020120
3020376
3020632
3020888
3021144
3021400
3021656
3021912
3022168
3022424
3022680
3014745
3015001
3015257
3015513
3015769
3016025
3016281
3016537
3016793
3017049
3017305
3017561
3017817
3018073
3018329
3018585
3018841
3019097
3019353
3019609
3019865
3020121
3020377
3020633
3020889
3021145
3021401
3021657
3021913
3022169
3022425
3022681
3014746
3015002
3015258
3015514
3015770
3016026
3016282
3016538
3016794
3017050
3017306
3017562
3017818
3018074
3018330
3018586
3018842
3019098
3019354
3019610
3019866
3020122
3020378
3020634
3020890
3021146
3021402
3021658
3021914
3022170
3022426
3022682
3014747
3015003
3015259
3015515
3015771
3016027
3016283
3016539
3016795
3017051
3017307
3017563
3017819
3018075
3018331
3018587
3018843
3019099
3019355
3019611
3019867
3020123
3020379
3020635
3020891
3021147
3021403
3021659
3021915
3022171
3022427
3022683
3014748
3015004
3015260
3015516
3015772
3016028
3016284
3016540
3016796
3017052
3017308
3017564
3017820
3018076
3018332
3018588
3018844
3019100
3019356
3019612
3019868
3020124
3020380
3020636
3020892
3021148
3021404
3021660
3021916
3022172
3022428
3022684
3014749
3015005
3015261
3015517
3015773
3016029
3016285
3016541
3016797
3017053
3017309
3017565
3017821
3018077
3018333
3018589
3018845
3019101
3019357
3019613
3019869
3020125
3020381
3020637
3020893
3021149
3021405
3021661
3021917
3022173
3022429
3022685
3014750
3015006
3015262
3015518
3015774
3016030
3016286
3016542
3016798
3017054
3017310
3017566
3017822
3018078
3018334
3018590
3018846
3019102
3019358
3019614
3019870
3020126
3020382
3020638
3020894
3021150
3021406
3021662
3021918
3022174
3022430
3022686
3014751
3015007
3015263
3015519
3015775
3016031
3016287
3016543
3016799
3017055
3017311
3017567
3017823
3018079
3018335
3018591
3018847
3019103
3019359
3019615
3019871
3020127
3020383
3020639
3020895
3021151
3021407
3021663
3021919
3022175
3022431
3022687
