1132122
2906457
2905434
2905436
3097665
3098434
3098690
3098946
3099458
3099714
3096899
3097667
3096644
3097668
3098692
3096901
3097677
3098189
3099472
3096913
3098961
3097426
3097682
3097171
3097427
3099475
3097684
3098197
3097174
3097686
3099222
3097175
3097431
3097687
3099479
3097946
3297883
