409600
409856
410112
410368
410624
410880
411136
411392
411648
411904
412160
412416
412672
412928
413184
413440
413696
413952
414208
414464
414720
414976
415232
415488
415744
416000
416256
416512
416768
417024
417280
417536
409601
409857
410113
410369
410625
410881
411137
411393
411649
411905
412161
412417
412673
412929
413185
413441
413697
413953
414209
414465
414721
414977
415233
415489
415745
416001
416257
416513
416769
417025
417281
417537
409602
409858
410114
410370
410626
410882
411138
411394
411650
411906
412162
412418
412674
412930
413186
413442
413698
413954
414210
414466
414722
414978
415234
415490
415746
416002
416258
416514
416770
417026
417282
417538
409603
409859
410115
410371
410627
410883
411139
411395
411651
411907
412163
412419
412675
412931
413187
413443
413699
413955
414211
414467
414723
414979
415235
415491
415747
416003
416259
416515
416771
417027
417283
417539
409604
409860
410116
410372
410628
410884
411140
411396
411652
411908
412164
412420
412676
412932
413188
413444
413700
413956
414212
414468
414724
414980
415236
415492
415748
416004
416260
416516
416772
417028
417284
417540
409605
409861
410117
410373
410629
410885
411141
411397
411653
411909
412165
412421
412677
412933
413189
413445
413701
413957
414213
414469
414725
414981
415237
415493
415749
416005
416261
416517
416773
417029
417285
417541
409606
409862
410118
410374
410630
410886
411142
411398
411654
411910
412166
412422
412678
412934
413190
413446
413702
413958
414214
414470
414726
414982
415238
415494
415750
416006
416262
416518
416774
417030
417286
417542
409607
409863
410119
410375
410631
410887
411143
411399
411655
411911
412167
412423
412679
412935
413191
413447
413703
413959
414215
414471
414727
414983
415239
415495
415751
416007
416263
416519
416775
417031
417287
417543
409608
409864
410120
410376
410632
410888
411144
411400
411656
411912
412168
412424
412680
412936
413192
413448
413704
413960
414216
414472
414728
414984
415240
415496
415752
416008
416264
416520
416776
417032
417288
417544
409609
409865
410121
410377
410633
410889
411145
411401
411657
411913
412169
412425
412681
412937
413193
413449
413705
413961
414217
414473
414729
414985
415241
415497
415753
416009
416265
416521
416777
417033
417289
417545
409610
409866
410122
410378
410634
410890
411146
411402
411658
411914
412170
412426
412682
412938
413194
413450
413706
413962
414218
414474
414730
414986
415242
415498
415754
416010
416266
416522
416778
417034
417290
417546
409611
409867
410123
410379
410635
410891
411147
411403
411659
411915
412171
412427
412683
412939
413195
413451
413707
413963
414219
414475
414731
414987
415243
415499
415755
416011
416267
416523
416779
417035
417291
417547
409612
409868
410124
410380
410636
410892
411148
411404
411660
411916
412172
412428
412684
412940
413196
413452
413708
413964
414220
414476
414732
414988
415244
415500
415756
416012
416268
416524
416780
417036
417292
417548
409613
409869
410125
410381
410637
410893
411149
411405
411661
411917
412173
412429
412685
412941
413197
413453
413709
413965
414221
414477
414733
414989
415245
415501
415757
416013
416269
416525
416781
417037
417293
417549
409614
409870
410126
410382
410638
410894
411150
411406
411662
411918
412174
412430
412686
412942
413198
413454
413710
413966
414222
414478
414734
414990
415246
415502
415758
416014
416270
416526
416782
417038
417294
417550
409615
409871
410127
410383
410639
410895
411151
411407
411663
411919
412175
412431
412687
412943
413199
413455
413711
413967
414223
414479
414735
414991
415247
415503
415759
416015
416271
416527
416783
417039
417295
417551
409616
409872
410128
410384
410640
410896
411152
411408
411664
411920
412176
412432
412688
412944
413200
413456
413712
413968
414224
414480
414736
414992
415248
415504
415760
416016
416272
416528
416784
417040
417296
417552
409617
409873
410129
410385
410641
410897
411153
411409
411665
411921
412177
412433
412689
412945
413201
413457
413713
413969
414225
414481
414737
414993
415249
415505
415761
416017
416273
416529
416785
417041
417297
417553
409618
409874
410130
410386
410642
410898
411154
411410
411666
411922
412178
412434
412690
412946
413202
413458
413714
413970
414226
414482
414738
414994
415250
415506
415762
416018
416274
416530
416786
417042
417298
417554
409619
409875
410131
410387
410643
410899
411155
411411
411667
411923
412179
412435
412691
412947
413203
413459
413715
413971
414227
414483
414739
414995
415251
415507
415763
416019
416275
416531
416787
417043
417299
417555
409620
409876
410132
410388
410644
410900
411156
411412
411668
411924
412180
412436
412692
412948
413204
413460
413716
413972
414228
414484
414740
414996
415252
415508
415764
416020
416276
416532
416788
417044
417300
417556
409621
409877
410133
410389
410645
410901
411157
411413
411669
411925
412181
412437
412693
412949
413205
413461
413717
413973
414229
414485
414741
414997
415253
415509
415765
416021
416277
416533
416789
417045
417301
417557
409622
409878
410134
410390
410646
410902
411158
411414
411670
411926
412182
412438
412694
412950
413206
413462
413718
413974
414230
414486
414742
414998
415254
415510
415766
416022
416278
416534
416790
417046
417302
417558
409623
409879
410135
410391
410647
410903
411159
411415
411671
411927
412183
412439
412695
412951
413207
413463
413719
413975
414231
414487
414743
414999
415255
415511
415767
416023
416279
416535
416791
417047
417303
417559
409624
409880
410136
410392
410648
410904
411160
411416
411672
411928
412184
412440
412696
412952
413208
413464
413720
413976
414232
414488
414744
415000
415256
415512
415768
416024
416280
416536
416792
417048
417304
417560
409625
409881
410137
410393
410649
410905
411161
411417
411673
411929
412185
412441
412697
412953
413209
413465
413721
413977
414233
414489
414745
415001
415257
415513
415769
416025
416281
416537
416793
417049
417305
417561
409626
409882
410138
410394
410650
410906
411162
411418
411674
411930
412186
412442
412698
412954
413210
413466
413722
413978
414234
414490
414746
415002
415258
415514
415770
416026
416282
416538
416794
417050
417306
417562
409627
409883
410139
410395
410651
410907
411163
411419
411675
411931
412187
412443
412699
412955
413211
413467
413723
413979
414235
414491
414747
415003
415259
415515
415771
416027
416283
416539
416795
417051
417307
417563
409628
409884
410140
410396
410652
410908
411164
411420
411676
411932
412188
412444
412700
412956
413212
413468
413724
413980
414236
414492
414748
415004
415260
415516
415772
416028
416284
416540
416796
417052
417308
417564
409629
409885
410141
410397
410653
410909
411165
411421
411677
411933
412189
412445
412701
412957
413213
413469
413725
413981
414237
414493
414749
415005
415261
415517
415773
416029
416285
416541
416797
417053
417309
417565
409630
409886
410142
410398
410654
410910
411166
411422
411678
411934
412190
412446
412702
412958
413214
413470
413726
413982
414238
414494
414750
415006
415262
415518
415774
416030
416286
416542
416798
417054
417310
417566
409631
409887
410143
410399
410655
410911
411167
411423
411679
411935
412191
412447
412703
412959
413215
413471
413727
413983
414239
414495
414751
415007
415263
415519
415775
416031
416287
416543
416799
417055
417311
417567
409632
409888
410144
410400
410656
410912
411168
411424
411680
411936
412192
412448
412704
412960
413216
413472
413728
413984
414240
414496
414752
415008
415264
415520
415776
416032
416288
416544
416800
417056
417312
417568
409633
409889
410145
410401
410657
410913
411169
411425
411681
411937
412193
412449
412705
412961
413217
413473
413729
413985
414241
414497
414753
415009
415265
415521
415777
416033
416289
416545
416801
417057
417313
417569
409634
409890
410146
410402
410658
410914
411170
411426
411682
411938
412194
412450
412706
412962
413218
413474
413730
413986
414242
414498
414754
415010
415266
415522
415778
416034
416290
416546
416802
417058
417314
417570
409635
409891
410147
410403
410659
410915
411171
411427
411683
411939
412195
412451
412707
412963
413219
413475
413731
413987
414243
414499
414755
415011
415267
415523
415779
416035
416291
416547
416803
417059
417315
417571
409636
409892
410148
410404
410660
410916
411172
411428
411684
411940
412196
412452
412708
412964
413220
413476
413732
413988
414244
414500
414756
415012
415268
415524
415780
416036
416292
416548
416804
417060
417316
417572
409637
409893
410149
410405
410661
410917
411173
411429
411685
411941
412197
412453
412709
412965
413221
413477
413733
413989
414245
414501
414757
415013
415269
415525
415781
416037
416293
416549
416805
417061
417317
417573
409638
409894
410150
410406
410662
410918
411174
411430
411686
411942
412198
412454
412710
412966
413222
413478
413734
413990
414246
414502
414758
415014
415270
415526
415782
416038
416294
416550
416806
417062
417318
417574
409639
409895
410151
410407
410663
410919
411175
411431
411687
411943
412199
412455
412711
412967
413223
413479
413735
413991
414247
414503
414759
415015
415271
415527
415783
416039
416295
416551
416807
417063
417319
417575
409640
409896
410152
410408
410664
410920
411176
411432
411688
411944
412200
412456
412712
412968
413224
413480
413736
413992
414248
414504
414760
415016
415272
415528
415784
416040
416296
416552
416808
417064
417320
417576
409641
409897
410153
410409
410665
410921
411177
411433
411689
411945
412201
412457
412713
412969
413225
413481
413737
413993
414249
414505
414761
415017
415273
415529
415785
416041
416297
416553
416809
417065
417321
417577
409642
409898
410154
410410
410666
410922
411178
411434
411690
411946
412202
412458
412714
412970
413226
413482
413738
413994
414250
414506
414762
415018
415274
415530
415786
416042
416298
416554
416810
417066
417322
417578
409643
409899
410155
410411
410667
410923
411179
411435
411691
411947
412203
412459
412715
412971
413227
413483
413739
413995
414251
414507
414763
415019
415275
415531
415787
416043
416299
416555
416811
417067
417323
417579
409644
409900
410156
410412
410668
410924
411180
411436
411692
411948
412204
412460
412716
412972
413228
413484
413740
413996
414252
414508
414764
415020
415276
415532
415788
416044
416300
416556
416812
417068
417324
417580
409645
409901
410157
410413
410669
410925
411181
411437
411693
411949
412205
412461
412717
412973
413229
413485
413741
413997
414253
414509
414765
415021
415277
415533
415789
416045
416301
416557
416813
417069
417325
417581
409646
409902
410158
410414
410670
410926
411182
411438
411694
411950
412206
412462
412718
412974
413230
413486
413742
413998
414254
414510
414766
415022
415278
415534
415790
416046
416302
416558
416814
417070
417326
417582
409647
409903
410159
410415
410671
410927
411183
411439
411695
411951
412207
412463
412719
412975
413231
413487
413743
413999
414255
414511
414767
415023
415279
415535
415791
416047
416303
416559
416815
417071
417327
417583
409648
409904
410160
410416
410672
410928
411184
411440
411696
411952
412208
412464
412720
412976
413232
413488
413744
414000
414256
414512
414768
415024
415280
415536
415792
416048
416304
416560
416816
417072
417328
417584
409649
409905
410161
410417
410673
410929
411185
411441
411697
411953
412209
412465
412721
412977
413233
413489
413745
414001
414257
414513
414769
415025
415281
415537
415793
416049
416305
416561
416817
417073
417329
417585
409650
409906
410162
410418
410674
410930
411186
411442
411698
411954
412210
412466
412722
412978
413234
413490
413746
414002
414258
414514
414770
415026
415282
415538
415794
416050
416306
416562
416818
417074
417330
417586
409651
409907
410163
410419
410675
410931
411187
411443
411699
411955
412211
412467
412723
412979
413235
413491
413747
414003
414259
414515
414771
415027
415283
415539
415795
416051
416307
416563
416819
417075
417331
417587
409652
409908
410164
410420
410676
410932
411188
411444
411700
411956
412212
412468
412724
412980
413236
413492
413748
414004
414260
414516
414772
415028
415284
415540
415796
416052
416308
416564
416820
417076
417332
417588
409653
409909
410165
410421
410677
410933
411189
411445
411701
411957
412213
412469
412725
412981
413237
413493
413749
414005
414261
414517
414773
415029
415285
415541
415797
416053
416309
416565
416821
417077
417333
417589
409654
409910
410166
410422
410678
410934
411190
411446
411702
411958
412214
412470
412726
412982
413238
413494
413750
414006
414262
414518
414774
415030
415286
415542
415798
416054
416310
416566
416822
417078
417334
417590
409655
409911
410167
410423
410679
410935
411191
411447
411703
411959
412215
412471
412727
412983
413239
413495
413751
414007
414263
414519
414775
415031
415287
415543
415799
416055
416311
416567
416823
417079
417335
417591
409656
409912
410168
410424
410680
410936
411192
411448
411704
411960
412216
412472
412728
412984
413240
413496
413752
414008
414264
414520
414776
415032
415288
415544
415800
416056
416312
416568
416824
417080
417336
417592
409657
409913
410169
410425
410681
410937
411193
411449
411705
411961
412217
412473
412729
412985
413241
413497
413753
414009
414265
414521
414777
415033
415289
415545
415801
416057
416313
416569
416825
417081
417337
417593
409658
409914
410170
410426
410682
410938
411194
411450
411706
411962
412218
412474
412730
412986
413242
413498
413754
414010
414266
414522
414778
415034
415290
415546
415802
416058
416314
416570
416826
417082
417338
417594
409659
409915
410171
410427
410683
410939
411195
411451
411707
411963
412219
412475
412731
412987
413243
413499
413755
414011
414267
414523
414779
415035
415291
415547
415803
416059
416315
416571
416827
417083
417339
417595
409660
409916
410172
410428
410684
410940
411196
411452
411708
411964
412220
412476
412732
412988
413244
413500
413756
414012
414268
414524
414780
415036
415292
415548
415804
416060
416316
416572
416828
417084
417340
417596
409661
409917
410173
410429
410685
410941
411197
411453
411709
411965
412221
412477
412733
412989
413245
413501
413757
414013
414269
414525
414781
415037
415293
415549
415805
416061
416317
416573
416829
417085
417341
417597
409662
409918
410174
410430
410686
410942
411198
411454
411710
411966
412222
412478
412734
412990
413246
413502
413758
414014
414270
414526
414782
415038
415294
415550
415806
416062
416318
416574
416830
417086
417342
417598
409663
409919
410175
410431
410687
410943
411199
411455
411711
411967
412223
412479
412735
412991
413247
413503
413759
414015
414271
414527
414783
415039
415295
415551
415807
416063
416319
416575
416831
417087
417343
417599
409664
409920
410176
410432
410688
410944
411200
411456
411712
411968
412224
412480
412736
412992
413248
413504
413760
414016
414272
414528
414784
415040
415296
415552
415808
416064
416320
416576
416832
417088
417344
417600
409665
409921
410177
410433
410689
410945
411201
411457
411713
411969
412225
412481
412737
412993
413249
413505
413761
414017
414273
414529
414785
415041
415297
415553
415809
416065
416321
416577
416833
417089
417345
417601
409666
409922
410178
410434
410690
410946
411202
411458
411714
411970
412226
412482
412738
412994
413250
413506
413762
414018
414274
414530
414786
415042
415298
415554
415810
416066
416322
416578
416834
417090
417346
417602
409667
409923
410179
410435
410691
410947
411203
411459
411715
411971
412227
412483
412739
412995
413251
413507
413763
414019
414275
414531
414787
415043
415299
415555
415811
416067
416323
416579
416835
417091
417347
417603
409668
409924
410180
410436
410692
410948
411204
411460
411716
411972
412228
412484
412740
412996
413252
413508
413764
414020
414276
414532
414788
415044
415300
415556
415812
416068
416324
416580
416836
417092
417348
417604
409669
409925
410181
410437
410693
410949
411205
411461
411717
411973
412229
412485
412741
412997
413253
413509
413765
414021
414277
414533
414789
415045
415301
415557
415813
416069
416325
416581
416837
417093
417349
417605
409670
409926
410182
410438
410694
410950
411206
411462
411718
411974
412230
412486
412742
412998
413254
413510
413766
414022
414278
414534
414790
415046
415302
415558
415814
416070
416326
416582
416838
417094
417350
417606
409671
409927
410183
410439
410695
410951
411207
411463
411719
411975
412231
412487
412743
412999
413255
413511
413767
414023
414279
414535
414791
415047
415303
415559
415815
416071
416327
416583
416839
417095
417351
417607
409672
409928
410184
410440
410696
410952
411208
411464
411720
411976
412232
412488
412744
413000
413256
413512
413768
414024
414280
414536
414792
415048
415304
415560
415816
416072
416328
416584
416840
417096
417352
417608
409673
409929
410185
410441
410697
410953
411209
411465
411721
411977
412233
412489
412745
413001
413257
413513
413769
414025
414281
414537
414793
415049
415305
415561
415817
416073
416329
416585
416841
417097
417353
417609
409674
409930
410186
410442
410698
410954
411210
411466
411722
411978
412234
412490
412746
413002
413258
413514
413770
414026
414282
414538
414794
415050
415306
415562
415818
416074
416330
416586
416842
417098
417354
417610
409675
409931
410187
410443
410699
410955
411211
411467
411723
411979
412235
412491
412747
413003
413259
413515
413771
414027
414283
414539
414795
415051
415307
415563
415819
416075
416331
416587
416843
417099
417355
417611
409676
409932
410188
410444
410700
410956
411212
411468
411724
411980
412236
412492
412748
413004
413260
413516
413772
414028
414284
414540
414796
415052
415308
415564
415820
416076
416332
416588
416844
417100
417356
417612
409677
409933
410189
410445
410701
410957
411213
411469
411725
411981
412237
412493
412749
413005
413261
413517
413773
414029
414285
414541
414797
415053
415309
415565
415821
416077
416333
416589
416845
417101
417357
417613
409678
409934
410190
410446
410702
410958
411214
411470
411726
411982
412238
412494
412750
413006
413262
413518
413774
414030
414286
414542
414798
415054
415310
415566
415822
416078
416334
416590
416846
417102
417358
417614
409679
409935
410191
410447
410703
410959
411215
411471
411727
411983
412239
412495
412751
413007
413263
413519
413775
414031
414287
414543
414799
415055
415311
415567
415823
416079
416335
416591
416847
417103
417359
417615
409680
409936
410192
410448
410704
410960
411216
411472
411728
411984
412240
412496
412752
413008
413264
413520
413776
414032
414288
414544
414800
415056
415312
415568
415824
416080
416336
416592
416848
417104
417360
417616
409681
409937
410193
410449
410705
410961
411217
411473
411729
411985
412241
412497
412753
413009
413265
413521
413777
414033
414289
414545
414801
415057
415313
415569
415825
416081
416337
416593
416849
417105
417361
417617
409682
409938
410194
410450
410706
410962
411218
411474
411730
411986
412242
412498
412754
413010
413266
413522
413778
414034
414290
414546
414802
415058
415314
415570
415826
416082
416338
416594
416850
417106
417362
417618
409683
409939
410195
410451
410707
410963
411219
411475
411731
411987
412243
412499
412755
413011
413267
413523
413779
414035
414291
414547
414803
415059
415315
415571
415827
416083
416339
416595
416851
417107
417363
417619
409684
409940
410196
410452
410708
410964
411220
411476
411732
411988
412244
412500
412756
413012
413268
413524
413780
414036
414292
414548
414804
415060
415316
415572
415828
416084
416340
416596
416852
417108
417364
417620
409685
409941
410197
410453
410709
410965
411221
411477
411733
411989
412245
412501
412757
413013
413269
413525
413781
414037
414293
414549
414805
415061
415317
415573
415829
416085
416341
416597
416853
417109
417365
417621
409686
409942
410198
410454
410710
410966
411222
411478
411734
411990
412246
412502
412758
413014
413270
413526
413782
414038
414294
414550
414806
415062
415318
415574
415830
416086
416342
416598
416854
417110
417366
417622
409687
409943
410199
410455
410711
410967
411223
411479
411735
411991
412247
412503
412759
413015
413271
413527
413783
414039
414295
414551
414807
415063
415319
415575
415831
416087
416343
416599
416855
417111
417367
417623
409688
409944
410200
410456
410712
410968
411224
411480
411736
411992
412248
412504
412760
413016
413272
413528
413784
414040
414296
414552
414808
415064
415320
415576
415832
416088
416344
416600
416856
417112
417368
417624
409689
409945
410201
410457
410713
410969
411225
411481
411737
411993
412249
412505
412761
413017
413273
413529
413785
414041
414297
414553
414809
415065
415321
415577
415833
416089
416345
416601
416857
417113
417369
417625
409690
409946
410202
410458
410714
410970
411226
411482
411738
411994
412250
412506
412762
413018
413274
413530
413786
414042
414298
414554
414810
415066
415322
415578
415834
416090
416346
416602
416858
417114
417370
417626
409691
409947
410203
410459
410715
410971
411227
411483
411739
411995
412251
412507
412763
413019
413275
413531
413787
414043
414299
414555
414811
415067
415323
415579
415835
416091
416347
416603
416859
417115
417371
417627
409692
409948
410204
410460
410716
410972
411228
411484
411740
411996
412252
412508
412764
413020
413276
413532
413788
414044
414300
414556
414812
415068
415324
415580
415836
416092
416348
416604
416860
417116
417372
417628
409693
409949
410205
410461
410717
410973
411229
411485
411741
411997
412253
412509
412765
413021
413277
413533
413789
414045
414301
414557
414813
415069
415325
415581
415837
416093
416349
416605
416861
417117
417373
417629
409694
409950
410206
410462
410718
410974
411230
411486
411742
411998
412254
412510
412766
413022
413278
413534
413790
414046
414302
414558
414814
415070
415326
415582
415838
416094
416350
416606
416862
417118
417374
417630
409695
409951
410207
410463
410719
410975
411231
411487
411743
411999
412255
412511
412767
413023
413279
413535
413791
414047
414303
414559
414815
415071
415327
415583
415839
416095
416351
416607
416863
417119
417375
417631
3014656
3014912
3015168
3015424
3015680
3015936
3016192
3016448
3016704
3016960
3017216
3017472
3017728
3017984
3018240
3018496
3018752
3019008
3019264
3019520
3019776
3020032
3020288
3020544
3020800
3021056
3021312
3021568
3021824
3022080
3022336
3022592
3014657
3014913
3015169
3015425
3015681
3015937
3016193
3016449
3016705
3016961
3017217
3017473
3017729
3017985
3018241
3018497
3018753
3019009
3019265
3019521
3019777
3020033
3020289
3020545
3020801
3021057
3021313
3021569
3021825
3022081
3022337
3022593
3014658
3014914
3015170
3015426
3015682
3015938
3016194
3016450
3016706
3016962
3017218
3017474
3017730
3017986
3018242
3018498
3018754
3019010
3019266
3019522
3019778
3020034
3020290
3020546
3020802
3021058
3021314
3021570
3021826
3022082
3022338
3022594
3014659
3014915
3015171
3015427
3015683
3015939
3016195
3016451
3016707
3016963
3017219
3017475
3017731
3017987
3018243
3018499
3018755
3019011
3019267
3019523
3019779
3020035
3020291
3020547
3020803
3021059
3021315
3021571
3021827
3022083
3022339
3022595
3014660
3014916
3015172
3015428
3015684
3015940
3016196
3016452
3016708
3016964
3017220
3017476
3017732
3017988
3018244
3018500
3018756
3019012
3019268
3019524
3019780
3020036
3020292
3020548
3020804
3021060
3021316
3021572
3021828
3022084
3022340
3022596
3014661
3014917
3015173
3015429
3015685
3015941
3016197
3016453
3016709
3016965
3017221
3017477
3017733
3017989
3018245
3018501
3018757
3019013
3019269
3019525
3019781
3020037
3020293
3020549
3020805
3021061
3021317
3021573
3021829
3022085
3022341
3022597
3014662
3014918
3015174
3015430
3015686
3015942
3016198
3016454
3016710
3016966
3017222
3017478
3017734
3017990
3018246
3018502
3018758
3019014
3019270
3019526
3019782
3020038
3020294
3020550
3020806
3021062
3021318
3021574
3021830
3022086
3022342
3022598
3014663
3014919
3015175
3015431
3015687
3015943
3016199
3016455
3016711
3016967
3017223
3017479
3017735
3017991
3018247
3018503
3018759
3019015
3019271
3019527
3019783
3020039
3020295
3020551
3020807
3021063
3021319
3021575
3021831
3022087
3022343
3022599
3014664
3014920
3015176
3015432
3015688
3015944
3016200
3016456
3016712
3016968
3017224
3017480
3017736
3017992
3018248
3018504
3018760
3019016
3019272
3019528
3019784
3020040
3020296
3020552
3020808
3021064
3021320
3021576
3021832
3022088
3022344
3022600
3014665
3014921
3015177
3015433
3015689
3015945
3016201
3016457
3016713
3016969
3017225
3017481
3017737
3017993
3018249
3018505
3018761
3019017
3019273
3019529
3019785
3020041
3020297
3020553
3020809
3021065
3021321
3021577
3021833
3022089
3022345
3022601
3014666
3014922
3015178
3015434
3015690
3015946
3016202
3016458
3016714
3016970
3017226
3017482
3017738
3017994
3018250
3018506
3018762
3019018
3019274
3019530
3019786
3020042
3020298
3020554
3020810
3021066
3021322
3021578
3021834
3022090
3022346
3022602
3014667
3014923
3015179
3015435
3015691
3015947
3016203
3016459
3016715
3016971
3017227
3017483
3017739
3017995
3018251
3018507
3018763
3019019
3019275
3019531
3019787
3020043
3020299
3020555
3020811
3021067
3021323
3021579
3021835
3022091
3022347
3022603
3014668
3014924
3015180
3015436
3015692
3015948
3016204
3016460
3016716
3016972
3017228
3017484
3017740
3017996
3018252
3018508
3018764
3019020
3019276
3019532
3019788
3020044
3020300
3020556
3020812
3021068
3021324
3021580
3021836
3022092
3022348
3022604
3014669
3014925
3015181
3015437
3015693
3015949
3016205
3016461
3016717
3016973
3017229
3017485
3017741
3017997
3018253
3018509
3018765
3019021
3019277
3019533
3019789
3020045
3020301
3020557
3020813
3021069
3021325
3021581
3021837
3022093
3022349
3022605
3014670
3014926
3015182
3015438
3015694
3015950
3016206
3016462
3016718
3016974
3017230
3017486
3017742
3017998
3018254
3018510
3018766
3019022
3019278
3019534
3019790
3020046
3020302
3020558
3020814
3021070
3021326
3021582
3021838
3022094
3022350
3022606
3014671
3014927
3015183
3015439
3015695
3015951
3016207
3016463
3016719
3016975
3017231
3017487
3017743
3017999
3018255
3018511
3018767
3019023
3019279
3019535
3019791
3020047
3020303
3020559
3020815
3021071
3021327
3021583
3021839
3022095
3022351
3022607
3014672
3014928
3015184
3015440
3015696
3015952
3016208
3016464
3016720
3016976
3017232
3017488
3017744
3018000
3018256
3018512
3018768
3019024
3019280
3019536
3019792
3020048
3020304
3020560
3020816
3021072
3021328
3021584
3021840
3022096
3022352
3022608
3014673
3014929
3015185
3015441
3015697
3015953
3016209
3016465
3016721
3016977
3017233
3017489
3017745
3018001
3018257
3018513
3018769
3019025
3019281
3019537
3019793
3020049
3020305
3020561
3020817
3021073
3021329
3021585
3021841
3022097
3022353
3022609
3014674
3014930
3015186
3015442
3015698
3015954
3016210
3016466
3016722
3016978
3017234
3017490
3017746
3018002
3018258
3018514
3018770
3019026
3019282
3019538
3019794
3020050
3020306
3020562
3020818
3021074
3021330
3021586
3021842
3022098
3022354
3022610
3014675
3014931
3015187
3015443
3015699
3015955
3016211
3016467
3016723
3016979
3017235
3017491
3017747
3018003
3018259
3018515
3018771
3019027
3019283
3019539
3019795
3020051
3020307
3020563
3020819
3021075
3021331
3021587
3021843
3022099
3022355
3022611
3014676
3014932
3015188
3015444
3015700
3015956
3016212
3016468
3016724
3016980
3017236
3017492
3017748
3018004
3018260
3018516
3018772
3019028
3019284
3019540
3019796
3020052
3020308
3020564
3020820
3021076
3021332
3021588
3021844
3022100
3022356
3022612
3014677
3014933
3015189
3015445
3015701
3015957
3016213
3016469
3016725
3016981
3017237
3017493
3017749
3018005
3018261
3018517
3018773
3019029
3019285
3019541
3019797
3020053
3020309
3020565
3020821
3021077
3021333
3021589
3021845
3022101
3022357
3022613
3014678
3014934
3015190
3015446
3015702
3015958
3016214
3016470
3016726
3016982
3017238
3017494
3017750
3018006
3018262
3018518
3018774
3019030
3019286
3019542
3019798
3020054
3020310
3020566
3020822
3021078
3021334
3021590
3021846
3022102
3022358
3022614
3014679
3014935
3015191
3015447
3015703
3015959
3016215
3016471
3016727
3016983
3017239
3017495
3017751
3018007
3018263
3018519
3018775
3019031
3019287
3019543
3019799
3020055
3020311
3020567
3020823
3021079
3021335
3021591
3021847
3022103
3022359
3022615
3014680
3014936
3015192
3015448
3015704
3015960
3016216
3016472
3016728
3016984
3017240
3017496
3017752
3018008
3018264
3018520
3018776
3019032
3019288
3019544
3019800
3020056
3020312
3020568
3020824
3021080
3021336
3021592
3021848
3022104
3022360
3022616
3014681
3014937
3015193
3015449
3015705
3015961
3016217
3016473
3016729
3016985
3017241
3017497
3017753
3018009
3018265
3018521
3018777
3019033
3019289
3019545
3019801
3020057
3020313
3020569
3020825
3021081
3021337
3021593
3021849
3022105
3022361
3022617
3014682
3014938
3015194
3015450
3015706
3015962
3016218
3016474
3016730
3016986
3017242
3017498
3017754
3018010
3018266
3018522
3018778
3019034
3019290
3019546
3019802
3020058
3020314
3020570
3020826
3021082
3021338
3021594
3021850
3022106
3022362
3022618
3014683
3014939
3015195
3015451
3015707
3015963
3016219
3016475
3016731
3016987
3017243
3017499
3017755
3018011
3018267
3018523
3018779
3019035
3019291
3019547
3019803
3020059
3020315
3020571
3020827
3021083
3021339
3021595
3021851
3022107
3022363
3022619
3014684
3014940
3015196
3015452
3015708
3015964
3016220
3016476
3016732
3016988
3017244
3017500
3017756
3018012
3018268
3018524
3018780
3019036
3019292
3019548
3019804
3020060
3020316
3020572
3020828
3021084
3021340
3021596
3021852
3022108
3022364
3022620
3014685
3014941
3015197
3015453
3015709
3015965
3016221
3016477
3016733
3016989
3017245
3017501
3017757
3018013
3018269
3018525
3018781
3019037
3019293
3019549
3019805
3020061
3020317
3020573
3020829
3021085
3021341
3021597
3021853
3022109
3022365
3022621
3014686
3014942
3015198
3015454
3015710
3015966
3016222
3016478
3016734
3016990
3017246
3017502
3017758
3018014
3018270
3018526
3018782
3019038
3019294
3019550
3019806
3020062
3020318
3020574
3020830
3021086
3021342
3021598
3021854
3022110
3022366
3022622
3014687
3014943
3015199
3015455
3015711
3015967
3016223
3016479
3016735
3016991
3017247
3017503
3017759
3018015
3018271
3018527
3018783
3019039
3019295
3019551
3019807
3020063
3020319
3020575
3020831
3021087
3021343
3021599
3021855
3022111
3022367
3022623
3014688
3014944
3015200
3015456
3015712
3015968
3016224
3016480
3016736
3016992
3017248
3017504
3017760
3018016
3018272
3018528
3018784
3019040
3019296
3019552
3019808
3020064
3020320
3020576
3020832
3021088
3021344
3021600
3021856
3022112
3022368
3022624
3014689
3014945
3015201
3015457
3015713
3015969
3016225
3016481
3016737
3016993
3017249
3017505
3017761
3018017
3018273
3018529
3018785
3019041
3019297
3019553
3019809
3020065
3020321
3020577
3020833
3021089
3021345
3021601
3021857
3022113
3022369
3022625
3014690
3014946
3015202
3015458
3015714
3015970
3016226
3016482
3016738
3016994
3017250
3017506
3017762
3018018
3018274
3018530
3018786
3019042
3019298
3019554
3019810
3020066
3020322
3020578
3020834
3021090
3021346
3021602
3021858
3022114
3022370
3022626
3014691
3014947
3015203
3015459
3015715
3015971
3016227
3016483
3016739
3016995
3017251
3017507
3017763
3018019
3018275
3018531
3018787
3019043
3019299
3019555
3019811
3020067
3020323
3020579
3020835
3021091
3021347
3021603
3021859
3022115
3022371
3022627
3014692
3014948
3015204
3015460
3015716
3015972
3016228
3016484
3016740
3016996
3017252
3017508
3017764
3018020
3018276
3018532
3018788
3019044
3019300
3019556
3019812
3020068
3020324
3020580
3020836
3021092
3021348
3021604
3021860
3022116
3022372
3022628
3014693
3014949
3015205
3015461
3015717
3015973
3016229
3016485
3016741
3016997
3017253
3017509
3017765
3018021
3018277
3018533
3018789
3019045
3019301
3019557
3019813
3020069
3020325
3020581
3020837
3021093
3021349
3021605
3021861
3022117
3022373
3022629
3014694
3014950
3015206
3015462
3015718
3015974
3016230
3016486
3016742
3016998
3017254
3017510
3017766
3018022
3018278
3018534
3018790
3019046
3019302
3019558
3019814
3020070
3020326
3020582
3020838
3021094
3021350
3021606
3021862
3022118
3022374
3022630
3014695
3014951
3015207
3015463
3015719
3015975
3016231
3016487
3016743
3016999
3017255
3017511
3017767
3018023
3018279
3018535
3018791
3019047
3019303
3019559
3019815
3020071
3020327
3020583
3020839
3021095
3021351
3021607
3021863
3022119
3022375
3022631
3014696
3014952
3015208
3015464
3015720
3015976
3016232
3016488
3016744
3017000
3017256
3017512
3017768
3018024
3018280
3018536
3018792
3019048
3019304
3019560
3019816
3020072
3020328
3020584
3020840
3021096
3021352
3021608
3021864
3022120
3022376
3022632
3014697
3014953
3015209
3015465
3015721
3015977
3016233
3016489
3016745
3017001
3017257
3017513
3017769
3018025
3018281
3018537
3018793
3019049
3019305
3019561
3019817
3020073
3020329
3020585
3020841
3021097
3021353
3021609
3021865
3022121
3022377
3022633
3014698
3014954
3015210
3015466
3015722
3015978
3016234
3016490
3016746
3017002
3017258
3017514
3017770
3018026
3018282
3018538
3018794
3019050
3019306
3019562
3019818
3020074
3020330
3020586
3020842
3021098
3021354
3021610
3021866
3022122
3022378
3022634
3014699
3014955
3015211
3015467
3015723
3015979
3016235
3016491
3016747
3017003
3017259
3017515
3017771
3018027
3018283
3018539
3018795
3019051
3019307
3019563
3019819
3020075
3020331
3020587
3020843
3021099
3021355
3021611
3021867
3022123
3022379
3022635
3014700
3014956
3015212
3015468
3015724
3015980
3016236
3016492
3016748
3017004
3017260
3017516
3017772
3018028
3018284
3018540
3018796
3019052
3019308
3019564
3019820
3020076
3020332
3020588
3020844
3021100
3021356
3021612
3021868
3022124
3022380
3022636
3014701
3014957
3015213
3015469
3015725
3015981
3016237
3016493
3016749
3017005
3017261
3017517
3017773
3018029
3018285
3018541
3018797
3019053
3019309
3019565
3019821
3020077
3020333
3020589
3020845
3021101
3021357
3021613
3021869
3022125
3022381
3022637
3014702
3014958
3015214
3015470
3015726
3015982
3016238
3016494
3016750
3017006
3017262
3017518
3017774
3018030
3018286
3018542
3018798
3019054
3019310
3019566
3019822
3020078
3020334
3020590
3020846
3021102
3021358
3021614
3021870
3022126
3022382
3022638
3014703
3014959
3015215
3015471
3015727
3015983
3016239
3016495
3016751
3017007
3017263
3017519
3017775
3018031
3018287
3018543
3018799
3019055
3019311
3019567
3019823
3020079
3020335
3020591
3020847
3021103
3021359
3021615
3021871
3022127
3022383
3022639
3014704
3014960
3015216
3015472
3015728
3015984
3016240
3016496
3016752
3017008
3017264
3017520
3017776
3018032
3018288
3018544
3018800
3019056
3019312
3019568
3019824
3020080
3020336
3020592
3020848
3021104
3021360
3021616
3021872
3022128
3022384
3022640
3014705
3014961
3015217
3015473
3015729
3015985
3016241
3016497
3016753
3017009
3017265
3017521
3017777
3018033
3018289
3018545
3018801
3019057
3019313
3019569
3019825
3020081
3020337
3020593
3020849
3021105
3021361
3021617
3021873
3022129
3022385
3022641
3014706
3014962
3015218
3015474
3015730
3015986
3016242
3016498
3016754
3017010
3017266
3017522
3017778
3018034
3018290
3018546
3018802
3019058
3019314
3019570
3019826
3020082
3020338
3020594
3020850
3021106
3021362
3021618
3021874
3022130
3022386
3022642
3014707
3014963
3015219
3015475
3015731
3015987
3016243
3016499
3016755
3017011
3017267
3017523
3017779
3018035
3018291
3018547
3018803
3019059
3019315
3019571
3019827
3020083
3020339
3020595
3020851
3021107
3021363
3021619
3021875
3022131
3022387
3022643
3014708
3014964
3015220
3015476
3015732
3015988
3016244
3016500
3016756
3017012
3017268
3017524
3017780
3018036
3018292
3018548
3018804
3019060
3019316
3019572
3019828
3020084
3020340
3020596
3020852
3021108
3021364
3021620
3021876
3022132
3022388
3022644
3014709
3014965
3015221
3015477
3015733
3015989
3016245
3016501
3016757
3017013
3017269
3017525
3017781
3018037
3018293
3018549
3018805
3019061
3019317
3019573
3019829
3020085
3020341
3020597
3020853
3021109
3021365
3021621
3021877
3022133
3022389
3022645
3014710
3014966
3015222
3015478
3015734
3015990
3016246
3016502
3016758
3017014
3017270
3017526
3017782
3018038
3018294
3018550
3018806
3019062
3019318
3019574
3019830
3020086
3020342
3020598
3020854
3021110
3021366
3021622
3021878
3022134
3022390
3022646
3014711
3014967
3015223
3015479
3015735
3015991
3016247
3016503
3016759
3017015
3017271
3017527
3017783
3018039
3018295
3018551
3018807
3019063
3019319
3019575
3019831
3020087
3020343
3020599
3020855
3021111
3021367
3021623
3021879
3022135
3022391
3022647
3014712
3014968
3015224
3015480
3015736
3015992
3016248
3016504
3016760
3017016
3017272
3017528
3017784
3018040
3018296
3018552
3018808
3019064
3019320
3019576
3019832
3020088
3020344
3020600
3020856
3021112
3021368
3021624
3021880
3022136
3022392
3022648
3014713
3014969
3015225
3015481
3015737
3015993
3016249
3016505
3016761
3017017
3017273
3017529
3017785
3018041
3018297
3018553
3018809
3019065
3019321
3019577
3019833
3020089
3020345
3020601
3020857
3021113
3021369
3021625
3021881
3022137
3022393
3022649
3014714
3014970
3015226
3015482
3015738
3015994
3016250
3016506
3016762
3017018
3017274
3017530
3017786
3018042
3018298
3018554
3018810
3019066
3019322
3019578
3019834
3020090
3020346
3020602
3020858
3021114
3021370
3021626
3021882
3022138
3022394
3022650
3014715
3014971
3015227
3015483
3015739
3015995
3016251
3016507
3016763
3017019
3017275
3017531
3017787
3018043
3018299
3018555
3018811
3019067
3019323
3019579
3019835
3020091
3020347
3020603
3020859
3021115
3021371
3021627
3021883
3022139
3022395
3022651
3014716
3014972
3015228
3015484
3015740
3015996
3016252
3016508
3016764
3017020
3017276
3017532
3017788
3018044
3018300
3018556
3018812
3019068
3019324
3019580
3019836
3020092
3020348
3020604
3020860
3021116
3021372
3021628
3021884
3022140
3022396
3022652
3014717
3014973
3015229
3015485
3015741
3015997
3016253
3016509
3016765
3017021
3017277
3017533
3017789
3018045
3018301
3018557
3018813
3019069
3019325
3019581
3019837
3020093
3020349
3020605
3020861
3021117
3021373
3021629
3021885
3022141
3022397
3022653
3014718
3014974
3015230
3015486
3015742
3015998
3016254
3016510
3016766
3017022
3017278
3017534
3017790
3018046
3018302
3018558
3018814
3019070
3019326
3019582
3019838
3020094
3020350
3020606
3020862
3021118
3021374
3021630
3021886
3022142
3022398
3022654
3014719
3014975
3015231
3015487
3015743
3015999
3016255
3016511
3016767
3017023
3017279
3017535
3017791
3018047
3018303
3018559
3018815
3019071
3019327
3019583
3019839
3020095
3020351
3020607
3020863
3021119
3021375
3021631
3021887
3022143
3022399
3022655
3014720
3014976
3015232
3015488
3015744
3016000
3016256
3016512
3016768
3017024
3017280
3017536
3017792
3018048
3018304
3018560
3018816
3019072
3019328
3019584
3019840
3020096
3020352
3020608
3020864
3021120
3021376
3021632
3021888
3022144
3022400
3022656
3014721
3014977
3015233
3015489
3015745
3016001
3016257
3016513
3016769
3017025
3017281
3017537
3017793
3018049
3018305
3018561
3018817
3019073
3019329
3019585
3019841
3020097
3020353
3020609
3020865
3021121
3021377
3021633
3021889
3022145
3022401
3022657
3014722
3014978
3015234
3015490
3015746
3016002
3016258
3016514
3016770
3017026
3017282
3017538
3017794
3018050
3018306
3018562
3018818
3019074
3019330
3019586
3019842
3020098
3020354
3020610
3020866
3021122
3021378
3021634
3021890
3022146
3022402
3022658
3014723
3014979
3015235
3015491
3015747
3016003
3016259
3016515
3016771
3017027
3017283
3017539
3017795
3018051
3018307
3018563
3018819
3019075
3019331
3019587
3019843
3020099
3020355
3020611
3020867
3021123
3021379
3021635
3021891
3022147
3022403
3022659
3014724
3014980
3015236
3015492
3015748
3016004
3016260
3016516
3016772
3017028
3017284
3017540
3017796
3018052
3018308
3018564
3018820
3019076
3019332
3019588
3019844
3020100
3020356
3020612
3020868
3021124
3021380
3021636
3021892
3022148
3022404
3022660
3014725
3014981
3015237
3015493
3015749
3016005
3016261
3016517
3016773
3017029
3017285
3017541
3017797
3018053
3018309
3018565
3018821
3019077
3019333
3019589
3019845
3020101
3020357
3020613
3020869
3021125
3021381
3021637
3021893
3022149
3022405
3022661
3014726
3014982
3015238
3015494
3015750
3016006
3016262
3016518
3016774
3017030
3017286
3017542
3017798
3018054
3018310
3018566
3018822
3019078
3019334
3019590
3019846
3020102
3020358
3020614
3020870
3021126
3021382
3021638
3021894
3022150
3022406
3022662
3014727
3014983
3015239
3015495
3015751
3016007
3016263
3016519
3016775
3017031
3017287
3017543
3017799
3018055
3018311
3018567
3018823
3019079
3019335
3019591
3019847
3020103
3020359
3020615
3020871
3021127
3021383
3021639
3021895
3022151
3022407
3022663
3014728
3014984
3015240
3015496
3015752
3016008
3016264
3016520
3016776
3017032
3017288
3017544
3017800
3018056
3018312
3018568
3018824
3019080
3019336
3019592
3019848
3020104
3020360
3020616
3020872
3021128
3021384
3021640
3021896
3022152
3022408
3022664
3014729
3014985
3015241
3015497
3015753
3016009
3016265
3016521
3016777
3017033
3017289
3017545
3017801
3018057
3018313
3018569
3018825
3019081
3019337
3019593
3019849
3020105
3020361
3020617
3020873
3021129
3021385
3021641
3021897
3022153
3022409
3022665
3014730
3014986
3015242
3015498
3015754
3016010
3016266
3016522
3016778
3017034
3017290
3017546
3017802
3018058
3018314
3018570
3018826
3019082
3019338
3019594
3019850
3020106
3020362
3020618
3020874
3021130
3021386
3021642
3021898
3022154
3022410
3022666
3014731
3014987
3015243
3015499
3015755
3016011
3016267
3016523
3016779
3017035
3017291
3017547
3017803
3018059
3018315
3018571
3018827
3019083
3019339
3019595
3019851
3020107
3020363
3020619
3020875
3021131
3021387
3021643
3021899
3022155
3022411
3022667
3014732
3014988
3015244
3015500
3015756
3016012
3016268
3016524
3016780
3017036
3017292
3017548
3017804
3018060
3018316
3018572
3018828
3019084
3019340
3019596
3019852
3020108
3020364
3020620
3020876
3021132
3021388
3021644
3021900
3022156
3022412
3022668
3014733
3014989
3015245
3015501
3015757
3016013
3016269
3016525
3016781
3017037
3017293
3017549
3017805
3018061
3018317
3018573
3018829
3019085
3019341
3019597
3019853
3020109
3020365
3020621
3020877
3021133
3021389
3021645
3021901
3022157
3022413
3022669
3014734
3014990
3015246
3015502
3015758
3016014
3016270
3016526
3016782
3017038
3017294
3017550
3017806
3018062
3018318
3018574
3018830
3019086
3019342
3019598
3019854
3020110
3020366
3020622
3020878
3021134
3021390
3021646
3021902
3022158
3022414
3022670
3014735
3014991
3015247
3015503
3015759
3016015
3016271
3016527
3016783
3017039
3017295
3017551
3017807
3018063
3018319
3018575
3018831
3019087
3019343
3019599
3019855
3020111
3020367
3020623
3020879
3021135
3021391
3021647
3021903
3022159
3022415
3022671
3014736
3014992
3015248
3015504
3015760
3016016
3016272
3016528
3016784
3017040
3017296
3017552
3017808
3018064
3018320
3018576
3018832
3019088
3019344
3019600
3019856
3020112
3020368
3020624
3020880
3021136
3021392
3021648
3021904
3022160
3022416
3022672
3014737
3014993
3015249
3015505
3015761
3016017
3016273
3016529
3016785
3017041
3017297
3017553
3017809
3018065
3018321
3018577
3018833
3019089
3019345
3019601
3019857
3020113
3020369
3020625
3020881
3021137
3021393
3021649
3021905
3022161
3022417
3022673
3014738
3014994
3015250
3015506
3015762
3016018
3016274
3016530
3016786
3017042
3017298
3017554
3017810
3018066
3018322
3018578
3018834
3019090
3019346
3019602
3019858
3020114
3020370
3020626
3020882
3021138
3021394
3021650
3021906
3022162
3022418
3022674
3014739
3014995
3015251
3015507
3015763
3016019
3016275
3016531
3016787
3017043
3017299
3017555
3017811
3018067
3018323
3018579
3018835
3019091
3019347
3019603
3019859
3020115
3020371
3020627
3020883
3021139
3021395
3021651
3021907
3022163
3022419
3022675
3014740
3014996
3015252
3015508
3015764
3016020
3016276
3016532
3016788
3017044
3017300
3017556
3017812
3018068
3018324
3018580
3018836
3019092
3019348
3019604
3019860
3020116
3020372
3020628
3020884
3021140
3021396
3021652
3021908
3022164
3022420
3022676
3014741
3014997
3015253
3015509
3015765
3016021
3016277
3016533
3016789
3017045
3017301
3017557
3017813
3018069
3018325
3018581
3018837
3019093
3019349
3019605
3019861
3020117
3020373
3020629
3020885
3021141
3021397
3021653
3021909
3022165
3022421
3022677
3014742
3014998
3015254
3015510
3015766
3016022
3016278
3016534
3016790
3017046
3017302
3017558
3017814
3018070
3018326
3018582
3018838
3019094
3019350
3019606
3019862
3020118
3020374
3020630
3020886
3021142
3021398
3021654
3021910
3022166
3022422
3022678
3014743
3014999
3015255
3015511
3015767
3016023
3016279
3016535
3016791
3017047
3017303
3017559
3017815
3018071
3018327
3018583
3018839
3019095
3019351
3019607
3019863
3020119
3020375
3020631
3020887
3021143
3021399
3021655
3021911
3022167
3022423
3022679
3014744
3015000
3015256
3015512
3015768
3016024
3016280
3016536
3016792
3017048
3017304
3017560
3017816
3018072
3018328
3018584
3018840
3019096
3019352
3019608
3019864
3020120
3020376
3020632
3020888
3021144
3021400
3021656
3021912
3022168
3022424
3022680
3014745
3015001
3015257
3015513
3015769
3016025
3016281
3016537
3016793
3017049
3017305
3017561
3017817
3018073
3018329
3018585
3018841
3019097
3019353
3019609
3019865
3020121
3020377
3020633
3020889
3021145
3021401
3021657
3021913
3022169
3022425
3022681
3014746
3015002
3015258
3015514
3015770
3016026
3016282
3016538
3016794
3017050
3017306
3017562
3017818
3018074
3018330
3018586
3018842
3019098
3019354
3019610
3019866
3020122
3020378
3020634
3020890
3021146
3021402
3021658
3021914
3022170
3022426
3022682
3014747
3015003
3015259
3015515
3015771
3016027
3016283
3016539
3016795
3017051
3017307
3017563
3017819
3018075
3018331
3018587
3018843
3019099
3019355
3019611
3019867
3020123
3020379
3020635
3020891
3021147
3021403
3021659
3021915
3022171
3022427
3022683
3014748
3015004
3015260
3015516
3015772
3016028
3016284
3016540
3016796
3017052
3017308
3017564
3017820
3018076
3018332
3018588
3018844
3019100
3019356
3019612
3019868
3020124
3020380
3020636
3020892
3021148
3021404
3021660
3021916
3022172
3022428
3022684
3014749
3015005
3015261
3015517
3015773
3016029
3016285
3016541
3016797
3017053
3017309
3017565
3017821
3018077
3018333
3018589
3018845
3019101
3019357
3019613
3019869
3020125
3020381
3020637
3020893
3021149
3021405
3021661
3021917
3022173
3022429
3022685
3014750
3015006
3015262
3015518
3015774
3016030
3016286
3016542
3016798
3017054
3017310
3017566
3017822
3018078
3018334
3018590
3018846
3019102
3019358
3019614
3019870
3020126
3020382
3020638
3020894
3021150
3021406
3021662
3021918
3022174
3022430
3022686
3014751
3015007
3015263
3015519
3015775
3016031
3016287
3016543
3016799
3017055
3017311
3017567
3017823
3018079
3018335
3018591
3018847
3019103
3019359
3019615
3019871
3020127
3020383
3020639
3020895
3021151
3021407
3021663
3021919
3022175
3022431
3022687
3424256
3424512
3424768
3425024
3425280
3425536
3425792
3426048
3426304
3426560
3426816
3427072
3427328
3427584
3427840
3428096
3428352
3428608
3428864
3429120
3429376
3429632
3429888
3430144
3430400
3430656
3430912
3431168
3431424
3431680
3431936
3432192
3424257
3424513
3424769
3425025
3425281
3425537
3425793
3426049
3426305
3426561
3426817
3427073
3427329
3427585
3427841
3428097
3428353
3428609
3428865
3429121
3429377
3429633
3429889
3430145
3430401
3430657
3430913
3431169
3431425
3431681
3431937
3432193
3424258
3424514
3424770
3425026
3425282
3425538
3425794
3426050
3426306
3426562
3426818
3427074
3427330
3427586
3427842
3428098
3428354
3428610
3428866
3429122
3429378
3429634
3429890
3430146
3430402
3430658
3430914
3431170
3431426
3431682
3431938
3432194
3424259
3424515
3424771
3425027
3425283
3425539
3425795
3426051
3426307
3426563
3426819
3427075
3427331
3427587
3427843
3428099
3428355
3428611
3428867
3429123
3429379
3429635
3429891
3430147
3430403
3430659
3430915
3431171
3431427
3431683
3431939
3432195
3424260
3424516
3424772
3425028
3425284
3425540
3425796
3426052
3426308
3426564
3426820
3427076
3427332
3427588
3427844
3428100
3428356
3428612
3428868
3429124
3429380
3429636
3429892
3430148
3430404
3430660
3430916
3431172
3431428
3431684
3431940
3432196
3424261
3424517
3424773
3425029
3425285
3425541
3425797
3426053
3426309
3426565
3426821
3427077
3427333
3427589
3427845
3428101
3428357
3428613
3428869
3429125
3429381
3429637
3429893
3430149
3430405
3430661
3430917
3431173
3431429
3431685
3431941
3432197
3424262
3424518
3424774
3425030
3425286
3425542
3425798
3426054
3426310
3426566
3426822
3427078
3427334
3427590
3427846
3428102
3428358
3428614
3428870
3429126
3429382
3429638
3429894
3430150
3430406
3430662
3430918
3431174
3431430
3431686
3431942
3432198
3424263
3424519
3424775
3425031
3425287
3425543
3425799
3426055
3426311
3426567
3426823
3427079
3427335
3427591
3427847
3428103
3428359
3428615
3428871
3429127
3429383
3429639
3429895
3430151
3430407
3430663
3430919
3431175
3431431
3431687
3431943
3432199
3424264
3424520
3424776
3425032
3425288
3425544
3425800
3426056
3426312
3426568
3426824
3427080
3427336
3427592
3427848
3428104
3428360
3428616
3428872
3429128
3429384
3429640
3429896
3430152
3430408
3430664
3430920
3431176
3431432
3431688
3431944
3432200
3424265
3424521
3424777
3425033
3425289
3425545
3425801
3426057
3426313
3426569
3426825
3427081
3427337
3427593
3427849
3428105
3428361
3428617
3428873
3429129
3429385
3429641
3429897
3430153
3430409
3430665
3430921
3431177
3431433
3431689
3431945
3432201
3424266
3424522
3424778
3425034
3425290
3425546
3425802
3426058
3426314
3426570
3426826
3427082
3427338
3427594
3427850
3428106
3428362
3428618
3428874
3429130
3429386
3429642
3429898
3430154
3430410
3430666
3430922
3431178
3431434
3431690
3431946
3432202
3424267
3424523
3424779
3425035
3425291
3425547
3425803
3426059
3426315
3426571
3426827
3427083
3427339
3427595
3427851
3428107
3428363
3428619
3428875
3429131
3429387
3429643
3429899
3430155
3430411
3430667
3430923
3431179
3431435
3431691
3431947
3432203
3424268
3424524
3424780
3425036
3425292
3425548
3425804
3426060
3426316
3426572
3426828
3427084
3427340
3427596
3427852
3428108
3428364
3428620
3428876
3429132
3429388
3429644
3429900
3430156
3430412
3430668
3430924
3431180
3431436
3431692
3431948
3432204
3424269
3424525
3424781
3425037
3425293
3425549
3425805
3426061
3426317
3426573
3426829
3427085
3427341
3427597
3427853
3428109
3428365
3428621
3428877
3429133
3429389
3429645
3429901
3430157
3430413
3430669
3430925
3431181
3431437
3431693
3431949
3432205
3424270
3424526
3424782
3425038
3425294
3425550
3425806
3426062
3426318
3426574
3426830
3427086
3427342
3427598
3427854
3428110
3428366
3428622
3428878
3429134
3429390
3429646
3429902
3430158
3430414
3430670
3430926
3431182
3431438
3431694
3431950
3432206
3424271
3424527
3424783
3425039
3425295
3425551
3425807
3426063
3426319
3426575
3426831
3427087
3427343
3427599
3427855
3428111
3428367
3428623
3428879
3429135
3429391
3429647
3429903
3430159
3430415
3430671
3430927
3431183
3431439
3431695
3431951
3432207
3424272
3424528
3424784
3425040
3425296
3425552
3425808
3426064
3426320
3426576
3426832
3427088
3427344
3427600
3427856
3428112
3428368
3428624
3428880
3429136
3429392
3429648
3429904
3430160
3430416
3430672
3430928
3431184
3431440
3431696
3431952
3432208
3424273
3424529
3424785
3425041
3425297
3425553
3425809
3426065
3426321
3426577
3426833
3427089
3427345
3427601
3427857
3428113
3428369
3428625
3428881
3429137
3429393
3429649
3429905
3430161
3430417
3430673
3430929
3431185
3431441
3431697
3431953
3432209
3424274
3424530
3424786
3425042
3425298
3425554
3425810
3426066
3426322
3426578
3426834
3427090
3427346
3427602
3427858
3428114
3428370
3428626
3428882
3429138
3429394
3429650
3429906
3430162
3430418
3430674
3430930
3431186
3431442
3431698
3431954
3432210
3424275
3424531
3424787
3425043
3425299
3425555
3425811
3426067
3426323
3426579
3426835
3427091
3427347
3427603
3427859
3428115
3428371
3428627
3428883
3429139
3429395
3429651
3429907
3430163
3430419
3430675
3430931
3431187
3431443
3431699
3431955
3432211
3424276
3424532
3424788
3425044
3425300
3425556
3425812
3426068
3426324
3426580
3426836
3427092
3427348
3427604
3427860
3428116
3428372
3428628
3428884
3429140
3429396
3429652
3429908
3430164
3430420
3430676
3430932
3431188
3431444
3431700
3431956
3432212
3424277
3424533
3424789
3425045
3425301
3425557
3425813
3426069
3426325
3426581
3426837
3427093
3427349
3427605
3427861
3428117
3428373
3428629
3428885
3429141
3429397
3429653
3429909
3430165
3430421
3430677
3430933
3431189
3431445
3431701
3431957
3432213
3424278
3424534
3424790
3425046
3425302
3425558
3425814
3426070
3426326
3426582
3426838
3427094
3427350
3427606
3427862
3428118
3428374
3428630
3428886
3429142
3429398
3429654
3429910
3430166
3430422
3430678
3430934
3431190
3431446
3431702
3431958
3432214
3424279
3424535
3424791
3425047
3425303
3425559
3425815
3426071
3426327
3426583
3426839
3427095
3427351
3427607
3427863
3428119
3428375
3428631
3428887
3429143
3429399
3429655
3429911
3430167
3430423
3430679
3430935
3431191
3431447
3431703
3431959
3432215
3424280
3424536
3424792
3425048
3425304
3425560
3425816
3426072
3426328
3426584
3426840
3427096
3427352
3427608
3427864
3428120
3428376
3428632
3428888
3429144
3429400
3429656
3429912
3430168
3430424
3430680
3430936
3431192
3431448
3431704
3431960
3432216
3424281
3424537
3424793
3425049
3425305
3425561
3425817
3426073
3426329
3426585
3426841
3427097
3427353
3427609
3427865
3428121
3428377
3428633
3428889
3429145
3429401
3429657
3429913
3430169
3430425
3430681
3430937
3431193
3431449
3431705
3431961
3432217
3424282
3424538
3424794
3425050
3425306
3425562
3425818
3426074
3426330
3426586
3426842
3427098
3427354
3427610
3427866
3428122
3428378
3428634
3428890
3429146
3429402
3429658
3429914
3430170
3430426
3430682
3430938
3431194
3431450
3431706
3431962
3432218
3424283
3424539
3424795
3425051
3425307
3425563
3425819
3426075
3426331
3426587
3426843
3427099
3427355
3427611
3427867
3428123
3428379
3428635
3428891
3429147
3429403
3429659
3429915
3430171
3430427
3430683
3430939
3431195
3431451
3431707
3431963
3432219
3424284
3424540
3424796
3425052
3425308
3425564
3425820
3426076
3426332
3426588
3426844
3427100
3427356
3427612
3427868
3428124
3428380
3428636
3428892
3429148
3429404
3429660
3429916
3430172
3430428
3430684
3430940
3431196
3431452
3431708
3431964
3432220
3424285
3424541
3424797
3425053
3425309
3425565
3425821
3426077
3426333
3426589
3426845
3427101
3427357
3427613
3427869
3428125
3428381
3428637
3428893
3429149
3429405
3429661
3429917
3430173
3430429
3430685
3430941
3431197
3431453
3431709
3431965
3432221
3424286
3424542
3424798
3425054
3425310
3425566
3425822
3426078
3426334
3426590
3426846
3427102
3427358
3427614
3427870
3428126
3428382
3428638
3428894
3429150
3429406
3429662
3429918
3430174
3430430
3430686
3430942
3431198
3431454
3431710
3431966
3432222
3424287
3424543
3424799
3425055
3425311
3425567
3425823
3426079
3426335
3426591
3426847
3427103
3427359
3427615
3427871
3428127
3428383
3428639
3428895
3429151
3429407
3429663
3429919
3430175
3430431
3430687
3430943
3431199
3431455
3431711
3431967
3432223
3424288
3424544
3424800
3425056
3425312
3425568
3425824
3426080
3426336
3426592
3426848
3427104
3427360
3427616
3427872
3428128
3428384
3428640
3428896
3429152
3429408
3429664
3429920
3430176
3430432
3430688
3430944
3431200
3431456
3431712
3431968
3432224
3424289
3424545
3424801
3425057
3425313
3425569
3425825
3426081
3426337
3426593
3426849
3427105
3427361
3427617
3427873
3428129
3428385
3428641
3428897
3429153
3429409
3429665
3429921
3430177
3430433
3430689
3430945
3431201
3431457
3431713
3431969
3432225
3424290
3424546
3424802
3425058
3425314
3425570
3425826
3426082
3426338
3426594
3426850
3427106
3427362
3427618
3427874
3428130
3428386
3428642
3428898
3429154
3429410
3429666
3429922
3430178
3430434
3430690
3430946
3431202
3431458
3431714
3431970
3432226
3424291
3424547
3424803
3425059
3425315
3425571
3425827
3426083
3426339
3426595
3426851
3427107
3427363
3427619
3427875
3428131
3428387
3428643
3428899
3429155
3429411
3429667
3429923
3430179
3430435
3430691
3430947
3431203
3431459
3431715
3431971
3432227
3424292
3424548
3424804
3425060
3425316
3425572
3425828
3426084
3426340
3426596
3426852
3427108
3427364
3427620
3427876
3428132
3428388
3428644
3428900
3429156
3429412
3429668
3429924
3430180
3430436
3430692
3430948
3431204
3431460
3431716
3431972
3432228
3424293
3424549
3424805
3425061
3425317
3425573
3425829
3426085
3426341
3426597
3426853
3427109
3427365
3427621
3427877
3428133
3428389
3428645
3428901
3429157
3429413
3429669
3429925
3430181
3430437
3430693
3430949
3431205
3431461
3431717
3431973
3432229
3424294
3424550
3424806
3425062
3425318
3425574
3425830
3426086
3426342
3426598
3426854
3427110
3427366
3427622
3427878
3428134
3428390
3428646
3428902
3429158
3429414
3429670
3429926
3430182
3430438
3430694
3430950
3431206
3431462
3431718
3431974
3432230
3424295
3424551
3424807
3425063
3425319
3425575
3425831
3426087
3426343
3426599
3426855
3427111
3427367
3427623
3427879
3428135
3428391
3428647
3428903
3429159
3429415
3429671
3429927
3430183
3430439
3430695
3430951
3431207
3431463
3431719
3431975
3432231
3424296
3424552
3424808
3425064
3425320
3425576
3425832
3426088
3426344
3426600
3426856
3427112
3427368
3427624
3427880
3428136
3428392
3428648
3428904
3429160
3429416
3429672
3429928
3430184
3430440
3430696
3430952
3431208
3431464
3431720
3431976
3432232
3424297
3424553
3424809
3425065
3425321
3425577
3425833
3426089
3426345
3426601
3426857
3427113
3427369
3427625
3427881
3428137
3428393
3428649
3428905
3429161
3429417
3429673
3429929
3430185
3430441
3430697
3430953
3431209
3431465
3431721
3431977
3432233
3424298
3424554
3424810
3425066
3425322
3425578
3425834
3426090
3426346
3426602
3426858
3427114
3427370
3427626
3427882
3428138
3428394
3428650
3428906
3429162
3429418
3429674
3429930
3430186
3430442
3430698
3430954
3431210
3431466
3431722
3431978
3432234
3424299
3424555
3424811
3425067
3425323
3425579
3425835
3426091
3426347
3426603
3426859
3427115
3427371
3427627
3427883
3428139
3428395
3428651
3428907
3429163
3429419
3429675
3429931
3430187
3430443
3430699
3430955
3431211
3431467
3431723
3431979
3432235
3424300
3424556
3424812
3425068
3425324
3425580
3425836
3426092
3426348
3426604
3426860
3427116
3427372
3427628
3427884
3428140
3428396
3428652
3428908
3429164
3429420
3429676
3429932
3430188
3430444
3430700
3430956
3431212
3431468
3431724
3431980
3432236
3424301
3424557
3424813
3425069
3425325
3425581
3425837
3426093
3426349
3426605
3426861
3427117
3427373
3427629
3427885
3428141
3428397
3428653
3428909
3429165
3429421
3429677
3429933
3430189
3430445
3430701
3430957
3431213
3431469
3431725
3431981
3432237
3424302
3424558
3424814
3425070
3425326
3425582
3425838
3426094
3426350
3426606
3426862
3427118
3427374
3427630
3427886
3428142
3428398
3428654
3428910
3429166
3429422
3429678
3429934
3430190
3430446
3430702
3430958
3431214
3431470
3431726
3431982
3432238
3424303
3424559
3424815
3425071
3425327
3425583
3425839
3426095
3426351
3426607
3426863
3427119
3427375
3427631
3427887
3428143
3428399
3428655
3428911
3429167
3429423
3429679
3429935
3430191
3430447
3430703
3430959
3431215
3431471
3431727
3431983
3432239
3424304
3424560
3424816
3425072
3425328
3425584
3425840
3426096
3426352
3426608
3426864
3427120
3427376
3427632
3427888
3428144
3428400
3428656
3428912
3429168
3429424
3429680
3429936
3430192
3430448
3430704
3430960
3431216
3431472
3431728
3431984
3432240
3424305
3424561
3424817
3425073
3425329
3425585
3425841
3426097
3426353
3426609
3426865
3427121
3427377
3427633
3427889
3428145
3428401
3428657
3428913
3429169
3429425
3429681
3429937
3430193
3430449
3430705
3430961
3431217
3431473
3431729
3431985
3432241
3424306
3424562
3424818
3425074
3425330
3425586
3425842
3426098
3426354
3426610
3426866
3427122
3427378
3427634
3427890
3428146
3428402
3428658
3428914
3429170
3429426
3429682
3429938
3430194
3430450
3430706
3430962
3431218
3431474
3431730
3431986
3432242
3424307
3424563
3424819
3425075
3425331
3425587
3425843
3426099
3426355
3426611
3426867
3427123
3427379
3427635
3427891
3428147
3428403
3428659
3428915
3429171
3429427
3429683
3429939
3430195
3430451
3430707
3430963
3431219
3431475
3431731
3431987
3432243
3424308
3424564
3424820
3425076
3425332
3425588
3425844
3426100
3426356
3426612
3426868
3427124
3427380
3427636
3427892
3428148
3428404
3428660
3428916
3429172
3429428
3429684
3429940
3430196
3430452
3430708
3430964
3431220
3431476
3431732
3431988
3432244
3424309
3424565
3424821
3425077
3425333
3425589
3425845
3426101
3426357
3426613
3426869
3427125
3427381
3427637
3427893
3428149
3428405
3428661
3428917
3429173
3429429
3429685
3429941
3430197
3430453
3430709
3430965
3431221
3431477
3431733
3431989
3432245
3424310
3424566
3424822
3425078
3425334
3425590
3425846
3426102
3426358
3426614
3426870
3427126
3427382
3427638
3427894
3428150
3428406
3428662
3428918
3429174
3429430
3429686
3429942
3430198
3430454
3430710
3430966
3431222
3431478
3431734
3431990
3432246
3424311
3424567
3424823
3425079
3425335
3425591
3425847
3426103
3426359
3426615
3426871
3427127
3427383
3427639
3427895
3428151
3428407
3428663
3428919
3429175
3429431
3429687
3429943
3430199
3430455
3430711
3430967
3431223
3431479
3431735
3431991
3432247
3424312
3424568
3424824
3425080
3425336
3425592
3425848
3426104
3426360
3426616
3426872
3427128
3427384
3427640
3427896
3428152
3428408
3428664
3428920
3429176
3429432
3429688
3429944
3430200
3430456
3430712
3430968
3431224
3431480
3431736
3431992
3432248
3424313
3424569
3424825
3425081
3425337
3425593
3425849
3426105
3426361
3426617
3426873
3427129
3427385
3427641
3427897
3428153
3428409
3428665
3428921
3429177
3429433
3429689
3429945
3430201
3430457
3430713
3430969
3431225
3431481
3431737
3431993
3432249
3424314
3424570
3424826
3425082
3425338
3425594
3425850
3426106
3426362
3426618
3426874
3427130
3427386
3427642
3427898
3428154
3428410
3428666
3428922
3429178
3429434
3429690
3429946
3430202
3430458
3430714
3430970
3431226
3431482
3431738
3431994
3432250
3424315
3424571
3424827
3425083
3425339
3425595
3425851
3426107
3426363
3426619
3426875
3427131
3427387
3427643
3427899
3428155
3428411
3428667
3428923
3429179
3429435
3429691
3429947
3430203
3430459
3430715
3430971
3431227
3431483
3431739
3431995
3432251
3424316
3424572
3424828
3425084
3425340
3425596
3425852
3426108
3426364
3426620
3426876
3427132
3427388
3427644
3427900
3428156
3428412
3428668
3428924
3429180
3429436
3429692
3429948
3430204
3430460
3430716
3430972
3431228
3431484
3431740
3431996
3432252
3424317
3424573
3424829
3425085
3425341
3425597
3425853
3426109
3426365
3426621
3426877
3427133
3427389
3427645
3427901
3428157
3428413
3428669
3428925
3429181
3429437
3429693
3429949
3430205
3430461
3430717
3430973
3431229
3431485
3431741
3431997
3432253
3424318
3424574
3424830
3425086
3425342
3425598
3425854
3426110
3426366
3426622
3426878
3427134
3427390
3427646
3427902
3428158
3428414
3428670
3428926
3429182
3429438
3429694
3429950
3430206
3430462
3430718
3430974
3431230
3431486
3431742
3431998
3432254
3424319
3424575
3424831
3425087
3425343
3425599
3425855
3426111
3426367
3426623
3426879
3427135
3427391
3427647
3427903
3428159
3428415
3428671
3428927
3429183
3429439
3429695
3429951
3430207
3430463
3430719
3430975
3431231
3431487
3431743
3431999
3432255
3424320
3424576
3424832
3425088
3425344
3425600
3425856
3426112
3426368
3426624
3426880
3427136
3427392
3427648
3427904
3428160
3428416
3428672
3428928
3429184
3429440
3429696
3429952
3430208
3430464
3430720
3430976
3431232
3431488
3431744
3432000
3432256
3424321
3424577
3424833
3425089
3425345
3425601
3425857
3426113
3426369
3426625
3426881
3427137
3427393
3427649
3427905
3428161
3428417
3428673
3428929
3429185
3429441
3429697
3429953
3430209
3430465
3430721
3430977
3431233
3431489
3431745
3432001
3432257
3424322
3424578
3424834
3425090
3425346
3425602
3425858
3426114
3426370
3426626
3426882
3427138
3427394
3427650
3427906
3428162
3428418
3428674
3428930
3429186
3429442
3429698
3429954
3430210
3430466
3430722
3430978
3431234
3431490
3431746
3432002
3432258
3424323
3424579
3424835
3425091
3425347
3425603
3425859
3426115
3426371
3426627
3426883
3427139
3427395
3427651
3427907
3428163
3428419
3428675
3428931
3429187
3429443
3429699
3429955
3430211
3430467
3430723
3430979
3431235
3431491
3431747
3432003
3432259
3424324
3424580
3424836
3425092
3425348
3425604
3425860
3426116
3426372
3426628
3426884
3427140
3427396
3427652
3427908
3428164
3428420
3428676
3428932
3429188
3429444
3429700
3429956
3430212
3430468
3430724
3430980
3431236
3431492
3431748
3432004
3432260
3424325
3424581
3424837
3425093
3425349
3425605
3425861
3426117
3426373
3426629
3426885
3427141
3427397
3427653
3427909
3428165
3428421
3428677
3428933
3429189
3429445
3429701
3429957
3430213
3430469
3430725
3430981
3431237
3431493
3431749
3432005
3432261
3424326
3424582
3424838
3425094
3425350
3425606
3425862
3426118
3426374
3426630
3426886
3427142
3427398
3427654
3427910
3428166
3428422
3428678
3428934
3429190
3429446
3429702
3429958
3430214
3430470
3430726
3430982
3431238
3431494
3431750
3432006
3432262
3424327
3424583
3424839
3425095
3425351
3425607
3425863
3426119
3426375
3426631
3426887
3427143
3427399
3427655
3427911
3428167
3428423
3428679
3428935
3429191
3429447
3429703
3429959
3430215
3430471
3430727
3430983
3431239
3431495
3431751
3432007
3432263
3424328
3424584
3424840
3425096
3425352
3425608
3425864
3426120
3426376
3426632
3426888
3427144
3427400
3427656
3427912
3428168
3428424
3428680
3428936
3429192
3429448
3429704
3429960
3430216
3430472
3430728
3430984
3431240
3431496
3431752
3432008
3432264
3424329
3424585
3424841
3425097
3425353
3425609
3425865
3426121
3426377
3426633
3426889
3427145
3427401
3427657
3427913
3428169
3428425
3428681
3428937
3429193
3429449
3429705
3429961
3430217
3430473
3430729
3430985
3431241
3431497
3431753
3432009
3432265
3424330
3424586
3424842
3425098
3425354
3425610
3425866
3426122
3426378
3426634
3426890
3427146
3427402
3427658
3427914
3428170
3428426
3428682
3428938
3429194
3429450
3429706
3429962
3430218
3430474
3430730
3430986
3431242
3431498
3431754
3432010
3432266
3424331
3424587
3424843
3425099
3425355
3425611
3425867
3426123
3426379
3426635
3426891
3427147
3427403
3427659
3427915
3428171
3428427
3428683
3428939
3429195
3429451
3429707
3429963
3430219
3430475
3430731
3430987
3431243
3431499
3431755
3432011
3432267
3424332
3424588
3424844
3425100
3425356
3425612
3425868
3426124
3426380
3426636
3426892
3427148
3427404
3427660
3427916
3428172
3428428
3428684
3428940
3429196
3429452
3429708
3429964
3430220
3430476
3430732
3430988
3431244
3431500
3431756
3432012
3432268
3424333
3424589
3424845
3425101
3425357
3425613
3425869
3426125
3426381
3426637
3426893
3427149
3427405
3427661
3427917
3428173
3428429
3428685
3428941
3429197
3429453
3429709
3429965
3430221
3430477
3430733
3430989
3431245
3431501
3431757
3432013
3432269
3424334
3424590
3424846
3425102
3425358
3425614
3425870
3426126
3426382
3426638
3426894
3427150
3427406
3427662
3427918
3428174
3428430
3428686
3428942
3429198
3429454
3429710
3429966
3430222
3430478
3430734
3430990
3431246
3431502
3431758
3432014
3432270
3424335
3424591
3424847
3425103
3425359
3425615
3425871
3426127
3426383
3426639
3426895
3427151
3427407
3427663
3427919
3428175
3428431
3428687
3428943
3429199
3429455
3429711
3429967
3430223
3430479
3430735
3430991
3431247
3431503
3431759
3432015
3432271
3424336
3424592
3424848
3425104
3425360
3425616
3425872
3426128
3426384
3426640
3426896
3427152
3427408
3427664
3427920
3428176
3428432
3428688
3428944
3429200
3429456
3429712
3429968
3430224
3430480
3430736
3430992
3431248
3431504
3431760
3432016
3432272
3424337
3424593
3424849
3425105
3425361
3425617
3425873
3426129
3426385
3426641
3426897
3427153
3427409
3427665
3427921
3428177
3428433
3428689
3428945
3429201
3429457
3429713
3429969
3430225
3430481
3430737
3430993
3431249
3431505
3431761
3432017
3432273
3424338
3424594
3424850
3425106
3425362
3425618
3425874
3426130
3426386
3426642
3426898
3427154
3427410
3427666
3427922
3428178
3428434
3428690
3428946
3429202
3429458
3429714
3429970
3430226
3430482
3430738
3430994
3431250
3431506
3431762
3432018
3432274
3424339
3424595
3424851
3425107
3425363
3425619
3425875
3426131
3426387
3426643
3426899
3427155
3427411
3427667
3427923
3428179
3428435
3428691
3428947
3429203
3429459
3429715
3429971
3430227
3430483
3430739
3430995
3431251
3431507
3431763
3432019
3432275
3424340
3424596
3424852
3425108
3425364
3425620
3425876
3426132
3426388
3426644
3426900
3427156
3427412
3427668
3427924
3428180
3428436
3428692
3428948
3429204
3429460
3429716
3429972
3430228
3430484
3430740
3430996
3431252
3431508
3431764
3432020
3432276
3424341
3424597
3424853
3425109
3425365
3425621
3425877
3426133
3426389
3426645
3426901
3427157
3427413
3427669
3427925
3428181
3428437
3428693
3428949
3429205
3429461
3429717
3429973
3430229
3430485
3430741
3430997
3431253
3431509
3431765
3432021
3432277
3424342
3424598
3424854
3425110
3425366
3425622
3425878
3426134
3426390
3426646
3426902
3427158
3427414
3427670
3427926
3428182
3428438
3428694
3428950
3429206
3429462
3429718
3429974
3430230
3430486
3430742
3430998
3431254
3431510
3431766
3432022
3432278
3424343
3424599
3424855
3425111
3425367
3425623
3425879
3426135
3426391
3426647
3426903
3427159
3427415
3427671
3427927
3428183
3428439
3428695
3428951
3429207
3429463
3429719
3429975
3430231
3430487
3430743
3430999
3431255
3431511
3431767
3432023
3432279
3424344
3424600
3424856
3425112
3425368
3425624
3425880
3426136
3426392
3426648
3426904
3427160
3427416
3427672
3427928
3428184
3428440
3428696
3428952
3429208
3429464
3429720
3429976
3430232
3430488
3430744
3431000
3431256
3431512
3431768
3432024
3432280
3424345
3424601
3424857
3425113
3425369
3425625
3425881
3426137
3426393
3426649
3426905
3427161
3427417
3427673
3427929
3428185
3428441
3428697
3428953
3429209
3429465
3429721
3429977
3430233
3430489
3430745
3431001
3431257
3431513
3431769
3432025
3432281
3424346
3424602
3424858
3425114
3425370
3425626
3425882
3426138
3426394
3426650
3426906
3427162
3427418
3427674
3427930
3428186
3428442
3428698
3428954
3429210
3429466
3429722
3429978
3430234
3430490
3430746
3431002
3431258
3431514
3431770
3432026
3432282
3424347
3424603
3424859
3425115
3425371
3425627
3425883
3426139
3426395
3426651
3426907
3427163
3427419
3427675
3427931
3428187
3428443
3428699
3428955
3429211
3429467
3429723
3429979
3430235
3430491
3430747
3431003
3431259
3431515
3431771
3432027
3432283
3424348
3424604
3424860
3425116
3425372
3425628
3425884
3426140
3426396
3426652
3426908
3427164
3427420
3427676
3427932
3428188
3428444
3428700
3428956
3429212
3429468
3429724
3429980
3430236
3430492
3430748
3431004
3431260
3431516
3431772
3432028
3432284
3424349
3424605
3424861
3425117
3425373
3425629
3425885
3426141
3426397
3426653
3426909
3427165
3427421
3427677
3427933
3428189
3428445
3428701
3428957
3429213
3429469
3429725
3429981
3430237
3430493
3430749
3431005
3431261
3431517
3431773
3432029
3432285
3424350
3424606
3424862
3425118
3425374
3425630
3425886
3426142
3426398
3426654
3426910
3427166
3427422
3427678
3427934
3428190
3428446
3428702
3428958
3429214
3429470
3429726
3429982
3430238
3430494
3430750
3431006
3431262
3431518
3431774
3432030
3432286
3424351
3424607
3424863
3425119
3425375
3425631
3425887
3426143
3426399
3426655
3426911
3427167
3427423
3427679
3427935
3428191
3428447
3428703
3428959
3429215
3429471
3429727
3429983
3430239
3430495
3430751
3431007
3431263
3431519
3431775
3432031
3432287
