1128231
1129770
1255206
1259564
1387567
1522735
1584160
1583394
1584162
1583139
1583651
1583907
1584419
1583396
1584676
1583398
1583654
1583911
1585707
1589039
1589040
1653808
1654326
1779751
1785401
1846843
3029039
3029040
3090737
3090738
3090740
3090997
3090742
3090998
3091254
3092022
3092534
3091255
3091511
3092535
3358256
