0 0 1.26315786304 0.625 1.26666665077
0 1 0.790754387035 0.897793650627 1.40858113766
0 2 1.09917356996 0.609022557735 1.49382710457
1 0 0.914893579893 0.767441868782 1.42424237728
1 1 0.68200159301 0.927666604519 1.58060264587
1 2 0.744827583758 0.768518507481 1.74698793888
2 0 0.77777778808 0.755102038383 1.7027027607
2 1 0.712405963156 0.923208296299 1.52045214176
2 2 0.723684213932 0.818181812763 1.68888890743
3 0 0.851063864325 0.774999976158 1.51612901688
3 1 0.504237894073 0.93562412262 2.11964488029
3 2 0.670588220247 0.745614051819 2.0
4 0 0.68181816704 0.62222224474 2.35714292526
4 1 0.671089284246 0.927324295044 1.60689711571
4 2 0.760273943427 0.702702701092 1.87179481983
5 0 0.655172405714 0.842105269432 1.8125
5 1 0.608076097658 0.945257365704 1.73977053165
5 2 0.7943925331 0.729411780834 1.72580647469
6 0 1.0 0.0 0.0
6 1 0.597448606442 0.934758067131 1.79060673714
6 2 0.709090921386 0.756410241127 1.86440682411
7 0 0.807692278066 0.619047641754 2.0
7 1 0.653555522989 0.904959201813 1.69078552723
7 2 0.642857131909 0.809523820877 1.92156863213
8 0 0.627906975003 0.777777791023 2.04761910439
8 1 0.673642445456 0.916558682919 1.61960947514
8 2 0.704225373396 0.759999990463 1.86842107773
9 0 0.810810800361 0.833333313465 1.48000001907
9 1 0.696523852262 0.918281078339 1.56346571445
9 2 0.758064537992 0.765957474709 1.72222220898
10 0 0.604938254689 0.755102038383 2.18918919563
10 1 0.647607030767 0.934559166431 1.65227234364
10 2 0.87234044102 0.609756112099 1.87999999523
11 0 0.749999977648 0.809523820877 1.64705884457
11 1 0.65053536545 0.934318482876 1.64525854588
11 2 1.0 0.6875 1.45454549789
12 0 0.770833367792 0.837837815285 1.54838705063
12 1 0.565428431305 0.964428365231 1.83380174637
12 2 0.568181821261 0.959999978542 1.83333337307
13 0 0.829268321617 0.852941155434 1.41379308701
13 1 0.683428571615 0.930717170238 1.57213246822
13 2 1.0434782825 0.625 1.53333330154
14 0 1.09374999389 0.742857158184 1.23076927662
14 1 0.667908859502 0.925185203552 1.61828172207
14 2 0.742857137797 0.884615361691 1.52173912525
15 0 0.699999983311 0.785714268684 1.81818187237
15 1 0.712888727988 0.905811190605 1.54860472679
15 2 0.882352947364 0.699999988079 1.61904764175
16 0 0.710526318018 0.888888895512 1.58333337307
16 1 0.646195832447 0.936518371105 1.65241658688
16 2 0.880000008392 0.727272748947 1.5625
17 0 0.812499969732 0.846153855324 1.45454549789
17 1 0.623620123033 0.949292898178 1.68919456005
17 2 1.0 0.759999990463 1.31578946114
18 0 1.73333334711 0.461538463831 1.25
18 1 0.624147829874 0.857757210732 1.86787641048
18 2 0.874999960884 0.761904776096 1.5
19 0 0.794117669333 0.888888895512 1.41666662693
19 1 0.72445300767 0.90216177702 1.53004908562
19 2 1.25925928706 0.588235318661 1.35000002384
20 0 1.14814814308 0.709677398205 1.22727274895
20 1 0.780654570686 0.804246068001 1.59276652336
20 2 0.874999960884 0.857142865658 1.33333337307
21 0 0.874999960884 0.857142865658 1.33333337307
21 1 0.567472785368 0.961505234241 1.83275043964
21 2 0.862068990323 0.800000011921 1.45000004768
22 0 0.923076889219 0.833333313465 1.29999995232
22 1 0.698635269779 0.897196948528 1.59537100792
22 2 0.874999960884 0.809523820877 1.41176474094
23 0 0.774193572204 0.875 1.47619044781
23 1 0.646393013913 0.944943368435 1.63718426228
23 2 1.18749999115 0.736842095852 1.14285719395
24 0 1.0 0.0 0.0
24 1 0.658194969144 0.910340070724 1.66894412041
24 2 0.78260868754 0.833333313465 1.53333330154
25 0 0.692307705005 0.944444417953 1.52941179276
25 1 0.704957683335 0.931225478649 1.52328836918
25 2 0.894736847719 0.823529422283 1.35714280605
26 0 0.764705893078 0.923076927662 1.41666662693
26 1 0.98760694915 0.75147908926 1.34740757942
26 2 1.05555553109 0.736842095852 1.28571426868
27 0 0.866666673554 0.846153855324 1.36363637447
27 1 0.675120622386 0.906772434711 1.63350450993
27 2 0.78260868754 0.888888895512 1.4375
28 0 0.660000006294 0.969696998596 1.5625
28 1 0.767692623071 0.858170032501 1.51788640022
28 2 0.83333330022 0.75 1.60000002384
29 0 0.837837800046 0.838709652424 1.42307686806
29 1 0.646069221746 0.953827321529 1.62274837494
29 2 0.920000017548 0.739130437374 1.47058820724
30 0 0.899999957085 0.85185188055 1.30434787273
30 1 0.499704714266 0.969944953918 2.06319117546
30 2 0.733333327505 0.818181812763 1.66666662693
31 0 1.04000002975 0.692307710648 1.38888883591
31 1 0.409487111122 0.971319556236 2.51418733597
31 2 0.8 0.850000023842 1.47058820724
32 0 2.66666666667 0.25 1.5
32 1 1.12671578163 0.613373041153 1.44697475433
32 2 0.633333310684 0.947368443012 1.66666662693
33 0 0.540540533574 1.0 1.85000002384
33 1 0.530337527025 0.973479688168 1.93696045876
33 2 0.903225848131 0.75 1.47619044781
34 0 0.615384615385 1.0 1.625
34 1 0.700856130463 0.934389054775 1.52701532841
34 2 0.857142886337 0.958333313465 1.21739125252
35 0 0.749999977648 1.0 1.33333337307
35 1 0.703446385891 0.920484364033 1.54437434673
35 2 0.771428605586 0.925925910473 1.39999997616
36 0 0.935483838591 0.827586233616 1.29166662693
36 1 0.553720201329 0.959700763226 1.88180136681
36 2 1.15789472231 0.772727251053 1.11764705181
37 0 0.818181827049 0.85185188055 1.43478262424
37 1 0.739417240765 0.914755284786 1.47844612598
37 2 0.884615408951 0.869565188885 1.29999995232
38 0 0.966666705079 0.86206895113 1.20000004768
38 1 0.834601743841 0.831607222557 1.44079589844
38 2 1.41666663148 0.588235318661 1.20000004768
39 0 1.30769228371 0.588235318661 1.29999995232
39 1 0.732563301047 0.914772570133 1.4922504425
39 2 2.0 0.346153855324 1.44444441795
40 0 0.857142886337 0.833333313465 1.39999997616
40 1 0.904703979514 0.817889451981 1.35144662857
40 2 1.4285714529 0.699999988079 1.0
41 0 0.735294109913 0.920000016689 1.47826087475
41 1 0.642918669862 0.961082577705 1.61839020252
41 2 2.79999993324 0.142857149243 2.5
42 0 1.46666665501 0.636363625526 1.07142853737
42 1 0.711177366801 0.880495011806 1.59696412086
42 2 5.99999982119 0.166666671634 1.0
43 0 0.904761940714 1.0 1.10526311398
43 1 0.762122530027 0.881590843201 1.48836052418
43 2 2.0 0.5 1.0
44 0 0.909090889387 0.850000023842 1.29411768913
44 1 0.822976529995 0.834927141666 1.45533835888
44 2 0.5 1.0 2.0
45 0 1.4285714529 0.699999988079 1.0
45 1 0.736813526522 0.899914205074 1.50813877583
45 2 2.0 0.5 1.0
46 0 1.38461541001 0.666666686535 1.08333337307
46 1 0.688504272964 0.923777759075 1.57226538658
46 2 1.0 0.0 0.0
47 0 1.33333333333 0.666666686535 1.125
47 1 1.08088493424 0.723681628704 1.27841842175
47 2 1.0 0.0 0.0
48 0 0.749999977648 0.777777791023 1.71428573132
48 1 0.563985342016 0.943908751011 1.87846088409
48 2 2.33333331015 0.285714298487 1.5
49 0 0.882352947364 0.733333349228 1.54545450211
49 1 0.866433754589 0.787120461464 1.46630203724
49 2 1.4999999553 0.666666686535 1.0
50 0 0.818181827049 0.888888895512 1.375
50 1 0.857418771899 0.831531584263 1.40258193016
50 2 1.4999999553 0.666666686535 1.0
51 0 1.0 1.0 1.0
51 1 0.699369171043 0.932342112064 1.53362166882
51 2 0.857142886337 0.666666686535 1.75
52 0 16.0 0.0625 1.0
52 1 0.566199617337 0.933053314686 1.89288389683
52 2 4.33333331181 0.153846159577 1.5
53 0 1.0 0.0 0.0
53 1 1.0 0.0 0.0
53 2 1.0 0.0 0.0
