0 0 0.5 1.0 2.0
0 1 0.793799576349 0.873751163483 1.44178795815
0 2 1.0 0.0 0.0
1 0 1.0 0.0 0.0
1 1 0.703084850357 0.906764149666 1.56854844093
1 2 1.0 0.0 0.0
2 0 1.0 0.0 0.0
2 1 0.726198320013 0.908679902554 1.51542294025
2 2 1.0 0.0 0.0
3 0 1.0 1.0 1.0
3 1 0.541605112619 0.923636376858 1.9990156889
3 2 1.0 0.0 0.0
4 0 1.0 1.0 1.0
4 1 0.692839190117 0.919310986996 1.57001972198
4 2 1.0 0.0 0.0
5 0 1.0 1.0 1.0
5 1 0.604843167848 0.947224736214 1.74543702602
5 2 0.5 1.0 2.0
6 0 1.0 0.0 0.0
6 1 0.589770929831 0.9376693964 1.80828511715
6 2 1.0 0.0 0.0
7 0 2.0 0.5 1.0
7 1 0.638505743014 0.906390666962 1.72790467739
7 2 1.0 0.0 0.0
8 0 1.0 1.0 1.0
8 1 0.692211844381 0.89828979969 1.60821640491
8 2 1.0 1.0 1.0
9 0 1.0 1.0 1.0
9 1 0.711994851737 0.923423409462 1.52097558975
9 2 1.0 0.0 0.0
10 0 1.0 1.0 1.0
10 1 0.671108397431 0.933212995529 1.5967117548
10 2 1.0 0.0 0.0
11 0 0.4 1.0 2.5
11 1 0.664674214784 0.940647482872 1.59942638874
11 2 1.0 0.0 0.0
12 0 1.0 0.5 2.0
12 1 0.576192936186 0.956366896629 1.81471133232
12 2 1.0 0.0 0.0
13 0 0.5 1.0 2.0
13 1 0.67992654278 0.931593179703 1.57874393463
13 2 1.0 0.0 0.0
14 0 1.0 1.0 1.0
14 1 0.702616445126 0.912806510925 1.55920398235
14 2 1.0 0.0 0.0
15 0 1.0 0.0 0.0
15 1 0.828592795222 0.84823846817 1.42279016972
15 2 1.0 0.0 0.0
16 0 2.0 0.5 1.0
16 1 0.627986368563 0.938405811787 1.69691121578
16 2 1.0 0.0 0.0
17 0 1.0 1.0 1.0
17 1 0.618161321484 0.947992682457 1.70644855499
17 2 1.0 0.0 0.0
18 0 0.5 1.0 2.0
18 1 0.600547942381 0.923357665539 1.80335962772
18 2 1.0 0.0 0.0
19 0 1.0 1.0 1.0
19 1 0.719816286817 0.908842325211 1.52858579159
19 2 1.0 0.0 0.0
20 0 2.0 0.5 1.0
20 1 0.675245124871 0.929219603539 1.59375
20 2 1.0 0.0 0.0
21 0 1.0 1.0 1.0
21 1 0.604829866797 0.949183285236 1.74187386036
21 2 1.0 0.0 0.0
22 0 1.0 1.0 1.0
22 1 0.714193959249 0.894784152508 1.56482410431
22 2 1.0 0.0 0.0
23 0 1.0 1.0 1.0
23 1 0.664835147417 0.949494957924 1.58413922787
23 2 1.0 1.0 1.0
24 0 1.0 0.0 0.0
24 1 0.657346830796 0.901357471943 1.68775105476
24 2 0.4 1.0 2.5
25 0 0.666666666667 1.0 1.5
25 1 0.690168201908 0.947516381741 1.52917897701
25 2 0.666666666667 1.0 1.5
26 0 1.0 0.5 2.0
26 1 1.01834861272 0.754054069519 1.30227005482
26 2 0.666666666667 1.0 1.5
27 0 1.0 1.0 1.0
27 1 0.702737932599 0.902597427368 1.57656729221
27 2 0.666666666667 1.0 1.5
28 0 0.5 1.0 2.0
28 1 0.796981116014 0.859848499298 1.45925104618
28 2 0.5 1.0 2.0
29 0 1.0 0.5 2.0
29 1 0.653620348591 0.954091787338 1.60355651379
29 2 0.749999977648 1.0 1.33333337307
30 0 1.33333333333 0.5 1.5
30 1 0.495718386179 0.966410756111 2.08738827705
30 2 4.99999992549 0.20000000298 1.0
31 0 1.4999999553 0.666666686535 1.0
31 1 0.410666650479 0.956400752068 2.54607176781
31 2 1.0 1.0 1.0
32 0 1.33333333333 0.75 1.0
32 1 0.983501400462 0.691519081593 1.47035038471
32 2 1.66666660044 0.600000023842 1.0
33 0 0.749999977648 1.0 1.33333337307
33 1 0.581408435398 0.965116262436 1.78212857246
33 2 0.83333330022 1.0 1.20000004768
34 0 1.0 1.0 1.0
34 1 0.730225960176 0.931334614754 1.47040498257
34 2 1.24999998137 0.800000011921 1.0
35 0 1.0 1.0 1.0
35 1 0.747093045262 0.904669284821 1.47956991196
35 2 0.600000014305 0.833333313465 2.0
36 0 1.4999999553 0.666666686535 1.0
36 1 0.582920108279 0.960302472115 1.78641736507
36 2 0.874999960884 1.0 1.14285719395
37 0 1.0 0.0 0.0
37 1 0.772592597095 0.911792933941 1.41955840588
37 2 1.0 0.875 1.14285719395
38 0 1.0 0.0 0.0
38 1 1.39040209758 0.606343269348 1.1861538887
38 2 0.666666666667 1.0 1.5
39 0 1.0 1.0 1.0
39 1 0.687669394355 0.925123155117 1.57188498974
39 2 0.899999957085 0.833333313465 1.33333337307
40 0 1.33333333333 0.75 1.0
40 1 0.784603432662 0.881070375443 1.44656920433
40 2 0.727272727273 0.875 1.57142853737
41 0 1.0 0.800000011921 1.25
41 1 0.663734777261 0.9571865201 1.57401490211
41 2 6.74999994971 0.148148149252 1.0
42 0 1.4999999553 0.666666686535 1.0
42 1 0.653048005981 0.942403197289 1.62486827374
42 2 1.14285714286 0.75 1.16666662693
43 0 0.624999990687 1.0 1.60000002384
43 1 0.751956172415 0.88865762949 1.49648714066
43 2 0.894736847719 0.882352948189 1.26666665077
44 0 0.83333330022 0.800000011921 1.5
44 1 0.839473699748 0.839080452919 1.41967618465
44 2 1.20000002861 0.833333313465 1.0
45 0 0.8 1.0 1.25
45 1 0.706463886589 0.89881592989 1.57485032082
45 2 1.16666665508 0.714285731316 1.20000004768
46 0 1.0 1.0 1.0
46 1 0.650224194044 0.920689642429 1.67041194439
46 2 3.42857154535 0.166666671634 1.75
47 0 1.0 0.0 0.0
47 1 1.01076553554 0.792899429798 1.24776124954
47 2 6.99999968708 0.142857149243 1.0
48 0 1.0 0.0 0.0
48 1 0.557613157919 0.928659260273 1.93112587929
48 2 0.736842133002 0.857142865658 1.58333337307
49 0 0.749999977648 0.666666686535 2.0
49 1 1.0693069206 0.706018507481 1.32459020615
49 2 1.09090906726 0.75 1.22222220898
50 0 1.0 0.0 0.0
50 1 0.816609020792 0.824858784676 1.48458909988
50 2 0.83333330022 0.800000011921 1.5
51 0 1.0 0.0 0.0
51 1 0.720758717988 0.913742661476 1.51839995384
51 2 0.899999957085 0.888888895512 1.25
52 0 1.0 0.0 0.0
52 1 0.58532421946 0.928571403027 1.83987438679
52 2 4.0 0.25 1.0
53 0 1.0 0.0 0.0
53 1 1.0 0.0 0.0
53 2 1.0 0.0 0.0
