139085
139086
139087
139088
139089
139090
868116
1188136
1188392
1259564
1387567
1522735
1583394
1583651
1584419
1585707
1846843
1910309
2113537
2109954
2110210
2115587
2110980
2111492
2115076
2115588
2117124
2107397
2107398
2111494
2115078
2115334
2115079
2114824
2116872
2118408
2118664
2118920
2307377
2310193
2512385
2512641
2512897
2513153
2513409
2513665
2513921
2514177
2514433
2514689
2512131
2512387
2512643
2512899
2513155
2513411
2513667
2513923
2514179
2514435
2514691
2512133
2512389
2512645
2512901
2513157
2513413
2513669
2513925
2514181
2514437
2514693
2512136
2512392
2512648
2512904
2513160
2513416
2513672
2513928
2514184
2514440
2514696
2512143
2512399
2512655
2512911
2513167
2513423
2513679
2513935
2514191
2514447
2514703
2512144
2512400
2512656
2512912
2513168
2513424
2513680
2513936
2514192
2514448
2514704
2512145
2512401
2512657
2512913
2513169
2513425
2513681
2513937
2514193
2514449
2514705
2512146
2512402
2512658
2512914
2513170
2513426
2513682
2513938
2514194
2514450
2514706
2512147
2512403
2512659
2512915
2513171
2513427
2513683
2513939
2514195
2514451
2514707
2512148
2512404
2512660
2512916
2513172
2513428
2513684
2513940
2514196
2514452
2514708
2512149
2512405
2512661
2512917
2513173
2513429
2513685
2513941
2514197
2514453
2514709
2512150
2512406
2512662
2512918
2513174
2513430
2513686
2513942
2514198
2514454
2514710
2512151
2512407
2512663
2512919
2513175
2513431
2513687
2513943
2514199
2514455
2514711
2512152
2512408
2512664
2512920
2513176
2513432
2513688
2513944
2514200
2514456
2514712
2512153
2512409
2512665
2512921
2513177
2513433
2513689
2513945
2514201
2514457
2514713
2512154
2512410
2512666
2512922
2513178
2513434
2513690
2513946
2514202
2514458
2514714
2512155
2512411
2512667
2512923
2513179
2513435
2513691
2513947
2514203
2514459
2514715
2512156
2512412
2512668
2512924
2513180
2513436
2513692
2513948
2514204
2514460
2514716
2512157
2512413
2512669
2512925
2513181
2513437
2513693
2513949
2514205
2514461
2514717
2512158
2512414
2512670
2512926
2513182
2513438
2513694
2513950
2514206
2514462
2514718
2512159
2512415
2512671
2512927
2513183
2513439
2513695
2513951
2514207
2514463
2514719
2512160
2512416
2512672
2512928
2513184
2513440
2513696
2513952
2514208
2514464
2514720
2512161
2512417
2512673
2512929
2513185
2513441
2513697
2513953
2514209
2514465
2514721
2512162
2512418
2512674
2512930
2513186
2513442
2513698
2513954
2514210
2514466
2514722
2512163
2512419
2512675
2512931
2513187
2513443
2513699
2513955
2514211
2514467
2514723
2512164
2512420
2512676
2512932
2513188
2513444
2513700
2513956
2514212
2514468
2514724
2512165
2512421
2512677
2512933
2513189
2513445
2513701
2513957
2514213
2514469
2514725
2512167
2512423
2512679
2512935
2513191
2513447
2513703
2513959
2514215
2514471
2514727
2512168
2512424
2512680
2512936
2513192
2513448
2513704
2513960
2514216
2514472
2514728
2512169
2512425
2512681
2512937
2513193
2513449
2513705
2513961
2514217
2514473
2514729
2512170
2512426
2512682
2512938
2513194
2513450
2513706
2513962
2514218
2514474
2514730
2512171
2512427
2512683
2512939
2513195
2513451
2513707
2513963
2514219
2514475
2514731
2512172
2512428
2512684
2512940
2513196
2513452
2513708
2513964
2514220
2514476
2514732
2512174
2512430
2512686
2512942
2513198
2513454
2513710
2513966
2514222
2514478
2514734
2512175
2512431
2512687
2512943
2513199
2513455
2513711
2513967
2514223
2514479
2514735
2512176
2512432
2512688
2512944
2513200
2513456
2513712
2513968
2514224
2514480
2512177
2512433
2512689
2512945
2513201
2513457
2513713
2513969
2514225
2514481
2512178
2512434
2512690
2512946
2513202
2513458
2513714
2513970
2514226
2514482
2512179
2512435
2512691
2512947
2513203
2513459
2513715
2513971
2514227
2514483
2512180
2512436
2512692
2512948
2513204
2513460
2513716
2513972
2514228
2514484
2564384
2564385
2564387
2564389
2564399
2643201
2637844
2637859
2637867
2637871
2629680
2628155
2703152
2703408
2703409
2703154
2958359
2961432
2963224
3030312
3029039
3029040
3090737
3090738
3090740
3090485
3090997
3089974
3090742
3090998
3091254
3092022
3092534
3089719
3091255
3092535
3090232
3090233
3091769
