536584
536840
537096
537352
537608
537864
538120
538376
536585
536841
537097
537353
537609
537865
538121
538377
536586
536842
537098
537354
537610
537866
538122
538378
536587
536843
537099
537355
537611
537867
538123
538379
536588
536844
537100
537356
537612
537868
538124
538380
536589
536845
537101
537357
537613
537869
538125
538381
536590
536846
537102
537358
537614
537870
538126
538382
536591
536847
537103
537359
537615
537871
538127
538383
542760
543016
543272
543528
543784
544040
544296
544552
542761
543017
543273
543529
543785
544041
544297
544553
542762
543018
543274
543530
543786
544042
544298
544554
542763
543019
543275
543531
543787
544043
544299
544555
542764
543020
543276
543532
543788
544044
544300
544556
542765
543021
543277
543533
543789
544045
544301
544557
542766
543022
543278
543534
543790
544046
544302
544558
542767
543023
543279
543535
543791
544047
544303
544559
540744
541000
541256
541512
541768
542024
542280
542536
540745
541001
541257
541513
541769
542025
542281
542537
540746
541002
541258
541514
541770
542026
542282
542538
540747
541003
541259
541515
541771
542027
542283
542539
540748
541004
541260
541516
541772
542028
542284
542540
540749
541005
541261
541517
541773
542029
542285
542541
540750
541006
541262
541518
541774
542030
542286
542542
540751
541007
541263
541519
541775
542031
542287
542543
540760
541016
541272
541528
541784
542040
542296
542552
540761
541017
541273
541529
541785
542041
542297
542553
540762
541018
541274
541530
541786
542042
542298
542554
540763
541019
541275
541531
541787
542043
542299
542555
540764
541020
541276
541532
541788
542044
542300
542556
540765
541021
541277
541533
541789
542045
542301
542557
540766
541022
541278
541534
541790
542046
542302
542558
540767
541023
541279
541535
541791
542047
542303
542559
729152
729408
729664
729920
730176
730432
730688
730944
729153
729409
729665
729921
730177
730433
730689
730945
729154
729410
729666
729922
730178
730434
730690
730946
729155
729411
729667
729923
730179
730435
730691
730947
729156
729412
729668
729924
730180
730436
730692
730948
729157
729413
729669
729925
730181
730437
730693
730949
729158
729414
729670
729926
730182
730438
730694
730950
729159
729415
729671
729927
730183
730439
730695
730951
794704
794960
795216
795472
795728
795984
796240
796496
794705
794961
795217
795473
795729
795985
796241
796497
794706
794962
795218
795474
795730
795986
796242
796498
794707
794963
795219
795475
795731
795987
796243
796499
794708
794964
795220
795476
795732
795988
796244
796500
794709
794965
795221
795477
795733
795989
796245
796501
794710
794966
795222
795478
795734
795990
796246
796502
794711
794967
795223
795479
795735
795991
796247
796503
1187888
1188144
1188400
1188656
1188912
1189168
1189424
1189680
1187889
1188145
1188401
1188657
1188913
1189169
1189425
1189681
1187890
1188146
1188402
1188658
1188914
1189170
1189426
1189682
1187891
1188147
1188403
1188659
1188915
1189171
1189427
1189683
1187892
1188148
1188404
1188660
1188916
1189172
1189428
1189684
1187893
1188149
1188405
1188661
1188917
1189173
1189429
1189685
1187894
1188150
1188406
1188662
1188918
1189174
1189430
1189686
1187895
1188151
1188407
1188663
1188919
1189175
1189431
1189687
1323040
1323296
1323552
1323808
1324064
1324320
1324576
1324832
1323041
1323297
1323553
1323809
1324065
1324321
1324577
1324833
1323042
1323298
1323554
1323810
1324066
1324322
1324578
1324834
1323043
1323299
1323555
1323811
1324067
1324323
1324579
1324835
1323044
1323300
1323556
1323812
1324068
1324324
1324580
1324836
1323045
1323301
1323557
1323813
1324069
1324325
1324581
1324837
1323046
1323302
1323558
1323814
1324070
1324326
1324582
1324838
1323047
1323303
1323559
1323815
1324071
1324327
1324583
1324839
1779776
1780032
1780288
1780544
1780800
1781056
1781312
1781568
1779777
1780033
1780289
1780545
1780801
1781057
1781313
1781569
1779778
1780034
1780290
1780546
1780802
1781058
1781314
1781570
1779779
1780035
1780291
1780547
1780803
1781059
1781315
1781571
1779780
1780036
1780292
1780548
1780804
1781060
1781316
1781572
1779781
1780037
1780293
1780549
1780805
1781061
1781317
1781573
1779782
1780038
1780294
1780550
1780806
1781062
1781318
1781574
1779783
1780039
1780295
1780551
1780807
1781063
1781319
1781575
2107440
2107696
2107952
2108208
2108464
2108720
2108976
2109232
2107441
2107697
2107953
2108209
2108465
2108721
2108977
2109233
2107442
2107698
2107954
2108210
2108466
2108722
2108978
2109234
2107443
2107699
2107955
2108211
2108467
2108723
2108979
2109235
2107444
2107700
2107956
2108212
2108468
2108724
2108980
2109236
2107445
2107701
2107957
2108213
2108469
2108725
2108981
2109237
2107446
2107702
2107958
2108214
2108470
2108726
2108982
2109238
2107447
2107703
2107959
2108215
2108471
2108727
2108983
2109239
3024952
3025208
3025464
3025720
3025976
3026232
3026488
3026744
3024953
3025209
3025465
3025721
3025977
3026233
3026489
3026745
3024954
3025210
3025466
3025722
3025978
3026234
3026490
3026746
3024955
3025211
3025467
3025723
3025979
3026235
3026491
3026747
3024956
3025212
3025468
3025724
3025980
3026236
3026492
3026748
3024957
3025213
3025469
3025725
3025981
3026237
3026493
3026749
3024958
3025214
3025470
3025726
3025982
3026238
3026494
3026750
3024959
3025215
3025471
3025727
3025983
3026239
3026495
3026751
