2639912
2640168
2640424
2640680
2640936
2641192
2641448
2641704
2639913
2640169
2640425
2640681
2640937
2641193
2641449
2641705
2639914
2640170
2640426
2640682
2640938
2641194
2641450
2641706
2639915
2640171
2640427
2640683
2640939
2641195
2641451
2641707
2639916
2640172
2640428
2640684
2640940
2641196
2641452
2641708
2639917
2640173
2640429
2640685
2640941
2641197
2641453
2641709
2639918
2640174
2640430
2640686
2640942
2641198
2641454
2641710
2639919
2640175
2640431
2640687
2640943
2641199
2641455
2641711
3342376
3342632
3342888
3343144
3343400
3343656
3343912
3344168
3342377
3342633
3342889
3343145
3343401
3343657
3343913
3344169
3342378
3342634
3342890
3343146
3343402
3343658
3343914
3344170
3342379
3342635
3342891
3343147
3343403
3343659
3343915
3344171
3342380
3342636
3342892
3343148
3343404
3343660
3343916
3344172
3342381
3342637
3342893
3343149
3343405
3343661
3343917
3344173
3342382
3342638
3342894
3343150
3343406
3343662
3343918
3344174
3342383
3342639
3342895
3343151
3343407
3343663
3343919
3344175
