605501
1128231
1129770
1255971
1255206
1259564
1387567
1522735
1583394
1584162
1583651
1583907
1584419
1583396
1584676
1583398
1583654
1583911
1585707
1589039
1589040
1653808
1779751
1846843
2700080
2703152
2703154
2762035
2764349
2764606
2958127
2958383
3030312
3029039
3029040
3090737
3090993
3097137
3097393
3089202
3090738
3097394
3090740
3089205
3090485
3090997
3089462
3090742
3090998
3091254
3092022
3092534
3097654
3089975
3090231
3091255
3092535
3096887
3089208
3089464
3090232
3091256
3096632
3096888
3090233
3091769
3094329
3089982
3089983
3092290
3157569
3220271
3220272
3423549
