605499
605501
799786
863040
1064752
1129770
1255206
1259564
1387567
1522735
1585707
1653808
2506285
2637872
2700080
2703152
2703154
2768681
2762035
2764349
2763070
2764606
3030312
3030314
3030315
3029039
3029040
3090737
3090993
3097137
3097393
3090738
3097394
3090740
3089205
3090485
3090997
3090742
3092022
3092534
3089975
3090231
3091255
3091511
3092535
3097911
3090232
3091256
3096888
3097656
3090233
3094329
3089468
3089983
3157569
3423549
3487022
