140849
140594
601135
1129770
1254434
1254182
1254185
1259564
1387567
1450287
1522735
1583136
1584160
1583394
1584162
1583139
1583651
1583907
1584419
1583396
1584676
1583398
1583654
1583911
1585707
1653808
1846843
1910309
2173466
2307100
2368303
2368304
2563888
2564400
2563640
2629680
2639920
2628155
2703152
2703154
2765851
2766108
2761264
2762035
2764349
2763070
2764606
2762822
2826296
2961432
2963224
2957353
2957355
2957611
2957357
2957613
2957358
2957359
2957615
2958127
2958383
3030312
3029039
3029040
3090737
3097137
3089202
3090738
3090740
3089205
3090485
3090997
3089974
3090742
3092534
3089719
3091255
3092535
3089208
3089464
3090232
3091256
3090233
3091769
3094329
3091258
3089468
3089982
3088959
3089983
3090239
3090240
3090496
3089217
3089730
3092034
3091267
3091523
3089220
3089732
3097668
3092550
