605501
1064752
1129770
1255971
1255206
1387567
1522735
1584160
1583394
1583139
1583907
1583396
1584676
1583398
1583654
1583911
1585707
1589039
1589040
1653808
1719596
1779751
2700080
2764349
3030312
3029039
3029040
3090737
3089202
3090738
3090740
3090485
3090997
3090742
3090998
3091254
3092022
3092534
3091255
3092535
3090232
3090488
3091256
3090233
3091769
3094329
