16405
16661
16917
17173
17429
17685
18197
16407
16663
16919
17175
17431
17687
18199
16408
16664
16920
17176
17432
17688
18200
16409
16665
16921
17177
17433
17689
18201
16410
16666
16922
17178
17434
17690
18202
16411
16667
16923
17179
17435
17691
18203
16412
16668
16924
17180
17436
17692
18204
5632
5888
14080
14336
21504
21760
5727
5983
14175
14431
21599
21855
82185
82441
82697
82953
83721
84489
82187
82443
82699
82955
83723
84491
82189
82445
82701
82957
83725
84493
85005
85261
85517
81944
82200
82456
82712
82968
83736
84504
85016
85272
85528
81945
82201
82457
82713
82969
83737
84505
85017
81946
82202
82458
82714
82970
83738
84506
85018
85274
85530
81947
82203
82459
82715
82971
83739
84507
85019
85275
85531
81948
82204
82460
82716
82972
83740
84508
85020
85276
85532
71168
71424
79616
79872
87040
87296
71263
71519
79711
79967
87135
87391
147473
147729
147985
148241
148497
148753
149265
150801
153361
147474
147730
147986
148242
148498
148754
149266
150802
153362
147475
147731
147987
148243
148499
148755
149267
150803
153363
147476
147732
147988
148244
148500
148756
149268
150804
153364
147477
147733
147989
148245
148501
148757
149269
150805
153365
147478
147734
147990
148246
148502
148758
149270
150806
153366
147479
147735
147991
148247
148503
148759
149271
150807
153367
147480
147736
147992
148248
148504
148760
149272
150808
153368
147481
147737
147993
148249
148505
148761
149273
150809
153369
147482
147738
147994
148250
148506
148762
149274
150810
153370
147483
147739
147995
148251
148507
148763
149275
150811
153371
147484
147740
147996
148252
148508
148764
149276
150812
153372
147486
147742
147998
148254
148510
148766
149278
150814
153374
136704
136960
145152
145408
152576
152832
136799
137055
145247
145503
152671
152927
213262
213518
218126
218894
219150
213009
213265
213521
218129
218897
219153
213010
213266
213522
218130
218898
219154
213013
213269
213525
218133
218901
219157
213015
213271
213527
218135
218903
219159
213016
213272
213528
218136
218904
219160
213017
213273
213529
218137
218905
219161
213274
213530
218138
218906
219162
213019
213275
213531
218139
218907
219163
213276
213532
218140
218908
219164
213277
213533
218141
218909
219165
213278
213534
218142
218910
219166
202240
202496
210688
210944
218112
218368
202335
202591
210783
211039
218207
218463
278545
279057
281361
284433
278546
279058
281362
284434
278548
279060
281364
284436
278549
279061
281365
284437
278550
279062
281366
284438
278551
279063
281367
284439
278552
279064
281368
284440
278553
279065
281369
284441
278554
279066
281370
284442
278555
279067
281371
284443
278556
279068
281372
284444
267776
268032
276224
276480
283648
283904
267871
268127
276319
276575
283743
283999
349185
344084
344340
344596
344852
345108
345364
345876
348180
344085
344341
344597
344853
345109
345365
345877
348181
344086
344342
344598
344854
345110
345366
345878
348182
344087
344343
344599
344855
345111
345367
345879
348183
344088
344344
344600
344856
345112
345368
345880
348184
344089
344345
344601
344857
345113
345369
345881
348185
344090
344346
344602
344858
345114
345370
345882
348186
344091
344347
344603
344859
345115
345371
345883
348187
344092
344348
344604
344860
345116
345372
345884
348188
333312
333568
341760
342016
349184
349440
333407
333663
341855
342111
349279
349535
409352
409353
409354
409355
409356
409357
409358
409359
409360
409361
409362
409363
409364
411412
411668
411924
412180
412436
412948
413716
409365
411413
411669
411925
412181
412437
412949
413717
409366
411414
411670
411926
412182
412438
412950
413718
409367
409368
410904
411416
411672
411928
412184
412440
412952
413720
409369
409370
410906
411418
411674
411930
412186
412442
412954
413722
409371
409372
410908
411420
411676
411932
412188
412444
412956
413724
409373
410909
411421
411677
411933
412189
412445
412957
413725
409374
410910
411422
411678
411934
412190
412446
412958
413726
409375
410911
411423
411679
411935
412191
412447
412959
413727
409376
409377
410915
398848
399104
407296
407552
414720
414976
398943
399199
407391
407647
414815
415071
475406
475662
475918
476174
476942
475151
475407
475663
475919
476175
476943
475158
475414
475670
475926
476182
476950
475159
475415
475671
475927
476183
476951
475160
475416
475672
475928
476184
476952
475161
475417
475673
475929
476185
476953
475162
475418
475674
475930
476186
476954
475163
475419
475675
475931
476187
476955
475164
475420
475676
475932
476188
476956
464384
464640
472832
473088
480256
480512
464479
464735
472927
473183
480351
480607
540688
540944
541200
541456
543760
546576
540689
540945
541201
541457
543761
546577
540690
540946
541202
541458
543762
546578
540692
540948
541204
541460
543764
546580
540695
540951
541207
541463
543767
546583
540696
540952
541208
541464
543768
546584
540697
540953
541209
541465
543769
546585
540698
540954
541210
541466
543770
546586
540699
540955
541211
541467
543771
546587
540700
540956
541212
541468
543772
546588
529920
530176
538368
538624
545792
546048
530015
530271
538463
538719
545887
546143
611328
611584
611329
611585
606225
606481
606737
610833
606228
606484
606740
610836
606229
606485
606741
610837
606230
606486
606742
610838
606231
606487
606743
610839
606232
606488
606744
606233
606489
606745
610841
606234
606490
606746
610842
606235
606491
606747
610843
606236
606492
606748
610844
595456
595712
603904
604160
611328
611584
595551
595807
603999
604255
611423
611679
672013
672269
672525
672781
672014
672270
672526
672782
671767
672023
672279
672535
672791
671768
672024
672280
672536
672792
671769
672025
672281
672537
672793
671770
672026
672282
672538
672794
671771
672027
672283
672539
672795
671772
672028
672284
672540
672796
660992
661248
669440
669696
676864
677120
661087
661343
669535
669791
676959
677215
737290
737546
737291
737547
737292
737548
737293
737549
737294
737550
737299
737555
737300
737556
737302
737558
737303
737559
737304
737560
737305
737561
737306
737562
737307
737563
737308
737564
737310
737566
737311
737567
737312
737568
737313
737569
726528
726784
734976
735232
742400
742656
726623
726879
735071
735327
742495
742751
808448
808960
802830
803086
804622
807950
808974
802831
803087
804623
807951
808975
802832
803088
804624
807952
808976
802833
803089
804625
807953
808977
802834
803090
804626
807954
808978
802835
803091
804627
807955
808979
802836
803092
804628
807956
808980
802837
803093
804629
807957
808981
802838
803094
804630
807958
808982
802839
803095
804631
807959
808983
802840
803096
804632
807960
808984
802841
803097
804633
807961
808985
802842
803098
804634
807962
808986
802843
803099
804635
807963
808987
802844
803100
804636
807964
808988
802846
803102
804638
807966
808990
802847
803103
804639
807967
808991
792064
792320
800512
800768
807936
808192
792159
792415
800607
800863
808031
808287
868622
868878
870158
871182
868623
868879
870159
871183
868624
868880
870160
871184
868625
868881
870161
871185
868626
868882
870162
871186
868627
868883
870163
871187
868629
868885
870165
871189
868630
868886
870166
871190
868631
868887
870167
871191
868632
868888
870168
871192
868633
868889
870169
871193
868634
868890
870170
871194
868635
868891
870171
871195
868636
868892
870172
871196
868637
868893
870173
871197
857600
857856
866048
866304
873472
873728
857695
857951
866143
866399
873567
873823
933900
934668
936204
937740
939276
940044
934159
934671
937743
939279
940047
934160
934672
936208
937744
939280
940048
933905
934161
936209
937745
939281
940049
933906
934162
934674
933907
934163
934675
936211
937747
939283
933908
934164
934676
936212
937748
939284
940052
933909
934165
934677
936213
937749
939285
940053
933910
934166
934678
936214
937750
939286
940054
933911
934167
934679
936215
937751
939287
940055
933912
934168
936216
939288
940056
933913
934169
936217
937753
939289
940057
933914
934170
936218
937754
939290
940058
933915
934171
936219
937755
939291
940059
933916
934172
936220
937756
939292
940060
933917
934173
936221
937757
939293
940061
933920
934176
936224
937760
940064
923136
923392
931584
931840
939008
939264
923231
923487
931679
931935
939103
939359
999692
999948
1000204
1000460
1001228
1002252
999693
999949
1000205
1000461
1001229
1002253
999694
999950
1000206
1000462
1001230
1002254
999695
999951
1000207
1000463
1001231
1002255
999451
999707
999963
1000219
1000475
1001243
1002267
999452
999708
999964
1000220
1000476
1001244
1002268
988672
988928
997120
997376
1004544
1004800
988767
989023
997215
997471
1004639
1004895
1065231
1065487
1065743
1069071
1065232
1065488
1065744
1069072
1065233
1065489
1065745
1069073
1065234
1065490
1065746
1069074
1065235
1065491
1065747
1069075
1065236
1065492
1065748
1069076
1065237
1065493
1065749
1069077
1065238
1065494
1065750
1069078
1065239
1065495
1065751
1069079
1065240
1065496
1065752
1069080
1065241
1065497
1065753
1069081
1065242
1065498
1065754
1069082
1065243
1065499
1065755
1069083
1065244
1065500
1065756
1069084
1054208
1054464
1062656
1062912
1070080
1070336
1054303
1054559
1062751
1063007
1070175
1070431
1130511
1130767
1131279
1130512
1130768
1131280
1130513
1130769
1131281
1130514
1130770
1131282
1130515
1130771
1131283
1130516
1130772
1131284
1130517
1130773
1131285
1130518
1130774
1131286
1130519
1130775
1131287
1130520
1130776
1131288
1130521
1130777
1131289
1130522
1130778
1131290
1130523
1130779
1131291
1130524
1130780
1131292
1119744
1120000
1128192
1128448
1135616
1135872
1119839
1120095
1128287
1128543
1135711
1135967
1196814
1196828
1196830
1196831
1196832
1185280
1185536
1193728
1193984
1201152
1201408
1185375
1185631
1193823
1194079
1201247
1201503
1261582
1261838
1262094
1264398
1261585
1261841
1262097
1264401
1261586
1261842
1262098
1264402
1261587
1261843
1262099
1264403
1261588
1261844
1262100
1264404
1261589
1261845
1262101
1264405
1261590
1261846
1262102
1264406
1261592
1261848
1262104
1264408
1261593
1261849
1262105
1264409
1261594
1261850
1262106
1264410
1261595
1261851
1262107
1264411
1261596
1261852
1262108
1264412
1250816
1251072
1259264
1259520
1266688
1266944
1250911
1251167
1259359
1259615
1266783
1267039
1327382
1329942
1327385
1329945
1327386
1329946
1327387
1329947
1327388
1327389
1329949
1327390
1329950
1327391
1329951
1316352
1316608
1324800
1325056
1332224
1332480
1316447
1316703
1324895
1325151
1332319
1332575
1392653
1392909
1393165
1392654
1392910
1393166
1392655
1392911
1393167
1392656
1392912
1393168
1392657
1392913
1393169
1392658
1392914
1393170
1392659
1392915
1393171
1392660
1392916
1393172
1392661
1392917
1393173
1392662
1392918
1393174
1392663
1392919
1393175
1392664
1392920
1393176
1392665
1392921
1393177
1392666
1392922
1393178
1392667
1392923
1393179
1392668
1392924
1393180
1381888
1382144
1390336
1390592
1397760
1398016
1381983
1382239
1390431
1390687
1397855
1398111
1463552
1463553
1458450
1458706
1459474
1460498
1460754
1461010
1461266
1461522
1461778
1462546
1462802
1463058
1458452
1458708
1459476
1460500
1460756
1461012
1461268
1461524
1461780
1462548
1462804
1463060
1458453
1458709
1459477
1460501
1460757
1461013
1461269
1461525
1461781
1462549
1462805
1463061
1458454
1458710
1459478
1460502
1460758
1461014
1461270
1461526
1461782
1462550
1462806
1463062
1458455
1458711
1459479
1460503
1460759
1461015
1461271
1461527
1461783
1462551
1462807
1463063
1458456
1458712
1459480
1460504
1460760
1461016
1461272
1461528
1461784
1462552
1462808
1463064
1458457
1458713
1459481
1460505
1460761
1461017
1461273
1461529
1461785
1462553
1462809
1463065
1458458
1458714
1459482
1460506
1460762
1461018
1461274
1461530
1461786
1462554
1462810
1463066
1458459
1458715
1459483
1460507
1460763
1461019
1461275
1461531
1461787
1462555
1462811
1463067
1458460
1458716
1459484
1460508
1460764
1461020
1461276
1461532
1461788
1462556
1462812
1463068
1460515
1460771
1461027
1461283
1461539
1461795
1462563
1462819
1463075
1447424
1447680
1455872
1456128
1463296
1463552
1447519
1447775
1455967
1456223
1463391
1463647
1523976
1524744
1525512
1523978
1524746
1525514
1523726
1523982
1524750
1525518
1523727
1523983
1524751
1525519
1523728
1523984
1524752
1525520
1523729
1523985
1524753
1525521
1523731
1523987
1524755
1525523
1523732
1523988
1524756
1525524
1523733
1523989
1524757
1525525
1523734
1523990
1524758
1525526
1523735
1523991
1524759
1525527
1523736
1523992
1524760
1525528
1523738
1523994
1524762
1525530
1523739
1523995
1524763
1525531
1523740
1523996
1524764
1525532
1512960
1513216
1521408
1521664
1528832
1529088
1513055
1513311
1521503
1521759
1528927
1529183
1594624
1594625
1591051
1591052
1591054
1591055
1591056
1591057
1591058
1591059
1591061
1591067
1591068
1591070
1578496
1578752
1586944
1587200
1594368
1594624
1578591
1578847
1587039
1587295
1594463
1594719
1659904
1660160
1659905
1660161
1654793
1655049
1655817
1656073
1656329
1657097
1657353
1657609
1654794
1655050
1655818
1656074
1656330
1657098
1657354
1657610
1654795
1655051
1655819
1656075
1656331
1657099
1657355
1657611
1654796
1655052
1655820
1656076
1656332
1657100
1657356
1657612
1654797
1655053
1655821
1656077
1656333
1657101
1657357
1657613
1654798
1655054
1655822
1656078
1656334
1657102
1657358
1657614
1654799
1655055
1655823
1656079
1656335
1657103
1657359
1657615
1654800
1655056
1655824
1656080
1656336
1657104
1657360
1657616
1654801
1655057
1655825
1656081
1656337
1657105
1657361
1657617
1654802
1655058
1655826
1656082
1656338
1657106
1657362
1657618
1654803
1655059
1655827
1656083
1656339
1657107
1657363
1657619
1654804
1655060
1655828
1656084
1656340
1657108
1657364
1657620
1654805
1655061
1655829
1656085
1656341
1657109
1657365
1657621
1654806
1655062
1655830
1656086
1656342
1657110
1657366
1657622
1654807
1655063
1655831
1656087
1656343
1657111
1657367
1657623
1654808
1655064
1655832
1656088
1656344
1657112
1657368
1657624
1654809
1655065
1655833
1656089
1656345
1657113
1657369
1657625
1654810
1655066
1655834
1656090
1656346
1657114
1657370
1657626
1654811
1655067
1655835
1656091
1656347
1657115
1657371
1657627
1654812
1655068
1655836
1656092
1656348
1657116
1657372
1657628
1654813
1655069
1655837
1656093
1656349
1657117
1657373
1657629
1654815
1655071
1655839
1656095
1656351
1657119
1657375
1657631
1654816
1655072
1655840
1656096
1656352
1657120
1657376
1657632
1654817
1655073
1655841
1656097
1656353
1657121
1657377
1657633
1655842
1656098
1656354
1657122
1657378
1657634
1655843
1656099
1656355
1657123
1657379
1657635
1644032
1644288
1652480
1652736
1659904
1660160
1644127
1644383
1652575
1652831
1659999
1660255
1725696
1725697
1720329
1720330
1720331
1720332
1720333
1720334
1720335
1720336
1720337
1720338
1720339
1720341
1720342
1720344
1720345
1720346
1720347
1720348
1720349
1720350
1720353
1709568
1709824
1718016
1718272
1725440
1725696
1709663
1709919
1718111
1718367
1725535
1725791
1787660
1787661
1787662
1787663
1787664
1787665
1787667
1787668
1787669
1787670
1787671
1787672
1785881
1787673
1785882
1785883
1785884
1785885
1785886
1785887
1785888
1785889
1775104
1775360
1783552
1783808
1790976
1791232
1775199
1775455
1783647
1783903
1791071
1791327
1840640
1840896
1849088
1849344
1856512
1856768
1840735
1840991
1849183
1849439
1856607
1856863
1916941
1917197
1916942
1917198
1916943
1917199
1916944
1917200
1916945
1917201
1916947
1917203
1916948
1917204
1916950
1917206
1916951
1917207
1916952
1917208
1916953
1917209
1916954
1917210
1916955
1917211
1916956
1917212
1906176
1906432
1914624
1914880
1922048
1922304
1906271
1906527
1914719
1914975
1922143
1922399
1971712
1971968
1980160
1980416
1987584
1987840
1971807
1972063
1980255
1980511
1987679
1987935
2048015
2048016
2048017
2048021
2048277
2048022
2048278
2048024
2048280
2048028
2048284
2037248
2037504
2045696
2045952
2053120
2053376
2037343
2037599
2045791
2046047
2053215
2053471
2110464
2110720
2110465
2110721
2115080
2113813
2114837
2115093
2116885
2117909
2118677
2113818
2114842
2115098
2116890
2117914
2118682
2102784
2103040
2111232
2111488
2118656
2118912
2102879
2103135
2111327
2111583
2118751
2119007
2168320
2168576
2176768
2177024
2184192
2184448
2168415
2168671
2176863
2177119
2184287
2184543
2244621
2247181
2244623
2247183
2244624
2247184
2244625
2247185
2244626
2247186
2244628
2247188
2244629
2247189
2244630
2247190
2244631
2247191
2244632
2247192
2244633
2247193
2244634
2247194
2244635
2247195
2244636
2247196
2233856
2234112
2242304
2242560
2249728
2249984
2233951
2234207
2242399
2242655
2249823
2250079
2299392
2299648
2307840
2308096
2315264
2315520
2299487
2299743
2307935
2308191
2315359
2315615
2375710
2364928
2365184
2373376
2373632
2380800
2381056
2365023
2365279
2373471
2373727
2380895
2381151
2441227
2441483
2441228
2441484
2441229
2441485
2441230
2441486
2441231
2441487
2441232
2441488
2441233
2441489
2441234
2441490
2441235
2441491
2441236
2441492
2441237
2441493
2441238
2441494
2441239
2441495
2441240
2441496
2441241
2441497
2441244
2441500
2430464
2430720
2438912
2439168
2446336
2446592
2430559
2430815
2439007
2439263
2446431
2446687
2506772
2507028
2507284
2506773
2507029
2507285
2506774
2507030
2507286
2506776
2507032
2507288
2506777
2507033
2507289
2506778
2507034
2507290
2506779
2507035
2507291
2506780
2507036
2507292
2496000
2496256
2504448
2504704
2511872
2512128
2496095
2496351
2504543
2504799
2511967
2512223
2577665
2574101
2574109
2574110
2561536
2561792
2569984
2570240
2577408
2577664
2561631
2561887
2570079
2570335
2577503
2577759
2627072
2627328
2635520
2635776
2642944
2643200
2627167
2627423
2635615
2635871
2643039
2643295
2692608
2692864
2701056
2701312
2708480
2708736
2692703
2692959
2701151
2701407
2708575
2708831
2775313
2775315
2775317
2775319
2775320
2775321
2775323
2775324
2775326
2758144
2758400
2766592
2766848
2774016
2774272
2758239
2758495
2766687
2766943
2774111
2774367
2823680
2823936
2832128
2832384
2839552
2839808
2823775
2824031
2832223
2832479
2839647
2839903
2904331
2905099
2904332
2905100
2904333
2905101
2904334
2905102
2904335
2905103
2904337
2905105
2904339
2905107
2904340
2905108
2904341
2905109
2904342
2905110
2904343
2905111
2904344
2905112
2904345
2905113
2904346
2905114
2904347
2905115
2904348
2905116
2904349
2905117
2904350
2905118
2904351
2905119
2904352
2905120
2904353
2905121
2904354
2889216
2889472
2897664
2897920
2905088
2905344
2889311
2889567
2897759
2898015
2905183
2905439
2965520
2965522
2965527
2965528
2965529
2965530
2954752
2955008
2963200
2963456
2970624
2970880
2954847
2955103
2963295
2963551
2970719
2970975
3036160
3036161
3035405
3035406
3035407
3035410
3035412
3035413
3035414
3035415
3035416
3035417
3035418
3035419
3035421
3035422
3035423
3020288
3020544
3028736
3028992
3036160
3036416
3020383
3020639
3028831
3029087
3036255
3036511
3102731
3102736
3102737
3102738
3102739
3102740
3102741
3102742
3102743
3102744
3102746
3102747
3102748
3102750
3102751
3085824
3086080
3094272
3094528
3101696
3101952
3085919
3086175
3094367
3094623
3101791
3102047
3167488
3167233
3167489
3151360
3151616
3159808
3160064
3167232
3167488
3151455
3151711
3159903
3160159
3167327
3167583
3232768
3232769
3233025
3233800
3233802
3233814
3233816
3233818
3233819
3233820
3216896
3217152
3225344
3225600
3232768
3233024
3216991
3217247
3225439
3225695
3232863
3233119
3295243
3295244
3295246
3295247
3295248
3295251
3295252
3295253
3295255
3295256
3295257
3293210
3295258
3295259
3293212
3295260
3295261
3293214
3295262
3293215
3295263
3293216
3295264
3282432
3282688
3290880
3291136
3298304
3298560
3282527
3282783
3290975
3291231
3298399
3298655
3364873
3365129
3364876
3365132
3364888
3365144
3365400
3364889
3365145
3365401
3364891
3365147
3365403
3347968
3348224
3356416
3356672
3363840
3364096
3348063
3348319
3356511
3356767
3363935
3364191
3423751
3423752
3426056
3423753
3423754
3423755
3423756
3423757
3423758
3423759
3423760
3423761
3423762
3423763
3423764
3423765
3423766
3423767
3423768
3423769
3423770
3423771
3423772
3423773
3423774
3423775
3423776
3423777
3423778
3423779
3425571
3413504
3413760
3421952
3422208
3429376
3429632
3413599
3413855
3422047
3422303
3429471
3429727
3479040
3479296
3487488
3487744
3494912
3495168
3479135
3479391
3487583
3487839
3495007
3495263
