0 0 0.600000014305 1.0 1.66666662693
0 1 21.3350644987 0.0353055745363 1.32758617401
0 2 1.0 1.0 1.0
1 0 1.0 0.833333313465 1.20000004768
1 1 0.645564119272 0.932563126087 1.66104865074
1 2 1.0 0.0 0.0
2 0 1.33333333333 0.75 1.0
2 1 0.662172879482 0.930405855179 1.62314069271
2 2 1.0 1.0 1.0
3 0 0.749999977648 1.0 1.33333337307
3 1 0.592909240289 0.943246483803 1.78807854652
3 2 1.0 0.75 1.33333337307
4 0 0.41666665011 0.800000011921 3.0
4 1 0.673176348346 0.907118499279 1.63759744167
4 2 0.428571443168 1.0 2.33333325386
5 0 0.749999977648 1.0 1.33333337307
5 1 0.609688120033 0.931916475296 1.76001060009
5 2 1.0 1.0 1.0
6 0 1.0 0.0 0.0
6 1 0.576708376453 0.923538804054 1.87753748894
6 2 0.71428572645 0.800000011921 1.75
7 0 0.749999977648 1.0 1.33333337307
7 1 0.639213516511 0.895614564419 1.74675858021
7 2 1.33333333333 0.75 1.0
8 0 0.8 1.0 1.25
8 1 0.481531604966 0.960547208786 2.16200399399
8 2 0.83333330022 0.800000011921 1.5
9 0 0.8 0.75 1.66666662693
9 1 0.678322268673 0.909913241863 1.62018251419
9 2 0.5 1.0 2.0
10 0 0.624999990687 0.800000011921 2.0
10 1 0.624096193721 0.921219527721 1.73934340477
10 2 1.33333333333 0.75 1.0
11 0 1.0 1.0 1.0
11 1 0.628952401546 0.925863087177 1.7172576189
11 2 1.33333333333 0.5 1.5
12 0 1.0 0.75 1.33333337307
12 1 0.747253765305 0.879503548145 1.52157831192
12 2 1.0 1.0 1.0
13 0 0.749999977648 1.0 1.33333337307
13 1 0.661794242823 0.927427172661 1.62928557396
13 2 0.8 1.0 1.25
14 0 0.749999977648 1.0 1.33333337307
14 1 0.711594959104 0.886959671974 1.58439421654
14 2 0.5 1.0 2.0
15 0 0.600000014305 1.0 1.66666662693
15 1 0.804622271708 0.84335064888 1.47366845608
15 2 1.0 0.75 1.33333337307
16 0 0.600000014305 1.0 1.66666662693
16 1 0.575364431077 0.94768178463 1.83397936821
16 2 0.5 1.0 2.0
17 0 0.749999977648 0.666666686535 2.0
17 1 0.595328387668 0.946242034435 1.7751749754
17 2 0.5 1.0 2.0
18 0 0.5 1.0 2.0
18 1 1.4832022895 0.521807253361 1.29208040237
18 2 0.666666666667 1.0 1.5
19 0 0.749999977648 1.0 1.33333337307
19 1 0.655331534036 0.921299755573 1.656296134
19 2 0.571428571429 1.0 1.75
20 0 1.4999999553 0.666666686535 1.0
20 1 0.64008550947 0.932821989059 1.67480111122
20 2 0.666666666667 1.0 1.5
21 0 0.749999977648 1.0 1.33333337307
21 1 0.582202240372 0.939783096313 1.82767307758
21 2 0.333333333333 1.0 3.0
22 0 0.749999977648 1.0 1.33333337307
22 1 0.580716715032 0.94736212492 1.81768929958
22 2 1.0 0.0 0.0
23 0 1.4999999553 0.666666686535 1.0
23 1 0.619858019353 0.945608317852 1.70606851578
23 2 0.749999977648 1.0 1.33333337307
24 0 1.0 0.666666686535 1.5
24 1 0.618850161179 0.928102076054 1.74108016491
24 2 1.0 1.0 1.0
25 0 0.5 1.0 2.0
25 1 0.66364598303 0.950682759285 1.58499515057
25 2 1.0 0.75 1.33333337307
26 0 0.428571443168 1.0 2.33333325386
26 1 1.0 0.0 0.0
26 2 0.444444444444 1.0 2.25
27 0 0.749999977648 1.0 1.33333337307
27 1 0.64222922216 0.923588037491 1.68589925766
27 2 0.8 1.0 1.25
28 0 0.749999977648 0.666666686535 2.0
28 1 0.66998841183 0.922599256039 1.61778056622
28 2 1.0 0.800000011921 1.25
29 0 0.749999977648 1.0 1.33333337307
29 1 0.628571415726 0.9541041255 1.66743755341
29 2 0.83333330022 1.0 1.20000004768
30 0 0.749999977648 1.0 1.33333337307
30 1 0.47644716585 0.961264133453 2.18344640732
30 2 2.49999996275 0.40000000596 1.0
31 0 1.4999999553 0.333333343267 2.0
31 1 0.31391055859 0.976236641407 3.26316452026
31 2 1.0 1.0 1.0
32 0 1.0 0.0 0.0
32 1 0.671173422627 0.928127348423 1.60530543327
32 2 1.4999999553 0.666666686535 1.0
33 0 0.600000014305 1.0 1.66666662693
33 1 0.637751870162 0.953102886677 1.6451612711
33 2 0.857142886337 1.0 1.16666662693
34 0 0.666666666667 1.0 1.5
34 1 0.683977791086 0.93603849411 1.56193971634
34 2 0.615384615385 0.75 2.16666674614
35 0 0.5 1.0 2.0
35 1 0.626329902606 0.94009333849 1.6983448267
35 2 1.0 0.888888895512 1.125
36 0 0.8 1.0 1.25
36 1 10.8111259017 0.0656934306026 1.4080145359
36 2 1.0 0.75 1.33333337307
37 0 1.0 0.5 2.0
37 1 0.693884982094 0.926124453545 1.55612027645
37 2 0.636363650156 1.0 1.57142853737
38 0 1.0 0.0 0.0
38 1 0.489036477915 0.954522132874 2.14226269722
38 2 0.555555570273 0.800000011921 2.25
39 0 0.666666666667 1.0 1.5
39 1 0.686337915433 0.941107213497 1.5481852293
39 2 1.14285714286 0.6875 1.27272725105
40 0 0.666666666667 1.0 1.5
40 1 0.781760468172 0.868298530579 1.47318482399
40 2 0.941176470588 0.75 1.41666662693
41 0 1.0 0.0 0.0
41 1 0.638320872089 0.953215658665 1.64350032806
41 2 1.14285714286 0.8125 1.07692313194
42 0 0.83333330022 1.0 1.20000004768
42 1 0.589212227389 0.942303061485 1.80109930038
42 2 0.904761940714 0.947368443012 1.16666662693
43 0 0.624999990687 0.800000011921 2.0
43 1 0.685487216729 0.903599739075 1.61444973946
43 2 1.05555553109 0.789473712444 1.20000004768
44 0 0.83333330022 1.0 1.20000004768
44 1 0.73228697563 0.886711597443 1.54005527496
44 2 0.880000008392 0.772727251053 1.47058820724
45 0 1.39999996662 0.714285731316 1.0
45 1 0.670852607219 0.920073866844 1.62013113499
45 2 0.807692278066 0.952380955219 1.29999995232
46 0 1.33333333333 0.625 1.20000004768
46 1 0.779961464068 0.835721373558 1.53414130211
46 2 0.655172405714 1.0 1.5263158083
47 0 1.6 0.625 1.0
47 1 0.92937659725 0.793069303036 1.35674154758
47 2 0.894736847719 0.941176474094 1.1875
48 0 1.0 0.899999976158 1.11111116409
48 1 0.588209580684 0.926907837391 1.83413529396
48 2 0.68000001297 0.941176474094 1.5625
49 0 0.666666666667 0.800000011921 1.875
49 1 0.758931981082 0.830098927021 1.58733034134
49 2 0.882352947364 0.800000011921 1.41666662693
50 0 0.666666666667 1.0 1.5
50 1 0.748974364309 0.871650636196 1.5317595005
50 2 0.565217405952 0.846153855324 2.09090900421
51 0 0.666666666667 0.833333313465 1.79999995232
51 1 0.622234934372 0.948513627052 1.69434571266
51 2 0.933333363003 0.785714268684 1.36363637447
52 0 1.6 0.625 1.0
52 1 0.872797705919 0.779670715332 1.46951889992
52 2 2.0 0.375 1.33333337307
53 0 1.0 0.0 0.0
53 1 1.0 0.0 0.0
53 2 1.0 0.0 0.0
