0 0 1.0 0.0 0.0
0 1 0.789789816084 0.889733850956 1.42307686806
0 2 1.0 0.0 0.0
1 0 1.0 0.0 0.0
1 1 0.70844685636 0.888461530209 1.58874464035
1 2 1.0 0.0 0.0
2 0 1.0 0.0 0.0
2 1 0.786248140786 0.878327012062 1.44805192947
2 2 1.0 0.0 0.0
3 0 1.0 0.0 0.0
3 1 0.557894742443 0.915094316006 1.95876288414
3 2 1.0 0.0 0.0
4 0 1.0 0.0 0.0
4 1 0.711934183621 0.90366089344 1.55437099934
4 2 1.0 0.0 0.0
5 0 1.0 0.0 0.0
5 1 0.603773584906 0.958984375 1.72708761692
5 2 1.0 0.0 0.0
6 0 1.0 0.0 0.0
6 1 0.577971630595 0.930188655853 1.86004054546
6 2 1.0 0.0 0.0
7 0 1.0 0.0 0.0
7 1 0.660000006294 0.901515126228 1.68067228794
7 2 1.0 0.0 0.0
8 0 1.0 0.0 0.0
8 1 0.632896285791 0.928436934948 1.70182549953
8 2 1.0 0.0 0.0
9 0 1.0 0.0 0.0
9 1 0.686684059001 0.933460056782 1.56008148193
9 2 1.0 0.0 0.0
10 0 1.0 0.0 0.0
10 1 0.626575044551 0.943327248096 1.69186043739
10 2 1.0 0.0 0.0
11 0 1.0 0.0 0.0
11 1 0.636576806668 0.952117860317 1.64990329742
11 2 1.0 0.0 0.0
12 0 1.0 0.0 0.0
12 1 0.572198268291 0.964218437672 1.8125
12 2 1.0 0.0 0.0
13 0 1.0 0.0 0.0
13 1 0.649509794243 0.93962264061 1.63855421543
13 2 1.0 0.0 0.0
14 0 1.0 0.0 0.0
14 1 0.706737139799 0.902803719044 1.5672878027
14 2 1.0 0.0 0.0
15 0 1.0 0.0 0.0
15 1 0.860162641808 0.826086938381 1.40732264519
15 2 1.0 0.0 0.0
16 0 1.0 0.0 0.0
16 1 0.620809249239 0.940409660339 1.7128713131
16 2 1.0 0.0 0.0
17 0 1.0 0.0 0.0
17 1 0.633886261028 0.940186917782 1.67793238163
17 2 1.0 0.0 0.0
18 0 1.0 0.0 0.0
18 1 0.607709762395 0.916044771671 1.79633402824
18 2 1.0 0.0 0.0
19 0 1.0 0.0 0.0
19 1 0.692802054008 0.925788521767 1.55911827087
19 2 1.0 0.0 0.0
20 0 1.0 0.0 0.0
20 1 0.688946010357 0.944029867649 1.53754937649
20 2 1.0 0.0 0.0
21 0 1.0 0.0 0.0
21 1 0.619815654413 0.946096658707 1.70530450344
21 2 1.0 0.0 0.0
22 0 1.0 0.0 0.0
22 1 0.788321137701 0.85925924778 1.47629308701
22 2 1.0 0.0 0.0
23 0 1.0 0.0 0.0
23 1 0.675606664987 0.937618136406 1.57862901688
23 2 1.0 0.0 0.0
24 0 1.0 0.0 0.0
24 1 0.657465481841 0.900763332844 1.68855929375
24 2 1.0 0.0 0.0
25 0 1.0 0.0 0.0
25 1 0.745639529328 0.92397660017 1.45147681236
25 2 1.0 0.0 0.0
26 0 1.0 0.0 0.0
26 1 1.0209524097 0.755596995354 1.2962962389
26 2 1.0 0.0 0.0
27 0 1.0 0.0 0.0
27 1 0.703653557777 0.903846144676 1.57234036922
27 2 1.0 0.0 0.0
28 0 1.0 0.0 0.0
28 1 0.747838597318 0.872832357883 1.53200888634
28 2 2.0 0.5 1.0
29 0 1.0 0.0 0.0
29 1 0.633637567603 0.967078208923 1.63191485405
29 2 1.0 1.0 1.0
30 0 1.0 0.0 0.0
30 1 0.506903338159 0.978599250317 2.01590466499
30 2 2.0 0.5 1.0
31 0 1.0 0.0 0.0
31 1 0.383480835668 0.990384638309 2.63300967216
31 2 0.5 1.0 2.0
32 0 1.0 0.0 0.0
32 1 0.931578994128 0.696798503399 1.54054057598
32 2 1.0 1.0 1.0
33 0 1.0 0.0 0.0
33 1 0.578299790861 0.970986485481 1.7808765173
33 2 1.0 1.0 1.0
34 0 1.0 0.0 0.0
34 1 0.714673914896 0.922053217888 1.51752579212
34 2 0.5 0.5 4.0
35 0 1.0 0.0 0.0
35 1 0.699999983311 0.919517099857 1.55361044407
35 2 0.666666666667 1.0 1.5
36 0 1.0 0.0 0.0
36 1 0.576707742084 0.970873773098 1.78600001335
36 2 1.0 1.0 1.0
37 0 1.0 0.0 0.0
37 1 0.762481087059 0.922619044781 1.42150533199
37 2 1.0 1.0 1.0
38 0 1.0 0.0 0.0
38 1 1.84697507095 0.470134884119 1.15163934231
38 2 1.0 0.666666686535 1.5
39 0 1.0 1.0 1.0
39 1 0.698689967971 0.922916650772 1.55079007149
39 2 1.0 0.666666686535 1.5
40 0 1.0 1.0 1.0
40 1 0.882246414346 0.831622183323 1.3629629612
40 2 0.8 1.0 1.25
41 0 1.0 1.0 1.0
41 1 0.682158933463 0.934065937996 1.56941175461
41 2 1.0 0.0 0.0
42 0 1.0 0.0 0.0
42 1 0.678821887555 0.913223147392 1.61312222481
42 2 0.77777778808 0.714285731316 1.79999995232
43 0 0.666666666667 1.0 1.5
43 1 0.733124010195 0.875802993774 1.55745720863
43 2 1.4999999553 0.666666686535 1.0
44 0 1.0 1.0 1.0
44 1 0.878048821335 0.814102590084 1.39895009995
44 2 1.0 0.0 0.0
45 0 0.83333330022 0.800000011921 1.5
45 1 0.714960625895 0.922907471657 1.51551318169
45 2 0.83333330022 0.800000011921 1.5
46 0 1.0 1.0 1.0
46 1 0.667697059433 0.925925910473 1.61749994755
46 2 1.0 0.0 0.0
47 0 2.0 0.5 1.0
47 1 1.02380953543 0.786046504974 1.24260354042
47 2 2.49999996275 0.40000000596 1.0
48 0 2.0 0.5 1.0
48 1 0.604651166143 0.930288434029 1.77777779102
48 2 0.600000014305 1.0 1.66666662693
49 0 1.0 0.0 0.0
49 1 1.059259292 0.715617716312 1.31921827793
49 2 1.0 0.800000011921 1.25
50 0 1.0 0.0 0.0
50 1 0.890274320037 0.843137264252 1.33222591877
50 2 1.33333333333 0.75 1.0
51 0 1.0 0.0 0.0
51 1 0.70253165246 0.939939916134 1.51437699795
51 2 0.749999977648 1.0 1.33333337307
52 0 1.0 0.0 0.0
52 1 0.559618425002 0.931818187237 1.91768288612
52 2 1.4999999553 0.333333343267 2.0
53 0 1.0 0.0 0.0
53 1 1.0 0.0 0.0
53 2 1.0 0.0 0.0
