0 0 0.571428571429 1.0 1.75
0 1 8.24909112186 0.102490633726 1.18279564381
0 2 0.749999977648 1.0 1.33333337307
1 0 0.666666666667 1.0 1.5
1 1 0.681951583158 0.90667027235 1.61732423306
1 2 1.0 0.0 0.0
2 0 0.5 1.0 2.0
2 1 0.746909915374 0.874967157841 1.53017115593
2 2 0.749999977648 1.0 1.33333337307
3 0 1.0 1.0 1.0
3 1 0.717022844258 0.852261066437 1.6364184618
3 2 0.571428571429 1.0 1.75
4 0 1.33333333333 0.75 1.0
4 1 0.806960287984 0.79335129261 1.56200456619
4 2 0.666666666667 1.0 1.5
5 0 1.0 0.75 1.33333337307
5 1 0.747694419438 0.840586483479 1.59108531475
5 2 1.0 1.0 1.0
6 0 1.33333333333 0.75 1.0
6 1 0.693535097624 0.836812138557 1.72307252884
6 2 1.0 0.75 1.33333337307
7 0 1.0 1.0 1.0
7 1 0.855643563993 0.74542927742 1.56783604622
7 2 0.444444444444 1.0 2.25
8 0 1.0 1.0 1.0
8 1 0.620957131451 0.88451564312 1.82067680359
8 2 0.4 1.0 2.5
9 0 1.0 1.0 1.0
9 1 0.83020360287 0.80666667223 1.49321138859
9 2 1.0 0.5 2.0
10 0 1.0 1.0 1.0
10 1 0.754426787369 0.843290686607 1.57183015347
10 2 0.749999977648 1.0 1.33333337307
11 0 0.749999977648 1.0 1.33333337307
11 1 0.77046861266 0.832912564278 1.55828046799
11 2 0.374999988824 1.0 2.66666674614
12 0 0.666666666667 0.75 2.0
12 1 0.884457223229 0.769874453545 1.46859908104
12 2 1.0 1.0 1.0
13 0 1.0 0.75 1.33333337307
13 1 0.803333304285 0.831489145756 1.49708902836
13 2 1.4999999553 0.666666686535 1.0
14 0 0.8 0.75 1.66666662693
14 1 0.871669299254 0.783771634102 1.46372234821
14 2 0.749999977648 1.0 1.33333337307
15 0 0.5 1.0 2.0
15 1 0.917852769711 0.75011074543 1.4524512291
15 2 1.0 1.0 1.0
16 0 2.99999991059 0.333333343267 1.0
16 1 0.663659214016 0.891464233398 1.6902500391
16 2 0.749999977648 1.0 1.33333337307
17 0 0.4 1.0 2.5
17 1 0.710615399329 0.872266709805 1.61330354214
17 2 1.0 1.0 1.0
18 0 1.0 1.0 1.0
18 1 0.845806563499 0.800656974316 1.47666668892
18 2 0.600000014305 1.0 1.66666662693
19 0 1.0 0.666666686535 1.5
19 1 0.78010711095 0.839544892311 1.52686917782
19 2 0.749999977648 1.0 1.33333337307
20 0 2.99999991059 0.333333343267 1.0
20 1 0.751356876531 0.85845375061 1.55037522316
20 2 0.749999977648 1.0 1.33333337307
21 0 0.749999977648 1.0 1.33333337307
21 1 0.681205799542 0.884276509285 1.66009747982
21 2 0.749999977648 1.0 1.33333337307
22 0 0.600000014305 1.0 1.66666662693
22 1 0.65682333054 0.910464882851 1.67220008373
22 2 1.0 0.0 0.0
23 0 1.0 1.0 1.0
23 1 0.660151254023 0.913334786892 1.65854239464
23 2 1.0 0.5 2.0
24 0 0.749999977648 1.0 1.33333337307
24 1 0.722599149259 0.865846037865 1.59831321239
24 2 0.600000014305 1.0 1.66666662693
25 0 1.0 1.0 1.0
25 1 0.709470782291 0.916165113449 1.53847956657
25 2 1.0 1.0 1.0
26 0 0.5 1.0 2.0
26 1 1.0 0.0 0.0
26 2 0.749999977648 1.0 1.33333337307
27 0 1.4999999553 0.666666686535 1.0
27 1 0.68887591204 0.883386254311 1.64326786995
27 2 0.600000014305 1.0 1.66666662693
28 0 1.4999999553 0.666666686535 1.0
28 1 0.709446841562 0.880858540535 1.60019886494
28 2 0.600000014305 1.0 1.66666662693
29 0 1.0 1.0 1.0
29 1 0.659171608327 0.934021532536 1.62421917915
29 2 0.5 1.0 2.0
30 0 1.0 1.0 1.0
30 1 0.557404517174 0.929778456688 1.92952346802
30 2 1.33333333333 0.5 1.5
31 0 1.0 1.0 1.0
31 1 0.371469885886 0.961060643196 2.80108046532
31 2 1.0 1.0 1.0
32 0 1.0 0.0 0.0
32 1 0.650422429915 0.927899122238 1.65692842007
32 2 1.0 0.75 1.33333337307
33 0 0.749999977648 1.0 1.33333337307
33 1 0.645999716452 0.943000853062 1.64155554771
33 2 0.624999990687 1.0 1.60000002384
34 0 1.0 1.0 1.0
34 1 0.695223115803 0.920798182487 1.56210899353
34 2 0.857142886337 1.0 1.16666662693
35 0 1.0 1.0 1.0
35 1 0.602836893703 0.944366872311 1.75654566288
35 2 1.39999996662 0.571428596973 1.25
36 0 1.0 1.0 1.0
36 1 7.15535257368 0.106732346117 1.30940175056
36 2 0.77777778808 0.857142865658 1.5
37 0 2.99999991059 0.333333343267 1.0
37 1 0.704330918172 0.913283407688 1.5545964241
37 2 0.857142886337 1.0 1.16666662693
38 0 1.0 0.0 0.0
38 1 0.497064403927 0.941322147846 2.1372191906
38 2 0.666666666667 1.0 1.5
39 0 1.4999999553 0.666666686535 1.0
39 1 0.666887144289 0.947629451752 1.5823738575
39 2 1.14285714286 0.75 1.16666662693
40 0 1.0 1.0 1.0
40 1 0.722730821581 0.890155613422 1.55438101292
40 2 0.624999990687 1.0 1.60000002384
41 0 1.66666660044 0.600000023842 1.0
41 1 0.628218318351 0.956102013588 1.66488850117
41 2 0.818181827049 0.888888895512 1.375
42 0 0.83333330022 1.0 1.20000004768
42 1 0.573874250197 0.936539530754 1.86061775684
42 2 0.71428572645 1.0 1.39999997616
43 0 1.0 0.75 1.33333337307
43 1 0.660567126804 0.907906830311 1.66740751266
43 2 1.11111114055 0.800000011921 1.125
44 0 0.8 0.75 1.66666662693
44 1 0.697078399515 0.889889717102 1.61206364632
44 2 1.74999992177 0.285714298487 2.0
45 0 3.49999984354 0.285714298487 1.0
45 1 0.653309272402 0.91858536005 1.66633248329
45 2 0.600000014305 1.0 1.66666662693
46 0 1.0 0.600000023842 1.66666662693
46 1 0.71213520148 0.862228810787 1.6286021471
46 2 0.8 0.75 1.66666662693
47 0 2.49999996275 0.40000000596 1.0
47 1 0.83533950983 0.838352143764 1.42794179916
47 2 1.0 0.857142865658 1.16666662693
48 0 1.4999999553 0.666666686535 1.0
48 1 0.551521294227 0.930305242538 1.94900178909
48 2 0.8 0.875 1.42857146263
49 0 1.4999999553 0.666666686535 1.0
49 1 0.692742438564 0.864824771881 1.66916811466
49 2 0.749999977648 1.0 1.33333337307
50 0 0.749999977648 1.0 1.33333337307
50 1 0.728209068011 0.889381468296 1.54403042793
50 2 0.77777778808 0.857142865658 1.5
51 0 1.24999998137 0.600000023842 1.33333337307
51 1 0.616693237642 0.954094827175 1.69957077503
51 2 1.0 0.714285731316 1.39999997616
52 0 1.20000002861 0.666666686535 1.25
52 1 0.485101164135 0.940670847893 2.19144201279
52 2 2.0 0.300000011921 1.66666662693
53 0 1.0 0.0 0.0
53 1 1.0 0.0 0.0
53 2 1.0 0.0 0.0
