1579064
1579320
1579576
1579832
1580088
1580344
1580600
1580856
1579065
1579321
1579577
1579833
1580089
1580345
1580601
1580857
1579066
1579322
1579578
1579834
1580090
1580346
1580602
1580858
1579067
1579323
1579579
1579835
1580091
1580347
1580603
1580859
1579068
1579324
1579580
1579836
1580092
1580348
1580604
1580860
1579069
1579325
1579581
1579837
1580093
1580349
1580605
1580861
1579070
1579326
1579582
1579838
1580094
1580350
1580606
1580862
1579071
1579327
1579583
1579839
1580095
1580351
1580607
1580863
