0 0 1.0 0.0 0.0
0 1 2.74999991804 0.0909090936184 4.0
0 2 0.783545613845 0.842694282532 1.51448738575
1 0 1.0 0.0 0.0
1 1 1.0 1.0 1.0
1 2 0.631675666338 0.880538403988 1.7978669405
2 0 1.0 0.0 0.0
2 1 1.0 0.0 0.0
2 2 0.692749189126 0.918477654457 1.57164824009
3 0 1.0 0.0 0.0
3 1 1.0 0.0 0.0
3 2 0.813875710938 0.768026351929 1.59980046749
4 0 1.0 0.0 0.0
4 1 1.0 0.0 0.0
4 2 0.705040514619 0.899111270905 1.57751131058
5 0 1.0 0.0 0.0
5 1 1.0 0.0 0.0
5 2 0.733276211632 0.871457099915 1.56489920616
6 0 1.0 0.0 0.0
6 1 1.0 0.0 0.0
6 2 0.733755016538 0.870846390724 1.56497478485
7 0 1.0 0.0 0.0
7 1 1.0 0.0 0.0
7 2 0.584380341889 0.943864941597 1.8129863739
8 0 1.0 0.0 0.0
8 1 1.0 0.0 0.0
8 2 0.739093847454 0.89731580019 1.50783932209
9 0 1.0 0.0 0.0
9 1 1.0 0.0 0.0
9 2 0.688441948353 0.904653787613 1.60564768314
10 0 1.0 0.0 0.0
10 1 1.0 0.0 0.0
10 2 0.642243628962 0.90885078907 1.71319806576
11 0 1.0 0.0 0.0
11 1 1.0 0.0 0.0
11 2 1.1893322025 0.569513618946 1.47636139393
12 0 1.0 0.0 0.0
12 1 1.0 0.0 0.0
12 2 0.683738234939 0.931079864502 1.57080829144
13 0 1.0 0.0 0.0
13 1 1.0 0.0 0.0
13 2 0.67630975128 0.888993561268 1.66324305534
14 0 1.0 0.0 0.0
14 1 1.0 0.0 0.0
14 2 0.999099827231 0.685652494431 1.45977878571
15 0 1.0 0.0 0.0
15 1 1.0 0.0 0.0
15 2 0.873628233351 0.766689419746 1.49297952652
16 0 1.0 0.0 0.0
16 1 1.0 0.0 0.0
16 2 0.819380759877 0.809420645237 1.50778675079
17 0 1.0 0.0 0.0
17 1 1.0 0.0 0.0
17 2 0.712947013977 0.917489647865 1.52876794338
18 0 1.0 0.0 0.0
18 1 1.0 0.0 0.0
18 2 0.705007806379 0.893670260906 1.58718943596
19 0 1.0 0.0 0.0
19 1 1.0 0.0 0.0
19 2 1.26678052972 0.536128342152 1.47241377831
20 0 1.0 0.0 0.0
20 1 1.0 0.0 0.0
20 2 0.679669604693 0.926475346088 1.58806502819
21 0 1.0 0.0 0.0
21 1 1.0 0.0 0.0
21 2 0.893365093703 0.780026316643 1.43503248692
22 0 1.0 0.0 0.0
22 1 1.0 0.0 0.0
22 2 0.931552820869 0.762816011906 1.40725469589
23 0 1.0 0.0 0.0
23 1 1.0 0.0 0.0
23 2 0.714292660119 0.887684881687 1.57712078094
24 0 1.0 0.0 0.0
24 1 1.0 0.0 0.0
24 2 0.812828504066 0.818288803101 1.50346887112
25 0 1.0 0.0 0.0
25 1 1.0 0.0 0.0
25 2 0.850664449772 0.840182483196 1.39916229248
26 0 1.0 0.0 0.0
26 1 1.0 0.0 0.0
26 2 0.687415866699 0.878759741783 1.65542793274
27 0 1.0 0.0 0.0
27 1 1.0 0.0 0.0
27 2 0.767992945377 0.771475970745 1.6877976656
28 0 1.0 0.0 0.0
28 1 1.0 0.0 0.0
28 2 0.903483058174 0.797156274319 1.38847005367
29 0 1.0 0.0 0.0
29 1 1.0 0.0 0.0
29 2 0.793421022639 0.857128679752 1.47045004368
30 0 1.0 0.0 0.0
30 1 1.0 0.0 0.0
30 2 0.902909692218 0.789137721062 1.4034692049
31 0 1.0 0.0 0.0
31 1 1.0 0.0 0.0
31 2 0.850261187022 0.762928307056 1.54157221317
32 0 1.0 0.0 0.0
32 1 1.0 0.0 0.0
32 2 0.618624300807 0.957492411137 1.68825352192
33 0 1.0 0.0 0.0
33 1 1.0 0.0 0.0
33 2 0.700419578364 0.911162376404 1.56691682339
34 0 1.0 0.0 0.0
34 1 1.0 0.0 0.0
34 2 0.810740116897 0.87281703949 1.41317236423
35 0 1.0 0.0 0.0
35 1 1.0 0.0 0.0
35 2 0.738488539379 0.83015114069 1.63116955757
36 0 1.0 0.0 0.0
36 1 1.0 0.0 0.0
36 2 0.913667311096 0.794604063034 1.37740337849
37 0 1.0 0.0 0.0
37 1 1.0 0.0 0.0
37 2 0.823104037107 0.830719411373 1.46248328686
38 0 1.0 0.0 0.0
38 1 1.0 0.0 0.0
38 2 0.860913000414 0.854083180428 1.36000525951
39 0 1.0 0.0 0.0
39 1 1.0 0.0 0.0
39 2 2.28516759133 0.371259480715 1.17870295048
40 0 1.0 0.0 0.0
40 1 1.0 0.0 0.0
40 2 0.711044747224 0.893597781658 1.5738414526
41 0 1.0 0.0 0.0
41 1 1.0 0.0 0.0
41 2 6.90178139114 0.112264312804 1.29061615467
42 0 1.0 0.0 0.0
42 1 1.0 0.0 0.0
42 2 0.816871517313 0.866683423519 1.41249132156
43 0 1.0 0.0 0.0
43 1 1.0 0.0 0.0
43 2 0.863174438635 0.836640298367 1.38472223282
44 0 1.0 0.0 0.0
44 1 1.0 0.0 0.0
44 2 0.795045071087 0.836803078651 1.50308990479
45 0 1.0 0.0 0.0
45 1 1.0 0.0 0.0
45 2 0.79862450042 0.865532636642 1.44668483734
46 0 1.0 0.0 0.0
46 1 1.0 0.0 0.0
46 2 19.223270204 0.0334601141512 1.55469548702
47 0 1.0 0.0 0.0
47 1 1.0 0.0 0.0
47 2 0.798338115274 0.884270071983 1.41653800011
48 0 1.0 0.0 0.0
48 1 1.0 0.0 0.0
48 2 0.751243496389 0.85583126545 1.55536067486
49 0 1.0 0.0 0.0
49 1 1.0 0.0 0.0
49 2 0.763695519513 0.881657481194 1.48518264294
50 0 1.0 0.0 0.0
50 1 1.0 0.0 0.0
50 2 0.798410984151 0.880636096001 1.42225348949
51 0 1.0 0.0 0.0
51 1 1.0 0.0 0.0
51 2 0.711375303074 0.904846966267 1.5535531044
52 0 1.0 0.0 0.0
52 1 1.0 0.0 0.0
52 2 121.962605271 0.00448874663562 1.82661998272
53 0 1.0 0.0 0.0
53 1 1.0 0.0 0.0
53 2 1.0 0.0 0.0
