%!PS-Adobe-2.0
%%Title: swRecords.ps
%%Creator: fig2dev Version 3.2 Patchlevel 3d
%%CreationDate: Fri Jun 10 14:56:46 2005
%%For: calice@heppc74.hep.ph.ic.ac.uk (CALICE Librarian)
%%Orientation: Landscape
%%Pages: 1
%%BoundingBox: 0 0 595 842
%%BeginSetup
%%IncludeFeature: *PageSize A4
%%EndSetup
%%Magnification: 0.7500
%%EndComments
/$F2psDict 200 dict def
$F2psDict begin
$F2psDict /mtrx matrix put
/col-1 {0 setgray} bind def
/col0 {0.000 0.000 0.000 srgb} bind def
/col1 {0.000 0.000 1.000 srgb} bind def
/col2 {0.000 1.000 0.000 srgb} bind def
/col3 {0.000 1.000 1.000 srgb} bind def
/col4 {1.000 0.000 0.000 srgb} bind def
/col5 {1.000 0.000 1.000 srgb} bind def
/col6 {1.000 1.000 0.000 srgb} bind def
/col7 {1.000 1.000 1.000 srgb} bind def
/col8 {0.000 0.000 0.560 srgb} bind def
/col9 {0.000 0.000 0.690 srgb} bind def
/col10 {0.000 0.000 0.820 srgb} bind def
/col11 {0.530 0.810 1.000 srgb} bind def
/col12 {0.000 0.560 0.000 srgb} bind def
/col13 {0.000 0.690 0.000 srgb} bind def
/col14 {0.000 0.820 0.000 srgb} bind def
/col15 {0.000 0.560 0.560 srgb} bind def
/col16 {0.000 0.690 0.690 srgb} bind def
/col17 {0.000 0.820 0.820 srgb} bind def
/col18 {0.560 0.000 0.000 srgb} bind def
/col19 {0.690 0.000 0.000 srgb} bind def
/col20 {0.820 0.000 0.000 srgb} bind def
/col21 {0.560 0.000 0.560 srgb} bind def
/col22 {0.690 0.000 0.690 srgb} bind def
/col23 {0.820 0.000 0.820 srgb} bind def
/col24 {0.500 0.190 0.000 srgb} bind def
/col25 {0.630 0.250 0.000 srgb} bind def
/col26 {0.750 0.380 0.000 srgb} bind def
/col27 {1.000 0.500 0.500 srgb} bind def
/col28 {1.000 0.630 0.630 srgb} bind def
/col29 {1.000 0.750 0.750 srgb} bind def
/col30 {1.000 0.880 0.880 srgb} bind def
/col31 {1.000 0.840 0.000 srgb} bind def

end
save
newpath 0 842 moveto 0 0 lineto 595 0 lineto 595 842 lineto closepath clip newpath
22.4 101.5 translate
 90 rotate
1 -1 scale

/cp {closepath} bind def
/ef {eofill} bind def
/gr {grestore} bind def
/gs {gsave} bind def
/sa {save} bind def
/rs {restore} bind def
/l {lineto} bind def
/m {moveto} bind def
/rm {rmoveto} bind def
/n {newpath} bind def
/s {stroke} bind def
/sh {show} bind def
/slc {setlinecap} bind def
/slj {setlinejoin} bind def
/slw {setlinewidth} bind def
/srgb {setrgbcolor} bind def
/rot {rotate} bind def
/sc {scale} bind def
/sd {setdash} bind def
/ff {findfont} bind def
/sf {setfont} bind def
/scf {scalefont} bind def
/sw {stringwidth} bind def
/tr {translate} bind def
/tnt {dup dup currentrgbcolor
  4 -2 roll dup 1 exch sub 3 -1 roll mul add
  4 -2 roll dup 1 exch sub 3 -1 roll mul add
  4 -2 roll dup 1 exch sub 3 -1 roll mul add srgb}
  bind def
/shd {dup dup currentrgbcolor 4 -2 roll mul 4 -2 roll mul
  4 -2 roll mul srgb} bind def
/$F2psBegin {$F2psDict begin /$F2psEnteredState save def} def
/$F2psEnd {$F2psEnteredState restore end} def

$F2psBegin
10 setmiterlimit
 0.04500 0.04500 sc
%%Page: 1 1
%
% Fig objects follow
%
% Polyline
7.500 slw
n 6150 8175 m
 12300 7200 l gs col0 s gr 
% Polyline
n 5700 8175 m
 8025 4800 l gs col0 s gr 
% Polyline
n 6000 8175 m
 10425 7200 l gs col0 s gr 
% Polyline
n 5550 8175 m
 6300 4800 l gs col0 s gr 
% Polyline
n 2625 3825 m
 5400 8175 l gs col0 s gr 
% Polyline
n 9825 4800 m
 5850 8175 l gs col0 s gr 
% Polyline
n 10905 3600 m 10800 3600 10800 4695 105 arcto 4 {pop} repeat
  10800 4800 12345 4800 105 arcto 4 {pop} repeat
  12450 4800 12450 3705 105 arcto 4 {pop} repeat
  12450 3600 10905 3600 105 arcto 4 {pop} repeat
 cp gs col0 s gr 
% Polyline
n 9105 3600 m 9000 3600 9000 4695 105 arcto 4 {pop} repeat
  9000 4800 10545 4800 105 arcto 4 {pop} repeat
  10650 4800 10650 3705 105 arcto 4 {pop} repeat
  10650 3600 9105 3600 105 arcto 4 {pop} repeat
 cp gs col0 s gr 
% Polyline
n 7305 3600 m 7200 3600 7200 4695 105 arcto 4 {pop} repeat
  7200 4800 8745 4800 105 arcto 4 {pop} repeat
  8850 4800 8850 3705 105 arcto 4 {pop} repeat
  8850 3600 7305 3600 105 arcto 4 {pop} repeat
 cp gs col0 s gr 
% Polyline
n 5505 3600 m 5400 3600 5400 4695 105 arcto 4 {pop} repeat
  5400 4800 6945 4800 105 arcto 4 {pop} repeat
  7050 4800 7050 3705 105 arcto 4 {pop} repeat
  7050 3600 5505 3600 105 arcto 4 {pop} repeat
 cp gs col0 s gr 
% Polyline
n 1830 2625 m 1725 2625 1725 3720 105 arcto 4 {pop} repeat
  1725 3825 3270 3825 105 arcto 4 {pop} repeat
  3375 3825 3375 2730 105 arcto 4 {pop} repeat
  3375 2625 1830 2625 105 arcto 4 {pop} repeat
 cp gs col0 s gr 
% Polyline
n 11505 6000 m 11400 6000 11400 7095 105 arcto 4 {pop} repeat
  11400 7200 12945 7200 105 arcto 4 {pop} repeat
  13050 7200 13050 6105 105 arcto 4 {pop} repeat
  13050 6000 11505 6000 105 arcto 4 {pop} repeat
 cp gs col0 s gr 
% Polyline
n 9705 6000 m 9600 6000 9600 7095 105 arcto 4 {pop} repeat
  9600 7200 11145 7200 105 arcto 4 {pop} repeat
  11250 7200 11250 6105 105 arcto 4 {pop} repeat
  11250 6000 9705 6000 105 arcto 4 {pop} repeat
 cp gs col0 s gr 
% Polyline
n 5055 8175 m 4950 8175 4950 9270 105 arcto 4 {pop} repeat
  4950 9375 6495 9375 105 arcto 4 {pop} repeat
  6600 9375 6600 8280 105 arcto 4 {pop} repeat
  6600 8175 5055 8175 105 arcto 4 {pop} repeat
 cp gs col0 s gr 
% Polyline
n 5055 10725 m 4950 10725 4950 11820 105 arcto 4 {pop} repeat
  4950 11925 6495 11925 105 arcto 4 {pop} repeat
  6600 11925 6600 10830 105 arcto 4 {pop} repeat
  6600 10725 5055 10725 105 arcto 4 {pop} repeat
 cp gs col0 s gr 
% Polyline
n 5775 9375 m
 5775 10725 l gs col0 s gr 
% Polyline
n 11550 4800 m
 10500 6000 l gs col0 s gr 
% Polyline
n 11775 4800 m
 12375 6000 l gs col0 s gr 
% Polyline
n 5700 1500 m
 8100 3600 l gs col0 s gr 
% Polyline
n 5550 1500 m
 6300 3600 l gs col0 s gr 
% Polyline
n 5400 1500 m
 2550 2625 l gs col0 s gr 
% Polyline
n 5850 1500 m
 9900 3600 l gs col0 s gr 
% Polyline
n 6075 1500 m
 11625 3600 l gs col0 s gr 
% Polyline
n 4980 300 m 4875 300 4875 1395 105 arcto 4 {pop} repeat
  4875 1500 6420 1500 105 arcto 4 {pop} repeat
  6525 1500 6525 405 105 arcto 4 {pop} repeat
  6525 300 4980 300 105 arcto 4 {pop} repeat
 cp gs col0 s gr 
% Polyline
 [45] 0 sd
n 5175 3375 m 13275 3375 l 13275 7425 l 5175 7425 l
 cp gs col0 s gr  [] 0 sd
/Times-Roman ff 360.00 scf sf
5550 11400 m
gs 1 -1 sc (fix) col0 sh gr
/Times-Roman ff 360.00 scf sf
5550 8850 m
gs 1 -1 sc (sub) col0 sh gr
/Times-Roman ff 360.00 scf sf
10125 6675 m
gs 1 -1 sc (emc) col0 sh gr
/Times-Roman ff 360.00 scf sf
12000 6675 m
gs 1 -1 sc (ahc) col0 sh gr
/Times-Roman ff 360.00 scf sf
11475 4275 m
gs 1 -1 sc (crc) col0 sh gr
/Times-Roman ff 360.00 scf sf
9600 4275 m
gs 1 -1 sc (dhc) col0 sh gr
/Times-Roman ff 360.00 scf sf
7800 4275 m
gs 1 -1 sc (daq) col0 sh gr
/Times-Roman ff 360.00 scf sf
6000 4275 m
gs 1 -1 sc (bml) col0 sh gr
/Times-Roman ff 360.00 scf sf
2325 3300 m
gs 1 -1 sc (rcd) col0 sh gr
/Times-Roman ff 360.00 scf sf
5475 975 m
gs 1 -1 sc (utl) col0 sh gr
/Times-Roman ff 360.00 scf sf
825 7425 m
gs 1 -1 sc (Records subpackage) col0 sh gr
/Times-Roman ff 360.00 scf sf
825 7800 m
gs 1 -1 sc (structure) col0 sh gr
/Times-Roman ff 360.00 scf sf
10950 7800 m
gs 1 -1 sc (Data subrecords) col0 sh gr
$F2psEnd
rs
showpage
