0 0 0.5 1.0 2.0
0 1 0.755332505901 0.888704299927 1.48971962929
0 2 1.0 1.0 1.0
1 0 1.0 1.0 1.0
1 1 0.735257954462 0.898078501225 1.51441860199
1 2 0.5 1.0 2.0
2 0 0.571428571429 1.0 1.75
2 1 0.749845179099 0.894302248955 1.49122810364
2 2 0.5 1.0 2.0
3 0 0.666666666667 1.0 1.5
3 1 0.580706785511 0.895559191704 1.92286503315
3 2 1.0 1.0 1.0
4 0 0.749999977648 1.0 1.33333337307
4 1 0.684892903022 0.909465014935 1.60542988777
4 2 1.0 1.0 1.0
5 0 0.600000014305 1.0 1.66666662693
5 1 0.635543746 0.925709545612 1.6997294426
5 2 1.0 0.0 0.0
6 0 2.99999991059 0.333333343267 1.0
6 1 0.580934405569 0.917140543461 1.87688219547
6 2 1.0 1.0 1.0
7 0 1.0 1.0 1.0
7 1 0.636929451129 0.910423457623 1.7245080471
7 2 1.0 0.0 0.0
8 0 1.0 1.0 1.0
8 1 0.655135718381 0.920389950275 1.65842890739
8 2 1.0 0.0 0.0
9 0 1.0 1.0 1.0
9 1 0.698466806622 0.917073190212 1.56117022038
9 2 1.0 0.0 0.0
10 0 1.4999999553 0.666666686535 1.0
10 1 0.657142859381 0.925120770931 1.64490866661
10 2 1.0 0.0 0.0
11 0 1.0 1.0 1.0
11 1 0.644615369719 0.929196476936 1.66952049732
11 2 1.0 0.0 0.0
12 0 0.749999977648 1.0 1.33333337307
12 1 0.548941799634 0.965461850166 1.88685524464
12 2 1.0 0.0 0.0
13 0 0.600000014305 1.0 1.66666662693
13 1 0.66756464634 0.934624671936 1.60276341438
13 2 1.0 0.0 0.0
14 0 0.600000014305 0.666666686535 2.5
14 1 0.685226003635 0.925181031227 1.57739126682
14 2 1.0 0.0 0.0
15 0 0.749999977648 1.0 1.33333337307
15 1 0.838235308813 0.850877165794 1.40206182003
15 2 1.0 0.0 0.0
16 0 0.5 1.0 2.0
16 1 0.607194926569 0.947157740593 1.7387996912
16 2 1.0 0.0 0.0
17 0 0.600000014305 1.0 1.66666662693
17 1 0.627204027213 0.95100402832 1.67652022839
17 2 1.0 0.0 0.0
18 0 0.600000014305 1.0 1.66666662693
18 1 0.60774819893 0.92988049984 1.76949441433
18 2 1.0 0.0 0.0
19 0 0.749999977648 1.0 1.33333337307
19 1 0.718358035449 0.911111116409 1.52787458897
19 2 1.0 0.0 0.0
20 0 0.5 1.0 2.0
20 1 0.656151431402 0.947115361691 1.60913705826
20 2 1.0 0.0 0.0
21 0 1.0 1.0 1.0
21 1 0.582479039426 0.958400011063 1.79131889343
21 2 1.0 0.0 0.0
22 0 0.300000007153 1.0 3.33333325386
22 1 0.811734342902 0.864972174168 1.42424237728
22 2 1.0 0.0 0.0
23 0 1.0 1.0 1.0
23 1 0.639793279683 0.938610672951 1.66523230076
23 2 1.0 0.0 0.0
24 0 1.4999999553 0.666666686535 1.0
24 1 0.651236199401 0.920032322407 1.66900789738
24 2 1.0 0.0 0.0
25 0 0.749999977648 1.0 1.33333337307
25 1 0.711583912719 0.945182740688 1.48681902885
25 2 1.0 0.0 0.0
26 0 0.666666666667 1.0 1.5
26 1 1.02377048895 0.766212999821 1.27481710911
26 2 1.0 0.0 0.0
27 0 0.666666666667 1.0 1.5
27 1 0.701025045288 0.910641729832 1.56645846367
27 2 1.0 0.0 0.0
28 0 0.5 1.0 2.0
28 1 0.793307121799 0.841191053391 1.49852502346
28 2 1.0 0.0 0.0
29 0 0.571428571429 1.0 1.75
29 1 0.656323205579 0.947368443012 1.60828626156
29 2 1.0 0.0 0.0
30 0 0.4 1.0 2.5
30 1 0.502337454442 0.975465297699 2.04076313972
30 2 1.0 0.0 0.0
31 0 1.0 0.75 1.33333337307
31 1 0.397242273895 0.966942131519 2.60341882706
31 2 1.0 1.0 1.0
32 0 1.20000002861 0.833333313465 1.0
32 1 1.00246103795 0.657119452953 1.51805722713
32 2 1.0 1.0 1.0
33 0 0.749999977648 1.0 1.33333337307
33 1 0.567645624249 0.965224742889 1.82513177395
33 2 1.0 0.75 1.33333337307
34 0 0.666666666667 1.0 1.5
34 1 0.70981338964 0.932994067669 1.50999999046
34 2 1.0 1.0 1.0
35 0 1.0 1.0 1.0
35 1 0.720207234313 0.919064760208 1.51076316833
35 2 1.0 1.0 1.0
36 0 0.624999990687 0.800000011921 2.0
36 1 0.556279052002 0.968227446079 1.8566493988
36 2 1.0 0.800000011921 1.25
37 0 1.0 0.0 0.0
37 1 0.745035234735 0.923473775387 1.45344507694
37 2 0.857142886337 0.833333313465 1.39999997616
38 0 1.0 0.5 2.0
38 1 2.21157327217 0.39247751236 1.1520832777
38 2 0.874999960884 0.857142865658 1.33333337307
39 0 1.0 1.0 1.0
39 1 0.714737486781 0.932743370533 1.5
39 2 1.12499999162 0.777777791023 1.14285719395
40 0 0.749999977648 1.0 1.33333337307
40 1 0.819172080952 0.86081558466 1.41812562943
40 2 0.83333330022 1.0 1.20000004768
41 0 0.8 0.75 1.66666662693
41 1 0.679746819955 0.9413408041 1.56280910969
41 2 4.24999998417 0.235294118524 1.0
42 0 2.99999991059 0.333333343267 1.0
42 1 0.641732263888 0.929886043072 1.67577755451
42 2 0.941176470588 0.875 1.21428573132
43 0 0.583333327538 0.857142865658 2.0
43 1 0.720026354419 0.892040252686 1.55692303181
43 2 0.928571381131 0.769230782986 1.39999997616
44 0 0.8 1.0 1.25
44 1 0.826415071662 0.84200912714 1.4370932579
44 2 1.0 1.0 1.0
45 0 0.666666666667 1.0 1.5
45 1 0.686973444521 0.919811308384 1.58256411552
45 2 0.916666639348 0.909090936184 1.20000004768
46 0 0.545454533632 0.666666686535 2.75
46 1 0.652202068158 0.922542214394 1.66200220585
46 2 12.9999995157 0.0769230797887 1.0
47 0 1.0 0.800000011921 1.25
47 1 0.99798181492 0.789686560631 1.26888608932
47 2 4.24999998417 0.235294118524 1.0
48 0 0.727272727273 0.625 2.20000004768
48 1 0.551564302621 0.931722700596 1.94588506222
48 2 0.909090889387 0.899999976158 1.22222220898
49 0 0.77777778808 0.857142865658 1.5
49 1 1.10302351572 0.660913705826 1.37173581123
49 2 0.687499979511 0.909090936184 1.60000002384
50 0 0.71428572645 1.0 1.39999997616
50 1 0.863537151281 0.828065752983 1.39847326279
50 2 0.909090889387 0.699999988079 1.57142853737
51 0 0.83333330022 1.0 1.20000004768
51 1 0.692589213317 0.906208693981 1.5932945013
51 2 1.12499999162 0.555555582047 1.60000002384
52 0 1.79999991417 0.333333343267 1.66666662693
52 1 0.577272724458 0.909448802471 1.90476191044
52 2 1.07692310655 0.428571432829 2.16666674614
53 0 1.0 0.0 0.0
53 1 1.0 0.0 0.0
53 2 1.0 0.0 0.0
