140849
140594
601135
794671
863040
1188394
1254182
1387567
1522735
1583136
1584160
1583394
1584162
1583139
1583651
1583907
1584419
1583396
1584676
1583398
1583654
1583911
1585707
1653808
1654326
1785401
1910309
2307100
2564399
2564144
2564400
2563641
2629680
2639920
2694959
2694448
2694704
2694960
2695216
2703152
2703154
2761264
2762035
2764349
2763070
2764606
2957358
2957359
2957615
2958127
2958383
3030312
3029039
3029040
3090737
3090738
3089205
3090485
3090997
3089974
3090742
3090998
3091254
3092534
3091255
3091256
3091769
3094329
