2230280
2230536
2230792
2231048
2231304
2231560
2231816
2232072
2230281
2230537
2230793
2231049
2231305
2231561
2231817
2232073
2230282
2230538
2230794
2231050
2231306
2231562
2231818
2232074
2230283
2230539
2230795
2231051
2231307
2231563
2231819
2232075
2230284
2230540
2230796
2231052
2231308
2231564
2231820
2232076
2230285
2230541
2230797
2231053
2231309
2231565
2231821
2232077
2230286
2230542
2230798
2231054
2231310
2231566
2231822
2232078
2230287
2230543
2230799
2231055
2231311
2231567
2231823
2232079
