0 0 1.0 1.0 1.0
0 1 42.5121952629 0.00659781973809 3.56521749496
0 2 1.0 0.0 0.0
1 0 0.285714285714 1.0 3.5
1 1 0.615113868478 0.907438576221 1.7915430069
1 2 1.0 0.0 0.0
2 0 1.0 1.0 1.0
2 1 0.743019528359 0.857332885265 1.56982159615
2 2 1.0 0.0 0.0
3 0 1.0 1.0 1.0
3 1 0.630990743131 0.923365116119 1.71634078026
3 2 2.0 0.5 1.0
4 0 1.0 0.0 0.0
4 1 0.797833109938 0.798324167728 1.57003259659
4 2 2.0 0.5 1.0
5 0 1.0 0.0 0.0
5 1 0.585663728553 0.904805064201 1.88710749149
5 2 0.666666666667 1.0 1.5
6 0 1.0 0.0 0.0
6 1 0.589957413338 0.879398524761 1.92749655247
6 2 0.5 1.0 2.0
7 0 1.0 0.0 0.0
7 1 0.670046637074 0.810835361481 1.84061217308
7 2 0.5 1.0 2.0
8 0 1.0 0.0 0.0
8 1 0.375470030863 0.966421186924 2.75586700439
8 2 0.666666666667 1.0 1.5
9 0 0.142857142857 1.0 7.0
9 1 0.769894073815 0.814079999924 1.59551882744
9 2 0.333333333333 1.0 3.0
10 0 1.0 0.0 0.0
10 1 0.691826613172 0.841334164143 1.71804368496
10 2 1.0 1.0 1.0
11 0 1.0 0.0 0.0
11 1 0.69117330689 0.846877932549 1.70841050148
11 2 1.0 1.0 1.0
12 0 1.0 0.0 0.0
12 1 1.14683816953 0.632398724556 1.3788176775
12 2 0.142857142857 1.0 7.0
13 0 1.0 0.0 0.0
13 1 0.68206769267 0.884976506233 1.65668809414
13 2 1.0 1.0 1.0
14 0 1.0 0.0 0.0
14 1 0.880999166325 0.765848994255 1.48211312294
14 2 0.5 1.0 2.0
15 0 1.0 0.0 0.0
15 1 1.34668847091 0.530054628849 1.40091633797
15 2 0.5 1.0 2.0
16 0 1.0 0.0 0.0
16 1 0.538774812883 0.921259820461 2.01470088959
16 2 0.5 1.0 2.0
17 0 1.0 0.0 0.0
17 1 0.602774039855 0.909875333309 1.82332277298
17 2 0.333333333333 1.0 3.0
18 0 1.0 0.0 0.0
18 1 0.783138169804 0.796351671219 1.60345470905
18 2 0.25 1.0 4.0
19 0 1.0 0.0 0.0
19 1 0.749841425575 0.825719118118 1.61509561539
19 2 0.5 1.0 2.0
20 0 1.0 0.0 0.0
20 1 0.688071623819 0.873868763447 1.66310679913
20 2 0.5 1.0 2.0
21 0 1.0 0.0 0.0
21 1 0.512576272885 0.931184649467 2.09510445595
21 2 0.5 1.0 2.0
22 0 1.0 0.0 0.0
22 1 0.501072796276 0.948287248611 2.10455012321
22 2 1.0 0.0 0.0
23 0 1.0 0.0 0.0
23 1 0.615873962614 0.919331014156 1.76618516445
23 2 0.5 1.0 2.0
24 0 1.0 0.0 0.0
24 1 0.731757482023 0.81273406744 1.68145155907
24 2 0.5 1.0 2.0
25 0 1.0 0.0 0.0
25 1 3.98014201121 0.210976481438 1.19087839127
25 2 0.333333333333 1.0 3.0
26 0 1.0 0.0 0.0
26 1 1.0 0.0 0.0
26 2 0.5 1.0 2.0
27 0 1.0 0.0 0.0
27 1 0.773116802588 0.813302218914 1.59038734436
27 2 0.333333333333 1.0 3.0
28 0 1.0 0.0 0.0
28 1 0.776962598372 0.806421160698 1.5960187912
28 2 0.25 1.0 4.0
29 0 1.0 0.0 0.0
29 1 0.606196121161 0.944678604603 1.74623537064
29 2 1.0 1.0 1.0
30 0 1.0 0.0 0.0
30 1 0.363368145649 0.968457221985 2.84166407585
30 2 1.0 0.0 0.0
31 0 1.0 0.0 0.0
31 1 0.216599445145 0.98428863287 4.69051122665
31 2 1.0 0.0 0.0
32 0 1.0 0.0 0.0
32 1 0.631825582984 0.904224455357 1.75035667419
32 2 1.0 0.0 0.0
33 0 1.0 0.0 0.0
33 1 0.660980138545 0.916471123695 1.65079367161
33 2 1.0 0.0 0.0
34 0 1.0 0.0 0.0
34 1 0.841696137609 0.829974830151 1.43146181107
34 2 1.0 0.0 0.0
35 0 1.0 0.0 0.0
35 1 0.570272415187 0.932848751545 1.87977731228
35 2 1.0 0.0 0.0
36 0 1.0 0.0 0.0
36 1 12.959259423 0.017147757113 4.5
36 2 1.0 0.0 0.0
37 0 1.0 0.0 0.0
37 1 0.855842163455 0.808865249157 1.44454181194
37 2 0.5 1.0 2.0
38 0 1.0 0.0 0.0
38 1 0.391434532513 0.951114058495 2.686013937
38 2 1.0 1.0 1.0
39 0 1.0 0.0 0.0
39 1 0.634666644474 0.926470577717 1.70068025589
39 2 1.0 1.0 1.0
40 0 1.0 0.0 0.0
40 1 0.911055478149 0.74286699295 1.47755670547
40 2 2.0 0.5 1.0
41 0 1.0 0.0 0.0
41 1 0.618318882737 0.932397484779 1.73454833031
41 2 2.0 0.5 1.0
42 0 1.0 0.0 0.0
42 1 1.0 0.0 0.0
42 2 1.4999999553 0.333333343267 2.0
43 0 1.0 0.0 0.0
43 1 0.628309132052 0.869520902634 1.83040249348
43 2 2.0 0.5 1.0
44 0 1.0 0.0 0.0
44 1 0.669841288346 0.854903399944 1.74626863003
44 2 0.5 1.0 2.0
45 0 1.0 0.0 0.0
45 1 0.667202160726 0.869582653046 1.72358095646
45 2 1.0 0.0 0.0
46 0 1.0 0.0 0.0
46 1 0.598357517812 0.915735721588 1.82502615452
46 2 1.0 1.0 1.0
47 0 1.0 1.0 1.0
47 1 1.32799356505 0.564837157726 1.3331553936
47 2 0.666666666667 1.0 1.5
48 0 1.0 1.0 1.0
48 1 0.584905647221 0.865907669067 1.97443389893
48 2 0.5 1.0 2.0
49 0 1.0 0.0 0.0
49 1 0.804016262801 0.736958563328 1.68768763542
49 2 0.5 1.0 2.0
50 0 1.0 1.0 1.0
50 1 0.867820580237 0.760199427605 1.51580202579
50 2 1.0 1.0 1.0
51 0 2.0 0.5 1.0
51 1 0.556045164193 0.927191674709 1.93963670731
51 2 0.5 1.0 2.0
52 0 1.0 0.0 0.0
52 1 0.395014550626 0.932289242744 2.71541500092
52 2 1.0 0.0 0.0
53 0 1.0 0.0 0.0
53 1 1.0 0.0 0.0
53 2 1.0 0.0 0.0
