140849
140594
210177
210945
601135
863040
1064752
1387567
1583394
1584162
1583139
1583651
1583907
1584419
1583396
1584676
1583398
1583654
1583911
1585707
1653808
1910309
2564399
2564144
2564400
2637871
2638127
2629680
2639920
2703152
2703154
2765851
2766108
2761264
2762035
2764349
2763070
2764606
2762822
2961432
2957353
2957355
2957611
2957357
2957613
2957359
2957615
2958127
2958383
3030312
3030314
3030315
3029039
3029040
3089202
3089205
3090485
3089974
3091254
3091255
3089208
3089464
3091256
3091769
3094329
3091258
3089467
3089216
3157569
