3342376
3342632
3342888
3343144
3343400
3343656
3343912
3344168
3342377
3342633
3342889
3343145
3343401
3343657
3343913
3344169
3342378
3342634
3342890
3343146
3343402
3343658
3343914
3344170
3342379
3342635
3342891
3343147
3343403
3343659
3343915
3344171
3342380
3342636
3342892
3343148
3343404
3343660
3343916
3344172
3342381
3342637
3342893
3343149
3343405
3343661
3343917
3344173
3342382
3342638
3342894
3343150
3343406
3343662
3343918
3344174
3342383
3342639
3342895
3343151
3343407
3343663
3343919
3344175
