0 0 0.71428572645 0.600000023842 2.33333325386
0 1 1.84341492256 0.474489450455 1.14327394962
0 2 0.699999983311 0.714285731316 2.0
1 0 0.421052631579 0.625 3.79999995232
1 1 0.589158182212 0.950855135918 1.78506374359
1 2 1.0 0.571428596973 1.75
2 0 0.454545444693 1.0 2.20000004768
2 1 0.611596139291 0.949318706989 1.7223572731
2 2 0.874999960884 0.714285731316 1.60000002384
3 0 0.583333327538 0.857142865658 2.0
3 1 0.563148748102 0.952807843685 1.86368083954
3 2 1.20000002861 0.666666686535 1.25
4 0 0.545454533632 0.833333313465 2.20000004768
4 1 0.613693608092 0.93802601099 1.73713481426
4 2 0.380952380952 0.875 3.0
5 0 1.0 0.833333313465 1.20000004768
5 1 0.565973314147 0.951465845108 1.85699546337
5 2 0.874999960884 0.714285731316 1.60000002384
6 0 3.49999984354 0.285714298487 1.0
6 1 0.538239711563 0.943914830685 1.9683008194
6 2 0.624999990687 1.0 1.60000002384
7 0 0.83333330022 1.0 1.20000004768
7 1 0.578887871929 0.921660244465 1.87428092957
7 2 0.41666665011 1.0 2.40000009537
8 0 0.888888888889 0.75 1.5
8 1 0.476269389056 0.962978422642 2.18037295341
8 2 0.545454533632 0.833333313465 2.20000004768
9 0 0.749999977648 0.833333313465 1.60000002384
9 1 0.614282632425 0.935320198536 1.74048960209
9 2 0.71428572645 1.0 1.39999997616
10 0 0.470588235294 0.75 2.83333325386
10 1 0.559812848669 0.943987846375 1.89230322838
10 2 0.71428572645 1.0 1.39999997616
11 0 0.8 1.0 1.25
11 1 0.569827394484 0.950585961342 1.84614276886
11 2 0.624999990687 1.0 1.60000002384
12 0 0.749999977648 1.0 1.33333337307
12 1 0.640293689397 0.92108297348 1.69559454918
12 2 0.600000014305 1.0 1.66666662693
13 0 0.636363650156 1.0 1.57142853737
13 1 0.597971463973 0.947814762592 1.76439607143
13 2 0.749999977648 1.0 1.33333337307
14 0 1.0 0.75 1.33333337307
14 1 0.628469225708 0.928478360176 1.71373713017
14 2 0.77777778808 0.857142865658 1.5
15 0 0.77777778808 0.857142865658 1.5
15 1 0.618217401898 0.934378862381 1.73115432262
15 2 0.636363650156 1.0 1.57142853737
16 0 0.749999977648 1.0 1.33333337307
16 1 0.531905619846 0.960557818413 1.95723032951
16 2 0.857142886337 0.833333313465 1.39999997616
17 0 0.384615398723 1.0 2.59999990463
17 1 0.556042694726 0.95762771368 1.87799811363
17 2 0.83333330022 1.0 1.20000004768
18 0 1.4999999553 0.666666686535 1.0
18 1 0.800489801652 0.818206548691 1.52679681778
18 2 1.24999998137 0.800000011921 1.0
19 0 0.5 1.0 2.0
19 1 0.642408640306 0.934322476387 1.66606462002
19 2 0.624999990687 1.0 1.60000002384
20 0 1.39999996662 0.714285731316 1.0
20 1 0.605923243295 0.9465072155 1.7436466217
20 2 0.83333330022 1.0 1.20000004768
21 0 0.699999983311 1.0 1.42857146263
21 1 0.586053414743 0.933544278145 1.82779657841
21 2 0.83333330022 1.0 1.20000004768
22 0 0.179487172904 1.0 5.57142877579
22 1 0.381881204949 0.850562274456 3.07868742943
22 2 1.0 1.0 1.0
23 0 0.699999983311 1.0 1.42857146263
23 1 0.592962886098 0.957846939564 1.76066350937
23 2 1.24999998137 0.800000011921 1.0
24 0 0.615384615385 0.875 1.85714280605
24 1 0.609715639294 0.934005260468 1.75599515438
24 2 1.39999996662 0.714285731316 1.0
25 0 0.874999960884 0.714285731316 1.60000002384
25 1 0.647086693304 0.957665085793 1.61370396614
25 2 1.0 1.0 1.0
26 0 0.583333327538 1.0 1.71428573132
26 1 1.0 0.0 0.0
26 2 0.368421066501 1.0 2.71428561211
27 0 0.571428571429 1.0 1.75
27 1 0.586054315501 0.942473173141 1.81047737598
27 2 0.5 0.75 2.66666674614
28 0 0.77777778808 0.857142865658 1.5
28 1 0.665444868977 0.921882808208 1.63009238243
28 2 1.0 0.833333313465 1.20000004768
29 0 0.5 1.0 2.0
29 1 0.607625641653 0.966629862785 1.70256495476
29 2 0.874999960884 0.857142865658 1.33333337307
30 0 0.454545444693 1.0 2.20000004768
30 1 0.478932986328 0.965189874172 2.16327857971
30 2 2.66666666667 0.375 1.0
31 0 0.384615398723 0.800000011921 3.25
31 1 0.276275018236 0.977019429207 3.70471835136
31 2 0.538461553275 1.0 1.85714280605
32 0 1.0 0.0 0.0
32 1 0.623236908999 0.94234764576 1.70269036293
32 2 0.818181827049 0.888888895512 1.375
33 0 0.555555570273 1.0 1.79999995232
33 1 0.562585931824 0.966510951519 1.83909583092
33 2 0.769230797446 1.0 1.29999995232
34 0 0.41666665011 1.0 2.40000009537
34 1 0.616071439719 0.953623175621 1.70212769508
34 2 0.526315796078 0.899999976158 2.11111116409
35 0 0.666666666667 1.0 1.5
35 1 0.563171470195 0.957128226757 1.85519361496
35 2 0.692307705005 1.0 1.44444441795
36 0 0.857142886337 0.833333313465 1.39999997616
36 1 0.865435467263 0.825008511543 1.40057659149
36 2 0.727272727273 1.0 1.375
37 0 0.749999977648 0.833333313465 1.60000002384
37 1 0.643643031738 0.937525451183 1.65718829632
37 2 0.785714299095 0.909090936184 1.39999997616
38 0 1.0 0.0 0.0
38 1 0.516370078043 0.948441803455 2.04187059402
38 2 0.909090889387 0.899999976158 1.22222220898
39 0 1.20000002861 0.583333313465 1.42857146263
39 1 0.624136034532 0.955771446228 1.67635774612
39 2 1.09090906726 0.833333313465 1.10000002384
40 0 1.09090906726 0.583333313465 1.57142853737
40 1 0.677200400704 0.919878065586 1.60528635979
40 2 0.736842133002 0.857142865658 1.58333337307
41 0 0.72222220309 0.923076927662 1.5
41 1 0.613712106042 0.961042463779 1.69548022747
41 2 4.0 0.25 1.0
42 0 1.24999998137 0.800000011921 1.0
42 1 0.542128325037 0.956884860992 1.9276945591
42 2 0.8 1.0 1.25
43 0 0.583333327538 0.928571403027 1.84615385532
43 1 0.603117491685 0.934804975986 1.77368724346
43 2 1.0 0.882352948189 1.13333332539
44 0 0.736842133002 0.785714268684 1.72727274895
44 1 0.65271233361 0.911184430122 1.6814032793
44 2 0.866666673554 0.923076927662 1.25
45 0 0.8 0.916666686535 1.36363637447
45 1 0.584685011583 0.948215603828 1.80372750759
45 2 0.791666698125 0.89473682642 1.41176474094
46 0 0.916666639348 0.818181812763 1.33333337307
46 1 0.618745493712 0.948795616627 1.70339477062
46 2 1.66666660044 0.5 1.20000004768
47 0 1.79999991417 0.444444447756 1.25
47 1 0.757155539959 0.88341397047 1.4950324297
47 2 1.6923077699 0.409090906382 1.44444441795
48 0 0.608695633245 0.785714268684 2.09090900421
48 1 0.570812928262 0.924433767796 1.89509248734
48 2 0.740740727659 0.800000011921 1.6875
49 0 0.5 0.846153855324 2.36363625526
49 1 0.712970646148 0.855985164642 1.63855910301
49 2 0.733333327505 0.909090936184 1.5
50 0 0.692307705005 1.0 1.44444441795
50 1 0.765559894651 0.860174119473 1.5185687542
50 2 0.684210539194 1.0 1.46153843403
51 0 0.769230797446 0.899999976158 1.44444441795
51 1 0.584647888433 0.9611338377 1.77959728241
51 2 0.812499969732 0.923076927662 1.33333337307
52 0 1.0 0.727272748947 1.375
52 1 0.493523590106 0.937950491905 2.16029071808
52 2 1.4999999553 0.388888895512 1.71428573132
53 0 1.0 0.0 0.0
53 1 1.0 0.0 0.0
53 2 1.0 0.0 0.0
