0 0 1.0 1.0 1.0
0 1 0.775838937596 0.898248255253 1.43493437767
0 2 0.916666639348 0.909090936184 1.20000004768
1 0 0.727272727273 0.875 1.57142853737
1 1 0.65442059968 0.937371551991 1.630163908
1 2 0.578947361156 0.95454543829 1.80952382088
2 0 0.857142886337 1.0 1.16666662693
2 1 0.716192250726 0.909737169743 1.53480935097
2 2 0.666666666667 1.0 1.5
3 0 0.615384615385 0.75 2.16666674614
3 1 0.592998809069 0.930645167828 1.81201612949
3 2 0.687499979511 1.0 1.45454549789
4 0 0.363636363636 1.0 2.75
4 1 0.704304780328 0.907183051109 1.56510853767
4 2 0.83333330022 0.920000016689 1.30434787273
5 0 2.0 0.5 1.0
5 1 0.635656775373 0.928339481354 1.69461286068
5 2 0.68571426703 0.833333313465 1.75
6 0 1.24999998137 0.40000000596 2.0
6 1 0.592440755275 0.925929903984 1.82295918465
6 2 0.827586179681 0.916666686535 1.31818187237
7 0 0.444444444444 1.0 2.25
7 1 0.68239294313 0.88188123703 1.66171050072
7 2 0.560975593445 0.956521749496 1.86363637447
8 0 0.555555570273 1.0 1.79999995232
8 1 0.697386064247 0.906692326069 1.58149123192
8 2 0.733333327505 0.95454543829 1.42857146263
9 0 1.24999998137 0.800000011921 1.0
9 1 0.725556202139 0.904163837433 1.52433991432
9 2 0.647058841679 1.0 1.54545450211
10 0 0.71428572645 0.800000011921 1.75
10 1 0.654325501159 0.917198896408 1.666259408
10 2 0.724137942941 1.0 1.38095235825
11 0 0.571428571429 1.0 1.75
11 1 1.54063837091 0.533319115639 1.21706044674
11 2 0.676470585863 0.913043498993 1.61904764175
12 0 0.857142886337 0.833333313465 1.39999997616
12 1 0.578020575986 0.953746914864 1.81394267082
12 2 0.785714299095 1.0 1.27272725105
13 0 0.8 1.0 1.25
13 1 0.707282611097 0.924802839756 1.52882540226
13 2 0.785714299095 1.0 1.27272725105
14 0 0.83333330022 1.0 1.20000004768
14 1 0.71406088094 0.907327830791 1.5434782505
14 2 0.814814800425 0.95454543829 1.28571426868
15 0 2.0 0.5 1.0
15 1 0.718972803919 0.897110581398 1.55039215088
15 2 0.821428606401 0.869565188885 1.39999997616
16 0 1.0 0.75 1.33333337307
16 1 0.629881963509 0.943349778652 1.68293786049
16 2 0.84615388495 0.95454543829 1.23809528351
17 0 0.333333333333 1.0 3.0
17 1 0.651343399333 0.937157571316 1.6382393837
17 2 0.758620658471 0.863636374474 1.5263158083
18 0 1.0 1.0 1.0
18 1 0.574556564275 0.952416419983 1.8274282217
18 2 0.807692278066 0.952380955219 1.29999995232
19 0 0.5 1.0 2.0
19 1 0.745484935328 0.896371424198 1.4964877367
19 2 0.904761940714 0.89473682642 1.23529410362
20 0 1.0 0.5 2.0
20 1 0.69546900131 0.917313218117 1.5674892664
20 2 0.724137942941 0.952380955219 1.45000004768
21 0 0.666666666667 1.0 1.5
21 1 0.585171715709 0.95308983326 1.79301047325
21 2 0.578947361156 0.95454543829 1.80952382088
22 0 1.0 0.666666686535 1.5
22 1 0.795882205827 0.859626829624 1.46164286137
22 2 0.814814800425 0.818181812763 1.5
23 0 1.0 0.75 1.33333337307
23 1 0.656859229875 0.938791036606 1.62165606022
23 2 0.689655149734 1.0 1.45000004768
24 0 2.99999991059 0.333333343267 1.0
24 1 0.695600199842 0.8977663517 1.60131573677
24 2 0.785714299095 0.909090936184 1.39999997616
25 0 0.83333330022 1.0 1.20000004768
25 1 0.737758844395 0.925470590591 1.46461319923
25 2 0.718749986612 0.956521749496 1.45454549789
26 0 0.83333330022 1.0 1.20000004768
26 1 0.968807759879 0.779919505119 1.3234654665
26 2 0.57500001885 0.869565188885 2.0
27 0 1.16666665508 0.857142865658 1.0
27 1 0.69193138465 0.909822702408 1.58847439289
27 2 0.656249987776 0.952380955219 1.60000002384
28 0 0.749999977648 0.833333313465 1.60000002384
28 1 0.712018843875 0.898940861225 1.56234657764
28 2 0.920000017548 0.782608687878 1.38888883591
29 0 0.749999977648 1.0 1.33333337307
29 1 0.652489251198 0.953919172287 1.60662698746
29 2 1.04545453412 0.695652186871 1.375
30 0 1.20000002861 0.833333313465 1.0
30 1 0.4835991187 0.97044223547 2.13081026077
30 2 0.774193572204 0.916666686535 1.40909087658
31 0 1.0 1.0 1.0
31 1 0.412789930939 0.973043203354 2.48965287209
31 2 0.648648665368 0.958333313465 1.60869562626
32 0 1.74999992177 0.571428596973 1.0
32 1 0.888069814082 0.758191347122 1.48516273499
32 2 0.735294109913 1.0 1.36000001431
33 0 0.699999983311 1.0 1.42857146263
33 1 0.619083725079 0.942243516445 1.71430253983
33 2 0.69444441685 0.959999978542 1.5
34 0 0.77777778808 1.0 1.28571426868
34 1 0.738779195097 0.922567129135 1.46719348431
34 2 0.925925889133 0.839999973774 1.28571426868
35 0 0.749999977648 1.0 1.33333337307
35 1 0.730895159695 0.906915783882 1.50861346722
35 2 0.702702729871 0.923076927662 1.54166662693
36 0 1.6 0.4375 1.42857146263
36 1 0.581789935514 0.959406018257 1.79155993462
36 2 0.749999977648 0.925925910473 1.44000005722
37 0 1.0 0.857142865658 1.16666662693
37 1 0.787374536531 0.88660132885 1.43248558044
37 2 0.466666681502 1.0 2.14285707474
38 0 1.36363633408 0.666666686535 1.10000002384
38 1 0.842262952745 0.827816724777 1.434227705
38 2 0.794117669333 0.85185188055 1.47826087475
39 0 1.21052634237 0.739130437374 1.11764705181
39 1 0.721058886076 0.928986310959 1.49286305904
39 2 0.820512820513 0.875 1.39285719395
40 0 0.933333363003 0.785714268684 1.36363637447
40 1 1.14320719013 0.680668652058 1.28510701656
40 2 0.734693848953 0.916666686535 1.4848484993
41 0 0.894736847719 0.882352948189 1.26666665077
41 1 0.66159188544 0.956546008587 1.5801705122
41 2 1.32000001259 0.636363625526 1.19047617912
42 0 2.70588234345 0.347826093435 1.0625
42 1 0.635935981323 0.93618196249 1.67967915535
42 2 0.863636368316 0.842105269432 1.375
43 0 0.78260868754 0.861111104488 1.48387098312
43 1 0.729323930594 0.891551375389 1.53791797161
43 2 0.921052585348 0.885714292526 1.22580647469
44 0 0.780487804878 0.8125 1.57692313194
44 1 0.757859557879 0.87632393837 1.50572836399
44 2 0.739130446275 0.852941155434 1.58620691299
45 0 0.899999957085 0.75 1.48148143291
45 1 0.733191227375 0.899127721786 1.51691544056
45 2 0.79069766565 0.882352948189 1.4333332777
46 0 1.04761906546 0.727272748947 1.3125
46 1 0.789045738667 0.821084797382 1.54351127148
46 2 4.11111104304 0.216216221452 1.125
47 0 1.6399999609 0.56097561121 1.08695650101
47 1 1.00275606439 0.782753109932 1.27403068542
47 2 1.06896551504 0.709677398205 1.31818187237
48 0 0.940000006723 0.829787254333 1.28205132484
48 1 0.569874737867 0.936842083931 1.87307071686
48 2 0.864864864865 0.90625 1.27586209774
49 0 0.716666692297 0.883720934391 1.57894742489
49 1 0.823721862997 0.815045952797 1.48948907852
49 2 1.0 0.827586233616 1.20833337307
50 0 0.843749993714 0.85185188055 1.39130437374
50 1 0.866343914638 0.819469690323 1.40856468678
50 2 1.0 0.857142865658 1.16666662693
51 0 0.8 0.714285731316 1.75
51 1 0.683723132415 0.938842535019 1.55785489082
51 2 0.935483838591 0.72413790226 1.47619044781
52 0 10.9999996722 0.0909090936184 1.0
52 1 0.55614447703 0.938733816147 1.91544592381
52 2 1.44000005493 0.444444447756 1.5625
53 0 1.0 0.0 0.0
53 1 1.0 0.0 0.0
53 2 1.0 0.0 0.0
