409600
409856
410112
410368
410624
410880
411136
411392
411648
411904
412160
412416
412672
412928
413184
413440
413696
413952
414208
414464
414720
414976
415232
415488
415744
416000
416256
416512
416768
417024
417280
417536
409601
409857
410113
410369
410625
410881
411137
411393
411649
411905
412161
412417
412673
412929
413185
413441
413697
413953
414209
414465
414721
414977
415233
415489
415745
416001
416257
416513
416769
417025
417281
417537
409602
409858
410114
410370
410626
410882
411138
411394
411650
411906
412162
412418
412674
412930
413186
413442
413698
413954
414210
414466
414722
414978
415234
415490
415746
416002
416258
416514
416770
417026
417282
417538
409603
409859
410115
410371
410627
410883
411139
411395
411651
411907
412163
412419
412675
412931
413187
413443
413699
413955
414211
414467
414723
414979
415235
415491
415747
416003
416259
416515
416771
417027
417283
417539
409604
409860
410116
410372
410628
410884
411140
411396
411652
411908
412164
412420
412676
412932
413188
413444
413700
413956
414212
414468
414724
414980
415236
415492
415748
416004
416260
416516
416772
417028
417284
417540
409605
409861
410117
410373
410629
410885
411141
411397
411653
411909
412165
412421
412677
412933
413189
413445
413701
413957
414213
414469
414725
414981
415237
415493
415749
416005
416261
416517
416773
417029
417285
417541
409606
409862
410118
410374
410630
410886
411142
411398
411654
411910
412166
412422
412678
412934
413190
413446
413702
413958
414214
414470
414726
414982
415238
415494
415750
416006
416262
416518
416774
417030
417286
417542
409607
409863
410119
410375
410631
410887
411143
411399
411655
411911
412167
412423
412679
412935
413191
413447
413703
413959
414215
414471
414727
414983
415239
415495
415751
416007
416263
416519
416775
417031
417287
417543
409608
409864
410120
410376
410632
410888
411144
411400
411656
411912
412168
412424
412680
412936
413192
413448
413704
413960
414216
414472
414728
414984
415240
415496
415752
416008
416264
416520
416776
417032
417288
417544
409609
409865
410121
410377
410633
410889
411145
411401
411657
411913
412169
412425
412681
412937
413193
413449
413705
413961
414217
414473
414729
414985
415241
415497
415753
416009
416265
416521
416777
417033
417289
417545
409610
409866
410122
410378
410634
410890
411146
411402
411658
411914
412170
412426
412682
412938
413194
413450
413706
413962
414218
414474
414730
414986
415242
415498
415754
416010
416266
416522
416778
417034
417290
417546
409611
409867
410123
410379
410635
410891
411147
411403
411659
411915
412171
412427
412683
412939
413195
413451
413707
413963
414219
414475
414731
414987
415243
415499
415755
416011
416267
416523
416779
417035
417291
417547
409612
409868
410124
410380
410636
410892
411148
411404
411660
411916
412172
412428
412684
412940
413196
413452
413708
413964
414220
414476
414732
414988
415244
415500
415756
416012
416268
416524
416780
417036
417292
417548
409613
409869
410125
410381
410637
410893
411149
411405
411661
411917
412173
412429
412685
412941
413197
413453
413709
413965
414221
414477
414733
414989
415245
415501
415757
416013
416269
416525
416781
417037
417293
417549
409614
409870
410126
410382
410638
410894
411150
411406
411662
411918
412174
412430
412686
412942
413198
413454
413710
413966
414222
414478
414734
414990
415246
415502
415758
416014
416270
416526
416782
417038
417294
417550
409615
409871
410127
410383
410639
410895
411151
411407
411663
411919
412175
412431
412687
412943
413199
413455
413711
413967
414223
414479
414735
414991
415247
415503
415759
416015
416271
416527
416783
417039
417295
417551
409616
409872
410128
410384
410640
410896
411152
411408
411664
411920
412176
412432
412688
412944
413200
413456
413712
413968
414224
414480
414736
414992
415248
415504
415760
416016
416272
416528
416784
417040
417296
417552
409617
409873
410129
410385
410641
410897
411153
411409
411665
411921
412177
412433
412689
412945
413201
413457
413713
413969
414225
414481
414737
414993
415249
415505
415761
416017
416273
416529
416785
417041
417297
417553
409618
409874
410130
410386
410642
410898
411154
411410
411666
411922
412178
412434
412690
412946
413202
413458
413714
413970
414226
414482
414738
414994
415250
415506
415762
416018
416274
416530
416786
417042
417298
417554
409619
409875
410131
410387
410643
410899
411155
411411
411667
411923
412179
412435
412691
412947
413203
413459
413715
413971
414227
414483
414739
414995
415251
415507
415763
416019
416275
416531
416787
417043
417299
417555
409620
409876
410132
410388
410644
410900
411156
411412
411668
411924
412180
412436
412692
412948
413204
413460
413716
413972
414228
414484
414740
414996
415252
415508
415764
416020
416276
416532
416788
417044
417300
417556
409621
409877
410133
410389
410645
410901
411157
411413
411669
411925
412181
412437
412693
412949
413205
413461
413717
413973
414229
414485
414741
414997
415253
415509
415765
416021
416277
416533
416789
417045
417301
417557
409622
409878
410134
410390
410646
410902
411158
411414
411670
411926
412182
412438
412694
412950
413206
413462
413718
413974
414230
414486
414742
414998
415254
415510
415766
416022
416278
416534
416790
417046
417302
417558
409623
409879
410135
410391
410647
410903
411159
411415
411671
411927
412183
412439
412695
412951
413207
413463
413719
413975
414231
414487
414743
414999
415255
415511
415767
416023
416279
416535
416791
417047
417303
417559
409624
409880
410136
410392
410648
410904
411160
411416
411672
411928
412184
412440
412696
412952
413208
413464
413720
413976
414232
414488
414744
415000
415256
415512
415768
416024
416280
416536
416792
417048
417304
417560
409625
409881
410137
410393
410649
410905
411161
411417
411673
411929
412185
412441
412697
412953
413209
413465
413721
413977
414233
414489
414745
415001
415257
415513
415769
416025
416281
416537
416793
417049
417305
417561
409626
409882
410138
410394
410650
410906
411162
411418
411674
411930
412186
412442
412698
412954
413210
413466
413722
413978
414234
414490
414746
415002
415258
415514
415770
416026
416282
416538
416794
417050
417306
417562
409627
409883
410139
410395
410651
410907
411163
411419
411675
411931
412187
412443
412699
412955
413211
413467
413723
413979
414235
414491
414747
415003
415259
415515
415771
416027
416283
416539
416795
417051
417307
417563
409628
409884
410140
410396
410652
410908
411164
411420
411676
411932
412188
412444
412700
412956
413212
413468
413724
413980
414236
414492
414748
415004
415260
415516
415772
416028
416284
416540
416796
417052
417308
417564
409629
409885
410141
410397
410653
410909
411165
411421
411677
411933
412189
412445
412701
412957
413213
413469
413725
413981
414237
414493
414749
415005
415261
415517
415773
416029
416285
416541
416797
417053
417309
417565
409630
409886
410142
410398
410654
410910
411166
411422
411678
411934
412190
412446
412702
412958
413214
413470
413726
413982
414238
414494
414750
415006
415262
415518
415774
416030
416286
416542
416798
417054
417310
417566
409631
409887
410143
410399
410655
410911
411167
411423
411679
411935
412191
412447
412703
412959
413215
413471
413727
413983
414239
414495
414751
415007
415263
415519
415775
416031
416287
416543
416799
417055
417311
417567
409632
409888
410144
410400
410656
410912
411168
411424
411680
411936
412192
412448
412704
412960
413216
413472
413728
413984
414240
414496
414752
415008
415264
415520
415776
416032
416288
416544
416800
417056
417312
417568
409633
409889
410145
410401
410657
410913
411169
411425
411681
411937
412193
412449
412705
412961
413217
413473
413729
413985
414241
414497
414753
415009
415265
415521
415777
416033
416289
416545
416801
417057
417313
417569
409634
409890
410146
410402
410658
410914
411170
411426
411682
411938
412194
412450
412706
412962
413218
413474
413730
413986
414242
414498
414754
415010
415266
415522
415778
416034
416290
416546
416802
417058
417314
417570
409635
409891
410147
410403
410659
410915
411171
411427
411683
411939
412195
412451
412707
412963
413219
413475
413731
413987
414243
414499
414755
415011
415267
415523
415779
416035
416291
416547
416803
417059
417315
417571
409636
409892
410148
410404
410660
410916
411172
411428
411684
411940
412196
412452
412708
412964
413220
413476
413732
413988
414244
414500
414756
415012
415268
415524
415780
416036
416292
416548
416804
417060
417316
417572
409637
409893
410149
410405
410661
410917
411173
411429
411685
411941
412197
412453
412709
412965
413221
413477
413733
413989
414245
414501
414757
415013
415269
415525
415781
416037
416293
416549
416805
417061
417317
417573
409638
409894
410150
410406
410662
410918
411174
411430
411686
411942
412198
412454
412710
412966
413222
413478
413734
413990
414246
414502
414758
415014
415270
415526
415782
416038
416294
416550
416806
417062
417318
417574
409639
409895
410151
410407
410663
410919
411175
411431
411687
411943
412199
412455
412711
412967
413223
413479
413735
413991
414247
414503
414759
415015
415271
415527
415783
416039
416295
416551
416807
417063
417319
417575
409640
409896
410152
410408
410664
410920
411176
411432
411688
411944
412200
412456
412712
412968
413224
413480
413736
413992
414248
414504
414760
415016
415272
415528
415784
416040
416296
416552
416808
417064
417320
417576
409641
409897
410153
410409
410665
410921
411177
411433
411689
411945
412201
412457
412713
412969
413225
413481
413737
413993
414249
414505
414761
415017
415273
415529
415785
416041
416297
416553
416809
417065
417321
417577
409642
409898
410154
410410
410666
410922
411178
411434
411690
411946
412202
412458
412714
412970
413226
413482
413738
413994
414250
414506
414762
415018
415274
415530
415786
416042
416298
416554
416810
417066
417322
417578
409643
409899
410155
410411
410667
410923
411179
411435
411691
411947
412203
412459
412715
412971
413227
413483
413739
413995
414251
414507
414763
415019
415275
415531
415787
416043
416299
416555
416811
417067
417323
417579
409644
409900
410156
410412
410668
410924
411180
411436
411692
411948
412204
412460
412716
412972
413228
413484
413740
413996
414252
414508
414764
415020
415276
415532
415788
416044
416300
416556
416812
417068
417324
417580
409645
409901
410157
410413
410669
410925
411181
411437
411693
411949
412205
412461
412717
412973
413229
413485
413741
413997
414253
414509
414765
415021
415277
415533
415789
416045
416301
416557
416813
417069
417325
417581
409646
409902
410158
410414
410670
410926
411182
411438
411694
411950
412206
412462
412718
412974
413230
413486
413742
413998
414254
414510
414766
415022
415278
415534
415790
416046
416302
416558
416814
417070
417326
417582
409647
409903
410159
410415
410671
410927
411183
411439
411695
411951
412207
412463
412719
412975
413231
413487
413743
413999
414255
414511
414767
415023
415279
415535
415791
416047
416303
416559
416815
417071
417327
417583
409648
409904
410160
410416
410672
410928
411184
411440
411696
411952
412208
412464
412720
412976
413232
413488
413744
414000
414256
414512
414768
415024
415280
415536
415792
416048
416304
416560
416816
417072
417328
417584
409649
409905
410161
410417
410673
410929
411185
411441
411697
411953
412209
412465
412721
412977
413233
413489
413745
414001
414257
414513
414769
415025
415281
415537
415793
416049
416305
416561
416817
417073
417329
417585
409650
409906
410162
410418
410674
410930
411186
411442
411698
411954
412210
412466
412722
412978
413234
413490
413746
414002
414258
414514
414770
415026
415282
415538
415794
416050
416306
416562
416818
417074
417330
417586
409651
409907
410163
410419
410675
410931
411187
411443
411699
411955
412211
412467
412723
412979
413235
413491
413747
414003
414259
414515
414771
415027
415283
415539
415795
416051
416307
416563
416819
417075
417331
417587
409652
409908
410164
410420
410676
410932
411188
411444
411700
411956
412212
412468
412724
412980
413236
413492
413748
414004
414260
414516
414772
415028
415284
415540
415796
416052
416308
416564
416820
417076
417332
417588
409653
409909
410165
410421
410677
410933
411189
411445
411701
411957
412213
412469
412725
412981
413237
413493
413749
414005
414261
414517
414773
415029
415285
415541
415797
416053
416309
416565
416821
417077
417333
417589
409654
409910
410166
410422
410678
410934
411190
411446
411702
411958
412214
412470
412726
412982
413238
413494
413750
414006
414262
414518
414774
415030
415286
415542
415798
416054
416310
416566
416822
417078
417334
417590
409655
409911
410167
410423
410679
410935
411191
411447
411703
411959
412215
412471
412727
412983
413239
413495
413751
414007
414263
414519
414775
415031
415287
415543
415799
416055
416311
416567
416823
417079
417335
417591
409656
409912
410168
410424
410680
410936
411192
411448
411704
411960
412216
412472
412728
412984
413240
413496
413752
414008
414264
414520
414776
415032
415288
415544
415800
416056
416312
416568
416824
417080
417336
417592
409657
409913
410169
410425
410681
410937
411193
411449
411705
411961
412217
412473
412729
412985
413241
413497
413753
414009
414265
414521
414777
415033
415289
415545
415801
416057
416313
416569
416825
417081
417337
417593
409658
409914
410170
410426
410682
410938
411194
411450
411706
411962
412218
412474
412730
412986
413242
413498
413754
414010
414266
414522
414778
415034
415290
415546
415802
416058
416314
416570
416826
417082
417338
417594
409659
409915
410171
410427
410683
410939
411195
411451
411707
411963
412219
412475
412731
412987
413243
413499
413755
414011
414267
414523
414779
415035
415291
415547
415803
416059
416315
416571
416827
417083
417339
417595
409660
409916
410172
410428
410684
410940
411196
411452
411708
411964
412220
412476
412732
412988
413244
413500
413756
414012
414268
414524
414780
415036
415292
415548
415804
416060
416316
416572
416828
417084
417340
417596
409661
409917
410173
410429
410685
410941
411197
411453
411709
411965
412221
412477
412733
412989
413245
413501
413757
414013
414269
414525
414781
415037
415293
415549
415805
416061
416317
416573
416829
417085
417341
417597
409662
409918
410174
410430
410686
410942
411198
411454
411710
411966
412222
412478
412734
412990
413246
413502
413758
414014
414270
414526
414782
415038
415294
415550
415806
416062
416318
416574
416830
417086
417342
417598
409663
409919
410175
410431
410687
410943
411199
411455
411711
411967
412223
412479
412735
412991
413247
413503
413759
414015
414271
414527
414783
415039
415295
415551
415807
416063
416319
416575
416831
417087
417343
417599
409664
409920
410176
410432
410688
410944
411200
411456
411712
411968
412224
412480
412736
412992
413248
413504
413760
414016
414272
414528
414784
415040
415296
415552
415808
416064
416320
416576
416832
417088
417344
417600
409665
409921
410177
410433
410689
410945
411201
411457
411713
411969
412225
412481
412737
412993
413249
413505
413761
414017
414273
414529
414785
415041
415297
415553
415809
416065
416321
416577
416833
417089
417345
417601
409666
409922
410178
410434
410690
410946
411202
411458
411714
411970
412226
412482
412738
412994
413250
413506
413762
414018
414274
414530
414786
415042
415298
415554
415810
416066
416322
416578
416834
417090
417346
417602
409667
409923
410179
410435
410691
410947
411203
411459
411715
411971
412227
412483
412739
412995
413251
413507
413763
414019
414275
414531
414787
415043
415299
415555
415811
416067
416323
416579
416835
417091
417347
417603
409668
409924
410180
410436
410692
410948
411204
411460
411716
411972
412228
412484
412740
412996
413252
413508
413764
414020
414276
414532
414788
415044
415300
415556
415812
416068
416324
416580
416836
417092
417348
417604
409669
409925
410181
410437
410693
410949
411205
411461
411717
411973
412229
412485
412741
412997
413253
413509
413765
414021
414277
414533
414789
415045
415301
415557
415813
416069
416325
416581
416837
417093
417349
417605
409670
409926
410182
410438
410694
410950
411206
411462
411718
411974
412230
412486
412742
412998
413254
413510
413766
414022
414278
414534
414790
415046
415302
415558
415814
416070
416326
416582
416838
417094
417350
417606
409671
409927
410183
410439
410695
410951
411207
411463
411719
411975
412231
412487
412743
412999
413255
413511
413767
414023
414279
414535
414791
415047
415303
415559
415815
416071
416327
416583
416839
417095
417351
417607
409672
409928
410184
410440
410696
410952
411208
411464
411720
411976
412232
412488
412744
413000
413256
413512
413768
414024
414280
414536
414792
415048
415304
415560
415816
416072
416328
416584
416840
417096
417352
417608
409673
409929
410185
410441
410697
410953
411209
411465
411721
411977
412233
412489
412745
413001
413257
413513
413769
414025
414281
414537
414793
415049
415305
415561
415817
416073
416329
416585
416841
417097
417353
417609
409674
409930
410186
410442
410698
410954
411210
411466
411722
411978
412234
412490
412746
413002
413258
413514
413770
414026
414282
414538
414794
415050
415306
415562
415818
416074
416330
416586
416842
417098
417354
417610
409675
409931
410187
410443
410699
410955
411211
411467
411723
411979
412235
412491
412747
413003
413259
413515
413771
414027
414283
414539
414795
415051
415307
415563
415819
416075
416331
416587
416843
417099
417355
417611
409676
409932
410188
410444
410700
410956
411212
411468
411724
411980
412236
412492
412748
413004
413260
413516
413772
414028
414284
414540
414796
415052
415308
415564
415820
416076
416332
416588
416844
417100
417356
417612
409677
409933
410189
410445
410701
410957
411213
411469
411725
411981
412237
412493
412749
413005
413261
413517
413773
414029
414285
414541
414797
415053
415309
415565
415821
416077
416333
416589
416845
417101
417357
417613
409678
409934
410190
410446
410702
410958
411214
411470
411726
411982
412238
412494
412750
413006
413262
413518
413774
414030
414286
414542
414798
415054
415310
415566
415822
416078
416334
416590
416846
417102
417358
417614
409679
409935
410191
410447
410703
410959
411215
411471
411727
411983
412239
412495
412751
413007
413263
413519
413775
414031
414287
414543
414799
415055
415311
415567
415823
416079
416335
416591
416847
417103
417359
417615
409680
409936
410192
410448
410704
410960
411216
411472
411728
411984
412240
412496
412752
413008
413264
413520
413776
414032
414288
414544
414800
415056
415312
415568
415824
416080
416336
416592
416848
417104
417360
417616
409681
409937
410193
410449
410705
410961
411217
411473
411729
411985
412241
412497
412753
413009
413265
413521
413777
414033
414289
414545
414801
415057
415313
415569
415825
416081
416337
416593
416849
417105
417361
417617
409682
409938
410194
410450
410706
410962
411218
411474
411730
411986
412242
412498
412754
413010
413266
413522
413778
414034
414290
414546
414802
415058
415314
415570
415826
416082
416338
416594
416850
417106
417362
417618
409683
409939
410195
410451
410707
410963
411219
411475
411731
411987
412243
412499
412755
413011
413267
413523
413779
414035
414291
414547
414803
415059
415315
415571
415827
416083
416339
416595
416851
417107
417363
417619
409684
409940
410196
410452
410708
410964
411220
411476
411732
411988
412244
412500
412756
413012
413268
413524
413780
414036
414292
414548
414804
415060
415316
415572
415828
416084
416340
416596
416852
417108
417364
417620
409685
409941
410197
410453
410709
410965
411221
411477
411733
411989
412245
412501
412757
413013
413269
413525
413781
414037
414293
414549
414805
415061
415317
415573
415829
416085
416341
416597
416853
417109
417365
417621
409686
409942
410198
410454
410710
410966
411222
411478
411734
411990
412246
412502
412758
413014
413270
413526
413782
414038
414294
414550
414806
415062
415318
415574
415830
416086
416342
416598
416854
417110
417366
417622
409687
409943
410199
410455
410711
410967
411223
411479
411735
411991
412247
412503
412759
413015
413271
413527
413783
414039
414295
414551
414807
415063
415319
415575
415831
416087
416343
416599
416855
417111
417367
417623
409688
409944
410200
410456
410712
410968
411224
411480
411736
411992
412248
412504
412760
413016
413272
413528
413784
414040
414296
414552
414808
415064
415320
415576
415832
416088
416344
416600
416856
417112
417368
417624
409689
409945
410201
410457
410713
410969
411225
411481
411737
411993
412249
412505
412761
413017
413273
413529
413785
414041
414297
414553
414809
415065
415321
415577
415833
416089
416345
416601
416857
417113
417369
417625
409690
409946
410202
410458
410714
410970
411226
411482
411738
411994
412250
412506
412762
413018
413274
413530
413786
414042
414298
414554
414810
415066
415322
415578
415834
416090
416346
416602
416858
417114
417370
417626
409691
409947
410203
410459
410715
410971
411227
411483
411739
411995
412251
412507
412763
413019
413275
413531
413787
414043
414299
414555
414811
415067
415323
415579
415835
416091
416347
416603
416859
417115
417371
417627
409692
409948
410204
410460
410716
410972
411228
411484
411740
411996
412252
412508
412764
413020
413276
413532
413788
414044
414300
414556
414812
415068
415324
415580
415836
416092
416348
416604
416860
417116
417372
417628
409693
409949
410205
410461
410717
410973
411229
411485
411741
411997
412253
412509
412765
413021
413277
413533
413789
414045
414301
414557
414813
415069
415325
415581
415837
416093
416349
416605
416861
417117
417373
417629
409694
409950
410206
410462
410718
410974
411230
411486
411742
411998
412254
412510
412766
413022
413278
413534
413790
414046
414302
414558
414814
415070
415326
415582
415838
416094
416350
416606
416862
417118
417374
417630
409695
409951
410207
410463
410719
410975
411231
411487
411743
411999
412255
412511
412767
413023
413279
413535
413791
414047
414303
414559
414815
415071
415327
415583
415839
416095
416351
416607
416863
417119
417375
417631
1589248
1589504
1589760
1590016
1590272
1590528
1590784
1591040
1591296
1591552
1591808
1592064
1592320
1592576
1592832
1593088
1593344
1593600
1593856
1594112
1594368
1594624
1594880
1595136
1595392
1595648
1595904
1596160
1596416
1596672
1596928
1597184
1589249
1589505
1589761
1590017
1590273
1590529
1590785
1591041
1591297
1591553
1591809
1592065
1592321
1592577
1592833
1593089
1593345
1593601
1593857
1594113
1594369
1594625
1594881
1595137
1595393
1595649
1595905
1596161
1596417
1596673
1596929
1597185
1589250
1589506
1589762
1590018
1590274
1590530
1590786
1591042
1591298
1591554
1591810
1592066
1592322
1592578
1592834
1593090
1593346
1593602
1593858
1594114
1594370
1594626
1594882
1595138
1595394
1595650
1595906
1596162
1596418
1596674
1596930
1597186
1589251
1589507
1589763
1590019
1590275
1590531
1590787
1591043
1591299
1591555
1591811
1592067
1592323
1592579
1592835
1593091
1593347
1593603
1593859
1594115
1594371
1594627
1594883
1595139
1595395
1595651
1595907
1596163
1596419
1596675
1596931
1597187
1589252
1589508
1589764
1590020
1590276
1590532
1590788
1591044
1591300
1591556
1591812
1592068
1592324
1592580
1592836
1593092
1593348
1593604
1593860
1594116
1594372
1594628
1594884
1595140
1595396
1595652
1595908
1596164
1596420
1596676
1596932
1597188
1589253
1589509
1589765
1590021
1590277
1590533
1590789
1591045
1591301
1591557
1591813
1592069
1592325
1592581
1592837
1593093
1593349
1593605
1593861
1594117
1594373
1594629
1594885
1595141
1595397
1595653
1595909
1596165
1596421
1596677
1596933
1597189
1589254
1589510
1589766
1590022
1590278
1590534
1590790
1591046
1591302
1591558
1591814
1592070
1592326
1592582
1592838
1593094
1593350
1593606
1593862
1594118
1594374
1594630
1594886
1595142
1595398
1595654
1595910
1596166
1596422
1596678
1596934
1597190
1589255
1589511
1589767
1590023
1590279
1590535
1590791
1591047
1591303
1591559
1591815
1592071
1592327
1592583
1592839
1593095
1593351
1593607
1593863
1594119
1594375
1594631
1594887
1595143
1595399
1595655
1595911
1596167
1596423
1596679
1596935
1597191
1589256
1589512
1589768
1590024
1590280
1590536
1590792
1591048
1591304
1591560
1591816
1592072
1592328
1592584
1592840
1593096
1593352
1593608
1593864
1594120
1594376
1594632
1594888
1595144
1595400
1595656
1595912
1596168
1596424
1596680
1596936
1597192
1589257
1589513
1589769
1590025
1590281
1590537
1590793
1591049
1591305
1591561
1591817
1592073
1592329
1592585
1592841
1593097
1593353
1593609
1593865
1594121
1594377
1594633
1594889
1595145
1595401
1595657
1595913
1596169
1596425
1596681
1596937
1597193
1589258
1589514
1589770
1590026
1590282
1590538
1590794
1591050
1591306
1591562
1591818
1592074
1592330
1592586
1592842
1593098
1593354
1593610
1593866
1594122
1594378
1594634
1594890
1595146
1595402
1595658
1595914
1596170
1596426
1596682
1596938
1597194
1589259
1589515
1589771
1590027
1590283
1590539
1590795
1591051
1591307
1591563
1591819
1592075
1592331
1592587
1592843
1593099
1593355
1593611
1593867
1594123
1594379
1594635
1594891
1595147
1595403
1595659
1595915
1596171
1596427
1596683
1596939
1597195
1589260
1589516
1589772
1590028
1590284
1590540
1590796
1591052
1591308
1591564
1591820
1592076
1592332
1592588
1592844
1593100
1593356
1593612
1593868
1594124
1594380
1594636
1594892
1595148
1595404
1595660
1595916
1596172
1596428
1596684
1596940
1597196
1589261
1589517
1589773
1590029
1590285
1590541
1590797
1591053
1591309
1591565
1591821
1592077
1592333
1592589
1592845
1593101
1593357
1593613
1593869
1594125
1594381
1594637
1594893
1595149
1595405
1595661
1595917
1596173
1596429
1596685
1596941
1597197
1589262
1589518
1589774
1590030
1590286
1590542
1590798
1591054
1591310
1591566
1591822
1592078
1592334
1592590
1592846
1593102
1593358
1593614
1593870
1594126
1594382
1594638
1594894
1595150
1595406
1595662
1595918
1596174
1596430
1596686
1596942
1597198
1589263
1589519
1589775
1590031
1590287
1590543
1590799
1591055
1591311
1591567
1591823
1592079
1592335
1592591
1592847
1593103
1593359
1593615
1593871
1594127
1594383
1594639
1594895
1595151
1595407
1595663
1595919
1596175
1596431
1596687
1596943
1597199
1589264
1589520
1589776
1590032
1590288
1590544
1590800
1591056
1591312
1591568
1591824
1592080
1592336
1592592
1592848
1593104
1593360
1593616
1593872
1594128
1594384
1594640
1594896
1595152
1595408
1595664
1595920
1596176
1596432
1596688
1596944
1597200
1589265
1589521
1589777
1590033
1590289
1590545
1590801
1591057
1591313
1591569
1591825
1592081
1592337
1592593
1592849
1593105
1593361
1593617
1593873
1594129
1594385
1594641
1594897
1595153
1595409
1595665
1595921
1596177
1596433
1596689
1596945
1597201
1589266
1589522
1589778
1590034
1590290
1590546
1590802
1591058
1591314
1591570
1591826
1592082
1592338
1592594
1592850
1593106
1593362
1593618
1593874
1594130
1594386
1594642
1594898
1595154
1595410
1595666
1595922
1596178
1596434
1596690
1596946
1597202
1589267
1589523
1589779
1590035
1590291
1590547
1590803
1591059
1591315
1591571
1591827
1592083
1592339
1592595
1592851
1593107
1593363
1593619
1593875
1594131
1594387
1594643
1594899
1595155
1595411
1595667
1595923
1596179
1596435
1596691
1596947
1597203
1589268
1589524
1589780
1590036
1590292
1590548
1590804
1591060
1591316
1591572
1591828
1592084
1592340
1592596
1592852
1593108
1593364
1593620
1593876
1594132
1594388
1594644
1594900
1595156
1595412
1595668
1595924
1596180
1596436
1596692
1596948
1597204
1589269
1589525
1589781
1590037
1590293
1590549
1590805
1591061
1591317
1591573
1591829
1592085
1592341
1592597
1592853
1593109
1593365
1593621
1593877
1594133
1594389
1594645
1594901
1595157
1595413
1595669
1595925
1596181
1596437
1596693
1596949
1597205
1589270
1589526
1589782
1590038
1590294
1590550
1590806
1591062
1591318
1591574
1591830
1592086
1592342
1592598
1592854
1593110
1593366
1593622
1593878
1594134
1594390
1594646
1594902
1595158
1595414
1595670
1595926
1596182
1596438
1596694
1596950
1597206
1589271
1589527
1589783
1590039
1590295
1590551
1590807
1591063
1591319
1591575
1591831
1592087
1592343
1592599
1592855
1593111
1593367
1593623
1593879
1594135
1594391
1594647
1594903
1595159
1595415
1595671
1595927
1596183
1596439
1596695
1596951
1597207
1589272
1589528
1589784
1590040
1590296
1590552
1590808
1591064
1591320
1591576
1591832
1592088
1592344
1592600
1592856
1593112
1593368
1593624
1593880
1594136
1594392
1594648
1594904
1595160
1595416
1595672
1595928
1596184
1596440
1596696
1596952
1597208
1589273
1589529
1589785
1590041
1590297
1590553
1590809
1591065
1591321
1591577
1591833
1592089
1592345
1592601
1592857
1593113
1593369
1593625
1593881
1594137
1594393
1594649
1594905
1595161
1595417
1595673
1595929
1596185
1596441
1596697
1596953
1597209
1589274
1589530
1589786
1590042
1590298
1590554
1590810
1591066
1591322
1591578
1591834
1592090
1592346
1592602
1592858
1593114
1593370
1593626
1593882
1594138
1594394
1594650
1594906
1595162
1595418
1595674
1595930
1596186
1596442
1596698
1596954
1597210
1589275
1589531
1589787
1590043
1590299
1590555
1590811
1591067
1591323
1591579
1591835
1592091
1592347
1592603
1592859
1593115
1593371
1593627
1593883
1594139
1594395
1594651
1594907
1595163
1595419
1595675
1595931
1596187
1596443
1596699
1596955
1597211
1589276
1589532
1589788
1590044
1590300
1590556
1590812
1591068
1591324
1591580
1591836
1592092
1592348
1592604
1592860
1593116
1593372
1593628
1593884
1594140
1594396
1594652
1594908
1595164
1595420
1595676
1595932
1596188
1596444
1596700
1596956
1597212
1589277
1589533
1589789
1590045
1590301
1590557
1590813
1591069
1591325
1591581
1591837
1592093
1592349
1592605
1592861
1593117
1593373
1593629
1593885
1594141
1594397
1594653
1594909
1595165
1595421
1595677
1595933
1596189
1596445
1596701
1596957
1597213
1589278
1589534
1589790
1590046
1590302
1590558
1590814
1591070
1591326
1591582
1591838
1592094
1592350
1592606
1592862
1593118
1593374
1593630
1593886
1594142
1594398
1594654
1594910
1595166
1595422
1595678
1595934
1596190
1596446
1596702
1596958
1597214
1589279
1589535
1589791
1590047
1590303
1590559
1590815
1591071
1591327
1591583
1591839
1592095
1592351
1592607
1592863
1593119
1593375
1593631
1593887
1594143
1594399
1594655
1594911
1595167
1595423
1595679
1595935
1596191
1596447
1596703
1596959
1597215
1589280
1589536
1589792
1590048
1590304
1590560
1590816
1591072
1591328
1591584
1591840
1592096
1592352
1592608
1592864
1593120
1593376
1593632
1593888
1594144
1594400
1594656
1594912
1595168
1595424
1595680
1595936
1596192
1596448
1596704
1596960
1597216
1589281
1589537
1589793
1590049
1590305
1590561
1590817
1591073
1591329
1591585
1591841
1592097
1592353
1592609
1592865
1593121
1593377
1593633
1593889
1594145
1594401
1594657
1594913
1595169
1595425
1595681
1595937
1596193
1596449
1596705
1596961
1597217
1589282
1589538
1589794
1590050
1590306
1590562
1590818
1591074
1591330
1591586
1591842
1592098
1592354
1592610
1592866
1593122
1593378
1593634
1593890
1594146
1594402
1594658
1594914
1595170
1595426
1595682
1595938
1596194
1596450
1596706
1596962
1597218
1589283
1589539
1589795
1590051
1590307
1590563
1590819
1591075
1591331
1591587
1591843
1592099
1592355
1592611
1592867
1593123
1593379
1593635
1593891
1594147
1594403
1594659
1594915
1595171
1595427
1595683
1595939
1596195
1596451
1596707
1596963
1597219
1589284
1589540
1589796
1590052
1590308
1590564
1590820
1591076
1591332
1591588
1591844
1592100
1592356
1592612
1592868
1593124
1593380
1593636
1593892
1594148
1594404
1594660
1594916
1595172
1595428
1595684
1595940
1596196
1596452
1596708
1596964
1597220
1589285
1589541
1589797
1590053
1590309
1590565
1590821
1591077
1591333
1591589
1591845
1592101
1592357
1592613
1592869
1593125
1593381
1593637
1593893
1594149
1594405
1594661
1594917
1595173
1595429
1595685
1595941
1596197
1596453
1596709
1596965
1597221
1589286
1589542
1589798
1590054
1590310
1590566
1590822
1591078
1591334
1591590
1591846
1592102
1592358
1592614
1592870
1593126
1593382
1593638
1593894
1594150
1594406
1594662
1594918
1595174
1595430
1595686
1595942
1596198
1596454
1596710
1596966
1597222
1589287
1589543
1589799
1590055
1590311
1590567
1590823
1591079
1591335
1591591
1591847
1592103
1592359
1592615
1592871
1593127
1593383
1593639
1593895
1594151
1594407
1594663
1594919
1595175
1595431
1595687
1595943
1596199
1596455
1596711
1596967
1597223
1589288
1589544
1589800
1590056
1590312
1590568
1590824
1591080
1591336
1591592
1591848
1592104
1592360
1592616
1592872
1593128
1593384
1593640
1593896
1594152
1594408
1594664
1594920
1595176
1595432
1595688
1595944
1596200
1596456
1596712
1596968
1597224
1589289
1589545
1589801
1590057
1590313
1590569
1590825
1591081
1591337
1591593
1591849
1592105
1592361
1592617
1592873
1593129
1593385
1593641
1593897
1594153
1594409
1594665
1594921
1595177
1595433
1595689
1595945
1596201
1596457
1596713
1596969
1597225
1589290
1589546
1589802
1590058
1590314
1590570
1590826
1591082
1591338
1591594
1591850
1592106
1592362
1592618
1592874
1593130
1593386
1593642
1593898
1594154
1594410
1594666
1594922
1595178
1595434
1595690
1595946
1596202
1596458
1596714
1596970
1597226
1589291
1589547
1589803
1590059
1590315
1590571
1590827
1591083
1591339
1591595
1591851
1592107
1592363
1592619
1592875
1593131
1593387
1593643
1593899
1594155
1594411
1594667
1594923
1595179
1595435
1595691
1595947
1596203
1596459
1596715
1596971
1597227
1589292
1589548
1589804
1590060
1590316
1590572
1590828
1591084
1591340
1591596
1591852
1592108
1592364
1592620
1592876
1593132
1593388
1593644
1593900
1594156
1594412
1594668
1594924
1595180
1595436
1595692
1595948
1596204
1596460
1596716
1596972
1597228
1589293
1589549
1589805
1590061
1590317
1590573
1590829
1591085
1591341
1591597
1591853
1592109
1592365
1592621
1592877
1593133
1593389
1593645
1593901
1594157
1594413
1594669
1594925
1595181
1595437
1595693
1595949
1596205
1596461
1596717
1596973
1597229
1589294
1589550
1589806
1590062
1590318
1590574
1590830
1591086
1591342
1591598
1591854
1592110
1592366
1592622
1592878
1593134
1593390
1593646
1593902
1594158
1594414
1594670
1594926
1595182
1595438
1595694
1595950
1596206
1596462
1596718
1596974
1597230
1589295
1589551
1589807
1590063
1590319
1590575
1590831
1591087
1591343
1591599
1591855
1592111
1592367
1592623
1592879
1593135
1593391
1593647
1593903
1594159
1594415
1594671
1594927
1595183
1595439
1595695
1595951
1596207
1596463
1596719
1596975
1597231
1589296
1589552
1589808
1590064
1590320
1590576
1590832
1591088
1591344
1591600
1591856
1592112
1592368
1592624
1592880
1593136
1593392
1593648
1593904
1594160
1594416
1594672
1594928
1595184
1595440
1595696
1595952
1596208
1596464
1596720
1596976
1597232
1589297
1589553
1589809
1590065
1590321
1590577
1590833
1591089
1591345
1591601
1591857
1592113
1592369
1592625
1592881
1593137
1593393
1593649
1593905
1594161
1594417
1594673
1594929
1595185
1595441
1595697
1595953
1596209
1596465
1596721
1596977
1597233
1589298
1589554
1589810
1590066
1590322
1590578
1590834
1591090
1591346
1591602
1591858
1592114
1592370
1592626
1592882
1593138
1593394
1593650
1593906
1594162
1594418
1594674
1594930
1595186
1595442
1595698
1595954
1596210
1596466
1596722
1596978
1597234
1589299
1589555
1589811
1590067
1590323
1590579
1590835
1591091
1591347
1591603
1591859
1592115
1592371
1592627
1592883
1593139
1593395
1593651
1593907
1594163
1594419
1594675
1594931
1595187
1595443
1595699
1595955
1596211
1596467
1596723
1596979
1597235
1589300
1589556
1589812
1590068
1590324
1590580
1590836
1591092
1591348
1591604
1591860
1592116
1592372
1592628
1592884
1593140
1593396
1593652
1593908
1594164
1594420
1594676
1594932
1595188
1595444
1595700
1595956
1596212
1596468
1596724
1596980
1597236
1589301
1589557
1589813
1590069
1590325
1590581
1590837
1591093
1591349
1591605
1591861
1592117
1592373
1592629
1592885
1593141
1593397
1593653
1593909
1594165
1594421
1594677
1594933
1595189
1595445
1595701
1595957
1596213
1596469
1596725
1596981
1597237
1589302
1589558
1589814
1590070
1590326
1590582
1590838
1591094
1591350
1591606
1591862
1592118
1592374
1592630
1592886
1593142
1593398
1593654
1593910
1594166
1594422
1594678
1594934
1595190
1595446
1595702
1595958
1596214
1596470
1596726
1596982
1597238
1589303
1589559
1589815
1590071
1590327
1590583
1590839
1591095
1591351
1591607
1591863
1592119
1592375
1592631
1592887
1593143
1593399
1593655
1593911
1594167
1594423
1594679
1594935
1595191
1595447
1595703
1595959
1596215
1596471
1596727
1596983
1597239
1589304
1589560
1589816
1590072
1590328
1590584
1590840
1591096
1591352
1591608
1591864
1592120
1592376
1592632
1592888
1593144
1593400
1593656
1593912
1594168
1594424
1594680
1594936
1595192
1595448
1595704
1595960
1596216
1596472
1596728
1596984
1597240
1589305
1589561
1589817
1590073
1590329
1590585
1590841
1591097
1591353
1591609
1591865
1592121
1592377
1592633
1592889
1593145
1593401
1593657
1593913
1594169
1594425
1594681
1594937
1595193
1595449
1595705
1595961
1596217
1596473
1596729
1596985
1597241
1589306
1589562
1589818
1590074
1590330
1590586
1590842
1591098
1591354
1591610
1591866
1592122
1592378
1592634
1592890
1593146
1593402
1593658
1593914
1594170
1594426
1594682
1594938
1595194
1595450
1595706
1595962
1596218
1596474
1596730
1596986
1597242
1589307
1589563
1589819
1590075
1590331
1590587
1590843
1591099
1591355
1591611
1591867
1592123
1592379
1592635
1592891
1593147
1593403
1593659
1593915
1594171
1594427
1594683
1594939
1595195
1595451
1595707
1595963
1596219
1596475
1596731
1596987
1597243
1589308
1589564
1589820
1590076
1590332
1590588
1590844
1591100
1591356
1591612
1591868
1592124
1592380
1592636
1592892
1593148
1593404
1593660
1593916
1594172
1594428
1594684
1594940
1595196
1595452
1595708
1595964
1596220
1596476
1596732
1596988
1597244
1589309
1589565
1589821
1590077
1590333
1590589
1590845
1591101
1591357
1591613
1591869
1592125
1592381
1592637
1592893
1593149
1593405
1593661
1593917
1594173
1594429
1594685
1594941
1595197
1595453
1595709
1595965
1596221
1596477
1596733
1596989
1597245
1589310
1589566
1589822
1590078
1590334
1590590
1590846
1591102
1591358
1591614
1591870
1592126
1592382
1592638
1592894
1593150
1593406
1593662
1593918
1594174
1594430
1594686
1594942
1595198
1595454
1595710
1595966
1596222
1596478
1596734
1596990
1597246
1589311
1589567
1589823
1590079
1590335
1590591
1590847
1591103
1591359
1591615
1591871
1592127
1592383
1592639
1592895
1593151
1593407
1593663
1593919
1594175
1594431
1594687
1594943
1595199
1595455
1595711
1595967
1596223
1596479
1596735
1596991
1597247
1589312
1589568
1589824
1590080
1590336
1590592
1590848
1591104
1591360
1591616
1591872
1592128
1592384
1592640
1592896
1593152
1593408
1593664
1593920
1594176
1594432
1594688
1594944
1595200
1595456
1595712
1595968
1596224
1596480
1596736
1596992
1597248
1589313
1589569
1589825
1590081
1590337
1590593
1590849
1591105
1591361
1591617
1591873
1592129
1592385
1592641
1592897
1593153
1593409
1593665
1593921
1594177
1594433
1594689
1594945
1595201
1595457
1595713
1595969
1596225
1596481
1596737
1596993
1597249
1589314
1589570
1589826
1590082
1590338
1590594
1590850
1591106
1591362
1591618
1591874
1592130
1592386
1592642
1592898
1593154
1593410
1593666
1593922
1594178
1594434
1594690
1594946
1595202
1595458
1595714
1595970
1596226
1596482
1596738
1596994
1597250
1589315
1589571
1589827
1590083
1590339
1590595
1590851
1591107
1591363
1591619
1591875
1592131
1592387
1592643
1592899
1593155
1593411
1593667
1593923
1594179
1594435
1594691
1594947
1595203
1595459
1595715
1595971
1596227
1596483
1596739
1596995
1597251
1589316
1589572
1589828
1590084
1590340
1590596
1590852
1591108
1591364
1591620
1591876
1592132
1592388
1592644
1592900
1593156
1593412
1593668
1593924
1594180
1594436
1594692
1594948
1595204
1595460
1595716
1595972
1596228
1596484
1596740
1596996
1597252
1589317
1589573
1589829
1590085
1590341
1590597
1590853
1591109
1591365
1591621
1591877
1592133
1592389
1592645
1592901
1593157
1593413
1593669
1593925
1594181
1594437
1594693
1594949
1595205
1595461
1595717
1595973
1596229
1596485
1596741
1596997
1597253
1589318
1589574
1589830
1590086
1590342
1590598
1590854
1591110
1591366
1591622
1591878
1592134
1592390
1592646
1592902
1593158
1593414
1593670
1593926
1594182
1594438
1594694
1594950
1595206
1595462
1595718
1595974
1596230
1596486
1596742
1596998
1597254
1589319
1589575
1589831
1590087
1590343
1590599
1590855
1591111
1591367
1591623
1591879
1592135
1592391
1592647
1592903
1593159
1593415
1593671
1593927
1594183
1594439
1594695
1594951
1595207
1595463
1595719
1595975
1596231
1596487
1596743
1596999
1597255
1589320
1589576
1589832
1590088
1590344
1590600
1590856
1591112
1591368
1591624
1591880
1592136
1592392
1592648
1592904
1593160
1593416
1593672
1593928
1594184
1594440
1594696
1594952
1595208
1595464
1595720
1595976
1596232
1596488
1596744
1597000
1597256
1589321
1589577
1589833
1590089
1590345
1590601
1590857
1591113
1591369
1591625
1591881
1592137
1592393
1592649
1592905
1593161
1593417
1593673
1593929
1594185
1594441
1594697
1594953
1595209
1595465
1595721
1595977
1596233
1596489
1596745
1597001
1597257
1589322
1589578
1589834
1590090
1590346
1590602
1590858
1591114
1591370
1591626
1591882
1592138
1592394
1592650
1592906
1593162
1593418
1593674
1593930
1594186
1594442
1594698
1594954
1595210
1595466
1595722
1595978
1596234
1596490
1596746
1597002
1597258
1589323
1589579
1589835
1590091
1590347
1590603
1590859
1591115
1591371
1591627
1591883
1592139
1592395
1592651
1592907
1593163
1593419
1593675
1593931
1594187
1594443
1594699
1594955
1595211
1595467
1595723
1595979
1596235
1596491
1596747
1597003
1597259
1589324
1589580
1589836
1590092
1590348
1590604
1590860
1591116
1591372
1591628
1591884
1592140
1592396
1592652
1592908
1593164
1593420
1593676
1593932
1594188
1594444
1594700
1594956
1595212
1595468
1595724
1595980
1596236
1596492
1596748
1597004
1597260
1589325
1589581
1589837
1590093
1590349
1590605
1590861
1591117
1591373
1591629
1591885
1592141
1592397
1592653
1592909
1593165
1593421
1593677
1593933
1594189
1594445
1594701
1594957
1595213
1595469
1595725
1595981
1596237
1596493
1596749
1597005
1597261
1589326
1589582
1589838
1590094
1590350
1590606
1590862
1591118
1591374
1591630
1591886
1592142
1592398
1592654
1592910
1593166
1593422
1593678
1593934
1594190
1594446
1594702
1594958
1595214
1595470
1595726
1595982
1596238
1596494
1596750
1597006
1597262
1589327
1589583
1589839
1590095
1590351
1590607
1590863
1591119
1591375
1591631
1591887
1592143
1592399
1592655
1592911
1593167
1593423
1593679
1593935
1594191
1594447
1594703
1594959
1595215
1595471
1595727
1595983
1596239
1596495
1596751
1597007
1597263
1589328
1589584
1589840
1590096
1590352
1590608
1590864
1591120
1591376
1591632
1591888
1592144
1592400
1592656
1592912
1593168
1593424
1593680
1593936
1594192
1594448
1594704
1594960
1595216
1595472
1595728
1595984
1596240
1596496
1596752
1597008
1597264
1589329
1589585
1589841
1590097
1590353
1590609
1590865
1591121
1591377
1591633
1591889
1592145
1592401
1592657
1592913
1593169
1593425
1593681
1593937
1594193
1594449
1594705
1594961
1595217
1595473
1595729
1595985
1596241
1596497
1596753
1597009
1597265
1589330
1589586
1589842
1590098
1590354
1590610
1590866
1591122
1591378
1591634
1591890
1592146
1592402
1592658
1592914
1593170
1593426
1593682
1593938
1594194
1594450
1594706
1594962
1595218
1595474
1595730
1595986
1596242
1596498
1596754
1597010
1597266
1589331
1589587
1589843
1590099
1590355
1590611
1590867
1591123
1591379
1591635
1591891
1592147
1592403
1592659
1592915
1593171
1593427
1593683
1593939
1594195
1594451
1594707
1594963
1595219
1595475
1595731
1595987
1596243
1596499
1596755
1597011
1597267
1589332
1589588
1589844
1590100
1590356
1590612
1590868
1591124
1591380
1591636
1591892
1592148
1592404
1592660
1592916
1593172
1593428
1593684
1593940
1594196
1594452
1594708
1594964
1595220
1595476
1595732
1595988
1596244
1596500
1596756
1597012
1597268
1589333
1589589
1589845
1590101
1590357
1590613
1590869
1591125
1591381
1591637
1591893
1592149
1592405
1592661
1592917
1593173
1593429
1593685
1593941
1594197
1594453
1594709
1594965
1595221
1595477
1595733
1595989
1596245
1596501
1596757
1597013
1597269
1589334
1589590
1589846
1590102
1590358
1590614
1590870
1591126
1591382
1591638
1591894
1592150
1592406
1592662
1592918
1593174
1593430
1593686
1593942
1594198
1594454
1594710
1594966
1595222
1595478
1595734
1595990
1596246
1596502
1596758
1597014
1597270
1589335
1589591
1589847
1590103
1590359
1590615
1590871
1591127
1591383
1591639
1591895
1592151
1592407
1592663
1592919
1593175
1593431
1593687
1593943
1594199
1594455
1594711
1594967
1595223
1595479
1595735
1595991
1596247
1596503
1596759
1597015
1597271
1589336
1589592
1589848
1590104
1590360
1590616
1590872
1591128
1591384
1591640
1591896
1592152
1592408
1592664
1592920
1593176
1593432
1593688
1593944
1594200
1594456
1594712
1594968
1595224
1595480
1595736
1595992
1596248
1596504
1596760
1597016
1597272
1589337
1589593
1589849
1590105
1590361
1590617
1590873
1591129
1591385
1591641
1591897
1592153
1592409
1592665
1592921
1593177
1593433
1593689
1593945
1594201
1594457
1594713
1594969
1595225
1595481
1595737
1595993
1596249
1596505
1596761
1597017
1597273
1589338
1589594
1589850
1590106
1590362
1590618
1590874
1591130
1591386
1591642
1591898
1592154
1592410
1592666
1592922
1593178
1593434
1593690
1593946
1594202
1594458
1594714
1594970
1595226
1595482
1595738
1595994
1596250
1596506
1596762
1597018
1597274
1589339
1589595
1589851
1590107
1590363
1590619
1590875
1591131
1591387
1591643
1591899
1592155
1592411
1592667
1592923
1593179
1593435
1593691
1593947
1594203
1594459
1594715
1594971
1595227
1595483
1595739
1595995
1596251
1596507
1596763
1597019
1597275
1589340
1589596
1589852
1590108
1590364
1590620
1590876
1591132
1591388
1591644
1591900
1592156
1592412
1592668
1592924
1593180
1593436
1593692
1593948
1594204
1594460
1594716
1594972
1595228
1595484
1595740
1595996
1596252
1596508
1596764
1597020
1597276
1589341
1589597
1589853
1590109
1590365
1590621
1590877
1591133
1591389
1591645
1591901
1592157
1592413
1592669
1592925
1593181
1593437
1593693
1593949
1594205
1594461
1594717
1594973
1595229
1595485
1595741
1595997
1596253
1596509
1596765
1597021
1597277
1589342
1589598
1589854
1590110
1590366
1590622
1590878
1591134
1591390
1591646
1591902
1592158
1592414
1592670
1592926
1593182
1593438
1593694
1593950
1594206
1594462
1594718
1594974
1595230
1595486
1595742
1595998
1596254
1596510
1596766
1597022
1597278
1589343
1589599
1589855
1590111
1590367
1590623
1590879
1591135
1591391
1591647
1591903
1592159
1592415
1592671
1592927
1593183
1593439
1593695
1593951
1594207
1594463
1594719
1594975
1595231
1595487
1595743
1595999
1596255
1596511
1596767
1597023
1597279
