0 0 2.99999991059 0.333333343267 1.0
0 1 1.9770673976 0.434446394444 1.16423952579
0 2 0.8 1.0 1.25
1 0 1.0 1.0 1.0
1 1 0.609595255327 0.952629625797 1.72200465202
1 2 0.555555570273 1.0 1.79999995232
2 0 0.571428571429 0.75 2.33333325386
2 1 0.63977083404 0.940298497677 1.66230154037
2 2 0.83333330022 1.0 1.20000004768
3 0 0.5 1.0 2.0
3 1 0.606774345635 0.934195935726 1.76414716244
3 2 0.666666666667 1.0 1.5
4 0 1.0 1.0 1.0
4 1 0.640706345115 0.919081270695 1.69819295406
4 2 0.5 1.0 2.0
5 0 0.749999977648 1.0 1.33333337307
5 1 0.602666079658 0.930074930191 1.78404295444
5 2 1.0 1.0 1.0
6 0 2.99999991059 0.333333343267 1.0
6 1 0.564354449994 0.921847224236 1.92215800285
6 2 0.444444444444 1.0 2.25
7 0 1.0 0.666666686535 1.5
7 1 0.619058094775 0.901528596878 1.79179811478
7 2 0.83333330022 0.800000011921 1.5
8 0 0.300000007153 1.0 3.33333325386
8 1 0.505565518543 0.946022748947 2.0908408165
8 2 0.666666666667 1.0 1.5
9 0 0.749999977648 1.0 1.33333337307
9 1 0.65047861536 0.914931774139 1.68026673794
9 2 0.4 1.0 2.5
10 0 0.5 1.0 2.0
10 1 0.632539506536 0.915904283524 1.72608530521
10 2 0.571428571429 1.0 1.75
11 0 0.749999977648 0.666666686535 2.0
11 1 0.607338679573 0.926041662693 1.7780277729
11 2 1.0 0.75 1.33333337307
12 0 0.749999977648 0.666666686535 2.0
12 1 0.696911207336 0.891966760159 1.60869562626
12 2 0.8 1.0 1.25
13 0 1.4999999553 0.666666686535 1.0
13 1 0.632391873012 0.93440335989 1.69230771065
13 2 0.8 0.75 1.66666662693
14 0 0.666666666667 1.0 1.5
14 1 0.680246333825 0.897632300854 1.63770365715
14 2 0.8 1.0 1.25
15 0 1.0 0.666666686535 1.5
15 1 0.657769749756 0.915749669075 1.66015768051
15 2 1.0 0.75 1.33333337307
16 0 1.0 0.0 0.0
16 1 0.56561528151 0.949397563934 1.86221897602
16 2 0.666666666667 1.0 1.5
17 0 0.333333333333 1.0 3.0
17 1 0.595068285663 0.946917831898 1.7746835947
17 2 0.8 1.0 1.25
18 0 1.0 0.666666686535 1.5
18 1 0.695229050512 0.905087053776 1.58921158314
18 2 0.8 1.0 1.25
19 0 0.374999988824 1.0 2.66666674614
19 1 0.673255823566 0.913644194603 1.62570893764
19 2 0.363636363636 1.0 2.75
20 0 1.0 1.0 1.0
20 1 0.635686110826 0.932413816452 1.68713021278
20 2 0.8 1.0 1.25
21 0 0.749999977648 1.0 1.33333337307
21 1 0.612944436537 0.926015973091 1.76181542873
21 2 0.444444444444 1.0 2.25
22 0 0.230769222305 0.666666686535 6.5
22 1 0.440113489424 0.839158475399 2.70764255524
22 2 0.666666666667 1.0 1.5
23 0 0.666666666667 1.0 1.5
23 1 0.628902324858 0.94115293026 1.68949377537
23 2 1.0 1.0 1.0
24 0 1.0 1.0 1.0
24 1 0.599810988859 0.938558459282 1.77633237839
24 2 0.8 1.0 1.25
25 0 2.99999991059 0.333333343267 1.0
25 1 0.657454145544 0.942603051662 1.61363637447
25 2 0.8 1.0 1.25
26 0 0.5 1.0 2.0
26 1 1.0 0.0 0.0
26 2 0.666666666667 1.0 1.5
27 0 0.300000007153 1.0 3.33333325386
27 1 0.611395370889 0.93685811758 1.7458384037
27 2 0.571428571429 0.75 2.33333325386
28 0 1.0 0.666666686535 1.5
28 1 0.685697956085 0.911740243435 1.59954333305
28 2 1.0 1.0 1.0
29 0 0.749999977648 0.666666686535 2.0
29 1 0.623414395608 0.957609176636 1.67507743835
29 2 1.33333333333 0.75 1.0
30 0 0.749999977648 1.0 1.33333337307
30 1 0.485990829181 0.961914718151 2.1391210556
30 2 0.8 0.75 1.66666662693
31 0 0.600000014305 1.0 1.66666662693
31 1 0.293646774695 0.971359550953 3.50586152077
31 2 0.571428571429 1.0 1.75
32 0 1.0 0.0 0.0
32 1 0.615587832029 0.936337649822 1.73491215706
32 2 0.5 1.0 2.0
33 0 0.5 1.0 2.0
33 1 0.572619286697 0.960698664188 1.81780302525
33 2 0.8 1.0 1.25
34 0 0.5 1.0 2.0
34 1 0.643636364752 0.939265549183 1.65413534641
34 2 0.8 1.0 1.25
35 0 1.0 1.0 1.0
35 1 0.61457011709 0.94279807806 1.72587716579
35 2 0.666666666667 1.0 1.5
36 0 0.666666666667 1.0 1.5
36 1 0.906998127317 0.797631144524 1.38226556778
36 2 0.666666666667 1.0 1.5
37 0 1.0 0.666666686535 1.5
37 1 0.676728113127 0.924412667751 1.59852671623
37 2 0.666666666667 0.75 2.0
38 0 1.0 0.0 0.0
38 1 0.525679770046 0.950642347336 2.00106692314
38 2 0.666666666667 1.0 1.5
39 0 1.0 1.0 1.0
39 1 0.629334463272 0.960985600948 1.65349006653
39 2 0.857142886337 1.0 1.16666662693
40 0 0.666666666667 1.0 1.5
40 1 0.692271425663 0.915588855743 1.5776951313
40 2 0.71428572645 1.0 1.39999997616
41 0 0.749999977648 1.0 1.33333337307
41 1 0.626751581316 0.956300795078 1.66843783855
41 2 6.99999968708 0.142857149243 1.0
42 0 1.33333333333 0.75 1.0
42 1 0.54992549207 0.958333313465 1.89749026299
42 2 1.0 1.0 1.0
43 0 0.749999977648 1.0 1.33333337307
43 1 0.603053452127 0.934314072132 1.77480781078
43 2 1.33333333333 0.75 1.0
44 0 0.600000014305 1.0 1.66666662693
44 1 0.64998875697 0.907835662365 1.69467675686
44 2 0.545454533632 1.0 1.83333337307
45 0 0.5 1.0 2.0
45 1 0.60086811557 0.944272458553 1.76247727871
45 2 0.749999977648 1.0 1.33333337307
46 0 0.300000007153 1.0 3.33333325386
46 1 0.677827218624 0.925043165684 1.59484684467
46 2 0.83333330022 1.0 1.20000004768
47 0 1.0 1.0 1.0
47 1 0.745990701759 0.880374491215 1.52264666557
47 2 5.99999982119 0.166666671634 1.0
48 0 0.8 1.0 1.25
48 1 0.548533596359 0.934805095196 1.95018446445
48 2 0.624999990687 0.600000023842 2.66666674614
49 0 0.83333330022 1.0 1.20000004768
49 1 0.68668096739 0.869535028934 1.67478048801
49 2 0.4 1.0 2.5
50 0 1.0 0.800000011921 1.25
50 1 0.787757623759 0.850449025631 1.49265384674
50 2 1.0 1.0 1.0
51 0 0.41666665011 1.0 2.40000009537
51 1 0.598885132048 0.957911789417 1.74313473701
51 2 1.0 1.0 1.0
52 0 0.624999990687 1.0 1.60000002384
52 1 0.485891009594 0.944311857224 2.17944407463
52 2 2.99999991059 0.333333343267 1.0
53 0 1.0 0.0 0.0
53 1 1.0 0.0 0.0
53 2 1.0 0.0 0.0
