140849
140594
601135
1064752
1129770
1254182
1255206
1254185
1259564
1387567
1450287
1583136
1584160
1583394
1584162
1583139
1583651
1583907
1584419
1583396
1584676
1583398
1583654
1583911
1585707
1580859
1653808
1779751
1910309
2368303
2368304
2563888
2564400
2629680
2628155
2628411
2694959
2694448
2694704
2694960
2695216
2703152
2703154
2765851
2766108
2761264
2762035
2764349
2763070
2764606
2762822
2957358
2957359
2957615
2958127
2958383
3030312
3029039
3029040
3090737
3089202
3090740
3089205
3090485
3090997
3090742
3092022
3092534
3089975
3090231
3091255
3092535
3089208
3089464
3090232
3090488
3091256
3090233
3091769
3091258
