0 0 0.666666666667 1.0 1.5
0 1 4.07581694456 0.208948045969 1.17421340942
0 2 1.0 1.0 1.0
1 0 0.666666666667 1.0 1.5
1 1 0.587754255532 0.950434803963 1.79011893272
1 2 1.0 0.0 0.0
2 0 0.666666666667 1.0 1.5
2 1 0.630958897 0.945366501808 1.67648136616
2 2 1.0 1.0 1.0
3 0 0.666666666667 1.0 1.5
3 1 0.569516354892 0.945788323879 1.85652089119
3 2 1.0 1.0 1.0
4 0 0.5 1.0 2.0
4 1 0.635981976965 0.924488782883 1.70080113411
4 2 0.5 1.0 2.0
5 0 0.666666666667 1.0 1.5
5 1 0.585461520385 0.940532565117 1.81605005264
5 2 0.5 0.75 2.66666674614
6 0 1.0 0.5 2.0
6 1 0.532989689608 0.940683424473 1.99451684952
6 2 0.8 1.0 1.25
7 0 1.0 0.0 0.0
7 1 0.608292202742 0.901168465614 1.82423913479
7 2 1.0 1.0 1.0
8 0 0.5 1.0 2.0
8 1 0.482331879159 0.954171359539 2.17283940315
8 2 1.0 1.0 1.0
9 0 1.0 0.5 2.0
9 1 0.618281193777 0.931237697601 1.73681437969
9 2 1.0 1.0 1.0
10 0 0.5 1.0 2.0
10 1 0.561662308877 0.942344665527 1.8893610239
10 2 1.0 1.0 1.0
11 0 0.5 1.0 2.0
11 1 0.584141959884 0.937826275826 1.82540488243
11 2 1.0 1.0 1.0
12 0 0.666666666667 1.0 1.5
12 1 0.660128707899 0.91274958849 1.65966236591
12 2 1.0 1.0 1.0
13 0 0.666666666667 1.0 1.5
13 1 0.607200991835 0.941334187984 1.7495392561
13 2 1.0 1.0 1.0
14 0 0.666666666667 1.0 1.5
14 1 0.64540527906 0.920810878277 1.68266248703
14 2 2.0 0.5 1.0
15 0 0.5 1.0 2.0
15 1 0.731828151846 0.877852976322 1.55657160282
15 2 1.0 1.0 1.0
16 0 0.5 1.0 2.0
16 1 0.537650841214 0.958583593369 1.94030344486
16 2 0.666666666667 0.5 3.0
17 0 0.222222222222 1.0 4.5
17 1 0.567388573685 0.955678224564 1.84419870377
17 2 1.0 1.0 1.0
18 0 0.666666666667 1.0 1.5
18 1 0.63488255751 0.930258214474 1.69317984581
18 2 1.0 1.0 1.0
19 0 0.5 1.0 2.0
19 1 0.604868376034 0.940102934837 1.75858640671
19 2 1.0 1.0 1.0
20 0 0.666666666667 1.0 1.5
20 1 0.586910959159 0.948439180851 1.7964631319
20 2 0.749999977648 1.0 1.33333337307
21 0 0.666666666667 1.0 1.5
21 1 0.548409231645 0.942298650742 1.93511450291
21 2 1.0 1.0 1.0
22 0 0.666666666667 1.0 1.5
22 1 0.545739981293 0.956927359104 1.91485214233
22 2 1.0 0.0 0.0
23 0 0.666666666667 1.0 1.5
23 1 0.573919873238 0.959030389786 1.8168387413
23 2 0.374999988824 1.0 2.66666674614
24 0 2.0 0.5 1.0
24 1 0.611518205527 0.932995796204 1.75271344185
24 2 1.0 0.666666686535 1.5
25 0 0.666666666667 1.0 1.5
25 1 0.64373954565 0.954356849194 1.62771737576
25 2 0.666666666667 1.0 1.5
26 0 0.666666666667 1.0 1.5
26 1 1.0 0.0 0.0
26 2 0.749999977648 1.0 1.33333337307
27 0 1.0 0.5 2.0
27 1 0.589738340506 0.942114412785 1.79985284805
27 2 0.333333333333 1.0 3.0
28 0 0.285714285714 1.0 3.5
28 1 0.62392857443 0.939515352249 1.70593011379
28 2 1.33333333333 0.75 1.0
29 0 0.5 1.0 2.0
29 1 0.58900822361 0.965276420116 1.75884246826
29 2 0.8 1.0 1.25
30 0 1.0 0.0 0.0
30 1 0.484765605542 0.948751032352 2.17428231239
30 2 1.0 0.75 1.33333337307
31 0 0.666666666667 1.0 1.5
31 1 0.272632584474 0.977873265743 3.75093603134
31 2 0.444444444444 1.0 2.25
32 0 1.0 0.0 0.0
32 1 0.595844745819 0.952138185501 1.76265335083
32 2 0.8 1.0 1.25
33 0 0.5 1.0 2.0
33 1 0.584921389976 0.967420339584 1.76720643044
33 2 0.857142886337 0.666666686535 1.75
34 0 1.0 1.0 1.0
34 1 0.628745120795 0.953556656837 1.6679340601
34 2 0.83333330022 1.0 1.20000004768
35 0 0.666666666667 1.0 1.5
35 1 0.54602718508 0.967534601688 1.89286327362
35 2 1.0 0.5 2.0
36 0 1.0 1.0 1.0
36 1 2.0926170373 0.383524954319 1.24599587917
36 2 0.583333327538 1.0 1.71428573132
37 0 1.0 1.0 1.0
37 1 0.632989698968 0.94201952219 1.6770401001
37 2 0.562499995809 0.888888895512 2.0
38 0 1.0 0.0 0.0
38 1 0.462991767534 0.961593866348 2.24613070488
38 2 0.727272727273 1.0 1.375
39 0 1.0 1.0 1.0
39 1 0.629085648138 0.958073019981 1.65917277336
39 2 0.83333330022 0.800000011921 1.5
40 0 1.0 0.800000011921 1.25
40 1 0.686936934539 0.921779870987 1.5792683363
40 2 0.83333330022 0.899999976158 1.33333337307
41 0 0.666666666667 1.0 1.5
41 1 0.598464281306 0.9657330513 1.73023331165
41 2 0.785714299095 0.909090936184 1.39999997616
42 0 0.444444444444 1.0 2.25
42 1 0.541835022419 0.955413997173 1.93170726299
42 2 1.0 0.777777791023 1.28571426868
43 0 0.545454533632 1.0 1.83333337307
43 1 0.607993109331 0.93505269289 1.75899767876
43 2 0.818181827049 0.777777791023 1.57142853737
44 0 0.749999977648 1.0 1.33333337307
44 1 0.643329585962 0.920436561108 1.688778162
44 2 1.0 0.777777791023 1.28571426868
45 0 0.77777778808 0.857142865658 1.5
45 1 0.657095450688 0.917021632195 1.65955615044
45 2 0.83333330022 0.699999988079 1.71428573132
46 0 0.636363650156 1.0 1.57142853737
46 1 0.587745278112 0.935590565205 1.81854903698
46 2 0.636363650156 1.0 1.57142853737
47 0 1.20000002861 0.666666686535 1.25
47 1 0.765201717474 0.893627047539 1.46240532398
47 2 1.33333333333 0.75 1.0
48 0 0.888888888889 0.875 1.28571426868
48 1 0.529784213208 0.944016337395 1.99950027466
48 2 0.769230797446 0.899999976158 1.44444441795
49 0 1.0 0.800000011921 1.25
49 1 0.640557174098 0.893161058426 1.74788284302
49 2 1.12499999162 0.888888895512 1.0
50 0 1.0 0.777777791023 1.28571426868
50 1 0.675624022991 0.910199761391 1.62614095211
50 2 0.727272727273 0.875 1.57142853737
51 0 0.699999983311 1.0 1.42857146263
51 1 0.597564878782 0.959070622921 1.74487519264
51 2 1.0 0.714285731316 1.39999997616
52 0 0.8 0.75 1.66666662693
52 1 0.489722183951 0.944151759148 2.16276049614
52 2 1.0 0.0 0.0
53 0 1.0 0.0 0.0
53 1 1.0 0.0 0.0
53 2 1.0 0.0 0.0
