slot	fe	chip	channel	mean	RMS
7	4	4	8	419.644	43.0881
7	4	4	6	677.458	36.0455
7	4	4	11	771.682	38.936
7	4	4	9	597.598	51.1536
7	4	4	7	574.322	35.3671
7	4	4	14	541.652	38.442
7	4	4	12	921.146	39.0859
7	4	4	17	691.506	32.9343
7	4	4	15	612.32	41.07
7	4	4	13	820.5	228.478
7	4	5	2	627.91	41.725
7	4	5	0	1082.14	38.5063
7	4	5	5	882.202	42.1228
7	4	5	3	689.322	37.8299
7	4	5	1	381.068	43.0757
7	4	5	8	606.946	40.2592
7	4	5	6	861.914	16.7231
7	4	5	11	491.764	125.521
7	4	5	9	852.408	17.3743
7	4	5	7	868.352	44.2554
7	4	10	3	1214.61	25.836
7	4	10	5	825.536	41.0074
7	4	10	0	1045.86	38.5729
7	4	10	2	841.558	28.3817
7	4	10	4	891.464	38.3304
7	4	10	9	986.724	27.3465
7	4	10	11	943.124	30.3961
7	4	10	6	551.816	31.9342
7	4	10	8	948.964	34.5091
7	4	10	10	702.072	42.1335
7	4	10	15	1362.05	41.8096
7	4	10	17	980.786	31.7848
7	4	10	12	650.23	26.6851
7	4	10	14	785.824	41.1096
7	4	10	16	536.658	29.5619
7	4	7	3	867.114	31.7013
7	4	7	1	1227.69	30.9714
7	4	7	4	571.08	33.3065
7	4	7	2	1008.53	29.266
7	4	7	0	604.208	39.6884
7	4	1	14	693.286	36.4511
7	4	1	12	836.472	34.0975
7	4	1	17	828.456	38.4385
7	4	1	15	1039.5	31.8945
7	4	1	13	640.844	36.6473
7	4	2	2	869.296	39.9628
7	4	2	0	1337.45	44.9488
7	4	2	5	880.53	44.8728
7	4	2	3	1179.4	43.1064
7	4	2	1	1008.56	37.3017
7	4	2	8	983.54	35.5633
7	4	2	6	1233.65	38.2692
7	4	2	11	996.326	36.6964
7	4	2	9	1236.19	36.4879
7	4	2	7	1328.52	39.605
7	4	2	14	1207.27	49.7166
7	4	2	12	1088.54	30.3249
7	4	2	17	1053.34	40.3777
7	4	2	15	384.508	44.6014
7	4	2	13	1121.13	40.1571
7	4	7	9	326.062	30.2937
7	4	7	7	595.5	42.3297
7	4	7	10	746.764	40.7967
7	4	7	8	268.926	39.8558
7	4	7	6	993.454	42.5219
7	4	7	15	558.792	38.7651
7	4	7	13	244.494	41.2444
7	4	7	16	813.442	39.3671
7	4	7	14	513.656	44.5896
7	4	7	12	848.824	38.6488
7	4	8	3	1036.17	47.2712
7	4	8	1	1150.16	28.6787
7	4	8	4	818.122	35.6681
7	4	8	2	738.952	42.4786
7	4	8	0	1020.57	41.6802
7	4	8	9	465.282	31.2555
7	4	8	7	557.814	46.8626
7	4	8	10	920.806	40.9657
7	4	8	8	1020.29	42.6582
7	4	8	6	754.31	29.0077
7	4	3	2	994.682	34.6102
7	4	3	4	716.48	38.7723
7	4	3	1	1097.44	30.7627
7	4	3	3	1139.72	34.7094
7	4	3	5	1235.16	38.0211
7	4	3	8	713.996	36.9896
7	4	3	6	549.926	281.818
7	4	3	11	991.826	35.2343
7	4	3	9	1092.42	38.5962
7	4	3	7	468.816	37.4701
7	4	3	14	1063.84	38.6708
7	4	3	12	1278.81	43.6919
7	4	3	17	925.162	38.8262
7	4	3	15	1316.73	36.4894
7	4	3	13	689.19	43.0105
7	4	4	2	575.766	50.0273
7	4	4	0	492.456	51.0004
7	4	4	5	483.132	49.5409
7	4	4	3	481.2	45.3149
7	4	4	1	878.268	133.678
7	4	8	15	600.722	28.5254
7	4	8	13	718.01	34.5732
7	4	8	16	877.702	33.2719
7	4	8	14	959.038	31.0557
7	4	8	12	630.182	44.2064
7	4	9	3	938.572	42.5217
7	4	9	5	925.432	46.5383
7	4	9	0	864.9	45.4215
7	4	9	2	1216.68	44.6673
7	4	9	4	962.702	40.3635
7	4	9	9	791.228	27.7327
7	4	9	11	949.316	39.436
7	4	9	6	1066.08	30.4591
7	4	9	8	914.888	40.7943
7	4	9	10	774.032	31.7614
7	4	9	15	933.708	42.3613
7	4	9	17	1053.11	36.641
7	4	9	12	680.206	37.4708
7	4	9	14	858.876	17.769
7	4	9	16	1261.99	17.8014
7	4	0	2	1009.01	38.4704
7	4	0	4	1372.21	17.5002
7	4	0	1	385.376	43.5106
7	4	0	3	878.824	42.0007
7	4	0	5	1018.3	37.7007
7	4	0	14	1041.6	39.1185
7	4	0	16	737.616	35.921
7	4	0	13	752.272	17.4123
7	4	0	15	762.554	36.1543
7	4	0	17	1099.5	43.7205
7	4	1	2	758.248	34.3759
7	4	1	0	828.352	41.3469
7	4	1	5	908.638	40.6788
7	4	1	3	369.52	37.7489
7	4	1	1	859.578	41.092
7	4	1	8	728.672	32.8118
7	4	1	6	956.3	31.91
7	4	1	11	815.606	34.1331
7	4	1	9	789.09	30.0557
7	4	1	7	800.126	36.8384
7	4	6	3	1001.38	27.4255
7	4	6	5	1055.92	39.6993
7	4	6	0	840.428	36.9945
7	4	6	2	1260.55	40.5729
7	4	6	4	877.44	31.0333
7	4	6	9	1328.46	26.2719
7	4	6	11	1056.86	42.1133
7	4	6	6	1152.9	35.9227
7	4	6	8	772.22	42.3341
7	4	6	10	1237.65	42.2933
7	4	6	15	513.92	32.6149
7	4	6	17	905.542	34.8017
7	4	6	12	858.598	28.8218
7	4	6	14	832.946	17.8898
7	4	6	16	881.926	42.597
7	4	11	3	1133.72	45.5583
7	4	11	5	893.652	34.8515
7	4	11	0	1113.07	33.9408
7	4	11	2	1532.29	47.3719
7	4	11	4	967.594	33.831
7	6	11	15	831.568	34.7798
7	6	11	13	1220.72	34.481
7	6	11	16	802.834	26.3996
7	6	11	14	767.628	25.7159
7	6	11	12	756.112	44.0658
7	6	11	9	511.238	28.3486
7	6	11	7	1213.02	28.3666
7	6	11	10	888.076	28.4092
7	6	11	8	965.826	29.2648
7	6	11	6	383.378	30.4048
7	6	11	3	1284.51	34.2046
7	6	11	1	578.266	30.5404
7	6	11	4	800.176	47.5607
7	6	11	2	1142.52	33.2221
7	6	11	0	821.24	32.7583
7	6	10	15	979.058	27.4519
7	6	10	13	952.29	25.7018
7	6	10	16	935.524	31.0656
7	6	10	14	865.896	33.4456
7	6	10	12	951.42	29.4591
7	6	5	14	566.848	22.8554
7	6	5	12	558.308	33.8275
7	6	5	17	669.002	34.9176
7	6	5	15	698.638	27.368
7	6	5	13	662.112	33.2524
7	6	5	8	779.046	32.4794
7	6	5	6	823.504	32.3797
7	6	5	11	455.332	23.6821
7	6	5	9	1044.79	38.6882
7	6	5	7	849.914	25.4212
7	6	5	2	615.168	31.4613
7	6	5	0	947.612	29.4472
7	6	5	5	907.134	27.7419
7	6	5	3	952.27	26.5286
7	6	5	1	466.46	24.6257
7	6	4	8	1360.39	36.2123
7	6	4	6	713.398	37.9649
7	6	4	11	1051.43	37.7668
7	6	4	9	1441.55	22.8252
7	6	4	7	1310.32	23.3099
7	6	10	9	913.474	31.136
7	6	10	7	1097.63	29.8743
7	6	10	10	845.65	28.1708
7	6	10	8	1163.62	36.8458
7	6	10	6	982.318	27.568
7	6	10	5	957.018	19.1566
7	6	10	1	949.626	33.593
7	6	10	4	797.19	35.2806
7	6	10	2	952.626	26.3172
7	6	10	0	887.66	46.1963
7	6	9	15	675.038	29.5864
7	6	9	13	769.124	31.6493
7	6	9	16	966.176	30.6064
7	6	9	14	615.166	27.2261
7	6	9	12	872.25	40.5055
7	6	9	9	781.408	26.7882
7	6	9	7	1124.7	33.3721
7	6	9	10	775.016	27.2875
7	6	9	8	922.284	26.8747
7	6	9	6	1081.11	31.8067
7	6	4	2	1406.73	27.3014
7	6	4	0	1230.96	37.3752
7	6	4	5	826.99	25.6322
7	6	4	3	1064.49	23.3378
7	6	4	1	1078.32	28.2547
7	6	3	14	1050.44	25.2763
7	6	3	12	741.46	28.2402
7	6	3	17	1120.29	32.5512
7	6	3	15	1146.33	32.8522
7	6	3	13	1012.12	28.5999
7	6	3	8	1076.75	34.7943
7	6	3	6	1398.64	36.3401
7	6	3	11	944.376	33.6261
7	6	3	9	887.19	35.0401
7	6	3	7	1070.37	28.6421
7	6	3	2	926.892	29.2395
7	6	3	0	1184.27	34.2929
7	6	3	5	1258.49	24.6187
7	6	3	3	912.726	26.4885
7	6	3	1	679.2	17.6497
7	6	9	3	773.428	28.3762
7	6	9	1	1149.64	32.265
7	6	9	4	1020.07	29.7206
7	6	9	2	734.606	31.8304
7	6	9	0	767.978	28.9429
7	6	8	15	501.368	28.1818
7	6	8	13	578.208	27.108
7	6	8	16	768.002	28.7089
7	6	8	14	405.394	29.2342
7	6	8	12	1064.14	29.7392
7	6	8	9	678.776	29.44
7	6	8	7	407.86	31.9076
7	6	8	10	639.058	34.8858
7	6	8	8	315.168	32.7982
7	6	8	6	414.422	30.0494
7	6	8	3	587.466	27.1424
7	6	8	1	435.298	25.935
7	6	8	4	388.788	31.7771
7	6	8	2	988.056	29.7363
7	6	8	0	837.916	30.2688
7	6	2	14	1216.47	27.5709
7	6	2	12	705.246	34.945
7	6	2	17	955.188	29.3124
7	6	2	15	977.774	26.6666
7	6	2	13	841.132	36.3697
7	6	2	8	600.42	31.1779
7	6	2	6	1007.36	27.4389
7	6	2	11	772.402	30.4732
7	6	2	9	890.794	30.3121
7	6	2	7	854.484	30.2097
7	6	2	2	999.994	31.1462
7	6	2	0	796.208	32.0612
7	6	2	5	1125.66	31.0578
7	6	2	3	1270.09	26.628
7	6	2	1	1340.14	34.3785
7	6	1	14	983.606	35.4746
7	6	1	12	918.408	37.2386
7	6	1	17	769.006	25.2479
7	6	1	15	834.95	26.1671
7	6	1	13	653.434	26.692
7	6	7	15	1152.96	33.1417
7	6	7	13	1580.23	29.0661
7	6	7	16	695.562	28.0676
7	6	7	14	1222.38	27.7305
7	6	7	12	949.018	24.5386
7	6	7	9	1216.4	34.3638
7	6	7	7	1246.68	35.2139
7	6	7	10	1155.09	32.1405
7	6	7	8	1358.7	18.7068
7	6	7	6	1248.89	25.4397
7	6	7	3	1059.99	32.9325
7	6	7	1	1409.29	22.1979
7	6	7	4	951.522	27.0736
7	6	7	2	1073.16	31.9971
7	6	7	0	1232.76	38.489
7	6	6	15	1094.47	28.7959
7	6	6	13	1289.59	25.1252
7	6	6	16	1133.53	24.6536
7	6	6	14	932.87	28.4619
7	6	6	12	693.666	28.8725
7	6	1	8	827.24	44.4353
7	6	1	6	621.468	34.6113
7	6	1	11	734.078	33.7927
7	6	1	9	485	38.8145
7	6	1	7	906.192	28.8308
7	6	1	2	1007.37	30.7884
7	6	1	0	1036.12	25.9097
7	6	1	5	937.418	29.9865
7	6	1	3	878.63	26.9419
7	6	1	1	889.516	32.5123
7	6	0	14	915.106	31.9244
7	6	0	12	726.154	31.6878
7	6	0	17	926.87	31.6726
7	6	0	15	630.12	28.0342
7	6	0	13	893.192	30.1465
7	6	0	8	881.676	29.889
7	6	0	6	844.892	278.353
7	6	0	11	870.508	30.718
7	6	0	9	616.03	45.6505
7	6	0	7	773.552	24.5585
