20775
20776
20777
20778
20779
20780
20781
20782
20783
20784
5632
5888
14080
14336
21504
21760
5727
5983
14175
14431
21599
21855
82472
71168
71424
79616
79872
87040
87296
71263
71519
79711
79967
87135
87391
148283
150331
136704
136960
145152
145408
152576
152832
136799
137055
145247
145503
152671
152927
213808
214064
213297
213809
214065
202240
202496
210688
210944
218112
218368
202335
202591
210783
211039
218207
218463
278832
279344
281392
278833
279345
281393
278843
279355
281403
267776
268032
276224
276480
283648
283904
267871
268127
276319
276575
283743
283999
349185
333312
333568
341760
342016
349184
349440
333407
333663
341855
342111
349279
349535
410916
411172
411428
411940
410662
410918
411174
411430
411942
412966
413990
414246
414502
415014
415270
415526
410664
410920
411176
411432
411944
412968
413992
414248
414504
415016
415272
415528
415784
410665
410921
411177
411433
411945
412969
413993
414249
414505
415017
415273
415529
415785
410670
410926
411182
411438
411950
412974
413998
414254
414510
415022
415278
415534
410418
410674
410930
411186
411442
411954
412978
414002
414258
414514
415026
415282
415538
410421
410677
410933
411189
411445
411957
412981
413493
414005
414261
414517
415029
415285
415541
411455
398848
399104
407296
407552
414720
414976
398943
399199
407391
407647
414815
415071
478257
478260
464384
464640
472832
473088
480256
480512
464479
464735
472927
473183
480351
480607
546048
546049
546856
546857
546858
546861
546862
546863
529920
530176
538368
538624
545792
546048
530015
530271
538463
538719
545887
546143
611328
611584
611329
611585
595456
595712
603904
604160
611328
611584
595551
595807
603999
604255
611423
611679
673068
673070
673077
673078
673080
673081
673082
673083
673084
660992
661248
669440
669696
676864
677120
661087
661343
669535
669791
676959
677215
726528
726784
734976
735232
742400
742656
726623
726879
735071
735327
742495
742751
808448
808704
808960
808450
792064
792320
800512
800768
807936
808192
792159
792415
800607
800863
808031
808287
857600
857856
866048
866304
873472
873728
857695
857951
866143
866399
873567
873823
933939
936755
923136
923392
931584
931840
939008
939264
923231
923487
931679
931935
939103
939359
1000756
1002292
1003828
1000757
1002293
1003829
988672
988928
997120
997376
1004544
1004800
988767
989023
997215
997471
1004639
1004895
1067824
1069360
1054208
1054464
1062656
1062912
1070080
1070336
1054303
1054559
1062751
1063007
1070175
1070431
1135616
1135872
1135617
1135873
1131812
1132068
1132580
1132836
1133092
1133348
1133860
1130538
1130794
1131562
1131818
1132074
1132586
1132842
1133098
1133354
1133866
1130796
1131564
1131820
1132076
1132588
1132844
1133100
1133356
1133868
1130800
1131568
1131824
1132080
1132592
1132848
1133104
1133360
1133872
1119744
1120000
1128192
1128448
1135616
1135872
1119839
1120095
1128287
1128543
1135711
1135967
1199654
1200422
1201958
1199658
1200426
1201962
1199661
1200429
1201965
1199668
1200436
1185280
1185536
1193728
1193984
1201152
1201408
1185375
1185631
1193823
1194079
1201247
1201503
1262637
1264685
1262638
1264686
1262649
1264697
1262650
1264698
1262651
1264699
1262652
1264700
1262653
1264701
1250816
1251072
1259264
1259520
1266688
1266944
1250911
1251167
1259359
1259615
1266783
1267039
1333308
1333309
1333054
1316352
1316608
1324800
1325056
1332224
1332480
1316447
1316703
1324895
1325151
1332319
1332575
1381888
1382144
1390336
1390592
1397760
1398016
1381983
1382239
1390431
1390687
1397855
1398111
1463296
1463552
1463297
1463553
1458724
1458980
1459236
1459492
1459748
1447424
1447680
1455872
1456128
1463296
1463552
1447519
1447775
1455967
1456223
1463391
1463647
1512960
1513216
1521408
1521664
1528832
1529088
1513055
1513311
1521503
1521759
1528927
1529183
1594624
1594625
1589295
1589551
1590319
1590575
1592111
1592367
1593391
1593647
1589552
1590320
1590576
1592112
1592368
1593392
1593648
1590321
1590577
1592113
1592369
1593393
1593649
1589554
1590322
1590578
1592114
1592370
1593394
1593650
1589555
1590323
1590579
1592115
1592371
1593395
1593651
1590324
1590580
1592116
1592372
1593396
1593652
1590331
1590587
1592123
1592379
1593403
1593659
1578496
1578752
1586944
1587200
1594368
1594624
1578591
1578847
1587039
1587295
1594463
1594719
1660160
1660161
1644032
1644288
1652480
1652736
1659904
1660160
1644127
1644383
1652575
1652831
1659999
1660255
1721125
1721637
1722149
1722405
1721126
1721638
1722150
1722406
1722662
1722918
1723686
1723942
1721127
1721639
1722151
1722407
1722663
1722919
1723687
1723943
1721128
1721640
1722152
1722408
1722664
1722920
1723688
1723944
1721129
1721641
1722153
1722409
1722665
1722921
1723689
1723945
1721130
1721642
1722154
1722410
1722666
1722922
1723690
1723946
1721131
1721643
1722155
1722411
1722667
1722923
1723691
1723947
1721132
1721644
1722156
1722412
1722668
1722924
1723692
1723948
1721133
1721645
1722157
1722413
1722669
1722925
1723693
1723949
1721134
1721646
1722158
1722414
1722670
1722926
1723694
1723950
1721135
1721647
1722159
1722415
1722671
1722927
1723695
1723951
1721136
1721648
1722160
1722416
1722672
1722928
1723696
1723952
1721137
1721649
1722161
1722417
1722673
1722929
1723697
1723953
1721138
1721650
1722162
1722418
1722674
1722930
1723698
1723954
1721139
1721651
1722163
1722419
1722675
1722931
1723699
1723955
1721140
1721652
1722164
1722420
1722676
1722932
1723700
1723956
1721141
1721653
1722165
1722421
1722677
1722933
1723701
1723957
1721142
1721654
1722166
1722422
1722678
1722934
1723702
1723958
1721143
1721655
1722167
1722423
1722679
1722935
1723703
1723959
1721144
1721656
1722168
1722424
1722680
1722936
1723704
1723960
1721145
1721657
1722169
1722425
1722681
1722937
1723705
1723961
1721146
1721658
1722170
1722426
1722682
1722938
1723706
1723962
1721147
1721659
1722171
1722427
1722683
1722939
1723707
1723963
1721148
1721660
1722172
1722428
1722684
1722940
1723708
1723964
1721149
1721661
1722173
1722429
1722685
1722941
1723709
1723965
1709568
1709824
1718016
1718272
1725440
1725696
1709663
1709919
1718111
1718367
1725535
1725791
1787673
1786404
1786916
1787428
1786405
1786917
1787429
1786407
1786919
1787687
1786408
1786920
1787688
1786410
1786922
1787434
1786411
1786923
1786414
1786926
1787438
1787694
1786415
1786927
1787439
1787695
1786416
1786928
1787440
1787696
1786417
1786929
1787441
1787697
1786418
1786930
1787442
1787698
1786419
1786931
1787443
1787699
1786420
1786932
1787444
1787700
1786421
1786933
1787445
1787701
1786422
1786934
1787446
1787702
1786423
1786935
1787447
1787703
1786424
1786936
1787448
1787704
1786425
1786937
1787449
1787705
1786426
1786938
1787450
1787706
1786427
1786939
1787451
1787707
1786428
1786940
1787452
1787708
1786429
1786941
1787453
1787709
1775104
1775360
1783552
1783808
1790976
1791232
1775199
1775455
1783647
1783903
1791071
1791327
1852457
1856041
1857065
1852459
1856043
1857067
1852460
1856044
1857068
1852462
1856046
1857070
1852463
1856047
1857071
1852464
1856048
1857072
1852465
1856049
1857073
1852466
1856050
1857074
1852467
1856051
1857075
1852468
1856052
1857076
1852469
1856053
1857077
1852470
1856054
1857078
1852471
1856055
1857079
1852472
1856056
1857080
1852473
1856057
1857081
1852474
1856058
1857082
1852475
1856059
1857083
1852476
1856060
1852477
1856061
1857085
1840640
1840896
1849088
1849344
1856512
1856768
1840735
1840991
1849183
1849439
1856607
1856863
1906176
1906432
1914624
1914880
1922048
1922304
1906271
1906527
1914719
1914975
1922143
1922399
1971712
1971968
1980160
1980416
1987584
1987840
1971807
1972063
1980255
1980511
1987679
1987935
2053937
2053940
2053946
2053947
2037248
2037504
2045696
2045952
2053120
2053376
2037343
2037599
2045791
2046047
2053215
2053471
2110464
2110720
2110465
2110721
2116903
2102784
2103040
2111232
2111488
2118656
2118912
2102879
2103135
2111327
2111583
2118751
2119007
2179892
2180148
2183476
2168320
2168576
2176768
2177024
2184192
2184448
2168415
2168671
2176863
2177119
2184287
2184543
2233856
2234112
2242304
2242560
2249728
2249984
2233951
2234207
2242399
2242655
2249823
2250079
2299392
2299648
2307840
2308096
2315264
2315520
2299487
2299743
2307935
2308191
2315359
2315615
2375974
2376742
2376998
2378534
2375975
2376743
2376999
2378535
2381863
2375976
2376744
2377000
2378536
2381864
2375977
2376745
2377001
2378537
2381865
2375978
2376746
2377002
2378538
2381866
2375979
2376747
2377003
2378539
2381867
2375980
2376748
2377004
2378540
2381868
2375981
2376749
2377005
2378541
2381869
2375982
2376750
2377006
2378542
2381870
2375983
2376751
2377007
2378543
2375984
2376752
2377008
2378544
2381872
2375985
2376753
2377009
2378545
2381873
2375986
2376754
2377010
2378546
2381874
2375987
2376755
2377011
2378547
2381875
2375988
2376756
2377012
2378548
2381876
2375989
2376757
2377013
2378549
2381877
2375990
2376758
2377014
2378550
2381878
2375991
2376759
2377015
2378551
2381879
2375992
2376760
2377016
2378552
2381880
2375993
2376761
2377017
2378553
2381881
2375994
2376762
2377018
2378554
2381882
2375995
2376763
2377019
2378555
2381883
2375996
2376764
2377020
2378556
2381884
2375997
2376765
2377021
2378557
2381885
2364928
2365184
2373376
2373632
2380800
2381056
2365023
2365279
2373471
2373727
2380895
2381151
2447105
2442532
2442278
2444326
2442281
2444329
2444841
2444331
2444843
2444332
2444333
2444334
2444335
2444336
2444337
2444338
2444339
2444340
2444341
2444342
2444343
2444344
2430464
2430720
2438912
2439168
2446336
2446592
2430559
2430815
2439007
2439263
2446431
2446687
2496000
2496256
2504448
2504704
2511872
2512128
2496095
2496351
2504543
2504799
2511967
2512223
2577665
2572601
2572603
2561536
2561792
2569984
2570240
2577408
2577664
2561631
2561887
2570079
2570335
2577503
2577759
2627072
2627328
2635520
2635776
2642944
2643200
2627167
2627423
2635615
2635871
2643039
2643295
2703408
2703410
2692608
2692864
2701056
2701312
2708480
2708736
2692703
2692959
2701151
2701407
2708575
2708831
2770985
2772521
2773545
2774057
2774569
2774825
2775081
2770999
2772535
2774071
2774583
2774839
2775095
2771000
2772536
2773560
2774072
2774584
2774840
2775096
2771006
2772542
2774078
2774590
2758144
2758400
2766592
2766848
2774016
2774272
2758239
2758495
2766687
2766943
2774111
2774367
2834476
2838828
2823680
2823936
2832128
2832384
2839552
2839808
2823775
2824031
2832223
2832479
2839647
2839903
2901029
2901030
2901035
2901039
2901040
2901041
2901046
2903094
2901048
2903096
2901049
2903097
2901050
2903098
2901051
2903099
2901053
2903101
2889216
2889472
2897664
2897920
2905088
2905344
2889311
2889567
2897759
2898015
2905183
2905439
2965543
2968615
2968871
2969383
2971943
2965545
2968617
2969385
2971945
2965546
2968874
2969386
2971946
2965547
2968619
2971947
2965561
2968633
2968889
2969401
2971961
2954752
2955008
2963200
2963456
2970624
2970880
2954847
2955103
2963295
2963551
2970719
2970975
3035176
3035432
3035688
3035944
3036200
3036456
3036712
3036968
3037224
3037480
3035180
3035436
3035692
3035948
3036204
3036460
3036716
3036972
3037228
3037484
3020288
3020544
3028736
3028992
3036160
3036416
3020383
3020639
3028831
3029087
3036255
3036511
3096616
3097128
3097640
3097896
3098408
3100712
3100968
3096617
3097129
3097641
3097897
3098409
3100713
3100969
3096618
3097130
3097642
3097898
3098410
3100714
3100970
3096619
3097131
3097643
3097899
3098411
3100715
3100971
3096620
3097132
3097644
3097900
3098412
3100716
3100972
3096621
3097133
3097645
3097901
3098413
3100717
3100973
3096622
3097134
3097646
3097902
3098414
3100718
3100974
3096623
3097135
3097647
3097903
3098415
3100719
3100975
3096625
3097649
3097905
3098673
3098929
3099185
3099441
3099697
3099953
3100209
3100465
3100721
3100977
3096626
3097138
3097650
3096627
3097139
3097395
3097651
3098419
3098675
3098931
3099187
3099443
3099699
3099955
3100211
3100467
3100723
3100979
3096628
3097140
3097396
3097652
3098420
3098676
3098932
3099188
3099444
3099700
3099956
3100212
3100468
3100724
3100980
3096629
3097397
3097653
3098933
3099189
3099701
3099957
3100469
3100725
3100981
3096630
3097142
3097910
3098166
3098934
3099190
3099446
3099702
3100470
3100726
3100982
3097143
3097655
3098167
3098423
3098679
3099447
3099703
3100215
3100471
3100983
3097144
3097400
3097912
3098424
3098680
3099192
3097145
3097913
3099449
3100217
3100473
3100729
3100985
3096634
3096890
3097146
3097658
3099706
3100218
3100474
3100730
3100986
3096635
3096891
3097403
3098683
3098939
3099451
3099707
3100219
3100475
3100731
3100987
3096636
3096892
3098172
3098428
3098684
3099452
3099708
3100220
3100476
3100732
3100988
3096637
3097149
3097405
3097661
3097917
3098173
3098429
3098685
3098941
3099453
3099709
3100221
3100477
3100733
3100989
3085824
3086080
3094272
3094528
3101696
3101952
3085919
3086175
3094367
3094623
3101791
3102047
3167232
3167488
3167233
3167489
3151360
3151616
3159808
3160064
3167232
3167488
3151455
3151711
3159903
3160159
3167327
3167583
3232768
3232769
3233025
3216896
3217152
3225344
3225600
3232768
3233024
3216991
3217247
3225439
3225695
3232863
3233119
3293222
3299110
3299366
3293223
3299111
3299367
3293224
3299112
3299368
3293225
3299113
3299369
3293226
3299114
3299370
3293227
3299115
3299371
3293228
3299116
3299372
3293229
3299117
3299373
3293230
3299118
3299374
3293231
3299119
3299375
3293232
3299120
3299376
3293233
3299121
3299377
3293234
3299122
3299378
3293235
3299123
3299379
3293236
3299124
3299380
3293237
3299125
3299381
3293238
3299126
3299382
3293239
3299127
3299383
3293240
3299128
3299384
3282432
3282688
3290880
3291136
3298304
3298560
3282527
3282783
3290975
3291231
3298399
3298655
3358758
3359014
3359782
3361062
3362854
3358759
3359015
3359783
3361063
3362855
3358760
3359016
3359784
3361064
3362856
3358762
3359018
3359786
3361066
3362858
3358764
3359020
3359788
3361068
3362860
3358766
3359022
3359790
3361070
3362862
3358767
3359023
3359791
3361071
3362863
3358769
3359025
3359793
3361073
3362865
3358770
3359026
3359794
3361074
3362866
3358771
3359027
3359795
3361075
3362867
3358772
3359028
3359796
3361076
3362868
3358773
3359029
3359797
3361077
3362869
3358774
3359030
3359798
3361078
3362870
3347968
3348224
3356416
3356672
3363840
3364096
3348063
3348319
3356511
3356767
3363935
3364191
3428917
3429941
3430453
3413504
3413760
3421952
3422208
3429376
3429632
3413599
3413855
3422047
3422303
3429471
3429727
3479040
3479296
3487488
3487744
3494912
3495168
3479135
3479391
3487583
3487839
3495007
3495263
