0 0 0.841423945623 0.842307686806 1.41095888615
0 1 0.831540169807 0.858141958714 1.40138554573
0 2 0.793706293375 0.894273102283 1.40886700153
1 0 0.830449837951 0.875 1.37619042397
1 1 0.709620103295 0.902272045612 1.56184017658
1 2 0.704268297034 0.91774892807 1.54716980457
2 0 0.735211299207 0.915708839893 1.48535561562
2 1 0.732047589768 0.900856792927 1.51636910439
2 2 0.669540234472 0.927038609982 1.61111116409
3 0 0.838006201276 0.869888484478 1.37179481983
3 1 0.681348660672 0.912920296192 1.60767316818
3 2 0.817869444621 0.903361320496 1.35348832607
4 0 0.684754532721 0.916981160641 1.59259259701
4 1 0.701765563711 0.885106503963 1.60995018482
4 2 0.877394657255 0.829694330692 1.37368416786
5 0 0.808139537124 0.8669064641 1.42738592625
5 1 0.672183330885 0.89669239521 1.65908563137
5 2 0.810276669915 0.868292689323 1.42134833336
6 0 0.940789510576 0.751748263836 1.41395354271
6 1 0.622064761236 0.89605820179 1.794023633
6 2 0.757785482757 0.894977152348 1.47448980808
7 0 0.71148457103 0.881889760494 1.59375
7 1 0.701711146001 0.851604819298 1.67341446877
7 2 0.6677215074 0.924170613289 1.62051284313
8 0 0.73854445446 0.857664227486 1.57872343063
8 1 1.07430878401 0.693978190422 1.34129738808
8 2 0.801444023317 0.846846818924 1.47340428829
9 0 0.787114846727 0.893238425255 1.42231070995
9 1 0.732671304311 0.869401335716 1.56989467144
9 2 0.748447182802 0.912863075733 1.46363639832
10 0 0.72660101573 0.905084729195 1.52059924603
10 1 0.648488103294 0.893957436085 1.72496843338
10 2 0.765472292194 0.859574496746 1.5198019743
11 0 0.755725208032 0.878787875175 1.50574707985
11 1 0.65442361184 0.898466646671 1.70074462891
11 2 0.733542315363 0.888888895512 1.53365385532
12 0 0.986885189972 0.803986728191 1.26033055782
12 1 0.581749870818 0.922779381275 1.86279821396
12 2 0.748344359045 0.929203510284 1.43809521198
13 0 0.716381425819 0.877133131027 1.59143972397
13 1 0.69990811243 0.888214528561 1.6085742712
13 2 0.915057950015 0.805907189846 1.35602092743
14 0 0.759358267471 0.887323915958 1.48412692547
14 1 0.70815966543 0.873761534691 1.61612856388
14 2 0.738019186756 0.883116900921 1.53431367874
15 0 1.0404040166 0.74757283926 1.28571426868
15 1 0.681756659121 0.876448452473 1.67357134819
15 2 0.816666658554 0.840816318989 1.45631062984
16 0 1.04745764257 0.741100311279 1.28820955753
16 1 0.636111369356 0.893927872181 1.75858902931
16 2 0.786833850801 0.848605573177 1.49765253067
17 0 0.758024670162 0.912052094936 1.44642853737
17 1 0.628710202467 0.899967670441 1.76734995842
17 2 0.774373242082 0.917266190052 1.40784311295
18 0 0.898218875834 0.801699697971 1.38869261742
18 1 0.594975263292 0.909371614456 1.84824573994
18 2 0.841040440405 0.89347076416 1.33076918125
19 0 0.726530596691 0.926966309547 1.4848484993
19 1 0.726945945157 0.861225545406 1.59727966785
19 2 0.832402273996 0.848993301392 1.4150197506
20 0 0.917159735495 0.800000011921 1.36290323734
20 1 0.740609538921 0.865826308727 1.5594804287
20 2 0.728735652754 0.921135663986 1.48972606659
21 0 0.909426967022 0.81097561121 1.355889678
21 1 0.602798815961 0.903577268124 1.83595621586
21 2 0.776785681214 0.873563230038 1.4736841917
22 0 0.780898892094 0.861510813236 1.48643004894
22 1 0.748701692918 0.859430789948 1.55410456657
22 2 0.881796716649 0.844503998756 1.34285712242
23 0 0.762202718871 0.8866994977 1.47962963581
23 1 0.66169683277 0.888335168362 1.70123422146
23 2 0.765384639949 0.902010023594 1.44846796989
24 0 0.925692721204 0.793197274208 1.36192107201
24 1 0.708167975264 0.854000687599 1.6535050869
24 2 0.856310699433 0.843537390232 1.38440859318
25 0 0.723048339794 0.906169652939 1.52624118328
25 1 0.738229814843 0.86801636219 1.56056010723
25 2 0.855018599486 0.889130413532 1.31540346146
26 0 0.741451235216 0.876265466213 1.53915274143
26 1 0.871237012883 0.791661500931 1.44985365868
26 2 0.79617831735 0.861999988556 1.45707654953
27 0 0.725299371816 0.882352948189 1.56257307529
27 1 0.645576241623 0.878665149212 1.76290559769
27 2 0.754143623561 0.873626351357 1.51781976223
28 0 0.658055766576 0.905991733074 1.67730903625
28 1 0.881899061626 0.768763661385 1.47498726845
28 2 0.873111751661 0.818339109421 1.39957714081
29 0 0.810231043025 0.862525463104 1.43093276024
29 1 0.729062081985 0.857304394245 1.59992802143
29 2 0.795518184969 0.866197168827 1.45121955872
30 0 0.958217305832 0.74903100729 1.39327299595
30 1 0.922743133663 0.760135293007 1.42570054531
30 2 0.931564200366 0.775112450123 1.38491296768
31 0 1.19099757416 0.658835530281 1.27441859245
31 1 0.706315355537 0.835169494152 1.6952226162
31 2 0.75560805556 0.846875011921 1.56273066998
32 0 0.883647780854 0.837485194206 1.35127472878
32 1 0.72665577455 0.869483590126 1.58274102211
32 2 0.713024278808 0.930340528488 1.50748753548
33 0 0.784797658875 0.881761014462 1.44507849216
33 1 21964.0005104 4.55290464743e-05 1.0
33 2 0.888010493601 0.83234423399 1.35294115543
34 0 1.7180527157 0.48760330677 1.1937046051
34 1 0.814379256542 0.860588550568 1.42684805393
34 2 0.846350835625 0.897125542164 1.31703209877
35 0 0.779660985443 0.891304373741 1.43902444839
35 1 0.787423686312 0.859792709351 1.47705864906
35 2 0.730158713579 0.874223589897 1.56660747528
36 0 0.761609872828 0.857723593712 1.53080570698
36 1 5987.00019437 0.000111352375825 1.5
36 2 0.867283949979 0.84697508812 1.36134457588
37 0 4.68041252213 0.160792946815 1.32876718044
37 1 0.818186216142 0.851975440979 1.43456673622
37 2 0.856474279199 0.848816037178 1.3755364418
38 0 526.000004164 0.00190114066936 1.0
38 1 1.1115820696 0.719800531864 1.24981665611
38 2 1.02638523057 0.771208226681 1.26333332062
39 0 1.25242714823 0.655038774014 1.21893489361
39 1 0.748977306686 0.882205843925 1.5134267807
39 2 1.09324012013 0.733475506306 1.24709308147
40 0 0.957415557971 0.771472394466 1.35387670994
40 1 0.754799802694 0.875345110893 1.51352262497
40 2 0.813242758539 0.862212955952 1.42615008354
41 0 0.822742452611 0.908536612988 1.33780765533
41 1 0.782893176052 0.889136493206 1.43657755852
41 2 6.23300965283 0.143302187324 1.11956524849
42 0 1.20440249857 0.680156648159 1.22072935104
42 1 0.67307042857 0.901672303677 1.64774787426
42 2 1.04502370318 0.761904776096 1.25595235825
43 0 0.766169125147 0.834415555 1.56420230865
43 1 0.787834345134 0.847774088383 1.49721765518
43 2 0.752228184453 0.881516575813 1.50806450844
44 0 1.0 0.0 0.0
44 1 0.556469537624 0.934916615486 1.92214310169
44 2 1.10354226785 0.696296274662 1.30141842365
45 0 0.809523818715 0.854489147663 1.44565212727
45 1 0.722659033983 0.900885343552 1.53602063656
45 2 0.910138279347 0.830379724503 1.32317078114
46 0 0.882352947364 0.766666650772 1.47826087475
46 1 0.801407807523 0.867599248886 1.43822646141
46 2 1.11228069501 0.709779202938 1.26666665077
47 0 1.32110096367 0.621527791023 1.21787714958
47 1 1.01661132548 0.77296179533 1.27258563042
47 2 0.969298191387 0.809954762459 1.27374303341
48 0 0.93209872908 0.764900684357 1.40259742737
48 1 0.945648539593 0.775201439857 1.36412978172
48 2 0.855932196472 0.777227699757 1.50318467617
49 0 0.799435061092 0.83392226696 1.5
49 1 0.604230444625 0.921602964401 1.79578173161
49 2 0.825136632447 0.867549657822 1.39694654942
50 0 0.855769260197 0.831460654736 1.40540540218
50 1 0.841197309647 0.848394036293 1.40121412277
50 2 0.944099367697 0.796052634716 1.3305785656
51 0 1.08469056912 0.660660684109 1.39545452595
51 1 0.701184605148 0.919134378433 1.55163156986
51 2 0.943181800294 0.710843384266 1.49152541161
52 0 1.18971062826 0.616216242313 1.36403512955
52 1 0.705399437958 0.895448982716 1.58315718174
52 2 2.86842114487 0.238532111049 1.46153843403
53 0 1.43445692692 0.464751958847 1.5
53 1 0.914683387978 0.780011296272 1.40161371231
53 2 1.6129032134 0.414999991655 1.49397587776
