2686976
2687232
2687488
2687744
2688000
2688256
2688512
2688768
2689024
2689280
2689536
2689792
2690048
2690304
2690560
2690816
2691072
2691328
2691584
2691840
2692096
2692352
2692608
2692864
2693120
2693376
2693632
2693888
2694144
2694400
2694656
2694912
2686977
2687233
2687489
2687745
2688001
2688257
2688513
2688769
2689025
2689281
2689537
2689793
2690049
2690305
2690561
2690817
2691073
2691329
2691585
2691841
2692097
2692353
2692609
2692865
2693121
2693377
2693633
2693889
2694145
2694401
2694657
2694913
2686978
2687234
2687490
2687746
2688002
2688258
2688514
2688770
2689026
2689282
2689538
2689794
2690050
2690306
2690562
2690818
2691074
2691330
2691586
2691842
2692098
2692354
2692610
2692866
2693122
2693378
2693634
2693890
2694146
2694402
2694658
2694914
2686979
2687235
2687491
2687747
2688003
2688259
2688515
2688771
2689027
2689283
2689539
2689795
2690051
2690307
2690563
2690819
2691075
2691331
2691587
2691843
2692099
2692355
2692611
2692867
2693123
2693379
2693635
2693891
2694147
2694403
2694659
2694915
2686980
2687236
2687492
2687748
2688004
2688260
2688516
2688772
2689028
2689284
2689540
2689796
2690052
2690308
2690564
2690820
2691076
2691332
2691588
2691844
2692100
2692356
2692612
2692868
2693124
2693380
2693636
2693892
2694148
2694404
2694660
2694916
2686981
2687237
2687493
2687749
2688005
2688261
2688517
2688773
2689029
2689285
2689541
2689797
2690053
2690309
2690565
2690821
2691077
2691333
2691589
2691845
2692101
2692357
2692613
2692869
2693125
2693381
2693637
2693893
2694149
2694405
2694661
2694917
2686982
2687238
2687494
2687750
2688006
2688262
2688518
2688774
2689030
2689286
2689542
2689798
2690054
2690310
2690566
2690822
2691078
2691334
2691590
2691846
2692102
2692358
2692614
2692870
2693126
2693382
2693638
2693894
2694150
2694406
2694662
2694918
2686983
2687239
2687495
2687751
2688007
2688263
2688519
2688775
2689031
2689287
2689543
2689799
2690055
2690311
2690567
2690823
2691079
2691335
2691591
2691847
2692103
2692359
2692615
2692871
2693127
2693383
2693639
2693895
2694151
2694407
2694663
2694919
2686984
2687240
2687496
2687752
2688008
2688264
2688520
2688776
2689032
2689288
2689544
2689800
2690056
2690312
2690568
2690824
2691080
2691336
2691592
2691848
2692104
2692360
2692616
2692872
2693128
2693384
2693640
2693896
2694152
2694408
2694664
2694920
2686985
2687241
2687497
2687753
2688009
2688265
2688521
2688777
2689033
2689289
2689545
2689801
2690057
2690313
2690569
2690825
2691081
2691337
2691593
2691849
2692105
2692361
2692617
2692873
2693129
2693385
2693641
2693897
2694153
2694409
2694665
2694921
2686986
2687242
2687498
2687754
2688010
2688266
2688522
2688778
2689034
2689290
2689546
2689802
2690058
2690314
2690570
2690826
2691082
2691338
2691594
2691850
2692106
2692362
2692618
2692874
2693130
2693386
2693642
2693898
2694154
2694410
2694666
2694922
2686987
2687243
2687499
2687755
2688011
2688267
2688523
2688779
2689035
2689291
2689547
2689803
2690059
2690315
2690571
2690827
2691083
2691339
2691595
2691851
2692107
2692363
2692619
2692875
2693131
2693387
2693643
2693899
2694155
2694411
2694667
2694923
2686988
2687244
2687500
2687756
2688012
2688268
2688524
2688780
2689036
2689292
2689548
2689804
2690060
2690316
2690572
2690828
2691084
2691340
2691596
2691852
2692108
2692364
2692620
2692876
2693132
2693388
2693644
2693900
2694156
2694412
2694668
2694924
2686989
2687245
2687501
2687757
2688013
2688269
2688525
2688781
2689037
2689293
2689549
2689805
2690061
2690317
2690573
2690829
2691085
2691341
2691597
2691853
2692109
2692365
2692621
2692877
2693133
2693389
2693645
2693901
2694157
2694413
2694669
2694925
2686990
2687246
2687502
2687758
2688014
2688270
2688526
2688782
2689038
2689294
2689550
2689806
2690062
2690318
2690574
2690830
2691086
2691342
2691598
2691854
2692110
2692366
2692622
2692878
2693134
2693390
2693646
2693902
2694158
2694414
2694670
2694926
2686991
2687247
2687503
2687759
2688015
2688271
2688527
2688783
2689039
2689295
2689551
2689807
2690063
2690319
2690575
2690831
2691087
2691343
2691599
2691855
2692111
2692367
2692623
2692879
2693135
2693391
2693647
2693903
2694159
2694415
2694671
2694927
2686992
2687248
2687504
2687760
2688016
2688272
2688528
2688784
2689040
2689296
2689552
2689808
2690064
2690320
2690576
2690832
2691088
2691344
2691600
2691856
2692112
2692368
2692624
2692880
2693136
2693392
2693648
2693904
2694160
2694416
2694672
2694928
2686993
2687249
2687505
2687761
2688017
2688273
2688529
2688785
2689041
2689297
2689553
2689809
2690065
2690321
2690577
2690833
2691089
2691345
2691601
2691857
2692113
2692369
2692625
2692881
2693137
2693393
2693649
2693905
2694161
2694417
2694673
2694929
2686994
2687250
2687506
2687762
2688018
2688274
2688530
2688786
2689042
2689298
2689554
2689810
2690066
2690322
2690578
2690834
2691090
2691346
2691602
2691858
2692114
2692370
2692626
2692882
2693138
2693394
2693650
2693906
2694162
2694418
2694674
2694930
2686995
2687251
2687507
2687763
2688019
2688275
2688531
2688787
2689043
2689299
2689555
2689811
2690067
2690323
2690579
2690835
2691091
2691347
2691603
2691859
2692115
2692371
2692627
2692883
2693139
2693395
2693651
2693907
2694163
2694419
2694675
2694931
2686996
2687252
2687508
2687764
2688020
2688276
2688532
2688788
2689044
2689300
2689556
2689812
2690068
2690324
2690580
2690836
2691092
2691348
2691604
2691860
2692116
2692372
2692628
2692884
2693140
2693396
2693652
2693908
2694164
2694420
2694676
2694932
2686997
2687253
2687509
2687765
2688021
2688277
2688533
2688789
2689045
2689301
2689557
2689813
2690069
2690325
2690581
2690837
2691093
2691349
2691605
2691861
2692117
2692373
2692629
2692885
2693141
2693397
2693653
2693909
2694165
2694421
2694677
2694933
2686998
2687254
2687510
2687766
2688022
2688278
2688534
2688790
2689046
2689302
2689558
2689814
2690070
2690326
2690582
2690838
2691094
2691350
2691606
2691862
2692118
2692374
2692630
2692886
2693142
2693398
2693654
2693910
2694166
2694422
2694678
2694934
2686999
2687255
2687511
2687767
2688023
2688279
2688535
2688791
2689047
2689303
2689559
2689815
2690071
2690327
2690583
2690839
2691095
2691351
2691607
2691863
2692119
2692375
2692631
2692887
2693143
2693399
2693655
2693911
2694167
2694423
2694679
2694935
2687000
2687256
2687512
2687768
2688024
2688280
2688536
2688792
2689048
2689304
2689560
2689816
2690072
2690328
2690584
2690840
2691096
2691352
2691608
2691864
2692120
2692376
2692632
2692888
2693144
2693400
2693656
2693912
2694168
2694424
2694680
2694936
2687001
2687257
2687513
2687769
2688025
2688281
2688537
2688793
2689049
2689305
2689561
2689817
2690073
2690329
2690585
2690841
2691097
2691353
2691609
2691865
2692121
2692377
2692633
2692889
2693145
2693401
2693657
2693913
2694169
2694425
2694681
2694937
2687002
2687258
2687514
2687770
2688026
2688282
2688538
2688794
2689050
2689306
2689562
2689818
2690074
2690330
2690586
2690842
2691098
2691354
2691610
2691866
2692122
2692378
2692634
2692890
2693146
2693402
2693658
2693914
2694170
2694426
2694682
2694938
2687003
2687259
2687515
2687771
2688027
2688283
2688539
2688795
2689051
2689307
2689563
2689819
2690075
2690331
2690587
2690843
2691099
2691355
2691611
2691867
2692123
2692379
2692635
2692891
2693147
2693403
2693659
2693915
2694171
2694427
2694683
2694939
2687004
2687260
2687516
2687772
2688028
2688284
2688540
2688796
2689052
2689308
2689564
2689820
2690076
2690332
2690588
2690844
2691100
2691356
2691612
2691868
2692124
2692380
2692636
2692892
2693148
2693404
2693660
2693916
2694172
2694428
2694684
2694940
2687005
2687261
2687517
2687773
2688029
2688285
2688541
2688797
2689053
2689309
2689565
2689821
2690077
2690333
2690589
2690845
2691101
2691357
2691613
2691869
2692125
2692381
2692637
2692893
2693149
2693405
2693661
2693917
2694173
2694429
2694685
2694941
2687006
2687262
2687518
2687774
2688030
2688286
2688542
2688798
2689054
2689310
2689566
2689822
2690078
2690334
2690590
2690846
2691102
2691358
2691614
2691870
2692126
2692382
2692638
2692894
2693150
2693406
2693662
2693918
2694174
2694430
2694686
2694942
2687007
2687263
2687519
2687775
2688031
2688287
2688543
2688799
2689055
2689311
2689567
2689823
2690079
2690335
2690591
2690847
2691103
2691359
2691615
2691871
2692127
2692383
2692639
2692895
2693151
2693407
2693663
2693919
2694175
2694431
2694687
2694943
2687008
2687264
2687520
2687776
2688032
2688288
2688544
2688800
2689056
2689312
2689568
2689824
2690080
2690336
2690592
2690848
2691104
2691360
2691616
2691872
2692128
2692384
2692640
2692896
2693152
2693408
2693664
2693920
2694176
2694432
2694688
2694944
2687009
2687265
2687521
2687777
2688033
2688289
2688545
2688801
2689057
2689313
2689569
2689825
2690081
2690337
2690593
2690849
2691105
2691361
2691617
2691873
2692129
2692385
2692641
2692897
2693153
2693409
2693665
2693921
2694177
2694433
2694689
2694945
2687010
2687266
2687522
2687778
2688034
2688290
2688546
2688802
2689058
2689314
2689570
2689826
2690082
2690338
2690594
2690850
2691106
2691362
2691618
2691874
2692130
2692386
2692642
2692898
2693154
2693410
2693666
2693922
2694178
2694434
2694690
2694946
2687011
2687267
2687523
2687779
2688035
2688291
2688547
2688803
2689059
2689315
2689571
2689827
2690083
2690339
2690595
2690851
2691107
2691363
2691619
2691875
2692131
2692387
2692643
2692899
2693155
2693411
2693667
2693923
2694179
2694435
2694691
2694947
2687012
2687268
2687524
2687780
2688036
2688292
2688548
2688804
2689060
2689316
2689572
2689828
2690084
2690340
2690596
2690852
2691108
2691364
2691620
2691876
2692132
2692388
2692644
2692900
2693156
2693412
2693668
2693924
2694180
2694436
2694692
2694948
2687013
2687269
2687525
2687781
2688037
2688293
2688549
2688805
2689061
2689317
2689573
2689829
2690085
2690341
2690597
2690853
2691109
2691365
2691621
2691877
2692133
2692389
2692645
2692901
2693157
2693413
2693669
2693925
2694181
2694437
2694693
2694949
2687014
2687270
2687526
2687782
2688038
2688294
2688550
2688806
2689062
2689318
2689574
2689830
2690086
2690342
2690598
2690854
2691110
2691366
2691622
2691878
2692134
2692390
2692646
2692902
2693158
2693414
2693670
2693926
2694182
2694438
2694694
2694950
2687015
2687271
2687527
2687783
2688039
2688295
2688551
2688807
2689063
2689319
2689575
2689831
2690087
2690343
2690599
2690855
2691111
2691367
2691623
2691879
2692135
2692391
2692647
2692903
2693159
2693415
2693671
2693927
2694183
2694439
2694695
2694951
2687016
2687272
2687528
2687784
2688040
2688296
2688552
2688808
2689064
2689320
2689576
2689832
2690088
2690344
2690600
2690856
2691112
2691368
2691624
2691880
2692136
2692392
2692648
2692904
2693160
2693416
2693672
2693928
2694184
2694440
2694696
2694952
2687017
2687273
2687529
2687785
2688041
2688297
2688553
2688809
2689065
2689321
2689577
2689833
2690089
2690345
2690601
2690857
2691113
2691369
2691625
2691881
2692137
2692393
2692649
2692905
2693161
2693417
2693673
2693929
2694185
2694441
2694697
2694953
2687018
2687274
2687530
2687786
2688042
2688298
2688554
2688810
2689066
2689322
2689578
2689834
2690090
2690346
2690602
2690858
2691114
2691370
2691626
2691882
2692138
2692394
2692650
2692906
2693162
2693418
2693674
2693930
2694186
2694442
2694698
2694954
2687019
2687275
2687531
2687787
2688043
2688299
2688555
2688811
2689067
2689323
2689579
2689835
2690091
2690347
2690603
2690859
2691115
2691371
2691627
2691883
2692139
2692395
2692651
2692907
2693163
2693419
2693675
2693931
2694187
2694443
2694699
2694955
2687020
2687276
2687532
2687788
2688044
2688300
2688556
2688812
2689068
2689324
2689580
2689836
2690092
2690348
2690604
2690860
2691116
2691372
2691628
2691884
2692140
2692396
2692652
2692908
2693164
2693420
2693676
2693932
2694188
2694444
2694700
2694956
2687021
2687277
2687533
2687789
2688045
2688301
2688557
2688813
2689069
2689325
2689581
2689837
2690093
2690349
2690605
2690861
2691117
2691373
2691629
2691885
2692141
2692397
2692653
2692909
2693165
2693421
2693677
2693933
2694189
2694445
2694701
2694957
2687022
2687278
2687534
2687790
2688046
2688302
2688558
2688814
2689070
2689326
2689582
2689838
2690094
2690350
2690606
2690862
2691118
2691374
2691630
2691886
2692142
2692398
2692654
2692910
2693166
2693422
2693678
2693934
2694190
2694446
2694702
2694958
2687023
2687279
2687535
2687791
2688047
2688303
2688559
2688815
2689071
2689327
2689583
2689839
2690095
2690351
2690607
2690863
2691119
2691375
2691631
2691887
2692143
2692399
2692655
2692911
2693167
2693423
2693679
2693935
2694191
2694447
2694703
2694959
2687024
2687280
2687536
2687792
2688048
2688304
2688560
2688816
2689072
2689328
2689584
2689840
2690096
2690352
2690608
2690864
2691120
2691376
2691632
2691888
2692144
2692400
2692656
2692912
2693168
2693424
2693680
2693936
2694192
2694448
2694704
2694960
2687025
2687281
2687537
2687793
2688049
2688305
2688561
2688817
2689073
2689329
2689585
2689841
2690097
2690353
2690609
2690865
2691121
2691377
2691633
2691889
2692145
2692401
2692657
2692913
2693169
2693425
2693681
2693937
2694193
2694449
2694705
2694961
2687026
2687282
2687538
2687794
2688050
2688306
2688562
2688818
2689074
2689330
2689586
2689842
2690098
2690354
2690610
2690866
2691122
2691378
2691634
2691890
2692146
2692402
2692658
2692914
2693170
2693426
2693682
2693938
2694194
2694450
2694706
2694962
2687027
2687283
2687539
2687795
2688051
2688307
2688563
2688819
2689075
2689331
2689587
2689843
2690099
2690355
2690611
2690867
2691123
2691379
2691635
2691891
2692147
2692403
2692659
2692915
2693171
2693427
2693683
2693939
2694195
2694451
2694707
2694963
2687028
2687284
2687540
2687796
2688052
2688308
2688564
2688820
2689076
2689332
2689588
2689844
2690100
2690356
2690612
2690868
2691124
2691380
2691636
2691892
2692148
2692404
2692660
2692916
2693172
2693428
2693684
2693940
2694196
2694452
2694708
2694964
2687029
2687285
2687541
2687797
2688053
2688309
2688565
2688821
2689077
2689333
2689589
2689845
2690101
2690357
2690613
2690869
2691125
2691381
2691637
2691893
2692149
2692405
2692661
2692917
2693173
2693429
2693685
2693941
2694197
2694453
2694709
2694965
2687030
2687286
2687542
2687798
2688054
2688310
2688566
2688822
2689078
2689334
2689590
2689846
2690102
2690358
2690614
2690870
2691126
2691382
2691638
2691894
2692150
2692406
2692662
2692918
2693174
2693430
2693686
2693942
2694198
2694454
2694710
2694966
2687031
2687287
2687543
2687799
2688055
2688311
2688567
2688823
2689079
2689335
2689591
2689847
2690103
2690359
2690615
2690871
2691127
2691383
2691639
2691895
2692151
2692407
2692663
2692919
2693175
2693431
2693687
2693943
2694199
2694455
2694711
2694967
2687032
2687288
2687544
2687800
2688056
2688312
2688568
2688824
2689080
2689336
2689592
2689848
2690104
2690360
2690616
2690872
2691128
2691384
2691640
2691896
2692152
2692408
2692664
2692920
2693176
2693432
2693688
2693944
2694200
2694456
2694712
2694968
2687033
2687289
2687545
2687801
2688057
2688313
2688569
2688825
2689081
2689337
2689593
2689849
2690105
2690361
2690617
2690873
2691129
2691385
2691641
2691897
2692153
2692409
2692665
2692921
2693177
2693433
2693689
2693945
2694201
2694457
2694713
2694969
2687034
2687290
2687546
2687802
2688058
2688314
2688570
2688826
2689082
2689338
2689594
2689850
2690106
2690362
2690618
2690874
2691130
2691386
2691642
2691898
2692154
2692410
2692666
2692922
2693178
2693434
2693690
2693946
2694202
2694458
2694714
2694970
2687035
2687291
2687547
2687803
2688059
2688315
2688571
2688827
2689083
2689339
2689595
2689851
2690107
2690363
2690619
2690875
2691131
2691387
2691643
2691899
2692155
2692411
2692667
2692923
2693179
2693435
2693691
2693947
2694203
2694459
2694715
2694971
2687036
2687292
2687548
2687804
2688060
2688316
2688572
2688828
2689084
2689340
2689596
2689852
2690108
2690364
2690620
2690876
2691132
2691388
2691644
2691900
2692156
2692412
2692668
2692924
2693180
2693436
2693692
2693948
2694204
2694460
2694716
2694972
2687037
2687293
2687549
2687805
2688061
2688317
2688573
2688829
2689085
2689341
2689597
2689853
2690109
2690365
2690621
2690877
2691133
2691389
2691645
2691901
2692157
2692413
2692669
2692925
2693181
2693437
2693693
2693949
2694205
2694461
2694717
2694973
2687038
2687294
2687550
2687806
2688062
2688318
2688574
2688830
2689086
2689342
2689598
2689854
2690110
2690366
2690622
2690878
2691134
2691390
2691646
2691902
2692158
2692414
2692670
2692926
2693182
2693438
2693694
2693950
2694206
2694462
2694718
2694974
2687039
2687295
2687551
2687807
2688063
2688319
2688575
2688831
2689087
2689343
2689599
2689855
2690111
2690367
2690623
2690879
2691135
2691391
2691647
2691903
2692159
2692415
2692671
2692927
2693183
2693439
2693695
2693951
2694207
2694463
2694719
2694975
2687040
2687296
2687552
2687808
2688064
2688320
2688576
2688832
2689088
2689344
2689600
2689856
2690112
2690368
2690624
2690880
2691136
2691392
2691648
2691904
2692160
2692416
2692672
2692928
2693184
2693440
2693696
2693952
2694208
2694464
2694720
2694976
2687041
2687297
2687553
2687809
2688065
2688321
2688577
2688833
2689089
2689345
2689601
2689857
2690113
2690369
2690625
2690881
2691137
2691393
2691649
2691905
2692161
2692417
2692673
2692929
2693185
2693441
2693697
2693953
2694209
2694465
2694721
2694977
2687042
2687298
2687554
2687810
2688066
2688322
2688578
2688834
2689090
2689346
2689602
2689858
2690114
2690370
2690626
2690882
2691138
2691394
2691650
2691906
2692162
2692418
2692674
2692930
2693186
2693442
2693698
2693954
2694210
2694466
2694722
2694978
2687043
2687299
2687555
2687811
2688067
2688323
2688579
2688835
2689091
2689347
2689603
2689859
2690115
2690371
2690627
2690883
2691139
2691395
2691651
2691907
2692163
2692419
2692675
2692931
2693187
2693443
2693699
2693955
2694211
2694467
2694723
2694979
2687044
2687300
2687556
2687812
2688068
2688324
2688580
2688836
2689092
2689348
2689604
2689860
2690116
2690372
2690628
2690884
2691140
2691396
2691652
2691908
2692164
2692420
2692676
2692932
2693188
2693444
2693700
2693956
2694212
2694468
2694724
2694980
2687045
2687301
2687557
2687813
2688069
2688325
2688581
2688837
2689093
2689349
2689605
2689861
2690117
2690373
2690629
2690885
2691141
2691397
2691653
2691909
2692165
2692421
2692677
2692933
2693189
2693445
2693701
2693957
2694213
2694469
2694725
2694981
2687046
2687302
2687558
2687814
2688070
2688326
2688582
2688838
2689094
2689350
2689606
2689862
2690118
2690374
2690630
2690886
2691142
2691398
2691654
2691910
2692166
2692422
2692678
2692934
2693190
2693446
2693702
2693958
2694214
2694470
2694726
2694982
2687047
2687303
2687559
2687815
2688071
2688327
2688583
2688839
2689095
2689351
2689607
2689863
2690119
2690375
2690631
2690887
2691143
2691399
2691655
2691911
2692167
2692423
2692679
2692935
2693191
2693447
2693703
2693959
2694215
2694471
2694727
2694983
2687048
2687304
2687560
2687816
2688072
2688328
2688584
2688840
2689096
2689352
2689608
2689864
2690120
2690376
2690632
2690888
2691144
2691400
2691656
2691912
2692168
2692424
2692680
2692936
2693192
2693448
2693704
2693960
2694216
2694472
2694728
2694984
2687049
2687305
2687561
2687817
2688073
2688329
2688585
2688841
2689097
2689353
2689609
2689865
2690121
2690377
2690633
2690889
2691145
2691401
2691657
2691913
2692169
2692425
2692681
2692937
2693193
2693449
2693705
2693961
2694217
2694473
2694729
2694985
2687050
2687306
2687562
2687818
2688074
2688330
2688586
2688842
2689098
2689354
2689610
2689866
2690122
2690378
2690634
2690890
2691146
2691402
2691658
2691914
2692170
2692426
2692682
2692938
2693194
2693450
2693706
2693962
2694218
2694474
2694730
2694986
2687051
2687307
2687563
2687819
2688075
2688331
2688587
2688843
2689099
2689355
2689611
2689867
2690123
2690379
2690635
2690891
2691147
2691403
2691659
2691915
2692171
2692427
2692683
2692939
2693195
2693451
2693707
2693963
2694219
2694475
2694731
2694987
2687052
2687308
2687564
2687820
2688076
2688332
2688588
2688844
2689100
2689356
2689612
2689868
2690124
2690380
2690636
2690892
2691148
2691404
2691660
2691916
2692172
2692428
2692684
2692940
2693196
2693452
2693708
2693964
2694220
2694476
2694732
2694988
2687053
2687309
2687565
2687821
2688077
2688333
2688589
2688845
2689101
2689357
2689613
2689869
2690125
2690381
2690637
2690893
2691149
2691405
2691661
2691917
2692173
2692429
2692685
2692941
2693197
2693453
2693709
2693965
2694221
2694477
2694733
2694989
2687054
2687310
2687566
2687822
2688078
2688334
2688590
2688846
2689102
2689358
2689614
2689870
2690126
2690382
2690638
2690894
2691150
2691406
2691662
2691918
2692174
2692430
2692686
2692942
2693198
2693454
2693710
2693966
2694222
2694478
2694734
2694990
2687055
2687311
2687567
2687823
2688079
2688335
2688591
2688847
2689103
2689359
2689615
2689871
2690127
2690383
2690639
2690895
2691151
2691407
2691663
2691919
2692175
2692431
2692687
2692943
2693199
2693455
2693711
2693967
2694223
2694479
2694735
2694991
2687056
2687312
2687568
2687824
2688080
2688336
2688592
2688848
2689104
2689360
2689616
2689872
2690128
2690384
2690640
2690896
2691152
2691408
2691664
2691920
2692176
2692432
2692688
2692944
2693200
2693456
2693712
2693968
2694224
2694480
2694736
2694992
2687057
2687313
2687569
2687825
2688081
2688337
2688593
2688849
2689105
2689361
2689617
2689873
2690129
2690385
2690641
2690897
2691153
2691409
2691665
2691921
2692177
2692433
2692689
2692945
2693201
2693457
2693713
2693969
2694225
2694481
2694737
2694993
2687058
2687314
2687570
2687826
2688082
2688338
2688594
2688850
2689106
2689362
2689618
2689874
2690130
2690386
2690642
2690898
2691154
2691410
2691666
2691922
2692178
2692434
2692690
2692946
2693202
2693458
2693714
2693970
2694226
2694482
2694738
2694994
2687059
2687315
2687571
2687827
2688083
2688339
2688595
2688851
2689107
2689363
2689619
2689875
2690131
2690387
2690643
2690899
2691155
2691411
2691667
2691923
2692179
2692435
2692691
2692947
2693203
2693459
2693715
2693971
2694227
2694483
2694739
2694995
2687060
2687316
2687572
2687828
2688084
2688340
2688596
2688852
2689108
2689364
2689620
2689876
2690132
2690388
2690644
2690900
2691156
2691412
2691668
2691924
2692180
2692436
2692692
2692948
2693204
2693460
2693716
2693972
2694228
2694484
2694740
2694996
2687061
2687317
2687573
2687829
2688085
2688341
2688597
2688853
2689109
2689365
2689621
2689877
2690133
2690389
2690645
2690901
2691157
2691413
2691669
2691925
2692181
2692437
2692693
2692949
2693205
2693461
2693717
2693973
2694229
2694485
2694741
2694997
2687062
2687318
2687574
2687830
2688086
2688342
2688598
2688854
2689110
2689366
2689622
2689878
2690134
2690390
2690646
2690902
2691158
2691414
2691670
2691926
2692182
2692438
2692694
2692950
2693206
2693462
2693718
2693974
2694230
2694486
2694742
2694998
2687063
2687319
2687575
2687831
2688087
2688343
2688599
2688855
2689111
2689367
2689623
2689879
2690135
2690391
2690647
2690903
2691159
2691415
2691671
2691927
2692183
2692439
2692695
2692951
2693207
2693463
2693719
2693975
2694231
2694487
2694743
2694999
2687064
2687320
2687576
2687832
2688088
2688344
2688600
2688856
2689112
2689368
2689624
2689880
2690136
2690392
2690648
2690904
2691160
2691416
2691672
2691928
2692184
2692440
2692696
2692952
2693208
2693464
2693720
2693976
2694232
2694488
2694744
2695000
2687065
2687321
2687577
2687833
2688089
2688345
2688601
2688857
2689113
2689369
2689625
2689881
2690137
2690393
2690649
2690905
2691161
2691417
2691673
2691929
2692185
2692441
2692697
2692953
2693209
2693465
2693721
2693977
2694233
2694489
2694745
2695001
2687066
2687322
2687578
2687834
2688090
2688346
2688602
2688858
2689114
2689370
2689626
2689882
2690138
2690394
2690650
2690906
2691162
2691418
2691674
2691930
2692186
2692442
2692698
2692954
2693210
2693466
2693722
2693978
2694234
2694490
2694746
2695002
2687067
2687323
2687579
2687835
2688091
2688347
2688603
2688859
2689115
2689371
2689627
2689883
2690139
2690395
2690651
2690907
2691163
2691419
2691675
2691931
2692187
2692443
2692699
2692955
2693211
2693467
2693723
2693979
2694235
2694491
2694747
2695003
2687068
2687324
2687580
2687836
2688092
2688348
2688604
2688860
2689116
2689372
2689628
2689884
2690140
2690396
2690652
2690908
2691164
2691420
2691676
2691932
2692188
2692444
2692700
2692956
2693212
2693468
2693724
2693980
2694236
2694492
2694748
2695004
2687069
2687325
2687581
2687837
2688093
2688349
2688605
2688861
2689117
2689373
2689629
2689885
2690141
2690397
2690653
2690909
2691165
2691421
2691677
2691933
2692189
2692445
2692701
2692957
2693213
2693469
2693725
2693981
2694237
2694493
2694749
2695005
2687070
2687326
2687582
2687838
2688094
2688350
2688606
2688862
2689118
2689374
2689630
2689886
2690142
2690398
2690654
2690910
2691166
2691422
2691678
2691934
2692190
2692446
2692702
2692958
2693214
2693470
2693726
2693982
2694238
2694494
2694750
2695006
2687071
2687327
2687583
2687839
2688095
2688351
2688607
2688863
2689119
2689375
2689631
2689887
2690143
2690399
2690655
2690911
2691167
2691423
2691679
2691935
2692191
2692447
2692703
2692959
2693215
2693471
2693727
2693983
2694239
2694495
2694751
2695007
3014656
3014912
3015168
3015424
3015680
3015936
3016192
3016448
3016704
3016960
3017216
3017472
3017728
3017984
3018240
3018496
3018752
3019008
3019264
3019520
3019776
3020032
3020288
3020544
3020800
3021056
3021312
3021568
3021824
3022080
3022336
3022592
3014657
3014913
3015169
3015425
3015681
3015937
3016193
3016449
3016705
3016961
3017217
3017473
3017729
3017985
3018241
3018497
3018753
3019009
3019265
3019521
3019777
3020033
3020289
3020545
3020801
3021057
3021313
3021569
3021825
3022081
3022337
3022593
3014658
3014914
3015170
3015426
3015682
3015938
3016194
3016450
3016706
3016962
3017218
3017474
3017730
3017986
3018242
3018498
3018754
3019010
3019266
3019522
3019778
3020034
3020290
3020546
3020802
3021058
3021314
3021570
3021826
3022082
3022338
3022594
3014659
3014915
3015171
3015427
3015683
3015939
3016195
3016451
3016707
3016963
3017219
3017475
3017731
3017987
3018243
3018499
3018755
3019011
3019267
3019523
3019779
3020035
3020291
3020547
3020803
3021059
3021315
3021571
3021827
3022083
3022339
3022595
3014660
3014916
3015172
3015428
3015684
3015940
3016196
3016452
3016708
3016964
3017220
3017476
3017732
3017988
3018244
3018500
3018756
3019012
3019268
3019524
3019780
3020036
3020292
3020548
3020804
3021060
3021316
3021572
3021828
3022084
3022340
3022596
3014661
3014917
3015173
3015429
3015685
3015941
3016197
3016453
3016709
3016965
3017221
3017477
3017733
3017989
3018245
3018501
3018757
3019013
3019269
3019525
3019781
3020037
3020293
3020549
3020805
3021061
3021317
3021573
3021829
3022085
3022341
3022597
3014662
3014918
3015174
3015430
3015686
3015942
3016198
3016454
3016710
3016966
3017222
3017478
3017734
3017990
3018246
3018502
3018758
3019014
3019270
3019526
3019782
3020038
3020294
3020550
3020806
3021062
3021318
3021574
3021830
3022086
3022342
3022598
3014663
3014919
3015175
3015431
3015687
3015943
3016199
3016455
3016711
3016967
3017223
3017479
3017735
3017991
3018247
3018503
3018759
3019015
3019271
3019527
3019783
3020039
3020295
3020551
3020807
3021063
3021319
3021575
3021831
3022087
3022343
3022599
3014664
3014920
3015176
3015432
3015688
3015944
3016200
3016456
3016712
3016968
3017224
3017480
3017736
3017992
3018248
3018504
3018760
3019016
3019272
3019528
3019784
3020040
3020296
3020552
3020808
3021064
3021320
3021576
3021832
3022088
3022344
3022600
3014665
3014921
3015177
3015433
3015689
3015945
3016201
3016457
3016713
3016969
3017225
3017481
3017737
3017993
3018249
3018505
3018761
3019017
3019273
3019529
3019785
3020041
3020297
3020553
3020809
3021065
3021321
3021577
3021833
3022089
3022345
3022601
3014666
3014922
3015178
3015434
3015690
3015946
3016202
3016458
3016714
3016970
3017226
3017482
3017738
3017994
3018250
3018506
3018762
3019018
3019274
3019530
3019786
3020042
3020298
3020554
3020810
3021066
3021322
3021578
3021834
3022090
3022346
3022602
3014667
3014923
3015179
3015435
3015691
3015947
3016203
3016459
3016715
3016971
3017227
3017483
3017739
3017995
3018251
3018507
3018763
3019019
3019275
3019531
3019787
3020043
3020299
3020555
3020811
3021067
3021323
3021579
3021835
3022091
3022347
3022603
3014668
3014924
3015180
3015436
3015692
3015948
3016204
3016460
3016716
3016972
3017228
3017484
3017740
3017996
3018252
3018508
3018764
3019020
3019276
3019532
3019788
3020044
3020300
3020556
3020812
3021068
3021324
3021580
3021836
3022092
3022348
3022604
3014669
3014925
3015181
3015437
3015693
3015949
3016205
3016461
3016717
3016973
3017229
3017485
3017741
3017997
3018253
3018509
3018765
3019021
3019277
3019533
3019789
3020045
3020301
3020557
3020813
3021069
3021325
3021581
3021837
3022093
3022349
3022605
3014670
3014926
3015182
3015438
3015694
3015950
3016206
3016462
3016718
3016974
3017230
3017486
3017742
3017998
3018254
3018510
3018766
3019022
3019278
3019534
3019790
3020046
3020302
3020558
3020814
3021070
3021326
3021582
3021838
3022094
3022350
3022606
3014671
3014927
3015183
3015439
3015695
3015951
3016207
3016463
3016719
3016975
3017231
3017487
3017743
3017999
3018255
3018511
3018767
3019023
3019279
3019535
3019791
3020047
3020303
3020559
3020815
3021071
3021327
3021583
3021839
3022095
3022351
3022607
3014672
3014928
3015184
3015440
3015696
3015952
3016208
3016464
3016720
3016976
3017232
3017488
3017744
3018000
3018256
3018512
3018768
3019024
3019280
3019536
3019792
3020048
3020304
3020560
3020816
3021072
3021328
3021584
3021840
3022096
3022352
3022608
3014673
3014929
3015185
3015441
3015697
3015953
3016209
3016465
3016721
3016977
3017233
3017489
3017745
3018001
3018257
3018513
3018769
3019025
3019281
3019537
3019793
3020049
3020305
3020561
3020817
3021073
3021329
3021585
3021841
3022097
3022353
3022609
3014674
3014930
3015186
3015442
3015698
3015954
3016210
3016466
3016722
3016978
3017234
3017490
3017746
3018002
3018258
3018514
3018770
3019026
3019282
3019538
3019794
3020050
3020306
3020562
3020818
3021074
3021330
3021586
3021842
3022098
3022354
3022610
3014675
3014931
3015187
3015443
3015699
3015955
3016211
3016467
3016723
3016979
3017235
3017491
3017747
3018003
3018259
3018515
3018771
3019027
3019283
3019539
3019795
3020051
3020307
3020563
3020819
3021075
3021331
3021587
3021843
3022099
3022355
3022611
3014676
3014932
3015188
3015444
3015700
3015956
3016212
3016468
3016724
3016980
3017236
3017492
3017748
3018004
3018260
3018516
3018772
3019028
3019284
3019540
3019796
3020052
3020308
3020564
3020820
3021076
3021332
3021588
3021844
3022100
3022356
3022612
3014677
3014933
3015189
3015445
3015701
3015957
3016213
3016469
3016725
3016981
3017237
3017493
3017749
3018005
3018261
3018517
3018773
3019029
3019285
3019541
3019797
3020053
3020309
3020565
3020821
3021077
3021333
3021589
3021845
3022101
3022357
3022613
3014678
3014934
3015190
3015446
3015702
3015958
3016214
3016470
3016726
3016982
3017238
3017494
3017750
3018006
3018262
3018518
3018774
3019030
3019286
3019542
3019798
3020054
3020310
3020566
3020822
3021078
3021334
3021590
3021846
3022102
3022358
3022614
3014679
3014935
3015191
3015447
3015703
3015959
3016215
3016471
3016727
3016983
3017239
3017495
3017751
3018007
3018263
3018519
3018775
3019031
3019287
3019543
3019799
3020055
3020311
3020567
3020823
3021079
3021335
3021591
3021847
3022103
3022359
3022615
3014680
3014936
3015192
3015448
3015704
3015960
3016216
3016472
3016728
3016984
3017240
3017496
3017752
3018008
3018264
3018520
3018776
3019032
3019288
3019544
3019800
3020056
3020312
3020568
3020824
3021080
3021336
3021592
3021848
3022104
3022360
3022616
3014681
3014937
3015193
3015449
3015705
3015961
3016217
3016473
3016729
3016985
3017241
3017497
3017753
3018009
3018265
3018521
3018777
3019033
3019289
3019545
3019801
3020057
3020313
3020569
3020825
3021081
3021337
3021593
3021849
3022105
3022361
3022617
3014682
3014938
3015194
3015450
3015706
3015962
3016218
3016474
3016730
3016986
3017242
3017498
3017754
3018010
3018266
3018522
3018778
3019034
3019290
3019546
3019802
3020058
3020314
3020570
3020826
3021082
3021338
3021594
3021850
3022106
3022362
3022618
3014683
3014939
3015195
3015451
3015707
3015963
3016219
3016475
3016731
3016987
3017243
3017499
3017755
3018011
3018267
3018523
3018779
3019035
3019291
3019547
3019803
3020059
3020315
3020571
3020827
3021083
3021339
3021595
3021851
3022107
3022363
3022619
3014684
3014940
3015196
3015452
3015708
3015964
3016220
3016476
3016732
3016988
3017244
3017500
3017756
3018012
3018268
3018524
3018780
3019036
3019292
3019548
3019804
3020060
3020316
3020572
3020828
3021084
3021340
3021596
3021852
3022108
3022364
3022620
3014685
3014941
3015197
3015453
3015709
3015965
3016221
3016477
3016733
3016989
3017245
3017501
3017757
3018013
3018269
3018525
3018781
3019037
3019293
3019549
3019805
3020061
3020317
3020573
3020829
3021085
3021341
3021597
3021853
3022109
3022365
3022621
3014686
3014942
3015198
3015454
3015710
3015966
3016222
3016478
3016734
3016990
3017246
3017502
3017758
3018014
3018270
3018526
3018782
3019038
3019294
3019550
3019806
3020062
3020318
3020574
3020830
3021086
3021342
3021598
3021854
3022110
3022366
3022622
3014687
3014943
3015199
3015455
3015711
3015967
3016223
3016479
3016735
3016991
3017247
3017503
3017759
3018015
3018271
3018527
3018783
3019039
3019295
3019551
3019807
3020063
3020319
3020575
3020831
3021087
3021343
3021599
3021855
3022111
3022367
3022623
3014688
3014944
3015200
3015456
3015712
3015968
3016224
3016480
3016736
3016992
3017248
3017504
3017760
3018016
3018272
3018528
3018784
3019040
3019296
3019552
3019808
3020064
3020320
3020576
3020832
3021088
3021344
3021600
3021856
3022112
3022368
3022624
3014689
3014945
3015201
3015457
3015713
3015969
3016225
3016481
3016737
3016993
3017249
3017505
3017761
3018017
3018273
3018529
3018785
3019041
3019297
3019553
3019809
3020065
3020321
3020577
3020833
3021089
3021345
3021601
3021857
3022113
3022369
3022625
3014690
3014946
3015202
3015458
3015714
3015970
3016226
3016482
3016738
3016994
3017250
3017506
3017762
3018018
3018274
3018530
3018786
3019042
3019298
3019554
3019810
3020066
3020322
3020578
3020834
3021090
3021346
3021602
3021858
3022114
3022370
3022626
3014691
3014947
3015203
3015459
3015715
3015971
3016227
3016483
3016739
3016995
3017251
3017507
3017763
3018019
3018275
3018531
3018787
3019043
3019299
3019555
3019811
3020067
3020323
3020579
3020835
3021091
3021347
3021603
3021859
3022115
3022371
3022627
3014692
3014948
3015204
3015460
3015716
3015972
3016228
3016484
3016740
3016996
3017252
3017508
3017764
3018020
3018276
3018532
3018788
3019044
3019300
3019556
3019812
3020068
3020324
3020580
3020836
3021092
3021348
3021604
3021860
3022116
3022372
3022628
3014693
3014949
3015205
3015461
3015717
3015973
3016229
3016485
3016741
3016997
3017253
3017509
3017765
3018021
3018277
3018533
3018789
3019045
3019301
3019557
3019813
3020069
3020325
3020581
3020837
3021093
3021349
3021605
3021861
3022117
3022373
3022629
3014694
3014950
3015206
3015462
3015718
3015974
3016230
3016486
3016742
3016998
3017254
3017510
3017766
3018022
3018278
3018534
3018790
3019046
3019302
3019558
3019814
3020070
3020326
3020582
3020838
3021094
3021350
3021606
3021862
3022118
3022374
3022630
3014695
3014951
3015207
3015463
3015719
3015975
3016231
3016487
3016743
3016999
3017255
3017511
3017767
3018023
3018279
3018535
3018791
3019047
3019303
3019559
3019815
3020071
3020327
3020583
3020839
3021095
3021351
3021607
3021863
3022119
3022375
3022631
3014696
3014952
3015208
3015464
3015720
3015976
3016232
3016488
3016744
3017000
3017256
3017512
3017768
3018024
3018280
3018536
3018792
3019048
3019304
3019560
3019816
3020072
3020328
3020584
3020840
3021096
3021352
3021608
3021864
3022120
3022376
3022632
3014697
3014953
3015209
3015465
3015721
3015977
3016233
3016489
3016745
3017001
3017257
3017513
3017769
3018025
3018281
3018537
3018793
3019049
3019305
3019561
3019817
3020073
3020329
3020585
3020841
3021097
3021353
3021609
3021865
3022121
3022377
3022633
3014698
3014954
3015210
3015466
3015722
3015978
3016234
3016490
3016746
3017002
3017258
3017514
3017770
3018026
3018282
3018538
3018794
3019050
3019306
3019562
3019818
3020074
3020330
3020586
3020842
3021098
3021354
3021610
3021866
3022122
3022378
3022634
3014699
3014955
3015211
3015467
3015723
3015979
3016235
3016491
3016747
3017003
3017259
3017515
3017771
3018027
3018283
3018539
3018795
3019051
3019307
3019563
3019819
3020075
3020331
3020587
3020843
3021099
3021355
3021611
3021867
3022123
3022379
3022635
3014700
3014956
3015212
3015468
3015724
3015980
3016236
3016492
3016748
3017004
3017260
3017516
3017772
3018028
3018284
3018540
3018796
3019052
3019308
3019564
3019820
3020076
3020332
3020588
3020844
3021100
3021356
3021612
3021868
3022124
3022380
3022636
3014701
3014957
3015213
3015469
3015725
3015981
3016237
3016493
3016749
3017005
3017261
3017517
3017773
3018029
3018285
3018541
3018797
3019053
3019309
3019565
3019821
3020077
3020333
3020589
3020845
3021101
3021357
3021613
3021869
3022125
3022381
3022637
3014702
3014958
3015214
3015470
3015726
3015982
3016238
3016494
3016750
3017006
3017262
3017518
3017774
3018030
3018286
3018542
3018798
3019054
3019310
3019566
3019822
3020078
3020334
3020590
3020846
3021102
3021358
3021614
3021870
3022126
3022382
3022638
3014703
3014959
3015215
3015471
3015727
3015983
3016239
3016495
3016751
3017007
3017263
3017519
3017775
3018031
3018287
3018543
3018799
3019055
3019311
3019567
3019823
3020079
3020335
3020591
3020847
3021103
3021359
3021615
3021871
3022127
3022383
3022639
3014704
3014960
3015216
3015472
3015728
3015984
3016240
3016496
3016752
3017008
3017264
3017520
3017776
3018032
3018288
3018544
3018800
3019056
3019312
3019568
3019824
3020080
3020336
3020592
3020848
3021104
3021360
3021616
3021872
3022128
3022384
3022640
3014705
3014961
3015217
3015473
3015729
3015985
3016241
3016497
3016753
3017009
3017265
3017521
3017777
3018033
3018289
3018545
3018801
3019057
3019313
3019569
3019825
3020081
3020337
3020593
3020849
3021105
3021361
3021617
3021873
3022129
3022385
3022641
3014706
3014962
3015218
3015474
3015730
3015986
3016242
3016498
3016754
3017010
3017266
3017522
3017778
3018034
3018290
3018546
3018802
3019058
3019314
3019570
3019826
3020082
3020338
3020594
3020850
3021106
3021362
3021618
3021874
3022130
3022386
3022642
3014707
3014963
3015219
3015475
3015731
3015987
3016243
3016499
3016755
3017011
3017267
3017523
3017779
3018035
3018291
3018547
3018803
3019059
3019315
3019571
3019827
3020083
3020339
3020595
3020851
3021107
3021363
3021619
3021875
3022131
3022387
3022643
3014708
3014964
3015220
3015476
3015732
3015988
3016244
3016500
3016756
3017012
3017268
3017524
3017780
3018036
3018292
3018548
3018804
3019060
3019316
3019572
3019828
3020084
3020340
3020596
3020852
3021108
3021364
3021620
3021876
3022132
3022388
3022644
3014709
3014965
3015221
3015477
3015733
3015989
3016245
3016501
3016757
3017013
3017269
3017525
3017781
3018037
3018293
3018549
3018805
3019061
3019317
3019573
3019829
3020085
3020341
3020597
3020853
3021109
3021365
3021621
3021877
3022133
3022389
3022645
3014710
3014966
3015222
3015478
3015734
3015990
3016246
3016502
3016758
3017014
3017270
3017526
3017782
3018038
3018294
3018550
3018806
3019062
3019318
3019574
3019830
3020086
3020342
3020598
3020854
3021110
3021366
3021622
3021878
3022134
3022390
3022646
3014711
3014967
3015223
3015479
3015735
3015991
3016247
3016503
3016759
3017015
3017271
3017527
3017783
3018039
3018295
3018551
3018807
3019063
3019319
3019575
3019831
3020087
3020343
3020599
3020855
3021111
3021367
3021623
3021879
3022135
3022391
3022647
3014712
3014968
3015224
3015480
3015736
3015992
3016248
3016504
3016760
3017016
3017272
3017528
3017784
3018040
3018296
3018552
3018808
3019064
3019320
3019576
3019832
3020088
3020344
3020600
3020856
3021112
3021368
3021624
3021880
3022136
3022392
3022648
3014713
3014969
3015225
3015481
3015737
3015993
3016249
3016505
3016761
3017017
3017273
3017529
3017785
3018041
3018297
3018553
3018809
3019065
3019321
3019577
3019833
3020089
3020345
3020601
3020857
3021113
3021369
3021625
3021881
3022137
3022393
3022649
3014714
3014970
3015226
3015482
3015738
3015994
3016250
3016506
3016762
3017018
3017274
3017530
3017786
3018042
3018298
3018554
3018810
3019066
3019322
3019578
3019834
3020090
3020346
3020602
3020858
3021114
3021370
3021626
3021882
3022138
3022394
3022650
3014715
3014971
3015227
3015483
3015739
3015995
3016251
3016507
3016763
3017019
3017275
3017531
3017787
3018043
3018299
3018555
3018811
3019067
3019323
3019579
3019835
3020091
3020347
3020603
3020859
3021115
3021371
3021627
3021883
3022139
3022395
3022651
3014716
3014972
3015228
3015484
3015740
3015996
3016252
3016508
3016764
3017020
3017276
3017532
3017788
3018044
3018300
3018556
3018812
3019068
3019324
3019580
3019836
3020092
3020348
3020604
3020860
3021116
3021372
3021628
3021884
3022140
3022396
3022652
3014717
3014973
3015229
3015485
3015741
3015997
3016253
3016509
3016765
3017021
3017277
3017533
3017789
3018045
3018301
3018557
3018813
3019069
3019325
3019581
3019837
3020093
3020349
3020605
3020861
3021117
3021373
3021629
3021885
3022141
3022397
3022653
3014718
3014974
3015230
3015486
3015742
3015998
3016254
3016510
3016766
3017022
3017278
3017534
3017790
3018046
3018302
3018558
3018814
3019070
3019326
3019582
3019838
3020094
3020350
3020606
3020862
3021118
3021374
3021630
3021886
3022142
3022398
3022654
3014719
3014975
3015231
3015487
3015743
3015999
3016255
3016511
3016767
3017023
3017279
3017535
3017791
3018047
3018303
3018559
3018815
3019071
3019327
3019583
3019839
3020095
3020351
3020607
3020863
3021119
3021375
3021631
3021887
3022143
3022399
3022655
3014720
3014976
3015232
3015488
3015744
3016000
3016256
3016512
3016768
3017024
3017280
3017536
3017792
3018048
3018304
3018560
3018816
3019072
3019328
3019584
3019840
3020096
3020352
3020608
3020864
3021120
3021376
3021632
3021888
3022144
3022400
3022656
3014721
3014977
3015233
3015489
3015745
3016001
3016257
3016513
3016769
3017025
3017281
3017537
3017793
3018049
3018305
3018561
3018817
3019073
3019329
3019585
3019841
3020097
3020353
3020609
3020865
3021121
3021377
3021633
3021889
3022145
3022401
3022657
3014722
3014978
3015234
3015490
3015746
3016002
3016258
3016514
3016770
3017026
3017282
3017538
3017794
3018050
3018306
3018562
3018818
3019074
3019330
3019586
3019842
3020098
3020354
3020610
3020866
3021122
3021378
3021634
3021890
3022146
3022402
3022658
3014723
3014979
3015235
3015491
3015747
3016003
3016259
3016515
3016771
3017027
3017283
3017539
3017795
3018051
3018307
3018563
3018819
3019075
3019331
3019587
3019843
3020099
3020355
3020611
3020867
3021123
3021379
3021635
3021891
3022147
3022403
3022659
3014724
3014980
3015236
3015492
3015748
3016004
3016260
3016516
3016772
3017028
3017284
3017540
3017796
3018052
3018308
3018564
3018820
3019076
3019332
3019588
3019844
3020100
3020356
3020612
3020868
3021124
3021380
3021636
3021892
3022148
3022404
3022660
3014725
3014981
3015237
3015493
3015749
3016005
3016261
3016517
3016773
3017029
3017285
3017541
3017797
3018053
3018309
3018565
3018821
3019077
3019333
3019589
3019845
3020101
3020357
3020613
3020869
3021125
3021381
3021637
3021893
3022149
3022405
3022661
3014726
3014982
3015238
3015494
3015750
3016006
3016262
3016518
3016774
3017030
3017286
3017542
3017798
3018054
3018310
3018566
3018822
3019078
3019334
3019590
3019846
3020102
3020358
3020614
3020870
3021126
3021382
3021638
3021894
3022150
3022406
3022662
3014727
3014983
3015239
3015495
3015751
3016007
3016263
3016519
3016775
3017031
3017287
3017543
3017799
3018055
3018311
3018567
3018823
3019079
3019335
3019591
3019847
3020103
3020359
3020615
3020871
3021127
3021383
3021639
3021895
3022151
3022407
3022663
3014728
3014984
3015240
3015496
3015752
3016008
3016264
3016520
3016776
3017032
3017288
3017544
3017800
3018056
3018312
3018568
3018824
3019080
3019336
3019592
3019848
3020104
3020360
3020616
3020872
3021128
3021384
3021640
3021896
3022152
3022408
3022664
3014729
3014985
3015241
3015497
3015753
3016009
3016265
3016521
3016777
3017033
3017289
3017545
3017801
3018057
3018313
3018569
3018825
3019081
3019337
3019593
3019849
3020105
3020361
3020617
3020873
3021129
3021385
3021641
3021897
3022153
3022409
3022665
3014730
3014986
3015242
3015498
3015754
3016010
3016266
3016522
3016778
3017034
3017290
3017546
3017802
3018058
3018314
3018570
3018826
3019082
3019338
3019594
3019850
3020106
3020362
3020618
3020874
3021130
3021386
3021642
3021898
3022154
3022410
3022666
3014731
3014987
3015243
3015499
3015755
3016011
3016267
3016523
3016779
3017035
3017291
3017547
3017803
3018059
3018315
3018571
3018827
3019083
3019339
3019595
3019851
3020107
3020363
3020619
3020875
3021131
3021387
3021643
3021899
3022155
3022411
3022667
3014732
3014988
3015244
3015500
3015756
3016012
3016268
3016524
3016780
3017036
3017292
3017548
3017804
3018060
3018316
3018572
3018828
3019084
3019340
3019596
3019852
3020108
3020364
3020620
3020876
3021132
3021388
3021644
3021900
3022156
3022412
3022668
3014733
3014989
3015245
3015501
3015757
3016013
3016269
3016525
3016781
3017037
3017293
3017549
3017805
3018061
3018317
3018573
3018829
3019085
3019341
3019597
3019853
3020109
3020365
3020621
3020877
3021133
3021389
3021645
3021901
3022157
3022413
3022669
3014734
3014990
3015246
3015502
3015758
3016014
3016270
3016526
3016782
3017038
3017294
3017550
3017806
3018062
3018318
3018574
3018830
3019086
3019342
3019598
3019854
3020110
3020366
3020622
3020878
3021134
3021390
3021646
3021902
3022158
3022414
3022670
3014735
3014991
3015247
3015503
3015759
3016015
3016271
3016527
3016783
3017039
3017295
3017551
3017807
3018063
3018319
3018575
3018831
3019087
3019343
3019599
3019855
3020111
3020367
3020623
3020879
3021135
3021391
3021647
3021903
3022159
3022415
3022671
3014736
3014992
3015248
3015504
3015760
3016016
3016272
3016528
3016784
3017040
3017296
3017552
3017808
3018064
3018320
3018576
3018832
3019088
3019344
3019600
3019856
3020112
3020368
3020624
3020880
3021136
3021392
3021648
3021904
3022160
3022416
3022672
3014737
3014993
3015249
3015505
3015761
3016017
3016273
3016529
3016785
3017041
3017297
3017553
3017809
3018065
3018321
3018577
3018833
3019089
3019345
3019601
3019857
3020113
3020369
3020625
3020881
3021137
3021393
3021649
3021905
3022161
3022417
3022673
3014738
3014994
3015250
3015506
3015762
3016018
3016274
3016530
3016786
3017042
3017298
3017554
3017810
3018066
3018322
3018578
3018834
3019090
3019346
3019602
3019858
3020114
3020370
3020626
3020882
3021138
3021394
3021650
3021906
3022162
3022418
3022674
3014739
3014995
3015251
3015507
3015763
3016019
3016275
3016531
3016787
3017043
3017299
3017555
3017811
3018067
3018323
3018579
3018835
3019091
3019347
3019603
3019859
3020115
3020371
3020627
3020883
3021139
3021395
3021651
3021907
3022163
3022419
3022675
3014740
3014996
3015252
3015508
3015764
3016020
3016276
3016532
3016788
3017044
3017300
3017556
3017812
3018068
3018324
3018580
3018836
3019092
3019348
3019604
3019860
3020116
3020372
3020628
3020884
3021140
3021396
3021652
3021908
3022164
3022420
3022676
3014741
3014997
3015253
3015509
3015765
3016021
3016277
3016533
3016789
3017045
3017301
3017557
3017813
3018069
3018325
3018581
3018837
3019093
3019349
3019605
3019861
3020117
3020373
3020629
3020885
3021141
3021397
3021653
3021909
3022165
3022421
3022677
3014742
3014998
3015254
3015510
3015766
3016022
3016278
3016534
3016790
3017046
3017302
3017558
3017814
3018070
3018326
3018582
3018838
3019094
3019350
3019606
3019862
3020118
3020374
3020630
3020886
3021142
3021398
3021654
3021910
3022166
3022422
3022678
3014743
3014999
3015255
3015511
3015767
3016023
3016279
3016535
3016791
3017047
3017303
3017559
3017815
3018071
3018327
3018583
3018839
3019095
3019351
3019607
3019863
3020119
3020375
3020631
3020887
3021143
3021399
3021655
3021911
3022167
3022423
3022679
3014744
3015000
3015256
3015512
3015768
3016024
3016280
3016536
3016792
3017048
3017304
3017560
3017816
3018072
3018328
3018584
3018840
3019096
3019352
3019608
3019864
3020120
3020376
3020632
3020888
3021144
3021400
3021656
3021912
3022168
3022424
3022680
3014745
3015001
3015257
3015513
3015769
3016025
3016281
3016537
3016793
3017049
3017305
3017561
3017817
3018073
3018329
3018585
3018841
3019097
3019353
3019609
3019865
3020121
3020377
3020633
3020889
3021145
3021401
3021657
3021913
3022169
3022425
3022681
3014746
3015002
3015258
3015514
3015770
3016026
3016282
3016538
3016794
3017050
3017306
3017562
3017818
3018074
3018330
3018586
3018842
3019098
3019354
3019610
3019866
3020122
3020378
3020634
3020890
3021146
3021402
3021658
3021914
3022170
3022426
3022682
3014747
3015003
3015259
3015515
3015771
3016027
3016283
3016539
3016795
3017051
3017307
3017563
3017819
3018075
3018331
3018587
3018843
3019099
3019355
3019611
3019867
3020123
3020379
3020635
3020891
3021147
3021403
3021659
3021915
3022171
3022427
3022683
3014748
3015004
3015260
3015516
3015772
3016028
3016284
3016540
3016796
3017052
3017308
3017564
3017820
3018076
3018332
3018588
3018844
3019100
3019356
3019612
3019868
3020124
3020380
3020636
3020892
3021148
3021404
3021660
3021916
3022172
3022428
3022684
3014749
3015005
3015261
3015517
3015773
3016029
3016285
3016541
3016797
3017053
3017309
3017565
3017821
3018077
3018333
3018589
3018845
3019101
3019357
3019613
3019869
3020125
3020381
3020637
3020893
3021149
3021405
3021661
3021917
3022173
3022429
3022685
3014750
3015006
3015262
3015518
3015774
3016030
3016286
3016542
3016798
3017054
3017310
3017566
3017822
3018078
3018334
3018590
3018846
3019102
3019358
3019614
3019870
3020126
3020382
3020638
3020894
3021150
3021406
3021662
3021918
3022174
3022430
3022686
3014751
3015007
3015263
3015519
3015775
3016031
3016287
3016543
3016799
3017055
3017311
3017567
3017823
3018079
3018335
3018591
3018847
3019103
3019359
3019615
3019871
3020127
3020383
3020639
3020895
3021151
3021407
3021663
3021919
3022175
3022431
3022687
