210177
349186
349442
349187
349443
601135
603440
930818
931074
1387567
1579265
1579266
1585707
1857537
1857538
2053633
2053889
2054145
2040578
2045186
2045698
2045954
2046978
2047234
2048002
2053378
2053634
2053890
2054146
2040579
2045187
2045699
2045955
2046979
2047235
2048003
2053379
2053635
2053891
2054147
2040580
2097409
3027970
3028226
3036162
3036418
3027971
3028227
