0 0 2.0 0.5 1.0
0 1 8.56620032356 0.0928625315428 1.2571041584
0 2 1.0 0.0 0.0
1 0 1.0 0.0 0.0
1 1 0.594646457336 0.878168702126 1.91497552395
1 2 1.0 0.0 0.0
2 0 0.333333333333 1.0 3.0
2 1 0.640190926081 0.882344186306 1.77032279968
2 2 1.0 0.0 0.0
3 0 1.0 1.0 1.0
3 1 0.498215451281 0.907894730568 2.21078896523
3 2 1.0 0.0 0.0
4 0 0.166666666667 1.0 6.0
4 1 0.597265224781 0.877940833569 1.9070738554
4 2 1.0 0.0 0.0
5 0 1.33333333333 0.5 1.5
5 1 0.678768717989 0.865762293339 1.70168626308
5 2 1.0 0.0 0.0
6 0 1.0 0.0 0.0
6 1 0.387982659524 0.905748009682 2.84564232826
6 2 1.0 0.0 0.0
7 0 0.333333333333 1.0 3.0
7 1 0.822208206098 0.779678344727 1.55992138386
7 2 1.0 0.0 0.0
8 0 0.666666666667 1.0 1.5
8 1 0.569427206438 0.8723731637 2.01307296753
8 2 1.0 0.0 0.0
9 0 0.444444444444 1.0 2.25
9 1 0.647647879883 0.875259876251 1.76410329342
9 2 1.0 0.0 0.0
10 0 0.666666666667 1.0 1.5
10 1 0.499815115177 0.895930945873 2.23314070702
10 2 1.0 0.0 0.0
11 0 1.0 0.75 1.33333337307
11 1 0.537439445542 0.898550748825 2.07075095177
11 2 1.0 0.0 0.0
12 0 0.8 1.0 1.25
12 1 0.771560224888 0.84848856926 1.52751040459
12 2 1.0 0.0 0.0
13 0 1.0 0.666666686535 1.5
13 1 0.563476713702 0.907596051693 1.95538127422
13 2 1.0 0.0 0.0
14 0 1.0 0.666666686535 1.5
14 1 0.694868139524 0.861872434616 1.66976225376
14 2 1.0 0.0 0.0
15 0 1.0 0.666666686535 1.5
15 1 0.77916195632 0.832848846912 1.54101216793
15 2 1.0 0.0 0.0
16 0 1.0 0.666666686535 1.5
16 1 0.432962066539 0.926036179066 2.49414801598
16 2 1.0 0.0 0.0
17 0 2.0 0.5 1.0
17 1 0.621037581748 0.901188194752 1.78676176071
17 2 1.0 0.0 0.0
18 0 1.0 0.0 0.0
18 1 0.620767167615 0.884141921997 1.8220038414
18 2 1.0 0.0 0.0
19 0 1.0 1.0 1.0
19 1 0.649246130346 0.894958496094 1.72102713585
19 2 1.0 0.0 0.0
20 0 1.0 0.0 0.0
20 1 0.565453815249 0.904547095299 1.95511221886
20 2 1.0 0.0 0.0
21 0 1.0 1.0 1.0
21 1 0.516539297152 0.895241498947 2.16250157356
21 2 1.0 1.0 1.0
22 0 1.0 0.666666686535 1.5
22 1 0.662873044516 0.884259819984 1.70604205132
22 2 1.0 0.0 0.0
23 0 1.4999999553 0.666666686535 1.0
23 1 0.613927923001 0.912011384964 1.78600370884
23 2 1.0 0.0 0.0
24 0 0.666666666667 1.0 1.5
24 1 0.605488862534 0.884560883045 1.86709368229
24 2 1.0 0.0 0.0
25 0 0.666666666667 1.0 1.5
25 1 0.605469065213 0.915210902691 1.80462443829
25 2 1.0 0.0 0.0
26 0 0.444444444444 0.75 3.0
26 1 1.0 0.0 0.0
26 2 1.0 0.0 0.0
27 0 0.333333333333 1.0 3.0
27 1 0.526629063674 0.89544916153 2.12057805061
27 2 1.0 1.0 1.0
28 0 1.33333333333 0.75 1.0
28 1 0.626885255506 0.873012542725 1.82722258568
28 2 1.0 1.0 1.0
29 0 1.0 1.0 1.0
29 1 0.530826085364 0.907126545906 2.07672929764
29 2 1.0 1.0 1.0
30 0 1.4999999553 0.666666686535 1.0
30 1 0.45148288569 0.87057185173 2.54421663284
30 2 1.0 0.0 0.0
31 0 1.0 1.0 1.0
31 1 0.26606049361 0.601040124893 6.2533993721
31 2 1.0 1.0 1.0
32 0 1.0 0.0 0.0
32 1 0.77095564367 0.836302697659 1.55098319054
32 2 1.0 1.0 1.0
33 0 1.0 0.0 0.0
33 1 0.381127331828 0.936124324799 2.80282783508
33 2 1.0 0.0 0.0
34 0 0.142857142857 1.0 7.0
34 1 0.700285561898 0.894422590733 1.59654831886
34 2 1.0 1.0 1.0
35 0 1.0 0.0 0.0
35 1 0.32272329791 0.93924510479 3.29906415939
35 2 1.0 1.0 1.0
36 0 1.0 1.0 1.0
36 1 0.98041291466 0.745815336704 1.36760175228
36 2 2.0 0.5 1.0
37 0 1.0 1.0 1.0
37 1 0.743772267551 0.858646631241 1.56583344936
37 2 1.0 1.0 1.0
38 0 1.0 0.0 0.0
38 1 0.17574732032 0.94702154398 6.00829744339
38 2 1.0 1.0 1.0
39 0 1.66666660044 0.600000023842 1.0
39 1 0.547347439754 0.906281888485 2.01592159271
39 2 1.0 1.0 1.0
40 0 0.624999990687 1.0 1.60000002384
40 1 0.965660635869 0.761355757713 1.36015319824
40 2 0.333333333333 0.5 6.0
41 0 0.666666666667 1.0 1.5
41 1 0.353644496012 0.942430436611 3.00043225288
41 2 0.25 1.0 4.0
42 0 0.666666666667 1.0 1.5
42 1 0.324796869538 0.930104255676 3.31021761894
42 2 1.0 1.0 1.0
43 0 0.5 1.0 2.0
43 1 0.7260752479 0.853765785694 1.61316812038
43 2 1.4999999553 0.666666686535 1.0
44 0 1.4999999553 0.666666686535 1.0
44 1 0.688662480097 0.845684051514 1.71705985069
44 2 1.0 1.0 1.0
45 0 1.0 0.833333313465 1.20000004768
45 1 0.622857125461 0.908530712128 1.76714396477
45 2 1.0 0.800000011921 1.25
46 0 0.600000014305 0.666666686535 2.5
46 1 0.258102771979 0.956527113914 4.05051279068
46 2 1.0 0.800000011921 1.25
47 0 1.24999998137 0.600000023842 1.33333337307
47 1 0.89668506049 0.810450673103 1.37604773045
47 2 0.5 0.888888895512 2.25
48 0 1.33333333333 0.75 1.0
48 1 0.346289917774 0.9221175313 3.13165473938
48 2 0.611111115158 0.909090936184 1.79999995232
49 0 0.857142886337 0.833333313465 1.39999997616
49 1 0.862982098946 0.75751376152 1.52970504761
49 2 1.09999996722 0.54545456171 1.66666662693
50 0 0.899999957085 0.333333343267 3.33333325386
50 1 0.860888526916 0.776861250401 1.49523544312
50 2 0.899999957085 0.555555582047 2.0
51 0 2.49999996275 0.40000000596 1.0
51 1 0.377766427393 0.882250607014 3.00043821335
51 2 1.6 0.375 1.66666662693
52 0 0.666666666667 1.0 1.5
52 1 0.243519619501 0.852600634098 4.81637620926
52 2 2.0 0.1875 2.66666674614
53 0 1.0 0.0 0.0
53 1 1.0 0.0 0.0
53 2 1.0 0.0 0.0
