210177
210433
210689
210945
211201
211457
211713
211969
212225
212481
212737
212993
213249
213505
213761
214017
214273
214529
214785
215041
215297
215553
215809
216065
216321
216577
216833
217089
217345
217601
217857
218113
218369
218625
218881
219137
219393
219649
219905
220161
220417
220673
220929
196866
197122
197378
197634
197890
198146
198402
198658
198914
199170
199426
199682
199938
200194
200450
200706
200962
201218
201474
201730
201986
202242
202498
202754
203010
203266
203522
203778
204034
204290
204546
204802
205058
205314
205570
205826
206082
206338
206594
206850
207106
207362
207618
207874
208130
208386
208642
208898
209154
209410
209666
209922
210178
210434
210690
210946
211202
211458
211714
211970
212226
212482
212738
212994
213250
213506
213762
214018
214274
214530
214786
215042
215298
215554
215810
216066
216322
216578
216834
217090
217346
217602
217858
218114
218370
218626
218882
219138
219394
219650
219906
220162
220418
220674
220930
196867
197123
197379
197635
197891
198147
198403
198659
198915
199171
199427
199683
199939
200195
200451
200707
200963
201219
201475
201731
201987
202243
202499
202755
203011
203267
203523
203779
204035
204291
204547
204803
205059
205315
205571
205827
206083
206339
206595
206851
207107
207363
207619
207875
208131
208387
208643
208899
209155
209411
209667
209923
210179
210435
210691
210947
211203
211459
211715
211971
212227
212483
212739
212995
213251
213507
213763
214019
214275
214531
214787
215043
215299
215555
215811
216067
216323
216579
216835
217091
217347
217603
217859
218115
218371
218627
218883
219139
219395
219651
219907
220163
220419
220675
220931
196868
197124
197380
197636
197892
198148
198404
198660
198916
199172
199428
199684
199940
200196
200452
200708
200964
201220
201476
201732
201988
202244
202500
202756
203012
203268
203524
203780
204036
204292
204548
204804
205060
205316
205572
205828
206084
206340
206596
206852
207108
207364
207620
207876
208132
208388
208644
208900
209156
209412
209668
209924
210180
210436
210692
210948
211204
211460
211716
211972
212228
212484
212740
212996
213252
213508
213764
214020
214276
214532
214788
215044
215300
215556
215812
216068
216324
216580
216836
217092
217348
217604
217860
218116
218372
218628
218884
219140
219396
219652
219908
220164
220420
220676
220932
196869
197125
197381
197637
197893
198149
198405
198661
198917
199173
199429
199685
199941
200197
200453
200709
200965
201221
201477
201733
201989
202245
202501
202757
203013
203269
203525
203781
204037
204293
204549
204805
205061
205317
205573
205829
206085
206341
206597
206853
207109
207365
207621
207877
208133
208389
208645
208901
209157
209413
209669
209925
210181
210437
210693
210949
211205
211461
211717
211973
212229
212485
212741
212997
213253
213509
213765
214021
214277
214533
214789
215045
215301
215557
215813
216069
216325
216581
216837
217093
217349
217605
217861
218117
218373
218629
218885
219141
219397
219653
219909
220165
220421
220677
220933
196870
197126
197382
197638
197894
198150
198406
198662
198918
199174
199430
199686
199942
200198
200454
200710
200966
201222
201478
201734
201990
202246
202502
202758
203014
203270
203526
203782
204038
204294
204550
204806
205062
205318
205574
205830
206086
206342
206598
206854
207110
207366
207622
207878
208134
208390
208646
208902
209158
209414
209670
209926
210182
210438
210694
210950
211206
211462
211718
211974
212230
212486
212742
212998
213254
213510
213766
214022
214278
214534
214790
215046
215302
215558
215814
216070
216326
216582
216838
217094
217350
217606
217862
218118
218374
218630
218886
219142
219398
219654
219910
220166
220422
220678
220934
196871
197127
197383
197639
197895
198151
198407
198663
198919
199175
199431
199687
199943
200199
200455
200711
200967
201223
201479
201735
201991
202247
202503
202759
203015
203271
203527
203783
204039
204295
204551
204807
205063
205319
205575
205831
206087
206343
206599
206855
207111
207367
207623
207879
208135
208391
208647
208903
209159
209415
209671
209927
210183
210439
210695
210951
211207
211463
211719
211975
212231
212487
212743
212999
213255
213511
213767
214023
214279
214535
214791
215047
215303
215559
215815
216071
216327
216583
216839
217095
217351
217607
217863
218119
218375
218631
218887
219143
219399
219655
219911
220167
220423
220679
220935
196872
197128
197384
197640
197896
198152
198408
198664
198920
199176
199432
199688
199944
200200
200456
200712
200968
201224
201480
201736
201992
202248
202504
202760
203016
203272
203528
203784
204040
204296
204552
204808
205064
205320
205576
205832
206088
206344
206600
206856
207112
207368
207624
207880
208136
208392
208648
208904
209160
209416
209672
209928
210184
210440
210696
210952
211208
211464
211720
211976
212232
212488
212744
213000
213256
213512
213768
214024
214280
214536
214792
215048
215304
215560
215816
216072
216328
216584
216840
217096
217352
217608
217864
218120
218376
218632
218888
219144
219400
219656
219912
220168
220424
220680
220936
196873
197129
197385
197641
197897
198153
198409
198665
198921
199177
199433
199689
199945
200201
200457
200713
200969
201225
201481
201737
201993
202249
202505
202761
203017
203273
203529
203785
204041
204297
204553
204809
205065
205321
205577
205833
206089
206345
206601
206857
207113
207369
207625
207881
208137
208393
208649
208905
209161
209417
209673
209929
210185
210441
210697
210953
211209
211465
211721
211977
212233
212489
212745
213001
213257
213513
213769
214025
214281
214537
214793
215049
215305
215561
215817
216073
216329
216585
216841
217097
217353
217609
217865
218121
218377
218633
218889
219145
219401
219657
219913
220169
220425
220681
220937
196874
197130
197386
197642
197898
198154
198410
198666
198922
199178
199434
199690
199946
200202
200458
200714
200970
201226
201482
201738
201994
202250
202506
202762
203018
203274
203530
203786
204042
204298
204554
204810
205066
205322
205578
205834
206090
206346
206602
206858
207114
207370
207626
207882
208138
208394
208650
208906
209162
209418
209674
209930
210186
210442
210698
210954
211210
211466
211722
211978
212234
212490
212746
213002
213258
213514
213770
214026
214282
214538
214794
215050
215306
215562
215818
216074
216330
216586
216842
217098
217354
217610
217866
218122
218378
218634
218890
219146
219402
219658
219914
220170
220426
220682
220938
196875
197131
197387
197643
197899
198155
198411
198667
198923
199179
199435
199691
199947
200203
200459
200715
200971
201227
201483
201739
201995
202251
202507
202763
203019
203275
203531
203787
204043
204299
204555
204811
205067
205323
205579
205835
206091
206347
206603
206859
207115
207371
207627
207883
208139
208395
208651
208907
209163
209419
209675
209931
210187
210443
210699
210955
211211
211467
211723
211979
212235
212491
212747
213003
213259
213515
213771
214027
214283
214539
214795
215051
215307
215563
215819
216075
216331
216587
216843
217099
217355
217611
217867
218123
218379
218635
218891
219147
219403
219659
219915
220171
220427
220683
220939
196876
197132
197388
197644
197900
198156
198412
198668
198924
199180
199436
199692
199948
200204
200460
200716
200972
201228
201484
201740
201996
202252
202508
202764
203020
203276
203532
203788
204044
204300
204556
204812
205068
205324
205580
205836
206092
206348
206604
206860
207116
207372
207628
207884
208140
208396
208652
208908
209164
209420
209676
209932
210188
210444
210700
210956
211212
211468
211724
211980
212236
212492
212748
213004
213260
213516
213772
214028
214284
214540
214796
215052
215308
215564
215820
216076
216332
216588
216844
217100
217356
217612
217868
218124
218380
218636
218892
219148
219404
219660
219916
220172
220428
220684
220940
196877
197133
197389
197645
197901
198157
198413
198669
198925
199181
199437
199693
199949
200205
200461
200717
200973
201229
201485
201741
201997
202253
202509
202765
203021
203277
203533
203789
204045
204301
204557
204813
205069
205325
205581
205837
206093
206349
206605
206861
207117
207373
207629
207885
208141
208397
208653
208909
209165
209421
209677
209933
210189
210445
210701
210957
211213
211469
211725
211981
212237
212493
212749
213005
213261
213517
213773
214029
214285
214541
214797
215053
215309
215565
215821
216077
216333
216589
216845
217101
217357
217613
217869
218125
218381
218637
218893
219149
219405
219661
219917
220173
220429
220685
220941
196878
197134
197390
197646
197902
198158
198414
198670
198926
199182
199438
199694
199950
200206
200462
200718
200974
201230
201486
201742
201998
202254
202510
202766
203022
203278
203534
203790
204046
204302
204558
204814
205070
205326
205582
205838
206094
206350
206606
206862
207118
207374
207630
207886
208142
208398
208654
208910
209166
209422
209678
209934
210190
210446
210702
210958
211214
211470
211726
211982
212238
212494
212750
213006
213262
213518
213774
214030
214286
214542
214798
215054
215310
215566
215822
216078
216334
216590
216846
217102
217358
217614
217870
218126
218382
218638
218894
219150
219406
219662
219918
220174
220430
220686
220942
196879
197135
197391
197647
197903
198159
198415
198671
198927
199183
199439
199695
199951
200207
200463
200719
200975
201231
201487
201743
201999
202255
202511
202767
203023
203279
203535
203791
204047
204303
204559
204815
205071
205327
205583
205839
206095
206351
206607
206863
207119
207375
207631
207887
208143
208399
208655
208911
209167
209423
209679
209935
210191
210447
210703
210959
211215
211471
211727
211983
212239
212495
212751
213007
213263
213519
213775
214031
214287
214543
214799
215055
215311
215567
215823
216079
216335
216591
216847
217103
217359
217615
217871
218127
218383
218639
218895
219151
219407
219663
219919
220175
220431
220687
220943
196880
197136
197392
197648
197904
198160
198416
198672
198928
199184
199440
199696
199952
200208
200464
200720
200976
201232
201488
201744
202000
202256
202512
202768
203024
203280
203536
203792
204048
204304
204560
204816
205072
205328
205584
205840
206096
206352
206608
206864
207120
207376
207632
207888
208144
208400
208656
208912
209168
209424
209680
209936
210192
210448
210704
210960
211216
211472
211728
211984
212240
212496
212752
213008
213264
213520
213776
214032
214288
214544
214800
215056
215312
215568
215824
216080
216336
216592
216848
217104
217360
217616
217872
218128
218384
218640
218896
219152
219408
219664
219920
220176
220432
220688
220944
196881
197137
197393
197649
197905
198161
198417
198673
198929
199185
199441
199697
199953
200209
200465
200721
200977
201233
201489
201745
202001
202257
202513
202769
203025
203281
203537
203793
204049
204305
204561
204817
205073
205329
205585
205841
206097
206353
206609
206865
207121
207377
207633
207889
208145
208401
208657
208913
209169
209425
209681
209937
210193
210449
210705
210961
211217
211473
211729
211985
212241
212497
212753
213009
213265
213521
213777
214033
214289
214545
214801
215057
215313
215569
215825
216081
216337
216593
216849
217105
217361
217617
217873
218129
218385
218641
218897
219153
219409
219665
219921
220177
220433
220689
220945
196882
197138
197394
197650
197906
198162
198418
198674
198930
199186
199442
199698
199954
200210
200466
200722
200978
201234
201490
201746
202002
202258
202514
202770
203026
203282
203538
203794
204050
204306
204562
204818
205074
205330
205586
205842
206098
206354
206610
206866
207122
207378
207634
207890
208146
208402
208658
208914
209170
209426
209682
209938
210194
210450
210706
210962
211218
211474
211730
211986
212242
212498
212754
213010
213266
213522
213778
214034
214290
214546
214802
215058
215314
215570
215826
216082
216338
216594
216850
217106
217362
217618
217874
218130
218386
218642
218898
219154
219410
219666
219922
220178
220434
220690
220946
196883
197139
197395
197651
197907
198163
198419
198675
198931
199187
199443
199699
199955
200211
200467
200723
200979
201235
201491
201747
202003
202259
202515
202771
203027
203283
203539
203795
204051
204307
204563
204819
205075
205331
205587
205843
206099
206355
206611
206867
207123
207379
207635
207891
208147
208403
208659
208915
209171
209427
209683
209939
210195
210451
210707
210963
211219
211475
211731
211987
212243
212499
212755
213011
213267
213523
213779
214035
214291
214547
214803
215059
215315
215571
215827
216083
216339
216595
216851
217107
217363
217619
217875
218131
218387
218643
218899
219155
219411
219667
219923
220179
220435
220691
220947
196884
197140
197396
197652
197908
198164
198420
198676
198932
199188
199444
199700
199956
200212
200468
200724
200980
201236
201492
201748
202004
202260
202516
202772
203028
203284
203540
203796
204052
204308
204564
204820
205076
205332
205588
205844
206100
206356
206612
206868
207124
207380
207636
207892
208148
208404
208660
208916
209172
209428
209684
209940
210196
210452
210708
210964
211220
211476
211732
211988
212244
212500
212756
213012
213268
213524
213780
214036
214292
214548
214804
215060
215316
215572
215828
216084
216340
216596
216852
217108
217364
217620
217876
218132
218388
218644
218900
219156
219412
219668
219924
220180
220436
220692
220948
196885
197141
197397
197653
197909
198165
198421
198677
198933
199189
199445
199701
199957
200213
200469
200725
200981
201237
201493
201749
202005
202261
202517
202773
203029
203285
203541
203797
204053
204309
204565
204821
205077
205333
205589
205845
206101
206357
206613
206869
207125
207381
207637
207893
208149
208405
208661
208917
209173
209429
209685
209941
210197
210453
210709
210965
211221
211477
211733
211989
212245
212501
212757
213013
213269
213525
213781
214037
214293
214549
214805
215061
215317
215573
215829
216085
216341
216597
216853
217109
217365
217621
217877
218133
218389
218645
218901
219157
219413
219669
219925
220181
220437
220693
220949
196886
197142
197398
197654
197910
198166
198422
198678
198934
199190
199446
199702
199958
200214
200470
200726
200982
201238
201494
201750
202006
202262
202518
202774
203030
203286
203542
203798
204054
204310
204566
204822
205078
205334
205590
205846
206102
206358
206614
206870
207126
207382
207638
207894
208150
208406
208662
208918
209174
209430
209686
209942
210198
210454
210710
210966
211222
211478
211734
211990
212246
212502
212758
213014
213270
213526
213782
214038
214294
214550
214806
215062
215318
215574
215830
216086
216342
216598
216854
217110
217366
217622
217878
218134
218390
218646
218902
219158
219414
219670
219926
220182
220438
220694
220950
196887
197143
197399
197655
197911
198167
198423
198679
198935
199191
199447
199703
199959
200215
200471
200727
200983
201239
201495
201751
202007
202263
202519
202775
203031
203287
203543
203799
204055
204311
204567
204823
205079
205335
205591
205847
206103
206359
206615
206871
207127
207383
207639
207895
208151
208407
208663
208919
209175
209431
209687
209943
210199
210455
210711
210967
211223
211479
211735
211991
212247
212503
212759
213015
213271
213527
213783
214039
214295
214551
214807
215063
215319
215575
215831
216087
216343
216599
216855
217111
217367
217623
217879
218135
218391
218647
218903
219159
219415
219671
219927
220183
220439
220695
220951
196888
197144
197400
197656
197912
198168
198424
198680
198936
199192
199448
199704
199960
200216
200472
200728
200984
201240
201496
201752
202008
202264
202520
202776
203032
203288
203544
203800
204056
204312
204568
204824
205080
205336
205592
205848
206104
206360
206616
206872
207128
207384
207640
207896
208152
208408
208664
208920
209176
209432
209688
209944
210200
210456
210712
210968
211224
211480
211736
211992
212248
212504
212760
213016
213272
213528
213784
214040
214296
214552
214808
215064
215320
215576
215832
216088
216344
216600
216856
217112
217368
217624
217880
218136
218392
218648
218904
219160
219416
219672
219928
220184
220440
220696
220952
196889
197145
197401
197657
197913
198169
198425
198681
198937
199193
199449
199705
199961
200217
200473
200729
200985
201241
201497
201753
202009
202265
202521
202777
203033
203289
203545
203801
204057
204313
204569
204825
205081
205337
205593
205849
206105
206361
206617
206873
207129
207385
207641
207897
208153
208409
208665
208921
209177
209433
209689
209945
210201
210457
210713
210969
211225
211481
211737
211993
212249
212505
212761
213017
213273
213529
213785
214041
214297
214553
214809
215065
215321
215577
215833
216089
216345
216601
216857
217113
217369
217625
217881
218137
218393
218649
218905
219161
219417
219673
219929
220185
220441
220697
220953
196890
197146
197402
197658
197914
198170
198426
198682
198938
199194
199450
199706
199962
200218
200474
200730
200986
201242
201498
201754
202010
202266
202522
202778
203034
203290
203546
203802
204058
204314
204570
204826
205082
205338
205594
205850
206106
206362
206618
206874
207130
207386
207642
207898
208154
208410
208666
208922
209178
209434
209690
209946
210202
210458
210714
210970
211226
211482
211738
211994
212250
212506
212762
213018
213274
213530
213786
214042
214298
214554
214810
215066
215322
215578
215834
216090
216346
216602
216858
217114
217370
217626
217882
218138
218394
218650
218906
219162
219418
219674
219930
220186
220442
220698
220954
196891
197147
197403
197659
197915
198171
198427
198683
198939
199195
199451
199707
199963
200219
200475
200731
200987
201243
201499
201755
202011
202267
202523
202779
203035
203291
203547
203803
204059
204315
204571
204827
205083
205339
205595
205851
206107
206363
206619
206875
207131
207387
207643
207899
208155
208411
208667
208923
209179
209435
209691
209947
210203
210459
210715
210971
211227
211483
211739
211995
212251
212507
212763
213019
213275
213531
213787
214043
214299
214555
214811
215067
215323
215579
215835
216091
216347
216603
216859
217115
217371
217627
217883
218139
218395
218651
218907
219163
219419
219675
219931
220187
220443
220699
220955
196892
197148
197404
197660
197916
198172
198428
198684
198940
199196
199452
199708
199964
200220
200476
200732
200988
201244
201500
201756
202012
202268
202524
202780
203036
203292
203548
203804
204060
204316
204572
204828
205084
205340
205596
205852
206108
206364
206620
206876
207132
207388
207644
207900
208156
208412
208668
208924
209180
209436
209692
209948
210204
210460
210716
210972
211228
211484
211740
211996
212252
212508
212764
213020
213276
213532
213788
214044
214300
214556
214812
215068
215324
215580
215836
216092
216348
216604
216860
217116
217372
217628
217884
218140
218396
218652
218908
219164
219420
219676
219932
220188
220444
220700
220956
196893
197149
197405
197661
197917
198173
198429
198685
198941
199197
199453
199709
199965
200221
200477
200733
200989
201245
201501
201757
202013
202269
202525
202781
203037
203293
203549
203805
204061
204317
204573
204829
205085
205341
205597
205853
206109
206365
206621
206877
207133
207389
207645
207901
208157
208413
208669
208925
209181
209437
209693
209949
210205
210461
210717
210973
211229
211485
211741
211997
212253
212509
212765
213021
213277
213533
213789
214045
214301
214557
214813
215069
215325
215581
215837
216093
216349
216605
216861
217117
217373
217629
217885
218141
218397
218653
218909
219165
219421
219677
219933
220189
220445
220701
220957
196894
197150
197406
197662
197918
198174
198430
198686
198942
199198
199454
199710
199966
200222
200478
200734
200990
201246
201502
201758
202014
202270
202526
202782
203038
203294
203550
203806
204062
204318
204574
204830
205086
205342
205598
205854
206110
206366
206622
206878
207134
207390
207646
207902
208158
208414
208670
208926
209182
209438
209694
209950
210206
210462
210718
210974
211230
211486
211742
211998
212254
212510
212766
213022
213278
213534
213790
214046
214302
214558
214814
215070
215326
215582
215838
216094
216350
216606
216862
217118
217374
217630
217886
218142
218398
218654
218910
219166
219422
219678
219934
220190
220446
220702
220958
196895
197151
197407
197663
197919
198175
198431
198687
198943
199199
199455
199711
199967
200223
200479
200735
200991
201247
201503
201759
202015
202271
202527
202783
203039
203295
203551
203807
204063
204319
204575
204831
205087
205343
205599
205855
206111
206367
206623
206879
207135
207391
207647
207903
208159
208415
208671
208927
209183
209439
209695
209951
210207
210463
210719
210975
211231
211487
211743
211999
212255
212511
212767
213023
213279
213535
213791
214047
214303
214559
214815
215071
215327
215583
215839
216095
216351
216607
216863
217119
217375
217631
217887
218143
218399
218655
218911
219167
219423
219679
219935
220191
220447
220703
220959
196896
197152
197408
197664
197920
198176
198432
198688
198944
199200
199456
199712
199968
200224
200480
200736
200992
201248
201504
201760
202016
202272
202528
202784
203040
203296
203552
203808
204064
204320
204576
204832
205088
205344
205600
205856
206112
206368
206624
206880
207136
207392
207648
207904
208160
208416
208672
208928
209184
209440
209696
209952
210208
210464
210720
210976
211232
211488
211744
212000
212256
212512
212768
213024
213280
213536
213792
214048
214304
214560
214816
215072
215328
215584
215840
216096
216352
216608
216864
217120
217376
217632
217888
218144
218400
218656
218912
219168
219424
219680
219936
220192
220448
220704
220960
196897
197153
197409
197665
197921
198177
198433
198689
198945
199201
199457
199713
199969
200225
200481
200737
200993
201249
201505
201761
202017
202273
202529
202785
203041
203297
203553
203809
204065
204321
204577
204833
205089
205345
205601
205857
206113
206369
206625
206881
207137
207393
207649
207905
208161
208417
208673
208929
209185
209441
209697
209953
210209
210465
210721
210977
211233
211489
211745
212001
212257
212513
212769
213025
213281
213537
213793
214049
214305
214561
214817
215073
215329
215585
215841
216097
216353
216609
216865
217121
217377
217633
217889
218145
218401
218657
218913
219169
219425
219681
219937
220193
220449
220705
220961
196898
197154
197410
197666
197922
198178
198434
198690
198946
199202
199458
199714
199970
200226
200482
200738
200994
201250
201506
201762
202018
202274
202530
202786
203042
203298
203554
203810
204066
204322
204578
204834
205090
205346
205602
205858
206114
206370
206626
206882
207138
207394
207650
207906
208162
208418
208674
208930
209186
209442
209698
209954
210210
210466
210722
210978
211234
211490
211746
212002
212258
212514
212770
213026
213282
213538
213794
214050
214306
214562
214818
215074
215330
215586
215842
216098
216354
216610
216866
217122
217378
217634
217890
218146
218402
218658
218914
219170
219426
219682
219938
220194
220450
220706
220962
196899
197155
197411
197667
197923
198179
198435
198691
198947
199203
199459
199715
199971
200227
200483
200739
200995
201251
201507
201763
202019
202275
202531
202787
203043
203299
203555
203811
204067
204323
204579
204835
205091
205347
205603
205859
206115
206371
206627
206883
207139
207395
207651
207907
208163
208419
208675
208931
209187
209443
209699
209955
210211
210467
210723
210979
211235
211491
211747
212003
212259
212515
212771
213027
213283
213539
213795
214051
214307
214563
214819
215075
215331
215587
215843
216099
216355
216611
216867
217123
217379
217635
217891
218147
218403
218659
218915
219171
219427
219683
219939
220195
220451
220707
220963
196900
197156
197412
197668
197924
198180
198436
198692
198948
199204
199460
199716
199972
200228
200484
200740
200996
201252
201508
201764
202020
202276
202532
202788
203044
203300
203556
203812
204068
204324
204580
204836
205092
205348
205604
205860
206116
206372
206628
206884
207140
207396
207652
207908
208164
208420
208676
208932
209188
209444
209700
209956
210212
210468
210724
210980
211236
211492
211748
212004
212260
212516
212772
213028
213284
213540
213796
214052
214308
214564
214820
215076
215332
215588
215844
216100
216356
216612
216868
217124
217380
217636
217892
218148
218404
218660
218916
219172
219428
219684
219940
220196
220452
220708
220964
196901
197157
197413
197669
197925
198181
198437
198693
198949
199205
199461
199717
199973
200229
200485
200741
200997
201253
201509
201765
202021
202277
202533
202789
203045
203301
203557
203813
204069
204325
204581
204837
205093
205349
205605
205861
206117
206373
206629
206885
207141
207397
207653
207909
208165
208421
208677
208933
209189
209445
209701
209957
210213
210469
210725
210981
211237
211493
211749
212005
212261
212517
212773
213029
213285
213541
213797
214053
214309
214565
214821
215077
215333
215589
215845
216101
216357
216613
216869
217125
217381
217637
217893
218149
218405
218661
218917
219173
219429
219685
219941
220197
220453
220709
220965
196902
197158
197414
197670
197926
198182
198438
198694
198950
199206
199462
199718
199974
200230
200486
200742
200998
201254
201510
201766
202022
202278
202534
202790
203046
203302
203558
203814
204070
204326
204582
204838
205094
205350
205606
205862
206118
206374
206630
206886
207142
207398
207654
207910
208166
208422
208678
208934
209190
209446
209702
209958
210214
210470
210726
210982
211238
211494
211750
212006
212262
212518
212774
213030
213286
213542
213798
214054
214310
214566
214822
215078
215334
215590
215846
216102
216358
216614
216870
217126
217382
217638
217894
218150
218406
218662
218918
219174
219430
219686
219942
220198
220454
220710
220966
196903
197159
197415
197671
197927
198183
198439
198695
198951
199207
199463
199719
199975
200231
200487
200743
200999
201255
201511
201767
202023
202279
202535
202791
203047
203303
203559
203815
204071
204327
204583
204839
205095
205351
205607
205863
206119
206375
206631
206887
207143
207399
207655
207911
208167
208423
208679
208935
209191
209447
209703
209959
210215
210471
210727
210983
211239
211495
211751
212007
212263
212519
212775
213031
213287
213543
213799
214055
214311
214567
214823
215079
215335
215591
215847
216103
216359
216615
216871
217127
217383
217639
217895
218151
218407
218663
218919
219175
219431
219687
219943
220199
220455
220711
220967
196904
197160
197416
197672
197928
198184
198440
198696
198952
199208
199464
199720
199976
200232
200488
200744
201000
201256
201512
201768
202024
202280
202536
202792
203048
203304
203560
203816
204072
204328
204584
204840
205096
205352
205608
205864
206120
206376
206632
206888
207144
207400
207656
207912
208168
208424
208680
208936
209192
209448
209704
209960
210216
210472
210728
210984
211240
211496
211752
212008
212264
212520
212776
213032
213288
213544
213800
214056
214312
214568
214824
215080
215336
215592
215848
216104
216360
216616
216872
217128
217384
217640
217896
218152
218408
218664
218920
219176
219432
219688
219944
220200
220456
220712
220968
196905
197161
197417
197673
197929
198185
198441
198697
198953
199209
199465
199721
199977
200233
200489
200745
201001
201257
201513
201769
202025
202281
202537
202793
203049
203305
203561
203817
204073
204329
204585
204841
205097
205353
205609
205865
206121
206377
206633
206889
207145
207401
207657
207913
208169
208425
208681
208937
209193
209449
209705
209961
210217
210473
210729
210985
211241
211497
211753
212009
212265
212521
212777
213033
213289
213545
213801
214057
214313
214569
214825
215081
215337
215593
215849
216105
216361
216617
216873
217129
217385
217641
217897
218153
218409
218665
218921
219177
219433
219689
219945
220201
220457
220713
220969
196906
197162
197418
197674
197930
198186
198442
198698
198954
199210
199466
199722
199978
200234
200490
200746
201002
201258
201514
201770
202026
202282
202538
202794
203050
203306
203562
203818
204074
204330
204586
204842
205098
205354
205610
205866
206122
206378
206634
206890
207146
207402
207658
207914
208170
208426
208682
208938
209194
209450
209706
209962
210218
210474
210730
210986
211242
211498
211754
212010
212266
212522
212778
213034
213290
213546
213802
214058
214314
214570
214826
215082
215338
215594
215850
216106
216362
216618
216874
217130
217386
217642
217898
218154
218410
218666
218922
219178
219434
219690
219946
220202
220458
220714
220970
196907
197163
197419
197675
197931
198187
198443
198699
198955
199211
199467
199723
199979
200235
200491
200747
201003
201259
201515
201771
202027
202283
202539
202795
203051
203307
203563
203819
204075
204331
204587
204843
205099
205355
205611
205867
206123
206379
206635
206891
207147
207403
207659
207915
208171
208427
208683
208939
209195
209451
209707
209963
210219
210475
210731
210987
211243
211499
211755
212011
212267
212523
212779
213035
213291
213547
213803
214059
214315
214571
214827
215083
215339
215595
215851
216107
216363
216619
216875
217131
217387
217643
217899
218155
218411
218667
218923
219179
219435
219691
219947
220203
220459
220715
220971
196908
197164
197420
197676
197932
198188
198444
198700
198956
199212
199468
199724
199980
200236
200492
200748
201004
201260
201516
201772
202028
202284
202540
202796
203052
203308
203564
203820
204076
204332
204588
204844
205100
205356
205612
205868
206124
206380
206636
206892
207148
207404
207660
207916
208172
208428
208684
208940
209196
209452
209708
209964
210220
210476
210732
210988
211244
211500
211756
212012
212268
212524
212780
213036
213292
213548
213804
214060
214316
214572
214828
215084
215340
215596
215852
216108
216364
216620
216876
217132
217388
217644
217900
218156
218412
218668
218924
219180
219436
219692
219948
220204
220460
220716
220972
196909
197165
197421
197677
197933
198189
198445
198701
198957
199213
199469
199725
199981
200237
200493
200749
201005
201261
201517
201773
202029
202285
202541
202797
203053
203309
203565
203821
204077
204333
204589
204845
205101
205357
205613
205869
206125
206381
206637
206893
207149
207405
207661
207917
208173
208429
208685
208941
209197
209453
209709
209965
210221
210477
210733
210989
211245
211501
211757
212013
212269
212525
212781
213037
213293
213549
213805
214061
214317
214573
214829
215085
215341
215597
215853
216109
216365
216621
216877
217133
217389
217645
217901
218157
218413
218669
218925
219181
219437
219693
219949
220205
220461
220717
220973
196910
197166
197422
197678
197934
198190
198446
198702
198958
199214
199470
199726
199982
200238
200494
200750
201006
201262
201518
201774
202030
202286
202542
202798
203054
203310
203566
203822
204078
204334
204590
204846
205102
205358
205614
205870
206126
206382
206638
206894
207150
207406
207662
207918
208174
208430
208686
208942
209198
209454
209710
209966
210222
210478
210734
210990
211246
211502
211758
212014
212270
212526
212782
213038
213294
213550
213806
214062
214318
214574
214830
215086
215342
215598
215854
216110
216366
216622
216878
217134
217390
217646
217902
218158
218414
218670
218926
219182
219438
219694
219950
220206
220462
220718
220974
196911
197167
197423
197679
197935
198191
198447
198703
198959
199215
199471
199727
199983
200239
200495
200751
201007
201263
201519
201775
202031
202287
202543
202799
203055
203311
203567
203823
204079
204335
204591
204847
205103
205359
205615
205871
206127
206383
206639
206895
207151
207407
207663
207919
208175
208431
208687
208943
209199
209455
209711
209967
210223
210479
210735
210991
211247
211503
211759
212015
212271
212527
212783
213039
213295
213551
213807
214063
214319
214575
214831
215087
215343
215599
215855
216111
216367
216623
216879
217135
217391
217647
217903
218159
218415
218671
218927
219183
219439
219695
219951
220207
220463
220719
220975
196912
197168
197424
197680
197936
198192
198448
198704
198960
199216
199472
199728
199984
200240
200496
200752
201008
201264
201520
201776
202032
202288
202544
202800
203056
203312
203568
203824
204080
204336
204592
204848
205104
205360
205616
205872
206128
206384
206640
206896
207152
207408
207664
207920
208176
208432
208688
208944
209200
209456
209712
209968
210224
210480
210736
210992
211248
211504
211760
212016
212272
212528
212784
213040
213296
213552
213808
214064
214320
214576
214832
215088
215344
215600
215856
216112
216368
216624
216880
217136
217392
217648
217904
218160
218416
218672
218928
219184
219440
219696
219952
220208
220464
220720
220976
196913
197169
197425
197681
197937
198193
198449
198705
198961
199217
199473
199729
199985
200241
200497
200753
201009
201265
201521
201777
202033
202289
202545
202801
203057
203313
203569
203825
204081
204337
204593
204849
205105
205361
205617
205873
206129
206385
206641
206897
207153
207409
207665
207921
208177
208433
208689
208945
209201
209457
209713
209969
210225
210481
210737
210993
211249
211505
211761
212017
212273
212529
212785
213041
213297
213553
213809
214065
214321
214577
214833
215089
215345
215601
215857
216113
216369
216625
216881
217137
217393
217649
217905
218161
218417
218673
218929
219185
219441
219697
219953
220209
220465
220721
220977
196914
197170
197426
197682
197938
198194
198450
198706
198962
199218
199474
199730
199986
200242
200498
200754
201010
201266
201522
201778
202034
202290
202546
202802
203058
203314
203570
203826
204082
204338
204594
204850
205106
205362
205618
205874
206130
206386
206642
206898
207154
207410
207666
207922
208178
208434
208690
208946
209202
209458
209714
209970
210226
210482
210738
210994
211250
211506
211762
212018
212274
212530
212786
213042
213298
213554
213810
214066
214322
214578
214834
215090
215346
215602
215858
216114
216370
216626
216882
217138
217394
217650
217906
218162
218418
218674
218930
219186
219442
219698
219954
220210
220466
220722
220978
196915
197171
197427
197683
197939
198195
198451
198707
198963
199219
199475
199731
199987
200243
200499
200755
201011
201267
201523
201779
202035
202291
202547
202803
203059
203315
203571
203827
204083
204339
204595
204851
205107
205363
205619
205875
206131
206387
206643
206899
207155
207411
207667
207923
208179
208435
208691
208947
209203
209459
209715
209971
210227
210483
210739
210995
211251
211507
211763
212019
212275
212531
212787
213043
213299
213555
213811
214067
214323
214579
214835
215091
215347
215603
215859
216115
216371
216627
216883
217139
217395
217651
217907
218163
218419
218675
218931
219187
219443
219699
219955
220211
220467
220723
220979
196916
197172
197428
197684
197940
198196
198452
198708
198964
199220
199476
199732
199988
200244
200500
200756
201012
201268
201524
201780
202036
202292
202548
202804
203060
203316
203572
203828
204084
204340
204596
204852
205108
205364
205620
205876
206132
206388
206644
206900
207156
207412
207668
207924
208180
208436
208692
208948
209204
209460
209716
209972
210228
210484
210740
210996
211252
211508
211764
212020
212276
212532
212788
213044
213300
213556
213812
214068
214324
214580
214836
215092
215348
215604
215860
216116
216372
216628
216884
217140
217396
217652
217908
218164
218420
218676
218932
219188
219444
219700
219956
220212
220468
220724
220980
196917
197173
197429
197685
197941
198197
198453
198709
198965
199221
199477
199733
199989
200245
200501
200757
201013
201269
201525
201781
202037
202293
202549
202805
203061
203317
203573
203829
204085
204341
204597
204853
205109
205365
205621
205877
206133
206389
206645
206901
207157
207413
207669
207925
208181
208437
208693
208949
209205
209461
209717
209973
210229
210485
210741
210997
211253
211509
211765
212021
212277
212533
212789
213045
213301
213557
213813
214069
214325
214581
214837
215093
215349
215605
215861
216117
216373
216629
216885
217141
217397
217653
217909
218165
218421
218677
218933
219189
219445
219701
219957
220213
220469
220725
220981
196918
197174
197430
197686
197942
198198
198454
198710
198966
199222
199478
199734
199990
200246
200502
200758
201014
201270
201526
201782
202038
202294
202550
202806
203062
203318
203574
203830
204086
204342
204598
204854
205110
205366
205622
205878
206134
206390
206646
206902
207158
207414
207670
207926
208182
208438
208694
208950
209206
209462
209718
209974
210230
210486
210742
210998
211254
211510
211766
212022
212278
212534
212790
213046
213302
213558
213814
214070
214326
214582
214838
215094
215350
215606
215862
216118
216374
216630
216886
217142
217398
217654
217910
218166
218422
218678
218934
219190
219446
219702
219958
220214
220470
220726
220982
196919
197175
197431
197687
197943
198199
198455
198711
198967
199223
199479
199735
199991
200247
200503
200759
201015
201271
201527
201783
202039
202295
202551
202807
203063
203319
203575
203831
204087
204343
204599
204855
205111
205367
205623
205879
206135
206391
206647
206903
207159
207415
207671
207927
208183
208439
208695
208951
209207
209463
209719
209975
210231
210487
210743
210999
211255
211511
211767
212023
212279
212535
212791
213047
213303
213559
213815
214071
214327
214583
214839
215095
215351
215607
215863
216119
216375
216631
216887
217143
217399
217655
217911
218167
218423
218679
218935
219191
219447
219703
219959
220215
220471
220727
220983
196920
197176
197432
197688
197944
198200
198456
198712
198968
199224
199480
199736
199992
200248
200504
200760
201016
201272
201528
201784
202040
202296
202552
202808
203064
203320
203576
203832
204088
204344
204600
204856
205112
205368
205624
205880
206136
206392
206648
206904
207160
207416
207672
207928
208184
208440
208696
208952
209208
209464
209720
209976
210232
210488
210744
211000
211256
211512
211768
212024
212280
212536
212792
213048
213304
213560
213816
214072
214328
214584
214840
215096
215352
215608
215864
216120
216376
216632
216888
217144
217400
217656
217912
218168
218424
218680
218936
219192
219448
219704
219960
220216
220472
220728
220984
196921
197177
197433
197689
197945
198201
198457
198713
198969
199225
199481
199737
199993
200249
200505
200761
201017
201273
201529
201785
202041
202297
202553
202809
203065
203321
203577
203833
204089
204345
204601
204857
205113
205369
205625
205881
206137
206393
206649
206905
207161
207417
207673
207929
208185
208441
208697
208953
209209
209465
209721
209977
210233
210489
210745
211001
211257
211513
211769
212025
212281
212537
212793
213049
213305
213561
213817
214073
214329
214585
214841
215097
215353
215609
215865
216121
216377
216633
216889
217145
217401
217657
217913
218169
218425
218681
218937
219193
219449
219705
219961
220217
220473
220729
220985
196922
197178
197434
197690
197946
198202
198458
198714
198970
199226
199482
199738
199994
200250
200506
200762
201018
201274
201530
201786
202042
202298
202554
202810
203066
203322
203578
203834
204090
204346
204602
204858
205114
205370
205626
205882
206138
206394
206650
206906
207162
207418
207674
207930
208186
208442
208698
208954
209210
209466
209722
209978
210234
210490
210746
211002
211258
211514
211770
212026
212282
212538
212794
213050
213306
213562
213818
214074
214330
214586
214842
215098
215354
215610
215866
216122
216378
216634
216890
217146
217402
217658
217914
218170
218426
218682
218938
219194
219450
219706
219962
220218
220474
220730
220986
196923
197179
197435
197691
197947
198203
198459
198715
198971
199227
199483
199739
199995
200251
200507
200763
201019
201275
201531
201787
202043
202299
202555
202811
203067
203323
203579
203835
204091
204347
204603
204859
205115
205371
205627
205883
206139
206395
206651
206907
207163
207419
207675
207931
208187
208443
208699
208955
209211
209467
209723
209979
210235
210491
210747
211003
211259
211515
211771
212027
212283
212539
212795
213051
213307
213563
213819
214075
214331
214587
214843
215099
215355
215611
215867
216123
216379
216635
216891
217147
217403
217659
217915
218171
218427
218683
218939
219195
219451
219707
219963
220219
220475
220731
220987
196924
197180
197436
197692
197948
198204
198460
198716
198972
199228
199484
199740
199996
200252
200508
200764
201020
201276
201532
201788
202044
202300
202556
202812
203068
203324
203580
203836
204092
204348
204604
204860
205116
205372
205628
205884
206140
206396
206652
206908
207164
207420
207676
207932
208188
208444
208700
208956
209212
209468
209724
209980
210236
210492
210748
211004
211260
211516
211772
212028
212284
212540
212796
213052
213308
213564
213820
214076
214332
214588
214844
215100
215356
215612
215868
216124
216380
216636
216892
217148
217404
217660
217916
218172
218428
218684
218940
219196
219452
219708
219964
220220
220476
220732
220988
196925
197181
197437
197693
197949
198205
198461
198717
198973
199229
199485
199741
199997
200253
200509
200765
201021
201277
201533
201789
202045
202301
202557
202813
203069
203325
203581
203837
204093
204349
204605
204861
205117
205373
205629
205885
206141
206397
206653
206909
207165
207421
207677
207933
208189
208445
208701
208957
209213
209469
209725
209981
210237
210493
210749
211005
211261
211517
211773
212029
212285
212541
212797
213053
213309
213565
213821
214077
214333
214589
214845
215101
215357
215613
215869
216125
216381
216637
216893
217149
217405
217661
217917
218173
218429
218685
218941
219197
219453
219709
219965
220221
220477
220733
220989
196926
197182
197438
197694
197950
198206
198462
198718
198974
199230
199486
199742
199998
200254
200510
200766
201022
201278
201534
201790
202046
202302
202558
202814
203070
203326
203582
203838
204094
204350
204606
204862
205118
205374
205630
205886
206142
206398
206654
206910
207166
207422
207678
207934
208190
208446
208702
208958
209214
209470
209726
209982
210238
210494
210750
211006
211262
211518
211774
212030
212286
212542
212798
213054
213310
213566
213822
214078
214334
214590
214846
215102
215358
215614
215870
216126
216382
216638
216894
217150
217406
217662
217918
218174
218430
218686
218942
219198
219454
219710
219966
220222
220478
220734
220990
196927
197183
197439
197695
197951
198207
198463
198719
198975
199231
199487
199743
199999
200255
200511
200767
201023
201279
201535
201791
202047
202303
202559
202815
203071
203327
203583
203839
204095
204351
204607
204863
205119
205375
205631
205887
206143
206399
206655
206911
207167
207423
207679
207935
208191
208447
208703
208959
209215
209471
209727
209983
210239
210495
210751
211007
211263
211519
211775
212031
212287
212543
212799
213055
213311
213567
213823
214079
214335
214591
214847
215103
215359
215615
215871
216127
216383
216639
216895
217151
217407
217663
217919
218175
218431
218687
218943
219199
219455
219711
219967
220223
220479
220735
220991
196928
197184
197440
197696
197952
198208
198464
198720
198976
199232
199488
199744
200000
200256
200512
200768
201024
201280
201536
201792
202048
202304
202560
202816
203072
203328
203584
203840
204096
204352
204608
204864
205120
205376
205632
205888
206144
206400
206656
206912
207168
207424
207680
207936
208192
208448
208704
208960
209216
209472
209728
209984
210240
210496
210752
211008
211264
211520
211776
212032
212288
212544
212800
213056
213312
213568
213824
214080
214336
214592
214848
215104
215360
215616
215872
216128
216384
216640
216896
217152
217408
217664
217920
218176
218432
218688
218944
219200
219456
219712
219968
220224
220480
220736
220992
196929
197185
197441
197697
197953
198209
198465
198721
198977
199233
199489
199745
200001
200257
200513
200769
201025
201281
201537
201793
202049
202305
202561
202817
203073
203329
203585
203841
204097
204353
204609
204865
205121
205377
205633
205889
206145
206401
206657
206913
207169
207425
207681
207937
208193
208449
208705
208961
209217
209473
209729
209985
210241
210497
210753
211009
211265
211521
211777
212033
212289
212545
212801
213057
213313
213569
213825
214081
214337
214593
214849
215105
215361
215617
215873
216129
216385
216641
216897
217153
217409
217665
217921
218177
218433
218689
218945
219201
219457
219713
219969
220225
220481
220737
220993
196930
197186
197442
197698
197954
198210
198466
198722
198978
199234
199490
199746
200002
200258
200514
200770
201026
201282
201538
201794
202050
202306
202562
202818
203074
203330
203586
203842
204098
204354
204610
204866
205122
205378
205634
205890
206146
206402
206658
206914
207170
207426
207682
207938
208194
208450
208706
208962
209218
209474
209730
209986
210242
210498
210754
211010
211266
211522
211778
212034
212290
212546
212802
213058
213314
213570
213826
214082
214338
214594
214850
215106
215362
215618
215874
216130
216386
216642
216898
217154
217410
217666
217922
218178
218434
218690
218946
219202
219458
219714
219970
220226
220482
220738
220994
196931
197187
197443
197699
197955
198211
198467
198723
198979
199235
199491
199747
200003
200259
200515
200771
201027
201283
201539
201795
202051
202307
202563
202819
203075
203331
203587
203843
204099
204355
204611
204867
205123
205379
205635
205891
206147
206403
206659
206915
207171
207427
207683
207939
208195
208451
208707
208963
209219
209475
209731
209987
210243
210499
210755
211011
211267
211523
211779
212035
212291
212547
212803
213059
213315
213571
213827
214083
214339
214595
214851
215107
215363
215619
215875
216131
216387
216643
216899
217155
217411
217667
217923
218179
218435
218691
218947
219203
219459
219715
219971
220227
220483
220739
220995
196932
197188
197444
197700
197956
198212
198468
198724
198980
199236
199492
199748
200004
200260
200516
200772
201028
201284
201540
201796
202052
202308
202564
202820
203076
203332
203588
203844
204100
204356
204612
204868
205124
205380
205636
205892
206148
206404
206660
206916
207172
207428
207684
207940
208196
208452
208708
208964
209220
209476
209732
209988
210244
210500
210756
211012
211268
211524
211780
212036
212292
212548
212804
213060
213316
213572
213828
214084
214340
214596
214852
215108
215364
215620
215876
216132
216388
216644
216900
217156
217412
217668
217924
218180
218436
218692
218948
219204
219460
219716
219972
220228
220484
220740
220996
196933
197189
197445
197701
197957
198213
198469
198725
198981
199237
199493
199749
200005
200261
200517
200773
201029
201285
201541
201797
202053
202309
202565
202821
203077
203333
203589
203845
204101
204357
204613
204869
205125
205381
205637
205893
206149
206405
206661
206917
207173
207429
207685
207941
208197
208453
208709
208965
209221
209477
209733
209989
210245
210501
210757
211013
211269
211525
211781
212037
212293
212549
212805
213061
213317
213573
213829
214085
214341
214597
214853
215109
215365
215621
215877
216133
216389
216645
216901
217157
217413
217669
217925
218181
218437
218693
218949
219205
219461
219717
219973
220229
220485
220741
220997
196934
197190
197446
197702
197958
198214
198470
198726
198982
199238
199494
199750
200006
200262
200518
200774
201030
201286
201542
201798
202054
202310
202566
202822
203078
203334
203590
203846
204102
204358
204614
204870
205126
205382
205638
205894
206150
206406
206662
206918
207174
207430
207686
207942
208198
208454
208710
208966
209222
209478
209734
209990
210246
210502
210758
211014
211270
211526
211782
212038
212294
212550
212806
213062
213318
213574
213830
214086
214342
214598
214854
215110
215366
215622
215878
216134
216390
216646
216902
217158
217414
217670
217926
218182
218438
218694
218950
219206
219462
219718
219974
220230
220486
220742
220998
196935
197191
197447
197703
197959
198215
198471
198727
198983
199239
199495
199751
200007
200263
200519
200775
201031
201287
201543
201799
202055
202311
202567
202823
203079
203335
203591
203847
204103
204359
204615
204871
205127
205383
205639
205895
206151
206407
206663
206919
207175
207431
207687
207943
208199
208455
208711
208967
209223
209479
209735
209991
210247
210503
210759
211015
211271
211527
211783
212039
212295
212551
212807
213063
213319
213575
213831
214087
214343
214599
214855
215111
215367
215623
215879
216135
216391
216647
216903
217159
217415
217671
217927
218183
218439
218695
218951
219207
219463
219719
219975
220231
220487
220743
220999
196936
197192
197448
197704
197960
198216
198472
198728
198984
199240
199496
199752
200008
200264
200520
200776
201032
201288
201544
201800
202056
202312
202568
202824
203080
203336
203592
203848
204104
204360
204616
204872
205128
205384
205640
205896
206152
206408
206664
206920
207176
207432
207688
207944
208200
208456
208712
208968
209224
209480
209736
209992
210248
210504
210760
211016
211272
211528
211784
212040
212296
212552
212808
213064
213320
213576
213832
214088
214344
214600
214856
215112
215368
215624
215880
216136
216392
216648
216904
217160
217416
217672
217928
218184
218440
218696
218952
219208
219464
219720
219976
220232
220488
220744
221000
196937
197193
197449
197705
197961
198217
198473
198729
198985
199241
199497
199753
200009
200265
200521
200777
201033
201289
201545
201801
202057
202313
202569
202825
203081
203337
203593
203849
204105
204361
204617
204873
205129
205385
205641
205897
206153
206409
206665
206921
207177
207433
207689
207945
208201
208457
208713
208969
209225
209481
209737
209993
210249
210505
210761
211017
211273
211529
211785
212041
212297
212553
212809
213065
213321
213577
213833
214089
214345
214601
214857
215113
215369
215625
215881
216137
216393
216649
216905
217161
217417
217673
217929
218185
218441
218697
218953
219209
219465
219721
219977
220233
220489
220745
221001
196938
197194
197450
197706
197962
198218
198474
198730
198986
199242
199498
199754
200010
200266
200522
200778
201034
201290
201546
201802
202058
202314
202570
202826
203082
203338
203594
203850
204106
204362
204618
204874
205130
205386
205642
205898
206154
206410
206666
206922
207178
207434
207690
207946
208202
208458
208714
208970
209226
209482
209738
209994
210250
210506
210762
211018
211274
211530
211786
212042
212298
212554
212810
213066
213322
213578
213834
214090
214346
214602
214858
215114
215370
215626
215882
216138
216394
216650
216906
217162
217418
217674
217930
218186
218442
218698
218954
219210
219466
219722
219978
220234
220490
220746
221002
196939
197195
197451
197707
197963
198219
198475
198731
198987
199243
199499
199755
200011
200267
200523
200779
201035
201291
201547
201803
202059
202315
202571
202827
203083
203339
203595
203851
204107
204363
204619
204875
205131
205387
205643
205899
206155
206411
206667
206923
207179
207435
207691
207947
208203
208459
208715
208971
209227
209483
209739
209995
210251
210507
210763
211019
211275
211531
211787
212043
212299
212555
212811
213067
213323
213579
213835
214091
214347
214603
214859
215115
215371
215627
215883
216139
216395
216651
216907
217163
217419
217675
217931
218187
218443
218699
218955
219211
219467
219723
219979
220235
220491
220747
221003
196940
197196
197452
197708
197964
198220
198476
198732
198988
199244
199500
199756
200012
200268
200524
200780
201036
201292
201548
201804
202060
202316
202572
202828
203084
203340
203596
203852
204108
204364
204620
204876
205132
205388
205644
205900
206156
206412
206668
206924
207180
207436
207692
207948
208204
208460
208716
208972
209228
209484
209740
209996
210252
210508
210764
211020
211276
211532
211788
212044
212300
212556
212812
213068
213324
213580
213836
214092
214348
214604
214860
215116
215372
215628
215884
216140
216396
216652
216908
217164
217420
217676
217932
218188
218444
218700
218956
219212
219468
219724
219980
220236
220492
220748
221004
196941
197197
197453
197709
197965
198221
198477
198733
198989
199245
199501
199757
200013
200269
200525
200781
201037
201293
201549
201805
202061
202317
202573
202829
203085
203341
203597
203853
204109
204365
204621
204877
205133
205389
205645
205901
206157
206413
206669
206925
207181
207437
207693
207949
208205
208461
208717
208973
209229
209485
209741
209997
210253
210509
210765
211021
211277
211533
211789
212045
212301
212557
212813
213069
213325
213581
213837
214093
214349
214605
214861
215117
215373
215629
215885
216141
216397
216653
216909
217165
217421
217677
217933
218189
218445
218701
218957
219213
219469
219725
219981
220237
220493
220749
221005
196942
197198
197454
197710
197966
198222
198478
198734
198990
199246
199502
199758
200014
200270
200526
200782
201038
201294
201550
201806
202062
202318
202574
202830
203086
203342
203598
203854
204110
204366
204622
204878
205134
205390
205646
205902
206158
206414
206670
206926
207182
207438
207694
207950
208206
208462
208718
208974
209230
209486
209742
209998
210254
210510
210766
211022
211278
211534
211790
212046
212302
212558
212814
213070
213326
213582
213838
214094
214350
214606
214862
215118
215374
215630
215886
216142
216398
216654
216910
217166
217422
217678
217934
218190
218446
218702
218958
219214
219470
219726
219982
220238
220494
220750
221006
196943
197199
197455
197711
197967
198223
198479
198735
198991
199247
199503
199759
200015
200271
200527
200783
201039
201295
201551
201807
202063
202319
202575
202831
203087
203343
203599
203855
204111
204367
204623
204879
205135
205391
205647
205903
206159
206415
206671
206927
207183
207439
207695
207951
208207
208463
208719
208975
209231
209487
209743
209999
210255
210511
210767
211023
211279
211535
211791
212047
212303
212559
212815
213071
213327
213583
213839
214095
214351
214607
214863
215119
215375
215631
215887
216143
216399
216655
216911
217167
217423
217679
217935
218191
218447
218703
218959
219215
219471
219727
219983
220239
220495
220751
221007
196944
197200
197456
197712
197968
198224
198480
198736
198992
199248
199504
199760
200016
200272
200528
200784
201040
201296
201552
201808
202064
202320
202576
202832
203088
203344
203600
203856
204112
204368
204624
204880
205136
205392
205648
205904
206160
206416
206672
206928
207184
207440
207696
207952
208208
208464
208720
208976
209232
209488
209744
210000
210256
210512
210768
211024
211280
211536
211792
212048
212304
212560
212816
213072
213328
213584
213840
214096
214352
214608
214864
215120
215376
215632
215888
216144
216400
216656
216912
217168
217424
217680
217936
218192
218448
218704
218960
219216
219472
219728
219984
220240
220496
220752
221008
196945
197201
197457
197713
197969
198225
198481
198737
198993
199249
199505
199761
200017
200273
200529
200785
201041
201297
201553
201809
202065
202321
202577
202833
203089
203345
203601
203857
204113
204369
204625
204881
205137
205393
205649
205905
206161
206417
206673
206929
207185
207441
207697
207953
208209
208465
208721
208977
209233
209489
209745
210001
210257
210513
210769
211025
211281
211537
211793
212049
212305
212561
212817
213073
213329
213585
213841
214097
214353
214609
214865
215121
215377
215633
215889
216145
216401
216657
216913
217169
217425
217681
217937
218193
218449
218705
218961
219217
219473
219729
219985
220241
220497
220753
221009
196946
197202
197458
197714
197970
198226
198482
198738
198994
199250
199506
199762
200018
200274
200530
200786
201042
201298
201554
201810
202066
202322
202578
202834
203090
203346
203602
203858
204114
204370
204626
204882
205138
205394
205650
205906
206162
206418
206674
206930
207186
207442
207698
207954
208210
208466
208722
208978
209234
209490
209746
210002
210258
210514
210770
211026
211282
211538
211794
212050
212306
212562
212818
213074
213330
213586
213842
214098
214354
214610
214866
215122
215378
215634
215890
216146
216402
216658
216914
217170
217426
217682
217938
218194
218450
218706
218962
219218
219474
219730
219986
220242
220498
220754
221010
196947
197203
197459
197715
197971
198227
198483
198739
198995
199251
199507
199763
200019
200275
200531
200787
201043
201299
201555
201811
202067
202323
202579
202835
203091
203347
203603
203859
204115
204371
204627
204883
205139
205395
205651
205907
206163
206419
206675
206931
207187
207443
207699
207955
208211
208467
208723
208979
209235
209491
209747
210003
210259
210515
210771
211027
211283
211539
211795
212051
212307
212563
212819
213075
213331
213587
213843
214099
214355
214611
214867
215123
215379
215635
215891
216147
216403
216659
216915
217171
217427
217683
217939
218195
218451
218707
218963
219219
219475
219731
219987
220243
220499
220755
221011
196948
197204
197460
197716
197972
198228
198484
198740
198996
199252
199508
199764
200020
200276
200532
200788
201044
201300
201556
201812
202068
202324
202580
202836
203092
203348
203604
203860
204116
204372
204628
204884
205140
205396
205652
205908
206164
206420
206676
206932
207188
207444
207700
207956
208212
208468
208724
208980
209236
209492
209748
210004
210260
210516
210772
211028
211284
211540
211796
212052
212308
212564
212820
213076
213332
213588
213844
214100
214356
214612
214868
215124
215380
215636
215892
216148
216404
216660
216916
217172
217428
217684
217940
218196
218452
218708
218964
219220
219476
219732
219988
220244
220500
220756
221012
196949
197205
197461
197717
197973
198229
198485
198741
198997
199253
199509
199765
200021
200277
200533
200789
201045
201301
201557
201813
202069
202325
202581
202837
203093
203349
203605
203861
204117
204373
204629
204885
205141
205397
205653
205909
206165
206421
206677
206933
207189
207445
207701
207957
208213
208469
208725
208981
209237
209493
209749
210005
210261
210517
210773
211029
211285
211541
211797
212053
212309
212565
212821
213077
213333
213589
213845
214101
214357
214613
214869
215125
215381
215637
215893
216149
216405
216661
216917
217173
217429
217685
217941
218197
218453
218709
218965
219221
219477
219733
219989
220245
220501
220757
221013
196950
197206
197462
197718
197974
198230
198486
198742
198998
199254
199510
199766
200022
200278
200534
200790
201046
201302
201558
201814
202070
202326
202582
202838
203094
203350
203606
203862
204118
204374
204630
204886
205142
205398
205654
205910
206166
206422
206678
206934
207190
207446
207702
207958
208214
208470
208726
208982
209238
209494
209750
210006
210262
210518
210774
211030
211286
211542
211798
212054
212310
212566
212822
213078
213334
213590
213846
214102
214358
214614
214870
215126
215382
215638
215894
216150
216406
216662
216918
217174
217430
217686
217942
218198
218454
218710
218966
219222
219478
219734
219990
220246
220502
220758
221014
196951
197207
197463
197719
197975
198231
198487
198743
198999
199255
199511
199767
200023
200279
200535
200791
201047
201303
201559
201815
202071
202327
202583
202839
203095
203351
203607
203863
204119
204375
204631
204887
205143
205399
205655
205911
206167
206423
206679
206935
207191
207447
207703
207959
208215
208471
208727
208983
209239
209495
209751
210007
210263
210519
210775
211031
211287
211543
211799
212055
212311
212567
212823
213079
213335
213591
213847
214103
214359
214615
214871
215127
215383
215639
215895
216151
216407
216663
216919
217175
217431
217687
217943
218199
218455
218711
218967
219223
219479
219735
219991
220247
220503
220759
221015
196952
197208
197464
197720
197976
198232
198488
198744
199000
199256
199512
199768
200024
200280
200536
200792
201048
201304
201560
201816
202072
202328
202584
202840
203096
203352
203608
203864
204120
204376
204632
204888
205144
205400
205656
205912
206168
206424
206680
206936
207192
207448
207704
207960
208216
208472
208728
208984
209240
209496
209752
210008
210264
210520
210776
211032
211288
211544
211800
212056
212312
212568
212824
213080
213336
213592
213848
214104
214360
214616
214872
215128
215384
215640
215896
216152
216408
216664
216920
217176
217432
217688
217944
218200
218456
218712
218968
219224
219480
219736
219992
220248
220504
220760
221016
196953
197209
197465
197721
197977
198233
198489
198745
199001
199257
199513
199769
200025
200281
200537
200793
201049
201305
201561
201817
202073
202329
202585
202841
203097
203353
203609
203865
204121
204377
204633
204889
205145
205401
205657
205913
206169
206425
206681
206937
207193
207449
207705
207961
208217
208473
208729
208985
209241
209497
209753
210009
210265
210521
210777
211033
211289
211545
211801
212057
212313
212569
212825
213081
213337
213593
213849
214105
214361
214617
214873
215129
215385
215641
215897
216153
216409
216665
216921
217177
217433
217689
217945
218201
218457
218713
218969
219225
219481
219737
219993
220249
220505
220761
221017
196954
197210
197466
197722
197978
198234
198490
198746
199002
199258
199514
199770
200026
200282
200538
200794
201050
201306
201562
201818
202074
202330
202586
202842
203098
203354
203610
203866
204122
204378
204634
204890
205146
205402
205658
205914
206170
206426
206682
206938
207194
207450
207706
207962
208218
208474
208730
208986
209242
209498
209754
210010
210266
210522
210778
211034
211290
211546
211802
212058
212314
212570
212826
213082
213338
213594
213850
214106
214362
214618
214874
215130
215386
215642
215898
216154
216410
216666
216922
217178
217434
217690
217946
218202
218458
218714
218970
219226
219482
219738
219994
220250
220506
220762
221018
196955
197211
197467
197723
197979
198235
198491
198747
199003
199259
199515
199771
200027
200283
200539
200795
201051
201307
201563
201819
202075
202331
202587
202843
203099
203355
203611
203867
204123
204379
204635
204891
205147
205403
205659
205915
206171
206427
206683
206939
207195
207451
207707
207963
208219
208475
208731
208987
209243
209499
209755
210011
210267
210523
210779
211035
211291
211547
211803
212059
212315
212571
212827
213083
213339
213595
213851
214107
214363
214619
214875
215131
215387
215643
215899
216155
216411
216667
216923
217179
217435
217691
217947
218203
218459
218715
218971
219227
219483
219739
219995
220251
220507
220763
221019
196956
197212
197468
197724
197980
198236
198492
198748
199004
199260
199516
199772
200028
200284
200540
200796
201052
201308
201564
201820
202076
202332
202588
202844
203100
203356
203612
203868
204124
204380
204636
204892
205148
205404
205660
205916
206172
206428
206684
206940
207196
207452
207708
207964
208220
208476
208732
208988
209244
209500
209756
210012
210268
210524
210780
211036
211292
211548
211804
212060
212316
212572
212828
213084
213340
213596
213852
214108
214364
214620
214876
215132
215388
215644
215900
216156
216412
216668
216924
217180
217436
217692
217948
218204
218460
218716
218972
219228
219484
219740
219996
220252
220508
220764
221020
196957
197213
197469
197725
197981
198237
198493
198749
199005
199261
199517
199773
200029
200285
200541
200797
201053
201309
201565
201821
202077
202333
202589
202845
203101
203357
203613
203869
204125
204381
204637
204893
205149
205405
205661
205917
206173
206429
206685
206941
207197
207453
207709
207965
208221
208477
208733
208989
209245
209501
209757
210013
210269
210525
210781
211037
211293
211549
211805
212061
212317
212573
212829
213085
213341
213597
213853
214109
214365
214621
214877
215133
215389
215645
215901
216157
216413
216669
216925
217181
217437
217693
217949
218205
218461
218717
218973
219229
219485
219741
219997
220253
220509
220765
221021
196958
197214
197470
197726
197982
198238
198494
198750
199006
199262
199518
199774
200030
200286
200542
200798
201054
201310
201566
201822
202078
202334
202590
202846
203102
203358
203614
203870
204126
204382
204638
204894
205150
205406
205662
205918
206174
206430
206686
206942
207198
207454
207710
207966
208222
208478
208734
208990
209246
209502
209758
210014
210270
210526
210782
211038
211294
211550
211806
212062
212318
212574
212830
213086
213342
213598
213854
214110
214366
214622
214878
215134
215390
215646
215902
216158
216414
216670
216926
217182
217438
217694
217950
218206
218462
218718
218974
219230
219486
219742
219998
220254
220510
220766
221022
196959
197215
197471
197727
197983
198239
198495
198751
199007
199263
199519
199775
200031
200287
200543
200799
201055
201311
201567
201823
202079
202335
202591
202847
203103
203359
203615
203871
204127
204383
204639
204895
205151
205407
205663
205919
206175
206431
206687
206943
207199
207455
207711
207967
208223
208479
208735
208991
209247
209503
209759
210015
210271
210527
210783
211039
211295
211551
211807
212063
212319
212575
212831
213087
213343
213599
213855
214111
214367
214623
214879
215135
215391
215647
215903
216159
216415
216671
216927
217183
217439
217695
217951
218207
218463
218719
218975
219231
219487
219743
219999
220255
220511
220767
221023
2752769
2753025
2753281
2753537
2753793
2754049
2754305
2754561
2754817
2755073
2755329
2755585
2755841
2756097
2756353
2756609
2756865
2757121
2757377
2757633
2757889
2758145
2758401
2758657
2758913
2759169
2759425
2759681
2759937
2760193
2760449
2752770
2753026
2753282
2753538
2753794
2754050
2754306
2754562
2754818
2755074
2755330
2755586
2755842
2756098
2756354
2756610
2756866
2757122
2757378
2757634
2757890
2758146
2758402
2758658
2758914
2759170
2759426
2759682
2759938
2760194
2760450
2752771
2753027
2753283
2753539
2753795
2754051
2754307
2754563
2754819
2755075
2755331
2755587
2755843
2756099
2756355
2756611
2756867
2757123
2757379
2757635
2757891
2758147
2758403
2758659
2758915
2759171
2759427
2759683
2759939
2760195
2760451
2752772
2753028
2753284
2753540
2753796
2754052
2754308
2754564
2754820
2755076
2755332
2755588
2755844
2756100
2756356
2756612
2756868
2757124
2757380
2757636
2757892
2758148
2758404
2758660
2758916
2759172
2759428
2759684
2759940
2760196
2760452
2752773
2753029
2753285
2753541
2753797
2754053
2754309
2754565
2754821
2755077
2755333
2755589
2755845
2756101
2756357
2756613
2756869
2757125
2757381
2757637
2757893
2758149
2758405
2758661
2758917
2759173
2759429
2759685
2759941
2760197
2760453
2752774
2753030
2753286
2753542
2753798
2754054
2754310
2754566
2754822
2755078
2755334
2755590
2755846
2756102
2756358
2756614
2756870
2757126
2757382
2757638
2757894
2758150
2758406
2758662
2758918
2759174
2759430
2759686
2759942
2760198
2760454
2752775
2753031
2753287
2753543
2753799
2754055
2754311
2754567
2754823
2755079
2755335
2755591
2755847
2756103
2756359
2756615
2756871
2757127
2757383
2757639
2757895
2758151
2758407
2758663
2758919
2759175
2759431
2759687
2759943
2760199
2760455
2752776
2753032
2753288
2753544
2753800
2754056
2754312
2754568
2754824
2755080
2755336
2755592
2755848
2756104
2756360
2756616
2756872
2757128
2757384
2757640
2757896
2758152
2758408
2758664
2758920
2759176
2759432
2759688
2759944
2760200
2760456
2752777
2753033
2753289
2753545
2753801
2754057
2754313
2754569
2754825
2755081
2755337
2755593
2755849
2756105
2756361
2756617
2756873
2757129
2757385
2757641
2757897
2758153
2758409
2758665
2758921
2759177
2759433
2759689
2759945
2760201
2760457
2752778
2753034
2753290
2753546
2753802
2754058
2754314
2754570
2754826
2755082
2755338
2755594
2755850
2756106
2756362
2756618
2756874
2757130
2757386
2757642
2757898
2758154
2758410
2758666
2758922
2759178
2759434
2759690
2759946
2760202
2760458
2752779
2753035
2753291
2753547
2753803
2754059
2754315
2754571
2754827
2755083
2755339
2755595
2755851
2756107
2756363
2756619
2756875
2757131
2757387
2757643
2757899
2758155
2758411
2758667
2758923
2759179
2759435
2759691
2759947
2760203
2760459
2752780
2753036
2753292
2753548
2753804
2754060
2754316
2754572
2754828
2755084
2755340
2755596
2755852
2756108
2756364
2756620
2756876
2757132
2757388
2757644
2757900
2758156
2758412
2758668
2758924
2759180
2759436
2759692
2759948
2760204
2760460
2752781
2753037
2753293
2753549
2753805
2754061
2754317
2754573
2754829
2755085
2755341
2755597
2755853
2756109
2756365
2756621
2756877
2757133
2757389
2757645
2757901
2758157
2758413
2758669
2758925
2759181
2759437
2759693
2759949
2760205
2760461
2752782
2753038
2753294
2753550
2753806
2754062
2754318
2754574
2754830
2755086
2755342
2755598
2755854
2756110
2756366
2756622
2756878
2757134
2757390
2757646
2757902
2758158
2758414
2758670
2758926
2759182
2759438
2759694
2759950
2760206
2760462
2752783
2753039
2753295
2753551
2753807
2754063
2754319
2754575
2754831
2755087
2755343
2755599
2755855
2756111
2756367
2756623
2756879
2757135
2757391
2757647
2757903
2758159
2758415
2758671
2758927
2759183
2759439
2759695
2759951
2760207
2760463
2752784
2753040
2753296
2753552
2753808
2754064
2754320
2754576
2754832
2755088
2755344
2755600
2755856
2756112
2756368
2756624
2756880
2757136
2757392
2757648
2757904
2758160
2758416
2758672
2758928
2759184
2759440
2759696
2759952
2760208
2760464
2752785
2753041
2753297
2753553
2753809
2754065
2754321
2754577
2754833
2755089
2755345
2755601
2755857
2756113
2756369
2756625
2756881
2757137
2757393
2757649
2757905
2758161
2758417
2758673
2758929
2759185
2759441
2759697
2759953
2760209
2760465
2752786
2753042
2753298
2753554
2753810
2754066
2754322
2754578
2754834
2755090
2755346
2755602
2755858
2756114
2756370
2756626
2756882
2757138
2757394
2757650
2757906
2758162
2758418
2758674
2758930
2759186
2759442
2759698
2759954
2760210
2760466
2752787
2753043
2753299
2753555
2753811
2754067
2754323
2754579
2754835
2755091
2755347
2755603
2755859
2756115
2756371
2756627
2756883
2757139
2757395
2757651
2757907
2758163
2758419
2758675
2758931
2759187
2759443
2759699
2759955
2760211
2760467
2752788
2753044
2753300
2753556
2753812
2754068
2754324
2754580
2754836
2755092
2755348
2755604
2755860
2756116
2756372
2756628
2756884
2757140
2757396
2757652
2757908
2758164
2758420
2758676
2758932
2759188
2759444
2759700
2759956
2760212
2760468
2752789
2753045
2753301
2753557
2753813
2754069
2754325
2754581
2754837
2755093
2755349
2755605
2755861
2756117
2756373
2756629
2756885
2757141
2757397
2757653
2757909
2758165
2758421
2758677
2758933
2759189
2759445
2759701
2759957
2760213
2760469
2752790
2753046
2753302
2753558
2753814
2754070
2754326
2754582
2754838
2755094
2755350
2755606
2755862
2756118
2756374
2756630
2756886
2757142
2757398
2757654
2757910
2758166
2758422
2758678
2758934
2759190
2759446
2759702
2759958
2760214
2760470
2752791
2753047
2753303
2753559
2753815
2754071
2754327
2754583
2754839
2755095
2755351
2755607
2755863
2756119
2756375
2756631
2756887
2757143
2757399
2757655
2757911
2758167
2758423
2758679
2758935
2759191
2759447
2759703
2759959
2760215
2760471
2752792
2753048
2753304
2753560
2753816
2754072
2754328
2754584
2754840
2755096
2755352
2755608
2755864
2756120
2756376
2756632
2756888
2757144
2757400
2757656
2757912
2758168
2758424
2758680
2758936
2759192
2759448
2759704
2759960
2760216
2760472
2752793
2753049
2753305
2753561
2753817
2754073
2754329
2754585
2754841
2755097
2755353
2755609
2755865
2756121
2756377
2756633
2756889
2757145
2757401
2757657
2757913
2758169
2758425
2758681
2758937
2759193
2759449
2759705
2759961
2760217
2760473
2752794
2753050
2753306
2753562
2753818
2754074
2754330
2754586
2754842
2755098
2755354
2755610
2755866
2756122
2756378
2756634
2756890
2757146
2757402
2757658
2757914
2758170
2758426
2758682
2758938
2759194
2759450
2759706
2759962
2760218
2760474
2752795
2753051
2753307
2753563
2753819
2754075
2754331
2754587
2754843
2755099
2755355
2755611
2755867
2756123
2756379
2756635
2756891
2757147
2757403
2757659
2757915
2758171
2758427
2758683
2758939
2759195
2759451
2759707
2759963
2760219
2760475
2752796
2753052
2753308
2753564
2753820
2754076
2754332
2754588
2754844
2755100
2755356
2755612
2755868
2756124
2756380
2756636
2756892
2757148
2757404
2757660
2757916
2758172
2758428
2758684
2758940
2759196
2759452
2759708
2759964
2760220
2760476
2752797
2753053
2753309
2753565
2753821
2754077
2754333
2754589
2754845
2755101
2755357
2755613
2755869
2756125
2756381
2756637
2756893
2757149
2757405
2757661
2757917
2758173
2758429
2758685
2758941
2759197
2759453
2759709
2759965
2760221
2760477
2752798
2753054
2753310
2753566
2753822
2754078
2754334
2754590
2754846
2755102
2755358
2755614
2755870
2756126
2756382
2756638
2756894
2757150
2757406
2757662
2757918
2758174
2758430
2758686
2758942
2759198
2759454
2759710
2759966
2760222
2760478
2752799
2753055
2753311
2753567
2753823
2754079
2754335
2754591
2754847
2755103
2755359
2755615
2755871
2756127
2756383
2756639
2756895
2757151
2757407
2757663
2757919
2758175
2758431
2758687
2758943
2759199
2759455
2759711
2759967
2760223
2760479
2752800
2753056
2753312
2753568
2753824
2754080
2754336
2754592
2754848
2755104
2755360
2755616
2755872
2756128
2756384
2756640
2756896
2757152
2757408
2757664
2757920
2758176
2758432
2758688
2758944
2759200
2759456
2759712
2759968
2760224
2760480
2752801
2753057
2753313
2753569
2753825
2754081
2754337
2754593
2754849
2755105
2755361
2755617
2755873
2756129
2756385
2756641
2756897
2757153
2757409
2757665
2757921
2758177
2758433
2758689
2758945
2759201
2759457
2759713
2759969
2760225
2760481
2752802
2753058
2753314
2753570
2753826
2754082
2754338
2754594
2754850
2755106
2755362
2755618
2755874
2756130
2756386
2756642
2756898
2757154
2757410
2757666
2757922
2758178
2758434
2758690
2758946
2759202
2759458
2759714
2759970
2760226
2760482
2752803
2753059
2753315
2753571
2753827
2754083
2754339
2754595
2754851
2755107
2755363
2755619
2755875
2756131
2756387
2756643
2756899
2757155
2757411
2757667
2757923
2758179
2758435
2758691
2758947
2759203
2759459
2759715
2759971
2760227
2760483
2752804
2753060
2753316
2753572
2753828
2754084
2754340
2754596
2754852
2755108
2755364
2755620
2755876
2756132
2756388
2756644
2756900
2757156
2757412
2757668
2757924
2758180
2758436
2758692
2758948
2759204
2759460
2759716
2759972
2760228
2760484
2752805
2753061
2753317
2753573
2753829
2754085
2754341
2754597
2754853
2755109
2755365
2755621
2755877
2756133
2756389
2756645
2756901
2757157
2757413
2757669
2757925
2758181
2758437
2758693
2758949
2759205
2759461
2759717
2759973
2760229
2760485
2752806
2753062
2753318
2753574
2753830
2754086
2754342
2754598
2754854
2755110
2755366
2755622
2755878
2756134
2756390
2756646
2756902
2757158
2757414
2757670
2757926
2758182
2758438
2758694
2758950
2759206
2759462
2759718
2759974
2760230
2760486
2752807
2753063
2753319
2753575
2753831
2754087
2754343
2754599
2754855
2755111
2755367
2755623
2755879
2756135
2756391
2756647
2756903
2757159
2757415
2757671
2757927
2758183
2758439
2758695
2758951
2759207
2759463
2759719
2759975
2760231
2760487
2752808
2753064
2753320
2753576
2753832
2754088
2754344
2754600
2754856
2755112
2755368
2755624
2755880
2756136
2756392
2756648
2756904
2757160
2757416
2757672
2757928
2758184
2758440
2758696
2758952
2759208
2759464
2759720
2759976
2760232
2760488
2752809
2753065
2753321
2753577
2753833
2754089
2754345
2754601
2754857
2755113
2755369
2755625
2755881
2756137
2756393
2756649
2756905
2757161
2757417
2757673
2757929
2758185
2758441
2758697
2758953
2759209
2759465
2759721
2759977
2760233
2760489
2752810
2753066
2753322
2753578
2753834
2754090
2754346
2754602
2754858
2755114
2755370
2755626
2755882
2756138
2756394
2756650
2756906
2757162
2757418
2757674
2757930
2758186
2758442
2758698
2758954
2759210
2759466
2759722
2759978
2760234
2760490
2752811
2753067
2753323
2753579
2753835
2754091
2754347
2754603
2754859
2755115
2755371
2755627
2755883
2756139
2756395
2756651
2756907
2757163
2757419
2757675
2757931
2758187
2758443
2758699
2758955
2759211
2759467
2759723
2759979
2760235
2760491
2752812
2753068
2753324
2753580
2753836
2754092
2754348
2754604
2754860
2755116
2755372
2755628
2755884
2756140
2756396
2756652
2756908
2757164
2757420
2757676
2757932
2758188
2758444
2758700
2758956
2759212
2759468
2759724
2759980
2760236
2760492
2752813
2753069
2753325
2753581
2753837
2754093
2754349
2754605
2754861
2755117
2755373
2755629
2755885
2756141
2756397
2756653
2756909
2757165
2757421
2757677
2757933
2758189
2758445
2758701
2758957
2759213
2759469
2759725
2759981
2760237
2760493
2752814
2753070
2753326
2753582
2753838
2754094
2754350
2754606
2754862
2755118
2755374
2755630
2755886
2756142
2756398
2756654
2756910
2757166
2757422
2757678
2757934
2758190
2758446
2758702
2758958
2759214
2759470
2759726
2759982
2760238
2760494
2752815
2753071
2753327
2753583
2753839
2754095
2754351
2754607
2754863
2755119
2755375
2755631
2755887
2756143
2756399
2756655
2756911
2757167
2757423
2757679
2757935
2758191
2758447
2758703
2758959
2759215
2759471
2759727
2759983
2760239
2760495
2752816
2753072
2753328
2753584
2753840
2754096
2754352
2754608
2754864
2755120
2755376
2755632
2755888
2756144
2756400
2756656
2756912
2757168
2757424
2757680
2757936
2758192
2758448
2758704
2758960
2759216
2759472
2759728
2759984
2760240
2760496
2752817
2753073
2753329
2753585
2753841
2754097
2754353
2754609
2754865
2755121
2755377
2755633
2755889
2756145
2756401
2756657
2756913
2757169
2757425
2757681
2757937
2758193
2758449
2758705
2758961
2759217
2759473
2759729
2759985
2760241
2760497
2752818
2753074
2753330
2753586
2753842
2754098
2754354
2754610
2754866
2755122
2755378
2755634
2755890
2756146
2756402
2756658
2756914
2757170
2757426
2757682
2757938
2758194
2758450
2758706
2758962
2759218
2759474
2759730
2759986
2760242
2760498
2752819
2753075
2753331
2753587
2753843
2754099
2754355
2754611
2754867
2755123
2755379
2755635
2755891
2756147
2756403
2756659
2756915
2757171
2757427
2757683
2757939
2758195
2758451
2758707
2758963
2759219
2759475
2759731
2759987
2760243
2760499
2752820
2753076
2753332
2753588
2753844
2754100
2754356
2754612
2754868
2755124
2755380
2755636
2755892
2756148
2756404
2756660
2756916
2757172
2757428
2757684
2757940
2758196
2758452
2758708
2758964
2759220
2759476
2759732
2759988
2760244
2760500
2752821
2753077
2753333
2753589
2753845
2754101
2754357
2754613
2754869
2755125
2755381
2755637
2755893
2756149
2756405
2756661
2756917
2757173
2757429
2757685
2757941
2758197
2758453
2758709
2758965
2759221
2759477
2759733
2759989
2760245
2760501
2752822
2753078
2753334
2753590
2753846
2754102
2754358
2754614
2754870
2755126
2755382
2755638
2755894
2756150
2756406
2756662
2756918
2757174
2757430
2757686
2757942
2758198
2758454
2758710
2758966
2759222
2759478
2759734
2759990
2760246
2760502
2752823
2753079
2753335
2753591
2753847
2754103
2754359
2754615
2754871
2755127
2755383
2755639
2755895
2756151
2756407
2756663
2756919
2757175
2757431
2757687
2757943
2758199
2758455
2758711
2758967
2759223
2759479
2759735
2759991
2760247
2760503
2752824
2753080
2753336
2753592
2753848
2754104
2754360
2754616
2754872
2755128
2755384
2755640
2755896
2756152
2756408
2756664
2756920
2757176
2757432
2757688
2757944
2758200
2758456
2758712
2758968
2759224
2759480
2759736
2759992
2760248
2760504
2752825
2753081
2753337
2753593
2753849
2754105
2754361
2754617
2754873
2755129
2755385
2755641
2755897
2756153
2756409
2756665
2756921
2757177
2757433
2757689
2757945
2758201
2758457
2758713
2758969
2759225
2759481
2759737
2759993
2760249
2760505
2752826
2753082
2753338
2753594
2753850
2754106
2754362
2754618
2754874
2755130
2755386
2755642
2755898
2756154
2756410
2756666
2756922
2757178
2757434
2757690
2757946
2758202
2758458
2758714
2758970
2759226
2759482
2759738
2759994
2760250
2760506
2752827
2753083
2753339
2753595
2753851
2754107
2754363
2754619
2754875
2755131
2755387
2755643
2755899
2756155
2756411
2756667
2756923
2757179
2757435
2757691
2757947
2758203
2758459
2758715
2758971
2759227
2759483
2759739
2759995
2760251
2760507
2752828
2753084
2753340
2753596
2753852
2754108
2754364
2754620
2754876
2755132
2755388
2755644
2755900
2756156
2756412
2756668
2756924
2757180
2757436
2757692
2757948
2758204
2758460
2758716
2758972
2759228
2759484
2759740
2759996
2760252
2760508
2752829
2753085
2753341
2753597
2753853
2754109
2754365
2754621
2754877
2755133
2755389
2755645
2755901
2756157
2756413
2756669
2756925
2757181
2757437
2757693
2757949
2758205
2758461
2758717
2758973
2759229
2759485
2759741
2759997
2760253
2760509
2752830
2753086
2753342
2753598
2753854
2754110
2754366
2754622
2754878
2755134
2755390
2755646
2755902
2756158
2756414
2756670
2756926
2757182
2757438
2757694
2757950
2758206
2758462
2758718
2758974
2759230
2759486
2759742
2759998
2760254
2760510
2752831
2753087
2753343
2753599
2753855
2754111
2754367
2754623
2754879
2755135
2755391
2755647
2755903
2756159
2756415
2756671
2756927
2757183
2757439
2757695
2757951
2758207
2758463
2758719
2758975
2759231
2759487
2759743
2759999
2760255
2760511
2752832
2753088
2753344
2753600
2753856
2754112
2754368
2754624
2754880
2755136
2755392
2755648
2755904
2756160
2756416
2756672
2756928
2757184
2757440
2757696
2757952
2758208
2758464
2758720
2758976
2759232
2759488
2759744
2760000
2760256
2760512
2752833
2753089
2753345
2753601
2753857
2754113
2754369
2754625
2754881
2755137
2755393
2755649
2755905
2756161
2756417
2756673
2756929
2757185
2757441
2757697
2757953
2758209
2758465
2758721
2758977
2759233
2759489
2759745
2760001
2760257
2760513
2752834
2753090
2753346
2753602
2753858
2754114
2754370
2754626
2754882
2755138
2755394
2755650
2755906
2756162
2756418
2756674
2756930
2757186
2757442
2757698
2757954
2758210
2758466
2758722
2758978
2759234
2759490
2759746
2760002
2760258
2760514
2752835
2753091
2753347
2753603
2753859
2754115
2754371
2754627
2754883
2755139
2755395
2755651
2755907
2756163
2756419
2756675
2756931
2757187
2757443
2757699
2757955
2758211
2758467
2758723
2758979
2759235
2759491
2759747
2760003
2760259
2760515
2752836
2753092
2753348
2753604
2753860
2754116
2754372
2754628
2754884
2755140
2755396
2755652
2755908
2756164
2756420
2756676
2756932
2757188
2757444
2757700
2757956
2758212
2758468
2758724
2758980
2759236
2759492
2759748
2760004
2760260
2760516
2752837
2753093
2753349
2753605
2753861
2754117
2754373
2754629
2754885
2755141
2755397
2755653
2755909
2756165
2756421
2756677
2756933
2757189
2757445
2757701
2757957
2758213
2758469
2758725
2758981
2759237
2759493
2759749
2760005
2760261
2760517
2752838
2753094
2753350
2753606
2753862
2754118
2754374
2754630
2754886
2755142
2755398
2755654
2755910
2756166
2756422
2756678
2756934
2757190
2757446
2757702
2757958
2758214
2758470
2758726
2758982
2759238
2759494
2759750
2760006
2760262
2760518
2752839
2753095
2753351
2753607
2753863
2754119
2754375
2754631
2754887
2755143
2755399
2755655
2755911
2756167
2756423
2756679
2756935
2757191
2757447
2757703
2757959
2758215
2758471
2758727
2758983
2759239
2759495
2759751
2760007
2760263
2760519
2752840
2753096
2753352
2753608
2753864
2754120
2754376
2754632
2754888
2755144
2755400
2755656
2755912
2756168
2756424
2756680
2756936
2757192
2757448
2757704
2757960
2758216
2758472
2758728
2758984
2759240
2759496
2759752
2760008
2760264
2760520
2752841
2753097
2753353
2753609
2753865
2754121
2754377
2754633
2754889
2755145
2755401
2755657
2755913
2756169
2756425
2756681
2756937
2757193
2757449
2757705
2757961
2758217
2758473
2758729
2758985
2759241
2759497
2759753
2760009
2760265
2760521
2752842
2753098
2753354
2753610
2753866
2754122
2754378
2754634
2754890
2755146
2755402
2755658
2755914
2756170
2756426
2756682
2756938
2757194
2757450
2757706
2757962
2758218
2758474
2758730
2758986
2759242
2759498
2759754
2760010
2760266
2760522
2752843
2753099
2753355
2753611
2753867
2754123
2754379
2754635
2754891
2755147
2755403
2755659
2755915
2756171
2756427
2756683
2756939
2757195
2757451
2757707
2757963
2758219
2758475
2758731
2758987
2759243
2759499
2759755
2760011
2760267
2760523
2752844
2753100
2753356
2753612
2753868
2754124
2754380
2754636
2754892
2755148
2755404
2755660
2755916
2756172
2756428
2756684
2756940
2757196
2757452
2757708
2757964
2758220
2758476
2758732
2758988
2759244
2759500
2759756
2760012
2760268
2760524
2752845
2753101
2753357
2753613
2753869
2754125
2754381
2754637
2754893
2755149
2755405
2755661
2755917
2756173
2756429
2756685
2756941
2757197
2757453
2757709
2757965
2758221
2758477
2758733
2758989
2759245
2759501
2759757
2760013
2760269
2760525
2752846
2753102
2753358
2753614
2753870
2754126
2754382
2754638
2754894
2755150
2755406
2755662
2755918
2756174
2756430
2756686
2756942
2757198
2757454
2757710
2757966
2758222
2758478
2758734
2758990
2759246
2759502
2759758
2760014
2760270
2760526
2752847
2753103
2753359
2753615
2753871
2754127
2754383
2754639
2754895
2755151
2755407
2755663
2755919
2756175
2756431
2756687
2756943
2757199
2757455
2757711
2757967
2758223
2758479
2758735
2758991
2759247
2759503
2759759
2760015
2760271
2760527
2752848
2753104
2753360
2753616
2753872
2754128
2754384
2754640
2754896
2755152
2755408
2755664
2755920
2756176
2756432
2756688
2756944
2757200
2757456
2757712
2757968
2758224
2758480
2758736
2758992
2759248
2759504
2759760
2760016
2760272
2760528
2752849
2753105
2753361
2753617
2753873
2754129
2754385
2754641
2754897
2755153
2755409
2755665
2755921
2756177
2756433
2756689
2756945
2757201
2757457
2757713
2757969
2758225
2758481
2758737
2758993
2759249
2759505
2759761
2760017
2760273
2760529
2752850
2753106
2753362
2753618
2753874
2754130
2754386
2754642
2754898
2755154
2755410
2755666
2755922
2756178
2756434
2756690
2756946
2757202
2757458
2757714
2757970
2758226
2758482
2758738
2758994
2759250
2759506
2759762
2760018
2760274
2760530
2752851
2753107
2753363
2753619
2753875
2754131
2754387
2754643
2754899
2755155
2755411
2755667
2755923
2756179
2756435
2756691
2756947
2757203
2757459
2757715
2757971
2758227
2758483
2758739
2758995
2759251
2759507
2759763
2760019
2760275
2760531
2752852
2753108
2753364
2753620
2753876
2754132
2754388
2754644
2754900
2755156
2755412
2755668
2755924
2756180
2756436
2756692
2756948
2757204
2757460
2757716
2757972
2758228
2758484
2758740
2758996
2759252
2759508
2759764
2760020
2760276
2760532
2752853
2753109
2753365
2753621
2753877
2754133
2754389
2754645
2754901
2755157
2755413
2755669
2755925
2756181
2756437
2756693
2756949
2757205
2757461
2757717
2757973
2758229
2758485
2758741
2758997
2759253
2759509
2759765
2760021
2760277
2760533
2752854
2753110
2753366
2753622
2753878
2754134
2754390
2754646
2754902
2755158
2755414
2755670
2755926
2756182
2756438
2756694
2756950
2757206
2757462
2757718
2757974
2758230
2758486
2758742
2758998
2759254
2759510
2759766
2760022
2760278
2760534
2752855
2753111
2753367
2753623
2753879
2754135
2754391
2754647
2754903
2755159
2755415
2755671
2755927
2756183
2756439
2756695
2756951
2757207
2757463
2757719
2757975
2758231
2758487
2758743
2758999
2759255
2759511
2759767
2760023
2760279
2760535
2752856
2753112
2753368
2753624
2753880
2754136
2754392
2754648
2754904
2755160
2755416
2755672
2755928
2756184
2756440
2756696
2756952
2757208
2757464
2757720
2757976
2758232
2758488
2758744
2759000
2759256
2759512
2759768
2760024
2760280
2760536
2752857
2753113
2753369
2753625
2753881
2754137
2754393
2754649
2754905
2755161
2755417
2755673
2755929
2756185
2756441
2756697
2756953
2757209
2757465
2757721
2757977
2758233
2758489
2758745
2759001
2759257
2759513
2759769
2760025
2760281
2760537
2752858
2753114
2753370
2753626
2753882
2754138
2754394
2754650
2754906
2755162
2755418
2755674
2755930
2756186
2756442
2756698
2756954
2757210
2757466
2757722
2757978
2758234
2758490
2758746
2759002
2759258
2759514
2759770
2760026
2760282
2760538
2752859
2753115
2753371
2753627
2753883
2754139
2754395
2754651
2754907
2755163
2755419
2755675
2755931
2756187
2756443
2756699
2756955
2757211
2757467
2757723
2757979
2758235
2758491
2758747
2759003
2759259
2759515
2759771
2760027
2760283
2760539
2752860
2753116
2753372
2753628
2753884
2754140
2754396
2754652
2754908
2755164
2755420
2755676
2755932
2756188
2756444
2756700
2756956
2757212
2757468
2757724
2757980
2758236
2758492
2758748
2759004
2759260
2759516
2759772
2760028
2760284
2760540
2752861
2753117
2753373
2753629
2753885
2754141
2754397
2754653
2754909
2755165
2755421
2755677
2755933
2756189
2756445
2756701
2756957
2757213
2757469
2757725
2757981
2758237
2758493
2758749
2759005
2759261
2759517
2759773
2760029
2760285
2760541
2752862
2753118
2753374
2753630
2753886
2754142
2754398
2754654
2754910
2755166
2755422
2755678
2755934
2756190
2756446
2756702
2756958
2757214
2757470
2757726
2757982
2758238
2758494
2758750
2759006
2759262
2759518
2759774
2760030
2760286
2760542
2752863
2753119
2753375
2753631
2753887
2754143
2754399
2754655
2754911
2755167
2755423
2755679
2755935
2756191
2756447
2756703
2756959
2757215
2757471
2757727
2757983
2758239
2758495
2758751
2759007
2759263
2759519
2759775
2760031
2760287
2760543
