1976408
1976664
1976920
1977176
1977432
1977688
1977944
1978200
1976409
1976665
1976921
1977177
1977433
1977689
1977945
1978201
1976410
1976666
1976922
1977178
1977434
1977690
1977946
1978202
1976411
1976667
1976923
1977179
1977435
1977691
1977947
1978203
1976412
1976668
1976924
1977180
1977436
1977692
1977948
1978204
1976413
1976669
1976925
1977181
1977437
1977693
1977949
1978205
1976414
1976670
1976926
1977182
1977438
1977694
1977950
1978206
1976415
1976671
1976927
1977183
1977439
1977695
1977951
1978207
