210177
210945
404025
601135
863040
1255971
1255206
1259564
1387567
1522735
1583139
1583396
1583398
1583654
1583911
1585707
1653808
1779751
1846843
2762035
2764349
2764606
2897198
3029039
3029040
3090737
3090738
3090997
3091255
