0 0 0.749999977648 1.0 1.33333337307
0 1 41.8008290077 0.00704784598202 3.39436626434
0 2 1.0 1.0 1.0
1 0 0.749999977648 1.0 1.33333337307
1 1 0.657000756734 0.882088780403 1.72552728653
1 2 1.0 0.0 0.0
2 0 0.428571443168 1.0 2.33333325386
2 1 0.754047159049 0.845825493336 1.56790852547
2 2 1.0 1.0 1.0
3 0 1.0 0.75 1.33333337307
3 1 0.71539841469 0.860718309879 1.62401866913
3 2 4.0 0.25 1.0
4 0 0.749999977648 0.666666686535 2.0
4 1 0.872563477044 0.734809398651 1.55965411663
4 2 0.749999977648 1.0 1.33333337307
5 0 1.0 0.0 0.0
5 1 0.685162424326 0.83539223671 1.74709308147
5 2 0.749999977648 1.0 1.33333337307
6 0 1.0 0.5 2.0
6 1 0.665036172396 0.812813103199 1.84996724129
6 2 2.0 0.5 1.0
7 0 0.749999977648 0.666666686535 2.0
7 1 0.780275093076 0.753439366817 1.70099854469
7 2 0.749999977648 1.0 1.33333337307
8 0 0.749999977648 0.666666686535 2.0
8 1 0.413458569801 0.941019654274 2.57021427155
8 2 2.0 0.5 1.0
9 0 0.571428571429 0.75 2.33333325386
9 1 0.858350506603 0.758474588394 1.5360108614
9 2 0.5 1.0 2.0
10 0 0.666666666667 1.0 1.5
10 1 0.718972988785 0.813120365143 1.71053743362
10 2 2.0 0.5 1.0
11 0 0.571428571429 1.0 1.75
11 1 0.744084390156 0.80297267437 1.67369782925
11 2 1.0 0.5 2.0
12 0 0.8 0.75 1.66666662693
12 1 1.20005916887 0.588039457798 1.41706860065
12 2 0.666666666667 1.0 1.5
13 0 0.444444444444 1.0 2.25
13 1 0.760403920347 0.823205888271 1.59752321243
13 2 2.0 0.5 1.0
14 0 0.363636363636 1.0 2.75
14 1 0.933936362216 0.714600980282 1.49837017059
14 2 0.333333333333 1.0 3.0
15 0 0.666666666667 0.75 2.0
15 1 1.96483187125 0.360867142677 1.41035115719
15 2 1.0 0.5 2.0
16 0 1.0 0.75 1.33333337307
16 1 0.569038272241 0.890173435211 1.97416710854
16 2 0.5 1.0 2.0
17 0 0.5 1.0 2.0
17 1 0.629311706825 0.871980965137 1.82233071327
17 2 1.0 1.0 1.0
18 0 0.8 1.0 1.25
18 1 0.954880064692 0.7039321661 1.48771715164
18 2 1.0 0.5 2.0
19 0 0.666666666667 1.0 1.5
19 1 0.889033399925 0.738664090633 1.52277231216
19 2 1.0 0.666666686535 1.5
20 0 0.666666666667 1.0 1.5
20 1 0.763939148661 0.814873278141 1.60639071465
20 2 1.0 1.0 1.0
21 0 0.571428571429 1.0 1.75
21 1 0.537100361274 0.911672532558 2.04223489761
21 2 1.0 0.666666686535 1.5
22 0 0.5 1.0 2.0
22 1 0.528992862519 0.927115380764 2.03899598122
22 2 1.0 0.0 0.0
23 0 0.5 1.0 2.0
23 1 0.645100334362 0.881789505482 1.75795531273
23 2 0.428571443168 1.0 2.33333325386
24 0 1.0 1.0 1.0
24 1 0.704168622899 0.819038033485 1.73388087749
24 2 1.0 1.0 1.0
25 0 1.33333333333 0.5 1.5
25 1 0.679227799553 0.89611518383 1.64293622971
25 2 1.0 1.0 1.0
26 0 0.749999977648 0.666666686535 2.0
26 1 1.0 0.0 0.0
26 2 0.749999977648 1.0 1.33333337307
27 0 1.0 1.0 1.0
27 1 0.789854364914 0.775522828102 1.63251960278
27 2 0.749999977648 1.0 1.33333337307
28 0 1.0 1.0 1.0
28 1 0.836041584174 0.783335983753 1.52694737911
28 2 1.0 0.666666686535 1.5
29 0 0.600000014305 1.0 1.66666662693
29 1 0.706399279505 0.882249891758 1.60456800461
29 2 0.214285721584 1.0 4.66666650772
30 0 1.4999999553 0.666666686535 1.0
30 1 0.371367334032 0.963545024395 2.79463005066
30 2 1.0 0.666666686535 1.5
31 0 0.666666666667 1.0 1.5
31 1 0.229877175344 0.976266145706 4.45590496063
31 2 0.749999977648 1.0 1.33333337307
32 0 1.0 0.0 0.0
32 1 0.689498469783 0.8678201437 1.67123281956
32 2 1.0 1.0 1.0
33 0 0.5 1.0 2.0
33 1 0.680583763542 0.903598725796 1.62608337402
33 2 0.214285721584 1.0 4.66666650772
34 0 0.600000014305 1.0 1.66666662693
34 1 0.900168967969 0.777682960033 1.4284774065
34 2 0.666666666667 1.0 1.5
35 0 1.0 0.0 0.0
35 1 1.05938370009 0.664794027805 1.41990613937
35 2 0.666666666667 1.0 1.5
36 0 0.571428571429 0.75 2.33333325386
36 1 24.4837905241 0.0099816666916 4.09183692932
36 2 1.0 0.0 0.0
37 0 1.0 0.666666686535 1.5
37 1 0.940746464326 0.748193621635 1.42073619366
37 2 0.666666666667 1.0 1.5
38 0 1.0 0.0 0.0
38 1 0.384409749259 0.943747699261 2.75644731522
38 2 1.0 1.0 1.0
39 0 1.0 0.0 0.0
39 1 0.655316738856 0.914138317108 1.66930937767
39 2 1.0 0.0 0.0
40 0 1.0 0.0 0.0
40 1 0.829117426562 0.780891358852 1.54451930523
40 2 1.0 1.0 1.0
41 0 2.0 0.5 1.0
41 1 0.654762682512 0.915636658669 1.6679879427
41 2 1.0 0.5 2.0
42 0 1.0 0.0 0.0
42 1 0.482112054077 0.931066930294 2.2277739048
42 2 1.0 1.0 1.0
43 0 1.0 1.0 1.0
43 1 0.677865341159 0.838448345661 1.75946342945
43 2 0.666666666667 0.5 3.0
44 0 0.555555570273 0.800000011921 2.25
44 1 0.739666623931 0.812146306038 1.66467583179
44 2 1.0 1.0 1.0
45 0 0.666666666667 1.0 1.5
45 1 0.747926344402 0.824461340904 1.62170124054
45 2 2.99999991059 0.333333343267 1.0
46 0 0.555555570273 1.0 1.79999995232
46 1 0.669853109337 0.885369539261 1.68614864349
46 2 0.571428571429 1.0 1.75
47 0 1.0 0.75 1.33333337307
47 1 1.72521451276 0.448830574751 1.29144072533
47 2 0.666666666667 1.0 1.5
48 0 0.444444444444 1.0 2.25
48 1 0.676737885451 0.806610822678 1.83195793629
48 2 0.624999990687 0.800000011921 2.0
49 0 1.0 0.75 1.33333337307
49 1 0.965067724713 0.647109687328 1.60126900673
49 2 0.666666666667 0.75 2.0
50 0 0.666666666667 1.0 1.5
50 1 0.953080545943 0.694513499737 1.51073980331
50 2 0.5 0.666666686535 3.0
51 0 0.363636363636 1.0 2.75
51 1 0.552196930171 0.939589440823 1.92738246918
51 2 1.0 0.5 2.0
52 0 1.0 0.75 1.33333337307
52 1 0.579268950382 0.86287933588 2.00064325333
52 2 1.0 0.25 4.0
53 0 1.0 0.0 0.0
53 1 1.0 0.0 0.0
53 2 1.0 0.0 0.0
