1589248
1589504
1589760
1590016
1590272
1590528
1590784
1591040
1591296
1591552
1591808
1592064
1592320
1592576
1592832
1593088
1593344
1593600
1593856
1594112
1594368
1594624
1594880
1595136
1595392
1595648
1595904
1596160
1596416
1596672
1596928
1597184
1589249
1589505
1589761
1590017
1590273
1590529
1590785
1591041
1591297
1591553
1591809
1592065
1592321
1592577
1592833
1593089
1593345
1593601
1593857
1594113
1594369
1594625
1594881
1595137
1595393
1595649
1595905
1596161
1596417
1596673
1596929
1597185
1589250
1589506
1589762
1590018
1590274
1590530
1590786
1591042
1591298
1591554
1591810
1592066
1592322
1592578
1592834
1593090
1593346
1593602
1593858
1594114
1594370
1594626
1594882
1595138
1595394
1595650
1595906
1596162
1596418
1596674
1596930
1597186
1589251
1589507
1589763
1590019
1590275
1590531
1590787
1591043
1591299
1591555
1591811
1592067
1592323
1592579
1592835
1593091
1593347
1593603
1593859
1594115
1594371
1594627
1594883
1595139
1595395
1595651
1595907
1596163
1596419
1596675
1596931
1597187
1589252
1589508
1589764
1590020
1590276
1590532
1590788
1591044
1591300
1591556
1591812
1592068
1592324
1592580
1592836
1593092
1593348
1593604
1593860
1594116
1594372
1594628
1594884
1595140
1595396
1595652
1595908
1596164
1596420
1596676
1596932
1597188
1589253
1589509
1589765
1590021
1590277
1590533
1590789
1591045
1591301
1591557
1591813
1592069
1592325
1592581
1592837
1593093
1593349
1593605
1593861
1594117
1594373
1594629
1594885
1595141
1595397
1595653
1595909
1596165
1596421
1596677
1596933
1597189
1589254
1589510
1589766
1590022
1590278
1590534
1590790
1591046
1591302
1591558
1591814
1592070
1592326
1592582
1592838
1593094
1593350
1593606
1593862
1594118
1594374
1594630
1594886
1595142
1595398
1595654
1595910
1596166
1596422
1596678
1596934
1597190
1589255
1589511
1589767
1590023
1590279
1590535
1590791
1591047
1591303
1591559
1591815
1592071
1592327
1592583
1592839
1593095
1593351
1593607
1593863
1594119
1594375
1594631
1594887
1595143
1595399
1595655
1595911
1596167
1596423
1596679
1596935
1597191
1589256
1589512
1589768
1590024
1590280
1590536
1590792
1591048
1591304
1591560
1591816
1592072
1592328
1592584
1592840
1593096
1593352
1593608
1593864
1594120
1594376
1594632
1594888
1595144
1595400
1595656
1595912
1596168
1596424
1596680
1596936
1597192
1589257
1589513
1589769
1590025
1590281
1590537
1590793
1591049
1591305
1591561
1591817
1592073
1592329
1592585
1592841
1593097
1593353
1593609
1593865
1594121
1594377
1594633
1594889
1595145
1595401
1595657
1595913
1596169
1596425
1596681
1596937
1597193
1589258
1589514
1589770
1590026
1590282
1590538
1590794
1591050
1591306
1591562
1591818
1592074
1592330
1592586
1592842
1593098
1593354
1593610
1593866
1594122
1594378
1594634
1594890
1595146
1595402
1595658
1595914
1596170
1596426
1596682
1596938
1597194
1589259
1589515
1589771
1590027
1590283
1590539
1590795
1591051
1591307
1591563
1591819
1592075
1592331
1592587
1592843
1593099
1593355
1593611
1593867
1594123
1594379
1594635
1594891
1595147
1595403
1595659
1595915
1596171
1596427
1596683
1596939
1597195
1589260
1589516
1589772
1590028
1590284
1590540
1590796
1591052
1591308
1591564
1591820
1592076
1592332
1592588
1592844
1593100
1593356
1593612
1593868
1594124
1594380
1594636
1594892
1595148
1595404
1595660
1595916
1596172
1596428
1596684
1596940
1597196
1589261
1589517
1589773
1590029
1590285
1590541
1590797
1591053
1591309
1591565
1591821
1592077
1592333
1592589
1592845
1593101
1593357
1593613
1593869
1594125
1594381
1594637
1594893
1595149
1595405
1595661
1595917
1596173
1596429
1596685
1596941
1597197
1589262
1589518
1589774
1590030
1590286
1590542
1590798
1591054
1591310
1591566
1591822
1592078
1592334
1592590
1592846
1593102
1593358
1593614
1593870
1594126
1594382
1594638
1594894
1595150
1595406
1595662
1595918
1596174
1596430
1596686
1596942
1597198
1589263
1589519
1589775
1590031
1590287
1590543
1590799
1591055
1591311
1591567
1591823
1592079
1592335
1592591
1592847
1593103
1593359
1593615
1593871
1594127
1594383
1594639
1594895
1595151
1595407
1595663
1595919
1596175
1596431
1596687
1596943
1597199
1589264
1589520
1589776
1590032
1590288
1590544
1590800
1591056
1591312
1591568
1591824
1592080
1592336
1592592
1592848
1593104
1593360
1593616
1593872
1594128
1594384
1594640
1594896
1595152
1595408
1595664
1595920
1596176
1596432
1596688
1596944
1597200
1589265
1589521
1589777
1590033
1590289
1590545
1590801
1591057
1591313
1591569
1591825
1592081
1592337
1592593
1592849
1593105
1593361
1593617
1593873
1594129
1594385
1594641
1594897
1595153
1595409
1595665
1595921
1596177
1596433
1596689
1596945
1597201
1589266
1589522
1589778
1590034
1590290
1590546
1590802
1591058
1591314
1591570
1591826
1592082
1592338
1592594
1592850
1593106
1593362
1593618
1593874
1594130
1594386
1594642
1594898
1595154
1595410
1595666
1595922
1596178
1596434
1596690
1596946
1597202
1589267
1589523
1589779
1590035
1590291
1590547
1590803
1591059
1591315
1591571
1591827
1592083
1592339
1592595
1592851
1593107
1593363
1593619
1593875
1594131
1594387
1594643
1594899
1595155
1595411
1595667
1595923
1596179
1596435
1596691
1596947
1597203
1589268
1589524
1589780
1590036
1590292
1590548
1590804
1591060
1591316
1591572
1591828
1592084
1592340
1592596
1592852
1593108
1593364
1593620
1593876
1594132
1594388
1594644
1594900
1595156
1595412
1595668
1595924
1596180
1596436
1596692
1596948
1597204
1589269
1589525
1589781
1590037
1590293
1590549
1590805
1591061
1591317
1591573
1591829
1592085
1592341
1592597
1592853
1593109
1593365
1593621
1593877
1594133
1594389
1594645
1594901
1595157
1595413
1595669
1595925
1596181
1596437
1596693
1596949
1597205
1589270
1589526
1589782
1590038
1590294
1590550
1590806
1591062
1591318
1591574
1591830
1592086
1592342
1592598
1592854
1593110
1593366
1593622
1593878
1594134
1594390
1594646
1594902
1595158
1595414
1595670
1595926
1596182
1596438
1596694
1596950
1597206
1589271
1589527
1589783
1590039
1590295
1590551
1590807
1591063
1591319
1591575
1591831
1592087
1592343
1592599
1592855
1593111
1593367
1593623
1593879
1594135
1594391
1594647
1594903
1595159
1595415
1595671
1595927
1596183
1596439
1596695
1596951
1597207
1589272
1589528
1589784
1590040
1590296
1590552
1590808
1591064
1591320
1591576
1591832
1592088
1592344
1592600
1592856
1593112
1593368
1593624
1593880
1594136
1594392
1594648
1594904
1595160
1595416
1595672
1595928
1596184
1596440
1596696
1596952
1597208
1589273
1589529
1589785
1590041
1590297
1590553
1590809
1591065
1591321
1591577
1591833
1592089
1592345
1592601
1592857
1593113
1593369
1593625
1593881
1594137
1594393
1594649
1594905
1595161
1595417
1595673
1595929
1596185
1596441
1596697
1596953
1597209
1589274
1589530
1589786
1590042
1590298
1590554
1590810
1591066
1591322
1591578
1591834
1592090
1592346
1592602
1592858
1593114
1593370
1593626
1593882
1594138
1594394
1594650
1594906
1595162
1595418
1595674
1595930
1596186
1596442
1596698
1596954
1597210
1589275
1589531
1589787
1590043
1590299
1590555
1590811
1591067
1591323
1591579
1591835
1592091
1592347
1592603
1592859
1593115
1593371
1593627
1593883
1594139
1594395
1594651
1594907
1595163
1595419
1595675
1595931
1596187
1596443
1596699
1596955
1597211
1589276
1589532
1589788
1590044
1590300
1590556
1590812
1591068
1591324
1591580
1591836
1592092
1592348
1592604
1592860
1593116
1593372
1593628
1593884
1594140
1594396
1594652
1594908
1595164
1595420
1595676
1595932
1596188
1596444
1596700
1596956
1597212
1589277
1589533
1589789
1590045
1590301
1590557
1590813
1591069
1591325
1591581
1591837
1592093
1592349
1592605
1592861
1593117
1593373
1593629
1593885
1594141
1594397
1594653
1594909
1595165
1595421
1595677
1595933
1596189
1596445
1596701
1596957
1597213
1589278
1589534
1589790
1590046
1590302
1590558
1590814
1591070
1591326
1591582
1591838
1592094
1592350
1592606
1592862
1593118
1593374
1593630
1593886
1594142
1594398
1594654
1594910
1595166
1595422
1595678
1595934
1596190
1596446
1596702
1596958
1597214
1589279
1589535
1589791
1590047
1590303
1590559
1590815
1591071
1591327
1591583
1591839
1592095
1592351
1592607
1592863
1593119
1593375
1593631
1593887
1594143
1594399
1594655
1594911
1595167
1595423
1595679
1595935
1596191
1596447
1596703
1596959
1597215
1589280
1589536
1589792
1590048
1590304
1590560
1590816
1591072
1591328
1591584
1591840
1592096
1592352
1592608
1592864
1593120
1593376
1593632
1593888
1594144
1594400
1594656
1594912
1595168
1595424
1595680
1595936
1596192
1596448
1596704
1596960
1597216
1589281
1589537
1589793
1590049
1590305
1590561
1590817
1591073
1591329
1591585
1591841
1592097
1592353
1592609
1592865
1593121
1593377
1593633
1593889
1594145
1594401
1594657
1594913
1595169
1595425
1595681
1595937
1596193
1596449
1596705
1596961
1597217
1589282
1589538
1589794
1590050
1590306
1590562
1590818
1591074
1591330
1591586
1591842
1592098
1592354
1592610
1592866
1593122
1593378
1593634
1593890
1594146
1594402
1594658
1594914
1595170
1595426
1595682
1595938
1596194
1596450
1596706
1596962
1597218
1589283
1589539
1589795
1590051
1590307
1590563
1590819
1591075
1591331
1591587
1591843
1592099
1592355
1592611
1592867
1593123
1593379
1593635
1593891
1594147
1594403
1594659
1594915
1595171
1595427
1595683
1595939
1596195
1596451
1596707
1596963
1597219
1589284
1589540
1589796
1590052
1590308
1590564
1590820
1591076
1591332
1591588
1591844
1592100
1592356
1592612
1592868
1593124
1593380
1593636
1593892
1594148
1594404
1594660
1594916
1595172
1595428
1595684
1595940
1596196
1596452
1596708
1596964
1597220
1589285
1589541
1589797
1590053
1590309
1590565
1590821
1591077
1591333
1591589
1591845
1592101
1592357
1592613
1592869
1593125
1593381
1593637
1593893
1594149
1594405
1594661
1594917
1595173
1595429
1595685
1595941
1596197
1596453
1596709
1596965
1597221
1589286
1589542
1589798
1590054
1590310
1590566
1590822
1591078
1591334
1591590
1591846
1592102
1592358
1592614
1592870
1593126
1593382
1593638
1593894
1594150
1594406
1594662
1594918
1595174
1595430
1595686
1595942
1596198
1596454
1596710
1596966
1597222
1589287
1589543
1589799
1590055
1590311
1590567
1590823
1591079
1591335
1591591
1591847
1592103
1592359
1592615
1592871
1593127
1593383
1593639
1593895
1594151
1594407
1594663
1594919
1595175
1595431
1595687
1595943
1596199
1596455
1596711
1596967
1597223
1589288
1589544
1589800
1590056
1590312
1590568
1590824
1591080
1591336
1591592
1591848
1592104
1592360
1592616
1592872
1593128
1593384
1593640
1593896
1594152
1594408
1594664
1594920
1595176
1595432
1595688
1595944
1596200
1596456
1596712
1596968
1597224
1589289
1589545
1589801
1590057
1590313
1590569
1590825
1591081
1591337
1591593
1591849
1592105
1592361
1592617
1592873
1593129
1593385
1593641
1593897
1594153
1594409
1594665
1594921
1595177
1595433
1595689
1595945
1596201
1596457
1596713
1596969
1597225
1589290
1589546
1589802
1590058
1590314
1590570
1590826
1591082
1591338
1591594
1591850
1592106
1592362
1592618
1592874
1593130
1593386
1593642
1593898
1594154
1594410
1594666
1594922
1595178
1595434
1595690
1595946
1596202
1596458
1596714
1596970
1597226
1589291
1589547
1589803
1590059
1590315
1590571
1590827
1591083
1591339
1591595
1591851
1592107
1592363
1592619
1592875
1593131
1593387
1593643
1593899
1594155
1594411
1594667
1594923
1595179
1595435
1595691
1595947
1596203
1596459
1596715
1596971
1597227
1589292
1589548
1589804
1590060
1590316
1590572
1590828
1591084
1591340
1591596
1591852
1592108
1592364
1592620
1592876
1593132
1593388
1593644
1593900
1594156
1594412
1594668
1594924
1595180
1595436
1595692
1595948
1596204
1596460
1596716
1596972
1597228
1589293
1589549
1589805
1590061
1590317
1590573
1590829
1591085
1591341
1591597
1591853
1592109
1592365
1592621
1592877
1593133
1593389
1593645
1593901
1594157
1594413
1594669
1594925
1595181
1595437
1595693
1595949
1596205
1596461
1596717
1596973
1597229
1589294
1589550
1589806
1590062
1590318
1590574
1590830
1591086
1591342
1591598
1591854
1592110
1592366
1592622
1592878
1593134
1593390
1593646
1593902
1594158
1594414
1594670
1594926
1595182
1595438
1595694
1595950
1596206
1596462
1596718
1596974
1597230
1589295
1589551
1589807
1590063
1590319
1590575
1590831
1591087
1591343
1591599
1591855
1592111
1592367
1592623
1592879
1593135
1593391
1593647
1593903
1594159
1594415
1594671
1594927
1595183
1595439
1595695
1595951
1596207
1596463
1596719
1596975
1597231
1589296
1589552
1589808
1590064
1590320
1590576
1590832
1591088
1591344
1591600
1591856
1592112
1592368
1592624
1592880
1593136
1593392
1593648
1593904
1594160
1594416
1594672
1594928
1595184
1595440
1595696
1595952
1596208
1596464
1596720
1596976
1597232
1589297
1589553
1589809
1590065
1590321
1590577
1590833
1591089
1591345
1591601
1591857
1592113
1592369
1592625
1592881
1593137
1593393
1593649
1593905
1594161
1594417
1594673
1594929
1595185
1595441
1595697
1595953
1596209
1596465
1596721
1596977
1597233
1589298
1589554
1589810
1590066
1590322
1590578
1590834
1591090
1591346
1591602
1591858
1592114
1592370
1592626
1592882
1593138
1593394
1593650
1593906
1594162
1594418
1594674
1594930
1595186
1595442
1595698
1595954
1596210
1596466
1596722
1596978
1597234
1589299
1589555
1589811
1590067
1590323
1590579
1590835
1591091
1591347
1591603
1591859
1592115
1592371
1592627
1592883
1593139
1593395
1593651
1593907
1594163
1594419
1594675
1594931
1595187
1595443
1595699
1595955
1596211
1596467
1596723
1596979
1597235
1589300
1589556
1589812
1590068
1590324
1590580
1590836
1591092
1591348
1591604
1591860
1592116
1592372
1592628
1592884
1593140
1593396
1593652
1593908
1594164
1594420
1594676
1594932
1595188
1595444
1595700
1595956
1596212
1596468
1596724
1596980
1597236
1589301
1589557
1589813
1590069
1590325
1590581
1590837
1591093
1591349
1591605
1591861
1592117
1592373
1592629
1592885
1593141
1593397
1593653
1593909
1594165
1594421
1594677
1594933
1595189
1595445
1595701
1595957
1596213
1596469
1596725
1596981
1597237
1589302
1589558
1589814
1590070
1590326
1590582
1590838
1591094
1591350
1591606
1591862
1592118
1592374
1592630
1592886
1593142
1593398
1593654
1593910
1594166
1594422
1594678
1594934
1595190
1595446
1595702
1595958
1596214
1596470
1596726
1596982
1597238
1589303
1589559
1589815
1590071
1590327
1590583
1590839
1591095
1591351
1591607
1591863
1592119
1592375
1592631
1592887
1593143
1593399
1593655
1593911
1594167
1594423
1594679
1594935
1595191
1595447
1595703
1595959
1596215
1596471
1596727
1596983
1597239
1589304
1589560
1589816
1590072
1590328
1590584
1590840
1591096
1591352
1591608
1591864
1592120
1592376
1592632
1592888
1593144
1593400
1593656
1593912
1594168
1594424
1594680
1594936
1595192
1595448
1595704
1595960
1596216
1596472
1596728
1596984
1597240
1589305
1589561
1589817
1590073
1590329
1590585
1590841
1591097
1591353
1591609
1591865
1592121
1592377
1592633
1592889
1593145
1593401
1593657
1593913
1594169
1594425
1594681
1594937
1595193
1595449
1595705
1595961
1596217
1596473
1596729
1596985
1597241
1589306
1589562
1589818
1590074
1590330
1590586
1590842
1591098
1591354
1591610
1591866
1592122
1592378
1592634
1592890
1593146
1593402
1593658
1593914
1594170
1594426
1594682
1594938
1595194
1595450
1595706
1595962
1596218
1596474
1596730
1596986
1597242
1589307
1589563
1589819
1590075
1590331
1590587
1590843
1591099
1591355
1591611
1591867
1592123
1592379
1592635
1592891
1593147
1593403
1593659
1593915
1594171
1594427
1594683
1594939
1595195
1595451
1595707
1595963
1596219
1596475
1596731
1596987
1597243
1589308
1589564
1589820
1590076
1590332
1590588
1590844
1591100
1591356
1591612
1591868
1592124
1592380
1592636
1592892
1593148
1593404
1593660
1593916
1594172
1594428
1594684
1594940
1595196
1595452
1595708
1595964
1596220
1596476
1596732
1596988
1597244
1589309
1589565
1589821
1590077
1590333
1590589
1590845
1591101
1591357
1591613
1591869
1592125
1592381
1592637
1592893
1593149
1593405
1593661
1593917
1594173
1594429
1594685
1594941
1595197
1595453
1595709
1595965
1596221
1596477
1596733
1596989
1597245
1589310
1589566
1589822
1590078
1590334
1590590
1590846
1591102
1591358
1591614
1591870
1592126
1592382
1592638
1592894
1593150
1593406
1593662
1593918
1594174
1594430
1594686
1594942
1595198
1595454
1595710
1595966
1596222
1596478
1596734
1596990
1597246
1589311
1589567
1589823
1590079
1590335
1590591
1590847
1591103
1591359
1591615
1591871
1592127
1592383
1592639
1592895
1593151
1593407
1593663
1593919
1594175
1594431
1594687
1594943
1595199
1595455
1595711
1595967
1596223
1596479
1596735
1596991
1597247
1589312
1589568
1589824
1590080
1590336
1590592
1590848
1591104
1591360
1591616
1591872
1592128
1592384
1592640
1592896
1593152
1593408
1593664
1593920
1594176
1594432
1594688
1594944
1595200
1595456
1595712
1595968
1596224
1596480
1596736
1596992
1597248
1589313
1589569
1589825
1590081
1590337
1590593
1590849
1591105
1591361
1591617
1591873
1592129
1592385
1592641
1592897
1593153
1593409
1593665
1593921
1594177
1594433
1594689
1594945
1595201
1595457
1595713
1595969
1596225
1596481
1596737
1596993
1597249
1589314
1589570
1589826
1590082
1590338
1590594
1590850
1591106
1591362
1591618
1591874
1592130
1592386
1592642
1592898
1593154
1593410
1593666
1593922
1594178
1594434
1594690
1594946
1595202
1595458
1595714
1595970
1596226
1596482
1596738
1596994
1597250
1589315
1589571
1589827
1590083
1590339
1590595
1590851
1591107
1591363
1591619
1591875
1592131
1592387
1592643
1592899
1593155
1593411
1593667
1593923
1594179
1594435
1594691
1594947
1595203
1595459
1595715
1595971
1596227
1596483
1596739
1596995
1597251
1589316
1589572
1589828
1590084
1590340
1590596
1590852
1591108
1591364
1591620
1591876
1592132
1592388
1592644
1592900
1593156
1593412
1593668
1593924
1594180
1594436
1594692
1594948
1595204
1595460
1595716
1595972
1596228
1596484
1596740
1596996
1597252
1589317
1589573
1589829
1590085
1590341
1590597
1590853
1591109
1591365
1591621
1591877
1592133
1592389
1592645
1592901
1593157
1593413
1593669
1593925
1594181
1594437
1594693
1594949
1595205
1595461
1595717
1595973
1596229
1596485
1596741
1596997
1597253
1589318
1589574
1589830
1590086
1590342
1590598
1590854
1591110
1591366
1591622
1591878
1592134
1592390
1592646
1592902
1593158
1593414
1593670
1593926
1594182
1594438
1594694
1594950
1595206
1595462
1595718
1595974
1596230
1596486
1596742
1596998
1597254
1589319
1589575
1589831
1590087
1590343
1590599
1590855
1591111
1591367
1591623
1591879
1592135
1592391
1592647
1592903
1593159
1593415
1593671
1593927
1594183
1594439
1594695
1594951
1595207
1595463
1595719
1595975
1596231
1596487
1596743
1596999
1597255
1589320
1589576
1589832
1590088
1590344
1590600
1590856
1591112
1591368
1591624
1591880
1592136
1592392
1592648
1592904
1593160
1593416
1593672
1593928
1594184
1594440
1594696
1594952
1595208
1595464
1595720
1595976
1596232
1596488
1596744
1597000
1597256
1589321
1589577
1589833
1590089
1590345
1590601
1590857
1591113
1591369
1591625
1591881
1592137
1592393
1592649
1592905
1593161
1593417
1593673
1593929
1594185
1594441
1594697
1594953
1595209
1595465
1595721
1595977
1596233
1596489
1596745
1597001
1597257
1589322
1589578
1589834
1590090
1590346
1590602
1590858
1591114
1591370
1591626
1591882
1592138
1592394
1592650
1592906
1593162
1593418
1593674
1593930
1594186
1594442
1594698
1594954
1595210
1595466
1595722
1595978
1596234
1596490
1596746
1597002
1597258
1589323
1589579
1589835
1590091
1590347
1590603
1590859
1591115
1591371
1591627
1591883
1592139
1592395
1592651
1592907
1593163
1593419
1593675
1593931
1594187
1594443
1594699
1594955
1595211
1595467
1595723
1595979
1596235
1596491
1596747
1597003
1597259
1589324
1589580
1589836
1590092
1590348
1590604
1590860
1591116
1591372
1591628
1591884
1592140
1592396
1592652
1592908
1593164
1593420
1593676
1593932
1594188
1594444
1594700
1594956
1595212
1595468
1595724
1595980
1596236
1596492
1596748
1597004
1597260
1589325
1589581
1589837
1590093
1590349
1590605
1590861
1591117
1591373
1591629
1591885
1592141
1592397
1592653
1592909
1593165
1593421
1593677
1593933
1594189
1594445
1594701
1594957
1595213
1595469
1595725
1595981
1596237
1596493
1596749
1597005
1597261
1589326
1589582
1589838
1590094
1590350
1590606
1590862
1591118
1591374
1591630
1591886
1592142
1592398
1592654
1592910
1593166
1593422
1593678
1593934
1594190
1594446
1594702
1594958
1595214
1595470
1595726
1595982
1596238
1596494
1596750
1597006
1597262
1589327
1589583
1589839
1590095
1590351
1590607
1590863
1591119
1591375
1591631
1591887
1592143
1592399
1592655
1592911
1593167
1593423
1593679
1593935
1594191
1594447
1594703
1594959
1595215
1595471
1595727
1595983
1596239
1596495
1596751
1597007
1597263
1589328
1589584
1589840
1590096
1590352
1590608
1590864
1591120
1591376
1591632
1591888
1592144
1592400
1592656
1592912
1593168
1593424
1593680
1593936
1594192
1594448
1594704
1594960
1595216
1595472
1595728
1595984
1596240
1596496
1596752
1597008
1597264
1589329
1589585
1589841
1590097
1590353
1590609
1590865
1591121
1591377
1591633
1591889
1592145
1592401
1592657
1592913
1593169
1593425
1593681
1593937
1594193
1594449
1594705
1594961
1595217
1595473
1595729
1595985
1596241
1596497
1596753
1597009
1597265
1589330
1589586
1589842
1590098
1590354
1590610
1590866
1591122
1591378
1591634
1591890
1592146
1592402
1592658
1592914
1593170
1593426
1593682
1593938
1594194
1594450
1594706
1594962
1595218
1595474
1595730
1595986
1596242
1596498
1596754
1597010
1597266
1589331
1589587
1589843
1590099
1590355
1590611
1590867
1591123
1591379
1591635
1591891
1592147
1592403
1592659
1592915
1593171
1593427
1593683
1593939
1594195
1594451
1594707
1594963
1595219
1595475
1595731
1595987
1596243
1596499
1596755
1597011
1597267
1589332
1589588
1589844
1590100
1590356
1590612
1590868
1591124
1591380
1591636
1591892
1592148
1592404
1592660
1592916
1593172
1593428
1593684
1593940
1594196
1594452
1594708
1594964
1595220
1595476
1595732
1595988
1596244
1596500
1596756
1597012
1597268
1589333
1589589
1589845
1590101
1590357
1590613
1590869
1591125
1591381
1591637
1591893
1592149
1592405
1592661
1592917
1593173
1593429
1593685
1593941
1594197
1594453
1594709
1594965
1595221
1595477
1595733
1595989
1596245
1596501
1596757
1597013
1597269
1589334
1589590
1589846
1590102
1590358
1590614
1590870
1591126
1591382
1591638
1591894
1592150
1592406
1592662
1592918
1593174
1593430
1593686
1593942
1594198
1594454
1594710
1594966
1595222
1595478
1595734
1595990
1596246
1596502
1596758
1597014
1597270
1589335
1589591
1589847
1590103
1590359
1590615
1590871
1591127
1591383
1591639
1591895
1592151
1592407
1592663
1592919
1593175
1593431
1593687
1593943
1594199
1594455
1594711
1594967
1595223
1595479
1595735
1595991
1596247
1596503
1596759
1597015
1597271
1589336
1589592
1589848
1590104
1590360
1590616
1590872
1591128
1591384
1591640
1591896
1592152
1592408
1592664
1592920
1593176
1593432
1593688
1593944
1594200
1594456
1594712
1594968
1595224
1595480
1595736
1595992
1596248
1596504
1596760
1597016
1597272
1589337
1589593
1589849
1590105
1590361
1590617
1590873
1591129
1591385
1591641
1591897
1592153
1592409
1592665
1592921
1593177
1593433
1593689
1593945
1594201
1594457
1594713
1594969
1595225
1595481
1595737
1595993
1596249
1596505
1596761
1597017
1597273
1589338
1589594
1589850
1590106
1590362
1590618
1590874
1591130
1591386
1591642
1591898
1592154
1592410
1592666
1592922
1593178
1593434
1593690
1593946
1594202
1594458
1594714
1594970
1595226
1595482
1595738
1595994
1596250
1596506
1596762
1597018
1597274
1589339
1589595
1589851
1590107
1590363
1590619
1590875
1591131
1591387
1591643
1591899
1592155
1592411
1592667
1592923
1593179
1593435
1593691
1593947
1594203
1594459
1594715
1594971
1595227
1595483
1595739
1595995
1596251
1596507
1596763
1597019
1597275
1589340
1589596
1589852
1590108
1590364
1590620
1590876
1591132
1591388
1591644
1591900
1592156
1592412
1592668
1592924
1593180
1593436
1593692
1593948
1594204
1594460
1594716
1594972
1595228
1595484
1595740
1595996
1596252
1596508
1596764
1597020
1597276
1589341
1589597
1589853
1590109
1590365
1590621
1590877
1591133
1591389
1591645
1591901
1592157
1592413
1592669
1592925
1593181
1593437
1593693
1593949
1594205
1594461
1594717
1594973
1595229
1595485
1595741
1595997
1596253
1596509
1596765
1597021
1597277
1589342
1589598
1589854
1590110
1590366
1590622
1590878
1591134
1591390
1591646
1591902
1592158
1592414
1592670
1592926
1593182
1593438
1593694
1593950
1594206
1594462
1594718
1594974
1595230
1595486
1595742
1595998
1596254
1596510
1596766
1597022
1597278
1589343
1589599
1589855
1590111
1590367
1590623
1590879
1591135
1591391
1591647
1591903
1592159
1592415
1592671
1592927
1593183
1593439
1593695
1593951
1594207
1594463
1594719
1594975
1595231
1595487
1595743
1595999
1596255
1596511
1596767
1597023
1597279
2572288
2572544
2572800
2573056
2573312
2573568
2573824
2574080
2574336
2574592
2574848
2575104
2575360
2575616
2575872
2576128
2576384
2576640
2576896
2577152
2577408
2577664
2577920
2578176
2578432
2578688
2578944
2579200
2579456
2579712
2579968
2580224
2572289
2572545
2572801
2573057
2573313
2573569
2573825
2574081
2574337
2574593
2574849
2575105
2575361
2575617
2575873
2576129
2576385
2576641
2576897
2577153
2577409
2577665
2577921
2578177
2578433
2578689
2578945
2579201
2579457
2579713
2579969
2580225
2572290
2572546
2572802
2573058
2573314
2573570
2573826
2574082
2574338
2574594
2574850
2575106
2575362
2575618
2575874
2576130
2576386
2576642
2576898
2577154
2577410
2577666
2577922
2578178
2578434
2578690
2578946
2579202
2579458
2579714
2579970
2580226
2572291
2572547
2572803
2573059
2573315
2573571
2573827
2574083
2574339
2574595
2574851
2575107
2575363
2575619
2575875
2576131
2576387
2576643
2576899
2577155
2577411
2577667
2577923
2578179
2578435
2578691
2578947
2579203
2579459
2579715
2579971
2580227
2572292
2572548
2572804
2573060
2573316
2573572
2573828
2574084
2574340
2574596
2574852
2575108
2575364
2575620
2575876
2576132
2576388
2576644
2576900
2577156
2577412
2577668
2577924
2578180
2578436
2578692
2578948
2579204
2579460
2579716
2579972
2580228
2572293
2572549
2572805
2573061
2573317
2573573
2573829
2574085
2574341
2574597
2574853
2575109
2575365
2575621
2575877
2576133
2576389
2576645
2576901
2577157
2577413
2577669
2577925
2578181
2578437
2578693
2578949
2579205
2579461
2579717
2579973
2580229
2572294
2572550
2572806
2573062
2573318
2573574
2573830
2574086
2574342
2574598
2574854
2575110
2575366
2575622
2575878
2576134
2576390
2576646
2576902
2577158
2577414
2577670
2577926
2578182
2578438
2578694
2578950
2579206
2579462
2579718
2579974
2580230
2572295
2572551
2572807
2573063
2573319
2573575
2573831
2574087
2574343
2574599
2574855
2575111
2575367
2575623
2575879
2576135
2576391
2576647
2576903
2577159
2577415
2577671
2577927
2578183
2578439
2578695
2578951
2579207
2579463
2579719
2579975
2580231
2572296
2572552
2572808
2573064
2573320
2573576
2573832
2574088
2574344
2574600
2574856
2575112
2575368
2575624
2575880
2576136
2576392
2576648
2576904
2577160
2577416
2577672
2577928
2578184
2578440
2578696
2578952
2579208
2579464
2579720
2579976
2580232
2572297
2572553
2572809
2573065
2573321
2573577
2573833
2574089
2574345
2574601
2574857
2575113
2575369
2575625
2575881
2576137
2576393
2576649
2576905
2577161
2577417
2577673
2577929
2578185
2578441
2578697
2578953
2579209
2579465
2579721
2579977
2580233
2572298
2572554
2572810
2573066
2573322
2573578
2573834
2574090
2574346
2574602
2574858
2575114
2575370
2575626
2575882
2576138
2576394
2576650
2576906
2577162
2577418
2577674
2577930
2578186
2578442
2578698
2578954
2579210
2579466
2579722
2579978
2580234
2572299
2572555
2572811
2573067
2573323
2573579
2573835
2574091
2574347
2574603
2574859
2575115
2575371
2575627
2575883
2576139
2576395
2576651
2576907
2577163
2577419
2577675
2577931
2578187
2578443
2578699
2578955
2579211
2579467
2579723
2579979
2580235
2572300
2572556
2572812
2573068
2573324
2573580
2573836
2574092
2574348
2574604
2574860
2575116
2575372
2575628
2575884
2576140
2576396
2576652
2576908
2577164
2577420
2577676
2577932
2578188
2578444
2578700
2578956
2579212
2579468
2579724
2579980
2580236
2572301
2572557
2572813
2573069
2573325
2573581
2573837
2574093
2574349
2574605
2574861
2575117
2575373
2575629
2575885
2576141
2576397
2576653
2576909
2577165
2577421
2577677
2577933
2578189
2578445
2578701
2578957
2579213
2579469
2579725
2579981
2580237
2572302
2572558
2572814
2573070
2573326
2573582
2573838
2574094
2574350
2574606
2574862
2575118
2575374
2575630
2575886
2576142
2576398
2576654
2576910
2577166
2577422
2577678
2577934
2578190
2578446
2578702
2578958
2579214
2579470
2579726
2579982
2580238
2572303
2572559
2572815
2573071
2573327
2573583
2573839
2574095
2574351
2574607
2574863
2575119
2575375
2575631
2575887
2576143
2576399
2576655
2576911
2577167
2577423
2577679
2577935
2578191
2578447
2578703
2578959
2579215
2579471
2579727
2579983
2580239
2572304
2572560
2572816
2573072
2573328
2573584
2573840
2574096
2574352
2574608
2574864
2575120
2575376
2575632
2575888
2576144
2576400
2576656
2576912
2577168
2577424
2577680
2577936
2578192
2578448
2578704
2578960
2579216
2579472
2579728
2579984
2580240
2572305
2572561
2572817
2573073
2573329
2573585
2573841
2574097
2574353
2574609
2574865
2575121
2575377
2575633
2575889
2576145
2576401
2576657
2576913
2577169
2577425
2577681
2577937
2578193
2578449
2578705
2578961
2579217
2579473
2579729
2579985
2580241
2572306
2572562
2572818
2573074
2573330
2573586
2573842
2574098
2574354
2574610
2574866
2575122
2575378
2575634
2575890
2576146
2576402
2576658
2576914
2577170
2577426
2577682
2577938
2578194
2578450
2578706
2578962
2579218
2579474
2579730
2579986
2580242
2572307
2572563
2572819
2573075
2573331
2573587
2573843
2574099
2574355
2574611
2574867
2575123
2575379
2575635
2575891
2576147
2576403
2576659
2576915
2577171
2577427
2577683
2577939
2578195
2578451
2578707
2578963
2579219
2579475
2579731
2579987
2580243
2572308
2572564
2572820
2573076
2573332
2573588
2573844
2574100
2574356
2574612
2574868
2575124
2575380
2575636
2575892
2576148
2576404
2576660
2576916
2577172
2577428
2577684
2577940
2578196
2578452
2578708
2578964
2579220
2579476
2579732
2579988
2580244
2572309
2572565
2572821
2573077
2573333
2573589
2573845
2574101
2574357
2574613
2574869
2575125
2575381
2575637
2575893
2576149
2576405
2576661
2576917
2577173
2577429
2577685
2577941
2578197
2578453
2578709
2578965
2579221
2579477
2579733
2579989
2580245
2572310
2572566
2572822
2573078
2573334
2573590
2573846
2574102
2574358
2574614
2574870
2575126
2575382
2575638
2575894
2576150
2576406
2576662
2576918
2577174
2577430
2577686
2577942
2578198
2578454
2578710
2578966
2579222
2579478
2579734
2579990
2580246
2572311
2572567
2572823
2573079
2573335
2573591
2573847
2574103
2574359
2574615
2574871
2575127
2575383
2575639
2575895
2576151
2576407
2576663
2576919
2577175
2577431
2577687
2577943
2578199
2578455
2578711
2578967
2579223
2579479
2579735
2579991
2580247
2572312
2572568
2572824
2573080
2573336
2573592
2573848
2574104
2574360
2574616
2574872
2575128
2575384
2575640
2575896
2576152
2576408
2576664
2576920
2577176
2577432
2577688
2577944
2578200
2578456
2578712
2578968
2579224
2579480
2579736
2579992
2580248
2572313
2572569
2572825
2573081
2573337
2573593
2573849
2574105
2574361
2574617
2574873
2575129
2575385
2575641
2575897
2576153
2576409
2576665
2576921
2577177
2577433
2577689
2577945
2578201
2578457
2578713
2578969
2579225
2579481
2579737
2579993
2580249
2572314
2572570
2572826
2573082
2573338
2573594
2573850
2574106
2574362
2574618
2574874
2575130
2575386
2575642
2575898
2576154
2576410
2576666
2576922
2577178
2577434
2577690
2577946
2578202
2578458
2578714
2578970
2579226
2579482
2579738
2579994
2580250
2572315
2572571
2572827
2573083
2573339
2573595
2573851
2574107
2574363
2574619
2574875
2575131
2575387
2575643
2575899
2576155
2576411
2576667
2576923
2577179
2577435
2577691
2577947
2578203
2578459
2578715
2578971
2579227
2579483
2579739
2579995
2580251
2572316
2572572
2572828
2573084
2573340
2573596
2573852
2574108
2574364
2574620
2574876
2575132
2575388
2575644
2575900
2576156
2576412
2576668
2576924
2577180
2577436
2577692
2577948
2578204
2578460
2578716
2578972
2579228
2579484
2579740
2579996
2580252
2572317
2572573
2572829
2573085
2573341
2573597
2573853
2574109
2574365
2574621
2574877
2575133
2575389
2575645
2575901
2576157
2576413
2576669
2576925
2577181
2577437
2577693
2577949
2578205
2578461
2578717
2578973
2579229
2579485
2579741
2579997
2580253
2572318
2572574
2572830
2573086
2573342
2573598
2573854
2574110
2574366
2574622
2574878
2575134
2575390
2575646
2575902
2576158
2576414
2576670
2576926
2577182
2577438
2577694
2577950
2578206
2578462
2578718
2578974
2579230
2579486
2579742
2579998
2580254
2572319
2572575
2572831
2573087
2573343
2573599
2573855
2574111
2574367
2574623
2574879
2575135
2575391
2575647
2575903
2576159
2576415
2576671
2576927
2577183
2577439
2577695
2577951
2578207
2578463
2578719
2578975
2579231
2579487
2579743
2579999
2580255
2572320
2572576
2572832
2573088
2573344
2573600
2573856
2574112
2574368
2574624
2574880
2575136
2575392
2575648
2575904
2576160
2576416
2576672
2576928
2577184
2577440
2577696
2577952
2578208
2578464
2578720
2578976
2579232
2579488
2579744
2580000
2580256
2572321
2572577
2572833
2573089
2573345
2573601
2573857
2574113
2574369
2574625
2574881
2575137
2575393
2575649
2575905
2576161
2576417
2576673
2576929
2577185
2577441
2577697
2577953
2578209
2578465
2578721
2578977
2579233
2579489
2579745
2580001
2580257
2572322
2572578
2572834
2573090
2573346
2573602
2573858
2574114
2574370
2574626
2574882
2575138
2575394
2575650
2575906
2576162
2576418
2576674
2576930
2577186
2577442
2577698
2577954
2578210
2578466
2578722
2578978
2579234
2579490
2579746
2580002
2580258
2572323
2572579
2572835
2573091
2573347
2573603
2573859
2574115
2574371
2574627
2574883
2575139
2575395
2575651
2575907
2576163
2576419
2576675
2576931
2577187
2577443
2577699
2577955
2578211
2578467
2578723
2578979
2579235
2579491
2579747
2580003
2580259
2572324
2572580
2572836
2573092
2573348
2573604
2573860
2574116
2574372
2574628
2574884
2575140
2575396
2575652
2575908
2576164
2576420
2576676
2576932
2577188
2577444
2577700
2577956
2578212
2578468
2578724
2578980
2579236
2579492
2579748
2580004
2580260
2572325
2572581
2572837
2573093
2573349
2573605
2573861
2574117
2574373
2574629
2574885
2575141
2575397
2575653
2575909
2576165
2576421
2576677
2576933
2577189
2577445
2577701
2577957
2578213
2578469
2578725
2578981
2579237
2579493
2579749
2580005
2580261
2572326
2572582
2572838
2573094
2573350
2573606
2573862
2574118
2574374
2574630
2574886
2575142
2575398
2575654
2575910
2576166
2576422
2576678
2576934
2577190
2577446
2577702
2577958
2578214
2578470
2578726
2578982
2579238
2579494
2579750
2580006
2580262
2572327
2572583
2572839
2573095
2573351
2573607
2573863
2574119
2574375
2574631
2574887
2575143
2575399
2575655
2575911
2576167
2576423
2576679
2576935
2577191
2577447
2577703
2577959
2578215
2578471
2578727
2578983
2579239
2579495
2579751
2580007
2580263
2572328
2572584
2572840
2573096
2573352
2573608
2573864
2574120
2574376
2574632
2574888
2575144
2575400
2575656
2575912
2576168
2576424
2576680
2576936
2577192
2577448
2577704
2577960
2578216
2578472
2578728
2578984
2579240
2579496
2579752
2580008
2580264
2572329
2572585
2572841
2573097
2573353
2573609
2573865
2574121
2574377
2574633
2574889
2575145
2575401
2575657
2575913
2576169
2576425
2576681
2576937
2577193
2577449
2577705
2577961
2578217
2578473
2578729
2578985
2579241
2579497
2579753
2580009
2580265
2572330
2572586
2572842
2573098
2573354
2573610
2573866
2574122
2574378
2574634
2574890
2575146
2575402
2575658
2575914
2576170
2576426
2576682
2576938
2577194
2577450
2577706
2577962
2578218
2578474
2578730
2578986
2579242
2579498
2579754
2580010
2580266
2572331
2572587
2572843
2573099
2573355
2573611
2573867
2574123
2574379
2574635
2574891
2575147
2575403
2575659
2575915
2576171
2576427
2576683
2576939
2577195
2577451
2577707
2577963
2578219
2578475
2578731
2578987
2579243
2579499
2579755
2580011
2580267
2572332
2572588
2572844
2573100
2573356
2573612
2573868
2574124
2574380
2574636
2574892
2575148
2575404
2575660
2575916
2576172
2576428
2576684
2576940
2577196
2577452
2577708
2577964
2578220
2578476
2578732
2578988
2579244
2579500
2579756
2580012
2580268
2572333
2572589
2572845
2573101
2573357
2573613
2573869
2574125
2574381
2574637
2574893
2575149
2575405
2575661
2575917
2576173
2576429
2576685
2576941
2577197
2577453
2577709
2577965
2578221
2578477
2578733
2578989
2579245
2579501
2579757
2580013
2580269
2572334
2572590
2572846
2573102
2573358
2573614
2573870
2574126
2574382
2574638
2574894
2575150
2575406
2575662
2575918
2576174
2576430
2576686
2576942
2577198
2577454
2577710
2577966
2578222
2578478
2578734
2578990
2579246
2579502
2579758
2580014
2580270
2572335
2572591
2572847
2573103
2573359
2573615
2573871
2574127
2574383
2574639
2574895
2575151
2575407
2575663
2575919
2576175
2576431
2576687
2576943
2577199
2577455
2577711
2577967
2578223
2578479
2578735
2578991
2579247
2579503
2579759
2580015
2580271
2572336
2572592
2572848
2573104
2573360
2573616
2573872
2574128
2574384
2574640
2574896
2575152
2575408
2575664
2575920
2576176
2576432
2576688
2576944
2577200
2577456
2577712
2577968
2578224
2578480
2578736
2578992
2579248
2579504
2579760
2580016
2580272
2572337
2572593
2572849
2573105
2573361
2573617
2573873
2574129
2574385
2574641
2574897
2575153
2575409
2575665
2575921
2576177
2576433
2576689
2576945
2577201
2577457
2577713
2577969
2578225
2578481
2578737
2578993
2579249
2579505
2579761
2580017
2580273
2572338
2572594
2572850
2573106
2573362
2573618
2573874
2574130
2574386
2574642
2574898
2575154
2575410
2575666
2575922
2576178
2576434
2576690
2576946
2577202
2577458
2577714
2577970
2578226
2578482
2578738
2578994
2579250
2579506
2579762
2580018
2580274
2572339
2572595
2572851
2573107
2573363
2573619
2573875
2574131
2574387
2574643
2574899
2575155
2575411
2575667
2575923
2576179
2576435
2576691
2576947
2577203
2577459
2577715
2577971
2578227
2578483
2578739
2578995
2579251
2579507
2579763
2580019
2580275
2572340
2572596
2572852
2573108
2573364
2573620
2573876
2574132
2574388
2574644
2574900
2575156
2575412
2575668
2575924
2576180
2576436
2576692
2576948
2577204
2577460
2577716
2577972
2578228
2578484
2578740
2578996
2579252
2579508
2579764
2580020
2580276
2572341
2572597
2572853
2573109
2573365
2573621
2573877
2574133
2574389
2574645
2574901
2575157
2575413
2575669
2575925
2576181
2576437
2576693
2576949
2577205
2577461
2577717
2577973
2578229
2578485
2578741
2578997
2579253
2579509
2579765
2580021
2580277
2572342
2572598
2572854
2573110
2573366
2573622
2573878
2574134
2574390
2574646
2574902
2575158
2575414
2575670
2575926
2576182
2576438
2576694
2576950
2577206
2577462
2577718
2577974
2578230
2578486
2578742
2578998
2579254
2579510
2579766
2580022
2580278
2572343
2572599
2572855
2573111
2573367
2573623
2573879
2574135
2574391
2574647
2574903
2575159
2575415
2575671
2575927
2576183
2576439
2576695
2576951
2577207
2577463
2577719
2577975
2578231
2578487
2578743
2578999
2579255
2579511
2579767
2580023
2580279
2572344
2572600
2572856
2573112
2573368
2573624
2573880
2574136
2574392
2574648
2574904
2575160
2575416
2575672
2575928
2576184
2576440
2576696
2576952
2577208
2577464
2577720
2577976
2578232
2578488
2578744
2579000
2579256
2579512
2579768
2580024
2580280
2572345
2572601
2572857
2573113
2573369
2573625
2573881
2574137
2574393
2574649
2574905
2575161
2575417
2575673
2575929
2576185
2576441
2576697
2576953
2577209
2577465
2577721
2577977
2578233
2578489
2578745
2579001
2579257
2579513
2579769
2580025
2580281
2572346
2572602
2572858
2573114
2573370
2573626
2573882
2574138
2574394
2574650
2574906
2575162
2575418
2575674
2575930
2576186
2576442
2576698
2576954
2577210
2577466
2577722
2577978
2578234
2578490
2578746
2579002
2579258
2579514
2579770
2580026
2580282
2572347
2572603
2572859
2573115
2573371
2573627
2573883
2574139
2574395
2574651
2574907
2575163
2575419
2575675
2575931
2576187
2576443
2576699
2576955
2577211
2577467
2577723
2577979
2578235
2578491
2578747
2579003
2579259
2579515
2579771
2580027
2580283
2572348
2572604
2572860
2573116
2573372
2573628
2573884
2574140
2574396
2574652
2574908
2575164
2575420
2575676
2575932
2576188
2576444
2576700
2576956
2577212
2577468
2577724
2577980
2578236
2578492
2578748
2579004
2579260
2579516
2579772
2580028
2580284
2572349
2572605
2572861
2573117
2573373
2573629
2573885
2574141
2574397
2574653
2574909
2575165
2575421
2575677
2575933
2576189
2576445
2576701
2576957
2577213
2577469
2577725
2577981
2578237
2578493
2578749
2579005
2579261
2579517
2579773
2580029
2580285
2572350
2572606
2572862
2573118
2573374
2573630
2573886
2574142
2574398
2574654
2574910
2575166
2575422
2575678
2575934
2576190
2576446
2576702
2576958
2577214
2577470
2577726
2577982
2578238
2578494
2578750
2579006
2579262
2579518
2579774
2580030
2580286
2572351
2572607
2572863
2573119
2573375
2573631
2573887
2574143
2574399
2574655
2574911
2575167
2575423
2575679
2575935
2576191
2576447
2576703
2576959
2577215
2577471
2577727
2577983
2578239
2578495
2578751
2579007
2579263
2579519
2579775
2580031
2580287
2572352
2572608
2572864
2573120
2573376
2573632
2573888
2574144
2574400
2574656
2574912
2575168
2575424
2575680
2575936
2576192
2576448
2576704
2576960
2577216
2577472
2577728
2577984
2578240
2578496
2578752
2579008
2579264
2579520
2579776
2580032
2580288
2572353
2572609
2572865
2573121
2573377
2573633
2573889
2574145
2574401
2574657
2574913
2575169
2575425
2575681
2575937
2576193
2576449
2576705
2576961
2577217
2577473
2577729
2577985
2578241
2578497
2578753
2579009
2579265
2579521
2579777
2580033
2580289
2572354
2572610
2572866
2573122
2573378
2573634
2573890
2574146
2574402
2574658
2574914
2575170
2575426
2575682
2575938
2576194
2576450
2576706
2576962
2577218
2577474
2577730
2577986
2578242
2578498
2578754
2579010
2579266
2579522
2579778
2580034
2580290
2572355
2572611
2572867
2573123
2573379
2573635
2573891
2574147
2574403
2574659
2574915
2575171
2575427
2575683
2575939
2576195
2576451
2576707
2576963
2577219
2577475
2577731
2577987
2578243
2578499
2578755
2579011
2579267
2579523
2579779
2580035
2580291
2572356
2572612
2572868
2573124
2573380
2573636
2573892
2574148
2574404
2574660
2574916
2575172
2575428
2575684
2575940
2576196
2576452
2576708
2576964
2577220
2577476
2577732
2577988
2578244
2578500
2578756
2579012
2579268
2579524
2579780
2580036
2580292
2572357
2572613
2572869
2573125
2573381
2573637
2573893
2574149
2574405
2574661
2574917
2575173
2575429
2575685
2575941
2576197
2576453
2576709
2576965
2577221
2577477
2577733
2577989
2578245
2578501
2578757
2579013
2579269
2579525
2579781
2580037
2580293
2572358
2572614
2572870
2573126
2573382
2573638
2573894
2574150
2574406
2574662
2574918
2575174
2575430
2575686
2575942
2576198
2576454
2576710
2576966
2577222
2577478
2577734
2577990
2578246
2578502
2578758
2579014
2579270
2579526
2579782
2580038
2580294
2572359
2572615
2572871
2573127
2573383
2573639
2573895
2574151
2574407
2574663
2574919
2575175
2575431
2575687
2575943
2576199
2576455
2576711
2576967
2577223
2577479
2577735
2577991
2578247
2578503
2578759
2579015
2579271
2579527
2579783
2580039
2580295
2572360
2572616
2572872
2573128
2573384
2573640
2573896
2574152
2574408
2574664
2574920
2575176
2575432
2575688
2575944
2576200
2576456
2576712
2576968
2577224
2577480
2577736
2577992
2578248
2578504
2578760
2579016
2579272
2579528
2579784
2580040
2580296
2572361
2572617
2572873
2573129
2573385
2573641
2573897
2574153
2574409
2574665
2574921
2575177
2575433
2575689
2575945
2576201
2576457
2576713
2576969
2577225
2577481
2577737
2577993
2578249
2578505
2578761
2579017
2579273
2579529
2579785
2580041
2580297
2572362
2572618
2572874
2573130
2573386
2573642
2573898
2574154
2574410
2574666
2574922
2575178
2575434
2575690
2575946
2576202
2576458
2576714
2576970
2577226
2577482
2577738
2577994
2578250
2578506
2578762
2579018
2579274
2579530
2579786
2580042
2580298
2572363
2572619
2572875
2573131
2573387
2573643
2573899
2574155
2574411
2574667
2574923
2575179
2575435
2575691
2575947
2576203
2576459
2576715
2576971
2577227
2577483
2577739
2577995
2578251
2578507
2578763
2579019
2579275
2579531
2579787
2580043
2580299
2572364
2572620
2572876
2573132
2573388
2573644
2573900
2574156
2574412
2574668
2574924
2575180
2575436
2575692
2575948
2576204
2576460
2576716
2576972
2577228
2577484
2577740
2577996
2578252
2578508
2578764
2579020
2579276
2579532
2579788
2580044
2580300
2572365
2572621
2572877
2573133
2573389
2573645
2573901
2574157
2574413
2574669
2574925
2575181
2575437
2575693
2575949
2576205
2576461
2576717
2576973
2577229
2577485
2577741
2577997
2578253
2578509
2578765
2579021
2579277
2579533
2579789
2580045
2580301
2572366
2572622
2572878
2573134
2573390
2573646
2573902
2574158
2574414
2574670
2574926
2575182
2575438
2575694
2575950
2576206
2576462
2576718
2576974
2577230
2577486
2577742
2577998
2578254
2578510
2578766
2579022
2579278
2579534
2579790
2580046
2580302
2572367
2572623
2572879
2573135
2573391
2573647
2573903
2574159
2574415
2574671
2574927
2575183
2575439
2575695
2575951
2576207
2576463
2576719
2576975
2577231
2577487
2577743
2577999
2578255
2578511
2578767
2579023
2579279
2579535
2579791
2580047
2580303
2572368
2572624
2572880
2573136
2573392
2573648
2573904
2574160
2574416
2574672
2574928
2575184
2575440
2575696
2575952
2576208
2576464
2576720
2576976
2577232
2577488
2577744
2578000
2578256
2578512
2578768
2579024
2579280
2579536
2579792
2580048
2580304
2572369
2572625
2572881
2573137
2573393
2573649
2573905
2574161
2574417
2574673
2574929
2575185
2575441
2575697
2575953
2576209
2576465
2576721
2576977
2577233
2577489
2577745
2578001
2578257
2578513
2578769
2579025
2579281
2579537
2579793
2580049
2580305
2572370
2572626
2572882
2573138
2573394
2573650
2573906
2574162
2574418
2574674
2574930
2575186
2575442
2575698
2575954
2576210
2576466
2576722
2576978
2577234
2577490
2577746
2578002
2578258
2578514
2578770
2579026
2579282
2579538
2579794
2580050
2580306
2572371
2572627
2572883
2573139
2573395
2573651
2573907
2574163
2574419
2574675
2574931
2575187
2575443
2575699
2575955
2576211
2576467
2576723
2576979
2577235
2577491
2577747
2578003
2578259
2578515
2578771
2579027
2579283
2579539
2579795
2580051
2580307
2572372
2572628
2572884
2573140
2573396
2573652
2573908
2574164
2574420
2574676
2574932
2575188
2575444
2575700
2575956
2576212
2576468
2576724
2576980
2577236
2577492
2577748
2578004
2578260
2578516
2578772
2579028
2579284
2579540
2579796
2580052
2580308
2572373
2572629
2572885
2573141
2573397
2573653
2573909
2574165
2574421
2574677
2574933
2575189
2575445
2575701
2575957
2576213
2576469
2576725
2576981
2577237
2577493
2577749
2578005
2578261
2578517
2578773
2579029
2579285
2579541
2579797
2580053
2580309
2572374
2572630
2572886
2573142
2573398
2573654
2573910
2574166
2574422
2574678
2574934
2575190
2575446
2575702
2575958
2576214
2576470
2576726
2576982
2577238
2577494
2577750
2578006
2578262
2578518
2578774
2579030
2579286
2579542
2579798
2580054
2580310
2572375
2572631
2572887
2573143
2573399
2573655
2573911
2574167
2574423
2574679
2574935
2575191
2575447
2575703
2575959
2576215
2576471
2576727
2576983
2577239
2577495
2577751
2578007
2578263
2578519
2578775
2579031
2579287
2579543
2579799
2580055
2580311
2572376
2572632
2572888
2573144
2573400
2573656
2573912
2574168
2574424
2574680
2574936
2575192
2575448
2575704
2575960
2576216
2576472
2576728
2576984
2577240
2577496
2577752
2578008
2578264
2578520
2578776
2579032
2579288
2579544
2579800
2580056
2580312
2572377
2572633
2572889
2573145
2573401
2573657
2573913
2574169
2574425
2574681
2574937
2575193
2575449
2575705
2575961
2576217
2576473
2576729
2576985
2577241
2577497
2577753
2578009
2578265
2578521
2578777
2579033
2579289
2579545
2579801
2580057
2580313
2572378
2572634
2572890
2573146
2573402
2573658
2573914
2574170
2574426
2574682
2574938
2575194
2575450
2575706
2575962
2576218
2576474
2576730
2576986
2577242
2577498
2577754
2578010
2578266
2578522
2578778
2579034
2579290
2579546
2579802
2580058
2580314
2572379
2572635
2572891
2573147
2573403
2573659
2573915
2574171
2574427
2574683
2574939
2575195
2575451
2575707
2575963
2576219
2576475
2576731
2576987
2577243
2577499
2577755
2578011
2578267
2578523
2578779
2579035
2579291
2579547
2579803
2580059
2580315
2572380
2572636
2572892
2573148
2573404
2573660
2573916
2574172
2574428
2574684
2574940
2575196
2575452
2575708
2575964
2576220
2576476
2576732
2576988
2577244
2577500
2577756
2578012
2578268
2578524
2578780
2579036
2579292
2579548
2579804
2580060
2580316
2572381
2572637
2572893
2573149
2573405
2573661
2573917
2574173
2574429
2574685
2574941
2575197
2575453
2575709
2575965
2576221
2576477
2576733
2576989
2577245
2577501
2577757
2578013
2578269
2578525
2578781
2579037
2579293
2579549
2579805
2580061
2580317
2572382
2572638
2572894
2573150
2573406
2573662
2573918
2574174
2574430
2574686
2574942
2575198
2575454
2575710
2575966
2576222
2576478
2576734
2576990
2577246
2577502
2577758
2578014
2578270
2578526
2578782
2579038
2579294
2579550
2579806
2580062
2580318
2572383
2572639
2572895
2573151
2573407
2573663
2573919
2574175
2574431
2574687
2574943
2575199
2575455
2575711
2575967
2576223
2576479
2576735
2576991
2577247
2577503
2577759
2578015
2578271
2578527
2578783
2579039
2579295
2579551
2579807
2580063
2580319
