0 0 0.971428544959 0.794117629528 1.2962962389
0 1 0.721182433379 0.897318780422 1.54528331757
0 2 0.857142886337 0.777777791023 1.5
1 0 0.675000022128 1.0 1.48148143291
1 1 0.71969326885 0.887067317963 1.56637585163
1 2 0.608695633245 1.0 1.64285719395
2 0 0.842105263158 0.875 1.35714280605
2 1 0.704028736525 0.902171671391 1.57441949844
2 2 0.72222220309 0.846153855324 1.63636362553
3 0 0.699999983311 0.892857134342 1.60000002384
3 1 0.684322059996 0.899336576462 1.62486481667
3 2 1.4999999553 0.555555582047 1.20000004768
4 0 0.651162797919 0.892857134342 1.72000002861
4 1 0.645229146276 0.898280441761 1.72533750534
4 2 0.666666666667 0.916666686535 1.63636362553
5 0 0.659574474777 0.806451618671 1.87999999523
5 1 0.639781568716 0.904012560844 1.72899520397
5 2 0.71428572645 0.899999976158 1.55555558205
6 0 0.8 0.71875 1.73913037777
6 1 0.566781447131 0.916239023209 1.92564213276
6 2 0.916666639348 0.818181812763 1.33333337307
7 0 0.849999964535 0.823529422283 1.42857146263
7 1 0.677908617624 0.860259056091 1.71474528313
7 2 0.684210539194 0.923076927662 1.58333337307
8 0 0.829787242461 0.897435903549 1.34285712242
8 1 0.659949225041 0.892294943333 1.69816946983
8 2 0.749999977648 0.933333337307 1.42857146263
9 0 0.719298253136 0.853658556938 1.62857139111
9 1 0.678485982693 0.887035608292 1.6615678072
9 2 0.933333363003 0.857142865658 1.25
10 0 0.657142859381 0.913043498993 1.66666662693
10 1 0.567714043915 0.915280520916 1.92449212074
10 2 0.705882372741 0.916666686535 1.54545450211
11 0 0.604395614688 0.890909075737 1.85714280605
11 1 0.568573901354 0.922749876976 1.90602707863
11 2 0.71428572645 0.933333337307 1.5
12 0 0.810126582278 0.890625 1.38596487045
12 1 0.695324538353 0.884774506092 1.62547338009
12 2 1.74999992177 0.5 1.14285719395
13 0 0.657142859381 0.840579688549 1.81034481525
13 1 0.638006424627 0.903019845486 1.73571193218
13 2 0.749999977648 0.916666686535 1.45454549789
14 0 0.795918377029 0.871794879436 1.44117641449
14 1 0.63488837166 0.897405743599 1.75514817238
14 2 0.772727247605 0.882352948189 1.46666669846
15 0 0.969072112547 0.755319178104 1.36619722843
15 1 0.595796332254 0.906600952148 1.85133910179
15 2 0.740740727659 0.850000023842 1.58823525906
16 0 0.882352947364 0.857142865658 1.32222223282
16 1 0.566625208577 0.915115892887 1.92853713036
16 2 0.958333342854 0.826086938381 1.26315784454
17 0 0.754716953972 0.858333349228 1.54368937016
17 1 0.56283249278 0.917718529701 1.93602657318
17 2 0.553191494974 0.923076927662 1.95833337307
18 0 0.705882372741 0.923611104488 1.53383457661
18 1 0.681450946643 0.887402832508 1.65365374088
18 2 0.772727247605 0.941176474094 1.375
19 0 0.678700345822 0.904255330563 1.6294118166
19 1 0.631724948759 0.898694336414 1.76140785217
19 2 0.826923090193 0.860465109348 1.40540540218
20 0 0.846428548365 0.818565428257 1.44329893589
20 1 0.732709573771 0.869404196739 1.56980741024
20 2 0.71428572645 0.939999997616 1.48936164379
21 0 0.8 0.850000023842 1.47058820724
21 1 0.844797189853 0.730541944504 1.62032604218
21 2 0.692307705005 0.968253970146 1.49180328846
22 0 0.751861075322 0.851485133171 1.56201553345
22 1 0.679627534716 0.891478478909 1.65051007271
22 2 0.590551162255 0.933333337307 1.81428575516
23 0 0.767741946112 0.904761910439 1.43962848186
23 1 0.593679862583 0.911144733429 1.8486739397
23 2 0.741666646774 0.887640476227 1.51898729801
24 0 0.756476704497 0.84018266201 1.57336962223
24 1 0.617078839276 0.88182091713 1.83771824837
24 2 0.580645165756 0.925925910473 1.86000001431
25 0 0.77878790467 0.863813221455 1.48648643494
25 1 0.712114344983 0.879221200943 1.59717345238
25 2 0.775000023097 0.870967745781 1.48148143291
26 0 0.673863610347 0.865092754364 1.71539962292
26 1 0.824956488371 0.813421785831 1.49022948742
26 2 0.617647050161 0.91836732626 1.76296293736
27 0 0.677879692995 0.893233060837 1.65151512623
27 1 0.58470225039 0.903298616409 1.89336299896
27 2 0.629921269303 0.9375 1.69333338737
28 0 0.76476905612 0.844101130962 1.54908490181
28 1 0.631376569107 0.879188835621 1.80147969723
28 2 0.702811233876 0.897142827511 1.58598721027
29 0 0.735263690116 0.884669482708 1.5373609066
29 1 0.664980501502 0.892484724522 1.68496274948
29 2 0.733333327505 0.931818187237 1.46341466904
30 0 0.821392572713 0.796068787575 1.52932095528
30 1 1.0029518459 0.714224159718 1.39599978924
30 2 0.857142886337 0.766666650772 1.52173912525
31 0 0.780971229515 0.827411174774 1.54754602909
31 1 0.593259412307 0.877054572105 1.92189097404
31 2 0.61609908576 0.899497509003 1.80446922779
32 0 0.876350550751 0.826027393341 1.38142621517
32 1 0.673314455996 0.899367690086 1.65137147903
32 2 0.768656693852 0.883495151997 1.47252750397
33 0 0.77164503847 0.870967745781 1.48792266846
33 1 7999.0004358 0.000125015620142 1.0
33 2 0.783132540243 0.882051289082 1.44767439365
34 0 0.666360307187 0.907586216927 1.65349543095
34 1 0.688791122891 0.918101549149 1.58132719994
34 2 0.765342951066 0.900943398476 1.45026183128
35 0 0.724181390319 0.8991304636 1.53578341007
35 1 0.724161447638 0.890689432621 1.55038046837
35 2 0.63897761242 0.925000011921 1.69189190865
36 0 0.698776746182 0.901531755924 1.5873786211
36 1 1.0 0.0 0.0
36 2 0.754545474171 0.90963858366 1.45695364475
37 0 1.06451613108 0.699724495411 1.34251964092
37 1 0.692925322305 0.909443378448 1.58685743809
37 2 0.808080839218 0.862500011921 1.43478262424
38 0 398.000004263 0.00251256278716 1.0
38 1 0.785606867287 0.865530133247 1.4706608057
38 2 0.8 0.839999973774 1.48809528351
39 0 1.05591400841 0.714867591858 1.32478630543
39 1 0.668578528772 0.922513306141 1.62134313583
39 2 0.933884271759 0.769911527634 1.3908046484
40 0 0.868131862446 0.80108499527 1.43792319298
40 1 0.686345440245 0.909793913364 1.60145306587
40 2 0.716923081131 0.879828333855 1.58536589146
41 0 0.804733732352 0.86274510622 1.44034087658
41 1 0.730321194408 0.913677632809 1.49862551689
41 2 0.816254389798 0.852813839912 1.43654823303
42 0 0.883064538202 0.778538823128 1.45454549789
42 1 0.594134108759 0.930746674538 1.8083564043
42 2 0.822878201272 0.860986530781 1.41145837307
43 0 0.746781119701 0.793103456497 1.68840575218
43 1 0.677400768747 0.902275204659 1.63612055779
43 2 1.33898300215 0.590717315674 1.26428568363
44 0 1.0 0.0 0.0
44 1 0.766155899598 0.875313997269 1.49114191532
44 2 0.738916244876 0.853333353996 1.5859375
45 0 0.963235280609 0.809160292149 1.28301882744
45 1 0.661937904498 0.928831398487 1.62646925449
45 2 0.898437541 0.791304349899 1.40659344196
46 0 0.733333327505 0.82954543829 1.6438356638
46 1 1.53281942775 0.445550978184 1.46423780918
46 2 1.0169491361 0.75 1.31111109257
47 0 1.05479454122 0.623376607895 1.52083337307
47 1 0.819876878822 0.875889658928 1.3925216198
47 2 1.0 0.800000011921 1.25
48 0 0.805555587565 0.747126460075 1.66153848171
48 1 0.788188403966 0.853933215141 1.48575103283
48 2 0.874999960884 0.678571403027 1.68421053886
49 0 0.686274522637 0.800000011921 1.82142853737
49 1 1.00145139042 0.735587775707 1.35748684406
49 2 0.705882372741 1.0 1.41666662693
50 0 0.861111136774 0.784946262836 1.47945201397
50 1 0.764419002108 0.885162949562 1.47790086269
50 2 1.0 0.722222208977 1.3846154213
51 0 1.02608693206 0.711864411831 1.36904764175
51 1 0.635408231182 0.94804918766 1.66003131866
51 2 1.04545453412 0.608695626259 1.57142853737
52 0 1.05600001007 0.659090936184 1.43678164482
52 1 0.648273259059 0.924826741219 1.66794419289
52 2 2.0 0.352941185236 1.41666662693
53 0 1.34146340683 0.527272701263 1.41379308701
53 1 0.786447532339 0.83641242981 1.52023160458
53 2 1.91666668571 0.260869562626 2.0
