140849
140594
605501
863040
1064752
1129770
1188394
1254185
1387567
1583136
1584160
1583394
1584162
1583139
1583651
1583907
1584419
1583396
1584676
1583398
1583654
1583911
1585707
1653808
1656112
1654326
1779751
1787432
1785401
1846843
1910309
2762035
2764349
2764606
3029039
3029040
3090740
3090997
3092534
3091255
3091511
3092535
3094329
3487022
