0 0 1.0 0.714285731316 1.39999997616
0 1 0.753856878405 0.893582820892 1.4844865799
0 2 0.84615388495 1.0 1.18181812763
1 0 1.14285714286 0.625 1.39999997616
1 1 0.67512654486 0.917705476284 1.61402952671
1 2 0.83333330022 1.0 1.20000004768
2 0 0.888888888889 0.875 1.28571426868
2 1 0.719557084156 0.909515917301 1.52800381184
2 2 0.699999983311 0.928571403027 1.53846156597
3 0 1.0 0.699999988079 1.42857146263
3 1 0.679551777841 0.932090938091 1.57877111435
3 2 0.71428572645 0.800000011921 1.75
4 0 0.727272727273 0.75 1.83333337307
4 1 0.672085369486 0.910139262676 1.63481152058
4 2 0.785714299095 1.0 1.27272725105
5 0 0.769230797446 0.899999976158 1.44444441795
5 1 0.642737932566 0.923287928104 1.68511247635
5 2 0.764705893078 0.769230782986 1.70000004768
6 0 1.0 0.800000011921 1.25
6 1 0.584904056679 0.925988852978 1.84633123875
6 2 1.12499999162 0.666666686535 1.33333337307
7 0 0.923076889219 0.75 1.44444441795
7 1 0.674658555266 0.87916302681 1.68595731258
7 2 0.624999990687 1.0 1.60000002384
8 0 0.769230797446 0.800000011921 1.625
8 1 0.664122631157 0.909281253815 1.65597391129
8 2 0.708333315742 0.941176474094 1.5
9 0 0.857142886337 0.916666686535 1.27272725105
9 1 0.703410817235 0.904291749001 1.57210814953
9 2 0.849999964535 0.823529422283 1.42857146263
10 0 0.541666663976 0.923076927662 2.0
10 1 0.608992677299 0.922589719296 1.7798333168
10 2 0.538461553275 0.928571403027 2.0
11 0 0.535714283433 0.866666674614 2.15384626389
11 1 0.624517612235 0.92623347044 1.72876060009
11 2 0.600000014305 1.0 1.66666662693
12 0 0.789473694117 0.933333337307 1.35714280605
12 1 0.762665761862 0.878944098949 1.49177896976
12 2 0.863636368316 0.89473682642 1.29411768913
13 0 0.666666666667 0.909090936184 1.64999997616
13 1 0.667849303737 0.922293066978 1.62350106239
13 2 0.761904761905 0.9375 1.39999997616
14 0 0.604651166143 0.961538434029 1.72000002861
14 1 0.663633750086 0.907067656517 1.66123795509
14 2 0.592592592593 1.0 1.6875
15 0 1.05882355911 0.722222208977 1.30769228935
15 1 0.638401172113 0.916179060936 1.70972383022
15 2 0.68000001297 1.0 1.47058820724
16 0 0.937499951106 0.800000011921 1.33333337307
16 1 0.590704236996 0.935118556023 1.81035292149
16 2 0.857142886337 0.944444417953 1.23529410362
17 0 0.860465099581 0.94594591856 1.22857141495
17 1 0.602533964421 0.929843366146 1.78487849236
17 2 0.720000027466 0.944444417953 1.47058820724
18 0 0.704918052073 0.930232584476 1.52499997616
18 1 0.952300015882 0.782319188118 1.34227728844
18 2 0.749999977648 0.888888895512 1.5
19 0 0.770491824359 0.893617033958 1.45238089561
19 1 0.694120846882 0.902322411537 1.59662592411
19 2 0.840000008011 0.857142865658 1.38888883591
20 0 0.870967718491 0.870370388031 1.31914889812
20 1 0.813611348144 0.854414463043 1.4385150671
20 2 0.589743605967 0.869565188885 1.95000004768
21 0 0.902777734431 0.815384626389 1.35849058628
21 1 0.67782190591 0.904624700546 1.63085722923
21 2 0.595238113822 0.920000016689 1.82608699799
22 0 0.692307705005 0.944444417953 1.52941179276
22 1 0.738987913649 0.892746925354 1.51577353477
22 2 0.935483838591 0.86206895113 1.24000000954
23 0 0.788135604367 0.892473101616 1.42168676853
23 1 0.633389069243 0.925516843796 1.70586681366
23 2 0.809523818715 0.941176474094 1.3125
24 0 0.849624092896 0.867256641388 1.35714280605
24 1 0.68024925744 0.88606184721 1.6590821743
24 2 0.77358493002 0.804878056049 1.60606062412
25 0 0.692307705005 0.904761910439 1.59649121761
25 1 0.721055601151 0.904417574406 1.53342401981
25 2 0.742424267903 0.897959172726 1.5
26 0 0.734693848953 0.916666686535 1.4848484993
26 1 0.879304406161 0.816415011883 1.39299559593
26 2 0.686746965266 0.89473682642 1.62745094299
27 0 0.666666666667 0.934065937996 1.60588240623
27 1 0.628351395254 0.91586214304 1.73766994476
27 2 0.681318667038 0.951612889767 1.54237282276
28 0 0.583569385392 0.917475700378 1.86772489548
28 1 0.686930296778 0.88632696867 1.64245462418
28 2 0.802197793791 0.876712322235 1.421875
29 0 0.79477615617 0.849765241146 1.48066294193
29 1 0.710747738341 0.903920054436 1.55651926994
29 2 0.806818177446 0.859154939651 1.44262290001
30 0 0.82879377355 0.816901385784 1.47701144218
30 1 0.797491108257 0.842081546783 1.48908674717
30 2 0.909090889387 0.733333349228 1.5
31 0 0.812734081308 0.774193525314 1.58928573132
31 1 0.660923061699 0.868258297443 1.74260985851
31 2 0.834951473705 0.825581371784 1.45070421696
32 0 0.790322585204 0.867346942425 1.45882356167
32 1 0.668959635821 0.916148304939 1.63167738914
32 2 0.65573771517 0.862500011921 1.76811599731
33 0 0.822222228757 0.881081104279 1.38036811352
33 1 1.0 0.0 0.0
33 2 1.0487805122 0.790697693825 1.20588231087
34 0 0.68085106383 0.911458313465 1.61142861843
34 1 0.767404329556 0.900336742401 1.44734072685
34 2 0.8 0.904761910439 1.38157892227
35 0 0.748858426292 0.914634168148 1.46000003815
35 1 0.993739115478 0.779877901077 1.29033064842
35 2 0.747474760076 0.851351380348 1.57142853737
36 0 0.726190461762 0.868852436543 1.58490562439
36 1 1.0 0.0 0.0
36 2 0.831325334637 0.927536249161 1.296875
37 0 1.0 0.747252762318 1.33823525906
37 1 0.736480379374 0.90879368782 1.49407887459
37 2 0.844155851997 0.846153855324 1.39999997616
38 0 1.0 0.0 0.0
38 1 0.987261623257 0.790853202343 1.28077220917
38 2 1.02777776076 0.729729712009 1.33333337307
39 0 1.19130430769 0.649635016918 1.29213488102
39 1 0.691830150689 0.92841976881 1.55688357353
39 2 1.30188679977 0.652173936367 1.17777776718
40 0 0.888235314049 0.834437072277 1.34920632839
40 1 0.713611371493 0.907209634781 1.54465186596
40 2 0.721739137916 0.843373477459 1.64285719395
41 0 0.804687492506 0.864077687263 1.43820226192
41 1 0.963015116336 0.816691040993 1.27147865295
41 2 0.8 0.875 1.42857146263
42 0 0.815286624204 0.8515625 1.44036698341
42 1 0.618544155233 0.929414629936 1.73948132992
42 2 0.899999957085 0.827160477638 1.34328353405
43 0 0.708074545696 0.807017564774 1.75
43 1 0.726084549135 0.883952498436 1.55805897713
43 2 0.768292658355 0.873015880585 1.49090909958
44 0 1.0 0.0 0.0
44 1 0.534549376885 0.956694424152 1.95541489124
44 2 2.24999998324 0.361111104488 1.23076927662
45 0 0.82089550194 0.836363613605 1.4565217495
45 1 0.714970192984 0.909007310867 1.538667202
45 2 1.0 0.823529422283 1.21428573132
46 0 0.981818135001 0.722222208977 1.4102563858
46 1 1.03525006703 0.763360261917 1.26539218426
46 2 1.14285714286 0.8125 1.07692313194
47 0 1.34883719061 0.586206912994 1.26470589638
47 1 0.927559000441 0.826965987682 1.30367946625
47 2 1.15384614327 0.600000023842 1.44444441795
48 0 0.854166698487 0.719512224197 1.62711858749
48 1 0.834715851496 0.824499726295 1.45301735401
48 2 0.960000036621 0.5 2.08333325386
49 0 0.986842117646 0.773333311081 1.31034481525
49 1 0.679583212692 0.893421888351 1.6470272541
49 2 0.636363650156 0.857142865658 1.83333337307
50 0 0.878260901429 0.80198019743 1.41975307465
50 1 0.777565613698 0.878589451313 1.46378386021
50 2 1.09523807037 0.782608687878 1.16666662693
51 0 0.848484823964 0.767857134342 1.53488373756
51 1 0.663568917767 0.938599526882 1.60558617115
51 2 0.840909086353 0.837837815285 1.41935479641
52 0 13.1874995087 0.0758293867111 1.0
52 1 0.680238556027 0.910182952881 1.61513960361
52 2 2.03846150809 0.396226406097 1.23809528351
53 0 1.36799997586 0.549707591534 1.32978725433
53 1 0.871321987787 0.788410186768 1.45569074154
53 2 1.5588235786 0.471698105335 1.36000001431
