1114112
1114368
1114624
1114880
1115136
1115392
1115648
1115904
1116160
1116416
1116672
1116928
1117184
1117440
1117696
1117952
1118208
1118464
1118720
1118976
1119232
1119488
1119744
1120000
1120256
1120512
1120768
1121024
1121280
1121536
1121792
1122048
1122304
1122560
1122816
1123072
1123328
1123584
1123840
1124096
1124352
1124608
1124864
1125120
1125376
1125632
1125888
1126144
1126400
1126656
1126912
1127168
1127424
1127680
1127936
1128192
1128448
1128704
1128960
1129216
1129472
1129728
1129984
1130240
1114113
1114369
1114625
1114881
1115137
1115393
1115649
1115905
1116161
1116417
1116673
1116929
1117185
1117441
1117697
1117953
1118209
1118465
1118721
1118977
1119233
1119489
1119745
1120001
1120257
1120513
1120769
1121025
1121281
1121537
1121793
1122049
1122305
1122561
1122817
1123073
1123329
1123585
1123841
1124097
1124353
1124609
1124865
1125121
1125377
1125633
1125889
1126145
1126401
1126657
1126913
1127169
1127425
1127681
1127937
1128193
1128449
1128705
1128961
1129217
1129473
1129729
1129985
1130241
1114114
1114370
1114626
1114882
1115138
1115394
1115650
1115906
1116162
1116418
1116674
1116930
1117186
1117442
1117698
1117954
1118210
1118466
1118722
1118978
1119234
1119490
1119746
1120002
1120258
1120514
1120770
1121026
1121282
1121538
1121794
1122050
1122306
1122562
1122818
1123074
1123330
1123586
1123842
1124098
1124354
1124610
1124866
1125122
1125378
1125634
1125890
1126146
1126402
1126658
1126914
1127170
1127426
1127682
1127938
1128194
1128450
1128706
1128962
1129218
1129474
1129730
1129986
1130242
1114115
1114371
1114627
1114883
1115139
1115395
1115651
1115907
1116163
1116419
1116675
1116931
1117187
1117443
1117699
1117955
1118211
1118467
1118723
1118979
1119235
1119491
1119747
1120003
1120259
1120515
1120771
1121027
1121283
1121539
1121795
1122051
1122307
1122563
1122819
1123075
1123331
1123587
1123843
1124099
1124355
1124611
1124867
1125123
1125379
1125635
1125891
1126147
1126403
1126659
1126915
1127171
1127427
1127683
1127939
1128195
1128451
1128707
1128963
1129219
1129475
1129731
1129987
1130243
1114116
1114372
1114628
1114884
1115140
1115396
1115652
1115908
1116164
1116420
1116676
1116932
1117188
1117444
1117700
1117956
1118212
1118468
1118724
1118980
1119236
1119492
1119748
1120004
1120260
1120516
1120772
1121028
1121284
1121540
1121796
1122052
1122308
1122564
1122820
1123076
1123332
1123588
1123844
1124100
1124356
1124612
1124868
1125124
1125380
1125636
1125892
1126148
1126404
1126660
1126916
1127172
1127428
1127684
1127940
1128196
1128452
1128708
1128964
1129220
1129476
1129732
1129988
1130244
1114117
1114373
1114629
1114885
1115141
1115397
1115653
1115909
1116165
1116421
1116677
1116933
1117189
1117445
1117701
1117957
1118213
1118469
1118725
1118981
1119237
1119493
1119749
1120005
1120261
1120517
1120773
1121029
1121285
1121541
1121797
1122053
1122309
1122565
1122821
1123077
1123333
1123589
1123845
1124101
1124357
1124613
1124869
1125125
1125381
1125637
1125893
1126149
1126405
1126661
1126917
1127173
1127429
1127685
1127941
1128197
1128453
1128709
1128965
1129221
1129477
1129733
1129989
1130245
1114118
1114374
1114630
1114886
1115142
1115398
1115654
1115910
1116166
1116422
1116678
1116934
1117190
1117446
1117702
1117958
1118214
1118470
1118726
1118982
1119238
1119494
1119750
1120006
1120262
1120518
1120774
1121030
1121286
1121542
1121798
1122054
1122310
1122566
1122822
1123078
1123334
1123590
1123846
1124102
1124358
1124614
1124870
1125126
1125382
1125638
1125894
1126150
1126406
1126662
1126918
1127174
1127430
1127686
1127942
1128198
1128454
1128710
1128966
1129222
1129478
1129734
1129990
1130246
1114119
1114375
1114631
1114887
1115143
1115399
1115655
1115911
1116167
1116423
1116679
1116935
1117191
1117447
1117703
1117959
1118215
1118471
1118727
1118983
1119239
1119495
1119751
1120007
1120263
1120519
1120775
1121031
1121287
1121543
1121799
1122055
1122311
1122567
1122823
1123079
1123335
1123591
1123847
1124103
1124359
1124615
1124871
1125127
1125383
1125639
1125895
1126151
1126407
1126663
1126919
1127175
1127431
1127687
1127943
1128199
1128455
1128711
1128967
1129223
1129479
1129735
1129991
1130247
1114120
1114376
1114632
1114888
1115144
1115400
1115656
1115912
1116168
1116424
1116680
1116936
1117192
1117448
1117704
1117960
1118216
1118472
1118728
1118984
1119240
1119496
1119752
1120008
1120264
1120520
1120776
1121032
1121288
1121544
1121800
1122056
1122312
1122568
1122824
1123080
1123336
1123592
1123848
1124104
1124360
1124616
1124872
1125128
1125384
1125640
1125896
1126152
1126408
1126664
1126920
1127176
1127432
1127688
1127944
1128200
1128456
1128712
1128968
1129224
1129480
1129736
1129992
1130248
1114121
1114377
1114633
1114889
1115145
1115401
1115657
1115913
1116169
1116425
1116681
1116937
1117193
1117449
1117705
1117961
1118217
1118473
1118729
1118985
1119241
1119497
1119753
1120009
1120265
1120521
1120777
1121033
1121289
1121545
1121801
1122057
1122313
1122569
1122825
1123081
1123337
1123593
1123849
1124105
1124361
1124617
1124873
1125129
1125385
1125641
1125897
1126153
1126409
1126665
1126921
1127177
1127433
1127689
1127945
1128201
1128457
1128713
1128969
1129225
1129481
1129737
1129993
1130249
1114122
1114378
1114634
1114890
1115146
1115402
1115658
1115914
1116170
1116426
1116682
1116938
1117194
1117450
1117706
1117962
1118218
1118474
1118730
1118986
1119242
1119498
1119754
1120010
1120266
1120522
1120778
1121034
1121290
1121546
1121802
1122058
1122314
1122570
1122826
1123082
1123338
1123594
1123850
1124106
1124362
1124618
1124874
1125130
1125386
1125642
1125898
1126154
1126410
1126666
1126922
1127178
1127434
1127690
1127946
1128202
1128458
1128714
1128970
1129226
1129482
1129738
1129994
1130250
1114123
1114379
1114635
1114891
1115147
1115403
1115659
1115915
1116171
1116427
1116683
1116939
1117195
1117451
1117707
1117963
1118219
1118475
1118731
1118987
1119243
1119499
1119755
1120011
1120267
1120523
1120779
1121035
1121291
1121547
1121803
1122059
1122315
1122571
1122827
1123083
1123339
1123595
1123851
1124107
1124363
1124619
1124875
1125131
1125387
1125643
1125899
1126155
1126411
1126667
1126923
1127179
1127435
1127691
1127947
1128203
1128459
1128715
1128971
1129227
1129483
1129739
1129995
1130251
1114124
1114380
1114636
1114892
1115148
1115404
1115660
1115916
1116172
1116428
1116684
1116940
1117196
1117452
1117708
1117964
1118220
1118476
1118732
1118988
1119244
1119500
1119756
1120012
1120268
1120524
1120780
1121036
1121292
1121548
1121804
1122060
1122316
1122572
1122828
1123084
1123340
1123596
1123852
1124108
1124364
1124620
1124876
1125132
1125388
1125644
1125900
1126156
1126412
1126668
1126924
1127180
1127436
1127692
1127948
1128204
1128460
1128716
1128972
1129228
1129484
1129740
1129996
1130252
1114125
1114381
1114637
1114893
1115149
1115405
1115661
1115917
1116173
1116429
1116685
1116941
1117197
1117453
1117709
1117965
1118221
1118477
1118733
1118989
1119245
1119501
1119757
1120013
1120269
1120525
1120781
1121037
1121293
1121549
1121805
1122061
1122317
1122573
1122829
1123085
1123341
1123597
1123853
1124109
1124365
1124621
1124877
1125133
1125389
1125645
1125901
1126157
1126413
1126669
1126925
1127181
1127437
1127693
1127949
1128205
1128461
1128717
1128973
1129229
1129485
1129741
1129997
1130253
1114126
1114382
1114638
1114894
1115150
1115406
1115662
1115918
1116174
1116430
1116686
1116942
1117198
1117454
1117710
1117966
1118222
1118478
1118734
1118990
1119246
1119502
1119758
1120014
1120270
1120526
1120782
1121038
1121294
1121550
1121806
1122062
1122318
1122574
1122830
1123086
1123342
1123598
1123854
1124110
1124366
1124622
1124878
1125134
1125390
1125646
1125902
1126158
1126414
1126670
1126926
1127182
1127438
1127694
1127950
1128206
1128462
1128718
1128974
1129230
1129486
1129742
1129998
1130254
1114127
1114383
1114639
1114895
1115151
1115407
1115663
1115919
1116175
1116431
1116687
1116943
1117199
1117455
1117711
1117967
1118223
1118479
1118735
1118991
1119247
1119503
1119759
1120015
1120271
1120527
1120783
1121039
1121295
1121551
1121807
1122063
1122319
1122575
1122831
1123087
1123343
1123599
1123855
1124111
1124367
1124623
1124879
1125135
1125391
1125647
1125903
1126159
1126415
1126671
1126927
1127183
1127439
1127695
1127951
1128207
1128463
1128719
1128975
1129231
1129487
1129743
1129999
1130255
1114128
1114384
1114640
1114896
1115152
1115408
1115664
1115920
1116176
1116432
1116688
1116944
1117200
1117456
1117712
1117968
1118224
1118480
1118736
1118992
1119248
1119504
1119760
1120016
1120272
1120528
1120784
1121040
1121296
1121552
1121808
1122064
1122320
1122576
1122832
1123088
1123344
1123600
1123856
1124112
1124368
1124624
1124880
1125136
1125392
1125648
1125904
1126160
1126416
1126672
1126928
1127184
1127440
1127696
1127952
1128208
1128464
1128720
1128976
1129232
1129488
1129744
1130000
1130256
1114129
1114385
1114641
1114897
1115153
1115409
1115665
1115921
1116177
1116433
1116689
1116945
1117201
1117457
1117713
1117969
1118225
1118481
1118737
1118993
1119249
1119505
1119761
1120017
1120273
1120529
1120785
1121041
1121297
1121553
1121809
1122065
1122321
1122577
1122833
1123089
1123345
1123601
1123857
1124113
1124369
1124625
1124881
1125137
1125393
1125649
1125905
1126161
1126417
1126673
1126929
1127185
1127441
1127697
1127953
1128209
1128465
1128721
1128977
1129233
1129489
1129745
1130001
1130257
1114130
1114386
1114642
1114898
1115154
1115410
1115666
1115922
1116178
1116434
1116690
1116946
1117202
1117458
1117714
1117970
1118226
1118482
1118738
1118994
1119250
1119506
1119762
1120018
1120274
1120530
1120786
1121042
1121298
1121554
1121810
1122066
1122322
1122578
1122834
1123090
1123346
1123602
1123858
1124114
1124370
1124626
1124882
1125138
1125394
1125650
1125906
1126162
1126418
1126674
1126930
1127186
1127442
1127698
1127954
1128210
1128466
1128722
1128978
1129234
1129490
1129746
1130002
1130258
1114131
1114387
1114643
1114899
1115155
1115411
1115667
1115923
1116179
1116435
1116691
1116947
1117203
1117459
1117715
1117971
1118227
1118483
1118739
1118995
1119251
1119507
1119763
1120019
1120275
1120531
1120787
1121043
1121299
1121555
1121811
1122067
1122323
1122579
1122835
1123091
1123347
1123603
1123859
1124115
1124371
1124627
1124883
1125139
1125395
1125651
1125907
1126163
1126419
1126675
1126931
1127187
1127443
1127699
1127955
1128211
1128467
1128723
1128979
1129235
1129491
1129747
1130003
1130259
1114132
1114388
1114644
1114900
1115156
1115412
1115668
1115924
1116180
1116436
1116692
1116948
1117204
1117460
1117716
1117972
1118228
1118484
1118740
1118996
1119252
1119508
1119764
1120020
1120276
1120532
1120788
1121044
1121300
1121556
1121812
1122068
1122324
1122580
1122836
1123092
1123348
1123604
1123860
1124116
1124372
1124628
1124884
1125140
1125396
1125652
1125908
1126164
1126420
1126676
1126932
1127188
1127444
1127700
1127956
1128212
1128468
1128724
1128980
1129236
1129492
1129748
1130004
1130260
1114133
1114389
1114645
1114901
1115157
1115413
1115669
1115925
1116181
1116437
1116693
1116949
1117205
1117461
1117717
1117973
1118229
1118485
1118741
1118997
1119253
1119509
1119765
1120021
1120277
1120533
1120789
1121045
1121301
1121557
1121813
1122069
1122325
1122581
1122837
1123093
1123349
1123605
1123861
1124117
1124373
1124629
1124885
1125141
1125397
1125653
1125909
1126165
1126421
1126677
1126933
1127189
1127445
1127701
1127957
1128213
1128469
1128725
1128981
1129237
1129493
1129749
1130005
1130261
1114134
1114390
1114646
1114902
1115158
1115414
1115670
1115926
1116182
1116438
1116694
1116950
1117206
1117462
1117718
1117974
1118230
1118486
1118742
1118998
1119254
1119510
1119766
1120022
1120278
1120534
1120790
1121046
1121302
1121558
1121814
1122070
1122326
1122582
1122838
1123094
1123350
1123606
1123862
1124118
1124374
1124630
1124886
1125142
1125398
1125654
1125910
1126166
1126422
1126678
1126934
1127190
1127446
1127702
1127958
1128214
1128470
1128726
1128982
1129238
1129494
1129750
1130006
1130262
1114135
1114391
1114647
1114903
1115159
1115415
1115671
1115927
1116183
1116439
1116695
1116951
1117207
1117463
1117719
1117975
1118231
1118487
1118743
1118999
1119255
1119511
1119767
1120023
1120279
1120535
1120791
1121047
1121303
1121559
1121815
1122071
1122327
1122583
1122839
1123095
1123351
1123607
1123863
1124119
1124375
1124631
1124887
1125143
1125399
1125655
1125911
1126167
1126423
1126679
1126935
1127191
1127447
1127703
1127959
1128215
1128471
1128727
1128983
1129239
1129495
1129751
1130007
1130263
1114136
1114392
1114648
1114904
1115160
1115416
1115672
1115928
1116184
1116440
1116696
1116952
1117208
1117464
1117720
1117976
1118232
1118488
1118744
1119000
1119256
1119512
1119768
1120024
1120280
1120536
1120792
1121048
1121304
1121560
1121816
1122072
1122328
1122584
1122840
1123096
1123352
1123608
1123864
1124120
1124376
1124632
1124888
1125144
1125400
1125656
1125912
1126168
1126424
1126680
1126936
1127192
1127448
1127704
1127960
1128216
1128472
1128728
1128984
1129240
1129496
1129752
1130008
1130264
1114137
1114393
1114649
1114905
1115161
1115417
1115673
1115929
1116185
1116441
1116697
1116953
1117209
1117465
1117721
1117977
1118233
1118489
1118745
1119001
1119257
1119513
1119769
1120025
1120281
1120537
1120793
1121049
1121305
1121561
1121817
1122073
1122329
1122585
1122841
1123097
1123353
1123609
1123865
1124121
1124377
1124633
1124889
1125145
1125401
1125657
1125913
1126169
1126425
1126681
1126937
1127193
1127449
1127705
1127961
1128217
1128473
1128729
1128985
1129241
1129497
1129753
1130009
1130265
1114138
1114394
1114650
1114906
1115162
1115418
1115674
1115930
1116186
1116442
1116698
1116954
1117210
1117466
1117722
1117978
1118234
1118490
1118746
1119002
1119258
1119514
1119770
1120026
1120282
1120538
1120794
1121050
1121306
1121562
1121818
1122074
1122330
1122586
1122842
1123098
1123354
1123610
1123866
1124122
1124378
1124634
1124890
1125146
1125402
1125658
1125914
1126170
1126426
1126682
1126938
1127194
1127450
1127706
1127962
1128218
1128474
1128730
1128986
1129242
1129498
1129754
1130010
1130266
1114139
1114395
1114651
1114907
1115163
1115419
1115675
1115931
1116187
1116443
1116699
1116955
1117211
1117467
1117723
1117979
1118235
1118491
1118747
1119003
1119259
1119515
1119771
1120027
1120283
1120539
1120795
1121051
1121307
1121563
1121819
1122075
1122331
1122587
1122843
1123099
1123355
1123611
1123867
1124123
1124379
1124635
1124891
1125147
1125403
1125659
1125915
1126171
1126427
1126683
1126939
1127195
1127451
1127707
1127963
1128219
1128475
1128731
1128987
1129243
1129499
1129755
1130011
1130267
1114140
1114396
1114652
1114908
1115164
1115420
1115676
1115932
1116188
1116444
1116700
1116956
1117212
1117468
1117724
1117980
1118236
1118492
1118748
1119004
1119260
1119516
1119772
1120028
1120284
1120540
1120796
1121052
1121308
1121564
1121820
1122076
1122332
1122588
1122844
1123100
1123356
1123612
1123868
1124124
1124380
1124636
1124892
1125148
1125404
1125660
1125916
1126172
1126428
1126684
1126940
1127196
1127452
1127708
1127964
1128220
1128476
1128732
1128988
1129244
1129500
1129756
1130012
1130268
1114141
1114397
1114653
1114909
1115165
1115421
1115677
1115933
1116189
1116445
1116701
1116957
1117213
1117469
1117725
1117981
1118237
1118493
1118749
1119005
1119261
1119517
1119773
1120029
1120285
1120541
1120797
1121053
1121309
1121565
1121821
1122077
1122333
1122589
1122845
1123101
1123357
1123613
1123869
1124125
1124381
1124637
1124893
1125149
1125405
1125661
1125917
1126173
1126429
1126685
1126941
1127197
1127453
1127709
1127965
1128221
1128477
1128733
1128989
1129245
1129501
1129757
1130013
1130269
1114142
1114398
1114654
1114910
1115166
1115422
1115678
1115934
1116190
1116446
1116702
1116958
1117214
1117470
1117726
1117982
1118238
1118494
1118750
1119006
1119262
1119518
1119774
1120030
1120286
1120542
1120798
1121054
1121310
1121566
1121822
1122078
1122334
1122590
1122846
1123102
1123358
1123614
1123870
1124126
1124382
1124638
1124894
1125150
1125406
1125662
1125918
1126174
1126430
1126686
1126942
1127198
1127454
1127710
1127966
1128222
1128478
1128734
1128990
1129246
1129502
1129758
1130014
1130270
1114143
1114399
1114655
1114911
1115167
1115423
1115679
1115935
1116191
1116447
1116703
1116959
1117215
1117471
1117727
1117983
1118239
1118495
1118751
1119007
1119263
1119519
1119775
1120031
1120287
1120543
1120799
1121055
1121311
1121567
1121823
1122079
1122335
1122591
1122847
1123103
1123359
1123615
1123871
1124127
1124383
1124639
1124895
1125151
1125407
1125663
1125919
1126175
1126431
1126687
1126943
1127199
1127455
1127711
1127967
1128223
1128479
1128735
1128991
1129247
1129503
1129759
1130015
1130271
1114144
1114400
1114656
1114912
1115168
1115424
1115680
1115936
1116192
1116448
1116704
1116960
1117216
1117472
1117728
1117984
1118240
1118496
1118752
1119008
1119264
1119520
1119776
1120032
1120288
1120544
1120800
1121056
1121312
1121568
1121824
1122080
1122336
1122592
1122848
1123104
1123360
1123616
1123872
1124128
1124384
1124640
1124896
1125152
1125408
1125664
1125920
1126176
1126432
1126688
1126944
1127200
1127456
1127712
1127968
1128224
1128480
1128736
1128992
1129248
1129504
1129760
1130016
1130272
1114145
1114401
1114657
1114913
1115169
1115425
1115681
1115937
1116193
1116449
1116705
1116961
1117217
1117473
1117729
1117985
1118241
1118497
1118753
1119009
1119265
1119521
1119777
1120033
1120289
1120545
1120801
1121057
1121313
1121569
1121825
1122081
1122337
1122593
1122849
1123105
1123361
1123617
1123873
1124129
1124385
1124641
1124897
1125153
1125409
1125665
1125921
1126177
1126433
1126689
1126945
1127201
1127457
1127713
1127969
1128225
1128481
1128737
1128993
1129249
1129505
1129761
1130017
1130273
1114146
1114402
1114658
1114914
1115170
1115426
1115682
1115938
1116194
1116450
1116706
1116962
1117218
1117474
1117730
1117986
1118242
1118498
1118754
1119010
1119266
1119522
1119778
1120034
1120290
1120546
1120802
1121058
1121314
1121570
1121826
1122082
1122338
1122594
1122850
1123106
1123362
1123618
1123874
1124130
1124386
1124642
1124898
1125154
1125410
1125666
1125922
1126178
1126434
1126690
1126946
1127202
1127458
1127714
1127970
1128226
1128482
1128738
1128994
1129250
1129506
1129762
1130018
1130274
1114147
1114403
1114659
1114915
1115171
1115427
1115683
1115939
1116195
1116451
1116707
1116963
1117219
1117475
1117731
1117987
1118243
1118499
1118755
1119011
1119267
1119523
1119779
1120035
1120291
1120547
1120803
1121059
1121315
1121571
1121827
1122083
1122339
1122595
1122851
1123107
1123363
1123619
1123875
1124131
1124387
1124643
1124899
1125155
1125411
1125667
1125923
1126179
1126435
1126691
1126947
1127203
1127459
1127715
1127971
1128227
1128483
1128739
1128995
1129251
1129507
1129763
1130019
1130275
1114148
1114404
1114660
1114916
1115172
1115428
1115684
1115940
1116196
1116452
1116708
1116964
1117220
1117476
1117732
1117988
1118244
1118500
1118756
1119012
1119268
1119524
1119780
1120036
1120292
1120548
1120804
1121060
1121316
1121572
1121828
1122084
1122340
1122596
1122852
1123108
1123364
1123620
1123876
1124132
1124388
1124644
1124900
1125156
1125412
1125668
1125924
1126180
1126436
1126692
1126948
1127204
1127460
1127716
1127972
1128228
1128484
1128740
1128996
1129252
1129508
1129764
1130020
1130276
1114149
1114405
1114661
1114917
1115173
1115429
1115685
1115941
1116197
1116453
1116709
1116965
1117221
1117477
1117733
1117989
1118245
1118501
1118757
1119013
1119269
1119525
1119781
1120037
1120293
1120549
1120805
1121061
1121317
1121573
1121829
1122085
1122341
1122597
1122853
1123109
1123365
1123621
1123877
1124133
1124389
1124645
1124901
1125157
1125413
1125669
1125925
1126181
1126437
1126693
1126949
1127205
1127461
1127717
1127973
1128229
1128485
1128741
1128997
1129253
1129509
1129765
1130021
1130277
1114150
1114406
1114662
1114918
1115174
1115430
1115686
1115942
1116198
1116454
1116710
1116966
1117222
1117478
1117734
1117990
1118246
1118502
1118758
1119014
1119270
1119526
1119782
1120038
1120294
1120550
1120806
1121062
1121318
1121574
1121830
1122086
1122342
1122598
1122854
1123110
1123366
1123622
1123878
1124134
1124390
1124646
1124902
1125158
1125414
1125670
1125926
1126182
1126438
1126694
1126950
1127206
1127462
1127718
1127974
1128230
1128486
1128742
1128998
1129254
1129510
1129766
1130022
1130278
1114151
1114407
1114663
1114919
1115175
1115431
1115687
1115943
1116199
1116455
1116711
1116967
1117223
1117479
1117735
1117991
1118247
1118503
1118759
1119015
1119271
1119527
1119783
1120039
1120295
1120551
1120807
1121063
1121319
1121575
1121831
1122087
1122343
1122599
1122855
1123111
1123367
1123623
1123879
1124135
1124391
1124647
1124903
1125159
1125415
1125671
1125927
1126183
1126439
1126695
1126951
1127207
1127463
1127719
1127975
1128231
1128487
1128743
1128999
1129255
1129511
1129767
1130023
1130279
1114152
1114408
1114664
1114920
1115176
1115432
1115688
1115944
1116200
1116456
1116712
1116968
1117224
1117480
1117736
1117992
1118248
1118504
1118760
1119016
1119272
1119528
1119784
1120040
1120296
1120552
1120808
1121064
1121320
1121576
1121832
1122088
1122344
1122600
1122856
1123112
1123368
1123624
1123880
1124136
1124392
1124648
1124904
1125160
1125416
1125672
1125928
1126184
1126440
1126696
1126952
1127208
1127464
1127720
1127976
1128232
1128488
1128744
1129000
1129256
1129512
1129768
1130024
1130280
1114153
1114409
1114665
1114921
1115177
1115433
1115689
1115945
1116201
1116457
1116713
1116969
1117225
1117481
1117737
1117993
1118249
1118505
1118761
1119017
1119273
1119529
1119785
1120041
1120297
1120553
1120809
1121065
1121321
1121577
1121833
1122089
1122345
1122601
1122857
1123113
1123369
1123625
1123881
1124137
1124393
1124649
1124905
1125161
1125417
1125673
1125929
1126185
1126441
1126697
1126953
1127209
1127465
1127721
1127977
1128233
1128489
1128745
1129001
1129257
1129513
1129769
1130025
1130281
1114154
1114410
1114666
1114922
1115178
1115434
1115690
1115946
1116202
1116458
1116714
1116970
1117226
1117482
1117738
1117994
1118250
1118506
1118762
1119018
1119274
1119530
1119786
1120042
1120298
1120554
1120810
1121066
1121322
1121578
1121834
1122090
1122346
1122602
1122858
1123114
1123370
1123626
1123882
1124138
1124394
1124650
1124906
1125162
1125418
1125674
1125930
1126186
1126442
1126698
1126954
1127210
1127466
1127722
1127978
1128234
1128490
1128746
1129002
1129258
1129514
1129770
1130026
1130282
1114155
1114411
1114667
1114923
1115179
1115435
1115691
1115947
1116203
1116459
1116715
1116971
1117227
1117483
1117739
1117995
1118251
1118507
1118763
1119019
1119275
1119531
1119787
1120043
1120299
1120555
1120811
1121067
1121323
1121579
1121835
1122091
1122347
1122603
1122859
1123115
1123371
1123627
1123883
1124139
1124395
1124651
1124907
1125163
1125419
1125675
1125931
1126187
1126443
1126699
1126955
1127211
1127467
1127723
1127979
1128235
1128491
1128747
1129003
1129259
1129515
1129771
1130027
1130283
1114156
1114412
1114668
1114924
1115180
1115436
1115692
1115948
1116204
1116460
1116716
1116972
1117228
1117484
1117740
1117996
1118252
1118508
1118764
1119020
1119276
1119532
1119788
1120044
1120300
1120556
1120812
1121068
1121324
1121580
1121836
1122092
1122348
1122604
1122860
1123116
1123372
1123628
1123884
1124140
1124396
1124652
1124908
1125164
1125420
1125676
1125932
1126188
1126444
1126700
1126956
1127212
1127468
1127724
1127980
1128236
1128492
1128748
1129004
1129260
1129516
1129772
1130028
1130284
1114157
1114413
1114669
1114925
1115181
1115437
1115693
1115949
1116205
1116461
1116717
1116973
1117229
1117485
1117741
1117997
1118253
1118509
1118765
1119021
1119277
1119533
1119789
1120045
1120301
1120557
1120813
1121069
1121325
1121581
1121837
1122093
1122349
1122605
1122861
1123117
1123373
1123629
1123885
1124141
1124397
1124653
1124909
1125165
1125421
1125677
1125933
1126189
1126445
1126701
1126957
1127213
1127469
1127725
1127981
1128237
1128493
1128749
1129005
1129261
1129517
1129773
1130029
1130285
1114158
1114414
1114670
1114926
1115182
1115438
1115694
1115950
1116206
1116462
1116718
1116974
1117230
1117486
1117742
1117998
1118254
1118510
1118766
1119022
1119278
1119534
1119790
1120046
1120302
1120558
1120814
1121070
1121326
1121582
1121838
1122094
1122350
1122606
1122862
1123118
1123374
1123630
1123886
1124142
1124398
1124654
1124910
1125166
1125422
1125678
1125934
1126190
1126446
1126702
1126958
1127214
1127470
1127726
1127982
1128238
1128494
1128750
1129006
1129262
1129518
1129774
1130030
1130286
1114159
1114415
1114671
1114927
1115183
1115439
1115695
1115951
1116207
1116463
1116719
1116975
1117231
1117487
1117743
1117999
1118255
1118511
1118767
1119023
1119279
1119535
1119791
1120047
1120303
1120559
1120815
1121071
1121327
1121583
1121839
1122095
1122351
1122607
1122863
1123119
1123375
1123631
1123887
1124143
1124399
1124655
1124911
1125167
1125423
1125679
1125935
1126191
1126447
1126703
1126959
1127215
1127471
1127727
1127983
1128239
1128495
1128751
1129007
1129263
1129519
1129775
1130031
1130287
1114160
1114416
1114672
1114928
1115184
1115440
1115696
1115952
1116208
1116464
1116720
1116976
1117232
1117488
1117744
1118000
1118256
1118512
1118768
1119024
1119280
1119536
1119792
1120048
1120304
1120560
1120816
1121072
1121328
1121584
1121840
1122096
1122352
1122608
1122864
1123120
1123376
1123632
1123888
1124144
1124400
1124656
1124912
1125168
1125424
1125680
1125936
1126192
1126448
1126704
1126960
1127216
1127472
1127728
1127984
1128240
1128496
1128752
1129008
1129264
1129520
1129776
1130032
1130288
1114161
1114417
1114673
1114929
1115185
1115441
1115697
1115953
1116209
1116465
1116721
1116977
1117233
1117489
1117745
1118001
1118257
1118513
1118769
1119025
1119281
1119537
1119793
1120049
1120305
1120561
1120817
1121073
1121329
1121585
1121841
1122097
1122353
1122609
1122865
1123121
1123377
1123633
1123889
1124145
1124401
1124657
1124913
1125169
1125425
1125681
1125937
1126193
1126449
1126705
1126961
1127217
1127473
1127729
1127985
1128241
1128497
1128753
1129009
1129265
1129521
1129777
1130033
1130289
1114162
1114418
1114674
1114930
1115186
1115442
1115698
1115954
1116210
1116466
1116722
1116978
1117234
1117490
1117746
1118002
1118258
1118514
1118770
1119026
1119282
1119538
1119794
1120050
1120306
1120562
1120818
1121074
1121330
1121586
1121842
1122098
1122354
1122610
1122866
1123122
1123378
1123634
1123890
1124146
1124402
1124658
1124914
1125170
1125426
1125682
1125938
1126194
1126450
1126706
1126962
1127218
1127474
1127730
1127986
1128242
1128498
1128754
1129010
1129266
1129522
1129778
1130034
1130290
1114163
1114419
1114675
1114931
1115187
1115443
1115699
1115955
1116211
1116467
1116723
1116979
1117235
1117491
1117747
1118003
1118259
1118515
1118771
1119027
1119283
1119539
1119795
1120051
1120307
1120563
1120819
1121075
1121331
1121587
1121843
1122099
1122355
1122611
1122867
1123123
1123379
1123635
1123891
1124147
1124403
1124659
1124915
1125171
1125427
1125683
1125939
1126195
1126451
1126707
1126963
1127219
1127475
1127731
1127987
1128243
1128499
1128755
1129011
1129267
1129523
1129779
1130035
1130291
1114164
1114420
1114676
1114932
1115188
1115444
1115700
1115956
1116212
1116468
1116724
1116980
1117236
1117492
1117748
1118004
1118260
1118516
1118772
1119028
1119284
1119540
1119796
1120052
1120308
1120564
1120820
1121076
1121332
1121588
1121844
1122100
1122356
1122612
1122868
1123124
1123380
1123636
1123892
1124148
1124404
1124660
1124916
1125172
1125428
1125684
1125940
1126196
1126452
1126708
1126964
1127220
1127476
1127732
1127988
1128244
1128500
1128756
1129012
1129268
1129524
1129780
1130036
1130292
1114165
1114421
1114677
1114933
1115189
1115445
1115701
1115957
1116213
1116469
1116725
1116981
1117237
1117493
1117749
1118005
1118261
1118517
1118773
1119029
1119285
1119541
1119797
1120053
1120309
1120565
1120821
1121077
1121333
1121589
1121845
1122101
1122357
1122613
1122869
1123125
1123381
1123637
1123893
1124149
1124405
1124661
1124917
1125173
1125429
1125685
1125941
1126197
1126453
1126709
1126965
1127221
1127477
1127733
1127989
1128245
1128501
1128757
1129013
1129269
1129525
1129781
1130037
1130293
1114166
1114422
1114678
1114934
1115190
1115446
1115702
1115958
1116214
1116470
1116726
1116982
1117238
1117494
1117750
1118006
1118262
1118518
1118774
1119030
1119286
1119542
1119798
1120054
1120310
1120566
1120822
1121078
1121334
1121590
1121846
1122102
1122358
1122614
1122870
1123126
1123382
1123638
1123894
1124150
1124406
1124662
1124918
1125174
1125430
1125686
1125942
1126198
1126454
1126710
1126966
1127222
1127478
1127734
1127990
1128246
1128502
1128758
1129014
1129270
1129526
1129782
1130038
1130294
1114167
1114423
1114679
1114935
1115191
1115447
1115703
1115959
1116215
1116471
1116727
1116983
1117239
1117495
1117751
1118007
1118263
1118519
1118775
1119031
1119287
1119543
1119799
1120055
1120311
1120567
1120823
1121079
1121335
1121591
1121847
1122103
1122359
1122615
1122871
1123127
1123383
1123639
1123895
1124151
1124407
1124663
1124919
1125175
1125431
1125687
1125943
1126199
1126455
1126711
1126967
1127223
1127479
1127735
1127991
1128247
1128503
1128759
1129015
1129271
1129527
1129783
1130039
1130295
1114168
1114424
1114680
1114936
1115192
1115448
1115704
1115960
1116216
1116472
1116728
1116984
1117240
1117496
1117752
1118008
1118264
1118520
1118776
1119032
1119288
1119544
1119800
1120056
1120312
1120568
1120824
1121080
1121336
1121592
1121848
1122104
1122360
1122616
1122872
1123128
1123384
1123640
1123896
1124152
1124408
1124664
1124920
1125176
1125432
1125688
1125944
1126200
1126456
1126712
1126968
1127224
1127480
1127736
1127992
1128248
1128504
1128760
1129016
1129272
1129528
1129784
1130040
1130296
1114169
1114425
1114681
1114937
1115193
1115449
1115705
1115961
1116217
1116473
1116729
1116985
1117241
1117497
1117753
1118009
1118265
1118521
1118777
1119033
1119289
1119545
1119801
1120057
1120313
1120569
1120825
1121081
1121337
1121593
1121849
1122105
1122361
1122617
1122873
1123129
1123385
1123641
1123897
1124153
1124409
1124665
1124921
1125177
1125433
1125689
1125945
1126201
1126457
1126713
1126969
1127225
1127481
1127737
1127993
1128249
1128505
1128761
1129017
1129273
1129529
1129785
1130041
1130297
1114170
1114426
1114682
1114938
1115194
1115450
1115706
1115962
1116218
1116474
1116730
1116986
1117242
1117498
1117754
1118010
1118266
1118522
1118778
1119034
1119290
1119546
1119802
1120058
1120314
1120570
1120826
1121082
1121338
1121594
1121850
1122106
1122362
1122618
1122874
1123130
1123386
1123642
1123898
1124154
1124410
1124666
1124922
1125178
1125434
1125690
1125946
1126202
1126458
1126714
1126970
1127226
1127482
1127738
1127994
1128250
1128506
1128762
1129018
1129274
1129530
1129786
1130042
1130298
1114171
1114427
1114683
1114939
1115195
1115451
1115707
1115963
1116219
1116475
1116731
1116987
1117243
1117499
1117755
1118011
1118267
1118523
1118779
1119035
1119291
1119547
1119803
1120059
1120315
1120571
1120827
1121083
1121339
1121595
1121851
1122107
1122363
1122619
1122875
1123131
1123387
1123643
1123899
1124155
1124411
1124667
1124923
1125179
1125435
1125691
1125947
1126203
1126459
1126715
1126971
1127227
1127483
1127739
1127995
1128251
1128507
1128763
1129019
1129275
1129531
1129787
1130043
1130299
1114172
1114428
1114684
1114940
1115196
1115452
1115708
1115964
1116220
1116476
1116732
1116988
1117244
1117500
1117756
1118012
1118268
1118524
1118780
1119036
1119292
1119548
1119804
1120060
1120316
1120572
1120828
1121084
1121340
1121596
1121852
1122108
1122364
1122620
1122876
1123132
1123388
1123644
1123900
1124156
1124412
1124668
1124924
1125180
1125436
1125692
1125948
1126204
1126460
1126716
1126972
1127228
1127484
1127740
1127996
1128252
1128508
1128764
1129020
1129276
1129532
1129788
1130044
1130300
1114173
1114429
1114685
1114941
1115197
1115453
1115709
1115965
1116221
1116477
1116733
1116989
1117245
1117501
1117757
1118013
1118269
1118525
1118781
1119037
1119293
1119549
1119805
1120061
1120317
1120573
1120829
1121085
1121341
1121597
1121853
1122109
1122365
1122621
1122877
1123133
1123389
1123645
1123901
1124157
1124413
1124669
1124925
1125181
1125437
1125693
1125949
1126205
1126461
1126717
1126973
1127229
1127485
1127741
1127997
1128253
1128509
1128765
1129021
1129277
1129533
1129789
1130045
1130301
1114174
1114430
1114686
1114942
1115198
1115454
1115710
1115966
1116222
1116478
1116734
1116990
1117246
1117502
1117758
1118014
1118270
1118526
1118782
1119038
1119294
1119550
1119806
1120062
1120318
1120574
1120830
1121086
1121342
1121598
1121854
1122110
1122366
1122622
1122878
1123134
1123390
1123646
1123902
1124158
1124414
1124670
1124926
1125182
1125438
1125694
1125950
1126206
1126462
1126718
1126974
1127230
1127486
1127742
1127998
1128254
1128510
1128766
1129022
1129278
1129534
1129790
1130046
1130302
1114175
1114431
1114687
1114943
1115199
1115455
1115711
1115967
1116223
1116479
1116735
1116991
1117247
1117503
1117759
1118015
1118271
1118527
1118783
1119039
1119295
1119551
1119807
1120063
1120319
1120575
1120831
1121087
1121343
1121599
1121855
1122111
1122367
1122623
1122879
1123135
1123391
1123647
1123903
1124159
1124415
1124671
1124927
1125183
1125439
1125695
1125951
1126207
1126463
1126719
1126975
1127231
1127487
1127743
1127999
1128255
1128511
1128767
1129023
1129279
1129535
1129791
1130047
1130303
1114176
1114432
1114688
1114944
1115200
1115456
1115712
1115968
1116224
1116480
1116736
1116992
1117248
1117504
1117760
1118016
1118272
1118528
1118784
1119040
1119296
1119552
1119808
1120064
1120320
1120576
1120832
1121088
1121344
1121600
1121856
1122112
1122368
1122624
1122880
1123136
1123392
1123648
1123904
1124160
1124416
1124672
1124928
1125184
1125440
1125696
1125952
1126208
1126464
1126720
1126976
1127232
1127488
1127744
1128000
1128256
1128512
1128768
1129024
1129280
1129536
1129792
1130048
1130304
1114177
1114433
1114689
1114945
1115201
1115457
1115713
1115969
1116225
1116481
1116737
1116993
1117249
1117505
1117761
1118017
1118273
1118529
1118785
1119041
1119297
1119553
1119809
1120065
1120321
1120577
1120833
1121089
1121345
1121601
1121857
1122113
1122369
1122625
1122881
1123137
1123393
1123649
1123905
1124161
1124417
1124673
1124929
1125185
1125441
1125697
1125953
1126209
1126465
1126721
1126977
1127233
1127489
1127745
1128001
1128257
1128513
1128769
1129025
1129281
1129537
1129793
1130049
1130305
1114178
1114434
1114690
1114946
1115202
1115458
1115714
1115970
1116226
1116482
1116738
1116994
1117250
1117506
1117762
1118018
1118274
1118530
1118786
1119042
1119298
1119554
1119810
1120066
1120322
1120578
1120834
1121090
1121346
1121602
1121858
1122114
1122370
1122626
1122882
1123138
1123394
1123650
1123906
1124162
1124418
1124674
1124930
1125186
1125442
1125698
1125954
1126210
1126466
1126722
1126978
1127234
1127490
1127746
1128002
1128258
1128514
1128770
1129026
1129282
1129538
1129794
1130050
1130306
1114179
1114435
1114691
1114947
1115203
1115459
1115715
1115971
1116227
1116483
1116739
1116995
1117251
1117507
1117763
1118019
1118275
1118531
1118787
1119043
1119299
1119555
1119811
1120067
1120323
1120579
1120835
1121091
1121347
1121603
1121859
1122115
1122371
1122627
1122883
1123139
1123395
1123651
1123907
1124163
1124419
1124675
1124931
1125187
1125443
1125699
1125955
1126211
1126467
1126723
1126979
1127235
1127491
1127747
1128003
1128259
1128515
1128771
1129027
1129283
1129539
1129795
1130051
1130307
1114180
1114436
1114692
1114948
1115204
1115460
1115716
1115972
1116228
1116484
1116740
1116996
1117252
1117508
1117764
1118020
1118276
1118532
1118788
1119044
1119300
1119556
1119812
1120068
1120324
1120580
1120836
1121092
1121348
1121604
1121860
1122116
1122372
1122628
1122884
1123140
1123396
1123652
1123908
1124164
1124420
1124676
1124932
1125188
1125444
1125700
1125956
1126212
1126468
1126724
1126980
1127236
1127492
1127748
1128004
1128260
1128516
1128772
1129028
1129284
1129540
1129796
1130052
1130308
1114181
1114437
1114693
1114949
1115205
1115461
1115717
1115973
1116229
1116485
1116741
1116997
1117253
1117509
1117765
1118021
1118277
1118533
1118789
1119045
1119301
1119557
1119813
1120069
1120325
1120581
1120837
1121093
1121349
1121605
1121861
1122117
1122373
1122629
1122885
1123141
1123397
1123653
1123909
1124165
1124421
1124677
1124933
1125189
1125445
1125701
1125957
1126213
1126469
1126725
1126981
1127237
1127493
1127749
1128005
1128261
1128517
1128773
1129029
1129285
1129541
1129797
1130053
1130309
1114182
1114438
1114694
1114950
1115206
1115462
1115718
1115974
1116230
1116486
1116742
1116998
1117254
1117510
1117766
1118022
1118278
1118534
1118790
1119046
1119302
1119558
1119814
1120070
1120326
1120582
1120838
1121094
1121350
1121606
1121862
1122118
1122374
1122630
1122886
1123142
1123398
1123654
1123910
1124166
1124422
1124678
1124934
1125190
1125446
1125702
1125958
1126214
1126470
1126726
1126982
1127238
1127494
1127750
1128006
1128262
1128518
1128774
1129030
1129286
1129542
1129798
1130054
1130310
1114183
1114439
1114695
1114951
1115207
1115463
1115719
1115975
1116231
1116487
1116743
1116999
1117255
1117511
1117767
1118023
1118279
1118535
1118791
1119047
1119303
1119559
1119815
1120071
1120327
1120583
1120839
1121095
1121351
1121607
1121863
1122119
1122375
1122631
1122887
1123143
1123399
1123655
1123911
1124167
1124423
1124679
1124935
1125191
1125447
1125703
1125959
1126215
1126471
1126727
1126983
1127239
1127495
1127751
1128007
1128263
1128519
1128775
1129031
1129287
1129543
1129799
1130055
1130311
1114184
1114440
1114696
1114952
1115208
1115464
1115720
1115976
1116232
1116488
1116744
1117000
1117256
1117512
1117768
1118024
1118280
1118536
1118792
1119048
1119304
1119560
1119816
1120072
1120328
1120584
1120840
1121096
1121352
1121608
1121864
1122120
1122376
1122632
1122888
1123144
1123400
1123656
1123912
1124168
1124424
1124680
1124936
1125192
1125448
1125704
1125960
1126216
1126472
1126728
1126984
1127240
1127496
1127752
1128008
1128264
1128520
1128776
1129032
1129288
1129544
1129800
1130056
1130312
1114185
1114441
1114697
1114953
1115209
1115465
1115721
1115977
1116233
1116489
1116745
1117001
1117257
1117513
1117769
1118025
1118281
1118537
1118793
1119049
1119305
1119561
1119817
1120073
1120329
1120585
1120841
1121097
1121353
1121609
1121865
1122121
1122377
1122633
1122889
1123145
1123401
1123657
1123913
1124169
1124425
1124681
1124937
1125193
1125449
1125705
1125961
1126217
1126473
1126729
1126985
1127241
1127497
1127753
1128009
1128265
1128521
1128777
1129033
1129289
1129545
1129801
1130057
1130313
1114186
1114442
1114698
1114954
1115210
1115466
1115722
1115978
1116234
1116490
1116746
1117002
1117258
1117514
1117770
1118026
1118282
1118538
1118794
1119050
1119306
1119562
1119818
1120074
1120330
1120586
1120842
1121098
1121354
1121610
1121866
1122122
1122378
1122634
1122890
1123146
1123402
1123658
1123914
1124170
1124426
1124682
1124938
1125194
1125450
1125706
1125962
1126218
1126474
1126730
1126986
1127242
1127498
1127754
1128010
1128266
1128522
1128778
1129034
1129290
1129546
1129802
1130058
1130314
1114187
1114443
1114699
1114955
1115211
1115467
1115723
1115979
1116235
1116491
1116747
1117003
1117259
1117515
1117771
1118027
1118283
1118539
1118795
1119051
1119307
1119563
1119819
1120075
1120331
1120587
1120843
1121099
1121355
1121611
1121867
1122123
1122379
1122635
1122891
1123147
1123403
1123659
1123915
1124171
1124427
1124683
1124939
1125195
1125451
1125707
1125963
1126219
1126475
1126731
1126987
1127243
1127499
1127755
1128011
1128267
1128523
1128779
1129035
1129291
1129547
1129803
1130059
1130315
1114188
1114444
1114700
1114956
1115212
1115468
1115724
1115980
1116236
1116492
1116748
1117004
1117260
1117516
1117772
1118028
1118284
1118540
1118796
1119052
1119308
1119564
1119820
1120076
1120332
1120588
1120844
1121100
1121356
1121612
1121868
1122124
1122380
1122636
1122892
1123148
1123404
1123660
1123916
1124172
1124428
1124684
1124940
1125196
1125452
1125708
1125964
1126220
1126476
1126732
1126988
1127244
1127500
1127756
1128012
1128268
1128524
1128780
1129036
1129292
1129548
1129804
1130060
1130316
1114189
1114445
1114701
1114957
1115213
1115469
1115725
1115981
1116237
1116493
1116749
1117005
1117261
1117517
1117773
1118029
1118285
1118541
1118797
1119053
1119309
1119565
1119821
1120077
1120333
1120589
1120845
1121101
1121357
1121613
1121869
1122125
1122381
1122637
1122893
1123149
1123405
1123661
1123917
1124173
1124429
1124685
1124941
1125197
1125453
1125709
1125965
1126221
1126477
1126733
1126989
1127245
1127501
1127757
1128013
1128269
1128525
1128781
1129037
1129293
1129549
1129805
1130061
1130317
1114190
1114446
1114702
1114958
1115214
1115470
1115726
1115982
1116238
1116494
1116750
1117006
1117262
1117518
1117774
1118030
1118286
1118542
1118798
1119054
1119310
1119566
1119822
1120078
1120334
1120590
1120846
1121102
1121358
1121614
1121870
1122126
1122382
1122638
1122894
1123150
1123406
1123662
1123918
1124174
1124430
1124686
1124942
1125198
1125454
1125710
1125966
1126222
1126478
1126734
1126990
1127246
1127502
1127758
1128014
1128270
1128526
1128782
1129038
1129294
1129550
1129806
1130062
1130318
1114191
1114447
1114703
1114959
1115215
1115471
1115727
1115983
1116239
1116495
1116751
1117007
1117263
1117519
1117775
1118031
1118287
1118543
1118799
1119055
1119311
1119567
1119823
1120079
1120335
1120591
1120847
1121103
1121359
1121615
1121871
1122127
1122383
1122639
1122895
1123151
1123407
1123663
1123919
1124175
1124431
1124687
1124943
1125199
1125455
1125711
1125967
1126223
1126479
1126735
1126991
1127247
1127503
1127759
1128015
1128271
1128527
1128783
1129039
1129295
1129551
1129807
1130063
1130319
1114192
1114448
1114704
1114960
1115216
1115472
1115728
1115984
1116240
1116496
1116752
1117008
1117264
1117520
1117776
1118032
1118288
1118544
1118800
1119056
1119312
1119568
1119824
1120080
1120336
1120592
1120848
1121104
1121360
1121616
1121872
1122128
1122384
1122640
1122896
1123152
1123408
1123664
1123920
1124176
1124432
1124688
1124944
1125200
1125456
1125712
1125968
1126224
1126480
1126736
1126992
1127248
1127504
1127760
1128016
1128272
1128528
1128784
1129040
1129296
1129552
1129808
1130064
1130320
1114193
1114449
1114705
1114961
1115217
1115473
1115729
1115985
1116241
1116497
1116753
1117009
1117265
1117521
1117777
1118033
1118289
1118545
1118801
1119057
1119313
1119569
1119825
1120081
1120337
1120593
1120849
1121105
1121361
1121617
1121873
1122129
1122385
1122641
1122897
1123153
1123409
1123665
1123921
1124177
1124433
1124689
1124945
1125201
1125457
1125713
1125969
1126225
1126481
1126737
1126993
1127249
1127505
1127761
1128017
1128273
1128529
1128785
1129041
1129297
1129553
1129809
1130065
1130321
1114194
1114450
1114706
1114962
1115218
1115474
1115730
1115986
1116242
1116498
1116754
1117010
1117266
1117522
1117778
1118034
1118290
1118546
1118802
1119058
1119314
1119570
1119826
1120082
1120338
1120594
1120850
1121106
1121362
1121618
1121874
1122130
1122386
1122642
1122898
1123154
1123410
1123666
1123922
1124178
1124434
1124690
1124946
1125202
1125458
1125714
1125970
1126226
1126482
1126738
1126994
1127250
1127506
1127762
1128018
1128274
1128530
1128786
1129042
1129298
1129554
1129810
1130066
1130322
1114195
1114451
1114707
1114963
1115219
1115475
1115731
1115987
1116243
1116499
1116755
1117011
1117267
1117523
1117779
1118035
1118291
1118547
1118803
1119059
1119315
1119571
1119827
1120083
1120339
1120595
1120851
1121107
1121363
1121619
1121875
1122131
1122387
1122643
1122899
1123155
1123411
1123667
1123923
1124179
1124435
1124691
1124947
1125203
1125459
1125715
1125971
1126227
1126483
1126739
1126995
1127251
1127507
1127763
1128019
1128275
1128531
1128787
1129043
1129299
1129555
1129811
1130067
1130323
1114196
1114452
1114708
1114964
1115220
1115476
1115732
1115988
1116244
1116500
1116756
1117012
1117268
1117524
1117780
1118036
1118292
1118548
1118804
1119060
1119316
1119572
1119828
1120084
1120340
1120596
1120852
1121108
1121364
1121620
1121876
1122132
1122388
1122644
1122900
1123156
1123412
1123668
1123924
1124180
1124436
1124692
1124948
1125204
1125460
1125716
1125972
1126228
1126484
1126740
1126996
1127252
1127508
1127764
1128020
1128276
1128532
1128788
1129044
1129300
1129556
1129812
1130068
1130324
1114197
1114453
1114709
1114965
1115221
1115477
1115733
1115989
1116245
1116501
1116757
1117013
1117269
1117525
1117781
1118037
1118293
1118549
1118805
1119061
1119317
1119573
1119829
1120085
1120341
1120597
1120853
1121109
1121365
1121621
1121877
1122133
1122389
1122645
1122901
1123157
1123413
1123669
1123925
1124181
1124437
1124693
1124949
1125205
1125461
1125717
1125973
1126229
1126485
1126741
1126997
1127253
1127509
1127765
1128021
1128277
1128533
1128789
1129045
1129301
1129557
1129813
1130069
1130325
1114198
1114454
1114710
1114966
1115222
1115478
1115734
1115990
1116246
1116502
1116758
1117014
1117270
1117526
1117782
1118038
1118294
1118550
1118806
1119062
1119318
1119574
1119830
1120086
1120342
1120598
1120854
1121110
1121366
1121622
1121878
1122134
1122390
1122646
1122902
1123158
1123414
1123670
1123926
1124182
1124438
1124694
1124950
1125206
1125462
1125718
1125974
1126230
1126486
1126742
1126998
1127254
1127510
1127766
1128022
1128278
1128534
1128790
1129046
1129302
1129558
1129814
1130070
1130326
1114199
1114455
1114711
1114967
1115223
1115479
1115735
1115991
1116247
1116503
1116759
1117015
1117271
1117527
1117783
1118039
1118295
1118551
1118807
1119063
1119319
1119575
1119831
1120087
1120343
1120599
1120855
1121111
1121367
1121623
1121879
1122135
1122391
1122647
1122903
1123159
1123415
1123671
1123927
1124183
1124439
1124695
1124951
1125207
1125463
1125719
1125975
1126231
1126487
1126743
1126999
1127255
1127511
1127767
1128023
1128279
1128535
1128791
1129047
1129303
1129559
1129815
1130071
1130327
1114200
1114456
1114712
1114968
1115224
1115480
1115736
1115992
1116248
1116504
1116760
1117016
1117272
1117528
1117784
1118040
1118296
1118552
1118808
1119064
1119320
1119576
1119832
1120088
1120344
1120600
1120856
1121112
1121368
1121624
1121880
1122136
1122392
1122648
1122904
1123160
1123416
1123672
1123928
1124184
1124440
1124696
1124952
1125208
1125464
1125720
1125976
1126232
1126488
1126744
1127000
1127256
1127512
1127768
1128024
1128280
1128536
1128792
1129048
1129304
1129560
1129816
1130072
1130328
1114201
1114457
1114713
1114969
1115225
1115481
1115737
1115993
1116249
1116505
1116761
1117017
1117273
1117529
1117785
1118041
1118297
1118553
1118809
1119065
1119321
1119577
1119833
1120089
1120345
1120601
1120857
1121113
1121369
1121625
1121881
1122137
1122393
1122649
1122905
1123161
1123417
1123673
1123929
1124185
1124441
1124697
1124953
1125209
1125465
1125721
1125977
1126233
1126489
1126745
1127001
1127257
1127513
1127769
1128025
1128281
1128537
1128793
1129049
1129305
1129561
1129817
1130073
1130329
1114202
1114458
1114714
1114970
1115226
1115482
1115738
1115994
1116250
1116506
1116762
1117018
1117274
1117530
1117786
1118042
1118298
1118554
1118810
1119066
1119322
1119578
1119834
1120090
1120346
1120602
1120858
1121114
1121370
1121626
1121882
1122138
1122394
1122650
1122906
1123162
1123418
1123674
1123930
1124186
1124442
1124698
1124954
1125210
1125466
1125722
1125978
1126234
1126490
1126746
1127002
1127258
1127514
1127770
1128026
1128282
1128538
1128794
1129050
1129306
1129562
1129818
1130074
1130330
1114203
1114459
1114715
1114971
1115227
1115483
1115739
1115995
1116251
1116507
1116763
1117019
1117275
1117531
1117787
1118043
1118299
1118555
1118811
1119067
1119323
1119579
1119835
1120091
1120347
1120603
1120859
1121115
1121371
1121627
1121883
1122139
1122395
1122651
1122907
1123163
1123419
1123675
1123931
1124187
1124443
1124699
1124955
1125211
1125467
1125723
1125979
1126235
1126491
1126747
1127003
1127259
1127515
1127771
1128027
1128283
1128539
1128795
1129051
1129307
1129563
1129819
1130075
1130331
1114204
1114460
1114716
1114972
1115228
1115484
1115740
1115996
1116252
1116508
1116764
1117020
1117276
1117532
1117788
1118044
1118300
1118556
1118812
1119068
1119324
1119580
1119836
1120092
1120348
1120604
1120860
1121116
1121372
1121628
1121884
1122140
1122396
1122652
1122908
1123164
1123420
1123676
1123932
1124188
1124444
1124700
1124956
1125212
1125468
1125724
1125980
1126236
1126492
1126748
1127004
1127260
1127516
1127772
1128028
1128284
1128540
1128796
1129052
1129308
1129564
1129820
1130076
1130332
1114205
1114461
1114717
1114973
1115229
1115485
1115741
1115997
1116253
1116509
1116765
1117021
1117277
1117533
1117789
1118045
1118301
1118557
1118813
1119069
1119325
1119581
1119837
1120093
1120349
1120605
1120861
1121117
1121373
1121629
1121885
1122141
1122397
1122653
1122909
1123165
1123421
1123677
1123933
1124189
1124445
1124701
1124957
1125213
1125469
1125725
1125981
1126237
1126493
1126749
1127005
1127261
1127517
1127773
1128029
1128285
1128541
1128797
1129053
1129309
1129565
1129821
1130077
1130333
1114206
1114462
1114718
1114974
1115230
1115486
1115742
1115998
1116254
1116510
1116766
1117022
1117278
1117534
1117790
1118046
1118302
1118558
1118814
1119070
1119326
1119582
1119838
1120094
1120350
1120606
1120862
1121118
1121374
1121630
1121886
1122142
1122398
1122654
1122910
1123166
1123422
1123678
1123934
1124190
1124446
1124702
1124958
1125214
1125470
1125726
1125982
1126238
1126494
1126750
1127006
1127262
1127518
1127774
1128030
1128286
1128542
1128798
1129054
1129310
1129566
1129822
1130078
1130334
1114207
1114463
1114719
1114975
1115231
1115487
1115743
1115999
1116255
1116511
1116767
1117023
1117279
1117535
1117791
1118047
1118303
1118559
1118815
1119071
1119327
1119583
1119839
1120095
1120351
1120607
1120863
1121119
1121375
1121631
1121887
1122143
1122399
1122655
1122911
1123167
1123423
1123679
1123935
1124191
1124447
1124703
1124959
1125215
1125471
1125727
1125983
1126239
1126495
1126751
1127007
1127263
1127519
1127775
1128031
1128287
1128543
1128799
1129055
1129311
1129567
1129823
1130079
1130335
