1589248
1589504
1589760
1590016
1590272
1590528
1590784
1591040
1591296
1591552
1591808
1592064
1592320
1592576
1592832
1593088
1593344
1593600
1593856
1594112
1594368
1594624
1594880
1595136
1595392
1595648
1595904
1596160
1596416
1596672
1596928
1597184
1589249
1589505
1589761
1590017
1590273
1590529
1590785
1591041
1591297
1591553
1591809
1592065
1592321
1592577
1592833
1593089
1593345
1593601
1593857
1594113
1594369
1594625
1594881
1595137
1595393
1595649
1595905
1596161
1596417
1596673
1596929
1597185
1589250
1589506
1589762
1590018
1590274
1590530
1590786
1591042
1591298
1591554
1591810
1592066
1592322
1592578
1592834
1593090
1593346
1593602
1593858
1594114
1594370
1594626
1594882
1595138
1595394
1595650
1595906
1596162
1596418
1596674
1596930
1597186
1589251
1589507
1589763
1590019
1590275
1590531
1590787
1591043
1591299
1591555
1591811
1592067
1592323
1592579
1592835
1593091
1593347
1593603
1593859
1594115
1594371
1594627
1594883
1595139
1595395
1595651
1595907
1596163
1596419
1596675
1596931
1597187
1589252
1589508
1589764
1590020
1590276
1590532
1590788
1591044
1591300
1591556
1591812
1592068
1592324
1592580
1592836
1593092
1593348
1593604
1593860
1594116
1594372
1594628
1594884
1595140
1595396
1595652
1595908
1596164
1596420
1596676
1596932
1597188
1589253
1589509
1589765
1590021
1590277
1590533
1590789
1591045
1591301
1591557
1591813
1592069
1592325
1592581
1592837
1593093
1593349
1593605
1593861
1594117
1594373
1594629
1594885
1595141
1595397
1595653
1595909
1596165
1596421
1596677
1596933
1597189
1589254
1589510
1589766
1590022
1590278
1590534
1590790
1591046
1591302
1591558
1591814
1592070
1592326
1592582
1592838
1593094
1593350
1593606
1593862
1594118
1594374
1594630
1594886
1595142
1595398
1595654
1595910
1596166
1596422
1596678
1596934
1597190
1589255
1589511
1589767
1590023
1590279
1590535
1590791
1591047
1591303
1591559
1591815
1592071
1592327
1592583
1592839
1593095
1593351
1593607
1593863
1594119
1594375
1594631
1594887
1595143
1595399
1595655
1595911
1596167
1596423
1596679
1596935
1597191
1589256
1589512
1589768
1590024
1590280
1590536
1590792
1591048
1591304
1591560
1591816
1592072
1592328
1592584
1592840
1593096
1593352
1593608
1593864
1594120
1594376
1594632
1594888
1595144
1595400
1595656
1595912
1596168
1596424
1596680
1596936
1597192
1589257
1589513
1589769
1590025
1590281
1590537
1590793
1591049
1591305
1591561
1591817
1592073
1592329
1592585
1592841
1593097
1593353
1593609
1593865
1594121
1594377
1594633
1594889
1595145
1595401
1595657
1595913
1596169
1596425
1596681
1596937
1597193
1589258
1589514
1589770
1590026
1590282
1590538
1590794
1591050
1591306
1591562
1591818
1592074
1592330
1592586
1592842
1593098
1593354
1593610
1593866
1594122
1594378
1594634
1594890
1595146
1595402
1595658
1595914
1596170
1596426
1596682
1596938
1597194
1589259
1589515
1589771
1590027
1590283
1590539
1590795
1591051
1591307
1591563
1591819
1592075
1592331
1592587
1592843
1593099
1593355
1593611
1593867
1594123
1594379
1594635
1594891
1595147
1595403
1595659
1595915
1596171
1596427
1596683
1596939
1597195
1589260
1589516
1589772
1590028
1590284
1590540
1590796
1591052
1591308
1591564
1591820
1592076
1592332
1592588
1592844
1593100
1593356
1593612
1593868
1594124
1594380
1594636
1594892
1595148
1595404
1595660
1595916
1596172
1596428
1596684
1596940
1597196
1589261
1589517
1589773
1590029
1590285
1590541
1590797
1591053
1591309
1591565
1591821
1592077
1592333
1592589
1592845
1593101
1593357
1593613
1593869
1594125
1594381
1594637
1594893
1595149
1595405
1595661
1595917
1596173
1596429
1596685
1596941
1597197
1589262
1589518
1589774
1590030
1590286
1590542
1590798
1591054
1591310
1591566
1591822
1592078
1592334
1592590
1592846
1593102
1593358
1593614
1593870
1594126
1594382
1594638
1594894
1595150
1595406
1595662
1595918
1596174
1596430
1596686
1596942
1597198
1589263
1589519
1589775
1590031
1590287
1590543
1590799
1591055
1591311
1591567
1591823
1592079
1592335
1592591
1592847
1593103
1593359
1593615
1593871
1594127
1594383
1594639
1594895
1595151
1595407
1595663
1595919
1596175
1596431
1596687
1596943
1597199
1589264
1589520
1589776
1590032
1590288
1590544
1590800
1591056
1591312
1591568
1591824
1592080
1592336
1592592
1592848
1593104
1593360
1593616
1593872
1594128
1594384
1594640
1594896
1595152
1595408
1595664
1595920
1596176
1596432
1596688
1596944
1597200
1589265
1589521
1589777
1590033
1590289
1590545
1590801
1591057
1591313
1591569
1591825
1592081
1592337
1592593
1592849
1593105
1593361
1593617
1593873
1594129
1594385
1594641
1594897
1595153
1595409
1595665
1595921
1596177
1596433
1596689
1596945
1597201
1589266
1589522
1589778
1590034
1590290
1590546
1590802
1591058
1591314
1591570
1591826
1592082
1592338
1592594
1592850
1593106
1593362
1593618
1593874
1594130
1594386
1594642
1594898
1595154
1595410
1595666
1595922
1596178
1596434
1596690
1596946
1597202
1589267
1589523
1589779
1590035
1590291
1590547
1590803
1591059
1591315
1591571
1591827
1592083
1592339
1592595
1592851
1593107
1593363
1593619
1593875
1594131
1594387
1594643
1594899
1595155
1595411
1595667
1595923
1596179
1596435
1596691
1596947
1597203
1589268
1589524
1589780
1590036
1590292
1590548
1590804
1591060
1591316
1591572
1591828
1592084
1592340
1592596
1592852
1593108
1593364
1593620
1593876
1594132
1594388
1594644
1594900
1595156
1595412
1595668
1595924
1596180
1596436
1596692
1596948
1597204
1589269
1589525
1589781
1590037
1590293
1590549
1590805
1591061
1591317
1591573
1591829
1592085
1592341
1592597
1592853
1593109
1593365
1593621
1593877
1594133
1594389
1594645
1594901
1595157
1595413
1595669
1595925
1596181
1596437
1596693
1596949
1597205
1589270
1589526
1589782
1590038
1590294
1590550
1590806
1591062
1591318
1591574
1591830
1592086
1592342
1592598
1592854
1593110
1593366
1593622
1593878
1594134
1594390
1594646
1594902
1595158
1595414
1595670
1595926
1596182
1596438
1596694
1596950
1597206
1589271
1589527
1589783
1590039
1590295
1590551
1590807
1591063
1591319
1591575
1591831
1592087
1592343
1592599
1592855
1593111
1593367
1593623
1593879
1594135
1594391
1594647
1594903
1595159
1595415
1595671
1595927
1596183
1596439
1596695
1596951
1597207
1589272
1589528
1589784
1590040
1590296
1590552
1590808
1591064
1591320
1591576
1591832
1592088
1592344
1592600
1592856
1593112
1593368
1593624
1593880
1594136
1594392
1594648
1594904
1595160
1595416
1595672
1595928
1596184
1596440
1596696
1596952
1597208
1589273
1589529
1589785
1590041
1590297
1590553
1590809
1591065
1591321
1591577
1591833
1592089
1592345
1592601
1592857
1593113
1593369
1593625
1593881
1594137
1594393
1594649
1594905
1595161
1595417
1595673
1595929
1596185
1596441
1596697
1596953
1597209
1589274
1589530
1589786
1590042
1590298
1590554
1590810
1591066
1591322
1591578
1591834
1592090
1592346
1592602
1592858
1593114
1593370
1593626
1593882
1594138
1594394
1594650
1594906
1595162
1595418
1595674
1595930
1596186
1596442
1596698
1596954
1597210
1589275
1589531
1589787
1590043
1590299
1590555
1590811
1591067
1591323
1591579
1591835
1592091
1592347
1592603
1592859
1593115
1593371
1593627
1593883
1594139
1594395
1594651
1594907
1595163
1595419
1595675
1595931
1596187
1596443
1596699
1596955
1597211
1589276
1589532
1589788
1590044
1590300
1590556
1590812
1591068
1591324
1591580
1591836
1592092
1592348
1592604
1592860
1593116
1593372
1593628
1593884
1594140
1594396
1594652
1594908
1595164
1595420
1595676
1595932
1596188
1596444
1596700
1596956
1597212
1589277
1589533
1589789
1590045
1590301
1590557
1590813
1591069
1591325
1591581
1591837
1592093
1592349
1592605
1592861
1593117
1593373
1593629
1593885
1594141
1594397
1594653
1594909
1595165
1595421
1595677
1595933
1596189
1596445
1596701
1596957
1597213
1589278
1589534
1589790
1590046
1590302
1590558
1590814
1591070
1591326
1591582
1591838
1592094
1592350
1592606
1592862
1593118
1593374
1593630
1593886
1594142
1594398
1594654
1594910
1595166
1595422
1595678
1595934
1596190
1596446
1596702
1596958
1597214
1589279
1589535
1589791
1590047
1590303
1590559
1590815
1591071
1591327
1591583
1591839
1592095
1592351
1592607
1592863
1593119
1593375
1593631
1593887
1594143
1594399
1594655
1594911
1595167
1595423
1595679
1595935
1596191
1596447
1596703
1596959
1597215
1589280
1589536
1589792
1590048
1590304
1590560
1590816
1591072
1591328
1591584
1591840
1592096
1592352
1592608
1592864
1593120
1593376
1593632
1593888
1594144
1594400
1594656
1594912
1595168
1595424
1595680
1595936
1596192
1596448
1596704
1596960
1597216
1589281
1589537
1589793
1590049
1590305
1590561
1590817
1591073
1591329
1591585
1591841
1592097
1592353
1592609
1592865
1593121
1593377
1593633
1593889
1594145
1594401
1594657
1594913
1595169
1595425
1595681
1595937
1596193
1596449
1596705
1596961
1597217
1589282
1589538
1589794
1590050
1590306
1590562
1590818
1591074
1591330
1591586
1591842
1592098
1592354
1592610
1592866
1593122
1593378
1593634
1593890
1594146
1594402
1594658
1594914
1595170
1595426
1595682
1595938
1596194
1596450
1596706
1596962
1597218
1589283
1589539
1589795
1590051
1590307
1590563
1590819
1591075
1591331
1591587
1591843
1592099
1592355
1592611
1592867
1593123
1593379
1593635
1593891
1594147
1594403
1594659
1594915
1595171
1595427
1595683
1595939
1596195
1596451
1596707
1596963
1597219
1589284
1589540
1589796
1590052
1590308
1590564
1590820
1591076
1591332
1591588
1591844
1592100
1592356
1592612
1592868
1593124
1593380
1593636
1593892
1594148
1594404
1594660
1594916
1595172
1595428
1595684
1595940
1596196
1596452
1596708
1596964
1597220
1589285
1589541
1589797
1590053
1590309
1590565
1590821
1591077
1591333
1591589
1591845
1592101
1592357
1592613
1592869
1593125
1593381
1593637
1593893
1594149
1594405
1594661
1594917
1595173
1595429
1595685
1595941
1596197
1596453
1596709
1596965
1597221
1589286
1589542
1589798
1590054
1590310
1590566
1590822
1591078
1591334
1591590
1591846
1592102
1592358
1592614
1592870
1593126
1593382
1593638
1593894
1594150
1594406
1594662
1594918
1595174
1595430
1595686
1595942
1596198
1596454
1596710
1596966
1597222
1589287
1589543
1589799
1590055
1590311
1590567
1590823
1591079
1591335
1591591
1591847
1592103
1592359
1592615
1592871
1593127
1593383
1593639
1593895
1594151
1594407
1594663
1594919
1595175
1595431
1595687
1595943
1596199
1596455
1596711
1596967
1597223
1589288
1589544
1589800
1590056
1590312
1590568
1590824
1591080
1591336
1591592
1591848
1592104
1592360
1592616
1592872
1593128
1593384
1593640
1593896
1594152
1594408
1594664
1594920
1595176
1595432
1595688
1595944
1596200
1596456
1596712
1596968
1597224
1589289
1589545
1589801
1590057
1590313
1590569
1590825
1591081
1591337
1591593
1591849
1592105
1592361
1592617
1592873
1593129
1593385
1593641
1593897
1594153
1594409
1594665
1594921
1595177
1595433
1595689
1595945
1596201
1596457
1596713
1596969
1597225
1589290
1589546
1589802
1590058
1590314
1590570
1590826
1591082
1591338
1591594
1591850
1592106
1592362
1592618
1592874
1593130
1593386
1593642
1593898
1594154
1594410
1594666
1594922
1595178
1595434
1595690
1595946
1596202
1596458
1596714
1596970
1597226
1589291
1589547
1589803
1590059
1590315
1590571
1590827
1591083
1591339
1591595
1591851
1592107
1592363
1592619
1592875
1593131
1593387
1593643
1593899
1594155
1594411
1594667
1594923
1595179
1595435
1595691
1595947
1596203
1596459
1596715
1596971
1597227
1589292
1589548
1589804
1590060
1590316
1590572
1590828
1591084
1591340
1591596
1591852
1592108
1592364
1592620
1592876
1593132
1593388
1593644
1593900
1594156
1594412
1594668
1594924
1595180
1595436
1595692
1595948
1596204
1596460
1596716
1596972
1597228
1589293
1589549
1589805
1590061
1590317
1590573
1590829
1591085
1591341
1591597
1591853
1592109
1592365
1592621
1592877
1593133
1593389
1593645
1593901
1594157
1594413
1594669
1594925
1595181
1595437
1595693
1595949
1596205
1596461
1596717
1596973
1597229
1589294
1589550
1589806
1590062
1590318
1590574
1590830
1591086
1591342
1591598
1591854
1592110
1592366
1592622
1592878
1593134
1593390
1593646
1593902
1594158
1594414
1594670
1594926
1595182
1595438
1595694
1595950
1596206
1596462
1596718
1596974
1597230
1589295
1589551
1589807
1590063
1590319
1590575
1590831
1591087
1591343
1591599
1591855
1592111
1592367
1592623
1592879
1593135
1593391
1593647
1593903
1594159
1594415
1594671
1594927
1595183
1595439
1595695
1595951
1596207
1596463
1596719
1596975
1597231
1589296
1589552
1589808
1590064
1590320
1590576
1590832
1591088
1591344
1591600
1591856
1592112
1592368
1592624
1592880
1593136
1593392
1593648
1593904
1594160
1594416
1594672
1594928
1595184
1595440
1595696
1595952
1596208
1596464
1596720
1596976
1597232
1589297
1589553
1589809
1590065
1590321
1590577
1590833
1591089
1591345
1591601
1591857
1592113
1592369
1592625
1592881
1593137
1593393
1593649
1593905
1594161
1594417
1594673
1594929
1595185
1595441
1595697
1595953
1596209
1596465
1596721
1596977
1597233
1589298
1589554
1589810
1590066
1590322
1590578
1590834
1591090
1591346
1591602
1591858
1592114
1592370
1592626
1592882
1593138
1593394
1593650
1593906
1594162
1594418
1594674
1594930
1595186
1595442
1595698
1595954
1596210
1596466
1596722
1596978
1597234
1589299
1589555
1589811
1590067
1590323
1590579
1590835
1591091
1591347
1591603
1591859
1592115
1592371
1592627
1592883
1593139
1593395
1593651
1593907
1594163
1594419
1594675
1594931
1595187
1595443
1595699
1595955
1596211
1596467
1596723
1596979
1597235
1589300
1589556
1589812
1590068
1590324
1590580
1590836
1591092
1591348
1591604
1591860
1592116
1592372
1592628
1592884
1593140
1593396
1593652
1593908
1594164
1594420
1594676
1594932
1595188
1595444
1595700
1595956
1596212
1596468
1596724
1596980
1597236
1589301
1589557
1589813
1590069
1590325
1590581
1590837
1591093
1591349
1591605
1591861
1592117
1592373
1592629
1592885
1593141
1593397
1593653
1593909
1594165
1594421
1594677
1594933
1595189
1595445
1595701
1595957
1596213
1596469
1596725
1596981
1597237
1589302
1589558
1589814
1590070
1590326
1590582
1590838
1591094
1591350
1591606
1591862
1592118
1592374
1592630
1592886
1593142
1593398
1593654
1593910
1594166
1594422
1594678
1594934
1595190
1595446
1595702
1595958
1596214
1596470
1596726
1596982
1597238
1589303
1589559
1589815
1590071
1590327
1590583
1590839
1591095
1591351
1591607
1591863
1592119
1592375
1592631
1592887
1593143
1593399
1593655
1593911
1594167
1594423
1594679
1594935
1595191
1595447
1595703
1595959
1596215
1596471
1596727
1596983
1597239
1589304
1589560
1589816
1590072
1590328
1590584
1590840
1591096
1591352
1591608
1591864
1592120
1592376
1592632
1592888
1593144
1593400
1593656
1593912
1594168
1594424
1594680
1594936
1595192
1595448
1595704
1595960
1596216
1596472
1596728
1596984
1597240
1589305
1589561
1589817
1590073
1590329
1590585
1590841
1591097
1591353
1591609
1591865
1592121
1592377
1592633
1592889
1593145
1593401
1593657
1593913
1594169
1594425
1594681
1594937
1595193
1595449
1595705
1595961
1596217
1596473
1596729
1596985
1597241
1589306
1589562
1589818
1590074
1590330
1590586
1590842
1591098
1591354
1591610
1591866
1592122
1592378
1592634
1592890
1593146
1593402
1593658
1593914
1594170
1594426
1594682
1594938
1595194
1595450
1595706
1595962
1596218
1596474
1596730
1596986
1597242
1589307
1589563
1589819
1590075
1590331
1590587
1590843
1591099
1591355
1591611
1591867
1592123
1592379
1592635
1592891
1593147
1593403
1593659
1593915
1594171
1594427
1594683
1594939
1595195
1595451
1595707
1595963
1596219
1596475
1596731
1596987
1597243
1589308
1589564
1589820
1590076
1590332
1590588
1590844
1591100
1591356
1591612
1591868
1592124
1592380
1592636
1592892
1593148
1593404
1593660
1593916
1594172
1594428
1594684
1594940
1595196
1595452
1595708
1595964
1596220
1596476
1596732
1596988
1597244
1589309
1589565
1589821
1590077
1590333
1590589
1590845
1591101
1591357
1591613
1591869
1592125
1592381
1592637
1592893
1593149
1593405
1593661
1593917
1594173
1594429
1594685
1594941
1595197
1595453
1595709
1595965
1596221
1596477
1596733
1596989
1597245
1589310
1589566
1589822
1590078
1590334
1590590
1590846
1591102
1591358
1591614
1591870
1592126
1592382
1592638
1592894
1593150
1593406
1593662
1593918
1594174
1594430
1594686
1594942
1595198
1595454
1595710
1595966
1596222
1596478
1596734
1596990
1597246
1589311
1589567
1589823
1590079
1590335
1590591
1590847
1591103
1591359
1591615
1591871
1592127
1592383
1592639
1592895
1593151
1593407
1593663
1593919
1594175
1594431
1594687
1594943
1595199
1595455
1595711
1595967
1596223
1596479
1596735
1596991
1597247
1589312
1589568
1589824
1590080
1590336
1590592
1590848
1591104
1591360
1591616
1591872
1592128
1592384
1592640
1592896
1593152
1593408
1593664
1593920
1594176
1594432
1594688
1594944
1595200
1595456
1595712
1595968
1596224
1596480
1596736
1596992
1597248
1589313
1589569
1589825
1590081
1590337
1590593
1590849
1591105
1591361
1591617
1591873
1592129
1592385
1592641
1592897
1593153
1593409
1593665
1593921
1594177
1594433
1594689
1594945
1595201
1595457
1595713
1595969
1596225
1596481
1596737
1596993
1597249
1589314
1589570
1589826
1590082
1590338
1590594
1590850
1591106
1591362
1591618
1591874
1592130
1592386
1592642
1592898
1593154
1593410
1593666
1593922
1594178
1594434
1594690
1594946
1595202
1595458
1595714
1595970
1596226
1596482
1596738
1596994
1597250
1589315
1589571
1589827
1590083
1590339
1590595
1590851
1591107
1591363
1591619
1591875
1592131
1592387
1592643
1592899
1593155
1593411
1593667
1593923
1594179
1594435
1594691
1594947
1595203
1595459
1595715
1595971
1596227
1596483
1596739
1596995
1597251
1589316
1589572
1589828
1590084
1590340
1590596
1590852
1591108
1591364
1591620
1591876
1592132
1592388
1592644
1592900
1593156
1593412
1593668
1593924
1594180
1594436
1594692
1594948
1595204
1595460
1595716
1595972
1596228
1596484
1596740
1596996
1597252
1589317
1589573
1589829
1590085
1590341
1590597
1590853
1591109
1591365
1591621
1591877
1592133
1592389
1592645
1592901
1593157
1593413
1593669
1593925
1594181
1594437
1594693
1594949
1595205
1595461
1595717
1595973
1596229
1596485
1596741
1596997
1597253
1589318
1589574
1589830
1590086
1590342
1590598
1590854
1591110
1591366
1591622
1591878
1592134
1592390
1592646
1592902
1593158
1593414
1593670
1593926
1594182
1594438
1594694
1594950
1595206
1595462
1595718
1595974
1596230
1596486
1596742
1596998
1597254
1589319
1589575
1589831
1590087
1590343
1590599
1590855
1591111
1591367
1591623
1591879
1592135
1592391
1592647
1592903
1593159
1593415
1593671
1593927
1594183
1594439
1594695
1594951
1595207
1595463
1595719
1595975
1596231
1596487
1596743
1596999
1597255
1589320
1589576
1589832
1590088
1590344
1590600
1590856
1591112
1591368
1591624
1591880
1592136
1592392
1592648
1592904
1593160
1593416
1593672
1593928
1594184
1594440
1594696
1594952
1595208
1595464
1595720
1595976
1596232
1596488
1596744
1597000
1597256
1589321
1589577
1589833
1590089
1590345
1590601
1590857
1591113
1591369
1591625
1591881
1592137
1592393
1592649
1592905
1593161
1593417
1593673
1593929
1594185
1594441
1594697
1594953
1595209
1595465
1595721
1595977
1596233
1596489
1596745
1597001
1597257
1589322
1589578
1589834
1590090
1590346
1590602
1590858
1591114
1591370
1591626
1591882
1592138
1592394
1592650
1592906
1593162
1593418
1593674
1593930
1594186
1594442
1594698
1594954
1595210
1595466
1595722
1595978
1596234
1596490
1596746
1597002
1597258
1589323
1589579
1589835
1590091
1590347
1590603
1590859
1591115
1591371
1591627
1591883
1592139
1592395
1592651
1592907
1593163
1593419
1593675
1593931
1594187
1594443
1594699
1594955
1595211
1595467
1595723
1595979
1596235
1596491
1596747
1597003
1597259
1589324
1589580
1589836
1590092
1590348
1590604
1590860
1591116
1591372
1591628
1591884
1592140
1592396
1592652
1592908
1593164
1593420
1593676
1593932
1594188
1594444
1594700
1594956
1595212
1595468
1595724
1595980
1596236
1596492
1596748
1597004
1597260
1589325
1589581
1589837
1590093
1590349
1590605
1590861
1591117
1591373
1591629
1591885
1592141
1592397
1592653
1592909
1593165
1593421
1593677
1593933
1594189
1594445
1594701
1594957
1595213
1595469
1595725
1595981
1596237
1596493
1596749
1597005
1597261
1589326
1589582
1589838
1590094
1590350
1590606
1590862
1591118
1591374
1591630
1591886
1592142
1592398
1592654
1592910
1593166
1593422
1593678
1593934
1594190
1594446
1594702
1594958
1595214
1595470
1595726
1595982
1596238
1596494
1596750
1597006
1597262
1589327
1589583
1589839
1590095
1590351
1590607
1590863
1591119
1591375
1591631
1591887
1592143
1592399
1592655
1592911
1593167
1593423
1593679
1593935
1594191
1594447
1594703
1594959
1595215
1595471
1595727
1595983
1596239
1596495
1596751
1597007
1597263
1589328
1589584
1589840
1590096
1590352
1590608
1590864
1591120
1591376
1591632
1591888
1592144
1592400
1592656
1592912
1593168
1593424
1593680
1593936
1594192
1594448
1594704
1594960
1595216
1595472
1595728
1595984
1596240
1596496
1596752
1597008
1597264
1589329
1589585
1589841
1590097
1590353
1590609
1590865
1591121
1591377
1591633
1591889
1592145
1592401
1592657
1592913
1593169
1593425
1593681
1593937
1594193
1594449
1594705
1594961
1595217
1595473
1595729
1595985
1596241
1596497
1596753
1597009
1597265
1589330
1589586
1589842
1590098
1590354
1590610
1590866
1591122
1591378
1591634
1591890
1592146
1592402
1592658
1592914
1593170
1593426
1593682
1593938
1594194
1594450
1594706
1594962
1595218
1595474
1595730
1595986
1596242
1596498
1596754
1597010
1597266
1589331
1589587
1589843
1590099
1590355
1590611
1590867
1591123
1591379
1591635
1591891
1592147
1592403
1592659
1592915
1593171
1593427
1593683
1593939
1594195
1594451
1594707
1594963
1595219
1595475
1595731
1595987
1596243
1596499
1596755
1597011
1597267
1589332
1589588
1589844
1590100
1590356
1590612
1590868
1591124
1591380
1591636
1591892
1592148
1592404
1592660
1592916
1593172
1593428
1593684
1593940
1594196
1594452
1594708
1594964
1595220
1595476
1595732
1595988
1596244
1596500
1596756
1597012
1597268
1589333
1589589
1589845
1590101
1590357
1590613
1590869
1591125
1591381
1591637
1591893
1592149
1592405
1592661
1592917
1593173
1593429
1593685
1593941
1594197
1594453
1594709
1594965
1595221
1595477
1595733
1595989
1596245
1596501
1596757
1597013
1597269
1589334
1589590
1589846
1590102
1590358
1590614
1590870
1591126
1591382
1591638
1591894
1592150
1592406
1592662
1592918
1593174
1593430
1593686
1593942
1594198
1594454
1594710
1594966
1595222
1595478
1595734
1595990
1596246
1596502
1596758
1597014
1597270
1589335
1589591
1589847
1590103
1590359
1590615
1590871
1591127
1591383
1591639
1591895
1592151
1592407
1592663
1592919
1593175
1593431
1593687
1593943
1594199
1594455
1594711
1594967
1595223
1595479
1595735
1595991
1596247
1596503
1596759
1597015
1597271
1589336
1589592
1589848
1590104
1590360
1590616
1590872
1591128
1591384
1591640
1591896
1592152
1592408
1592664
1592920
1593176
1593432
1593688
1593944
1594200
1594456
1594712
1594968
1595224
1595480
1595736
1595992
1596248
1596504
1596760
1597016
1597272
1589337
1589593
1589849
1590105
1590361
1590617
1590873
1591129
1591385
1591641
1591897
1592153
1592409
1592665
1592921
1593177
1593433
1593689
1593945
1594201
1594457
1594713
1594969
1595225
1595481
1595737
1595993
1596249
1596505
1596761
1597017
1597273
1589338
1589594
1589850
1590106
1590362
1590618
1590874
1591130
1591386
1591642
1591898
1592154
1592410
1592666
1592922
1593178
1593434
1593690
1593946
1594202
1594458
1594714
1594970
1595226
1595482
1595738
1595994
1596250
1596506
1596762
1597018
1597274
1589339
1589595
1589851
1590107
1590363
1590619
1590875
1591131
1591387
1591643
1591899
1592155
1592411
1592667
1592923
1593179
1593435
1593691
1593947
1594203
1594459
1594715
1594971
1595227
1595483
1595739
1595995
1596251
1596507
1596763
1597019
1597275
1589340
1589596
1589852
1590108
1590364
1590620
1590876
1591132
1591388
1591644
1591900
1592156
1592412
1592668
1592924
1593180
1593436
1593692
1593948
1594204
1594460
1594716
1594972
1595228
1595484
1595740
1595996
1596252
1596508
1596764
1597020
1597276
1589341
1589597
1589853
1590109
1590365
1590621
1590877
1591133
1591389
1591645
1591901
1592157
1592413
1592669
1592925
1593181
1593437
1593693
1593949
1594205
1594461
1594717
1594973
1595229
1595485
1595741
1595997
1596253
1596509
1596765
1597021
1597277
1589342
1589598
1589854
1590110
1590366
1590622
1590878
1591134
1591390
1591646
1591902
1592158
1592414
1592670
1592926
1593182
1593438
1593694
1593950
1594206
1594462
1594718
1594974
1595230
1595486
1595742
1595998
1596254
1596510
1596766
1597022
1597278
1589343
1589599
1589855
1590111
1590367
1590623
1590879
1591135
1591391
1591647
1591903
1592159
1592415
1592671
1592927
1593183
1593439
1593695
1593951
1594207
1594463
1594719
1594975
1595231
1595487
1595743
1595999
1596255
1596511
1596767
1597023
1597279
