1187888
1188144
1188400
1188656
1188912
1189168
1189424
1189680
1187889
1188145
1188401
1188657
1188913
1189169
1189425
1189681
1187890
1188146
1188402
1188658
1188914
1189170
1189426
1189682
1187891
1188147
1188403
1188659
1188915
1189171
1189427
1189683
1187892
1188148
1188404
1188660
1188916
1189172
1189428
1189684
1187893
1188149
1188405
1188661
1188917
1189173
1189429
1189685
1187894
1188150
1188406
1188662
1188918
1189174
1189430
1189686
1187895
1188151
1188407
1188663
1188919
1189175
1189431
1189687
1323040
1323296
1323552
1323808
1324064
1324320
1324576
1324832
1323041
1323297
1323553
1323809
1324065
1324321
1324577
1324833
1323042
1323298
1323554
1323810
1324066
1324322
1324578
1324834
1323043
1323299
1323555
1323811
1324067
1324323
1324579
1324835
1323044
1323300
1323556
1323812
1324068
1324324
1324580
1324836
1323045
1323301
1323557
1323813
1324069
1324325
1324581
1324837
1323046
1323302
1323558
1323814
1324070
1324326
1324582
1324838
1323047
1323303
1323559
1323815
1324071
1324327
1324583
1324839
1849392
1849648
1849904
1850160
1850416
1850672
1850928
1851184
1849393
1849649
1849905
1850161
1850417
1850673
1850929
1851185
1849394
1849650
1849906
1850162
1850418
1850674
1850930
1851186
1849395
1849651
1849907
1850163
1850419
1850675
1850931
1851187
1849396
1849652
1849908
1850164
1850420
1850676
1850932
1851188
1849397
1849653
1849909
1850165
1850421
1850677
1850933
1851189
1849398
1849654
1849910
1850166
1850422
1850678
1850934
1851190
1849399
1849655
1849911
1850167
1850423
1850679
1850935
1851191
2373672
2373928
2374184
2374440
2374696
2374952
2375208
2375464
2373673
2373929
2374185
2374441
2374697
2374953
2375209
2375465
2373674
2373930
2374186
2374442
2374698
2374954
2375210
2375466
2373675
2373931
2374187
2374443
2374699
2374955
2375211
2375467
2373676
2373932
2374188
2374444
2374700
2374956
2375212
2375468
2373677
2373933
2374189
2374445
2374701
2374957
2375213
2375469
2373678
2373934
2374190
2374446
2374702
2374958
2375214
2375470
2373679
2373935
2374191
2374447
2374703
2374959
2375215
2375471
3024952
3025208
3025464
3025720
3025976
3026232
3026488
3026744
3024953
3025209
3025465
3025721
3025977
3026233
3026489
3026745
3024954
3025210
3025466
3025722
3025978
3026234
3026490
3026746
3024955
3025211
3025467
3025723
3025979
3026235
3026491
3026747
3024956
3025212
3025468
3025724
3025980
3026236
3026492
3026748
3024957
3025213
3025469
3025725
3025981
3026237
3026493
3026749
3024958
3025214
3025470
3025726
3025982
3026238
3026494
3026750
3024959
3025215
3025471
3025727
3025983
3026239
3026495
3026751
