792640
792896
793152
793408
793664
793920
794176
794432
792641
792897
793153
793409
793665
793921
794177
794433
792642
792898
793154
793410
793666
793922
794178
794434
792643
792899
793155
793411
793667
793923
794179
794435
792644
792900
793156
793412
793668
793924
794180
794436
792645
792901
793157
793413
793669
793925
794181
794437
792646
792902
793158
793414
793670
793926
794182
794438
792647
792903
793159
793415
793671
793927
794183
794439
2301984
2302240
2302496
2302752
2303008
2303264
2303520
2303776
2301985
2302241
2302497
2302753
2303009
2303265
2303521
2303777
2301986
2302242
2302498
2302754
2303010
2303266
2303522
2303778
2301987
2302243
2302499
2302755
2303011
2303267
2303523
2303779
2301988
2302244
2302500
2302756
2303012
2303268
2303524
2303780
2301989
2302245
2302501
2302757
2303013
2303269
2303525
2303781
2301990
2302246
2302502
2302758
2303014
2303270
2303526
2303782
2301991
2302247
2302503
2302759
2303015
2303271
2303527
2303783
2639912
2640168
2640424
2640680
2640936
2641192
2641448
2641704
2639913
2640169
2640425
2640681
2640937
2641193
2641449
2641705
2639914
2640170
2640426
2640682
2640938
2641194
2641450
2641706
2639915
2640171
2640427
2640683
2640939
2641195
2641451
2641707
2639916
2640172
2640428
2640684
2640940
2641196
2641452
2641708
2639917
2640173
2640429
2640685
2640941
2641197
2641453
2641709
2639918
2640174
2640430
2640686
2640942
2641198
2641454
2641710
2639919
2640175
2640431
2640687
2640943
2641199
2641455
2641711
