863040
1064752
1129770
1255206
1261358
1387567
1584160
1583394
1584162
1583651
1583907
1584419
1583396
1584676
1583398
1583654
1583911
1585707
1589039
1589040
1653808
1654326
1719855
1779751
1846843
2700080
3090738
3090997
3092022
3092534
3091255
3091511
3092535
