0 0 1.0 1.0 1.0
0 1 14.619512947 0.04771438241 1.43356645107
0 2 1.0 0.0 0.0
1 0 4.0 0.25 1.0
1 1 0.691478458933 0.927060127258 1.55996000767
1 2 1.0 0.0 0.0
2 0 2.0 0.5 1.0
2 1 0.738965064056 0.911597132683 1.48447585106
2 2 1.0 0.0 0.0
3 0 0.666666666667 1.0 1.5
3 1 0.684361754097 0.916408121586 1.59450304508
3 2 1.0 0.0 0.0
4 0 2.0 0.5 1.0
4 1 0.788615726234 0.867144525051 1.46232223511
4 2 1.0 1.0 1.0
5 0 0.666666666667 1.0 1.5
5 1 0.689655149734 0.907239079475 1.59825575352
5 2 0.5 1.0 2.0
6 0 0.666666666667 1.0 1.5
6 1 0.662988983152 0.898302257061 1.6790792942
6 2 0.666666666667 1.0 1.5
7 0 0.600000014305 1.0 1.66666662693
7 1 0.749686290467 0.852217555046 1.56520032883
7 2 0.5 1.0 2.0
8 0 0.600000014305 1.0 1.66666662693
8 1 0.553503469868 0.948692142963 1.90438318253
8 2 0.666666666667 1.0 1.5
9 0 0.5 1.0 2.0
9 1 0.761296142519 0.888587415218 1.47824430466
9 2 0.333333333333 1.0 3.0
10 0 0.428571443168 1.0 2.33333325386
10 1 0.71302797582 0.88970464468 1.57633161545
10 2 1.0 1.0 1.0
11 0 1.0 1.0 1.0
11 1 0.709259931435 0.903616428375 1.56030845642
11 2 1.0 0.5 2.0
12 0 0.749999977648 1.0 1.33333337307
12 1 0.842229634314 0.839742541313 1.41391503811
12 2 1.0 0.5 2.0
13 0 0.600000014305 1.0 1.66666662693
13 1 0.727722761541 0.916044473648 1.50009059906
13 2 0.666666666667 1.0 1.5
14 0 1.0 1.0 1.0
14 1 0.789180097733 0.863554179668 1.46735203266
14 2 0.4 1.0 2.5
15 0 1.0 1.0 1.0
15 1 0.711518607221 0.903448283672 1.5556448698
15 2 0.25 1.0 4.0
16 0 2.0 0.5 1.0
16 1 0.637769131535 0.943077743053 1.6626046896
16 2 1.0 1.0 1.0
17 0 0.749999977648 1.0 1.33333337307
17 1 0.665748167976 0.935396790504 1.60580992699
17 2 1.0 1.0 1.0
18 0 0.300000007153 1.0 3.33333325386
18 1 20.48 0.0343424491584 1.42180097103
18 2 1.0 1.0 1.0
19 0 1.4999999553 0.666666686535 1.0
19 1 0.71090862249 0.916868746281 1.53418970108
19 2 1.0 0.0 0.0
20 0 1.0 0.666666686535 1.5
20 1 0.67315311984 0.930932998657 1.59576046467
20 2 0.5 1.0 2.0
21 0 1.4999999553 0.666666686535 1.0
21 1 0.631977998996 0.924708724022 1.71116960049
21 2 1.0 1.0 1.0
22 0 0.749999977648 1.0 1.33333337307
22 1 0.611844072176 0.952172517776 1.7164992094
22 2 1.0 0.0 0.0
23 0 1.0 1.0 1.0
23 1 0.650381482187 0.943442463875 1.629732728
23 2 1.0 1.0 1.0
24 0 1.0 1.0 1.0
24 1 0.640391890209 0.930458962917 1.67825114727
24 2 1.0 1.0 1.0
25 0 1.0 0.666666686535 1.5
25 1 0.681986844331 0.949104964733 1.5449334383
25 2 1.0 0.0 0.0
26 0 0.749999977648 1.0 1.33333337307
26 1 1.0 0.0 0.0
26 2 0.666666666667 1.0 1.5
27 0 0.666666666667 1.0 1.5
27 1 0.698197643695 0.911696612835 1.57098221779
27 2 1.4999999553 0.666666686535 1.0
28 0 1.0 1.0 1.0
28 1 0.698619036539 0.923062026501 1.55070328712
28 2 1.0 1.0 1.0
29 0 0.666666666667 1.0 1.5
29 1 0.643913531475 0.956419289112 1.62376844883
29 2 0.749999977648 1.0 1.33333337307
30 0 0.666666666667 1.0 1.5
30 1 0.518053517324 0.952699303627 2.02614045143
30 2 0.749999977648 0.666666686535 2.0
31 0 1.0 1.0 1.0
31 1 0.331569176926 0.975481331348 3.09176778793
31 2 2.99999991059 0.333333343267 1.0
32 0 1.0 0.0 0.0
32 1 0.658885862974 0.94283759594 1.60972952843
32 2 1.4999999553 0.666666686535 1.0
33 0 1.0 1.0 1.0
33 1 0.668627182635 0.952419042587 1.57031905651
33 2 0.600000014305 1.0 1.66666662693
34 0 1.0 0.0 0.0
34 1 0.721664070453 0.93235296011 1.48622500896
34 2 0.8 1.0 1.25
35 0 1.0 0.0 0.0
35 1 0.940748046839 0.805770576 1.3192139864
35 2 0.83333330022 1.0 1.20000004768
36 0 1.0 0.0 0.0
36 1 13.3260398622 0.0382594428957 1.96137344837
36 2 1.33333333333 0.75 1.0
37 0 1.0 0.0 0.0
37 1 0.712488436067 0.924163579941 1.518704772
37 2 1.33333333333 0.75 1.0
38 0 1.0 0.0 0.0
38 1 0.487442524244 0.961357057095 2.13398742676
38 2 1.33333333333 0.75 1.0
39 0 1.0 0.0 0.0
39 1 0.700708660141 0.940942764282 1.51669859886
39 2 1.0 0.0 0.0
40 0 1.0 0.0 0.0
40 1 0.851117314893 0.844437122345 1.39137196541
40 2 0.749999977648 0.833333313465 1.60000002384
41 0 1.0 0.0 0.0
41 1 0.656811193544 0.9579859972 1.58927953243
41 2 1.39999996662 0.714285731316 1.0
42 0 1.0 0.0 0.0
42 1 0.598295679859 0.945180535316 1.76835465431
42 2 1.0 0.857142865658 1.16666662693
43 0 0.666666666667 1.0 1.5
43 1 0.708722903431 0.896125555038 1.5745434761
43 2 1.4999999553 0.666666686535 1.0
44 0 0.666666666667 1.0 1.5
44 1 0.780405392519 0.858308374882 1.49291944504
44 2 0.888888888889 1.0 1.125
45 0 0.749999977648 0.666666686535 2.0
45 1 0.692469608624 0.916751086712 1.5752440691
45 2 1.0 0.875 1.14285719395
46 0 1.0 1.0 1.0
46 1 0.693744848255 0.874723017216 1.64789557457
46 2 1.0 0.699999988079 1.42857146263
47 0 1.0 0.0 0.0
47 1 0.937748750066 0.796774208546 1.33837628365
47 2 0.83333330022 0.899999976158 1.33333337307
48 0 1.0 1.0 1.0
48 1 0.574990283862 0.922726511955 1.88480532169
48 2 0.818181827049 1.0 1.22222220898
49 0 1.0 1.0 1.0
49 1 0.800344691909 0.814070343971 1.53483247757
49 2 1.4999999553 0.666666686535 1.0
50 0 0.300000007153 0.666666686535 5.0
50 1 0.800647343462 0.840665876865 1.48571431637
50 2 1.33333333333 0.75 1.0
51 0 2.0 0.5 1.0
51 1 0.65206690928 0.938113212585 1.63475465775
51 2 0.5 1.0 2.0
52 0 2.0 0.5 1.0
52 1 1.76400564281 0.448193728924 1.26483619213
52 2 0.71428572645 0.800000011921 1.75
53 0 1.0 0.0 0.0
53 1 1.0 0.0 0.0
53 2 1.0 0.0 0.0
