1452040
1452296
1452552
1452808
1453064
1453320
1453576
1453832
1452041
1452297
1452553
1452809
1453065
1453321
1453577
1453833
1452042
1452298
1452554
1452810
1453066
1453322
1453578
1453834
1452043
1452299
1452555
1452811
1453067
1453323
1453579
1453835
1452044
1452300
1452556
1452812
1453068
1453324
1453580
1453836
1452045
1452301
1452557
1452813
1453069
1453325
1453581
1453837
1452046
1452302
1452558
1452814
1453070
1453326
1453582
1453838
1452047
1452303
1452559
1452815
1453071
1453327
1453583
1453839
