0 0 1.0 0.777777791023 1.28571426868
0 1 0.777651536501 0.896442055702 1.4344741106
0 2 1.0 0.909090936184 1.10000002384
1 0 0.727272727273 1.0 1.375
1 1 0.648499383166 0.939268827438 1.64172542095
1 2 0.5 1.0 2.0
2 0 0.899999957085 0.888888895512 1.25
2 1 0.67520327474 0.930248558521 1.59208583832
2 2 1.20000002861 0.75 1.11111116409
3 0 1.4285714529 0.699999988079 1.0
3 1 0.574586434606 0.938308656216 1.85480773449
3 2 0.923076889219 0.833333313465 1.29999995232
4 0 0.874999960884 1.0 1.14285719395
4 1 0.690885209523 0.912364006042 1.58644843102
4 2 0.916666639348 0.909090936184 1.20000004768
5 0 1.0 0.857142865658 1.16666662693
5 1 0.628131952062 0.93415248394 1.70424234867
5 2 0.600000014305 1.0 1.66666662693
6 0 4.0 0.25 1.0
6 1 0.58146642857 0.932942569256 1.8434035778
6 2 0.83333330022 0.899999976158 1.33333337307
7 0 0.699999983311 0.857142865658 1.66666662693
7 1 0.66867781575 0.886654615402 1.68666410446
7 2 0.769230797446 0.800000011921 1.625
8 0 0.5 1.0 2.0
8 1 0.722835259706 0.893919765949 1.54761219025
8 2 0.666666666667 1.0 1.5
9 0 0.466666681502 1.0 2.14285707474
9 1 0.704175538876 0.914040863514 1.55365085602
9 2 0.727272727273 1.0 1.375
10 0 0.874999960884 0.857142865658 1.33333337307
10 1 0.644872707218 0.920363068581 1.68487155437
10 2 0.8 1.0 1.25
11 0 1.16666665508 0.857142865658 1.0
11 1 0.659735904554 0.925298154354 1.63812947273
11 2 1.24999998137 0.600000023842 1.33333337307
12 0 0.538461553275 1.0 1.85714280605
12 1 0.569912873785 0.954397976398 1.83849322796
12 2 0.888888888889 0.875 1.28571426868
13 0 0.699999983311 0.714285731316 2.0
13 1 0.696913754866 0.923142671585 1.55436193943
13 2 0.888888888889 0.875 1.28571426868
14 0 1.0 1.0 1.0
14 1 0.70394183049 0.905249655247 1.56925976276
14 2 0.8 1.0 1.25
15 0 0.699999983311 1.0 1.42857146263
15 1 0.756318880167 0.881319642067 1.50024306774
15 2 0.888888888889 0.875 1.28571426868
16 0 1.14285714286 0.75 1.16666662693
16 1 0.619620804484 0.944988846779 1.70784068108
16 2 1.0 0.888888895512 1.125
17 0 0.699999983311 1.0 1.42857146263
17 1 0.640717258021 0.939206063747 1.66177678108
17 2 0.888888888889 1.0 1.125
18 0 1.0 0.777777791023 1.28571426868
18 1 0.562829736082 0.95313167572 1.86410367489
18 2 0.899999957085 0.888888895512 1.25
19 0 0.727272727273 1.0 1.375
19 1 0.757522708231 0.88828009367 1.48612177372
19 2 0.8 0.875 1.42857146263
20 0 0.636363650156 1.0 1.57142853737
20 1 0.692221212187 0.916424572468 1.57637071609
20 2 0.818181827049 1.0 1.22222220898
21 0 1.0 0.75 1.33333337307
21 1 0.579882254 0.953364312649 1.80884480476
21 2 1.12499999162 0.777777791023 1.14285719395
22 0 0.571428571429 0.875 2.0
22 1 0.782882143247 0.862771630287 1.48049783707
22 2 0.749999977648 0.888888895512 1.5
23 0 0.8 0.875 1.42857146263
23 1 0.648444090477 0.937397301197 1.6451433897
23 2 0.818181827049 0.888888895512 1.375
24 0 1.28571426382 0.444444447756 1.75
24 1 0.689979335843 0.895296037197 1.61881518364
24 2 1.11111114055 0.699999988079 1.28571426868
25 0 0.600000014305 1.0 1.66666662693
25 1 0.715999508704 0.931330859661 1.49962711334
25 2 0.916666639348 0.818181812763 1.33333337307
26 0 0.611111115158 1.0 1.63636362553
26 1 0.955327552358 0.785641789436 1.33236467838
26 2 0.749999977648 1.0 1.33333337307
27 0 0.84615388495 0.818181812763 1.44444441795
27 1 0.667053181708 0.920823931694 1.62803208828
27 2 0.916666639348 1.0 1.09090912342
28 0 0.520000014877 0.923076927662 2.08333325386
28 1 0.707294239975 0.9017187953 1.56793749332
28 2 1.08333332795 0.846153855324 1.09090912342
29 0 0.823529400215 0.857142865658 1.41666662693
29 1 0.64849727756 0.953097403049 1.61791074276
29 2 0.8 1.0 1.25
30 0 1.09090906726 0.75 1.22222220898
30 1 0.477735864702 0.970645606518 2.15650987625
30 2 1.44444440618 0.692307710648 1.0
31 0 0.923076889219 0.916666686535 1.18181812763
31 1 0.400342318461 0.975918352604 2.55949926376
31 2 0.8 0.916666686535 1.36363637447
32 0 2.0 0.5 1.0
32 1 0.877207761869 0.743850111961 1.5325409174
32 2 0.535714283433 1.0 1.86666667461
33 0 0.684210539194 0.923076927662 1.58333337307
33 1 0.529508724362 0.974559664726 1.93784224987
33 2 0.789473694117 0.866666674614 1.46153843403
34 0 0.461538444609 1.0 2.16666674614
34 1 0.725526582723 0.925873637199 1.48865807056
34 2 1.15384614327 0.733333349228 1.18181812763
35 0 0.695652173913 0.9375 1.53333330154
35 1 0.735001617009 0.908598840237 1.49740588665
35 2 0.560000005341 0.857142865658 2.08333325386
36 0 1.05882355911 0.777777791023 1.21428573132
36 1 0.594437705027 0.954912126064 1.76169300079
36 2 0.749999977648 0.866666674614 1.53846156597
37 0 1.41666663148 0.705882370472 1.0
37 1 0.738596280995 0.908641159534 1.49004876614
37 2 0.730769217367 0.89473682642 1.52941179276
38 0 0.944444394406 0.882352948189 1.20000004768
38 1 0.911823354747 0.797090470791 1.37588357925
38 2 0.749999977648 0.866666674614 1.53846156597
39 0 0.958333342854 0.782608687878 1.33333337307
39 1 0.688909799598 0.937585294247 1.548199296
39 2 0.809523818715 0.941176474094 1.3125
40 0 0.8 0.857142865658 1.45833337307
40 1 0.880820443465 0.830528616905 1.36696684361
40 2 0.78260868754 0.888888895512 1.4375
41 0 0.852941152546 0.827586233616 1.41666662693
41 1 0.648956573114 0.960889995098 1.60365414619
41 2 12.5000002794 0.0799999982119 1.0
42 0 0.837837800046 0.806451618671 1.48000001907
42 1 0.613346663956 0.945040762424 1.72521579266
42 2 1.21052634237 0.608695626259 1.35714280605
43 0 0.708333315742 0.970588207245 1.45454549789
43 1 0.700036668314 0.902130246162 1.58347046375
43 2 1.0 0.909090936184 1.10000002384
44 0 0.8 0.805555582047 1.55172419548
44 1 0.767126915552 0.870869576931 1.4968546629
44 2 0.899999957085 0.888888895512 1.25
45 0 1.02777776076 0.675675690174 1.44000005722
45 1 0.672086392575 0.920625090599 1.61618876457
45 2 1.07692310655 0.714285731316 1.29999995232
46 0 0.944444394406 0.735294103622 1.44000005722
46 1 0.766733280247 0.843117892742 1.54691827297
46 2 1.0 0.0 0.0
47 0 1.12903224938 0.742857158184 1.19230771065
47 1 0.961136928368 0.803304135799 1.29519367218
47 2 1.15384614327 0.800000011921 1.08333337307
48 0 0.874999960884 0.809523820877 1.41176474094
48 1 0.561782637219 0.939168035984 1.89534544945
48 2 0.874999960884 0.761904776096 1.5
49 0 0.869565235419 0.75 1.53333330154
49 1 0.944745728314 0.744259059429 1.42220079899
49 2 0.821428606401 0.826086938381 1.4736841917
50 0 0.693548400432 0.906976759434 1.5897436142
50 1 0.87317973229 0.819822669029 1.39693570137
50 2 0.749999977648 0.888888895512 1.5
51 0 0.8 0.833333313465 1.5
51 1 0.656709846567 0.949944257736 1.60298085213
51 2 0.826086935114 0.842105269432 1.4375
52 0 1.90909080564 0.396825402975 1.32000005245
52 1 0.548852296154 0.939238011837 1.93985307217
52 2 3.57142855622 0.20000000298 1.39999997616
53 0 1.0 0.0 0.0
53 1 1.0 0.0 0.0
53 2 1.0 0.0 0.0
