143360
143616
143872
144128
144384
144640
144896
145152
143361
143617
143873
144129
144385
144641
144897
145153
143362
143618
143874
144130
144386
144642
144898
145154
143363
143619
143875
144131
144387
144643
144899
145155
143364
143620
143876
144132
144388
144644
144900
145156
143365
143621
143877
144133
144389
144645
144901
145157
143366
143622
143878
144134
144390
144646
144902
145158
143367
143623
143879
144135
144391
144647
144903
145159
1450032
1450288
1450544
1450800
1451056
1451312
1451568
1451824
1450033
1450289
1450545
1450801
1451057
1451313
1451569
1451825
1450034
1450290
1450546
1450802
1451058
1451314
1451570
1451826
1450035
1450291
1450547
1450803
1451059
1451315
1451571
1451827
1450036
1450292
1450548
1450804
1451060
1451316
1451572
1451828
1450037
1450293
1450549
1450805
1451061
1451317
1451573
1451829
1450038
1450294
1450550
1450806
1451062
1451318
1451574
1451830
1450039
1450295
1450551
1450807
1451063
1451319
1451575
1451831
