20517
149039
481832
481839
544317
935972
1198386
1199156
1198134
1464065
1656112
2312239
2312240
2310193
2381103
2637871
2638127
2639919
2637872
2638128
2639920
2707252
2840879
3097393
3098162
3099958
3096887
3098168
3099448
3096889
3098169
3097914
3099194
3230767
