475208
475464
475720
475976
476232
476488
476744
477000
475209
475465
475721
475977
476233
476489
476745
477001
475210
475466
475722
475978
476234
476490
476746
477002
475211
475467
475723
475979
476235
476491
476747
477003
475212
475468
475724
475980
476236
476492
476748
477004
475213
475469
475725
475981
476237
476493
476749
477005
475214
475470
475726
475982
476238
476494
476750
477006
475215
475471
475727
475983
476239
476495
476751
477007
542760
543016
543272
543528
543784
544040
544296
544552
542761
543017
543273
543529
543785
544041
544297
544553
542762
543018
543274
543530
543786
544042
544298
544554
542763
543019
543275
543531
543787
544043
544299
544555
542764
543020
543276
543532
543788
544044
544300
544556
542765
543021
543277
543533
543789
544045
544301
544557
542766
543022
543278
543534
543790
544046
544302
544558
542767
543023
543279
543535
543791
544047
544303
544559
806992
807248
807504
807760
808016
808272
808528
808784
806993
807249
807505
807761
808017
808273
808529
808785
806994
807250
807506
807762
808018
808274
808530
808786
806995
807251
807507
807763
808019
808275
808531
808787
806996
807252
807508
807764
808020
808276
808532
808788
806997
807253
807509
807765
808021
808277
808533
808789
806998
807254
807510
807766
808022
808278
808534
808790
806999
807255
807511
807767
808023
808279
808535
808791
1001528
1001784
1002040
1002296
1002552
1002808
1003064
1003320
1001529
1001785
1002041
1002297
1002553
1002809
1003065
1003321
1001530
1001786
1002042
1002298
1002554
1002810
1003066
1003322
1001531
1001787
1002043
1002299
1002555
1002811
1003067
1003323
1001532
1001788
1002044
1002300
1002556
1002812
1003068
1003324
1001533
1001789
1002045
1002301
1002557
1002813
1003069
1003325
1001534
1001790
1002046
1002302
1002558
1002814
1003070
1003326
1001535
1001791
1002047
1002303
1002559
1002815
1003071
1003327
2506752
2507008
2507264
2507520
2507776
2508032
2508288
2508544
2506753
2507009
2507265
2507521
2507777
2508033
2508289
2508545
2506754
2507010
2507266
2507522
2507778
2508034
2508290
2508546
2506755
2507011
2507267
2507523
2507779
2508035
2508291
2508547
2506756
2507012
2507268
2507524
2507780
2508036
2508292
2508548
2506757
2507013
2507269
2507525
2507781
2508037
2508293
2508549
2506758
2507014
2507270
2507526
2507782
2508038
2508294
2508550
2506759
2507015
2507271
2507527
2507783
2508039
2508295
2508551
2506784
2507040
2507296
2507552
2507808
2508064
2508320
2508576
2506785
2507041
2507297
2507553
2507809
2508065
2508321
2508577
2506786
2507042
2507298
2507554
2507810
2508066
2508322
2508578
2506787
2507043
2507299
2507555
2507811
2508067
2508323
2508579
2506788
2507044
2507300
2507556
2507812
2508068
2508324
2508580
2506789
2507045
2507301
2507557
2507813
2508069
2508325
2508581
2506790
2507046
2507302
2507558
2507814
2508070
2508326
2508582
2506791
2507047
2507303
2507559
2507815
2508071
2508327
2508583
2506808
2507064
2507320
2507576
2507832
2508088
2508344
2508600
2506809
2507065
2507321
2507577
2507833
2508089
2508345
2508601
2506810
2507066
2507322
2507578
2507834
2508090
2508346
2508602
2506811
2507067
2507323
2507579
2507835
2508091
2508347
2508603
2506812
2507068
2507324
2507580
2507836
2508092
2508348
2508604
2506813
2507069
2507325
2507581
2507837
2508093
2508349
2508605
2506814
2507070
2507326
2507582
2507838
2508094
2508350
2508606
2506815
2507071
2507327
2507583
2507839
2508095
2508351
2508607
3035184
3035440
3035696
3035952
3036208
3036464
3036720
3036976
3035185
3035441
3035697
3035953
3036209
3036465
3036721
3036977
3035186
3035442
3035698
3035954
3036210
3036466
3036722
3036978
3035187
3035443
3035699
3035955
3036211
3036467
3036723
3036979
3035188
3035444
3035700
3035956
3036212
3036468
3036724
3036980
3035189
3035445
3035701
3035957
3036213
3036469
3036725
3036981
3035190
3035446
3035702
3035958
3036214
3036470
3036726
3036982
3035191
3035447
3035703
3035959
3036215
3036471
3036727
3036983
