331808
332064
332320
332576
332832
333088
333344
333600
331809
332065
332321
332577
332833
333089
333345
333601
331810
332066
332322
332578
332834
333090
333346
333602
331811
332067
332323
332579
332835
333091
333347
333603
331812
332068
332324
332580
332836
333092
333348
333604
331813
332069
332325
332581
332837
333093
333349
333605
331814
332070
332326
332582
332838
333094
333350
333606
331815
332071
332327
332583
332839
333095
333351
333607
1450032
1450288
1450544
1450800
1451056
1451312
1451568
1451824
1450033
1450289
1450545
1450801
1451057
1451313
1451569
1451825
1450034
1450290
1450546
1450802
1451058
1451314
1451570
1451826
1450035
1450291
1450547
1450803
1451059
1451315
1451571
1451827
1450036
1450292
1450548
1450804
1451060
1451316
1451572
1451828
1450037
1450293
1450549
1450805
1451061
1451317
1451573
1451829
1450038
1450294
1450550
1450806
1451062
1451318
1451574
1451830
1450039
1450295
1450551
1450807
1451063
1451319
1451575
1451831
1579064
1579320
1579576
1579832
1580088
1580344
1580600
1580856
1579065
1579321
1579577
1579833
1580089
1580345
1580601
1580857
1579066
1579322
1579578
1579834
1580090
1580346
1580602
1580858
1579067
1579323
1579579
1579835
1580091
1580347
1580603
1580859
1579068
1579324
1579580
1579836
1580092
1580348
1580604
1580860
1579069
1579325
1579581
1579837
1580093
1580349
1580605
1580861
1579070
1579326
1579582
1579838
1580094
1580350
1580606
1580862
1579071
1579327
1579583
1579839
1580095
1580351
1580607
1580863
2228272
2228528
2228784
2229040
2229296
2229552
2229808
2230064
2228273
2228529
2228785
2229041
2229297
2229553
2229809
2230065
2228274
2228530
2228786
2229042
2229298
2229554
2229810
2230066
2228275
2228531
2228787
2229043
2229299
2229555
2229811
2230067
2228276
2228532
2228788
2229044
2229300
2229556
2229812
2230068
2228277
2228533
2228789
2229045
2229301
2229557
2229813
2230069
2228278
2228534
2228790
2229046
2229302
2229558
2229814
2230070
2228279
2228535
2228791
2229047
2229303
2229559
2229815
2230071
2564144
2564400
2564656
2564912
2565168
2565424
2565680
2565936
2564145
2564401
2564657
2564913
2565169
2565425
2565681
2565937
2564146
2564402
2564658
2564914
2565170
2565426
2565682
2565938
2564147
2564403
2564659
2564915
2565171
2565427
2565683
2565939
2564148
2564404
2564660
2564916
2565172
2565428
2565684
2565940
2564149
2564405
2564661
2564917
2565173
2565429
2565685
2565941
2564150
2564406
2564662
2564918
2565174
2565430
2565686
2565942
2564151
2564407
2564663
2564919
2565175
2565431
2565687
2565943
2639912
2640168
2640424
2640680
2640936
2641192
2641448
2641704
2639913
2640169
2640425
2640681
2640937
2641193
2641449
2641705
2639914
2640170
2640426
2640682
2640938
2641194
2641450
2641706
2639915
2640171
2640427
2640683
2640939
2641195
2641451
2641707
2639916
2640172
2640428
2640684
2640940
2641196
2641452
2641708
2639917
2640173
2640429
2640685
2640941
2641197
2641453
2641709
2639918
2640174
2640430
2640686
2640942
2641198
2641454
2641710
2639919
2640175
2640431
2640687
2640943
2641199
2641455
2641711
3342376
3342632
3342888
3343144
3343400
3343656
3343912
3344168
3342377
3342633
3342889
3343145
3343401
3343657
3343913
3344169
3342378
3342634
3342890
3343146
3343402
3343658
3343914
3344170
3342379
3342635
3342891
3343147
3343403
3343659
3343915
3344171
3342380
3342636
3342892
3343148
3343404
3343660
3343916
3344172
3342381
3342637
3342893
3343149
3343405
3343661
3343917
3344173
3342382
3342638
3342894
3343150
3343406
3343662
3343918
3344174
3342383
3342639
3342895
3343151
3343407
3343663
3343919
3344175
