0 0 1.39999996662 0.571428596973 1.25
0 1 0.80809337214 0.882389366627 1.40242028236
0 2 0.862068990323 0.759999990463 1.5263158083
1 0 1.09999996722 0.818181812763 1.11111116409
1 1 0.666871186567 0.932429969311 1.60820651054
1 2 0.605263171186 0.869565188885 1.89999997616
2 0 0.733333327505 0.818181812763 1.66666662693
2 1 0.687052553418 0.927227020264 1.56972634792
2 2 0.656249987776 0.857142865658 1.77777779102
3 0 0.769230797446 0.899999976158 1.44444441795
3 1 0.579580965973 0.932781457901 1.84972000122
3 2 0.818181827049 0.777777791023 1.57142853737
4 0 0.588235277618 0.800000011921 2.125
4 1 0.709916350529 0.907961308956 1.55140602589
4 2 0.615384615385 0.9375 1.73333334923
5 0 0.916666639348 0.636363625526 1.71428573132
5 1 0.629694394407 0.933678865433 1.70087599754
5 2 0.72222220309 0.846153855324 1.63636362553
6 0 1.0 0.0 0.0
6 1 0.596903683393 0.924632608891 1.81186795235
6 2 1.0 0.823529422283 1.21428573132
7 0 0.83333330022 0.600000023842 2.0
7 1 0.663371296752 0.891732335091 1.69047534466
7 2 0.656249987776 0.857142865658 1.77777779102
8 0 0.749999977648 1.0 1.33333337307
8 1 0.688344161577 0.904700756073 1.60579240322
8 2 1.09523807037 0.739130437374 1.23529410362
9 0 0.823529400215 0.857142865658 1.41666662693
9 1 0.720113939384 0.90168774128 1.54007768631
9 2 0.814814800425 0.863636374474 1.42105257511
10 0 0.749999977648 0.944444417953 1.41176474094
10 1 0.652575135609 0.91587716341 1.67313992977
10 2 1.24999998137 0.680000007153 1.17647063732
11 0 0.8 1.0 1.25
11 1 0.668190936457 0.914321780205 1.63681781292
11 2 0.923076889219 0.875 1.23809528351
12 0 1.04166668995 0.72000002861 1.33333337307
12 1 0.567861888235 0.945236623287 1.86301660538
12 2 1.04166668995 0.800000011921 1.20000004768
13 0 0.874999960884 0.809523820877 1.41176474094
13 1 0.688677914695 0.91861385107 1.58070504665
13 2 0.970588262518 0.848484873772 1.21428573132
14 0 1.04166668995 0.839999973774 1.14285719395
14 1 0.711755562775 0.892828643322 1.57362413406
14 2 0.854166698487 0.87804877758 1.33333337307
15 0 0.874999960884 0.785714268684 1.45454549789
15 1 0.903590012715 0.791595876217 1.39805757999
15 2 0.784313740156 0.899999976158 1.41666662693
16 0 0.8 0.75 1.66666662693
16 1 0.608204216519 0.935189187527 1.75813043118
16 2 0.904761940714 0.719298243523 1.53658533096
17 0 0.902438979784 0.729729712009 1.51851856709
17 1 0.649036658938 0.926849424839 1.66234660149
17 2 0.75581393044 0.892307698727 1.48275864124
18 0 1.19444447015 0.674418628216 1.24137926102
18 1 0.613620974017 0.928938031197 1.75433731079
18 2 0.764705893078 0.935897409916 1.39726030827
19 0 1.02173912779 0.765957474709 1.27777779102
19 1 0.740566582422 0.888625621796 1.51955723763
19 2 0.838983039829 0.828282833099 1.43902444839
20 0 0.874999960884 0.892857134342 1.27999997139
20 1 0.682061703247 0.914748668671 1.60278236866
20 2 0.743243227678 0.909090936184 1.48000001907
21 0 1.82222217878 0.5 1.09756100178
21 1 0.601079299098 0.935369610786 1.77862739563
21 2 0.761290338975 0.847457647324 1.54999995232
22 0 0.559322045199 0.909090936184 1.96666669846
22 1 0.781026273093 0.858485400677 1.49142503738
22 2 0.916666639348 0.824675321579 1.32283461094
23 0 0.908163285191 0.876404523849 1.25641024113
23 1 0.659984532242 0.92576444149 1.63668739796
23 2 0.717842343536 0.907514452934 1.5350317955
24 0 1.66666660044 0.495999991894 1.20967745781
24 1 0.684712669254 0.884819924831 1.6505805254
24 2 0.804270493341 0.840707957745 1.47894740105
25 0 0.781609178267 0.897058844566 1.42622947693
25 1 0.729850732504 0.917462825775 1.49340462685
25 2 0.83333330022 0.853846132755 1.40540540218
26 0 0.811926596625 0.824858784676 1.49315071106
26 1 1.01877090216 0.748704373837 1.31103146076
26 2 0.703883471928 0.886206924915 1.60311281681
27 0 0.857740614438 0.843902468681 1.38150286674
27 1 0.704227324357 0.892557740211 1.59092903137
27 2 0.732558119226 0.879365086555 1.55234658718
28 0 0.677914096052 0.886877834797 1.66326534748
28 1 0.826702568003 0.83902156353 1.44170892239
28 2 0.82211537849 0.824561417103 1.47517728806
29 0 0.836956556443 0.870129883289 1.37313437462
29 1 0.66100388875 0.939604640007 1.61009252071
29 2 0.757211515244 0.885714292526 1.49103939533
30 0 1.0 0.710743784904 1.40697669983
30 1 0.494505421952 0.958566427231 2.10963225365
30 2 1.45075754562 0.556135773659 1.23943662643
31 0 0.925619790939 0.732142865658 1.47560977936
31 1 0.402109339161 0.962258756161 2.58442521095
31 2 0.744920975989 0.845454573631 1.5878136158
32 0 1.0281124498 0.73828125 1.31746029854
32 1 0.990682145288 0.665562450886 1.51662027836
32 2 0.693181842596 0.885245919228 1.62962961197
33 0 0.653439144166 0.923076927662 1.65789473057
33 1 0.567186859041 0.963085472584 1.83066546917
33 2 0.836027752754 0.834254145622 1.43377482891
34 0 0.659442723241 0.882629096508 1.71808505058
34 1 0.740244338816 0.915041327477 1.47633254528
34 2 0.852017916268 0.857894718647 1.36809813976
35 0 0.722419927906 0.896551728249 1.54395604134
35 1 0.772766968504 0.891295015812 1.45187747478
35 2 0.753564123318 0.848648667336 1.56369423866
36 0 0.988764055539 0.76704543829 1.3185185194
36 1 0.590890104238 0.948782801628 1.78371918201
36 2 0.887955222694 0.839116692543 1.34210526943
37 0 49.7500005328 0.0201005022973 1.0
37 1 0.771095252776 0.894079387188 1.45049381256
37 2 0.866071466366 0.810996592045 1.42372882366
38 0 1.1830985995 0.690476179123 1.22413790226
38 1 2.22140842392 0.387104868889 1.16290163994
38 2 1.09999996722 0.732323229313 1.24137926102
39 0 1.28735629362 0.616071403027 1.26086962223
39 1 0.723818093226 0.923634052277 1.49579012394
39 2 1.26637558343 0.579310357571 1.36309528351
40 0 0.85082872704 0.837662339211 1.40310072899
40 1 0.920921843137 0.811081826687 1.33879029751
40 2 0.857142886337 0.809523820877 1.44117641449
41 0 1.05228754972 0.745341598988 1.27499997616
41 1 0.705392735183 0.946015059948 1.49854910374
41 2 15.0476183002 0.0601265840232 1.10526311398
42 0 3.6865673626 0.222672060132 1.21818184853
42 1 0.63458665705 0.933798551559 1.68754696846
42 2 1.69291346687 0.520930230618 1.13392853737
43 0 0.842696670977 0.819999992847 1.44715452194
43 1 0.742596658486 0.881635069847 1.52741885185
43 2 0.986394550624 0.744827568531 1.36111116409
44 0 0.818652845696 0.803797483444 1.51968502998
44 1 0.808646141255 0.85646790266 1.44387757778
44 2 0.983870986659 0.73770493269 1.37777781487
45 0 0.940000006723 0.808510661125 1.31578946114
45 1 0.689200554903 0.912453949451 1.59016954899
45 2 1.05555553109 0.701754391193 1.35000002384
46 0 0.910112408312 0.666666686535 1.64814817905
46 1 0.878417246223 0.841012895107 1.35361909866
46 2 9.49999992922 0.065789476037 1.60000002384
47 0 1.73333334711 0.461538463831 1.25
47 1 1.08993735133 0.747924625874 1.22670638561
47 2 3.54545438216 0.230769231915 1.22222220898
48 0 0.897959174935 0.613636374474 1.81481480598
48 1 0.577951481362 0.931140363216 1.85820424557
48 2 1.3888888337 0.560000002384 1.28571426868
49 0 0.923076889219 0.791666686535 1.36842107773
49 1 1.31017238888 0.589051365852 1.29574167728
49 2 1.6363636541 0.388888895512 1.57142853737
50 0 1.15384614327 0.733333349228 1.18181812763
50 1 1.09454618737 0.711149513721 1.284709692
50 2 1.66666660044 0.40000000596 1.5
51 0 1.66666660044 0.40000000596 1.5
51 1 0.689572719495 0.938964545727 1.54443895817
51 2 2.71428574895 0.263157904148 1.39999997616
52 0 21.9999993443 0.0454545468092 1.0
52 1 0.580611929478 0.930666208267 1.8506321907
52 2 8.0 0.0750000029802 1.66666662693
53 0 1.0 0.0 0.0
53 1 1.0 0.0 0.0
53 2 1.0 0.0 0.0
