1980504
1980760
1981016
1981272
1981528
1981784
1982040
1982296
1980505
1980761
1981017
1981273
1981529
1981785
1982041
1982297
1980506
1980762
1981018
1981274
1981530
1981786
1982042
1982298
1980507
1980763
1981019
1981275
1981531
1981787
1982043
1982299
1980508
1980764
1981020
1981276
1981532
1981788
1982044
1982300
1980509
1980765
1981021
1981277
1981533
1981789
1982045
1982301
1980510
1980766
1981022
1981278
1981534
1981790
1982046
1982302
1980511
1980767
1981023
1981279
1981535
1981791
1982047
1982303
2639912
2640168
2640424
2640680
2640936
2641192
2641448
2641704
2639913
2640169
2640425
2640681
2640937
2641193
2641449
2641705
2639914
2640170
2640426
2640682
2640938
2641194
2641450
2641706
2639915
2640171
2640427
2640683
2640939
2641195
2641451
2641707
2639916
2640172
2640428
2640684
2640940
2641196
2641452
2641708
2639917
2640173
2640429
2640685
2640941
2641197
2641453
2641709
2639918
2640174
2640430
2640686
2640942
2641198
2641454
2641710
2639919
2640175
2640431
2640687
2640943
2641199
2641455
2641711
