140849
140594
210177
404025
601135
603440
1254434
1255971
1255206
1259564
1387567
1450287
1584160
1583394
1584162
1583139
1583651
1583907
1584419
1583396
1584676
1583398
1583654
1583911
1585707
1653808
1779751
1846843
1910309
2368303
2368304
2564400
2629680
2639920
2703152
2703154
2765851
2766108
2761264
2762035
2764349
2763070
2764606
2957357
2957613
2958127
2958383
3036929
3030312
3029039
3029040
3090737
3089202
3090738
3090740
3089205
3090485
3090997
3090742
3091254
3092534
3089975
3090231
3091255
3092535
3090232
3090488
3091256
3091769
3094329
3091258
