0 0 0.906250003376 0.786206901073 1.40350878239
0 1 0.819152002812 0.867356419563 1.40746605396
0 2 0.816793887927 0.906542062759 1.35051548481
1 0 0.869822479072 0.81632655859 1.40833330154
1 1 0.695803987278 0.911472916603 1.57677352428
1 2 0.767123267628 0.866071403027 1.50515460968
2 0 0.792682899172 0.915384590626 1.37815129757
2 1 0.73188389296 0.904727220535 1.51021969318
2 2 0.727272727273 0.923076927662 1.48958337307
3 0 0.89570549527 0.794520556927 1.40517246723
3 1 0.697080079372 0.919027864933 1.56094872952
3 2 0.874015722599 0.882882893085 1.29591834545
4 0 0.694581267736 0.900709211826 1.59842514992
4 1 0.711863014489 0.889864683151 1.57862722874
4 2 0.818181827049 0.824074089527 1.48314607143
5 0 0.820809234981 0.866197168827 1.406504035
5 1 0.667837500195 0.907381772995 1.65020978451
5 2 0.727941196889 0.909090936184 1.51111114025
6 0 0.899371021982 0.888111889362 1.251968503
6 1 0.617386850054 0.910714864731 1.77852594852
6 2 0.848000035583 0.830188691616 1.42045450211
7 0 0.798994947114 0.842767298222 1.48507463932
7 1 0.711750610752 0.856117725372 1.64111363888
7 2 0.651612920265 0.900990128517 1.70329666138
8 0 0.767567587352 0.91549295187 1.42307686806
8 1 0.799537239884 0.844526469707 1.48097598553
8 2 0.830769191155 0.888888895512 1.35416662693
9 0 0.834254132108 0.887417197227 1.35074627399
9 1 0.734354836634 0.884135007858 1.54019403458
9 2 0.773049617286 0.889908254147 1.45360827446
10 0 0.768844231699 0.888888895512 1.46323525906
10 1 0.643882295058 0.90745806694 1.71146082878
10 2 0.81379312352 0.855932176113 1.43564355373
11 0 0.772727247605 0.86274510622 1.5
11 1 0.663270222859 0.907133936882 1.66202712059
11 2 0.798507428589 0.822429895401 1.52272725105
12 0 0.9874999897 0.803797483444 1.25984251499
12 1 0.567479081137 0.938922047615 1.87681138515
12 2 0.802816890625 0.903508782387 1.37864077091
13 0 0.762430913115 0.905797123909 1.44799995422
13 1 0.69515530598 0.904553472996 1.59031784534
13 2 0.832116825972 0.859649121761 1.39795923233
14 0 0.780219792485 0.908450722694 1.41085267067
14 1 0.715898380521 0.880970776081 1.58557617664
14 2 0.749999977648 0.863247871399 1.54455447197
15 0 1.08275862202 0.713375806808 1.29464280605
15 1 0.683548303798 0.892317831516 1.63949930668
15 2 0.79054051316 0.863247871399 1.46534657478
16 0 1.19847324318 0.707006394863 1.18018019199
16 1 0.624432028004 0.916227281094 1.74787998199
16 2 0.856115115256 0.823529422283 1.41836738586
17 0 0.849740968333 0.847561001778 1.38848924637
17 1 0.634795502148 0.915585160255 1.7205504179
17 2 0.743589773137 0.853448271751 1.57575762272
18 0 0.873684191889 0.801204800606 1.42857146263
18 1 0.597701467191 0.928108513355 1.8026727438
18 2 0.965517257255 0.771428585052 1.34259259701
19 0 0.779166660474 0.866310179234 1.48148143291
19 1 0.742013889196 0.874619483948 1.54088008404
19 2 0.77900552127 0.893617033958 1.43650794029
20 0 0.842657308237 0.825726151466 1.43718588352
20 1 0.725467853068 0.886485338211 1.55492794514
20 2 0.749999977648 0.928104579449 1.43661975861
21 0 0.963210726919 0.774305582047 1.34080719948
21 1 0.582621280693 0.927470266819 1.85060465336
21 2 0.798165152454 0.890804588795 1.40645158291
22 0 0.822580613529 0.879084944725 1.38289964199
22 1 0.894927564449 0.777792394161 1.4366414547
22 2 0.874418594955 0.824468076229 1.38709676266
23 0 0.808853156738 0.868159174919 1.42406880856
23 1 0.672383920384 0.905416846275 1.64260864258
23 2 0.86872585753 0.848888874054 1.35602092743
24 0 0.872047255963 0.805869102478 1.42296922207
24 1 0.718726585567 0.863523304462 1.6112473011
24 2 0.815789458329 0.834677398205 1.46859908104
25 0 0.832792242926 0.873294353485 1.375
25 1 0.731295177393 0.899452149868 1.52029979229
25 2 0.862068990323 0.871999979019 1.33027517796
26 0 0.806584358974 0.857142865658 1.44642853737
26 1 0.924832794126 0.785133838654 1.37718749046
26 2 0.743781104453 0.872909724712 1.54022991657
27 0 0.74795802109 0.867394685745 1.54136693478
27 1 0.674300901607 0.889185607433 1.6678378582
27 2 0.768707479253 0.846607685089 1.53658533096
28 0 0.699239927607 0.894409954548 1.59895837307
28 1 0.86558334882 0.801604628563 1.44122195244
28 2 0.869565235419 0.819444417953 1.40338981152
29 0 0.845878120298 0.834745764732 1.41624367237
29 1 0.741619895898 0.879974067211 1.53231751919
29 2 0.873786391586 0.841666638851 1.35973596573
30 0 1.018987346 0.719254672527 1.36442136765
30 1 0.862515015547 0.806783437729 1.43706488609
30 2 0.957207220571 0.729411780834 1.43225800991
31 0 0.849999964535 0.818057477474 1.43812704086
31 1 0.735246032321 0.838857889175 1.62135803699
31 2 0.743902468224 0.878220140934 1.53066670895
32 0 0.932555074625 0.791376888752 1.35500884056
32 1 0.709820296817 0.900725483894 1.56408059597
32 2 0.711256118008 0.899082541466 1.5637755394
33 0 0.813679218288 0.886956512928 1.38562095165
33 1 1.0 0.0 0.0
33 2 0.880626261714 0.837777793407 1.35543763638
34 0 0.78420463827 0.880851089954 1.44766509533
34 1 0.834681632534 0.866401672363 1.38280153275
34 2 0.752883060282 0.914660811424 1.45215308666
35 0 0.826224359402 0.866156816483 1.39735102654
35 1 0.837844327262 0.858359158039 1.39048933983
35 2 0.737274218445 0.879732728004 1.54177212715
36 0 0.802521042169 0.840314149857 1.48286604881
36 1 1.0 0.0 0.0
36 2 0.958868900185 0.809651494026 1.2880795002
37 0 2.12182739383 0.406698554754 1.15882349014
37 1 0.815037815189 0.873341679573 1.40487623215
37 2 0.952261314804 0.765171527863 1.37241375446
38 0 407.000007676 0.00245700241067 1.0
38 1 1.21892353517 0.681433081627 1.20392751694
38 2 1.2367346674 0.683168292046 1.18357491493
39 0 1.23795183701 0.659367382526 1.22509229183
39 1 0.729669165814 0.912467479706 1.50195395947
39 2 1.21553884512 0.686597943306 1.19819819927
40 0 0.897651017125 0.777570068836 1.43269228935
40 1 0.868106168271 0.829544186592 1.3886333704
40 2 0.780740741568 0.851992428303 1.50334072113
41 0 0.879518107659 0.838356137276 1.3562091589
41 1 0.804360877181 0.890232563019 1.39651489258
41 2 0.863636368316 0.827935218811 1.39853298664
42 0 1.42999998551 0.58041960001 1.20481932163
42 1 0.645032326942 0.92034548521 1.684486866
42 2 0.940038665645 0.786008238792 1.35340309143
43 0 0.790960471155 0.826190471649 1.5302593708
43 1 0.771546031967 0.862229049206 1.50319564342
43 2 0.80141844988 0.858407080173 1.45360827446
44 0 1.0 0.0 0.0
44 1 0.534038372472 0.953296244144 1.96426308155
44 2 1.24324326327 0.643478274345 1.25
45 0 0.846491241348 0.849740922451 1.3902438879
45 1 0.749630015412 0.898324251175 1.48497760296
45 2 0.950464428206 0.798045575619 1.31836736202
46 0 0.758064537992 0.861702144146 1.53086423874
46 1 0.815711717178 0.874005258083 1.40264976025
46 2 0.977401158908 0.780346810818 1.31111109257
47 0 1.52173908311 0.552380979061 1.18965518475
47 1 1.04336212384 0.769083559513 1.2462105751
47 2 0.957446810939 0.777777791023 1.34285712242
48 0 0.881679382894 0.787878811359 1.43956041336
48 1 0.975365662943 0.748331189156 1.37005722523
48 2 1.0964912275 0.67199999094 1.35714280605
49 0 0.799307926496 0.822510838509 1.52105259895
49 1 0.658356757666 0.903377592564 1.68139362335
49 2 1.08108106715 0.725000023842 1.27586209774
50 0 0.902255626159 0.787500023842 1.40740740299
50 1 0.842611770558 0.841687738895 1.41000771523
50 2 1.04615382697 0.779411792755 1.22641503811
51 0 1.05172413901 0.704918026924 1.34883725643
51 1 0.685372907999 0.936133146286 1.55860280991
51 2 1.13924053555 0.600000023842 1.46296298504
52 0 1.10691827219 0.64204543829 1.40707969666
52 1 0.751480590756 0.883901774883 1.50549125671
52 2 3.27500002928 0.244274809957 1.25
53 0 1.53759404319 0.493887543678 1.31683170795
53 1 0.886467659168 0.801797151566 1.40693032742
53 2 1.62499993946 0.410256415606 1.5
