0 0 1.11111114055 0.600000023842 1.5
0 1 52.9619050193 0.00827189348638 2.28260874748
0 2 0.8 1.0 1.25
1 0 0.933333363003 0.642857134342 1.66666662693
1 1 0.764962863052 0.886090517044 1.47530424595
1 2 1.0 0.0 0.0
2 0 1.4999999553 0.666666686535 1.0
2 1 0.815587203559 0.860356986523 1.42511820793
2 2 0.666666666667 1.0 1.5
3 0 0.600000014305 0.833333313465 2.0
3 1 0.73024865393 0.892397344112 1.53451430798
3 2 1.0 0.75 1.33333337307
4 0 0.83333330022 0.699999988079 1.71428573132
4 1 0.843685754461 0.818472981453 1.44815468788
4 2 0.666666666667 1.0 1.5
5 0 0.727272727273 0.875 1.57142853737
5 1 0.751389046387 0.865567326546 1.53756785393
5 2 0.857142886337 0.833333313465 1.39999997616
6 0 1.0 0.0 0.0
6 1 0.691196884467 0.86947953701 1.66394460201
6 2 1.09090906726 0.833333313465 1.10000002384
7 0 0.699999983311 0.857142865658 1.66666662693
7 1 0.925258067405 0.746320724487 1.44814360142
7 2 0.611111115158 0.909090936184 1.79999995232
8 0 0.857142886337 0.833333313465 1.39999997616
8 1 0.530119044429 0.944432020187 1.99735784531
8 2 1.4999999553 0.666666686535 1.0
9 0 1.4999999553 0.666666686535 1.0
9 1 0.840159771022 0.825455367565 1.4419311285
9 2 0.555555570273 0.800000011921 2.25
10 0 1.74999992177 0.571428596973 1.0
10 1 0.765444213354 0.850686073303 1.53573799133
10 2 0.692307705005 0.888888895512 1.625
11 0 1.33333333333 0.75 1.0
11 1 0.760962444309 0.861216068268 1.5258949995
11 2 1.4999999553 0.555555582047 1.20000004768
12 0 1.0 0.0 0.0
12 1 0.985350840172 0.743348956108 1.36526310444
12 2 1.0 0.857142865658 1.16666662693
13 0 0.555555570273 0.800000011921 2.25
13 1 0.786708405081 0.868247568607 1.46400523186
13 2 0.727272727273 0.875 1.57142853737
14 0 0.888888888889 0.75 1.5
14 1 0.944519576925 0.77183008194 1.37172603607
14 2 0.749999977648 0.777777791023 1.71428573132
15 0 0.8 1.0 1.25
15 1 0.886579618073 0.79072701931 1.42644715309
15 2 0.615384615385 0.75 2.16666674614
16 0 1.0 1.0 1.0
16 1 0.671732213199 0.906116068363 1.64293348789
16 2 0.909090889387 0.600000023842 1.83333337307
17 0 1.14285714286 0.875 1.0
17 1 0.70528841372 0.898179650307 1.57859253883
17 2 0.636363650156 1.0 1.57142853737
18 0 1.0 0.0 0.0
18 1 0.890233788291 0.79862600565 1.40654122829
18 2 0.8 0.875 1.42857146263
19 0 0.727272727273 1.0 1.375
19 1 0.837857047257 0.826804995537 1.4435338974
19 2 0.8 0.875 1.42857146263
20 0 1.16666665508 0.857142865658 1.0
20 1 0.782283915094 0.855364620686 1.4944601059
20 2 0.666666666667 0.875 1.71428573132
21 0 1.0 0.714285731316 1.39999997616
21 1 0.642291279269 0.9078322649 1.71499311924
21 2 0.857142886337 0.833333313465 1.39999997616
22 0 0.874999960884 1.0 1.14285719395
22 1 0.62931496439 0.928280353546 1.71179902554
22 2 1.0 0.0 0.0
23 0 0.874999960884 0.857142865658 1.33333337307
23 1 0.722196585776 0.903434514999 1.53266727924
23 2 0.454545444693 1.0 2.20000004768
24 0 1.16666665508 0.857142865658 1.0
24 1 0.770866093687 0.850810110569 1.52471411228
24 2 0.83333330022 0.600000023842 2.0
25 0 1.6 0.5 1.25
25 1 0.758251054564 0.908068776131 1.45233976841
25 2 0.71428572645 1.0 1.39999997616
26 0 0.874999960884 0.857142865658 1.33333337307
26 1 1.0 0.0 0.0
26 2 0.583333327538 0.714285731316 2.40000009537
27 0 0.636363650156 1.0 1.57142853737
27 1 0.807220656269 0.835601389408 1.48254740238
27 2 0.470588235294 0.875 2.42857146263
28 0 1.0 1.0 1.0
28 1 0.831575038458 0.834092736244 1.4417309761
28 2 0.8 0.875 1.42857146263
29 0 0.642857131909 0.777777791023 2.0
29 1 0.722264488068 0.913334906101 1.51591086388
29 2 0.874999960884 0.857142865658 1.33333337307
30 0 0.636363650156 0.857142865658 1.83333337307
30 1 0.540928551213 0.931876957417 1.98381662369
30 2 1.0 0.777777791023 1.28571426868
31 0 0.77777778808 1.0 1.28571426868
31 1 0.233537209792 0.970298111439 4.41304922104
31 2 0.642857131909 0.888888895512 1.75
32 0 1.0 0.0 0.0
32 1 0.809705335145 0.855025887489 1.4444206953
32 2 0.8 1.0 1.25
33 0 0.666666666667 1.0 1.5
33 1 0.743493155936 0.901939809322 1.49123287201
33 2 1.33333333333 0.75 1.0
34 0 0.692307705005 0.777777791023 1.85714280605
34 1 0.867230332418 0.841657400131 1.37003040314
34 2 1.4999999553 0.666666686535 1.0
35 0 0.8 1.0 1.25
35 1 0.695748874425 0.905053436756 1.58808326721
35 2 0.8 1.0 1.25
36 0 0.749999977648 1.0 1.33333337307
36 1 2.03432393945 0.390859901905 1.25764703751
36 2 1.0 1.0 1.0
37 0 0.666666666667 0.833333313465 1.79999995232
37 1 0.922552147693 0.798902451992 1.35679841042
37 2 1.20000002861 0.75 1.11111116409
38 0 1.0 0.0 0.0
38 1 0.493077141465 0.947006583214 2.14156937599
38 2 1.4999999553 0.5 1.33333337307
39 0 1.4999999553 0.666666686535 1.0
39 1 0.807220578591 0.882543623447 1.40369129181
39 2 2.09999999374 0.428571432829 1.11111116409
40 0 1.11111114055 0.699999988079 1.28571426868
40 1 1.00576377894 0.750800907612 1.32427823544
40 2 1.12499999162 0.833333313465 1.0666667223
41 0 1.0 0.666666686535 1.5
41 1 0.688550953182 0.933666825294 1.55550706387
41 2 1.09999996722 0.681818187237 1.33333337307
42 0 0.84615388495 0.727272748947 1.625
42 1 0.703037180412 0.896692693233 1.58627343178
42 2 0.952380995631 0.800000011921 1.3125
43 0 1.0 0.727272748947 1.375
43 1 0.919055063382 0.7814848423 1.39231622219
43 2 3.18181806975 0.285714298487 1.10000002384
44 0 1.24999998137 0.699999988079 1.14285719395
44 1 0.949862167868 0.774459898472 1.3593788147
44 2 0.84615388495 0.727272748947 1.625
45 0 1.24999998137 0.699999988079 1.14285719395
45 1 0.798772866049 0.85264146328 1.46828460693
45 2 1.0434782825 0.791666686535 1.21052634716
46 0 1.22222223032 0.727272748947 1.125
46 1 0.720039951252 0.891116559505 1.55850744247
46 2 1.05882355911 0.777777791023 1.21428573132
47 0 1.11111114055 0.699999988079 1.28571426868
47 1 1.60677878187 0.507580757141 1.22613632679
47 2 1.21052634237 0.608695626259 1.35714280605
48 0 1.0 0.699999988079 1.42857146263
48 1 0.672093285042 0.878351271152 1.69395637512
48 2 1.0 0.727272748947 1.375
49 0 0.83333330022 0.800000011921 1.5
49 1 1.34180608277 0.545475959778 1.36626398563
49 2 0.899999957085 0.833333313465 1.33333337307
50 0 1.0 0.714285731316 1.39999997616
50 1 1.16468731842 0.662383615971 1.29622709751
50 2 0.866666673554 0.692307710648 1.66666662693
51 0 1.0 0.875 1.14285719395
51 1 0.737216227917 0.919916510582 1.47454047203
51 2 1.20000002861 0.666666686535 1.25
52 0 1.28571426382 0.666666686535 1.16666662693
52 1 0.596573549243 0.907527029514 1.84704065323
52 2 2.57142852764 0.277777791023 1.39999997616
53 0 1.0 0.0 0.0
53 1 1.0 0.0 0.0
53 2 1.0 0.0 0.0
