0 0 1.7255001824 0.488868653774 1.18547606468
0 1 38.9999994915 0.0256410259753 1.0
0 2 1.0 0.0 0.0
1 0 0.689817630142 0.91569262743 1.58312785625
1 1 2.99999991059 0.166666671634 2.0
1 2 1.0 0.0 0.0
2 0 0.668659800142 0.945573270321 1.58161067963
2 1 1.0 0.0 0.0
2 2 1.0 0.0 0.0
3 0 0.694744064005 0.911485612392 1.57915711403
3 1 1.0 0.0 0.0
3 2 1.0 0.0 0.0
4 0 0.701529755902 0.898448467255 1.58657538891
4 1 1.0 0.0 0.0
4 2 1.0 0.0 0.0
5 0 0.663595741587 0.927221298218 1.62522315979
5 1 1.0 0.0 0.0
5 2 1.0 0.0 0.0
6 0 6.98440840508 0.114595964551 1.24939870834
6 1 1.0 0.0 0.0
6 2 1.0 0.0 0.0
7 0 0.675147573198 0.885225653648 1.67319786549
7 1 27.9999987483 0.0357142873108 1.0
7 2 1.0 0.0 0.0
8 0 0.652733309372 0.835886716843 1.83280718327
8 1 1.0 0.0 0.0
8 2 1.0 0.0 0.0
9 0 0.62833445164 0.944334030151 1.68532431126
9 1 1.4999999553 0.666666686535 1.0
9 2 1.0 0.0 0.0
10 0 0.593665367416 0.939384996891 1.7931419611
10 1 1.0 0.0 0.0
10 2 1.0 0.0 0.0
11 0 0.620796798732 0.934077680111 1.72451722622
11 1 1.0 0.0 0.0
11 2 1.0 0.0 0.0
12 0 1.23693307657 0.521480619907 1.55029964447
12 1 1.0 0.0 0.0
12 2 1.0 0.0 0.0
13 0 0.583264781975 0.936311423779 1.83110797405
13 1 1.0 0.0 0.0
13 2 1.0 0.0 0.0
14 0 0.632923647839 0.941276073456 1.67853987217
14 1 1.0 0.0 0.0
14 2 1.0 0.0 0.0
15 0 0.703445442066 0.888701498508 1.59960830212
15 1 1.0 0.0 0.0
15 2 1.0 0.0 0.0
16 0 0.652817581528 0.926152050495 1.65396332741
16 1 1.0 0.0 0.0
16 2 1.0 0.0 0.0
17 0 0.453267449694 0.88240724802 2.50020933151
17 1 1.0 0.0 0.0
17 2 1.0 0.0 0.0
18 0 2.07466855751 0.377351403236 1.27733647823
18 1 1.0 0.0 0.0
18 2 1.0 0.0 0.0
19 0 0.625108368855 0.930414319038 1.7193659544
19 1 1.0 0.0 0.0
19 2 1.0 0.0 0.0
20 0 0.876452734224 0.802815258503 1.42120218277
20 1 1.0 0.0 0.0
20 2 1.0 0.0 0.0
21 0 0.615578978019 0.929667413235 1.74738490582
21 1 1.0 0.0 0.0
21 2 1.0 0.0 0.0
22 0 0.24942358427 0.919310629368 4.36114168167
22 1 1.0 0.0 0.0
22 2 1.0 0.0 0.0
23 0 0.645079945512 0.931603491306 1.66400778294
23 1 1.0 0.0 0.0
23 2 1.0 0.0 0.0
24 0 0.825075520708 0.78899115324 1.53615188599
24 1 1.0 0.0 0.0
24 2 1.0 0.0 0.0
25 0 0.794289258272 0.879363954067 1.43170201778
25 1 1.0 0.0 0.0
25 2 1.0 0.0 0.0
26 0 1.0361546429 0.61604899168 1.56660735607
26 1 1.0 0.0 0.0
26 2 1.0 0.0 0.0
27 0 0.726730561995 0.824349164963 1.66922700405
27 1 1.0 0.0 0.0
27 2 1.0 0.0 0.0
28 0 0.679834190183 0.870226204395 1.69030416012
28 1 1.0 0.0 0.0
28 2 1.0 0.0 0.0
29 0 0.643822005481 0.943404138088 1.64640390873
29 1 3.49999984354 0.142857149243 2.0
29 2 1.0 0.0 0.0
30 0 0.745197188888 0.824666440487 1.62723565102
30 1 1.0 0.0 0.0
30 2 1.0 0.0 0.0
31 0 0.712083274089 0.812890291214 1.72757649422
31 1 2.0 0.300000011921 1.66666662693
31 2 1.0 0.0 0.0
32 0 132.989206953 0.00414739502594 1.81304347515
32 1 1.0 0.0 0.0
32 2 1.0 0.0 0.0
33 0 0.674547341018 0.943388342857 1.57143735886
33 1 8.0 0.125 1.0
33 2 1.0 0.0 0.0
34 0 0.551392997908 0.972768068314 1.86435866356
34 1 1.0 0.0 0.0
34 2 1.0 0.0 0.0
35 0 0.533129452155 0.913957953453 2.05230116844
35 1 1.0 0.0 0.0
35 2 1.0 0.0 0.0
36 0 0.970655197998 0.683565020561 1.50714564323
36 1 6.49999975786 0.115384615958 1.33333337307
36 2 1.0 0.0 0.0
37 0 27.2853111588 0.0235016290098 1.55945587158
37 1 8.0 0.125 1.0
37 2 1.0 0.0 0.0
38 0 7833.49956119 8.51045697345e-05 1.5
38 1 4.99999992549 0.0545454546809 3.66666674614
38 2 1.0 0.0 0.0
39 0 0.769164708975 0.908051550388 1.43175971508
39 1 8.49999996834 0.0588235296309 2.0
39 2 1.0 0.0 0.0
40 0 0.648621732325 0.920595884323 1.67470943928
40 1 1.0 0.0 0.0
40 2 1.0 0.0 0.0
41 0 0.910816486494 0.819724738598 1.33937168121
41 1 1.0 0.0 0.0
41 2 1.0 0.0 0.0
42 0 0.838394149816 0.846972107887 1.40825939178
42 1 1.0 0.0 0.0
42 2 1.0 0.0 0.0
43 0 0.638654932449 0.935733258724 1.6733301878
43 1 1.0 0.0 0.0
43 2 1.0 0.0 0.0
44 0 0.673854841077 0.889571011066 1.66821885109
44 1 1.0 0.0 0.0
44 2 1.0 0.0 0.0
45 0 0.732351162248 0.895648539066 1.52455461025
45 1 1.0 0.0 0.0
45 2 1.0 0.0 0.0
46 0 0.807672680959 0.797323107719 1.55285263062
46 1 1.0 0.0 0.0
46 2 1.0 0.0 0.0
47 0 1.70195108625 0.444611430168 1.32151556015
47 1 1.0 0.0 0.0
47 2 1.0 0.0 0.0
48 0 0.576454700459 0.92984944582 1.86561572552
48 1 1.0 0.0 0.0
48 2 1.0 0.0 0.0
49 0 0.553193209564 0.926303327084 1.95150613785
49 1 1.0 0.0 0.0
49 2 1.0 0.0 0.0
50 0 0.63500506158 0.904303967953 1.74143946171
50 1 1.0 0.0 0.0
50 2 1.0 0.0 0.0
51 0 0.710994846848 0.825576424599 1.70363378525
51 1 1.0 0.0 0.0
51 2 1.0 0.0 0.0
52 0 0.640862488884 0.891797542572 1.74972128868
52 1 1.0 0.0 0.0
52 2 1.0 0.0 0.0
53 0 1.0 0.0 0.0
53 1 1.0 0.0 0.0
53 2 1.0 0.0 0.0
