0 0 1.0 0.0 0.0
0 1 16.9999999367 0.0588235296309 1.0
0 2 1.0 0.0 0.0
1 0 1.0 0.0 0.0
1 1 0.220588236841 0.933333337307 4.85714292526
1 2 1.0 0.0 0.0
2 0 1.0 0.0 0.0
2 1 1.0 0.692307710648 1.44444441795
2 2 1.0 0.0 0.0
3 0 1.0 0.0 0.0
3 1 0.368421066501 0.785714268684 3.45454549789
3 2 1.0 0.0 0.0
4 0 1.0 0.0 0.0
4 1 0.580645165756 0.944444417953 1.82352936268
4 2 1.0 0.0 0.0
5 0 1.0 0.0 0.0
5 1 0.422222217748 0.947368443012 2.5
5 2 1.0 0.0 0.0
6 0 1.0 0.0 0.0
6 1 0.474999983013 0.89473682642 2.35294127464
6 2 1.0 0.0 0.0
7 0 1.0 0.0 0.0
7 1 0.655172405714 0.89473682642 1.70588231087
7 2 1.0 0.0 0.0
8 0 1.0 0.0 0.0
8 1 0.487179478245 0.947368443012 2.16666674614
8 2 1.0 0.0 0.0
9 0 1.0 0.0 0.0
9 1 0.487179478245 0.947368443012 2.16666674614
9 2 1.0 0.0 0.0
10 0 1.0 0.0 0.0
10 1 0.51351352344 0.947368443012 2.05555558205
10 2 1.0 0.0 0.0
11 0 1.0 0.0 0.0
11 1 0.39130434377 0.833333313465 3.06666660309
11 2 1.0 0.0 0.0
12 0 1.0 0.0 0.0
12 1 0.692307705005 0.944444417953 1.52941179276
12 2 1.0 0.0 0.0
13 0 1.0 0.0 0.0
13 1 0.424999982268 1.0 2.35294127464
13 2 1.0 0.0 0.0
14 0 1.0 0.0 0.0
14 1 0.64 0.9375 1.66666662693
14 2 1.0 0.0 0.0
15 0 1.0 0.0 0.0
15 1 0.740740727659 0.899999976158 1.5
15 2 1.0 0.0 0.0
16 0 1.0 0.0 0.0
16 1 0.229729737131 0.941176474094 4.625
16 2 1.0 0.0 0.0
17 0 1.0 0.0 0.0
17 1 0.384615398723 0.949999988079 2.73684215546
17 2 1.0 0.0 0.0
18 0 1.0 0.0 0.0
18 1 0.849999964535 0.941176474094 1.25
18 2 1.0 0.0 0.0
19 0 1.0 0.0 0.0
19 1 0.263157898039 1.0 3.79999995232
19 2 1.0 0.0 0.0
20 0 1.0 0.0 0.0
20 1 0.551724137931 1.0 1.8125
20 2 1.0 0.0 0.0
21 0 1.0 0.0 0.0
21 1 0.708333315742 0.823529422283 1.71428573132
21 2 1.0 0.0 0.0
22 0 1.0 0.0 0.0
22 1 0.424999982268 0.823529422283 2.85714292526
22 2 1.0 0.0 0.0
23 0 1.0 0.0 0.0
23 1 0.39130434377 0.888888895512 2.875
23 2 1.0 0.0 0.0
24 0 1.0 0.0 0.0
24 1 0.344827574867 0.600000023842 4.83333349228
24 2 1.0 0.0 0.0
25 0 1.0 0.0 0.0
25 1 0.409090913524 0.777777791023 3.14285707474
25 2 1.0 0.0 0.0
26 0 1.0 0.0 0.0
26 1 1.0 0.0 0.0
26 2 1.0 0.0 0.0
27 0 1.0 0.0 0.0
27 1 0.43478261771 0.899999976158 2.55555558205
27 2 1.0 0.0 0.0
28 0 1.0 0.0 0.0
28 1 0.374999988824 0.888888895512 3.0
28 2 1.0 0.0 0.0
29 0 1.0 0.0 0.0
29 1 0.449999978542 1.0 2.22222232819
29 2 1.0 0.0 0.0
30 0 1.0 0.0 0.0
30 1 0.560000005341 0.928571403027 1.92307686806
30 2 1.0 0.0 0.0
31 0 1.0 0.0 0.0
31 1 0.533333333333 0.3125 6.0
31 2 1.0 0.0 0.0
32 0 1.0 0.0 0.0
32 1 0.529411779555 0.611111104488 3.09090900421
32 2 1.0 0.0 0.0
33 0 1.0 0.0 0.0
33 1 0.409090913524 0.888888895512 2.75
33 2 1.0 0.0 0.0
34 0 1.0 0.0 0.0
34 1 0.533333333333 1.0 1.875
34 2 1.0 0.0 0.0
35 0 1.0 0.0 0.0
35 1 0.515151530039 1.0 1.94117641449
35 2 1.0 0.0 0.0
36 0 1.0 0.0 0.0
36 1 0.642857131909 0.944444417953 1.64705884457
36 2 1.0 0.0 0.0
37 0 1.0 0.0 0.0
37 1 0.666666666667 0.888888895512 1.6875
37 2 1.0 0.0 0.0
38 0 1.0 0.0 0.0
38 1 0.15702479277 0.947368443012 6.72222232819
38 2 1.0 0.0 0.0
39 0 1.0 0.0 0.0
39 1 0.428571443168 0.866666674614 2.69230771065
39 2 1.0 0.0 0.0
40 0 1.0 0.0 0.0
40 1 0.736842133002 0.714285731316 1.89999997616
40 2 1.0 0.0 0.0
41 0 1.0 0.0 0.0
41 1 0.457142857143 0.875 2.5
41 2 1.0 0.0 0.0
42 0 1.0 0.0 0.0
42 1 0.346938789015 0.882352948189 3.26666665077
42 2 1.0 0.0 0.0
43 0 1.0 0.0 0.0
43 1 0.541666663976 0.846153855324 2.18181824684
43 2 1.0 0.0 0.0
44 0 1.0 0.0 0.0
44 1 0.71428572645 0.899999976158 1.55555558205
44 2 1.0 0.0 0.0
45 0 1.0 0.0 0.0
45 1 0.294117638809 1.0 3.40000009537
45 2 1.0 0.0 0.0
46 0 1.0 0.0 0.0
46 1 0.318181825078 0.928571403027 3.3846154213
46 2 1.0 0.0 0.0
47 0 1.0 0.0 0.0
47 1 1.0 0.636363625526 1.57142853737
47 2 1.0 0.0 0.0
48 0 1.0 0.0 0.0
48 1 0.229166659837 1.0 4.36363649368
48 2 1.0 0.0 0.0
49 0 1.0 0.0 0.0
49 1 0.8 0.833333313465 1.5
49 2 1.0 0.0 0.0
50 0 1.0 0.0 0.0
50 1 0.578947361156 1.0 1.72727274895
50 2 1.0 0.0 0.0
51 0 1.0 0.0 0.0
51 1 0.441176473682 0.866666674614 2.6153845787
51 2 1.0 0.0 0.0
52 0 1.0 0.0 0.0
52 1 0.769230797446 0.899999976158 1.44444441795
52 2 1.0 0.0 0.0
