0 0 1.0 0.0 0.0
0 1 4.42153497262 0.198186531663 1.14117646217
0 2 1.0 0.0 0.0
1 0 0.428571443168 0.666666686535 3.5
1 1 0.658293313863 0.933501660824 1.62729179859
1 2 1.0 0.0 0.0
2 0 1.0 0.0 0.0
2 1 0.697329946912 0.919787585735 1.5591006279
2 2 1.0 0.0 0.0
3 0 0.5 1.0 2.0
3 1 0.665376832351 0.901412367821 1.66728115082
3 2 1.0 0.0 0.0
4 0 1.0 0.0 0.0
4 1 0.727410208464 0.893451154232 1.53868532181
4 2 1.0 0.0 0.0
5 0 1.0 0.0 0.0
5 1 0.667888970949 0.915817022324 1.63488435745
5 2 0.5 1.0 2.0
6 0 1.0 1.0 1.0
6 1 0.611656654201 0.918436050415 1.78009581566
6 2 1.0 0.0 0.0
7 0 0.25 1.0 4.0
7 1 0.722678084635 0.859612882137 1.60972678661
7 2 1.0 0.0 0.0
8 0 0.25 1.0 4.0
8 1 0.562472613465 0.936866700649 1.89767050743
8 2 1.0 0.0 0.0
9 0 1.0 0.0 0.0
9 1 0.709964717616 0.899372696877 1.56611454487
9 2 1.0 0.0 0.0
10 0 1.0 0.0 0.0
10 1 0.649999988377 0.91330075264 1.68450701237
10 2 1.0 0.0 0.0
11 0 1.0 0.0 0.0
11 1 0.657066319097 0.920998990536 1.65246260166
11 2 1.0 0.0 0.0
12 0 1.0 0.0 0.0
12 1 0.767259948184 0.879428982735 1.48202896118
12 2 1.0 0.0 0.0
13 0 1.0 0.0 0.0
13 1 0.678484555889 0.92597335577 1.59170126915
13 2 1.0 0.0 0.0
14 0 1.0 0.0 0.0
14 1 0.718286375811 0.892331540585 1.56018519402
14 2 1.0 0.0 0.0
15 0 1.0 0.0 0.0
15 1 0.650309836068 0.897244393826 1.71383464336
15 2 0.5 1.0 2.0
16 0 1.0 0.0 0.0
16 1 0.593039222375 0.94337195158 1.78744888306
16 2 1.0 0.0 0.0
17 0 1.0 0.0 0.0
17 1 0.624134037727 0.943469285965 1.69822156429
17 2 1.0 0.0 0.0
18 0 1.0 0.0 0.0
18 1 0.683617823399 0.914800524712 1.59904336929
18 2 0.5 1.0 2.0
19 0 1.0 0.0 0.0
19 1 0.656077584858 0.933486223221 1.63281464577
19 2 1.0 0.0 0.0
20 0 1.0 0.0 0.0
20 1 0.629428669809 0.946754574776 1.67809319496
20 2 1.0 0.0 0.0
21 0 1.0 0.0 0.0
21 1 0.605430566846 0.931829810143 1.77255225182
21 2 0.5 1.0 2.0
22 0 1.0 0.0 0.0
22 1 0.587392534494 0.95301669836 1.78636848927
22 2 1.0 0.0 0.0
23 0 1.0 0.0 0.0
23 1 0.60541715256 0.957194149494 1.72562026978
23 2 1.0 0.0 0.0
24 0 1.0 0.0 0.0
24 1 0.698570050472 0.905294775963 1.58124816418
24 2 1.0 0.0 0.0
25 0 1.0 0.0 0.0
25 1 0.680309335028 0.944275021553 1.55666470528
25 2 1.0 1.0 1.0
26 0 1.0 0.0 0.0
26 1 1.0 0.0 0.0
26 2 2.0 0.5 1.0
27 0 1.0 0.0 0.0
27 1 0.639964015695 0.921237707138 1.69618320465
27 2 2.0 0.5 1.0
28 0 1.0 0.0 0.0
28 1 0.647793668731 0.944634497166 1.63417851925
28 2 0.333333333333 1.0 3.0
29 0 1.0 0.0 0.0
29 1 0.606526644459 0.965677201748 1.70733273029
29 2 1.0 1.0 1.0
30 0 1.0 0.0 0.0
30 1 0.51110814997 0.947630286217 2.06465864182
30 2 2.0 0.5 1.0
31 0 1.0 0.0 0.0
31 1 0.289387380134 0.974761784077 3.5450463295
31 2 1.0 0.0 0.0
32 0 1.0 0.0 0.0
32 1 0.629889672923 0.947717607021 1.67516100407
32 2 1.0 0.0 0.0
33 0 1.0 0.0 0.0
33 1 0.63070386427 0.963678956032 1.64528870583
33 2 1.0 0.0 0.0
34 0 1.0 0.0 0.0
34 1 0.669784328789 0.951268196106 1.5695027113
34 2 1.0 0.0 0.0
35 0 1.0 0.0 0.0
35 1 0.593429468825 0.960032403469 1.75527429581
35 2 1.0 0.0 0.0
36 0 1.0 0.0 0.0
36 1 4.38702462064 0.175165727735 1.30131006241
36 2 1.0 0.0 0.0
37 0 1.0 0.0 0.0
37 1 0.673536378967 0.939886271954 1.57966005802
37 2 1.0 0.0 0.0
38 0 1.0 0.0 0.0
38 1 0.457170461648 0.966966152191 2.26209354401
38 2 1.0 0.0 0.0
39 0 1.0 0.0 0.0
39 1 0.629305899945 0.964324593544 1.6478395462
39 2 2.0 0.5 1.0
40 0 1.0 0.0 0.0
40 1 0.70979969581 0.911263644695 1.54603791237
40 2 0.666666666667 1.0 1.5
41 0 1.0 0.0 0.0
41 1 0.613604366662 0.971457719803 1.6775970459
41 2 0.666666666667 1.0 1.5
42 0 1.0 0.0 0.0
42 1 0.549120139341 0.956093847752 1.9047242403
42 2 1.4999999553 0.666666686535 1.0
43 0 1.0 0.0 0.0
43 1 0.620695100009 0.930771172047 1.73092699051
43 2 1.4999999553 0.666666686535 1.0
44 0 1.0 0.0 0.0
44 1 0.665648851085 0.910805284977 1.64941239357
44 2 0.571428571429 0.75 2.33333325386
45 0 1.0 0.0 0.0
45 1 0.601605944824 0.942248463631 1.76409697533
45 2 0.749999977648 1.0 1.33333337307
46 0 1.0 0.0 0.0
46 1 0.605035509721 0.930303812027 1.77661907673
46 2 0.749999977648 0.666666686535 2.0
47 0 1.0 0.0 0.0
47 1 0.802704347274 0.875446677208 1.42303204536
47 2 1.0 1.0 1.0
48 0 1.0 0.0 0.0
48 1 0.530918844544 0.940879225731 2.00187969208
48 2 0.666666666667 0.5 3.0
49 0 1.0 0.5 2.0
49 1 0.650222732427 0.896472990513 1.715539217
49 2 0.5 1.0 2.0
50 0 1.0 0.5 2.0
50 1 0.684426245893 0.911605358124 1.60275256634
50 2 1.0 0.0 0.0
51 0 1.0 1.0 1.0
51 1 0.60511564099 0.958888232708 1.72342991829
51 2 1.0 0.0 0.0
52 0 2.0 0.5 1.0
52 1 0.494823721503 0.94147580862 2.14654660225
52 2 1.0 0.0 0.0
53 0 1.0 0.0 0.0
53 1 1.0 0.0 0.0
53 2 1.0 0.0 0.0
