0 0 1.38235299207 0.489361703396 1.47826087475
0 1 32.7314508122 0.0103587945923 2.94934463501
0 2 1.74999992177 0.410714298487 1.39130437374
1 0 0.893111614677 0.635638296604 1.76150631905
1 1 0.751969586344 0.856241226196 1.55311489105
1 2 1.0 0.0 0.0
2 0 0.657894745098 0.724444448948 2.09815955162
2 1 0.725250523127 0.866788387299 1.59073877335
2 2 0.705882372741 0.666666686535 2.125
3 0 0.794326262625 0.678571403027 1.85526311398
3 1 0.607031913034 0.920549213886 1.78954029083
3 2 0.951965107129 0.678899109364 1.5472972393
4 0 0.558823539208 0.671052634716 2.66666674614
4 1 0.695582261649 0.85653346777 1.67844521999
4 2 0.650224194044 0.731034457684 2.1037735939
5 0 1.0 0.0 0.0
5 1 0.636430034984 0.87415510416 1.7974666357
5 2 0.698581569143 0.68527919054 2.08888888359
6 0 0.863636368316 0.736842095852 1.57142853737
6 1 0.599799580786 0.878881037235 1.89698433876
6 2 0.850961558457 0.672316372395 1.74789917469
7 0 0.682692334298 0.760563373566 1.92592597008
7 1 0.765951066871 0.776268064976 1.68185007572
7 2 0.57647058581 0.714285731316 2.42857146263
8 0 0.577181210824 0.755813956261 2.29230761528
8 1 0.388180438438 0.961035966873 2.68056726456
8 2 2.06249993853 0.315151512623 1.53846156597
9 0 0.57954544905 0.72549021244 2.37837839127
9 1 0.7386388141 0.837857782841 1.61583709717
9 2 0.49374999485 0.772151887417 2.62295079231
10 0 0.597402612201 0.706521749496 2.36923074722
10 1 0.656619272649 0.871535181999 1.74743676186
10 2 0.616766464865 0.699029147625 2.31944441795
11 0 0.72222220309 0.666666686535 2.07692313194
11 1 0.63506856699 0.887464404106 1.77430570126
11 2 0.77777778808 0.714285731316 1.79999995232
12 0 1.156249972 0.5 1.72972977161
12 1 0.871127176388 0.766186237335 1.49824941158
12 2 0.853211041834 0.666666686535 1.75806450844
13 0 0.763888921773 0.763636350632 1.71428573132
13 1 0.724794084146 0.863285422325 1.59819936752
13 2 1.11688310478 0.581395328045 1.53999996185
14 0 0.965517257255 0.696428596973 1.48717951775
14 1 0.783147528213 0.809498846531 1.57739412785
14 2 0.804597729814 0.742857158184 1.67307686806
15 0 1.26666662137 0.631578922272 1.25
15 1 1.3169095779 0.517796933651 1.46650862694
15 2 0.870129874171 0.716417908669 1.60416662693
16 0 1.23999999113 0.596774220467 1.35135138035
16 1 0.5704594164 0.913585662842 1.91878354549
16 2 0.975609778791 0.6875 1.49090909958
17 0 0.758064537992 0.765957474709 1.72222220898
17 1 0.576694262067 0.917896032333 1.88912582397
17 2 0.761363649772 0.880596995354 1.49152541161
18 0 0.779660985443 0.847826063633 1.51282048225
18 1 0.726657474094 0.826492547989 1.66506552696
18 2 0.615384615385 0.859375 1.89090907574
19 0 0.551020410844 0.796296298504 2.27906966209
19 1 0.82590011468 0.781064689159 1.55019199848
19 2 0.869565235419 0.800000011921 1.4375
20 0 0.929824611964 0.622641503811 1.72727274895
20 1 0.651530527523 0.877444803715 1.74922394753
20 2 0.818181827049 0.916666686535 1.33333337307
21 0 0.749999977648 0.809523820877 1.64705884457
21 1 0.510201403037 0.932292163372 2.10235643387
21 2 0.8 0.8125 1.53846156597
22 0 0.745098035732 0.815789461136 1.6451612711
22 1 0.518932872225 0.93768876791 2.05508637428
22 2 1.0 0.0 0.0
23 0 0.892857139056 0.77999997139 1.43589746952
23 1 0.602600707408 0.916927397251 1.80982005596
23 2 0.5 1.0 2.0
24 0 1.48780493645 0.459016382694 1.46428573132
24 1 0.677360510629 0.856107473373 1.72445487976
24 2 1.0 0.0 0.0
25 0 1.04545453412 0.717391312122 1.33333337307
25 1 0.748680243262 0.877546846867 1.52206540108
25 2 1.24999998137 0.5 1.60000002384
26 0 0.803921564869 0.804878056049 1.54545450211
26 1 1.0 0.0 0.0
26 2 0.923076889219 0.75 1.44444441795
27 0 0.938775523907 0.739130437374 1.44117641449
27 1 0.767291178245 0.794210314751 1.64098370075
27 2 0.8 0.8125 1.53846156597
28 0 0.924528335158 0.795918345451 1.35897433758
28 1 0.823052270431 0.777522981167 1.56264162064
28 2 0.794871799731 0.661290347576 1.90243899822
29 0 0.808510605487 0.842105269432 1.46875
29 1 0.667199507383 0.889649510384 1.68471074104
29 2 1.01785713527 0.736842095852 1.33333337307
30 0 0.732142852467 0.731707334518 1.86666667461
30 1 0.370333541796 0.960266113281 2.81200027466
30 2 0.695652173913 0.791666686535 1.81578946114
31 0 0.673469381201 0.909090936184 1.63333332539
31 1 0.255333925051 0.976714670658 4.00980949402
31 2 0.703703731666 0.868421077728 1.63636362553
32 0 1.0 0.0 0.0
32 1 0.804680699787 0.823997557163 1.50817060471
32 2 1.07843136121 0.7090908885 1.30769228935
33 0 0.774193572204 0.791666686535 1.63157892227
33 1 0.691731170926 0.894669771194 1.61584579945
33 2 0.868852457318 0.811320781708 1.41860461235
34 0 0.739999984121 0.837837815285 1.61290323734
34 1 0.766485064538 0.859987556934 1.51706492901
34 2 0.851351315693 0.841269850731 1.3962264061
35 0 0.954545402822 0.761904776096 1.375
35 1 1.00147829115 0.585719168186 1.70478272438
35 2 1.08823530747 0.675675690174 1.36000001431
36 0 1.0 0.694444417953 1.44000005722
36 1 14.1000619186 0.0356079302728 1.9917383194
36 2 1.89999993205 0.368421047926 1.42857146263
37 0 0.934782579626 0.674418628216 1.58620691299
37 1 0.861618912664 0.804678559303 1.44232237339
37 2 1.13636364252 0.560000002384 1.57142853737
38 0 1.0 0.0 0.0
38 1 0.414225491015 0.947394609451 2.54819250107
38 2 1.0 0.0 0.0
39 0 1.0 0.0 0.0
39 1 0.733214554425 0.897437036037 1.51972484589
39 2 1.0 0.0 0.0
40 0 0.5 1.0 2.0
40 1 0.816310229899 0.80314463377 1.52528512478
40 2 1.0 0.5 2.0
41 0 1.0 0.0 0.0
41 1 0.609505253187 0.93446201086 1.75574290752
41 2 1.10526315096 0.666666686535 1.35714280605
42 0 1.0 0.0 0.0
42 1 1.0 0.0 0.0
42 2 0.83333330022 0.800000011921 1.5
43 0 2.0 0.5 1.0
43 1 0.710606008624 0.85447627306 1.64691472054
43 2 1.25396823855 0.468354433775 1.7027027607
44 0 0.600000014305 0.666666686535 2.5
44 1 0.77223747877 0.800580322742 1.61749958992
44 2 0.624999990687 0.866666674614 1.84615385532
45 0 10.9999996722 0.0909090936184 1.0
45 1 0.84548994849 0.784079194069 1.50845241547
45 2 1.21212122964 0.699999988079 1.17857146263
46 0 1.0 0.629629611969 1.58823525906
46 1 0.639617172492 0.890264809132 1.75614619255
46 2 0.711111111111 0.8125 1.73076927662
47 0 1.41666663148 0.558823525906 1.26315784454
47 1 1.3075510275 0.577812194824 1.32359361649
47 2 1.24999998137 0.657142877579 1.21739125252
48 0 0.868421071702 0.757575750351 1.51999998093
48 1 0.654515776916 0.840167462826 1.81850290298
48 2 0.891891889018 0.727272748947 1.54166662693
49 0 0.613333345032 0.869565188885 1.875
49 1 0.820335812612 0.744093239307 1.63825297356
49 2 0.647058841679 0.818181812763 1.88888883591
50 0 0.616438370257 0.911111116409 1.7804877758
50 1 0.894308842547 0.744111299515 1.50270795822
50 2 0.896551753621 0.692307710648 1.61111116409
51 0 1.03703701872 0.678571403027 1.42105257511
51 1 0.55153906248 0.938142061234 1.93265843391
51 2 0.774193572204 0.791666686535 1.63157892227
52 0 0.810344845907 0.765957474709 1.61111116409
52 1 0.612008877133 0.867603361607 1.88330674171
52 2 1.14814814308 0.419354826212 2.07692313194
53 0 1.0 0.0 0.0
53 1 1.0 0.0 0.0
53 2 1.0 0.0 0.0
