0 0 0.857142886337 0.84375 1.38271605968
0 1 0.809778105218 0.87162733078 1.41678237915
0 2 0.723076946947 0.946808516979 1.46067416668
1 0 0.869565235419 0.800000011921 1.4375
1 1 0.686987453233 0.913741290569 1.59304451942
1 2 0.783333353566 0.925531923771 1.37931036949
2 0 0.823008826983 0.913978517056 1.32941174507
2 1 0.724652894998 0.904065430164 1.52640604973
2 2 0.740458003812 0.865979373455 1.55952382088
3 0 0.763779516805 0.89690721035 1.45977008343
3 1 0.689440384783 0.918143808842 1.57976531982
3 2 0.813953497398 0.866666674614 1.41758239269
4 0 0.686131384473 0.904255330563 1.61176466942
4 1 0.701583382678 0.89360755682 1.59504842758
4 2 0.962616842807 0.796116530895 1.30487799644
5 0 0.759398481947 0.900990128517 1.46153843403
5 1 0.655312387459 0.908308029175 1.68003547192
5 2 0.876190456295 0.836956501007 1.36363637447
6 0 1.0 0.788990855217 1.26744186878
6 1 0.611642382841 0.907075107098 1.80243325233
6 2 0.862068990323 0.870000004768 1.33333337307
7 0 0.753623157157 0.894230782986 1.48387098312
7 1 0.690010777964 0.859492719173 1.68617212772
7 2 0.711111111111 0.895833313465 1.56976747513
8 0 0.784615394688 0.872548997402 1.46067416668
8 1 1.100013382 0.690964758396 1.31566751003
8 2 0.909090889387 0.800000011921 1.375
9 0 0.808917193153 0.874015748501 1.41441440582
9 1 0.727313966173 0.879475235939 1.56334364414
9 2 0.733812977331 0.921568632126 1.47872340679
10 0 0.855172444728 0.838709652424 1.39423072338
10 1 0.63305829593 0.905412912369 1.7446552515
10 2 0.838709664518 0.817307710648 1.45882356167
11 0 0.8 0.90625 1.37931036949
11 1 0.657437399458 0.906509399414 1.67792785168
11 2 0.742647082909 0.900990128517 1.49450552464
12 0 0.903448320427 0.854961812496 1.29464280605
12 1 0.562709487266 0.934214234352 1.90225744247
12 2 0.873873867304 0.865979373455 1.32142853737
13 0 0.810218991497 0.864864885807 1.42708337307
13 1 0.684183083193 0.905789554119 1.61361670494
13 2 0.890909137253 0.867346942425 1.29411768913
14 0 0.757763988621 0.868852436543 1.51886796951
14 1 0.707562048475 0.875824451447 1.61368370056
14 2 0.77777778808 0.87619048357 1.46739125252
15 0 1.21186443127 0.699300706387 1.17999994755
15 1 0.670582377129 0.890739440918 1.67416083813
15 2 0.853658544032 0.895238101482 1.30851066113
16 0 1.28070175171 0.63698631525 1.22580647469
16 1 0.617317109696 0.911567091942 1.77706384659
16 2 0.873015887883 0.818181812763 1.39999997616
17 0 0.784810140793 0.895161271095 1.42342340946
17 1 0.621985335912 0.913358509541 1.76026725769
17 2 0.893939353574 0.838983058929 1.33333337307
18 0 0.939393888492 0.832258045673 1.2790697813
18 1 0.592447366194 0.922343313694 1.83002758026
18 2 0.960629966345 0.836065590382 1.2450979948
19 0 0.835748805747 0.861271679401 1.38926172256
19 1 0.7297553035 0.873945057392 1.56797301769
19 2 0.860606078016 0.887323915958 1.30952382088
20 0 0.892561969401 0.796296298504 1.40697669983
20 1 0.720302285214 0.881454944611 1.57501637936
20 2 0.682008357655 0.914110422134 1.60402679443
21 0 1.06276147447 0.732283473015 1.28494620323
21 1 0.580838308842 0.920477211475 1.8703879118
21 2 0.831858382508 0.840425550938 1.43037974834
22 0 0.857142886337 0.818181812763 1.42592597008
22 1 1.45332514555 0.54614084959 1.25988972187
22 2 0.819819828624 0.89010989666 1.37037038803
23 0 0.768539300313 0.877192974091 1.48333334923
23 1 0.660022855215 0.904002249241 1.6759904623
23 2 0.780405392519 0.896103918552 1.42995166779
24 0 0.852173886543 0.829081654549 1.41538465023
24 1 0.701329695958 0.868688762188 1.64139664173
24 2 0.786206874575 0.885964930058 1.43564355373
25 0 0.781362010507 0.924311935902 1.3846154213
25 1 0.725475005531 0.898076653481 1.53484368324
25 2 0.854785452989 0.861003875732 1.35874438286
26 0 0.844799997422 0.854166686535 1.38580930233
26 1 0.92249787015 0.784513533115 1.38176500797
26 2 0.77485377173 0.860377371311 1.5
27 0 0.787921368367 0.859180033207 1.4771784544
27 1 0.662000433252 0.893375098705 1.69086098671
27 2 0.778378386403 0.868055582047 1.48000001907
28 0 0.71310507634 0.884105980396 1.58614230156
28 1 0.881099752947 0.787849187851 1.44056153297
28 2 0.822580613529 0.810457527637 1.5
29 0 0.854137475824 0.834154367447 1.40354335308
29 1 0.728664566189 0.88395601511 1.55253601074
29 2 0.806282705403 0.870129883289 1.42537307739
30 0 1.01622418549 0.727140784264 1.35329341888
30 1 0.882598869581 0.79490685463 1.42534637451
30 2 0.962059658514 0.738028168678 1.4083969593
31 0 0.846047124274 0.813114762306 1.45362901688
31 1 0.716145538091 0.842559993267 1.65728759766
31 2 0.721982764556 0.868656694889 1.59450173378
32 0 0.945249586173 0.795570671558 1.32976448536
32 1 0.715338995199 0.894399821758 1.56299066544
32 2 0.694881896449 0.963172793388 1.49411761761
33 0 0.787833827196 0.887005627155 1.43099784851
33 1 1.0 0.0 0.0
33 2 0.852459056375 0.854395627975 1.3729903698
34 0 1.87499990221 0.447154462337 1.19272732735
34 1 0.819397967829 0.867152571678 1.4073741436
34 2 0.824833678464 0.860215067863 1.40937495232
35 0 0.786082438965 0.901639342308 1.41090905666
35 1 1.02141728057 0.752391517162 1.3012264967
35 2 0.739919373333 0.839237034321 1.61038959026
36 0 0.793103412414 0.859903395176 1.46629214287
36 1 1.0 0.0 0.0
36 2 0.977987434215 0.790996789932 1.29268288612
37 0 1.51449275166 0.511961698532 1.2897195816
37 1 0.801211701886 0.874531388283 1.42717528343
37 2 0.923076889219 0.746794879436 1.45064377785
38 0 307.00001065 0.00325732887723 1.0
38 1 1.15096663969 0.706929862499 1.22902560234
38 2 1.12650599497 0.775401055813 1.14482760429
39 0 1.25825829655 0.658711194992 1.2065217495
39 1 0.72133560897 0.912119150162 1.51988613605
39 2 1.12442394707 0.676229536533 1.31515157223
40 0 0.998148181421 0.740259766579 1.3533834219
40 1 0.746131369553 0.8908816576 1.50440466404
40 2 0.749999977648 0.855218827724 1.55905508995
41 0 0.833698041508 0.871391057968 1.37650597095
41 1 0.846755097777 0.870134472847 1.35723733902
41 2 4.43617009322 0.184652283788 1.22077918053
42 0 1.05231388469 0.720841288567 1.31830239296
42 1 0.63619323735 0.923349678516 1.70233380795
42 2 1.00374534524 0.772388041019 1.28985512257
43 0 0.823754784757 0.811627924442 1.49570202827
43 1 0.753060004693 0.866709411144 1.53213453293
43 2 0.790000010359 0.860759496689 1.47058820724
44 0 1.0 0.0 0.0
44 1 0.525256178451 0.952416300774 1.99895036221
44 2 1.21383650165 0.689119160175 1.19548869133
45 0 0.840816286437 0.839805841446 1.4161850214
45 1 0.703657571425 0.912394106388 1.55760085583
45 2 0.852678541025 0.774869084358 1.51351356506
46 0 0.884422068168 0.789772748947 1.4316546917
46 1 0.778470701769 0.885849058628 1.45010006428
46 2 2.4264706212 0.363636374474 1.13333332539
47 0 1.4285714529 0.577777802944 1.21153843403
47 1 1.00721642033 0.783021271229 1.26795446873
47 2 1.0 0.758241772652 1.3188406229
48 0 0.974999944791 0.707692325115 1.44927537441
48 1 0.962553882989 0.751104474068 1.38316690922
48 2 0.964705914824 0.792682945728 1.30769228935
49 0 0.82439027746 0.804733753204 1.50735294819
49 1 1.01419007565 0.621065855026 1.58760690689
49 2 0.956521778792 0.757575750351 1.37999999523
50 0 0.910526323787 0.786127150059 1.39705884457
50 1 0.828905397504 0.85037112236 1.41868674755
50 2 1.0389610647 0.737500011921 1.30508470535
51 0 1.02439027369 0.738095223904 1.32258069515
51 1 0.680274798773 0.937885642052 1.56734907627
51 2 1.20481930133 0.550000011921 1.50909090042
52 0 1.11483251713 0.605150222778 1.48226952553
52 1 0.759232083539 0.876385450363 1.50290071964
52 2 3.26315783332 0.217741936445 1.40740740299
53 0 1.49397586499 0.487903237343 1.37190079689
53 1 0.888506924037 0.798932611942 1.40873408318
53 2 2.67499997808 0.224299058318 1.66666662693
