0 0 0.791666698125 0.902833998203 1.39910316467
0 1 0.80502889708 0.881843328476 1.4086304903
0 2 0.750769218652 0.901639342308 1.47727274895
1 0 0.833898271387 0.890243887901 1.34703195095
1 1 0.696859218639 0.92149657011 1.5572603941
1 2 0.717717727224 0.92887032032 1.5
2 0 0.7943925331 0.882352948189 1.42666661739
2 1 0.733645474467 0.917328178883 1.48589813709
2 2 0.659340666251 0.904166638851 1.67741930485
3 0 0.790996793055 0.865853667259 1.46009385586
3 1 0.690608552618 0.932044446468 1.55357217789
3 2 0.786885221297 0.891666650772 1.42523360252
4 0 0.636591492391 0.933070838451 1.68354427814
4 1 0.718193639327 0.904267013073 1.53979098797
4 2 0.83333330022 0.843137264252 1.4232558012
5 0 0.836419792478 0.841328442097 1.42105257511
5 1 0.67632109282 0.916759848595 1.61284089088
5 2 0.786184180006 0.86192470789 1.47572815418
6 0 1.00366302076 0.766423344612 1.29999995232
6 1 0.632510079239 0.91524118185 1.72741627693
6 2 0.752293553299 0.914634168148 1.45333337784
7 0 0.802469145251 0.884615361691 1.40869569778
7 1 0.709349295298 0.875319957733 1.61054551601
7 2 0.68351065325 0.910505831242 1.60683763027
8 0 0.717948691615 0.896428585052 1.55378484726
8 1 0.703471339185 0.904031038284 1.57242619991
8 2 0.798761609318 0.879844963551 1.42290747166
9 0 0.745257434999 0.923636376858 1.45275592804
9 1 0.754228380848 0.892534017563 1.48549890518
9 2 0.739495786467 0.912878811359 1.48132777214
10 0 0.775999989639 0.907216489315 1.42045450211
10 1 0.660706353222 0.918982744217 1.64696419239
10 2 0.726775958178 0.872180461884 1.57758617401
11 0 0.711627919208 0.915032684803 1.53571426868
11 1 0.670135225212 0.920886874199 1.62043368816
11 2 0.771676271598 0.910112380981 1.42386829853
12 0 0.861445754057 0.891608417034 1.30196082592
12 1 0.597908171582 0.947310984135 1.76552116871
12 2 0.780281697739 0.895306885242 1.43145155907
13 0 0.717499982893 0.895470380783 1.55642020702
13 1 0.699183628087 0.919821023941 1.55491065979
13 2 0.830860527071 0.853571414948 1.41004180908
14 0 0.760752720596 0.883392214775 1.48800003529
14 1 0.723540086805 0.897536754608 1.53987383842
14 2 0.786885221297 0.895833313465 1.41860461235
15 0 1.07168460109 0.759197294712 1.22907483578
15 1 0.696170435532 0.904941558838 1.58731770515
15 2 0.803713523531 0.864686489105 1.43893134594
16 0 1.15444018526 0.668896317482 1.29499995708
16 1 0.658069498336 0.920003056526 1.65172970295
16 2 0.828571434216 0.836990594864 1.44194757938
17 0 0.747252766831 0.915441155434 1.46184742451
17 1 0.652822611115 0.92635768652 1.6535834074
17 2 0.779746864623 0.909090936184 1.41071426868
18 0 0.940063105623 0.771812081337 1.37826085091
18 1 0.614540312036 0.939734995365 1.73158669472
18 2 0.813895768155 0.899390220642 1.36610174179
19 0 0.76059848633 0.908196747303 1.44765341282
19 1 0.739263717446 0.891879439354 1.51668179035
19 2 0.833740797761 0.835777103901 1.43508768082
20 0 0.928571381131 0.776923060417 1.38613855839
20 1 0.755661828187 0.893565475941 1.48096954823
20 2 0.752535496593 0.881401598454 1.50764524937
21 0 0.81318678549 0.864864885807 1.421875
21 1 0.62266401012 0.936610996723 1.71469545364
21 2 0.849775744551 0.870712399483 1.35151517391
22 0 0.823762388683 0.865384638309 1.40277779102
22 1 0.759609591866 0.893577575684 1.47325289249
22 2 0.871794855806 0.848039209843 1.35260117054
23 0 0.785123934455 0.890526294708 1.43026006222
23 1 0.678359624063 0.919323265553 1.60351026058
23 2 0.749116627969 0.917452812195 1.45501279831
24 0 0.956672426281 0.784420311451 1.33256351948
24 1 0.712896664501 0.886685192585 1.58199083805
24 2 0.815330999616 0.848290622234 1.4458438158
25 0 0.751898747339 0.912457883358 1.45756459236
25 1 0.74884980258 0.903822302818 1.47748208046
25 2 0.82094595322 0.903292179108 1.34851932526
26 0 0.810281522477 0.874622344971 1.41105353832
26 1 0.909605849769 0.808503866196 1.35976743698
26 2 0.751066866519 0.873106062412 1.52494573593
27 0 0.720528479813 0.870239794254 1.59481358528
27 1 0.673485115556 0.90409475565 1.64232099056
27 2 0.738191616184 0.888482630253 1.52469134331
28 0 0.678966772942 0.896739125252 1.64242422581
28 1 0.899817207038 0.776746094227 1.43075942993
28 2 0.84963502171 0.828178703785 1.42116177082
29 0 0.840625019729 0.838909566402 1.41802072525
29 1 0.734190491995 0.895468473434 1.52104103565
29 2 0.84074608903 0.872013628483 1.3639922142
30 0 0.940397386629 0.772300481796 1.37689971924
30 1 1.04289132972 0.731000721455 1.31172609329
30 2 0.900420766998 0.783489108086 1.41749501228
31 0 1.09066305115 0.694789111614 1.31964290142
31 1 0.717607580083 0.859392106533 1.62151730061
31 2 0.818298992077 0.840944886208 1.45318353176
32 0 0.835966016877 0.866279065609 1.38087248802
32 1 0.725974457902 0.902800142765 1.5257627964
32 2 0.726544629065 0.907086610794 1.51736116409
33 0 0.777911150216 0.89814811945 1.43127143383
33 1 1.0 0.0 0.0
33 2 0.865384577691 0.828571438789 1.39463603497
34 0 1.80229883872 0.485969394445 1.14173233509
34 1 0.81490986563 0.882438421249 1.3906121254
34 2 0.848000035583 0.882075488567 1.33689844608
35 0 0.84699457359 0.873118281364 1.35221672058
35 1 0.800501794653 0.879523217678 1.42033362389
35 2 0.789677401378 0.856209158897 1.47900760174
36 0 0.742914966491 0.910081744194 1.47904193401
36 1 1.0 0.0 0.0
36 2 0.855813961081 0.85688406229 1.36363637447
37 0 1.30128204532 0.625615775585 1.22834646702
37 1 0.79139222388 0.889691948891 1.42026233673
37 2 0.927152309097 0.807142853737 1.33628320694
38 0 580.000002161 0.00172413792461 1.0
38 1 1.20122505192 0.695533454418 1.19689929485
38 2 0.993273510742 0.776523709297 1.29651165009
39 0 1.13345866503 0.742951929569 1.1875
39 1 0.730734142071 0.913888692856 1.49743258953
39 2 1.06498198085 0.725423753262 1.29439246655
40 0 0.933090014859 0.800521492958 1.33876216412
40 1 0.746289883425 0.898637592793 1.49110376835
40 2 0.804908009367 0.856707334518 1.45017790794
41 0 0.836671815529 0.867403328419 1.37791931629
41 1 0.796220032386 0.900349318981 1.39494109154
41 2 1.05460749802 0.750809073448 1.26293098927
42 0 0.878345504643 0.862880885601 1.31942212582
42 1 0.659499440983 0.924211084843 1.64064407349
42 2 0.916666639348 0.826758146286 1.31950211525
43 0 0.75881060626 0.846153855324 1.55746138096
43 1 0.778507402848 0.868070483208 1.47972929478
43 2 0.852327489095 0.834274947643 1.4063205719
44 0 1.0 0.0 0.0
44 1 0.553354903023 0.951707184315 1.8988597393
44 2 1.15765766854 0.678988337517 1.27220630646
45 0 0.809430240237 0.876213610172 1.40997231007
45 1 0.729285062937 0.90838265419 1.5095025301
45 2 0.987804885229 0.76543211937 1.32258069515
46 0 0.890214799162 0.793565690517 1.41554057598
46 1 0.858173479246 0.835498690605 1.39469468594
46 2 1.29914532562 0.664473712444 1.15841579437
47 0 1.35143765516 0.624113500118 1.18560600281
47 1 1.01451014431 0.785461246967 1.25492811203
47 2 0.938775523907 0.808695673943 1.31720435619
48 0 0.949799144722 0.788583517075 1.33512067795
48 1 0.953757050617 0.77696210146 1.34946739674
48 2 1.18433181025 0.645914375782 1.30722892284
49 0 0.78353661185 0.828793764114 1.53990614414
49 1 0.616686709247 0.928204238415 1.74699580669
49 2 1.13440861742 0.706161141396 1.24832212925
50 0 0.873684191889 0.805507719517 1.42094016075
50 1 0.841562974555 0.8519769907 1.39471518993
50 2 0.83690987938 0.841025650501 1.4207316637
51 0 0.884130957412 0.760683774948 1.48689138889
51 1 0.709208542418 0.924320816994 1.52546870708
51 2 1.03587443143 0.722943723202 1.3353292942
52 0 1.0074719625 0.715698421001 1.38687396049
52 1 0.71491577977 0.900027275085 1.55413746834
52 2 2.17419359897 0.31750741601 1.44859814644
53 0 1.15267177041 0.604856491089 1.43430662155
53 1 0.92162371561 0.783194959164 1.38540399075
53 2 1.45283017234 0.483766227961 1.42281877995
