5632
5888
14080
14336
21504
21760
5727
5983
14175
14431
21599
21855
74023
74279
74535
74791
75047
75559
75815
77351
78887
79399
79911
74024
74280
74536
74792
75048
75560
75816
77352
78888
79400
79912
74025
74281
74537
74793
75049
75561
75817
77353
78889
79401
79913
74026
74282
74538
74794
75050
75562
75818
77354
78890
79402
79914
74027
74283
74539
74795
75051
75563
75819
77355
78891
79403
79915
74028
74284
74540
74796
75052
75564
75820
77356
78892
79404
79916
74029
74285
74541
74797
75053
75565
75821
77357
78893
79405
79917
74030
74286
74542
74798
75054
75566
75822
77358
78894
79406
79918
74031
74287
74543
74799
75055
75567
75823
77359
78895
79407
79919
74032
74288
74544
74800
75056
75568
75824
77360
78896
79408
79920
74033
74289
74545
74801
75057
75569
75825
77361
78897
79409
79921
74034
74290
74546
74802
75058
75570
75826
77362
78898
79410
79922
74035
74291
74547
74803
75059
75571
75827
77363
78899
79411
79923
74036
74292
74548
74804
75060
75572
75828
77364
78900
79412
79924
74037
74293
74549
74805
75061
75573
75829
77365
78901
79413
79925
74038
74294
74550
74806
75062
75574
75830
77366
78902
79414
79926
74039
74295
74551
74807
75063
75575
75831
77367
78903
79415
79927
74040
74296
74552
74808
75064
75576
75832
77368
78904
79416
79928
74041
74297
74553
74809
75065
75577
75833
77369
78905
79417
79929
74042
74298
74554
74810
75066
75578
75834
77370
78906
79418
79930
74043
74299
74555
74811
75067
75579
75835
77371
78907
79419
79931
74044
74300
74556
74812
75068
75580
75836
77372
78908
79420
79932
74045
74301
74557
74813
75069
75581
75837
77373
78909
79421
79933
71168
71424
79616
79872
87040
87296
71263
71519
79711
79967
87135
87391
139303
139559
139815
140071
140327
141095
145447
139560
139816
140072
140328
141096
145448
139305
139561
139817
140073
140329
141097
145449
139306
139562
139818
140074
140330
141098
145450
139307
139563
139819
140075
140331
141099
145451
139308
139564
139820
140076
140332
141100
145452
139309
139565
139821
140077
140333
141101
145453
139310
139566
139822
140078
140334
141102
145454
139311
139567
139823
140079
140335
141103
145455
139312
139568
139824
140080
140336
141104
145456
139313
139569
139825
140081
140337
139314
139570
139826
140082
140338
139315
139571
139827
140083
140339
140595
141107
145459
139316
139572
139828
140084
140340
140596
141108
145460
139317
139573
139829
140085
140341
140597
141109
145461
139318
139574
139830
140086
140342
140598
141110
145462
139319
139575
139831
140087
140343
140599
141111
145463
139320
139576
139832
140088
140344
140600
141112
145464
139321
139577
139833
140089
140345
140601
141113
145465
139322
139578
139834
140090
140346
140602
141114
145466
139323
139579
139835
140091
140347
140603
141115
145467
139324
139580
139836
140092
140348
140604
141116
145468
139325
139581
139837
140093
140349
140605
141117
145469
139326
139582
139838
140094
140350
140606
141118
145470
139327
139583
139839
140095
140351
140607
141119
145471
139328
139584
139840
140096
140352
140608
141120
145472
136704
136960
145152
145408
152576
152832
136799
137055
145247
145503
152671
152927
209920
209921
204839
205095
205351
205607
205863
206119
209191
209447
210215
210471
210983
204840
205096
205352
205608
205864
206120
209192
209448
210216
210472
210984
204841
205097
205353
205609
205865
206121
209193
209449
210217
210473
210985
204842
205098
205354
205610
205866
206122
209194
209450
210218
210474
210986
204843
205099
205355
205611
205867
206123
209195
209451
210219
210475
210987
204844
205100
205356
205612
205868
206124
209196
209452
210220
210476
210988
204845
205101
205357
205613
205869
206125
209197
209453
210221
210477
210989
204846
205102
205358
205614
205870
206126
209198
209454
210222
210478
210990
204847
205103
205359
205615
205871
206127
209199
209455
210223
210479
210991
204848
205104
205360
205616
205872
206128
209200
209456
210224
210480
210992
204849
205105
205361
205617
205873
206129
209201
209457
210225
210481
210993
204850
205106
205362
205618
205874
206130
209202
209458
210226
210482
210994
204851
205107
205363
205619
205875
206131
209203
209459
210227
210483
210995
204852
205108
205364
205620
205876
206132
209204
209460
210228
210484
210996
204853
205109
205365
205621
205877
206133
209205
209461
210229
210485
210997
204854
205110
205366
205622
205878
206134
209206
209462
210230
210486
210998
204855
205111
205367
205623
205879
206135
209207
209463
210231
210487
210999
204856
205112
205368
205624
205880
206136
209208
209464
210232
210488
211000
204857
205113
205369
205625
205881
206137
209209
209465
210233
210489
211001
204858
205114
205370
205626
205882
206138
209210
209466
210234
210490
211002
204859
205115
205371
205627
205883
206139
209211
209467
210235
210491
211003
204860
205116
205372
205628
205884
206140
209212
209468
210236
210492
211004
206403
202240
202496
210688
210944
218112
218368
202335
202591
210783
211039
218207
218463
270375
270887
271143
271655
271911
272167
273959
274215
274471
274727
274983
275239
275495
275751
276263
276519
270376
270888
271144
271656
271912
272168
273960
274216
274472
274728
274984
275240
275496
275752
276264
276520
270377
270889
271145
271657
271913
272169
273961
274217
274473
274729
274985
275241
275497
275753
276265
276521
270378
270890
271146
271658
271914
272170
273962
274218
274474
274730
274986
275242
275498
275754
276266
276522
270379
270891
271147
271659
271915
272171
273963
274219
274475
274731
274987
275243
275499
275755
276267
276523
270380
270892
271148
271660
271916
272172
273964
274220
274476
274732
274988
275244
275500
275756
276268
276524
270381
270893
271149
271661
271917
272173
273965
274221
274477
274733
274989
275245
275501
275757
276269
276525
270382
270894
271150
271662
271918
272174
273966
274222
274478
274734
274990
275246
275502
275758
276270
276526
270895
271151
271663
271919
272175
273967
274223
274479
274735
274991
275247
275503
275759
276271
276527
270384
270640
270896
271152
271664
271920
272176
273968
274224
274480
274736
274992
275248
275504
275760
276272
276528
270385
270641
270897
271153
271665
271921
272177
273969
274225
274481
274737
274993
275249
275505
275761
276273
276529
270386
270642
270898
271154
271666
271922
272178
273970
274226
274482
274738
274994
275250
275506
275762
276274
276530
270387
270643
270899
271155
271667
271923
272179
273971
274227
274483
274739
274995
275251
275507
275763
276275
276531
270388
270644
270900
271156
271668
271924
272180
273972
274228
274484
274740
274996
275252
275508
275764
276276
276532
270389
270645
270901
271157
271669
271925
272181
273973
274229
274485
274741
274997
275253
275509
275765
276277
276533
270390
270646
270902
271158
271670
271926
272182
273974
274230
274486
274742
274998
275254
275510
275766
276278
276534
270391
270647
270903
271159
271671
271927
272183
273975
274231
274487
274743
274999
275255
275511
275767
276279
276535
270392
270648
270904
271160
271672
271928
272184
273976
274232
274488
274744
275000
275256
275512
275768
276280
276536
270393
270649
270905
271161
271673
271929
272185
273977
274233
274489
274745
275001
275257
275513
275769
276281
276537
270394
270650
270906
271162
271674
271930
272186
273978
274234
274490
274746
275002
275258
275514
275770
276282
276538
270395
270651
270907
271163
271675
271931
272187
273979
274235
274491
274747
275003
275259
275515
275771
276283
276539
270396
270652
270908
271164
271676
271932
272188
273980
274236
274492
274748
275004
275260
275516
275772
276284
276540
270397
270653
270909
271165
271677
271933
272189
273981
274237
274493
274749
275005
275261
275517
275773
276285
276541
270398
270654
270910
271166
271678
271934
272190
273982
274238
274494
274750
275006
275262
275518
275774
276286
276542
270399
270655
270911
271167
271679
271935
272191
273983
274239
274495
274751
275007
275263
275519
275775
276287
276543
267776
268032
276224
276480
283648
283904
267871
268127
276319
276575
283743
283999
336167
336423
336935
337191
337447
337703
337959
340775
341031
341287
341543
341799
342055
336168
336424
336936
337192
337448
337704
337960
340776
341032
341288
341544
341800
342056
336169
336425
336937
337193
337449
337705
337961
340777
341033
341289
341545
341801
342057
336170
336426
336938
337194
337450
337706
337962
340778
341034
341290
341546
341802
342058
336171
336427
336939
337195
337451
337707
337963
340779
341035
341291
341547
341803
342059
336172
336428
336940
337196
337452
337708
337964
340780
341036
341292
341548
341804
342060
336173
336429
336941
337197
337453
337709
337965
340781
341037
341293
341549
341805
342061
336174
336430
336942
337198
337454
337710
337966
340782
341038
341294
341550
341806
342062
336175
336431
336943
337199
337455
337711
337967
340783
341039
341295
341551
341807
342063
336176
336432
336944
337200
337456
337712
337968
340784
341040
341296
341552
341808
342064
336177
336433
336945
337201
337457
337713
337969
340785
341041
341297
341553
341809
342065
336178
336434
336946
337202
337458
337714
337970
340786
341042
341298
341554
341810
342066
336179
336435
336947
337203
337459
337715
337971
340787
341043
341299
341555
341811
342067
336180
336436
336948
337204
337460
337716
337972
340788
341044
341300
341556
341812
342068
336181
336437
336949
337205
337461
337717
337973
340789
341045
341301
341557
341813
342069
336182
336438
336950
337206
337462
337718
337974
340790
341046
341302
341558
341814
342070
336183
336439
336951
337207
337463
337719
337975
340791
341047
341303
341559
341815
342071
336184
336440
336952
337208
337464
337720
337976
340792
341048
341304
341560
341816
342072
336185
336441
336953
337209
337465
337721
337977
340793
341049
341305
341561
341817
342073
336186
336442
336954
337210
337466
337722
337978
340794
341050
341306
341562
341818
342074
336187
336443
336955
337211
337467
337723
337979
340795
341051
341307
341563
341819
342075
336188
336444
336956
337212
337468
337724
337980
340796
341052
341308
341564
341820
342076
336189
336445
336957
337213
337469
337725
337981
340797
341053
341309
341565
341821
342077
336190
336446
336958
337214
337470
337726
337982
340798
341054
341310
341566
341822
342078
336191
336447
336959
337215
337471
337727
337983
340799
341055
341311
341567
341823
342079
333312
333568
341760
342016
349184
349440
333407
333663
341855
342111
349279
349535
401447
401959
402215
402471
402727
402983
403495
406823
407079
407335
407591
401448
401960
402216
402472
402728
402984
403496
406824
407080
407336
407592
401449
401961
402217
402473
402729
402985
403497
406825
407081
407337
407593
401450
401962
402218
402474
402730
402986
403498
406826
407082
407338
407594
401451
401963
402219
402475
402731
402987
403499
406827
407083
407339
407595
401452
401964
402220
402476
402732
402988
403500
406828
407084
407340
407596
401453
401965
402221
402477
402733
402989
403501
406829
407085
407341
407597
401966
402222
402478
402734
402990
403502
406830
407086
407342
407598
401967
402223
402479
402735
402991
403503
406831
407087
407343
407599
401968
402224
402480
402736
402992
403504
406832
407088
407344
407600
401969
402225
402481
402737
402993
403505
406833
407089
407345
407601
401970
402226
402482
402738
402994
403506
406834
407090
407346
407602
401971
402227
402483
402739
402995
403507
406835
407091
407347
407603
401972
402228
402484
402740
402996
403508
406836
407092
407348
407604
401973
402229
402485
402741
402997
403509
406837
407093
407349
407605
401974
402230
402486
402742
402998
403510
406838
407094
407350
407606
401975
402231
402487
402743
402999
403511
406839
407095
407351
407607
401976
402232
402488
402744
403000
403512
406840
407096
407352
407608
401977
402233
402489
402745
403001
403513
401978
402234
402490
402746
403002
403514
406842
407098
407354
407610
401979
402235
402491
402747
403003
403515
406843
407099
407355
407611
401980
402236
402492
402748
403004
403516
406844
407100
407356
407612
401981
402237
402493
402749
403005
403517
406845
407101
407357
407613
401982
402238
402494
402750
403006
403518
406846
407102
407358
407614
398848
399104
407296
407552
414720
414976
398943
399199
407391
407647
414815
415071
467495
467751
468007
468263
468519
468775
469031
469287
469543
470055
471847
472103
472359
472615
472871
473127
467496
467752
468008
468264
468520
468776
469032
469288
469544
470056
471848
472104
472360
472616
472872
473128
467497
467753
468009
468265
468521
468777
469033
469289
469545
470057
471849
472105
472361
472617
472873
473129
467498
467754
468010
468266
468522
468778
469034
469290
469546
470058
471850
472106
472362
472618
472874
473130
467499
467755
468011
468267
468523
468779
469035
469291
469547
470059
471851
472107
472363
472619
472875
473131
467500
467756
468012
468268
468524
468780
469036
469292
469548
470060
471852
472108
472364
472620
472876
473132
467501
467757
468013
468269
468525
468781
469037
469293
469549
470061
471853
472109
472365
472621
472877
473133
467502
467758
468014
468270
468526
468782
469038
469294
469550
470062
471854
472110
472366
472622
472878
473134
467503
467759
468015
468271
468527
468783
469039
469295
469551
470063
471855
472111
472367
472623
472879
473135
467504
467760
468016
468272
468528
468784
469040
469296
469552
470064
471856
472112
472368
472624
472880
473136
467505
467761
468017
468273
468529
468785
469041
469297
469553
470065
471857
472113
472369
472625
472881
473137
467506
467762
468018
468274
468530
468786
469042
469298
469554
470066
471858
472114
472370
472626
472882
473138
467507
467763
468019
468275
468531
468787
469043
469299
469555
470067
471859
472115
472371
472627
472883
473139
467508
467764
468020
468276
468532
468788
469044
469300
469556
470068
471860
472116
472372
472628
472884
473140
467509
467765
468021
468277
468533
468789
469045
469301
469557
470069
471861
472117
472373
472629
472885
473141
467510
467766
468022
468278
468534
468790
469046
469302
469558
470070
471862
472118
472374
472630
472886
473142
467511
467767
468023
468279
468535
468791
469047
469303
469559
470071
471863
472119
472375
472631
472887
473143
467512
467768
468024
468280
468536
468792
469048
469304
469560
470072
471864
472120
472376
472632
472888
473144
467513
467769
468025
468281
468537
468793
469049
469305
469561
470073
471865
472121
472377
472633
472889
473145
467514
467770
468026
468282
468538
468794
469050
469306
469562
470074
471866
472122
472378
472634
472890
473146
467515
467771
468027
468283
468539
468795
469051
469307
469563
470075
471867
472123
472379
472635
472891
473147
467516
467772
468028
468284
468540
468796
469052
469308
469564
470076
471868
472124
472380
472636
472892
473148
467517
467773
468029
468285
468541
468797
469053
469309
469565
470077
471869
472125
472381
472637
472893
473149
467518
467774
468030
468286
468542
468798
469054
469310
469566
470078
471870
472126
472382
472638
472894
473150
467519
467775
468031
468287
468543
468799
469055
469311
469567
470079
471871
472127
472383
472639
472895
473151
464384
464640
472832
473088
480256
480512
464479
464735
472927
473183
480351
480607
532775
533031
533287
533543
534055
534567
538919
539175
539431
532776
533032
533288
533544
534056
534568
538920
539176
539432
532777
533033
533289
533545
534057
534569
538921
539177
539433
532778
533034
533290
533546
534058
534570
538922
539178
539434
532779
533035
533291
533547
534059
534571
538923
539179
539435
532780
533036
533292
533548
534060
534572
538924
539180
539436
532781
533037
533293
533549
534061
534573
538925
539181
539437
532782
533038
533294
533550
534062
534574
538926
539182
539438
532783
533039
533295
533551
534063
534575
538927
539183
539439
532784
533040
533296
533552
534064
534576
538928
539184
539440
532785
533041
533297
533553
534065
534577
538929
539185
539441
532786
533042
533298
533554
534066
534578
538930
539186
539442
532787
533043
533299
533555
534067
534579
538931
539187
539443
532788
533044
533300
533556
534068
534580
538932
539188
539444
532789
533045
533301
533557
534069
534581
538933
539189
539445
532790
533046
533302
533558
534070
534582
538934
539190
539446
532791
533047
533303
533559
534071
534583
538935
539191
539447
532792
533048
533304
533560
534072
534584
538936
539192
539448
532793
533049
533305
533561
534073
534585
538937
539193
539449
532794
533050
533306
533562
534074
534586
538938
539194
539450
532795
533051
533307
533563
534075
534587
538939
539195
539451
532796
533052
533308
533564
534076
534588
538940
539196
539452
532797
533053
533309
533565
534077
534589
538941
539197
539453
532798
533054
533310
533566
534078
534590
538942
539198
539454
532799
533055
533311
533567
534079
534591
538943
539199
539455
532800
533056
533312
533568
534080
534592
538944
539200
539456
529920
530176
538368
538624
545792
546048
530015
530271
538463
538719
545887
546143
598055
599847
600103
600359
600615
600871
601639
601895
602151
602407
602663
602919
598056
599848
600104
600360
600616
600872
601640
601896
602152
602408
602664
602920
598057
599849
600105
600361
600617
600873
601641
601897
602153
602409
602665
602921
598058
599850
600106
600362
600618
600874
601642
601898
602154
602410
602666
602922
598059
599851
600107
600363
600619
600875
601643
601899
602155
602411
602667
602923
598060
599852
600108
600364
600620
600876
601644
601900
602156
602412
602668
602924
598061
599853
600109
600365
600621
600877
601645
601901
602157
602413
602669
602925
598062
599854
600110
600366
600622
600878
601646
601902
602158
602414
602670
602926
598063
599855
600111
600367
600623
600879
599857
600113
600369
600625
600881
601137
601649
601905
602161
602417
602673
602929
603441
599858
600114
600370
600626
600882
601138
601650
601906
602162
602418
602674
602930
603442
599859
600115
600371
600627
600883
601139
601651
601907
602163
602419
602675
602931
603443
599860
600116
600372
600628
600884
601140
601652
601908
602164
602420
602676
602932
603444
599861
600117
600373
600629
600885
601141
601653
601909
602165
602421
602677
602933
603445
599862
600118
600374
600630
600886
601142
601654
601910
602166
602422
602678
602934
603446
599864
600120
600376
600632
600888
601144
601656
601912
602168
602424
602680
602936
603448
599865
600121
600377
600633
600889
601145
601657
601913
602169
602425
602681
602937
603449
599867
600123
600379
600635
600891
601147
601659
601915
602171
602427
602683
602939
603451
595456
595712
603904
604160
611328
611584
595551
595807
603999
604255
611423
611679
663591
663847
664103
664359
664615
664871
665383
665639
666151
668199
668711
668967
669223
669479
669735
669991
670247
663592
663848
664104
664360
664616
664872
665384
665640
666152
668200
668712
668968
669224
669480
669736
669992
670248
663593
663849
664105
664361
664617
664873
665385
665641
666153
668201
668713
668969
669225
669481
669737
669993
670249
663594
663850
664106
664362
664618
664874
665386
665642
666154
668202
668714
668970
669226
669482
669738
669994
670250
663595
663851
664107
664363
664619
664875
665387
665643
666155
668203
668715
668971
669227
669483
669739
669995
670251
663596
663852
664108
664364
664620
664876
665388
665644
666156
668204
668716
668972
669228
669484
669740
669996
670252
663853
664109
664365
664621
664877
665389
665645
666157
668205
668717
668973
669229
669485
669741
669997
670253
663598
663854
664110
664366
664622
664878
665390
665646
666158
668206
668718
668974
669230
669486
669742
669998
670254
663599
663855
664111
664367
664623
664879
665391
665647
666159
668207
668719
668975
669231
669487
669743
669999
670255
663600
663856
664112
664368
664624
664880
665392
665648
666160
668208
668720
668976
669232
669488
669744
670000
670256
663601
663857
664113
664369
664625
664881
665393
665649
666161
668209
668721
668977
669233
669489
669745
670001
670257
663602
663858
664114
664370
664626
664882
665394
665650
666162
668210
668722
668978
669234
669490
669746
670002
670258
663603
663859
664115
664371
664627
664883
665395
665651
666163
668211
668723
668979
669235
669491
669747
670003
670259
663604
663860
664116
664372
664628
664884
665396
665652
666164
668212
668724
668980
669236
669492
669748
670004
670260
663605
663861
664117
664373
664629
664885
665397
665653
666165
668213
668725
668981
669237
669493
669749
670005
670261
663606
663862
664118
664374
664630
664886
665398
665654
666166
668214
668726
668982
669238
669494
669750
670006
670262
663607
663863
664119
664375
664631
664887
665399
665655
666167
668215
668727
668983
669239
669495
669751
670007
670263
663608
663864
664120
664376
664632
664888
665400
665656
666168
668216
668728
668984
669240
669496
669752
670008
670264
663609
663865
664121
664377
664633
664889
665401
665657
666169
668217
668729
668985
669241
669497
669753
670009
670265
663610
663866
664122
664378
664634
664890
665402
665658
666170
668218
668730
668986
669242
669498
669754
670010
670266
663611
663867
664123
664379
664635
664891
665403
665659
666171
668219
668731
668987
669243
669499
669755
670011
670267
663612
663868
664124
664380
664636
664892
665404
665660
666172
668220
668732
668988
669244
669500
669756
670012
670268
660992
661248
669440
669696
676864
677120
661087
661343
669535
669791
676959
677215
729383
729639
729895
730151
730407
730919
731175
732199
732711
734247
734759
735015
735271
735527
736039
729384
729640
729896
730152
730408
730920
731176
732200
732712
734248
734760
735016
735272
735528
736040
729385
729641
729897
730153
730409
730921
731177
732201
732713
734249
734761
735017
735273
735529
736041
729386
729642
729898
730154
730410
730922
731178
732202
732714
734250
734762
735018
735274
735530
736042
729387
729643
729899
730155
730411
730923
731179
732203
732715
734251
734763
735019
735275
735531
736043
729388
729644
729900
730156
730412
730924
731180
732204
732716
734252
734764
735020
735276
735532
736044
729389
729645
729901
730157
730413
730925
731181
732205
732717
734253
734765
735021
735277
735533
736045
729390
729646
729902
730158
730414
730926
731182
732206
732718
734254
734766
735022
735278
735534
736046
729391
729647
729903
730159
730415
730927
731183
732207
732719
734255
734767
735023
735279
735535
736047
729392
729648
729904
730160
730416
730928
731184
732208
732720
734256
734768
735024
735280
735536
736048
729393
729649
729905
730161
730417
730929
731185
732209
732721
734257
734769
735025
735281
735537
736049
729394
729650
729906
730162
730418
730930
731186
732210
732722
734258
734770
735026
735282
735538
736050
729395
729651
729907
730163
730419
730931
731187
732211
732723
734259
734771
735027
735283
735539
736051
729396
729652
729908
730164
730420
730932
731188
732212
732724
734260
734772
735028
735284
735540
736052
729397
729653
729909
730165
730421
730933
731189
732213
732725
734261
734773
735029
735285
735541
736053
729398
729654
729910
730166
730422
730934
731190
732214
732726
734262
734774
735030
735286
735542
736054
729399
729655
729911
730167
730423
730935
731191
732215
732727
734263
734775
735031
735287
735543
736055
729400
729656
729912
730168
730424
730936
731192
732216
732728
734264
734776
735032
735288
735544
736056
729401
729657
729913
730169
730425
730937
731193
732217
732729
734265
734777
735033
735289
735545
736057
729402
729658
729914
730170
730426
730938
731194
732218
732730
734266
734778
735034
735290
735546
736058
729403
729659
729915
730171
730427
730939
731195
732219
732731
734267
734779
735035
735291
735547
736059
729404
729660
729916
730172
730428
730940
731196
732220
732732
734268
734780
735036
735292
735548
736060
726528
726784
734976
735232
742400
742656
726623
726879
735071
735327
742495
742751
794663
794919
795175
795431
795687
795943
796199
796455
796711
797223
797735
798247
798503
799527
800039
800295
800551
801063
801319
794664
794920
795176
795432
795688
795944
796200
796456
796712
797224
797736
798248
798504
799528
800040
800296
800552
801064
801320
794665
794921
795177
795433
795689
795945
796201
796457
796713
797225
797737
798249
798505
799529
800041
800297
800553
801065
801321
794666
794922
795178
795434
795690
795946
796202
796458
796714
797226
797738
798250
798506
799530
794667
794923
795179
795435
795691
795947
796203
796459
796715
797227
797739
798251
798507
799531
799787
800043
800299
800555
801067
801323
794668
794924
795180
795436
795692
795948
796204
796460
796716
797228
797740
798252
798508
799532
799788
800044
800300
800556
801068
801324
794669
794925
795181
795437
795693
795949
796205
796461
796717
797229
797741
798253
798509
799533
799789
800045
800301
800557
801069
801325
794670
794926
795182
795438
795694
795950
796206
796462
796718
797230
797742
798254
798510
799534
799790
800046
800302
800558
801070
801326
794927
795183
795439
795695
795951
796207
796463
796719
797231
797743
798255
798511
799535
799791
800047
800303
800559
801071
801327
794672
794928
795184
795440
795696
795952
796208
796464
796720
797232
797744
798256
798512
799536
799792
800048
800304
800560
801072
801328
794673
794929
795185
795441
795697
795953
796209
796465
796721
797233
797745
798257
798513
799537
799793
800049
800305
800561
801073
801329
794674
794930
795186
795442
795698
795954
796210
796466
796722
797234
797746
798258
798514
799538
799794
800050
800306
800562
801074
801330
794675
794931
795187
795443
795699
795955
796211
796467
796723
797235
797747
798259
798515
799539
799795
800051
800307
800563
801075
801331
794676
794932
795188
795444
795700
795956
796212
796468
796724
797236
797748
798260
798516
799540
799796
800052
800308
800564
801076
801332
794677
794933
795189
795445
795701
795957
796213
796469
796725
797237
797749
798261
798517
799541
799797
800053
800309
800565
801077
801333
794678
794934
795190
795446
795702
795958
796214
796470
796726
797238
797750
798262
798518
799542
799798
800054
800310
800566
801078
801334
794679
794935
795191
795447
795703
795959
796215
796471
796727
797239
797751
798263
798519
799543
799799
800055
800311
800567
801079
801335
794680
794936
795192
795448
795704
795960
796216
796472
796728
797240
797752
798264
798520
799544
799800
800056
800312
800568
801080
801336
794681
794937
795193
795449
795705
795961
796217
796473
796729
797241
797753
798265
798521
799545
799801
800057
800313
800569
801081
801337
794682
794938
795194
795450
795706
795962
796218
796474
796730
797242
797754
798266
798522
799546
799802
800058
800314
800570
801082
801338
794683
794939
795195
795451
795707
795963
796219
796475
796731
797243
797755
798267
798523
799547
799803
800059
800315
800571
801083
801339
794684
794940
795196
795452
795708
795964
796220
796476
796732
797244
797756
798268
798524
799548
799804
800060
800316
800572
801084
801340
794685
794941
795197
795453
795709
795965
796221
796477
796733
797245
797757
798269
798525
799549
799805
800061
800317
800573
801085
801341
794686
794942
795198
795454
795710
795966
796222
796478
796734
797246
797758
798270
798526
799550
799806
800062
800318
800574
801086
801342
794687
794943
795199
795455
795711
795967
796223
796479
796735
797247
797759
798271
798527
799551
799807
800063
800319
800575
801087
801343
794688
794944
795200
795456
795712
795968
796224
796480
796736
797248
797760
798272
798528
799552
799808
800064
800320
800576
801088
801344
792064
792320
800512
800768
807936
808192
792159
792415
800607
800863
808031
808287
860967
861735
861991
862247
863783
864039
864807
865063
865319
865575
865831
866087
866343
860968
861736
861992
862248
863784
864040
864808
865064
865320
865576
865832
866088
866344
860969
861737
861993
862249
863785
864041
864809
865065
865321
865577
865833
866089
866345
860202
860970
861738
861994
862250
863786
864042
864810
865066
865322
865578
865834
866090
866346
860203
860971
861739
861995
862251
863787
864043
864811
865067
865323
865579
865835
866091
866347
860204
860972
861740
861996
862252
863788
864044
864812
865068
865324
865580
865836
866092
866348
860205
860973
861741
861997
862253
863789
864045
864813
865069
865325
865581
865837
866093
866349
860206
860974
861742
861998
862254
863790
864046
864814
865070
865326
865582
865838
866094
866350
860207
860975
861743
861999
862255
863791
864047
864815
865071
865327
865583
865839
866095
866351
860208
860976
861744
862000
862256
863792
864048
864816
865072
865328
865584
865840
866096
866352
860209
860977
861745
862001
862257
863793
864049
864817
865073
865329
865585
865841
866097
866353
860210
860978
861746
862002
862258
863794
864050
864818
865074
865330
865586
865842
866098
866354
860211
860979
861747
862003
862259
863795
864051
864819
865075
865331
865587
865843
866099
866355
860212
860980
861748
862004
862260
863796
864052
864820
865076
865332
865588
865844
866100
866356
860213
860981
861749
862005
862261
863797
864053
864821
865077
865333
865589
865845
866101
866357
860214
860982
861750
862006
862262
863798
864054
864822
865078
865334
865590
865846
866102
866358
860215
860983
861751
862007
862263
863799
864055
864823
865079
865335
865591
865847
866103
866359
860216
860984
861752
862008
862264
863800
864056
864824
865080
865336
865592
865848
866104
866360
860217
860985
861753
862009
862265
863801
864057
864825
865081
865337
865593
865849
866105
866361
857600
857856
866048
866304
873472
873728
857695
857951
866143
866399
873567
873823
925735
927527
928295
930855
925736
927528
928296
930856
925737
927529
928297
930857
925738
927530
928298
930858
925739
927531
928299
930859
925740
927532
928300
930860
925741
927533
928301
930861
925742
927534
928302
930862
925743
927535
928303
930863
925744
927536
928304
930864
925745
927537
928305
930865
927538
928306
930866
927539
928307
930867
927540
928308
930868
927541
928309
930869
927542
928310
930870
927543
928311
930871
927544
928312
930872
927545
928313
930873
927546
928314
930874
927547
928315
930875
927548
928316
930876
927549
928317
930877
927550
928318
930878
927551
928319
930879
923136
923392
931584
931840
939008
939264
923231
923487
931679
931935
939103
939359
997121
992551
992807
993063
993319
993831
994599
994855
996135
996391
996647
997159
992555
992811
993067
993323
993835
994603
994859
996139
996395
996651
997163
992556
992812
993068
993324
993836
994604
994860
996140
996396
996652
997164
992557
992813
993069
993325
993837
994605
994861
996141
996397
996653
997165
992558
992814
993070
993326
993838
994606
994862
996142
996398
996654
997166
992559
992815
993071
993327
993839
994607
994863
996143
996399
996655
997167
992560
992816
993072
993328
993840
994608
994864
996144
996400
996656
997168
992561
992817
993073
993329
993841
994609
994865
996145
996401
996657
997169
992562
992818
993074
993330
993842
994610
994866
996146
996402
996658
997170
992563
992819
993075
993331
993843
994611
994867
996147
996403
996659
997171
992564
992820
993076
993332
993844
994612
994868
996148
996404
996660
997172
992565
992821
993077
993333
993845
994613
994869
996149
996405
996661
997173
992566
992822
993078
993334
993846
994614
994870
996150
996406
996662
997174
988672
988928
997120
997376
1004544
1004800
988767
989023
997215
997471
1004639
1004895
1058855
1059111
1059367
1059623
1059879
1060135
1060391
1060647
1061415
1058856
1059112
1059368
1059624
1059880
1060136
1060392
1060648
1061416
1058857
1059113
1059369
1059625
1059881
1060137
1060393
1060649
1061417
1058858
1059114
1059370
1059626
1059882
1060138
1060394
1060650
1061418
1058859
1059115
1059371
1059627
1059883
1060139
1060395
1060651
1061419
1058860
1059116
1059372
1059628
1059884
1060140
1060396
1060652
1061420
1058861
1059117
1059373
1059629
1059885
1060141
1060397
1060653
1061421
1058862
1059118
1059374
1059630
1059886
1060142
1060398
1060654
1061422
1058863
1059119
1059375
1059631
1059887
1060143
1060399
1060655
1061423
1058864
1059120
1059376
1059632
1059888
1060144
1060400
1060656
1061424
1058865
1059121
1059377
1059633
1059889
1060145
1060401
1060657
1061425
1058866
1059122
1059378
1059634
1059890
1060146
1060402
1060658
1061426
1058867
1059123
1059379
1059635
1059891
1060147
1060403
1060659
1061427
1058868
1059124
1059380
1059636
1059892
1060148
1060404
1060660
1061428
1058869
1059125
1059381
1059637
1059893
1060149
1060405
1060661
1061429
1058870
1059126
1059382
1059638
1059894
1060150
1060406
1060662
1061430
1058871
1059127
1059383
1059639
1059895
1060151
1060407
1060663
1061431
1058873
1059129
1059385
1059641
1059897
1060153
1060409
1060665
1061433
1058875
1059131
1059387
1059643
1059899
1060155
1060411
1060667
1061435
1054208
1054464
1062656
1062912
1070080
1070336
1054303
1054559
1062751
1063007
1070175
1070431
1122855
1123111
1124135
1127207
1122856
1123112
1124136
1127208
1122857
1123113
1124137
1127209
1122858
1123114
1124138
1127210
1122859
1123115
1124139
1127211
1122860
1123116
1124140
1127212
1122861
1123117
1124141
1127213
1122862
1123118
1124142
1127214
1122863
1123119
1124143
1127215
1122864
1123120
1124144
1127216
1122865
1123121
1124145
1127217
1122866
1123122
1124146
1127218
1122867
1123123
1124147
1127219
1122868
1123124
1124148
1127220
1122869
1123125
1124149
1127221
1122870
1123126
1124150
1127222
1122871
1123127
1124151
1127223
1122872
1123128
1124152
1127224
1122873
1123129
1124153
1127225
1122874
1123130
1124154
1127226
1122875
1123131
1124155
1127227
1122876
1123132
1124156
1127228
1122877
1123133
1124157
1127229
1122878
1123134
1124158
1127230
1122879
1123135
1124159
1127231
1119744
1120000
1128192
1128448
1135616
1135872
1119839
1120095
1128287
1128543
1135711
1135967
1193728
1202176
1185280
1185536
1193728
1193984
1201152
1201408
1185375
1185631
1193823
1194079
1201247
1201503
1253415
1253927
1254183
1254695
1254951
1253928
1254184
1254696
1254952
1255208
1255464
1256488
1258024
1258792
1259304
1253417
1253929
1254185
1254697
1254953
1255209
1255465
1256489
1258025
1258793
1259305
1253930
1254186
1254698
1254954
1255210
1255466
1256490
1258026
1258794
1259306
1253419
1253931
1254187
1254699
1254955
1255211
1255467
1256491
1258027
1258795
1259307
1253932
1254188
1254700
1254956
1255212
1255468
1256492
1258028
1258796
1259308
1253678
1253934
1254190
1254702
1254958
1255214
1255470
1256494
1258030
1258798
1259310
1253679
1253935
1254191
1254703
1254959
1255215
1255471
1256495
1258031
1258799
1259311
1253680
1253936
1254192
1254704
1254960
1255216
1255472
1256496
1258032
1258800
1259312
1253681
1253937
1254193
1254705
1254961
1255217
1255473
1256497
1258033
1258801
1259313
1253682
1253938
1254194
1254706
1254962
1255218
1255474
1256498
1258034
1258802
1259314
1253683
1253939
1254195
1254707
1254963
1255219
1255475
1256499
1258035
1258803
1259315
1253684
1253940
1254196
1254708
1254964
1255220
1255476
1256500
1258036
1258804
1259316
1253685
1253941
1254197
1254709
1254965
1255221
1255477
1256501
1258037
1258805
1259317
1253686
1253942
1254198
1254710
1254966
1255222
1255478
1256502
1258038
1258806
1259318
1253687
1253943
1254199
1254711
1254967
1255223
1255479
1256503
1258039
1258807
1259319
1253688
1253944
1254200
1254712
1254968
1255224
1255480
1256504
1258040
1258808
1259320
1253689
1253945
1254201
1254713
1254969
1255225
1255481
1256505
1258041
1258809
1259321
1253690
1253946
1254202
1254714
1254970
1255226
1255482
1256506
1258042
1258810
1259322
1253691
1253947
1254203
1254715
1254971
1255227
1255483
1256507
1258043
1258811
1259323
1253692
1253948
1254204
1254716
1254972
1255228
1255484
1256508
1258044
1258812
1259324
1253694
1253950
1254206
1254718
1254974
1255230
1255486
1256510
1258046
1258814
1259326
1250816
1251072
1259264
1259520
1266688
1266944
1250911
1251167
1259359
1259615
1266783
1267039
1320230
1320486
1320742
1320998
1321510
1322790
1319463
1319719
1320231
1320487
1320743
1320999
1321511
1322791
1325095
1319464
1319720
1320232
1320488
1320744
1321000
1321512
1322792
1323048
1323304
1323560
1323816
1324072
1324328
1324584
1324840
1325096
1319465
1319721
1320233
1320489
1320745
1321001
1321513
1322793
1323049
1323305
1323561
1323817
1324073
1324329
1324585
1324841
1325097
1319466
1319722
1320234
1320490
1320746
1321002
1321514
1322794
1323050
1323306
1323562
1323818
1324074
1324330
1324586
1324842
1325098
1319467
1319723
1320235
1320491
1320747
1321003
1321515
1322795
1323051
1323307
1323563
1323819
1324075
1324331
1324587
1324843
1325099
1319468
1319724
1320236
1320492
1320748
1321004
1321516
1322796
1323052
1323308
1323564
1323820
1324076
1324332
1324588
1324844
1325100
1319469
1319725
1320237
1320493
1320749
1321005
1321517
1322797
1323053
1323309
1323565
1323821
1324077
1324333
1324589
1324845
1325101
1319470
1319726
1320238
1320494
1320750
1321006
1321518
1322798
1323054
1323310
1323566
1323822
1324078
1324334
1324590
1324846
1325102
1319471
1319727
1320239
1320495
1320751
1321007
1321519
1322799
1323055
1323311
1323567
1323823
1324079
1324335
1324591
1324847
1325103
1319472
1319728
1320240
1320496
1320752
1321008
1321520
1322800
1323056
1323312
1323568
1323824
1324080
1324336
1324592
1324848
1325104
1319473
1319729
1320241
1320497
1320753
1321009
1321521
1322801
1323057
1323313
1323569
1323825
1324081
1324337
1324593
1324849
1325105
1319474
1319730
1320242
1320498
1320754
1321010
1321522
1322802
1323058
1323314
1323570
1323826
1324082
1324338
1324594
1324850
1325106
1319475
1319731
1320243
1320499
1320755
1321011
1321523
1322803
1323059
1323315
1323571
1323827
1324083
1324339
1324595
1324851
1325107
1319476
1319732
1320244
1320500
1320756
1321012
1321524
1322804
1323060
1323316
1323572
1323828
1324084
1324340
1324596
1324852
1325108
1319477
1319733
1320245
1320501
1320757
1321013
1321525
1322805
1323061
1323317
1323573
1323829
1324085
1324341
1324597
1324853
1325109
1319478
1319734
1320246
1320502
1320758
1321014
1321526
1322806
1323062
1323318
1323574
1323830
1324086
1324342
1324598
1324854
1325110
1319479
1319735
1320247
1320503
1320759
1321015
1321527
1322807
1323063
1323319
1323575
1323831
1324087
1324343
1324599
1324855
1325111
1319480
1319736
1320248
1320504
1320760
1321016
1321528
1322808
1323064
1323320
1323576
1323832
1324088
1324344
1324600
1324856
1325112
1319481
1319737
1320249
1320505
1320761
1321017
1321529
1322809
1323065
1323321
1323577
1323833
1324089
1324345
1324601
1324857
1325113
1319482
1319738
1320250
1320506
1320762
1321018
1321530
1322810
1323066
1323322
1323578
1323834
1324090
1324346
1324602
1324858
1325114
1319483
1319739
1320251
1320507
1320763
1321019
1321531
1322811
1323067
1323323
1323579
1323835
1324091
1324347
1324603
1324859
1325115
1319484
1319740
1320252
1320508
1320764
1321020
1321532
1322812
1323068
1323324
1323580
1323836
1324092
1324348
1324604
1324860
1325116
1319485
1319741
1320253
1320509
1320765
1321021
1321533
1322813
1323069
1323325
1323581
1323837
1324093
1324349
1324605
1324861
1325117
1319486
1319742
1320254
1320510
1320766
1321022
1321534
1322814
1323070
1323326
1323582
1323838
1324094
1324350
1324606
1324862
1325118
1319487
1319743
1320255
1320511
1320767
1321023
1321535
1322815
1323071
1323327
1323583
1323839
1324095
1324351
1324607
1324863
1325119
1316352
1316608
1324800
1325056
1332224
1332480
1316447
1316703
1324895
1325151
1332319
1332575
1381888
1382144
1390336
1390592
1397760
1398016
1381983
1382239
1390431
1390687
1397855
1398111
1450023
1450279
1450535
1451047
1451559
1456679
1450024
1450280
1450536
1451048
1451560
1456680
1450025
1450281
1450537
1451049
1451561
1456681
1450026
1450282
1450538
1451050
1451562
1456682
1450027
1450283
1450539
1451051
1451563
1456683
1450028
1450284
1450540
1451052
1451564
1456684
1450029
1450285
1450541
1451053
1451565
1456685
1450030
1450286
1450542
1451054
1451566
1456686
1450543
1451055
1451567
1456687
1450288
1450544
1451056
1451568
1456688
1450033
1450289
1450545
1451057
1451569
1456689
1450034
1450290
1450546
1451058
1451570
1456690
1450035
1450291
1450547
1451059
1451571
1456691
1450036
1450292
1450548
1451060
1451572
1456692
1450037
1450293
1450549
1451061
1451573
1456693
1450038
1450294
1450550
1451062
1451574
1456694
1450039
1450295
1450551
1451063
1451575
1456695
1450040
1450296
1450552
1451064
1451576
1456696
1450041
1450297
1450553
1451065
1451577
1456697
1450042
1450298
1450554
1451066
1451578
1456698
1450043
1450299
1450555
1451067
1451579
1456699
1450044
1450300
1450556
1451068
1451580
1456700
1450045
1450301
1450557
1451069
1451581
1456701
1450046
1450302
1450558
1451070
1451582
1456702
1450047
1450303
1450559
1451071
1451583
1456703
1447424
1447680
1455872
1456128
1463296
1463552
1447519
1447775
1455967
1456223
1463391
1463647
1515815
1516327
1516583
1516839
1517095
1517351
1517607
1520423
1520679
1521191
1521447
1521703
1515816
1516328
1516584
1516840
1517096
1517352
1517608
1520424
1520680
1521192
1521448
1521704
1515817
1516329
1516585
1516841
1517097
1517353
1517609
1520425
1520681
1521193
1521449
1521705
1515818
1516330
1516586
1516842
1517098
1517354
1517610
1520426
1520682
1521194
1521450
1521706
1515819
1516331
1516587
1516843
1517099
1517355
1517611
1520427
1520683
1521195
1521451
1521707
1515820
1516332
1516588
1516844
1517100
1517356
1517612
1520428
1520684
1521196
1521452
1521708
1515821
1516333
1516589
1516845
1517101
1517357
1517613
1520429
1520685
1521197
1521453
1521709
1515822
1516334
1516590
1516846
1517102
1517358
1517614
1520430
1520686
1521198
1521454
1521710
1515823
1516335
1516591
1516847
1517103
1517359
1517615
1520431
1520687
1521199
1521455
1521711
1515824
1516336
1516592
1516848
1517104
1517360
1517616
1520432
1520688
1521200
1521456
1521712
1515825
1516337
1516593
1516849
1517105
1517361
1517617
1520433
1520689
1521201
1521457
1521713
1515826
1516338
1516594
1516850
1517106
1517362
1517618
1520434
1520690
1521202
1521458
1521714
1515827
1516339
1516595
1516851
1517107
1517363
1517619
1520435
1520691
1521203
1521459
1521715
1515828
1516340
1516596
1516852
1517108
1517364
1517620
1520436
1520692
1521204
1521460
1521716
1515829
1516341
1516597
1516853
1517109
1517365
1517621
1520437
1520693
1521205
1521461
1521717
1515830
1516342
1516598
1516854
1517110
1517366
1517622
1520438
1520694
1521206
1521462
1521718
1515831
1516343
1516599
1516855
1517111
1517367
1517623
1520439
1520695
1521207
1521463
1521719
1515832
1516344
1516600
1516856
1517112
1517368
1517624
1520440
1520696
1521208
1521464
1521720
1515833
1516345
1516601
1516857
1517113
1517369
1517625
1520441
1520697
1521209
1521465
1521721
1515834
1516346
1516602
1516858
1517114
1517370
1517626
1520442
1520698
1521210
1521466
1521722
1515835
1516347
1516603
1516859
1517115
1517371
1517627
1520443
1520699
1521211
1521467
1521723
1515836
1516348
1516604
1516860
1517116
1517372
1517628
1520444
1520700
1521212
1521468
1521724
1515837
1516349
1516605
1516861
1517117
1517373
1517629
1520445
1520701
1521213
1521469
1521725
1515838
1516350
1516606
1516862
1517118
1517374
1517630
1520446
1520702
1521214
1521470
1521726
1515839
1516351
1516607
1516863
1517119
1517375
1517631
1520447
1520703
1521215
1521471
1521727
1515840
1516352
1516608
1516864
1517120
1517376
1517632
1520448
1520704
1521216
1521472
1521728
1512960
1513216
1521408
1521664
1528832
1529088
1513055
1513311
1521503
1521759
1528927
1529183
1586176
1586177
1581095
1581351
1581607
1581863
1582119
1582631
1583143
1581096
1581352
1581608
1581864
1582120
1582632
1583144
1586216
1586472
1586728
1586984
1587240
1587496
1587752
1581097
1581353
1581609
1581865
1582121
1582633
1583145
1586217
1586473
1586729
1586985
1587241
1587497
1587753
1581098
1581354
1581610
1581866
1582122
1582634
1583146
1586218
1586474
1586730
1586986
1587242
1587498
1587754
1581099
1581355
1581611
1581867
1582123
1582635
1583147
1581100
1581356
1581612
1581868
1582124
1582636
1583148
1586220
1586476
1586732
1586988
1587244
1587500
1587756
1581101
1581357
1581613
1581869
1582125
1582637
1583149
1586221
1586477
1586733
1586989
1587245
1587501
1587757
1581102
1581358
1581614
1581870
1582126
1582638
1583150
1586222
1586478
1586734
1586990
1587246
1587502
1587758
1581103
1581359
1581615
1581871
1582127
1582639
1583151
1586223
1586479
1586735
1586991
1587247
1587503
1587759
1581104
1581360
1581616
1581872
1582128
1582640
1583152
1586224
1586480
1586736
1586992
1587248
1587504
1587760
1581105
1581361
1581617
1581873
1582129
1582641
1583153
1586225
1586481
1586737
1586993
1587249
1587505
1587761
1581106
1581362
1581618
1581874
1582130
1582642
1583154
1586226
1586482
1586738
1586994
1587250
1587506
1587762
1581107
1581363
1581619
1581875
1582131
1582643
1583155
1586227
1586483
1586739
1586995
1587251
1587507
1587763
1581108
1581364
1581620
1581876
1582132
1582644
1583156
1586228
1586484
1586740
1586996
1587252
1587508
1587764
1581109
1581365
1581621
1581877
1582133
1582645
1583157
1586229
1586485
1586741
1586997
1587253
1587509
1587765
1581110
1581366
1581622
1581878
1582134
1582646
1583158
1586230
1586486
1586742
1586998
1587254
1587510
1587766
1581111
1581367
1581623
1581879
1582135
1582647
1583159
1586231
1586487
1586743
1586999
1587255
1587511
1587767
1581371
1581627
1581883
1582139
1582651
1583163
1586235
1586491
1586747
1587003
1587259
1587515
1587771
1578496
1578752
1586944
1587200
1594368
1594624
1578591
1578847
1587039
1587295
1594463
1594719
1660928
1646887
1647143
1647655
1651751
1652007
1652263
1652519
1652775
1653031
1653287
1653543
1646888
1647144
1647656
1651752
1652008
1652264
1652520
1652776
1653032
1653288
1653544
1646889
1647145
1647657
1651753
1652009
1652265
1652521
1652777
1653033
1653289
1653545
1646890
1647146
1647658
1651754
1652010
1652266
1652522
1652778
1653034
1653290
1653546
1646891
1647147
1647659
1651755
1652011
1652267
1652523
1652779
1653035
1653291
1653547
1646892
1647148
1647660
1651756
1652012
1652268
1652524
1652780
1653036
1653292
1653548
1646893
1647149
1647661
1651757
1652013
1652269
1652525
1652781
1653037
1653293
1653549
1646894
1647150
1647662
1651758
1652014
1652270
1652526
1652782
1653038
1653294
1653550
1646895
1647151
1647663
1651759
1652015
1652271
1652527
1652783
1653039
1653295
1653551
1646896
1647152
1647664
1651760
1652016
1652272
1652528
1652784
1653040
1653296
1653552
1646897
1647153
1647665
1651761
1652017
1652273
1652529
1652785
1653041
1653297
1653553
1646898
1647154
1647666
1651762
1652018
1652274
1652530
1652786
1653042
1653298
1653554
1646899
1647155
1647667
1651763
1652019
1652275
1652531
1652787
1653043
1653299
1653555
1646900
1647156
1647668
1651764
1652020
1652276
1652532
1652788
1653044
1653300
1653556
1646901
1647157
1647669
1651765
1652021
1652277
1652533
1652789
1653045
1653301
1653557
1646902
1647158
1647670
1651766
1652022
1652278
1652534
1652790
1653046
1653302
1653558
1646903
1647159
1647671
1651767
1652023
1652279
1652535
1652791
1653047
1653303
1653559
1646904
1647160
1647672
1651768
1652024
1652280
1652536
1652792
1653048
1653304
1653560
1646905
1647161
1647673
1651769
1652025
1652281
1652537
1652793
1653049
1653305
1653561
1646906
1647162
1647674
1651770
1652026
1652282
1652538
1652794
1653050
1653306
1653562
1646907
1647163
1647675
1651771
1652027
1652283
1652539
1652795
1653051
1653307
1653563
1646908
1647164
1647676
1651772
1652028
1652284
1652540
1652796
1653052
1653308
1653564
1646910
1647166
1647678
1651774
1652030
1652286
1652542
1652798
1653054
1653310
1653566
1646911
1647167
1647679
1651775
1652031
1652287
1652543
1652799
1653055
1653311
1653567
1644032
1644288
1652480
1652736
1659904
1660160
1644127
1644383
1652575
1652831
1659999
1660255
1708046
1708047
1708049
1709568
1709824
1718016
1718272
1725440
1725696
1709663
1709919
1718111
1718367
1725535
1725791
1778983
1778984
1779752
1781544
1778985
1779753
1781545
1778986
1779754
1781546
1778987
1779755
1781547
1778988
1779756
1781548
1778989
1779757
1781549
1778990
1779758
1781550
1778991
1779759
1781551
1778992
1779760
1781552
1778993
1779761
1781553
1778994
1779762
1781554
1778995
1779763
1781555
1778996
1779764
1781556
1778997
1779765
1781557
1778998
1779766
1781558
1778999
1779767
1781559
1779000
1779768
1781560
1779001
1779769
1781561
1779002
1779770
1781562
1779003
1779771
1781563
1779004
1779772
1781564
1779005
1779773
1781565
1779006
1779774
1781566
1775104
1775360
1783552
1783808
1790976
1791232
1775199
1775455
1783647
1783903
1791071
1791327
1843751
1844007
1844263
1844775
1845031
1845287
1847847
1848103
1848359
1848615
1848871
1849127
1849383
1849639
1849895
1850151
1843752
1844008
1844264
1844776
1845032
1845288
1847848
1848104
1848360
1848616
1848872
1849128
1849384
1849640
1849896
1850152
1843753
1844009
1844265
1844777
1845033
1845289
1847849
1848105
1848361
1848617
1848873
1849129
1849385
1849641
1849897
1850153
1843754
1844010
1844266
1844778
1845034
1845290
1847850
1848106
1848362
1848618
1848874
1849130
1849386
1849642
1849898
1850154
1843755
1844011
1844267
1844779
1845035
1845291
1847851
1848107
1848363
1848619
1848875
1849131
1849387
1849643
1849899
1850155
1843756
1844012
1844268
1844780
1845036
1845292
1847852
1848108
1848364
1848620
1848876
1849132
1849388
1849644
1849900
1850156
1843757
1844013
1844269
1844781
1845037
1845293
1847853
1848109
1848365
1848621
1848877
1849133
1849389
1849645
1849901
1850157
1843758
1844014
1844270
1844782
1845038
1845294
1847854
1848110
1848366
1848622
1848878
1849134
1849390
1849646
1849902
1850158
1843759
1844015
1844271
1844783
1845039
1845295
1847855
1848111
1848367
1848623
1848879
1849135
1849391
1849647
1849903
1850159
1843760
1844016
1844272
1844784
1845040
1845296
1847856
1848112
1848368
1848624
1848880
1849136
1849392
1849648
1849904
1850160
1843761
1844017
1844273
1844785
1845041
1845297
1847857
1848113
1848369
1848625
1848881
1849137
1849393
1849649
1849905
1850161
1843762
1844018
1844274
1844786
1845042
1845298
1847858
1848114
1848370
1848626
1848882
1849138
1849394
1849650
1849906
1850162
1843763
1844019
1844275
1844787
1845043
1845299
1847859
1848115
1848371
1848627
1848883
1849139
1849395
1849651
1849907
1850163
1843764
1844020
1844276
1844788
1845044
1845300
1847860
1848116
1848372
1848628
1848884
1849140
1849396
1849652
1849908
1850164
1843765
1844021
1844277
1844789
1845045
1845301
1847861
1848117
1848373
1848629
1848885
1849141
1849397
1849653
1849909
1850165
1843766
1844022
1844278
1844790
1845046
1845302
1847862
1848118
1848374
1848630
1848886
1849142
1849398
1849654
1849910
1850166
1843767
1844023
1844279
1844791
1845047
1845303
1847863
1848119
1848375
1848631
1848887
1849143
1849399
1849655
1849911
1850167
1843768
1844024
1844280
1844792
1845048
1845304
1847864
1848120
1848376
1848632
1848888
1849144
1849400
1849656
1849912
1850168
1843769
1844025
1844281
1844793
1845049
1845305
1847865
1848121
1848377
1848633
1848889
1849145
1849401
1849657
1849913
1850169
1840640
1840896
1849088
1849344
1856512
1856768
1840735
1840991
1849183
1849439
1856607
1856863
1914663
1915687
1914664
1915688
1914665
1915689
1914666
1915690
1914667
1915691
1914668
1915692
1914669
1915693
1914670
1915694
1914671
1915695
1914672
1915696
1914673
1915697
1914674
1915698
1914675
1915699
1914676
1915700
1914677
1915701
1914678
1915702
1914679
1915703
1914680
1915704
1914681
1915705
1914682
1915706
1914683
1915707
1914684
1915708
1906176
1906432
1914624
1914880
1922048
1922304
1906271
1906527
1914719
1914975
1922143
1922399
1975079
1975335
1975080
1975336
1975081
1975337
1975082
1975338
1975083
1975339
1975084
1975340
1975085
1975341
1975086
1975342
1975087
1975343
1975088
1975344
1975089
1975345
1975090
1975346
1975091
1975347
1975092
1975348
1975093
1975349
1975094
1975350
1975095
1975351
1975096
1975352
1975097
1975353
1975098
1975354
1975100
1975356
1971712
1971968
1980160
1980416
1987584
1987840
1971807
1972063
1980255
1980511
1987679
1987935
2053890
2037248
2037504
2045696
2045952
2053120
2053376
2037343
2037599
2045791
2046047
2053215
2053471
2110720
2110465
2110721
2105895
2106151
2106407
2106663
2107175
2108967
2109223
2110247
2110503
2110759
2111015
2111271
2111783
2112039
2105896
2106152
2106408
2106664
2107176
2108968
2109224
2110248
2110504
2110760
2111016
2111272
2111784
2112040
2105897
2106153
2106409
2106665
2107177
2108969
2109225
2110249
2110505
2110761
2111017
2111273
2111785
2112041
2105898
2106154
2106410
2106666
2107178
2108970
2109226
2110250
2110506
2110762
2111018
2111274
2111786
2112042
2105899
2106155
2106411
2106667
2107179
2108971
2109227
2110251
2110507
2110763
2111019
2111275
2111787
2112043
2105900
2106156
2106412
2106668
2107180
2108972
2109228
2110252
2110508
2110764
2111020
2111276
2111788
2112044
2105901
2106157
2106413
2106669
2107181
2108973
2109229
2110253
2110509
2110765
2111021
2111277
2111789
2112045
2105902
2106158
2106414
2106670
2107182
2108974
2109230
2110254
2110510
2110766
2111022
2111278
2111790
2112046
2105903
2106159
2106415
2106671
2107183
2108975
2109231
2110255
2110511
2110767
2111023
2111279
2111791
2112047
2105904
2106160
2106416
2106672
2107184
2108976
2109232
2110256
2110512
2110768
2111024
2111280
2111792
2112048
2105905
2106161
2106417
2106673
2107185
2108977
2109233
2110257
2110513
2110769
2111025
2111281
2111793
2112049
2105906
2106162
2106418
2106674
2107186
2108978
2109234
2110258
2110514
2110770
2111026
2111282
2111794
2112050
2105907
2106163
2106419
2106675
2107187
2108979
2109235
2110259
2110515
2110771
2111027
2111283
2111795
2112051
2105908
2106164
2106420
2106676
2107188
2108980
2109236
2110260
2110516
2110772
2111028
2111284
2111796
2112052
2105909
2106165
2106421
2106677
2107189
2108981
2109237
2110261
2110517
2110773
2111029
2111285
2111797
2112053
2105910
2106166
2106422
2106678
2107190
2108982
2109238
2110262
2110518
2110774
2111030
2111286
2111798
2112054
2105911
2106167
2106423
2106679
2107191
2108983
2109239
2110263
2110519
2110775
2111031
2111287
2111799
2112055
2105912
2106168
2106424
2106680
2107192
2108984
2109240
2110264
2110520
2110776
2111032
2111288
2111800
2112056
2105913
2106169
2106425
2106681
2107193
2108985
2109241
2110265
2110521
2110777
2111033
2111289
2111801
2112057
2105914
2106170
2106426
2106682
2107194
2108986
2109242
2110266
2110522
2110778
2111034
2111290
2111802
2112058
2105915
2106171
2106427
2106683
2107195
2108987
2109243
2110267
2110523
2110779
2111035
2111291
2111803
2112059
2105916
2106172
2106428
2106684
2107196
2108988
2109244
2110268
2110524
2110780
2111036
2111292
2111804
2112060
2105917
2106173
2106429
2106685
2107197
2108989
2109245
2110269
2110525
2110781
2111037
2111293
2111805
2112061
2105918
2106174
2106430
2106686
2107198
2108990
2109246
2110270
2110526
2110782
2111038
2111294
2111806
2112062
2105919
2106175
2106431
2106687
2107199
2108991
2109247
2110271
2110527
2110783
2111039
2111295
2111807
2112063
2102784
2103040
2111232
2111488
2118656
2118912
2102879
2103135
2111327
2111583
2118751
2119007
2184449
2168320
2168576
2176768
2177024
2184192
2184448
2168415
2168671
2176863
2177119
2184287
2184543
2238247
2242087
2242343
2243367
2238248
2242088
2242344
2243368
2238249
2242089
2242345
2243369
2238250
2242090
2242346
2243370
2238251
2242091
2242347
2243371
2238252
2242092
2242348
2243372
2238253
2242093
2242349
2243373
2238254
2242094
2242350
2243374
2238255
2242095
2242351
2243375
2238256
2242096
2242352
2243376
2238257
2242097
2242353
2243377
2238258
2242098
2242354
2243378
2238259
2242099
2242355
2243379
2238260
2242100
2242356
2243380
2238261
2242101
2242357
2243381
2238262
2242102
2242358
2243382
2238263
2242103
2242359
2243383
2238264
2242104
2242360
2243384
2238265
2242105
2242361
2243385
2238266
2242106
2242362
2243386
2238267
2242107
2242363
2243387
2238268
2242108
2242364
2243388
2238269
2242109
2242365
2243389
2238270
2242110
2242366
2243390
2238271
2242111
2242367
2243391
2238272
2242112
2242368
2243392
2233856
2234112
2242304
2242560
2249728
2249984
2233951
2234207
2242399
2242655
2249823
2250079
2299392
2299648
2307840
2308096
2315264
2315520
2299487
2299743
2307935
2308191
2315359
2315615
2372608
2372864
2372609
2372865
2373415
2373671
2373927
2374183
2374439
2373416
2373417
2373418
2373419
2373420
2373421
2373422
2373423
2373425
2373681
2373937
2374193
2374449
2373426
2373682
2373938
2374194
2374450
2373428
2373684
2373940
2374196
2374452
2373429
2373685
2373941
2374197
2374453
2373431
2373687
2373943
2374199
2374455
2373432
2373688
2373944
2374200
2374456
2373433
2373689
2373945
2374201
2374457
2373434
2373690
2373946
2374202
2374458
2373435
2373691
2373947
2374203
2374459
2373436
2373692
2373948
2374204
2374460
2373437
2373693
2373949
2374205
2374461
2373439
2373695
2373951
2374207
2374463
2373440
2373696
2373952
2374208
2374464
2364928
2365184
2373376
2373632
2380800
2381056
2365023
2365279
2373471
2373727
2380895
2381151
2437671
2438951
2439719
2439975
2437672
2438952
2439720
2439976
2437673
2438953
2439721
2439977
2437674
2438954
2439722
2439978
2437675
2438955
2439723
2439979
2437676
2438956
2439724
2439980
2437677
2438957
2439725
2439981
2437678
2438958
2439726
2439982
2437679
2438959
2439727
2439983
2437680
2438960
2439728
2439984
2437681
2438961
2439729
2439985
2437682
2438962
2439730
2439986
2437683
2438963
2439731
2439987
2437684
2438964
2439732
2439988
2437685
2438965
2439733
2439989
2437686
2438966
2439734
2439990
2437687
2438967
2439735
2439991
2437688
2438968
2439736
2439992
2437689
2438969
2439737
2439993
2437690
2438970
2439738
2439994
2437691
2438971
2439739
2439995
2437692
2438972
2439740
2439996
2437693
2438973
2439741
2439997
2437694
2438974
2439742
2439998
2437695
2438975
2439743
2439999
2437696
2438976
2439744
2440000
2430464
2430720
2438912
2439168
2446336
2446592
2430559
2430815
2439007
2439263
2446431
2446687
2496000
2496256
2504448
2504704
2511872
2512128
2496095
2496351
2504543
2504799
2511967
2512223
2564135
2569511
2564136
2569512
2564137
2569513
2564138
2569514
2564139
2569515
2564140
2569516
2564141
2569517
2564142
2569518
2564143
2569520
2564145
2564401
2569521
2564146
2564402
2569522
2564147
2564403
2569523
2564148
2564404
2569524
2564149
2564405
2569525
2564150
2564406
2569526
2564151
2564407
2569527
2569529
2561536
2561792
2569984
2570240
2577408
2577664
2561631
2561887
2570079
2570335
2577503
2577759
2627072
2627328
2635520
2635776
2642944
2643200
2627167
2627423
2635615
2635871
2643039
2643295
2695206
2695718
2695207
2695463
2695719
2702119
2695208
2695464
2695720
2702120
2695209
2695465
2695721
2702121
2695210
2695466
2695722
2702122
2695211
2695467
2695723
2702123
2695212
2695468
2695724
2702124
2695213
2695469
2695725
2702125
2695214
2695470
2695726
2702126
2695215
2695471
2695727
2702127
2695472
2695728
2695217
2695473
2695729
2695218
2695474
2695730
2702130
2695219
2695475
2695731
2702131
2695220
2695476
2695732
2702132
2695221
2695477
2695733
2702133
2695222
2695478
2695734
2702134
2695223
2695479
2695735
2702135
2695224
2695480
2695736
2702136
2695225
2695481
2695737
2702137
2695226
2695482
2695738
2702138
2695227
2695483
2695739
2702139
2695228
2695484
2695740
2702140
2695229
2695485
2695741
2702141
2695230
2695486
2695742
2702142
2695231
2695487
2695743
2702143
2695232
2695488
2695744
2702144
2692608
2692864
2701056
2701312
2708480
2708736
2692703
2692959
2701151
2701407
2708575
2708831
2758400
2766631
2766632
2766633
2766634
2766635
2766636
2766637
2766638
2766639
2766641
2766642
2766644
2758144
2758400
2766592
2766848
2774016
2774272
2758239
2758495
2766687
2766943
2774111
2774367
2826278
2832166
2832678
2826279
2832167
2832679
2833191
2826280
2832168
2832680
2833192
2826281
2832169
2832681
2833193
2826282
2832170
2832682
2833194
2826283
2832171
2832683
2833195
2826284
2832172
2832684
2833196
2826285
2832173
2832685
2833197
2826286
2832174
2832686
2833198
2826287
2832175
2832687
2833199
2826288
2832176
2832688
2833200
2826289
2832177
2832689
2833201
2826290
2832178
2832690
2833202
2826291
2832179
2832691
2833203
2826292
2832180
2832692
2833204
2826293
2832181
2832693
2833205
2826294
2832182
2832694
2833206
2826295
2832183
2832695
2833207
2832184
2832696
2833208
2826297
2832185
2832697
2833209
2826298
2832186
2832698
2833210
2826299
2832187
2832699
2833211
2826300
2832188
2832700
2833212
2826301
2832189
2832701
2833213
2826302
2832190
2832702
2833214
2826303
2832191
2832703
2833215
2826304
2832192
2832704
2833216
2823680
2823936
2832128
2832384
2839552
2839808
2823775
2824031
2832223
2832479
2839647
2839903
2889216
2889472
2897664
2897920
2905088
2905344
2889311
2889567
2897759
2898015
2905183
2905439
2957350
2957606
2957862
2958886
2963238
2957351
2957607
2957863
2958887
2963239
2957352
2957608
2957864
2958888
2963240
2957609
2957865
2958889
2963241
2957354
2957610
2957866
2958890
2963242
2957867
2958891
2963243
2957356
2957612
2957868
2958892
2963244
2957869
2958893
2963245
2957614
2957870
2958894
2963246
2957871
2957360
2957616
2957872
2958896
2963248
2957617
2957873
2958897
2963249
2957362
2957618
2957874
2958898
2963250
2957363
2957619
2957875
2958899
2963251
2957364
2957620
2957876
2958900
2963252
2957365
2957621
2957877
2958901
2963253
2957366
2957622
2957878
2958902
2963254
2957367
2957623
2957879
2958903
2963255
2957368
2957624
2957880
2958904
2957369
2957625
2957881
2958905
2957370
2957626
2957882
2958906
2957371
2957627
2957883
2958907
2957372
2957628
2957884
2958908
2957373
2957629
2957885
2958909
2957374
2957630
2957886
2958910
2957375
2957631
2957887
2958911
2957376
2957632
2957888
2958912
2963264
2954752
2955008
2963200
2963456
2970624
2970880
2954847
2955103
2963295
2963551
2970719
2970975
3022886
3023398
3024934
3025190
3025446
3025702
3025958
3026214
3026470
3026726
3022887
3023399
3024935
3025191
3025447
3025703
3025959
3026215
3026471
3026727
3022888
3023400
3024936
3025192
3025448
3025704
3025960
3026216
3026472
3026728
3022889
3023401
3024937
3025193
3025449
3025705
3025961
3026217
3026473
3026729
3022890
3023402
3024938
3025194
3025450
3025706
3025962
3026218
3026474
3026730
3022891
3023403
3024939
3025195
3025451
3025707
3025963
3026219
3026475
3026731
3022892
3023404
3024940
3025196
3025452
3025708
3025964
3026220
3026476
3026732
3022893
3023405
3024941
3025197
3025453
3025709
3025965
3026221
3026477
3026733
3022894
3023406
3024942
3025198
3025454
3025710
3025966
3026222
3026478
3026734
3023407
3024943
3025199
3025455
3025711
3025967
3026223
3026479
3026735
3022896
3023408
3024944
3025200
3025456
3025712
3025968
3026224
3026480
3026736
3022897
3023409
3024945
3025201
3025457
3025713
3025969
3026225
3026481
3026737
3022898
3023410
3024946
3025202
3025458
3025714
3025970
3026226
3026482
3026738
3022899
3023411
3024947
3025203
3025459
3025715
3025971
3026227
3026483
3026739
3022900
3023412
3024948
3025204
3025460
3025716
3025972
3026228
3026484
3026740
3022901
3023413
3024949
3025205
3025461
3025717
3025973
3026229
3026485
3026741
3022902
3023414
3024950
3025206
3025462
3025718
3025974
3026230
3026486
3026742
3022903
3023415
3024951
3025207
3025463
3025719
3025975
3026231
3026487
3026743
3022904
3023416
3022905
3023417
3022906
3023418
3022907
3023419
3022908
3023420
3022909
3023421
3022910
3023422
3022911
3023423
3022912
3023424
3024960
3025216
3025472
3025728
3025984
3026240
3026496
3026752
3020288
3020544
3028736
3028992
3036160
3036416
3020383
3020639
3028831
3029087
3036255
3036511
3088423
3088679
3088424
3088680
3088425
3088681
3088426
3088682
3088427
3088683
3088428
3088684
3088429
3088685
3088430
3088686
3088431
3088687
3088432
3088688
3088433
3088689
3088434
3088690
3088435
3088691
3088436
3088692
3088437
3088693
3088438
3088694
3088439
3088695
3088440
3088696
3089720
3088441
3088697
3089721
3088442
3088698
3089722
3090234
3088443
3088699
3088444
3088700
3088445
3088701
3089725
3090237
3088446
3088702
3089726
3088703
3089727
3088448
3088704
3091010
3091266
3085824
3086080
3094272
3094528
3101696
3101952
3085919
3086175
3094367
3094623
3101791
3102047
3153958
3159078
3153959
3159079
3153960
3159080
3153961
3159081
3153962
3159082
3153963
3159083
3153964
3159084
3153965
3159085
3153966
3159086
3153967
3159087
3153968
3159088
3153969
3159089
3153970
3159090
3153971
3159091
3153972
3159092
3153973
3159093
3153974
3159094
3153975
3159095
3153976
3159096
3153977
3159097
3153978
3159098
3153979
3159099
3153980
3159100
3153981
3159101
3151360
3151616
3159808
3160064
3167232
3167488
3151455
3151711
3159903
3160159
3167327
3167583
3224576
3224577
3216896
3217152
3225344
3225600
3232768
3233024
3216991
3217247
3225439
3225695
3232863
3233119
3282432
3282688
3290880
3291136
3298304
3298560
3282527
3282783
3290975
3291231
3298399
3298655
3347968
3348224
3356416
3356672
3363840
3364096
3348063
3348319
3356511
3356767
3363935
3364191
3413504
3413760
3421952
3422208
3429376
3429632
3413599
3413855
3422047
3422303
3429471
3429727
3479040
3479296
3487488
3487744
3494912
3495168
3479135
3479391
3487583
3487839
3495007
3495263
