77337
82468
149039
140849
140594
601135
931359
1129770
1188394
1255971
1254185
1387567
1583136
1584160
1583394
1584162
1583139
1583651
1583907
1584419
1583396
1584676
1583398
1583654
1583911
1585707
1580859
1653808
1785401
1846843
1910309
2173466
2307100
2564387
2564399
2564144
2564400
2639920
2703152
2703154
2765851
2766108
2768681
2761264
2762035
2764349
2763070
2764606
2957355
2957611
2957357
2957613
2957358
2958127
2958383
3030312
3029039
3029040
3089202
3090485
3091254
3092022
3092534
3089975
3090231
3091255
3092535
3090232
3090488
3091256
3091769
3091258
