0 0 0.687499979511 0.909090936184 1.60000002384
0 1 0.766129030048 0.902180850506 1.44678652287
0 2 1.0 0.800000011921 1.25
1 0 1.11111114055 0.699999988079 1.28571426868
1 1 0.648947385848 0.938666343689 1.64164495468
1 2 0.426229528188 0.923076927662 2.54166674614
2 0 0.562499995809 0.888888895512 2.0
2 1 0.730977828961 0.904485940933 1.5124951601
2 2 0.857142886337 0.833333313465 1.39999997616
3 0 0.785714299095 0.818181812763 1.55555558205
3 1 0.602676687751 0.931702494621 1.78089499474
3 2 0.954545402822 0.809523820877 1.29411768913
4 0 0.387096786102 0.916666686535 2.81818175316
4 1 0.684787792395 0.915720164776 1.59470808506
4 2 0.757575727472 0.839999973774 1.57142853737
5 0 0.636363650156 0.857142865658 1.83333337307
5 1 0.62311649614 0.938989400864 1.7091101408
5 2 0.781250017462 0.839999973774 1.52380955219
6 0 1.4999999553 0.666666686535 1.0
6 1 0.577055982687 0.936736822128 1.84996891022
6 2 0.781250017462 0.879999995232 1.45454549789
7 0 1.0 0.875 1.14285719395
7 1 0.654004269587 0.89273661375 1.71275830269
7 2 0.724137942941 0.904761910439 1.5263158083
8 0 0.571428571429 1.0 1.75
8 1 0.737246291141 0.886864900589 1.52943110466
8 2 0.638888895236 0.956521749496 1.63636362553
9 0 0.583333327538 1.0 1.71428573132
9 1 0.708580423835 0.911506474018 1.54828560352
9 2 0.52380953273 0.909090936184 2.09999990463
10 0 0.615384615385 1.0 1.625
10 1 0.635995140464 0.92392373085 1.70180606842
10 2 0.916666639348 0.863636374474 1.26315784454
11 0 0.529411779555 1.0 1.88888883591
11 1 0.656653659009 0.928814530373 1.63958764076
11 2 0.814814800425 0.909090936184 1.35000002384
12 0 0.555555570273 1.0 1.79999995232
12 1 0.560086375778 0.957812964916 1.86407887936
12 2 0.874999960884 0.904761910439 1.26315784454
13 0 0.555555570273 1.0 1.79999995232
13 1 0.691053336752 0.926774144173 1.56140136719
13 2 0.884615408951 0.913043498993 1.23809528351
14 0 1.0 0.888888895512 1.125
14 1 0.695697578264 0.902644634247 1.59243857861
14 2 0.657142859381 0.869565188885 1.75
15 0 1.14285714286 0.875 1.0
15 1 0.728376816859 0.885595202446 1.55027461052
15 2 0.718749986612 0.956521749496 1.45454549789
16 0 1.11111114055 0.899999976158 1.0
16 1 0.608504047405 0.946636557579 1.73601424694
16 2 0.757575727472 0.800000011921 1.64999997616
17 0 0.77777778808 0.857142865658 1.5
17 1 0.637844636779 0.939958095551 1.66792523861
17 2 0.742857137797 0.807692289352 1.66666662693
18 0 1.0 0.875 1.14285719395
18 1 0.560396631584 0.956256151199 1.8660800457
18 2 0.676470585863 0.956521749496 1.54545450211
19 0 0.77777778808 1.0 1.28571426868
19 1 0.731153101235 0.903746724129 1.51336932182
19 2 0.718749986612 0.956521749496 1.45454549789
20 0 1.14285714286 0.625 1.39999997616
20 1 0.68321455047 0.92061650753 1.58987915516
20 2 0.666666666667 0.916666686535 1.63636362553
21 0 0.727272727273 0.875 1.57142853737
21 1 0.570954230323 0.955629229546 1.83277547359
21 2 0.857142886337 0.875 1.33333337307
22 0 0.5 0.888888895512 2.25
22 1 0.815356676167 0.847542881966 1.44707393646
22 2 0.956521778792 0.909090936184 1.14999997616
23 0 0.699999983311 1.0 1.42857146263
23 1 0.64946418443 0.936278522015 1.64452219009
23 2 0.741935463899 0.913043498993 1.47619044781
24 0 1.22222223032 0.636363625526 1.28571426868
24 1 0.668354056013 0.904392898083 1.65438377857
24 2 0.888888888889 0.875 1.28571426868
25 0 0.624999990687 1.0 1.60000002384
25 1 0.707030447979 0.936835885048 1.50972688198
25 2 0.657142859381 0.869565188885 1.75
26 0 0.916666639348 0.818181812763 1.33333337307
26 1 0.944986678433 0.788310647011 1.3423845768
26 2 0.774193572204 0.875 1.47619044781
27 0 0.923076889219 0.833333313465 1.29999995232
27 1 0.673605283227 0.912325382233 1.62721431255
27 2 0.705882372741 0.875 1.61904764175
28 0 0.749999977648 1.0 1.33333337307
28 1 0.708308554604 0.894585192204 1.57817745209
28 2 0.631578931518 0.833333313465 1.89999997616
29 0 1.0 0.818181812763 1.22222220898
29 1 0.647218447012 0.95387840271 1.61978018284
29 2 0.71428572645 0.959999978542 1.45833337307
30 0 0.77777778808 0.857142865658 1.5
30 1 0.475218806877 0.969201028347 2.17116332054
30 2 0.806451606701 0.839999973774 1.47619044781
31 0 0.684210539194 0.846153855324 1.72727274895
31 1 0.398814331249 0.972053766251 2.57952046394
31 2 0.705882372741 0.958333313465 1.47826087475
32 0 1.29999997675 0.692307710648 1.11111116409
32 1 0.865894011024 0.753465592861 1.53275179863
32 2 0.595238113822 0.959999978542 1.75
33 0 0.481481468727 0.923076927662 2.25
33 1 0.527460510137 0.976088821888 1.94231975079
33 2 0.636363650156 1.0 1.57142853737
34 0 0.583333327538 1.0 1.71428573132
34 1 0.725623105736 0.921602904797 1.49535763264
34 2 0.771428605586 0.962962985039 1.34615385532
35 0 0.608695633245 1.0 1.64285719395
35 1 0.723895108746 0.907913565636 1.52152764797
35 2 0.702702729871 1.0 1.42307686806
36 0 1.6428572128 0.565217375755 1.07692313194
36 1 0.580891562372 0.959855735302 1.79349017143
36 2 0.906250003376 0.86206895113 1.27999997139
37 0 1.0 0.736842095852 1.35714280605
37 1 0.749332300233 0.903587698936 1.4769141674
37 2 0.71428572645 0.959999978542 1.45833337307
38 0 1.20000002861 0.611111104488 1.36363637447
38 1 0.953582604131 0.76930141449 1.36315476894
38 2 0.956521778792 0.863636374474 1.21052634716
39 0 1.27586205323 0.675675690174 1.15999996662
39 1 0.701234779259 0.93477243185 1.52556478977
39 2 3.57142855622 0.280000001192 1.0
40 0 0.974999944791 0.564102590084 1.81818187237
40 1 0.864684784011 0.837380349636 1.38108181953
40 2 0.789473694117 0.933333337307 1.35714280605
41 0 0.843137276581 0.860465109348 1.37837839127
41 1 0.642076589103 0.95688521862 1.62762105465
41 2 1.0 0.0 0.0
42 0 1.0 0.64814811945 1.5428571701
42 1 0.626238164076 0.932630360126 1.71218597889
42 2 1.57142859819 0.54545456171 1.16666662693
43 0 0.62195121047 0.882352948189 1.82222223282
43 1 0.701747071309 0.901426017284 1.58084499836
43 2 0.923076889219 0.916666686535 1.18181812763
44 0 0.794520516806 0.810344815254 1.55319154263
44 1 0.763929200152 0.869157195091 1.50608170033
44 2 0.77777778808 0.928571403027 1.3846154213
45 0 1.03448278839 0.716666638851 1.34883725643
45 1 0.712779149475 0.902959167957 1.55373489857
45 2 0.743589773137 0.86206895113 1.55999994278
46 0 1.0 0.671428561211 1.48936164379
46 1 0.723351728257 0.894768953323 1.54503953457
46 2 1.0 0.0 0.0
47 0 1.10169490858 0.73846155405 1.22916662693
47 1 0.950772633787 0.801883876324 1.31163144112
47 2 0.888888888889 0.9375 1.20000004768
48 0 0.891304345516 0.865853667259 1.29577469826
48 1 0.565005929169 0.93950086832 1.88386499882
48 2 0.874999960884 0.857142865658 1.33333337307
49 0 0.722772294289 0.86301368475 1.60317456722
49 1 0.919108634426 0.755788564682 1.43957018852
49 2 0.749999977648 0.904761910439 1.4736841917
50 0 0.811320760192 0.883720934391 1.39473688602
50 1 0.857308974632 0.829633831978 1.40597045422
50 2 1.0 0.809523820877 1.23529410362
51 0 0.961538496807 0.72000002861 1.44444441795
51 1 0.666700099926 0.945732355118 1.58599281311
51 2 0.803921564869 0.87804877758 1.41666662693
52 0 10.3333336413 0.0860215052962 1.125
52 1 0.553380273133 0.937260985374 1.92803895473
52 2 1.6363636541 0.388888895512 1.57142853737
53 0 1.0 0.0 0.0
53 1 1.0 0.0 0.0
53 2 1.0 0.0 0.0
