Timestamp	Run No.	Events	Run Type	Beam Stopper	Beam Polarity	Beam Momentum [GeV]	Trigger	Cerenkov BCA	Cerenkov BCB	Events / spill	Temperature	Pressure	Comment	Bad run	Beam File	Beam type	Absorber	Target
	660052	78536	beamData		-	9	10x10			500	32.3	964.7	varying Cherenkov pressure during run				air	
	660053		DhcNoise								32.155	964.9	Noisy chip Crate 221, Slot 14, Dcon 8 masked				air	
	660054	100025	beamData		-	9	10x10	2	2	600	32	964.1					air	
	660055	101045	beamData		-	9	10x10	2	2	555	31.985	963.7					air	
	660056	84249	beamData		-	9	10x10	2	2	590	31.9	963.8					air	
	660057	22241	beamData		-	9	10x10	2	2	599	31.9	963.8	3rd spill immediately after 2nd spill. 3rd spill is never seen and fastRPC is out of sync				air	
	660058	106373	beamData		-	9	10x10	2	2	580	32	963.1					air	
	660059	101669	beamData		-	9	10x10	2	2	590	32.088	963	N				air	
	660060	109905	beamData		-	9	10x10	2	2	600	32.1	963.2					air	
	660061	76685	beamData		-	9	10x10	2	2	590	32.13	963.8					air	
	660062		DhcNoise				NULL				32.15	963.8	Short noise run to test kill masks				air	
	660063		DhcNoise				NULL				32.15	963.8	Second kill mask test				air	
	660064		DhcNoise				NULL				32.15	963.8	Third kill mask test				air	
	660065		DhcNoise				NULL				32.15	963.8	fourth and last kill mask test				air	
	660066	13815	beamData		-	9	10x10	2.25	2.25	400	32.1	964					air	
	660067	21578	beamData		-	9	10x10	0.51	0.51	300	31.7	964.5	at end of run, trigger went wrong				air	
	660068		beamData		-	9	10x10	999	999	400	31.63	964.4	Cherenkov pressure during run was changing				air	
	660069		DhcNoise								31.78	964.1					air	
	660070	52856	beamData		-	9	10x10	1	1	400	31.691	964.1					air	
	660071		DhcNoise				NULL				31.6	963.6					air	
	660072		DhcNoise				NULL				31.7	963.5					air	
	660073		DhcNoise				NULL				31.5	963.3					air	
	660074	75660	beamData		-	3	10x10	1	1	400	31.16	963.6					air	
	660075	111382	beamData		-	3	10x10	1	1	420	30.93	964.8					air	
	660076	189076	beamData		-	3	10x10	1	1.1	400	30.83	965.7					air	
	660077	211109	beamData		-	3	10x10	1	1.1	460	30.57	965.1					air	
	660078	96700	beamData		-	3	10x10	1	1.1	428	30.46	965					air	
	660079		DhcNoise				NULL				30.46	965					air	
	660080	168010	beamData		-	3	10x10	1	1.1	400	30.4	964.1					air	
	660081	154248	beamData		-	3	10x10	1	1	400	30.3	963.9					air	
	660082	100226	beamData		-	1	10x10	1	1	430	30.2	962.6					air	
	660083	194597	beamData		-	1	10x10	0.99	1.01	400	30.05	960.7					air	
	660084	220458	beamData		-	1	10x10	0.99	1.01	400	30.1	959.8					air	
	660085	25379	beamData		-	1	10x10	0.99	1.03	400	30.1	959.8					air	
	660086	114368	beamData		-	5	10x10	0.84	0.84	450		960.1					air	
	660087	101779	beamData		-	5	10x10	0.84	0.085	450	30.2	960.9					air	
	660088		DhcNoise				NULL				30.2	960.1					air	
	660089	106521	beamData		-	5	10x10	0.84	0.86	446	30.25	960.4					air	
	660090	132585	beamData		-	5	10x10	0.84	0.86	470	30.24	960					air	
	660091	99472	beamData		-	5	10x10	0.84	0.86	450	30.2	959.2					air	
	660092	112885	beamData		-	5	10x10	0.84	0.86	457	30.29	959					air	
	660093	114545	beamData		-	5	10x10	0.84	0.86	456	30.35	958.9					air	
	660094	178748	beamData		-	5	10x10	0.84	0.87	400	30.3	958.9					air	
	660095	224332	beamData		-	5	10x10	0.84	0.85	400	30.2	957.4					air	
	660096	220466	beamData		-	7	10x10	0.41	0.4	400	30.2	955.9					air	
	660097		DhcNoise								30.2	955.9					air	
	660098	105399	beamData	Open	-	7	10x10	0.41	0.41	400	30.5	954.5					air	
5/20/2012 19:54:53	660099	131012	beamData	Open	-	7	10x10	0.41	0.41	430	30.57	954	only 2 spills / supercycle during part of the run			-	air	
5/20/2012 21:58:50	660100	165832	beamData	Open	-	7	10x10	0.41	0.41	400	30.7	954.5				-	air	
5/20/2012 22:07:19	660101		DhcNoise	Open	-		10x10				30.6	954.8				-	air	
5/21/2012 0:37:36	660102	193669	beamData	Open	-	7	10x10	0.42	0.41	434	30.6	954.7			-	-	air	
5/21/2012 2:47:14	660103	293847	beamData	Open	-	7	10x10	0.42	0.41	401	30.6	954				-	air	
5/21/2012 4:43:23	660104	1	beamData	Open	-	7	10x10	0.42	0.41	401	30.6	953.7	junk run, just start/stop	bad run		-	air	
5/21/2012 4:51:46	660105	211941	beamData	Open	-	7	10x10	0.41	0.42	420	30.5	953.7				-	air	
5/21/2012 6:56:57	660106	168024	beamData	Open	-	7	10x10	0.42	0.41	401	30.5	953				-	air	
5/21/2012 7:01:15	660107		DhcNoise	Open	-		10x10				30.5	953.1				-	air	
5/21/2012 7:45:06	660108	56554	beamData	Open	-	7	10x10	0.42	0.41	417	30.5	953.2				-	air	
5/21/2012 10:06:32	660109	162502	beamData	Open	-	2	10x10	1	1.01	250	30.5	952.8	Layer 9 middle RPC is inefficient. Probably connector problem			-	air	
5/21/2012 10:18:08	660110		DhcNoise	Open	-		10x10				30.5	952.7				-	air	
5/21/2012 12:16:44	660111	114492	beamData	Open	-	2	10x10	1	1.01	60 - 500	30.5	952.9				-	air	
5/21/2012 14:29:00	660112	76182	beamData	Open	-	2	10x10	1	1.02	450	30.5	952.9	beam condition changed dramatically during run. <40 triggers per spill, almost no electrons. Stopped the run. 			-	air	
5/21/2012 15:30:14	660113	14793	beamData	Open	-	2	10x10	1	1.02	400	30.4	949.9	lineac problem, no beam for some time; report pressure measured in tent from now on			-	air	
5/21/2012 17:36:50	660114	159678	beamData	Open	-	2	10x10	1	1	440	30.5	950	layer 26 inefficient at beginning, recovered during run. Layer 9 alive.			-	air	
5/21/2012 19:57:56	660115	181812	beamData	Open	-	2	10x10	1	1	420	30.5	950.7	about 30 min into the run Lei reconnected HV of 34M and 37M, without effect. Layer 31 was inefficient for part of the run.			-	air	
5/21/2012 21:51:06	660116	154830	beamData	Open	-	2	10x10	1	1	440	30.5	951.87				-	air	
5/21/2012 21:59:20	660117		DhcNoise	Open	-		10x10				30.5	952.13	noise calibration run			-	air	
5/21/2012 23:40:37	660118	100072	beamData	Open	-	2	10x10	1	1	430	30.5	952.2	layer 26 somewhat inefficient; for some time two consecutive spills in the cycle			-	air	
5/22/2012 2:07:36	660119	201491	beamData	Open	-	4	10x10	1	1	472	30.4	952.4				-	air	
5/22/2012 4:09:19	660120	187353	beamData	Open	-	4	10x10	1	1	469	30.4	952.7				-	air	
5/22/2012 6:06:32	660121	151896	beamData	Open	-	4	10x10	1	1.01	419	30.5	952.4				-	air	
5/22/2012 6:11:55	660122		DhcNoise	Open	-		10x10				30.5	954				-	air	
5/22/2012 8:18:15	660123	158232	beamData	Open	-	4	10x10	1	1.01	430	30.5	953.4				-	air	
5/22/2012 8:49:22	660124	14454	beamData	Open	-	4	10x10	1	1	490	30.5	953.8	stopped because of Machine development		-	-	air	
5/22/2012 12:22:37	660125	178809	beamData	Open	-	4	10x10	1	1	470	30.5	957.3			-	-	air	
5/22/2012 15:49:09	660126	138067	beamData	Open	-	4	10x10	1	1	470	30.5	958.3				-	air	
5/22/2012 17:49:18	660127	151189	beamData	Open	-	6	10x10	0.6	0.6	400	30.4	960.08				-	air	
5/22/2012 17:51:05	660128		DhcNoise	Open	-		10x10				30.4	960.1				-	air	
5/22/2012 19:53:13	660129	127113	beamData	Open	-	6	10x10	0.6	0.6	490	30.35	961.26				-	air	
5/22/2012 21:57:21	660130	137560	beamData	Open	-	6	10x10	0.61	0.61	440	30.38	962.6				-	air	
5/22/2012 23:10:15	660131	111429	beamData	Open	-	6	10x10	0.61	0.61	450	30.38	963.6				-	air	
5/22/2012 23:12:40	660132		DhcNoise	Open	-		10x10				30.37	963.5				-	air	
5/23/2012 1:32:32	660133	122353	beamData	Open	-	6	10x10	0.6	0.6	470	30.36	964.7				-	air	
5/23/2012 3:38:57	660134	193119	beamData	Open	-	6	10x10	0.6	0.61	470	30.46	965.1				-	air	
5/23/2012 5:43:08	660135	175303	beamData	Open	-	6	10x10	0.61	0.61	460	30.5	966				-	air	
5/23/2012 5:45:21	660136		DhcNoise	Open	-		10x10				30.5	966				-	air	
5/23/2012 7:48:34	660137	157662	beamData	Open	-	6	10x10	0.61	0.61	490	30.46	966.7				-	air	
5/23/2012 8:59:52	660138	92507	beamData	Open	-	6	10x10	0.6	0.6	447	30.4	967.5				-	air	
5/23/2012 12:02:30	660139	146988	beamData	Open	-	8	10x10	0.3	0.3	350	30.2	967.8				-	air	
5/23/2012 14:36:07	660140	142328	beamData	Open	-	8	10x10	0.31	0.33	350	30.2	967.5				-	air	
5/23/2012 14:38:39	660141		DhcNoise	Open	-		10x10	0.31	0.33	350	30.2	967.5				-	air	
5/23/2012 16:58:15	660142	122651	beamData	Open	-	8	10x10	0.31	0.33	340	30.2	967.7				-	air	
5/23/2012 17:17:34	660143		DhcNoise	Open	-		NULL				30.2	967.6	noise run before HV change			-	air	
5/23/2012 17:18:14	660144		DhcNoise	Open	-		NULL				30.2	967.6	noise run after HV change			-	air	
5/23/2012 19:25:32	660145	120688	beamData	Open	-	8	10x10	0.31	0.33	350	32.1	967.5				-	air	
5/23/2012 21:55:49	660146	104684	beamData	Open	-	8	10x10	0.31	0.33	350	31.1	969	layer 11 was in the beginning not efficient			-	air	
5/23/2012 23:59:27	660147	136962	beamData	Open	-	8	10x10	0.31	0.33	350	30.7	970				-	air	
5/24/2012 2:05:11	660148	163795	beamData	Open	-	8	10x10	0.32	0.34	340	30.6	969.6				-	air	
5/24/2012 4:08:56	660149	145018	beamData	Open	-	8	10x10	0.32	0.34	340	30.5	969.6				-	air	
5/24/2012 4:14:30	660150		DhcNoise	Open	-		10x10				30.5	969.6				-	air	
5/24/2012 4:41:28	660151	645	beamData	Open	-	8	10x10			0	30.4	969.7	stopped because of problem with PS	bad run		-	air	
5/24/2012 9:36:54	660152	113690	beamData	Open	-	8	10x10	0.32	0.33	330	30.32	970.5				-	air	
5/24/2012 12:28:19	660153	102084	beamData	Open	-	9	10x10	0.26	0.26	350	30.4	969.4				-	air	
5/24/2012 14:30:13	660154	119975	beamData	Open	-	9	10x10	0.26	0.27	300	30.3	968.1				-	air	
5/24/2012 16:51:06	660155	114431	beamData	Open	-	9	10x10	0.26	0.27	330	30.5	967.2				-	air	
5/24/2012 17:46:34	660156	21069	beamData	Open	-	9	10x10	0.26	0.27	330	31.3	967.1	Changed cherenkov pressure during run, air condition tripped during run			-	air	
5/24/2012 18:23:15	660157	2024	beamData	Open	-	9	10x10	0.25	0.25	330	3.18	967.6	no air conditioning.	bad run		-	air	
5/24/2012 21:52:26	660158	121812	beamData	Open	-	9	10x10	0.26	0.26	340	31.2	967.3				-	air	
5/24/2012 23:56:01	660159	115420	beamData	Open	-	9	10x10	0.26	0.26	310	30.8	967.1				-	air	
5/25/2012 2:07:22	660160	119835	beamData	Open	-	9	10x10	0.26	0.26	365	30.6	967.2				-	air	
5/25/2012 2:09:52	660161		DhcNoise	Open	-		10x10				30.6	967.2				-	air	
5/25/2012 4:13:23	660162	123957	beamData	Open	-	9	10x10	0.26	0.26	360	30.5	966.4				-	air	
5/25/2012 6:15:58	660163	135244	beamData	Open	-	9	10x10	0.27	0.26	340	30.5	966.4				-	air	
5/25/2012 8:31:15	660164	147916	beamData	Open	-	9	10x10	0.27	0.27	360	30.5	966.45				-	air	
5/25/2012 9:31:48	660165	53504	beamData	Open	-	9	10x10	0.27	0.27	300	30.5	966.4	Ended when survey was started			-	air	
5/25/2012 13:56:35	660166	136376	beamData	Open	-	10	10x10	0.21	0.2	300	30.4	964.6				-	air	
5/25/2012 16:16:11	660167	109957	beamData	Open	-	10	10x10	0.21	0.2	300	30.4	963.6				-	air	
5/25/2012 16:26:00	660168		DhcNoise	Open	-		10x10	0.21	0.2		30.5	963.8				-	air	
5/25/2012 18:31:23	660169	84778	beamData	Open	-	10	10x10	0.21	0.2	300	30.5	962.7				-	air	
5/25/2012 20:35:37	660170	120130	beamData	Open	-	10	10x10	0.21	0.2	320	30.6	963.1				-	air	
5/25/2012 22:53:36	660171	109319	beamData	Open	-	10	10x10	0.21	0.2	320	30.7	963.9				-	air	
5/25/2012 23:58:49	660172	65089	beamData	Open	-	10	10x10	0.22	0.2	313	30.6	964.5				-	air	
5/26/2012 2:28:25	660173	101199	beamData	Open	-	10	10x10	0.21	0.21	320	30.5	965				-	air	
5/26/2012 4:32:51	660174	121118	beamData	Open	-	10	10x10	0.22	0.21	330	30.5	964.9				-	air	
5/26/2012 6:36:38	660175	124210	beamData	Open	-	10	10x10	0.22	0.21	330	30.5	965.2				-	air	
5/26/2012 7:12:42	660176	35746	beamData	Open	-	10	10x10	0.22	0.21	320	30.5	965.5				-	air	
5/26/2012 10:04:28	660177	150505	beamData	Open	+	10	10x10	0.22	2.98	370	30.6	965.6				-	air	
5/26/2012 12:05:57	660178	141092	beamData	Open	+	10	10x10	0.22	2.98	350	30.7	965.1	L9 not very efficient			-	air	
5/26/2012 12:08:00	660179		DhcNoise	Open	-		10x10				30.7	965.1				-	air	
5/26/2012 13:08:44	660180	68171	beamData	Open	+	10	10x10	0.22	2.98	330	30.7	964.6				-	air	air
5/26/2012 15:36:43	660181	157815	beamData	Open	+	8	10x10	0.31	2.99	400	30.6	963.8				-	air	
5/26/2012 17:47:55	660182	149196	beamData	Open	+	8	10x10	0.29	3.01	360	30.6	963.3				-	air	
5/26/2012 20:11:28	660183	184191	beamData	Open	+	8	10x10	0.29	3.01	360	30.5	963.2				-	air	
5/26/2012 20:44:47	660184	36032	beamData	Open	+	8	10x10	0.29	3.01	360	30.5	963.4				-	air	
5/26/2012 21:04:04	660185	3326	DhcNoise	Closed	-		NULL				30.5	963.5				-	air	
5/26/2012 21:58:43	660186	77673	beamData	Open	+	4	10x10	0.82	2.98	480	30.5	964.2				-	air	
5/26/2012 22:23:52	660187	3624	beamData	Open	+	4	10x10	0.28	2.98	480	30.5	964.4	re-alignment of beam	bad run		-	air	
5/27/2012 0:25:25	660188	190451	beamData	Open	+	4	10x10	0.82	2.98	470	30.5	965.2				-	air	
5/27/2012 2:28:18	660189	188196	beamData	Open	+	4	10x10	0.82	2.97	440	30.5	965.2				-	air	
5/27/2012 4:31:40	660190	190546	beamData	Open	+	4	10x10	0.82	2.96	460	30.5	965.4				-	air	
5/27/2012 6:33:40	660191	240759	beamData	Open	+	4	10x10	0.82	2.95	450	30.5	965.8				-	air	
5/27/2012 8:38:44	660192	250273	beamData	Open	+	4	10x10	0.82	2.95	430	30.5	966.3				-	air	
5/27/2012 8:53:25	660193		DhcNoise	Open	+		10x10	0.3	2.95		30.4	966.3				-	air	
5/27/2012 10:59:24	660194	190645	beamData	Open	+	6	10x10	0.31	2.96	330	30.5	965.6				-	air	
5/27/2012 13:03:27	660195	182190	beamData	Open	+	6	10x10	0.31	2.96	330	30.5	964.7				-	air	
5/27/2012 15:13:48	660196	191489	beamData	Open	+	6	10x10	0.31	2.97	320	30.4	963.7				-	air	
5/27/2012 16:10:51	660197	91314	beamData	Open	+	6	10x10	0.31	2.97	320	30.3	963				-	air	
5/27/2012 16:13:35	660198		DhcNoise	Open	-		10x10	0.31	2.97		30.3	962.9				-	air	
5/27/2012 17:22:08	660199		Other	Open	-		10x10				30.5	962.7				-	air	
5/27/2012 18:32:27	660200		DhcNoise	Closed	+		10x10				30.6	962.5				-	air	
6/1/2012 10:01:10	660203	23721	beamData	Closed	+	180	10x10	1.06	1.05	1500	-	-	test run for wire chambers and Cherenkovs, calorimeter not yet connected	bad run		-	air	air
6/4/2012 19:04:24	660204		DhcNoise	Open	-		10x10				26.4	962.3				-	air	air
6/4/2012 21:31:44	660205		DhcNoise	Open	-		10x10				26.4	962.3	test run for wire chambers and Cherenkovs, calorimeter not yet connected	bad run		-	air	air
6/4/2012 21:38:39	660206	78238	beamData	Open	-	30	10x10			3000	26.4	962.3	Still trying to test wire chambers	bad run		secondary	air	air
6/4/2012 21:40:16	660207	1635	beamData	Open	-	30	10x10				26.4	962.3		bad run		secondary	18 mm Pb	air
6/4/2012 21:41:59	660208	697	beamData	Open	-	30	10x10				26.4	962.3	Trying to tune beam	bad run		secondary	18 mm Pb	air
6/4/2012 21:45:05	660209	4771	beamData	Open	-	30	10x10			250	26.4	962.3	Tuning the beam	bad run		secondary	18 mm Pb	air
6/4/2012 21:53:07	660210	41587	beamData	Open	-	30	10x10	0.3	0.3	940	29.7	962.3	First attempt to run at 100 Hz		H8C 870	secondary	18 mm Pb	air
6/4/2012 23:56:29	660211	79246	beamData	Open	-	30	10x10	0.3	0.3	550	31	963.7			H8C 870	secondary	18 mm Pb	air
6/4/2012 23:57:28	660212	2324	beamData	Open	-	30	10x10	0.3	0.3	550	31	963.7	sh		H8C 870	-	18 mm Pb	air
6/5/2012 2:31:53	660213	92365	beamData	Open	-	30	10x10	0.3	0.3	580	31.9	963.4	T3B is not running with DHCAL for tonight, started with this run		H8C 870	secondary	18 mm Pb	air
6/5/2012 4:36:09	660214	91969	beamData	Open	-	30	10x10	0.3	0.3	560	32.3	963.2	no T3B, stack temperature is slowly rising		H8C 870	secondary	18 mm Pb	air
6/5/2012 7:24:50	660215	108537	beamData	Open	-	30	10x10	0.3	0.3	520	32.5	963.1	layer 11 recovered in the 2nd half of this run, but a few others are still not good (26,31?,37)		H8C 870	secondary	18 mm Pb	air
6/5/2012 10:03:13	660216	77488	beamData	Open	-	30	10x10	0.3	0.3	550	31.1	963.3			H8C 870	secondary	18 mm Pb	air
6/5/2012 11:53:38	660217	100616	beamData	Open	-	30	10x10	0.31	0.3	900	30.4	963.3			H8C 870	secondary	18 mm Pb	air
6/5/2012 12:49:10	660218	0	beamData	Closed	-	30	10x10				999	963		bad run		-	air	air
6/5/2012 12:58:16	660219		DhcNoise	Closed	-		NULL				999	962.7				-	air	air
6/5/2012 14:28:02	660220	50847	beamData	Open	-	30	10x10	0.3	0.3	1700	29.95	962.2	scintillators and wire chambers left in beam		865	secondary	air	6 mm Pb
6/5/2012 18:10:57	660221	47406	beamData	Open	-	30	10x10	0.3	0.3	2000	29.9	962.2			865	secondary	air	6 mm Pb
6/5/2012 18:15:37	660222	45202	beamData	Open	-		10x10				29.9	962.2	No beam	bad run	865	secondary	air	6 mm Pb
6/5/2012 20:50:44	660223	151466	beamData	Open	-	40	10x10	1	1	950	29.8	959.9			872	secondary	18 mm Pb	air
6/5/2012 23:24:38	660224	174337	beamData	Open	-	40	10x10	0.99	1	900	29.8	959.9			872	secondary	18 mm Pb	air
6/5/2012 23:29:11	660225		DhcNoise	Open	-	40	10x10				29.8	959.9			872	secondary	18 mm Pb	air
6/6/2012 1:58:45	660226	237364	beamData	Open	-	50	10x10	0.996	1.005	1600	29.7	959.3	1st 50gev run, higher rate, seems this rate is OK		H8C 871	secondary	18 mm Pb	air
6/6/2012 4:16:07	660227	128610	beamData	Open	-	50	10x10	0.9957	1.0054	1600	29.6	957.9			H8C 871	secondary	18 mm Pb	air
6/6/2012 6:16:26	660228	252228	beamData	Open	-	50	10x10	0.9957	1.0054	1600	29.58	957.7			H8C 871	secondary	18 mm Pb	air
6/6/2012 8:25:34	660229	267999	beamData	Open	-	50	10x10	1	1	1600	29.55	959.1			871	secondary	18 mm Pb	air
6/7/2012 10:16:10	660231		DhcNoise	Open	-		10x10				29.5	954.6			na	secondary	air	air
6/7/2012 9:47:22	660232	15476	beamData	Open	-	120	10x10	0.99	1.01	250	29.4	955			868	secondary	18 mm Pb	air
6/7/2012 11:06:31	660233	70053	beamData	Open	-	60	10x10	1	1.01	1200	29.3	954.2	The run was stopped because we have no beam. Cooling magnet problem.		874	secondary	18 mm Pb	air
6/7/2012 12:36:32	660234	133288	beamData	Open	-	60	10x10	1	1.01	1300	29.3	953.2	Run was stopped because the rate was too high		874	secondary	18 mm Pb	air
6/7/2012 14:50:22	660235	159499	beamData	Open	-	60	10x10	1	1.01	1000	29.5	951.6			874	secondary	18 mm Pb	air
6/7/2012 17:07:08	660236	134899	beamData	Open	-	60	10x10	1	1.01	900	29.5	950.6	run stopped. no beam from linac		874	secondary	18 mm Pb	air
6/7/2012 20:40:19	660237	24861	beamData	Open	-	120	10x10	1	1	500	29.51	953.8	short because beam loss		863	secondary	18 mm Pb	air
6/7/2012 23:09:40	660238	63799	beamData	Open	-	120	10x10	1	1	400	29.449	955.4			863	secondary	18 mm Pb	air
6/8/2012 1:15:32	660239	72156	beamData	Open	-	120	10x10	0.996	1.005	460	29.4	956.3			H8C 863	secondary	18 mm Pb	air
6/8/2012 3:28:25	660240	69434	beamData	Open	-	120	10x10	0.9957	1.0086	460	29.5	956.9			H8C 863	secondary	18 mm Pb	air
6/8/2012 5:34:21	660241	63607	beamData	Open	-	120	10x10	0.993	1.005	400	29.5	956.5			H8C 863	secondary	18 mm Pb	air
6/8/2012 7:47:47	660242	60165	beamData	Open	-	120	10x10	0.9925	1.0054	400	29.6	957.1	event/spill fluctuate from 200 to 600		H8C 863	secondary	18 mm Pb	air
6/8/2012 8:30:03	660243	18468	beamData	Open	-	120	10x10	0.9925	1.0054	400	29.5	957.4	stopped to do noise run, and decide HV changes		H8C 863	secondary	18 mm Pb	air
6/8/2012 8:31:35	660244		DhcNoise	Open	-	120	10x10			400	29.5	957.4			H8C 863	secondary	18 mm Pb	air
6/8/2012 14:37:05	660245	23059	beamData	Open	-	120	10x10	1	1	500	0	0	test run?	bad run	0	secondary	18 mm Pb	air
6/8/2012 14:38:01	660246		DhcNoise	Open	-		10x10				0	0			0	secondary	18 mm Pb	air
6/8/2012 14:38:48	660247		DhcNoise	Open	-		10x10				0	0			0	secondary	18 mm Pb	air
6/8/2012 13:40:19	660248	84596	beamData	Open	-	120	10x10	1	1.01	500	29.5	960.2			863	secondary	18 mm Pb	air
6/8/2012 14:45:06	660249	32903	beamData	Open	-	120	10x10	1	1.01	400	29.5	960.7			863	secondary	18 mm Pb	air
6/8/2012 16:09:42	660250	0	beamData	Open	-	80	10x10	1	1.01	500	29.5	960.9	Mostly muons: tertiary beams don't work...	bad run	880	tertiary	18 mm Pb	40 cm Cu
6/8/2012 17:09:22	660251	45759	beamData	Open	-	80	10x10	1	1.01	700	29.53	961	50% muons, will increase electronic rate in forthcoming run		879	secondary	18 mm Pb	air
6/8/2012 17:30:15	660252	10796	beamData	Open	-	80	10x10	1	1.01	1000	29.47	961	run stopped because of beam lost		879	secondary	18 mm Pb	air
6/8/2012 22:24:45	660253	137408	beamData	Open	-	80	10x10	1	1.01	1000	29.48	962.1			879	secondary	18 mm Pb	air
6/9/2012 0:36:33	660254	145511	beamData	Open	-	80	10x10	1	1.01	900	29.7	962.7			879	secondary	18 mm Pb	air
6/9/2012 0:47:02	660255	4091	beamData	Open	-	100	10x10	1	1	650	29.7	962.7	test run to prepare the 100 GeV file	bad run	882	secondary	18 mm Pb	air
6/9/2012 1:07:38	660256	0	DhcNoise	Closed	-	0	10x10				29.5	962.8			879	secondary	18 mm Pb	air
6/9/2012 3:08:48	660257	127545	beamData	Open	-	80	10x10	1	1.01	800	29.5	962.7			879	secondary	18 mm Pb	air
6/9/2012 5:21:26	660258	125268	beamData	Open	-	80	10x10	1	1.01	800	29.5	962.8	No beam. Run stopped.		879	secondary	18 mm Pb	air
6/9/2012 7:36:18	660259	129981	beamData	Open	-	80	10x10	1	1.01	800	29.5	963.4			879	secondary	18 mm Pb	air
6/9/2012 10:32:03	660260	130377	beamData	Open	-	100	10x10	1	1	670	29,5	962.8			882	secondary	18 mm Pb	air
6/9/2012 13:10:01	660261	131280	beamData	Open	-	100	10x10	0.9957	1.0054	730	29.53	961.8			H8C 882	secondary	18 mm Pb	air
6/9/2012 15:44:37	660262	130796	beamData	Open	-	100	10x10	1	1	705	29.6	961			882	secondary	18 mm Pb	air
6/9/2012 18:28:39	660263	133870	beamData	Open	-	100	10x10	1	1	730	29.7	960.7	run stopped during a spill		882	secondary	18 mm Pb	air
6/9/2012 18:33:24	660264		DhcNoise	Open	-		10x10				29.6	960.7			-	secondary	air	air
6/9/2012 21:04:09	660265	80703	beamData	Open	-	20	10x10	1	1	520	29.7	961	beamline scintillators in		877	tertiary	air	6 mm Pb
6/9/2012 21:06:24	660266		DhcNoise	Open	-		10x10				29.69	960.8			877	tertiary	air	6 mm Pb
6/9/2012 22:16:14	660267	43016	beamData	Open	-	20	10x10	1	1	520	29.69	961	beamline scintillators in		877	tertiary	air	6 mm Pb
6/9/2012 23:16:28	660268	16803	beamData	Open	-	20	10x10	0.65	0.65	260	29.7	961	All 20 GeV runs until now had the scintillators in		877	tertiary	air	6 mm Pb
6/10/2012 1:35:05	660269	44216	beamData	Open	-	20	10x10	0.65	0.64	250	29.7	961.1			877	tertiary	air	6 mm Pb
6/10/2012 1:35:55	660270		DhcNoise	Open	-		10x10				29.7	961.1			877	tertiary	air	6 mm Pb
6/10/2012 3:41:40	660271	42022	beamData	Open	-	20	10x10	0.65	0.64	250	29.7	960.9			877	tertiary	air	6 mm Pb
6/10/2012 3:46:22	660272		DhcNoise	Open	-		10x10				29.7	960.8			877	tertiary	air	6 mm Pb
6/10/2012 5:53:41	660273	42066	beamData	Open	-	20	10x10	0.65	0.64	250	29.7	960.9			877	tertiary	air	6 mm Pb
6/10/2012 6:02:24	660274		DhcNoise	Open	-		10x10				29.7	960.9			877	tertiary	air	6 mm Pb
6/10/2012 8:15:00	660275	43996	beamData	Open	-	20	10x10	0.65	0.64	250	29.6	960.4			877	tertiary	air	6 mm Pb
6/10/2012 8:15:46	660276		DhcNoise	Open	-		10x10				29.6	960.5			877	tertiary	air	6 mm Pb
6/10/2012 10:30:13	660277	41336	beamData	Open	-	20	10x10	0.6483	0.6382	285	29.6	959			H8C 877	secondary	18 mm Pb	air
6/10/2012 10:32:11	660278		DhcNoise	Open	-	20	10x10	0.6483	0.6413	285	29.6	959			H8C 877	secondary	18 mm Pb	air
6/10/2012 12:34:57	660279	42710	beamData	Open	-	20	10x10	0.6483	0.6382	276	29.7	957.3			H8C 877	secondary	air	air
6/10/2012 12:36:03	660280		DhcNoise	Open	-	20	10x10	0.6483	0.6382	270	29.7	957.3			H8C 877	secondary	air	air
6/10/2012 14:39:21	660281	42253	beamData	Open	-	20	10x10	0.6483	0.6413	277	29.7	956.2			H8C 877	tertiary	air	6 mm Pb
6/10/2012 14:40:19	660282		DhcNoise	Open	-	20	10x10	0.6483	0.6413	277	29.7	956.2			H8C 877	tertiary	air	6 mm Pb
6/10/2012 16:47:23	660283	40571	beamData	Open	-	20	10x10	0.6483	0.6414	280	29.75	955.6			H8C 877	tertiary	air	6 mm Pb
6/10/2012 17:00:51	660284		DhcNoise	Open	-	30	10x10	0.6483	0.6414	280	29.74	955.7			H8C 877	tertiary	air	6 mm Pb
6/10/2012 19:03:02	660285	36472	beamData	Open	-	30	10x10	0.2992	0.3036	250	29.7	954.4			H8C 865	tertiary	air	6 mm Pb
6/10/2012 19:05:25	660286		DhcNoise	Open	-		10x10				29.7	954.4			H8C 865	tertiary	air	6 mm Pb
6/10/2012 21:14:38	660287	38696	beamData	Open	-	30	10x10	0.2992	0.3036	220	29.68	953.7			H8C 865	tertiary	air	6 mm Pb
6/10/2012 21:16:24	660288		DhcNoise	Open	-		NULL				29.65	953.7			H8C 865	tertiary	air	6 mm Pb
6/10/2012 23:26:53	660289	37576	beamData	Open	-	30	10x10	0.2992	0.3036	220	29.61	953.7			H8C 865	tertiary	air	6 mm Pb
6/10/2012 23:28:30	660290		DhcNoise	Open	-		NULL				29.61	953.8			H8C 865	tertiary	air	6 mm Pb
6/11/2012 0:41:25	660291	18820	beamData	Open	-	30	10x10	0.3	0.3	240	29.6	954.1			865	tertiary	air	6 mm Pb
6/11/2012 2:50:43	660292	36293	beamData	Open	-	30	10x10	0.3	0.3	265	29.5	955			865	tertiary	air	6 mm Pb
6/11/2012 2:51:45	660293		DhcNoise	Open	-		10x10				29.5	955.1			H8C 865	tertiary	air	6 mm Pb
6/11/2012 5:04:34	660294	37155	beamData	Open	-	30	10x10	0.3	0.3	250	29.5	955.1			H8C 865	tertiary	air	6 mm Pb
6/11/2012 5:05:13	660295		DhcNoise	Open	-		10x10				29.5	955.2			H8C 865	tertiary	air	6 mm Pb
6/11/2012 7:13:31	660296	35464	beamData	Open	-	30	10x10	0.3	0.3	220	29.5	954.9			H8C 865	tertiary	air	6 mm Pb
6/11/2012 7:16:46	660297		DhcNoise	Open	-		10x10				29.5	954.8			H8C 865	tertiary	air	6 mm Pb
6/11/2012 9:42:20	660298	36616	beamData	Open	-	30	10x10	0.2992	0.3036	290	29.5	954.3			H8C 865	secondary	air	6 mm Pb
6/11/2012 9:45:37	660299		DhcNoise	Open	-	30	10x10	0.2992	0.3036	290	29.5	954.2			H8C 865	secondary	air	6 mm Pb
6/11/2012 10:40:28	660300	6691	beamData	Open	-	30	10x10	0.3	0.3	230	29.5	954	Run stopped. No beam.		865	tertiary	air	6 mm Pb
6/11/2012 13:36:42	660301	28695	beamData	Open	-	30	10x10	0.3	0.3	200-230	29.5	953.2			H8C 865	tertiary	air	6 mm Pb
6/11/2012 13:38:26	660302		DhcNoise	Open	-		10x10				29.5	953.2			H8C 865	tertiary	air	6 mm Pb
6/11/2012 16:05:10	660303	83359	beamData	Open	-	40	10x10	1	1	800	29.5	952			872	secondary	18 mm Pb	air
6/11/2012 18:26:54	660304	101574	beamData	Open	-	40	10x10	1	1	800	29.6	951.9			872	secondary	18 mm Pb	air
6/11/2012 20:50:23	660305	39857	beamData	Open	-	40	10x10	1	1	270	29.58	951.3			878	tertiary	air	6 mm Pb
6/11/2012 20:57:06	660306		DhcNoise	Open	-		10x10				29.58	951.3			878	tertiary	air	6 mm Pb
6/11/2012 23:01:31	660307	40327	beamData	Open	-	40	10x10	1	1	280	29.563	952.4			878	tertiary	air	6 mm Pb
6/11/2012 23:04:10	660308		DhcNoise	Open	-	40	10x10				29.563	952.4			878	tertiary	air	6 mm Pb
6/12/2012 1:14:26	660309	41310	beamData	Open	-	40	10x10	1	1	240	29.5	951.9			878	tertiary	air	6 mm Pb
6/12/2012 1:15:37	660310		DhcNoise	Open	-		10x10				29.5	951.9			878	tertiary	air	6 mm Pb
6/12/2012 3:22:59	660311	38745	beamData	Open	-	40	10x10	1	1	250	29.5	951			878	tertiary	air	6 mm Pb
6/12/2012 3:23:50	660312		DhcNoise	Open	-	40	10x10				29.5	951			878	tertiary	air	6 mm Pb
6/12/2012 5:33:21	660313	32431	beamData	Open	-	40	10x10	1	1	250	29.5	950.8			878	tertiary	air	6 mm Pb
6/12/2012 5:34:02	660314		DhcNoise	Open	-		10x10				29.5	950.8			878	tertiary	air	6 mm Pb
6/12/2012 7:43:25	660315	1556	Other	Open	-	0	10x10	1	1	0	29.5	951.5	no beam	bad run	-	tertiary	air	6 mm Pb
6/12/2012 7:46:05	660316		DhcNoise	Open	-		10x10				29.5	951.5			878	tertiary	air	6 mm Pb
6/12/2012 8:09:42	660317	803	beamData	Open	-		10x10	1	1		29.5	951.8	no beam	bad run	878	tertiary	air	6 mm Pb
6/12/2012 9:25:45	660318	19991	beamData	Open	-	40	10x10	1	1	250	29.5	952.4			878	tertiary	air	6 mm Pb
6/12/2012 12:10:25	660319	43303	beamData	Open	-	40	10x10	1	1	250	29.5	953.3			878	tertiary	air	6 mm Pb
6/12/2012 15:06:49	660320	47056	beamData	Open	-	40	10x10	1	1	250	29.4	954.8			878	tertiary	air	6 mm Pb
6/12/2012 17:04:59	660321	100568	beamData	Open	-	20	10x10	0.65	0.65	1800	29.4	956.6	too high rate, will lower by factor 2.		820	secondary	18 mm Pb	air
6/12/2012 21:11:28	660322	324000	beamData	Open	-	20	10x10	0.65	0.65	1200	29.3	958.3			820	secondary	18 mm Pb	air
6/12/2012 21:29:16	660323		DhcNoise	Open	-		10x10				29.4	958.4			820	secondary	air	air
6/12/2012 23:38:49	660324	55800	beamData	Open	-	12	10x10	0.65	0.65	330	29.4	959.5	corrected entries, after nightshift (beam type, absorber and target)		821	tertiary	air	6 mm Pb
6/12/2012 23:41:48	660325		DhcNoise	Open	-		10x10				29.4	959.6			821	tertiary	air	6 mm Pb
6/13/2012 1:53:44	660326	53032	beamData	Open	-	12	10x10	0.65	1	350	29.4	959.9			821	tertiary	air	6 mm Pb
6/13/2012 1:56:14	660327		DhcNoise	Open	-		10x10				29.4	960			821	tertiary	air	6 mm Pb
6/13/2012 4:00:31	660328	53662	beamData	Open	-	12	10x10	0.65	1	350	29.38	960			821	tertiary	air	6 mm Pb
6/13/2012 4:01:13	660329		DhcNoise	Open	-		10x10				29.37	960			821	tertiary	air	6 mm Pb
6/13/2012 6:03:19	660330	52275	beamData	Open	-	12	10x10	0.65	1	350	29.37	960			821	tertiary	air	6 mm Pb
6/13/2012 6:04:15	660331		DhcNoise	Open	-		10x10				29.37	960.4			821	tertiary	air	6 mm Pb
6/13/2012 7:30:59	660332	28946	beamData	Open	-	12	10x10	0.65	1	350	29.4	960.8	 no beam at end of run		821	tertiary	air	6 mm Pb
6/13/2012 8:08:12	660333		DhcNoise	Open	-		10x10				29.41	961.3			821	tertiary	air	6 mm Pb
6/13/2012 10:33:00	660334	49094	beamData	Open	-	12	10x10	0.65	1	300	29.4	962.3			821	tertiary	air	6 mm Pb
6/13/2012 10:35:19	660335		DhcNoise	Open	-		10x10				29.4	962.3			821	tertiary	air	air
6/13/2012 10:56:38	660336	7857	beamData	Open	-	12	10x10	0.65	0.65	300	29.4	962.8			821	tertiary	air	6 mm Pb
6/13/2012 11:00:18	660337		DhcNoise	Open	-		10x10	0.65	0.65		29.4	962.8			821	secondary	air	air
6/13/2012 12:02:43	660338	8540	beamData	Open	-	10	10x10				0	0	beam tuning test	bad run	823	secondary	air	air
6/13/2012 14:39:27	660339	269590	beamData	Open	-	15	10x10	1	1	1350	29.4	963.8			825	secondary	18 mm Pb	air
6/13/2012 14:40:17	660340		DhcNoise	Open	-	10	10x10				29.4	963.9			825	secondary	18 mm Pb	air
6/13/2012 15:22:34	660341	36145	beamData	Open	-	15	10x10	1	1	1200	29.4	963.8			825	secondary	18 mm Pb	air
6/13/2012 18:07:25	660342	11225	beamData	Open	+	180	10x10	1	1	200	29.3	964.1			31	secondary	18 mm Pb	air
6/13/2012 20:25:25	660343	34277	beamData	Open	+	180	10x10	0.35	0.35	180	29.4	964.3			31	secondary	18 mm Pb	air
6/13/2012 22:42:36	660345	32159	beamData	Open	+	180	10x10	0.35	0.35	182	29.4	965			31	secondary	18 mm Pb	air
6/13/2012 22:45:00	660346		DhcNoise	Open	+	180	10x10				29.4	965			31	secondary	18 mm Pb	air
6/13/2012 23:50:20	660347	17609	beamData	Open	+	180	10x10	0.35	0.35	240	29.4	965.2			31	secondary	18 mm Pb	air
6/14/2012 1:47:56	660348	38623	beamData	Open	+	180	10x10	0.35	0.35	255	29.35	965	layer 12 became less efficient during run		31	secondary	18 mm Pb	air
6/14/2012 1:53:18	660349		DhcNoise	Open	+	180	10x10				29.36	965			31	secondary	18 mm Pb	air
6/14/2012 2:14:59	660350	282	beamData	Open	+	180	10x10	0.35	0.35	280	29.4	964.8	only 1 spill, stopped because of problem with T3B	bad run	31	secondary	18 mm Pb	air
6/14/2012 4:14:31	660351	41154	beamData	Open	+	180	10x10	0.35	0.35	265	29.38	964.4			31	secondary	18 mm Pb	air
6/14/2012 6:21:29	660352	41863	beamData	Open	+	180	10x10	0.35	0.35	300	29.47	964.7	layer 41 becomes slightly less efficient during run		31	secondary	18 mm Pb	air
6/14/2012 6:22:41	660353		DhcNoise	Open	+		10x10				29.47	964.7			31	secondary	18 mm Pb	air
6/14/2012 8:04:16	660354	35513	beamData	Open	+	180	10x10	0.35	0.35	320	29.51	964.6	layers 12 and 41 show slightly fluctuating efficiencies during run		31	secondary	18 mm Pb	air
6/14/2012 8:10:17	660355		DhcNoise	Open	+		10x10				29.5	964.8			31	secondary	air	air
6/14/2012 10:52:31	660356	359922	beamData	Closed	+	180	30x30	0.35	0.35	5000	29.5	964.4	muon run center pos 5		832	secondary	air+dump	air
6/14/2012 11:59:58	660357	184602	beamData	Closed	+	180	30x30	0.35	0.35	5000	29.5	964.5	muon run center pos 5		832	secondary	air+dump	air
6/14/2012 13:30:05	660358	268891	beamData	Closed	+	180	30x30	0.35	0.35	3000	29.5	963.9	muon run center left pos 4		832	secondary	air+dump	air
6/14/2012 14:41:52	660359	255560	beamData	Closed	+	180	30x30	0.35	0.35	3000	29.5	963.3	muon run center left pos 4		832	secondary	air+dump	air
6/14/2012 14:52:53	660360		DhcNoise	Closed	+		10x10				29.5	963.3			832	secondary	air+dump	air
6/14/2012 16:52:40	660361	362087	beamData	Closed	+	180	30x30	0.35	0.35	3300	29.5	962.2	muon run center right pos 6		832	secondary	air+dump	air
6/14/2012 17:06:11	660362	158316	beamData	Closed	+	180	30x30	0.35	0.35	5000	29.52	962.3	muon run center right pos 6		832	secondary	air+dump	air
6/14/2012 19:04:55	660363	263982	beamData	Closed	+	180	30x30	0.35	0.35	5000	29.6	961.9	muon run lower right pos 3		832	secondary	air+dump	air
6/14/2012 19:50:27	660364	261799	beamData	Closed	+	180	30x30	0.35	0.35	5000	29.5	962.3	muon run lower right pos 3		832	secondary	air+dump	air
6/14/2012 20:42:14	660365	262800	beamData	Closed	+	180	30x30	0.35	0.35	5500	29.5	962.6	muon run lower middle pos 2		832	secondary	air+dump	air
6/14/2012 21:23:34	660366	263626	beamData	Closed	+	180	30x30	0.35	0.35	5800	29.5	962.5	muon run lower middle pos 2		832	secondary	air+dump	air
6/14/2012 22:19:15	660367	260168	beamData	Closed	+	180	30x30	0.35	0.35	5300	29.6	963.3	muon run lower left pos 1		832	secondary	air+dump	air
6/14/2012 23:09:24	660368	262888	beamData	Closed	+	180	30x30	0.35	0.35	4300	29.5	963.4	muon run lower left pos 1		832	secondary	air+dump	air
6/14/2012 23:39:33	660369	38966	beamData	Open	+	180	10x10	0.35	0.35	??	29.5	962.3	run taken during change of beam conditions	bad run	0	secondary	air	air
6/14/2012 23:40:29	660370		DhcNoise	Open	+		10x10				29.5	963.8			31	secondary	air	air
6/15/2012 1:39:22	660371	37765	beamData	Open	+	180	10x10	0.35	0.35	230	29.43	964.3			31	secondary	air	air
6/15/2012 3:39:08	660372	37708	beamData	Open	+	180	10x10	0.35	0.35	250	29.41	964.2			31	secondary	air	air
6/15/2012 5:44:10	660373	40210	beamData	Open	+	180	10x10	0.35	0.35	250	29.36	964			31	secondary	air	air
6/15/2012 7:49:03	660374	37716	beamData	Open	+	180	10x10	0.35	0.35	250	29.33	964.5			31	secondary	air	air
6/15/2012 7:51:43	660375		DhcNoise	Open	+		10x10				29.32	964.5			31	secondary	air	air
6/15/2012 8:33:23	660376	11462	beamData	Open	+	180	10x10	0.35	0.35	250	29.31	964.5			31	secondary	air	air
6/15/2012 12:02:03	660377	17448	beamData	Closed	+	180	30x30			200	29.3	964	running behind clicpix		111	secondary	air+dump	air
6/15/2012 13:21:49	660378	293025	beamData	Closed	+	180	30x30			1600	29.3	964	muon run pos 9		832	secondary	air+dump	air
6/15/2012 15:09:16	660379	212586	beamData	Closed	+	180	30x30			2400	29.4	963.7	muon run pos 9		832	secondary	air+dump	air
6/15/2012 15:37:22	660380	86616	beamData	Closed	+	180	30x30	0.35	0.35	5000	29.3	963.6	muon run upper middle pos 8		832	secondary	air+dump	air
6/15/2012 19:38:02	660381	571802	beamData	Closed	+	180	30x30			5000	29.4	963.4	top-middle: position 8		832	secondary	air+dump	air
6/15/2012 21:41:21	660382	6787	beamData	Open	+	150	10x10	0.5	0.5	250	29.3	964.2	Beam tuning	bad run	834	tertiary	air	6 mm Pb
6/15/2012 21:43:04	660383	1759	beamData	Open	+	150	10x10	0.5	0.5	250	29.3	964.3	Beam tuning	bad run	833	tertiary	air	6 mm Pb
6/15/2012 21:44:53	660384	9848	beamData	Open	+	150	10x10	0.5	0.5	2500	29.3	964.3	Beam tuning	bad run	833	tertiary	air	6 mm Pb
6/15/2012 21:45:59	660385	56218	beamData	Open	+	150	10x10	0.5	0.5	2500	29.3	964.3	Mostly muons	bad run	833	tertiary	air	6 mm Pb
6/15/2012 23:17:04	660386	39027	beamData	Open	+	150	10x10	0.5	0.5	240	29.3	965			835	secondary	18 mm Pb	air
6/16/2012 1:23:21	660387	37280	beamData	Open	+	150	10x10	0.5	0.5	250	29.27	965.2			835	secondary	18 mm Pb	air
6/16/2012 1:47:09	660388		DhcNoise	Open	+		10x10				29.3	965.4			835	secondary	air	air
6/16/2012 3:58:37	660389	46243	beamData	Open	+	150	10x10	0.5	0.5	300	29.37	965.5			835	secondary	air	air
6/16/2012 5:59:26	660390	39852	beamData	Open	+	150	10x10	0.5	0.5	240	29.34	965.4			835	secondary	18 mm Pb	air
6/16/2012 7:16:01	660391	24237	beamData	Open	+	150	10x10	0.5	0.5	240	29.34	965.2	Stopped run since access required for T3B		835	secondary	18 mm Pb	air
6/16/2012 8:58:10	660392	26753	beamData	Open	+	150	10x10	0.5	0.5	240	29.4	965.4			835	secondary	18 mm Pb	air
6/16/2012 11:32:22	660393	386363	beamData	Closed	+	180	30x30	0.5	0.5	2600	29.6	964.5			H8C 832	secondary	air+dump	air
6/16/2012 12:37:09	660394	188198	beamData	Closed	+	180	30x30	0.5	0.5	1500	29.6	964.2			H8C 832	secondary	air+dump	air
6/16/2012 15:18:13	660395	40966	beamData	Open	+	180	10x10	0.35	0.35	250	29.3	963.5			831	secondary	18 mm Pb	air
6/16/2012 16:48:35	660396	10528	beamData	Open	+	180	10x10	0.35	0.35	245	29.4	963.4			831	secondary	18 mm Pb	air
6/16/2012 17:18:59	660397		DhcNoise	Open	+		NULL	0.35	0.35		29.4	963.7			831	secondary	air	air
6/16/2012 22:46:55	660398	46621	beamData	Open	+	180	10x10	0.35	0.35		29.4	966.2			831	secondary	air	air
6/16/2012 22:43:51	660399	41083	beamData	Open	+	150	10x10	0.5	0.5	237	29.4	966.1			835	secondary	air	air
6/17/2012 0:50:45	660400	39687	beamData	Open	+	150	10x10	0.4984	0.4986	250	29.35	966.7			835	secondary	air	air
6/17/2012 3:03:30	660401	38061	beamData	Open	+	150	10x10	0.4984	0.4986	250	29.39	966.5			835	secondary	air	air
6/17/2012 5:13:55	660402	25715	beamData	Open	+	150	10x10	0.5	0.5	250	29.32	966.8	Stopped run because no beam		835	secondary	air	air
6/17/2012 7:32:12	660403	39726	beamData	Open	+	150	10x10	0.4984	0.4986	260	29.29	967.7			835	secondary	air	air
6/17/2012 9:36:50	660404	38250	beamData	Open	+	150	10x10	0.5	0.5	250	29.2	968.2			835	secondary	18 mm Pb	air
6/17/2012 11:49:25	660405	40034	beamData	Open	+	150	10x10	0.5	0.5	250	29.3	967.6			835	secondary	18 mm Pb	air
6/17/2012 14:09:02	660406	44455	beamData	Open	+	150	10x10	0.5	0.5	250	29.2	966.4			835	secondary	18 mm Pb	air
6/17/2012 15:39:31	660407	10125	beamData	Open	+	60	10x10	0.5	0.5	130	29.3	965.5	pixel sent up is in the beam (quite some material), so might not be a useful run.  this setup is out of the beam for next run		837	tertiary	air	6 mm Pb
6/17/2012 16:21:56	660408	23384	beamData	Open	+	60	10x10	0.5	0.5	200	29.2	965.1	scintillators in the beam	bad run	837	tertiary	air	6 mm Pb
6/17/2012 18:06:56	660409	7779	beamData	Open	+		10x10				29.2	964.2	this run started with +60 'positron', but then started beam tuning soon after for later T3B run	bad run	(n/a)	secondary	air	air
6/17/2012 18:09:24	660410		DhcNoise	Open	+		10x10				29.1	964.2	this is a noise run taken as a reference for turning off HV on part of the DHCAL/TAIL catcher		(n/a)	secondary	air	air
6/17/2012 18:10:35	660411		DhcNoise	Open	+		10x10				29.1	964.2	this is the noise run AFTER turning off part of the HV		(n/a)	secondary	air	air
6/17/2012 18:14:05	660412	49752	beamData	Open	+	180	10x10	0.5	0.5	10000	29.1	964.1	HIGH RATE this is 1st run together with T3B at high rate, a little worried about data rate, will turn off more layers after this run		840	secondary	air	air
6/17/2012 18:16:03	660413		DhcNoise	Open	+		10x10				29.1	964.2	this is a noise run AFTER turning off HV on more layers		(n/a)	secondary	air	air
6/17/2012 19:02:06	660414	48687	beamData	Open	+	80	10x10			4000	29.2	964.1	HIGH RATE sync with T3B/fastRPC. Just few layers have HV turned on. Test of the 80GeV file settings		839	secondary	18 mm Pb	air
6/17/2012 19:41:58	660415	411892	beamData	Open	+	180	10x10	0.35	0.35	9000	29.2	963.8	HIGH RATE		840	secondary	air	air
6/17/2012 21:16:22	660416	141118	beamData	Open	+	180	10x10	0.35	0.35	6000	29.3	964	HIGH RATE Run stopped to start in sync with fastRPC		840	secondary	air	air
6/17/2012 22:12:36	660417	515078	beamData	Open	+	180	10x10	0.35	0.35	9500	29.2	964.1	HIGH RATE		840	secondary	air	air
6/17/2012 23:25:33	660418	534215	beamData	Open	+	180	10x10	0.35	0.35	9000	29.3	964.3	HIGH RATE		840	secondary	air	air
6/18/2012 1:38:48	660419	515418	beamData	Open	+	80	10x10	1.8	1.8	3700	29.27	963.7	HIGH RATE		839	secondary	18 mm Pb	air
6/18/2012 3:46:53	660420	531035	beamData	Open	+	80	10x10	1.8	1.8	4000	32.58	962.9	HIGH RATE High temperature towards the end of the run since AC was off		839	secondary	18 mm Pb	air
6/18/2012 7:03:39	660421	554366	beamData	Open	+	80	10x10	1.8	1.8	4000	30.4	963	HIGH RATETemperature slowling dropping over the run		839	secondary	18 mm Pb	air
6/18/2012 9:13:59	660422	373034	beamData	Open	+	80	10x10	1.8	1.8	3300	29.9	964.1	HIGH RATE		839	secondary	18 mm Pb	air
7/30/2012 14:14:29	660423	0	beamData	Open	-	300	10x10	0.15	0.16		999	999	test	bad run	842	secondary	air	air
7/30/2012 14:15:07	660424	0	beamData	Open	-	300	10x10	0.15	0.16		999	999	test	bad run	842	secondary	air	air
7/30/2012 14:15:50	660425	0	beamData	Open	-	300	10x10	0.15	0.16		999	999	test	bad run	842	secondary	air	air
7/30/2012 14:16:21	660426	0	beamData	Open	-	300	10x10	0.15	0.16		999	999			842	secondary	air	air
7/30/2012 14:21:17	660427	14417	beamData	Open	-	300	10x10	0.15	0.16	230	30.1	964.9	still several layers with low efficiency		842	secondary	18 mm Pb	air
7/30/2012 17:27:34	660428	0	DhcNoise	Open	-	300	10x10	0.15	0.16		30.5	964.4	too many low efficiencies		842	secondary	18 mm Pb	air
7/30/2012 17:28:16	660429	0	DhcNoise	Open	-	300	10x10	0.15	0.16		30.5	964.4			842	secondary	18 mm Pb	air
7/30/2012 17:28:56	660430	0	DhcNoise	Open	-	300	10x10	0.15	0.16		30.5	964.4			842	secondary	18 mm Pb	air
7/30/2012 17:29:25	660431	0	DhcNoise	Open	-	300	10x10	0.15	0.16		30.5	964.4			842	secondary	18 mm Pb	air
7/30/2012 17:29:57	660432	0	DhcNoise	Open	-	300	10x10	0.15	0.16		30.5	964.3			842	secondary	18 mm Pb	air
7/30/2012 17:30:50	660433	0	DhcNoise	Open	-	300	10x10	0.15	0.16		30.5	964.4			842	secondary	18 mm Pb	air
7/30/2012 17:33:17	660434	4935	beamData	Open	-	300	10x10	0.15	0.16	230	30.5	964.4	quad19 had tripped, lot of muons at end of run		842	secondary	18 mm Pb	air
7/30/2012 20:09:03	660435	30927	beamData	Open	-	300	10x10	0.15	0.16	170	30.5	963.9			842	secondary	18 mm Pb	air
7/30/2012 22:21:26	660436	37117	beamData	Open	-	300	10x10	0.15	0.16	223	30.6	964.9			842	secondary	18 mm Pb	air
7/30/2012 22:33:38	660437	0	DhcNoise	Open	-	300	10x10	0.15	0.16		30.5	964.9			842	secondary	18 mm Pb	air
7/31/2012 0:07:34	660438	25148	beamData	Open	-	300	10x10	0.15	0.16	220	30.6	965.2			801	secondary	18 mm Pb	air
7/31/2012 0:37:50	660439		DhcNoise	Closed	-	300	10x10			200	30.56	965.1			801	secondary	18 mm Pb	air
7/31/2012 2:35:45	660440	31188	beamData	Open	-	300	10x10	0.155	0.164	200	26.3	964.9			801	secondary	18 mm Pb	air
7/31/2012 4:07:18	660441		DhcNoise	Closed	-	300	10x10				30.25	965.2			801	secondary	18 mm Pb	air
7/31/2012 6:06:21	660442	27027	beamData	Open	-	300	10x10	0.15	0.16	160	25.4	965.7			801	secondary	18 mm Pb	air
7/31/2012 8:04:34	660443	28348	beamData	Open	-	300	10x10	0.155	0.164	181	25.3	966.3			801	secondary	18 mm Pb	air
7/31/2012 10:35:35	660444	30603	beamData	Open	-	300	10x10	0.15	0.16		29.92	966.3	no beam at the end of run		H8C.801	secondary	18 mm Pb	air
7/31/2012 12:44:47	660445	0	DhcNoise	Open	-	300	10x10	0.15	0.16		30	965.6			801	secondary	18 mm Pb	air
7/31/2012 12:45:26	660446	0	DhcNoise	Open	-	300	10x10	0.15	0.16		30	965.6			801	secondary	18 mm Pb	air
7/31/2012 14:12:12	660447	6000	beamData	Open	-	300 & 210	10x10	0.15	0.16	500	30.2	965.1	tuning beam files	bad run	802	tertiary	18 mm Pb	40 cm Cu
7/31/2012 14:15:50	660448	24431	beamData	Open	-	210	10x10	0.15	0.16	500	30.2	965.1	increased rate by opening all colimators during run		802	tertiary	18 mm Pb	40 cm Cu
7/31/2012 14:45:59	660449	25000	beamData	Open	-	210	10x10			550	30.16	964.8	lots of muons and few pions in this tertiary beam		H8C.802	tertiary	18 mm Pb	40 cm Cu
7/31/2012 14:59:25	660450	2000	beamData	Open	-	210	10x10			varying	30.2	962.3	unconventional secondary beam - test while tuning	bad run	H8C.803	secondary	18 mm Pb	air
7/31/2012 17:24:52	660451	31067	beamData	Open	-	210	10x10	0.15	0.16	220	30.1	963.4			803	secondary	18 mm Pb	air
7/31/2012 19:03:32	660452	27919	beamData	Open	-	210	10x10	0.15	0.16	220	30	962.7	layer 32 drops in efficieny. One FE board is lost?		803	secondary	18 mm Pb	air
7/31/2012 19:18:56	660453		DhcNoise	Open	-	210	10x10	0.15	0.16	220	30	962.6			803	secondary	18 mm Pb	air
7/31/2012 20:01:48	660454	15513	beamData	Open	-	210	10x10	0.15	0.16		30.1	962.7	last 2 min., layer 32 looses 1 FE board again.		803	secondary	18 mm Pb	air
7/31/2012 20:11:11	660455	0	DhcNoise	Open	-	210	10x10	0.15	0.16	220	30	962.7			803	secondary	18 mm Pb	air
7/31/2012 21:51:19	660456	34464	beamData	Open	-	210	10x10	0.15	0.16	250	30	963.1	layer 19 dropped 50% in number of hits in the last 10 minutes		803	secondary	18 mm Pb	air
7/31/2012 21:52:26	660457	0	DhcNoise	Open	-	210	10x10	0.15	0.16	250	30	963.1			803	secondary	18 mm Pb	air
8/1/2012 0:23:30	660458	42917	beamData	Open	-	210	10x10	0.15	0.16	250	29.96	963.3			803	secondary	18 mm Pb	air
8/1/2012 2:28:40	660459	39311	beamData	Open	-	210	10x10	0.15	0.16	200-250	29.9	963.2			803	secondary	18 mm Pb	air
8/1/2012 4:40:11	660460	42708	beamData	Open	-	210	10x10	0.15	0.16	200-250	29.8	963			H8C.803	secondary	18 mm Pb	air
8/1/2012 6:56:46	660461	46791	beamData	Open	-	210	10x10	0.15	0.16	250	29.8	962.9			801	secondary	18 mm Pb	air
8/1/2012 7:06:07	660462		DhcNoise	Open	-	210	10x10			250	29.8	962.6			801	secondary	18 mm Pb	air
8/1/2012 8:09:15	660463	20181	beamData	Open	-	210	10x10	0.15	0.16	250	29.8	962.8			801	secondary	18 mm Pb	air
8/2/2012 9:58:58	660464	40000	beamData	Closed	-	300	30x30	0.15	0.16	5000	29.95	962.4	center position 5; too high rate		804	secondary	18 mm Pb	air
8/2/2012 10:30:43	660465	180254	beamData	Closed	-	300	30x30	0.15	0.16	2700	29.97	962.3	center position 5		804	secondary	18 mm Pb	air
8/2/2012 10:32:03	660466		DhcNoise	Closed	-	300	30x30				29.96	962.3			804	secondary	18 mm Pb	air
8/2/2012 15:22:40	660467	112762	beamData	Closed	-	300	30x30	0.15	0.16	2700	29.99	961.1	lower middle position 2, stopped run early since the beam was steered a bit too high; lower rate in the beginning of the run		804	secondary	18 mm Pb	air
8/2/2012 15:38:02	660468	113097	beamData	Closed	-	300	30x30	0.15	0.16	2700	29.98	961.1	lower middle position 2		804	secondary	18 mm Pb	air
8/2/2012 17:45:22	660469	110481	beamData	Closed	-	300	30x30	0.15	0.16	2700	30	961	stopped run, as intensity shot up to 6000 /spill		804	secondary	18 mm Pb	air
8/2/2012 18:09:54	660470	147547	beamData	Closed	-	300	30x30	0.15	0.16	2500	30	961.1			804	secondary	18 mm Pb	air
8/2/2012 18:31:10	660471	0	DhcNoise	Closed	-	300	30x30	0.15	0.16	0	30	961			804	secondary	18 mm Pb	air
8/2/2012 19:57:06	660472	13306	beamData	Open	-	210 and 2400.155	10x10	0.155	0.166	variable	30.04	961.5	mixed energies, dump partiallz closed	bad run	804	secondary	18 mm Pb	air
8/2/2012 22:05:25	660473	26258	beamData	Open	-	240	10x10	0.155	0.166	200	30.1	963	small pion fraction		805	secondary	18 mm Pb	air
8/2/2012 23:56:06	660474	23193	beamData	Open	-	240	10x10	0.155	0.166	200	30.1	963.7	small pion fraction		805	secondary	18 mm Pb	air
8/3/2012 1:59:44	660475	27103	beamData	Open	-	240	10x10	0.155	0.166	200	30	963.9	small pion fraction		805	secondary	18 mm Pb	air
8/3/2012 3:18:20	660476	11415	beamData	Open	-	240	10x10	0.155	0.166	200	31.4	963.9	Stopped run because of rising temperature; small pion fraction		805	secondary	18 mm Pb	air
8/3/2012 5:30:31	660477	24080	beamData	Open	-	240	10x10	0.155	0.166	200	30.6	963.8	Temperature changing from 31.5 to 30.5; small pion fraction		805	secondary	18 mm Pb	air
8/3/2012 7:36:16	660478	23149	beamData	Open	-	240	10x10	0.155	0.166	150	30.3	964.2	small pion fraction		805	secondary	18 mm Pb	air
8/3/2012 9:02:42	660479	16372	beamData	Open	-	240	10x10	0.155	0.166	200	30.1	964.5	last two minutes intensity increased to 700/spill; small pion fraction		805	secondary	18 mm Pb	air
8/3/2012 9:04:12	660480		DhcNoise	Open	-	240	10x10				30.09	964.5			805	secondary	18 mm Pb	air
8/3/2012 9:14:09	660481	4873	beamData	Open	-	240	10x10	0.155	0.166	400	30.08	964.6	too high rate (large pion fraction)	bad run	805	secondary	18 mm Pb	air
8/3/2012 10:55:35	660482	39723	beamData	Open	-	240	10x10	0.155	0.166	300	29.93	964.3	run stopped: no hits in layers 45-48 (right side) visible in event display top view for some time, then seems to be fine again		805	secondary	18 mm Pb	air
8/3/2012 11:14:39	660483	7026	beamData	Open	-	240	10x10	0.155	0.166	320	29.9	964.3	run stopped because of imminent tests of zone-access system		805	secondary	18 mm Pb	air
8/3/2012 13:59:05	660484	44572	beamData	Open	-	240	10x10	0.155	0.166	279	30	963			805	secondary	18 mm Pb	air
8/3/2012 15:49:19	660485	40663	beamData	Open	-	240	10x10	0.155	0.166	270	30	962.6			805	secondary	18 mm Pb	air
8/3/2012 16:10:39	660486	9000	beamData	Open	-	270	10x10	0.15	0.16	500	30	962.6	tuning beam	bad run	806	secondary	18 mm Pb	air
8/3/2012 16:25:35	660487	15000	beamData	Open	-	270	10x10	0.15	0.16	4000	30	962.6	tuning	bad run	806	secondary	18 mm Pb	air
8/3/2012 18:25:32	660488		beamData	Open	-	270	10x10	0.15	0.16	150	30	962.3			807	secondary	18 mm Pb	air
8/3/2012 20:28:51	660489	18745	beamData	Open	-	270	10x10	0.15	0.16	150	30	962.7			807	secondary	18 mm Pb	air
8/3/2012 22:33:17	660490	22291	beamData	Open	-	270	10x10	0.15	0.16	150	30.1	963.5			807	secondary	18 mm Pb	air
8/4/2012 0:59:27	660491	25789	beamData	Open	-	270	10x10	0.1554	0.1664	137	30	963.4			807	secondary	18 mm Pb	air
8/4/2012 3:02:59	660492	21685	beamData	Open	-	270	10x10	0.1524	0.1664	130	29.97	962.8			807	secondary	18 mm Pb	air
8/4/2012 4:52:26	660493	15070	beamData	Open	-	270	10x10	0.1524	0.1664	130	30	962.4			807	secondary	18 mm Pb	air
8/4/2012 7:42:07	660494	22404	beamData	Open	-	270	10x10	0.1524	0.1635	130	30	962.6			807	secondary	18 mm Pb	air
8/4/2012 9:59:57	660495	24965	beamData	Open	-	270	10x10	0.1524	0.1635	138	30	962.4			807	secondary	18 mm Pb	air
8/4/2012 12:10:43	660496	21012	beamData	Open	-	270	10x10	0.1524	0.1635	116	29.98	961.6			807	secondary	18 mm Pb	air
8/4/2012 14:18:00	660497	16035	beamData	Open	-	270	10x10	0.1554		116	29.99	960.3			807	secondary	18 mm Pb	air
8/4/2012 16:15:12	660498	18737	beamData	Open	-	270	10x10	0.15	0.16	150	30	959.2			807	secondary	18 mm Pb	air
8/4/2012 19:11:29	660499	23863	beamData	Open	-	300	10x10	0.15	0.16	150-190	30.1	958			801	secondary	18 mm Pb	air
8/4/2012 21:16:19	660500	25497	beamData	Open	-	300	10x10	0.15	0.16	170	30	958.8			801	secondary	18 mm Pb	air
8/4/2012 23:16:18	660501	22479	beamData	Open	-	300	10x10	0.15	0.16	150 - 190	30.1	959.1			801	secondary	18 mm Pb	air
8/5/2012 1:35:12	660502	21978	beamData	Open	-	300	10x10	0.1524	-	160	30	961.4	cannot read cerenkov BCB in netbeans. Server down. Beam had problems, saw sudden drop in efficiency. Comment from SPS: re-steering north extraction. Detector seems to have recovered towards end of shift		801	secondary	18 mm Pb	air
8/5/2012 2:59:32	660503	4382	beamData	Open	-	300	10x10	0.1524	-	160	30	959.7			801	secondary	18 mm Pb	air
8/5/2012 6:00:47	660504	26818	beamData	Open	-	300	10x10	1.554	-	160	29.959	959.4			801	secondary	18 mm Pb	air
8/5/2012 8:05:45	660505	26213	beamData	Open	-	300	10x10	0.155	-	160	30	959.9			801	secondary	18 mm Pb	air
8/5/2012 8:35:29	660506		DhcNoise	Open	-		10x10				29.9	960.1			H8C801	secondary	18 mm Pb	air
																		
																		
																		
8/5/2012 10:46:20	660507	28006	beamData	Open	-	300	10x10	0	0	219	29.915	959.7			H8C.801	secondary	18 mm Pb	air
8/5/2012 12:46:27	660508	27187	beamData	Open	-	300	10x10	0.1	0.1	180	29.9	959.3			801	secondary	18 mm Pb	air
8/5/2012 14:51:53	660509	37434	beamData	Open	-	180	10x10			260	29.9	957.9			808	secondary	18 mm Pb	air
8/5/2012 16:54:55	660510	39110	beamData	Open	-	180	10x10	0.15	0.16	250	29.9	956			808	secondary	18 mm Pb	air
8/5/2012 16:56:33	660511		DhcNoise	Open	-	180	NULL	0.15	0.16	250	29.9	955.9			808	secondary	18 mm Pb	air
8/5/2012 19:05:20	660512	33160	beamData	Open	-	180	10x10	0.15	0.16	250	30	95.5			808	secondary	18 mm Pb	air
8/5/2012 21:05:20	660513	13744	beamData	Open	-	180	10x10	0.15	0.16	250	30	955.7			808	secondary	18 mm Pb	air
8/5/2012 21:06:32	660514		DhcNoise	Open	+		10x10	0.15	0.16	0	30.1	955.7			808	secondary	18 mm Pb	air
8/5/2012 23:19:09	660515	10241	beamData	Open	-	100	10x10	0.15	0.16	100	30	959.8			809	tertiary	air	6 mm Pb
8/6/2012 1:24:37	660516	16227	beamData	Open	-	100	10x10	0.1524	0.1664	100	30.003	960.48			809	tertiary	air	6 mm Pb
8/6/2012 3:27:37	660517	15949	beamData	Open	-	100	10x10	0.1524	0.1664	100	29.954	960.82			809	tertiary	air	6 mm Pb
8/6/2012 5:30:41	660518	15332	beamData	Open	-	100	10x10	0.1524	0.1664	100	29.954	960.6			809	tertiary	air	6 mm Pb
8/6/2012 5:36:50	660519		DhcNoise	Open	-	100	10x10	0.1524	0.1664	100	29.958	960.6			809	tertiary	air	6 mm Pb
8/6/2012 7:09:43	660520	2883	beamData	Open	-	100	10x10	0.1524	0.1664		29.939	960.8	Very unstable beam conditions		809	tertiary	air	6 mm Pb
8/6/2012 8:03:05	660521	4026	beamData	Open	-	100	10x10	0.15	0.16	100	29.9	961			809	tertiary	air	6 mm Pb
11/1/2012 16:57:33	660522		DhcNoise	Closed	-	180	30x30	0	0	3500	23	941.5	DAQ just started, temperature still rising		999	secondary	air	air
11/3/2012 4:51:02	660523		DhcNoise	Closed	-	180	30x30	0	0	2800	28.6	954.7			808	secondary	air	air
11/3/2012 4:52:11	660524		DhcNoise	Closed	-	180	30x30	0		0	28.6	954.7			808	secondary	air	air
11/3/2012 5:48:41	660525	726792	beamData	Closed	-	180	30x30	0.0557	0.0554	2800	28.7	954.7			808	secondary	air	air
11/3/2012 8:54:51	660526	356706	beamData	Closed	-	180	30x30	0	0	10000	28.6	954.2			808	secondary	air	air
11/3/2012 8:55:40	660527		DhcNoise	Closed	-	180	30x30	0	0	0	28.6	954.2			808	secondary	air	air
11/3/2012 9:05:59	660528	100000	beamData	Closed	-	180	30x30	0	0	12000	28.6	954	60000 events with "missing data"	bad run	808	secondary	air	air
11/3/2012 9:26:40	660529	170000	beamData	Closed	-	180	30x30	0	0	10000	28.6	954	again missing data.	bad run	808	secondary	air	air
11/3/2012 10:14:42	660530	1	beamData	Closed	-	180	30x30	0	0	10000	28.6	954	DAQ is confused: missing data, taking 100k ev/min.	bad run	808	secondary	air	air
11/3/2012 10:15:01	660531	1	beamData	Closed	-	180	30x30	0	0	10000	28.6	954	DAQ is confused: missing data, taking 100k ev/min.	bad run	808	secondary	air	air
11/3/2012 10:15:21	660532	1	beamData	Closed	-	180	30x30	0	0	10000	28.6	954	DAQ is confused: missing data, taking 100k ev/min.	bad run	808	secondary	air	air
11/3/2012 10:29:59	660533	115347	beamData	Closed	-	180	30x30	0	0	8000	28.6	954	at the end, 4000 events with missing data	bad run	808	secondary	air	air
11/3/2012 11:11:58	660534	145056	beamData	Closed	-	180	30x30	0	0	7500	28.5	954.1	100k events with missing data		808	secondary	air	air
11/3/2012 11:19:07	660535	3422	beamData	Closed	-	180	30x30	0	0	5000	28.5	954.1	forgot to restart the DAQ	bad run	808	secondary	air	air
11/3/2012 12:43:42	660536	271122	beamData	Closed	-	180	30x30	0	0	5000	28.6	953.5			808	secondary	air	air
11/3/2012 13:44:18	660537	209505	beamData	Closed	-	180	30x30	0	0	3500	28.7	953	still missing data		808	secondary	air	air
11/3/2012 14:46:23	660538	237690	beamData	Closed	-	180	30x30	0	0	3500	28.8	952.5	still missing data		808	secondary	air	air
11/3/2012 17:22:21	660539	8402	Other	Open	-		10x10				28.7	952.3	with closed beam dump	bad run	808	secondary	air	air
11/3/2012 17:50:17	660540	8072	beamData	Open	-	180	10x10			360tot -180pi	28.3	952.3		bad run	808	secondary	18 mm Pb	air
11/3/2012 19:47:56	660541	57434	beamData	Open	-	180	10x10			400	28.8	952.7	per spill 200 pi and 200 mu		808	secondary	18 mm Pb	air
11/3/2012 20:50:22	660542	29212	beamData	Open	-	180	10x10			350	28.9	952.7			808	secondary	18 mm Pb	air
11/3/2012 21:00:43	660543	4729	beamData	Open	-	180	10x10			350	28.9	954.7			808	secondary	18 mm Pb	air
11/3/2012 22:23:49	660544	10506	beamData	Open	-	180	10x10				29.02	953			808	secondary	18 mm Pb	air
11/3/2012 22:34:04	660545	4203	beamData	Open	-	180	10x10			400	29	953.1		bad run	808	secondary	18 mm Pb	air
11/4/2012 0:25:13	660546	24301	beamData	Open	-	180	10x10			400	28.9	953.1			808	secondary	18 mm Pb	air
11/4/2012 2:43:09	660547	46753	beamData	Open	-	180	10x10			300	29	952.3			808	secondary	18 mm Pb	air
11/4/2012 4:47:00	660548	63079	beamData	Open	-	180	10x10			400	29.1	951.3			808	secondary	18 mm Pb	air
11/4/2012 6:50:08	660549	57808	beamData	Open	-	180	10x10			400	29.1	950.8			808	secondary	18 mm Pb	air
11/4/2012 10:01:59	660550	112668	beamData	Open	-	180	10x10	0	0	470	29.2	950.5			808	secondary	18 mm Pb	air
11/4/2012 10:06:39	660551	0	DhcNoise	Open	-	180	10x10	0	0	470	29.2	950.5			808	secondary	18 mm Pb	air
11/4/2012 13:21:02	660552	100649	beamData	Open	-	180	10x10	0	0	420	29.3	948.8	no more missing data!		808	secondary	18 mm Pb	air
11/4/2012 15:06:29	660553	16079	beamData	Open	-	180	10x10	0	0	420	29.4	947.7	booster problem, stopping the run.		808	secondary	18 mm Pb	air
11/4/2012 19:26:27	660554	100311	beamData	Open	-	180	10x10			380	29.3	950.3			808	secondary	18 mm Pb	air
11/4/2012 22:40:50	660555	63341	beamData	Open	-	180	10x10			380	29	951.3			808	secondary	18 mm Pb	air
11/4/2012 23:57:40	660556	1851	beamData	Open	-	180	10x10			263	28.9	951.6	Daq seemed to have stopped, restart	bad run	808	secondary	18 mm Pb	air
11/5/2012 2:52:34	660557	71234	beamData	Open	-	180	10x10	0.0557	0.0554	360	28.8	951.6			808	secondary	18 mm Pb	air
11/5/2012 3:51:38	660558	21519	beamData	Open	-	180	10x10	0.0528	0.0554	420	28.7	951.6	Stopped run because there is no beam		808	secondary	18 mm Pb	air
11/5/2012 7:46:11	660559	0	DhcNoise	Open	-	180	10x10				28.5	952.5	Shutter was open, but no beam		808	secondary	18 mm Pb	air
11/6/2012 18:04:13	660560	0	DhcNoise	Closed	-	180	10x10	0	0	0	28.1	967.3	No beam		808	secondary	18 mm Pb	air
11/6/2012 21:42:19	660561	0	DhcNoise	Open	-	180	10x10	0	0	0	28	970.4	Shutter was open, but no beam		808	secondary	18 mm Pb	air
11/6/2012 22:51:17	660562	0	DhcNoise	Closed	-	180	10x10	0	0	0	28	970.4	Shutter was open, but no beam		808	secondary	18 mm Pb	air
11/6/2012 22:51:31	660563	0	DhcNoise	Closed	-	180	10x10	0	0	0	28	970.4	Shutter was open, but no beam		808	secondary	18 mm Pb	air
11/6/2012 22:51:42	660564	0	DhcNoise	Closed	-	180	10x10	0	0	0	28	970.4	Shutter was open, but no beam		808	secondary	18 mm Pb	air
11/6/2012 22:51:53	660565	0	DhcNoise	Closed	-	180	10x10	0	0	0	28	970.4	Shutter was open, but no beam		808	secondary	18 mm Pb	air
11/7/2012 4:04:47	660566	0	DhcNoise	Open	-	180	10x10	0	0	0	29.3	973.5			808	secondary	18 mm Pb	air
11/7/2012 4:38:32	660567	3000	beamData	Open	-	180	10x10	0	0	230	29.3	973.5	Short run to test gain		808	secondary	18 mm Pb	air
11/7/2012 5:10:13	660568	5000	beamData	Open	-	180	10x10	0	0	220	29.3	973.7	Short run to test gain		808	secondary	18 mm Pb	air
11/7/2012 5:39:58	660569	6000	beamData	Open	-	180	10x10	0	0	220	29.3	974.1	Short run to test gain		808	secondary	18 mm Pb	air
11/7/2012 6:09:40	660570	6700	beamData	Open	-	180	10x10	0	0	290	29.3	974.4	Short run to test gain		808	secondary	18 mm Pb	air
11/7/2012 7:29:19	660571	17900	beamData	Open	-	180	10x10	0	0	300	29.3	974.9	Stopped run because there is no beam		808	secondary	18 mm Pb	air
11/7/2012 9:04:51	660572	31463	beamData	Open	-	180	10x10	0	0	330	28.1	976			808	secondary	18 mm Pb	air
11/7/2012 10:43:21	660573	10011	beamData	Open	-	50	10x10	1.2	1.2	600	28.1	976.4			813	secondary	18 mm Pb	air
11/7/2012 10:44:40	660574		DhcNoise	Open	-		10x10				28.1	976.4			813	secondary	18 mm Pb	air
11/7/2012 17:14:29	660577	0	DhcNoise	Open	-	50	NULL	0	0	0	28.1	973.9	No beam		813	secondary	18 mm Pb	air
11/7/2012 20:59:23	660578	169429	beamData	Open	-	50	10x10	1.1968	1.1954	1334	~28	9736			813	secondary	18 mm Pb	air
11/7/2012 21:03:08	660579	0	DhcNoise	Open	-	50	NULL	1.1968	1.1954		~28	973.7			813	secondary	18 mm Pb	air
11/7/2012 23:07:53	660580	191420	beamData	Open	-	50	10x10	1.1968	1.1954	1354	~28	973.6			813	secondary	18 mm Pb	air
11/7/2012 23:17:02	660581	0	DhcNoise	Open	-		NULL	1.1968	1.1954		~28	973.5			813	secondary	18 mm Pb	air
11/7/2012 23:52:12	660582	66603	beamData	Open	-	50	10x10	1.1968	1.1954	1336	~28	973.5	Run stopped to reduce intensity (call by Erik)		813	secondary	18 mm Pb	air
11/8/2012 2:06:31	600583		DhcNoise	Open	-	50	10x10				~28	972.8	Temperature and pressure two hours after end of the run, Beam shutter was open		813	secondary	18 mm Pb	air
11/8/2012 2:13:57	660584	136386	beamData	Open	-	50	10x10	1.1968	1.1954	830	~28	972.7			813	secondary	18 mm Pb	air
11/8/2012 2:15:14	660585		DhcNoise	Open	-	50	10x10				~28	972.6			813	secondary	18 mm Pb	air
11/8/2012 3:57:16	660586	93257	beamData	Open	-	50	10x10	1.2	1.2	860	~28	971.7	Stopped a bit earlier, no beam		813	secondary	18 mm Pb	air
11/8/2012 3:58:47	660587		DhcNoise	Open	-	50	10x10	1.2	1.2		~28	971.7			813	secondary	18 mm Pb	air
11/8/2012 7:23:37	600588	55175	beamData	Open	-	50	10x10	1.2	1.2	500	~28	970.2			813	secondary	18 mm Pb	air
11/8/2012 7:24:54	600589		DhcNoise	Open	+		10x10				~28	970.3			813	secondary	18 mm Pb	air
11/8/2012 14:56:47	660590		DhcNoise	Open	+		10x10				~28	966.7	No beam		813	secondary	18 mm Pb	air
11/8/2012 15:24:08	660591		DhcNoise	Open	+		10x10				~28	966.7	high gain, thr 80, 6.1kV		813	secondary	18 mm Pb	air
11/8/2012 16:30:55	660592		DhcNoise	Open	+		10x10				~28	966.5	high gain, thr 80, 6.0kV		813	secondary	18 mm Pb	air
11/8/2012 16:35:34	660593		DhcNoise	Open	+		10x10				~28	966.5			813	secondary	18 mm Pb	air
11/8/2012 16:54:11	660594		DhcNoise	Open	+		10x10				~28	966.4	high gain, thr 80, 5.9kV		813	secondary	18 mm Pb	air
11/8/2012 17:15:17	660595		DhcNoise	Open	+		10x10				~28	966.7	high gain, thr 80, 5.8kV		813	secondary	18 mm Pb	air
11/8/2012 17:55:55	660597	137495	beamData	Closed	-	180	30x30	0	0	9000	~28	967.1	low gain, thr 110, 6.1kV		811	secondary	18 mm Pb	air
11/8/2012 18:25:50	660598	248087	beamData	Closed	-	180	30x30			10k	~28	967.1	high gain, thr 80, 6.1kV		811	secondary	18 mm Pb	air
11/8/2012 18:53:37	660599	163015	beamData	Closed	-	180	30x30			10k	~28	967	high gain, thr 80, 6.0kV		811	secondary	18 mm Pb	air
11/8/2012 19:21:48	660600	202499	beamData	Closed	-	180	30x30			10k	~28	967.1	high gain, thr 80, 5.8kV		811	secondary	18 mm Pb	air
11/8/2012 19:57:54	660601	205529	beamData	Closed	-	180	30x30			10k	~28	966.7	high gain, thr 80, 5.6kV		811	secondary	18 mm Pb	air
11/8/2012 20:19:15	660602	205817	beamData	Closed	-	180	30x30			10k	~28	966.8	high gain, thr 80, 5.5kV		811	secondary	18 mm Pb	air
11/8/2012 20:50:16	660603	211039	beamData	Closed	-	180	30x30			10k	~28	966.8	high gain, thr 80, 5.3kV		811	secondary	18 mm Pb	air
11/8/2012 22:05:09	660604	39798	beamData	Open	-	180	10x10			550/560	~28	967.1	high gain, thr 80, 5.5kV		808	secondary	18 mm Pb	air
11/8/2012 22:42:56	660605	40698	beamData	Open	-	180	10x10			1100/1150	~28	967	high gain, thr 80, 5.5kV		808	secondary	18 mm Pb	air
11/8/2012 23:06:17	660606	40836	beamData	Open	-	180	10x10			1600/1650	~28	966.8	high gain, thr 80, 5.5kV		808	secondary	18 mm Pb	air
11/8/2012 23:26:28	660607	40597	beamData	Open	-	180	10x10			2000/2100	~28	966.8	high gain, thr 80, 5.5kV		808	secondary	18 mm Pb	air
11/8/2012 23:38:23	660608	43188	beamData	Open	-	180	10x10			3600/4200	~28	966.7	high gain, thr 80, 5.5kV		808	secondary	18 mm Pb	air
11/9/2012 1:57:15	600609	101782	beamData	Open	-	180	10x10	1.2	1.2	680	~28	965.3			808	secondary	18 mm Pb	air
11/9/2012 1:59:05	660610		DhcNoise	Open	-	180	10x10				~28	965.3			808	secondary	18 mm Pb	air
11/9/2012 4:05:11	660611	115725	beamData	Open	-	180	10x10	1.2	1.2	760	27.6	694.8			808	secondary	18 mm Pb	air
11/9/2012 4:08:31	660612		DhcNoise	Open	-	180	10x10				27.6	964.8			808	secondary	18 mm Pb	air
11/9/2012 5:05:41	660613	40423	beamData	Open	-	180	10x10	1.2	1.2	740	27.6	964.5	stoppted because we have no beam		808	secondary	18 mm Pb	air
11/9/2012 7:07:22	660614	57084	beamData	Open	-	180	10x10	1.2	1.2	660	27.5	694.5			808	secondary	18 mm Pb	air
11/9/2012 7:09:03	660615		DhcNoise	Open	-	180	10x10				27.5	964.5			808	secondary	18 mm Pb	air
11/9/2012 8:30:37	660616	65496	beamData	Open	-	180	10x10	1.2	1.2	690	29.03	964.6	run ok		808	secondary	18 mm Pb	air
11/9/2012 9:33:36	660617	42990	beamData	Open	-	50	10x10	1.2	1.2	700/720	27.5	964.2	rate test -for the last 5 min or so very low intensity from SPS		813	secondary	18 mm Pb	air
11/9/2012 9:56:12	660618	16758	beamData	Open	-	50	10x10	1.2	1.2	1200 / 1260	27.5	964.2	unstable beam		813	secondary	18 mm Pb	air
11/9/2012 10:30:41	660619	8094	beamData	Open	-	50	10x10	1.2	1.2	1200 /1260	27.5	963.9	unstable beam		813	secondary	18 mm Pb	air
11/9/2012 11:00:07	660620	41257	beamData	Open	-	50	10x10	1.2	1.2	1200 /1260	27.5	963.5			813	secondary	18 mm Pb	air
11/9/2012 11:39:25	660621	16563	beamData	Open	-	50	10x10	1.2	1.2	1800/1920	27.54	962.9	unstable beam		813	secondary	18 mm Pb	air
11/9/2012 12:13:39	660622	40863	beamData	Open	-	50	10x10	1.2	1.2	1710/1800	27.56	962.4			813	secondary	18 mm Pb	air
11/9/2012 12:49:14	660223	46100	beamData	Open	-	50	10x10	1.2	1.2	2200	27.59	961.9			813	secondary	18 mm Pb	air
11/9/2012 14:11:02	660624	567394	beamData	Closed	-	180	10x10			11k	27.7	961.6	trig ct at central position		811	secondary	18 mm Pb	air
11/9/2012 15:50:48	660625	420524	beamData	Closed	-	180	10x10			10k	27.8	960.6	trig ct at lower position		811	secondary	18 mm Pb	air
11/9/2012 17:46:40	660626	504173	beamData	Closed	-	180	30x30	1.2	1.2	8000	28.1	960.1	trig ct at upper position		811	secondary	18 mm Pb	air
11/9/2012 17:49:52	660627	0	DhcNoise	Closed	-	180	30x30	1.2	1.2	8000	28.1	960.1	high gain noise run		811	secondary	18 mm Pb	air
11/9/2012 20:05:35	660628	40109	beamData	Open	-	180	10x10	1.2	1.2	340	28.2	960			808	secondary	18 mm Pb	air
11/9/2012 21:06:06	660629	35541	beamData	Open	-	180	10x10	1.2	1.2	800 / 840	28.1	960.1	last 5000 events had fluctating intensity (between 400 and 800)		808	secondary	18 mm Pb	air
11/9/2012 21:44:39	660630	41285	beamData	Open	-	180	10x10	1.2	1.2	1500 / 1580	28.1	960.1			808	secondary	18 mm Pb	air
11/9/2012 23:33:35	660631	53186	beamData	Open	-	180	10x10	1.2	1.2	3255 / 3710	28	959			808	secondary	18 mm Pb	air
11/9/2012 23:43:31	660632	42254	beamData	Open	-	180	10x10	1.2	1.2	6200 / 8000	28	959			808	secondary	18 mm Pb	air
11/10/2012 2:14:28	660634	131352	beamData	Open	-	50	10x10	1.1935	1.1986	1000/900	28.1	956.9	High-gain settings, lower HV Lost ~10% beam intensity half-way through this run		813	secondary	18 mm Pb	air
11/10/2012 2:38:00	660635	19052	beamData	Open	-	50	10x10	1.1968	1.1954	1000	28.1	956.9	Beam lost		813	secondary	18 mm Pb	air
11/10/2012 2:50:53	660636	28	beamData	Open	-	50	10x10	1.1935	1.1986	900	28.1	956.9	Beam lost - very short run		813	secondary	18 mm Pb	air
11/10/2012 5:17:02	660637	153711	beamData	Open	-	50	10x10	1.1935	1.1986	1080	28.16	956.36			813	secondary	18 mm Pb	air
11/10/2012 5:59:36	660638	44112	beamData	Open	-	50	10x10	1.1935	1.1986	1000	28.14	954.6	Beam lost. Stopped run.		813	secondary	18 mm Pb	air
11/10/2012 7:28:31	660640	0	DhcNoise	Open	-		10x10				28.163	953.64			813	secondary	18 mm Pb	air
11/10/2012 10:20:14	660641		DhcNoise	Open	-		10x10			no beam	28.3	954.1	back to low gain setting 6.1kv		813	secondary	air	air
11/10/2012 16:13:50	660642	41620	beamData	Open	-	50	10x10	1.2	1.2	620 /640	28.5	950.8			813	secondary	18 mm Pb	air
11/10/2012 16:51:50	660643	40286	beamData	Open	-	50	10x10	1.2	1.2	1000 /1200	28.5	950.9			813	secondary	18 mm Pb	air
11/10/2012 17:24:20	660644	42077	beamData	Open	-	50	10x10	1.2	1.2	1300	28.5	950.7	rate droped in between from 1300 to 900		813	secondary	18 mm Pb	air
11/10/2012 18:03:53	660645	39207	beamData	Open	-	50	10x10	1.2	1.2	1800	28.4	950.5	large rate variations: 1200-2200. Mainly 1800		813	secondary	18 mm Pb	air
11/10/2012 18:25:18	660646		DhcNoise	Open	-		10x10				28.5	950.8			808	secondary	18 mm Pb	air
11/10/2012 20:48:38	660647	16319	beamData	Open	-	180	10x10	1.2	1.2	300	28.5	952.3	rate variations between 250 and 350		808	secondary	18 mm Pb	air
11/10/2012 20:53:15	660648		DhcNoise	Open	-		10x10				28.5	952.9			808	secondary	18 mm Pb	air
11/10/2012 23:56:43	660649		DhcNoise	Open	-	180	10x10	1.2	1.2		28.5	953.3			808	secondary	18 mm Pb	air
