475208
475464
475720
475976
476232
476488
476744
477000
475209
475465
475721
475977
476233
476489
476745
477001
475210
475466
475722
475978
476234
476490
476746
477002
475211
475467
475723
475979
476235
476491
476747
477003
475212
475468
475724
475980
476236
476492
476748
477004
475213
475469
475725
475981
476237
476493
476749
477005
475214
475470
475726
475982
476238
476494
476750
477006
475215
475471
475727
475983
476239
476495
476751
477007
540760
541016
541272
541528
541784
542040
542296
542552
540761
541017
541273
541529
541785
542041
542297
542553
540762
541018
541274
541530
541786
542042
542298
542554
540763
541019
541275
541531
541787
542043
542299
542555
540764
541020
541276
541532
541788
542044
542300
542556
540765
541021
541277
541533
541789
542045
542301
542557
540766
541022
541278
541534
541790
542046
542302
542558
540767
541023
541279
541535
541791
542047
542303
542559
610360
610616
610872
611128
611384
611640
611896
612152
610361
610617
610873
611129
611385
611641
611897
612153
610362
610618
610874
611130
611386
611642
611898
612154
610363
610619
610875
611131
611387
611643
611899
612155
610364
610620
610876
611132
611388
611644
611900
612156
610365
610621
610877
611133
611389
611645
611901
612157
610366
610622
610878
611134
611390
611646
611902
612158
610367
610623
610879
611135
611391
611647
611903
612159
593984
594240
594496
594752
595008
595264
595520
595776
593985
594241
594497
594753
595009
595265
595521
595777
593986
594242
594498
594754
595010
595266
595522
595778
593987
594243
594499
594755
595011
595267
595523
595779
593988
594244
594500
594756
595012
595268
595524
595780
593989
594245
594501
594757
595013
595269
595525
595781
593990
594246
594502
594758
595014
595270
595526
595782
593991
594247
594503
594759
595015
595271
595527
595783
741432
741688
741944
742200
742456
742712
742968
743224
741433
741689
741945
742201
742457
742713
742969
743225
741434
741690
741946
742202
742458
742714
742970
743226
741435
741691
741947
742203
742459
742715
742971
743227
741436
741692
741948
742204
742460
742716
742972
743228
741437
741693
741949
742205
742461
742717
742973
743229
741438
741694
741950
742206
742462
742718
742974
743230
741439
741695
741951
742207
742463
742719
742975
743231
1187888
1188144
1188400
1188656
1188912
1189168
1189424
1189680
1187889
1188145
1188401
1188657
1188913
1189169
1189425
1189681
1187890
1188146
1188402
1188658
1188914
1189170
1189426
1189682
1187891
1188147
1188403
1188659
1188915
1189171
1189427
1189683
1187892
1188148
1188404
1188660
1188916
1189172
1189428
1189684
1187893
1188149
1188405
1188661
1188917
1189173
1189429
1189685
1187894
1188150
1188406
1188662
1188918
1189174
1189430
1189686
1187895
1188151
1188407
1188663
1188919
1189175
1189431
1189687
1714240
1714496
1714752
1715008
1715264
1715520
1715776
1716032
1714241
1714497
1714753
1715009
1715265
1715521
1715777
1716033
1714242
1714498
1714754
1715010
1715266
1715522
1715778
1716034
1714243
1714499
1714755
1715011
1715267
1715523
1715779
1716035
1714244
1714500
1714756
1715012
1715268
1715524
1715780
1716036
1714245
1714501
1714757
1715013
1715269
1715525
1715781
1716037
1714246
1714502
1714758
1715014
1715270
1715526
1715782
1716038
1714247
1714503
1714759
1715015
1715271
1715527
1715783
1716039
2107440
2107696
2107952
2108208
2108464
2108720
2108976
2109232
2107441
2107697
2107953
2108209
2108465
2108721
2108977
2109233
2107442
2107698
2107954
2108210
2108466
2108722
2108978
2109234
2107443
2107699
2107955
2108211
2108467
2108723
2108979
2109235
2107444
2107700
2107956
2108212
2108468
2108724
2108980
2109236
2107445
2107701
2107957
2108213
2108469
2108725
2108981
2109237
2107446
2107702
2107958
2108214
2108470
2108726
2108982
2109238
2107447
2107703
2107959
2108215
2108471
2108727
2108983
2109239
3024952
3025208
3025464
3025720
3025976
3026232
3026488
3026744
3024953
3025209
3025465
3025721
3025977
3026233
3026489
3026745
3024954
3025210
3025466
3025722
3025978
3026234
3026490
3026746
3024955
3025211
3025467
3025723
3025979
3026235
3026491
3026747
3024956
3025212
3025468
3025724
3025980
3026236
3026492
3026748
3024957
3025213
3025469
3025725
3025981
3026237
3026493
3026749
3024958
3025214
3025470
3025726
3025982
3026238
3026494
3026750
3024959
3025215
3025471
3025727
3025983
3026239
3026495
3026751
