404748
1060360
1059082
1060366
1128972
1260304
1254434
1254690
1583136
1584160
1583394
1584162
1583139
1583651
1583907
1584419
1583396
1584676
1583398
1583654
1910309
2173466
2307347
2307100
2765851
2766108
2961432
2963224
2957340
