2361384
2361640
2361896
2362152
2362408
2362664
2362920
2363176
2361385
2361641
2361897
2362153
2362409
2362665
2362921
2363177
2361386
2361642
2361898
2362154
2362410
2362666
2362922
2363178
2361387
2361643
2361899
2362155
2362411
2362667
2362923
2363179
2361388
2361644
2361900
2362156
2362412
2362668
2362924
2363180
2361389
2361645
2361901
2362157
2362413
2362669
2362925
2363181
2361390
2361646
2361902
2362158
2362414
2362670
2362926
2363182
2361391
2361647
2361903
2362159
2362415
2362671
2362927
2363183
