725048
725304
725560
725816
726072
726328
726584
726840
725049
725305
725561
725817
726073
726329
726585
726841
725050
725306
725562
725818
726074
726330
726586
726842
725051
725307
725563
725819
726075
726331
726587
726843
725052
725308
725564
725820
726076
726332
726588
726844
725053
725309
725565
725821
726077
726333
726589
726845
725054
725310
725566
725822
726078
726334
726590
726846
725055
725311
725567
725823
726079
726335
726591
726847
3035184
3035440
3035696
3035952
3036208
3036464
3036720
3036976
3035185
3035441
3035697
3035953
3036209
3036465
3036721
3036977
3035186
3035442
3035698
3035954
3036210
3036466
3036722
3036978
3035187
3035443
3035699
3035955
3036211
3036467
3036723
3036979
3035188
3035444
3035700
3035956
3036212
3036468
3036724
3036980
3035189
3035445
3035701
3035957
3036213
3036469
3036725
3036981
3035190
3035446
3035702
3035958
3036214
3036470
3036726
3036982
3035191
3035447
3035703
3035959
3036215
3036471
3036727
3036983
3414064
3414320
3414576
3414832
3415088
3415344
3415600
3415856
3414065
3414321
3414577
3414833
3415089
3415345
3415601
3415857
3414066
3414322
3414578
3414834
3415090
3415346
3415602
3415858
3414067
3414323
3414579
3414835
3415091
3415347
3415603
3415859
3414068
3414324
3414580
3414836
3415092
3415348
3415604
3415860
3414069
3414325
3414581
3414837
3415093
3415349
3415605
3415861
3414070
3414326
3414582
3414838
3415094
3415350
3415606
3415862
3414071
3414327
3414583
3414839
3415095
3415351
3415607
3415863
