1114112
1114368
1114624
1114880
1115136
1115392
1115648
1115904
1116160
1116416
1116672
1116928
1117184
1117440
1117696
1117952
1118208
1118464
1118720
1118976
1119232
1119488
1119744
1120000
1120256
1120512
1120768
1121024
1121280
1121536
1121792
1122048
1122304
1122560
1122816
1123072
1123328
1123584
1123840
1124096
1124352
1124608
1124864
1125120
1125376
1125632
1125888
1126144
1126400
1126656
1126912
1127168
1127424
1127680
1127936
1128192
1128448
1128704
1128960
1129216
1129472
1129728
1129984
1130240
1114113
1114369
1114625
1114881
1115137
1115393
1115649
1115905
1116161
1116417
1116673
1116929
1117185
1117441
1117697
1117953
1118209
1118465
1118721
1118977
1119233
1119489
1119745
1120001
1120257
1120513
1120769
1121025
1121281
1121537
1121793
1122049
1122305
1122561
1122817
1123073
1123329
1123585
1123841
1124097
1124353
1124609
1124865
1125121
1125377
1125633
1125889
1126145
1126401
1126657
1126913
1127169
1127425
1127681
1127937
1128193
1128449
1128705
1128961
1129217
1129473
1129729
1129985
1130241
1114114
1114370
1114626
1114882
1115138
1115394
1115650
1115906
1116162
1116418
1116674
1116930
1117186
1117442
1117698
1117954
1118210
1118466
1118722
1118978
1119234
1119490
1119746
1120002
1120258
1120514
1120770
1121026
1121282
1121538
1121794
1122050
1122306
1122562
1122818
1123074
1123330
1123586
1123842
1124098
1124354
1124610
1124866
1125122
1125378
1125634
1125890
1126146
1126402
1126658
1126914
1127170
1127426
1127682
1127938
1128194
1128450
1128706
1128962
1129218
1129474
1129730
1129986
1130242
1114115
1114371
1114627
1114883
1115139
1115395
1115651
1115907
1116163
1116419
1116675
1116931
1117187
1117443
1117699
1117955
1118211
1118467
1118723
1118979
1119235
1119491
1119747
1120003
1120259
1120515
1120771
1121027
1121283
1121539
1121795
1122051
1122307
1122563
1122819
1123075
1123331
1123587
1123843
1124099
1124355
1124611
1124867
1125123
1125379
1125635
1125891
1126147
1126403
1126659
1126915
1127171
1127427
1127683
1127939
1128195
1128451
1128707
1128963
1129219
1129475
1129731
1129987
1130243
1114116
1114372
1114628
1114884
1115140
1115396
1115652
1115908
1116164
1116420
1116676
1116932
1117188
1117444
1117700
1117956
1118212
1118468
1118724
1118980
1119236
1119492
1119748
1120004
1120260
1120516
1120772
1121028
1121284
1121540
1121796
1122052
1122308
1122564
1122820
1123076
1123332
1123588
1123844
1124100
1124356
1124612
1124868
1125124
1125380
1125636
1125892
1126148
1126404
1126660
1126916
1127172
1127428
1127684
1127940
1128196
1128452
1128708
1128964
1129220
1129476
1129732
1129988
1130244
1114117
1114373
1114629
1114885
1115141
1115397
1115653
1115909
1116165
1116421
1116677
1116933
1117189
1117445
1117701
1117957
1118213
1118469
1118725
1118981
1119237
1119493
1119749
1120005
1120261
1120517
1120773
1121029
1121285
1121541
1121797
1122053
1122309
1122565
1122821
1123077
1123333
1123589
1123845
1124101
1124357
1124613
1124869
1125125
1125381
1125637
1125893
1126149
1126405
1126661
1126917
1127173
1127429
1127685
1127941
1128197
1128453
1128709
1128965
1129221
1129477
1129733
1129989
1130245
1114118
1114374
1114630
1114886
1115142
1115398
1115654
1115910
1116166
1116422
1116678
1116934
1117190
1117446
1117702
1117958
1118214
1118470
1118726
1118982
1119238
1119494
1119750
1120006
1120262
1120518
1120774
1121030
1121286
1121542
1121798
1122054
1122310
1122566
1122822
1123078
1123334
1123590
1123846
1124102
1124358
1124614
1124870
1125126
1125382
1125638
1125894
1126150
1126406
1126662
1126918
1127174
1127430
1127686
1127942
1128198
1128454
1128710
1128966
1129222
1129478
1129734
1129990
1130246
1114119
1114375
1114631
1114887
1115143
1115399
1115655
1115911
1116167
1116423
1116679
1116935
1117191
1117447
1117703
1117959
1118215
1118471
1118727
1118983
1119239
1119495
1119751
1120007
1120263
1120519
1120775
1121031
1121287
1121543
1121799
1122055
1122311
1122567
1122823
1123079
1123335
1123591
1123847
1124103
1124359
1124615
1124871
1125127
1125383
1125639
1125895
1126151
1126407
1126663
1126919
1127175
1127431
1127687
1127943
1128199
1128455
1128711
1128967
1129223
1129479
1129735
1129991
1130247
1114120
1114376
1114632
1114888
1115144
1115400
1115656
1115912
1116168
1116424
1116680
1116936
1117192
1117448
1117704
1117960
1118216
1118472
1118728
1118984
1119240
1119496
1119752
1120008
1120264
1120520
1120776
1121032
1121288
1121544
1121800
1122056
1122312
1122568
1122824
1123080
1123336
1123592
1123848
1124104
1124360
1124616
1124872
1125128
1125384
1125640
1125896
1126152
1126408
1126664
1126920
1127176
1127432
1127688
1127944
1128200
1128456
1128712
1128968
1129224
1129480
1129736
1129992
1130248
1114121
1114377
1114633
1114889
1115145
1115401
1115657
1115913
1116169
1116425
1116681
1116937
1117193
1117449
1117705
1117961
1118217
1118473
1118729
1118985
1119241
1119497
1119753
1120009
1120265
1120521
1120777
1121033
1121289
1121545
1121801
1122057
1122313
1122569
1122825
1123081
1123337
1123593
1123849
1124105
1124361
1124617
1124873
1125129
1125385
1125641
1125897
1126153
1126409
1126665
1126921
1127177
1127433
1127689
1127945
1128201
1128457
1128713
1128969
1129225
1129481
1129737
1129993
1130249
1114122
1114378
1114634
1114890
1115146
1115402
1115658
1115914
1116170
1116426
1116682
1116938
1117194
1117450
1117706
1117962
1118218
1118474
1118730
1118986
1119242
1119498
1119754
1120010
1120266
1120522
1120778
1121034
1121290
1121546
1121802
1122058
1122314
1122570
1122826
1123082
1123338
1123594
1123850
1124106
1124362
1124618
1124874
1125130
1125386
1125642
1125898
1126154
1126410
1126666
1126922
1127178
1127434
1127690
1127946
1128202
1128458
1128714
1128970
1129226
1129482
1129738
1129994
1130250
1114123
1114379
1114635
1114891
1115147
1115403
1115659
1115915
1116171
1116427
1116683
1116939
1117195
1117451
1117707
1117963
1118219
1118475
1118731
1118987
1119243
1119499
1119755
1120011
1120267
1120523
1120779
1121035
1121291
1121547
1121803
1122059
1122315
1122571
1122827
1123083
1123339
1123595
1123851
1124107
1124363
1124619
1124875
1125131
1125387
1125643
1125899
1126155
1126411
1126667
1126923
1127179
1127435
1127691
1127947
1128203
1128459
1128715
1128971
1129227
1129483
1129739
1129995
1130251
1114124
1114380
1114636
1114892
1115148
1115404
1115660
1115916
1116172
1116428
1116684
1116940
1117196
1117452
1117708
1117964
1118220
1118476
1118732
1118988
1119244
1119500
1119756
1120012
1120268
1120524
1120780
1121036
1121292
1121548
1121804
1122060
1122316
1122572
1122828
1123084
1123340
1123596
1123852
1124108
1124364
1124620
1124876
1125132
1125388
1125644
1125900
1126156
1126412
1126668
1126924
1127180
1127436
1127692
1127948
1128204
1128460
1128716
1128972
1129228
1129484
1129740
1129996
1130252
1114125
1114381
1114637
1114893
1115149
1115405
1115661
1115917
1116173
1116429
1116685
1116941
1117197
1117453
1117709
1117965
1118221
1118477
1118733
1118989
1119245
1119501
1119757
1120013
1120269
1120525
1120781
1121037
1121293
1121549
1121805
1122061
1122317
1122573
1122829
1123085
1123341
1123597
1123853
1124109
1124365
1124621
1124877
1125133
1125389
1125645
1125901
1126157
1126413
1126669
1126925
1127181
1127437
1127693
1127949
1128205
1128461
1128717
1128973
1129229
1129485
1129741
1129997
1130253
1114126
1114382
1114638
1114894
1115150
1115406
1115662
1115918
1116174
1116430
1116686
1116942
1117198
1117454
1117710
1117966
1118222
1118478
1118734
1118990
1119246
1119502
1119758
1120014
1120270
1120526
1120782
1121038
1121294
1121550
1121806
1122062
1122318
1122574
1122830
1123086
1123342
1123598
1123854
1124110
1124366
1124622
1124878
1125134
1125390
1125646
1125902
1126158
1126414
1126670
1126926
1127182
1127438
1127694
1127950
1128206
1128462
1128718
1128974
1129230
1129486
1129742
1129998
1130254
1114127
1114383
1114639
1114895
1115151
1115407
1115663
1115919
1116175
1116431
1116687
1116943
1117199
1117455
1117711
1117967
1118223
1118479
1118735
1118991
1119247
1119503
1119759
1120015
1120271
1120527
1120783
1121039
1121295
1121551
1121807
1122063
1122319
1122575
1122831
1123087
1123343
1123599
1123855
1124111
1124367
1124623
1124879
1125135
1125391
1125647
1125903
1126159
1126415
1126671
1126927
1127183
1127439
1127695
1127951
1128207
1128463
1128719
1128975
1129231
1129487
1129743
1129999
1130255
1114128
1114384
1114640
1114896
1115152
1115408
1115664
1115920
1116176
1116432
1116688
1116944
1117200
1117456
1117712
1117968
1118224
1118480
1118736
1118992
1119248
1119504
1119760
1120016
1120272
1120528
1120784
1121040
1121296
1121552
1121808
1122064
1122320
1122576
1122832
1123088
1123344
1123600
1123856
1124112
1124368
1124624
1124880
1125136
1125392
1125648
1125904
1126160
1126416
1126672
1126928
1127184
1127440
1127696
1127952
1128208
1128464
1128720
1128976
1129232
1129488
1129744
1130000
1130256
1114129
1114385
1114641
1114897
1115153
1115409
1115665
1115921
1116177
1116433
1116689
1116945
1117201
1117457
1117713
1117969
1118225
1118481
1118737
1118993
1119249
1119505
1119761
1120017
1120273
1120529
1120785
1121041
1121297
1121553
1121809
1122065
1122321
1122577
1122833
1123089
1123345
1123601
1123857
1124113
1124369
1124625
1124881
1125137
1125393
1125649
1125905
1126161
1126417
1126673
1126929
1127185
1127441
1127697
1127953
1128209
1128465
1128721
1128977
1129233
1129489
1129745
1130001
1130257
1114130
1114386
1114642
1114898
1115154
1115410
1115666
1115922
1116178
1116434
1116690
1116946
1117202
1117458
1117714
1117970
1118226
1118482
1118738
1118994
1119250
1119506
1119762
1120018
1120274
1120530
1120786
1121042
1121298
1121554
1121810
1122066
1122322
1122578
1122834
1123090
1123346
1123602
1123858
1124114
1124370
1124626
1124882
1125138
1125394
1125650
1125906
1126162
1126418
1126674
1126930
1127186
1127442
1127698
1127954
1128210
1128466
1128722
1128978
1129234
1129490
1129746
1130002
1130258
1114131
1114387
1114643
1114899
1115155
1115411
1115667
1115923
1116179
1116435
1116691
1116947
1117203
1117459
1117715
1117971
1118227
1118483
1118739
1118995
1119251
1119507
1119763
1120019
1120275
1120531
1120787
1121043
1121299
1121555
1121811
1122067
1122323
1122579
1122835
1123091
1123347
1123603
1123859
1124115
1124371
1124627
1124883
1125139
1125395
1125651
1125907
1126163
1126419
1126675
1126931
1127187
1127443
1127699
1127955
1128211
1128467
1128723
1128979
1129235
1129491
1129747
1130003
1130259
1114132
1114388
1114644
1114900
1115156
1115412
1115668
1115924
1116180
1116436
1116692
1116948
1117204
1117460
1117716
1117972
1118228
1118484
1118740
1118996
1119252
1119508
1119764
1120020
1120276
1120532
1120788
1121044
1121300
1121556
1121812
1122068
1122324
1122580
1122836
1123092
1123348
1123604
1123860
1124116
1124372
1124628
1124884
1125140
1125396
1125652
1125908
1126164
1126420
1126676
1126932
1127188
1127444
1127700
1127956
1128212
1128468
1128724
1128980
1129236
1129492
1129748
1130004
1130260
1114133
1114389
1114645
1114901
1115157
1115413
1115669
1115925
1116181
1116437
1116693
1116949
1117205
1117461
1117717
1117973
1118229
1118485
1118741
1118997
1119253
1119509
1119765
1120021
1120277
1120533
1120789
1121045
1121301
1121557
1121813
1122069
1122325
1122581
1122837
1123093
1123349
1123605
1123861
1124117
1124373
1124629
1124885
1125141
1125397
1125653
1125909
1126165
1126421
1126677
1126933
1127189
1127445
1127701
1127957
1128213
1128469
1128725
1128981
1129237
1129493
1129749
1130005
1130261
1114134
1114390
1114646
1114902
1115158
1115414
1115670
1115926
1116182
1116438
1116694
1116950
1117206
1117462
1117718
1117974
1118230
1118486
1118742
1118998
1119254
1119510
1119766
1120022
1120278
1120534
1120790
1121046
1121302
1121558
1121814
1122070
1122326
1122582
1122838
1123094
1123350
1123606
1123862
1124118
1124374
1124630
1124886
1125142
1125398
1125654
1125910
1126166
1126422
1126678
1126934
1127190
1127446
1127702
1127958
1128214
1128470
1128726
1128982
1129238
1129494
1129750
1130006
1130262
1114135
1114391
1114647
1114903
1115159
1115415
1115671
1115927
1116183
1116439
1116695
1116951
1117207
1117463
1117719
1117975
1118231
1118487
1118743
1118999
1119255
1119511
1119767
1120023
1120279
1120535
1120791
1121047
1121303
1121559
1121815
1122071
1122327
1122583
1122839
1123095
1123351
1123607
1123863
1124119
1124375
1124631
1124887
1125143
1125399
1125655
1125911
1126167
1126423
1126679
1126935
1127191
1127447
1127703
1127959
1128215
1128471
1128727
1128983
1129239
1129495
1129751
1130007
1130263
1114136
1114392
1114648
1114904
1115160
1115416
1115672
1115928
1116184
1116440
1116696
1116952
1117208
1117464
1117720
1117976
1118232
1118488
1118744
1119000
1119256
1119512
1119768
1120024
1120280
1120536
1120792
1121048
1121304
1121560
1121816
1122072
1122328
1122584
1122840
1123096
1123352
1123608
1123864
1124120
1124376
1124632
1124888
1125144
1125400
1125656
1125912
1126168
1126424
1126680
1126936
1127192
1127448
1127704
1127960
1128216
1128472
1128728
1128984
1129240
1129496
1129752
1130008
1130264
1114137
1114393
1114649
1114905
1115161
1115417
1115673
1115929
1116185
1116441
1116697
1116953
1117209
1117465
1117721
1117977
1118233
1118489
1118745
1119001
1119257
1119513
1119769
1120025
1120281
1120537
1120793
1121049
1121305
1121561
1121817
1122073
1122329
1122585
1122841
1123097
1123353
1123609
1123865
1124121
1124377
1124633
1124889
1125145
1125401
1125657
1125913
1126169
1126425
1126681
1126937
1127193
1127449
1127705
1127961
1128217
1128473
1128729
1128985
1129241
1129497
1129753
1130009
1130265
1114138
1114394
1114650
1114906
1115162
1115418
1115674
1115930
1116186
1116442
1116698
1116954
1117210
1117466
1117722
1117978
1118234
1118490
1118746
1119002
1119258
1119514
1119770
1120026
1120282
1120538
1120794
1121050
1121306
1121562
1121818
1122074
1122330
1122586
1122842
1123098
1123354
1123610
1123866
1124122
1124378
1124634
1124890
1125146
1125402
1125658
1125914
1126170
1126426
1126682
1126938
1127194
1127450
1127706
1127962
1128218
1128474
1128730
1128986
1129242
1129498
1129754
1130010
1130266
1114139
1114395
1114651
1114907
1115163
1115419
1115675
1115931
1116187
1116443
1116699
1116955
1117211
1117467
1117723
1117979
1118235
1118491
1118747
1119003
1119259
1119515
1119771
1120027
1120283
1120539
1120795
1121051
1121307
1121563
1121819
1122075
1122331
1122587
1122843
1123099
1123355
1123611
1123867
1124123
1124379
1124635
1124891
1125147
1125403
1125659
1125915
1126171
1126427
1126683
1126939
1127195
1127451
1127707
1127963
1128219
1128475
1128731
1128987
1129243
1129499
1129755
1130011
1130267
1114140
1114396
1114652
1114908
1115164
1115420
1115676
1115932
1116188
1116444
1116700
1116956
1117212
1117468
1117724
1117980
1118236
1118492
1118748
1119004
1119260
1119516
1119772
1120028
1120284
1120540
1120796
1121052
1121308
1121564
1121820
1122076
1122332
1122588
1122844
1123100
1123356
1123612
1123868
1124124
1124380
1124636
1124892
1125148
1125404
1125660
1125916
1126172
1126428
1126684
1126940
1127196
1127452
1127708
1127964
1128220
1128476
1128732
1128988
1129244
1129500
1129756
1130012
1130268
1114141
1114397
1114653
1114909
1115165
1115421
1115677
1115933
1116189
1116445
1116701
1116957
1117213
1117469
1117725
1117981
1118237
1118493
1118749
1119005
1119261
1119517
1119773
1120029
1120285
1120541
1120797
1121053
1121309
1121565
1121821
1122077
1122333
1122589
1122845
1123101
1123357
1123613
1123869
1124125
1124381
1124637
1124893
1125149
1125405
1125661
1125917
1126173
1126429
1126685
1126941
1127197
1127453
1127709
1127965
1128221
1128477
1128733
1128989
1129245
1129501
1129757
1130013
1130269
1114142
1114398
1114654
1114910
1115166
1115422
1115678
1115934
1116190
1116446
1116702
1116958
1117214
1117470
1117726
1117982
1118238
1118494
1118750
1119006
1119262
1119518
1119774
1120030
1120286
1120542
1120798
1121054
1121310
1121566
1121822
1122078
1122334
1122590
1122846
1123102
1123358
1123614
1123870
1124126
1124382
1124638
1124894
1125150
1125406
1125662
1125918
1126174
1126430
1126686
1126942
1127198
1127454
1127710
1127966
1128222
1128478
1128734
1128990
1129246
1129502
1129758
1130014
1130270
1114143
1114399
1114655
1114911
1115167
1115423
1115679
1115935
1116191
1116447
1116703
1116959
1117215
1117471
1117727
1117983
1118239
1118495
1118751
1119007
1119263
1119519
1119775
1120031
1120287
1120543
1120799
1121055
1121311
1121567
1121823
1122079
1122335
1122591
1122847
1123103
1123359
1123615
1123871
1124127
1124383
1124639
1124895
1125151
1125407
1125663
1125919
1126175
1126431
1126687
1126943
1127199
1127455
1127711
1127967
1128223
1128479
1128735
1128991
1129247
1129503
1129759
1130015
1130271
1114144
1114400
1114656
1114912
1115168
1115424
1115680
1115936
1116192
1116448
1116704
1116960
1117216
1117472
1117728
1117984
1118240
1118496
1118752
1119008
1119264
1119520
1119776
1120032
1120288
1120544
1120800
1121056
1121312
1121568
1121824
1122080
1122336
1122592
1122848
1123104
1123360
1123616
1123872
1124128
1124384
1124640
1124896
1125152
1125408
1125664
1125920
1126176
1126432
1126688
1126944
1127200
1127456
1127712
1127968
1128224
1128480
1128736
1128992
1129248
1129504
1129760
1130016
1130272
1114145
1114401
1114657
1114913
1115169
1115425
1115681
1115937
1116193
1116449
1116705
1116961
1117217
1117473
1117729
1117985
1118241
1118497
1118753
1119009
1119265
1119521
1119777
1120033
1120289
1120545
1120801
1121057
1121313
1121569
1121825
1122081
1122337
1122593
1122849
1123105
1123361
1123617
1123873
1124129
1124385
1124641
1124897
1125153
1125409
1125665
1125921
1126177
1126433
1126689
1126945
1127201
1127457
1127713
1127969
1128225
1128481
1128737
1128993
1129249
1129505
1129761
1130017
1130273
1114146
1114402
1114658
1114914
1115170
1115426
1115682
1115938
1116194
1116450
1116706
1116962
1117218
1117474
1117730
1117986
1118242
1118498
1118754
1119010
1119266
1119522
1119778
1120034
1120290
1120546
1120802
1121058
1121314
1121570
1121826
1122082
1122338
1122594
1122850
1123106
1123362
1123618
1123874
1124130
1124386
1124642
1124898
1125154
1125410
1125666
1125922
1126178
1126434
1126690
1126946
1127202
1127458
1127714
1127970
1128226
1128482
1128738
1128994
1129250
1129506
1129762
1130018
1130274
1114147
1114403
1114659
1114915
1115171
1115427
1115683
1115939
1116195
1116451
1116707
1116963
1117219
1117475
1117731
1117987
1118243
1118499
1118755
1119011
1119267
1119523
1119779
1120035
1120291
1120547
1120803
1121059
1121315
1121571
1121827
1122083
1122339
1122595
1122851
1123107
1123363
1123619
1123875
1124131
1124387
1124643
1124899
1125155
1125411
1125667
1125923
1126179
1126435
1126691
1126947
1127203
1127459
1127715
1127971
1128227
1128483
1128739
1128995
1129251
1129507
1129763
1130019
1130275
1114148
1114404
1114660
1114916
1115172
1115428
1115684
1115940
1116196
1116452
1116708
1116964
1117220
1117476
1117732
1117988
1118244
1118500
1118756
1119012
1119268
1119524
1119780
1120036
1120292
1120548
1120804
1121060
1121316
1121572
1121828
1122084
1122340
1122596
1122852
1123108
1123364
1123620
1123876
1124132
1124388
1124644
1124900
1125156
1125412
1125668
1125924
1126180
1126436
1126692
1126948
1127204
1127460
1127716
1127972
1128228
1128484
1128740
1128996
1129252
1129508
1129764
1130020
1130276
1114149
1114405
1114661
1114917
1115173
1115429
1115685
1115941
1116197
1116453
1116709
1116965
1117221
1117477
1117733
1117989
1118245
1118501
1118757
1119013
1119269
1119525
1119781
1120037
1120293
1120549
1120805
1121061
1121317
1121573
1121829
1122085
1122341
1122597
1122853
1123109
1123365
1123621
1123877
1124133
1124389
1124645
1124901
1125157
1125413
1125669
1125925
1126181
1126437
1126693
1126949
1127205
1127461
1127717
1127973
1128229
1128485
1128741
1128997
1129253
1129509
1129765
1130021
1130277
1114150
1114406
1114662
1114918
1115174
1115430
1115686
1115942
1116198
1116454
1116710
1116966
1117222
1117478
1117734
1117990
1118246
1118502
1118758
1119014
1119270
1119526
1119782
1120038
1120294
1120550
1120806
1121062
1121318
1121574
1121830
1122086
1122342
1122598
1122854
1123110
1123366
1123622
1123878
1124134
1124390
1124646
1124902
1125158
1125414
1125670
1125926
1126182
1126438
1126694
1126950
1127206
1127462
1127718
1127974
1128230
1128486
1128742
1128998
1129254
1129510
1129766
1130022
1130278
1114151
1114407
1114663
1114919
1115175
1115431
1115687
1115943
1116199
1116455
1116711
1116967
1117223
1117479
1117735
1117991
1118247
1118503
1118759
1119015
1119271
1119527
1119783
1120039
1120295
1120551
1120807
1121063
1121319
1121575
1121831
1122087
1122343
1122599
1122855
1123111
1123367
1123623
1123879
1124135
1124391
1124647
1124903
1125159
1125415
1125671
1125927
1126183
1126439
1126695
1126951
1127207
1127463
1127719
1127975
1128231
1128487
1128743
1128999
1129255
1129511
1129767
1130023
1130279
1114152
1114408
1114664
1114920
1115176
1115432
1115688
1115944
1116200
1116456
1116712
1116968
1117224
1117480
1117736
1117992
1118248
1118504
1118760
1119016
1119272
1119528
1119784
1120040
1120296
1120552
1120808
1121064
1121320
1121576
1121832
1122088
1122344
1122600
1122856
1123112
1123368
1123624
1123880
1124136
1124392
1124648
1124904
1125160
1125416
1125672
1125928
1126184
1126440
1126696
1126952
1127208
1127464
1127720
1127976
1128232
1128488
1128744
1129000
1129256
1129512
1129768
1130024
1130280
1114153
1114409
1114665
1114921
1115177
1115433
1115689
1115945
1116201
1116457
1116713
1116969
1117225
1117481
1117737
1117993
1118249
1118505
1118761
1119017
1119273
1119529
1119785
1120041
1120297
1120553
1120809
1121065
1121321
1121577
1121833
1122089
1122345
1122601
1122857
1123113
1123369
1123625
1123881
1124137
1124393
1124649
1124905
1125161
1125417
1125673
1125929
1126185
1126441
1126697
1126953
1127209
1127465
1127721
1127977
1128233
1128489
1128745
1129001
1129257
1129513
1129769
1130025
1130281
1114154
1114410
1114666
1114922
1115178
1115434
1115690
1115946
1116202
1116458
1116714
1116970
1117226
1117482
1117738
1117994
1118250
1118506
1118762
1119018
1119274
1119530
1119786
1120042
1120298
1120554
1120810
1121066
1121322
1121578
1121834
1122090
1122346
1122602
1122858
1123114
1123370
1123626
1123882
1124138
1124394
1124650
1124906
1125162
1125418
1125674
1125930
1126186
1126442
1126698
1126954
1127210
1127466
1127722
1127978
1128234
1128490
1128746
1129002
1129258
1129514
1129770
1130026
1130282
1114155
1114411
1114667
1114923
1115179
1115435
1115691
1115947
1116203
1116459
1116715
1116971
1117227
1117483
1117739
1117995
1118251
1118507
1118763
1119019
1119275
1119531
1119787
1120043
1120299
1120555
1120811
1121067
1121323
1121579
1121835
1122091
1122347
1122603
1122859
1123115
1123371
1123627
1123883
1124139
1124395
1124651
1124907
1125163
1125419
1125675
1125931
1126187
1126443
1126699
1126955
1127211
1127467
1127723
1127979
1128235
1128491
1128747
1129003
1129259
1129515
1129771
1130027
1130283
1114156
1114412
1114668
1114924
1115180
1115436
1115692
1115948
1116204
1116460
1116716
1116972
1117228
1117484
1117740
1117996
1118252
1118508
1118764
1119020
1119276
1119532
1119788
1120044
1120300
1120556
1120812
1121068
1121324
1121580
1121836
1122092
1122348
1122604
1122860
1123116
1123372
1123628
1123884
1124140
1124396
1124652
1124908
1125164
1125420
1125676
1125932
1126188
1126444
1126700
1126956
1127212
1127468
1127724
1127980
1128236
1128492
1128748
1129004
1129260
1129516
1129772
1130028
1130284
1114157
1114413
1114669
1114925
1115181
1115437
1115693
1115949
1116205
1116461
1116717
1116973
1117229
1117485
1117741
1117997
1118253
1118509
1118765
1119021
1119277
1119533
1119789
1120045
1120301
1120557
1120813
1121069
1121325
1121581
1121837
1122093
1122349
1122605
1122861
1123117
1123373
1123629
1123885
1124141
1124397
1124653
1124909
1125165
1125421
1125677
1125933
1126189
1126445
1126701
1126957
1127213
1127469
1127725
1127981
1128237
1128493
1128749
1129005
1129261
1129517
1129773
1130029
1130285
1114158
1114414
1114670
1114926
1115182
1115438
1115694
1115950
1116206
1116462
1116718
1116974
1117230
1117486
1117742
1117998
1118254
1118510
1118766
1119022
1119278
1119534
1119790
1120046
1120302
1120558
1120814
1121070
1121326
1121582
1121838
1122094
1122350
1122606
1122862
1123118
1123374
1123630
1123886
1124142
1124398
1124654
1124910
1125166
1125422
1125678
1125934
1126190
1126446
1126702
1126958
1127214
1127470
1127726
1127982
1128238
1128494
1128750
1129006
1129262
1129518
1129774
1130030
1130286
1114159
1114415
1114671
1114927
1115183
1115439
1115695
1115951
1116207
1116463
1116719
1116975
1117231
1117487
1117743
1117999
1118255
1118511
1118767
1119023
1119279
1119535
1119791
1120047
1120303
1120559
1120815
1121071
1121327
1121583
1121839
1122095
1122351
1122607
1122863
1123119
1123375
1123631
1123887
1124143
1124399
1124655
1124911
1125167
1125423
1125679
1125935
1126191
1126447
1126703
1126959
1127215
1127471
1127727
1127983
1128239
1128495
1128751
1129007
1129263
1129519
1129775
1130031
1130287
1114160
1114416
1114672
1114928
1115184
1115440
1115696
1115952
1116208
1116464
1116720
1116976
1117232
1117488
1117744
1118000
1118256
1118512
1118768
1119024
1119280
1119536
1119792
1120048
1120304
1120560
1120816
1121072
1121328
1121584
1121840
1122096
1122352
1122608
1122864
1123120
1123376
1123632
1123888
1124144
1124400
1124656
1124912
1125168
1125424
1125680
1125936
1126192
1126448
1126704
1126960
1127216
1127472
1127728
1127984
1128240
1128496
1128752
1129008
1129264
1129520
1129776
1130032
1130288
1114161
1114417
1114673
1114929
1115185
1115441
1115697
1115953
1116209
1116465
1116721
1116977
1117233
1117489
1117745
1118001
1118257
1118513
1118769
1119025
1119281
1119537
1119793
1120049
1120305
1120561
1120817
1121073
1121329
1121585
1121841
1122097
1122353
1122609
1122865
1123121
1123377
1123633
1123889
1124145
1124401
1124657
1124913
1125169
1125425
1125681
1125937
1126193
1126449
1126705
1126961
1127217
1127473
1127729
1127985
1128241
1128497
1128753
1129009
1129265
1129521
1129777
1130033
1130289
1114162
1114418
1114674
1114930
1115186
1115442
1115698
1115954
1116210
1116466
1116722
1116978
1117234
1117490
1117746
1118002
1118258
1118514
1118770
1119026
1119282
1119538
1119794
1120050
1120306
1120562
1120818
1121074
1121330
1121586
1121842
1122098
1122354
1122610
1122866
1123122
1123378
1123634
1123890
1124146
1124402
1124658
1124914
1125170
1125426
1125682
1125938
1126194
1126450
1126706
1126962
1127218
1127474
1127730
1127986
1128242
1128498
1128754
1129010
1129266
1129522
1129778
1130034
1130290
1114163
1114419
1114675
1114931
1115187
1115443
1115699
1115955
1116211
1116467
1116723
1116979
1117235
1117491
1117747
1118003
1118259
1118515
1118771
1119027
1119283
1119539
1119795
1120051
1120307
1120563
1120819
1121075
1121331
1121587
1121843
1122099
1122355
1122611
1122867
1123123
1123379
1123635
1123891
1124147
1124403
1124659
1124915
1125171
1125427
1125683
1125939
1126195
1126451
1126707
1126963
1127219
1127475
1127731
1127987
1128243
1128499
1128755
1129011
1129267
1129523
1129779
1130035
1130291
1114164
1114420
1114676
1114932
1115188
1115444
1115700
1115956
1116212
1116468
1116724
1116980
1117236
1117492
1117748
1118004
1118260
1118516
1118772
1119028
1119284
1119540
1119796
1120052
1120308
1120564
1120820
1121076
1121332
1121588
1121844
1122100
1122356
1122612
1122868
1123124
1123380
1123636
1123892
1124148
1124404
1124660
1124916
1125172
1125428
1125684
1125940
1126196
1126452
1126708
1126964
1127220
1127476
1127732
1127988
1128244
1128500
1128756
1129012
1129268
1129524
1129780
1130036
1130292
1114165
1114421
1114677
1114933
1115189
1115445
1115701
1115957
1116213
1116469
1116725
1116981
1117237
1117493
1117749
1118005
1118261
1118517
1118773
1119029
1119285
1119541
1119797
1120053
1120309
1120565
1120821
1121077
1121333
1121589
1121845
1122101
1122357
1122613
1122869
1123125
1123381
1123637
1123893
1124149
1124405
1124661
1124917
1125173
1125429
1125685
1125941
1126197
1126453
1126709
1126965
1127221
1127477
1127733
1127989
1128245
1128501
1128757
1129013
1129269
1129525
1129781
1130037
1130293
1114166
1114422
1114678
1114934
1115190
1115446
1115702
1115958
1116214
1116470
1116726
1116982
1117238
1117494
1117750
1118006
1118262
1118518
1118774
1119030
1119286
1119542
1119798
1120054
1120310
1120566
1120822
1121078
1121334
1121590
1121846
1122102
1122358
1122614
1122870
1123126
1123382
1123638
1123894
1124150
1124406
1124662
1124918
1125174
1125430
1125686
1125942
1126198
1126454
1126710
1126966
1127222
1127478
1127734
1127990
1128246
1128502
1128758
1129014
1129270
1129526
1129782
1130038
1130294
1114167
1114423
1114679
1114935
1115191
1115447
1115703
1115959
1116215
1116471
1116727
1116983
1117239
1117495
1117751
1118007
1118263
1118519
1118775
1119031
1119287
1119543
1119799
1120055
1120311
1120567
1120823
1121079
1121335
1121591
1121847
1122103
1122359
1122615
1122871
1123127
1123383
1123639
1123895
1124151
1124407
1124663
1124919
1125175
1125431
1125687
1125943
1126199
1126455
1126711
1126967
1127223
1127479
1127735
1127991
1128247
1128503
1128759
1129015
1129271
1129527
1129783
1130039
1130295
1114168
1114424
1114680
1114936
1115192
1115448
1115704
1115960
1116216
1116472
1116728
1116984
1117240
1117496
1117752
1118008
1118264
1118520
1118776
1119032
1119288
1119544
1119800
1120056
1120312
1120568
1120824
1121080
1121336
1121592
1121848
1122104
1122360
1122616
1122872
1123128
1123384
1123640
1123896
1124152
1124408
1124664
1124920
1125176
1125432
1125688
1125944
1126200
1126456
1126712
1126968
1127224
1127480
1127736
1127992
1128248
1128504
1128760
1129016
1129272
1129528
1129784
1130040
1130296
1114169
1114425
1114681
1114937
1115193
1115449
1115705
1115961
1116217
1116473
1116729
1116985
1117241
1117497
1117753
1118009
1118265
1118521
1118777
1119033
1119289
1119545
1119801
1120057
1120313
1120569
1120825
1121081
1121337
1121593
1121849
1122105
1122361
1122617
1122873
1123129
1123385
1123641
1123897
1124153
1124409
1124665
1124921
1125177
1125433
1125689
1125945
1126201
1126457
1126713
1126969
1127225
1127481
1127737
1127993
1128249
1128505
1128761
1129017
1129273
1129529
1129785
1130041
1130297
1114170
1114426
1114682
1114938
1115194
1115450
1115706
1115962
1116218
1116474
1116730
1116986
1117242
1117498
1117754
1118010
1118266
1118522
1118778
1119034
1119290
1119546
1119802
1120058
1120314
1120570
1120826
1121082
1121338
1121594
1121850
1122106
1122362
1122618
1122874
1123130
1123386
1123642
1123898
1124154
1124410
1124666
1124922
1125178
1125434
1125690
1125946
1126202
1126458
1126714
1126970
1127226
1127482
1127738
1127994
1128250
1128506
1128762
1129018
1129274
1129530
1129786
1130042
1130298
1114171
1114427
1114683
1114939
1115195
1115451
1115707
1115963
1116219
1116475
1116731
1116987
1117243
1117499
1117755
1118011
1118267
1118523
1118779
1119035
1119291
1119547
1119803
1120059
1120315
1120571
1120827
1121083
1121339
1121595
1121851
1122107
1122363
1122619
1122875
1123131
1123387
1123643
1123899
1124155
1124411
1124667
1124923
1125179
1125435
1125691
1125947
1126203
1126459
1126715
1126971
1127227
1127483
1127739
1127995
1128251
1128507
1128763
1129019
1129275
1129531
1129787
1130043
1130299
1114172
1114428
1114684
1114940
1115196
1115452
1115708
1115964
1116220
1116476
1116732
1116988
1117244
1117500
1117756
1118012
1118268
1118524
1118780
1119036
1119292
1119548
1119804
1120060
1120316
1120572
1120828
1121084
1121340
1121596
1121852
1122108
1122364
1122620
1122876
1123132
1123388
1123644
1123900
1124156
1124412
1124668
1124924
1125180
1125436
1125692
1125948
1126204
1126460
1126716
1126972
1127228
1127484
1127740
1127996
1128252
1128508
1128764
1129020
1129276
1129532
1129788
1130044
1130300
1114173
1114429
1114685
1114941
1115197
1115453
1115709
1115965
1116221
1116477
1116733
1116989
1117245
1117501
1117757
1118013
1118269
1118525
1118781
1119037
1119293
1119549
1119805
1120061
1120317
1120573
1120829
1121085
1121341
1121597
1121853
1122109
1122365
1122621
1122877
1123133
1123389
1123645
1123901
1124157
1124413
1124669
1124925
1125181
1125437
1125693
1125949
1126205
1126461
1126717
1126973
1127229
1127485
1127741
1127997
1128253
1128509
1128765
1129021
1129277
1129533
1129789
1130045
1130301
1114174
1114430
1114686
1114942
1115198
1115454
1115710
1115966
1116222
1116478
1116734
1116990
1117246
1117502
1117758
1118014
1118270
1118526
1118782
1119038
1119294
1119550
1119806
1120062
1120318
1120574
1120830
1121086
1121342
1121598
1121854
1122110
1122366
1122622
1122878
1123134
1123390
1123646
1123902
1124158
1124414
1124670
1124926
1125182
1125438
1125694
1125950
1126206
1126462
1126718
1126974
1127230
1127486
1127742
1127998
1128254
1128510
1128766
1129022
1129278
1129534
1129790
1130046
1130302
1114175
1114431
1114687
1114943
1115199
1115455
1115711
1115967
1116223
1116479
1116735
1116991
1117247
1117503
1117759
1118015
1118271
1118527
1118783
1119039
1119295
1119551
1119807
1120063
1120319
1120575
1120831
1121087
1121343
1121599
1121855
1122111
1122367
1122623
1122879
1123135
1123391
1123647
1123903
1124159
1124415
1124671
1124927
1125183
1125439
1125695
1125951
1126207
1126463
1126719
1126975
1127231
1127487
1127743
1127999
1128255
1128511
1128767
1129023
1129279
1129535
1129791
1130047
1130303
1114176
1114432
1114688
1114944
1115200
1115456
1115712
1115968
1116224
1116480
1116736
1116992
1117248
1117504
1117760
1118016
1118272
1118528
1118784
1119040
1119296
1119552
1119808
1120064
1120320
1120576
1120832
1121088
1121344
1121600
1121856
1122112
1122368
1122624
1122880
1123136
1123392
1123648
1123904
1124160
1124416
1124672
1124928
1125184
1125440
1125696
1125952
1126208
1126464
1126720
1126976
1127232
1127488
1127744
1128000
1128256
1128512
1128768
1129024
1129280
1129536
1129792
1130048
1130304
1114177
1114433
1114689
1114945
1115201
1115457
1115713
1115969
1116225
1116481
1116737
1116993
1117249
1117505
1117761
1118017
1118273
1118529
1118785
1119041
1119297
1119553
1119809
1120065
1120321
1120577
1120833
1121089
1121345
1121601
1121857
1122113
1122369
1122625
1122881
1123137
1123393
1123649
1123905
1124161
1124417
1124673
1124929
1125185
1125441
1125697
1125953
1126209
1126465
1126721
1126977
1127233
1127489
1127745
1128001
1128257
1128513
1128769
1129025
1129281
1129537
1129793
1130049
1130305
1114178
1114434
1114690
1114946
1115202
1115458
1115714
1115970
1116226
1116482
1116738
1116994
1117250
1117506
1117762
1118018
1118274
1118530
1118786
1119042
1119298
1119554
1119810
1120066
1120322
1120578
1120834
1121090
1121346
1121602
1121858
1122114
1122370
1122626
1122882
1123138
1123394
1123650
1123906
1124162
1124418
1124674
1124930
1125186
1125442
1125698
1125954
1126210
1126466
1126722
1126978
1127234
1127490
1127746
1128002
1128258
1128514
1128770
1129026
1129282
1129538
1129794
1130050
1130306
1114179
1114435
1114691
1114947
1115203
1115459
1115715
1115971
1116227
1116483
1116739
1116995
1117251
1117507
1117763
1118019
1118275
1118531
1118787
1119043
1119299
1119555
1119811
1120067
1120323
1120579
1120835
1121091
1121347
1121603
1121859
1122115
1122371
1122627
1122883
1123139
1123395
1123651
1123907
1124163
1124419
1124675
1124931
1125187
1125443
1125699
1125955
1126211
1126467
1126723
1126979
1127235
1127491
1127747
1128003
1128259
1128515
1128771
1129027
1129283
1129539
1129795
1130051
1130307
1114180
1114436
1114692
1114948
1115204
1115460
1115716
1115972
1116228
1116484
1116740
1116996
1117252
1117508
1117764
1118020
1118276
1118532
1118788
1119044
1119300
1119556
1119812
1120068
1120324
1120580
1120836
1121092
1121348
1121604
1121860
1122116
1122372
1122628
1122884
1123140
1123396
1123652
1123908
1124164
1124420
1124676
1124932
1125188
1125444
1125700
1125956
1126212
1126468
1126724
1126980
1127236
1127492
1127748
1128004
1128260
1128516
1128772
1129028
1129284
1129540
1129796
1130052
1130308
1114181
1114437
1114693
1114949
1115205
1115461
1115717
1115973
1116229
1116485
1116741
1116997
1117253
1117509
1117765
1118021
1118277
1118533
1118789
1119045
1119301
1119557
1119813
1120069
1120325
1120581
1120837
1121093
1121349
1121605
1121861
1122117
1122373
1122629
1122885
1123141
1123397
1123653
1123909
1124165
1124421
1124677
1124933
1125189
1125445
1125701
1125957
1126213
1126469
1126725
1126981
1127237
1127493
1127749
1128005
1128261
1128517
1128773
1129029
1129285
1129541
1129797
1130053
1130309
1114182
1114438
1114694
1114950
1115206
1115462
1115718
1115974
1116230
1116486
1116742
1116998
1117254
1117510
1117766
1118022
1118278
1118534
1118790
1119046
1119302
1119558
1119814
1120070
1120326
1120582
1120838
1121094
1121350
1121606
1121862
1122118
1122374
1122630
1122886
1123142
1123398
1123654
1123910
1124166
1124422
1124678
1124934
1125190
1125446
1125702
1125958
1126214
1126470
1126726
1126982
1127238
1127494
1127750
1128006
1128262
1128518
1128774
1129030
1129286
1129542
1129798
1130054
1130310
1114183
1114439
1114695
1114951
1115207
1115463
1115719
1115975
1116231
1116487
1116743
1116999
1117255
1117511
1117767
1118023
1118279
1118535
1118791
1119047
1119303
1119559
1119815
1120071
1120327
1120583
1120839
1121095
1121351
1121607
1121863
1122119
1122375
1122631
1122887
1123143
1123399
1123655
1123911
1124167
1124423
1124679
1124935
1125191
1125447
1125703
1125959
1126215
1126471
1126727
1126983
1127239
1127495
1127751
1128007
1128263
1128519
1128775
1129031
1129287
1129543
1129799
1130055
1130311
1114184
1114440
1114696
1114952
1115208
1115464
1115720
1115976
1116232
1116488
1116744
1117000
1117256
1117512
1117768
1118024
1118280
1118536
1118792
1119048
1119304
1119560
1119816
1120072
1120328
1120584
1120840
1121096
1121352
1121608
1121864
1122120
1122376
1122632
1122888
1123144
1123400
1123656
1123912
1124168
1124424
1124680
1124936
1125192
1125448
1125704
1125960
1126216
1126472
1126728
1126984
1127240
1127496
1127752
1128008
1128264
1128520
1128776
1129032
1129288
1129544
1129800
1130056
1130312
1114185
1114441
1114697
1114953
1115209
1115465
1115721
1115977
1116233
1116489
1116745
1117001
1117257
1117513
1117769
1118025
1118281
1118537
1118793
1119049
1119305
1119561
1119817
1120073
1120329
1120585
1120841
1121097
1121353
1121609
1121865
1122121
1122377
1122633
1122889
1123145
1123401
1123657
1123913
1124169
1124425
1124681
1124937
1125193
1125449
1125705
1125961
1126217
1126473
1126729
1126985
1127241
1127497
1127753
1128009
1128265
1128521
1128777
1129033
1129289
1129545
1129801
1130057
1130313
1114186
1114442
1114698
1114954
1115210
1115466
1115722
1115978
1116234
1116490
1116746
1117002
1117258
1117514
1117770
1118026
1118282
1118538
1118794
1119050
1119306
1119562
1119818
1120074
1120330
1120586
1120842
1121098
1121354
1121610
1121866
1122122
1122378
1122634
1122890
1123146
1123402
1123658
1123914
1124170
1124426
1124682
1124938
1125194
1125450
1125706
1125962
1126218
1126474
1126730
1126986
1127242
1127498
1127754
1128010
1128266
1128522
1128778
1129034
1129290
1129546
1129802
1130058
1130314
1114187
1114443
1114699
1114955
1115211
1115467
1115723
1115979
1116235
1116491
1116747
1117003
1117259
1117515
1117771
1118027
1118283
1118539
1118795
1119051
1119307
1119563
1119819
1120075
1120331
1120587
1120843
1121099
1121355
1121611
1121867
1122123
1122379
1122635
1122891
1123147
1123403
1123659
1123915
1124171
1124427
1124683
1124939
1125195
1125451
1125707
1125963
1126219
1126475
1126731
1126987
1127243
1127499
1127755
1128011
1128267
1128523
1128779
1129035
1129291
1129547
1129803
1130059
1130315
1114188
1114444
1114700
1114956
1115212
1115468
1115724
1115980
1116236
1116492
1116748
1117004
1117260
1117516
1117772
1118028
1118284
1118540
1118796
1119052
1119308
1119564
1119820
1120076
1120332
1120588
1120844
1121100
1121356
1121612
1121868
1122124
1122380
1122636
1122892
1123148
1123404
1123660
1123916
1124172
1124428
1124684
1124940
1125196
1125452
1125708
1125964
1126220
1126476
1126732
1126988
1127244
1127500
1127756
1128012
1128268
1128524
1128780
1129036
1129292
1129548
1129804
1130060
1130316
1114189
1114445
1114701
1114957
1115213
1115469
1115725
1115981
1116237
1116493
1116749
1117005
1117261
1117517
1117773
1118029
1118285
1118541
1118797
1119053
1119309
1119565
1119821
1120077
1120333
1120589
1120845
1121101
1121357
1121613
1121869
1122125
1122381
1122637
1122893
1123149
1123405
1123661
1123917
1124173
1124429
1124685
1124941
1125197
1125453
1125709
1125965
1126221
1126477
1126733
1126989
1127245
1127501
1127757
1128013
1128269
1128525
1128781
1129037
1129293
1129549
1129805
1130061
1130317
1114190
1114446
1114702
1114958
1115214
1115470
1115726
1115982
1116238
1116494
1116750
1117006
1117262
1117518
1117774
1118030
1118286
1118542
1118798
1119054
1119310
1119566
1119822
1120078
1120334
1120590
1120846
1121102
1121358
1121614
1121870
1122126
1122382
1122638
1122894
1123150
1123406
1123662
1123918
1124174
1124430
1124686
1124942
1125198
1125454
1125710
1125966
1126222
1126478
1126734
1126990
1127246
1127502
1127758
1128014
1128270
1128526
1128782
1129038
1129294
1129550
1129806
1130062
1130318
1114191
1114447
1114703
1114959
1115215
1115471
1115727
1115983
1116239
1116495
1116751
1117007
1117263
1117519
1117775
1118031
1118287
1118543
1118799
1119055
1119311
1119567
1119823
1120079
1120335
1120591
1120847
1121103
1121359
1121615
1121871
1122127
1122383
1122639
1122895
1123151
1123407
1123663
1123919
1124175
1124431
1124687
1124943
1125199
1125455
1125711
1125967
1126223
1126479
1126735
1126991
1127247
1127503
1127759
1128015
1128271
1128527
1128783
1129039
1129295
1129551
1129807
1130063
1130319
1114192
1114448
1114704
1114960
1115216
1115472
1115728
1115984
1116240
1116496
1116752
1117008
1117264
1117520
1117776
1118032
1118288
1118544
1118800
1119056
1119312
1119568
1119824
1120080
1120336
1120592
1120848
1121104
1121360
1121616
1121872
1122128
1122384
1122640
1122896
1123152
1123408
1123664
1123920
1124176
1124432
1124688
1124944
1125200
1125456
1125712
1125968
1126224
1126480
1126736
1126992
1127248
1127504
1127760
1128016
1128272
1128528
1128784
1129040
1129296
1129552
1129808
1130064
1130320
1114193
1114449
1114705
1114961
1115217
1115473
1115729
1115985
1116241
1116497
1116753
1117009
1117265
1117521
1117777
1118033
1118289
1118545
1118801
1119057
1119313
1119569
1119825
1120081
1120337
1120593
1120849
1121105
1121361
1121617
1121873
1122129
1122385
1122641
1122897
1123153
1123409
1123665
1123921
1124177
1124433
1124689
1124945
1125201
1125457
1125713
1125969
1126225
1126481
1126737
1126993
1127249
1127505
1127761
1128017
1128273
1128529
1128785
1129041
1129297
1129553
1129809
1130065
1130321
1114194
1114450
1114706
1114962
1115218
1115474
1115730
1115986
1116242
1116498
1116754
1117010
1117266
1117522
1117778
1118034
1118290
1118546
1118802
1119058
1119314
1119570
1119826
1120082
1120338
1120594
1120850
1121106
1121362
1121618
1121874
1122130
1122386
1122642
1122898
1123154
1123410
1123666
1123922
1124178
1124434
1124690
1124946
1125202
1125458
1125714
1125970
1126226
1126482
1126738
1126994
1127250
1127506
1127762
1128018
1128274
1128530
1128786
1129042
1129298
1129554
1129810
1130066
1130322
1114195
1114451
1114707
1114963
1115219
1115475
1115731
1115987
1116243
1116499
1116755
1117011
1117267
1117523
1117779
1118035
1118291
1118547
1118803
1119059
1119315
1119571
1119827
1120083
1120339
1120595
1120851
1121107
1121363
1121619
1121875
1122131
1122387
1122643
1122899
1123155
1123411
1123667
1123923
1124179
1124435
1124691
1124947
1125203
1125459
1125715
1125971
1126227
1126483
1126739
1126995
1127251
1127507
1127763
1128019
1128275
1128531
1128787
1129043
1129299
1129555
1129811
1130067
1130323
1114196
1114452
1114708
1114964
1115220
1115476
1115732
1115988
1116244
1116500
1116756
1117012
1117268
1117524
1117780
1118036
1118292
1118548
1118804
1119060
1119316
1119572
1119828
1120084
1120340
1120596
1120852
1121108
1121364
1121620
1121876
1122132
1122388
1122644
1122900
1123156
1123412
1123668
1123924
1124180
1124436
1124692
1124948
1125204
1125460
1125716
1125972
1126228
1126484
1126740
1126996
1127252
1127508
1127764
1128020
1128276
1128532
1128788
1129044
1129300
1129556
1129812
1130068
1130324
1114197
1114453
1114709
1114965
1115221
1115477
1115733
1115989
1116245
1116501
1116757
1117013
1117269
1117525
1117781
1118037
1118293
1118549
1118805
1119061
1119317
1119573
1119829
1120085
1120341
1120597
1120853
1121109
1121365
1121621
1121877
1122133
1122389
1122645
1122901
1123157
1123413
1123669
1123925
1124181
1124437
1124693
1124949
1125205
1125461
1125717
1125973
1126229
1126485
1126741
1126997
1127253
1127509
1127765
1128021
1128277
1128533
1128789
1129045
1129301
1129557
1129813
1130069
1130325
1114198
1114454
1114710
1114966
1115222
1115478
1115734
1115990
1116246
1116502
1116758
1117014
1117270
1117526
1117782
1118038
1118294
1118550
1118806
1119062
1119318
1119574
1119830
1120086
1120342
1120598
1120854
1121110
1121366
1121622
1121878
1122134
1122390
1122646
1122902
1123158
1123414
1123670
1123926
1124182
1124438
1124694
1124950
1125206
1125462
1125718
1125974
1126230
1126486
1126742
1126998
1127254
1127510
1127766
1128022
1128278
1128534
1128790
1129046
1129302
1129558
1129814
1130070
1130326
1114199
1114455
1114711
1114967
1115223
1115479
1115735
1115991
1116247
1116503
1116759
1117015
1117271
1117527
1117783
1118039
1118295
1118551
1118807
1119063
1119319
1119575
1119831
1120087
1120343
1120599
1120855
1121111
1121367
1121623
1121879
1122135
1122391
1122647
1122903
1123159
1123415
1123671
1123927
1124183
1124439
1124695
1124951
1125207
1125463
1125719
1125975
1126231
1126487
1126743
1126999
1127255
1127511
1127767
1128023
1128279
1128535
1128791
1129047
1129303
1129559
1129815
1130071
1130327
1114200
1114456
1114712
1114968
1115224
1115480
1115736
1115992
1116248
1116504
1116760
1117016
1117272
1117528
1117784
1118040
1118296
1118552
1118808
1119064
1119320
1119576
1119832
1120088
1120344
1120600
1120856
1121112
1121368
1121624
1121880
1122136
1122392
1122648
1122904
1123160
1123416
1123672
1123928
1124184
1124440
1124696
1124952
1125208
1125464
1125720
1125976
1126232
1126488
1126744
1127000
1127256
1127512
1127768
1128024
1128280
1128536
1128792
1129048
1129304
1129560
1129816
1130072
1130328
1114201
1114457
1114713
1114969
1115225
1115481
1115737
1115993
1116249
1116505
1116761
1117017
1117273
1117529
1117785
1118041
1118297
1118553
1118809
1119065
1119321
1119577
1119833
1120089
1120345
1120601
1120857
1121113
1121369
1121625
1121881
1122137
1122393
1122649
1122905
1123161
1123417
1123673
1123929
1124185
1124441
1124697
1124953
1125209
1125465
1125721
1125977
1126233
1126489
1126745
1127001
1127257
1127513
1127769
1128025
1128281
1128537
1128793
1129049
1129305
1129561
1129817
1130073
1130329
1114202
1114458
1114714
1114970
1115226
1115482
1115738
1115994
1116250
1116506
1116762
1117018
1117274
1117530
1117786
1118042
1118298
1118554
1118810
1119066
1119322
1119578
1119834
1120090
1120346
1120602
1120858
1121114
1121370
1121626
1121882
1122138
1122394
1122650
1122906
1123162
1123418
1123674
1123930
1124186
1124442
1124698
1124954
1125210
1125466
1125722
1125978
1126234
1126490
1126746
1127002
1127258
1127514
1127770
1128026
1128282
1128538
1128794
1129050
1129306
1129562
1129818
1130074
1130330
1114203
1114459
1114715
1114971
1115227
1115483
1115739
1115995
1116251
1116507
1116763
1117019
1117275
1117531
1117787
1118043
1118299
1118555
1118811
1119067
1119323
1119579
1119835
1120091
1120347
1120603
1120859
1121115
1121371
1121627
1121883
1122139
1122395
1122651
1122907
1123163
1123419
1123675
1123931
1124187
1124443
1124699
1124955
1125211
1125467
1125723
1125979
1126235
1126491
1126747
1127003
1127259
1127515
1127771
1128027
1128283
1128539
1128795
1129051
1129307
1129563
1129819
1130075
1130331
1114204
1114460
1114716
1114972
1115228
1115484
1115740
1115996
1116252
1116508
1116764
1117020
1117276
1117532
1117788
1118044
1118300
1118556
1118812
1119068
1119324
1119580
1119836
1120092
1120348
1120604
1120860
1121116
1121372
1121628
1121884
1122140
1122396
1122652
1122908
1123164
1123420
1123676
1123932
1124188
1124444
1124700
1124956
1125212
1125468
1125724
1125980
1126236
1126492
1126748
1127004
1127260
1127516
1127772
1128028
1128284
1128540
1128796
1129052
1129308
1129564
1129820
1130076
1130332
1114205
1114461
1114717
1114973
1115229
1115485
1115741
1115997
1116253
1116509
1116765
1117021
1117277
1117533
1117789
1118045
1118301
1118557
1118813
1119069
1119325
1119581
1119837
1120093
1120349
1120605
1120861
1121117
1121373
1121629
1121885
1122141
1122397
1122653
1122909
1123165
1123421
1123677
1123933
1124189
1124445
1124701
1124957
1125213
1125469
1125725
1125981
1126237
1126493
1126749
1127005
1127261
1127517
1127773
1128029
1128285
1128541
1128797
1129053
1129309
1129565
1129821
1130077
1130333
1114206
1114462
1114718
1114974
1115230
1115486
1115742
1115998
1116254
1116510
1116766
1117022
1117278
1117534
1117790
1118046
1118302
1118558
1118814
1119070
1119326
1119582
1119838
1120094
1120350
1120606
1120862
1121118
1121374
1121630
1121886
1122142
1122398
1122654
1122910
1123166
1123422
1123678
1123934
1124190
1124446
1124702
1124958
1125214
1125470
1125726
1125982
1126238
1126494
1126750
1127006
1127262
1127518
1127774
1128030
1128286
1128542
1128798
1129054
1129310
1129566
1129822
1130078
1130334
1114207
1114463
1114719
1114975
1115231
1115487
1115743
1115999
1116255
1116511
1116767
1117023
1117279
1117535
1117791
1118047
1118303
1118559
1118815
1119071
1119327
1119583
1119839
1120095
1120351
1120607
1120863
1121119
1121375
1121631
1121887
1122143
1122399
1122655
1122911
1123167
1123423
1123679
1123935
1124191
1124447
1124703
1124959
1125215
1125471
1125727
1125983
1126239
1126495
1126751
1127007
1127263
1127519
1127775
1128031
1128287
1128543
1128799
1129055
1129311
1129567
1129823
1130079
1130335
1449984
1450240
1450496
1450752
1451008
1451264
1451520
1451776
1452032
1452288
1452544
1452800
1453056
1453312
1453568
1453824
1454080
1454336
1454592
1454848
1455104
1455360
1455616
1455872
1456128
1456384
1456640
1456896
1457152
1457408
1457664
1457920
1449985
1450241
1450497
1450753
1451009
1451265
1451521
1451777
1452033
1452289
1452545
1452801
1453057
1453313
1453569
1453825
1454081
1454337
1454593
1454849
1455105
1455361
1455617
1455873
1456129
1456385
1456641
1456897
1457153
1457409
1457665
1457921
1449986
1450242
1450498
1450754
1451010
1451266
1451522
1451778
1452034
1452290
1452546
1452802
1453058
1453314
1453570
1453826
1454082
1454338
1454594
1454850
1455106
1455362
1455618
1455874
1456130
1456386
1456642
1456898
1457154
1457410
1457666
1457922
1449987
1450243
1450499
1450755
1451011
1451267
1451523
1451779
1452035
1452291
1452547
1452803
1453059
1453315
1453571
1453827
1454083
1454339
1454595
1454851
1455107
1455363
1455619
1455875
1456131
1456387
1456643
1456899
1457155
1457411
1457667
1457923
1449988
1450244
1450500
1450756
1451012
1451268
1451524
1451780
1452036
1452292
1452548
1452804
1453060
1453316
1453572
1453828
1454084
1454340
1454596
1454852
1455108
1455364
1455620
1455876
1456132
1456388
1456644
1456900
1457156
1457412
1457668
1457924
1449989
1450245
1450501
1450757
1451013
1451269
1451525
1451781
1452037
1452293
1452549
1452805
1453061
1453317
1453573
1453829
1454085
1454341
1454597
1454853
1455109
1455365
1455621
1455877
1456133
1456389
1456645
1456901
1457157
1457413
1457669
1457925
1449990
1450246
1450502
1450758
1451014
1451270
1451526
1451782
1452038
1452294
1452550
1452806
1453062
1453318
1453574
1453830
1454086
1454342
1454598
1454854
1455110
1455366
1455622
1455878
1456134
1456390
1456646
1456902
1457158
1457414
1457670
1457926
1449991
1450247
1450503
1450759
1451015
1451271
1451527
1451783
1452039
1452295
1452551
1452807
1453063
1453319
1453575
1453831
1454087
1454343
1454599
1454855
1455111
1455367
1455623
1455879
1456135
1456391
1456647
1456903
1457159
1457415
1457671
1457927
1449992
1450248
1450504
1450760
1451016
1451272
1451528
1451784
1452040
1452296
1452552
1452808
1453064
1453320
1453576
1453832
1454088
1454344
1454600
1454856
1455112
1455368
1455624
1455880
1456136
1456392
1456648
1456904
1457160
1457416
1457672
1457928
1449993
1450249
1450505
1450761
1451017
1451273
1451529
1451785
1452041
1452297
1452553
1452809
1453065
1453321
1453577
1453833
1454089
1454345
1454601
1454857
1455113
1455369
1455625
1455881
1456137
1456393
1456649
1456905
1457161
1457417
1457673
1457929
1449994
1450250
1450506
1450762
1451018
1451274
1451530
1451786
1452042
1452298
1452554
1452810
1453066
1453322
1453578
1453834
1454090
1454346
1454602
1454858
1455114
1455370
1455626
1455882
1456138
1456394
1456650
1456906
1457162
1457418
1457674
1457930
1449995
1450251
1450507
1450763
1451019
1451275
1451531
1451787
1452043
1452299
1452555
1452811
1453067
1453323
1453579
1453835
1454091
1454347
1454603
1454859
1455115
1455371
1455627
1455883
1456139
1456395
1456651
1456907
1457163
1457419
1457675
1457931
1449996
1450252
1450508
1450764
1451020
1451276
1451532
1451788
1452044
1452300
1452556
1452812
1453068
1453324
1453580
1453836
1454092
1454348
1454604
1454860
1455116
1455372
1455628
1455884
1456140
1456396
1456652
1456908
1457164
1457420
1457676
1457932
1449997
1450253
1450509
1450765
1451021
1451277
1451533
1451789
1452045
1452301
1452557
1452813
1453069
1453325
1453581
1453837
1454093
1454349
1454605
1454861
1455117
1455373
1455629
1455885
1456141
1456397
1456653
1456909
1457165
1457421
1457677
1457933
1449998
1450254
1450510
1450766
1451022
1451278
1451534
1451790
1452046
1452302
1452558
1452814
1453070
1453326
1453582
1453838
1454094
1454350
1454606
1454862
1455118
1455374
1455630
1455886
1456142
1456398
1456654
1456910
1457166
1457422
1457678
1457934
1449999
1450255
1450511
1450767
1451023
1451279
1451535
1451791
1452047
1452303
1452559
1452815
1453071
1453327
1453583
1453839
1454095
1454351
1454607
1454863
1455119
1455375
1455631
1455887
1456143
1456399
1456655
1456911
1457167
1457423
1457679
1457935
1450000
1450256
1450512
1450768
1451024
1451280
1451536
1451792
1452048
1452304
1452560
1452816
1453072
1453328
1453584
1453840
1454096
1454352
1454608
1454864
1455120
1455376
1455632
1455888
1456144
1456400
1456656
1456912
1457168
1457424
1457680
1457936
1450001
1450257
1450513
1450769
1451025
1451281
1451537
1451793
1452049
1452305
1452561
1452817
1453073
1453329
1453585
1453841
1454097
1454353
1454609
1454865
1455121
1455377
1455633
1455889
1456145
1456401
1456657
1456913
1457169
1457425
1457681
1457937
1450002
1450258
1450514
1450770
1451026
1451282
1451538
1451794
1452050
1452306
1452562
1452818
1453074
1453330
1453586
1453842
1454098
1454354
1454610
1454866
1455122
1455378
1455634
1455890
1456146
1456402
1456658
1456914
1457170
1457426
1457682
1457938
1450003
1450259
1450515
1450771
1451027
1451283
1451539
1451795
1452051
1452307
1452563
1452819
1453075
1453331
1453587
1453843
1454099
1454355
1454611
1454867
1455123
1455379
1455635
1455891
1456147
1456403
1456659
1456915
1457171
1457427
1457683
1457939
1450004
1450260
1450516
1450772
1451028
1451284
1451540
1451796
1452052
1452308
1452564
1452820
1453076
1453332
1453588
1453844
1454100
1454356
1454612
1454868
1455124
1455380
1455636
1455892
1456148
1456404
1456660
1456916
1457172
1457428
1457684
1457940
1450005
1450261
1450517
1450773
1451029
1451285
1451541
1451797
1452053
1452309
1452565
1452821
1453077
1453333
1453589
1453845
1454101
1454357
1454613
1454869
1455125
1455381
1455637
1455893
1456149
1456405
1456661
1456917
1457173
1457429
1457685
1457941
1450006
1450262
1450518
1450774
1451030
1451286
1451542
1451798
1452054
1452310
1452566
1452822
1453078
1453334
1453590
1453846
1454102
1454358
1454614
1454870
1455126
1455382
1455638
1455894
1456150
1456406
1456662
1456918
1457174
1457430
1457686
1457942
1450007
1450263
1450519
1450775
1451031
1451287
1451543
1451799
1452055
1452311
1452567
1452823
1453079
1453335
1453591
1453847
1454103
1454359
1454615
1454871
1455127
1455383
1455639
1455895
1456151
1456407
1456663
1456919
1457175
1457431
1457687
1457943
1450008
1450264
1450520
1450776
1451032
1451288
1451544
1451800
1452056
1452312
1452568
1452824
1453080
1453336
1453592
1453848
1454104
1454360
1454616
1454872
1455128
1455384
1455640
1455896
1456152
1456408
1456664
1456920
1457176
1457432
1457688
1457944
1450009
1450265
1450521
1450777
1451033
1451289
1451545
1451801
1452057
1452313
1452569
1452825
1453081
1453337
1453593
1453849
1454105
1454361
1454617
1454873
1455129
1455385
1455641
1455897
1456153
1456409
1456665
1456921
1457177
1457433
1457689
1457945
1450010
1450266
1450522
1450778
1451034
1451290
1451546
1451802
1452058
1452314
1452570
1452826
1453082
1453338
1453594
1453850
1454106
1454362
1454618
1454874
1455130
1455386
1455642
1455898
1456154
1456410
1456666
1456922
1457178
1457434
1457690
1457946
1450011
1450267
1450523
1450779
1451035
1451291
1451547
1451803
1452059
1452315
1452571
1452827
1453083
1453339
1453595
1453851
1454107
1454363
1454619
1454875
1455131
1455387
1455643
1455899
1456155
1456411
1456667
1456923
1457179
1457435
1457691
1457947
1450012
1450268
1450524
1450780
1451036
1451292
1451548
1451804
1452060
1452316
1452572
1452828
1453084
1453340
1453596
1453852
1454108
1454364
1454620
1454876
1455132
1455388
1455644
1455900
1456156
1456412
1456668
1456924
1457180
1457436
1457692
1457948
1450013
1450269
1450525
1450781
1451037
1451293
1451549
1451805
1452061
1452317
1452573
1452829
1453085
1453341
1453597
1453853
1454109
1454365
1454621
1454877
1455133
1455389
1455645
1455901
1456157
1456413
1456669
1456925
1457181
1457437
1457693
1457949
1450014
1450270
1450526
1450782
1451038
1451294
1451550
1451806
1452062
1452318
1452574
1452830
1453086
1453342
1453598
1453854
1454110
1454366
1454622
1454878
1455134
1455390
1455646
1455902
1456158
1456414
1456670
1456926
1457182
1457438
1457694
1457950
1450015
1450271
1450527
1450783
1451039
1451295
1451551
1451807
1452063
1452319
1452575
1452831
1453087
1453343
1453599
1453855
1454111
1454367
1454623
1454879
1455135
1455391
1455647
1455903
1456159
1456415
1456671
1456927
1457183
1457439
1457695
1457951
1450016
1450272
1450528
1450784
1451040
1451296
1451552
1451808
1452064
1452320
1452576
1452832
1453088
1453344
1453600
1453856
1454112
1454368
1454624
1454880
1455136
1455392
1455648
1455904
1456160
1456416
1456672
1456928
1457184
1457440
1457696
1457952
1450017
1450273
1450529
1450785
1451041
1451297
1451553
1451809
1452065
1452321
1452577
1452833
1453089
1453345
1453601
1453857
1454113
1454369
1454625
1454881
1455137
1455393
1455649
1455905
1456161
1456417
1456673
1456929
1457185
1457441
1457697
1457953
1450018
1450274
1450530
1450786
1451042
1451298
1451554
1451810
1452066
1452322
1452578
1452834
1453090
1453346
1453602
1453858
1454114
1454370
1454626
1454882
1455138
1455394
1455650
1455906
1456162
1456418
1456674
1456930
1457186
1457442
1457698
1457954
1450019
1450275
1450531
1450787
1451043
1451299
1451555
1451811
1452067
1452323
1452579
1452835
1453091
1453347
1453603
1453859
1454115
1454371
1454627
1454883
1455139
1455395
1455651
1455907
1456163
1456419
1456675
1456931
1457187
1457443
1457699
1457955
1450020
1450276
1450532
1450788
1451044
1451300
1451556
1451812
1452068
1452324
1452580
1452836
1453092
1453348
1453604
1453860
1454116
1454372
1454628
1454884
1455140
1455396
1455652
1455908
1456164
1456420
1456676
1456932
1457188
1457444
1457700
1457956
1450021
1450277
1450533
1450789
1451045
1451301
1451557
1451813
1452069
1452325
1452581
1452837
1453093
1453349
1453605
1453861
1454117
1454373
1454629
1454885
1455141
1455397
1455653
1455909
1456165
1456421
1456677
1456933
1457189
1457445
1457701
1457957
1450022
1450278
1450534
1450790
1451046
1451302
1451558
1451814
1452070
1452326
1452582
1452838
1453094
1453350
1453606
1453862
1454118
1454374
1454630
1454886
1455142
1455398
1455654
1455910
1456166
1456422
1456678
1456934
1457190
1457446
1457702
1457958
1450023
1450279
1450535
1450791
1451047
1451303
1451559
1451815
1452071
1452327
1452583
1452839
1453095
1453351
1453607
1453863
1454119
1454375
1454631
1454887
1455143
1455399
1455655
1455911
1456167
1456423
1456679
1456935
1457191
1457447
1457703
1457959
1450024
1450280
1450536
1450792
1451048
1451304
1451560
1451816
1452072
1452328
1452584
1452840
1453096
1453352
1453608
1453864
1454120
1454376
1454632
1454888
1455144
1455400
1455656
1455912
1456168
1456424
1456680
1456936
1457192
1457448
1457704
1457960
1450025
1450281
1450537
1450793
1451049
1451305
1451561
1451817
1452073
1452329
1452585
1452841
1453097
1453353
1453609
1453865
1454121
1454377
1454633
1454889
1455145
1455401
1455657
1455913
1456169
1456425
1456681
1456937
1457193
1457449
1457705
1457961
1450026
1450282
1450538
1450794
1451050
1451306
1451562
1451818
1452074
1452330
1452586
1452842
1453098
1453354
1453610
1453866
1454122
1454378
1454634
1454890
1455146
1455402
1455658
1455914
1456170
1456426
1456682
1456938
1457194
1457450
1457706
1457962
1450027
1450283
1450539
1450795
1451051
1451307
1451563
1451819
1452075
1452331
1452587
1452843
1453099
1453355
1453611
1453867
1454123
1454379
1454635
1454891
1455147
1455403
1455659
1455915
1456171
1456427
1456683
1456939
1457195
1457451
1457707
1457963
1450028
1450284
1450540
1450796
1451052
1451308
1451564
1451820
1452076
1452332
1452588
1452844
1453100
1453356
1453612
1453868
1454124
1454380
1454636
1454892
1455148
1455404
1455660
1455916
1456172
1456428
1456684
1456940
1457196
1457452
1457708
1457964
1450029
1450285
1450541
1450797
1451053
1451309
1451565
1451821
1452077
1452333
1452589
1452845
1453101
1453357
1453613
1453869
1454125
1454381
1454637
1454893
1455149
1455405
1455661
1455917
1456173
1456429
1456685
1456941
1457197
1457453
1457709
1457965
1450030
1450286
1450542
1450798
1451054
1451310
1451566
1451822
1452078
1452334
1452590
1452846
1453102
1453358
1453614
1453870
1454126
1454382
1454638
1454894
1455150
1455406
1455662
1455918
1456174
1456430
1456686
1456942
1457198
1457454
1457710
1457966
1450031
1450287
1450543
1450799
1451055
1451311
1451567
1451823
1452079
1452335
1452591
1452847
1453103
1453359
1453615
1453871
1454127
1454383
1454639
1454895
1455151
1455407
1455663
1455919
1456175
1456431
1456687
1456943
1457199
1457455
1457711
1457967
1450032
1450288
1450544
1450800
1451056
1451312
1451568
1451824
1452080
1452336
1452592
1452848
1453104
1453360
1453616
1453872
1454128
1454384
1454640
1454896
1455152
1455408
1455664
1455920
1456176
1456432
1456688
1456944
1457200
1457456
1457712
1457968
1450033
1450289
1450545
1450801
1451057
1451313
1451569
1451825
1452081
1452337
1452593
1452849
1453105
1453361
1453617
1453873
1454129
1454385
1454641
1454897
1455153
1455409
1455665
1455921
1456177
1456433
1456689
1456945
1457201
1457457
1457713
1457969
1450034
1450290
1450546
1450802
1451058
1451314
1451570
1451826
1452082
1452338
1452594
1452850
1453106
1453362
1453618
1453874
1454130
1454386
1454642
1454898
1455154
1455410
1455666
1455922
1456178
1456434
1456690
1456946
1457202
1457458
1457714
1457970
1450035
1450291
1450547
1450803
1451059
1451315
1451571
1451827
1452083
1452339
1452595
1452851
1453107
1453363
1453619
1453875
1454131
1454387
1454643
1454899
1455155
1455411
1455667
1455923
1456179
1456435
1456691
1456947
1457203
1457459
1457715
1457971
1450036
1450292
1450548
1450804
1451060
1451316
1451572
1451828
1452084
1452340
1452596
1452852
1453108
1453364
1453620
1453876
1454132
1454388
1454644
1454900
1455156
1455412
1455668
1455924
1456180
1456436
1456692
1456948
1457204
1457460
1457716
1457972
1450037
1450293
1450549
1450805
1451061
1451317
1451573
1451829
1452085
1452341
1452597
1452853
1453109
1453365
1453621
1453877
1454133
1454389
1454645
1454901
1455157
1455413
1455669
1455925
1456181
1456437
1456693
1456949
1457205
1457461
1457717
1457973
1450038
1450294
1450550
1450806
1451062
1451318
1451574
1451830
1452086
1452342
1452598
1452854
1453110
1453366
1453622
1453878
1454134
1454390
1454646
1454902
1455158
1455414
1455670
1455926
1456182
1456438
1456694
1456950
1457206
1457462
1457718
1457974
1450039
1450295
1450551
1450807
1451063
1451319
1451575
1451831
1452087
1452343
1452599
1452855
1453111
1453367
1453623
1453879
1454135
1454391
1454647
1454903
1455159
1455415
1455671
1455927
1456183
1456439
1456695
1456951
1457207
1457463
1457719
1457975
1450040
1450296
1450552
1450808
1451064
1451320
1451576
1451832
1452088
1452344
1452600
1452856
1453112
1453368
1453624
1453880
1454136
1454392
1454648
1454904
1455160
1455416
1455672
1455928
1456184
1456440
1456696
1456952
1457208
1457464
1457720
1457976
1450041
1450297
1450553
1450809
1451065
1451321
1451577
1451833
1452089
1452345
1452601
1452857
1453113
1453369
1453625
1453881
1454137
1454393
1454649
1454905
1455161
1455417
1455673
1455929
1456185
1456441
1456697
1456953
1457209
1457465
1457721
1457977
1450042
1450298
1450554
1450810
1451066
1451322
1451578
1451834
1452090
1452346
1452602
1452858
1453114
1453370
1453626
1453882
1454138
1454394
1454650
1454906
1455162
1455418
1455674
1455930
1456186
1456442
1456698
1456954
1457210
1457466
1457722
1457978
1450043
1450299
1450555
1450811
1451067
1451323
1451579
1451835
1452091
1452347
1452603
1452859
1453115
1453371
1453627
1453883
1454139
1454395
1454651
1454907
1455163
1455419
1455675
1455931
1456187
1456443
1456699
1456955
1457211
1457467
1457723
1457979
1450044
1450300
1450556
1450812
1451068
1451324
1451580
1451836
1452092
1452348
1452604
1452860
1453116
1453372
1453628
1453884
1454140
1454396
1454652
1454908
1455164
1455420
1455676
1455932
1456188
1456444
1456700
1456956
1457212
1457468
1457724
1457980
1450045
1450301
1450557
1450813
1451069
1451325
1451581
1451837
1452093
1452349
1452605
1452861
1453117
1453373
1453629
1453885
1454141
1454397
1454653
1454909
1455165
1455421
1455677
1455933
1456189
1456445
1456701
1456957
1457213
1457469
1457725
1457981
1450046
1450302
1450558
1450814
1451070
1451326
1451582
1451838
1452094
1452350
1452606
1452862
1453118
1453374
1453630
1453886
1454142
1454398
1454654
1454910
1455166
1455422
1455678
1455934
1456190
1456446
1456702
1456958
1457214
1457470
1457726
1457982
1450047
1450303
1450559
1450815
1451071
1451327
1451583
1451839
1452095
1452351
1452607
1452863
1453119
1453375
1453631
1453887
1454143
1454399
1454655
1454911
1455167
1455423
1455679
1455935
1456191
1456447
1456703
1456959
1457215
1457471
1457727
1457983
1450048
1450304
1450560
1450816
1451072
1451328
1451584
1451840
1452096
1452352
1452608
1452864
1453120
1453376
1453632
1453888
1454144
1454400
1454656
1454912
1455168
1455424
1455680
1455936
1456192
1456448
1456704
1456960
1457216
1457472
1457728
1457984
1450049
1450305
1450561
1450817
1451073
1451329
1451585
1451841
1452097
1452353
1452609
1452865
1453121
1453377
1453633
1453889
1454145
1454401
1454657
1454913
1455169
1455425
1455681
1455937
1456193
1456449
1456705
1456961
1457217
1457473
1457729
1457985
1450050
1450306
1450562
1450818
1451074
1451330
1451586
1451842
1452098
1452354
1452610
1452866
1453122
1453378
1453634
1453890
1454146
1454402
1454658
1454914
1455170
1455426
1455682
1455938
1456194
1456450
1456706
1456962
1457218
1457474
1457730
1457986
1450051
1450307
1450563
1450819
1451075
1451331
1451587
1451843
1452099
1452355
1452611
1452867
1453123
1453379
1453635
1453891
1454147
1454403
1454659
1454915
1455171
1455427
1455683
1455939
1456195
1456451
1456707
1456963
1457219
1457475
1457731
1457987
1450052
1450308
1450564
1450820
1451076
1451332
1451588
1451844
1452100
1452356
1452612
1452868
1453124
1453380
1453636
1453892
1454148
1454404
1454660
1454916
1455172
1455428
1455684
1455940
1456196
1456452
1456708
1456964
1457220
1457476
1457732
1457988
1450053
1450309
1450565
1450821
1451077
1451333
1451589
1451845
1452101
1452357
1452613
1452869
1453125
1453381
1453637
1453893
1454149
1454405
1454661
1454917
1455173
1455429
1455685
1455941
1456197
1456453
1456709
1456965
1457221
1457477
1457733
1457989
1450054
1450310
1450566
1450822
1451078
1451334
1451590
1451846
1452102
1452358
1452614
1452870
1453126
1453382
1453638
1453894
1454150
1454406
1454662
1454918
1455174
1455430
1455686
1455942
1456198
1456454
1456710
1456966
1457222
1457478
1457734
1457990
1450055
1450311
1450567
1450823
1451079
1451335
1451591
1451847
1452103
1452359
1452615
1452871
1453127
1453383
1453639
1453895
1454151
1454407
1454663
1454919
1455175
1455431
1455687
1455943
1456199
1456455
1456711
1456967
1457223
1457479
1457735
1457991
1450056
1450312
1450568
1450824
1451080
1451336
1451592
1451848
1452104
1452360
1452616
1452872
1453128
1453384
1453640
1453896
1454152
1454408
1454664
1454920
1455176
1455432
1455688
1455944
1456200
1456456
1456712
1456968
1457224
1457480
1457736
1457992
1450057
1450313
1450569
1450825
1451081
1451337
1451593
1451849
1452105
1452361
1452617
1452873
1453129
1453385
1453641
1453897
1454153
1454409
1454665
1454921
1455177
1455433
1455689
1455945
1456201
1456457
1456713
1456969
1457225
1457481
1457737
1457993
1450058
1450314
1450570
1450826
1451082
1451338
1451594
1451850
1452106
1452362
1452618
1452874
1453130
1453386
1453642
1453898
1454154
1454410
1454666
1454922
1455178
1455434
1455690
1455946
1456202
1456458
1456714
1456970
1457226
1457482
1457738
1457994
1450059
1450315
1450571
1450827
1451083
1451339
1451595
1451851
1452107
1452363
1452619
1452875
1453131
1453387
1453643
1453899
1454155
1454411
1454667
1454923
1455179
1455435
1455691
1455947
1456203
1456459
1456715
1456971
1457227
1457483
1457739
1457995
1450060
1450316
1450572
1450828
1451084
1451340
1451596
1451852
1452108
1452364
1452620
1452876
1453132
1453388
1453644
1453900
1454156
1454412
1454668
1454924
1455180
1455436
1455692
1455948
1456204
1456460
1456716
1456972
1457228
1457484
1457740
1457996
1450061
1450317
1450573
1450829
1451085
1451341
1451597
1451853
1452109
1452365
1452621
1452877
1453133
1453389
1453645
1453901
1454157
1454413
1454669
1454925
1455181
1455437
1455693
1455949
1456205
1456461
1456717
1456973
1457229
1457485
1457741
1457997
1450062
1450318
1450574
1450830
1451086
1451342
1451598
1451854
1452110
1452366
1452622
1452878
1453134
1453390
1453646
1453902
1454158
1454414
1454670
1454926
1455182
1455438
1455694
1455950
1456206
1456462
1456718
1456974
1457230
1457486
1457742
1457998
1450063
1450319
1450575
1450831
1451087
1451343
1451599
1451855
1452111
1452367
1452623
1452879
1453135
1453391
1453647
1453903
1454159
1454415
1454671
1454927
1455183
1455439
1455695
1455951
1456207
1456463
1456719
1456975
1457231
1457487
1457743
1457999
1450064
1450320
1450576
1450832
1451088
1451344
1451600
1451856
1452112
1452368
1452624
1452880
1453136
1453392
1453648
1453904
1454160
1454416
1454672
1454928
1455184
1455440
1455696
1455952
1456208
1456464
1456720
1456976
1457232
1457488
1457744
1458000
1450065
1450321
1450577
1450833
1451089
1451345
1451601
1451857
1452113
1452369
1452625
1452881
1453137
1453393
1453649
1453905
1454161
1454417
1454673
1454929
1455185
1455441
1455697
1455953
1456209
1456465
1456721
1456977
1457233
1457489
1457745
1458001
1450066
1450322
1450578
1450834
1451090
1451346
1451602
1451858
1452114
1452370
1452626
1452882
1453138
1453394
1453650
1453906
1454162
1454418
1454674
1454930
1455186
1455442
1455698
1455954
1456210
1456466
1456722
1456978
1457234
1457490
1457746
1458002
1450067
1450323
1450579
1450835
1451091
1451347
1451603
1451859
1452115
1452371
1452627
1452883
1453139
1453395
1453651
1453907
1454163
1454419
1454675
1454931
1455187
1455443
1455699
1455955
1456211
1456467
1456723
1456979
1457235
1457491
1457747
1458003
1450068
1450324
1450580
1450836
1451092
1451348
1451604
1451860
1452116
1452372
1452628
1452884
1453140
1453396
1453652
1453908
1454164
1454420
1454676
1454932
1455188
1455444
1455700
1455956
1456212
1456468
1456724
1456980
1457236
1457492
1457748
1458004
1450069
1450325
1450581
1450837
1451093
1451349
1451605
1451861
1452117
1452373
1452629
1452885
1453141
1453397
1453653
1453909
1454165
1454421
1454677
1454933
1455189
1455445
1455701
1455957
1456213
1456469
1456725
1456981
1457237
1457493
1457749
1458005
1450070
1450326
1450582
1450838
1451094
1451350
1451606
1451862
1452118
1452374
1452630
1452886
1453142
1453398
1453654
1453910
1454166
1454422
1454678
1454934
1455190
1455446
1455702
1455958
1456214
1456470
1456726
1456982
1457238
1457494
1457750
1458006
1450071
1450327
1450583
1450839
1451095
1451351
1451607
1451863
1452119
1452375
1452631
1452887
1453143
1453399
1453655
1453911
1454167
1454423
1454679
1454935
1455191
1455447
1455703
1455959
1456215
1456471
1456727
1456983
1457239
1457495
1457751
1458007
1450072
1450328
1450584
1450840
1451096
1451352
1451608
1451864
1452120
1452376
1452632
1452888
1453144
1453400
1453656
1453912
1454168
1454424
1454680
1454936
1455192
1455448
1455704
1455960
1456216
1456472
1456728
1456984
1457240
1457496
1457752
1458008
1450073
1450329
1450585
1450841
1451097
1451353
1451609
1451865
1452121
1452377
1452633
1452889
1453145
1453401
1453657
1453913
1454169
1454425
1454681
1454937
1455193
1455449
1455705
1455961
1456217
1456473
1456729
1456985
1457241
1457497
1457753
1458009
1450074
1450330
1450586
1450842
1451098
1451354
1451610
1451866
1452122
1452378
1452634
1452890
1453146
1453402
1453658
1453914
1454170
1454426
1454682
1454938
1455194
1455450
1455706
1455962
1456218
1456474
1456730
1456986
1457242
1457498
1457754
1458010
1450075
1450331
1450587
1450843
1451099
1451355
1451611
1451867
1452123
1452379
1452635
1452891
1453147
1453403
1453659
1453915
1454171
1454427
1454683
1454939
1455195
1455451
1455707
1455963
1456219
1456475
1456731
1456987
1457243
1457499
1457755
1458011
1450076
1450332
1450588
1450844
1451100
1451356
1451612
1451868
1452124
1452380
1452636
1452892
1453148
1453404
1453660
1453916
1454172
1454428
1454684
1454940
1455196
1455452
1455708
1455964
1456220
1456476
1456732
1456988
1457244
1457500
1457756
1458012
1450077
1450333
1450589
1450845
1451101
1451357
1451613
1451869
1452125
1452381
1452637
1452893
1453149
1453405
1453661
1453917
1454173
1454429
1454685
1454941
1455197
1455453
1455709
1455965
1456221
1456477
1456733
1456989
1457245
1457501
1457757
1458013
1450078
1450334
1450590
1450846
1451102
1451358
1451614
1451870
1452126
1452382
1452638
1452894
1453150
1453406
1453662
1453918
1454174
1454430
1454686
1454942
1455198
1455454
1455710
1455966
1456222
1456478
1456734
1456990
1457246
1457502
1457758
1458014
1450079
1450335
1450591
1450847
1451103
1451359
1451615
1451871
1452127
1452383
1452639
1452895
1453151
1453407
1453663
1453919
1454175
1454431
1454687
1454943
1455199
1455455
1455711
1455967
1456223
1456479
1456735
1456991
1457247
1457503
1457759
1458015
