1450032
1450288
1450544
1450800
1451056
1451312
1451568
1451824
1450033
1450289
1450545
1450801
1451057
1451313
1451569
1451825
1450034
1450290
1450546
1450802
1451058
1451314
1451570
1451826
1450035
1450291
1450547
1450803
1451059
1451315
1451571
1451827
1450036
1450292
1450548
1450804
1451060
1451316
1451572
1451828
1450037
1450293
1450549
1450805
1451061
1451317
1451573
1451829
1450038
1450294
1450550
1450806
1451062
1451318
1451574
1451830
1450039
1450295
1450551
1450807
1451063
1451319
1451575
1451831
2639912
2640168
2640424
2640680
2640936
2641192
2641448
2641704
2639913
2640169
2640425
2640681
2640937
2641193
2641449
2641705
2639914
2640170
2640426
2640682
2640938
2641194
2641450
2641706
2639915
2640171
2640427
2640683
2640939
2641195
2641451
2641707
2639916
2640172
2640428
2640684
2640940
2641196
2641452
2641708
2639917
2640173
2640429
2640685
2640941
2641197
2641453
2641709
2639918
2640174
2640430
2640686
2640942
2641198
2641454
2641710
2639919
2640175
2640431
2640687
2640943
2641199
2641455
2641711
