409600
409856
410112
410368
410624
410880
411136
411392
411648
411904
412160
412416
412672
412928
413184
413440
413696
413952
414208
414464
414720
414976
415232
415488
415744
416000
416256
416512
416768
417024
417280
417536
409601
409857
410113
410369
410625
410881
411137
411393
411649
411905
412161
412417
412673
412929
413185
413441
413697
413953
414209
414465
414721
414977
415233
415489
415745
416001
416257
416513
416769
417025
417281
417537
409602
409858
410114
410370
410626
410882
411138
411394
411650
411906
412162
412418
412674
412930
413186
413442
413698
413954
414210
414466
414722
414978
415234
415490
415746
416002
416258
416514
416770
417026
417282
417538
409603
409859
410115
410371
410627
410883
411139
411395
411651
411907
412163
412419
412675
412931
413187
413443
413699
413955
414211
414467
414723
414979
415235
415491
415747
416003
416259
416515
416771
417027
417283
417539
409604
409860
410116
410372
410628
410884
411140
411396
411652
411908
412164
412420
412676
412932
413188
413444
413700
413956
414212
414468
414724
414980
415236
415492
415748
416004
416260
416516
416772
417028
417284
417540
409605
409861
410117
410373
410629
410885
411141
411397
411653
411909
412165
412421
412677
412933
413189
413445
413701
413957
414213
414469
414725
414981
415237
415493
415749
416005
416261
416517
416773
417029
417285
417541
409606
409862
410118
410374
410630
410886
411142
411398
411654
411910
412166
412422
412678
412934
413190
413446
413702
413958
414214
414470
414726
414982
415238
415494
415750
416006
416262
416518
416774
417030
417286
417542
409607
409863
410119
410375
410631
410887
411143
411399
411655
411911
412167
412423
412679
412935
413191
413447
413703
413959
414215
414471
414727
414983
415239
415495
415751
416007
416263
416519
416775
417031
417287
417543
409608
409864
410120
410376
410632
410888
411144
411400
411656
411912
412168
412424
412680
412936
413192
413448
413704
413960
414216
414472
414728
414984
415240
415496
415752
416008
416264
416520
416776
417032
417288
417544
409609
409865
410121
410377
410633
410889
411145
411401
411657
411913
412169
412425
412681
412937
413193
413449
413705
413961
414217
414473
414729
414985
415241
415497
415753
416009
416265
416521
416777
417033
417289
417545
409610
409866
410122
410378
410634
410890
411146
411402
411658
411914
412170
412426
412682
412938
413194
413450
413706
413962
414218
414474
414730
414986
415242
415498
415754
416010
416266
416522
416778
417034
417290
417546
409611
409867
410123
410379
410635
410891
411147
411403
411659
411915
412171
412427
412683
412939
413195
413451
413707
413963
414219
414475
414731
414987
415243
415499
415755
416011
416267
416523
416779
417035
417291
417547
409612
409868
410124
410380
410636
410892
411148
411404
411660
411916
412172
412428
412684
412940
413196
413452
413708
413964
414220
414476
414732
414988
415244
415500
415756
416012
416268
416524
416780
417036
417292
417548
409613
409869
410125
410381
410637
410893
411149
411405
411661
411917
412173
412429
412685
412941
413197
413453
413709
413965
414221
414477
414733
414989
415245
415501
415757
416013
416269
416525
416781
417037
417293
417549
409614
409870
410126
410382
410638
410894
411150
411406
411662
411918
412174
412430
412686
412942
413198
413454
413710
413966
414222
414478
414734
414990
415246
415502
415758
416014
416270
416526
416782
417038
417294
417550
409615
409871
410127
410383
410639
410895
411151
411407
411663
411919
412175
412431
412687
412943
413199
413455
413711
413967
414223
414479
414735
414991
415247
415503
415759
416015
416271
416527
416783
417039
417295
417551
409616
409872
410128
410384
410640
410896
411152
411408
411664
411920
412176
412432
412688
412944
413200
413456
413712
413968
414224
414480
414736
414992
415248
415504
415760
416016
416272
416528
416784
417040
417296
417552
409617
409873
410129
410385
410641
410897
411153
411409
411665
411921
412177
412433
412689
412945
413201
413457
413713
413969
414225
414481
414737
414993
415249
415505
415761
416017
416273
416529
416785
417041
417297
417553
409618
409874
410130
410386
410642
410898
411154
411410
411666
411922
412178
412434
412690
412946
413202
413458
413714
413970
414226
414482
414738
414994
415250
415506
415762
416018
416274
416530
416786
417042
417298
417554
409619
409875
410131
410387
410643
410899
411155
411411
411667
411923
412179
412435
412691
412947
413203
413459
413715
413971
414227
414483
414739
414995
415251
415507
415763
416019
416275
416531
416787
417043
417299
417555
409620
409876
410132
410388
410644
410900
411156
411412
411668
411924
412180
412436
412692
412948
413204
413460
413716
413972
414228
414484
414740
414996
415252
415508
415764
416020
416276
416532
416788
417044
417300
417556
409621
409877
410133
410389
410645
410901
411157
411413
411669
411925
412181
412437
412693
412949
413205
413461
413717
413973
414229
414485
414741
414997
415253
415509
415765
416021
416277
416533
416789
417045
417301
417557
409622
409878
410134
410390
410646
410902
411158
411414
411670
411926
412182
412438
412694
412950
413206
413462
413718
413974
414230
414486
414742
414998
415254
415510
415766
416022
416278
416534
416790
417046
417302
417558
409623
409879
410135
410391
410647
410903
411159
411415
411671
411927
412183
412439
412695
412951
413207
413463
413719
413975
414231
414487
414743
414999
415255
415511
415767
416023
416279
416535
416791
417047
417303
417559
409624
409880
410136
410392
410648
410904
411160
411416
411672
411928
412184
412440
412696
412952
413208
413464
413720
413976
414232
414488
414744
415000
415256
415512
415768
416024
416280
416536
416792
417048
417304
417560
409625
409881
410137
410393
410649
410905
411161
411417
411673
411929
412185
412441
412697
412953
413209
413465
413721
413977
414233
414489
414745
415001
415257
415513
415769
416025
416281
416537
416793
417049
417305
417561
409626
409882
410138
410394
410650
410906
411162
411418
411674
411930
412186
412442
412698
412954
413210
413466
413722
413978
414234
414490
414746
415002
415258
415514
415770
416026
416282
416538
416794
417050
417306
417562
409627
409883
410139
410395
410651
410907
411163
411419
411675
411931
412187
412443
412699
412955
413211
413467
413723
413979
414235
414491
414747
415003
415259
415515
415771
416027
416283
416539
416795
417051
417307
417563
409628
409884
410140
410396
410652
410908
411164
411420
411676
411932
412188
412444
412700
412956
413212
413468
413724
413980
414236
414492
414748
415004
415260
415516
415772
416028
416284
416540
416796
417052
417308
417564
409629
409885
410141
410397
410653
410909
411165
411421
411677
411933
412189
412445
412701
412957
413213
413469
413725
413981
414237
414493
414749
415005
415261
415517
415773
416029
416285
416541
416797
417053
417309
417565
409630
409886
410142
410398
410654
410910
411166
411422
411678
411934
412190
412446
412702
412958
413214
413470
413726
413982
414238
414494
414750
415006
415262
415518
415774
416030
416286
416542
416798
417054
417310
417566
409631
409887
410143
410399
410655
410911
411167
411423
411679
411935
412191
412447
412703
412959
413215
413471
413727
413983
414239
414495
414751
415007
415263
415519
415775
416031
416287
416543
416799
417055
417311
417567
409632
409888
410144
410400
410656
410912
411168
411424
411680
411936
412192
412448
412704
412960
413216
413472
413728
413984
414240
414496
414752
415008
415264
415520
415776
416032
416288
416544
416800
417056
417312
417568
409633
409889
410145
410401
410657
410913
411169
411425
411681
411937
412193
412449
412705
412961
413217
413473
413729
413985
414241
414497
414753
415009
415265
415521
415777
416033
416289
416545
416801
417057
417313
417569
409634
409890
410146
410402
410658
410914
411170
411426
411682
411938
412194
412450
412706
412962
413218
413474
413730
413986
414242
414498
414754
415010
415266
415522
415778
416034
416290
416546
416802
417058
417314
417570
409635
409891
410147
410403
410659
410915
411171
411427
411683
411939
412195
412451
412707
412963
413219
413475
413731
413987
414243
414499
414755
415011
415267
415523
415779
416035
416291
416547
416803
417059
417315
417571
409636
409892
410148
410404
410660
410916
411172
411428
411684
411940
412196
412452
412708
412964
413220
413476
413732
413988
414244
414500
414756
415012
415268
415524
415780
416036
416292
416548
416804
417060
417316
417572
409637
409893
410149
410405
410661
410917
411173
411429
411685
411941
412197
412453
412709
412965
413221
413477
413733
413989
414245
414501
414757
415013
415269
415525
415781
416037
416293
416549
416805
417061
417317
417573
409638
409894
410150
410406
410662
410918
411174
411430
411686
411942
412198
412454
412710
412966
413222
413478
413734
413990
414246
414502
414758
415014
415270
415526
415782
416038
416294
416550
416806
417062
417318
417574
409639
409895
410151
410407
410663
410919
411175
411431
411687
411943
412199
412455
412711
412967
413223
413479
413735
413991
414247
414503
414759
415015
415271
415527
415783
416039
416295
416551
416807
417063
417319
417575
409640
409896
410152
410408
410664
410920
411176
411432
411688
411944
412200
412456
412712
412968
413224
413480
413736
413992
414248
414504
414760
415016
415272
415528
415784
416040
416296
416552
416808
417064
417320
417576
409641
409897
410153
410409
410665
410921
411177
411433
411689
411945
412201
412457
412713
412969
413225
413481
413737
413993
414249
414505
414761
415017
415273
415529
415785
416041
416297
416553
416809
417065
417321
417577
409642
409898
410154
410410
410666
410922
411178
411434
411690
411946
412202
412458
412714
412970
413226
413482
413738
413994
414250
414506
414762
415018
415274
415530
415786
416042
416298
416554
416810
417066
417322
417578
409643
409899
410155
410411
410667
410923
411179
411435
411691
411947
412203
412459
412715
412971
413227
413483
413739
413995
414251
414507
414763
415019
415275
415531
415787
416043
416299
416555
416811
417067
417323
417579
409644
409900
410156
410412
410668
410924
411180
411436
411692
411948
412204
412460
412716
412972
413228
413484
413740
413996
414252
414508
414764
415020
415276
415532
415788
416044
416300
416556
416812
417068
417324
417580
409645
409901
410157
410413
410669
410925
411181
411437
411693
411949
412205
412461
412717
412973
413229
413485
413741
413997
414253
414509
414765
415021
415277
415533
415789
416045
416301
416557
416813
417069
417325
417581
409646
409902
410158
410414
410670
410926
411182
411438
411694
411950
412206
412462
412718
412974
413230
413486
413742
413998
414254
414510
414766
415022
415278
415534
415790
416046
416302
416558
416814
417070
417326
417582
409647
409903
410159
410415
410671
410927
411183
411439
411695
411951
412207
412463
412719
412975
413231
413487
413743
413999
414255
414511
414767
415023
415279
415535
415791
416047
416303
416559
416815
417071
417327
417583
409648
409904
410160
410416
410672
410928
411184
411440
411696
411952
412208
412464
412720
412976
413232
413488
413744
414000
414256
414512
414768
415024
415280
415536
415792
416048
416304
416560
416816
417072
417328
417584
409649
409905
410161
410417
410673
410929
411185
411441
411697
411953
412209
412465
412721
412977
413233
413489
413745
414001
414257
414513
414769
415025
415281
415537
415793
416049
416305
416561
416817
417073
417329
417585
409650
409906
410162
410418
410674
410930
411186
411442
411698
411954
412210
412466
412722
412978
413234
413490
413746
414002
414258
414514
414770
415026
415282
415538
415794
416050
416306
416562
416818
417074
417330
417586
409651
409907
410163
410419
410675
410931
411187
411443
411699
411955
412211
412467
412723
412979
413235
413491
413747
414003
414259
414515
414771
415027
415283
415539
415795
416051
416307
416563
416819
417075
417331
417587
409652
409908
410164
410420
410676
410932
411188
411444
411700
411956
412212
412468
412724
412980
413236
413492
413748
414004
414260
414516
414772
415028
415284
415540
415796
416052
416308
416564
416820
417076
417332
417588
409653
409909
410165
410421
410677
410933
411189
411445
411701
411957
412213
412469
412725
412981
413237
413493
413749
414005
414261
414517
414773
415029
415285
415541
415797
416053
416309
416565
416821
417077
417333
417589
409654
409910
410166
410422
410678
410934
411190
411446
411702
411958
412214
412470
412726
412982
413238
413494
413750
414006
414262
414518
414774
415030
415286
415542
415798
416054
416310
416566
416822
417078
417334
417590
409655
409911
410167
410423
410679
410935
411191
411447
411703
411959
412215
412471
412727
412983
413239
413495
413751
414007
414263
414519
414775
415031
415287
415543
415799
416055
416311
416567
416823
417079
417335
417591
409656
409912
410168
410424
410680
410936
411192
411448
411704
411960
412216
412472
412728
412984
413240
413496
413752
414008
414264
414520
414776
415032
415288
415544
415800
416056
416312
416568
416824
417080
417336
417592
409657
409913
410169
410425
410681
410937
411193
411449
411705
411961
412217
412473
412729
412985
413241
413497
413753
414009
414265
414521
414777
415033
415289
415545
415801
416057
416313
416569
416825
417081
417337
417593
409658
409914
410170
410426
410682
410938
411194
411450
411706
411962
412218
412474
412730
412986
413242
413498
413754
414010
414266
414522
414778
415034
415290
415546
415802
416058
416314
416570
416826
417082
417338
417594
409659
409915
410171
410427
410683
410939
411195
411451
411707
411963
412219
412475
412731
412987
413243
413499
413755
414011
414267
414523
414779
415035
415291
415547
415803
416059
416315
416571
416827
417083
417339
417595
409660
409916
410172
410428
410684
410940
411196
411452
411708
411964
412220
412476
412732
412988
413244
413500
413756
414012
414268
414524
414780
415036
415292
415548
415804
416060
416316
416572
416828
417084
417340
417596
409661
409917
410173
410429
410685
410941
411197
411453
411709
411965
412221
412477
412733
412989
413245
413501
413757
414013
414269
414525
414781
415037
415293
415549
415805
416061
416317
416573
416829
417085
417341
417597
409662
409918
410174
410430
410686
410942
411198
411454
411710
411966
412222
412478
412734
412990
413246
413502
413758
414014
414270
414526
414782
415038
415294
415550
415806
416062
416318
416574
416830
417086
417342
417598
409663
409919
410175
410431
410687
410943
411199
411455
411711
411967
412223
412479
412735
412991
413247
413503
413759
414015
414271
414527
414783
415039
415295
415551
415807
416063
416319
416575
416831
417087
417343
417599
409664
409920
410176
410432
410688
410944
411200
411456
411712
411968
412224
412480
412736
412992
413248
413504
413760
414016
414272
414528
414784
415040
415296
415552
415808
416064
416320
416576
416832
417088
417344
417600
409665
409921
410177
410433
410689
410945
411201
411457
411713
411969
412225
412481
412737
412993
413249
413505
413761
414017
414273
414529
414785
415041
415297
415553
415809
416065
416321
416577
416833
417089
417345
417601
409666
409922
410178
410434
410690
410946
411202
411458
411714
411970
412226
412482
412738
412994
413250
413506
413762
414018
414274
414530
414786
415042
415298
415554
415810
416066
416322
416578
416834
417090
417346
417602
409667
409923
410179
410435
410691
410947
411203
411459
411715
411971
412227
412483
412739
412995
413251
413507
413763
414019
414275
414531
414787
415043
415299
415555
415811
416067
416323
416579
416835
417091
417347
417603
409668
409924
410180
410436
410692
410948
411204
411460
411716
411972
412228
412484
412740
412996
413252
413508
413764
414020
414276
414532
414788
415044
415300
415556
415812
416068
416324
416580
416836
417092
417348
417604
409669
409925
410181
410437
410693
410949
411205
411461
411717
411973
412229
412485
412741
412997
413253
413509
413765
414021
414277
414533
414789
415045
415301
415557
415813
416069
416325
416581
416837
417093
417349
417605
409670
409926
410182
410438
410694
410950
411206
411462
411718
411974
412230
412486
412742
412998
413254
413510
413766
414022
414278
414534
414790
415046
415302
415558
415814
416070
416326
416582
416838
417094
417350
417606
409671
409927
410183
410439
410695
410951
411207
411463
411719
411975
412231
412487
412743
412999
413255
413511
413767
414023
414279
414535
414791
415047
415303
415559
415815
416071
416327
416583
416839
417095
417351
417607
409672
409928
410184
410440
410696
410952
411208
411464
411720
411976
412232
412488
412744
413000
413256
413512
413768
414024
414280
414536
414792
415048
415304
415560
415816
416072
416328
416584
416840
417096
417352
417608
409673
409929
410185
410441
410697
410953
411209
411465
411721
411977
412233
412489
412745
413001
413257
413513
413769
414025
414281
414537
414793
415049
415305
415561
415817
416073
416329
416585
416841
417097
417353
417609
409674
409930
410186
410442
410698
410954
411210
411466
411722
411978
412234
412490
412746
413002
413258
413514
413770
414026
414282
414538
414794
415050
415306
415562
415818
416074
416330
416586
416842
417098
417354
417610
409675
409931
410187
410443
410699
410955
411211
411467
411723
411979
412235
412491
412747
413003
413259
413515
413771
414027
414283
414539
414795
415051
415307
415563
415819
416075
416331
416587
416843
417099
417355
417611
409676
409932
410188
410444
410700
410956
411212
411468
411724
411980
412236
412492
412748
413004
413260
413516
413772
414028
414284
414540
414796
415052
415308
415564
415820
416076
416332
416588
416844
417100
417356
417612
409677
409933
410189
410445
410701
410957
411213
411469
411725
411981
412237
412493
412749
413005
413261
413517
413773
414029
414285
414541
414797
415053
415309
415565
415821
416077
416333
416589
416845
417101
417357
417613
409678
409934
410190
410446
410702
410958
411214
411470
411726
411982
412238
412494
412750
413006
413262
413518
413774
414030
414286
414542
414798
415054
415310
415566
415822
416078
416334
416590
416846
417102
417358
417614
409679
409935
410191
410447
410703
410959
411215
411471
411727
411983
412239
412495
412751
413007
413263
413519
413775
414031
414287
414543
414799
415055
415311
415567
415823
416079
416335
416591
416847
417103
417359
417615
409680
409936
410192
410448
410704
410960
411216
411472
411728
411984
412240
412496
412752
413008
413264
413520
413776
414032
414288
414544
414800
415056
415312
415568
415824
416080
416336
416592
416848
417104
417360
417616
409681
409937
410193
410449
410705
410961
411217
411473
411729
411985
412241
412497
412753
413009
413265
413521
413777
414033
414289
414545
414801
415057
415313
415569
415825
416081
416337
416593
416849
417105
417361
417617
409682
409938
410194
410450
410706
410962
411218
411474
411730
411986
412242
412498
412754
413010
413266
413522
413778
414034
414290
414546
414802
415058
415314
415570
415826
416082
416338
416594
416850
417106
417362
417618
409683
409939
410195
410451
410707
410963
411219
411475
411731
411987
412243
412499
412755
413011
413267
413523
413779
414035
414291
414547
414803
415059
415315
415571
415827
416083
416339
416595
416851
417107
417363
417619
409684
409940
410196
410452
410708
410964
411220
411476
411732
411988
412244
412500
412756
413012
413268
413524
413780
414036
414292
414548
414804
415060
415316
415572
415828
416084
416340
416596
416852
417108
417364
417620
409685
409941
410197
410453
410709
410965
411221
411477
411733
411989
412245
412501
412757
413013
413269
413525
413781
414037
414293
414549
414805
415061
415317
415573
415829
416085
416341
416597
416853
417109
417365
417621
409686
409942
410198
410454
410710
410966
411222
411478
411734
411990
412246
412502
412758
413014
413270
413526
413782
414038
414294
414550
414806
415062
415318
415574
415830
416086
416342
416598
416854
417110
417366
417622
409687
409943
410199
410455
410711
410967
411223
411479
411735
411991
412247
412503
412759
413015
413271
413527
413783
414039
414295
414551
414807
415063
415319
415575
415831
416087
416343
416599
416855
417111
417367
417623
409688
409944
410200
410456
410712
410968
411224
411480
411736
411992
412248
412504
412760
413016
413272
413528
413784
414040
414296
414552
414808
415064
415320
415576
415832
416088
416344
416600
416856
417112
417368
417624
409689
409945
410201
410457
410713
410969
411225
411481
411737
411993
412249
412505
412761
413017
413273
413529
413785
414041
414297
414553
414809
415065
415321
415577
415833
416089
416345
416601
416857
417113
417369
417625
409690
409946
410202
410458
410714
410970
411226
411482
411738
411994
412250
412506
412762
413018
413274
413530
413786
414042
414298
414554
414810
415066
415322
415578
415834
416090
416346
416602
416858
417114
417370
417626
409691
409947
410203
410459
410715
410971
411227
411483
411739
411995
412251
412507
412763
413019
413275
413531
413787
414043
414299
414555
414811
415067
415323
415579
415835
416091
416347
416603
416859
417115
417371
417627
409692
409948
410204
410460
410716
410972
411228
411484
411740
411996
412252
412508
412764
413020
413276
413532
413788
414044
414300
414556
414812
415068
415324
415580
415836
416092
416348
416604
416860
417116
417372
417628
409693
409949
410205
410461
410717
410973
411229
411485
411741
411997
412253
412509
412765
413021
413277
413533
413789
414045
414301
414557
414813
415069
415325
415581
415837
416093
416349
416605
416861
417117
417373
417629
409694
409950
410206
410462
410718
410974
411230
411486
411742
411998
412254
412510
412766
413022
413278
413534
413790
414046
414302
414558
414814
415070
415326
415582
415838
416094
416350
416606
416862
417118
417374
417630
409695
409951
410207
410463
410719
410975
411231
411487
411743
411999
412255
412511
412767
413023
413279
413535
413791
414047
414303
414559
414815
415071
415327
415583
415839
416095
416351
416607
416863
417119
417375
417631
2572288
2572544
2572800
2573056
2573312
2573568
2573824
2574080
2574336
2574592
2574848
2575104
2575360
2575616
2575872
2576128
2576384
2576640
2576896
2577152
2577408
2577664
2577920
2578176
2578432
2578688
2578944
2579200
2579456
2579712
2579968
2580224
2572289
2572545
2572801
2573057
2573313
2573569
2573825
2574081
2574337
2574593
2574849
2575105
2575361
2575617
2575873
2576129
2576385
2576641
2576897
2577153
2577409
2577665
2577921
2578177
2578433
2578689
2578945
2579201
2579457
2579713
2579969
2580225
2572290
2572546
2572802
2573058
2573314
2573570
2573826
2574082
2574338
2574594
2574850
2575106
2575362
2575618
2575874
2576130
2576386
2576642
2576898
2577154
2577410
2577666
2577922
2578178
2578434
2578690
2578946
2579202
2579458
2579714
2579970
2580226
2572291
2572547
2572803
2573059
2573315
2573571
2573827
2574083
2574339
2574595
2574851
2575107
2575363
2575619
2575875
2576131
2576387
2576643
2576899
2577155
2577411
2577667
2577923
2578179
2578435
2578691
2578947
2579203
2579459
2579715
2579971
2580227
2572292
2572548
2572804
2573060
2573316
2573572
2573828
2574084
2574340
2574596
2574852
2575108
2575364
2575620
2575876
2576132
2576388
2576644
2576900
2577156
2577412
2577668
2577924
2578180
2578436
2578692
2578948
2579204
2579460
2579716
2579972
2580228
2572293
2572549
2572805
2573061
2573317
2573573
2573829
2574085
2574341
2574597
2574853
2575109
2575365
2575621
2575877
2576133
2576389
2576645
2576901
2577157
2577413
2577669
2577925
2578181
2578437
2578693
2578949
2579205
2579461
2579717
2579973
2580229
2572294
2572550
2572806
2573062
2573318
2573574
2573830
2574086
2574342
2574598
2574854
2575110
2575366
2575622
2575878
2576134
2576390
2576646
2576902
2577158
2577414
2577670
2577926
2578182
2578438
2578694
2578950
2579206
2579462
2579718
2579974
2580230
2572295
2572551
2572807
2573063
2573319
2573575
2573831
2574087
2574343
2574599
2574855
2575111
2575367
2575623
2575879
2576135
2576391
2576647
2576903
2577159
2577415
2577671
2577927
2578183
2578439
2578695
2578951
2579207
2579463
2579719
2579975
2580231
2572296
2572552
2572808
2573064
2573320
2573576
2573832
2574088
2574344
2574600
2574856
2575112
2575368
2575624
2575880
2576136
2576392
2576648
2576904
2577160
2577416
2577672
2577928
2578184
2578440
2578696
2578952
2579208
2579464
2579720
2579976
2580232
2572297
2572553
2572809
2573065
2573321
2573577
2573833
2574089
2574345
2574601
2574857
2575113
2575369
2575625
2575881
2576137
2576393
2576649
2576905
2577161
2577417
2577673
2577929
2578185
2578441
2578697
2578953
2579209
2579465
2579721
2579977
2580233
2572298
2572554
2572810
2573066
2573322
2573578
2573834
2574090
2574346
2574602
2574858
2575114
2575370
2575626
2575882
2576138
2576394
2576650
2576906
2577162
2577418
2577674
2577930
2578186
2578442
2578698
2578954
2579210
2579466
2579722
2579978
2580234
2572299
2572555
2572811
2573067
2573323
2573579
2573835
2574091
2574347
2574603
2574859
2575115
2575371
2575627
2575883
2576139
2576395
2576651
2576907
2577163
2577419
2577675
2577931
2578187
2578443
2578699
2578955
2579211
2579467
2579723
2579979
2580235
2572300
2572556
2572812
2573068
2573324
2573580
2573836
2574092
2574348
2574604
2574860
2575116
2575372
2575628
2575884
2576140
2576396
2576652
2576908
2577164
2577420
2577676
2577932
2578188
2578444
2578700
2578956
2579212
2579468
2579724
2579980
2580236
2572301
2572557
2572813
2573069
2573325
2573581
2573837
2574093
2574349
2574605
2574861
2575117
2575373
2575629
2575885
2576141
2576397
2576653
2576909
2577165
2577421
2577677
2577933
2578189
2578445
2578701
2578957
2579213
2579469
2579725
2579981
2580237
2572302
2572558
2572814
2573070
2573326
2573582
2573838
2574094
2574350
2574606
2574862
2575118
2575374
2575630
2575886
2576142
2576398
2576654
2576910
2577166
2577422
2577678
2577934
2578190
2578446
2578702
2578958
2579214
2579470
2579726
2579982
2580238
2572303
2572559
2572815
2573071
2573327
2573583
2573839
2574095
2574351
2574607
2574863
2575119
2575375
2575631
2575887
2576143
2576399
2576655
2576911
2577167
2577423
2577679
2577935
2578191
2578447
2578703
2578959
2579215
2579471
2579727
2579983
2580239
2572304
2572560
2572816
2573072
2573328
2573584
2573840
2574096
2574352
2574608
2574864
2575120
2575376
2575632
2575888
2576144
2576400
2576656
2576912
2577168
2577424
2577680
2577936
2578192
2578448
2578704
2578960
2579216
2579472
2579728
2579984
2580240
2572305
2572561
2572817
2573073
2573329
2573585
2573841
2574097
2574353
2574609
2574865
2575121
2575377
2575633
2575889
2576145
2576401
2576657
2576913
2577169
2577425
2577681
2577937
2578193
2578449
2578705
2578961
2579217
2579473
2579729
2579985
2580241
2572306
2572562
2572818
2573074
2573330
2573586
2573842
2574098
2574354
2574610
2574866
2575122
2575378
2575634
2575890
2576146
2576402
2576658
2576914
2577170
2577426
2577682
2577938
2578194
2578450
2578706
2578962
2579218
2579474
2579730
2579986
2580242
2572307
2572563
2572819
2573075
2573331
2573587
2573843
2574099
2574355
2574611
2574867
2575123
2575379
2575635
2575891
2576147
2576403
2576659
2576915
2577171
2577427
2577683
2577939
2578195
2578451
2578707
2578963
2579219
2579475
2579731
2579987
2580243
2572308
2572564
2572820
2573076
2573332
2573588
2573844
2574100
2574356
2574612
2574868
2575124
2575380
2575636
2575892
2576148
2576404
2576660
2576916
2577172
2577428
2577684
2577940
2578196
2578452
2578708
2578964
2579220
2579476
2579732
2579988
2580244
2572309
2572565
2572821
2573077
2573333
2573589
2573845
2574101
2574357
2574613
2574869
2575125
2575381
2575637
2575893
2576149
2576405
2576661
2576917
2577173
2577429
2577685
2577941
2578197
2578453
2578709
2578965
2579221
2579477
2579733
2579989
2580245
2572310
2572566
2572822
2573078
2573334
2573590
2573846
2574102
2574358
2574614
2574870
2575126
2575382
2575638
2575894
2576150
2576406
2576662
2576918
2577174
2577430
2577686
2577942
2578198
2578454
2578710
2578966
2579222
2579478
2579734
2579990
2580246
2572311
2572567
2572823
2573079
2573335
2573591
2573847
2574103
2574359
2574615
2574871
2575127
2575383
2575639
2575895
2576151
2576407
2576663
2576919
2577175
2577431
2577687
2577943
2578199
2578455
2578711
2578967
2579223
2579479
2579735
2579991
2580247
2572312
2572568
2572824
2573080
2573336
2573592
2573848
2574104
2574360
2574616
2574872
2575128
2575384
2575640
2575896
2576152
2576408
2576664
2576920
2577176
2577432
2577688
2577944
2578200
2578456
2578712
2578968
2579224
2579480
2579736
2579992
2580248
2572313
2572569
2572825
2573081
2573337
2573593
2573849
2574105
2574361
2574617
2574873
2575129
2575385
2575641
2575897
2576153
2576409
2576665
2576921
2577177
2577433
2577689
2577945
2578201
2578457
2578713
2578969
2579225
2579481
2579737
2579993
2580249
2572314
2572570
2572826
2573082
2573338
2573594
2573850
2574106
2574362
2574618
2574874
2575130
2575386
2575642
2575898
2576154
2576410
2576666
2576922
2577178
2577434
2577690
2577946
2578202
2578458
2578714
2578970
2579226
2579482
2579738
2579994
2580250
2572315
2572571
2572827
2573083
2573339
2573595
2573851
2574107
2574363
2574619
2574875
2575131
2575387
2575643
2575899
2576155
2576411
2576667
2576923
2577179
2577435
2577691
2577947
2578203
2578459
2578715
2578971
2579227
2579483
2579739
2579995
2580251
2572316
2572572
2572828
2573084
2573340
2573596
2573852
2574108
2574364
2574620
2574876
2575132
2575388
2575644
2575900
2576156
2576412
2576668
2576924
2577180
2577436
2577692
2577948
2578204
2578460
2578716
2578972
2579228
2579484
2579740
2579996
2580252
2572317
2572573
2572829
2573085
2573341
2573597
2573853
2574109
2574365
2574621
2574877
2575133
2575389
2575645
2575901
2576157
2576413
2576669
2576925
2577181
2577437
2577693
2577949
2578205
2578461
2578717
2578973
2579229
2579485
2579741
2579997
2580253
2572318
2572574
2572830
2573086
2573342
2573598
2573854
2574110
2574366
2574622
2574878
2575134
2575390
2575646
2575902
2576158
2576414
2576670
2576926
2577182
2577438
2577694
2577950
2578206
2578462
2578718
2578974
2579230
2579486
2579742
2579998
2580254
2572319
2572575
2572831
2573087
2573343
2573599
2573855
2574111
2574367
2574623
2574879
2575135
2575391
2575647
2575903
2576159
2576415
2576671
2576927
2577183
2577439
2577695
2577951
2578207
2578463
2578719
2578975
2579231
2579487
2579743
2579999
2580255
2572320
2572576
2572832
2573088
2573344
2573600
2573856
2574112
2574368
2574624
2574880
2575136
2575392
2575648
2575904
2576160
2576416
2576672
2576928
2577184
2577440
2577696
2577952
2578208
2578464
2578720
2578976
2579232
2579488
2579744
2580000
2580256
2572321
2572577
2572833
2573089
2573345
2573601
2573857
2574113
2574369
2574625
2574881
2575137
2575393
2575649
2575905
2576161
2576417
2576673
2576929
2577185
2577441
2577697
2577953
2578209
2578465
2578721
2578977
2579233
2579489
2579745
2580001
2580257
2572322
2572578
2572834
2573090
2573346
2573602
2573858
2574114
2574370
2574626
2574882
2575138
2575394
2575650
2575906
2576162
2576418
2576674
2576930
2577186
2577442
2577698
2577954
2578210
2578466
2578722
2578978
2579234
2579490
2579746
2580002
2580258
2572323
2572579
2572835
2573091
2573347
2573603
2573859
2574115
2574371
2574627
2574883
2575139
2575395
2575651
2575907
2576163
2576419
2576675
2576931
2577187
2577443
2577699
2577955
2578211
2578467
2578723
2578979
2579235
2579491
2579747
2580003
2580259
2572324
2572580
2572836
2573092
2573348
2573604
2573860
2574116
2574372
2574628
2574884
2575140
2575396
2575652
2575908
2576164
2576420
2576676
2576932
2577188
2577444
2577700
2577956
2578212
2578468
2578724
2578980
2579236
2579492
2579748
2580004
2580260
2572325
2572581
2572837
2573093
2573349
2573605
2573861
2574117
2574373
2574629
2574885
2575141
2575397
2575653
2575909
2576165
2576421
2576677
2576933
2577189
2577445
2577701
2577957
2578213
2578469
2578725
2578981
2579237
2579493
2579749
2580005
2580261
2572326
2572582
2572838
2573094
2573350
2573606
2573862
2574118
2574374
2574630
2574886
2575142
2575398
2575654
2575910
2576166
2576422
2576678
2576934
2577190
2577446
2577702
2577958
2578214
2578470
2578726
2578982
2579238
2579494
2579750
2580006
2580262
2572327
2572583
2572839
2573095
2573351
2573607
2573863
2574119
2574375
2574631
2574887
2575143
2575399
2575655
2575911
2576167
2576423
2576679
2576935
2577191
2577447
2577703
2577959
2578215
2578471
2578727
2578983
2579239
2579495
2579751
2580007
2580263
2572328
2572584
2572840
2573096
2573352
2573608
2573864
2574120
2574376
2574632
2574888
2575144
2575400
2575656
2575912
2576168
2576424
2576680
2576936
2577192
2577448
2577704
2577960
2578216
2578472
2578728
2578984
2579240
2579496
2579752
2580008
2580264
2572329
2572585
2572841
2573097
2573353
2573609
2573865
2574121
2574377
2574633
2574889
2575145
2575401
2575657
2575913
2576169
2576425
2576681
2576937
2577193
2577449
2577705
2577961
2578217
2578473
2578729
2578985
2579241
2579497
2579753
2580009
2580265
2572330
2572586
2572842
2573098
2573354
2573610
2573866
2574122
2574378
2574634
2574890
2575146
2575402
2575658
2575914
2576170
2576426
2576682
2576938
2577194
2577450
2577706
2577962
2578218
2578474
2578730
2578986
2579242
2579498
2579754
2580010
2580266
2572331
2572587
2572843
2573099
2573355
2573611
2573867
2574123
2574379
2574635
2574891
2575147
2575403
2575659
2575915
2576171
2576427
2576683
2576939
2577195
2577451
2577707
2577963
2578219
2578475
2578731
2578987
2579243
2579499
2579755
2580011
2580267
2572332
2572588
2572844
2573100
2573356
2573612
2573868
2574124
2574380
2574636
2574892
2575148
2575404
2575660
2575916
2576172
2576428
2576684
2576940
2577196
2577452
2577708
2577964
2578220
2578476
2578732
2578988
2579244
2579500
2579756
2580012
2580268
2572333
2572589
2572845
2573101
2573357
2573613
2573869
2574125
2574381
2574637
2574893
2575149
2575405
2575661
2575917
2576173
2576429
2576685
2576941
2577197
2577453
2577709
2577965
2578221
2578477
2578733
2578989
2579245
2579501
2579757
2580013
2580269
2572334
2572590
2572846
2573102
2573358
2573614
2573870
2574126
2574382
2574638
2574894
2575150
2575406
2575662
2575918
2576174
2576430
2576686
2576942
2577198
2577454
2577710
2577966
2578222
2578478
2578734
2578990
2579246
2579502
2579758
2580014
2580270
2572335
2572591
2572847
2573103
2573359
2573615
2573871
2574127
2574383
2574639
2574895
2575151
2575407
2575663
2575919
2576175
2576431
2576687
2576943
2577199
2577455
2577711
2577967
2578223
2578479
2578735
2578991
2579247
2579503
2579759
2580015
2580271
2572336
2572592
2572848
2573104
2573360
2573616
2573872
2574128
2574384
2574640
2574896
2575152
2575408
2575664
2575920
2576176
2576432
2576688
2576944
2577200
2577456
2577712
2577968
2578224
2578480
2578736
2578992
2579248
2579504
2579760
2580016
2580272
2572337
2572593
2572849
2573105
2573361
2573617
2573873
2574129
2574385
2574641
2574897
2575153
2575409
2575665
2575921
2576177
2576433
2576689
2576945
2577201
2577457
2577713
2577969
2578225
2578481
2578737
2578993
2579249
2579505
2579761
2580017
2580273
2572338
2572594
2572850
2573106
2573362
2573618
2573874
2574130
2574386
2574642
2574898
2575154
2575410
2575666
2575922
2576178
2576434
2576690
2576946
2577202
2577458
2577714
2577970
2578226
2578482
2578738
2578994
2579250
2579506
2579762
2580018
2580274
2572339
2572595
2572851
2573107
2573363
2573619
2573875
2574131
2574387
2574643
2574899
2575155
2575411
2575667
2575923
2576179
2576435
2576691
2576947
2577203
2577459
2577715
2577971
2578227
2578483
2578739
2578995
2579251
2579507
2579763
2580019
2580275
2572340
2572596
2572852
2573108
2573364
2573620
2573876
2574132
2574388
2574644
2574900
2575156
2575412
2575668
2575924
2576180
2576436
2576692
2576948
2577204
2577460
2577716
2577972
2578228
2578484
2578740
2578996
2579252
2579508
2579764
2580020
2580276
2572341
2572597
2572853
2573109
2573365
2573621
2573877
2574133
2574389
2574645
2574901
2575157
2575413
2575669
2575925
2576181
2576437
2576693
2576949
2577205
2577461
2577717
2577973
2578229
2578485
2578741
2578997
2579253
2579509
2579765
2580021
2580277
2572342
2572598
2572854
2573110
2573366
2573622
2573878
2574134
2574390
2574646
2574902
2575158
2575414
2575670
2575926
2576182
2576438
2576694
2576950
2577206
2577462
2577718
2577974
2578230
2578486
2578742
2578998
2579254
2579510
2579766
2580022
2580278
2572343
2572599
2572855
2573111
2573367
2573623
2573879
2574135
2574391
2574647
2574903
2575159
2575415
2575671
2575927
2576183
2576439
2576695
2576951
2577207
2577463
2577719
2577975
2578231
2578487
2578743
2578999
2579255
2579511
2579767
2580023
2580279
2572344
2572600
2572856
2573112
2573368
2573624
2573880
2574136
2574392
2574648
2574904
2575160
2575416
2575672
2575928
2576184
2576440
2576696
2576952
2577208
2577464
2577720
2577976
2578232
2578488
2578744
2579000
2579256
2579512
2579768
2580024
2580280
2572345
2572601
2572857
2573113
2573369
2573625
2573881
2574137
2574393
2574649
2574905
2575161
2575417
2575673
2575929
2576185
2576441
2576697
2576953
2577209
2577465
2577721
2577977
2578233
2578489
2578745
2579001
2579257
2579513
2579769
2580025
2580281
2572346
2572602
2572858
2573114
2573370
2573626
2573882
2574138
2574394
2574650
2574906
2575162
2575418
2575674
2575930
2576186
2576442
2576698
2576954
2577210
2577466
2577722
2577978
2578234
2578490
2578746
2579002
2579258
2579514
2579770
2580026
2580282
2572347
2572603
2572859
2573115
2573371
2573627
2573883
2574139
2574395
2574651
2574907
2575163
2575419
2575675
2575931
2576187
2576443
2576699
2576955
2577211
2577467
2577723
2577979
2578235
2578491
2578747
2579003
2579259
2579515
2579771
2580027
2580283
2572348
2572604
2572860
2573116
2573372
2573628
2573884
2574140
2574396
2574652
2574908
2575164
2575420
2575676
2575932
2576188
2576444
2576700
2576956
2577212
2577468
2577724
2577980
2578236
2578492
2578748
2579004
2579260
2579516
2579772
2580028
2580284
2572349
2572605
2572861
2573117
2573373
2573629
2573885
2574141
2574397
2574653
2574909
2575165
2575421
2575677
2575933
2576189
2576445
2576701
2576957
2577213
2577469
2577725
2577981
2578237
2578493
2578749
2579005
2579261
2579517
2579773
2580029
2580285
2572350
2572606
2572862
2573118
2573374
2573630
2573886
2574142
2574398
2574654
2574910
2575166
2575422
2575678
2575934
2576190
2576446
2576702
2576958
2577214
2577470
2577726
2577982
2578238
2578494
2578750
2579006
2579262
2579518
2579774
2580030
2580286
2572351
2572607
2572863
2573119
2573375
2573631
2573887
2574143
2574399
2574655
2574911
2575167
2575423
2575679
2575935
2576191
2576447
2576703
2576959
2577215
2577471
2577727
2577983
2578239
2578495
2578751
2579007
2579263
2579519
2579775
2580031
2580287
2572352
2572608
2572864
2573120
2573376
2573632
2573888
2574144
2574400
2574656
2574912
2575168
2575424
2575680
2575936
2576192
2576448
2576704
2576960
2577216
2577472
2577728
2577984
2578240
2578496
2578752
2579008
2579264
2579520
2579776
2580032
2580288
2572353
2572609
2572865
2573121
2573377
2573633
2573889
2574145
2574401
2574657
2574913
2575169
2575425
2575681
2575937
2576193
2576449
2576705
2576961
2577217
2577473
2577729
2577985
2578241
2578497
2578753
2579009
2579265
2579521
2579777
2580033
2580289
2572354
2572610
2572866
2573122
2573378
2573634
2573890
2574146
2574402
2574658
2574914
2575170
2575426
2575682
2575938
2576194
2576450
2576706
2576962
2577218
2577474
2577730
2577986
2578242
2578498
2578754
2579010
2579266
2579522
2579778
2580034
2580290
2572355
2572611
2572867
2573123
2573379
2573635
2573891
2574147
2574403
2574659
2574915
2575171
2575427
2575683
2575939
2576195
2576451
2576707
2576963
2577219
2577475
2577731
2577987
2578243
2578499
2578755
2579011
2579267
2579523
2579779
2580035
2580291
2572356
2572612
2572868
2573124
2573380
2573636
2573892
2574148
2574404
2574660
2574916
2575172
2575428
2575684
2575940
2576196
2576452
2576708
2576964
2577220
2577476
2577732
2577988
2578244
2578500
2578756
2579012
2579268
2579524
2579780
2580036
2580292
2572357
2572613
2572869
2573125
2573381
2573637
2573893
2574149
2574405
2574661
2574917
2575173
2575429
2575685
2575941
2576197
2576453
2576709
2576965
2577221
2577477
2577733
2577989
2578245
2578501
2578757
2579013
2579269
2579525
2579781
2580037
2580293
2572358
2572614
2572870
2573126
2573382
2573638
2573894
2574150
2574406
2574662
2574918
2575174
2575430
2575686
2575942
2576198
2576454
2576710
2576966
2577222
2577478
2577734
2577990
2578246
2578502
2578758
2579014
2579270
2579526
2579782
2580038
2580294
2572359
2572615
2572871
2573127
2573383
2573639
2573895
2574151
2574407
2574663
2574919
2575175
2575431
2575687
2575943
2576199
2576455
2576711
2576967
2577223
2577479
2577735
2577991
2578247
2578503
2578759
2579015
2579271
2579527
2579783
2580039
2580295
2572360
2572616
2572872
2573128
2573384
2573640
2573896
2574152
2574408
2574664
2574920
2575176
2575432
2575688
2575944
2576200
2576456
2576712
2576968
2577224
2577480
2577736
2577992
2578248
2578504
2578760
2579016
2579272
2579528
2579784
2580040
2580296
2572361
2572617
2572873
2573129
2573385
2573641
2573897
2574153
2574409
2574665
2574921
2575177
2575433
2575689
2575945
2576201
2576457
2576713
2576969
2577225
2577481
2577737
2577993
2578249
2578505
2578761
2579017
2579273
2579529
2579785
2580041
2580297
2572362
2572618
2572874
2573130
2573386
2573642
2573898
2574154
2574410
2574666
2574922
2575178
2575434
2575690
2575946
2576202
2576458
2576714
2576970
2577226
2577482
2577738
2577994
2578250
2578506
2578762
2579018
2579274
2579530
2579786
2580042
2580298
2572363
2572619
2572875
2573131
2573387
2573643
2573899
2574155
2574411
2574667
2574923
2575179
2575435
2575691
2575947
2576203
2576459
2576715
2576971
2577227
2577483
2577739
2577995
2578251
2578507
2578763
2579019
2579275
2579531
2579787
2580043
2580299
2572364
2572620
2572876
2573132
2573388
2573644
2573900
2574156
2574412
2574668
2574924
2575180
2575436
2575692
2575948
2576204
2576460
2576716
2576972
2577228
2577484
2577740
2577996
2578252
2578508
2578764
2579020
2579276
2579532
2579788
2580044
2580300
2572365
2572621
2572877
2573133
2573389
2573645
2573901
2574157
2574413
2574669
2574925
2575181
2575437
2575693
2575949
2576205
2576461
2576717
2576973
2577229
2577485
2577741
2577997
2578253
2578509
2578765
2579021
2579277
2579533
2579789
2580045
2580301
2572366
2572622
2572878
2573134
2573390
2573646
2573902
2574158
2574414
2574670
2574926
2575182
2575438
2575694
2575950
2576206
2576462
2576718
2576974
2577230
2577486
2577742
2577998
2578254
2578510
2578766
2579022
2579278
2579534
2579790
2580046
2580302
2572367
2572623
2572879
2573135
2573391
2573647
2573903
2574159
2574415
2574671
2574927
2575183
2575439
2575695
2575951
2576207
2576463
2576719
2576975
2577231
2577487
2577743
2577999
2578255
2578511
2578767
2579023
2579279
2579535
2579791
2580047
2580303
2572368
2572624
2572880
2573136
2573392
2573648
2573904
2574160
2574416
2574672
2574928
2575184
2575440
2575696
2575952
2576208
2576464
2576720
2576976
2577232
2577488
2577744
2578000
2578256
2578512
2578768
2579024
2579280
2579536
2579792
2580048
2580304
2572369
2572625
2572881
2573137
2573393
2573649
2573905
2574161
2574417
2574673
2574929
2575185
2575441
2575697
2575953
2576209
2576465
2576721
2576977
2577233
2577489
2577745
2578001
2578257
2578513
2578769
2579025
2579281
2579537
2579793
2580049
2580305
2572370
2572626
2572882
2573138
2573394
2573650
2573906
2574162
2574418
2574674
2574930
2575186
2575442
2575698
2575954
2576210
2576466
2576722
2576978
2577234
2577490
2577746
2578002
2578258
2578514
2578770
2579026
2579282
2579538
2579794
2580050
2580306
2572371
2572627
2572883
2573139
2573395
2573651
2573907
2574163
2574419
2574675
2574931
2575187
2575443
2575699
2575955
2576211
2576467
2576723
2576979
2577235
2577491
2577747
2578003
2578259
2578515
2578771
2579027
2579283
2579539
2579795
2580051
2580307
2572372
2572628
2572884
2573140
2573396
2573652
2573908
2574164
2574420
2574676
2574932
2575188
2575444
2575700
2575956
2576212
2576468
2576724
2576980
2577236
2577492
2577748
2578004
2578260
2578516
2578772
2579028
2579284
2579540
2579796
2580052
2580308
2572373
2572629
2572885
2573141
2573397
2573653
2573909
2574165
2574421
2574677
2574933
2575189
2575445
2575701
2575957
2576213
2576469
2576725
2576981
2577237
2577493
2577749
2578005
2578261
2578517
2578773
2579029
2579285
2579541
2579797
2580053
2580309
2572374
2572630
2572886
2573142
2573398
2573654
2573910
2574166
2574422
2574678
2574934
2575190
2575446
2575702
2575958
2576214
2576470
2576726
2576982
2577238
2577494
2577750
2578006
2578262
2578518
2578774
2579030
2579286
2579542
2579798
2580054
2580310
2572375
2572631
2572887
2573143
2573399
2573655
2573911
2574167
2574423
2574679
2574935
2575191
2575447
2575703
2575959
2576215
2576471
2576727
2576983
2577239
2577495
2577751
2578007
2578263
2578519
2578775
2579031
2579287
2579543
2579799
2580055
2580311
2572376
2572632
2572888
2573144
2573400
2573656
2573912
2574168
2574424
2574680
2574936
2575192
2575448
2575704
2575960
2576216
2576472
2576728
2576984
2577240
2577496
2577752
2578008
2578264
2578520
2578776
2579032
2579288
2579544
2579800
2580056
2580312
2572377
2572633
2572889
2573145
2573401
2573657
2573913
2574169
2574425
2574681
2574937
2575193
2575449
2575705
2575961
2576217
2576473
2576729
2576985
2577241
2577497
2577753
2578009
2578265
2578521
2578777
2579033
2579289
2579545
2579801
2580057
2580313
2572378
2572634
2572890
2573146
2573402
2573658
2573914
2574170
2574426
2574682
2574938
2575194
2575450
2575706
2575962
2576218
2576474
2576730
2576986
2577242
2577498
2577754
2578010
2578266
2578522
2578778
2579034
2579290
2579546
2579802
2580058
2580314
2572379
2572635
2572891
2573147
2573403
2573659
2573915
2574171
2574427
2574683
2574939
2575195
2575451
2575707
2575963
2576219
2576475
2576731
2576987
2577243
2577499
2577755
2578011
2578267
2578523
2578779
2579035
2579291
2579547
2579803
2580059
2580315
2572380
2572636
2572892
2573148
2573404
2573660
2573916
2574172
2574428
2574684
2574940
2575196
2575452
2575708
2575964
2576220
2576476
2576732
2576988
2577244
2577500
2577756
2578012
2578268
2578524
2578780
2579036
2579292
2579548
2579804
2580060
2580316
2572381
2572637
2572893
2573149
2573405
2573661
2573917
2574173
2574429
2574685
2574941
2575197
2575453
2575709
2575965
2576221
2576477
2576733
2576989
2577245
2577501
2577757
2578013
2578269
2578525
2578781
2579037
2579293
2579549
2579805
2580061
2580317
2572382
2572638
2572894
2573150
2573406
2573662
2573918
2574174
2574430
2574686
2574942
2575198
2575454
2575710
2575966
2576222
2576478
2576734
2576990
2577246
2577502
2577758
2578014
2578270
2578526
2578782
2579038
2579294
2579550
2579806
2580062
2580318
2572383
2572639
2572895
2573151
2573407
2573663
2573919
2574175
2574431
2574687
2574943
2575199
2575455
2575711
2575967
2576223
2576479
2576735
2576991
2577247
2577503
2577759
2578015
2578271
2578527
2578783
2579039
2579295
2579551
2579807
2580063
2580319
