Px		Py		Pz	layer	hot/dead
-475		-265		27	1	hot
-465		-265		27	1	hot
-475		375		54	2	hot
-475		365		54	2	hot
-465		375		54	2	hot
-465		365		54	2	hot
-475		55		54	2	hot
-475		45		54	2	hot
-465		55		54	2	hot
-465		45		54	2	hot
-475		375		81	3	hot
-465		375		81	3	hot
-475		375		108	4	hot
-475		365		108	4	hot
-465		375		108	4	hot
-465		365		108	4	hot
-475		375		135	5	hot
-475		365		135	5	hot
-465		375		135	5	hot
-465		365		135	5	hot
-475		55		135	5	hot
-475		45		135	5	hot
-465		55		135	5	hot
-465		45		135	5	hot
-475		-265		135	5	hot
-475		-275		135	5	hot
-465		-265		135	5	hot
-465		-275		135	5	hot
-475		-375		188	7	hot
-465		-375		188	7	hot
240<Px<320	160<Py<240	188	7	dead
-475		375		216	8	hot
-475		365		216	8	hot
-465		375		216	8	hot
-465		365		216	8	hot
-80<Px<0	240<Py<320	216	8	dead
400<Px<480	160<Py<240	216	8	dead
-475		375		242	9	hot
-475		365		242	9	hot
-465		375		242	9	hot
-465		365		242	9	hot
-475		55		242	9	hot
-5		-35		242	9	dead	
-475		85		270	10	hot
-475		75		270	10	hot
-475		65		270	10	hot
-475		-5		270	10	hot
-465		5		270	10	hot
-445		15		270	10	hot
80<Px<160	-320<Py<-240	297	11	dead
-475		405		324	12	hot
-475		395		324	12	hot
-475		385		324	12	hot
-475		55		350	13	hot
-465		55		350	13	hot
-480<Px<-400	-320<Py<-240	350	13	dead
-320<Px<-240	-160<Py<-80	350	13	dead
400<Px<480	0<Py<80		350	13	dead
-475		55		377	14	hot
-475		45		377	14	hot
-465		55		377	14	hot
-465		45		377	14	hot
80<Px<160	240<Py<320	405	15	dead
160<Px<240	240<Py<320	432	16	dead
400<Px<480	0<Py<80		432	16	dead
-475		375		459	17	hot
-475		365		459	17	hot
-465		375		459	17	hot
-465		365		459	17	hot
-475		55		485	18	hot
-475		45		485	18	hot
-465		55		485	18	hot
-465		45		485	18	hot
0<Px<80		-160<Py<-80	485	18	dead
-475		85		512	19	hot
-475		75		512	19	hot
-475		55		512	19	hot
-475		45		512	19	hot
-465		55		512	19	hot
-465		45		512	19	hot
-160<Px<-80	0<Py<80		540	20	dead
-5		-35		567	21	dead
0<Px<80		-160<Py<-80	594	22	hot
0<Px<80		-240<Py<-160	648	24	hot
-475		375		648	24	hot
-465		375		648	24	hot
-475		55		648	24	hot
-475		45		648	24	hot
-465		55		648	24	hot
-465		45		648	24	hot
-475		375		675	25	hot
-465		375		675	25	hot
-475		55		675	25	hot
-475		45		675	25	hot
-465		45		675	25	hot
-475		415		755	28	hot
-475		395		755	28	hot
-475		375		755	28	hot
0<Px<80		80<Py<160	755	28	dead
400<Px<480	240<Py<320	755	28	dead	
-475		375		836	31	hot
-475		365		836	31	hot
-465		375		836	31	hot
-465		365		836	31	hot
-475		365		864	32	hot
-465		365		864	32	hot
-475		55		864	32	hot
-475		45		864	32	hot
-465		55		864	32	hot
-465		45		864	32	hot
-475		-265		864	32	hot
-475		-275		864	32	hot
-465		-265		864	32	hot
-465		-275		864	32	hot
0<Px<80		0<Py<-80	864	32	dead
-475		375		890	33	hot
-475		365		890	33	hot
-465		375		890	33	hot
-465		365		890	33	hot
-475		55		918	34	hot
-475		45		918	34	hot
-465		55		918	34	hot
-465		45		918	34	hot
-400<Px<-320	-400<Py<-320	918	34	dead	
-475		375		945	35	hot
-475		365		945	35	hot
-465		375		945	35	hot
-465		365		945	35	hot
-475		55		945	35	hot
-475		45		945	35	hot
-465		55		945	35	hot
-465		45		945	35	hot
-475		-265		945	35	hot
-465		-265		945	35	hot
-475		55		971	36	hot
-475		45		971	36	hot
-465		55		971	36	hot
-465		45		971	36	hot
-475		55		999	37	hot
-475		45		999	37	hot
-465		55		999	37	hot
-465		45		999	37	hot
0<Px<80		-160<Py<-80	1260	39	hot
-80<Px<0	240<Py<320	1313	40	hot
-475		55		1366	41	hot
-475		45		1366	41	hot
-465		55		1366	41	hot
-465		45		1366	41	hot
-475		-245		1420	42	hot
-475		-255		1420	42	hot
-475		375		1631	46	hot
-475		365		1631	46	hot
-465		375		1631	46	hot
-465		365		1631	46	hot
-475		55		1631	46	hot
-475		45		1631	46	hot
-465		55		1631	46	hot
-465		45		1631	46	hot
0<Px<80		320<Py<400	1631	46	dead	
80<Px<160	-80<Py<0	1631	46	dead
-80<Px<0	240<Py<320	1761	47	dead	
-475		55		1891	48	hot
-475		45		1891	48	hot
-465		55		1891	48	hot
-465		45		1891	48	hot
-475		55		2021	49	hot
-475		45		2021	49	hot
-465		55		2021	49	hot
-465		45		2021	49	hot
0<Px<480	-480<Py<-160	2411	52	dead	
