0 0 0.739130446275 0.823529422283 1.64285719395
0 1 0.778248185286 0.888978421688 1.44540858269
0 2 1.20000002861 0.75 1.11111116409
1 0 0.8 0.9375 1.33333337307
1 1 0.705166161438 0.911832392216 1.55522596836
1 2 0.8 0.833333313465 1.5
2 0 0.629629643529 0.941176474094 1.6875
2 1 0.750264402525 0.903132975101 1.47582185268
2 2 0.916666639348 1.0 1.09090912342
3 0 0.64 0.875 1.78571426868
3 1 0.695695847367 0.929611206055 1.54624819756
3 2 0.944444394406 0.705882370472 1.5
4 0 0.612903235234 0.89473682642 1.82352936268
4 1 0.708420172838 0.900432527065 1.5676817894
4 2 0.761904761905 0.75 1.75
5 0 1.0 0.823529422283 1.21428573132
5 1 0.673131729425 0.915259599686 1.62313866615
5 2 1.0 0.727272748947 1.375
6 0 0.730769217367 0.89473682642 1.52941179276
6 1 0.614369281536 0.919871151447 1.76947128773
6 2 0.71428572645 0.866666674614 1.6153845787
7 0 0.703703731666 1.0 1.42105257511
7 1 0.706471621194 0.871552228928 1.624096632
7 2 0.666666666667 0.833333313465 1.79999995232
8 0 0.772727247605 0.764705896378 1.69230771065
8 1 0.69263604878 0.906150996685 1.59328818321
8 2 1.0 0.882352948189 1.13333332539
9 0 0.863636368316 1.0 1.15789473057
9 1 0.736402214314 0.897040963173 1.51381444931
9 2 0.666666666667 0.949999988079 1.57894742489
10 0 0.699999983311 0.904761910439 1.57894742489
10 1 0.636960258398 0.920615315437 1.70533406734
10 2 0.952380995631 0.800000011921 1.3125
11 0 0.793103412414 0.869565188885 1.45000004768
11 1 0.648853971641 0.925495445728 1.66524732113
11 2 0.869565235419 0.850000023842 1.35294115543
12 0 0.757575727472 0.879999995232 1.5
12 1 0.825872712782 0.858644366264 1.41017663479
12 2 0.709677435729 1.0 1.40909087658
13 0 0.866666673554 0.807692289352 1.42857146263
13 1 0.690284570337 0.927149295807 1.5625077486
13 2 0.8 0.916666686535 1.36363637447
14 0 0.771428605586 0.814814805984 1.59090912342
14 1 0.706655873845 0.898979485035 1.57413589954
14 2 0.741935463899 0.956521749496 1.40909087658
15 0 1.06060605677 0.685714304447 1.375
15 1 0.674918559857 0.911167681217 1.62611150742
15 2 0.848484823964 0.857142865658 1.375
16 0 1.24137926952 0.694444417953 1.15999996662
16 1 0.624312593314 0.93191665411 1.71878218651
16 2 0.827586179681 0.875 1.38095235825
17 0 0.952380995631 0.850000023842 1.23529410362
17 1 0.630112097441 0.931390404701 1.70392477512
17 2 0.749999977648 0.958333313465 1.39130437374
18 0 0.772727247605 0.882352948189 1.46666669846
18 1 1.18463988739 0.680144309998 1.24111652374
18 2 0.78787881634 0.961538434029 1.32000005245
19 0 0.830985879217 0.898305058479 1.33962261677
19 1 0.726817014811 0.899973571301 1.52878057957
19 2 0.928571381131 0.923076927662 1.16666662693
20 0 0.776595759454 0.808219194412 1.59322035313
20 1 0.851741776053 0.850498557091 1.38044297695
20 2 0.767441890251 0.878787875175 1.48275864124
21 0 0.784946219454 0.917808234692 1.3880597353
21 1 0.751458645 0.890477001667 1.49441838264
21 2 0.812499969732 0.846153855324 1.45454549789
22 0 0.791666698125 0.884210526943 1.42857146263
22 1 0.783368905179 0.886303663254 1.44029390812
22 2 1.04545453412 0.782608687878 1.22222220898
23 0 0.837037063646 0.902654886246 1.32352936268
23 1 0.666673130522 0.927303493023 1.617577672
23 2 0.638888895236 0.956521749496 1.63636362553
24 0 0.755434810017 0.856115102768 1.54621851444
24 1 0.716735395823 0.882677733898 1.5806620121
24 2 0.870967718491 0.907407402992 1.26530611515
25 0 0.798969073147 0.870967745781 1.43703699112
25 1 0.771427896169 0.890781223774 1.45523655415
25 2 0.904109574277 0.863636374474 1.28070175648
26 0 0.771551709073 0.888268172741 1.45911943913
26 1 0.911796396752 0.809981584549 1.35402595997
26 2 0.666666666667 0.941176474094 1.59375
27 0 0.665540534376 0.923857867718 1.62637364864
27 1 0.665488105064 0.910684764385 1.65002918243
27 2 0.65600001001 0.914634168148 1.66666662693
28 0 0.648734193857 0.917073190212 1.68085110188
28 1 0.715555368652 0.879865705967 1.58832871914
28 2 0.811320760192 0.883720934391 1.39473688602
29 0 0.745644566474 0.897196233273 1.49479162693
29 1 0.734110306694 0.903690338135 1.50736713409
29 2 0.71428572645 0.964705884457 1.45121955872
30 0 0.921641840649 0.765182197094 1.41798937321
30 1 0.822191927519 0.836625635624 1.45376980305
30 2 0.802816890625 0.842105269432 1.47916662693
31 0 0.745398753654 0.86008232832 1.55980861187
31 1 0.708081478841 0.854390859604 1.65295159817
31 2 0.725490189295 0.891891896725 1.54545450211
32 0 0.848484823964 0.829365074635 1.42105257511
32 1 0.712008449098 0.909038484097 1.54501461983
32 2 0.79856117094 0.936936914921 1.33653843403
33 0 0.824137905965 0.90794980526 1.33640551567
33 1 27849.999432 3.59066434612e-05 1.0
33 2 0.909090889387 0.824999988079 1.33333337307
34 0 0.73312881559 0.899581611156 1.51627910137
34 1 0.778409589148 0.896086990833 1.4336451292
34 2 0.771812094122 0.913043498993 1.41904759407
35 0 0.712643691832 0.908602178097 1.54437875748
35 1 0.842334926169 0.851847589016 1.39364862442
35 2 0.666666666667 0.879032254219 1.70642197132
36 0 0.684931488953 0.893333315849 1.63432836533
36 1 26956.9992913 3.7096117012e-05 1.0
36 2 0.774436081896 0.951456308365 1.35714280605
37 0 1.23404257197 0.655172407627 1.23684215546
37 1 0.767807579473 0.899736464024 1.44754576683
37 2 0.813559348335 0.84375 1.45679008961
38 0 1.0 0.0 0.0
38 1 1.03796989388 0.770373046398 1.2505877018
38 2 1.0 0.771428585052 1.2962962389
39 0 1.13207548188 0.722222208977 1.22307693958
39 1 0.715402746477 0.920164883137 1.51909089088
39 2 0.802816890625 0.859649121761 1.44897961617
40 0 1.00421943908 0.743697464466 1.33898305893
40 1 0.74281201267 0.897929549217 1.49926650524
40 2 0.774566440897 0.888059675694 1.45378148556
41 0 0.879581186967 0.833333313465 1.36428570747
41 1 0.803327842217 0.894689977169 1.39134430885
41 2 1.21296295627 0.633587777615 1.30120480061
42 0 0.907949786266 0.801843345165 1.37356317043
42 1 0.655063481421 0.920770049095 1.65792703629
42 2 1.03389832702 0.729508221149 1.32584273815
43 0 0.938325981334 0.793427228928 1.34319531918
43 1 0.78675363472 0.860650539398 1.47684323788
43 2 0.860465099581 0.819819808006 1.41758239269
44 0 1.0 0.0 0.0
44 1 0.548579296988 0.955032527447 1.90872097015
44 2 0.970297043446 0.785714268684 1.31168830395
45 0 0.867403313203 0.859872639179 1.3407407999
45 1 0.767304443018 0.894014716148 1.45776534081
45 2 0.866071466366 0.81443297863 1.41772150993
46 0 0.912844073636 0.763819098473 1.43421053886
46 1 0.989746343378 0.783353090286 1.28978848457
46 2 1.83673470281 0.466666668653 1.16666662693
47 0 1.43421057243 0.602446496487 1.15736043453
47 1 0.984157018216 0.805653095245 1.26121032238
47 2 1.15384614327 0.706666648388 1.22641503811
48 0 0.82807013526 0.762711882591 1.58333337307
48 1 0.908618238918 0.802442789078 1.3715274334
48 2 0.888888888889 0.8125 1.3846154213
49 0 0.796296294538 0.833887040615 1.50597608089
49 1 1.34114041752 0.584543824196 1.27558290958
49 2 0.79054051316 0.829059839249 1.52577316761
50 0 0.872767830203 0.827365756035 1.38485312462
50 1 0.905437531119 0.815766453743 1.3538659811
50 2 0.920930234601 0.797979772091 1.36075949669
51 0 0.898648611009 0.773361980915 1.43888890743
51 1 0.702636042734 0.925149261951 1.53835916519
51 2 0.893280616417 0.827433645725 1.35294115543
52 0 0.882032683525 0.798353910446 1.42010307312
52 1 0.725362339268 0.890700221062 1.5477950573
52 2 1.70854268491 0.411764711142 1.42142856121
53 0 1.15026456361 0.617295324802 1.40834569931
53 1 0.978111958651 0.726990759373 1.40631473064
53 2 1.04844291328 0.610561072826 1.56216216087
