0 0 1.0 1.0 1.0
0 1 0.787854915218 0.882882893085 1.43764173985
0 2 1.0 0.0 0.0
1 0 1.0 1.0 1.0
1 1 0.719247495977 0.907444655895 1.53215074539
1 2 1.0 0.0 0.0
2 0 0.333333333333 1.0 3.0
2 1 0.726017434753 0.901901900768 1.52719199657
2 2 0.5 1.0 2.0
3 0 1.0 0.5 2.0
3 1 0.517875375792 0.916173577309 2.1076426506
3 2 0.5 1.0 2.0
4 0 1.0 1.0 1.0
4 1 0.708987181092 0.902414500713 1.5629876852
4 2 1.0 0.0 0.0
5 0 1.0 0.0 0.0
5 1 0.630585289274 0.942115783691 1.6832627058
5 2 1.0 0.0 0.0
6 0 1.0 0.0 0.0
6 1 0.597768634699 0.936149299145 1.78698849678
6 2 1.0 0.0 0.0
7 0 1.0 0.0 0.0
7 1 0.635403706995 0.913978517056 1.72192513943
7 2 1.0 0.0 0.0
8 0 1.0 0.0 0.0
8 1 0.681879187211 0.930118083954 1.57671952248
8 2 1.0 0.0 0.0
9 0 1.0 0.0 0.0
9 1 0.727337614441 0.912659466267 1.50645160675
9 2 1.0 0.0 0.0
10 0 1.0 0.0 0.0
10 1 0.662813126478 0.923449635506 1.63378798962
10 2 1.0 0.0 0.0
11 0 1.0 0.0 0.0
11 1 0.659249831525 0.940212130547 1.61333334446
11 2 1.0 0.0 0.0
12 0 1.0 0.0 0.0
12 1 0.574680749207 0.967149734497 1.79920077324
12 2 1.0 0.0 0.0
13 0 1.0 0.0 0.0
13 1 0.666018163797 0.944498538971 1.58969068527
13 2 0.5 1.0 2.0
14 0 1.0 0.0 0.0
14 1 0.717164692954 0.932170569897 1.49584197998
14 2 1.0 1.0 1.0
15 0 1.0 0.0 0.0
15 1 0.848608854776 0.850530385971 1.38548755646
15 2 1.0 0.0 0.0
16 0 1.0 0.0 0.0
16 1 0.636137080487 0.943192958832 1.66666662693
16 2 1.0 0.0 0.0
17 0 1.0 0.0 0.0
17 1 0.638218935225 0.941860437393 1.66358029842
17 2 1.0 0.0 0.0
18 0 1.0 0.0 0.0
18 1 0.621184928782 0.921965301037 1.74608147144
18 2 1.0 0.0 0.0
19 0 1.0 0.0 0.0
19 1 0.730113656392 0.912451386452 1.50106608868
19 2 1.0 0.0 0.0
20 0 1.0 0.0 0.0
20 1 0.671070011096 0.947834670544 1.57217025757
20 2 1.0 0.0 0.0
21 0 1.0 0.0 0.0
21 1 0.593298686202 0.953261911869 1.76813077927
21 2 1.0 0.0 0.0
22 0 1.0 0.0 0.0
22 1 0.829736191106 0.867052018642 1.38999998569
22 2 1.0 0.0 0.0
23 0 1.0 0.0 0.0
23 1 0.684317705649 0.943452358246 1.54889595509
23 2 1.0 0.0 0.0
24 0 1.0 0.0 0.0
24 1 0.680322355996 0.914116501808 1.60799133778
24 2 1.0 0.0 0.0
25 0 1.0 1.0 1.0
25 1 0.737900254165 0.929364264011 1.45819759369
25 2 1.0 0.0 0.0
26 0 1.0 1.0 1.0
26 1 1.04512818743 0.744847893715 1.28458499908
26 2 1.0 0.0 0.0
27 0 1.0 1.0 1.0
27 1 0.716750522165 0.901705086231 1.54727470875
27 2 1.0 1.0 1.0
28 0 0.5 1.0 2.0
28 1 0.837613927907 0.834816992283 1.43009483814
28 2 1.0 0.0 0.0
29 0 0.5 1.0 2.0
29 1 0.629143633926 0.953896820545 1.66628313065
29 2 0.5 1.0 2.0
30 0 0.5 1.0 2.0
30 1 0.502813284577 0.971515774727 2.04712033272
30 2 1.0 1.0 1.0
31 0 0.5 1.0 2.0
31 1 0.41356493263 0.964999973774 2.50569939613
31 2 1.0 1.0 1.0
32 0 1.0 1.0 1.0
32 1 0.986220484012 0.691616773605 1.46608948708
32 2 0.5 1.0 2.0
33 0 1.0 1.0 1.0
33 1 0.60453399342 0.969791650772 1.7056927681
33 2 1.0 1.0 1.0
34 0 1.0 1.0 1.0
34 1 0.703837819597 0.940329194069 1.51094090939
34 2 1.0 1.0 1.0
35 0 0.5 1.0 2.0
35 1 0.767405031591 0.906185567379 1.43799769878
35 2 0.2 1.0 5.0
36 0 1.0 1.0 1.0
36 1 0.596269548039 0.95358222723 1.75873017311
36 2 0.5 1.0 2.0
37 0 1.0 0.0 0.0
37 1 0.764009491319 0.895661175251 1.46136105061
37 2 1.0 0.0 0.0
38 0 1.0 1.0 1.0
38 1 1.31979025855 0.635551154613 1.19218754768
38 2 1.0 0.0 0.0
39 0 1.0 1.0 1.0
39 1 0.75039493962 0.897894740105 1.4841735363
39 2 0.77777778808 1.0 1.28571426868
40 0 0.666666666667 0.5 3.0
40 1 0.786789276093 0.887353897095 1.43233537674
40 2 0.899999957085 0.888888895512 1.25
41 0 0.749999977648 0.666666686535 2.0
41 1 0.67678298374 0.954035878181 1.54876613617
41 2 9.99999985099 0.10000000149 1.0
42 0 2.0 0.5 1.0
42 1 0.676128120378 0.920344471931 1.60701751709
42 2 0.857142886337 0.833333313465 1.39999997616
43 0 1.4999999553 0.666666686535 1.0
43 1 0.743243227678 0.889772713184 1.51213276386
43 2 1.36363633408 0.533333361149 1.375
44 0 0.5 1.0 2.0
44 1 0.806038431448 0.867196381092 1.43062829971
44 2 0.8 1.0 1.25
45 0 0.666666666667 1.0 1.5
45 1 0.713567847745 0.92018777132 1.52295923233
45 2 1.0 0.727272748947 1.375
46 0 0.5 1.0 2.0
46 1 0.65306122449 0.93624997139 1.63551402092
46 2 18.9999998584 0.0526315793395 1.0
47 0 1.33333333333 0.5 1.5
47 1 1.05423281562 0.767879545689 1.23529410362
47 2 11.9999996424 0.0833333358169 1.0
48 0 1.0 0.666666686535 1.5
48 1 0.581521732349 0.918558061123 1.87209308147
48 2 0.849999964535 0.823529422283 1.42857146263
49 0 0.8 1.0 1.25
49 1 1.13753585392 0.653652369976 1.34489405155
49 2 0.823529400215 0.785714268684 1.54545450211
50 0 1.0 0.666666686535 1.5
50 1 0.881428601 0.795786082745 1.4256619215
50 2 0.647058841679 0.818181812763 1.88888883591
51 0 1.0 1.0 1.0
51 1 0.718204461449 0.935763895512 1.48794066906
51 2 1.0 0.800000011921 1.25
52 0 4.99999992549 0.20000000298 1.0
52 1 0.604604622786 0.902317881584 1.83302748203
52 2 1.79999991417 0.296296298504 1.875
53 0 1.0 0.0 0.0
53 1 1.0 0.0 0.0
53 2 1.0 0.0 0.0
