0 0 1.0 1.0 1.0
0 1 0.758863737292 0.904962539673 1.45614826679
0 2 0.71428572645 0.800000011921 1.75
1 0 2.0 0.5 1.0
1 1 0.686117298415 0.921507954597 1.58162140846
1 2 0.444444444444 1.0 2.25
2 0 0.666666666667 1.0 1.5
2 1 0.730764633834 0.904612481594 1.51272463799
2 2 0.8 1.0 1.25
3 0 0.5 1.0 2.0
3 1 0.691790098981 0.900492429733 1.60526072979
3 2 0.600000014305 1.0 1.66666662693
4 0 0.600000014305 1.0 1.66666662693
4 1 0.779464150732 0.871397972107 1.47226941586
4 2 0.374999988824 1.0 2.66666674614
5 0 2.0 0.5 1.0
5 1 0.695830306025 0.905117332935 1.58778524399
5 2 1.4999999553 0.666666686535 1.0
6 0 2.0 0.5 1.0
6 1 0.653767055708 0.900364279747 1.69886445999
6 2 0.600000014305 1.0 1.66666662693
7 0 2.0 0.5 1.0
7 1 0.780528545521 0.836226761341 1.53210020065
7 2 0.666666666667 1.0 1.5
8 0 2.99999991059 0.333333343267 1.0
8 1 0.777196621126 0.860646605492 1.49501049519
8 2 1.0 1.0 1.0
9 0 0.600000014305 1.0 1.66666662693
9 1 0.768127896295 0.879748940468 1.47981595993
9 2 0.749999977648 1.0 1.33333337307
10 0 1.0 0.666666686535 1.5
10 1 0.715217990538 0.893017113209 1.56567561626
10 2 0.571428571429 0.5 3.5
11 0 0.600000014305 0.666666686535 2.5
11 1 0.712984462604 0.89738792181 1.56293070316
11 2 1.0 1.0 1.0
12 0 1.0 0.0 0.0
12 1 0.65213554636 0.929979681969 1.64887857437
12 2 0.600000014305 0.666666686535 2.5
13 0 0.333333333333 1.0 3.0
13 1 0.762982010192 0.895384073257 1.46378171444
13 2 0.600000014305 1.0 1.66666662693
14 0 0.2 1.0 5.0
14 1 0.804665879709 0.86618065834 1.43474900723
14 2 0.749999977648 1.0 1.33333337307
15 0 2.99999991059 0.333333343267 1.0
15 1 1.41997942973 0.570068597794 1.23535239697
15 2 1.0 1.0 1.0
16 0 0.666666666667 1.0 1.5
16 1 0.726990675209 0.903745830059 1.52203571796
16 2 0.749999977648 1.0 1.33333337307
17 0 0.5 1.0 2.0
17 1 0.681645529711 0.927475333214 1.58175432682
17 2 0.600000014305 1.0 1.66666662693
18 0 4.0 0.25 1.0
18 1 0.659273353919 0.929065406322 1.63263165951
18 2 0.333333333333 1.0 3.0
19 0 0.5 1.0 2.0
19 1 1.01485791658 0.761180877686 1.29451441765
19 2 0.214285721584 1.0 4.66666650772
20 0 0.666666666667 1.0 1.5
20 1 0.716238602531 0.911581158638 1.53160560131
20 2 0.600000014305 0.666666686535 2.5
21 0 1.0 0.5 2.0
21 1 0.650612611926 0.929153740406 1.65420722961
21 2 0.333333333333 1.0 3.0
22 0 1.0 1.0 1.0
22 1 0.785261298102 0.87655466795 1.45280325413
22 2 0.5 1.0 2.0
23 0 2.0 0.5 1.0
23 1 0.678472538048 0.932696640491 1.58025550842
23 2 0.5 0.75 2.66666674614
24 0 1.0 0.0 0.0
24 1 0.689926787361 0.896671772003 1.61645448208
24 2 0.384615398723 1.0 2.59999990463
25 0 0.333333333333 1.0 3.0
25 1 0.743383256391 0.926146447659 1.45247125626
25 2 0.624999990687 0.800000011921 2.0
26 0 1.0 1.0 1.0
26 1 1.07887360281 0.721960186958 1.28385555744
26 2 0.384615398723 1.0 2.59999990463
27 0 0.5 1.0 2.0
27 1 0.697875038009 0.904027163982 1.58504235744
27 2 0.5 1.0 2.0
28 0 1.0 1.0 1.0
28 1 0.779628740341 0.864954888821 1.48292326927
28 2 0.624999990687 1.0 1.60000002384
29 0 1.0 0.0 0.0
29 1 0.672630632272 0.947729945183 1.56869578362
29 2 0.83333330022 1.0 1.20000004768
30 0 1.0 0.0 0.0
30 1 0.668056305706 0.918642818928 1.62944698334
30 2 0.71428572645 0.800000011921 1.75
31 0 1.0 0.0 0.0
31 1 3.72512208016 0.223706319928 1.20000004768
31 2 0.624999990687 0.800000011921 2.0
32 0 1.0 0.0 0.0
32 1 1.04170704883 0.635009288788 1.51173019409
32 2 1.0 0.800000011921 1.25
33 0 1.0 0.0 0.0
33 1 0.569140466143 0.967503905296 1.81605005264
33 2 1.0 0.0 0.0
34 0 0.749999977648 1.0 1.33333337307
34 1 0.7420456578 0.91665905714 1.47014963627
34 2 1.0 1.0 1.0
35 0 1.0 1.0 1.0
35 1 0.749992266377 0.89622604847 1.48773527145
35 2 1.0 1.0 1.0
36 0 1.33333333333 0.75 1.0
36 1 0.599272195664 0.94902318716 1.7583245039
36 2 1.0 1.0 1.0
37 0 1.0 0.75 1.33333337307
37 1 0.761858400152 0.901837050915 1.45545125008
37 2 1.4999999553 0.5 1.33333337307
38 0 0.666666666667 1.0 1.5
38 1 0.809526865456 0.844989478588 1.46189916134
38 2 1.0 1.0 1.0
39 0 0.600000014305 1.0 1.66666662693
39 1 0.697269144004 0.941552221775 1.523193717
39 2 1.16666665508 0.857142865658 1.0
40 0 1.0 0.666666686535 1.5
40 1 0.855365853982 0.84409737587 1.3850184679
40 2 1.0 0.888888895512 1.125
41 0 1.4999999553 0.666666686535 1.0
41 1 0.650625277861 0.961759924889 1.59809422493
41 2 1.37499995902 0.727272748947 1.0
42 0 0.666666666667 1.0 1.5
42 1 0.612360790726 0.94347423315 1.73086249828
42 2 0.923076889219 0.75 1.44444441795
43 0 1.0 1.0 1.0
43 1 0.728852979079 0.889158368111 1.54305326939
43 2 1.57142859819 0.54545456171 1.16666662693
44 0 1.0 1.0 1.0
44 1 0.762762502265 0.87324911356 1.50131738186
44 2 0.84615388495 0.909090936184 1.29999995232
45 0 1.33333333333 0.5 1.5
45 1 0.676929895142 0.923321902752 1.59993803501
45 2 0.923076889219 0.916666686535 1.18181812763
46 0 0.25 0.5 8.0
46 1 0.674475695066 0.899478971958 1.64832437038
46 2 0.733333327505 0.909090936184 1.5
47 0 1.0 1.0 1.0
47 1 0.968267975173 0.793296992779 1.30187308788
47 2 1.44444440618 0.615384638309 1.125
48 0 0.749999977648 1.0 1.33333337307
48 1 0.571580109582 0.928650975227 1.88395428658
48 2 0.769230797446 0.699999988079 1.85714280605
49 0 1.0 0.666666686535 1.5
49 1 0.909180945651 0.759725034237 1.44774889946
49 2 1.0 0.888888895512 1.125
50 0 2.0 0.5 1.0
50 1 0.8404127903 0.842709720135 1.41198265553
50 2 0.636363650156 1.0 1.57142853737
51 0 1.4999999553 0.666666686535 1.0
51 1 0.656373635755 0.945142030716 1.61195087433
51 2 0.642857131909 0.777777791023 2.0
52 0 1.66666660044 0.40000000596 1.5
52 1 1.11950541412 0.658200740814 1.35711121559
52 2 1.20000002861 0.5 1.66666662693
53 0 1.0 0.0 0.0
53 1 1.0 0.0 0.0
53 2 1.0 0.0 0.0
