473160
473416
473672
473928
474184
474440
474696
474952
473161
473417
473673
473929
474185
474441
474697
474953
473162
473418
473674
473930
474186
474442
474698
474954
473163
473419
473675
473931
474187
474443
474699
474955
473164
473420
473676
473932
474188
474444
474700
474956
473165
473421
473677
473933
474189
474445
474701
474957
473166
473422
473678
473934
474190
474446
474702
474958
473167
473423
473679
473935
474191
474447
474703
474959
542760
543016
543272
543528
543784
544040
544296
544552
542761
543017
543273
543529
543785
544041
544297
544553
542762
543018
543274
543530
543786
544042
544298
544554
542763
543019
543275
543531
543787
544043
544299
544555
542764
543020
543276
543532
543788
544044
544300
544556
542765
543021
543277
543533
543789
544045
544301
544557
542766
543022
543278
543534
543790
544046
544302
544558
542767
543023
543279
543535
543791
544047
544303
544559
725048
725304
725560
725816
726072
726328
726584
726840
725049
725305
725561
725817
726073
726329
726585
726841
725050
725306
725562
725818
726074
726330
726586
726842
725051
725307
725563
725819
726075
726331
726587
726843
725052
725308
725564
725820
726076
726332
726588
726844
725053
725309
725565
725821
726077
726333
726589
726845
725054
725310
725566
725822
726078
726334
726590
726846
725055
725311
725567
725823
726079
726335
726591
726847
860176
860432
860688
860944
861200
861456
861712
861968
860177
860433
860689
860945
861201
861457
861713
861969
860178
860434
860690
860946
861202
861458
861714
861970
860179
860435
860691
860947
861203
861459
861715
861971
860180
860436
860692
860948
861204
861460
861716
861972
860181
860437
860693
860949
861205
861461
861717
861973
860182
860438
860694
860950
861206
861462
861718
861974
860183
860439
860695
860951
861207
861463
861719
861975
1067072
1067328
1067584
1067840
1068096
1068352
1068608
1068864
1067073
1067329
1067585
1067841
1068097
1068353
1068609
1068865
1067074
1067330
1067586
1067842
1068098
1068354
1068610
1068866
1067075
1067331
1067587
1067843
1068099
1068355
1068611
1068867
1067076
1067332
1067588
1067844
1068100
1068356
1068612
1068868
1067077
1067333
1067589
1067845
1068101
1068357
1068613
1068869
1067078
1067334
1067590
1067846
1068102
1068358
1068614
1068870
1067079
1067335
1067591
1067847
1068103
1068359
1068615
1068871
1323040
1323296
1323552
1323808
1324064
1324320
1324576
1324832
1323041
1323297
1323553
1323809
1324065
1324321
1324577
1324833
1323042
1323298
1323554
1323810
1324066
1324322
1324578
1324834
1323043
1323299
1323555
1323811
1324067
1324323
1324579
1324835
1323044
1323300
1323556
1323812
1324068
1324324
1324580
1324836
1323045
1323301
1323557
1323813
1324069
1324325
1324581
1324837
1323046
1323302
1323558
1323814
1324070
1324326
1324582
1324838
1323047
1323303
1323559
1323815
1324071
1324327
1324583
1324839
1849392
1849648
1849904
1850160
1850416
1850672
1850928
1851184
1849393
1849649
1849905
1850161
1850417
1850673
1850929
1851185
1849394
1849650
1849906
1850162
1850418
1850674
1850930
1851186
1849395
1849651
1849907
1850163
1850419
1850675
1850931
1851187
1849396
1849652
1849908
1850164
1850420
1850676
1850932
1851188
1849397
1849653
1849909
1850165
1850421
1850677
1850933
1851189
1849398
1849654
1849910
1850166
1850422
1850678
1850934
1851190
1849399
1849655
1849911
1850167
1850423
1850679
1850935
1851191
1970232
1970488
1970744
1971000
1971256
1971512
1971768
1972024
1970233
1970489
1970745
1971001
1971257
1971513
1971769
1972025
1970234
1970490
1970746
1971002
1971258
1971514
1971770
1972026
1970235
1970491
1970747
1971003
1971259
1971515
1971771
1972027
1970236
1970492
1970748
1971004
1971260
1971516
1971772
1972028
1970237
1970493
1970749
1971005
1971261
1971517
1971773
1972029
1970238
1970494
1970750
1971006
1971262
1971518
1971774
1972030
1970239
1970495
1970751
1971007
1971263
1971519
1971775
1972031
1982536
1982792
1983048
1983304
1983560
1983816
1984072
1984328
1982537
1982793
1983049
1983305
1983561
1983817
1984073
1984329
1982538
1982794
1983050
1983306
1983562
1983818
1984074
1984330
1982539
1982795
1983051
1983307
1983563
1983819
1984075
1984331
1982540
1982796
1983052
1983308
1983564
1983820
1984076
1984332
1982541
1982797
1983053
1983309
1983565
1983821
1984077
1984333
1982542
1982798
1983054
1983310
1983566
1983822
1984078
1984334
1982543
1982799
1983055
1983311
1983567
1983823
1984079
1984335
2373672
2373928
2374184
2374440
2374696
2374952
2375208
2375464
2373673
2373929
2374185
2374441
2374697
2374953
2375209
2375465
2373674
2373930
2374186
2374442
2374698
2374954
2375210
2375466
2373675
2373931
2374187
2374443
2374699
2374955
2375211
2375467
2373676
2373932
2374188
2374444
2374700
2374956
2375212
2375468
2373677
2373933
2374189
2374445
2374701
2374957
2375213
2375469
2373678
2373934
2374190
2374446
2374702
2374958
2375214
2375470
2373679
2373935
2374191
2374447
2374703
2374959
2375215
2375471
3035184
3035440
3035696
3035952
3036208
3036464
3036720
3036976
3035185
3035441
3035697
3035953
3036209
3036465
3036721
3036977
3035186
3035442
3035698
3035954
3036210
3036466
3036722
3036978
3035187
3035443
3035699
3035955
3036211
3036467
3036723
3036979
3035188
3035444
3035700
3035956
3036212
3036468
3036724
3036980
3035189
3035445
3035701
3035957
3036213
3036469
3036725
3036981
3035190
3035446
3035702
3035958
3036214
3036470
3036726
3036982
3035191
3035447
3035703
3035959
3036215
3036471
3036727
3036983
3024952
3025208
3025464
3025720
3025976
3026232
3026488
3026744
3024953
3025209
3025465
3025721
3025977
3026233
3026489
3026745
3024954
3025210
3025466
3025722
3025978
3026234
3026490
3026746
3024955
3025211
3025467
3025723
3025979
3026235
3026491
3026747
3024956
3025212
3025468
3025724
3025980
3026236
3026492
3026748
3024957
3025213
3025469
3025725
3025981
3026237
3026493
3026749
3024958
3025214
3025470
3025726
3025982
3026238
3026494
3026750
3024959
3025215
3025471
3025727
3025983
3026239
3026495
3026751
3414064
3414320
3414576
3414832
3415088
3415344
3415600
3415856
3414065
3414321
3414577
3414833
3415089
3415345
3415601
3415857
3414066
3414322
3414578
3414834
3415090
3415346
3415602
3415858
3414067
3414323
3414579
3414835
3415091
3415347
3415603
3415859
3414068
3414324
3414580
3414836
3415092
3415348
3415604
3415860
3414069
3414325
3414581
3414837
3415093
3415349
3415605
3415861
3414070
3414326
3414582
3414838
3415094
3415350
3415606
3415862
3414071
3414327
3414583
3414839
3415095
3415351
3415607
3415863
