1638400
1638656
1638912
1639168
1639424
1639680
1639936
1640192
1640448
1640704
1640960
1641216
1641472
1641728
1641984
1642240
1642496
1642752
1643008
1643264
1643520
1643776
1644032
1644288
1644544
1644800
1645056
1645312
1645568
1645824
1646080
1646336
1638401
1638657
1638913
1639169
1639425
1639681
1639937
1640193
1640449
1640705
1640961
1641217
1641473
1641729
1641985
1642241
1642497
1642753
1643009
1643265
1643521
1643777
1644033
1644289
1644545
1644801
1645057
1645313
1645569
1645825
1646081
1646337
1638402
1638658
1638914
1639170
1639426
1639682
1639938
1640194
1640450
1640706
1640962
1641218
1641474
1641730
1641986
1642242
1642498
1642754
1643010
1643266
1643522
1643778
1644034
1644290
1644546
1644802
1645058
1645314
1645570
1645826
1646082
1646338
1638403
1638659
1638915
1639171
1639427
1639683
1639939
1640195
1640451
1640707
1640963
1641219
1641475
1641731
1641987
1642243
1642499
1642755
1643011
1643267
1643523
1643779
1644035
1644291
1644547
1644803
1645059
1645315
1645571
1645827
1646083
1646339
1638404
1638660
1638916
1639172
1639428
1639684
1639940
1640196
1640452
1640708
1640964
1641220
1641476
1641732
1641988
1642244
1642500
1642756
1643012
1643268
1643524
1643780
1644036
1644292
1644548
1644804
1645060
1645316
1645572
1645828
1646084
1646340
1638405
1638661
1638917
1639173
1639429
1639685
1639941
1640197
1640453
1640709
1640965
1641221
1641477
1641733
1641989
1642245
1642501
1642757
1643013
1643269
1643525
1643781
1644037
1644293
1644549
1644805
1645061
1645317
1645573
1645829
1646085
1646341
1638406
1638662
1638918
1639174
1639430
1639686
1639942
1640198
1640454
1640710
1640966
1641222
1641478
1641734
1641990
1642246
1642502
1642758
1643014
1643270
1643526
1643782
1644038
1644294
1644550
1644806
1645062
1645318
1645574
1645830
1646086
1646342
1638407
1638663
1638919
1639175
1639431
1639687
1639943
1640199
1640455
1640711
1640967
1641223
1641479
1641735
1641991
1642247
1642503
1642759
1643015
1643271
1643527
1643783
1644039
1644295
1644551
1644807
1645063
1645319
1645575
1645831
1646087
1646343
1638408
1638664
1638920
1639176
1639432
1639688
1639944
1640200
1640456
1640712
1640968
1641224
1641480
1641736
1641992
1642248
1642504
1642760
1643016
1643272
1643528
1643784
1644040
1644296
1644552
1644808
1645064
1645320
1645576
1645832
1646088
1646344
1638409
1638665
1638921
1639177
1639433
1639689
1639945
1640201
1640457
1640713
1640969
1641225
1641481
1641737
1641993
1642249
1642505
1642761
1643017
1643273
1643529
1643785
1644041
1644297
1644553
1644809
1645065
1645321
1645577
1645833
1646089
1646345
1638410
1638666
1638922
1639178
1639434
1639690
1639946
1640202
1640458
1640714
1640970
1641226
1641482
1641738
1641994
1642250
1642506
1642762
1643018
1643274
1643530
1643786
1644042
1644298
1644554
1644810
1645066
1645322
1645578
1645834
1646090
1646346
1638411
1638667
1638923
1639179
1639435
1639691
1639947
1640203
1640459
1640715
1640971
1641227
1641483
1641739
1641995
1642251
1642507
1642763
1643019
1643275
1643531
1643787
1644043
1644299
1644555
1644811
1645067
1645323
1645579
1645835
1646091
1646347
1638412
1638668
1638924
1639180
1639436
1639692
1639948
1640204
1640460
1640716
1640972
1641228
1641484
1641740
1641996
1642252
1642508
1642764
1643020
1643276
1643532
1643788
1644044
1644300
1644556
1644812
1645068
1645324
1645580
1645836
1646092
1646348
1638413
1638669
1638925
1639181
1639437
1639693
1639949
1640205
1640461
1640717
1640973
1641229
1641485
1641741
1641997
1642253
1642509
1642765
1643021
1643277
1643533
1643789
1644045
1644301
1644557
1644813
1645069
1645325
1645581
1645837
1646093
1646349
1638414
1638670
1638926
1639182
1639438
1639694
1639950
1640206
1640462
1640718
1640974
1641230
1641486
1641742
1641998
1642254
1642510
1642766
1643022
1643278
1643534
1643790
1644046
1644302
1644558
1644814
1645070
1645326
1645582
1645838
1646094
1646350
1638415
1638671
1638927
1639183
1639439
1639695
1639951
1640207
1640463
1640719
1640975
1641231
1641487
1641743
1641999
1642255
1642511
1642767
1643023
1643279
1643535
1643791
1644047
1644303
1644559
1644815
1645071
1645327
1645583
1645839
1646095
1646351
1638416
1638672
1638928
1639184
1639440
1639696
1639952
1640208
1640464
1640720
1640976
1641232
1641488
1641744
1642000
1642256
1642512
1642768
1643024
1643280
1643536
1643792
1644048
1644304
1644560
1644816
1645072
1645328
1645584
1645840
1646096
1646352
1638417
1638673
1638929
1639185
1639441
1639697
1639953
1640209
1640465
1640721
1640977
1641233
1641489
1641745
1642001
1642257
1642513
1642769
1643025
1643281
1643537
1643793
1644049
1644305
1644561
1644817
1645073
1645329
1645585
1645841
1646097
1646353
1638418
1638674
1638930
1639186
1639442
1639698
1639954
1640210
1640466
1640722
1640978
1641234
1641490
1641746
1642002
1642258
1642514
1642770
1643026
1643282
1643538
1643794
1644050
1644306
1644562
1644818
1645074
1645330
1645586
1645842
1646098
1646354
1638419
1638675
1638931
1639187
1639443
1639699
1639955
1640211
1640467
1640723
1640979
1641235
1641491
1641747
1642003
1642259
1642515
1642771
1643027
1643283
1643539
1643795
1644051
1644307
1644563
1644819
1645075
1645331
1645587
1645843
1646099
1646355
1638420
1638676
1638932
1639188
1639444
1639700
1639956
1640212
1640468
1640724
1640980
1641236
1641492
1641748
1642004
1642260
1642516
1642772
1643028
1643284
1643540
1643796
1644052
1644308
1644564
1644820
1645076
1645332
1645588
1645844
1646100
1646356
1638421
1638677
1638933
1639189
1639445
1639701
1639957
1640213
1640469
1640725
1640981
1641237
1641493
1641749
1642005
1642261
1642517
1642773
1643029
1643285
1643541
1643797
1644053
1644309
1644565
1644821
1645077
1645333
1645589
1645845
1646101
1646357
1638422
1638678
1638934
1639190
1639446
1639702
1639958
1640214
1640470
1640726
1640982
1641238
1641494
1641750
1642006
1642262
1642518
1642774
1643030
1643286
1643542
1643798
1644054
1644310
1644566
1644822
1645078
1645334
1645590
1645846
1646102
1646358
1638423
1638679
1638935
1639191
1639447
1639703
1639959
1640215
1640471
1640727
1640983
1641239
1641495
1641751
1642007
1642263
1642519
1642775
1643031
1643287
1643543
1643799
1644055
1644311
1644567
1644823
1645079
1645335
1645591
1645847
1646103
1646359
1638424
1638680
1638936
1639192
1639448
1639704
1639960
1640216
1640472
1640728
1640984
1641240
1641496
1641752
1642008
1642264
1642520
1642776
1643032
1643288
1643544
1643800
1644056
1644312
1644568
1644824
1645080
1645336
1645592
1645848
1646104
1646360
1638425
1638681
1638937
1639193
1639449
1639705
1639961
1640217
1640473
1640729
1640985
1641241
1641497
1641753
1642009
1642265
1642521
1642777
1643033
1643289
1643545
1643801
1644057
1644313
1644569
1644825
1645081
1645337
1645593
1645849
1646105
1646361
1638426
1638682
1638938
1639194
1639450
1639706
1639962
1640218
1640474
1640730
1640986
1641242
1641498
1641754
1642010
1642266
1642522
1642778
1643034
1643290
1643546
1643802
1644058
1644314
1644570
1644826
1645082
1645338
1645594
1645850
1646106
1646362
1638427
1638683
1638939
1639195
1639451
1639707
1639963
1640219
1640475
1640731
1640987
1641243
1641499
1641755
1642011
1642267
1642523
1642779
1643035
1643291
1643547
1643803
1644059
1644315
1644571
1644827
1645083
1645339
1645595
1645851
1646107
1646363
1638428
1638684
1638940
1639196
1639452
1639708
1639964
1640220
1640476
1640732
1640988
1641244
1641500
1641756
1642012
1642268
1642524
1642780
1643036
1643292
1643548
1643804
1644060
1644316
1644572
1644828
1645084
1645340
1645596
1645852
1646108
1646364
1638429
1638685
1638941
1639197
1639453
1639709
1639965
1640221
1640477
1640733
1640989
1641245
1641501
1641757
1642013
1642269
1642525
1642781
1643037
1643293
1643549
1643805
1644061
1644317
1644573
1644829
1645085
1645341
1645597
1645853
1646109
1646365
1638430
1638686
1638942
1639198
1639454
1639710
1639966
1640222
1640478
1640734
1640990
1641246
1641502
1641758
1642014
1642270
1642526
1642782
1643038
1643294
1643550
1643806
1644062
1644318
1644574
1644830
1645086
1645342
1645598
1645854
1646110
1646366
1638431
1638687
1638943
1639199
1639455
1639711
1639967
1640223
1640479
1640735
1640991
1641247
1641503
1641759
1642015
1642271
1642527
1642783
1643039
1643295
1643551
1643807
1644063
1644319
1644575
1644831
1645087
1645343
1645599
1645855
1646111
1646367
1638432
1638688
1638944
1639200
1639456
1639712
1639968
1640224
1640480
1640736
1640992
1641248
1641504
1641760
1642016
1642272
1642528
1642784
1643040
1643296
1643552
1643808
1644064
1644320
1644576
1644832
1645088
1645344
1645600
1645856
1646112
1646368
1638433
1638689
1638945
1639201
1639457
1639713
1639969
1640225
1640481
1640737
1640993
1641249
1641505
1641761
1642017
1642273
1642529
1642785
1643041
1643297
1643553
1643809
1644065
1644321
1644577
1644833
1645089
1645345
1645601
1645857
1646113
1646369
1638434
1638690
1638946
1639202
1639458
1639714
1639970
1640226
1640482
1640738
1640994
1641250
1641506
1641762
1642018
1642274
1642530
1642786
1643042
1643298
1643554
1643810
1644066
1644322
1644578
1644834
1645090
1645346
1645602
1645858
1646114
1646370
1638435
1638691
1638947
1639203
1639459
1639715
1639971
1640227
1640483
1640739
1640995
1641251
1641507
1641763
1642019
1642275
1642531
1642787
1643043
1643299
1643555
1643811
1644067
1644323
1644579
1644835
1645091
1645347
1645603
1645859
1646115
1646371
1638436
1638692
1638948
1639204
1639460
1639716
1639972
1640228
1640484
1640740
1640996
1641252
1641508
1641764
1642020
1642276
1642532
1642788
1643044
1643300
1643556
1643812
1644068
1644324
1644580
1644836
1645092
1645348
1645604
1645860
1646116
1646372
1638437
1638693
1638949
1639205
1639461
1639717
1639973
1640229
1640485
1640741
1640997
1641253
1641509
1641765
1642021
1642277
1642533
1642789
1643045
1643301
1643557
1643813
1644069
1644325
1644581
1644837
1645093
1645349
1645605
1645861
1646117
1646373
1638438
1638694
1638950
1639206
1639462
1639718
1639974
1640230
1640486
1640742
1640998
1641254
1641510
1641766
1642022
1642278
1642534
1642790
1643046
1643302
1643558
1643814
1644070
1644326
1644582
1644838
1645094
1645350
1645606
1645862
1646118
1646374
1638439
1638695
1638951
1639207
1639463
1639719
1639975
1640231
1640487
1640743
1640999
1641255
1641511
1641767
1642023
1642279
1642535
1642791
1643047
1643303
1643559
1643815
1644071
1644327
1644583
1644839
1645095
1645351
1645607
1645863
1646119
1646375
1638440
1638696
1638952
1639208
1639464
1639720
1639976
1640232
1640488
1640744
1641000
1641256
1641512
1641768
1642024
1642280
1642536
1642792
1643048
1643304
1643560
1643816
1644072
1644328
1644584
1644840
1645096
1645352
1645608
1645864
1646120
1646376
1638441
1638697
1638953
1639209
1639465
1639721
1639977
1640233
1640489
1640745
1641001
1641257
1641513
1641769
1642025
1642281
1642537
1642793
1643049
1643305
1643561
1643817
1644073
1644329
1644585
1644841
1645097
1645353
1645609
1645865
1646121
1646377
1638442
1638698
1638954
1639210
1639466
1639722
1639978
1640234
1640490
1640746
1641002
1641258
1641514
1641770
1642026
1642282
1642538
1642794
1643050
1643306
1643562
1643818
1644074
1644330
1644586
1644842
1645098
1645354
1645610
1645866
1646122
1646378
1638443
1638699
1638955
1639211
1639467
1639723
1639979
1640235
1640491
1640747
1641003
1641259
1641515
1641771
1642027
1642283
1642539
1642795
1643051
1643307
1643563
1643819
1644075
1644331
1644587
1644843
1645099
1645355
1645611
1645867
1646123
1646379
1638444
1638700
1638956
1639212
1639468
1639724
1639980
1640236
1640492
1640748
1641004
1641260
1641516
1641772
1642028
1642284
1642540
1642796
1643052
1643308
1643564
1643820
1644076
1644332
1644588
1644844
1645100
1645356
1645612
1645868
1646124
1646380
1638445
1638701
1638957
1639213
1639469
1639725
1639981
1640237
1640493
1640749
1641005
1641261
1641517
1641773
1642029
1642285
1642541
1642797
1643053
1643309
1643565
1643821
1644077
1644333
1644589
1644845
1645101
1645357
1645613
1645869
1646125
1646381
1638446
1638702
1638958
1639214
1639470
1639726
1639982
1640238
1640494
1640750
1641006
1641262
1641518
1641774
1642030
1642286
1642542
1642798
1643054
1643310
1643566
1643822
1644078
1644334
1644590
1644846
1645102
1645358
1645614
1645870
1646126
1646382
1638447
1638703
1638959
1639215
1639471
1639727
1639983
1640239
1640495
1640751
1641007
1641263
1641519
1641775
1642031
1642287
1642543
1642799
1643055
1643311
1643567
1643823
1644079
1644335
1644591
1644847
1645103
1645359
1645615
1645871
1646127
1646383
1638448
1638704
1638960
1639216
1639472
1639728
1639984
1640240
1640496
1640752
1641008
1641264
1641520
1641776
1642032
1642288
1642544
1642800
1643056
1643312
1643568
1643824
1644080
1644336
1644592
1644848
1645104
1645360
1645616
1645872
1646128
1646384
1638449
1638705
1638961
1639217
1639473
1639729
1639985
1640241
1640497
1640753
1641009
1641265
1641521
1641777
1642033
1642289
1642545
1642801
1643057
1643313
1643569
1643825
1644081
1644337
1644593
1644849
1645105
1645361
1645617
1645873
1646129
1646385
1638450
1638706
1638962
1639218
1639474
1639730
1639986
1640242
1640498
1640754
1641010
1641266
1641522
1641778
1642034
1642290
1642546
1642802
1643058
1643314
1643570
1643826
1644082
1644338
1644594
1644850
1645106
1645362
1645618
1645874
1646130
1646386
1638451
1638707
1638963
1639219
1639475
1639731
1639987
1640243
1640499
1640755
1641011
1641267
1641523
1641779
1642035
1642291
1642547
1642803
1643059
1643315
1643571
1643827
1644083
1644339
1644595
1644851
1645107
1645363
1645619
1645875
1646131
1646387
1638452
1638708
1638964
1639220
1639476
1639732
1639988
1640244
1640500
1640756
1641012
1641268
1641524
1641780
1642036
1642292
1642548
1642804
1643060
1643316
1643572
1643828
1644084
1644340
1644596
1644852
1645108
1645364
1645620
1645876
1646132
1646388
1638453
1638709
1638965
1639221
1639477
1639733
1639989
1640245
1640501
1640757
1641013
1641269
1641525
1641781
1642037
1642293
1642549
1642805
1643061
1643317
1643573
1643829
1644085
1644341
1644597
1644853
1645109
1645365
1645621
1645877
1646133
1646389
1638454
1638710
1638966
1639222
1639478
1639734
1639990
1640246
1640502
1640758
1641014
1641270
1641526
1641782
1642038
1642294
1642550
1642806
1643062
1643318
1643574
1643830
1644086
1644342
1644598
1644854
1645110
1645366
1645622
1645878
1646134
1646390
1638455
1638711
1638967
1639223
1639479
1639735
1639991
1640247
1640503
1640759
1641015
1641271
1641527
1641783
1642039
1642295
1642551
1642807
1643063
1643319
1643575
1643831
1644087
1644343
1644599
1644855
1645111
1645367
1645623
1645879
1646135
1646391
1638456
1638712
1638968
1639224
1639480
1639736
1639992
1640248
1640504
1640760
1641016
1641272
1641528
1641784
1642040
1642296
1642552
1642808
1643064
1643320
1643576
1643832
1644088
1644344
1644600
1644856
1645112
1645368
1645624
1645880
1646136
1646392
1638457
1638713
1638969
1639225
1639481
1639737
1639993
1640249
1640505
1640761
1641017
1641273
1641529
1641785
1642041
1642297
1642553
1642809
1643065
1643321
1643577
1643833
1644089
1644345
1644601
1644857
1645113
1645369
1645625
1645881
1646137
1646393
1638458
1638714
1638970
1639226
1639482
1639738
1639994
1640250
1640506
1640762
1641018
1641274
1641530
1641786
1642042
1642298
1642554
1642810
1643066
1643322
1643578
1643834
1644090
1644346
1644602
1644858
1645114
1645370
1645626
1645882
1646138
1646394
1638459
1638715
1638971
1639227
1639483
1639739
1639995
1640251
1640507
1640763
1641019
1641275
1641531
1641787
1642043
1642299
1642555
1642811
1643067
1643323
1643579
1643835
1644091
1644347
1644603
1644859
1645115
1645371
1645627
1645883
1646139
1646395
1638460
1638716
1638972
1639228
1639484
1639740
1639996
1640252
1640508
1640764
1641020
1641276
1641532
1641788
1642044
1642300
1642556
1642812
1643068
1643324
1643580
1643836
1644092
1644348
1644604
1644860
1645116
1645372
1645628
1645884
1646140
1646396
1638461
1638717
1638973
1639229
1639485
1639741
1639997
1640253
1640509
1640765
1641021
1641277
1641533
1641789
1642045
1642301
1642557
1642813
1643069
1643325
1643581
1643837
1644093
1644349
1644605
1644861
1645117
1645373
1645629
1645885
1646141
1646397
1638462
1638718
1638974
1639230
1639486
1639742
1639998
1640254
1640510
1640766
1641022
1641278
1641534
1641790
1642046
1642302
1642558
1642814
1643070
1643326
1643582
1643838
1644094
1644350
1644606
1644862
1645118
1645374
1645630
1645886
1646142
1646398
1638463
1638719
1638975
1639231
1639487
1639743
1639999
1640255
1640511
1640767
1641023
1641279
1641535
1641791
1642047
1642303
1642559
1642815
1643071
1643327
1643583
1643839
1644095
1644351
1644607
1644863
1645119
1645375
1645631
1645887
1646143
1646399
1638464
1638720
1638976
1639232
1639488
1639744
1640000
1640256
1640512
1640768
1641024
1641280
1641536
1641792
1642048
1642304
1642560
1642816
1643072
1643328
1643584
1643840
1644096
1644352
1644608
1644864
1645120
1645376
1645632
1645888
1646144
1646400
1638465
1638721
1638977
1639233
1639489
1639745
1640001
1640257
1640513
1640769
1641025
1641281
1641537
1641793
1642049
1642305
1642561
1642817
1643073
1643329
1643585
1643841
1644097
1644353
1644609
1644865
1645121
1645377
1645633
1645889
1646145
1646401
1638466
1638722
1638978
1639234
1639490
1639746
1640002
1640258
1640514
1640770
1641026
1641282
1641538
1641794
1642050
1642306
1642562
1642818
1643074
1643330
1643586
1643842
1644098
1644354
1644610
1644866
1645122
1645378
1645634
1645890
1646146
1646402
1638467
1638723
1638979
1639235
1639491
1639747
1640003
1640259
1640515
1640771
1641027
1641283
1641539
1641795
1642051
1642307
1642563
1642819
1643075
1643331
1643587
1643843
1644099
1644355
1644611
1644867
1645123
1645379
1645635
1645891
1646147
1646403
1638468
1638724
1638980
1639236
1639492
1639748
1640004
1640260
1640516
1640772
1641028
1641284
1641540
1641796
1642052
1642308
1642564
1642820
1643076
1643332
1643588
1643844
1644100
1644356
1644612
1644868
1645124
1645380
1645636
1645892
1646148
1646404
1638469
1638725
1638981
1639237
1639493
1639749
1640005
1640261
1640517
1640773
1641029
1641285
1641541
1641797
1642053
1642309
1642565
1642821
1643077
1643333
1643589
1643845
1644101
1644357
1644613
1644869
1645125
1645381
1645637
1645893
1646149
1646405
1638470
1638726
1638982
1639238
1639494
1639750
1640006
1640262
1640518
1640774
1641030
1641286
1641542
1641798
1642054
1642310
1642566
1642822
1643078
1643334
1643590
1643846
1644102
1644358
1644614
1644870
1645126
1645382
1645638
1645894
1646150
1646406
1638471
1638727
1638983
1639239
1639495
1639751
1640007
1640263
1640519
1640775
1641031
1641287
1641543
1641799
1642055
1642311
1642567
1642823
1643079
1643335
1643591
1643847
1644103
1644359
1644615
1644871
1645127
1645383
1645639
1645895
1646151
1646407
1638472
1638728
1638984
1639240
1639496
1639752
1640008
1640264
1640520
1640776
1641032
1641288
1641544
1641800
1642056
1642312
1642568
1642824
1643080
1643336
1643592
1643848
1644104
1644360
1644616
1644872
1645128
1645384
1645640
1645896
1646152
1646408
1638473
1638729
1638985
1639241
1639497
1639753
1640009
1640265
1640521
1640777
1641033
1641289
1641545
1641801
1642057
1642313
1642569
1642825
1643081
1643337
1643593
1643849
1644105
1644361
1644617
1644873
1645129
1645385
1645641
1645897
1646153
1646409
1638474
1638730
1638986
1639242
1639498
1639754
1640010
1640266
1640522
1640778
1641034
1641290
1641546
1641802
1642058
1642314
1642570
1642826
1643082
1643338
1643594
1643850
1644106
1644362
1644618
1644874
1645130
1645386
1645642
1645898
1646154
1646410
1638475
1638731
1638987
1639243
1639499
1639755
1640011
1640267
1640523
1640779
1641035
1641291
1641547
1641803
1642059
1642315
1642571
1642827
1643083
1643339
1643595
1643851
1644107
1644363
1644619
1644875
1645131
1645387
1645643
1645899
1646155
1646411
1638476
1638732
1638988
1639244
1639500
1639756
1640012
1640268
1640524
1640780
1641036
1641292
1641548
1641804
1642060
1642316
1642572
1642828
1643084
1643340
1643596
1643852
1644108
1644364
1644620
1644876
1645132
1645388
1645644
1645900
1646156
1646412
1638477
1638733
1638989
1639245
1639501
1639757
1640013
1640269
1640525
1640781
1641037
1641293
1641549
1641805
1642061
1642317
1642573
1642829
1643085
1643341
1643597
1643853
1644109
1644365
1644621
1644877
1645133
1645389
1645645
1645901
1646157
1646413
1638478
1638734
1638990
1639246
1639502
1639758
1640014
1640270
1640526
1640782
1641038
1641294
1641550
1641806
1642062
1642318
1642574
1642830
1643086
1643342
1643598
1643854
1644110
1644366
1644622
1644878
1645134
1645390
1645646
1645902
1646158
1646414
1638479
1638735
1638991
1639247
1639503
1639759
1640015
1640271
1640527
1640783
1641039
1641295
1641551
1641807
1642063
1642319
1642575
1642831
1643087
1643343
1643599
1643855
1644111
1644367
1644623
1644879
1645135
1645391
1645647
1645903
1646159
1646415
1638480
1638736
1638992
1639248
1639504
1639760
1640016
1640272
1640528
1640784
1641040
1641296
1641552
1641808
1642064
1642320
1642576
1642832
1643088
1643344
1643600
1643856
1644112
1644368
1644624
1644880
1645136
1645392
1645648
1645904
1646160
1646416
1638481
1638737
1638993
1639249
1639505
1639761
1640017
1640273
1640529
1640785
1641041
1641297
1641553
1641809
1642065
1642321
1642577
1642833
1643089
1643345
1643601
1643857
1644113
1644369
1644625
1644881
1645137
1645393
1645649
1645905
1646161
1646417
1638482
1638738
1638994
1639250
1639506
1639762
1640018
1640274
1640530
1640786
1641042
1641298
1641554
1641810
1642066
1642322
1642578
1642834
1643090
1643346
1643602
1643858
1644114
1644370
1644626
1644882
1645138
1645394
1645650
1645906
1646162
1646418
1638483
1638739
1638995
1639251
1639507
1639763
1640019
1640275
1640531
1640787
1641043
1641299
1641555
1641811
1642067
1642323
1642579
1642835
1643091
1643347
1643603
1643859
1644115
1644371
1644627
1644883
1645139
1645395
1645651
1645907
1646163
1646419
1638484
1638740
1638996
1639252
1639508
1639764
1640020
1640276
1640532
1640788
1641044
1641300
1641556
1641812
1642068
1642324
1642580
1642836
1643092
1643348
1643604
1643860
1644116
1644372
1644628
1644884
1645140
1645396
1645652
1645908
1646164
1646420
1638485
1638741
1638997
1639253
1639509
1639765
1640021
1640277
1640533
1640789
1641045
1641301
1641557
1641813
1642069
1642325
1642581
1642837
1643093
1643349
1643605
1643861
1644117
1644373
1644629
1644885
1645141
1645397
1645653
1645909
1646165
1646421
1638486
1638742
1638998
1639254
1639510
1639766
1640022
1640278
1640534
1640790
1641046
1641302
1641558
1641814
1642070
1642326
1642582
1642838
1643094
1643350
1643606
1643862
1644118
1644374
1644630
1644886
1645142
1645398
1645654
1645910
1646166
1646422
1638487
1638743
1638999
1639255
1639511
1639767
1640023
1640279
1640535
1640791
1641047
1641303
1641559
1641815
1642071
1642327
1642583
1642839
1643095
1643351
1643607
1643863
1644119
1644375
1644631
1644887
1645143
1645399
1645655
1645911
1646167
1646423
1638488
1638744
1639000
1639256
1639512
1639768
1640024
1640280
1640536
1640792
1641048
1641304
1641560
1641816
1642072
1642328
1642584
1642840
1643096
1643352
1643608
1643864
1644120
1644376
1644632
1644888
1645144
1645400
1645656
1645912
1646168
1646424
1638489
1638745
1639001
1639257
1639513
1639769
1640025
1640281
1640537
1640793
1641049
1641305
1641561
1641817
1642073
1642329
1642585
1642841
1643097
1643353
1643609
1643865
1644121
1644377
1644633
1644889
1645145
1645401
1645657
1645913
1646169
1646425
1638490
1638746
1639002
1639258
1639514
1639770
1640026
1640282
1640538
1640794
1641050
1641306
1641562
1641818
1642074
1642330
1642586
1642842
1643098
1643354
1643610
1643866
1644122
1644378
1644634
1644890
1645146
1645402
1645658
1645914
1646170
1646426
1638491
1638747
1639003
1639259
1639515
1639771
1640027
1640283
1640539
1640795
1641051
1641307
1641563
1641819
1642075
1642331
1642587
1642843
1643099
1643355
1643611
1643867
1644123
1644379
1644635
1644891
1645147
1645403
1645659
1645915
1646171
1646427
1638492
1638748
1639004
1639260
1639516
1639772
1640028
1640284
1640540
1640796
1641052
1641308
1641564
1641820
1642076
1642332
1642588
1642844
1643100
1643356
1643612
1643868
1644124
1644380
1644636
1644892
1645148
1645404
1645660
1645916
1646172
1646428
1638493
1638749
1639005
1639261
1639517
1639773
1640029
1640285
1640541
1640797
1641053
1641309
1641565
1641821
1642077
1642333
1642589
1642845
1643101
1643357
1643613
1643869
1644125
1644381
1644637
1644893
1645149
1645405
1645661
1645917
1646173
1646429
1638494
1638750
1639006
1639262
1639518
1639774
1640030
1640286
1640542
1640798
1641054
1641310
1641566
1641822
1642078
1642334
1642590
1642846
1643102
1643358
1643614
1643870
1644126
1644382
1644638
1644894
1645150
1645406
1645662
1645918
1646174
1646430
1638495
1638751
1639007
1639263
1639519
1639775
1640031
1640287
1640543
1640799
1641055
1641311
1641567
1641823
1642079
1642335
1642591
1642847
1643103
1643359
1643615
1643871
1644127
1644383
1644639
1644895
1645151
1645407
1645663
1645919
1646175
1646431
2310144
2310400
2310656
2310912
2311168
2311424
2311680
2311936
2312192
2312448
2312704
2312960
2313216
2313472
2313728
2313984
2314240
2314496
2314752
2315008
2315264
2315520
2315776
2316032
2316288
2316544
2316800
2317056
2317312
2317568
2317824
2318080
2310145
2310401
2310657
2310913
2311169
2311425
2311681
2311937
2312193
2312449
2312705
2312961
2313217
2313473
2313729
2313985
2314241
2314497
2314753
2315009
2315265
2315521
2315777
2316033
2316289
2316545
2316801
2317057
2317313
2317569
2317825
2318081
2310146
2310402
2310658
2310914
2311170
2311426
2311682
2311938
2312194
2312450
2312706
2312962
2313218
2313474
2313730
2313986
2314242
2314498
2314754
2315010
2315266
2315522
2315778
2316034
2316290
2316546
2316802
2317058
2317314
2317570
2317826
2318082
2310147
2310403
2310659
2310915
2311171
2311427
2311683
2311939
2312195
2312451
2312707
2312963
2313219
2313475
2313731
2313987
2314243
2314499
2314755
2315011
2315267
2315523
2315779
2316035
2316291
2316547
2316803
2317059
2317315
2317571
2317827
2318083
2310148
2310404
2310660
2310916
2311172
2311428
2311684
2311940
2312196
2312452
2312708
2312964
2313220
2313476
2313732
2313988
2314244
2314500
2314756
2315012
2315268
2315524
2315780
2316036
2316292
2316548
2316804
2317060
2317316
2317572
2317828
2318084
2310149
2310405
2310661
2310917
2311173
2311429
2311685
2311941
2312197
2312453
2312709
2312965
2313221
2313477
2313733
2313989
2314245
2314501
2314757
2315013
2315269
2315525
2315781
2316037
2316293
2316549
2316805
2317061
2317317
2317573
2317829
2318085
2310150
2310406
2310662
2310918
2311174
2311430
2311686
2311942
2312198
2312454
2312710
2312966
2313222
2313478
2313734
2313990
2314246
2314502
2314758
2315014
2315270
2315526
2315782
2316038
2316294
2316550
2316806
2317062
2317318
2317574
2317830
2318086
2310151
2310407
2310663
2310919
2311175
2311431
2311687
2311943
2312199
2312455
2312711
2312967
2313223
2313479
2313735
2313991
2314247
2314503
2314759
2315015
2315271
2315527
2315783
2316039
2316295
2316551
2316807
2317063
2317319
2317575
2317831
2318087
2310152
2310408
2310664
2310920
2311176
2311432
2311688
2311944
2312200
2312456
2312712
2312968
2313224
2313480
2313736
2313992
2314248
2314504
2314760
2315016
2315272
2315528
2315784
2316040
2316296
2316552
2316808
2317064
2317320
2317576
2317832
2318088
2310153
2310409
2310665
2310921
2311177
2311433
2311689
2311945
2312201
2312457
2312713
2312969
2313225
2313481
2313737
2313993
2314249
2314505
2314761
2315017
2315273
2315529
2315785
2316041
2316297
2316553
2316809
2317065
2317321
2317577
2317833
2318089
2310154
2310410
2310666
2310922
2311178
2311434
2311690
2311946
2312202
2312458
2312714
2312970
2313226
2313482
2313738
2313994
2314250
2314506
2314762
2315018
2315274
2315530
2315786
2316042
2316298
2316554
2316810
2317066
2317322
2317578
2317834
2318090
2310155
2310411
2310667
2310923
2311179
2311435
2311691
2311947
2312203
2312459
2312715
2312971
2313227
2313483
2313739
2313995
2314251
2314507
2314763
2315019
2315275
2315531
2315787
2316043
2316299
2316555
2316811
2317067
2317323
2317579
2317835
2318091
2310156
2310412
2310668
2310924
2311180
2311436
2311692
2311948
2312204
2312460
2312716
2312972
2313228
2313484
2313740
2313996
2314252
2314508
2314764
2315020
2315276
2315532
2315788
2316044
2316300
2316556
2316812
2317068
2317324
2317580
2317836
2318092
2310157
2310413
2310669
2310925
2311181
2311437
2311693
2311949
2312205
2312461
2312717
2312973
2313229
2313485
2313741
2313997
2314253
2314509
2314765
2315021
2315277
2315533
2315789
2316045
2316301
2316557
2316813
2317069
2317325
2317581
2317837
2318093
2310158
2310414
2310670
2310926
2311182
2311438
2311694
2311950
2312206
2312462
2312718
2312974
2313230
2313486
2313742
2313998
2314254
2314510
2314766
2315022
2315278
2315534
2315790
2316046
2316302
2316558
2316814
2317070
2317326
2317582
2317838
2318094
2310159
2310415
2310671
2310927
2311183
2311439
2311695
2311951
2312207
2312463
2312719
2312975
2313231
2313487
2313743
2313999
2314255
2314511
2314767
2315023
2315279
2315535
2315791
2316047
2316303
2316559
2316815
2317071
2317327
2317583
2317839
2318095
2310160
2310416
2310672
2310928
2311184
2311440
2311696
2311952
2312208
2312464
2312720
2312976
2313232
2313488
2313744
2314000
2314256
2314512
2314768
2315024
2315280
2315536
2315792
2316048
2316304
2316560
2316816
2317072
2317328
2317584
2317840
2318096
2310161
2310417
2310673
2310929
2311185
2311441
2311697
2311953
2312209
2312465
2312721
2312977
2313233
2313489
2313745
2314001
2314257
2314513
2314769
2315025
2315281
2315537
2315793
2316049
2316305
2316561
2316817
2317073
2317329
2317585
2317841
2318097
2310162
2310418
2310674
2310930
2311186
2311442
2311698
2311954
2312210
2312466
2312722
2312978
2313234
2313490
2313746
2314002
2314258
2314514
2314770
2315026
2315282
2315538
2315794
2316050
2316306
2316562
2316818
2317074
2317330
2317586
2317842
2318098
2310163
2310419
2310675
2310931
2311187
2311443
2311699
2311955
2312211
2312467
2312723
2312979
2313235
2313491
2313747
2314003
2314259
2314515
2314771
2315027
2315283
2315539
2315795
2316051
2316307
2316563
2316819
2317075
2317331
2317587
2317843
2318099
2310164
2310420
2310676
2310932
2311188
2311444
2311700
2311956
2312212
2312468
2312724
2312980
2313236
2313492
2313748
2314004
2314260
2314516
2314772
2315028
2315284
2315540
2315796
2316052
2316308
2316564
2316820
2317076
2317332
2317588
2317844
2318100
2310165
2310421
2310677
2310933
2311189
2311445
2311701
2311957
2312213
2312469
2312725
2312981
2313237
2313493
2313749
2314005
2314261
2314517
2314773
2315029
2315285
2315541
2315797
2316053
2316309
2316565
2316821
2317077
2317333
2317589
2317845
2318101
2310166
2310422
2310678
2310934
2311190
2311446
2311702
2311958
2312214
2312470
2312726
2312982
2313238
2313494
2313750
2314006
2314262
2314518
2314774
2315030
2315286
2315542
2315798
2316054
2316310
2316566
2316822
2317078
2317334
2317590
2317846
2318102
2310167
2310423
2310679
2310935
2311191
2311447
2311703
2311959
2312215
2312471
2312727
2312983
2313239
2313495
2313751
2314007
2314263
2314519
2314775
2315031
2315287
2315543
2315799
2316055
2316311
2316567
2316823
2317079
2317335
2317591
2317847
2318103
2310168
2310424
2310680
2310936
2311192
2311448
2311704
2311960
2312216
2312472
2312728
2312984
2313240
2313496
2313752
2314008
2314264
2314520
2314776
2315032
2315288
2315544
2315800
2316056
2316312
2316568
2316824
2317080
2317336
2317592
2317848
2318104
2310169
2310425
2310681
2310937
2311193
2311449
2311705
2311961
2312217
2312473
2312729
2312985
2313241
2313497
2313753
2314009
2314265
2314521
2314777
2315033
2315289
2315545
2315801
2316057
2316313
2316569
2316825
2317081
2317337
2317593
2317849
2318105
2310170
2310426
2310682
2310938
2311194
2311450
2311706
2311962
2312218
2312474
2312730
2312986
2313242
2313498
2313754
2314010
2314266
2314522
2314778
2315034
2315290
2315546
2315802
2316058
2316314
2316570
2316826
2317082
2317338
2317594
2317850
2318106
2310171
2310427
2310683
2310939
2311195
2311451
2311707
2311963
2312219
2312475
2312731
2312987
2313243
2313499
2313755
2314011
2314267
2314523
2314779
2315035
2315291
2315547
2315803
2316059
2316315
2316571
2316827
2317083
2317339
2317595
2317851
2318107
2310172
2310428
2310684
2310940
2311196
2311452
2311708
2311964
2312220
2312476
2312732
2312988
2313244
2313500
2313756
2314012
2314268
2314524
2314780
2315036
2315292
2315548
2315804
2316060
2316316
2316572
2316828
2317084
2317340
2317596
2317852
2318108
2310173
2310429
2310685
2310941
2311197
2311453
2311709
2311965
2312221
2312477
2312733
2312989
2313245
2313501
2313757
2314013
2314269
2314525
2314781
2315037
2315293
2315549
2315805
2316061
2316317
2316573
2316829
2317085
2317341
2317597
2317853
2318109
2310174
2310430
2310686
2310942
2311198
2311454
2311710
2311966
2312222
2312478
2312734
2312990
2313246
2313502
2313758
2314014
2314270
2314526
2314782
2315038
2315294
2315550
2315806
2316062
2316318
2316574
2316830
2317086
2317342
2317598
2317854
2318110
2310175
2310431
2310687
2310943
2311199
2311455
2311711
2311967
2312223
2312479
2312735
2312991
2313247
2313503
2313759
2314015
2314271
2314527
2314783
2315039
2315295
2315551
2315807
2316063
2316319
2316575
2316831
2317087
2317343
2317599
2317855
2318111
2310176
2310432
2310688
2310944
2311200
2311456
2311712
2311968
2312224
2312480
2312736
2312992
2313248
2313504
2313760
2314016
2314272
2314528
2314784
2315040
2315296
2315552
2315808
2316064
2316320
2316576
2316832
2317088
2317344
2317600
2317856
2318112
2310177
2310433
2310689
2310945
2311201
2311457
2311713
2311969
2312225
2312481
2312737
2312993
2313249
2313505
2313761
2314017
2314273
2314529
2314785
2315041
2315297
2315553
2315809
2316065
2316321
2316577
2316833
2317089
2317345
2317601
2317857
2318113
2310178
2310434
2310690
2310946
2311202
2311458
2311714
2311970
2312226
2312482
2312738
2312994
2313250
2313506
2313762
2314018
2314274
2314530
2314786
2315042
2315298
2315554
2315810
2316066
2316322
2316578
2316834
2317090
2317346
2317602
2317858
2318114
2310179
2310435
2310691
2310947
2311203
2311459
2311715
2311971
2312227
2312483
2312739
2312995
2313251
2313507
2313763
2314019
2314275
2314531
2314787
2315043
2315299
2315555
2315811
2316067
2316323
2316579
2316835
2317091
2317347
2317603
2317859
2318115
2310180
2310436
2310692
2310948
2311204
2311460
2311716
2311972
2312228
2312484
2312740
2312996
2313252
2313508
2313764
2314020
2314276
2314532
2314788
2315044
2315300
2315556
2315812
2316068
2316324
2316580
2316836
2317092
2317348
2317604
2317860
2318116
2310181
2310437
2310693
2310949
2311205
2311461
2311717
2311973
2312229
2312485
2312741
2312997
2313253
2313509
2313765
2314021
2314277
2314533
2314789
2315045
2315301
2315557
2315813
2316069
2316325
2316581
2316837
2317093
2317349
2317605
2317861
2318117
2310182
2310438
2310694
2310950
2311206
2311462
2311718
2311974
2312230
2312486
2312742
2312998
2313254
2313510
2313766
2314022
2314278
2314534
2314790
2315046
2315302
2315558
2315814
2316070
2316326
2316582
2316838
2317094
2317350
2317606
2317862
2318118
2310183
2310439
2310695
2310951
2311207
2311463
2311719
2311975
2312231
2312487
2312743
2312999
2313255
2313511
2313767
2314023
2314279
2314535
2314791
2315047
2315303
2315559
2315815
2316071
2316327
2316583
2316839
2317095
2317351
2317607
2317863
2318119
2310184
2310440
2310696
2310952
2311208
2311464
2311720
2311976
2312232
2312488
2312744
2313000
2313256
2313512
2313768
2314024
2314280
2314536
2314792
2315048
2315304
2315560
2315816
2316072
2316328
2316584
2316840
2317096
2317352
2317608
2317864
2318120
2310185
2310441
2310697
2310953
2311209
2311465
2311721
2311977
2312233
2312489
2312745
2313001
2313257
2313513
2313769
2314025
2314281
2314537
2314793
2315049
2315305
2315561
2315817
2316073
2316329
2316585
2316841
2317097
2317353
2317609
2317865
2318121
2310186
2310442
2310698
2310954
2311210
2311466
2311722
2311978
2312234
2312490
2312746
2313002
2313258
2313514
2313770
2314026
2314282
2314538
2314794
2315050
2315306
2315562
2315818
2316074
2316330
2316586
2316842
2317098
2317354
2317610
2317866
2318122
2310187
2310443
2310699
2310955
2311211
2311467
2311723
2311979
2312235
2312491
2312747
2313003
2313259
2313515
2313771
2314027
2314283
2314539
2314795
2315051
2315307
2315563
2315819
2316075
2316331
2316587
2316843
2317099
2317355
2317611
2317867
2318123
2310188
2310444
2310700
2310956
2311212
2311468
2311724
2311980
2312236
2312492
2312748
2313004
2313260
2313516
2313772
2314028
2314284
2314540
2314796
2315052
2315308
2315564
2315820
2316076
2316332
2316588
2316844
2317100
2317356
2317612
2317868
2318124
2310189
2310445
2310701
2310957
2311213
2311469
2311725
2311981
2312237
2312493
2312749
2313005
2313261
2313517
2313773
2314029
2314285
2314541
2314797
2315053
2315309
2315565
2315821
2316077
2316333
2316589
2316845
2317101
2317357
2317613
2317869
2318125
2310190
2310446
2310702
2310958
2311214
2311470
2311726
2311982
2312238
2312494
2312750
2313006
2313262
2313518
2313774
2314030
2314286
2314542
2314798
2315054
2315310
2315566
2315822
2316078
2316334
2316590
2316846
2317102
2317358
2317614
2317870
2318126
2310191
2310447
2310703
2310959
2311215
2311471
2311727
2311983
2312239
2312495
2312751
2313007
2313263
2313519
2313775
2314031
2314287
2314543
2314799
2315055
2315311
2315567
2315823
2316079
2316335
2316591
2316847
2317103
2317359
2317615
2317871
2318127
2310192
2310448
2310704
2310960
2311216
2311472
2311728
2311984
2312240
2312496
2312752
2313008
2313264
2313520
2313776
2314032
2314288
2314544
2314800
2315056
2315312
2315568
2315824
2316080
2316336
2316592
2316848
2317104
2317360
2317616
2317872
2318128
2310193
2310449
2310705
2310961
2311217
2311473
2311729
2311985
2312241
2312497
2312753
2313009
2313265
2313521
2313777
2314033
2314289
2314545
2314801
2315057
2315313
2315569
2315825
2316081
2316337
2316593
2316849
2317105
2317361
2317617
2317873
2318129
2310194
2310450
2310706
2310962
2311218
2311474
2311730
2311986
2312242
2312498
2312754
2313010
2313266
2313522
2313778
2314034
2314290
2314546
2314802
2315058
2315314
2315570
2315826
2316082
2316338
2316594
2316850
2317106
2317362
2317618
2317874
2318130
2310195
2310451
2310707
2310963
2311219
2311475
2311731
2311987
2312243
2312499
2312755
2313011
2313267
2313523
2313779
2314035
2314291
2314547
2314803
2315059
2315315
2315571
2315827
2316083
2316339
2316595
2316851
2317107
2317363
2317619
2317875
2318131
2310196
2310452
2310708
2310964
2311220
2311476
2311732
2311988
2312244
2312500
2312756
2313012
2313268
2313524
2313780
2314036
2314292
2314548
2314804
2315060
2315316
2315572
2315828
2316084
2316340
2316596
2316852
2317108
2317364
2317620
2317876
2318132
2310197
2310453
2310709
2310965
2311221
2311477
2311733
2311989
2312245
2312501
2312757
2313013
2313269
2313525
2313781
2314037
2314293
2314549
2314805
2315061
2315317
2315573
2315829
2316085
2316341
2316597
2316853
2317109
2317365
2317621
2317877
2318133
2310198
2310454
2310710
2310966
2311222
2311478
2311734
2311990
2312246
2312502
2312758
2313014
2313270
2313526
2313782
2314038
2314294
2314550
2314806
2315062
2315318
2315574
2315830
2316086
2316342
2316598
2316854
2317110
2317366
2317622
2317878
2318134
2310199
2310455
2310711
2310967
2311223
2311479
2311735
2311991
2312247
2312503
2312759
2313015
2313271
2313527
2313783
2314039
2314295
2314551
2314807
2315063
2315319
2315575
2315831
2316087
2316343
2316599
2316855
2317111
2317367
2317623
2317879
2318135
2310200
2310456
2310712
2310968
2311224
2311480
2311736
2311992
2312248
2312504
2312760
2313016
2313272
2313528
2313784
2314040
2314296
2314552
2314808
2315064
2315320
2315576
2315832
2316088
2316344
2316600
2316856
2317112
2317368
2317624
2317880
2318136
2310201
2310457
2310713
2310969
2311225
2311481
2311737
2311993
2312249
2312505
2312761
2313017
2313273
2313529
2313785
2314041
2314297
2314553
2314809
2315065
2315321
2315577
2315833
2316089
2316345
2316601
2316857
2317113
2317369
2317625
2317881
2318137
2310202
2310458
2310714
2310970
2311226
2311482
2311738
2311994
2312250
2312506
2312762
2313018
2313274
2313530
2313786
2314042
2314298
2314554
2314810
2315066
2315322
2315578
2315834
2316090
2316346
2316602
2316858
2317114
2317370
2317626
2317882
2318138
2310203
2310459
2310715
2310971
2311227
2311483
2311739
2311995
2312251
2312507
2312763
2313019
2313275
2313531
2313787
2314043
2314299
2314555
2314811
2315067
2315323
2315579
2315835
2316091
2316347
2316603
2316859
2317115
2317371
2317627
2317883
2318139
2310204
2310460
2310716
2310972
2311228
2311484
2311740
2311996
2312252
2312508
2312764
2313020
2313276
2313532
2313788
2314044
2314300
2314556
2314812
2315068
2315324
2315580
2315836
2316092
2316348
2316604
2316860
2317116
2317372
2317628
2317884
2318140
2310205
2310461
2310717
2310973
2311229
2311485
2311741
2311997
2312253
2312509
2312765
2313021
2313277
2313533
2313789
2314045
2314301
2314557
2314813
2315069
2315325
2315581
2315837
2316093
2316349
2316605
2316861
2317117
2317373
2317629
2317885
2318141
2310206
2310462
2310718
2310974
2311230
2311486
2311742
2311998
2312254
2312510
2312766
2313022
2313278
2313534
2313790
2314046
2314302
2314558
2314814
2315070
2315326
2315582
2315838
2316094
2316350
2316606
2316862
2317118
2317374
2317630
2317886
2318142
2310207
2310463
2310719
2310975
2311231
2311487
2311743
2311999
2312255
2312511
2312767
2313023
2313279
2313535
2313791
2314047
2314303
2314559
2314815
2315071
2315327
2315583
2315839
2316095
2316351
2316607
2316863
2317119
2317375
2317631
2317887
2318143
2310208
2310464
2310720
2310976
2311232
2311488
2311744
2312000
2312256
2312512
2312768
2313024
2313280
2313536
2313792
2314048
2314304
2314560
2314816
2315072
2315328
2315584
2315840
2316096
2316352
2316608
2316864
2317120
2317376
2317632
2317888
2318144
2310209
2310465
2310721
2310977
2311233
2311489
2311745
2312001
2312257
2312513
2312769
2313025
2313281
2313537
2313793
2314049
2314305
2314561
2314817
2315073
2315329
2315585
2315841
2316097
2316353
2316609
2316865
2317121
2317377
2317633
2317889
2318145
2310210
2310466
2310722
2310978
2311234
2311490
2311746
2312002
2312258
2312514
2312770
2313026
2313282
2313538
2313794
2314050
2314306
2314562
2314818
2315074
2315330
2315586
2315842
2316098
2316354
2316610
2316866
2317122
2317378
2317634
2317890
2318146
2310211
2310467
2310723
2310979
2311235
2311491
2311747
2312003
2312259
2312515
2312771
2313027
2313283
2313539
2313795
2314051
2314307
2314563
2314819
2315075
2315331
2315587
2315843
2316099
2316355
2316611
2316867
2317123
2317379
2317635
2317891
2318147
2310212
2310468
2310724
2310980
2311236
2311492
2311748
2312004
2312260
2312516
2312772
2313028
2313284
2313540
2313796
2314052
2314308
2314564
2314820
2315076
2315332
2315588
2315844
2316100
2316356
2316612
2316868
2317124
2317380
2317636
2317892
2318148
2310213
2310469
2310725
2310981
2311237
2311493
2311749
2312005
2312261
2312517
2312773
2313029
2313285
2313541
2313797
2314053
2314309
2314565
2314821
2315077
2315333
2315589
2315845
2316101
2316357
2316613
2316869
2317125
2317381
2317637
2317893
2318149
2310214
2310470
2310726
2310982
2311238
2311494
2311750
2312006
2312262
2312518
2312774
2313030
2313286
2313542
2313798
2314054
2314310
2314566
2314822
2315078
2315334
2315590
2315846
2316102
2316358
2316614
2316870
2317126
2317382
2317638
2317894
2318150
2310215
2310471
2310727
2310983
2311239
2311495
2311751
2312007
2312263
2312519
2312775
2313031
2313287
2313543
2313799
2314055
2314311
2314567
2314823
2315079
2315335
2315591
2315847
2316103
2316359
2316615
2316871
2317127
2317383
2317639
2317895
2318151
2310216
2310472
2310728
2310984
2311240
2311496
2311752
2312008
2312264
2312520
2312776
2313032
2313288
2313544
2313800
2314056
2314312
2314568
2314824
2315080
2315336
2315592
2315848
2316104
2316360
2316616
2316872
2317128
2317384
2317640
2317896
2318152
2310217
2310473
2310729
2310985
2311241
2311497
2311753
2312009
2312265
2312521
2312777
2313033
2313289
2313545
2313801
2314057
2314313
2314569
2314825
2315081
2315337
2315593
2315849
2316105
2316361
2316617
2316873
2317129
2317385
2317641
2317897
2318153
2310218
2310474
2310730
2310986
2311242
2311498
2311754
2312010
2312266
2312522
2312778
2313034
2313290
2313546
2313802
2314058
2314314
2314570
2314826
2315082
2315338
2315594
2315850
2316106
2316362
2316618
2316874
2317130
2317386
2317642
2317898
2318154
2310219
2310475
2310731
2310987
2311243
2311499
2311755
2312011
2312267
2312523
2312779
2313035
2313291
2313547
2313803
2314059
2314315
2314571
2314827
2315083
2315339
2315595
2315851
2316107
2316363
2316619
2316875
2317131
2317387
2317643
2317899
2318155
2310220
2310476
2310732
2310988
2311244
2311500
2311756
2312012
2312268
2312524
2312780
2313036
2313292
2313548
2313804
2314060
2314316
2314572
2314828
2315084
2315340
2315596
2315852
2316108
2316364
2316620
2316876
2317132
2317388
2317644
2317900
2318156
2310221
2310477
2310733
2310989
2311245
2311501
2311757
2312013
2312269
2312525
2312781
2313037
2313293
2313549
2313805
2314061
2314317
2314573
2314829
2315085
2315341
2315597
2315853
2316109
2316365
2316621
2316877
2317133
2317389
2317645
2317901
2318157
2310222
2310478
2310734
2310990
2311246
2311502
2311758
2312014
2312270
2312526
2312782
2313038
2313294
2313550
2313806
2314062
2314318
2314574
2314830
2315086
2315342
2315598
2315854
2316110
2316366
2316622
2316878
2317134
2317390
2317646
2317902
2318158
2310223
2310479
2310735
2310991
2311247
2311503
2311759
2312015
2312271
2312527
2312783
2313039
2313295
2313551
2313807
2314063
2314319
2314575
2314831
2315087
2315343
2315599
2315855
2316111
2316367
2316623
2316879
2317135
2317391
2317647
2317903
2318159
2310224
2310480
2310736
2310992
2311248
2311504
2311760
2312016
2312272
2312528
2312784
2313040
2313296
2313552
2313808
2314064
2314320
2314576
2314832
2315088
2315344
2315600
2315856
2316112
2316368
2316624
2316880
2317136
2317392
2317648
2317904
2318160
2310225
2310481
2310737
2310993
2311249
2311505
2311761
2312017
2312273
2312529
2312785
2313041
2313297
2313553
2313809
2314065
2314321
2314577
2314833
2315089
2315345
2315601
2315857
2316113
2316369
2316625
2316881
2317137
2317393
2317649
2317905
2318161
2310226
2310482
2310738
2310994
2311250
2311506
2311762
2312018
2312274
2312530
2312786
2313042
2313298
2313554
2313810
2314066
2314322
2314578
2314834
2315090
2315346
2315602
2315858
2316114
2316370
2316626
2316882
2317138
2317394
2317650
2317906
2318162
2310227
2310483
2310739
2310995
2311251
2311507
2311763
2312019
2312275
2312531
2312787
2313043
2313299
2313555
2313811
2314067
2314323
2314579
2314835
2315091
2315347
2315603
2315859
2316115
2316371
2316627
2316883
2317139
2317395
2317651
2317907
2318163
2310228
2310484
2310740
2310996
2311252
2311508
2311764
2312020
2312276
2312532
2312788
2313044
2313300
2313556
2313812
2314068
2314324
2314580
2314836
2315092
2315348
2315604
2315860
2316116
2316372
2316628
2316884
2317140
2317396
2317652
2317908
2318164
2310229
2310485
2310741
2310997
2311253
2311509
2311765
2312021
2312277
2312533
2312789
2313045
2313301
2313557
2313813
2314069
2314325
2314581
2314837
2315093
2315349
2315605
2315861
2316117
2316373
2316629
2316885
2317141
2317397
2317653
2317909
2318165
2310230
2310486
2310742
2310998
2311254
2311510
2311766
2312022
2312278
2312534
2312790
2313046
2313302
2313558
2313814
2314070
2314326
2314582
2314838
2315094
2315350
2315606
2315862
2316118
2316374
2316630
2316886
2317142
2317398
2317654
2317910
2318166
2310231
2310487
2310743
2310999
2311255
2311511
2311767
2312023
2312279
2312535
2312791
2313047
2313303
2313559
2313815
2314071
2314327
2314583
2314839
2315095
2315351
2315607
2315863
2316119
2316375
2316631
2316887
2317143
2317399
2317655
2317911
2318167
2310232
2310488
2310744
2311000
2311256
2311512
2311768
2312024
2312280
2312536
2312792
2313048
2313304
2313560
2313816
2314072
2314328
2314584
2314840
2315096
2315352
2315608
2315864
2316120
2316376
2316632
2316888
2317144
2317400
2317656
2317912
2318168
2310233
2310489
2310745
2311001
2311257
2311513
2311769
2312025
2312281
2312537
2312793
2313049
2313305
2313561
2313817
2314073
2314329
2314585
2314841
2315097
2315353
2315609
2315865
2316121
2316377
2316633
2316889
2317145
2317401
2317657
2317913
2318169
2310234
2310490
2310746
2311002
2311258
2311514
2311770
2312026
2312282
2312538
2312794
2313050
2313306
2313562
2313818
2314074
2314330
2314586
2314842
2315098
2315354
2315610
2315866
2316122
2316378
2316634
2316890
2317146
2317402
2317658
2317914
2318170
2310235
2310491
2310747
2311003
2311259
2311515
2311771
2312027
2312283
2312539
2312795
2313051
2313307
2313563
2313819
2314075
2314331
2314587
2314843
2315099
2315355
2315611
2315867
2316123
2316379
2316635
2316891
2317147
2317403
2317659
2317915
2318171
2310236
2310492
2310748
2311004
2311260
2311516
2311772
2312028
2312284
2312540
2312796
2313052
2313308
2313564
2313820
2314076
2314332
2314588
2314844
2315100
2315356
2315612
2315868
2316124
2316380
2316636
2316892
2317148
2317404
2317660
2317916
2318172
2310237
2310493
2310749
2311005
2311261
2311517
2311773
2312029
2312285
2312541
2312797
2313053
2313309
2313565
2313821
2314077
2314333
2314589
2314845
2315101
2315357
2315613
2315869
2316125
2316381
2316637
2316893
2317149
2317405
2317661
2317917
2318173
2310238
2310494
2310750
2311006
2311262
2311518
2311774
2312030
2312286
2312542
2312798
2313054
2313310
2313566
2313822
2314078
2314334
2314590
2314846
2315102
2315358
2315614
2315870
2316126
2316382
2316638
2316894
2317150
2317406
2317662
2317918
2318174
2310239
2310495
2310751
2311007
2311263
2311519
2311775
2312031
2312287
2312543
2312799
2313055
2313311
2313567
2313823
2314079
2314335
2314591
2314847
2315103
2315359
2315615
2315871
2316127
2316383
2316639
2316895
2317151
2317407
2317663
2317919
2318175
