0 0 1.0 1.0 1.0
0 1 0.827640967982 0.873320519924 1.38351643085
0 2 0.5 1.0 2.0
1 0 0.666666666667 1.0 1.5
1 1 0.72109322463 0.904761910439 1.53276050091
1 2 0.5 1.0 2.0
2 0 0.666666666667 1.0 1.5
2 1 0.718967935823 0.911736190319 1.52553188801
2 2 1.0 0.0 0.0
3 0 0.666666666667 1.0 1.5
3 1 0.543171105858 0.910404622555 2.0222222805
3 2 0.5 1.0 2.0
4 0 0.5 0.5 4.0
4 1 0.706730768826 0.914480090141 1.54729008675
4 2 0.666666666667 1.0 1.5
5 0 0.5 1.0 2.0
5 1 0.634723070299 0.938235282898 1.67920589447
5 2 0.5 1.0 2.0
6 0 1.0 0.0 0.0
6 1 0.610817160679 0.934552431107 1.75180232525
6 2 1.0 0.0 0.0
7 0 0.5 1.0 2.0
7 1 0.67357515616 0.900961518288 1.64781212807
7 2 1.0 0.5 2.0
8 0 0.666666666667 1.0 1.5
8 1 0.699527336252 0.908301174641 1.57385754585
8 2 0.285714285714 1.0 3.5
9 0 0.5 1.0 2.0
9 1 0.711325959472 0.912621378899 1.54042553902
9 2 0.666666666667 1.0 1.5
10 0 0.666666666667 1.0 1.5
10 1 0.698113216968 0.912162184715 1.57037031651
10 2 0.666666666667 1.0 1.5
11 0 1.0 1.0 1.0
11 1 0.69380888274 0.922405421734 1.56256568432
11 2 0.5 1.0 2.0
12 0 1.0 1.0 1.0
12 1 0.571587119971 0.965048551559 1.8128772974
12 2 0.5 1.0 2.0
13 0 0.666666666667 1.0 1.5
13 1 0.667737771605 0.947064459324 1.58130085468
13 2 0.666666666667 1.0 1.5
14 0 2.0 0.5 1.0
14 1 0.715854516273 0.89645254612 1.55828881264
14 2 0.4 1.0 2.5
15 0 1.0 1.0 1.0
15 1 0.830793874557 0.825289547443 1.45847952366
15 2 0.666666666667 0.5 3.0
16 0 1.0 1.0 1.0
16 1 0.639079012797 0.946445941925 1.65329217911
16 2 0.285714285714 1.0 3.5
17 0 1.0 1.0 1.0
17 1 0.647169813213 0.951409161091 1.62410628796
17 2 1.0 1.0 1.0
18 0 0.666666666667 1.0 1.5
18 1 0.628623182704 0.920268952847 1.72860121727
18 2 0.25 1.0 4.0
19 0 1.0 0.5 2.0
19 1 0.721300130939 0.921380639076 1.5046826601
19 2 0.5 1.0 2.0
20 0 0.5 1.0 2.0
20 1 0.693333324517 0.934615373611 1.54320991039
20 2 0.285714285714 0.5 7.0
21 0 1.0 0.0 0.0
21 1 0.612379789574 0.96270853281 1.69622838497
21 2 1.0 1.0 1.0
22 0 1.0 1.0 1.0
22 1 0.772020713467 0.854266524315 1.51627385616
22 2 0.5 1.0 2.0
23 0 0.5 1.0 2.0
23 1 0.661478573448 0.943137228489 1.60291063786
23 2 2.0 0.5 1.0
24 0 2.0 0.5 1.0
24 1 0.689795904942 0.905325472355 1.6013071537
24 2 1.0 1.0 1.0
25 0 1.0 1.0 1.0
25 1 0.732383835257 0.947799384594 1.44060480595
25 2 1.0 1.0 1.0
26 0 1.0 1.0 1.0
26 1 1.07083333785 0.728599250317 1.28170895576
26 2 1.0 1.0 1.0
27 0 1.0 1.0 1.0
27 1 0.704768571549 0.892537295818 1.5897436142
27 2 0.600000014305 1.0 1.66666662693
28 0 1.0 1.0 1.0
28 1 0.834448154713 0.83967936039 1.42720758915
28 2 1.0 0.75 1.33333337307
29 0 2.0 0.5 1.0
29 1 0.655027931543 0.950959503651 1.60538113117
29 2 0.83333330022 0.800000011921 1.5
30 0 1.0 0.5 2.0
30 1 0.50508130479 0.971830964088 2.03726696968
30 2 5.99999982119 0.166666671634 1.0
31 0 1.0 1.0 1.0
31 1 0.425871493402 0.976331353188 2.40505051613
31 2 0.8 1.0 1.25
32 0 2.0 0.5 1.0
32 1 1.00896413127 0.693978309631 1.42816495895
32 2 0.727272727273 1.0 1.375
33 0 0.5 1.0 2.0
33 1 0.570520212383 0.967578530312 1.8115183115
33 2 1.28571426382 0.666666686535 1.16666662693
34 0 0.749999977648 1.0 1.33333337307
34 1 0.722060943793 0.911557793617 1.51929438114
34 2 1.0 1.0 1.0
35 0 1.0 1.0 1.0
35 1 0.750190999559 0.904276967049 1.47409904003
35 2 0.71428572645 0.899999976158 1.55555558205
36 0 1.0 1.0 1.0
36 1 0.606060614818 0.944000005722 1.74788141251
36 2 1.0 0.818181812763 1.22222220898
37 0 1.0 0.0 0.0
37 1 0.775316481435 0.91836732626 1.4044444561
37 2 1.09090906726 0.666666686535 1.375
38 0 0.749999977648 1.0 1.33333337307
38 1 1.14849184774 0.701010107994 1.24207496643
38 2 1.11111114055 0.800000011921 1.125
39 0 1.24999998137 0.600000023842 1.33333337307
39 1 0.723356032143 0.909090936184 1.52068960667
39 2 1.0 0.846153855324 1.18181812763
40 0 0.8 1.0 1.25
40 1 0.807495727937 0.861814320087 1.43696451187
40 2 0.826086935114 0.842105269432 1.4375
41 0 0.874999960884 1.0 1.14285719395
41 1 0.699059579676 0.942825138569 1.51724135876
41 2 4.39999986887 0.181818187237 1.25
42 0 1.33333333333 0.625 1.20000004768
42 1 0.672082731009 0.921977996826 1.61382603645
42 2 0.904761940714 0.842105269432 1.3125
43 0 0.77777778808 1.0 1.28571426868
43 1 0.752356436841 0.882687926292 1.50580644608
43 2 0.894736847719 0.941176474094 1.1875
44 0 1.0 1.0 1.0
44 1 0.851456308019 0.833523392677 1.40902876854
44 2 0.909090889387 1.0 1.10000002384
45 0 0.8 1.0 1.25
45 1 0.71843001703 0.91092634201 1.52803134918
45 2 0.857142886337 0.833333313465 1.39999997616
46 0 4.0 0.25 1.0
46 1 0.695614043453 0.901639342308 1.59440565109
46 2 5.33333333333 0.1875 1.0
47 0 1.4999999553 0.666666686535 1.0
47 1 1.14372163059 0.711640238762 1.22862458229
47 2 2.66666666667 0.3125 1.20000004768
48 0 1.28571426382 0.666666686535 1.16666662693
48 1 0.656756736866 0.901234567165 1.68949770927
48 2 0.631578931518 0.833333313465 1.89999997616
49 0 1.39999996662 0.571428596973 1.25
49 1 1.23593747859 0.63337546587 1.2774450779
49 2 0.857142886337 0.833333313465 1.39999997616
50 0 0.666666666667 1.0 1.5
50 1 0.932618733227 0.793103456497 1.35196685791
50 2 0.857142886337 1.0 1.16666662693
51 0 0.83333330022 0.40000000596 3.0
51 1 0.711250027132 0.927943766117 1.5151515007
51 2 1.0 0.75 1.33333337307
52 0 1.0 0.0 0.0
52 1 0.62098498788 0.905172407627 1.77904760838
52 2 2.1666666559 0.307692319155 1.5
53 0 1.0 0.0 0.0
53 1 1.0 0.0 0.0
53 2 1.0 0.0 0.0
