0 0 1.66666660044 0.600000023842 1.0
0 1 0.727754265226 0.914614379406 1.50237107277
0 2 1.0 0.666666686535 1.5
1 0 1.0 1.0 1.0
1 1 0.642405540951 0.93730276823 1.66077506542
1 2 1.24999998137 0.600000023842 1.33333337307
2 0 1.33333333333 0.75 1.0
2 1 0.676372516206 0.928877830505 1.5916788578
2 2 0.749999977648 1.0 1.33333337307
3 0 1.0 1.0 1.0
3 1 0.61769266686 0.919928073883 1.75984203815
3 2 0.8 0.75 1.66666662693
4 0 0.571428571429 1.0 1.75
4 1 0.719979263903 0.898792147636 1.54532814026
4 2 0.571428571429 0.75 2.33333325386
5 0 1.0 1.0 1.0
5 1 0.643515247206 0.927122890949 1.67611515522
5 2 1.0 0.666666686535 1.5
6 0 2.0 0.5 1.0
6 1 0.608525986014 0.920514583588 1.78521370888
6 2 0.571428571429 0.75 2.33333325386
7 0 1.0 0.75 1.33333337307
7 1 0.692464121063 0.878144323826 1.64451110363
7 2 0.624999990687 0.800000011921 2.0
8 0 0.749999977648 1.0 1.33333337307
8 1 0.709445521569 0.901119232178 1.56422305107
8 2 1.0 0.75 1.33333337307
9 0 0.600000014305 1.0 1.66666662693
9 1 0.720409858422 0.900709211826 1.54111754894
9 2 1.0 0.666666686535 1.5
10 0 1.33333333333 0.75 1.0
10 1 0.687036066206 0.909892320633 1.59967017174
10 2 0.666666666667 1.0 1.5
11 0 1.33333333333 0.75 1.0
11 1 0.671610454459 0.920306861401 1.61789345741
11 2 0.71428572645 0.800000011921 1.75
12 0 1.33333333333 0.75 1.0
12 1 0.60057438471 0.946434795856 1.75931060314
12 2 1.0 1.0 1.0
13 0 0.5 1.0 2.0
13 1 0.701353209253 0.922130048275 1.5462192297
13 2 0.666666666667 1.0 1.5
14 0 0.4 1.0 2.5
14 1 0.723946898874 0.899123132229 1.5362932682
14 2 1.33333333333 0.75 1.0
15 0 1.0 0.75 1.33333337307
15 1 1.4052510163 0.579861998558 1.22721719742
15 2 0.749999977648 1.0 1.33333337307
16 0 0.571428571429 1.0 1.75
16 1 0.699054336702 0.914219796658 1.5647264719
16 2 0.600000014305 1.0 1.66666662693
17 0 0.8 0.75 1.66666662693
17 1 0.65043912314 0.936821997166 1.64110469818
17 2 0.749999977648 1.0 1.33333337307
18 0 0.8 1.0 1.25
18 1 0.614989179453 0.941950440407 1.72625303268
18 2 0.428571443168 1.0 2.33333325386
19 0 1.0 1.0 1.0
19 1 0.876249397936 0.833469569683 1.36924934387
19 2 0.5 1.0 2.0
20 0 1.0 1.0 1.0
20 1 0.676998512051 0.92871016264 1.59049415588
20 2 0.600000014305 1.0 1.66666662693
21 0 1.0 1.0 1.0
21 1 0.612190837026 0.941734075546 1.73454225063
21 2 0.749999977648 1.0 1.33333337307
22 0 1.0 1.0 1.0
22 1 0.749581183552 0.887547969818 1.50310564041
22 2 1.0 1.0 1.0
23 0 0.666666666667 1.0 1.5
23 1 0.645426185077 0.944085776806 1.64112615585
23 2 1.0 1.0 1.0
24 0 1.0 0.0 0.0
24 1 0.677336117413 0.898763477802 1.64267015457
24 2 0.8 1.0 1.25
25 0 0.8 1.0 1.25
25 1 0.693859785965 0.94176453352 1.53033304214
25 2 4.0 0.25 1.0
26 0 0.624999990687 1.0 1.60000002384
26 1 0.999629277386 0.764777839184 1.30805408955
26 2 0.8 1.0 1.25
27 0 0.294117638809 0.800000011921 4.25
27 1 0.678987931273 0.911776959896 1.61528563499
27 2 1.0 1.0 1.0
28 0 0.666666666667 1.0 1.5
28 1 0.766938741962 0.877062261105 1.48665046692
28 2 1.0 0.75 1.33333337307
29 0 0.666666666667 1.0 1.5
29 1 0.621052019035 0.959202885628 1.67865538597
29 2 1.0 0.75 1.33333337307
30 0 0.83333330022 0.600000023842 2.0
30 1 0.642978051111 0.929006099701 1.67411506176
30 2 1.0 0.800000011921 1.25
31 0 0.555555570273 1.0 1.79999995232
31 1 5.70110449194 0.14459387958 1.21308457851
31 2 0.583333327538 1.0 1.71428573132
32 0 0.454545444693 0.800000011921 2.75
32 1 0.972808787579 0.65845656395 1.56115281582
32 2 0.600000014305 1.0 1.66666662693
33 0 0.83333330022 1.0 1.20000004768
33 1 0.529342826991 0.975561976433 1.93645811081
33 2 0.624999990687 1.0 1.60000002384
34 0 0.555555570273 1.0 1.79999995232
34 1 0.709818975433 0.931559443474 1.51231348515
34 2 0.600000014305 1.0 1.66666662693
35 0 0.624999990687 1.0 1.60000002384
35 1 0.715580333852 0.911811292171 1.53262758255
35 2 0.818181827049 0.666666686535 1.83333337307
36 0 0.71428572645 1.0 1.39999997616
36 1 0.569112085991 0.955082118511 1.83976137638
36 2 0.818181827049 1.0 1.22222220898
37 0 1.0 0.800000011921 1.25
37 1 0.75215473395 0.906087875366 1.46731209755
37 2 1.11111114055 0.800000011921 1.125
38 0 1.0 0.75 1.33333337307
38 1 0.890011448996 0.804990410805 1.39576947689
38 2 0.888888888889 0.875 1.28571426868
39 0 2.0 0.333333343267 1.5
39 1 0.68184820467 0.943156421185 1.55499351025
39 2 0.916666639348 0.818181812763 1.33333337307
40 0 0.624999990687 1.0 1.60000002384
40 1 0.884056975176 0.830361127853 1.36223709583
40 2 0.749999977648 0.833333313465 1.60000002384
41 0 1.0 0.833333313465 1.20000004768
41 1 0.65165933862 0.964282989502 1.59138345718
41 2 1.0 0.933333337307 1.07142853737
42 0 0.666666666667 1.0 1.5
42 1 0.591659865093 0.950222373009 1.77869975567
42 2 1.06249999604 0.823529422283 1.14285719395
43 0 0.428571443168 1.0 2.33333325386
43 1 0.683178216371 0.909244835377 1.60984897614
43 2 1.30769228371 0.647058844566 1.18181812763
44 0 1.0 0.75 1.33333337307
44 1 0.728590582529 0.890532314777 1.54122757912
44 2 0.866666673554 0.846153855324 1.36363637447
45 0 0.5 0.75 2.66666674614
45 1 0.64882104967 0.932120680809 1.65349507332
45 2 0.72222220309 0.923076927662 1.5
46 0 0.32 0.75 4.16666650772
46 1 0.724684258654 0.882089912891 1.5643658638
46 2 0.8 0.916666686535 1.36363637447
47 0 1.0 0.75 1.33333337307
47 1 0.918702375475 0.826974034309 1.31623458862
47 2 1.33333333333 0.583333313465 1.28571426868
48 0 0.699999983311 1.0 1.42857146263
48 1 0.560613213474 0.936742246151 1.90421748161
48 2 1.09090906726 0.583333313465 1.57142853737
49 0 0.666666666667 1.0 1.5
49 1 0.90422281764 0.767176270485 1.44154882431
49 2 0.899999957085 0.777777791023 1.42857146263
50 0 0.666666666667 1.0 1.5
50 1 0.872034836452 0.826319277287 1.38777256012
50 2 0.749999977648 0.833333313465 1.60000002384
51 0 0.666666666667 1.0 1.5
51 1 0.656665430355 0.952916026115 1.59808981419
51 2 0.71428572645 1.0 1.39999997616
52 0 4.0 0.25 1.0
52 1 0.502657696823 0.945911884308 2.10318255424
52 2 1.6 0.375 1.66666662693
53 0 1.0 0.0 0.0
53 1 1.0 0.0 0.0
53 2 1.0 0.0 0.0
