0 0 1.0 0.0 0.0
0 1 43.8333318909 0.00950570311397 2.40000009537
0 2 1.0 0.0 0.0
1 0 1.0 0.0 0.0
1 1 0.623395169186 0.91151791811 1.75983262062
1 2 1.0 0.0 0.0
2 0 1.0 0.0 0.0
2 1 0.685156660236 0.888305842876 1.64303791523
2 2 1.0 0.0 0.0
3 0 1.0 0.0 0.0
3 1 0.633189846871 0.909365534782 1.73671090603
3 2 1.0 0.0 0.0
4 0 1.0 0.0 0.0
4 1 0.795315676102 0.79193341732 1.58771216869
4 2 1.0 0.0 0.0
5 0 1.0 0.0 0.0
5 1 0.618144330809 0.885256826878 1.82743024826
5 2 1.0 0.0 0.0
6 0 1.0 0.0 0.0
6 1 0.610422906984 0.864240705967 1.89554655552
6 2 1.0 0.0 0.0
7 0 1.0 0.0 0.0
7 1 0.67908043889 0.824644565582 1.78571426868
7 2 1.0 0.0 0.0
8 0 1.0 0.0 0.0
8 1 0.384347822581 0.957336783409 2.71775817871
8 2 1.0 0.0 0.0
9 0 1.0 1.0 1.0
9 1 0.728586152846 0.835694074631 1.6423728466
9 2 1.0 0.0 0.0
10 0 1.0 1.0 1.0
10 1 0.701918354102 0.863349676132 1.65016233921
10 2 1.0 0.0 0.0
11 0 1.0 1.0 1.0
11 1 0.694321009808 0.854196310043 1.6860948801
11 2 1.0 0.0 0.0
12 0 1.0 0.0 0.0
12 1 1.0939648762 0.640363156796 1.42748093605
12 2 1.0 0.0 0.0
13 0 1.0 0.0 0.0
13 1 0.695278952171 0.879629611969 1.6350877285
13 2 1.0 0.0 0.0
14 0 1.0 0.0 0.0
14 1 1.0480480458 0.668338119984 1.42765271664
14 2 1.0 0.0 0.0
15 0 1.0 0.0 0.0
15 1 1.18979930258 0.591004908085 1.42211651802
15 2 1.0 0.0 0.0
16 0 1.0 0.0 0.0
16 1 0.544303785148 0.921511650085 1.99369084835
16 2 1.0 0.0 0.0
17 0 1.0 0.0 0.0
17 1 0.588435361504 0.900288999081 1.88764047623
17 2 1.0 0.0 0.0
18 0 1.0 0.0 0.0
18 1 0.797406809596 0.785230338573 1.59706640244
18 2 1.0 0.0 0.0
19 0 1.0 0.0 0.0
19 1 0.761858192574 0.821566104889 1.59765625
19 2 1.0 0.0 0.0
20 0 1.0 0.0 0.0
20 1 0.666381904642 0.866666674614 1.73150885105
20 2 1.0 0.0 0.0
21 0 1.0 0.0 0.0
21 1 0.520646953154 0.916721761227 2.09516954422
21 2 1.0 0.0 0.0
22 0 1.0 0.0 0.0
22 1 0.514134927714 0.950879752636 2.04548954964
22 2 1.0 0.0 0.0
23 0 1.0 0.0 0.0
23 1 0.597222235077 0.922832965851 1.81443297863
23 2 1.0 0.0 0.0
24 0 1.0 0.0 0.0
24 1 0.795562622496 0.780876517296 1.60969388485
24 2 1.0 0.0 0.0
25 0 1.0 0.0 0.0
25 1 2.43195269574 0.327656120062 1.25495052338
25 2 1.0 0.0 0.0
26 0 1.0 0.0 0.0
26 1 1.0 0.0 0.0
26 2 1.0 0.0 0.0
27 0 1.0 0.0 0.0
27 1 0.806480681294 0.779017865658 1.59169054031
27 2 1.0 0.0 0.0
28 0 1.0 0.0 0.0
28 1 0.845050201189 0.787775874138 1.50215518475
28 2 1.0 0.0 0.0
29 0 1.0 0.0 0.0
29 1 0.624044473262 0.935412049294 1.71309518814
29 2 1.0 0.0 0.0
30 0 1.0 0.0 0.0
30 1 0.391531472545 0.957865178585 2.6664223671
30 2 1.0 0.0 0.0
31 0 1.0 0.0 0.0
31 1 0.217014639303 0.984947621822 4.67840528488
31 2 1.0 0.0 0.0
32 0 1.0 0.0 0.0
32 1 0.632562258527 0.91350209713 1.73056197166
32 2 1.0 0.0 0.0
33 0 1.0 0.0 0.0
33 1 0.707906279259 0.911065161228 1.55051076412
33 2 1.0 0.0 0.0
34 0 1.0 0.0 0.0
34 1 0.866141753422 0.819090902805 1.40954494476
34 2 1.0 0.0 0.0
35 0 1.0 0.0 0.0
35 1 0.619512216017 0.907086610794 1.77951383591
35 2 1.0 0.0 0.0
36 0 1.0 0.0 0.0
36 1 11.1000001902 0.0225225221366 4.0
36 2 1.0 0.0 0.0
37 0 1.0 0.0 0.0
37 1 0.875611437905 0.81085395813 1.40846455097
37 2 1.0 0.0 0.0
38 0 1.0 0.0 0.0
38 1 0.383450194582 0.954645216465 2.7318007946
38 2 1.0 0.0 0.0
39 0 1.0 0.0 0.0
39 1 0.633663366337 0.921875 1.71186435223
39 2 1.0 0.0 0.0
40 0 1.0 0.0 0.0
40 1 0.806269608626 0.807931542397 1.53512990475
40 2 1.0 0.0 0.0
41 0 1.0 0.0 0.0
41 1 0.644736852218 0.933877527714 1.66083920002
41 2 1.0 1.0 1.0
42 0 1.0 0.0 0.0
42 1 1.0 0.0 0.0
42 2 1.0 0.0 0.0
43 0 1.0 0.0 0.0
43 1 0.627032063025 0.86814814806 1.83703076839
43 2 1.0 0.0 0.0
44 0 1.0 0.0 0.0
44 1 0.699040064559 0.838449120522 1.70616567135
44 2 2.0 0.5 1.0
45 0 1.0 0.0 0.0
45 1 0.645591643627 0.884995520115 1.75025379658
45 2 1.0 0.0 0.0
46 0 1.0 0.0 0.0
46 1 0.576073358463 0.931982636452 1.86257767677
46 2 1.0 0.0 0.0
47 0 1.0 0.0 0.0
47 1 1.48282828818 0.526566743851 1.28072440624
47 2 1.0 0.0 0.0
48 0 1.0 0.0 0.0
48 1 0.595946507661 0.853111445904 1.96692109108
48 2 1.0 0.0 0.0
49 0 1.0 0.0 0.0
49 1 0.876844108459 0.706656932831 1.61387169361
49 2 1.0 0.0 0.0
50 0 1.0 0.0 0.0
50 1 0.903317566983 0.697796404362 1.5864661932
50 2 1.0 0.0 0.0
51 0 1.0 0.0 0.0
51 1 0.57736390947 0.940446674824 1.84168863297
51 2 1.0 0.0 0.0
52 0 1.0 0.0 0.0
52 1 0.406319525348 0.939759016037 2.61888122559
52 2 1.0 0.0 0.0
53 0 1.0 0.0 0.0
53 1 1.0 0.0 0.0
53 2 1.0 0.0 0.0
