140849
210177
601135
863040
1129770
1255971
1255206
1387567
1522735
1584160
1583394
1584162
1583139
1583651
1583907
1584419
1583396
1584676
1583398
1583654
1583911
1585707
1846843
1910309
2629680
2637872
2638128
2703152
2703154
2765851
2761264
2762035
2764349
2763070
2764606
2958127
2958383
3030312
3029039
3029040
3090737
3089202
3090738
3090740
3089205
3090485
3090997
3089974
3090742
3091254
3092534
3089719
3089975
3090231
3091255
3090232
3090488
3091256
3090233
3091769
3094329
