140849
140594
601135
1188394
1387567
1584676
1583398
1583654
1583911
1585707
1653808
2564399
2761264
2762035
2764349
2763070
2764606
2958127
2958383
3029039
3029040
3090737
3089202
3089205
3089462
3089974
3092534
3089719
3089975
3090231
3092535
3090232
3090233
3094329
3089467
3089468
3090239
3220271
3220272
