0 0 1.0 1.0 1.0
0 1 83.4380956496 0.00422326195985 2.83783793449
0 2 1.0 0.0 0.0
1 0 0.5 1.0 2.0
1 1 0.683878815153 0.864892959595 1.69066846371
1 2 1.0 0.0 0.0
2 0 1.0 1.0 1.0
2 1 0.787601637657 0.814767003059 1.55833184719
2 2 1.0 0.0 0.0
3 0 2.0 0.5 1.0
3 1 0.67989579253 0.876621484756 1.67782080173
3 2 1.0 1.0 1.0
4 0 0.5 1.0 2.0
4 1 0.929368051156 0.707542836666 1.52075588703
4 2 1.0 0.0 0.0
5 0 1.0 0.0 0.0
5 1 0.71245926885 0.816933631897 1.71811878681
5 2 1.0 1.0 1.0
6 0 1.0 0.0 0.0
6 1 0.692132056948 0.808170497417 1.78775513172
6 2 1.0 0.0 0.0
7 0 0.4 1.0 2.5
7 1 0.843828757426 0.707587063313 1.67481100559
7 2 0.25 1.0 4.0
8 0 0.749999977648 0.666666686535 2.0
8 1 0.437207747961 0.930422723293 2.45828270912
8 2 1.0 0.0 0.0
9 0 1.4999999553 0.666666686535 1.0
9 1 0.928374276379 0.715443849564 1.50557124615
9 2 1.0 0.0 0.0
10 0 0.666666666667 1.0 1.5
10 1 0.776039473382 0.776078999043 1.66039049625
10 2 1.0 0.0 0.0
11 0 0.5 1.0 2.0
11 1 0.773307806561 0.781585454941 1.65451669693
11 2 1.0 0.0 0.0
12 0 1.4999999553 0.666666686535 1.0
12 1 1.2961048984 0.551977932453 1.39777779579
12 2 1.0 0.0 0.0
13 0 1.0 1.0 1.0
13 1 0.778461960487 0.816391766071 1.57349002361
13 2 1.0 0.0 0.0
14 0 1.0 1.0 1.0
14 1 1.04740787836 0.660680413246 1.44508290291
14 2 1.0 1.0 1.0
15 0 1.0 1.0 1.0
15 1 2.23808102464 0.329046100378 1.35789906979
15 2 1.0 1.0 1.0
16 0 1.0 1.0 1.0
16 1 0.601185528188 0.885379731655 1.87871932983
16 2 1.0 0.5 2.0
17 0 0.666666666667 1.0 1.5
17 1 0.652817835546 0.859165668488 1.7829169035
17 2 2.0 0.5 1.0
18 0 1.0 1.0 1.0
18 1 1.0237292591 0.658011376858 1.48450434208
18 2 0.666666666667 1.0 1.5
19 0 0.666666666667 1.0 1.5
19 1 0.896565456238 0.731401264668 1.52497339249
19 2 2.0 0.5 1.0
20 0 0.285714285714 1.0 3.5
20 1 0.798316310386 0.793583154678 1.57845628262
20 2 1.0 0.0 0.0
21 0 0.285714285714 1.0 3.5
21 1 0.574236371637 0.892576336861 1.95102989674
21 2 0.5 1.0 2.0
22 0 0.5 1.0 2.0
22 1 0.557720225181 0.912453889847 1.96504580975
22 2 1.0 0.0 0.0
23 0 1.0 1.0 1.0
23 1 0.683853336971 0.867250919342 1.68613469601
23 2 1.0 0.0 0.0
24 0 0.666666666667 1.0 1.5
24 1 0.711894911967 0.808518707752 1.73737692833
24 2 0.5 1.0 2.0
25 0 2.0 0.5 1.0
25 1 0.677195043143 0.903580069542 1.63425409794
25 2 1.0 0.0 0.0
26 0 2.0 0.5 1.0
26 1 1.0 0.0 0.0
26 2 1.0 0.0 0.0
27 0 1.0 1.0 1.0
27 1 0.847277827393 0.756606400013 1.55992650986
27 2 1.0 0.0 0.0
28 0 1.0 1.0 1.0
28 1 0.859175840923 0.748792290688 1.55437791348
28 2 1.0 0.0 0.0
29 0 0.5 1.0 2.0
29 1 0.735467202627 0.868657290936 1.56526625156
29 2 1.0 0.0 0.0
30 0 0.666666666667 1.0 1.5
30 1 0.394232145675 0.956933140755 2.65073537827
30 2 1.0 0.0 0.0
31 0 1.0 1.0 1.0
31 1 0.23561146856 0.977661132812 4.34125423431
31 2 1.0 0.0 0.0
32 0 1.0 0.0 0.0
32 1 0.703480778244 0.857762873173 1.65722131729
32 2 1.0 0.0 0.0
33 0 0.4 1.0 2.5
33 1 0.693291150434 0.887529671192 1.62518000603
33 2 1.0 0.0 0.0
34 0 0.5 1.0 2.0
34 1 0.954300639795 0.754917025566 1.38808333874
34 2 1.0 0.0 0.0
35 0 0.25 1.0 4.0
35 1 0.826488352019 0.803093254566 1.50659775734
35 2 1.0 0.0 0.0
36 0 0.5 1.0 2.0
36 1 28.2476486465 0.00954389106482 3.70930242538
36 2 0.5 1.0 2.0
37 0 0.666666666667 0.5 3.0
37 1 0.944866933 0.738861739635 1.43240618706
37 2 0.5 1.0 2.0
38 0 1.0 0.0 0.0
38 1 0.394341376349 0.93508541584 2.71191692352
38 2 1.0 1.0 1.0
39 0 1.0 1.0 1.0
39 1 0.667291803024 0.907532334328 1.65128517151
39 2 2.0 0.5 1.0
40 0 0.5 1.0 2.0
40 1 0.857116437286 0.761174678802 1.53276598454
40 2 0.666666666667 1.0 1.5
41 0 2.0 0.5 1.0
41 1 0.650463786301 0.912115871906 1.68549263477
41 2 0.666666666667 1.0 1.5
42 0 1.0 0.0 0.0
42 1 0.495070253215 0.923411011696 2.18744969368
42 2 1.0 0.0 0.0
43 0 1.0 1.0 1.0
43 1 0.70249494082 0.8213519454 1.73311555386
43 2 1.0 1.0 1.0
44 0 0.5 1.0 2.0
44 1 0.753452850725 0.8064442873 1.64577162266
44 2 1.0 1.0 1.0
45 0 1.0 1.0 1.0
45 1 0.689560192277 0.850175499916 1.70576512814
45 2 1.0 1.0 1.0
46 0 0.285714285714 1.0 3.5
46 1 0.659477354121 0.88492333889 1.71354091167
46 2 2.0 0.5 1.0
47 0 2.0 0.5 1.0
47 1 1.90982665276 0.398305088282 1.31458961964
47 2 1.0 1.0 1.0
48 0 1.0 1.0 1.0
48 1 0.70205857814 0.786289811134 1.81152355671
48 2 1.0 0.800000011921 1.25
49 0 0.333333333333 1.0 3.0
49 1 1.02532458619 0.621740221977 1.56866300106
49 2 4.99999992549 0.20000000298 1.0
50 0 0.333333333333 1.0 3.0
50 1 1.04839724827 0.655275762081 1.45562672615
50 2 1.33333333333 0.5 1.5
51 0 1.0 1.0 1.0
51 1 0.557215278681 0.937530755997 1.91421830654
51 2 0.666666666667 1.0 1.5
52 0 0.25 1.0 4.0
52 1 0.614512490592 0.848708510399 1.9173913002
52 2 1.0 0.5 2.0
53 0 1.0 0.0 0.0
53 1 1.0 0.0 0.0
53 2 1.0 0.0 0.0
