0 0 1.0 0.0 0.0
0 1 2.33333331015 0.428571432829 1.0
0 2 0.781397383403 0.810150563717 1.57965528965
1 0 1.0 0.0 0.0
1 1 1.0 0.0 0.0
1 2 0.551954694568 0.940911233425 1.9255194664
2 0 1.0 0.0 0.0
2 1 1.0 0.0 0.0
2 2 0.804839895674 0.775366902351 1.602445364
3 0 1.0 0.0 0.0
3 1 1.0 0.0 0.0
3 2 0.929542298977 0.745811641216 1.44245302677
4 0 1.0 0.0 0.0
4 1 1.0 0.0 0.0
4 2 0.613028378935 0.919937312603 1.77321410179
5 0 1.0 0.0 0.0
5 1 1.0 0.0 0.0
5 2 1.17155819843 0.555714845657 1.5359749794
6 0 1.0 0.0 0.0
6 1 1.0 0.0 0.0
6 2 0.749412230204 0.840385079384 1.58781862259
7 0 1.0 0.0 0.0
7 1 1.0 0.0 0.0
7 2 0.590427587665 0.93471121788 1.8119904995
8 0 1.0 0.0 0.0
8 1 1.0 0.0 0.0
8 2 1.12702580061 0.613758504391 1.44566810131
9 0 1.0 0.0 0.0
9 1 1.0 0.0 0.0
9 2 0.62849907871 0.887182712555 1.79342126846
10 0 1.0 0.0 0.0
10 1 1.0 0.0 0.0
10 2 0.742423216585 0.790622532368 1.70364558697
11 0 1.0 0.0 0.0
11 1 1.0 0.0 0.0
11 2 0.960749009228 0.739986479282 1.40658593178
12 0 1.0 0.0 0.0
12 1 1.0 0.0 0.0
12 2 0.795760274956 0.79106926918 1.58855855465
13 0 1.0 0.0 0.0
13 1 1.0 0.0 0.0
13 2 0.743401570725 0.798827826977 1.68392729759
14 0 1.0 0.0 0.0
14 1 1.0 0.0 0.0
14 2 0.824508417082 0.792535483837 1.53033399582
15 0 1.0 0.0 0.0
15 1 1.0 0.0 0.0
15 2 0.752926443844 0.845321834087 1.57117795944
16 0 1.0 0.0 0.0
16 1 1.0 0.0 0.0
16 2 0.797516204197 0.799265265465 1.56880700588
17 0 1.0 0.0 0.0
17 1 1.0 0.0 0.0
17 2 0.783195566695 0.846926867962 1.50759208202
18 0 1.0 0.0 0.0
18 1 1.0 0.0 0.0
18 2 0.980565909639 0.663884162903 1.53614020348
19 0 1.0 0.0 0.0
19 1 1.0 0.0 0.0
19 2 1.96521691665 0.367424815893 1.38490831852
20 0 1.0 0.0 0.0
20 1 1.0 0.0 0.0
20 2 0.771500263356 0.836241781712 1.55000126362
21 0 1.0 0.0 0.0
21 1 1.0 0.0 0.0
21 2 0.724161572667 0.861273288727 1.60333228111
22 0 1.0 0.0 0.0
22 1 1.0 0.0 0.0
22 2 0.724314578071 0.898131847382 1.53720808029
23 0 1.0 0.0 0.0
23 1 1.0 0.0 0.0
23 2 0.67589321339 0.889067709446 1.66412937641
24 0 1.0 0.0 0.0
24 1 1.0 0.0 0.0
24 2 0.856622350463 0.744944930077 1.56706285477
25 0 1.0 0.0 0.0
25 1 1.0 0.0 0.0
25 2 0.694386760127 0.937148272991 1.53670418262
26 0 1.0 0.0 0.0
26 1 1.0 0.0 0.0
26 2 0.584989999126 0.931034505367 1.83605539799
27 0 1.0 0.0 0.0
27 1 1.0 0.0 0.0
27 2 0.777727095057 0.727436482906 1.76757442951
28 0 1.0 0.0 0.0
28 1 1.0 0.0 0.0
28 2 1.09464938199 0.65161472559 1.40195500851
29 0 1.0 0.0 0.0
29 1 1.0 0.0 0.0
29 2 0.740826620631 0.872610628605 1.54690241814
30 0 1.0 0.0 0.0
30 1 1.0 0.0 0.0
30 2 1.18569285671 0.583946943283 1.44429004192
31 0 1.0 0.0 0.0
31 1 1.0 0.0 0.0
31 2 1.13566388843 0.528195500374 1.66707623005
32 0 1.0 0.0 0.0
32 1 1.0 0.0 0.0
32 2 0.707699939426 0.918289840221 1.53876066208
33 0 1.0 0.0 0.0
33 1 1.0 0.0 0.0
33 2 0.691557810677 0.894218444824 1.61706662178
34 0 1.0 0.0 0.0
34 1 1.0 0.0 0.0
34 2 0.743478395355 0.912196040154 1.47449553013
35 0 1.0 0.0 0.0
35 1 1.0 0.0 0.0
35 2 0.566303470214 0.94975066185 1.85926449299
36 0 1.0 0.0 0.0
36 1 1.0 0.0 0.0
36 2 0.696005757479 0.901536762714 1.59368956089
37 0 1.0 0.0 0.0
37 1 1.0 0.0 0.0
37 2 0.744029282898 0.877390623093 1.53185272217
38 0 1.0 0.0 0.0
38 1 1.0 0.0 0.0
38 2 0.801692262319 0.876793205738 1.42264032364
39 0 1.0 0.0 0.0
39 1 1.0 0.0 0.0
39 2 0.80988607289 0.849012494087 1.45432686806
40 0 1.0 0.0 0.0
40 1 1.0 0.0 0.0
40 2 0.623763457011 0.920373916626 1.74187004566
41 0 1.0 0.0 0.0
41 1 1.0 0.0 0.0
41 2 4.18626062349 0.198714256287 1.20211136341
42 0 1.0 0.0 0.0
42 1 1.0 0.0 0.0
42 2 0.915710823588 0.779620587826 1.40074265003
43 0 1.0 0.0 0.0
43 1 1.0 0.0 0.0
43 2 0.856294178816 0.839367985725 1.39131224155
44 0 1.0 0.0 0.0
44 1 1.0 0.0 0.0
44 2 0.595171049255 0.954312741756 1.76062750816
45 0 1.0 0.0 0.0
45 1 1.0 0.0 0.0
45 2 0.651471478715 0.941821694374 1.62980592251
46 0 1.0 0.0 0.0
46 1 1.0 0.0 0.0
46 2 14.6721350865 0.0501696318388 1.3585190773
47 0 1.0 0.0 0.0
47 1 1.0 0.0 0.0
47 2 3.93694400211 0.207084521651 1.22657227516
48 0 1.0 0.0 0.0
48 1 1.0 0.0 0.0
48 2 0.723098076559 0.8346773386 1.65685379505
49 0 1.0 0.0 0.0
49 1 1.0 0.0 0.0
49 2 0.61516073576 0.920967757702 1.76509046555
50 0 1.0 0.0 0.0
50 1 1.0 0.0 0.0
50 2 0.722627098378 0.885793507099 1.56225991249
51 0 1.0 0.0 0.0
51 1 1.0 0.0 0.0
51 2 0.639397735257 0.913134455681 1.71275067329
52 0 1.0 0.0 0.0
52 1 1.0 0.0 0.0
52 2 52.0015695271 0.00821132119745 2.34191179276
53 0 1.0 0.0 0.0
53 1 1.0 0.0 0.0
53 2 1.0 0.0 0.0
