1589248
1589504
1589760
1590016
1590272
1590528
1590784
1591040
1591296
1591552
1591808
1592064
1592320
1592576
1592832
1593088
1593344
1593600
1593856
1594112
1594368
1594624
1594880
1595136
1595392
1595648
1595904
1596160
1596416
1596672
1596928
1597184
1589249
1589505
1589761
1590017
1590273
1590529
1590785
1591041
1591297
1591553
1591809
1592065
1592321
1592577
1592833
1593089
1593345
1593601
1593857
1594113
1594369
1594625
1594881
1595137
1595393
1595649
1595905
1596161
1596417
1596673
1596929
1597185
1589250
1589506
1589762
1590018
1590274
1590530
1590786
1591042
1591298
1591554
1591810
1592066
1592322
1592578
1592834
1593090
1593346
1593602
1593858
1594114
1594370
1594626
1594882
1595138
1595394
1595650
1595906
1596162
1596418
1596674
1596930
1597186
1589251
1589507
1589763
1590019
1590275
1590531
1590787
1591043
1591299
1591555
1591811
1592067
1592323
1592579
1592835
1593091
1593347
1593603
1593859
1594115
1594371
1594627
1594883
1595139
1595395
1595651
1595907
1596163
1596419
1596675
1596931
1597187
1589252
1589508
1589764
1590020
1590276
1590532
1590788
1591044
1591300
1591556
1591812
1592068
1592324
1592580
1592836
1593092
1593348
1593604
1593860
1594116
1594372
1594628
1594884
1595140
1595396
1595652
1595908
1596164
1596420
1596676
1596932
1597188
1589253
1589509
1589765
1590021
1590277
1590533
1590789
1591045
1591301
1591557
1591813
1592069
1592325
1592581
1592837
1593093
1593349
1593605
1593861
1594117
1594373
1594629
1594885
1595141
1595397
1595653
1595909
1596165
1596421
1596677
1596933
1597189
1589254
1589510
1589766
1590022
1590278
1590534
1590790
1591046
1591302
1591558
1591814
1592070
1592326
1592582
1592838
1593094
1593350
1593606
1593862
1594118
1594374
1594630
1594886
1595142
1595398
1595654
1595910
1596166
1596422
1596678
1596934
1597190
1589255
1589511
1589767
1590023
1590279
1590535
1590791
1591047
1591303
1591559
1591815
1592071
1592327
1592583
1592839
1593095
1593351
1593607
1593863
1594119
1594375
1594631
1594887
1595143
1595399
1595655
1595911
1596167
1596423
1596679
1596935
1597191
1589256
1589512
1589768
1590024
1590280
1590536
1590792
1591048
1591304
1591560
1591816
1592072
1592328
1592584
1592840
1593096
1593352
1593608
1593864
1594120
1594376
1594632
1594888
1595144
1595400
1595656
1595912
1596168
1596424
1596680
1596936
1597192
1589257
1589513
1589769
1590025
1590281
1590537
1590793
1591049
1591305
1591561
1591817
1592073
1592329
1592585
1592841
1593097
1593353
1593609
1593865
1594121
1594377
1594633
1594889
1595145
1595401
1595657
1595913
1596169
1596425
1596681
1596937
1597193
1589258
1589514
1589770
1590026
1590282
1590538
1590794
1591050
1591306
1591562
1591818
1592074
1592330
1592586
1592842
1593098
1593354
1593610
1593866
1594122
1594378
1594634
1594890
1595146
1595402
1595658
1595914
1596170
1596426
1596682
1596938
1597194
1589259
1589515
1589771
1590027
1590283
1590539
1590795
1591051
1591307
1591563
1591819
1592075
1592331
1592587
1592843
1593099
1593355
1593611
1593867
1594123
1594379
1594635
1594891
1595147
1595403
1595659
1595915
1596171
1596427
1596683
1596939
1597195
1589260
1589516
1589772
1590028
1590284
1590540
1590796
1591052
1591308
1591564
1591820
1592076
1592332
1592588
1592844
1593100
1593356
1593612
1593868
1594124
1594380
1594636
1594892
1595148
1595404
1595660
1595916
1596172
1596428
1596684
1596940
1597196
1589261
1589517
1589773
1590029
1590285
1590541
1590797
1591053
1591309
1591565
1591821
1592077
1592333
1592589
1592845
1593101
1593357
1593613
1593869
1594125
1594381
1594637
1594893
1595149
1595405
1595661
1595917
1596173
1596429
1596685
1596941
1597197
1589262
1589518
1589774
1590030
1590286
1590542
1590798
1591054
1591310
1591566
1591822
1592078
1592334
1592590
1592846
1593102
1593358
1593614
1593870
1594126
1594382
1594638
1594894
1595150
1595406
1595662
1595918
1596174
1596430
1596686
1596942
1597198
1589263
1589519
1589775
1590031
1590287
1590543
1590799
1591055
1591311
1591567
1591823
1592079
1592335
1592591
1592847
1593103
1593359
1593615
1593871
1594127
1594383
1594639
1594895
1595151
1595407
1595663
1595919
1596175
1596431
1596687
1596943
1597199
1589264
1589520
1589776
1590032
1590288
1590544
1590800
1591056
1591312
1591568
1591824
1592080
1592336
1592592
1592848
1593104
1593360
1593616
1593872
1594128
1594384
1594640
1594896
1595152
1595408
1595664
1595920
1596176
1596432
1596688
1596944
1597200
1589265
1589521
1589777
1590033
1590289
1590545
1590801
1591057
1591313
1591569
1591825
1592081
1592337
1592593
1592849
1593105
1593361
1593617
1593873
1594129
1594385
1594641
1594897
1595153
1595409
1595665
1595921
1596177
1596433
1596689
1596945
1597201
1589266
1589522
1589778
1590034
1590290
1590546
1590802
1591058
1591314
1591570
1591826
1592082
1592338
1592594
1592850
1593106
1593362
1593618
1593874
1594130
1594386
1594642
1594898
1595154
1595410
1595666
1595922
1596178
1596434
1596690
1596946
1597202
1589267
1589523
1589779
1590035
1590291
1590547
1590803
1591059
1591315
1591571
1591827
1592083
1592339
1592595
1592851
1593107
1593363
1593619
1593875
1594131
1594387
1594643
1594899
1595155
1595411
1595667
1595923
1596179
1596435
1596691
1596947
1597203
1589268
1589524
1589780
1590036
1590292
1590548
1590804
1591060
1591316
1591572
1591828
1592084
1592340
1592596
1592852
1593108
1593364
1593620
1593876
1594132
1594388
1594644
1594900
1595156
1595412
1595668
1595924
1596180
1596436
1596692
1596948
1597204
1589269
1589525
1589781
1590037
1590293
1590549
1590805
1591061
1591317
1591573
1591829
1592085
1592341
1592597
1592853
1593109
1593365
1593621
1593877
1594133
1594389
1594645
1594901
1595157
1595413
1595669
1595925
1596181
1596437
1596693
1596949
1597205
1589270
1589526
1589782
1590038
1590294
1590550
1590806
1591062
1591318
1591574
1591830
1592086
1592342
1592598
1592854
1593110
1593366
1593622
1593878
1594134
1594390
1594646
1594902
1595158
1595414
1595670
1595926
1596182
1596438
1596694
1596950
1597206
1589271
1589527
1589783
1590039
1590295
1590551
1590807
1591063
1591319
1591575
1591831
1592087
1592343
1592599
1592855
1593111
1593367
1593623
1593879
1594135
1594391
1594647
1594903
1595159
1595415
1595671
1595927
1596183
1596439
1596695
1596951
1597207
1589272
1589528
1589784
1590040
1590296
1590552
1590808
1591064
1591320
1591576
1591832
1592088
1592344
1592600
1592856
1593112
1593368
1593624
1593880
1594136
1594392
1594648
1594904
1595160
1595416
1595672
1595928
1596184
1596440
1596696
1596952
1597208
1589273
1589529
1589785
1590041
1590297
1590553
1590809
1591065
1591321
1591577
1591833
1592089
1592345
1592601
1592857
1593113
1593369
1593625
1593881
1594137
1594393
1594649
1594905
1595161
1595417
1595673
1595929
1596185
1596441
1596697
1596953
1597209
1589274
1589530
1589786
1590042
1590298
1590554
1590810
1591066
1591322
1591578
1591834
1592090
1592346
1592602
1592858
1593114
1593370
1593626
1593882
1594138
1594394
1594650
1594906
1595162
1595418
1595674
1595930
1596186
1596442
1596698
1596954
1597210
1589275
1589531
1589787
1590043
1590299
1590555
1590811
1591067
1591323
1591579
1591835
1592091
1592347
1592603
1592859
1593115
1593371
1593627
1593883
1594139
1594395
1594651
1594907
1595163
1595419
1595675
1595931
1596187
1596443
1596699
1596955
1597211
1589276
1589532
1589788
1590044
1590300
1590556
1590812
1591068
1591324
1591580
1591836
1592092
1592348
1592604
1592860
1593116
1593372
1593628
1593884
1594140
1594396
1594652
1594908
1595164
1595420
1595676
1595932
1596188
1596444
1596700
1596956
1597212
1589277
1589533
1589789
1590045
1590301
1590557
1590813
1591069
1591325
1591581
1591837
1592093
1592349
1592605
1592861
1593117
1593373
1593629
1593885
1594141
1594397
1594653
1594909
1595165
1595421
1595677
1595933
1596189
1596445
1596701
1596957
1597213
1589278
1589534
1589790
1590046
1590302
1590558
1590814
1591070
1591326
1591582
1591838
1592094
1592350
1592606
1592862
1593118
1593374
1593630
1593886
1594142
1594398
1594654
1594910
1595166
1595422
1595678
1595934
1596190
1596446
1596702
1596958
1597214
1589279
1589535
1589791
1590047
1590303
1590559
1590815
1591071
1591327
1591583
1591839
1592095
1592351
1592607
1592863
1593119
1593375
1593631
1593887
1594143
1594399
1594655
1594911
1595167
1595423
1595679
1595935
1596191
1596447
1596703
1596959
1597215
1589280
1589536
1589792
1590048
1590304
1590560
1590816
1591072
1591328
1591584
1591840
1592096
1592352
1592608
1592864
1593120
1593376
1593632
1593888
1594144
1594400
1594656
1594912
1595168
1595424
1595680
1595936
1596192
1596448
1596704
1596960
1597216
1589281
1589537
1589793
1590049
1590305
1590561
1590817
1591073
1591329
1591585
1591841
1592097
1592353
1592609
1592865
1593121
1593377
1593633
1593889
1594145
1594401
1594657
1594913
1595169
1595425
1595681
1595937
1596193
1596449
1596705
1596961
1597217
1589282
1589538
1589794
1590050
1590306
1590562
1590818
1591074
1591330
1591586
1591842
1592098
1592354
1592610
1592866
1593122
1593378
1593634
1593890
1594146
1594402
1594658
1594914
1595170
1595426
1595682
1595938
1596194
1596450
1596706
1596962
1597218
1589283
1589539
1589795
1590051
1590307
1590563
1590819
1591075
1591331
1591587
1591843
1592099
1592355
1592611
1592867
1593123
1593379
1593635
1593891
1594147
1594403
1594659
1594915
1595171
1595427
1595683
1595939
1596195
1596451
1596707
1596963
1597219
1589284
1589540
1589796
1590052
1590308
1590564
1590820
1591076
1591332
1591588
1591844
1592100
1592356
1592612
1592868
1593124
1593380
1593636
1593892
1594148
1594404
1594660
1594916
1595172
1595428
1595684
1595940
1596196
1596452
1596708
1596964
1597220
1589285
1589541
1589797
1590053
1590309
1590565
1590821
1591077
1591333
1591589
1591845
1592101
1592357
1592613
1592869
1593125
1593381
1593637
1593893
1594149
1594405
1594661
1594917
1595173
1595429
1595685
1595941
1596197
1596453
1596709
1596965
1597221
1589286
1589542
1589798
1590054
1590310
1590566
1590822
1591078
1591334
1591590
1591846
1592102
1592358
1592614
1592870
1593126
1593382
1593638
1593894
1594150
1594406
1594662
1594918
1595174
1595430
1595686
1595942
1596198
1596454
1596710
1596966
1597222
1589287
1589543
1589799
1590055
1590311
1590567
1590823
1591079
1591335
1591591
1591847
1592103
1592359
1592615
1592871
1593127
1593383
1593639
1593895
1594151
1594407
1594663
1594919
1595175
1595431
1595687
1595943
1596199
1596455
1596711
1596967
1597223
1589288
1589544
1589800
1590056
1590312
1590568
1590824
1591080
1591336
1591592
1591848
1592104
1592360
1592616
1592872
1593128
1593384
1593640
1593896
1594152
1594408
1594664
1594920
1595176
1595432
1595688
1595944
1596200
1596456
1596712
1596968
1597224
1589289
1589545
1589801
1590057
1590313
1590569
1590825
1591081
1591337
1591593
1591849
1592105
1592361
1592617
1592873
1593129
1593385
1593641
1593897
1594153
1594409
1594665
1594921
1595177
1595433
1595689
1595945
1596201
1596457
1596713
1596969
1597225
1589290
1589546
1589802
1590058
1590314
1590570
1590826
1591082
1591338
1591594
1591850
1592106
1592362
1592618
1592874
1593130
1593386
1593642
1593898
1594154
1594410
1594666
1594922
1595178
1595434
1595690
1595946
1596202
1596458
1596714
1596970
1597226
1589291
1589547
1589803
1590059
1590315
1590571
1590827
1591083
1591339
1591595
1591851
1592107
1592363
1592619
1592875
1593131
1593387
1593643
1593899
1594155
1594411
1594667
1594923
1595179
1595435
1595691
1595947
1596203
1596459
1596715
1596971
1597227
1589292
1589548
1589804
1590060
1590316
1590572
1590828
1591084
1591340
1591596
1591852
1592108
1592364
1592620
1592876
1593132
1593388
1593644
1593900
1594156
1594412
1594668
1594924
1595180
1595436
1595692
1595948
1596204
1596460
1596716
1596972
1597228
1589293
1589549
1589805
1590061
1590317
1590573
1590829
1591085
1591341
1591597
1591853
1592109
1592365
1592621
1592877
1593133
1593389
1593645
1593901
1594157
1594413
1594669
1594925
1595181
1595437
1595693
1595949
1596205
1596461
1596717
1596973
1597229
1589294
1589550
1589806
1590062
1590318
1590574
1590830
1591086
1591342
1591598
1591854
1592110
1592366
1592622
1592878
1593134
1593390
1593646
1593902
1594158
1594414
1594670
1594926
1595182
1595438
1595694
1595950
1596206
1596462
1596718
1596974
1597230
1589295
1589551
1589807
1590063
1590319
1590575
1590831
1591087
1591343
1591599
1591855
1592111
1592367
1592623
1592879
1593135
1593391
1593647
1593903
1594159
1594415
1594671
1594927
1595183
1595439
1595695
1595951
1596207
1596463
1596719
1596975
1597231
1589296
1589552
1589808
1590064
1590320
1590576
1590832
1591088
1591344
1591600
1591856
1592112
1592368
1592624
1592880
1593136
1593392
1593648
1593904
1594160
1594416
1594672
1594928
1595184
1595440
1595696
1595952
1596208
1596464
1596720
1596976
1597232
1589297
1589553
1589809
1590065
1590321
1590577
1590833
1591089
1591345
1591601
1591857
1592113
1592369
1592625
1592881
1593137
1593393
1593649
1593905
1594161
1594417
1594673
1594929
1595185
1595441
1595697
1595953
1596209
1596465
1596721
1596977
1597233
1589298
1589554
1589810
1590066
1590322
1590578
1590834
1591090
1591346
1591602
1591858
1592114
1592370
1592626
1592882
1593138
1593394
1593650
1593906
1594162
1594418
1594674
1594930
1595186
1595442
1595698
1595954
1596210
1596466
1596722
1596978
1597234
1589299
1589555
1589811
1590067
1590323
1590579
1590835
1591091
1591347
1591603
1591859
1592115
1592371
1592627
1592883
1593139
1593395
1593651
1593907
1594163
1594419
1594675
1594931
1595187
1595443
1595699
1595955
1596211
1596467
1596723
1596979
1597235
1589300
1589556
1589812
1590068
1590324
1590580
1590836
1591092
1591348
1591604
1591860
1592116
1592372
1592628
1592884
1593140
1593396
1593652
1593908
1594164
1594420
1594676
1594932
1595188
1595444
1595700
1595956
1596212
1596468
1596724
1596980
1597236
1589301
1589557
1589813
1590069
1590325
1590581
1590837
1591093
1591349
1591605
1591861
1592117
1592373
1592629
1592885
1593141
1593397
1593653
1593909
1594165
1594421
1594677
1594933
1595189
1595445
1595701
1595957
1596213
1596469
1596725
1596981
1597237
1589302
1589558
1589814
1590070
1590326
1590582
1590838
1591094
1591350
1591606
1591862
1592118
1592374
1592630
1592886
1593142
1593398
1593654
1593910
1594166
1594422
1594678
1594934
1595190
1595446
1595702
1595958
1596214
1596470
1596726
1596982
1597238
1589303
1589559
1589815
1590071
1590327
1590583
1590839
1591095
1591351
1591607
1591863
1592119
1592375
1592631
1592887
1593143
1593399
1593655
1593911
1594167
1594423
1594679
1594935
1595191
1595447
1595703
1595959
1596215
1596471
1596727
1596983
1597239
1589304
1589560
1589816
1590072
1590328
1590584
1590840
1591096
1591352
1591608
1591864
1592120
1592376
1592632
1592888
1593144
1593400
1593656
1593912
1594168
1594424
1594680
1594936
1595192
1595448
1595704
1595960
1596216
1596472
1596728
1596984
1597240
1589305
1589561
1589817
1590073
1590329
1590585
1590841
1591097
1591353
1591609
1591865
1592121
1592377
1592633
1592889
1593145
1593401
1593657
1593913
1594169
1594425
1594681
1594937
1595193
1595449
1595705
1595961
1596217
1596473
1596729
1596985
1597241
1589306
1589562
1589818
1590074
1590330
1590586
1590842
1591098
1591354
1591610
1591866
1592122
1592378
1592634
1592890
1593146
1593402
1593658
1593914
1594170
1594426
1594682
1594938
1595194
1595450
1595706
1595962
1596218
1596474
1596730
1596986
1597242
1589307
1589563
1589819
1590075
1590331
1590587
1590843
1591099
1591355
1591611
1591867
1592123
1592379
1592635
1592891
1593147
1593403
1593659
1593915
1594171
1594427
1594683
1594939
1595195
1595451
1595707
1595963
1596219
1596475
1596731
1596987
1597243
1589308
1589564
1589820
1590076
1590332
1590588
1590844
1591100
1591356
1591612
1591868
1592124
1592380
1592636
1592892
1593148
1593404
1593660
1593916
1594172
1594428
1594684
1594940
1595196
1595452
1595708
1595964
1596220
1596476
1596732
1596988
1597244
1589309
1589565
1589821
1590077
1590333
1590589
1590845
1591101
1591357
1591613
1591869
1592125
1592381
1592637
1592893
1593149
1593405
1593661
1593917
1594173
1594429
1594685
1594941
1595197
1595453
1595709
1595965
1596221
1596477
1596733
1596989
1597245
1589310
1589566
1589822
1590078
1590334
1590590
1590846
1591102
1591358
1591614
1591870
1592126
1592382
1592638
1592894
1593150
1593406
1593662
1593918
1594174
1594430
1594686
1594942
1595198
1595454
1595710
1595966
1596222
1596478
1596734
1596990
1597246
1589311
1589567
1589823
1590079
1590335
1590591
1590847
1591103
1591359
1591615
1591871
1592127
1592383
1592639
1592895
1593151
1593407
1593663
1593919
1594175
1594431
1594687
1594943
1595199
1595455
1595711
1595967
1596223
1596479
1596735
1596991
1597247
1589312
1589568
1589824
1590080
1590336
1590592
1590848
1591104
1591360
1591616
1591872
1592128
1592384
1592640
1592896
1593152
1593408
1593664
1593920
1594176
1594432
1594688
1594944
1595200
1595456
1595712
1595968
1596224
1596480
1596736
1596992
1597248
1589313
1589569
1589825
1590081
1590337
1590593
1590849
1591105
1591361
1591617
1591873
1592129
1592385
1592641
1592897
1593153
1593409
1593665
1593921
1594177
1594433
1594689
1594945
1595201
1595457
1595713
1595969
1596225
1596481
1596737
1596993
1597249
1589314
1589570
1589826
1590082
1590338
1590594
1590850
1591106
1591362
1591618
1591874
1592130
1592386
1592642
1592898
1593154
1593410
1593666
1593922
1594178
1594434
1594690
1594946
1595202
1595458
1595714
1595970
1596226
1596482
1596738
1596994
1597250
1589315
1589571
1589827
1590083
1590339
1590595
1590851
1591107
1591363
1591619
1591875
1592131
1592387
1592643
1592899
1593155
1593411
1593667
1593923
1594179
1594435
1594691
1594947
1595203
1595459
1595715
1595971
1596227
1596483
1596739
1596995
1597251
1589316
1589572
1589828
1590084
1590340
1590596
1590852
1591108
1591364
1591620
1591876
1592132
1592388
1592644
1592900
1593156
1593412
1593668
1593924
1594180
1594436
1594692
1594948
1595204
1595460
1595716
1595972
1596228
1596484
1596740
1596996
1597252
1589317
1589573
1589829
1590085
1590341
1590597
1590853
1591109
1591365
1591621
1591877
1592133
1592389
1592645
1592901
1593157
1593413
1593669
1593925
1594181
1594437
1594693
1594949
1595205
1595461
1595717
1595973
1596229
1596485
1596741
1596997
1597253
1589318
1589574
1589830
1590086
1590342
1590598
1590854
1591110
1591366
1591622
1591878
1592134
1592390
1592646
1592902
1593158
1593414
1593670
1593926
1594182
1594438
1594694
1594950
1595206
1595462
1595718
1595974
1596230
1596486
1596742
1596998
1597254
1589319
1589575
1589831
1590087
1590343
1590599
1590855
1591111
1591367
1591623
1591879
1592135
1592391
1592647
1592903
1593159
1593415
1593671
1593927
1594183
1594439
1594695
1594951
1595207
1595463
1595719
1595975
1596231
1596487
1596743
1596999
1597255
1589320
1589576
1589832
1590088
1590344
1590600
1590856
1591112
1591368
1591624
1591880
1592136
1592392
1592648
1592904
1593160
1593416
1593672
1593928
1594184
1594440
1594696
1594952
1595208
1595464
1595720
1595976
1596232
1596488
1596744
1597000
1597256
1589321
1589577
1589833
1590089
1590345
1590601
1590857
1591113
1591369
1591625
1591881
1592137
1592393
1592649
1592905
1593161
1593417
1593673
1593929
1594185
1594441
1594697
1594953
1595209
1595465
1595721
1595977
1596233
1596489
1596745
1597001
1597257
1589322
1589578
1589834
1590090
1590346
1590602
1590858
1591114
1591370
1591626
1591882
1592138
1592394
1592650
1592906
1593162
1593418
1593674
1593930
1594186
1594442
1594698
1594954
1595210
1595466
1595722
1595978
1596234
1596490
1596746
1597002
1597258
1589323
1589579
1589835
1590091
1590347
1590603
1590859
1591115
1591371
1591627
1591883
1592139
1592395
1592651
1592907
1593163
1593419
1593675
1593931
1594187
1594443
1594699
1594955
1595211
1595467
1595723
1595979
1596235
1596491
1596747
1597003
1597259
1589324
1589580
1589836
1590092
1590348
1590604
1590860
1591116
1591372
1591628
1591884
1592140
1592396
1592652
1592908
1593164
1593420
1593676
1593932
1594188
1594444
1594700
1594956
1595212
1595468
1595724
1595980
1596236
1596492
1596748
1597004
1597260
1589325
1589581
1589837
1590093
1590349
1590605
1590861
1591117
1591373
1591629
1591885
1592141
1592397
1592653
1592909
1593165
1593421
1593677
1593933
1594189
1594445
1594701
1594957
1595213
1595469
1595725
1595981
1596237
1596493
1596749
1597005
1597261
1589326
1589582
1589838
1590094
1590350
1590606
1590862
1591118
1591374
1591630
1591886
1592142
1592398
1592654
1592910
1593166
1593422
1593678
1593934
1594190
1594446
1594702
1594958
1595214
1595470
1595726
1595982
1596238
1596494
1596750
1597006
1597262
1589327
1589583
1589839
1590095
1590351
1590607
1590863
1591119
1591375
1591631
1591887
1592143
1592399
1592655
1592911
1593167
1593423
1593679
1593935
1594191
1594447
1594703
1594959
1595215
1595471
1595727
1595983
1596239
1596495
1596751
1597007
1597263
1589328
1589584
1589840
1590096
1590352
1590608
1590864
1591120
1591376
1591632
1591888
1592144
1592400
1592656
1592912
1593168
1593424
1593680
1593936
1594192
1594448
1594704
1594960
1595216
1595472
1595728
1595984
1596240
1596496
1596752
1597008
1597264
1589329
1589585
1589841
1590097
1590353
1590609
1590865
1591121
1591377
1591633
1591889
1592145
1592401
1592657
1592913
1593169
1593425
1593681
1593937
1594193
1594449
1594705
1594961
1595217
1595473
1595729
1595985
1596241
1596497
1596753
1597009
1597265
1589330
1589586
1589842
1590098
1590354
1590610
1590866
1591122
1591378
1591634
1591890
1592146
1592402
1592658
1592914
1593170
1593426
1593682
1593938
1594194
1594450
1594706
1594962
1595218
1595474
1595730
1595986
1596242
1596498
1596754
1597010
1597266
1589331
1589587
1589843
1590099
1590355
1590611
1590867
1591123
1591379
1591635
1591891
1592147
1592403
1592659
1592915
1593171
1593427
1593683
1593939
1594195
1594451
1594707
1594963
1595219
1595475
1595731
1595987
1596243
1596499
1596755
1597011
1597267
1589332
1589588
1589844
1590100
1590356
1590612
1590868
1591124
1591380
1591636
1591892
1592148
1592404
1592660
1592916
1593172
1593428
1593684
1593940
1594196
1594452
1594708
1594964
1595220
1595476
1595732
1595988
1596244
1596500
1596756
1597012
1597268
1589333
1589589
1589845
1590101
1590357
1590613
1590869
1591125
1591381
1591637
1591893
1592149
1592405
1592661
1592917
1593173
1593429
1593685
1593941
1594197
1594453
1594709
1594965
1595221
1595477
1595733
1595989
1596245
1596501
1596757
1597013
1597269
1589334
1589590
1589846
1590102
1590358
1590614
1590870
1591126
1591382
1591638
1591894
1592150
1592406
1592662
1592918
1593174
1593430
1593686
1593942
1594198
1594454
1594710
1594966
1595222
1595478
1595734
1595990
1596246
1596502
1596758
1597014
1597270
1589335
1589591
1589847
1590103
1590359
1590615
1590871
1591127
1591383
1591639
1591895
1592151
1592407
1592663
1592919
1593175
1593431
1593687
1593943
1594199
1594455
1594711
1594967
1595223
1595479
1595735
1595991
1596247
1596503
1596759
1597015
1597271
1589336
1589592
1589848
1590104
1590360
1590616
1590872
1591128
1591384
1591640
1591896
1592152
1592408
1592664
1592920
1593176
1593432
1593688
1593944
1594200
1594456
1594712
1594968
1595224
1595480
1595736
1595992
1596248
1596504
1596760
1597016
1597272
1589337
1589593
1589849
1590105
1590361
1590617
1590873
1591129
1591385
1591641
1591897
1592153
1592409
1592665
1592921
1593177
1593433
1593689
1593945
1594201
1594457
1594713
1594969
1595225
1595481
1595737
1595993
1596249
1596505
1596761
1597017
1597273
1589338
1589594
1589850
1590106
1590362
1590618
1590874
1591130
1591386
1591642
1591898
1592154
1592410
1592666
1592922
1593178
1593434
1593690
1593946
1594202
1594458
1594714
1594970
1595226
1595482
1595738
1595994
1596250
1596506
1596762
1597018
1597274
1589339
1589595
1589851
1590107
1590363
1590619
1590875
1591131
1591387
1591643
1591899
1592155
1592411
1592667
1592923
1593179
1593435
1593691
1593947
1594203
1594459
1594715
1594971
1595227
1595483
1595739
1595995
1596251
1596507
1596763
1597019
1597275
1589340
1589596
1589852
1590108
1590364
1590620
1590876
1591132
1591388
1591644
1591900
1592156
1592412
1592668
1592924
1593180
1593436
1593692
1593948
1594204
1594460
1594716
1594972
1595228
1595484
1595740
1595996
1596252
1596508
1596764
1597020
1597276
1589341
1589597
1589853
1590109
1590365
1590621
1590877
1591133
1591389
1591645
1591901
1592157
1592413
1592669
1592925
1593181
1593437
1593693
1593949
1594205
1594461
1594717
1594973
1595229
1595485
1595741
1595997
1596253
1596509
1596765
1597021
1597277
1589342
1589598
1589854
1590110
1590366
1590622
1590878
1591134
1591390
1591646
1591902
1592158
1592414
1592670
1592926
1593182
1593438
1593694
1593950
1594206
1594462
1594718
1594974
1595230
1595486
1595742
1595998
1596254
1596510
1596766
1597022
1597278
1589343
1589599
1589855
1590111
1590367
1590623
1590879
1591135
1591391
1591647
1591903
1592159
1592415
1592671
1592927
1593183
1593439
1593695
1593951
1594207
1594463
1594719
1594975
1595231
1595487
1595743
1595999
1596255
1596511
1596767
1597023
1597279
2162688
2162944
2163200
2163456
2163712
2163968
2164224
2164480
2164736
2164992
2165248
2165504
2165760
2166016
2166272
2166528
2166784
2167040
2167296
2167552
2167808
2168064
2168320
2168576
2168832
2169088
2169344
2169600
2169856
2170112
2170368
2170624
2162689
2162945
2163201
2163457
2163713
2163969
2164225
2164481
2164737
2164993
2165249
2165505
2165761
2166017
2166273
2166529
2166785
2167041
2167297
2167553
2167809
2168065
2168321
2168577
2168833
2169089
2169345
2169601
2169857
2170113
2170369
2170625
2162690
2162946
2163202
2163458
2163714
2163970
2164226
2164482
2164738
2164994
2165250
2165506
2165762
2166018
2166274
2166530
2166786
2167042
2167298
2167554
2167810
2168066
2168322
2168578
2168834
2169090
2169346
2169602
2169858
2170114
2170370
2170626
2162691
2162947
2163203
2163459
2163715
2163971
2164227
2164483
2164739
2164995
2165251
2165507
2165763
2166019
2166275
2166531
2166787
2167043
2167299
2167555
2167811
2168067
2168323
2168579
2168835
2169091
2169347
2169603
2169859
2170115
2170371
2170627
2162692
2162948
2163204
2163460
2163716
2163972
2164228
2164484
2164740
2164996
2165252
2165508
2165764
2166020
2166276
2166532
2166788
2167044
2167300
2167556
2167812
2168068
2168324
2168580
2168836
2169092
2169348
2169604
2169860
2170116
2170372
2170628
2162693
2162949
2163205
2163461
2163717
2163973
2164229
2164485
2164741
2164997
2165253
2165509
2165765
2166021
2166277
2166533
2166789
2167045
2167301
2167557
2167813
2168069
2168325
2168581
2168837
2169093
2169349
2169605
2169861
2170117
2170373
2170629
2162694
2162950
2163206
2163462
2163718
2163974
2164230
2164486
2164742
2164998
2165254
2165510
2165766
2166022
2166278
2166534
2166790
2167046
2167302
2167558
2167814
2168070
2168326
2168582
2168838
2169094
2169350
2169606
2169862
2170118
2170374
2170630
2162695
2162951
2163207
2163463
2163719
2163975
2164231
2164487
2164743
2164999
2165255
2165511
2165767
2166023
2166279
2166535
2166791
2167047
2167303
2167559
2167815
2168071
2168327
2168583
2168839
2169095
2169351
2169607
2169863
2170119
2170375
2170631
2162696
2162952
2163208
2163464
2163720
2163976
2164232
2164488
2164744
2165000
2165256
2165512
2165768
2166024
2166280
2166536
2166792
2167048
2167304
2167560
2167816
2168072
2168328
2168584
2168840
2169096
2169352
2169608
2169864
2170120
2170376
2170632
2162697
2162953
2163209
2163465
2163721
2163977
2164233
2164489
2164745
2165001
2165257
2165513
2165769
2166025
2166281
2166537
2166793
2167049
2167305
2167561
2167817
2168073
2168329
2168585
2168841
2169097
2169353
2169609
2169865
2170121
2170377
2170633
2162698
2162954
2163210
2163466
2163722
2163978
2164234
2164490
2164746
2165002
2165258
2165514
2165770
2166026
2166282
2166538
2166794
2167050
2167306
2167562
2167818
2168074
2168330
2168586
2168842
2169098
2169354
2169610
2169866
2170122
2170378
2170634
2162699
2162955
2163211
2163467
2163723
2163979
2164235
2164491
2164747
2165003
2165259
2165515
2165771
2166027
2166283
2166539
2166795
2167051
2167307
2167563
2167819
2168075
2168331
2168587
2168843
2169099
2169355
2169611
2169867
2170123
2170379
2170635
2162700
2162956
2163212
2163468
2163724
2163980
2164236
2164492
2164748
2165004
2165260
2165516
2165772
2166028
2166284
2166540
2166796
2167052
2167308
2167564
2167820
2168076
2168332
2168588
2168844
2169100
2169356
2169612
2169868
2170124
2170380
2170636
2162701
2162957
2163213
2163469
2163725
2163981
2164237
2164493
2164749
2165005
2165261
2165517
2165773
2166029
2166285
2166541
2166797
2167053
2167309
2167565
2167821
2168077
2168333
2168589
2168845
2169101
2169357
2169613
2169869
2170125
2170381
2170637
2162702
2162958
2163214
2163470
2163726
2163982
2164238
2164494
2164750
2165006
2165262
2165518
2165774
2166030
2166286
2166542
2166798
2167054
2167310
2167566
2167822
2168078
2168334
2168590
2168846
2169102
2169358
2169614
2169870
2170126
2170382
2170638
2162703
2162959
2163215
2163471
2163727
2163983
2164239
2164495
2164751
2165007
2165263
2165519
2165775
2166031
2166287
2166543
2166799
2167055
2167311
2167567
2167823
2168079
2168335
2168591
2168847
2169103
2169359
2169615
2169871
2170127
2170383
2170639
2162704
2162960
2163216
2163472
2163728
2163984
2164240
2164496
2164752
2165008
2165264
2165520
2165776
2166032
2166288
2166544
2166800
2167056
2167312
2167568
2167824
2168080
2168336
2168592
2168848
2169104
2169360
2169616
2169872
2170128
2170384
2170640
2162705
2162961
2163217
2163473
2163729
2163985
2164241
2164497
2164753
2165009
2165265
2165521
2165777
2166033
2166289
2166545
2166801
2167057
2167313
2167569
2167825
2168081
2168337
2168593
2168849
2169105
2169361
2169617
2169873
2170129
2170385
2170641
2162706
2162962
2163218
2163474
2163730
2163986
2164242
2164498
2164754
2165010
2165266
2165522
2165778
2166034
2166290
2166546
2166802
2167058
2167314
2167570
2167826
2168082
2168338
2168594
2168850
2169106
2169362
2169618
2169874
2170130
2170386
2170642
2162707
2162963
2163219
2163475
2163731
2163987
2164243
2164499
2164755
2165011
2165267
2165523
2165779
2166035
2166291
2166547
2166803
2167059
2167315
2167571
2167827
2168083
2168339
2168595
2168851
2169107
2169363
2169619
2169875
2170131
2170387
2170643
2162708
2162964
2163220
2163476
2163732
2163988
2164244
2164500
2164756
2165012
2165268
2165524
2165780
2166036
2166292
2166548
2166804
2167060
2167316
2167572
2167828
2168084
2168340
2168596
2168852
2169108
2169364
2169620
2169876
2170132
2170388
2170644
2162709
2162965
2163221
2163477
2163733
2163989
2164245
2164501
2164757
2165013
2165269
2165525
2165781
2166037
2166293
2166549
2166805
2167061
2167317
2167573
2167829
2168085
2168341
2168597
2168853
2169109
2169365
2169621
2169877
2170133
2170389
2170645
2162710
2162966
2163222
2163478
2163734
2163990
2164246
2164502
2164758
2165014
2165270
2165526
2165782
2166038
2166294
2166550
2166806
2167062
2167318
2167574
2167830
2168086
2168342
2168598
2168854
2169110
2169366
2169622
2169878
2170134
2170390
2170646
2162711
2162967
2163223
2163479
2163735
2163991
2164247
2164503
2164759
2165015
2165271
2165527
2165783
2166039
2166295
2166551
2166807
2167063
2167319
2167575
2167831
2168087
2168343
2168599
2168855
2169111
2169367
2169623
2169879
2170135
2170391
2170647
2162712
2162968
2163224
2163480
2163736
2163992
2164248
2164504
2164760
2165016
2165272
2165528
2165784
2166040
2166296
2166552
2166808
2167064
2167320
2167576
2167832
2168088
2168344
2168600
2168856
2169112
2169368
2169624
2169880
2170136
2170392
2170648
2162713
2162969
2163225
2163481
2163737
2163993
2164249
2164505
2164761
2165017
2165273
2165529
2165785
2166041
2166297
2166553
2166809
2167065
2167321
2167577
2167833
2168089
2168345
2168601
2168857
2169113
2169369
2169625
2169881
2170137
2170393
2170649
2162714
2162970
2163226
2163482
2163738
2163994
2164250
2164506
2164762
2165018
2165274
2165530
2165786
2166042
2166298
2166554
2166810
2167066
2167322
2167578
2167834
2168090
2168346
2168602
2168858
2169114
2169370
2169626
2169882
2170138
2170394
2170650
2162715
2162971
2163227
2163483
2163739
2163995
2164251
2164507
2164763
2165019
2165275
2165531
2165787
2166043
2166299
2166555
2166811
2167067
2167323
2167579
2167835
2168091
2168347
2168603
2168859
2169115
2169371
2169627
2169883
2170139
2170395
2170651
2162716
2162972
2163228
2163484
2163740
2163996
2164252
2164508
2164764
2165020
2165276
2165532
2165788
2166044
2166300
2166556
2166812
2167068
2167324
2167580
2167836
2168092
2168348
2168604
2168860
2169116
2169372
2169628
2169884
2170140
2170396
2170652
2162717
2162973
2163229
2163485
2163741
2163997
2164253
2164509
2164765
2165021
2165277
2165533
2165789
2166045
2166301
2166557
2166813
2167069
2167325
2167581
2167837
2168093
2168349
2168605
2168861
2169117
2169373
2169629
2169885
2170141
2170397
2170653
2162718
2162974
2163230
2163486
2163742
2163998
2164254
2164510
2164766
2165022
2165278
2165534
2165790
2166046
2166302
2166558
2166814
2167070
2167326
2167582
2167838
2168094
2168350
2168606
2168862
2169118
2169374
2169630
2169886
2170142
2170398
2170654
2162719
2162975
2163231
2163487
2163743
2163999
2164255
2164511
2164767
2165023
2165279
2165535
2165791
2166047
2166303
2166559
2166815
2167071
2167327
2167583
2167839
2168095
2168351
2168607
2168863
2169119
2169375
2169631
2169887
2170143
2170399
2170655
2162720
2162976
2163232
2163488
2163744
2164000
2164256
2164512
2164768
2165024
2165280
2165536
2165792
2166048
2166304
2166560
2166816
2167072
2167328
2167584
2167840
2168096
2168352
2168608
2168864
2169120
2169376
2169632
2169888
2170144
2170400
2170656
2162721
2162977
2163233
2163489
2163745
2164001
2164257
2164513
2164769
2165025
2165281
2165537
2165793
2166049
2166305
2166561
2166817
2167073
2167329
2167585
2167841
2168097
2168353
2168609
2168865
2169121
2169377
2169633
2169889
2170145
2170401
2170657
2162722
2162978
2163234
2163490
2163746
2164002
2164258
2164514
2164770
2165026
2165282
2165538
2165794
2166050
2166306
2166562
2166818
2167074
2167330
2167586
2167842
2168098
2168354
2168610
2168866
2169122
2169378
2169634
2169890
2170146
2170402
2170658
2162723
2162979
2163235
2163491
2163747
2164003
2164259
2164515
2164771
2165027
2165283
2165539
2165795
2166051
2166307
2166563
2166819
2167075
2167331
2167587
2167843
2168099
2168355
2168611
2168867
2169123
2169379
2169635
2169891
2170147
2170403
2170659
2162724
2162980
2163236
2163492
2163748
2164004
2164260
2164516
2164772
2165028
2165284
2165540
2165796
2166052
2166308
2166564
2166820
2167076
2167332
2167588
2167844
2168100
2168356
2168612
2168868
2169124
2169380
2169636
2169892
2170148
2170404
2170660
2162725
2162981
2163237
2163493
2163749
2164005
2164261
2164517
2164773
2165029
2165285
2165541
2165797
2166053
2166309
2166565
2166821
2167077
2167333
2167589
2167845
2168101
2168357
2168613
2168869
2169125
2169381
2169637
2169893
2170149
2170405
2170661
2162726
2162982
2163238
2163494
2163750
2164006
2164262
2164518
2164774
2165030
2165286
2165542
2165798
2166054
2166310
2166566
2166822
2167078
2167334
2167590
2167846
2168102
2168358
2168614
2168870
2169126
2169382
2169638
2169894
2170150
2170406
2170662
2162727
2162983
2163239
2163495
2163751
2164007
2164263
2164519
2164775
2165031
2165287
2165543
2165799
2166055
2166311
2166567
2166823
2167079
2167335
2167591
2167847
2168103
2168359
2168615
2168871
2169127
2169383
2169639
2169895
2170151
2170407
2170663
2162728
2162984
2163240
2163496
2163752
2164008
2164264
2164520
2164776
2165032
2165288
2165544
2165800
2166056
2166312
2166568
2166824
2167080
2167336
2167592
2167848
2168104
2168360
2168616
2168872
2169128
2169384
2169640
2169896
2170152
2170408
2170664
2162729
2162985
2163241
2163497
2163753
2164009
2164265
2164521
2164777
2165033
2165289
2165545
2165801
2166057
2166313
2166569
2166825
2167081
2167337
2167593
2167849
2168105
2168361
2168617
2168873
2169129
2169385
2169641
2169897
2170153
2170409
2170665
2162730
2162986
2163242
2163498
2163754
2164010
2164266
2164522
2164778
2165034
2165290
2165546
2165802
2166058
2166314
2166570
2166826
2167082
2167338
2167594
2167850
2168106
2168362
2168618
2168874
2169130
2169386
2169642
2169898
2170154
2170410
2170666
2162731
2162987
2163243
2163499
2163755
2164011
2164267
2164523
2164779
2165035
2165291
2165547
2165803
2166059
2166315
2166571
2166827
2167083
2167339
2167595
2167851
2168107
2168363
2168619
2168875
2169131
2169387
2169643
2169899
2170155
2170411
2170667
2162732
2162988
2163244
2163500
2163756
2164012
2164268
2164524
2164780
2165036
2165292
2165548
2165804
2166060
2166316
2166572
2166828
2167084
2167340
2167596
2167852
2168108
2168364
2168620
2168876
2169132
2169388
2169644
2169900
2170156
2170412
2170668
2162733
2162989
2163245
2163501
2163757
2164013
2164269
2164525
2164781
2165037
2165293
2165549
2165805
2166061
2166317
2166573
2166829
2167085
2167341
2167597
2167853
2168109
2168365
2168621
2168877
2169133
2169389
2169645
2169901
2170157
2170413
2170669
2162734
2162990
2163246
2163502
2163758
2164014
2164270
2164526
2164782
2165038
2165294
2165550
2165806
2166062
2166318
2166574
2166830
2167086
2167342
2167598
2167854
2168110
2168366
2168622
2168878
2169134
2169390
2169646
2169902
2170158
2170414
2170670
2162735
2162991
2163247
2163503
2163759
2164015
2164271
2164527
2164783
2165039
2165295
2165551
2165807
2166063
2166319
2166575
2166831
2167087
2167343
2167599
2167855
2168111
2168367
2168623
2168879
2169135
2169391
2169647
2169903
2170159
2170415
2170671
2162736
2162992
2163248
2163504
2163760
2164016
2164272
2164528
2164784
2165040
2165296
2165552
2165808
2166064
2166320
2166576
2166832
2167088
2167344
2167600
2167856
2168112
2168368
2168624
2168880
2169136
2169392
2169648
2169904
2170160
2170416
2170672
2162737
2162993
2163249
2163505
2163761
2164017
2164273
2164529
2164785
2165041
2165297
2165553
2165809
2166065
2166321
2166577
2166833
2167089
2167345
2167601
2167857
2168113
2168369
2168625
2168881
2169137
2169393
2169649
2169905
2170161
2170417
2170673
2162738
2162994
2163250
2163506
2163762
2164018
2164274
2164530
2164786
2165042
2165298
2165554
2165810
2166066
2166322
2166578
2166834
2167090
2167346
2167602
2167858
2168114
2168370
2168626
2168882
2169138
2169394
2169650
2169906
2170162
2170418
2170674
2162739
2162995
2163251
2163507
2163763
2164019
2164275
2164531
2164787
2165043
2165299
2165555
2165811
2166067
2166323
2166579
2166835
2167091
2167347
2167603
2167859
2168115
2168371
2168627
2168883
2169139
2169395
2169651
2169907
2170163
2170419
2170675
2162740
2162996
2163252
2163508
2163764
2164020
2164276
2164532
2164788
2165044
2165300
2165556
2165812
2166068
2166324
2166580
2166836
2167092
2167348
2167604
2167860
2168116
2168372
2168628
2168884
2169140
2169396
2169652
2169908
2170164
2170420
2170676
2162741
2162997
2163253
2163509
2163765
2164021
2164277
2164533
2164789
2165045
2165301
2165557
2165813
2166069
2166325
2166581
2166837
2167093
2167349
2167605
2167861
2168117
2168373
2168629
2168885
2169141
2169397
2169653
2169909
2170165
2170421
2170677
2162742
2162998
2163254
2163510
2163766
2164022
2164278
2164534
2164790
2165046
2165302
2165558
2165814
2166070
2166326
2166582
2166838
2167094
2167350
2167606
2167862
2168118
2168374
2168630
2168886
2169142
2169398
2169654
2169910
2170166
2170422
2170678
2162743
2162999
2163255
2163511
2163767
2164023
2164279
2164535
2164791
2165047
2165303
2165559
2165815
2166071
2166327
2166583
2166839
2167095
2167351
2167607
2167863
2168119
2168375
2168631
2168887
2169143
2169399
2169655
2169911
2170167
2170423
2170679
2162744
2163000
2163256
2163512
2163768
2164024
2164280
2164536
2164792
2165048
2165304
2165560
2165816
2166072
2166328
2166584
2166840
2167096
2167352
2167608
2167864
2168120
2168376
2168632
2168888
2169144
2169400
2169656
2169912
2170168
2170424
2170680
2162745
2163001
2163257
2163513
2163769
2164025
2164281
2164537
2164793
2165049
2165305
2165561
2165817
2166073
2166329
2166585
2166841
2167097
2167353
2167609
2167865
2168121
2168377
2168633
2168889
2169145
2169401
2169657
2169913
2170169
2170425
2170681
2162746
2163002
2163258
2163514
2163770
2164026
2164282
2164538
2164794
2165050
2165306
2165562
2165818
2166074
2166330
2166586
2166842
2167098
2167354
2167610
2167866
2168122
2168378
2168634
2168890
2169146
2169402
2169658
2169914
2170170
2170426
2170682
2162747
2163003
2163259
2163515
2163771
2164027
2164283
2164539
2164795
2165051
2165307
2165563
2165819
2166075
2166331
2166587
2166843
2167099
2167355
2167611
2167867
2168123
2168379
2168635
2168891
2169147
2169403
2169659
2169915
2170171
2170427
2170683
2162748
2163004
2163260
2163516
2163772
2164028
2164284
2164540
2164796
2165052
2165308
2165564
2165820
2166076
2166332
2166588
2166844
2167100
2167356
2167612
2167868
2168124
2168380
2168636
2168892
2169148
2169404
2169660
2169916
2170172
2170428
2170684
2162749
2163005
2163261
2163517
2163773
2164029
2164285
2164541
2164797
2165053
2165309
2165565
2165821
2166077
2166333
2166589
2166845
2167101
2167357
2167613
2167869
2168125
2168381
2168637
2168893
2169149
2169405
2169661
2169917
2170173
2170429
2170685
2162750
2163006
2163262
2163518
2163774
2164030
2164286
2164542
2164798
2165054
2165310
2165566
2165822
2166078
2166334
2166590
2166846
2167102
2167358
2167614
2167870
2168126
2168382
2168638
2168894
2169150
2169406
2169662
2169918
2170174
2170430
2170686
2162751
2163007
2163263
2163519
2163775
2164031
2164287
2164543
2164799
2165055
2165311
2165567
2165823
2166079
2166335
2166591
2166847
2167103
2167359
2167615
2167871
2168127
2168383
2168639
2168895
2169151
2169407
2169663
2169919
2170175
2170431
2170687
2162752
2163008
2163264
2163520
2163776
2164032
2164288
2164544
2164800
2165056
2165312
2165568
2165824
2166080
2166336
2166592
2166848
2167104
2167360
2167616
2167872
2168128
2168384
2168640
2168896
2169152
2169408
2169664
2169920
2170176
2170432
2170688
2162753
2163009
2163265
2163521
2163777
2164033
2164289
2164545
2164801
2165057
2165313
2165569
2165825
2166081
2166337
2166593
2166849
2167105
2167361
2167617
2167873
2168129
2168385
2168641
2168897
2169153
2169409
2169665
2169921
2170177
2170433
2170689
2162754
2163010
2163266
2163522
2163778
2164034
2164290
2164546
2164802
2165058
2165314
2165570
2165826
2166082
2166338
2166594
2166850
2167106
2167362
2167618
2167874
2168130
2168386
2168642
2168898
2169154
2169410
2169666
2169922
2170178
2170434
2170690
2162755
2163011
2163267
2163523
2163779
2164035
2164291
2164547
2164803
2165059
2165315
2165571
2165827
2166083
2166339
2166595
2166851
2167107
2167363
2167619
2167875
2168131
2168387
2168643
2168899
2169155
2169411
2169667
2169923
2170179
2170435
2170691
2162756
2163012
2163268
2163524
2163780
2164036
2164292
2164548
2164804
2165060
2165316
2165572
2165828
2166084
2166340
2166596
2166852
2167108
2167364
2167620
2167876
2168132
2168388
2168644
2168900
2169156
2169412
2169668
2169924
2170180
2170436
2170692
2162757
2163013
2163269
2163525
2163781
2164037
2164293
2164549
2164805
2165061
2165317
2165573
2165829
2166085
2166341
2166597
2166853
2167109
2167365
2167621
2167877
2168133
2168389
2168645
2168901
2169157
2169413
2169669
2169925
2170181
2170437
2170693
2162758
2163014
2163270
2163526
2163782
2164038
2164294
2164550
2164806
2165062
2165318
2165574
2165830
2166086
2166342
2166598
2166854
2167110
2167366
2167622
2167878
2168134
2168390
2168646
2168902
2169158
2169414
2169670
2169926
2170182
2170438
2170694
2162759
2163015
2163271
2163527
2163783
2164039
2164295
2164551
2164807
2165063
2165319
2165575
2165831
2166087
2166343
2166599
2166855
2167111
2167367
2167623
2167879
2168135
2168391
2168647
2168903
2169159
2169415
2169671
2169927
2170183
2170439
2170695
2162760
2163016
2163272
2163528
2163784
2164040
2164296
2164552
2164808
2165064
2165320
2165576
2165832
2166088
2166344
2166600
2166856
2167112
2167368
2167624
2167880
2168136
2168392
2168648
2168904
2169160
2169416
2169672
2169928
2170184
2170440
2170696
2162761
2163017
2163273
2163529
2163785
2164041
2164297
2164553
2164809
2165065
2165321
2165577
2165833
2166089
2166345
2166601
2166857
2167113
2167369
2167625
2167881
2168137
2168393
2168649
2168905
2169161
2169417
2169673
2169929
2170185
2170441
2170697
2162762
2163018
2163274
2163530
2163786
2164042
2164298
2164554
2164810
2165066
2165322
2165578
2165834
2166090
2166346
2166602
2166858
2167114
2167370
2167626
2167882
2168138
2168394
2168650
2168906
2169162
2169418
2169674
2169930
2170186
2170442
2170698
2162763
2163019
2163275
2163531
2163787
2164043
2164299
2164555
2164811
2165067
2165323
2165579
2165835
2166091
2166347
2166603
2166859
2167115
2167371
2167627
2167883
2168139
2168395
2168651
2168907
2169163
2169419
2169675
2169931
2170187
2170443
2170699
2162764
2163020
2163276
2163532
2163788
2164044
2164300
2164556
2164812
2165068
2165324
2165580
2165836
2166092
2166348
2166604
2166860
2167116
2167372
2167628
2167884
2168140
2168396
2168652
2168908
2169164
2169420
2169676
2169932
2170188
2170444
2170700
2162765
2163021
2163277
2163533
2163789
2164045
2164301
2164557
2164813
2165069
2165325
2165581
2165837
2166093
2166349
2166605
2166861
2167117
2167373
2167629
2167885
2168141
2168397
2168653
2168909
2169165
2169421
2169677
2169933
2170189
2170445
2170701
2162766
2163022
2163278
2163534
2163790
2164046
2164302
2164558
2164814
2165070
2165326
2165582
2165838
2166094
2166350
2166606
2166862
2167118
2167374
2167630
2167886
2168142
2168398
2168654
2168910
2169166
2169422
2169678
2169934
2170190
2170446
2170702
2162767
2163023
2163279
2163535
2163791
2164047
2164303
2164559
2164815
2165071
2165327
2165583
2165839
2166095
2166351
2166607
2166863
2167119
2167375
2167631
2167887
2168143
2168399
2168655
2168911
2169167
2169423
2169679
2169935
2170191
2170447
2170703
2162768
2163024
2163280
2163536
2163792
2164048
2164304
2164560
2164816
2165072
2165328
2165584
2165840
2166096
2166352
2166608
2166864
2167120
2167376
2167632
2167888
2168144
2168400
2168656
2168912
2169168
2169424
2169680
2169936
2170192
2170448
2170704
2162769
2163025
2163281
2163537
2163793
2164049
2164305
2164561
2164817
2165073
2165329
2165585
2165841
2166097
2166353
2166609
2166865
2167121
2167377
2167633
2167889
2168145
2168401
2168657
2168913
2169169
2169425
2169681
2169937
2170193
2170449
2170705
2162770
2163026
2163282
2163538
2163794
2164050
2164306
2164562
2164818
2165074
2165330
2165586
2165842
2166098
2166354
2166610
2166866
2167122
2167378
2167634
2167890
2168146
2168402
2168658
2168914
2169170
2169426
2169682
2169938
2170194
2170450
2170706
2162771
2163027
2163283
2163539
2163795
2164051
2164307
2164563
2164819
2165075
2165331
2165587
2165843
2166099
2166355
2166611
2166867
2167123
2167379
2167635
2167891
2168147
2168403
2168659
2168915
2169171
2169427
2169683
2169939
2170195
2170451
2170707
2162772
2163028
2163284
2163540
2163796
2164052
2164308
2164564
2164820
2165076
2165332
2165588
2165844
2166100
2166356
2166612
2166868
2167124
2167380
2167636
2167892
2168148
2168404
2168660
2168916
2169172
2169428
2169684
2169940
2170196
2170452
2170708
2162773
2163029
2163285
2163541
2163797
2164053
2164309
2164565
2164821
2165077
2165333
2165589
2165845
2166101
2166357
2166613
2166869
2167125
2167381
2167637
2167893
2168149
2168405
2168661
2168917
2169173
2169429
2169685
2169941
2170197
2170453
2170709
2162774
2163030
2163286
2163542
2163798
2164054
2164310
2164566
2164822
2165078
2165334
2165590
2165846
2166102
2166358
2166614
2166870
2167126
2167382
2167638
2167894
2168150
2168406
2168662
2168918
2169174
2169430
2169686
2169942
2170198
2170454
2170710
2162775
2163031
2163287
2163543
2163799
2164055
2164311
2164567
2164823
2165079
2165335
2165591
2165847
2166103
2166359
2166615
2166871
2167127
2167383
2167639
2167895
2168151
2168407
2168663
2168919
2169175
2169431
2169687
2169943
2170199
2170455
2170711
2162776
2163032
2163288
2163544
2163800
2164056
2164312
2164568
2164824
2165080
2165336
2165592
2165848
2166104
2166360
2166616
2166872
2167128
2167384
2167640
2167896
2168152
2168408
2168664
2168920
2169176
2169432
2169688
2169944
2170200
2170456
2170712
2162777
2163033
2163289
2163545
2163801
2164057
2164313
2164569
2164825
2165081
2165337
2165593
2165849
2166105
2166361
2166617
2166873
2167129
2167385
2167641
2167897
2168153
2168409
2168665
2168921
2169177
2169433
2169689
2169945
2170201
2170457
2170713
2162778
2163034
2163290
2163546
2163802
2164058
2164314
2164570
2164826
2165082
2165338
2165594
2165850
2166106
2166362
2166618
2166874
2167130
2167386
2167642
2167898
2168154
2168410
2168666
2168922
2169178
2169434
2169690
2169946
2170202
2170458
2170714
2162779
2163035
2163291
2163547
2163803
2164059
2164315
2164571
2164827
2165083
2165339
2165595
2165851
2166107
2166363
2166619
2166875
2167131
2167387
2167643
2167899
2168155
2168411
2168667
2168923
2169179
2169435
2169691
2169947
2170203
2170459
2170715
2162780
2163036
2163292
2163548
2163804
2164060
2164316
2164572
2164828
2165084
2165340
2165596
2165852
2166108
2166364
2166620
2166876
2167132
2167388
2167644
2167900
2168156
2168412
2168668
2168924
2169180
2169436
2169692
2169948
2170204
2170460
2170716
2162781
2163037
2163293
2163549
2163805
2164061
2164317
2164573
2164829
2165085
2165341
2165597
2165853
2166109
2166365
2166621
2166877
2167133
2167389
2167645
2167901
2168157
2168413
2168669
2168925
2169181
2169437
2169693
2169949
2170205
2170461
2170717
2162782
2163038
2163294
2163550
2163806
2164062
2164318
2164574
2164830
2165086
2165342
2165598
2165854
2166110
2166366
2166622
2166878
2167134
2167390
2167646
2167902
2168158
2168414
2168670
2168926
2169182
2169438
2169694
2169950
2170206
2170462
2170718
2162783
2163039
2163295
2163551
2163807
2164063
2164319
2164575
2164831
2165087
2165343
2165599
2165855
2166111
2166367
2166623
2166879
2167135
2167391
2167647
2167903
2168159
2168415
2168671
2168927
2169183
2169439
2169695
2169951
2170207
2170463
2170719
