1  0  250
1  1  250
1  2  286
1  3  256
1  4  359
1  5  452
1  6  359
1  7  81
1  8  296
1  9  211
1  10  176
1  11  156
1  12  64
1  13  151
1  14  118
1  15  244
1  16  250
1  17  250
1  18  250
1  19  250
2  0  250
2  1  250
2  2  250
2  3  52
2  4  58
2  5  250
2  6  250
2  7  250
2  8  81
2  9  250
2  10  93
2  11  70
2  12  95
2  13  137
2  14  104
2  15  227
2  16  250
2  17  250
2  18  250
2  19  250
3  0  250
3  1  250
3  2  250
3  3  326
3  4  441
3  5  250
3  6  328
3  7  250
3  8  321
3  9  419
3  10  250
3  11  269
3  12  250
3  13  250
3  14  250
3  15  250
3  16  250
3  17  250
3  18  250
3  19  250
4  0  250
4  1  315
4  2  334
4  3  288
4  4  301
4  5  250
4  6  250
4  7  250
4  8  250
4  9  250
4  10  170
4  11  250
4  12  250
4  13  991
4  14  528
4  15  250
4  16  250
4  17  190
4  18  250
4  19  250
5  0  250
5  1  250
5  2  323
5  3  259
5  4  390
5  5  691
5  6  350
5  7  250
5  8  457
5  9  433
5  10  250
5  11  218
5  12  250
5  13  250
5  14  342
5  15  250
5  16  250
5  17  250
5  18  250
5  19  250
6  0  250
6  1  250
6  2  221
6  3  211
6  4  214
6  5  250
6  6  250
6  7  250
6  8  250
6  9  250
6  10  94
6  11  109
6  12  94
6  13  141
6  14  335
6  15  250
6  16  106
6  17  250
6  18  250
6  19  250
7  0  250
7  1  250
7  2  153
7  3  250
7  4  197
7  5  663
7  6  267
7  7  51
7  8  277
7  9  176
7  10  250
7  11  342
7  12  250
7  13  250
7  14  250
7  15  282
7  16  250
7  17  66
7  18  250
7  19  250
8  0  113
8  1  250
8  2  216
8  3  231
8  4  175
8  5  250
8  6  250
8  7  250
8  8  250
8  9  250
8  10  250
8  11  119
8  12  250
8  13  65
8  14  394
8  15  250
8  16  157
8  17  250
8  18  250
8  19  250
9  0  250
9  1  250
9  2  154
9  3  131
9  4  204
9  5  323
9  6  150
9  7  250
9  8  134
9  9  145
9  10  250
9  11  180
9  12  258
9  13  198
9  14  183
9  15  149
9  16  141
9  17  250
9  18  105
9  19  161
10  0  135
10  1  73
10  2  181
10  3  162
10  4  225
10  5  282
10  6  250
10  7  199
10  8  1974
10  9  250
10  10  204
10  11  187
10  12  200
10  13  302
10  14  268
10  15  250
10  16  250
10  17  372
10  18  250
10  19  250
11  0  250
11  1  250
11  2  250
11  3  148
11  4  207
11  5  54
11  6  179
11  7  250
11  8  250
11  9  250
11  10  250
11  11  71
11  12  91
11  13  53
11  14  110
11  15  85
11  16  93
11  17  250
11  18  250
11  19  58
12  0  195
12  1  250
12  2  222
12  3  238
12  4  264
12  5  918
12  6  250
12  7  52
12  8  250
12  9  250
12  10  74
12  11  93
12  12  77
12  13  110
12  14  250
12  15  250
12  16  250
12  17  250
12  18  250
12  19  250
13  0  250
13  1  250
13  2  90
13  3  96
13  4  73
13  5  250
13  6  93
13  7  92
13  8  250
13  9  63
13  10  250
13  11  70
13  12  105
13  13  115
13  14  85
13  15  84
13  16  94
13  17  250
13  18  250
13  19  65
14  0  139
14  1  250
14  2  126
14  3  135
14  4  250
14  5  250
14  6  250
14  7  159
14  8  250
14  9  250
14  10  165
14  11  162
14  12  250
14  13  500
14  14  250
14  15  250
14  16  250
14  17  250
14  18  250
14  19  250
15  0  250
15  1  250
15  2  78
15  3  93
15  4  99
15  5  487
15  6  121
15  7  250
15  8  250
15  9  86
15  10  250
15  11  79
15  12  80
15  13  157
15  14  137
15  15  250
15  16  171
15  17  250
15  18  250
15  19  250
16  0  250
16  1  250
16  2  250
16  3  250
16  4  250
16  5  240
16  6  250
16  7  87
16  8  250
16  9  250
16  10  250
16  11  182
16  12  250
16  13  228
16  14  502
16  15  250
16  16  250
16  17  250
16  18  250
16  19  250
