206872
207128
207384
207640
207896
208152
208408
208664
206873
207129
207385
207641
207897
208153
208409
208665
206874
207130
207386
207642
207898
208154
208410
208666
206875
207131
207387
207643
207899
208155
208411
208667
206876
207132
207388
207644
207900
208156
208412
208668
206877
207133
207389
207645
207901
208157
208413
208669
206878
207134
207390
207646
207902
208158
208414
208670
206879
207135
207391
207647
207903
208159
208415
208671
473160
473416
473672
473928
474184
474440
474696
474952
473161
473417
473673
473929
474185
474441
474697
474953
473162
473418
473674
473930
474186
474442
474698
474954
473163
473419
473675
473931
474187
474443
474699
474955
473164
473420
473676
473932
474188
474444
474700
474956
473165
473421
473677
473933
474189
474445
474701
474957
473166
473422
473678
473934
474190
474446
474702
474958
473167
473423
473679
473935
474191
474447
474703
474959
542760
543016
543272
543528
543784
544040
544296
544552
542761
543017
543273
543529
543785
544041
544297
544553
542762
543018
543274
543530
543786
544042
544298
544554
542763
543019
543275
543531
543787
544043
544299
544555
542764
543020
543276
543532
543788
544044
544300
544556
542765
543021
543277
543533
543789
544045
544301
544557
542766
543022
543278
543534
543790
544046
544302
544558
542767
543023
543279
543535
543791
544047
544303
544559
2033712
2033968
2034224
2034480
2034736
2034992
2035248
2035504
2033713
2033969
2034225
2034481
2034737
2034993
2035249
2035505
2033714
2033970
2034226
2034482
2034738
2034994
2035250
2035506
2033715
2033971
2034227
2034483
2034739
2034995
2035251
2035507
2033716
2033972
2034228
2034484
2034740
2034996
2035252
2035508
2033717
2033973
2034229
2034485
2034741
2034997
2035253
2035509
2033718
2033974
2034230
2034486
2034742
2034998
2035254
2035510
2033719
2033975
2034231
2034487
2034743
2034999
2035255
2035511
2899968
2900224
2900480
2900736
2900992
2901248
2901504
2901760
2899969
2900225
2900481
2900737
2900993
2901249
2901505
2901761
2899970
2900226
2900482
2900738
2900994
2901250
2901506
2901762
2899971
2900227
2900483
2900739
2900995
2901251
2901507
2901763
2899972
2900228
2900484
2900740
2900996
2901252
2901508
2901764
2899973
2900229
2900485
2900741
2900997
2901253
2901509
2901765
2899974
2900230
2900486
2900742
2900998
2901254
2901510
2901766
2899975
2900231
2900487
2900743
2900999
2901255
2901511
2901767
3035184
3035440
3035696
3035952
3036208
3036464
3036720
3036976
3035185
3035441
3035697
3035953
3036209
3036465
3036721
3036977
3035186
3035442
3035698
3035954
3036210
3036466
3036722
3036978
3035187
3035443
3035699
3035955
3036211
3036467
3036723
3036979
3035188
3035444
3035700
3035956
3036212
3036468
3036724
3036980
3035189
3035445
3035701
3035957
3036213
3036469
3036725
3036981
3035190
3035446
3035702
3035958
3036214
3036470
3036726
3036982
3035191
3035447
3035703
3035959
3036215
3036471
3036727
3036983
3024952
3025208
3025464
3025720
3025976
3026232
3026488
3026744
3024953
3025209
3025465
3025721
3025977
3026233
3026489
3026745
3024954
3025210
3025466
3025722
3025978
3026234
3026490
3026746
3024955
3025211
3025467
3025723
3025979
3026235
3026491
3026747
3024956
3025212
3025468
3025724
3025980
3026236
3026492
3026748
3024957
3025213
3025469
3025725
3025981
3026237
3026493
3026749
3024958
3025214
3025470
3025726
3025982
3026238
3026494
3026750
3024959
3025215
3025471
3025727
3025983
3026239
3026495
3026751
