206872
207128
207384
207640
207896
208152
208408
208664
206873
207129
207385
207641
207897
208153
208409
208665
206874
207130
207386
207642
207898
208154
208410
208666
206875
207131
207387
207643
207899
208155
208411
208667
206876
207132
207388
207644
207900
208156
208412
208668
206877
207133
207389
207645
207901
208157
208413
208669
206878
207134
207390
207646
207902
208158
208414
208670
206879
207135
207391
207647
207903
208159
208415
208671
542760
543016
543272
543528
543784
544040
544296
544552
542761
543017
543273
543529
543785
544041
544297
544553
542762
543018
543274
543530
543786
544042
544298
544554
542763
543019
543275
543531
543787
544043
544299
544555
542764
543020
543276
543532
543788
544044
544300
544556
542765
543021
543277
543533
543789
544045
544301
544557
542766
543022
543278
543534
543790
544046
544302
544558
542767
543023
543279
543535
543791
544047
544303
544559
1511464
1511720
1511976
1512232
1512488
1512744
1513000
1513256
1511465
1511721
1511977
1512233
1512489
1512745
1513001
1513257
1511466
1511722
1511978
1512234
1512490
1512746
1513002
1513258
1511467
1511723
1511979
1512235
1512491
1512747
1513003
1513259
1511468
1511724
1511980
1512236
1512492
1512748
1513004
1513260
1511469
1511725
1511981
1512237
1512493
1512749
1513005
1513261
1511470
1511726
1511982
1512238
1512494
1512750
1513006
1513262
1511471
1511727
1511983
1512239
1512495
1512751
1513007
1513263
2037824
2038080
2038336
2038592
2038848
2039104
2039360
2039616
2037825
2038081
2038337
2038593
2038849
2039105
2039361
2039617
2037826
2038082
2038338
2038594
2038850
2039106
2039362
2039618
2037827
2038083
2038339
2038595
2038851
2039107
2039363
2039619
2037828
2038084
2038340
2038596
2038852
2039108
2039364
2039620
2037829
2038085
2038341
2038597
2038853
2039109
2039365
2039621
2037830
2038086
2038342
2038598
2038854
2039110
2039366
2039622
2037831
2038087
2038343
2038599
2038855
2039111
2039367
2039623
2899968
2900224
2900480
2900736
2900992
2901248
2901504
2901760
2899969
2900225
2900481
2900737
2900993
2901249
2901505
2901761
2899970
2900226
2900482
2900738
2900994
2901250
2901506
2901762
2899971
2900227
2900483
2900739
2900995
2901251
2901507
2901763
2899972
2900228
2900484
2900740
2900996
2901252
2901508
2901764
2899973
2900229
2900485
2900741
2900997
2901253
2901509
2901765
2899974
2900230
2900486
2900742
2900998
2901254
2901510
2901766
2899975
2900231
2900487
2900743
2900999
2901255
2901511
2901767
3035184
3035440
3035696
3035952
3036208
3036464
3036720
3036976
3037232
3037488
3037744
3038000
3038256
3038512
3038768
3039024
3035185
3035441
3035697
3035953
3036209
3036465
3036721
3036977
3037233
3037489
3037745
3038001
3038257
3038513
3038769
3039025
3035186
3035442
3035698
3035954
3036210
3036466
3036722
3036978
3037234
3037490
3037746
3038002
3038258
3038514
3038770
3039026
3035187
3035443
3035699
3035955
3036211
3036467
3036723
3036979
3037235
3037491
3037747
3038003
3038259
3038515
3038771
3039027
3035188
3035444
3035700
3035956
3036212
3036468
3036724
3036980
3037236
3037492
3037748
3038004
3038260
3038516
3038772
3039028
3035189
3035445
3035701
3035957
3036213
3036469
3036725
3036981
3037237
3037493
3037749
3038005
3038261
3038517
3038773
3039029
3035190
3035446
3035702
3035958
3036214
3036470
3036726
3036982
3037238
3037494
3037750
3038006
3038262
3038518
3038774
3039030
3035191
3035447
3035703
3035959
3036215
3036471
3036727
3036983
3037239
3037495
3037751
3038007
3038263
3038519
3038775
3039031
3024952
3025208
3025464
3025720
3025976
3026232
3026488
3026744
3024953
3025209
3025465
3025721
3025977
3026233
3026489
3026745
3024954
3025210
3025466
3025722
3025978
3026234
3026490
3026746
3024955
3025211
3025467
3025723
3025979
3026235
3026491
3026747
3024956
3025212
3025468
3025724
3025980
3026236
3026492
3026748
3024957
3025213
3025469
3025725
3025981
3026237
3026493
3026749
3024958
3025214
3025470
3025726
3025982
3026238
3026494
3026750
3024959
3025215
3025471
3025727
3025983
3026239
3026495
3026751
3364880
3365136
3365392
3365648
3365904
3366160
3366416
3366672
3364881
3365137
3365393
3365649
3365905
3366161
3366417
3366673
3364882
3365138
3365394
3365650
3365906
3366162
3366418
3366674
3364883
3365139
3365395
3365651
3365907
3366163
3366419
3366675
3364884
3365140
3365396
3365652
3365908
3366164
3366420
3366676
3364885
3365141
3365397
3365653
3365909
3366165
3366421
3366677
3364886
3365142
3365398
3365654
3365910
3366166
3366422
3366678
3364887
3365143
3365399
3365655
3365911
3366167
3366423
3366679
3481600
3481856
3482112
3482368
3482624
3482880
3483136
3483392
3481601
3481857
3482113
3482369
3482625
3482881
3483137
3483393
3481602
3481858
3482114
3482370
3482626
3482882
3483138
3483394
3481603
3481859
3482115
3482371
3482627
3482883
3483139
3483395
3481604
3481860
3482116
3482372
3482628
3482884
3483140
3483396
3481605
3481861
3482117
3482373
3482629
3482885
3483141
3483397
3481606
3481862
3482118
3482374
3482630
3482886
3483142
3483398
3481607
3481863
3482119
3482375
3482631
3482887
3483143
3483399
