3168256
3168512
3168768
3169024
3169280
3169536
3169792
3170048
3168257
3168513
3168769
3169025
3169281
3169537
3169793
3170049
3168258
3168514
3168770
3169026
3169282
3169538
3169794
3170050
3168259
3168515
3168771
3169027
3169283
3169539
3169795
3170051
3168260
3168516
3168772
3169028
3169284
3169540
3169796
3170052
3168261
3168517
3168773
3169029
3169285
3169541
3169797
3170053
3168262
3168518
3168774
3169030
3169286
3169542
3169798
3170054
3168263
3168519
3168775
3169031
3169287
3169543
3169799
3170055
