206872
207128
207384
207640
207896
208152
208408
208664
206873
207129
207385
207641
207897
208153
208409
208665
206874
207130
207386
207642
207898
208154
208410
208666
206875
207131
207387
207643
207899
208155
208411
208667
206876
207132
207388
207644
207900
208156
208412
208668
206877
207133
207389
207645
207901
208157
208413
208669
206878
207134
207390
207646
207902
208158
208414
208670
206879
207135
207391
207647
207903
208159
208415
208671
542760
543016
543272
543528
543784
544040
544296
544552
542761
543017
543273
543529
543785
544041
544297
544553
542762
543018
543274
543530
543786
544042
544298
544554
542763
543019
543275
543531
543787
544043
544299
544555
542764
543020
543276
543532
543788
544044
544300
544556
542765
543021
543277
543533
543789
544045
544301
544557
542766
543022
543278
543534
543790
544046
544302
544558
542767
543023
543279
543535
543791
544047
544303
544559
2760768
2761024
2761280
2761536
2761792
2762048
2762304
2762560
2760769
2761025
2761281
2761537
2761793
2762049
2762305
2762561
2760770
2761026
2761282
2761538
2761794
2762050
2762306
2762562
2760771
2761027
2761283
2761539
2761795
2762051
2762307
2762563
2760772
2761028
2761284
2761540
2761796
2762052
2762308
2762564
2760773
2761029
2761285
2761541
2761797
2762053
2762309
2762565
2760774
2761030
2761286
2761542
2761798
2762054
2762310
2762566
2760775
2761031
2761287
2761543
2761799
2762055
2762311
2762567
3024952
3025208
3025464
3025720
3025976
3026232
3026488
3026744
3024953
3025209
3025465
3025721
3025977
3026233
3026489
3026745
3024954
3025210
3025466
3025722
3025978
3026234
3026490
3026746
3024955
3025211
3025467
3025723
3025979
3026235
3026491
3026747
3024956
3025212
3025468
3025724
3025980
3026236
3026492
3026748
3024957
3025213
3025469
3025725
3025981
3026237
3026493
3026749
3024958
3025214
3025470
3025726
3025982
3026238
3026494
3026750
3024959
3025215
3025471
3025727
3025983
3026239
3026495
3026751
3414064
3414320
3414576
3414832
3415088
3415344
3415600
3415856
3414065
3414321
3414577
3414833
3415089
3415345
3415601
3415857
3414066
3414322
3414578
3414834
3415090
3415346
3415602
3415858
3414067
3414323
3414579
3414835
3415091
3415347
3415603
3415859
3414068
3414324
3414580
3414836
3415092
3415348
3415604
3415860
3414069
3414325
3414581
3414837
3415093
3415349
3415605
3415861
3414070
3414326
3414582
3414838
3415094
3415350
3415606
3415862
3414071
3414327
3414583
3414839
3415095
3415351
3415607
3415863
