5403
5405
5406
5408
5664
4939
5632
5888
14080
14336
21504
21760
5727
5983
14175
14431
21599
21855
85002
72003
85576
85832
86088
86344
85577
85833
86089
86345
85578
85834
86090
86346
85579
85835
86091
86347
85580
85836
86092
86348
71168
71424
79616
79872
87040
87296
71263
71519
79711
79967
87135
87391
135699
134420
135700
136212
134421
135702
136214
135705
136217
135706
136218
135707
136219
135711
135716
142152
142920
137545
136270
136271
132688
136272
152401
136704
136960
145152
145408
152576
152832
136799
137055
145247
145503
152671
152927
216861
217373
216864
216866
207141
207397
207653
207909
216634
216635
215612
216636
215614
216638
215617
216641
215618
216642
216643
215620
216644
215621
216645
206406
216646
206408
216648
197471
202240
202496
210688
210944
218112
218368
202335
202591
210783
211039
218207
218463
267776
268032
276224
276480
283648
283904
267871
268127
276319
276575
283743
283999
327936
328192
343852
338761
338764
338765
338766
338768
333312
333568
341760
342016
349184
349440
333407
333663
341855
342111
349279
349535
398848
399104
407296
407552
414720
414976
398943
399199
407391
407647
414815
415071
478477
479501
478478
479502
478479
479503
478480
479504
478481
479505
479290
479291
479292
479293
479295
464384
464640
472832
473088
480256
480512
464479
464735
472927
473183
480351
480607
536344
536600
536345
536601
543006
543518
542496
543008
543520
542497
543009
543521
542498
543010
543522
542243
542499
543011
543523
542500
543012
543524
543013
543525
529920
530176
538368
538624
545792
546048
530015
530271
538463
538719
545887
546143
612612
595456
595712
603904
604160
611328
611584
595551
595807
603999
604255
611423
611679
659218
659474
658963
659219
659475
658965
659221
659477
659223
659479
674586
674587
674588
674589
674590
674591
674594
674595
675650
675652
675654
675655
675657
660992
661248
669440
669696
676864
677120
661087
661343
669535
669791
676959
677215
726528
726784
734976
735232
742400
742656
726623
726879
735071
735327
742495
742751
799004
790564
790820
809272
798786
799042
798787
799043
798789
799045
798790
799046
798792
799048
792064
792320
800512
800768
807936
808192
792159
792415
800607
800863
808031
808287
872206
872462
872207
872463
872719
872208
872464
872720
872209
872465
872721
872210
872466
872722
872211
872467
872723
872212
872468
872724
872213
872469
872725
872214
872470
872726
872215
872471
872727
872216
872472
872728
872217
872473
872729
872218
872474
872730
872219
872475
872731
872220
872476
872732
872221
872477
872733
872222
872478
872734
872223
872479
872735
872505
872506
872762
872507
872763
870460
870716
871228
872508
872764
870462
870718
871230
872510
872766
870464
870720
871232
872512
872768
870466
870722
871234
872514
872770
870467
870723
871235
872515
872771
870468
870724
871236
872516
872772
873028
870469
870725
871237
872517
872773
873029
870470
870726
871238
872518
872774
873030
870471
870727
871239
872519
872775
873031
870472
870728
871240
872520
872776
873032
870473
870729
871241
872521
872777
873033
870474
870730
871242
872522
872778
873034
870475
870731
871243
872523
872779
873035
870476
870732
871244
872524
872780
873036
870477
870733
871245
872525
872781
873037
870478
870734
871246
872526
872782
873038
870479
870735
871247
872527
872783
873039
870480
870736
871248
872528
872784
873040
870481
870737
871249
872529
872785
873041
870482
870738
871250
857600
857856
866048
866304
873472
873728
857695
857951
866143
866399
873567
873823
920601
935971
923984
923136
923392
931584
931840
939008
939264
923231
923487
931679
931935
939103
939359
988672
988928
997120
997376
1004544
1004800
988767
989023
997215
997471
1004639
1004895
1053455
1053456
1054224
1053457
1054225
1053459
1054227
1053460
1053732
1053734
1052221
1052477
1052733
1052989
1052222
1052478
1052734
1052990
1052223
1052479
1052735
1052991
1052224
1052480
1052736
1052992
1052225
1052481
1052737
1052993
1052226
1052482
1052738
1052994
1052227
1052483
1052739
1052995
1052484
1052740
1052996
1054208
1054464
1062656
1062912
1070080
1070336
1054303
1054559
1062751
1063007
1070175
1070431
1119744
1120000
1128192
1128448
1135616
1135872
1119839
1120095
1128287
1128543
1135711
1135967
1185280
1185536
1193728
1193984
1201152
1201408
1185375
1185631
1193823
1194079
1201247
1201503
1250816
1251072
1259264
1259520
1266688
1266944
1250911
1251167
1259359
1259615
1266783
1267039
1316352
1316608
1324800
1325056
1332224
1332480
1316447
1316703
1324895
1325151
1332319
1332575
1381888
1382144
1390336
1390592
1397760
1398016
1381983
1382239
1390431
1390687
1397855
1398111
1453592
1454104
1454360
1453595
1454107
1454363
1444901
1444902
1447424
1447680
1455872
1456128
1463296
1463552
1447519
1447775
1455967
1456223
1463391
1463647
1512960
1513216
1521408
1521664
1528832
1529088
1513055
1513311
1521503
1521759
1528927
1529183
1578496
1578752
1586944
1587200
1594368
1594624
1578591
1578847
1587039
1587295
1594463
1594719
1651464
1644032
1644288
1652480
1652736
1659904
1660160
1644127
1644383
1652575
1652831
1659999
1660255
1726724
1716754
1717266
1717522
1716757
1717269
1717525
1716758
1717270
1717526
1716759
1717271
1717527
1716760
1717272
1717528
1716761
1717273
1717529
1716762
1717274
1717530
1716763
1717275
1717531
1716764
1717276
1717532
1717827
1717828
1717829
1717830
1717831
1717832
1717833
1717834
1717835
1709568
1709824
1718016
1718272
1725440
1725696
1709663
1709919
1718111
1718367
1725535
1725791
1787926
1788182
1787671
1787927
1788183
1787673
1787929
1788185
1783066
1787930
1788186
1783067
1787931
1788187
1787932
1788188
1789212
1787933
1788189
1789213
1787934
1788190
1773599
1787935
1788191
1787936
1788192
1773601
1787937
1788193
1773602
1787938
1788194
1787939
1773116
1789008
1775104
1775360
1783552
1783808
1790976
1791232
1775199
1775455
1783647
1783903
1791071
1791327
1855825
1856593
1856849
1855826
1856594
1856850
1856597
1856853
1840640
1840896
1849088
1849344
1856512
1856768
1840735
1840991
1849183
1849439
1856607
1856863
1922323
1920290
1906176
1906432
1914624
1914880
1922048
1922304
1906271
1906527
1914719
1914975
1922143
1922399
1987336
1970960
1986835
1985300
1985556
1986836
1969941
1970197
1985301
1985557
1986837
1969942
1970198
1985303
1985559
1986839
1969944
1970200
1979160
1969945
1970201
1969947
1970203
1969948
1970204
1979164
1984029
1969950
1970206
1971271
1971272
1985608
1972557
1975889
1971712
1971968
1980160
1980416
1987584
1987840
1971807
1972063
1980255
1980511
1987679
1987935
2037248
2037504
2045696
2045952
2053120
2053376
2037343
2037599
2045791
2046047
2053215
2053471
2116682
2102784
2103040
2111232
2111488
2118656
2118912
2102879
2103135
2111327
2111583
2118751
2119007
2184448
2184449
2185531
2170943
2170960
2170963
2170964
2168320
2168576
2176768
2177024
2184192
2184448
2168415
2168671
2176863
2177119
2184287
2184543
2229766
2239576
2233856
2234112
2242304
2242560
2249728
2249984
2233951
2234207
2242399
2242655
2249823
2250079
2315520
2315265
2315521
2306828
2300179
2313279
2315083
2299392
2299648
2307840
2308096
2315264
2315520
2299487
2299743
2307935
2308191
2315359
2315615
2382165
2364928
2365184
2373376
2373632
2380800
2381056
2365023
2365279
2373471
2373727
2380895
2381151
2430464
2430720
2438912
2439168
2446336
2446592
2430559
2430815
2439007
2439263
2446431
2446687
2512896
2512641
2512897
2513153
2512642
2512898
2513154
2496000
2496256
2504448
2504704
2511872
2512128
2496095
2496351
2504543
2504799
2511967
2512223
2562329
2562332
2575431
2561536
2561792
2569984
2570240
2577408
2577664
2561631
2561887
2570079
2570335
2577503
2577759
2627072
2627328
2635520
2635776
2642944
2643200
2627167
2627423
2635615
2635871
2643039
2643295
2698508
2698509
2698510
2698511
2699800
2699801
2704929
2692608
2692864
2701056
2701312
2708480
2708736
2692703
2692959
2701151
2701407
2708575
2708831
2758400
2755608
2755609
2759200
2759214
2754120
2754121
2775382
2758144
2758400
2766592
2766848
2774016
2774272
2758239
2758495
2766687
2766943
2774111
2774367
2822918
2822919
2821649
2821905
2822161
2822417
2837533
2822978
2823680
2823936
2832128
2832384
2839552
2839808
2823775
2824031
2832223
2832479
2839647
2839903
2895380
2895382
2895383
2889216
2889472
2897664
2897920
2905088
2905344
2889311
2889567
2897759
2898015
2905183
2905439
2967314
2967570
2967316
2967572
2967317
2967573
2967318
2967574
2967319
2967575
2967320
2967576
2967321
2967577
2967322
2967578
2967844
2969416
2967130
2954752
2955008
2963200
2963456
2970624
2970880
2954847
2955103
2963295
2963551
2970719
2970975
3034163
3034164
3034168
3037496
3037497
3034426
3027794
3035993
3035994
3035995
3020288
3020544
3028736
3028992
3036160
3036416
3020383
3020639
3028831
3029087
3036255
3036511
3085127
3085824
3086080
3094272
3094528
3101696
3101952
3085919
3086175
3094367
3094623
3101791
3102047
3165444
3168522
3153935
3165200
3153948
3166029
3163736
3151360
3151616
3159808
3160064
3167232
3167488
3151455
3151711
3159903
3160159
3167327
3167583
3224576
3224577
3219217
3216896
3217152
3225344
3225600
3232768
3233024
3216991
3217247
3225439
3225695
3232863
3233119
3296780
3297292
3296013
3296781
3297293
3295758
3296014
3296782
3297294
3295759
3296015
3296783
3297295
3295760
3296016
3296784
3297296
3295761
3296017
3296785
3297297
3296788
3280661
3280663
3280664
3280665
3280154
3280666
3280155
3280667
3280669
3295560
3295816
3296328
3296584
3297096
3295561
3295817
3296329
3296585
3297097
3295562
3295818
3296330
3296586
3297098
3295563
3295819
3296331
3296587
3297099
3295564
3295820
3296332
3296588
3297100
3295568
3295824
3296336
3282432
3282688
3290880
3291136
3298304
3298560
3282527
3282783
3290975
3291231
3298399
3298655
3347968
3348224
3356416
3356672
3363840
3364096
3348063
3348319
3356511
3356767
3363935
3364191
3420949
3425844
3413504
3413760
3421952
3422208
3429376
3429632
3413599
3413855
3422047
3422303
3429471
3429727
3486470
3486471
3494663
3486472
3494664
3493697
3493953
3494209
3493698
3493954
3494210
3493699
3493955
3494211
3493700
3493956
3494212
3493701
3493957
3494213
3493702
3493958
3494214
3493703
3493959
3494215
3493704
3493960
3494216
3493705
3493961
3494217
3493706
3493962
3494218
3493707
3493963
3494219
3493708
3493964
3494220
3493709
3493965
3494221
3493710
3493966
3494222
3493711
3493967
3494223
3493712
3493968
3494224
3493713
3493969
3494225
3493714
3493970
3494226
3486553
3479040
3479296
3487488
3487744
3494912
3495168
3479135
3479391
3487583
3487839
3495007
3495263
