140849
140594
601135
1188394
1387567
1522735
1584419
1584676
1583398
1583654
1583911
1585707
1653808
1910309
2368303
2368304
2564399
2761264
2762035
2764349
2763070
2764606
2958127
2958383
3029039
3029040
3089205
3089208
3094329
3089982
3416367
