0 0 1.0 0.0 0.0
0 1 0.783783766107 0.896551728249 1.42307686806
0 2 1.0 0.0 0.0
1 0 1.0 0.0 0.0
1 1 0.617021285986 0.965517222881 1.67857146263
1 2 1.0 0.0 0.0
2 0 1.0 0.0 0.0
2 1 0.612244900938 0.899999976158 1.81481480598
2 2 1.0 0.0 0.0
3 0 1.0 0.0 0.0
3 1 0.630434776074 0.896551728249 1.76923072338
3 2 1.0 0.0 0.0
4 0 1.0 0.0 0.0
4 1 0.666666666667 0.964285731316 1.55555558205
4 2 1.0 0.0 0.0
5 0 1.0 0.0 0.0
5 1 0.5 0.966666638851 2.06896543503
5 2 1.0 0.0 0.0
6 0 1.0 0.0 0.0
6 1 0.5 0.931034505367 2.14814805984
6 2 1.0 0.0 0.0
7 0 1.0 0.0 0.0
7 1 0.651162797919 0.857142865658 1.79166662693
7 2 1.0 0.0 0.0
8 0 1.0 0.0 0.0
8 1 0.71428572645 0.879999995232 1.59090912342
8 2 1.0 0.0 0.0
9 0 1.0 0.0 0.0
9 1 0.717948691615 0.892857134342 1.55999994278
9 2 1.0 0.0 0.0
10 0 1.0 0.0 0.0
10 1 0.636363650156 0.964285731316 1.62962961197
10 2 1.0 0.0 0.0
11 0 1.0 0.0 0.0
11 1 1.76470589473 0.5 1.13333332539
11 2 1.0 0.0 0.0
12 0 1.0 0.0 0.0
12 1 0.586956501965 0.925925910473 1.84000003338
12 2 1.0 0.0 0.0
13 0 1.0 0.0 0.0
13 1 0.874999960884 0.892857134342 1.27999997139
13 2 1.0 0.0 0.0
14 0 1.0 0.0 0.0
14 1 0.630434776074 0.965517222881 1.64285719395
14 2 1.0 0.0 0.0
15 0 1.0 0.0 0.0
15 1 0.83333330022 0.866666674614 1.3846154213
15 2 1.0 0.0 0.0
16 0 1.0 0.0 0.0
16 1 0.576923071633 1.0 1.73333334923
16 2 1.0 0.0 0.0
17 0 1.0 0.0 0.0
17 1 0.624999990687 0.966666638851 1.65517246723
17 2 1.0 0.0 0.0
18 0 1.0 0.0 0.0
18 1 0.483870982628 1.0 2.06666660309
18 2 1.0 0.0 0.0
19 0 1.0 0.0 0.0
19 1 0.828571434216 0.86206895113 1.39999997616
19 2 1.0 0.0 0.0
20 0 1.0 0.0 0.0
20 1 0.666666666667 0.928571403027 1.6153845787
20 2 1.0 0.0 0.0
21 0 1.0 0.0 0.0
21 1 0.666666666667 0.964285731316 1.55555558205
21 2 1.0 0.0 0.0
22 0 1.0 0.0 0.0
22 1 0.805555587565 0.896551728249 1.3846154213
22 2 1.0 0.0 0.0
23 0 1.0 0.0 0.0
23 1 0.571428571429 0.964285731316 1.81481480598
23 2 1.0 0.0 0.0
24 0 1.0 0.0 0.0
24 1 0.576923071633 0.899999976158 1.92592597008
24 2 1.0 0.0 0.0
25 0 1.0 0.0 0.0
25 1 0.634146319338 0.923076927662 1.70833337307
25 2 1.0 0.0 0.0
26 0 1.0 0.0 0.0
26 1 1.07407404799 0.758620679379 1.22727274895
26 2 1.0 0.0 0.0
27 0 1.0 0.0 0.0
27 1 0.729729720325 0.888888895512 1.54166662693
27 2 1.0 0.0 0.0
28 0 1.0 0.0 0.0
28 1 0.707317081397 0.86206895113 1.63999998569
28 2 1.0 0.0 0.0
29 0 1.0 0.0 0.0
29 1 0.692307705005 0.962962985039 1.5
29 2 1.0 0.0 0.0
30 0 1.0 0.0 0.0
30 1 0.568627435031 0.931034505367 1.88888883591
30 2 1.0 0.0 0.0
31 0 1.0 0.0 0.0
31 1 0.38157895096 1.0 2.62068963051
31 2 1.0 0.0 0.0
32 0 1.0 0.0 0.0
32 1 1.0 0.758620679379 1.31818187237
32 2 1.0 0.0 0.0
33 0 1.0 0.0 0.0
33 1 0.529411779555 1.0 1.88888883591
33 2 1.0 0.0 0.0
34 0 1.0 0.0 0.0
34 1 0.658536564304 0.925925910473 1.63999998569
34 2 1.0 0.0 0.0
35 0 1.0 0.0 0.0
35 1 0.818181827049 0.888888895512 1.375
35 2 1.0 0.0 0.0
36 0 1.0 0.0 0.0
36 1 0.600000014305 0.833333313465 2.0
36 2 1.0 0.0 0.0
37 0 1.0 0.0 0.0
37 1 0.72222220309 0.923076927662 1.5
37 2 1.0 0.0 0.0
38 0 1.0 0.0 0.0
38 1 0.966666705079 0.793103456497 1.30434787273
38 2 1.0 0.0 0.0
39 0 1.0 0.0 0.0
39 1 0.756756776262 0.892857134342 1.48000001907
39 2 1.0 0.0 0.0
40 0 1.0 0.0 0.0
40 1 0.763157901919 0.827586233616 1.58333337307
40 2 1.0 0.0 0.0
41 0 1.0 0.0 0.0
41 1 0.690476217913 1.0 1.44827580452
41 2 1.0 0.0 0.0
42 0 1.0 0.0 0.0
42 1 0.783783766107 0.896551728249 1.42307686806
42 2 1.0 0.0 0.0
43 0 1.0 0.0 0.0
43 1 0.729729720325 0.888888895512 1.54166662693
43 2 1.0 0.0 0.0
44 0 1.0 0.0 0.0
44 1 0.717948691615 0.928571403027 1.5
44 2 1.0 0.0 0.0
45 0 1.0 0.0 0.0
45 1 0.736842133002 0.928571403027 1.46153843403
45 2 1.0 0.0 0.0
46 0 1.0 0.0 0.0
46 1 0.742857137797 0.961538434029 1.39999997616
46 2 1.0 0.0 0.0
47 0 1.0 0.0 0.0
47 1 0.896551753621 0.884615361691 1.26086962223
47 2 1.0 0.0 0.0
48 0 1.0 0.0 0.0
48 1 0.649999988377 0.961538434029 1.60000002384
48 2 1.0 0.0 0.0
49 0 1.0 0.0 0.0
49 1 1.17391300393 0.666666686535 1.27777779102
49 2 1.0 0.0 0.0
50 0 1.0 0.0 0.0
50 1 1.08695650202 0.72000002861 1.27777779102
50 2 1.0 0.0 0.0
51 0 1.0 0.0 0.0
51 1 0.71428572645 0.920000016689 1.52173912525
51 2 1.0 0.0 0.0
52 0 1.0 0.0 0.0
52 1 0.555555570273 0.959999978542 1.875
52 2 1.0 0.0 0.0
