0 0 0.71428572645 0.600000023842 2.33333325386
0 1 2.52606543911 0.335941523314 1.17839729786
0 2 1.0 0.0 0.0
1 0 0.882352947364 0.533333361149 2.125
1 1 0.552121806039 0.873636305332 2.07316756248
1 2 1.0 0.0 0.0
2 0 0.84615388495 0.54545456171 2.16666674614
2 1 0.515160514789 0.922017991543 2.10531973839
2 2 1.0 0.0 0.0
3 0 0.545454533632 1.0 1.83333337307
3 1 0.41753907326 0.93464922905 2.56244301796
3 2 1.16666665508 0.714285731316 1.20000004768
4 0 0.699999983311 0.714285731316 2.0
4 1 0.466527726968 0.929096162319 2.30707597733
4 2 1.20000002861 0.666666686535 1.25
5 0 1.0 0.0 0.0
5 1 0.43966653595 0.922989606857 2.46422171593
5 2 0.687499979511 0.636363625526 2.28571438789
6 0 0.428571443168 1.0 2.33333325386
6 1 0.396876052972 0.941206336021 2.67707324028
6 2 0.473684198638 0.666666686535 3.16666674614
7 0 0.5 0.75 2.66666674614
7 1 0.457043877064 0.928329348564 2.35689401627
7 2 0.888888888889 0.625 1.79999995232
8 0 0.5 1.0 2.0
8 1 0.313650158851 0.951216518879 3.3517768383
8 2 0.529411779555 0.666666686535 2.83333325386
9 0 0.347826086957 0.875 3.28571438789
9 1 0.501449783038 0.911684513092 2.1873986721
9 2 0.600000014305 1.0 1.66666662693
10 0 0.35294118637 0.833333313465 3.40000009537
10 1 0.443324387511 0.935394823551 2.41147851944
10 2 1.4999999553 0.5 1.33333337307
11 0 0.454545444693 0.800000011921 2.75
11 1 0.43742360112 0.933511912823 2.44893860817
11 2 0.666666666667 0.75 2.0
12 0 0.466666681502 1.0 2.14285707474
12 1 0.517453729863 0.932005107403 2.07352948189
12 2 0.749999977648 1.0 1.33333337307
13 0 0.368421066501 1.0 2.71428561211
13 1 0.504349124746 0.947256743908 2.0931532383
13 2 1.4999999553 0.666666686535 1.0
14 0 0.437499980442 1.0 2.28571438789
14 1 0.524511081119 0.917440593243 2.078104496
14 2 1.4999999553 0.666666686535 1.0
15 0 0.636363650156 0.714285731316 2.20000004768
15 1 0.553298914497 0.923667430878 1.9567013979
15 2 0.666666666667 0.75 2.0
16 0 0.636363650156 1.0 1.57142853737
16 1 0.410957524338 0.94460350275 2.57604551315
16 2 1.0 0.75 1.33333337307
17 0 0.444444444444 0.75 3.0
17 1 0.398589471862 0.947676837444 2.64736557007
17 2 0.749999977648 1.0 1.33333337307
18 0 0.571428571429 1.0 1.75
18 1 0.512802882051 0.874724566936 2.22934985161
18 2 0.272727266816 1.0 3.66666674614
19 0 0.363636363636 1.0 2.75
19 1 0.502816750544 0.924203336239 2.15190315247
19 2 1.0 1.0 1.0
20 0 0.437499980442 1.0 2.28571438789
20 1 0.516536911671 0.862632513046 2.24425816536
20 2 1.0 0.0 0.0
21 0 0.4 1.0 2.5
21 1 0.383754543717 0.933498680592 2.7914686203
21 2 1.0 0.0 0.0
22 0 0.571428571429 0.75 2.33333325386
22 1 0.401073966487 0.937271535397 2.66017436981
22 2 1.0 0.0 0.0
23 0 0.461538444609 1.0 2.16666674614
23 1 0.424183846603 0.933398127556 2.52568364143
23 2 1.0 0.0 0.0
24 0 0.269230776637 0.857142865658 4.33333349228
24 1 0.417603468347 0.952742516994 2.51339268684
24 2 1.0 0.0 0.0
25 0 0.538461553275 1.0 1.85714280605
25 1 0.620334416473 0.908047318459 1.77527499199
25 2 1.0 0.0 0.0
26 0 0.600000014305 1.0 1.66666662693
26 1 7289.66671649 4.57268288301e-05 3.0
26 2 2.0 0.5 1.0
27 0 0.38888889404 1.0 2.57142853737
27 1 0.455328795429 0.926361680031 2.37079668045
27 2 0.5 1.0 2.0
28 0 0.571428571429 0.875 2.0
28 1 0.502441829264 0.886495292187 2.2451107502
28 2 0.5 1.0 2.0
29 0 0.5 1.0 2.0
29 1 0.464813590457 0.89910531044 2.3928232193
29 2 2.0 0.5 1.0
30 0 0.5 0.833333313465 2.40000009537
30 1 0.319541015724 0.943453192711 3.31705760956
30 2 1.0 0.0 0.0
31 0 0.555555570273 1.0 1.79999995232
31 1 0.209776874401 0.969365119934 4.91762018204
31 2 1.0 0.5 2.0
32 0 1.0 0.0 0.0
32 1 0.546278082799 0.910511672497 2.01048445702
32 2 2.0 0.5 1.0
33 0 0.466666681502 1.0 2.14285707474
33 1 0.479897318113 0.928159117699 2.24506664276
33 2 0.5 1.0 2.0
34 0 0.77777778808 0.857142865658 1.5
34 1 0.515206329233 0.934327065945 2.07739877701
34 2 1.0 1.0 1.0
35 0 0.357142863225 1.0 2.79999995232
35 1 0.42991913719 0.947900652885 2.45386362076
35 2 1.0 1.0 1.0
36 0 0.699999983311 1.0 1.42857146263
36 1 1.87360305187 0.425684213638 1.25381910801
36 2 0.666666666667 1.0 1.5
37 0 0.583333327538 1.0 1.71428573132
37 1 0.542710827843 0.922672629356 1.9970266819
37 2 0.600000014305 0.666666686535 2.5
38 0 1.0 0.0 0.0
38 1 0.288802153534 0.96424382925 3.59097766876
38 2 1.0 0.0 0.0
39 0 1.0 0.0 0.0
39 1 0.5863513069 0.917096734047 1.85963177681
39 2 2.66666666667 0.25 1.5
40 0 1.0 0.0 0.0
40 1 0.54859490295 0.940866947174 1.93740320206
40 2 2.49999996275 0.20000000298 2.0
41 0 1.0 0.0 0.0
41 1 0.424945943377 0.954486966133 2.46545052528
41 2 1.4999999553 0.333333343267 2.0
42 0 1.0 0.0 0.0
42 1 22770.4992337 4.39164723502e-05 1.0
42 2 2.99999991059 0.333333343267 1.0
43 0 1.0 0.0 0.0
43 1 0.49008995198 0.956630110741 2.13294744492
43 2 1.74999992177 0.428571432829 1.33333337307
44 0 0.5 0.5 4.0
44 1 0.536638500305 0.916887462139 2.03236722946
44 2 0.5 0.800000011921 2.5
45 0 0.333333333333 0.600000023842 5.0
45 1 0.557160689623 0.930743634701 1.92836594582
45 2 1.0 0.800000011921 1.25
46 0 0.749999977648 0.666666686535 2.0
46 1 0.56531895581 0.699164450169 2.53003835678
46 2 2.33333331015 0.428571432829 1.0
47 0 0.699999983311 0.857142865658 1.66666662693
47 1 0.60741832253 0.942772269249 1.74624550343
47 2 0.571428571429 1.0 1.75
48 0 0.545454533632 0.833333313465 2.20000004768
48 1 0.34682830969 0.972962796688 2.96339273453
48 2 0.444444444444 1.0 2.25
49 0 0.538461553275 0.857142865658 2.16666674614
49 1 0.485992574841 0.92828977108 2.21659731865
49 2 0.4 1.0 2.5
50 0 0.35294118637 1.0 2.83333325386
50 1 0.512711800697 0.941169500351 2.07232952118
50 2 1.0 0.75 1.33333337307
51 0 0.555555570273 1.0 1.79999995232
51 1 0.399469774216 0.953487694263 2.62543320656
51 2 0.749999977648 1.0 1.33333337307
52 0 1.0 0.714285731316 1.39999997616
52 1 0.429317627902 0.901435315609 2.58396577835
52 2 2.99999991059 0.111111111939 3.0
53 0 1.0 0.0 0.0
53 1 1.0 0.0 0.0
53 2 1.0 0.0 0.0
