2441216
2441472
2441728
2441984
2442240
2442496
2442752
2443008
2443264
2443520
2443776
2444032
2444288
2444544
2444800
2445056
2445312
2445568
2445824
2446080
2446336
2446592
2446848
2447104
2447360
2447616
2447872
2448128
2448384
2448640
2448896
2449152
2441217
2441473
2441729
2441985
2442241
2442497
2442753
2443009
2443265
2443521
2443777
2444033
2444289
2444545
2444801
2445057
2445313
2445569
2445825
2446081
2446337
2446593
2446849
2447105
2447361
2447617
2447873
2448129
2448385
2448641
2448897
2449153
2441218
2441474
2441730
2441986
2442242
2442498
2442754
2443010
2443266
2443522
2443778
2444034
2444290
2444546
2444802
2445058
2445314
2445570
2445826
2446082
2446338
2446594
2446850
2447106
2447362
2447618
2447874
2448130
2448386
2448642
2448898
2449154
2441219
2441475
2441731
2441987
2442243
2442499
2442755
2443011
2443267
2443523
2443779
2444035
2444291
2444547
2444803
2445059
2445315
2445571
2445827
2446083
2446339
2446595
2446851
2447107
2447363
2447619
2447875
2448131
2448387
2448643
2448899
2449155
2441220
2441476
2441732
2441988
2442244
2442500
2442756
2443012
2443268
2443524
2443780
2444036
2444292
2444548
2444804
2445060
2445316
2445572
2445828
2446084
2446340
2446596
2446852
2447108
2447364
2447620
2447876
2448132
2448388
2448644
2448900
2449156
2441221
2441477
2441733
2441989
2442245
2442501
2442757
2443013
2443269
2443525
2443781
2444037
2444293
2444549
2444805
2445061
2445317
2445573
2445829
2446085
2446341
2446597
2446853
2447109
2447365
2447621
2447877
2448133
2448389
2448645
2448901
2449157
2441222
2441478
2441734
2441990
2442246
2442502
2442758
2443014
2443270
2443526
2443782
2444038
2444294
2444550
2444806
2445062
2445318
2445574
2445830
2446086
2446342
2446598
2446854
2447110
2447366
2447622
2447878
2448134
2448390
2448646
2448902
2449158
2441223
2441479
2441735
2441991
2442247
2442503
2442759
2443015
2443271
2443527
2443783
2444039
2444295
2444551
2444807
2445063
2445319
2445575
2445831
2446087
2446343
2446599
2446855
2447111
2447367
2447623
2447879
2448135
2448391
2448647
2448903
2449159
2441224
2441480
2441736
2441992
2442248
2442504
2442760
2443016
2443272
2443528
2443784
2444040
2444296
2444552
2444808
2445064
2445320
2445576
2445832
2446088
2446344
2446600
2446856
2447112
2447368
2447624
2447880
2448136
2448392
2448648
2448904
2449160
2441225
2441481
2441737
2441993
2442249
2442505
2442761
2443017
2443273
2443529
2443785
2444041
2444297
2444553
2444809
2445065
2445321
2445577
2445833
2446089
2446345
2446601
2446857
2447113
2447369
2447625
2447881
2448137
2448393
2448649
2448905
2449161
2441226
2441482
2441738
2441994
2442250
2442506
2442762
2443018
2443274
2443530
2443786
2444042
2444298
2444554
2444810
2445066
2445322
2445578
2445834
2446090
2446346
2446602
2446858
2447114
2447370
2447626
2447882
2448138
2448394
2448650
2448906
2449162
2441227
2441483
2441739
2441995
2442251
2442507
2442763
2443019
2443275
2443531
2443787
2444043
2444299
2444555
2444811
2445067
2445323
2445579
2445835
2446091
2446347
2446603
2446859
2447115
2447371
2447627
2447883
2448139
2448395
2448651
2448907
2449163
2441228
2441484
2441740
2441996
2442252
2442508
2442764
2443020
2443276
2443532
2443788
2444044
2444300
2444556
2444812
2445068
2445324
2445580
2445836
2446092
2446348
2446604
2446860
2447116
2447372
2447628
2447884
2448140
2448396
2448652
2448908
2449164
2441229
2441485
2441741
2441997
2442253
2442509
2442765
2443021
2443277
2443533
2443789
2444045
2444301
2444557
2444813
2445069
2445325
2445581
2445837
2446093
2446349
2446605
2446861
2447117
2447373
2447629
2447885
2448141
2448397
2448653
2448909
2449165
2441230
2441486
2441742
2441998
2442254
2442510
2442766
2443022
2443278
2443534
2443790
2444046
2444302
2444558
2444814
2445070
2445326
2445582
2445838
2446094
2446350
2446606
2446862
2447118
2447374
2447630
2447886
2448142
2448398
2448654
2448910
2449166
2441231
2441487
2441743
2441999
2442255
2442511
2442767
2443023
2443279
2443535
2443791
2444047
2444303
2444559
2444815
2445071
2445327
2445583
2445839
2446095
2446351
2446607
2446863
2447119
2447375
2447631
2447887
2448143
2448399
2448655
2448911
2449167
2441232
2441488
2441744
2442000
2442256
2442512
2442768
2443024
2443280
2443536
2443792
2444048
2444304
2444560
2444816
2445072
2445328
2445584
2445840
2446096
2446352
2446608
2446864
2447120
2447376
2447632
2447888
2448144
2448400
2448656
2448912
2449168
2441233
2441489
2441745
2442001
2442257
2442513
2442769
2443025
2443281
2443537
2443793
2444049
2444305
2444561
2444817
2445073
2445329
2445585
2445841
2446097
2446353
2446609
2446865
2447121
2447377
2447633
2447889
2448145
2448401
2448657
2448913
2449169
2441234
2441490
2441746
2442002
2442258
2442514
2442770
2443026
2443282
2443538
2443794
2444050
2444306
2444562
2444818
2445074
2445330
2445586
2445842
2446098
2446354
2446610
2446866
2447122
2447378
2447634
2447890
2448146
2448402
2448658
2448914
2449170
2441235
2441491
2441747
2442003
2442259
2442515
2442771
2443027
2443283
2443539
2443795
2444051
2444307
2444563
2444819
2445075
2445331
2445587
2445843
2446099
2446355
2446611
2446867
2447123
2447379
2447635
2447891
2448147
2448403
2448659
2448915
2449171
2441236
2441492
2441748
2442004
2442260
2442516
2442772
2443028
2443284
2443540
2443796
2444052
2444308
2444564
2444820
2445076
2445332
2445588
2445844
2446100
2446356
2446612
2446868
2447124
2447380
2447636
2447892
2448148
2448404
2448660
2448916
2449172
2441237
2441493
2441749
2442005
2442261
2442517
2442773
2443029
2443285
2443541
2443797
2444053
2444309
2444565
2444821
2445077
2445333
2445589
2445845
2446101
2446357
2446613
2446869
2447125
2447381
2447637
2447893
2448149
2448405
2448661
2448917
2449173
2441238
2441494
2441750
2442006
2442262
2442518
2442774
2443030
2443286
2443542
2443798
2444054
2444310
2444566
2444822
2445078
2445334
2445590
2445846
2446102
2446358
2446614
2446870
2447126
2447382
2447638
2447894
2448150
2448406
2448662
2448918
2449174
2441239
2441495
2441751
2442007
2442263
2442519
2442775
2443031
2443287
2443543
2443799
2444055
2444311
2444567
2444823
2445079
2445335
2445591
2445847
2446103
2446359
2446615
2446871
2447127
2447383
2447639
2447895
2448151
2448407
2448663
2448919
2449175
2441240
2441496
2441752
2442008
2442264
2442520
2442776
2443032
2443288
2443544
2443800
2444056
2444312
2444568
2444824
2445080
2445336
2445592
2445848
2446104
2446360
2446616
2446872
2447128
2447384
2447640
2447896
2448152
2448408
2448664
2448920
2449176
2441241
2441497
2441753
2442009
2442265
2442521
2442777
2443033
2443289
2443545
2443801
2444057
2444313
2444569
2444825
2445081
2445337
2445593
2445849
2446105
2446361
2446617
2446873
2447129
2447385
2447641
2447897
2448153
2448409
2448665
2448921
2449177
2441242
2441498
2441754
2442010
2442266
2442522
2442778
2443034
2443290
2443546
2443802
2444058
2444314
2444570
2444826
2445082
2445338
2445594
2445850
2446106
2446362
2446618
2446874
2447130
2447386
2447642
2447898
2448154
2448410
2448666
2448922
2449178
2441243
2441499
2441755
2442011
2442267
2442523
2442779
2443035
2443291
2443547
2443803
2444059
2444315
2444571
2444827
2445083
2445339
2445595
2445851
2446107
2446363
2446619
2446875
2447131
2447387
2447643
2447899
2448155
2448411
2448667
2448923
2449179
2441244
2441500
2441756
2442012
2442268
2442524
2442780
2443036
2443292
2443548
2443804
2444060
2444316
2444572
2444828
2445084
2445340
2445596
2445852
2446108
2446364
2446620
2446876
2447132
2447388
2447644
2447900
2448156
2448412
2448668
2448924
2449180
2441245
2441501
2441757
2442013
2442269
2442525
2442781
2443037
2443293
2443549
2443805
2444061
2444317
2444573
2444829
2445085
2445341
2445597
2445853
2446109
2446365
2446621
2446877
2447133
2447389
2447645
2447901
2448157
2448413
2448669
2448925
2449181
2441246
2441502
2441758
2442014
2442270
2442526
2442782
2443038
2443294
2443550
2443806
2444062
2444318
2444574
2444830
2445086
2445342
2445598
2445854
2446110
2446366
2446622
2446878
2447134
2447390
2447646
2447902
2448158
2448414
2448670
2448926
2449182
2441247
2441503
2441759
2442015
2442271
2442527
2442783
2443039
2443295
2443551
2443807
2444063
2444319
2444575
2444831
2445087
2445343
2445599
2445855
2446111
2446367
2446623
2446879
2447135
2447391
2447647
2447903
2448159
2448415
2448671
2448927
2449183
2441248
2441504
2441760
2442016
2442272
2442528
2442784
2443040
2443296
2443552
2443808
2444064
2444320
2444576
2444832
2445088
2445344
2445600
2445856
2446112
2446368
2446624
2446880
2447136
2447392
2447648
2447904
2448160
2448416
2448672
2448928
2449184
2441249
2441505
2441761
2442017
2442273
2442529
2442785
2443041
2443297
2443553
2443809
2444065
2444321
2444577
2444833
2445089
2445345
2445601
2445857
2446113
2446369
2446625
2446881
2447137
2447393
2447649
2447905
2448161
2448417
2448673
2448929
2449185
2441250
2441506
2441762
2442018
2442274
2442530
2442786
2443042
2443298
2443554
2443810
2444066
2444322
2444578
2444834
2445090
2445346
2445602
2445858
2446114
2446370
2446626
2446882
2447138
2447394
2447650
2447906
2448162
2448418
2448674
2448930
2449186
2441251
2441507
2441763
2442019
2442275
2442531
2442787
2443043
2443299
2443555
2443811
2444067
2444323
2444579
2444835
2445091
2445347
2445603
2445859
2446115
2446371
2446627
2446883
2447139
2447395
2447651
2447907
2448163
2448419
2448675
2448931
2449187
2441252
2441508
2441764
2442020
2442276
2442532
2442788
2443044
2443300
2443556
2443812
2444068
2444324
2444580
2444836
2445092
2445348
2445604
2445860
2446116
2446372
2446628
2446884
2447140
2447396
2447652
2447908
2448164
2448420
2448676
2448932
2449188
2441253
2441509
2441765
2442021
2442277
2442533
2442789
2443045
2443301
2443557
2443813
2444069
2444325
2444581
2444837
2445093
2445349
2445605
2445861
2446117
2446373
2446629
2446885
2447141
2447397
2447653
2447909
2448165
2448421
2448677
2448933
2449189
2441254
2441510
2441766
2442022
2442278
2442534
2442790
2443046
2443302
2443558
2443814
2444070
2444326
2444582
2444838
2445094
2445350
2445606
2445862
2446118
2446374
2446630
2446886
2447142
2447398
2447654
2447910
2448166
2448422
2448678
2448934
2449190
2441255
2441511
2441767
2442023
2442279
2442535
2442791
2443047
2443303
2443559
2443815
2444071
2444327
2444583
2444839
2445095
2445351
2445607
2445863
2446119
2446375
2446631
2446887
2447143
2447399
2447655
2447911
2448167
2448423
2448679
2448935
2449191
2441256
2441512
2441768
2442024
2442280
2442536
2442792
2443048
2443304
2443560
2443816
2444072
2444328
2444584
2444840
2445096
2445352
2445608
2445864
2446120
2446376
2446632
2446888
2447144
2447400
2447656
2447912
2448168
2448424
2448680
2448936
2449192
2441257
2441513
2441769
2442025
2442281
2442537
2442793
2443049
2443305
2443561
2443817
2444073
2444329
2444585
2444841
2445097
2445353
2445609
2445865
2446121
2446377
2446633
2446889
2447145
2447401
2447657
2447913
2448169
2448425
2448681
2448937
2449193
2441258
2441514
2441770
2442026
2442282
2442538
2442794
2443050
2443306
2443562
2443818
2444074
2444330
2444586
2444842
2445098
2445354
2445610
2445866
2446122
2446378
2446634
2446890
2447146
2447402
2447658
2447914
2448170
2448426
2448682
2448938
2449194
2441259
2441515
2441771
2442027
2442283
2442539
2442795
2443051
2443307
2443563
2443819
2444075
2444331
2444587
2444843
2445099
2445355
2445611
2445867
2446123
2446379
2446635
2446891
2447147
2447403
2447659
2447915
2448171
2448427
2448683
2448939
2449195
2441260
2441516
2441772
2442028
2442284
2442540
2442796
2443052
2443308
2443564
2443820
2444076
2444332
2444588
2444844
2445100
2445356
2445612
2445868
2446124
2446380
2446636
2446892
2447148
2447404
2447660
2447916
2448172
2448428
2448684
2448940
2449196
2441261
2441517
2441773
2442029
2442285
2442541
2442797
2443053
2443309
2443565
2443821
2444077
2444333
2444589
2444845
2445101
2445357
2445613
2445869
2446125
2446381
2446637
2446893
2447149
2447405
2447661
2447917
2448173
2448429
2448685
2448941
2449197
2441262
2441518
2441774
2442030
2442286
2442542
2442798
2443054
2443310
2443566
2443822
2444078
2444334
2444590
2444846
2445102
2445358
2445614
2445870
2446126
2446382
2446638
2446894
2447150
2447406
2447662
2447918
2448174
2448430
2448686
2448942
2449198
2441263
2441519
2441775
2442031
2442287
2442543
2442799
2443055
2443311
2443567
2443823
2444079
2444335
2444591
2444847
2445103
2445359
2445615
2445871
2446127
2446383
2446639
2446895
2447151
2447407
2447663
2447919
2448175
2448431
2448687
2448943
2449199
2441264
2441520
2441776
2442032
2442288
2442544
2442800
2443056
2443312
2443568
2443824
2444080
2444336
2444592
2444848
2445104
2445360
2445616
2445872
2446128
2446384
2446640
2446896
2447152
2447408
2447664
2447920
2448176
2448432
2448688
2448944
2449200
2441265
2441521
2441777
2442033
2442289
2442545
2442801
2443057
2443313
2443569
2443825
2444081
2444337
2444593
2444849
2445105
2445361
2445617
2445873
2446129
2446385
2446641
2446897
2447153
2447409
2447665
2447921
2448177
2448433
2448689
2448945
2449201
2441266
2441522
2441778
2442034
2442290
2442546
2442802
2443058
2443314
2443570
2443826
2444082
2444338
2444594
2444850
2445106
2445362
2445618
2445874
2446130
2446386
2446642
2446898
2447154
2447410
2447666
2447922
2448178
2448434
2448690
2448946
2449202
2441267
2441523
2441779
2442035
2442291
2442547
2442803
2443059
2443315
2443571
2443827
2444083
2444339
2444595
2444851
2445107
2445363
2445619
2445875
2446131
2446387
2446643
2446899
2447155
2447411
2447667
2447923
2448179
2448435
2448691
2448947
2449203
2441268
2441524
2441780
2442036
2442292
2442548
2442804
2443060
2443316
2443572
2443828
2444084
2444340
2444596
2444852
2445108
2445364
2445620
2445876
2446132
2446388
2446644
2446900
2447156
2447412
2447668
2447924
2448180
2448436
2448692
2448948
2449204
2441269
2441525
2441781
2442037
2442293
2442549
2442805
2443061
2443317
2443573
2443829
2444085
2444341
2444597
2444853
2445109
2445365
2445621
2445877
2446133
2446389
2446645
2446901
2447157
2447413
2447669
2447925
2448181
2448437
2448693
2448949
2449205
2441270
2441526
2441782
2442038
2442294
2442550
2442806
2443062
2443318
2443574
2443830
2444086
2444342
2444598
2444854
2445110
2445366
2445622
2445878
2446134
2446390
2446646
2446902
2447158
2447414
2447670
2447926
2448182
2448438
2448694
2448950
2449206
2441271
2441527
2441783
2442039
2442295
2442551
2442807
2443063
2443319
2443575
2443831
2444087
2444343
2444599
2444855
2445111
2445367
2445623
2445879
2446135
2446391
2446647
2446903
2447159
2447415
2447671
2447927
2448183
2448439
2448695
2448951
2449207
2441272
2441528
2441784
2442040
2442296
2442552
2442808
2443064
2443320
2443576
2443832
2444088
2444344
2444600
2444856
2445112
2445368
2445624
2445880
2446136
2446392
2446648
2446904
2447160
2447416
2447672
2447928
2448184
2448440
2448696
2448952
2449208
2441273
2441529
2441785
2442041
2442297
2442553
2442809
2443065
2443321
2443577
2443833
2444089
2444345
2444601
2444857
2445113
2445369
2445625
2445881
2446137
2446393
2446649
2446905
2447161
2447417
2447673
2447929
2448185
2448441
2448697
2448953
2449209
2441274
2441530
2441786
2442042
2442298
2442554
2442810
2443066
2443322
2443578
2443834
2444090
2444346
2444602
2444858
2445114
2445370
2445626
2445882
2446138
2446394
2446650
2446906
2447162
2447418
2447674
2447930
2448186
2448442
2448698
2448954
2449210
2441275
2441531
2441787
2442043
2442299
2442555
2442811
2443067
2443323
2443579
2443835
2444091
2444347
2444603
2444859
2445115
2445371
2445627
2445883
2446139
2446395
2446651
2446907
2447163
2447419
2447675
2447931
2448187
2448443
2448699
2448955
2449211
2441276
2441532
2441788
2442044
2442300
2442556
2442812
2443068
2443324
2443580
2443836
2444092
2444348
2444604
2444860
2445116
2445372
2445628
2445884
2446140
2446396
2446652
2446908
2447164
2447420
2447676
2447932
2448188
2448444
2448700
2448956
2449212
2441277
2441533
2441789
2442045
2442301
2442557
2442813
2443069
2443325
2443581
2443837
2444093
2444349
2444605
2444861
2445117
2445373
2445629
2445885
2446141
2446397
2446653
2446909
2447165
2447421
2447677
2447933
2448189
2448445
2448701
2448957
2449213
2441278
2441534
2441790
2442046
2442302
2442558
2442814
2443070
2443326
2443582
2443838
2444094
2444350
2444606
2444862
2445118
2445374
2445630
2445886
2446142
2446398
2446654
2446910
2447166
2447422
2447678
2447934
2448190
2448446
2448702
2448958
2449214
2441279
2441535
2441791
2442047
2442303
2442559
2442815
2443071
2443327
2443583
2443839
2444095
2444351
2444607
2444863
2445119
2445375
2445631
2445887
2446143
2446399
2446655
2446911
2447167
2447423
2447679
2447935
2448191
2448447
2448703
2448959
2449215
2441280
2441536
2441792
2442048
2442304
2442560
2442816
2443072
2443328
2443584
2443840
2444096
2444352
2444608
2444864
2445120
2445376
2445632
2445888
2446144
2446400
2446656
2446912
2447168
2447424
2447680
2447936
2448192
2448448
2448704
2448960
2449216
2441281
2441537
2441793
2442049
2442305
2442561
2442817
2443073
2443329
2443585
2443841
2444097
2444353
2444609
2444865
2445121
2445377
2445633
2445889
2446145
2446401
2446657
2446913
2447169
2447425
2447681
2447937
2448193
2448449
2448705
2448961
2449217
2441282
2441538
2441794
2442050
2442306
2442562
2442818
2443074
2443330
2443586
2443842
2444098
2444354
2444610
2444866
2445122
2445378
2445634
2445890
2446146
2446402
2446658
2446914
2447170
2447426
2447682
2447938
2448194
2448450
2448706
2448962
2449218
2441283
2441539
2441795
2442051
2442307
2442563
2442819
2443075
2443331
2443587
2443843
2444099
2444355
2444611
2444867
2445123
2445379
2445635
2445891
2446147
2446403
2446659
2446915
2447171
2447427
2447683
2447939
2448195
2448451
2448707
2448963
2449219
2441284
2441540
2441796
2442052
2442308
2442564
2442820
2443076
2443332
2443588
2443844
2444100
2444356
2444612
2444868
2445124
2445380
2445636
2445892
2446148
2446404
2446660
2446916
2447172
2447428
2447684
2447940
2448196
2448452
2448708
2448964
2449220
2441285
2441541
2441797
2442053
2442309
2442565
2442821
2443077
2443333
2443589
2443845
2444101
2444357
2444613
2444869
2445125
2445381
2445637
2445893
2446149
2446405
2446661
2446917
2447173
2447429
2447685
2447941
2448197
2448453
2448709
2448965
2449221
2441286
2441542
2441798
2442054
2442310
2442566
2442822
2443078
2443334
2443590
2443846
2444102
2444358
2444614
2444870
2445126
2445382
2445638
2445894
2446150
2446406
2446662
2446918
2447174
2447430
2447686
2447942
2448198
2448454
2448710
2448966
2449222
2441287
2441543
2441799
2442055
2442311
2442567
2442823
2443079
2443335
2443591
2443847
2444103
2444359
2444615
2444871
2445127
2445383
2445639
2445895
2446151
2446407
2446663
2446919
2447175
2447431
2447687
2447943
2448199
2448455
2448711
2448967
2449223
2441288
2441544
2441800
2442056
2442312
2442568
2442824
2443080
2443336
2443592
2443848
2444104
2444360
2444616
2444872
2445128
2445384
2445640
2445896
2446152
2446408
2446664
2446920
2447176
2447432
2447688
2447944
2448200
2448456
2448712
2448968
2449224
2441289
2441545
2441801
2442057
2442313
2442569
2442825
2443081
2443337
2443593
2443849
2444105
2444361
2444617
2444873
2445129
2445385
2445641
2445897
2446153
2446409
2446665
2446921
2447177
2447433
2447689
2447945
2448201
2448457
2448713
2448969
2449225
2441290
2441546
2441802
2442058
2442314
2442570
2442826
2443082
2443338
2443594
2443850
2444106
2444362
2444618
2444874
2445130
2445386
2445642
2445898
2446154
2446410
2446666
2446922
2447178
2447434
2447690
2447946
2448202
2448458
2448714
2448970
2449226
2441291
2441547
2441803
2442059
2442315
2442571
2442827
2443083
2443339
2443595
2443851
2444107
2444363
2444619
2444875
2445131
2445387
2445643
2445899
2446155
2446411
2446667
2446923
2447179
2447435
2447691
2447947
2448203
2448459
2448715
2448971
2449227
2441292
2441548
2441804
2442060
2442316
2442572
2442828
2443084
2443340
2443596
2443852
2444108
2444364
2444620
2444876
2445132
2445388
2445644
2445900
2446156
2446412
2446668
2446924
2447180
2447436
2447692
2447948
2448204
2448460
2448716
2448972
2449228
2441293
2441549
2441805
2442061
2442317
2442573
2442829
2443085
2443341
2443597
2443853
2444109
2444365
2444621
2444877
2445133
2445389
2445645
2445901
2446157
2446413
2446669
2446925
2447181
2447437
2447693
2447949
2448205
2448461
2448717
2448973
2449229
2441294
2441550
2441806
2442062
2442318
2442574
2442830
2443086
2443342
2443598
2443854
2444110
2444366
2444622
2444878
2445134
2445390
2445646
2445902
2446158
2446414
2446670
2446926
2447182
2447438
2447694
2447950
2448206
2448462
2448718
2448974
2449230
2441295
2441551
2441807
2442063
2442319
2442575
2442831
2443087
2443343
2443599
2443855
2444111
2444367
2444623
2444879
2445135
2445391
2445647
2445903
2446159
2446415
2446671
2446927
2447183
2447439
2447695
2447951
2448207
2448463
2448719
2448975
2449231
2441296
2441552
2441808
2442064
2442320
2442576
2442832
2443088
2443344
2443600
2443856
2444112
2444368
2444624
2444880
2445136
2445392
2445648
2445904
2446160
2446416
2446672
2446928
2447184
2447440
2447696
2447952
2448208
2448464
2448720
2448976
2449232
2441297
2441553
2441809
2442065
2442321
2442577
2442833
2443089
2443345
2443601
2443857
2444113
2444369
2444625
2444881
2445137
2445393
2445649
2445905
2446161
2446417
2446673
2446929
2447185
2447441
2447697
2447953
2448209
2448465
2448721
2448977
2449233
2441298
2441554
2441810
2442066
2442322
2442578
2442834
2443090
2443346
2443602
2443858
2444114
2444370
2444626
2444882
2445138
2445394
2445650
2445906
2446162
2446418
2446674
2446930
2447186
2447442
2447698
2447954
2448210
2448466
2448722
2448978
2449234
2441299
2441555
2441811
2442067
2442323
2442579
2442835
2443091
2443347
2443603
2443859
2444115
2444371
2444627
2444883
2445139
2445395
2445651
2445907
2446163
2446419
2446675
2446931
2447187
2447443
2447699
2447955
2448211
2448467
2448723
2448979
2449235
2441300
2441556
2441812
2442068
2442324
2442580
2442836
2443092
2443348
2443604
2443860
2444116
2444372
2444628
2444884
2445140
2445396
2445652
2445908
2446164
2446420
2446676
2446932
2447188
2447444
2447700
2447956
2448212
2448468
2448724
2448980
2449236
2441301
2441557
2441813
2442069
2442325
2442581
2442837
2443093
2443349
2443605
2443861
2444117
2444373
2444629
2444885
2445141
2445397
2445653
2445909
2446165
2446421
2446677
2446933
2447189
2447445
2447701
2447957
2448213
2448469
2448725
2448981
2449237
2441302
2441558
2441814
2442070
2442326
2442582
2442838
2443094
2443350
2443606
2443862
2444118
2444374
2444630
2444886
2445142
2445398
2445654
2445910
2446166
2446422
2446678
2446934
2447190
2447446
2447702
2447958
2448214
2448470
2448726
2448982
2449238
2441303
2441559
2441815
2442071
2442327
2442583
2442839
2443095
2443351
2443607
2443863
2444119
2444375
2444631
2444887
2445143
2445399
2445655
2445911
2446167
2446423
2446679
2446935
2447191
2447447
2447703
2447959
2448215
2448471
2448727
2448983
2449239
2441304
2441560
2441816
2442072
2442328
2442584
2442840
2443096
2443352
2443608
2443864
2444120
2444376
2444632
2444888
2445144
2445400
2445656
2445912
2446168
2446424
2446680
2446936
2447192
2447448
2447704
2447960
2448216
2448472
2448728
2448984
2449240
2441305
2441561
2441817
2442073
2442329
2442585
2442841
2443097
2443353
2443609
2443865
2444121
2444377
2444633
2444889
2445145
2445401
2445657
2445913
2446169
2446425
2446681
2446937
2447193
2447449
2447705
2447961
2448217
2448473
2448729
2448985
2449241
2441306
2441562
2441818
2442074
2442330
2442586
2442842
2443098
2443354
2443610
2443866
2444122
2444378
2444634
2444890
2445146
2445402
2445658
2445914
2446170
2446426
2446682
2446938
2447194
2447450
2447706
2447962
2448218
2448474
2448730
2448986
2449242
2441307
2441563
2441819
2442075
2442331
2442587
2442843
2443099
2443355
2443611
2443867
2444123
2444379
2444635
2444891
2445147
2445403
2445659
2445915
2446171
2446427
2446683
2446939
2447195
2447451
2447707
2447963
2448219
2448475
2448731
2448987
2449243
2441308
2441564
2441820
2442076
2442332
2442588
2442844
2443100
2443356
2443612
2443868
2444124
2444380
2444636
2444892
2445148
2445404
2445660
2445916
2446172
2446428
2446684
2446940
2447196
2447452
2447708
2447964
2448220
2448476
2448732
2448988
2449244
2441309
2441565
2441821
2442077
2442333
2442589
2442845
2443101
2443357
2443613
2443869
2444125
2444381
2444637
2444893
2445149
2445405
2445661
2445917
2446173
2446429
2446685
2446941
2447197
2447453
2447709
2447965
2448221
2448477
2448733
2448989
2449245
2441310
2441566
2441822
2442078
2442334
2442590
2442846
2443102
2443358
2443614
2443870
2444126
2444382
2444638
2444894
2445150
2445406
2445662
2445918
2446174
2446430
2446686
2446942
2447198
2447454
2447710
2447966
2448222
2448478
2448734
2448990
2449246
2441311
2441567
2441823
2442079
2442335
2442591
2442847
2443103
2443359
2443615
2443871
2444127
2444383
2444639
2444895
2445151
2445407
2445663
2445919
2446175
2446431
2446687
2446943
2447199
2447455
2447711
2447967
2448223
2448479
2448735
2448991
2449247
