532480
532736
532992
533248
533504
533760
534016
534272
532481
532737
532993
533249
533505
533761
534017
534273
532482
532738
532994
533250
533506
533762
534018
534274
532483
532739
532995
533251
533507
533763
534019
534275
532484
532740
532996
533252
533508
533764
534020
534276
532485
532741
532997
533253
533509
533765
534021
534277
532486
532742
532998
533254
533510
533766
534022
534278
532487
532743
532999
533255
533511
533767
534023
534279
542808
543064
543320
543576
543832
544088
544344
544600
542809
543065
543321
543577
543833
544089
544345
544601
542810
543066
543322
543578
543834
544090
544346
544602
542811
543067
543323
543579
543835
544091
544347
544603
542812
543068
543324
543580
543836
544092
544348
544604
542813
543069
543325
543581
543837
544093
544349
544605
542814
543070
543326
543582
543838
544094
544350
544606
542815
543071
543327
543583
543839
544095
544351
544607
