0 0 1.0 1.0 1.0
0 1 31.7477470829 0.0106886113063 2.94690275192
0 2 0.5 1.0 2.0
1 0 1.0 0.5 2.0
1 1 0.629590232362 0.907105028629 1.75099301338
1 2 1.0 0.0 0.0
2 0 1.0 1.0 1.0
2 1 0.724832725087 0.870788395405 1.58434426785
2 2 1.0 1.0 1.0
3 0 1.0 1.0 1.0
3 1 0.638070677407 0.910254955292 1.72174239159
3 2 1.0 0.5 2.0
4 0 1.0 1.0 1.0
4 1 0.800667976709 0.796359479427 1.56833338737
4 2 0.333333333333 1.0 3.0
5 0 1.0 0.0 0.0
5 1 0.613796438497 0.886426568031 1.83794641495
5 2 1.0 1.0 1.0
6 0 1.0 1.0 1.0
6 1 0.591494074277 0.869053483009 1.94537389278
6 2 0.4 1.0 2.5
7 0 0.5 1.0 2.0
7 1 0.70625440272 0.811243772507 1.74536979198
7 2 0.666666666667 1.0 1.5
8 0 0.5 1.0 2.0
8 1 0.385808465408 0.963196754456 2.69099712372
8 2 2.0 0.5 1.0
9 0 1.0 0.0 0.0
9 1 0.76799807813 0.815141022205 1.59737586975
9 2 1.0 0.0 0.0
10 0 1.0 0.0 0.0
10 1 0.694304976435 0.845351219177 1.70377612114
10 2 1.0 0.0 0.0
11 0 1.0 0.0 0.0
11 1 0.700338180049 0.846945226192 1.68591964245
11 2 1.0 0.0 0.0
12 0 1.0 0.0 0.0
12 1 1.1467437122 0.628070533276 1.38843393326
12 2 1.0 0.0 0.0
13 0 1.0 1.0 1.0
13 1 0.710902356825 0.872162640095 1.61284470558
13 2 0.5 1.0 2.0
14 0 1.0 1.0 1.0
14 1 0.938670371542 0.731264531612 1.45684182644
14 2 0.25 1.0 4.0
15 0 1.0 1.0 1.0
15 1 1.36951666733 0.535346329212 1.36394822598
15 2 0.5 1.0 2.0
16 0 1.0 1.0 1.0
16 1 0.534689958711 0.920597910881 2.03155231476
16 2 0.5 1.0 2.0
17 0 2.0 0.5 1.0
17 1 0.604989736186 0.903742194176 1.82897365093
17 2 0.5 1.0 2.0
18 0 1.0 1.0 1.0
18 1 0.838642417514 0.772297918797 1.54396808147
18 2 0.5 1.0 2.0
19 0 2.0 0.5 1.0
19 1 0.77291699088 0.813908040524 1.58961451054
19 2 0.5 1.0 2.0
20 0 1.0 1.0 1.0
20 1 0.658671574257 0.874509811401 1.73606657982
20 2 1.0 0.0 0.0
21 0 1.0 0.5 2.0
21 1 0.524493798254 0.924513816833 2.06227326393
21 2 1.0 0.0 0.0
22 0 0.5 1.0 2.0
22 1 0.513648037723 0.946129024029 2.05770921707
22 2 1.0 0.0 0.0
23 0 1.0 1.0 1.0
23 1 0.626647126574 0.904789745808 1.76371848583
23 2 1.0 0.0 0.0
24 0 0.5 1.0 2.0
24 1 0.730644973043 0.804478049278 1.70129406452
24 2 1.0 0.0 0.0
25 0 0.666666666667 1.0 1.5
25 1 2.36018951612 0.350933134556 1.20733761787
25 2 1.0 0.0 0.0
26 0 1.0 1.0 1.0
26 1 1.0 0.0 0.0
26 2 0.25 1.0 4.0
27 0 0.5 1.0 2.0
27 1 0.783064699439 0.80039203167 1.59551024437
27 2 1.0 0.0 0.0
28 0 0.333333333333 1.0 3.0
28 1 0.818618253415 0.801631808281 1.52385497093
28 2 1.0 0.0 0.0
29 0 0.333333333333 1.0 3.0
29 1 0.619178086641 0.930905401707 1.7349177599
29 2 1.0 0.0 0.0
30 0 0.5 1.0 2.0
30 1 0.392248078834 0.958185970783 2.66066002846
30 2 1.0 0.0 0.0
31 0 0.5 1.0 2.0
31 1 0.219045623573 0.986402392387 4.6281914711
31 2 1.0 0.0 0.0
32 0 1.0 0.0 0.0
32 1 0.648913550836 0.893524885178 1.72467195988
32 2 1.0 0.0 0.0
33 0 1.0 1.0 1.0
33 1 0.666393603848 0.910878896713 1.64743590355
33 2 1.0 0.0 0.0
34 0 1.0 1.0 1.0
34 1 0.878986443235 0.803543806076 1.41582083702
34 2 1.0 0.0 0.0
35 0 1.0 1.0 1.0
35 1 0.594797360959 0.913238227367 1.84097075462
35 2 1.0 0.0 0.0
36 0 1.0 1.0 1.0
36 1 16.6766557657 0.0174973998219 3.42702698708
36 2 0.2 1.0 5.0
37 0 1.0 1.0 1.0
37 1 0.878438219053 0.786794900894 1.44686245918
37 2 0.333333333333 1.0 3.0
38 0 1.0 0.0 0.0
38 1 0.380461032012 0.949526488781 2.76810598373
38 2 0.5 1.0 2.0
39 0 1.0 0.0 0.0
39 1 0.643138410636 0.925170063972 1.68063724041
39 2 2.0 0.25 2.0
40 0 1.0 0.0 0.0
40 1 0.797412570448 0.80922794342 1.5496942997
40 2 1.20000002861 0.833333313465 1.0
41 0 1.0 0.0 0.0
41 1 0.649988303693 0.926263988018 1.66096198559
41 2 1.0 0.714285731316 1.39999997616
42 0 1.0 0.0 0.0
42 1 1.0 0.0 0.0
42 2 1.0 0.714285731316 1.39999997616
43 0 0.5 1.0 2.0
43 1 0.652038525937 0.864948928356 1.77311253548
43 2 1.33333333333 0.625 1.20000004768
44 0 0.749999977648 1.0 1.33333337307
44 1 0.666392280388 0.854372501373 1.75639724731
44 2 1.09999996722 0.727272748947 1.25
45 0 1.0 1.0 1.0
45 1 0.599019587121 0.898663401604 1.85764157772
45 2 1.09999996722 0.727272748947 1.25
46 0 1.20000002861 0.5 1.66666662693
46 1 0.650931075136 0.870368421078 1.76506972313
46 2 0.52380953273 0.818181812763 2.33333325386
47 0 1.0 0.75 1.33333337307
47 1 1.40446261266 0.541075944901 1.31592643261
47 2 0.624999990687 0.800000011921 2.0
48 0 1.0 1.0 1.0
48 1 0.588666727204 0.854115664959 1.98890411854
48 2 0.636363650156 0.857142865658 1.83333337307
49 0 0.5 1.0 2.0
49 1 0.841142314414 0.726684331894 1.6360052824
49 2 0.933333363003 0.642857134342 1.66666662693
50 0 2.99999991059 0.333333343267 1.0
50 1 0.926798807314 0.712939441204 1.51342844963
50 2 0.736842133002 0.714285731316 1.89999997616
51 0 1.0 0.5 2.0
51 1 0.556877664279 0.938119649887 1.91417634487
51 2 0.769230797446 0.899999976158 1.44444441795
52 0 2.99999991059 0.333333343267 1.0
52 1 0.399608842358 0.933007061481 2.68213105202
52 2 1.4999999553 0.416666656733 1.60000002384
53 0 1.0 0.0 0.0
53 1 1.0 0.0 0.0
53 2 1.0 0.0 0.0
