0 0 1.0 0.0 0.0
0 1 2.67479676223 0.337386012077 1.10810816288
0 2 1.0 0.0 0.0
1 0 1.0 0.0 0.0
1 1 0.652806658955 0.955413997173 1.603333354
1 2 1.0 0.0 0.0
2 0 1.0 0.0 0.0
2 1 0.707482979428 0.929487168789 1.52068960667
2 2 1.0 0.0 0.0
3 0 1.0 0.0 0.0
3 1 0.567028978772 0.932907342911 1.89041090012
3 2 1.0 0.0 0.0
4 0 1.0 0.0 0.0
4 1 0.67484661787 0.942424237728 1.57234728336
4 2 1.0 0.0 0.0
5 0 1.0 0.0 0.0
5 1 0.595588252 0.959876537323 1.74919617176
5 2 1.0 0.0 0.0
6 0 1.0 0.0 0.0
6 1 0.537216828064 0.966867446899 1.92523360252
6 2 1.0 0.0 0.0
7 0 1.0 0.0 0.0
7 1 0.589189176281 0.935779809952 1.8137254715
7 2 1.0 0.0 0.0
8 0 1.0 0.0 0.0
8 1 0.467224525438 0.961194038391 2.22670817375
8 2 1.0 0.0 0.0
9 0 1.0 0.0 0.0
9 1 0.623574136573 0.963414609432 1.66455698013
9 2 1.0 0.0 0.0
10 0 1.0 0.0 0.0
10 1 0.580589265082 0.955223858356 1.80312502384
10 2 1.0 0.0 0.0
11 0 1.0 0.0 0.0
11 1 0.58885015685 0.964497029781 1.76073622704
11 2 1.0 0.0 0.0
12 0 1.0 0.0 0.0
12 1 0.678000009376 0.941002964973 1.56739807129
12 2 1.0 0.0 0.0
13 0 1.0 0.0 0.0
13 1 0.624074093086 0.958456993103 1.67182660103
13 2 1.0 0.0 0.0
14 0 1.0 0.0 0.0
14 1 0.64380950422 0.928994059563 1.67197453976
14 2 1.0 0.0 0.0
15 0 1.0 0.0 0.0
15 1 0.664670633536 0.948948919773 1.58544301987
15 2 1.0 0.0 0.0
16 0 1.0 0.0 0.0
16 1 0.53269536447 0.976047933102 1.92331290245
16 2 1.0 0.0 0.0
17 0 1.0 0.0 0.0
17 1 0.562706278818 0.961876809597 1.84756100178
17 2 1.0 0.0 0.0
18 0 1.0 0.0 0.0
18 1 0.651923092018 0.923303842545 1.66134190559
18 2 1.0 0.0 0.0
19 0 1.0 0.0 0.0
19 1 0.640232115403 0.942598164082 1.65705132484
19 2 1.0 0.0 0.0
20 0 1.0 0.0 0.0
20 1 0.62056074711 0.948795199394 1.69841265678
20 2 1.0 0.0 0.0
21 0 1.0 0.0 0.0
21 1 0.586086949353 0.925815999508 1.84294867516
21 2 1.0 0.0 0.0
22 0 1.0 0.0 0.0
22 1 0.504451030724 0.82647061348 2.39857649803
22 2 1.0 1.0 1.0
23 0 1.0 0.0 0.0
23 1 0.635574852759 0.962457358837 1.63475179672
23 2 1.0 1.0 1.0
24 0 1.0 0.0 0.0
24 1 0.652838411635 0.929765880108 1.64748203754
24 2 1.0 1.0 1.0
25 0 1.0 0.0 0.0
25 1 0.701388863341 0.960396051407 1.48453605175
25 2 0.5 1.0 2.0
26 0 1.0 0.0 0.0
26 1 1.0 0.0 0.0
26 2 0.5 1.0 2.0
27 0 1.0 0.0 0.0
27 1 0.638429741059 0.948220074177 1.65187716484
27 2 0.5 1.0 2.0
28 0 1.0 0.0 0.0
28 1 0.72524751341 0.92150169611 1.49629628658
28 2 0.5 1.0 2.0
29 0 1.0 0.0 0.0
29 1 0.624999990687 0.970909118652 1.64794003963
29 2 0.5 1.0 2.0
30 0 1.0 0.0 0.0
30 1 0.518987355086 0.954268276691 2.0191693306
30 2 1.0 1.0 1.0
31 0 1.0 0.0 0.0
31 1 0.273255810923 0.981762945652 3.72755408287
31 2 0.5 1.0 2.0
32 0 1.0 0.0 0.0
32 1 0.694805175443 0.922118365765 1.56081080437
32 2 1.0 1.0 1.0
33 0 1.0 0.0 0.0
33 1 0.604508203219 0.955932199955 1.73049640656
33 2 0.5 1.0 2.0
34 0 1.0 1.0 1.0
34 1 0.67586206452 0.948979616165 1.55913972855
34 2 1.4999999553 0.666666686535 1.0
35 0 1.0 0.0 0.0
35 1 0.689427295759 0.923322677612 1.57093429565
35 2 2.99999991059 0.333333343267 1.0
36 0 1.0 0.0 0.0
36 1 1.85714276226 0.396923065186 1.35658919811
36 2 0.666666666667 1.0 1.5
37 0 1.0 0.0 0.0
37 1 0.676789590653 0.916666686535 1.61188817024
37 2 1.0 1.0 1.0
38 0 1.0 0.0 0.0
38 1 0.591254771879 0.942122161388 1.79522180557
38 2 0.8 1.0 1.25
39 0 1.0 1.0 1.0
39 1 0.625754526713 0.971061110497 1.64569532871
39 2 1.0 0.75 1.33333337307
40 0 1.0 1.0 1.0
40 1 0.691331945495 0.902140676975 1.6033898592
40 2 0.749999977648 0.666666686535 2.0
41 0 1.0 1.0 1.0
41 1 0.648915207364 0.945288777351 1.63022506237
41 2 2.99999991059 0.333333343267 1.0
42 0 1.0 1.0 1.0
42 1 0.584392025898 0.937888205051 1.82450330257
42 2 2.0 0.5 1.0
43 0 0.5 1.0 2.0
43 1 0.602968448376 0.959999978542 1.72756409645
43 2 2.0 0.5 1.0
44 0 2.0 0.5 1.0
44 1 0.661885257866 0.916408658028 1.64864861965
44 2 0.5 1.0 2.0
45 0 1.0 1.0 1.0
45 1 0.611214952318 0.938837945461 1.74267101288
45 2 2.0 0.5 1.0
46 0 1.0 0.5 2.0
46 1 0.563670419157 0.980066418648 1.81016945839
46 2 1.0 1.0 1.0
47 0 0.5 1.0 2.0
47 1 0.741116762929 0.88356167078 1.52713179588
47 2 1.0 1.0 1.0
48 0 1.0 1.0 1.0
48 1 0.646799108487 0.92150169611 1.67777776718
48 2 1.0 1.0 1.0
49 0 0.333333333333 1.0 3.0
49 1 2.17021275495 0.31699347496 1.45360827446
49 2 0.5 1.0 2.0
50 0 1.0 1.0 1.0
50 1 0.807692278066 0.805194795132 1.53763437271
50 2 0.5 1.0 2.0
51 0 1.0 0.5 2.0
51 1 0.611764692155 0.975961565971 1.67487680912
51 2 1.0 1.0 1.0
52 0 2.0 0.5 1.0
52 1 0.587570602474 0.927884638309 1.83419692516
52 2 2.0 0.5 1.0
53 0 1.0 0.0 0.0
53 1 1.0 0.0 0.0
53 2 1.0 0.0 0.0
