0 0 1.0 0.0 0.0
0 1 0.767014757746 0.904616594315 1.44122481346
0 2 1.0 0.666666686535 1.5
1 0 1.0 0.0 0.0
1 1 0.685044419722 0.932723879814 1.5650498867
1 2 1.0 1.0 1.0
2 0 1.0 0.0 0.0
2 1 0.720076479833 0.918566524982 1.51185715199
2 2 0.749999977648 0.666666686535 2.0
3 0 1.0 0.0 0.0
3 1 0.63011545796 0.930609703064 1.70534515381
3 2 2.0 0.5 1.0
4 0 1.0 0.0 0.0
4 1 0.717754696105 0.904484629631 1.54036188126
4 2 1.0 0.0 0.0
5 0 1.0 1.0 1.0
5 1 0.65310017136 0.930337250233 1.64581036568
5 2 2.0 0.5 1.0
6 0 2.0 0.5 1.0
6 1 0.611549947317 0.927620708942 1.76277804375
6 2 1.0 0.0 0.0
7 0 0.5 1.0 2.0
7 1 0.761537482486 0.858127176762 1.53023123741
7 2 2.0 0.5 1.0
8 0 2.0 0.5 1.0
8 1 0.730127700419 0.897322177887 1.52634525299
8 2 0.666666666667 0.5 3.0
9 0 1.0 1.0 1.0
9 1 0.730050814398 0.909068048 1.50678229332
9 2 1.0 0.0 0.0
10 0 1.0 0.0 0.0
10 1 2.07463417994 0.398098260164 1.21078824997
10 2 1.0 0.0 0.0
11 0 1.0 1.0 1.0
11 1 0.746929068964 0.892851173878 1.49948310852
11 2 1.0 0.0 0.0
12 0 1.0 0.0 0.0
12 1 0.587144209608 0.955637693405 1.78222262859
12 2 1.0 0.0 0.0
13 0 1.0 0.0 0.0
13 1 0.916849183448 0.818286657333 1.33289706707
13 2 1.0 0.0 0.0
14 0 1.0 0.0 0.0
14 1 0.775088172825 0.882376015186 1.46216094494
14 2 1.0 0.0 0.0
15 0 1.0 0.0 0.0
15 1 0.678884954821 0.916699290276 1.60685586929
15 2 1.0 0.0 0.0
16 0 1.0 0.0 0.0
16 1 0.717865687035 0.908018708229 1.53412950039
16 2 1.0 0.0 0.0
17 0 1.0 0.0 0.0
17 1 0.629435329082 0.950467824936 1.6715195179
17 2 1.0 0.0 0.0
18 0 1.0 0.0 0.0
18 1 0.59107721299 0.951349258423 1.77834415436
18 2 1.0 0.0 0.0
19 0 1.0 0.0 0.0
19 1 0.862672457712 0.844947338104 1.37190616131
19 2 1.0 1.0 1.0
20 0 1.0 0.0 0.0
20 1 0.709177964391 0.920527696609 1.53182053566
20 2 1.0 0.0 0.0
21 0 1.0 0.0 0.0
21 1 0.75902894407 0.884455621243 1.48958611488
21 2 1.0 0.0 0.0
22 0 1.0 0.0 0.0
22 1 0.773507392463 0.885390639305 1.46016061306
22 2 1.0 0.0 0.0
23 0 1.0 0.0 0.0
23 1 0.6720187139 0.935368895531 1.59087371826
23 2 1.0 1.0 1.0
24 0 1.0 0.0 0.0
24 1 0.677463189231 0.90710735321 1.62725508213
24 2 1.0 1.0 1.0
25 0 1.0 0.0 0.0
25 1 0.712708477396 0.935398817062 1.5
25 2 2.0 0.5 1.0
26 0 1.0 0.0 0.0
26 1 1.42798355521 0.577459275723 1.21270573139
26 2 0.666666666667 1.0 1.5
27 0 1.0 0.0 0.0
27 1 0.700652884651 0.910579800606 1.56739711761
27 2 2.0 0.5 1.0
28 0 1.0 0.0 0.0
28 1 0.866146761586 0.831679522991 1.38820147514
28 2 1.0 0.5 2.0
29 0 1.0 0.0 0.0
29 1 0.645114175703 0.957811951637 1.6183899641
29 2 1.0 0.5 2.0
30 0 1.0 0.0 0.0
30 1 4.53889092545 0.181698918343 1.21254515648
30 2 0.5 1.0 2.0
31 0 1.0 1.0 1.0
31 1 0.690854598001 0.887516498566 1.63093590736
31 2 1.0 1.0 1.0
32 0 1.0 1.0 1.0
32 1 1.30317299937 0.53785431385 1.42670202255
32 2 0.333333333333 1.0 3.0
33 0 0.5 1.0 2.0
33 1 0.564036839398 0.972982943058 1.82216334343
33 2 1.0 0.0 0.0
34 0 1.0 0.0 0.0
34 1 0.763982006741 0.913763463497 1.4324618578
34 2 0.666666666667 1.0 1.5
35 0 1.0 0.0 0.0
35 1 1.88348773835 0.395821392536 1.34133720398
35 2 1.0 1.0 1.0
36 0 1.0 0.0 0.0
36 1 0.612521580547 0.951173007488 1.71640229225
36 2 1.0 1.0 1.0
37 0 1.0 0.0 0.0
37 1 0.839061839217 0.875514149666 1.36126554012
37 2 1.0 1.0 1.0
38 0 1.0 0.0 0.0
38 1 0.857701850786 0.834838449955 1.3965651989
38 2 1.0 0.666666686535 1.5
39 0 2.0 0.333333343267 1.5
39 1 0.729444427633 0.931793153286 1.47125601768
39 2 1.39999996662 0.571428596973 1.25
40 0 1.0 0.75 1.33333337307
40 1 0.965536594212 0.79224562645 1.30728840828
40 2 1.0 1.0 1.0
41 0 1.0 1.0 1.0
41 1 1.72909134776 0.51735496521 1.11787545681
41 2 0.636363650156 0.857142865658 1.83333337307
42 0 2.49999996275 0.40000000596 1.0
42 1 0.634712648775 0.93403583765 1.68678343296
42 2 1.6 0.625 1.0
43 0 0.666666666667 1.0 1.5
43 1 0.770141320972 0.874243140221 1.48524236679
43 2 2.33333331015 0.428571432829 1.0
44 0 1.0 1.0 1.0
44 1 0.768085697061 0.874262690544 1.48918402195
44 2 1.16666665508 0.714285731316 1.20000004768
45 0 1.0 1.0 1.0
45 1 0.710490932453 0.903783798218 1.55731654167
45 2 0.77777778808 0.857142865658 1.5
46 0 0.333333333333 0.5 6.0
46 1 1.42560469307 0.524078845978 1.3384565115
46 2 1.16666665508 0.857142865658 1.0
47 0 1.0 0.0 0.0
47 1 1.00842541601 0.756312668324 1.31115746498
47 2 1.16666665508 0.714285731316 1.20000004768
48 0 1.0 0.0 0.0
48 1 1.06162200744 0.686397314072 1.37231719494
48 2 0.666666666667 1.0 1.5
49 0 2.0 0.5 1.0
49 1 0.942035547698 0.751453459263 1.41263699532
49 2 1.16666665508 0.571428596973 1.5
50 0 0.749999977648 0.666666686535 2.0
50 1 0.915587689272 0.799265384674 1.36649811268
50 2 1.24999998137 0.800000011921 1.0
51 0 4.49999996647 0.111111111939 2.0
51 1 0.700427941476 0.898574352264 1.58884859085
51 2 1.4999999553 0.5 1.33333337307
52 0 8.99999993294 0.111111111939 1.0
52 1 6.40976646794 0.123992495239 1.25823688507
52 2 4.0 0.166666671634 1.5
53 0 1.0 0.0 0.0
53 1 1.0 0.0 0.0
53 2 1.0 0.0 0.0
