0 0 1.0 1.0 1.0
0 1 1.20220485703 0.690878391266 1.20398187637
0 2 0.692307705005 0.888888895512 1.625
1 0 1.0 1.0 1.0
1 1 0.626414511034 0.937886655331 1.70211076736
1 2 0.692307705005 1.0 1.44444441795
2 0 0.749999977648 1.0 1.33333337307
2 1 0.631030187431 0.939334154129 1.68705701828
2 2 2.49999996275 0.40000000596 1.0
3 0 0.749999977648 1.0 1.33333337307
3 1 0.606444867653 0.916359186172 1.79946303368
3 2 1.0 1.0 1.0
4 0 1.0 1.0 1.0
4 1 0.649858188879 0.909553825855 1.69181549549
4 2 0.636363650156 0.714285731316 2.20000004768
5 0 0.749999977648 1.0 1.33333337307
5 1 0.596830722744 0.940515697002 1.7814874649
5 2 0.727272727273 0.75 1.83333337307
6 0 1.4999999553 0.666666686535 1.0
6 1 0.546613114454 0.935377597809 1.95583856106
6 2 0.545454533632 1.0 1.83333337307
7 0 1.4999999553 0.666666686535 1.0
7 1 0.661440967873 0.878214836121 1.72150444984
7 2 0.349999991655 1.0 2.85714292526
8 0 0.5 1.0 2.0
8 1 1.44257111237 0.547114670277 1.26702272892
8 2 0.749999977648 0.833333313465 1.60000002384
9 0 0.666666666667 1.0 1.5
9 1 0.646151333881 0.915417850018 1.69062149525
9 2 0.636363650156 0.857142865658 1.83333337307
10 0 0.600000014305 1.0 1.66666662693
10 1 0.589290995502 0.929776012897 1.82512176037
10 2 0.545454533632 1.0 1.83333337307
11 0 2.0 0.5 1.0
11 1 0.596963832008 0.931189239025 1.79892909527
11 2 1.0 1.0 1.0
12 0 1.33333333333 0.25 3.0
12 1 0.661142674068 0.904750525951 1.67176783085
12 2 2.99999991059 0.333333343267 1.0
13 0 0.5 1.0 2.0
13 1 0.646341466234 0.9190351367 1.68347191811
13 2 1.24999998137 0.600000023842 1.33333337307
14 0 0.666666666667 1.0 1.5
14 1 0.717975176019 0.883932828903 1.57569181919
14 2 0.624999990687 1.0 1.60000002384
15 0 0.571428571429 1.0 1.75
15 1 0.764673618421 0.852223813534 1.53451180458
15 2 2.0 0.5 1.0
16 0 0.8 1.0 1.25
16 1 0.554549085044 0.953879415989 1.89045584202
16 2 0.77777778808 0.857142865658 1.5
17 0 0.444444444444 1.0 2.25
17 1 0.581024940149 0.945172846317 1.82093322277
17 2 0.600000014305 1.0 1.66666662693
18 0 0.8 0.75 1.66666662693
18 1 0.709294414821 0.886178851128 1.59093368053
18 2 0.749999977648 0.833333313465 1.60000002384
19 0 0.600000014305 1.0 1.66666662693
19 1 0.669583202694 0.91518175602 1.6318795681
19 2 0.666666666667 0.875 1.71428573132
20 0 1.33333333333 0.5 1.5
20 1 0.652241115472 0.918957352638 1.66838574409
20 2 2.24999998324 0.444444447756 1.0
21 0 0.4 1.0 2.5
21 1 0.578447576609 0.927670717239 1.86355471611
21 2 0.636363650156 1.0 1.57142853737
22 0 0.8 1.0 1.25
22 1 0.586168447487 0.943625092506 1.80791532993
22 2 1.0 0.777777791023 1.28571426868
23 0 0.444444444444 1.0 2.25
23 1 0.598126874849 0.939264535904 1.7799949646
23 2 0.583333327538 1.0 1.71428573132
24 0 4.0 0.25 1.0
24 1 0.613391557922 0.917180836201 1.77749025822
24 2 1.28571426382 0.666666686535 1.16666662693
25 0 0.666666666667 1.0 1.5
25 1 0.650914154619 0.943108797073 1.62897527218
25 2 1.0 1.0 1.0
26 0 0.600000014305 1.0 1.66666662693
26 1 0.818181827049 0.837552726269 1.45927786827
26 2 0.874999960884 0.857142865658 1.33333337307
27 0 1.0 1.0 1.0
27 1 0.611232365862 0.926446080208 1.76593005657
27 2 1.39999996662 0.571428596973 1.25
28 0 2.99999991059 0.333333343267 1.0
28 1 0.64293675411 0.915531337261 1.69886362553
28 2 0.5 0.833333313465 2.40000009537
29 0 1.0 1.0 1.0
29 1 0.598687151683 0.956391751766 1.74648249149
29 2 1.0 1.0 1.0
30 0 1.0 1.0 1.0
30 1 0.489964573012 0.963132500648 2.11908936501
30 2 1.0 1.0 1.0
31 0 2.0 0.5 1.0
31 1 0.976476059271 0.586679279804 1.74557161331
31 2 1.33333333333 0.75 1.0
32 0 1.0 0.0 0.0
32 1 0.646733135755 0.932240724564 1.65861976147
32 2 0.71428572645 0.40000000596 3.5
33 0 0.600000014305 1.0 1.66666662693
33 1 0.694052045994 0.922603130341 1.56168365479
33 2 1.0 0.0 0.0
34 0 1.0 0.0 0.0
34 1 0.63884646764 0.941317021847 1.66290545464
34 2 0.749999977648 1.0 1.33333337307
35 0 1.0 0.0 0.0
35 1 0.616981123055 0.93299973011 1.73718714714
35 2 0.818181827049 0.888888895512 1.375
36 0 0.749999977648 1.0 1.33333337307
36 1 2.1746539484 0.36973553896 1.24370861053
36 2 0.705882372741 0.916666686535 1.54545450211
37 0 1.0 0.0 0.0
37 1 0.656653144986 0.930395722389 1.63680243492
37 2 0.937499951106 0.866666674614 1.23076927662
38 0 1.0 0.0 0.0
38 1 2.45335705793 0.32380720973 1.25878834724
38 2 0.84615388495 0.909090936184 1.29999995232
39 0 0.600000014305 1.0 1.66666662693
39 1 0.645937288871 0.955310344696 1.62056016922
39 2 4.0 0.20000000298 1.25
40 0 1.33333333333 0.75 1.0
40 1 0.742129227466 0.896763145924 1.50259780884
40 2 0.882352947364 0.933333337307 1.21428573132
41 0 1.20000002861 0.833333313465 1.0
41 1 0.654803110417 0.959738314152 1.59124279022
41 2 4.74999996461 0.157894730568 1.33333337307
42 0 0.77777778808 0.857142865658 1.5
42 1 0.573015442562 0.947754144669 1.84135699272
42 2 0.760000007248 0.842105269432 1.5625
43 0 0.874999960884 0.857142865658 1.33333337307
43 1 0.632126677806 0.916010499001 1.72701227665
43 2 0.809523818715 0.941176474094 1.3125
44 0 0.5 1.0 2.0
44 1 0.674317108479 0.89813041687 1.65118765831
44 2 0.857142886337 0.833333313465 1.39999997616
45 0 0.749999977648 1.0 1.33333337307
45 1 0.609526599715 0.93801254034 1.74903571606
45 2 0.937499951106 0.800000011921 1.33333337307
46 0 0.83333330022 1.0 1.20000004768
46 1 0.668802299212 0.918573737144 1.62775206566
46 2 1.0 0.0 0.0
47 0 1.0 0.600000023842 1.66666662693
47 1 0.809698301137 0.861857891083 1.43298327923
47 2 5.49999983609 0.181818187237 1.0
48 0 1.20000002861 0.833333313465 1.0
48 1 0.588777746544 0.913459002972 1.85934317112
48 2 0.666666666667 1.0 1.5
49 0 0.41666665011 1.0 2.40000009537
49 1 4.6268155353 0.135233029723 1.59821426868
49 2 2.79999993324 0.357142865658 1.0
50 0 0.333333333333 1.0 3.0
50 1 0.793765024543 0.853474318981 1.47610616684
50 2 0.77777778808 0.714285731316 1.79999995232
51 0 1.4999999553 0.666666686535 1.0
51 1 0.623752232757 0.954452216625 1.67970764637
51 2 1.0 0.714285731316 1.39999997616
52 0 5.99999982119 0.166666671634 1.0
52 1 0.510115027831 0.941679656506 2.08175063133
52 2 2.24999998324 0.444444447756 1.0
53 0 1.0 0.0 0.0
53 1 1.0 0.0 0.0
53 2 1.0 0.0 0.0
