2116
3140
3396
3908
4420
5188
7748
1093
2117
3141
3397
3909
4421
5189
7749
1094
2118
3142
3398
3910
4422
5190
7750
1095
2119
3143
3399
3911
4423
5191
7751
1096
2120
3144
3400
3912
4424
5192
7752
1097
2121
3145
3401
3913
4425
5193
7753
1098
2122
3146
3402
3914
4426
5194
7754
1099
2123
3147
3403
3915
4427
5195
7755
1100
2124
3148
3404
3916
4428
5196
7756
1101
2125
3149
3405
3917
4429
5197
7757
1102
2126
3150
3406
3918
4430
5198
7758
1103
2127
3151
3407
3919
4431
5199
7759
1104
2128
3152
3408
3920
4432
5200
7760
1105
2129
3153
3409
3921
4433
5201
7761
1106
2130
3154
3410
3922
4434
5202
7762
1107
2131
3155
3411
3923
4435
5203
7763
1108
2132
3156
3412
3924
4436
5204
7764
1109
2133
3157
3413
3925
4437
5205
7765
1110
2134
3158
3414
3926
4438
5206
7766
1111
2135
3159
3415
3927
4439
5207
7767
1112
2136
3160
3416
3928
4440
5208
7768
1113
2137
3161
3417
3929
4441
5209
7769
1114
2138
3162
3418
3930
4442
5210
7770
1115
2139
3163
3419
3931
4443
5211
7771
5632
5888
14080
14336
21504
21760
5727
5983
14175
14431
21599
21855
67653
68677
69445
69957
70725
71237
72773
67654
68678
69446
69958
70726
71238
72774
67655
68679
69447
69959
70727
71239
72775
67656
68680
69448
69960
70728
71240
72776
67657
68681
69449
69961
70729
71241
72777
67658
68682
69450
69962
70730
71242
72778
67659
68683
69451
69963
70731
71243
72779
67660
68684
69452
69964
70732
71244
72780
67661
68685
69453
69965
70733
71245
72781
67662
68686
69454
69966
70734
71246
72782
67663
68687
69455
69967
70735
71247
72783
67664
68688
69456
69968
70736
71248
72784
67665
68689
69457
69969
70737
71249
72785
67666
68690
69458
69970
70738
71250
72786
73042
67667
68691
69459
69971
70739
71251
72787
73043
67668
68692
69460
69972
70740
71252
72788
73044
67669
68693
69461
69973
70741
71253
72789
73045
67670
68694
69462
69974
70742
71254
72790
73046
67671
68695
69463
69975
70743
71255
72791
73047
67673
68697
69465
69977
70745
71257
72793
73049
69466
69978
70746
71258
72794
73050
67675
68699
68955
69467
69979
70747
71259
72795
73051
71168
71424
79616
79872
87040
87296
71263
71519
79711
79967
87135
87391
131909
132165
133957
134725
134981
136261
138821
139077
131910
132166
133958
134726
134982
136262
138822
139078
131911
132167
133959
134727
134983
136263
138823
139079
131912
132168
133960
134728
134984
136264
138824
139080
131913
132169
133961
134729
134985
136265
138825
139081
131914
132170
133962
134730
134986
136266
138826
139082
131915
132171
133963
134731
134987
136267
138827
139083
131916
132172
133964
134732
134988
136268
138828
139084
131917
132173
133965
134733
134989
136269
138829
139085
131918
132174
133966
134734
134990
136270
138830
131919
132175
133967
134735
134991
136271
138831
139087
131920
132176
133968
134736
134992
136272
138832
131921
132177
133969
134737
134993
136273
138833
131922
132178
133970
134738
134994
136274
138834
131923
132179
133971
134739
134995
136275
138835
139091
131924
132180
133972
134740
134996
136276
138836
139092
131925
132181
133973
134741
134997
136277
138837
139093
131926
132182
133974
134742
134998
136278
138838
139094
131927
132183
133975
134743
134999
136279
138839
139095
131928
132184
133976
134744
135000
136280
138840
139096
131929
132185
133977
134745
135001
136281
138841
139097
131930
132186
133978
134746
135002
136282
138842
139098
133979
134747
135003
136283
138843
136704
136960
145152
145408
152576
152832
136799
137055
145247
145503
152671
152927
199492
200260
200516
200772
202564
204356
197445
197701
199493
200261
200517
200773
202565
204357
197446
197702
199494
200262
200518
200774
202566
204358
197447
197703
199495
200263
200519
200775
202567
204359
197448
197704
199496
200264
200520
200776
202568
204360
197449
197705
199497
200265
200521
200777
202569
204361
197450
197706
199498
200266
200522
200778
202570
204362
197451
197707
199499
200267
200523
200779
202571
204363
197452
197708
199500
200268
200524
200780
202572
204364
197453
197709
199501
200269
200525
200781
202573
204365
197454
197710
199502
200270
200526
200782
202574
204366
197455
197711
199503
200271
200527
200783
202575
204367
197456
197712
199504
200272
200528
200784
202576
204368
197457
197713
199505
200273
200529
200785
202577
204369
197458
197714
199506
200274
200530
200786
202578
204370
197459
197715
199507
200275
200531
200787
202579
204371
197460
197716
199508
200276
200532
200788
202580
204372
197461
197717
199509
200277
200533
200789
202581
204373
197462
197718
199510
200278
200534
200790
202582
204374
197464
197720
199512
200280
200536
200792
202584
204376
197465
197721
199513
200281
200537
200793
202585
204377
197466
197722
199514
200282
200538
200794
202586
204378
197467
197723
199515
200283
200539
200795
202587
204379
200796
202240
202496
210688
210944
218112
218368
202335
202591
210783
211039
218207
218463
265285
265797
266053
266821
267077
267333
268101
268869
269893
265286
265798
266054
266822
267078
267334
268102
268870
269894
265287
265799
266055
266823
267079
267335
268103
268871
269895
265288
265800
266056
266824
267080
267336
268104
268872
269896
265289
265801
266057
266825
267081
267337
268105
268873
269897
265290
265802
266058
266826
267082
267338
268106
268874
269898
265291
265803
266059
266827
267083
267339
268107
268875
269899
265292
265804
266060
266828
267084
267340
268108
268876
269900
265293
265805
266061
266829
267085
267341
268109
268877
269901
265294
265806
266062
266830
267086
267342
268110
268878
269902
265295
265807
266063
266831
267087
267343
268111
268879
269903
265296
265808
266064
266832
267088
267344
268112
268880
269904
265298
265810
266066
266834
267090
267346
268114
268882
269906
265299
265811
266067
266835
267091
267347
268115
268883
269907
265300
265812
266068
266836
267092
267348
268116
268884
269908
265301
265813
266069
266837
267093
267349
268117
268885
269909
265302
265814
266070
266838
267094
267350
268118
268886
269910
262744
265304
265816
266072
266840
267096
267352
268120
268888
269912
262745
265305
265817
266073
266841
267097
267353
268121
268889
269913
265306
265818
266074
266842
267098
267354
268122
268890
265307
267099
267355
268123
268891
267776
268032
276224
276480
283648
283904
267871
268127
276319
276575
283743
283999
329796
330308
331332
331588
332356
332868
334916
328517
328773
329797
330309
331333
331589
332357
332869
334917
328518
328774
329798
330310
331334
331590
332358
332870
334918
328519
328775
329799
330311
331335
331591
332359
332871
334919
328520
328776
329800
330312
331336
331592
332360
332872
334920
328521
328777
329801
330313
331337
331593
332361
332873
334921
328522
328778
329802
330314
331338
331594
332362
332874
334922
328523
328779
329803
330315
331339
331595
332363
332875
334923
328524
328780
329804
330316
331340
331596
332364
332876
334924
328525
328781
329805
330317
331341
331597
332365
332877
334925
328526
328782
329806
330318
331342
331598
332366
332878
334926
328527
328783
329807
330319
331343
331599
332367
332879
334927
328528
328784
329808
330320
331344
331600
332368
332880
334928
328529
328785
329809
330321
331345
331601
332369
332881
334929
328530
328786
329810
330322
331346
331602
332370
332882
334930
328531
328787
329811
330323
331347
331603
332371
332883
334931
328532
328788
329812
330324
331348
331604
332372
332884
334932
328533
328789
329813
330325
331349
331605
332373
332885
334933
328534
328790
329814
330326
331350
331606
332374
332886
334934
328535
328791
329815
330327
331351
331607
332375
332887
334935
328536
328792
329816
330328
331352
331608
332376
332888
334936
328537
328793
329817
330329
331353
331609
332377
332889
334937
328283
329563
329819
330331
331355
331611
332379
332891
334939
333312
333568
341760
342016
349184
349440
333407
333663
341855
342111
349279
349535
396356
397124
397636
398404
396357
397125
397637
398405
396358
397126
397638
398406
396359
397127
397639
398407
396360
397128
397640
398408
396361
397129
397641
398409
396362
397130
397642
398410
396363
397131
397643
398411
396364
397132
397644
398412
396365
397133
397645
398413
396366
397134
397646
398414
396367
397135
397647
398415
396368
397136
397648
398416
396369
397137
397649
398417
396370
397138
397650
398418
396371
397139
397651
398419
396372
397140
397652
398420
396373
397141
397653
398421
396374
397142
397654
398422
396375
397143
397655
398423
396376
397144
397656
398424
393817
396377
397145
397657
398425
396378
397146
397658
398426
398848
399104
407296
407552
414720
414976
398943
399199
407391
407647
414815
415071
462148
462404
462660
463940
464708
459589
462149
462405
462661
463941
464709
459590
462150
462406
462662
463942
464710
459591
462151
462407
462663
463943
464711
459592
462152
462408
462664
463944
464712
459593
462153
462409
462665
463945
464713
459594
462154
462410
462666
463946
464714
459595
462155
462411
462667
463947
464715
459596
462156
462412
462668
463948
464716
459597
462157
462413
462669
463949
464717
459598
462158
462414
462670
463950
464718
459599
462159
462415
462671
463951
464719
459600
462160
462416
462672
463952
464720
459601
462161
462417
462673
463953
464721
459602
462162
462418
462674
463954
464722
459603
462163
462419
462675
463955
464723
459604
462164
462420
462676
463956
464724
459605
462165
462421
462677
463957
464725
459606
462166
462422
462678
463958
464726
459607
462167
462423
462679
463959
464727
459608
462168
462424
462680
463960
464728
459609
462169
462425
462681
463961
464729
459610
462170
462426
462682
463962
464730
464384
464640
472832
473088
480256
480512
464479
464735
472927
473183
480351
480607
528196
528452
529988
525381
527685
528197
528453
529989
528198
528454
529990
525383
526407
527687
527943
528199
528455
529991
525384
526408
527688
527944
528200
528456
529992
525385
526409
527689
527945
528201
528457
529993
525386
526410
527690
527946
528202
528458
529994
525387
526411
527691
527947
528203
528459
529995
525388
526412
527692
527948
528204
528460
529996
525389
526413
527693
527949
528205
528461
529997
525390
526414
527694
527950
528206
528462
529998
525391
526415
527695
527951
528207
528463
529999
525392
526416
527696
527952
528208
528464
530000
525393
526417
527697
527953
528209
528465
530001
525394
526418
527698
527954
528210
528466
530002
525395
526419
527699
527955
528211
528467
530003
525396
526420
527700
527956
528212
528468
530004
525397
526421
527701
527957
528213
528469
530005
525398
526422
527702
527958
528214
528470
530006
525399
526423
527703
527959
528215
528471
530007
525400
526424
527704
527960
528216
528472
530008
525401
526425
527705
527961
528217
528473
530009
525402
526426
527706
527962
528218
528474
530010
529920
530176
538368
538624
545792
546048
530015
530271
538463
538719
545887
546143
591941
592965
593221
593477
593733
594245
595013
595269
591942
592966
593222
593478
593734
594246
595014
595270
591943
592967
593223
593479
593735
594247
595015
595271
591944
592968
593224
593480
593736
594248
595016
595272
591945
592969
593225
593481
593737
594249
595017
595273
591946
592970
593226
593482
593738
594250
595018
595274
591947
592971
593227
593483
593739
594251
595019
595275
591948
592972
593228
593484
593740
594252
595020
595276
591949
592973
593229
593485
593741
594253
595021
595277
591950
592974
593230
593486
593742
594254
595022
595278
591951
592975
593231
593487
593743
594255
595023
595279
591952
592976
593232
593488
593744
594256
595024
595280
591953
592977
593233
593489
593745
594257
595025
595281
591954
592978
593234
593490
593746
594258
595026
595282
591955
592979
593235
593491
593747
594259
595027
595283
591956
592980
593236
593492
593748
594260
595028
595284
591961
592985
593241
593497
593753
594265
595033
595289
591962
592986
593242
593498
593754
594266
595034
595290
595456
595712
603904
604160
611328
611584
595551
595807
603999
604255
611423
611679
656708
658500
659268
659780
661316
663108
656709
658501
659269
659781
661317
663109
663365
656710
658502
659270
659782
661318
663110
663366
656711
658503
659271
659783
661319
663111
663367
656712
658504
659272
659784
661320
663112
663368
656713
658505
659273
659785
661321
663113
663369
656714
658506
659274
659786
661322
663114
663370
656715
658507
659275
659787
661323
663115
663371
656716
658508
659276
659788
661324
663116
663372
656717
658509
659277
659789
661325
663117
663373
656718
658510
659278
659790
661326
663118
663374
656719
658511
659279
659791
661327
663119
663375
656720
658512
659280
659792
661328
663120
656721
658513
659281
659793
661329
663121
656722
658514
659282
659794
661330
663122
656724
658516
659284
659796
661332
663124
656725
658517
659285
659797
661333
663125
656726
658518
659286
659798
661334
663126
656730
658522
659290
659802
661338
659804
660992
661248
669440
669696
676864
677120
661087
661343
669535
669791
676959
677215
723780
724036
724804
725316
721733
723781
724037
724805
725317
728901
721734
723782
724038
724806
725318
728902
721735
723783
724039
724807
725319
728903
721736
723784
724040
724808
725320
728904
721737
723785
724041
724809
725321
728905
721738
723786
724042
724810
725322
721739
723787
724043
724811
725323
721740
723788
724044
724812
725324
721741
723789
724045
724813
725325
721743
723791
724047
724815
725327
721744
723792
724048
724816
725328
721746
723794
724050
724818
725330
721747
723795
724051
724819
725331
721748
723796
724052
724820
725332
721750
723798
724054
724822
725334
721752
723800
724056
724824
725336
721753
723801
724057
724825
725337
721754
723802
724058
724826
725338
726528
726784
734976
735232
742400
742656
726623
726879
735071
735327
742495
742751
787269
787525
789317
789573
790341
790853
794181
787270
787526
789318
789574
790342
790854
794182
787271
787527
789319
789575
790343
790855
794183
787272
787528
789320
789576
790344
790856
794184
787273
787529
789321
789577
790345
790857
794185
787274
787530
789322
789578
790346
790858
794186
787275
787531
789323
789579
790347
790859
794187
787276
787532
789324
789580
790348
790860
794188
787277
787533
789325
789581
790349
790861
794189
787278
787534
789326
789582
790350
790862
794190
787280
787536
789328
789584
790352
790864
794192
787281
787537
789329
789585
790353
790865
794193
787282
787538
789330
789586
790354
790866
794194
787283
787539
789331
789587
790355
790867
794195
787284
787540
789332
789588
790356
790868
794196
787285
787541
789333
789589
790357
790869
794197
787286
787542
789334
789590
790358
790870
794198
787287
787543
789335
789591
790359
790871
794199
787288
787544
789336
789592
790360
790872
794200
787289
787545
789337
789593
790361
790873
794201
787291
787547
789339
789595
790363
790875
794203
792064
792320
800512
800768
807936
808192
792159
792415
800607
800863
808031
808287
854084
854596
855620
855876
857156
857412
858692
859204
859716
852805
853061
854085
854597
855621
855877
857157
857413
858693
859205
859717
852806
853062
854086
854598
855622
855878
857158
857414
858694
859206
859718
852807
853063
854087
854599
855623
855879
857159
857415
858695
859207
859719
859975
852808
853064
854088
854600
855624
855880
857160
857416
858696
859208
859720
859976
852809
853065
854089
854601
855625
855881
857161
857417
858697
859209
859721
859977
852810
853066
854090
854602
855626
855882
857162
857418
858698
859210
859722
859978
852811
853067
854091
854603
855627
855883
857163
857419
858699
859211
859723
859979
852812
853068
854092
854604
855628
855884
857164
857420
858700
859212
859724
859980
852813
853069
854093
854605
855629
855885
857165
857421
858701
859213
859725
859981
852814
853070
854094
854606
855630
855886
857166
857422
858702
859214
859726
859982
852815
853071
854095
854607
855631
855887
857167
857423
858703
859215
859727
859983
852816
853072
854096
854608
855632
855888
857168
857424
858704
859216
859728
859984
852817
853073
854097
854609
855633
855889
857169
857425
858705
859217
859729
859985
852818
853074
854098
854610
855634
855890
857170
857426
858706
859218
859730
859986
852819
853075
854099
854611
855635
855891
857171
857427
858707
859219
859731
859987
852820
853076
854100
854612
855636
855892
857172
857428
858708
859220
859732
859988
852821
853077
854101
854613
855637
855893
857173
857429
858709
859221
859733
859989
852822
853078
854102
854614
855638
855894
857174
857430
858710
859222
859734
859990
852823
853079
854103
854615
855639
855895
857175
857431
858711
859223
859735
859991
852824
853080
854104
854616
855640
855896
857176
857432
858712
859224
859736
859992
857600
857856
866048
866304
873472
873728
857695
857951
866143
866399
873567
873823
921156
921412
924740
925252
921157
921413
924741
925253
921158
921414
924742
925254
921159
921415
924743
925255
921160
921416
924744
925256
921161
921417
924745
925257
921163
921419
924747
925259
921164
921420
924748
925260
921165
921421
924749
925261
921166
921422
924750
925262
921167
921423
924751
925263
921168
921424
924752
925264
921169
921425
924753
925265
921170
921426
924754
925266
921171
921427
924755
925267
921172
921428
924756
925268
921173
921429
924757
925269
921174
921430
924758
925270
921175
921431
924759
925271
921176
921432
924760
925272
921179
921435
924763
925275
923136
923392
931584
931840
939008
939264
923231
923487
931679
931935
939103
939359
986692
986948
987716
988484
988996
989508
991044
986693
986949
987717
988485
988997
989509
991045
986694
986950
987718
988486
988998
989510
991046
986695
986951
987719
988487
988999
989511
991047
986696
986952
987720
988488
989000
989512
991048
986697
986953
987721
988489
989001
989513
991049
986698
986954
987722
988490
989002
989514
991050
986699
986955
987723
988491
989003
989515
991051
986700
986956
987724
988492
989004
989516
991052
986701
986957
987725
988493
989005
989517
991053
986706
986962
987730
988498
989010
989522
986707
986963
987731
988499
989011
989523
986708
986964
987732
988500
989012
989524
986710
986966
987734
988502
989014
989526
986711
986967
987735
988503
989015
989527
986712
986968
987736
988504
989016
989528
986713
986969
987737
988505
989017
989529
986714
986970
987738
988506
989018
989530
988672
988928
997120
997376
1004544
1004800
988767
989023
997215
997471
1004639
1004895
1050180
1050436
1051460
1052484
1055300
1055556
1055812
1056324
1049413
1049669
1050181
1050437
1051461
1052485
1055301
1055557
1055813
1056325
1049414
1049670
1050182
1050438
1051462
1052486
1055302
1055558
1055814
1056326
1049415
1049671
1050183
1050439
1051463
1052487
1055303
1055559
1055815
1056327
1049416
1049672
1050184
1050440
1051464
1052488
1055304
1055560
1055816
1056328
1049417
1049673
1050185
1050441
1051465
1052489
1055305
1055561
1055817
1056329
1049418
1049674
1050186
1050442
1051466
1052490
1055306
1055562
1055818
1056330
1049419
1049675
1050187
1050443
1051467
1052491
1055307
1055563
1055819
1056331
1049420
1049676
1050188
1050444
1051468
1052492
1055308
1055564
1055820
1056332
1049421
1049677
1050189
1050445
1051469
1052493
1055309
1055565
1055821
1049422
1049678
1050190
1050446
1051470
1052494
1055310
1055566
1055822
1056334
1049423
1049679
1050191
1050447
1051471
1052495
1055311
1055567
1055823
1049424
1049680
1050192
1050448
1051472
1052496
1055312
1055568
1055824
1049425
1049681
1050193
1050449
1051473
1052497
1055313
1055569
1055825
1049426
1049682
1050194
1050450
1051474
1052498
1055314
1055570
1055826
1049427
1049683
1050195
1050451
1051475
1052499
1055315
1055571
1055827
1049428
1049684
1050196
1050452
1051476
1052500
1055316
1055572
1055828
1049429
1049685
1050197
1050453
1051477
1052501
1055317
1055573
1055829
1049430
1049686
1050198
1050454
1051478
1052502
1055318
1055574
1055830
1049432
1049688
1050200
1050456
1051480
1052504
1055320
1055576
1055832
1054208
1054464
1062656
1062912
1070080
1070336
1054303
1054559
1062751
1063007
1070175
1070431
1116740
1118020
1121348
1114949
1115205
1116741
1118021
1121349
1114950
1115206
1116742
1118022
1121350
1114951
1115207
1116743
1118023
1121351
1114952
1115208
1116744
1118024
1121352
1114953
1115209
1116745
1118025
1121353
1114954
1115210
1116746
1118026
1121354
1114955
1115211
1116747
1118027
1121355
1114956
1115212
1116748
1118028
1121356
1114957
1115213
1116749
1118029
1121357
1114958
1115214
1116750
1118030
1121358
1114959
1115215
1116751
1118031
1121359
1114960
1115216
1116752
1118032
1121360
1114962
1115218
1116754
1118034
1121362
1114964
1115220
1116756
1118036
1121364
1114965
1115221
1116757
1118037
1121365
1114968
1115224
1116760
1118040
1121368
1114969
1115225
1116761
1118041
1121369
1119744
1120000
1128192
1128448
1135616
1135872
1119839
1120095
1128287
1128543
1135711
1135967
1180485
1180741
1182789
1183557
1185093
1186885
1187397
1180486
1180742
1182790
1183558
1185094
1186886
1187398
1180487
1180743
1182791
1183559
1185095
1186887
1187399
1180488
1180744
1182792
1183560
1186888
1187400
1180489
1180745
1182793
1183561
1185097
1186889
1187401
1180490
1180746
1182794
1183562
1186890
1187402
1180491
1180747
1182795
1183563
1185099
1186891
1187403
1180492
1180748
1182796
1183564
1185100
1186892
1187404
1180495
1180751
1182799
1183567
1185103
1186895
1187407
1180496
1180752
1182800
1183568
1185104
1186896
1187408
1180497
1180753
1182801
1183569
1185105
1186897
1187409
1180498
1180754
1182802
1183570
1185106
1186898
1187410
1180500
1180756
1182804
1183572
1185108
1186900
1187412
1180501
1180757
1182805
1183573
1185109
1186901
1187413
1180502
1180758
1182806
1183574
1185110
1186902
1187414
1180505
1180761
1182809
1183577
1185113
1186905
1187417
1180506
1180762
1182810
1183578
1185114
1186906
1187418
1185280
1185536
1193728
1193984
1201152
1201408
1185375
1185631
1193823
1194079
1201247
1201503
1246532
1247556
1247812
1248580
1248836
1249092
1249860
1250116
1250628
1252164
1246533
1247557
1247813
1248581
1248837
1249093
1249861
1250117
1250629
1251909
1252165
1246534
1247558
1247814
1248582
1248838
1249094
1250118
1250630
1251910
1252166
1246535
1247559
1247815
1248583
1248839
1249095
1250119
1250631
1251911
1252167
1246536
1247560
1247816
1248584
1248840
1249096
1249864
1250120
1250632
1251912
1252168
1246537
1247561
1247817
1248585
1248841
1249097
1249865
1250633
1251913
1252169
1246538
1247562
1247818
1248586
1248842
1249098
1249866
1250122
1250634
1251914
1252170
1246539
1247563
1247819
1248587
1248843
1249099
1249867
1250123
1250635
1251915
1252171
1246540
1247564
1247820
1248588
1248844
1249100
1249868
1250124
1250636
1251916
1252172
1246541
1247565
1247821
1248589
1248845
1249101
1249869
1250125
1250637
1251917
1252173
1246544
1247568
1247824
1248592
1248848
1249104
1249872
1250128
1250640
1251920
1252176
1246546
1247570
1247826
1248594
1248850
1249106
1249874
1250130
1250642
1251922
1252178
1246547
1247571
1247827
1248595
1248851
1249107
1249875
1250131
1250643
1251923
1252179
1246548
1247572
1247828
1248596
1248852
1249108
1249876
1250132
1250644
1251924
1252180
1246549
1247573
1247829
1248597
1248853
1249109
1249877
1250133
1250645
1251925
1252181
1246550
1247574
1247830
1248598
1248854
1249110
1249878
1250134
1250646
1251926
1252182
1246551
1247575
1247831
1248599
1248855
1249111
1249879
1250135
1250647
1251927
1252183
1246552
1247576
1247832
1248600
1248856
1249112
1249880
1250136
1250648
1251928
1252184
1250816
1251072
1259264
1259520
1266688
1266944
1250911
1251167
1259359
1259615
1266783
1267039
1311301
1314629
1315141
1315909
1316677
1317189
1318213
1318469
1318725
1311302
1314630
1315142
1315910
1316678
1317190
1318214
1318470
1318726
1311303
1314631
1315143
1315911
1316679
1317191
1318215
1318471
1318727
1311304
1314632
1315144
1315912
1316680
1317192
1318216
1318472
1318728
1311305
1314633
1315145
1315913
1316681
1317193
1318217
1318473
1318729
1311306
1314634
1315146
1315914
1316682
1317194
1318218
1318474
1318730
1311307
1314635
1315147
1315915
1316683
1317195
1318219
1318475
1318731
1311308
1314636
1315148
1315916
1316684
1317196
1318220
1318476
1318732
1311309
1314637
1315149
1315917
1316685
1317197
1318221
1318477
1318733
1311310
1314638
1315150
1315918
1316686
1317198
1318222
1318478
1318734
1311311
1314639
1315151
1315919
1316687
1317199
1318223
1318479
1318735
1311312
1314640
1315152
1315920
1316688
1317200
1318224
1318480
1318736
1311313
1314641
1315153
1315921
1316689
1317201
1318225
1318481
1318737
1311314
1314642
1315154
1315922
1316690
1317202
1318226
1318482
1318738
1311315
1314643
1315155
1315923
1316691
1317203
1318227
1318483
1318739
1311316
1314644
1315156
1315924
1316692
1317204
1318228
1318484
1318740
1311317
1314645
1315157
1315925
1316693
1317205
1318229
1318485
1318741
1311318
1314646
1315158
1315926
1316694
1317206
1318230
1318486
1318742
1311319
1314647
1315159
1315927
1316695
1317207
1318231
1318487
1318743
1311320
1314648
1315160
1315928
1316696
1317208
1318232
1318488
1318744
1311321
1314649
1315161
1315929
1316697
1317209
1318233
1318489
1318745
1311322
1314650
1315162
1315930
1316698
1317210
1318234
1318490
1318746
1314651
1315163
1315931
1316699
1317211
1318235
1318491
1316352
1316608
1324800
1325056
1332224
1332480
1316447
1316703
1324895
1325151
1332319
1332575
1376837
1377093
1377861
1378117
1378629
1379653
1380933
1382725
1384005
1376838
1377094
1377862
1378118
1378630
1379654
1380934
1382726
1384006
1376839
1377095
1377863
1378119
1378631
1379655
1380935
1382727
1384007
1376840
1377096
1377864
1378120
1378632
1379656
1380936
1382728
1384008
1376841
1377097
1377865
1378121
1378633
1379657
1380937
1382729
1384009
1376842
1377098
1377866
1378122
1378634
1379658
1380938
1382730
1384010
1376843
1377099
1377867
1378123
1378635
1379659
1380939
1382731
1384011
1376844
1377100
1377868
1378124
1378636
1379660
1380940
1382732
1384012
1376845
1377101
1377869
1378125
1378637
1379661
1380941
1382733
1384013
1376846
1377102
1377870
1378126
1378638
1379662
1380942
1382734
1384014
1376847
1377103
1377871
1378127
1378639
1379663
1380943
1382735
1384015
1376848
1377104
1377872
1378128
1378640
1379664
1380944
1382736
1384016
1376850
1377106
1377874
1378130
1378642
1379666
1380946
1382738
1384018
1376851
1377107
1377875
1378131
1378643
1379667
1380947
1382739
1384019
1376852
1377108
1377876
1378132
1378644
1379668
1380948
1382740
1384020
1376853
1377109
1377877
1378133
1378645
1379669
1380949
1382741
1384021
1376857
1377113
1377881
1378137
1378649
1379673
1380953
1382745
1384025
1376858
1377114
1377882
1378138
1378650
1379674
1380954
1382746
1384026
1376859
1377115
1377883
1378139
1378651
1379675
1380955
1382747
1384027
1381888
1382144
1390336
1390592
1397760
1398016
1381983
1382239
1390431
1390687
1397855
1398111
1442885
1444933
1449541
1442886
1444934
1449542
1442887
1444935
1449543
1442888
1444936
1449544
1442889
1444937
1449545
1442890
1444938
1449546
1442891
1444939
1449547
1442892
1444940
1449548
1442893
1444941
1449549
1442894
1444942
1449550
1442895
1444943
1449551
1442896
1444944
1449552
1442897
1444945
1449553
1442898
1444946
1449554
1442899
1444947
1449555
1442900
1444948
1449556
1442901
1444949
1449557
1442902
1444950
1449558
1442903
1444951
1449559
1442905
1444953
1449561
1442907
1444955
1449563
1447424
1447680
1455872
1456128
1463296
1463552
1447519
1447775
1455967
1456223
1463391
1463647
1508165
1508421
1509701
1511237
1511493
1511749
1512773
1508166
1508422
1509702
1511238
1511494
1511750
1512774
1508167
1508423
1509703
1511239
1511495
1511751
1512775
1508168
1508424
1509704
1511240
1511496
1511752
1512776
1508169
1508425
1509705
1511241
1511497
1511753
1512777
1508170
1508426
1509706
1511242
1511498
1511754
1512778
1508171
1508427
1509707
1511243
1511499
1511755
1512779
1508172
1508428
1509708
1511244
1511500
1511756
1512780
1508173
1508429
1509709
1511245
1511501
1511757
1512781
1508174
1508430
1509710
1511246
1511502
1511758
1512782
1508175
1508431
1509711
1511247
1511503
1511759
1512783
1508176
1508432
1509712
1511248
1511504
1511760
1512784
1508177
1508433
1509713
1511249
1511505
1511761
1512785
1508178
1508434
1509714
1511250
1511506
1511762
1512786
1508179
1508435
1509715
1511251
1511507
1511763
1512787
1508180
1508436
1509716
1511252
1511508
1511764
1512788
1508181
1508437
1509717
1511253
1511509
1511765
1512789
1508182
1508438
1509718
1511254
1511510
1511766
1512790
1508186
1508442
1509722
1511258
1511514
1511770
1512794
1512960
1513216
1521408
1521664
1528832
1529088
1513055
1513311
1521503
1521759
1528927
1529183
1573701
1574725
1574981
1575237
1576261
1577285
1579845
1580613
1573702
1574726
1574982
1575238
1576262
1577286
1579846
1580614
1573703
1574727
1574983
1575239
1576263
1577287
1579847
1580615
1573704
1574728
1574984
1575240
1576264
1577288
1579848
1580616
1573705
1574729
1574985
1575241
1576265
1577289
1579849
1580617
1573706
1574730
1574986
1575242
1576266
1577290
1579850
1580618
1573708
1574732
1574988
1575244
1576268
1577292
1579852
1580620
1573709
1574733
1574989
1575245
1576269
1577293
1579853
1580621
1573710
1574734
1574990
1575246
1576270
1577294
1579854
1580622
1573712
1574736
1574992
1575248
1576272
1577296
1579856
1580624
1573713
1574737
1574993
1575249
1576273
1577297
1579857
1580625
1573714
1574738
1574994
1575250
1576274
1577298
1579858
1580626
1573715
1574739
1574995
1575251
1576275
1577299
1579859
1580627
1573716
1574740
1574996
1575252
1576276
1577300
1579860
1580628
1573717
1574741
1574997
1575253
1576277
1577301
1579861
1580629
1573719
1574743
1574999
1575255
1576279
1577303
1579863
1580631
1573722
1574746
1575002
1575258
1576282
1577306
1579866
1580634
1574747
1575003
1575259
1576283
1577307
1579867
1580635
1578496
1578752
1586944
1587200
1594368
1594624
1578591
1578847
1587039
1587295
1594463
1594719
1639237
1639493
1639749
1640261
1640517
1640773
1641797
1642053
1642821
1644613
1645381
1646149
1639238
1639494
1639750
1640262
1640518
1640774
1641798
1642054
1642822
1644614
1645382
1646150
1639239
1639495
1639751
1640263
1640519
1640775
1641799
1642055
1642823
1644615
1645383
1646151
1639240
1639496
1639752
1640264
1640520
1640776
1641800
1642056
1642824
1644616
1645384
1646152
1639241
1639497
1639753
1640265
1640521
1640777
1641801
1642057
1642825
1644617
1645385
1646153
1639242
1639498
1639754
1640266
1640522
1640778
1641802
1642058
1642826
1644618
1645386
1646154
1639243
1639499
1639755
1640267
1640523
1640779
1641803
1642059
1642827
1644619
1645387
1646155
1639244
1639500
1639756
1640268
1640524
1640780
1641804
1642060
1642828
1644620
1645388
1646156
1639245
1639501
1639757
1640269
1640525
1640781
1641805
1642061
1642829
1644621
1645389
1646157
1639246
1639502
1639758
1640270
1640526
1640782
1641806
1642062
1642830
1644622
1645390
1646158
1639247
1639503
1639759
1640271
1640527
1640783
1641807
1642063
1642831
1644623
1645391
1646159
1639248
1639504
1639760
1640272
1640528
1640784
1641808
1642064
1642832
1644624
1645392
1646160
1639249
1639505
1639761
1640273
1640529
1640785
1641809
1642065
1642833
1644625
1645393
1646161
1639250
1639506
1639762
1640274
1640530
1640786
1641810
1642066
1642834
1644626
1645394
1646162
1639251
1639507
1639763
1640275
1640531
1640787
1641811
1642067
1642835
1644627
1645395
1646163
1639252
1639508
1639764
1640276
1640532
1640788
1641812
1642068
1642836
1644628
1645396
1646164
1639253
1639509
1639765
1640277
1640533
1640789
1641813
1642069
1642837
1644629
1645397
1646165
1639254
1639510
1639766
1640278
1640534
1640790
1641814
1642070
1642838
1644630
1645398
1646166
1639255
1639511
1639767
1640279
1640535
1640791
1641815
1642071
1642839
1644631
1645399
1646167
1639257
1639513
1639769
1640281
1640537
1640793
1641817
1642073
1642841
1644633
1645401
1646169
1639259
1639515
1639771
1640283
1640539
1640795
1641819
1642075
1642843
1644635
1645403
1646171
1644032
1644288
1652480
1652736
1659904
1660160
1644127
1644383
1652575
1652831
1659999
1660255
1705029
1706309
1707845
1708613
1709381
1709893
1711685
1711941
1705030
1706310
1707846
1708614
1709382
1709894
1711686
1711942
1705031
1706311
1707847
1708615
1709383
1709895
1711687
1711943
1705032
1706312
1707848
1708616
1709384
1709896
1711688
1711944
1705033
1706313
1707849
1708617
1709385
1709897
1711689
1711945
1705034
1706314
1707850
1708618
1709386
1709898
1711690
1711946
1705035
1706315
1707851
1708619
1709387
1709899
1711691
1711947
1705036
1706316
1707852
1708620
1709388
1709900
1711692
1711948
1705037
1706317
1707853
1708621
1709389
1709901
1711693
1711949
1705038
1706318
1707854
1708622
1709390
1709902
1711694
1711950
1705039
1706319
1707855
1708623
1709391
1709903
1711695
1711951
1705040
1706320
1707856
1708624
1709392
1709904
1711696
1711952
1705041
1706321
1707857
1708625
1709393
1709905
1711697
1711953
1705042
1706322
1707858
1708626
1709394
1709906
1711698
1705043
1706323
1707859
1708627
1709395
1709907
1711699
1705044
1706324
1707860
1708628
1709396
1709908
1711700
1705045
1706325
1707861
1708629
1709397
1709909
1711701
1705046
1706326
1707862
1708630
1709398
1709910
1711702
1705049
1706329
1707865
1708633
1709401
1709913
1711705
1705051
1706331
1707867
1708635
1709403
1709915
1711707
1709568
1709824
1718016
1718272
1725440
1725696
1709663
1709919
1718111
1718367
1725535
1725791
1770309
1770565
1770821
1771845
1773381
1774149
1770310
1770566
1770822
1771846
1773382
1774150
1770311
1770567
1770823
1771847
1773383
1774151
1770312
1770568
1770824
1771848
1773384
1774152
1770314
1770570
1770826
1771850
1773386
1774154
1770315
1770571
1770827
1771851
1773387
1774155
1770316
1770572
1770828
1771852
1773388
1774156
1770317
1770573
1770829
1771853
1773389
1774157
1770318
1770574
1770830
1771854
1773390
1774158
1770319
1770575
1770831
1771855
1773391
1774159
1770320
1770576
1770832
1771856
1773392
1774160
1770321
1770577
1770833
1771857
1773393
1774161
1770322
1770578
1770834
1771858
1773394
1774162
1770323
1770579
1770835
1771859
1773395
1774163
1770324
1770580
1770836
1771860
1773396
1774164
1770325
1770581
1770837
1771861
1773397
1774165
1770326
1770582
1770838
1771862
1773398
1774166
1770327
1770583
1770839
1771863
1773399
1774167
1770328
1770584
1770840
1771864
1773400
1774168
1770329
1770585
1770841
1771865
1773401
1774169
1770331
1770587
1770843
1771867
1773403
1774171
1775104
1775360
1783552
1783808
1790976
1791232
1775199
1775455
1783647
1783903
1791071
1791327
1836357
1837381
1837637
1838405
1838661
1839685
1841989
1836359
1837383
1837639
1838407
1838663
1839687
1841991
1836360
1837384
1837640
1838408
1838664
1839688
1841992
1836363
1837387
1837643
1838411
1838667
1839691
1841995
1836364
1837388
1837644
1838412
1838668
1839692
1841996
1836366
1837390
1837646
1838414
1838670
1839438
1839694
1841998
1836369
1837393
1837649
1838417
1838673
1839441
1839697
1842001
1836370
1837394
1837650
1838418
1838674
1839442
1839698
1842002
1836371
1837395
1837651
1838419
1838675
1839443
1839699
1842003
1836372
1837396
1837652
1838420
1838676
1839444
1839700
1842004
1836373
1837397
1837653
1838421
1838677
1839445
1839701
1842005
1836374
1837398
1837654
1838422
1838678
1839446
1839702
1842006
1836375
1837399
1837655
1838423
1838679
1839447
1839703
1842007
1836376
1837400
1837656
1838424
1838680
1839448
1839704
1842008
1836378
1837402
1837658
1838426
1838682
1839450
1839706
1842010
1840640
1840896
1849088
1849344
1856512
1856768
1840735
1840991
1849183
1849439
1856607
1856863
1901381
1902917
1904197
1904453
1905989
1906501
1907525
1908293
1901382
1902918
1904198
1904454
1905990
1906502
1907526
1908294
1901383
1902919
1904199
1904455
1905991
1906503
1907527
1908295
1901384
1902920
1904200
1904456
1905992
1906504
1907528
1908296
1901385
1902921
1904201
1904457
1905993
1906505
1907529
1908297
1901386
1902922
1904202
1904458
1905994
1906506
1907530
1908298
1901387
1902923
1904203
1904459
1905995
1906507
1907531
1908299
1901388
1902924
1904204
1904460
1905996
1906508
1907532
1908300
1901389
1902925
1904205
1904461
1905997
1906509
1907533
1908301
1901390
1902926
1904206
1904462
1905998
1906510
1907534
1908302
1901391
1902927
1904207
1904463
1905999
1906511
1907535
1908303
1901392
1902928
1904208
1904464
1906000
1906512
1907536
1908304
1901393
1902929
1904209
1904465
1906001
1906513
1907537
1908305
1901394
1902930
1904210
1904466
1906002
1906514
1907538
1908306
1901395
1902931
1904211
1904467
1906003
1906515
1907539
1908307
1901396
1902932
1904212
1904468
1906004
1906516
1907540
1908308
1901397
1902933
1904213
1904469
1906005
1906517
1907541
1908309
1901401
1902937
1904217
1904473
1906009
1906521
1907545
1908313
1901403
1902939
1904219
1904475
1906011
1906523
1907547
1908315
1906176
1906432
1914624
1914880
1922048
1922304
1906271
1906527
1914719
1914975
1922143
1922399
1966661
1966917
1969989
1970757
1971525
1972805
1973061
1973573
1966662
1966918
1969990
1970758
1971526
1972806
1973062
1973574
1966663
1966919
1969991
1970759
1971527
1972807
1973063
1973575
1966664
1966920
1969992
1970760
1971528
1972808
1973064
1973576
1966665
1966921
1969993
1970761
1971529
1972809
1973065
1973577
1966666
1966922
1969994
1970762
1971530
1972810
1973066
1973578
1966667
1966923
1969995
1970763
1971531
1972811
1973067
1973579
1966668
1966924
1969996
1970764
1971532
1972812
1973068
1973580
1966669
1966925
1969997
1970765
1971533
1972813
1973069
1973581
1966671
1966927
1969999
1970767
1971535
1972815
1973071
1973583
1966672
1966928
1970000
1970768
1971536
1972816
1973072
1973584
1966674
1966930
1970002
1970770
1971538
1972818
1973074
1973586
1966675
1966931
1970003
1970771
1971539
1972819
1973075
1973587
1966676
1966932
1970004
1970772
1971540
1972820
1973076
1973588
1966677
1966933
1970005
1970773
1971541
1972821
1973077
1966679
1966935
1970007
1970775
1971543
1972823
1973079
1966680
1966936
1970008
1970776
1971544
1972824
1973080
1966681
1966937
1970009
1970777
1971545
1972825
1973081
1966682
1966938
1970010
1970778
1971546
1966683
1966939
1970011
1970779
1971547
1971712
1971968
1980160
1980416
1987584
1987840
1971807
1972063
1980255
1980511
1987679
1987935
2033988
2034500
2034756
2035524
2036804
2037060
2038340
2038596
2039108
2033221
2033989
2034501
2034757
2035525
2036805
2037061
2038341
2038597
2039109
2033222
2033990
2034502
2034758
2035526
2036806
2037062
2038342
2038598
2039110
2033223
2033991
2034503
2034759
2035527
2036807
2037063
2038343
2038599
2039111
2033224
2033992
2034504
2034760
2035528
2036808
2037064
2038344
2038600
2039112
2033225
2033993
2034505
2034761
2035529
2036809
2037065
2038345
2038601
2039113
2033226
2033994
2034506
2034762
2035530
2036810
2037066
2038346
2038602
2039114
2033227
2033995
2034507
2034763
2035531
2036811
2037067
2038347
2038603
2039115
2033228
2033996
2034508
2034764
2035532
2036812
2037068
2038348
2038604
2039116
2033229
2033997
2034509
2034765
2035533
2036813
2037069
2038349
2038605
2039117
2033230
2033998
2034510
2034766
2035534
2036814
2037070
2038350
2038606
2039118
2033232
2034000
2034512
2034768
2035536
2036816
2037072
2038352
2038608
2039120
2033234
2034002
2034514
2034770
2035538
2036818
2037074
2038354
2038610
2039122
2033235
2034003
2034515
2034771
2035539
2036819
2037075
2038355
2038611
2039123
2033237
2034005
2034517
2034773
2035541
2036821
2037077
2038357
2038613
2039125
2033239
2034007
2034519
2034775
2035543
2036823
2037079
2038359
2038615
2033240
2034008
2034520
2034776
2035544
2036824
2037080
2038360
2038616
2039128
2033241
2034009
2034521
2034777
2035545
2036825
2037081
2038361
2038617
2039129
2033242
2034010
2034522
2034778
2035546
2036826
2037082
2038362
2038618
2039130
2033243
2034011
2034523
2034779
2035547
2036827
2037083
2038363
2038619
2039131
2037248
2037504
2045696
2045952
2053120
2053376
2037343
2037599
2045791
2046047
2053215
2053471
2101061
2101573
2104133
2104645
2101062
2101574
2104134
2104646
2101063
2101575
2104135
2104647
2101064
2101576
2104136
2104648
2101065
2101577
2104137
2104649
2101066
2101578
2104138
2104650
2101067
2101579
2104139
2104651
2101068
2101580
2104140
2104652
2101069
2101581
2104141
2104653
2101070
2101582
2104142
2104654
2101071
2101583
2104143
2104655
2101072
2101584
2104144
2104656
2101073
2101585
2104145
2104657
2101074
2101586
2104146
2104658
2101075
2101587
2104147
2104659
2101076
2101588
2104148
2104660
2101077
2101589
2104149
2104661
2101078
2101590
2104150
2104662
2101079
2101591
2104151
2104663
2101080
2101592
2104152
2104664
2101081
2101593
2104153
2104665
2101082
2101594
2104154
2104666
2101083
2101595
2104155
2104667
2102784
2103040
2111232
2111488
2118656
2118912
2102879
2103135
2111327
2111583
2118751
2119007
2163525
2164037
2164805
2166085
2166341
2169157
2169669
2169925
2170437
2163526
2164038
2164806
2166086
2166342
2169158
2169670
2169926
2170438
2163527
2164039
2164807
2166087
2166343
2169159
2169671
2169927
2170439
2163528
2164040
2164808
2166088
2166344
2169160
2169672
2169928
2170440
2163529
2164041
2164809
2166089
2166345
2169161
2169673
2169929
2170441
2163530
2164042
2164810
2166090
2166346
2169162
2169674
2169930
2170442
2163531
2164043
2164811
2166091
2166347
2169163
2169675
2169931
2170443
2163532
2164044
2164812
2166092
2166348
2169164
2169676
2169932
2170444
2163533
2164045
2164813
2166093
2166349
2169165
2169677
2169933
2170445
2163534
2164046
2164814
2166094
2166350
2169166
2169678
2169934
2170446
2163535
2164047
2164815
2166095
2166351
2169167
2169679
2169935
2170447
2170448
2163537
2164049
2164817
2166097
2166353
2170449
2170450
2169683
2169939
2170451
2169684
2169940
2170452
2163541
2164053
2164821
2166101
2166357
2169685
2169941
2170453
2163542
2164054
2164822
2166102
2166358
2169686
2169942
2170454
2163543
2164055
2164823
2166103
2166359
2169687
2169943
2170455
2163544
2164056
2164824
2166104
2166360
2168920
2169176
2169688
2170456
2163545
2164057
2164825
2166105
2166361
2168921
2169177
2163547
2164059
2164827
2166107
2166363
2168923
2168320
2168576
2176768
2177024
2184192
2184448
2168415
2168671
2176863
2177119
2184287
2184543
2231876
2233412
2234948
2235204
2235460
2235972
2231877
2233413
2234949
2235205
2235461
2235973
2231878
2233414
2234950
2235206
2235462
2235974
2231879
2233415
2234951
2235207
2235463
2235975
2231880
2233416
2234952
2235208
2235464
2235976
2231881
2233417
2234953
2235209
2235465
2235977
2231882
2233418
2234954
2235210
2235466
2235978
2231883
2233419
2234955
2235211
2235467
2235979
2231884
2233420
2234956
2235212
2235468
2235980
2231885
2233421
2234957
2235213
2235469
2235981
2231886
2233422
2234958
2235214
2235470
2235982
2231887
2233423
2234959
2235215
2235471
2235983
2231888
2233424
2234960
2235216
2235472
2235984
2231889
2233425
2234961
2235217
2235473
2235985
2231890
2233426
2234962
2235218
2235474
2235986
2231891
2233427
2234963
2235219
2235475
2235987
2231892
2233428
2234964
2235220
2235476
2235988
2231893
2233429
2234965
2235221
2235477
2235989
2231895
2233431
2234967
2235223
2235479
2235991
2231896
2233432
2234968
2235224
2235480
2235992
2231897
2233433
2234969
2235225
2235481
2235993
2231898
2233434
2234970
2235226
2235482
2235994
2231899
2233435
2234971
2235227
2235483
2235995
2233856
2234112
2242304
2242560
2249728
2249984
2233951
2234207
2242399
2242655
2249823
2250079
2294343
2295879
2296647
2297671
2299719
2301255
2294344
2295880
2296648
2297672
2299720
2301256
2294345
2295881
2296649
2297673
2299721
2301257
2294346
2295882
2296650
2297674
2299722
2301258
2294347
2295883
2296651
2297675
2299723
2301259
2294348
2295884
2296652
2297676
2299724
2301260
2294350
2295886
2296654
2297678
2299726
2301262
2294351
2295887
2296655
2297679
2299727
2301263
2294353
2295889
2296657
2297681
2299729
2301265
2294355
2295891
2296659
2297683
2299731
2301267
2294356
2295892
2296660
2297684
2299732
2301268
2294357
2295893
2296661
2297685
2299733
2301269
2294359
2295895
2296663
2297687
2299735
2301271
2294360
2295896
2296664
2297688
2299736
2301272
2294361
2295897
2296665
2297689
2299737
2301273
2295898
2296666
2297690
2299738
2301274
2295899
2296667
2297691
2299739
2301275
2299392
2299648
2307840
2308096
2315264
2315520
2299487
2299743
2307935
2308191
2315359
2315615
2360134
2361158
2361414
2361670
2362438
2363206
2364230
2365254
2366790
2360135
2361159
2361415
2361671
2362439
2363207
2364231
2365255
2366791
2360136
2361160
2361416
2361672
2362440
2363208
2364232
2365256
2366792
2360137
2361161
2361417
2361673
2362441
2363209
2364233
2365257
2366793
2360138
2361162
2361418
2361674
2362442
2363210
2364234
2365258
2366794
2361163
2361419
2361675
2362443
2363211
2364235
2365259
2366795
2360140
2361164
2361420
2361676
2362444
2363212
2364236
2365260
2366796
2360141
2361165
2361421
2361677
2362445
2363213
2364237
2365261
2366797
2360142
2361166
2361422
2361678
2362446
2363214
2364238
2365262
2366798
2360143
2361167
2361423
2361679
2362447
2363215
2364239
2365263
2366799
2360144
2361168
2361424
2361680
2362448
2363216
2365264
2366800
2360148
2361172
2361428
2361684
2362452
2363220
2364244
2365268
2366804
2360149
2361173
2361429
2361685
2362453
2363221
2364245
2365269
2366805
2360150
2361174
2361430
2361686
2362454
2363222
2364246
2365270
2366806
2360151
2361175
2361431
2361687
2362455
2363223
2364247
2365271
2366807
2360152
2361176
2361432
2361688
2362456
2363224
2364248
2365272
2366808
2360153
2361177
2361433
2361689
2362457
2363225
2364249
2365273
2366809
2360154
2361178
2361434
2361690
2362458
2363226
2364250
2365274
2366810
2360155
2361179
2361435
2361691
2362459
2363227
2364251
2365275
2366811
2364928
2365184
2373376
2373632
2380800
2381056
2365023
2365279
2373471
2373727
2380895
2381151
2425925
2426693
2428741
2428997
2430789
2431045
2431301
2432069
2432581
2425926
2426694
2428742
2428998
2430790
2431046
2431302
2432070
2432582
2425927
2426695
2428743
2428999
2430791
2431047
2431303
2432071
2432583
2425928
2426696
2428744
2429000
2430792
2431048
2431304
2432072
2432584
2425929
2426697
2428745
2429001
2430793
2431049
2431305
2432073
2432585
2425930
2426698
2428746
2429002
2430794
2431050
2431306
2432074
2432586
2425931
2426699
2428747
2429003
2430795
2431051
2431307
2432075
2432587
2425932
2426700
2428748
2429004
2430796
2431052
2431308
2432076
2432588
2425933
2426701
2428749
2429005
2430797
2431053
2431309
2432077
2432589
2425934
2426702
2428750
2429006
2430798
2431054
2431310
2432078
2432590
2425935
2426703
2428751
2429007
2430799
2431055
2431311
2432079
2432591
2425936
2426704
2428752
2429008
2430800
2431056
2431312
2432080
2432592
2425937
2426705
2428753
2429009
2430801
2431057
2431313
2432081
2432593
2425938
2426706
2428754
2429010
2430802
2431058
2431314
2432082
2432594
2425939
2426707
2428755
2429011
2430803
2431059
2431315
2432083
2432595
2425940
2426708
2428756
2429012
2430804
2431060
2431316
2432084
2432596
2425941
2426709
2428757
2429013
2430805
2431061
2431317
2432085
2432597
2425942
2426710
2428758
2429014
2430806
2431062
2431318
2432086
2432598
2425943
2426711
2428759
2429015
2430807
2431063
2431319
2432087
2432599
2425944
2426712
2428760
2429016
2430808
2431064
2431320
2432088
2432600
2425945
2426713
2428761
2429017
2430809
2431065
2431321
2432089
2432601
2425946
2426714
2428762
2429018
2430810
2431066
2431322
2432090
2432602
2425947
2426715
2428763
2429019
2430811
2431067
2431323
2432091
2432603
2430464
2430720
2438912
2439168
2446336
2446592
2430559
2430815
2439007
2439263
2446431
2446687
2491973
2493509
2494021
2496837
2497349
2497605
2498117
2491974
2493510
2494022
2496838
2497350
2497606
2491975
2493511
2494023
2496839
2497351
2497607
2498119
2491976
2493512
2494024
2496840
2497352
2497608
2498120
2491977
2493513
2494025
2496841
2497353
2497609
2498121
2491978
2493514
2494026
2496842
2497354
2497610
2498122
2491979
2493515
2494027
2496843
2497355
2497611
2498123
2491980
2493516
2494028
2496844
2497356
2497612
2498124
2491981
2493517
2494029
2496845
2497357
2497613
2498125
2491982
2493518
2494030
2496846
2497358
2497614
2498126
2491983
2493519
2494031
2496847
2497359
2497615
2498127
2491984
2493520
2494032
2496848
2497360
2497616
2498128
2491985
2493521
2494033
2496849
2497361
2497617
2498129
2491986
2493522
2494034
2496850
2497362
2497618
2498130
2491987
2493523
2494035
2496851
2497363
2497619
2498131
2491988
2493524
2494036
2496852
2497364
2497620
2498132
2491989
2493525
2494037
2496853
2497365
2497621
2498133
2491990
2493526
2494038
2496854
2497366
2497622
2498134
2491991
2493527
2494039
2496855
2497367
2497623
2498135
2491992
2493528
2494040
2496856
2497368
2497624
2498136
2491994
2493530
2494042
2496858
2497370
2497626
2498138
2491995
2493531
2494043
2496859
2497371
2497627
2498139
2491996
2493532
2494044
2496860
2497372
2497628
2496000
2496256
2504448
2504704
2511872
2512128
2496095
2496351
2504543
2504799
2511967
2512223
2558540
2560588
2558549
2560597
2561536
2561792
2569984
2570240
2577408
2577664
2561631
2561887
2570079
2570335
2577503
2577759
2622021
2622277
2623301
2623557
2625349
2626629
2626885
2628933
2629189
2622022
2622278
2623302
2623558
2625350
2626630
2626886
2628934
2629190
2622023
2622279
2623303
2623559
2625351
2626631
2626887
2628935
2629191
2622024
2622280
2623304
2623560
2625352
2626632
2626888
2628936
2629192
2622025
2622281
2623305
2623561
2625353
2626633
2626889
2628937
2629193
2622026
2622282
2623306
2623562
2625354
2626634
2626890
2628938
2629194
2622027
2622283
2623307
2623563
2625355
2626635
2626891
2628939
2629195
2622029
2622285
2623309
2623565
2625357
2626637
2626893
2628941
2629197
2622030
2622286
2623310
2623566
2625358
2626638
2626894
2628942
2629198
2622031
2622287
2623311
2623567
2625359
2626639
2626895
2628943
2629199
2622032
2622288
2623312
2623568
2625360
2626640
2626896
2628944
2629200
2622033
2622289
2623313
2623569
2625361
2626641
2626897
2628945
2629201
2622034
2622290
2623314
2623570
2625362
2626642
2626898
2628946
2629202
2622035
2622291
2623315
2623571
2625363
2626643
2626899
2628947
2629203
2622036
2622292
2623316
2623572
2625364
2626644
2626900
2628948
2629204
2622037
2622293
2623317
2623573
2625365
2626645
2626901
2628949
2629205
2622038
2622294
2623318
2623574
2625366
2626646
2626902
2628950
2629206
2622039
2622295
2623319
2623575
2625367
2626647
2626903
2628951
2629207
2622040
2622296
2623320
2623576
2625368
2626648
2626904
2628952
2629208
2622042
2622298
2623322
2623578
2625370
2626650
2626906
2628954
2629210
2622043
2622299
2623323
2623579
2625371
2626651
2626907
2628955
2627072
2627328
2635520
2635776
2642944
2643200
2627167
2627423
2635615
2635871
2643039
2643295
2692608
2692864
2701056
2701312
2708480
2708736
2692703
2692959
2701151
2701407
2708575
2708831
2753094
2753606
2753862
2754118
2754630
2755398
2755910
2756422
2759494
2753095
2753607
2753863
2754119
2754631
2755399
2755911
2756423
2759495
2753096
2753608
2753864
2754120
2754632
2755400
2755912
2756424
2759496
2753097
2753609
2753865
2754121
2754633
2755401
2755913
2756425
2759497
2753098
2753610
2753866
2754122
2754634
2755402
2755914
2756426
2759498
2753099
2753611
2753867
2754123
2754635
2755403
2755915
2756427
2759499
2753100
2753612
2753868
2754124
2754636
2755404
2755916
2756428
2759500
2753102
2753614
2753870
2754126
2754638
2755406
2755918
2756430
2759502
2753104
2753616
2753872
2754128
2754640
2755408
2755920
2756432
2759504
2753106
2753618
2753874
2754130
2754642
2755410
2755922
2756434
2759506
2759508
2753110
2753622
2753878
2754134
2754646
2755414
2755926
2756438
2757206
2759510
2758144
2758400
2766592
2766848
2774016
2774272
2758239
2758495
2766687
2766943
2774111
2774367
2818885
2819397
2819909
2820677
2821445
2824261
2825285
2825541
2825797
2818886
2819398
2819910
2820678
2821446
2824262
2825286
2825542
2825798
2818887
2819399
2819911
2820679
2821447
2824263
2825287
2825543
2825799
2818888
2819400
2819912
2820680
2821448
2824264
2825288
2825544
2825800
2818889
2819401
2819913
2820681
2821449
2824265
2825289
2825545
2825801
2818890
2819402
2819914
2820682
2821450
2824266
2825290
2825546
2825802
2818891
2819403
2819915
2820683
2821451
2824267
2825291
2825547
2825803
2818892
2819404
2819916
2820684
2821452
2824268
2825292
2825548
2825804
2818893
2819405
2819917
2820685
2821453
2824269
2825293
2825549
2825805
2818894
2819406
2819918
2820686
2821454
2824270
2825294
2825550
2825806
2818895
2819407
2819919
2820687
2821455
2824271
2825295
2825551
2825807
2818896
2819408
2819920
2820688
2821456
2824272
2825296
2825552
2825808
2818897
2819409
2819921
2820689
2821457
2824273
2825297
2825553
2825809
2818898
2819410
2819922
2820690
2821458
2824274
2825298
2825554
2825810
2818899
2819411
2819923
2820691
2821459
2824275
2825299
2825555
2825811
2818900
2819412
2819924
2820692
2821460
2824276
2825300
2825556
2825812
2818901
2819413
2819925
2820693
2821461
2824277
2825301
2825557
2825813
2818902
2819414
2819926
2820694
2821462
2824278
2825302
2825558
2825814
2818904
2819416
2819928
2820696
2821464
2824280
2825304
2825560
2825816
2818905
2819417
2819929
2820697
2821465
2824281
2825305
2825561
2825817
2818906
2819418
2819930
2820698
2821466
2824282
2825306
2825562
2825818
2825308
2823680
2823936
2832128
2832384
2839552
2839808
2823775
2824031
2832223
2832479
2839647
2839903
2884933
2886981
2887749
2889285
2890821
2891077
2891333
2884934
2886982
2887750
2889286
2890822
2891078
2891334
2884935
2886983
2887751
2889287
2890823
2891079
2891335
2884937
2886985
2887753
2889289
2890825
2891081
2891337
2884938
2886986
2887754
2889290
2890826
2891082
2891338
2884939
2886987
2887755
2889291
2890827
2891083
2891339
2884940
2886988
2887756
2889292
2890828
2891084
2891340
2884941
2886989
2887757
2889293
2890829
2891085
2891341
2884942
2886990
2887758
2889294
2890830
2891086
2891342
2884943
2886991
2887759
2889295
2890831
2891087
2891343
2884944
2886992
2887760
2889296
2890832
2891088
2891344
2884945
2886993
2887761
2889297
2890833
2891089
2891345
2884946
2886994
2887762
2889298
2890834
2891090
2891346
2884947
2886995
2887763
2889299
2890835
2891091
2891347
2884948
2886996
2887764
2889300
2890836
2891092
2891348
2884950
2886998
2887766
2889302
2890838
2891094
2891350
2884951
2886999
2887767
2889303
2890839
2891095
2891351
2884952
2887000
2887768
2889304
2890840
2891096
2891352
2884954
2887002
2887770
2889306
2890842
2891098
2891354
2889216
2889472
2897664
2897920
2905088
2905344
2889311
2889567
2897759
2898015
2905183
2905439
2949701
2949957
2950981
2951237
2951493
2952005
2952773
2953797
2954309
2956101
2949702
2949958
2950982
2951238
2951494
2952006
2952774
2953798
2954310
2956102
2949703
2949959
2950983
2951239
2951495
2952007
2952775
2953799
2954311
2956103
2949704
2949960
2950984
2951240
2951496
2952008
2952776
2953800
2954312
2956104
2949706
2949962
2950986
2951242
2951498
2952010
2952778
2953802
2954314
2949707
2949963
2950987
2951243
2951499
2952011
2952779
2953803
2954315
2949708
2949964
2950988
2951244
2951500
2952012
2952780
2953804
2954316
2949709
2949965
2950989
2951245
2951501
2952013
2952781
2953805
2954317
2949710
2949966
2950990
2951246
2951502
2952014
2952782
2953806
2954318
2949711
2949967
2950991
2951247
2951503
2952015
2952783
2953807
2954319
2949712
2949968
2950992
2951248
2951504
2952016
2952784
2953808
2954320
2949714
2949970
2950994
2951250
2951506
2952018
2952786
2953810
2954322
2949718
2949974
2950998
2951254
2951510
2952022
2952790
2953814
2954326
2949719
2949975
2950999
2951255
2951511
2952023
2952791
2953815
2954327
2949721
2949977
2951001
2951257
2951513
2952025
2952793
2953817
2954329
2949722
2949978
2951002
2951258
2951514
2952026
2952794
2953818
2954330
2954752
2955008
2963200
2963456
2970624
2970880
2954847
2955103
2963295
2963551
2970719
2970975
3020288
3020544
3028736
3028992
3036160
3036416
3020383
3020639
3028831
3029087
3036255
3036511
3081029
3081541
3084357
3084869
3085125
3086405
3086661
3087429
3087941
3081030
3081542
3084358
3084870
3085126
3086406
3086662
3087430
3087942
3081031
3081543
3084359
3084871
3085127
3086407
3086663
3087431
3087943
3081032
3081544
3084360
3084872
3085128
3086408
3086664
3087432
3087944
3081033
3081545
3084361
3084873
3085129
3086409
3086665
3087433
3087945
3081034
3081546
3084362
3084874
3085130
3086410
3086666
3087434
3087946
3081035
3081547
3084363
3084875
3085131
3086411
3086667
3087435
3087947
3081036
3081548
3084364
3084876
3085132
3086412
3086668
3087436
3087948
3081037
3081549
3084365
3084877
3085133
3086413
3086669
3087437
3087949
3081038
3081550
3084366
3084878
3085134
3086414
3086670
3087438
3087950
3081039
3081551
3084367
3084879
3085135
3086415
3086671
3087439
3087951
3081040
3081552
3084368
3084880
3085136
3086416
3086672
3087440
3087952
3081041
3081553
3084369
3084881
3085137
3086417
3086673
3087441
3087953
3081042
3081554
3084370
3084882
3085138
3086418
3086674
3087442
3087954
3081043
3081555
3084371
3084883
3085139
3086419
3086675
3087443
3087955
3081044
3081556
3084372
3084884
3085140
3086420
3086676
3087444
3087956
3081561
3084377
3084889
3085145
3086425
3086681
3087449
3085824
3086080
3094272
3094528
3101696
3101952
3085919
3086175
3094367
3094623
3101791
3102047
3147076
3147588
3148612
3150404
3152196
3152964
3146309
3146565
3146821
3147077
3147589
3148613
3150405
3152197
3152965
3146310
3146566
3146822
3147078
3147590
3148614
3150406
3152198
3152966
3146311
3146567
3146823
3147079
3147591
3148615
3150407
3152199
3152967
3146312
3146568
3146824
3147080
3147592
3148616
3150408
3152200
3152968
3146313
3146569
3146825
3147081
3147593
3148617
3150409
3152201
3152969
3146314
3146570
3146826
3147082
3147594
3148618
3150410
3152202
3152970
3146315
3146571
3146827
3147083
3147595
3148619
3150411
3152203
3152971
3146316
3146572
3146828
3147084
3147596
3148620
3150412
3152204
3152972
3146317
3146573
3146829
3147085
3147597
3148621
3150413
3152205
3152973
3146318
3146574
3146830
3147086
3147598
3148622
3150414
3152206
3152974
3146319
3146575
3146831
3147087
3147599
3148623
3150415
3152207
3152975
3146320
3146576
3146832
3147088
3147600
3148624
3150416
3152208
3152976
3146321
3146577
3146833
3147089
3147601
3148625
3150417
3152209
3152977
3146322
3146578
3146834
3147090
3147602
3148626
3150418
3152210
3152978
3146323
3146579
3146835
3147091
3147603
3148627
3150419
3152211
3152979
3146324
3146580
3146836
3147092
3147604
3148628
3150420
3152212
3152980
3146325
3146581
3146837
3147093
3147605
3148629
3150421
3152213
3152981
3146582
3146838
3147094
3147606
3148630
3150422
3152214
3152982
3146583
3146839
3147095
3147607
3148631
3150423
3152215
3152983
3146584
3146840
3147096
3147608
3148632
3150424
3152216
3152984
3146841
3147097
3147609
3148633
3150425
3152217
3152985
3151360
3151616
3159808
3160064
3167232
3167488
3151455
3151711
3159903
3160159
3167327
3167583
3212101
3213381
3214917
3215941
3216709
3216965
3217221
3217989
3219013
3212102
3213382
3214918
3215942
3216710
3216966
3217222
3217990
3219014
3212103
3213383
3214919
3215943
3216711
3216967
3217223
3217991
3219015
3212104
3213384
3214920
3215944
3216712
3216968
3217224
3217992
3219016
3212106
3213386
3214922
3215946
3216714
3216970
3217226
3217994
3219018
3212107
3213387
3214923
3215947
3216715
3216971
3217227
3217995
3219019
3212108
3213388
3214924
3215948
3216716
3216972
3217228
3217996
3219020
3212110
3213390
3214926
3215950
3216718
3216974
3217230
3217998
3219022
3212111
3213391
3214927
3215951
3216719
3216975
3217231
3217999
3219023
3212112
3213392
3214928
3215952
3216720
3216976
3217232
3218000
3219024
3212113
3213393
3214929
3215953
3216721
3216977
3217233
3218001
3219025
3212114
3213394
3214930
3215954
3216722
3216978
3217234
3218002
3219026
3212115
3213395
3214931
3215955
3216723
3216979
3217235
3218003
3219027
3212116
3213396
3214932
3215956
3216724
3216980
3217236
3218004
3219028
3212117
3213397
3214933
3215957
3216725
3216981
3217237
3218005
3219029
3212118
3213398
3214934
3215958
3216726
3216982
3217238
3218006
3219030
3212119
3213399
3214935
3215959
3216727
3216983
3217239
3218007
3219031
3212120
3213400
3214936
3215960
3216728
3216984
3217240
3218008
3219032
3212121
3213401
3214937
3215961
3216729
3216985
3217241
3218009
3219033
3212122
3213402
3214938
3215962
3216730
3216986
3217242
3218010
3219034
3216896
3217152
3225344
3225600
3232768
3233024
3216991
3217247
3225439
3225695
3232863
3233119
3278916
3279684
3283012
3284292
3277381
3277637
3278917
3279685
3282245
3283013
3284037
3284293
3277382
3277638
3278918
3279686
3282246
3283014
3284038
3284294
3277383
3277639
3278919
3279687
3282247
3283015
3284039
3284295
3277384
3277640
3278920
3279688
3282248
3283016
3284040
3284296
3277385
3277641
3278921
3279689
3282249
3283017
3284041
3284297
3277386
3277642
3278922
3279690
3282250
3283018
3284042
3284298
3277387
3277643
3278923
3279691
3282251
3283019
3284043
3284299
3277388
3277644
3278924
3279692
3282252
3283020
3284044
3284300
3277389
3277645
3278925
3279693
3282253
3283021
3284045
3284301
3277390
3277646
3278926
3279694
3282254
3283022
3284046
3284302
3277391
3277647
3278927
3279695
3282255
3283023
3284047
3284303
3277392
3277648
3278928
3279696
3282256
3283024
3284048
3284304
3277393
3277649
3278929
3279697
3282257
3283025
3284305
3277394
3277650
3278930
3279698
3282258
3283026
3284050
3284306
3277395
3277651
3278931
3279699
3282259
3283027
3284051
3284307
3277396
3277652
3278932
3279700
3282260
3283028
3284052
3284308
3277397
3277653
3278933
3279701
3282261
3283029
3284053
3284309
3277398
3277654
3278934
3279702
3282262
3283030
3284054
3284310
3277399
3277655
3278935
3279703
3282263
3283031
3284055
3284311
3277401
3277657
3278937
3279705
3282265
3283033
3284057
3284313
3282432
3282688
3290880
3291136
3298304
3298560
3282527
3282783
3290975
3291231
3298399
3298655
3342917
3343173
3346501
3347781
3349573
3349829
3350085
3342918
3343174
3346502
3347782
3349574
3349830
3350086
3342919
3343175
3346503
3347783
3349575
3349831
3350087
3342920
3343176
3346504
3347784
3349576
3349832
3350088
3342921
3343177
3346505
3347785
3349577
3349833
3350089
3342922
3343178
3346506
3347786
3349578
3349834
3350090
3342923
3343179
3346507
3347787
3349579
3349835
3350091
3342924
3343180
3346508
3347788
3349580
3349836
3350092
3342925
3343181
3346509
3347789
3349581
3349837
3350093
3342926
3343182
3346510
3347790
3349582
3349838
3350094
3342927
3343183
3346511
3347791
3349583
3349839
3350095
3342928
3343184
3346512
3347792
3349584
3349840
3350096
3342929
3343185
3346513
3347793
3349585
3349841
3350097
3342930
3343186
3346514
3347794
3349586
3349842
3350098
3342931
3343187
3346515
3347795
3349587
3349843
3350099
3342932
3343188
3346516
3347796
3349588
3349844
3350100
3342933
3343189
3346517
3347797
3349589
3349845
3350101
3342934
3343190
3346518
3347798
3349590
3349846
3350102
3342935
3343191
3346519
3347799
3349591
3349847
3350103
3342936
3343192
3346520
3347800
3349592
3349848
3350104
3342937
3343193
3346521
3347801
3349593
3349849
3350105
3342938
3343194
3346522
3347802
3349594
3349850
3350106
3342939
3343195
3346523
3347803
3349595
3349851
3350107
3346524
3347804
3349596
3349852
3350108
3343197
3347968
3348224
3356416
3356672
3363840
3364096
3348063
3348319
3356511
3356767
3363935
3364191
3413504
3413760
3421952
3422208
3429376
3429632
3413599
3413855
3422047
3422303
3429471
3429727
3479040
3479296
3487488
3487744
3494912
3495168
3479135
3479391
3487583
3487839
3495007
3495263
