0 0 1.0 0.0 0.0
0 1 0.775296560864 0.899189889431 1.43443441391
0 2 1.0 0.0 0.0
1 0 1.0 0.0 0.0
1 1 0.725225254822 0.893522620201 1.54319763184
1 2 1.0 0.0 0.0
2 0 1.0 0.0 0.0
2 1 0.731738843296 0.896643102169 1.52413797379
2 2 1.0 0.0 0.0
3 0 1.0 0.0 0.0
3 1 0.542446042235 0.916887700558 2.010607481
3 2 1.0 0.0 0.0
4 0 1.0 0.0 0.0
4 1 0.709160817867 0.910569131374 1.54861116409
4 2 1.0 0.0 0.0
5 0 1.0 0.0 0.0
5 1 0.626194501861 0.938061058521 1.70239233971
5 2 1.0 0.0 0.0
6 0 1.0 0.0 0.0
6 1 0.601608576704 0.931372523308 1.78468894958
6 2 1.0 0.0 0.0
7 0 1.0 0.0 0.0
7 1 0.640380303977 0.89519649744 1.74439024925
7 2 1.0 0.0 0.0
8 0 1.0 0.0 0.0
8 1 0.676014296489 0.910856127739 1.62403106689
8 2 1.0 0.0 0.0
9 0 1.0 0.0 0.0
9 1 0.698891610584 0.910132169724 1.57212007046
9 2 1.0 0.0 0.0
10 0 1.0 0.0 0.0
10 1 0.67491166362 0.918848156929 1.61253559589
10 2 1.0 0.0 0.0
11 0 1.0 0.0 0.0
11 1 0.653234945069 0.939183294773 1.62997221947
11 2 1.0 0.0 0.0
12 0 1.0 0.0 0.0
12 1 0.593412257291 0.95490026474 1.76475930214
12 2 1.0 0.0 0.0
13 0 1.0 0.0 0.0
13 1 0.666080831165 0.936675488949 1.60281693935
13 2 1.0 0.0 0.0
14 0 1.0 0.0 0.0
14 1 0.689489515554 0.914634168148 1.58571434021
14 2 1.0 0.0 0.0
15 0 1.0 0.0 0.0
15 1 0.816442274863 0.856770813465 1.42958462238
15 2 1.0 0.0 0.0
16 0 1.0 0.0 0.0
16 1 0.621651160109 0.940193474293 1.71094477177
16 2 1.0 0.0 0.0
17 0 1.0 0.0 0.0
17 1 0.618681332216 0.954706907272 1.6930232048
17 2 1.0 0.0 0.0
18 0 1.0 0.0 0.0
18 1 0.602099717225 0.931124687195 1.78370785713
18 2 1.0 0.0 0.0
19 0 1.0 0.0 0.0
19 1 0.722327613828 0.916812598705 1.51002860069
19 2 1.0 0.0 0.0
20 0 1.0 0.0 0.0
20 1 0.663176257544 0.921052634716 1.63714289665
20 2 1.0 0.0 0.0
21 0 1.0 0.0 0.0
21 1 0.595050008101 0.955752193928 1.75833332539
21 2 1.0 0.0 0.0
22 0 1.0 0.0 0.0
22 1 0.72450919528 0.876748263836 1.57427716255
22 2 1.0 0.0 0.0
23 0 1.0 0.0 0.0
23 1 0.665469785792 0.952338159084 1.57790362835
23 2 1.0 0.0 0.0
24 0 1.0 0.0 0.0
24 1 0.678982435476 0.905441582203 1.62660098076
24 2 1.0 0.0 0.0
25 0 1.0 1.0 1.0
25 1 0.71897570016 0.93242007494 1.49167478085
25 2 1.0 1.0 1.0
26 0 1.0 1.0 1.0
26 1 1.02173912779 0.742021262646 1.31899642944
26 2 1.0 0.0 0.0
27 0 1.0 0.0 0.0
27 1 0.712807252637 0.897459149361 1.56319510937
27 2 1.0 1.0 1.0
28 0 1.0 1.0 1.0
28 1 0.776086930979 0.860877692699 1.49674618244
28 2 2.0 0.5 1.0
29 0 1.0 1.0 1.0
29 1 0.649836088636 0.952573180199 1.61546611786
29 2 0.5 1.0 2.0
30 0 0.5 1.0 2.0
30 1 0.51542912632 0.96725910902 2.00580263138
30 2 1.4999999553 0.333333343267 2.0
31 0 0.25 1.0 4.0
31 1 0.402731616788 0.970669090748 2.55807375908
31 2 0.5 1.0 2.0
32 0 0.5 1.0 2.0
32 1 1.01008251299 0.66606169939 1.48637604713
32 2 0.571428571429 1.0 1.75
33 0 1.0 1.0 1.0
33 1 0.549689423085 0.969868183136 1.87572813034
33 2 2.0 0.5 1.0
34 0 1.0 1.0 1.0
34 1 0.67525126695 0.9460465312 1.56538844109
34 2 0.624999990687 1.0 1.60000002384
35 0 1.0 1.0 1.0
35 1 0.705921518459 0.921771883965 1.53680980206
35 2 0.583333327538 0.857142865658 2.0
36 0 1.0 1.0 1.0
36 1 0.583112052278 0.95537340641 1.79504287243
36 2 1.33333333333 0.625 1.20000004768
37 0 1.0 0.0 0.0
37 1 0.752433908701 0.914972245693 1.45252525806
37 2 0.769230797446 0.899999976158 1.44444441795
38 0 1.0 0.0 0.0
38 1 1.33535107215 0.620126903057 1.20760238171
38 2 1.0 0.857142865658 1.16666662693
39 0 0.5 1.0 2.0
39 1 0.71093224022 0.909433960915 1.54668045044
39 2 0.941176470588 0.8125 1.30769228935
40 0 0.428571443168 1.0 2.33333325386
40 1 0.757641892212 0.889529287815 1.48380124569
40 2 0.944444394406 0.882352948189 1.20000004768
41 0 1.66666660044 0.600000023842 1.0
41 1 0.675712350414 0.947791159153 1.56144070625
41 2 9.66666635457 0.103448279202 1.0
42 0 0.83333330022 0.800000011921 1.5
42 1 0.660450161632 0.925998032093 1.63512086868
42 2 0.852941152546 0.793103456497 1.47826087475
43 0 0.749999977648 1.0 1.33333337307
43 1 0.706174615031 0.902512550354 1.56904232502
43 2 1.14285714286 0.75 1.16666662693
44 0 0.571428571429 1.0 1.75
44 1 0.809210517431 0.848577260971 1.45628738403
44 2 0.71428572645 1.0 1.39999997616
45 0 1.0 1.0 1.0
45 1 0.710102464727 0.911340177059 1.54524886608
45 2 0.933333363003 0.714285731316 1.5
46 0 1.0 0.5 2.0
46 1 0.656472258897 0.913326084614 1.66785287857
46 2 29.000000108 0.0344827584922 1.0
47 0 1.0 1.0 1.0
47 1 1.02040814341 0.774444460869 1.26542329788
47 2 3.87500011548 0.225806444883 1.14285719395
48 0 1.0 0.75 1.33333337307
48 1 0.563987124169 0.950969219208 1.86450839043
48 2 1.15789472231 0.681818187237 1.26666665077
49 0 0.571428571429 1.0 1.75
49 1 1.08951705475 0.696216225624 1.31832301617
49 2 1.0 0.666666686535 1.5
50 0 1.0 1.0 1.0
50 1 0.893794767077 0.826435267925 1.35379648209
50 2 0.923076889219 0.75 1.44444441795
51 0 1.33333333333 0.75 1.0
51 1 0.684865895456 0.927272737026 1.57466065884
51 2 0.705882372741 0.833333313465 1.70000004768
52 0 5.99999982119 0.166666671634 1.0
52 1 0.589344278362 0.905424177647 1.87403988838
52 2 2.88888881236 0.230769231915 1.5
53 0 1.0 0.0 0.0
53 1 1.0 0.0 0.0
53 2 1.0 0.0 0.0
