1064752
1128231
1129770
1255971
1255206
1387567
1522735
1584160
1583394
1584162
1583139
1583651
1583907
1584419
1583396
1584676
1583398
1583654
1583911
1585707
1653808
1779751
1787436
1787437
1846843
2700080
2700081
2764349
3029039
3029040
3090737
3090738
3090740
3090485
3090997
3090742
3090998
3091254
3092022
3092534
3091255
3092535
3090232
3090488
3091256
3094329
3358513
3358514
3358515
