1132122
1137242
2572635
2906709
2905434
2905436
3097665
3097154
3099458
3097667
3097668
3098189
3099472
3096913
3097171
3099475
3097684
3097174
3097686
3098710
3099222
3097175
3097431
3097687
3096920
3097176
3297883
