140849
601135
863040
1064752
1255971
1254185
1387567
1522735
1584160
1583394
1584162
1583139
1583651
1583907
1584419
1583396
1584676
1583398
1583654
1583911
1585707
1653808
1654326
1779751
1785401
1846843
1910309
2564400
2629680
2639920
2703152
2703154
2765851
2766108
2768681
2762035
2761015
2764349
2763070
2764606
2958127
2958383
3030312
3029039
3029040
3090740
3090485
3090997
3090742
3092022
3091255
3090232
3091256
3090233
3091769
3094329
3089730
3157569
