0 0 0.899999957085 0.777777791023 1.42857146263
0 1 0.7722071243 0.898397684097 1.44144332409
0 2 0.666666666667 0.916666686535 1.63636362553
1 0 1.27272730031 0.571428596973 1.375
1 1 0.648428100967 0.939119160175 1.642167449
1 2 0.545454533632 0.916666686535 2.0
2 0 0.470588235294 1.0 2.125
2 1 0.662810612671 0.936466872692 1.61108374596
2 2 0.619047633104 0.923076927662 1.75
3 0 0.899999957085 0.888888895512 1.25
3 1 0.607631891582 0.933413386345 1.76313447952
3 2 0.555555570273 0.800000011921 2.25
4 0 0.642857131909 0.888888895512 1.75
4 1 0.683562006062 0.915814876556 1.59740257263
4 2 0.58620691101 0.941176474094 1.8125
5 0 0.533333333333 1.0 1.875
5 1 0.630207720582 0.935288667679 1.69656550884
5 2 0.566666662163 0.823529422283 2.14285707474
6 0 11.9999996424 0.0833333358169 1.0
6 1 0.574541413845 0.935406506062 1.8607083559
6 2 0.541666663976 1.0 1.84615385532
7 0 0.8 0.875 1.42857146263
7 1 0.652559246304 0.89356982708 1.7149503231
7 2 0.470588235294 1.0 2.125
8 0 0.647058841679 0.636363625526 2.42857146263
8 1 0.716174029628 0.897143363953 1.55639410019
8 2 0.692307705005 0.777777791023 1.85714280605
9 0 0.733333327505 1.0 1.36363637447
9 1 0.709342337303 0.916239142418 1.53863382339
9 2 0.818181827049 0.722222208977 1.69230771065
10 0 0.549999983609 1.0 1.81818187237
10 1 0.630609180848 0.92091435194 1.72194969654
10 2 0.629629643529 0.882352948189 1.79999995232
11 0 0.733333327505 0.818181812763 1.66666662693
11 1 0.64992570713 0.926566064358 1.66058039665
11 2 0.652173926564 0.933333337307 1.64285719395
12 0 0.687499979511 1.0 1.45454549789
12 1 0.563404884194 0.956442475319 1.85575461388
12 2 0.882352947364 0.866666674614 1.30769228935
13 0 0.611111115158 1.0 1.63636362553
13 1 0.693789085871 0.925551474094 1.5572988987
13 2 1.08333332795 0.769230782986 1.20000004768
14 0 0.733333327505 1.0 1.36363637447
14 1 0.69493572062 0.904055655003 1.59169614315
14 2 0.8 1.0 1.25
15 0 1.33333333333 0.666666686535 1.125
15 1 0.733423025716 0.887309730053 1.5366332531
15 2 0.866666673554 0.923076927662 1.25
16 0 0.687499979511 1.0 1.45454549789
16 1 0.618882303433 0.942620694637 1.71417427063
16 2 0.928571381131 0.846153855324 1.27272725105
17 0 0.611111115158 0.909090936184 1.79999995232
17 1 0.630794212213 0.941414535046 1.68395853043
17 2 0.8 0.916666686535 1.36363637447
18 0 1.20000002861 0.75 1.11111116409
18 1 0.564878015932 0.95515692234 1.85340619087
18 2 0.8 1.0 1.25
19 0 0.916666639348 1.0 1.09090912342
19 1 0.747230068896 0.89565294981 1.49419021606
19 2 1.08333332795 0.846153855324 1.09090912342
20 0 1.0 0.818181812763 1.22222220898
20 1 0.685010687613 0.919937610626 1.5868806839
20 2 1.07692310655 0.857142865658 1.08333337307
21 0 0.84615388495 0.909090936184 1.29999995232
21 1 0.576966085409 0.953119218349 1.81845474243
21 2 0.649999988377 1.0 1.53846156597
22 0 0.705882372741 0.916666686535 1.54545450211
22 1 0.793785304586 0.859932482243 1.46498298645
22 2 0.649999988377 1.0 1.53846156597
23 0 1.0 0.833333313465 1.20000004768
23 1 0.645761810145 0.940013051033 1.64737987518
23 2 0.666666666667 1.0 1.5
24 0 2.0 0.416666656733 1.20000004768
24 1 0.680138067426 0.894537746906 1.64363074303
24 2 1.0 0.785714268684 1.27272725105
25 0 0.684210539194 0.923076927662 1.58333337307
25 1 0.711133295445 0.929245710373 1.51327705383
25 2 0.874999960884 0.857142865658 1.33333337307
26 0 0.699999983311 0.928571403027 1.53846156597
26 1 0.941934423299 0.787707448006 1.34776568413
26 2 0.555555570273 1.0 1.79999995232
27 0 0.631578931518 1.0 1.58333337307
27 1 0.66067455906 0.918747067451 1.64746594429
27 2 0.849999964535 0.941176474094 1.25
28 0 0.764705893078 0.923076927662 1.41666662693
28 1 0.703061456511 0.895171225071 1.58891475201
28 2 0.789473694117 0.933333337307 1.35714280605
29 0 0.705882372741 1.0 1.41666662693
29 1 0.651796759512 0.947868704796 1.61860024929
29 2 0.941176470588 0.75 1.41666662693
30 0 1.36363633408 0.666666686535 1.10000002384
30 1 0.471192233284 0.971643328667 2.18421316147
30 2 1.0 0.722222208977 1.3846154213
31 0 1.16666665508 0.785714268684 1.09090912342
31 1 0.396053575347 0.971998512745 2.59764909744
31 2 0.749999977648 0.944444417953 1.41176474094
32 0 2.14285713373 0.466666668653 1.0
32 1 0.867501447024 0.757924556732 1.52091109753
32 2 0.606060614818 1.0 1.64999997616
33 0 0.520000014877 1.0 1.92307686806
33 1 0.531712804368 0.97445255518 1.93002164364
33 2 0.769230797446 0.899999976158 1.44444441795
34 0 0.555555570273 1.0 1.79999995232
34 1 0.733980171372 0.921635746956 1.47827875614
34 2 0.840000008011 0.904761910439 1.31578946114
35 0 0.736842133002 1.0 1.35714280605
35 1 0.724570836479 0.909814596176 1.5169326067
35 2 0.8 0.850000023842 1.47058820724
36 0 0.882352947364 0.866666674614 1.30769228935
36 1 0.581722034551 0.958314180374 1.79381048679
36 2 0.789473694117 1.0 1.26666665077
37 0 0.608695633245 0.928571403027 1.76923072338
37 1 0.75309664758 0.903703033924 1.4693441391
37 2 0.894736847719 0.941176474094 1.1875
38 0 1.14285714286 0.6875 1.27272725105
38 1 0.909196219544 0.802530944347 1.37050485611
38 2 0.823529400215 0.857142865658 1.41666662693
39 0 1.44999997407 0.620689630508 1.11111116409
39 1 0.706980990265 0.932292640209 1.51719009876
39 2 1.0 0.0 0.0
40 0 1.0 0.629629611969 1.58823525906
40 1 0.887165262954 0.826155006886 1.36437559128
40 2 1.0 1.0 1.0
41 0 1.09677422307 0.823529422283 1.10714280605
41 1 0.649975461098 0.955021202564 1.61097943783
41 2 1.0 0.0 0.0
42 0 1.11764707842 0.710526287556 1.25925922394
42 1 0.628317038322 0.933805704117 1.70437300205
42 2 1.37499995902 0.727272748947 1.0
43 0 0.760000007248 0.868421077728 1.5151515007
43 1 0.723145014894 0.894944906235 1.5451772213
43 2 1.22222223032 0.818181812763 1.0
44 0 0.725490189295 0.891891896725 1.54545450211
44 1 0.767119339133 0.871186435223 1.49632513523
44 2 0.916666639348 0.818181812763 1.33333337307
45 0 1.0 0.756097555161 1.32258069515
45 1 0.724511510546 0.896659433842 1.5393140316
45 2 0.71428572645 0.933333337307 1.5
46 0 1.29411768336 0.636363625526 1.21428573132
46 1 0.667276515955 0.928613424301 1.61383533478
46 2 1.0 0.0 0.0
47 0 1.17073168009 0.729166686535 1.17142856121
47 1 0.984565229996 0.775559902191 1.30960452557
47 2 0.947368397277 0.666666686535 1.58333337307
48 0 0.810810800361 0.733333349228 1.68181812763
48 1 0.572908996164 0.937333226204 1.86217439175
48 2 0.560000005341 0.928571403027 1.92307686806
49 0 0.826666640388 0.822580635548 1.47058820724
49 1 0.93233959153 0.747438967228 1.43499422073
49 2 0.483870982628 0.866666674614 2.3846154213
50 0 0.818181827049 0.85185188055 1.43478262424
50 1 0.848473066523 0.835625886917 1.41042518616
50 2 0.789473694117 0.800000011921 1.58333337307
51 0 0.861538474179 0.839285731316 1.38297867775
51 1 0.669060690285 0.94668918848 1.57879984379
51 2 0.83333330022 0.733333349228 1.63636362553
52 0 1.37499995902 0.54545456171 1.33333337307
52 1 0.559356954161 0.936104536057 1.90979444981
52 2 1.58333339625 0.421052634716 1.5
53 0 1.0 0.0 0.0
53 1 1.0 0.0 0.0
53 2 1.0 0.0 0.0
