140849
140594
863040
1129770
1254182
1254185
1259564
1387567
1450287
1522735
1583136
1584160
1583394
1584162
1583139
1583651
1583907
1584419
1583396
1584676
1583398
1583654
1583911
1585707
1653808
1654326
1785401
1846843
1910309
2307100
2368303
2368304
2564400
2563640
2629680
2639920
2628155
2694959
2694448
2694704
2694960
2700080
2765851
2766108
2768681
2761264
2762035
2764349
2763070
2764606
2958127
2958383
3090737
3089202
3090738
3090740
3089205
3090485
3090997
3090742
3091254
3092534
3091255
3091511
3092535
3091256
3090233
3091769
3091258
