3414064
3414320
3414576
3414832
3415088
3415344
3415600
3415856
3414065
3414321
3414577
3414833
3415089
3415345
3415601
3415857
3414066
3414322
3414578
3414834
3415090
3415346
3415602
3415858
3414067
3414323
3414579
3414835
3415091
3415347
3415603
3415859
3414068
3414324
3414580
3414836
3415092
3415348
3415604
3415860
3414069
3414325
3414581
3414837
3415093
3415349
3415605
3415861
3414070
3414326
3414582
3414838
3415094
3415350
3415606
3415862
3414071
3414327
3414583
3414839
3415095
3415351
3415607
3415863
