0 0 1.0 1.0 1.0
0 1 0.735936735785 0.914946258068 1.48512816429
0 2 1.0 1.0 1.0
1 0 1.0 1.0 1.0
1 1 0.628473698769 0.944047629833 1.6854621172
1 2 0.5 1.0 2.0
2 0 1.0 1.0 1.0
2 1 0.679872593913 0.935338199139 1.57254755497
2 2 1.0 1.0 1.0
3 0 2.0 0.5 1.0
3 1 0.565587175559 0.939852178097 1.88122570515
3 2 0.5 1.0 2.0
4 0 1.0 1.0 1.0
4 1 0.695136469065 0.911943733692 1.57747268677
4 2 0.4 1.0 2.5
5 0 1.0 0.5 2.0
5 1 0.620987056527 0.937757194042 1.71722435951
5 2 1.0 0.5 2.0
6 0 1.0 0.0 0.0
6 1 0.587315835605 0.929937958717 1.83094084263
6 2 0.5 1.0 2.0
7 0 1.0 0.0 0.0
7 1 0.643710301941 0.904162049294 1.71815872192
7 2 0.5 1.0 2.0
8 0 0.25 1.0 4.0
8 1 0.669314261121 0.920857191086 1.62247359753
8 2 0.666666666667 1.0 1.5
9 0 1.0 1.0 1.0
9 1 0.696018173486 0.917231321335 1.56639242172
9 2 0.333333333333 1.0 3.0
10 0 0.5 1.0 2.0
10 1 0.643788356948 0.928869247437 1.67225432396
10 2 1.0 1.0 1.0
11 0 0.5 1.0 2.0
11 1 0.64086136281 0.936239898205 1.66666662693
11 2 1.0 1.0 1.0
12 0 1.0 1.0 1.0
12 1 0.560214859016 0.95777964592 1.8637162447
12 2 0.666666666667 1.0 1.5
13 0 1.0 1.0 1.0
13 1 0.668576290758 0.939509630203 1.59201729298
13 2 1.0 1.0 1.0
14 0 1.0 1.0 1.0
14 1 0.710472398564 0.908319890499 1.54957985878
14 2 1.0 1.0 1.0
15 0 1.0 1.0 1.0
15 1 0.837551539434 0.841779112816 1.41837251186
15 2 0.666666666667 1.0 1.5
16 0 0.5 1.0 2.0
16 1 0.592495446245 0.951310873032 1.77415895462
16 2 0.5 1.0 2.0
17 0 0.5 1.0 2.0
17 1 0.637830766139 0.945816993713 1.65762925148
17 2 1.0 0.5 2.0
18 0 0.2 1.0 5.0
18 1 0.600478343544 0.947372853756 1.75784957409
18 2 0.666666666667 0.5 3.0
19 0 1.0 0.0 0.0
19 1 0.699905134185 0.920718252659 1.55179393291
19 2 2.0 0.5 1.0
20 0 1.0 0.0 0.0
20 1 0.66285905918 0.938334167004 1.60776019096
20 2 1.0 0.0 0.0
21 0 1.0 0.0 0.0
21 1 0.580086362154 0.956095099449 1.80304372311
21 2 1.0 0.0 0.0
22 0 0.166666666667 1.0 6.0
22 1 0.790139011247 0.864645302296 1.46372175217
22 2 1.0 1.0 1.0
23 0 1.0 0.0 0.0
23 1 0.630829362422 0.951196730137 1.66654765606
23 2 1.0 1.0 1.0
24 0 1.0 0.0 0.0
24 1 0.64020792886 0.924475669861 1.68959844112
24 2 0.25 1.0 4.0
25 0 1.0 0.0 0.0
25 1 0.690201648844 0.946624398232 1.53054571152
25 2 1.0 1.0 1.0
26 0 0.5 1.0 2.0
26 1 0.983393944993 0.779131293297 1.30515420437
26 2 0.5 1.0 2.0
27 0 1.0 0.0 0.0
27 1 0.657924569411 0.919672846794 1.65268671513
27 2 0.5 1.0 2.0
28 0 0.5 1.0 2.0
28 1 0.730378295998 0.901171505451 1.51930403709
28 2 0.5 1.0 2.0
29 0 1.0 1.0 1.0
29 1 0.629531833518 0.964435517788 1.64705884457
29 2 0.5 1.0 2.0
30 0 0.5 1.0 2.0
30 1 0.475193286778 0.972825586796 2.16319036484
30 2 1.0 1.0 1.0
31 0 1.0 1.0 1.0
31 1 0.366452475546 0.976969361305 2.79319572449
31 2 1.0 1.0 1.0
32 0 0.5 1.0 2.0
32 1 1.01251667414 0.634052276611 1.55766034126
32 2 1.0 1.0 1.0
33 0 1.0 1.0 1.0
33 1 0.541901631957 0.975839316845 1.89104223251
33 2 1.0 1.0 1.0
34 0 1.0 1.0 1.0
34 1 0.702828428036 0.933822214603 1.52365446091
34 2 1.0 1.0 1.0
35 0 0.5 1.0 2.0
35 1 0.753837638844 0.906163990498 1.4639133215
35 2 1.0 1.0 1.0
36 0 0.5 1.0 2.0
36 1 0.582859718864 0.954439580441 1.79757702351
36 2 1.0 1.0 1.0
37 0 1.0 0.0 0.0
37 1 0.731436479677 0.923753678799 1.48001861572
37 2 1.0 1.0 1.0
38 0 1.0 0.0 0.0
38 1 1.8236540439 0.46342676878 1.1832498312
38 2 1.4999999553 0.666666686535 1.0
39 0 1.0 0.0 0.0
39 1 0.682182399327 0.946104705334 1.54938840866
39 2 0.666666666667 1.0 1.5
40 0 1.0 0.0 0.0
40 1 0.733396607666 0.904527842999 1.50743710995
40 2 0.83333330022 1.0 1.20000004768
41 0 1.0 0.0 0.0
41 1 0.689812297982 0.953324556351 1.52064669132
41 2 1.33333333333 0.625 1.20000004768
42 0 1.0 0.0 0.0
42 1 0.578673269006 0.952228784561 1.81478536129
42 2 0.692307705005 1.0 1.44444441795
43 0 0.666666666667 1.0 1.5
43 1 0.676374315894 0.912356674671 1.62049710751
43 2 1.0 0.75 1.33333337307
44 0 0.666666666667 1.0 1.5
44 1 0.733258520978 0.886564612389 1.53826975822
44 2 0.71428572645 1.0 1.39999997616
45 0 0.666666666667 1.0 1.5
45 1 0.639824950236 0.935191512108 1.67123794556
45 2 0.749999977648 0.833333313465 1.60000002384
46 0 1.0 1.0 1.0
46 1 0.699823271558 0.884776175022 1.61502110958
46 2 2.99999991059 0.166666671634 2.0
47 0 1.4999999553 0.666666686535 1.0
47 1 0.902879371552 0.82812088728 1.33744680882
47 2 1.33333333333 0.75 1.0
48 0 1.0 0.666666686535 1.5
48 1 0.51758431268 0.941746711731 2.05156254768
48 2 0.83333330022 0.600000023842 2.0
49 0 1.4999999553 0.666666686535 1.0
49 1 1.02433898718 0.69743591547 1.39975488186
49 2 2.0 0.5 1.0
50 0 0.333333333333 1.0 3.0
50 1 0.829301442275 0.840736925602 1.43425858021
50 2 0.5 1.0 2.0
51 0 0.666666666667 1.0 1.5
51 1 0.644593773221 0.950139701366 1.63277542591
51 2 1.0 0.0 0.0
52 0 4.0 0.25 1.0
52 1 0.535072383897 0.938190996647 1.99203145504
52 2 1.0 0.0 0.0
53 0 1.0 0.0 0.0
53 1 1.0 0.0 0.0
53 2 1.0 0.0 0.0
