2107440
2107696
2107952
2108208
2108464
2108720
2108976
2109232
2107441
2107697
2107953
2108209
2108465
2108721
2108977
2109233
2107442
2107698
2107954
2108210
2108466
2108722
2108978
2109234
2107443
2107699
2107955
2108211
2108467
2108723
2108979
2109235
2107444
2107700
2107956
2108212
2108468
2108724
2108980
2109236
2107445
2107701
2107957
2108213
2108469
2108725
2108981
2109237
2107446
2107702
2107958
2108214
2108470
2108726
2108982
2109238
2107447
2107703
2107959
2108215
2108471
2108727
2108983
2109239
2230280
2230536
2230792
2231048
2231304
2231560
2231816
2232072
2230281
2230537
2230793
2231049
2231305
2231561
2231817
2232073
2230282
2230538
2230794
2231050
2231306
2231562
2231818
2232074
2230283
2230539
2230795
2231051
2231307
2231563
2231819
2232075
2230284
2230540
2230796
2231052
2231308
2231564
2231820
2232076
2230285
2230541
2230797
2231053
2231309
2231565
2231821
2232077
2230286
2230542
2230798
2231054
2231310
2231566
2231822
2232078
2230287
2230543
2230799
2231055
2231311
2231567
2231823
2232079
3031040
3031296
3031552
3031808
3032064
3032320
3032576
3032832
3031041
3031297
3031553
3031809
3032065
3032321
3032577
3032833
3031042
3031298
3031554
3031810
3032066
3032322
3032578
3032834
3031043
3031299
3031555
3031811
3032067
3032323
3032579
3032835
3031044
3031300
3031556
3031812
3032068
3032324
3032580
3032836
3031045
3031301
3031557
3031813
3032069
3032325
3032581
3032837
3031046
3031302
3031558
3031814
3032070
3032326
3032582
3032838
3031047
3031303
3031559
3031815
3032071
3032327
3032583
3032839
