1323040
1323296
1323552
1323808
1324064
1324320
1324576
1324832
1323041
1323297
1323553
1323809
1324065
1324321
1324577
1324833
1323042
1323298
1323554
1323810
1324066
1324322
1324578
1324834
1323043
1323299
1323555
1323811
1324067
1324323
1324579
1324835
1323044
1323300
1323556
1323812
1324068
1324324
1324580
1324836
1323045
1323301
1323557
1323813
1324069
1324325
1324581
1324837
1323046
1323302
1323558
1323814
1324070
1324326
1324582
1324838
1323047
1323303
1323559
1323815
1324071
1324327
1324583
1324839
2373672
2373928
2374184
2374440
2374696
2374952
2375208
2375464
2373673
2373929
2374185
2374441
2374697
2374953
2375209
2375465
2373674
2373930
2374186
2374442
2374698
2374954
2375210
2375466
2373675
2373931
2374187
2374443
2374699
2374955
2375211
2375467
2373676
2373932
2374188
2374444
2374700
2374956
2375212
2375468
2373677
2373933
2374189
2374445
2374701
2374957
2375213
2375469
2373678
2373934
2374190
2374446
2374702
2374958
2375214
2375470
2373679
2373935
2374191
2374447
2374703
2374959
2375215
2375471
3414064
3414320
3414576
3414832
3415088
3415344
3415600
3415856
3414065
3414321
3414577
3414833
3415089
3415345
3415601
3415857
3414066
3414322
3414578
3414834
3415090
3415346
3415602
3415858
3414067
3414323
3414579
3414835
3415091
3415347
3415603
3415859
3414068
3414324
3414580
3414836
3415092
3415348
3415604
3415860
3414069
3414325
3414581
3414837
3415093
3415349
3415605
3415861
3414070
3414326
3414582
3414838
3415094
3415350
3415606
3415862
3414071
3414327
3414583
3414839
3415095
3415351
3415607
3415863
