532480
532736
532992
533248
533504
533760
534016
534272
532481
532737
532993
533249
533505
533761
534017
534273
532482
532738
532994
533250
533506
533762
534018
534274
532483
532739
532995
533251
533507
533763
534019
534275
532484
532740
532996
533252
533508
533764
534020
534276
532485
532741
532997
533253
533509
533765
534021
534277
532486
532742
532998
533254
533510
533766
534022
534278
532487
532743
532999
533255
533511
533767
534023
534279
