0 0 2.99999991059 0.166666671634 2.0
0 1 1.59461141007 0.539836227894 1.16167092323
0 2 0.866666673554 0.923076927662 1.25
1 0 0.666666666667 1.0 1.5
1 1 0.586333642858 0.951739013195 1.79199719429
1 2 0.695652173913 1.0 1.4375
2 0 0.555555570273 0.800000011921 2.25
2 1 0.614419950648 0.951161980629 1.71111893654
2 2 0.937499951106 0.866666674614 1.23076927662
3 0 1.4999999553 0.666666686535 1.0
3 1 0.564869343366 0.948997318745 1.86546456814
3 2 0.764705893078 0.923076927662 1.41666662693
4 0 1.0 0.75 1.33333337307
4 1 0.606882641325 0.936508953571 1.75947606564
4 2 0.705882372741 1.0 1.41666662693
5 0 0.8 1.0 1.25
5 1 0.567502883481 0.952104866505 1.85074734688
5 2 0.923076889219 0.916666686535 1.18181812763
6 0 4.99999992549 0.20000000298 1.0
6 1 0.533837485123 0.941510558128 1.98959994316
6 2 0.8 1.0 1.25
7 0 0.5 0.800000011921 2.5
7 1 0.57678625588 0.922511637211 1.87937414646
7 2 0.866666673554 0.846153855324 1.36363637447
8 0 0.545454533632 1.0 1.83333337307
8 1 0.479181725695 0.965623378754 2.16118526459
8 2 0.583333327538 0.928571403027 1.84615385532
9 0 0.874999960884 0.714285731316 1.60000002384
9 1 0.610687316322 0.940269768238 1.74152064323
9 2 0.77777778808 1.0 1.28571426868
10 0 0.77777778808 0.857142865658 1.5
10 1 0.558506581218 0.944910049438 1.89487791061
10 2 0.624999990687 0.866666674614 1.84615385532
11 0 0.77777778808 0.857142865658 1.5
11 1 0.558506246554 0.950397849083 1.88393759727
11 2 0.933333363003 0.857142865658 1.25
12 0 1.20000002861 0.833333313465 1.0
12 1 0.631812877037 0.927868008614 1.7057890892
12 2 0.72222220309 1.0 1.3846154213
13 0 0.857142886337 1.0 1.16666662693
13 1 0.593972311907 0.953380525112 1.76590573788
13 2 0.77777778808 0.928571403027 1.3846154213
14 0 0.857142886337 0.833333313465 1.39999997616
14 1 0.620696569672 0.929436922073 1.73340773582
14 2 0.684210539194 0.923076927662 1.58333337307
15 0 1.0 0.800000011921 1.25
15 1 0.61946353974 0.93598395586 1.72470903397
15 2 0.77777778808 1.0 1.28571426868
16 0 1.0 1.0 1.0
16 1 0.530622303751 0.95989125967 1.96332621574
16 2 0.866666673554 0.769230782986 1.5
17 0 0.624999990687 0.600000023842 2.66666674614
17 1 0.55678958271 0.958178162575 1.87440145016
17 2 0.705882372741 0.916666686535 1.54545450211
18 0 1.0 0.0 0.0
18 1 1.20585039425 0.529566943645 1.56597816944
18 2 0.705882372741 1.0 1.41666662693
19 0 0.571428571429 0.75 2.33333325386
19 1 0.643166517528 0.934953153133 1.66297888756
19 2 0.812499969732 0.846153855324 1.45454549789
20 0 2.0 0.5 1.0
20 1 0.605127994267 0.950520992279 1.73856544495
20 2 0.764705893078 1.0 1.30769228935
21 0 0.8 0.75 1.66666662693
21 1 0.585973872405 0.934461355209 1.82625079155
21 2 0.928571381131 0.923076927662 1.16666662693
22 0 0.227272722347 1.0 4.40000009537
22 1 0.388208282991 0.848762512207 3.03493261337
22 2 0.590909084505 0.923076927662 1.83333337307
23 0 0.600000014305 1.0 1.66666662693
23 1 0.594214030042 0.954959750175 1.76226830482
23 2 0.666666666667 1.0 1.5
24 0 1.24999998137 0.600000023842 1.33333337307
24 1 0.587968065022 0.940214514732 1.80891978741
24 2 0.749999977648 0.916666686535 1.45454549789
25 0 2.0 0.333333343267 1.5
25 1 0.644253423308 0.956926107407 1.6220523119
25 2 0.812499969732 0.923076927662 1.33333337307
26 0 0.749999977648 0.666666686535 2.0
26 1 1.0 0.0 0.0
26 2 0.636363650156 0.928571403027 1.69230771065
27 0 0.454545444693 1.0 2.20000004768
27 1 0.579644562951 0.943576991558 1.82835650444
27 2 0.583333327538 1.0 1.71428573132
28 0 0.444444444444 1.0 2.25
28 1 0.653873000845 0.928331017494 1.64741778374
28 2 0.8 0.833333313465 1.5
29 0 0.5 1.0 2.0
29 1 0.613705730409 0.963003516197 1.69204521179
29 2 0.619047633104 0.923076927662 1.75
30 0 1.24999998137 0.800000011921 1.0
30 1 0.474262388302 0.96789264679 2.17848277092
30 2 1.55555557616 0.5 1.28571426868
31 0 0.624999990687 0.800000011921 2.0
31 1 0.435087231572 0.666817545891 3.44680428505
31 2 1.4999999553 0.533333361149 1.25
32 0 1.0 0.0 0.0
32 1 0.607796372542 0.945538163185 1.74005436897
32 2 0.636363650156 1.0 1.57142853737
33 0 0.571428571429 1.0 1.75
33 1 0.570058495397 0.964368760586 1.81901991367
33 2 0.72222220309 1.0 1.3846154213
34 0 0.749999977648 1.0 1.33333337307
34 1 0.618104841345 0.948764443398 1.70521616936
34 2 0.666666666667 0.9375 1.60000002384
35 0 0.600000014305 1.0 1.66666662693
35 1 0.573466321208 0.953066051006 1.82965445518
35 2 0.739130446275 0.882352948189 1.53333330154
36 0 1.16666665508 0.428571432829 2.0
36 1 0.833812399446 0.835291087627 1.43579947948
36 2 0.615384615385 0.875 1.85714280605
37 0 1.33333333333 0.75 1.0
37 1 0.643837867464 0.938570261002 1.65484261513
37 2 1.14285714286 0.8125 1.07692313194
38 0 1.0 0.0 0.0
38 1 0.519474162802 0.946112692356 2.03466629982
38 2 0.8 0.833333313465 1.5
39 0 1.0 0.833333313465 1.20000004768
39 1 0.627316548822 0.957306206226 1.66518449783
39 2 0.736842133002 0.928571403027 1.46153843403
40 0 0.857142886337 1.0 1.16666662693
40 1 0.687639067135 0.914466977119 1.59027194977
40 2 0.624999990687 1.0 1.60000002384
41 0 0.749999977648 1.0 1.33333337307
41 1 0.617959816665 0.962715089321 1.68090033531
41 2 8.99999993294 0.111111111939 1.0
42 0 1.0 0.857142865658 1.16666662693
42 1 0.539393513061 0.956027925014 1.93920493126
42 2 0.720000027466 0.888888895512 1.5625
43 0 0.769230797446 0.800000011921 1.625
43 1 0.601035887797 0.935691297054 1.77814435959
43 2 0.812499969732 0.846153855324 1.45454549789
44 0 0.857142886337 0.916666686535 1.27272725105
44 1 0.648845088402 0.913737595081 1.68669855595
44 2 1.0 1.0 1.0
45 0 1.0 0.769230782986 1.29999995232
45 1 0.584801260759 0.951921224594 1.79634892941
45 2 0.83333330022 0.800000011921 1.5
46 0 0.649999988377 0.846153855324 1.81818187237
46 1 0.562559522001 0.966013431549 1.84012937546
46 2 1.0 0.0 0.0
47 0 1.0 0.909090936184 1.10000002384
47 1 0.750790519388 0.892208456993 1.49284553528
47 2 6.333333585 0.105263158679 1.5
48 0 0.769230797446 0.800000011921 1.625
48 1 0.556515130336 0.929516851902 1.9331510067
48 2 0.478260889396 1.0 2.09090900421
49 0 0.83333330022 0.899999976158 1.33333337307
49 1 0.848293655794 0.737209737301 1.5990524292
49 2 0.888888888889 0.875 1.28571426868
50 0 1.0 0.75 1.33333337307
50 1 0.752764558092 0.866722464561 1.53271269798
50 2 0.666666666667 0.833333313465 1.79999995232
51 0 0.642857131909 0.888888895512 1.75
51 1 0.583805959414 0.961930334568 1.78068804741
51 2 0.636363650156 0.857142865658 1.83333337307
52 0 0.84615388495 0.727272748947 1.625
52 1 0.487712999958 0.937456965446 2.18717885017
52 2 1.72727273663 0.315789461136 1.83333337307
53 0 1.0 0.0 0.0
53 1 1.0 0.0 0.0
53 2 1.0 0.0 0.0
