140849
140594
601135
863040
1254182
1387567
1583136
1584160
1583394
1584162
1583139
1583651
1583907
1584419
1583396
1584676
1583398
1583654
1583911
1585707
1653808
1654326
1785401
1910309
2307100
2368303
2368304
2498356
2498101
2564399
2629680
2639920
2628155
2703152
2703154
2765851
2766108
2768681
2761264
2762035
2764349
2763070
2764606
2899759
2899760
2961432
2963224
2957353
2957357
2957613
2957359
2957615
2958127
2958383
3030312
3029039
3029040
3090737
3097137
3097393
3089202
3090738
3097394
3090740
3089205
3090485
3090997
3097141
3089462
3089974
3090742
3091254
3092534
3089719
3092535
3089208
3089464
3090232
3090233
3091769
3094329
3097401
3091258
3089467
3089468
3089982
3088959
3089983
3090239
3090240
3090496
3090243
3097668
3091013
3091014
3157569
