874496
874752
875008
875264
875520
875776
876032
876288
874497
874753
875009
875265
875521
875777
876033
876289
874498
874754
875010
875266
875522
875778
876034
876290
874499
874755
875011
875267
875523
875779
876035
876291
874500
874756
875012
875268
875524
875780
876036
876292
874501
874757
875013
875269
875525
875781
876037
876293
874502
874758
875014
875270
875526
875782
876038
876294
874503
874759
875015
875271
875527
875783
876039
876295
