210177
210945
601135
1387567
1583398
1583654
1585707
2040065
2040321
2040577
2040833
2041089
2041345
2041601
2041857
2042113
2042369
2042625
2042881
2043137
2043393
2043649
2040066
2040322
2040578
2040834
2041090
2041346
2041602
2041858
2042114
2042370
2042626
2042882
2043138
2043394
2097410
2102274
2110466
2110722
2097411
2102275
2110467
2110723
2097456
3343106
3343618
3343874
3344130
3344386
3347458
