0 0 1.0 0.5 2.0
0 1 1.62331992856 0.531120657921 1.15985226631
0 2 1.0 0.800000011921 1.25
1 0 0.333333333333 1.0 3.0
1 1 0.595353865307 0.947368443012 1.77298855782
1 2 0.5 1.0 2.0
2 0 0.5 1.0 2.0
2 1 0.621131712066 0.946624338627 1.70074272156
2 2 1.20000002861 0.833333313465 1.0
3 0 0.444444444444 1.0 2.25
3 1 0.596239287857 0.934141218662 1.79542338848
3 2 1.0 0.800000011921 1.25
4 0 0.5 0.75 2.66666674614
4 1 0.648632063917 0.913455247879 1.68777418137
4 2 0.571428571429 0.75 2.33333325386
5 0 0.666666666667 0.75 2.0
5 1 0.59852696551 0.930955708027 1.79468107224
5 2 0.666666666667 1.0 1.5
6 0 0.357142863225 1.0 2.79999995232
6 1 0.549724761071 0.931364655495 1.95314705372
6 2 0.8 1.0 1.25
7 0 0.749999977648 0.666666686535 2.0
7 1 0.611594712408 0.903374910355 1.80995690823
7 2 0.571428571429 1.0 1.75
8 0 0.307692307692 1.0 3.25
8 1 0.499571690607 0.954148948193 2.09790587425
8 2 0.666666666667 1.0 1.5
9 0 1.0 1.0 1.0
9 1 0.664157019155 0.91762393713 1.64083349705
9 2 0.666666666667 1.0 1.5
10 0 0.749999977648 1.0 1.33333337307
10 1 0.576485640067 0.938668429852 1.8479886055
10 2 1.0 0.75 1.33333337307
11 0 0.600000014305 1.0 1.66666662693
11 1 0.896901253283 0.74449211359 1.49759805202
11 2 0.8 1.0 1.25
12 0 0.749999977648 1.0 1.33333337307
12 1 0.677701378975 0.906580686569 1.627628088
12 2 0.749999977648 1.0 1.33333337307
13 0 0.749999977648 1.0 1.33333337307
13 1 0.617187166616 0.937277674675 1.72868096828
13 2 0.749999977648 1.0 1.33333337307
14 0 1.0 1.0 1.0
14 1 0.661212453414 0.916636228561 1.64991641045
14 2 1.0 1.0 1.0
15 0 0.600000014305 1.0 1.66666662693
15 1 0.6526694213 0.91776996851 1.66944789886
15 2 0.749999977648 1.0 1.33333337307
16 0 0.600000014305 1.0 1.66666662693
16 1 0.545277964027 0.951624393463 1.9271543026
16 2 1.4999999553 0.666666686535 1.0
17 0 1.0 1.0 1.0
17 1 0.573275502401 0.951969742775 1.83237123489
17 2 1.0 0.666666686535 1.5
18 0 1.4999999553 0.666666686535 1.0
18 1 0.662670498101 0.917877495289 1.64405989647
18 2 0.749999977648 1.0 1.33333337307
19 0 0.749999977648 1.0 1.33333337307
19 1 0.634049736947 0.928402125835 1.69879329205
19 2 1.0 1.0 1.0
20 0 0.749999977648 1.0 1.33333337307
20 1 0.623296831849 0.940705835819 1.70549821854
20 2 0.600000014305 1.0 1.66666662693
21 0 2.99999991059 0.333333343267 1.0
21 1 0.583403349875 0.941447615623 1.82068538666
21 2 1.0 0.75 1.33333337307
22 0 0.272727266816 1.0 3.66666674614
22 1 0.473517992718 0.840542078018 2.51248860359
22 2 1.33333333333 0.5 1.5
23 0 0.5 1.0 2.0
23 1 0.604332653088 0.949979424477 1.74184596539
23 2 2.0 0.5 1.0
24 0 0.8 0.75 1.66666662693
24 1 0.584518707284 0.938151836395 1.82359528542
24 2 0.571428571429 1.0 1.75
25 0 0.8 1.0 1.25
25 1 0.653427488204 0.952742278576 1.60630190372
25 2 0.71428572645 1.0 1.39999997616
26 0 0.307692307692 1.0 3.25
26 1 1.0 0.0 0.0
26 2 0.749999977648 1.0 1.33333337307
27 0 0.333333333333 1.0 3.0
27 1 0.59192906624 0.939313590527 1.79853844643
27 2 1.0 1.0 1.0
28 0 1.0 1.0 1.0
28 1 0.65621672169 0.926758408546 1.64431941509
28 2 1.0 0.875 1.14285719395
29 0 0.8 1.0 1.25
29 1 0.628496630092 0.958962321281 1.65918755531
29 2 0.749999977648 1.0 1.33333337307
30 0 1.0 0.75 1.33333337307
30 1 0.476192119717 0.968788385391 2.16764855385
30 2 1.12499999162 0.777777791023 1.14285719395
31 0 0.8 1.0 1.25
31 1 0.281321983344 0.976504087448 3.64017510414
31 2 0.600000014305 1.0 1.66666662693
32 0 1.0 0.0 0.0
32 1 0.611812433712 0.949594676495 1.72124791145
32 2 0.909090889387 0.699999988079 1.57142853737
33 0 1.0 1.0 1.0
33 1 0.591592603061 0.964755535126 1.75210440159
33 2 0.818181827049 0.888888895512 1.375
34 0 0.444444444444 1.0 2.25
34 1 0.629883808076 0.952763438225 1.66630494595
34 2 0.866666673554 0.923076927662 1.25
35 0 1.4999999553 0.666666686535 1.0
35 1 0.604570591401 0.948061585426 1.74468255043
35 2 0.812499969732 0.769230782986 1.60000002384
36 0 1.66666660044 0.600000023842 1.0
36 1 3.28828426858 0.2442137748 1.24526131153
36 2 0.882352947364 0.733333349228 1.54545450211
37 0 1.0 0.75 1.33333337307
37 1 0.655185710364 0.936312794685 1.63010144234
37 2 0.58620691101 1.0 1.70588231087
38 0 1.0 0.0 0.0
38 1 0.531432781603 0.946793019772 1.98745191097
38 2 0.8 0.8125 1.53846156597
39 0 1.14285714286 0.875 1.0
39 1 0.626163418449 0.964102566242 1.65649092197
39 2 0.8 0.850000023842 1.47058820724
40 0 0.631578931518 0.916666686535 1.72727274895
40 1 0.647385925023 0.941068768501 1.64140355587
40 2 1.0 0.789473712444 1.26666665077
41 0 1.39999996662 0.642857134342 1.11111116409
41 1 0.603899679578 0.964117050171 1.71753442287
41 2 6.2500001397 0.159999996424 1.0
42 0 0.928571381131 0.846153855324 1.27272725105
42 1 0.533747167378 0.959117472172 1.95340633392
42 2 1.0 0.833333313465 1.20000004768
43 0 0.684210539194 0.923076927662 1.58333337307
43 1 0.587210011695 0.93807387352 1.81538808346
43 2 1.1500000377 0.652173936367 1.33333337307
44 0 1.0 0.888888895512 1.125
44 1 0.633831612184 0.923655927181 1.70811021328
44 2 0.733333327505 0.863636374474 1.57894742489
45 0 0.727272727273 0.875 1.57142853737
45 1 0.575924845745 0.953719615936 1.82059550285
45 2 0.742857137797 0.846153855324 1.59090912342
46 0 1.14285714286 0.75 1.16666662693
46 1 0.632141206553 0.906906664371 1.74430847168
46 2 1.27777779047 0.739130437374 1.05882358551
47 0 1.57142859819 0.54545456171 1.16666662693
47 1 0.752579650314 0.892833292484 1.4882543087
47 2 0.874999960884 0.857142865658 1.33333337307
48 0 0.8 0.916666686535 1.36363637447
48 1 0.552671152413 0.936930298805 1.931194067
48 2 0.705882372741 0.875 1.61904764175
49 0 0.695652173913 0.875 1.64285719395
49 1 1.2583693762 0.598083376884 1.32870984077
49 2 0.892857139056 0.759999990463 1.4736841917
50 0 0.823529400215 0.785714268684 1.54545450211
50 1 0.747415553421 0.876750946045 1.52602493763
50 2 0.77777778808 0.904761910439 1.42105257511
51 0 0.695652173913 0.8125 1.76923072338
51 1 0.588962982133 0.96465754509 1.76010608673
51 2 0.77777778808 0.904761910439 1.42105257511
52 0 1.23076923077 0.625 1.29999995232
52 1 0.494893491749 0.945938766003 2.13611793518
52 2 1.92307699361 0.360000014305 1.44444441795
53 0 1.0 0.0 0.0
53 1 1.0 0.0 0.0
53 2 1.0 0.0 0.0
