210177
332802
333058
611330
611586
1129770
1259265
1259564
1387567
1522735
1583394
1583651
1584419
1585707
1846843
1910309
2512385
2512641
2512897
2513153
2513409
2513665
2513921
2514177
2514433
2514689
2569985
2570241
3029039
3029040
3091255
