1337405925 360893 0 230
1073440 220 0 100000 4 3956993 3692298241 0 0 0 0 0 0 0 0 0
0 0 0 0 0 5005328 220 262128 0 268374015 268374015 268374015 268374015 268374015 268374015 3870719
0 0 50529027 50529027 50529027 50529027 50529027 0 0 5005328 221 262128 0 268374015 268374015 268374015
268374015 268374015 268374015 4132863 0 0 50529027 50529027 50529027 50529027 50529027 0 0 811056 3691252737 11
4095 811056 3691318273 11 4095 811056 3691383809 11 4095 811056 3691449345 11 4095 811056 3691514881 11
4095 811056 3691580417 11 4095 811056 3691645953 11 4095 811056 3691711489 11 4095 811056 3691777025 11
4095 811056 3691842561 11 4095 811056 3691908097 11 4095 811056 3691973633 11 4095 811056 3692039169 11
4095 811056 3692104705 11 59 811056 3708029953 11 4095 811056 3708095489 11 4095 811056 3708161025 11
4095 811056 3708226561 11 4095 811056 3708292097 11 4095 811056 3708357633 11 4095 811056 3708423169 11
4095 811056 3708488705 11 4095 811056 3708554241 11 4095 811056 3708619777 11 4095 811056 3708685313 11
4095 811056 3708750849 11 4095 811056 3708816385 11 4095 811056 3708881921 11 63 811088 3707702529 218563359
16777215 811088 3724479745 218563359 16777215 811088 3708815617 218563359 16777211 2121761 3707702529 2039152666 1845514612 62 0 0
0 0 2121761 3724479745 2039152666 1845514612 62 0 0 0 0 2121761 3708684289 2039152640 4278210932 62
0 134217728 0 0 2121761 3708160769 2039152646 1845514612 62 0 0 6291456 0 2121761 3708289281 2039152646
1845514612 62 0 0 2097152 0
