601135
1387567
2053122
2053378
2053123
2053379
2758145
2758401
2758146
2758402
2758147
2758403
3224578
3224834
3224579
3224835
3224580
3224836
3224581
3224837
3355650
3355906
3355651
3355907
3355652
3355908
3355653
3355909
3355654
3355910
3355655
3355911
3355656
3355912
