0 0 0.823529400215 0.75 1.61904764175
0 1 0.812509256055 0.871428251266 1.41234254837
0 2 0.621621631636 1.0 1.60869562626
1 0 0.840000008011 0.857142865658 1.38888883591
1 1 0.742207299719 0.898107588291 1.50019037724
1 2 0.733333327505 0.909090936184 1.5
2 0 0.8 0.833333313465 1.5
2 1 0.788299950636 0.890073359013 1.42522263527
2 2 0.480000018311 1.0 2.08333325386
3 0 0.896551753621 0.807692289352 1.38095235825
3 1 0.709606056761 0.927500665188 1.51938712597
3 2 0.821428606401 0.869565188885 1.39999997616
4 0 0.68571426703 0.875 1.66666662693
4 1 0.739654688827 0.886506021023 1.52506840229
4 2 0.821428606401 0.869565188885 1.39999997616
5 0 0.923076889219 0.875 1.23809528351
5 1 0.705880471997 0.902008354664 1.57057356834
5 2 1.0 0.833333313465 1.20000004768
6 0 0.903225848131 0.821428596973 1.34782612324
6 1 0.672715265512 0.89509087801 1.66073977947
6 2 0.960000036621 0.875 1.19047617912
7 0 0.93103452103 0.777777791023 1.38095235825
7 1 0.763906312607 0.849262952805 1.54140841961
7 2 0.524999998435 1.0 1.90476191044
8 0 0.608695633245 0.928571403027 1.76923072338
8 1 0.728967429214 0.891389429569 1.53894948959
8 2 0.633333310684 1.0 1.57894742489
9 0 0.916666639348 0.909090936184 1.20000004768
9 1 0.777431793599 0.878519296646 1.46415281296
9 2 0.529411779555 0.944444417953 2.0
10 0 0.899999957085 0.888888895512 1.25
10 1 0.659799886219 0.915515124798 1.65547347069
10 2 0.615384615385 0.9375 1.73333334923
11 0 0.749999977648 1.0 1.33333337307
11 1 0.672934202426 0.915084660053 1.62392544746
11 2 1.0 0.0 0.0
12 0 0.77777778808 0.928571403027 1.3846154213
12 1 0.873744070913 0.836725950241 1.36783134937
12 2 0.560000005341 0.928571403027 1.92307686806
13 0 0.866666673554 0.730769217014 1.57894742489
13 1 0.717468624355 0.915613353252 1.52224647999
13 2 0.749999977648 1.0 1.33333337307
14 0 0.727272727273 0.958333313465 1.43478262424
14 1 0.743738966189 0.889368832111 1.51181125641
14 2 0.666666666667 1.0 1.5
15 0 1.10714289014 0.741935491562 1.21739125252
15 1 0.706351278026 0.899263143539 1.57431805134
15 2 0.647058841679 0.95454543829 1.61904764175
16 0 1.03225806452 0.78125 1.24000000954
16 1 0.652759924628 0.926608264446 1.65329504013
16 2 1.0 0.833333313465 1.20000004768
17 0 0.813953497398 0.885714292526 1.38709676266
17 1 0.652181887093 0.927777409554 1.65267503262
17 2 0.8 0.958333313465 1.30434787273
18 0 0.754716953972 0.925000011921 1.4324324131
18 1 1.28230296416 0.646151721478 1.20690989494
18 2 0.899999957085 0.814814805984 1.36363637447
19 0 0.742857137797 0.942307710648 1.42857146263
19 1 0.771488555979 0.880259871483 1.47251462936
19 2 0.774193572204 0.875 1.47619044781
20 0 0.845070462264 0.899999976158 1.31481480598
20 1 0.89716139799 0.831681311131 1.34020876884
20 2 0.666666666667 0.964285731316 1.55555558205
21 0 0.906250003376 0.827586233616 1.33333337307
21 1 0.78189775051 0.882984757423 1.44842767715
21 2 0.636363650156 0.928571403027 1.69230771065
22 0 0.831168831169 0.90625 1.32758617401
22 1 0.835041902866 0.867531001568 1.38040578365
22 2 0.941176470588 0.8125 1.30769228935
23 0 0.818181827049 0.913580238819 1.33783781528
23 1 0.700497134875 0.918868303299 1.55360424519
23 2 0.842105263158 0.90625 1.31034481525
24 0 0.938775523907 0.771739125252 1.38028168678
24 1 0.7807031757 0.856684029102 1.49517965317
24 2 0.863636368316 0.815789461136 1.41935479641
25 0 1.22499995802 0.68367344141 1.19402980804
25 1 0.822279694418 0.866514027119 1.40347552299
25 2 0.847826051802 0.871794879436 1.35294115543
26 0 0.709219874945 0.910000026226 1.5494505167
26 1 0.951738618057 0.797394633293 1.31767714024
26 2 0.770491824359 0.808510661125 1.60526311398
27 0 0.740259755158 0.903508782387 1.49514567852
27 1 0.701575167979 0.903474152088 1.57764780521
27 2 0.813559348335 0.895833313465 1.37209308147
28 0 0.715909072483 0.904761910439 1.54385960102
28 1 0.758541838851 0.86515724659 1.52379107475
28 2 0.791044755007 0.905660390854 1.39583337307
29 0 0.798913069358 0.857142865658 1.46031749249
29 1 0.785236893986 0.884767055511 1.43936300278
29 2 0.859649092243 0.959183692932 1.21276593208
30 0 1.09090906726 0.714285731316 1.28333330154
30 1 0.967890695815 0.76868391037 1.3440823555
30 2 0.898550715323 0.790322601795 1.4081633091
31 0 0.931937187898 0.808988749981 1.32638883591
31 1 0.762228690378 0.828788757324 1.58296334743
31 2 0.91525423359 0.777777791023 1.40476191044
32 0 0.92999995898 0.844086050987 1.2738853693
32 1 0.769392222364 0.886977732182 1.46534359455
32 2 1.52500001591 0.49180328846 1.33333337307
33 0 0.82648403626 0.883977890015 1.36874997616
33 1 1.0 0.0 0.0
33 2 0.948275908846 0.818181812763 1.28888893127
34 0 0.749019639357 0.921465992928 1.44886362553
34 1 0.810757120552 0.881477475166 1.3992587328
34 2 1.0 0.811320781708 1.23255813122
35 0 0.891891889018 0.872727274895 1.28472220898
35 1 0.809120913527 0.865524351597 1.42793130875
35 2 0.879310305068 0.823529422283 1.38095235825
36 0 0.848314587425 0.847682118416 1.390625
36 1 1.0 0.0 0.0
36 2 0.948275908846 0.854545474052 1.23404252529
37 0 1.28799998219 0.701863348484 1.10619473457
37 1 0.833934084217 0.870957314968 1.37680184841
37 2 1.0 0.819999992847 1.2195122242
38 0 1.0 0.0 0.0
38 1 1.13203217097 0.729698240757 1.21059238911
38 2 1.128205142 0.681818187237 1.29999995232
39 0 1.25806449678 0.674358963966 1.17870724201
39 1 0.759709411382 0.902067303658 1.45919573307
39 2 1.08088235768 0.761904776096 1.21428573132
40 0 1.10973722512 0.740947067738 1.21616542339
40 1 0.819768954879 0.86648786068 1.40781652927
40 2 0.848920851661 0.864406764507 1.36274504662
41 0 0.872958288876 0.858627855778 1.33414041996
41 1 0.840486468928 0.882165014744 1.34871268272
41 2 0.873376645011 0.862453520298 1.32758617401
42 0 0.959006254353 0.814766824245 1.27980923653
42 1 0.733467786852 0.888224065304 1.53495776653
42 2 0.958100530903 0.82215744257 1.26950359344
43 0 0.854578115238 0.847689092159 1.38042128086
43 1 0.91073688343 0.80400454998 1.36567878723
43 2 0.823529400215 0.873015880585 1.39090907574
44 0 1.0 0.0 0.0
44 1 0.593580301355 0.945742070675 1.78134405613
44 2 0.920168044643 0.812785387039 1.33707869053
45 0 0.98431372503 0.784860551357 1.29441618919
45 1 0.87923592934 0.838392019272 1.35658621788
45 2 0.948979638011 0.823655903339 1.27937340736
46 0 0.984861956148 0.740506350994 1.37118434906
46 1 0.947077363771 0.803516805172 1.31407320499
46 2 1.62121214317 0.521495342255 1.18279564381
47 0 1.4028475172 0.595223903656 1.19759273529
47 1 1.09353191727 0.750214040279 1.21894288063
47 2 1.1607142746 0.69059830904 1.24752473831
48 0 0.895511100896 0.752737998962 1.48349189758
48 1 1.02959326036 0.741359710693 1.31010270119
48 2 0.916554463897 0.760646104813 1.43436288834
49 0 0.873704029319 0.77993530035 1.46749651432
49 1 1.29842573421 0.594431400299 1.29563045502
49 2 0.845869334962 0.804664731026 1.46920287609
50 0 0.896327013838 0.778255105019 1.43354558945
50 1 1.06412850412 0.722215592861 1.30118501186
50 2 1.07142856687 0.704938292503 1.32399296761
51 0 0.951800278939 0.729713261127 1.43979930878
51 1 0.836270952487 0.813166558743 1.47052848339
51 2 1.10869564499 0.645969510078 1.39629006386
52 0 1.07840696075 0.649740338326 1.42717587948
52 1 1.59615215928 0.485355883837 1.29081916809
52 2 2.55598462834 0.280211478472 1.3962264061
53 0 2.07551244778 0.334979206324 1.43832433224
53 1 2.17454007585 0.341813415289 1.34537553787
53 2 3.10165493724 0.221036583185 1.45862066746
