924709
924965
925221
925477
917798
918054
918310
918566
918822
919078
919334
919590
919846
920102
920358
920614
920870
921126
921382
921638
921894
922150
922406
922662
922918
923174
923430
923686
923942
924198
924454
924710
924966
925222
925478
917799
918055
918311
918567
918823
919079
919335
919591
919847
920103
920359
920615
920871
921127
921383
921639
921895
922151
922407
922663
922919
923175
923431
923687
923943
924199
924455
924711
924967
925223
925479
917800
918056
918312
918568
918824
919080
919336
919592
919848
920104
920360
920616
920872
921128
921384
921640
921896
922152
922408
922664
922920
923176
923432
923688
923944
924200
924456
924712
924968
925224
925480
917801
918057
918313
918569
918825
919081
919337
919593
919849
920105
920361
920617
920873
921129
921385
921641
921897
922153
922409
922665
922921
923177
923433
923689
923945
924201
924457
924713
924969
925225
925481
917802
918058
918314
918570
918826
919082
919338
919594
919850
920106
920362
920618
920874
921130
921386
921642
921898
922154
922410
922666
922922
923178
923434
923690
923946
924202
924458
924714
924970
925226
925482
917803
918059
918315
918571
918827
919083
919339
919595
919851
920107
920363
920619
920875
921131
921387
921643
921899
922155
922411
922667
922923
923179
923435
923691
923947
924203
924459
924715
924971
925227
925483
917804
918060
918316
918572
918828
919084
919340
919596
919852
920108
920364
920620
920876
921132
921388
921644
921900
922156
922412
922668
922924
923180
923436
923692
923948
924204
924460
924716
924972
925228
925484
917805
918061
918317
918573
918829
919085
919341
919597
919853
920109
920365
920621
920877
921133
921389
921645
921901
922157
922413
922669
922925
923181
923437
923693
923949
924205
924461
924717
924973
925229
925485
917806
918062
918318
918574
918830
919086
919342
919598
919854
920110
920366
920622
920878
921134
921390
921646
921902
922158
922414
922670
922926
923182
923438
923694
923950
924206
924462
924718
924974
925230
925486
917807
918063
918319
918575
918831
919087
919343
919599
919855
920111
920367
920623
920879
921135
921391
921647
921903
922159
922415
922671
922927
923183
923439
923695
923951
924207
924463
924719
924975
925231
925487
917808
918064
918320
918576
918832
919088
919344
919600
919856
920112
920368
920624
920880
921136
921392
921648
921904
922160
922416
922672
922928
923184
923440
923696
923952
924208
924464
924720
924976
925232
925488
917809
918065
918321
918577
918833
919089
919345
919601
919857
920113
920369
920625
920881
921137
921393
921649
921905
922161
922417
922673
922929
923185
923441
923697
923953
924209
924465
924721
924977
925233
925489
917810
918066
918322
918578
918834
919090
919346
919602
919858
920114
920370
920626
920882
921138
921394
921650
921906
922162
922418
922674
922930
923186
923442
923698
923954
924210
924466
924722
924978
925234
925490
917811
918067
918323
918579
918835
919091
919347
919603
919859
920115
920371
920627
920883
921139
921395
921651
921907
922163
922419
922675
922931
923187
923443
923699
923955
924211
924467
924723
924979
925235
925491
917812
918068
918324
918580
918836
919092
919348
919604
919860
920116
920372
920628
920884
921140
921396
921652
921908
922164
922420
922676
922932
923188
923444
923700
923956
924212
924468
924724
924980
925236
925492
917813
918069
918325
918581
918837
919093
919349
919605
919861
920117
920373
920629
920885
921141
921397
921653
921909
922165
922421
922677
922933
923189
923445
923701
923957
924213
924469
924725
924981
925237
925493
917814
918070
918326
918582
918838
919094
919350
919606
919862
920118
920374
920630
920886
921142
921398
921654
921910
922166
922422
922678
922934
923190
923446
923702
923958
924214
924470
924726
924982
925238
925494
917815
918071
918327
918583
918839
919095
919351
919607
919863
920119
920375
920631
920887
921143
921399
921655
921911
922167
922423
922679
922935
923191
923447
923703
923959
924215
924471
924727
924983
925239
925495
917816
918072
918328
918584
918840
919096
919352
919608
919864
920120
920376
920632
920888
921144
921400
921656
921912
922168
922424
922680
922936
923192
923448
923704
923960
924216
924472
924728
924984
925240
925496
917817
918073
918329
918585
918841
919097
919353
919609
919865
920121
920377
920633
920889
921145
921401
921657
921913
922169
922425
922681
922937
923193
923449
923705
923961
924217
924473
924729
924985
925241
925497
917818
918074
918330
918586
918842
919098
919354
919610
919866
920122
920378
920634
920890
921146
921402
921658
921914
922170
922426
922682
922938
923194
923450
923706
923962
924218
924474
924730
924986
925242
925498
917819
918075
918331
918587
918843
919099
919355
919611
919867
920123
920379
920635
920891
921147
921403
921659
921915
922171
922427
922683
922939
923195
923451
923707
923963
924219
924475
924731
924987
925243
925499
917820
918076
918332
918588
918844
919100
919356
919612
919868
920124
920380
920636
920892
921148
921404
921660
921916
922172
922428
922684
922940
923196
923452
923708
923964
924220
924476
924732
924988
925244
925500
917821
918077
918333
918589
918845
919101
919357
919613
919869
920125
920381
920637
920893
921149
921405
921661
921917
922173
922429
922685
922941
923197
923453
923709
923965
924221
924477
924733
924989
925245
925501
917822
918078
918334
918590
918846
919102
919358
919614
919870
920126
920382
920638
920894
921150
921406
921662
921918
922174
922430
922686
922942
923198
923454
923710
923966
924222
924478
924734
924990
925246
925502
917823
918079
918335
918591
918847
919103
919359
919615
919871
920127
920383
920639
920895
921151
921407
921663
921919
922175
922431
922687
922943
923199
923455
923711
923967
924223
924479
924735
924991
925247
925503
917824
918080
918336
918592
918848
919104
919360
919616
919872
920128
920384
920640
920896
921152
921408
921664
921920
922176
922432
922688
922944
923200
923456
923712
923968
924224
924480
924736
924992
925248
925504
917825
918081
918337
918593
918849
919105
919361
919617
919873
920129
920385
920641
920897
921153
921409
921665
921921
922177
922433
922689
922945
923201
923457
923713
923969
924225
924481
924737
924993
925249
925505
917826
918082
918338
918594
918850
919106
919362
919618
919874
920130
920386
920642
920898
921154
921410
921666
921922
922178
922434
922690
922946
923202
923458
923714
923970
924226
924482
924738
924994
925250
925506
917827
918083
918339
918595
918851
919107
919363
919619
919875
920131
920387
920643
920899
921155
921411
921667
921923
922179
922435
922691
922947
923203
923459
923715
923971
924227
924483
924739
924995
925251
925507
917828
918084
918340
918596
918852
919108
919364
919620
919876
920132
920388
920644
920900
921156
921412
921668
921924
922180
922436
922692
922948
923204
923460
923716
923972
924228
924484
924740
924996
925252
925508
917829
918085
918341
918597
918853
919109
919365
919621
919877
920133
920389
920645
920901
921157
921413
921669
921925
922181
922437
922693
922949
923205
923461
923717
923973
924229
924485
924741
924997
925253
925509
917830
918086
918342
918598
918854
919110
919366
919622
919878
920134
920390
920646
920902
921158
921414
921670
921926
922182
922438
922694
922950
923206
923462
923718
923974
924230
924486
924742
924998
925254
925510
917831
918087
918343
918599
918855
919111
919367
919623
919879
920135
920391
920647
920903
921159
921415
921671
921927
922183
922439
922695
922951
923207
923463
923719
923975
924231
924487
924743
924999
925255
925511
917832
918088
918344
918600
918856
919112
919368
919624
919880
920136
920392
920648
920904
921160
921416
921672
921928
922184
922440
922696
922952
923208
923464
923720
923976
924232
924488
924744
925000
925256
925512
917833
918089
918345
918601
918857
919113
919369
919625
919881
920137
920393
920649
920905
921161
921417
921673
921929
922185
922441
922697
922953
923209
923465
923721
923977
924233
924489
924745
925001
925257
925513
917834
918090
918346
918602
918858
919114
919370
919626
919882
920138
920394
920650
920906
921162
921418
921674
921930
922186
922442
922698
922954
923210
923466
923722
923978
924234
924490
924746
925002
925258
925514
917835
918091
918347
918603
918859
919115
919371
919627
919883
920139
920395
920651
920907
921163
921419
921675
921931
922187
922443
922699
922955
923211
923467
923723
923979
924235
924491
924747
925003
925259
925515
917836
918092
918348
918604
918860
919116
919372
919628
919884
920140
920396
920652
920908
921164
921420
921676
921932
922188
922444
922700
922956
923212
923468
923724
923980
924236
924492
924748
925004
925260
925516
917837
918093
918349
918605
918861
919117
919373
919629
919885
920141
920397
920653
920909
921165
921421
921677
921933
922189
922445
922701
922957
923213
923469
923725
923981
924237
924493
924749
925005
925261
925517
917838
918094
918350
918606
918862
919118
919374
919630
919886
920142
920398
920654
920910
921166
921422
921678
921934
922190
922446
922702
922958
923214
923470
923726
923982
924238
924494
924750
925006
925262
925518
917839
918095
918351
918607
918863
919119
919375
919631
919887
920143
920399
920655
920911
921167
921423
921679
921935
922191
922447
922703
922959
923215
923471
923727
923983
924239
924495
924751
925007
925263
925519
917840
918096
918352
918608
918864
919120
919376
919632
919888
920144
920400
920656
920912
921168
921424
921680
921936
922192
922448
922704
922960
923216
923472
923728
923984
924240
924496
924752
925008
925264
925520
917841
918097
918353
918609
918865
919121
919377
919633
919889
920145
920401
920657
920913
921169
921425
921681
921937
922193
922449
922705
922961
923217
923473
923729
923985
924241
924497
924753
925009
925265
925521
917842
918098
918354
918610
918866
919122
919378
919634
919890
920146
920402
920658
920914
921170
921426
921682
921938
922194
922450
922706
922962
923218
923474
923730
923986
924242
924498
924754
925010
925266
925522
917843
918099
918355
918611
918867
919123
919379
919635
919891
920147
920403
920659
920915
921171
921427
921683
921939
922195
922451
922707
922963
923219
923475
923731
923987
924243
924499
924755
925011
925267
925523
917844
918100
918356
918612
918868
919124
919380
919636
919892
920148
920404
920660
920916
921172
921428
921684
921940
922196
922452
922708
922964
923220
923476
923732
923988
924244
924500
924756
925012
925268
925524
917845
918101
918357
918613
918869
919125
919381
919637
919893
920149
920405
920661
920917
921173
921429
921685
921941
922197
922453
922709
922965
923221
923477
923733
923989
924245
924501
924757
925013
925269
925525
917846
918102
918358
918614
918870
919126
919382
919638
919894
920150
920406
920662
920918
921174
921430
921686
921942
922198
922454
922710
922966
923222
923478
923734
923990
924246
924502
924758
925014
925270
925526
917847
918103
918359
918615
918871
919127
919383
919639
919895
920151
920407
920663
920919
921175
921431
921687
921943
922199
922455
922711
922967
923223
923479
923735
923991
924247
924503
924759
925015
925271
925527
917848
918104
918360
918616
918872
919128
919384
919640
919896
920152
920408
920664
920920
921176
921432
921688
921944
922200
922456
922712
922968
923224
923480
923736
923992
924248
924504
924760
925016
925272
925528
917849
918105
918361
918617
918873
919129
919385
919641
919897
920153
920409
920665
920921
921177
921433
921689
921945
922201
922457
922713
922969
923225
923481
923737
923993
924249
924505
924761
925017
925273
925529
917850
918106
918362
918618
918874
919130
919386
919642
919898
920154
920410
920666
920922
921178
921434
921690
921946
922202
922458
922714
922970
923226
923482
923738
923994
924250
924506
924762
925018
925274
925530
917851
918107
918363
918619
918875
919131
919387
919643
919899
920155
920411
920667
920923
921179
921435
921691
921947
922203
922459
922715
922971
923227
923483
923739
923995
924251
924507
924763
925019
925275
925531
917852
918108
918364
918620
918876
919132
919388
919644
919900
920156
920412
920668
920924
921180
921436
921692
921948
922204
922460
922716
922972
923228
923484
923740
923996
924252
924508
924764
925020
925276
925532
917853
918109
918365
918621
918877
919133
919389
919645
919901
920157
920413
920669
920925
921181
921437
921693
921949
922205
922461
922717
922973
923229
923485
923741
923997
924253
924509
924765
925021
925277
925533
917854
918110
918366
918622
918878
919134
919390
919646
919902
920158
920414
920670
920926
921182
921438
921694
921950
922206
922462
922718
922974
923230
923486
923742
923998
924254
924510
924766
925022
925278
925534
917855
918111
918367
918623
918879
919135
919391
919647
919903
920159
920415
920671
920927
921183
921439
921695
921951
922207
922463
922719
922975
923231
923487
923743
923999
924255
924511
924767
925023
925279
925535
1131866
1132122
1132378
1132634
1132890
1133146
1133402
1133658
1133914
1134170
1134426
1134682
1134938
1135194
1135450
1135706
1135962
1136218
1136474
1136730
1136986
1137242
1137498
1137754
1138010
1138266
1138522
1130587
1130843
1131099
1131355
1131611
1131867
1132123
1132379
1132635
1132891
1133147
1133403
1133659
1133915
1134171
1134427
1134683
1134939
1135195
1135451
1135707
1135963
1136219
1136475
1136731
1136987
1137243
1137499
1137755
1138011
1138267
1138523
1130588
1130844
1131100
1131356
1131612
1131868
1132124
1132380
1132636
1132892
1133148
1133404
1133660
1133916
1134172
1134428
1134684
1134940
1135196
1135452
1135708
1135964
1136220
1136476
1136732
1136988
1137244
1137500
1137756
1138012
1138268
1138524
1130589
1130845
1131101
1131357
1131613
1131869
1132125
1132381
1132637
1132893
1133149
1133405
1133661
1133917
1134173
1134429
1134685
1134941
1135197
1135453
1135709
1135965
1136221
1136477
1136733
1136989
1137245
1137501
1137757
1138013
1138269
1138525
1130590
1130846
1131102
1131358
1131614
1131870
1132126
1132382
1132638
1132894
1133150
1133406
1133662
1133918
1134174
1134430
1134686
1134942
1135198
1135454
1135710
1135966
1136222
1136478
1136734
1136990
1137246
1137502
1137758
1138014
1138270
1138526
1130591
1130847
1131103
1131359
1131615
1131871
1132127
1132383
1132639
1132895
1133151
1133407
1133663
1133919
1134175
1134431
1134687
1134943
1135199
1135455
1135711
1135967
1136223
1136479
1136735
1136991
1137247
1137503
1137759
1138015
1138271
1138527
2233659
2233915
2234171
2234427
2234683
2234939
2235195
2235451
2235707
2235963
2236219
2228540
2228796
2229052
2229308
2229564
2229820
2230076
2230332
2230588
2230844
2231100
2231356
2231612
2231868
2232124
2232380
2232636
2232892
2233148
2233404
2233660
2233916
2234172
2234428
2234684
2234940
2235196
2235452
2235708
2235964
2236220
2228541
2228797
2229053
2229309
2229565
2229821
2230077
2230333
2230589
2230845
2231101
2231357
2231613
2231869
2232125
2232381
2232637
2232893
2233149
2233405
2233661
2233917
2234173
2234429
2234685
2234941
2235197
2235453
2235709
2235965
2236221
2228542
2228798
2229054
2229310
2229566
2229822
2230078
2230334
2230590
2230846
2231102
2231358
2231614
2231870
2232126
2232382
2232638
2232894
2233150
2233406
2233662
2233918
2234174
2234430
2234686
2234942
2235198
2235454
2235710
2235966
2236222
2228543
2228799
2229055
2229311
2229567
2229823
2230079
2230335
2230591
2230847
2231103
2231359
2231615
2231871
2232127
2232383
2232639
2232895
2233151
2233407
2233663
2233919
2234175
2234431
2234687
2234943
2235199
2235455
2235711
2235967
2236223
2228544
2228800
2229056
2229312
2229568
2229824
2230080
2230336
2230592
2230848
2231104
2231360
2231616
2231872
2232128
2232384
2232640
2232896
2233152
2233408
2233664
2233920
2234176
2234432
2234688
2234944
2235200
2235456
2235712
2235968
2236224
2228545
2228801
2229057
2229313
2229569
2229825
2230081
2230337
2230593
2230849
2231105
2231361
2231617
2231873
2232129
2232385
2232641
2232897
2233153
2233409
2233665
2233921
2234177
2234433
2234689
2234945
2235201
2235457
2235713
2235969
2236225
2228546
2228802
2229058
2229314
2229570
2229826
2230082
2230338
2230594
2230850
2231106
2231362
2231618
2231874
2232130
2232386
2232642
2232898
2233154
2233410
2233666
2233922
2234178
2234434
2234690
2234946
2235202
2235458
2235714
2235970
2236226
2228547
2228803
2229059
2229315
2229571
2229827
2230083
2230339
2230595
2230851
2231107
2231363
2231619
2231875
2232131
2232387
2232643
2232899
2233155
2233411
2233667
2233923
2234179
2234435
2234691
2234947
2235203
2235459
2235715
2235971
2236227
2228548
2228804
2229060
2229316
2229572
2229828
2230084
2230340
2230596
2230852
2231108
2231364
2231620
2231876
2232132
2232388
2232644
2232900
2233156
2233412
2233668
2233924
2234180
2234436
2234692
2234948
2235204
2235460
2235716
2235972
2236228
2228549
2228805
2229061
2229317
2229573
2229829
2230085
2230341
2230597
2230853
2231109
2231365
2231621
2231877
2232133
2232389
2232645
2232901
2233157
2233413
2233669
2233925
2234181
2234437
2234693
2234949
2235205
2235461
2235717
2235973
2236229
2228550
2228806
2229062
2229318
2229574
2229830
2230086
2230342
2230598
2230854
2231110
2231366
2231622
2231878
2232134
2232390
2232646
2232902
2233158
2233414
2233670
2233926
2234182
2234438
2234694
2234950
2235206
2235462
2235718
2235974
2236230
2228551
2228807
2229063
2229319
2229575
2229831
2230087
2230343
2230599
2230855
2231111
2231367
2231623
2231879
2232135
2232391
2232647
2232903
2233159
2233415
2233671
2233927
2234183
2234439
2234695
2234951
2235207
2235463
2235719
2235975
2236231
2228552
2228808
2229064
2229320
2229576
2229832
2230088
2230344
2230600
2230856
2231112
2231368
2231624
2231880
2232136
2232392
2232648
2232904
2233160
2233416
2233672
2233928
2234184
2234440
2234696
2234952
2235208
2235464
2235720
2235976
2236232
2228553
2228809
2229065
2229321
2229577
2229833
2230089
2230345
2230601
2230857
2231113
2231369
2231625
2231881
2232137
2232393
2232649
2232905
2233161
2233417
2233673
2233929
2234185
2234441
2234697
2234953
2235209
2235465
2235721
2235977
2236233
2228554
2228810
2229066
2229322
2229578
2229834
2230090
2230346
2230602
2230858
2231114
2231370
2231626
2231882
2232138
2232394
2232650
2232906
2233162
2233418
2233674
2233930
2234186
2234442
2234698
2234954
2235210
2235466
2235722
2235978
2236234
2228555
2228811
2229067
2229323
2229579
2229835
2230091
2230347
2230603
2230859
2231115
2231371
2231627
2231883
2232139
2232395
2232651
2232907
2233163
2233419
2233675
2233931
2234187
2234443
2234699
2234955
2235211
2235467
2235723
2235979
2236235
2228556
2228812
2229068
2229324
2229580
2229836
2230092
2230348
2230604
2230860
2231116
2231372
2231628
2231884
2232140
2232396
2232652
2232908
2233164
2233420
2233676
2233932
2234188
2234444
2234700
2234956
2235212
2235468
2235724
2235980
2236236
2228557
2228813
2229069
2229325
2229581
2229837
2230093
2230349
2230605
2230861
2231117
2231373
2231629
2231885
2232141
2232397
2232653
2232909
2233165
2233421
2233677
2233933
2234189
2234445
2234701
2234957
2235213
2235469
2235725
2235981
2236237
2228558
2228814
2229070
2229326
2229582
2229838
2230094
2230350
2230606
2230862
2231118
2231374
2231630
2231886
2232142
2232398
2232654
2232910
2233166
2233422
2233678
2233934
2234190
2234446
2234702
2234958
2235214
2235470
2235726
2235982
2236238
2228559
2228815
2229071
2229327
2229583
2229839
2230095
2230351
2230607
2230863
2231119
2231375
2231631
2231887
2232143
2232399
2232655
2232911
2233167
2233423
2233679
2233935
2234191
2234447
2234703
2234959
2235215
2235471
2235727
2235983
2236239
2228560
2228816
2229072
2229328
2229584
2229840
2230096
2230352
2230608
2230864
2231120
2231376
2231632
2231888
2232144
2232400
2232656
2232912
2233168
2233424
2233680
2233936
2234192
2234448
2234704
2234960
2235216
2235472
2235728
2235984
2236240
2228561
2228817
2229073
2229329
2229585
2229841
2230097
2230353
2230609
2230865
2231121
2231377
2231633
2231889
2232145
2232401
2232657
2232913
2233169
2233425
2233681
2233937
2234193
2234449
2234705
2234961
2235217
2235473
2235729
2235985
2236241
2228562
2228818
2229074
2229330
2229586
2229842
2230098
2230354
2230610
2230866
2231122
2231378
2231634
2231890
2232146
2232402
2232658
2232914
2233170
2233426
2233682
2233938
2234194
2234450
2234706
2234962
2235218
2235474
2235730
2235986
2236242
2228563
2228819
2229075
2229331
2229587
2229843
2230099
2230355
2230611
2230867
2231123
2231379
2231635
2231891
2232147
2232403
2232659
2232915
2233171
2233427
2233683
2233939
2234195
2234451
2234707
2234963
2235219
2235475
2235731
2235987
2236243
2228564
2228820
2229076
2229332
2229588
2229844
2230100
2230356
2230612
2230868
2231124
2231380
2231636
2231892
2232148
2232404
2232660
2232916
2233172
2233428
2233684
2233940
2234196
2234452
2234708
2234964
2235220
2235476
2235732
2235988
2236244
2228565
2228821
2229077
2229333
2229589
2229845
2230101
2230357
2230613
2230869
2231125
2231381
2231637
2231893
2232149
2232405
2232661
2232917
2233173
2233429
2233685
2233941
2234197
2234453
2234709
2234965
2235221
2235477
2235733
2235989
2236245
2228566
2228822
2229078
2229334
2229590
2229846
2230102
2230358
2230614
2230870
2231126
2231382
2231638
2231894
2232150
2232406
2232662
2232918
2233174
2233430
2233686
2233942
2234198
2234454
2234710
2234966
2235222
2235478
2235734
2235990
2236246
2228567
2228823
2229079
2229335
2229591
2229847
2230103
2230359
2230615
2230871
2231127
2231383
2231639
2231895
2232151
2232407
2232663
2232919
2233175
2233431
2233687
2233943
2234199
2234455
2234711
2234967
2235223
2235479
2235735
2235991
2236247
2228568
2228824
2229080
2229336
2229592
2229848
2230104
2230360
2230616
2230872
2231128
2231384
2231640
2231896
2232152
2232408
2232664
2232920
2233176
2233432
2233688
2233944
2234200
2234456
2234712
2234968
2235224
2235480
2235736
2235992
2236248
2228569
2228825
2229081
2229337
2229593
2229849
2230105
2230361
2230617
2230873
2231129
2231385
2231641
2231897
2232153
2232409
2232665
2232921
2233177
2233433
2233689
2233945
2234201
2234457
2234713
2234969
2235225
2235481
2235737
2235993
2236249
2228570
2228826
2229082
2229338
2229594
2229850
2230106
2230362
2230618
2230874
2231130
2231386
2231642
2231898
2232154
2232410
2232666
2232922
2233178
2233434
2233690
2233946
2234202
2234458
2234714
2234970
2235226
2235482
2235738
2235994
2236250
2228571
2228827
2229083
2229339
2229595
2229851
2230107
2230363
2230619
2230875
2231131
2231387
2231643
2231899
2232155
2232411
2232667
2232923
2233179
2233435
2233691
2233947
2234203
2234459
2234715
2234971
2235227
2235483
2235739
2235995
2236251
2228572
2228828
2229084
2229340
2229596
2229852
2230108
2230364
2230620
2230876
2231132
2231388
2231644
2231900
2232156
2232412
2232668
2232924
2233180
2233436
2233692
2233948
2234204
2234460
2234716
2234972
2235228
2235484
2235740
2235996
2236252
2228573
2228829
2229085
2229341
2229597
2229853
2230109
2230365
2230621
2230877
2231133
2231389
2231645
2231901
2232157
2232413
2232669
2232925
2233181
2233437
2233693
2233949
2234205
2234461
2234717
2234973
2235229
2235485
2235741
2235997
2236253
2228574
2228830
2229086
2229342
2229598
2229854
2230110
2230366
2230622
2230878
2231134
2231390
2231646
2231902
2232158
2232414
2232670
2232926
2233182
2233438
2233694
2233950
2234206
2234462
2234718
2234974
2235230
2235486
2235742
2235998
2236254
2228575
2228831
2229087
2229343
2229599
2229855
2230111
2230367
2230623
2230879
2231135
2231391
2231647
2231903
2232159
2232415
2232671
2232927
2233183
2233439
2233695
2233951
2234207
2234463
2234719
2234975
2235231
2235487
2235743
2235999
2236255
