cell,geo
1,c
2,e
3,g
4,e
5,e
6,g
7,e
8,c
9,C
10,n
11,n
12,n
13,O
14,o
15,n
16,n
17,n
18,C
19,G
20,n
21,n
22,n
23,n
24,n
25,n
26,n
27,n
28,G
29,E
30,n
31,n
32,n
33,n
34,n
35,n
36,n
37,n
38,n
39,E
40,E
41,n
42,n
43,n
44,n
45,n
46,n
47,n
48,n
49,n
50,n
51,E
52,E
53,n
54,n
55,n
56,n
57,n
58,n
59,n
60,n
61,O
62,o
63,n
64,n
65,E
66,G
67,n
68,n
69,O
70,o
71,n
72,n
73,n
74,n
75,n
76,n
77,n
78,n
79,n
80,G
81,C
82,n
83,n
84,n
85,n
86,n
87,n
88,n
89,n
90,n
91,n
92,n
93,n
94,n
95,C
96,c
97,n
98,n
99,n
100,n
101,n
102,n
103,n
104,n
105,n
106,n
107,n
108,n
109,n
110,n
111,c
112,e
113,n
114,n
115,n
116,n
117,n
118,n
119,n
120,n
121,n
122,n
123,n
124,n
125,n
126,e
127,g
128,n
129,n
130,n
131,n
132,n
133,n
134,n
135,n
136,n
137,n
138,n
139,n
140,g
141,e
142,O
143,o
144,n
145,n
146,n
147,n
148,n
149,n
150,n
151,n
152,n
153,O
154,o
155,e
156,e
157,n
158,n
159,n
160,n
161,n
162,O
163,o
164,n
165,n
166,n
167,n
168,e
169,g
170,n
171,n
172,n
173,n
174,n
175,n
176,n
177,n
178,n
179,g
180,e
181,n
182,n
183,n
184,n
185,n
186,n
187,n
188,n
189,e
190,c
191,C
192,G
193,E
194,E
195,E
196,G
197,C
198,c
