# SKIROC CHANNEL | LAYER SENSOR_IX SENSOR_IV IX IV TYPE
1   0  0 0    0   0  0 0
1   1  0 0    0   0  0 0
1   2  0 0    0   0  0 0
1   4  0 0    0   0  0 0
1   5  0 0    0   0  0 0
1   6  0 0    0   0  0 0
1   7  0 0    0   0  0 0
1   8  0 0    0   0  0 0
1   9  0 0    0   0  0 0
1   10 0    0   0  0 0    0
1   12 0    0   0  0 0    0
1   13 0    0   0  0 0    0
1   14 0    0   0  0 0    0
1   16 0    0   0  0 0    0
1   17 0    0   0  0 0    0
1   18 0    0   0  0 0    0
1   20 0    0   0  0 0    0
1   21 0    0   0  0 0    0
1   22 0    0   0  0 0    0
1   24 0    0   0  0 0    0
1   25 0    0   0  0 0    0
1   26 0    0   0  0 0    0
1   28 0    0   0  0 0    0
1   29 0    0   0  0 0    0
1   30 0    0   0  0 0    0
1   32 0    0   0  0 0    0
1   33 0    0   0  0 0    0
1   34 0    0   0  0 0    0
1   36 0    0   0  0 0    0
1   37 0    0   0  0 0    0
1   38 0    0   0  0 0    0
1   40 0    0   0  0 0    0
1   41 0    0   0  0 0    0
1   42 0    0   0  0 0    0
1   44 0    0   0  0 0    0
1   45 0    0   0  0 0    0
1   46 0    0   0  0 0    0
1   48 0    0   0  0 0    0
1   49 0    0   0  0 0    0
1   50 0    0   0  0 0    0
1   52 0    0   0  0 0    0
1   53 0    0   0  0 0    0
1   54 0    0   0  0 0    0
1   55 0    0   0  0 0    0
1   56 0    0   0  0 0    0
1   57 0    0   0  0 0    0
1   58 0    0   0  0 0    0
1   60 0    0   0  0 0    0
1   61 0    0   0  0 0    0
1   62 0    0   0  0 0    0
2   0  0 0    0   0  0 0
2   1  0 0    0   0  0 0
2   2  0 0    0   0  0 0
2   4  0 0    0   0  0 0
2   5  0 0    0   0  0 0
2   6  0 0    0   0  0 0
2   8  0 0    0   0  0 0
2   9  0 0    0   0  0 0
2   10 0    0   0  0 0    0
2   12 0    0   0  0 0    0
2   13 0    0   0  0 0    0
2   14 0    0   0  0 0    0
2   16 0    0   0  0 0    0
2   17 0    0   0  0 0    0
2   18 0    0   0  0 0    0
2   20 0    0   0  0 0    0
2   21 0    0   0  0 0    0
2   22 0    0   0  0 0    0
2   24 0    0   0  0 0    0
2   25 0    0   0  0 0    0
2   26 0    0   0  0 0    0
2   28 0    0   0  0 0    0
2   29 0    0   0  0 0    0
2   30 0    0   0  0 0    0
2   32 0    0   0  0 0    0
2   33 0    0   0  0 0    0
2   34 0    0   0  0 0    0
2   36 0    0   0  0 0    0
2   37 0    0   0  0 0    0
2   38 0    0   0  0 0    0
2   40 0    0   0  0 0    0
2   41 0    0   0  0 0    0
2   42 0    0   0  0 0    0
2   44 0    0   0  0 0    0
2   45 0    0   0  0 0    0
2   46 0    0   0  0 0    0
2   48 0    0   0  0 0    0
2   49 0    0   0  0 0    0
2   50 0    0   0  0 0    0
2   52 0    0   0  0 0    0
2   53 0    0   0  0 0    0
2   54 0    0   0  0 0    0
2   55 0    0   0  0 0    0
2   56 0    0   0  0 0    0
2   57 0    0   0  0 0    0
2   58 0    0   0  0 0    0
2   60 0    0   0  0 0    0
2   61 0    0   0  0 0    0
2   62 0    0   0  0 0    0
3   0  0 0    0   0  0 0
3   1  0 0    0   0  0 0
3   2  0 0    0   0  0 0
3   4  0 0    0   0  0 0
3   5  0 0    0   0  0 0
3   6  0 0    0   0  0 0
3   8  0 0    0   0  0 0
3   9  0 0    0   0  0 0
3   10 0    0   0  0 0    0
3   12 0    0   0  0 0    0
3   13 0    0   0  0 0    0
3   14 0    0   0  0 0    0
3   16 0    0   0  0 0    0
3   17 0    0   0  0 0    0
3   18 0    0   0  0 0    0
3   20 0    0   0  0 0    0
3   21 0    0   0  0 0    0
3   22 0    0   0  0 0    0
3   24 0    0   0  0 0    0
3   25 0    0   0  0 0    0
3   26 0    0   0  0 0    0
3   28 0    0   0  0 0    0
3   29 0    0   0  0 0    0
3   30 0    0   0  0 0    0
3   32 0    0   0  0 0    0
3   33 0    0   0  0 0    0
3   34 0    0   0  0 0    0
3   36 0    0   0  0 0    0
3   37 0    0   0  0 0    0
3   38 0    0   0  0 0    0
3   40 0    0   0  0 0    0
3   41 0    0   0  0 0    0
3   42 0    0   0  0 0    0
3   44 0    0   0  0 0    0
3   45 0    0   0  0 0    0
3   46 0    0   0  0 0    0
3   48 0    0   0  0 0    0
3   49 0    0   0  0 0    0
3   50 0    0   0  0 0    0
3   52 0    0   0  0 0    0
3   53 0    0   0  0 0    0
3   54 0    0   0  0 0    0
3   55 0    0   0  0 0    0
3   56 0    0   0  0 0    0
3   57 0    0   0  0 0    0
3   58 0    0   0  0 0    0
3   60 0    0   0  0 0    0
3   61 0    0   0  0 0    0
3   62 0    0   0  0 0    0
4   0  0 0    0   0  0 0
4   1  0 0    0   0  0 0
4   2  0 0    0   0  0 0
4   4  0 0    0   0  0 0
4   5  0 0    0   0  0 0
4   6  0 0    0   0  0 0
4   7  0 0    0   0  0 0
4   8  0 0    0   0  0 0
4   9  0 0    0   0  0 0
4   10 0    0   0  0 0    0
4   12 0    0   0  0 0    0
4   13 0    0   0  0 0    0
4   14 0    0   0  0 0    0
4   16 0    0   0  0 0    0
4   17 0    0   0  0 0    0
4   18 0    0   0  0 0    0
4   20 0    0   0  0 0    0
4   21 0    0   0  0 0    0
4   22 0    0   0  0 0    0
4   24 0    0   0  0 0    0
4   25 0    0   0  0 0    0
4   26 0    0   0  0 0    0
4   28 0    0   0  0 0    0
4   29 0    0   0  0 0    0
4   30 0    0   0  0 0    0
4   32 0    0   0  0 0    0
4   33 0    0   0  0 0    0
4   34 0    0   0  0 0    0
4   36 0    0   0  0 0    0
4   37 0    0   0  0 0    0
4   38 0    0   0  0 0    0
4   40 0    0   0  0 0    0
4   41 0    0   0  0 0    0
4   42 0    0   0  0 0    0
4   44 0    0   0  0 0    0
4   45 0    0   0  0 0    0
4   46 0    0   0  0 0    0
4   48 0    0   0  0 0    0
4   49 0    0   0  0 0    0
4   50 0    0   0  0 0    0
4   52 0    0   0  0 0    0
4   53 0    0   0  0 0    0
4   54 0    0   0  0 0    0
4   55 0    0   0  0 0    0
4   56 0    0   0  0 0    0
4   57 0    0   0  0 0    0
4   58 0    0   0  0 0    0
4   60 0    0   0  0 0    0
4   61 0    0   0  0 0    0
4   62 0    0   0  0 0    0