Design Route Status
                                               :      # nets :
   ------------------------------------------- : ----------- :
   # of logical nets.......................... :       20500 :
       # of nets not needing routing.......... :        7024 :
           # of internally routed nets........ :        6916 :
           # of nets with no loads............ :         108 :
       # of routable nets..................... :       13476 :
           # of fully routed nets............. :       13476 :
       # of nets with routing errors.......... :           0 :
   ------------------------------------------- : ----------- :

