G04 Layer_Physical_Order=1*
G04 Layer_Color=255*
%FSLAX43Y43*%
%MOMM*%
G71*
G01*
G75*
%ADD10R,0.500X0.500*%
%ADD11R,3.800X4.000*%
%ADD12R,0.150X0.200*%
%ADD13R,0.100X0.200*%
%ADD14R,0.080X0.200*%
%ADD15R,0.220X0.200*%
%ADD16R,1.150X2.700*%
%ADD17R,1.000X0.900*%
%ADD18R,0.500X0.500*%
%ADD19R,0.300X0.800*%
%ADD20R,1.300X0.700*%
%ADD21R,0.900X1.000*%
%ADD22O,0.450X1.700*%
%ADD23R,0.600X1.550*%
%ADD24R,2.400X1.600*%
%ADD25R,1.600X2.400*%
%ADD26R,1.000X0.950*%
%ADD27C,0.100*%
%ADD28C,0.500*%
%ADD29C,0.150*%
%ADD30C,0.300*%
%ADD31C,0.400*%
%ADD32C,0.200*%
%ADD33C,0.120*%
%ADD34C,0.250*%
%ADD35C,1.000*%
%ADD36C,0.700*%
%ADD37C,1.000*%
%ADD38C,1.600*%
%ADD39C,1.700*%
%ADD40C,3.900*%
%ADD41C,4.000*%
%ADD42C,0.460*%
%ADD43C,0.600*%
G36*
X33500Y29000D02*
Y25000D01*
X31900D01*
X31000Y25900D01*
X30500Y26400D01*
Y31100D01*
X33500D01*
Y29000D01*
D02*
G37*
G36*
X24400Y30934D02*
Y27424D01*
X23427D01*
X23427Y31024D01*
X24310Y31024D01*
X24400Y30934D01*
D02*
G37*
G36*
X29300Y31010D02*
X29300Y23500D01*
X26790Y23500D01*
X26700Y23590D01*
X26700Y31100D01*
X29210D01*
X29300Y31010D01*
D02*
G37*
%LPC*%
G36*
X28627Y28776D02*
Y28627D01*
X28776D01*
X28716Y28716D01*
X28627Y28776D01*
D02*
G37*
G36*
X28373D02*
X28284Y28716D01*
X28224Y28627D01*
X28373D01*
Y28776D01*
D02*
G37*
G36*
X31127D02*
Y28627D01*
X31276D01*
X31216Y28716D01*
X31127Y28776D01*
D02*
G37*
G36*
X30873D02*
X30784Y28716D01*
X30724Y28627D01*
X30873D01*
Y28776D01*
D02*
G37*
G36*
X23773D02*
X23684Y28716D01*
X23624Y28627D01*
X23773D01*
Y28776D01*
D02*
G37*
G36*
X33176Y28373D02*
X33027D01*
Y28224D01*
X33116Y28284D01*
X33176Y28373D01*
D02*
G37*
G36*
X24027Y28776D02*
Y28627D01*
X24176D01*
X24116Y28716D01*
X24027Y28776D01*
D02*
G37*
G36*
X27727D02*
Y28627D01*
X27876D01*
X27816Y28716D01*
X27727Y28776D01*
D02*
G37*
G36*
X27473D02*
X27384Y28716D01*
X27324Y28627D01*
X27473D01*
Y28776D01*
D02*
G37*
G36*
X31873D02*
X31784Y28716D01*
X31724Y28627D01*
X31873D01*
Y28776D01*
D02*
G37*
G36*
X27473Y29373D02*
X27324D01*
X27384Y29284D01*
X27473Y29224D01*
Y29373D01*
D02*
G37*
G36*
X24176D02*
X24027D01*
Y29224D01*
X24116Y29284D01*
X24176Y29373D01*
D02*
G37*
G36*
X28373D02*
X28224D01*
X28284Y29284D01*
X28373Y29224D01*
Y29373D01*
D02*
G37*
G36*
X27876D02*
X27727D01*
Y29224D01*
X27816Y29284D01*
X27876Y29373D01*
D02*
G37*
G36*
X23773D02*
X23624D01*
X23684Y29284D01*
X23773Y29224D01*
Y29373D01*
D02*
G37*
G36*
X28776D02*
X28627D01*
Y29224D01*
X28716Y29284D01*
X28776Y29373D01*
D02*
G37*
G36*
X32127Y28776D02*
Y28627D01*
X32276D01*
X32216Y28716D01*
X32127Y28776D01*
D02*
G37*
G36*
X33027D02*
Y28627D01*
X33176D01*
X33116Y28716D01*
X33027Y28776D01*
D02*
G37*
G36*
X32773D02*
X32684Y28716D01*
X32624Y28627D01*
X32773D01*
Y28776D01*
D02*
G37*
G36*
X28173Y24092D02*
X28134Y24066D01*
X28108Y24027D01*
X28173D01*
Y24092D01*
D02*
G37*
G36*
X27227D02*
Y24027D01*
X27292D01*
X27266Y24066D01*
X27227Y24092D01*
D02*
G37*
G36*
X23773Y28373D02*
X23624D01*
X23684Y28284D01*
X23773Y28224D01*
Y28373D01*
D02*
G37*
G36*
X28427Y24092D02*
Y24027D01*
X28492D01*
X28466Y24066D01*
X28427Y24092D01*
D02*
G37*
G36*
X26973D02*
X26934Y24066D01*
X26908Y24027D01*
X26973D01*
Y24092D01*
D02*
G37*
G36*
X27292Y23773D02*
X27227D01*
Y23708D01*
X27266Y23734D01*
X27292Y23773D01*
D02*
G37*
G36*
X26973D02*
X26908D01*
X26934Y23734D01*
X26973Y23708D01*
Y23773D01*
D02*
G37*
G36*
X28492D02*
X28427D01*
Y23708D01*
X28466Y23734D01*
X28492Y23773D01*
D02*
G37*
G36*
X28173D02*
X28108D01*
X28134Y23734D01*
X28173Y23708D01*
Y23773D01*
D02*
G37*
G36*
X24176Y28373D02*
X24027D01*
Y28224D01*
X24116Y28284D01*
X24176Y28373D01*
D02*
G37*
G36*
X31873D02*
X31724D01*
X31784Y28284D01*
X31873Y28224D01*
Y28373D01*
D02*
G37*
G36*
X31276D02*
X31127D01*
Y28224D01*
X31216Y28284D01*
X31276Y28373D01*
D02*
G37*
G36*
X32773D02*
X32624D01*
X32684Y28284D01*
X32773Y28224D01*
Y28373D01*
D02*
G37*
G36*
X32276D02*
X32127D01*
Y28224D01*
X32216Y28284D01*
X32276Y28373D01*
D02*
G37*
G36*
X30873D02*
X30724D01*
X30784Y28284D01*
X30873Y28224D01*
Y28373D01*
D02*
G37*
G36*
X27876D02*
X27727D01*
Y28224D01*
X27816Y28284D01*
X27876Y28373D01*
D02*
G37*
G36*
X27473D02*
X27324D01*
X27384Y28284D01*
X27473Y28224D01*
Y28373D01*
D02*
G37*
G36*
X28776D02*
X28627D01*
Y28224D01*
X28716Y28284D01*
X28776Y28373D01*
D02*
G37*
G36*
X28373D02*
X28224D01*
X28284Y28284D01*
X28373Y28224D01*
Y28373D01*
D02*
G37*
G36*
X30873Y29373D02*
X30724D01*
X30784Y29284D01*
X30873Y29224D01*
Y29373D01*
D02*
G37*
G36*
X32773Y30373D02*
X32624D01*
X32684Y30284D01*
X32773Y30224D01*
Y30373D01*
D02*
G37*
G36*
X32276D02*
X32127D01*
Y30224D01*
X32216Y30284D01*
X32276Y30373D01*
D02*
G37*
G36*
X33176D02*
X33027D01*
Y30224D01*
X33116Y30284D01*
X33176Y30373D01*
D02*
G37*
G36*
X24027Y30776D02*
Y30627D01*
X24176D01*
X24116Y30716D01*
X24027Y30776D01*
D02*
G37*
G36*
X23773D02*
X23684Y30716D01*
X23624Y30627D01*
X23773D01*
Y30776D01*
D02*
G37*
G36*
X28776Y30373D02*
X28627D01*
Y30224D01*
X28716Y30284D01*
X28776Y30373D01*
D02*
G37*
G36*
X28373D02*
X28224D01*
X28284Y30284D01*
X28373Y30224D01*
Y30373D01*
D02*
G37*
G36*
X30873D02*
X30724D01*
X30784Y30284D01*
X30873Y30224D01*
Y30373D01*
D02*
G37*
G36*
X31873D02*
X31724D01*
X31784Y30284D01*
X31873Y30224D01*
Y30373D01*
D02*
G37*
G36*
X31276D02*
X31127D01*
Y30224D01*
X31216Y30284D01*
X31276Y30373D01*
D02*
G37*
G36*
X31873Y30776D02*
X31784Y30716D01*
X31724Y30627D01*
X31873D01*
Y30776D01*
D02*
G37*
G36*
X31127D02*
Y30627D01*
X31276D01*
X31216Y30716D01*
X31127Y30776D01*
D02*
G37*
G36*
X32127D02*
Y30627D01*
X32276D01*
X32216Y30716D01*
X32127Y30776D01*
D02*
G37*
G36*
X33027D02*
Y30627D01*
X33176D01*
X33116Y30716D01*
X33027Y30776D01*
D02*
G37*
G36*
X32773D02*
X32684Y30716D01*
X32624Y30627D01*
X32773D01*
Y30776D01*
D02*
G37*
G36*
X27727D02*
Y30627D01*
X27876D01*
X27816Y30716D01*
X27727Y30776D01*
D02*
G37*
G36*
X27473D02*
X27384Y30716D01*
X27324Y30627D01*
X27473D01*
Y30776D01*
D02*
G37*
G36*
X28373D02*
X28284Y30716D01*
X28224Y30627D01*
X28373D01*
Y30776D01*
D02*
G37*
G36*
X30873D02*
X30784Y30716D01*
X30724Y30627D01*
X30873D01*
Y30776D01*
D02*
G37*
G36*
X28627D02*
Y30627D01*
X28776D01*
X28716Y30716D01*
X28627Y30776D01*
D02*
G37*
G36*
X27876Y30373D02*
X27727D01*
Y30224D01*
X27816Y30284D01*
X27876Y30373D01*
D02*
G37*
G36*
X24027Y29776D02*
Y29627D01*
X24176D01*
X24116Y29716D01*
X24027Y29776D01*
D02*
G37*
G36*
X23773D02*
X23684Y29716D01*
X23624Y29627D01*
X23773D01*
Y29776D01*
D02*
G37*
G36*
X27473D02*
X27384Y29716D01*
X27324Y29627D01*
X27473D01*
Y29776D01*
D02*
G37*
G36*
X28373D02*
X28284Y29716D01*
X28224Y29627D01*
X28373D01*
Y29776D01*
D02*
G37*
G36*
X27727D02*
Y29627D01*
X27876D01*
X27816Y29716D01*
X27727Y29776D01*
D02*
G37*
G36*
X31873Y29373D02*
X31724D01*
X31784Y29284D01*
X31873Y29224D01*
Y29373D01*
D02*
G37*
G36*
X31276D02*
X31127D01*
Y29224D01*
X31216Y29284D01*
X31276Y29373D01*
D02*
G37*
G36*
X32276D02*
X32127D01*
Y29224D01*
X32216Y29284D01*
X32276Y29373D01*
D02*
G37*
G36*
X33176D02*
X33027D01*
Y29224D01*
X33116Y29284D01*
X33176Y29373D01*
D02*
G37*
G36*
X32773D02*
X32624D01*
X32684Y29284D01*
X32773Y29224D01*
Y29373D01*
D02*
G37*
G36*
X33027Y29776D02*
Y29627D01*
X33176D01*
X33116Y29716D01*
X33027Y29776D01*
D02*
G37*
G36*
X32773D02*
X32684Y29716D01*
X32624Y29627D01*
X32773D01*
Y29776D01*
D02*
G37*
G36*
X23773Y30373D02*
X23624D01*
X23684Y30284D01*
X23773Y30224D01*
Y30373D01*
D02*
G37*
G36*
X27473D02*
X27324D01*
X27384Y30284D01*
X27473Y30224D01*
Y30373D01*
D02*
G37*
G36*
X24176D02*
X24027D01*
Y30224D01*
X24116Y30284D01*
X24176Y30373D01*
D02*
G37*
G36*
X30873Y29776D02*
X30784Y29716D01*
X30724Y29627D01*
X30873D01*
Y29776D01*
D02*
G37*
G36*
X28627D02*
Y29627D01*
X28776D01*
X28716Y29716D01*
X28627Y29776D01*
D02*
G37*
G36*
X31127D02*
Y29627D01*
X31276D01*
X31216Y29716D01*
X31127Y29776D01*
D02*
G37*
G36*
X32127D02*
Y29627D01*
X32276D01*
X32216Y29716D01*
X32127Y29776D01*
D02*
G37*
G36*
X31873D02*
X31784Y29716D01*
X31724Y29627D01*
X31873D01*
Y29776D01*
D02*
G37*
%LPD*%
D10*
X52900Y54900D02*
D03*
D11*
X50000Y53870D02*
D03*
D12*
X50360Y50970D02*
D03*
X48680Y50670D02*
D03*
X48520Y50970D02*
D03*
X50520Y50670D02*
D03*
X51320Y51010D02*
D03*
X51480Y50710D02*
D03*
D13*
X48800Y50370D02*
D03*
X48880Y50070D02*
D03*
X48960Y49770D02*
D03*
X49120Y50070D02*
D03*
X49200Y50370D02*
D03*
X49760Y50670D02*
D03*
X49840Y50370D02*
D03*
X49900Y50070D02*
D03*
X50000Y49770D02*
D03*
X50100Y50070D02*
D03*
X50160Y50370D02*
D03*
X50240Y50670D02*
D03*
X50640Y50370D02*
D03*
X50720Y50070D02*
D03*
X50780Y49770D02*
D03*
X50880Y49470D02*
D03*
X50980Y49770D02*
D03*
X51040Y50070D02*
D03*
X51120Y50370D02*
D03*
X51200Y50670D02*
D03*
D14*
X49030Y49470D02*
D03*
D15*
X49360Y50670D02*
D03*
X49600Y50970D02*
D03*
D16*
X75800Y46400D02*
D03*
X72800D02*
D03*
X75800Y52700D02*
D03*
X72800D02*
D03*
D17*
X72800Y48800D02*
D03*
Y50400D02*
D03*
X15500Y60800D02*
D03*
Y59200D02*
D03*
X17300Y60800D02*
D03*
Y59200D02*
D03*
X15500Y70400D02*
D03*
Y68800D02*
D03*
X17300Y70400D02*
D03*
Y68800D02*
D03*
D18*
X52900Y53500D02*
D03*
D19*
X44750Y38000D02*
D03*
X45250D02*
D03*
X44250Y36000D02*
D03*
X44750D02*
D03*
X45250D02*
D03*
X45750D02*
D03*
Y38000D02*
D03*
X44250D02*
D03*
X50250D02*
D03*
X51750D02*
D03*
X51250D02*
D03*
X50750D02*
D03*
X50250Y36000D02*
D03*
X50750D02*
D03*
X51250D02*
D03*
X51750D02*
D03*
X62750D02*
D03*
X63250D02*
D03*
X62250Y38000D02*
D03*
X63750D02*
D03*
X63250D02*
D03*
X62750D02*
D03*
X62250Y36000D02*
D03*
X63750D02*
D03*
X53250Y38000D02*
D03*
X54750D02*
D03*
X54250D02*
D03*
X53750D02*
D03*
X53250Y36000D02*
D03*
X53750D02*
D03*
X54250D02*
D03*
X54750D02*
D03*
X59750Y38000D02*
D03*
X60250D02*
D03*
X56750D02*
D03*
X57250D02*
D03*
X59250Y36000D02*
D03*
X59750D02*
D03*
X60250D02*
D03*
X60750D02*
D03*
Y38000D02*
D03*
X59250D02*
D03*
X56250Y36000D02*
D03*
X56750D02*
D03*
X57250D02*
D03*
X57750D02*
D03*
Y38000D02*
D03*
X56250D02*
D03*
X47250Y36000D02*
D03*
X47750D02*
D03*
X48250D02*
D03*
X48750D02*
D03*
Y38000D02*
D03*
X48250D02*
D03*
X47750D02*
D03*
X47250D02*
D03*
D20*
X45000Y37000D02*
D03*
X51000D02*
D03*
X63000D02*
D03*
X54000D02*
D03*
X60000D02*
D03*
X57000D02*
D03*
X48000D02*
D03*
D21*
X63800Y33200D02*
D03*
X62200D02*
D03*
X51800D02*
D03*
X50200D02*
D03*
X54800D02*
D03*
X53200D02*
D03*
D22*
X40375Y51700D02*
D03*
X39725D02*
D03*
X39075D02*
D03*
X38425D02*
D03*
X40375Y47500D02*
D03*
X39725D02*
D03*
X39075D02*
D03*
X38425D02*
D03*
X16025Y62700D02*
D03*
X16675D02*
D03*
X17325D02*
D03*
X17975D02*
D03*
X16025Y66900D02*
D03*
X16675D02*
D03*
X17325D02*
D03*
X17975D02*
D03*
D23*
X18605Y53500D02*
D03*
X17335D02*
D03*
X16065D02*
D03*
X14795D02*
D03*
X18605Y48100D02*
D03*
X17335D02*
D03*
X16065D02*
D03*
X14795D02*
D03*
D24*
X32000Y75000D02*
D03*
Y45000D02*
D03*
X68000Y45000D02*
D03*
Y75000D02*
D03*
D25*
X35000Y42000D02*
D03*
X65000D02*
D03*
X65000Y78000D02*
D03*
X63000D02*
D03*
X61000D02*
D03*
X59000D02*
D03*
X57000D02*
D03*
X55000D02*
D03*
X53000D02*
D03*
X51000D02*
D03*
X49000D02*
D03*
X47000D02*
D03*
X45000D02*
D03*
X43000D02*
D03*
X41000D02*
D03*
X39000D02*
D03*
X37000D02*
D03*
X35000D02*
D03*
D26*
X20100Y66800D02*
D03*
Y65200D02*
D03*
X19100Y60800D02*
D03*
Y59200D02*
D03*
D27*
X50620Y51540D02*
Y51560D01*
Y51070D02*
Y51540D01*
X49200Y50370D02*
Y50430D01*
Y50320D02*
Y50370D01*
X51600Y51970D02*
Y53870D01*
Y54970D01*
X48400Y53870D02*
Y54970D01*
Y51970D02*
Y53870D01*
X50000Y51970D02*
X50244D01*
X49600D02*
X50000D01*
X50244D02*
X50360D01*
X51105Y51215D02*
X51250Y51360D01*
X51105Y50923D02*
Y51215D01*
X51250Y51360D02*
X52840D01*
X52923Y51560D02*
X53329Y51154D01*
X51167Y51560D02*
X52923D01*
X50905Y51298D02*
X51167Y51560D01*
X50905Y51006D02*
Y51298D01*
X50810Y50911D02*
X50905Y51006D01*
X50810Y50691D02*
Y50911D01*
X50590Y51040D02*
X50620Y51070D01*
X50590Y50735D02*
Y51040D01*
X50525Y50670D02*
X50590Y50735D01*
X49850Y51060D02*
X50240Y50670D01*
X49850Y51060D02*
Y51490D01*
X49460Y51970D02*
X49600D01*
X48400D02*
X49460D01*
X52840Y51360D02*
X53200Y51000D01*
X47200Y51300D02*
X48600D01*
X51010Y50828D02*
X51105Y50923D01*
X51010Y50608D02*
Y50828D01*
X53200Y50800D02*
Y51000D01*
X51827Y50000D02*
X52783D01*
X51200Y50627D02*
X51827Y50000D01*
X51200Y50627D02*
Y50670D01*
X52783Y50000D02*
X53029Y49754D01*
X51690Y49800D02*
X52700D01*
X51600Y51770D02*
Y51970D01*
X52000D01*
X50360D02*
X51600D01*
X48000D02*
X48400D01*
Y51770D02*
Y51970D01*
X50930Y50528D02*
X51010Y50608D01*
X51120Y50370D02*
X51690Y49800D01*
X51092Y50020D02*
X52559Y48554D01*
X48600Y51300D02*
X48990Y50910D01*
X50400Y48000D02*
Y48500D01*
Y48000D02*
X51100Y47300D01*
Y46650D02*
Y47300D01*
Y46650D02*
X51250Y46500D01*
X50200Y47917D02*
Y48500D01*
Y47917D02*
X50900Y47217D01*
Y46650D02*
Y47217D01*
X50750Y46500D02*
X50900Y46650D01*
X50000Y46700D02*
Y49770D01*
Y46700D02*
X50200Y46500D01*
X53329Y51154D02*
X53554D01*
X50850Y50228D02*
X50930Y50308D01*
Y50528D01*
X50735Y50465D02*
Y50616D01*
X50810Y50691D01*
X53029Y49754D02*
X53254D01*
X52559Y48554D02*
X52754D01*
X50850Y50200D02*
Y50228D01*
X50720Y50070D02*
X50850Y50200D01*
X50720Y50070D02*
Y50098D01*
X50640Y50370D02*
X50735Y50465D01*
X49800Y49970D02*
X49900Y50070D01*
X49700Y46500D02*
X49800Y46600D01*
Y49970D01*
X49840Y50364D02*
Y50370D01*
X49796Y50320D02*
X49840Y50364D01*
X49795Y50320D02*
X49796D01*
X49600Y50125D02*
X49795Y50320D01*
X49600Y47617D02*
Y50125D01*
X48600Y46617D02*
X49600Y47617D01*
X48600Y45850D02*
X48750Y45700D01*
X48600Y45850D02*
Y46617D01*
X51090Y50020D02*
X51092D01*
X51040Y50070D02*
X51090Y50020D01*
X52400Y48200D02*
Y48350D01*
X50980Y49770D02*
X52400Y48350D01*
X50680Y48437D02*
Y49670D01*
X50780Y49770D01*
X52000Y47000D02*
Y47117D01*
X50680Y48437D02*
X52000Y47117D01*
X50212Y50320D02*
X50400Y50132D01*
X50160Y50370D02*
X50210Y50320D01*
X50212D01*
X50400Y48500D02*
X50400Y48500D01*
X50400Y48500D02*
Y50132D01*
X50200Y48500D02*
Y49970D01*
Y48500D02*
X50200Y48500D01*
X50100Y50070D02*
X50200Y49970D01*
X47400Y46500D02*
X48850Y47950D01*
X48300Y49490D02*
X48880Y50070D01*
X47000Y46400D02*
X48600Y48000D01*
X47000Y46100D02*
Y46400D01*
X48600Y48000D02*
Y49410D01*
X47400Y46100D02*
Y46500D01*
X47800Y46100D02*
Y46600D01*
X48990Y50632D02*
Y50910D01*
X48600Y49410D02*
X48960Y49770D01*
X48990Y50632D02*
X49192Y50430D01*
X49200D01*
X49120Y50020D02*
Y50070D01*
X48300Y48600D02*
Y49490D01*
X47400Y47700D02*
X48300Y48600D01*
X47400Y48600D02*
X48000Y49200D01*
Y49570D01*
X48800Y50370D01*
X48250Y45700D02*
X48400Y45850D01*
Y46700D01*
X49400Y47700D01*
Y50208D01*
X49640Y50448D01*
Y50550D01*
X49760Y50670D01*
X52046Y47354D02*
X52354D01*
X50880Y48520D02*
X52046Y47354D01*
X50880Y48520D02*
Y49470D01*
X49120Y50070D02*
X49200Y49990D01*
X47800Y46600D02*
X49200Y48000D01*
Y49990D01*
X48850Y47950D02*
Y49300D01*
X49020Y49470D01*
X52700Y49800D02*
X52900Y49600D01*
Y49400D02*
Y49600D01*
D28*
X17350Y55250D02*
X17400Y55300D01*
X17335Y55235D02*
X17350Y55250D01*
X16100Y53500D02*
Y55300D01*
X75850Y46450D02*
X75900Y46400D01*
X75800Y46500D02*
X75850Y46450D01*
X20100Y65200D02*
Y65300D01*
Y64100D02*
Y65200D01*
X23800Y28500D02*
Y28700D01*
Y20900D02*
Y28500D01*
Y20900D02*
X24600Y20100D01*
X72800Y53500D02*
Y69300D01*
Y52700D02*
Y53500D01*
X55200D02*
X72800D01*
X27100Y23900D02*
X28300D01*
X27100D02*
Y23900D01*
X36100Y50800D02*
X37500D01*
X38300Y51600D01*
X28300Y17600D02*
X29600D01*
X24600Y22600D02*
X25800D01*
X29600Y21300D02*
X32900D01*
X25800Y20100D02*
X25800D01*
X29600Y22600D02*
X30900D01*
Y18800D02*
X32200D01*
X28400Y21300D02*
X29600D01*
X24600Y20100D02*
X25800D01*
X24700Y17500D02*
X25800D01*
X17400Y55300D02*
X18600D01*
X17300Y58300D02*
Y59200D01*
X14800Y66900D02*
X16025D01*
X19100Y60800D02*
Y62600D01*
X18000Y62600D02*
X19100D01*
X15500Y58300D02*
Y59200D01*
X34200Y78800D02*
X35000Y78000D01*
X63000D02*
Y79600D01*
X63500Y80100D01*
X19100Y58300D02*
Y59200D01*
X14795Y53500D02*
Y55295D01*
X18605Y53500D02*
Y55295D01*
X18600Y55300D02*
X18605Y55295D01*
X17335Y53500D02*
Y55235D01*
X18605Y48100D02*
X19400D01*
X16100Y55300D02*
X17300D01*
X17400D01*
X66200Y80100D02*
X67200D01*
X30700Y78800D02*
X31600D01*
X32500D01*
X33400D01*
X34200D01*
X64000Y80100D02*
X65100D01*
X63500D02*
X64000D01*
X65100D02*
X66200D01*
X72800Y50400D02*
Y52700D01*
X69600Y72500D02*
X72800Y69300D01*
Y52700D02*
X72800Y52700D01*
X61000Y75100D02*
X63600Y72500D01*
X69600D01*
X61000Y75100D02*
Y78000D01*
X75800Y52700D02*
X76800D01*
X75700D02*
X75800D01*
X72800Y44700D02*
X73500Y44000D01*
X74500D01*
X75500D01*
X75800Y47500D02*
X75900Y47400D01*
X72800Y44700D02*
Y46400D01*
X75900D02*
X76800D01*
X72800D02*
Y48800D01*
X72800Y48800D02*
X72800Y48800D01*
D29*
X51330Y51000D02*
X51340Y51010D01*
X51320Y50990D02*
X51330Y51000D01*
X49325Y50670D02*
Y51005D01*
X49600Y50970D02*
Y51130D01*
X49440Y51290D02*
X49600Y51130D01*
X49440Y51290D02*
Y51950D01*
X49010Y51320D02*
X49325Y51005D01*
X49010Y51320D02*
Y51490D01*
X49440Y51950D02*
X49460Y51970D01*
X52410Y51010D02*
X52450Y50970D01*
X51340Y51010D02*
X52410D01*
X48200Y50400D02*
X48470Y50670D01*
X48680D01*
X47770Y50970D02*
X48520D01*
X51710Y50710D02*
X52050Y50370D01*
X51520Y50710D02*
X51710D01*
X49325Y50670D02*
X49360D01*
D30*
X38400Y46100D02*
Y47500D01*
X38450Y46050D02*
X38475Y46025D01*
X38400Y46100D02*
X38450Y46050D01*
X52100Y50370D02*
X52770D01*
X52050D02*
X52100D01*
X39700Y51700D02*
Y51700D01*
Y50600D02*
Y51700D01*
X16100Y48100D02*
Y49700D01*
Y47000D02*
Y48100D01*
X15550Y60750D02*
X16675Y61875D01*
X15450Y60850D02*
X15500Y60900D01*
X13300Y58700D02*
X15450Y60850D01*
X47200Y50400D02*
X47770Y50970D01*
X47200Y49700D02*
Y50400D01*
X54000Y53500D02*
X55200D01*
X52900D02*
X54000D01*
Y54900D01*
X52900D02*
X54000D01*
X52770Y50370D02*
X52800Y50400D01*
X29000Y49100D02*
X39600D01*
X28200Y50000D02*
X39100D01*
X45750Y38050D02*
Y38850D01*
X26400Y72800D02*
X50300D01*
X25000Y49100D02*
X29000D01*
X24500Y50000D02*
X28200D01*
X25200Y72200D02*
X51900D01*
X46500Y39600D02*
X46500D01*
X45750Y38850D02*
X46500Y39600D01*
X49400Y37000D02*
X50700D01*
X60750Y38950D02*
X61400Y39600D01*
X60750Y38000D02*
Y38950D01*
X57750D02*
X58400Y39600D01*
X57750Y38000D02*
Y38950D01*
X48750D02*
X49400Y39600D01*
X48750Y38000D02*
Y38950D01*
X58600Y37000D02*
X60000D01*
X46500D02*
X48000D01*
X46500Y38000D02*
X47250D01*
X43500D02*
X44250D01*
X51750Y34950D02*
X51900Y34800D01*
X51750Y34950D02*
Y36000D01*
X54750Y34950D02*
X54900Y34800D01*
X54750Y34950D02*
Y36000D01*
X55500Y38000D02*
X56250D01*
X58600D02*
X59250D01*
X43500Y37000D02*
X45000D01*
X50700D02*
X50800Y37100D01*
X50250Y36550D02*
X50700Y37000D01*
X48300D02*
X48750Y36550D01*
X48200Y37100D02*
X48300Y37000D01*
X50700D02*
X51000D01*
X48000D02*
X48300D01*
X55500D02*
X57000D01*
X54000D02*
X55500D01*
X61500D02*
X62700D01*
X62250Y36550D02*
X62700Y37000D01*
X60300D02*
X60750Y36550D01*
X62700Y37000D02*
X63000D01*
X60000D02*
X60300D01*
X63750Y35450D02*
X64300Y34900D01*
X63750Y35450D02*
Y36000D01*
X62250D02*
Y36550D01*
X60750Y36000D02*
Y36550D01*
X57200Y37100D02*
X57750Y36550D01*
Y36000D02*
Y36550D01*
X53250Y36450D02*
X53800Y37000D01*
X53250Y36000D02*
Y36450D01*
X50250Y36000D02*
Y36550D01*
X48750Y36000D02*
Y36550D01*
X45200Y37100D02*
X45750Y36550D01*
Y36000D02*
Y36550D01*
X21600Y45700D02*
X25000Y49100D01*
X21000Y46500D02*
X24500Y50000D01*
X39600Y49100D02*
X40375Y49875D01*
X16300Y45700D02*
X21600D01*
X14795Y47205D02*
X16300Y45700D01*
X40375Y49875D02*
Y51700D01*
X39100Y50000D02*
X39700Y50600D01*
X16600Y46500D02*
X21000D01*
X16100Y47000D02*
X16600Y46500D01*
X14795Y47205D02*
Y48100D01*
Y50105D01*
X13300Y51600D02*
X14795Y50105D01*
X13300Y51600D02*
Y58700D01*
X13900Y55600D02*
X16400Y58100D01*
X13900Y51900D02*
Y55600D01*
Y51900D02*
X16100Y49700D01*
X16400Y58100D02*
Y59900D01*
X17300Y60800D01*
X38475Y46025D02*
X39725D01*
X39075Y46075D02*
Y47500D01*
X39725Y46025D02*
Y47500D01*
X16675Y61875D02*
Y62700D01*
X17325Y60925D02*
Y62700D01*
X17300Y68800D02*
X18200D01*
X17325Y66900D02*
Y68675D01*
X15600Y68800D02*
X16675Y67725D01*
Y66900D02*
Y67725D01*
X15500Y68800D02*
Y68800D01*
X14600D02*
X15500D01*
X53000Y75500D02*
Y78000D01*
X51000Y75500D02*
Y78000D01*
X55000Y75300D02*
Y78000D01*
X51900Y72200D02*
X55000Y75300D01*
X50300Y72800D02*
X53000Y75500D01*
X48900Y73400D02*
X51000Y75500D01*
X27500Y73400D02*
X48900D01*
X40375Y46225D02*
Y47500D01*
Y46225D02*
X40600Y46000D01*
X41200D01*
D31*
X16000Y62700D02*
Y63800D01*
Y62500D02*
Y62700D01*
X17975Y65775D02*
Y66900D01*
X16000Y63800D02*
X17975Y65775D01*
X15500Y70400D02*
X17300D01*
X17300Y70400D01*
X20100D01*
X20100Y66900D02*
Y66900D01*
Y67900D01*
X17975Y66900D02*
X20100D01*
D32*
X45700Y16600D02*
X46200Y16100D01*
X40400Y16600D02*
X45700D01*
X37500Y18800D02*
X40200Y16100D01*
X44800D01*
X46600Y50700D02*
X47200Y51300D01*
X46600Y46200D02*
Y50700D01*
X41500Y41100D02*
X46600Y46200D01*
X41500Y18300D02*
Y41100D01*
X41900Y40800D02*
X47000Y45900D01*
X41900Y19200D02*
Y40800D01*
X47000Y45900D02*
Y46100D01*
X49200Y24600D02*
Y28600D01*
Y24600D02*
X52500Y21300D01*
X34300Y32300D02*
X37500Y29100D01*
X25100Y32300D02*
X34300D01*
X21200Y36200D02*
X25100Y32300D01*
X34500Y32800D02*
X38000Y29300D01*
X25400Y32800D02*
X34500D01*
X21800Y36400D02*
X25400Y32800D01*
X34700Y33300D02*
X38500Y29500D01*
X25600Y33300D02*
X34700D01*
X22400Y36500D02*
X25600Y33300D01*
X21200Y36200D02*
Y42000D01*
X37500Y18800D02*
Y29100D01*
X38500Y19200D02*
Y29500D01*
X38000Y19000D02*
X40400Y16600D01*
X38000Y19000D02*
Y29300D01*
X38500Y19200D02*
X40700Y17000D01*
X46900D01*
X21800Y36400D02*
Y42500D01*
X22400Y36500D02*
Y43000D01*
X46900Y17000D02*
X47400Y17500D01*
X42700Y21000D02*
X44900Y18800D01*
X42700Y21000D02*
Y40400D01*
X43600Y17500D02*
Y18500D01*
X42300Y19800D02*
X43600Y18500D01*
X42300Y19800D02*
Y40600D01*
X41900Y19200D02*
X42300Y18800D01*
X41500Y18300D02*
X42300Y17500D01*
Y40600D02*
X47400Y45700D01*
X42700Y40400D02*
X47800Y45500D01*
Y46100D01*
X47400Y45700D02*
Y46100D01*
X45000Y78000D02*
Y78700D01*
X47000Y78000D02*
Y78700D01*
X49000Y78000D02*
Y78700D01*
X41000Y78000D02*
Y78700D01*
X43000Y78000D02*
Y78700D01*
X41600Y80100D02*
X43000Y78700D01*
X43100Y80600D02*
X45000Y78700D01*
X44600Y81100D02*
X47000Y78700D01*
X40100Y79600D02*
X41000Y78700D01*
X46100Y81600D02*
X49000Y78700D01*
X21200Y81600D02*
X46100D01*
X23700Y80100D02*
X41600D01*
X24000Y79600D02*
X40100D01*
X21900Y80900D02*
X22100Y81100D01*
X44600D01*
X22600Y80200D02*
X23000Y80600D01*
X43100D01*
X14600Y79000D02*
X15400Y78200D01*
X22600D01*
X24000Y79600D01*
X22600Y79000D02*
X23700Y80100D01*
X18200Y79000D02*
X22600D01*
X49800Y25300D02*
X52500Y22600D01*
X49800Y25300D02*
Y29200D01*
X49200Y29800D02*
X49800Y29200D01*
D33*
X50360Y50970D02*
Y51156D01*
X50230Y51286D02*
X50360Y51156D01*
X50230Y51286D02*
Y51956D01*
X50244Y51970D01*
Y52186D01*
X50230Y52200D02*
X50244Y52186D01*
D34*
X53200Y50800D02*
X62750Y41250D01*
X61100Y18500D02*
X61400Y18800D01*
X49900Y18500D02*
X61100D01*
X48250Y20150D02*
X49900Y18500D01*
X60900Y18000D02*
X61400Y17500D01*
X49693Y18000D02*
X60900D01*
X47750Y19943D02*
X49693Y18000D01*
X58400Y17100D02*
X58800Y17500D01*
X50750Y26543D02*
Y32025D01*
X51250Y26750D02*
Y32025D01*
X50750Y26543D02*
X53400Y23893D01*
X51250Y26750D02*
X53900Y24100D01*
X53400Y21293D02*
Y23893D01*
X53900Y21500D02*
Y24100D01*
X53400Y21293D02*
X54146Y20546D01*
X53900Y21500D02*
X54500Y20900D01*
X50200Y32575D02*
X50750Y32025D01*
X51250D02*
X51800Y32575D01*
X54500Y20900D02*
X57200D01*
X57600Y21300D01*
X47750Y19943D02*
Y36000D01*
X48250Y20150D02*
Y36000D01*
X51250Y39025D02*
Y46500D01*
X50750Y39025D02*
Y46500D01*
X51250Y39025D02*
X51750Y38525D01*
X50250D02*
X50750Y39025D01*
X50200Y43400D02*
Y46500D01*
X49700Y43607D02*
Y46500D01*
X50000Y43200D02*
X50200Y43400D01*
X47750Y41657D02*
X49700Y43607D01*
X47750Y38000D02*
Y41657D01*
X62750Y39025D02*
Y41250D01*
X62250Y38525D02*
X62750Y39025D01*
X53554Y51154D02*
X63250Y41457D01*
Y39025D02*
Y41457D01*
Y39025D02*
X63750Y38525D01*
X53254Y49754D02*
X60250Y42757D01*
Y38000D02*
Y42757D01*
X59750Y38000D02*
Y42550D01*
X52754Y48554D02*
X57250Y44057D01*
Y38000D02*
Y44057D01*
X52400Y48200D02*
X56750Y43850D01*
Y38000D02*
Y43850D01*
X62250Y38000D02*
Y38525D01*
X63750Y38000D02*
Y38525D01*
X53750Y34375D02*
Y36000D01*
X53200Y33825D02*
X53750Y34375D01*
X53200Y33200D02*
Y33825D01*
Y32575D02*
Y33200D01*
X54800D02*
Y33825D01*
Y32575D02*
Y33200D01*
X54250Y34375D02*
X54800Y33825D01*
X54250Y34375D02*
Y36000D01*
X71950Y20350D02*
Y20850D01*
X72450Y20350D02*
Y20643D01*
X71950Y20850D02*
X72600Y21500D01*
X72450Y20643D02*
X72807Y21000D01*
X72600Y21500D02*
X76593D01*
X72807Y21000D02*
X76800D01*
X76593Y21500D02*
X78200Y23107D01*
X76800Y21000D02*
X78700Y22900D01*
X78200Y23107D02*
Y28093D01*
X78700Y22900D02*
Y28300D01*
X76393Y29900D02*
X78200Y28093D01*
X76600Y30400D02*
X78700Y28300D01*
X63893Y29900D02*
X76393D01*
X64100Y30400D02*
X76600D01*
X62750Y31043D02*
X63893Y29900D01*
X63250Y31250D02*
X64100Y30400D01*
X62750Y31043D02*
Y32025D01*
X63250Y31250D02*
Y32025D01*
X71600Y20000D02*
X71950Y20350D01*
X62200Y32575D02*
X62750Y32025D01*
X72450Y20350D02*
X72800Y20000D01*
X63250Y32025D02*
X63800Y32575D01*
X75000Y25600D02*
Y26300D01*
X74500Y25600D02*
Y26093D01*
X74000Y27300D02*
X75000Y26300D01*
X73793Y26800D02*
X74500Y26093D01*
X63800Y27300D02*
X74000D01*
X63593Y26800D02*
X73793D01*
X60250Y30850D02*
X63800Y27300D01*
X59750Y30643D02*
X63593Y26800D01*
X60250Y30850D02*
Y36000D01*
X59750Y30643D02*
Y36000D01*
X75000Y25600D02*
X75400Y25200D01*
X74100D02*
X74500Y25600D01*
X73200Y23000D02*
Y23893D01*
X73700Y23000D02*
Y24100D01*
X72393Y24700D02*
X73200Y23893D01*
X72600Y25200D02*
X73700Y24100D01*
X62293Y24700D02*
X72393D01*
X62500Y25200D02*
X72600D01*
X56750Y30243D02*
X62293Y24700D01*
X57250Y30450D02*
X62500Y25200D01*
X56750Y30243D02*
Y36000D01*
X57250Y30450D02*
Y36000D01*
X72800Y22600D02*
X73200Y23000D01*
X73700Y23000D02*
X74100Y22600D01*
X49193Y16600D02*
X58400D01*
X49400Y17100D02*
X58400D01*
X44750Y21043D02*
X49193Y16600D01*
X45250Y21250D02*
X49400Y17100D01*
X44750Y21043D02*
Y36000D01*
X45250Y21250D02*
Y36000D01*
X58400Y16600D02*
X58800Y16200D01*
X50000Y43200D02*
Y43200D01*
X48750Y44550D02*
Y45700D01*
X48600Y44400D02*
X48750Y44550D01*
X48600Y44400D02*
Y44400D01*
X53250Y38000D02*
Y38525D01*
X54750Y38000D02*
Y38525D01*
X51750Y38000D02*
Y38525D01*
X50250Y38000D02*
Y38525D01*
X48250Y44757D02*
Y45700D01*
X44750Y38000D02*
Y41257D01*
X45250Y38000D02*
Y41050D01*
X44750Y41257D02*
X48250Y44757D01*
X45250Y41050D02*
X48600Y44400D01*
X48250Y38000D02*
Y41450D01*
X50000Y43200D01*
X53250Y38525D02*
X53750Y39025D01*
X54250D02*
X54750Y38525D01*
X53750Y39025D02*
Y45250D01*
X54250Y39025D02*
Y45457D01*
X52000Y47000D02*
X53750Y45250D01*
X52354Y47354D02*
X54250Y45457D01*
X54146Y20546D02*
X54146D01*
X51250Y34375D02*
Y36000D01*
Y34375D02*
X51800Y33825D01*
Y32575D02*
Y33200D01*
Y33825D01*
X50200Y32575D02*
Y33200D01*
Y33825D01*
X50750Y34375D01*
Y36000D01*
X54293Y20400D02*
X57300D01*
X57600Y20100D01*
X54146Y20546D02*
X54293Y20400D01*
X62200Y32575D02*
Y33200D01*
Y33825D01*
X62750Y34375D01*
Y36000D01*
X63800Y32575D02*
Y33200D01*
X63250Y34375D02*
Y36000D01*
Y34375D02*
X63800Y33825D01*
Y33200D02*
Y33825D01*
X54250Y32025D02*
X54800Y32575D01*
X63900Y16200D02*
X64300Y16600D01*
X53200Y32575D02*
X53750Y32025D01*
X63900Y17500D02*
X64300Y17100D01*
X54250Y27850D02*
Y32025D01*
X53750Y27643D02*
Y32025D01*
X54250Y27850D02*
X59000Y23100D01*
X53750Y27643D02*
X58793Y22600D01*
X59000Y23100D02*
X64900D01*
X58793Y22600D02*
X64693D01*
X64900Y23100D02*
X65700Y22300D01*
X64693Y22600D02*
X65200Y22093D01*
X65700Y17300D02*
Y22300D01*
X65200Y17507D02*
Y22093D01*
X65000Y16600D02*
X65700Y17300D01*
X64793Y17100D02*
X65200Y17507D01*
X64300Y16600D02*
X65000D01*
X64300Y17100D02*
X64793D01*
X52900Y49400D02*
X59750Y42550D01*
D35*
X32900Y28500D02*
Y28600D01*
Y21300D02*
Y28500D01*
D36*
X70800Y40660D02*
Y47100D01*
Y40660D02*
X73400Y38060D01*
X69300Y48600D02*
X70800Y47100D01*
X69300Y48600D02*
Y48700D01*
X73400Y40600D02*
X78900Y35100D01*
Y34000D02*
Y35100D01*
X69300Y48700D02*
Y49800D01*
Y50900D01*
Y51900D01*
X32000Y75000D02*
X32250D01*
X32000D02*
X32400Y74600D01*
X67500D02*
X67900Y75000D01*
X32400Y74600D02*
X33900D01*
X35000D01*
X36100D01*
X63600D02*
X64800D01*
X66000D01*
X67500D01*
D37*
X22765Y21330D02*
D03*
X77145Y18280D02*
D03*
D38*
X85500Y75000D02*
D03*
X82960Y77540D02*
D03*
Y72460D02*
D03*
X88040D02*
D03*
Y77540D02*
D03*
X27960Y88540D02*
D03*
X33040D02*
D03*
Y83460D02*
D03*
X27960D02*
D03*
X30500Y86000D02*
D03*
X40960Y88540D02*
D03*
X46040D02*
D03*
Y83460D02*
D03*
X40960D02*
D03*
X43500Y86000D02*
D03*
X53960Y88540D02*
D03*
X59040D02*
D03*
Y83460D02*
D03*
X53960D02*
D03*
X56500Y86000D02*
D03*
X66960Y88540D02*
D03*
X72040D02*
D03*
Y83460D02*
D03*
X66960D02*
D03*
X69500Y86000D02*
D03*
D39*
X16300Y73860D02*
D03*
Y76400D02*
D03*
X31500Y38540D02*
D03*
Y36000D02*
D03*
X29000Y59000D02*
D03*
Y61540D02*
D03*
Y69540D02*
D03*
Y67000D02*
D03*
X37200Y38540D02*
D03*
Y36000D02*
D03*
X82000Y45000D02*
D03*
X84540D02*
D03*
X73400Y35520D02*
D03*
Y38060D02*
D03*
Y40600D02*
D03*
X23500Y75500D02*
D03*
X26040D02*
D03*
D40*
X78900Y34000D02*
D03*
X82000Y39000D02*
D03*
X85100Y34000D02*
D03*
D41*
X15000Y85000D02*
D03*
X85000D02*
D03*
X15000Y20000D02*
D03*
X85000D02*
D03*
D42*
X46200Y16100D02*
D03*
X44800D02*
D03*
X50614Y51540D02*
D03*
X49850Y51490D02*
D03*
X49010D02*
D03*
X52450Y50970D02*
D03*
X52100Y50400D02*
D03*
X48200Y50400D02*
D03*
X53000Y54200D02*
D03*
X27100Y23900D02*
D03*
X28300D02*
D03*
X58800Y17500D02*
D03*
X52800Y50400D02*
D03*
X63900Y16200D02*
D03*
Y17500D02*
D03*
X29600Y22600D02*
D03*
X30900D02*
D03*
X29600Y17600D02*
D03*
X28300D02*
D03*
X52500Y21300D02*
D03*
Y22600D02*
D03*
X74100Y25200D02*
D03*
X75400D02*
D03*
X74100Y22600D02*
D03*
X72800D02*
D03*
X61400Y17500D02*
D03*
Y18800D02*
D03*
X58800Y16200D02*
D03*
X47400Y17500D02*
D03*
X42300D02*
D03*
Y18800D02*
D03*
X43600Y17500D02*
D03*
X44900Y18800D02*
D03*
X32200D02*
D03*
X30900D02*
D03*
X28400Y21300D02*
D03*
X29600D02*
D03*
X24600Y20100D02*
D03*
X25800D02*
D03*
Y17500D02*
D03*
X24700D02*
D03*
X24600Y22600D02*
D03*
X25800D02*
D03*
X57600Y21300D02*
D03*
Y20100D02*
D03*
X71600Y20000D02*
D03*
X72800D02*
D03*
X74100Y17500D02*
D03*
Y20100D02*
D03*
X66400Y20000D02*
D03*
X63900Y20100D02*
D03*
Y23800D02*
D03*
X66500D02*
D03*
X36000Y21300D02*
D03*
X33400Y17500D02*
D03*
X36000Y23800D02*
D03*
X39700D02*
D03*
X60100Y20100D02*
D03*
Y23900D02*
D03*
X52500Y23800D02*
D03*
Y20000D02*
D03*
X43700Y23800D02*
D03*
X36000Y18800D02*
D03*
X39700D02*
D03*
D43*
X50700Y52870D02*
D03*
X49300D02*
D03*
Y53970D02*
D03*
X50700D02*
D03*
Y55070D02*
D03*
X49300D02*
D03*
X35700Y48300D02*
D03*
X55800Y50300D02*
D03*
X60100D02*
D03*
X53100Y52700D02*
D03*
X58600D02*
D03*
X41600D02*
D03*
X58900Y50300D02*
D03*
X57400D02*
D03*
X41700Y47900D02*
D03*
X41600Y49900D02*
D03*
X45900Y50200D02*
D03*
X44300D02*
D03*
X42700D02*
D03*
X47100Y54500D02*
D03*
X41500D02*
D03*
X35700Y52500D02*
D03*
X47100Y52600D02*
D03*
X36100Y50800D02*
D03*
X47200Y50400D02*
D03*
Y49700D02*
D03*
X64500Y48400D02*
D03*
X58600Y47900D02*
D03*
X64500Y52500D02*
D03*
X61500Y31000D02*
D03*
X58500D02*
D03*
X56000D02*
D03*
X52500Y30300D02*
D03*
X17000Y31000D02*
D03*
Y32000D02*
D03*
Y33000D02*
D03*
Y34000D02*
D03*
Y38000D02*
D03*
Y39000D02*
D03*
Y40000D02*
D03*
Y41000D02*
D03*
X74000Y28500D02*
D03*
X73000D02*
D03*
X72000D02*
D03*
X71000D02*
D03*
X70000D02*
D03*
X63000Y43500D02*
D03*
X58300Y42700D02*
D03*
X69500Y63000D02*
D03*
Y64000D02*
D03*
Y65000D02*
D03*
Y66000D02*
D03*
X66000Y50000D02*
D03*
Y51000D02*
D03*
Y52000D02*
D03*
X59000Y74500D02*
D03*
X58000D02*
D03*
X46000Y74600D02*
D03*
X45000D02*
D03*
X40000Y74500D02*
D03*
X39000D02*
D03*
X28600Y39000D02*
D03*
Y40000D02*
D03*
Y45000D02*
D03*
Y46000D02*
D03*
X55500Y43500D02*
D03*
X52500D02*
D03*
X24000Y54000D02*
D03*
Y53000D02*
D03*
Y52000D02*
D03*
Y51000D02*
D03*
X23500Y70000D02*
D03*
Y71000D02*
D03*
Y72000D02*
D03*
Y73000D02*
D03*
X20000D02*
D03*
Y74000D02*
D03*
Y75000D02*
D03*
Y76000D02*
D03*
X23000Y89000D02*
D03*
X19000D02*
D03*
X77000D02*
D03*
X81000D02*
D03*
Y16000D02*
D03*
X85000D02*
D03*
X19000D02*
D03*
X15000D02*
D03*
X39000Y31000D02*
D03*
Y30000D02*
D03*
X56000Y32000D02*
D03*
Y33000D02*
D03*
X46500Y32700D02*
D03*
X58500Y32000D02*
D03*
Y33000D02*
D03*
X28500Y28500D02*
D03*
X23900D02*
D03*
Y29500D02*
D03*
Y30500D02*
D03*
X49200Y29800D02*
D03*
X46500Y28000D02*
D03*
Y29000D02*
D03*
X44000Y30000D02*
D03*
Y31000D02*
D03*
X32900Y28500D02*
D03*
X31000D02*
D03*
X32000D02*
D03*
X32900Y29500D02*
D03*
X31000D02*
D03*
X32000D02*
D03*
Y30500D02*
D03*
X31000D02*
D03*
X32900D02*
D03*
X27600Y28500D02*
D03*
Y29500D02*
D03*
X28500D02*
D03*
Y30500D02*
D03*
X27600D02*
D03*
X49200Y28600D02*
D03*
X25200Y72200D02*
D03*
X26400Y72800D02*
D03*
X29000Y49100D02*
D03*
X22400Y43000D02*
D03*
X21800Y42500D02*
D03*
X21200Y42000D02*
D03*
X28200Y50000D02*
D03*
X69300Y48700D02*
D03*
Y49800D02*
D03*
Y50900D02*
D03*
Y51900D02*
D03*
X46500Y39600D02*
D03*
X49400Y37000D02*
D03*
X61400Y39600D02*
D03*
X58400D02*
D03*
X49400D02*
D03*
X58600Y37000D02*
D03*
X46500D02*
D03*
Y38000D02*
D03*
X43500D02*
D03*
X51900Y34800D02*
D03*
X54900D02*
D03*
X55500Y38000D02*
D03*
X58600D02*
D03*
X43500Y37000D02*
D03*
X55500D02*
D03*
X61500D02*
D03*
X64300Y34900D02*
D03*
X17300Y55300D02*
D03*
X17300Y58300D02*
D03*
X38400Y46000D02*
D03*
X89000Y20000D02*
D03*
Y16000D02*
D03*
Y24000D02*
D03*
X11000D02*
D03*
Y16000D02*
D03*
Y20000D02*
D03*
X19100Y62600D02*
D03*
X20100Y64100D02*
D03*
X14800Y66900D02*
D03*
X89000Y29000D02*
D03*
Y33000D02*
D03*
X11000D02*
D03*
Y29000D02*
D03*
Y77000D02*
D03*
Y73000D02*
D03*
X89000Y81000D02*
D03*
X57000Y78900D02*
D03*
X59000D02*
D03*
X39000D02*
D03*
X37000D02*
D03*
X15000Y89000D02*
D03*
X11000D02*
D03*
Y81000D02*
D03*
Y85000D02*
D03*
Y69000D02*
D03*
Y65000D02*
D03*
Y61000D02*
D03*
Y37000D02*
D03*
Y41000D02*
D03*
Y45000D02*
D03*
Y53000D02*
D03*
Y49000D02*
D03*
Y57000D02*
D03*
X89000D02*
D03*
Y49000D02*
D03*
Y53000D02*
D03*
Y45000D02*
D03*
Y41000D02*
D03*
Y37000D02*
D03*
Y61000D02*
D03*
Y65000D02*
D03*
Y69000D02*
D03*
Y85000D02*
D03*
X85000Y89000D02*
D03*
X89000D02*
D03*
X65000Y78900D02*
D03*
X31100Y45000D02*
D03*
X35000Y41100D02*
D03*
X65000D02*
D03*
X68900Y45000D02*
D03*
X15500Y58300D02*
D03*
X18200Y68800D02*
D03*
X14600D02*
D03*
X33900Y74600D02*
D03*
X21200Y81600D02*
D03*
X66000Y74600D02*
D03*
X64800D02*
D03*
X36100D02*
D03*
X35000D02*
D03*
X63600D02*
D03*
X20100Y70400D02*
D03*
Y67900D02*
D03*
X30700Y78800D02*
D03*
X31600D02*
D03*
X32500D02*
D03*
X33400D02*
D03*
X67200Y80100D02*
D03*
X66200D02*
D03*
X27500Y73400D02*
D03*
X21900Y80900D02*
D03*
X22600Y80200D02*
D03*
X19100Y58300D02*
D03*
X14800Y55300D02*
D03*
X19400Y48100D02*
D03*
X47400Y47700D02*
D03*
Y48600D02*
D03*
X64000Y80100D02*
D03*
X65100D02*
D03*
X14600Y79000D02*
D03*
X18200D02*
D03*
X76800Y52700D02*
D03*
X73500Y44000D02*
D03*
X75500D02*
D03*
X74500D02*
D03*
X76800Y46400D02*
D03*
X23000Y16000D02*
D03*
X27000D02*
D03*
X31000D02*
D03*
X35000D02*
D03*
X39000D02*
D03*
X51000D02*
D03*
X55000D02*
D03*
X69000D02*
D03*
X73000D02*
D03*
X77000D02*
D03*
X41300Y46000D02*
D03*
M02*
