Project Outputs Generation Report
---------------------------------
Start Output Generation At 17:57:06 On 19/12/2016

Output: Report Board Stack
Type  : Report Board Stack
From  : PCB Document [CLICpix2_Chipboard.PcbDoc]


Files Generated   : 0
Documents Printed : 0

Finished Output Generation At 17:57:12 On 19/12/2016
