14.95 1.70
14.02 1.20
13.43 0.85
12.80 0.74
11.55 0.35
10.05 0.16
9.01 0.09
7.01 0.00
15.63 2.32
17.33 3.40
18.96 4.51
20.16 5.50
21.40 6.25
22.26 6.60
22.82 6.80
23.75 6.70
25.22 6.00
27.00 4.94
28.29 4.11
30.71 2.47
33.22 1.17
36.62 0.37





