KEK83    -0.0029979   0.00346467   0.  0. 0.    -0.016179    
KEK114   -0.006668   -0.00143858   0.  0. 0.    0.0353612    
KEKFE65   0.0181961  -0.0094352    0.  0. 0.   -0.000878594  
KEK94     0.0372388  -0.00923926   0.  0. 0.     0.269872    
KEK101   -0.042058    0.0717686    0.  0. 0.    -0.221218    
KEK113   -0.06847    -0.0724444    0.  0. 0.    -0.277011    
KEK115    0.0642626   0.0167422    0.  0. 0.     0.251314    
		












