Signal_prefix,ST_EE_Signal_Name,Change_from,Change_to,Change_when_ms,Plus_ms,Minus_ms,Link,Const_at
,ST_SW_Z_OPEN,,,CONST,2000,-500,,0
,ST_SW_OPNFLR_0,,,CONST,2000,-500,,0
,ST_SW_OPNFLR_1,,,CONST,2000,-500,,0
,ST_SOF_MDE_0,,,CONST,2000,-500,,0
,ST_SOF_MDE_1,,,CONST,2000,-500,,0
,ST_U_CAP_Z_LOW,,,CONST,2000,-500,,0