%!PS-Adobe-1.0
%%Creator: Unified Graphics System
%%Pages: (atend)
%%DocumentFonts: Helvetica
%%BoundingBox:  101   69  543  399
%%EndComments
/Sw{setlinewidth}def
/Sg{setgray}def
/Sd{setdash}def
/P {newpath
    moveto
0 0 rlineto
    stroke}def
/M {moveto}def
/D {lineto}def
/N {newpath}def
/S {stroke}def
/T {/Helvetica findfont
    exch
    scalefont
    setfont}def
/R {rotate}def
/W {show}def
/F {fill}def
/X {gsave}def
/Y {grestore}def
%%EndProlog
%%Page: 1 1
0.12000 0.12000 scale
1 setlinecap
1 setlinejoin
8 Sw
0.00 0.00 0.00 setrgbcolor
[] 0 Sd
N
2559 707 M
2559 616 D
S
N
2564 707 M
2564 616 D
S
N
2564 694 M
2572 702 D
2581 707 D
2590 707 D
2603 702 D
2611 694 D
2616 681 D
2616 672 D
2611 659 D
2603 650 D
2590 646 D
2581 646 D
2572 650 D
2564 659 D
S
N
2590 707 M
2598 702 D
2607 694 D
2611 681 D
2611 672 D
2607 659 D
2598 650 D
2590 646 D
S
N
2546 707 M
2564 707 D
S
N
2546 616 M
2577 616 D
S
N
2660 672 M
2660 611 D
S
N
2663 672 M
2663 611 D
S
N
2643 672 M
2640 655 D
2640 672 D
2683 672 D
2683 655 D
2680 672 D
S
N
2652 611 M
2672 611 D
S
N
2649 776 M
2649 715 D
S
N
2652 776 M
2652 715 D
S
N
2686 776 M
2686 715 D
S
N
2689 776 M
2689 715 D
S
N
2640 776 M
2660 776 D
S
N
2678 776 M
2698 776 D
S
N
2652 747 M
2686 747 D
S
N
2640 715 M
2660 715 D
S
N
2678 715 M
2698 715 D
S
N
2796 754 M
2796 616 D
S
N
2800 754 M
2800 616 D
S
N
2796 754 M
2826 754 D
S
N
2796 616 M
2826 616 D
S
N
2913 724 M
2917 711 D
2917 737 D
2913 724 D
2904 733 D
2891 737 D
2882 737 D
2869 733 D
2861 724 D
2856 715 D
2852 702 D
2852 681 D
2856 668 D
2861 659 D
2869 650 D
2882 646 D
2891 646 D
2904 650 D
2913 659 D
S
N
2882 737 M
2874 733 D
2865 724 D
2861 715 D
2856 702 D
2856 681 D
2861 668 D
2865 659 D
2874 650 D
2882 646 D
S
N
2913 681 M
2913 646 D
S
N
2917 681 M
2917 646 D
S
N
2900 681 M
2930 681 D
S
N
2956 681 M
3008 681 D
3008 689 D
3003 698 D
2999 702 D
2990 707 D
2977 707 D
2964 702 D
2956 694 D
2952 681 D
2952 672 D
2956 659 D
2964 650 D
2977 646 D
2986 646 D
2999 650 D
3008 659 D
S
N
3003 681 M
3003 694 D
2999 702 D
S
N
2977 707 M
2969 702 D
2960 694 D
2956 681 D
2956 672 D
2960 659 D
2969 650 D
2977 646 D
S
N
3034 737 M
3064 646 D
S
N
3038 737 M
3064 659 D
S
N
3094 737 M
3064 646 D
S
N
3025 737 M
3051 737 D
S
N
3077 737 M
3103 737 D
S
N
3146 754 M
3146 616 D
S
N
3150 754 M
3150 616 D
S
N
3120 754 M
3150 754 D
S
N
3120 616 M
3150 616 D
S
N
912 1797 M
1003 1797 D
S
N
912 1801 M
1003 1801 D
S
N
955 1797 M
947 1788 D
942 1779 D
942 1771 D
947 1758 D
955 1749 D
968 1745 D
977 1745 D
990 1749 D
999 1758 D
1003 1771 D
1003 1779 D
999 1788 D
990 1797 D
S
N
942 1771 M
947 1762 D
955 1753 D
968 1749 D
977 1749 D
990 1753 D
999 1762 D
1003 1771 D
S
N
912 1784 M
912 1801 D
S
N
1003 1797 M
1003 1814 D
S
N
942 1905 M
942 1862 D
947 1849 D
960 1840 D
973 1836 D
986 1836 D
994 1840 D
999 1844 D
1003 1853 D
1003 1862 D
999 1875 D
986 1883 D
973 1888 D
960 1888 D
951 1883 D
947 1879 D
942 1870 D
S
N
942 1862 M
947 1853 D
960 1844 D
973 1840 D
990 1840 D
999 1844 D
S
N
1003 1862 M
999 1870 D
986 1879 D
973 1883 D
955 1883 D
947 1879 D
S
N
947 1879 M
947 1905 D
S
N
895 2000 M
1033 1922 D
S
N
912 2073 M
1003 2073 D
S
N
912 2078 M
1003 2078 D
S
N
955 2073 M
947 2065 D
942 2056 D
942 2048 D
947 2035 D
955 2026 D
968 2022 D
977 2022 D
990 2026 D
999 2035 D
1003 2048 D
1003 2056 D
999 2065 D
990 2073 D
S
N
942 2048 M
947 2039 D
955 2030 D
968 2026 D
977 2026 D
990 2030 D
999 2039 D
1003 2048 D
S
N
912 2061 M
912 2078 D
S
N
1003 2073 M
1003 2091 D
S
N
942 2121 M
1033 2121 D
S
N
942 2125 M
1033 2125 D
S
N
955 2125 M
947 2134 D
942 2143 D
942 2151 D
947 2164 D
955 2173 D
968 2177 D
977 2177 D
990 2173 D
999 2164 D
1003 2151 D
1003 2143 D
999 2134 D
990 2125 D
S
N
942 2151 M
947 2160 D
955 2169 D
968 2173 D
977 2173 D
990 2169 D
999 2160 D
1003 2151 D
S
N
942 2108 M
942 2125 D
S
N
1033 2108 M
1033 2138 D
S
N
977 2222 M
1038 2222 D
S
N
977 2225 M
1038 2225 D
S
N
977 2205 M
994 2202 D
977 2202 D
977 2245 D
994 2245 D
977 2242 D
S
N
1038 2213 M
1038 2234 D
S
N
873 2210 M
934 2210 D
S
N
873 2213 M
934 2213 D
S
N
873 2248 M
934 2248 D
S
N
873 2251 M
934 2251 D
S
N
873 2202 M
873 2222 D
S
N
873 2239 M
873 2259 D
S
N
902 2213 M
902 2248 D
S
N
934 2202 M
934 2222 D
S
N
934 2239 M
934 2259 D
S
N
895 2357 M
1033 2357 D
S
N
895 2362 M
1033 2362 D
S
N
895 2357 M
895 2388 D
S
N
1033 2357 M
1033 2388 D
S
N
942 2422 M
1033 2422 D
S
N
942 2427 M
1033 2427 D
S
N
955 2427 M
947 2435 D
942 2444 D
942 2453 D
947 2466 D
955 2474 D
968 2479 D
977 2479 D
990 2474 D
999 2466 D
1003 2453 D
1003 2444 D
999 2435 D
990 2427 D
S
N
942 2453 M
947 2461 D
955 2470 D
968 2474 D
977 2474 D
990 2470 D
999 2461 D
1003 2453 D
S
N
942 2409 M
942 2427 D
S
N
1033 2409 M
1033 2440 D
S
N
912 2513 M
1003 2513 D
S
N
912 2518 M
1003 2518 D
S
N
955 2518 M
947 2526 D
942 2535 D
942 2543 D
947 2556 D
955 2565 D
968 2569 D
977 2569 D
990 2565 D
999 2556 D
1003 2543 D
1003 2535 D
999 2526 D
990 2518 D
S
N
942 2543 M
947 2552 D
955 2561 D
968 2565 D
977 2565 D
990 2561 D
999 2552 D
1003 2543 D
S
N
912 2500 M
912 2518 D
S
N
895 2669 M
1033 2591 D
S
N
925 2751 M
938 2755 D
912 2755 D
925 2751 D
917 2742 D
912 2729 D
912 2721 D
917 2708 D
925 2699 D
934 2695 D
947 2691 D
968 2691 D
981 2695 D
990 2699 D
999 2708 D
1003 2721 D
1003 2729 D
999 2742 D
990 2751 D
S
N
912 2721 M
917 2712 D
925 2703 D
934 2699 D
947 2695 D
968 2695 D
981 2699 D
990 2703 D
999 2712 D
1003 2721 D
S
N
968 2751 M
1003 2751 D
S
N
968 2755 M
1003 2755 D
S
N
968 2738 M
968 2768 D
S
N
968 2794 M
968 2846 D
960 2846 D
951 2842 D
947 2838 D
942 2829 D
942 2816 D
947 2803 D
955 2794 D
968 2790 D
977 2790 D
990 2794 D
999 2803 D
1003 2816 D
1003 2825 D
999 2838 D
990 2846 D
S
N
968 2842 M
955 2842 D
947 2838 D
S
N
942 2816 M
947 2807 D
955 2799 D
968 2794 D
977 2794 D
990 2799 D
999 2807 D
1003 2816 D
S
N
912 2872 M
1003 2902 D
S
N
912 2876 M
990 2902 D
S
N
912 2933 M
1003 2902 D
S
N
912 2864 M
912 2889 D
S
N
912 2915 M
912 2941 D
S
N
895 2985 M
1033 2985 D
S
N
895 2989 M
1033 2989 D
S
N
895 2959 M
895 2989 D
S
N
1033 2959 M
1033 2989 D
S
N
1268 3300 M
1268 975 D
S
N
1268 975 M
4437 975 D
S
N
4437 975 M
4437 3300 D
S
N
4437 3300 M
1268 3300 D
S
1379 975 P
N
1362 958 M
1396 993 D
S
N
1362 993 M
1396 958 D
S
1411 981 P
N
1393 963 M
1428 998 D
S
N
1393 998 M
1428 963 D
S
1442 1001 P
N
1425 984 M
1460 1018 D
S
N
1425 1018 M
1460 984 D
S
1474 1038 P
N
1457 1021 M
1491 1056 D
S
N
1457 1056 M
1491 1021 D
S
1506 1129 P
N
1488 1112 M
1523 1147 D
S
N
1488 1147 M
1523 1112 D
S
1537 1218 P
N
1520 1201 M
1555 1236 D
S
N
1520 1236 M
1555 1201 D
S
1569 1337 P
N
1552 1320 M
1586 1354 D
S
N
1552 1354 M
1586 1320 D
S
1601 1413 P
N
1584 1396 M
1618 1430 D
S
N
1584 1430 M
1618 1396 D
S
1633 1542 P
N
1615 1525 M
1650 1559 D
S
N
1615 1559 M
1650 1525 D
S
1664 1653 P
N
1647 1636 M
1682 1671 D
S
N
1647 1671 M
1682 1636 D
S
1696 1788 P
N
1679 1771 M
1713 1806 D
S
N
1679 1806 M
1713 1771 D
S
1728 1821 P
N
1710 1804 M
1745 1838 D
S
N
1710 1838 M
1745 1804 D
S
1759 1992 P
N
1742 1975 M
1777 2009 D
S
N
1742 2009 M
1777 1975 D
S
1791 2065 P
N
1774 2047 M
1808 2082 D
S
N
1774 2082 M
1808 2047 D
S
1823 2155 P
N
1805 2138 M
1840 2172 D
S
N
1805 2172 M
1840 2138 D
S
1854 2258 P
N
1837 2241 M
1872 2276 D
S
N
1837 2276 M
1872 2241 D
S
1886 2279 P
N
1869 2262 M
1903 2296 D
S
N
1869 2296 M
1903 2262 D
S
1918 2335 P
N
1900 2318 M
1935 2353 D
S
N
1900 2353 M
1935 2318 D
S
1949 2400 P
N
1932 2383 M
1967 2417 D
S
N
1932 2417 M
1967 2383 D
S
1981 2449 P
N
1964 2432 M
1998 2467 D
S
N
1964 2467 M
1998 2432 D
S
2013 2505 P
N
1996 2488 M
2030 2522 D
S
N
1996 2522 M
2030 2488 D
S
2045 2561 P
N
2027 2543 M
2062 2578 D
S
N
2027 2578 M
2062 2543 D
S
2076 2559 P
N
2059 2541 M
2094 2576 D
S
N
2059 2576 M
2094 2541 D
S
2108 2624 P
N
2091 2607 M
2125 2641 D
S
N
2091 2641 M
2125 2607 D
S
2140 2659 P
N
2122 2641 M
2157 2676 D
S
N
2122 2676 M
2157 2641 D
S
2171 2719 P
N
2154 2702 M
2189 2737 D
S
N
2154 2737 M
2189 2702 D
S
2203 2633 P
N
2186 2616 M
2220 2651 D
S
N
2186 2651 M
2220 2616 D
S
2235 2657 P
N
2217 2639 M
2252 2674 D
S
N
2217 2674 M
2252 2639 D
S
2266 2710 P
N
2249 2693 M
2284 2727 D
S
N
2249 2727 M
2284 2693 D
S
2298 2789 P
N
2281 2772 M
2315 2806 D
S
N
2281 2806 M
2315 2772 D
S
2330 2738 P
N
2313 2720 M
2347 2755 D
S
N
2313 2755 M
2347 2720 D
S
2361 2762 P
N
2344 2745 M
2379 2780 D
S
N
2344 2780 M
2379 2745 D
S
2393 2785 P
N
2376 2768 M
2410 2803 D
S
N
2376 2803 M
2410 2768 D
S
2425 2783 P
N
2408 2765 M
2442 2800 D
S
N
2408 2800 M
2442 2765 D
S
2457 2781 P
N
2439 2764 M
2474 2799 D
S
N
2439 2799 M
2474 2764 D
S
2488 2719 P
N
2471 2701 M
2506 2736 D
S
N
2471 2736 M
2506 2701 D
S
2520 2706 P
N
2503 2689 M
2537 2723 D
S
N
2503 2723 M
2537 2689 D
S
2552 2727 P
N
2534 2710 M
2569 2744 D
S
N
2534 2744 M
2569 2710 D
S
2583 2688 P
N
2566 2670 M
2601 2705 D
S
N
2566 2705 M
2601 2670 D
S
2615 2702 P
N
2598 2685 M
2632 2720 D
S
N
2598 2720 M
2632 2685 D
S
2647 2742 P
N
2629 2724 M
2664 2759 D
S
N
2629 2759 M
2664 2724 D
S
2678 2697 P
N
2661 2679 M
2696 2714 D
S
N
2661 2714 M
2696 2679 D
S
2710 2755 P
N
2693 2738 M
2727 2772 D
S
N
2693 2772 M
2727 2738 D
S
2742 2742 P
N
2725 2724 M
2759 2759 D
S
N
2725 2759 M
2759 2724 D
S
2774 2678 P
N
2756 2661 M
2791 2696 D
S
N
2756 2696 M
2791 2661 D
S
2805 2663 P
N
2788 2646 M
2823 2680 D
S
N
2788 2680 M
2823 2646 D
S
2837 2700 P
N
2820 2682 M
2854 2717 D
S
N
2820 2717 M
2854 2682 D
S
2869 2602 P
N
2851 2585 M
2886 2620 D
S
N
2851 2620 M
2886 2585 D
S
2900 2659 P
N
2883 2641 M
2918 2676 D
S
N
2883 2676 M
2918 2641 D
S
2932 2627 P
N
2915 2610 M
2949 2644 D
S
N
2915 2644 M
2949 2610 D
S
2964 2595 P
N
2946 2577 M
2981 2612 D
S
N
2946 2612 M
2981 2577 D
S
2995 2552 P
N
2978 2534 M
3013 2569 D
S
N
2978 2569 M
3013 2534 D
S
3027 2569 P
N
3010 2552 M
3044 2586 D
S
N
3010 2586 M
3044 2552 D
S
3059 2559 P
N
3041 2542 M
3076 2577 D
S
N
3041 2577 M
3076 2542 D
S
3090 2552 P
N
3073 2535 M
3108 2570 D
S
N
3073 2570 M
3108 2535 D
S
3122 2497 P
N
3105 2479 M
3139 2514 D
S
N
3105 2514 M
3139 2479 D
S
3154 2537 P
N
3137 2519 M
3171 2554 D
S
N
3137 2554 M
3171 2519 D
S
3186 2475 P
N
3168 2457 M
3203 2492 D
S
N
3168 2492 M
3203 2457 D
S
3217 2504 P
N
3200 2486 M
3235 2521 D
S
N
3200 2521 M
3235 2486 D
S
3249 2461 P
N
3232 2443 M
3266 2478 D
S
N
3232 2478 M
3266 2443 D
S
3281 2449 P
N
3263 2432 M
3298 2467 D
S
N
3263 2467 M
3298 2432 D
S
3312 2429 P
N
3295 2412 M
3330 2446 D
S
N
3295 2446 M
3330 2412 D
S
3344 2399 P
N
3327 2381 M
3361 2416 D
S
N
3327 2416 M
3361 2381 D
S
3376 2403 P
N
3358 2386 M
3393 2420 D
S
N
3358 2420 M
3393 2386 D
S
3407 2345 P
N
3390 2328 M
3425 2362 D
S
N
3390 2362 M
3425 2328 D
S
3439 2400 P
N
3422 2383 M
3456 2417 D
S
N
3422 2417 M
3456 2383 D
S
3471 2354 P
N
3453 2337 M
3488 2372 D
S
N
3453 2372 M
3488 2337 D
S
3502 2367 P
N
3485 2350 M
3520 2384 D
S
N
3485 2384 M
3520 2350 D
S
3534 2420 P
N
3517 2402 M
3551 2437 D
S
N
3517 2437 M
3551 2402 D
S
3566 2340 P
N
3549 2323 M
3583 2357 D
S
N
3549 2357 M
3583 2323 D
S
3598 2349 P
N
3580 2332 M
3615 2367 D
S
N
3580 2367 M
3615 2332 D
S
3629 2304 P
N
3612 2287 M
3647 2322 D
S
N
3612 2322 M
3647 2287 D
S
3661 2308 P
N
3644 2290 M
3678 2325 D
S
N
3644 2325 M
3678 2290 D
S
3693 2262 P
N
3675 2245 M
3710 2279 D
S
N
3675 2279 M
3710 2245 D
S
3724 2309 P
N
3707 2292 M
3742 2326 D
S
N
3707 2326 M
3742 2292 D
S
3756 2259 P
N
3739 2242 M
3773 2276 D
S
N
3739 2276 M
3773 2242 D
S
3788 2259 P
N
3770 2242 M
3805 2276 D
S
N
3770 2276 M
3805 2242 D
S
3819 2229 P
N
3802 2212 M
3837 2246 D
S
N
3802 2246 M
3837 2212 D
S
3851 2285 P
N
3834 2268 M
3868 2303 D
S
N
3834 2303 M
3868 2268 D
S
3883 2192 P
N
3865 2174 M
3900 2209 D
S
N
3865 2209 M
3900 2174 D
S
3914 2215 P
N
3897 2197 M
3932 2232 D
S
N
3897 2232 M
3932 2197 D
S
3946 2204 P
N
3929 2187 M
3963 2221 D
S
N
3929 2221 M
3963 2187 D
S
3978 2207 P
N
3961 2190 M
3995 2224 D
S
N
3961 2224 M
3995 2190 D
S
4010 2160 P
N
3992 2143 M
4027 2177 D
S
N
3992 2177 M
4027 2143 D
S
4041 2151 P
N
4024 2133 M
4059 2168 D
S
N
4024 2168 M
4059 2133 D
S
4073 2180 P
N
4056 2162 M
4090 2197 D
S
N
4056 2197 M
4090 2162 D
S
4105 2111 P
N
4087 2094 M
4122 2128 D
S
N
4087 2128 M
4122 2094 D
S
4136 2144 P
N
4119 2127 M
4154 2162 D
S
N
4119 2162 M
4154 2127 D
S
4168 2097 P
N
4151 2080 M
4185 2114 D
S
N
4151 2114 M
4185 2080 D
S
4200 2111 P
N
4182 2094 M
4217 2128 D
S
N
4182 2128 M
4217 2094 D
S
4231 2067 P
N
4214 2050 M
4249 2084 D
S
N
4214 2084 M
4249 2050 D
S
4263 2077 P
N
4246 2060 M
4280 2095 D
S
N
4246 2095 M
4280 2060 D
S
4295 2046 P
N
4278 2028 M
4312 2063 D
S
N
4278 2063 M
4312 2028 D
S
4327 2077 P
N
4309 2059 M
4344 2094 D
S
N
4309 2094 M
4344 2059 D
S
4358 2041 P
N
4341 2024 M
4375 2059 D
S
N
4341 2059 M
4375 2024 D
S
4390 2066 P
N
4373 2049 M
4407 2083 D
S
N
4373 2083 M
4407 2049 D
S
4422 2037 P
N
4404 2020 M
4439 2055 D
S
N
4404 2055 M
4439 2020 D
S
N
1268 975 M
1268 1079 D
S
N
1374 1009 M
1374 975 D
S
N
1479 975 M
1479 1009 D
S
N
1585 1009 M
1585 975 D
S
N
1691 975 M
1691 1009 D
S
N
1796 1079 M
1796 975 D
S
N
1902 975 M
1902 1009 D
S
N
2008 1009 M
2008 975 D
S
N
2113 975 M
2113 1009 D
S
N
2219 1009 M
2219 975 D
S
N
2325 975 M
2325 1079 D
S
N
2430 1009 M
2430 975 D
S
N
2536 975 M
2536 1009 D
S
N
2641 1009 M
2641 975 D
S
N
2747 975 M
2747 1009 D
S
N
2853 1079 M
2853 975 D
S
N
2958 975 M
2958 1009 D
S
N
3064 1009 M
3064 975 D
S
N
3170 975 M
3170 1009 D
S
N
3275 1009 M
3275 975 D
S
N
3381 975 M
3381 1079 D
S
N
3487 1009 M
3487 975 D
S
N
3592 975 M
3592 1009 D
S
N
3698 1009 M
3698 975 D
S
N
3804 975 M
3804 1009 D
S
N
3909 1079 M
3909 975 D
S
N
4015 975 M
4015 1009 D
S
N
4120 1009 M
4120 975 D
S
N
4226 975 M
4226 1009 D
S
N
4332 1009 M
4332 975 D
S
N
4437 975 M
4437 1079 D
S
N
1264 903 M
1254 900 D
1246 889 D
1243 871 D
1243 860 D
1246 842 D
1254 831 D
1264 828 D
1272 828 D
1282 831 D
1290 842 D
1293 860 D
1293 871 D
1290 889 D
1282 900 D
1272 903 D
1264 903 D
S
N
1264 903 M
1257 900 D
1254 896 D
1250 889 D
1246 871 D
1246 860 D
1250 842 D
1254 835 D
1257 831 D
1264 828 D
S
N
1272 828 M
1279 831 D
1282 835 D
1286 842 D
1290 860 D
1290 871 D
1286 889 D
1282 896 D
1279 900 D
1272 903 D
S
N
1778 903 M
1771 867 D
S
N
1771 867 M
1778 875 D
1789 878 D
1800 878 D
1811 875 D
1818 867 D
1822 856 D
1822 849 D
1818 838 D
1811 831 D
1800 828 D
1789 828 D
1778 831 D
1775 835 D
1771 842 D
1771 846 D
1775 849 D
1778 846 D
1775 842 D
S
N
1800 878 M
1807 875 D
1814 867 D
1818 856 D
1818 849 D
1814 838 D
1807 831 D
1800 828 D
S
N
1778 903 M
1814 903 D
S
N
1778 900 M
1796 900 D
1814 903 D
S
N
2274 889 M
2281 893 D
2292 903 D
2292 828 D
S
N
2288 900 M
2288 828 D
S
N
2274 828 M
2307 828 D
S
N
2357 903 M
2346 900 D
2339 889 D
2335 871 D
2335 860 D
2339 842 D
2346 831 D
2357 828 D
2364 828 D
2375 831 D
2382 842 D
2386 860 D
2386 871 D
2382 889 D
2375 900 D
2364 903 D
2357 903 D
S
N
2357 903 M
2350 900 D
2346 896 D
2343 889 D
2339 871 D
2339 860 D
2343 842 D
2346 835 D
2350 831 D
2357 828 D
S
N
2364 828 M
2371 831 D
2375 835 D
2379 842 D
2382 860 D
2382 871 D
2379 889 D
2375 896 D
2371 900 D
2364 903 D
S
N
2802 889 M
2809 893 D
2820 903 D
2820 828 D
S
N
2817 900 M
2817 828 D
S
N
2802 828 M
2835 828 D
S
N
2871 903 M
2864 867 D
S
N
2864 867 M
2871 875 D
2882 878 D
2892 878 D
2903 875 D
2910 867 D
2914 856 D
2914 849 D
2910 838 D
2903 831 D
2892 828 D
2882 828 D
2871 831 D
2867 835 D
2864 842 D
2864 846 D
2867 849 D
2871 846 D
2867 842 D
S
N
2892 878 M
2900 875 D
2907 867 D
2910 856 D
2910 849 D
2907 838 D
2900 831 D
2892 828 D
S
N
2871 903 M
2907 903 D
S
N
2871 900 M
2889 900 D
2907 903 D
S
N
3323 889 M
3327 885 D
3323 882 D
3320 885 D
3320 889 D
3323 896 D
3327 900 D
3338 903 D
3352 903 D
3363 900 D
3367 896 D
3370 889 D
3370 882 D
3367 875 D
3356 867 D
3338 860 D
3331 856 D
3323 849 D
3320 838 D
3320 828 D
S
N
3352 903 M
3359 900 D
3363 896 D
3367 889 D
3367 882 D
3363 875 D
3352 867 D
3338 860 D
S
N
3320 835 M
3323 838 D
3331 838 D
3349 831 D
3359 831 D
3367 835 D
3370 838 D
S
N
3331 838 M
3349 828 D
3363 828 D
3367 831 D
3370 838 D
3370 846 D
S
N
3413 903 M
3403 900 D
3395 889 D
3392 871 D
3392 860 D
3395 842 D
3403 831 D
3413 828 D
3421 828 D
3431 831 D
3439 842 D
3442 860 D
3442 871 D
3439 889 D
3431 900 D
3421 903 D
3413 903 D
S
N
3413 903 M
3406 900 D
3403 896 D
3399 889 D
3395 871 D
3395 860 D
3399 842 D
3403 835 D
3406 831 D
3413 828 D
S
N
3421 828 M
3428 831 D
3431 835 D
3435 842 D
3439 860 D
3439 871 D
3435 889 D
3431 896 D
3428 900 D
3421 903 D
S
N
3852 889 M
3855 885 D
3852 882 D
3848 885 D
3848 889 D
3852 896 D
3855 900 D
3866 903 D
3880 903 D
3891 900 D
3895 896 D
3898 889 D
3898 882 D
3895 875 D
3884 867 D
3866 860 D
3859 856 D
3852 849 D
3848 838 D
3848 828 D
S
N
3880 903 M
3888 900 D
3891 896 D
3895 889 D
3895 882 D
3891 875 D
3880 867 D
3866 860 D
S
N
3848 835 M
3852 838 D
3859 838 D
3877 831 D
3888 831 D
3895 835 D
3898 838 D
S
N
3859 838 M
3877 828 D
3891 828 D
3895 831 D
3898 838 D
3898 846 D
S
N
3927 903 M
3920 867 D
S
N
3920 867 M
3927 875 D
3938 878 D
3949 878 D
3960 875 D
3967 867 D
3970 856 D
3970 849 D
3967 838 D
3960 831 D
3949 828 D
3938 828 D
3927 831 D
3924 835 D
3920 842 D
3920 846 D
3924 849 D
3927 846 D
3924 842 D
S
N
3949 878 M
3956 875 D
3963 867 D
3967 856 D
3967 849 D
3963 838 D
3956 831 D
3949 828 D
S
N
3927 903 M
3963 903 D
S
N
3927 900 M
3945 900 D
3963 903 D
S
N
4380 889 M
4383 885 D
4380 882 D
4376 885 D
4376 889 D
4380 896 D
4383 900 D
4394 903 D
4409 903 D
4419 900 D
4423 893 D
4423 882 D
4419 875 D
4409 871 D
4398 871 D
S
N
4409 903 M
4416 900 D
4419 893 D
4419 882 D
4416 875 D
4409 871 D
S
N
4409 871 M
4416 867 D
4423 860 D
4427 853 D
4427 842 D
4423 835 D
4419 831 D
4409 828 D
4394 828 D
4383 831 D
4380 835 D
4376 842 D
4376 846 D
4380 849 D
4383 846 D
4380 842 D
S
N
4419 864 M
4423 853 D
4423 842 D
4419 835 D
4416 831 D
4409 828 D
S
N
4470 903 M
4459 900 D
4452 889 D
4448 871 D
4448 860 D
4452 842 D
4459 831 D
4470 828 D
4477 828 D
4488 831 D
4495 842 D
4499 860 D
4499 871 D
4495 889 D
4488 900 D
4477 903 D
4470 903 D
S
N
4470 903 M
4463 900 D
4459 896 D
4455 889 D
4452 871 D
4452 860 D
4455 842 D
4459 835 D
4463 831 D
4470 828 D
S
N
4477 828 M
4484 831 D
4488 835 D
4491 842 D
4495 860 D
4495 871 D
4491 889 D
4488 896 D
4484 900 D
4477 903 D
S
N
1268 3196 M
1268 3300 D
S
N
1374 3300 M
1374 3265 D
S
N
1479 3265 M
1479 3300 D
S
N
1585 3300 M
1585 3265 D
S
N
1691 3265 M
1691 3300 D
S
N
1796 3300 M
1796 3196 D
S
N
1902 3265 M
1902 3300 D
S
N
2008 3300 M
2008 3265 D
S
N
2113 3265 M
2113 3300 D
S
N
2219 3300 M
2219 3265 D
S
N
2325 3196 M
2325 3300 D
S
N
2430 3300 M
2430 3265 D
S
N
2536 3265 M
2536 3300 D
S
N
2641 3300 M
2641 3265 D
S
N
2747 3265 M
2747 3300 D
S
N
2853 3300 M
2853 3196 D
S
N
2958 3265 M
2958 3300 D
S
N
3064 3300 M
3064 3265 D
S
N
3170 3265 M
3170 3300 D
S
N
3275 3300 M
3275 3265 D
S
N
3381 3196 M
3381 3300 D
S
N
3487 3300 M
3487 3265 D
S
N
3592 3265 M
3592 3300 D
S
N
3698 3300 M
3698 3265 D
S
N
3804 3265 M
3804 3300 D
S
N
3909 3300 M
3909 3196 D
S
N
4015 3265 M
4015 3300 D
S
N
4120 3300 M
4120 3265 D
S
N
4226 3265 M
4226 3300 D
S
N
4332 3300 M
4332 3265 D
S
N
4437 3196 M
4437 3300 D
S
N
1268 975 M
1372 975 D
S
N
1303 1059 M
1268 1059 D
S
N
1268 1144 M
1303 1144 D
S
N
1303 1228 M
1268 1228 D
S
N
1268 1313 M
1303 1313 D
S
N
1372 1397 M
1268 1397 D
S
N
1268 1482 M
1303 1482 D
S
N
1303 1567 M
1268 1567 D
S
N
1268 1651 M
1303 1651 D
S
N
1303 1736 M
1268 1736 D
S
N
1268 1820 M
1372 1820 D
S
N
1303 1905 M
1268 1905 D
S
N
1268 1989 M
1303 1989 D
S
N
1303 2074 M
1268 2074 D
S
N
1268 2158 M
1303 2158 D
S
N
1372 2243 M
1268 2243 D
S
N
1268 2327 M
1303 2327 D
S
N
1303 2412 M
1268 2412 D
S
N
1268 2497 M
1303 2497 D
S
N
1303 2581 M
1268 2581 D
S
N
1268 2666 M
1372 2666 D
S
N
1303 2750 M
1268 2750 D
S
N
1268 2835 M
1303 2835 D
S
N
1303 2919 M
1268 2919 D
S
N
1268 3004 M
1303 3004 D
S
N
1372 3088 M
1268 3088 D
S
N
1268 3173 M
1303 3173 D
S
N
1303 3258 M
1268 3258 D
S
N
1077 1007 M
1066 1004 D
1059 993 D
1055 975 D
1055 964 D
1059 946 D
1066 935 D
1077 931 D
1084 931 D
1095 935 D
1102 946 D
1106 964 D
1106 975 D
1102 993 D
1095 1004 D
1084 1007 D
1077 1007 D
S
N
1077 1007 M
1070 1004 D
1066 1000 D
1063 993 D
1059 975 D
1059 964 D
1063 946 D
1066 939 D
1070 935 D
1077 931 D
S
N
1084 931 M
1091 935 D
1095 939 D
1099 946 D
1102 964 D
1102 975 D
1099 993 D
1095 1000 D
1091 1004 D
1084 1007 D
S
N
1135 939 M
1131 935 D
1135 931 D
1138 935 D
1135 939 D
S
N
1185 1007 M
1174 1004 D
1167 993 D
1164 975 D
1164 964 D
1167 946 D
1174 935 D
1185 931 D
1192 931 D
1203 935 D
1210 946 D
1214 964 D
1214 975 D
1210 993 D
1203 1004 D
1192 1007 D
1185 1007 D
S
N
1185 1007 M
1178 1004 D
1174 1000 D
1171 993 D
1167 975 D
1167 964 D
1171 946 D
1174 939 D
1178 935 D
1185 931 D
S
N
1192 931 M
1200 935 D
1203 939 D
1207 946 D
1210 964 D
1210 975 D
1207 993 D
1203 1000 D
1200 1004 D
1192 1007 D
S
N
1077 1430 M
1066 1426 D
1059 1415 D
1055 1397 D
1055 1387 D
1059 1369 D
1066 1358 D
1077 1354 D
1084 1354 D
1095 1358 D
1102 1369 D
1106 1387 D
1106 1397 D
1102 1415 D
1095 1426 D
1084 1430 D
1077 1430 D
S
N
1077 1430 M
1070 1426 D
1066 1423 D
1063 1415 D
1059 1397 D
1059 1387 D
1063 1369 D
1066 1361 D
1070 1358 D
1077 1354 D
S
N
1084 1354 M
1091 1358 D
1095 1361 D
1099 1369 D
1102 1387 D
1102 1397 D
1099 1415 D
1095 1423 D
1091 1426 D
1084 1430 D
S
N
1135 1361 M
1131 1358 D
1135 1354 D
1138 1358 D
1135 1361 D
S
N
1167 1415 M
1171 1412 D
1167 1408 D
1164 1412 D
1164 1415 D
1167 1423 D
1171 1426 D
1182 1430 D
1196 1430 D
1207 1426 D
1210 1423 D
1214 1415 D
1214 1408 D
1210 1401 D
1200 1394 D
1182 1387 D
1174 1383 D
1167 1376 D
1164 1365 D
1164 1354 D
S
N
1196 1430 M
1203 1426 D
1207 1423 D
1210 1415 D
1210 1408 D
1207 1401 D
1196 1394 D
1182 1387 D
S
N
1164 1361 M
1167 1365 D
1174 1365 D
1192 1358 D
1203 1358 D
1210 1361 D
1214 1365 D
S
N
1174 1365 M
1192 1354 D
1207 1354 D
1210 1358 D
1214 1365 D
1214 1372 D
S
N
1077 1853 M
1066 1849 D
1059 1838 D
1055 1820 D
1055 1809 D
1059 1791 D
1066 1781 D
1077 1777 D
1084 1777 D
1095 1781 D
1102 1791 D
1106 1809 D
1106 1820 D
1102 1838 D
1095 1849 D
1084 1853 D
1077 1853 D
S
N
1077 1853 M
1070 1849 D
1066 1845 D
1063 1838 D
1059 1820 D
1059 1809 D
1063 1791 D
1066 1784 D
1070 1781 D
1077 1777 D
S
N
1084 1777 M
1091 1781 D
1095 1784 D
1099 1791 D
1102 1809 D
1102 1820 D
1099 1838 D
1095 1845 D
1091 1849 D
1084 1853 D
S
N
1135 1784 M
1131 1781 D
1135 1777 D
1138 1781 D
1135 1784 D
S
N
1196 1845 M
1196 1777 D
S
N
1200 1853 M
1200 1777 D
S
N
1200 1853 M
1160 1799 D
1218 1799 D
S
N
1185 1777 M
1210 1777 D
S
N
1077 2275 M
1066 2272 D
1059 2261 D
1055 2243 D
1055 2232 D
1059 2214 D
1066 2203 D
1077 2200 D
1084 2200 D
1095 2203 D
1102 2214 D
1106 2232 D
1106 2243 D
1102 2261 D
1095 2272 D
1084 2275 D
1077 2275 D
S
N
1077 2275 M
1070 2272 D
1066 2268 D
1063 2261 D
1059 2243 D
1059 2232 D
1063 2214 D
1066 2207 D
1070 2203 D
1077 2200 D
S
N
1084 2200 M
1091 2203 D
1095 2207 D
1099 2214 D
1102 2232 D
1102 2243 D
1099 2261 D
1095 2268 D
1091 2272 D
1084 2275 D
S
N
1135 2207 M
1131 2203 D
1135 2200 D
1138 2203 D
1135 2207 D
S
N
1207 2265 M
1203 2261 D
1207 2257 D
1210 2261 D
1210 2265 D
1207 2272 D
1200 2275 D
1189 2275 D
1178 2272 D
1171 2265 D
1167 2257 D
1164 2243 D
1164 2221 D
1167 2211 D
1174 2203 D
1185 2200 D
1192 2200 D
1203 2203 D
1210 2211 D
1214 2221 D
1214 2225 D
1210 2236 D
1203 2243 D
1192 2247 D
1189 2247 D
1178 2243 D
1171 2236 D
1167 2225 D
S
N
1189 2275 M
1182 2272 D
1174 2265 D
1171 2257 D
1167 2243 D
1167 2221 D
1171 2211 D
1178 2203 D
1185 2200 D
S
N
1192 2200 M
1200 2203 D
1207 2211 D
1210 2221 D
1210 2225 D
1207 2236 D
1200 2243 D
1192 2247 D
S
N
1077 2698 M
1066 2695 D
1059 2684 D
1055 2666 D
1055 2655 D
1059 2637 D
1066 2626 D
1077 2622 D
1084 2622 D
1095 2626 D
1102 2637 D
1106 2655 D
1106 2666 D
1102 2684 D
1095 2695 D
1084 2698 D
1077 2698 D
S
N
1077 2698 M
1070 2695 D
1066 2691 D
1063 2684 D
1059 2666 D
1059 2655 D
1063 2637 D
1066 2630 D
1070 2626 D
1077 2622 D
S
N
1084 2622 M
1091 2626 D
1095 2630 D
1099 2637 D
1102 2655 D
1102 2666 D
1099 2684 D
1095 2691 D
1091 2695 D
1084 2698 D
S
N
1135 2630 M
1131 2626 D
1135 2622 D
1138 2626 D
1135 2630 D
S
N
1182 2698 M
1171 2695 D
1167 2687 D
1167 2677 D
1171 2669 D
1182 2666 D
1196 2666 D
1207 2669 D
1210 2677 D
1210 2687 D
1207 2695 D
1196 2698 D
1182 2698 D
S
N
1182 2698 M
1174 2695 D
1171 2687 D
1171 2677 D
1174 2669 D
1182 2666 D
S
N
1196 2666 M
1203 2669 D
1207 2677 D
1207 2687 D
1203 2695 D
1196 2698 D
S
N
1182 2666 M
1171 2662 D
1167 2658 D
1164 2651 D
1164 2637 D
1167 2630 D
1171 2626 D
1182 2622 D
1196 2622 D
1207 2626 D
1210 2630 D
1214 2637 D
1214 2651 D
1210 2658 D
1207 2662 D
1196 2666 D
S
N
1182 2666 M
1174 2662 D
1171 2658 D
1167 2651 D
1167 2637 D
1171 2630 D
1174 2626 D
1182 2622 D
S
N
1196 2622 M
1203 2626 D
1207 2630 D
1210 2637 D
1210 2651 D
1207 2658 D
1203 2662 D
1196 2666 D
S
N
1066 3106 M
1073 3110 D
1084 3121 D
1084 3045 D
S
N
1081 3117 M
1081 3045 D
S
N
1066 3045 M
1099 3045 D
S
N
1135 3052 M
1131 3049 D
1135 3045 D
1138 3049 D
1135 3052 D
S
N
1185 3121 M
1174 3117 D
1167 3106 D
1164 3088 D
1164 3078 D
1167 3060 D
1174 3049 D
1185 3045 D
1192 3045 D
1203 3049 D
1210 3060 D
1214 3078 D
1214 3088 D
1210 3106 D
1203 3117 D
1192 3121 D
1185 3121 D
S
N
1185 3121 M
1178 3117 D
1174 3114 D
1171 3106 D
1167 3088 D
1167 3078 D
1171 3060 D
1174 3052 D
1178 3049 D
1185 3045 D
S
N
1192 3045 M
1200 3049 D
1203 3052 D
1207 3060 D
1210 3078 D
1210 3088 D
1207 3106 D
1203 3114 D
1200 3117 D
1192 3121 D
S
N
4334 975 M
4437 975 D
S
N
4437 1059 M
4403 1059 D
S
N
4403 1144 M
4437 1144 D
S
N
4437 1228 M
4403 1228 D
S
N
4403 1313 M
4437 1313 D
S
N
4437 1397 M
4334 1397 D
S
N
4403 1482 M
4437 1482 D
S
N
4437 1567 M
4403 1567 D
S
N
4403 1651 M
4437 1651 D
S
N
4437 1736 M
4403 1736 D
S
N
4334 1820 M
4437 1820 D
S
N
4437 1905 M
4403 1905 D
S
N
4403 1989 M
4437 1989 D
S
N
4437 2074 M
4403 2074 D
S
N
4403 2158 M
4437 2158 D
S
N
4437 2243 M
4334 2243 D
S
N
4403 2327 M
4437 2327 D
S
N
4437 2412 M
4403 2412 D
S
N
4403 2497 M
4437 2497 D
S
N
4437 2581 M
4403 2581 D
S
N
4334 2666 M
4437 2666 D
S
N
4437 2750 M
4403 2750 D
S
N
4403 2835 M
4437 2835 D
S
N
4437 2919 M
4403 2919 D
S
N
4403 3004 M
4437 3004 D
S
N
4437 3088 M
4334 3088 D
S
N
4403 3173 M
4437 3173 D
S
N
4437 3258 M
4403 3258 D
S
0.00 0.00 1.00 setrgbcolor
1284 1022 P
N
1267 1022 M
1284 1005 D
1301 1022 D
1284 1039 D
1267 1022 D
S
1316 1116 P
N
1298 1116 M
1316 1099 D
1333 1116 D
1316 1134 D
1298 1116 D
S
1347 1210 P
N
1330 1210 M
1347 1193 D
1365 1210 D
1347 1227 D
1330 1210 D
S
1379 1303 P
N
1362 1303 M
1379 1286 D
1396 1303 D
1379 1320 D
1362 1303 D
S
1411 1394 P
N
1393 1394 M
1411 1377 D
1428 1394 D
1411 1411 D
1393 1394 D
S
1442 1484 P
N
1425 1484 M
1442 1466 D
1460 1484 D
1442 1501 D
1425 1484 D
S
1474 1571 P
N
1457 1571 M
1474 1554 D
1491 1571 D
1474 1588 D
1457 1571 D
S
1506 1656 P
N
1488 1656 M
1506 1639 D
1523 1656 D
1506 1673 D
1488 1656 D
S
1537 1738 P
N
1520 1738 M
1537 1721 D
1555 1738 D
1537 1755 D
1520 1738 D
S
1569 1817 P
N
1552 1817 M
1569 1800 D
1586 1817 D
1569 1834 D
1552 1817 D
S
1601 1893 P
N
1584 1893 M
1601 1876 D
1618 1893 D
1601 1910 D
1584 1893 D
S
1633 1965 P
N
1615 1965 M
1633 1948 D
1650 1965 D
1633 1983 D
1615 1965 D
S
1664 2034 P
N
1647 2034 M
1664 2017 D
1682 2034 D
1664 2051 D
1647 2034 D
S
1696 2099 P
N
1679 2099 M
1696 2082 D
1713 2099 D
1696 2116 D
1679 2099 D
S
1728 2160 P
N
1710 2160 M
1728 2143 D
1745 2160 D
1728 2178 D
1710 2160 D
S
1759 2218 P
N
1742 2218 M
1759 2201 D
1777 2218 D
1759 2235 D
1742 2218 D
S
1791 2272 P
N
1774 2272 M
1791 2254 D
1808 2272 D
1791 2289 D
1774 2272 D
S
1823 2322 P
N
1805 2322 M
1823 2304 D
1840 2322 D
1823 2339 D
1805 2322 D
S
1854 2368 P
N
1837 2368 M
1854 2351 D
1872 2368 D
1854 2385 D
1837 2368 D
S
1886 2411 P
N
1869 2411 M
1886 2393 D
1903 2411 D
1886 2428 D
1869 2411 D
S
1918 2450 P
N
1900 2450 M
1918 2433 D
1935 2450 D
1918 2467 D
1900 2450 D
S
1949 2486 P
N
1932 2486 M
1949 2469 D
1967 2486 D
1949 2503 D
1932 2486 D
S
1981 2518 P
N
1964 2518 M
1981 2501 D
1998 2518 D
1981 2536 D
1964 2518 D
S
2013 2548 P
N
1996 2548 M
2013 2531 D
2030 2548 D
2013 2565 D
1996 2548 D
S
2045 2574 P
N
2027 2574 M
2045 2557 D
2062 2574 D
2045 2592 D
2027 2574 D
S
2076 2598 P
N
2059 2598 M
2076 2581 D
2094 2598 D
2076 2615 D
2059 2598 D
S
2108 2619 P
N
2091 2619 M
2108 2601 D
2125 2619 D
2108 2636 D
2091 2619 D
S
2140 2637 P
N
2122 2637 M
2140 2620 D
2157 2637 D
2140 2654 D
2122 2637 D
S
2171 2653 P
N
2154 2653 M
2171 2636 D
2189 2653 D
2171 2670 D
2154 2653 D
S
2203 2666 P
N
2186 2666 M
2203 2649 D
2220 2666 D
2203 2684 D
2186 2666 D
S
2235 2678 P
N
2217 2678 M
2235 2660 D
2252 2678 D
2235 2695 D
2217 2678 D
S
2266 2687 P
N
2249 2687 M
2266 2670 D
2284 2687 D
2266 2704 D
2249 2687 D
S
2298 2694 P
N
2281 2694 M
2298 2677 D
2315 2694 D
2298 2712 D
2281 2694 D
S
2330 2700 P
N
2313 2700 M
2330 2683 D
2347 2700 D
2330 2717 D
2313 2700 D
S
2361 2704 P
N
2344 2704 M
2361 2686 D
2379 2704 D
2361 2721 D
2344 2704 D
S
2393 2706 P
N
2376 2706 M
2393 2689 D
2410 2706 D
2393 2723 D
2376 2706 D
S
2425 2707 P
N
2408 2707 M
2425 2690 D
2442 2707 D
2425 2724 D
2408 2707 D
S
2457 2706 P
N
2439 2706 M
2457 2689 D
2474 2706 D
2457 2724 D
2439 2706 D
S
2488 2704 P
N
2471 2704 M
2488 2687 D
2506 2704 D
2488 2722 D
2471 2704 D
S
2520 2701 P
N
2503 2701 M
2520 2684 D
2537 2701 D
2520 2719 D
2503 2701 D
S
2552 2697 P
N
2534 2697 M
2552 2680 D
2569 2697 D
2552 2715 D
2534 2697 D
S
2583 2692 P
N
2566 2692 M
2583 2675 D
2601 2692 D
2583 2709 D
2566 2692 D
S
2615 2686 P
N
2598 2686 M
2615 2669 D
2632 2686 D
2615 2703 D
2598 2686 D
S
2647 2679 P
N
2629 2679 M
2647 2662 D
2664 2679 D
2647 2696 D
2629 2679 D
S
2678 2671 P
N
2661 2671 M
2678 2654 D
2696 2671 D
2678 2688 D
2661 2671 D
S
2710 2663 P
N
2693 2663 M
2710 2645 D
2727 2663 D
2710 2680 D
2693 2663 D
S
2742 2653 P
N
2725 2653 M
2742 2636 D
2759 2653 D
2742 2671 D
2725 2653 D
S
2774 2643 P
N
2756 2643 M
2774 2626 D
2791 2643 D
2774 2661 D
2756 2643 D
S
2805 2633 P
N
2788 2633 M
2805 2616 D
2823 2633 D
2805 2650 D
2788 2633 D
S
2837 2622 P
N
2820 2622 M
2837 2605 D
2854 2622 D
2837 2639 D
2820 2622 D
S
2869 2610 P
N
2851 2610 M
2869 2593 D
2886 2610 D
2869 2628 D
2851 2610 D
S
2900 2599 P
N
2883 2599 M
2900 2581 D
2918 2599 D
2900 2616 D
2883 2599 D
S
2932 2586 P
N
2915 2586 M
2932 2569 D
2949 2586 D
2932 2604 D
2915 2586 D
S
2964 2574 P
N
2946 2574 M
2964 2556 D
2981 2574 D
2964 2591 D
2946 2574 D
S
2995 2561 P
N
2978 2561 M
2995 2543 D
3013 2561 D
2995 2578 D
2978 2561 D
S
3027 2547 P
N
3010 2547 M
3027 2530 D
3044 2547 D
3027 2564 D
3010 2547 D
S
3059 2534 P
N
3041 2534 M
3059 2516 D
3076 2534 D
3059 2551 D
3041 2534 D
S
3090 2520 P
N
3073 2520 M
3090 2503 D
3108 2520 D
3090 2537 D
3073 2520 D
S
3122 2506 P
N
3105 2506 M
3122 2488 D
3139 2506 D
3122 2523 D
3105 2506 D
S
3154 2492 P
N
3137 2492 M
3154 2474 D
3171 2492 D
3154 2509 D
3137 2492 D
S
3186 2477 P
N
3168 2477 M
3186 2460 D
3203 2477 D
3186 2495 D
3168 2477 D
S
3217 2463 P
N
3200 2463 M
3217 2445 D
3235 2463 D
3217 2480 D
3200 2463 D
S
3249 2448 P
N
3232 2448 M
3249 2431 D
3266 2448 D
3249 2465 D
3232 2448 D
S
3281 2433 P
N
3263 2433 M
3281 2416 D
3298 2433 D
3281 2451 D
3263 2433 D
S
3312 2419 P
N
3295 2419 M
3312 2401 D
3330 2419 D
3312 2436 D
3295 2419 D
S
3344 2404 P
N
3327 2404 M
3344 2387 D
3361 2404 D
3344 2421 D
3327 2404 D
S
3376 2389 P
N
3358 2389 M
3376 2372 D
3393 2389 D
3376 2406 D
3358 2389 D
S
3407 2374 P
N
3390 2374 M
3407 2357 D
3425 2374 D
3407 2391 D
3390 2374 D
S
3439 2359 P
N
3422 2359 M
3439 2342 D
3456 2359 D
3439 2377 D
3422 2359 D
S
3471 2344 P
N
3453 2344 M
3471 2327 D
3488 2344 D
3471 2362 D
3453 2344 D
S
3502 2329 P
N
3485 2329 M
3502 2312 D
3520 2329 D
3502 2347 D
3485 2329 D
S
3534 2315 P
N
3517 2315 M
3534 2297 D
3551 2315 D
3534 2332 D
3517 2315 D
S
3566 2300 P
N
3549 2300 M
3566 2282 D
3583 2300 D
3566 2317 D
3549 2300 D
S
3598 2285 P
N
3580 2285 M
3598 2268 D
3615 2285 D
3598 2302 D
3580 2285 D
S
3629 2270 P
N
3612 2270 M
3629 2253 D
3647 2270 D
3629 2287 D
3612 2270 D
S
3661 2255 P
N
3644 2255 M
3661 2238 D
3678 2255 D
3661 2273 D
3644 2255 D
S
3693 2241 P
N
3675 2241 M
3693 2223 D
3710 2241 D
3693 2258 D
3675 2241 D
S
3724 2226 P
N
3707 2226 M
3724 2209 D
3742 2226 D
3724 2244 D
3707 2226 D
S
3756 2212 P
N
3739 2212 M
3756 2194 D
3773 2212 D
3756 2229 D
3739 2212 D
S
3788 2197 P
N
3770 2197 M
3788 2180 D
3805 2197 D
3788 2215 D
3770 2197 D
S
3819 2183 P
N
3802 2183 M
3819 2166 D
3837 2183 D
3819 2200 D
3802 2183 D
S
3851 2169 P
N
3834 2169 M
3851 2151 D
3868 2169 D
3851 2186 D
3834 2169 D
S
3883 2155 P
N
3865 2155 M
3883 2137 D
3900 2155 D
3883 2172 D
3865 2155 D
S
3914 2141 P
N
3897 2141 M
3914 2123 D
3932 2141 D
3914 2158 D
3897 2141 D
S
3946 2127 P
N
3929 2127 M
3946 2109 D
3963 2127 D
3946 2144 D
3929 2127 D
S
3978 2113 P
N
3961 2113 M
3978 2096 D
3995 2113 D
3978 2130 D
3961 2113 D
S
4010 2099 P
N
3992 2099 M
4010 2082 D
4027 2099 D
4010 2116 D
3992 2099 D
S
4041 2086 P
N
4024 2086 M
4041 2068 D
4059 2086 D
4041 2103 D
4024 2086 D
S
4073 2072 P
N
4056 2072 M
4073 2055 D
4090 2072 D
4073 2089 D
4056 2072 D
S
4105 2059 P
N
4087 2059 M
4105 2041 D
4122 2059 D
4105 2076 D
4087 2059 D
S
4136 2045 P
N
4119 2045 M
4136 2028 D
4154 2045 D
4136 2063 D
4119 2045 D
S
4168 2032 P
N
4151 2032 M
4168 2015 D
4185 2032 D
4168 2050 D
4151 2032 D
S
4200 2019 P
N
4182 2019 M
4200 2002 D
4217 2019 D
4200 2037 D
4182 2019 D
S
4231 2006 P
N
4214 2006 M
4231 1989 D
4249 2006 D
4231 2024 D
4214 2006 D
S
4263 1994 P
N
4246 1994 M
4263 1976 D
4280 1994 D
4263 2011 D
4246 1994 D
S
4295 1981 P
N
4278 1981 M
4295 1964 D
4312 1981 D
4295 1998 D
4278 1981 D
S
4327 1969 P
N
4309 1969 M
4327 1951 D
4344 1969 D
4327 1986 D
4309 1969 D
S
4358 1956 P
N
4341 1956 M
4358 1939 D
4375 1956 D
4358 1973 D
4341 1956 D
S
4390 1944 P
N
4373 1944 M
4390 1927 D
4407 1944 D
4390 1961 D
4373 1944 D
S
4422 1932 P
N
4404 1932 M
4422 1914 D
4439 1932 D
4422 1949 D
4404 1932 D
S
1.00 0.00 0.00 setrgbcolor
1284 1011 P
N
1267 1011 M
1275 1011 D
1284 1019 D
S
N
1284 1028 M
1284 1019 D
1293 1011 D
S
N
1301 1011 M
1293 1011 D
1284 1002 D
S
N
1284 993 M
1284 1002 D
1275 1011 D
S
1316 1091 P
N
1298 1091 M
1307 1091 D
1316 1100 D
S
N
1316 1109 M
1316 1100 D
1324 1091 D
S
N
1333 1091 M
1324 1091 D
1316 1083 D
S
N
1316 1074 M
1316 1083 D
1307 1091 D
S
1347 1158 P
N
1330 1158 M
1339 1158 D
1347 1167 D
S
N
1347 1175 M
1347 1167 D
1356 1158 D
S
N
1365 1158 M
1356 1158 D
1347 1149 D
S
N
1347 1141 M
1347 1149 D
1339 1158 D
S
1379 1239 P
N
1362 1239 M
1370 1239 D
1379 1248 D
S
N
1379 1257 M
1379 1248 D
1388 1239 D
S
N
1396 1239 M
1388 1239 D
1379 1231 D
S
N
1379 1222 M
1379 1231 D
1370 1239 D
S
1411 1316 P
N
1393 1316 M
1402 1316 D
1411 1325 D
S
N
1411 1333 M
1411 1325 D
1419 1316 D
S
N
1428 1316 M
1419 1316 D
1411 1307 D
S
N
1411 1299 M
1411 1307 D
1402 1316 D
S
1442 1405 P
N
1425 1405 M
1434 1405 D
1442 1414 D
S
N
1442 1422 M
1442 1414 D
1451 1405 D
S
N
1460 1405 M
1451 1405 D
1442 1396 D
S
N
1442 1388 M
1442 1396 D
1434 1405 D
S
1474 1459 P
N
1457 1459 M
1465 1459 D
1474 1468 D
S
N
1474 1476 M
1474 1468 D
1483 1459 D
S
N
1491 1459 M
1483 1459 D
1474 1451 D
S
N
1474 1442 M
1474 1451 D
1465 1459 D
S
1506 1539 P
N
1488 1539 M
1497 1539 D
1506 1548 D
S
N
1506 1557 M
1506 1548 D
1514 1539 D
S
N
1523 1539 M
1514 1539 D
1506 1531 D
S
N
1506 1522 M
1506 1531 D
1497 1539 D
S
1537 1622 P
N
1520 1622 M
1529 1622 D
1537 1631 D
S
N
1537 1639 M
1537 1631 D
1546 1622 D
S
N
1555 1622 M
1546 1622 D
1537 1613 D
S
N
1537 1605 M
1537 1613 D
1529 1622 D
S
1569 1738 P
N
1552 1738 M
1561 1738 D
1569 1747 D
S
N
1569 1756 M
1569 1747 D
1578 1738 D
S
N
1586 1738 M
1578 1738 D
1569 1730 D
S
N
1569 1721 M
1569 1730 D
1561 1738 D
S
1601 1779 P
N
1584 1779 M
1592 1779 D
1601 1787 D
S
N
1601 1796 M
1601 1787 D
1610 1779 D
S
N
1618 1779 M
1610 1779 D
1601 1770 D
S
N
1601 1761 M
1601 1770 D
1592 1779 D
S
1633 1843 P
N
1615 1843 M
1624 1843 D
1633 1851 D
S
N
1633 1860 M
1633 1851 D
1641 1843 D
S
N
1650 1843 M
1641 1843 D
1633 1834 D
S
N
1633 1825 M
1633 1834 D
1624 1843 D
S
1664 1963 P
N
1647 1963 M
1656 1963 D
1664 1972 D
S
N
1664 1981 M
1664 1972 D
1673 1963 D
S
N
1682 1963 M
1673 1963 D
1664 1955 D
S
N
1664 1946 M
1664 1955 D
1656 1963 D
S
1696 2024 P
N
1679 2024 M
1687 2024 D
1696 2032 D
S
N
1696 2041 M
1696 2032 D
1705 2024 D
S
N
1713 2024 M
1705 2024 D
1696 2015 D
S
N
1696 2007 M
1696 2015 D
1687 2024 D
S
1728 2061 P
N
1710 2061 M
1719 2061 D
1728 2070 D
S
N
1728 2078 M
1728 2070 D
1736 2061 D
S
N
1745 2061 M
1736 2061 D
1728 2053 D
S
N
1728 2044 M
1728 2053 D
1719 2061 D
S
1759 2120 P
N
1742 2120 M
1751 2120 D
1759 2129 D
S
N
1759 2138 M
1759 2129 D
1768 2120 D
S
N
1777 2120 M
1768 2120 D
1759 2112 D
S
N
1759 2103 M
1759 2112 D
1751 2120 D
S
1791 2211 P
N
1774 2211 M
1782 2211 D
1791 2219 D
S
N
1791 2228 M
1791 2219 D
1800 2211 D
S
N
1808 2211 M
1800 2211 D
1791 2202 D
S
N
1791 2193 M
1791 2202 D
1782 2211 D
S
1823 2213 P
N
1805 2213 M
1814 2213 D
1823 2221 D
S
N
1823 2230 M
1823 2221 D
1831 2213 D
S
N
1840 2213 M
1831 2213 D
1823 2204 D
S
N
1823 2195 M
1823 2204 D
1814 2213 D
S
1854 2274 P
N
1837 2274 M
1846 2274 D
1854 2283 D
S
N
1854 2291 M
1854 2283 D
1863 2274 D
S
N
1872 2274 M
1863 2274 D
1854 2265 D
S
N
1854 2257 M
1854 2265 D
1846 2274 D
S
1886 2333 P
N
1869 2333 M
1877 2333 D
1886 2342 D
S
N
1886 2350 M
1886 2342 D
1895 2333 D
S
N
1903 2333 M
1895 2333 D
1886 2324 D
S
N
1886 2316 M
1886 2324 D
1877 2333 D
S
1918 2431 P
N
1900 2431 M
1909 2431 D
1918 2440 D
S
N
1918 2448 M
1918 2440 D
1926 2431 D
S
N
1935 2431 M
1926 2431 D
1918 2422 D
S
N
1918 2414 M
1918 2422 D
1909 2431 D
S
1949 2385 P
N
1932 2385 M
1941 2385 D
1949 2393 D
S
N
1949 2402 M
1949 2393 D
1958 2385 D
S
N
1967 2385 M
1958 2385 D
1949 2376 D
S
N
1949 2367 M
1949 2376 D
1941 2385 D
S
1981 2368 P
N
1964 2368 M
1973 2368 D
1981 2377 D
S
N
1981 2386 M
1981 2377 D
1990 2368 D
S
N
1998 2368 M
1990 2368 D
1981 2360 D
S
N
1981 2351 M
1981 2360 D
1973 2368 D
S
2013 2473 P
N
1996 2473 M
2004 2473 D
2013 2482 D
S
N
2013 2491 M
2013 2482 D
2022 2473 D
S
N
2030 2473 M
2022 2473 D
2013 2465 D
S
N
2013 2456 M
2013 2465 D
2004 2473 D
S
2045 2469 P
N
2027 2469 M
2036 2469 D
2045 2478 D
S
N
2045 2486 M
2045 2478 D
2053 2469 D
S
N
2062 2469 M
2053 2469 D
2045 2460 D
S
N
2045 2452 M
2045 2460 D
2036 2469 D
S
2076 2547 P
N
2059 2547 M
2068 2547 D
2076 2555 D
S
N
2076 2564 M
2076 2555 D
2085 2547 D
S
N
2094 2547 M
2085 2547 D
2076 2538 D
S
N
2076 2529 M
2076 2538 D
2068 2547 D
S
2108 2533 P
N
2091 2533 M
2099 2533 D
2108 2541 D
S
N
2108 2550 M
2108 2541 D
2117 2533 D
S
N
2125 2533 M
2117 2533 D
2108 2524 D
S
N
2108 2515 M
2108 2524 D
2099 2533 D
S
2140 2530 P
N
2122 2530 M
2131 2530 D
2140 2539 D
S
N
2140 2548 M
2140 2539 D
2148 2530 D
S
N
2157 2530 M
2148 2530 D
2140 2522 D
S
N
2140 2513 M
2140 2522 D
2131 2530 D
S
2171 2589 P
N
2154 2589 M
2163 2589 D
2171 2598 D
S
N
2171 2606 M
2171 2598 D
2180 2589 D
S
N
2189 2589 M
2180 2589 D
2171 2580 D
S
N
2171 2572 M
2171 2580 D
2163 2589 D
S
2203 2607 P
N
2186 2607 M
2194 2607 D
2203 2616 D
S
N
2203 2625 M
2203 2616 D
2212 2607 D
S
N
2220 2607 M
2212 2607 D
2203 2599 D
S
N
2203 2590 M
2203 2599 D
2194 2607 D
S
2235 2610 P
N
2217 2610 M
2226 2610 D
2235 2619 D
S
N
2235 2627 M
2235 2619 D
2243 2610 D
S
N
2252 2610 M
2243 2610 D
2235 2601 D
S
N
2235 2593 M
2235 2601 D
2226 2610 D
S
2266 2634 P
N
2249 2634 M
2258 2634 D
2266 2643 D
S
N
2266 2651 M
2266 2643 D
2275 2634 D
S
N
2284 2634 M
2275 2634 D
2266 2625 D
S
N
2266 2617 M
2266 2625 D
2258 2634 D
S
2298 2602 P
N
2281 2602 M
2289 2602 D
2298 2611 D
S
N
2298 2620 M
2298 2611 D
2307 2602 D
S
N
2315 2602 M
2307 2602 D
2298 2594 D
S
N
2298 2585 M
2298 2594 D
2289 2602 D
S
2330 2565 P
N
2313 2565 M
2321 2565 D
2330 2574 D
S
N
2330 2582 M
2330 2574 D
2338 2565 D
S
N
2347 2565 M
2338 2565 D
2330 2556 D
S
N
2330 2548 M
2330 2556 D
2321 2565 D
S
2361 2694 P
N
2344 2694 M
2353 2694 D
2361 2703 D
S
N
2361 2711 M
2361 2703 D
2370 2694 D
S
N
2379 2694 M
2370 2694 D
2361 2685 D
S
N
2361 2677 M
2361 2685 D
2353 2694 D
S
2393 2619 P
N
2376 2619 M
2385 2619 D
2393 2628 D
S
N
2393 2636 M
2393 2628 D
2402 2619 D
S
N
2410 2619 M
2402 2619 D
2393 2611 D
S
N
2393 2602 M
2393 2611 D
2385 2619 D
S
2425 2600 P
N
2408 2600 M
2416 2600 D
2425 2609 D
S
N
2425 2617 M
2425 2609 D
2434 2600 D
S
N
2442 2600 M
2434 2600 D
2425 2592 D
S
N
2425 2583 M
2425 2592 D
2416 2600 D
S
2457 2656 P
N
2439 2656 M
2448 2656 D
2457 2664 D
S
N
2457 2673 M
2457 2664 D
2465 2656 D
S
N
2474 2656 M
2465 2656 D
2457 2647 D
S
N
2457 2639 M
2457 2647 D
2448 2656 D
S
2488 2597 P
N
2471 2597 M
2480 2597 D
2488 2606 D
S
N
2488 2615 M
2488 2606 D
2497 2597 D
S
N
2506 2597 M
2497 2597 D
2488 2589 D
S
N
2488 2580 M
2488 2589 D
2480 2597 D
S
2520 2603 P
N
2503 2603 M
2511 2603 D
2520 2612 D
S
N
2520 2620 M
2520 2612 D
2529 2603 D
S
N
2537 2603 M
2529 2603 D
2520 2594 D
S
N
2520 2586 M
2520 2594 D
2511 2603 D
S
2552 2626 P
N
2534 2626 M
2543 2626 D
2552 2634 D
S
N
2552 2643 M
2552 2634 D
2560 2626 D
S
N
2569 2626 M
2560 2626 D
2552 2617 D
S
N
2552 2608 M
2552 2617 D
2543 2626 D
S
2583 2640 P
N
2566 2640 M
2575 2640 D
2583 2649 D
S
N
2583 2658 M
2583 2649 D
2592 2640 D
S
N
2601 2640 M
2592 2640 D
2583 2632 D
S
N
2583 2623 M
2583 2632 D
2575 2640 D
S
2615 2559 P
N
2598 2559 M
2606 2559 D
2615 2567 D
S
N
2615 2576 M
2615 2567 D
2624 2559 D
S
N
2632 2559 M
2624 2559 D
2615 2550 D
S
N
2615 2541 M
2615 2550 D
2606 2559 D
S
2647 2609 P
N
2629 2609 M
2638 2609 D
2647 2617 D
S
N
2647 2626 M
2647 2617 D
2655 2609 D
S
N
2664 2609 M
2655 2609 D
2647 2600 D
S
N
2647 2591 M
2647 2600 D
2638 2609 D
S
2678 2640 P
N
2661 2640 M
2670 2640 D
2678 2649 D
S
N
2678 2658 M
2678 2649 D
2687 2640 D
S
N
2696 2640 M
2687 2640 D
2678 2632 D
S
N
2678 2623 M
2678 2632 D
2670 2640 D
S
2710 2544 P
N
2693 2544 M
2701 2544 D
2710 2552 D
S
N
2710 2561 M
2710 2552 D
2719 2544 D
S
N
2727 2544 M
2719 2544 D
2710 2535 D
S
N
2710 2527 M
2710 2535 D
2701 2544 D
S
2742 2578 P
N
2725 2578 M
2733 2578 D
2742 2587 D
S
N
2742 2596 M
2742 2587 D
2750 2578 D
S
N
2759 2578 M
2750 2578 D
2742 2570 D
S
N
2742 2561 M
2742 2570 D
2733 2578 D
S
2774 2542 P
N
2756 2542 M
2765 2542 D
2774 2550 D
S
N
2774 2559 M
2774 2550 D
2782 2542 D
S
N
2791 2542 M
2782 2542 D
2774 2533 D
S
N
2774 2524 M
2774 2533 D
2765 2542 D
S
2805 2580 P
N
2788 2580 M
2797 2580 D
2805 2588 D
S
N
2805 2597 M
2805 2588 D
2814 2580 D
S
N
2823 2580 M
2814 2580 D
2805 2571 D
S
N
2805 2562 M
2805 2571 D
2797 2580 D
S
2837 2554 P
N
2820 2554 M
2828 2554 D
2837 2563 D
S
N
2837 2572 M
2837 2563 D
2846 2554 D
S
N
2854 2554 M
2846 2554 D
2837 2546 D
S
N
2837 2537 M
2837 2546 D
2828 2554 D
S
2869 2516 P
N
2851 2516 M
2860 2516 D
2869 2525 D
S
N
2869 2534 M
2869 2525 D
2877 2516 D
S
N
2886 2516 M
2877 2516 D
2869 2508 D
S
N
2869 2499 M
2869 2508 D
2860 2516 D
S
2900 2561 P
N
2883 2561 M
2892 2561 D
2900 2570 D
S
N
2900 2579 M
2900 2570 D
2909 2561 D
S
N
2918 2561 M
2909 2561 D
2900 2553 D
S
N
2900 2544 M
2900 2553 D
2892 2561 D
S
2932 2490 P
N
2915 2490 M
2923 2490 D
2932 2499 D
S
N
2932 2508 M
2932 2499 D
2941 2490 D
S
N
2949 2490 M
2941 2490 D
2932 2482 D
S
N
2932 2473 M
2932 2482 D
2923 2490 D
S
2964 2538 P
N
2946 2538 M
2955 2538 D
2964 2547 D
S
N
2964 2555 M
2964 2547 D
2972 2538 D
S
N
2981 2538 M
2972 2538 D
2964 2530 D
S
N
2964 2521 M
2964 2530 D
2955 2538 D
S
2995 2458 P
N
2978 2458 M
2987 2458 D
2995 2466 D
S
N
2995 2475 M
2995 2466 D
3004 2458 D
S
N
3013 2458 M
3004 2458 D
2995 2449 D
S
N
2995 2441 M
2995 2449 D
2987 2458 D
S
3027 2483 P
N
3010 2483 M
3018 2483 D
3027 2491 D
S
N
3027 2500 M
3027 2491 D
3036 2483 D
S
N
3044 2483 M
3036 2483 D
3027 2474 D
S
N
3027 2465 M
3027 2474 D
3018 2483 D
S
3059 2461 P
N
3041 2461 M
3050 2461 D
3059 2469 D
S
N
3059 2478 M
3059 2469 D
3067 2461 D
S
N
3076 2461 M
3067 2461 D
3059 2452 D
S
N
3059 2443 M
3059 2452 D
3050 2461 D
S
3090 2468 P
N
3073 2468 M
3082 2468 D
3090 2477 D
S
N
3090 2486 M
3090 2477 D
3099 2468 D
S
N
3108 2468 M
3099 2468 D
3090 2460 D
S
N
3090 2451 M
3090 2460 D
3082 2468 D
S
3122 2420 P
N
3105 2420 M
3113 2420 D
3122 2428 D
S
N
3122 2437 M
3122 2428 D
3131 2420 D
S
N
3139 2420 M
3131 2420 D
3122 2411 D
S
N
3122 2402 M
3122 2411 D
3113 2420 D
S
3154 2480 P
N
3137 2480 M
3145 2480 D
3154 2489 D
S
N
3154 2498 M
3154 2489 D
3162 2480 D
S
N
3171 2480 M
3162 2480 D
3154 2472 D
S
N
3154 2463 M
3154 2472 D
3145 2480 D
S
3186 2449 P
N
3168 2449 M
3177 2449 D
3186 2457 D
S
N
3186 2466 M
3186 2457 D
3194 2449 D
S
N
3203 2449 M
3194 2449 D
3186 2440 D
S
N
3186 2431 M
3186 2440 D
3177 2449 D
S
3217 2428 P
N
3200 2428 M
3209 2428 D
3217 2437 D
S
N
3217 2446 M
3217 2437 D
3226 2428 D
S
N
3235 2428 M
3226 2428 D
3217 2420 D
S
N
3217 2411 M
3217 2420 D
3209 2428 D
S
3249 2405 P
N
3232 2405 M
3240 2405 D
3249 2414 D
S
N
3249 2422 M
3249 2414 D
3258 2405 D
S
N
3266 2405 M
3258 2405 D
3249 2396 D
S
N
3249 2388 M
3249 2396 D
3240 2405 D
S
3281 2397 P
N
3263 2397 M
3272 2397 D
3281 2406 D
S
N
3281 2415 M
3281 2406 D
3289 2397 D
S
N
3298 2397 M
3289 2397 D
3281 2389 D
S
N
3281 2380 M
3281 2389 D
3272 2397 D
S
3312 2347 P
N
3295 2347 M
3304 2347 D
3312 2356 D
S
N
3312 2365 M
3312 2356 D
3321 2347 D
S
N
3330 2347 M
3321 2347 D
3312 2339 D
S
N
3312 2330 M
3312 2339 D
3304 2347 D
S
3344 2390 P
N
3327 2390 M
3335 2390 D
3344 2399 D
S
N
3344 2408 M
3344 2399 D
3353 2390 D
S
N
3361 2390 M
3353 2390 D
3344 2382 D
S
N
3344 2373 M
3344 2382 D
3335 2390 D
S
3376 2391 P
N
3358 2391 M
3367 2391 D
3376 2400 D
S
N
3376 2408 M
3376 2400 D
3384 2391 D
S
N
3393 2391 M
3384 2391 D
3376 2382 D
S
N
3376 2374 M
3376 2382 D
3367 2391 D
S
3407 2390 P
N
3390 2390 M
3399 2390 D
3407 2398 D
S
N
3407 2407 M
3407 2398 D
3416 2390 D
S
N
3425 2390 M
3416 2390 D
3407 2381 D
S
N
3407 2372 M
3407 2381 D
3399 2390 D
S
3439 2345 P
N
3422 2345 M
3430 2345 D
3439 2354 D
S
N
3439 2362 M
3439 2354 D
3448 2345 D
S
N
3456 2345 M
3448 2345 D
3439 2336 D
S
N
3439 2328 M
3439 2336 D
3430 2345 D
S
3471 2296 P
N
3453 2296 M
3462 2296 D
3471 2305 D
S
N
3471 2314 M
3471 2305 D
3479 2296 D
S
N
3488 2296 M
3479 2296 D
3471 2288 D
S
N
3471 2279 M
3471 2288 D
3462 2296 D
S
3502 2287 P
N
3485 2287 M
3494 2287 D
3502 2296 D
S
N
3502 2305 M
3502 2296 D
3511 2287 D
S
N
3520 2287 M
3511 2287 D
3502 2279 D
S
N
3502 2270 M
3502 2279 D
3494 2287 D
S
3534 2268 P
N
3517 2268 M
3526 2268 D
3534 2277 D
S
N
3534 2286 M
3534 2277 D
3543 2268 D
S
N
3551 2268 M
3543 2268 D
3534 2260 D
S
N
3534 2251 M
3534 2260 D
3526 2268 D
S
3566 2279 P
N
3549 2279 M
3557 2279 D
3566 2288 D
S
N
3566 2296 M
3566 2288 D
3575 2279 D
S
N
3583 2279 M
3575 2279 D
3566 2270 D
S
N
3566 2262 M
3566 2270 D
3557 2279 D
S
3598 2300 P
N
3580 2300 M
3589 2300 D
3598 2309 D
S
N
3598 2317 M
3598 2309 D
3606 2300 D
S
N
3615 2300 M
3606 2300 D
3598 2291 D
S
N
3598 2283 M
3598 2291 D
3589 2300 D
S
3629 2260 P
N
3612 2260 M
3621 2260 D
3629 2269 D
S
N
3629 2277 M
3629 2269 D
3638 2260 D
S
N
3647 2260 M
3638 2260 D
3629 2251 D
S
N
3629 2243 M
3629 2251 D
3621 2260 D
S
3661 2261 P
N
3644 2261 M
3652 2261 D
3661 2269 D
S
N
3661 2278 M
3661 2269 D
3670 2261 D
S
N
3678 2261 M
3670 2261 D
3661 2252 D
S
N
3661 2243 M
3661 2252 D
3652 2261 D
S
3693 2266 P
N
3675 2266 M
3684 2266 D
3693 2275 D
S
N
3693 2283 M
3693 2275 D
3701 2266 D
S
N
3710 2266 M
3701 2266 D
3693 2258 D
S
N
3693 2249 M
3693 2258 D
3684 2266 D
S
3724 2218 P
N
3707 2218 M
3716 2218 D
3724 2227 D
S
N
3724 2236 M
3724 2227 D
3733 2218 D
S
N
3742 2218 M
3733 2218 D
3724 2210 D
S
N
3724 2201 M
3724 2210 D
3716 2218 D
S
3756 2237 P
N
3739 2237 M
3747 2237 D
3756 2245 D
S
N
3756 2254 M
3756 2245 D
3765 2237 D
S
N
3773 2237 M
3765 2237 D
3756 2228 D
S
N
3756 2219 M
3756 2228 D
3747 2237 D
S
3788 2181 P
N
3770 2181 M
3779 2181 D
3788 2190 D
S
N
3788 2198 M
3788 2190 D
3796 2181 D
S
N
3805 2181 M
3796 2181 D
3788 2172 D
S
N
3788 2164 M
3788 2172 D
3779 2181 D
S
3819 2199 P
N
3802 2199 M
3811 2199 D
3819 2207 D
S
N
3819 2216 M
3819 2207 D
3828 2199 D
S
N
3837 2199 M
3828 2199 D
3819 2190 D
S
N
3819 2181 M
3819 2190 D
3811 2199 D
S
3851 2171 P
N
3834 2171 M
3842 2171 D
3851 2180 D
S
N
3851 2188 M
3851 2180 D
3860 2171 D
S
N
3868 2171 M
3860 2171 D
3851 2162 D
S
N
3851 2154 M
3851 2162 D
3842 2171 D
S
3883 2153 P
N
3865 2153 M
3874 2153 D
3883 2161 D
S
N
3883 2170 M
3883 2161 D
3891 2153 D
S
N
3900 2153 M
3891 2153 D
3883 2144 D
S
N
3883 2135 M
3883 2144 D
3874 2153 D
S
3914 2158 P
N
3897 2158 M
3906 2158 D
3914 2167 D
S
N
3914 2176 M
3914 2167 D
3923 2158 D
S
N
3932 2158 M
3923 2158 D
3914 2150 D
S
N
3914 2141 M
3914 2150 D
3906 2158 D
S
3946 2182 P
N
3929 2182 M
3938 2182 D
3946 2191 D
S
N
3946 2200 M
3946 2191 D
3955 2182 D
S
N
3963 2182 M
3955 2182 D
3946 2174 D
S
N
3946 2165 M
3946 2174 D
3938 2182 D
S
3978 2150 P
N
3961 2150 M
3969 2150 D
3978 2159 D
S
N
3978 2167 M
3978 2159 D
3987 2150 D
S
N
3995 2150 M
3987 2150 D
3978 2141 D
S
N
3978 2133 M
3978 2141 D
3969 2150 D
S
4010 2106 P
N
3992 2106 M
4001 2106 D
4010 2114 D
S
N
4010 2123 M
4010 2114 D
4018 2106 D
S
N
4027 2106 M
4018 2106 D
4010 2097 D
S
N
4010 2088 M
4010 2097 D
4001 2106 D
S
4041 2112 P
N
4024 2112 M
4033 2112 D
4041 2121 D
S
N
4041 2129 M
4041 2121 D
4050 2112 D
S
N
4059 2112 M
4050 2112 D
4041 2103 D
S
N
4041 2095 M
4041 2103 D
4033 2112 D
S
4073 2110 P
N
4056 2110 M
4064 2110 D
4073 2118 D
S
N
4073 2127 M
4073 2118 D
4082 2110 D
S
N
4090 2110 M
4082 2110 D
4073 2101 D
S
N
4073 2092 M
4073 2101 D
4064 2110 D
S
4105 2090 P
N
4087 2090 M
4096 2090 D
4105 2099 D
S
N
4105 2107 M
4105 2099 D
4113 2090 D
S
N
4122 2090 M
4113 2090 D
4105 2081 D
S
N
4105 2073 M
4105 2081 D
4096 2090 D
S
4136 2116 P
N
4119 2116 M
4128 2116 D
4136 2125 D
S
N
4136 2133 M
4136 2125 D
4145 2116 D
S
N
4154 2116 M
4145 2116 D
4136 2107 D
S
N
4136 2099 M
4136 2107 D
4128 2116 D
S
4168 2089 P
N
4151 2089 M
4159 2089 D
4168 2098 D
S
N
4168 2107 M
4168 2098 D
4177 2089 D
S
N
4185 2089 M
4177 2089 D
4168 2081 D
S
N
4168 2072 M
4168 2081 D
4159 2089 D
S
4200 2077 P
N
4182 2077 M
4191 2077 D
4200 2085 D
S
N
4200 2094 M
4200 2085 D
4208 2077 D
S
N
4217 2077 M
4208 2077 D
4200 2068 D
S
N
4200 2059 M
4200 2068 D
4191 2077 D
S
4231 2053 P
N
4214 2053 M
4223 2053 D
4231 2062 D
S
N
4231 2071 M
4231 2062 D
4240 2053 D
S
N
4249 2053 M
4240 2053 D
4231 2045 D
S
N
4231 2036 M
4231 2045 D
4223 2053 D
S
4263 2070 P
N
4246 2070 M
4254 2070 D
4263 2078 D
S
N
4263 2087 M
4263 2078 D
4272 2070 D
S
N
4280 2070 M
4272 2070 D
4263 2061 D
S
N
4263 2052 M
4263 2061 D
4254 2070 D
S
4295 1985 P
N
4278 1985 M
4286 1985 D
4295 1994 D
S
N
4295 2002 M
4295 1994 D
4303 1985 D
S
N
4312 1985 M
4303 1985 D
4295 1976 D
S
N
4295 1968 M
4295 1976 D
4286 1985 D
S
4327 2046 P
N
4309 2046 M
4318 2046 D
4327 2054 D
S
N
4327 2063 M
4327 2054 D
4335 2046 D
S
N
4344 2046 M
4335 2046 D
4327 2037 D
S
N
4327 2028 M
4327 2037 D
4318 2046 D
S
4358 2018 P
N
4341 2018 M
4350 2018 D
4358 2027 D
S
N
4358 2035 M
4358 2027 D
4367 2018 D
S
N
4375 2018 M
4367 2018 D
4358 2010 D
S
N
4358 2001 M
4358 2010 D
4350 2018 D
S
4390 2001 P
N
4373 2001 M
4381 2001 D
4390 2010 D
S
N
4390 2019 M
4390 2010 D
4399 2001 D
S
N
4407 2001 M
4399 2001 D
4390 1993 D
S
N
4390 1984 M
4390 1993 D
4381 2001 D
S
4422 1989 P
N
4404 1989 M
4413 1989 D
4422 1998 D
S
N
4422 2007 M
4422 1998 D
4430 1989 D
S
N
4439 1989 M
4430 1989 D
4422 1981 D
S
N
4422 1972 M
4422 1981 D
4413 1989 D
S
0.00 1.00 0.00 setrgbcolor
1284 1041 P
N
1267 1023 M
1301 1023 D
1301 1058 D
1267 1058 D
1267 1023 D
S
1316 1172 P
N
1298 1155 M
1333 1155 D
1333 1189 D
1298 1189 D
1298 1155 D
S
1347 1302 P
N
1330 1285 M
1365 1285 D
1365 1320 D
1330 1320 D
1330 1285 D
S
1379 1431 P
N
1362 1414 M
1396 1414 D
1396 1448 D
1362 1448 D
1362 1414 D
S
1411 1557 P
N
1393 1540 M
1428 1540 D
1428 1575 D
1393 1575 D
1393 1540 D
S
1442 1681 P
N
1425 1663 M
1460 1663 D
1460 1698 D
1425 1698 D
1425 1663 D
S
1474 1801 P
N
1457 1783 M
1491 1783 D
1491 1818 D
1457 1818 D
1457 1783 D
S
1506 1916 P
N
1488 1899 M
1523 1899 D
1523 1934 D
1488 1934 D
1488 1899 D
S
1537 2028 P
N
1520 2010 M
1555 2010 D
1555 2045 D
1520 2045 D
1520 2010 D
S
1569 2134 P
N
1552 2117 M
1586 2117 D
1586 2151 D
1552 2151 D
1552 2117 D
S
1601 2235 P
N
1584 2218 M
1618 2218 D
1618 2253 D
1584 2253 D
1584 2218 D
S
1633 2331 P
N
1615 2314 M
1650 2314 D
1650 2349 D
1615 2349 D
1615 2314 D
S
1664 2422 P
N
1647 2405 M
1682 2405 D
1682 2439 D
1647 2439 D
1647 2405 D
S
1696 2507 P
N
1679 2490 M
1713 2490 D
1713 2524 D
1679 2524 D
1679 2490 D
S
1728 2586 P
N
1710 2569 M
1745 2569 D
1745 2604 D
1710 2604 D
1710 2569 D
S
1759 2660 P
N
1742 2643 M
1777 2643 D
1777 2677 D
1742 2677 D
1742 2643 D
S
1791 2728 P
N
1774 2711 M
1808 2711 D
1808 2746 D
1774 2746 D
1774 2711 D
S
1823 2791 P
N
1805 2774 M
1840 2774 D
1840 2808 D
1805 2808 D
1805 2774 D
S
1854 2849 P
N
1837 2831 M
1872 2831 D
1872 2866 D
1837 2866 D
1837 2831 D
S
1886 2901 P
N
1869 2884 M
1903 2884 D
1903 2918 D
1869 2918 D
1869 2884 D
S
1918 2948 P
N
1900 2931 M
1935 2931 D
1935 2966 D
1900 2966 D
1900 2931 D
S
1949 2991 P
N
1932 2974 M
1967 2974 D
1967 3008 D
1932 3008 D
1932 2974 D
S
1981 3029 P
N
1964 3012 M
1998 3012 D
1998 3047 D
1964 3047 D
1964 3012 D
S
2013 3063 P
N
1996 3046 M
2030 3046 D
2030 3080 D
1996 3080 D
1996 3046 D
S
2045 3093 P
N
2027 3076 M
2062 3076 D
2062 3110 D
2027 3110 D
2027 3076 D
S
2076 3119 P
N
2059 3101 M
2094 3101 D
2094 3136 D
2059 3136 D
2059 3101 D
S
2108 3141 P
N
2091 3124 M
2125 3124 D
2125 3158 D
2091 3158 D
2091 3124 D
S
2140 3160 P
N
2122 3142 M
2157 3142 D
2157 3177 D
2122 3177 D
2122 3142 D
S
2171 3175 P
N
2154 3158 M
2189 3158 D
2189 3192 D
2154 3192 D
2154 3158 D
S
2203 3188 P
N
2186 3170 M
2220 3170 D
2220 3205 D
2186 3205 D
2186 3170 D
S
2235 3197 P
N
2217 3180 M
2252 3180 D
2252 3215 D
2217 3215 D
2217 3180 D
S
2266 3204 P
N
2249 3187 M
2284 3187 D
2284 3222 D
2249 3222 D
2249 3187 D
S
2298 3209 P
N
2281 3191 M
2315 3191 D
2315 3226 D
2281 3226 D
2281 3191 D
S
2330 3211 P
N
2313 3194 M
2347 3194 D
2347 3228 D
2313 3228 D
2313 3194 D
S
2361 3211 P
N
2344 3194 M
2379 3194 D
2379 3228 D
2344 3228 D
2344 3194 D
S
2393 3209 P
N
2376 3192 M
2410 3192 D
2410 3226 D
2376 3226 D
2376 3192 D
S
2425 3205 P
N
2408 3188 M
2442 3188 D
2442 3223 D
2408 3223 D
2408 3188 D
S
2457 3200 P
N
2439 3183 M
2474 3183 D
2474 3217 D
2439 3217 D
2439 3183 D
S
2488 3193 P
N
2471 3176 M
2506 3176 D
2506 3210 D
2471 3210 D
2471 3176 D
S
2520 3185 P
N
2503 3167 M
2537 3167 D
2537 3202 D
2503 3202 D
2503 3167 D
S
2552 3175 P
N
2534 3158 M
2569 3158 D
2569 3192 D
2534 3192 D
2534 3158 D
S
2583 3164 P
N
2566 3147 M
2601 3147 D
2601 3181 D
2566 3181 D
2566 3147 D
S
2615 3152 P
N
2598 3134 M
2632 3134 D
2632 3169 D
2598 3169 D
2598 3134 D
S
2647 3139 P
N
2629 3121 M
2664 3121 D
2664 3156 D
2629 3156 D
2629 3121 D
S
2678 3125 P
N
2661 3107 M
2696 3107 D
2696 3142 D
2661 3142 D
2661 3107 D
S
2710 3110 P
N
2693 3092 M
2727 3092 D
2727 3127 D
2693 3127 D
2693 3092 D
S
2742 3094 P
N
2725 3077 M
2759 3077 D
2759 3111 D
2725 3111 D
2725 3077 D
S
2774 3078 P
N
2756 3060 M
2791 3060 D
2791 3095 D
2756 3095 D
2756 3060 D
S
2805 3061 P
N
2788 3043 M
2823 3043 D
2823 3078 D
2788 3078 D
2788 3043 D
S
2837 3043 P
N
2820 3026 M
2854 3026 D
2854 3060 D
2820 3060 D
2820 3026 D
S
2869 3025 P
N
2851 3008 M
2886 3008 D
2886 3042 D
2851 3042 D
2851 3008 D
S
2900 3007 P
N
2883 2989 M
2918 2989 D
2918 3024 D
2883 3024 D
2883 2989 D
S
2932 2988 P
N
2915 2970 M
2949 2970 D
2949 3005 D
2915 3005 D
2915 2970 D
S
2964 2968 P
N
2946 2951 M
2981 2951 D
2981 2986 D
2946 2986 D
2946 2951 D
S
2995 2949 P
N
2978 2931 M
3013 2931 D
3013 2966 D
2978 2966 D
2978 2931 D
S
3027 2929 P
N
3010 2912 M
3044 2912 D
3044 2946 D
3010 2946 D
3010 2912 D
S
3059 2909 P
N
3041 2892 M
3076 2892 D
3076 2926 D
3041 2926 D
3041 2892 D
S
3090 2889 P
N
3073 2871 M
3108 2871 D
3108 2906 D
3073 2906 D
3073 2871 D
S
3122 2868 P
N
3105 2851 M
3139 2851 D
3139 2886 D
3105 2886 D
3105 2851 D
S
3154 2848 P
N
3137 2830 M
3171 2830 D
3171 2865 D
3137 2865 D
3137 2830 D
S
3186 2827 P
N
3168 2810 M
3203 2810 D
3203 2844 D
3168 2844 D
3168 2810 D
S
3217 2806 P
N
3200 2789 M
3235 2789 D
3235 2824 D
3200 2824 D
3200 2789 D
S
3249 2786 P
N
3232 2768 M
3266 2768 D
3266 2803 D
3232 2803 D
3232 2768 D
S
3281 2765 P
N
3263 2747 M
3298 2747 D
3298 2782 D
3263 2782 D
3263 2747 D
S
3312 2744 P
N
3295 2727 M
3330 2727 D
3330 2761 D
3295 2761 D
3295 2727 D
S
3344 2723 P
N
3327 2706 M
3361 2706 D
3361 2740 D
3327 2740 D
3327 2706 D
S
3376 2702 P
N
3358 2685 M
3393 2685 D
3393 2720 D
3358 2720 D
3358 2685 D
S
3407 2682 P
N
3390 2664 M
3425 2664 D
3425 2699 D
3390 2699 D
3390 2664 D
S
3439 2661 P
N
3422 2644 M
3456 2644 D
3456 2678 D
3422 2678 D
3422 2644 D
S
3471 2640 P
N
3453 2623 M
3488 2623 D
3488 2658 D
3453 2658 D
3453 2623 D
S
3502 2620 P
N
3485 2603 M
3520 2603 D
3520 2637 D
3485 2637 D
3485 2603 D
S
3534 2600 P
N
3517 2582 M
3551 2582 D
3551 2617 D
3517 2617 D
3517 2582 D
S
3566 2579 P
N
3549 2562 M
3583 2562 D
3583 2597 D
3549 2597 D
3549 2562 D
S
3598 2559 P
N
3580 2542 M
3615 2542 D
3615 2576 D
3580 2576 D
3580 2542 D
S
3629 2539 P
N
3612 2522 M
3647 2522 D
3647 2556 D
3612 2556 D
3612 2522 D
S
3661 2519 P
N
3644 2502 M
3678 2502 D
3678 2537 D
3644 2537 D
3644 2502 D
S
3693 2499 P
N
3675 2482 M
3710 2482 D
3710 2517 D
3675 2517 D
3675 2482 D
S
3724 2480 P
N
3707 2463 M
3742 2463 D
3742 2497 D
3707 2497 D
3707 2463 D
S
3756 2460 P
N
3739 2443 M
3773 2443 D
3773 2478 D
3739 2478 D
3739 2443 D
S
3788 2441 P
N
3770 2424 M
3805 2424 D
3805 2458 D
3770 2458 D
3770 2424 D
S
3819 2422 P
N
3802 2405 M
3837 2405 D
3837 2439 D
3802 2439 D
3802 2405 D
S
3851 2403 P
N
3834 2386 M
3868 2386 D
3868 2420 D
3834 2420 D
3834 2386 D
S
3883 2384 P
N
3865 2367 M
3900 2367 D
3900 2402 D
3865 2402 D
3865 2367 D
S
3914 2366 P
N
3897 2348 M
3932 2348 D
3932 2383 D
3897 2383 D
3897 2348 D
S
3946 2347 P
N
3929 2330 M
3963 2330 D
3963 2365 D
3929 2365 D
3929 2330 D
S
3978 2329 P
N
3961 2312 M
3995 2312 D
3995 2346 D
3961 2346 D
3961 2312 D
S
4010 2311 P
N
3992 2294 M
4027 2294 D
4027 2328 D
3992 2328 D
3992 2294 D
S
4041 2293 P
N
4024 2276 M
4059 2276 D
4059 2310 D
4024 2310 D
4024 2276 D
S
4073 2275 P
N
4056 2258 M
4090 2258 D
4090 2293 D
4056 2293 D
4056 2258 D
S
4105 2258 P
N
4087 2241 M
4122 2241 D
4122 2275 D
4087 2275 D
4087 2241 D
S
4136 2241 P
N
4119 2223 M
4154 2223 D
4154 2258 D
4119 2258 D
4119 2223 D
S
4168 2224 P
N
4151 2206 M
4185 2206 D
4185 2241 D
4151 2241 D
4151 2206 D
S
4200 2207 P
N
4182 2189 M
4217 2189 D
4217 2224 D
4182 2224 D
4182 2189 D
S
4231 2190 P
N
4214 2173 M
4249 2173 D
4249 2207 D
4214 2207 D
4214 2173 D
S
4263 2173 P
N
4246 2156 M
4280 2156 D
4280 2191 D
4246 2191 D
4246 2156 D
S
4295 2157 P
N
4278 2140 M
4312 2140 D
4312 2174 D
4278 2174 D
4278 2140 D
S
4327 2141 P
N
4309 2124 M
4344 2124 D
4344 2158 D
4309 2158 D
4309 2124 D
S
4358 2125 P
N
4341 2108 M
4375 2108 D
4375 2142 D
4341 2142 D
4341 2108 D
S
4390 2109 P
N
4373 2092 M
4407 2092 D
4407 2127 D
4373 2127 D
4373 2092 D
S
4422 2094 P
N
4404 2076 M
4439 2076 D
4439 2111 D
4404 2111 D
4404 2076 D
S
0.00 0.00 0.00 setrgbcolor
N
1268 3300 M
1268 975 D
S
N
1268 975 M
4437 975 D
S
N
4437 975 M
4437 3300 D
S
N
4437 3300 M
1268 3300 D
S
N
1268 975 M
4437 975 D
S
N
1268 975 M
1268 1079 D
S
N
1374 1009 M
1374 975 D
S
N
1479 975 M
1479 1009 D
S
N
1585 1009 M
1585 975 D
S
N
1691 975 M
1691 1009 D
S
N
1796 1079 M
1796 975 D
S
N
1902 975 M
1902 1009 D
S
N
2008 1009 M
2008 975 D
S
N
2113 975 M
2113 1009 D
S
N
2219 1009 M
2219 975 D
S
N
2325 975 M
2325 1079 D
S
N
2430 1009 M
2430 975 D
S
N
2536 975 M
2536 1009 D
S
N
2641 1009 M
2641 975 D
S
N
2747 975 M
2747 1009 D
S
N
2853 1079 M
2853 975 D
S
N
2958 975 M
2958 1009 D
S
N
3064 1009 M
3064 975 D
S
N
3170 975 M
3170 1009 D
S
N
3275 1009 M
3275 975 D
S
N
3381 975 M
3381 1079 D
S
N
3487 1009 M
3487 975 D
S
N
3592 975 M
3592 1009 D
S
N
3698 1009 M
3698 975 D
S
N
3804 975 M
3804 1009 D
S
N
3909 1079 M
3909 975 D
S
N
4015 975 M
4015 1009 D
S
N
4120 1009 M
4120 975 D
S
N
4226 975 M
4226 1009 D
S
N
4332 1009 M
4332 975 D
S
N
4437 975 M
4437 1079 D
S
N
1264 903 M
1254 900 D
1246 889 D
1243 871 D
1243 860 D
1246 842 D
1254 831 D
1264 828 D
1272 828 D
1282 831 D
1290 842 D
1293 860 D
1293 871 D
1290 889 D
1282 900 D
1272 903 D
1264 903 D
S
N
1264 903 M
1257 900 D
1254 896 D
1250 889 D
1246 871 D
1246 860 D
1250 842 D
1254 835 D
1257 831 D
1264 828 D
S
N
1272 828 M
1279 831 D
1282 835 D
1286 842 D
1290 860 D
1290 871 D
1286 889 D
1282 896 D
1279 900 D
1272 903 D
S
N
1778 903 M
1771 867 D
S
N
1771 867 M
1778 875 D
1789 878 D
1800 878 D
1811 875 D
1818 867 D
1822 856 D
1822 849 D
1818 838 D
1811 831 D
1800 828 D
1789 828 D
1778 831 D
1775 835 D
1771 842 D
1771 846 D
1775 849 D
1778 846 D
1775 842 D
S
N
1800 878 M
1807 875 D
1814 867 D
1818 856 D
1818 849 D
1814 838 D
1807 831 D
1800 828 D
S
N
1778 903 M
1814 903 D
S
N
1778 900 M
1796 900 D
1814 903 D
S
N
2274 889 M
2281 893 D
2292 903 D
2292 828 D
S
N
2288 900 M
2288 828 D
S
N
2274 828 M
2307 828 D
S
N
2357 903 M
2346 900 D
2339 889 D
2335 871 D
2335 860 D
2339 842 D
2346 831 D
2357 828 D
2364 828 D
2375 831 D
2382 842 D
2386 860 D
2386 871 D
2382 889 D
2375 900 D
2364 903 D
2357 903 D
S
N
2357 903 M
2350 900 D
2346 896 D
2343 889 D
2339 871 D
2339 860 D
2343 842 D
2346 835 D
2350 831 D
2357 828 D
S
N
2364 828 M
2371 831 D
2375 835 D
2379 842 D
2382 860 D
2382 871 D
2379 889 D
2375 896 D
2371 900 D
2364 903 D
S
N
2802 889 M
2809 893 D
2820 903 D
2820 828 D
S
N
2817 900 M
2817 828 D
S
N
2802 828 M
2835 828 D
S
N
2871 903 M
2864 867 D
S
N
2864 867 M
2871 875 D
2882 878 D
2892 878 D
2903 875 D
2910 867 D
2914 856 D
2914 849 D
2910 838 D
2903 831 D
2892 828 D
2882 828 D
2871 831 D
2867 835 D
2864 842 D
2864 846 D
2867 849 D
2871 846 D
2867 842 D
S
N
2892 878 M
2900 875 D
2907 867 D
2910 856 D
2910 849 D
2907 838 D
2900 831 D
2892 828 D
S
N
2871 903 M
2907 903 D
S
N
2871 900 M
2889 900 D
2907 903 D
S
N
3323 889 M
3327 885 D
3323 882 D
3320 885 D
3320 889 D
3323 896 D
3327 900 D
3338 903 D
3352 903 D
3363 900 D
3367 896 D
3370 889 D
3370 882 D
3367 875 D
3356 867 D
3338 860 D
3331 856 D
3323 849 D
3320 838 D
3320 828 D
S
N
3352 903 M
3359 900 D
3363 896 D
3367 889 D
3367 882 D
3363 875 D
3352 867 D
3338 860 D
S
N
3320 835 M
3323 838 D
3331 838 D
3349 831 D
3359 831 D
3367 835 D
3370 838 D
S
N
3331 838 M
3349 828 D
3363 828 D
3367 831 D
3370 838 D
3370 846 D
S
N
3413 903 M
3403 900 D
3395 889 D
3392 871 D
3392 860 D
3395 842 D
3403 831 D
3413 828 D
3421 828 D
3431 831 D
3439 842 D
3442 860 D
3442 871 D
3439 889 D
3431 900 D
3421 903 D
3413 903 D
S
N
3413 903 M
3406 900 D
3403 896 D
3399 889 D
3395 871 D
3395 860 D
3399 842 D
3403 835 D
3406 831 D
3413 828 D
S
N
3421 828 M
3428 831 D
3431 835 D
3435 842 D
3439 860 D
3439 871 D
3435 889 D
3431 896 D
3428 900 D
3421 903 D
S
N
3852 889 M
3855 885 D
3852 882 D
3848 885 D
3848 889 D
3852 896 D
3855 900 D
3866 903 D
3880 903 D
3891 900 D
3895 896 D
3898 889 D
3898 882 D
3895 875 D
3884 867 D
3866 860 D
3859 856 D
3852 849 D
3848 838 D
3848 828 D
S
N
3880 903 M
3888 900 D
3891 896 D
3895 889 D
3895 882 D
3891 875 D
3880 867 D
3866 860 D
S
N
3848 835 M
3852 838 D
3859 838 D
3877 831 D
3888 831 D
3895 835 D
3898 838 D
S
N
3859 838 M
3877 828 D
3891 828 D
3895 831 D
3898 838 D
3898 846 D
S
N
3927 903 M
3920 867 D
S
N
3920 867 M
3927 875 D
3938 878 D
3949 878 D
3960 875 D
3967 867 D
3970 856 D
3970 849 D
3967 838 D
3960 831 D
3949 828 D
3938 828 D
3927 831 D
3924 835 D
3920 842 D
3920 846 D
3924 849 D
3927 846 D
3924 842 D
S
N
3949 878 M
3956 875 D
3963 867 D
3967 856 D
3967 849 D
3963 838 D
3956 831 D
3949 828 D
S
N
3927 903 M
3963 903 D
S
N
3927 900 M
3945 900 D
3963 903 D
S
N
4380 889 M
4383 885 D
4380 882 D
4376 885 D
4376 889 D
4380 896 D
4383 900 D
4394 903 D
4409 903 D
4419 900 D
4423 893 D
4423 882 D
4419 875 D
4409 871 D
4398 871 D
S
N
4409 903 M
4416 900 D
4419 893 D
4419 882 D
4416 875 D
4409 871 D
S
N
4409 871 M
4416 867 D
4423 860 D
4427 853 D
4427 842 D
4423 835 D
4419 831 D
4409 828 D
4394 828 D
4383 831 D
4380 835 D
4376 842 D
4376 846 D
4380 849 D
4383 846 D
4380 842 D
S
N
4419 864 M
4423 853 D
4423 842 D
4419 835 D
4416 831 D
4409 828 D
S
N
4470 903 M
4459 900 D
4452 889 D
4448 871 D
4448 860 D
4452 842 D
4459 831 D
4470 828 D
4477 828 D
4488 831 D
4495 842 D
4499 860 D
4499 871 D
4495 889 D
4488 900 D
4477 903 D
4470 903 D
S
N
4470 903 M
4463 900 D
4459 896 D
4455 889 D
4452 871 D
4452 860 D
4455 842 D
4459 835 D
4463 831 D
4470 828 D
S
N
4477 828 M
4484 831 D
4488 835 D
4491 842 D
4495 860 D
4495 871 D
4491 889 D
4488 896 D
4484 900 D
4477 903 D
S
N
1268 3196 M
1268 3300 D
S
N
1374 3300 M
1374 3265 D
S
N
1479 3265 M
1479 3300 D
S
N
1585 3300 M
1585 3265 D
S
N
1691 3265 M
1691 3300 D
S
N
1796 3300 M
1796 3196 D
S
N
1902 3265 M
1902 3300 D
S
N
2008 3300 M
2008 3265 D
S
N
2113 3265 M
2113 3300 D
S
N
2219 3300 M
2219 3265 D
S
N
2325 3196 M
2325 3300 D
S
N
2430 3300 M
2430 3265 D
S
N
2536 3265 M
2536 3300 D
S
N
2641 3300 M
2641 3265 D
S
N
2747 3265 M
2747 3300 D
S
N
2853 3300 M
2853 3196 D
S
N
2958 3265 M
2958 3300 D
S
N
3064 3300 M
3064 3265 D
S
N
3170 3265 M
3170 3300 D
S
N
3275 3300 M
3275 3265 D
S
N
3381 3196 M
3381 3300 D
S
N
3487 3300 M
3487 3265 D
S
N
3592 3265 M
3592 3300 D
S
N
3698 3300 M
3698 3265 D
S
N
3804 3265 M
3804 3300 D
S
N
3909 3300 M
3909 3196 D
S
N
4015 3265 M
4015 3300 D
S
N
4120 3300 M
4120 3265 D
S
N
4226 3265 M
4226 3300 D
S
N
4332 3300 M
4332 3265 D
S
N
4437 3196 M
4437 3300 D
S
N
1268 975 M
1268 3300 D
S
N
1268 975 M
1372 975 D
S
N
1303 1059 M
1268 1059 D
S
N
1268 1144 M
1303 1144 D
S
N
1303 1228 M
1268 1228 D
S
N
1268 1313 M
1303 1313 D
S
N
1372 1397 M
1268 1397 D
S
N
1268 1482 M
1303 1482 D
S
N
1303 1567 M
1268 1567 D
S
N
1268 1651 M
1303 1651 D
S
N
1303 1736 M
1268 1736 D
S
N
1268 1820 M
1372 1820 D
S
N
1303 1905 M
1268 1905 D
S
N
1268 1989 M
1303 1989 D
S
N
1303 2074 M
1268 2074 D
S
N
1268 2158 M
1303 2158 D
S
N
1372 2243 M
1268 2243 D
S
N
1268 2327 M
1303 2327 D
S
N
1303 2412 M
1268 2412 D
S
N
1268 2497 M
1303 2497 D
S
N
1303 2581 M
1268 2581 D
S
N
1268 2666 M
1372 2666 D
S
N
1303 2750 M
1268 2750 D
S
N
1268 2835 M
1303 2835 D
S
N
1303 2919 M
1268 2919 D
S
N
1268 3004 M
1303 3004 D
S
N
1372 3088 M
1268 3088 D
S
N
1268 3173 M
1303 3173 D
S
N
1303 3258 M
1268 3258 D
S
N
1077 1007 M
1066 1004 D
1059 993 D
1055 975 D
1055 964 D
1059 946 D
1066 935 D
1077 931 D
1084 931 D
1095 935 D
1102 946 D
1106 964 D
1106 975 D
1102 993 D
1095 1004 D
1084 1007 D
1077 1007 D
S
N
1077 1007 M
1070 1004 D
1066 1000 D
1063 993 D
1059 975 D
1059 964 D
1063 946 D
1066 939 D
1070 935 D
1077 931 D
S
N
1084 931 M
1091 935 D
1095 939 D
1099 946 D
1102 964 D
1102 975 D
1099 993 D
1095 1000 D
1091 1004 D
1084 1007 D
S
N
1135 939 M
1131 935 D
1135 931 D
1138 935 D
1135 939 D
S
N
1185 1007 M
1174 1004 D
1167 993 D
1164 975 D
1164 964 D
1167 946 D
1174 935 D
1185 931 D
1192 931 D
1203 935 D
1210 946 D
1214 964 D
1214 975 D
1210 993 D
1203 1004 D
1192 1007 D
1185 1007 D
S
N
1185 1007 M
1178 1004 D
1174 1000 D
1171 993 D
1167 975 D
1167 964 D
1171 946 D
1174 939 D
1178 935 D
1185 931 D
S
N
1192 931 M
1200 935 D
1203 939 D
1207 946 D
1210 964 D
1210 975 D
1207 993 D
1203 1000 D
1200 1004 D
1192 1007 D
S
N
1077 1430 M
1066 1426 D
1059 1415 D
1055 1397 D
1055 1387 D
1059 1369 D
1066 1358 D
1077 1354 D
1084 1354 D
1095 1358 D
1102 1369 D
1106 1387 D
1106 1397 D
1102 1415 D
1095 1426 D
1084 1430 D
1077 1430 D
S
N
1077 1430 M
1070 1426 D
1066 1423 D
1063 1415 D
1059 1397 D
1059 1387 D
1063 1369 D
1066 1361 D
1070 1358 D
1077 1354 D
S
N
1084 1354 M
1091 1358 D
1095 1361 D
1099 1369 D
1102 1387 D
1102 1397 D
1099 1415 D
1095 1423 D
1091 1426 D
1084 1430 D
S
N
1135 1361 M
1131 1358 D
1135 1354 D
1138 1358 D
1135 1361 D
S
N
1167 1415 M
1171 1412 D
1167 1408 D
1164 1412 D
1164 1415 D
1167 1423 D
1171 1426 D
1182 1430 D
1196 1430 D
1207 1426 D
1210 1423 D
1214 1415 D
1214 1408 D
1210 1401 D
1200 1394 D
1182 1387 D
1174 1383 D
1167 1376 D
1164 1365 D
1164 1354 D
S
N
1196 1430 M
1203 1426 D
1207 1423 D
1210 1415 D
1210 1408 D
1207 1401 D
1196 1394 D
1182 1387 D
S
N
1164 1361 M
1167 1365 D
1174 1365 D
1192 1358 D
1203 1358 D
1210 1361 D
1214 1365 D
S
N
1174 1365 M
1192 1354 D
1207 1354 D
1210 1358 D
1214 1365 D
1214 1372 D
S
N
1077 1853 M
1066 1849 D
1059 1838 D
1055 1820 D
1055 1809 D
1059 1791 D
1066 1781 D
1077 1777 D
1084 1777 D
1095 1781 D
1102 1791 D
1106 1809 D
1106 1820 D
1102 1838 D
1095 1849 D
1084 1853 D
1077 1853 D
S
N
1077 1853 M
1070 1849 D
1066 1845 D
1063 1838 D
1059 1820 D
1059 1809 D
1063 1791 D
1066 1784 D
1070 1781 D
1077 1777 D
S
N
1084 1777 M
1091 1781 D
1095 1784 D
1099 1791 D
1102 1809 D
1102 1820 D
1099 1838 D
1095 1845 D
1091 1849 D
1084 1853 D
S
N
1135 1784 M
1131 1781 D
1135 1777 D
1138 1781 D
1135 1784 D
S
N
1196 1845 M
1196 1777 D
S
N
1200 1853 M
1200 1777 D
S
N
1200 1853 M
1160 1799 D
1218 1799 D
S
N
1185 1777 M
1210 1777 D
S
N
1077 2275 M
1066 2272 D
1059 2261 D
1055 2243 D
1055 2232 D
1059 2214 D
1066 2203 D
1077 2200 D
1084 2200 D
1095 2203 D
1102 2214 D
1106 2232 D
1106 2243 D
1102 2261 D
1095 2272 D
1084 2275 D
1077 2275 D
S
N
1077 2275 M
1070 2272 D
1066 2268 D
1063 2261 D
1059 2243 D
1059 2232 D
1063 2214 D
1066 2207 D
1070 2203 D
1077 2200 D
S
N
1084 2200 M
1091 2203 D
1095 2207 D
1099 2214 D
1102 2232 D
1102 2243 D
1099 2261 D
1095 2268 D
1091 2272 D
1084 2275 D
S
N
1135 2207 M
1131 2203 D
1135 2200 D
1138 2203 D
1135 2207 D
S
N
1207 2265 M
1203 2261 D
1207 2257 D
1210 2261 D
1210 2265 D
1207 2272 D
1200 2275 D
1189 2275 D
1178 2272 D
1171 2265 D
1167 2257 D
1164 2243 D
1164 2221 D
1167 2211 D
1174 2203 D
1185 2200 D
1192 2200 D
1203 2203 D
1210 2211 D
1214 2221 D
1214 2225 D
1210 2236 D
1203 2243 D
1192 2247 D
1189 2247 D
1178 2243 D
1171 2236 D
1167 2225 D
S
N
1189 2275 M
1182 2272 D
1174 2265 D
1171 2257 D
1167 2243 D
1167 2221 D
1171 2211 D
1178 2203 D
1185 2200 D
S
N
1192 2200 M
1200 2203 D
1207 2211 D
1210 2221 D
1210 2225 D
1207 2236 D
1200 2243 D
1192 2247 D
S
N
1077 2698 M
1066 2695 D
1059 2684 D
1055 2666 D
1055 2655 D
1059 2637 D
1066 2626 D
1077 2622 D
1084 2622 D
1095 2626 D
1102 2637 D
1106 2655 D
1106 2666 D
1102 2684 D
1095 2695 D
1084 2698 D
1077 2698 D
S
N
1077 2698 M
1070 2695 D
1066 2691 D
1063 2684 D
1059 2666 D
1059 2655 D
1063 2637 D
1066 2630 D
1070 2626 D
1077 2622 D
S
N
1084 2622 M
1091 2626 D
1095 2630 D
1099 2637 D
1102 2655 D
1102 2666 D
1099 2684 D
1095 2691 D
1091 2695 D
1084 2698 D
S
N
1135 2630 M
1131 2626 D
1135 2622 D
1138 2626 D
1135 2630 D
S
N
1182 2698 M
1171 2695 D
1167 2687 D
1167 2677 D
1171 2669 D
1182 2666 D
1196 2666 D
1207 2669 D
1210 2677 D
1210 2687 D
1207 2695 D
1196 2698 D
1182 2698 D
S
N
1182 2698 M
1174 2695 D
1171 2687 D
1171 2677 D
1174 2669 D
1182 2666 D
S
N
1196 2666 M
1203 2669 D
1207 2677 D
1207 2687 D
1203 2695 D
1196 2698 D
S
N
1182 2666 M
1171 2662 D
1167 2658 D
1164 2651 D
1164 2637 D
1167 2630 D
1171 2626 D
1182 2622 D
1196 2622 D
1207 2626 D
1210 2630 D
1214 2637 D
1214 2651 D
1210 2658 D
1207 2662 D
1196 2666 D
S
N
1182 2666 M
1174 2662 D
1171 2658 D
1167 2651 D
1167 2637 D
1171 2630 D
1174 2626 D
1182 2622 D
S
N
1196 2622 M
1203 2626 D
1207 2630 D
1210 2637 D
1210 2651 D
1207 2658 D
1203 2662 D
1196 2666 D
S
N
1066 3106 M
1073 3110 D
1084 3121 D
1084 3045 D
S
N
1081 3117 M
1081 3045 D
S
N
1066 3045 M
1099 3045 D
S
N
1135 3052 M
1131 3049 D
1135 3045 D
1138 3049 D
1135 3052 D
S
N
1185 3121 M
1174 3117 D
1167 3106 D
1164 3088 D
1164 3078 D
1167 3060 D
1174 3049 D
1185 3045 D
1192 3045 D
1203 3049 D
1210 3060 D
1214 3078 D
1214 3088 D
1210 3106 D
1203 3117 D
1192 3121 D
1185 3121 D
S
N
1185 3121 M
1178 3117 D
1174 3114 D
1171 3106 D
1167 3088 D
1167 3078 D
1171 3060 D
1174 3052 D
1178 3049 D
1185 3045 D
S
N
1192 3045 M
1200 3049 D
1203 3052 D
1207 3060 D
1210 3078 D
1210 3088 D
1207 3106 D
1203 3114 D
1200 3117 D
1192 3121 D
S
N
4437 975 M
4437 3300 D
S
N
4334 975 M
4437 975 D
S
N
4437 1059 M
4403 1059 D
S
N
4403 1144 M
4437 1144 D
S
N
4437 1228 M
4403 1228 D
S
N
4403 1313 M
4437 1313 D
S
N
4437 1397 M
4334 1397 D
S
N
4403 1482 M
4437 1482 D
S
N
4437 1567 M
4403 1567 D
S
N
4403 1651 M
4437 1651 D
S
N
4437 1736 M
4403 1736 D
S
N
4334 1820 M
4437 1820 D
S
N
4437 1905 M
4403 1905 D
S
N
4403 1989 M
4437 1989 D
S
N
4437 2074 M
4403 2074 D
S
N
4403 2158 M
4437 2158 D
S
N
4437 2243 M
4334 2243 D
S
N
4403 2327 M
4437 2327 D
S
N
4437 2412 M
4403 2412 D
S
N
4403 2497 M
4437 2497 D
S
N
4437 2581 M
4403 2581 D
S
N
4334 2666 M
4437 2666 D
S
N
4437 2750 M
4403 2750 D
S
N
4403 2835 M
4437 2835 D
S
N
4437 2919 M
4403 2919 D
S
N
4403 3004 M
4437 3004 D
S
N
4437 3088 M
4334 3088 D
S
N
4403 3173 M
4437 3173 D
S
N
4437 3258 M
4403 3258 D
S
N
3400 3131 M
3400 3031 D
S
N
3405 3131 M
3405 3031 D
S
N
3386 3131 M
3420 3131 D
S
N
3386 3031 M
3458 3031 D
3458 3060 D
3453 3031 D
S
N
3486 3131 M
3486 3031 D
S
N
3491 3131 M
3491 3031 D
S
N
3548 3131 M
3548 3031 D
S
N
3553 3131 M
3553 3031 D
S
N
3472 3131 M
3505 3131 D
S
N
3534 3131 M
3567 3131 D
S
N
3491 3084 M
3548 3084 D
S
N
3472 3031 M
3505 3031 D
S
N
3534 3031 M
3567 3031 D
S
N
3657 3117 M
3662 3103 D
3662 3131 D
3657 3117 D
3648 3127 D
3634 3131 D
3624 3131 D
3610 3127 D
3600 3117 D
3596 3107 D
3591 3093 D
3591 3069 D
3596 3055 D
3600 3046 D
3610 3036 D
3624 3031 D
3634 3031 D
3648 3036 D
3657 3046 D
3662 3055 D
S
N
3624 3131 M
3615 3127 D
3605 3117 D
3600 3107 D
3596 3093 D
3596 3069 D
3600 3055 D
3605 3046 D
3615 3036 D
3624 3031 D
S
N
3700 3031 M
3695 3036 D
3700 3041 D
3705 3036 D
3705 3027 D
3700 3017 D
3695 3012 D
S
N
3829 3112 M
3838 3117 D
3852 3131 D
3852 3031 D
S
N
3848 3127 M
3848 3031 D
S
N
3829 3031 M
3871 3031 D
S
N
3952 3122 M
3952 3031 D
S
N
3957 3131 M
3957 3031 D
S
N
3957 3131 M
3905 3060 D
3981 3060 D
S
N
3938 3031 M
3971 3031 D
S
N
4109 3131 M
4109 3031 D
S
N
4114 3131 M
4114 3031 D
S
N
4081 3131 M
4076 3103 D
4076 3131 D
4147 3131 D
4147 3103 D
4143 3131 D
S
N
4095 3031 M
4128 3031 D
S
N
4176 3069 M
4233 3069 D
4233 3079 D
4228 3088 D
4224 3093 D
4214 3098 D
4200 3098 D
4185 3093 D
4176 3084 D
4171 3069 D
4171 3060 D
4176 3046 D
4185 3036 D
4200 3031 D
4209 3031 D
4224 3036 D
4233 3046 D
S
N
4228 3069 M
4228 3084 D
4224 3093 D
S
N
4200 3098 M
4190 3093 D
4181 3084 D
4176 3069 D
4176 3060 D
4181 3046 D
4190 3036 D
4200 3031 D
S
N
4262 3131 M
4295 3031 D
S
N
4266 3131 M
4295 3046 D
S
N
4328 3131 M
4295 3031 D
S
N
4252 3131 M
4281 3131 D
S
N
4309 3131 M
4338 3131 D
S
N
3400 2870 M
3400 2803 D
S
N
3405 2870 M
3405 2803 D
S
N
3405 2855 M
3415 2865 D
3429 2870 D
3439 2870 D
3453 2865 D
3458 2855 D
3458 2803 D
S
N
3439 2870 M
3448 2865 D
3453 2855 D
3453 2803 D
S
N
3458 2855 M
3467 2865 D
3481 2870 D
3491 2870 D
3505 2865 D
3510 2855 D
3510 2803 D
S
N
3491 2870 M
3500 2865 D
3505 2855 D
3505 2803 D
S
N
3386 2870 M
3405 2870 D
S
N
3386 2803 M
3420 2803 D
S
N
3439 2803 M
3472 2803 D
S
N
3491 2803 M
3524 2803 D
S
N
3556 2832 M
3556 2765 D
S
N
3559 2832 M
3559 2765 D
S
N
3597 2832 M
3597 2765 D
S
N
3600 2832 M
3600 2765 D
S
N
3546 2832 M
3569 2832 D
S
N
3588 2832 M
3610 2832 D
S
N
3559 2800 M
3597 2800 D
S
N
3546 2765 M
3569 2765 D
S
N
3588 2765 M
3610 2765 D
S
N
3642 2860 M
3727 2860 D
S
N
3642 2832 M
3727 2832 D
S
N
3775 2884 M
3784 2889 D
3799 2903 D
3799 2803 D
S
N
3794 2898 M
3794 2803 D
S
N
3775 2803 M
3818 2803 D
S
N
3860 2884 M
3865 2879 D
3860 2874 D
3856 2879 D
3856 2884 D
3860 2893 D
3865 2898 D
3879 2903 D
3898 2903 D
3913 2898 D
3917 2893 D
3922 2884 D
3922 2874 D
3917 2865 D
3903 2855 D
3879 2846 D
3870 2841 D
3860 2832 D
3856 2817 D
3856 2803 D
S
N
3898 2903 M
3908 2898 D
3913 2893 D
3917 2884 D
3917 2874 D
3913 2865 D
3898 2855 D
3879 2846 D
S
N
3856 2813 M
3860 2817 D
3870 2817 D
3894 2808 D
3908 2808 D
3917 2813 D
3922 2817 D
S
N
3870 2817 M
3894 2803 D
3913 2803 D
3917 2808 D
3922 2817 D
3922 2827 D
S
N
3979 2903 M
3965 2898 D
3956 2884 D
3951 2860 D
3951 2846 D
3956 2822 D
3965 2808 D
3979 2803 D
3989 2803 D
4003 2808 D
4013 2822 D
4017 2846 D
4017 2860 D
4013 2884 D
4003 2898 D
3989 2903 D
3979 2903 D
S
N
3979 2903 M
3970 2898 D
3965 2893 D
3960 2884 D
3956 2860 D
3956 2846 D
3960 2822 D
3965 2813 D
3970 2808 D
3979 2803 D
S
N
3989 2803 M
3998 2808 D
4003 2813 D
4008 2822 D
4013 2846 D
4013 2860 D
4008 2884 D
4003 2893 D
3998 2898 D
3989 2903 D
S
N
4189 2889 M
4193 2874 D
4193 2903 D
4189 2889 D
4179 2898 D
4165 2903 D
4155 2903 D
4141 2898 D
4132 2889 D
4127 2879 D
4122 2865 D
4122 2841 D
4127 2827 D
4132 2817 D
4141 2808 D
4155 2803 D
4165 2803 D
4179 2808 D
4189 2817 D
S
N
4155 2903 M
4146 2898 D
4136 2889 D
4132 2879 D
4127 2865 D
4127 2841 D
4132 2827 D
4136 2817 D
4146 2808 D
4155 2803 D
S
N
4189 2841 M
4189 2803 D
S
N
4193 2841 M
4193 2803 D
S
N
4174 2841 M
4208 2841 D
S
N
4236 2841 M
4293 2841 D
4293 2851 D
4289 2860 D
4284 2865 D
4274 2870 D
4260 2870 D
4246 2865 D
4236 2855 D
4231 2841 D
4231 2832 D
4236 2817 D
4246 2808 D
4260 2803 D
4270 2803 D
4284 2808 D
4293 2817 D
S
N
4289 2841 M
4289 2855 D
4284 2865 D
S
N
4260 2870 M
4251 2865 D
4241 2855 D
4236 2841 D
4236 2832 D
4241 2817 D
4251 2808 D
4260 2803 D
S
N
4322 2903 M
4355 2803 D
S
N
4327 2903 M
4355 2817 D
S
N
4388 2903 M
4355 2803 D
S
N
4312 2903 M
4341 2903 D
S
N
4369 2903 M
4398 2903 D
S
1.00 0.00 0.00 setrgbcolor
2113 1820 P
N
2090 1820 M
2102 1820 D
2113 1832 D
S
N
2113 1843 M
2113 1832 D
2125 1820 D
S
N
2136 1820 M
2125 1820 D
2113 1809 D
S
N
2113 1797 M
2113 1809 D
2102 1820 D
S
N
2299 1853 M
2299 1777 D
S
N
2303 1853 M
2303 1777 D
S
N
2288 1853 M
2332 1853 D
2343 1849 D
2346 1845 D
2350 1838 D
2350 1827 D
2346 1820 D
2343 1817 D
2332 1813 D
2303 1813 D
S
N
2332 1853 M
2339 1849 D
2343 1845 D
2346 1838 D
2346 1827 D
2343 1820 D
2339 1817 D
2332 1813 D
S
N
2288 1777 M
2314 1777 D
S
N
2397 1853 M
2386 1849 D
2379 1842 D
2375 1835 D
2371 1820 D
2371 1809 D
2375 1795 D
2379 1788 D
2386 1781 D
2397 1777 D
2404 1777 D
2415 1781 D
2422 1788 D
2425 1795 D
2429 1809 D
2429 1820 D
2425 1835 D
2422 1842 D
2415 1849 D
2404 1853 D
2397 1853 D
S
N
2397 1853 M
2389 1849 D
2382 1842 D
2379 1835 D
2375 1820 D
2375 1809 D
2379 1795 D
2382 1788 D
2389 1781 D
2397 1777 D
S
N
2404 1777 M
2411 1781 D
2418 1788 D
2422 1795 D
2425 1809 D
2425 1820 D
2422 1835 D
2418 1842 D
2411 1849 D
2404 1853 D
S
N
2454 1853 M
2469 1777 D
S
N
2458 1853 M
2469 1795 D
S
N
2483 1853 M
2469 1777 D
S
N
2483 1853 M
2498 1777 D
S
N
2487 1853 M
2498 1795 D
S
N
2512 1853 M
2498 1777 D
S
N
2443 1853 M
2469 1853 D
S
N
2501 1853 M
2523 1853 D
S
N
2544 1853 M
2544 1777 D
S
N
2548 1853 M
2548 1777 D
S
N
2591 1853 M
2591 1777 D
S
N
2595 1853 M
2595 1777 D
S
N
2534 1853 M
2559 1853 D
S
N
2580 1853 M
2606 1853 D
S
N
2548 1817 M
2591 1817 D
S
N
2534 1777 M
2559 1777 D
S
N
2580 1777 M
2606 1777 D
S
N
2631 1853 M
2631 1777 D
S
N
2634 1853 M
2634 1777 D
S
N
2656 1831 M
2656 1802 D
S
N
2620 1853 M
2678 1853 D
2678 1831 D
2674 1853 D
S
N
2634 1817 M
2656 1817 D
S
N
2620 1777 M
2678 1777 D
2678 1799 D
2674 1777 D
S
N
2750 1842 M
2753 1831 D
2753 1853 D
2750 1842 D
2743 1849 D
2732 1853 D
2725 1853 D
2714 1849 D
2707 1842 D
2703 1835 D
2699 1824 D
2699 1806 D
2703 1795 D
2707 1788 D
2714 1781 D
2725 1777 D
2732 1777 D
2743 1781 D
2750 1788 D
S
N
2725 1853 M
2717 1849 D
2710 1842 D
2707 1835 D
2703 1824 D
2703 1806 D
2707 1795 D
2710 1788 D
2717 1781 D
2725 1777 D
S
N
2750 1806 M
2750 1777 D
S
N
2753 1806 M
2753 1777 D
S
N
2739 1806 M
2764 1806 D
S
N
2818 1842 M
2818 1777 D
S
N
2786 1809 M
2851 1809 D
S
N
2883 1853 M
2883 1777 D
S
N
2887 1853 M
2887 1777 D
S
N
2930 1853 M
2930 1777 D
S
N
2934 1853 M
2934 1777 D
S
N
2872 1853 M
2898 1853 D
S
N
2919 1853 M
2944 1853 D
S
N
2887 1817 M
2930 1817 D
S
N
2872 1777 M
2898 1777 D
S
N
2919 1777 M
2944 1777 D
S
N
2970 1853 M
2970 1777 D
S
N
2973 1853 M
2973 1777 D
S
N
2995 1831 M
2995 1802 D
S
N
2959 1853 M
3017 1853 D
3017 1831 D
3013 1853 D
S
N
2973 1817 M
2995 1817 D
S
N
2959 1777 M
3017 1777 D
3017 1799 D
3013 1777 D
S
N
3045 1853 M
3045 1777 D
S
N
3049 1853 M
3049 1777 D
S
N
3035 1853 M
3078 1853 D
3089 1849 D
3092 1845 D
3096 1838 D
3096 1831 D
3092 1824 D
3089 1820 D
3078 1817 D
3049 1817 D
S
N
3078 1853 M
3085 1849 D
3089 1845 D
3092 1838 D
3092 1831 D
3089 1824 D
3085 1820 D
3078 1817 D
S
N
3035 1777 M
3060 1777 D
S
N
3067 1817 M
3074 1813 D
3078 1809 D
3089 1784 D
3092 1781 D
3096 1781 D
3099 1784 D
S
N
3074 1813 M
3078 1806 D
3085 1781 D
3089 1777 D
3096 1777 D
3099 1784 D
3099 1788 D
S
N
3121 1853 M
3135 1777 D
S
N
3125 1853 M
3135 1795 D
S
N
3150 1853 M
3135 1777 D
S
N
3150 1853 M
3164 1777 D
S
N
3153 1853 M
3164 1795 D
S
N
3179 1853 M
3164 1777 D
S
N
3110 1853 M
3135 1853 D
S
N
3168 1853 M
3190 1853 D
S
N
3211 1853 M
3211 1777 D
S
N
3215 1853 M
3215 1777 D
S
N
3200 1853 M
3226 1853 D
S
N
3200 1777 M
3226 1777 D
S
N
3294 1842 M
3298 1831 D
3298 1853 D
3294 1842 D
3287 1849 D
3276 1853 D
3269 1853 D
3258 1849 D
3251 1842 D
3247 1835 D
3244 1824 D
3244 1806 D
3247 1795 D
3251 1788 D
3258 1781 D
3269 1777 D
3276 1777 D
3287 1781 D
3294 1788 D
S
N
3269 1853 M
3262 1849 D
3254 1842 D
3251 1835 D
3247 1824 D
3247 1806 D
3251 1795 D
3254 1788 D
3262 1781 D
3269 1777 D
S
N
3294 1806 M
3294 1777 D
S
N
3298 1806 M
3298 1777 D
S
N
3283 1806 M
3308 1806 D
S
0.00 0.00 1.00 setrgbcolor
2113 1651 P
N
2090 1651 M
2113 1628 D
2136 1651 D
2113 1674 D
2090 1651 D
S
N
2299 1684 M
2299 1608 D
S
N
2303 1684 M
2303 1608 D
S
N
2346 1684 M
2346 1608 D
S
N
2350 1684 M
2350 1608 D
S
N
2288 1684 M
2314 1684 D
S
N
2335 1684 M
2361 1684 D
S
N
2303 1647 M
2346 1647 D
S
N
2288 1608 M
2314 1608 D
S
N
2335 1608 M
2361 1608 D
S
N
2422 1658 M
2422 1583 D
S
N
2425 1658 M
2425 1583 D
S
N
2422 1647 M
2415 1655 D
2407 1658 D
2400 1658 D
2389 1655 D
2382 1647 D
2379 1637 D
2379 1629 D
2382 1619 D
2389 1611 D
2400 1608 D
2407 1608 D
2415 1611 D
2422 1619 D
S
N
2400 1658 M
2393 1655 D
2386 1647 D
2382 1637 D
2382 1629 D
2386 1619 D
2393 1611 D
2400 1608 D
S
N
2411 1583 M
2436 1583 D
S
N
2472 1684 M
2472 1608 D
S
N
2476 1684 M
2476 1608 D
S
N
2451 1684 M
2447 1662 D
2447 1684 D
2501 1684 D
2501 1662 D
2498 1684 D
S
N
2461 1608 M
2487 1608 D
S
N
2606 1698 M
2598 1691 D
2591 1680 D
2584 1666 D
2580 1647 D
2580 1633 D
2584 1615 D
2591 1601 D
2598 1590 D
2606 1583 D
S
N
2598 1691 M
2591 1676 D
2588 1666 D
2584 1647 D
2584 1633 D
2588 1615 D
2591 1604 D
2598 1590 D
S
N
2634 1684 M
2634 1608 D
S
N
2638 1684 M
2681 1615 D
S
N
2638 1676 M
2681 1608 D
S
N
2681 1684 M
2681 1608 D
S
N
2624 1684 M
2638 1684 D
S
N
2671 1684 M
2692 1684 D
S
N
2624 1608 M
2645 1608 D
S
N
2717 1684 M
2717 1608 D
S
N
2721 1684 M
2721 1608 D
S
N
2707 1684 M
2732 1684 D
S
N
2707 1608 M
2761 1608 D
2761 1629 D
2757 1608 D
S
N
2782 1684 M
2782 1608 D
S
N
2786 1684 M
2786 1608 D
S
N
2771 1684 M
2797 1684 D
S
N
2771 1608 M
2826 1608 D
2826 1629 D
2822 1608 D
S
N
2905 1658 M
2905 1608 D
S
N
2908 1658 M
2908 1608 D
S
N
2908 1637 M
2912 1647 D
2919 1655 D
2926 1658 D
2937 1658 D
2941 1655 D
2941 1651 D
2937 1647 D
2934 1651 D
2937 1655 D
S
N
2894 1658 M
2908 1658 D
S
N
2894 1608 M
2919 1608 D
S
N
2962 1637 M
3006 1637 D
3006 1644 D
3002 1651 D
2999 1655 D
2991 1658 D
2980 1658 D
2970 1655 D
2962 1647 D
2959 1637 D
2959 1629 D
2962 1619 D
2970 1611 D
2980 1608 D
2988 1608 D
2999 1611 D
3006 1619 D
S
N
3002 1637 M
3002 1647 D
2999 1655 D
S
N
2980 1658 M
2973 1655 D
2966 1647 D
2962 1637 D
2962 1629 D
2966 1619 D
2973 1611 D
2980 1608 D
S
N
3063 1651 M
3067 1658 D
3067 1644 D
3063 1651 D
3060 1655 D
3053 1658 D
3038 1658 D
3031 1655 D
3027 1651 D
3027 1644 D
3031 1640 D
3038 1637 D
3056 1629 D
3063 1626 D
3067 1622 D
S
N
3027 1647 M
3031 1644 D
3038 1640 D
3056 1633 D
3063 1629 D
3067 1626 D
3067 1615 D
3063 1611 D
3056 1608 D
3042 1608 D
3035 1611 D
3031 1615 D
3027 1622 D
3027 1608 D
3031 1615 D
S
N
3096 1658 M
3096 1619 D
3099 1611 D
3110 1608 D
3117 1608 D
3128 1611 D
3135 1619 D
S
N
3099 1658 M
3099 1619 D
3103 1611 D
3110 1608 D
S
N
3135 1658 M
3135 1608 D
S
N
3139 1658 M
3139 1608 D
S
N
3085 1658 M
3099 1658 D
S
N
3125 1658 M
3139 1658 D
S
N
3135 1608 M
3150 1608 D
S
N
3175 1658 M
3175 1608 D
S
N
3179 1658 M
3179 1608 D
S
N
3179 1647 M
3186 1655 D
3197 1658 D
3204 1658 D
3215 1655 D
3218 1647 D
3218 1608 D
S
N
3204 1658 M
3211 1655 D
3215 1647 D
3215 1608 D
S
N
3218 1647 M
3226 1655 D
3236 1658 D
3244 1658 D
3254 1655 D
3258 1647 D
3258 1608 D
S
N
3244 1658 M
3251 1655 D
3254 1647 D
3254 1608 D
S
N
3164 1658 M
3179 1658 D
S
N
3164 1608 M
3190 1608 D
S
N
3204 1608 M
3229 1608 D
S
N
3244 1608 M
3269 1608 D
S
N
3294 1615 M
3290 1611 D
3294 1608 D
3298 1611 D
3294 1615 D
S
N
3323 1698 M
3330 1691 D
3337 1680 D
3344 1666 D
3348 1647 D
3348 1633 D
3344 1615 D
3337 1601 D
3330 1590 D
3323 1583 D
S
N
3330 1691 M
3337 1676 D
3341 1666 D
3344 1647 D
3344 1633 D
3341 1615 D
3337 1604 D
3330 1590 D
S
0.00 1.00 0.00 setrgbcolor
2113 1482 P
N
2090 1459 M
2136 1459 D
2136 1505 D
2090 1505 D
2090 1459 D
S
N
2299 1514 M
2299 1439 D
S
N
2303 1514 M
2303 1439 D
S
N
2346 1514 M
2346 1439 D
S
N
2350 1514 M
2350 1439 D
S
N
2288 1514 M
2314 1514 D
S
N
2335 1514 M
2361 1514 D
S
N
2303 1478 M
2346 1478 D
S
N
2288 1439 M
2314 1439 D
S
N
2335 1439 M
2361 1439 D
S
N
2422 1489 M
2422 1414 D
S
N
2425 1489 M
2425 1414 D
S
N
2422 1478 M
2415 1486 D
2407 1489 D
2400 1489 D
2389 1486 D
2382 1478 D
2379 1468 D
2379 1460 D
2382 1450 D
2389 1442 D
2400 1439 D
2407 1439 D
2415 1442 D
2422 1450 D
S
N
2400 1489 M
2393 1486 D
2386 1478 D
2382 1468 D
2382 1460 D
2386 1450 D
2393 1442 D
2400 1439 D
S
N
2411 1414 M
2436 1414 D
S
N
2472 1514 M
2472 1439 D
S
N
2476 1514 M
2476 1439 D
S
N
2451 1514 M
2447 1493 D
2447 1514 D
2501 1514 D
2501 1493 D
2498 1514 D
S
N
2461 1439 M
2487 1439 D
S
N
2606 1529 M
2598 1522 D
2591 1511 D
2584 1496 D
2580 1478 D
2580 1464 D
2584 1446 D
2591 1432 D
2598 1421 D
2606 1414 D
S
N
2598 1522 M
2591 1507 D
2588 1496 D
2584 1478 D
2584 1464 D
2588 1446 D
2591 1435 D
2598 1421 D
S
N
2634 1514 M
2634 1439 D
S
N
2638 1514 M
2681 1446 D
S
N
2638 1507 M
2681 1439 D
S
N
2681 1514 M
2681 1439 D
S
N
2624 1514 M
2638 1514 D
S
N
2671 1514 M
2692 1514 D
S
N
2624 1439 M
2645 1439 D
S
N
2717 1514 M
2717 1439 D
S
N
2721 1514 M
2764 1446 D
S
N
2721 1507 M
2764 1439 D
S
N
2764 1514 M
2764 1439 D
S
N
2707 1514 M
2721 1514 D
S
N
2753 1514 M
2775 1514 D
S
N
2707 1439 M
2728 1439 D
S
N
2800 1514 M
2800 1439 D
S
N
2804 1514 M
2804 1439 D
S
N
2789 1514 M
2815 1514 D
S
N
2789 1439 M
2844 1439 D
2844 1460 D
2840 1439 D
S
N
2865 1514 M
2865 1439 D
S
N
2869 1514 M
2869 1439 D
S
N
2854 1514 M
2880 1514 D
S
N
2854 1439 M
2908 1439 D
2908 1460 D
2905 1439 D
S
N
2988 1489 M
2988 1439 D
S
N
2991 1489 M
2991 1439 D
S
N
2991 1468 M
2995 1478 D
3002 1486 D
3009 1489 D
3020 1489 D
3024 1486 D
3024 1482 D
3020 1478 D
3017 1482 D
3020 1486 D
S
N
2977 1489 M
2991 1489 D
S
N
2977 1439 M
3002 1439 D
S
N
3045 1468 M
3089 1468 D
3089 1475 D
3085 1482 D
3081 1486 D
3074 1489 D
3063 1489 D
3053 1486 D
3045 1478 D
3042 1468 D
3042 1460 D
3045 1450 D
3053 1442 D
3063 1439 D
3071 1439 D
3081 1442 D
3089 1450 D
S
N
3085 1468 M
3085 1478 D
3081 1486 D
S
N
3063 1489 M
3056 1486 D
3049 1478 D
3045 1468 D
3045 1460 D
3049 1450 D
3056 1442 D
3063 1439 D
S
N
3146 1482 M
3150 1489 D
3150 1475 D
3146 1482 D
3143 1486 D
3135 1489 D
3121 1489 D
3114 1486 D
3110 1482 D
3110 1475 D
3114 1471 D
3121 1468 D
3139 1460 D
3146 1457 D
3150 1453 D
S
N
3110 1478 M
3114 1475 D
3121 1471 D
3139 1464 D
3146 1460 D
3150 1457 D
3150 1446 D
3146 1442 D
3139 1439 D
3125 1439 D
3117 1442 D
3114 1446 D
3110 1453 D
3110 1439 D
3114 1446 D
S
N
3179 1489 M
3179 1450 D
3182 1442 D
3193 1439 D
3200 1439 D
3211 1442 D
3218 1450 D
S
N
3182 1489 M
3182 1450 D
3186 1442 D
3193 1439 D
S
N
3218 1489 M
3218 1439 D
S
N
3222 1489 M
3222 1439 D
S
N
3168 1489 M
3182 1489 D
S
N
3208 1489 M
3222 1489 D
S
N
3218 1439 M
3233 1439 D
S
N
3258 1489 M
3258 1439 D
S
N
3262 1489 M
3262 1439 D
S
N
3262 1478 M
3269 1486 D
3280 1489 D
3287 1489 D
3298 1486 D
3301 1478 D
3301 1439 D
S
N
3287 1489 M
3294 1486 D
3298 1478 D
3298 1439 D
S
N
3301 1478 M
3308 1486 D
3319 1489 D
3326 1489 D
3337 1486 D
3341 1478 D
3341 1439 D
S
N
3326 1489 M
3334 1486 D
3337 1478 D
3337 1439 D
S
N
3247 1489 M
3262 1489 D
S
N
3247 1439 M
3272 1439 D
S
N
3287 1439 M
3312 1439 D
S
N
3326 1439 M
3352 1439 D
S
N
3377 1446 M
3373 1442 D
3377 1439 D
3381 1442 D
3377 1446 D
S
N
3406 1529 M
3413 1522 D
3420 1511 D
3427 1496 D
3431 1478 D
3431 1464 D
3427 1446 D
3420 1432 D
3413 1421 D
3406 1414 D
S
N
3413 1522 M
3420 1507 D
3424 1496 D
3427 1478 D
3427 1464 D
3424 1446 D
3420 1435 D
3413 1421 D
S
0.00 0.00 0.00 setrgbcolor
2113 1313 P
N
2090 1290 M
2136 1336 D
S
N
2090 1336 M
2136 1290 D
S
N
2299 1345 M
2299 1270 D
S
N
2303 1345 M
2303 1270 D
S
N
2288 1345 M
2332 1345 D
2343 1342 D
2346 1338 D
2350 1331 D
2350 1320 D
2346 1313 D
2343 1309 D
2332 1306 D
2303 1306 D
S
N
2332 1345 M
2339 1342 D
2343 1338 D
2346 1331 D
2346 1320 D
2343 1313 D
2339 1309 D
2332 1306 D
S
N
2288 1270 M
2314 1270 D
S
N
2397 1345 M
2386 1342 D
2379 1335 D
2375 1327 D
2371 1313 D
2371 1302 D
2375 1288 D
2379 1280 D
2386 1273 D
2397 1270 D
2404 1270 D
2415 1273 D
2422 1280 D
2425 1288 D
2429 1302 D
2429 1313 D
2425 1327 D
2422 1335 D
2415 1342 D
2404 1345 D
2397 1345 D
S
N
2397 1345 M
2389 1342 D
2382 1335 D
2379 1327 D
2375 1313 D
2375 1302 D
2379 1288 D
2382 1280 D
2389 1273 D
2397 1270 D
S
N
2404 1270 M
2411 1273 D
2418 1280 D
2422 1288 D
2425 1302 D
2425 1313 D
2422 1327 D
2418 1335 D
2411 1342 D
2404 1345 D
S
N
2454 1345 M
2469 1270 D
S
N
2458 1345 M
2469 1288 D
S
N
2483 1345 M
2469 1270 D
S
N
2483 1345 M
2498 1270 D
S
N
2487 1345 M
2498 1288 D
S
N
2512 1345 M
2498 1270 D
S
N
2443 1345 M
2469 1345 D
S
N
2501 1345 M
2523 1345 D
S
N
2544 1345 M
2544 1270 D
S
N
2548 1345 M
2548 1270 D
S
N
2591 1345 M
2591 1270 D
S
N
2595 1345 M
2595 1270 D
S
N
2534 1345 M
2559 1345 D
S
N
2580 1345 M
2606 1345 D
S
N
2548 1309 M
2591 1309 D
S
N
2534 1270 M
2559 1270 D
S
N
2580 1270 M
2606 1270 D
S
N
2631 1345 M
2631 1270 D
S
N
2634 1345 M
2634 1270 D
S
N
2656 1324 M
2656 1295 D
S
N
2620 1345 M
2678 1345 D
2678 1324 D
2674 1345 D
S
N
2634 1309 M
2656 1309 D
S
N
2620 1270 M
2678 1270 D
2678 1291 D
2674 1270 D
S
N
2750 1335 M
2753 1324 D
2753 1345 D
2750 1335 D
2743 1342 D
2732 1345 D
2725 1345 D
2714 1342 D
2707 1335 D
2703 1327 D
2699 1317 D
2699 1298 D
2703 1288 D
2707 1280 D
2714 1273 D
2725 1270 D
2732 1270 D
2743 1273 D
2750 1280 D
S
N
2725 1345 M
2717 1342 D
2710 1335 D
2707 1327 D
2703 1317 D
2703 1298 D
2707 1288 D
2710 1280 D
2717 1273 D
2725 1270 D
S
N
2750 1298 M
2750 1270 D
S
N
2753 1298 M
2753 1270 D
S
N
2739 1298 M
2764 1298 D
S
showpage
%%Trailer
%%Pages: 1
%%BoundingBox:
