%!PS-Adobe-2.0 EPSF-2.0
%%BoundingBox: 0 0 680 529
%%Title: plot.eps
%%Creator: HIGZ Version 1.29/04
%%CreationDate: 2010/11/22   17.42
%%EndComments
%%BeginProlog
80 dict begin
/s {stroke} def /l {lineto} def /m {moveto} def /t {translate} def
/sw {stringwidth} def /r {rotate} def /rl {roll}  def /R {repeat} def
/d {rlineto} def /rm {rmoveto} def /gr {grestore} def /f {eofill} def
/c {setrgbcolor} def /lw {setlinewidth} def /sd {setdash} def
/cl {closepath} def /sf {scalefont setfont} def /black {0 setgray} def
/box {m dup 0 exch d exch 0 d 0 exch neg d cl} def
/NC{systemdict begin initclip end}def/C{NC box clip newpath}def
/bl {box s} def /bf {box f} def /Y { 0 exch d} def /X { 0 d} def 
/mp {newpath /y exch def /x exch def} def
/side {[w .77 mul w .23 mul] .385 w mul sd w 0 l currentpoint t -144 r} def
/mr {mp x y w2 0 360 arc} def /m24 {mr s} def /m20 {mr f} def
/mb {mp x y w2 add m w2 neg 0 d 0 w neg d w 0 d 0 w d cl} def
/mt {mp x y w2 add m w2 neg w neg d w 0 d cl} def
/m21 {mb f} def /m25 {mb s} def /m22 {mt f} def /m26  {mt s} def
/m23 {mp x y w2 sub m w2 w d w neg 0 d cl f} def
/m27 {mp x y w2 add m w3 neg w2 neg d w3 w2 neg d w3  w2 d cl s} def
/m28 {mp x w2 sub y w2 sub w3 add m w3 0 d 0 w3 neg d w3 0 d 0 w3 d w3 0 d
 0 w3 d w3 neg 0 d 0 w3 d w3 neg 0 d
 0 w3 neg d w3 neg 0 d cl s } def
/m29 {mp gsave x w2 sub y w2 add w3 sub m currentpoint t
 4 {side} repeat cl fill gr} def
/m30 {mp gsave x w2 sub y w2 add w3 sub m currentpoint t
 5 {side} repeat s gr} def
/m31 {mp x y w2 sub m 0 w d x w2 sub y m w 0 d
 x w2 sub y w2 add m w w neg d x w2 sub y w2
 sub m w w d s} def
/m2 {mp x y w2 sub m 0 w d x w2 sub y m w 0 d s} def
/m5 {mp x w2 sub y w2 sub m w w d x w2 sub y w2 add m w w neg d s} def
/reencdict 24 dict def /ReEncode {reencdict begin /nco&na exch def
/nfnam exch def /basefontname exch def /basefontdict basefontname findfont def
/newfont basefontdict maxlength dict def basefontdict {exch dup /FID ne
{dup /Encoding eq {exch dup length array copy newfont 3 1 roll put} {exch
newfont 3 1 roll put} ifelse} {pop pop} ifelse } forall newfont
/FontName nfnam put nco&na aload pop nco&na length 2 idiv {newfont
/Encoding get 3 1 roll put} repeat nfnam newfont definefont pop end } def
/accvec [ 176 /agrave 181 /Agrave 190 /acircumflex 192 /Acircumflex
201 /adieresis 204 /Adieresis 209 /ccedilla 210 /Ccedilla 211 /eacute
212 /Eacute 213 /egrave 214 /Egrave 215 /ecircumflex 216 /Ecircumflex
217 /edieresis 218 /Edieresis 219 /icircumflex 220 /Icircumflex
221 /idieresis 222 /Idieresis 223 /ntilde 224 /Ntilde 226 /ocircumflex
228 /Ocircumflex 229 /odieresis 230 /Odieresis 231 /ucircumflex 236 /Ucircumflex
237 /udieresis 238 /Udieresis 239 /aring 242 /Aring 243 /ydieresis
244 /Ydieresis 246 /aacute 247 /Aacute 252 /ugrave 253 /Ugrave] def
/Times-Roman /Times-Roman accvec ReEncode
/Times-Italic /Times-Italic accvec ReEncode
/Times-Bold /Times-Bold accvec ReEncode
/Times-BoldItalic /Times-BoldItalic accvec ReEncode
/Helvetica /Helvetica accvec ReEncode
/Helvetica-Oblique /Helvetica-Oblique accvec ReEncode
/Helvetica-Bold /Helvetica-Bold accvec ReEncode
/Helvetica-BoldOblique /Helvetica-BoldOblique  accvec ReEncode
/Courier /Courier accvec ReEncode
/Courier-Oblique /Courier-Oblique accvec ReEncode
/Courier-Bold /Courier-Bold accvec ReEncode
/Courier-BoldOblique /Courier-BoldOblique accvec ReEncode
/oshow {gsave [] 0 sd true charpath stroke gr} def
/stwn { /fs exch def /fn exch def /text exch def fn findfont fs sf
 text sw pop xs add /xs exch def} def
/stwb { /fs exch def /fn exch def /nbas exch def /textf exch def
textf length /tlen exch def nbas tlen gt {/nbas tlen  def} if
fn findfont fs sf textf dup length nbas sub nbas getinterval sw
pop neg xs add /xs exch def} def
/accspe [ 65 /plusminus 66 /bar 67 /existential 68 /universal
69 /exclam 70 /numbersign 71 /greater 72 /question 73 /integral
74 /colon 75 /semicolon 76 /less 77 /bracketleft 78 /bracketright
79 /greaterequal 80 /braceleft 81 /braceright 82 /radical
83 /spade 84 /heart 85 /diamond 86 /club 87 /lessequal
88 /multiply 89 /percent 90 /infinity 48 /circlemultiply 49 /circleplus
50 /emptyset 51 /lozenge 52 /bullet 53 /arrowright 54 /arrowup
55 /arrowleft 56 /arrowdown 57 /arrowboth 48 /degree 44 /comma 43 /plus
 45 /angle 42 /angleleft 47 /divide 61 /notequal 40 /equivalence 41 /second
 97 /approxequal 98 /congruent 99 /perpendicular 100 /partialdiff 101 /florin
 102 /intersection 103 /union 104 /propersuperset 105 /reflexsuperset
 106 /notsubset 107 /propersubset 108 /reflexsubset 109 /element 110 /notelement
 111 /gradient 112 /logicaland 113 /logicalor 114 /arrowdblboth
 115 /arrowdblleft 116 /arrowdblup 117 /arrowdblright 118 /arrowdbldown
 119 /ampersand 120 /omega1 121 /similar 122 /aleph ] def
/Symbol /Special accspe ReEncode
%%EndProlog
%%BeginSetup
newpath  gsave  .25 .25 scale 
%%EndSetup
 gsave 0 0 t black [] 0 sd 1 lw 4 lw 2267 1660 340 340 bl 2720 2114 0 0 C
 gsave  1813 1834
 t   0 r 0 0 m
 /Symbol findfont   77 sf 0    0 m 
(s)
 show 
 currentpoint pop 0 t 
 /Times-Roman findfont   77 sf 0    0 m 
(\(pp\040)
 show 
 currentpoint pop 0 t 
 /Special findfont   77 sf 0    0 m 
(5)
 show 
 currentpoint pop 0 t 
 /Times-Roman findfont   77 sf 0    0 m 
( tt)
 show 
 currentpoint pop 0 t 
/Times-Roman findfont   77 sf 
( tt)
 dup length 1 sub 1 getinterval 
 stringwidth pop 2 div neg    0 rm 
 /Times-Roman findfont   54 sf 0   54 rm 
(_\040)
 stringwidth pop 2 div neg 0 rm 
(_\040)
 show
 /Times-Roman findfont   77 sf 0    0 m 
(H + X\)\040)
 show 
 currentpoint pop 0 t 
 /Special findfont   77 sf 0    0 m 
(M)
 show 
 currentpoint pop 0 t 
 /Times-Roman findfont   77 sf 0    0 m 
(fb)
 show 
 currentpoint pop 0 t 
 /Special findfont   77 sf 0    0 m 
(N)
 show 
 gsave  gr  gr 
 gsave  1813 1718
 t   0 r 0 0 m
 /Symbol findfont   77 sf 0    0 m 
(m)
 show 
 currentpoint pop 0 t 
 /Times-Roman findfont   77 sf 0    0 m 
( = m)
 show 
 currentpoint pop 0 t 
 /Times-Roman findfont   54 sf 0  -26 m 
(t)
 show 
 currentpoint pop 0 t 
 /Times-Roman findfont   77 sf 0    0 m 
( + M)
 show 
 currentpoint pop 0 t 
 /Times-Roman findfont   54 sf 0  -26 m 
(H)
 show 
 currentpoint pop 0 t 
 /Times-Roman findfont   77 sf 0    0 m 
(/2)
 show 
 gr  0 0 1 c
 gsave  988 1646
 t   0 r 0 0 m
 /Special findfont   77 sf 0    0 m 
(R)
 show 
 currentpoint pop 0 t 
 /Times-Roman findfont   77 sf 0    0 m 
(s = 14 TeV)
 show 
 gr  1 0 0 c
 gsave  988 1105
 t   0 r 0 0 m
 /Special findfont   77 sf 0    0 m 
(R)
 show 
 currentpoint pop 0 t 
 /Times-Roman findfont   77 sf 0    0 m 
(s = 7 TeV)
 show 
 gr  black
 /xs 0 def 
(M)
 /Times-Roman     77 stwn 
(H)
 /Times-Roman     54 stwn 
(\040)
 /Times-Roman     77 stwn 
(M)
 /Special     77 stwn 
(GeV)
 /Times-Roman     77 stwn 
(N)
 /Special     77 stwn 
 gsave  1473 124
 t   0 r  xs 2 div neg 0 t 0 0 m
 /Times-Roman findfont   77 sf 0    0 m 
(M)
 show 
 currentpoint pop 0 t 
 /Times-Roman findfont   54 sf 0  -26 m 
(H)
 show 
 currentpoint pop 0 t 
 /Times-Roman findfont   77 sf 0    0 m 
(\040)
 show 
 currentpoint pop 0 t 
 /Special findfont   77 sf 0    0 m 
(M)
 show 
 currentpoint pop 0 t 
 /Times-Roman findfont   77 sf 0    0 m 
(GeV)
 show 
 currentpoint pop 0 t 
 /Special findfont   77 sf 0    0 m 
(N)
 show 
 gr  2267 1660 340 340 C NC 1 lw 340 340 m 1660 Y s 4 lw 357 413 m -17 X s 357
 470 m -17 X s 357 517 m -17 X s 357 556 m -17 X s 357 590 m -17 X s 357 621 m
 -17 X s 374 647 m -34 X s
 /xs 0 def 
(10)
 /Times-Roman     77 stwn 
 gsave  249 622
 t   0 r  xs neg 0 t 0 0 m
 /Times-Roman findfont   77 sf 0    0 m 
(10)
 show 
 gr  357 824 m -17 X s 357 928 m -17 X s 357 1001 m -17 X s 357 1058 m -17 X s
 357 1105 m -17 X s 357 1144 m -17 X s 357 1178 m -17 X s 357 1208 m -17 X s 374
 1235 m -34 X s
 /xs 0 def 
(10)
 /Times-Roman     77 stwn 
 gsave  249 1210
 t   0 r  xs neg 0 t 0 0 m
 /Times-Roman findfont   77 sf 0    0 m 
(10)
 show 
 gr 
 /xs 0 def 
(2)
 /Times-Roman     61 stwn 
 gsave  300 1247
 t   0 r  xs neg 0 t 0 0 m
 /Times-Roman findfont   61 sf 0    0 m 
(2)
 show 
 gr  357 1412 m -17 X s 357 1516 m -17 X s 357 1589 m -17 X s 357 1646 m -17 X s
 357 1693 m -17 X s 357 1732 m -17 X s 357 1766 m -17 X s 357 1796 m -17 X s 374
 1823 m -34 X s
 /xs 0 def 
(10)
 /Times-Roman     77 stwn 
 gsave  249 1798
 t   0 r  xs neg 0 t 0 0 m
 /Times-Roman findfont   77 sf 0    0 m 
(10)
 show 
 gr 
 /xs 0 def 
(3)
 /Times-Roman     61 stwn 
 gsave  300 1835
 t   0 r  xs neg 0 t 0 0 m
 /Times-Roman findfont   61 sf 0    0 m 
(3)
 show 
 gr  1 lw 340 340 m 2267 X s 4 lw 448 374 m -34 Y s 502 357 m -17 Y s 556 357 m
 -17 Y s 610 357 m -17 Y s 664 357 m -17 Y s 718 374 m -34 Y s 772 357 m -17 Y s
 826 357 m -17 Y s 880 357 m -17 Y s 934 357 m -17 Y s 988 374 m -34 Y s 1042
 357 m -17 Y s 1096 357 m -17 Y s 1150 357 m -17 Y s 1203 357 m -17 Y s 1257 374
 m -34 Y s 1311 357 m -17 Y s 1365 357 m -17 Y s 1419 357 m -17 Y s 1473 357 m
 -17 Y s 1527 374 m -34 Y s 1581 357 m -17 Y s 1635 357 m -17 Y s 1689 357 m -17
 Y s 1743 357 m -17 Y s 1797 374 m -34 Y s 1851 357 m -17 Y s 1905 357 m -17 Y s
 1959 357 m -17 Y s 2013 357 m -17 Y s 2067 374 m -34 Y s 2121 357 m -17 Y s
 2175 357 m -17 Y s 2229 357 m -17 Y s 2283 357 m -17 Y s 2337 374 m -34 Y s
 2391 357 m -17 Y s 2445 357 m -17 Y s 2499 357 m -17 Y s 2553 357 m -17 Y s
 2607 374 m -34 Y s 448 374 m -34 Y s 394 357 m -17 Y s
 /xs 0 def 
(100)
 /Times-Roman     77 stwn 
 gsave  448 255
 t   0 r  xs 2 div neg 0 t 0 0 m
 /Times-Roman findfont   77 sf 0    0 m 
(100)
 show 
 gr 
 /xs 0 def 
(125)
 /Times-Roman     77 stwn 
 gsave  718 255
 t   0 r  xs 2 div neg 0 t 0 0 m
 /Times-Roman findfont   77 sf 0    0 m 
(125)
 show 
 gr 
 /xs 0 def 
(150)
 /Times-Roman     77 stwn 
 gsave  988 255
 t   0 r  xs 2 div neg 0 t 0 0 m
 /Times-Roman findfont   77 sf 0    0 m 
(150)
 show 
 gr 
 /xs 0 def 
(175)
 /Times-Roman     77 stwn 
 gsave  1257 255
 t   0 r  xs 2 div neg 0 t 0 0 m
 /Times-Roman findfont   77 sf 0    0 m 
(175)
 show 
 gr 
 /xs 0 def 
(200)
 /Times-Roman     77 stwn 
 gsave  1527 255
 t   0 r  xs 2 div neg 0 t 0 0 m
 /Times-Roman findfont   77 sf 0    0 m 
(200)
 show 
 gr 
 /xs 0 def 
(225)
 /Times-Roman     77 stwn 
 gsave  1797 255
 t   0 r  xs 2 div neg 0 t 0 0 m
 /Times-Roman findfont   77 sf 0    0 m 
(225)
 show 
 gr 
 /xs 0 def 
(250)
 /Times-Roman     77 stwn 
 gsave  2067 255
 t   0 r  xs 2 div neg 0 t 0 0 m
 /Times-Roman findfont   77 sf 0    0 m 
(250)
 show 
 gr 
 /xs 0 def 
(275)
 /Times-Roman     77 stwn 
 gsave  2337 255
 t   0 r  xs 2 div neg 0 t 0 0 m
 /Times-Roman findfont   77 sf 0    0 m 
(275)
 show 
 gr 
 /xs 0 def 
(300)
 /Times-Roman     77 stwn 
 gsave  2607 255
 t   0 r  xs 2 div neg 0 t 0 0 m
 /Times-Roman findfont   77 sf 0    0 m 
(300)
 show 
 gr  2267 1660 340 340 C NC 1 lw 2607 340 m 1660 Y s 4 lw 2590 413 m 17 X s 2590
 470 m 17 X s 2590 517 m 17 X s 2590 556 m 17 X s 2590 590 m 17 X s 2590 621 m
 17 X s 2573 647 m 34 X s 2590 824 m 17 X s 2590 928 m 17 X s 2590 1001 m 17 X s
 2590 1058 m 17 X s 2590 1105 m 17 X s 2590 1144 m 17 X s 2590 1178 m 17 X s
 2590 1208 m 17 X s 2573 1235 m 34 X s 2590 1412 m 17 X s 2590 1516 m 17 X s
 2590 1589 m 17 X s 2590 1646 m 17 X s 2590 1693 m 17 X s 2590 1732 m 17 X s
 2590 1766 m 17 X s 2590 1796 m 17 X s 2573 1823 m 34 X s 1 lw 340 2000 m 2267 X
 s 4 lw 448 1966 m 34 Y s 502 1983 m 17 Y s 556 1983 m 17 Y s 610 1983 m 17 Y s
 664 1983 m 17 Y s 718 1966 m 34 Y s 772 1983 m 17 Y s 826 1983 m 17 Y s 880
 1983 m 17 Y s 934 1983 m 17 Y s 988 1966 m 34 Y s 1042 1983 m 17 Y s 1096 1983
 m 17 Y s 1150 1983 m 17 Y s 1203 1983 m 17 Y s 1257 1966 m 34 Y s 1311 1983 m
 17 Y s 1365 1983 m 17 Y s 1419 1983 m 17 Y s 1473 1983 m 17 Y s 1527 1966 m 34
 Y s 1581 1983 m 17 Y s 1635 1983 m 17 Y s 1689 1983 m 17 Y s 1743 1983 m 17 Y s
 1797 1966 m 34 Y s 1851 1983 m 17 Y s 1905 1983 m 17 Y s 1959 1983 m 17 Y s
 2013 1983 m 17 Y s 2067 1966 m 34 Y s 2121 1983 m 17 Y s 2175 1983 m 17 Y s
 2229 1983 m 17 Y s 2283 1983 m 17 Y s 2337 1966 m 34 Y s 2391 1983 m 17 Y s
 2445 1983 m 17 Y s 2499 1983 m 17 Y s 2553 1983 m 17 Y s 2607 1966 m 34 Y s 448
 1966 m 34 Y s 394 1983 m 17 Y s 2267 1660 340 340 C 2720 2720 0 -303 C 1 lw 1 0
 0 c 2602 500 m 5 -6 d s 2586 503 m 21 -20 d s 2571 507 m 36 -36 d s 2556 511 m
 51 -51 d s 2541 514 m 66 -66 d s 2526 518 m 81 -81 d s 2510 521 m 97 -96 d s
 2495 525 m 112 -111 d s 2480 529 m 111 -111 d s 2464 533 m 111 -111 d s 2449
 537 m 111 -111 d s 2433 541 m 111 -111 d s 2418 545 m 110 -110 d s 2403 548 m
 109 -109 d s 2387 552 m 109 -109 d s 2371 557 m 109 -109 d s 2356 561 m 108
 -109 d s 2340 565 m 108 -108 d s 2324 569 m 108 -108 d s 2309 573 m 107 -107 d
 s 2293 577 m 107 -107 d s 2277 582 m 107 -107 d s 2261 586 m 107 -107 d s 2245
 591 m 107 -107 d s 2229 595 m 106 -106 d s 2213 600 m 106 -106 d s 2197 604 m
 106 -106 d s 2181 609 m 105 -106 d s 2165 613 m 105 -105 d s 2148 618 m 105
 -105 d s 2132 623 m 105 -105 d s 2116 628 m 104 -105 d s 2099 633 m 104 -105 d
 s 2083 637 m 104 -103 d s 2067 642 m 103 -103 d s 2050 647 m 103 -103 d s 2033
 653 m 103 -103 d s 2016 658 m 103 -103 d s 2000 663 m 102 -103 d s 1983 668 m
 102 -102 d s 1966 673 m 102 -102 d s 1949 679 m 102 -102 d s 1932 685 m 102
 -102 d s 1915 690 m 102 -102 d s 1897 696 m 102 -102 d s 1880 702 m 102 -102 d
 s 1863 707 m 102 -101 d s 1846 713 m 101 -101 d s 1828 719 m 101 -101 d s 1810
 725 m 102 -101 d s 1793 731 m 101 -101 d s 1775 738 m 101 -102 d s 1757 744 m
 102 -102 d s 1740 750 m 101 -101 d s 1721 757 m 101 -101 d s 1703 763 m 101
 -101 d s 1685 770 m 101 -101 d s 1667 777 m 101 -102 d s 1649 783 m 101 -101 d
 s 1630 790 m 101 -101 d s 1611 797 m 101 -101 d s 1593 804 m 101 -101 d s 1574
 812 m 101 -101 d s 1555 819 m 101 -101 d s 1536 826 m 102 -101 d s 1517 834 m
 102 -101 d s 1498 841 m 101 -101 d s 1479 849 m 101 -101 d s 1459 857 m 102
 -101 d s 1440 865 m 101 -102 d s 1420 873 m 102 -102 d s 1400 882 m 102 -103 d
 s 1380 890 m 103 -102 d s 1360 899 m 103 -103 d s 1340 907 m 103 -103 d s 1319
 916 m 104 -103 d s 1299 925 m 103 -103 d s 1278 935 m 104 -104 d s 1257 944 m
 104 -104 d s 1236 953 m 105 -104 d s 1215 963 m 105 -105 d s 1194 973 m 105
 -106 d s 1172 983 m 106 -106 d s 1150 993 m 107 -106 d s 1128 1004 m 107 -107 d
 s 1106 1014 m 107 -107 d s 1084 1025 m 108 -108 d s 1061 1036 m 109 -109 d s
 1039 1047 m 109 -109 d s 1015 1059 m 110 -110 d s 992 1070 m 111 -110 d s 969
 1082 m 111 -111 d s 945 1095 m 112 -113 d s 921 1107 m 113 -113 d s 896 1120 m
 115 -114 d s 871 1133 m 116 -115 d s 846 1147 m 117 -117 d s 821 1161 m 118
 -118 d s 795 1175 m 120 -119 d s 769 1190 m 121 -121 d s 742 1205 m 123 -123 d
 s 716 1220 m 124 -124 d s 688 1236 m 126 -126 d s 661 1252 m 127 -128 d s 632
 1269 m 130 -130 d s 604 1286 m 132 -132 d s 574 1304 m 135 -135 d s 545 1322 m
 136 -137 d s 514 1341 m 140 -140 d s 483 1360 m 142 -142 d s 451 1381 m 146
 -146 d s 418 1402 m 149 -149 d s 384 1424 m 153 -153 d s 349 1448 m 158 -158 d
 s 340 1446 m 136 -136 d s 340 1434 m 104 -104 d s 340 1422 m 71 -71 d s 340
 1411 m 37 -37 d s 340 1399 m 3 -2 d s 2267 1660 340 340 C 4 lw 340 1398 m 54
 -35 d 54 -36 d 54 -34 d 54 -33 d 54 -33 d 54 -32 d 54 -31 d 54 -31 d 54 -30 d
 54 -29 d 54 -29 d 54 -28 d 54 -27 d 54 -27 d 54 -26 d 53 -26 d 54 -25 d 54 -24
 d 54 -24 d 54 -24 d 54 -23 d 54 -22 d 108 -43 d 108 -42 d 108 -39 d 108 -37 d
 108 -36 d 108 -35 d 108 -33 d 108 -31 d 108 -31 d 108 -29 d 85 Y -108 26 d -108
 27 d -108 29 d -108 30 d -108 32 d -108 34 d -108 35 d -108 38 d -108 39 d -108
 42 d -54 21 d -54 23 d -54 22 d -54 24 d -54 24 d -54 24 d -53 25 d -54 26 d
 -54 27 d -54 27 d -54 27 d -54 29 d -54 29 d -54 30 d -54 31 d -54 31 d -54 32
 d -54 33 d -54 33 d -54 35 d -54 35 d -54 36 d s 2720 2720 0 -303 C 1 lw 0 0 1
 c 2607 1023 m -4 -4 d s 2607 1034 m -13 -13 d s 2607 1046 m -23 -23 d s 2607
 1057 m -32 -32 d s 2607 1069 m -42 -42 d s 2607 1080 m -52 -51 d s 2607 1092 m
 -61 -61 d s 2602 1098 m -66 -65 d s 2592 1100 m -65 -65 d s 2582 1102 m -65 -65
 d s 2573 1104 m -65 -65 d s 2563 1106 m -65 -65 d s 2553 1108 m -65 -65 d s
 2544 1109 m -65 -64 d s 2534 1111 m -65 -64 d s 2524 1113 m -64 -64 d s 2514
 1115 m -64 -64 d s 2505 1117 m -64 -64 d s 2495 1119 m -64 -64 d s 2485 1121 m
 -63 -64 d s 2476 1123 m -64 -64 d s 2466 1124 m -63 -63 d s 2457 1126 m -64 -63
 d s 2447 1128 m -63 -63 d s 2437 1130 m -62 -62 d s 2428 1132 m -63 -62 d s
 2418 1134 m -62 -62 d s 2409 1136 m -63 -62 d s 2399 1138 m -62 -62 d s 2389
 1140 m -61 -62 d s 2380 1142 m -62 -62 d s 2370 1144 m -61 -61 d s 2361 1146 m
 -62 -61 d s 2351 1148 m -61 -61 d s 2342 1150 m -61 -61 d s 2332 1152 m -61 -61
 d s 2323 1154 m -61 -61 d s 2313 1156 m -60 -60 d s 2304 1158 m -61 -60 d s
 2294 1160 m -60 -60 d s 2285 1162 m -60 -60 d s 2275 1164 m -59 -59 d s 2266
 1166 m -60 -59 d s 2256 1168 m -59 -59 d s 2247 1171 m -59 -60 d s 2238 1173 m
 -60 -59 d s 2228 1175 m -59 -59 d s 2219 1177 m -59 -59 d s 2209 1179 m -58 -58
 d s 2200 1181 m -58 -58 d s 2190 1183 m -58 -58 d s 2181 1185 m -58 -57 d s
 2172 1188 m -58 -58 d s 2162 1190 m -57 -58 d s 2153 1192 m -57 -57 d s 2144
 1194 m -58 -57 d s 2134 1197 m -57 -58 d s 2125 1199 m -57 -57 d s 2116 1201 m
 -57 -57 d s 2107 1203 m -57 -56 d s 2097 1206 m -56 -57 d s 2088 1208 m -56 -57
 d s 2079 1210 m -56 -56 d s 2069 1212 m -56 -56 d s 2060 1215 m -56 -56 d s
 2051 1217 m -56 -56 d s 2042 1219 m -56 -55 d s 2033 1222 m -56 -56 d s 2023
 1224 m -55 -55 d s 2014 1226 m -55 -55 d s 2005 1229 m -55 -55 d s 1996 1231 m
 -55 -55 d s 1987 1233 m -55 -54 d s 1977 1236 m -54 -55 d s 1968 1238 m -54 -54
 d s 1959 1240 m -54 -53 d s 1950 1243 m -54 -54 d s 1941 1245 m -54 -53 d s
 1932 1248 m -54 -54 d s 1923 1250 m -54 -53 d s 1914 1253 m -54 -54 d s 1905
 1255 m -54 -53 d s 1896 1258 m -54 -53 d s 1887 1260 m -53 -53 d s 1878 1263 m
 -53 -53 d s 1869 1265 m -53 -52 d s 1860 1268 m -53 -53 d s 1851 1270 m -53 -52
 d s 1842 1273 m -53 -52 d s 1833 1276 m -53 -53 d s 1824 1278 m -52 -52 d s
 1815 1281 m -52 -52 d s 1806 1284 m -52 -52 d s 1797 1286 m -52 -52 d s 1788
 1289 m -52 -52 d s 1779 1291 m -51 -51 d s 1770 1294 m -51 -51 d s 1761 1297 m
 -51 -52 d s 1752 1299 m -50 -51 d s 1743 1302 m -50 -51 d s 1735 1305 m -51 -51
 d s 1726 1307 m -51 -50 d s 1717 1310 m -50 -50 d s 1708 1313 m -50 -51 d s
 1700 1316 m -51 -51 d s 1691 1318 m -50 -50 d s 1682 1321 m -50 -50 d s 1673
 1324 m -50 -50 d s 1664 1327 m -49 -50 d s 1656 1329 m -50 -49 d s 1647 1332 m
 -49 -49 d s 1638 1335 m -49 -49 d s 1629 1338 m -49 -49 d s 1621 1341 m -49 -49
 d s 1612 1343 m -49 -48 d s 1603 1346 m -48 -48 d s 1595 1349 m -49 -48 d s
 1586 1352 m -49 -49 d s 1577 1355 m -48 -49 d s 1569 1358 m -49 -49 d s 1560
 1361 m -48 -48 d s 1551 1364 m -48 -48 d s 1543 1367 m -48 -48 d s 1534 1369 m
 -48 -47 d s 1526 1372 m -48 -47 d s 1517 1375 m -48 -47 d s 1508 1378 m -47 -47
 d s 1500 1381 m -47 -47 d s 1491 1384 m -47 -47 d s 1483 1387 m -47 -47 d s
 1474 1390 m -47 -47 d s 1466 1393 m -47 -46 d s 1457 1396 m -46 -46 d s 1449
 1399 m -47 -46 d s 1440 1403 m -46 -47 d s 1432 1406 m -47 -47 d s 1423 1409 m
 -46 -47 d s 1415 1412 m -46 -46 d s 1407 1415 m -47 -46 d s 1398 1418 m -46 -46
 d s 1390 1421 m -46 -46 d s 1381 1424 m -45 -45 d s 1373 1427 m -46 -45 d s
 1364 1431 m -45 -46 d s 1356 1434 m -45 -46 d s 1348 1437 m -46 -45 d s 1339
 1440 m -45 -45 d s 1331 1443 m -45 -45 d s 1323 1447 m -45 -45 d s 1315 1450 m
 -45 -45 d s 1306 1453 m -45 -45 d s 1298 1456 m -45 -44 d s 1290 1460 m -45 -45
 d s 1281 1463 m -44 -45 d s 1273 1466 m -44 -44 d s 1265 1470 m -44 -45 d s
 1257 1473 m -45 -44 d s 1249 1476 m -45 -44 d s 1240 1480 m -44 -45 d s 1232
 1483 m -44 -44 d s 1224 1486 m -44 -43 d s 1216 1490 m -44 -44 d s 1208 1493 m
 -44 -43 d s 1200 1496 m -44 -43 d s 1191 1500 m -43 -43 d s 1183 1503 m -43 -43
 d s 1175 1506 m -43 -42 d s 1167 1510 m -43 -43 d s 1158 1513 m -42 -42 d s
 1150 1516 m -42 -42 d s 1142 1520 m -42 -42 d s 1134 1523 m -42 -42 d s 1126
 1527 m -42 -42 d s 1118 1530 m -42 -41 d s 1110 1534 m -42 -42 d s 1102 1537 m
 -42 -41 d s 1094 1541 m -42 -42 d s 1086 1544 m -42 -41 d s 1078 1548 m -41 -41
 d s 1070 1551 m -41 -41 d s 1062 1555 m -41 -41 d s 1054 1559 m -41 -42 d s
 1046 1562 m -41 -41 d s 1038 1566 m -41 -41 d s 1030 1569 m -41 -41 d s 1022
 1573 m -41 -41 d s 1014 1577 m -40 -41 d s 1006 1580 m -40 -40 d s 998 1584 m
 -40 -41 d s 991 1587 m -41 -40 d s 983 1591 m -41 -40 d s 975 1595 m -41 -40 d
 s 967 1599 m -40 -41 d s 959 1602 m -40 -40 d s 951 1606 m -40 -40 d s 943 1610
 m -40 -40 d s 936 1613 m -40 -40 d s 928 1617 m -40 -40 d s 920 1621 m -40 -40
 d s 912 1625 m -39 -40 d s 905 1628 m -40 -39 d s 897 1632 m -40 -39 d s 889
 1636 m -40 -40 d s 881 1640 m -39 -40 d s 873 1644 m -39 -40 d s 866 1647 m -40
 -39 d s 858 1651 m -39 -39 d s 850 1655 m -39 -39 d s 843 1659 m -40 -39 d s
 835 1663 m -39 -39 d s 827 1667 m -39 -39 d s 820 1670 m -39 -39 d s 812 1674 m
 -39 -39 d s 804 1678 m -39 -39 d s 797 1682 m -39 -39 d s 789 1686 m -39 -39 d
 s 781 1690 m -38 -39 d s 774 1694 m -39 -39 d s 766 1698 m -38 -39 d s 759 1702
 m -39 -39 d s 751 1706 m -38 -39 d s 743 1710 m -38 -39 d s 736 1714 m -38 -39
 d s 728 1718 m -38 -39 d s 721 1722 m -38 -39 d s 713 1726 m -38 -38 d s 706
 1730 m -38 -38 d s 698 1734 m -38 -38 d s 691 1738 m -38 -38 d s 683 1742 m -38
 -38 d s 676 1746 m -38 -38 d s 668 1750 m -37 -38 d s 661 1754 m -38 -38 d s
 653 1758 m -37 -38 d s 646 1762 m -38 -37 d s 638 1766 m -37 -37 d s 631 1770 m
 -37 -37 d s 624 1774 m -38 -37 d s 616 1779 m -37 -38 d s 609 1783 m -38 -38 d
 s 601 1787 m -37 -37 d s 594 1791 m -37 -37 d s 587 1795 m -38 -37 d s 579 1799
 m -37 -37 d s 572 1804 m -37 -37 d s 565 1808 m -37 -37 d s 557 1812 m -37 -37
 d s 550 1816 m -37 -37 d s 543 1820 m -37 -36 d s 535 1825 m -36 -37 d s 528
 1829 m -37 -37 d s 521 1833 m -37 -36 d s 513 1837 m -36 -36 d s 506 1842 m -36
 -37 d s 499 1846 m -37 -37 d s 492 1850 m -37 -36 d s 484 1855 m -36 -37 d s
 477 1859 m -36 -37 d s 470 1863 m -36 -36 d s 463 1867 m -36 -36 d s 455 1872 m
 -36 -36 d s 448 1876 m -36 -36 d s 441 1880 m -36 -36 d s 434 1885 m -36 -36 d
 s 427 1889 m -36 -36 d s 420 1894 m -36 -36 d s 413 1898 m -36 -36 d s 405 1902
 m -35 -35 d s 398 1907 m -35 -36 d s 391 1911 m -36 -35 d s 384 1916 m -36 -36
 d s 377 1920 m -36 -35 d s 370 1925 m -30 -30 d s 363 1929 m -23 -23 d s 356
 1934 m -16 -16 d s 349 1938 m -9 -9 d s 342 1943 m -2 -2 d s 2267 1660 340 340
 C 4 lw 340 1885 m 54 -34 d 54 -33 d 54 -32 d 54 -32 d 54 -30 d 54 -30 d 54 -30
 d 54 -28 d 54 -28 d 54 -27 d 54 -26 d 54 -26 d 54 -25 d 54 -24 d 54 -24 d 53
 -24 d 54 -22 d 54 -22 d 54 -21 d 54 -21 d 54 -20 d 54 -19 d 108 -37 d 108 -35 d
 108 -33 d 108 -31 d 108 -29 d 108 -28 d 108 -26 d 108 -24 d 108 -23 d 108 -22 d
 78 Y -108 21 d -108 22 d -108 22 d -108 25 d -108 26 d -108 28 d -108 29 d -108
 32 d -108 34 d -108 36 d -54 19 d -54 19 d -54 20 d -54 21 d -54 22 d -54 22 d
 -53 22 d -54 23 d -54 24 d -54 25 d -54 25 d -54 26 d -54 27 d -54 28 d -54 28
 d -54 29 d -54 30 d -54 31 d -54 31 d -54 32 d -54 33 d -54 35 d s
 gr  gr 
showpage
end
%%EOF
