%!PS-Adobe-1.0
%%Creator: Unified Graphics System
%%Pages: (atend)
%%DocumentFonts: Helvetica
%%BoundingBox:  123   69  562  403
%%EndComments
/Sw{setlinewidth}def
/Sg{setgray}def
/Sd{setdash}def
/P {newpath
    moveto
0 0 rlineto
    stroke}def
/M {moveto}def
/D {lineto}def
/N {newpath}def
/S {stroke}def
/T {/Helvetica findfont
    exch
    scalefont
    setfont}def
/R {rotate}def
/W {show}def
/F {fill}def
/X {gsave}def
/Y {grestore}def
%%EndProlog
%%Page: 1 1
0.12000 0.12000 scale
1 setlinecap
1 setlinejoin
8 Sw
0.00 0.00 0.00 setrgbcolor
[] 0 Sd
N
2559 707 M
2559 616 D
S
N
2564 707 M
2564 616 D
S
N
2564 694 M
2572 702 D
2581 707 D
2590 707 D
2603 702 D
2611 694 D
2616 681 D
2616 672 D
2611 659 D
2603 650 D
2590 646 D
2581 646 D
2572 650 D
2564 659 D
S
N
2590 707 M
2598 702 D
2607 694 D
2611 681 D
2611 672 D
2607 659 D
2598 650 D
2590 646 D
S
N
2546 707 M
2564 707 D
S
N
2546 616 M
2577 616 D
S
N
2660 672 M
2660 611 D
S
N
2663 672 M
2663 611 D
S
N
2643 672 M
2640 655 D
2640 672 D
2683 672 D
2683 655 D
2680 672 D
S
N
2652 611 M
2672 611 D
S
N
2649 776 M
2649 715 D
S
N
2652 776 M
2652 715 D
S
N
2686 776 M
2686 715 D
S
N
2689 776 M
2689 715 D
S
N
2640 776 M
2660 776 D
S
N
2678 776 M
2698 776 D
S
N
2652 747 M
2686 747 D
S
N
2640 715 M
2660 715 D
S
N
2678 715 M
2698 715 D
S
N
2796 754 M
2796 616 D
S
N
2800 754 M
2800 616 D
S
N
2796 754 M
2826 754 D
S
N
2796 616 M
2826 616 D
S
N
2913 724 M
2917 711 D
2917 737 D
2913 724 D
2904 733 D
2891 737 D
2882 737 D
2869 733 D
2861 724 D
2856 715 D
2852 702 D
2852 681 D
2856 668 D
2861 659 D
2869 650 D
2882 646 D
2891 646 D
2904 650 D
2913 659 D
S
N
2882 737 M
2874 733 D
2865 724 D
2861 715 D
2856 702 D
2856 681 D
2861 668 D
2865 659 D
2874 650 D
2882 646 D
S
N
2913 681 M
2913 646 D
S
N
2917 681 M
2917 646 D
S
N
2900 681 M
2930 681 D
S
N
2956 681 M
3008 681 D
3008 689 D
3003 698 D
2999 702 D
2990 707 D
2977 707 D
2964 702 D
2956 694 D
2952 681 D
2952 672 D
2956 659 D
2964 650 D
2977 646 D
2986 646 D
2999 650 D
3008 659 D
S
N
3003 681 M
3003 694 D
2999 702 D
S
N
2977 707 M
2969 702 D
2960 694 D
2956 681 D
2956 672 D
2960 659 D
2969 650 D
2977 646 D
S
N
3034 737 M
3064 646 D
S
N
3038 737 M
3064 659 D
S
N
3094 737 M
3064 646 D
S
N
3025 737 M
3051 737 D
S
N
3077 737 M
3103 737 D
S
N
3146 754 M
3146 616 D
S
N
3150 754 M
3150 616 D
S
N
3120 754 M
3150 754 D
S
N
3120 616 M
3150 616 D
S
N
4622 2675 M
4531 2675 D
S
N
4622 2671 M
4531 2671 D
S
N
4578 2675 M
4587 2684 D
4591 2692 D
4591 2701 D
4587 2714 D
4578 2723 D
4565 2727 D
4557 2727 D
4544 2723 D
4535 2714 D
4531 2701 D
4531 2692 D
4535 2684 D
4544 2675 D
S
N
4591 2701 M
4587 2710 D
4578 2718 D
4565 2723 D
4557 2723 D
4544 2718 D
4535 2710 D
4531 2701 D
S
N
4622 2688 M
4622 2671 D
S
N
4531 2675 M
4531 2658 D
S
N
4591 2567 M
4591 2610 D
4587 2623 D
4574 2632 D
4561 2636 D
4548 2636 D
4540 2632 D
4535 2627 D
4531 2619 D
4531 2610 D
4535 2597 D
4548 2589 D
4561 2584 D
4574 2584 D
4583 2589 D
4587 2593 D
4591 2601 D
S
N
4591 2610 M
4587 2619 D
4574 2627 D
4561 2632 D
4544 2632 D
4535 2627 D
S
N
4531 2610 M
4535 2601 D
4548 2593 D
4561 2589 D
4578 2589 D
4587 2593 D
S
N
4587 2593 M
4587 2567 D
S
N
4639 2472 M
4501 2550 D
S
N
4622 2398 M
4531 2398 D
S
N
4622 2394 M
4531 2394 D
S
N
4578 2398 M
4587 2407 D
4591 2416 D
4591 2424 D
4587 2437 D
4578 2446 D
4565 2450 D
4557 2450 D
4544 2446 D
4535 2437 D
4531 2424 D
4531 2416 D
4535 2407 D
4544 2398 D
S
N
4591 2424 M
4587 2433 D
4578 2441 D
4565 2446 D
4557 2446 D
4544 2441 D
4535 2433 D
4531 2424 D
S
N
4622 2411 M
4622 2394 D
S
N
4531 2398 M
4531 2381 D
S
N
4591 2351 M
4501 2351 D
S
N
4591 2346 M
4501 2346 D
S
N
4578 2346 M
4587 2338 D
4591 2329 D
4591 2320 D
4587 2307 D
4578 2299 D
4565 2294 D
4557 2294 D
4544 2299 D
4535 2307 D
4531 2320 D
4531 2329 D
4535 2338 D
4544 2346 D
S
N
4591 2320 M
4587 2312 D
4578 2303 D
4565 2299 D
4557 2299 D
4544 2303 D
4535 2312 D
4531 2320 D
S
N
4591 2364 M
4591 2346 D
S
N
4501 2364 M
4501 2333 D
S
N
4557 2250 M
4496 2250 D
S
N
4557 2247 M
4496 2247 D
S
N
4557 2267 M
4540 2270 D
4557 2270 D
4557 2227 D
4540 2227 D
4557 2230 D
S
N
4496 2258 M
4496 2238 D
S
N
4661 2261 M
4600 2261 D
S
N
4661 2258 M
4600 2258 D
S
N
4661 2224 M
4600 2224 D
S
N
4661 2221 M
4600 2221 D
S
N
4661 2270 M
4661 2250 D
S
N
4661 2232 M
4661 2212 D
S
N
4632 2258 M
4632 2224 D
S
N
4600 2270 M
4600 2250 D
S
N
4600 2232 M
4600 2212 D
S
N
4639 2114 M
4501 2114 D
S
N
4639 2110 M
4501 2110 D
S
N
4639 2114 M
4639 2084 D
S
N
4501 2114 M
4501 2084 D
S
N
4591 2049 M
4501 2049 D
S
N
4591 2045 M
4501 2045 D
S
N
4578 2045 M
4587 2036 D
4591 2028 D
4591 2019 D
4587 2006 D
4578 1997 D
4565 1993 D
4557 1993 D
4544 1997 D
4535 2006 D
4531 2019 D
4531 2028 D
4535 2036 D
4544 2045 D
S
N
4591 2019 M
4587 2010 D
4578 2002 D
4565 1997 D
4557 1997 D
4544 2002 D
4535 2010 D
4531 2019 D
S
N
4591 2062 M
4591 2045 D
S
N
4501 2062 M
4501 2032 D
S
N
4622 1958 M
4531 1958 D
S
N
4622 1954 M
4531 1954 D
S
N
4578 1954 M
4587 1946 D
4591 1937 D
4591 1928 D
4587 1915 D
4578 1907 D
4565 1902 D
4557 1902 D
4544 1907 D
4535 1915 D
4531 1928 D
4531 1937 D
4535 1946 D
4544 1954 D
S
N
4591 1928 M
4587 1920 D
4578 1911 D
4565 1907 D
4557 1907 D
4544 1911 D
4535 1920 D
4531 1928 D
S
N
4622 1971 M
4622 1954 D
S
N
4639 1803 M
4501 1881 D
S
N
4609 1721 M
4596 1716 D
4622 1716 D
4609 1721 D
4617 1729 D
4622 1742 D
4622 1751 D
4617 1764 D
4609 1773 D
4600 1777 D
4587 1781 D
4565 1781 D
4552 1777 D
4544 1773 D
4535 1764 D
4531 1751 D
4531 1742 D
4535 1729 D
4544 1721 D
S
N
4622 1751 M
4617 1760 D
4609 1768 D
4600 1773 D
4587 1777 D
4565 1777 D
4552 1773 D
4544 1768 D
4535 1760 D
4531 1751 D
S
N
4565 1721 M
4531 1721 D
S
N
4565 1716 M
4531 1716 D
S
N
4565 1734 M
4565 1703 D
S
N
4565 1677 M
4565 1625 D
4574 1625 D
4583 1630 D
4587 1634 D
4591 1643 D
4591 1656 D
4587 1669 D
4578 1677 D
4565 1682 D
4557 1682 D
4544 1677 D
4535 1669 D
4531 1656 D
4531 1647 D
4535 1634 D
4544 1625 D
S
N
4565 1630 M
4578 1630 D
4587 1634 D
S
N
4591 1656 M
4587 1664 D
4578 1673 D
4565 1677 D
4557 1677 D
4544 1673 D
4535 1664 D
4531 1656 D
S
N
4622 1600 M
4531 1569 D
S
N
4622 1595 M
4544 1569 D
S
N
4622 1539 M
4531 1569 D
S
N
4622 1608 M
4622 1582 D
S
N
4622 1556 M
4622 1530 D
S
N
4639 1487 M
4501 1487 D
S
N
4639 1483 M
4501 1483 D
S
N
4639 1513 M
4639 1483 D
S
N
4501 1513 M
4501 1483 D
S
1.00 0.00 0.00 setrgbcolor
N
1268 3300 M
1268 975 D
S
N
1268 975 M
4437 975 D
S
N
4437 975 M
4437 3300 D
S
N
4437 3300 M
1268 3300 D
S
2113 1905 P
N
2090 1905 M
2102 1905 D
2113 1916 D
S
N
2113 1928 M
2113 1916 D
2125 1905 D
S
N
2136 1905 M
2125 1905 D
2113 1893 D
S
N
2113 1882 M
2113 1893 D
2102 1905 D
S
N
1268 975 M
1268 1079 D
S
N
1374 1009 M
1374 975 D
S
N
1479 975 M
1479 1009 D
S
N
1585 1009 M
1585 975 D
S
N
1691 975 M
1691 1009 D
S
N
1796 1079 M
1796 975 D
S
N
1902 975 M
1902 1009 D
S
N
2008 1009 M
2008 975 D
S
N
2113 975 M
2113 1009 D
S
N
2219 1009 M
2219 975 D
S
N
2325 975 M
2325 1079 D
S
N
2430 1009 M
2430 975 D
S
N
2536 975 M
2536 1009 D
S
N
2641 1009 M
2641 975 D
S
N
2747 975 M
2747 1009 D
S
N
2853 1079 M
2853 975 D
S
N
2958 975 M
2958 1009 D
S
N
3064 1009 M
3064 975 D
S
N
3170 975 M
3170 1009 D
S
N
3275 1009 M
3275 975 D
S
N
3381 975 M
3381 1079 D
S
N
3487 1009 M
3487 975 D
S
N
3592 975 M
3592 1009 D
S
N
3698 1009 M
3698 975 D
S
N
3804 975 M
3804 1009 D
S
N
3909 1079 M
3909 975 D
S
N
4015 975 M
4015 1009 D
S
N
4120 1009 M
4120 975 D
S
N
4226 975 M
4226 1009 D
S
N
4332 1009 M
4332 975 D
S
N
4437 975 M
4437 1079 D
S
N
1264 903 M
1254 900 D
1246 889 D
1243 871 D
1243 860 D
1246 842 D
1254 831 D
1264 828 D
1272 828 D
1282 831 D
1290 842 D
1293 860 D
1293 871 D
1290 889 D
1282 900 D
1272 903 D
1264 903 D
S
N
1264 903 M
1257 900 D
1254 896 D
1250 889 D
1246 871 D
1246 860 D
1250 842 D
1254 835 D
1257 831 D
1264 828 D
S
N
1272 828 M
1279 831 D
1282 835 D
1286 842 D
1290 860 D
1290 871 D
1286 889 D
1282 896 D
1279 900 D
1272 903 D
S
N
1778 903 M
1771 867 D
S
N
1771 867 M
1778 875 D
1789 878 D
1800 878 D
1811 875 D
1818 867 D
1822 856 D
1822 849 D
1818 838 D
1811 831 D
1800 828 D
1789 828 D
1778 831 D
1775 835 D
1771 842 D
1771 846 D
1775 849 D
1778 846 D
1775 842 D
S
N
1800 878 M
1807 875 D
1814 867 D
1818 856 D
1818 849 D
1814 838 D
1807 831 D
1800 828 D
S
N
1778 903 M
1814 903 D
S
N
1778 900 M
1796 900 D
1814 903 D
S
N
2274 889 M
2281 893 D
2292 903 D
2292 828 D
S
N
2288 900 M
2288 828 D
S
N
2274 828 M
2307 828 D
S
N
2357 903 M
2346 900 D
2339 889 D
2335 871 D
2335 860 D
2339 842 D
2346 831 D
2357 828 D
2364 828 D
2375 831 D
2382 842 D
2386 860 D
2386 871 D
2382 889 D
2375 900 D
2364 903 D
2357 903 D
S
N
2357 903 M
2350 900 D
2346 896 D
2343 889 D
2339 871 D
2339 860 D
2343 842 D
2346 835 D
2350 831 D
2357 828 D
S
N
2364 828 M
2371 831 D
2375 835 D
2379 842 D
2382 860 D
2382 871 D
2379 889 D
2375 896 D
2371 900 D
2364 903 D
S
N
2802 889 M
2809 893 D
2820 903 D
2820 828 D
S
N
2817 900 M
2817 828 D
S
N
2802 828 M
2835 828 D
S
N
2871 903 M
2864 867 D
S
N
2864 867 M
2871 875 D
2882 878 D
2892 878 D
2903 875 D
2910 867 D
2914 856 D
2914 849 D
2910 838 D
2903 831 D
2892 828 D
2882 828 D
2871 831 D
2867 835 D
2864 842 D
2864 846 D
2867 849 D
2871 846 D
2867 842 D
S
N
2892 878 M
2900 875 D
2907 867 D
2910 856 D
2910 849 D
2907 838 D
2900 831 D
2892 828 D
S
N
2871 903 M
2907 903 D
S
N
2871 900 M
2889 900 D
2907 903 D
S
N
3323 889 M
3327 885 D
3323 882 D
3320 885 D
3320 889 D
3323 896 D
3327 900 D
3338 903 D
3352 903 D
3363 900 D
3367 896 D
3370 889 D
3370 882 D
3367 875 D
3356 867 D
3338 860 D
3331 856 D
3323 849 D
3320 838 D
3320 828 D
S
N
3352 903 M
3359 900 D
3363 896 D
3367 889 D
3367 882 D
3363 875 D
3352 867 D
3338 860 D
S
N
3320 835 M
3323 838 D
3331 838 D
3349 831 D
3359 831 D
3367 835 D
3370 838 D
S
N
3331 838 M
3349 828 D
3363 828 D
3367 831 D
3370 838 D
3370 846 D
S
N
3413 903 M
3403 900 D
3395 889 D
3392 871 D
3392 860 D
3395 842 D
3403 831 D
3413 828 D
3421 828 D
3431 831 D
3439 842 D
3442 860 D
3442 871 D
3439 889 D
3431 900 D
3421 903 D
3413 903 D
S
N
3413 903 M
3406 900 D
3403 896 D
3399 889 D
3395 871 D
3395 860 D
3399 842 D
3403 835 D
3406 831 D
3413 828 D
S
N
3421 828 M
3428 831 D
3431 835 D
3435 842 D
3439 860 D
3439 871 D
3435 889 D
3431 896 D
3428 900 D
3421 903 D
S
N
3852 889 M
3855 885 D
3852 882 D
3848 885 D
3848 889 D
3852 896 D
3855 900 D
3866 903 D
3880 903 D
3891 900 D
3895 896 D
3898 889 D
3898 882 D
3895 875 D
3884 867 D
3866 860 D
3859 856 D
3852 849 D
3848 838 D
3848 828 D
S
N
3880 903 M
3888 900 D
3891 896 D
3895 889 D
3895 882 D
3891 875 D
3880 867 D
3866 860 D
S
N
3848 835 M
3852 838 D
3859 838 D
3877 831 D
3888 831 D
3895 835 D
3898 838 D
S
N
3859 838 M
3877 828 D
3891 828 D
3895 831 D
3898 838 D
3898 846 D
S
N
3927 903 M
3920 867 D
S
N
3920 867 M
3927 875 D
3938 878 D
3949 878 D
3960 875 D
3967 867 D
3970 856 D
3970 849 D
3967 838 D
3960 831 D
3949 828 D
3938 828 D
3927 831 D
3924 835 D
3920 842 D
3920 846 D
3924 849 D
3927 846 D
3924 842 D
S
N
3949 878 M
3956 875 D
3963 867 D
3967 856 D
3967 849 D
3963 838 D
3956 831 D
3949 828 D
S
N
3927 903 M
3963 903 D
S
N
3927 900 M
3945 900 D
3963 903 D
S
N
4380 889 M
4383 885 D
4380 882 D
4376 885 D
4376 889 D
4380 896 D
4383 900 D
4394 903 D
4409 903 D
4419 900 D
4423 893 D
4423 882 D
4419 875 D
4409 871 D
4398 871 D
S
N
4409 903 M
4416 900 D
4419 893 D
4419 882 D
4416 875 D
4409 871 D
S
N
4409 871 M
4416 867 D
4423 860 D
4427 853 D
4427 842 D
4423 835 D
4419 831 D
4409 828 D
4394 828 D
4383 831 D
4380 835 D
4376 842 D
4376 846 D
4380 849 D
4383 846 D
4380 842 D
S
N
4419 864 M
4423 853 D
4423 842 D
4419 835 D
4416 831 D
4409 828 D
S
N
4470 903 M
4459 900 D
4452 889 D
4448 871 D
4448 860 D
4452 842 D
4459 831 D
4470 828 D
4477 828 D
4488 831 D
4495 842 D
4499 860 D
4499 871 D
4495 889 D
4488 900 D
4477 903 D
4470 903 D
S
N
4470 903 M
4463 900 D
4459 896 D
4455 889 D
4452 871 D
4452 860 D
4455 842 D
4459 835 D
4463 831 D
4470 828 D
S
N
4477 828 M
4484 831 D
4488 835 D
4491 842 D
4495 860 D
4495 871 D
4491 889 D
4488 896 D
4484 900 D
4477 903 D
S
N
1268 3196 M
1268 3300 D
S
N
1374 3300 M
1374 3265 D
S
N
1479 3265 M
1479 3300 D
S
N
1585 3300 M
1585 3265 D
S
N
1691 3265 M
1691 3300 D
S
N
1796 3300 M
1796 3196 D
S
N
1902 3265 M
1902 3300 D
S
N
2008 3300 M
2008 3265 D
S
N
2113 3265 M
2113 3300 D
S
N
2219 3300 M
2219 3265 D
S
N
2325 3196 M
2325 3300 D
S
N
2430 3300 M
2430 3265 D
S
N
2536 3265 M
2536 3300 D
S
N
2641 3300 M
2641 3265 D
S
N
2747 3265 M
2747 3300 D
S
N
2853 3300 M
2853 3196 D
S
N
2958 3265 M
2958 3300 D
S
N
3064 3300 M
3064 3265 D
S
N
3170 3265 M
3170 3300 D
S
N
3275 3300 M
3275 3265 D
S
N
3381 3196 M
3381 3300 D
S
N
3487 3300 M
3487 3265 D
S
N
3592 3265 M
3592 3300 D
S
N
3698 3300 M
3698 3265 D
S
N
3804 3265 M
3804 3300 D
S
N
3909 3300 M
3909 3196 D
S
N
4015 3265 M
4015 3300 D
S
N
4120 3300 M
4120 3265 D
S
N
4226 3265 M
4226 3300 D
S
N
4332 3300 M
4332 3265 D
S
N
4437 3196 M
4437 3300 D
S
N
1268 975 M
1372 975 D
S
N
1303 1068 M
1268 1068 D
S
N
1268 1161 M
1303 1161 D
S
N
1303 1254 M
1268 1254 D
S
N
1268 1347 M
1303 1347 D
S
N
1372 1440 M
1268 1440 D
S
N
1268 1533 M
1303 1533 D
S
N
1303 1626 M
1268 1626 D
S
N
1268 1719 M
1303 1719 D
S
N
1303 1812 M
1268 1812 D
S
N
1268 1905 M
1372 1905 D
S
N
1303 1998 M
1268 1998 D
S
N
1268 2091 M
1303 2091 D
S
N
1303 2184 M
1268 2184 D
S
N
1268 2277 M
1303 2277 D
S
N
1372 2370 M
1268 2370 D
S
N
1268 2463 M
1303 2463 D
S
N
1303 2556 M
1268 2556 D
S
N
1268 2649 M
1303 2649 D
S
N
1303 2742 M
1268 2742 D
S
N
1268 2835 M
1372 2835 D
S
N
1303 2928 M
1268 2928 D
S
N
1268 3021 M
1303 3021 D
S
N
1303 3114 M
1268 3114 D
S
N
1268 3207 M
1303 3207 D
S
N
1372 3300 M
1268 3300 D
S
N
1077 1007 M
1066 1004 D
1059 993 D
1055 975 D
1055 964 D
1059 946 D
1066 935 D
1077 931 D
1084 931 D
1095 935 D
1102 946 D
1106 964 D
1106 975 D
1102 993 D
1095 1004 D
1084 1007 D
1077 1007 D
S
N
1077 1007 M
1070 1004 D
1066 1000 D
1063 993 D
1059 975 D
1059 964 D
1063 946 D
1066 939 D
1070 935 D
1077 931 D
S
N
1084 931 M
1091 935 D
1095 939 D
1099 946 D
1102 964 D
1102 975 D
1099 993 D
1095 1000 D
1091 1004 D
1084 1007 D
S
N
1135 939 M
1131 935 D
1135 931 D
1138 935 D
1135 939 D
S
N
1185 1007 M
1174 1004 D
1167 993 D
1164 975 D
1164 964 D
1167 946 D
1174 935 D
1185 931 D
1192 931 D
1203 935 D
1210 946 D
1214 964 D
1214 975 D
1210 993 D
1203 1004 D
1192 1007 D
1185 1007 D
S
N
1185 1007 M
1178 1004 D
1174 1000 D
1171 993 D
1167 975 D
1167 964 D
1171 946 D
1174 939 D
1178 935 D
1185 931 D
S
N
1192 931 M
1200 935 D
1203 939 D
1207 946 D
1210 964 D
1210 975 D
1207 993 D
1203 1000 D
1200 1004 D
1192 1007 D
S
N
1077 1472 M
1066 1469 D
1059 1458 D
1055 1440 D
1055 1429 D
1059 1411 D
1066 1400 D
1077 1396 D
1084 1396 D
1095 1400 D
1102 1411 D
1106 1429 D
1106 1440 D
1102 1458 D
1095 1469 D
1084 1472 D
1077 1472 D
S
N
1077 1472 M
1070 1469 D
1066 1465 D
1063 1458 D
1059 1440 D
1059 1429 D
1063 1411 D
1066 1404 D
1070 1400 D
1077 1396 D
S
N
1084 1396 M
1091 1400 D
1095 1404 D
1099 1411 D
1102 1429 D
1102 1440 D
1099 1458 D
1095 1465 D
1091 1469 D
1084 1472 D
S
N
1135 1404 M
1131 1400 D
1135 1396 D
1138 1400 D
1135 1404 D
S
N
1167 1458 M
1171 1454 D
1167 1451 D
1164 1454 D
1164 1458 D
1167 1465 D
1171 1469 D
1182 1472 D
1196 1472 D
1207 1469 D
1210 1465 D
1214 1458 D
1214 1451 D
1210 1443 D
1200 1436 D
1182 1429 D
1174 1425 D
1167 1418 D
1164 1407 D
1164 1396 D
S
N
1196 1472 M
1203 1469 D
1207 1465 D
1210 1458 D
1210 1451 D
1207 1443 D
1196 1436 D
1182 1429 D
S
N
1164 1404 M
1167 1407 D
1174 1407 D
1192 1400 D
1203 1400 D
1210 1404 D
1214 1407 D
S
N
1174 1407 M
1192 1396 D
1207 1396 D
1210 1400 D
1214 1407 D
1214 1414 D
S
N
1077 1937 M
1066 1934 D
1059 1923 D
1055 1905 D
1055 1894 D
1059 1876 D
1066 1865 D
1077 1861 D
1084 1861 D
1095 1865 D
1102 1876 D
1106 1894 D
1106 1905 D
1102 1923 D
1095 1934 D
1084 1937 D
1077 1937 D
S
N
1077 1937 M
1070 1934 D
1066 1930 D
1063 1923 D
1059 1905 D
1059 1894 D
1063 1876 D
1066 1869 D
1070 1865 D
1077 1861 D
S
N
1084 1861 M
1091 1865 D
1095 1869 D
1099 1876 D
1102 1894 D
1102 1905 D
1099 1923 D
1095 1930 D
1091 1934 D
1084 1937 D
S
N
1135 1869 M
1131 1865 D
1135 1861 D
1138 1865 D
1135 1869 D
S
N
1196 1930 M
1196 1861 D
S
N
1200 1937 M
1200 1861 D
S
N
1200 1937 M
1160 1883 D
1218 1883 D
S
N
1185 1861 M
1210 1861 D
S
N
1077 2402 M
1066 2399 D
1059 2388 D
1055 2370 D
1055 2359 D
1059 2341 D
1066 2330 D
1077 2327 D
1084 2327 D
1095 2330 D
1102 2341 D
1106 2359 D
1106 2370 D
1102 2388 D
1095 2399 D
1084 2402 D
1077 2402 D
S
N
1077 2402 M
1070 2399 D
1066 2395 D
1063 2388 D
1059 2370 D
1059 2359 D
1063 2341 D
1066 2334 D
1070 2330 D
1077 2327 D
S
N
1084 2327 M
1091 2330 D
1095 2334 D
1099 2341 D
1102 2359 D
1102 2370 D
1099 2388 D
1095 2395 D
1091 2399 D
1084 2402 D
S
N
1135 2334 M
1131 2330 D
1135 2327 D
1138 2330 D
1135 2334 D
S
N
1207 2391 M
1203 2388 D
1207 2384 D
1210 2388 D
1210 2391 D
1207 2399 D
1200 2402 D
1189 2402 D
1178 2399 D
1171 2391 D
1167 2384 D
1164 2370 D
1164 2348 D
1167 2337 D
1174 2330 D
1185 2327 D
1192 2327 D
1203 2330 D
1210 2337 D
1214 2348 D
1214 2352 D
1210 2363 D
1203 2370 D
1192 2373 D
1189 2373 D
1178 2370 D
1171 2363 D
1167 2352 D
S
N
1189 2402 M
1182 2399 D
1174 2391 D
1171 2384 D
1167 2370 D
1167 2348 D
1171 2337 D
1178 2330 D
1185 2327 D
S
N
1192 2327 M
1200 2330 D
1207 2337 D
1210 2348 D
1210 2352 D
1207 2363 D
1200 2370 D
1192 2373 D
S
N
1077 2867 M
1066 2864 D
1059 2853 D
1055 2835 D
1055 2824 D
1059 2806 D
1066 2795 D
1077 2792 D
1084 2792 D
1095 2795 D
1102 2806 D
1106 2824 D
1106 2835 D
1102 2853 D
1095 2864 D
1084 2867 D
1077 2867 D
S
N
1077 2867 M
1070 2864 D
1066 2860 D
1063 2853 D
1059 2835 D
1059 2824 D
1063 2806 D
1066 2799 D
1070 2795 D
1077 2792 D
S
N
1084 2792 M
1091 2795 D
1095 2799 D
1099 2806 D
1102 2824 D
1102 2835 D
1099 2853 D
1095 2860 D
1091 2864 D
1084 2867 D
S
N
1135 2799 M
1131 2795 D
1135 2792 D
1138 2795 D
1135 2799 D
S
N
1182 2867 M
1171 2864 D
1167 2856 D
1167 2846 D
1171 2838 D
1182 2835 D
1196 2835 D
1207 2838 D
1210 2846 D
1210 2856 D
1207 2864 D
1196 2867 D
1182 2867 D
S
N
1182 2867 M
1174 2864 D
1171 2856 D
1171 2846 D
1174 2838 D
1182 2835 D
S
N
1196 2835 M
1203 2838 D
1207 2846 D
1207 2856 D
1203 2864 D
1196 2867 D
S
N
1182 2835 M
1171 2831 D
1167 2828 D
1164 2820 D
1164 2806 D
1167 2799 D
1171 2795 D
1182 2792 D
1196 2792 D
1207 2795 D
1210 2799 D
1214 2806 D
1214 2820 D
1210 2828 D
1207 2831 D
1196 2835 D
S
N
1182 2835 M
1174 2831 D
1171 2828 D
1167 2820 D
1167 2806 D
1171 2799 D
1174 2795 D
1182 2792 D
S
N
1196 2792 M
1203 2795 D
1207 2799 D
1210 2806 D
1210 2820 D
1207 2828 D
1203 2831 D
1196 2835 D
S
N
1066 3318 M
1073 3321 D
1084 3332 D
1084 3257 D
S
N
1081 3329 M
1081 3257 D
S
N
1066 3257 M
1099 3257 D
S
N
1135 3264 M
1131 3260 D
1135 3257 D
1138 3260 D
1135 3264 D
S
N
1185 3332 M
1174 3329 D
1167 3318 D
1164 3300 D
1164 3289 D
1167 3271 D
1174 3260 D
1185 3257 D
1192 3257 D
1203 3260 D
1210 3271 D
1214 3289 D
1214 3300 D
1210 3318 D
1203 3329 D
1192 3332 D
1185 3332 D
S
N
1185 3332 M
1178 3329 D
1174 3325 D
1171 3318 D
1167 3300 D
1167 3289 D
1171 3271 D
1174 3264 D
1178 3260 D
1185 3257 D
S
N
1192 3257 M
1200 3260 D
1203 3264 D
1207 3271 D
1210 3289 D
1210 3300 D
1207 3318 D
1203 3325 D
1200 3329 D
1192 3332 D
S
N
4334 975 M
4437 975 D
S
N
4437 1068 M
4403 1068 D
S
N
4403 1161 M
4437 1161 D
S
N
4437 1254 M
4403 1254 D
S
N
4403 1347 M
4437 1347 D
S
N
4437 1440 M
4334 1440 D
S
N
4403 1533 M
4437 1533 D
S
N
4437 1626 M
4403 1626 D
S
N
4403 1719 M
4437 1719 D
S
N
4437 1812 M
4403 1812 D
S
N
4334 1905 M
4437 1905 D
S
N
4437 1998 M
4403 1998 D
S
N
4403 2091 M
4437 2091 D
S
N
4437 2184 M
4403 2184 D
S
N
4403 2277 M
4437 2277 D
S
N
4437 2370 M
4334 2370 D
S
N
4403 2463 M
4437 2463 D
S
N
4437 2556 M
4403 2556 D
S
N
4403 2649 M
4437 2649 D
S
N
4437 2742 M
4403 2742 D
S
N
4334 2835 M
4437 2835 D
S
N
4437 2928 M
4403 2928 D
S
N
4403 3021 M
4437 3021 D
S
N
4437 3114 M
4403 3114 D
S
N
4403 3207 M
4437 3207 D
S
N
4437 3300 M
4334 3300 D
S
N
2294 1944 M
2294 1853 D
S
N
2299 1944 M
2299 1853 D
S
N
2281 1944 M
2333 1944 D
2346 1939 D
2350 1935 D
2355 1926 D
2355 1913 D
2350 1905 D
2346 1900 D
2333 1896 D
2299 1896 D
S
N
2333 1944 M
2342 1939 D
2346 1935 D
2350 1926 D
2350 1913 D
2346 1905 D
2342 1900 D
2333 1896 D
S
N
2281 1853 M
2312 1853 D
S
N
2411 1944 M
2398 1939 D
2389 1931 D
2385 1922 D
2381 1905 D
2381 1892 D
2385 1874 D
2389 1866 D
2398 1857 D
2411 1853 D
2420 1853 D
2433 1857 D
2441 1866 D
2446 1874 D
2450 1892 D
2450 1905 D
2446 1922 D
2441 1931 D
2433 1939 D
2420 1944 D
2411 1944 D
S
N
2411 1944 M
2402 1939 D
2394 1931 D
2389 1922 D
2385 1905 D
2385 1892 D
2389 1874 D
2394 1866 D
2402 1857 D
2411 1853 D
S
N
2420 1853 M
2428 1857 D
2437 1866 D
2441 1874 D
2446 1892 D
2446 1905 D
2441 1922 D
2437 1931 D
2428 1939 D
2420 1944 D
S
N
2480 1944 M
2498 1853 D
S
N
2485 1944 M
2498 1874 D
S
N
2515 1944 M
2498 1853 D
S
N
2515 1944 M
2532 1853 D
S
N
2519 1944 M
2532 1874 D
S
N
2549 1944 M
2532 1853 D
S
N
2467 1944 M
2498 1944 D
S
N
2536 1944 M
2562 1944 D
S
N
2588 1944 M
2588 1853 D
S
N
2593 1944 M
2593 1853 D
S
N
2645 1944 M
2645 1853 D
S
N
2649 1944 M
2649 1853 D
S
N
2575 1944 M
2606 1944 D
S
N
2632 1944 M
2662 1944 D
S
N
2593 1900 M
2645 1900 D
S
N
2575 1853 M
2606 1853 D
S
N
2632 1853 M
2662 1853 D
S
N
2692 1944 M
2692 1853 D
S
N
2696 1944 M
2696 1853 D
S
N
2722 1918 M
2722 1883 D
S
N
2679 1944 M
2748 1944 D
2748 1918 D
2744 1944 D
S
N
2696 1900 M
2722 1900 D
S
N
2679 1853 M
2748 1853 D
2748 1879 D
2744 1853 D
S
N
2835 1931 M
2839 1918 D
2839 1944 D
2835 1931 D
2826 1939 D
2813 1944 D
2805 1944 D
2792 1939 D
2783 1931 D
2779 1922 D
2774 1909 D
2774 1887 D
2779 1874 D
2783 1866 D
2792 1857 D
2805 1853 D
2813 1853 D
2826 1857 D
2835 1866 D
S
N
2805 1944 M
2796 1939 D
2787 1931 D
2783 1922 D
2779 1909 D
2779 1887 D
2783 1874 D
2787 1866 D
2796 1857 D
2805 1853 D
S
N
2835 1887 M
2835 1853 D
S
N
2839 1887 M
2839 1853 D
S
N
2822 1887 M
2852 1887 D
S
N
2917 1931 M
2917 1853 D
S
N
2878 1892 M
2956 1892 D
S
N
2995 1944 M
2995 1853 D
S
N
2999 1944 M
2999 1853 D
S
N
3051 1944 M
3051 1853 D
S
N
3055 1944 M
3055 1853 D
S
N
2982 1944 M
3012 1944 D
S
N
3038 1944 M
3068 1944 D
S
N
2999 1900 M
3051 1900 D
S
N
2982 1853 M
3012 1853 D
S
N
3038 1853 M
3068 1853 D
S
N
3099 1944 M
3099 1853 D
S
N
3103 1944 M
3103 1853 D
S
N
3129 1918 M
3129 1883 D
S
N
3086 1944 M
3155 1944 D
3155 1918 D
3151 1944 D
S
N
3103 1900 M
3129 1900 D
S
N
3086 1853 M
3155 1853 D
3155 1879 D
3151 1853 D
S
N
3190 1944 M
3190 1853 D
S
N
3194 1944 M
3194 1853 D
S
N
3177 1944 M
3228 1944 D
3241 1939 D
3246 1935 D
3250 1926 D
3250 1918 D
3246 1909 D
3241 1905 D
3228 1900 D
3194 1900 D
S
N
3228 1944 M
3237 1939 D
3241 1935 D
3246 1926 D
3246 1918 D
3241 1909 D
3237 1905 D
3228 1900 D
S
N
3177 1853 M
3207 1853 D
S
N
3215 1900 M
3224 1896 D
3228 1892 D
3241 1861 D
3246 1857 D
3250 1857 D
3254 1861 D
S
N
3224 1896 M
3228 1887 D
3237 1857 D
3241 1853 D
3250 1853 D
3254 1861 D
3254 1866 D
S
N
3280 1944 M
3298 1853 D
S
N
3285 1944 M
3298 1874 D
S
N
3315 1944 M
3298 1853 D
S
N
3315 1944 M
3332 1853 D
S
N
3319 1944 M
3332 1874 D
S
N
3350 1944 M
3332 1853 D
S
N
3267 1944 M
3298 1944 D
S
N
3337 1944 M
3363 1944 D
S
N
3388 1944 M
3388 1853 D
S
N
3393 1944 M
3393 1853 D
S
N
3375 1944 M
3406 1944 D
S
N
3375 1853 M
3406 1853 D
S
N
3488 1931 M
3492 1918 D
3492 1944 D
3488 1931 D
3479 1939 D
3466 1944 D
3458 1944 D
3445 1939 D
3436 1931 D
3432 1922 D
3427 1909 D
3427 1887 D
3432 1874 D
3436 1866 D
3445 1857 D
3458 1853 D
3466 1853 D
3479 1857 D
3488 1866 D
S
N
3458 1944 M
3449 1939 D
3440 1931 D
3436 1922 D
3432 1909 D
3432 1887 D
3436 1874 D
3440 1866 D
3449 1857 D
3458 1853 D
S
N
3488 1887 M
3488 1853 D
S
N
3492 1887 M
3492 1853 D
S
N
3475 1887 M
3505 1887 D
S
1.00 0.00 1.00 setrgbcolor
2113 1719 P
N
2090 1719 M
2113 1696 D
2136 1719 D
2113 1742 D
2090 1719 D
S
N
2294 1758 M
2294 1667 D
S
N
2299 1758 M
2299 1667 D
S
N
2281 1758 M
2333 1758 D
2346 1753 D
2350 1749 D
2355 1740 D
2355 1727 D
2350 1719 D
2346 1714 D
2333 1710 D
2299 1710 D
S
N
2333 1758 M
2342 1753 D
2346 1749 D
2350 1740 D
2350 1727 D
2346 1719 D
2342 1714 D
2333 1710 D
S
N
2281 1667 M
2312 1667 D
S
N
2411 1758 M
2398 1753 D
2389 1745 D
2385 1736 D
2381 1719 D
2381 1706 D
2385 1688 D
2389 1680 D
2398 1671 D
2411 1667 D
2420 1667 D
2433 1671 D
2441 1680 D
2446 1688 D
2450 1706 D
2450 1719 D
2446 1736 D
2441 1745 D
2433 1753 D
2420 1758 D
2411 1758 D
S
N
2411 1758 M
2402 1753 D
2394 1745 D
2389 1736 D
2385 1719 D
2385 1706 D
2389 1688 D
2394 1680 D
2402 1671 D
2411 1667 D
S
N
2420 1667 M
2428 1671 D
2437 1680 D
2441 1688 D
2446 1706 D
2446 1719 D
2441 1736 D
2437 1745 D
2428 1753 D
2420 1758 D
S
N
2480 1758 M
2498 1667 D
S
N
2485 1758 M
2498 1688 D
S
N
2515 1758 M
2498 1667 D
S
N
2515 1758 M
2532 1667 D
S
N
2519 1758 M
2532 1688 D
S
N
2549 1758 M
2532 1667 D
S
N
2467 1758 M
2498 1758 D
S
N
2536 1758 M
2562 1758 D
S
N
2588 1758 M
2588 1667 D
S
N
2593 1758 M
2593 1667 D
S
N
2645 1758 M
2645 1667 D
S
N
2649 1758 M
2649 1667 D
S
N
2575 1758 M
2606 1758 D
S
N
2632 1758 M
2662 1758 D
S
N
2593 1714 M
2645 1714 D
S
N
2575 1667 M
2606 1667 D
S
N
2632 1667 M
2662 1667 D
S
N
2692 1758 M
2692 1667 D
S
N
2696 1758 M
2696 1667 D
S
N
2722 1732 M
2722 1697 D
S
N
2679 1758 M
2748 1758 D
2748 1732 D
2744 1758 D
S
N
2696 1714 M
2722 1714 D
S
N
2679 1667 M
2748 1667 D
2748 1693 D
2744 1667 D
S
N
2835 1745 M
2839 1732 D
2839 1758 D
2835 1745 D
2826 1753 D
2813 1758 D
2805 1758 D
2792 1753 D
2783 1745 D
2779 1736 D
2774 1723 D
2774 1701 D
2779 1688 D
2783 1680 D
2792 1671 D
2805 1667 D
2813 1667 D
2826 1671 D
2835 1680 D
S
N
2805 1758 M
2796 1753 D
2787 1745 D
2783 1736 D
2779 1723 D
2779 1701 D
2783 1688 D
2787 1680 D
2796 1671 D
2805 1667 D
S
N
2835 1701 M
2835 1667 D
S
N
2839 1701 M
2839 1667 D
S
N
2822 1701 M
2852 1701 D
S
N
2917 1745 M
2917 1667 D
S
N
2878 1706 M
2956 1706 D
S
N
2995 1758 M
2995 1667 D
S
N
2999 1758 M
2999 1667 D
S
N
2982 1758 M
3034 1758 D
3047 1753 D
3051 1749 D
3055 1740 D
3055 1727 D
3051 1719 D
3047 1714 D
3034 1710 D
2999 1710 D
S
N
3034 1758 M
3042 1753 D
3047 1749 D
3051 1740 D
3051 1727 D
3047 1719 D
3042 1714 D
3034 1710 D
S
N
2982 1667 M
3012 1667 D
S
N
3081 1758 M
3112 1710 D
3112 1667 D
S
N
3086 1758 M
3116 1710 D
3116 1667 D
S
N
3146 1758 M
3116 1710 D
S
N
3073 1758 M
3099 1758 D
S
N
3129 1758 M
3155 1758 D
S
N
3099 1667 M
3129 1667 D
S
N
3198 1758 M
3198 1667 D
S
N
3202 1758 M
3202 1667 D
S
N
3172 1758 M
3168 1732 D
3168 1758 D
3233 1758 D
3233 1732 D
3228 1758 D
S
N
3185 1667 M
3215 1667 D
S
N
3263 1758 M
3263 1667 D
S
N
3267 1758 M
3267 1667 D
S
N
3319 1758 M
3319 1667 D
S
N
3324 1758 M
3324 1667 D
S
N
3250 1758 M
3280 1758 D
S
N
3306 1758 M
3337 1758 D
S
N
3267 1714 M
3319 1714 D
S
N
3250 1667 M
3280 1667 D
S
N
3306 1667 M
3337 1667 D
S
N
3367 1758 M
3367 1667 D
S
N
3371 1758 M
3371 1667 D
S
N
3354 1758 M
3384 1758 D
S
N
3354 1667 M
3384 1667 D
S
N
3436 1758 M
3406 1667 D
S
N
3436 1758 M
3466 1667 D
S
N
3436 1745 M
3462 1667 D
S
N
3414 1693 M
3453 1693 D
S
N
3397 1667 M
3423 1667 D
S
N
3449 1667 M
3475 1667 D
S
0.00 1.00 0.00 setrgbcolor
2113 1533 P
N
2090 1510 M
2136 1510 D
2136 1556 D
2090 1556 D
2090 1510 D
S
N
2294 1572 M
2294 1481 D
S
N
2299 1572 M
2299 1481 D
S
N
2281 1572 M
2333 1572 D
2346 1567 D
2350 1563 D
2355 1554 D
2355 1541 D
2350 1533 D
2346 1528 D
2333 1524 D
2299 1524 D
S
N
2333 1572 M
2342 1567 D
2346 1563 D
2350 1554 D
2350 1541 D
2346 1533 D
2342 1528 D
2333 1524 D
S
N
2281 1481 M
2312 1481 D
S
N
2381 1572 M
2411 1524 D
2411 1481 D
S
N
2385 1572 M
2415 1524 D
2415 1481 D
S
N
2446 1572 M
2415 1524 D
S
N
2372 1572 M
2398 1572 D
S
N
2428 1572 M
2454 1572 D
S
N
2398 1481 M
2428 1481 D
S
N
2498 1572 M
2498 1481 D
S
N
2502 1572 M
2502 1481 D
S
N
2472 1572 M
2467 1546 D
2467 1572 D
2532 1572 D
2532 1546 D
2528 1572 D
S
N
2485 1481 M
2515 1481 D
S
N
2562 1572 M
2562 1481 D
S
N
2567 1572 M
2567 1481 D
S
N
2619 1572 M
2619 1481 D
S
N
2623 1572 M
2623 1481 D
S
N
2549 1572 M
2580 1572 D
S
N
2606 1572 M
2636 1572 D
S
N
2567 1528 M
2619 1528 D
S
N
2549 1481 M
2580 1481 D
S
N
2606 1481 M
2636 1481 D
S
N
2666 1572 M
2666 1481 D
S
N
2671 1572 M
2671 1481 D
S
N
2653 1572 M
2683 1572 D
S
N
2653 1481 M
2683 1481 D
S
N
2735 1572 M
2705 1481 D
S
N
2735 1572 M
2766 1481 D
S
N
2735 1559 M
2761 1481 D
S
N
2714 1507 M
2753 1507 D
S
N
2696 1481 M
2722 1481 D
S
N
2748 1481 M
2774 1481 D
S
0.00 0.00 1.00 setrgbcolor
2113 1347 P
N
2090 1324 M
2136 1370 D
S
N
2090 1370 M
2136 1324 D
S
N
2294 1386 M
2294 1295 D
S
N
2299 1386 M
2325 1308 D
S
N
2294 1386 M
2325 1295 D
S
N
2355 1386 M
2325 1295 D
S
N
2355 1386 M
2355 1295 D
S
N
2359 1386 M
2359 1295 D
S
N
2281 1386 M
2299 1386 D
S
N
2355 1386 M
2372 1386 D
S
N
2281 1295 M
2307 1295 D
S
N
2342 1295 M
2372 1295 D
S
N
2454 1373 M
2459 1360 D
2459 1386 D
2454 1373 D
2446 1381 D
2433 1386 D
2424 1386 D
2411 1381 D
2402 1373 D
2398 1364 D
2394 1351 D
2394 1329 D
2398 1316 D
2402 1308 D
2411 1299 D
2424 1295 D
2433 1295 D
2446 1299 D
2454 1308 D
2459 1316 D
S
N
2424 1386 M
2415 1381 D
2407 1373 D
2402 1364 D
2398 1351 D
2398 1329 D
2402 1316 D
2407 1308 D
2415 1299 D
2424 1295 D
S
N
2549 1351 M
2545 1360 D
2536 1364 D
2523 1364 D
2515 1360 D
2510 1355 D
2506 1342 D
2506 1329 D
2510 1321 D
2519 1316 D
2532 1316 D
2541 1321 D
2545 1329 D
S
N
2523 1364 M
2515 1355 D
2510 1342 D
2510 1329 D
2515 1321 D
2519 1316 D
S
N
2549 1364 M
2545 1329 D
2545 1321 D
2554 1316 D
2562 1316 D
2571 1325 D
2575 1338 D
2575 1347 D
2571 1360 D
2567 1368 D
2558 1377 D
2549 1381 D
2536 1386 D
2523 1386 D
2510 1381 D
2502 1377 D
2493 1368 D
2489 1360 D
2485 1347 D
2485 1334 D
2489 1321 D
2493 1312 D
2502 1303 D
2510 1299 D
2523 1295 D
2536 1295 D
2549 1299 D
2558 1303 D
2562 1308 D
S
N
2554 1364 M
2549 1329 D
2549 1321 D
2554 1316 D
S
N
2610 1386 M
2610 1295 D
S
N
2614 1386 M
2666 1303 D
S
N
2614 1377 M
2666 1295 D
S
N
2666 1386 M
2666 1295 D
S
N
2597 1386 M
2614 1386 D
S
N
2653 1386 M
2679 1386 D
S
N
2597 1295 M
2623 1295 D
S
N
2709 1386 M
2709 1295 D
S
N
2714 1386 M
2714 1295 D
S
N
2696 1386 M
2727 1386 D
S
N
2696 1295 M
2761 1295 D
2761 1321 D
2757 1295 D
S
N
2809 1386 M
2796 1381 D
2787 1373 D
2783 1364 D
2779 1347 D
2779 1334 D
2783 1316 D
2787 1308 D
2796 1299 D
2809 1295 D
2818 1295 D
2831 1299 D
2839 1308 D
2844 1316 D
2848 1334 D
2848 1347 D
2844 1364 D
2839 1373 D
2831 1381 D
2818 1386 D
2809 1386 D
S
N
2809 1386 M
2800 1381 D
2792 1373 D
2787 1364 D
2783 1347 D
2783 1334 D
2787 1316 D
2792 1308 D
2800 1299 D
2809 1295 D
S
N
2818 1295 M
2826 1299 D
2835 1308 D
2839 1316 D
2844 1334 D
2844 1347 D
2839 1364 D
2835 1373 D
2826 1381 D
2818 1386 D
S
0.00 0.00 0.00 setrgbcolor
N
1268 3300 M
1268 975 D
S
N
1268 975 M
4437 975 D
S
N
4437 975 M
4437 3300 D
S
N
4437 3300 M
1268 3300 D
S
N
1268 975 M
4437 975 D
S
N
1268 975 M
1268 1079 D
S
N
1374 1009 M
1374 975 D
S
N
1479 975 M
1479 1009 D
S
N
1585 1009 M
1585 975 D
S
N
1691 975 M
1691 1009 D
S
N
1796 1079 M
1796 975 D
S
N
1902 975 M
1902 1009 D
S
N
2008 1009 M
2008 975 D
S
N
2113 975 M
2113 1009 D
S
N
2219 1009 M
2219 975 D
S
N
2325 975 M
2325 1079 D
S
N
2430 1009 M
2430 975 D
S
N
2536 975 M
2536 1009 D
S
N
2641 1009 M
2641 975 D
S
N
2747 975 M
2747 1009 D
S
N
2853 1079 M
2853 975 D
S
N
2958 975 M
2958 1009 D
S
N
3064 1009 M
3064 975 D
S
N
3170 975 M
3170 1009 D
S
N
3275 1009 M
3275 975 D
S
N
3381 975 M
3381 1079 D
S
N
3487 1009 M
3487 975 D
S
N
3592 975 M
3592 1009 D
S
N
3698 1009 M
3698 975 D
S
N
3804 975 M
3804 1009 D
S
N
3909 1079 M
3909 975 D
S
N
4015 975 M
4015 1009 D
S
N
4120 1009 M
4120 975 D
S
N
4226 975 M
4226 1009 D
S
N
4332 1009 M
4332 975 D
S
N
4437 975 M
4437 1079 D
S
N
1264 903 M
1254 900 D
1246 889 D
1243 871 D
1243 860 D
1246 842 D
1254 831 D
1264 828 D
1272 828 D
1282 831 D
1290 842 D
1293 860 D
1293 871 D
1290 889 D
1282 900 D
1272 903 D
1264 903 D
S
N
1264 903 M
1257 900 D
1254 896 D
1250 889 D
1246 871 D
1246 860 D
1250 842 D
1254 835 D
1257 831 D
1264 828 D
S
N
1272 828 M
1279 831 D
1282 835 D
1286 842 D
1290 860 D
1290 871 D
1286 889 D
1282 896 D
1279 900 D
1272 903 D
S
N
1778 903 M
1771 867 D
S
N
1771 867 M
1778 875 D
1789 878 D
1800 878 D
1811 875 D
1818 867 D
1822 856 D
1822 849 D
1818 838 D
1811 831 D
1800 828 D
1789 828 D
1778 831 D
1775 835 D
1771 842 D
1771 846 D
1775 849 D
1778 846 D
1775 842 D
S
N
1800 878 M
1807 875 D
1814 867 D
1818 856 D
1818 849 D
1814 838 D
1807 831 D
1800 828 D
S
N
1778 903 M
1814 903 D
S
N
1778 900 M
1796 900 D
1814 903 D
S
N
2274 889 M
2281 893 D
2292 903 D
2292 828 D
S
N
2288 900 M
2288 828 D
S
N
2274 828 M
2307 828 D
S
N
2357 903 M
2346 900 D
2339 889 D
2335 871 D
2335 860 D
2339 842 D
2346 831 D
2357 828 D
2364 828 D
2375 831 D
2382 842 D
2386 860 D
2386 871 D
2382 889 D
2375 900 D
2364 903 D
2357 903 D
S
N
2357 903 M
2350 900 D
2346 896 D
2343 889 D
2339 871 D
2339 860 D
2343 842 D
2346 835 D
2350 831 D
2357 828 D
S
N
2364 828 M
2371 831 D
2375 835 D
2379 842 D
2382 860 D
2382 871 D
2379 889 D
2375 896 D
2371 900 D
2364 903 D
S
N
2802 889 M
2809 893 D
2820 903 D
2820 828 D
S
N
2817 900 M
2817 828 D
S
N
2802 828 M
2835 828 D
S
N
2871 903 M
2864 867 D
S
N
2864 867 M
2871 875 D
2882 878 D
2892 878 D
2903 875 D
2910 867 D
2914 856 D
2914 849 D
2910 838 D
2903 831 D
2892 828 D
2882 828 D
2871 831 D
2867 835 D
2864 842 D
2864 846 D
2867 849 D
2871 846 D
2867 842 D
S
N
2892 878 M
2900 875 D
2907 867 D
2910 856 D
2910 849 D
2907 838 D
2900 831 D
2892 828 D
S
N
2871 903 M
2907 903 D
S
N
2871 900 M
2889 900 D
2907 903 D
S
N
3323 889 M
3327 885 D
3323 882 D
3320 885 D
3320 889 D
3323 896 D
3327 900 D
3338 903 D
3352 903 D
3363 900 D
3367 896 D
3370 889 D
3370 882 D
3367 875 D
3356 867 D
3338 860 D
3331 856 D
3323 849 D
3320 838 D
3320 828 D
S
N
3352 903 M
3359 900 D
3363 896 D
3367 889 D
3367 882 D
3363 875 D
3352 867 D
3338 860 D
S
N
3320 835 M
3323 838 D
3331 838 D
3349 831 D
3359 831 D
3367 835 D
3370 838 D
S
N
3331 838 M
3349 828 D
3363 828 D
3367 831 D
3370 838 D
3370 846 D
S
N
3413 903 M
3403 900 D
3395 889 D
3392 871 D
3392 860 D
3395 842 D
3403 831 D
3413 828 D
3421 828 D
3431 831 D
3439 842 D
3442 860 D
3442 871 D
3439 889 D
3431 900 D
3421 903 D
3413 903 D
S
N
3413 903 M
3406 900 D
3403 896 D
3399 889 D
3395 871 D
3395 860 D
3399 842 D
3403 835 D
3406 831 D
3413 828 D
S
N
3421 828 M
3428 831 D
3431 835 D
3435 842 D
3439 860 D
3439 871 D
3435 889 D
3431 896 D
3428 900 D
3421 903 D
S
N
3852 889 M
3855 885 D
3852 882 D
3848 885 D
3848 889 D
3852 896 D
3855 900 D
3866 903 D
3880 903 D
3891 900 D
3895 896 D
3898 889 D
3898 882 D
3895 875 D
3884 867 D
3866 860 D
3859 856 D
3852 849 D
3848 838 D
3848 828 D
S
N
3880 903 M
3888 900 D
3891 896 D
3895 889 D
3895 882 D
3891 875 D
3880 867 D
3866 860 D
S
N
3848 835 M
3852 838 D
3859 838 D
3877 831 D
3888 831 D
3895 835 D
3898 838 D
S
N
3859 838 M
3877 828 D
3891 828 D
3895 831 D
3898 838 D
3898 846 D
S
N
3927 903 M
3920 867 D
S
N
3920 867 M
3927 875 D
3938 878 D
3949 878 D
3960 875 D
3967 867 D
3970 856 D
3970 849 D
3967 838 D
3960 831 D
3949 828 D
3938 828 D
3927 831 D
3924 835 D
3920 842 D
3920 846 D
3924 849 D
3927 846 D
3924 842 D
S
N
3949 878 M
3956 875 D
3963 867 D
3967 856 D
3967 849 D
3963 838 D
3956 831 D
3949 828 D
S
N
3927 903 M
3963 903 D
S
N
3927 900 M
3945 900 D
3963 903 D
S
N
4380 889 M
4383 885 D
4380 882 D
4376 885 D
4376 889 D
4380 896 D
4383 900 D
4394 903 D
4409 903 D
4419 900 D
4423 893 D
4423 882 D
4419 875 D
4409 871 D
4398 871 D
S
N
4409 903 M
4416 900 D
4419 893 D
4419 882 D
4416 875 D
4409 871 D
S
N
4409 871 M
4416 867 D
4423 860 D
4427 853 D
4427 842 D
4423 835 D
4419 831 D
4409 828 D
4394 828 D
4383 831 D
4380 835 D
4376 842 D
4376 846 D
4380 849 D
4383 846 D
4380 842 D
S
N
4419 864 M
4423 853 D
4423 842 D
4419 835 D
4416 831 D
4409 828 D
S
N
4470 903 M
4459 900 D
4452 889 D
4448 871 D
4448 860 D
4452 842 D
4459 831 D
4470 828 D
4477 828 D
4488 831 D
4495 842 D
4499 860 D
4499 871 D
4495 889 D
4488 900 D
4477 903 D
4470 903 D
S
N
4470 903 M
4463 900 D
4459 896 D
4455 889 D
4452 871 D
4452 860 D
4455 842 D
4459 835 D
4463 831 D
4470 828 D
S
N
4477 828 M
4484 831 D
4488 835 D
4491 842 D
4495 860 D
4495 871 D
4491 889 D
4488 896 D
4484 900 D
4477 903 D
S
N
1268 3300 M
4437 3300 D
S
N
1268 3196 M
1268 3300 D
S
N
1374 3300 M
1374 3265 D
S
N
1479 3265 M
1479 3300 D
S
N
1585 3300 M
1585 3265 D
S
N
1691 3265 M
1691 3300 D
S
N
1796 3300 M
1796 3196 D
S
N
1902 3265 M
1902 3300 D
S
N
2008 3300 M
2008 3265 D
S
N
2113 3265 M
2113 3300 D
S
N
2219 3300 M
2219 3265 D
S
N
2325 3196 M
2325 3300 D
S
N
2430 3300 M
2430 3265 D
S
N
2536 3265 M
2536 3300 D
S
N
2641 3300 M
2641 3265 D
S
N
2747 3265 M
2747 3300 D
S
N
2853 3300 M
2853 3196 D
S
N
2958 3265 M
2958 3300 D
S
N
3064 3300 M
3064 3265 D
S
N
3170 3265 M
3170 3300 D
S
N
3275 3300 M
3275 3265 D
S
N
3381 3196 M
3381 3300 D
S
N
3487 3300 M
3487 3265 D
S
N
3592 3265 M
3592 3300 D
S
N
3698 3300 M
3698 3265 D
S
N
3804 3265 M
3804 3300 D
S
N
3909 3300 M
3909 3196 D
S
N
4015 3265 M
4015 3300 D
S
N
4120 3300 M
4120 3265 D
S
N
4226 3265 M
4226 3300 D
S
N
4332 3300 M
4332 3265 D
S
N
4437 3196 M
4437 3300 D
S
N
1268 975 M
1268 3300 D
S
N
1268 975 M
1372 975 D
S
N
1303 1068 M
1268 1068 D
S
N
1268 1161 M
1303 1161 D
S
N
1303 1254 M
1268 1254 D
S
N
1268 1347 M
1303 1347 D
S
N
1372 1440 M
1268 1440 D
S
N
1268 1533 M
1303 1533 D
S
N
1303 1626 M
1268 1626 D
S
N
1268 1719 M
1303 1719 D
S
N
1303 1812 M
1268 1812 D
S
N
1268 1905 M
1372 1905 D
S
N
1303 1998 M
1268 1998 D
S
N
1268 2091 M
1303 2091 D
S
N
1303 2184 M
1268 2184 D
S
N
1268 2277 M
1303 2277 D
S
N
1372 2370 M
1268 2370 D
S
N
1268 2463 M
1303 2463 D
S
N
1303 2556 M
1268 2556 D
S
N
1268 2649 M
1303 2649 D
S
N
1303 2742 M
1268 2742 D
S
N
1268 2835 M
1372 2835 D
S
N
1303 2928 M
1268 2928 D
S
N
1268 3021 M
1303 3021 D
S
N
1303 3114 M
1268 3114 D
S
N
1268 3207 M
1303 3207 D
S
N
1372 3300 M
1268 3300 D
S
N
1077 1007 M
1066 1004 D
1059 993 D
1055 975 D
1055 964 D
1059 946 D
1066 935 D
1077 931 D
1084 931 D
1095 935 D
1102 946 D
1106 964 D
1106 975 D
1102 993 D
1095 1004 D
1084 1007 D
1077 1007 D
S
N
1077 1007 M
1070 1004 D
1066 1000 D
1063 993 D
1059 975 D
1059 964 D
1063 946 D
1066 939 D
1070 935 D
1077 931 D
S
N
1084 931 M
1091 935 D
1095 939 D
1099 946 D
1102 964 D
1102 975 D
1099 993 D
1095 1000 D
1091 1004 D
1084 1007 D
S
N
1135 939 M
1131 935 D
1135 931 D
1138 935 D
1135 939 D
S
N
1185 1007 M
1174 1004 D
1167 993 D
1164 975 D
1164 964 D
1167 946 D
1174 935 D
1185 931 D
1192 931 D
1203 935 D
1210 946 D
1214 964 D
1214 975 D
1210 993 D
1203 1004 D
1192 1007 D
1185 1007 D
S
N
1185 1007 M
1178 1004 D
1174 1000 D
1171 993 D
1167 975 D
1167 964 D
1171 946 D
1174 939 D
1178 935 D
1185 931 D
S
N
1192 931 M
1200 935 D
1203 939 D
1207 946 D
1210 964 D
1210 975 D
1207 993 D
1203 1000 D
1200 1004 D
1192 1007 D
S
N
1077 1472 M
1066 1469 D
1059 1458 D
1055 1440 D
1055 1429 D
1059 1411 D
1066 1400 D
1077 1396 D
1084 1396 D
1095 1400 D
1102 1411 D
1106 1429 D
1106 1440 D
1102 1458 D
1095 1469 D
1084 1472 D
1077 1472 D
S
N
1077 1472 M
1070 1469 D
1066 1465 D
1063 1458 D
1059 1440 D
1059 1429 D
1063 1411 D
1066 1404 D
1070 1400 D
1077 1396 D
S
N
1084 1396 M
1091 1400 D
1095 1404 D
1099 1411 D
1102 1429 D
1102 1440 D
1099 1458 D
1095 1465 D
1091 1469 D
1084 1472 D
S
N
1135 1404 M
1131 1400 D
1135 1396 D
1138 1400 D
1135 1404 D
S
N
1167 1458 M
1171 1454 D
1167 1451 D
1164 1454 D
1164 1458 D
1167 1465 D
1171 1469 D
1182 1472 D
1196 1472 D
1207 1469 D
1210 1465 D
1214 1458 D
1214 1451 D
1210 1443 D
1200 1436 D
1182 1429 D
1174 1425 D
1167 1418 D
1164 1407 D
1164 1396 D
S
N
1196 1472 M
1203 1469 D
1207 1465 D
1210 1458 D
1210 1451 D
1207 1443 D
1196 1436 D
1182 1429 D
S
N
1164 1404 M
1167 1407 D
1174 1407 D
1192 1400 D
1203 1400 D
1210 1404 D
1214 1407 D
S
N
1174 1407 M
1192 1396 D
1207 1396 D
1210 1400 D
1214 1407 D
1214 1414 D
S
N
1077 1937 M
1066 1934 D
1059 1923 D
1055 1905 D
1055 1894 D
1059 1876 D
1066 1865 D
1077 1861 D
1084 1861 D
1095 1865 D
1102 1876 D
1106 1894 D
1106 1905 D
1102 1923 D
1095 1934 D
1084 1937 D
1077 1937 D
S
N
1077 1937 M
1070 1934 D
1066 1930 D
1063 1923 D
1059 1905 D
1059 1894 D
1063 1876 D
1066 1869 D
1070 1865 D
1077 1861 D
S
N
1084 1861 M
1091 1865 D
1095 1869 D
1099 1876 D
1102 1894 D
1102 1905 D
1099 1923 D
1095 1930 D
1091 1934 D
1084 1937 D
S
N
1135 1869 M
1131 1865 D
1135 1861 D
1138 1865 D
1135 1869 D
S
N
1196 1930 M
1196 1861 D
S
N
1200 1937 M
1200 1861 D
S
N
1200 1937 M
1160 1883 D
1218 1883 D
S
N
1185 1861 M
1210 1861 D
S
N
1077 2402 M
1066 2399 D
1059 2388 D
1055 2370 D
1055 2359 D
1059 2341 D
1066 2330 D
1077 2327 D
1084 2327 D
1095 2330 D
1102 2341 D
1106 2359 D
1106 2370 D
1102 2388 D
1095 2399 D
1084 2402 D
1077 2402 D
S
N
1077 2402 M
1070 2399 D
1066 2395 D
1063 2388 D
1059 2370 D
1059 2359 D
1063 2341 D
1066 2334 D
1070 2330 D
1077 2327 D
S
N
1084 2327 M
1091 2330 D
1095 2334 D
1099 2341 D
1102 2359 D
1102 2370 D
1099 2388 D
1095 2395 D
1091 2399 D
1084 2402 D
S
N
1135 2334 M
1131 2330 D
1135 2327 D
1138 2330 D
1135 2334 D
S
N
1207 2391 M
1203 2388 D
1207 2384 D
1210 2388 D
1210 2391 D
1207 2399 D
1200 2402 D
1189 2402 D
1178 2399 D
1171 2391 D
1167 2384 D
1164 2370 D
1164 2348 D
1167 2337 D
1174 2330 D
1185 2327 D
1192 2327 D
1203 2330 D
1210 2337 D
1214 2348 D
1214 2352 D
1210 2363 D
1203 2370 D
1192 2373 D
1189 2373 D
1178 2370 D
1171 2363 D
1167 2352 D
S
N
1189 2402 M
1182 2399 D
1174 2391 D
1171 2384 D
1167 2370 D
1167 2348 D
1171 2337 D
1178 2330 D
1185 2327 D
S
N
1192 2327 M
1200 2330 D
1207 2337 D
1210 2348 D
1210 2352 D
1207 2363 D
1200 2370 D
1192 2373 D
S
N
1077 2867 M
1066 2864 D
1059 2853 D
1055 2835 D
1055 2824 D
1059 2806 D
1066 2795 D
1077 2792 D
1084 2792 D
1095 2795 D
1102 2806 D
1106 2824 D
1106 2835 D
1102 2853 D
1095 2864 D
1084 2867 D
1077 2867 D
S
N
1077 2867 M
1070 2864 D
1066 2860 D
1063 2853 D
1059 2835 D
1059 2824 D
1063 2806 D
1066 2799 D
1070 2795 D
1077 2792 D
S
N
1084 2792 M
1091 2795 D
1095 2799 D
1099 2806 D
1102 2824 D
1102 2835 D
1099 2853 D
1095 2860 D
1091 2864 D
1084 2867 D
S
N
1135 2799 M
1131 2795 D
1135 2792 D
1138 2795 D
1135 2799 D
S
N
1182 2867 M
1171 2864 D
1167 2856 D
1167 2846 D
1171 2838 D
1182 2835 D
1196 2835 D
1207 2838 D
1210 2846 D
1210 2856 D
1207 2864 D
1196 2867 D
1182 2867 D
S
N
1182 2867 M
1174 2864 D
1171 2856 D
1171 2846 D
1174 2838 D
1182 2835 D
S
N
1196 2835 M
1203 2838 D
1207 2846 D
1207 2856 D
1203 2864 D
1196 2867 D
S
N
1182 2835 M
1171 2831 D
1167 2828 D
1164 2820 D
1164 2806 D
1167 2799 D
1171 2795 D
1182 2792 D
1196 2792 D
1207 2795 D
1210 2799 D
1214 2806 D
1214 2820 D
1210 2828 D
1207 2831 D
1196 2835 D
S
N
1182 2835 M
1174 2831 D
1171 2828 D
1167 2820 D
1167 2806 D
1171 2799 D
1174 2795 D
1182 2792 D
S
N
1196 2792 M
1203 2795 D
1207 2799 D
1210 2806 D
1210 2820 D
1207 2828 D
1203 2831 D
1196 2835 D
S
N
1066 3318 M
1073 3321 D
1084 3332 D
1084 3257 D
S
N
1081 3329 M
1081 3257 D
S
N
1066 3257 M
1099 3257 D
S
N
1135 3264 M
1131 3260 D
1135 3257 D
1138 3260 D
1135 3264 D
S
N
1185 3332 M
1174 3329 D
1167 3318 D
1164 3300 D
1164 3289 D
1167 3271 D
1174 3260 D
1185 3257 D
1192 3257 D
1203 3260 D
1210 3271 D
1214 3289 D
1214 3300 D
1210 3318 D
1203 3329 D
1192 3332 D
1185 3332 D
S
N
1185 3332 M
1178 3329 D
1174 3325 D
1171 3318 D
1167 3300 D
1167 3289 D
1171 3271 D
1174 3264 D
1178 3260 D
1185 3257 D
S
N
1192 3257 M
1200 3260 D
1203 3264 D
1207 3271 D
1210 3289 D
1210 3300 D
1207 3318 D
1203 3325 D
1200 3329 D
1192 3332 D
S
N
4437 975 M
4437 3300 D
S
N
4334 975 M
4437 975 D
S
N
4437 1068 M
4403 1068 D
S
N
4403 1161 M
4437 1161 D
S
N
4437 1254 M
4403 1254 D
S
N
4403 1347 M
4437 1347 D
S
N
4437 1440 M
4334 1440 D
S
N
4403 1533 M
4437 1533 D
S
N
4437 1626 M
4403 1626 D
S
N
4403 1719 M
4437 1719 D
S
N
4437 1812 M
4403 1812 D
S
N
4334 1905 M
4437 1905 D
S
N
4437 1998 M
4403 1998 D
S
N
4403 2091 M
4437 2091 D
S
N
4437 2184 M
4403 2184 D
S
N
4403 2277 M
4437 2277 D
S
N
4437 2370 M
4334 2370 D
S
N
4403 2463 M
4437 2463 D
S
N
4437 2556 M
4403 2556 D
S
N
4403 2649 M
4437 2649 D
S
N
4437 2742 M
4403 2742 D
S
N
4334 2835 M
4437 2835 D
S
N
4437 2928 M
4403 2928 D
S
N
4403 3021 M
4437 3021 D
S
N
4437 3114 M
4403 3114 D
S
N
4403 3207 M
4437 3207 D
S
N
4437 3300 M
4334 3300 D
S
1.00 0.00 0.00 setrgbcolor
1284 1009 P
N
1267 1009 M
1275 1009 D
1284 1018 D
S
N
1284 1027 M
1284 1018 D
1293 1009 D
S
N
1301 1009 M
1293 1009 D
1284 1001 D
S
N
1284 992 M
1284 1001 D
1275 1009 D
S
1316 1087 P
N
1298 1087 M
1307 1087 D
1316 1095 D
S
N
1316 1104 M
1316 1095 D
1324 1087 D
S
N
1333 1087 M
1324 1087 D
1316 1078 D
S
N
1316 1069 M
1316 1078 D
1307 1087 D
S
1347 1176 P
N
1330 1176 M
1339 1176 D
1347 1185 D
S
N
1347 1194 M
1347 1185 D
1356 1176 D
S
N
1365 1176 M
1356 1176 D
1347 1168 D
S
N
1347 1159 M
1347 1168 D
1339 1176 D
S
1379 1260 P
N
1362 1260 M
1370 1260 D
1379 1268 D
S
N
1379 1277 M
1379 1268 D
1388 1260 D
S
N
1396 1260 M
1388 1260 D
1379 1251 D
S
N
1379 1242 M
1379 1251 D
1370 1260 D
S
1411 1363 P
N
1393 1363 M
1402 1363 D
1411 1372 D
S
N
1411 1381 M
1411 1372 D
1419 1363 D
S
N
1428 1363 M
1419 1363 D
1411 1355 D
S
N
1411 1346 M
1411 1355 D
1402 1363 D
S
1442 1438 P
N
1425 1438 M
1434 1438 D
1442 1447 D
S
N
1442 1456 M
1442 1447 D
1451 1438 D
S
N
1460 1438 M
1451 1438 D
1442 1430 D
S
N
1442 1421 M
1442 1430 D
1434 1438 D
S
1474 1544 P
N
1457 1544 M
1465 1544 D
1474 1553 D
S
N
1474 1562 M
1474 1553 D
1483 1544 D
S
N
1491 1544 M
1483 1544 D
1474 1536 D
S
N
1474 1527 M
1474 1536 D
1465 1544 D
S
1506 1582 P
N
1488 1582 M
1497 1582 D
1506 1590 D
S
N
1506 1599 M
1506 1590 D
1514 1582 D
S
N
1523 1582 M
1514 1582 D
1506 1573 D
S
N
1506 1564 M
1506 1573 D
1497 1582 D
S
1537 1700 P
N
1520 1700 M
1529 1700 D
1537 1709 D
S
N
1537 1717 M
1537 1709 D
1546 1700 D
S
N
1555 1700 M
1546 1700 D
1537 1691 D
S
N
1537 1683 M
1537 1691 D
1529 1700 D
S
1569 1826 P
N
1552 1826 M
1561 1826 D
1569 1835 D
S
N
1569 1844 M
1569 1835 D
1578 1826 D
S
N
1586 1826 M
1578 1826 D
1569 1818 D
S
N
1569 1809 M
1569 1818 D
1561 1826 D
S
1601 1906 P
N
1584 1906 M
1592 1906 D
1601 1915 D
S
N
1601 1924 M
1601 1915 D
1610 1906 D
S
N
1618 1906 M
1610 1906 D
1601 1898 D
S
N
1601 1889 M
1601 1898 D
1592 1906 D
S
1633 1987 P
N
1615 1987 M
1624 1987 D
1633 1996 D
S
N
1633 2004 M
1633 1996 D
1641 1987 D
S
N
1650 1987 M
1641 1987 D
1633 1978 D
S
N
1633 1970 M
1633 1978 D
1624 1987 D
S
1664 2011 P
N
1647 2011 M
1656 2011 D
1664 2020 D
S
N
1664 2028 M
1664 2020 D
1673 2011 D
S
N
1682 2011 M
1673 2011 D
1664 2002 D
S
N
1664 1994 M
1664 2002 D
1656 2011 D
S
1696 2081 P
N
1679 2081 M
1687 2081 D
1696 2089 D
S
N
1696 2098 M
1696 2089 D
1705 2081 D
S
N
1713 2081 M
1705 2081 D
1696 2072 D
S
N
1696 2063 M
1696 2072 D
1687 2081 D
S
1728 2257 P
N
1710 2257 M
1719 2257 D
1728 2266 D
S
N
1728 2275 M
1728 2266 D
1736 2257 D
S
N
1745 2257 M
1736 2257 D
1728 2249 D
S
N
1728 2240 M
1728 2249 D
1719 2257 D
S
1759 2255 P
N
1742 2255 M
1751 2255 D
1759 2264 D
S
N
1759 2272 M
1759 2264 D
1768 2255 D
S
N
1777 2255 M
1768 2255 D
1759 2246 D
S
N
1759 2238 M
1759 2246 D
1751 2255 D
S
1791 2329 P
N
1774 2329 M
1782 2329 D
1791 2337 D
S
N
1791 2346 M
1791 2337 D
1800 2329 D
S
N
1808 2329 M
1800 2329 D
1791 2320 D
S
N
1791 2311 M
1791 2320 D
1782 2329 D
S
1823 2347 P
N
1805 2347 M
1814 2347 D
1823 2355 D
S
N
1823 2364 M
1823 2355 D
1831 2347 D
S
N
1840 2347 M
1831 2347 D
1823 2338 D
S
N
1823 2329 M
1823 2338 D
1814 2347 D
S
1854 2415 P
N
1837 2415 M
1846 2415 D
1854 2423 D
S
N
1854 2432 M
1854 2423 D
1863 2415 D
S
N
1872 2415 M
1863 2415 D
1854 2406 D
S
N
1854 2397 M
1854 2406 D
1846 2415 D
S
1886 2475 P
N
1869 2475 M
1877 2475 D
1886 2484 D
S
N
1886 2492 M
1886 2484 D
1895 2475 D
S
N
1903 2475 M
1895 2475 D
1886 2467 D
S
N
1886 2458 M
1886 2467 D
1877 2475 D
S
1918 2538 P
N
1900 2538 M
1909 2538 D
1918 2547 D
S
N
1918 2555 M
1918 2547 D
1926 2538 D
S
N
1935 2538 M
1926 2538 D
1918 2529 D
S
N
1918 2521 M
1918 2529 D
1909 2538 D
S
1949 2497 P
N
1932 2497 M
1941 2497 D
1949 2506 D
S
N
1949 2514 M
1949 2506 D
1958 2497 D
S
N
1967 2497 M
1958 2497 D
1949 2488 D
S
N
1949 2480 M
1949 2488 D
1941 2497 D
S
1981 2545 P
N
1964 2545 M
1973 2545 D
1981 2554 D
S
N
1981 2562 M
1981 2554 D
1990 2545 D
S
N
1998 2545 M
1990 2545 D
1981 2536 D
S
N
1981 2528 M
1981 2536 D
1973 2545 D
S
2013 2583 P
N
1996 2583 M
2004 2583 D
2013 2592 D
S
N
2013 2600 M
2013 2592 D
2022 2583 D
S
N
2030 2583 M
2022 2583 D
2013 2574 D
S
N
2013 2566 M
2013 2574 D
2004 2583 D
S
2045 2703 P
N
2027 2703 M
2036 2703 D
2045 2712 D
S
N
2045 2720 M
2045 2712 D
2053 2703 D
S
N
2062 2703 M
2053 2703 D
2045 2694 D
S
N
2045 2686 M
2045 2694 D
2036 2703 D
S
2076 2719 P
N
2059 2719 M
2068 2719 D
2076 2727 D
S
N
2076 2736 M
2076 2727 D
2085 2719 D
S
N
2094 2719 M
2085 2719 D
2076 2710 D
S
N
2076 2701 M
2076 2710 D
2068 2719 D
S
2108 2677 P
N
2091 2677 M
2099 2677 D
2108 2685 D
S
N
2108 2694 M
2108 2685 D
2117 2677 D
S
N
2125 2677 M
2117 2677 D
2108 2668 D
S
N
2108 2659 M
2108 2668 D
2099 2677 D
S
2140 2704 P
N
2122 2704 M
2131 2704 D
2140 2712 D
S
N
2140 2721 M
2140 2712 D
2148 2704 D
S
N
2157 2704 M
2148 2704 D
2140 2695 D
S
N
2140 2686 M
2140 2695 D
2131 2704 D
S
2171 2665 P
N
2154 2665 M
2163 2665 D
2171 2674 D
S
N
2171 2682 M
2171 2674 D
2180 2665 D
S
N
2189 2665 M
2180 2665 D
2171 2656 D
S
N
2171 2648 M
2171 2656 D
2163 2665 D
S
2203 2749 P
N
2186 2749 M
2194 2749 D
2203 2757 D
S
N
2203 2766 M
2203 2757 D
2212 2749 D
S
N
2220 2749 M
2212 2749 D
2203 2740 D
S
N
2203 2731 M
2203 2740 D
2194 2749 D
S
2235 2767 P
N
2217 2767 M
2226 2767 D
2235 2776 D
S
N
2235 2785 M
2235 2776 D
2243 2767 D
S
N
2252 2767 M
2243 2767 D
2235 2759 D
S
N
2235 2750 M
2235 2759 D
2226 2767 D
S
2266 2764 P
N
2249 2764 M
2258 2764 D
2266 2773 D
S
N
2266 2782 M
2266 2773 D
2275 2764 D
S
N
2284 2764 M
2275 2764 D
2266 2756 D
S
N
2266 2747 M
2266 2756 D
2258 2764 D
S
2298 2760 P
N
2281 2760 M
2289 2760 D
2298 2768 D
S
N
2298 2777 M
2298 2768 D
2307 2760 D
S
N
2315 2760 M
2307 2760 D
2298 2751 D
S
N
2298 2742 M
2298 2751 D
2289 2760 D
S
2330 2822 P
N
2313 2822 M
2321 2822 D
2330 2830 D
S
N
2330 2839 M
2330 2830 D
2338 2822 D
S
N
2347 2822 M
2338 2822 D
2330 2813 D
S
N
2330 2804 M
2330 2813 D
2321 2822 D
S
2361 2805 P
N
2344 2805 M
2353 2805 D
2361 2814 D
S
N
2361 2823 M
2361 2814 D
2370 2805 D
S
N
2379 2805 M
2370 2805 D
2361 2797 D
S
N
2361 2788 M
2361 2797 D
2353 2805 D
S
2393 2821 P
N
2376 2821 M
2385 2821 D
2393 2829 D
S
N
2393 2838 M
2393 2829 D
2402 2821 D
S
N
2410 2821 M
2402 2821 D
2393 2812 D
S
N
2393 2804 M
2393 2812 D
2385 2821 D
S
2425 2791 P
N
2408 2791 M
2416 2791 D
2425 2800 D
S
N
2425 2809 M
2425 2800 D
2434 2791 D
S
N
2442 2791 M
2434 2791 D
2425 2783 D
S
N
2425 2774 M
2425 2783 D
2416 2791 D
S
2457 2758 P
N
2439 2758 M
2448 2758 D
2457 2767 D
S
N
2457 2775 M
2457 2767 D
2465 2758 D
S
N
2474 2758 M
2465 2758 D
2457 2749 D
S
N
2457 2741 M
2457 2749 D
2448 2758 D
S
2488 2748 P
N
2471 2748 M
2480 2748 D
2488 2757 D
S
N
2488 2765 M
2488 2757 D
2497 2748 D
S
N
2506 2748 M
2497 2748 D
2488 2739 D
S
N
2488 2731 M
2488 2739 D
2480 2748 D
S
2520 2756 P
N
2503 2756 M
2511 2756 D
2520 2765 D
S
N
2520 2774 M
2520 2765 D
2529 2756 D
S
N
2537 2756 M
2529 2756 D
2520 2748 D
S
N
2520 2739 M
2520 2748 D
2511 2756 D
S
2552 2759 P
N
2534 2759 M
2543 2759 D
2552 2767 D
S
N
2552 2776 M
2552 2767 D
2560 2759 D
S
N
2569 2759 M
2560 2759 D
2552 2750 D
S
N
2552 2742 M
2552 2750 D
2543 2759 D
S
2583 2748 P
N
2566 2748 M
2575 2748 D
2583 2757 D
S
N
2583 2765 M
2583 2757 D
2592 2748 D
S
N
2601 2748 M
2592 2748 D
2583 2739 D
S
N
2583 2731 M
2583 2739 D
2575 2748 D
S
2615 2760 P
N
2598 2760 M
2606 2760 D
2615 2768 D
S
N
2615 2777 M
2615 2768 D
2624 2760 D
S
N
2632 2760 M
2624 2760 D
2615 2751 D
S
N
2615 2742 M
2615 2751 D
2606 2760 D
S
2647 2768 P
N
2629 2768 M
2638 2768 D
2647 2777 D
S
N
2647 2785 M
2647 2777 D
2655 2768 D
S
N
2664 2768 M
2655 2768 D
2647 2759 D
S
N
2647 2751 M
2647 2759 D
2638 2768 D
S
2678 2745 P
N
2661 2745 M
2670 2745 D
2678 2754 D
S
N
2678 2762 M
2678 2754 D
2687 2745 D
S
N
2696 2745 M
2687 2745 D
2678 2736 D
S
N
2678 2728 M
2678 2736 D
2670 2745 D
S
2710 2739 P
N
2693 2739 M
2701 2739 D
2710 2747 D
S
N
2710 2756 M
2710 2747 D
2719 2739 D
S
N
2727 2739 M
2719 2739 D
2710 2730 D
S
N
2710 2721 M
2710 2730 D
2701 2739 D
S
2742 2760 P
N
2725 2760 M
2733 2760 D
2742 2769 D
S
N
2742 2778 M
2742 2769 D
2750 2760 D
S
N
2759 2760 M
2750 2760 D
2742 2752 D
S
N
2742 2743 M
2742 2752 D
2733 2760 D
S
2774 2730 P
N
2756 2730 M
2765 2730 D
2774 2739 D
S
N
2774 2747 M
2774 2739 D
2782 2730 D
S
N
2791 2730 M
2782 2730 D
2774 2721 D
S
N
2774 2713 M
2774 2721 D
2765 2730 D
S
2805 2707 P
N
2788 2707 M
2797 2707 D
2805 2716 D
S
N
2805 2724 M
2805 2716 D
2814 2707 D
S
N
2823 2707 M
2814 2707 D
2805 2698 D
S
N
2805 2690 M
2805 2698 D
2797 2707 D
S
2837 2726 P
N
2820 2726 M
2828 2726 D
2837 2735 D
S
N
2837 2744 M
2837 2735 D
2846 2726 D
S
N
2854 2726 M
2846 2726 D
2837 2718 D
S
N
2837 2709 M
2837 2718 D
2828 2726 D
S
2869 2763 P
N
2851 2763 M
2860 2763 D
2869 2772 D
S
N
2869 2781 M
2869 2772 D
2877 2763 D
S
N
2886 2763 M
2877 2763 D
2869 2755 D
S
N
2869 2746 M
2869 2755 D
2860 2763 D
S
2900 2715 P
N
2883 2715 M
2892 2715 D
2900 2723 D
S
N
2900 2732 M
2900 2723 D
2909 2715 D
S
N
2918 2715 M
2909 2715 D
2900 2706 D
S
N
2900 2697 M
2900 2706 D
2892 2715 D
S
2932 2706 P
N
2915 2706 M
2923 2706 D
2932 2715 D
S
N
2932 2723 M
2932 2715 D
2941 2706 D
S
N
2949 2706 M
2941 2706 D
2932 2697 D
S
N
2932 2689 M
2932 2697 D
2923 2706 D
S
2964 2682 P
N
2946 2682 M
2955 2682 D
2964 2691 D
S
N
2964 2699 M
2964 2691 D
2972 2682 D
S
N
2981 2682 M
2972 2682 D
2964 2673 D
S
N
2964 2665 M
2964 2673 D
2955 2682 D
S
2995 2679 P
N
2978 2679 M
2987 2679 D
2995 2688 D
S
N
2995 2696 M
2995 2688 D
3004 2679 D
S
N
3013 2679 M
3004 2679 D
2995 2670 D
S
N
2995 2662 M
2995 2670 D
2987 2679 D
S
3027 2629 P
N
3010 2629 M
3018 2629 D
3027 2637 D
S
N
3027 2646 M
3027 2637 D
3036 2629 D
S
N
3044 2629 M
3036 2629 D
3027 2620 D
S
N
3027 2611 M
3027 2620 D
3018 2629 D
S
3059 2620 P
N
3041 2620 M
3050 2620 D
3059 2629 D
S
N
3059 2637 M
3059 2629 D
3067 2620 D
S
N
3076 2620 M
3067 2620 D
3059 2611 D
S
N
3059 2603 M
3059 2611 D
3050 2620 D
S
3090 2622 P
N
3073 2622 M
3082 2622 D
3090 2630 D
S
N
3090 2639 M
3090 2630 D
3099 2622 D
S
N
3108 2622 M
3099 2622 D
3090 2613 D
S
N
3090 2604 M
3090 2613 D
3082 2622 D
S
3122 2616 P
N
3105 2616 M
3113 2616 D
3122 2625 D
S
N
3122 2634 M
3122 2625 D
3131 2616 D
S
N
3139 2616 M
3131 2616 D
3122 2608 D
S
N
3122 2599 M
3122 2608 D
3113 2616 D
S
3154 2563 P
N
3137 2563 M
3145 2563 D
3154 2571 D
S
N
3154 2580 M
3154 2571 D
3162 2563 D
S
N
3171 2563 M
3162 2563 D
3154 2554 D
S
N
3154 2545 M
3154 2554 D
3145 2563 D
S
3186 2539 P
N
3168 2539 M
3177 2539 D
3186 2548 D
S
N
3186 2557 M
3186 2548 D
3194 2539 D
S
N
3203 2539 M
3194 2539 D
3186 2531 D
S
N
3186 2522 M
3186 2531 D
3177 2539 D
S
3217 2565 P
N
3200 2565 M
3209 2565 D
3217 2574 D
S
N
3217 2582 M
3217 2574 D
3226 2565 D
S
N
3235 2565 M
3226 2565 D
3217 2556 D
S
N
3217 2548 M
3217 2556 D
3209 2565 D
S
3249 2570 P
N
3232 2570 M
3240 2570 D
3249 2578 D
S
N
3249 2587 M
3249 2578 D
3258 2570 D
S
N
3266 2570 M
3258 2570 D
3249 2561 D
S
N
3249 2552 M
3249 2561 D
3240 2570 D
S
3281 2524 P
N
3263 2524 M
3272 2524 D
3281 2533 D
S
N
3281 2541 M
3281 2533 D
3289 2524 D
S
N
3298 2524 M
3289 2524 D
3281 2515 D
S
N
3281 2507 M
3281 2515 D
3272 2524 D
S
3312 2533 P
N
3295 2533 M
3304 2533 D
3312 2541 D
S
N
3312 2550 M
3312 2541 D
3321 2533 D
S
N
3330 2533 M
3321 2533 D
3312 2524 D
S
N
3312 2515 M
3312 2524 D
3304 2533 D
S
3344 2546 P
N
3327 2546 M
3335 2546 D
3344 2555 D
S
N
3344 2564 M
3344 2555 D
3353 2546 D
S
N
3361 2546 M
3353 2546 D
3344 2538 D
S
N
3344 2529 M
3344 2538 D
3335 2546 D
S
3376 2531 P
N
3358 2531 M
3367 2531 D
3376 2540 D
S
N
3376 2548 M
3376 2540 D
3384 2531 D
S
N
3393 2531 M
3384 2531 D
3376 2522 D
S
N
3376 2514 M
3376 2522 D
3367 2531 D
S
3407 2470 P
N
3390 2470 M
3399 2470 D
3407 2478 D
S
N
3407 2487 M
3407 2478 D
3416 2470 D
S
N
3425 2470 M
3416 2470 D
3407 2461 D
S
N
3407 2452 M
3407 2461 D
3399 2470 D
S
3439 2473 P
N
3422 2473 M
3430 2473 D
3439 2481 D
S
N
3439 2490 M
3439 2481 D
3448 2473 D
S
N
3456 2473 M
3448 2473 D
3439 2464 D
S
N
3439 2456 M
3439 2464 D
3430 2473 D
S
3471 2443 P
N
3453 2443 M
3462 2443 D
3471 2452 D
S
N
3471 2461 M
3471 2452 D
3479 2443 D
S
N
3488 2443 M
3479 2443 D
3471 2435 D
S
N
3471 2426 M
3471 2435 D
3462 2443 D
S
3502 2477 P
N
3485 2477 M
3494 2477 D
3502 2486 D
S
N
3502 2495 M
3502 2486 D
3511 2477 D
S
N
3520 2477 M
3511 2477 D
3502 2469 D
S
N
3502 2460 M
3502 2469 D
3494 2477 D
S
3534 2436 P
N
3517 2436 M
3526 2436 D
3534 2445 D
S
N
3534 2454 M
3534 2445 D
3543 2436 D
S
N
3551 2436 M
3543 2436 D
3534 2428 D
S
N
3534 2419 M
3534 2428 D
3526 2436 D
S
3566 2403 P
N
3549 2403 M
3557 2403 D
3566 2412 D
S
N
3566 2420 M
3566 2412 D
3575 2403 D
S
N
3583 2403 M
3575 2403 D
3566 2394 D
S
N
3566 2386 M
3566 2394 D
3557 2403 D
S
3598 2476 P
N
3580 2476 M
3589 2476 D
3598 2485 D
S
N
3598 2493 M
3598 2485 D
3606 2476 D
S
N
3615 2476 M
3606 2476 D
3598 2467 D
S
N
3598 2459 M
3598 2467 D
3589 2476 D
S
3629 2372 P
N
3612 2372 M
3621 2372 D
3629 2381 D
S
N
3629 2389 M
3629 2381 D
3638 2372 D
S
N
3647 2372 M
3638 2372 D
3629 2363 D
S
N
3629 2355 M
3629 2363 D
3621 2372 D
S
3661 2371 P
N
3644 2371 M
3652 2371 D
3661 2379 D
S
N
3661 2388 M
3661 2379 D
3670 2371 D
S
N
3678 2371 M
3670 2371 D
3661 2362 D
S
N
3661 2353 M
3661 2362 D
3652 2371 D
S
3693 2379 P
N
3675 2379 M
3684 2379 D
3693 2388 D
S
N
3693 2396 M
3693 2388 D
3701 2379 D
S
N
3710 2379 M
3701 2379 D
3693 2370 D
S
N
3693 2362 M
3693 2370 D
3684 2379 D
S
3724 2374 P
N
3707 2374 M
3716 2374 D
3724 2383 D
S
N
3724 2392 M
3724 2383 D
3733 2374 D
S
N
3742 2374 M
3733 2374 D
3724 2366 D
S
N
3724 2357 M
3724 2366 D
3716 2374 D
S
3756 2386 P
N
3739 2386 M
3747 2386 D
3756 2395 D
S
N
3756 2403 M
3756 2395 D
3765 2386 D
S
N
3773 2386 M
3765 2386 D
3756 2377 D
S
N
3756 2369 M
3756 2377 D
3747 2386 D
S
3788 2357 P
N
3770 2357 M
3779 2357 D
3788 2366 D
S
N
3788 2375 M
3788 2366 D
3796 2357 D
S
N
3805 2357 M
3796 2357 D
3788 2349 D
S
N
3788 2340 M
3788 2349 D
3779 2357 D
S
3819 2293 P
N
3802 2293 M
3811 2293 D
3819 2302 D
S
N
3819 2310 M
3819 2302 D
3828 2293 D
S
N
3837 2293 M
3828 2293 D
3819 2284 D
S
N
3819 2276 M
3819 2284 D
3811 2293 D
S
3851 2338 P
N
3834 2338 M
3842 2338 D
3851 2347 D
S
N
3851 2355 M
3851 2347 D
3860 2338 D
S
N
3868 2338 M
3860 2338 D
3851 2329 D
S
N
3851 2321 M
3851 2329 D
3842 2338 D
S
3883 2247 P
N
3865 2247 M
3874 2247 D
3883 2255 D
S
N
3883 2264 M
3883 2255 D
3891 2247 D
S
N
3900 2247 M
3891 2247 D
3883 2238 D
S
N
3883 2229 M
3883 2238 D
3874 2247 D
S
3914 2359 P
N
3897 2359 M
3906 2359 D
3914 2368 D
S
N
3914 2376 M
3914 2368 D
3923 2359 D
S
N
3932 2359 M
3923 2359 D
3914 2350 D
S
N
3914 2342 M
3914 2350 D
3906 2359 D
S
3946 2285 P
N
3929 2285 M
3938 2285 D
3946 2294 D
S
N
3946 2303 M
3946 2294 D
3955 2285 D
S
N
3963 2285 M
3955 2285 D
3946 2277 D
S
N
3946 2268 M
3946 2277 D
3938 2285 D
S
3978 2271 P
N
3961 2271 M
3969 2271 D
3978 2279 D
S
N
3978 2288 M
3978 2279 D
3987 2271 D
S
N
3995 2271 M
3987 2271 D
3978 2262 D
S
N
3978 2253 M
3978 2262 D
3969 2271 D
S
4010 2285 P
N
3992 2285 M
4001 2285 D
4010 2294 D
S
N
4010 2303 M
4010 2294 D
4018 2285 D
S
N
4027 2285 M
4018 2285 D
4010 2277 D
S
N
4010 2268 M
4010 2277 D
4001 2285 D
S
4041 2223 P
N
4024 2223 M
4033 2223 D
4041 2231 D
S
N
4041 2240 M
4041 2231 D
4050 2223 D
S
N
4059 2223 M
4050 2223 D
4041 2214 D
S
N
4041 2205 M
4041 2214 D
4033 2223 D
S
4073 2264 P
N
4056 2264 M
4064 2264 D
4073 2273 D
S
N
4073 2282 M
4073 2273 D
4082 2264 D
S
N
4090 2264 M
4082 2264 D
4073 2256 D
S
N
4073 2247 M
4073 2256 D
4064 2264 D
S
4105 2216 P
N
4087 2216 M
4096 2216 D
4105 2224 D
S
N
4105 2233 M
4105 2224 D
4113 2216 D
S
N
4122 2216 M
4113 2216 D
4105 2207 D
S
N
4105 2198 M
4105 2207 D
4096 2216 D
S
4136 2158 P
N
4119 2158 M
4128 2158 D
4136 2167 D
S
N
4136 2175 M
4136 2167 D
4145 2158 D
S
N
4154 2158 M
4145 2158 D
4136 2150 D
S
N
4136 2141 M
4136 2150 D
4128 2158 D
S
4168 2242 P
N
4151 2242 M
4159 2242 D
4168 2251 D
S
N
4168 2259 M
4168 2251 D
4177 2242 D
S
N
4185 2242 M
4177 2242 D
4168 2233 D
S
N
4168 2225 M
4168 2233 D
4159 2242 D
S
4200 2160 P
N
4182 2160 M
4191 2160 D
4200 2169 D
S
N
4200 2178 M
4200 2169 D
4208 2160 D
S
N
4217 2160 M
4208 2160 D
4200 2152 D
S
N
4200 2143 M
4200 2152 D
4191 2160 D
S
4231 2193 P
N
4214 2193 M
4223 2193 D
4231 2202 D
S
N
4231 2210 M
4231 2202 D
4240 2193 D
S
N
4249 2193 M
4240 2193 D
4231 2184 D
S
N
4231 2176 M
4231 2184 D
4223 2193 D
S
4263 2150 P
N
4246 2150 M
4254 2150 D
4263 2159 D
S
N
4263 2168 M
4263 2159 D
4272 2150 D
S
N
4280 2150 M
4272 2150 D
4263 2142 D
S
N
4263 2133 M
4263 2142 D
4254 2150 D
S
4295 2149 P
N
4278 2149 M
4286 2149 D
4295 2158 D
S
N
4295 2166 M
4295 2158 D
4303 2149 D
S
N
4312 2149 M
4303 2149 D
4295 2140 D
S
N
4295 2132 M
4295 2140 D
4286 2149 D
S
4327 2174 P
N
4309 2174 M
4318 2174 D
4327 2182 D
S
N
4327 2191 M
4327 2182 D
4335 2174 D
S
N
4344 2174 M
4335 2174 D
4327 2165 D
S
N
4327 2156 M
4327 2165 D
4318 2174 D
S
4358 2113 P
N
4341 2113 M
4350 2113 D
4358 2122 D
S
N
4358 2131 M
4358 2122 D
4367 2113 D
S
N
4375 2113 M
4367 2113 D
4358 2105 D
S
N
4358 2096 M
4358 2105 D
4350 2113 D
S
4390 2123 P
N
4373 2123 M
4381 2123 D
4390 2131 D
S
N
4390 2140 M
4390 2131 D
4399 2123 D
S
N
4407 2123 M
4399 2123 D
4390 2114 D
S
N
4390 2105 M
4390 2114 D
4381 2123 D
S
4422 2047 P
N
4404 2047 M
4413 2047 D
4422 2055 D
S
N
4422 2064 M
4422 2055 D
4430 2047 D
S
N
4439 2047 M
4430 2047 D
4422 2038 D
S
N
4422 2029 M
4422 2038 D
4413 2047 D
S
0.00 0.00 1.00 setrgbcolor
1284 1057 P
N
1267 1040 M
1301 1074 D
S
N
1267 1074 M
1301 1040 D
S
1316 1212 P
N
1298 1195 M
1333 1230 D
S
N
1298 1230 M
1333 1195 D
S
1347 1323 P
N
1330 1305 M
1365 1340 D
S
N
1330 1340 M
1365 1305 D
S
1379 1476 P
N
1362 1459 M
1396 1493 D
S
N
1362 1493 M
1396 1459 D
S
1411 1664 P
N
1393 1647 M
1428 1681 D
S
N
1393 1681 M
1428 1647 D
S
1442 1704 P
N
1425 1687 M
1460 1721 D
S
N
1425 1721 M
1460 1687 D
S
1474 1819 P
N
1457 1801 M
1491 1836 D
S
N
1457 1836 M
1491 1801 D
S
1506 1962 P
N
1488 1945 M
1523 1979 D
S
N
1488 1979 M
1523 1945 D
S
1537 2000 P
N
1520 1983 M
1555 2017 D
S
N
1520 2017 M
1555 1983 D
S
1569 2103 P
N
1552 2086 M
1586 2120 D
S
N
1552 2120 M
1586 2086 D
S
1601 2138 P
N
1584 2121 M
1618 2155 D
S
N
1584 2155 M
1618 2121 D
S
1633 2108 P
N
1615 2090 M
1650 2125 D
S
N
1615 2125 M
1650 2090 D
S
1664 2267 P
N
1647 2249 M
1682 2284 D
S
N
1647 2284 M
1682 2249 D
S
1696 2391 P
N
1679 2374 M
1713 2409 D
S
N
1679 2409 M
1713 2374 D
S
1728 2347 P
N
1710 2330 M
1745 2365 D
S
N
1710 2365 M
1745 2330 D
S
1759 2419 P
N
1742 2402 M
1777 2437 D
S
N
1742 2437 M
1777 2402 D
S
1791 2465 P
N
1774 2448 M
1808 2482 D
S
N
1774 2482 M
1808 2448 D
S
1823 2499 P
N
1805 2482 M
1840 2516 D
S
N
1805 2516 M
1840 2482 D
S
1854 2587 P
N
1837 2569 M
1872 2604 D
S
N
1837 2604 M
1872 2569 D
S
1886 2677 P
N
1869 2660 M
1903 2695 D
S
N
1869 2695 M
1903 2660 D
S
1918 2683 P
N
1900 2666 M
1935 2700 D
S
N
1900 2700 M
1935 2666 D
S
1949 2769 P
N
1932 2752 M
1967 2786 D
S
N
1932 2786 M
1967 2752 D
S
1981 2791 P
N
1964 2774 M
1998 2809 D
S
N
1964 2809 M
1998 2774 D
S
2013 2777 P
N
1996 2760 M
2030 2795 D
S
N
1996 2795 M
2030 2760 D
S
2045 2796 P
N
2027 2779 M
2062 2813 D
S
N
2027 2813 M
2062 2779 D
S
2076 2845 P
N
2059 2828 M
2094 2862 D
S
N
2059 2862 M
2094 2828 D
S
2108 2844 P
N
2091 2827 M
2125 2861 D
S
N
2091 2861 M
2125 2827 D
S
2140 2964 P
N
2122 2947 M
2157 2982 D
S
N
2122 2982 M
2157 2947 D
S
2171 2870 P
N
2154 2853 M
2189 2888 D
S
N
2154 2888 M
2189 2853 D
S
2203 2926 P
N
2186 2909 M
2220 2944 D
S
N
2186 2944 M
2220 2909 D
S
2235 2989 P
N
2217 2972 M
2252 3006 D
S
N
2217 3006 M
2252 2972 D
S
2266 2932 P
N
2249 2915 M
2284 2950 D
S
N
2249 2950 M
2284 2915 D
S
2298 2981 P
N
2281 2964 M
2315 2999 D
S
N
2281 2999 M
2315 2964 D
S
2330 2992 P
N
2313 2975 M
2347 3009 D
S
N
2313 3009 M
2347 2975 D
S
2361 2980 P
N
2344 2962 M
2379 2997 D
S
N
2344 2997 M
2379 2962 D
S
2393 3028 P
N
2376 3010 M
2410 3045 D
S
N
2376 3045 M
2410 3010 D
S
2425 2997 P
N
2408 2979 M
2442 3014 D
S
N
2408 3014 M
2442 2979 D
S
2457 2939 P
N
2439 2921 M
2474 2956 D
S
N
2439 2956 M
2474 2921 D
S
2488 3004 P
N
2471 2986 M
2506 3021 D
S
N
2471 3021 M
2506 2986 D
S
2520 3011 P
N
2503 2994 M
2537 3029 D
S
N
2503 3029 M
2537 2994 D
S
2552 2982 P
N
2534 2965 M
2569 2999 D
S
N
2534 2999 M
2569 2965 D
S
2583 3061 P
N
2566 3044 M
2601 3078 D
S
N
2566 3078 M
2601 3044 D
S
2615 3039 P
N
2598 3021 M
2632 3056 D
S
N
2598 3056 M
2632 3021 D
S
2647 3034 P
N
2629 3017 M
2664 3051 D
S
N
2629 3051 M
2664 3017 D
S
2678 2936 P
N
2661 2919 M
2696 2954 D
S
N
2661 2954 M
2696 2919 D
S
2710 2971 P
N
2693 2954 M
2727 2988 D
S
N
2693 2988 M
2727 2954 D
S
2742 2960 P
N
2725 2942 M
2759 2977 D
S
N
2725 2977 M
2759 2942 D
S
2774 2943 P
N
2756 2926 M
2791 2961 D
S
N
2756 2961 M
2791 2926 D
S
2805 2964 P
N
2788 2947 M
2823 2982 D
S
N
2788 2982 M
2823 2947 D
S
2837 2939 P
N
2820 2921 M
2854 2956 D
S
N
2820 2956 M
2854 2921 D
S
2869 2943 P
N
2851 2925 M
2886 2960 D
S
N
2851 2960 M
2886 2925 D
S
2900 2985 P
N
2883 2968 M
2918 3002 D
S
N
2883 3002 M
2918 2968 D
S
2932 2946 P
N
2915 2929 M
2949 2964 D
S
N
2915 2964 M
2949 2929 D
S
2964 2844 P
N
2946 2827 M
2981 2861 D
S
N
2946 2861 M
2981 2827 D
S
2995 2905 P
N
2978 2888 M
3013 2923 D
S
N
2978 2923 M
3013 2888 D
S
3027 2867 P
N
3010 2849 M
3044 2884 D
S
N
3010 2884 M
3044 2849 D
S
3059 2843 P
N
3041 2826 M
3076 2861 D
S
N
3041 2861 M
3076 2826 D
S
3090 2862 P
N
3073 2845 M
3108 2879 D
S
N
3073 2879 M
3108 2845 D
S
3122 2842 P
N
3105 2824 M
3139 2859 D
S
N
3105 2859 M
3139 2824 D
S
3154 2856 P
N
3137 2839 M
3171 2874 D
S
N
3137 2874 M
3171 2839 D
S
3186 2870 P
N
3168 2852 M
3203 2887 D
S
N
3168 2887 M
3203 2852 D
S
3217 2874 P
N
3200 2857 M
3235 2892 D
S
N
3200 2892 M
3235 2857 D
S
3249 2778 P
N
3232 2761 M
3266 2796 D
S
N
3232 2796 M
3266 2761 D
S
3281 2715 P
N
3263 2698 M
3298 2733 D
S
N
3263 2733 M
3298 2698 D
S
3312 2751 P
N
3295 2734 M
3330 2768 D
S
N
3295 2768 M
3330 2734 D
S
3344 2710 P
N
3327 2693 M
3361 2727 D
S
N
3327 2727 M
3361 2693 D
S
3376 2694 P
N
3358 2677 M
3393 2712 D
S
N
3358 2712 M
3393 2677 D
S
3407 2726 P
N
3390 2709 M
3425 2744 D
S
N
3390 2744 M
3425 2709 D
S
3439 2706 P
N
3422 2689 M
3456 2723 D
S
N
3422 2723 M
3456 2689 D
S
3471 2610 P
N
3453 2593 M
3488 2627 D
S
N
3453 2627 M
3488 2593 D
S
3502 2647 P
N
3485 2630 M
3520 2665 D
S
N
3485 2665 M
3520 2630 D
S
3534 2677 P
N
3517 2659 M
3551 2694 D
S
N
3517 2694 M
3551 2659 D
S
3566 2636 P
N
3549 2619 M
3583 2654 D
S
N
3549 2654 M
3583 2619 D
S
3598 2596 P
N
3580 2579 M
3615 2613 D
S
N
3580 2613 M
3615 2579 D
S
3629 2608 P
N
3612 2590 M
3647 2625 D
S
N
3612 2625 M
3647 2590 D
S
3661 2596 P
N
3644 2579 M
3678 2613 D
S
N
3644 2613 M
3678 2579 D
S
3693 2537 P
N
3675 2520 M
3710 2554 D
S
N
3675 2554 M
3710 2520 D
S
3724 2495 P
N
3707 2478 M
3742 2513 D
S
N
3707 2513 M
3742 2478 D
S
3756 2564 P
N
3739 2547 M
3773 2582 D
S
N
3739 2582 M
3773 2547 D
S
3788 2546 P
N
3770 2529 M
3805 2564 D
S
N
3770 2564 M
3805 2529 D
S
3819 2514 P
N
3802 2497 M
3837 2531 D
S
N
3802 2531 M
3837 2497 D
S
3851 2479 P
N
3834 2462 M
3868 2496 D
S
N
3834 2496 M
3868 2462 D
S
3883 2513 P
N
3865 2496 M
3900 2530 D
S
N
3865 2530 M
3900 2496 D
S
3914 2507 P
N
3897 2490 M
3932 2524 D
S
N
3897 2524 M
3932 2490 D
S
3946 2459 P
N
3929 2442 M
3963 2476 D
S
N
3929 2476 M
3963 2442 D
S
3978 2442 P
N
3961 2425 M
3995 2459 D
S
N
3961 2459 M
3995 2425 D
S
4010 2422 P
N
3992 2404 M
4027 2439 D
S
N
3992 2439 M
4027 2404 D
S
4041 2422 P
N
4024 2405 M
4059 2440 D
S
N
4024 2440 M
4059 2405 D
S
4073 2438 P
N
4056 2421 M
4090 2455 D
S
N
4056 2455 M
4090 2421 D
S
4105 2345 P
N
4087 2328 M
4122 2362 D
S
N
4087 2362 M
4122 2328 D
S
4136 2344 P
N
4119 2327 M
4154 2361 D
S
N
4119 2361 M
4154 2327 D
S
4168 2295 P
N
4151 2278 M
4185 2313 D
S
N
4151 2313 M
4185 2278 D
S
4200 2366 P
N
4182 2349 M
4217 2383 D
S
N
4182 2383 M
4217 2349 D
S
4231 2332 P
N
4214 2314 M
4249 2349 D
S
N
4214 2349 M
4249 2314 D
S
4263 2280 P
N
4246 2263 M
4280 2297 D
S
N
4246 2297 M
4280 2263 D
S
4295 2310 P
N
4278 2293 M
4312 2327 D
S
N
4278 2327 M
4312 2293 D
S
4327 2216 P
N
4309 2199 M
4344 2234 D
S
N
4309 2234 M
4344 2199 D
S
4358 2264 P
N
4341 2246 M
4375 2281 D
S
N
4341 2281 M
4375 2246 D
S
4390 2254 P
N
4373 2236 M
4407 2271 D
S
N
4373 2271 M
4407 2236 D
S
4422 2277 P
N
4404 2259 M
4439 2294 D
S
N
4404 2294 M
4439 2259 D
S
1.00 0.00 1.00 setrgbcolor
1284 1020 P
N
1267 1020 M
1284 1003 D
1301 1020 D
1284 1038 D
1267 1020 D
S
1316 1121 P
N
1298 1121 M
1316 1104 D
1333 1121 D
1316 1138 D
1298 1121 D
S
1347 1177 P
N
1330 1177 M
1347 1159 D
1365 1177 D
1347 1194 D
1330 1177 D
S
1379 1271 P
N
1362 1271 M
1379 1254 D
1396 1271 D
1379 1288 D
1362 1271 D
S
1411 1345 P
N
1393 1345 M
1411 1328 D
1428 1345 D
1411 1362 D
1393 1345 D
S
1442 1430 P
N
1425 1430 M
1442 1413 D
1460 1430 D
1442 1448 D
1425 1430 D
S
1474 1506 P
N
1457 1506 M
1474 1489 D
1491 1506 D
1474 1523 D
1457 1506 D
S
1506 1618 P
N
1488 1618 M
1506 1600 D
1523 1618 D
1506 1635 D
1488 1618 D
S
1537 1696 P
N
1520 1696 M
1537 1678 D
1555 1696 D
1537 1713 D
1520 1696 D
S
1569 1728 P
N
1552 1728 M
1569 1711 D
1586 1728 D
1569 1746 D
1552 1728 D
S
1601 1808 P
N
1584 1808 M
1601 1791 D
1618 1808 D
1601 1825 D
1584 1808 D
S
1633 1889 P
N
1615 1889 M
1633 1872 D
1650 1889 D
1633 1907 D
1615 1889 D
S
1664 1999 P
N
1647 1999 M
1664 1981 D
1682 1999 D
1664 2016 D
1647 1999 D
S
1696 2026 P
N
1679 2026 M
1696 2008 D
1713 2026 D
1696 2043 D
1679 2026 D
S
1728 2062 P
N
1710 2062 M
1728 2045 D
1745 2062 D
1728 2079 D
1710 2062 D
S
1759 2166 P
N
1742 2166 M
1759 2149 D
1777 2166 D
1759 2183 D
1742 2166 D
S
1791 2194 P
N
1774 2194 M
1791 2177 D
1808 2194 D
1791 2211 D
1774 2194 D
S
1823 2287 P
N
1805 2287 M
1823 2270 D
1840 2287 D
1823 2304 D
1805 2287 D
S
1854 2348 P
N
1837 2348 M
1854 2331 D
1872 2348 D
1854 2365 D
1837 2348 D
S
1886 2339 P
N
1869 2339 M
1886 2321 D
1903 2339 D
1886 2356 D
1869 2339 D
S
1918 2388 P
N
1900 2388 M
1918 2371 D
1935 2388 D
1918 2406 D
1900 2388 D
S
1949 2436 P
N
1932 2436 M
1949 2419 D
1967 2436 D
1949 2454 D
1932 2436 D
S
1981 2476 P
N
1964 2476 M
1981 2459 D
1998 2476 D
1981 2493 D
1964 2476 D
S
2013 2526 P
N
1996 2526 M
2013 2509 D
2030 2526 D
2013 2544 D
1996 2526 D
S
2045 2587 P
N
2027 2587 M
2045 2569 D
2062 2587 D
2045 2604 D
2027 2587 D
S
2076 2537 P
N
2059 2537 M
2076 2520 D
2094 2537 D
2076 2554 D
2059 2537 D
S
2108 2569 P
N
2091 2569 M
2108 2552 D
2125 2569 D
2108 2586 D
2091 2569 D
S
2140 2596 P
N
2122 2596 M
2140 2579 D
2157 2596 D
2140 2613 D
2122 2596 D
S
2171 2633 P
N
2154 2633 M
2171 2616 D
2189 2633 D
2171 2651 D
2154 2633 D
S
2203 2644 P
N
2186 2644 M
2203 2627 D
2220 2644 D
2203 2661 D
2186 2644 D
S
2235 2626 P
N
2217 2626 M
2235 2608 D
2252 2626 D
2235 2643 D
2217 2626 D
S
2266 2705 P
N
2249 2705 M
2266 2688 D
2284 2705 D
2266 2723 D
2249 2705 D
S
2298 2676 P
N
2281 2676 M
2298 2659 D
2315 2676 D
2298 2693 D
2281 2676 D
S
2330 2676 P
N
2313 2676 M
2330 2659 D
2347 2676 D
2330 2693 D
2313 2676 D
S
2361 2710 P
N
2344 2710 M
2361 2693 D
2379 2710 D
2361 2727 D
2344 2710 D
S
2393 2683 P
N
2376 2683 M
2393 2666 D
2410 2683 D
2393 2700 D
2376 2683 D
S
2425 2755 P
N
2408 2755 M
2425 2738 D
2442 2755 D
2425 2772 D
2408 2755 D
S
2457 2698 P
N
2439 2698 M
2457 2680 D
2474 2698 D
2457 2715 D
2439 2698 D
S
2488 2694 P
N
2471 2694 M
2488 2677 D
2506 2694 D
2488 2712 D
2471 2694 D
S
2520 2716 P
N
2503 2716 M
2520 2699 D
2537 2716 D
2520 2733 D
2503 2716 D
S
2552 2738 P
N
2534 2738 M
2552 2721 D
2569 2738 D
2552 2755 D
2534 2738 D
S
2583 2653 P
N
2566 2653 M
2583 2636 D
2601 2653 D
2583 2671 D
2566 2653 D
S
2615 2707 P
N
2598 2707 M
2615 2690 D
2632 2707 D
2615 2724 D
2598 2707 D
S
2647 2701 P
N
2629 2701 M
2647 2684 D
2664 2701 D
2647 2719 D
2629 2701 D
S
2678 2697 P
N
2661 2697 M
2678 2680 D
2696 2697 D
2678 2714 D
2661 2697 D
S
2710 2683 P
N
2693 2683 M
2710 2666 D
2727 2683 D
2710 2700 D
2693 2683 D
S
2742 2688 P
N
2725 2688 M
2742 2670 D
2759 2688 D
2742 2705 D
2725 2688 D
S
2774 2699 P
N
2756 2699 M
2774 2682 D
2791 2699 D
2774 2716 D
2756 2699 D
S
2805 2722 P
N
2788 2722 M
2805 2705 D
2823 2722 D
2805 2740 D
2788 2722 D
S
2837 2637 P
N
2820 2637 M
2837 2620 D
2854 2637 D
2837 2654 D
2820 2637 D
S
2869 2649 P
N
2851 2649 M
2869 2631 D
2886 2649 D
2869 2666 D
2851 2649 D
S
2900 2672 P
N
2883 2672 M
2900 2655 D
2918 2672 D
2900 2689 D
2883 2672 D
S
2932 2626 P
N
2915 2626 M
2932 2609 D
2949 2626 D
2932 2644 D
2915 2626 D
S
2964 2659 P
N
2946 2659 M
2964 2642 D
2981 2659 D
2964 2676 D
2946 2659 D
S
2995 2558 P
N
2978 2558 M
2995 2541 D
3013 2558 D
2995 2575 D
2978 2558 D
S
3027 2544 P
N
3010 2544 M
3027 2527 D
3044 2544 D
3027 2561 D
3010 2544 D
S
3059 2603 P
N
3041 2603 M
3059 2586 D
3076 2603 D
3059 2620 D
3041 2603 D
S
3090 2552 P
N
3073 2552 M
3090 2535 D
3108 2552 D
3090 2569 D
3073 2552 D
S
3122 2551 P
N
3105 2551 M
3122 2534 D
3139 2551 D
3122 2568 D
3105 2551 D
S
3154 2616 P
N
3137 2616 M
3154 2599 D
3171 2616 D
3154 2634 D
3137 2616 D
S
3186 2546 P
N
3168 2546 M
3186 2528 D
3203 2546 D
3186 2563 D
3168 2546 D
S
3217 2568 P
N
3200 2568 M
3217 2551 D
3235 2568 D
3217 2585 D
3200 2568 D
S
3249 2493 P
N
3232 2493 M
3249 2476 D
3266 2493 D
3249 2510 D
3232 2493 D
S
3281 2531 P
N
3263 2531 M
3281 2514 D
3298 2531 D
3281 2548 D
3263 2531 D
S
3312 2530 P
N
3295 2530 M
3312 2513 D
3330 2530 D
3312 2547 D
3295 2530 D
S
3344 2484 P
N
3327 2484 M
3344 2466 D
3361 2484 D
3344 2501 D
3327 2484 D
S
3376 2460 P
N
3358 2460 M
3376 2443 D
3393 2460 D
3376 2478 D
3358 2460 D
S
3407 2464 P
N
3390 2464 M
3407 2446 D
3425 2464 D
3407 2481 D
3390 2464 D
S
3439 2408 P
N
3422 2408 M
3439 2390 D
3456 2408 D
3439 2425 D
3422 2408 D
S
3471 2505 P
N
3453 2505 M
3471 2487 D
3488 2505 D
3471 2522 D
3453 2505 D
S
3502 2484 P
N
3485 2484 M
3502 2466 D
3520 2484 D
3502 2501 D
3485 2484 D
S
3534 2450 P
N
3517 2450 M
3534 2433 D
3551 2450 D
3534 2468 D
3517 2450 D
S
3566 2395 P
N
3549 2395 M
3566 2378 D
3583 2395 D
3566 2413 D
3549 2395 D
S
3598 2400 P
N
3580 2400 M
3598 2383 D
3615 2400 D
3598 2417 D
3580 2400 D
S
3629 2352 P
N
3612 2352 M
3629 2335 D
3647 2352 D
3629 2369 D
3612 2352 D
S
3661 2337 P
N
3644 2337 M
3661 2320 D
3678 2337 D
3661 2355 D
3644 2337 D
S
3693 2341 P
N
3675 2341 M
3693 2324 D
3710 2341 D
3693 2358 D
3675 2341 D
S
3724 2364 P
N
3707 2364 M
3724 2346 D
3742 2364 D
3724 2381 D
3707 2364 D
S
3756 2358 P
N
3739 2358 M
3756 2341 D
3773 2358 D
3756 2375 D
3739 2358 D
S
3788 2320 P
N
3770 2320 M
3788 2303 D
3805 2320 D
3788 2337 D
3770 2320 D
S
3819 2302 P
N
3802 2302 M
3819 2284 D
3837 2302 D
3819 2319 D
3802 2302 D
S
3851 2301 P
N
3834 2301 M
3851 2283 D
3868 2301 D
3851 2318 D
3834 2301 D
S
3883 2315 P
N
3865 2315 M
3883 2297 D
3900 2315 D
3883 2332 D
3865 2315 D
S
3914 2301 P
N
3897 2301 M
3914 2283 D
3932 2301 D
3914 2318 D
3897 2301 D
S
3946 2297 P
N
3929 2297 M
3946 2280 D
3963 2297 D
3946 2314 D
3929 2297 D
S
3978 2282 P
N
3961 2282 M
3978 2265 D
3995 2282 D
3978 2299 D
3961 2282 D
S
4010 2239 P
N
3992 2239 M
4010 2221 D
4027 2239 D
4010 2256 D
3992 2239 D
S
4041 2280 P
N
4024 2280 M
4041 2263 D
4059 2280 D
4041 2297 D
4024 2280 D
S
4073 2264 P
N
4056 2264 M
4073 2246 D
4090 2264 D
4073 2281 D
4056 2264 D
S
4105 2186 P
N
4087 2186 M
4105 2169 D
4122 2186 D
4105 2203 D
4087 2186 D
S
4136 2194 P
N
4119 2194 M
4136 2177 D
4154 2194 D
4136 2211 D
4119 2194 D
S
4168 2198 P
N
4151 2198 M
4168 2180 D
4185 2198 D
4168 2215 D
4151 2198 D
S
4200 2198 P
N
4182 2198 M
4200 2180 D
4217 2198 D
4200 2215 D
4182 2198 D
S
4231 2160 P
N
4214 2160 M
4231 2143 D
4249 2160 D
4231 2178 D
4214 2160 D
S
4263 2122 P
N
4246 2122 M
4263 2104 D
4280 2122 D
4263 2139 D
4246 2122 D
S
4295 2150 P
N
4278 2150 M
4295 2133 D
4312 2150 D
4295 2168 D
4278 2150 D
S
4327 2175 P
N
4309 2175 M
4327 2158 D
4344 2175 D
4327 2193 D
4309 2175 D
S
4358 2147 P
N
4341 2147 M
4358 2130 D
4375 2147 D
4358 2165 D
4341 2147 D
S
4390 2090 P
N
4373 2090 M
4390 2073 D
4407 2090 D
4390 2107 D
4373 2090 D
S
4422 2140 P
N
4404 2140 M
4422 2122 D
4439 2140 D
4422 2157 D
4404 2140 D
S
0.00 1.00 0.00 setrgbcolor
1284 1041 P
N
1267 1024 M
1301 1024 D
1301 1059 D
1267 1059 D
1267 1024 D
S
1316 1173 P
N
1298 1156 M
1333 1156 D
1333 1190 D
1298 1190 D
1298 1156 D
S
1347 1310 P
N
1330 1293 M
1365 1293 D
1365 1328 D
1330 1328 D
1330 1293 D
S
1379 1465 P
N
1362 1448 M
1396 1448 D
1396 1483 D
1362 1483 D
1362 1448 D
S
1411 1582 P
N
1393 1565 M
1428 1565 D
1428 1600 D
1393 1600 D
1393 1565 D
S
1442 1677 P
N
1425 1660 M
1460 1660 D
1460 1694 D
1425 1694 D
1425 1660 D
S
1474 1851 P
N
1457 1834 M
1491 1834 D
1491 1869 D
1457 1869 D
1457 1834 D
S
1506 1912 P
N
1488 1895 M
1523 1895 D
1523 1929 D
1488 1929 D
1488 1895 D
S
1537 2042 P
N
1520 2024 M
1555 2024 D
1555 2059 D
1520 2059 D
1520 2024 D
S
1569 2149 P
N
1552 2132 M
1586 2132 D
1586 2167 D
1552 2167 D
1552 2132 D
S
1601 2204 P
N
1584 2187 M
1618 2187 D
1618 2221 D
1584 2221 D
1584 2187 D
S
1633 2283 P
N
1615 2266 M
1650 2266 D
1650 2300 D
1615 2300 D
1615 2266 D
S
1664 2409 P
N
1647 2392 M
1682 2392 D
1682 2427 D
1647 2427 D
1647 2392 D
S
1696 2518 P
N
1679 2500 M
1713 2500 D
1713 2535 D
1679 2535 D
1679 2500 D
S
1728 2579 P
N
1710 2562 M
1745 2562 D
1745 2596 D
1710 2596 D
1710 2562 D
S
1759 2676 P
N
1742 2658 M
1777 2658 D
1777 2693 D
1742 2693 D
1742 2658 D
S
1791 2649 P
N
1774 2632 M
1808 2632 D
1808 2667 D
1774 2667 D
1774 2632 D
S
1823 2683 P
N
1805 2666 M
1840 2666 D
1840 2701 D
1805 2701 D
1805 2666 D
S
1854 2789 P
N
1837 2772 M
1872 2772 D
1872 2807 D
1837 2807 D
1837 2772 D
S
1886 2800 P
N
1869 2782 M
1903 2782 D
1903 2817 D
1869 2817 D
1869 2782 D
S
1918 2848 P
N
1900 2831 M
1935 2831 D
1935 2866 D
1900 2866 D
1900 2831 D
S
1949 2933 P
N
1932 2916 M
1967 2916 D
1967 2950 D
1932 2950 D
1932 2916 D
S
1981 2931 P
N
1964 2914 M
1998 2914 D
1998 2949 D
1964 2949 D
1964 2914 D
S
2013 2949 P
N
1996 2931 M
2030 2931 D
2030 2966 D
1996 2966 D
1996 2931 D
S
2045 2921 P
N
2027 2904 M
2062 2904 D
2062 2938 D
2027 2938 D
2027 2904 D
S
2076 3070 P
N
2059 3053 M
2094 3053 D
2094 3087 D
2059 3087 D
2059 3053 D
S
2108 2940 P
N
2091 2923 M
2125 2923 D
2125 2957 D
2091 2957 D
2091 2923 D
S
2140 2973 P
N
2122 2956 M
2157 2956 D
2157 2990 D
2122 2990 D
2122 2956 D
S
2171 3006 P
N
2154 2988 M
2189 2988 D
2189 3023 D
2154 3023 D
2154 2988 D
S
2203 2968 P
N
2186 2950 M
2220 2950 D
2220 2985 D
2186 2985 D
2186 2950 D
S
2235 3054 P
N
2217 3037 M
2252 3037 D
2252 3072 D
2217 3072 D
2217 3037 D
S
2266 3011 P
N
2249 2994 M
2284 2994 D
2284 3028 D
2249 3028 D
2249 2994 D
S
2298 2994 P
N
2281 2976 M
2315 2976 D
2315 3011 D
2281 3011 D
2281 2976 D
S
2330 2997 P
N
2313 2980 M
2347 2980 D
2347 3014 D
2313 3014 D
2313 2980 D
S
2361 3011 P
N
2344 2994 M
2379 2994 D
2379 3028 D
2344 3028 D
2344 2994 D
S
2393 2943 P
N
2376 2926 M
2410 2926 D
2410 2961 D
2376 2961 D
2376 2926 D
S
2425 2980 P
N
2408 2962 M
2442 2962 D
2442 2997 D
2408 2997 D
2408 2962 D
S
2457 2985 P
N
2439 2968 M
2474 2968 D
2474 3002 D
2439 3002 D
2439 2968 D
S
2488 2971 P
N
2471 2954 M
2506 2954 D
2506 2988 D
2471 2988 D
2471 2954 D
S
2520 3032 P
N
2503 3014 M
2537 3014 D
2537 3049 D
2503 3049 D
2503 3014 D
S
2552 2897 P
N
2534 2879 M
2569 2879 D
2569 2914 D
2534 2914 D
2534 2879 D
S
2583 2945 P
N
2566 2928 M
2601 2928 D
2601 2962 D
2566 2962 D
2566 2928 D
S
2615 2956 P
N
2598 2938 M
2632 2938 D
2632 2973 D
2598 2973 D
2598 2938 D
S
2647 2904 P
N
2629 2886 M
2664 2886 D
2664 2921 D
2629 2921 D
2629 2886 D
S
2678 2876 P
N
2661 2859 M
2696 2859 D
2696 2893 D
2661 2893 D
2661 2859 D
S
2710 2962 P
N
2693 2945 M
2727 2945 D
2727 2980 D
2693 2980 D
2693 2945 D
S
2742 2829 P
N
2725 2812 M
2759 2812 D
2759 2846 D
2725 2846 D
2725 2812 D
S
2774 2878 P
N
2756 2860 M
2791 2860 D
2791 2895 D
2756 2895 D
2756 2860 D
S
2805 2904 P
N
2788 2886 M
2823 2886 D
2823 2921 D
2788 2921 D
2788 2886 D
S
2837 2824 P
N
2820 2807 M
2854 2807 D
2854 2841 D
2820 2841 D
2820 2807 D
S
2869 2774 P
N
2851 2756 M
2886 2756 D
2886 2791 D
2851 2791 D
2851 2756 D
S
2900 2796 P
N
2883 2779 M
2918 2779 D
2918 2814 D
2883 2814 D
2883 2779 D
S
2932 2810 P
N
2915 2793 M
2949 2793 D
2949 2827 D
2915 2827 D
2915 2793 D
S
2964 2689 P
N
2946 2672 M
2981 2672 D
2981 2707 D
2946 2707 D
2946 2672 D
S
2995 2697 P
N
2978 2680 M
3013 2680 D
3013 2715 D
2978 2715 D
2978 2680 D
S
3027 2705 P
N
3010 2688 M
3044 2688 D
3044 2722 D
3010 2722 D
3010 2688 D
S
3059 2692 P
N
3041 2675 M
3076 2675 D
3076 2709 D
3041 2709 D
3041 2675 D
S
3090 2677 P
N
3073 2660 M
3108 2660 D
3108 2695 D
3073 2695 D
3073 2660 D
S
3122 2651 P
N
3105 2633 M
3139 2633 D
3139 2668 D
3105 2668 D
3105 2633 D
S
3154 2625 P
N
3137 2608 M
3171 2608 D
3171 2643 D
3137 2643 D
3137 2608 D
S
3186 2662 P
N
3168 2644 M
3203 2644 D
3203 2679 D
3168 2679 D
3168 2644 D
S
3217 2635 P
N
3200 2618 M
3235 2618 D
3235 2652 D
3200 2652 D
3200 2618 D
S
3249 2567 P
N
3232 2550 M
3266 2550 D
3266 2584 D
3232 2584 D
3232 2550 D
S
3281 2535 P
N
3263 2518 M
3298 2518 D
3298 2553 D
3263 2553 D
3263 2518 D
S
3312 2574 P
N
3295 2557 M
3330 2557 D
3330 2591 D
3295 2591 D
3295 2557 D
S
3344 2572 P
N
3327 2554 M
3361 2554 D
3361 2589 D
3327 2589 D
3327 2554 D
S
3376 2543 P
N
3358 2526 M
3393 2526 D
3393 2561 D
3358 2561 D
3358 2526 D
S
3407 2555 P
N
3390 2538 M
3425 2538 D
3425 2573 D
3390 2573 D
3390 2538 D
S
3439 2531 P
N
3422 2513 M
3456 2513 D
3456 2548 D
3422 2548 D
3422 2513 D
S
3471 2525 P
N
3453 2507 M
3488 2507 D
3488 2542 D
3453 2542 D
3453 2507 D
S
3502 2505 P
N
3485 2488 M
3520 2488 D
3520 2523 D
3485 2523 D
3485 2488 D
S
3534 2444 P
N
3517 2427 M
3551 2427 D
3551 2461 D
3517 2461 D
3517 2427 D
S
3566 2483 P
N
3549 2465 M
3583 2465 D
3583 2500 D
3549 2500 D
3549 2465 D
S
3598 2415 P
N
3580 2398 M
3615 2398 D
3615 2432 D
3580 2432 D
3580 2398 D
S
3629 2435 P
N
3612 2417 M
3647 2417 D
3647 2452 D
3612 2452 D
3612 2417 D
S
3661 2405 P
N
3644 2388 M
3678 2388 D
3678 2423 D
3644 2423 D
3644 2388 D
S
3693 2415 P
N
3675 2398 M
3710 2398 D
3710 2432 D
3675 2432 D
3675 2398 D
S
3724 2390 P
N
3707 2372 M
3742 2372 D
3742 2407 D
3707 2407 D
3707 2372 D
S
3756 2341 P
N
3739 2324 M
3773 2324 D
3773 2358 D
3739 2358 D
3739 2324 D
S
3788 2302 P
N
3770 2285 M
3805 2285 D
3805 2320 D
3770 2320 D
3770 2285 D
S
3819 2302 P
N
3802 2284 M
3837 2284 D
3837 2319 D
3802 2319 D
3802 2284 D
S
3851 2340 P
N
3834 2322 M
3868 2322 D
3868 2357 D
3834 2357 D
3834 2322 D
S
3883 2325 P
N
3865 2308 M
3900 2308 D
3900 2342 D
3865 2342 D
3865 2308 D
S
3914 2293 P
N
3897 2276 M
3932 2276 D
3932 2310 D
3897 2310 D
3897 2276 D
S
3946 2314 P
N
3929 2297 M
3963 2297 D
3963 2331 D
3929 2331 D
3929 2297 D
S
3978 2301 P
N
3961 2284 M
3995 2284 D
3995 2318 D
3961 2318 D
3961 2284 D
S
4010 2271 P
N
3992 2254 M
4027 2254 D
4027 2288 D
3992 2288 D
3992 2254 D
S
4041 2209 P
N
4024 2191 M
4059 2191 D
4059 2226 D
4024 2226 D
4024 2191 D
S
4073 2203 P
N
4056 2186 M
4090 2186 D
4090 2221 D
4056 2221 D
4056 2186 D
S
4105 2217 P
N
4087 2199 M
4122 2199 D
4122 2234 D
4087 2234 D
4087 2199 D
S
4136 2225 P
N
4119 2208 M
4154 2208 D
4154 2242 D
4119 2242 D
4119 2208 D
S
4168 2174 P
N
4151 2157 M
4185 2157 D
4185 2192 D
4151 2192 D
4151 2157 D
S
4200 2151 P
N
4182 2133 M
4217 2133 D
4217 2168 D
4182 2168 D
4182 2133 D
S
4231 2135 P
N
4214 2118 M
4249 2118 D
4249 2153 D
4214 2153 D
4214 2118 D
S
4263 2163 P
N
4246 2146 M
4280 2146 D
4280 2181 D
4246 2181 D
4246 2146 D
S
4295 2130 P
N
4278 2113 M
4312 2113 D
4312 2147 D
4278 2147 D
4278 2113 D
S
4327 2112 P
N
4309 2095 M
4344 2095 D
4344 2130 D
4309 2130 D
4309 2095 D
S
4358 2114 P
N
4341 2097 M
4375 2097 D
4375 2132 D
4341 2132 D
4341 2097 D
S
4390 2095 P
N
4373 2078 M
4407 2078 D
4407 2112 D
4373 2112 D
4373 2078 D
S
4422 2090 P
N
4404 2072 M
4439 2072 D
4439 2107 D
4404 2107 D
4404 2072 D
S
showpage
%%Trailer
%%Pages: 1
%%BoundingBox:
