%!PS-Adobe-2.0 EPSF-2.0
%%BoundingBox:  0 0 567 544
%%Title: YRHXS_PDF_11.eps: NNLO2008nnlo
%%Creator: ROOT Version 5.27/06
%%CreationDate: Mon Nov 22 18:19:19 2010
%%EndComments
%%BeginProlog
80 dict begin
/s {stroke} def /l {lineto} def /m {moveto} def /t {translate} def
/r {rotate} def /rl {roll}  def /R {repeat} def
/d {rlineto} def /rm {rmoveto} def /gr {grestore} def /f {eofill} def
/c {setrgbcolor} def /black {0 setgray} def /sd {setdash} def
/cl {closepath} def /sf {scalefont setfont} def /lw {setlinewidth} def
/box {m dup 0 exch d exch 0 d 0 exch neg d cl} def
/NC{systemdict begin initclip end}def/C{NC box clip newpath}def
/bl {box s} def /bf {box f} def /Y { 0 exch d} def /X { 0 d} def 
/K {{pop pop 0 moveto} exch kshow} bind def
/ita {/ang 15 def gsave [1 0 ang dup sin exch cos div 1 0 0] concat} def 
/mp {newpath /y exch def /x exch def} def
/side {[w .77 mul w .23 mul] .385 w mul sd w 0 l currentpoint t -144 r} def
/mr {mp x y w2 0 360 arc} def /m24 {mr s} def /m20 {mr f} def
/mb {mp x y w2 add m w2 neg 0 d 0 w neg d w 0 d 0 w d cl} def
/mt {mp x y w2 add m w2 neg w neg d w 0 d cl} def
/m21 {mb f} def /m25 {mb s} def /m22 {mt f} def /m26{mt s} def
/m23 {mp x y w2 sub m w2 w d w neg 0 d cl f} def
/m27 {mp x y w2 add m w3 neg w2 neg d w3 w2 neg d w3 w2 d cl s} def
/m28 {mp x w2 sub y w2 sub w3 add m w3 0 d  0 w3 neg d w3 0 d 0 w3 d w3 0 d  0 w3 d w3 neg 0 d 0 w3 d w3 neg 0 d 0 w3 neg d w3 neg 0 d cl s } def
/m29 {mp gsave x w2 sub y w2 add w3 sub m currentpoint t 4 {side} repeat cl fill gr} def
/m30 {mp gsave x w2 sub y w2 add w3 sub m currentpoint t 4 {side} repeat cl s gr} def
/m31 {mp x y w2 sub m 0 w d x w2 sub y m w 0 d x w2 sub y w2 add m w w neg d x w2 sub y w2 sub m w w d s} def
/m32 {mp x y w2 sub m w2 w d w neg 0 d cl s} def
/m33 {mp x y w2 add m w3 neg w2 neg d w3 w2 neg d w3 w2 d cl f} def
/m34 {mp x w2 sub y w2 sub w3 add m w3 0 d  0 w3 neg d w3 0 d 0 w3 d w3 0 d  0 w3 d w3 neg 0 d 0 w3 d w3 neg 0 d 0 w3 neg d w3 neg 0 d cl f } def
/m2 {mp x y w2 sub m 0 w d x w2 sub y m w 0 d s} def
/m5 {mp x w2 sub y w2 sub m w w d x w2 sub y w2 add m w w neg d s} def
/reEncode {exch findfont dup length dict begin {1 index /FID eq  {pop pop} {def} ifelse } forall /Encoding exch def currentdict end dup /FontName get exch definefont pop } def [/Times-Bold /Times-Italic /Times-BoldItalic /Helvetica /Helvetica-Oblique
 /Helvetica-Bold /Helvetica-BoldOblique /Courier /Courier-Oblique /Courier-Bold /Courier-BoldOblique /Times-Roman /AvantGarde-Book /AvantGarde-BookOblique /AvantGarde-Demi /AvantGarde-DemiOblique /Bookman-Demi /Bookman-DemiItalic /Bookman-Light
 /Bookman-LightItalic /Helvetica-Narrow /Helvetica-Narrow-Bold /Helvetica-Narrow-BoldOblique /Helvetica-Narrow-Oblique /NewCenturySchlbk-Roman /NewCenturySchlbk-Bold /NewCenturySchlbk-BoldItalic /NewCenturySchlbk-Italic /Palatino-Bold
 /Palatino-BoldItalic /Palatino-Italic /Palatino-Roman ] {ISOLatin1Encoding reEncode } forall%%EndProlog
%%BeginSetup
%%EndSetup
newpath  gsave  .25 .25 scale  gsave  0 0 t black[  ] 0 sd 3 lw 1 1 1 c 2268 2176 0 0 bf black 1 1 1 c 1791 1720 363 348 bf black 1791 1720 363 348 bl 363 348 m 1791 X s 363 2068 m 1791 X s 363 348 m 1720 Y s[ 4 8] 0 sd 2154 348 m -1791 X s 2154 520
 m -1791 X s 2154 692 m -1791 X s 2154 864 m -1791 X s 2154 1036 m -1791 X s 2154 1208 m -1791 X s 2154 1380 m -1791 X s 2154 1552 m -1791 X s 2154 1724 m -1791 X s 2154 1896 m -1791 X s 2154 2068 m -1791 X s[  ] 0 sd 2154 348 m 1720 Y s 6 lw 1 1 1 c
 black 363 348 m 1791 X s 3 lw 363 348 m 1791 X s
 gsave  2268 2176 0 0 C 1869.19 81.25 t 0 r /Helvetica findfont 102.732 sf 0 0 m ( [GeV]) show NC gr 
 gsave  2268 2176 0 0 C 1823.5 54.625 t 0 r /Helvetica findfont 68.4881 sf 0 0 m (H) show NC gr 
 gsave  2268 2176 0 0 C 1743.62 81.25 t 0 r /Helvetica findfont 102.732 sf 0 0 m (M) show NC gr  363 400 m -52 Y s 408 374 m -26 Y s 452 374 m -26 Y s 497 374 m -26 Y s 542 374 m -26 Y s 587 400 m -52 Y s 632 374 m -26 Y s 676 374 m -26 Y s 721 374 m
 -26 Y s 766 374 m -26 Y s 811 400 m -52 Y s 855 374 m -26 Y s 900 374 m -26 Y s 945 374 m -26 Y s 990 374 m -26 Y s 1035 400 m -52 Y s 1079 374 m -26 Y s 1124 374 m -26 Y s 1169 374 m -26 Y s 1214 374 m -26 Y s 1259 400 m -52 Y s 1303 374 m -26 Y s
 1348 374 m -26 Y s 1393 374 m -26 Y s 1438 374 m -26 Y s 1483 400 m -52 Y s 1527 374 m -26 Y s 1572 374 m -26 Y s 1617 374 m -26 Y s 1662 374 m -26 Y s 1706 400 m -52 Y s 1751 374 m -26 Y s 1796 374 m -26 Y s 1841 374 m -26 Y s 1886 374 m -26 Y s
 1930 400 m -52 Y s 1975 374 m -26 Y s 2020 374 m -26 Y s 2065 374 m -26 Y s 2110 374 m -26 Y s 2154 400 m -52 Y s
 gsave  2268 2176 0 0 C 278.75 252.5 t 0 r /Helvetica findfont 102.732 sf 0 0 m (100) show NC gr 
 gsave  2268 2176 0 0 C 503.25 252.5 t 0 r /Helvetica findfont 102.732 sf 0 0 m (150) show NC gr 
 gsave  2268 2176 0 0 C 727.688 252.5 t 0 r /Helvetica findfont 102.732 sf 0 0 m (200) show NC gr 
 gsave  2268 2176 0 0 C 948.375 252.5 t 0 r /Helvetica findfont 102.732 sf 0 0 m (250) show NC gr 
 gsave  2268 2176 0 0 C 1172.88 252.5 t 0 r /Helvetica findfont 102.732 sf 0 0 m (300) show NC gr 
 gsave  2268 2176 0 0 C 1397.38 252.5 t 0 r /Helvetica findfont 102.732 sf 0 0 m (350) show NC gr 
 gsave  2268 2176 0 0 C 1621.88 252.5 t 0 r /Helvetica findfont 102.732 sf 0 0 m (400) show NC gr 
 gsave  2268 2176 0 0 C 1846.38 252.5 t 0 r /Helvetica findfont 102.732 sf 0 0 m (450) show NC gr 
 gsave  2268 2176 0 0 C 2070.81 252.5 t 0 r /Helvetica findfont 102.732 sf 0 0 m (500) show NC gr  363 2068 m 1791 X s 363 2016 m 52 Y s 408 2042 m 26 Y s 452 2042 m 26 Y s 497 2042 m 26 Y s 542 2042 m 26 Y s 587 2016 m 52 Y s 632 2042 m 26 Y s 676
 2042 m 26 Y s 721 2042 m 26 Y s 766 2042 m 26 Y s 811 2016 m 52 Y s 855 2042 m 26 Y s 900 2042 m 26 Y s 945 2042 m 26 Y s 990 2042 m 26 Y s 1035 2016 m 52 Y s 1079 2042 m 26 Y s 1124 2042 m 26 Y s 1169 2042 m 26 Y s 1214 2042 m 26 Y s 1259 2016 m 52
 Y s 1303 2042 m 26 Y s 1348 2042 m 26 Y s 1393 2042 m 26 Y s 1438 2042 m 26 Y s 1483 2016 m 52 Y s 1527 2042 m 26 Y s 1572 2042 m 26 Y s 1617 2042 m 26 Y s 1662 2042 m 26 Y s 1706 2016 m 52 Y s 1751 2042 m 26 Y s 1796 2042 m 26 Y s 1841 2042 m 26 Y
 s 1886 2042 m 26 Y s 1930 2016 m 52 Y s 1975 2042 m 26 Y s 2020 2042 m 26 Y s 2065 2042 m 26 Y s 2110 2042 m 26 Y s 2154 2016 m 52 Y s 363 348 m 1720 Y s
 gsave  2268 2176 0 0 C 149.375 1995.12 t 90 r /Helvetica findfont 102.732 sf 0 0 m (R) show NC gr  417 348 m -54 X s 390 383 m -27 X s 390 417 m -27 X s 390 451 m -27 X s 390 486 m -27 X s 417 520 m -54 X s 390 555 m -27 X s 390 589 m -27 X s 390
 623 m -27 X s 390 658 m -27 X s 417 692 m -54 X s 390 726 m -27 X s 390 761 m -27 X s 390 795 m -27 X s 390 830 m -27 X s 417 864 m -54 X s 390 898 m -27 X s 390 933 m -27 X s 390 967 m -27 X s 390 1002 m -27 X s 417 1036 m -54 X s 390 1070 m -27 X
 s 390 1105 m -27 X s 390 1139 m -27 X s 390 1174 m -27 X s 417 1208 m -54 X s 390 1242 m -27 X s 390 1277 m -27 X s 390 1311 m -27 X s 390 1345 m -27 X s 417 1380 m -54 X s 390 1414 m -27 X s 390 1449 m -27 X s 390 1483 m -27 X s 390 1517 m -27 X s
 417 1552 m -54 X s 390 1586 m -27 X s 390 1621 m -27 X s 390 1655 m -27 X s 390 1689 m -27 X s 417 1724 m -54 X s 390 1758 m -27 X s 390 1792 m -27 X s 390 1827 m -27 X s 390 1861 m -27 X s 417 1896 m -54 X s 390 1930 m -27 X s 390 1964 m -27 X s
 390 1999 m -27 X s 390 2033 m -27 X s 417 2068 m -54 X s
 gsave  2268 2176 0 0 C 210.25 313.375 t 0 r /Helvetica findfont 102.732 sf 0 0 m (0.5) show NC gr 
 gsave  2268 2176 0 0 C 210.25 484.562 t 0 r /Helvetica findfont 102.732 sf 0 0 m (0.6) show NC gr 
 gsave  2268 2176 0 0 C 210.25 655.812 t 0 r /Helvetica findfont 102.732 sf 0 0 m (0.7) show NC gr 
 gsave  2268 2176 0 0 C 210.25 830.812 t 0 r /Helvetica findfont 102.732 sf 0 0 m (0.8) show NC gr 
 gsave  2268 2176 0 0 C 210.25 1002.06 t 0 r /Helvetica findfont 102.732 sf 0 0 m (0.9) show NC gr 
 gsave  2268 2176 0 0 C 309.188 1169.44 t 0 r /Helvetica findfont 102.732 sf 0 0 m (1) show NC gr 
 gsave  2268 2176 0 0 C 225.438 1340.69 t 0 r /Helvetica findfont 102.732 sf 0 0 m (1.1) show NC gr 
 gsave  2268 2176 0 0 C 210.25 1511.88 t 0 r /Helvetica findfont 102.732 sf 0 0 m (1.2) show NC gr 
 gsave  2268 2176 0 0 C 210.25 1690.75 t 0 r /Helvetica findfont 102.732 sf 0 0 m (1.3) show NC gr 
 gsave  2268 2176 0 0 C 210.25 1858.12 t 0 r /Helvetica findfont 102.732 sf 0 0 m (1.4) show NC gr 
 gsave  2268 2176 0 0 C 210.25 2033.19 t 0 r /Helvetica findfont 102.732 sf 0 0 m (1.5) show NC gr  2154 348 m 1720 Y s 2101 348 m 53 X s 2127 383 m 27 X s 2127 417 m 27 X s 2127 451 m 27 X s 2127 486 m 27 X s 2101 520 m 53 X s 2127 555 m 27 X s 2127
 589 m 27 X s 2127 623 m 27 X s 2127 658 m 27 X s 2101 692 m 53 X s 2127 726 m 27 X s 2127 761 m 27 X s 2127 795 m 27 X s 2127 830 m 27 X s 2101 864 m 53 X s 2127 898 m 27 X s 2127 933 m 27 X s 2127 967 m 27 X s 2127 1002 m 27 X s 2101 1036 m 53 X s
 2127 1070 m 27 X s 2127 1105 m 27 X s 2127 1139 m 27 X s 2127 1174 m 27 X s 2101 1208 m 53 X s 2127 1242 m 27 X s 2127 1277 m 27 X s 2127 1311 m 27 X s 2127 1345 m 27 X s 2101 1380 m 53 X s 2127 1414 m 27 X s 2127 1449 m 27 X s 2127 1483 m 27 X s
 2127 1517 m 27 X s 2101 1552 m 53 X s 2127 1586 m 27 X s 2127 1621 m 27 X s 2127 1655 m 27 X s 2127 1689 m 27 X s 2101 1724 m 53 X s 2127 1758 m 27 X s 2127 1792 m 27 X s 2127 1827 m 27 X s 2127 1861 m 27 X s 2101 1896 m 53 X s 2127 1930 m 27 X s
 2127 1964 m 27 X s 2127 1999 m 27 X s 2127 2033 m 27 X s 2101 2068 m 53 X s 0 0 1 c[  12 12 ] 0 sd 12 lw black 0 0 1 c 363 1288 m 45 -1 d 44 -2 d 45 -1 d 90 X 45 -2 d 44 3 d 45 X 45 -2 d 45 3 d 44 1 d 45 1 d 45 1 d 45 1 d 45 1 d 44 -1 d 45 3 d 45 1
 d 45 X 45 2 d 44 1 d 45 X 45 1 d 45 3 d 45 1 d 44 2 d 45 1 d 45 1 d 45 X 44 2 d 45 2 d 45 1 d 45 2 d 45 1 d 44 1 d 45 1 d 45 2 d 45 1 d 45 1 d 44 2 d s black 0 0 1 c 363 1111 m 45 X 44 1 d 45 1 d 45 -2 d 45 X 45 1 d 44 -4 d 45 -1 d 45 2 d 45 -5 d 44
 -1 d 45 -1 d 45 -1 d 45 -3 d 45 -1 d 44 2 d 45 -3 d 45 -3 d 45 -1 d 45 -1 d 44 X 45 2 d 45 -1 d 45 -2 d 45 -1 d 44 -1 d 45 X 45 -1 d 45 1 d 44 X 45 -2 d 45 X 45 -1 d 45 X 44 -1 d 180 X 44 -1 d s 0 1 0 c[ 4 8] 0 sd black 0 1 0 c 363 1333 m 45 X 44 -1
 d 90 X 45 -1 d 134 X 45 1 d 45 X 44 2 d 45 2 d 45 -2 d 45 1 d 45 1 d 44 1 d 45 1 d 45 1 d 45 1 d 45 2 d 44 X 45 2 d 45 1 d 45 1 d 45 1 d 44 2 d 45 3 d 45 2 d 45 2 d 44 2 d 45 3 d 45 2 d 45 2 d 45 1 d 44 1 d 45 1 d 45 2 d 45 1 d 45 1 d 44 1 d s black
 0 1 0 c 363 1099 m 45 -2 d 44 -3 d 45 -3 d 45 -2 d 45 -2 d 45 -3 d 44 -3 d 45 -1 d 45 -1 d 45 -1 d 44 X 45 -1 d 45 -1 d 45 -1 d 45 -1 d 44 -1 d 45 -1 d 45 -1 d 45 -1 d 45 -1 d 44 X 45 -1 d 45 -1 d 90 X 44 -1 d 45 -1 d 45 -1 d 45 X 44 -1 d 45 X 45 -1
 d 45 X 45 -1 d 44 X 45 -1 d 45 X 45 -1 d 45 -1 d 44 X s 1 0 0 c[ 20 12 4 12 4 12 4 12] 0 sd black 1 0 0 c 363 1366 m 45 8 d 44 5 d 45 4 d 45 7 d 45 7 d 45 8 d 44 6 d 45 3 d 45 4 d 45 2 d 44 -1 d 45 4 d 45 2 d 45 X 45 3 d 44 4 d 45 3 d 45 9 d 45 9 d
 45 11 d 44 9 d 45 11 d 45 10 d 45 17 d 45 20 d 44 20 d 45 28 d 45 13 d 45 21 d 44 21 d 45 23 d 45 23 d 45 23 d 45 23 d 44 25 d 45 29 d 45 29 d 45 29 d 45 31 d 44 31 d s black 1 0 0 c 363 1004 m 45 X 44 -3 d 45 -5 d 45 -3 d 45 -3 d 45 -2 d 44 -2 d 45
 -1 d 45 -2 d 45 X 44 2 d 45 -4 d 45 X 45 -1 d 45 -2 d 44 -4 d 45 -3 d 45 -10 d 45 -9 d 45 -11 d 44 -9 d 45 -11 d 45 -11 d 45 -17 d 45 -21 d 44 -20 d 45 -13 d 45 -31 d 45 -22 d 44 -23 d 45 -23 d 45 -24 d 45 -25 d 45 -25 d 44 -27 d 45 -26 d 45 -26 d
 45 -28 d 45 -29 d 44 -29 d s black
 gsave  2268 2176 0 0 C 1176.69 2075 t 0 r /Helvetica-BoldOblique findfont 102.732 sf 0 0 m (LHC HIGGS XS WG) show NC gr 
 gsave  2268 2176 0 0 C 408.125 1960.88 t 0 r /Helvetica findfont 60.8783 sf 0 0 m (NNLO\255QCD) show NC gr 
 gsave  2268 2176 0 0 C 644 1854.38 t 0 r /Helvetica findfont 60.8783 sf 0 0 m ( 68% C.L.\)*rescaling factor) show NC gr 
 gsave  2268 2176 0 0 C 621.188 1839.12 t 0 r /Helvetica findfont 41.8538 sf 0 0 m (s) show NC gr 
 gsave  2268 2176 0 0 C 583.125 1854.38 t 0 r /Symbol findfont 60.8783 sf 0 0 m (a) show NC gr 
 gsave  2268 2176 0 0 C 408.125 1854.38 t 0 r /Helvetica findfont 60.8783 sf 0 0 m (\(PDF+) show NC gr 
 gsave  2268 2176 0 0 C 408.125 1744 t 0 r /Helvetica findfont 60.8783 sf 0 0 m (normalized to MSTW2008nnlo) show NC gr [  ] 0 sd 3 lw 1 1 1 c 431 414 363 348 bf black 363 348 m 431 X s 794 348 m 414 Y s 794 762 m -431 X s 363 762 m -414 Y s
 gsave  2268 2176 0 0 C 469 682.438 t 0 r /Helvetica findfont 41.8538 sf 0 0 m 
 142 118 103 92 68 46 22
(Tevatron) K NC gr  1 0 0 c[ 20 12 4 12 4 12 4 12] 0 sd 12 lw 379 693 m 75 X s black
 gsave  2268 2176 0 0 C 469 537.875 t 0 r /Helvetica findfont 41.8538 sf 0 0 m 
 191 167 146 134 110 98 86 55 24
(LHC  7 TeV) K NC gr  0 1 0 c[ 4 8] 0 sd 379 555 m 75 X s black
 gsave  2268 2176 0 0 C 469 400.875 t 0 r /Helvetica findfont 41.8538 sf 0 0 m 
 203 179 158 146 122 98 86 55 24
(LHC 14 TeV) K NC gr  0 0 1 c[  12 12 ] 0 sd 379 417 m 75 X s
 gr  gr showpage
end
%%EOF
