%!PS-Adobe-2.0 EPSF-2.0
%%BoundingBox:  0 0 567 544
%%Title: C:\Ivica\Physics\CMS\Higgs\BranchingRatios\Yellow report 2010\Width.eps: Higgs Width
%%Creator: ROOT Version 5.25/04
%%CreationDate: Wed Oct 27 00:26:00 2010
%%EndComments
%%BeginProlog
80 dict begin
/s {stroke} def /l {lineto} def /m {moveto} def /t {translate} def
/sw {stringwidth} def /r {rotate} def /rl {roll}  def /R {repeat} def
/d {rlineto} def /rm {rmoveto} def /gr {grestore} def /f {eofill} def
/c {setrgbcolor} def /black {0 setgray} def /sd {setdash} def
/cl {closepath} def /sf {scalefont setfont} def /lw {setlinewidth} def
/box {m dup 0 exch d exch 0 d 0 exch neg d cl} def
/NC{systemdict begin initclip end}def/C{NC box clip newpath}def
/bl {box s} def /bf {box f} def /Y { 0 exch d} def /X { 0 d} def 
/mp {newpath /y exch def /x exch def} def
/side {[w .77 mul w .23 mul] .385 w mul sd w 0 l currentpoint t -144 r} def
/mr {mp x y w2 0 360 arc} def /m24 {mr s} def /m20 {mr f} def
/mb {mp x y w2 add m w2 neg 0 d 0 w neg d w 0 d 0 w d cl} def
/mt {mp x y w2 add m w2 neg w neg d w 0 d cl} def
/m21 {mb f} def /m25 {mb s} def /m22 {mt f} def /m26{mt s} def
/m23 {mp x y w2 sub m w2 w d w neg 0 d cl f} def
/m27 {mp x y w2 add m w3 neg w2 neg d w3 w2 neg d w3 w2 d cl s} def
/m28 {mp x w2 sub y w2 sub w3 add m w3 0 d  0 w3 neg d w3 0 d 0 w3 d w3 0 d  0 w3 d w3 neg 0 d 0 w3 d w3 neg 0 d
 0 w3 neg d w3 neg 0 d cl s } def
/m29 {mp gsave x w2 sub y w2 add w3 sub m currentpoint t
 4 {side} repeat cl fill gr} def
/m30 {mp gsave x w2 sub y w2 add w3 sub m currentpoint t
 4 {side} repeat cl s gr} def
/m31 {mp x y w2 sub m 0 w d x w2 sub y m w 0 d x w2 sub y w2 add m w w neg d x w2 sub y w2
 sub m w w d s} def
/m2 {mp x y w2 sub m 0 w d x w2 sub y m w 0 d s} def
/m5 {mp x w2 sub y w2 sub m w w d x w2 sub y w2 add m w w neg d s} def
/reEncode {exch findfont dup length dict begin {1 index /FID eq  {pop pop} {def} ifelse } forall /Encoding exch def currentdict end dup /FontName get exch definefont pop } def [/Times-Bold /Times-Italic /Times-BoldItalic /Helvetica
 /Helvetica-Oblique /Helvetica-Bold /Helvetica-BoldOblique /Courier /Courier-Oblique /Courier-Bold /Courier-BoldOblique /Times-Roman /AvantGarde-Book /AvantGarde-BookOblique /AvantGarde-Demi /AvantGarde-DemiOblique /Bookman-Demi
 /Bookman-DemiItalic /Bookman-Light /Bookman-LightItalic /Helvetica-Narrow /Helvetica-Narrow-Bold /Helvetica-Narrow-BoldOblique /Helvetica-Narrow-Oblique /NewCenturySchlbk-Roman /NewCenturySchlbk-Bold
 /NewCenturySchlbk-BoldItalic /NewCenturySchlbk-Italic /Palatino-Bold /Palatino-BoldItalic /Palatino-Italic /Palatino-Roman ] {ISOLatin1Encoding reEncode } forall
/oshow {gsave [] 0 sd true charpath stroke gr} def
/stwn { /fs exch def /fn exch def /text exch def fn findfont fs sf
 text sw pop xs add /xs exch def} def
/stwb { /fs exch def /fn exch def /nbas exch def /textf exch deftextf length /tlen exch def nbas tlen gt {/nbas tlendef} iffn findfont fs sf textf dup length nbas sub nbas getinterval sw
pop neg xs add /xs exch def} def
%%EndProlog
%%BeginSetup
%%EndSetup
newpath  gsave  .25 .25 scale  gsave  0 0 t black[  ] 0 sd 3 lw 1 1 1 c 2268 2176 0 0 bf black 1 1 1 c 1791 1720 363 348 bf black 1791 1720 363 348 bl 363 348 m 1791 X s[ 4 8] 0 sd 441 2068 m -1720 Y s 957 2068 m -1720 Y s 1259 2068 m -1720 Y s 1473
 2068 m -1720 Y s 1639 2068 m -1720 Y s 1774 2068 m -1720 Y s 1889 2068 m -1720 Y s 1988 2068 m -1720 Y s 2076 2068 m -1720 Y s 2154 2068 m -1720 Y s[  ] 0 sd 363 2068 m 1791 X s 363 348 m 1720 Y s[ 4 8] 0 sd 2154 348 m -1791 X s 2154 635 m -1791 X
 s 2154 921 m -1791 X s 2154 1208 m -1791 X s 2154 1494 m -1791 X s 2154 1781 m -1791 X s 2154 2068 m -1791 X s[  ] 0 sd 2154 348 m 1720 Y s 6 lw 1 1 1 c black 363 348 m 1791 X s 3 lw 363 348 m 1791 X s
 gsave  2268 2176 0 0 C 1868 80 t 0 r /Helvetica findfont 102.732 sf 0 0 m ( [GeV]) show NC gr 
 gsave  2268 2176 0 0 C 1823 53 t 0 r /Helvetica findfont 68.4881 sf 0 0 m (H) show NC gr 
 gsave  2268 2176 0 0 C 1743 80 t 0 r /Helvetica findfont 102.732 sf 0 0 m (M) show NC gr  441 400 m -52 Y s
 gsave  2268 2176 0 0 C 441 248 t 0 r  -83 0 t /Helvetica findfont 102.732 sf 0 0 m (100) show NC gr  957 374 m -26 Y s
 gsave  2268 2176 0 0 C 871 251 t 0 r /Helvetica findfont 102.732 sf 0 0 m (200) show NC gr  1259 374 m -26 Y s
 gsave  2268 2176 0 0 C 1172 251 t 0 r /Helvetica findfont 102.732 sf 0 0 m (300) show NC gr  1473 374 m -26 Y s 1639 374 m -26 Y s 1774 374 m -26 Y s 1889 374 m -26 Y s 1988 374 m -26 Y s 2076 374 m -26 Y s 2154 400 m -52 Y s
 gsave  2268 2176 0 0 C 2154 248 t 0 r  -112 0 t /Helvetica findfont 102.732 sf 0 0 m (1000) show NC gr  363 2068 m 1791 X s 441 2016 m 52 Y s 957 2042 m 26 Y s 1259 2042 m 26 Y s 1473 2042 m 26 Y s 1639 2042 m 26 Y s 1774 2042 m 26 Y s 1889 2042 m
 26 Y s 1988 2042 m 26 Y s 2076 2042 m 26 Y s 2154 2016 m 52 Y s 363 348 m 1720 Y s
 gsave  2268 2176 0 0 C 133 1784 t 90 r /Helvetica findfont 102.732 sf 0 0 m ( [GeV]) show NC gr 
 gsave  2268 2176 0 0 C 160 1739 t 90 r /Helvetica findfont 68.4881 sf 0 0 m (H) show NC gr 
 gsave  2268 2176 0 0 C 133 1674 t 90 r /Symbol findfont 102.732 sf 0 0 m (G) show NC gr  417 348 m -54 X s
 gsave  2268 2176 0 0 C 278 350 t 0 r /Helvetica findfont 68.4881 sf 0 0 m (\2553) show NC gr 
 gsave  2268 2176 0 0 C 167 301 t 0 r /Helvetica findfont 102.732 sf 0 0 m (10) show NC gr  390 434 m -27 X s 390 485 m -27 X s 390 521 m -27 X s 390 549 m -27 X s 390 571 m -27 X s 390 590 m -27 X s 390 607 m -27 X s 390 622 m -27 X s 417 635 m -54
 X s
 gsave  2268 2176 0 0 C 278 632 t 0 r /Helvetica findfont 68.4881 sf 0 0 m (\2552) show NC gr 
 gsave  2268 2176 0 0 C 167 586 t 0 r /Helvetica findfont 102.732 sf 0 0 m (10) show NC gr  390 721 m -27 X s 390 772 m -27 X s 390 807 m -27 X s 390 835 m -27 X s 390 858 m -27 X s 390 877 m -27 X s 390 894 m -27 X s 390 908 m -27 X s 417 921 m -54
 X s
 gsave  2268 2176 0 0 C 289 921 t 0 r /Helvetica findfont 68.4881 sf 0 0 m (\2551) show NC gr 
 gsave  2268 2176 0 0 C 179 875 t 0 r /Helvetica findfont 102.732 sf 0 0 m (10) show NC gr  390 1008 m -27 X s 390 1058 m -27 X s 390 1094 m -27 X s 390 1122 m -27 X s 390 1144 m -27 X s 390 1164 m -27 X s 390 1180 m -27 X s 390 1195 m -27 X s 417
 1208 m -54 X s
 gsave  2268 2176 0 0 C 342 1165 t 0 r  -42 0 t /Helvetica findfont 102.732 sf 0 0 m (1) show NC gr  390 1294 m -27 X s 390 1345 m -27 X s 390 1380 m -27 X s 390 1408 m -27 X s 390 1431 m -27 X s 390 1450 m -27 X s 390 1467 m -27 X s 390 1481 m -27
 X s 417 1494 m -54 X s
 gsave  2268 2176 0 0 C 342 1452 t 0 r  -110 0 t /Helvetica findfont 102.732 sf 0 0 m (10) show NC gr  390 1581 m -27 X s 390 1631 m -27 X s 390 1667 m -27 X s 390 1695 m -27 X s 390 1717 m -27 X s 390 1737 m -27 X s 390 1753 m -27 X s 390 1768 m
 -27 X s 417 1781 m -54 X s
 gsave  2268 2176 0 0 C 301 1781 t 0 r /Helvetica findfont 68.4881 sf 0 0 m (2) show NC gr 
 gsave  2268 2176 0 0 C 190 1735 t 0 r /Helvetica findfont 102.732 sf 0 0 m (10) show NC gr  390 1867 m -27 X s 390 1918 m -27 X s 390 1954 m -27 X s 390 1981 m -27 X s 390 2004 m -27 X s 390 2023 m -27 X s 390 2040 m -27 X s 390 2054 m -27 X s 417
 2068 m -54 X s
 gsave  2268 2176 0 0 C 301 2070 t 0 r /Helvetica findfont 68.4881 sf 0 0 m (3) show NC gr 
 gsave  2268 2176 0 0 C 190 2020 t 0 r /Helvetica findfont 102.732 sf 0 0 m (10) show NC gr  2154 348 m 1720 Y s 2101 348 m 53 X s 2127 434 m 27 X s 2127 485 m 27 X s 2127 521 m 27 X s 2127 549 m 27 X s 2127 571 m 27 X s 2127 590 m 27 X s 2127 607 m
 27 X s 2127 622 m 27 X s 2101 635 m 53 X s 2127 721 m 27 X s 2127 772 m 27 X s 2127 807 m 27 X s 2127 835 m 27 X s 2127 858 m 27 X s 2127 877 m 27 X s 2127 894 m 27 X s 2127 908 m 27 X s 2101 921 m 53 X s 2127 1008 m 27 X s 2127 1058 m 27 X s 2127
 1094 m 27 X s 2127 1122 m 27 X s 2127 1144 m 27 X s 2127 1164 m 27 X s 2127 1180 m 27 X s 2127 1195 m 27 X s 2101 1208 m 53 X s 2127 1294 m 27 X s 2127 1345 m 27 X s 2127 1380 m 27 X s 2127 1408 m 27 X s 2127 1431 m 27 X s 2127 1450 m 27 X s 2127
 1467 m 27 X s 2127 1481 m 27 X s 2101 1494 m 53 X s 2127 1581 m 27 X s 2127 1631 m 27 X s 2127 1667 m 27 X s 2127 1695 m 27 X s 2127 1717 m 27 X s 2127 1737 m 27 X s 2127 1753 m 27 X s 2127 1768 m 27 X s 2101 1781 m 53 X s 2127 1867 m 27 X s 2127
 1918 m 27 X s 2127 1954 m 27 X s 2127 1981 m 27 X s 2127 2004 m 27 X s 2127 2023 m 27 X s 2127 2040 m 27 X s 2127 2054 m 27 X s 2101 2068 m 53 X s 0.35 0.33 0.85 c 15 lw black 0.35 0.33 0.85 c 363 447 m 40 6 d 38 7 d 37 8 d 34 9 d 33 11 d 32 15 d
 30 18 d 29 24 d 28 28 d 28 35 d 26 42 d 25 52 d 24 70 d 24 126 d 23 135 d 22 54 d 22 35 d 21 29 d 20 34 d 20 28 d 19 22 d 19 17 d 36 32 d 35 28 d 33 25 d 32 23 d 30 22 d 29 20 d 28 19 d 27 19 d 26 17 d 26 16 d 24 16 d 24 15 d 22 14 d 23 14 d 21 15
 d 21 18 d 21 17 d 19 17 d 20 15 d 19 14 d 18 13 d 18 13 d 17 11 d 18 11 d 16 11 d 17 10 d 16 9 d 15 10 d 16 9 d 15 8 d 14 8 d 15 8 d 14 8 d 14 8 d 14 7 d 13 7 d 13 7 d 13 7 d 13 6 d 12 8 d 13 6 d 12 6 d 12 7 d 11 5 d 12 7 d 11 6 d 11 6 d 11 6 d 11
 5 d 11 6 d 11 5 d 10 6 d 10 5 d 10 5 d 10 6 d 10 5 d 10 5 d 9 6 d 10 4 d 9 5 d 10 6 d 9 5 d 9 4 d 9 5 d 8 5 d 9 5 d 9 5 d 8 4 d 9 5 d 8 5 d 8 5 d 8 4 d 8 5 d 8 4 d 8 5 d 8 4 d 8 5 d 7 4 d 8 5 d 7 4 d s black
 gsave  2268 2176 0 0 C 2199 350 t 90 r /Helvetica-BoldOblique findfont 41.8538 sf 0 0 m (LHC HIGGS XS WG) show NC gr 
 gsave  2268 2176 0 0 C 1556 251 t 0 r /Helvetica findfont 102.732 sf 0 0 m (500) show NC gr 
 gr  gr 
showpage
end
%%EOF
