%!PS-Adobe-3.0
%%Pages: (atend)
%%BoundingBox: 20 255 564 822
%%HiResBoundingBox: 20.000000 255.000000 564.000000 822.000000
%...................................
%%Creator: GPL Ghostscript 871 (pswrite)
%%CreationDate: 2010/11/22 11:35:01
%%DocumentData: Clean7Bit
%%LanguageLevel: 2
%%EndComments
%%BeginProlog
% This copyright applies to everything between here and the %%EndProlog:
% Copyright (C) 2010 Artifex Software, Inc.  All rights reserved.
%%BeginResource: procset GS_pswrite_2_0_1001 1.001 0
/GS_pswrite_2_0_1001 80 dict dup begin
/PageSize 2 array def/setpagesize{ PageSize aload pop 3 index eq exch
4 index eq and{ pop pop pop}{ PageSize dup  1
5 -1 roll put 0 4 -1 roll put dup null eq {false} {dup where} ifelse{ exch get exec}
{ pop/setpagedevice where
{ pop 1 dict dup /PageSize PageSize put setpagedevice}
{ /setpage where{ pop PageSize aload pop pageparams 3 {exch pop} repeat
setpage}if}ifelse}ifelse}ifelse} bind def
/!{bind def}bind def/#{load def}!/N/counttomark #
/rG{3{3 -1 roll 255 div}repeat setrgbcolor}!/G{255 div setgray}!/K{0 G}!
/r6{dup 3 -1 roll rG}!/r5{dup 3 1 roll rG}!/r3{dup rG}!
/w/setlinewidth #/J/setlinecap #
/j/setlinejoin #/M/setmiterlimit #/d/setdash #/i/setflat #
/m/moveto #/l/lineto #/c/rcurveto #
/p{N 2 idiv{N -2 roll rlineto}repeat}!
/P{N 0 gt{N -2 roll moveto p}if}!
/h{p closepath}!/H{P closepath}!
/lx{0 rlineto}!/ly{0 exch rlineto}!/v{0 0 6 2 roll c}!/y{2 copy c}!
/re{4 -2 roll m exch dup lx exch ly neg lx h}!
/^{3 index neg 3 index neg}!
/f{P fill}!/f*{P eofill}!/s{H stroke}!/S{P stroke}!
/q/gsave #/Q/grestore #/rf{re fill}!
/Y{P clip newpath}!/Y*{P eoclip newpath}!/rY{re Y}!
/|={pop exch 4 1 roll 1 array astore cvx 3 array astore cvx exch 1 index def exec}!
/|{exch string readstring |=}!
/+{dup type/nametype eq{2 index 7 add -3 bitshift 2 index mul}if}!
/@/currentfile #/${+ @ |}!
/B{{2 copy string{readstring pop}aload pop 4 array astore cvx
3 1 roll}repeat pop pop true}!
/Ix{[1 0 0 1 11 -2 roll exch neg exch neg]exch}!
/,{true exch Ix imagemask}!/If{false exch Ix imagemask}!/I{exch Ix image}!
/Ic{exch Ix false 3 colorimage}!
/F{/Columns counttomark 3 add -2 roll/Rows exch/K -1/BlackIs1 true>>
/CCITTFaxDecode filter}!/FX{<</EndOfBlock false F}!
/X{/ASCII85Decode filter}!/@X{@ X}!/&2{2 index 2 index}!
/@F{@ &2<<F}!/@C{@X &2 FX}!
/$X{+ @X |}!/&4{4 index 4 index}!/$F{+ @ &4<<F |}!/$C{+ @X &4 FX |}!
/IC{3 1 roll 10 dict begin 1{/ImageType/Interpolate/Decode/DataSource
/ImageMatrix/BitsPerComponent/Height/Width}{exch def}forall
currentdict end image}!
/~{@ read {pop} if}!
end def
%%EndResource
/pagesave null def
%%EndProlog
%%Page: 1 1
%%PageBoundingBox: 0 0 595 842
%%BeginPageSetup
GS_pswrite_2_0_1001 begin
595 842 /a4 setpagesize
/pagesave save store 197 dict begin
0.1 0.1 scale
%%EndPageSetup
gsave mark
Q q
200 2550 5440 5670 re
Y
255 G
200 2550.71 5441 5669.29 re
f*
1070.56 2834.17 4298.39 4478.74 re
f*
10 w
K
1070.56 2834.17 4298.39 4478.74 re
S
15 w
1070.56 7312.91 0 -4.48 0 0 0 -4.48 ^ 0 -4.48 ^ 0 -4.48 
^ 0 -4.48 ^ 0 -4.48 ^ 0 -4.48 ^ 0 -4.48 
^ 0 -4.48 ^ 0 -4.48 ^ 0 -4.48 ^ 0 -4.48 
^ 0 -4.48 ^ 0 -4.48 ^ 0 -4.48 ^ 0 -4.48 
^ 0 -4.48 ^ 0 -4.48 ^ 0 -4.48 ^ 0 -4.48 
^ 0 -4.48 ^ 0 -4.48 ^ 0 -4.48 ^ 0 -4.48 
^ 0 -4.48 ^ 0 -4.47 ^ 0 -4.48 ^ 0 -4.48 
^ 0 -4.48 ^ 0 -4.48 ^ 0 -4.48 ^ 0 -4.48 
^ 0 -4.48 ^ 0 -4.47 ^ 0 -4.48 ^ 0 -4.48 
^ 0 -4.48 ^ 0 -4.48 ^ 0 -4.48 ^ 0 -4.48 
^ 0 -4.47 ^ 0 -4.48 ^ 0 -4.48 ^ 0 -4.48 
^ 0 -4.48 ^ 0 -4.48 ^ 0 -4.48 ^ 0 -4.48 
^ 0 -4.47 ^ 0 -4.48 ^ 0 -4.48 ^ 0 -4.48 
^ 0 -4.48 ^ 0 -4.48 ^ 0 -4.48 ^ 0 -4.48 
^ 0 -4.47 ^ 0 -4.48 ^ 0 -4.48 ^ 0 -4.48 
^ 0 -4.48 ^ 0 -4.48 ^ 0 -4.48 ^ 0 -4.48 
^ 0 -4.47 ^ 0 -4.48 ^ 0 -4.48 ^ 0 -4.48 
^ 0 -4.48 ^ 0 -4.48 ^ 0 -4.48 ^ 0 -4.48 
^ 0 -4.47 ^ 0 -4.48 ^ 0 -4.48 ^ 0 -4.48 
^ 0 -4.48 ^ 0 -4.48 ^ 0 -4.48 ^ 0 -4.48 
^ 0 -4.47 ^ 0 -4.48 ^ 0 -4.48 ^ 0 -4.48 
^ 0 -4.48 ^ 0 -4.48 ^ 0 -4.48 ^ 0 -4.48 
^ 0 -4.47 ^ 0 -4.48 ^ 0 -4.48 ^ 0 -4.48 
^ 0 -4.48 ^ 0 -4.48 ^ 0 -4.48 ^ 0 -4.48 
^ 0 -4.47 ^ 0 -4.48 ^ 0 -4.48 ^ 0 -4.48 
^ 0 -4.48 ^ 0 -4.48 ^ 0 -4.48 ^ 0 -4.48 
^ 0 -4.47 ^ 0 -4.48 ^ 0 -4.48 ^ 0 -4.48 
^ 0 -4.48 ^ 0 -4.48 ^ 0 -4.48 ^ 0 -4.48 
^ 0 -4.47 ^ 0 -4.48 ^ 0 -4.48 ^ 0 -4.48 
^ 0 -4.48 ^ 0 -4.48 ^ 0 -4.48 ^ 0 -4.48 
^ P
0 -4.47 0 0 0 -4.48 ^ 0 -4.48 ^ 0 -4.48 ^ 
0 -4.48 ^ 0 -4.48 ^ 0 -4.48 ^ 0 -4.48 ^ 
0 -4.47 ^ 0 -4.48 ^ 0 -4.48 ^ 0 -4.48 ^ 
0 -4.48 ^ 0 -4.48 ^ 0 -4.48 ^ 0 -4.48 ^ 
0 -4.47 ^ 0 -4.48 ^ 0 -4.48 ^ 0 -4.48 ^ 
0 -4.48 ^ 0 -4.48 ^ 0 -4.48 ^ 0 -4.48 ^ 
0 -4.47 ^ 0 -4.48 ^ 0 -4.48 ^ 0 -4.48 ^ 
0 -4.48 ^ 0 -4.48 ^ 0 -4.48 ^ 0 -4.48 ^ 
0 -4.47 ^ 0 -4.48 ^ 0 -4.48 ^ 0 -4.48 ^ 
0 -4.48 ^ 0 -4.48 ^ 0 -4.48 ^ 0 -4.47 ^ 
0 -4.48 ^ 0 -4.48 ^ 0 -4.48 ^ 0 -4.48 ^ 
0 -4.48 ^ 0 -4.48 ^ 0 -4.48 ^ 0 -4.47 ^ 
0 -4.48 ^ 0 -4.48 ^ 0 -4.48 ^ 0 -4.48 ^ 
0 -4.48 ^ 0 -4.48 ^ 0 -4.48 ^ 0 -4.47 ^ 
0 -4.48 ^ 0 -4.48 ^ 0 -4.48 ^ 0 -4.48 ^ 
0 -4.48 ^ 0 -4.48 ^ 0 -4.48 ^ 0 -4.47 ^ 
0 -4.48 ^ 0 -4.48 ^ 0 -4.48 ^ 0 -4.48 ^ 
0 -4.48 ^ 0 -4.48 ^ 0 -4.48 ^ 0 -4.47 ^ 
0 -4.48 ^ 0 -4.48 ^ 0 -4.48 ^ 0 -4.48 ^ 
0 -4.48 ^ 0 -4.48 ^ 0 -4.48 ^ 0 -4.47 ^ 
0 -4.48 ^ 0 -4.48 ^ 0 -4.48 ^ 0 -4.48 ^ 
0 -4.48 ^ 0 -4.48 ^ 0 -4.48 ^ 0 -4.47 ^ 
0 -4.48 ^ 0 -4.48 ^ 0 -4.48 ^ 0 -4.48 ^ 
0 -4.48 ^ 0 -4.48 ^ 0 -4.48 ^ 0 -4.47 ^ 
0 -4.48 ^ 0 -4.48 ^ 0 -4.48 ^ 0 -4.48 ^ 
0 -4.48 ^ 0 -4.48 ^ 0 -4.48 ^ 0 -4.47 ^ 
0 -4.48 ^ 0 -4.48 ^ 0 -4.48 ^ 0 -4.48 ^ 
0 -4.48 ^ 0 -4.48 ^ 0 -4.48 ^ 0 -4.47 ^ 
0 -4.48 ^ 0 -4.48 ^ 0 -4.48 ^ 0 -4.48 ^ 
0 -4.48 ^ 0 -4.48 ^ 0 -4.48 ^ 0 -4.47 ^ 
0 -4.48 p
0 0 0 -4.48 ^ 0 -4.48 ^ 0 -4.48 ^ 0 -4.48 
^ 0 -4.48 ^ 0 -4.48 ^ 0 -4.47 ^ 0 -4.48 
^ 0 -4.48 ^ 0 -4.48 ^ 0 -4.48 ^ 0 -4.48 
^ 0 -4.48 ^ 0 -4.48 ^ 0 -4.47 ^ 0 -4.48 
^ 0 -4.48 ^ 0 -4.48 ^ 0 -4.48 ^ 0 -4.48 
^ 0 -4.48 ^ 0 -4.48 ^ 0 -4.47 ^ 0 -4.48 
^ 0 -4.48 ^ 0 -4.48 ^ 0 -4.48 ^ 0 -4.48 
^ 0 -4.48 ^ 0 -4.48 ^ 0 -4.47 ^ 0 -4.48 
^ 0 -4.48 ^ 0 -4.48 ^ 0 -4.48 ^ 0 -4.48 
^ 0 -4.48 ^ 0 -4.48 ^ 0 -4.47 ^ 0 -4.48 
^ 0 -4.48 ^ 0 -4.48 ^ 0 -4.48 ^ 0 -4.48 
^ 0 -4.48 ^ 0 -4.48 ^ 0 -4.47 ^ 0 -4.48 
^ 0 -4.48 ^ 0 -4.48 ^ 0 -4.48 ^ 0 -4.48 
^ 0 -4.48 ^ 0 -4.47 ^ 0 -4.48 ^ 0 -4.48 
^ 0 -4.48 ^ 0 -4.48 ^ 0 -4.48 ^ 0 -4.48 
^ 0 -4.48 ^ 0 -4.47 ^ 0 -4.48 ^ 0 -4.48 
^ 0 -4.48 ^ 0 -4.48 ^ 0 -4.48 ^ 0 -4.48 
^ 0 -4.48 ^ 0 -4.47 ^ 0 -4.48 ^ 0 -4.48 
^ 0 -4.48 ^ 0 -4.48 ^ 0 -4.48 ^ 0 -4.48 
^ 0 -4.48 ^ 0 -4.47 ^ 0 -4.48 ^ 0 -4.48 
^ 0 -4.48 ^ 0 -4.48 ^ 0 -4.48 ^ 0 -4.48 
^ 0 -4.48 ^ 0 -4.47 ^ 0 -4.48 ^ 0 -4.48 
^ 0 -4.48 ^ 0 -4.48 ^ 0 -4.48 ^ 0 -4.48 
^ 0 -4.48 ^ 0 -4.47 ^ 0 -4.48 ^ 0 -4.48 
^ 0 -4.48 ^ 0 -4.48 ^ 0 -4.48 ^ 0 -4.48 
^ 0 -4.48 ^ 0 -4.47 ^ 0 -4.48 ^ 0 -4.48 
^ 0 -4.48 ^ 0 -4.48 ^ 0 -4.48 ^ 0 -4.48 
^ 0 -4.48 ^ 0 -4.47 ^ 0 -4.48 ^ 0 -4.48 
^ 0 -4.48 ^ 0 -4.48 ^ 0 -4.48 ^ 0 -4.48 
^ 0 -4.48 ^ 0 -4.47 ^ 0 -4.48 ^ 0 -4.48 
^ p
0 -4.48 0 0 0 -4.48 ^ 0 -4.48 ^ 0 -4.48 ^ 
0 -4.48 ^ 0 -4.47 ^ 0 -4.48 ^ 0 -4.48 ^ 
0 -4.48 ^ 0 -4.48 ^ 0 -4.48 ^ 0 -4.48 ^ 
0 -4.48 ^ 0 -4.47 ^ 0 -4.48 ^ 0 -4.48 ^ 
0 -4.48 ^ 0 -4.48 ^ 0 -4.48 ^ 0 -4.48 ^ 
0 -4.48 ^ 0 -4.47 ^ 0 -4.48 ^ 0 -4.48 ^ 
0 -4.48 ^ 0 -4.48 ^ 0 -4.48 ^ 0 -4.48 ^ 
0 -4.48 ^ 0 -4.47 ^ 0 -4.48 ^ 0 -4.48 ^ 
0 -4.48 ^ 0 -4.48 ^ 0 -4.48 ^ 0 -4.48 ^ 
0 -4.48 ^ 0 -4.47 ^ 0 -4.48 ^ 0 -4.48 ^ 
0 -4.48 ^ 0 -4.48 ^ 0 -4.48 ^ 0 -4.48 ^ 
0 -4.48 ^ 0 -4.47 ^ 0 -4.48 ^ 0 -4.48 ^ 
0 -4.48 ^ 0 -4.48 ^ 0 -4.48 ^ 0 -4.48 ^ 
0 -4.48 ^ 0 -4.47 ^ 0 -4.48 ^ 0 -4.48 ^ 
0 -4.48 ^ 0 -4.48 ^ 0 -4.48 ^ 0 -4.48 ^ 
0 -4.47 ^ 0 -4.48 ^ 0 -4.48 ^ 0 -4.48 ^ 
0 -4.48 ^ 0 -4.48 ^ 0 -4.48 ^ 0 -4.48 ^ 
0 -4.47 ^ 0 -4.48 ^ 0 -4.48 ^ 0 -4.48 ^ 
0 -4.48 ^ 0 -4.48 ^ 0 -4.48 ^ 0 -4.48 ^ 
0 -4.47 ^ 0 -4.48 ^ 0 -4.48 ^ 0 -4.48 ^ 
0 -4.48 ^ 0 -4.48 ^ 0 -4.48 ^ 0 -4.48 ^ 
0 -4.47 ^ 0 -4.48 ^ 0 -4.48 ^ 0 -4.48 ^ 
0 -4.48 ^ 0 -4.48 ^ 0 -4.48 ^ 0 -4.48 ^ 
0 -4.47 ^ 0 -4.48 ^ 0 -4.48 ^ 0 -4.48 ^ 
0 -4.48 ^ 0 -4.48 ^ 0 -4.48 ^ 0 -4.48 ^ 
0 -4.47 ^ 0 -4.48 ^ 0 -4.48 ^ 0 -4.48 ^ 
0 -4.48 ^ 0 -4.48 ^ 0 -4.48 ^ 0 -4.48 ^ 
0 -4.47 ^ 0 -4.48 ^ 0 -4.48 ^ 0 -4.48 ^ 
0 -4.48 ^ 0 -4.48 ^ 0 -4.48 ^ 0 -4.48 ^ 
0 -4.47 ^ 0 -4.48 ^ 0 -4.48 ^ 0 -4.48 ^ 
0 -4.48 p
0 0 0 -4.48 ^ 0 -4.48 ^ 0 -4.48 ^ 0 -4.47 
^ 0 -4.48 ^ 0 -4.48 ^ 0 -4.48 ^ 0 -4.48 
^ 0 -4.48 ^ 0 -4.48 ^ 0 -4.48 ^ 0 -4.47 
^ 0 -4.48 ^ 0 -4.48 ^ 0 -4.48 ^ 0 -4.48 
^ 0 -4.48 ^ 0 -4.48 ^ 0 -4.48 ^ 0 -4.47 
^ 0 -4.48 ^ 0 -4.48 ^ 0 -4.48 ^ 0 -4.48 
^ 0 -4.48 ^ 0 -4.48 ^ 0 -4.48 ^ 0 -4.47 
^ 0 -4.48 ^ 0 -4.48 ^ 0 -4.48 ^ 0 -4.48 
^ 0 -4.48 ^ 0 -4.48 ^ 0 -4.48 ^ 0 -4.47 
^ 0 -4.48 ^ 0 -4.48 ^ 0 -4.48 ^ 0 -4.48 
^ 0 -4.48 ^ 0 -4.48 ^ 0 -4.48 ^ 0 -4.47 
^ 0 -4.48 ^ 0 -4.48 ^ 0 -4.48 ^ 0 -4.48 
^ 0 -4.48 ^ 0 -4.48 ^ 0 -4.48 ^ 0 -4.47 
^ 0 -4.48 ^ 0 -4.48 ^ 0 -4.48 ^ 0 -4.48 
^ 0 -4.48 ^ 0 -4.48 ^ 0 -4.48 ^ 0 -4.47 
^ 0 -4.48 ^ 0 -4.48 ^ 0 -4.48 ^ 0 -4.48 
^ 0 -4.48 ^ 0 -4.48 ^ 0 -4.47 ^ 0 -4.48 
^ 0 -4.48 ^ 0 -4.48 ^ 0 -4.48 ^ 0 -4.48 
^ 0 -4.48 ^ 0 -4.48 ^ 0 -4.47 ^ 0 -4.48 
^ 0 -4.48 ^ 0 -4.48 ^ 0 -4.48 ^ 0 -4.48 
^ 0 -4.48 ^ 0 -4.48 ^ 0 -4.47 ^ 0 -4.48 
^ 0 -4.48 ^ 0 -4.48 ^ 0 -4.48 ^ 0 -4.48 
^ 0 -4.48 ^ 0 -4.48 ^ 0 -4.47 ^ 0 -4.48 
^ 0 -4.48 ^ 0 -4.48 ^ 0 -4.48 ^ 0 -4.48 
^ 0 -4.48 ^ 0 -4.48 ^ 0 -4.47 ^ 0 -4.48 
^ 0 -4.48 ^ 0 -4.48 ^ 0 -4.48 ^ 0 -4.48 
^ 0 -4.48 ^ 0 -4.48 ^ 0 -4.47 ^ 0 -4.48 
^ 0 -4.48 ^ 0 -4.48 ^ 0 -4.48 ^ 0 -4.48 
^ 0 -4.48 ^ 0 -4.48 ^ 0 -4.47 ^ 0 -4.48 
^ 0 -4.48 ^ 0 -4.48 ^ 0 -4.48 ^ 0 -4.48 
^ p
0 -4.48 0 0 0 -4.48 ^ 0 -4.47 ^ 0 -4.48 ^ 
0 -4.48 ^ 0 -4.48 ^ 0 -4.48 ^ 0 -4.48 ^ 
0 -4.48 ^ 0 -4.48 ^ 0 -4.47 ^ 0 -4.48 ^ 
0 -4.48 ^ 0 -4.48 ^ 0 -4.48 ^ 0 -4.48 ^ 
0 -4.48 ^ 0 -4.48 ^ 0 -4.47 ^ 0 -4.48 ^ 
0 -4.48 ^ 0 -4.48 ^ 0 -4.48 ^ 0 -4.48 ^ 
0 -4.48 ^ 0 -4.48 ^ 0 -4.47 ^ 0 -4.48 ^ 
0 -4.48 ^ 0 -4.48 ^ 0 -4.48 ^ 0 -4.48 ^ 
0 -4.48 ^ 0 -4.48 ^ 0 -4.47 ^ 0 -4.48 ^ 
0 -4.48 ^ 0 -4.48 ^ 0 -4.48 ^ 0 -4.48 ^ 
0 -4.48 ^ 0 -4.48 ^ 0 -4.47 ^ 0 -4.48 ^ 
0 -4.48 ^ 0 -4.48 ^ 0 -4.48 ^ 0 -4.48 ^ 
0 -4.48 ^ 0 -4.48 ^ 0 -4.47 ^ 0 -4.48 ^ 
0 -4.48 ^ 0 -4.48 ^ 0 -4.48 ^ 0 -4.48 ^ 
0 -4.48 ^ 0 -4.48 ^ 0 -4.47 ^ 0 -4.48 ^ 
0 -4.48 ^ 0 -4.48 ^ 0 -4.48 ^ 0 -4.48 ^ 
0 -4.48 ^ 0 -4.47 ^ 0 -4.48 ^ 0 -4.48 ^ 
0 -4.48 ^ 0 -4.48 ^ 0 -4.48 ^ 0 -4.48 ^ 
0 -4.48 ^ 0 -4.47 ^ 0 -4.48 ^ 0 -4.48 ^ 
0 -4.48 ^ 0 -4.48 ^ 0 -4.48 ^ 0 -4.48 ^ 
0 -4.48 ^ 0 -4.47 ^ 0 -4.48 ^ 0 -4.48 ^ 
0 -4.48 ^ 0 -4.48 ^ 0 -4.48 ^ 0 -4.48 ^ 
0 -4.48 ^ 0 -4.47 ^ 0 -4.48 ^ 0 -4.48 ^ 
0 -4.48 ^ 0 -4.48 ^ 0 -4.48 ^ 0 -4.48 ^ 
0 -4.48 ^ 0 -4.47 ^ 0 -4.48 ^ 0 -4.48 ^ 
0 -4.48 ^ 0 -4.48 ^ 0 -4.48 ^ 0 -4.48 ^ 
0 -4.48 ^ 0 -4.47 ^ 0 -4.48 ^ 0 -4.48 ^ 
0 -4.48 ^ 0 -4.48 ^ 0 -4.48 ^ 0 -4.48 ^ 
0 -4.48 ^ 0 -4.47 ^ 0 -4.48 ^ 0 -4.48 ^ 
0 -4.48 ^ 0 -4.48 ^ 0 -4.48 ^ 0 -4.48 ^ 
0 -4.48 p
0 0 0 -4.47 ^ 0 -4.48 ^ 0 -4.48 ^ 0 -4.48 
^ 0 -4.48 ^ 0 -4.48 ^ 0 -4.48 ^ 0 -4.48 
^ 0 -4.47 ^ 0 -4.48 ^ 0 -4.48 ^ 0 -4.48 
^ 0 -4.48 ^ 0 -4.48 ^ 0 -4.48 ^ 0 -4.48 
^ 0 -4.47 ^ 0 -4.48 ^ 0 -4.48 ^ 0 -4.48 
^ 0 -4.48 ^ 0 -4.48 ^ 0 -4.48 ^ 0 -4.48 
^ 0 -4.47 ^ 0 -4.48 ^ 0 -4.48 ^ 0 -4.48 
^ 0 -4.48 ^ 0 -4.48 ^ 0 -4.48 ^ 0 -4.48 
^ 0 -4.47 ^ 0 -4.48 ^ 0 -4.48 ^ 0 -4.48 
^ 0 -4.48 ^ 0 -4.48 ^ 0 -4.48 ^ 0 -4.48 
^ 0 -4.47 ^ 0 -4.48 ^ 0 -4.48 ^ 0 -4.48 
^ 0 -4.48 ^ 0 -4.48 ^ 0 -4.48 ^ 0 -4.48 
^ 0 -4.47 ^ 0 -4.48 ^ 0 -4.48 ^ 0 -4.48 
^ 0 -4.48 ^ 0 -4.48 ^ 0 -4.48 ^ 0 -4.48 
^ 0 -4.47 ^ 0 -4.48 ^ 0 -4.48 ^ 0 -4.48 
^ 0 -4.48 ^ 0 -4.48 ^ 0 -4.48 ^ 0 -4.48 
^ 0 -4.47 ^ 0 -4.48 ^ 0 -4.48 ^ 0 -4.48 
^ 0 -4.48 ^ 0 -4.48 ^ 0 -4.48 ^ 0 -4.47 
^ 0 -4.48 ^ 0 -4.48 ^ 0 -4.48 ^ 0 -4.48 
^ 0 -4.48 ^ 0 -4.48 ^ 0 -4.48 ^ 0 -4.48 
^ 0 -4.47 ^ 0 -4.48 ^ 0 -4.48 ^ 0 -4.48 
^ 0 -4.48 ^ 0 -4.48 ^ 0 -4.48 ^ 0 -4.47 
^ 0 -4.48 ^ 0 -4.48 ^ 0 -4.48 ^ 0 -4.48 
^ 0 -4.48 ^ 0 -4.48 ^ 0 -4.48 ^ 0 -4.47 
^ 0 -4.48 ^ 0 -4.48 ^ 0 -4.48 ^ 0 -4.48 
^ 0 -4.48 ^ 0 -4.48 ^ 0 -4.48 ^ 0 -4.47 
^ 0 -4.48 ^ 0 -4.48 ^ 0 -4.48 ^ 0 -4.48 
^ 0 -4.48 ^ 0 -4.48 ^ 0 -4.48 ^ 0 -4.47 
^ 0 -4.48 ^ 0 -4.48 ^ 0 -4.48 ^ 0 -4.48 
^ 0 -4.48 ^ 0 -4.48 ^ 0 -4.48 ^ 0 -4.47 
^ p
0 -4.48 0 0 0 -4.48 ^ 0 -4.48 ^ 0 -4.48 ^ 
0 -4.48 ^ 0 -4.48 ^ 0 -4.48 ^ 0 -4.47 ^ 
0 -4.48 ^ 0 -4.48 ^ 0 -4.48 ^ 0 -4.48 ^ 
0 -4.48 ^ 0 -4.48 ^ 0 -4.48 ^ 0 -4.47 ^ 
0 -4.48 ^ 0 -4.48 ^ 0 -4.48 ^ 0 -4.48 ^ 
0 -4.48 ^ 0 -4.48 ^ 0 -4.48 ^ 0 -4.47 ^ 
0 -4.48 ^ 0 -4.48 ^ 0 -4.48 ^ 0 -4.48 ^ 
0 -4.48 ^ 0 -4.48 ^ 0 -4.48 ^ 0 -4.47 ^ 
0 -4.48 ^ 0 -4.48 ^ 0 -4.48 ^ 0 -4.48 ^ 
0 -4.48 ^ 0 -4.48 ^ 0 -4.48 ^ 0 -4.47 ^ 
0 -4.48 ^ 0 -4.48 ^ 0 -4.48 ^ 0 -4.48 ^ 
0 -4.48 ^ 0 -4.48 ^ 0 -4.48 ^ 0 -4.47 ^ 
0 -4.48 ^ 0 -4.48 ^ 0 -4.48 ^ 0 -4.48 ^ 
0 -4.48 ^ 0 -4.48 ^ 0 -4.48 ^ 0 -4.47 ^ 
0 -4.48 ^ 0 -4.48 ^ 0 -4.48 ^ 0 -4.48 ^ 
0 -4.48 ^ 0 -4.48 ^ 0 -4.48 ^ 0 -4.47 ^ 
0 -4.48 ^ 0 -4.48 ^ 0 -4.48 ^ 0 -4.48 ^ 
0 -4.48 ^ 0 -4.48 ^ 0 -4.48 ^ 0 -4.47 ^ 
0 -4.48 ^ 0 -4.48 ^ 0 -4.48 ^ 0 -4.48 ^ 
0 -4.48 ^ 0 -4.48 ^ 0 -4.47 ^ 0 -4.48 ^ 
0 -4.48 ^ 0 -4.48 ^ 0 -4.48 ^ 0 -4.48 ^ 
0 -4.48 ^ 0 -4.48 ^ 0 -4.48 ^ 0 -4.47 ^ 
0 -4.48 ^ 0 -4.48 ^ 0 -4.48 ^ 0 -4.48 ^ 
0 -4.48 ^ 0 -4.48 ^ 0 -4.47 ^ 0 -4.48 ^ 
0 -4.48 ^ 0 -4.48 ^ 0 -4.48 ^ 0 -4.48 ^ 
0 -4.48 ^ 0 -4.48 ^ 0 -4.47 ^ 0 -4.48 ^ 
0 -4.48 ^ 0 -4.48 ^ 0 -4.48 ^ 0 -4.48 ^ 
0 -4.48 ^ 0 -4.48 ^ 0 -4.47 ^ 0 -4.48 ^ 
0 -4.48 ^ 0 -4.48 ^ 0 -4.48 ^ 0 -4.48 ^ 
0 -4.48 ^ 0 -4.48 ^ 0 -4.47 ^ 0 -4.48 ^ 
0 -4.48 p
0 0 0 -4.48 ^ 0 -4.48 ^ 0 -4.48 ^ 0 -4.48 
^ 0 -4.48 ^ 0 -4.47 ^ 0 -4.48 ^ 0 -4.48 
^ 0 -4.48 ^ 0 -4.48 ^ 0 -4.48 ^ 0 -4.48 
^ 0 -4.48 ^ 0 -4.47 ^ 0 -4.48 ^ 0 -4.48 
^ 0 -4.48 ^ 0 -4.48 ^ 0 -4.48 ^ 0 -4.48 
^ 0 -4.48 ^ 0 -4.47 ^ 0 -4.48 ^ 0 -4.48 
^ 0 -4.48 ^ 0 -4.48 ^ 0 -4.48 ^ 0 -4.48 
^ 0 -4.48 ^ 0 -4.47 ^ 0 -4.48 ^ 0 -4.48 
^ 0 -4.48 ^ 0 -4.48 ^ 0 -4.48 ^ 0 -4.48 p S
7.5 w
1070.56 7312.91 0 -4478.74 S
Q q
200 2550 5440 0 0 5670 ^ Y
0.25683 i
K
587 3418.98 0 48.01 -241 0 ^ 18 0 0 27.01 205 0 ^ H
f
498.99 3229 0 78.02 -21 0 0 -57.02 -5.18 0 P
-33.55 0 -57.81 24.71 -57.81 58.9 c
0 19.02 6.93 36.25 18.99 47.3 c
13.35 12.34 35.68 19.8 58.77 19.8 c
45.94 0 76.23 -26.23 76.23 -65.83 c
0 -28.54 -14.55 -49.11 -38.53 -54.26 c
0 -24.45 p
37.82 6.71 59.54 35.53 59.54 78.49 c
0 22.9 -5.93 41.42 -17.99 56.09 c
-17.96 21.61 -46.94 33.96 -80.55 33.96 c
-57.46 0 -97.48 -35.24 -97.48 -85.93 c
0 -25.47 9.52 -45.79 29.85 -64.08 c
-24.96 -5.89 0 -15.11 h
f
460 3080 m
20.45 0 32.73 1.56 42.7 5.39 c
21.99 8.7 35.3 29.16 35.3 54.24 c
0 37.35 -28.71 61.4 -72.78 61.4 c
-44.07 0 -71.23 -23.23 -71.23 -60.77 c
0 -30.64 17.5 -51.83 46.84 -57.2 c
0 21.5 p
-17.64 5.88 -26.84 17.9 -26.84 35.04 c
0 13.56 6.13 25.07 17.38 32.23 c
7.67 5.12 15.33 6.91 28.63 7.16 c
h
477.01 3178.87 m
24.84 -1.8 40.98 -16.95 40.98 -38.52 c
0 -21.06 -17.42 -37.24 -39.45 -37.24 c
-0.51 0 -1.02 0 -1.54 0.25 c
h
f
400 2968.32 187 -64.98 0 25.43 -158.24 51.88 158.24 54.96 0 25.68 -187 -67.29 H
f
346 2891.09 0 -48.09 241 0 ^ -18 0 0 -27.09 -205 0 ^ H
f
Q q
200 2550 5440 0 0 5670 ^ Y
0.2 i
K
391 3646 -58 0 0 -16 125 0 ^ -54 0 0 64 ^ 
0 16 -125 0 ^ 58 0 H
f
Q q
200 2550 5440 0 0 5670 ^ Y
0.25683 i
K
400 3818.66 156.92 -52.66 -156.92 0 0 -23 187 0 0 33.31 -162.86 54.7 162.86 55.73 
0 33.29 -187 0 0 -23.01 156.92 0 -156.92 -53.18 H
f
Q q
200 2550 5440 5670 re
Y
7.5 w
K
1199.51 6923.46 -128.95 0 S
1135.04 6728.73 -64.48 0 S
1135.04 6534 -64.48 0 S
1135.04 6339.27 -64.48 0 S
1135.04 6144.55 -64.48 0 S
1199.51 5949.82 -128.95 0 S
1135.04 5755.09 -64.48 0 S
1135.04 5560.36 -64.48 0 S
1135.04 5365.64 -64.48 0 S
1135.04 5170.91 -64.48 0 S
1199.51 4976.18 -128.95 0 S
1135.04 4781.45 -64.48 0 S
1135.04 4586.72 -64.48 0 S
1135.04 4392 -64.48 0 S
1135.04 4197.27 -64.48 0 S
1199.51 4002.54 -128.95 0 S
1135.04 3807.81 -64.48 0 S
1135.04 3613.08 -64.48 0 S
1135.04 3418.36 -64.48 0 S
1135.04 3223.63 -64.48 0 S
1199.51 3028.9 -128.95 0 S
1199.51 6923.46 -128.95 0 S
1135.04 7118.19 -64.48 0 S
1135.04 7312.91 -64.48 0 S
1199.51 3028.9 -128.95 0 S
Q q
200 2550 5440 0 0 5670 ^ Y
0.25683 i
K
957.64 7070 -129.64 0 0 -23 182.04 0 0 14.88 P
-28.02 7.95 -31.87 13.07 -36.23 47.93 c
-16.17 0 h
f
1010 6922.51 m
0 16.93 -7.44 32.31 -20 41.8 c
-15.95 11.8 -40.35 17.7 -74 17.7 c
-61.38 0 -94 -20.52 -94 -59.5 c
0 -38.47 32.62 -59.52 92.46 -59.52 c
35.44 0 59.07 5.66 75.54 17.71 c
12.82 9.49 20 24.62 20 41.8 c
h
989.99 6922.5 m
0 -24.42 -24.64 -36.5 -73.36 -36.5 c
-51.54 0 -75.64 11.83 -75.64 37.02 c
0 23.91 25.13 35.98 74.87 35.98 c
49.74 0 74.13 -12.08 74.13 -36.5 c
h
f
1010 6779.51 m
0 16.93 -7.44 32.31 -20 41.8 c
-15.95 11.8 -40.35 17.7 -74 17.7 c
-61.38 0 -94 -20.52 -94 -59.5 c
0 -38.47 32.62 -59.52 92.46 -59.52 c
35.44 0 59.07 5.66 75.54 17.71 c
12.82 9.49 20 24.62 20 41.8 c
h
989.99 6779.5 m
0 -24.42 -24.64 -36.5 -73.36 -36.5 c
-51.54 0 -75.64 11.83 -75.64 37.02 c
0 23.91 25.13 35.98 74.87 35.98 c
49.74 0 74.13 -12.08 74.13 -36.5 c
h
f
Q q
200 2550 5440 0 0 5670 ^ Y
0.25683 i
K
957.64 6099 -129.64 0 0 -23 182.04 0 0 14.88 P
-28.02 7.95 -31.87 13.07 -36.23 47.93 c
-16.17 0 h
f
1010 5900.54 0 94.18 -99.04 13.64 0 -20.88 P
12.65 -10.57 17.04 -19.33 17.04 -33.51 c
0 -24.49 -16.74 -39.96 -43.78 -39.96 c
-26.26 0 -42.22 15.21 -42.22 39.95 c
0 19.84 10.06 31.96 30.69 37.37 c
0 22.68 p
-14.93 -3.09 -22.13 -5.66 -28.82 -11.07 c
-13.89 -10.29 -21.87 -28.82 -21.87 -49.41 c
0 -36.8 26.74 -62.54 65.32 -62.54 c
36 0 60.69 23.95 60.69 58.94 c
0 12.87 -3.36 23.16 -11.11 33.71 c
51.1 -7.2 0 -75.91 h
f
1010 5809.51 m
0 16.93 -7.44 32.31 -20 41.8 c
-15.95 11.8 -40.35 17.7 -74 17.7 c
-61.38 0 -94 -20.52 -94 -59.5 c
0 -38.47 32.62 -59.52 92.46 -59.52 c
35.44 0 59.07 5.66 75.54 17.71 c
12.82 9.49 20 24.62 20 41.8 c
h
989.99 5809.5 m
0 -24.42 -24.64 -36.5 -73.36 -36.5 c
-51.54 0 -75.64 11.83 -75.64 37.02 c
0 23.91 25.13 35.98 74.87 35.98 c
49.74 0 74.13 -12.08 74.13 -36.5 c
h
f
Q q
200 2550 5440 0 0 5670 ^ Y
0.25683 i
K
850 5056.28 0 95.61 P
14.92 -2.3 24.43 -10.51 37.55 -32.81 c
13.89 -25.63 p
13.89 -25.38 32.66 -38.45 55.04 -38.45 c
15.18 0 29.32 6.18 39.09 16.94 c
9.77 10.77 14.41 24.09 14.41 41.26 c
0 23.07 -8.21 40.23 -23.6 50.23 c
-9.74 6.41 -21.02 9.23 -39.48 9.74 c
0 -22.57 p
12.23 -0.77 19.63 -2.3 25.49 -5.38 c
10.96 -5.9 17.59 -17.7 17.59 -31.29 c
0 -20.52 -14.64 -35.91 -34.12 -35.91 c
-14.35 0 -26.65 8.48 -35.87 24.64 c
-13.33 23.59 p
-21.52 37.96 -38.7 48.98 -78.67 51.04 c
0 -120.99 h
f
1010 4972.51 m
0 16.93 -7.44 32.31 -20 41.8 c
-15.95 11.8 -40.35 17.7 -74 17.7 c
-61.38 0 -94 -20.52 -94 -59.5 c
0 -38.47 32.62 -59.52 92.46 -59.52 c
35.44 0 59.07 5.66 75.54 17.71 c
12.82 9.49 20 24.62 20 41.8 c
h
989.99 4972.5 m
0 -24.42 -24.64 -36.5 -73.36 -36.5 c
-51.54 0 -75.64 11.83 -75.64 37.02 c
0 23.91 25.13 35.98 74.87 35.98 c
49.74 0 74.13 -12.08 74.13 -36.5 c
h
f
1010 4829.51 m
0 16.93 -7.44 32.31 -20 41.8 c
-15.95 11.8 -40.35 17.7 -74 17.7 c
-61.38 0 -94 -20.52 -94 -59.5 c
0 -38.47 32.62 -59.52 92.46 -59.52 c
35.44 0 59.07 5.66 75.54 17.71 c
12.82 9.49 20 24.62 20 41.8 c
h
989.99 4829.5 m
0 -24.42 -24.64 -36.5 -73.36 -36.5 c
-51.54 0 -75.64 11.83 -75.64 37.02 c
0 23.91 25.13 35.98 74.87 35.98 c
49.74 0 74.13 -12.08 74.13 -36.5 c
h
f
Q q
200 2550 5440 0 0 5670 ^ Y
0.25683 i
K
850 4085.28 0 95.61 P
14.92 -2.3 24.43 -10.51 37.55 -32.81 c
13.89 -25.63 p
13.89 -25.38 32.66 -38.45 55.04 -38.45 c
15.18 0 29.32 6.18 39.09 16.94 c
9.77 10.77 14.41 24.09 14.41 41.26 c
0 23.07 -8.21 40.23 -23.6 50.23 c
-9.74 6.41 -21.02 9.23 -39.48 9.74 c
0 -22.57 p
12.23 -0.77 19.63 -2.3 25.49 -5.38 c
10.96 -5.9 17.59 -17.7 17.59 -31.29 c
0 -20.52 -14.64 -35.91 -34.12 -35.91 c
-14.35 0 -26.65 8.48 -35.87 24.64 c
-13.33 23.59 p
-21.52 37.96 -38.7 48.98 -78.67 51.04 c
0 -120.99 h
f
1010 3950.54 0 94.18 -99.04 13.64 0 -20.88 P
12.65 -10.57 17.04 -19.33 17.04 -33.51 c
0 -24.49 -16.74 -39.96 -43.78 -39.96 c
-26.26 0 -42.22 15.21 -42.22 39.95 c
0 19.84 10.06 31.96 30.69 37.37 c
0 22.68 p
-14.93 -3.09 -22.13 -5.66 -28.82 -11.07 c
-13.89 -10.29 -21.87 -28.82 -21.87 -49.41 c
0 -36.8 26.74 -62.54 65.32 -62.54 c
36 0 60.69 23.95 60.69 58.94 c
0 12.87 -3.36 23.16 -11.11 33.71 c
51.1 -7.2 0 -75.91 h
f
1010 3859.51 m
0 16.93 -7.44 32.31 -20 41.8 c
-15.95 11.8 -40.35 17.7 -74 17.7 c
-61.38 0 -94 -20.52 -94 -59.5 c
0 -38.47 32.62 -59.52 92.46 -59.52 c
35.44 0 59.07 5.66 75.54 17.71 c
12.82 9.49 20 24.62 20 41.8 c
h
989.99 3859.5 m
0 -24.42 -24.64 -36.5 -73.36 -36.5 c
-51.54 0 -75.64 11.83 -75.64 37.02 c
0 23.91 25.13 35.98 74.87 35.98 c
49.74 0 74.13 -12.08 74.13 -36.5 c
h
f
Q q
200 2550 5440 0 0 5670 ^ Y
0.25683 i
K
912 3188.24 0 -12.37 P
0 -24.98 -11.37 -37.87 -33.32 -37.87 c
-22.98 0 -36.68 14.16 -36.68 37.82 c
0 24.69 12.37 36.78 38.91 38.32 c
0 22.63 p
-14.67 -1.03 -24.19 -3.59 -32.42 -7.96 c
-17.49 -9.25 -26.49 -27.23 -26.49 -52.15 c
0 -37.5 22.34 -61.67 56.76 -61.67 c
23.11 0 35.95 9.01 43.4 30.87 c
6.68 -17.23 19.52 -25.86 37.75 -25.86 c
31.33 0 50.08 20.9 50.08 55.7 c
0 36.86 -20 56.45 -58.72 57.23 c
0 -22.73 p
10.95 -0.26 17.06 -1.29 22.66 -4.13 c
9.93 -5.17 16.05 -16.54 16.05 -30.74 c
0 -20.15 -11.71 -32.31 -30.77 -32.31 c
-12.71 0 -20.34 4.69 -24.4 14.82 c
-2.54 6.24 -3.56 14.3 -3.81 30.41 c
h
f
1010 3031.51 m
0 16.93 -7.44 32.31 -20 41.8 c
-15.95 11.8 -40.35 17.7 -74 17.7 c
-61.38 0 -94 -20.52 -94 -59.5 c
0 -38.47 32.62 -59.52 92.46 -59.52 c
35.44 0 59.07 5.66 75.54 17.71 c
12.82 9.49 20 24.62 20 41.8 c
h
989.99 3031.5 m
0 -24.42 -24.64 -36.5 -73.36 -36.5 c
-51.54 0 -75.64 11.83 -75.64 37.02 c
0 23.91 25.13 35.98 74.87 35.98 c
49.74 0 74.13 -12.08 74.13 -36.5 c
h
f
1010 2889.51 m
0 16.93 -7.44 32.31 -20 41.8 c
-15.95 11.8 -40.35 17.7 -74 17.7 c
-61.38 0 -94 -20.52 -94 -59.5 c
0 -38.47 32.62 -59.52 92.46 -59.52 c
35.44 0 59.07 5.66 75.54 17.71 c
12.82 9.49 20 24.62 20 41.8 c
h
989.99 2889.5 m
0 -24.42 -24.64 -36.5 -73.36 -36.5 c
-51.54 0 -75.64 11.83 -75.64 37.02 c
0 23.91 25.13 35.98 74.87 35.98 c
49.74 0 74.13 -12.08 74.13 -36.5 c
h
f
Q q
200 2550 5440 5670 re
Y
7.5 w
K
5368.95 7312.91 0 -4478.74 S
5240 6923.46 128.95 0 S
5304.47 6728.73 64.48 0 S
5304.47 6534 64.48 0 S
5304.47 6339.27 64.48 0 S
5304.47 6144.55 64.48 0 S
5240 5949.82 128.95 0 S
5304.47 5755.09 64.48 0 S
5304.47 5560.36 64.48 0 S
5304.47 5365.64 64.48 0 S
5304.47 5170.91 64.48 0 S
5240 4976.18 128.95 0 S
5304.47 4781.45 64.48 0 S
5304.47 4586.72 64.48 0 S
5304.47 4392 64.48 0 S
5304.47 4197.27 64.48 0 S
5240 4002.54 128.95 0 S
5304.47 3807.81 64.48 0 S
5304.47 3613.08 64.48 0 S
5304.47 3418.36 64.48 0 S
5304.47 3223.63 64.48 0 S
5240 3028.9 128.95 0 S
5240 6923.46 128.95 0 S
5304.47 7118.19 64.48 0 S
5304.47 7312.91 64.48 0 S
5240 3028.9 128.95 0 S
1070.56 7312.91 4298.39 0 S
Q q
200 2550 5440 0 0 5670 ^ Y
0.25683 i
K
5026.01 8103 -48.01 0 0 -241 ^ 0 18 -27.01 0 0 205 ^ H
f
5046 7860.01 22.01 0 0 69.99 P
11.2 -13.85 23.67 -20 40.97 -20 c
34.36 0 57.02 27.93 57.02 70.71 c
0 45.09 -21.95 73.29 -57.4 73.29 c
-18.11 0 -32.65 -8.24 -42.6 -24.12 c
0 20.24 -20 0 h
5105.23 8033.99 m
23.45 0 38.77 -20.77 38.77 -52.77 c
0 -30.48 -15.57 -51.22 -38.77 -51.22 c
-22.44 0 -37.22 20.49 -37.22 51.98 c
0 31.5 14.79 52.01 37.22 52.01 c
h
f
5189 8103 0 -187 19 0 0 17.21 P
10.25 -15.73 23.84 -23.21 42.55 -23.21 c
35.38 0 58.45 28.95 58.45 73.53 c
0 43.55 -22.06 70.47 -57.45 70.47 c
-18.46 0 -31.54 -6.8 -41.54 -21.66 c
0 70.66 h
5247.59 8033.99 m
23.95 0 39.4 -20.77 39.4 -52.77 c
0 -30.48 -15.97 -51.22 -39.4 -51.22 c
-22.66 0 -37.59 20.49 -37.59 51.98 c
0 31.5 14.93 52.01 37.59 52.01 c
h
f
5323.91 7862 48.09 0 0 241 ^ 0 -18 27.09 0 0 -205 ^ H
f
Q q
200 2550 5440 0 0 5670 ^ Y
0.2 i
K
4770.98 7955 -89.99 0 0 -13 69.79 0 -74.79 -99 0 -13 94.99 0 ^ 
-75.16 0 75.16 97.45 H
f
4869 7887 0 -57 16 0 0 125 ^ 0 -55.01 -64 0 ^ 
-16 0 0 -125 ^ 0 57 H
f
Q q
200 2550 5440 0 0 5670 ^ Y
0.2 i
K
4595.65 7867 m
-11.64 -12.46 -21.91 -24.25 -28.93 -33.17 c
6.5 -6.39 p
16.95 19.86 32.02 35.61 42.98 45.03 c
-10.96 9.42 -26.02 25.17 -42.98 45.03 c
-6.5 -6.55 p
7.02 -9.13 17.29 -21.2 28.93 -33.95 c
-135.26 0 0 -10 h
f
Q q
200 2550 5440 0 0 5670 ^ Y
0.2 i
K
4223 7792.68 15 0 0 46.32 P
7.54 -9 15.94 -13 27.6 -13 c
23.14 0 38.41 18.62 38.41 47.14 c
0 30.06 -14.92 48.86 -39.04 48.86 c
-12.32 0 -22.21 -5.5 -28.97 -16.09 c
0 13.5 -13 0 h
4262.98 7909 m
15.74 0 26.02 -13.98 26.02 -35.53 c
0 -20.51 -10.45 -34.48 -26.02 -34.48 c
-15.06 0 -24.98 13.79 -24.98 35 c
0 21.2 9.92 35.01 24.98 35.01 c
h
f
4318 7792.68 15 0 0 46.32 P
7.54 -9 15.94 -13 27.6 -13 c
23.14 0 38.41 18.62 38.41 47.14 c
0 30.06 -14.92 48.86 -39.04 48.86 c
-12.32 0 -22.21 -5.5 -28.97 -16.09 c
0 13.5 -13 0 h
4357.98 7909 m
15.74 0 26.02 -13.98 26.02 -35.53 c
0 -20.51 -10.45 -34.48 -26.02 -34.48 c
-15.06 0 -24.98 13.79 -24.98 35 c
0 21.2 9.92 35.01 24.98 35.01 c
h
f
Q q
200 2550 5440 0 0 5670 ^ Y
0.25683 i
K
4213.02 8021.99 0 22 -58.2 0 P
-20.24 0 -34.08 -2.31 -45.87 -7.42 c
-24.86 -11.23 -38.95 -31.15 -38.95 -54.89 c
0 -16.59 6.41 -33.45 18.21 -46.72 c
13.33 -15.32 27.95 -21.96 48.21 -21.96 c
17.44 0 32.31 5.37 44.11 15.86 c
11.54 10.49 18.48 25.07 18.48 38.89 c
0 19.44 -14.94 38.63 -42.23 54.25 c
h
4145.03 8021.99 m
22.09 -22.78 26.97 -32.5 26.97 -53.48 c
0 -26.61 -12.84 -44.52 -31.85 -44.52 c
-23.63 0 -43.15 25.84 -43.15 57.3 c
0 24.56 15.92 40.69 40.07 40.69 c
h
f
Q q
200 2550 5440 5670 re
Y
7.5 w
K
1070.56 7245.73 0 67.18 S
1155.98 7245.73 0 67.18 S
1232.39 7178.55 0 134.36 S
Q q
200 2550 5440 0 0 5670 ^ Y
0.2 i
K
1268 7477 12 40.9961 re
f
1242 7382.86 0 63.48 P
9.88 -1.53 16.18 -6.98 24.88 -21.78 c
9.2 -17.02 p
9.2 -16.85 21.64 -25.53 36.46 -25.53 c
10.05 0 19.43 4.09 25.9 11.23 c
6.48 7.14 9.57 15.99 9.57 27.39 c
0 15.31 -5.43 26.71 -15.61 33.34 c
-6.45 4.25 -13.91 6.13 -26.12 6.46 c
0 -15.04 p
8.16 -0.51 13.09 -1.54 17 -3.59 c
7.31 -3.93 11.73 -11.8 11.73 -20.86 c
0 -13.68 -9.74 -23.94 -22.73 -23.94 c
-9.57 0 -17.77 5.65 -23.93 16.42 c
-8.89 15.73 p
-14.36 25.3 -25.8 32.66 -52.46 34.02 c
0 -80.32 h
f
Q q
200 2550 5440 0 0 5670 ^ Y
0.25683 i
K
1242.64 7735 -129.64 0 0 -23 182.04 0 0 14.88 P
-28.02 7.95 -31.87 13.07 -36.23 47.93 c
-16.17 0 h
f
1295 7588.51 m
0 16.93 -7.44 32.31 -20 41.8 c
-15.95 11.8 -40.35 17.7 -74 17.7 c
-61.38 0 -94 -20.52 -94 -59.5 c
0 -38.47 32.62 -59.52 92.46 -59.52 c
35.44 0 59.07 5.66 75.54 17.71 c
12.82 9.49 20 24.62 20 41.8 c
h
1274.99 7588.5 m
0 -24.42 -24.64 -36.5 -73.36 -36.5 c
-51.54 0 -75.64 11.83 -75.64 37.02 c
0 23.91 25.13 35.98 74.87 35.98 c
49.74 0 74.13 -12.08 74.13 -36.5 c
h
f
Q q
200 2550 5440 5670 re
Y
7.5 w
K
1735.08 7245.73 0 67.18 S
2029.14 7245.73 0 67.18 S
2237.77 7245.73 0 67.18 S
2399.61 7245.73 0 67.18 S
2531.83 7245.73 0 67.18 S
2643.62 7245.73 0 67.18 S
2740.47 7245.73 0 67.18 S
2825.89 7245.73 0 67.18 S
2902.3 7178.55 0 134.36 S
Q q
200 2550 5440 0 0 5670 ^ Y
0.2 i
K
2942 7448 12 40.9961 re
f
2987.17 7396 -86.17 0 0 -15 120.99 0 0 9.84 P
-18.61 5.25 -21.17 8.64 -24.07 31.7 c
-10.75 0 h
f
Q q
200 2550 5440 0 0 5670 ^ Y
0.25683 i
K
2916.64 7707 -129.64 0 0 -23 182.04 0 0 14.88 P
-28.02 7.95 -31.87 13.07 -36.23 47.93 c
-16.17 0 h
f
2969 7559.51 m
0 16.93 -7.44 32.31 -20 41.8 c
-15.95 11.8 -40.35 17.7 -74 17.7 c
-61.38 0 -94 -20.52 -94 -59.5 c
0 -38.47 32.62 -59.52 92.46 -59.52 c
35.44 0 59.07 5.66 75.54 17.71 c
12.82 9.49 20 24.62 20 41.8 c
h
2948.99 7559.5 m
0 -24.42 -24.64 -36.5 -73.36 -36.5 c
-51.54 0 -75.64 11.83 -75.64 37.02 c
0 23.91 25.13 35.98 74.87 35.98 c
49.74 0 74.13 -12.08 74.13 -36.5 c
h
f
Q q
200 2550 5440 5670 re
Y
7.5 w
K
3404.99 7245.73 0 67.18 S
3699.04 7245.73 0 67.18 S
3907.68 7245.73 0 67.18 S
4069.51 7245.73 0 67.18 S
4201.73 7245.73 0 67.18 S
4313.53 7245.73 0 67.18 S
4410.37 7245.73 0 67.18 S
4495.79 7245.73 0 67.18 S
4572.2 7178.55 0 134.36 S
Q q
200 2550 5440 0 0 5670 ^ Y
0.25683 i
K
4595.64 7403 -129.64 0 0 -23 182.04 0 0 14.88 P
-28.02 7.95 -31.87 13.07 -36.23 47.93 c
-16.17 0 h
f
Q q
200 2550 5440 5670 re
Y
7.5 w
K
5074.89 7245.73 0 67.18 S
5368.95 7245.73 0 67.18 S
1070.56 2834.17 4298.39 0 S
1070.56 2901.35 0 -67.18 S
1155.98 2901.35 0 -67.18 S
1232.39 2968.54 0 -134.37 S
1735.08 2901.35 0 -67.18 S
2029.14 2901.35 0 -67.18 S
2237.77 2901.35 0 -67.18 S
2399.61 2901.35 0 -67.18 S
2531.83 2901.35 0 -67.18 S
2643.62 2901.35 0 -67.18 S
2740.47 2901.35 0 -67.18 S
2825.89 2901.35 0 -67.18 S
2902.3 2968.54 0 -134.37 S
3404.99 2901.35 0 -67.18 S
3699.04 2901.35 0 -67.18 S
3907.68 2901.35 0 -67.18 S
4069.51 2901.35 0 -67.18 S
4201.73 2901.35 0 -67.18 S
4313.53 2901.35 0 -67.18 S
4410.37 2901.35 0 -67.18 S
4495.79 2901.35 0 -67.18 S
4572.2 2968.54 0 -134.37 S
5074.89 2901.35 0 -67.18 S
5368.95 2901.35 0 -67.18 S
255 0 r5
4490.36 7118.19 -109.02 -97.37 -110.64 -97.36 -103.72 -97.37 -101.96 -97.36 -99.72 -97.36 -99.18 -97.37 -94.98 -97.36 
-90.89 -97.37 -89.62 -97.36 -89.1 -97.36 -81.4 -97.37 -89.14 -97.36 -82.2 -97.37 -95.67 -97.36 -55.33 -97.36 
-77.44 -97.37 -77.56 -97.36 -81.16 -97.36 -65.9 -97.37 -72.2 -97.36 -67.8 -97.37 -67.31 -97.36 -134.53 -194.73 
-129.67 -194.73 -122.57 -194.72 -128.15 -194.73 -121.64 -194.73 -117.29 -194.73 -118.53 -194.73 -108.61 -194.72 -111.74 -194.73 
-105.2 -194.73 -91.19 0 109.64 194.73 106.22 194.73 114.7 194.72 114.24 194.73 120.9 194.73 117.4 194.73 
120.72 194.73 130.59 194.72 129.35 194.73 134.93 194.73 69.96 97.36 67.7 97.37 74.28 97.36 66.36 97.37 
77.35 97.36 75.69 97.36 81.73 97.37 57.97 97.36 100.36 97.36 84.3 97.37 82.19 97.36 88.79 97.37 
90.98 97.36 89.69 97.36 92.39 97.37 98.07 97.36 91.06 97.37 101.61 97.36 104.13 97.36 111.48 97.37 
110.24 97.36 118.4 97.37 f*
K
4462.6 7118.19 -113.87 -97.37 -110.15 -97.36 -106.68 -97.37 -104.05 -97.36 -101.1 -97.36 -95.95 -97.37 -94.52 -97.36 
-92.92 -97.37 -90.24 -97.36 -88.43 -97.36 -85.38 -97.37 -86.86 -97.36 -83.94 -97.37 -97.17 -97.36 -57.3 -97.36 
-78.74 -97.37 -76.67 -97.36 -79.45 -97.36 -66.21 -97.37 -72.37 -97.36 -68.82 -97.37 -68.43 -97.36 -133.93 -194.73 
-130.32 -194.73 -125.75 -194.72 -124.35 -194.73 -120.62 -194.73 -118.16 -194.73 -116.03 -194.73 -112.5 -194.72 -108.78 -194.73 
-107.13 -194.73 S
0 255 r6
5196.25 7118.19 -105.98 -97.37 -100.57 -97.36 -100.56 -97.37 -93.48 -97.36 -91.67 -97.36 -92.23 -97.37 -84.77 -97.36 
-86.64 -97.37 -87.43 -97.36 -79.66 -97.36 -74.64 -97.37 -84.57 -97.36 -72.92 -97.37 -89.71 -97.36 -54.35 -97.36 
-71.47 -97.37 -69.82 -97.36 -74.46 -97.36 -64.46 -97.37 -64.78 -97.36 -62.7 -97.37 -61.31 -97.36 -126.45 -194.73 
-121.71 -194.73 -112.4 -194.72 -119.42 -194.73 -117.29 -194.73 -109.95 -194.73 -113.68 -194.73 -102.15 -194.72 -101.34 -194.73 
-98.75 -194.73 -77.54 0 102.53 194.73 98.92 194.73 106.66 194.72 104.66 194.73 106.97 194.73 110.79 194.73 
113.88 194.73 122.32 194.72 123.7 194.73 117.72 194.73 65.27 97.36 62.11 97.37 69.73 97.36 58.35 97.37 
75.9 97.36 73.05 97.36 76.09 97.37 47.99 97.36 89.18 97.36 83.98 97.37 73.69 97.36 82.14 97.37 
79.95 97.36 84.89 97.36 83.52 97.37 88.13 97.36 92.28 97.37 89.16 97.36 98.84 97.36 100.12 97.37 
104.87 97.36 101.49 97.37 f*
K
5158.73 7118.19 -105.54 -97.37 -103.56 -97.36 -99.13 -97.37 -97.71 -97.36 -92.24 -97.36 -90.78 -97.37 -87.8 -97.36 
-85.67 -97.37 -84.71 -97.36 -79.53 -97.36 -80.27 -97.37 -79.92 -97.36 -76.63 -97.37 -90.13 -97.36 -52.91 -97.36 
-72.07 -97.37 -70.46 -97.36 -75.26 -97.36 -60.57 -97.37 -67.22 -97.36 -62.23 -97.37 -62.98 -97.36 -125.72 -194.73 
-119.94 -194.73 -117.59 -194.72 -116.13 -194.73 -114.23 -194.73 -109.63 -194.73 -108.09 -194.73 -104.77 -194.72 -100.01 -194.73 
-99.79 -194.73 S
Q q
200 2550 5440 0 0 5670 ^ Y
0.2 i
K
4104 4309.96 0 97.04 -14 0 ^ H
4069 4309.96 0 97.04 -14 0 ^ H
f
4134.17 4192 -101.17 0 0 -17 142.05 0 0 11.51 P
-21.84 6.15 -24.85 10.12 -28.26 37.12 c
-12.62 0 h
f
4067 4067.01 -34 0 0 -17.01 ^ 0 -20.87 16 0 ^ 92 0 
0 13.01 -89.37 64.4 -18.63 0 H
4083 4067.01 0 45.02 61.66 -45.02 H
f
4162.99 3896 0 -47.45 16 0 0 114.26 ^ 0 -47.8 -129.99 0 0 -19 H
f
4080 3742.96 m
16 0 25.59 1.2 33.39 4.18 c
17.2 6.76 27.59 22.66 27.59 42.14 c
0 29.02 -22.54 47.71 -57.11 47.71 c
-34.58 0 -55.89 -18.17 -55.89 -47.53 c
0 -23.96 13.74 -40.54 36.77 -44.75 c
0 16.87 p
-13.64 4.61 -20.76 14.05 -20.76 27.49 c
0 10.64 4.8 19.67 13.6 25.29 c
6 4.02 12 5.42 22.41 5.62 c
h
4094.01 3819.23 m
18.78 -1.4 30.98 -13.18 30.98 -29.96 c
0 -16.38 -13.17 -28.96 -29.82 -28.96 c
-0.39 0 -0.77 0 -1.16 0.2 c
h
f
4033 3655.7 146 -50.54 0 19.78 -123.62 40.35 123.63 42.75 0 19.98 -146 -52.34 H
f
Q q
200 2550 5440 0 0 5670 ^ Y
0.2 i
K
4108.51 4479.51 m
20.78 0.2 32.48 13.68 32.48 37.66 c
0 24.18 -12.61 39.84 -32.01 39.84 c
-16.4 0 -24.2 -8.39 -30.2 -33.19 c
-3.8 -15.59 p
-2.8 -11.6 -7 -16.21 -14.6 -16.21 c
-9.8 0 -16.39 9.9 -16.39 24.63 c
0 9.08 2.57 16.75 6.92 20.98 c
2.96 2.62 5.93 3.83 13.25 4.84 c
0 17.75 p
-24.45 -0.8 -36.17 -14.43 -36.17 -41.9 c
0 -26.46 13 -43.31 33.19 -43.31 c
15.6 0 24.2 8.81 29.2 29.61 c
3.8 16 p
3.2 13.59 7.6 19.39 15 19.39 c
9.6 0 15.82 -8.56 15.82 -22.09 c
0 -13.33 -5.69 -20.5 -16.48 -20.89 c
h
f
Q q
200 2550 5440 5670 re
Y
15 w
K
4147.58 4700.47 -123.66 -85.61 S
0 w
4023.92 4614.86 180.73 -28.53 S
4204.65 4586.33 0 -114.15 S
0 255 r6
4030.46 4761.73 174.109 283.465 re
f*
30 w
K
4117.52 5045.2 0 -283.47 S
Q q
200 2550 5440 0 0 5670 ^ Y
0.2 i
K
3838 4309.96 0 97.04 -14 0 ^ H
3803 4309.96 0 97.04 -14 0 ^ H
f
3909 4140 0 95.04 -17.01 0 0 -76.79 P
-48.44 33.88 -78.18 47.72 -125 58.34 c
0 -18.85 p
45.45 -7.82 84.5 -25.66 127.16 -57.74 c
h
f
3896.99 4007 0 -47.45 16 0 0 114.26 ^ 0 -47.8 -129.99 0 0 -19 H
f
3814 3853.96 m
16 0 25.59 1.2 33.39 4.18 c
17.2 6.76 27.59 22.66 27.59 42.14 c
0 29.02 -22.54 47.71 -57.11 47.71 c
-34.58 0 -55.89 -18.17 -55.89 -47.53 c
0 -23.96 13.74 -40.54 36.77 -44.75 c
0 16.87 p
-13.64 4.61 -20.76 14.05 -20.76 27.49 c
0 10.64 4.8 19.67 13.6 25.29 c
6 4.02 12 5.42 22.41 5.62 c
h
3828.01 3930.23 m
18.78 -1.4 30.98 -13.18 30.98 -29.96 c
0 -16.38 -13.17 -28.96 -29.82 -28.96 c
-0.39 0 -0.77 0 -1.16 0.2 c
h
f
3767 3766.7 146 -50.54 0 19.78 -123.62 40.35 123.63 42.75 0 19.98 -146 -52.34 H
f
Q q
200 2550 5440 0 0 5670 ^ Y
0.2 i
K
3842.51 4479.51 m
20.78 0.2 32.48 13.68 32.48 37.66 c
0 24.18 -12.61 39.84 -32.01 39.84 c
-16.4 0 -24.2 -8.39 -30.2 -33.19 c
-3.8 -15.59 p
-2.8 -11.6 -7 -16.21 -14.6 -16.21 c
-9.8 0 -16.39 9.9 -16.39 24.63 c
0 9.08 2.57 16.75 6.92 20.98 c
2.96 2.62 5.93 3.83 13.25 4.84 c
0 17.75 p
-24.45 -0.8 -36.17 -14.43 -36.17 -41.9 c
0 -26.46 13 -43.31 33.19 -43.31 c
15.6 0 24.2 8.81 29.2 29.61 c
3.8 16 p
3.2 13.59 7.6 19.39 15 19.39 c
9.6 0 15.82 -8.56 15.82 -22.09 c
0 -13.33 -5.69 -20.5 -16.48 -20.89 c
h
f
Q q
200 2550 5440 5670 re
Y
15 w
K
3881.23 4700.47 -123.65 -85.61 S
0 w
3757.58 4614.86 180.73 -28.53 S
3938.31 4586.33 0 -114.15 S
255 0 r5
3758.41 4761.73 174.113 283.465 re
f*
30 w
K
3845.47 5045.2 0 -283.47 S
Q q
200 2550 5440 0 0 5670 ^ Y
0.25683 i
K
5181 5857.12 0 38.52 -187 39.81 0 -128.16 32.01 -6.93 0 89.63 H
f
5079 5650.81 -85 17.98 0 -38.53 187 -39.81 0 38.78 -70 14.9 0 73.96 70 -14.89 
0 38.52 -187 39.81 ^ 85 -17.98 H
f
5117.79 5411.37 m
7.16 -0.77 9.97 -1.04 12.78 -1.04 c
31.7 0 53.43 26.89 53.43 66.58 c
0 31.5 -13.63 58.9 -39.54 79.64 c
-22.57 18.18 -57.2 29.45 -90.3 29.45 c
-41.04 0 -66.18 -26.62 -66.18 -70.4 c
0 -46.6 25.97 -80.9 69.95 -92.17 c
0 36.66 p
-23.61 7.43 -36.95 25.63 -36.95 50.23 c
0 24.86 13.82 37.67 40.69 37.67 c
20.98 0 43.5 -6.66 61.41 -18.2 c
18.94 -12.05 27.9 -27.94 27.9 -48.45 c
0 -13.59 -4.82 -24.1 -13.44 -29.48 c
-5.07 -3.33 -9.88 -4.36 -19.77 -4.36 c
h
f
5079 5208.81 -85 17.98 0 -38.53 187 -39.81 0 38.78 -70 14.9 0 73.96 70 -14.89 
0 38.52 -187 39.81 ^ 85 -17.98 H
f
5181 5076.49 0 38.52 -187 39.81 ^ H
f
5095 4895.82 0 74.86 -32.01 6.92 0 -42.55 P
-10.63 3.34 -17.11 6.92 -23.85 13.84 c
-11.66 11.54 -18.14 26.66 -18.14 41.52 c
0 25.12 19.45 43.58 45.8 43.58 c
18.17 0 41.45 -6.66 55.53 -15.89 c
18.94 -12.3 28.66 -29.73 28.66 -51.52 c
0 -24.35 -10.63 -38.96 -29.61 -41.01 c
0 -35.37 p
3.58 -0.26 6.39 -0.54 8.43 -0.54 c
32.2 0 54.19 27.93 54.19 69.67 c
0 31.5 -12.86 59.41 -37.23 80.41 c
-23.34 19.97 -55.92 32.27 -85.68 32.27 c
-44.63 0 -73.11 -28.68 -73.11 -73.75 c
0 -23.82 8.25 -40.71 28.62 -59.67 c
-23.21 1.79 0 -23.05 h
f
5095 4695.82 0 74.86 -32.01 6.92 0 -42.55 P
-10.63 3.34 -17.11 6.92 -23.85 13.84 c
-11.66 11.54 -18.14 26.66 -18.14 41.52 c
0 25.12 19.45 43.58 45.8 43.58 c
18.17 0 41.45 -6.66 55.53 -15.89 c
18.94 -12.3 28.66 -29.73 28.66 -51.52 c
0 -24.35 -10.63 -38.96 -29.61 -41.01 c
0 -35.37 p
3.58 -0.26 6.39 -0.54 8.43 -0.54 c
32.2 0 54.19 27.93 54.19 69.67 c
0 31.5 -12.86 59.41 -37.23 80.41 c
-23.34 19.97 -55.92 32.27 -85.68 32.27 c
-44.63 0 -73.11 -28.68 -73.11 -73.75 c
0 -23.82 8.25 -40.71 28.62 -59.67 c
-23.21 1.79 0 -23.05 h
f
5124.21 4516.05 m
7.15 -1.53 10.73 -2.05 15.84 -2.05 c
27.59 0 43.95 23.83 43.95 64.54 c
0 24.84 -6.17 44.3 -18.98 58.9 c
-12.55 14.6 -31.77 23.56 -49.97 23.56 c
-21.27 0 -32.55 -12.79 -38.7 -43.23 c
-5.12 -25.07 p
-4.61 -23.28 -9.73 -30.7 -21.78 -30.7 c
-17.17 0 -28.45 17.07 -28.45 43.57 c
0 23.18 8.46 36.43 23.08 36.43 c
1.28 0 3.59 -0.02 5.9 -0.05 c
0 37.04 p
-5.15 0.76 -7.72 1.01 -11.32 1.01 c
-13.63 0 -25.46 -5.11 -33.95 -14.3 c
-11.32 -12.25 -16.72 -29.87 -16.72 -54.38 c
0 -31.15 8.97 -54.89 26.14 -69.7 c
12.04 -10.73 30.75 -17.64 47.66 -17.64 c
19.73 0 33.06 14.07 38.18 40.17 c
5.64 27.88 p
4.87 24.05 8.97 30.96 18.71 30.96 c
16.4 0 26.67 -14.45 26.67 -37.92 c
0 -21.93 -7.33 -34.06 -20.98 -34.06 c
-1.26 0 -3.54 0.4 -5.81 0.79 c
h
f
5089.42 4329.84 91.58 -77.82 0 44.95 -60.39 47 60.39 20.29 0 45.71 -92.86 -37.24 -94.14 79.62 
0 -44.95 63.95 -48.54 -63.95 -23.11 0 -45.97 H
f
5124.21 4102.05 m
7.15 -1.53 10.73 -2.05 15.84 -2.05 c
27.59 0 43.95 23.83 43.95 64.54 c
0 24.84 -6.17 44.3 -18.98 58.9 c
-12.55 14.6 -31.77 23.56 -49.97 23.56 c
-21.27 0 -32.55 -12.79 -38.7 -43.23 c
-5.12 -25.07 p
-4.61 -23.28 -9.73 -30.7 -21.78 -30.7 c
-17.17 0 -28.45 17.07 -28.45 43.57 c
0 23.18 8.46 36.43 23.08 36.43 c
1.28 0 3.59 -0.02 5.9 -0.05 c
0 37.04 p
-5.15 0.76 -7.72 1.01 -11.32 1.01 c
-13.63 0 -25.46 -5.11 -33.95 -14.3 c
-11.32 -12.25 -16.72 -29.87 -16.72 -54.38 c
0 -31.15 8.97 -54.89 26.14 -69.7 c
12.04 -10.73 30.75 -17.64 47.66 -17.64 c
19.73 0 33.06 14.07 38.18 40.17 c
5.64 27.88 p
4.87 24.05 8.97 30.96 18.71 30.96 c
16.4 0 26.67 -14.45 26.67 -37.92 c
0 -21.93 -7.33 -34.06 -20.98 -34.06 c
-1.26 0 -3.54 0.4 -5.81 0.79 c
h
f
4994 3856.52 187 -91.69 0 40.84 -140.52 57.79 140.52 -0.77 0 40.58 -140 57.53 140 -0.77 
0 40.84 -187 -13.1 0 -34.67 142.54 -60.87 -142.54 -1.03 H
f
5095 3596.82 0 74.86 -32.01 6.92 0 -42.55 P
-10.63 3.34 -17.11 6.92 -23.85 13.84 c
-11.66 11.54 -18.14 26.66 -18.14 41.52 c
0 25.12 19.45 43.58 45.8 43.58 c
18.17 0 41.45 -6.66 55.53 -15.89 c
18.94 -12.3 28.66 -29.73 28.66 -51.52 c
0 -24.35 -10.63 -38.96 -29.61 -41.01 c
0 -35.37 p
3.58 -0.26 6.39 -0.54 8.43 -0.54 c
32.2 0 54.19 27.93 54.19 69.67 c
0 31.5 -12.86 59.41 -37.23 80.41 c
-23.34 19.97 -55.92 32.27 -85.68 32.27 c
-44.63 0 -73.11 -28.68 -73.11 -73.75 c
0 -23.82 8.25 -40.71 28.62 -59.67 c
-23.21 1.79 0 -23.05 h
f
5026.01 3392.08 0 76.9 P
9.51 -6.41 15.16 -13.84 34.44 -44.34 c
13.36 -21.28 20.82 -30.76 30.58 -38.96 c
12.85 -10.77 28.53 -16.67 44.72 -16.67 c
27.76 0 44.24 19.75 44.24 53.05 c
0 39.71 -24.17 65.85 -67.34 72.51 c
0 -34.19 p
24.79 -3.32 38.33 -14.8 38.33 -32.4 c
0 -13.78 -7.73 -21.96 -20.55 -21.96 c
-11.8 0 -24.11 5.14 -32.83 13.83 c
-8.46 7.92 -14.36 16.35 -32.57 45.48 c
-21.29 35.52 -37.19 48.04 -71.04 56.98 c
0 -123.55 h
f
5179.99 3278.62 m
0 29.04 -16.71 52.69 -47.04 66.82 c
-23.64 10.8 -67.85 20.56 -93.81 20.56 c
-31.61 0 -51.15 -18.5 -51.15 -48.83 c
0 -29.82 16.45 -53.46 47.04 -67.59 c
23.39 -10.8 68.11 -20.59 94.07 -20.59 c
31.62 0 50.89 18.79 50.89 49.63 c
h
5150.99 3285.64 m
0 -11.98 -8.5 -19.64 -21.62 -19.64 c
-15.95 0 -50.43 5.88 -74.86 12.76 c
-25.47 7.14 -35.5 15.81 -35.5 30.86 c
0 11.73 8.49 19.38 21.61 19.38 c
24.96 0 82.07 -12.5 95.7 -20.91 c
9.78 -6.12 14.67 -13.52 14.67 -22.44 c
h
f
5119.59 3156.16 -125.59 26.71 0 -35.96 182.09 -38.78 0 23.89 P
-21.57 10.27 -32.62 31.33 -32.62 62.66 c
-23.89 5.14 h
f
5179.99 2993.62 m
0 29.04 -16.71 52.69 -47.04 66.82 c
-23.64 10.8 -67.85 20.56 -93.81 20.56 c
-31.61 0 -51.15 -18.5 -51.15 -48.83 c
0 -29.82 16.45 -53.46 47.04 -67.59 c
23.39 -10.8 68.11 -20.59 94.07 -20.59 c
31.62 0 50.89 18.79 50.89 49.63 c
h
5150.99 3000.64 m
0 -11.98 -8.5 -19.64 -21.62 -19.64 c
-15.95 0 -50.43 5.88 -74.86 12.76 c
-25.47 7.14 -35.5 15.81 -35.5 30.86 c
0 11.73 8.49 19.38 21.61 19.38 c
24.96 0 82.07 -12.5 95.7 -20.91 c
9.78 -6.12 14.67 -13.52 14.67 -22.44 c
h
f
Q q
200 2550 5440 0 0 5670 ^ Y
0.2 i
K
4817 4415 0 105.04 -16 0 0 -82.12 -113.99 87.08 -16 0 0 -111.04 ^ 
0 88.08 113.1 -87.03 H
f
4737.99 4299 -66.99 0 0 -19.01 146 0 ^ -63 0 0 75.01 ^ 
0 19.01 -146 0 ^ 66.99 0 H
f
Q q
200 2550 5440 0 0 5670 ^ Y
0.2 i
K
4715 4618.4 m
-14.8 13.59 -28.8 25.57 -39.39 33.76 c
-7.6 -7.59 p
23.17 -19.78 41.55 -37.36 52.54 -50.14 c
10.99 12.79 29.36 30.36 52.54 50.14 c
-7.62 7.59 p
-10.61 -8.19 -24.64 -20.18 -39.46 -33.76 c
0 157.81 -11 0 h
f
Q q
200 2550 5440 0 0 5670 ^ Y
0.2 i
K
4627.45 5041 0 -17 54.55 0 P
-11.08 -8.68 -16.01 -18.36 -16.01 -31.78 c
0 -26.64 21.91 -44.22 55.48 -44.22 c
35.38 0 57.52 17.13 57.52 44.77 c
0 14.13 -6.43 25.46 -18.84 33.22 c
15.81 0 0 15 h
4762.99 4995.1 m
0 -18.21 -16.16 -30.09 -41.1 -30.09 c
-23.73 0 -39.89 12.09 -39.89 30.09 c
0 17.41 15.96 28.89 40.49 28.89 c
24.54 0 40.5 -11.48 40.5 -28.89 c
h
f
4627.45 4930 0 -17 54.55 0 P
-11.08 -8.68 -16.01 -18.36 -16.01 -31.78 c
0 -26.64 21.91 -44.22 55.48 -44.22 c
35.38 0 57.52 17.13 57.52 44.77 c
0 14.13 -6.43 25.46 -18.84 33.22 c
15.81 0 0 15 h
4762.99 4884.1 m
0 -18.21 -16.16 -30.09 -41.1 -30.09 c
-23.73 0 -39.89 12.09 -39.89 30.09 c
0 17.41 15.96 28.89 40.49 28.89 c
24.54 0 40.5 -11.48 40.5 -28.89 c
h
f
Q q
200 2550 5440 0 0 5670 ^ Y
0.2 i
K
4512 4923 0 17 -119.43 0 119.43 76.68 0 20.32 -146 0 0 -17 118.05 0 
-118.05 -75.86 0 -21.14 H
f
4512 4779 0 17 -119.43 0 119.43 76.68 0 20.32 -146 0 0 -17 118.05 0 
-118.05 -75.86 0 -21.14 H
f
4512 4728.99 0 19.01 -146 0 0 -90.03 16 0 0 71.02 H
f
4514 4575.71 m
0 41.85 -30.85 70.29 -76.51 70.29 c
-45.66 0 -76.5 -28.43 -76.5 -70.48 c
0 -17.62 5.41 -33.44 15.42 -45.26 c
13.41 -15.82 36.04 -25.25 59.87 -25.25 c
47.06 0 77.71 27.86 77.71 70.71 c
h
4497.99 4575.71 m
0 -31.41 -24.21 -51.7 -61.31 -51.7 c
-35.48 0 -59.68 20.89 -59.68 51.5 c
0 30.81 24.19 51.48 60.48 51.48 c
36.29 0 60.51 -20.68 60.51 -51.29 c
h
f
4365.8 4295.83 15.38 18.82 P
15.18 -13.82 33.95 -20.65 56.91 -20.65 c
45.14 0 75.91 28.46 75.91 70.51 c
0 42.05 -30.85 70.48 -76.51 70.48 c
-45.66 0 -76.5 -28.43 -76.5 -70.48 c
0 -14.42 3.33 -26.43 10.6 -38.25 c
-17.38 -21.03 h
4406.43 4346.42 -11.29 9.14 -12.5 -14.71 P
-4.03 8.55 -5.64 15.11 -5.64 23.86 c
0 30.81 24.19 51.29 60.48 51.29 c
36.29 0 60.51 -20.68 60.51 -51.48 c
0 -30.81 -24.21 -51.5 -60.3 -51.5 c
-18.95 0 -33.67 4.98 -45.97 15.72 c
h
f
4466.48 4154.76 m
31.94 5.84 47.52 24.3 47.52 56.41 c
0 19.67 -6.22 35.52 -18.24 46.36 c
-14.42 13.24 -35.24 20.47 -58.87 20.47 c
-24.03 0 -44.66 -7.43 -58.87 -21.27 c
-11.62 -11.24 -17.02 -25.69 -17.02 -44.75 c
0 -35.72 19.31 -55.79 58.14 -60.21 c
0 19.21 p
-10.19 1.6 -17.11 3.6 -23.01 6.6 c
-12.21 6 -19.13 18.4 -19.13 34.01 c
0 29.01 23.39 47.41 60.08 47.41 c
37.7 0 60.91 -17.61 60.91 -45.81 c
0 -11.8 -3.64 -22.81 -9.3 -28.81 c
-5.05 -5.4 -11.31 -8.4 -22.21 -10.6 c
h
f
4366 4124 0 -55.9 P
0 -36.6 27.63 -59.1 73.09 -59.1 c
45.25 0 72.91 22.3 72.91 59.1 c
0 55.9 h
4382 4104.99 113.99 0 0 -33.77 P
0 -28.27 -19.59 -43.21 -57.11 -43.21 c
-37.11 0 -56.88 14.94 -56.88 43.21 c
h
f
4419 3836.33 0 41.68 41.68 0 0 14 ^ 0 41 -14.01 0 ^ 
-40.99 0 0 -14 ^ 0 -41.68 H
f
4512 3641 0 17 -119.43 0 119.43 76.68 0 20.32 -146 0 0 -17 118.05 0 
-118.05 -75.86 0 -21.14 H
f
4512 3590.99 0 19.01 -146 0 0 -90.03 16 0 0 71.02 H
f
4514 3437.71 m
0 41.85 -30.85 70.29 -76.51 70.29 c
-45.66 0 -76.5 -28.43 -76.5 -70.48 c
0 -17.62 5.41 -33.44 15.42 -45.26 c
13.41 -15.82 36.04 -25.25 59.87 -25.25 c
47.06 0 77.71 27.86 77.71 70.71 c
h
4497.99 3437.71 m
0 -31.41 -24.21 -51.7 -61.31 -51.7 c
-35.48 0 -59.68 20.89 -59.68 51.5 c
0 30.81 24.19 51.48 60.48 51.48 c
36.29 0 60.51 -20.68 60.51 -51.29 c
h
f
4432.99 3266.99 0 -78.85 16.01 0 ^ 46.99 0 0 -82.03 16 0 0 101.04 
-146 0 0 -104.04 16 0 0 85.03 H
f
4366 3022.38 146 -36.96 0 20.77 -118.63 26.77 118.63 33.16 0 19.97 -118.63 32.36 118.63 27.37 
0 20.77 -146 -37.36 0 -20.37 119.66 -32.56 -119.66 -33.56 H
f
cleartomark end end pagesave restore
 showpage
%%PageTrailer
%%Trailer
%%Pages: 1
%%EOF
