\relax 
\citation{Higgs:1964ia,Higgs:1964pj,Higgs:1966ev,Englert:1964et,Guralnik:1964eu}
\@writefile{toc}{\contentsline {section}{\numberline {1}Preface}{5}}
\citation{Georgi:1977gs}
\citation{Georgi:1977gs}
\citation{Dawson:1991zj,Djouadi:1991tka}
\citation{Graudenz:1992pv,Spira:1995rr}
\citation{Harlander:2000mg,Catani:2001ic,Harlander:2001is,Harlander:2002wh,Anastasiou:2002yz,Ravindran:2003um,Blumlein:2005im}
\citation{Catani:2003zt}
\citation{Moch:2005ky,Laenen:2005uz,Idilbi:2005ni,Ravindran:2005vv,Ravindran:2006cg}
\citation{Marzani:2008az,Harlander:2009bw,Harlander:2009mq,Harlander:2009my,Pak:2009bx,Pak:2009dg}
\citation{Anastasiou:2008tj}
\citation{Djouadi:1994ge,Aglietti:2004nj,Degrassi:2004mx,Actis:2008ts,Actis:2008ug}
\citation{Actis:2008ug}
\citation{Actis:2008ug}
\citation{Anastasiou:2008tj}
\citation{Keung:2009bs,Brein:2010xj}
\@writefile{toc}{\contentsline {section}{\numberline {2}Gluon-Fusion Process\oldfootnote {M. Grazzini, F. Petriello, J. Qian, F. Stoeckli (eds.); C. Anastasiou, J. Baglio, R. Boughezal, A. Djouadi, D. de Florian}}{8}}
\@writefile{lof}{\contentsline {figure}{\numberline {1}{\ignorespaces  \it  Feynman diagram contributing to $gg\to H$ at lowest order.}}{8}}
\newlabel{fig:triangle}{{1}{8}}
\citation{Anastasiou:2008tj,deFlorian:2009hc}
\citation{Martin:2009iq}
\citation{Anastasiou:2008tj}
\citation{Aglietti:2004nj,Degrassi:2004mx,Actis:2008ug,Actis:2008ts}
\citation{Actis:2008ug,Actis:2008ts}
\citation{Anastasiou:2008tj}
\citation{Keung:2009bs}
\citation{deFlorian:2009hc}
\citation{deFlorian:2009hc}
\citation{Graudenz:1992pv,Spira:1995rr}
\citation{Catani:2003zt}
\citation{Aglietti:2004nj,Degrassi:2004mx,Actis:2008ug,Actis:2008ts}
\citation{Actis:2008ug,Actis:2008ts}
\citation{calculator}
\citation{Anastasiou:2008tj}
\citation{deFlorian:2009hc}
\@writefile{lof}{\contentsline {figure}{\numberline {2}{\ignorespaces Comparison of ABPS \cite  {Anastasiou:2008tj} and dFG \cite  {deFlorian:2009hc} results, including scale uncertainty bands.}}{9}}
\newlabel{fig:comp}{{2}{9}}
\citation{Moch:2005ky}
\citation{Anastasiou:2008tj}
\citation{Actis:2008ug,Actis:2008ts}
\citation{Anastasiou:2008tj}
\citation{Marzani:2008az,Harlander:2009bw,Harlander:2009mq,Harlander:2009my,Pak:2009bx,Pak:2009dg}
\@writefile{lot}{\contentsline {table}{\numberline {1}{\ignorespaces }}{11}}
\newlabel{tab:dFG7}{{1}{11}}
\@writefile{lot}{\contentsline {table}{\numberline {2}{\ignorespaces }}{12}}
\newlabel{tab:ABPS7}{{2}{12}}
\@writefile{lot}{\contentsline {table}{\numberline {3}{\ignorespaces }}{13}}
\newlabel{tab:dFG14}{{3}{13}}
\@writefile{lot}{\contentsline {table}{\numberline {4}{\ignorespaces }}{14}}
\newlabel{tab:ABPS14}{{4}{14}}
\citation{Martin:2009iq}
\citation{Martin:2002aw}
\citation{Martin:2009bu}
\@writefile{lof}{\contentsline {figure}{\numberline {3}{\ignorespaces Comparison of NNLL and NNLO bands with different choice of the central scale.}}{15}}
\newlabel{fig:compband}{{3}{15}}
\citation{Alekhin:2009ni}
\citation{JimenezDelgado:2009tv}
\citation{CooperSarkar:2010ik}
\citation{Baglio:2010um}
\citation{Baglio:toap}
\citation{Martin:2009bu}
\citation{Alekhin:2009ni}
\citation{Ahrens:2010rs}
\citation{Ahrens:2010rs}
\citation{Ahrens:2008qu,Ahrens:2008nc}
\citation{Ahrens:2010rs}
\citation{Ahrens:2010rs}
\citation{Ahrens:2010rs}
\citation{Ahrens:2008nc}
\citation{Catani:2003zt}
\citation{Ahrens:2010rs}
\citation{Ahrens:2010rs}
\citation{Moch:2005ky}
\@writefile{lot}{\contentsline {table}{\numberline {5}{\ignorespaces }}{17}}
\newlabel{tab:BD7}{{5}{17}}
\@writefile{lot}{\contentsline {table}{\numberline {6}{\ignorespaces }}{18}}
\newlabel{tab:BD14}{{6}{18}}
\citation{Asai:2004ws}
\citation{Abdullin:2005yn}
\citation{Duhrssen:2004cv}
\citation{Hankele:2006ma}
\citation{Barger:1994zq,Rainwater:1997dg,Rainwater:1998kj,Rainwater:1999sd,DelDuca:2006hk}
\citation{DelDuca:2001fn,Campbell:2006xx}
\citation{Nikitenko:2007it}
\citation{Campbell:2006xx}
\citation{Spira:1997dg,Han:1992hr,Figy:2003nv,Figy:2004pt,Berger:2004pca}
\citation{Ciccolini:2007jr,Ciccolini:2007ec,HAWK}
\citation{Figy:2003nv,Arnold:2008rz}
\citation{VV2H}
\citation{HiggsLH:2008uu}
\@writefile{toc}{\contentsline {section}{\numberline {3}Vector-Boson-Fusion Process\oldfootnote {A.\nobreakspace  {}Denner, S.\nobreakspace  {}Farrington, C.\nobreakspace  {}Hackstein, C.\nobreakspace  {}Oleari, D.\nobreakspace  {}Rebuzzi (eds.); P.\nobreakspace  {}Bolzoni, D.\nobreakspace  {}Dittmaier, F.\nobreakspace  {}Maltoni, S.-O.\nobreakspace  {}Moch, A.\nobreakspace  {}M\"uck, S. Palmer, M.\nobreakspace  {}Zaro.} }{19}}
\@writefile{toc}{\contentsline {subsection}{\numberline {3.1}Higgs-boson production in vector-boson fusion}{19}}
\newlabel{sec:intro}{{3.1}{19}}
\citation{Ciccolini:2007jr,Ciccolini:2007ec}
\citation{Bolzoni:2010xr}
\citation{Han:1992hr,Ciccolini:2007ec}
\citation{Ciccolini:2007jr,Ciccolini:2007ec,HAWK}
\citation{Ghinculov:1995bz,Frink:1996sv}
\@writefile{lof}{\contentsline {figure}{\numberline {4}{\ignorespaces Topologies of $t$-, $u$-, and $s$-channel contributions for ${\mathrm  {q}}{\mathrm  {q}}\to {\mathrm  {q}}{\mathrm  {q}}\PH  $ at LO, where ${\mathrm  {q}}$ denotes any quark or antiquark and $V$ stands for \PW  and \PZ  \nobreakspace  {}boson.}}{20}}
\newlabel{fig:VBFLOtops}{{4}{20}}
\@writefile{toc}{\contentsline {subsection}{\numberline {3.2}NLO calculations}{20}}
\newlabel{sec:NLO_calculations}{{3.2}{20}}
\citation{Alwall:2006yp}
\citation{Andersen:2007mp,Bredenstein:2008tm}
\citation{Figy:2003nv}
\citation{Han:1992hr}
\citation{Bardeen:1978yd}
\citation{Kazakov:1990fu,Zijlstra:1992kj,Zijlstra:1992qd,Moch:1999eb}
\citation{vanNeerven:1984ak,Blumlein:1992eh,Figy:2007kv}
\citation{Harlander:2008xn}
\@writefile{toc}{\contentsline {subsubsection}{\numberline {3.2.1}HAWK - NLO QCD and EW corrections}{21}}
\newlabel{sec:HAWK}{{3.2.1}{21}}
\@writefile{toc}{\contentsline {subsubsection}{\numberline {3.2.2}VBFNLO - NLO QCD and EW corrections}{21}}
\newlabel{sec:VBFNLO}{{3.2.2}{21}}
\@writefile{toc}{\contentsline {subsection}{\numberline {3.3}NNLO QCD corrections}{21}}
\newlabel{sec:VBF-NNLO}{{3.3}{21}}
\citation{WebInterface:2010}
\@writefile{lof}{\contentsline {figure}{\numberline {5}{\ignorespaces VBF cross sections at the LHC at 7\nobreakspace  {}(left) and 14\nobreakspace  {}\ensuremath  {\nobreakspace  {}\textstyle {TeV}}\nobreakspace  {}(right) estimated with MSTW2008 PDF set. NLO QCD results, with and without the EW corrections, and NNLO QCD result are shown. The bands represent the PDF + $\ensuremath  {\alpha _{\mathrm  {s}}}$ 68\% CL uncertainty.}}{22}}
\newlabel{fig:totXsecMSTW2008}{{5}{22}}
\@writefile{lof}{\contentsline {figure}{\numberline {6}{\ignorespaces NLO VBF cross sections at the LHC at 7\nobreakspace  {}(left) and 14\nobreakspace  {}\ensuremath  {\nobreakspace  {}\textstyle {TeV}}\nobreakspace  {}(right). Results with and without the EW corrections are plotted. The bands represent the PDF + $\ensuremath  {\alpha _{\mathrm  {s}}}$ 68\% CL uncertainty coming from the {\em  envelope} of three PDF sets (see text for details).}}{22}}
\newlabel{fig:totXsecEnvelope}{{6}{22}}
\@writefile{toc}{\contentsline {subsection}{\numberline {3.4}Results}{22}}
\citation{Martin:2009iq}
\citation{Alekhin:2009ni}
\citation{JimenezDelgado:2009tv}
\citation{WebInterface:2010}
\@writefile{lot}{\contentsline {table}{\numberline {7}{\ignorespaces NLO QCD + EW results at $\sqrt  {S} = 7 $\nobreakspace  {}\ensuremath  {\nobreakspace  {}\textstyle {TeV}}: central values (in \ensuremath  {\nobreakspace  {}\textstyle {fb}}) and relative uncertainties (in \%) from {\tt  HAWK}. Integration errors, affecting the last shown digit, are below $0.1\%$. In the last column, {\tt  VBFNLO} results obtained with CTEQ6.6, for sake of comparison (integration errors at the 0.3\% level).}}{24}}
\newlabel{tab:yesEWnoSch7TeV}{{7}{24}}
\@writefile{lot}{\contentsline {table}{\numberline {8}{\ignorespaces NLO QCD results (NLO EW corrections not included) at $\sqrt  {S} = 7 $\nobreakspace  {}\ensuremath  {\nobreakspace  {}\textstyle {TeV}}: central values (in \ensuremath  {\nobreakspace  {}\textstyle {fb}}) and relative uncertainties (in \%) from {\tt  VBFNLO}. Integration errors, affecting the last shown digit, are below $0.3\%$. In the last column, {\tt  HAWK} results obtained with MSTW2008NLO, for sake of comparison (integration errors at the 0.1\% level).}}{25}}
\newlabel{tab:noEWnoSch7TeV}{{8}{25}}
\@writefile{lot}{\contentsline {table}{\numberline {9}{\ignorespaces NLO QCD + EW results at $\sqrt  {S} = 14 $\nobreakspace  {}\ensuremath  {\nobreakspace  {}\textstyle {TeV}}: central values (in \ensuremath  {\nobreakspace  {}\textstyle {fb}}) and relative uncertainties (in \%) for {\tt  HAWK}. Integration errors, affecting the last shown digit, are below $0.1\%$. In the last column, the {\tt  VBFNLO} results obtained with CTEQ6.6, for sake of comparison (integration errors at the 0.3\% level).}}{26}}
\newlabel{tab:siEWnoSch14TeV}{{9}{26}}
\newlabel{tab:yesEWnoSch14TeV}{{9}{26}}
\@writefile{lot}{\contentsline {table}{\numberline {10}{\ignorespaces NLO QCD results (NLO EW corrections not included) at $\sqrt  {s} = 14$\nobreakspace  {}\ensuremath  {\nobreakspace  {}\textstyle {TeV}}: central values (in \ensuremath  {\nobreakspace  {}\textstyle {fb}}) and relative uncertainties (in \%) from {\tt  VBFNLO}. Integration errors, affecting the last shown digit, are below $0.3\%$. }}{27}}
\newlabel{tab:noEWnoSch14TeV}{{10}{27}}
\@writefile{lot}{\contentsline {table}{\numberline {11}{\ignorespaces NNLO QCD Results at $\sqrt  {s} = 7$\nobreakspace  {}\ensuremath  {\nobreakspace  {}\textstyle {TeV}}: central values and pdf errors (in \ensuremath  {\nobreakspace  {}\textstyle {pb}}) and evaluated with MSTW2008NNLO pdf set. Integration errors are below the 0.1\% level.}}{28}}
\newlabel{tab:NNLO7TeV}{{11}{28}}
\@writefile{lot}{\contentsline {table}{\numberline {12}{\ignorespaces NNLO QCD Results at $\sqrt  {s} = 14$\nobreakspace  {}\ensuremath  {\nobreakspace  {}\textstyle {TeV}}: central values and pdf errors (in \ensuremath  {\nobreakspace  {}\textstyle {pb}}) and evaluated with MSTW2008NNLO pdf set. Integration errors are below the 0.1\% level.}}{29}}
\newlabel{tab:NNLO14TeV}{{12}{29}}
\citation{Baer:1998cm}
\citation{atlasphystdr,ATL-PHYS-2000-008}
\citation{CSC}
\citation{atlasphystdr}
\citation{ATL-PHYS-2000-023,ATL-PHYS-2000-024}
\citation{Butterworth:2008iy}
\citation{ATL-PHYS-PUB-2009-088}
\citation{CERN-THESIS-2010-027}
\@writefile{toc}{\contentsline {section}{\numberline {4}$\PW  \PH  $/$\PZ  \PH  $ production mode\oldfootnote {S.\nobreakspace  {}Dittmaier, R.V.\nobreakspace  {}Harlander, J.\nobreakspace  {}Olsen, G.\nobreakspace  {}Piacquadio (eds.); O.\nobreakspace  {}Brein, M.\nobreakspace  {}Kr\"amer, T.\nobreakspace  {}Zirke }}{30}}
\@writefile{toc}{\contentsline {subsection}{\numberline {4.1}Experimental overview}{30}}
\citation{Han:1991ia,Baer:1992vx,Ohnemus:1992bd}
\citation{Hamberg:1990np,Harlander:2002wh}
\citation{Brein:2003wg}
\citation{Hamberg:1990np}
\citation{Brein:2003wg}
\@writefile{lof}{\contentsline {figure}{\numberline {7}{\ignorespaces (a), (b) LO diagrams for the partonic processes $\Pp  \Pp  \to V\PH  $ ($V=\PW  ,\PZ  $); (c) diagram contributing to the $\Pg  \Pg  \to \PH  \PZ  $ channel.}}{31}}
\newlabel{fig:ppVH-LO-diags}{{7}{31}}
\@writefile{toc}{\contentsline {subsection}{\numberline {4.2}Theoretical framework}{31}}
\newlabel{eq:sigpart}{{1}{31}}
\citation{Ciccolini:2003jy}
\citation{Brein:2004ue}
\citation{Ciccolini:2007ec,Ciccolini:2007jr}
\citation{Ciccolini:2003jy}
\@writefile{toc}{\contentsline {subsection}{\numberline {4.3}Numerical results}{32}}
\citation{V2HV}
\citation{MCFM}
\@input{YRHXS_WHZH/wzh7nnlo.aux}
\@input{YRHXS_WHZH/wzh14nnlo.aux}
\@writefile{lof}{\contentsline {figure}{\numberline {8}{\ignorespaces }}{34}}
\newlabel{fig:wh-xsec}{{8}{34}}
\@writefile{lof}{\contentsline {figure}{\numberline {9}{\ignorespaces }}{34}}
\newlabel{fig:wh-k}{{9}{34}}
\@writefile{lof}{\contentsline {figure}{\numberline {10}{\ignorespaces }}{35}}
\newlabel{fig:zh-xsec}{{10}{35}}
\@writefile{lof}{\contentsline {figure}{\numberline {11}{\ignorespaces }}{35}}
\newlabel{fig:zh-k}{{11}{35}}
\@writefile{lot}{\contentsline {table}{\numberline {13}{\ignorespaces }}{36}}
\newlabel{tab:wzh7}{{13}{36}}
\@writefile{lot}{\contentsline {table}{\numberline {14}{\ignorespaces }}{37}}
\newlabel{tab:wzh14}{{14}{37}}
\citation{Raitio:1978pt,Ng:1983jm,Kunszt:1984ri,Gunion:1991kg,Marciano:1991qq}
\citation{Spira:1997dg,HQQ}
\citation{Stelzer:1994tk,Madgraph}
\citation{MCFM}
\citation{PYTHIA}
\citation{Beenakker:2001rj,Beenakker:2002nc,Reina:2001sf,Dawson:2002tg}
\citation{Dawson:1997im}
\citation{Bredenstein:2009aj,Bredenstein:2008zb,Bredenstein:2010rs,Bevilacqua:2009zn,Binoth:2010ra}
\citation{Binoth:2010ra}
\citation{Bevilacqua:2010ve}
\citation{Martin:2009iq,Martin:2009bu}
\citation{Pumplin:2002vw}
\citation{Ball:2010de}
\@writefile{toc}{\contentsline {section}{\numberline {5}ttH Process\oldfootnote {C.\nobreakspace  {}Collins-Tooth, C.\nobreakspace  {}Neu, L.\nobreakspace  {}Reina, M.\nobreakspace  {}Spira (eds.); S.\nobreakspace  {}Dawson, S.\nobreakspace  {}Dean, S.\nobreakspace  {}Dittmaier, M.\nobreakspace  {}Kr\"amer, C.T.\nobreakspace  {}Potter, D.\nobreakspace  {}Wackeroth}}{38}}
\@writefile{lof}{\contentsline {figure}{\numberline {12}{\ignorespaces \it   Examples of LO Feynman diagrams for the partonic processes $\PQq  \PAQq  ,\Pg  \Pg  \to \PQt  \PAQt  \PH  $.}}{38}}
\newlabel{fg:lodiatth}{{12}{38}}
\@writefile{lot}{\contentsline {table}{\numberline {15}{\ignorespaces \it   LO cross sections of $\Pp  \Pp  \to \PQt  \PAQt  \PH  $ for $\sqrt  {s}=7$ \ensuremath  {\nobreakspace  {}\textstyle {TeV}}using MSTW2008 and CTEQ6.6 PDFs. The scale dependence is given for the scale variation $\mu _0/2 < \mu _R,\mu _F < 2\mu _0]$ with $\mu _0=\relax $m_{\PQt  }$+\relax $M_{\PH  }$/2$. The PDF uncertainties are defined at 68\% C.L. using MSTW2008. The numbers in brackets denote the integration errors.}}{39}}
\newlabel{tb:siglo}{{15}{39}}
\@writefile{lot}{\contentsline {table}{\numberline {16}{\ignorespaces \it   LO and NLO cross sections of $\Pp  \Pp  \to \PQt  \PAQt  \PH  $ for $\sqrt  {s}=7$ \ensuremath  {\nobreakspace  {}\textstyle {TeV}}using MSTW2008 PDFs. The scale dependence is given for the scale variation $\mu _0/2 < \mu _R,\mu _F < 2\mu _0$ with $\mu _0=\relax $m_{\PQt  }$+\relax $M_{\PH  }$/2$. The $\alpha _s$ and PDF uncertainties are defined at 68\% C.L. The last column contains the combined PDF+$\alpha _s$ uncertainties obtained with combined PDF sets. The numbers in brackets denote the integration errors.}}{40}}
\newlabel{tb:mstw}{{16}{40}}
\@writefile{lot}{\contentsline {table}{\numberline {17}{\ignorespaces \it   LO and NLO cross sections of $\Pp  \Pp  \to \PQt  \PAQt  \PH  $ for $\sqrt  {s}=7$ \ensuremath  {\nobreakspace  {}\textstyle {TeV}}using CTEQ6.6 PDFs. The scale dependence is given for the scale variation $\mu _0/2 < \mu _R,\mu _F < 2\mu _0$ with $\mu _0=\relax $m_{\PQt  }$+\relax $M_{\PH  }$/2$. The $\alpha _s$ and PDF uncertainties are defined at 68\% C.L. The numbers in brackets denote the integration errors.}}{41}}
\newlabel{tb:cteq}{{17}{41}}
\@writefile{lot}{\contentsline {table}{\numberline {18}{\ignorespaces \it   NLO cross sections of $\Pp  \Pp  \to \PQt  \PAQt  \PH  $ for $\sqrt  {s}=7$ \ensuremath  {\nobreakspace  {}\textstyle {TeV}}using NNPDF PDFs. The scale dependence is given for the scale variation $\mu _0/2 < \mu _R,\mu _F < 2\mu _0$ with $\mu _0=\relax $m_{\PQt  }$+\relax $M_{\PH  }$/2$. The $\alpha _s$ and PDF uncertainties are defined at 68\% C.L.}}{42}}
\newlabel{tb:nnpdf}{{18}{42}}
\@writefile{lot}{\contentsline {table}{\numberline {19}{\ignorespaces \it   NLO cross sections of $\Pp  \Pp  \to \PQt  \PAQt  \PH  $ for $\sqrt  {s}=7$ \ensuremath  {\nobreakspace  {}\textstyle {TeV}}obtained according to the envelope method of the PDF4LHC goup.}}{43}}
\newlabel{tb:sig7}{{19}{43}}
\@writefile{lot}{\contentsline {table}{\numberline {20}{\ignorespaces \it   NLO cross sections of $\Pp  \Pp  \to \PQt  \PAQt  \PH  $ for $\sqrt  {s}=14$ \ensuremath  {\nobreakspace  {}\textstyle {TeV}}obtained according to the envelope method of the PDF4LHC goup.}}{44}}
\newlabel{tb:sig14}{{20}{44}}
\@writefile{lof}{\contentsline {figure}{\numberline {13}{\ignorespaces  \it  Total production cross sections of $\Pp  \Pp  \to \PQt  \PAQt  \PH  + X$ for $\sqrt  {s}=7$ \ensuremath  {\nobreakspace  {}\textstyle {TeV}}at LO and NLO for the different sets of PDFs.}}{45}}
\newlabel{fg:cxn}{{13}{45}}
\@writefile{lof}{\contentsline {figure}{\numberline {14}{\ignorespaces  \it  Total production cross sections of $\Pp  \Pp  \to \PQt  \PAQt  \PH  + X$ for $\sqrt  {s}=7,14$ \ensuremath  {\nobreakspace  {}\textstyle {TeV}}at NLO including the total uncertainties according to the PDF4LHC recommendation.}}{46}}
\newlabel{fg:cxntot}{{14}{46}}
\citation{Hall:1993gn,Hempfling:1993kv,Carena:1994bv,Pierce:1996zz,Carena:1999py,Guasch:2003cv,Noth:2008tw,Noth:2010jy,Mihaila:2010mp}
\citation{Barate:2003sz,Schael:2006cr}
\citation{Carena:2002qg}
\@writefile{toc}{\contentsline {section}{\numberline {6}MSSM Neutral Higgs Production Processes\oldfootnote {M.\nobreakspace  {}Spira, M.\nobreakspace  {}Vazquez Acosta, M.\nobreakspace  {}Warsinsky, G.\nobreakspace  {}Weiglein (eds.); S.\nobreakspace  {}Dittmaier, R.\nobreakspace  {}Harlander, S.\nobreakspace  {}Heinemeyer, A.\nobreakspace  {}Kalinowski, M.\nobreakspace  {}M\"uhlleitner, M.\nobreakspace  {}Kr\"amer, H.\nobreakspace  {}Rzehak, M.\nobreakspace  {}Schumacher, P.\nobreakspace  {}Slavich, T.\nobreakspace  {}Vickey}}{47}}
\newlabel{sec:mssm_neutral}{{6}{47}}
\@writefile{toc}{\contentsline {subsection}{\numberline {6.1}Higgs phenomenology in the MSSM}{47}}
\newlabel{sec:mssmvssm}{{6.1}{47}}
\newlabel{YRHXS_MSSM_neutral_eq:mhmax}{{3}{47}}
\citation{Heinemeyer:1998yj,Heinemeyer:1998np,Degrassi:2002fi,Frank:2006yh}
\citation{Lee:2003nta,Lee:2007gn}
\citation{Carena:2002qg}
\citation{Djouadi:1997yw,Spira:1997dg}
\citation{Dawson:1996xz}
\citation{Djouadi:1991tka,Dawson:1991zj,Kauffman:1993nv,Dawson:1993qf}
\citation{Graudenz:1992pv,Spira:1993bb,Spira:1995rr,Harlander:2005rq,Anastasiou:2006hc,Aglietti:2006tp,Bonciani:2007ex}
\citation{Kramer:1996iq,Spira:1997dg,Djouadi:2005gi,Djouadi:2005gj}
\citation{Harlander:2002wh,Harlander:2002vv,Anastasiou:2002yz,Anastasiou:2002wq,Ravindran:2003um}
\citation{Graudenz:1992pv,Spira:1993bb,Spira:1995rr,Anastasiou:2006hc,Aglietti:2006tp,Bonciani:2007ex}
\citation{Dawson:1996xz}
\citation{Muhlleitner:2006wx,Anastasiou:2006hc,Aglietti:2006tp,Bonciani:2007ex}
\citation{Harlander:2003bb,Harlander:2003kf,Harlander:2004tp,Harlander:2005if,Degrassi:2010eu}
\citation{Anastasiou:2008rm,Muhlleitner:2010nm}
\citation{Dawson:1996xz}
\citation{Harlander:2003bb,Harlander:2003kf,Harlander:2004tp,Harlander:2005if,Anastasiou:2008rm}
\citation{Muhlleitner:2010nm,Degrassi:2010eu}
\citation{Catani:2003zt,Ravindran:2005vv,Moch:2005ky}
\@writefile{toc}{\contentsline {subsection}{\numberline {6.2}Overview about the most relevant MSSM Higgs production processes}{48}}
\@writefile{lof}{\contentsline {figure}{\numberline {15}{\ignorespaces  \it  Typical diagram contributing to $\Pg  \Pg  \to \PSh  ,\PSH  ,\PSA  $ at lowest order.}}{48}}
\newlabel{YRHXS_MSSM_neutral_dia1}{{15}{48}}
\citation{Cahn:1983ip,Hikasa:1985ee,Altarelli:1987ue}
\citation{Han:1992hr,Figy:2003nv,Berger:2004pca,Ciccolini:2007jr,Ciccolini:2007ec}
\citation{Djouadi:1999ht,Hollik:2008xn}
\citation{Hollik:2008xn}
\citation{Glashow:1978ab,Kunszt:1991xk}
\citation{Butterworth:2008iy}
\citation{Han:1991ia,Spira:1997dg}
\citation{Brein:2003wg}
\citation{Djouadi:1999ht}
\citation{Raitio:1978pt,Ng:1983jm,Kunszt:1984ri,Gunion:1991kg,Marciano:1991qq}
\citation{Beenakker:2001rj,Beenakker:2002nc,Reina:2001sf,Dawson:2002tg}
\citation{Peng:2005ti,Hollik:2006vn,Hafliger:2006zz,Walser:2008zz}
\@writefile{lof}{\contentsline {figure}{\numberline {16}{\ignorespaces  \it  Diagram contributing to $\PQq  \PQq  \to \PQq  \PQq  V^*V^* \to \PQq  \PQq  + \PSh  /\PSH  $ ($V=\PW  ,\PZ  $) at lowest order.}}{49}}
\newlabel{YRHXS_MSSM_neutral_dia2}{{16}{49}}
\citation{Raitio:1978pt,Ng:1983jm,Kunszt:1984ri,Gunion:1991kg,Marciano:1991qq}
\citation{Dittmaier:2003ej,Dawson:2003kb}
\citation{Dicus:1988cx}
\citation{Dicus:1998hs,Balazs:1998sb}
\citation{Harlander:2003ai}
\citation{Campbell:2004pu,Dawson:2005vi}
\citation{Carena:2002qg}
\citation{Heinemeyer:1998yj,Heinemeyer:1998np,Degrassi:2002fi,Frank:2006yh}
\@writefile{lof}{\contentsline {figure}{\numberline {17}{\ignorespaces  \it  Diagram contributing to $\PQq  \PAQq  \to V^* \to V + \PSh  /\PSH  $ ($V=\PW  ,\PZ  $) at lowest order.}}{50}}
\newlabel{YRHXS_MSSM_neutral_dia3}{{17}{50}}
\@writefile{lof}{\contentsline {figure}{\numberline {18}{\ignorespaces  \it  Typical diagrams contributing to $\PQq  \PAQq  /\Pg  \Pg  \to Q\mathaccentV {bar}016Q + \PSh  /\PSH  /\PSA  \nobreakspace  {}\nobreakspace  {}(Q=\PQt  ,\PQb  )$ at lowest order.}}{50}}
\newlabel{YRHXS_MSSM_neutral_dia4}{{18}{50}}
\citation{Spira:1995mt}
\citation{Harlander:2002wh,Harlander:2002vv}
\@writefile{lof}{\contentsline {figure}{\numberline {19}{\ignorespaces  \it  Typical diagrams for the Higgs boson production mechanisms related to Higgs radiation off bottom quarks in the 4FS and 5FS at leading order: {\it  (a)} $\PQb  \PAQb  \to \PSh  /\PSH  /\PSA  $ and {\it  (b)} $\Pg  \Pg  \to \PQb  \PAQb  +\PSh  /\PSH  /\PSA  $.}}{51}}
\newlabel{YRHXS_MSSM_neutral_dia5}{{19}{51}}
\@writefile{toc}{\contentsline {subsection}{\numberline {6.3}Gluon Fusion}{51}}
\newlabel{YRHXS_MSSM_neutral_eq1}{{4}{51}}
\citation{Marzani:2008az,Harlander:2009bw,Harlander:2009mq,Harlander:2009my,Pak:2009bx,Pak:2009dg}
\citation{Djouadi:1994ge,Aglietti:2004nj,Degrassi:2004mx,Actis:2008ug}
\citation{Catani:2003zt,Ravindran:2005vv,Moch:2005ky}
\citation{Heinemeyer:1998yj,Heinemeyer:1998np,Degrassi:2002fi,Frank:2006yh}
\citation{Martin:2009iq,Martin:2009bu}
\citation{Spira:1993bb,Spira:1995rr}
\citation{Degrassi:2010eu}
\citation{Martin:2009iq,Martin:2009bu}
\citation{Martin:2009iq,Martin:2009bu}
\citation{Martin:2009iq,Martin:2009bu}
\citation{Martin:2009iq,Martin:2009bu}
\citation{Martin:2009iq,Martin:2009bu}
\citation{Martin:2009iq,Martin:2009bu}
\@writefile{lof}{\contentsline {figure}{\numberline {20}{\ignorespaces  \it  Total gluon fusion cross sections of the pseudoscalar MSSM Higgs boson $\PSA  $ for four values of $\qopname  \relax o{tan}\beta $ within the $\ensuremath  {m_h^{\rm  max}}$ scenario for $\sqrt  {s}=7$ \ensuremath  {\nobreakspace  {}\textstyle {TeV}}using MSTW2008 PDFs \cite  {Martin:2009iq,Martin:2009bu}. The NNLO results for the SM-type contributions have been obtained from the programs HIGLU and ggH@NNLO, while the rescaling with MSSM coupling factors has been done with {\sc  FeynHiggs}.}}{53}}
\newlabel{YRHXS_MSSM_neutral_fig1}{{20}{53}}
\citation{Harlander:2003ai}
\citation{Martin:2009iq,Martin:2009bu}
\citation{Hall:1993gn,Hempfling:1993kv,Carena:1994bv,Pierce:1996zz,Carena:1999py,Guasch:2003cv,Noth:2008tw,Noth:2010jy,Mihaila:2010mp}
\citation{Hafliger:2006zz,Walser:2008zz}
\citation{Dittmaier:2006cz}
\citation{Martin:2009iq,Martin:2009bu}
\citation{Martin:2009iq,Martin:2009bu}
\@writefile{lof}{\contentsline {figure}{\numberline {21}{\ignorespaces  \it  Total gluon fusion cross sections of the light scalar (CP-even) MSSM Higgs boson $\PSh  $ for four values of $\qopname  \relax o{tan}\beta $ within the $\ensuremath  {m_h^{\rm  max}}$ scenario for $\sqrt  {s}=7$ \ensuremath  {\nobreakspace  {}\textstyle {TeV}}using MSTW2008 PDFs \cite  {Martin:2009iq,Martin:2009bu}. The NNLO results for the SM-type contributions have been obtained from the programs HIGLU and ggH@NNLO, while the rescaling with MSSM coupling factors has been done with {\sc  FeynHiggs}.}}{54}}
\newlabel{YRHXS_MSSM_neutral_fig2}{{21}{54}}
\@writefile{toc}{\contentsline {subsection}{\numberline {6.4}Higgs Radiation off Bottom Quarks}{54}}
\citation{Martin:2010db}
\citation{Campbell:2004pu}
\citation{Martin:2009iq,Martin:2009bu}
\citation{Martin:2009iq,Martin:2009bu}
\@writefile{lof}{\contentsline {figure}{\numberline {22}{\ignorespaces  \it  Total gluon fusion cross sections of the heavy scalar (CP-even) MSSM Higgs boson $\PSH  $ for four values of $\qopname  \relax o{tan}\beta $ within the $\ensuremath  {m_h^{\rm  max}}$ scenario for $\sqrt  {s}=7$ \ensuremath  {\nobreakspace  {}\textstyle {TeV}}using MSTW2008 PDFs \cite  {Martin:2009iq,Martin:2009bu}. The NNLO results for the SM-type contributions have been obtained from the programs HIGLU and ggH@NNLO, while the rescaling with MSSM coupling factors has been done with {\sc  FeynHiggs}.}}{55}}
\newlabel{YRHXS_MSSM_neutral_fig3}{{22}{55}}
\@writefile{lof}{\contentsline {figure}{\numberline {23}{\ignorespaces  \it  Total bottom-quark-fusion cross sections of $\PQb  \PAQb  \to \PSH  /\PSA  +X$ within the 5FS for $\sqrt  {s}=7$ \ensuremath  {\nobreakspace  {}\textstyle {TeV}}with SM-like couplings using MSTW2008 PDFs \cite  {Martin:2009iq,Martin:2009bu}; (a) central prediction, (b) scale uncertainties, (c) 68\% C.L.\nobreakspace  {}PDF+$\alpha _s$ uncertainties, (c) 90\% C.L.\nobreakspace  {}PDF+$\alpha _s$ uncertainties.}}{56}}
\newlabel{YRHXS_MSSM_neutral_fig4}{{23}{56}}
\citation{Martin:2009iq,Martin:2009bu}
\citation{Martin:2009iq,Martin:2009bu}
\@writefile{lof}{\contentsline {figure}{\numberline {24}{\ignorespaces  \it  Total production cross sections of $\Pp  \Pp  \to \PQb  \PAQb  \PSH  /\PSA  +X$ for $\sqrt  {s}=7$ \ensuremath  {\nobreakspace  {}\textstyle {TeV}}within the 5FS and the 4FS using MSTW2008 PDFs \cite  {Martin:2009iq,Martin:2009bu}. The blue bands exhibit the combined scale and 68\% C.L.\nobreakspace  {}PDF+$\alpha _s$ uncertainties of the 5FS, while the red bands include the scale uncertainties of the 4FS only.}}{58}}
\newlabel{YRHXS_MSSM_neutral_fig5}{{24}{58}}
\@writefile{lof}{\contentsline {figure}{\numberline {25}{\ignorespaces  \it  Central predictions for the total MSSM production cross sections via gluon fusion and Higgs radiation off bottom quarks within the 5FS for $\sqrt  {s}=7$ \ensuremath  {\nobreakspace  {}\textstyle {TeV}}using NNLO and NLO MSTW2008 PDFs \cite  {Martin:2009iq,Martin:2009bu} for the $\ensuremath  {m_h^{\rm  max}}$ scenario and $\qopname  \relax o{tan}\beta =30$; (a) $\qopname  \relax o{tan}\beta =5$, (b) $\qopname  \relax o{tan}\beta =30$.}}{59}}
\newlabel{YRHXS_MSSM_neutral_fig6}{{25}{59}}
\citation{Heister:2002ev}
\citation{Gunion:1988pc,Brignole:1991wp,Diaz:1991ki,Frank:2006yh}
\citation{Schael:2006cr}
\citation{Aaltonen:2009ke,:2009zh}
\citation{Djouadi:2005gj}
\citation{Dittmaier:2007uw}
\citation{Heinemeyer:1998yj,Heinemeyer:1998np,Degrassi:2002fi,Frank:2006yh}
\citation{Lee:2003nta,Lee:2007gn}
\citation{Carena:2002qg}
\citation{Campbell:2004ch}
\citation{Hofer:2009xb}
\citation{Carena:1999py}
\citation{Chetyrkin:1999br}
\citation{Lee:2003nta}
\citation{Carena:2002bb,Ellis:2009di}
\@writefile{toc}{\contentsline {section}{\numberline {7}MSSM Charged Higgs Production Process\oldfootnote {Martin Flechl, Michael Kr\"amer, Sami Lehti (eds.); Stefan Dittmaier, Thomas Hahn, Tuomo Hartonen, Sven Heinemeyer, Jae Sik Lee, Apostolos Pilaftsis, Michael Spira, Carole Weydert}}{60}}
\newlabel{sec:chiggs_intro}{{7}{60}}
\@writefile{toc}{\contentsline {subsection}{\numberline {7.1}Light charged Higgs production from top quark decays}{60}}
\citation{Barnett:1987jw}
\citation{Dittmaier:2003ej,Campbell:2004pu,Dawson:2005vi,Buttar:2006zd}
\@writefile{lof}{\contentsline {figure}{\numberline {26}{\ignorespaces The branching fraction of $\rm  t\rightarrow bH^{\pm }$ as a function of tan$\beta $ for different values of mu and $ M_{{\rm  H}^{\pm }}$. The solid black curves are calculated with {\sl  FeynHiggs}, and the dotted green curves with {\sl  CPsuperH}.}}{61}}
\newlabel{fig:BRTop2HPlus}{{26}{61}}
\@writefile{toc}{\contentsline {subsection}{\numberline {7.2}Heavy charged Higgs production with top and bottom quarks}{61}}
\newlabel{subsec:CH_tbh}{{7.2}{61}}
\citation{Zhu:2001nt,Gao:2002is,Plehn:2002vy,Berger:2003sm,Kidonakis:2005hc,Peng:2006wv,Beccaria:2009my,Kidonakis:2010ux}
\citation{Weydert:2009vr}
\@writefile{lof}{\contentsline {figure}{\numberline {27}{\ignorespaces The difference of BR($\rm  t\rightarrow bH^{\pm }$) calculated with {\sl  CPsuperH} and {\sl  FeynHiggs} as a function of tan$\beta $ for different values of $\mu $ and $m_{{\rm  H}^{\pm }}$.}}{62}}
\newlabel{fig:BRTop2HPlusDiff}{{27}{62}}
\citation{DiazCruz:1992gg,Borzumati:1999th,Miller:1999bm}
\citation{Dittmaier:2009np}
\citation{Dittmaier:2009np}
\citation{Martin:2010db}
\citation{Dittmaier:2009np}
\citation{Martin:2009iq}
\@writefile{lof}{\contentsline {figure}{\numberline {28}{\ignorespaces Generic Feynman diagrams for $\Pp  \Pp  \to {\rm  t}\Pb  {\rm  H}^{\pm }+X$ in the 4FS at the Born level.}}{63}}
\newlabel{fig:diags}{{28}{63}}
\@writefile{toc}{\contentsline {subsubsection}{\numberline {7.2.1}NLO QCD predictions for $p p \to tbH^{\pm }+X$ in the 4FS}{63}}
\newlabel{subsubsec:CH_4FS}{{7.2.1}{63}}
\@writefile{lot}{\contentsline {table}{\numberline {21}{\ignorespaces  NLO QCD cross sections for $\Pp  \Pp  \to {\rm  t}\mathaccentV {bar}016{\Pb  }{\rm  H}^-+X$ in the 4FS at the LHC with 7 TeV, $\qopname  \relax o{tan}\beta =30$.}}{63}}
\newlabel{tab::charged_higgs_4fs_nlo_7tev}{{21}{63}}
\citation{Dittmaier:2009np}
\citation{Dittmaier:2009np}
\citation{Plehn:2002vy,Berger:2003sm,Weydert:2009vr}
\citation{Martin:2009iq}
\@writefile{lot}{\contentsline {table}{\numberline {22}{\ignorespaces  NLO QCD cross sections for $\Pp  \Pp  \to {\rm  t}\mathaccentV {bar}016{\Pb  }{\rm  H}^-+X$ in the 4FS at the LHC with 14 TeV, $\qopname  \relax o{tan}\beta =30$.}}{64}}
\newlabel{tab::charged_higgs_4fs_nlo_14tev}{{22}{64}}
\@writefile{lof}{\contentsline {figure}{\numberline {29}{\ignorespaces NLO QCD cross sections for $\Pp  \Pp  \to {\rm  t}\mathaccentV {bar}016{\Pb  }{\rm  H}^-+X$ in the 4FS at the LHC (7 TeV and 14 TeV) as a function of the Higgs-boson mass. The error band includes the NLO scale uncertainty and the pdf+$\alpha _{\rm  s}$ error, added in quadrature. Calculation from \Ref \nobreakspace  {}\cite  {Dittmaier:2009np}.}}{64}}
\newlabel{fig:totalxs}{{29}{64}}
\@writefile{toc}{\contentsline {subsubsection}{\numberline {7.2.2}NLO QCD predictions for $pp \to t H^{\pm }+X$ in the 5FS}{64}}
\newlabel{subsubsec:CH_5FS}{{7.2.2}{64}}
\citation{Weydert:2009vr}
\citation{Weydert:2009vr}
\citation{Beccaria:2009my}
\citation{Dittmaier:2009np,Weydert:2009vr}
\citation{Dittmaier:2009np,Weydert:2009vr}
\citation{Campbell:2009ss}
\citation{Martin:2009iq}
\citation{Martin:2004ir}
\@writefile{lot}{\contentsline {table}{\numberline {23}{\ignorespaces  NLO QCD cross sections for $\Pp  \Pp  \to {\rm  t}\mathaccentV {bar}016{\Pb  }{\rm  H}^-+X$ in the 5FS at the LHC with 7 TeV, $\qopname  \relax o{tan}\beta =30$.}}{65}}
\newlabel{tab::charged_higgs_5fs_nlo_7tev}{{23}{65}}
\@writefile{lot}{\contentsline {table}{\numberline {24}{\ignorespaces  NLO QCD cross sections for $\Pp  \Pp  \to {\rm  t}\mathaccentV {bar}016{\Pb  }{\rm  H}^-+X$ in the 5FS at the LHC with 14 TeV, $\qopname  \relax o{tan}\beta =30$.}}{65}}
\newlabel{tab::charged_higgs_5fs_nlo_14tev}{{24}{65}}
\@writefile{lof}{\contentsline {figure}{\numberline {30}{\ignorespaces NLO QCD cross sections for $\Pp  \Pp  \to {\rm  t}\mathaccentV {bar}016{\Pb  }{\rm  H}^-+X$ in the 5FS at the LHC (7 TeV and 14 TeV) as a function of the Higgs-boson mass. The error band includes the NLO scale uncertainty. Calculation from \Ref \nobreakspace  {}\cite  {Weydert:2009vr}.}}{65}}
\newlabel{fig:totalxs_5fs}{{30}{65}}
\@writefile{toc}{\contentsline {subsubsection}{\numberline {7.2.3}Comparison of the 4FS and 5FS calculations}{65}}
\newlabel{subsubsec:CH_4and5FS}{{7.2.3}{65}}
\citation{PDF4LHCwebpage}
\citation{Alekhin:2009ni}
\citation{Nadolsky:2008zw}
\citation{Gluck:2007ck,Gluck:2008gs}
\citation{:2009wt}
\citation{Martin:2009iq,Martin:2009bu,Martin:2010db}
\citation{Ball:2010de}
\citation{JimenezDelgado:2008hf}
\citation{JimenezDelgado:2009tv}
\citation{CooperSarkar:2010ik}
\citation{Moch:2004pa,Vogt:2004mw}
\citation{Lai:2010vv}
\citation{Alekhin:2010iu}
\citation{Rojo:2010gv}
\citation{CooperSarkar:2010ik}
\citation{Thorne:2010kj}
\@writefile{lof}{\contentsline {figure}{\numberline {31}{\ignorespaces NLO QCD cross sections for $\Pp  \Pp  \to {\rm  t}\mathaccentV {bar}016{\Pb  }{\rm  H}^-+X$ in the 4FS and 5FS at the LHC (7 TeV and 14 TeV) as a function of the Higgs-boson mass. The error band includes the NLO scale uncertainty. Calculations from \Refs \nobreakspace  {}\cite  {Dittmaier:2009np, Weydert:2009vr}.}}{66}}
\newlabel{fig:4fs_5fs}{{31}{66}}
\@writefile{toc}{\contentsline {section}{\numberline {8}Parton Distribution Functions\footnote {Contributing authors:S. Forte, J. Huston, K. Mazumdar, R.S. Thorne, A. Vicini}}{66}}
\newlabel{pdfsection}{{8}{66}}
\@writefile{toc}{\contentsline {subsection}{\numberline {8.1}Introduction}{66}}
\newlabel{intro}{{8.1}{66}}
\citation{Stump:2001gu,Pumplin:2001ct,Martin:2002aw}
\citation{Martin:2009iq}
\@writefile{toc}{\contentsline {subsection}{\numberline {8.2}PDF determinations - experimental uncertainties}{67}}
\newlabel{sec:pdfdet1}{{8.2}{67}}
\@writefile{toc}{\contentsline {subsubsection}{\numberline {8.2.1}Data Sets}{67}}
\newlabel{data}{{8.2.1}{67}}
\@writefile{toc}{\contentsline {subsubsection}{\numberline {8.2.2}Statistical treatment}{67}}
\newlabel{stat}{{8.2.2}{67}}
\citation{Ball:2008by,Ball:2010de}
\@writefile{toc}{\contentsline {subsubsection}{\numberline {8.2.3}Parton parametrization}{68}}
\newlabel{parm}{{8.2.3}{68}}
\newlabel{pdfparm}{{8}{68}}
\newlabel{pdfparmnn}{{9}{68}}
\citation{Alekhin:2009vn}
\citation{Martin:2010db}
\citation{Guffanti:2010yu}
\citation{Binoth:2010ra}
\citation{Martin:2004dh}
\citation{Demartin:2010er}
\citation{Demartin:2010er}
\citation{Martin:2009bu}
\citation{Lai:2010nw}
\citation{Alekhin:2009vn}
\@writefile{toc}{\contentsline {subsection}{\numberline {8.3}PDF determinations - Theoretical uncertainties}{69}}
\newlabel{sec:pdfdet2}{{8.3}{69}}
\@writefile{toc}{\contentsline {subsubsection}{\numberline {8.3.1}The value of $\ensuremath  {\alpha _{\mathrm  {s}}}$ and its uncertainty}{69}}
\citation{Watt}
\citation{Watt}
\citation{Watt}
\citation{Watt}
\citation{PDF4LHCwiki}
\citation{Martin:2009bu}
\citation{Ubiali:2010xc}
\citation{Ubiali:2010xc}
\citation{Martin:2009bu}
\citation{Ubiali:2010xc}
\citation{Ubiali:2010xc}
\citation{PDF4LHCwiki}
\@writefile{lof}{\contentsline {figure}{\numberline {32}{\ignorespaces  The $gg$ luminosity functions and uncertainties at 7\nobreakspace  {}TeV, normalized to the MSTW08 result. Plots by G. Watt \cite  {Watt}.}}{70}}
\newlabel{fig:gglum}{{32}{70}}
\@writefile{toc}{\contentsline {subsection}{\numberline {8.4}Comparison of results from different PDFs}{70}}
\newlabel{sec:benchmarking}{{8.4}{70}}
\newlabel{eq1}{{10}{70}}
\newlabel{eq:xseclum}{{11}{70}}
\@writefile{lof}{\contentsline {figure}{\numberline {33}{\ignorespaces  Cross-section predictions as a function of $\ensuremath  {\alpha _{\mathrm  {s}}}$ for a Higgs ($gg$ fusion) for a Higgs mass of 120 GeV at NNLO for the Tevatron and LHC at 14\nobreakspace  {}TeV\nobreakspace  {}\cite  {Martin:2009bu} (top-left) and at NLO for the LHC at 7\nobreakspace  {}TeV\nobreakspace  {}\cite  {Ubiali:2010xc} (top-right) and for various groups all at NLO\nobreakspace  {}\cite  {Ubiali:2010xc} (bottom).}}{71}}
\newlabel{fig:Higgscs}{{33}{71}}
\@writefile{toc}{\contentsline {subsection}{\numberline {8.5}The PDF4LHC recommendation}{71}}
\newlabel{sec:pdf4lhcreco}{{8.5}{71}}
\citation{Trento}
\citation{PDF4LHCwebpage}
\citation{Lai:2010vv}
\citation{Thorne:2010kj}
\citation{Rojo:2010gv}
\citation{Lai:2010nw}
\@writefile{lof}{\contentsline {figure}{\numberline {34}{\ignorespaces Combined PDF+$\ensuremath  {\alpha _{\mathrm  {s}}}$ uncertainty band for the total Higgs production cross-section via gluon fusion, at NLO, evaluated according to the PDF4LHC recipe. The bands are normalized to the central MSTW2008 NLO result.}}{72}}
\newlabel{nloenvelope}{{34}{72}}
\@writefile{toc}{\contentsline {subsubsection}{\numberline {8.5.1}NLO prescription}{72}}
\citation{Nadolsky:2008zw}
\citation{Martin:2009iq,Martin:2009bu}
\citation{Ball:2010de}
\citation{Demartin:2010er}
\citation{Bonciani:2007ex,Aglietti:2006tp,Aglietti:2004nj,Aglietti:2004ki,Degrassi:2005mc,Degrassi:2004mx}
\citation{Harlander:2000mg,Catani:2001ic,Harlander:2001is,Harlander:2002wh,Anastasiou:2002yz,Ravindran:2003um}
\citation{PDF4LHCwebpage}
\@writefile{toc}{\contentsline {subsubsection}{\numberline {8.5.2}NNLO prescription}{73}}
\@writefile{toc}{\contentsline {subsubsection}{\numberline {8.5.3}Application to Higgs production via gluon fusion}{73}}
\newlabel{sec:pdf4lchiggs}{{8.5.3}{73}}
\citation{Trento}
\@writefile{lof}{\contentsline {figure}{\numberline {35}{\ignorespaces  Top: Combined relative PDF+$\ensuremath  {\alpha _{\mathrm  {s}}}$ uncertainty band for the total Higgs cross-section from gluon fusion, at NLO (left) and at NNLO (right) obtained using MSTW2008 Bottom: rescaling factor for the NNLO uncertainty (left), obtained as the ratio of the percentage width of the NLO envelope with respect to its mid point to the percentage uncertainty of the MSTW2008 NLO band, and final NNLO uncertainty band obtained applying the rescaling to the MSTW08 NNLO result (right). }}{74}}
\newlabel{nlonnlo}{{35}{74}}
\citation{Djouadi:1997yw,Spira:1997dg}
\citation{Bredenstein:2006rh,Bredenstein:2006ha,Prophecy4f}
\citation{Aglietti:2004ki,Aglietti:2004nj,Aglietti:2006ne,Degrassi:2004mx,Degrassi:2005mc,Actis2008}
\citation{Actis2008}
\citation{Ghinculov:1995bz,Frink:1996sv}
\@writefile{toc}{\contentsline {subsection}{\numberline {8.6}Summary}{75}}
\newlabel{sec:summary}{{8.6}{75}}
\@writefile{toc}{\contentsline {section}{\numberline {9}Branching Ratios\oldfootnote {A.\nobreakspace  {}Denner, S.\nobreakspace  {}Heinemeyer, I.\nobreakspace  {}Puljak, D.\nobreakspace  {}Rebuzzi (eds.); S. Dittmaier, A. M\"uck, M. Spira, M. Weber, G. Weiglein}}{75}}
\newlabel{sec:BR}{{9}{75}}
\@writefile{toc}{\contentsline {subsection}{\numberline {9.1}SM Higgs Branching Ratios}{75}}
\newlabel{sec:SM-BR}{{9.1}{75}}
\citation{Fleischer:1980ub,Bardin:1990zj,Dabelstein:1991ky,Kniehl:1991ze}
\citation{Accomando:1997wt}
\citation{Braaten:1980yq,Sakai:1980fa,Inami:1980qp,Gorishnii:1983cu,Drees:1989du,Drees:1990dq,Drees:1991dq}
\citation{Gorishnii:1990zu,Gorishnii:1991zr,Kataev:1993be,Surguladze:1994gc,Larin:1995sq,Chetyrkin:1995pd,Chetyrkin:1996sr}
\citation{Ghinculov:1994se,Ghinculov:1995err,Durand:1994pk,Durand:1994err,Durand:1994pw,Borodulin:1996br}
\citation{Inami:1982xt,Djouadi:1991tka,Spira:1995rr}
\citation{Chetyrkin:1997iv}
\citation{Baikov:2006ch}
\citation{Actis2008}
\citation{Zheng:1990qa,Djouadi:1990aj,Dawson:1992cy,Djouadi:1993ji,Melnikov:1993tj,Inoue:1994jq,Spira:1995rr}
\citation{Actis2008}
\citation{Firan:2007tp}
\@writefile{lot}{\contentsline {table}{\numberline {25}{\ignorespaces Estimate of theoretical uncertainties from missing higher orders}}{76}}
\newlabel{tab:uncertainty}{{25}{76}}
\citation{Heinemeyer:1998yj,Heinemeyer:1998np,Degrassi:2002fi,Frank:2006yh}
\citation{Lee:2003nta,Lee:2007gn}
\citation{Djouadi:1997yw,Spira:1997dg}
\citation{Carena:2002qg}
\@writefile{toc}{\contentsline {subsection}{\numberline {9.2}MSSM Higgs Branching Ratios: Work in Progress}{77}}
\newlabel{sec:MSSM-BR}{{9.2}{77}}
\@writefile{toc}{\contentsline {subsection}{\numberline {9.3}Results}{77}}
\@writefile{lot}{\contentsline {table}{\numberline {26}{\ignorespaces SM Higgs branching ratio in some of the possible Higgs final states and in the low and intermediate mass range.}}{78}}
\newlabel{tab:BR-lm.part1}{{26}{78}}
\@writefile{lot}{\contentsline {table}{\numberline {27}{\ignorespaces SM Higgs branching ratio in some of the possible Higgs final states and in the high mass range.}}{79}}
\newlabel{tab:BR-hm.part1}{{27}{79}}
\@writefile{lot}{\contentsline {table}{\numberline {28}{\ignorespaces SM Higgs branching ratio in the remaining Higgs final states and Higgs total widths [GeV] in the low and intermediate mass range.}}{80}}
\newlabel{tab:BR-lm.part2}{{28}{80}}
\@writefile{lot}{\contentsline {table}{\numberline {29}{\ignorespaces SM Higgs branching ratio in the remaining Higgs final states and Higgs total widths [GeV] in the high mass range.}}{81}}
\newlabel{tab:BR-hm.part2}{{29}{81}}
\@writefile{lot}{\contentsline {table}{\numberline {30}{\ignorespaces SM Higgs branching ratios for 4-fermion final states for the low and intermediate mass range. We list results for the specific final states $\Pe  ^+\Pe  ^-\Pe  ^+\Pe  ^-$ and $\Pe  ^+\Pe  ^-\mu ^+\mu ^-$, for final states with 4 arbitrary leptons, 2 leptons and 2 quarks and 4 quarks, as well as the result for arbitrary 4 fermions. }}{82}}
\newlabel{tab:PBR-lm}{{30}{82}}
\@writefile{lot}{\contentsline {table}{\numberline {31}{\ignorespaces SM Higgs branching ratios for 4-fermion final states for the high mass range. We list results for the specific final states $\Pe  ^+\Pe  ^-\Pe  ^+\Pe  ^-$ and $\Pe  ^+\Pe  ^-\mu ^+\mu ^-$, for final states with 4 arbitrary leptons, 2 leptons and 2 quarks and 4 quarks, as well as the result for arbitrary 4 fermions.}}{83}}
\newlabel{tab:PBR-hm}{{31}{83}}
\@writefile{lot}{\contentsline {table}{\numberline {32}{\ignorespaces MSSM Higgs branching ratio to $\tau ^+\tau ^-$ final states in the $m_{\Ph  }^{\rm  max}$ scenario as a function of $\relax $M_{{\mathrm  {A}}}$$ [GeV] and $\qopname  \relax o{tan}\beta $. The format in each cell is $M_{\Ph  }$ [GeV], BR($\Ph  \to \tau ^+\tau ^-$) (upper line), $M_{\PH  }$ [GeV], BR($\PH  \to \tau ^+\tau ^-$) (middle line), $M_{{\mathrm  {A}}}$ [GeV], BR(${\mathrm  {A}}\to \tau ^+\tau ^-$) (lower line). }}{84}}
\newlabel{tab:BR-mssm}{{32}{84}}
\@writefile{lof}{\contentsline {figure}{\numberline {36}{\ignorespaces SM Higgs branching ratios.}}{85}}
\newlabel{fig:SMBR200}{{36}{85}}
\@writefile{lof}{\contentsline {figure}{\numberline {37}{\ignorespaces SM Higgs total width.}}{86}}
\newlabel{fig:SMWidth}{{37}{86}}
\citation{Frixione:2002ik}
\citation{Frixione:2003ei}
\citation{Frixione:2005vw}
\citation{Frixione:2006gn}
\citation{Frixione:2007zp}
\citation{Frixione:2008yi}
\citation{LatundeDada:2007jg}
\citation{Nason:2004rx}
\citation{Nason:2006hfa}
\citation{Frixione:2007nu}
\citation{Frixione:2007vw}
\citation{Frixione:2007nw}
\citation{LatundeDada:2006gx}
\citation{Hamilton:2008pd}
\citation{Hamilton:2009za}
\citation{Alioli:2008gx}
\citation{Alioli:2008tz}
\citation{Alioli:2009je}
\citation{LatundeDada:2008bv}
\citation{Mangano:2001xp}
\citation{Catani:2001cc}
\citation{Lonnblad:2001iq}
\citation{Krauss:2002up}
\citation{Mrenna:2003if}
\citation{Schalicke:2005nv}
\citation{Alwall:2007fs}
\citation{Hoeche:2009rj}
\citation{Hamilton:2009ne}
\@writefile{toc}{\contentsline {section}{\numberline {10}NLO Monte Carlo\footnote {Contributing authors: M. Felcini, F. Krauss, F. Maltoni, P. Nason and J. Yu}}{87}}
\@writefile{toc}{\contentsline {subsection}{\numberline {10.1}INTRODUCTION}{87}}
\@writefile{toc}{\contentsline {subsection}{\numberline {10.2}Embedding higher-order corrections into parton shower Monte Carlos}{87}}
\@writefile{toc}{\contentsline {subsubsection}{\numberline {10.2.1}NLO cross sections}{87}}
\newlabel{eq:nlocorr}{{15}{87}}
\citation{Sjostrand:2006za,Sjostrand:2007gs}
\citation{Corcella:2000bw}
\citation{Bahr:2008pv}
\citation{Gleisberg:2003xi}
\newlabel{eq:subtractionmethod}{{16}{88}}
\@writefile{toc}{\contentsline {subsubsection}{\numberline {10.2.2}Parton Shower (PS)}{88}}
\newlabel{Eq:1storder_in_PS}{{18}{88}}
\citation{Bengtsson:1986hr}
\citation{Gustafson:1987rq}
\citation{Seymour:1994we}
\citation{Seymour:1994df}
\citation{Miu:1998ju}
\citation{Lonnblad:1995ex}
\citation{Frixione:2002ik}
\citation{Nason:2004rx}
\@writefile{toc}{\contentsline {subsubsection}{\numberline {10.2.3}Matrix Element Correction (MEC)}{89}}
\newlabel{mec}{{10.2.3}{89}}
\newlabel{Eq:MEC}{{21}{89}}
\@writefile{toc}{\contentsline {subsubsection}{\numberline {10.2.4}NLO+PS}{89}}
\newlabel{nlops}{{10.2.4}{89}}
\citation{Frixione:2010wd}
\citation{Torrielli:2010aw}
\citation{Hamilton:2009za}
\citation{Alioli:2010xd}
\citation{Hoeche:2010pf}
\citation{Catani:2001cc}
\newlabel{eq:nlocorr1}{{23}{90}}
\newlabel{Eq:Powheg}{{24}{90}}
\@writefile{toc}{\contentsline {subsubsection}{\numberline {10.2.5}\tt  MC@NLO}{90}}
\newlabel{mcatnlo}{{10.2.5}{90}}
\@writefile{toc}{\contentsline {subsubsection}{\numberline {10.2.6}POWHEG}{90}}
\newlabel{powheg}{{10.2.6}{90}}
\@writefile{toc}{\contentsline {subsubsection}{\numberline {10.2.7}Matrix element merging (ME+PS)}{90}}
\newlabel{meps}{{10.2.7}{90}}
\citation{Catani:2001cc}
\citation{Krauss:2002up}
\citation{Lonnblad:2001iq}
\citation{Hoeche:2009rj}
\citation{Hamilton:2009ne}
\citation{Mangano:2001xp}
\citation{Alwall:2008qv}
\citation{Alwall:2007fs}
\citation{Hamilton:2010wh,Hoeche:2010kg}
\citation{Djouadi:1991tka,Spira:1995rr}
\citation{Catani:2007vq}
\citation{Butterworth:2010ym}
\citation{Butterworth:2010ym}
\@writefile{toc}{\contentsline {subsubsection}{\numberline {10.2.8}MENLOPS}{91}}
\newlabel{menlops}{{10.2.8}{91}}
\@writefile{toc}{\contentsline {subsection}{\numberline {10.3}Higgs production channels}{91}}
\newlabel{HiggsChannels}{{10.3}{91}}
\@writefile{toc}{\contentsline {subsubsection}{\numberline {10.3.1}Gluon fusion}{91}}
\citation{Alioli:2008tz}
\@writefile{lof}{\contentsline {figure}{\numberline {38}{\ignorespaces Comparison of the $p_{\scriptscriptstyle \rm  T}$ spectrum of the Higgs in various approaches, from ref.\nobreakspace  {}\cite  {Butterworth:2010ym}.}}{92}}
\newlabel{fig:ptHLesHouches}{{38}{92}}
\citation{Bozzi:2005wk}
\citation{Bozzi:2005wk}
\citation{Bozzi:2005wk}
\citation{Stockli:2005hz}
\citation{Anastasiou:2008ik}
\citation{Anastasiou:2008ik}
\citation{Butterworth:1996zw}
\citation{Anastasiou:2008ik}
\citation{Anastasiou:2008ik}
\citation{Nason:2009ai}
\@writefile{lof}{\contentsline {figure}{\numberline {39}{\ignorespaces Comparison of the Higgs $p_{\scriptscriptstyle \rm  T}$ spectrum of {\POWHEG } compared with the analytical resummed results of ref.\nobreakspace  {}\cite  {Bozzi:2005wk} (on the left), and comparison of {\POWHEG } interfaced with {\pythia }, {\POWHEG } interfaced with {\herwig }, {\MCatNLO } and {\pythia } standalone}}{93}}
\newlabel{fig:HqTpwg}{{39}{93}}
\@writefile{toc}{\contentsline {subsubsection}{\numberline {10.3.2}VBF}{93}}
\citation{DelDuca:2006hk}
\citation{Nason:2009ai}
\citation{Nason:2009ai}
\citation{Figy:2007kv}
\citation{Campbell:2010cz}
\citation{Hamilton:2009za}
\@writefile{lof}{\contentsline {figure}{\numberline {40}{\ignorespaces  Difference of the cross section after signal cuts including the underlying event and the hadronization model, with respecto to the partonic cross section, from ref.\nobreakspace  {}\cite  {Anastasiou:2008ik}. The cross section is shown ad a function of the jet veto for both the SISCone and the $k_T$ clustering algorithm.}}{94}}
\newlabel{fig:UEeffect}{{40}{94}}
\newlabel{fig:HqTpwg}{{40}{94}}
\@writefile{toc}{\contentsline {subsubsection}{\numberline {10.3.3}VH}{94}}
\citation{Butterworth:2008iy}
\citation{Weydert:2009vr}
\@writefile{toc}{\contentsline {subsubsection}{\numberline {10.3.4}ttH}{95}}
\@writefile{toc}{\contentsline {subsection}{\numberline {10.4}Modelling the Higgs boson in BSM}{95}}
\@writefile{toc}{\contentsline {subsection}{\numberline {10.5}Currently used tools and wish-list by the experimentalists}{96}}
\@writefile{lot}{\contentsline {table}{\numberline {33}{\ignorespaces Combined set of Monte Carlo event generator tools currently used for mass production by the ATLAS and CMS collaborations. Most of these tools are used by both the collaborations, few are used in one collaboration alone. The version numbers in the table represent the latest versions used but lower versions are also used in experiments due to validation and coordinated production schedules.}}{96}}
\newlabel{tab:nlomctabone}{{33}{96}}
\@writefile{toc}{\contentsline {subsection}{\numberline {10.6}Further issues and studies}{98}}
\@writefile{toc}{\contentsline {subsubsection}{\numberline {10.6.1}Which tools to use?}{98}}
\@writefile{toc}{\contentsline {subsubsection}{\numberline {10.6.2}Choice of Parton Distribution Functions}{98}}
\citation{Butterworth:2010ym}
\@writefile{toc}{\contentsline {subsubsection}{\numberline {10.6.3}Interfacing codes}{99}}
\@writefile{toc}{\contentsline {subsection}{\numberline {10.7}Conclusions}{99}}
\citation{Dixon:2003yb}
\@writefile{toc}{\contentsline {section}{\numberline {11}Higgs Pseudo-Observables\oldfootnote {S.\nobreakspace  {}Heinemeyer and G.\nobreakspace  {}Passarino}}{100}}
\@writefile{toc}{\contentsline {subsection}{\numberline {11.1}Introduction}{100}}
\@writefile{toc}{\contentsline {subsection}{\numberline {11.2}Formulation of the problem}{100}}
\@writefile{toc}{\contentsline {subsection}{\numberline {11.3}Examples of Pseudo-Observables}{101}}
\newlabel{Gloss}{{11.3}{101}}
\@writefile{lof}{\contentsline {figure}{\numberline {41}{\ignorespaces }}{101}}
\newlabel{YRHXS_PO_fig1}{{41}{101}}
\citation{Alioli:2008tz}
\@writefile{lof}{\contentsline {figure}{\numberline {42}{\ignorespaces }}{102}}
\newlabel{YRHXS_PO_fig2}{{42}{102}}
\@writefile{toc}{\contentsline {subsection}{\numberline {11.4}Experimental overview with theoretical eyes}{102}}
\citation{Veltman:1963th}
\citation{Grassi:2000dz}
\citation{Actis:2006rc,Passarino:2010qk}
\citation{Duhrssen:2004cv}
\@writefile{toc}{\contentsline {subsection}{\numberline {11.5}Theoretical background}{103}}
\citation{Actis:2008uh}
\citation{Denner:2005fg}
\@writefile{lof}{\contentsline {figure}{\numberline {43}{\ignorespaces }}{105}}
\newlabel{YRHXS_PO_fig3}{{43}{105}}
\citation{Gunion:1989we}
\citation{Degrassi:2002fi}
\@writefile{lot}{\contentsline {table}{\numberline {34}{\ignorespaces }}{106}}
\newlabel{TgammaH}{{34}{106}}
\@writefile{toc}{\contentsline {subsection}{\numberline {11.6}Extensions of the SM}{106}}
\@writefile{toc}{\contentsline {subsection}{\numberline {11.7}Conclusions}{107}}
\@writefile{toc}{\contentsline {section}{\numberline {12}Parametric and theoretical uncertainties\oldfootnote {A.\nobreakspace  {}Denner, S.\nobreakspace  {}Dittmaier, S.\nobreakspace  {}Forte and G.\nobreakspace  {}Passarino}}{107}}
\@writefile{toc}{\contentsline {subsection}{\numberline {12.1}Introduction}{107}}
\citation{Collins:1990bu}
\@writefile{toc}{\contentsline {subsection}{\numberline {12.2}Parametric uncertainties}{108}}
\@writefile{toc}{\contentsline {subsection}{\numberline {12.3}THU, understanding the origin of the problem}{108}}
\newlabel{orprob}{{12.3}{108}}
\citation{Catani:2003zt}
\@writefile{toc}{\contentsline {subsection}{\numberline {12.4}THU uncertainties}{109}}
\newlabel{scale}{{12.4.1}{109}}
\@writefile{toc}{\contentsline {subsubsection}{\numberline {12.4.1}QCD scale variation }{109}}
\citation{forterev,PDF4LHCwebpage,PDF4LHCwiki}
\citation{Dittmar}
\citation{Ball:2010de}
\@writefile{toc}{\contentsline {subsubsection}{\numberline {12.4.2}PDF}{110}}
\@writefile{toc}{\contentsline {subsubsection}{\numberline {12.4.3}Other sources of THU}{110}}
\citation{Actis:2008ug}
\citation{Anastasiou:2008tj}
\citation{Spira:1995rr}
\citation{Anastasiou:2009kn}
\@writefile{toc}{\contentsline {subsection}{\numberline {12.5}How to combine THU}{111}}
\@writefile{toc}{\contentsline {subsubsection}{\numberline {12.5.1}Possibilities for option combination}{112}}
\newlabel{bestcenter}{{42}{113}}
\newlabel{bigband}{{43}{113}}
\newlabel{bigoverlap}{{44}{113}}
\newlabel{smallband}{{45}{114}}
\newlabel{envband}{{46}{114}}
\newlabel{genDEF}{{47}{114}}
\newlabel{finalCV}{{48}{114}}
\newlabel{finalrec}{{50}{114}}
\@writefile{toc}{\contentsline {subsubsection}{\numberline {12.5.2}Conclusions}{115}}
\@writefile{toc}{\contentsline {section}{\numberline {13}Summary}{116}}
\@writefile{lof}{\contentsline {figure}{\numberline {44}{\ignorespaces The SM Higgs production cross section at $\sqrt  {s} = 7$\ensuremath  {\nobreakspace  {}\textstyle {TeV}}.}}{116}}
\newlabel{fig:SMXS7TeV}{{44}{116}}
\@writefile{lof}{\contentsline {figure}{\numberline {45}{\ignorespaces The SM Higgs branching ratios as a function of Higgs mass.}}{117}}
\newlabel{fig:SMBRs}{{45}{117}}
\@writefile{toc}{\contentsline {section}{\numberline {A}The Standard Model input parameter set}{119}}
\newlabel{sminput}{{A}{119}}
\@writefile{lot}{\contentsline {table}{\numberline {A.1}{\ignorespaces The Standard Model input parameters for particle masses and widths for computing cross section and branching ratios as presented in this Report.}}{119}}
\newlabel{tab:SMinput}{{A.1}{119}}
\@writefile{toc}{\contentsline {section}{\numberline {B}SM Higgs boson partial widths}{119}}
\newlabel{brappendix}{{B}{119}}
\@writefile{lot}{\contentsline {table}{\numberline {B.1}{\ignorespaces SM Higgs boson partial widths [GeV] in some of the possible final states, for the low and intermediate mass range.}}{120}}
\newlabel{tab:Width-lm.part1}{{B.1}{120}}
\@writefile{lot}{\contentsline {table}{\numberline {B.2}{\ignorespaces SM Higgs boson partial widths [GeV] in some of the possible final states, for the high mass range.}}{121}}
\newlabel{tab:Width-hm.part1}{{B.2}{121}}
\@writefile{lot}{\contentsline {table}{\numberline {B.3}{\ignorespaces SM Higgs boson partial and total widths [GeV] in other possible final states, for the low and intermediate mass range. The $\PW  \PW  /\PZ  \PZ  $ interference is also explicitly listed.}}{122}}
\newlabel{tab:Width-lm.part2}{{B.3}{122}}
\@writefile{lot}{\contentsline {table}{\numberline {B.4}{\ignorespaces SM Higgs boson partial and total widths [GeV] in other possible final states, for the low and intermediate mass range. The $\PW  \PW  /\PZ  \PZ  $ interference is also explicitly listed.}}{123}}
\newlabel{tab:Width-hm.part2}{{B.4}{123}}
\@writefile{lot}{\contentsline {table}{\numberline {B.5}{\ignorespaces SM Higgs boson partial widths [GeV] for 4-fermion final states for the low and intermediate mass range. We list results for the specific final states $\Pe  ^+\Pe  ^-\Pe  ^+\Pe  ^-$ and $\Pe  ^+\Pe  ^-\mu ^+\mu ^-$, for final states with 4 arbitrary leptons, 2 leptons and 2 quarks and 4 quarks, as well as the result for arbitrary 4 fermions. }}{124}}
\newlabel{tab:PWidth-lm}{{B.5}{124}}
\@writefile{lot}{\contentsline {table}{\numberline {B.6}{\ignorespaces SM Higgs boson partial widths [GeV] for 4-fermion final states for the high mass range. We list results for the specific final states $\Pe  ^+\Pe  ^-\Pe  ^+\Pe  ^-$ and $\Pe  ^+\Pe  ^-\mu ^+\mu ^-$, for final states with 4 arbitrary leptons, 2 leptons and 2 quarks and 4 quarks, as well as the result for arbitrary 4 fermions.}}{125}}
\newlabel{tab:PWidth-hm}{{B.6}{125}}
\bibstyle{atlasnote}
\bibdata{YRHXS}
\bibcite{Higgs:1964ia}{1}
\bibcite{Higgs:1964pj}{2}
\bibcite{Higgs:1966ev}{3}
\bibcite{Englert:1964et}{4}
\bibcite{Guralnik:1964eu}{5}
\bibcite{Georgi:1977gs}{6}
\bibcite{Dawson:1991zj}{7}
\bibcite{Djouadi:1991tka}{8}
\bibcite{Graudenz:1992pv}{9}
\bibcite{Spira:1995rr}{10}
\bibcite{Harlander:2000mg}{11}
\bibcite{Catani:2001ic}{12}
\bibcite{Harlander:2001is}{13}
\bibcite{Harlander:2002wh}{14}
\bibcite{Anastasiou:2002yz}{15}
\bibcite{Ravindran:2003um}{16}
\bibcite{Catani:2003zt}{17}
\bibcite{Moch:2005ky}{18}
\bibcite{Laenen:2005uz}{19}
\bibcite{Idilbi:2005ni}{20}
\bibcite{Ravindran:2005vv}{21}
\bibcite{Marzani:2008az}{22}
\bibcite{Harlander:2009bw}{23}
\bibcite{Harlander:2009mq}{24}
\bibcite{Harlander:2009my}{25}
\bibcite{Pak:2009bx}{26}
\bibcite{Pak:2009dg}{27}
\bibcite{Anastasiou:2008tj}{28}
\bibcite{Djouadi:1994ge}{29}
\bibcite{Aglietti:2004nj}{30}
\bibcite{Degrassi:2004mx}{31}
\bibcite{Actis:2008ts}{32}
\bibcite{Actis:2008ug}{33}
\bibcite{Keung:2009bs}{34}
\bibcite{Brein:2010xj}{35}
\bibcite{deFlorian:2009hc}{36}
\bibcite{Martin:2009iq}{37}
\bibcite{calculator}{38}
\bibcite{Martin:2002aw}{39}
\bibcite{Martin:2009bu}{40}
\bibcite{Alekhin:2009ni}{41}
\bibcite{JimenezDelgado:2009tv}{42}
\bibcite{CooperSarkar:2010ik}{43}
\bibcite{Baglio:2010um}{44}
\bibcite{Baglio:toap}{45}
\bibcite{Ahrens:2010rs}{46}
\bibcite{Ahrens:2008qu}{47}
\bibcite{Ahrens:2008nc}{48}
\bibcite{Asai:2004ws}{49}
\bibcite{Abdullin:2005yn}{50}
\bibcite{Duhrssen:2004cv}{51}
\bibcite{Hankele:2006ma}{52}
\bibcite{Barger:1994zq}{53}
\bibcite{Rainwater:1997dg}{54}
\bibcite{Rainwater:1998kj}{55}
\bibcite{Rainwater:1999sd}{56}
\bibcite{DelDuca:2006hk}{57}
\bibcite{DelDuca:2001fn}{58}
\bibcite{Campbell:2006xx}{59}
\bibcite{Nikitenko:2007it}{60}
\bibcite{Spira:1997dg}{61}
\bibcite{Han:1992hr}{62}
\bibcite{Figy:2003nv}{63}
\bibcite{Figy:2004pt}{64}
\bibcite{Berger:2004pca}{65}
\bibcite{Ciccolini:2007jr}{66}
\bibcite{Ciccolini:2007ec}{67}
\bibcite{HAWK}{68}
\bibcite{Arnold:2008rz}{69}
\bibcite{VV2H}{70}
\bibcite{HiggsLH:2008uu}{71}
\bibcite{Bolzoni:2010xr}{72}
\bibcite{Ghinculov:1995bz}{73}
\bibcite{Frink:1996sv}{74}
\bibcite{Alwall:2006yp}{75}
\bibcite{Andersen:2007mp}{76}
\bibcite{Bredenstein:2008tm}{77}
\bibcite{Bardeen:1978yd}{78}
\bibcite{Kazakov:1990fu}{79}
\bibcite{Zijlstra:1992kj}{80}
\bibcite{Zijlstra:1992qd}{81}
\bibcite{Moch:1999eb}{82}
\bibcite{vanNeerven:1984ak}{83}
\bibcite{Blumlein:1992eh}{84}
\bibcite{Figy:2007kv}{85}
\bibcite{Harlander:2008xn}{86}
\bibcite{WebInterface:2010}{87}
\bibcite{Baer:1998cm}{88}
\bibcite{atlasphystdr}{89}
\bibcite{ATL-PHYS-2000-008}{90}
\bibcite{CSC}{91}
\bibcite{ATL-PHYS-2000-023}{92}
\bibcite{ATL-PHYS-2000-024}{93}
\bibcite{Butterworth:2008iy}{94}
\bibcite{ATL-PHYS-PUB-2009-088}{95}
\bibcite{CERN-THESIS-2010-027}{96}
\bibcite{Han:1991ia}{97}
\bibcite{Baer:1992vx}{98}
\bibcite{Ohnemus:1992bd}{99}
\bibcite{Hamberg:1990np}{100}
\bibcite{Brein:2003wg}{101}
\bibcite{Ciccolini:2003jy}{102}
\bibcite{Brein:2004ue}{103}
\bibcite{V2HV}{104}
\bibcite{MCFM}{105}
\bibcite{Raitio:1978pt}{106}
\bibcite{Ng:1983jm}{107}
\bibcite{Kunszt:1984ri}{108}
\bibcite{Gunion:1991kg}{109}
\bibcite{Marciano:1991qq}{110}
\bibcite{HQQ}{111}
\bibcite{Stelzer:1994tk}{112}
\bibcite{Madgraph}{113}
\bibcite{PYTHIA}{114}
\bibcite{Beenakker:2001rj}{115}
\bibcite{Beenakker:2002nc}{116}
\bibcite{Reina:2001sf}{117}
\bibcite{Dawson:2002tg}{118}
\bibcite{Dawson:1997im}{119}
\bibcite{Bredenstein:2009aj}{120}
\bibcite{Bredenstein:2008zb}{121}
\bibcite{Bredenstein:2010rs}{122}
\bibcite{Bevilacqua:2009zn}{123}
\bibcite{Binoth:2010ra}{124}
\bibcite{Bevilacqua:2010ve}{125}
\bibcite{Pumplin:2002vw}{126}
\bibcite{Ball:2010de}{127}
\bibcite{Hall:1993gn}{128}
\bibcite{Hempfling:1993kv}{129}
\bibcite{Carena:1994bv}{130}
\bibcite{Pierce:1996zz}{131}
\bibcite{Carena:1999py}{132}
\bibcite{Guasch:2003cv}{133}
\bibcite{Noth:2008tw}{134}
\bibcite{Noth:2010jy}{135}
\bibcite{Mihaila:2010mp}{136}
\bibcite{Barate:2003sz}{137}
\bibcite{Schael:2006cr}{138}
\bibcite{Carena:2002qg}{139}
\bibcite{Heinemeyer:1998yj}{140}
\bibcite{Heinemeyer:1998np}{141}
\bibcite{Degrassi:2002fi}{142}
\bibcite{Frank:2006yh}{143}
\bibcite{Lee:2003nta}{144}
\bibcite{Lee:2007gn}{145}
\bibcite{Djouadi:1997yw}{146}
\bibcite{Dawson:1996xz}{147}
\bibcite{Kauffman:1993nv}{148}
\bibcite{Dawson:1993qf}{149}
\bibcite{Spira:1993bb}{150}
\bibcite{Harlander:2005rq}{151}
\bibcite{Anastasiou:2006hc}{152}
\bibcite{Aglietti:2006tp}{153}
\bibcite{Bonciani:2007ex}{154}
\bibcite{Kramer:1996iq}{155}
\bibcite{Djouadi:2005gi}{156}
\bibcite{Djouadi:2005gj}{157}
\bibcite{Harlander:2002vv}{158}
\bibcite{Anastasiou:2002wq}{159}
\bibcite{Muhlleitner:2006wx}{160}
\bibcite{Harlander:2003bb}{161}
\bibcite{Harlander:2003kf}{162}
\bibcite{Harlander:2004tp}{163}
\bibcite{Harlander:2005if}{164}
\bibcite{Degrassi:2010eu}{165}
\bibcite{Anastasiou:2008rm}{166}
\bibcite{Muhlleitner:2010nm}{167}
\bibcite{Cahn:1983ip}{168}
\bibcite{Hikasa:1985ee}{169}
\bibcite{Altarelli:1987ue}{170}
\bibcite{Djouadi:1999ht}{171}
\bibcite{Hollik:2008xn}{172}
\bibcite{Glashow:1978ab}{173}
\bibcite{Kunszt:1991xk}{174}
\bibcite{Peng:2005ti}{175}
\bibcite{Hollik:2006vn}{176}
\bibcite{Hafliger:2006zz}{177}
\bibcite{Walser:2008zz}{178}
\bibcite{Dittmaier:2003ej}{179}
\bibcite{Dawson:2003kb}{180}
\bibcite{Dicus:1988cx}{181}
\bibcite{Dicus:1998hs}{182}
\bibcite{Balazs:1998sb}{183}
\bibcite{Harlander:2003ai}{184}
\bibcite{Campbell:2004pu}{185}
\bibcite{Dawson:2005vi}{186}
\bibcite{Spira:1995mt}{187}
\bibcite{Dittmaier:2006cz}{188}
\bibcite{Martin:2010db}{189}
\bibcite{Heister:2002ev}{190}
\bibcite{Gunion:1988pc}{191}
\bibcite{Brignole:1991wp}{192}
\bibcite{Diaz:1991ki}{193}
\bibcite{Aaltonen:2009ke}{194}
\bibcite{:2009zh}{195}
\bibcite{Dittmaier:2007uw}{196}
\bibcite{Campbell:2004ch}{197}
\bibcite{Hofer:2009xb}{198}
\bibcite{Chetyrkin:1999br}{199}
\bibcite{Carena:2002bb}{200}
\bibcite{Ellis:2009di}{201}
\bibcite{Barnett:1987jw}{202}
\bibcite{Buttar:2006zd}{203}
\bibcite{Zhu:2001nt}{204}
\bibcite{Gao:2002is}{205}
\bibcite{Plehn:2002vy}{206}
\bibcite{Berger:2003sm}{207}
\bibcite{Kidonakis:2005hc}{208}
\bibcite{Peng:2006wv}{209}
\bibcite{Beccaria:2009my}{210}
\bibcite{Kidonakis:2010ux}{211}
\bibcite{Weydert:2009vr}{212}
\bibcite{DiazCruz:1992gg}{213}
\bibcite{Borzumati:1999th}{214}
\bibcite{Miller:1999bm}{215}
\bibcite{Dittmaier:2009np}{216}
\bibcite{Campbell:2009ss}{217}
\bibcite{Martin:2004ir}{218}
\bibcite{PDF4LHCwebpage}{219}
\bibcite{Nadolsky:2008zw}{220}
\bibcite{Gluck:2007ck}{221}
\bibcite{Gluck:2008gs}{222}
\bibcite{:2009wt}{223}
\bibcite{JimenezDelgado:2008hf}{224}
\bibcite{Moch:2004pa}{225}
\bibcite{Vogt:2004mw}{226}
\bibcite{Lai:2010vv}{227}
\bibcite{Alekhin:2010iu}{228}
\bibcite{Rojo:2010gv}{229}
\bibcite{Thorne:2010kj}{230}
\bibcite{Stump:2001gu}{231}
\bibcite{Pumplin:2001ct}{232}
\bibcite{Ball:2008by}{233}
\bibcite{Alekhin:2009vn}{234}
\bibcite{Guffanti:2010yu}{235}
\bibcite{Martin:2004dh}{236}
\bibcite{Demartin:2010er}{237}
\bibcite{Lai:2010nw}{238}
\bibcite{Watt}{239}
\bibcite{PDF4LHCwiki}{240}
\bibcite{Ubiali:2010xc}{241}
\bibcite{Trento}{242}
\bibcite{Aglietti:2004ki}{243}
\bibcite{Degrassi:2005mc}{244}
\bibcite{Bredenstein:2006rh}{245}
\bibcite{Bredenstein:2006ha}{246}
\bibcite{Prophecy4f}{247}
\bibcite{Aglietti:2006ne}{248}
\bibcite{Actis2008}{249}
\bibcite{Fleischer:1980ub}{250}
\bibcite{Bardin:1990zj}{251}
\bibcite{Dabelstein:1991ky}{252}
\bibcite{Kniehl:1991ze}{253}
\bibcite{Accomando:1997wt}{254}
\bibcite{Braaten:1980yq}{255}
\bibcite{Sakai:1980fa}{256}
\bibcite{Inami:1980qp}{257}
\bibcite{Gorishnii:1983cu}{258}
\bibcite{Drees:1989du}{259}
\bibcite{Drees:1990dq}{260}
\bibcite{Drees:1991dq}{261}
\bibcite{Gorishnii:1990zu}{262}
\bibcite{Gorishnii:1991zr}{263}
\bibcite{Kataev:1993be}{264}
\bibcite{Surguladze:1994gc}{265}
\bibcite{Larin:1995sq}{266}
\bibcite{Chetyrkin:1995pd}{267}
\bibcite{Chetyrkin:1996sr}{268}
\bibcite{Ghinculov:1994se}{269}
\bibcite{Ghinculov:1995err}{270}
\bibcite{Durand:1994pk}{271}
\bibcite{Durand:1994err}{272}
\bibcite{Durand:1994pw}{273}
\bibcite{Borodulin:1996br}{274}
\bibcite{Inami:1982xt}{275}
\bibcite{Chetyrkin:1997iv}{276}
\bibcite{Baikov:2006ch}{277}
\bibcite{Zheng:1990qa}{278}
\bibcite{Djouadi:1990aj}{279}
\bibcite{Dawson:1992cy}{280}
\bibcite{Djouadi:1993ji}{281}
\bibcite{Melnikov:1993tj}{282}
\bibcite{Inoue:1994jq}{283}
\bibcite{Firan:2007tp}{284}
\bibcite{Frixione:2002ik}{285}
\bibcite{Frixione:2003ei}{286}
\bibcite{Frixione:2005vw}{287}
\bibcite{Frixione:2006gn}{288}
\bibcite{Frixione:2007zp}{289}
\bibcite{Frixione:2008yi}{290}
\bibcite{LatundeDada:2007jg}{291}
\bibcite{Nason:2004rx}{292}
\bibcite{Nason:2006hfa}{293}
\bibcite{Frixione:2007nu}{294}
\bibcite{Frixione:2007vw}{295}
\bibcite{Frixione:2007nw}{296}
\bibcite{LatundeDada:2006gx}{297}
\bibcite{Hamilton:2008pd}{298}
\bibcite{Hamilton:2009za}{299}
\bibcite{Alioli:2008gx}{300}
\bibcite{Alioli:2008tz}{301}
\bibcite{Alioli:2009je}{302}
\bibcite{LatundeDada:2008bv}{303}
\bibcite{Mangano:2001xp}{304}
\bibcite{Catani:2001cc}{305}
\bibcite{Lonnblad:2001iq}{306}
\bibcite{Krauss:2002up}{307}
\bibcite{Mrenna:2003if}{308}
\bibcite{Schalicke:2005nv}{309}
\bibcite{Alwall:2007fs}{310}
\bibcite{Hoeche:2009rj}{311}
\bibcite{Hamilton:2009ne}{312}
\bibcite{Sjostrand:2006za}{313}
\bibcite{Sjostrand:2007gs}{314}
\bibcite{Corcella:2000bw}{315}
\bibcite{Bahr:2008pv}{316}
\bibcite{Gleisberg:2003xi}{317}
\bibcite{Bengtsson:1986hr}{318}
\bibcite{Gustafson:1987rq}{319}
\bibcite{Seymour:1994we}{320}
\bibcite{Seymour:1994df}{321}
\bibcite{Miu:1998ju}{322}
\bibcite{Lonnblad:1995ex}{323}
\bibcite{Frixione:2010wd}{324}
\bibcite{Torrielli:2010aw}{325}
\bibcite{Alioli:2010xd}{326}
\bibcite{Hoeche:2010pf}{327}
\bibcite{Alwall:2008qv}{328}
\bibcite{Hamilton:2010wh}{329}
\bibcite{Hoeche:2010kg}{330}
\bibcite{Catani:2007vq}{331}
\bibcite{Butterworth:2010ym}{332}
\bibcite{Bozzi:2005wk}{333}
\bibcite{Stockli:2005hz}{334}
\bibcite{Anastasiou:2008ik}{335}
\bibcite{Butterworth:1996zw}{336}
\bibcite{Nason:2009ai}{337}
\bibcite{Campbell:2010cz}{338}
\bibcite{Dixon:2003yb}{339}
\bibcite{Veltman:1963th}{340}
\bibcite{Grassi:2000dz}{341}
\bibcite{Actis:2006rc}{342}
\bibcite{Passarino:2010qk}{343}
\bibcite{Actis:2008uh}{344}
\bibcite{Denner:2005fg}{345}
\bibcite{Gunion:1989we}{346}
