%!PS-Adobe-2.0 EPSF-2.0
%%BoundingBox:  0 0 567 384
%%Title: : c1
%%Creator: ROOT Version 5.24/00
%%CreationDate: Tue Nov 30 15:34:27 2010
%%EndComments
%%BeginProlog
80 dict begin
/s {stroke} def /l {lineto} def /m {moveto} def /t {translate} def
/sw {stringwidth} def /r {rotate} def /rl {roll}  def /R {repeat} def
/d {rlineto} def /rm {rmoveto} def /gr {grestore} def /f {eofill} def
/c {setrgbcolor} def /black {0 setgray} def /sd {setdash} def
/cl {closepath} def /sf {scalefont setfont} def /lw {setlinewidth} def
/box {m dup 0 exch d exch 0 d 0 exch neg d cl} def
/NC{systemdict begin initclip end}def/C{NC box clip newpath}def
/bl {box s} def /bf {box f} def /Y { 0 exch d} def /X { 0 d} def 
/mp {newpath /y exch def /x exch def} def
/side {[w .77 mul w .23 mul] .385 w mul sd w 0 l currentpoint t -144 r} def
/mr {mp x y w2 0 360 arc} def /m24 {mr s} def /m20 {mr f} def
/mb {mp x y w2 add m w2 neg 0 d 0 w neg d w 0 d 0 w d cl} def
/mt {mp x y w2 add m w2 neg w neg d w 0 d cl} def
/m21 {mb f} def /m25 {mb s} def /m22 {mt f} def /m26{mt s} def
/m23 {mp x y w2 sub m w2 w d w neg 0 d cl f} def
/m27 {mp x y w2 add m w3 neg w2 neg d w3 w2 neg d w3 w2 d cl s} def
/m28 {mp x w2 sub y w2 sub w3 add m w3 0 d  0 w3 neg d w3 0 d 0 w3 d w3 0 d  0 w3 d w3 neg 0 d 0 w3 d w3 neg 0 d
 0 w3 neg d w3 neg 0 d cl s } def
/m29 {mp gsave x w2 sub y w2 add w3 sub m currentpoint t
 4 {side} repeat cl fill gr} def
/m30 {mp gsave x w2 sub y w2 add w3 sub m currentpoint t
 4 {side} repeat cl s gr} def
/m31 {mp x y w2 sub m 0 w d x w2 sub y m w 0 d x w2 sub y w2 add m w w neg d x w2 sub y w2
 sub m w w d s} def
/m2 {mp x y w2 sub m 0 w d x w2 sub y m w 0 d s} def
/m5 {mp x w2 sub y w2 sub m w w d x w2 sub y w2 add m w w neg d s} def
/reEncode {exch findfont dup length dict begin {1 index /FID eq  {pop pop} {def} ifelse } forall /Encoding exch def currentdict end dup /FontName get exch definefont pop } def [/Times-Bold /Times-Italic /Times-BoldItalic /Helvetica
 /Helvetica-Oblique /Helvetica-Bold /Helvetica-BoldOblique /Courier /Courier-Oblique /Courier-Bold /Courier-BoldOblique /Times-Roman /AvantGarde-Book /AvantGarde-BookOblique /AvantGarde-Demi /AvantGarde-DemiOblique /Bookman-Demi
 /Bookman-DemiItalic /Bookman-Light /Bookman-LightItalic /Helvetica-Narrow /Helvetica-Narrow-Bold /Helvetica-Narrow-BoldOblique /Helvetica-Narrow-Oblique /NewCenturySchlbk-Roman /NewCenturySchlbk-Bold
 /NewCenturySchlbk-BoldItalic /NewCenturySchlbk-Italic /Palatino-Bold /Palatino-BoldItalic /Palatino-Italic /Palatino-Roman ] {ISOLatin1Encoding reEncode } forall
/oshow {gsave [] 0 sd true charpath stroke gr} def
/stwn { /fs exch def /fn exch def /text exch def fn findfont fs sf
 text sw pop xs add /xs exch def} def
/stwb { /fs exch def /fn exch def /nbas exch def /textf exch deftextf length /tlen exch def nbas tlen gt {/nbas tlendef} iffn findfont fs sf textf dup length nbas sub nbas getinterval sw
pop neg xs add /xs exch def} def
%%EndProlog
%%BeginSetup
%%EndSetup
newpath  gsave  .25 .25 scale  gsave  0 0 t black[  ] 0 sd 3 lw 1 1 1 c 2268 1538 0 0 bf black 1 1 1 c 1791 1215 363 246 bf black 1791 1215 363 246 bl 1 1 1 c 1791 1215 363 246 bf black 1791 1215 363 246 bl 363 246 m 1791 X s
 gsave  2268 1538 0 0 C 1955 117 t 0 r /Helvetica findfont 71.6807 sf 0 0 m ( [GeV]) show NC gr 
 gsave  2268 1538 0 0 C 1922 98 t 0 r /Helvetica findfont 48.8732 sf 0 0 m (H) show NC gr 
 gsave  2268 1538 0 0 C 1867 117 t 0 r /Helvetica findfont 71.6807 sf 0 0 m (M) show NC gr  401 283 m -37 Y s 439 264 m -18 Y s 477 264 m -18 Y s 515 264 m -18 Y s 553 264 m -18 Y s 592 283 m -37 Y s 630 264 m -18 Y s 668 264 m -18 Y s 706 264 m -18
 Y s 744 264 m -18 Y s 782 283 m -37 Y s 820 264 m -18 Y s 858 264 m -18 Y s 896 264 m -18 Y s 935 264 m -18 Y s 973 283 m -37 Y s 1011 264 m -18 Y s 1049 264 m -18 Y s 1087 264 m -18 Y s 1125 264 m -18 Y s 1163 283 m -37 Y s 1201 264 m -18 Y s 1240
 264 m -18 Y s 1278 264 m -18 Y s 1316 264 m -18 Y s 1354 283 m -37 Y s 1392 264 m -18 Y s 1430 264 m -18 Y s 1468 264 m -18 Y s 1506 264 m -18 Y s 1544 283 m -37 Y s 1583 264 m -18 Y s 1621 264 m -18 Y s 1659 264 m -18 Y s 1697 264 m -18 Y s 1735
 283 m -37 Y s 1773 264 m -18 Y s 1811 264 m -18 Y s 1849 264 m -18 Y s 1888 264 m -18 Y s 1926 283 m -37 Y s 1964 264 m -18 Y s 2002 264 m -18 Y s 2040 264 m -18 Y s 2078 264 m -18 Y s 2116 283 m -37 Y s 401 283 m -37 Y s 363 264 m -18 Y s 2116 283
 m -37 Y s
 gsave  2268 1538 0 0 C 342 179 t 0 r /Helvetica findfont 71.6807 sf 0 0 m (100) show NC gr 
 gsave  2268 1538 0 0 C 531 179 t 0 r /Helvetica findfont 71.6807 sf 0 0 m (200) show NC gr 
 gsave  2268 1538 0 0 C 723 179 t 0 r /Helvetica findfont 71.6807 sf 0 0 m (300) show NC gr 
 gsave  2268 1538 0 0 C 912 179 t 0 r /Helvetica findfont 71.6807 sf 0 0 m (400) show NC gr 
 gsave  2268 1538 0 0 C 1105 179 t 0 r /Helvetica findfont 71.6807 sf 0 0 m (500) show NC gr 
 gsave  2268 1538 0 0 C 1294 179 t 0 r /Helvetica findfont 71.6807 sf 0 0 m (600) show NC gr 
 gsave  2268 1538 0 0 C 1486 179 t 0 r /Helvetica findfont 71.6807 sf 0 0 m (700) show NC gr 
 gsave  2268 1538 0 0 C 1675 179 t 0 r /Helvetica findfont 71.6807 sf 0 0 m (800) show NC gr 
 gsave  2268 1538 0 0 C 1867 179 t 0 r /Helvetica findfont 71.6807 sf 0 0 m (900) show NC gr 
 gsave  2268 1538 0 0 C 2036 179 t 0 r /Helvetica findfont 71.6807 sf 0 0 m (1000) show NC gr  363 1461 m 1791 X s 401 1425 m 36 Y s 439 1443 m 18 Y s 477 1443 m 18 Y s 515 1443 m 18 Y s 553 1443 m 18 Y s 592 1425 m 36 Y s 630 1443 m 18 Y s 668 1443
 m 18 Y s 706 1443 m 18 Y s 744 1443 m 18 Y s 782 1425 m 36 Y s 820 1443 m 18 Y s 858 1443 m 18 Y s 896 1443 m 18 Y s 935 1443 m 18 Y s 973 1425 m 36 Y s 1011 1443 m 18 Y s 1049 1443 m 18 Y s 1087 1443 m 18 Y s 1125 1443 m 18 Y s 1163 1425 m 36 Y s
 1201 1443 m 18 Y s 1240 1443 m 18 Y s 1278 1443 m 18 Y s 1316 1443 m 18 Y s 1354 1425 m 36 Y s 1392 1443 m 18 Y s 1430 1443 m 18 Y s 1468 1443 m 18 Y s 1506 1443 m 18 Y s 1544 1425 m 36 Y s 1583 1443 m 18 Y s 1621 1443 m 18 Y s 1659 1443 m 18 Y s
 1697 1443 m 18 Y s 1735 1425 m 36 Y s 1773 1443 m 18 Y s 1811 1443 m 18 Y s 1849 1443 m 18 Y s 1888 1443 m 18 Y s 1926 1425 m 36 Y s 1964 1443 m 18 Y s 2002 1443 m 18 Y s 2040 1443 m 18 Y s 2078 1443 m 18 Y s 2116 1425 m 36 Y s 401 1425 m 36 Y s
 363 1443 m 18 Y s 2116 1425 m 36 Y s 363 246 m 1215 Y s
 gsave  2268 1538 0 0 C 235 740 t 90 r /Helvetica findfont 71.6807 sf 0 0 m (VBF Cross Section [fb]) show NC gr  417 277 m -54 X s
 gsave  2268 1538 0 0 C 316 274 t 0 r /Helvetica findfont 48.8732 sf 0 0 m (2) show NC gr 
 gsave  2268 1538 0 0 C 238 244 t 0 r /Helvetica findfont 71.6807 sf 0 0 m (10) show NC gr  390 477 m -27 X s 390 594 m -27 X s 390 678 m -27 X s 390 742 m -27 X s 390 795 m -27 X s 390 839 m -27 X s 390 878 m -27 X s 390 912 m -27 X s 417 943 m -54
 X s
 gsave  2268 1538 0 0 C 316 945 t 0 r /Helvetica findfont 48.8732 sf 0 0 m (3) show NC gr 
 gsave  2268 1538 0 0 C 238 912 t 0 r /Helvetica findfont 71.6807 sf 0 0 m (10) show NC gr  390 1143 m -27 X s 390 1260 m -27 X s 390 1344 m -27 X s 390 1408 m -27 X s 2154 246 m 1215 Y s 2101 277 m 53 X s 2127 477 m 27 X s 2127 594 m 27 X s 2127
 678 m 27 X s 2127 742 m 27 X s 2127 795 m 27 X s 2127 839 m 27 X s 2127 878 m 27 X s 2127 912 m 27 X s 2101 943 m 53 X s 2127 1143 m 27 X s 2127 1260 m 27 X s 2127 1344 m 27 X s 2127 1408 m 27 X s 0.4 0.4 0.8 c 401 1408 m 19 -23 d 19 -23 d 19 -23 d
 19 -22 d 19 -21 d 19 -22 d 19 -16 d 19 -21 d 19 -18 d 20 -19 d 19 -19 d 19 -19 d 19 -18 d 19 -18 d 19 -17 d 19 -17 d 19 -17 d 19 -16 d 19 -16 d 19 -16 d 38 -31 d 38 -32 d 38 -28 d 39 -23 d 38 -24 d 190 -114 d 191 -103 d 190 -93 d 191 -83 d 191 -74
 d 190 -66 d s 1 lw << /PatternType 1 /PaintType 2 /TilingType 1 /BBox [ 0 0 100 100 ] /XStep 98 /YStep 4 /PaintProc { begin gsave [1] 0 sd 2 4 m 99 4 l s 1 3 m 98 3 l s 2 2 m 99 2 l s 1 1 m 98 1 l s gr end } >> [ 4.0 0 0 4.0 0 0 ]
 makepattern /P01 exch def /cs {[/Pattern /DeviceRGB] setcolorspace} def /FA {f [/DeviceRGB] setcolorspace} def cs 0.4 0.4 0.8 P01 setcolor 401 1416 m 19 -24 d 19 -23 d 19 -23 d 19 -22 d 19 -21 d 19 -22 d 19 -16 d 19 -22 d 19 -17 d 20 -20 d 19 -19 d
 19 -18 d 19 -19 d 19 -17 d 19 -18 d 19 -17 d 19 -17 d 19 -16 d 19 -16 d 19 -16 d 38 -31 d 38 -32 d 38 -28 d 39 -23 d 38 -24 d 190 -114 d 191 -102 d 190 -92 d 191 -82 d 191 -73 d 190 -65 d -22 Y -190 66 d -191 75 d -191 84 d -190 94 d -191 104 d
 -190 115 d -38 23 d -39 24 d -38 28 d -38 32 d -38 31 d -19 16 d -19 16 d -19 16 d -19 17 d -19 17 d -19 17 d -19 18 d -19 17 d -19 20 d -19 18 d -20 20 d -19 17 d -19 21 d -19 16 d -19 22 d -19 21 d -19 22 d -19 22 d -19 23 d -19 24 d FA 3 lw 0.8
 0 0 c 382 1451 m 9 -13 d 10 -12 d 9 -12 d 10 -12 d 10 -12 d 9 -11 d 10 -11 d 9 -11 d 10 -12 d 9 -11 d 10 -10 d 9 -11 d 10 -10 d 9 -11 d 10 -10 d 9 -10 d 10 -10 d 9 -10 d 10 -10 d 9 -9 d 10 -10 d 10 -9 d 19 -19 d 19 -18 d 19 -18 d 19 -17 d 19 -17 d
 19 -17 d 19 -16 d 19 -16 d 19 -16 d 19 -16 d 38 -30 d 38 -29 d 38 -29 d 39 -27 d 38 -27 d 38 -26 d 38 -25 d 38 -25 d 38 -24 d 38 -24 d 38 -23 d 39 -23 d 38 -22 d 38 -22 d 38 -21 d 95 -52 d 95 -50 d 96 -49 d 95 -46 d 95 -45 d 96 -44 d 95 -42 d 95
 -42 d s 2116 288 m -4 -4 d s 2116 307 m -17 -17 d s 2106 316 m -21 -20 d s 2092 322 m -20 -20 d s 2079 328 m -20 -20 d s 2066 334 m -21 -21 d s 2052 340 m -20 -21 d s 2039 345 m -20 -20 d s 2025 351 m -20 -20 d s 2012 357 m -20 -20 d s 1999 363 m
 -20 -20 d s 1985 369 m -20 -20 d s 1972 375 m -20 -20 d s 1958 381 m -19 -20 d s 1945 387 m -19 -20 d s 1932 392 m -20 -19 d s 1918 398 m -19 -19 d s 1905 404 m -19 -19 d s 1892 410 m -19 -19 d s 1879 416 m -19 -19 d s 1866 422 m -19 -18 d s 1852
 428 m -18 -18 d s 1839 434 m -19 -18 d s 1826 440 m -19 -18 d s 1813 447 m -19 -19 d s 1800 453 m -19 -19 d s 1787 459 m -19 -18 d s 1773 465 m -18 -18 d s 1760 471 m -18 -18 d s 1747 477 m -18 -18 d s 1734 483 m -18 -17 d s 1721 490 m -17 -18 d s
 1708 496 m -17 -18 d s 1695 502 m -17 -17 d s 1682 508 m -17 -17 d s 1669 515 m -17 -18 d s 1656 521 m -17 -17 d s 1643 527 m -17 -17 d s 1630 534 m -16 -17 d s 1618 540 m -17 -17 d s 1605 546 m -17 -16 d s 1592 553 m -17 -17 d s 1579 559 m -16 -16
 d s 1566 566 m -16 -17 d s 1553 572 m -16 -16 d s 1541 579 m -16 -16 d s 1528 585 m -16 -16 d s 1515 592 m -15 -16 d s 1503 598 m -16 -15 d s 1490 605 m -16 -16 d s 1477 611 m -15 -15 d s 1465 618 m -16 -15 d s 1452 625 m -15 -16 d s 1439 631 m -15
 -15 d s 1427 638 m -15 -15 d s 1414 645 m -14 -15 d s 1402 651 m -15 -14 d s 1389 658 m -14 -14 d s 1377 665 m -14 -14 d s 1364 672 m -14 -15 d s 1352 678 m -14 -14 d s 1340 685 m -14 -14 d s 1327 692 m -14 -14 d s 1315 699 m -14 -14 d s 1303 706 m
 -14 -14 d s 1290 713 m -13 -13 d s 1278 720 m -13 -13 d s 1266 727 m -13 -13 d s 1254 734 m -14 -13 d s 1241 741 m -13 -13 d s 1229 748 m -13 -13 d s 1217 755 m -12 -12 d s 1205 763 m -12 -13 d s 1193 770 m -12 -13 d s 1181 777 m -12 -12 d s 1169
 784 m -12 -12 d s 1157 792 m -12 -13 d s 1145 799 m -12 -12 d s 1133 806 m -12 -12 d s 1121 814 m -11 -12 d s 1110 821 m -12 -12 d s 1098 828 m -12 -11 d s 1086 836 m -11 -12 d s 1074 843 m -11 -11 d s 1063 851 m -12 -11 d s 1051 858 m -11 -11 d s
 1039 866 m -11 -11 d s 1028 874 m -11 -11 d s 1016 881 m -11 -10 d s 1005 889 m -11 -10 d s 993 897 m -10 -11 d s 982 905 m -11 -11 d s 970 912 m -10 -10 d s 959 920 m -10 -10 d s 947 928 m -10 -10 d s 936 936 m -10 -10 d s 925 944 m -10 -10 d s
 914 952 m -10 -10 d s 902 960 m -9 -9 d s 891 968 m -9 -9 d s 880 976 m -9 -9 d s 869 984 m -9 -9 d s 858 993 m -9 -9 d s 847 1001 m -9 -9 d s 836 1009 m -9 -8 d s 825 1018 m -8 -9 d s 814 1026 m -8 -8 d s 804 1034 m -9 -8 d s 793 1043 m -9 -8 d s
 782 1051 m -8 -8 d s 771 1060 m -8 -8 d s 761 1069 m -8 -8 d s 750 1077 m -8 -7 d s 740 1086 m -8 -8 d s 729 1095 m -7 -8 d s 719 1104 m -8 -8 d s 709 1113 m -8 -8 d s 698 1122 m -7 -8 d s 688 1131 m -7 -8 d s 678 1140 m -8 -8 d s 668 1149 m -8 -8
 d s 658 1158 m -8 -7 d s 648 1167 m -8 -7 d s 638 1177 m -8 -8 d s 628 1186 m -7 -7 d s 618 1195 m -7 -7 d s 608 1205 m -7 -7 d s 598 1214 m -7 -7 d s 589 1224 m -7 -7 d s 579 1233 m -7 -7 d s 569 1243 m -7 -7 d s 560 1253 m -7 -7 d s 550 1262 m -6
 -7 d s 541 1272 m -7 -7 d s 532 1282 m -7 -7 d s 522 1292 m -7 -7 d s 513 1302 m -7 -7 d s 504 1312 m -7 -7 d s 495 1322 m -7 -7 d s 486 1332 m -7 -7 d s 477 1343 m -7 -8 d s 468 1353 m -7 -7 d s 459 1363 m -7 -7 d s 450 1374 m -7 -8 d s 441 1384 m
 -7 -7 d s 433 1395 m -8 -8 d s 424 1405 m -7 -7 d s 415 1416 m -7 -7 d s 407 1427 m -7 -8 d s 399 1438 m -8 -8 d s 390 1449 m -7 -8 d s 2110 315 m 6 -7 d s 2076 329 m 40 -40 d s 2042 344 m 52 -52 d s 2008 359 m 52 -52 d s 1974 374 m 51 -52 d s 1939
 389 m 51 -51 d s 1904 405 m 51 -51 d s 1869 421 m 51 -52 d s 1834 437 m 51 -51 d s 1798 454 m 51 -51 d s 1762 470 m 50 -50 d s 1725 488 m 51 -51 d s 1688 506 m 51 -51 d s 1651 524 m 50 -51 d s 1613 542 m 50 -50 d s 1574 562 m 51 -51 d s 1535 581 m
 50 -50 d s 1495 602 m 51 -50 d s 1455 623 m 50 -50 d s 1414 645 m 50 -50 d s 1372 668 m 50 -50 d s 1329 691 m 50 -49 d s 1285 716 m 50 -50 d s 1240 742 m 50 -50 d s 1193 770 m 51 -51 d s 1144 800 m 51 -51 d s 1092 832 m 52 -52 d s 1038 867 m 54 -54
 d s 980 906 m 55 -56 d s 917 950 m 57 -58 d s 844 1004 m 63 -64 d s 382 1446 m 47 -47 d s 752 1076 m 76 -76 d s 446 1363 m 276 -276 d s 0 lw 1 1 1 c 3 lw 746 333 1294 1039 bf black
 gsave  2268 1538 0 0 C 1479 1274 t 0 r /Helvetica findfont 39.0986 sf 0 0 m (NLO QCD+EW \255 14 TeV) show NC gr  0.4 0.4 0.8 c cs 0.4 0.4 0.8 P01 setcolor 1321 1230 m 131 X 117 Y -131 X FA 0.4 0.4 0.8 c 1321 1347 m 131 X s 1321 1230 m 131 X s 1452
 1230 m 117 Y s 1321 1230 m 117 Y s black
 gsave  2268 1538 0 0 C 1479 1108 t 0 r /Helvetica findfont 39.0986 sf 0 0 m (NLO QCD \255 14 TeV) show NC gr  0.8 0 0 c 1452 1067 m -3 -3 d s 1452 1086 m -22 -22 d s 1452 1106 m -41 -42 d s 1452 1125 m -61 -61 d s 1452 1144 m -80 -80 d s 1452 1163
 m -99 -99 d s 1450 1181 m -116 -117 d s 1431 1181 m -110 -110 d s 1412 1181 m -91 -90 d s 1392 1181 m -71 -71 d s 1373 1181 m -52 -52 d s 1354 1181 m -33 -33 d s 1335 1181 m -14 -13 d s 1436 1181 m 16 -16 d s 1417 1181 m 35 -35 d s 1398 1181 m 54
 -55 d s 1379 1181 m 73 -74 d s 1359 1181 m 93 -93 d s 1340 1181 m 112 -112 d s 1321 1180 m 116 -116 d s 1321 1161 m 97 -97 d s 1321 1142 m 78 -78 d s 1321 1122 m 58 -58 d s 1321 1103 m 39 -39 d s 1321 1084 m 20 -20 d s 1321 1065 m 1 -1 d s 0 lw 0.4
 0.4 0.8 c 0.8 0 0 c 3 lw 1321 1181 m 131 X s 1321 1064 m 131 X s 1452 1064 m 117 Y s 1321 1064 m 117 Y s black
 gsave  2268 1538 0 0 C 2222 1118 t 90 r /Helvetica-BoldOblique findfont 29.3239 sf 0 0 m (LHC HIGGS XS WG 2010) show NC gr 
 gr  gr 
showpage
end
%%EOF
