%!PS-Adobe-2.0 EPSF-2.0
%%BoundingBox:  0 0 567 544
%%Title: C:\Ivica\Physics\CMS\Higgs\BranchingRatios\Yellow report 2010\BR1_till_200.eps: Higgs BRs
%%Creator: ROOT Version 5.25/04
%%CreationDate: Fri Nov 19 01:16:15 2010
%%EndComments
%%BeginProlog
80 dict begin
/s {stroke} def /l {lineto} def /m {moveto} def /t {translate} def
/sw {stringwidth} def /r {rotate} def /rl {roll}  def /R {repeat} def
/d {rlineto} def /rm {rmoveto} def /gr {grestore} def /f {eofill} def
/c {setrgbcolor} def /black {0 setgray} def /sd {setdash} def
/cl {closepath} def /sf {scalefont setfont} def /lw {setlinewidth} def
/box {m dup 0 exch d exch 0 d 0 exch neg d cl} def
/NC{systemdict begin initclip end}def/C{NC box clip newpath}def
/bl {box s} def /bf {box f} def /Y { 0 exch d} def /X { 0 d} def 
/mp {newpath /y exch def /x exch def} def
/side {[w .77 mul w .23 mul] .385 w mul sd w 0 l currentpoint t -144 r} def
/mr {mp x y w2 0 360 arc} def /m24 {mr s} def /m20 {mr f} def
/mb {mp x y w2 add m w2 neg 0 d 0 w neg d w 0 d 0 w d cl} def
/mt {mp x y w2 add m w2 neg w neg d w 0 d cl} def
/m21 {mb f} def /m25 {mb s} def /m22 {mt f} def /m26{mt s} def
/m23 {mp x y w2 sub m w2 w d w neg 0 d cl f} def
/m27 {mp x y w2 add m w3 neg w2 neg d w3 w2 neg d w3 w2 d cl s} def
/m28 {mp x w2 sub y w2 sub w3 add m w3 0 d  0 w3 neg d w3 0 d 0 w3 d w3 0 d  0 w3 d w3 neg 0 d 0 w3 d w3 neg 0 d
 0 w3 neg d w3 neg 0 d cl s } def
/m29 {mp gsave x w2 sub y w2 add w3 sub m currentpoint t
 4 {side} repeat cl fill gr} def
/m30 {mp gsave x w2 sub y w2 add w3 sub m currentpoint t
 4 {side} repeat cl s gr} def
/m31 {mp x y w2 sub m 0 w d x w2 sub y m w 0 d x w2 sub y w2 add m w w neg d x w2 sub y w2
 sub m w w d s} def
/m2 {mp x y w2 sub m 0 w d x w2 sub y m w 0 d s} def
/m5 {mp x w2 sub y w2 sub m w w d x w2 sub y w2 add m w w neg d s} def
/reEncode {exch findfont dup length dict begin {1 index /FID eq  {pop pop} {def} ifelse } forall /Encoding exch def currentdict end dup /FontName get exch definefont pop } def [/Times-Bold /Times-Italic /Times-BoldItalic /Helvetica
 /Helvetica-Oblique /Helvetica-Bold /Helvetica-BoldOblique /Courier /Courier-Oblique /Courier-Bold /Courier-BoldOblique /Times-Roman /AvantGarde-Book /AvantGarde-BookOblique /AvantGarde-Demi /AvantGarde-DemiOblique /Bookman-Demi
 /Bookman-DemiItalic /Bookman-Light /Bookman-LightItalic /Helvetica-Narrow /Helvetica-Narrow-Bold /Helvetica-Narrow-BoldOblique /Helvetica-Narrow-Oblique /NewCenturySchlbk-Roman /NewCenturySchlbk-Bold
 /NewCenturySchlbk-BoldItalic /NewCenturySchlbk-Italic /Palatino-Bold /Palatino-BoldItalic /Palatino-Italic /Palatino-Roman ] {ISOLatin1Encoding reEncode } forall
/oshow {gsave [] 0 sd true charpath stroke gr} def
/stwn { /fs exch def /fn exch def /text exch def fn findfont fs sf
 text sw pop xs add /xs exch def} def
/stwb { /fs exch def /fn exch def /nbas exch def /textf exch deftextf length /tlen exch def nbas tlen gt {/nbas tlendef} iffn findfont fs sf textf dup length nbas sub nbas getinterval sw
pop neg xs add /xs exch def} def
%%EndProlog
%%BeginSetup
%%EndSetup
newpath  gsave  .25 .25 scale  gsave  0 0 t black[  ] 0 sd 3 lw 1 1 1 c 2268 2176 0 0 bf black 1 1 1 c 1791 1720 363 348 bf black 1791 1720 363 348 bl 6 lw 1 1 1 c black 363 348 m 1791 X s 3 lw 363 348 m 1791 X s
 gsave  2268 2176 0 0 C 1868 80 t 0 r /Helvetica findfont 102.732 sf 0 0 m ( [GeV]) show NC gr 
 gsave  2268 2176 0 0 C 1823 53 t 0 r /Helvetica findfont 68.4881 sf 0 0 m (H) show NC gr 
 gsave  2268 2176 0 0 C 1743 80 t 0 r /Helvetica findfont 102.732 sf 0 0 m (M) show NC gr  526 400 m -52 Y s 607 374 m -26 Y s 689 374 m -26 Y s 770 374 m -26 Y s 851 400 m -52 Y s 933 374 m -26 Y s 1014 374 m -26 Y s 1096 374 m -26 Y s 1177 400 m
 -52 Y s 1259 374 m -26 Y s 1340 374 m -26 Y s 1421 374 m -26 Y s 1503 400 m -52 Y s 1584 374 m -26 Y s 1666 374 m -26 Y s 1747 374 m -26 Y s 1829 400 m -52 Y s 1910 374 m -26 Y s 1991 374 m -26 Y s 2073 374 m -26 Y s 2154 400 m -52 Y s 526 400 m
 -52 Y s 444 374 m -26 Y s
 gsave  2268 2176 0 0 C 441 251 t 0 r /Helvetica findfont 102.732 sf 0 0 m (100) show NC gr 
 gsave  2268 2176 0 0 C 765 251 t 0 r /Helvetica findfont 102.732 sf 0 0 m (120) show NC gr 
 gsave  2268 2176 0 0 C 1092 251 t 0 r /Helvetica findfont 102.732 sf 0 0 m (140) show NC gr 
 gsave  2268 2176 0 0 C 1415 251 t 0 r /Helvetica findfont 102.732 sf 0 0 m (160) show NC gr 
 gsave  2268 2176 0 0 C 1743 251 t 0 r /Helvetica findfont 102.732 sf 0 0 m (180) show NC gr 
 gsave  2268 2176 0 0 C 2070 251 t 0 r /Helvetica findfont 102.732 sf 0 0 m (200) show NC gr  363 2068 m 1791 X s 526 2016 m 52 Y s 607 2042 m 26 Y s 689 2042 m 26 Y s 770 2042 m 26 Y s 851 2016 m 52 Y s 933 2042 m 26 Y s 1014 2042 m 26 Y s 1096
 2042 m 26 Y s 1177 2016 m 52 Y s 1259 2042 m 26 Y s 1340 2042 m 26 Y s 1421 2042 m 26 Y s 1503 2016 m 52 Y s 1584 2042 m 26 Y s 1666 2042 m 26 Y s 1747 2042 m 26 Y s 1829 2016 m 52 Y s 1910 2042 m 26 Y s 1991 2042 m 26 Y s 2073 2042 m 26 Y s 2154
 2016 m 52 Y s 526 2016 m 52 Y s 444 2042 m 26 Y s 363 348 m 1720 Y s
 gsave  2268 2176 0 0 C 133 1328 t 90 r /Helvetica findfont 102.732 sf 0 0 m (Branching ratios) show NC gr  417 348 m -54 X s
 gsave  2268 2176 0 0 C 278 350 t 0 r /Helvetica findfont 68.4881 sf 0 0 m (\2553) show NC gr 
 gsave  2268 2176 0 0 C 167 301 t 0 r /Helvetica findfont 102.732 sf 0 0 m (10) show NC gr  390 521 m -27 X s 390 622 m -27 X s 390 693 m -27 X s 390 749 m -27 X s 390 794 m -27 X s 390 833 m -27 X s 390 866 m -27 X s 390 895 m -27 X s 417 921 m -54
 X s
 gsave  2268 2176 0 0 C 278 921 t 0 r /Helvetica findfont 68.4881 sf 0 0 m (\2552) show NC gr 
 gsave  2268 2176 0 0 C 167 875 t 0 r /Helvetica findfont 102.732 sf 0 0 m (10) show NC gr  390 1094 m -27 X s 390 1195 m -27 X s 390 1266 m -27 X s 390 1322 m -27 X s 390 1367 m -27 X s 390 1406 m -27 X s 390 1439 m -27 X s 390 1468 m -27 X s 417
 1494 m -54 X s
 gsave  2268 2176 0 0 C 289 1492 t 0 r /Helvetica findfont 68.4881 sf 0 0 m (\2551) show NC gr 
 gsave  2268 2176 0 0 C 179 1446 t 0 r /Helvetica findfont 102.732 sf 0 0 m (10) show NC gr  390 1667 m -27 X s 390 1768 m -27 X s 390 1840 m -27 X s 390 1895 m -27 X s 390 1940 m -27 X s 390 1979 m -27 X s 390 2012 m -27 X s 390 2041 m -27 X s 417
 2068 m -54 X s
 gsave  2268 2176 0 0 C 342 2025 t 0 r  -42 0 t /Helvetica findfont 102.732 sf 0 0 m (1) show NC gr  2154 348 m 1720 Y s 2101 348 m 53 X s 2127 521 m 27 X s 2127 622 m 27 X s 2127 693 m 27 X s 2127 749 m 27 X s 2127 794 m 27 X s 2127 833 m 27 X s
 2127 866 m 27 X s 2127 895 m 27 X s 2101 921 m 53 X s 2127 1094 m 27 X s 2127 1195 m 27 X s 2127 1266 m 27 X s 2127 1322 m 27 X s 2127 1367 m 27 X s 2127 1406 m 27 X s 2127 1439 m 27 X s 2127 1468 m 27 X s 2101 1494 m 53 X s 2127 1667 m 27 X s 2127
 1768 m 27 X s 2127 1840 m 27 X s 2127 1895 m 27 X s 2127 1940 m 27 X s 2127 1979 m 27 X s 2127 2012 m 27 X s 2127 2041 m 27 X s 2101 2068 m 53 X s 0.3 0.3 0.3 c 12 lw black 0.3 0.3 0.3 c 363 2015 m 81 -2 d 82 -4 d 81 -6 d 82 -8 d 81 -14 d 81 -20 d
 82 -29 d 81 -39 d 82 -50 d 81 -62 d 82 -77 d 81 -97 d 81 -133 d 82 -245 d 81 -264 d 82 -103 d 81 -63 d 82 -52 d 81 -63 d 81 -50 d 82 -38 d 81 -32 d s
 gsave  2268 2176 0 0 C 651 1872 t 0 r /Helvetica findfont 102.732 sf 0 0 m (b) show NC gr  6 lw 651 1960 m 53 X s
 gsave  2268 2176 0 0 C 597 1872 t 0 r /Helvetica findfont 102.732 sf 0 0 m (b) show NC gr  1 0 0 c 12 lw black 1 0 0 c 363 1450 m 163 X 81 -4 d 82 -6 d 81 -12 d 81 -18 d 82 -27 d 81 -37 d 82 -48 d 81 -61 d 82 -75 d 81 -96 d 81 -130 d 82 -245 d 81
 -263 d 65 -80 d s
 gsave  2268 2176 0 0 C 453 1480 t 0 r /Symbol findfont 102.732 sf 0 0 m (t) show NC gr 
 gsave  2268 2176 0 0 C 407 1480 t 0 r /Symbol findfont 102.732 sf 0 0 m (t) show NC gr  0 0.4 0 c black 0 0.4 0 c 363 1322 m 81 -3 d 82 -3 d 81 -6 d 82 -9 d 81 -14 d 81 -20 d 82 -29 d 81 -38 d 82 -51 d 81 -63 d 82 -76 d 81 -97 d 81 -133 d 82 -246 d
 57 -186 d s
 gsave  2268 2176 0 0 C 460 1221 t 0 r /Helvetica findfont 102.732 sf 0 0 m (c) show NC gr  6 lw 460 1290 m 54 X s
 gsave  2268 2176 0 0 C 407 1221 t 0 r /Helvetica findfont 102.732 sf 0 0 m (c) show NC gr  0.6 0 0.6 c 12 lw black 0.6 0 0.6 c 363 1332 m 81 24 d 82 22 d 81 20 d 82 15 d 81 9 d 81 1 d 82 -7 d 81 -19 d 82 -30 d 81 -43 d 82 -58 d 81 -79 d 81 -115 d
 82 -228 d 81 -249 d 82 -84 d 81 -47 d 82 -37 d 81 -48 d 73 -31 d s 0.4 0 0.4 c
 gsave  2268 2176 0 0 C 860 1461 t 0 r /Helvetica findfont 102.732 sf 0 0 m (gg) show NC gr  1 0 1 c black 1 0 1 c 363 425 m 81 32 d 82 31 d 81 28 d 82 25 d 81 19 d 81 13 d 82 4 d 81 -5 d 82 -14 d 81 -26 d 82 -37 d 81 -53 d 81 -79 d 8 -15 d s
 gsave  2268 2176 0 0 C 913 613 t 0 r /Symbol findfont 102.732 sf 0 0 m (g) show NC gr 
 gsave  2268 2176 0 0 C 860 613 t 0 r /Symbol findfont 102.732 sf 0 0 m (g) show NC gr  0 0 0.4 c black 0 0 0.4 c 824 348 m 27 37 d s 851 385 m 82 82 d 81 59 d 82 37 d 81 20 d 82 1 d 81 -18 d 81 -48 d 82 -126 d 19 -44 d s
 gsave  2268 2176 0 0 C 1237 624 t 0 r /Symbol findfont 102.732 sf 0 0 m (g) show NC gr 
 gsave  2268 2176 0 0 C 1176 624 t 0 r /Helvetica findfont 102.732 sf 0 0 m (Z) show NC gr  0.35 0.83 0.33 c black 0.35 0.83 0.33 c 363 531 m 81 203 d 82 213 d 81 195 d 82 171 d 81 147 d 81 123 d 82 104 d 81 86 d 82 70 d 81 55 d 82 44 d 81 37 d 81
 32 d 82 33 d 81 14 d 82 1 d 81 -2 d 82 -7 d 81 -25 d 81 -17 d 82 -10 d 81 -5 d s
 gsave  2268 2176 0 0 C 1450 1918 t 0 r /Helvetica findfont 102.732 sf 0 0 m (WW) show NC gr  0.35 0.33 0.85 c black 0.35 0.33 0.85 c 507 348 m 19 31 d s 526 379 m 81 160 d 82 177 d 81 172 d 81 152 d 82 127 d 81 101 d 82 79 d 81 57 d 82 35 d 81 9 d
 81 -29 d 82 -143 d 81 -156 d 82 15 d 81 78 d 82 155 d 81 227 d 81 83 d 82 33 d 81 17 d s
 gsave  2268 2176 0 0 C 1880 1701 t 0 r /Helvetica findfont 102.732 sf 0 0 m (ZZ) show NC gr  black
 gsave  2268 2176 0 0 C 2222 1579 t 90 r /Helvetica-BoldOblique findfont 41.8538 sf 0 0 m (LHC HIGGS XS WG 2010) show NC gr 
 gr  gr 
showpage
end
%%EOF
