%!PS-Adobe-2.0 EPSF-2.0
%%BoundingBox:  0 0 567 384
%%Title: : c1
%%Creator: ROOT Version 5.24/00
%%CreationDate: Tue Nov 30 15:30:13 2010
%%EndComments
%%BeginProlog
80 dict begin
/s {stroke} def /l {lineto} def /m {moveto} def /t {translate} def
/sw {stringwidth} def /r {rotate} def /rl {roll}  def /R {repeat} def
/d {rlineto} def /rm {rmoveto} def /gr {grestore} def /f {eofill} def
/c {setrgbcolor} def /black {0 setgray} def /sd {setdash} def
/cl {closepath} def /sf {scalefont setfont} def /lw {setlinewidth} def
/box {m dup 0 exch d exch 0 d 0 exch neg d cl} def
/NC{systemdict begin initclip end}def/C{NC box clip newpath}def
/bl {box s} def /bf {box f} def /Y { 0 exch d} def /X { 0 d} def 
/mp {newpath /y exch def /x exch def} def
/side {[w .77 mul w .23 mul] .385 w mul sd w 0 l currentpoint t -144 r} def
/mr {mp x y w2 0 360 arc} def /m24 {mr s} def /m20 {mr f} def
/mb {mp x y w2 add m w2 neg 0 d 0 w neg d w 0 d 0 w d cl} def
/mt {mp x y w2 add m w2 neg w neg d w 0 d cl} def
/m21 {mb f} def /m25 {mb s} def /m22 {mt f} def /m26{mt s} def
/m23 {mp x y w2 sub m w2 w d w neg 0 d cl f} def
/m27 {mp x y w2 add m w3 neg w2 neg d w3 w2 neg d w3 w2 d cl s} def
/m28 {mp x w2 sub y w2 sub w3 add m w3 0 d  0 w3 neg d w3 0 d 0 w3 d w3 0 d  0 w3 d w3 neg 0 d 0 w3 d w3 neg 0 d
 0 w3 neg d w3 neg 0 d cl s } def
/m29 {mp gsave x w2 sub y w2 add w3 sub m currentpoint t
 4 {side} repeat cl fill gr} def
/m30 {mp gsave x w2 sub y w2 add w3 sub m currentpoint t
 4 {side} repeat cl s gr} def
/m31 {mp x y w2 sub m 0 w d x w2 sub y m w 0 d x w2 sub y w2 add m w w neg d x w2 sub y w2
 sub m w w d s} def
/m2 {mp x y w2 sub m 0 w d x w2 sub y m w 0 d s} def
/m5 {mp x w2 sub y w2 sub m w w d x w2 sub y w2 add m w w neg d s} def
/reEncode {exch findfont dup length dict begin {1 index /FID eq  {pop pop} {def} ifelse } forall /Encoding exch def currentdict end dup /FontName get exch definefont pop } def [/Times-Bold /Times-Italic /Times-BoldItalic /Helvetica
 /Helvetica-Oblique /Helvetica-Bold /Helvetica-BoldOblique /Courier /Courier-Oblique /Courier-Bold /Courier-BoldOblique /Times-Roman /AvantGarde-Book /AvantGarde-BookOblique /AvantGarde-Demi /AvantGarde-DemiOblique /Bookman-Demi
 /Bookman-DemiItalic /Bookman-Light /Bookman-LightItalic /Helvetica-Narrow /Helvetica-Narrow-Bold /Helvetica-Narrow-BoldOblique /Helvetica-Narrow-Oblique /NewCenturySchlbk-Roman /NewCenturySchlbk-Bold
 /NewCenturySchlbk-BoldItalic /NewCenturySchlbk-Italic /Palatino-Bold /Palatino-BoldItalic /Palatino-Italic /Palatino-Roman ] {ISOLatin1Encoding reEncode } forall
/oshow {gsave [] 0 sd true charpath stroke gr} def
/stwn { /fs exch def /fn exch def /text exch def fn findfont fs sf
 text sw pop xs add /xs exch def} def
/stwb { /fs exch def /fn exch def /nbas exch def /textf exch deftextf length /tlen exch def nbas tlen gt {/nbas tlendef} iffn findfont fs sf textf dup length nbas sub nbas getinterval sw
pop neg xs add /xs exch def} def
%%EndProlog
%%BeginSetup
%%EndSetup
newpath  gsave  .25 .25 scale  gsave  0 0 t black[  ] 0 sd 3 lw 1 1 1 c 2268 1538 0 0 bf black 1 1 1 c 1791 1215 363 246 bf black 1791 1215 363 246 bl 1 1 1 c 1791 1215 363 246 bf black 1791 1215 363 246 bl 363 246 m 1791 X s
 gsave  2268 1538 0 0 C 1955 117 t 0 r /Helvetica findfont 71.6807 sf 0 0 m ( [GeV]) show NC gr 
 gsave  2268 1538 0 0 C 1922 98 t 0 r /Helvetica findfont 48.8732 sf 0 0 m (H) show NC gr 
 gsave  2268 1538 0 0 C 1867 117 t 0 r /Helvetica findfont 71.6807 sf 0 0 m (M) show NC gr  401 283 m -37 Y s 439 264 m -18 Y s 477 264 m -18 Y s 515 264 m -18 Y s 553 264 m -18 Y s 592 283 m -37 Y s 630 264 m -18 Y s 668 264 m -18 Y s 706 264 m -18
 Y s 744 264 m -18 Y s 782 283 m -37 Y s 820 264 m -18 Y s 858 264 m -18 Y s 896 264 m -18 Y s 935 264 m -18 Y s 973 283 m -37 Y s 1011 264 m -18 Y s 1049 264 m -18 Y s 1087 264 m -18 Y s 1125 264 m -18 Y s 1163 283 m -37 Y s 1201 264 m -18 Y s 1240
 264 m -18 Y s 1278 264 m -18 Y s 1316 264 m -18 Y s 1354 283 m -37 Y s 1392 264 m -18 Y s 1430 264 m -18 Y s 1468 264 m -18 Y s 1506 264 m -18 Y s 1544 283 m -37 Y s 1583 264 m -18 Y s 1621 264 m -18 Y s 1659 264 m -18 Y s 1697 264 m -18 Y s 1735
 283 m -37 Y s 1773 264 m -18 Y s 1811 264 m -18 Y s 1849 264 m -18 Y s 1888 264 m -18 Y s 1926 283 m -37 Y s 1964 264 m -18 Y s 2002 264 m -18 Y s 2040 264 m -18 Y s 2078 264 m -18 Y s 2116 283 m -37 Y s 401 283 m -37 Y s 363 264 m -18 Y s 2116 283
 m -37 Y s
 gsave  2268 1538 0 0 C 342 179 t 0 r /Helvetica findfont 71.6807 sf 0 0 m (100) show NC gr 
 gsave  2268 1538 0 0 C 531 179 t 0 r /Helvetica findfont 71.6807 sf 0 0 m (200) show NC gr 
 gsave  2268 1538 0 0 C 723 179 t 0 r /Helvetica findfont 71.6807 sf 0 0 m (300) show NC gr 
 gsave  2268 1538 0 0 C 912 179 t 0 r /Helvetica findfont 71.6807 sf 0 0 m (400) show NC gr 
 gsave  2268 1538 0 0 C 1105 179 t 0 r /Helvetica findfont 71.6807 sf 0 0 m (500) show NC gr 
 gsave  2268 1538 0 0 C 1294 179 t 0 r /Helvetica findfont 71.6807 sf 0 0 m (600) show NC gr 
 gsave  2268 1538 0 0 C 1486 179 t 0 r /Helvetica findfont 71.6807 sf 0 0 m (700) show NC gr 
 gsave  2268 1538 0 0 C 1675 179 t 0 r /Helvetica findfont 71.6807 sf 0 0 m (800) show NC gr 
 gsave  2268 1538 0 0 C 1867 179 t 0 r /Helvetica findfont 71.6807 sf 0 0 m (900) show NC gr 
 gsave  2268 1538 0 0 C 2036 179 t 0 r /Helvetica findfont 71.6807 sf 0 0 m (1000) show NC gr  363 1461 m 1791 X s 401 1425 m 36 Y s 439 1443 m 18 Y s 477 1443 m 18 Y s 515 1443 m 18 Y s 553 1443 m 18 Y s 592 1425 m 36 Y s 630 1443 m 18 Y s 668 1443
 m 18 Y s 706 1443 m 18 Y s 744 1443 m 18 Y s 782 1425 m 36 Y s 820 1443 m 18 Y s 858 1443 m 18 Y s 896 1443 m 18 Y s 935 1443 m 18 Y s 973 1425 m 36 Y s 1011 1443 m 18 Y s 1049 1443 m 18 Y s 1087 1443 m 18 Y s 1125 1443 m 18 Y s 1163 1425 m 36 Y s
 1201 1443 m 18 Y s 1240 1443 m 18 Y s 1278 1443 m 18 Y s 1316 1443 m 18 Y s 1354 1425 m 36 Y s 1392 1443 m 18 Y s 1430 1443 m 18 Y s 1468 1443 m 18 Y s 1506 1443 m 18 Y s 1544 1425 m 36 Y s 1583 1443 m 18 Y s 1621 1443 m 18 Y s 1659 1443 m 18 Y s
 1697 1443 m 18 Y s 1735 1425 m 36 Y s 1773 1443 m 18 Y s 1811 1443 m 18 Y s 1849 1443 m 18 Y s 1888 1443 m 18 Y s 1926 1425 m 36 Y s 1964 1443 m 18 Y s 2002 1443 m 18 Y s 2040 1443 m 18 Y s 2078 1443 m 18 Y s 2116 1425 m 36 Y s 401 1425 m 36 Y s
 363 1443 m 18 Y s 2116 1425 m 36 Y s 363 246 m 1215 Y s
 gsave  2268 1538 0 0 C 235 740 t 90 r /Helvetica findfont 71.6807 sf 0 0 m (VBF Cross Section [fb]) show NC gr  417 277 m -54 X s
 gsave  2268 1538 0 0 C 316 274 t 0 r /Helvetica findfont 48.8732 sf 0 0 m (2) show NC gr 
 gsave  2268 1538 0 0 C 238 244 t 0 r /Helvetica findfont 71.6807 sf 0 0 m (10) show NC gr  390 477 m -27 X s 390 594 m -27 X s 390 678 m -27 X s 390 742 m -27 X s 390 795 m -27 X s 390 839 m -27 X s 390 878 m -27 X s 390 912 m -27 X s 417 943 m -54
 X s
 gsave  2268 1538 0 0 C 316 945 t 0 r /Helvetica findfont 48.8732 sf 0 0 m (3) show NC gr 
 gsave  2268 1538 0 0 C 238 912 t 0 r /Helvetica findfont 71.6807 sf 0 0 m (10) show NC gr  390 1143 m -27 X s 390 1260 m -27 X s 390 1344 m -27 X s 390 1408 m -27 X s 2154 246 m 1215 Y s 2101 277 m 53 X s 2127 477 m 27 X s 2127 594 m 27 X s 2127
 678 m 27 X s 2127 742 m 27 X s 2127 795 m 27 X s 2127 839 m 27 X s 2127 878 m 27 X s 2127 912 m 27 X s 2101 943 m 53 X s 2127 1143 m 27 X s 2127 1260 m 27 X s 2127 1344 m 27 X s 2127 1408 m 27 X s 0.4 0.4 0.8 c 0.4 0.8 0.4 c 0.4 0.4 0.8 c 401 1410
 m 19 -24 d 19 -23 d 19 -23 d 19 -22 d 19 -21 d 19 -22 d 19 -17 d 19 -21 d 19 -18 d 20 -19 d 19 -19 d 19 -19 d 19 -18 d 19 -18 d 19 -17 d 19 -18 d 19 -17 d 19 -16 d 19 -16 d 19 -16 d 38 -31 d 38 -32 d 38 -28 d 39 -23 d 38 -24 d 190 -114 d 191 -104 d
 190 -94 d 191 -84 d 191 -75 d 190 -66 d s 0.4 0.8 0.4 c 0.4 0.4 0.8 c 1 lw << /PatternType 1 /PaintType 2 /TilingType 1 /BBox [ 0 0 100 100 ] /XStep 98 /YStep 4 /PaintProc { begin gsave [1] 0 sd 2 4 m 99 4 l s 1 3 m 98 3 l s
 2 2 m 99 2 l s 1 1 m 98 1 l s gr end } >> [ 4.0 0 0 4.0 0 0 ] makepattern /P01 exch def /cs {[/Pattern /DeviceRGB] setcolorspace} def /FA {f [/DeviceRGB] setcolorspace} def cs 0.4 0.4 0.8 P01 setcolor 401 1414 m 19 -24 d 19 -23 d 19 -22 d 19 -22 d
 19 -22 d 19 -22 d 19 -16 d 19 -21 d 19 -18 d 20 -19 d 19 -20 d 19 -18 d 19 -18 d 19 -18 d 19 -18 d 19 -17 d 19 -17 d 19 -16 d 19 -16 d 19 -16 d 38 -31 d 38 -32 d 38 -28 d 39 -23 d 38 -24 d 190 -114 d 191 -104 d 190 -94 d 191 -83 d 191 -75 d 190 -66
 d -15 Y -190 67 d -191 75 d -191 84 d -190 94 d -191 104 d -190 115 d -38 23 d -39 24 d -38 28 d -38 32 d -38 31 d -19 16 d -19 16 d -19 16 d -19 17 d -19 18 d -19 17 d -19 18 d -19 18 d -19 19 d -19 19 d -20 19 d -19 18 d -19 22 d -19 16 d -19 22
 d -19 22 d -19 21 d -19 23 d -19 23 d -19 24 d FA 3 lw 0 0.6 0 c 382 1455 m 9 -12 d 10 -12 d 9 -13 d 10 -9 d 10 -14 d 9 -11 d 10 -12 d 9 -11 d 10 -12 d 9 -10 d 10 -11 d 9 -11 d 10 -10 d 9 -11 d 10 -10 d 9 -10 d 10 -10 d 9 -11 d 10 -8 d 9 -10 d 10
 -9 d 10 -11 d 19 -18 d 19 -18 d 19 -18 d 19 -17 d 19 -17 d 19 -15 d 19 -18 d 19 -17 d 19 -15 d 19 -16 d 38 -30 d 38 -29 d 38 -29 d 39 -28 d 38 -27 d 95 -64 d 95 -61 d 96 -57 d 95 -55 d 95 -52 d 95 -51 d 96 -48 d 95 -47 d 95 -46 d 96 -44 d 95 -43 d
 95 -42 d s 382 1460 m 9 -12 d 10 -13 d 9 -12 d 10 -9 d 10 -15 d 9 -10 d 10 -12 d 9 -11 d 10 -12 d 9 -10 d 10 -11 d 9 -11 d 10 -10 d 9 -12 d 10 -9 d 9 -10 d 10 -10 d 9 -11 d 10 -9 d 9 -9 d 10 -10 d 10 -10 d 19 -18 d 19 -18 d 19 -18 d 19 -17 d 19 -17
 d 19 -15 d 19 -18 d 19 -17 d 19 -15 d 19 -15 d 38 -31 d 38 -29 d 38 -28 d 39 -28 d 38 -27 d 95 -65 d 95 -60 d 96 -58 d 95 -54 d 95 -53 d 95 -50 d 96 -48 d 95 -47 d 95 -46 d 96 -44 d 95 -42 d 95 -42 d -13 Y -95 42 d -95 43 d -96 44 d -95 46 d -95 46
 d -96 49 d -95 50 d -95 53 d -95 55 d -96 58 d -95 60 d -95 65 d -38 27 d -39 28 d -38 28 d -38 30 d -38 30 d -19 16 d -19 15 d -19 17 d -19 18 d -19 15 d -19 17 d -19 17 d -19 18 d -19 18 d -19 18 d -10 11 d -10 9 d -9 10 d -10 8 d -9 11 d -10 10
 d -9 10 d -10 10 d -9 11 d -10 11 d -9 10 d -10 11 d -9 10 d -10 13 d -9 10 d -10 13 d -9 10 d -10 14 d -10 10 d -9 12 d -10 12 d -9 12 d f 0.8 0 0 c 382 1452 m 9 -13 d 10 -12 d 9 -12 d 10 -12 d 10 -12 d 9 -11 d 10 -11 d 9 -12 d 10 -11 d 9 -11 d 10
 -11 d 9 -10 d 10 -11 d 9 -10 d 10 -10 d 9 -10 d 10 -10 d 9 -10 d 10 -10 d 9 -10 d 10 -9 d 10 -10 d 19 -18 d 19 -18 d 19 -18 d 19 -17 d 19 -17 d 19 -17 d 19 -17 d 19 -16 d 19 -16 d 19 -15 d 38 -30 d 38 -30 d 38 -28 d 39 -28 d 38 -27 d 38 -26 d 38
 -26 d 38 -25 d 38 -24 d 38 -24 d 38 -24 d 39 -22 d 38 -23 d 38 -22 d 38 -22 d 95 -52 d 95 -51 d 96 -48 d 95 -48 d 95 -45 d 96 -44 d 95 -44 d 95 -41 d s 2116 288 m -3 -3 d s 2110 301 m -11 -11 d s 2096 307 m -10 -11 d s 2083 313 m -11 -11 d s 2070
 319 m -11 -11 d s 2056 324 m -10 -10 d s 2043 330 m -11 -10 d s 2029 336 m -10 -10 d s 2016 342 m -10 -10 d s 2003 348 m -11 -10 d s 1990 354 m -11 -10 d s 1976 360 m -10 -10 d s 1963 366 m -10 -10 d s 1950 372 m -10 -10 d s 1937 378 m -11 -10 d s
 1924 384 m -11 -10 d s 1910 390 m -10 -10 d s 1897 396 m -10 -10 d s 1884 402 m -10 -10 d s 1871 409 m -10 -11 d s 1858 415 m -10 -11 d s 1845 421 m -11 -10 d s 1832 427 m -11 -10 d s 1818 433 m -10 -10 d s 1805 439 m -10 -10 d s 1792 445 m -10 -10
 d s 1779 452 m -10 -10 d s 1766 458 m -10 -10 d s 1753 464 m -10 -10 d s 1740 470 m -10 -10 d s 1727 477 m -10 -10 d s 1714 483 m -9 -10 d s 1702 489 m -10 -10 d s 1689 496 m -10 -10 d s 1676 502 m -10 -10 d s 1663 508 m -10 -9 d s 1650 515 m -10
 -10 d s 1637 521 m -10 -10 d s 1624 528 m -9 -10 d s 1612 534 m -10 -10 d s 1599 541 m -10 -10 d s 1586 547 m -10 -10 d s 1573 554 m -9 -10 d s 1561 560 m -10 -10 d s 1548 567 m -10 -10 d s 1535 573 m -9 -9 d s 1523 580 m -10 -10 d s 1510 587 m -9
 -10 d s 1498 593 m -10 -9 d s 1485 600 m -9 -10 d s 1472 607 m -9 -10 d s 1460 613 m -9 -9 d s 1447 620 m -9 -9 d s 1435 627 m -9 -9 d s 1423 634 m -10 -10 d s 1410 640 m -9 -9 d s 1398 647 m -10 -9 d s 1385 654 m -9 -9 d s 1373 661 m -9 -9 d s
 1360 668 m -9 -9 d s 1348 675 m -9 -9 d s 1336 682 m -9 -10 d s 1324 689 m -10 -10 d s 1311 696 m -9 -9 d s 1299 703 m -9 -9 d s 1287 710 m -9 -9 d s 1275 717 m -9 -9 d s 1263 724 m -9 -9 d s 1251 731 m -9 -9 d s 1238 738 m -8 -9 d s 1226 745 m -8
 -8 d s 1214 753 m -8 -9 d s 1202 760 m -8 -9 d s 1190 767 m -8 -9 d s 1179 774 m -9 -8 d s 1167 782 m -9 -9 d s 1155 789 m -9 -8 d s 1143 797 m -9 -9 d s 1131 804 m -8 -9 d s 1119 811 m -8 -8 d s 1108 819 m -9 -9 d s 1096 826 m -9 -8 d s 1084 834 m
 -8 -8 d s 1072 842 m -8 -9 d s 1061 849 m -9 -8 d s 1049 857 m -8 -9 d s 1038 864 m -9 -8 d s 1026 872 m -8 -8 d s 1015 880 m -8 -8 d s 1003 888 m -8 -8 d s 992 896 m -8 -9 d s 980 903 m -8 -8 d s 969 911 m -8 -8 d s 958 919 m -8 -8 d s 946 927 m
 -7 -8 d s 935 935 m -8 -8 d s 924 943 m -8 -7 d s 913 951 m -8 -7 d s 902 959 m -8 -7 d s 891 968 m -8 -8 d s 880 976 m -8 -8 d s 869 984 m -8 -7 d s 858 992 m -8 -7 d s 847 1001 m -8 -8 d s 836 1009 m -8 -7 d s 825 1017 m -7 -7 d s 814 1026 m -7
 -8 d s 803 1034 m -7 -7 d s 793 1043 m -8 -8 d s 782 1051 m -7 -7 d s 771 1060 m -7 -7 d s 761 1069 m -7 -7 d s 750 1077 m -7 -7 d s 740 1086 m -7 -7 d s 729 1095 m -7 -7 d s 719 1104 m -7 -7 d s 709 1113 m -7 -7 d s 698 1122 m -6 -7 d s 688 1131 m
 -7 -7 d s 678 1140 m -7 -7 d s 668 1149 m -7 -7 d s 658 1158 m -7 -7 d s 648 1167 m -7 -6 d s 638 1177 m -7 -7 d s 628 1186 m -7 -7 d s 618 1195 m -7 -6 d s 608 1205 m -6 -7 d s 598 1214 m -6 -6 d s 589 1224 m -7 -7 d s 579 1233 m -6 -6 d s 569
 1243 m -6 -6 d s 560 1252 m -6 -6 d s 550 1262 m -6 -6 d s 541 1272 m -6 -6 d s 531 1282 m -5 -6 d s 522 1292 m -6 -6 d s 513 1302 m -6 -6 d s 504 1312 m -6 -6 d s 494 1322 m -5 -6 d s 485 1332 m -5 -6 d s 476 1342 m -5 -5 d s 467 1353 m -5 -6 d s
 458 1363 m -5 -6 d s 450 1373 m -6 -5 d s 441 1384 m -6 -6 d s 432 1394 m -5 -5 d s 424 1405 m -6 -5 d s 415 1415 m -5 -5 d s 406 1426 m -5 -5 d s 398 1437 m -5 -5 d s 389 1448 m -5 -5 d s 2100 305 m 16 -16 d s 2066 320 m 27 -27 d s 2032 335 m 27
 -27 d s 1997 351 m 27 -28 d s 1961 367 m 28 -28 d s 1926 383 m 28 -28 d s 1890 400 m 28 -29 d s 1854 416 m 28 -28 d s 1818 433 m 28 -28 d s 1781 451 m 29 -29 d s 1745 468 m 28 -28 d s 1707 487 m 29 -30 d s 1669 505 m 29 -29 d s 1631 524 m 29 -29 d
 s 1591 544 m 30 -30 d s 1552 564 m 30 -29 d s 1512 586 m 31 -31 d s 1471 608 m 30 -31 d s 1429 630 m 31 -31 d s 1386 654 m 32 -32 d s 1343 678 m 32 -33 d s 1298 703 m 33 -33 d s 1251 731 m 35 -35 d s 1203 759 m 36 -35 d s 1154 790 m 36 -37 d s 1101
 823 m 38 -38 d s 1046 859 m 40 -40 d s 987 899 m 43 -43 d s 921 945 m 48 -47 d s 846 1002 m 53 -54 d s 382 1446 m 43 -43 d s 752 1076 m 68 -68 d s 461 1348 m 249 -249 d s 0 lw 1 1 1 c 3 lw 1039 407 1069 994 bf black
 gsave  2268 1538 0 0 C 1326 1320 t 0 r /Helvetica findfont 35.8403 sf 0 0 m (NLO QCD+EW MSTW2008 \255 14 TeV) show NC gr  0.4 0.4 0.8 c cs 0.4 0.4 0.8 P01 setcolor 1108 1286 m 182 X 95 Y -182 X FA 0.4 0.4 0.8 c 1108 1381 m 182 X s 1108 1286 m 182 X
 s 1290 1286 m 95 Y s 1108 1286 m 95 Y s black
 gsave  2268 1538 0 0 C 1326 1183 t 0 r /Helvetica findfont 35.8403 sf 0 0 m (NNLO QCD MSTW2008 \255 14 TeV) show NC gr  0 0.6 0 c 1108 1150 m 182 X 95 Y -182 X f 1108 1245 m 182 X s 1108 1150 m 182 X s 1290 1150 m 95 Y s 1108 1150 m 95 Y s black
 gsave  2268 1538 0 0 C 1326 1046 t 0 r /Helvetica findfont 35.8403 sf 0 0 m (NLO QCD MSTW2008 \255 14 TeV) show NC gr  0.8 0 0 c 1290 1020 m -6 -6 d s 1290 1039 m -26 -25 d s 1290 1059 m -45 -45 d s 1290 1078 m -64 -64 d s 1290 1097 m -83 -83 d s
 1282 1109 m -95 -95 d s 1263 1109 m -95 -95 d s 1244 1109 m -95 -95 d s 1225 1109 m -95 -95 d s 1205 1109 m -95 -95 d s 1186 1109 m -78 -78 d s 1167 1109 m -59 -59 d s 1148 1109 m -40 -40 d s 1128 1109 m -20 -21 d s 1109 1109 m -1 -1 d s 1277 1109
 m 13 -13 d s 1258 1109 m 32 -32 d s 1238 1109 m 52 -51 d s 1219 1109 m 71 -70 d s 1200 1109 m 90 -89 d s 1181 1109 m 95 -95 d s 1161 1109 m 95 -95 d s 1142 1109 m 95 -95 d s 1123 1109 m 95 -95 d s 1108 1105 m 91 -91 d s 1108 1086 m 71 -72 d s 1108
 1067 m 52 -53 d s 1108 1047 m 33 -33 d s 1108 1028 m 14 -14 d s 0 lw 0 0.6 0 c 0.8 0 0 c 3 lw 1108 1109 m 182 X s 1108 1014 m 182 X s 1290 1014 m 95 Y s 1108 1014 m 95 Y s black
 gsave  2268 1538 0 0 C 2222 1118 t 90 r /Helvetica-BoldOblique findfont 29.3239 sf 0 0 m (LHC HIGGS XS WG 2010) show NC gr 
 gr  gr 
showpage
end
%%EOF
