%!PS-Adobe-2.0 EPSF-2.0
%%BoundingBox:  0 0 567 544
%%Title: YRHXS_PDF_7.eps: LHC 14 TeV
%%Creator: ROOT Version 5.27/06
%%CreationDate: Mon Nov 22 18:19:18 2010
%%EndComments
%%BeginProlog
80 dict begin
/s {stroke} def /l {lineto} def /m {moveto} def /t {translate} def
/r {rotate} def /rl {roll}  def /R {repeat} def
/d {rlineto} def /rm {rmoveto} def /gr {grestore} def /f {eofill} def
/c {setrgbcolor} def /black {0 setgray} def /sd {setdash} def
/cl {closepath} def /sf {scalefont setfont} def /lw {setlinewidth} def
/box {m dup 0 exch d exch 0 d 0 exch neg d cl} def
/NC{systemdict begin initclip end}def/C{NC box clip newpath}def
/bl {box s} def /bf {box f} def /Y { 0 exch d} def /X { 0 d} def 
/K {{pop pop 0 moveto} exch kshow} bind def
/ita {/ang 15 def gsave [1 0 ang dup sin exch cos div 1 0 0] concat} def 
/mp {newpath /y exch def /x exch def} def
/side {[w .77 mul w .23 mul] .385 w mul sd w 0 l currentpoint t -144 r} def
/mr {mp x y w2 0 360 arc} def /m24 {mr s} def /m20 {mr f} def
/mb {mp x y w2 add m w2 neg 0 d 0 w neg d w 0 d 0 w d cl} def
/mt {mp x y w2 add m w2 neg w neg d w 0 d cl} def
/m21 {mb f} def /m25 {mb s} def /m22 {mt f} def /m26{mt s} def
/m23 {mp x y w2 sub m w2 w d w neg 0 d cl f} def
/m27 {mp x y w2 add m w3 neg w2 neg d w3 w2 neg d w3 w2 d cl s} def
/m28 {mp x w2 sub y w2 sub w3 add m w3 0 d  0 w3 neg d w3 0 d 0 w3 d w3 0 d  0 w3 d w3 neg 0 d 0 w3 d w3 neg 0 d 0 w3 neg d w3 neg 0 d cl s } def
/m29 {mp gsave x w2 sub y w2 add w3 sub m currentpoint t 4 {side} repeat cl fill gr} def
/m30 {mp gsave x w2 sub y w2 add w3 sub m currentpoint t 4 {side} repeat cl s gr} def
/m31 {mp x y w2 sub m 0 w d x w2 sub y m w 0 d x w2 sub y w2 add m w w neg d x w2 sub y w2 sub m w w d s} def
/m32 {mp x y w2 sub m w2 w d w neg 0 d cl s} def
/m33 {mp x y w2 add m w3 neg w2 neg d w3 w2 neg d w3 w2 d cl f} def
/m34 {mp x w2 sub y w2 sub w3 add m w3 0 d  0 w3 neg d w3 0 d 0 w3 d w3 0 d  0 w3 d w3 neg 0 d 0 w3 d w3 neg 0 d 0 w3 neg d w3 neg 0 d cl f } def
/m2 {mp x y w2 sub m 0 w d x w2 sub y m w 0 d s} def
/m5 {mp x w2 sub y w2 sub m w w d x w2 sub y w2 add m w w neg d s} def
/reEncode {exch findfont dup length dict begin {1 index /FID eq  {pop pop} {def} ifelse } forall /Encoding exch def currentdict end dup /FontName get exch definefont pop } def [/Times-Bold /Times-Italic /Times-BoldItalic /Helvetica /Helvetica-Oblique
 /Helvetica-Bold /Helvetica-BoldOblique /Courier /Courier-Oblique /Courier-Bold /Courier-BoldOblique /Times-Roman /AvantGarde-Book /AvantGarde-BookOblique /AvantGarde-Demi /AvantGarde-DemiOblique /Bookman-Demi /Bookman-DemiItalic /Bookman-Light
 /Bookman-LightItalic /Helvetica-Narrow /Helvetica-Narrow-Bold /Helvetica-Narrow-BoldOblique /Helvetica-Narrow-Oblique /NewCenturySchlbk-Roman /NewCenturySchlbk-Bold /NewCenturySchlbk-BoldItalic /NewCenturySchlbk-Italic /Palatino-Bold
 /Palatino-BoldItalic /Palatino-Italic /Palatino-Roman ] {ISOLatin1Encoding reEncode } forall%%EndProlog
%%BeginSetup
%%EndSetup
newpath  gsave  .25 .25 scale  gsave  0 0 t black[  ] 0 sd 3 lw 1 1 1 c 2268 2176 0 0 bf black 1 1 1 c 1791 1720 363 348 bf black 1791 1720 363 348 bl 363 348 m 1791 X s 363 2068 m 1791 X s 363 348 m 1720 Y s[ 4 8] 0 sd 2154 348 m -1791 X s 2154 635
 m -1791 X s 2154 921 m -1791 X s 2154 1208 m -1791 X s 2154 1494 m -1791 X s 2154 1781 m -1791 X s 2154 2068 m -1791 X s 2154 348 m -1791 X s 2154 2068 m -1791 X s[  ] 0 sd 2154 348 m 1720 Y s 6 lw 1 1 1 c black 363 348 m 1791 X s 3 lw 363 348 m
 1791 X s
 gsave  2268 2176 0 0 C 1869.19 81.125 t 0 r /Helvetica findfont 102.732 sf 0 0 m ( [GeV]) show NC gr 
 gsave  2268 2176 0 0 C 1823.5 54.5 t 0 r /Helvetica findfont 68.4881 sf 0 0 m (H) show NC gr 
 gsave  2268 2176 0 0 C 1743.62 81.125 t 0 r /Helvetica findfont 102.732 sf 0 0 m (M) show NC gr  363 400 m -52 Y s 408 374 m -26 Y s 452 374 m -26 Y s 497 374 m -26 Y s 542 374 m -26 Y s 587 400 m -52 Y s 632 374 m -26 Y s 676 374 m -26 Y s 721 374
 m -26 Y s 766 374 m -26 Y s 811 400 m -52 Y s 855 374 m -26 Y s 900 374 m -26 Y s 945 374 m -26 Y s 990 374 m -26 Y s 1035 400 m -52 Y s 1079 374 m -26 Y s 1124 374 m -26 Y s 1169 374 m -26 Y s 1214 374 m -26 Y s 1259 400 m -52 Y s 1303 374 m -26 Y
 s 1348 374 m -26 Y s 1393 374 m -26 Y s 1438 374 m -26 Y s 1483 400 m -52 Y s 1527 374 m -26 Y s 1572 374 m -26 Y s 1617 374 m -26 Y s 1662 374 m -26 Y s 1706 400 m -52 Y s 1751 374 m -26 Y s 1796 374 m -26 Y s 1841 374 m -26 Y s 1886 374 m -26 Y s
 1930 400 m -52 Y s 1975 374 m -26 Y s 2020 374 m -26 Y s 2065 374 m -26 Y s 2110 374 m -26 Y s 2154 400 m -52 Y s
 gsave  2268 2176 0 0 C 278.75 252.312 t 0 r /Helvetica findfont 102.732 sf 0 0 m (100) show NC gr 
 gsave  2268 2176 0 0 C 503.25 252.312 t 0 r /Helvetica findfont 102.732 sf 0 0 m (150) show NC gr 
 gsave  2268 2176 0 0 C 727.688 252.312 t 0 r /Helvetica findfont 102.732 sf 0 0 m (200) show NC gr 
 gsave  2268 2176 0 0 C 948.375 252.312 t 0 r /Helvetica findfont 102.732 sf 0 0 m (250) show NC gr 
 gsave  2268 2176 0 0 C 1172.88 252.312 t 0 r /Helvetica findfont 102.732 sf 0 0 m (300) show NC gr 
 gsave  2268 2176 0 0 C 1397.38 252.312 t 0 r /Helvetica findfont 102.732 sf 0 0 m (350) show NC gr 
 gsave  2268 2176 0 0 C 1621.88 252.312 t 0 r /Helvetica findfont 102.732 sf 0 0 m (400) show NC gr 
 gsave  2268 2176 0 0 C 1846.38 252.312 t 0 r /Helvetica findfont 102.732 sf 0 0 m (450) show NC gr 
 gsave  2268 2176 0 0 C 2070.81 252.312 t 0 r /Helvetica findfont 102.732 sf 0 0 m (500) show NC gr  363 2068 m 1791 X s 363 2016 m 52 Y s 408 2042 m 26 Y s 452 2042 m 26 Y s 497 2042 m 26 Y s 542 2042 m 26 Y s 587 2016 m 52 Y s 632 2042 m 26 Y s 676
 2042 m 26 Y s 721 2042 m 26 Y s 766 2042 m 26 Y s 811 2016 m 52 Y s 855 2042 m 26 Y s 900 2042 m 26 Y s 945 2042 m 26 Y s 990 2042 m 26 Y s 1035 2016 m 52 Y s 1079 2042 m 26 Y s 1124 2042 m 26 Y s 1169 2042 m 26 Y s 1214 2042 m 26 Y s 1259 2016 m 52
 Y s 1303 2042 m 26 Y s 1348 2042 m 26 Y s 1393 2042 m 26 Y s 1438 2042 m 26 Y s 1483 2016 m 52 Y s 1527 2042 m 26 Y s 1572 2042 m 26 Y s 1617 2042 m 26 Y s 1662 2042 m 26 Y s 1706 2016 m 52 Y s 1751 2042 m 26 Y s 1796 2042 m 26 Y s 1841 2042 m 26 Y
 s 1886 2042 m 26 Y s 1930 2016 m 52 Y s 1975 2042 m 26 Y s 2020 2042 m 26 Y s 2065 2042 m 26 Y s 2110 2042 m 26 Y s 2154 2016 m 52 Y s 363 348 m 1720 Y s
 gsave  2268 2176 0 0 C 149.375 1994.94 t 90 r /Helvetica findfont 102.732 sf 0 0 m (R) show NC gr  417 348 m -54 X s 390 406 m -27 X s 390 463 m -27 X s 390 520 m -27 X s 390 577 m -27 X s 417 635 m -54 X s 390 692 m -27 X s 390 749 m -27 X s 390
 807 m -27 X s 390 864 m -27 X s 417 921 m -54 X s 390 979 m -27 X s 390 1036 m -27 X s 390 1093 m -27 X s 390 1151 m -27 X s 417 1208 m -54 X s 390 1265 m -27 X s 390 1323 m -27 X s 390 1380 m -27 X s 390 1437 m -27 X s 417 1494 m -54 X s 390 1552 m
 -27 X s 390 1609 m -27 X s 390 1666 m -27 X s 390 1724 m -27 X s 417 1781 m -54 X s 390 1838 m -27 X s 390 1896 m -27 X s 390 1953 m -27 X s 390 2010 m -27 X s 417 2068 m -54 X s 417 348 m -54 X s 417 2068 m -54 X s
 gsave  2268 2176 0 0 C 153.188 313.188 t 0 r /Helvetica findfont 102.732 sf 0 0 m (0.85) show NC gr 
 gsave  2268 2176 0 0 C 210.25 598.562 t 0 r /Helvetica findfont 102.732 sf 0 0 m (0.9) show NC gr 
 gsave  2268 2176 0 0 C 153.188 887.75 t 0 r /Helvetica findfont 102.732 sf 0 0 m (0.95) show NC gr 
 gsave  2268 2176 0 0 C 309.188 1169.31 t 0 r /Helvetica findfont 102.732 sf 0 0 m (1) show NC gr 
 gsave  2268 2176 0 0 C 153.188 1458.5 t 0 r /Helvetica findfont 102.732 sf 0 0 m (1.05) show NC gr 
 gsave  2268 2176 0 0 C 225.438 1743.88 t 0 r /Helvetica findfont 102.732 sf 0 0 m (1.1) show NC gr 
 gsave  2268 2176 0 0 C 153.188 2033 t 0 r /Helvetica findfont 102.732 sf 0 0 m (1.15) show NC gr  2154 348 m 1720 Y s 2101 348 m 53 X s 2127 406 m 27 X s 2127 463 m 27 X s 2127 520 m 27 X s 2127 577 m 27 X s 2101 635 m 53 X s 2127 692 m 27 X s 2127
 749 m 27 X s 2127 807 m 27 X s 2127 864 m 27 X s 2101 921 m 53 X s 2127 979 m 27 X s 2127 1036 m 27 X s 2127 1093 m 27 X s 2127 1151 m 27 X s 2101 1208 m 53 X s 2127 1265 m 27 X s 2127 1323 m 27 X s 2127 1380 m 27 X s 2127 1437 m 27 X s 2101 1494 m
 53 X s 2127 1552 m 27 X s 2127 1609 m 27 X s 2127 1666 m 27 X s 2127 1724 m 27 X s 2101 1781 m 53 X s 2127 1838 m 27 X s 2127 1896 m 27 X s 2127 1953 m 27 X s 2127 2010 m 27 X s 2101 2068 m 53 X s 2101 348 m 53 X s 2101 2068 m 53 X s 12 lw 363 1385
 m 45 -2 d 44 -1 d 45 -1 d 45 -1 d 45 -1 d 268 X 45 1 d 45 X 45 1 d 45 X 44 1 d 45 X 45 1 d 45 1 d 45 1 d 44 X 45 1 d 45 1 d 45 1 d 45 1 d 44 1 d 45 1 d 45 1 d 45 X 44 1 d 45 1 d 45 1 d 45 1 d 45 1 d 44 1 d 45 1 d 45 2 d 45 1 d 45 1 d 44 1 d s 363
 740 m 45 1 d 44 3 d 45 9 d 45 -9 d 45 -1 d 45 14 d 44 -21 d 45 -1 d 45 15 d 45 -19 d 44 -3 d 45 -2 d 45 -1 d 45 -8 d 45 2 d 44 13 d 45 -14 d 45 -5 d 45 -1 d 45 -1 d 44 -1 d 45 8 d 45 -4 d 45 -14 d 45 -5 d 44 -3 d 45 -3 d 45 -3 d 45 7 d 44 -2 d 45
 -12 d 45 X 45 -4 d 45 -1 d 44 -5 d 45 X 45 -2 d 45 -2 d 45 X 44 -7 d s 0 0 1 c[  12 12 ] 0 sd black 0 0 1 c 363 1385 m 45 -2 d 44 -1 d 45 -1 d 45 -1 d 45 -1 d 268 X 45 1 d 45 X 45 1 d 45 X 44 1 d 45 X 45 1 d 45 1 d 45 1 d 44 X 45 1 d 45 1 d 45 1 d
 45 1 d 44 1 d 45 1 d 45 1 d 45 X 44 1 d 45 1 d 45 1 d 45 1 d 45 1 d 44 1 d 45 1 d 45 2 d 45 1 d 45 1 d 44 1 d s black 0 0 1 c 363 1044 m 45 3 d 44 3 d 45 3 d 45 2 d 45 2 d 45 2 d 44 2 d 45 1 d 45 1 d 45 1 d 44 1 d 45 1 d 45 1 d 45 1 d 45 X 44 1 d
 135 X 45 -1 d 44 -1 d 45 -1 d 45 -1 d 45 -2 d 45 -1 d 44 -1 d 45 -1 d 45 -2 d 45 -1 d 44 -1 d 45 -2 d 45 -1 d 45 -2 d 45 -1 d 44 -2 d 45 -1 d 45 -2 d 45 -2 d 45 -1 d 44 -2 d s 0 1 0 c[ 4 8] 0 sd black 0 1 0 c 363 1053 m 45 -2 d 44 -12 d 45 13 d 45
 -29 d 45 -8 d 45 8 d 44 -21 d 45 -8 d 45 9 d 45 -20 d 44 -5 d 45 -3 d 45 -4 d 45 X 45 -8 d 44 12 d 45 -14 d 45 2 d 45 -2 d 45 -3 d 44 1 d 45 11 d 45 -1 d 45 -13 d 45 -1 d 44 1 d 45 1 d 45 -2 d 45 9 d 44 2 d 45 -7 d 45 3 d 45 1 d 45 X 44 5 d 45 2 d
 45 5 d 45 5 d 45 -1 d 44 4 d s black 0 1 0 c 363 737 m 45 1 d 44 4 d 45 8 d 45 -9 d 45 -1 d 45 15 d 44 -22 d 45 -1 d 45 15 d 45 -19 d 44 -3 d 45 -2 d 45 -2 d 45 -7 d 45 2 d 44 13 d 45 -14 d 45 -5 d 45 -1 d 45 -1 d 44 -1 d 45 8 d 45 -4 d 45 -15 d 45
 -4 d 44 -3 d 45 -3 d 45 -3 d 45 7 d 44 -3 d 45 -11 d 45 -1 d 45 -3 d 45 -1 d 44 -5 d 45 X 45 -2 d 45 -2 d 45 X 44 -7 d s 1 0 0 c[ 20 12 4 12 4 12 4 12] 0 sd black 1 0 0 c 363 1130 m 45 31 d 44 24 d 45 22 d 45 18 d 45 18 d 45 13 d 44 10 d 45 9 d 45 7
 d 45 3 d 44 3 d 45 3 d 45 2 d 45 3 d 45 1 d 44 3 d 45 2 d 45 2 d 45 3 d 45 3 d 44 3 d 45 2 d 45 2 d 45 1 d 89 X 45 1 d 45 1 d 45 2 d 44 2 d 45 2 d 45 2 d 45 2 d 45 2 d 44 3 d 45 2 d 45 2 d 45 2 d 45 2 d 44 1 d s black 1 0 0 c 363 880 m 45 30 d 44 24
 d 45 21 d 45 17 d 45 16 d 45 12 d 44 8 d 45 7 d 45 5 d 45 1 d 44 1 d 45 1 d 135 X 44 -1 d 224 X 45 -1 d 45 -2 d 45 -2 d 45 -3 d 44 -2 d 45 -2 d 45 -2 d 45 -2 d 44 -1 d 45 -1 d 45 -2 d 45 -1 d 45 -2 d 44 -1 d 45 -1 d 45 -2 d 45 -2 d 45 -2 d 44 -2 d s
 black
 gsave  2268 2176 0 0 C 1176.69 2074.88 t 0 r /Helvetica-BoldOblique findfont 102.732 sf 0 0 m (LHC HIGGS XS WG) show NC gr 
 gsave  2268 2176 0 0 C 408.125 1960.75 t 0 r /Helvetica findfont 60.8783 sf 0 0 m 
 286 252 222 206 172 138 121 77 33
(LHC 14 TeV) K NC gr 
 gsave  2268 2176 0 0 C 625 1854.19 t 0 r /Helvetica findfont 60.8783 sf 0 0 m ( 68% C.L.) show NC gr 
 gsave  2268 2176 0 0 C 602.125 1838.94 t 0 r /Helvetica findfont 41.8538 sf 0 0 m (s) show NC gr 
 gsave  2268 2176 0 0 C 564.125 1854.19 t 0 r /Symbol findfont 60.8783 sf 0 0 m (a) show NC gr 
 gsave  2268 2176 0 0 C 408.125 1854.19 t 0 r /Helvetica findfont 60.8783 sf 0 0 m (PDF+) show NC gr 
 gsave  2268 2176 0 0 C 408.125 1743.88 t 0 r /Helvetica findfont 60.8783 sf 0 0 m (normalized to MSTW2008nlo) show NC gr 
 gsave  2268 2176 0 0 C 1062.56 526.25 t 0 r /Helvetica findfont 60.8783 sf 0 0 m (\)) show NC gr 
 gsave  2268 2176 0 0 C 1035.88 495.812 t 0 r /Helvetica findfont 41.8538 sf 0 0 m (Z) show NC gr 
 gsave  2268 2176 0 0 C 967.438 526.25 t 0 r /Helvetica findfont 60.8783 sf 0 0 m (\(m) show NC gr 
 gsave  2268 2176 0 0 C 944.562 511.062 t 0 r /Helvetica findfont 41.8538 sf 0 0 m (s) show NC gr 
 gsave  2268 2176 0 0 C 906.562 526.25 t 0 r /Symbol findfont 60.8783 sf 0 0 m (a) show NC gr 
 gsave  2268 2176 0 0 C 408.125 526.25 t 0 r /Helvetica findfont 60.8783 sf 0 0 m 
 480 463 429 412 382 348 314 300 267 236 219 202 168 135 114 80 63 48 34
(different values of ) K NC gr 
 gsave  2268 2176 0 0 C 788.562 415.938 t 0 r /Helvetica findfont 60.8783 sf 0 0 m ( uncertainties) show NC gr 
 gsave  2268 2176 0 0 C 765.75 400.688 t 0 r /Helvetica findfont 41.8538 sf 0 0 m (s) show NC gr 
 gsave  2268 2176 0 0 C 727.688 415.938 t 0 r /Symbol findfont 60.8783 sf 0 0 m (a) show NC gr 
 gsave  2268 2176 0 0 C 408.125 415.938 t 0 r /Helvetica findfont 60.8783 sf 0 0 m (exact PDF+) show NC gr [  ] 0 sd 3 lw 1 1 1 c 521 545 1633 1523 bf black 1633 1523 m 521 X s 2154 1523 m 545 Y s 2154 2068 m -521 X s 1633 2068 m -545 Y s
 gsave  2268 2176 0 0 C 1762.62 1987.38 t 0 r /Helvetica findfont 45.6587 sf 0 0 m (PDF4LHC recipe) show NC gr  12 lw 1652 2000 m 92 X s
 gsave  2268 2176 0 0 C 1762.62 1846.56 t 0 r /Helvetica findfont 45.6587 sf 0 0 m (NNPDF2.0) show NC gr  1 0 0 c[ 20 12 4 12 4 12 4 12] 0 sd 1652 1864 m 92 X s black
 gsave  2268 2176 0 0 C 1762.62 1713.38 t 0 r /Helvetica findfont 45.6587 sf 0 0 m (CTEQ6.6) show NC gr  0 1 0 c[ 4 8] 0 sd 1652 1728 m 92 X s black
 gsave  2268 2176 0 0 C 1762.62 1576.44 t 0 r /Helvetica findfont 45.6587 sf 0 0 m (MSTW08nlo) show NC gr  0 0 1 c[  12 12 ] 0 sd 1652 1591 m 92 X s
 gr  gr showpage
end
%%EOF
