%!PS-Adobe-2.0 EPSF-2.0
%%BoundingBox: 0 0 680 529
%%Title: plot.eps
%%Creator: HIGZ Version 1.29/04
%%CreationDate: 2010/11/22   17.39
%%EndComments
%%BeginProlog
80 dict begin
/s {stroke} def /l {lineto} def /m {moveto} def /t {translate} def
/sw {stringwidth} def /r {rotate} def /rl {roll}  def /R {repeat} def
/d {rlineto} def /rm {rmoveto} def /gr {grestore} def /f {eofill} def
/c {setrgbcolor} def /lw {setlinewidth} def /sd {setdash} def
/cl {closepath} def /sf {scalefont setfont} def /black {0 setgray} def
/box {m dup 0 exch d exch 0 d 0 exch neg d cl} def
/NC{systemdict begin initclip end}def/C{NC box clip newpath}def
/bl {box s} def /bf {box f} def /Y { 0 exch d} def /X { 0 d} def 
/mp {newpath /y exch def /x exch def} def
/side {[w .77 mul w .23 mul] .385 w mul sd w 0 l currentpoint t -144 r} def
/mr {mp x y w2 0 360 arc} def /m24 {mr s} def /m20 {mr f} def
/mb {mp x y w2 add m w2 neg 0 d 0 w neg d w 0 d 0 w d cl} def
/mt {mp x y w2 add m w2 neg w neg d w 0 d cl} def
/m21 {mb f} def /m25 {mb s} def /m22 {mt f} def /m26  {mt s} def
/m23 {mp x y w2 sub m w2 w d w neg 0 d cl f} def
/m27 {mp x y w2 add m w3 neg w2 neg d w3 w2 neg d w3  w2 d cl s} def
/m28 {mp x w2 sub y w2 sub w3 add m w3 0 d 0 w3 neg d w3 0 d 0 w3 d w3 0 d
 0 w3 d w3 neg 0 d 0 w3 d w3 neg 0 d
 0 w3 neg d w3 neg 0 d cl s } def
/m29 {mp gsave x w2 sub y w2 add w3 sub m currentpoint t
 4 {side} repeat cl fill gr} def
/m30 {mp gsave x w2 sub y w2 add w3 sub m currentpoint t
 5 {side} repeat s gr} def
/m31 {mp x y w2 sub m 0 w d x w2 sub y m w 0 d
 x w2 sub y w2 add m w w neg d x w2 sub y w2
 sub m w w d s} def
/m2 {mp x y w2 sub m 0 w d x w2 sub y m w 0 d s} def
/m5 {mp x w2 sub y w2 sub m w w d x w2 sub y w2 add m w w neg d s} def
/reencdict 24 dict def /ReEncode {reencdict begin /nco&na exch def
/nfnam exch def /basefontname exch def /basefontdict basefontname findfont def
/newfont basefontdict maxlength dict def basefontdict {exch dup /FID ne
{dup /Encoding eq {exch dup length array copy newfont 3 1 roll put} {exch
newfont 3 1 roll put} ifelse} {pop pop} ifelse } forall newfont
/FontName nfnam put nco&na aload pop nco&na length 2 idiv {newfont
/Encoding get 3 1 roll put} repeat nfnam newfont definefont pop end } def
/accvec [ 176 /agrave 181 /Agrave 190 /acircumflex 192 /Acircumflex
201 /adieresis 204 /Adieresis 209 /ccedilla 210 /Ccedilla 211 /eacute
212 /Eacute 213 /egrave 214 /Egrave 215 /ecircumflex 216 /Ecircumflex
217 /edieresis 218 /Edieresis 219 /icircumflex 220 /Icircumflex
221 /idieresis 222 /Idieresis 223 /ntilde 224 /Ntilde 226 /ocircumflex
228 /Ocircumflex 229 /odieresis 230 /Odieresis 231 /ucircumflex 236 /Ucircumflex
237 /udieresis 238 /Udieresis 239 /aring 242 /Aring 243 /ydieresis
244 /Ydieresis 246 /aacute 247 /Aacute 252 /ugrave 253 /Ugrave] def
/Times-Roman /Times-Roman accvec ReEncode
/Times-Italic /Times-Italic accvec ReEncode
/Times-Bold /Times-Bold accvec ReEncode
/Times-BoldItalic /Times-BoldItalic accvec ReEncode
/Helvetica /Helvetica accvec ReEncode
/Helvetica-Oblique /Helvetica-Oblique accvec ReEncode
/Helvetica-Bold /Helvetica-Bold accvec ReEncode
/Helvetica-BoldOblique /Helvetica-BoldOblique  accvec ReEncode
/Courier /Courier accvec ReEncode
/Courier-Oblique /Courier-Oblique accvec ReEncode
/Courier-Bold /Courier-Bold accvec ReEncode
/Courier-BoldOblique /Courier-BoldOblique accvec ReEncode
/oshow {gsave [] 0 sd true charpath stroke gr} def
/stwn { /fs exch def /fn exch def /text exch def fn findfont fs sf
 text sw pop xs add /xs exch def} def
/stwb { /fs exch def /fn exch def /nbas exch def /textf exch def
textf length /tlen exch def nbas tlen gt {/nbas tlen  def} if
fn findfont fs sf textf dup length nbas sub nbas getinterval sw
pop neg xs add /xs exch def} def
/accspe [ 65 /plusminus 66 /bar 67 /existential 68 /universal
69 /exclam 70 /numbersign 71 /greater 72 /question 73 /integral
74 /colon 75 /semicolon 76 /less 77 /bracketleft 78 /bracketright
79 /greaterequal 80 /braceleft 81 /braceright 82 /radical
83 /spade 84 /heart 85 /diamond 86 /club 87 /lessequal
88 /multiply 89 /percent 90 /infinity 48 /circlemultiply 49 /circleplus
50 /emptyset 51 /lozenge 52 /bullet 53 /arrowright 54 /arrowup
55 /arrowleft 56 /arrowdown 57 /arrowboth 48 /degree 44 /comma 43 /plus
 45 /angle 42 /angleleft 47 /divide 61 /notequal 40 /equivalence 41 /second
 97 /approxequal 98 /congruent 99 /perpendicular 100 /partialdiff 101 /florin
 102 /intersection 103 /union 104 /propersuperset 105 /reflexsuperset
 106 /notsubset 107 /propersubset 108 /reflexsubset 109 /element 110 /notelement
 111 /gradient 112 /logicaland 113 /logicalor 114 /arrowdblboth
 115 /arrowdblleft 116 /arrowdblup 117 /arrowdblright 118 /arrowdbldown
 119 /ampersand 120 /omega1 121 /similar 122 /aleph ] def
/Symbol /Special accspe ReEncode
%%EndProlog
%%BeginSetup
newpath  gsave  .25 .25 scale 
%%EndSetup
 gsave 0 0 t black [] 0 sd 1 lw 4 lw 2267 1660 340 340 bl 2720 2114 0 0 C 1757
 1054 m 162 X s 2720 2720 0 -303 C 1757 1170 m 27 X s 1811 1170 m 27 X s 1865
 1170 m 28 X s 2720 2114 0 0 C
 gsave  1757 1834
 t   0 r 0 0 m
 /Symbol findfont   77 sf 0    0 m 
(s)
 show 
 currentpoint pop 0 t 
 /Times-Roman findfont   77 sf 0    0 m 
(\(pp\040)
 show 
 currentpoint pop 0 t 
 /Special findfont   77 sf 0    0 m 
(5)
 show 
 currentpoint pop 0 t 
 /Times-Roman findfont   77 sf 0    0 m 
( tt)
 show 
 currentpoint pop 0 t 
/Times-Roman findfont   77 sf 
( tt)
 dup length 1 sub 1 getinterval 
 stringwidth pop 2 div neg    0 rm 
 /Times-Roman findfont   54 sf 0   54 rm 
(_\040)
 stringwidth pop 2 div neg 0 rm 
(_\040)
 show
 /Times-Roman findfont   77 sf 0    0 m 
(H + X\)\040)
 show 
 currentpoint pop 0 t 
 /Special findfont   77 sf 0    0 m 
(M)
 show 
 currentpoint pop 0 t 
 /Times-Roman findfont   77 sf 0    0 m 
(fb)
 show 
 currentpoint pop 0 t 
 /Special findfont   77 sf 0    0 m 
(N)
 show 
 gsave  gr  gr 
 gsave  1757 1718
 t   0 r 0 0 m
 /Special findfont   77 sf 0    0 m 
(R)
 show 
 currentpoint pop 0 t 
 /Times-Roman findfont   77 sf 0    0 m 
(s = 7 TeV)
 show 
 gr 
 gsave  1757 1602
 t   0 r 0 0 m
 /Symbol findfont   77 sf 0    0 m 
(m)
 show 
 currentpoint pop 0 t 
 /Times-Roman findfont   77 sf 0    0 m 
( = m)
 show 
 currentpoint pop 0 t 
 /Times-Roman findfont   54 sf 0  -26 m 
(t)
 show 
 currentpoint pop 0 t 
 /Times-Roman findfont   77 sf 0    0 m 
( + M)
 show 
 currentpoint pop 0 t 
 /Times-Roman findfont   54 sf 0  -26 m 
(H)
 show 
 currentpoint pop 0 t 
 /Times-Roman findfont   77 sf 0    0 m 
(/2)
 show 
 gr 
 gsave  1951 1037
 t   0 r 0 0 m
 /Times-Roman findfont   77 sf 0    0 m 
(NLO)
 show 
 gr 
 gsave  1951 1154
 t   0 r 0 0 m
 /Times-Roman findfont   77 sf 0    0 m 
(LO)
 show 
 gr  1 0 0 c
 gsave  1757 1486
 t   0 r 0 0 m
 /Times-Roman findfont   77 sf 0    0 m 
(MSTW2008)
 show 
 gr  0 0 1 c
 gsave  1757 1369
 t   0 r 0 0 m
 /Times-Roman findfont   77 sf 0    0 m 
(CTEQ6.6)
 show 
 gr  black
 gsave  1757 1253
 t   0 r 0 0 m
 /Times-Roman findfont   77 sf 0    0 m 
(NNPDF 2.0)
 show 
 gr 
 /xs 0 def 
(M)
 /Times-Roman     77 stwn 
(H)
 /Times-Roman     54 stwn 
(\040)
 /Times-Roman     77 stwn 
(M)
 /Special     77 stwn 
(GeV)
 /Times-Roman     77 stwn 
(N)
 /Special     77 stwn 
 gsave  1473 124
 t   0 r  xs 2 div neg 0 t 0 0 m
 /Times-Roman findfont   77 sf 0    0 m 
(M)
 show 
 currentpoint pop 0 t 
 /Times-Roman findfont   54 sf 0  -26 m 
(H)
 show 
 currentpoint pop 0 t 
 /Times-Roman findfont   77 sf 0    0 m 
(\040)
 show 
 currentpoint pop 0 t 
 /Special findfont   77 sf 0    0 m 
(M)
 show 
 currentpoint pop 0 t 
 /Times-Roman findfont   77 sf 0    0 m 
(GeV)
 show 
 currentpoint pop 0 t 
 /Special findfont   77 sf 0    0 m 
(N)
 show 
 gr  2267 1660 340 340 C NC 1 lw 340 340 m 1660 Y s 4 lw 357 426 m -17 X s 357
 496 m -17 X s 357 555 m -17 X s 357 607 m -17 X s 357 652 m -17 X s 374 692 m
 -34 X s
 /xs 0 def 
(10)
 /Times-Roman     77 stwn 
 gsave  249 667
 t   0 r  xs neg 0 t 0 0 m
 /Times-Roman findfont   77 sf 0    0 m 
(10)
 show 
 gr  357 959 m -17 X s 357 1115 m -17 X s 357 1225 m -17 X s 357 1311 m -17 X s
 357 1381 m -17 X s 357 1441 m -17 X s 357 1492 m -17 X s 357 1537 m -17 X s 374
 1578 m -34 X s
 /xs 0 def 
(10)
 /Times-Roman     77 stwn 
 gsave  249 1552
 t   0 r  xs neg 0 t 0 0 m
 /Times-Roman findfont   77 sf 0    0 m 
(10)
 show 
 gr 
 /xs 0 def 
(2)
 /Times-Roman     61 stwn 
 gsave  300 1589
 t   0 r  xs neg 0 t 0 0 m
 /Times-Roman findfont   61 sf 0    0 m 
(2)
 show 
 gr  357 1844 m -17 X s 357 2000 m -17 X s 1 lw 340 340 m 2267 X s 4 lw 448 374
 m -34 Y s 502 357 m -17 Y s 556 357 m -17 Y s 610 357 m -17 Y s 664 357 m -17 Y
 s 718 374 m -34 Y s 772 357 m -17 Y s 826 357 m -17 Y s 880 357 m -17 Y s 934
 357 m -17 Y s 988 374 m -34 Y s 1042 357 m -17 Y s 1096 357 m -17 Y s 1150 357
 m -17 Y s 1203 357 m -17 Y s 1257 374 m -34 Y s 1311 357 m -17 Y s 1365 357 m
 -17 Y s 1419 357 m -17 Y s 1473 357 m -17 Y s 1527 374 m -34 Y s 1581 357 m -17
 Y s 1635 357 m -17 Y s 1689 357 m -17 Y s 1743 357 m -17 Y s 1797 374 m -34 Y s
 1851 357 m -17 Y s 1905 357 m -17 Y s 1959 357 m -17 Y s 2013 357 m -17 Y s
 2067 374 m -34 Y s 2121 357 m -17 Y s 2175 357 m -17 Y s 2229 357 m -17 Y s
 2283 357 m -17 Y s 2337 374 m -34 Y s 2391 357 m -17 Y s 2445 357 m -17 Y s
 2499 357 m -17 Y s 2553 357 m -17 Y s 2607 374 m -34 Y s 448 374 m -34 Y s 394
 357 m -17 Y s
 /xs 0 def 
(100)
 /Times-Roman     77 stwn 
 gsave  448 255
 t   0 r  xs 2 div neg 0 t 0 0 m
 /Times-Roman findfont   77 sf 0    0 m 
(100)
 show 
 gr 
 /xs 0 def 
(125)
 /Times-Roman     77 stwn 
 gsave  718 255
 t   0 r  xs 2 div neg 0 t 0 0 m
 /Times-Roman findfont   77 sf 0    0 m 
(125)
 show 
 gr 
 /xs 0 def 
(150)
 /Times-Roman     77 stwn 
 gsave  988 255
 t   0 r  xs 2 div neg 0 t 0 0 m
 /Times-Roman findfont   77 sf 0    0 m 
(150)
 show 
 gr 
 /xs 0 def 
(175)
 /Times-Roman     77 stwn 
 gsave  1257 255
 t   0 r  xs 2 div neg 0 t 0 0 m
 /Times-Roman findfont   77 sf 0    0 m 
(175)
 show 
 gr 
 /xs 0 def 
(200)
 /Times-Roman     77 stwn 
 gsave  1527 255
 t   0 r  xs 2 div neg 0 t 0 0 m
 /Times-Roman findfont   77 sf 0    0 m 
(200)
 show 
 gr 
 /xs 0 def 
(225)
 /Times-Roman     77 stwn 
 gsave  1797 255
 t   0 r  xs 2 div neg 0 t 0 0 m
 /Times-Roman findfont   77 sf 0    0 m 
(225)
 show 
 gr 
 /xs 0 def 
(250)
 /Times-Roman     77 stwn 
 gsave  2067 255
 t   0 r  xs 2 div neg 0 t 0 0 m
 /Times-Roman findfont   77 sf 0    0 m 
(250)
 show 
 gr 
 /xs 0 def 
(275)
 /Times-Roman     77 stwn 
 gsave  2337 255
 t   0 r  xs 2 div neg 0 t 0 0 m
 /Times-Roman findfont   77 sf 0    0 m 
(275)
 show 
 gr 
 /xs 0 def 
(300)
 /Times-Roman     77 stwn 
 gsave  2607 255
 t   0 r  xs 2 div neg 0 t 0 0 m
 /Times-Roman findfont   77 sf 0    0 m 
(300)
 show 
 gr  2267 1660 340 340 C NC 1 lw 2607 340 m 1660 Y s 4 lw 2590 426 m 17 X s 2590
 496 m 17 X s 2590 555 m 17 X s 2590 607 m 17 X s 2590 652 m 17 X s 2573 692 m
 34 X s 2590 959 m 17 X s 2590 1115 m 17 X s 2590 1225 m 17 X s 2590 1311 m 17 X
 s 2590 1381 m 17 X s 2590 1441 m 17 X s 2590 1492 m 17 X s 2590 1537 m 17 X s
 2573 1578 m 34 X s 2590 1844 m 17 X s 2590 2000 m 17 X s 1 lw 340 2000 m 2267 X
 s 4 lw 448 1966 m 34 Y s 502 1983 m 17 Y s 556 1983 m 17 Y s 610 1983 m 17 Y s
 664 1983 m 17 Y s 718 1966 m 34 Y s 772 1983 m 17 Y s 826 1983 m 17 Y s 880
 1983 m 17 Y s 934 1983 m 17 Y s 988 1966 m 34 Y s 1042 1983 m 17 Y s 1096 1983
 m 17 Y s 1150 1983 m 17 Y s 1203 1983 m 17 Y s 1257 1966 m 34 Y s 1311 1983 m
 17 Y s 1365 1983 m 17 Y s 1419 1983 m 17 Y s 1473 1983 m 17 Y s 1527 1966 m 34
 Y s 1581 1983 m 17 Y s 1635 1983 m 17 Y s 1689 1983 m 17 Y s 1743 1983 m 17 Y s
 1797 1966 m 34 Y s 1851 1983 m 17 Y s 1905 1983 m 17 Y s 1959 1983 m 17 Y s
 2013 1983 m 17 Y s 2067 1966 m 34 Y s 2121 1983 m 17 Y s 2175 1983 m 17 Y s
 2229 1983 m 17 Y s 2283 1983 m 17 Y s 2337 1966 m 34 Y s 2391 1983 m 17 Y s
 2445 1983 m 17 Y s 2499 1983 m 17 Y s 2553 1983 m 17 Y s 2607 1966 m 34 Y s 448
 1966 m 34 Y s 394 1983 m 17 Y s 2267 1660 340 340 C 1 0 0 c 340 1889 m 54 -53 d
 54 -53 d 54 -52 d 54 -50 d 54 -49 d 54 -49 d 54 -47 d 54 -46 d 54 -45 d 54 -44
 d 54 -43 d 54 -42 d 54 -41 d 54 -40 d 54 -40 d 53 -38 d 54 -38 d 54 -37 d 54
 -36 d 54 -34 d 54 -35 d 54 -34 d 108 -64 d 108 -62 d 108 -59 d 108 -57 d 108
 -53 d 108 -52 d 108 -48 d 108 -46 d 108 -46 d 108 -42 d s 0 0 1 c 340 1863 m 54
 -54 d 54 -53 d 54 -51 d 54 -50 d 54 -49 d 54 -48 d 54 -47 d 54 -46 d 54 -45 d
 54 -44 d 54 -43 d 54 -42 d 54 -41 d 54 -40 d 54 -39 d 53 -39 d 54 -37 d 54 -37
 d 54 -36 d 54 -35 d 54 -34 d 54 -33 d 108 -65 d 108 -61 d 108 -58 d 108 -56 d
 108 -52 d 108 -50 d 108 -49 d 108 -46 d 108 -43 d 108 -42 d s black 340 1883 m
 54 -54 d 54 -54 d 54 -52 d 54 -51 d 54 -50 d 54 -48 d 54 -48 d 54 -46 d 54 -45
 d 54 -45 d 54 -43 d 54 -43 d 54 -42 d 54 -40 d 54 -40 d 53 -39 d 54 -38 d 54
 -37 d 54 -36 d 54 -36 d 54 -35 d 54 -33 d 108 -66 d 108 -62 d 108 -59 d 108 -56
 d 108 -54 d 108 -51 d 108 -49 d 108 -47 d 108 -44 d 108 -43 d s 2720 2720 0
 -303 C 1 0 0 c 340 1869 m 20 -19 d s 379 1831 m 15 -14 d s 394 1817 m 5 -5 d s
 418 1793 m 20 -18 d s 458 1756 m 20 -18 d s 498 1719 m 4 -3 d s 502 1716 m 16
 -15 d s 538 1683 m 18 -16 d s 556 1667 m 3 -2 d s 579 1647 m 20 -18 d s 620
 1611 m 20 -18 d s 661 1575 m 3 -2 d s 664 1573 m 18 -15 d s 703 1540 m 15 -13 d
 s 718 1527 m 5 -4 d s 744 1505 m 21 -17 d s 786 1471 m 22 -17 d s 829 1437 m 21
 -17 d s 872 1403 m 8 -6 d s 880 1397 m 13 -11 d s 914 1370 m 20 -15 d s 934
 1355 m 2 -2 d s 958 1337 m 21 -17 d s 1001 1304 m 22 -16 d s 1045 1272 m 22 -16
 d s 1089 1240 m 7 -5 d s 1096 1235 m 15 -11 d s 1133 1208 m 17 -12 d s 1150
 1196 m 5 -4 d s 1178 1177 m 22 -16 d s 1222 1146 m 23 -16 d s 1268 1115 m 22
 -15 d s 1313 1085 m 23 -15 d s 1358 1055 m 7 -4 d s 1365 1051 m 16 -11 d s 1404
 1026 m 15 -10 d s 1419 1016 m 8 -5 d s 1450 997 m 23 -15 d s 1496 968 m 23 -14
 d s 1543 940 m 23 -14 d s 1589 912 m 24 -14 d s 1636 884 m 24 -13 d s 1683 857
 m 24 -13 d s 1731 830 m 12 -7 d s 1743 823 m 11 -6 d s 1778 804 m 24 -13 d s
 1826 778 m 24 -14 d s 1874 752 m 24 -13 d s 1922 726 m 24 -12 d s 1970 701 m 24
 -12 d s 2019 677 m 24 -13 d s 2067 652 m 25 -12 d s 2116 628 m 24 -12 d s 2165
 604 m 10 -5 d s 2175 599 m 14 -6 d s 2214 581 m 25 -11 d s 2263 558 m 20 -9 d s
 2283 549 m 5 -2 d s 2313 536 m 25 -12 d s 2363 513 m 24 -11 d s 2412 491 m 25
 -11 d s 2462 470 m 25 -11 d s 2512 448 m 25 -10 d s 2562 427 m 25 -10 d s 2267
 1660 340 340 C 2720 2720 0 -303 C 0 0 1 c 340 1791 m 19 -19 d s 379 1753 m 15
 -14 d s 394 1739 m 5 -5 d s 418 1716 m 20 -19 d s 458 1678 m 20 -18 d s 498
 1641 m 4 -4 d s 502 1637 m 16 -14 d s 538 1605 m 18 -16 d s 556 1589 m 2 -3 d s
 579 1568 m 20 -18 d s 619 1533 m 21 -18 d s 661 1497 m 3 -3 d s 664 1494 m 17
 -15 d s 702 1462 m 16 -13 d s 718 1449 m 5 -5 d s 744 1427 m 21 -17 d s 786
 1392 m 21 -17 d s 828 1358 m 21 -17 d s 871 1324 m 9 -7 d s 880 1317 m 12 -9 d
 s 914 1291 m 20 -16 d s 934 1275 m 1 -1 d s 957 1258 m 21 -17 d s 1000 1225 m
 22 -16 d s 1044 1193 m 22 -16 d s 1088 1161 m 8 -6 d s 1096 1155 m 14 -10 d s
 1132 1129 m 18 -13 d s 1150 1116 m 4 -3 d s 1177 1097 m 22 -15 d s 1221 1066 m
 23 -15 d s 1266 1036 m 23 -15 d s 1311 1005 m s 1311 1005 m 23 -14 d s 1357 976
 m 8 -6 d s 1365 970 m 15 -9 d s 1402 946 m 17 -11 d s 1419 935 m 6 -4 d s 1448
 917 m 23 -15 d s 1494 888 m 24 -14 d s 1541 860 m 23 -14 d s 1587 832 m 24 -14
 d s 1634 804 m 1 -1 d s 1635 803 m 23 -13 d s 1681 776 m 24 -13 d s 1728 749 m
 15 -9 d s 1743 740 m 9 -5 d s 1776 722 m 23 -13 d s 1823 696 m 24 -13 d s 1871
 670 m 24 -13 d s 1919 644 m 24 -13 d s 1967 619 m 24 -13 d s 2015 594 m 25 -13
 d s 2064 569 m 3 -2 d s 2067 567 m 21 -10 d s 2113 545 m 24 -12 d s 2161 521 m
 14 -7 d s 2175 514 m 11 -5 d s 2210 497 m 25 -12 d s 2259 474 m 24 -11 d s 2283
 463 m 1 -1 d s 2309 451 m 24 -12 d s 2358 428 m 25 -11 d s 2408 406 m 24 -12 d
 s 2457 383 m 25 -11 d s 2507 361 m 25 -10 d s 2557 340 m cl s 2267 1660 340 340
 C
 gr  gr 
showpage
end
%%EOF
