%!PS-Adobe-2.0 EPSF-2.0
%%BoundingBox:  0 0 567 384
%%Title: : c1
%%Creator: ROOT Version 5.24/00
%%CreationDate: Tue Nov 30 15:31:47 2010
%%EndComments
%%BeginProlog
80 dict begin
/s {stroke} def /l {lineto} def /m {moveto} def /t {translate} def
/sw {stringwidth} def /r {rotate} def /rl {roll}  def /R {repeat} def
/d {rlineto} def /rm {rmoveto} def /gr {grestore} def /f {eofill} def
/c {setrgbcolor} def /black {0 setgray} def /sd {setdash} def
/cl {closepath} def /sf {scalefont setfont} def /lw {setlinewidth} def
/box {m dup 0 exch d exch 0 d 0 exch neg d cl} def
/NC{systemdict begin initclip end}def/C{NC box clip newpath}def
/bl {box s} def /bf {box f} def /Y { 0 exch d} def /X { 0 d} def 
/mp {newpath /y exch def /x exch def} def
/side {[w .77 mul w .23 mul] .385 w mul sd w 0 l currentpoint t -144 r} def
/mr {mp x y w2 0 360 arc} def /m24 {mr s} def /m20 {mr f} def
/mb {mp x y w2 add m w2 neg 0 d 0 w neg d w 0 d 0 w d cl} def
/mt {mp x y w2 add m w2 neg w neg d w 0 d cl} def
/m21 {mb f} def /m25 {mb s} def /m22 {mt f} def /m26{mt s} def
/m23 {mp x y w2 sub m w2 w d w neg 0 d cl f} def
/m27 {mp x y w2 add m w3 neg w2 neg d w3 w2 neg d w3 w2 d cl s} def
/m28 {mp x w2 sub y w2 sub w3 add m w3 0 d  0 w3 neg d w3 0 d 0 w3 d w3 0 d  0 w3 d w3 neg 0 d 0 w3 d w3 neg 0 d
 0 w3 neg d w3 neg 0 d cl s } def
/m29 {mp gsave x w2 sub y w2 add w3 sub m currentpoint t
 4 {side} repeat cl fill gr} def
/m30 {mp gsave x w2 sub y w2 add w3 sub m currentpoint t
 4 {side} repeat cl s gr} def
/m31 {mp x y w2 sub m 0 w d x w2 sub y m w 0 d x w2 sub y w2 add m w w neg d x w2 sub y w2
 sub m w w d s} def
/m2 {mp x y w2 sub m 0 w d x w2 sub y m w 0 d s} def
/m5 {mp x w2 sub y w2 sub m w w d x w2 sub y w2 add m w w neg d s} def
/reEncode {exch findfont dup length dict begin {1 index /FID eq  {pop pop} {def} ifelse } forall /Encoding exch def currentdict end dup /FontName get exch definefont pop } def [/Times-Bold /Times-Italic /Times-BoldItalic /Helvetica
 /Helvetica-Oblique /Helvetica-Bold /Helvetica-BoldOblique /Courier /Courier-Oblique /Courier-Bold /Courier-BoldOblique /Times-Roman /AvantGarde-Book /AvantGarde-BookOblique /AvantGarde-Demi /AvantGarde-DemiOblique /Bookman-Demi
 /Bookman-DemiItalic /Bookman-Light /Bookman-LightItalic /Helvetica-Narrow /Helvetica-Narrow-Bold /Helvetica-Narrow-BoldOblique /Helvetica-Narrow-Oblique /NewCenturySchlbk-Roman /NewCenturySchlbk-Bold
 /NewCenturySchlbk-BoldItalic /NewCenturySchlbk-Italic /Palatino-Bold /Palatino-BoldItalic /Palatino-Italic /Palatino-Roman ] {ISOLatin1Encoding reEncode } forall
/oshow {gsave [] 0 sd true charpath stroke gr} def
/stwn { /fs exch def /fn exch def /text exch def fn findfont fs sf
 text sw pop xs add /xs exch def} def
/stwb { /fs exch def /fn exch def /nbas exch def /textf exch deftextf length /tlen exch def nbas tlen gt {/nbas tlendef} iffn findfont fs sf textf dup length nbas sub nbas getinterval sw
pop neg xs add /xs exch def} def
%%EndProlog
%%BeginSetup
%%EndSetup
newpath  gsave  .25 .25 scale  gsave  0 0 t black[  ] 0 sd 3 lw 1 1 1 c 2268 1538 0 0 bf black 1 1 1 c 1791 1215 363 246 bf black 1791 1215 363 246 bl 1 1 1 c 1791 1215 363 246 bf black 1791 1215 363 246 bl 363 246 m 1791 X s
 gsave  2268 1538 0 0 C 1955 117 t 0 r /Helvetica findfont 71.6807 sf 0 0 m ( [GeV]) show NC gr 
 gsave  2268 1538 0 0 C 1922 98 t 0 r /Helvetica findfont 48.8732 sf 0 0 m (H) show NC gr 
 gsave  2268 1538 0 0 C 1867 117 t 0 r /Helvetica findfont 71.6807 sf 0 0 m (M) show NC gr  401 283 m -37 Y s 439 264 m -18 Y s 477 264 m -18 Y s 515 264 m -18 Y s 553 264 m -18 Y s 592 283 m -37 Y s 630 264 m -18 Y s 668 264 m -18 Y s 706 264 m -18
 Y s 744 264 m -18 Y s 782 283 m -37 Y s 820 264 m -18 Y s 858 264 m -18 Y s 896 264 m -18 Y s 935 264 m -18 Y s 973 283 m -37 Y s 1011 264 m -18 Y s 1049 264 m -18 Y s 1087 264 m -18 Y s 1125 264 m -18 Y s 1163 283 m -37 Y s 1201 264 m -18 Y s 1240
 264 m -18 Y s 1278 264 m -18 Y s 1316 264 m -18 Y s 1354 283 m -37 Y s 1392 264 m -18 Y s 1430 264 m -18 Y s 1468 264 m -18 Y s 1506 264 m -18 Y s 1544 283 m -37 Y s 1583 264 m -18 Y s 1621 264 m -18 Y s 1659 264 m -18 Y s 1697 264 m -18 Y s 1735
 283 m -37 Y s 1773 264 m -18 Y s 1811 264 m -18 Y s 1849 264 m -18 Y s 1888 264 m -18 Y s 1926 283 m -37 Y s 1964 264 m -18 Y s 2002 264 m -18 Y s 2040 264 m -18 Y s 2078 264 m -18 Y s 2116 283 m -37 Y s 401 283 m -37 Y s 363 264 m -18 Y s 2116 283
 m -37 Y s
 gsave  2268 1538 0 0 C 342 179 t 0 r /Helvetica findfont 71.6807 sf 0 0 m (100) show NC gr 
 gsave  2268 1538 0 0 C 531 179 t 0 r /Helvetica findfont 71.6807 sf 0 0 m (200) show NC gr 
 gsave  2268 1538 0 0 C 723 179 t 0 r /Helvetica findfont 71.6807 sf 0 0 m (300) show NC gr 
 gsave  2268 1538 0 0 C 912 179 t 0 r /Helvetica findfont 71.6807 sf 0 0 m (400) show NC gr 
 gsave  2268 1538 0 0 C 1105 179 t 0 r /Helvetica findfont 71.6807 sf 0 0 m (500) show NC gr 
 gsave  2268 1538 0 0 C 1294 179 t 0 r /Helvetica findfont 71.6807 sf 0 0 m (600) show NC gr 
 gsave  2268 1538 0 0 C 1486 179 t 0 r /Helvetica findfont 71.6807 sf 0 0 m (700) show NC gr 
 gsave  2268 1538 0 0 C 1675 179 t 0 r /Helvetica findfont 71.6807 sf 0 0 m (800) show NC gr 
 gsave  2268 1538 0 0 C 1867 179 t 0 r /Helvetica findfont 71.6807 sf 0 0 m (900) show NC gr 
 gsave  2268 1538 0 0 C 2036 179 t 0 r /Helvetica findfont 71.6807 sf 0 0 m (1000) show NC gr  363 1461 m 1791 X s 401 1425 m 36 Y s 439 1443 m 18 Y s 477 1443 m 18 Y s 515 1443 m 18 Y s 553 1443 m 18 Y s 592 1425 m 36 Y s 630 1443 m 18 Y s 668 1443
 m 18 Y s 706 1443 m 18 Y s 744 1443 m 18 Y s 782 1425 m 36 Y s 820 1443 m 18 Y s 858 1443 m 18 Y s 896 1443 m 18 Y s 935 1443 m 18 Y s 973 1425 m 36 Y s 1011 1443 m 18 Y s 1049 1443 m 18 Y s 1087 1443 m 18 Y s 1125 1443 m 18 Y s 1163 1425 m 36 Y s
 1201 1443 m 18 Y s 1240 1443 m 18 Y s 1278 1443 m 18 Y s 1316 1443 m 18 Y s 1354 1425 m 36 Y s 1392 1443 m 18 Y s 1430 1443 m 18 Y s 1468 1443 m 18 Y s 1506 1443 m 18 Y s 1544 1425 m 36 Y s 1583 1443 m 18 Y s 1621 1443 m 18 Y s 1659 1443 m 18 Y s
 1697 1443 m 18 Y s 1735 1425 m 36 Y s 1773 1443 m 18 Y s 1811 1443 m 18 Y s 1849 1443 m 18 Y s 1888 1443 m 18 Y s 1926 1425 m 36 Y s 1964 1443 m 18 Y s 2002 1443 m 18 Y s 2040 1443 m 18 Y s 2078 1443 m 18 Y s 2116 1425 m 36 Y s 401 1425 m 36 Y s
 363 1443 m 18 Y s 2116 1425 m 36 Y s 363 246 m 1215 Y s
 gsave  2268 1538 0 0 C 235 740 t 90 r /Helvetica findfont 71.6807 sf 0 0 m (VBF Cross Section [fb]) show NC gr  390 272 m -27 X s 417 296 m -54 X s
 gsave  2268 1538 0 0 C 342 266 t 0 r  -79 0 t /Helvetica findfont 71.6807 sf 0 0 m (10) show NC gr  390 450 m -27 X s 390 540 m -27 X s 390 604 m -27 X s 390 653 m -27 X s 390 694 m -27 X s 390 728 m -27 X s 390 757 m -27 X s 390 784 m -27 X s 417
 807 m -54 X s
 gsave  2268 1538 0 0 C 316 805 t 0 r /Helvetica findfont 48.8732 sf 0 0 m (2) show NC gr 
 gsave  2268 1538 0 0 C 238 775 t 0 r /Helvetica findfont 71.6807 sf 0 0 m (10) show NC gr  390 961 m -27 X s 390 1051 m -27 X s 390 1115 m -27 X s 390 1164 m -27 X s 390 1205 m -27 X s 390 1239 m -27 X s 390 1269 m -27 X s 390 1295 m -27 X s 417
 1318 m -54 X s
 gsave  2268 1538 0 0 C 316 1320 t 0 r /Helvetica findfont 48.8732 sf 0 0 m (3) show NC gr 
 gsave  2268 1538 0 0 C 238 1287 t 0 r /Helvetica findfont 71.6807 sf 0 0 m (10) show NC gr  2154 246 m 1215 Y s 2127 272 m 27 X s 2101 296 m 53 X s 2127 450 m 27 X s 2127 540 m 27 X s 2127 604 m 27 X s 2127 653 m 27 X s 2127 694 m 27 X s 2127 728 m
 27 X s 2127 757 m 27 X s 2127 784 m 27 X s 2101 807 m 53 X s 2127 961 m 27 X s 2127 1051 m 27 X s 2127 1115 m 27 X s 2127 1164 m 27 X s 2127 1205 m 27 X s 2127 1239 m 27 X s 2127 1269 m 27 X s 2127 1295 m 27 X s 2101 1318 m 53 X s 0.4 0.4 0.8 c 0.4
 0.8 0.4 c 0.4 0.4 0.8 c 401 1412 m 19 -22 d 19 -21 d 19 -21 d 19 -21 d 19 -20 d 19 -21 d 19 -16 d 19 -20 d 19 -16 d 20 -19 d 19 -18 d 19 -18 d 19 -18 d 19 -17 d 19 -16 d 19 -17 d 19 -16 d 19 -16 d 19 -16 d 19 -15 d 38 -30 d 38 -31 d 38 -28 d 39 -25
 d 38 -24 d 190 -119 d 191 -112 d 190 -103 d 191 -96 d 191 -89 d 190 -84 d s 0.4 0.8 0.4 c 0.4 0.4 0.8 c 1 lw << /PatternType 1 /PaintType 2 /TilingType 1 /BBox [ 0 0 100 100 ] /XStep 98 /YStep 4 /PaintProc { begin gsave
 [1] 0 sd 2 4 m 99 4 l s 1 3 m 98 3 l s 2 2 m 99 2 l s 1 1 m 98 1 l s gr end } >> [ 4.0 0 0 4.0 0 0 ] makepattern /P01 exch def /cs {[/Pattern /DeviceRGB] setcolorspace} def /FA {f [/DeviceRGB] setcolorspace} def cs 0.4 0.4 0.8 P01 setcolor 401 1416
 m 19 -22 d 19 -21 d 19 -22 d 19 -20 d 19 -20 d 19 -21 d 19 -16 d 19 -20 d 19 -16 d 20 -19 d 19 -18 d 19 -18 d 19 -17 d 19 -18 d 19 -16 d 19 -17 d 19 -16 d 19 -16 d 19 -15 d 19 -16 d 38 -30 d 38 -31 d 38 -28 d 39 -24 d 38 -25 d 190 -119 d 191 -111 d
 190 -103 d 191 -96 d 191 -89 d 190 -83 d -13 Y -190 83 d -191 90 d -191 96 d -190 103 d -191 112 d -190 119 d -38 25 d -39 25 d -38 28 d -38 30 d -38 31 d -19 15 d -19 16 d -19 16 d -19 16 d -19 17 d -19 16 d -19 17 d -19 18 d -19 18 d -19 18 d -20
 19 d -19 17 d -19 20 d -19 16 d -19 20 d -19 20 d -19 21 d -19 21 d -19 22 d -19 22 d FA 3 lw 0 0.6 0 c 382 1447 m 9 -10 d 10 -12 d 9 -11 d 10 -11 d 10 -11 d 9 -11 d 10 -10 d 9 -11 d 10 -11 d 9 -10 d 10 -10 d 9 -10 d 10 -10 d 9 -9 d 10 -10 d 9 -9 d
 10 -10 d 9 -9 d 10 -10 d 9 -9 d 10 -9 d 10 -9 d 19 -17 d 19 -17 d 19 -17 d 19 -17 d 19 -17 d 19 -16 d 19 -16 d 19 -15 d 19 -16 d 19 -15 d 38 -30 d 38 -29 d 38 -28 d 39 -28 d 38 -27 d 95 -64 d 95 -62 d 96 -60 d 95 -58 d 95 -55 d 95 -54 d 96 -53 d 95
 -51 d 95 -51 d 96 -50 d 95 -47 d 95 -48 d s 382 1451 m 9 -10 d 10 -12 d 9 -11 d 10 -11 d 10 -11 d 9 -11 d 10 -10 d 9 -11 d 10 -11 d 9 -10 d 10 -10 d 9 -10 d 10 -10 d 9 -9 d 10 -10 d 9 -9 d 10 -10 d 9 -9 d 10 -10 d 9 -8 d 10 -9 d 10 -9 d 19 -18 d 19
 -17 d 19 -17 d 19 -17 d 19 -16 d 19 -17 d 19 -15 d 19 -16 d 19 -15 d 19 -15 d 38 -30 d 38 -29 d 38 -28 d 39 -28 d 38 -27 d 95 -65 d 95 -61 d 96 -60 d 95 -57 d 95 -56 d 95 -54 d 96 -53 d 95 -51 d 95 -50 d 96 -50 d 95 -47 d 95 -48 d -12 Y -95 48 d
 -95 47 d -96 50 d -95 51 d -95 51 d -96 53 d -95 54 d -95 56 d -95 57 d -96 60 d -95 62 d -95 65 d -38 28 d -39 27 d -38 28 d -38 29 d -38 30 d -19 16 d -19 15 d -19 16 d -19 15 d -19 17 d -19 16 d -19 17 d -19 17 d -19 17 d -19 18 d -10 9 d -10 9
 d -9 9 d -10 10 d -9 9 d -10 9 d -9 10 d -10 10 d -9 9 d -10 10 d -9 10 d -10 10 d -9 10 d -10 11 d -9 11 d -10 10 d -9 11 d -10 11 d -10 11 d -9 11 d -10 12 d -9 11 d f 0.8 0 0 c 382 1446 m 9 -11 d 10 -12 d 9 -11 d 10 -11 d 10 -11 d 9 -11 d 10 -10
 d 9 -11 d 10 -10 d 9 -11 d 10 -10 d 9 -10 d 10 -10 d 9 -9 d 10 -10 d 9 -10 d 10 -9 d 9 -9 d 10 -10 d 9 -9 d 10 -9 d 10 -9 d 19 -18 d 19 -17 d 19 -17 d 19 -17 d 19 -16 d 19 -17 d 19 -16 d 19 -15 d 19 -16 d 19 -15 d 38 -30 d 38 -29 d 38 -28 d 39 -28
 d 38 -27 d 38 -26 d 38 -26 d 38 -26 d 38 -25 d 38 -24 d 38 -25 d 39 -23 d 38 -24 d 38 -23 d 38 -23 d 95 -56 d 95 -54 d 96 -53 d 95 -51 d 95 -51 d 96 -50 d 95 -49 d 95 -48 d s 2115 267 m -9 -8 d s 2102 274 m -9 -9 d s 2089 280 m -8 -8 d s 2076 287 m
 -8 -9 d s 2064 293 m -9 -8 d s 2051 300 m -9 -9 d s 2038 306 m -9 -8 d s 2025 313 m -8 -9 d s 2012 319 m -8 -8 d s 2000 326 m -9 -9 d s 1987 332 m -8 -8 d s 1974 339 m -8 -9 d s 1961 345 m -8 -8 d s 1949 352 m -9 -9 d s 1936 358 m -8 -8 d s 1923
 365 m -8 -9 d s 1911 371 m -9 -8 d s 1898 378 m -8 -8 d s 1885 384 m -8 -8 d s 1873 391 m -9 -8 d s 1860 398 m -8 -9 d s 1847 404 m -8 -8 d s 1835 411 m -8 -8 d s 1822 417 m -8 -8 d s 1810 424 m -9 -8 d s 1797 431 m -8 -8 d s 1784 437 m -8 -8 d s
 1772 444 m -8 -8 d s 1759 451 m -8 -8 d s 1747 457 m -8 -8 d s 1734 464 m -8 -8 d s 1722 471 m -8 -8 d s 1709 478 m -8 -8 d s 1697 484 m -8 -8 d s 1684 491 m -8 -8 d s 1672 498 m -8 -8 d s 1659 505 m -8 -8 d s 1647 511 m -8 -8 d s 1634 518 m -8 -8
 d s 1622 525 m -8 -8 d s 1610 532 m -8 -8 d s 1597 539 m -8 -8 d s 1585 546 m -8 -8 d s 1572 553 m -7 -8 d s 1560 559 m -8 -7 d s 1548 566 m -8 -8 d s 1535 573 m -7 -8 d s 1523 580 m -8 -8 d s 1511 587 m -8 -8 d s 1499 594 m -8 -8 d s 1486 601 m -7
 -8 d s 1474 608 m -8 -8 d s 1462 615 m -8 -8 d s 1450 622 m -8 -8 d s 1437 629 m -7 -7 d s 1425 636 m -7 -7 d s 1413 643 m -8 -7 d s 1401 651 m -8 -8 d s 1389 658 m -8 -8 d s 1377 665 m -8 -8 d s 1365 672 m -8 -8 d s 1352 679 m -7 -8 d s 1340 686 m
 -7 -7 d s 1328 693 m -7 -7 d s 1316 701 m -7 -8 d s 1304 708 m -7 -8 d s 1292 715 m -7 -7 d s 1280 722 m -7 -7 d s 1268 730 m -7 -8 d s 1257 737 m -8 -7 d s 1245 744 m -8 -7 d s 1233 752 m -8 -8 d s 1221 759 m -7 -7 d s 1209 766 m -7 -7 d s 1197
 774 m -7 -7 d s 1185 781 m -7 -7 d s 1174 789 m -8 -7 d s 1162 796 m -7 -7 d s 1150 804 m -7 -7 d s 1139 811 m -8 -7 d s 1127 819 m -7 -7 d s 1115 827 m -7 -8 d s 1104 834 m -8 -7 d s 1092 842 m -7 -7 d s 1080 849 m -7 -7 d s 1069 857 m -7 -7 d s
 1057 865 m -7 -7 d s 1046 873 m -7 -7 d s 1034 880 m -7 -6 d s 1023 888 m -7 -7 d s 1012 896 m -7 -7 d s 1000 904 m -7 -7 d s 989 912 m -7 -7 d s 977 920 m -6 -7 d s 966 928 m -7 -7 d s 955 936 m -7 -7 d s 944 944 m -7 -7 d s 932 952 m -6 -7 d s
 921 960 m -6 -7 d s 910 968 m -7 -7 d s 899 976 m -7 -7 d s 888 984 m -7 -7 d s 877 992 m -7 -6 d s 866 1000 m -7 -6 d s 855 1009 m -7 -7 d s 844 1017 m -7 -6 d s 833 1025 m -7 -6 d s 822 1034 m -6 -7 d s 811 1042 m -6 -6 d s 800 1050 m -6 -6 d s
 789 1059 m -6 -6 d s 779 1067 m -6 -6 d s 768 1076 m -6 -6 d s 757 1084 m -6 -6 d s 747 1093 m -6 -6 d s 736 1102 m -6 -6 d s 726 1110 m -6 -6 d s 715 1119 m -6 -6 d s 705 1128 m -6 -6 d s 694 1137 m -6 -6 d s 684 1146 m -6 -6 d s 674 1155 m -6 -6
 d s 663 1164 m -5 -6 d s 653 1173 m -6 -6 d s 643 1182 m -6 -6 d s 633 1191 m -6 -6 d s 623 1200 m -6 -6 d s 612 1209 m -5 -6 d s 602 1218 m -5 -5 d s 592 1227 m -5 -5 d s 583 1237 m -6 -6 d s 573 1246 m -6 -5 d s 563 1256 m -5 -6 d s 553 1265 m -5
 -5 d s 543 1275 m -5 -6 d s 534 1284 m -5 -5 d s 524 1294 m -5 -5 d s 515 1304 m -6 -6 d s 505 1313 m -5 -5 d s 496 1323 m -5 -5 d s 486 1333 m -5 -5 d s 477 1343 m -5 -5 d s 468 1353 m -5 -5 d s 458 1363 m -4 -5 d s 449 1373 m -4 -5 d s 440 1383 m
 -4 -5 d s 431 1393 m -4 -4 d s 422 1404 m -4 -5 d s 413 1414 m -4 -5 d s 404 1424 m -4 -4 d s 396 1435 m -5 -5 d s 387 1445 m -5 -4 d s 2084 283 m 26 -26 d s 2045 303 m 26 -26 d s 2006 322 m 26 -26 d s 1966 343 m 27 -27 d s 1927 363 m 26 -26 d s
 1887 384 m 26 -27 d s 1847 405 m 26 -27 d s 1806 426 m 27 -27 d s 1765 448 m 27 -27 d s 1724 470 m 27 -27 d s 1682 492 m 27 -27 d s 1640 515 m 27 -27 d s 1597 539 m 28 -28 d s 1554 563 m 27 -28 d s 1509 588 m 29 -28 d s 1465 614 m 28 -29 d s 1419
 640 m 29 -29 d s 1372 667 m 30 -29 d s 1325 696 m 30 -31 d s 1276 725 m 31 -31 d s 1226 756 m 31 -31 d s 1174 789 m 32 -32 d s 1120 823 m 34 -33 d s 1063 861 m 35 -35 d s 1003 902 m 37 -37 d s 939 947 m 39 -39 d s 867 999 m 44 -43 d s 784 1063 m 51
 -51 d s 382 1446 m 26 -26 d s 673 1155 m 70 -70 d s 486 1323 m 97 -97 d s 0 lw 1 1 1 c 3 lw 1004 391 1101 997 bf black
 gsave  2268 1538 0 0 C 1352 1307 t 0 r /Helvetica findfont 35.8403 sf 0 0 m (NLO QCD+EW MSTW2008 \255 7 TeV) show NC gr  0.4 0.4 0.8 c cs 0.4 0.4 0.8 P01 setcolor 1139 1277 m 176 X 91 Y -176 X FA 0.4 0.4 0.8 c 1139 1368 m 176 X s 1139 1277 m 176 X
 s 1315 1277 m 91 Y s 1139 1277 m 91 Y s black
 gsave  2268 1538 0 0 C 1352 1176 t 0 r /Helvetica findfont 35.8403 sf 0 0 m (NNLO QCD MSTW2008 \255 7 TeV) show NC gr  0 0.6 0 c 1139 1147 m 176 X 91 Y -176 X f 1139 1238 m 176 X s 1139 1147 m 176 X s 1315 1147 m 91 Y s 1139 1147 m 91 Y s black
 gsave  2268 1538 0 0 C 1352 1046 t 0 r /Helvetica findfont 35.8403 sf 0 0 m (NLO QCD MSTW2008 \255 7 TeV) show NC gr  0.8 0 0 c 1315 1026 m -10 -9 d s 1315 1045 m -29 -28 d s 1315 1064 m -48 -47 d s 1315 1084 m -68 -67 d s 1315 1103 m -87 -86 d s
 1300 1108 m -91 -91 d s 1281 1108 m -91 -91 d s 1262 1108 m -91 -91 d s 1242 1108 m -91 -91 d s 1223 1108 m -84 -85 d s 1204 1108 m -65 -65 d s 1185 1108 m -46 -46 d s 1166 1108 m -27 -27 d s 1146 1108 m -7 -8 d s 1297 1108 m 18 -17 d s 1278 1108 m
 37 -36 d s 1259 1108 m 56 -56 d s 1240 1108 m 75 -75 d s 1221 1108 m 91 -91 d s 1201 1108 m 92 -91 d s 1182 1108 m 91 -91 d s 1163 1108 m 91 -91 d s 1144 1108 m 91 -91 d s 1139 1093 m 77 -76 d s 1139 1074 m 57 -57 d s 1139 1055 m 38 -38 d s 1139
 1035 m 19 -18 d s 0 lw 0 0.6 0 c 0.8 0 0 c 3 lw 1139 1108 m 176 X s 1139 1017 m 176 X s 1315 1017 m 91 Y s 1139 1017 m 91 Y s black
 gsave  2268 1538 0 0 C 2222 1118 t 90 r /Helvetica-BoldOblique findfont 29.3239 sf 0 0 m (LHC HIGGS XS WG 2010) show NC gr 
 gr  gr 
showpage
end
%%EOF
