%!PS-Adobe-3.0
%%Pages: (atend)
%%BoundingBox: 20 255 564 822
%%HiResBoundingBox: 20.000000 255.000000 564.000000 822.000000
%...................................
%%Creator: GPL Ghostscript 871 (pswrite)
%%CreationDate: 2010/11/22 11:28:17
%%DocumentData: Clean7Bit
%%LanguageLevel: 2
%%EndComments
%%BeginProlog
% This copyright applies to everything between here and the %%EndProlog:
% Copyright (C) 2010 Artifex Software, Inc.  All rights reserved.
%%BeginResource: procset GS_pswrite_2_0_1001 1.001 0
/GS_pswrite_2_0_1001 80 dict dup begin
/PageSize 2 array def/setpagesize{ PageSize aload pop 3 index eq exch
4 index eq and{ pop pop pop}{ PageSize dup  1
5 -1 roll put 0 4 -1 roll put dup null eq {false} {dup where} ifelse{ exch get exec}
{ pop/setpagedevice where
{ pop 1 dict dup /PageSize PageSize put setpagedevice}
{ /setpage where{ pop PageSize aload pop pageparams 3 {exch pop} repeat
setpage}if}ifelse}ifelse}ifelse} bind def
/!{bind def}bind def/#{load def}!/N/counttomark #
/rG{3{3 -1 roll 255 div}repeat setrgbcolor}!/G{255 div setgray}!/K{0 G}!
/r6{dup 3 -1 roll rG}!/r5{dup 3 1 roll rG}!/r3{dup rG}!
/w/setlinewidth #/J/setlinecap #
/j/setlinejoin #/M/setmiterlimit #/d/setdash #/i/setflat #
/m/moveto #/l/lineto #/c/rcurveto #
/p{N 2 idiv{N -2 roll rlineto}repeat}!
/P{N 0 gt{N -2 roll moveto p}if}!
/h{p closepath}!/H{P closepath}!
/lx{0 rlineto}!/ly{0 exch rlineto}!/v{0 0 6 2 roll c}!/y{2 copy c}!
/re{4 -2 roll m exch dup lx exch ly neg lx h}!
/^{3 index neg 3 index neg}!
/f{P fill}!/f*{P eofill}!/s{H stroke}!/S{P stroke}!
/q/gsave #/Q/grestore #/rf{re fill}!
/Y{P clip newpath}!/Y*{P eoclip newpath}!/rY{re Y}!
/|={pop exch 4 1 roll 1 array astore cvx 3 array astore cvx exch 1 index def exec}!
/|{exch string readstring |=}!
/+{dup type/nametype eq{2 index 7 add -3 bitshift 2 index mul}if}!
/@/currentfile #/${+ @ |}!
/B{{2 copy string{readstring pop}aload pop 4 array astore cvx
3 1 roll}repeat pop pop true}!
/Ix{[1 0 0 1 11 -2 roll exch neg exch neg]exch}!
/,{true exch Ix imagemask}!/If{false exch Ix imagemask}!/I{exch Ix image}!
/Ic{exch Ix false 3 colorimage}!
/F{/Columns counttomark 3 add -2 roll/Rows exch/K -1/BlackIs1 true>>
/CCITTFaxDecode filter}!/FX{<</EndOfBlock false F}!
/X{/ASCII85Decode filter}!/@X{@ X}!/&2{2 index 2 index}!
/@F{@ &2<<F}!/@C{@X &2 FX}!
/$X{+ @X |}!/&4{4 index 4 index}!/$F{+ @ &4<<F |}!/$C{+ @X &4 FX |}!
/IC{3 1 roll 10 dict begin 1{/ImageType/Interpolate/Decode/DataSource
/ImageMatrix/BitsPerComponent/Height/Width}{exch def}forall
currentdict end image}!
/~{@ read {pop} if}!
end def
%%EndResource
/pagesave null def
%%EndProlog
%%Page: 1 1
%%PageBoundingBox: 0 0 595 842
%%BeginPageSetup
GS_pswrite_2_0_1001 begin
595 842 /a4 setpagesize
/pagesave save store 197 dict begin
0.1 0.1 scale
%%EndPageSetup
gsave mark
Q q
200 2550 5440 5670 re
Y
255 G
200 2550.71 5441 5669.29 re
f*
1070.56 2834.17 4298.39 4478.74 re
f*
10 w
K
1070.56 2834.17 4298.39 4478.74 re
S
15 w
1070.56 7312.91 0 -4.48 0 0 0 -4.48 ^ 0 -4.48 ^ 0 -4.48 
^ 0 -4.48 ^ 0 -4.48 ^ 0 -4.48 ^ 0 -4.48 
^ 0 -4.48 ^ 0 -4.48 ^ 0 -4.48 ^ 0 -4.48 
^ 0 -4.48 ^ 0 -4.48 ^ 0 -4.48 ^ 0 -4.48 
^ 0 -4.48 ^ 0 -4.48 ^ 0 -4.48 ^ 0 -4.48 
^ 0 -4.48 ^ 0 -4.48 ^ 0 -4.48 ^ 0 -4.48 
^ 0 -4.48 ^ 0 -4.47 ^ 0 -4.48 ^ 0 -4.48 
^ 0 -4.48 ^ 0 -4.48 ^ 0 -4.48 ^ 0 -4.48 
^ 0 -4.48 ^ 0 -4.47 ^ 0 -4.48 ^ 0 -4.48 
^ 0 -4.48 ^ 0 -4.48 ^ 0 -4.48 ^ 0 -4.48 
^ 0 -4.47 ^ 0 -4.48 ^ 0 -4.48 ^ 0 -4.48 
^ 0 -4.48 ^ 0 -4.48 ^ 0 -4.48 ^ 0 -4.48 
^ 0 -4.47 ^ 0 -4.48 ^ 0 -4.48 ^ 0 -4.48 
^ 0 -4.48 ^ 0 -4.48 ^ 0 -4.48 ^ 0 -4.48 
^ 0 -4.47 ^ 0 -4.48 ^ 0 -4.48 ^ 0 -4.48 
^ 0 -4.48 ^ 0 -4.48 ^ 0 -4.48 ^ 0 -4.48 
^ 0 -4.47 ^ 0 -4.48 ^ 0 -4.48 ^ 0 -4.48 
^ 0 -4.48 ^ 0 -4.48 ^ 0 -4.48 ^ 0 -4.48 
^ 0 -4.47 ^ 0 -4.48 ^ 0 -4.48 ^ 0 -4.48 
^ 0 -4.48 ^ 0 -4.48 ^ 0 -4.48 ^ 0 -4.48 
^ 0 -4.47 ^ 0 -4.48 ^ 0 -4.48 ^ 0 -4.48 
^ 0 -4.48 ^ 0 -4.48 ^ 0 -4.48 ^ 0 -4.48 
^ 0 -4.47 ^ 0 -4.48 ^ 0 -4.48 ^ 0 -4.48 
^ 0 -4.48 ^ 0 -4.48 ^ 0 -4.48 ^ 0 -4.48 
^ 0 -4.47 ^ 0 -4.48 ^ 0 -4.48 ^ 0 -4.48 
^ 0 -4.48 ^ 0 -4.48 ^ 0 -4.48 ^ 0 -4.48 
^ 0 -4.47 ^ 0 -4.48 ^ 0 -4.48 ^ 0 -4.48 
^ 0 -4.48 ^ 0 -4.48 ^ 0 -4.48 ^ 0 -4.48 
^ 0 -4.47 ^ 0 -4.48 ^ 0 -4.48 ^ 0 -4.48 
^ 0 -4.48 ^ 0 -4.48 ^ 0 -4.48 ^ 0 -4.48 
^ P
0 -4.47 0 0 0 -4.48 ^ 0 -4.48 ^ 0 -4.48 ^ 
0 -4.48 ^ 0 -4.48 ^ 0 -4.48 ^ 0 -4.48 ^ 
0 -4.47 ^ 0 -4.48 ^ 0 -4.48 ^ 0 -4.48 ^ 
0 -4.48 ^ 0 -4.48 ^ 0 -4.48 ^ 0 -4.48 ^ 
0 -4.47 ^ 0 -4.48 ^ 0 -4.48 ^ 0 -4.48 ^ 
0 -4.48 ^ 0 -4.48 ^ 0 -4.48 ^ 0 -4.48 ^ 
0 -4.47 ^ 0 -4.48 ^ 0 -4.48 ^ 0 -4.48 ^ 
0 -4.48 ^ 0 -4.48 ^ 0 -4.48 ^ 0 -4.48 ^ 
0 -4.47 ^ 0 -4.48 ^ 0 -4.48 ^ 0 -4.48 ^ 
0 -4.48 ^ 0 -4.48 ^ 0 -4.48 ^ 0 -4.47 ^ 
0 -4.48 ^ 0 -4.48 ^ 0 -4.48 ^ 0 -4.48 ^ 
0 -4.48 ^ 0 -4.48 ^ 0 -4.48 ^ 0 -4.47 ^ 
0 -4.48 ^ 0 -4.48 ^ 0 -4.48 ^ 0 -4.48 ^ 
0 -4.48 ^ 0 -4.48 ^ 0 -4.48 ^ 0 -4.47 ^ 
0 -4.48 ^ 0 -4.48 ^ 0 -4.48 ^ 0 -4.48 ^ 
0 -4.48 ^ 0 -4.48 ^ 0 -4.48 ^ 0 -4.47 ^ 
0 -4.48 ^ 0 -4.48 ^ 0 -4.48 ^ 0 -4.48 ^ 
0 -4.48 ^ 0 -4.48 ^ 0 -4.48 ^ 0 -4.47 ^ 
0 -4.48 ^ 0 -4.48 ^ 0 -4.48 ^ 0 -4.48 ^ 
0 -4.48 ^ 0 -4.48 ^ 0 -4.48 ^ 0 -4.47 ^ 
0 -4.48 ^ 0 -4.48 ^ 0 -4.48 ^ 0 -4.48 ^ 
0 -4.48 ^ 0 -4.48 ^ 0 -4.48 ^ 0 -4.47 ^ 
0 -4.48 ^ 0 -4.48 ^ 0 -4.48 ^ 0 -4.48 ^ 
0 -4.48 ^ 0 -4.48 ^ 0 -4.48 ^ 0 -4.47 ^ 
0 -4.48 ^ 0 -4.48 ^ 0 -4.48 ^ 0 -4.48 ^ 
0 -4.48 ^ 0 -4.48 ^ 0 -4.48 ^ 0 -4.47 ^ 
0 -4.48 ^ 0 -4.48 ^ 0 -4.48 ^ 0 -4.48 ^ 
0 -4.48 ^ 0 -4.48 ^ 0 -4.48 ^ 0 -4.47 ^ 
0 -4.48 ^ 0 -4.48 ^ 0 -4.48 ^ 0 -4.48 ^ 
0 -4.48 ^ 0 -4.48 ^ 0 -4.48 ^ 0 -4.47 ^ 
0 -4.48 p
0 0 0 -4.48 ^ 0 -4.48 ^ 0 -4.48 ^ 0 -4.48 
^ 0 -4.48 ^ 0 -4.48 ^ 0 -4.47 ^ 0 -4.48 
^ 0 -4.48 ^ 0 -4.48 ^ 0 -4.48 ^ 0 -4.48 
^ 0 -4.48 ^ 0 -4.48 ^ 0 -4.47 ^ 0 -4.48 
^ 0 -4.48 ^ 0 -4.48 ^ 0 -4.48 ^ 0 -4.48 
^ 0 -4.48 ^ 0 -4.48 ^ 0 -4.47 ^ 0 -4.48 
^ 0 -4.48 ^ 0 -4.48 ^ 0 -4.48 ^ 0 -4.48 
^ 0 -4.48 ^ 0 -4.48 ^ 0 -4.47 ^ 0 -4.48 
^ 0 -4.48 ^ 0 -4.48 ^ 0 -4.48 ^ 0 -4.48 
^ 0 -4.48 ^ 0 -4.48 ^ 0 -4.47 ^ 0 -4.48 
^ 0 -4.48 ^ 0 -4.48 ^ 0 -4.48 ^ 0 -4.48 
^ 0 -4.48 ^ 0 -4.48 ^ 0 -4.47 ^ 0 -4.48 
^ 0 -4.48 ^ 0 -4.48 ^ 0 -4.48 ^ 0 -4.48 
^ 0 -4.48 ^ 0 -4.47 ^ 0 -4.48 ^ 0 -4.48 
^ 0 -4.48 ^ 0 -4.48 ^ 0 -4.48 ^ 0 -4.48 
^ 0 -4.48 ^ 0 -4.47 ^ 0 -4.48 ^ 0 -4.48 
^ 0 -4.48 ^ 0 -4.48 ^ 0 -4.48 ^ 0 -4.48 
^ 0 -4.48 ^ 0 -4.47 ^ 0 -4.48 ^ 0 -4.48 
^ 0 -4.48 ^ 0 -4.48 ^ 0 -4.48 ^ 0 -4.48 
^ 0 -4.48 ^ 0 -4.47 ^ 0 -4.48 ^ 0 -4.48 
^ 0 -4.48 ^ 0 -4.48 ^ 0 -4.48 ^ 0 -4.48 
^ 0 -4.48 ^ 0 -4.47 ^ 0 -4.48 ^ 0 -4.48 
^ 0 -4.48 ^ 0 -4.48 ^ 0 -4.48 ^ 0 -4.48 
^ 0 -4.48 ^ 0 -4.47 ^ 0 -4.48 ^ 0 -4.48 
^ 0 -4.48 ^ 0 -4.48 ^ 0 -4.48 ^ 0 -4.48 
^ 0 -4.48 ^ 0 -4.47 ^ 0 -4.48 ^ 0 -4.48 
^ 0 -4.48 ^ 0 -4.48 ^ 0 -4.48 ^ 0 -4.48 
^ 0 -4.48 ^ 0 -4.47 ^ 0 -4.48 ^ 0 -4.48 
^ 0 -4.48 ^ 0 -4.48 ^ 0 -4.48 ^ 0 -4.48 
^ 0 -4.48 ^ 0 -4.47 ^ 0 -4.48 ^ 0 -4.48 
^ p
0 -4.48 0 0 0 -4.48 ^ 0 -4.48 ^ 0 -4.48 ^ 
0 -4.48 ^ 0 -4.47 ^ 0 -4.48 ^ 0 -4.48 ^ 
0 -4.48 ^ 0 -4.48 ^ 0 -4.48 ^ 0 -4.48 ^ 
0 -4.48 ^ 0 -4.47 ^ 0 -4.48 ^ 0 -4.48 ^ 
0 -4.48 ^ 0 -4.48 ^ 0 -4.48 ^ 0 -4.48 ^ 
0 -4.48 ^ 0 -4.47 ^ 0 -4.48 ^ 0 -4.48 ^ 
0 -4.48 ^ 0 -4.48 ^ 0 -4.48 ^ 0 -4.48 ^ 
0 -4.48 ^ 0 -4.47 ^ 0 -4.48 ^ 0 -4.48 ^ 
0 -4.48 ^ 0 -4.48 ^ 0 -4.48 ^ 0 -4.48 ^ 
0 -4.48 ^ 0 -4.47 ^ 0 -4.48 ^ 0 -4.48 ^ 
0 -4.48 ^ 0 -4.48 ^ 0 -4.48 ^ 0 -4.48 ^ 
0 -4.48 ^ 0 -4.47 ^ 0 -4.48 ^ 0 -4.48 ^ 
0 -4.48 ^ 0 -4.48 ^ 0 -4.48 ^ 0 -4.48 ^ 
0 -4.48 ^ 0 -4.47 ^ 0 -4.48 ^ 0 -4.48 ^ 
0 -4.48 ^ 0 -4.48 ^ 0 -4.48 ^ 0 -4.48 ^ 
0 -4.47 ^ 0 -4.48 ^ 0 -4.48 ^ 0 -4.48 ^ 
0 -4.48 ^ 0 -4.48 ^ 0 -4.48 ^ 0 -4.48 ^ 
0 -4.47 ^ 0 -4.48 ^ 0 -4.48 ^ 0 -4.48 ^ 
0 -4.48 ^ 0 -4.48 ^ 0 -4.48 ^ 0 -4.48 ^ 
0 -4.47 ^ 0 -4.48 ^ 0 -4.48 ^ 0 -4.48 ^ 
0 -4.48 ^ 0 -4.48 ^ 0 -4.48 ^ 0 -4.48 ^ 
0 -4.47 ^ 0 -4.48 ^ 0 -4.48 ^ 0 -4.48 ^ 
0 -4.48 ^ 0 -4.48 ^ 0 -4.48 ^ 0 -4.48 ^ 
0 -4.47 ^ 0 -4.48 ^ 0 -4.48 ^ 0 -4.48 ^ 
0 -4.48 ^ 0 -4.48 ^ 0 -4.48 ^ 0 -4.48 ^ 
0 -4.47 ^ 0 -4.48 ^ 0 -4.48 ^ 0 -4.48 ^ 
0 -4.48 ^ 0 -4.48 ^ 0 -4.48 ^ 0 -4.48 ^ 
0 -4.47 ^ 0 -4.48 ^ 0 -4.48 ^ 0 -4.48 ^ 
0 -4.48 ^ 0 -4.48 ^ 0 -4.48 ^ 0 -4.48 ^ 
0 -4.47 ^ 0 -4.48 ^ 0 -4.48 ^ 0 -4.48 ^ 
0 -4.48 p
0 0 0 -4.48 ^ 0 -4.48 ^ 0 -4.48 ^ 0 -4.47 
^ 0 -4.48 ^ 0 -4.48 ^ 0 -4.48 ^ 0 -4.48 
^ 0 -4.48 ^ 0 -4.48 ^ 0 -4.48 ^ 0 -4.47 
^ 0 -4.48 ^ 0 -4.48 ^ 0 -4.48 ^ 0 -4.48 
^ 0 -4.48 ^ 0 -4.48 ^ 0 -4.48 ^ 0 -4.47 
^ 0 -4.48 ^ 0 -4.48 ^ 0 -4.48 ^ 0 -4.48 
^ 0 -4.48 ^ 0 -4.48 ^ 0 -4.48 ^ 0 -4.47 
^ 0 -4.48 ^ 0 -4.48 ^ 0 -4.48 ^ 0 -4.48 
^ 0 -4.48 ^ 0 -4.48 ^ 0 -4.48 ^ 0 -4.47 
^ 0 -4.48 ^ 0 -4.48 ^ 0 -4.48 ^ 0 -4.48 
^ 0 -4.48 ^ 0 -4.48 ^ 0 -4.48 ^ 0 -4.47 
^ 0 -4.48 ^ 0 -4.48 ^ 0 -4.48 ^ 0 -4.48 
^ 0 -4.48 ^ 0 -4.48 ^ 0 -4.48 ^ 0 -4.47 
^ 0 -4.48 ^ 0 -4.48 ^ 0 -4.48 ^ 0 -4.48 
^ 0 -4.48 ^ 0 -4.48 ^ 0 -4.48 ^ 0 -4.47 
^ 0 -4.48 ^ 0 -4.48 ^ 0 -4.48 ^ 0 -4.48 
^ 0 -4.48 ^ 0 -4.48 ^ 0 -4.47 ^ 0 -4.48 
^ 0 -4.48 ^ 0 -4.48 ^ 0 -4.48 ^ 0 -4.48 
^ 0 -4.48 ^ 0 -4.48 ^ 0 -4.47 ^ 0 -4.48 
^ 0 -4.48 ^ 0 -4.48 ^ 0 -4.48 ^ 0 -4.48 
^ 0 -4.48 ^ 0 -4.48 ^ 0 -4.47 ^ 0 -4.48 
^ 0 -4.48 ^ 0 -4.48 ^ 0 -4.48 ^ 0 -4.48 
^ 0 -4.48 ^ 0 -4.48 ^ 0 -4.47 ^ 0 -4.48 
^ 0 -4.48 ^ 0 -4.48 ^ 0 -4.48 ^ 0 -4.48 
^ 0 -4.48 ^ 0 -4.48 ^ 0 -4.47 ^ 0 -4.48 
^ 0 -4.48 ^ 0 -4.48 ^ 0 -4.48 ^ 0 -4.48 
^ 0 -4.48 ^ 0 -4.48 ^ 0 -4.47 ^ 0 -4.48 
^ 0 -4.48 ^ 0 -4.48 ^ 0 -4.48 ^ 0 -4.48 
^ 0 -4.48 ^ 0 -4.48 ^ 0 -4.47 ^ 0 -4.48 
^ 0 -4.48 ^ 0 -4.48 ^ 0 -4.48 ^ 0 -4.48 
^ p
0 -4.48 0 0 0 -4.48 ^ 0 -4.47 ^ 0 -4.48 ^ 
0 -4.48 ^ 0 -4.48 ^ 0 -4.48 ^ 0 -4.48 ^ 
0 -4.48 ^ 0 -4.48 ^ 0 -4.47 ^ 0 -4.48 ^ 
0 -4.48 ^ 0 -4.48 ^ 0 -4.48 ^ 0 -4.48 ^ 
0 -4.48 ^ 0 -4.48 ^ 0 -4.47 ^ 0 -4.48 ^ 
0 -4.48 ^ 0 -4.48 ^ 0 -4.48 ^ 0 -4.48 ^ 
0 -4.48 ^ 0 -4.48 ^ 0 -4.47 ^ 0 -4.48 ^ 
0 -4.48 ^ 0 -4.48 ^ 0 -4.48 ^ 0 -4.48 ^ 
0 -4.48 ^ 0 -4.48 ^ 0 -4.47 ^ 0 -4.48 ^ 
0 -4.48 ^ 0 -4.48 ^ 0 -4.48 ^ 0 -4.48 ^ 
0 -4.48 ^ 0 -4.48 ^ 0 -4.47 ^ 0 -4.48 ^ 
0 -4.48 ^ 0 -4.48 ^ 0 -4.48 ^ 0 -4.48 ^ 
0 -4.48 ^ 0 -4.48 ^ 0 -4.47 ^ 0 -4.48 ^ 
0 -4.48 ^ 0 -4.48 ^ 0 -4.48 ^ 0 -4.48 ^ 
0 -4.48 ^ 0 -4.48 ^ 0 -4.47 ^ 0 -4.48 ^ 
0 -4.48 ^ 0 -4.48 ^ 0 -4.48 ^ 0 -4.48 ^ 
0 -4.48 ^ 0 -4.47 ^ 0 -4.48 ^ 0 -4.48 ^ 
0 -4.48 ^ 0 -4.48 ^ 0 -4.48 ^ 0 -4.48 ^ 
0 -4.48 ^ 0 -4.47 ^ 0 -4.48 ^ 0 -4.48 ^ 
0 -4.48 ^ 0 -4.48 ^ 0 -4.48 ^ 0 -4.48 ^ 
0 -4.48 ^ 0 -4.47 ^ 0 -4.48 ^ 0 -4.48 ^ 
0 -4.48 ^ 0 -4.48 ^ 0 -4.48 ^ 0 -4.48 ^ 
0 -4.48 ^ 0 -4.47 ^ 0 -4.48 ^ 0 -4.48 ^ 
0 -4.48 ^ 0 -4.48 ^ 0 -4.48 ^ 0 -4.48 ^ 
0 -4.48 ^ 0 -4.47 ^ 0 -4.48 ^ 0 -4.48 ^ 
0 -4.48 ^ 0 -4.48 ^ 0 -4.48 ^ 0 -4.48 ^ 
0 -4.48 ^ 0 -4.47 ^ 0 -4.48 ^ 0 -4.48 ^ 
0 -4.48 ^ 0 -4.48 ^ 0 -4.48 ^ 0 -4.48 ^ 
0 -4.48 ^ 0 -4.47 ^ 0 -4.48 ^ 0 -4.48 ^ 
0 -4.48 ^ 0 -4.48 ^ 0 -4.48 ^ 0 -4.48 ^ 
0 -4.48 p
0 0 0 -4.47 ^ 0 -4.48 ^ 0 -4.48 ^ 0 -4.48 
^ 0 -4.48 ^ 0 -4.48 ^ 0 -4.48 ^ 0 -4.48 
^ 0 -4.47 ^ 0 -4.48 ^ 0 -4.48 ^ 0 -4.48 
^ 0 -4.48 ^ 0 -4.48 ^ 0 -4.48 ^ 0 -4.48 
^ 0 -4.47 ^ 0 -4.48 ^ 0 -4.48 ^ 0 -4.48 
^ 0 -4.48 ^ 0 -4.48 ^ 0 -4.48 ^ 0 -4.48 
^ 0 -4.47 ^ 0 -4.48 ^ 0 -4.48 ^ 0 -4.48 
^ 0 -4.48 ^ 0 -4.48 ^ 0 -4.48 ^ 0 -4.48 
^ 0 -4.47 ^ 0 -4.48 ^ 0 -4.48 ^ 0 -4.48 
^ 0 -4.48 ^ 0 -4.48 ^ 0 -4.48 ^ 0 -4.48 
^ 0 -4.47 ^ 0 -4.48 ^ 0 -4.48 ^ 0 -4.48 
^ 0 -4.48 ^ 0 -4.48 ^ 0 -4.48 ^ 0 -4.48 
^ 0 -4.47 ^ 0 -4.48 ^ 0 -4.48 ^ 0 -4.48 
^ 0 -4.48 ^ 0 -4.48 ^ 0 -4.48 ^ 0 -4.48 
^ 0 -4.47 ^ 0 -4.48 ^ 0 -4.48 ^ 0 -4.48 
^ 0 -4.48 ^ 0 -4.48 ^ 0 -4.48 ^ 0 -4.48 
^ 0 -4.47 ^ 0 -4.48 ^ 0 -4.48 ^ 0 -4.48 
^ 0 -4.48 ^ 0 -4.48 ^ 0 -4.48 ^ 0 -4.47 
^ 0 -4.48 ^ 0 -4.48 ^ 0 -4.48 ^ 0 -4.48 
^ 0 -4.48 ^ 0 -4.48 ^ 0 -4.48 ^ 0 -4.48 
^ 0 -4.47 ^ 0 -4.48 ^ 0 -4.48 ^ 0 -4.48 
^ 0 -4.48 ^ 0 -4.48 ^ 0 -4.48 ^ 0 -4.47 
^ 0 -4.48 ^ 0 -4.48 ^ 0 -4.48 ^ 0 -4.48 
^ 0 -4.48 ^ 0 -4.48 ^ 0 -4.48 ^ 0 -4.47 
^ 0 -4.48 ^ 0 -4.48 ^ 0 -4.48 ^ 0 -4.48 
^ 0 -4.48 ^ 0 -4.48 ^ 0 -4.48 ^ 0 -4.47 
^ 0 -4.48 ^ 0 -4.48 ^ 0 -4.48 ^ 0 -4.48 
^ 0 -4.48 ^ 0 -4.48 ^ 0 -4.48 ^ 0 -4.47 
^ 0 -4.48 ^ 0 -4.48 ^ 0 -4.48 ^ 0 -4.48 
^ 0 -4.48 ^ 0 -4.48 ^ 0 -4.48 ^ 0 -4.47 
^ p
0 -4.48 0 0 0 -4.48 ^ 0 -4.48 ^ 0 -4.48 ^ 
0 -4.48 ^ 0 -4.48 ^ 0 -4.48 ^ 0 -4.47 ^ 
0 -4.48 ^ 0 -4.48 ^ 0 -4.48 ^ 0 -4.48 ^ 
0 -4.48 ^ 0 -4.48 ^ 0 -4.48 ^ 0 -4.47 ^ 
0 -4.48 ^ 0 -4.48 ^ 0 -4.48 ^ 0 -4.48 ^ 
0 -4.48 ^ 0 -4.48 ^ 0 -4.48 ^ 0 -4.47 ^ 
0 -4.48 ^ 0 -4.48 ^ 0 -4.48 ^ 0 -4.48 ^ 
0 -4.48 ^ 0 -4.48 ^ 0 -4.48 ^ 0 -4.47 ^ 
0 -4.48 ^ 0 -4.48 ^ 0 -4.48 ^ 0 -4.48 ^ 
0 -4.48 ^ 0 -4.48 ^ 0 -4.48 ^ 0 -4.47 ^ 
0 -4.48 ^ 0 -4.48 ^ 0 -4.48 ^ 0 -4.48 ^ 
0 -4.48 ^ 0 -4.48 ^ 0 -4.48 ^ 0 -4.47 ^ 
0 -4.48 ^ 0 -4.48 ^ 0 -4.48 ^ 0 -4.48 ^ 
0 -4.48 ^ 0 -4.48 ^ 0 -4.48 ^ 0 -4.47 ^ 
0 -4.48 ^ 0 -4.48 ^ 0 -4.48 ^ 0 -4.48 ^ 
0 -4.48 ^ 0 -4.48 ^ 0 -4.48 ^ 0 -4.47 ^ 
0 -4.48 ^ 0 -4.48 ^ 0 -4.48 ^ 0 -4.48 ^ 
0 -4.48 ^ 0 -4.48 ^ 0 -4.48 ^ 0 -4.47 ^ 
0 -4.48 ^ 0 -4.48 ^ 0 -4.48 ^ 0 -4.48 ^ 
0 -4.48 ^ 0 -4.48 ^ 0 -4.47 ^ 0 -4.48 ^ 
0 -4.48 ^ 0 -4.48 ^ 0 -4.48 ^ 0 -4.48 ^ 
0 -4.48 ^ 0 -4.48 ^ 0 -4.48 ^ 0 -4.47 ^ 
0 -4.48 ^ 0 -4.48 ^ 0 -4.48 ^ 0 -4.48 ^ 
0 -4.48 ^ 0 -4.48 ^ 0 -4.47 ^ 0 -4.48 ^ 
0 -4.48 ^ 0 -4.48 ^ 0 -4.48 ^ 0 -4.48 ^ 
0 -4.48 ^ 0 -4.48 ^ 0 -4.47 ^ 0 -4.48 ^ 
0 -4.48 ^ 0 -4.48 ^ 0 -4.48 ^ 0 -4.48 ^ 
0 -4.48 ^ 0 -4.48 ^ 0 -4.47 ^ 0 -4.48 ^ 
0 -4.48 ^ 0 -4.48 ^ 0 -4.48 ^ 0 -4.48 ^ 
0 -4.48 ^ 0 -4.48 ^ 0 -4.47 ^ 0 -4.48 ^ 
0 -4.48 p
0 0 0 -4.48 ^ 0 -4.48 ^ 0 -4.48 ^ 0 -4.48 
^ 0 -4.48 ^ 0 -4.47 ^ 0 -4.48 ^ 0 -4.48 
^ 0 -4.48 ^ 0 -4.48 ^ 0 -4.48 ^ 0 -4.48 
^ 0 -4.48 ^ 0 -4.47 ^ 0 -4.48 ^ 0 -4.48 
^ 0 -4.48 ^ 0 -4.48 ^ 0 -4.48 ^ 0 -4.48 
^ 0 -4.48 ^ 0 -4.47 ^ 0 -4.48 ^ 0 -4.48 
^ 0 -4.48 ^ 0 -4.48 ^ 0 -4.48 ^ 0 -4.48 
^ 0 -4.48 ^ 0 -4.47 ^ 0 -4.48 ^ 0 -4.48 
^ 0 -4.48 ^ 0 -4.48 ^ 0 -4.48 ^ 0 -4.48 p S
7.5 w
1070.56 7312.91 0 -4478.74 S
Q q
200 2550 5440 0 0 5670 ^ Y
0.25683 i
K
587 3418.98 0 48.01 -241 0 ^ 18 0 0 27.01 205 0 ^ H
f
498.99 3229 0 78.02 -21 0 0 -57.02 -5.18 0 P
-33.55 0 -57.81 24.71 -57.81 58.9 c
0 19.02 6.93 36.25 18.99 47.3 c
13.35 12.34 35.68 19.8 58.77 19.8 c
45.94 0 76.23 -26.23 76.23 -65.83 c
0 -28.54 -14.55 -49.11 -38.53 -54.26 c
0 -24.45 p
37.82 6.71 59.54 35.53 59.54 78.49 c
0 22.9 -5.93 41.42 -17.99 56.09 c
-17.96 21.61 -46.94 33.96 -80.55 33.96 c
-57.46 0 -97.48 -35.24 -97.48 -85.93 c
0 -25.47 9.52 -45.79 29.85 -64.08 c
-24.96 -5.89 0 -15.11 h
f
460 3080 m
20.45 0 32.73 1.56 42.7 5.39 c
21.99 8.7 35.3 29.16 35.3 54.24 c
0 37.35 -28.71 61.4 -72.78 61.4 c
-44.07 0 -71.23 -23.23 -71.23 -60.77 c
0 -30.64 17.5 -51.83 46.84 -57.2 c
0 21.5 p
-17.64 5.88 -26.84 17.9 -26.84 35.04 c
0 13.56 6.13 25.07 17.38 32.23 c
7.67 5.12 15.33 6.91 28.63 7.16 c
h
477.01 3178.87 m
24.84 -1.8 40.98 -16.95 40.98 -38.52 c
0 -21.06 -17.42 -37.24 -39.45 -37.24 c
-0.51 0 -1.02 0 -1.54 0.25 c
h
f
400 2968.32 187 -64.98 0 25.43 -158.24 51.88 158.24 54.96 0 25.68 -187 -67.29 H
f
346 2891.09 0 -48.09 241 0 ^ -18 0 0 -27.09 -205 0 ^ H
f
Q q
200 2550 5440 0 0 5670 ^ Y
0.2 i
K
391 3646 -58 0 0 -16 125 0 ^ -54 0 0 64 ^ 
0 16 -125 0 ^ 58 0 H
f
Q q
200 2550 5440 0 0 5670 ^ Y
0.25683 i
K
400 3818.66 156.92 -52.66 -156.92 0 0 -23 187 0 0 33.31 -162.86 54.7 162.86 55.73 
0 33.29 -187 0 0 -23.01 156.92 0 -156.92 -53.18 H
f
Q q
200 2550 5440 5670 re
Y
7.5 w
K
1199.51 6923.46 -128.95 0 S
1135.04 6728.73 -64.48 0 S
1135.04 6534 -64.48 0 S
1135.04 6339.27 -64.48 0 S
1135.04 6144.55 -64.48 0 S
1199.51 5949.82 -128.95 0 S
1135.04 5755.09 -64.48 0 S
1135.04 5560.36 -64.48 0 S
1135.04 5365.64 -64.48 0 S
1135.04 5170.91 -64.48 0 S
1199.51 4976.18 -128.95 0 S
1135.04 4781.45 -64.48 0 S
1135.04 4586.72 -64.48 0 S
1135.04 4392 -64.48 0 S
1135.04 4197.27 -64.48 0 S
1199.51 4002.54 -128.95 0 S
1135.04 3807.81 -64.48 0 S
1135.04 3613.08 -64.48 0 S
1135.04 3418.36 -64.48 0 S
1135.04 3223.63 -64.48 0 S
1199.51 3028.9 -128.95 0 S
1199.51 6923.46 -128.95 0 S
1135.04 7118.19 -64.48 0 S
1135.04 7312.91 -64.48 0 S
1199.51 3028.9 -128.95 0 S
Q q
200 2550 5440 0 0 5670 ^ Y
0.25683 i
K
957.64 7070 -129.64 0 0 -23 182.04 0 0 14.88 P
-28.02 7.95 -31.87 13.07 -36.23 47.93 c
-16.17 0 h
f
1010 6922.51 m
0 16.93 -7.44 32.31 -20 41.8 c
-15.95 11.8 -40.35 17.7 -74 17.7 c
-61.38 0 -94 -20.52 -94 -59.5 c
0 -38.47 32.62 -59.52 92.46 -59.52 c
35.44 0 59.07 5.66 75.54 17.71 c
12.82 9.49 20 24.62 20 41.8 c
h
989.99 6922.5 m
0 -24.42 -24.64 -36.5 -73.36 -36.5 c
-51.54 0 -75.64 11.83 -75.64 37.02 c
0 23.91 25.13 35.98 74.87 35.98 c
49.74 0 74.13 -12.08 74.13 -36.5 c
h
f
1010 6779.51 m
0 16.93 -7.44 32.31 -20 41.8 c
-15.95 11.8 -40.35 17.7 -74 17.7 c
-61.38 0 -94 -20.52 -94 -59.5 c
0 -38.47 32.62 -59.52 92.46 -59.52 c
35.44 0 59.07 5.66 75.54 17.71 c
12.82 9.49 20 24.62 20 41.8 c
h
989.99 6779.5 m
0 -24.42 -24.64 -36.5 -73.36 -36.5 c
-51.54 0 -75.64 11.83 -75.64 37.02 c
0 23.91 25.13 35.98 74.87 35.98 c
49.74 0 74.13 -12.08 74.13 -36.5 c
h
f
Q q
200 2550 5440 0 0 5670 ^ Y
0.25683 i
K
957.64 6099 -129.64 0 0 -23 182.04 0 0 14.88 P
-28.02 7.95 -31.87 13.07 -36.23 47.93 c
-16.17 0 h
f
1010 5900.54 0 94.18 -99.04 13.64 0 -20.88 P
12.65 -10.57 17.04 -19.33 17.04 -33.51 c
0 -24.49 -16.74 -39.96 -43.78 -39.96 c
-26.26 0 -42.22 15.21 -42.22 39.95 c
0 19.84 10.06 31.96 30.69 37.37 c
0 22.68 p
-14.93 -3.09 -22.13 -5.66 -28.82 -11.07 c
-13.89 -10.29 -21.87 -28.82 -21.87 -49.41 c
0 -36.8 26.74 -62.54 65.32 -62.54 c
36 0 60.69 23.95 60.69 58.94 c
0 12.87 -3.36 23.16 -11.11 33.71 c
51.1 -7.2 0 -75.91 h
f
1010 5809.51 m
0 16.93 -7.44 32.31 -20 41.8 c
-15.95 11.8 -40.35 17.7 -74 17.7 c
-61.38 0 -94 -20.52 -94 -59.5 c
0 -38.47 32.62 -59.52 92.46 -59.52 c
35.44 0 59.07 5.66 75.54 17.71 c
12.82 9.49 20 24.62 20 41.8 c
h
989.99 5809.5 m
0 -24.42 -24.64 -36.5 -73.36 -36.5 c
-51.54 0 -75.64 11.83 -75.64 37.02 c
0 23.91 25.13 35.98 74.87 35.98 c
49.74 0 74.13 -12.08 74.13 -36.5 c
h
f
Q q
200 2550 5440 0 0 5670 ^ Y
0.25683 i
K
850 5056.28 0 95.61 P
14.92 -2.3 24.43 -10.51 37.55 -32.81 c
13.89 -25.63 p
13.89 -25.38 32.66 -38.45 55.04 -38.45 c
15.18 0 29.32 6.18 39.09 16.94 c
9.77 10.77 14.41 24.09 14.41 41.26 c
0 23.07 -8.21 40.23 -23.6 50.23 c
-9.74 6.41 -21.02 9.23 -39.48 9.74 c
0 -22.57 p
12.23 -0.77 19.63 -2.3 25.49 -5.38 c
10.96 -5.9 17.59 -17.7 17.59 -31.29 c
0 -20.52 -14.64 -35.91 -34.12 -35.91 c
-14.35 0 -26.65 8.48 -35.87 24.64 c
-13.33 23.59 p
-21.52 37.96 -38.7 48.98 -78.67 51.04 c
0 -120.99 h
f
1010 4972.51 m
0 16.93 -7.44 32.31 -20 41.8 c
-15.95 11.8 -40.35 17.7 -74 17.7 c
-61.38 0 -94 -20.52 -94 -59.5 c
0 -38.47 32.62 -59.52 92.46 -59.52 c
35.44 0 59.07 5.66 75.54 17.71 c
12.82 9.49 20 24.62 20 41.8 c
h
989.99 4972.5 m
0 -24.42 -24.64 -36.5 -73.36 -36.5 c
-51.54 0 -75.64 11.83 -75.64 37.02 c
0 23.91 25.13 35.98 74.87 35.98 c
49.74 0 74.13 -12.08 74.13 -36.5 c
h
f
1010 4829.51 m
0 16.93 -7.44 32.31 -20 41.8 c
-15.95 11.8 -40.35 17.7 -74 17.7 c
-61.38 0 -94 -20.52 -94 -59.5 c
0 -38.47 32.62 -59.52 92.46 -59.52 c
35.44 0 59.07 5.66 75.54 17.71 c
12.82 9.49 20 24.62 20 41.8 c
h
989.99 4829.5 m
0 -24.42 -24.64 -36.5 -73.36 -36.5 c
-51.54 0 -75.64 11.83 -75.64 37.02 c
0 23.91 25.13 35.98 74.87 35.98 c
49.74 0 74.13 -12.08 74.13 -36.5 c
h
f
Q q
200 2550 5440 0 0 5670 ^ Y
0.25683 i
K
850 4085.28 0 95.61 P
14.92 -2.3 24.43 -10.51 37.55 -32.81 c
13.89 -25.63 p
13.89 -25.38 32.66 -38.45 55.04 -38.45 c
15.18 0 29.32 6.18 39.09 16.94 c
9.77 10.77 14.41 24.09 14.41 41.26 c
0 23.07 -8.21 40.23 -23.6 50.23 c
-9.74 6.41 -21.02 9.23 -39.48 9.74 c
0 -22.57 p
12.23 -0.77 19.63 -2.3 25.49 -5.38 c
10.96 -5.9 17.59 -17.7 17.59 -31.29 c
0 -20.52 -14.64 -35.91 -34.12 -35.91 c
-14.35 0 -26.65 8.48 -35.87 24.64 c
-13.33 23.59 p
-21.52 37.96 -38.7 48.98 -78.67 51.04 c
0 -120.99 h
f
1010 3950.54 0 94.18 -99.04 13.64 0 -20.88 P
12.65 -10.57 17.04 -19.33 17.04 -33.51 c
0 -24.49 -16.74 -39.96 -43.78 -39.96 c
-26.26 0 -42.22 15.21 -42.22 39.95 c
0 19.84 10.06 31.96 30.69 37.37 c
0 22.68 p
-14.93 -3.09 -22.13 -5.66 -28.82 -11.07 c
-13.89 -10.29 -21.87 -28.82 -21.87 -49.41 c
0 -36.8 26.74 -62.54 65.32 -62.54 c
36 0 60.69 23.95 60.69 58.94 c
0 12.87 -3.36 23.16 -11.11 33.71 c
51.1 -7.2 0 -75.91 h
f
1010 3859.51 m
0 16.93 -7.44 32.31 -20 41.8 c
-15.95 11.8 -40.35 17.7 -74 17.7 c
-61.38 0 -94 -20.52 -94 -59.5 c
0 -38.47 32.62 -59.52 92.46 -59.52 c
35.44 0 59.07 5.66 75.54 17.71 c
12.82 9.49 20 24.62 20 41.8 c
h
989.99 3859.5 m
0 -24.42 -24.64 -36.5 -73.36 -36.5 c
-51.54 0 -75.64 11.83 -75.64 37.02 c
0 23.91 25.13 35.98 74.87 35.98 c
49.74 0 74.13 -12.08 74.13 -36.5 c
h
f
Q q
200 2550 5440 0 0 5670 ^ Y
0.25683 i
K
912 3188.24 0 -12.37 P
0 -24.98 -11.37 -37.87 -33.32 -37.87 c
-22.98 0 -36.68 14.16 -36.68 37.82 c
0 24.69 12.37 36.78 38.91 38.32 c
0 22.63 p
-14.67 -1.03 -24.19 -3.59 -32.42 -7.96 c
-17.49 -9.25 -26.49 -27.23 -26.49 -52.15 c
0 -37.5 22.34 -61.67 56.76 -61.67 c
23.11 0 35.95 9.01 43.4 30.87 c
6.68 -17.23 19.52 -25.86 37.75 -25.86 c
31.33 0 50.08 20.9 50.08 55.7 c
0 36.86 -20 56.45 -58.72 57.23 c
0 -22.73 p
10.95 -0.26 17.06 -1.29 22.66 -4.13 c
9.93 -5.17 16.05 -16.54 16.05 -30.74 c
0 -20.15 -11.71 -32.31 -30.77 -32.31 c
-12.71 0 -20.34 4.69 -24.4 14.82 c
-2.54 6.24 -3.56 14.3 -3.81 30.41 c
h
f
1010 3031.51 m
0 16.93 -7.44 32.31 -20 41.8 c
-15.95 11.8 -40.35 17.7 -74 17.7 c
-61.38 0 -94 -20.52 -94 -59.5 c
0 -38.47 32.62 -59.52 92.46 -59.52 c
35.44 0 59.07 5.66 75.54 17.71 c
12.82 9.49 20 24.62 20 41.8 c
h
989.99 3031.5 m
0 -24.42 -24.64 -36.5 -73.36 -36.5 c
-51.54 0 -75.64 11.83 -75.64 37.02 c
0 23.91 25.13 35.98 74.87 35.98 c
49.74 0 74.13 -12.08 74.13 -36.5 c
h
f
1010 2889.51 m
0 16.93 -7.44 32.31 -20 41.8 c
-15.95 11.8 -40.35 17.7 -74 17.7 c
-61.38 0 -94 -20.52 -94 -59.5 c
0 -38.47 32.62 -59.52 92.46 -59.52 c
35.44 0 59.07 5.66 75.54 17.71 c
12.82 9.49 20 24.62 20 41.8 c
h
989.99 2889.5 m
0 -24.42 -24.64 -36.5 -73.36 -36.5 c
-51.54 0 -75.64 11.83 -75.64 37.02 c
0 23.91 25.13 35.98 74.87 35.98 c
49.74 0 74.13 -12.08 74.13 -36.5 c
h
f
Q q
200 2550 5440 5670 re
Y
7.5 w
K
5368.95 7312.91 0 -4478.74 S
5240 6923.46 128.95 0 S
5304.47 6728.73 64.48 0 S
5304.47 6534 64.48 0 S
5304.47 6339.27 64.48 0 S
5304.47 6144.55 64.48 0 S
5240 5949.82 128.95 0 S
5304.47 5755.09 64.48 0 S
5304.47 5560.36 64.48 0 S
5304.47 5365.64 64.48 0 S
5304.47 5170.91 64.48 0 S
5240 4976.18 128.95 0 S
5304.47 4781.45 64.48 0 S
5304.47 4586.72 64.48 0 S
5304.47 4392 64.48 0 S
5304.47 4197.27 64.48 0 S
5240 4002.54 128.95 0 S
5304.47 3807.81 64.48 0 S
5304.47 3613.08 64.48 0 S
5304.47 3418.36 64.48 0 S
5304.47 3223.63 64.48 0 S
5240 3028.9 128.95 0 S
5240 6923.46 128.95 0 S
5304.47 7118.19 64.48 0 S
5304.47 7312.91 64.48 0 S
5240 3028.9 128.95 0 S
1070.56 7312.91 4298.39 0 S
Q q
200 2550 5440 0 0 5670 ^ Y
0.25683 i
K
4280.01 8103 -23 0 0 -152.84 -98.04 152.84 -25.98 0 0 -187 23 0 0 151.79 
96.99 -151.79 27.03 0 H
f
4466.01 8103 -23 0 0 -152.84 -98.04 152.84 -25.98 0 0 -187 23 0 0 151.79 
96.99 -151.79 27.03 0 H
f
4529.01 8103 -24.01 0 0 -187 116.03 0 0 21 -92.02 0 H
f
4728.23 8106.01 m
-53.73 0 -90.23 -39.54 -90.23 -98.02 c
0 -58.48 36.5 -97.99 90.49 -97.99 c
22.63 0 42.93 6.93 58.1 19.75 c
20.31 17.19 32.4 46.18 32.4 76.7 c
0 60.28 -35.74 99.56 -90.76 99.56 c
h
4728.23 8085 m
40.56 0 66.75 -30.81 66.75 -78.03 c
0 -45.17 -26.96 -75.97 -66.5 -75.97 c
-39.79 0 -66.48 30.8 -66.48 76.99 c
0 46.2 26.7 77.01 66.23 77.01 c
h
f
4957.81 8103 -60.87 -192.14 14.13 0 60.87 192.14 H
f
5086.01 8103 -24.01 0 0 -187 116.03 0 0 21 -92.02 0 H
f
5285.23 8106.01 m
-53.73 0 -90.23 -39.54 -90.23 -98.02 c
0 -58.48 36.5 -97.99 90.49 -97.99 c
22.63 0 42.93 6.93 58.1 19.75 c
20.31 17.19 32.4 46.18 32.4 76.7 c
0 60.28 -35.74 99.56 -90.76 99.56 c
h
5285.23 8085 m
40.56 0 66.75 -30.81 66.75 -78.03 c
0 -45.17 -26.96 -75.97 -66.5 -75.97 c
-39.79 0 -66.48 30.8 -66.48 76.99 c
0 46.2 26.7 77.01 66.23 77.01 c
h
f
Q q
200 2550 5440 0 0 5670 ^ Y
0.2 i
K
3894.39 7830 31.68 125 -17.8 0 -22.95 -101.54 -28.42 101.54 -17.12 0 -27.74 -101.54 -23.46 101.54 
-17.81 0 32.02 -125 17.46 0 27.91 102.56 28.77 -102.56 H
f
4023 7887 0 -57 16 0 0 125 ^ 0 -55.01 -64 0 ^ 
-16 0 0 -125 ^ 0 57 H
f
Q q
200 2550 5440 0 0 5670 ^ Y
0.2 i
K
3691.65 7867 m
-11.64 -12.46 -21.91 -24.25 -28.93 -33.17 c
6.5 -6.39 p
16.95 19.86 32.02 35.61 42.98 45.03 c
-10.96 9.42 -26.02 25.17 -42.98 45.03 c
-6.5 -6.55 p
7.02 -9.13 17.29 -21.2 28.93 -33.95 c
-135.26 0 0 -10 h
f
Q q
200 2550 5440 0 0 5670 ^ Y
0.2 i
K
3320 7792.68 15 0 0 46.32 P
7.54 -9 15.94 -13 27.6 -13 c
23.14 0 38.41 18.62 38.41 47.14 c
0 30.06 -14.92 48.86 -39.04 48.86 c
-12.32 0 -22.21 -5.5 -28.97 -16.09 c
0 13.5 -13 0 h
3359.98 7909 m
15.74 0 26.02 -13.98 26.02 -35.53 c
0 -20.51 -10.45 -34.48 -26.02 -34.48 c
-15.06 0 -24.98 13.79 -24.98 35 c
0 21.2 9.92 35.01 24.98 35.01 c
h
f
3415 7792.68 15 0 0 46.32 P
7.54 -9 15.94 -13 27.6 -13 c
23.14 0 38.41 18.62 38.41 47.14 c
0 30.06 -14.92 48.86 -39.04 48.86 c
-12.32 0 -22.21 -5.5 -28.97 -16.09 c
0 13.5 -13 0 h
3454.98 7909 m
15.74 0 26.02 -13.98 26.02 -35.53 c
0 -20.51 -10.45 -34.48 -26.02 -34.48 c
-15.06 0 -24.98 13.79 -24.98 35 c
0 21.2 9.92 35.01 24.98 35.01 c
h
f
Q q
200 2550 5440 0 0 5670 ^ Y
0.25683 i
K
3309.02 8021.99 0 22 -58.2 0 P
-20.24 0 -34.08 -2.31 -45.87 -7.42 c
-24.86 -11.23 -38.95 -31.15 -38.95 -54.89 c
0 -16.59 6.41 -33.45 18.21 -46.72 c
13.33 -15.32 27.95 -21.96 48.21 -21.96 c
17.44 0 32.31 5.37 44.11 15.86 c
11.54 10.49 18.48 25.07 18.48 38.89 c
0 19.44 -14.94 38.63 -42.23 54.25 c
h
3241.03 8021.99 m
22.09 -22.78 26.97 -32.5 26.97 -53.48 c
0 -26.61 -12.84 -44.52 -31.85 -44.52 c
-23.63 0 -43.15 25.84 -43.15 57.3 c
0 24.56 15.92 40.69 40.07 40.69 c
h
f
Q q
200 2550 5440 5670 re
Y
7.5 w
K
1193.37 7178.55 0 134.36 S
1316.18 7245.73 0 67.18 S
1438.99 7245.73 0 67.18 S
1561.8 7245.73 0 67.18 S
1684.62 7178.55 0 134.36 S
1807.43 7245.73 0 67.18 S
1930.24 7245.73 0 67.18 S
2053.05 7245.73 0 67.18 S
2175.86 7178.55 0 134.36 S
2298.67 7245.73 0 67.18 S
2421.48 7245.73 0 67.18 S
2544.29 7245.73 0 67.18 S
2667.1 7178.55 0 134.36 S
2789.91 7245.73 0 67.18 S
2912.73 7245.73 0 67.18 S
3035.54 7245.73 0 67.18 S
3158.35 7178.55 0 134.36 S
3281.16 7245.73 0 67.18 S
3403.97 7245.73 0 67.18 S
3526.78 7245.73 0 67.18 S
3649.59 7178.55 0 134.36 S
3772.4 7245.73 0 67.18 S
3895.21 7245.73 0 67.18 S
4018.03 7245.73 0 67.18 S
4140.84 7178.55 0 134.36 S
4263.65 7245.73 0 67.18 S
4386.46 7245.73 0 67.18 S
4509.27 7245.73 0 67.18 S
4632.08 7178.55 0 134.36 S
4754.89 7245.73 0 67.18 S
4877.7 7245.73 0 67.18 S
5000.51 7245.73 0 67.18 S
5123.33 7178.55 0 134.36 S
1193.37 7178.55 0 134.36 S
1070.56 7245.73 0 67.18 S
5123.33 7178.55 0 134.36 S
5246.14 7245.73 0 67.18 S
5368.95 7245.73 0 67.18 S
Q q
200 2550 5440 0 0 5670 ^ Y
0.25683 i
K
1286 7626.51 m
0 16.93 -7.44 32.31 -20 41.8 c
-15.95 11.8 -40.35 17.7 -74 17.7 c
-61.38 0 -94 -20.52 -94 -59.5 c
0 -38.47 32.62 -59.52 92.46 -59.52 c
35.44 0 59.07 5.66 75.54 17.71 c
12.82 9.49 20 24.62 20 41.8 c
h
1265.99 7626.5 m
0 -24.42 -24.64 -36.5 -73.36 -36.5 c
-51.54 0 -75.64 11.83 -75.64 37.02 c
0 23.91 25.13 35.98 74.87 35.98 c
49.74 0 74.13 -12.08 74.13 -36.5 c
h
f
1104 7504.99 27.0078 27.0078 re
f
1199.7 7382.58 m
11.3 -18.5 20.54 -24.58 37.75 -24.58 c
28.51 0 48.54 22.27 48.54 54.51 c
0 31.98 -20.03 54.49 -48.54 54.49 c
-16.95 0 -26.2 -6.14 -37.75 -24.58 c
-10.02 20.47 -25.17 30.58 -45.2 30.58 c
-33.39 0 -56.5 -25.11 -56.5 -60.99 c
0 -35.87 23.11 -61.01 56.25 -61.01 c
20.29 0 35.44 10.36 45.46 31.57 c
h
1265.99 7412.5 m
0 -19.2 -11.25 -31.5 -28.88 -31.5 c
-16.87 0 -28.11 12.55 -28.11 31.5 c
0 18.95 11.25 31.49 28.37 31.49 c
17.38 0 28.63 -12.54 28.63 -31.49 c
h
1189.99 7412 m
0 -22.59 -14.45 -37.99 -35.87 -37.99 c
-21.68 0 -36.12 15.4 -36.12 38.51 c
0 22.08 14.71 37.48 36.13 37.48 c
21.41 0 35.87 -15.4 35.87 -37.99 c
h
f
Q q
200 2550 5440 0 0 5670 ^ Y
0.25683 i
K
1718.64 7384 -129.64 0 0 -23 182.04 0 0 14.88 P
-28.02 7.95 -31.87 13.07 -36.23 47.93 c
-16.17 0 h
f
Q q
200 2550 5440 0 0 5670 ^ Y
0.25683 i
K
2203.64 7631 -129.64 0 0 -23 182.04 0 0 14.88 P
-28.02 7.95 -31.87 13.07 -36.23 47.93 c
-16.17 0 h
f
2074 7504.99 27.0078 27.0078 re
f
2096 7353.28 0 95.61 P
14.92 -2.3 24.43 -10.51 37.55 -32.81 c
13.89 -25.63 p
13.89 -25.38 32.66 -38.45 55.04 -38.45 c
15.18 0 29.32 6.18 39.09 16.94 c
9.77 10.77 14.41 24.09 14.41 41.26 c
0 23.07 -8.21 40.23 -23.6 50.23 c
-9.74 6.41 -21.02 9.23 -39.48 9.74 c
0 -22.57 p
12.23 -0.77 19.63 -2.3 25.49 -5.38 c
10.96 -5.9 17.59 -17.7 17.59 -31.29 c
0 -20.52 -14.64 -35.91 -34.12 -35.91 c
-14.35 0 -26.65 8.48 -35.87 24.64 c
-13.33 23.59 p
-21.52 37.96 -38.7 48.98 -78.67 51.04 c
0 -120.99 h
f
Q q
200 2550 5440 0 0 5670 ^ Y
0.25683 i
K
2698.64 7631 -129.64 0 0 -23 182.04 0 0 14.88 P
-28.02 7.95 -31.87 13.07 -36.23 47.93 c
-16.17 0 h
f
2569 7504.99 27.0078 27.0078 re
f
2613 7399 -44 0 0 -23 ^ 0 -26.55 20 0 ^ 118 0 
0 16.77 -114.19 83.04 -23.81 0 H
2633 7399 0 57.03 79.57 -57.03 H
f
Q q
200 2550 5440 0 0 5670 ^ Y
0.25683 i
K
3202.64 7631 -129.64 0 0 -23 182.04 0 0 14.88 P
-28.02 7.95 -31.87 13.07 -36.23 47.93 c
-16.17 0 h
f
3073 7504.99 27.0078 27.0078 re
f
3208 7355.1 m
29.46 4.39 47 23.91 47 51.66 c
0 20.04 -9.76 38.02 -25.94 48.81 c
-17.72 11.3 -40.06 16.44 -73.2 16.44 c
-30.56 0 -50.08 -4.63 -66.26 -15.44 c
-14.64 -9.79 -22.6 -25.74 -22.6 -45.82 c
0 -34.75 25.64 -59.75 61.29 -59.75 c
33.85 0 57.72 23.23 57.72 55.97 c
0 18.05 -6.84 32.23 -20 42.03 c
44.37 -0.26 68.99 -14.66 68.99 -40.65 c
0 -15.95 -9.84 -27.02 -27 -30.62 c
h
3166 7409.63 m
0 -21.93 -15.14 -35.62 -39.51 -35.62 c
-22.82 0 -39.5 15.49 -39.5 36.39 c
0 21.16 17.44 37.16 40.78 37.16 c
22.57 0 38.23 -15.48 38.23 -37.93 c
h
f
Q q
200 2550 5440 0 0 5670 ^ Y
0.25683 i
K
3687.64 7631 -129.64 0 0 -23 182.04 0 0 14.88 P
-28.02 7.95 -31.87 13.07 -36.23 47.93 c
-16.17 0 h
f
3558 7504.99 27.0078 27.0078 re
f
3653.7 7382.58 m
11.3 -18.5 20.54 -24.58 37.75 -24.58 c
28.51 0 48.54 22.27 48.54 54.51 c
0 31.98 -20.03 54.49 -48.54 54.49 c
-16.95 0 -26.2 -6.14 -37.75 -24.58 c
-10.02 20.47 -25.17 30.58 -45.2 30.58 c
-33.39 0 -56.5 -25.11 -56.5 -60.99 c
0 -35.87 23.11 -61.01 56.25 -61.01 c
20.29 0 35.44 10.36 45.46 31.57 c
h
3719.99 7412.5 m
0 -19.2 -11.25 -31.5 -28.88 -31.5 c
-16.87 0 -28.11 12.55 -28.11 31.5 c
0 18.95 11.25 31.49 28.37 31.49 c
17.38 0 28.63 -12.54 28.63 -31.49 c
h
3643.99 7412 m
0 -22.59 -14.45 -37.99 -35.87 -37.99 c
-21.68 0 -36.12 15.4 -36.12 38.51 c
0 22.08 14.71 37.48 36.13 37.48 c
21.41 0 35.87 -15.4 35.87 -37.99 c
h
f
Q q
200 2550 5440 0 0 5670 ^ Y
0.25683 i
K
4065 7348.28 0 95.61 P
14.92 -2.3 24.43 -10.51 37.55 -32.81 c
13.89 -25.63 p
13.89 -25.38 32.66 -38.45 55.04 -38.45 c
15.18 0 29.32 6.18 39.09 16.94 c
9.77 10.77 14.41 24.09 14.41 41.26 c
0 23.07 -8.21 40.23 -23.6 50.23 c
-9.74 6.41 -21.02 9.23 -39.48 9.74 c
0 -22.57 p
12.23 -0.77 19.63 -2.3 25.49 -5.38 c
10.96 -5.9 17.59 -17.7 17.59 -31.29 c
0 -20.52 -14.64 -35.91 -34.12 -35.91 c
-14.35 0 -26.65 8.48 -35.87 24.64 c
-13.33 23.59 p
-21.52 37.96 -38.7 48.98 -78.67 51.04 c
0 -120.99 h
f
Q q
200 2550 5440 0 0 5670 ^ Y
0.25683 i
K
4550 7567.28 0 95.61 P
14.92 -2.3 24.43 -10.51 37.55 -32.81 c
13.89 -25.63 p
13.89 -25.38 32.66 -38.45 55.04 -38.45 c
15.18 0 29.32 6.18 39.09 16.94 c
9.77 10.77 14.41 24.09 14.41 41.26 c
0 23.07 -8.21 40.23 -23.6 50.23 c
-9.74 6.41 -21.02 9.23 -39.48 9.74 c
0 -22.57 p
12.23 -0.77 19.63 -2.3 25.49 -5.38 c
10.96 -5.9 17.59 -17.7 17.59 -31.29 c
0 -20.52 -14.64 -35.91 -34.12 -35.91 c
-14.35 0 -26.65 8.48 -35.87 24.64 c
-13.33 23.59 p
-21.52 37.96 -38.7 48.98 -78.67 51.04 c
0 -120.99 h
f
4528 7504.99 27.0078 27.0078 re
f
4550 7353.28 0 95.61 P
14.92 -2.3 24.43 -10.51 37.55 -32.81 c
13.89 -25.63 p
13.89 -25.38 32.66 -38.45 55.04 -38.45 c
15.18 0 29.32 6.18 39.09 16.94 c
9.77 10.77 14.41 24.09 14.41 41.26 c
0 23.07 -8.21 40.23 -23.6 50.23 c
-9.74 6.41 -21.02 9.23 -39.48 9.74 c
0 -22.57 p
12.23 -0.77 19.63 -2.3 25.49 -5.38 c
10.96 -5.9 17.59 -17.7 17.59 -31.29 c
0 -20.52 -14.64 -35.91 -34.12 -35.91 c
-14.35 0 -26.65 8.48 -35.87 24.64 c
-13.33 23.59 p
-21.52 37.96 -38.7 48.98 -78.67 51.04 c
0 -120.99 h
f
Q q
200 2550 5440 0 0 5670 ^ Y
0.25683 i
K
5045 7567.28 0 95.61 P
14.92 -2.3 24.43 -10.51 37.55 -32.81 c
13.89 -25.63 p
13.89 -25.38 32.66 -38.45 55.04 -38.45 c
15.18 0 29.32 6.18 39.09 16.94 c
9.77 10.77 14.41 24.09 14.41 41.26 c
0 23.07 -8.21 40.23 -23.6 50.23 c
-9.74 6.41 -21.02 9.23 -39.48 9.74 c
0 -22.57 p
12.23 -0.77 19.63 -2.3 25.49 -5.38 c
10.96 -5.9 17.59 -17.7 17.59 -31.29 c
0 -20.52 -14.64 -35.91 -34.12 -35.91 c
-14.35 0 -26.65 8.48 -35.87 24.64 c
-13.33 23.59 p
-21.52 37.96 -38.7 48.98 -78.67 51.04 c
0 -120.99 h
f
5023 7504.99 27.0078 27.0078 re
f
5067 7399 -44 0 0 -23 ^ 0 -26.55 20 0 ^ 118 0 
0 16.77 -114.19 83.04 -23.81 0 H
5087 7399 0 57.03 79.57 -57.03 H
f
Q q
200 2550 5440 5670 re
Y
7.5 w
K
1070.56 2834.17 4298.39 0 S
1193.37 2968.54 0 -134.37 S
1316.18 2901.35 0 -67.18 S
1438.99 2901.35 0 -67.18 S
1561.8 2901.35 0 -67.18 S
1684.62 2968.54 0 -134.37 S
1807.43 2901.35 0 -67.18 S
1930.24 2901.35 0 -67.18 S
2053.05 2901.35 0 -67.18 S
2175.86 2968.54 0 -134.37 S
2298.67 2901.35 0 -67.18 S
2421.48 2901.35 0 -67.18 S
2544.29 2901.35 0 -67.18 S
2667.1 2968.54 0 -134.37 S
2789.91 2901.35 0 -67.18 S
2912.73 2901.35 0 -67.18 S
3035.54 2901.35 0 -67.18 S
3158.35 2968.54 0 -134.37 S
3281.16 2901.35 0 -67.18 S
3403.97 2901.35 0 -67.18 S
3526.78 2901.35 0 -67.18 S
3649.59 2968.54 0 -134.37 S
3772.4 2901.35 0 -67.18 S
3895.21 2901.35 0 -67.18 S
4018.03 2901.35 0 -67.18 S
4140.84 2968.54 0 -134.37 S
4263.65 2901.35 0 -67.18 S
4386.46 2901.35 0 -67.18 S
4509.27 2901.35 0 -67.18 S
4632.08 2968.54 0 -134.37 S
4754.89 2901.35 0 -67.18 S
4877.7 2901.35 0 -67.18 S
5000.51 2901.35 0 -67.18 S
5123.33 2968.54 0 -134.37 S
1193.37 2968.54 0 -134.37 S
1070.56 2901.35 0 -67.18 S
5123.33 2968.54 0 -134.37 S
5246.14 2901.35 0 -67.18 S
5368.95 2901.35 0 -67.18 S
255 0 r5
2432.1 7118.19 10.13 -97.37 3.13 -97.36 -10.78 -97.37 -7 -97.36 17.62 -97.36 -0.26 -97.37 -13.72 -97.36 
-19.9 -97.37 -24.63 -97.36 -16.4 -97.36 35.55 -97.37 -74.49 -97.36 9.01 -97.37 -94.8 -97.36 39.37 -97.36 
18.56 -97.37 26.2 -97.36 -43.28 -97.36 45.14 -97.37 -0.75 -97.36 6.37 -97.37 18.12 -97.36 -23.81 -194.73 
47.39 -194.73 48.02 -194.72 -14.51 -194.73 -27.58 -194.73 -5.95 -194.73 9.95 -194.73 12.15 -194.72 19.62 -194.73 
15.64 -194.73 -460.95 0 15.36 194.73 -3.23 194.73 21.58 194.72 -23.16 194.73 -14.75 194.73 -1.82 194.73 
-16.12 194.73 32.05 194.72 -8.17 194.73 -21.47 194.73 6.38 97.36 -5.37 97.37 17.77 97.36 -64.41 97.37 
35.65 97.36 -24.73 97.36 37.18 97.37 -102.56 97.36 64.22 97.36 42.22 97.37 2.12 97.36 -14.38 97.37 
31.58 97.36 -8.99 97.36 -43.56 97.37 16.08 97.36 -2.57 97.37 -28.95 97.36 41.66 97.36 -27.76 97.37 
-7.4 97.36 -7.03 97.37 f*
0 255 r6
2307.34 7118.19 6.42 -97.37 -1.16 -97.36 0.17 -97.37 -6.77 -97.36 6.45 -97.36 3.57 -97.37 -5.82 -97.36 
-10.43 -97.37 -16.56 -97.36 -10.84 -97.36 20.77 -97.37 -49.22 -97.36 -5.4 -97.37 -86.7 -97.36 56.51 -97.36 
4.3 -97.37 18.24 -97.36 -36.47 -97.36 52.33 -97.37 -3.76 -97.36 6.64 -97.37 8.04 -97.36 -8.72 -194.73 
29.92 -194.73 29.81 -194.72 -5.59 -194.73 -12.9 -194.73 -1.18 -194.73 7.22 -194.73 4.86 -194.72 15.74 -194.73 
3.78 -194.73 -230.47 0 11.72 194.73 -7.55 194.73 12.01 194.72 -13.83 194.73 -9.18 194.73 -1.8 194.73 
-9.71 194.73 10.22 194.72 -10.31 194.73 -13.91 194.73 4.2 97.36 -6.14 97.37 12.27 97.36 -61.96 97.37 
32.65 97.36 -17.51 97.36 23.57 97.37 -88.09 97.36 71.4 97.36 31.02 97.37 13.03 97.36 -10.19 97.37 
18.43 97.36 -0.25 97.36 -21.29 97.37 6.99 97.36 -4.98 97.37 -12.11 97.36 24.09 97.36 -19.43 97.37 
-0.98 97.36 -4.87 97.37 f*
K
2182.57 7118.19 2.72 -97.37 -5.44 -97.36 11.11 -97.37 -6.53 -97.36 -4.73 -97.36 7.39 -97.37 2.1 -97.36 
-0.97 -97.37 -8.5 -97.36 -5.28 -97.36 5.99 -97.37 -23.93 -97.36 -19.83 -97.37 -78.58 -97.36 73.64 -97.36 
-9.96 -97.37 10.29 -97.36 -29.67 -97.36 59.52 -97.37 -6.77 -97.36 6.91 -97.37 -2.03 -97.36 6.36 -194.73 
12.45 -194.73 11.61 -194.72 3.31 -194.73 1.78 -194.73 3.61 -194.73 4.48 -194.73 -2.43 -194.72 11.86 -194.73 
-8.08 -194.73 S
Q q
200 2550 5440 0 0 5670 ^ Y
0.25683 i
K
4648 4701 0 124.03 -18.01 0 ^ H
4604.01 4701 0 124.03 -18.01 0 ^ H
f
4686.64 4551 -129.64 0 0 -23 182.04 0 0 14.88 P
-28.02 7.95 -31.87 13.07 -36.23 47.93 c
-16.17 0 h
f
4601 4390 -44 0 0 -23 ^ 0 -26.55 20 0 ^ 118 0 
0 16.77 -114.19 83.04 -23.81 0 H
4621 4390 0 57.03 79.57 -57.03 H
f
4723 4169 0 -61.3 21 0 0 146.91 ^ 0 -61.61 -166 0 0 -24 H
f
4617 3971 m
20.45 0 32.73 1.56 42.7 5.39 c
21.99 8.7 35.3 29.16 35.3 54.24 c
0 37.35 -28.71 61.4 -72.78 61.4 c
-44.07 0 -71.23 -23.23 -71.23 -60.77 c
0 -30.64 17.5 -51.83 46.84 -57.2 c
0 21.5 p
-17.64 5.88 -26.84 17.9 -26.84 35.04 c
0 13.56 6.13 25.07 17.38 32.23 c
7.67 5.12 15.33 6.91 28.63 7.16 c
h
4634.01 4069.87 m
24.84 -1.8 40.98 -16.95 40.98 -38.52 c
0 -21.06 -17.42 -37.24 -39.45 -37.24 c
-0.51 0 -1.02 0 -1.54 0.25 c
h
f
4557 3859.32 187 -64.98 0 25.43 -158.24 51.88 158.24 54.96 0 25.68 -187 -67.29 H
f
Q q
200 2550 5440 0 0 5670 ^ Y
0.25683 i
K
4654.08 4920.51 m
26.18 0.27 40.92 17.75 40.92 48.84 c
0 31.35 -16.12 51.65 -40.92 51.65 c
-20.96 0 -30.93 -10.85 -38.6 -42.89 c
-4.86 -20.16 p
-3.58 -14.99 -8.95 -20.94 -18.66 -20.94 c
-12.53 0 -20.96 12.66 -20.96 31.5 c
0 11.62 3.32 21.43 8.95 26.85 c
3.83 3.36 7.66 4.91 17.12 6.2 c
0 22.72 p
-31.14 -1.03 -46.07 -18.51 -46.07 -53.73 c
0 -33.93 16.62 -55.54 42.44 -55.54 c
19.94 0 30.93 11.38 37.32 38.25 c
4.86 20.67 p
4.09 17.57 9.71 25.06 19.17 25.06 c
12.27 0 20.21 -11.1 20.21 -28.65 c
0 -17.3 -7.22 -26.59 -20.91 -27.11 c
h
f
Q q
200 2550 5440 5670 re
Y
15 w
K
4699.29 5195.11 -152.2 -104.63 S
0 w
4547.09 5090.48 228.29 -28.54 S
4775.38 5061.94 0 -152.2 S
Q q
200 2550 5440 0 0 5670 ^ Y
0.2 i
K
4133.65 3388.46 m
26.22 -19.91 62.64 -32.46 94.07 -32.46 c
31.62 0 68.05 12.55 94.27 32.46 c
0 10.95 p
-28.63 -17.6 -62.25 -27.41 -94.27 -27.41 c
-31.82 0 -65.65 9.8 -94.07 27.41 c
h
f
Q q
200 2550 5440 0 0 5670 ^ Y
0.2 i
K
4259 3412.54 17.01 0 0 45.35 P
0 15.78 -1.83 26.56 -5.85 35.75 c
-8.83 19.37 -24.49 30.36 -43.16 30.36 c
-13.05 0 -26.3 -4.97 -36.73 -14.11 c
-12.04 -10.34 -17.26 -21.67 -17.26 -37.37 c
0 -13.52 4.24 -25.05 12.52 -34.19 c
8.27 -8.95 19.78 -14.32 30.68 -14.32 c
15.34 0 30.48 11.43 42.8 32.29 c
h
4259 3465.86 m
-17.9 -17.07 -25.54 -20.86 -42.02 -20.86 c
-20.9 0 -34.97 9.94 -34.97 24.63 c
0 18.27 20.3 33.36 45.02 33.36 c
19.29 0 31.97 -12.31 31.97 -30.97 c
h
f
Q q
200 2550 5440 0 0 5670 ^ Y
0.2 i
K
4277.17 3556 -101.17 0 0 -17 142.05 0 0 11.51 P
-21.84 6.15 -24.85 10.12 -28.26 37.12 c
-12.62 0 h
f
Q q
200 2550 5440 0 0 5670 ^ Y
0.2 i
K
4187 3775.8 -11 0 0 -104.67 ^ H
4308.24 3718 0 11 -47.24 0 0 47 -11 0 ^ -48.23 0 0 -11 
^ 0 -47.67 11 0 ^ H
f
Q q
200 2550 5440 0 0 5670 ^ Y
0.2 i
K
4322 4752 0 17 -119.43 0 119.43 76.68 0 20.32 -146 0 0 -17 118.05 0 
-118.05 -75.86 0 -21.14 H
f
4322 4608 0 17 -119.43 0 119.43 76.68 0 20.32 -146 0 0 -17 118.05 0 
-118.05 -75.86 0 -21.14 H
f
4322 4557.99 0 19.01 -146 0 0 -90.03 16 0 0 71.02 H
f
4324 4404.71 m
0 41.85 -30.85 70.29 -76.51 70.29 c
-45.66 0 -76.5 -28.43 -76.5 -70.48 c
0 -17.62 5.41 -33.44 15.42 -45.26 c
13.41 -15.82 36.04 -25.25 59.87 -25.25 c
47.06 0 77.71 27.86 77.71 70.71 c
h
4307.99 4404.71 m
0 -31.41 -24.21 -51.7 -61.31 -51.7 c
-35.48 0 -59.68 20.89 -59.68 51.5 c
0 30.81 24.19 51.48 60.48 51.48 c
36.29 0 60.51 -20.68 60.51 -51.29 c
h
f
4322 4225.25 -149.99 47.34 0 -10.98 ^ H
f
4322 4124.99 0 19.01 -146 0 0 -90.03 16 0 0 71.02 H
f
4324 3971.71 m
0 41.85 -30.85 70.29 -76.51 70.29 c
-45.66 0 -76.5 -28.43 -76.5 -70.48 c
0 -17.62 5.41 -33.44 15.42 -45.26 c
13.41 -15.82 36.04 -25.25 59.87 -25.25 c
47.06 0 77.71 27.86 77.71 70.71 c
h
4307.99 3971.71 m
0 -31.41 -24.21 -51.7 -61.31 -51.7 c
-35.48 0 -59.68 20.89 -59.68 51.5 c
0 30.81 24.19 51.48 60.48 51.48 c
36.29 0 60.51 -20.68 60.51 -51.29 c
h
f
4322 3790.76 m
-26.23 19.79 -62.65 32.25 -94.07 32.25 c
-31.62 0 -68.05 -12.46 -94.27 -32.25 c
0 -10.89 p
28.62 17.43 62.25 27.13 94.27 27.13 c
31.82 0 65.65 -9.7 94.07 -27.13 c
h
f
Q q
200 2550 5440 5670 re
Y
0 255 r6
4139.28 4965.82 174.109 283.465 re
f*
30 w
K
4226.34 5249.29 0 -283.46 S
Q q
200 2550 5440 0 0 5670 ^ Y
0.2 i
K
3800.65 3359.46 m
26.22 -19.91 62.64 -32.46 94.07 -32.46 c
31.62 0 68.05 12.55 94.27 32.46 c
0 10.95 p
-28.63 -17.6 -62.25 -27.41 -94.27 -27.41 c
-31.82 0 -65.65 9.8 -94.07 27.41 c
h
f
Q q
200 2550 5440 0 0 5670 ^ Y
0.2 i
K
3926 3384.54 17.01 0 0 45.35 P
0 15.78 -1.83 26.56 -5.85 35.75 c
-8.83 19.37 -24.49 30.36 -43.16 30.36 c
-13.05 0 -26.3 -4.97 -36.73 -14.11 c
-12.04 -10.34 -17.26 -21.67 -17.26 -37.37 c
0 -13.52 4.24 -25.05 12.52 -34.19 c
8.27 -8.95 19.78 -14.32 30.68 -14.32 c
15.34 0 30.48 11.43 42.8 32.29 c
h
3926 3437.86 m
-17.9 -17.07 -25.54 -20.86 -42.02 -20.86 c
-20.9 0 -34.97 9.94 -34.97 24.63 c
0 18.27 20.3 33.36 45.02 33.36 c
19.29 0 31.97 -12.31 31.97 -30.97 c
h
f
Q q
200 2550 5440 0 0 5670 ^ Y
0.2 i
K
3860.01 3507.02 0 74.44 P
11.65 -1.8 19.09 -8.18 29.33 -25.55 c
10.85 -19.95 p
10.85 -19.76 25.52 -29.95 43 -29.95 c
11.85 0 22.9 4.8 30.54 13.19 c
7.64 8.38 11.27 18.76 11.27 32.13 c
0 17.96 -6.45 31.33 -18.52 39.11 c
-7.65 4.99 -16.51 7.18 -31 7.58 c
0 -17.55 p
9.52 -0.6 15.26 -1.8 19.82 -4.19 c
8.52 -4.59 13.68 -13.76 13.68 -24.33 c
0 -15.96 -11.39 -27.93 -26.54 -27.93 c
-11.16 0 -20.73 6.59 -27.91 19.16 c
-10.36 18.35 p
-16.74 29.52 -30.1 38.1 -61.19 39.69 c
0 -94.19 h
f
Q q
200 2550 5440 0 0 5670 ^ Y
0.2 i
K
3854 3775.8 -11 0 0 -104.67 ^ H
3975.24 3718 0 11 -47.24 0 0 47 -11 0 ^ -48.23 0 0 -11 
^ 0 -47.67 11 0 ^ H
f
Q q
200 2550 5440 0 0 5670 ^ Y
0.2 i
K
3989 4752 0 17 -119.43 0 119.43 76.68 0 20.32 -146 0 0 -17 118.05 0 
-118.05 -75.86 0 -21.14 H
f
3989 4608 0 17 -119.43 0 119.43 76.68 0 20.32 -146 0 0 -17 118.05 0 
-118.05 -75.86 0 -21.14 H
f
3989 4557.99 0 19.01 -146 0 0 -90.03 16 0 0 71.02 H
f
3991 4404.71 m
0 41.85 -30.85 70.29 -76.51 70.29 c
-45.66 0 -76.5 -28.43 -76.5 -70.48 c
0 -17.62 5.41 -33.44 15.42 -45.26 c
13.41 -15.82 36.04 -25.25 59.87 -25.25 c
47.06 0 77.71 27.86 77.71 70.71 c
h
3974.99 4404.71 m
0 -31.41 -24.21 -51.7 -61.31 -51.7 c
-35.48 0 -59.68 20.89 -59.68 51.5 c
0 30.81 24.19 51.48 60.48 51.48 c
36.29 0 60.51 -20.68 60.51 -51.29 c
h
f
3989 4225.25 -149.99 47.34 0 -10.98 ^ H
f
3989 4124.99 0 19.01 -146 0 0 -90.03 16 0 0 71.02 H
f
3991 3971.71 m
0 41.85 -30.85 70.29 -76.51 70.29 c
-45.66 0 -76.5 -28.43 -76.5 -70.48 c
0 -17.62 5.41 -33.44 15.42 -45.26 c
13.41 -15.82 36.04 -25.25 59.87 -25.25 c
47.06 0 77.71 27.86 77.71 70.71 c
h
3974.99 3971.71 m
0 -31.41 -24.21 -51.7 -61.31 -51.7 c
-35.48 0 -59.68 20.89 -59.68 51.5 c
0 30.81 24.19 51.48 60.48 51.48 c
36.29 0 60.51 -20.68 60.51 -51.29 c
h
f
3989 3790.76 m
-26.23 19.79 -62.65 32.25 -94.07 32.25 c
-31.62 0 -68.05 -12.46 -94.27 -32.25 c
0 -10.89 p
28.62 17.43 62.25 27.13 94.27 27.13 c
31.82 0 65.65 -9.7 94.07 -27.13 c
h
f
Q q
200 2550 5440 5670 re
Y
255 0 r5
3812.82 4965.82 174.113 283.465 re
f*
30 w
K
3899.88 5249.29 0 -283.46 S
Q q
200 2550 5440 0 0 5670 ^ Y
0.25683 i
K
5181 5857.12 0 38.52 -187 39.81 0 -128.16 32.01 -6.93 0 89.63 H
f
5079 5650.81 -85 17.98 0 -38.53 187 -39.81 0 38.78 -70 14.9 0 73.96 70 -14.89 
0 38.52 -187 39.81 ^ 85 -17.98 H
f
5117.79 5411.37 m
7.16 -0.77 9.97 -1.04 12.78 -1.04 c
31.7 0 53.43 26.89 53.43 66.58 c
0 31.5 -13.63 58.9 -39.54 79.64 c
-22.57 18.18 -57.2 29.45 -90.3 29.45 c
-41.04 0 -66.18 -26.62 -66.18 -70.4 c
0 -46.6 25.97 -80.9 69.95 -92.17 c
0 36.66 p
-23.61 7.43 -36.95 25.63 -36.95 50.23 c
0 24.86 13.82 37.67 40.69 37.67 c
20.98 0 43.5 -6.66 61.41 -18.2 c
18.94 -12.05 27.9 -27.94 27.9 -48.45 c
0 -13.59 -4.82 -24.1 -13.44 -29.48 c
-5.07 -3.33 -9.88 -4.36 -19.77 -4.36 c
h
f
5079 5208.81 -85 17.98 0 -38.53 187 -39.81 0 38.78 -70 14.9 0 73.96 70 -14.89 
0 38.52 -187 39.81 ^ 85 -17.98 H
f
5181 5076.49 0 38.52 -187 39.81 ^ H
f
5095 4895.82 0 74.86 -32.01 6.92 0 -42.55 P
-10.63 3.34 -17.11 6.92 -23.85 13.84 c
-11.66 11.54 -18.14 26.66 -18.14 41.52 c
0 25.12 19.45 43.58 45.8 43.58 c
18.17 0 41.45 -6.66 55.53 -15.89 c
18.94 -12.3 28.66 -29.73 28.66 -51.52 c
0 -24.35 -10.63 -38.96 -29.61 -41.01 c
0 -35.37 p
3.58 -0.26 6.39 -0.54 8.43 -0.54 c
32.2 0 54.19 27.93 54.19 69.67 c
0 31.5 -12.86 59.41 -37.23 80.41 c
-23.34 19.97 -55.92 32.27 -85.68 32.27 c
-44.63 0 -73.11 -28.68 -73.11 -73.75 c
0 -23.82 8.25 -40.71 28.62 -59.67 c
-23.21 1.79 0 -23.05 h
f
5095 4695.82 0 74.86 -32.01 6.92 0 -42.55 P
-10.63 3.34 -17.11 6.92 -23.85 13.84 c
-11.66 11.54 -18.14 26.66 -18.14 41.52 c
0 25.12 19.45 43.58 45.8 43.58 c
18.17 0 41.45 -6.66 55.53 -15.89 c
18.94 -12.3 28.66 -29.73 28.66 -51.52 c
0 -24.35 -10.63 -38.96 -29.61 -41.01 c
0 -35.37 p
3.58 -0.26 6.39 -0.54 8.43 -0.54 c
32.2 0 54.19 27.93 54.19 69.67 c
0 31.5 -12.86 59.41 -37.23 80.41 c
-23.34 19.97 -55.92 32.27 -85.68 32.27 c
-44.63 0 -73.11 -28.68 -73.11 -73.75 c
0 -23.82 8.25 -40.71 28.62 -59.67 c
-23.21 1.79 0 -23.05 h
f
5124.21 4516.05 m
7.15 -1.53 10.73 -2.05 15.84 -2.05 c
27.59 0 43.95 23.83 43.95 64.54 c
0 24.84 -6.17 44.3 -18.98 58.9 c
-12.55 14.6 -31.77 23.56 -49.97 23.56 c
-21.27 0 -32.55 -12.79 -38.7 -43.23 c
-5.12 -25.07 p
-4.61 -23.28 -9.73 -30.7 -21.78 -30.7 c
-17.17 0 -28.45 17.07 -28.45 43.57 c
0 23.18 8.46 36.43 23.08 36.43 c
1.28 0 3.59 -0.02 5.9 -0.05 c
0 37.04 p
-5.15 0.76 -7.72 1.01 -11.32 1.01 c
-13.63 0 -25.46 -5.11 -33.95 -14.3 c
-11.32 -12.25 -16.72 -29.87 -16.72 -54.38 c
0 -31.15 8.97 -54.89 26.14 -69.7 c
12.04 -10.73 30.75 -17.64 47.66 -17.64 c
19.73 0 33.06 14.07 38.18 40.17 c
5.64 27.88 p
4.87 24.05 8.97 30.96 18.71 30.96 c
16.4 0 26.67 -14.45 26.67 -37.92 c
0 -21.93 -7.33 -34.06 -20.98 -34.06 c
-1.26 0 -3.54 0.4 -5.81 0.79 c
h
f
5089.42 4329.84 91.58 -77.82 0 44.95 -60.39 47 60.39 20.29 0 45.71 -92.86 -37.24 -94.14 79.62 
0 -44.95 63.95 -48.54 -63.95 -23.11 0 -45.97 H
f
5124.21 4102.05 m
7.15 -1.53 10.73 -2.05 15.84 -2.05 c
27.59 0 43.95 23.83 43.95 64.54 c
0 24.84 -6.17 44.3 -18.98 58.9 c
-12.55 14.6 -31.77 23.56 -49.97 23.56 c
-21.27 0 -32.55 -12.79 -38.7 -43.23 c
-5.12 -25.07 p
-4.61 -23.28 -9.73 -30.7 -21.78 -30.7 c
-17.17 0 -28.45 17.07 -28.45 43.57 c
0 23.18 8.46 36.43 23.08 36.43 c
1.28 0 3.59 -0.02 5.9 -0.05 c
0 37.04 p
-5.15 0.76 -7.72 1.01 -11.32 1.01 c
-13.63 0 -25.46 -5.11 -33.95 -14.3 c
-11.32 -12.25 -16.72 -29.87 -16.72 -54.38 c
0 -31.15 8.97 -54.89 26.14 -69.7 c
12.04 -10.73 30.75 -17.64 47.66 -17.64 c
19.73 0 33.06 14.07 38.18 40.17 c
5.64 27.88 p
4.87 24.05 8.97 30.96 18.71 30.96 c
16.4 0 26.67 -14.45 26.67 -37.92 c
0 -21.93 -7.33 -34.06 -20.98 -34.06 c
-1.26 0 -3.54 0.4 -5.81 0.79 c
h
f
4994 3856.52 187 -91.69 0 40.84 -140.52 57.79 140.52 -0.77 0 40.58 -140 57.53 140 -0.77 
0 40.84 -187 -13.1 0 -34.67 142.54 -60.87 -142.54 -1.03 H
f
5095 3596.82 0 74.86 -32.01 6.92 0 -42.55 P
-10.63 3.34 -17.11 6.92 -23.85 13.84 c
-11.66 11.54 -18.14 26.66 -18.14 41.52 c
0 25.12 19.45 43.58 45.8 43.58 c
18.17 0 41.45 -6.66 55.53 -15.89 c
18.94 -12.3 28.66 -29.73 28.66 -51.52 c
0 -24.35 -10.63 -38.96 -29.61 -41.01 c
0 -35.37 p
3.58 -0.26 6.39 -0.54 8.43 -0.54 c
32.2 0 54.19 27.93 54.19 69.67 c
0 31.5 -12.86 59.41 -37.23 80.41 c
-23.34 19.97 -55.92 32.27 -85.68 32.27 c
-44.63 0 -73.11 -28.68 -73.11 -73.75 c
0 -23.82 8.25 -40.71 28.62 -59.67 c
-23.21 1.79 0 -23.05 h
f
5026.01 3392.08 0 76.9 P
9.51 -6.41 15.16 -13.84 34.44 -44.34 c
13.36 -21.28 20.82 -30.76 30.58 -38.96 c
12.85 -10.77 28.53 -16.67 44.72 -16.67 c
27.76 0 44.24 19.75 44.24 53.05 c
0 39.71 -24.17 65.85 -67.34 72.51 c
0 -34.19 p
24.79 -3.32 38.33 -14.8 38.33 -32.4 c
0 -13.78 -7.73 -21.96 -20.55 -21.96 c
-11.8 0 -24.11 5.14 -32.83 13.83 c
-8.46 7.92 -14.36 16.35 -32.57 45.48 c
-21.29 35.52 -37.19 48.04 -71.04 56.98 c
0 -123.55 h
f
5179.99 3278.62 m
0 29.04 -16.71 52.69 -47.04 66.82 c
-23.64 10.8 -67.85 20.56 -93.81 20.56 c
-31.61 0 -51.15 -18.5 -51.15 -48.83 c
0 -29.82 16.45 -53.46 47.04 -67.59 c
23.39 -10.8 68.11 -20.59 94.07 -20.59 c
31.62 0 50.89 18.79 50.89 49.63 c
h
5150.99 3285.64 m
0 -11.98 -8.5 -19.64 -21.62 -19.64 c
-15.95 0 -50.43 5.88 -74.86 12.76 c
-25.47 7.14 -35.5 15.81 -35.5 30.86 c
0 11.73 8.49 19.38 21.61 19.38 c
24.96 0 82.07 -12.5 95.7 -20.91 c
9.78 -6.12 14.67 -13.52 14.67 -22.44 c
h
f
5119.59 3156.16 -125.59 26.71 0 -35.96 182.09 -38.78 0 23.89 P
-21.57 10.27 -32.62 31.33 -32.62 62.66 c
-23.89 5.14 h
f
5179.99 2993.62 m
0 29.04 -16.71 52.69 -47.04 66.82 c
-23.64 10.8 -67.85 20.56 -93.81 20.56 c
-31.61 0 -51.15 -18.5 -51.15 -48.83 c
0 -29.82 16.45 -53.46 47.04 -67.59 c
23.39 -10.8 68.11 -20.59 94.07 -20.59 c
31.62 0 50.89 18.79 50.89 49.63 c
h
5150.99 3000.64 m
0 -11.98 -8.5 -19.64 -21.62 -19.64 c
-15.95 0 -50.43 5.88 -74.86 12.76 c
-25.47 7.14 -35.5 15.81 -35.5 30.86 c
0 11.73 8.49 19.38 21.61 19.38 c
24.96 0 82.07 -12.5 95.7 -20.91 c
9.78 -6.12 14.67 -13.52 14.67 -22.44 c
h
f
cleartomark end end pagesave restore
 showpage
%%PageTrailer
%%Trailer
%%Pages: 1
%%EOF
