%!PS-Adobe-2.0 EPSF-2.0
%%BoundingBox:  0 0 567 544
%%Title: pdfuncert.eps: pdfuncert
%%Creator: ROOT Version 5.18/00b
%%CreationDate: Wed Nov 24 11:47:52 2010
%%EndComments
%%BeginProlog
80 dict begin
/s {stroke} def /l {lineto} def /m {moveto} def /t {translate} def
/sw {stringwidth} def /r {rotate} def /rl {roll}  def /R {repeat} def
/d {rlineto} def /rm {rmoveto} def /gr {grestore} def /f {eofill} def
/c {setrgbcolor} def /black {0 setgray} def /sd {setdash} def
/cl {closepath} def /sf {scalefont setfont} def /lw {setlinewidth} def
/box {m dup 0 exch d exch 0 d 0 exch neg d cl} def
/NC{systemdict begin initclip end}def/C{NC box clip newpath}def
/bl {box s} def /bf {box f} def /Y { 0 exch d} def /X { 0 d} def 
/mp {newpath /y exch def /x exch def} def
/side {[w .77 mul w .23 mul] .385 w mul sd w 0 l currentpoint t -144 r} def
/mr {mp x y w2 0 360 arc} def /m24 {mr s} def /m20 {mr f} def
/mb {mp x y w2 add m w2 neg 0 d 0 w neg d w 0 d 0 w d cl} def
/mt {mp x y w2 add m w2 neg w neg d w 0 d cl} def
/m21 {mb f} def /m25 {mb s} def /m22 {mt f} def /m26{mt s} def
/m23 {mp x y w2 sub m w2 w d w neg 0 d cl f} def
/m27 {mp x y w2 add m w3 neg w2 neg d w3 w2 neg d w3 w2 d cl s} def
/m28 {mp x w2 sub y w2 sub w3 add m w3 0 d  0 w3 neg d w3 0 d 0 w3 d w3 0 d  0 w3 d w3 neg 0 d 0 w3 d w3 neg 0 d
 0 w3 neg d w3 neg 0 d cl s } def
/m29 {mp gsave x w2 sub y w2 add w3 sub m currentpoint t
 4 {side} repeat cl fill gr} def
/m30 {mp gsave x w2 sub y w2 add w3 sub m currentpoint t
 4 {side} repeat cl s gr} def
/m31 {mp x y w2 sub m 0 w d x w2 sub y m w 0 d x w2 sub y w2 add m w w neg d x w2 sub y w2
 sub m w w d s} def
/m2 {mp x y w2 sub m 0 w d x w2 sub y m w 0 d s} def
/m5 {mp x w2 sub y w2 sub m w w d x w2 sub y w2 add m w w neg d s} def
/reencdict 24 dict def /ReEncode {reencdict begin /nco&na exch def
/nfnam exch def /basefontname exch def /basefontdict basefontname findfont def
/newfont basefontdict maxlength dict def basefontdict {exch dup /FID ne
{dup /Encoding eq {exch dup length array copy newfont 3 1 roll put} {exch 
newfont 3 1 roll put} ifelse} {pop pop} ifelse } forall newfont
/FontName nfnam put nco&na aload pop nco&na length 2 idiv {newfont
/Encoding get 3 1 roll put} repeat nfnam newfont definefont pop end } def
/accvec [ 176 /agrave 181 /Agrave 190 /acircumflex 192 /Acircumflex
201 /adieresis 204 /Adieresis 209 /ccedilla 210 /Ccedilla 211 /eacute
212 /Eacute 213 /egrave 214 /Egrave 215 /ecircumflex 216 /Ecircumflex
217 /edieresis 218 /Edieresis 219 /icircumflex 220 /Icircumflex
221 /idieresis 222 /Idieresis 223 /ntilde 224 /Ntilde 226 /ocircumflex
228 /Ocircumflex 230 /Odieresis 231 /ucircumflex 236 /Ucircumflex
237 /udieresis 238 /Udieresis 239 /aring 240 /odieresis 242 /Aring 243 /ydieresis
244 /Ydieresis 246 /aacute 247 /Aacute 252 /ugrave 253 /Ugrave
127 /atilde 128 /Atilde 129 /oacute 130 /Oacute 131 /iacute
132 /Iacute 133 /igrave 134 /Igrave 135 /otilde 136 /Otilde
137 /uacute 138 /Uacute] def
/Times-Roman /Times-Roman accvec ReEncode
/Times-Italic /Times-Italic accvec ReEncode
/Times-Bold /Times-Bold accvec ReEncode
/Times-BoldItalic /Times-BoldItalic accvec ReEncode
/Helvetica /Helvetica accvec ReEncode
/Helvetica-Oblique /Helvetica-Oblique accvec ReEncode
/Helvetica-Bold /Helvetica-Bold accvec ReEncode
/Helvetica-BoldOblique /Helvetica-BoldOblique  accvec ReEncode
/Courier /Courier accvec ReEncode
/Courier-Oblique /Courier-Oblique accvec ReEncode
/Courier-Bold /Courier-Bold accvec ReEncode
/Courier-BoldOblique /Courier-BoldOblique accvec ReEncode
/oshow {gsave [] 0 sd true charpath stroke gr} def
/stwn { /fs exch def /fn exch def /text exch def fn findfont fs sf
 text sw pop xs add /xs exch def} def
/stwb { /fs exch def /fn exch def /nbas exch def /textf exch deftextf length /tlen exch def nbas tlen gt {/nbas tlendef} iffn findfont fs sf textf dup length nbas sub nbas getinterval sw
pop neg xs add /xs exch def} def
/accspe [ 65 /plusminus  66 /bar  67 /existential  68 /universal 
69 /exclam  70 /numbersign 71 /greater  72 /question  73 /integral 
74 /colon  75 /semicolon  76 /less  77 /bracketleft  78 /bracketright
79 /greaterequal 80 /braceleft 81 /braceright 82 /radical
83 /spade 84 /heart 85 /diamond 86 /club 87 /lessequal
88 /multiply 89 /percent 90 /infinity 48 /circlemultiply 49 /circleplus
50 /emptyset  51 /lozenge 52 /bullet 53 /arrowright 54 /arrowup
55 /arrowleft 56 /arrowdown 57 /arrowboth 48 /degree 44 /comma 43 /plus 45 /angle 42 /angleleft 47 /divide 61 /notequal 40 /equivalence 41 /second 97 /approxequal 98 /congruent 99 /perpendicular 100 /partialdiff 101 /florin 102 /intersection
 103 /union 104 /propersuperset 105 /reflexsuperset 106 /notsubset 107 /propersubset 108 /reflexsubset 109 /element 110 /notelement 111 /gradient 112 /logicaland 113 /logicalor 114 /arrowdblboth 115 /arrowdblleft 116 /arrowdblup 117 /arrowdblright
 118 /arrowdbldown 119 /ampersand 120 /omega1 121 /similar 122 /aleph ] def
/Symbol /Special accspe ReEncode
%%EndProlog
%%BeginSetup
%%EndSetup
newpath  gsave  .25 .25 scale  gsave  0 0 t black[  ] 0 sd 3 lw 1 1 1 c 2268 2176 0 0 bf black 1 1 1 c 1791 1720 363 348 bf black 1791 1720 363 348 bl 363 348 m 1791 X s
 gsave  2268 2176 0 0 C 1868 114 t 0 r /Helvetica findfont 102.732 sf 0 0 m ( [GeV]) show NC gr 
 gsave  2268 2176 0 0 C 1823 80 t 0 r /Helvetica findfont 68.4881 sf 0 0 m (H) show NC gr 
 gsave  2268 2176 0 0 C 1743 114 t 0 r /Helvetica findfont 102.732 sf 0 0 m (M) show NC gr  619 400 m -52 Y s 714 374 m -26 Y s 810 374 m -26 Y s 905 374 m -26 Y s 1000 400 m -52 Y s 1095 374 m -26 Y s 1191 374 m -26 Y s 1286 374 m -26 Y s 1381 400
 m -52 Y s 1477 374 m -26 Y s 1572 374 m -26 Y s 1667 374 m -26 Y s 1763 400 m -52 Y s 1858 374 m -26 Y s 1953 374 m -26 Y s 2048 374 m -26 Y s 2144 400 m -52 Y s 619 400 m -52 Y s 524 374 m -26 Y s 428 374 m -26 Y s 2144 400 m -52 Y s
 gsave  2268 2176 0 0 C 533 251 t 0 r /Helvetica findfont 102.732 sf 0 0 m (200) show NC gr 
 gsave  2268 2176 0 0 C 913 251 t 0 r /Helvetica findfont 102.732 sf 0 0 m (400) show NC gr 
 gsave  2268 2176 0 0 C 1297 251 t 0 r /Helvetica findfont 102.732 sf 0 0 m (600) show NC gr 
 gsave  2268 2176 0 0 C 1678 251 t 0 r /Helvetica findfont 102.732 sf 0 0 m (800) show NC gr 
 gsave  2268 2176 0 0 C 2028 251 t 0 r /Helvetica findfont 102.732 sf 0 0 m (1000) show NC gr  363 2068 m 1791 X s 619 2016 m 52 Y s 714 2042 m 26 Y s 810 2042 m 26 Y s 905 2042 m 26 Y s 1000 2016 m 52 Y s 1095 2042 m 26 Y s 1191 2042 m 26 Y s 1286
 2042 m 26 Y s 1381 2016 m 52 Y s 1477 2042 m 26 Y s 1572 2042 m 26 Y s 1667 2042 m 26 Y s 1763 2016 m 52 Y s 1858 2042 m 26 Y s 1953 2042 m 26 Y s 2048 2042 m 26 Y s 2144 2016 m 52 Y s 619 2016 m 52 Y s 524 2042 m 26 Y s 428 2042 m 26 Y s 2144 2016
 m 52 Y s 363 348 m 1720 Y s
 gsave  2268 2176 0 0 C 133 1899 t 90 r /Helvetica findfont 102.732 sf 0 0 m ( [%]) show NC gr 
 gsave  2268 2176 0 0 C 133 1838 t 90 r /Symbol findfont 102.732 sf 0 0 m (s) show NC gr 
 gsave  2268 2176 0 0 C 133 1804 t 90 r /Helvetica findfont 102.732 sf 0 0 m (/) show NC gr 
 gsave  2268 2176 0 0 C 171 1784 t 90 r /Helvetica findfont 68.4881 sf 0 0 m (\)) show NC gr 
 gsave  2268 2176 0 0 C 190 1762 t 90 r /Helvetica findfont 45.6587 sf 0 0 m (s) show NC gr 
 gsave  2268 2176 0 0 C 171 1716 t 90 r /Symbol findfont 68.4881 sf 0 0 m (a) show NC gr 
 gsave  2268 2176 0 0 C 171 1518 t 90 r /Helvetica findfont 68.4881 sf 0 0 m (PDF\(+) show NC gr 
 gsave  2268 2176 0 0 C 133 1457 t 90 r /Symbol findfont 102.732 sf 0 0 m (s) show NC gr 
 gsave  2268 2176 0 0 C 133 1393 t 90 r /Symbol findfont 102.732 sf 0 0 m (D) show NC gr  417 426 m -54 X s 390 465 m -27 X s 390 505 m -27 X s 390 544 m -27 X s 390 583 m -27 X s 417 622 m -54 X s 390 661 m -27 X s 390 700 m -27 X s 390 739 m -27 X
 s 390 778 m -27 X s 417 817 m -54 X s 390 856 m -27 X s 390 895 m -27 X s 390 934 m -27 X s 390 973 m -27 X s 417 1013 m -54 X s 390 1052 m -27 X s 390 1091 m -27 X s 390 1130 m -27 X s 390 1169 m -27 X s 417 1208 m -54 X s 390 1247 m -27 X s 390
 1286 m -27 X s 390 1325 m -27 X s 390 1364 m -27 X s 417 1403 m -54 X s 390 1442 m -27 X s 390 1481 m -27 X s 390 1521 m -27 X s 390 1560 m -27 X s 417 1599 m -54 X s 390 1638 m -27 X s 390 1677 m -27 X s 390 1716 m -27 X s 390 1755 m -27 X s 417
 1794 m -54 X s 390 1833 m -27 X s 390 1872 m -27 X s 390 1911 m -27 X s 390 1950 m -27 X s 417 1989 m -54 X s 417 426 m -54 X s 390 387 m -27 X s 417 1989 m -54 X s 390 2029 m -27 X s 390 2068 m -27 X s
 gsave  2268 2176 0 0 C 205 384 t 0 r /Helvetica findfont 102.732 sf 0 0 m (-40) show NC gr 
 gsave  2268 2176 0 0 C 205 578 t 0 r /Helvetica findfont 102.732 sf 0 0 m (-30) show NC gr 
 gsave  2268 2176 0 0 C 205 772 t 0 r /Helvetica findfont 102.732 sf 0 0 m (-20) show NC gr 
 gsave  2268 2176 0 0 C 205 970 t 0 r /Helvetica findfont 102.732 sf 0 0 m (-10) show NC gr 
 gsave  2268 2176 0 0 C 297 1164 t 0 r /Helvetica findfont 102.732 sf 0 0 m (0) show NC gr 
 gsave  2268 2176 0 0 C 240 1358 t 0 r /Helvetica findfont 102.732 sf 0 0 m (10) show NC gr 
 gsave  2268 2176 0 0 C 240 1556 t 0 r /Helvetica findfont 102.732 sf 0 0 m (20) show NC gr 
 gsave  2268 2176 0 0 C 240 1750 t 0 r /Helvetica findfont 102.732 sf 0 0 m (30) show NC gr 
 gsave  2268 2176 0 0 C 240 1944 t 0 r /Helvetica findfont 102.732 sf 0 0 m (40) show NC gr  2154 348 m 1720 Y s 2101 426 m 53 X s 2127 465 m 27 X s 2127 505 m 27 X s 2127 544 m 27 X s 2127 583 m 27 X s 2101 622 m 53 X s 2127 661 m 27 X s 2127 700 m
 27 X s 2127 739 m 27 X s 2127 778 m 27 X s 2101 817 m 53 X s 2127 856 m 27 X s 2127 895 m 27 X s 2127 934 m 27 X s 2127 973 m 27 X s 2101 1013 m 53 X s 2127 1052 m 27 X s 2127 1091 m 27 X s 2127 1130 m 27 X s 2127 1169 m 27 X s 2101 1208 m 53 X s
 2127 1247 m 27 X s 2127 1286 m 27 X s 2127 1325 m 27 X s 2127 1364 m 27 X s 2101 1403 m 53 X s 2127 1442 m 27 X s 2127 1481 m 27 X s 2127 1521 m 27 X s 2127 1560 m 27 X s 2101 1599 m 53 X s 2127 1638 m 27 X s 2127 1677 m 27 X s 2127 1716 m 27 X s
 2127 1755 m 27 X s 2101 1794 m 53 X s 2127 1833 m 27 X s 2127 1872 m 27 X s 2127 1911 m 27 X s 2127 1950 m 27 X s 2101 1989 m 53 X s 2101 426 m 53 X s 2127 387 m 27 X s 2101 1989 m 53 X s 2127 2029 m 27 X s 2127 2068 m 27 X s 6 lw 371 1233 m 19 1 d
 19 2 d 19 2 d 19 3 d 20 2 d 19 4 d 19 2 d 19 2 d 19 2 d 19 2 d 19 2 d 19 2 d 19 3 d 19 2 d 19 2 d 19 3 d 19 2 d 19 2 d 19 2 d 19 3 d 19 2 d 20 2 d 19 2 d 19 3 d 19 2 d 19 2 d 19 2 d 19 2 d 19 3 d 19 2 d 19 2 d 19 2 d 19 2 d 19 2 d 19 2 d 19 2 d 19
 2 d 19 2 d 20 2 d 19 2 d 19 2 d 19 2 d 19 2 d 19 2 d 19 2 d 19 2 d 19 2 d 19 2 d 19 2 d 19 2 d 19 2 d 19 1 d 19 2 d 19 2 d 19 2 d 20 2 d 19 2 d 19 2 d 19 2 d 19 2 d 19 2 d 19 1 d 19 2 d 19 2 d 19 2 d 19 2 d 19 2 d 19 2 d 19 1 d 19 2 d 19 2 d 19 2 d
 20 2 d 19 2 d 19 2 d 19 2 d 19 2 d 19 2 d 19 2 d 19 2 d 19 2 d 19 2 d 19 2 d 19 2 d 19 2 d 19 2 d 19 2 d 19 2 d 19 2 d 20 2 d 19 2 d 19 2 d 19 2 d s
 gsave  2268 2176 0 0 C 2222 392 t 90 r /Helvetica-BoldOblique findfont 41.8538 sf 0 0 m (LHC HIGGS XS WG 2010) show NC gr 
 gsave  2268 2176 0 0 C 453 438 t 0 r /Helvetica findfont 102.732 sf 0 0 m (Preliminary) show NC gr  1 1 1 c 3 lw 839 283 454 1523 bf 476 1523 m -15 Y 832 X 276 Y -15 X -261 Y f 454 1523 m 283 Y 839 X -283 Y -839 X cl s black
 gsave  2268 2176 0 0 C 662 1716 t 0 r /Helvetica findfont 72.293 sf 0 0 m (only PDF \(68%CL\)) show NC gr  6 lw 485 1736 m 147 X s
 gsave  2268 2176 0 0 C 917 1575 t 0 r /Helvetica findfont 72.293 sf 0 0 m (   \(68%CL\)) show NC gr 
 gsave  2268 2176 0 0 C 894 1552 t 0 r /Helvetica findfont 49.4636 sf 0 0 m (s) show NC gr 
 gsave  2268 2176 0 0 C 848 1575 t 0 r /Symbol findfont 72.293 sf 0 0 m (a) show NC gr 
 gsave  2268 2176 0 0 C 662 1575 t 0 r /Helvetica findfont 72.293 sf 0 0 m (PDF+) show NC gr [  12 12 ] 0 sd 485 1594 m 147 X s[  ] 0 sd 371 1233 m 19 1 d 19 2 d 19 2 d 19 3 d 20 2 d 19 4 d 19 2 d 19 2 d 19 2 d 19 2 d 19 2 d 19 2 d 19 3 d 19 2 d 19
 2 d 19 3 d 19 2 d 19 2 d 19 2 d 19 3 d 19 2 d 20 2 d 19 2 d 19 3 d 19 2 d 19 2 d 19 2 d 19 2 d 19 3 d 19 2 d 19 2 d 19 2 d 19 2 d 19 2 d 19 2 d 19 2 d 19 2 d 19 2 d 20 2 d 19 2 d 19 2 d 19 2 d 19 2 d 19 2 d 19 2 d 19 2 d 19 2 d 19 2 d 19 2 d 19 2 d
 19 2 d 19 1 d 19 2 d 19 2 d 19 2 d 20 2 d 19 2 d 19 2 d 19 2 d 19 2 d 19 2 d 19 1 d 19 2 d 19 2 d 19 2 d 19 2 d 19 2 d 19 2 d 19 1 d 19 2 d 19 2 d 19 2 d 20 2 d 19 2 d 19 2 d 19 2 d 19 2 d 19 2 d 19 2 d 19 2 d 19 2 d 19 2 d 19 2 d 19 2 d 19 2 d 19
 2 d 19 2 d 19 2 d 19 2 d 20 2 d 19 2 d 19 2 d 19 2 d s 371 1162 m 19 -1 d 19 X 19 -1 d 19 -1 d 20 -1 d 19 X 19 -2 d 19 -2 d 19 -2 d 19 -2 d 19 -2 d 19 -2 d 19 -2 d 19 -2 d 19 -2 d 19 -2 d 19 -2 d 19 -2 d 19 -2 d 19 -2 d 19 -2 d 20 -2 d 19 -2 d 19
 -2 d 19 -2 d 19 -2 d 19 -2 d 19 -2 d 19 -2 d 19 -2 d 19 -2 d 19 -2 d 19 -2 d 19 -2 d 19 -2 d 19 -2 d 19 -2 d 19 -2 d 20 -2 d 19 -1 d 19 -2 d 19 -2 d 19 -2 d 19 -2 d 19 -2 d 19 -2 d 19 -2 d 19 -2 d 19 -2 d 19 -2 d 19 -2 d 19 -2 d 19 -2 d 19 -2 d 19
 -2 d 20 -2 d 19 -2 d 19 -2 d 19 -2 d 19 -2 d 19 -2 d 19 -2 d 19 -2 d 19 -2 d 19 -2 d 19 -2 d 19 -2 d 19 -2 d 19 -2 d 19 -3 d 19 -2 d 19 -2 d 20 -2 d 19 -2 d 19 -2 d 19 -2 d 19 -2 d 19 -2 d 19 -2 d 19 -2 d 19 -2 d 19 -2 d 19 -2 d 19 -2 d 19 -2 d 19
 -3 d 19 -2 d 19 -2 d 19 -2 d 20 -2 d 19 -2 d 19 -2 d 19 -2 d s[  12 12 ] 0 sd 371 1148 m 19 -1 d 19 X 19 -1 d 19 -1 d 20 -2 d 19 X 19 -2 d 19 -2 d 19 -2 d 19 -2 d 19 -2 d 19 -2 d 19 -2 d 19 -2 d 19 -2 d 19 -2 d 19 -2 d 19 -2 d 19 -2 d 19 -2 d 19 -2
 d 20 -2 d 19 -2 d 19 -2 d 19 -2 d 19 -2 d 19 -2 d 19 -2 d 19 -2 d 19 -2 d 19 -2 d 19 -2 d 19 -2 d 19 -2 d 19 -2 d 19 -2 d 19 -2 d 19 -2 d 20 -2 d 19 -2 d 19 -2 d 19 -3 d 19 -2 d 19 -2 d 19 -2 d 19 -2 d 19 -2 d 19 -2 d 19 -2 d 19 -2 d 19 -3 d 19 -2
 d 19 -2 d 19 -2 d 19 -2 d 20 -2 d 19 -3 d 19 -2 d 19 -2 d 19 -2 d 19 -2 d 19 -2 d 19 -3 d 19 -2 d 19 -2 d 19 -2 d 19 -2 d 19 -3 d 19 -2 d 19 -2 d 19 -2 d 19 -3 d 20 -2 d 19 -2 d 19 -2 d 19 -3 d 19 -2 d 19 -2 d 19 -3 d 19 -2 d 19 -2 d 19 -3 d 19 -2
 d 19 -2 d 19 -3 d 19 -2 d 19 -2 d 19 -3 d 19 -2 d 20 -2 d 19 -3 d 19 -2 d 19 -3 d s 371 1274 m 19 X 19 1 d 19 X 19 1 d 20 1 d 19 1 d 19 1 d 19 1 d 19 1 d 19 1 d 19 2 d 19 1 d 19 3 d 19 3 d 19 3 d 19 2 d 19 3 d 19 3 d 19 3 d 19 3 d 19 3 d 20 3 d 19
 3 d 19 2 d 19 3 d 19 3 d 19 3 d 19 3 d 19 3 d 19 3 d 19 2 d 19 3 d 19 3 d 19 3 d 19 3 d 19 3 d 19 2 d 19 3 d 20 3 d 19 3 d 19 2 d 19 3 d 19 3 d 19 3 d 19 3 d 19 2 d 19 3 d 19 3 d 19 2 d 19 3 d 19 3 d 19 3 d 19 3 d 19 2 d 19 3 d 20 3 d 19 3 d 19 2 d
 19 3 d 19 3 d 19 3 d 19 2 d 19 3 d 19 3 d 19 3 d 19 3 d 19 2 d 19 3 d 19 3 d 19 3 d 19 3 d 19 3 d 20 3 d 19 3 d 19 3 d 19 3 d 19 3 d 19 3 d 19 3 d 19 3 d 19 3 d 19 3 d 19 3 d 19 3 d 19 3 d 19 3 d 19 3 d 19 3 d 19 4 d 20 3 d 19 3 d 19 3 d 19 3 d s
 gsave  2268 2176 0 0 C 1533 719 t 0 r /Helvetica findfont 79.9028 sf 0 0 m (=7 TeV) show NC gr 
 gsave  2268 2176 0 0 C 1495 719 t 0 r /Helvetica findfont 79.9028 sf 0 0 m (s) show NC gr [  ] 0 sd 1442 765 m 34 -50 d s 0 lw 1476 715 m 12 73 d s 1488 788 m 45 X s
 gsave  2268 2176 0 0 C 586 719 t 0 r /Helvetica findfont 79.9028 sf 0 0 m (bbh@nnlo, MSTW2008, ) show NC gr 
 gsave  2268 2176 0 0 C 1084 567 t 0 r /Helvetica findfont 53.2685 sf 0 0 m (H) show NC gr 
 gsave  2268 2176 0 0 C 1024 590 t 0 r /Helvetica findfont 79.9028 sf 0 0 m (M) show NC gr 
 gsave  2268 2176 0 0 C 982 544 t 0 r /Helvetica findfont 79.9028 sf 0 0 m (4) show NC gr 
 gsave  2268 2176 0 0 C 985 624 t 0 r /Helvetica findfont 79.9028 sf 0 0 m (1) show NC gr  6 lw 982 613 m 42 X s
 gsave  2268 2176 0 0 C 936 590 t 0 r /Helvetica findfont 79.9028 sf 0 0 m (=) show NC gr 
 gsave  2268 2176 0 0 C 902 548 t 0 r /Helvetica findfont 53.2685 sf 0 0 m (F) show NC gr 
 gsave  2268 2176 0 0 C 856 590 t 0 r /Symbol findfont 79.9028 sf 0 0 m (m) show NC gr 
 gsave  2268 2176 0 0 C 818 590 t 0 r /Helvetica findfont 79.9028 sf 0 0 m (, ) show NC gr 
 gsave  2268 2176 0 0 C 780 567 t 0 r /Helvetica findfont 53.2685 sf 0 0 m (H) show NC gr 
 gsave  2268 2176 0 0 C 670 590 t 0 r /Helvetica findfont 79.9028 sf 0 0 m (=M) show NC gr 
 gsave  2268 2176 0 0 C 632 548 t 0 r /Helvetica findfont 53.2685 sf 0 0 m (R) show NC gr 
 gsave  2268 2176 0 0 C 586 590 t 0 r /Symbol findfont 79.9028 sf 0 0 m (m) show NC gr 
 gr  gr 
showpage
end
%%EOF
