%!PS-Adobe-2.0 EPSF-2.0
%%BoundingBox:  0 0 567 544
%%Title: scaleuncert.eps: c1
%%Creator: ROOT Version 5.18/00b
%%CreationDate: Wed Nov 24 11:46:23 2010
%%EndComments
%%BeginProlog
80 dict begin
/s {stroke} def /l {lineto} def /m {moveto} def /t {translate} def
/sw {stringwidth} def /r {rotate} def /rl {roll}  def /R {repeat} def
/d {rlineto} def /rm {rmoveto} def /gr {grestore} def /f {eofill} def
/c {setrgbcolor} def /black {0 setgray} def /sd {setdash} def
/cl {closepath} def /sf {scalefont setfont} def /lw {setlinewidth} def
/box {m dup 0 exch d exch 0 d 0 exch neg d cl} def
/NC{systemdict begin initclip end}def/C{NC box clip newpath}def
/bl {box s} def /bf {box f} def /Y { 0 exch d} def /X { 0 d} def 
/mp {newpath /y exch def /x exch def} def
/side {[w .77 mul w .23 mul] .385 w mul sd w 0 l currentpoint t -144 r} def
/mr {mp x y w2 0 360 arc} def /m24 {mr s} def /m20 {mr f} def
/mb {mp x y w2 add m w2 neg 0 d 0 w neg d w 0 d 0 w d cl} def
/mt {mp x y w2 add m w2 neg w neg d w 0 d cl} def
/m21 {mb f} def /m25 {mb s} def /m22 {mt f} def /m26{mt s} def
/m23 {mp x y w2 sub m w2 w d w neg 0 d cl f} def
/m27 {mp x y w2 add m w3 neg w2 neg d w3 w2 neg d w3 w2 d cl s} def
/m28 {mp x w2 sub y w2 sub w3 add m w3 0 d  0 w3 neg d w3 0 d 0 w3 d w3 0 d  0 w3 d w3 neg 0 d 0 w3 d w3 neg 0 d
 0 w3 neg d w3 neg 0 d cl s } def
/m29 {mp gsave x w2 sub y w2 add w3 sub m currentpoint t
 4 {side} repeat cl fill gr} def
/m30 {mp gsave x w2 sub y w2 add w3 sub m currentpoint t
 4 {side} repeat cl s gr} def
/m31 {mp x y w2 sub m 0 w d x w2 sub y m w 0 d x w2 sub y w2 add m w w neg d x w2 sub y w2
 sub m w w d s} def
/m2 {mp x y w2 sub m 0 w d x w2 sub y m w 0 d s} def
/m5 {mp x w2 sub y w2 sub m w w d x w2 sub y w2 add m w w neg d s} def
/reencdict 24 dict def /ReEncode {reencdict begin /nco&na exch def
/nfnam exch def /basefontname exch def /basefontdict basefontname findfont def
/newfont basefontdict maxlength dict def basefontdict {exch dup /FID ne
{dup /Encoding eq {exch dup length array copy newfont 3 1 roll put} {exch 
newfont 3 1 roll put} ifelse} {pop pop} ifelse } forall newfont
/FontName nfnam put nco&na aload pop nco&na length 2 idiv {newfont
/Encoding get 3 1 roll put} repeat nfnam newfont definefont pop end } def
/accvec [ 176 /agrave 181 /Agrave 190 /acircumflex 192 /Acircumflex
201 /adieresis 204 /Adieresis 209 /ccedilla 210 /Ccedilla 211 /eacute
212 /Eacute 213 /egrave 214 /Egrave 215 /ecircumflex 216 /Ecircumflex
217 /edieresis 218 /Edieresis 219 /icircumflex 220 /Icircumflex
221 /idieresis 222 /Idieresis 223 /ntilde 224 /Ntilde 226 /ocircumflex
228 /Ocircumflex 230 /Odieresis 231 /ucircumflex 236 /Ucircumflex
237 /udieresis 238 /Udieresis 239 /aring 240 /odieresis 242 /Aring 243 /ydieresis
244 /Ydieresis 246 /aacute 247 /Aacute 252 /ugrave 253 /Ugrave
127 /atilde 128 /Atilde 129 /oacute 130 /Oacute 131 /iacute
132 /Iacute 133 /igrave 134 /Igrave 135 /otilde 136 /Otilde
137 /uacute 138 /Uacute] def
/Times-Roman /Times-Roman accvec ReEncode
/Times-Italic /Times-Italic accvec ReEncode
/Times-Bold /Times-Bold accvec ReEncode
/Times-BoldItalic /Times-BoldItalic accvec ReEncode
/Helvetica /Helvetica accvec ReEncode
/Helvetica-Oblique /Helvetica-Oblique accvec ReEncode
/Helvetica-Bold /Helvetica-Bold accvec ReEncode
/Helvetica-BoldOblique /Helvetica-BoldOblique  accvec ReEncode
/Courier /Courier accvec ReEncode
/Courier-Oblique /Courier-Oblique accvec ReEncode
/Courier-Bold /Courier-Bold accvec ReEncode
/Courier-BoldOblique /Courier-BoldOblique accvec ReEncode
/oshow {gsave [] 0 sd true charpath stroke gr} def
/stwn { /fs exch def /fn exch def /text exch def fn findfont fs sf
 text sw pop xs add /xs exch def} def
/stwb { /fs exch def /fn exch def /nbas exch def /textf exch deftextf length /tlen exch def nbas tlen gt {/nbas tlendef} iffn findfont fs sf textf dup length nbas sub nbas getinterval sw
pop neg xs add /xs exch def} def
/accspe [ 65 /plusminus  66 /bar  67 /existential  68 /universal 
69 /exclam  70 /numbersign 71 /greater  72 /question  73 /integral 
74 /colon  75 /semicolon  76 /less  77 /bracketleft  78 /bracketright
79 /greaterequal 80 /braceleft 81 /braceright 82 /radical
83 /spade 84 /heart 85 /diamond 86 /club 87 /lessequal
88 /multiply 89 /percent 90 /infinity 48 /circlemultiply 49 /circleplus
50 /emptyset  51 /lozenge 52 /bullet 53 /arrowright 54 /arrowup
55 /arrowleft 56 /arrowdown 57 /arrowboth 48 /degree 44 /comma 43 /plus 45 /angle 42 /angleleft 47 /divide 61 /notequal 40 /equivalence 41 /second 97 /approxequal 98 /congruent 99 /perpendicular 100 /partialdiff 101 /florin 102 /intersection
 103 /union 104 /propersuperset 105 /reflexsuperset 106 /notsubset 107 /propersubset 108 /reflexsubset 109 /element 110 /notelement 111 /gradient 112 /logicaland 113 /logicalor 114 /arrowdblboth 115 /arrowdblleft 116 /arrowdblup 117 /arrowdblright
 118 /arrowdbldown 119 /ampersand 120 /omega1 121 /similar 122 /aleph ] def
/Symbol /Special accspe ReEncode
%%EndProlog
%%BeginSetup
%%EndSetup
newpath  gsave  .25 .25 scale  gsave  0 0 t black[  ] 0 sd 3 lw 1 1 1 c 2268 2176 0 0 bf black 1 1 1 c 1791 1720 363 348 bf black 1791 1720 363 348 bl 363 348 m 1791 X s
 gsave  2268 2176 0 0 C 1868 114 t 0 r /Helvetica findfont 102.732 sf 0 0 m ( [GeV]) show NC gr 
 gsave  2268 2176 0 0 C 1823 80 t 0 r /Helvetica findfont 68.4881 sf 0 0 m (H) show NC gr 
 gsave  2268 2176 0 0 C 1743 114 t 0 r /Helvetica findfont 102.732 sf 0 0 m (M) show NC gr  614 400 m -52 Y s 711 374 m -26 Y s 807 374 m -26 Y s 903 374 m -26 Y s 999 400 m -52 Y s 1095 374 m -26 Y s 1192 374 m -26 Y s 1288 374 m -26 Y s 1384 400 m
 -52 Y s 1480 374 m -26 Y s 1577 374 m -26 Y s 1673 374 m -26 Y s 1769 400 m -52 Y s 1865 374 m -26 Y s 1961 374 m -26 Y s 2058 374 m -26 Y s 2154 400 m -52 Y s 614 400 m -52 Y s 518 374 m -26 Y s 422 374 m -26 Y s 2154 400 m -52 Y s
 gsave  2268 2176 0 0 C 529 251 t 0 r /Helvetica findfont 102.732 sf 0 0 m (200) show NC gr 
 gsave  2268 2176 0 0 C 913 251 t 0 r /Helvetica findfont 102.732 sf 0 0 m (400) show NC gr 
 gsave  2268 2176 0 0 C 1297 251 t 0 r /Helvetica findfont 102.732 sf 0 0 m (600) show NC gr 
 gsave  2268 2176 0 0 C 1682 251 t 0 r /Helvetica findfont 102.732 sf 0 0 m (800) show NC gr 
 gsave  2268 2176 0 0 C 2039 251 t 0 r /Helvetica findfont 102.732 sf 0 0 m (1000) show NC gr  363 2068 m 1791 X s 614 2016 m 52 Y s 711 2042 m 26 Y s 807 2042 m 26 Y s 903 2042 m 26 Y s 999 2016 m 52 Y s 1095 2042 m 26 Y s 1192 2042 m 26 Y s 1288
 2042 m 26 Y s 1384 2016 m 52 Y s 1480 2042 m 26 Y s 1577 2042 m 26 Y s 1673 2042 m 26 Y s 1769 2016 m 52 Y s 1865 2042 m 26 Y s 1961 2042 m 26 Y s 2058 2042 m 26 Y s 2154 2016 m 52 Y s 614 2016 m 52 Y s 518 2042 m 26 Y s 422 2042 m 26 Y s 2154 2016
 m 52 Y s 363 348 m 1720 Y s
 gsave  2268 2176 0 0 C 148 1899 t 90 r /Helvetica findfont 102.732 sf 0 0 m ( [%]) show NC gr 
 gsave  2268 2176 0 0 C 148 1838 t 90 r /Symbol findfont 102.732 sf 0 0 m (s) show NC gr 
 gsave  2268 2176 0 0 C 148 1777 t 90 r /Helvetica findfont 102.732 sf 0 0 m ( /) show NC gr 
 gsave  2268 2176 0 0 C 183 1617 t 90 r /Helvetica findfont 68.4881 sf 0 0 m (scale) show NC gr 
 gsave  2268 2176 0 0 C 148 1556 t 90 r /Symbol findfont 102.732 sf 0 0 m (s) show NC gr 
 gsave  2268 2176 0 0 C 148 1492 t 90 r /Symbol findfont 102.732 sf 0 0 m (D) show NC gr  417 465 m -54 X s 390 523 m -27 X s 390 581 m -27 X s 390 640 m -27 X s 390 698 m -27 X s 417 756 m -54 X s 390 814 m -27 X s 390 873 m -27 X s 390 931 m -27 X
 s 390 989 m -27 X s 417 1048 m -54 X s 390 1106 m -27 X s 390 1164 m -27 X s 390 1222 m -27 X s 390 1281 m -27 X s 417 1339 m -54 X s 390 1397 m -27 X s 390 1456 m -27 X s 390 1514 m -27 X s 390 1572 m -27 X s 417 1630 m -54 X s 390 1689 m -27 X s
 390 1747 m -27 X s 390 1805 m -27 X s 390 1864 m -27 X s 417 1922 m -54 X s 417 465 m -54 X s 390 407 m -27 X s 417 1922 m -54 X s 390 1980 m -27 X s 390 2038 m -27 X s
 gsave  2268 2176 0 0 C 205 422 t 0 r /Helvetica findfont 102.732 sf 0 0 m (-40) show NC gr 
 gsave  2268 2176 0 0 C 205 712 t 0 r /Helvetica findfont 102.732 sf 0 0 m (-30) show NC gr 
 gsave  2268 2176 0 0 C 205 1004 t 0 r /Helvetica findfont 102.732 sf 0 0 m (-20) show NC gr 
 gsave  2268 2176 0 0 C 205 1294 t 0 r /Helvetica findfont 102.732 sf 0 0 m (-10) show NC gr 
 gsave  2268 2176 0 0 C 297 1587 t 0 r /Helvetica findfont 102.732 sf 0 0 m (0) show NC gr 
 gsave  2268 2176 0 0 C 240 1880 t 0 r /Helvetica findfont 102.732 sf 0 0 m (10) show NC gr  2154 348 m 1720 Y s 2101 465 m 53 X s 2127 523 m 27 X s 2127 581 m 27 X s 2127 640 m 27 X s 2127 698 m 27 X s 2101 756 m 53 X s 2127 814 m 27 X s 2127 873 m
 27 X s 2127 931 m 27 X s 2127 989 m 27 X s 2101 1048 m 53 X s 2127 1106 m 27 X s 2127 1164 m 27 X s 2127 1222 m 27 X s 2127 1281 m 27 X s 2101 1339 m 53 X s 2127 1397 m 27 X s 2127 1456 m 27 X s 2127 1514 m 27 X s 2127 1572 m 27 X s 2101 1630 m 53
 X s 2127 1689 m 27 X s 2127 1747 m 27 X s 2127 1805 m 27 X s 2127 1864 m 27 X s 2101 1922 m 53 X s 2101 465 m 53 X s 2127 407 m 27 X s 2101 1922 m 53 X s 2127 1980 m 27 X s 2127 2038 m 27 X s[ 4 8] 0 sd 6 lw 364 1630 m 1790 X s 364 1412 m 2 3 d 2 3
 d 2 3 d 2 3 d 2 3 d 2 3 d 2 3 d 2 3 d 2 2 d 1 3 d 2 2 d 2 3 d 2 2 d 2 2 d 2 3 d 2 2 d 2 2 d 2 2 d 2 2 d 2 2 d 2 2 d 2 2 d 2 2 d 1 1 d 2 2 d 2 2 d 2 2 d 2 1 d 2 2 d 2 1 d 2 2 d 2 1 d 2 2 d 2 1 d 2 2 d 2 1 d 1 2 d 2 X 2 -1 d 2 -1 d 2 -1 d 2 -1 d 2 -1
 d 2 X 2 -1 d 2 -1 d 2 X 2 -1 d 2 -1 d 1 X 2 -1 d 2 X 2 -1 d 2 X 2 -1 d 2 X 2 -1 d 2 X 2 -1 d 2 -1 d 2 -1 d 2 X 1 -1 d 6 X 2 -1 d 4 X 2 -1 d 6 X 2 -1 d 5 X 2 -1 d 8 X 2 -1 d 12 X 1 -1 d 18 X 2 -1 d 100 X 2 1 d 30 X 2 1 d 23 X 2 1 d 29 X 2 1 d 25 X 2
 1 d 17 X 2 1 d 22 X 1 1 d 22 X 2 1 d 23 X 2 1 d 23 X 2 1 d 21 X 2 1 d 23 X 2 1 d 23 X 2 1 d 21 X 2 1 d 21 X 2 1 d 23 X 2 1 d 25 X 2 1 d 25 X 2 1 d 27 X 2 1 d 27 X 2 1 d 26 X 2 1 d 29 X 2 1 d 29 X 2 1 d 29 X 2 1 d 32 X 2 1 d 31 X 2 1 d 33 X 2 1 d 32
 X 2 1 d 33 X 2 1 d 35 X 2 1 d 38 X 2 1 d 37 X 1 1 d 39 X 2 1 d 38 X 2 1 d 43 X 2 1 d 40 X 2 1 d 40 X 2 1 d 43 X 1 1 d 49 X 2 1 d 44 X 2 1 d 48 X 2 1 d 50 X 2 1 d 48 X 2 1 d 54 X 2 1 d 42 X s[  ] 0 sd 364 488 m 2 24 d 2 23 d 2 23 d 2 21 d 2 21 d 2
 20 d 2 20 d 2 19 d 2 18 d 1 17 d 2 18 d 2 16 d 2 16 d 2 16 d 2 15 d 2 14 d 2 14 d 2 14 d 2 14 d 2 13 d 2 12 d 2 13 d 2 12 d 1 12 d 2 11 d 2 11 d 2 11 d 2 10 d 2 11 d 2 10 d 2 9 d 2 10 d 2 9 d 2 9 d 2 9 d 2 9 d 1 8 d 2 8 d 2 8 d 2 8 d 2 8 d 2 7 d 2
 8 d 2 7 d 2 7 d 2 7 d 2 7 d 2 6 d 2 7 d 1 6 d 2 6 d 2 6 d 2 6 d 2 6 d 2 6 d 2 5 d 2 6 d 2 5 d 2 6 d 2 6 d 2 6 d 2 5 d 1 5 d 2 4 d 2 5 d 2 5 d 2 4 d 2 5 d 2 4 d 2 5 d 2 4 d 2 4 d 2 4 d 2 4 d 2 4 d 1 4 d 2 4 d 2 4 d 2 4 d 2 3 d 2 4 d 2 3 d 2 4 d 2 3
 d 2 4 d 2 3 d 2 3 d 2 4 d 2 3 d 1 3 d 2 3 d 2 3 d 2 3 d 2 3 d 2 3 d 2 3 d 2 3 d 2 3 d 2 3 d 2 2 d 2 3 d 2 3 d 1 2 d 2 3 d 2 2 d 2 3 d 2 2 d 2 3 d 2 2 d 2 3 d 2 2 d 2 2 d 2 2 d 2 3 d 2 2 d 1 2 d 2 2 d 2 3 d 2 2 d 2 2 d 2 2 d 2 2 d 2 2 d 2 2 d 2 2 d
 2 2 d 2 2 d 2 2 d 1 2 d 2 1 d 2 2 d 2 2 d 2 2 d 2 2 d 2 1 d 2 2 d 2 2 d 2 2 d 2 1 d 2 2 d 2 2 d 1 1 d 2 2 d 2 1 d 2 2 d 2 2 d 2 1 d 2 2 d 2 1 d 2 2 d 2 1 d 2 1 d 2 2 d 2 1 d 2 2 d 1 1 d 2 1 d 2 2 d 2 1 d 2 1 d 2 2 d 2 1 d 2 1 d 2 2 d 2 1 d 2 1 d 2
 1 d 2 2 d 1 1 d 2 1 d 2 1 d 2 1 d 2 2 d 2 1 d 2 1 d 2 1 d 2 1 d 2 1 d 2 1 d 2 2 d 2 1 d 1 1 d 2 1 d 2 1 d 2 1 d 2 1 d 2 1 d 2 1 d 2 1 d 2 1 d 2 1 d 2 1 d 2 1 d 2 1 d 1 1 d 2 1 d 2 1 d 2 1 d 2 1 d 2 1 d 2 1 d 2 X 2 1 d 2 1 d 2 1 d 2 1 d 2 1 d 2 1 d
 1 1 d 2 X 2 1 d 2 1 d 2 1 d 2 1 d 2 1 d 2 X 2 1 d 2 1 d 2 1 d 2 1 d 2 X 1 1 d 2 1 d 2 1 d 2 X 2 1 d 2 1 d 2 1 d 2 X 2 1 d 2 1 d 2 X 2 1 d 2 1 d 1 X 2 1 d 2 1 d 2 X 2 1 d 2 1 d 2 1 d 2 X 2 1 d 2 X 2 1 d 2 1 d 2 X 1 1 d 2 1 d 2 X 2 1 d 2 1 d 2 X 2 1
 d 2 X 2 1 d 2 1 d 2 X 2 1 d 2 X 1 1 d 2 X 2 1 d 2 1 d 2 X 2 1 d 2 X 2 1 d 2 X 2 1 d 2 X 2 1 d 2 X 2 1 d 1 X 2 1 d 2 1 d 2 X 2 1 d 2 X 2 1 d 4 X 2 1 d 2 X 2 1 d 2 X 1 1 d 2 X 2 1 d 2 X 2 1 d 2 X 2 1 d 4 X 2 1 d 2 X 2 1 d 2 X 1 1 d 4 X 2 1 d 2 X 2 1
 d 2 X 2 1 d 4 X 2 1 d 2 X 2 1 d 3 X 2 1 d 4 X 2 1 d 2 X 2 1 d 4 X 2 1 d 4 X 1 1 d 2 X 2 1 d 4 X 2 1 d 4 X 2 1 d 4 X 2 1 d 4 X 1 1 d 4 X 2 1 d 4 X 2 1 d 4 X 2 1 d 4 X 2 1 d 3 X 2 1 d 6 X 2 1 d 4 X 2 1 d 4 X 2 1 d 5 X 2 1 d 4 X 2 1 d 6 X 2 1 d 4 X 1
 1 d 6 X 2 1 d 6 X 2 1 d 6 X 2 1 d 5 X 2 1 d 6 X 2 1 d 6 X 2 1 d 5 X 2 1 d 6 X 2 1 d 8 X 2 1 d 5 X 2 1 d 8 X 2 1 d 8 X 2 1 d 7 X 2 1 d 8 X 2 1 d 8 X 1 1 d 10 X 2 1 d 8 X 2 1 d 9 X 2 1 d 8 X 2 1 d 9 X 2 1 d 10 X 2 1 d 10 X 1 1 d 10 X 2 1 d 10 X 2 1 d
 11 X 2 1 d 10 X 2 1 d 11 X 2 1 d 12 X 2 1 d 11 X 2 1 d 12 X 1 1 d 14 X 2 1 d 13 X 2 1 d 14 X 2 1 d 13 X 2 1 d 15 X 2 1 d 16 X 2 1 d 15 X 2 1 d 17 X 2 1 d 18 X 1 1 d 18 X 2 1 d 21 X 2 1 d 21 X 2 1 d 21 X 2 1 d 21 X 2 1 d 25 X 2 1 d 23 X 2 1 d 25 X 2
 1 d 27 X 2 1 d 27 X 2 1 d 27 X 2 1 d 52 X 1 1 d 33 X 2 1 d 40 X 2 1 d 43 X 2 1 d 42 X 2 1 d 44 X 2 1 d 50 X 2 1 d 6 X s 364 1834 m 2 -3 d 2 -3 d 2 -3 d 2 -3 d 2 -2 d 2 -3 d 2 -2 d 2 -2 d 2 -3 d 1 -2 d 2 -2 d 2 -2 d 2 -2 d 2 -2 d 2 -2 d 2 -2 d 2 -2
 d 2 -1 d 2 -2 d 2 -2 d 2 -1 d 2 -2 d 2 -1 d 1 -2 d 2 -1 d 2 -2 d 2 -1 d 2 -2 d 2 -1 d 2 -1 d 2 -2 d 2 -1 d 2 -1 d 2 -2 d 2 -1 d 2 -1 d 1 -1 d 2 -1 d 2 -1 d 2 -1 d 2 -1 d 2 -1 d 2 -1 d 2 -1 d 2 -1 d 2 -1 d 2 -1 d 2 -1 d 2 -1 d 1 -1 d 2 -1 d 2 -1 d 2
 -1 d 2 -1 d 2 -1 d 2 -1 d 2 -1 d 2 -1 d 2 X 2 1 d 2 -1 d 2 -1 d 1 -1 d 2 X 2 -1 d 2 -1 d 2 -1 d 2 -1 d 2 X 2 -1 d 2 -1 d 2 X 2 -1 d 2 X 2 -1 d 1 X 2 -1 d 2 -1 d 2 X 2 -1 d 2 X 2 -1 d 2 X 2 -1 d 2 X 2 -1 d 2 X 2 -1 d 2 X 1 -1 d 4 X 2 -1 d 2 X 2 -1 d
 2 X 2 -1 d 2 X 2 -1 d 4 X 2 -1 d 1 X 2 -1 d 4 X 2 -1 d 2 X 2 -1 d 4 X 2 -1 d 4 X 2 -1 d 3 X 2 -1 d 4 X 2 -1 d 6 X 2 -1 d 6 X 1 -1 d 4 X 2 -1 d 6 X 2 -1 d 6 X 2 -1 d 5 X 2 -1 d 4 X 2 -1 d 8 X 2 -1 d 6 X 1 -1 d 6 X 2 -1 d 8 X 2 -1 d 7 X 2 -1 d 8 X 2
 -1 d 10 X 2 -1 d 9 X 2 -1 d 12 X 2 -1 d 11 X 2 -1 d 12 X 2 -1 d 13 X 2 -1 d 13 X 2 -1 d 12 X 2 -1 d 15 X 2 -1 d 15 X 2 -1 d 18 X 2 -1 d 21 X 2 -1 d 21 X 2 -1 d 19 X 2 -1 d 21 X 2 -1 d 23 X 2 -1 d 23 X 2 -1 d 21 X 2 -1 d 25 X 2 -1 d 29 X 2 -1 d 33 X
 2 -1 d 36 X 2 -1 d 42 X 2 -1 d 43 X 2 -1 d 42 X 2 -1 d 50 X 2 -1 d 65 X 2 -1 d 100 X 2 -1 d 81 X 2 -1 d 86 X 2 -1 d 118 X 2 -1 d 131 X 1 -1 d 137 X 2 -1 d 81 X s[  12 12 ] 0 sd 12 lw 364 468 m 2 24 d 2 23 d 2 23 d 2 21 d 2 21 d 2 21 d 2 19 d 2 19 d
 2 19 d 1 17 d 2 18 d 2 16 d 2 16 d 2 16 d 2 15 d 2 15 d 2 14 d 2 14 d 2 14 d 2 13 d 2 13 d 2 12 d 2 13 d 1 11 d 2 12 d 2 11 d 2 11 d 2 11 d 2 10 d 2 10 d 2 10 d 2 10 d 2 9 d 2 9 d 2 9 d 2 9 d 1 8 d 2 8 d 2 8 d 2 7 d 2 8 d 2 7 d 2 7 d 2 6 d 2 7 d 2
 7 d 2 6 d 2 6 d 2 6 d 1 6 d 2 6 d 2 5 d 2 6 d 2 5 d 2 6 d 2 5 d 2 5 d 2 5 d 2 5 d 2 6 d 2 5 d 2 4 d 1 5 d 2 4 d 2 5 d 2 4 d 2 4 d 2 4 d 2 4 d 2 4 d 2 4 d 2 4 d 2 4 d 2 3 d 2 4 d 1 4 d 2 3 d 2 3 d 2 4 d 2 3 d 2 3 d 2 4 d 2 3 d 2 3 d 2 3 d 2 3 d 2 3
 d 2 3 d 2 2 d 1 3 d 2 3 d 2 3 d 2 2 d 2 3 d 2 3 d 2 2 d 2 3 d 2 2 d 2 3 d 2 2 d 2 2 d 2 3 d 1 2 d 2 2 d 2 2 d 2 2 d 2 2 d 2 3 d 2 2 d 2 2 d 2 2 d 2 2 d 2 2 d 2 2 d 2 1 d 1 2 d 2 2 d 2 2 d 2 2 d 2 2 d 2 1 d 2 2 d 2 2 d 2 1 d 2 2 d 2 2 d 2 1 d 2 2 d
 1 2 d 2 1 d 2 2 d 2 1 d 2 2 d 2 1 d 2 2 d 2 1 d 2 1 d 2 2 d 2 1 d 2 2 d 2 1 d 1 1 d 2 2 d 2 1 d 2 1 d 2 1 d 2 2 d 2 1 d 2 1 d 2 1 d 2 1 d 2 2 d 2 1 d 2 1 d 2 1 d 1 1 d 2 1 d 2 1 d 2 1 d 2 1 d 2 1 d 2 1 d 2 1 d 2 1 d 2 1 d 2 1 d 2 1 d 2 1 d 1 1 d 2
 1 d 2 1 d 2 1 d 2 1 d 2 1 d 2 1 d 2 1 d 2 1 d 2 1 d 2 X 2 1 d 2 1 d 1 1 d 2 1 d 2 1 d 2 X 2 1 d 2 1 d 2 1 d 2 1 d 2 X 2 1 d 2 1 d 2 X 2 1 d 1 1 d 2 1 d 2 X 2 1 d 2 1 d 2 X 2 1 d 2 1 d 2 X 2 1 d 2 1 d 2 X 2 1 d 2 1 d 1 X 2 1 d 2 X 2 1 d 2 1 d 2 X 2
 1 d 2 X 2 1 d 2 1 d 2 X 2 1 d 2 X 1 1 d 2 X 2 1 d 2 1 d 2 X 2 1 d 2 X 2 1 d 2 X 2 1 d 2 X 2 1 d 2 X 1 1 d 2 X 2 1 d 2 X 2 1 d 2 X 2 1 d 4 X 2 1 d 2 X 2 1 d 2 X 1 1 d 2 X 2 1 d 4 X 2 1 d 2 X 2 1 d 4 X 2 1 d 2 X 2 1 d 3 X 2 1 d 2 X 2 1 d 4 X 2 1 d 4
 X 2 1 d 4 X 2 1 d 1 X 2 1 d 4 X 2 1 d 4 X 2 1 d 6 X 2 1 d 3 X 2 1 d 4 X 2 1 d 6 X 2 1 d 4 X 2 1 d 5 X 2 1 d 4 X 2 1 d 6 X 2 1 d 6 X 1 1 d 6 X 2 1 d 6 X 2 1 d 6 X 2 1 d 5 X 2 1 d 8 X 2 1 d 6 X 2 1 d 7 X 2 1 d 8 X 2 1 d 8 X 1 1 d 8 X 2 1 d 8 X 2 1 d
 9 X 2 1 d 8 X 2 1 d 9 X 2 1 d 12 X 2 1 d 9 X 2 1 d 12 X 2 1 d 11 X 2 1 d 12 X 2 1 d 11 X 2 1 d 14 X 2 1 d 13 X 2 1 d 15 X 2 1 d 16 X 2 1 d 15 X 2 1 d 17 X 2 1 d 18 X 2 1 d 17 X 2 1 d 19 X 2 1 d 19 X 2 1 d 19 X 2 1 d 21 X 2 1 d 22 X 1 1 d 25 X 2 1 d
 25 X 2 1 d 27 X 2 1 d 27 X 2 1 d 29 X 2 1 d 31 X 2 1 d 32 X 2 1 d 33 X 2 1 d 34 X 2 1 d 35 X 2 1 d 37 X 1 1 d 41 X 2 1 d 44 X 2 1 d 40 X 2 1 d 45 X 1 1 d 49 X 2 1 d 48 X 2 1 d 52 X 1 1 d 41 X s 364 1834 m 2 -3 d 2 -3 d 2 -3 d 2 -3 d 2 -2 d 2 -3 d 2
 -2 d 2 -2 d 2 -3 d 1 -2 d 2 -2 d 2 -2 d 2 -2 d 2 -2 d 2 -2 d 2 -2 d 2 -2 d 2 -1 d 2 -2 d 2 -2 d 2 -1 d 2 -2 d 2 -1 d 1 -2 d 2 -1 d 2 -2 d 2 -1 d 2 -2 d 2 -1 d 2 -1 d 2 -2 d 2 -1 d 2 -1 d 2 -2 d 2 -1 d 2 -1 d 1 -1 d 2 -1 d 2 -1 d 2 -1 d 2 -1 d 2 -1
 d 2 -1 d 2 -1 d 2 -1 d 2 -1 d 2 -1 d 2 -1 d 2 -1 d 1 -1 d 2 -1 d 2 -1 d 2 -1 d 2 -1 d 2 -1 d 2 -1 d 2 -1 d 2 -1 d 2 X 2 1 d 2 -1 d 2 -1 d 1 -1 d 2 X 2 -1 d 2 -1 d 2 -1 d 2 -1 d 2 X 2 -1 d 2 -1 d 2 X 2 -1 d 2 X 2 -1 d 1 X 2 -1 d 2 -1 d 2 X 2 -1 d 2
 X 2 -1 d 2 X 2 -1 d 2 X 2 -1 d 2 X 2 -1 d 2 X 1 -1 d 4 X 2 -1 d 2 X 2 -1 d 2 X 2 -1 d 2 X 2 -1 d 4 X 2 -1 d 1 X 2 -1 d 4 X 2 -1 d 2 X 2 -1 d 4 X 2 -1 d 4 X 2 -1 d 3 X 2 -1 d 4 X 2 -1 d 6 X 2 -1 d 6 X 1 -1 d 4 X 2 -1 d 6 X 2 -1 d 6 X 2 -1 d 5 X 2 -1
 d 4 X 2 -1 d 8 X 2 -1 d 6 X 1 -1 d 6 X 2 -1 d 8 X 2 -1 d 7 X 2 -1 d 8 X 2 -1 d 10 X 2 -1 d 9 X 2 -1 d 12 X 2 -1 d 11 X 2 -1 d 12 X 2 -1 d 13 X 2 -1 d 13 X 2 -1 d 12 X 2 -1 d 15 X 2 -1 d 15 X 2 -1 d 18 X 2 -1 d 21 X 2 -1 d 21 X 2 -1 d 19 X 2 -1 d 21
 X 2 -1 d 23 X 2 -1 d 23 X 2 -1 d 21 X 2 -1 d 25 X 2 -1 d 29 X 2 -1 d 33 X 2 -1 d 36 X 2 -1 d 42 X 2 -1 d 43 X 2 -1 d 42 X 2 -1 d 50 X 2 -1 d 65 X 2 -1 d 100 X 2 -1 d 81 X 2 -1 d 86 X 2 -1 d 118 X 2 -1 d 131 X 1 -1 d 137 X 2 -1 d 81 X s
 gsave  2268 2176 0 0 C 1533 719 t 0 r /Helvetica findfont 79.9028 sf 0 0 m (=7 TeV) show NC gr 
 gsave  2268 2176 0 0 C 1495 719 t 0 r /Helvetica findfont 79.9028 sf 0 0 m (s) show NC gr [  ] 0 sd 6 lw 1442 765 m 34 -50 d s 0 lw 1476 715 m 12 73 d s 1488 788 m 45 X s
 gsave  2268 2176 0 0 C 586 719 t 0 r /Helvetica findfont 79.9028 sf 0 0 m (bbh@nnlo, MSTW2008, ) show NC gr 
 gsave  2268 2176 0 0 C 2222 392 t 90 r /Helvetica-BoldOblique findfont 41.8538 sf 0 0 m (LHC HIGGS XS WG 2010) show NC gr 
 gsave  2268 2176 0 0 C 453 438 t 0 r /Helvetica findfont 102.732 sf 0 0 m (Preliminary) show NC gr  1 1 1 c 3 lw 1361 435 680 871 bf 703 871 m -16 Y 1353 X 428 Y -15 X -412 Y f 680 871 m 435 Y 1361 X -435 Y -1361 X cl s black
 gsave  2268 2176 0 0 C 1758 1199 t 0 r /Helvetica findfont 49.4636 sf 0 0 m (H) show NC gr 
 gsave  2268 2176 0 0 C 1659 1221 t 0 r /Helvetica findfont 72.293 sf 0 0 m (=M) show NC gr 
 gsave  2268 2176 0 0 C 1511 1248 t 0 r /Helvetica findfont 49.4636 sf 0 0 m (central) show NC gr 
 gsave  2268 2176 0 0 C 1511 1180 t 0 r /Helvetica findfont 49.4636 sf 0 0 m (R) show NC gr 
 gsave  2268 2176 0 0 C 1469 1221 t 0 r /Symbol findfont 72.293 sf 0 0 m (m) show NC gr 
 gsave  2268 2176 0 0 C 1351 1221 t 0 r /Helvetica findfont 72.293 sf 0 0 m (<5, ) show NC gr 
 gsave  2268 2176 0 0 C 1316 1195 t 0 r /Helvetica findfont 49.4636 sf 0 0 m (H) show NC gr 
 gsave  2268 2176 0 0 C 1237 1221 t 0 r /Helvetica findfont 72.293 sf 0 0 m (/M) show NC gr 
 gsave  2268 2176 0 0 C 1202 1180 t 0 r /Helvetica findfont 49.4636 sf 0 0 m (R) show NC gr 
 gsave  2268 2176 0 0 C 1160 1221 t 0 r /Symbol findfont 72.293 sf 0 0 m (m) show NC gr 
 gsave  2268 2176 0 0 C 1020 1221 t 0 r /Helvetica findfont 72.293 sf 0 0 m (0.2<) show NC gr [ 4 8] 0 sd 6 lw 731 1233 m 238 X s
 gsave  2268 2176 0 0 C 2001 1043 t 0 r /Helvetica findfont 49.4636 sf 0 0 m (H) show NC gr 
 gsave  2268 2176 0 0 C 1925 1065 t 0 r /Helvetica findfont 72.293 sf 0 0 m ( M) show NC gr 
 gsave  2268 2176 0 0 C 1887 1020 t 0 r /Helvetica findfont 72.293 sf 0 0 m (4) show NC gr 
 gsave  2268 2176 0 0 C 1891 1092 t 0 r /Helvetica findfont 72.293 sf 0 0 m (1) show NC gr [  ] 0 sd 1887 1084 m 38 X s
 gsave  2268 2176 0 0 C 1826 1065 t 0 r /Helvetica findfont 72.293 sf 0 0 m (= ) show NC gr 
 gsave  2268 2176 0 0 C 1678 1092 t 0 r /Helvetica findfont 49.4636 sf 0 0 m (central) show NC gr 
 gsave  2268 2176 0 0 C 1678 1024 t 0 r /Helvetica findfont 49.4636 sf 0 0 m (F) show NC gr 
 gsave  2268 2176 0 0 C 1636 1065 t 0 r /Symbol findfont 72.293 sf 0 0 m (m) show NC gr 
 gsave  2268 2176 0 0 C 1602 1065 t 0 r /Helvetica findfont 72.293 sf 0 0 m (, ) show NC gr 
 gsave  2268 2176 0 0 C 1568 1039 t 0 r /Helvetica findfont 49.4636 sf 0 0 m (H) show NC gr 
 gsave  2268 2176 0 0 C 1347 1065 t 0 r /Helvetica findfont 72.293 sf 0 0 m (<0.7 M) show NC gr 
 gsave  2268 2176 0 0 C 1313 1039 t 0 r /Helvetica findfont 49.4636 sf 0 0 m (H) show NC gr 
 gsave  2268 2176 0 0 C 1233 1065 t 0 r /Helvetica findfont 72.293 sf 0 0 m (/M) show NC gr 
 gsave  2268 2176 0 0 C 1202 1024 t 0 r /Helvetica findfont 49.4636 sf 0 0 m (F) show NC gr 
 gsave  2268 2176 0 0 C 1160 1065 t 0 r /Symbol findfont 72.293 sf 0 0 m (m) show NC gr 
 gsave  2268 2176 0 0 C 1020 1065 t 0 r /Helvetica findfont 72.293 sf 0 0 m (0.1<) show NC gr  731 1088 m 238 X s
 gsave  2268 2176 0 0 C 1020 921 t 0 r /Helvetica findfont 72.293 sf 0 0 m (quadratic addition) show NC gr [  12 12 ] 0 sd 12 lw 731 943 m 238 X s
 gr  gr 
showpage
end
%%EOF
