%!PS-Adobe-2.0 EPSF-2.0
%%BoundingBox:  0 0 567 384
%%Title: plots/projectedRLimit_combined_cls.eps: Canvas
%%Creator: ROOT Version 5.26/00
%%CreationDate: Mon Mar 22 20:04:18 2010
%%EndComments
%%BeginProlog
80 dict begin
/s {stroke} def /l {lineto} def /m {moveto} def /t {translate} def
/sw {stringwidth} def /r {rotate} def /rl {roll}  def /R {repeat} def
/d {rlineto} def /rm {rmoveto} def /gr {grestore} def /f {eofill} def
/c {setrgbcolor} def /black {0 setgray} def /sd {setdash} def
/cl {closepath} def /sf {scalefont setfont} def /lw {setlinewidth} def
/box {m dup 0 exch d exch 0 d 0 exch neg d cl} def
/NC{systemdict begin initclip end}def/C{NC box clip newpath}def
/bl {box s} def /bf {box f} def /Y { 0 exch d} def /X { 0 d} def 
/mp {newpath /y exch def /x exch def} def
/side {[w .77 mul w .23 mul] .385 w mul sd w 0 l currentpoint t -144 r} def
/mr {mp x y w2 0 360 arc} def /m24 {mr s} def /m20 {mr f} def
/mb {mp x y w2 add m w2 neg 0 d 0 w neg d w 0 d 0 w d cl} def
/mt {mp x y w2 add m w2 neg w neg d w 0 d cl} def
/m21 {mb f} def /m25 {mb s} def /m22 {mt f} def /m26{mt s} def
/m23 {mp x y w2 sub m w2 w d w neg 0 d cl f} def
/m27 {mp x y w2 add m w3 neg w2 neg d w3 w2 neg d w3 w2 d cl s} def
/m28 {mp x w2 sub y w2 sub w3 add m w3 0 d  0 w3 neg d w3 0 d 0 w3 d w3 0 d  0 w3 d w3 neg 0 d 0 w3 d w3 neg 0 d
 0 w3 neg d w3 neg 0 d cl s } def
/m29 {mp gsave x w2 sub y w2 add w3 sub m currentpoint t
 4 {side} repeat cl fill gr} def
/m30 {mp gsave x w2 sub y w2 add w3 sub m currentpoint t
 4 {side} repeat cl s gr} def
/m31 {mp x y w2 sub m 0 w d x w2 sub y m w 0 d x w2 sub y w2 add m w w neg d x w2 sub y w2
 sub m w w d s} def
/m2 {mp x y w2 sub m 0 w d x w2 sub y m w 0 d s} def
/m5 {mp x w2 sub y w2 sub m w w d x w2 sub y w2 add m w w neg d s} def
/reEncode {exch findfont dup length dict begin {1 index /FID eq  {pop pop} {def} ifelse } forall /Encoding exch def currentdict end dup /FontName get exch definefont pop } def [/Times-Bold /Times-Italic /Times-BoldItalic /Helvetica
 /Helvetica-Oblique /Helvetica-Bold /Helvetica-BoldOblique /Courier /Courier-Oblique /Courier-Bold /Courier-BoldOblique /Times-Roman /AvantGarde-Book /AvantGarde-BookOblique /AvantGarde-Demi /AvantGarde-DemiOblique /Bookman-Demi
 /Bookman-DemiItalic /Bookman-Light /Bookman-LightItalic /Helvetica-Narrow /Helvetica-Narrow-Bold /Helvetica-Narrow-BoldOblique /Helvetica-Narrow-Oblique /NewCenturySchlbk-Roman /NewCenturySchlbk-Bold
 /NewCenturySchlbk-BoldItalic /NewCenturySchlbk-Italic /Palatino-Bold /Palatino-BoldItalic /Palatino-Italic /Palatino-Roman ] {ISOLatin1Encoding reEncode } forall
/oshow {gsave [] 0 sd true charpath stroke gr} def
/stwn { /fs exch def /fn exch def /text exch def fn findfont fs sf
 text sw pop xs add /xs exch def} def
/stwb { /fs exch def /fn exch def /nbas exch def /textf exch deftextf length /tlen exch def nbas tlen gt {/nbas tlendef} iffn findfont fs sf textf dup length nbas sub nbas getinterval sw
pop neg xs add /xs exch def} def
%%EndProlog
%%BeginSetup
%%EndSetup
newpath  gsave  .25 .25 scale  gsave  0 0 t black[  ] 0 sd 3 lw 1 1 1 c 2268 1538 0 0 bf black 6 lw 1 1 1 c black 1746 1107 408 308 bl 1746 1107 408 308 bl 1 1 1 c black 1746 1107 408 308 bl 1746 1107 408 308 bl 3 lw 408 308 m 1746 X s
 gsave  2268 1538 0 0 C 2137 121 t 0 r /Helvetica findfont 71.6807 sf 0 0 m (]) show NC gr 
 gsave  2268 1538 0 0 C 2111 153 t 0 r /Helvetica findfont 48.8732 sf 0 0 m (2) show NC gr 
 gsave  2268 1538 0 0 C 1870 121 t 0 r /Helvetica findfont 71.6807 sf 0 0 m ( [GeV/c) show NC gr 
 gsave  2268 1538 0 0 C 1838 81 t 0 r /Helvetica findfont 48.8732 sf 0 0 m (H) show NC gr 
 gsave  2268 1538 0 0 C 1346 121 t 0 r /Helvetica findfont 71.6807 sf 0 0 m ( Higgs mass, m) show NC gr  408 290 m 18 Y s 495 299 m 9 Y s 583 299 m 9 Y s 670 299 m 9 Y s 757 290 m 18 Y s 845 299 m 9 Y s 932 299 m 9 Y s 1019 299 m 9 Y s 1107 290 m 18
 Y s 1194 299 m 9 Y s 1281 299 m 9 Y s 1369 299 m 9 Y s 1456 290 m 18 Y s 1543 299 m 9 Y s 1630 299 m 9 Y s 1718 299 m 9 Y s 1805 290 m 18 Y s 1892 299 m 9 Y s 1980 299 m 9 Y s 2067 299 m 9 Y s 2154 290 m 18 Y s
 gsave  2268 1538 0 0 C 349 225 t 0 r /Helvetica findfont 71.6807 sf 0 0 m (100) show NC gr 
 gsave  2268 1538 0 0 C 697 225 t 0 r /Helvetica findfont 71.6807 sf 0 0 m (120) show NC gr 
 gsave  2268 1538 0 0 C 1046 225 t 0 r /Helvetica findfont 71.6807 sf 0 0 m (140) show NC gr 
 gsave  2268 1538 0 0 C 1395 225 t 0 r /Helvetica findfont 71.6807 sf 0 0 m (160) show NC gr 
 gsave  2268 1538 0 0 C 1746 225 t 0 r /Helvetica findfont 71.6807 sf 0 0 m (180) show NC gr 
 gsave  2268 1538 0 0 C 2095 225 t 0 r /Helvetica findfont 71.6807 sf 0 0 m (200) show NC gr  408 308 m 1107 Y s
 gsave  2268 1538 0 0 C 228 1346 t 90 r /Helvetica findfont 48.8732 sf 0 0 m (SM) show NC gr 
 gsave  2268 1538 0 0 C 205 1303 t 90 r /Symbol findfont 71.6807 sf 0 0 m (s) show NC gr 
 gsave  2268 1538 0 0 C 205 1280 t 90 r /Helvetica findfont 71.6807 sf 0 0 m (/) show NC gr 
 gsave  2268 1538 0 0 C 228 1121 t 90 r /Helvetica findfont 48.8732 sf 0 0 m (95%CL) show NC gr 
 gsave  2268 1538 0 0 C 205 1078 t 90 r /Symbol findfont 71.6807 sf 0 0 m (s) show NC gr 
 gsave  2268 1538 0 0 C 205 955 t 90 r /Helvetica findfont 71.6807 sf 0 0 m ( r = ) show NC gr  396 308 m 12 X s 396 405 m 12 X s 396 474 m 12 X s 396 528 m 12 X s 396 572 m 12 X s 396 609 m 12 X s 396 641 m 12 X s 396 669 m 12 X s 384 695 m 24 X s
 gsave  2268 1538 0 0 C 365 665 t 0 r  -29 0 t /Helvetica findfont 71.6807 sf 0 0 m (1) show NC gr  396 861 m 12 X s 396 959 m 12 X s 396 1028 m 12 X s 396 1082 m 12 X s 396 1125 m 12 X s 396 1162 m 12 X s 396 1195 m 12 X s 396 1223 m 12 X s 384
 1248 m 24 X s
 gsave  2268 1538 0 0 C 365 1218 t 0 r  -78 0 t /Helvetica findfont 71.6807 sf 0 0 m (10) show NC gr  396 1415 m 12 X s 1 1 0 c black 1 1 0 c 670 1193 m 87 -64 d 175 -130 d 175 -98 d 174 -83 d 175 -216 d 174 36 d 175 133 d 175 77 d 174 61 d -355 Y
 -174 -42 d -175 -109 d -144 -95 d -245 X -135 170 d -174 59 d -175 110 d -175 143 d -87 84 d f 0 1 0 c black 0 1 0 c 670 1103 m 87 -65 d 175 -120 d 175 -115 d 174 -77 d 175 -206 d 174 20 d 175 143 d 175 82 d 174 59 d -190 Y -174 -48 d -175 -100 d
 -175 -125 d -174 -25 d -175 216 d -174 59 d -175 114 d -175 133 d -87 86 d f 1 0 0 c 6 lw 408 695 m 1746 X s 0 0 1 c black 0 0 1 c 670 1038 m 87 -72 d 175 -129 d 175 -112 d 174 -71 d 175 -211 d 174 25 d 175 136 d 175 86 d 174 55 d s 3 lw black /w 2
 def /w2 {w 2 div} def /w3 {w 3 div} def 670 1038 757 966 932 837 1107 725 1281 654 1456 443 1630 468 1805 604 1980 690 2154 745 10 { m20} R 6 lw 0 0 1 c[ 12 12] 0 sd 3 lw black 0 0 1 c 670 1030 m 87 -115 d 175 -148 d 175 -108 d 174 -35 d 175 -214 d
 174 26 d 175 123 d 175 86 d 174 49 d s[  ] 0 sd 670 1030 757 915 932 767 1107 659 1281 624 1456 410 1630 436 1805 559 1980 645 2154 694 10 { m20} R[ 12 12] 0 sd black
 gsave  2268 1538 0 0 C 629 1212 t 0 r /Helvetica findfont 65.1643 sf 0 0 m ( + HWW + HZZ) show NC gr 
 gsave  2268 1538 0 0 C 596 1212 t 0 r /Symbol findfont 65.1643 sf 0 0 m (g) show NC gr 
 gsave  2268 1538 0 0 C 564 1212 t 0 r /Symbol findfont 65.1643 sf 0 0 m (g) show NC gr 
 gsave  2268 1538 0 0 C 521 1212 t 0 r /Helvetica findfont 65.1643 sf 0 0 m (H) show NC gr 
 gsave  2268 1538 0 0 C 1274 1105 t 0 r /Helvetica findfont 58.6478 sf 0 0 m (95% CL exclusion: mean) show NC gr  0 0 1 c[  ] 0 sd 6 lw 1155 1125 m 99 X s black
 gsave  2268 1538 0 0 C 1274 1046 t 0 r /Helvetica findfont 58.6478 sf 0 0 m (95% CL exclusion: 68% band) show NC gr  0 1 0 c 3 lw 1155 1047 m 99 X 40 Y -99 X f 6 lw 3 lw 1155 1087 m 99 X s 1155 1047 m 99 X s 1254 1047 m 40 Y s 1155 1047 m 40 Y s
 black
 gsave  2268 1538 0 0 C 1274 987 t 0 r /Helvetica findfont 58.6478 sf 0 0 m (95% CL exclusion: 95% band) show NC gr  1 1 0 c 1155 989 m 99 X 40 Y -99 X f 1155 1029 m 99 X s 1155 989 m 99 X s 1254 989 m 40 Y s 1155 989 m 40 Y s black
 gsave  2268 1538 0 0 C 1274 935 t 0 r /Helvetica findfont 58.6478 sf 0 0 m (95% CL exclusion: mean \(no sys\)) show NC gr  0 0 1 c[ 12 12] 0 sd 1155 952 m 99 X s[  ] 0 sd 1205 952 m20[ 12 12] 0 sd black
 gsave  2268 1538 0 0 C 1623 1466 t 0 r /Helvetica findfont 42.3568 sf 0 0 m (\2551) show NC gr 
 gsave  2268 1538 0 0 C 401 1437 t 0 r /Helvetica findfont 65.1643 sf 0 0 m (CMS Preliminary: projection for 7 TeV, 1 fb) show NC gr 
 gsave  2268 1538 0 0 C 1877 1443 t 0 r /Helvetica findfont 48.8732 sf 0 0 m (Mar 17 2010) show NC gr 
 gr  gr 
showpage
end
%%EOF
