%!PS-Adobe-2.0 EPSF-2.0
%%BoundingBox:  0 0 567 544
%%Title: C:\Ivica\Physics\CMS\Higgs\BranchingRatios\Yellow report 2010\BR1.eps: Higgs BRs
%%Creator: ROOT Version 5.25/04
%%CreationDate: Fri Nov 19 01:02:21 2010
%%EndComments
%%BeginProlog
80 dict begin
/s {stroke} def /l {lineto} def /m {moveto} def /t {translate} def
/sw {stringwidth} def /r {rotate} def /rl {roll}  def /R {repeat} def
/d {rlineto} def /rm {rmoveto} def /gr {grestore} def /f {eofill} def
/c {setrgbcolor} def /black {0 setgray} def /sd {setdash} def
/cl {closepath} def /sf {scalefont setfont} def /lw {setlinewidth} def
/box {m dup 0 exch d exch 0 d 0 exch neg d cl} def
/NC{systemdict begin initclip end}def/C{NC box clip newpath}def
/bl {box s} def /bf {box f} def /Y { 0 exch d} def /X { 0 d} def 
/mp {newpath /y exch def /x exch def} def
/side {[w .77 mul w .23 mul] .385 w mul sd w 0 l currentpoint t -144 r} def
/mr {mp x y w2 0 360 arc} def /m24 {mr s} def /m20 {mr f} def
/mb {mp x y w2 add m w2 neg 0 d 0 w neg d w 0 d 0 w d cl} def
/mt {mp x y w2 add m w2 neg w neg d w 0 d cl} def
/m21 {mb f} def /m25 {mb s} def /m22 {mt f} def /m26{mt s} def
/m23 {mp x y w2 sub m w2 w d w neg 0 d cl f} def
/m27 {mp x y w2 add m w3 neg w2 neg d w3 w2 neg d w3 w2 d cl s} def
/m28 {mp x w2 sub y w2 sub w3 add m w3 0 d  0 w3 neg d w3 0 d 0 w3 d w3 0 d  0 w3 d w3 neg 0 d 0 w3 d w3 neg 0 d
 0 w3 neg d w3 neg 0 d cl s } def
/m29 {mp gsave x w2 sub y w2 add w3 sub m currentpoint t
 4 {side} repeat cl fill gr} def
/m30 {mp gsave x w2 sub y w2 add w3 sub m currentpoint t
 4 {side} repeat cl s gr} def
/m31 {mp x y w2 sub m 0 w d x w2 sub y m w 0 d x w2 sub y w2 add m w w neg d x w2 sub y w2
 sub m w w d s} def
/m2 {mp x y w2 sub m 0 w d x w2 sub y m w 0 d s} def
/m5 {mp x w2 sub y w2 sub m w w d x w2 sub y w2 add m w w neg d s} def
/reEncode {exch findfont dup length dict begin {1 index /FID eq  {pop pop} {def} ifelse } forall /Encoding exch def currentdict end dup /FontName get exch definefont pop } def [/Times-Bold /Times-Italic /Times-BoldItalic /Helvetica
 /Helvetica-Oblique /Helvetica-Bold /Helvetica-BoldOblique /Courier /Courier-Oblique /Courier-Bold /Courier-BoldOblique /Times-Roman /AvantGarde-Book /AvantGarde-BookOblique /AvantGarde-Demi /AvantGarde-DemiOblique /Bookman-Demi
 /Bookman-DemiItalic /Bookman-Light /Bookman-LightItalic /Helvetica-Narrow /Helvetica-Narrow-Bold /Helvetica-Narrow-BoldOblique /Helvetica-Narrow-Oblique /NewCenturySchlbk-Roman /NewCenturySchlbk-Bold
 /NewCenturySchlbk-BoldItalic /NewCenturySchlbk-Italic /Palatino-Bold /Palatino-BoldItalic /Palatino-Italic /Palatino-Roman ] {ISOLatin1Encoding reEncode } forall
/oshow {gsave [] 0 sd true charpath stroke gr} def
/stwn { /fs exch def /fn exch def /text exch def fn findfont fs sf
 text sw pop xs add /xs exch def} def
/stwb { /fs exch def /fn exch def /nbas exch def /textf exch deftextf length /tlen exch def nbas tlen gt {/nbas tlendef} iffn findfont fs sf textf dup length nbas sub nbas getinterval sw
pop neg xs add /xs exch def} def
%%EndProlog
%%BeginSetup
%%EndSetup
newpath  gsave  .25 .25 scale  gsave  0 0 t black[  ] 0 sd 3 lw 1 1 1 c 2268 2176 0 0 bf black 1 1 1 c 1791 1720 363 348 bf black 1791 1720 363 348 bl 6 lw 1 1 1 c black 363 348 m 1791 X s 3 lw 363 348 m 1791 X s
 gsave  2268 2176 0 0 C 1868 80 t 0 r /Helvetica findfont 102.732 sf 0 0 m ( [GeV]) show NC gr 
 gsave  2268 2176 0 0 C 1823 53 t 0 r /Helvetica findfont 68.4881 sf 0 0 m (H) show NC gr 
 gsave  2268 2176 0 0 C 1743 80 t 0 r /Helvetica findfont 102.732 sf 0 0 m (M) show NC gr  441 400 m -52 Y s
 gsave  2268 2176 0 0 C 441 248 t 0 r  -83 0 t /Helvetica findfont 102.732 sf 0 0 m (100) show NC gr  957 374 m -26 Y s
 gsave  2268 2176 0 0 C 871 251 t 0 r /Helvetica findfont 102.732 sf 0 0 m (200) show NC gr  1259 374 m -26 Y s
 gsave  2268 2176 0 0 C 1172 251 t 0 r /Helvetica findfont 102.732 sf 0 0 m (300) show NC gr  1473 374 m -26 Y s 1639 374 m -26 Y s 1774 374 m -26 Y s 1889 374 m -26 Y s 1988 374 m -26 Y s 2076 374 m -26 Y s 2154 400 m -52 Y s
 gsave  2268 2176 0 0 C 2154 248 t 0 r  -112 0 t /Helvetica findfont 102.732 sf 0 0 m (1000) show NC gr  363 2068 m 1791 X s 441 2016 m 52 Y s 957 2042 m 26 Y s 1259 2042 m 26 Y s 1473 2042 m 26 Y s 1639 2042 m 26 Y s 1774 2042 m 26 Y s 1889 2042 m
 26 Y s 1988 2042 m 26 Y s 2076 2042 m 26 Y s 2154 2016 m 52 Y s 363 348 m 1720 Y s
 gsave  2268 2176 0 0 C 133 1328 t 90 r /Helvetica findfont 102.732 sf 0 0 m (Branching ratios) show NC gr  417 348 m -54 X s
 gsave  2268 2176 0 0 C 278 350 t 0 r /Helvetica findfont 68.4881 sf 0 0 m (\2553) show NC gr 
 gsave  2268 2176 0 0 C 167 301 t 0 r /Helvetica findfont 102.732 sf 0 0 m (10) show NC gr  390 521 m -27 X s 390 622 m -27 X s 390 693 m -27 X s 390 749 m -27 X s 390 794 m -27 X s 390 833 m -27 X s 390 866 m -27 X s 390 895 m -27 X s 417 921 m -54
 X s
 gsave  2268 2176 0 0 C 278 921 t 0 r /Helvetica findfont 68.4881 sf 0 0 m (\2552) show NC gr 
 gsave  2268 2176 0 0 C 167 875 t 0 r /Helvetica findfont 102.732 sf 0 0 m (10) show NC gr  390 1094 m -27 X s 390 1195 m -27 X s 390 1266 m -27 X s 390 1322 m -27 X s 390 1367 m -27 X s 390 1406 m -27 X s 390 1439 m -27 X s 390 1468 m -27 X s 417
 1494 m -54 X s
 gsave  2268 2176 0 0 C 289 1492 t 0 r /Helvetica findfont 68.4881 sf 0 0 m (\2551) show NC gr 
 gsave  2268 2176 0 0 C 179 1446 t 0 r /Helvetica findfont 102.732 sf 0 0 m (10) show NC gr  390 1667 m -27 X s 390 1768 m -27 X s 390 1840 m -27 X s 390 1895 m -27 X s 390 1940 m -27 X s 390 1979 m -27 X s 390 2012 m -27 X s 390 2041 m -27 X s 417
 2068 m -54 X s
 gsave  2268 2176 0 0 C 342 2025 t 0 r  -42 0 t /Helvetica findfont 102.732 sf 0 0 m (1) show NC gr  2154 348 m 1720 Y s 2101 348 m 53 X s 2127 521 m 27 X s 2127 622 m 27 X s 2127 693 m 27 X s 2127 749 m 27 X s 2127 794 m 27 X s 2127 833 m 27 X s
 2127 866 m 27 X s 2127 895 m 27 X s 2101 921 m 53 X s 2127 1094 m 27 X s 2127 1195 m 27 X s 2127 1266 m 27 X s 2127 1322 m 27 X s 2127 1367 m 27 X s 2127 1406 m 27 X s 2127 1439 m 27 X s 2127 1468 m 27 X s 2101 1494 m 53 X s 2127 1667 m 27 X s 2127
 1768 m 27 X s 2127 1840 m 27 X s 2127 1895 m 27 X s 2127 1940 m 27 X s 2127 1979 m 27 X s 2127 2012 m 27 X s 2127 2041 m 27 X s 2101 2068 m 53 X s
 gsave  2268 2176 0 0 C 1556 251 t 0 r /Helvetica findfont 102.732 sf 0 0 m (500) show NC gr  0.3 0.3 0.3 c 12 lw black 0.3 0.3 0.3 c 363 2015 m 40 -2 d 38 -4 d 37 -6 d 34 -8 d 33 -14 d 32 -20 d 30 -29 d 29 -39 d 28 -50 d 28 -62 d 26 -77 d 25 -97 d
 24 -133 d 24 -245 d 23 -264 d 22 -103 d 22 -63 d 21 -52 d 20 -63 d 20 -50 d 19 -38 d 19 -32 d 36 -53 d 35 -46 d 33 -40 d 32 -38 d 30 -36 d 2 -3 d s
 gsave  2268 2176 0 0 C 651 1960 t 0 r /Helvetica findfont 102.732 sf 0 0 m (b) show NC gr  6 lw 651 2047 m 53 X s
 gsave  2268 2176 0 0 C 597 1960 t 0 r /Helvetica findfont 102.732 sf 0 0 m (b) show NC gr  1 0 0 c 12 lw black 1 0 0 c 363 1450 m 78 X 37 -4 d 34 -6 d 33 -12 d 32 -18 d 30 -27 d 29 -37 d 28 -48 d 28 -61 d 26 -75 d 25 -96 d 24 -130 d 24 -245 d 23
 -263 d 17 -80 d s
 gsave  2268 2176 0 0 C 453 1480 t 0 r /Symbol findfont 102.732 sf 0 0 m (t) show NC gr 
 gsave  2268 2176 0 0 C 407 1480 t 0 r /Symbol findfont 102.732 sf 0 0 m (t) show NC gr  0 0.4 0 c black 0 0.4 0 c 363 1322 m 40 -3 d 38 -3 d 37 -6 d 34 -9 d 33 -14 d 32 -20 d 30 -29 d 29 -38 d 28 -51 d 28 -63 d 26 -76 d 25 -97 d 24 -133 d 24 -246 d
 16 -186 d s
 gsave  2268 2176 0 0 C 639 959 t 0 r /Helvetica findfont 102.732 sf 0 0 m (c) show NC gr  6 lw 639 1027 m 53 X s
 gsave  2268 2176 0 0 C 586 959 t 0 r /Helvetica findfont 102.732 sf 0 0 m (c) show NC gr  0.81 0.37 0.38 c 12 lw black 0.81 0.37 0.38 c 1347 348 m 5 46 d s 1352 394 m 21 640 d 21 295 d 21 121 d 19 68 d 20 46 d 19 28 d 18 23 d 18 14 d 17 10 d 18 9 d
 16 5 d 17 3 d 16 2 d 15 1 d 16 X 15 -1 d 14 -1 d 15 -3 d 14 -2 d 14 -3 d 14 -3 d 13 -4 d 13 -4 d 13 -4 d 13 -5 d 12 -4 d 13 -4 d 12 -5 d 12 -5 d 11 -4 d 12 -5 d 11 -7 d 11 -5 d 11 -5 d 11 -5 d 11 -5 d 11 -6 d 10 -5 d 10 -6 d 10 -6 d 10 -6 d 10 -4 d
 10 -6 d 9 -7 d 10 -4 d 9 -7 d 10 -7 d 9 -4 d 9 -8 d 9 -5 d 8 -5 d 9 -6 d 9 -6 d 8 -6 d 9 -6 d 8 -6 d 8 -6 d 8 -7 d 8 -6 d 8 -6 d 8 -6 d 8 -6 d 8 -7 d 7 -6 d 8 -7 d 7 -6 d s
 gsave  2268 2176 0 0 C 2024 1526 t 0 r /Helvetica findfont 102.732 sf 0 0 m (t) show NC gr  6 lw 2024 1609 m 31 X s
 gsave  2268 2176 0 0 C 1994 1526 t 0 r /Helvetica findfont 102.732 sf 0 0 m (t) show NC gr  0.6 0 0.6 c 12 lw black 0.6 0 0.6 c 363 1332 m 40 24 d 38 22 d 37 20 d 34 15 d 33 9 d 32 1 d 30 -7 d 29 -19 d 28 -30 d 28 -43 d 26 -58 d 25 -79 d 24 -115 d
 24 -228 d 23 -249 d 22 -84 d 22 -47 d 21 -37 d 20 -48 d 18 -31 d s 0.4 0 0.4 c
 gsave  2268 2176 0 0 C 586 1461 t 0 r /Helvetica findfont 102.732 sf 0 0 m (gg) show NC gr  1 0 1 c black 1 0 1 c 363 425 m 40 32 d 38 31 d 37 28 d 34 25 d 33 19 d 32 13 d 30 4 d 29 -5 d 28 -14 d 28 -26 d 26 -37 d 25 -53 d 24 -79 d 2 -15 d s
 gsave  2268 2176 0 0 C 597 613 t 0 r /Symbol findfont 102.732 sf 0 0 m (g) show NC gr 
 gsave  2268 2176 0 0 C 544 613 t 0 r /Symbol findfont 102.732 sf 0 0 m (g) show NC gr  0 0 0.4 c black 0 0 0.4 c 566 348 m 11 37 d s 577 385 m 30 82 d 29 59 d 28 37 d 28 20 d 26 1 d 25 -18 d 24 -48 d 24 -126 d 5 -44 d s
 gsave  2268 2176 0 0 C 715 624 t 0 r /Symbol findfont 102.732 sf 0 0 m (g) show NC gr 
 gsave  2268 2176 0 0 C 654 624 t 0 r /Helvetica findfont 102.732 sf 0 0 m (Z) show NC gr  0.35 0.83 0.33 c black 0.35 0.83 0.33 c 363 531 m 40 203 d 38 213 d 37 195 d 34 171 d 33 147 d 32 123 d 30 104 d 29 86 d 28 70 d 28 55 d 26 44 d 25 37 d 24 32
 d 24 33 d 23 14 d 22 1 d 22 -2 d 21 -7 d 20 -25 d 20 -17 d 19 -10 d 19 -5 d 36 -6 d 35 -3 d 33 -2 d 32 -2 d 30 -1 d 29 -1 d 28 X 27 -1 d 26 -1 d 26 X 24 -1 d 24 X 22 -1 d 23 X 21 -4 d 21 -9 d 21 -9 d 19 -8 d 20 -6 d 19 -5 d 18 -4 d 18 -4 d 17 -2 d
 18 -2 d 16 -2 d 17 -1 d 16 -1 d 75 X 14 1 d 14 X 14 1 d 13 X 13 1 d 13 1 d 13 X 12 1 d 13 1 d 12 1 d 12 1 d 11 1 d 12 X 11 1 d 11 1 d 11 1 d 11 1 d 11 1 d 11 1 d 10 X 10 1 d 10 1 d 10 1 d 10 X 10 1 d 9 1 d 10 1 d 9 X 10 1 d 9 X 9 1 d 9 1 d 8 X 9 1
 d 9 X 8 1 d 9 1 d 8 X 8 1 d 8 X 8 1 d 8 X 8 1 d 8 X 8 1 d 7 X 8 1 d 7 X s
 gsave  2268 2176 0 0 C 1472 1960 t 0 r /Helvetica findfont 102.732 sf 0 0 m (WW) show NC gr  0.35 0.33 0.85 c black 0.35 0.33 0.85 c 432 348 m 9 31 d s 441 379 m 37 160 d 34 177 d 33 172 d 32 152 d 30 127 d 29 101 d 28 79 d 28 57 d 26 35 d 25 9 d
 24 -29 d 24 -143 d 23 -156 d 22 15 d 22 78 d 21 155 d 20 227 d 20 83 d 19 33 d 19 17 d 36 17 d 35 9 d 33 5 d 32 4 d 30 2 d 29 2 d 28 3 d 27 1 d 26 1 d 26 2 d 24 X 24 1 d 22 1 d 23 1 d 21 -3 d 21 -9 d 21 -8 d 19 -7 d 20 -6 d 19 -3 d 18 -4 d 18 -2 d
 17 -2 d 18 -1 d 16 -1 d 48 X 16 1 d 15 1 d 14 X 15 1 d 14 1 d 14 2 d 14 1 d 13 1 d 13 1 d 13 2 d 13 1 d 12 1 d 13 X 12 2 d 12 1 d 11 1 d 12 2 d 11 1 d 11 1 d 11 1 d 11 X 11 2 d 11 1 d 10 1 d 10 1 d 10 1 d 10 X 10 1 d 10 1 d 9 1 d 10 1 d 9 1 d 10 1
 d 9 X 9 1 d 9 1 d 8 1 d 9 1 d 9 1 d 17 X 8 1 d 8 1 d 8 1 d 8 X 8 1 d 16 X 8 1 d 7 1 d 8 X 7 1 d s
 gsave  2268 2176 0 0 C 1495 1765 t 0 r /Helvetica findfont 102.732 sf 0 0 m (ZZ) show NC gr  black
 gsave  2268 2176 0 0 C 2222 1579 t 90 r /Helvetica-BoldOblique findfont 41.8538 sf 0 0 m (LHC HIGGS XS WG 2010) show NC gr 
 gr  gr 
showpage
end
%%EOF
