%!PS-Adobe-2.0 EPSF-2.0
%%BoundingBox:  0 0 567 544
%%Title: YRHXS_PDF_10.eps: RESC2008nnlo
%%Creator: ROOT Version 5.27/06
%%CreationDate: Wed Nov 24 15:52:31 2010
%%EndComments
%%BeginProlog
80 dict begin
/s {stroke} def /l {lineto} def /m {moveto} def /t {translate} def
/r {rotate} def /rl {roll}  def /R {repeat} def
/d {rlineto} def /rm {rmoveto} def /gr {grestore} def /f {eofill} def
/c {setrgbcolor} def /black {0 setgray} def /sd {setdash} def
/cl {closepath} def /sf {scalefont setfont} def /lw {setlinewidth} def
/box {m dup 0 exch d exch 0 d 0 exch neg d cl} def
/NC{systemdict begin initclip end}def/C{NC box clip newpath}def
/bl {box s} def /bf {box f} def /Y { 0 exch d} def /X { 0 d} def 
/K {{pop pop 0 moveto} exch kshow} bind def
/ita {/ang 15 def gsave [1 0 ang dup sin exch cos div 1 0 0] concat} def 
/mp {newpath /y exch def /x exch def} def
/side {[w .77 mul w .23 mul] .385 w mul sd w 0 l currentpoint t -144 r} def
/mr {mp x y w2 0 360 arc} def /m24 {mr s} def /m20 {mr f} def
/mb {mp x y w2 add m w2 neg 0 d 0 w neg d w 0 d 0 w d cl} def
/mt {mp x y w2 add m w2 neg w neg d w 0 d cl} def
/m21 {mb f} def /m25 {mb s} def /m22 {mt f} def /m26{mt s} def
/m23 {mp x y w2 sub m w2 w d w neg 0 d cl f} def
/m27 {mp x y w2 add m w3 neg w2 neg d w3 w2 neg d w3 w2 d cl s} def
/m28 {mp x w2 sub y w2 sub w3 add m w3 0 d  0 w3 neg d w3 0 d 0 w3 d w3 0 d  0 w3 d w3 neg 0 d 0 w3 d w3 neg 0 d 0 w3 neg d w3 neg 0 d cl s } def
/m29 {mp gsave x w2 sub y w2 add w3 sub m currentpoint t 4 {side} repeat cl fill gr} def
/m30 {mp gsave x w2 sub y w2 add w3 sub m currentpoint t 4 {side} repeat cl s gr} def
/m31 {mp x y w2 sub m 0 w d x w2 sub y m w 0 d x w2 sub y w2 add m w w neg d x w2 sub y w2 sub m w w d s} def
/m32 {mp x y w2 sub m w2 w d w neg 0 d cl s} def
/m33 {mp x y w2 add m w3 neg w2 neg d w3 w2 neg d w3 w2 d cl f} def
/m34 {mp x w2 sub y w2 sub w3 add m w3 0 d  0 w3 neg d w3 0 d 0 w3 d w3 0 d  0 w3 d w3 neg 0 d 0 w3 d w3 neg 0 d 0 w3 neg d w3 neg 0 d cl f } def
/m2 {mp x y w2 sub m 0 w d x w2 sub y m w 0 d s} def
/m5 {mp x w2 sub y w2 sub m w w d x w2 sub y w2 add m w w neg d s} def
/reEncode {exch findfont dup length dict begin {1 index /FID eq  {pop pop} {def} ifelse } forall /Encoding exch def currentdict end dup /FontName get exch definefont pop } def [/Times-Bold /Times-Italic /Times-BoldItalic /Helvetica /Helvetica-Oblique
 /Helvetica-Bold /Helvetica-BoldOblique /Courier /Courier-Oblique /Courier-Bold /Courier-BoldOblique /Times-Roman /AvantGarde-Book /AvantGarde-BookOblique /AvantGarde-Demi /AvantGarde-DemiOblique /Bookman-Demi /Bookman-DemiItalic /Bookman-Light
 /Bookman-LightItalic /Helvetica-Narrow /Helvetica-Narrow-Bold /Helvetica-Narrow-BoldOblique /Helvetica-Narrow-Oblique /NewCenturySchlbk-Roman /NewCenturySchlbk-Bold /NewCenturySchlbk-BoldItalic /NewCenturySchlbk-Italic /Palatino-Bold
 /Palatino-BoldItalic /Palatino-Italic /Palatino-Roman ] {ISOLatin1Encoding reEncode } forall%%EndProlog
%%BeginSetup
%%EndSetup
newpath  gsave  .25 .25 scale  gsave  0 0 t black[  ] 0 sd 3 lw 1 1 1 c 2268 2176 0 0 bf black 1 1 1 c 1791 1720 363 348 bf black 1791 1720 363 348 bl 363 348 m 1791 X s 363 2068 m 1791 X s 363 348 m 1720 Y s[ 4 8] 0 sd 2154 348 m -1791 X s 2154 520
 m -1791 X s 2154 692 m -1791 X s 2154 864 m -1791 X s 2154 1036 m -1791 X s 2154 1208 m -1791 X s 2154 1380 m -1791 X s 2154 1552 m -1791 X s 2154 1724 m -1791 X s 2154 1896 m -1791 X s 2154 2068 m -1791 X s[  ] 0 sd 2154 348 m 1720 Y s 6 lw 1 1 1 c
 black 363 348 m 1791 X s 3 lw 363 348 m 1791 X s
 gsave  2268 2176 0 0 C 1869.19 81.25 t 0 r /Helvetica findfont 102.732 sf 0 0 m ( [GeV]) show NC gr 
 gsave  2268 2176 0 0 C 1823.5 54.625 t 0 r /Helvetica findfont 68.4881 sf 0 0 m (H) show NC gr 
 gsave  2268 2176 0 0 C 1743.62 81.25 t 0 r /Helvetica findfont 102.732 sf 0 0 m (M) show NC gr  363 400 m -52 Y s 408 374 m -26 Y s 452 374 m -26 Y s 497 374 m -26 Y s 542 374 m -26 Y s 587 400 m -52 Y s 632 374 m -26 Y s 676 374 m -26 Y s 721 374 m
 -26 Y s 766 374 m -26 Y s 811 400 m -52 Y s 855 374 m -26 Y s 900 374 m -26 Y s 945 374 m -26 Y s 990 374 m -26 Y s 1035 400 m -52 Y s 1079 374 m -26 Y s 1124 374 m -26 Y s 1169 374 m -26 Y s 1214 374 m -26 Y s 1259 400 m -52 Y s 1303 374 m -26 Y s
 1348 374 m -26 Y s 1393 374 m -26 Y s 1438 374 m -26 Y s 1483 400 m -52 Y s 1527 374 m -26 Y s 1572 374 m -26 Y s 1617 374 m -26 Y s 1662 374 m -26 Y s 1706 400 m -52 Y s 1751 374 m -26 Y s 1796 374 m -26 Y s 1841 374 m -26 Y s 1886 374 m -26 Y s
 1930 400 m -52 Y s 1975 374 m -26 Y s 2020 374 m -26 Y s 2065 374 m -26 Y s 2110 374 m -26 Y s 2154 400 m -52 Y s
 gsave  2268 2176 0 0 C 278.75 252.5 t 0 r /Helvetica findfont 102.732 sf 0 0 m (100) show NC gr 
 gsave  2268 2176 0 0 C 503.25 252.5 t 0 r /Helvetica findfont 102.732 sf 0 0 m (150) show NC gr 
 gsave  2268 2176 0 0 C 727.688 252.5 t 0 r /Helvetica findfont 102.732 sf 0 0 m (200) show NC gr 
 gsave  2268 2176 0 0 C 948.375 252.5 t 0 r /Helvetica findfont 102.732 sf 0 0 m (250) show NC gr 
 gsave  2268 2176 0 0 C 1172.88 252.5 t 0 r /Helvetica findfont 102.732 sf 0 0 m (300) show NC gr 
 gsave  2268 2176 0 0 C 1397.38 252.5 t 0 r /Helvetica findfont 102.732 sf 0 0 m (350) show NC gr 
 gsave  2268 2176 0 0 C 1621.88 252.5 t 0 r /Helvetica findfont 102.732 sf 0 0 m (400) show NC gr 
 gsave  2268 2176 0 0 C 1846.38 252.5 t 0 r /Helvetica findfont 102.732 sf 0 0 m (450) show NC gr 
 gsave  2268 2176 0 0 C 2070.81 252.5 t 0 r /Helvetica findfont 102.732 sf 0 0 m (500) show NC gr  363 2068 m 1791 X s 363 2016 m 52 Y s 408 2042 m 26 Y s 452 2042 m 26 Y s 497 2042 m 26 Y s 542 2042 m 26 Y s 587 2016 m 52 Y s 632 2042 m 26 Y s 676
 2042 m 26 Y s 721 2042 m 26 Y s 766 2042 m 26 Y s 811 2016 m 52 Y s 855 2042 m 26 Y s 900 2042 m 26 Y s 945 2042 m 26 Y s 990 2042 m 26 Y s 1035 2016 m 52 Y s 1079 2042 m 26 Y s 1124 2042 m 26 Y s 1169 2042 m 26 Y s 1214 2042 m 26 Y s 1259 2016 m 52
 Y s 1303 2042 m 26 Y s 1348 2042 m 26 Y s 1393 2042 m 26 Y s 1438 2042 m 26 Y s 1483 2016 m 52 Y s 1527 2042 m 26 Y s 1572 2042 m 26 Y s 1617 2042 m 26 Y s 1662 2042 m 26 Y s 1706 2016 m 52 Y s 1751 2042 m 26 Y s 1796 2042 m 26 Y s 1841 2042 m 26 Y
 s 1886 2042 m 26 Y s 1930 2016 m 52 Y s 1975 2042 m 26 Y s 2020 2042 m 26 Y s 2065 2042 m 26 Y s 2110 2042 m 26 Y s 2154 2016 m 52 Y s 363 348 m 1720 Y s
 gsave  2268 2176 0 0 C 145.562 1995.12 t 90 r /Helvetica findfont 102.732 sf 0 0 m (R) show NC gr  417 348 m -54 X s 390 391 m -27 X s 390 434 m -27 X s 390 477 m -27 X s 417 520 m -54 X s 390 563 m -27 X s 390 606 m -27 X s 390 649 m -27 X s 417
 692 m -54 X s 390 735 m -27 X s 390 778 m -27 X s 390 821 m -27 X s 417 864 m -54 X s 390 907 m -27 X s 390 950 m -27 X s 390 993 m -27 X s 417 1036 m -54 X s 390 1079 m -27 X s 390 1122 m -27 X s 390 1165 m -27 X s 417 1208 m -54 X s 390 1251 m -27
 X s 390 1294 m -27 X s 390 1337 m -27 X s 417 1380 m -54 X s 390 1423 m -27 X s 390 1466 m -27 X s 390 1509 m -27 X s 417 1552 m -54 X s 390 1595 m -27 X s 390 1638 m -27 X s 390 1681 m -27 X s 417 1724 m -54 X s 390 1767 m -27 X s 390 1810 m -27 X
 s 390 1853 m -27 X s 417 1896 m -54 X s 390 1939 m -27 X s 390 1982 m -27 X s 390 2025 m -27 X s 417 2068 m -54 X s
 gsave  2268 2176 0 0 C 309.188 309.562 t 0 r /Helvetica findfont 102.732 sf 0 0 m (1) show NC gr 
 gsave  2268 2176 0 0 C 210.25 480.75 t 0 r /Helvetica findfont 102.732 sf 0 0 m (1.2) show NC gr 
 gsave  2268 2176 0 0 C 210.25 652 t 0 r /Helvetica findfont 102.732 sf 0 0 m (1.4) show NC gr 
 gsave  2268 2176 0 0 C 210.25 830.812 t 0 r /Helvetica findfont 102.732 sf 0 0 m (1.6) show NC gr 
 gsave  2268 2176 0 0 C 210.25 1002.06 t 0 r /Helvetica findfont 102.732 sf 0 0 m (1.8) show NC gr 
 gsave  2268 2176 0 0 C 297.75 1169.44 t 0 r /Helvetica findfont 102.732 sf 0 0 m (2) show NC gr 
 gsave  2268 2176 0 0 C 210.25 1340.69 t 0 r /Helvetica findfont 102.732 sf 0 0 m (2.2) show NC gr 
 gsave  2268 2176 0 0 C 210.25 1511.88 t 0 r /Helvetica findfont 102.732 sf 0 0 m (2.4) show NC gr 
 gsave  2268 2176 0 0 C 210.25 1690.75 t 0 r /Helvetica findfont 102.732 sf 0 0 m (2.6) show NC gr 
 gsave  2268 2176 0 0 C 210.25 1861.94 t 0 r /Helvetica findfont 102.732 sf 0 0 m (2.8) show NC gr 
 gsave  2268 2176 0 0 C 297.75 2033.19 t 0 r /Helvetica findfont 102.732 sf 0 0 m (3) show NC gr  2154 348 m 1720 Y s 2101 348 m 53 X s 2127 391 m 27 X s 2127 434 m 27 X s 2127 477 m 27 X s 2101 520 m 53 X s 2127 563 m 27 X s 2127 606 m 27 X s 2127
 649 m 27 X s 2101 692 m 53 X s 2127 735 m 27 X s 2127 778 m 27 X s 2127 821 m 27 X s 2101 864 m 53 X s 2127 907 m 27 X s 2127 950 m 27 X s 2127 993 m 27 X s 2101 1036 m 53 X s 2127 1079 m 27 X s 2127 1122 m 27 X s 2127 1165 m 27 X s 2101 1208 m 53 X
 s 2127 1251 m 27 X s 2127 1294 m 27 X s 2127 1337 m 27 X s 2101 1380 m 53 X s 2127 1423 m 27 X s 2127 1466 m 27 X s 2127 1509 m 27 X s 2101 1552 m 53 X s 2127 1595 m 27 X s 2127 1638 m 27 X s 2127 1681 m 27 X s 2101 1724 m 53 X s 2127 1767 m 27 X s
 2127 1810 m 27 X s 2127 1853 m 27 X s 2101 1896 m 53 X s 2127 1939 m 27 X s 2127 1982 m 27 X s 2127 2025 m 27 X s 2101 2068 m 53 X s 0 0 1 c[  12 12 ] 0 sd 12 lw black 0 0 1 c 363 1057 m 45 2 d 37 2 d 7 X 29 2 d 16 1 d 24 2 d 18 1 d 3 1 d 18 2 d 19
 2 d 8 1 d 19 3 d 26 4 d 20 3 d 24 4 d 45 8 d 42 7 d 3 1 d 30 5 d 15 2 d 26 4 d 18 3 d 23 2 d 18 3 d 4 X 18 2 d 17 1 d 10 1 d 17 1 d 17 1 d 11 1 d 17 X 18 1 d 27 X 19 -1 d 27 X 19 -1 d 7 -1 d 21 -1 d 24 -2 d 45 -3 d 38 -4 d 7 X 23 -2 d 13 X 8 -1 d 57
 X 13 1 d 16 1 d 4 1 d 13 1 d 17 2 d 15 2 d 23 3 d 18 2 d 4 1 d 25 3 d 12 1 d 7 X 15 1 d 12 1 d 12 X 6 1 d 11 X 14 -1 d 20 X 14 -1 d 31 -2 d 42 -3 d 2 X 22 -1 d 35 X 16 1 d 17 X 15 1 d 30 2 d 31 2 d 14 1 d 18 1 d 26 X 11 -1 d 12 -1 d 13 -1 d 9 -1 d
 10 -1 d 35 -5 d 34 -5 d 8 -1 d 3 X 14 -1 d 10 X 7 -1 d 7 X 7 1 d 7 X 7 1 d 8 1 d 8 1 d 7 1 d 7 2 d s black 0 0 1 c 363 1183 m 45 20 d 44 19 d 45 19 d 34 16 d 11 5 d 29 15 d 16 9 d 34 20 d 11 6 d 44 28 d 45 28 d 36 21 d 9 5 d 34 19 d 11 5 d 44 23 d
 45 21 d 45 20 d 45 21 d 39 17 d 6 3 d 28 11 d 16 5 d 24 7 d 18 5 d 3 X 18 3 d 17 2 d 29 X 26 -2 d 21 -2 d 24 -4 d 44 -9 d 41 -7 d 4 -1 d 27 -2 d 18 -2 d 26 -1 d 19 X 45 -1 d 37 -2 d 7 X 25 -3 d 20 -3 d 22 -4 d 23 -5 d 45 -11 d 44 -12 d 32 -7 d 13 -3
 d 30 -5 d 15 -2 d 45 -5 d 41 -4 d 4 -1 d 29 -4 d 15 -3 d 23 -6 d 22 -6 d 45 -16 d 39 -14 d 6 -1 d 24 -7 d 14 -2 d 7 -1 d 15 -1 d 15 X 14 1 d s 0 1 0 c[ 4 8] 0 sd black 0 1 0 c 363 1096 m 21 1 d 24 2 d 22 X 22 1 d 26 -1 d 19 X 30 -1 d 15 -1 d 36 -2 d
 9 -1 d 45 -3 d 44 -4 d 45 -3 d 37 -2 d 8 -1 d 34 -1 d 11 -1 d 37 -1 d 7 X 45 -1 d 224 X 45 -1 d 45 -1 d 45 -2 d 44 -3 d 45 -2 d 45 -4 d 45 -3 d 45 -4 d 44 -3 d 45 -3 d 45 -3 d 45 -3 d 34 -2 d 10 -1 d 28 -3 d 17 -2 d 25 -3 d 20 -3 d 24 -3 d 21 -4 d
 23 -4 d 22 -5 d 23 -5 d 21 -6 d 26 -7 d 19 -5 d 45 -13 d 45 -14 d 36 -10 d 9 -3 d 21 -5 d 23 -6 d s black 0 1 0 c 363 1359 m 25 15 d 20 13 d 25 18 d 19 14 d 39 28 d 6 4 d 27 17 d 18 11 d 17 8 d 17 7 d 11 4 d 17 4 d 18 4 d 10 1 d 18 1 d 26 X 21 -2 d
 24 -4 d 25 -6 d 20 -6 d 31 -10 d 14 -5 d 44 -17 d 45 -19 d 45 -17 d 38 -14 d 7 -2 d 45 -14 d 44 -12 d 45 -13 d 45 -14 d 45 -15 d 45 -16 d 44 -17 d 45 -16 d 45 -15 d 45 -15 d 45 -14 d 44 -14 d 45 -15 d 45 -14 d 45 -15 d 44 -15 d 45 -15 d 45 -14 d 45
 -15 d 45 -14 d 44 -13 d 45 -14 d 45 -12 d 45 -13 d 45 -11 d 44 -11 d s 1 0 0 c[ 20 12 4 12 4 12 4 12] 0 sd black 1 0 0 c 363 1022 m 20 9 d 21 6 d 4 1 d 21 4 d 23 1 d 25 -1 d 20 -3 d 30 -7 d 15 -4 d 34 -12 d 11 -4 d 33 -14 d 12 -6 d 30 -16 d 14 -9 d
 29 -18 d 16 -12 d 28 -22 d 17 -14 d 36 -34 d 9 -9 d 44 -45 d 45 -44 d 32 -29 d 13 -10 d 23 -17 d 22 -14 d 23 -12 d 22 -10 d 24 -8 d 20 -5 d 27 -5 d 18 -2 d 29 -1 d 16 1 d 29 3 d 16 2 d 28 7 d 17 5 d 27 9 d 17 8 d 27 14 d 18 11 d 27 18 d 18 13 d 31
 25 d 14 12 d 38 36 d 7 6 d 44 44 d 45 45 d 45 44 d 45 44 d 44 43 d 45 44 d 45 42 d 45 43 d 45 42 d 44 43 d 45 43 d 45 44 d 45 44 d 45 43 d 44 42 d s black 1 0 0 c 363 1716 m 17 -34 d 18 -30 d 10 -17 d 18 -26 d 26 -32 d 19 -21 d 26 -25 d 45 -39 d 45
 -42 d 38 -40 d 7 -8 d 44 -52 d 45 -55 d 45 -56 d 45 -56 d 44 -54 d 38 -43 d 7 -7 d 32 -33 d 13 -12 d 28 -24 d 17 -12 d 27 -18 d 18 -10 d 26 -12 d 18 -6 d 26 -6 d 19 -3 d 26 -1 d 19 2 d 27 6 d 18 5 d 29 12 d 16 8 d 31 18 d 13 9 d 35 25 d 10 8 d 38 32
 d 7 6 d 38 36 d 7 7 d 37 39 d 8 9 d 36 43 d 8 10 d 38 48 d 7 10 d 45 63 d 45 66 d 44 65 d 45 64 d 45 60 d 45 58 d 45 57 d 44 57 d 45 60 d 45 63 d 45 63 d 45 62 d 42 55 d s black
 gsave  2268 2176 0 0 C 1176.69 2075 t 0 r /Helvetica-BoldOblique findfont 102.732 sf 0 0 m (LHC HIGGS XS WG) show NC gr 
 gsave  2268 2176 0 0 C 408.125 1960.88 t 0 r /Helvetica findfont 60.8783 sf 0 0 m (rescaling factors) show NC gr 
 gsave  2268 2176 0 0 C 408.125 1854.38 t 0 r /Helvetica findfont 60.8783 sf 0 0 m (lower curves = upper limit of uncertainty bands) show NC gr 
 gsave  2268 2176 0 0 C 1062.56 526.438 t 0 r /Helvetica findfont 60.8783 sf 0 0 m (\)) show NC gr 
 gsave  2268 2176 0 0 C 1035.88 496 t 0 r /Helvetica findfont 41.8538 sf 0 0 m (Z) show NC gr 
 gsave  2268 2176 0 0 C 967.438 526.438 t 0 r /Helvetica findfont 60.8783 sf 0 0 m (\(m) show NC gr 
 gsave  2268 2176 0 0 C 944.562 511.188 t 0 r /Helvetica findfont 41.8538 sf 0 0 m (s) show NC gr 
 gsave  2268 2176 0 0 C 906.562 526.438 t 0 r /Symbol findfont 60.8783 sf 0 0 m (a) show NC gr 
 gsave  2268 2176 0 0 C 408.125 526.438 t 0 r /Helvetica findfont 60.8783 sf 0 0 m 
 480 463 429 412 382 348 314 300 267 236 219 202 168 135 114 80 63 48 34
(different values of ) K NC gr 
 gsave  2268 2176 0 0 C 788.562 416.125 t 0 r /Helvetica findfont 60.8783 sf 0 0 m ( uncertainties) show NC gr 
 gsave  2268 2176 0 0 C 765.75 400.875 t 0 r /Helvetica findfont 41.8538 sf 0 0 m (s) show NC gr 
 gsave  2268 2176 0 0 C 727.688 416.125 t 0 r /Symbol findfont 60.8783 sf 0 0 m (a) show NC gr 
 gsave  2268 2176 0 0 C 408.125 416.125 t 0 r /Helvetica findfont 60.8783 sf 0 0 m (exact PDF+) show NC gr [  ] 0 sd 3 lw 1 1 1 c 431 414 1723 348 bf black 1723 348 m 431 X s 2154 348 m 414 Y s 2154 762 m -431 X s 1723 762 m -414 Y s
 gsave  2268 2176 0 0 C 1831.12 682.438 t 0 r /Helvetica findfont 41.8538 sf 0 0 m 
 142 118 103 92 68 46 22
(Tevatron) K NC gr  1 0 0 c[ 20 12 4 12 4 12 4 12] 0 sd 12 lw 1740 693 m 75 X s black
 gsave  2268 2176 0 0 C 1831.12 537.875 t 0 r /Helvetica findfont 41.8538 sf 0 0 m 
 191 167 146 134 110 98 86 55 24
(LHC  7 TeV) K NC gr  0 1 0 c[ 4 8] 0 sd 1740 555 m 75 X s black
 gsave  2268 2176 0 0 C 1831.12 400.875 t 0 r /Helvetica findfont 41.8538 sf 0 0 m 
 203 179 158 146 122 98 86 55 24
(LHC 14 TeV) K NC gr  0 0 1 c[  12 12 ] 0 sd 1740 417 m 75 X s
 gr  gr showpage
end
%%EOF
