%!PS-Adobe-2.0 EPSF-2.0
%%BoundingBox:  0 0 567 384
%%Title: : c1
%%Creator: ROOT Version 5.24/00
%%CreationDate: Tue Nov 30 15:33:19 2010
%%EndComments
%%BeginProlog
80 dict begin
/s {stroke} def /l {lineto} def /m {moveto} def /t {translate} def
/sw {stringwidth} def /r {rotate} def /rl {roll}  def /R {repeat} def
/d {rlineto} def /rm {rmoveto} def /gr {grestore} def /f {eofill} def
/c {setrgbcolor} def /black {0 setgray} def /sd {setdash} def
/cl {closepath} def /sf {scalefont setfont} def /lw {setlinewidth} def
/box {m dup 0 exch d exch 0 d 0 exch neg d cl} def
/NC{systemdict begin initclip end}def/C{NC box clip newpath}def
/bl {box s} def /bf {box f} def /Y { 0 exch d} def /X { 0 d} def 
/mp {newpath /y exch def /x exch def} def
/side {[w .77 mul w .23 mul] .385 w mul sd w 0 l currentpoint t -144 r} def
/mr {mp x y w2 0 360 arc} def /m24 {mr s} def /m20 {mr f} def
/mb {mp x y w2 add m w2 neg 0 d 0 w neg d w 0 d 0 w d cl} def
/mt {mp x y w2 add m w2 neg w neg d w 0 d cl} def
/m21 {mb f} def /m25 {mb s} def /m22 {mt f} def /m26{mt s} def
/m23 {mp x y w2 sub m w2 w d w neg 0 d cl f} def
/m27 {mp x y w2 add m w3 neg w2 neg d w3 w2 neg d w3 w2 d cl s} def
/m28 {mp x w2 sub y w2 sub w3 add m w3 0 d  0 w3 neg d w3 0 d 0 w3 d w3 0 d  0 w3 d w3 neg 0 d 0 w3 d w3 neg 0 d
 0 w3 neg d w3 neg 0 d cl s } def
/m29 {mp gsave x w2 sub y w2 add w3 sub m currentpoint t
 4 {side} repeat cl fill gr} def
/m30 {mp gsave x w2 sub y w2 add w3 sub m currentpoint t
 4 {side} repeat cl s gr} def
/m31 {mp x y w2 sub m 0 w d x w2 sub y m w 0 d x w2 sub y w2 add m w w neg d x w2 sub y w2
 sub m w w d s} def
/m2 {mp x y w2 sub m 0 w d x w2 sub y m w 0 d s} def
/m5 {mp x w2 sub y w2 sub m w w d x w2 sub y w2 add m w w neg d s} def
/reEncode {exch findfont dup length dict begin {1 index /FID eq  {pop pop} {def} ifelse } forall /Encoding exch def currentdict end dup /FontName get exch definefont pop } def [/Times-Bold /Times-Italic /Times-BoldItalic /Helvetica
 /Helvetica-Oblique /Helvetica-Bold /Helvetica-BoldOblique /Courier /Courier-Oblique /Courier-Bold /Courier-BoldOblique /Times-Roman /AvantGarde-Book /AvantGarde-BookOblique /AvantGarde-Demi /AvantGarde-DemiOblique /Bookman-Demi
 /Bookman-DemiItalic /Bookman-Light /Bookman-LightItalic /Helvetica-Narrow /Helvetica-Narrow-Bold /Helvetica-Narrow-BoldOblique /Helvetica-Narrow-Oblique /NewCenturySchlbk-Roman /NewCenturySchlbk-Bold
 /NewCenturySchlbk-BoldItalic /NewCenturySchlbk-Italic /Palatino-Bold /Palatino-BoldItalic /Palatino-Italic /Palatino-Roman ] {ISOLatin1Encoding reEncode } forall
/oshow {gsave [] 0 sd true charpath stroke gr} def
/stwn { /fs exch def /fn exch def /text exch def fn findfont fs sf
 text sw pop xs add /xs exch def} def
/stwb { /fs exch def /fn exch def /nbas exch def /textf exch deftextf length /tlen exch def nbas tlen gt {/nbas tlendef} iffn findfont fs sf textf dup length nbas sub nbas getinterval sw
pop neg xs add /xs exch def} def
%%EndProlog
%%BeginSetup
%%EndSetup
newpath  gsave  .25 .25 scale  gsave  0 0 t black[  ] 0 sd 3 lw 1 1 1 c 2268 1538 0 0 bf black 1 1 1 c 1791 1215 363 246 bf black 1791 1215 363 246 bl 1 1 1 c 1791 1215 363 246 bf black 1791 1215 363 246 bl 363 246 m 1791 X s
 gsave  2268 1538 0 0 C 1955 117 t 0 r /Helvetica findfont 71.6807 sf 0 0 m ( [GeV]) show NC gr 
 gsave  2268 1538 0 0 C 1922 98 t 0 r /Helvetica findfont 48.8732 sf 0 0 m (H) show NC gr 
 gsave  2268 1538 0 0 C 1867 117 t 0 r /Helvetica findfont 71.6807 sf 0 0 m (M) show NC gr  401 283 m -37 Y s 439 264 m -18 Y s 477 264 m -18 Y s 515 264 m -18 Y s 553 264 m -18 Y s 592 283 m -37 Y s 630 264 m -18 Y s 668 264 m -18 Y s 706 264 m -18
 Y s 744 264 m -18 Y s 782 283 m -37 Y s 820 264 m -18 Y s 858 264 m -18 Y s 896 264 m -18 Y s 935 264 m -18 Y s 973 283 m -37 Y s 1011 264 m -18 Y s 1049 264 m -18 Y s 1087 264 m -18 Y s 1125 264 m -18 Y s 1163 283 m -37 Y s 1201 264 m -18 Y s 1240
 264 m -18 Y s 1278 264 m -18 Y s 1316 264 m -18 Y s 1354 283 m -37 Y s 1392 264 m -18 Y s 1430 264 m -18 Y s 1468 264 m -18 Y s 1506 264 m -18 Y s 1544 283 m -37 Y s 1583 264 m -18 Y s 1621 264 m -18 Y s 1659 264 m -18 Y s 1697 264 m -18 Y s 1735
 283 m -37 Y s 1773 264 m -18 Y s 1811 264 m -18 Y s 1849 264 m -18 Y s 1888 264 m -18 Y s 1926 283 m -37 Y s 1964 264 m -18 Y s 2002 264 m -18 Y s 2040 264 m -18 Y s 2078 264 m -18 Y s 2116 283 m -37 Y s 401 283 m -37 Y s 363 264 m -18 Y s 2116 283
 m -37 Y s
 gsave  2268 1538 0 0 C 342 179 t 0 r /Helvetica findfont 71.6807 sf 0 0 m (100) show NC gr 
 gsave  2268 1538 0 0 C 531 179 t 0 r /Helvetica findfont 71.6807 sf 0 0 m (200) show NC gr 
 gsave  2268 1538 0 0 C 723 179 t 0 r /Helvetica findfont 71.6807 sf 0 0 m (300) show NC gr 
 gsave  2268 1538 0 0 C 912 179 t 0 r /Helvetica findfont 71.6807 sf 0 0 m (400) show NC gr 
 gsave  2268 1538 0 0 C 1105 179 t 0 r /Helvetica findfont 71.6807 sf 0 0 m (500) show NC gr 
 gsave  2268 1538 0 0 C 1294 179 t 0 r /Helvetica findfont 71.6807 sf 0 0 m (600) show NC gr 
 gsave  2268 1538 0 0 C 1486 179 t 0 r /Helvetica findfont 71.6807 sf 0 0 m (700) show NC gr 
 gsave  2268 1538 0 0 C 1675 179 t 0 r /Helvetica findfont 71.6807 sf 0 0 m (800) show NC gr 
 gsave  2268 1538 0 0 C 1867 179 t 0 r /Helvetica findfont 71.6807 sf 0 0 m (900) show NC gr 
 gsave  2268 1538 0 0 C 2036 179 t 0 r /Helvetica findfont 71.6807 sf 0 0 m (1000) show NC gr  363 1461 m 1791 X s 401 1425 m 36 Y s 439 1443 m 18 Y s 477 1443 m 18 Y s 515 1443 m 18 Y s 553 1443 m 18 Y s 592 1425 m 36 Y s 630 1443 m 18 Y s 668 1443
 m 18 Y s 706 1443 m 18 Y s 744 1443 m 18 Y s 782 1425 m 36 Y s 820 1443 m 18 Y s 858 1443 m 18 Y s 896 1443 m 18 Y s 935 1443 m 18 Y s 973 1425 m 36 Y s 1011 1443 m 18 Y s 1049 1443 m 18 Y s 1087 1443 m 18 Y s 1125 1443 m 18 Y s 1163 1425 m 36 Y s
 1201 1443 m 18 Y s 1240 1443 m 18 Y s 1278 1443 m 18 Y s 1316 1443 m 18 Y s 1354 1425 m 36 Y s 1392 1443 m 18 Y s 1430 1443 m 18 Y s 1468 1443 m 18 Y s 1506 1443 m 18 Y s 1544 1425 m 36 Y s 1583 1443 m 18 Y s 1621 1443 m 18 Y s 1659 1443 m 18 Y s
 1697 1443 m 18 Y s 1735 1425 m 36 Y s 1773 1443 m 18 Y s 1811 1443 m 18 Y s 1849 1443 m 18 Y s 1888 1443 m 18 Y s 1926 1425 m 36 Y s 1964 1443 m 18 Y s 2002 1443 m 18 Y s 2040 1443 m 18 Y s 2078 1443 m 18 Y s 2116 1425 m 36 Y s 401 1425 m 36 Y s
 363 1443 m 18 Y s 2116 1425 m 36 Y s 363 246 m 1215 Y s
 gsave  2268 1538 0 0 C 235 740 t 90 r /Helvetica findfont 71.6807 sf 0 0 m (VBF Cross Section [fb]) show NC gr  390 272 m -27 X s 417 296 m -54 X s
 gsave  2268 1538 0 0 C 342 266 t 0 r  -79 0 t /Helvetica findfont 71.6807 sf 0 0 m (10) show NC gr  390 450 m -27 X s 390 540 m -27 X s 390 604 m -27 X s 390 653 m -27 X s 390 694 m -27 X s 390 728 m -27 X s 390 757 m -27 X s 390 784 m -27 X s 417
 807 m -54 X s
 gsave  2268 1538 0 0 C 316 805 t 0 r /Helvetica findfont 48.8732 sf 0 0 m (2) show NC gr 
 gsave  2268 1538 0 0 C 238 775 t 0 r /Helvetica findfont 71.6807 sf 0 0 m (10) show NC gr  390 961 m -27 X s 390 1051 m -27 X s 390 1115 m -27 X s 390 1164 m -27 X s 390 1205 m -27 X s 390 1239 m -27 X s 390 1269 m -27 X s 390 1295 m -27 X s 417
 1318 m -54 X s
 gsave  2268 1538 0 0 C 316 1320 t 0 r /Helvetica findfont 48.8732 sf 0 0 m (3) show NC gr 
 gsave  2268 1538 0 0 C 238 1287 t 0 r /Helvetica findfont 71.6807 sf 0 0 m (10) show NC gr  2154 246 m 1215 Y s 2127 272 m 27 X s 2101 296 m 53 X s 2127 450 m 27 X s 2127 540 m 27 X s 2127 604 m 27 X s 2127 653 m 27 X s 2127 694 m 27 X s 2127 728 m
 27 X s 2127 757 m 27 X s 2127 784 m 27 X s 2101 807 m 53 X s 2127 961 m 27 X s 2127 1051 m 27 X s 2127 1115 m 27 X s 2127 1164 m 27 X s 2127 1205 m 27 X s 2127 1239 m 27 X s 2127 1269 m 27 X s 2127 1295 m 27 X s 2101 1318 m 53 X s 0.4 0.4 0.8 c 401
 1413 m 19 -22 d 19 -22 d 19 -21 d 19 -20 d 19 -21 d 19 -20 d 19 -16 d 19 -20 d 19 -17 d 20 -18 d 19 -19 d 19 -17 d 19 -18 d 19 -17 d 19 -16 d 19 -17 d 19 -16 d 19 -15 d 19 -16 d 19 -15 d 38 -30 d 38 -31 d 38 -27 d 39 -25 d 38 -24 d 190 -118 d 191
 -110 d 190 -103 d 191 -94 d 191 -89 d 190 -82 d s 1 lw << /PatternType 1 /PaintType 2 /TilingType 1 /BBox [ 0 0 100 100 ] /XStep 98 /YStep 4 /PaintProc { begin gsave [1] 0 sd 2 4 m 99 4 l s 1 3 m 98 3 l s 2 2 m 99 2 l s 1 1 m 98 1 l s
 gr end } >> [ 4.0 0 0 4.0 0 0 ] makepattern /P01 exch def /cs {[/Pattern /DeviceRGB] setcolorspace} def /FA {f [/DeviceRGB] setcolorspace} def cs 0.4 0.4 0.8 P01 setcolor 401 1418 m 19 -22 d 19 -22 d 19 -21 d 19 -21 d 19 -20 d 19 -20 d 19 -16 d 19
 -20 d 19 -17 d 20 -18 d 19 -19 d 19 -17 d 19 -18 d 19 -16 d 19 -17 d 19 -16 d 19 -16 d 19 -16 d 19 -15 d 19 -15 d 38 -30 d 38 -30 d 38 -28 d 39 -24 d 38 -24 d 190 -117 d 191 -109 d 190 -101 d 191 -93 d 191 -88 d 190 -81 d -29 Y -190 83 d -191 90 d
 -191 96 d -190 103 d -191 112 d -190 119 d -38 25 d -39 24 d -38 28 d -38 31 d -38 30 d -19 16 d -19 16 d -19 16 d -19 16 d -19 16 d -19 17 d -19 17 d -19 18 d -19 17 d -19 19 d -20 18 d -19 17 d -19 20 d -19 16 d -19 21 d -19 20 d -19 21 d -19 21
 d -19 21 d -19 22 d FA 3 lw 0.8 0 0 c 382 1446 m 9 -12 d 10 -11 d 9 -11 d 10 -11 d 10 -12 d 9 -10 d 10 -11 d 9 -10 d 10 -11 d 9 -10 d 10 -10 d 9 -10 d 10 -10 d 9 -9 d 10 -10 d 9 -9 d 10 -10 d 9 -9 d 10 -9 d 9 -9 d 10 -9 d 10 -9 d 19 -18 d 19 -17 d
 19 -17 d 19 -17 d 19 -16 d 19 -16 d 19 -16 d 19 -15 d 19 -16 d 19 -15 d 38 -29 d 38 -29 d 38 -28 d 39 -27 d 38 -27 d 38 -26 d 38 -26 d 38 -25 d 38 -24 d 38 -25 d 38 -24 d 39 -23 d 38 -23 d 38 -23 d 38 -23 d 95 -55 d 95 -53 d 96 -53 d 95 -51 d 95
 -49 d 96 -49 d 95 -49 d 95 -47 d s 2116 269 m -10 -10 d s 2116 288 m -23 -23 d s 2105 296 m -24 -24 d s 2092 303 m -24 -25 d s 2079 309 m -24 -24 d s 2066 315 m -24 -24 d s 2053 322 m -24 -24 d s 2040 328 m -23 -24 d s 2028 334 m -24 -23 d s 2015
 341 m -24 -24 d s 2002 347 m -24 -23 d s 1989 353 m -23 -23 d s 1976 360 m -23 -23 d s 1963 366 m -23 -23 d s 1951 373 m -23 -23 d s 1938 379 m -23 -23 d s 1925 385 m -23 -22 d s 1912 392 m -22 -22 d s 1899 398 m -22 -22 d s 1887 405 m -23 -22 d s
 1874 411 m -22 -22 d s 1861 418 m -22 -22 d s 1848 424 m -21 -21 d s 1835 431 m -21 -22 d s 1823 437 m -22 -21 d s 1810 444 m -21 -21 d s 1797 450 m -21 -21 d s 1785 457 m -21 -21 d s 1772 464 m -21 -21 d s 1759 470 m -20 -21 d s 1747 477 m -21 -21
 d s 1734 483 m -20 -20 d s 1721 490 m -20 -20 d s 1709 497 m -20 -21 d s 1696 503 m -20 -20 d s 1684 510 m -20 -20 d s 1671 516 m -20 -19 d s 1658 523 m -19 -20 d s 1646 530 m -20 -20 d s 1633 536 m -19 -19 d s 1621 543 m -19 -19 d s 1608 550 m -19
 -19 d s 1596 557 m -19 -19 d s 1583 564 m -18 -19 d s 1571 570 m -19 -18 d s 1558 577 m -18 -19 d s 1546 584 m -18 -19 d s 1534 591 m -19 -19 d s 1521 598 m -18 -19 d s 1509 604 m -18 -18 d s 1496 611 m -17 -18 d s 1484 618 m -18 -18 d s 1472 625 m
 -18 -18 d s 1459 632 m -17 -18 d s 1447 639 m -17 -17 d s 1435 646 m -17 -17 d s 1422 653 m -17 -17 d s 1410 660 m -17 -17 d s 1398 667 m -17 -17 d s 1386 674 m -17 -17 d s 1373 681 m -16 -17 d s 1361 688 m -16 -17 d s 1349 695 m -16 -16 d s 1337
 702 m -16 -16 d s 1325 709 m -16 -16 d s 1313 716 m -16 -16 d s 1301 723 m -16 -15 d s 1288 730 m -15 -15 d s 1276 738 m -15 -16 d s 1264 745 m -15 -15 d s 1252 752 m -15 -15 d s 1240 759 m -15 -15 d s 1228 767 m -15 -15 d s 1216 774 m -14 -15 d s
 1205 781 m -15 -15 d s 1193 789 m -15 -15 d s 1181 796 m -15 -15 d s 1169 803 m -14 -14 d s 1157 811 m -14 -15 d s 1145 818 m -14 -14 d s 1133 826 m -14 -14 d s 1122 833 m -14 -14 d s 1110 841 m -14 -14 d s 1098 848 m -14 -14 d s 1086 856 m -13 -14
 d s 1075 863 m -14 -13 d s 1063 871 m -13 -14 d s 1052 878 m -14 -13 d s 1040 886 m -13 -13 d s 1028 894 m -13 -13 d s 1017 901 m -13 -12 d s 1005 909 m -12 -13 d s 994 917 m -13 -13 d s 982 925 m -12 -13 d s 971 932 m -12 -12 d s 960 940 m -12 -12
 d s 948 948 m -12 -12 d s 937 956 m -12 -12 d s 926 964 m -12 -12 d s 914 972 m -11 -11 d s 903 980 m -11 -11 d s 892 988 m -11 -11 d s 881 996 m -11 -11 d s 870 1004 m -11 -11 d s 858 1012 m -10 -10 d s 847 1021 m -10 -11 d s 836 1029 m -10 -11 d
 s 825 1037 m -10 -11 d s 814 1045 m -10 -10 d s 803 1054 m -10 -11 d s 793 1062 m -10 -10 d s 782 1070 m -10 -10 d s 771 1079 m -10 -10 d s 760 1087 m -9 -9 d s 749 1096 m -9 -10 d s 739 1104 m -10 -9 d s 728 1113 m -9 -9 d s 718 1122 m -10 -10 d s
 707 1130 m -9 -9 d s 696 1139 m -8 -9 d s 686 1148 m -9 -9 d s 676 1157 m -9 -9 d s 665 1165 m -8 -8 d s 655 1174 m -8 -8 d s 645 1183 m -9 -8 d s 634 1192 m -8 -8 d s 624 1201 m -8 -7 d s 614 1210 m -8 -7 d s 604 1220 m -8 -8 d s 594 1229 m -8 -8
 d s 584 1238 m -8 -7 d s 574 1247 m -7 -7 d s 564 1257 m -7 -7 d s 554 1266 m -7 -7 d s 544 1275 m -6 -6 d s 534 1285 m -6 -7 d s 525 1294 m -7 -6 d s 515 1304 m -6 -6 d s 506 1314 m -7 -6 d s 496 1323 m -6 -6 d s 487 1333 m -6 -6 d s 477 1343 m -6
 -6 d s 468 1353 m -6 -6 d s 458 1363 m -5 -6 d s 449 1373 m -5 -5 d s 440 1383 m -5 -5 d s 431 1393 m -5 -5 d s 422 1404 m -5 -6 d s 413 1414 m -5 -5 d s 404 1424 m -5 -5 d s 396 1435 m -5 -5 d s 387 1445 m -5 -5 d s 2113 292 m 3 -3 d s 2075 311 m
 41 -41 d s 2037 329 m 73 -72 d s 1999 348 m 72 -71 d s 1961 368 m 71 -72 d s 1922 387 m 71 -71 d s 1883 407 m 70 -70 d s 1844 426 m 69 -69 d s 1805 447 m 68 -69 d s 1765 467 m 68 -68 d s 1725 488 m 67 -67 d s 1684 510 m 67 -67 d s 1643 531 m 66 -66
 d s 1601 554 m 66 -66 d s 1559 576 m 66 -65 d s 1517 600 m 64 -65 d s 1473 624 m 65 -64 d s 1429 649 m 64 -64 d s 1384 675 m 64 -64 d s 1339 701 m 63 -63 d s 1292 728 m 63 -63 d s 1244 757 m 63 -63 d s 1195 787 m 63 -63 d s 1144 819 m 63 -63 d s
 1091 853 m 64 -64 d s 1035 889 m 65 -65 d s 976 929 m 67 -67 d s 912 974 m 69 -70 d s 842 1025 m 72 -73 d s 759 1088 m 81 -81 d s 382 1446 m 27 -27 d s 645 1183 m 105 -105 d s 471 1337 m 133 -132 d s 0 lw 1 1 1 c 3 lw 782 323 1258 1049 bf black
 gsave  2268 1538 0 0 C 1453 1277 t 0 r /Helvetica findfont 42.3568 sf 0 0 m (NLO QCD+EW \255 7 TeV) show NC gr  0.4 0.4 0.8 c cs 0.4 0.4 0.8 P01 setcolor 1287 1235 m 137 X 113 Y -137 X FA 0.4 0.4 0.8 c 1287 1348 m 137 X s 1287 1235 m 137 X s 1424
 1235 m 113 Y s 1287 1235 m 113 Y s black
 gsave  2268 1538 0 0 C 1453 1114 t 0 r /Helvetica findfont 42.3568 sf 0 0 m (NLO QCD \255 7 TeV) show NC gr  0.8 0 0 c 1424 1077 m -4 -4 d s 1424 1097 m -24 -24 d s 1424 1116 m -43 -43 d s 1424 1135 m -62 -62 d s 1424 1154 m -81 -81 d s 1424 1174 m
 -101 -101 d s 1417 1186 m -113 -113 d s 1398 1186 m -111 -111 d s 1379 1186 m -92 -91 d s 1359 1186 m -72 -72 d s 1340 1186 m -53 -53 d s 1321 1186 m -34 -34 d s 1302 1186 m -15 -14 d s 1411 1186 m 13 -12 d s 1392 1186 m 32 -31 d s 1373 1186 m 51
 -51 d s 1354 1186 m 70 -70 d s 1334 1186 m 90 -89 d s 1315 1186 m 109 -108 d s 1296 1186 m 113 -113 d s 1287 1176 m 103 -103 d s 1287 1157 m 83 -84 d s 1287 1138 m 64 -65 d s 1287 1118 m 45 -45 d s 1287 1099 m 26 -26 d s 1287 1080 m 6 -7 d s 0 lw
 0.4 0.4 0.8 c 0.8 0 0 c 3 lw 1287 1186 m 137 X s 1287 1073 m 137 X s 1424 1073 m 113 Y s 1287 1073 m 113 Y s black
 gsave  2268 1538 0 0 C 2222 1118 t 90 r /Helvetica-BoldOblique findfont 29.3239 sf 0 0 m (LHC HIGGS XS WG 2010) show NC gr 
 gr  gr 
showpage
end
%%EOF
