%!PS-Adobe-1.0
%%Creator: Unified Graphics System
%%Pages: (atend)
%%DocumentFonts: Helvetica
%%BoundingBox:   54  236  464  568
%%EndComments
/Sw{setlinewidth}def
/Sg{setgray}def
/Sd{setdash}def
/P {newpath
    moveto
0 0 rlineto
    stroke}def
/M {moveto}def
/D {lineto}def
/N {newpath}def
/S {stroke}def
/T {/Helvetica findfont
    exch
    scalefont
    setfont}def
/R {rotate}def
/W {show}def
/F {fill}def
/X {gsave}def
/Y {grestore}def
%%EndProlog
%%Page: 1 1
0.12000 0.12000 scale
1 setlinecap
1 setlinejoin
6 Sw
0.00 0.00 0.00 setrgbcolor
[] 0 Sd
N
785 4685 M
785 2262 D
S
N
785 2262 M
3762 2262 D
S
N
3762 2262 M
3762 4685 D
S
N
3762 4685 M
785 4685 D
S
N
785 2262 M
3762 2262 D
S
N
785 2262 M
785 2296 D
S
N
989 2296 M
989 2262 D
S
N
1147 2262 M
1147 2366 D
S
N
1276 2296 M
1276 2262 D
S
N
1385 2262 M
1385 2296 D
S
N
1480 2296 M
1480 2262 D
S
N
1563 2262 M
1563 2296 D
S
N
1638 2366 M
1638 2262 D
S
N
2129 2262 M
2129 2366 D
S
N
2417 2296 M
2417 2262 D
S
N
2621 2262 M
2621 2296 D
S
N
2779 2366 M
2779 2262 D
S
N
2908 2262 M
2908 2296 D
S
N
3017 2296 M
3017 2262 D
S
N
3112 2262 M
3112 2296 D
S
N
3196 2296 M
3196 2262 D
S
N
3270 2262 M
3270 2366 D
S
N
3762 2366 M
3762 2262 D
S
N
1132 2205 M
1126 2176 D
S
N
1126 2176 M
1132 2182 D
1141 2184 D
1150 2184 D
1158 2182 D
1164 2176 D
1167 2167 D
1167 2161 D
1164 2153 D
1158 2147 D
1150 2144 D
1141 2144 D
1132 2147 D
1129 2150 D
1126 2156 D
1126 2158 D
1129 2161 D
1132 2158 D
1129 2156 D
S
N
1150 2184 M
1155 2182 D
1161 2176 D
1164 2167 D
1164 2161 D
1161 2153 D
1155 2147 D
1150 2144 D
S
N
1132 2205 M
1161 2205 D
S
N
1132 2202 M
1147 2202 D
1161 2205 D
S
N
1598 2193 M
1603 2196 D
1612 2205 D
1612 2144 D
S
N
1609 2202 M
1609 2144 D
S
N
1598 2144 M
1624 2144 D
S
N
1664 2205 M
1655 2202 D
1650 2193 D
1647 2179 D
1647 2170 D
1650 2156 D
1655 2147 D
1664 2144 D
1670 2144 D
1678 2147 D
1684 2156 D
1687 2170 D
1687 2179 D
1684 2193 D
1678 2202 D
1670 2205 D
1664 2205 D
S
N
1664 2205 M
1658 2202 D
1655 2199 D
1653 2193 D
1650 2179 D
1650 2170 D
1653 2156 D
1655 2150 D
1658 2147 D
1664 2144 D
S
N
1670 2144 M
1676 2147 D
1678 2150 D
1681 2156 D
1684 2170 D
1684 2179 D
1681 2193 D
1678 2199 D
1676 2202 D
1670 2205 D
S
N
2083 2193 M
2086 2190 D
2083 2187 D
2080 2190 D
2080 2193 D
2083 2199 D
2086 2202 D
2095 2205 D
2106 2205 D
2115 2202 D
2118 2199 D
2121 2193 D
2121 2187 D
2118 2182 D
2109 2176 D
2095 2170 D
2089 2167 D
2083 2161 D
2080 2153 D
2080 2144 D
S
N
2106 2205 M
2112 2202 D
2115 2199 D
2118 2193 D
2118 2187 D
2115 2182 D
2106 2176 D
2095 2170 D
S
N
2080 2150 M
2083 2153 D
2089 2153 D
2103 2147 D
2112 2147 D
2118 2150 D
2121 2153 D
S
N
2089 2153 M
2103 2144 D
2115 2144 D
2118 2147 D
2121 2153 D
2121 2158 D
S
N
2155 2205 M
2147 2202 D
2141 2193 D
2138 2179 D
2138 2170 D
2141 2156 D
2147 2147 D
2155 2144 D
2161 2144 D
2170 2147 D
2176 2156 D
2178 2170 D
2178 2179 D
2176 2193 D
2170 2202 D
2161 2205 D
2155 2205 D
S
N
2155 2205 M
2150 2202 D
2147 2199 D
2144 2193 D
2141 2179 D
2141 2170 D
2144 2156 D
2147 2150 D
2150 2147 D
2155 2144 D
S
N
2161 2144 M
2167 2147 D
2170 2150 D
2173 2156 D
2176 2170 D
2176 2179 D
2173 2193 D
2170 2199 D
2167 2202 D
2161 2205 D
S
N
2736 2205 M
2730 2176 D
S
N
2730 2176 M
2736 2182 D
2744 2184 D
2753 2184 D
2762 2182 D
2767 2176 D
2770 2167 D
2770 2161 D
2767 2153 D
2762 2147 D
2753 2144 D
2744 2144 D
2736 2147 D
2733 2150 D
2730 2156 D
2730 2158 D
2733 2161 D
2736 2158 D
2733 2156 D
S
N
2753 2184 M
2759 2182 D
2764 2176 D
2767 2167 D
2767 2161 D
2764 2153 D
2759 2147 D
2753 2144 D
S
N
2736 2205 M
2764 2205 D
S
N
2736 2202 M
2750 2202 D
2764 2205 D
S
N
2805 2205 M
2796 2202 D
2790 2193 D
2788 2179 D
2788 2170 D
2790 2156 D
2796 2147 D
2805 2144 D
2811 2144 D
2819 2147 D
2825 2156 D
2828 2170 D
2828 2179 D
2825 2193 D
2819 2202 D
2811 2205 D
2805 2205 D
S
N
2805 2205 M
2799 2202 D
2796 2199 D
2793 2193 D
2790 2179 D
2790 2170 D
2793 2156 D
2796 2150 D
2799 2147 D
2805 2144 D
S
N
2811 2144 M
2816 2147 D
2819 2150 D
2822 2156 D
2825 2170 D
2825 2179 D
2822 2193 D
2819 2199 D
2816 2202 D
2811 2205 D
S
N
3201 2193 M
3207 2196 D
3215 2205 D
3215 2144 D
S
N
3213 2202 M
3213 2144 D
S
N
3201 2144 M
3227 2144 D
S
N
3267 2205 M
3259 2202 D
3253 2193 D
3250 2179 D
3250 2170 D
3253 2156 D
3259 2147 D
3267 2144 D
3273 2144 D
3282 2147 D
3288 2156 D
3290 2170 D
3290 2179 D
3288 2193 D
3282 2202 D
3273 2205 D
3267 2205 D
S
N
3267 2205 M
3262 2202 D
3259 2199 D
3256 2193 D
3253 2179 D
3253 2170 D
3256 2156 D
3259 2150 D
3262 2147 D
3267 2144 D
S
N
3273 2144 M
3279 2147 D
3282 2150 D
3285 2156 D
3288 2170 D
3288 2179 D
3285 2193 D
3282 2199 D
3279 2202 D
3273 2205 D
S
N
3325 2205 M
3316 2202 D
3311 2193 D
3308 2179 D
3308 2170 D
3311 2156 D
3316 2147 D
3325 2144 D
3331 2144 D
3340 2147 D
3345 2156 D
3348 2170 D
3348 2179 D
3345 2193 D
3340 2202 D
3331 2205 D
3325 2205 D
S
N
3325 2205 M
3319 2202 D
3316 2199 D
3314 2193 D
3311 2179 D
3311 2170 D
3314 2156 D
3316 2150 D
3319 2147 D
3325 2144 D
S
N
3331 2144 M
3337 2147 D
3340 2150 D
3342 2156 D
3345 2170 D
3345 2179 D
3342 2193 D
3340 2199 D
3337 2202 D
3331 2205 D
S
N
3687 2193 M
3689 2190 D
3687 2187 D
3684 2190 D
3684 2193 D
3687 2199 D
3689 2202 D
3698 2205 D
3710 2205 D
3718 2202 D
3721 2199 D
3724 2193 D
3724 2187 D
3721 2182 D
3713 2176 D
3698 2170 D
3692 2167 D
3687 2161 D
3684 2153 D
3684 2144 D
S
N
3710 2205 M
3715 2202 D
3718 2199 D
3721 2193 D
3721 2187 D
3718 2182 D
3710 2176 D
3698 2170 D
S
N
3684 2150 M
3687 2153 D
3692 2153 D
3707 2147 D
3715 2147 D
3721 2150 D
3724 2153 D
S
N
3692 2153 M
3707 2144 D
3718 2144 D
3721 2147 D
3724 2153 D
3724 2158 D
S
N
3759 2205 M
3750 2202 D
3744 2193 D
3741 2179 D
3741 2170 D
3744 2156 D
3750 2147 D
3759 2144 D
3764 2144 D
3773 2147 D
3779 2156 D
3782 2170 D
3782 2179 D
3779 2193 D
3773 2202 D
3764 2205 D
3759 2205 D
S
N
3759 2205 M
3753 2202 D
3750 2199 D
3747 2193 D
3744 2179 D
3744 2170 D
3747 2156 D
3750 2150 D
3753 2147 D
3759 2144 D
S
N
3764 2144 M
3770 2147 D
3773 2150 D
3776 2156 D
3779 2170 D
3779 2179 D
3776 2193 D
3773 2199 D
3770 2202 D
3764 2205 D
S
N
3816 2205 M
3808 2202 D
3802 2193 D
3799 2179 D
3799 2170 D
3802 2156 D
3808 2147 D
3816 2144 D
3822 2144 D
3831 2147 D
3837 2156 D
3840 2170 D
3840 2179 D
3837 2193 D
3831 2202 D
3822 2205 D
3816 2205 D
S
N
3816 2205 M
3811 2202 D
3808 2199 D
3805 2193 D
3802 2179 D
3802 2170 D
3805 2156 D
3808 2150 D
3811 2147 D
3816 2144 D
S
N
3822 2144 M
3828 2147 D
3831 2150 D
3834 2156 D
3837 2170 D
3837 2179 D
3834 2193 D
3831 2199 D
3828 2202 D
3822 2205 D
S
N
785 2262 M
785 4685 D
S
N
785 2262 M
888 2262 D
S
N
819 2343 M
785 2343 D
S
N
785 2423 M
819 2423 D
S
N
819 2504 M
785 2504 D
S
N
785 2585 M
819 2585 D
S
N
888 2666 M
785 2666 D
S
N
785 2746 M
819 2746 D
S
N
819 2827 M
785 2827 D
S
N
785 2908 M
819 2908 D
S
N
819 2989 M
785 2989 D
S
N
785 3069 M
888 3069 D
S
N
819 3150 M
785 3150 D
S
N
785 3231 M
819 3231 D
S
N
819 3312 M
785 3312 D
S
N
785 3393 M
819 3393 D
S
N
888 3473 M
785 3473 D
S
N
785 3554 M
819 3554 D
S
N
819 3635 M
785 3635 D
S
N
785 3716 M
819 3716 D
S
N
819 3796 M
785 3796 D
S
N
785 3877 M
888 3877 D
S
N
819 3958 M
785 3958 D
S
N
785 4039 M
819 4039 D
S
N
819 4119 M
785 4119 D
S
N
785 4200 M
819 4200 D
S
N
888 4281 M
785 4281 D
S
N
785 4362 M
819 4362 D
S
N
819 4443 M
785 4443 D
S
N
785 4523 M
819 4523 D
S
N
819 4604 M
785 4604 D
S
N
785 4685 M
888 4685 D
S
N
485 2253 M
537 2253 D
S
N
574 2288 M
565 2285 D
560 2276 D
557 2262 D
557 2253 D
560 2239 D
565 2230 D
574 2227 D
580 2227 D
589 2230 D
594 2239 D
597 2253 D
597 2262 D
594 2276 D
589 2285 D
580 2288 D
574 2288 D
S
N
574 2288 M
568 2285 D
565 2282 D
563 2276 D
560 2262 D
560 2253 D
563 2239 D
565 2233 D
568 2230 D
574 2227 D
S
N
580 2227 M
586 2230 D
589 2233 D
591 2239 D
594 2253 D
594 2262 D
591 2276 D
589 2282 D
586 2285 D
580 2288 D
S
N
620 2233 M
617 2230 D
620 2227 D
623 2230 D
620 2233 D
S
N
652 2276 M
658 2279 D
667 2288 D
667 2227 D
S
N
664 2285 M
664 2227 D
S
N
652 2227 M
678 2227 D
S
N
707 2288 M
701 2259 D
S
N
701 2259 M
707 2265 D
716 2268 D
724 2268 D
733 2265 D
739 2259 D
742 2250 D
742 2244 D
739 2236 D
733 2230 D
724 2227 D
716 2227 D
707 2230 D
704 2233 D
701 2239 D
701 2242 D
704 2244 D
707 2242 D
704 2239 D
S
N
724 2268 M
730 2265 D
736 2259 D
739 2250 D
739 2244 D
736 2236 D
730 2230 D
724 2227 D
S
N
707 2288 M
736 2288 D
S
N
707 2285 M
721 2285 D
736 2288 D
S
N
485 2657 M
537 2657 D
S
N
574 2692 M
565 2689 D
560 2680 D
557 2666 D
557 2657 D
560 2643 D
565 2634 D
574 2631 D
580 2631 D
589 2634 D
594 2643 D
597 2657 D
597 2666 D
594 2680 D
589 2689 D
580 2692 D
574 2692 D
S
N
574 2692 M
568 2689 D
565 2686 D
563 2680 D
560 2666 D
560 2657 D
563 2643 D
565 2637 D
568 2634 D
574 2631 D
S
N
580 2631 M
586 2634 D
589 2637 D
591 2643 D
594 2657 D
594 2666 D
591 2680 D
589 2686 D
586 2689 D
580 2692 D
S
N
620 2637 M
617 2634 D
620 2631 D
623 2634 D
620 2637 D
S
N
652 2680 M
658 2683 D
667 2692 D
667 2631 D
S
N
664 2689 M
664 2631 D
S
N
652 2631 M
678 2631 D
S
N
718 2692 M
710 2689 D
704 2680 D
701 2666 D
701 2657 D
704 2643 D
710 2634 D
718 2631 D
724 2631 D
733 2634 D
739 2643 D
742 2657 D
742 2666 D
739 2680 D
733 2689 D
724 2692 D
718 2692 D
S
N
718 2692 M
713 2689 D
710 2686 D
707 2680 D
704 2666 D
704 2657 D
707 2643 D
710 2637 D
713 2634 D
718 2631 D
S
N
724 2631 M
730 2634 D
733 2637 D
736 2643 D
739 2657 D
739 2666 D
736 2680 D
733 2686 D
730 2689 D
724 2692 D
S
N
485 3061 M
537 3061 D
S
N
574 3095 M
565 3093 D
560 3084 D
557 3069 D
557 3061 D
560 3046 D
565 3038 D
574 3035 D
580 3035 D
589 3038 D
594 3046 D
597 3061 D
597 3069 D
594 3084 D
589 3093 D
580 3095 D
574 3095 D
S
N
574 3095 M
568 3093 D
565 3090 D
563 3084 D
560 3069 D
560 3061 D
563 3046 D
565 3041 D
568 3038 D
574 3035 D
S
N
580 3035 M
586 3038 D
589 3041 D
591 3046 D
594 3061 D
594 3069 D
591 3084 D
589 3090 D
586 3093 D
580 3095 D
S
N
620 3041 M
617 3038 D
620 3035 D
623 3038 D
620 3041 D
S
N
661 3095 M
652 3093 D
646 3084 D
643 3069 D
643 3061 D
646 3046 D
652 3038 D
661 3035 D
667 3035 D
675 3038 D
681 3046 D
684 3061 D
684 3069 D
681 3084 D
675 3093 D
667 3095 D
661 3095 D
S
N
661 3095 M
655 3093 D
652 3090 D
649 3084 D
646 3069 D
646 3061 D
649 3046 D
652 3041 D
655 3038 D
661 3035 D
S
N
667 3035 M
672 3038 D
675 3041 D
678 3046 D
681 3061 D
681 3069 D
678 3084 D
675 3090 D
672 3093 D
667 3095 D
S
N
707 3095 M
701 3067 D
S
N
701 3067 M
707 3072 D
716 3075 D
724 3075 D
733 3072 D
739 3067 D
742 3058 D
742 3052 D
739 3043 D
733 3038 D
724 3035 D
716 3035 D
707 3038 D
704 3041 D
701 3046 D
701 3049 D
704 3052 D
707 3049 D
704 3046 D
S
N
724 3075 M
730 3072 D
736 3067 D
739 3058 D
739 3052 D
736 3043 D
730 3038 D
724 3035 D
S
N
707 3095 M
736 3095 D
S
N
707 3093 M
721 3093 D
736 3095 D
S
N
574 3499 M
565 3496 D
560 3488 D
557 3473 D
557 3465 D
560 3450 D
565 3442 D
574 3439 D
580 3439 D
589 3442 D
594 3450 D
597 3465 D
597 3473 D
594 3488 D
589 3496 D
580 3499 D
574 3499 D
S
N
574 3499 M
568 3496 D
565 3494 D
563 3488 D
560 3473 D
560 3465 D
563 3450 D
565 3444 D
568 3442 D
574 3439 D
S
N
580 3439 M
586 3442 D
589 3444 D
591 3450 D
594 3465 D
594 3473 D
591 3488 D
589 3494 D
586 3496 D
580 3499 D
S
N
620 3444 M
617 3442 D
620 3439 D
623 3442 D
620 3444 D
S
N
661 3499 M
652 3496 D
646 3488 D
643 3473 D
643 3465 D
646 3450 D
652 3442 D
661 3439 D
666 3439 D
675 3442 D
681 3450 D
684 3465 D
684 3473 D
681 3488 D
675 3496 D
666 3499 D
661 3499 D
S
N
661 3499 M
655 3496 D
652 3494 D
649 3488 D
646 3473 D
646 3465 D
649 3450 D
652 3444 D
655 3442 D
661 3439 D
S
N
666 3439 M
672 3442 D
675 3444 D
678 3450 D
681 3465 D
681 3473 D
678 3488 D
675 3494 D
672 3496 D
666 3499 D
S
N
718 3499 M
710 3496 D
704 3488 D
701 3473 D
701 3465 D
704 3450 D
710 3442 D
718 3439 D
724 3439 D
733 3442 D
739 3450 D
742 3465 D
742 3473 D
739 3488 D
733 3496 D
724 3499 D
718 3499 D
S
N
718 3499 M
713 3496 D
710 3494 D
707 3488 D
704 3473 D
704 3465 D
707 3450 D
710 3444 D
713 3442 D
718 3439 D
S
N
724 3439 M
730 3442 D
733 3444 D
736 3450 D
739 3465 D
739 3473 D
736 3488 D
733 3494 D
730 3496 D
724 3499 D
S
N
574 3903 M
565 3900 D
560 3892 D
557 3877 D
557 3868 D
560 3854 D
565 3845 D
574 3843 D
580 3843 D
589 3845 D
594 3854 D
597 3868 D
597 3877 D
594 3892 D
589 3900 D
580 3903 D
574 3903 D
S
N
574 3903 M
568 3900 D
565 3897 D
563 3892 D
560 3877 D
560 3868 D
563 3854 D
565 3848 D
568 3845 D
574 3843 D
S
N
580 3843 M
586 3845 D
589 3848 D
591 3854 D
594 3868 D
594 3877 D
591 3892 D
589 3897 D
586 3900 D
580 3903 D
S
N
620 3848 M
617 3845 D
620 3843 D
623 3845 D
620 3848 D
S
N
661 3903 M
652 3900 D
646 3892 D
643 3877 D
643 3868 D
646 3854 D
652 3845 D
661 3843 D
666 3843 D
675 3845 D
681 3854 D
684 3868 D
684 3877 D
681 3892 D
675 3900 D
666 3903 D
661 3903 D
S
N
661 3903 M
655 3900 D
652 3897 D
649 3892 D
646 3877 D
646 3868 D
649 3854 D
652 3848 D
655 3845 D
661 3843 D
S
N
666 3843 M
672 3845 D
675 3848 D
678 3854 D
681 3868 D
681 3877 D
678 3892 D
675 3897 D
672 3900 D
666 3903 D
S
N
707 3903 M
701 3874 D
S
N
701 3874 M
707 3880 D
716 3883 D
724 3883 D
733 3880 D
739 3874 D
742 3866 D
742 3860 D
739 3851 D
733 3845 D
724 3843 D
716 3843 D
707 3845 D
704 3848 D
701 3854 D
701 3857 D
704 3860 D
707 3857 D
704 3854 D
S
N
724 3883 M
730 3880 D
736 3874 D
739 3866 D
739 3860 D
736 3851 D
730 3845 D
724 3843 D
S
N
707 3903 M
736 3903 D
S
N
707 3900 M
721 3900 D
736 3903 D
S
N
574 4307 M
565 4304 D
560 4295 D
557 4281 D
557 4272 D
560 4258 D
565 4249 D
574 4246 D
580 4246 D
589 4249 D
594 4258 D
597 4272 D
597 4281 D
594 4295 D
589 4304 D
580 4307 D
574 4307 D
S
N
574 4307 M
568 4304 D
565 4301 D
563 4295 D
560 4281 D
560 4272 D
563 4258 D
565 4252 D
568 4249 D
574 4246 D
S
N
580 4246 M
586 4249 D
589 4252 D
591 4258 D
594 4272 D
594 4281 D
591 4295 D
589 4301 D
586 4304 D
580 4307 D
S
N
620 4252 M
617 4249 D
620 4246 D
623 4249 D
620 4252 D
S
N
652 4295 M
658 4298 D
666 4307 D
666 4246 D
S
N
664 4304 M
664 4246 D
S
N
652 4246 M
678 4246 D
S
N
718 4307 M
710 4304 D
704 4295 D
701 4281 D
701 4272 D
704 4258 D
710 4249 D
718 4246 D
724 4246 D
733 4249 D
739 4258 D
742 4272 D
742 4281 D
739 4295 D
733 4304 D
724 4307 D
718 4307 D
S
N
718 4307 M
713 4304 D
710 4301 D
707 4295 D
704 4281 D
704 4272 D
707 4258 D
710 4252 D
713 4249 D
718 4246 D
S
N
724 4246 M
730 4249 D
733 4252 D
736 4258 D
739 4272 D
739 4281 D
736 4295 D
733 4301 D
730 4304 D
724 4307 D
S
N
574 4711 M
565 4708 D
560 4699 D
557 4685 D
557 4676 D
560 4662 D
565 4653 D
574 4650 D
580 4650 D
589 4653 D
594 4662 D
597 4676 D
597 4685 D
594 4699 D
589 4708 D
580 4711 D
574 4711 D
S
N
574 4711 M
568 4708 D
565 4705 D
563 4699 D
560 4685 D
560 4676 D
563 4662 D
565 4656 D
568 4653 D
574 4650 D
S
N
580 4650 M
586 4653 D
589 4656 D
591 4662 D
594 4676 D
594 4685 D
591 4699 D
589 4705 D
586 4708 D
580 4711 D
S
N
620 4656 M
617 4653 D
620 4650 D
623 4653 D
620 4656 D
S
N
652 4699 M
658 4702 D
666 4711 D
666 4650 D
S
N
664 4708 M
664 4650 D
S
N
652 4650 M
678 4650 D
S
N
707 4711 M
701 4682 D
S
N
701 4682 M
707 4688 D
716 4691 D
724 4691 D
733 4688 D
739 4682 D
742 4673 D
742 4668 D
739 4659 D
733 4653 D
724 4650 D
716 4650 D
707 4653 D
704 4656 D
701 4662 D
701 4665 D
704 4668 D
707 4665 D
704 4662 D
S
N
724 4691 M
730 4688 D
736 4682 D
739 4673 D
739 4668 D
736 4659 D
730 4653 D
724 4650 D
S
N
707 4711 M
736 4711 D
S
N
707 4708 M
721 4708 D
736 4711 D
S
N
3762 2262 M
3762 4685 D
S
N
3658 2262 M
3762 2262 D
S
N
3762 2343 M
3727 2343 D
S
N
3727 2423 M
3762 2423 D
S
N
3762 2504 M
3727 2504 D
S
N
3727 2585 M
3762 2585 D
S
N
3762 2666 M
3658 2666 D
S
N
3727 2746 M
3762 2746 D
S
N
3762 2827 M
3727 2827 D
S
N
3727 2908 M
3762 2908 D
S
N
3762 2989 M
3727 2989 D
S
N
3658 3069 M
3762 3069 D
S
N
3762 3150 M
3727 3150 D
S
N
3727 3231 M
3762 3231 D
S
N
3762 3312 M
3727 3312 D
S
N
3727 3393 M
3762 3393 D
S
N
3762 3473 M
3658 3473 D
S
N
3727 3554 M
3762 3554 D
S
N
3762 3635 M
3727 3635 D
S
N
3727 3716 M
3762 3716 D
S
N
3762 3796 M
3727 3796 D
S
N
3658 3877 M
3762 3877 D
S
N
3762 3958 M
3727 3958 D
S
N
3727 4039 M
3762 4039 D
S
N
3762 4119 M
3727 4119 D
S
N
3727 4200 M
3762 4200 D
S
N
3762 4281 M
3658 4281 D
S
N
3727 4362 M
3762 4362 D
S
N
3762 4443 M
3727 4443 D
S
N
3727 4523 M
3762 4523 D
S
N
3762 4604 M
3727 4604 D
S
N
3658 4685 M
3762 4685 D
S
N
2082 2060 M
2082 1999 D
S
N
2085 2060 M
2085 1999 D
S
N
2085 2051 M
2091 2057 D
2097 2060 D
2102 2060 D
2111 2057 D
2117 2051 D
2120 2043 D
2120 2037 D
2117 2028 D
2111 2022 D
2102 2019 D
2097 2019 D
2091 2022 D
2085 2028 D
S
N
2102 2060 M
2108 2057 D
2114 2051 D
2117 2043 D
2117 2037 D
2114 2028 D
2108 2022 D
2102 2019 D
S
N
2074 2060 M
2085 2060 D
S
N
2074 1999 M
2094 1999 D
S
N
2150 2037 M
2150 1996 D
S
N
2151 2037 M
2151 1996 D
S
N
2138 2037 M
2136 2025 D
2136 2037 D
2165 2037 D
2165 2025 D
2163 2037 D
S
N
2144 1996 M
2157 1996 D
S
N
2251 2092 M
2245 2086 D
2239 2077 D
2233 2066 D
2230 2051 D
2230 2040 D
2233 2025 D
2239 2014 D
2245 2005 D
2251 1999 D
S
N
2245 2086 M
2239 2074 D
2236 2066 D
2233 2051 D
2233 2040 D
2236 2025 D
2239 2017 D
2245 2005 D
S
N
2308 2071 M
2311 2063 D
2311 2080 D
2308 2071 D
2303 2077 D
2294 2080 D
2288 2080 D
2280 2077 D
2274 2071 D
2271 2066 D
2268 2057 D
2268 2043 D
2271 2034 D
2274 2028 D
2280 2022 D
2288 2019 D
2294 2019 D
2303 2022 D
2308 2028 D
S
N
2288 2080 M
2282 2077 D
2277 2071 D
2274 2066 D
2271 2057 D
2271 2043 D
2274 2034 D
2277 2028 D
2282 2022 D
2288 2019 D
S
N
2308 2043 M
2308 2019 D
S
N
2311 2043 M
2311 2019 D
S
N
2300 2043 M
2320 2043 D
S
N
2337 2043 M
2372 2043 D
2372 2048 D
2369 2054 D
2366 2057 D
2360 2060 D
2352 2060 D
2343 2057 D
2337 2051 D
2334 2043 D
2334 2037 D
2337 2028 D
2343 2022 D
2352 2019 D
2357 2019 D
2366 2022 D
2372 2028 D
S
N
2369 2043 M
2369 2051 D
2366 2057 D
S
N
2352 2060 M
2346 2057 D
2340 2051 D
2337 2043 D
2337 2037 D
2340 2028 D
2346 2022 D
2352 2019 D
S
N
2389 2080 M
2409 2019 D
S
N
2392 2080 M
2409 2028 D
S
N
2430 2080 M
2409 2019 D
S
N
2383 2080 M
2401 2080 D
S
N
2418 2080 M
2435 2080 D
S
N
2447 2092 M
2453 2086 D
2459 2077 D
2464 2066 D
2467 2051 D
2467 2040 D
2464 2025 D
2459 2014 D
2453 2005 D
2447 1999 D
S
N
2453 2086 M
2459 2074 D
2461 2066 D
2464 2051 D
2464 2040 D
2461 2025 D
2459 2017 D
2453 2005 D
S
N
3834 3870 M
3834 3896 D
3824 3899 D
3834 3894 D
S
N
3834 3877 M
3798 3887 D
S
N
3798 3885 M
3834 3875 D
S
N
3798 3892 M
3798 3880 D
S
N
3834 3908 M
3834 3920 D
S
N
3834 3915 M
3798 3925 D
S
N
3798 3923 M
3834 3913 D
S
N
3834 3930 M
3834 3942 D
S
N
3834 3937 M
3798 3947 D
S
N
3798 3946 M
3834 3935 D
S
N
3815 3940 M
3815 3920 D
S
N
3798 3930 M
3798 3918 D
S
N
3798 3940 M
3798 3953 D
S
N
3826 3989 M
3829 3987 D
3832 3984 D
3834 3980 D
3834 3975 D
3832 3971 D
3831 3970 D
3826 3968 D
3820 3968 D
3813 3970 D
3808 3971 D
3803 3975 D
3800 3978 D
3798 3982 D
3800 3977 D
3803 3973 D
3808 3970 D
3813 3968 D
3820 3966 D
3826 3966 D
3831 3968 D
3832 3970 D
3834 3975 D
S
N
3798 3982 M
3798 3987 D
3800 3990 D
3801 3992 D
3801 3994 D
3798 3996 D
3808 3994 D
3805 3994 D
3801 3992 D
S
N
3834 4032 M
3834 4044 D
S
N
3834 4039 M
3798 4049 D
S
N
3798 4047 M
3834 4037 D
S
N
3834 4054 M
3834 4066 D
S
N
3834 4061 M
3798 4072 D
S
N
3798 4070 M
3834 4059 D
S
N
3815 4065 M
3815 4044 D
S
N
3798 4054 M
3798 4042 D
S
N
3798 4065 M
3798 4077 D
S
N
3834 4085 M
3834 4097 D
S
N
3834 4092 M
3798 4103 D
S
N
3798 4101 M
3834 4091 D
S
N
3798 4108 M
3798 4096 D
S
N
3822 4139 M
3822 4151 D
S
N
3822 4146 M
3829 4142 D
3832 4139 D
3834 4134 D
3832 4137 D
3829 4141 D
3822 4144 D
S
N
3834 4134 M
3834 4130 D
3832 4127 D
3831 4125 D
3826 4123 D
3820 4123 D
3813 4125 D
3808 4127 D
3803 4130 D
3800 4134 D
3798 4137 D
3800 4132 D
3803 4128 D
3808 4125 D
3813 4123 D
3820 4122 D
3826 4122 D
3831 4123 D
3832 4125 D
3834 4130 D
S
N
3798 4137 M
3798 4142 D
3800 4146 D
3801 4147 D
3801 4149 D
3798 4151 D
3808 4149 D
3805 4149 D
3801 4147 D
S
N
3822 4182 M
3822 4194 D
S
N
3822 4189 M
3829 4185 D
3832 4182 D
3834 4177 D
3832 4180 D
3829 4184 D
3822 4187 D
S
N
3834 4177 M
3834 4173 D
3832 4170 D
3831 4168 D
3826 4166 D
3820 4166 D
3813 4168 D
3808 4170 D
3803 4173 D
3800 4177 D
3798 4180 D
3800 4175 D
3803 4172 D
3808 4168 D
3813 4166 D
3820 4165 D
3826 4165 D
3831 4166 D
3832 4168 D
3834 4173 D
S
N
3798 4180 M
3798 4185 D
3800 4189 D
3801 4191 D
3801 4192 D
3798 4194 D
3808 4192 D
3805 4192 D
3801 4191 D
S
N
3834 4206 M
3831 4208 D
3831 4210 D
3832 4211 D
3834 4216 D
3834 4223 D
3832 4229 D
3831 4230 D
3827 4232 D
3822 4232 D
3819 4229 D
3812 4216 D
3810 4215 D
3807 4213 D
3810 4216 D
3817 4229 D
3819 4230 D
3822 4232 D
S
N
3807 4213 M
3803 4213 D
3800 4216 D
3798 4222 D
3798 4229 D
3800 4234 D
3801 4235 D
3801 4237 D
3798 4239 D
3808 4237 D
3805 4237 D
3801 4235 D
S
N
3831 4210 M
3827 4208 D
3824 4208 D
3834 4206 D
S
N
3834 4273 M
3834 4284 D
S
N
3834 4277 M
3798 4311 D
S
N
3798 4315 M
3798 4304 D
S
N
3798 4294 M
3798 4284 D
S
N
3798 4287 M
3834 4299 D
S
N
3834 4301 M
3798 4289 D
S
N
3834 4304 M
3834 4294 D
S
N
3834 4327 M
3831 4329 D
3831 4330 D
3832 4332 D
3834 4337 D
3834 4344 D
3832 4349 D
3831 4351 D
3827 4353 D
3822 4353 D
3819 4349 D
3812 4337 D
3810 4335 D
3807 4334 D
3810 4337 D
3817 4349 D
3819 4351 D
3822 4353 D
S
N
3807 4334 M
3803 4334 D
3800 4337 D
3798 4342 D
3798 4349 D
3800 4354 D
3801 4356 D
3801 4358 D
3798 4360 D
3808 4358 D
3805 4358 D
3801 4356 D
S
N
3831 4330 M
3827 4329 D
3824 4329 D
3834 4327 D
S
N
3831 4408 M
3798 4411 D
S
N
3798 4410 M
3834 4406 D
3798 4423 D
3834 4420 D
3798 4437 D
S
N
3798 4442 M
3798 4432 D
S
N
3798 4425 M
3831 4422 D
S
N
3798 4417 M
3798 4404 D
S
N
3822 4473 M
3822 4486 D
S
N
3822 4480 M
3829 4477 D
3832 4473 D
3834 4468 D
3832 4472 D
3829 4475 D
3822 4479 D
S
N
3834 4468 M
3834 4465 D
3832 4461 D
3831 4460 D
3826 4458 D
3820 4458 D
3813 4460 D
3808 4461 D
3803 4465 D
3800 4468 D
3798 4472 D
3800 4467 D
3803 4463 D
3808 4460 D
3813 4458 D
3820 4456 D
3826 4456 D
3831 4458 D
3832 4460 D
3834 4465 D
S
N
3798 4472 M
3798 4477 D
3800 4480 D
3801 4482 D
3801 4484 D
3798 4486 D
3808 4484 D
3805 4484 D
3801 4482 D
S
N
3834 4523 M
3827 4527 D
3824 4530 D
3820 4536 D
3813 4546 D
3810 4549 D
3807 4551 D
3803 4551 D
3800 4549 D
3798 4546 D
3800 4551 D
3803 4553 D
3807 4553 D
3810 4551 D
3813 4548 D
3817 4542 D
3820 4536 D
S
N
3831 4525 M
3829 4527 D
3829 4530 D
3834 4539 D
3834 4544 D
3832 4548 D
3827 4549 D
3831 4548 D
3832 4544 D
3832 4539 D
3829 4530 D
S
N
3805 4534 M
3807 4536 D
3808 4534 D
3807 4532 D
3805 4532 D
3801 4534 D
3800 4536 D
3798 4541 D
3798 4546 D
S
N
3826 4567 M
3831 4568 D
3832 4570 D
3834 4574 D
3831 4570 D
3826 4568 D
3820 4568 D
3813 4570 D
3808 4572 D
3803 4575 D
3800 4579 D
3798 4582 D
3798 4586 D
3801 4589 D
3807 4591 D
3812 4591 D
3819 4589 D
3824 4587 D
3829 4584 D
3832 4580 D
3834 4577 D
3834 4574 D
S
N
3834 4577 M
3832 4582 D
3829 4586 D
3824 4589 D
3819 4591 D
3812 4592 D
3807 4592 D
3801 4591 D
3800 4589 D
3798 4586 D
S
N
3798 4582 M
3800 4577 D
3803 4574 D
3808 4570 D
3813 4568 D
3820 4567 D
3826 4567 D
S
N
3834 4613 M
3805 4622 D
S
N
3803 4624 M
3807 4617 D
3808 4611 D
3807 4615 D
3803 4620 D
3798 4625 D
3834 4615 D
S
N
3834 4646 M
3805 4655 D
S
N
3803 4656 M
3807 4649 D
3808 4644 D
3807 4648 D
3803 4653 D
3798 4658 D
3834 4648 D
S
N
785 3473 M
3762 3473 D
S
1.00 0.00 0.00 setrgbcolor
N
2327 4635 M
2327 4590 D
S
N
2329 4635 M
2342 4596 D
S
N
2327 4635 M
2342 4590 D
S
N
2357 4635 M
2342 4590 D
S
N
2357 4635 M
2357 4590 D
S
N
2359 4635 M
2359 4590 D
S
N
2320 4635 M
2329 4635 D
S
N
2357 4635 M
2366 4635 D
S
N
2320 4590 M
2333 4590 D
S
N
2350 4590 M
2366 4590 D
S
N
2404 4629 M
2407 4635 D
2407 4622 D
2404 4629 D
2400 4633 D
2394 4635 D
2387 4635 D
2381 4633 D
2376 4629 D
2376 4624 D
2379 4620 D
2381 4618 D
2385 4616 D
2398 4611 D
2402 4609 D
2407 4605 D
S
N
2376 4624 M
2381 4620 D
2385 4618 D
2398 4613 D
2402 4611 D
2404 4609 D
2407 4605 D
2407 4596 D
2402 4592 D
2396 4590 D
2389 4590 D
2383 4592 D
2379 4596 D
2376 4603 D
2376 4590 D
2379 4596 D
S
N
2432 4635 M
2432 4590 D
S
N
2435 4635 M
2435 4590 D
S
N
2419 4635 M
2417 4622 D
2417 4635 D
2450 4635 D
2450 4622 D
2448 4635 D
S
N
2426 4590 M
2441 4590 D
S
N
2463 4635 M
2471 4590 D
S
N
2465 4635 M
2471 4601 D
S
N
2480 4635 M
2471 4590 D
S
N
2480 4635 M
2488 4590 D
S
N
2482 4635 M
2488 4601 D
S
N
2497 4635 M
2488 4590 D
S
N
2456 4635 M
2471 4635 D
S
N
2491 4635 M
2504 4635 D
S
N
2514 4626 M
2517 4624 D
2514 4622 D
2512 4624 D
2512 4626 D
2514 4631 D
2517 4633 D
2523 4635 D
2532 4635 D
2538 4633 D
2540 4631 D
2542 4626 D
2542 4622 D
2540 4618 D
2534 4613 D
2523 4609 D
2519 4607 D
2514 4603 D
2512 4596 D
2512 4590 D
S
N
2532 4635 M
2536 4633 D
2538 4631 D
2540 4626 D
2540 4622 D
2538 4618 D
2532 4613 D
2523 4609 D
S
N
2512 4594 M
2514 4596 D
2519 4596 D
2529 4592 D
2536 4592 D
2540 4594 D
2542 4596 D
S
N
2519 4596 M
2529 4590 D
2538 4590 D
2540 4592 D
2542 4596 D
2542 4601 D
S
N
2568 4635 M
2562 4633 D
2557 4626 D
2555 4616 D
2555 4609 D
2557 4598 D
2562 4592 D
2568 4590 D
2573 4590 D
2579 4592 D
2583 4598 D
2586 4609 D
2586 4616 D
2583 4626 D
2579 4633 D
2573 4635 D
2568 4635 D
S
N
2568 4635 M
2564 4633 D
2562 4631 D
2560 4626 D
2557 4616 D
2557 4609 D
2560 4598 D
2562 4594 D
2564 4592 D
2568 4590 D
S
N
2573 4590 M
2577 4592 D
2579 4594 D
2581 4598 D
2583 4609 D
2583 4616 D
2581 4626 D
2579 4631 D
2577 4633 D
2573 4635 D
S
N
2611 4635 M
2605 4633 D
2601 4626 D
2598 4616 D
2598 4609 D
2601 4598 D
2605 4592 D
2611 4590 D
2616 4590 D
2622 4592 D
2626 4598 D
2629 4609 D
2629 4616 D
2626 4626 D
2622 4633 D
2616 4635 D
2611 4635 D
S
N
2611 4635 M
2607 4633 D
2605 4631 D
2603 4626 D
2601 4616 D
2601 4609 D
2603 4598 D
2605 4594 D
2607 4592 D
2611 4590 D
S
N
2616 4590 M
2620 4592 D
2622 4594 D
2624 4598 D
2626 4609 D
2626 4616 D
2624 4626 D
2622 4631 D
2620 4633 D
2616 4635 D
S
N
2652 4635 M
2646 4633 D
2644 4629 D
2644 4622 D
2646 4618 D
2652 4616 D
2661 4616 D
2667 4618 D
2670 4622 D
2670 4629 D
2667 4633 D
2661 4635 D
2652 4635 D
S
N
2652 4635 M
2648 4633 D
2646 4629 D
2646 4622 D
2648 4618 D
2652 4616 D
S
N
2661 4616 M
2665 4618 D
2667 4622 D
2667 4629 D
2665 4633 D
2661 4635 D
S
N
2652 4616 M
2646 4613 D
2644 4611 D
2642 4607 D
2642 4598 D
2644 4594 D
2646 4592 D
2652 4590 D
2661 4590 D
2667 4592 D
2670 4594 D
2672 4598 D
2672 4607 D
2670 4611 D
2667 4613 D
2661 4616 D
S
N
2652 4616 M
2648 4613 D
2646 4611 D
2644 4607 D
2644 4598 D
2646 4594 D
2648 4592 D
2652 4590 D
S
N
2661 4590 M
2665 4592 D
2667 4594 D
2670 4598 D
2670 4607 D
2667 4611 D
2665 4613 D
2661 4616 D
S
N
2724 4635 M
2724 4590 D
S
N
2726 4635 M
2752 4594 D
S
N
2726 4631 M
2752 4590 D
S
N
2752 4635 M
2752 4590 D
S
N
2717 4635 M
2726 4635 D
S
N
2745 4635 M
2758 4635 D
S
N
2717 4590 M
2730 4590 D
S
N
2773 4635 M
2773 4590 D
S
N
2775 4635 M
2801 4594 D
S
N
2775 4631 M
2801 4590 D
S
N
2801 4635 M
2801 4590 D
S
N
2767 4635 M
2775 4635 D
S
N
2795 4635 M
2808 4635 D
S
N
2767 4590 M
2780 4590 D
S
N
2823 4635 M
2823 4590 D
S
N
2825 4635 M
2825 4590 D
S
N
2816 4635 M
2831 4635 D
S
N
2816 4590 M
2849 4590 D
2849 4603 D
2846 4590 D
S
N
2872 4635 M
2866 4633 D
2862 4629 D
2859 4624 D
2857 4616 D
2857 4609 D
2859 4601 D
2862 4596 D
2866 4592 D
2872 4590 D
2877 4590 D
2883 4592 D
2887 4596 D
2890 4601 D
2892 4609 D
2892 4616 D
2890 4624 D
2887 4629 D
2883 4633 D
2877 4635 D
2872 4635 D
S
N
2872 4635 M
2868 4633 D
2864 4629 D
2862 4624 D
2859 4616 D
2859 4609 D
2862 4601 D
2864 4596 D
2868 4592 D
2872 4590 D
S
N
2877 4590 M
2881 4592 D
2885 4596 D
2887 4601 D
2890 4609 D
2890 4616 D
2887 4624 D
2885 4629 D
2881 4633 D
2877 4635 D
S
N
1925 4644 M
2164 4644 D
2164 4564 D
1925 4564 D
1925 4644 D
S
N
1972 4564 M
1925 4610 D
S
N
2057 4564 M
1976 4644 D
S
N
2142 4564 M
2061 4644 D
S
N
2164 4626 M
2146 4644 D
S
N
2164 4621 M
2107 4564 D
S
N
2103 4644 M
2022 4564 D
S
N
2018 4644 M
1937 4564 D
S
N
1933 4644 M
1925 4637 D
S
0.00 0.00 1.00 setrgbcolor
N
2327 4510 M
2327 4465 D
S
N
2329 4510 M
2355 4469 D
S
N
2329 4506 M
2355 4465 D
S
N
2355 4510 M
2355 4465 D
S
N
2320 4510 M
2329 4510 D
S
N
2348 4510 M
2361 4510 D
S
N
2320 4465 M
2333 4465 D
S
N
2376 4510 M
2376 4465 D
S
N
2379 4510 M
2404 4469 D
S
N
2379 4506 M
2404 4465 D
S
N
2404 4510 M
2404 4465 D
S
N
2370 4510 M
2379 4510 D
S
N
2398 4510 M
2411 4510 D
S
N
2370 4465 M
2383 4465 D
S
N
2426 4510 M
2426 4465 D
S
N
2428 4510 M
2428 4465 D
S
N
2419 4510 M
2445 4510 D
2452 4508 D
2454 4506 D
2456 4502 D
2456 4495 D
2454 4491 D
2452 4489 D
2445 4487 D
2428 4487 D
S
N
2445 4510 M
2450 4508 D
2452 4506 D
2454 4502 D
2454 4495 D
2452 4491 D
2450 4489 D
2445 4487 D
S
N
2419 4465 M
2435 4465 D
S
N
2473 4510 M
2473 4465 D
S
N
2476 4510 M
2476 4465 D
S
N
2467 4510 M
2488 4510 D
2495 4508 D
2499 4504 D
2501 4500 D
2504 4493 D
2504 4482 D
2501 4476 D
2499 4472 D
2495 4467 D
2488 4465 D
2467 4465 D
S
N
2488 4510 M
2493 4508 D
2497 4504 D
2499 4500 D
2501 4493 D
2501 4482 D
2499 4476 D
2497 4472 D
2493 4467 D
2488 4465 D
S
N
2521 4510 M
2521 4465 D
S
N
2523 4510 M
2523 4465 D
S
N
2536 4497 M
2536 4480 D
S
N
2514 4510 M
2549 4510 D
2549 4497 D
2547 4510 D
S
N
2523 4489 M
2536 4489 D
S
N
2514 4465 M
2529 4465 D
S
N
2562 4502 M
2564 4500 D
2562 4497 D
2560 4500 D
2560 4502 D
2562 4506 D
2564 4508 D
2570 4510 D
2579 4510 D
2586 4508 D
2588 4506 D
2590 4502 D
2590 4497 D
2588 4493 D
2581 4489 D
2570 4485 D
2566 4482 D
2562 4478 D
2560 4472 D
2560 4465 D
S
N
2579 4510 M
2583 4508 D
2586 4506 D
2588 4502 D
2588 4497 D
2586 4493 D
2579 4489 D
2570 4485 D
S
N
2560 4469 M
2562 4472 D
2566 4472 D
2577 4467 D
2583 4467 D
2588 4469 D
2590 4472 D
S
N
2566 4472 M
2577 4465 D
2586 4465 D
2588 4467 D
2590 4472 D
2590 4476 D
S
N
2607 4469 M
2605 4467 D
2607 4465 D
2609 4467 D
2607 4469 D
S
N
2631 4502 M
2635 4504 D
2642 4510 D
2642 4465 D
S
N
2639 4508 M
2639 4465 D
S
N
2631 4465 M
2650 4465 D
S
N
2706 4510 M
2706 4465 D
S
N
2708 4510 M
2734 4469 D
S
N
2708 4506 M
2734 4465 D
S
N
2734 4510 M
2734 4465 D
S
N
2700 4510 M
2708 4510 D
S
N
2728 4510 M
2741 4510 D
S
N
2700 4465 M
2713 4465 D
S
N
2756 4510 M
2756 4465 D
S
N
2758 4510 M
2784 4469 D
S
N
2758 4506 M
2784 4465 D
S
N
2784 4510 M
2784 4465 D
S
N
2749 4510 M
2758 4510 D
S
N
2777 4510 M
2790 4510 D
S
N
2749 4465 M
2762 4465 D
S
N
2805 4510 M
2805 4465 D
S
N
2808 4510 M
2808 4465 D
S
N
2799 4510 M
2814 4510 D
S
N
2799 4465 M
2831 4465 D
2831 4478 D
2829 4465 D
S
N
2855 4510 M
2849 4508 D
2844 4504 D
2842 4500 D
2840 4491 D
2840 4485 D
2842 4476 D
2844 4472 D
2849 4467 D
2855 4465 D
2859 4465 D
2866 4467 D
2870 4472 D
2872 4476 D
2874 4485 D
2874 4491 D
2872 4500 D
2870 4504 D
2866 4508 D
2859 4510 D
2855 4510 D
S
N
2855 4510 M
2851 4508 D
2846 4504 D
2844 4500 D
2842 4491 D
2842 4485 D
2844 4476 D
2846 4472 D
2851 4467 D
2855 4465 D
S
N
2859 4465 M
2864 4467 D
2868 4472 D
2870 4476 D
2872 4485 D
2872 4491 D
2870 4500 D
2868 4504 D
2864 4508 D
2859 4510 D
S
[39] 0 Sd
N
1925 4523 M
2164 4523 D
2164 4443 D
1925 4443 D
1925 4523 D
S
N
2009 4443 M
1928 4523 D
S
N
2093 4443 M
2013 4523 D
S
N
2164 4457 M
2097 4523 D
S
N
2164 4451 M
2155 4443 D
S
N
2151 4523 M
2070 4443 D
S
N
2066 4523 M
1986 4443 D
S
N
1982 4523 M
1925 4467 D
S
1.00 0.00 1.00 setrgbcolor
[] 0 Sd
N
2338 4386 M
2338 4349 D
2335 4343 D
2331 4341 D
2327 4341 D
2322 4343 D
2320 4347 D
2320 4351 D
2322 4353 D
2325 4351 D
2322 4349 D
S
N
2335 4386 M
2335 4349 D
2333 4343 D
2331 4341 D
S
N
2329 4386 M
2344 4386 D
S
N
2359 4386 M
2359 4341 D
S
N
2361 4386 M
2361 4341 D
S
N
2353 4386 M
2379 4386 D
2385 4384 D
2387 4381 D
2389 4377 D
2389 4373 D
2387 4369 D
2385 4366 D
2379 4364 D
2361 4364 D
S
N
2379 4386 M
2383 4384 D
2385 4381 D
2387 4377 D
2387 4373 D
2385 4369 D
2383 4366 D
2379 4364 D
S
N
2353 4341 M
2368 4341 D
S
N
2372 4364 M
2376 4362 D
2379 4360 D
2385 4345 D
2387 4343 D
2389 4343 D
2391 4345 D
S
N
2376 4362 M
2379 4358 D
2383 4343 D
2385 4341 D
2389 4341 D
2391 4345 D
2391 4347 D
S
N
2415 4386 M
2409 4384 D
2404 4377 D
2402 4366 D
2402 4360 D
2404 4349 D
2409 4343 D
2415 4341 D
2419 4341 D
2426 4343 D
2430 4349 D
2432 4360 D
2432 4366 D
2430 4377 D
2426 4384 D
2419 4386 D
2415 4386 D
S
N
2415 4386 M
2411 4384 D
2409 4381 D
2407 4377 D
2404 4366 D
2404 4360 D
2407 4349 D
2409 4345 D
2411 4343 D
2415 4341 D
S
N
2419 4341 M
2424 4343 D
2426 4345 D
2428 4349 D
2430 4360 D
2430 4366 D
2428 4377 D
2426 4381 D
2424 4384 D
2419 4386 D
S
N
2473 4371 M
2471 4364 D
2467 4360 D
2460 4358 D
2458 4358 D
2452 4360 D
2448 4364 D
2445 4371 D
2445 4373 D
2448 4379 D
2452 4384 D
2458 4386 D
2463 4386 D
2469 4384 D
2473 4379 D
2476 4373 D
2476 4360 D
2473 4351 D
2471 4347 D
2467 4343 D
2460 4341 D
2454 4341 D
2450 4343 D
2448 4347 D
2448 4349 D
2450 4351 D
2452 4349 D
2450 4347 D
S
N
2458 4358 M
2454 4360 D
2450 4364 D
2448 4371 D
2448 4373 D
2450 4379 D
2454 4384 D
2458 4386 D
S
N
2463 4386 M
2467 4384 D
2471 4379 D
2473 4373 D
2473 4360 D
2471 4351 D
2469 4347 D
2465 4343 D
2460 4341 D
S
N
2488 4386 M
2504 4341 D
S
N
2491 4386 M
2504 4347 D
S
N
2519 4386 M
2504 4341 D
S
N
2484 4386 M
2497 4386 D
S
N
2510 4386 M
2523 4386 D
S
N
2536 4386 M
2536 4341 D
S
N
2538 4386 M
2538 4341 D
S
N
2551 4373 M
2551 4356 D
S
N
2529 4386 M
2564 4386 D
2564 4373 D
2562 4386 D
S
N
2538 4364 M
2551 4364 D
S
N
2529 4341 M
2545 4341 D
S
N
2614 4386 M
2614 4341 D
S
N
2616 4386 M
2642 4345 D
S
N
2616 4381 M
2642 4341 D
S
N
2642 4386 M
2642 4341 D
S
N
2607 4386 M
2616 4386 D
S
N
2635 4386 M
2648 4386 D
S
N
2607 4341 M
2620 4341 D
S
N
2663 4386 M
2663 4341 D
S
N
2665 4386 M
2691 4345 D
S
N
2665 4381 M
2691 4341 D
S
N
2691 4386 M
2691 4341 D
S
N
2657 4386 M
2665 4386 D
S
N
2685 4386 M
2698 4386 D
S
N
2657 4341 M
2670 4341 D
S
N
2713 4386 M
2713 4341 D
S
N
2715 4386 M
2715 4341 D
S
N
2706 4386 M
2721 4386 D
S
N
2706 4341 M
2739 4341 D
2739 4353 D
2736 4341 D
S
N
2762 4386 M
2756 4384 D
2752 4379 D
2749 4375 D
2747 4366 D
2747 4360 D
2749 4351 D
2752 4347 D
2756 4343 D
2762 4341 D
2767 4341 D
2773 4343 D
2777 4347 D
2780 4351 D
2782 4360 D
2782 4366 D
2780 4375 D
2777 4379 D
2773 4384 D
2767 4386 D
2762 4386 D
S
N
2762 4386 M
2758 4384 D
2754 4379 D
2752 4375 D
2749 4366 D
2749 4360 D
2752 4351 D
2754 4347 D
2758 4343 D
2762 4341 D
S
N
2767 4341 M
2771 4343 D
2775 4347 D
2777 4351 D
2780 4360 D
2780 4366 D
2777 4375 D
2775 4379 D
2771 4384 D
2767 4386 D
S
[6 30] 0 Sd
N
1925 4402 M
2164 4402 D
2164 4321 D
1925 4321 D
1925 4402 D
S
N
1960 4321 M
1925 4356 D
S
N
2045 4321 M
1964 4402 D
S
N
2130 4321 M
2049 4402 D
S
N
2164 4372 M
2134 4402 D
S
N
2164 4366 M
2119 4321 D
S
N
2115 4402 M
2034 4321 D
S
N
2030 4402 M
1949 4321 D
S
N
1945 4402 M
1925 4382 D
S
0.00 1.00 0.00 setrgbcolor
[] 0 Sd
N
2338 4261 M
2322 4216 D
S
N
2338 4261 M
2353 4216 D
S
N
2338 4255 M
2350 4216 D
S
N
2327 4229 M
2346 4229 D
S
N
2318 4216 M
2331 4216 D
S
N
2344 4216 M
2357 4216 D
S
N
2370 4261 M
2370 4216 D
S
N
2372 4261 M
2372 4216 D
S
N
2363 4261 M
2389 4261 D
2396 4259 D
2398 4257 D
2400 4253 D
2400 4248 D
2398 4244 D
2396 4242 D
2389 4240 D
S
N
2389 4261 M
2394 4259 D
2396 4257 D
2398 4253 D
2398 4248 D
2396 4244 D
2394 4242 D
2389 4240 D
S
N
2372 4240 M
2389 4240 D
2396 4237 D
2398 4235 D
2400 4231 D
2400 4225 D
2398 4220 D
2396 4218 D
2389 4216 D
2363 4216 D
S
N
2389 4240 M
2394 4237 D
2396 4235 D
2398 4231 D
2398 4225 D
2396 4220 D
2394 4218 D
2389 4216 D
S
N
2417 4261 M
2417 4216 D
S
N
2419 4261 M
2419 4216 D
S
N
2448 4261 M
2419 4233 D
S
N
2430 4242 M
2448 4216 D
S
N
2428 4242 M
2445 4216 D
S
N
2411 4261 M
2426 4261 D
S
N
2439 4261 M
2452 4261 D
S
N
2411 4216 M
2426 4216 D
S
N
2439 4216 M
2452 4216 D
S
N
2465 4261 M
2465 4216 D
S
N
2467 4261 M
2480 4222 D
S
N
2465 4261 M
2480 4216 D
S
N
2495 4261 M
2480 4216 D
S
N
2495 4261 M
2495 4216 D
S
N
2497 4261 M
2497 4216 D
S
N
2458 4261 M
2467 4261 D
S
N
2495 4261 M
2504 4261 D
S
N
2458 4216 M
2471 4216 D
S
N
2488 4216 M
2504 4216 D
S
N
2527 4261 M
2521 4259 D
2517 4253 D
2514 4242 D
2514 4235 D
2517 4225 D
2521 4218 D
2527 4216 D
2532 4216 D
2538 4218 D
2542 4225 D
2545 4235 D
2545 4242 D
2542 4253 D
2538 4259 D
2532 4261 D
2527 4261 D
S
N
2527 4261 M
2523 4259 D
2521 4257 D
2519 4253 D
2517 4242 D
2517 4235 D
2519 4225 D
2521 4220 D
2523 4218 D
2527 4216 D
S
N
2532 4216 M
2536 4218 D
2538 4220 D
2540 4225 D
2542 4235 D
2542 4242 D
2540 4253 D
2538 4257 D
2536 4259 D
2532 4261 D
S
N
2586 4246 M
2583 4240 D
2579 4235 D
2573 4233 D
2570 4233 D
2564 4235 D
2560 4240 D
2557 4246 D
2557 4248 D
2560 4255 D
2564 4259 D
2570 4261 D
2575 4261 D
2581 4259 D
2586 4255 D
2588 4248 D
2588 4235 D
2586 4227 D
2583 4222 D
2579 4218 D
2573 4216 D
2566 4216 D
2562 4218 D
2560 4222 D
2560 4225 D
2562 4227 D
2564 4225 D
2562 4222 D
S
N
2570 4233 M
2566 4235 D
2562 4240 D
2560 4246 D
2560 4248 D
2562 4255 D
2566 4259 D
2570 4261 D
S
N
2575 4261 M
2579 4259 D
2583 4255 D
2586 4248 D
2586 4235 D
2583 4227 D
2581 4222 D
2577 4218 D
2573 4216 D
S
N
2601 4231 M
2618 4242 D
2635 4231 D
S
N
2601 4231 M
2618 4240 D
2635 4231 D
S
N
2652 4261 M
2648 4240 D
S
N
2648 4240 M
2652 4244 D
2659 4246 D
2665 4246 D
2672 4244 D
2676 4240 D
2678 4233 D
2678 4229 D
2676 4222 D
2672 4218 D
2665 4216 D
2659 4216 D
2652 4218 D
2650 4220 D
2648 4225 D
2648 4227 D
2650 4229 D
2652 4227 D
2650 4225 D
S
N
2665 4246 M
2670 4244 D
2674 4240 D
2676 4233 D
2676 4229 D
2674 4222 D
2670 4218 D
2665 4216 D
S
N
2652 4261 M
2674 4261 D
S
N
2652 4259 M
2663 4259 D
2674 4261 D
S
N
2730 4261 M
2730 4216 D
S
N
2732 4261 M
2758 4220 D
S
N
2732 4257 M
2758 4216 D
S
N
2758 4261 M
2758 4216 D
S
N
2724 4261 M
2732 4261 D
S
N
2752 4261 M
2764 4261 D
S
N
2724 4216 M
2736 4216 D
S
N
2780 4261 M
2780 4216 D
S
N
2782 4261 M
2808 4220 D
S
N
2782 4257 M
2808 4216 D
S
N
2808 4261 M
2808 4216 D
S
N
2773 4261 M
2782 4261 D
S
N
2801 4261 M
2814 4261 D
S
N
2773 4216 M
2786 4216 D
S
N
2829 4261 M
2829 4216 D
S
N
2831 4261 M
2831 4216 D
S
N
2823 4261 M
2838 4261 D
S
N
2823 4216 M
2855 4216 D
2855 4229 D
2853 4216 D
S
N
2879 4261 M
2872 4259 D
2868 4255 D
2866 4250 D
2864 4242 D
2864 4235 D
2866 4227 D
2868 4222 D
2872 4218 D
2879 4216 D
2883 4216 D
2890 4218 D
2894 4222 D
2896 4227 D
2898 4235 D
2898 4242 D
2896 4250 D
2894 4255 D
2890 4259 D
2883 4261 D
2879 4261 D
S
N
2879 4261 M
2874 4259 D
2870 4255 D
2868 4250 D
2866 4242 D
2866 4235 D
2868 4227 D
2870 4222 D
2874 4218 D
2879 4216 D
S
N
2883 4216 M
2887 4218 D
2892 4222 D
2894 4227 D
2896 4235 D
2896 4242 D
2894 4250 D
2892 4255 D
2887 4259 D
2883 4261 D
S
[30 30 6 30] 0 Sd
N
1925 4281 M
2164 4281 D
2164 4200 D
1925 4200 D
1925 4281 D
S
N
1996 4200 M
1925 4271 D
S
N
2081 4200 M
2000 4281 D
S
N
2164 4202 M
2085 4281 D
S
N
2164 4281 M
2083 4200 D
S
N
2079 4281 M
1998 4200 D
S
N
1994 4281 M
1925 4213 D
S
1.00 0.00 0.00 setrgbcolor
[] 0 Sd
785 3581 P
N
785 3581 M
1147 3555 D
1385 3551 D
1563 3542 D
1706 3535 D
1824 3528 D
1925 3521 D
2014 3516 D
2093 3511 D
2213 3505 D
2355 3499 D
2474 3498 D
2575 3500 D
2664 3503 D
2743 3508 D
2846 3515 D
2965 3526 D
3066 3536 D
3155 3546 D
3234 3555 D
3338 3570 D
3456 3588 D
3558 3607 D
3646 3624 D
3758 3640 D
3758 3306 D
3646 3323 D
3558 3340 D
3456 3358 D
3338 3377 D
3234 3391 D
3155 3401 D
3066 3411 D
2965 3421 D
2846 3431 D
2743 3439 D
2664 3443 D
2575 3447 D
2474 3449 D
2355 3447 D
2213 3442 D
2093 3435 D
2014 3430 D
1925 3425 D
1824 3419 D
1706 3412 D
1563 3404 D
1385 3396 D
1147 3391 D
785 3365 D
785 3365 D
S
N
794 3366 M
785 3375 D
S
N
873 3372 M
785 3460 D
S
N
952 3377 M
785 3545 D
S
N
1032 3383 M
837 3577 D
S
N
1111 3389 M
928 3571 D
S
N
1192 3392 M
1020 3564 D
S
N
1275 3394 M
1111 3558 D
S
N
1359 3395 M
1200 3554 D
S
N
1440 3399 M
1286 3553 D
S
N
1521 3402 M
1373 3551 D
S
N
1602 3406 M
1461 3547 D
S
N
1683 3411 M
1550 3543 D
S
N
1763 3415 M
1640 3538 D
S
N
1843 3420 M
1730 3533 D
S
N
1923 3425 M
1820 3528 D
S
N
2003 3430 M
1910 3522 D
S
N
2083 3435 M
2001 3517 D
S
N
2164 3439 M
2091 3512 D
S
N
2245 3443 M
2181 3507 D
S
N
2326 3446 M
2269 3503 D
S
N
2409 3448 M
2358 3499 D
S
N
2493 3448 M
2444 3498 D
S
N
2580 3447 M
2528 3499 D
S
N
2668 3443 M
2611 3501 D
S
N
2759 3438 M
2692 3505 D
S
N
2850 3431 M
2771 3510 D
S
N
2943 3423 M
2851 3516 D
S
N
3037 3414 M
2929 3522 D
S
N
3133 3403 M
3006 3530 D
S
N
3229 3392 M
3083 3538 D
S
N
3327 3378 M
3159 3546 D
S
N
3428 3363 M
3235 3556 D
S
N
3530 3345 M
3309 3566 D
S
N
3635 3325 M
3383 3577 D
S
N
3735 3310 M
3456 3589 D
S
N
3758 3372 M
3529 3601 D
S
N
3758 3457 M
3600 3615 D
S
N
3758 3542 M
3672 3628 D
S
N
3758 3626 M
3746 3639 D
S
N
3758 3330 M
3737 3309 D
S
N
3758 3415 M
3663 3320 D
S
N
3758 3500 M
3592 3333 D
S
N
3758 3584 M
3520 3347 D
S
N
3724 3635 M
3448 3359 D
S
N
3623 3619 M
3375 3371 D
S
N
3519 3600 M
3301 3382 D
S
N
3416 3582 M
3226 3392 D
S
N
3316 3567 M
3151 3401 D
S
N
3218 3554 M
3074 3410 D
S
N
3122 3542 M
2997 3418 D
S
N
3027 3532 M
2920 3425 D
S
N
2933 3523 M
2842 3432 D
S
N
2840 3515 M
2762 3437 D
S
N
2748 3508 M
2682 3442 D
S
N
2658 3503 M
2601 3446 D
S
N
2570 3499 M
2518 3448 D
S
N
2484 3498 M
2434 3448 D
S
N
2400 3499 M
2348 3447 D
S
N
2317 3501 M
2259 3443 D
S
N
2235 3504 M
2170 3439 D
S
N
2154 3508 M
2081 3434 D
S
N
2074 3513 M
1990 3429 D
S
N
1994 3517 M
1900 3424 D
S
N
1914 3522 M
1810 3418 D
S
N
1834 3527 M
1720 3413 D
S
N
1754 3532 M
1630 3408 D
S
N
1673 3536 M
1540 3403 D
S
N
1593 3541 M
1451 3399 D
S
N
1512 3545 M
1363 3396 D
S
N
1431 3549 M
1276 3394 D
S
N
1349 3551 M
1190 3392 D
S
N
1266 3553 M
1101 3388 D
S
N
1183 3555 M
1009 3381 D
S
N
1102 3559 M
918 3375 D
S
N
1022 3564 M
827 3368 D
S
N
943 3570 M
785 3411 D
S
N
864 3576 M
785 3496 D
S
N
785 3581 M
785 3581 D
S
0.00 0.00 1.00 setrgbcolor
785 3299 P
[39] 0 Sd
N
785 3299 M
1147 3255 D
1385 3322 D
1563 3379 D
1706 3424 D
1824 3460 D
1925 3488 D
2014 3510 D
2093 3527 D
2213 3550 D
2355 3573 D
2474 3588 D
2575 3599 D
2664 3607 D
2743 3613 D
2846 3619 D
2965 3623 D
3066 3623 D
3155 3622 D
3234 3619 D
3338 3614 D
3456 3605 D
3558 3596 D
3646 3587 D
3758 3578 D
3758 3162 D
3646 3214 D
3558 3269 D
3456 3324 D
3338 3379 D
3234 3420 D
3155 3445 D
3066 3470 D
2965 3492 D
2846 3510 D
2743 3520 D
2664 3523 D
2575 3522 D
2474 3514 D
2355 3498 D
2213 3467 D
2093 3434 D
2014 3409 D
1925 3379 D
1824 3341 D
1706 3295 D
1563 3238 D
1385 3170 D
1147 3094 D
785 2980 D
785 2980 D
S
N
827 2993 M
785 3036 D
S
N
892 3014 M
785 3121 D
S
N
956 3034 M
785 3206 D
S
N
1021 3054 M
785 3291 D
S
N
1086 3074 M
871 3289 D
S
N
1150 3095 M
968 3277 D
S
N
1214 3115 M
1064 3265 D
S
N
1279 3136 M
1156 3258 D
S
N
1343 3156 M
1223 3277 D
S
N
1406 3178 M
1289 3295 D
S
N
1468 3201 M
1356 3313 D
S
N
1529 3225 M
1421 3333 D
S
N
1590 3249 M
1485 3354 D
S
N
1651 3273 M
1549 3374 D
S
N
1712 3297 M
1614 3395 D
S
N
1773 3321 M
1678 3416 D
S
N
1834 3345 M
1743 3436 D
S
N
1896 3368 M
1808 3455 D
S
N
1958 3390 M
1874 3474 D
S
N
2021 3411 M
1941 3492 D
S
N
2086 3432 M
2009 3509 D
S
N
2152 3450 M
2078 3524 D
S
N
2219 3469 M
2149 3538 D
S
N
2289 3483 M
2221 3552 D
S
N
2359 3498 M
2294 3563 D
S
N
2433 3509 M
2368 3574 D
S
N
2510 3517 M
2443 3584 D
S
N
2590 3522 M
2519 3593 D
S
N
2674 3522 M
2596 3601 D
S
N
2764 3518 M
2674 3608 D
S
N
2858 3509 M
2753 3613 D
S
N
2958 3493 M
2833 3618 D
S
N
3066 3470 M
2915 3621 D
S
N
3185 3436 M
2998 3623 D
S
N
3319 3387 M
3083 3623 D
S
N
3478 3312 M
3169 3621 D
S
N
3674 3201 M
3257 3618 D
S
N
3758 3202 M
3347 3613 D
S
N
3758 3287 M
3439 3606 D
S
N
3758 3372 M
3532 3598 D
S
N
3758 3457 M
3626 3589 D
S
N
3758 3542 M
3718 3581 D
S
N
3758 3245 M
3701 3189 D
S
N
3758 3330 M
3644 3216 D
S
N
3758 3415 M
3591 3248 D
S
N
3758 3500 M
3538 3280 D
S
N
3752 3579 M
3483 3310 D
S
N
3673 3585 M
3427 3338 D
S
N
3596 3592 M
3369 3365 D
S
N
3518 3599 M
3309 3390 D
S
N
3440 3606 M
3248 3414 D
S
N
3361 3612 M
3185 3436 D
S
N
3281 3617 M
3120 3455 D
S
N
3200 3620 M
3052 3473 D
S
N
3117 3622 M
2983 3488 D
S
N
3033 3623 M
2910 3500 D
S
N
2947 3622 M
2836 3511 D
S
N
2859 3619 M
2758 3518 D
S
N
2770 3614 M
2678 3522 D
S
N
2678 3608 M
2592 3522 D
S
N
2585 3600 M
2502 3516 D
S
N
2490 3590 M
2405 3505 D
S
N
2393 3578 M
2302 3486 D
S
N
2294 3563 M
2193 3462 D
S
N
2193 3547 M
2074 3428 D
S
N
2088 3526 M
1948 3386 D
S
N
1977 3501 M
1813 3337 D
S
N
1862 3471 M
1673 3282 D
S
N
1742 3435 M
1533 3226 D
S
N
1618 3396 M
1396 3174 D
S
N
1493 3356 M
1270 3133 D
S
N
1369 3317 M
1145 3093 D
S
N
1252 3285 M
1022 3054 D
S
N
1139 3256 M
898 3016 D
S
N
1063 3266 M
785 2987 D
S
N
987 3275 M
785 3072 D
S
N
912 3284 M
785 3157 D
S
N
836 3293 M
785 3242 D
S
1.00 0.00 1.00 setrgbcolor
[6 30] 0 Sd
N
1077 4685 M
1147 4589 D
1385 4257 D
1563 4009 D
1706 3823 D
1824 3682 D
1925 3570 D
2014 3484 D
2093 3417 D
2213 3347 D
2355 3341 D
2474 3364 D
2575 3394 D
2664 3428 D
2743 3463 D
2846 3517 D
2965 3592 D
3066 3668 D
3155 3745 D
3234 3822 D
3338 3937 D
3456 4091 D
3558 4239 D
3646 4380 D
3758 4510 D
3758 3095 D
3646 3098 D
3558 3092 D
3456 3078 D
3338 3059 D
3234 3044 D
3155 3036 D
3066 3030 D
2965 3029 D
2846 3037 D
2743 3054 D
2664 3072 D
2575 3099 D
2474 3140 D
2355 3197 D
2213 3262 D
2093 3279 D
2014 3282 D
1925 3287 D
1824 3296 D
1706 3310 D
1563 3333 D
1385 3375 D
1147 3446 D
785 3610 D
785 3610 D
S
N
821 3594 M
785 3630 D
S
N
976 3523 M
785 3715 D
S
N
1131 3453 M
785 3800 D
S
N
1255 3414 M
785 3885 D
S
N
1376 3378 M
785 3969 D
S
N
1488 3351 M
785 4054 D
S
N
1596 3328 M
785 4139 D
S
N
1698 3311 M
785 4224 D
S
N
1794 3299 M
785 4309 D
S
N
1888 3290 M
785 4394 D
S
N
1979 3284 M
785 4478 D
S
N
2068 3280 M
785 4563 D
S
N
2164 3269 M
785 4648 D
S
N
2292 3226 M
2111 3406 D
S
N
1761 3757 M
833 4685 D
S
N
2452 3150 M
2257 3345 D
S
N
1487 4116 M
918 4685 D
S
N
2594 3094 M
2346 3341 D
S
N
1270 4417 M
1003 4685 D
S
N
2711 3062 M
2419 3353 D
S
N
2815 3042 M
2489 3369 D
S
N
2909 3033 M
2554 3388 D
S
N
2997 3029 M
2617 3410 D
S
N
3081 3031 M
2678 3434 D
S
N
3160 3037 M
2736 3460 D
S
N
3237 3045 M
2793 3489 D
S
N
3311 3055 M
2848 3518 D
S
N
3384 3067 M
2900 3551 D
S
N
3458 3078 M
2952 3584 D
S
N
3532 3089 M
3001 3619 D
S
N
3610 3096 M
3050 3656 D
S
N
3694 3097 M
3096 3694 D
S
N
3758 3117 M
3142 3733 D
S
N
3758 3202 M
3186 3775 D
S
N
3758 3287 M
3228 3817 D
S
N
3758 3372 M
3269 3861 D
S
N
3758 3457 M
3309 3906 D
S
N
3758 3542 M
3348 3951 D
S
N
3758 3626 M
3385 3999 D
S
N
3758 3711 M
3422 4047 D
S
N
3758 3796 M
3459 4095 D
S
N
3758 3881 M
3494 4145 D
S
N
3758 3966 M
3528 4196 D
S
N
3758 4051 M
3562 4247 D
S
N
3758 4136 M
3595 4299 D
S
N
3758 4220 M
3628 4351 D
S
N
3758 4305 M
3663 4400 D
S
N
3758 4390 M
3703 4445 D
S
N
3758 4475 M
3742 4491 D
S
N
3758 3160 M
3695 3097 D
S
N
3758 3245 M
3608 3095 D
S
N
3758 3330 M
3514 3086 D
S
N
3758 3415 M
3415 3071 D
S
N
3758 3500 M
3314 3056 D
S
N
3758 3584 M
3216 3043 D
S
N
3758 3669 M
3123 3034 D
S
N
3758 3754 M
3033 3030 D
S
N
3758 3839 M
2949 3030 D
S
N
3758 3924 M
2870 3036 D
S
N
3758 4009 M
2795 3046 D
S
N
3758 4094 M
2723 3059 D
S
N
3758 4178 M
2655 3075 D
S
N
3758 4263 M
2590 3095 D
S
N
3758 4348 M
3253 3843 D
S
N
3153 3743 M
2528 3118 D
S
N
3758 4433 M
3543 4218 D
S
N
2837 3512 M
2468 3143 D
S
N
2671 3431 M
2411 3170 D
S
N
2539 3383 M
2353 3198 D
S
N
2425 3355 M
2295 3225 D
S
N
2328 3342 M
2237 3251 D
S
N
2246 3346 M
2169 3268 D
S
N
2181 3366 M
2094 3278 D
S
N
2128 3397 M
2013 3282 D
S
N
2077 3431 M
1933 3287 D
S
N
2031 3470 M
1854 3293 D
S
N
1987 3510 M
1778 3301 D
S
N
1944 3552 M
1702 3310 D
S
N
1902 3596 M
1629 3322 D
S
N
1862 3640 M
1557 3335 D
S
N
1822 3684 M
1488 3351 D
S
N
1783 3731 M
1419 3367 D
S
N
1744 3777 M
1352 3385 D
S
N
1705 3823 M
1287 3404 D
S
N
1669 3871 M
1221 3424 D
S
N
1632 3919 M
1156 3443 D
S
N
1595 3967 M
1097 3469 D
S
N
1559 4016 M
1038 3495 D
S
N
1523 4065 M
980 3522 D
S
N
1488 4114 M
921 3548 D
S
N
1452 4164 M
863 3575 D
S
N
1417 4213 M
805 3601 D
S
N
1381 4263 M
785 3666 D
S
N
1346 4312 M
785 3751 D
S
N
1310 4361 M
785 3835 D
S
N
1275 4411 M
785 3920 D
S
N
1239 4460 M
785 4005 D
S
N
1204 4509 M
785 4090 D
S
N
1168 4559 M
785 4175 D
S
N
1133 4608 M
785 4260 D
S
N
1097 4657 M
785 4345 D
S
N
1040 4685 M
785 4429 D
S
N
955 4685 M
785 4514 D
S
N
870 4685 M
785 4599 D
S
N
785 4685 M
785 4684 D
S
0.00 1.00 0.00 setrgbcolor
[30 30 6 30] 0 Sd
N
1307 4685 M
1385 4562 D
1563 4279 D
1706 4061 D
1824 3889 D
1925 3751 D
2014 3640 D
2093 3551 D
2213 3446 D
2355 3361 D
2474 3302 D
2575 3258 D
2664 3222 D
2743 3192 D
2846 3155 D
2965 3115 D
3066 3081 D
3155 3052 D
3234 3025 D
3338 2987 D
3456 2940 D
3558 2894 D
3646 2848 D
3758 2803 D
3758 2262 D
S
N
3636 2262 M
3558 2344 D
3456 2437 D
3338 2532 D
3234 2607 D
3155 2659 D
3066 2716 D
2965 2779 D
2846 2855 D
2743 2925 D
2664 2982 D
2575 3049 D
2474 3132 D
2355 3236 D
2213 3368 D
2093 3467 D
2014 3522 D
1925 3582 D
1824 3650 D
1706 3733 D
1563 3835 D
1385 3965 D
1147 4140 D
785 4438 D
785 4438 D
S
N
1013 4250 M
785 4478 D
S
N
1376 3972 M
785 4563 D
S
N
1686 3747 M
785 4648 D
S
N
1957 3561 M
833 4685 D
S
N
2452 3151 M
918 4685 D
S
N
2803 2885 M
2284 3403 D
S
N
1896 3791 M
1003 4685 D
S
N
3040 2732 M
2466 3306 D
S
N
1695 4077 M
1087 4685 D
S
N
3292 2565 M
2616 3241 D
S
N
1539 4318 M
1172 4685 D
S
N
3680 2262 M
2754 3188 D
S
N
1394 4548 M
1257 4685 D
S
N
3758 2269 M
2885 3142 D
S
N
3758 2354 M
3013 3099 D
S
N
3758 2439 M
3140 3057 D
S
N
3758 2523 M
3269 3012 D
S
N
3758 2608 M
3406 2960 D
S
N
3758 2693 M
3557 2894 D
S
N
3758 2778 M
3716 2820 D
S
N
3758 2312 M
3708 2262 D
S
N
3758 2397 M
3630 2269 D
S
N
3758 2481 M
3588 2312 D
S
N
3758 2566 M
3546 2354 D
S
N
3758 2651 M
3502 2395 D
S
N
3758 2736 M
3458 2436 D
S
N
3745 2808 M
3411 2474 D
S
N
3685 2833 M
3364 2512 D
S
N
3626 2859 M
3316 2548 D
S
N
3570 2887 M
3266 2584 D
S
N
3512 2915 M
3216 2618 D
S
N
3454 2941 M
3165 2652 D
S
N
3393 2965 M
3114 2685 D
S
N
3333 2989 M
3062 2718 D
S
N
3270 3012 M
3010 2751 D
S
N
3207 3034 M
2958 2784 D
S
N
3144 3055 M
2906 2817 D
S
N
3080 3077 M
2854 2850 D
S
N
3017 3098 M
2803 2884 D
S
N
2953 3119 M
2753 2918 D
S
N
2890 3140 M
2703 2954 D
S
N
2826 3162 M
2654 2989 D
S
N
2764 3184 M
2605 3026 D
S
N
2702 3207 M
2558 3063 D
S
N
2641 3231 M
2511 3101 D
S
N
2581 3256 M
2465 3140 D
S
N
2522 3281 M
2419 3179 D
S
N
2463 3308 M
2374 3219 D
S
N
2406 3336 M
2330 3260 D
S
N
2350 3364 M
2286 3300 D
S
N
2296 3396 M
2242 3341 D
S
N
2243 3428 M
2197 3381 D
S
N
2194 3463 M
2151 3420 D
S
N
2148 3502 M
2104 3458 D
S
N
2103 3542 M
2055 3494 D
S
N
2062 3586 M
2005 3528 D
S
N
2022 3631 M
1954 3563 D
S
N
1984 3677 M
1904 3597 D
S
N
1947 3725 M
1853 3631 D
S
N
1910 3773 M
1802 3665 D
S
N
1874 3822 M
1752 3700 D
S
N
1838 3870 M
1702 3735 D
S
N
1803 3920 M
1653 3770 D
S
N
1768 3970 M
1604 3806 D
S
N
1733 4021 M
1554 3841 D
S
N
1699 4071 M
1505 3877 D
S
N
1666 4122 M
1456 3913 D
S
N
1632 4174 M
1407 3949 D
S
N
1599 4225 M
1358 3985 D
S
N
1565 4277 M
1309 4021 D
S
N
1532 4329 M
1260 4057 D
S
N
1500 4381 M
1211 4093 D
S
N
1467 4433 M
1162 4128 D
S
N
1434 4485 M
1115 4166 D
S
N
1401 4537 M
1069 4204 D
S
N
1368 4589 M
1022 4243 D
S
N
1335 4640 M
975 4281 D
S
N
1295 4685 M
929 4319 D
S
N
1210 4685 M
882 4358 D
S
N
1125 4685 M
836 4396 D
S
N
1040 4685 M
789 4434 D
S
N
955 4685 M
785 4514 D
S
N
870 4685 M
785 4599 D
S
N
785 4685 M
785 4684 D
S
0.00 0.00 0.00 setrgbcolor
[] 0 Sd
N
898 2544 M
909 2544 D
926 2511 D
S
N
907 2544 M
926 2506 D
950 2580 D
S
N
986 2539 M
989 2544 D
989 2533 D
986 2539 D
983 2541 D
978 2544 D
967 2544 D
961 2541 D
959 2539 D
959 2533 D
961 2530 D
967 2528 D
981 2522 D
986 2520 D
989 2517 D
S
N
959 2536 M
961 2533 D
967 2530 D
981 2525 D
986 2522 D
989 2520 D
989 2511 D
986 2509 D
981 2506 D
970 2506 D
964 2509 D
961 2511 D
959 2517 D
959 2506 D
961 2511 D
S
N
1008 2539 M
1057 2539 D
S
N
1008 2522 M
1057 2522 D
S
N
1076 2563 M
1076 2547 D
S
N
1076 2552 M
1079 2558 D
1085 2563 D
1090 2563 D
1104 2555 D
1109 2555 D
1112 2558 D
1115 2563 D
S
N
1079 2558 M
1085 2561 D
1090 2561 D
1104 2555 D
S
N
1115 2563 M
1115 2555 D
1112 2547 D
1101 2533 D
1098 2528 D
1096 2520 D
1096 2506 D
S
N
1112 2547 M
1098 2533 D
1096 2528 D
1093 2520 D
1093 2506 D
S
N
1191 2563 M
1191 2506 D
S
N
1194 2563 M
1194 2506 D
S
N
1175 2563 M
1172 2547 D
1172 2563 D
1213 2563 D
1213 2547 D
1211 2563 D
S
N
1183 2506 M
1202 2506 D
S
N
1230 2528 M
1263 2528 D
1263 2533 D
1260 2539 D
1257 2541 D
1252 2544 D
1243 2544 D
1235 2541 D
1230 2536 D
1227 2528 D
1227 2522 D
1230 2514 D
1235 2509 D
1243 2506 D
1249 2506 D
1257 2509 D
1263 2514 D
S
N
1260 2528 M
1260 2536 D
1257 2541 D
S
N
1243 2544 M
1238 2541 D
1232 2536 D
1230 2528 D
1230 2522 D
1232 2514 D
1238 2509 D
1243 2506 D
S
N
1279 2563 M
1298 2506 D
S
N
1282 2563 M
1298 2514 D
S
N
1317 2563 M
1298 2506 D
S
N
1273 2563 M
1290 2563 D
S
N
1306 2563 M
1323 2563 D
S
N
931 2417 M
929 2414 D
931 2411 D
934 2414 D
934 2417 D
931 2422 D
926 2425 D
918 2425 D
909 2422 D
904 2417 D
901 2411 D
898 2400 D
898 2384 D
901 2376 D
907 2370 D
915 2367 D
920 2367 D
929 2370 D
934 2376 D
937 2384 D
937 2387 D
934 2395 D
929 2400 D
920 2403 D
918 2403 D
909 2400 D
904 2395 D
901 2387 D
S
N
918 2425 M
912 2422 D
907 2417 D
904 2411 D
901 2400 D
901 2384 D
904 2376 D
909 2370 D
915 2367 D
S
N
920 2367 M
926 2370 D
931 2376 D
934 2384 D
934 2387 D
931 2395 D
926 2400 D
920 2403 D
S
N
967 2425 M
959 2422 D
956 2417 D
956 2408 D
959 2403 D
967 2400 D
978 2400 D
986 2403 D
989 2408 D
989 2417 D
986 2422 D
978 2425 D
967 2425 D
S
N
967 2425 M
961 2422 D
959 2417 D
959 2408 D
961 2403 D
967 2400 D
S
N
978 2400 M
983 2403 D
986 2408 D
986 2417 D
983 2422 D
978 2425 D
S
N
967 2400 M
959 2397 D
956 2395 D
953 2389 D
953 2378 D
956 2373 D
959 2370 D
967 2367 D
978 2367 D
986 2370 D
989 2373 D
992 2378 D
992 2389 D
989 2395 D
986 2397 D
978 2400 D
S
N
967 2400 M
961 2397 D
959 2395 D
956 2389 D
956 2378 D
959 2373 D
961 2370 D
967 2367 D
S
N
978 2367 M
983 2370 D
986 2373 D
989 2378 D
989 2389 D
986 2395 D
983 2397 D
978 2400 D
S
N
1057 2425 M
1008 2367 D
S
N
1022 2425 M
1027 2419 D
1027 2414 D
1024 2408 D
1019 2406 D
1013 2406 D
1008 2411 D
1008 2417 D
1011 2422 D
1016 2425 D
1022 2425 D
1027 2422 D
1035 2419 D
1044 2419 D
1052 2422 D
1057 2425 D
S
N
1046 2387 M
1041 2384 D
1038 2378 D
1038 2373 D
1044 2367 D
1049 2367 D
1054 2370 D
1057 2376 D
1057 2381 D
1052 2387 D
1046 2387 D
S
N
1156 2417 M
1159 2408 D
1159 2425 D
1156 2417 D
1150 2422 D
1142 2425 D
1137 2425 D
1128 2422 D
1123 2417 D
1120 2411 D
1117 2403 D
1117 2389 D
1120 2381 D
1123 2376 D
1128 2370 D
1137 2367 D
1142 2367 D
1150 2370 D
1156 2376 D
1159 2381 D
S
N
1137 2425 M
1131 2422 D
1126 2417 D
1123 2411 D
1120 2403 D
1120 2389 D
1123 2381 D
1126 2376 D
1131 2370 D
1137 2367 D
S
N
1180 2425 M
1180 2367 D
S
N
1183 2425 M
1183 2367 D
S
N
1172 2425 M
1191 2425 D
S
N
1172 2367 M
1213 2367 D
1213 2384 D
1211 2367 D
S
N
1273 2425 M
1273 2367 D
S
N
1276 2425 M
1276 2367 D
S
N
1265 2425 M
1298 2425 D
1306 2422 D
1309 2419 D
1312 2414 D
1312 2406 D
1309 2400 D
1306 2397 D
1298 2395 D
1276 2395 D
S
N
1298 2425 M
1304 2422 D
1306 2419 D
1309 2414 D
1309 2406 D
1306 2400 D
1304 2397 D
1298 2395 D
S
N
1265 2367 M
1284 2367 D
S
N
1334 2425 M
1334 2367 D
S
N
1336 2425 M
1336 2367 D
S
N
1325 2425 M
1353 2425 D
1361 2422 D
1367 2417 D
1369 2411 D
1372 2403 D
1372 2389 D
1369 2381 D
1367 2376 D
1361 2370 D
1353 2367 D
1325 2367 D
S
N
1353 2425 M
1358 2422 D
1364 2417 D
1367 2411 D
1369 2403 D
1369 2389 D
1367 2381 D
1364 2376 D
1358 2370 D
1353 2367 D
S
N
1394 2425 M
1394 2367 D
S
N
1397 2425 M
1397 2367 D
S
N
1413 2408 M
1413 2387 D
S
N
1386 2425 M
1430 2425 D
1430 2408 D
1427 2425 D
S
N
1397 2397 M
1413 2397 D
S
N
1386 2367 M
1405 2367 D
S
N
1490 2389 M
1523 2389 D
1523 2395 D
1520 2400 D
1517 2403 D
1512 2406 D
1503 2406 D
1495 2403 D
1490 2397 D
1487 2389 D
1487 2384 D
1490 2376 D
1495 2370 D
1503 2367 D
1509 2367 D
1517 2370 D
1523 2376 D
S
N
1520 2389 M
1520 2397 D
1517 2403 D
S
N
1503 2406 M
1498 2403 D
1492 2397 D
1490 2389 D
1490 2384 D
1492 2376 D
1498 2370 D
1503 2367 D
S
N
1544 2406 M
1544 2367 D
S
N
1547 2406 M
1547 2367 D
S
N
1547 2389 M
1550 2397 D
1555 2403 D
1561 2406 D
1569 2406 D
1572 2403 D
1572 2400 D
1569 2397 D
1566 2400 D
1569 2403 D
S
N
1536 2406 M
1547 2406 D
S
N
1536 2367 M
1555 2367 D
S
N
1591 2406 M
1591 2367 D
S
N
1594 2406 M
1594 2367 D
S
N
1594 2389 M
1597 2397 D
1602 2403 D
1607 2406 D
1616 2406 D
1618 2403 D
1618 2400 D
1616 2397 D
1613 2400 D
1616 2403 D
S
N
1583 2406 M
1594 2406 D
S
N
1583 2367 M
1602 2367 D
S
N
1649 2406 M
1640 2403 D
1635 2397 D
1632 2389 D
1632 2384 D
1635 2376 D
1640 2370 D
1649 2367 D
1654 2367 D
1662 2370 D
1668 2376 D
1670 2384 D
1670 2389 D
1668 2397 D
1662 2403 D
1654 2406 D
1649 2406 D
S
N
1649 2406 M
1643 2403 D
1638 2397 D
1635 2389 D
1635 2384 D
1638 2376 D
1643 2370 D
1649 2367 D
S
N
1654 2367 M
1659 2370 D
1665 2376 D
1668 2384 D
1668 2389 D
1665 2397 D
1659 2403 D
1654 2406 D
S
N
1692 2406 M
1692 2367 D
S
N
1695 2406 M
1695 2367 D
S
N
1695 2389 M
1698 2397 D
1703 2403 D
1709 2406 D
1717 2406 D
1720 2403 D
1720 2400 D
1717 2397 D
1714 2400 D
1717 2403 D
S
N
1684 2406 M
1695 2406 D
S
N
1684 2367 M
1703 2367 D
S
N
1783 2425 M
1783 2367 D
S
N
1785 2425 M
1785 2367 D
S
N
1785 2397 M
1791 2403 D
1796 2406 D
1802 2406 D
1810 2403 D
1816 2397 D
1818 2389 D
1818 2384 D
1816 2376 D
1810 2370 D
1802 2367 D
1796 2367 D
1791 2370 D
1785 2376 D
S
N
1802 2406 M
1807 2403 D
1813 2397 D
1816 2389 D
1816 2384 D
1813 2376 D
1807 2370 D
1802 2367 D
S
N
1774 2425 M
1785 2425 D
S
N
1840 2400 M
1840 2397 D
1837 2397 D
1837 2400 D
1840 2403 D
1846 2406 D
1857 2406 D
1862 2403 D
1865 2400 D
1868 2395 D
1868 2376 D
1870 2370 D
1873 2367 D
S
N
1865 2400 M
1865 2376 D
1868 2370 D
1873 2367 D
1876 2367 D
S
N
1865 2395 M
1862 2392 D
1846 2389 D
1837 2387 D
1835 2381 D
1835 2376 D
1837 2370 D
1846 2367 D
1854 2367 D
1859 2370 D
1865 2376 D
S
N
1846 2389 M
1840 2387 D
1837 2381 D
1837 2376 D
1840 2370 D
1846 2367 D
S
N
1895 2406 M
1895 2367 D
S
N
1898 2406 M
1898 2367 D
S
N
1898 2397 M
1903 2403 D
1911 2406 D
1917 2406 D
1925 2403 D
1928 2397 D
1928 2367 D
S
N
1917 2406 M
1922 2403 D
1925 2397 D
1925 2367 D
S
N
1887 2406 M
1898 2406 D
S
N
1887 2367 M
1906 2367 D
S
N
1917 2367 M
1936 2367 D
S
N
1982 2425 M
1982 2367 D
S
N
1985 2425 M
1985 2367 D
S
N
1982 2397 M
1977 2403 D
1972 2406 D
1966 2406 D
1958 2403 D
1952 2397 D
1950 2389 D
1950 2384 D
1952 2376 D
1958 2370 D
1966 2367 D
1972 2367 D
1977 2370 D
1982 2376 D
S
N
1966 2406 M
1961 2403 D
1955 2397 D
1952 2389 D
1952 2384 D
1955 2376 D
1961 2370 D
1966 2367 D
S
N
1974 2425 M
1985 2425 D
S
N
1982 2367 M
1993 2367 D
S
N
904 2683 M
904 2625 D
S
N
907 2683 M
907 2625 D
S
N
907 2674 M
912 2680 D
918 2683 D
923 2683 D
931 2680 D
937 2674 D
940 2666 D
940 2661 D
937 2653 D
931 2647 D
923 2644 D
918 2644 D
912 2647 D
907 2653 D
S
N
923 2683 M
929 2680 D
934 2674 D
937 2666 D
937 2661 D
934 2653 D
929 2647 D
923 2644 D
S
N
896 2683 M
907 2683 D
S
N
896 2625 M
915 2625 D
S
N
961 2683 M
961 2625 D
S
N
964 2683 M
964 2625 D
S
N
964 2674 M
970 2680 D
975 2683 D
981 2683 D
989 2680 D
994 2674 D
997 2666 D
997 2661 D
994 2653 D
989 2647 D
981 2644 D
975 2644 D
970 2647 D
964 2653 D
S
N
981 2683 M
986 2680 D
992 2674 D
994 2666 D
994 2661 D
992 2653 D
986 2647 D
981 2644 D
S
N
953 2683 M
964 2683 D
S
N
953 2625 M
972 2625 D
S
N
1057 2674 M
1065 2669 D
1057 2663 D
S
N
1049 2683 M
1063 2669 D
1049 2655 D
S
N
1016 2669 M
1063 2669 D
S
N
1090 2702 M
1090 2644 D
S
N
1093 2702 M
1093 2644 D
S
N
1126 2702 M
1126 2644 D
S
N
1128 2702 M
1128 2644 D
S
N
1082 2702 M
1101 2702 D
S
N
1117 2702 M
1137 2702 D
S
N
1093 2674 M
1126 2674 D
S
N
1082 2644 M
1101 2644 D
S
N
1117 2644 M
1137 2644 D
S
N
1178 2694 M
1178 2644 D
S
N
1153 2669 M
1202 2669 D
S
N
1221 2702 M
1257 2644 D
S
N
1224 2702 M
1260 2644 D
S
N
1260 2702 M
1221 2644 D
S
N
1216 2702 M
1232 2702 D
S
N
1249 2702 M
1265 2702 D
S
N
1216 2644 M
1232 2644 D
S
N
1249 2644 M
1265 2644 D
S
N
1413 2702 M
1413 2644 D
S
N
1416 2702 M
1432 2653 D
S
N
1413 2702 M
1432 2644 D
S
N
1451 2702 M
1432 2644 D
S
N
1451 2702 M
1451 2644 D
S
N
1454 2702 M
1454 2644 D
S
N
1405 2702 M
1416 2702 D
S
N
1451 2702 M
1462 2702 D
S
N
1405 2644 M
1421 2644 D
S
N
1443 2644 M
1462 2644 D
S
N
1481 2661 M
1481 2622 D
S
N
1482 2661 M
1482 2622 D
S
N
1504 2661 M
1504 2622 D
S
N
1506 2661 M
1506 2622 D
S
N
1475 2661 M
1488 2661 D
S
N
1499 2661 M
1512 2661 D
S
N
1482 2642 M
1504 2642 D
S
N
1475 2622 M
1488 2622 D
S
N
1499 2622 M
1512 2622 D
S
N
1530 2677 M
1579 2677 D
S
N
1530 2661 M
1579 2661 D
S
N
1607 2691 M
1612 2694 D
1620 2702 D
1620 2644 D
S
N
1617 2699 M
1617 2644 D
S
N
1607 2644 M
1631 2644 D
S
N
1686 2694 M
1683 2691 D
1686 2688 D
1689 2691 D
1689 2694 D
1686 2699 D
1680 2702 D
1672 2702 D
1664 2699 D
1659 2694 D
1656 2688 D
1653 2677 D
1653 2661 D
1656 2653 D
1661 2647 D
1670 2644 D
1675 2644 D
1683 2647 D
1689 2653 D
1691 2661 D
1691 2663 D
1689 2672 D
1683 2677 D
1675 2680 D
1672 2680 D
1664 2677 D
1659 2672 D
1656 2663 D
S
N
1672 2702 M
1667 2699 D
1661 2694 D
1659 2688 D
1656 2677 D
1656 2661 D
1659 2653 D
1664 2647 D
1670 2644 D
S
N
1675 2644 M
1680 2647 D
1686 2653 D
1689 2661 D
1689 2663 D
1686 2672 D
1680 2677 D
1675 2680 D
S
N
1713 2702 M
1708 2674 D
S
N
1708 2674 M
1713 2680 D
1722 2683 D
1730 2683 D
1738 2680 D
1743 2674 D
1746 2666 D
1746 2661 D
1743 2653 D
1738 2647 D
1730 2644 D
1722 2644 D
1713 2647 D
1711 2650 D
1708 2655 D
1708 2658 D
1711 2661 D
1713 2658 D
1711 2655 D
S
N
1730 2683 M
1735 2680 D
1741 2674 D
1743 2666 D
1743 2661 D
1741 2653 D
1735 2647 D
1730 2644 D
S
N
1713 2702 M
1741 2702 D
S
N
1713 2699 M
1727 2699 D
1741 2702 D
S
N
1845 2694 M
1847 2685 D
1847 2702 D
1845 2694 D
1839 2699 D
1831 2702 D
1826 2702 D
1817 2699 D
1812 2694 D
1809 2688 D
1806 2680 D
1806 2666 D
1809 2658 D
1812 2653 D
1817 2647 D
1826 2644 D
1831 2644 D
1839 2647 D
1845 2653 D
S
N
1826 2702 M
1820 2699 D
1815 2694 D
1812 2688 D
1809 2680 D
1809 2666 D
1812 2658 D
1815 2653 D
1820 2647 D
1826 2644 D
S
N
1845 2666 M
1845 2644 D
S
N
1847 2666 M
1847 2644 D
S
N
1836 2666 M
1856 2666 D
S
N
1872 2666 M
1905 2666 D
1905 2672 D
1902 2677 D
1899 2680 D
1894 2683 D
1886 2683 D
1878 2680 D
1872 2674 D
1869 2666 D
1869 2661 D
1872 2653 D
1878 2647 D
1886 2644 D
1891 2644 D
1899 2647 D
1905 2653 D
S
N
1902 2666 M
1902 2674 D
1899 2680 D
S
N
1886 2683 M
1880 2680 D
1875 2674 D
1872 2666 D
1872 2661 D
1875 2653 D
1880 2647 D
1886 2644 D
S
N
1921 2702 M
1941 2644 D
S
N
1924 2702 M
1941 2653 D
S
N
1960 2702 M
1941 2644 D
S
N
1916 2702 M
1932 2702 D
S
N
1949 2702 M
1965 2702 D
S
N
785 4685 M
785 2262 D
S
N
785 2262 M
3762 2262 D
S
N
3762 2262 M
3762 4685 D
S
N
3762 4685 M
785 4685 D
S
N
785 2262 M
3762 2262 D
S
N
785 2262 M
785 2296 D
S
N
989 2296 M
989 2262 D
S
N
1147 2262 M
1147 2366 D
S
N
1276 2296 M
1276 2262 D
S
N
1385 2262 M
1385 2296 D
S
N
1480 2296 M
1480 2262 D
S
N
1563 2262 M
1563 2296 D
S
N
1638 2366 M
1638 2262 D
S
N
2129 2262 M
2129 2366 D
S
N
2417 2296 M
2417 2262 D
S
N
2621 2262 M
2621 2296 D
S
N
2779 2366 M
2779 2262 D
S
N
2908 2262 M
2908 2296 D
S
N
3017 2296 M
3017 2262 D
S
N
3112 2262 M
3112 2296 D
S
N
3196 2296 M
3196 2262 D
S
N
3270 2262 M
3270 2366 D
S
N
3762 2366 M
3762 2262 D
S
N
1132 2205 M
1126 2176 D
S
N
1126 2176 M
1132 2182 D
1141 2184 D
1150 2184 D
1158 2182 D
1164 2176 D
1167 2167 D
1167 2161 D
1164 2153 D
1158 2147 D
1150 2144 D
1141 2144 D
1132 2147 D
1129 2150 D
1126 2156 D
1126 2158 D
1129 2161 D
1132 2158 D
1129 2156 D
S
N
1150 2184 M
1155 2182 D
1161 2176 D
1164 2167 D
1164 2161 D
1161 2153 D
1155 2147 D
1150 2144 D
S
N
1132 2205 M
1161 2205 D
S
N
1132 2202 M
1147 2202 D
1161 2205 D
S
N
1598 2193 M
1603 2196 D
1612 2205 D
1612 2144 D
S
N
1609 2202 M
1609 2144 D
S
N
1598 2144 M
1624 2144 D
S
N
1664 2205 M
1655 2202 D
1650 2193 D
1647 2179 D
1647 2170 D
1650 2156 D
1655 2147 D
1664 2144 D
1670 2144 D
1678 2147 D
1684 2156 D
1687 2170 D
1687 2179 D
1684 2193 D
1678 2202 D
1670 2205 D
1664 2205 D
S
N
1664 2205 M
1658 2202 D
1655 2199 D
1653 2193 D
1650 2179 D
1650 2170 D
1653 2156 D
1655 2150 D
1658 2147 D
1664 2144 D
S
N
1670 2144 M
1676 2147 D
1678 2150 D
1681 2156 D
1684 2170 D
1684 2179 D
1681 2193 D
1678 2199 D
1676 2202 D
1670 2205 D
S
N
2083 2193 M
2086 2190 D
2083 2187 D
2080 2190 D
2080 2193 D
2083 2199 D
2086 2202 D
2095 2205 D
2106 2205 D
2115 2202 D
2118 2199 D
2121 2193 D
2121 2187 D
2118 2182 D
2109 2176 D
2095 2170 D
2089 2167 D
2083 2161 D
2080 2153 D
2080 2144 D
S
N
2106 2205 M
2112 2202 D
2115 2199 D
2118 2193 D
2118 2187 D
2115 2182 D
2106 2176 D
2095 2170 D
S
N
2080 2150 M
2083 2153 D
2089 2153 D
2103 2147 D
2112 2147 D
2118 2150 D
2121 2153 D
S
N
2089 2153 M
2103 2144 D
2115 2144 D
2118 2147 D
2121 2153 D
2121 2158 D
S
N
2155 2205 M
2147 2202 D
2141 2193 D
2138 2179 D
2138 2170 D
2141 2156 D
2147 2147 D
2155 2144 D
2161 2144 D
2170 2147 D
2176 2156 D
2178 2170 D
2178 2179 D
2176 2193 D
2170 2202 D
2161 2205 D
2155 2205 D
S
N
2155 2205 M
2150 2202 D
2147 2199 D
2144 2193 D
2141 2179 D
2141 2170 D
2144 2156 D
2147 2150 D
2150 2147 D
2155 2144 D
S
N
2161 2144 M
2167 2147 D
2170 2150 D
2173 2156 D
2176 2170 D
2176 2179 D
2173 2193 D
2170 2199 D
2167 2202 D
2161 2205 D
S
N
2736 2205 M
2730 2176 D
S
N
2730 2176 M
2736 2182 D
2744 2184 D
2753 2184 D
2762 2182 D
2767 2176 D
2770 2167 D
2770 2161 D
2767 2153 D
2762 2147 D
2753 2144 D
2744 2144 D
2736 2147 D
2733 2150 D
2730 2156 D
2730 2158 D
2733 2161 D
2736 2158 D
2733 2156 D
S
N
2753 2184 M
2759 2182 D
2764 2176 D
2767 2167 D
2767 2161 D
2764 2153 D
2759 2147 D
2753 2144 D
S
N
2736 2205 M
2764 2205 D
S
N
2736 2202 M
2750 2202 D
2764 2205 D
S
N
2805 2205 M
2796 2202 D
2790 2193 D
2788 2179 D
2788 2170 D
2790 2156 D
2796 2147 D
2805 2144 D
2811 2144 D
2819 2147 D
2825 2156 D
2828 2170 D
2828 2179 D
2825 2193 D
2819 2202 D
2811 2205 D
2805 2205 D
S
N
2805 2205 M
2799 2202 D
2796 2199 D
2793 2193 D
2790 2179 D
2790 2170 D
2793 2156 D
2796 2150 D
2799 2147 D
2805 2144 D
S
N
2811 2144 M
2816 2147 D
2819 2150 D
2822 2156 D
2825 2170 D
2825 2179 D
2822 2193 D
2819 2199 D
2816 2202 D
2811 2205 D
S
N
3201 2193 M
3207 2196 D
3215 2205 D
3215 2144 D
S
N
3213 2202 M
3213 2144 D
S
N
3201 2144 M
3227 2144 D
S
N
3267 2205 M
3259 2202 D
3253 2193 D
3250 2179 D
3250 2170 D
3253 2156 D
3259 2147 D
3267 2144 D
3273 2144 D
3282 2147 D
3288 2156 D
3290 2170 D
3290 2179 D
3288 2193 D
3282 2202 D
3273 2205 D
3267 2205 D
S
N
3267 2205 M
3262 2202 D
3259 2199 D
3256 2193 D
3253 2179 D
3253 2170 D
3256 2156 D
3259 2150 D
3262 2147 D
3267 2144 D
S
N
3273 2144 M
3279 2147 D
3282 2150 D
3285 2156 D
3288 2170 D
3288 2179 D
3285 2193 D
3282 2199 D
3279 2202 D
3273 2205 D
S
N
3325 2205 M
3316 2202 D
3311 2193 D
3308 2179 D
3308 2170 D
3311 2156 D
3316 2147 D
3325 2144 D
3331 2144 D
3340 2147 D
3345 2156 D
3348 2170 D
3348 2179 D
3345 2193 D
3340 2202 D
3331 2205 D
3325 2205 D
S
N
3325 2205 M
3319 2202 D
3316 2199 D
3314 2193 D
3311 2179 D
3311 2170 D
3314 2156 D
3316 2150 D
3319 2147 D
3325 2144 D
S
N
3331 2144 M
3337 2147 D
3340 2150 D
3342 2156 D
3345 2170 D
3345 2179 D
3342 2193 D
3340 2199 D
3337 2202 D
3331 2205 D
S
N
3687 2193 M
3689 2190 D
3687 2187 D
3684 2190 D
3684 2193 D
3687 2199 D
3689 2202 D
3698 2205 D
3710 2205 D
3718 2202 D
3721 2199 D
3724 2193 D
3724 2187 D
3721 2182 D
3713 2176 D
3698 2170 D
3692 2167 D
3687 2161 D
3684 2153 D
3684 2144 D
S
N
3710 2205 M
3715 2202 D
3718 2199 D
3721 2193 D
3721 2187 D
3718 2182 D
3710 2176 D
3698 2170 D
S
N
3684 2150 M
3687 2153 D
3692 2153 D
3707 2147 D
3715 2147 D
3721 2150 D
3724 2153 D
S
N
3692 2153 M
3707 2144 D
3718 2144 D
3721 2147 D
3724 2153 D
3724 2158 D
S
N
3759 2205 M
3750 2202 D
3744 2193 D
3741 2179 D
3741 2170 D
3744 2156 D
3750 2147 D
3759 2144 D
3764 2144 D
3773 2147 D
3779 2156 D
3782 2170 D
3782 2179 D
3779 2193 D
3773 2202 D
3764 2205 D
3759 2205 D
S
N
3759 2205 M
3753 2202 D
3750 2199 D
3747 2193 D
3744 2179 D
3744 2170 D
3747 2156 D
3750 2150 D
3753 2147 D
3759 2144 D
S
N
3764 2144 M
3770 2147 D
3773 2150 D
3776 2156 D
3779 2170 D
3779 2179 D
3776 2193 D
3773 2199 D
3770 2202 D
3764 2205 D
S
N
3816 2205 M
3808 2202 D
3802 2193 D
3799 2179 D
3799 2170 D
3802 2156 D
3808 2147 D
3816 2144 D
3822 2144 D
3831 2147 D
3837 2156 D
3840 2170 D
3840 2179 D
3837 2193 D
3831 2202 D
3822 2205 D
3816 2205 D
S
N
3816 2205 M
3811 2202 D
3808 2199 D
3805 2193 D
3802 2179 D
3802 2170 D
3805 2156 D
3808 2150 D
3811 2147 D
3816 2144 D
S
N
3822 2144 M
3828 2147 D
3831 2150 D
3834 2156 D
3837 2170 D
3837 2179 D
3834 2193 D
3831 2199 D
3828 2202 D
3822 2205 D
S
N
785 2262 M
785 4685 D
S
N
785 2262 M
888 2262 D
S
N
819 2343 M
785 2343 D
S
N
785 2423 M
819 2423 D
S
N
819 2504 M
785 2504 D
S
N
785 2585 M
819 2585 D
S
N
888 2666 M
785 2666 D
S
N
785 2746 M
819 2746 D
S
N
819 2827 M
785 2827 D
S
N
785 2908 M
819 2908 D
S
N
819 2989 M
785 2989 D
S
N
785 3069 M
888 3069 D
S
N
819 3150 M
785 3150 D
S
N
785 3231 M
819 3231 D
S
N
819 3312 M
785 3312 D
S
N
785 3393 M
819 3393 D
S
N
888 3473 M
785 3473 D
S
N
785 3554 M
819 3554 D
S
N
819 3635 M
785 3635 D
S
N
785 3716 M
819 3716 D
S
N
819 3796 M
785 3796 D
S
N
785 3877 M
888 3877 D
S
N
819 3958 M
785 3958 D
S
N
785 4039 M
819 4039 D
S
N
819 4119 M
785 4119 D
S
N
785 4200 M
819 4200 D
S
N
888 4281 M
785 4281 D
S
N
785 4362 M
819 4362 D
S
N
819 4443 M
785 4443 D
S
N
785 4523 M
819 4523 D
S
N
819 4604 M
785 4604 D
S
N
785 4685 M
888 4685 D
S
N
485 2253 M
537 2253 D
S
N
574 2288 M
565 2285 D
560 2276 D
557 2262 D
557 2253 D
560 2239 D
565 2230 D
574 2227 D
580 2227 D
589 2230 D
594 2239 D
597 2253 D
597 2262 D
594 2276 D
589 2285 D
580 2288 D
574 2288 D
S
N
574 2288 M
568 2285 D
565 2282 D
563 2276 D
560 2262 D
560 2253 D
563 2239 D
565 2233 D
568 2230 D
574 2227 D
S
N
580 2227 M
586 2230 D
589 2233 D
591 2239 D
594 2253 D
594 2262 D
591 2276 D
589 2282 D
586 2285 D
580 2288 D
S
N
620 2233 M
617 2230 D
620 2227 D
623 2230 D
620 2233 D
S
N
652 2276 M
658 2279 D
667 2288 D
667 2227 D
S
N
664 2285 M
664 2227 D
S
N
652 2227 M
678 2227 D
S
N
707 2288 M
701 2259 D
S
N
701 2259 M
707 2265 D
716 2268 D
724 2268 D
733 2265 D
739 2259 D
742 2250 D
742 2244 D
739 2236 D
733 2230 D
724 2227 D
716 2227 D
707 2230 D
704 2233 D
701 2239 D
701 2242 D
704 2244 D
707 2242 D
704 2239 D
S
N
724 2268 M
730 2265 D
736 2259 D
739 2250 D
739 2244 D
736 2236 D
730 2230 D
724 2227 D
S
N
707 2288 M
736 2288 D
S
N
707 2285 M
721 2285 D
736 2288 D
S
N
485 2657 M
537 2657 D
S
N
574 2692 M
565 2689 D
560 2680 D
557 2666 D
557 2657 D
560 2643 D
565 2634 D
574 2631 D
580 2631 D
589 2634 D
594 2643 D
597 2657 D
597 2666 D
594 2680 D
589 2689 D
580 2692 D
574 2692 D
S
N
574 2692 M
568 2689 D
565 2686 D
563 2680 D
560 2666 D
560 2657 D
563 2643 D
565 2637 D
568 2634 D
574 2631 D
S
N
580 2631 M
586 2634 D
589 2637 D
591 2643 D
594 2657 D
594 2666 D
591 2680 D
589 2686 D
586 2689 D
580 2692 D
S
N
620 2637 M
617 2634 D
620 2631 D
623 2634 D
620 2637 D
S
N
652 2680 M
658 2683 D
667 2692 D
667 2631 D
S
N
664 2689 M
664 2631 D
S
N
652 2631 M
678 2631 D
S
N
718 2692 M
710 2689 D
704 2680 D
701 2666 D
701 2657 D
704 2643 D
710 2634 D
718 2631 D
724 2631 D
733 2634 D
739 2643 D
742 2657 D
742 2666 D
739 2680 D
733 2689 D
724 2692 D
718 2692 D
S
N
718 2692 M
713 2689 D
710 2686 D
707 2680 D
704 2666 D
704 2657 D
707 2643 D
710 2637 D
713 2634 D
718 2631 D
S
N
724 2631 M
730 2634 D
733 2637 D
736 2643 D
739 2657 D
739 2666 D
736 2680 D
733 2686 D
730 2689 D
724 2692 D
S
N
485 3061 M
537 3061 D
S
N
574 3095 M
565 3093 D
560 3084 D
557 3069 D
557 3061 D
560 3046 D
565 3038 D
574 3035 D
580 3035 D
589 3038 D
594 3046 D
597 3061 D
597 3069 D
594 3084 D
589 3093 D
580 3095 D
574 3095 D
S
N
574 3095 M
568 3093 D
565 3090 D
563 3084 D
560 3069 D
560 3061 D
563 3046 D
565 3041 D
568 3038 D
574 3035 D
S
N
580 3035 M
586 3038 D
589 3041 D
591 3046 D
594 3061 D
594 3069 D
591 3084 D
589 3090 D
586 3093 D
580 3095 D
S
N
620 3041 M
617 3038 D
620 3035 D
623 3038 D
620 3041 D
S
N
661 3095 M
652 3093 D
646 3084 D
643 3069 D
643 3061 D
646 3046 D
652 3038 D
661 3035 D
667 3035 D
675 3038 D
681 3046 D
684 3061 D
684 3069 D
681 3084 D
675 3093 D
667 3095 D
661 3095 D
S
N
661 3095 M
655 3093 D
652 3090 D
649 3084 D
646 3069 D
646 3061 D
649 3046 D
652 3041 D
655 3038 D
661 3035 D
S
N
667 3035 M
672 3038 D
675 3041 D
678 3046 D
681 3061 D
681 3069 D
678 3084 D
675 3090 D
672 3093 D
667 3095 D
S
N
707 3095 M
701 3067 D
S
N
701 3067 M
707 3072 D
716 3075 D
724 3075 D
733 3072 D
739 3067 D
742 3058 D
742 3052 D
739 3043 D
733 3038 D
724 3035 D
716 3035 D
707 3038 D
704 3041 D
701 3046 D
701 3049 D
704 3052 D
707 3049 D
704 3046 D
S
N
724 3075 M
730 3072 D
736 3067 D
739 3058 D
739 3052 D
736 3043 D
730 3038 D
724 3035 D
S
N
707 3095 M
736 3095 D
S
N
707 3093 M
721 3093 D
736 3095 D
S
N
574 3499 M
565 3496 D
560 3488 D
557 3473 D
557 3465 D
560 3450 D
565 3442 D
574 3439 D
580 3439 D
589 3442 D
594 3450 D
597 3465 D
597 3473 D
594 3488 D
589 3496 D
580 3499 D
574 3499 D
S
N
574 3499 M
568 3496 D
565 3494 D
563 3488 D
560 3473 D
560 3465 D
563 3450 D
565 3444 D
568 3442 D
574 3439 D
S
N
580 3439 M
586 3442 D
589 3444 D
591 3450 D
594 3465 D
594 3473 D
591 3488 D
589 3494 D
586 3496 D
580 3499 D
S
N
620 3444 M
617 3442 D
620 3439 D
623 3442 D
620 3444 D
S
N
661 3499 M
652 3496 D
646 3488 D
643 3473 D
643 3465 D
646 3450 D
652 3442 D
661 3439 D
666 3439 D
675 3442 D
681 3450 D
684 3465 D
684 3473 D
681 3488 D
675 3496 D
666 3499 D
661 3499 D
S
N
661 3499 M
655 3496 D
652 3494 D
649 3488 D
646 3473 D
646 3465 D
649 3450 D
652 3444 D
655 3442 D
661 3439 D
S
N
666 3439 M
672 3442 D
675 3444 D
678 3450 D
681 3465 D
681 3473 D
678 3488 D
675 3494 D
672 3496 D
666 3499 D
S
N
718 3499 M
710 3496 D
704 3488 D
701 3473 D
701 3465 D
704 3450 D
710 3442 D
718 3439 D
724 3439 D
733 3442 D
739 3450 D
742 3465 D
742 3473 D
739 3488 D
733 3496 D
724 3499 D
718 3499 D
S
N
718 3499 M
713 3496 D
710 3494 D
707 3488 D
704 3473 D
704 3465 D
707 3450 D
710 3444 D
713 3442 D
718 3439 D
S
N
724 3439 M
730 3442 D
733 3444 D
736 3450 D
739 3465 D
739 3473 D
736 3488 D
733 3494 D
730 3496 D
724 3499 D
S
N
574 3903 M
565 3900 D
560 3892 D
557 3877 D
557 3868 D
560 3854 D
565 3845 D
574 3843 D
580 3843 D
589 3845 D
594 3854 D
597 3868 D
597 3877 D
594 3892 D
589 3900 D
580 3903 D
574 3903 D
S
N
574 3903 M
568 3900 D
565 3897 D
563 3892 D
560 3877 D
560 3868 D
563 3854 D
565 3848 D
568 3845 D
574 3843 D
S
N
580 3843 M
586 3845 D
589 3848 D
591 3854 D
594 3868 D
594 3877 D
591 3892 D
589 3897 D
586 3900 D
580 3903 D
S
N
620 3848 M
617 3845 D
620 3843 D
623 3845 D
620 3848 D
S
N
661 3903 M
652 3900 D
646 3892 D
643 3877 D
643 3868 D
646 3854 D
652 3845 D
661 3843 D
666 3843 D
675 3845 D
681 3854 D
684 3868 D
684 3877 D
681 3892 D
675 3900 D
666 3903 D
661 3903 D
S
N
661 3903 M
655 3900 D
652 3897 D
649 3892 D
646 3877 D
646 3868 D
649 3854 D
652 3848 D
655 3845 D
661 3843 D
S
N
666 3843 M
672 3845 D
675 3848 D
678 3854 D
681 3868 D
681 3877 D
678 3892 D
675 3897 D
672 3900 D
666 3903 D
S
N
707 3903 M
701 3874 D
S
N
701 3874 M
707 3880 D
716 3883 D
724 3883 D
733 3880 D
739 3874 D
742 3866 D
742 3860 D
739 3851 D
733 3845 D
724 3843 D
716 3843 D
707 3845 D
704 3848 D
701 3854 D
701 3857 D
704 3860 D
707 3857 D
704 3854 D
S
N
724 3883 M
730 3880 D
736 3874 D
739 3866 D
739 3860 D
736 3851 D
730 3845 D
724 3843 D
S
N
707 3903 M
736 3903 D
S
N
707 3900 M
721 3900 D
736 3903 D
S
N
574 4307 M
565 4304 D
560 4295 D
557 4281 D
557 4272 D
560 4258 D
565 4249 D
574 4246 D
580 4246 D
589 4249 D
594 4258 D
597 4272 D
597 4281 D
594 4295 D
589 4304 D
580 4307 D
574 4307 D
S
N
574 4307 M
568 4304 D
565 4301 D
563 4295 D
560 4281 D
560 4272 D
563 4258 D
565 4252 D
568 4249 D
574 4246 D
S
N
580 4246 M
586 4249 D
589 4252 D
591 4258 D
594 4272 D
594 4281 D
591 4295 D
589 4301 D
586 4304 D
580 4307 D
S
N
620 4252 M
617 4249 D
620 4246 D
623 4249 D
620 4252 D
S
N
652 4295 M
658 4298 D
666 4307 D
666 4246 D
S
N
664 4304 M
664 4246 D
S
N
652 4246 M
678 4246 D
S
N
718 4307 M
710 4304 D
704 4295 D
701 4281 D
701 4272 D
704 4258 D
710 4249 D
718 4246 D
724 4246 D
733 4249 D
739 4258 D
742 4272 D
742 4281 D
739 4295 D
733 4304 D
724 4307 D
718 4307 D
S
N
718 4307 M
713 4304 D
710 4301 D
707 4295 D
704 4281 D
704 4272 D
707 4258 D
710 4252 D
713 4249 D
718 4246 D
S
N
724 4246 M
730 4249 D
733 4252 D
736 4258 D
739 4272 D
739 4281 D
736 4295 D
733 4301 D
730 4304 D
724 4307 D
S
N
574 4711 M
565 4708 D
560 4699 D
557 4685 D
557 4676 D
560 4662 D
565 4653 D
574 4650 D
580 4650 D
589 4653 D
594 4662 D
597 4676 D
597 4685 D
594 4699 D
589 4708 D
580 4711 D
574 4711 D
S
N
574 4711 M
568 4708 D
565 4705 D
563 4699 D
560 4685 D
560 4676 D
563 4662 D
565 4656 D
568 4653 D
574 4650 D
S
N
580 4650 M
586 4653 D
589 4656 D
591 4662 D
594 4676 D
594 4685 D
591 4699 D
589 4705 D
586 4708 D
580 4711 D
S
N
620 4656 M
617 4653 D
620 4650 D
623 4653 D
620 4656 D
S
N
652 4699 M
658 4702 D
666 4711 D
666 4650 D
S
N
664 4708 M
664 4650 D
S
N
652 4650 M
678 4650 D
S
N
707 4711 M
701 4682 D
S
N
701 4682 M
707 4688 D
716 4691 D
724 4691 D
733 4688 D
739 4682 D
742 4673 D
742 4668 D
739 4659 D
733 4653 D
724 4650 D
716 4650 D
707 4653 D
704 4656 D
701 4662 D
701 4665 D
704 4668 D
707 4665 D
704 4662 D
S
N
724 4691 M
730 4688 D
736 4682 D
739 4673 D
739 4668 D
736 4659 D
730 4653 D
724 4650 D
S
N
707 4711 M
736 4711 D
S
N
707 4708 M
721 4708 D
736 4711 D
S
N
3762 2262 M
3762 4685 D
S
N
3658 2262 M
3762 2262 D
S
N
3762 2343 M
3727 2343 D
S
N
3727 2423 M
3762 2423 D
S
N
3762 2504 M
3727 2504 D
S
N
3727 2585 M
3762 2585 D
S
N
3762 2666 M
3658 2666 D
S
N
3727 2746 M
3762 2746 D
S
N
3762 2827 M
3727 2827 D
S
N
3727 2908 M
3762 2908 D
S
N
3762 2989 M
3727 2989 D
S
N
3658 3069 M
3762 3069 D
S
N
3762 3150 M
3727 3150 D
S
N
3727 3231 M
3762 3231 D
S
N
3762 3312 M
3727 3312 D
S
N
3727 3393 M
3762 3393 D
S
N
3762 3473 M
3658 3473 D
S
N
3727 3554 M
3762 3554 D
S
N
3762 3635 M
3727 3635 D
S
N
3727 3716 M
3762 3716 D
S
N
3762 3796 M
3727 3796 D
S
N
3658 3877 M
3762 3877 D
S
N
3762 3958 M
3727 3958 D
S
N
3727 4039 M
3762 4039 D
S
N
3762 4119 M
3727 4119 D
S
N
3727 4200 M
3762 4200 D
S
N
3762 4281 M
3658 4281 D
S
N
3727 4362 M
3762 4362 D
S
N
3762 4443 M
3727 4443 D
S
N
3727 4523 M
3762 4523 D
S
N
3762 4604 M
3727 4604 D
S
N
3658 4685 M
3762 4685 D
S
N
785 3473 M
3762 3473 D
S
N
2355 2429 M
2355 2362 D
S
N
2358 2429 M
2358 2362 D
S
N
2396 2429 M
2396 2362 D
S
N
2399 2429 M
2399 2362 D
S
N
2345 2429 M
2367 2429 D
S
N
2386 2429 M
2409 2429 D
S
N
2358 2397 M
2396 2397 D
S
N
2345 2362 M
2367 2362 D
S
N
2386 2362 M
2409 2362 D
S
N
2462 2407 M
2462 2340 D
S
N
2466 2407 M
2466 2340 D
S
N
2462 2397 M
2456 2403 D
2450 2407 D
2443 2407 D
2434 2403 D
2428 2397 D
2424 2388 D
2424 2381 D
2428 2372 D
2434 2365 D
2443 2362 D
2450 2362 D
2456 2365 D
2462 2372 D
S
N
2443 2407 M
2437 2403 D
2431 2397 D
2428 2388 D
2428 2381 D
2431 2372 D
2437 2365 D
2443 2362 D
S
N
2453 2340 M
2475 2340 D
S
N
2507 2429 M
2507 2362 D
S
N
2510 2429 M
2510 2362 D
S
N
2488 2429 M
2485 2410 D
2485 2429 D
2532 2429 D
2532 2410 D
2529 2429 D
S
N
2497 2362 M
2520 2362 D
S
N
2551 2416 M
2554 2413 D
2551 2410 D
2548 2413 D
2548 2416 D
2551 2422 D
2554 2426 D
2564 2429 D
2577 2429 D
2586 2426 D
2589 2422 D
2592 2416 D
2592 2410 D
2589 2403 D
2580 2397 D
2564 2391 D
2558 2388 D
2551 2381 D
2548 2372 D
2548 2362 D
S
N
2577 2429 M
2583 2426 D
2586 2422 D
2589 2416 D
2589 2410 D
2586 2403 D
2577 2397 D
2564 2391 D
S
N
2548 2369 M
2551 2372 D
2558 2372 D
2573 2365 D
2583 2365 D
2589 2369 D
2592 2372 D
S
N
2558 2372 M
2573 2362 D
2586 2362 D
2589 2365 D
2592 2372 D
2592 2378 D
S
N
2618 2369 M
2615 2365 D
2618 2362 D
2621 2365 D
2618 2369 D
S
N
2662 2429 M
2653 2426 D
2646 2416 D
2643 2400 D
2643 2391 D
2646 2375 D
2653 2365 D
2662 2362 D
2668 2362 D
2678 2365 D
2684 2375 D
2687 2391 D
2687 2400 D
2684 2416 D
2678 2426 D
2668 2429 D
2662 2429 D
S
N
2662 2429 M
2656 2426 D
2653 2422 D
2649 2416 D
2646 2400 D
2646 2391 D
2649 2375 D
2653 2369 D
2656 2365 D
2662 2362 D
S
N
2668 2362 M
2675 2365 D
2678 2369 D
2681 2375 D
2684 2391 D
2684 2400 D
2681 2416 D
2678 2422 D
2675 2426 D
2668 2429 D
S
showpage
%%Trailer
%%Pages: 1
%%BoundingBox: 54 236 464 568
