%!PS-Adobe-2.0 EPSF-2.0
%%BoundingBox:  0 0 567 384
%%Title: DeltaGluGlu-NotCompletelyDegenerate-zoom.eps: Delta in percent
%%Creator: ROOT Version 5.24/00
%%CreationDate: Thu Oct  6 14:29:14 2011
%%EndComments
%%BeginProlog
80 dict begin
/s {stroke} def /l {lineto} def /m {moveto} def /t {translate} def
/sw {stringwidth} def /r {rotate} def /rl {roll}  def /R {repeat} def
/d {rlineto} def /rm {rmoveto} def /gr {grestore} def /f {eofill} def
/c {setrgbcolor} def /black {0 setgray} def /sd {setdash} def
/cl {closepath} def /sf {scalefont setfont} def /lw {setlinewidth} def
/box {m dup 0 exch d exch 0 d 0 exch neg d cl} def
/NC{systemdict begin initclip end}def/C{NC box clip newpath}def
/bl {box s} def /bf {box f} def /Y { 0 exch d} def /X { 0 d} def 
/mp {newpath /y exch def /x exch def} def
/side {[w .77 mul w .23 mul] .385 w mul sd w 0 l currentpoint t -144 r} def
/mr {mp x y w2 0 360 arc} def /m24 {mr s} def /m20 {mr f} def
/mb {mp x y w2 add m w2 neg 0 d 0 w neg d w 0 d 0 w d cl} def
/mt {mp x y w2 add m w2 neg w neg d w 0 d cl} def
/m21 {mb f} def /m25 {mb s} def /m22 {mt f} def /m26{mt s} def
/m23 {mp x y w2 sub m w2 w d w neg 0 d cl f} def
/m27 {mp x y w2 add m w3 neg w2 neg d w3 w2 neg d w3 w2 d cl s} def
/m28 {mp x w2 sub y w2 sub w3 add m w3 0 d  0 w3 neg d w3 0 d 0 w3 d w3 0 d  0 w3 d w3 neg 0 d 0 w3 d w3 neg 0 d
 0 w3 neg d w3 neg 0 d cl s } def
/m29 {mp gsave x w2 sub y w2 add w3 sub m currentpoint t
 4 {side} repeat cl fill gr} def
/m30 {mp gsave x w2 sub y w2 add w3 sub m currentpoint t
 4 {side} repeat cl s gr} def
/m31 {mp x y w2 sub m 0 w d x w2 sub y m w 0 d x w2 sub y w2 add m w w neg d x w2 sub y w2
 sub m w w d s} def
/m2 {mp x y w2 sub m 0 w d x w2 sub y m w 0 d s} def
/m5 {mp x w2 sub y w2 sub m w w d x w2 sub y w2 add m w w neg d s} def
/reEncode {exch findfont dup length dict begin {1 index /FID eq  {pop pop} {def} ifelse } forall /Encoding exch def currentdict end dup /FontName get exch definefont pop } def [/Times-Bold /Times-Italic /Times-BoldItalic /Helvetica
 /Helvetica-Oblique /Helvetica-Bold /Helvetica-BoldOblique /Courier /Courier-Oblique /Courier-Bold /Courier-BoldOblique /Times-Roman /AvantGarde-Book /AvantGarde-BookOblique /AvantGarde-Demi /AvantGarde-DemiOblique /Bookman-Demi
 /Bookman-DemiItalic /Bookman-Light /Bookman-LightItalic /Helvetica-Narrow /Helvetica-Narrow-Bold /Helvetica-Narrow-BoldOblique /Helvetica-Narrow-Oblique /NewCenturySchlbk-Roman /NewCenturySchlbk-Bold
 /NewCenturySchlbk-BoldItalic /NewCenturySchlbk-Italic /Palatino-Bold /Palatino-BoldItalic /Palatino-Italic /Palatino-Roman ] {ISOLatin1Encoding reEncode } forall
/oshow {gsave [] 0 sd true charpath stroke gr} def
/stwn { /fs exch def /fn exch def /text exch def fn findfont fs sf
 text sw pop xs add /xs exch def} def
/stwb { /fs exch def /fn exch def /nbas exch def /textf exch deftextf length /tlen exch def nbas tlen gt {/nbas tlendef} iffn findfont fs sf textf dup length nbas sub nbas getinterval sw
pop neg xs add /xs exch def} def
%%EndProlog
%%BeginSetup
%%EndSetup
newpath  gsave  .25 .25 scale  gsave  0 0 t black[  ] 0 sd 3 lw 1 1 1 c 2268 1538 0 0 bf 0 0 m 8 8 d 1522 Y 2252 X 8 8 d -2268 X -1538 Y f 0 0 m 8 8 d 2252 X 1522 Y 8 8 d -1538 Y -2268 X f black 1 1 1 c 2268 1538 0 0 bf 0 0 m 8 8 d 1522 Y 2252 X 8 8
 d -2268 X -1538 Y f 0 0 m 8 8 d 2252 X 1522 Y 8 8 d -1538 Y -2268 X f black 1 1 1 c 1814 1230 227 154 bf black 1814 1230 227 154 bl 1 1 1 c 1814 1230 227 154 bf black 1814 1230 227 154 bl 227 154 m 1814 X s
 gsave  2268 1538 0 0 C 1065 20 t 0 r /Courier findfont 58.6478 sf 0 0 m ( [GeV]) show NC gr 
 gsave  2268 1538 0 0 C 1043 3 t 0 r /Courier findfont 39.0986 sf 0 0 m (H) show NC gr 
 gsave  2268 1538 0 0 C 1007 20 t 0 r /Courier findfont 58.6478 sf 0 0 m (M) show NC gr  227 191 m -37 Y s 267 172 m -18 Y s 307 172 m -18 Y s 348 172 m -18 Y s 388 172 m -18 Y s 428 191 m -37 Y s 469 172 m -18 Y s 509 172 m -18 Y s 549 172 m -18 Y
 s 590 172 m -18 Y s 630 191 m -37 Y s 670 172 m -18 Y s 711 172 m -18 Y s 751 172 m -18 Y s 791 172 m -18 Y s 831 191 m -37 Y s 872 172 m -18 Y s 912 172 m -18 Y s 952 172 m -18 Y s 993 172 m -18 Y s 1033 191 m -37 Y s 1073 172 m -18 Y s 1114 172 m
 -18 Y s 1154 172 m -18 Y s 1194 172 m -18 Y s 1235 191 m -37 Y s 1275 172 m -18 Y s 1315 172 m -18 Y s 1356 172 m -18 Y s 1396 172 m -18 Y s 1436 191 m -37 Y s 1477 172 m -18 Y s 1517 172 m -18 Y s 1557 172 m -18 Y s 1597 172 m -18 Y s 1638 191 m
 -37 Y s 1678 172 m -18 Y s 1718 172 m -18 Y s 1759 172 m -18 Y s 1799 172 m -18 Y s 1839 191 m -37 Y s 1880 172 m -18 Y s 1920 172 m -18 Y s 1960 172 m -18 Y s 2001 172 m -18 Y s 2041 191 m -37 Y s
 gsave  2268 1538 0 0 C 173 75 t 0 r /Courier findfont 58.6478 sf 0 0 m (100) show NC gr 
 gsave  2268 1538 0 0 C 375 75 t 0 r /Courier findfont 58.6478 sf 0 0 m (200) show NC gr 
 gsave  2268 1538 0 0 C 577 75 t 0 r /Courier findfont 58.6478 sf 0 0 m (300) show NC gr 
 gsave  2268 1538 0 0 C 779 75 t 0 r /Courier findfont 58.6478 sf 0 0 m (400) show NC gr 
 gsave  2268 1538 0 0 C 981 75 t 0 r /Courier findfont 58.6478 sf 0 0 m (500) show NC gr 
 gsave  2268 1538 0 0 C 1179 75 t 0 r /Courier findfont 58.6478 sf 0 0 m (600) show NC gr 
 gsave  2268 1538 0 0 C 1381 75 t 0 r /Courier findfont 58.6478 sf 0 0 m (700) show NC gr 
 gsave  2268 1538 0 0 C 1583 75 t 0 r /Courier findfont 58.6478 sf 0 0 m (800) show NC gr 
 gsave  2268 1538 0 0 C 1786 75 t 0 r /Courier findfont 58.6478 sf 0 0 m (900) show NC gr 
 gsave  2268 1538 0 0 C 1971 75 t 0 r /Courier findfont 58.6478 sf 0 0 m (1000) show NC gr  227 154 m 1230 Y s
 gsave  2268 1538 0 0 C 62 746 t 90 r /Courier findfont 58.6478 sf 0 0 m ( [%]) show NC gr 
 gsave  2268 1538 0 0 C 78 697 t 90 r /Courier findfont 39.0986 sf 0 0 m (EW) show NC gr 
 gsave  2268 1538 0 0 C 36 697 t 90 r /Courier findfont 39.0986 sf 0 0 m (4) show NC gr 
 gsave  2268 1538 0 0 C 62 668 t 90 r /Symbol findfont 58.6478 sf 0 0 m (d) show NC gr  281 154 m -54 X s 254 181 m -27 X s 254 208 m -27 X s 254 236 m -27 X s 254 263 m -27 X s 281 290 m -54 X s 254 318 m -27 X s 254 345 m -27 X s 254 373 m -27 X s
 254 400 m -27 X s 281 427 m -54 X s 254 455 m -27 X s 254 482 m -27 X s 254 509 m -27 X s 254 537 m -27 X s 281 564 m -54 X s 254 591 m -27 X s 254 619 m -27 X s 254 646 m -27 X s 254 673 m -27 X s 281 701 m -54 X s 254 728 m -27 X s 254 755 m -27
 X s 254 783 m -27 X s 254 810 m -27 X s 281 837 m -54 X s 254 865 m -27 X s 254 892 m -27 X s 254 919 m -27 X s 254 947 m -27 X s 281 974 m -54 X s 254 1001 m -27 X s 254 1029 m -27 X s 254 1056 m -27 X s 254 1083 m -27 X s 281 1111 m -54 X s 254
 1138 m -27 X s 254 1165 m -27 X s 254 1193 m -27 X s 254 1220 m -27 X s 281 1247 m -54 X s 254 1275 m -27 X s 254 1302 m -27 X s 254 1329 m -27 X s 254 1357 m -27 X s 281 1384 m -54 X s
 gsave  2268 1538 0 0 C 114 137 t 0 r /Courier findfont 58.6478 sf 0 0 m (\25570) show NC gr 
 gsave  2268 1538 0 0 C 114 274 t 0 r /Courier findfont 58.6478 sf 0 0 m (\25560) show NC gr 
 gsave  2268 1538 0 0 C 114 411 t 0 r /Courier findfont 58.6478 sf 0 0 m (\25550) show NC gr 
 gsave  2268 1538 0 0 C 114 547 t 0 r /Courier findfont 58.6478 sf 0 0 m (\25540) show NC gr 
 gsave  2268 1538 0 0 C 114 684 t 0 r /Courier findfont 58.6478 sf 0 0 m (\25530) show NC gr 
 gsave  2268 1538 0 0 C 114 818 t 0 r /Courier findfont 58.6478 sf 0 0 m (\25520) show NC gr 
 gsave  2268 1538 0 0 C 114 955 t 0 r /Courier findfont 58.6478 sf 0 0 m (\25510) show NC gr 
 gsave  2268 1538 0 0 C 186 1092 t 0 r /Courier findfont 58.6478 sf 0 0 m (0) show NC gr 
 gsave  2268 1538 0 0 C 150 1228 t 0 r /Courier findfont 58.6478 sf 0 0 m (10) show NC gr 
 gsave  2268 1538 0 0 C 150 1365 t 0 r /Courier findfont 58.6478 sf 0 0 m (20) show NC gr [ 10 20] 0 sd 0 lw 349 154 m 1230 Y s 393 154 m 1230 Y s 721 154 m 1230 Y s
 gsave  2268 1538 0 0 C 283 1352 t 0 r /Helvetica-Bold findfont 29.3239 sf 0 0 m (WW) show NC gr 
 gsave  2268 1538 0 0 C 404 1352 t 0 r /Helvetica-Bold findfont 29.3239 sf 0 0 m (ZZ) show NC gr 
 gsave  2268 1538 0 0 C 730 1352 t 0 r /Helvetica-Bold findfont 29.3239 sf 0 0 m (tt) show NC gr  1 0 0 c[  ] 0 sd 3 lw black 1 0 0 c 227 1279 m 20 -1 d 20 -2 d 20 -2 d 20 -2 d 10 -2 d 11 -4 d 2 X 2 -1 d 2 -1 d 2 -2 d 2 -1 d 2 -2 d 2 -2 d 2 -3 d 2
 -3 d 2 -2 d 2 X 2 1 d 2 1 d 2 -1 d 2 -1 d 2 -1 d 2 -2 d 2 -1 d 2 -1 d 2 -2 d 2 -1 d 2 -1 d 2 -2 d 2 -1 d 2 -1 d 2 -2 d 2 -2 d 2 -1 d 2 -2 d 2 -2 d 2 -2 d 2 -1 d 4 X 2 1 d 2 -1 d 2 -1 d 2 -1 d 2 X 2 -1 d 10 -4 d 10 -4 d 21 -6 d 20 -4 d 20 -5 d 20 -4
 d 20 -4 d 20 -3 d 20 -4 d 21 -3 d 20 -4 d 20 -3 d 20 -3 d 20 -3 d 10 -2 d 10 -2 d 10 -2 d 2 X 3 -1 d 2 -1 d 2 -1 d 2 -1 d 2 -1 d 2 -1 d 2 -1 d 2 -2 d 2 -8 d 2 -1 d 2 -1 d 2 1 d 2 1 d 2 2 d 2 1 d 4 1 d 4 1 d 10 3 d 10 4 d 10 1 d 10 1 d 10 2 d 10 -1
 d 10 -1 d 20 -3 d 21 -3 d 20 -5 d 20 -6 d 20 -7 d 20 -8 d 20 -9 d 21 -9 d 20 -12 d 20 -9 d 20 -11 d 101 -65 d 101 -74 d 100 -80 d 101 -87 d 101 -86 d 101 -90 d 101 -89 d 100 -88 d 101 -93 d 101 -91 d s /w 0 def /w2 {w 2 div} def /w3 {w 3 div} def
 227 1279 247 1278 267 1276 287 1274 307 1272 317 1270 328 1266 330 1266 332 1265 334 1264 336 1262 338 1261 340 1259 342 1257 344 1254 346 1251 348 1249 350 1249 352 1250 354 1251 356 1250 358 1249 360 1248 362 1246 364 1245 366 1244 368 1242 370
 1241 372 1240 374 1238 376 1237 378 1236 380 1234 382 1232 384 1231 386 1229 388 1227 390 1225 392 1224 394 1224 396 1224 398 1225 400 1224 402 1223 404 1222 406 1222 408 1221 418 1217 428 1213 449 1207 469 1203 489 1198 509 1194 529 1190 549 1187
 569 1183 590 1180 610 1176 630 1173 650 1170 670 1167 680 1165 690 1163 700 1161 702 1161 705 1160 707 1159 709 1158 711 1157 713 1156 715 1155 717 1154 719 1152 721 1144 723 1143 725 1142 727 1143 729 1144 731 1146 733 1147 737 1148 741 1149 751
 1152 761 1156 771 1157 781 1158 791 1160 801 1159 811 1158 831 1155 852 1152 872 1147 892 1141 912 1134 932 1126 952 1117 973 1108 993 1096 1013 1087 1033 1076 100 { m20} R 1134 1011 1235 937 1335 857 1436 770 1537 684 1638 594 1739 505 1839 417
 1940 324 2041 233 10 { m20} R black 1 1 1 c 998 662 249 261 bf 249 261 m 8 8 d 646 Y 982 X 8 8 d -998 X -662 Y f 249 261 m 8 8 d 982 X 646 Y 8 8 d -662 Y -998 X f black 1 1 1 c 798 602 349 321 bf black 798 602 349 321 bl 1 1 1 c 798 602 349 321 bf
 black 798 602 349 321 bl 349 321 m 798 X s 349 337 m -16 Y s 615 337 m -16 Y s 881 337 m -16 Y s 1147 337 m -16 Y s
 gsave  998 662 249 261 C 310 270 t 0 r /Courier findfont 45.8318 sf 0 0 m (100) show NC gr 
 gsave  998 662 249 261 C 573 270 t 0 r /Courier findfont 45.8318 sf 0 0 m (200) show NC gr 
 gsave  998 662 249 261 C 841 270 t 0 r /Courier findfont 45.8318 sf 0 0 m (300) show NC gr 
 gsave  998 662 249 261 C 1108 270 t 0 r /Courier findfont 45.8318 sf 0 0 m (400) show NC gr  349 321 m 602 Y s 376 373 m -27 X s 363 399 m -14 X s 363 426 m -14 X s 363 452 m -14 X s 376 478 m -27 X s 363 504 m -14 X s 363 530 m -14 X s 363 556 m
 -14 X s 376 583 m -27 X s 363 609 m -14 X s 363 635 m -14 X s 363 661 m -14 X s 376 687 m -27 X s 363 713 m -14 X s 363 740 m -14 X s 363 766 m -14 X s 376 792 m -27 X s 363 818 m -14 X s 363 844 m -14 X s 363 870 m -14 X s 376 897 m -27 X s 376
 373 m -27 X s 363 347 m -14 X s 363 321 m -14 X s 376 897 m -27 X s
 gsave  998 662 249 261 C 316 355 t 0 r /Courier findfont 49.1055 sf 0 0 m (2) show NC gr 
 gsave  998 662 249 261 C 316 459 t 0 r /Courier findfont 49.1055 sf 0 0 m (4) show NC gr 
 gsave  998 662 249 261 C 316 567 t 0 r /Courier findfont 49.1055 sf 0 0 m (6) show NC gr 
 gsave  998 662 249 261 C 316 671 t 0 r /Courier findfont 49.1055 sf 0 0 m (8) show NC gr 
 gsave  998 662 249 261 C 287 779 t 0 r /Courier findfont 49.1055 sf 0 0 m (10) show NC gr 
 gsave  998 662 249 261 C 287 880 t 0 r /Courier findfont 49.1055 sf 0 0 m (12) show NC gr  1 0 0 c black 1 0 0 c 349 911 m 27 -3 d 26 -5 d 27 -7 d 27 -11 d 13 -8 d 13 -12 d 3 -3 d 3 -4 d 2 -4 d 3 -5 d 3 -5 d 2 -7 d 3 -8 d 3 -10 d 2 -12 d 3 -9 d 3
 -1 d 2 6 d 3 1 d 3 -2 d 2 -4 d 3 -5 d 3 -5 d 2 -5 d 3 -5 d 2 -5 d 3 -6 d 3 -5 d 2 -5 d 3 -5 d 3 -5 d 2 -6 d 3 -6 d 3 -7 d 2 -7 d 3 -8 d 3 -7 d 2 -4 d 3 X 3 2 d 2 1 d 3 -2 d 3 -3 d 2 -4 d 3 -3 d 3 -3 d 13 -15 d 13 -16 d 27 -22 d 27 -17 d 26 -17 d 27
 -17 d 26 -13 d 27 -11 d 27 -17 d 26 -13 d 27 -12 d 26 -14 d 27 -10 d 27 -12 d 13 -7 d 13 -7 d 14 -8 d 2 -2 d 3 -4 d 2 -2 d 3 -4 d 3 -3 d 2 -5 d 3 -5 d 3 -3 d 2 -6 d 3 -31 d 3 -5 d 2 -2 d 3 2 d 3 6 d 2 5 d 3 3 d 5 5 d 6 6 d 13 11 d 13 13 d 14 6 d 13
 4 d 13 5 d 14 -3 d 13 -3 d 26 -11 d s 349 911 376 908 402 903 429 896 456 885 469 877 482 865 485 862 488 858 490 854 493 849 496 844 498 837 501 829 504 819 506 807 509 798 512 797 514 803 517 804 520 802 522 798 525 793 528 788 530 783 533 778
 535 773 538 767 541 762 543 757 546 752 549 747 551 741 554 735 557 728 559 721 562 713 565 706 567 702 570 702 573 704 575 705 578 703 581 700 583 696 586 693 589 690 602 675 615 659 642 637 669 620 695 603 722 586 748 573 775 562 802 545 828 532
 855 520 881 506 908 496 935 484 948 477 961 470 975 462 977 460 980 456 982 454 985 450 988 447 990 442 993 437 996 434 998 428 1001 397 1004 392 1006 390 1009 392 1012 398 1014 403 1017 406 1022 411 1028 417 1041 428 1054 441 1068 447 1081 451
 1094 456 1108 453 1121 450 1147 439 90 { m20} R black[ 10 20] 0 sd 0 lw 511 321 m 602 Y s 568 321 m 602 Y s 1001 321 m 602 Y s
 gr  gr 
showpage
end
%%EOF
