%!PS-Adobe-2.0 EPSF-2.0
%%BoundingBox:  0 0 567 539
%%Title: output/Hqt_Powheg_ratio_m120.eps: c3
%%Creator: ROOT Version 5.28/00a
%%CreationDate: Sat Jan  7 17:38:39 2012
%%EndComments
%%BeginProlog
80 dict begin
/s {stroke} def /l {lineto} def /m {moveto} def /t {translate} def
/r {rotate} def /rl {roll}  def /R {repeat} def
/d {rlineto} def /rm {rmoveto} def /gr {grestore} def /f {eofill} def
/c {setrgbcolor} def /black {0 setgray} def /sd {setdash} def
/cl {closepath} def /sf {scalefont setfont} def /lw {setlinewidth} def
/box {m dup 0 exch d exch 0 d 0 exch neg d cl} def
/NC{systemdict begin initclip end}def/C{NC box clip newpath}def
/bl {box s} def /bf {box f} def /Y { 0 exch d} def /X { 0 d} def 
/K {{pop pop 0 moveto} exch kshow} bind def
/ita {/ang 15 def gsave [1 0 ang dup sin exch cos div 1 0 0] concat} def 
/mp {newpath /y exch def /x exch def} def
/side {[w .77 mul w .23 mul] .385 w mul sd w 0 l currentpoint t -144 r} def
/mr {mp x y w2 0 360 arc} def /m24 {mr s} def /m20 {mr f} def
/mb {mp x y w2 add m w2 neg 0 d 0 w neg d w 0 d 0 w d cl} def
/mt {mp x y w2 add m w2 neg w neg d w 0 d cl} def
/m21 {mb f} def /m25 {mb s} def /m22 {mt f} def /m26{mt s} def
/m23 {mp x y w2 sub m w2 w d w neg 0 d cl f} def
/m27 {mp x y w2 add m w3 neg w2 neg d w3 w2 neg d w3 w2 d cl s} def
/m28 {mp x w2 sub y w2 sub w3 add m w3 0 d  0 w3 neg d w3 0 d 0 w3 d w3 0 d  0 w3 d w3 neg 0 d 0 w3 d w3 neg 0 d 0 w3 neg d w3 neg 0 d cl s } def
/m29 {mp gsave x w2 sub y w2 add w3 sub m currentpoint t 4 {side} repeat cl fill gr} def
/m30 {mp gsave x w2 sub y w2 add w3 sub m currentpoint t 4 {side} repeat cl s gr} def
/m31 {mp x y w2 sub m 0 w d x w2 sub y m w 0 d x w2 sub y w2 add m w w neg d x w2 sub y w2 sub m w w d s} def
/m32 {mp x y w2 sub m w2 w d w neg 0 d cl s} def
/m33 {mp x y w2 add m w3 neg w2 neg d w3 w2 neg d w3 w2 d cl f} def
/m34 {mp x w2 sub y w2 sub w3 add m w3 0 d  0 w3 neg d w3 0 d 0 w3 d w3 0 d  0 w3 d w3 neg 0 d 0 w3 d w3 neg 0 d 0 w3 neg d w3 neg 0 d cl f } def
/m2 {mp x y w2 sub m 0 w d x w2 sub y m w 0 d s} def
/m5 {mp x w2 sub y w2 sub m w w d x w2 sub y w2 add m w w neg d s} def
/reEncode {exch findfont dup length dict begin {1 index /FID eq  {pop pop} {def} ifelse } forall /Encoding exch def currentdict end dup /FontName get exch definefont pop } def [/Times-Bold /Times-Italic /Times-BoldItalic /Helvetica /Helvetica-Oblique
 /Helvetica-Bold /Helvetica-BoldOblique /Courier /Courier-Oblique /Courier-Bold /Courier-BoldOblique /Times-Roman /AvantGarde-Book /AvantGarde-BookOblique /AvantGarde-Demi /AvantGarde-DemiOblique /Bookman-Demi /Bookman-DemiItalic /Bookman-Light
 /Bookman-LightItalic /Helvetica-Narrow /Helvetica-Narrow-Bold /Helvetica-Narrow-BoldOblique /Helvetica-Narrow-Oblique /NewCenturySchlbk-Roman /NewCenturySchlbk-Bold /NewCenturySchlbk-BoldItalic /NewCenturySchlbk-Italic /Palatino-Bold
 /Palatino-BoldItalic /Palatino-Italic /Palatino-Roman ] {ISOLatin1Encoding reEncode } forall%%EndProlog
%%BeginSetup
%%EndSetup
newpath  gsave  .25 .25 scale  gsave  0 0 t black[  ] 0 sd 3 lw 1 1 1 c 2268 2158 0 0 bf black 1 1 1 c 1791 1705 363 345 bf black 1791 1705 363 345 bl 1 0 0 c 9 lw 1 1 1 c 0 0 1 c 1 0 0 c 377 1845 m 8 Y s 377 1889 m 9 Y s 3 lw 0 0 1 c /w 44 def /w2
 {w 2 div} def /w3 {w 3 div} def 377 1871 m20 9 lw 3 lw 405 1738 m20 9 lw 3 lw 434 1614 m20 9 lw 3 lw 462 1575 m20 9 lw 3 lw 491 1526 m20 9 lw 3 lw 519 1516 m20 9 lw 3 lw 548 1454 m20 9 lw 3 lw 576 1438 m20 9 lw 3 lw 605 1416 m20 9 lw 3 lw 633 1351
 m20 9 lw 3 lw 661 1340 m20 9 lw 3 lw 690 1296 m20 9 lw 3 lw 718 1284 m20 9 lw 3 lw 747 1254 m20 9 lw 3 lw 775 1214 m20 9 lw 1 0 0 c 804 1176 m 1 Y s 804 1213 m 1 Y s 3 lw 0 0 1 c 804 1195 m20 9 lw 1 0 0 c 832 1144 m 1 Y s 832 1182 m 1 Y s 3 lw 0 0 1
 c 832 1163 m20 9 lw 1 0 0 c 860 1137 m 2 Y s 860 1175 m 2 Y s 3 lw 0 0 1 c 860 1157 m20 9 lw 1 0 0 c 889 1168 m 5 Y s 889 1210 m 4 Y s 3 lw 0 0 1 c 889 1191 m20 9 lw 1 0 0 c 917 1070 m 2 Y s 917 1109 m 2 Y s 3 lw 0 0 1 c 917 1090 m20 9 lw 1 0 0 c
 946 1075 m 4 Y s 946 1115 m 4 Y s 3 lw 0 0 1 c 946 1097 m20 9 lw 1 0 0 c 974 1089 m 6 Y s 974 1132 m 6 Y s 3 lw 0 0 1 c 974 1114 m20 9 lw 1 0 0 c 1003 1049 m 6 Y s 1003 1091 m 6 Y s 3 lw 0 0 1 c 1003 1073 m20 9 lw 1 0 0 c 1031 1017 m 5 Y s 1031 1059
 m 5 Y s 3 lw 0 0 1 c 1031 1040 m20 9 lw 1 0 0 c 1060 996 m 5 Y s 1060 1038 m 6 Y s 3 lw 0 0 1 c 1060 1020 m20 9 lw 1 0 0 c 1088 989 m 7 Y s 1088 1033 m 6 Y s 3 lw 0 0 1 c 1088 1014 m20 9 lw 1 0 0 c 1116 1017 m 10 Y s 1116 1064 m 10 Y s 3 lw 0 0 1 c
 1116 1046 m20 9 lw 1 0 0 c 1145 968 m 9 Y s 1145 1013 m 9 Y s 3 lw 0 0 1 c 1145 995 m20 9 lw 1 0 0 c 1173 916 m 6 Y s 1173 959 m 6 Y s 3 lw 0 0 1 c 1173 940 m20 9 lw 1 0 0 c 1202 983 m 13 Y s 1202 1032 m 13 Y s 3 lw 0 0 1 c 1202 1014 m20 9 lw 1 0 0
 c 1230 970 m 13 Y s 1230 1020 m 13 Y s 3 lw 0 0 1 c 1230 1002 m20 9 lw 1 0 0 c 1259 927 m 12 Y s 1259 975 m 12 Y s 3 lw 0 0 1 c 1259 957 m20 9 lw 1 0 0 c 1287 947 m 14 Y s 1287 998 m 14 Y s 3 lw 0 0 1 c 1287 980 m20 9 lw 1 0 0 c 1315 975 m 18 Y s
 1315 1030 m 18 Y s 3 lw 0 0 1 c 1315 1012 m20 9 lw 1 0 0 c 1344 965 m 19 Y s 1344 1021 m 19 Y s 3 lw 0 0 1 c 1344 1003 m20 9 lw 1 0 0 c 1372 916 m 16 Y s 1372 969 m 16 Y s 3 lw 0 0 1 c 1372 951 m20 9 lw 1 0 0 c 1401 915 m 18 Y s 1401 970 m 18 Y s 3
 lw 0 0 1 c 1401 952 m20 9 lw 1 0 0 c 1429 943 m 23 Y s 1429 1002 m 23 Y s 3 lw 0 0 1 c 1429 984 m20 9 lw 1 0 0 c 1458 914 m 21 Y s 1458 972 m 22 Y s 3 lw 0 0 1 c 1458 954 m20 9 lw 1 0 0 c 1486 895 m 21 Y s 1486 952 m 21 Y s 3 lw 0 0 1 c 1486 934 m20
 9 lw 1 0 0 c 1515 900 m 24 Y s 1515 961 m 23 Y s 3 lw 0 0 1 c 1515 942 m20 9 lw 1 0 0 c 1543 900 m 26 Y s 1543 962 m 26 Y s 3 lw 0 0 1 c 1543 944 m20 9 lw 1 0 0 c 1571 914 m 30 Y s 1571 980 m 29 Y s 3 lw 0 0 1 c 1571 962 m20 9 lw 1 0 0 c 1600 863 m
 25 Y s 1600 924 m 25 Y s 3 lw 0 0 1 c 1600 906 m20 9 lw 1 0 0 c 1628 869 m 28 Y s 1628 933 m 28 Y s 3 lw 0 0 1 c 1628 915 m20 9 lw 1 0 0 c 1657 884 m 32 Y s 1657 952 m 32 Y s 3 lw 0 0 1 c 1657 934 m20 9 lw 1 0 0 c 1685 925 m 40 Y s 1685 1001 m 40 Y
 s 3 lw 0 0 1 c 1685 983 m20 9 lw 1 0 0 c 1714 906 m 39 Y s 1714 982 m 39 Y s 3 lw 0 0 1 c 1714 964 m20 9 lw 1 0 0 c 1742 875 m 37 Y s 1742 949 m 36 Y s 3 lw 0 0 1 c 1742 930 m20 9 lw 1 0 0 c 1770 921 m 47 Y s 1770 1004 m 48 Y s 3 lw 0 0 1 c 1770 986
 m20 9 lw 1 0 0 c 1799 960 m 57 Y s 1799 1054 m 57 Y s 3 lw 0 0 1 c 1799 1036 m20 9 lw 1 0 0 c 1827 826 m 35 Y s 1827 898 m 35 Y s 3 lw 0 0 1 c 1827 879 m20 9 lw 1 0 0 c 1856 830 m 39 Y s 1856 905 m 38 Y s 3 lw 0 0 1 c 1856 887 m20 9 lw 1 0 0 c 1884
 963 m 69 Y s 1884 1068 m 69 Y s 3 lw 0 0 1 c 1884 1050 m20 9 lw 1 0 0 c 1913 957 m 71 Y s 1913 1064 m 71 Y s 3 lw 0 0 1 c 1913 1046 m20 9 lw 1 0 0 c 1941 953 m 74 Y s 1941 1064 m 73 Y s 3 lw 0 0 1 c 1941 1045 m20 9 lw 1 0 0 c 1969 857 m 54 Y s 1969
 948 m 54 Y s 3 lw 0 0 1 c 1969 930 m20 9 lw 1 0 0 c 1998 945 m 79 Y s 1998 1061 m 79 Y s 3 lw 0 0 1 c 1998 1042 m20 9 lw 1 0 0 c 2026 814 m 50 Y s 2026 901 m 49 Y s 3 lw 0 0 1 c 2026 882 m20 9 lw 1 0 0 c 2055 836 m 58 Y s 2055 931 m 58 Y s 3 lw 0 0
 1 c 2055 913 m20 9 lw 1 0 0 c 2083 821 m 58 Y s 2083 916 m 57 Y s 3 lw 0 0 1 c 2083 897 m20 9 lw 1 0 0 c 2112 800 m 55 Y s 2112 891 m 55 Y s 3 lw 0 0 1 c 2112 873 m20 9 lw 1 0 0 c 2140 876 m 80 Y s 2140 992 m 80 Y s 3 lw 0 0 1 c 2140 974 m20 9 lw
 black 3 lw 363 345 m 1791 X s
 gsave  2268 2158 0 0 C 1860.94 127.812 t 0 r /Helvetica findfont 100.584 sf 0 0 m ( \(GeV\)) show NC gr 
 gsave  2268 2158 0 0 C 1819.81 72.9375 t 0 r /Helvetica findfont 68.5801 sf 0 0 m (T) show NC gr 
 gsave  2268 2158 0 0 C 1467.75 127.812 t 0 r /Helvetica findfont 100.584 sf 0 0 m (Higgs P) show NC gr  363 396 m -51 Y s 434 371 m -26 Y s 505 371 m -26 Y s 576 371 m -26 Y s 647 371 m -26 Y s 718 396 m -51 Y s 789 371 m -26 Y s 860 371 m -26 Y s
 932 371 m -26 Y s 1003 371 m -26 Y s 1074 396 m -51 Y s 1145 371 m -26 Y s 1216 371 m -26 Y s 1287 371 m -26 Y s 1358 371 m -26 Y s 1429 396 m -51 Y s 1500 371 m -26 Y s 1571 371 m -26 Y s 1642 371 m -26 Y s 1714 371 m -26 Y s 1785 396 m -51 Y s
 1856 371 m -26 Y s 1927 371 m -26 Y s 1998 371 m -26 Y s 2069 371 m -26 Y s 2140 396 m -51 Y s 2140 396 m -51 Y s
 gsave  2268 2158 0 0 C 334 251.25 t 0 r /Helvetica findfont 100.584 sf 0 0 m (0) show NC gr 
 gsave  2268 2158 0 0 C 663.125 251.25 t 0 r /Helvetica findfont 100.584 sf 0 0 m (50) show NC gr 
 gsave  2268 2158 0 0 C 987.688 251.25 t 0 r /Helvetica findfont 100.584 sf 0 0 m (100) show NC gr 
 gsave  2268 2158 0 0 C 1344.31 251.25 t 0 r /Helvetica findfont 100.584 sf 0 0 m (150) show NC gr 
 gsave  2268 2158 0 0 C 1700.94 251.25 t 0 r /Helvetica findfont 100.584 sf 0 0 m (200) show NC gr 
 gsave  2268 2158 0 0 C 2057.56 251.25 t 0 r /Helvetica findfont 100.584 sf 0 0 m (250) show NC gr  363 2050 m 1791 X s 363 1999 m 51 Y s 434 2025 m 25 Y s 505 2025 m 25 Y s 576 2025 m 25 Y s 647 2025 m 25 Y s 718 1999 m 51 Y s 789 2025 m 25 Y s 860
 2025 m 25 Y s 932 2025 m 25 Y s 1003 2025 m 25 Y s 1074 1999 m 51 Y s 1145 2025 m 25 Y s 1216 2025 m 25 Y s 1287 2025 m 25 Y s 1358 2025 m 25 Y s 1429 1999 m 51 Y s 1500 2025 m 25 Y s 1571 2025 m 25 Y s 1642 2025 m 25 Y s 1714 2025 m 25 Y s 1785
 1999 m 51 Y s 1856 2025 m 25 Y s 1927 2025 m 25 Y s 1998 2025 m 25 Y s 2069 2025 m 25 Y s 2140 1999 m 51 Y s 2140 1999 m 51 Y s 363 345 m 1705 Y s
 gsave  2268 2158 0 0 C 169.375 1151.88 t 90 r /Helvetica findfont 100.584 sf 0 0 m (HqT/Powheg weight) show NC gr  417 345 m -54 X s 390 399 m -27 X s 390 452 m -27 X s 390 505 m -27 X s 417 558 m -54 X s 390 612 m -27 X s 390 665 m -27 X s 390 718
 m -27 X s 417 771 m -54 X s 390 825 m -27 X s 390 878 m -27 X s 390 931 m -27 X s 417 985 m -54 X s 390 1038 m -27 X s 390 1091 m -27 X s 390 1144 m -27 X s 417 1198 m -54 X s 390 1251 m -27 X s 390 1304 m -27 X s 390 1358 m -27 X s 417 1411 m -54 X
 s 390 1464 m -27 X s 390 1517 m -27 X s 390 1571 m -27 X s 417 1624 m -54 X s 390 1677 m -27 X s 390 1730 m -27 X s 390 1784 m -27 X s 417 1837 m -54 X s 390 1890 m -27 X s 390 1944 m -27 X s 390 1997 m -27 X s 417 2050 m -54 X s
 gsave  2268 2158 0 0 C 292.812 310.688 t 0 r /Helvetica findfont 100.584 sf 0 0 m (0) show NC gr 
 gsave  2268 2158 0 0 C 210.5 525.5 t 0 r /Helvetica findfont 100.584 sf 0 0 m (0.2) show NC gr 
 gsave  2268 2158 0 0 C 210.5 735.812 t 0 r /Helvetica findfont 100.584 sf 0 0 m (0.4) show NC gr 
 gsave  2268 2158 0 0 C 210.5 950.688 t 0 r /Helvetica findfont 100.584 sf 0 0 m (0.6) show NC gr 
 gsave  2268 2158 0 0 C 210.5 1161 t 0 r /Helvetica findfont 100.584 sf 0 0 m (0.8) show NC gr 
 gsave  2268 2158 0 0 C 306.562 1371.31 t 0 r /Helvetica findfont 100.584 sf 0 0 m (1) show NC gr 
 gsave  2268 2158 0 0 C 210.5 1586.25 t 0 r /Helvetica findfont 100.584 sf 0 0 m (1.2) show NC gr 
 gsave  2268 2158 0 0 C 210.5 1796.56 t 0 r /Helvetica findfont 100.584 sf 0 0 m (1.4) show NC gr 
 gsave  2268 2158 0 0 C 210.5 2016 t 0 r /Helvetica findfont 100.584 sf 0 0 m (1.6) show NC gr  2154 345 m 1705 Y s 2101 345 m 53 X s 2127 399 m 27 X s 2127 452 m 27 X s 2127 505 m 27 X s 2101 558 m 53 X s 2127 612 m 27 X s 2127 665 m 27 X s 2127 718
 m 27 X s 2101 771 m 53 X s 2127 825 m 27 X s 2127 878 m 27 X s 2127 931 m 27 X s 2101 985 m 53 X s 2127 1038 m 27 X s 2127 1091 m 27 X s 2127 1144 m 27 X s 2101 1198 m 53 X s 2127 1251 m 27 X s 2127 1304 m 27 X s 2127 1358 m 27 X s 2101 1411 m 53 X
 s 2127 1464 m 27 X s 2127 1517 m 27 X s 2127 1571 m 27 X s 2101 1624 m 53 X s 2127 1677 m 27 X s 2127 1730 m 27 X s 2127 1784 m 27 X s 2101 1837 m 53 X s 2127 1890 m 27 X s 2127 1944 m 27 X s 2127 1997 m 27 X s 2101 2050 m 53 X s 0 1 0 c 6 lw 0.95
 0.95 0.95 c black 0 1 0 c 372 1811 m 17 -50 d 18 -47 d 18 -43 d 18 -39 d 18 -37 d 17 -33 d 18 -31 d 18 -29 d 18 -26 d 17 -25 d 18 -22 d 18 -22 d 18 -19 d 18 -19 d 17 -18 d 18 -17 d 18 -16 d 18 -16 d 17 -15 d 18 -15 d 18 -14 d 18 -15 d 17 -14 d 18
 -14 d 18 -14 d 18 -14 d 18 -14 d 17 -14 d 18 -14 d 18 -13 d 18 -14 d 17 -13 d 18 -14 d 18 -13 d 18 -12 d 18 -12 d 17 -12 d 18 -11 d 18 -10 d 18 -8 d 17 -8 d 18 -7 d 18 -4 d 18 -4 d 17 -1 d 18 1 d 18 4 d 18 -36 d 18 X s 1243 958 m 870 X s 2113 958 m
 18 X s black[  12 12 ] 0 sd 363 1411 m 1784 X s
 gsave  2268 2158 0 0 C 2222.12 1567.94 t 90 r /Helvetica-BoldOblique findfont 41.1481 sf 0 0 m 
 444 425 402 380 369 337 299 288 261 234 223 196 165 134 122 94 82 53 24
(LHC HIGGS XS WG 2011) K NC gr 
 gr  gr showpage
end
%%EOF
