%!PS-Adobe-2.0 EPSF-1.2
%%Title: ptmax_DY_antikt-log-LHC7-mstw8nn-NNLO-hwg.eps
%%Creator: gnuplot 4.4 patchlevel 3
%%CreationDate: Mon Nov 14 18:08:59 2011
%%For:banfi banfi
%%Pages: 1
%%DocumentFonts: Helvetica Symbol
%%BoundingBox: 55 48 362 291
%%EndProlog
%%Page 1 1
/gnudict 256 dict def
gnudict begin
%
% The following true/false flags may be edited by hand if desired.
% The unit line width and grayscale image gamma correction may also be changed.
%
/Color true def
/Blacktext false def
/Solid true def
/Dashlength 1 def
/Landscape false def
/Level1 false def
/Rounded false def
/ClipToBoundingBox false def
/TransparentPatterns false def
/gnulinewidth 5.000 def
/userlinewidth gnulinewidth def
/Gamma 1.0 def
%
/vshift -80 def
/dl1 {
  10.0 Dashlength mul mul
  Rounded { currentlinewidth 0.75 mul sub dup 0 le { pop 0.01 } if } if
} def
/dl2 {
  10.0 Dashlength mul mul
  Rounded { currentlinewidth 0.75 mul add } if
} def
/hpt_ 31.5 def
/vpt_ 31.5 def
/hpt hpt_ def
/vpt vpt_ def
Level1 {} {
/SDict 10 dict def
systemdict /pdfmark known not {
  userdict /pdfmark systemdict /cleartomark get put
} if
SDict begin [
  /Title (ptmax_DY_antikt-log-LHC7-mstw8nn-NNLO-hwg.eps)
  /Subject (gnuplot plot)
  /Creator (gnuplot 4.4 patchlevel 3)
  /Author (banfi)
%  /Producer (gnuplot)
%  /Keywords ()
  /CreationDate (Mon Nov 14 18:08:59 2011)
  /DOCINFO pdfmark
end
} ifelse
/doclip {
  ClipToBoundingBox {
    newpath 50 50 moveto 410 50 lineto 410 302 lineto 50 302 lineto closepath
    clip
  } if
} def
%
% Gnuplot Prolog Version 4.4 (August 2010)
%
%/SuppressPDFMark true def
%
/M {moveto} bind def
/L {lineto} bind def
/R {rmoveto} bind def
/V {rlineto} bind def
/N {newpath moveto} bind def
/Z {closepath} bind def
/C {setrgbcolor} bind def
/f {rlineto fill} bind def
/g {setgray} bind def
/Gshow {show} def   % May be redefined later in the file to support UTF-8
/vpt2 vpt 2 mul def
/hpt2 hpt 2 mul def
/Lshow {currentpoint stroke M 0 vshift R 
	Blacktext {gsave 0 setgray show grestore} {show} ifelse} def
/Rshow {currentpoint stroke M dup stringwidth pop neg vshift R
	Blacktext {gsave 0 setgray show grestore} {show} ifelse} def
/Cshow {currentpoint stroke M dup stringwidth pop -2 div vshift R 
	Blacktext {gsave 0 setgray show grestore} {show} ifelse} def
/UP {dup vpt_ mul /vpt exch def hpt_ mul /hpt exch def
  /hpt2 hpt 2 mul def /vpt2 vpt 2 mul def} def
/DL {Color {setrgbcolor Solid {pop []} if 0 setdash}
 {pop pop pop 0 setgray Solid {pop []} if 0 setdash} ifelse} def
/BL {stroke userlinewidth 2 mul setlinewidth
	Rounded {1 setlinejoin 1 setlinecap} if} def
/AL {stroke userlinewidth 2 div setlinewidth
	Rounded {1 setlinejoin 1 setlinecap} if} def
/UL {dup gnulinewidth mul /userlinewidth exch def
	dup 1 lt {pop 1} if 10 mul /udl exch def} def
/PL {stroke userlinewidth setlinewidth
	Rounded {1 setlinejoin 1 setlinecap} if} def
3.8 setmiterlimit
% Default Line colors
/LCw {1 1 1} def
/LCb {0 0 0} def
/LCa {0 0 0} def
/LC0 {1 0 0} def
/LC1 {0 1 0} def
/LC2 {0 0 1} def
/LC3 {1 0 1} def
/LC4 {0 1 1} def
/LC5 {1 1 0} def
/LC6 {0 0 0} def
/LC7 {1 0.3 0} def
/LC8 {0.5 0.5 0.5} def
% Default Line Types
/LTw {PL [] 1 setgray} def
/LTb {BL [] LCb DL} def
/LTa {AL [1 udl mul 2 udl mul] 0 setdash LCa setrgbcolor} def
/LT0 {PL [] LC0 DL} def
/LT1 {PL [4 dl1 2 dl2] LC1 DL} def
/LT2 {PL [2 dl1 3 dl2] LC2 DL} def
/LT3 {PL [1 dl1 1.5 dl2] LC3 DL} def
/LT4 {PL [6 dl1 2 dl2 1 dl1 2 dl2] LC4 DL} def
/LT5 {PL [3 dl1 3 dl2 1 dl1 3 dl2] LC5 DL} def
/LT6 {PL [2 dl1 2 dl2 2 dl1 6 dl2] LC6 DL} def
/LT7 {PL [1 dl1 2 dl2 6 dl1 2 dl2 1 dl1 2 dl2] LC7 DL} def
/LT8 {PL [2 dl1 2 dl2 2 dl1 2 dl2 2 dl1 2 dl2 2 dl1 4 dl2] LC8 DL} def
/Pnt {stroke [] 0 setdash gsave 1 setlinecap M 0 0 V stroke grestore} def
/Dia {stroke [] 0 setdash 2 copy vpt add M
  hpt neg vpt neg V hpt vpt neg V
  hpt vpt V hpt neg vpt V closepath stroke
  Pnt} def
/Pls {stroke [] 0 setdash vpt sub M 0 vpt2 V
  currentpoint stroke M
  hpt neg vpt neg R hpt2 0 V stroke
 } def
/Box {stroke [] 0 setdash 2 copy exch hpt sub exch vpt add M
  0 vpt2 neg V hpt2 0 V 0 vpt2 V
  hpt2 neg 0 V closepath stroke
  Pnt} def
/Crs {stroke [] 0 setdash exch hpt sub exch vpt add M
  hpt2 vpt2 neg V currentpoint stroke M
  hpt2 neg 0 R hpt2 vpt2 V stroke} def
/TriU {stroke [] 0 setdash 2 copy vpt 1.12 mul add M
  hpt neg vpt -1.62 mul V
  hpt 2 mul 0 V
  hpt neg vpt 1.62 mul V closepath stroke
  Pnt} def
/Star {2 copy Pls Crs} def
/BoxF {stroke [] 0 setdash exch hpt sub exch vpt add M
  0 vpt2 neg V hpt2 0 V 0 vpt2 V
  hpt2 neg 0 V closepath fill} def
/TriUF {stroke [] 0 setdash vpt 1.12 mul add M
  hpt neg vpt -1.62 mul V
  hpt 2 mul 0 V
  hpt neg vpt 1.62 mul V closepath fill} def
/TriD {stroke [] 0 setdash 2 copy vpt 1.12 mul sub M
  hpt neg vpt 1.62 mul V
  hpt 2 mul 0 V
  hpt neg vpt -1.62 mul V closepath stroke
  Pnt} def
/TriDF {stroke [] 0 setdash vpt 1.12 mul sub M
  hpt neg vpt 1.62 mul V
  hpt 2 mul 0 V
  hpt neg vpt -1.62 mul V closepath fill} def
/DiaF {stroke [] 0 setdash vpt add M
  hpt neg vpt neg V hpt vpt neg V
  hpt vpt V hpt neg vpt V closepath fill} def
/Pent {stroke [] 0 setdash 2 copy gsave
  translate 0 hpt M 4 {72 rotate 0 hpt L} repeat
  closepath stroke grestore Pnt} def
/PentF {stroke [] 0 setdash gsave
  translate 0 hpt M 4 {72 rotate 0 hpt L} repeat
  closepath fill grestore} def
/Circle {stroke [] 0 setdash 2 copy
  hpt 0 360 arc stroke Pnt} def
/CircleF {stroke [] 0 setdash hpt 0 360 arc fill} def
/C0 {BL [] 0 setdash 2 copy moveto vpt 90 450 arc} bind def
/C1 {BL [] 0 setdash 2 copy moveto
	2 copy vpt 0 90 arc closepath fill
	vpt 0 360 arc closepath} bind def
/C2 {BL [] 0 setdash 2 copy moveto
	2 copy vpt 90 180 arc closepath fill
	vpt 0 360 arc closepath} bind def
/C3 {BL [] 0 setdash 2 copy moveto
	2 copy vpt 0 180 arc closepath fill
	vpt 0 360 arc closepath} bind def
/C4 {BL [] 0 setdash 2 copy moveto
	2 copy vpt 180 270 arc closepath fill
	vpt 0 360 arc closepath} bind def
/C5 {BL [] 0 setdash 2 copy moveto
	2 copy vpt 0 90 arc
	2 copy moveto
	2 copy vpt 180 270 arc closepath fill
	vpt 0 360 arc} bind def
/C6 {BL [] 0 setdash 2 copy moveto
	2 copy vpt 90 270 arc closepath fill
	vpt 0 360 arc closepath} bind def
/C7 {BL [] 0 setdash 2 copy moveto
	2 copy vpt 0 270 arc closepath fill
	vpt 0 360 arc closepath} bind def
/C8 {BL [] 0 setdash 2 copy moveto
	2 copy vpt 270 360 arc closepath fill
	vpt 0 360 arc closepath} bind def
/C9 {BL [] 0 setdash 2 copy moveto
	2 copy vpt 270 450 arc closepath fill
	vpt 0 360 arc closepath} bind def
/C10 {BL [] 0 setdash 2 copy 2 copy moveto vpt 270 360 arc closepath fill
	2 copy moveto
	2 copy vpt 90 180 arc closepath fill
	vpt 0 360 arc closepath} bind def
/C11 {BL [] 0 setdash 2 copy moveto
	2 copy vpt 0 180 arc closepath fill
	2 copy moveto
	2 copy vpt 270 360 arc closepath fill
	vpt 0 360 arc closepath} bind def
/C12 {BL [] 0 setdash 2 copy moveto
	2 copy vpt 180 360 arc closepath fill
	vpt 0 360 arc closepath} bind def
/C13 {BL [] 0 setdash 2 copy moveto
	2 copy vpt 0 90 arc closepath fill
	2 copy moveto
	2 copy vpt 180 360 arc closepath fill
	vpt 0 360 arc closepath} bind def
/C14 {BL [] 0 setdash 2 copy moveto
	2 copy vpt 90 360 arc closepath fill
	vpt 0 360 arc} bind def
/C15 {BL [] 0 setdash 2 copy vpt 0 360 arc closepath fill
	vpt 0 360 arc closepath} bind def
/Rec {newpath 4 2 roll moveto 1 index 0 rlineto 0 exch rlineto
	neg 0 rlineto closepath} bind def
/Square {dup Rec} bind def
/Bsquare {vpt sub exch vpt sub exch vpt2 Square} bind def
/S0 {BL [] 0 setdash 2 copy moveto 0 vpt rlineto BL Bsquare} bind def
/S1 {BL [] 0 setdash 2 copy vpt Square fill Bsquare} bind def
/S2 {BL [] 0 setdash 2 copy exch vpt sub exch vpt Square fill Bsquare} bind def
/S3 {BL [] 0 setdash 2 copy exch vpt sub exch vpt2 vpt Rec fill Bsquare} bind def
/S4 {BL [] 0 setdash 2 copy exch vpt sub exch vpt sub vpt Square fill Bsquare} bind def
/S5 {BL [] 0 setdash 2 copy 2 copy vpt Square fill
	exch vpt sub exch vpt sub vpt Square fill Bsquare} bind def
/S6 {BL [] 0 setdash 2 copy exch vpt sub exch vpt sub vpt vpt2 Rec fill Bsquare} bind def
/S7 {BL [] 0 setdash 2 copy exch vpt sub exch vpt sub vpt vpt2 Rec fill
	2 copy vpt Square fill Bsquare} bind def
/S8 {BL [] 0 setdash 2 copy vpt sub vpt Square fill Bsquare} bind def
/S9 {BL [] 0 setdash 2 copy vpt sub vpt vpt2 Rec fill Bsquare} bind def
/S10 {BL [] 0 setdash 2 copy vpt sub vpt Square fill 2 copy exch vpt sub exch vpt Square fill
	Bsquare} bind def
/S11 {BL [] 0 setdash 2 copy vpt sub vpt Square fill 2 copy exch vpt sub exch vpt2 vpt Rec fill
	Bsquare} bind def
/S12 {BL [] 0 setdash 2 copy exch vpt sub exch vpt sub vpt2 vpt Rec fill Bsquare} bind def
/S13 {BL [] 0 setdash 2 copy exch vpt sub exch vpt sub vpt2 vpt Rec fill
	2 copy vpt Square fill Bsquare} bind def
/S14 {BL [] 0 setdash 2 copy exch vpt sub exch vpt sub vpt2 vpt Rec fill
	2 copy exch vpt sub exch vpt Square fill Bsquare} bind def
/S15 {BL [] 0 setdash 2 copy Bsquare fill Bsquare} bind def
/D0 {gsave translate 45 rotate 0 0 S0 stroke grestore} bind def
/D1 {gsave translate 45 rotate 0 0 S1 stroke grestore} bind def
/D2 {gsave translate 45 rotate 0 0 S2 stroke grestore} bind def
/D3 {gsave translate 45 rotate 0 0 S3 stroke grestore} bind def
/D4 {gsave translate 45 rotate 0 0 S4 stroke grestore} bind def
/D5 {gsave translate 45 rotate 0 0 S5 stroke grestore} bind def
/D6 {gsave translate 45 rotate 0 0 S6 stroke grestore} bind def
/D7 {gsave translate 45 rotate 0 0 S7 stroke grestore} bind def
/D8 {gsave translate 45 rotate 0 0 S8 stroke grestore} bind def
/D9 {gsave translate 45 rotate 0 0 S9 stroke grestore} bind def
/D10 {gsave translate 45 rotate 0 0 S10 stroke grestore} bind def
/D11 {gsave translate 45 rotate 0 0 S11 stroke grestore} bind def
/D12 {gsave translate 45 rotate 0 0 S12 stroke grestore} bind def
/D13 {gsave translate 45 rotate 0 0 S13 stroke grestore} bind def
/D14 {gsave translate 45 rotate 0 0 S14 stroke grestore} bind def
/D15 {gsave translate 45 rotate 0 0 S15 stroke grestore} bind def
/DiaE {stroke [] 0 setdash vpt add M
  hpt neg vpt neg V hpt vpt neg V
  hpt vpt V hpt neg vpt V closepath stroke} def
/BoxE {stroke [] 0 setdash exch hpt sub exch vpt add M
  0 vpt2 neg V hpt2 0 V 0 vpt2 V
  hpt2 neg 0 V closepath stroke} def
/TriUE {stroke [] 0 setdash vpt 1.12 mul add M
  hpt neg vpt -1.62 mul V
  hpt 2 mul 0 V
  hpt neg vpt 1.62 mul V closepath stroke} def
/TriDE {stroke [] 0 setdash vpt 1.12 mul sub M
  hpt neg vpt 1.62 mul V
  hpt 2 mul 0 V
  hpt neg vpt -1.62 mul V closepath stroke} def
/PentE {stroke [] 0 setdash gsave
  translate 0 hpt M 4 {72 rotate 0 hpt L} repeat
  closepath stroke grestore} def
/CircE {stroke [] 0 setdash 
  hpt 0 360 arc stroke} def
/Opaque {gsave closepath 1 setgray fill grestore 0 setgray closepath} def
/DiaW {stroke [] 0 setdash vpt add M
  hpt neg vpt neg V hpt vpt neg V
  hpt vpt V hpt neg vpt V Opaque stroke} def
/BoxW {stroke [] 0 setdash exch hpt sub exch vpt add M
  0 vpt2 neg V hpt2 0 V 0 vpt2 V
  hpt2 neg 0 V Opaque stroke} def
/TriUW {stroke [] 0 setdash vpt 1.12 mul add M
  hpt neg vpt -1.62 mul V
  hpt 2 mul 0 V
  hpt neg vpt 1.62 mul V Opaque stroke} def
/TriDW {stroke [] 0 setdash vpt 1.12 mul sub M
  hpt neg vpt 1.62 mul V
  hpt 2 mul 0 V
  hpt neg vpt -1.62 mul V Opaque stroke} def
/PentW {stroke [] 0 setdash gsave
  translate 0 hpt M 4 {72 rotate 0 hpt L} repeat
  Opaque stroke grestore} def
/CircW {stroke [] 0 setdash 
  hpt 0 360 arc Opaque stroke} def
/BoxFill {gsave Rec 1 setgray fill grestore} def
/Density {
  /Fillden exch def
  currentrgbcolor
  /ColB exch def /ColG exch def /ColR exch def
  /ColR ColR Fillden mul Fillden sub 1 add def
  /ColG ColG Fillden mul Fillden sub 1 add def
  /ColB ColB Fillden mul Fillden sub 1 add def
  ColR ColG ColB setrgbcolor} def
/BoxColFill {gsave Rec PolyFill} def
/PolyFill {gsave Density fill grestore grestore} def
/h {rlineto rlineto rlineto gsave closepath fill grestore} bind def
%
% PostScript Level 1 Pattern Fill routine for rectangles
% Usage: x y w h s a XX PatternFill
%	x,y = lower left corner of box to be filled
%	w,h = width and height of box
%	  a = angle in degrees between lines and x-axis
%	 XX = 0/1 for no/yes cross-hatch
%
/PatternFill {gsave /PFa [ 9 2 roll ] def
  PFa 0 get PFa 2 get 2 div add PFa 1 get PFa 3 get 2 div add translate
  PFa 2 get -2 div PFa 3 get -2 div PFa 2 get PFa 3 get Rec
  gsave 1 setgray fill grestore clip
  currentlinewidth 0.5 mul setlinewidth
  /PFs PFa 2 get dup mul PFa 3 get dup mul add sqrt def
  0 0 M PFa 5 get rotate PFs -2 div dup translate
  0 1 PFs PFa 4 get div 1 add floor cvi
	{PFa 4 get mul 0 M 0 PFs V} for
  0 PFa 6 get ne {
	0 1 PFs PFa 4 get div 1 add floor cvi
	{PFa 4 get mul 0 2 1 roll M PFs 0 V} for
 } if
  stroke grestore} def
%
/languagelevel where
 {pop languagelevel} {1} ifelse
 2 lt
	{/InterpretLevel1 true def}
	{/InterpretLevel1 Level1 def}
 ifelse
%
% PostScript level 2 pattern fill definitions
%
/Level2PatternFill {
/Tile8x8 {/PaintType 2 /PatternType 1 /TilingType 1 /BBox [0 0 8 8] /XStep 8 /YStep 8}
	bind def
/KeepColor {currentrgbcolor [/Pattern /DeviceRGB] setcolorspace} bind def
<< Tile8x8
 /PaintProc {0.5 setlinewidth pop 0 0 M 8 8 L 0 8 M 8 0 L stroke} 
>> matrix makepattern
/Pat1 exch def
<< Tile8x8
 /PaintProc {0.5 setlinewidth pop 0 0 M 8 8 L 0 8 M 8 0 L stroke
	0 4 M 4 8 L 8 4 L 4 0 L 0 4 L stroke}
>> matrix makepattern
/Pat2 exch def
<< Tile8x8
 /PaintProc {0.5 setlinewidth pop 0 0 M 0 8 L
	8 8 L 8 0 L 0 0 L fill}
>> matrix makepattern
/Pat3 exch def
<< Tile8x8
 /PaintProc {0.5 setlinewidth pop -4 8 M 8 -4 L
	0 12 M 12 0 L stroke}
>> matrix makepattern
/Pat4 exch def
<< Tile8x8
 /PaintProc {0.5 setlinewidth pop -4 0 M 8 12 L
	0 -4 M 12 8 L stroke}
>> matrix makepattern
/Pat5 exch def
<< Tile8x8
 /PaintProc {0.5 setlinewidth pop -2 8 M 4 -4 L
	0 12 M 8 -4 L 4 12 M 10 0 L stroke}
>> matrix makepattern
/Pat6 exch def
<< Tile8x8
 /PaintProc {0.5 setlinewidth pop -2 0 M 4 12 L
	0 -4 M 8 12 L 4 -4 M 10 8 L stroke}
>> matrix makepattern
/Pat7 exch def
<< Tile8x8
 /PaintProc {0.5 setlinewidth pop 8 -2 M -4 4 L
	12 0 M -4 8 L 12 4 M 0 10 L stroke}
>> matrix makepattern
/Pat8 exch def
<< Tile8x8
 /PaintProc {0.5 setlinewidth pop 0 -2 M 12 4 L
	-4 0 M 12 8 L -4 4 M 8 10 L stroke}
>> matrix makepattern
/Pat9 exch def
/Pattern1 {PatternBgnd KeepColor Pat1 setpattern} bind def
/Pattern2 {PatternBgnd KeepColor Pat2 setpattern} bind def
/Pattern3 {PatternBgnd KeepColor Pat3 setpattern} bind def
/Pattern4 {PatternBgnd KeepColor Landscape {Pat5} {Pat4} ifelse setpattern} bind def
/Pattern5 {PatternBgnd KeepColor Landscape {Pat4} {Pat5} ifelse setpattern} bind def
/Pattern6 {PatternBgnd KeepColor Landscape {Pat9} {Pat6} ifelse setpattern} bind def
/Pattern7 {PatternBgnd KeepColor Landscape {Pat8} {Pat7} ifelse setpattern} bind def
} def
%
%
%End of PostScript Level 2 code
%
/PatternBgnd {
  TransparentPatterns {} {gsave 1 setgray fill grestore} ifelse
} def
%
% Substitute for Level 2 pattern fill codes with
% grayscale if Level 2 support is not selected.
%
/Level1PatternFill {
/Pattern1 {0.250 Density} bind def
/Pattern2 {0.500 Density} bind def
/Pattern3 {0.750 Density} bind def
/Pattern4 {0.125 Density} bind def
/Pattern5 {0.375 Density} bind def
/Pattern6 {0.625 Density} bind def
/Pattern7 {0.875 Density} bind def
} def
%
% Now test for support of Level 2 code
%
Level1 {Level1PatternFill} {Level2PatternFill} ifelse
%
/Symbol-Oblique /Symbol findfont [1 0 .167 1 0 0] makefont
dup length dict begin {1 index /FID eq {pop pop} {def} ifelse} forall
currentdict end definefont pop
/MFshow {
   { dup 5 get 3 ge
     { 5 get 3 eq {gsave} {grestore} ifelse }
     {dup dup 0 get findfont exch 1 get scalefont setfont
     [ currentpoint ] exch dup 2 get 0 exch R dup 5 get 2 ne {dup dup 6
     get exch 4 get {Gshow} {stringwidth pop 0 R} ifelse }if dup 5 get 0 eq
     {dup 3 get {2 get neg 0 exch R pop} {pop aload pop M} ifelse} {dup 5
     get 1 eq {dup 2 get exch dup 3 get exch 6 get stringwidth pop -2 div
     dup 0 R} {dup 6 get stringwidth pop -2 div 0 R 6 get
     show 2 index {aload pop M neg 3 -1 roll neg R pop pop} {pop pop pop
     pop aload pop M} ifelse }ifelse }ifelse }
     ifelse }
   forall} def
/Gswidth {dup type /stringtype eq {stringwidth} {pop (n) stringwidth} ifelse} def
/MFwidth {0 exch { dup 5 get 3 ge { 5 get 3 eq { 0 } { pop } ifelse }
 {dup 3 get{dup dup 0 get findfont exch 1 get scalefont setfont
     6 get Gswidth pop add} {pop} ifelse} ifelse} forall} def
/MLshow { currentpoint stroke M
  0 exch R
  Blacktext {gsave 0 setgray MFshow grestore} {MFshow} ifelse } bind def
/MRshow { currentpoint stroke M
  exch dup MFwidth neg 3 -1 roll R
  Blacktext {gsave 0 setgray MFshow grestore} {MFshow} ifelse } bind def
/MCshow { currentpoint stroke M
  exch dup MFwidth -2 div 3 -1 roll R
  Blacktext {gsave 0 setgray MFshow grestore} {MFshow} ifelse } bind def
/XYsave    { [( ) 1 2 true false 3 ()] } bind def
/XYrestore { [( ) 1 2 true false 4 ()] } bind def
end
gnudict begin
gsave
doclip
50 50 translate
0.050 0.050 scale
0 setgray
newpath
(Helvetica) findfont 240 scalefont setfont
1.000 UL
LTb
1122 4799 N
0 -4079 V
5099 0 V
0 4079 V
-5099 0 V
Z stroke
LCb setrgbcolor
282 2759 M
currentpoint gsave translate -270 rotate 0 0 moveto
[ [(Helvetica) 240.0 0.0 true true 0 (f)]
[(Helvetica) 192.0 -72.0 true true 0 (0)]
[(Helvetica) 240.0 0.0 true true 0 (\(p)]
XYsave
[(Helvetica) 192.0 -72.0 true true 0 (T)]
XYrestore
[(Helvetica) 192.0 120.0 true true 0 (cut)]
[(Helvetica) 240.0 0.0 true true 0 (\))]
] -80.0 MCshow
grestore
LTb
LCb setrgbcolor
3671 120 M
[ [(Helvetica) 240.0 0.0 true true 0 (p)]
XYsave
[(Helvetica) 192.0 -72.0 true true 0 (T)]
XYrestore
[(Helvetica) 192.0 120.0 true true 0 (cut)]
[(Helvetica) 240.0 0.0 true true 0 ( / M)]
[(Helvetica) 192.0 -72.0 true true 0 (Z)]
] -80.0 MCshow
LTb
1.000 UP
6017 3657 M
[ [(Helvetica) 192.0 0.0 true true 0 (LHC, 7 TeV)]
] -80.0 MRshow
6017 3371 M
[ [(Helvetica) 192.0 0.0 true true 0 (DYNNLO + MCFM)]
] -80.0 MRshow
6017 3086 M
[ [(Helvetica) 192.0 0.0 true true 0 (M)]
[(Helvetica) 153.6 -57.6 true true 0 (Z)]
[(Helvetica) 192.0 0.0 true true 0 (/4 )]
[(Symbol) 192.0 0.0 true true 0 (\243 m)]
[(Helvetica) 153.6 -57.6 true true 0 (R)]
[(Helvetica) 192.0 0.0 true true 0 (, )]
[(Symbol) 192.0 0.0 true true 0 (m)]
[(Helvetica) 153.6 -57.6 true true 0 (F)]
[(Helvetica) 192.0 0.0 true true 0 ( )]
[(Symbol) 192.0 0.0 true true 0 (\243)]
[(Helvetica) 192.0 0.0 true true 0 ( M)]
[(Helvetica) 153.6 -57.6 true true 0 (Z)]
] -60.8 MRshow
6017 2800 M
[ [(Helvetica) 192.0 0.0 true true 0 (1/2 )]
[(Symbol) 192.0 0.0 true true 0 (\243 m)]
[(Helvetica) 153.6 -57.6 true true 0 (R)]
[(Helvetica) 192.0 0.0 true true 0 ( / )]
[(Symbol) 192.0 0.0 true true 0 (m)]
[(Helvetica) 153.6 -57.6 true true 0 (F)]
[(Helvetica) 192.0 0.0 true true 0 ( )]
[(Symbol) 192.0 0.0 true true 0 (\243)]
[(Helvetica) 192.0 0.0 true true 0 ( 2)]
] -60.8 MRshow
1.000 UL
LTb
% Begin plot #1
1.000 UL
LT2
1301 720 M
77 32 V
86 48 V
86 61 V
86 74 V
85 87 V
86 99 V
86 109 V
86 115 V
85 119 V
86 122 V
86 112 V
85 103 V
86 109 V
86 114 V
86 119 V
85 124 V
86 127 V
86 128 V
85 129 V
86 127 V
86 124 V
86 122 V
85 117 V
86 115 V
86 112 V
85 108 V
86 103 V
86 97 V
86 92 V
85 85 V
86 79 V
86 73 V
86 66 V
85 60 V
86 54 V
86 49 V
85 44 V
86 38 V
86 32 V
86 28 V
85 22 V
86 19 V
86 15 V
85 13 V
86 10 V
86 8 V
86 6 V
85 4 V
86 4 V
86 2 V
85 2 V
86 1 V
86 1 V
86 1 V
85 0 V
86 1 V
86 0 V
42 0 V
% End plot #1
% Begin plot #2
1122 2347 M
85 -82 V
86 -56 V
85 -33 V
86 -15 V
86 -3 V
86 1 V
85 -6 V
86 -7 V
86 0 V
86 17 V
85 50 V
86 73 V
86 90 V
85 97 V
86 91 V
86 90 V
86 90 V
85 94 V
86 100 V
86 102 V
85 101 V
86 95 V
86 89 V
86 85 V
85 82 V
86 85 V
86 87 V
85 85 V
86 84 V
86 77 V
86 72 V
85 66 V
86 58 V
86 52 V
86 46 V
85 40 V
86 37 V
86 35 V
85 32 V
86 28 V
86 23 V
86 19 V
85 14 V
86 11 V
86 9 V
stroke 4979 4452 M
85 8 V
86 6 V
86 5 V
86 4 V
85 3 V
86 3 V
86 1 V
85 1 V
86 1 V
86 1 V
86 0 V
85 0 V
86 0 V
86 0 V
42 0 V
% End plot #2
% Begin plot #3
stroke
LCb setrgbcolor
5150 1683 M
[ [(Helvetica) 240.0 0.0 true true 0 (scheme \(a\))]
] -80.0 MRshow
LT2
5294 1593 639 180 80 -45 0 PatternFill
5294 1593 N
639 0 V
0 180 V
-639 0 V
0 -180 V
Z stroke
LT2
gsave 1122 720 N 0 1627 V 85 -82 V 0 -1545 V /TransparentPatterns true def
 Pattern5 fill grestore
gsave 1207 720 N 0 1545 V 86 -56 V 0 -1489 V /TransparentPatterns true def
 Pattern5 fill grestore
gsave 1293 720 N 0 1489 V 85 -33 V 0 -1424 V -77 -32 V /TransparentPatterns true def
 Pattern5 fill grestore
gsave 1378 752 N 0 1424 V 86 -15 V 0 -1361 V /TransparentPatterns true def
 Pattern5 fill grestore
gsave 1464 800 N 0 1361 V 86 -3 V 0 -1297 V /TransparentPatterns true def
 Pattern5 fill grestore
gsave 1550 861 N 0 1297 V 86 1 V 0 -1224 V /TransparentPatterns true def
 Pattern5 fill grestore
gsave 1636 935 N 0 1224 V 85 -6 V 0 -1131 V /TransparentPatterns true def
 Pattern5 fill grestore
gsave 1721 1022 N 0 1131 V 86 -7 V 0 -1025 V /TransparentPatterns true def
 Pattern5 fill grestore
gsave 1807 1121 N 0 1025 V 86 0 V 0 -916 V /TransparentPatterns true def
 Pattern5 fill grestore
gsave 1893 1230 N 0 916 V 86 17 V 0 -818 V /TransparentPatterns true def
 Pattern5 fill grestore
gsave 1979 1345 N 0 818 V 85 50 V 0 -749 V /TransparentPatterns true def
 Pattern5 fill grestore
gsave 2064 1464 N 0 749 V 86 73 V 0 -700 V /TransparentPatterns true def
 Pattern5 fill grestore
gsave 2150 1586 N 0 700 V 86 90 V 0 -678 V /TransparentPatterns true def
 Pattern5 fill grestore
gsave 2236 1698 N 0 678 V 85 97 V 0 -672 V /TransparentPatterns true def
 Pattern5 fill grestore
gsave 2321 1801 N 0 672 V 86 91 V 0 -654 V /TransparentPatterns true def
 Pattern5 fill grestore
gsave 2407 1910 N 0 654 V 86 90 V 0 -630 V /TransparentPatterns true def
 Pattern5 fill grestore
gsave 2493 2024 N 0 630 V 86 90 V 0 -601 V /TransparentPatterns true def
 Pattern5 fill grestore
gsave 2579 2143 N 0 601 V 85 94 V 0 -571 V /TransparentPatterns true def
 Pattern5 fill grestore
gsave 2664 2267 N 0 571 V 86 100 V 0 -544 V /TransparentPatterns true def
 Pattern5 fill grestore
gsave 2750 2394 N 0 544 V 86 102 V 0 -518 V /TransparentPatterns true def
 Pattern5 fill grestore
gsave 2836 2522 N 0 518 V 85 101 V 0 -490 V /TransparentPatterns true def
 Pattern5 fill grestore
gsave 2921 2651 N 0 490 V 86 95 V 0 -458 V /TransparentPatterns true def
 Pattern5 fill grestore
gsave 3007 2778 N 0 458 V 86 89 V 0 -423 V /TransparentPatterns true def
 Pattern5 fill grestore
gsave 3093 2902 N 0 423 V 86 85 V 0 -386 V /TransparentPatterns true def
 Pattern5 fill grestore
gsave 3179 3024 N 0 386 V 85 82 V 0 -351 V /TransparentPatterns true def
 Pattern5 fill grestore
gsave 3264 3141 N 0 351 V 86 85 V 0 -321 V /TransparentPatterns true def
 Pattern5 fill grestore
gsave 3350 3256 N 0 321 V 86 87 V 0 -296 V /TransparentPatterns true def
 Pattern5 fill grestore
gsave 3436 3368 N 0 296 V 85 85 V 0 -273 V /TransparentPatterns true def
 Pattern5 fill grestore
gsave 3521 3476 N 0 273 V 86 84 V 0 -254 V /TransparentPatterns true def
 Pattern5 fill grestore
gsave 3607 3579 N 0 254 V 86 77 V 0 -234 V /TransparentPatterns true def
 Pattern5 fill grestore
gsave 3693 3676 N 0 234 V 86 72 V 0 -214 V /TransparentPatterns true def
 Pattern5 fill grestore
gsave 3779 3768 N 0 214 V 85 66 V 0 -195 V /TransparentPatterns true def
 Pattern5 fill grestore
gsave 3864 3853 N 0 195 V 86 58 V 0 -174 V /TransparentPatterns true def
 Pattern5 fill grestore
gsave 3950 3932 N 0 174 V 86 52 V 0 -153 V /TransparentPatterns true def
 Pattern5 fill grestore
gsave 4036 4005 N 0 153 V 86 46 V 0 -133 V /TransparentPatterns true def
 Pattern5 fill grestore
gsave 4122 4071 N 0 133 V 85 40 V 0 -113 V /TransparentPatterns true def
 Pattern5 fill grestore
gsave 4207 4131 N 0 113 V 86 37 V 0 -96 V /TransparentPatterns true def
 Pattern5 fill grestore
gsave 4293 4185 N 0 96 V 86 35 V 0 -82 V /TransparentPatterns true def
 Pattern5 fill grestore
gsave 4379 4234 N 0 82 V 85 32 V 0 -70 V /TransparentPatterns true def
 Pattern5 fill grestore
gsave 4464 4278 N 0 70 V 86 28 V 0 -60 V /TransparentPatterns true def
 Pattern5 fill grestore
gsave 4550 4316 N 0 60 V 86 23 V 0 -51 V /TransparentPatterns true def
 Pattern5 fill grestore
gsave 4636 4348 N 0 51 V 86 19 V 0 -42 V /TransparentPatterns true def
 Pattern5 fill grestore
gsave 4722 4376 N 0 42 V 85 14 V 0 -34 V /TransparentPatterns true def
 Pattern5 fill grestore
gsave 4807 4398 N 0 34 V 86 11 V 0 -26 V /TransparentPatterns true def
 Pattern5 fill grestore
gsave 4893 4417 N 0 26 V 86 9 V 0 -20 V /TransparentPatterns true def
 Pattern5 fill grestore
gsave 4979 4432 N 0 20 V 85 8 V 0 -15 V /TransparentPatterns true def
 Pattern5 fill grestore
gsave 5064 4445 N 0 15 V 86 6 V 0 -11 V /TransparentPatterns true def
 Pattern5 fill grestore
gsave 5150 4455 N 0 11 V 86 5 V 0 -8 V /TransparentPatterns true def
 Pattern5 fill grestore
gsave 5236 4463 N 0 8 V 86 4 V 0 -6 V /TransparentPatterns true def
 Pattern5 fill grestore
gsave 5322 4469 N 0 6 V 85 3 V 0 -5 V /TransparentPatterns true def
 Pattern5 fill grestore
gsave 5407 4473 N 0 5 V 86 3 V 0 -4 V /TransparentPatterns true def
 Pattern5 fill grestore
gsave 5493 4477 N 0 4 V 86 1 V 0 -3 V /TransparentPatterns true def
 Pattern5 fill grestore
gsave 5579 4479 N 0 3 V 85 1 V 0 -2 V /TransparentPatterns true def
 Pattern5 fill grestore
gsave 5664 4481 N 0 2 V 86 1 V 0 -2 V /TransparentPatterns true def
 Pattern5 fill grestore
gsave 5750 4482 N 0 2 V 86 1 V 0 -2 V /TransparentPatterns true def
 Pattern5 fill grestore
gsave 5836 4483 N 0 2 V 86 0 V 0 -1 V /TransparentPatterns true def
 Pattern5 fill grestore
gsave 5922 4484 N 0 1 V 85 0 V 0 -1 V /TransparentPatterns true def
 Pattern5 fill grestore
gsave 6007 4484 N 0 1 V 86 0 V 0 0 V /TransparentPatterns true def
 Pattern5 fill grestore
gsave 6093 4485 N 0 0 V 86 0 V 0 0 V /TransparentPatterns true def
 Pattern5 fill grestore
gsave 6179 4485 N 0 0 V 42 0 V 0 0 V /TransparentPatterns true def
 Pattern5 fill grestore
% End plot #3
% Begin plot #4
1.000 UL
LT0
1350 720 M
28 12 V
86 48 V
86 62 V
86 74 V
85 88 V
86 99 V
86 109 V
86 116 V
85 119 V
86 124 V
86 126 V
85 118 V
86 109 V
86 114 V
86 118 V
85 123 V
86 126 V
86 128 V
85 128 V
86 126 V
86 124 V
86 120 V
85 117 V
86 115 V
86 111 V
85 107 V
86 102 V
86 97 V
86 91 V
85 85 V
86 79 V
86 72 V
86 66 V
85 60 V
86 54 V
86 48 V
85 44 V
86 38 V
86 32 V
86 27 V
85 23 V
86 18 V
86 15 V
85 13 V
86 10 V
86 8 V
86 6 V
85 4 V
86 4 V
86 2 V
85 2 V
86 1 V
86 1 V
86 1 V
85 0 V
86 1 V
86 0 V
42 0 V
% End plot #4
% Begin plot #5
1122 2347 M
85 -82 V
86 -57 V
85 -32 V
86 -16 V
86 -3 V
86 1 V
85 -6 V
86 -6 V
86 0 V
86 16 V
85 50 V
86 73 V
86 91 V
85 97 V
86 91 V
86 90 V
86 89 V
85 94 V
86 101 V
86 102 V
85 101 V
86 95 V
86 89 V
86 85 V
85 82 V
86 85 V
86 86 V
85 86 V
86 83 V
86 78 V
86 72 V
85 66 V
86 58 V
86 52 V
86 46 V
85 40 V
86 37 V
86 35 V
85 32 V
86 28 V
86 23 V
86 19 V
85 14 V
86 11 V
86 9 V
stroke 4979 4452 M
85 8 V
86 6 V
86 5 V
86 4 V
85 3 V
86 3 V
86 1 V
85 1 V
86 1 V
86 1 V
86 0 V
85 0 V
86 0 V
86 0 V
42 0 V
% End plot #5
% Begin plot #6
stroke
LCb setrgbcolor
5150 1323 M
[ [(Helvetica) 240.0 0.0 true true 0 (scheme \(b\))]
] -80.0 MRshow
LT0
5294 1233 639 180 80 -45 1 PatternFill
5294 1233 N
639 0 V
0 180 V
-639 0 V
0 -180 V
Z stroke
LT0
gsave 1122 720 N 0 1627 V 85 -82 V 0 -1545 V /TransparentPatterns true def
 Pattern1 fill grestore
gsave 1207 720 N 0 1545 V 86 -57 V 0 -1488 V /TransparentPatterns true def
 Pattern1 fill grestore
gsave 1293 720 N 0 1488 V 85 -32 V 0 -1444 V -28 -12 V /TransparentPatterns true def
 Pattern1 fill grestore
gsave 1378 732 N 0 1444 V 86 -16 V 0 -1380 V /TransparentPatterns true def
 Pattern1 fill grestore
gsave 1464 780 N 0 1380 V 86 -3 V 0 -1315 V /TransparentPatterns true def
 Pattern1 fill grestore
gsave 1550 842 N 0 1315 V 86 1 V 0 -1242 V /TransparentPatterns true def
 Pattern1 fill grestore
gsave 1636 916 N 0 1242 V 85 -6 V 0 -1148 V /TransparentPatterns true def
 Pattern1 fill grestore
gsave 1721 1004 N 0 1148 V 86 -6 V 0 -1043 V /TransparentPatterns true def
 Pattern1 fill grestore
gsave 1807 1103 N 0 1043 V 86 0 V 0 -934 V /TransparentPatterns true def
 Pattern1 fill grestore
gsave 1893 1212 N 0 934 V 86 16 V 0 -834 V /TransparentPatterns true def
 Pattern1 fill grestore
gsave 1979 1328 N 0 834 V 85 50 V 0 -765 V /TransparentPatterns true def
 Pattern1 fill grestore
gsave 2064 1447 N 0 765 V 86 73 V 0 -714 V /TransparentPatterns true def
 Pattern1 fill grestore
gsave 2150 1571 N 0 714 V 86 91 V 0 -679 V /TransparentPatterns true def
 Pattern1 fill grestore
gsave 2236 1697 N 0 679 V 85 97 V 0 -658 V /TransparentPatterns true def
 Pattern1 fill grestore
gsave 2321 1815 N 0 658 V 86 91 V 0 -640 V /TransparentPatterns true def
 Pattern1 fill grestore
gsave 2407 1924 N 0 640 V 86 90 V 0 -616 V /TransparentPatterns true def
 Pattern1 fill grestore
gsave 2493 2038 N 0 616 V 86 89 V 0 -587 V /TransparentPatterns true def
 Pattern1 fill grestore
gsave 2579 2156 N 0 587 V 85 94 V 0 -558 V /TransparentPatterns true def
 Pattern1 fill grestore
gsave 2664 2279 N 0 558 V 86 101 V 0 -533 V /TransparentPatterns true def
 Pattern1 fill grestore
gsave 2750 2405 N 0 533 V 86 102 V 0 -507 V /TransparentPatterns true def
 Pattern1 fill grestore
gsave 2836 2533 N 0 507 V 85 101 V 0 -480 V /TransparentPatterns true def
 Pattern1 fill grestore
gsave 2921 2661 N 0 480 V 86 95 V 0 -449 V /TransparentPatterns true def
 Pattern1 fill grestore
gsave 3007 2787 N 0 449 V 86 89 V 0 -414 V /TransparentPatterns true def
 Pattern1 fill grestore
gsave 3093 2911 N 0 414 V 86 85 V 0 -379 V /TransparentPatterns true def
 Pattern1 fill grestore
gsave 3179 3031 N 0 379 V 85 82 V 0 -344 V /TransparentPatterns true def
 Pattern1 fill grestore
gsave 3264 3148 N 0 344 V 86 85 V 0 -314 V /TransparentPatterns true def
 Pattern1 fill grestore
gsave 3350 3263 N 0 314 V 86 86 V 0 -289 V /TransparentPatterns true def
 Pattern1 fill grestore
gsave 3436 3374 N 0 289 V 85 86 V 0 -268 V /TransparentPatterns true def
 Pattern1 fill grestore
gsave 3521 3481 N 0 268 V 86 83 V 0 -249 V /TransparentPatterns true def
 Pattern1 fill grestore
gsave 3607 3583 N 0 249 V 86 78 V 0 -230 V /TransparentPatterns true def
 Pattern1 fill grestore
gsave 3693 3680 N 0 230 V 86 72 V 0 -211 V /TransparentPatterns true def
 Pattern1 fill grestore
gsave 3779 3771 N 0 211 V 85 66 V 0 -192 V /TransparentPatterns true def
 Pattern1 fill grestore
gsave 3864 3856 N 0 192 V 86 58 V 0 -171 V /TransparentPatterns true def
 Pattern1 fill grestore
gsave 3950 3935 N 0 171 V 86 52 V 0 -151 V /TransparentPatterns true def
 Pattern1 fill grestore
gsave 4036 4007 N 0 151 V 86 46 V 0 -131 V /TransparentPatterns true def
 Pattern1 fill grestore
gsave 4122 4073 N 0 131 V 85 40 V 0 -111 V /TransparentPatterns true def
 Pattern1 fill grestore
gsave 4207 4133 N 0 111 V 86 37 V 0 -94 V /TransparentPatterns true def
 Pattern1 fill grestore
gsave 4293 4187 N 0 94 V 86 35 V 0 -81 V /TransparentPatterns true def
 Pattern1 fill grestore
gsave 4379 4235 N 0 81 V 85 32 V 0 -69 V /TransparentPatterns true def
 Pattern1 fill grestore
gsave 4464 4279 N 0 69 V 86 28 V 0 -59 V /TransparentPatterns true def
 Pattern1 fill grestore
gsave 4550 4317 N 0 59 V 86 23 V 0 -50 V /TransparentPatterns true def
 Pattern1 fill grestore
gsave 4636 4349 N 0 50 V 86 19 V 0 -42 V /TransparentPatterns true def
 Pattern1 fill grestore
gsave 4722 4376 N 0 42 V 85 14 V 0 -33 V /TransparentPatterns true def
 Pattern1 fill grestore
gsave 4807 4399 N 0 33 V 86 11 V 0 -26 V /TransparentPatterns true def
 Pattern1 fill grestore
gsave 4893 4417 N 0 26 V 86 9 V 0 -20 V /TransparentPatterns true def
 Pattern1 fill grestore
gsave 4979 4432 N 0 20 V 85 8 V 0 -15 V /TransparentPatterns true def
 Pattern1 fill grestore
gsave 5064 4445 N 0 15 V 86 6 V 0 -11 V /TransparentPatterns true def
 Pattern1 fill grestore
gsave 5150 4455 N 0 11 V 86 5 V 0 -8 V /TransparentPatterns true def
 Pattern1 fill grestore
gsave 5236 4463 N 0 8 V 86 4 V 0 -6 V /TransparentPatterns true def
 Pattern1 fill grestore
gsave 5322 4469 N 0 6 V 85 3 V 0 -5 V /TransparentPatterns true def
 Pattern1 fill grestore
gsave 5407 4473 N 0 5 V 86 3 V 0 -4 V /TransparentPatterns true def
 Pattern1 fill grestore
gsave 5493 4477 N 0 4 V 86 1 V 0 -3 V /TransparentPatterns true def
 Pattern1 fill grestore
gsave 5579 4479 N 0 3 V 85 1 V 0 -2 V /TransparentPatterns true def
 Pattern1 fill grestore
gsave 5664 4481 N 0 2 V 86 1 V 0 -2 V /TransparentPatterns true def
 Pattern1 fill grestore
gsave 5750 4482 N 0 2 V 86 1 V 0 -2 V /TransparentPatterns true def
 Pattern1 fill grestore
gsave 5836 4483 N 0 2 V 86 0 V 0 -1 V /TransparentPatterns true def
 Pattern1 fill grestore
gsave 5922 4484 N 0 1 V 85 0 V 0 -1 V /TransparentPatterns true def
 Pattern1 fill grestore
gsave 6007 4484 N 0 1 V 86 0 V 0 0 V /TransparentPatterns true def
 Pattern1 fill grestore
gsave 6093 4485 N 0 0 V 86 0 V 0 0 V /TransparentPatterns true def
 Pattern1 fill grestore
gsave 6179 4485 N 0 0 V 42 0 V 0 0 V /TransparentPatterns true def
 Pattern1 fill grestore
% End plot #6
% Begin plot #7
1.000 UL
LT1
1122 1017 M
85 -35 V
86 -19 V
85 -1 V
86 15 V
86 31 V
86 47 V
85 63 V
86 79 V
86 90 V
86 100 V
85 105 V
86 110 V
86 116 V
85 120 V
86 127 V
86 131 V
86 133 V
85 134 V
86 134 V
86 133 V
85 131 V
86 128 V
86 112 V
86 105 V
85 103 V
86 103 V
86 102 V
85 99 V
86 96 V
86 92 V
86 86 V
85 81 V
86 76 V
86 69 V
86 64 V
85 57 V
86 53 V
86 47 V
85 43 V
86 37 V
86 32 V
86 27 V
85 22 V
86 19 V
86 15 V
85 13 V
86 10 V
86 9 V
86 6 V
85 5 V
86 4 V
86 2 V
85 2 V
86 2 V
86 1 V
86 1 V
85 0 V
86 1 V
86 0 V
42 0 V
% End plot #7
% Begin plot #8
1122 3537 M
85 -182 V
86 -148 V
85 -117 V
86 -93 V
86 -77 V
86 -68 V
85 -76 V
86 -74 V
86 -65 V
86 -41 V
85 2 V
86 33 V
86 57 V
85 67 V
86 61 V
86 62 V
86 64 V
85 71 V
86 81 V
86 85 V
85 86 V
86 80 V
86 74 V
86 71 V
85 70 V
86 75 V
86 79 V
85 80 V
86 79 V
86 73 V
86 68 V
85 61 V
86 55 V
86 48 V
86 42 V
85 37 V
86 34 V
86 33 V
85 30 V
86 27 V
86 23 V
86 17 V
85 13 V
stroke 4807 4434 M
86 10 V
86 8 V
85 8 V
86 6 V
86 5 V
86 4 V
85 3 V
86 3 V
86 1 V
85 1 V
86 1 V
86 1 V
86 0 V
85 0 V
86 0 V
86 0 V
42 0 V
% End plot #8
% Begin plot #9
stroke
LCb setrgbcolor
5150 963 M
[ [(Helvetica) 240.0 0.0 true true 0 (scheme \(c\))]
] -80.0 MRshow
LT1
5294 873 639 180 40 30 0 PatternFill
5294 873 N
639 0 V
0 180 V
-639 0 V
0 -180 V
Z stroke
LT1
gsave 1122 1017 N 0 2520 V 85 -182 V 0 -2373 V /TransparentPatterns true def
 Pattern6 fill grestore
gsave 1207 982 N 0 2373 V 86 -148 V 0 -2244 V /TransparentPatterns true def
 Pattern6 fill grestore
gsave 1293 963 N 0 2244 V 85 -117 V 0 -2128 V /TransparentPatterns true def
 Pattern6 fill grestore
gsave 1378 962 N 0 2128 V 86 -93 V 0 -2020 V /TransparentPatterns true def
 Pattern6 fill grestore
gsave 1464 977 N 0 2020 V 86 -77 V 0 -1912 V /TransparentPatterns true def
 Pattern6 fill grestore
gsave 1550 1008 N 0 1912 V 86 -68 V 0 -1797 V /TransparentPatterns true def
 Pattern6 fill grestore
gsave 1636 1055 N 0 1797 V 85 -76 V 0 -1658 V /TransparentPatterns true def
 Pattern6 fill grestore
gsave 1721 1118 N 0 1658 V 86 -74 V 0 -1505 V /TransparentPatterns true def
 Pattern6 fill grestore
gsave 1807 1197 N 0 1505 V 86 -65 V 0 -1350 V /TransparentPatterns true def
 Pattern6 fill grestore
gsave 1893 1287 N 0 1350 V 86 -41 V 0 -1209 V /TransparentPatterns true def
 Pattern6 fill grestore
gsave 1979 1387 N 0 1209 V 85 2 V 0 -1106 V /TransparentPatterns true def
 Pattern6 fill grestore
gsave 2064 1492 N 0 1106 V 86 33 V 0 -1029 V /TransparentPatterns true def
 Pattern6 fill grestore
gsave 2150 1602 N 0 1029 V 86 57 V 0 -970 V /TransparentPatterns true def
 Pattern6 fill grestore
gsave 2236 1718 N 0 970 V 85 67 V 0 -917 V /TransparentPatterns true def
 Pattern6 fill grestore
gsave 2321 1838 N 0 917 V 86 61 V 0 -851 V /TransparentPatterns true def
 Pattern6 fill grestore
gsave 2407 1965 N 0 851 V 86 62 V 0 -782 V /TransparentPatterns true def
 Pattern6 fill grestore
gsave 2493 2096 N 0 782 V 86 64 V 0 -713 V /TransparentPatterns true def
 Pattern6 fill grestore
gsave 2579 2229 N 0 713 V 85 71 V 0 -650 V /TransparentPatterns true def
 Pattern6 fill grestore
gsave 2664 2363 N 0 650 V 86 81 V 0 -597 V /TransparentPatterns true def
 Pattern6 fill grestore
gsave 2750 2497 N 0 597 V 86 85 V 0 -549 V /TransparentPatterns true def
 Pattern6 fill grestore
gsave 2836 2630 N 0 549 V 85 86 V 0 -504 V /TransparentPatterns true def
 Pattern6 fill grestore
gsave 2921 2761 N 0 504 V 86 80 V 0 -456 V /TransparentPatterns true def
 Pattern6 fill grestore
gsave 3007 2889 N 0 456 V 86 74 V 0 -418 V /TransparentPatterns true def
 Pattern6 fill grestore
gsave 3093 3001 N 0 418 V 86 71 V 0 -384 V /TransparentPatterns true def
 Pattern6 fill grestore
gsave 3179 3106 N 0 384 V 85 70 V 0 -351 V /TransparentPatterns true def
 Pattern6 fill grestore
gsave 3264 3209 N 0 351 V 86 75 V 0 -323 V /TransparentPatterns true def
 Pattern6 fill grestore
gsave 3350 3312 N 0 323 V 86 79 V 0 -300 V /TransparentPatterns true def
 Pattern6 fill grestore
gsave 3436 3414 N 0 300 V 85 80 V 0 -281 V /TransparentPatterns true def
 Pattern6 fill grestore
gsave 3521 3513 N 0 281 V 86 79 V 0 -264 V /TransparentPatterns true def
 Pattern6 fill grestore
gsave 3607 3609 N 0 264 V 86 73 V 0 -245 V /TransparentPatterns true def
 Pattern6 fill grestore
gsave 3693 3701 N 0 245 V 86 68 V 0 -227 V /TransparentPatterns true def
 Pattern6 fill grestore
gsave 3779 3787 N 0 227 V 85 61 V 0 -207 V /TransparentPatterns true def
 Pattern6 fill grestore
gsave 3864 3868 N 0 207 V 86 55 V 0 -186 V /TransparentPatterns true def
 Pattern6 fill grestore
gsave 3950 3944 N 0 186 V 86 48 V 0 -165 V /TransparentPatterns true def
 Pattern6 fill grestore
gsave 4036 4013 N 0 165 V 86 42 V 0 -143 V /TransparentPatterns true def
 Pattern6 fill grestore
gsave 4122 4077 N 0 143 V 85 37 V 0 -123 V /TransparentPatterns true def
 Pattern6 fill grestore
gsave 4207 4134 N 0 123 V 86 34 V 0 -104 V /TransparentPatterns true def
 Pattern6 fill grestore
gsave 4293 4187 N 0 104 V 86 33 V 0 -90 V /TransparentPatterns true def
 Pattern6 fill grestore
gsave 4379 4234 N 0 90 V 85 30 V 0 -77 V /TransparentPatterns true def
 Pattern6 fill grestore
gsave 4464 4277 N 0 77 V 86 27 V 0 -67 V /TransparentPatterns true def
 Pattern6 fill grestore
gsave 4550 4314 N 0 67 V 86 23 V 0 -58 V /TransparentPatterns true def
 Pattern6 fill grestore
gsave 4636 4346 N 0 58 V 86 17 V 0 -48 V /TransparentPatterns true def
 Pattern6 fill grestore
gsave 4722 4373 N 0 48 V 85 13 V 0 -39 V /TransparentPatterns true def
 Pattern6 fill grestore
gsave 4807 4395 N 0 39 V 86 10 V 0 -30 V /TransparentPatterns true def
 Pattern6 fill grestore
gsave 4893 4414 N 0 30 V 86 8 V 0 -23 V /TransparentPatterns true def
 Pattern6 fill grestore
gsave 4979 4429 N 0 23 V 85 8 V 0 -18 V /TransparentPatterns true def
 Pattern6 fill grestore
gsave 5064 4442 N 0 18 V 86 6 V 0 -14 V /TransparentPatterns true def
 Pattern6 fill grestore
gsave 5150 4452 N 0 14 V 86 5 V 0 -10 V /TransparentPatterns true def
 Pattern6 fill grestore
gsave 5236 4461 N 0 10 V 86 4 V 0 -8 V /TransparentPatterns true def
 Pattern6 fill grestore
gsave 5322 4467 N 0 8 V 85 3 V 0 -6 V /TransparentPatterns true def
 Pattern6 fill grestore
gsave 5407 4472 N 0 6 V 86 3 V 0 -5 V /TransparentPatterns true def
 Pattern6 fill grestore
gsave 5493 4476 N 0 5 V 86 1 V 0 -4 V /TransparentPatterns true def
 Pattern6 fill grestore
gsave 5579 4478 N 0 4 V 85 1 V 0 -3 V /TransparentPatterns true def
 Pattern6 fill grestore
gsave 5664 4480 N 0 3 V 86 1 V 0 -2 V /TransparentPatterns true def
 Pattern6 fill grestore
gsave 5750 4482 N 0 2 V 86 1 V 0 -2 V /TransparentPatterns true def
 Pattern6 fill grestore
gsave 5836 4483 N 0 2 V 86 0 V 0 -1 V /TransparentPatterns true def
 Pattern6 fill grestore
gsave 5922 4484 N 0 1 V 85 0 V 0 -1 V /TransparentPatterns true def
 Pattern6 fill grestore
gsave 6007 4484 N 0 1 V 86 0 V 0 0 V /TransparentPatterns true def
 Pattern6 fill grestore
gsave 6093 4485 N 0 0 V 86 0 V 0 0 V /TransparentPatterns true def
 Pattern6 fill grestore
gsave 6179 4485 N 0 0 V 42 0 V 0 0 V /TransparentPatterns true def
 Pattern6 fill grestore
% End plot #9
1.000 UL
LTb
1.000 UL
LTa
1122 720 M
5099 0 V
stroke
LTb
1122 720 M
63 0 V
5036 0 R
-63 0 V
stroke
978 720 M
[ [(Helvetica) 240.0 0.0 true true 0 (-0.2)]
] -80.0 MRshow
1.000 UL
LTb
1122 1034 M
31 0 V
5068 0 R
-31 0 V
stroke
LTa
1122 1348 M
2588 0 V
2367 0 R
144 0 V
stroke
LTb
1122 1348 M
63 0 V
5036 0 R
-63 0 V
stroke
978 1348 M
[ [(Helvetica) 240.0 0.0 true true 0 ( 0)]
] -80.0 MRshow
1.000 UL
LTb
1122 1661 M
31 0 V
5068 0 R
-31 0 V
stroke
LTa
1122 1975 M
5099 0 V
stroke
LTb
1122 1975 M
63 0 V
5036 0 R
-63 0 V
stroke
978 1975 M
[ [(Helvetica) 240.0 0.0 true true 0 ( 0.2)]
] -80.0 MRshow
1.000 UL
LTb
1122 2289 M
31 0 V
5068 0 R
-31 0 V
stroke
LTa
1122 2603 M
5099 0 V
stroke
LTb
1122 2603 M
63 0 V
5036 0 R
-63 0 V
stroke
978 2603 M
[ [(Helvetica) 240.0 0.0 true true 0 ( 0.4)]
] -80.0 MRshow
1.000 UL
LTb
1122 2916 M
31 0 V
5068 0 R
-31 0 V
stroke
LTa
1122 3230 M
5099 0 V
stroke
LTb
1122 3230 M
63 0 V
5036 0 R
-63 0 V
stroke
978 3230 M
[ [(Helvetica) 240.0 0.0 true true 0 ( 0.6)]
] -80.0 MRshow
1.000 UL
LTb
1122 3544 M
31 0 V
5068 0 R
-31 0 V
stroke
LTa
1122 3858 M
5099 0 V
stroke
LTb
1122 3858 M
63 0 V
5036 0 R
-63 0 V
stroke
978 3858 M
[ [(Helvetica) 240.0 0.0 true true 0 ( 0.8)]
] -80.0 MRshow
1.000 UL
LTb
1122 4171 M
31 0 V
5068 0 R
-31 0 V
stroke
LTa
1122 4485 M
5099 0 V
stroke
LTb
1122 4485 M
63 0 V
5036 0 R
-63 0 V
stroke
978 4485 M
[ [(Helvetica) 240.0 0.0 true true 0 ( 1)]
] -80.0 MRshow
1.000 UL
LTb
1122 4799 M
31 0 V
5068 0 R
-31 0 V
stroke
LTa
1122 720 M
0 4079 V
stroke
LTb
1122 720 M
0 63 V
0 4016 R
0 -63 V
stroke
1122 480 M
[ [(Helvetica) 240.0 0.0 true true 0 ( 0.01)]
] -80.0 MCshow
1.000 UL
LTb
1691 720 M
0 31 V
0 4048 R
0 -31 V
2023 720 M
0 31 V
0 4048 R
0 -31 V
2259 720 M
0 31 V
0 4048 R
0 -31 V
2443 720 M
0 31 V
0 4048 R
0 -31 V
2592 720 M
0 31 V
0 4048 R
0 -31 V
2719 720 M
0 31 V
0 4048 R
0 -31 V
2828 720 M
0 31 V
0 4048 R
0 -31 V
2925 720 M
0 31 V
0 4048 R
0 -31 V
stroke
LTa
3011 720 M
0 4079 V
stroke
LTb
3011 720 M
0 63 V
0 4016 R
0 -63 V
stroke
3011 480 M
[ [(Helvetica) 240.0 0.0 true true 0 ( 0.1)]
] -80.0 MCshow
1.000 UL
LTb
3580 720 M
0 31 V
0 4048 R
0 -31 V
3913 720 M
0 31 V
0 4048 R
0 -31 V
4149 720 M
0 31 V
0 4048 R
0 -31 V
4332 720 M
0 31 V
0 4048 R
0 -31 V
4481 720 M
0 31 V
0 4048 R
0 -31 V
4608 720 M
0 31 V
0 4048 R
0 -31 V
4717 720 M
0 31 V
0 4048 R
0 -31 V
4814 720 M
0 31 V
0 4048 R
0 -31 V
stroke
LTa
4900 720 M
0 63 V
0 1080 R
0 2936 V
stroke
LTb
4900 720 M
0 63 V
0 4016 R
0 -63 V
stroke
4900 480 M
[ [(Helvetica) 240.0 0.0 true true 0 ( 1)]
] -80.0 MCshow
1.000 UL
LTb
5469 720 M
0 31 V
0 4048 R
0 -31 V
5802 720 M
0 31 V
0 4048 R
0 -31 V
6038 720 M
0 31 V
0 4048 R
0 -31 V
6221 720 M
0 31 V
0 4048 R
0 -31 V
stroke
1122 4799 N
0 -4079 V
5099 0 V
0 4079 V
-5099 0 V
Z stroke
1.000 UP
4.000 UL
LT7
3580 720 M
0 4079 V
stroke
1.000 UL
LTb
stroke
grestore
end
showpage
%%EOF
