%!PS-Adobe-2.0 EPSF-2.0
%%BoundingBox:  0 0 567 407
%%Title: /Volumes/Dani'sHD/mac-Work/Documents/LaTex/BRNote/4fNumbers/YRHXS_BR_fig4.eps: Higgs Cross Section
%%Creator: ROOT Version 5.28/00c
%%CreationDate: Fri Nov 25 15:25:43 2011
%%EndComments
%%BeginProlog
80 dict begin
/s {stroke} def /l {lineto} def /m {moveto} def /t {translate} def
/r {rotate} def /rl {roll}  def /R {repeat} def
/d {rlineto} def /rm {rmoveto} def /gr {grestore} def /f {eofill} def
/c {setrgbcolor} def /black {0 setgray} def /sd {setdash} def
/cl {closepath} def /sf {scalefont setfont} def /lw {setlinewidth} def
/box {m dup 0 exch d exch 0 d 0 exch neg d cl} def
/NC{systemdict begin initclip end}def/C{NC box clip newpath}def
/bl {box s} def /bf {box f} def /Y { 0 exch d} def /X { 0 d} def 
/K {{pop pop 0 moveto} exch kshow} bind def
/ita {/ang 15 def gsave [1 0 ang dup sin exch cos div 1 0 0] concat} def 
/mp {newpath /y exch def /x exch def} def
/side {[w .77 mul w .23 mul] .385 w mul sd w 0 l currentpoint t -144 r} def
/mr {mp x y w2 0 360 arc} def /m24 {mr s} def /m20 {mr f} def
/mb {mp x y w2 add m w2 neg 0 d 0 w neg d w 0 d 0 w d cl} def
/mt {mp x y w2 add m w2 neg w neg d w 0 d cl} def
/m21 {mb f} def /m25 {mb s} def /m22 {mt f} def /m26{mt s} def
/m23 {mp x y w2 sub m w2 w d w neg 0 d cl f} def
/m27 {mp x y w2 add m w3 neg w2 neg d w3 w2 neg d w3 w2 d cl s} def
/m28 {mp x w2 sub y w2 sub w3 add m w3 0 d  0 w3 neg d w3 0 d 0 w3 d w3 0 d  0 w3 d w3 neg 0 d 0 w3 d w3 neg 0 d 0 w3 neg d w3 neg 0 d cl s } def
/m29 {mp gsave x w2 sub y w2 add w3 sub m currentpoint t 4 {side} repeat cl fill gr} def
/m30 {mp gsave x w2 sub y w2 add w3 sub m currentpoint t 4 {side} repeat cl s gr} def
/m31 {mp x y w2 sub m 0 w d x w2 sub y m w 0 d x w2 sub y w2 add m w w neg d x w2 sub y w2 sub m w w d s} def
/m32 {mp x y w2 sub m w2 w d w neg 0 d cl s} def
/m33 {mp x y w2 add m w3 neg w2 neg d w3 w2 neg d w3 w2 d cl f} def
/m34 {mp x w2 sub y w2 sub w3 add m w3 0 d  0 w3 neg d w3 0 d 0 w3 d w3 0 d  0 w3 d w3 neg 0 d 0 w3 d w3 neg 0 d 0 w3 neg d w3 neg 0 d cl f } def
/m2 {mp x y w2 sub m 0 w d x w2 sub y m w 0 d s} def
/m5 {mp x w2 sub y w2 sub m w w d x w2 sub y w2 add m w w neg d s} def
/reEncode {exch findfont dup length dict begin {1 index /FID eq  {pop pop} {def} ifelse } forall /Encoding exch def currentdict end dup /FontName get exch definefont pop } def [/Times-Bold /Times-Italic /Times-BoldItalic /Helvetica /Helvetica-Oblique
 /Helvetica-Bold /Helvetica-BoldOblique /Courier /Courier-Oblique /Courier-Bold /Courier-BoldOblique /Times-Roman /AvantGarde-Book /AvantGarde-BookOblique /AvantGarde-Demi /AvantGarde-DemiOblique /Bookman-Demi /Bookman-DemiItalic /Bookman-Light
 /Bookman-LightItalic /Helvetica-Narrow /Helvetica-Narrow-Bold /Helvetica-Narrow-BoldOblique /Helvetica-Narrow-Oblique /NewCenturySchlbk-Roman /NewCenturySchlbk-Bold /NewCenturySchlbk-BoldItalic /NewCenturySchlbk-Italic /Palatino-Bold
 /Palatino-BoldItalic /Palatino-Italic /Palatino-Roman ] {ISOLatin1Encoding reEncode } forall%%EndProlog
%%BeginSetup
%%EndSetup
newpath  gsave  .25 .25 scale  gsave  0 0 t black[  ] 0 sd 3 lw 1 1 1 c 2268 1630 0 0 bf black 1 1 1 c 1882 1385 272 196 bf black 1882 1385 272 196 bl 1 1 1 c 1882 1385 272 196 bf black 1882 1385 272 196 bl 272 196 m 1882 X s
 gsave  2268 1630 0 0 C 1940.09 59.8267 t 0 r /Helvetica findfont 76.92 sf 0 0 m ( [GeV]) show NC gr 
 gsave  2268 1630 0 0 C 1905.91 39.8845 t 0 r /Helvetica findfont 51.28 sf 0 0 m (H) show NC gr 
 gsave  2268 1630 0 0 C 1846.08 59.8267 t 0 r /Helvetica findfont 76.92 sf 0 0 m (M) show NC gr  354 236 m -40 Y s
 gsave  2268 1630 0 0 C 354.481 120.588 t 0 r  -63 0 t /Helvetica findfont 76.92 sf 0 0 m (100) show NC gr  896 216 m -20 Y s
 gsave  2268 1630 0 0 C 831.876 122.502 t 0 r /Helvetica findfont 76.92 sf 0 0 m (200) show NC gr  1213 216 m -20 Y s
 gsave  2268 1630 0 0 C 1148.1 122.502 t 0 r /Helvetica findfont 76.92 sf 0 0 m (300) show NC gr  1438 216 m -20 Y s
 gsave  2268 1630 0 0 C 1373.17 122.502 t 0 r /Helvetica findfont 76.92 sf 0 0 m (400) show NC gr  1613 216 m -20 Y s
 gsave  2268 1630 0 0 C 1549.8 122.502 t 0 r /Helvetica findfont 76.92 sf 0 0 m (500) show NC gr  1755 216 m -20 Y s 1876 216 m -20 Y s 1980 216 m -20 Y s 2072 216 m -20 Y s 2154 236 m -40 Y s
 gsave  2268 1630 0 0 C 2154.33 120.588 t 0 r  -84 0 t /Helvetica findfont 76.92 sf 0 0 m (1000) show NC gr  272 1581 m 1882 X s 354 1540 m 41 Y s 896 1560 m 21 Y s 1213 1560 m 21 Y s 1438 1560 m 21 Y s 1613 1560 m 21 Y s 1755 1560 m 21 Y s 1876 1560
 m 21 Y s 1980 1560 m 21 Y s 2072 1560 m 21 Y s 2154 1540 m 41 Y s 272 196 m 1385 Y s
 gsave  2268 1630 0 0 C 108.258 757.805 t 90 r /Helvetica findfont 76.92 sf 0 0 m 
 790 765 723 685 643 588 567 550 507 486 444 406 386 342 321 266 215 194 156 114 71 54
(Higgs BR + Total Uncert) K NC gr  330 196 m -58 X s
 gsave  2268 1630 0 0 C 205.12 196.573 t 0 r /Helvetica findfont 51.28 sf 0 0 m (\2555) show NC gr 
 gsave  2268 1630 0 0 C 122.502 159.538 t 0 r /Helvetica findfont 76.92 sf 0 0 m (10) show NC gr  301 278 m -29 X s 301 327 m -29 X s 301 361 m -29 X s 301 388 m -29 X s 301 409 m -29 X s 301 428 m -29 X s 301 444 m -29 X s 301 458 m -29 X s 330 470
 m -58 X s
 gsave  2268 1630 0 0 C 205.12 470.067 t 0 r /Helvetica findfont 51.28 sf 0 0 m (\2554) show NC gr 
 gsave  2268 1630 0 0 C 122.502 435.88 t 0 r /Helvetica findfont 76.92 sf 0 0 m (10) show NC gr  301 553 m -29 X s 301 601 m -29 X s 301 636 m -29 X s 301 662 m -29 X s 301 684 m -29 X s 301 702 m -29 X s 301 718 m -29 X s 301 732 m -29 X s 330 745 m
 -58 X s
 gsave  2268 1630 0 0 C 205.12 746.409 t 0 r /Helvetica findfont 51.28 sf 0 0 m (\2553) show NC gr 
 gsave  2268 1630 0 0 C 122.502 709.374 t 0 r /Helvetica findfont 76.92 sf 0 0 m (10) show NC gr  301 828 m -29 X s 301 876 m -29 X s 301 910 m -29 X s 301 937 m -29 X s 301 959 m -29 X s 301 977 m -29 X s 301 993 m -29 X s 301 1007 m -29 X s 330
 1020 m -58 X s
 gsave  2268 1630 0 0 C 205.12 1017.05 t 0 r /Helvetica findfont 51.28 sf 0 0 m (\2552) show NC gr 
 gsave  2268 1630 0 0 C 122.502 982.867 t 0 r /Helvetica findfont 76.92 sf 0 0 m (10) show NC gr  301 1103 m -29 X s 301 1151 m -29 X s 301 1185 m -29 X s 301 1212 m -29 X s 301 1234 m -29 X s 301 1252 m -29 X s 301 1268 m -29 X s 301 1282 m -29 X s
 330 1295 m -58 X s
 gsave  2268 1630 0 0 C 213.667 1293.4 t 0 r /Helvetica findfont 51.28 sf 0 0 m (\2551) show NC gr 
 gsave  2268 1630 0 0 C 131.049 1259.21 t 0 r /Helvetica findfont 76.92 sf 0 0 m (10) show NC gr  301 1377 m -29 X s 301 1426 m -29 X s 301 1460 m -29 X s 301 1487 m -29 X s 301 1508 m -29 X s 301 1527 m -29 X s 301 1543 m -29 X s 301 1557 m -29 X s
 330 1569 m -58 X s
 gsave  2268 1630 0 0 C 251.717 1537.4 t 0 r  -42 0 t /Helvetica findfont 76.92 sf 0 0 m (1) show NC gr  2154 196 m 1385 Y s 2097 196 m 57 X s 2125 278 m 29 X s 2125 327 m 29 X s 2125 361 m 29 X s 2125 388 m 29 X s 2125 409 m 29 X s 2125 428 m 29 X s
 2125 444 m 29 X s 2125 458 m 29 X s 2097 470 m 57 X s 2125 553 m 29 X s 2125 601 m 29 X s 2125 636 m 29 X s 2125 662 m 29 X s 2125 684 m 29 X s 2125 702 m 29 X s 2125 718 m 29 X s 2125 732 m 29 X s 2097 745 m 57 X s 2125 828 m 29 X s 2125 876 m 29 X
 s 2125 910 m 29 X s 2125 937 m 29 X s 2125 959 m 29 X s 2125 977 m 29 X s 2125 993 m 29 X s 2125 1007 m 29 X s 2097 1020 m 57 X s 2125 1103 m 29 X s 2125 1151 m 29 X s 2125 1185 m 29 X s 2125 1212 m 29 X s 2125 1234 m 29 X s 2125 1252 m 29 X s 2125
 1268 m 29 X s 2125 1282 m 29 X s 2097 1295 m 57 X s 2125 1377 m 29 X s 2125 1426 m 29 X s 2125 1460 m 29 X s 2125 1487 m 29 X s 2125 1508 m 29 X s 2125 1527 m 29 X s 2125 1543 m 29 X s 2125 1557 m 29 X s 2097 1569 m 57 X s 335 196 m 19 29 d s 354
 225 m 39 74 d 36 82 d 4 8 d 3 8 d 4 8 d 3 8 d 4 8 d 3 8 d 3 8 d 4 8 d 3 8 d 4 8 d 3 7 d 3 8 d 4 7 d 3 7 d 4 7 d 3 8 d 3 6 d 3 7 d 4 7 d 3 7 d 3 6 d 3 7 d 4 6 d 3 6 d 3 6 d 3 6 d 3 6 d 4 5 d 3 6 d 3 5 d 3 6 d 3 5 d 3 5 d 3 5 d 3 5 d 3 5 d 3 5 d 4 4 d
 3 5 d 3 4 d 3 4 d 3 4 d 3 4 d 2 4 d 3 4 d 3 4 d 3 3 d 3 4 d 3 3 d 3 3 d 3 3 d 3 4 d 3 2 d 3 3 d 2 3 d 3 3 d 3 2 d 3 3 d 3 2 d 2 2 d 6 4 d 6 4 d 5 4 d 6 2 d 5 3 d 5 2 d 6 1 d 5 1 d 5 1 d 5 X 6 -1 d 5 -2 d 5 -3 d 5 -3 d 5 -6 d 5 -7 d 5 -9 d 5 -13 d 5
 -17 d 5 -22 d 10 -46 d 9 -24 d 10 -7 d 9 2 d 9 7 d 9 12 d 9 16 d 9 21 d 9 26 d 9 37 d 9 47 d 8 45 d 9 28 d 8 17 d 8 11 d 8 8 d 8 5 d 8 4 d 8 4 d 8 3 d 8 2 d 8 2 d 7 1 d 8 2 d 7 1 d 8 1 d 7 1 d 7 1 d 8 X 7 1 d 7 1 d 7 X 7 1 d 14 X 6 1 d 7 X 7 1 d 19
 X 7 1 d 19 X 6 1 d 24 X 6 1 d 30 X 5 1 d 34 X 5 1 d 32 X 13 1 d 50 X 12 1 d 34 X 12 -2 d 22 -4 d 21 -4 d 21 -3 d 20 -2 d 20 -2 d 19 -2 d 19 -1 d 19 -1 d 35 X 17 -1 d 17 X 17 1 d 32 X 15 1 d 15 X 15 1 d 15 X 14 1 d 14 X 14 1 d 14 X 13 1 d 13 X 13 1 d
 13 1 d 12 X 12 1 d 13 X 12 1 d 11 X 12 1 d 11 X 12 1 d 11 X 11 1 d 10 X 11 1 d 10 X 11 1 d 10 X 10 1 d 10 X 10 1 d 19 X 10 1 d 18 X 9 1 d 18 X 9 1 d 18 X 8 1 d 17 X 8 1 d 17 X 8 1 d 15 X s 336 196 m 7 10 d s 343 206 m 11 19 d 15 27 d 16 32 d 8 15 d
 14 32 d 22 50 d 4 8 d 3 8 d 4 8 d 3 8 d 4 8 d 3 8 d 3 8 d 4 8 d 3 8 d 4 8 d 3 7 d 3 8 d 4 7 d 3 7 d 4 7 d 3 8 d 3 6 d 3 7 d 4 7 d 3 7 d 3 6 d 3 7 d 4 6 d 3 6 d 3 6 d 3 6 d 3 6 d 4 5 d 3 6 d 3 5 d 3 6 d 3 5 d 3 5 d 3 5 d 3 5 d 3 5 d 3 5 d 4 4 d 3 5 d
 3 4 d 3 4 d 3 4 d 3 4 d 2 4 d 3 4 d 3 4 d 3 3 d 3 4 d 3 3 d 3 3 d 3 3 d 3 4 d 3 2 d 3 3 d 2 3 d 3 3 d 3 2 d 3 3 d 3 2 d 2 2 d 6 4 d 6 4 d 5 4 d 6 2 d 5 3 d 5 2 d 6 1 d 5 1 d 5 1 d 5 X 6 -1 d 5 -2 d 5 -3 d 5 -3 d 5 -6 d 5 -7 d 5 -9 d 4 -9 d 1 -4 d 4
 -11 d 1 -6 d 5 -22 d 9 -43 d 1 -3 d 3 -11 d 3 -7 d 3 -6 d 3 -4 d 5 -2 d 2 -1 d 5 X 4 2 d 6 4 d 3 3 d 7 8 d 2 4 d 7 11 d 2 5 d 6 12 d 3 9 d 5 13 d 4 13 d 4 16 d 4 18 d 1 3 d 3 16 d 6 31 d 6 34 d 2 11 d 3 13 d 4 12 d 2 3 d 3 8 d 5 9 d 6 8 d 2 3 d 8 8
 d 8 5 d 8 4 d 8 4 d 8 3 d 8 2 d 8 2 d 7 1 d 8 2 d 7 1 d 8 1 d 7 1 d 7 1 d 8 X 7 1 d 7 1 d 7 X 7 1 d 14 X 6 1 d 7 X 7 1 d 19 X 7 1 d 19 X 6 1 d 24 X 6 1 d 30 X 5 1 d 34 X 5 1 d 32 X 13 1 d 50 X 12 1 d 34 X 12 -2 d 22 -4 d 21 -4 d 21 -3 d 20 -2 d 20
 -2 d 19 -2 d 19 -1 d 19 -1 d 35 X 17 -1 d 17 X 17 1 d 32 X 15 1 d 15 X 15 1 d 15 X 14 1 d 14 X 14 1 d 14 X 13 1 d 13 X 13 1 d 13 1 d 12 X 12 1 d 13 X 12 1 d 11 X 12 1 d 11 X 12 1 d 11 X 11 1 d 10 X 11 1 d 10 X 11 1 d 10 X 10 1 d 10 X 10 1 d 19 X 10
 1 d 18 X 9 1 d 18 X 9 1 d 18 X 8 1 d 17 X 8 1 d 17 X 8 1 d 15 X s 0.4 0.4 0.4 c black 0.4 0.4 0.4 c 333 196 m 21 32 d 39 74 d 36 82 d 4 8 d 3 8 d 4 8 d 3 8 d 4 8 d 3 8 d 3 8 d 4 8 d 3 8 d 4 7 d 3 8 d 3 7 d 4 8 d 3 7 d 4 7 d 3 7 d 3 7 d 3 7 d 4 7 d 3
 6 d 3 7 d 3 6 d 4 6 d 3 7 d 3 6 d 3 5 d 3 6 d 4 6 d 3 5 d 3 6 d 3 5 d 3 5 d 3 6 d 3 4 d 3 5 d 3 5 d 3 5 d 4 4 d 3 5 d 3 4 d 3 4 d 3 4 d 3 4 d 2 4 d 3 4 d 3 4 d 3 3 d 3 3 d 3 4 d 3 3 d 3 3 d 3 3 d 3 3 d 3 3 d 2 2 d 3 3 d 3 2 d 3 3 d 3 2 d 2 2 d 6 4 d
 6 4 d 5 3 d 6 3 d 5 2 d 5 2 d 6 2 d 5 1 d 10 X 6 -1 d 5 -2 d 5 -2 d 5 -4 d 5 -5 d 5 -7 d 5 -10 d 5 -13 d 5 -17 d 5 -22 d 10 -46 d 9 -24 d 10 -7 d 9 2 d 9 8 d 9 11 d 9 16 d 9 21 d 9 26 d 9 37 d 9 47 d 8 45 d 9 28 d 8 17 d 8 11 d 8 8 d 8 5 d 8 4 d 8 4
 d 8 3 d 8 2 d 8 2 d 7 1 d 8 2 d 7 1 d 8 1 d 7 1 d 7 1 d 8 X 7 1 d 7 1 d 7 X 7 1 d 14 X 6 1 d 7 X 7 1 d 19 X 7 1 d 19 X 6 1 d 24 X 6 1 d 30 X 5 1 d 34 X 5 1 d 32 X 13 1 d 50 X 12 1 d 34 X 12 -1 d 22 -4 d 21 -3 d 21 -3 d 20 -2 d 20 -2 d 19 -1 d 19 -1
 d 19 -1 d 18 X 17 -1 d 34 X 17 1 d 47 X 15 1 d 15 X 15 1 d 14 X 14 1 d 14 X 14 1 d 13 1 d 13 X 13 1 d 13 X 12 1 d 12 X 13 1 d 12 1 d 11 X 12 1 d 11 X 12 1 d 11 X 11 1 d 10 X 11 1 d 10 X 11 1 d 10 X 10 1 d 20 X 10 1 d 9 X 10 1 d 18 X 9 1 d 18 X 9 1 d
 9 X 9 1 d 25 X 8 1 d 17 X 8 1 d 15 X -5 Y -23 X -9 -1 d -16 X -8 -1 d -26 X -9 -1 d -18 X -9 -1 d -18 X -9 -1 d -19 X -10 -1 d -20 X -10 -1 d -10 X -11 -1 d -10 X -11 -1 d -10 X -11 -1 d -11 X -12 -1 d -11 X -12 -1 d -11 X -12 -1 d -13 -1 d -12 X
 -12 -1 d -13 X -13 -1 d -13 X -13 -1 d -14 -1 d -14 X -14 -1 d -14 X -15 -1 d -15 X -15 -1 d -15 X -16 -1 d -84 X -18 1 d -19 1 d -19 1 d -19 1 d -20 3 d -20 2 d -21 4 d -21 4 d -22 4 d -12 2 d -34 X -12 -1 d -50 X -13 -1 d -32 X -5 -1 d -34 X -5 -1
 d -30 X -6 -1 d -24 X -6 -1 d -19 X -7 -1 d -19 X -7 -1 d -7 X -6 -1 d -14 X -7 -1 d -7 X -7 -1 d -7 -1 d -8 X -7 -1 d -7 -1 d -8 -1 d -7 -1 d -8 -2 d -7 -1 d -8 -2 d -8 -2 d -8 -3 d -8 -4 d -8 -4 d -8 -5 d -8 -8 d -8 -11 d -8 -17 d -9 -28 d -8 -45
 d -9 -48 d -9 -36 d -9 -27 d -9 -20 d -9 -16 d -9 -12 d -9 -7 d -9 -2 d -10 7 d -9 24 d -10 46 d -5 22 d -5 17 d -5 13 d -5 9 d -5 7 d -5 5 d -5 4 d -5 3 d -5 1 d -6 1 d -10 X -5 -1 d -6 -2 d -5 -2 d -5 -2 d -6 -3 d -5 -3 d -6 -4 d -6 -4 d -2 -3 d
 -3 -2 d -3 -3 d -3 -2 d -3 -3 d -2 -3 d -3 -3 d -3 -3 d -3 -3 d -3 -3 d -3 -4 d -3 -3 d -3 -4 d -3 -3 d -3 -4 d -3 -4 d -2 -4 d -3 -4 d -3 -4 d -3 -4 d -3 -5 d -3 -4 d -4 -5 d -3 -4 d -3 -5 d -3 -5 d -3 -5 d -3 -5 d -3 -6 d -3 -5 d -3 -5 d -3 -6 d
 -4 -6 d -3 -6 d -3 -5 d -3 -7 d -3 -6 d -4 -6 d -3 -6 d -3 -7 d -3 -7 d -4 -6 d -3 -7 d -3 -7 d -3 -7 d -4 -8 d -3 -7 d -4 -7 d -3 -8 d -3 -7 d -4 -8 d -3 -8 d -4 -8 d -3 -7 d -3 -8 d -4 -9 d -3 -8 d -4 -8 d -3 -8 d -4 -8 d -36 -82 d -39 -74 d -17
 -26 d f black 335 196 m 19 29 d s 354 225 m 39 74 d 36 82 d 4 8 d 3 8 d 4 8 d 3 8 d 4 8 d 3 8 d 3 8 d 4 8 d 3 8 d 4 8 d 3 7 d 3 8 d 4 7 d 3 7 d 4 7 d 3 8 d 3 6 d 3 7 d 4 7 d 3 7 d 3 6 d 3 7 d 4 6 d 3 6 d 3 6 d 3 6 d 3 6 d 4 5 d 3 6 d 3 5 d 3 6 d 3 5
 d 3 5 d 3 5 d 3 5 d 3 5 d 3 5 d 4 4 d 3 5 d 3 4 d 3 4 d 3 4 d 3 4 d 2 4 d 3 4 d 3 4 d 3 3 d 3 4 d 3 3 d 3 3 d 3 3 d 3 4 d 3 2 d 3 3 d 2 3 d 3 3 d 3 2 d 3 3 d 3 2 d 2 2 d 6 4 d 6 4 d 5 4 d 6 2 d 5 3 d 5 2 d 6 1 d 5 1 d 5 1 d 5 X 6 -1 d 5 -2 d 5 -3 d
 5 -3 d 5 -6 d 5 -7 d 5 -9 d 5 -13 d 5 -17 d 5 -22 d 10 -46 d 9 -24 d 10 -7 d 9 2 d 9 7 d 9 12 d 9 16 d 9 21 d 9 26 d 9 37 d 9 47 d 8 45 d 9 28 d 8 17 d 8 11 d 8 8 d 8 5 d 8 4 d 8 4 d 8 3 d 8 2 d 8 2 d 7 1 d 8 2 d 7 1 d 8 1 d 7 1 d 7 1 d 8 X 7 1 d 7
 1 d 7 X 7 1 d 14 X 6 1 d 7 X 7 1 d 19 X 7 1 d 19 X 6 1 d 24 X 6 1 d 30 X 5 1 d 34 X 5 1 d 32 X 13 1 d 50 X 12 1 d 34 X 12 -2 d 22 -4 d 21 -4 d 21 -3 d 20 -2 d 20 -2 d 19 -2 d 19 -1 d 19 -1 d 35 X 17 -1 d 17 X 17 1 d 32 X 15 1 d 15 X 15 1 d 15 X 14 1
 d 14 X 14 1 d 14 X 13 1 d 13 X 13 1 d 13 1 d 12 X 12 1 d 13 X 12 1 d 11 X 12 1 d 11 X 12 1 d 11 X 11 1 d 10 X 11 1 d 10 X 11 1 d 10 X 10 1 d 10 X 10 1 d 19 X 10 1 d 18 X 9 1 d 18 X 9 1 d 18 X 8 1 d 17 X 8 1 d 17 X 8 1 d 15 X s 386 196 m 7 12 d s 393
 208 m 36 80 d 4 8 d 3 9 d 4 8 d 3 8 d 4 8 d 3 7 d 3 8 d 4 8 d 3 8 d 4 7 d 3 8 d 3 7 d 4 7 d 3 7 d 4 7 d 3 7 d 3 7 d 3 7 d 4 7 d 3 6 d 3 7 d 3 6 d 4 6 d 3 6 d 3 6 d 3 6 d 3 6 d 4 6 d 3 5 d 3 6 d 3 5 d 3 5 d 3 5 d 3 5 d 3 5 d 3 5 d 3 4 d 4 5 d 3 4 d 3
 5 d 3 4 d 3 4 d 3 4 d 2 4 d 3 4 d 3 3 d 3 4 d 3 3 d 3 4 d 3 3 d 3 3 d 3 3 d 3 3 d 3 3 d 2 3 d 3 2 d 3 3 d 3 2 d 3 2 d 2 3 d 6 4 d 6 4 d 5 3 d 6 3 d 5 2 d 5 2 d 6 2 d 5 1 d 10 X 6 -1 d 5 -2 d 5 -3 d 5 -3 d 5 -6 d 5 -7 d 5 -9 d 5 -13 d 5 -17 d 5 -22 d
 10 -46 d 9 -24 d 10 -7 d 9 2 d 9 7 d 9 12 d 9 16 d 9 20 d 9 27 d 9 36 d 9 48 d 8 45 d 9 28 d 8 16 d 8 11 d 8 8 d 8 5 d 8 5 d 8 3 d 8 3 d 8 2 d 8 2 d 7 2 d 8 1 d 7 1 d 8 1 d 7 1 d 7 1 d 8 1 d 7 X 7 1 d 7 X 7 1 d 7 X 7 1 d 13 X 7 1 d 13 X 6 1 d 19 X 7
 1 d 24 X 6 1 d 24 X 6 1 d 34 X 5 1 d 30 X 13 1 d 51 X 12 1 d 46 X 12 -1 d 22 -5 d 21 -3 d 21 -4 d 20 -2 d 20 -2 d 19 -2 d 19 -1 d 19 X 18 -1 d 100 X 15 1 d 15 X 15 1 d 15 X 14 1 d 14 X 14 1 d 14 1 d 13 X 13 1 d 13 X 13 1 d 12 X 12 1 d 13 1 d 12 X 11
 1 d 12 X 11 1 d 12 X 11 1 d 11 X 10 1 d 11 X 10 1 d 21 X 10 1 d 10 X 10 1 d 10 X 9 1 d 19 X 9 1 d 18 X 9 1 d 18 X 9 1 d 17 X 8 1 d 16 X 9 1 d 23 X s 1 0 0 c black 1 0 0 c 384 196 m 9 15 d 36 80 d 4 8 d 3 8 d 4 8 d 3 8 d 4 8 d 3 8 d 3 8 d 4 8 d 3 7 d
 4 8 d 3 7 d 3 8 d 4 7 d 3 7 d 4 7 d 3 7 d 3 7 d 3 7 d 4 7 d 3 6 d 3 6 d 3 7 d 4 6 d 3 6 d 3 6 d 3 6 d 3 6 d 4 5 d 3 6 d 3 5 d 3 5 d 3 5 d 3 6 d 3 4 d 3 5 d 3 5 d 3 5 d 4 4 d 3 5 d 3 4 d 3 4 d 3 4 d 3 4 d 2 4 d 3 4 d 3 3 d 3 4 d 3 3 d 3 3 d 3 4 d 3 3
 d 3 3 d 3 2 d 3 3 d 2 3 d 3 2 d 3 3 d 3 2 d 3 2 d 2 2 d 6 4 d 6 4 d 5 3 d 6 3 d 5 3 d 5 2 d 6 1 d 5 1 d 10 X 6 -1 d 5 -2 d 5 -2 d 5 -4 d 5 -5 d 5 -7 d 5 -10 d 5 -13 d 5 -17 d 5 -22 d 10 -46 d 9 -24 d 10 -7 d 9 2 d 9 7 d 9 12 d 9 16 d 9 20 d 9 27 d 9
 36 d 9 48 d 8 45 d 9 28 d 8 16 d 8 11 d 8 8 d 8 5 d 8 5 d 8 3 d 8 3 d 8 2 d 8 2 d 7 2 d 8 1 d 7 1 d 8 1 d 7 1 d 7 1 d 8 1 d 7 X 7 1 d 7 X 7 1 d 7 X 7 1 d 13 X 7 1 d 13 X 6 1 d 19 X 7 1 d 24 X 6 1 d 24 X 6 1 d 34 X 5 1 d 30 X 13 1 d 38 X 13 1 d 58 X
 12 -1 d 22 -4 d 21 -3 d 21 -3 d 20 -2 d 20 -2 d 19 -1 d 19 -1 d 19 -1 d 118 X 15 1 d 30 X 15 1 d 14 1 d 14 X 14 1 d 14 X 13 1 d 13 X 13 1 d 13 1 d 12 X 12 1 d 13 X 12 1 d 11 X 12 1 d 11 X 12 1 d 11 X 11 1 d 10 X 11 1 d 10 X 11 1 d 10 X 10 1 d 10 X
 10 1 d 19 X 10 1 d 9 X 9 1 d 18 X 9 1 d 18 X 9 1 d 17 X 8 1 d 16 X 9 1 d 23 X -4 Y -8 -1 d -24 X -8 -1 d -16 X -9 -1 d -26 X -9 -1 d -18 X -9 -1 d -18 X -10 -1 d -9 X -10 -1 d -20 X -10 -1 d -10 X -11 -1 d -10 X -11 -1 d -10 X -11 -1 d -11 X -12 -1
 d -11 X -12 -1 d -11 X -12 -1 d -13 X -12 -1 d -12 X -13 -1 d -13 -1 d -13 X -13 -1 d -14 X -14 -1 d -14 X -14 -1 d -15 -1 d -30 X -15 -1 d -16 -1 d -67 X -17 1 d -18 X -19 1 d -19 1 d -19 2 d -20 2 d -20 3 d -21 3 d -21 4 d -22 4 d -12 2 d -46 X
 -12 -1 d -51 X -13 -1 d -30 X -5 -1 d -34 X -6 -1 d -24 X -6 -1 d -24 X -7 -1 d -19 X -6 -1 d -13 X -7 -1 d -13 X -7 -1 d -7 X -7 -1 d -7 X -7 -1 d -7 X -8 -1 d -7 -1 d -7 -1 d -8 -1 d -7 -1 d -8 -1 d -7 -2 d -8 -2 d -8 -2 d -8 -3 d -8 -3 d -8 -5 d
 -8 -5 d -8 -8 d -8 -11 d -8 -16 d -9 -28 d -8 -45 d -9 -48 d -9 -36 d -9 -27 d -9 -20 d -9 -16 d -9 -12 d -9 -7 d -9 -2 d -10 7 d -9 24 d -10 46 d -5 22 d -5 17 d -5 13 d -5 9 d -5 7 d -5 5 d -5 4 d -5 3 d -5 2 d -6 X -5 1 d -5 -1 d -5 -1 d -6 -1 d
 -5 -2 d -5 -3 d -6 -3 d -5 -3 d -6 -4 d -6 -4 d -2 -2 d -3 -3 d -3 -2 d -3 -3 d -3 -3 d -2 -2 d -3 -3 d -3 -3 d -3 -4 d -3 -3 d -3 -3 d -3 -3 d -3 -4 d -3 -4 d -3 -3 d -3 -4 d -2 -4 d -3 -4 d -3 -4 d -3 -4 d -3 -5 d -3 -4 d -4 -5 d -3 -4 d -3 -5 d
 -3 -5 d -3 -5 d -3 -5 d -3 -5 d -3 -6 d -3 -5 d -3 -6 d -4 -5 d -3 -6 d -3 -6 d -3 -6 d -3 -6 d -4 -6 d -3 -7 d -3 -6 d -3 -7 d -4 -7 d -3 -6 d -3 -7 d -3 -7 d -4 -7 d -3 -8 d -4 -7 d -3 -7 d -3 -8 d -4 -7 d -3 -8 d -4 -8 d -3 -8 d -3 -7 d -4 -8 d
 -3 -8 d -4 -8 d -3 -8 d -4 -9 d -36 -80 d -5 -9 d f black 386 196 m 7 12 d s 393 208 m 36 80 d 4 8 d 3 9 d 4 8 d 3 8 d 4 8 d 3 7 d 3 8 d 4 8 d 3 8 d 4 7 d 3 8 d 3 7 d 4 7 d 3 7 d 4 7 d 3 7 d 3 7 d 3 7 d 4 7 d 3 6 d 3 7 d 3 6 d 4 6 d 3 6 d 3 6 d 3 6
 d 3 6 d 4 6 d 3 5 d 3 6 d 3 5 d 3 5 d 3 5 d 3 5 d 3 5 d 3 5 d 3 4 d 4 5 d 3 4 d 3 5 d 3 4 d 3 4 d 3 4 d 2 4 d 3 4 d 3 3 d 3 4 d 3 3 d 3 4 d 3 3 d 3 3 d 3 3 d 3 3 d 3 3 d 2 3 d 3 2 d 3 3 d 3 2 d 3 2 d 2 3 d 6 4 d 6 4 d 5 3 d 6 3 d 5 2 d 5 2 d 6 2 d 5
 1 d 10 X 6 -1 d 5 -2 d 5 -3 d 5 -3 d 5 -6 d 5 -7 d 5 -9 d 5 -13 d 5 -17 d 5 -22 d 10 -46 d 9 -24 d 10 -7 d 9 2 d 9 7 d 9 12 d 9 16 d 9 20 d 9 27 d 9 36 d 9 48 d 8 45 d 9 28 d 8 16 d 8 11 d 8 8 d 8 5 d 8 5 d 8 3 d 8 3 d 8 2 d 8 2 d 7 2 d 8 1 d 7 1 d
 8 1 d 7 1 d 7 1 d 8 1 d 7 X 7 1 d 7 X 7 1 d 7 X 7 1 d 13 X 7 1 d 13 X 6 1 d 19 X 7 1 d 24 X 6 1 d 24 X 6 1 d 34 X 5 1 d 30 X 13 1 d 51 X 12 1 d 46 X 12 -1 d 22 -5 d 21 -3 d 21 -4 d 20 -2 d 20 -2 d 19 -2 d 19 -1 d 19 X 18 -1 d 100 X 15 1 d 15 X 15 1
 d 15 X 14 1 d 14 X 14 1 d 14 1 d 13 X 13 1 d 13 X 13 1 d 12 X 12 1 d 13 1 d 12 X 11 1 d 12 X 11 1 d 12 X 11 1 d 11 X 10 1 d 11 X 10 1 d 21 X 10 1 d 10 X 10 1 d 10 X 9 1 d 19 X 9 1 d 18 X 9 1 d 18 X 9 1 d 17 X 8 1 d 16 X 9 1 d 23 X s 457 196 m s 457
 196 m 3 8 d 4 7 d 3 7 d 3 7 d 4 7 d 3 7 d 4 7 d 3 7 d 3 7 d 3 6 d 4 7 d 3 6 d 3 6 d 3 7 d 4 6 d 3 6 d 3 5 d 3 6 d 3 6 d 4 5 d 3 6 d 3 5 d 3 5 d 3 5 d 3 5 d 3 5 d 3 5 d 3 4 d 3 5 d 4 4 d 3 5 d 3 4 d 3 4 d 3 4 d 3 4 d 2 4 d 3 4 d 3 3 d 3 4 d 3 3 d 3 3
 d 3 3 d 3 4 d 3 2 d 3 3 d 3 3 d 2 3 d 3 2 d 3 3 d 3 2 d 3 2 d 2 3 d 6 4 d 6 3 d 5 4 d 6 2 d 5 3 d 5 2 d 6 1 d 5 1 d 10 X 6 -1 d 5 -2 d 5 -3 d 5 -3 d 5 -6 d 5 -7 d 5 -9 d 5 -13 d 5 -17 d 5 -22 d 10 -47 d 9 -24 d 10 -7 d 9 2 d 9 7 d 9 12 d 9 15 d 9 21
 d 9 26 d 9 36 d 9 48 d 8 45 d 9 27 d 8 17 d 8 11 d 8 7 d 8 6 d 8 4 d 8 4 d 8 2 d 8 3 d 8 2 d 7 1 d 8 2 d 7 1 d 8 1 d 7 1 d 7 X 8 1 d 7 1 d 7 X 7 1 d 7 X 7 1 d 7 X 6 1 d 14 X 6 1 d 13 X 7 1 d 25 X 6 1 d 24 X 6 1 d 29 X 6 1 d 28 X 5 1 d 45 X 13 1 d 49
 X 11 1 d 23 X 12 -2 d 22 -4 d 21 -4 d 21 -3 d 20 -2 d 20 -2 d 19 -2 d 19 -1 d 19 -1 d 18 X 17 -1 d 51 X 16 1 d 31 X 15 1 d 15 X 15 1 d 14 X 14 1 d 14 1 d 14 X 13 1 d 13 X 13 1 d 13 X 12 1 d 12 1 d 13 X 12 1 d 11 X 12 1 d 11 X 12 1 d 11 X 11 1 d 10 X
 11 1 d 10 X 11 1 d 10 X 10 1 d 20 X 10 1 d 9 X 10 1 d 18 X 9 1 d 18 X 9 1 d 18 X 8 1 d 17 X 8 1 d 25 X 7 1 d 8 X s 0 0 0.6 c black 0 0 0.6 c 455 196 m 2 3 d 3 8 d 4 7 d 3 7 d 3 7 d 4 7 d 3 7 d 4 7 d 3 7 d 3 6 d 3 7 d 4 6 d 3 7 d 3 6 d 3 6 d 4 6 d 3
 6 d 3 6 d 3 6 d 3 5 d 4 6 d 3 5 d 3 5 d 3 6 d 3 5 d 3 5 d 3 4 d 3 5 d 3 5 d 3 4 d 4 5 d 3 4 d 3 4 d 3 4 d 3 4 d 3 4 d 2 4 d 3 3 d 3 4 d 3 3 d 3 4 d 3 3 d 3 3 d 3 3 d 3 3 d 3 3 d 3 2 d 2 3 d 3 2 d 3 3 d 3 2 d 3 2 d 2 2 d 6 4 d 6 4 d 5 3 d 6 3 d 5 2 d
 5 2 d 6 1 d 5 1 d 5 1 d 5 -1 d 6 -1 d 5 -2 d 5 -2 d 5 -4 d 5 -5 d 5 -8 d 5 -9 d 5 -13 d 5 -17 d 5 -22 d 10 -47 d 9 -23 d 10 -8 d 9 2 d 9 7 d 9 12 d 9 15 d 9 21 d 9 26 d 9 36 d 9 48 d 8 45 d 9 27 d 8 17 d 8 11 d 8 7 d 8 6 d 8 4 d 8 4 d 8 2 d 8 3 d 8
 2 d 7 1 d 8 2 d 7 1 d 8 1 d 7 1 d 7 X 8 1 d 7 1 d 7 X 7 1 d 7 X 7 1 d 7 X 6 1 d 14 X 6 1 d 13 X 7 1 d 25 X 6 1 d 24 X 6 1 d 29 X 6 1 d 28 X 5 1 d 45 X 13 1 d 37 X 12 1 d 34 X 12 -2 d 22 -3 d 21 -3 d 21 -3 d 20 -2 d 20 -2 d 19 -1 d 19 -1 d 19 -1 d 18
 -1 d 68 X 16 1 d 31 X 15 1 d 15 X 15 1 d 14 X 14 1 d 14 X 14 1 d 13 X 13 1 d 13 1 d 13 X 12 1 d 12 X 13 1 d 12 X 11 1 d 12 X 11 1 d 12 X 11 1 d 11 X 10 1 d 11 X 10 1 d 11 X 10 1 d 10 X 10 1 d 10 X 10 1 d 19 X 9 1 d 9 X 9 1 d 18 X 9 1 d 18 X 8 1 d 17
 X 8 1 d 17 X 8 1 d 15 X -5 Y -15 X -8 -1 d -25 X -8 -1 d -17 X -9 -1 d -27 X -9 -1 d -18 X -9 -1 d -10 X -9 -1 d -20 X -10 -1 d -10 X -10 -1 d -11 X -10 -1 d -21 X -11 -1 d -11 X -12 -1 d -11 -1 d -12 X -11 -1 d -12 X -13 -1 d -12 X -12 -1 d -13 X
 -13 -1 d -13 -1 d -13 X -14 -1 d -14 X -14 -1 d -14 X -15 -1 d -15 X -15 -1 d -15 X -16 -1 d -84 X -18 1 d -19 X -19 2 d -19 1 d -20 2 d -20 3 d -21 4 d -21 4 d -22 4 d -12 2 d -23 X -11 -1 d -49 X -13 -1 d -45 X -5 -1 d -28 X -6 -1 d -29 X -6 -1 d
 -24 X -6 -1 d -25 X -7 -1 d -13 X -6 -1 d -14 X -6 -1 d -7 X -7 -1 d -7 X -7 -1 d -7 X -7 -1 d -8 -1 d -7 X -7 -1 d -8 -1 d -7 -1 d -8 -2 d -7 -1 d -8 -2 d -8 -3 d -8 -2 d -8 -4 d -8 -4 d -8 -6 d -8 -7 d -8 -11 d -8 -17 d -9 -27 d -8 -45 d -9 -48 d
 -9 -36 d -9 -26 d -9 -21 d -9 -15 d -9 -12 d -9 -7 d -9 -2 d -10 7 d -9 24 d -10 46 d -5 23 d -5 17 d -5 13 d -5 9 d -5 7 d -5 5 d -5 4 d -5 3 d -5 2 d -6 1 d -10 X -5 -1 d -6 -2 d -5 -2 d -5 -2 d -6 -3 d -5 -3 d -6 -4 d -6 -4 d -2 -2 d -3 -3 d -3
 -2 d -3 -3 d -3 -2 d -2 -3 d -3 -3 d -3 -3 d -3 -3 d -3 -3 d -3 -4 d -3 -3 d -3 -3 d -3 -4 d -3 -3 d -3 -4 d -2 -4 d -3 -4 d -3 -4 d -3 -4 d -3 -4 d -3 -5 d -4 -4 d -3 -5 d -3 -4 d -3 -5 d -3 -5 d -3 -5 d -3 -5 d -3 -5 d -3 -6 d -3 -5 d -4 -6 d -3
 -5 d -3 -6 d -3 -6 d -3 -6 d -4 -6 d -3 -6 d -3 -7 d -3 -6 d -4 -6 d -3 -7 d -3 -7 d -3 -7 d -4 -6 d -3 -7 d -4 -7 d -3 -8 d -3 -7 d -4 -7 d -2 -5 d f black 457 196 m s 457 196 m 3 8 d 4 7 d 3 7 d 3 7 d 4 7 d 3 7 d 4 7 d 3 7 d 3 7 d 3 6 d 4 7 d 3 6
 d 3 6 d 3 7 d 4 6 d 3 6 d 3 5 d 3 6 d 3 6 d 4 5 d 3 6 d 3 5 d 3 5 d 3 5 d 3 5 d 3 5 d 3 5 d 3 4 d 3 5 d 4 4 d 3 5 d 3 4 d 3 4 d 3 4 d 3 4 d 2 4 d 3 4 d 3 3 d 3 4 d 3 3 d 3 3 d 3 3 d 3 4 d 3 2 d 3 3 d 3 3 d 2 3 d 3 2 d 3 3 d 3 2 d 3 2 d 2 3 d 6 4 d 6
 3 d 5 4 d 6 2 d 5 3 d 5 2 d 6 1 d 5 1 d 10 X 6 -1 d 5 -2 d 5 -3 d 5 -3 d 5 -6 d 5 -7 d 5 -9 d 5 -13 d 5 -17 d 5 -22 d 10 -47 d 9 -24 d 10 -7 d 9 2 d 9 7 d 9 12 d 9 15 d 9 21 d 9 26 d 9 36 d 9 48 d 8 45 d 9 27 d 8 17 d 8 11 d 8 7 d 8 6 d 8 4 d 8 4 d
 8 2 d 8 3 d 8 2 d 7 1 d 8 2 d 7 1 d 8 1 d 7 1 d 7 X 8 1 d 7 1 d 7 X 7 1 d 7 X 7 1 d 7 X 6 1 d 14 X 6 1 d 13 X 7 1 d 25 X 6 1 d 24 X 6 1 d 29 X 6 1 d 28 X 5 1 d 45 X 13 1 d 49 X 11 1 d 23 X 12 -2 d 22 -4 d 21 -4 d 21 -3 d 20 -2 d 20 -2 d 19 -2 d 19
 -1 d 19 -1 d 18 X 17 -1 d 51 X 16 1 d 31 X 15 1 d 15 X 15 1 d 14 X 14 1 d 14 1 d 14 X 13 1 d 13 X 13 1 d 13 X 12 1 d 12 1 d 13 X 12 1 d 11 X 12 1 d 11 X 12 1 d 11 X 11 1 d 10 X 11 1 d 10 X 11 1 d 10 X 10 1 d 20 X 10 1 d 9 X 10 1 d 18 X 9 1 d 18 X 9
 1 d 18 X 8 1 d 17 X 8 1 d 25 X 7 1 d 8 X s 431 196 m 2 4 d s 433 200 m 3 9 d 4 8 d 3 9 d 4 8 d 3 8 d 3 8 d 4 8 d 3 8 d 4 8 d 3 8 d 3 8 d 4 7 d 3 8 d 4 7 d 3 7 d 3 7 d 3 7 d 4 7 d 3 7 d 3 7 d 3 6 d 4 7 d 3 6 d 3 6 d 3 6 d 3 6 d 4 6 d 3 5 d 3 6 d 3 5
 d 3 6 d 3 5 d 3 5 d 3 5 d 3 5 d 3 5 d 4 4 d 3 5 d 3 4 d 3 4 d 3 5 d 3 4 d 2 4 d 3 4 d 3 3 d 3 4 d 3 3 d 3 4 d 3 3 d 3 3 d 3 3 d 3 3 d 3 3 d 2 3 d 3 3 d 3 2 d 3 3 d 3 2 d 2 2 d 6 5 d 6 4 d 5 3 d 6 3 d 5 2 d 5 2 d 6 2 d 5 1 d 16 X 5 -2 d 5 -3 d 5 -3 d
 5 -6 d 5 -7 d 5 -9 d 5 -13 d 5 -17 d 5 -22 d 10 -46 d 9 -24 d 10 -6 d 9 2 d 9 7 d 9 12 d 9 16 d 9 20 d 9 27 d 9 37 d 9 48 d 8 45 d 9 28 d 8 17 d 8 10 d 8 8 d 8 6 d 8 4 d 8 3 d 8 3 d 8 2 d 8 2 d 7 2 d 8 1 d 7 1 d 8 1 d 7 1 d 7 1 d 8 1 d 7 1 d 7 X 7 1
 d 7 X 7 1 d 13 X 7 1 d 13 X 7 1 d 19 X 6 1 d 19 X 6 1 d 30 X 6 1 d 29 X 5 1 d 28 X 13 1 d 39 X 12 1 d 71 X 12 -1 d 22 -4 d 21 -4 d 21 -3 d 20 -3 d 20 -2 d 19 -1 d 19 -1 d 19 -1 d 18 -1 d 84 X 16 1 d 15 X 15 1 d 15 X 15 1 d 14 X 14 1 d 14 X 14 1 d 13
 X 13 1 d 13 1 d 13 X 12 1 d 12 X 13 1 d 12 X 11 1 d 12 X 11 1 d 12 X 11 1 d 11 X 10 1 d 11 X 10 1 d 11 X 10 1 d 10 X 10 1 d 20 X 9 1 d 10 X 9 1 d 18 X 9 1 d 18 X 9 1 d 17 X 9 1 d 16 X 8 1 d 24 X 8 1 d s 0 0.4 0 c black 0 0.4 0 c 429 196 m 4 7 d 3 9
 d 4 8 d 3 9 d 4 8 d 3 8 d 3 8 d 4 8 d 3 8 d 4 8 d 3 8 d 3 7 d 4 8 d 3 7 d 4 8 d 3 7 d 3 7 d 3 7 d 4 7 d 3 7 d 3 6 d 3 7 d 4 6 d 3 6 d 3 7 d 3 6 d 3 5 d 4 6 d 3 6 d 3 5 d 3 6 d 3 5 d 3 5 d 3 5 d 3 5 d 3 5 d 3 5 d 4 4 d 3 5 d 3 4 d 3 4 d 3 5 d 3 4 d 2
 4 d 3 3 d 3 4 d 3 4 d 3 3 d 3 4 d 3 3 d 3 3 d 3 3 d 3 3 d 3 3 d 2 2 d 3 3 d 3 2 d 3 3 d 3 2 d 2 2 d 6 4 d 6 4 d 5 3 d 6 3 d 5 3 d 5 2 d 6 1 d 5 1 d 5 1 d 5 X 6 -1 d 5 -2 d 5 -2 d 5 -4 d 5 -5 d 5 -7 d 5 -10 d 5 -13 d 5 -17 d 5 -22 d 10 -46 d 9 -23 d
 10 -7 d 9 2 d 9 7 d 9 12 d 9 16 d 9 20 d 9 27 d 9 37 d 9 48 d 8 45 d 9 28 d 8 17 d 8 10 d 8 8 d 8 6 d 8 4 d 8 3 d 8 3 d 8 2 d 8 2 d 7 2 d 8 1 d 7 1 d 8 1 d 7 1 d 7 1 d 8 1 d 7 1 d 7 X 7 1 d 7 X 7 1 d 13 X 7 1 d 13 X 7 1 d 19 X 6 1 d 19 X 6 1 d 30 X
 6 1 d 29 X 5 1 d 28 X 13 1 d 39 X 12 1 d 71 X 12 -1 d 22 -4 d 21 -3 d 21 -3 d 20 -2 d 20 -2 d 19 -1 d 19 -1 d 19 X 18 -1 d 100 X 15 1 d 15 X 15 1 d 15 X 14 1 d 14 X 14 1 d 14 1 d 13 X 13 1 d 13 X 13 1 d 12 X 12 1 d 13 1 d 12 X 11 1 d 12 X 11 1 d 12
 X 11 1 d 11 X 10 1 d 11 X 10 1 d 11 X 10 1 d 20 X 10 1 d 10 X 9 1 d 10 X 9 1 d 18 X 9 1 d 18 X 9 1 d 17 X 9 1 d 16 X 8 1 d 24 X 8 1 d -5 Y -8 X -7 -1 d -25 X -8 -1 d -17 X -8 -1 d -27 X -9 -1 d -18 X -9 -1 d -19 X -9 -1 d -10 X -10 -1 d -20 X -10 -1
 d -11 X -10 -1 d -11 X -10 -1 d -11 X -11 -1 d -12 X -11 -1 d -12 X -11 -1 d -12 X -13 -1 d -12 -1 d -12 X -13 -1 d -13 X -13 -1 d -13 X -14 -1 d -14 -1 d -14 X -14 -1 d -15 X -15 -1 d -15 X -15 -1 d -32 X -17 -1 d -34 X -17 1 d -18 X -19 1 d -19 1
 d -19 2 d -20 2 d -20 3 d -21 3 d -21 4 d -22 5 d -12 1 d -71 X -12 -1 d -39 X -13 -1 d -28 X -5 -1 d -29 X -6 -1 d -30 X -6 -1 d -19 X -6 -1 d -19 X -7 -1 d -13 X -7 -1 d -13 X -7 -1 d -7 X -7 -1 d -7 -1 d -7 X -8 -1 d -7 -1 d -7 -1 d -8 -1 d -7 -1
 d -8 -1 d -7 -2 d -8 -2 d -8 -2 d -8 -3 d -8 -3 d -8 -4 d -8 -6 d -8 -8 d -8 -10 d -8 -17 d -9 -28 d -8 -45 d -9 -48 d -9 -37 d -9 -27 d -9 -20 d -9 -16 d -9 -12 d -9 -7 d -9 -2 d -10 6 d -9 24 d -10 46 d -5 22 d -5 17 d -5 13 d -5 9 d -5 7 d -5 5 d
 -5 4 d -5 3 d -5 1 d -6 1 d -10 X -5 -1 d -6 -2 d -5 -2 d -5 -3 d -6 -3 d -5 -3 d -6 -4 d -6 -4 d -2 -2 d -3 -3 d -3 -3 d -3 -2 d -3 -3 d -2 -3 d -3 -3 d -3 -3 d -3 -3 d -3 -4 d -3 -3 d -3 -3 d -3 -4 d -3 -4 d -3 -3 d -3 -4 d -2 -4 d -3 -4 d -3 -5 d
 -3 -4 d -3 -4 d -3 -5 d -4 -5 d -3 -4 d -3 -5 d -3 -5 d -3 -5 d -3 -6 d -3 -5 d -3 -5 d -3 -6 d -3 -6 d -4 -5 d -3 -6 d -3 -6 d -3 -7 d -3 -6 d -4 -6 d -3 -7 d -3 -7 d -3 -6 d -4 -7 d -3 -7 d -3 -7 d -3 -8 d -4 -7 d -3 -8 d -4 -7 d -3 -8 d -3 -8 d
 -4 -7 d -3 -8 d -4 -9 d -3 -8 d -3 -8 d -4 -8 d -3 -9 d -4 -8 d -3 -9 d -1 -1 d f black 431 196 m 2 4 d s 433 200 m 3 9 d 4 8 d 3 9 d 4 8 d 3 8 d 3 8 d 4 8 d 3 8 d 4 8 d 3 8 d 3 8 d 4 7 d 3 8 d 4 7 d 3 7 d 3 7 d 3 7 d 4 7 d 3 7 d 3 7 d 3 6 d 4 7 d 3
 6 d 3 6 d 3 6 d 3 6 d 4 6 d 3 5 d 3 6 d 3 5 d 3 6 d 3 5 d 3 5 d 3 5 d 3 5 d 3 5 d 4 4 d 3 5 d 3 4 d 3 4 d 3 5 d 3 4 d 2 4 d 3 4 d 3 3 d 3 4 d 3 3 d 3 4 d 3 3 d 3 3 d 3 3 d 3 3 d 3 3 d 2 3 d 3 3 d 3 2 d 3 3 d 3 2 d 2 2 d 6 5 d 6 4 d 5 3 d 6 3 d 5 2 d
 5 2 d 6 2 d 5 1 d 16 X 5 -2 d 5 -3 d 5 -3 d 5 -6 d 5 -7 d 5 -9 d 5 -13 d 5 -17 d 5 -22 d 10 -46 d 9 -24 d 10 -6 d 9 2 d 9 7 d 9 12 d 9 16 d 9 20 d 9 27 d 9 37 d 9 48 d 8 45 d 9 28 d 8 17 d 8 10 d 8 8 d 8 6 d 8 4 d 8 3 d 8 3 d 8 2 d 8 2 d 7 2 d 8 1 d
 7 1 d 8 1 d 7 1 d 7 1 d 8 1 d 7 1 d 7 X 7 1 d 7 X 7 1 d 13 X 7 1 d 13 X 7 1 d 19 X 6 1 d 19 X 6 1 d 30 X 6 1 d 29 X 5 1 d 28 X 13 1 d 39 X 12 1 d 71 X 12 -1 d 22 -4 d 21 -4 d 21 -3 d 20 -3 d 20 -2 d 19 -1 d 19 -1 d 19 -1 d 18 -1 d 84 X 16 1 d 15 X
 15 1 d 15 X 15 1 d 14 X 14 1 d 14 X 14 1 d 13 X 13 1 d 13 1 d 13 X 12 1 d 12 X 13 1 d 12 X 11 1 d 12 X 11 1 d 12 X 11 1 d 11 X 10 1 d 11 X 10 1 d 11 X 10 1 d 10 X 10 1 d 20 X 9 1 d 10 X 9 1 d 18 X 9 1 d 18 X 9 1 d 17 X 9 1 d 16 X 8 1 d 24 X 8 1 d s
 272 559 m 42 98 d 40 104 d 39 95 d 36 83 d 4 8 d 3 7 d 4 7 d 3 8 d 4 7 d 3 7 d 3 7 d 4 7 d 3 7 d 4 6 d 3 7 d 3 6 d 4 6 d 3 7 d 4 6 d 3 6 d 3 6 d 3 5 d 4 6 d 3 6 d 3 5 d 3 6 d 4 5 d 3 5 d 3 5 d 3 5 d 3 5 d 4 5 d 3 5 d 3 4 d 3 5 d 3 4 d 3 5 d 3 4 d 3
 4 d 3 4 d 3 4 d 4 4 d 3 4 d 3 4 d 3 4 d 3 3 d 3 4 d 2 4 d 3 3 d 3 3 d 3 4 d 3 3 d 3 3 d 3 3 d 3 3 d 3 3 d 3 3 d 3 2 d 2 3 d 3 3 d 3 3 d 3 2 d 3 3 d 2 2 d 6 5 d 6 4 d 5 4 d 6 5 d 5 3 d 5 4 d 6 4 d 5 3 d 5 4 d 5 3 d 6 3 d 5 3 d 5 3 d 5 3 d 5 3 d 5 3 d
 5 2 d 5 3 d 5 3 d 5 3 d 10 4 d 9 1 d 10 1 d 45 X 9 -1 d 9 -1 d 9 -2 d 8 -3 d 9 -3 d 8 -2 d 8 -2 d 8 -1 d 8 -1 d 8 X 8 -1 d 8 -1 d 16 X 7 -1 d 30 X 7 -1 d 56 X 7 -1 d 123 X 6 -1 d 163 X 11 -1 d 12 -1 d 22 -5 d 21 -4 d 21 -3 d 20 -3 d 20 -3 d 19 -2 d
 19 -1 d 19 -1 d 18 -1 d 17 -1 d 34 X 17 -1 d 32 X 15 1 d 45 X 14 1 d 28 X 14 1 d 13 X 13 1 d 26 X 12 1 d 12 X 13 1 d 12 X 11 1 d 23 X 12 1 d 11 X 11 1 d 21 X 10 1 d 11 X 10 1 d 20 X 10 1 d 19 X 10 1 d 18 X 9 1 d 18 X 9 1 d 18 X 8 1 d 25 X 8 1 d 24 X
 8 1 d s 0.8 0.2 0.2 c black 0.8 0.2 0.2 c 272 562 m 42 99 d 40 103 d 39 95 d 36 83 d 4 7 d 3 8 d 4 7 d 3 8 d 4 7 d 3 7 d 3 7 d 4 7 d 3 6 d 4 7 d 3 6 d 3 7 d 4 6 d 3 6 d 4 6 d 3 6 d 3 6 d 3 6 d 4 6 d 3 5 d 3 6 d 3 5 d 4 5 d 3 6 d 3 5 d 3 5 d 3 5 d 4
 4 d 3 5 d 3 5 d 3 4 d 3 5 d 3 4 d 3 4 d 3 5 d 3 4 d 3 4 d 4 4 d 3 3 d 3 4 d 3 4 d 3 3 d 3 4 d 2 3 d 3 4 d 3 3 d 3 3 d 3 4 d 3 3 d 3 3 d 3 3 d 3 2 d 3 3 d 3 3 d 2 2 d 3 3 d 3 2 d 3 3 d 3 2 d 2 3 d 6 4 d 6 5 d 5 4 d 6 4 d 5 4 d 5 4 d 6 3 d 5 4 d 5 3 d
 5 3 d 6 3 d 5 3 d 5 3 d 5 3 d 5 3 d 5 3 d 5 3 d 5 2 d 5 3 d 5 3 d 10 4 d 9 1 d 10 1 d 45 X 9 -1 d 9 -1 d 9 -2 d 8 -3 d 9 -3 d 8 -2 d 8 -2 d 8 -1 d 8 -1 d 8 X 8 -1 d 8 -1 d 16 X 7 -1 d 30 X 7 -1 d 56 X 7 -1 d 123 X 6 -1 d 163 X 11 -1 d 12 -1 d 22 -4
 d 21 -4 d 21 -3 d 20 -2 d 20 -2 d 19 -2 d 19 -1 d 19 -1 d 18 -1 d 17 -1 d 34 X 17 -1 d 62 X 15 1 d 29 X 14 1 d 28 X 13 1 d 13 X 13 1 d 13 X 12 1 d 25 X 12 1 d 11 X 12 1 d 11 X 12 1 d 22 X 10 1 d 11 X 10 1 d 21 X 10 1 d 10 X 10 1 d 19 X 10 1 d 18 X 9
 1 d 18 X 9 1 d 18 X 8 1 d 25 X 8 1 d 17 X 7 1 d 8 X -5 Y -8 X -7 -1 d -25 X -8 -1 d -25 X -9 -1 d -27 X -9 -1 d -18 X -9 -1 d -19 X -10 -1 d -20 X -10 -1 d -21 X -10 -1 d -11 X -10 -1 d -22 X -12 -1 d -11 X -12 -1 d -11 X -12 -1 d -25 X -12 -1 d -13
 X -13 -1 d -13 X -13 -1 d -28 X -14 -1 d -29 X -15 -1 d -96 X -17 1 d -17 X -18 1 d -19 2 d -19 1 d -19 2 d -20 3 d -20 3 d -21 3 d -21 5 d -22 5 d -12 1 d -11 1 d -163 X -6 1 d -123 X -7 1 d -56 X -7 1 d -30 X -7 1 d -16 X -8 1 d -8 1 d -8 X -8 1 d
 -8 1 d -8 2 d -8 2 d -9 3 d -8 3 d -9 2 d -9 1 d -9 1 d -45 X -10 -1 d -9 -1 d -10 -4 d -5 -3 d -5 -3 d -5 -3 d -5 -3 d -5 -2 d -5 -3 d -5 -3 d -5 -3 d -5 -3 d -6 -3 d -5 -4 d -5 -3 d -5 -4 d -6 -3 d -5 -4 d -5 -4 d -6 -4 d -5 -4 d -6 -5 d -6 -5 d
 -2 -2 d -3 -3 d -3 -2 d -3 -3 d -3 -3 d -2 -3 d -3 -3 d -3 -3 d -3 -3 d -3 -3 d -3 -3 d -3 -3 d -3 -3 d -3 -4 d -3 -3 d -3 -3 d -2 -4 d -3 -4 d -3 -3 d -3 -4 d -3 -4 d -3 -4 d -4 -4 d -3 -4 d -3 -4 d -3 -4 d -3 -5 d -3 -4 d -3 -4 d -3 -5 d -3 -5 d
 -3 -5 d -4 -4 d -3 -5 d -3 -5 d -3 -5 d -3 -6 d -4 -5 d -3 -5 d -3 -6 d -3 -6 d -4 -5 d -3 -6 d -3 -6 d -3 -6 d -4 -6 d -3 -6 d -4 -7 d -3 -6 d -3 -7 d -4 -6 d -3 -7 d -4 -7 d -3 -7 d -3 -7 d -4 -7 d -3 -7 d -4 -8 d -3 -7 d -4 -8 d -36 -83 d -39 -95
 d -40 -104 d -42 -98 d f black 272 559 m 42 98 d 40 104 d 39 95 d 36 83 d 4 8 d 3 7 d 4 7 d 3 8 d 4 7 d 3 7 d 3 7 d 4 7 d 3 7 d 4 6 d 3 7 d 3 6 d 4 6 d 3 7 d 4 6 d 3 6 d 3 6 d 3 5 d 4 6 d 3 6 d 3 5 d 3 6 d 4 5 d 3 5 d 3 5 d 3 5 d 3 5 d 4 5 d 3 5 d 3
 4 d 3 5 d 3 4 d 3 5 d 3 4 d 3 4 d 3 4 d 3 4 d 4 4 d 3 4 d 3 4 d 3 4 d 3 3 d 3 4 d 2 4 d 3 3 d 3 3 d 3 4 d 3 3 d 3 3 d 3 3 d 3 3 d 3 3 d 3 3 d 3 2 d 2 3 d 3 3 d 3 3 d 3 2 d 3 3 d 2 2 d 6 5 d 6 4 d 5 4 d 6 5 d 5 3 d 5 4 d 6 4 d 5 3 d 5 4 d 5 3 d 6 3 d
 5 3 d 5 3 d 5 3 d 5 3 d 5 3 d 5 2 d 5 3 d 5 3 d 5 3 d 10 4 d 9 1 d 10 1 d 45 X 9 -1 d 9 -1 d 9 -2 d 8 -3 d 9 -3 d 8 -2 d 8 -2 d 8 -1 d 8 -1 d 8 X 8 -1 d 8 -1 d 16 X 7 -1 d 30 X 7 -1 d 56 X 7 -1 d 123 X 6 -1 d 163 X 11 -1 d 12 -1 d 22 -5 d 21 -4 d 21
 -3 d 20 -3 d 20 -3 d 19 -2 d 19 -1 d 19 -1 d 18 -1 d 17 -1 d 34 X 17 -1 d 32 X 15 1 d 45 X 14 1 d 28 X 14 1 d 13 X 13 1 d 26 X 12 1 d 12 X 13 1 d 12 X 11 1 d 23 X 12 1 d 11 X 11 1 d 21 X 10 1 d 11 X 10 1 d 20 X 10 1 d 19 X 10 1 d 18 X 9 1 d 18 X 9 1
 d 18 X 8 1 d 25 X 8 1 d 24 X 8 1 d s 272 459 m 42 100 d 40 104 d 39 96 d 36 83 d 4 8 d 3 8 d 4 7 d 3 8 d 4 7 d 3 7 d 3 7 d 4 7 d 3 7 d 4 6 d 3 7 d 3 6 d 4 7 d 3 6 d 4 6 d 3 6 d 3 6 d 3 6 d 4 6 d 3 5 d 3 6 d 3 5 d 4 6 d 3 5 d 3 5 d 3 5 d 3 5 d 4 5 d
 3 5 d 3 4 d 3 5 d 3 4 d 3 5 d 3 4 d 3 4 d 3 5 d 3 4 d 4 4 d 3 4 d 3 3 d 3 4 d 3 4 d 3 3 d 2 4 d 3 3 d 3 4 d 3 3 d 3 3 d 3 3 d 3 3 d 3 3 d 3 3 d 3 3 d 3 3 d 2 3 d 3 2 d 3 3 d 3 3 d 3 2 d 2 3 d 6 4 d 6 5 d 5 4 d 6 4 d 5 4 d 5 4 d 6 3 d 5 4 d 5 3 d 5 3
 d 6 3 d 5 3 d 5 3 d 5 3 d 5 3 d 5 2 d 5 3 d 5 3 d 5 3 d 5 2 d 10 4 d 9 1 d 10 1 d 45 X 9 -1 d 9 X 9 -2 d 8 -2 d 9 -2 d 8 -1 d 8 -1 d 8 -1 d 8 X 8 -1 d 8 X 8 -1 d 31 X 7 -1 d 85 X 7 -1 d 238 X 12 -1 d 46 X 12 -2 d 22 -4 d 21 -4 d 21 -4 d 20 -2 d 20
 -3 d 19 -2 d 19 -1 d 19 -1 d 18 -1 d 17 -1 d 34 X 17 -1 d 16 X 16 1 d 60 X 14 1 d 14 X 14 1 d 27 X 13 1 d 13 X 13 1 d 12 X 12 1 d 25 X 11 1 d 12 X 11 1 d 12 X 11 1 d 21 X 11 1 d 10 X 11 1 d 20 X 10 1 d 20 X 9 1 d 19 X 9 1 d 18 X 9 1 d 18 X 9 1 d 25
 X 8 1 d 17 X 8 1 d 15 X s 0.6 0.2 0.8 c black 0.6 0.2 0.8 c 272 462 m 42 100 d 40 104 d 39 96 d 36 83 d 4 8 d 3 8 d 4 7 d 3 7 d 4 8 d 3 7 d 3 7 d 4 7 d 3 6 d 4 7 d 3 7 d 3 6 d 4 6 d 3 7 d 4 6 d 3 6 d 3 6 d 3 6 d 4 5 d 3 6 d 3 5 d 3 6 d 4 5 d 3 5 d 3
 6 d 3 5 d 3 4 d 4 5 d 3 5 d 3 5 d 3 4 d 3 5 d 3 4 d 3 4 d 3 5 d 3 4 d 3 4 d 4 4 d 3 4 d 3 4 d 3 3 d 3 4 d 3 3 d 2 4 d 3 3 d 3 4 d 3 3 d 3 3 d 3 3 d 3 3 d 3 3 d 3 3 d 3 3 d 3 2 d 2 3 d 3 3 d 3 2 d 3 2 d 3 3 d 2 2 d 6 5 d 6 4 d 5 5 d 6 4 d 5 4 d 5 3 d
 6 4 d 5 3 d 5 3 d 5 4 d 6 3 d 5 3 d 5 2 d 5 3 d 5 3 d 5 3 d 5 2 d 5 3 d 5 3 d 5 2 d 10 4 d 9 1 d 10 1 d 45 X 9 -1 d 9 X 9 -2 d 8 -2 d 9 -2 d 8 -1 d 8 -1 d 8 -1 d 8 X 8 -1 d 8 X 8 -1 d 31 X 7 -1 d 85 X 7 -1 d 238 X 12 -1 d 46 X 12 -1 d 22 -4 d 21 -4
 d 21 -3 d 20 -2 d 20 -3 d 19 -1 d 19 -2 d 19 -1 d 18 X 17 -1 d 34 X 17 -1 d 47 X 15 1 d 30 X 14 1 d 28 X 14 1 d 13 X 13 1 d 26 X 12 1 d 12 X 13 1 d 12 X 11 1 d 23 X 12 1 d 11 X 11 1 d 10 X 11 1 d 21 X 10 1 d 10 X 10 1 d 20 X 9 1 d 19 X 9 1 d 18 X 9
 1 d 18 X 9 1 d 17 X 8 1 d 25 X 8 1 d 15 X -5 Y -23 X -9 -1 d -24 X -9 -1 d -26 X -9 -1 d -18 X -9 -1 d -18 X -10 -1 d -19 X -10 -1 d -20 X -10 -1 d -21 X -11 -1 d -10 X -11 -1 d -23 X -11 -1 d -12 X -11 -1 d -12 X -13 -1 d -12 X -12 -1 d -26 X -13
 -1 d -13 X -14 -1 d -28 X -14 -1 d -30 X -15 -1 d -81 X -17 1 d -17 X -18 1 d -19 1 d -19 2 d -19 2 d -20 2 d -20 3 d -21 4 d -21 5 d -22 4 d -12 2 d -46 X -12 1 d -238 X -7 1 d -85 X -7 1 d -31 X -8 1 d -8 X -8 1 d -8 X -8 1 d -8 1 d -8 1 d -9 2 d
 -8 2 d -9 2 d -9 X -9 1 d -45 X -10 -1 d -9 -1 d -10 -4 d -5 -3 d -5 -2 d -5 -3 d -5 -3 d -5 -2 d -5 -3 d -5 -3 d -5 -3 d -5 -3 d -6 -3 d -5 -3 d -5 -4 d -5 -3 d -6 -4 d -5 -3 d -5 -4 d -6 -4 d -5 -5 d -6 -4 d -6 -5 d -2 -3 d -3 -2 d -3 -3 d -3 -3 d
 -3 -2 d -2 -3 d -3 -3 d -3 -3 d -3 -3 d -3 -3 d -3 -3 d -3 -4 d -3 -3 d -3 -3 d -3 -4 d -3 -3 d -2 -4 d -3 -3 d -3 -4 d -3 -4 d -3 -4 d -3 -3 d -4 -4 d -3 -5 d -3 -4 d -3 -4 d -3 -4 d -3 -5 d -3 -4 d -3 -5 d -3 -5 d -3 -5 d -4 -4 d -3 -5 d -3 -6 d
 -3 -5 d -3 -5 d -4 -5 d -3 -6 d -3 -5 d -3 -6 d -4 -6 d -3 -6 d -3 -6 d -3 -6 d -4 -6 d -3 -6 d -4 -6 d -3 -7 d -3 -7 d -4 -6 d -3 -7 d -4 -7 d -3 -7 d -3 -7 d -4 -7 d -3 -8 d -4 -7 d -3 -8 d -4 -7 d -36 -84 d -39 -96 d -40 -104 d -42 -100 d f black
 272 459 m 42 100 d 40 104 d 39 96 d 36 83 d 4 8 d 3 8 d 4 7 d 3 8 d 4 7 d 3 7 d 3 7 d 4 7 d 3 7 d 4 6 d 3 7 d 3 6 d 4 7 d 3 6 d 4 6 d 3 6 d 3 6 d 3 6 d 4 6 d 3 5 d 3 6 d 3 5 d 4 6 d 3 5 d 3 5 d 3 5 d 3 5 d 4 5 d 3 5 d 3 4 d 3 5 d 3 4 d 3 5 d 3 4 d 3
 4 d 3 5 d 3 4 d 4 4 d 3 4 d 3 3 d 3 4 d 3 4 d 3 3 d 2 4 d 3 3 d 3 4 d 3 3 d 3 3 d 3 3 d 3 3 d 3 3 d 3 3 d 3 3 d 3 3 d 2 3 d 3 2 d 3 3 d 3 3 d 3 2 d 2 3 d 6 4 d 6 5 d 5 4 d 6 4 d 5 4 d 5 4 d 6 3 d 5 4 d 5 3 d 5 3 d 6 3 d 5 3 d 5 3 d 5 3 d 5 3 d 5 2 d
 5 3 d 5 3 d 5 3 d 5 2 d 10 4 d 9 1 d 10 1 d 45 X 9 -1 d 9 X 9 -2 d 8 -2 d 9 -2 d 8 -1 d 8 -1 d 8 -1 d 8 X 8 -1 d 8 X 8 -1 d 31 X 7 -1 d 85 X 7 -1 d 238 X 12 -1 d 46 X 12 -2 d 22 -4 d 21 -4 d 21 -4 d 20 -2 d 20 -3 d 19 -2 d 19 -1 d 19 -1 d 18 -1 d 17
 -1 d 34 X 17 -1 d 16 X 16 1 d 60 X 14 1 d 14 X 14 1 d 27 X 13 1 d 13 X 13 1 d 12 X 12 1 d 25 X 11 1 d 12 X 11 1 d 12 X 11 1 d 21 X 11 1 d 10 X 11 1 d 20 X 10 1 d 20 X 9 1 d 19 X 9 1 d 18 X 9 1 d 18 X 9 1 d 25 X 8 1 d 17 X 8 1 d 15 X s 272 262 m 42
 111 d 40 111 d 39 100 d 36 86 d 4 7 d 3 8 d 4 8 d 3 7 d 4 8 d 3 7 d 3 7 d 4 7 d 3 7 d 4 6 d 3 7 d 3 7 d 4 6 d 3 6 d 4 7 d 3 6 d 3 6 d 3 6 d 4 5 d 3 6 d 3 6 d 3 5 d 4 5 d 3 6 d 3 5 d 3 5 d 3 5 d 4 5 d 3 5 d 3 4 d 3 5 d 3 5 d 3 4 d 3 4 d 3 5 d 3 4 d 3
 4 d 4 4 d 3 4 d 3 4 d 3 4 d 3 3 d 3 4 d 2 3 d 3 4 d 3 3 d 3 4 d 3 3 d 3 3 d 3 3 d 3 3 d 3 3 d 3 3 d 3 3 d 2 3 d 3 2 d 3 3 d 3 2 d 3 3 d 2 2 d 6 5 d 6 5 d 5 4 d 6 4 d 5 4 d 5 4 d 6 4 d 5 3 d 5 4 d 5 3 d 6 3 d 5 3 d 5 3 d 5 4 d 5 3 d 5 2 d 5 3 d 5 3 d
 5 3 d 5 3 d 10 4 d 9 2 d 10 1 d 45 X 9 -1 d 9 -1 d 9 -2 d 8 -4 d 9 -2 d 8 -2 d 8 -2 d 8 -1 d 8 -1 d 8 -1 d 8 X 8 -1 d 8 X 8 -1 d 30 X 7 -1 d 50 X 7 -1 d 107 X 6 -1 d 169 X 11 -1 d 23 X 12 -1 d 22 -5 d 21 -4 d 21 -4 d 20 -2 d 20 -3 d 19 -2 d 19 -1 d
 19 -1 d 18 -1 d 17 -1 d 17 X 17 -1 d 64 X 15 1 d 44 X 14 1 d 14 X 14 1 d 26 X 13 1 d 13 X 12 1 d 12 X 13 1 d 23 X 12 1 d 11 X 12 1 d 22 X 10 1 d 11 X 10 1 d 21 X 10 1 d 10 X 10 1 d 19 X 10 1 d 18 X 9 1 d 27 X 9 1 d 17 X 9 1 d 24 X 9 1 d 15 X 8 1 d s
 1 0 1 c black 1 0 1 c 272 265 m 42 111 d 40 111 d 39 100 d 36 86 d 4 7 d 3 8 d 4 8 d 3 7 d 4 7 d 3 8 d 3 7 d 4 7 d 3 7 d 4 6 d 3 7 d 3 6 d 4 7 d 3 6 d 4 6 d 3 6 d 3 6 d 3 6 d 4 6 d 3 6 d 3 5 d 3 6 d 4 5 d 3 5 d 3 5 d 3 5 d 3 5 d 4 5 d 3 5 d 3 5 d 3
 4 d 3 5 d 3 4 d 3 5 d 3 4 d 3 4 d 3 4 d 4 4 d 3 4 d 3 4 d 3 4 d 3 3 d 3 4 d 2 3 d 3 4 d 3 3 d 3 3 d 3 4 d 3 3 d 3 3 d 3 3 d 3 3 d 3 2 d 3 3 d 2 3 d 3 2 d 3 3 d 3 2 d 3 3 d 2 2 d 6 5 d 6 4 d 5 5 d 6 4 d 5 4 d 5 4 d 6 3 d 5 4 d 5 3 d 5 3 d 6 4 d 5 3 d
 5 3 d 5 3 d 5 3 d 5 3 d 5 3 d 5 3 d 5 3 d 5 2 d 10 5 d 9 1 d 10 1 d 45 X 9 -1 d 9 -1 d 9 -2 d 8 -4 d 9 -2 d 8 -2 d 8 -2 d 8 -1 d 8 -1 d 8 -1 d 8 X 8 -1 d 16 X 7 -1 d 23 X 7 -1 d 50 X 7 -1 d 107 X 6 -1 d 169 X 11 -1 d 23 X 12 -1 d 22 -4 d 21 -4 d 21
 -3 d 20 -2 d 20 -3 d 19 -1 d 19 -2 d 19 -1 d 18 X 17 -1 d 17 X 17 -1 d 79 X 15 1 d 29 X 14 1 d 28 X 13 1 d 13 X 13 1 d 25 X 12 1 d 13 X 12 1 d 11 X 12 1 d 23 X 11 1 d 11 X 10 1 d 21 X 11 1 d 10 X 10 1 d 20 X 10 1 d 19 X 9 1 d 18 X 9 1 d 18 X 9 1 d
 17 X 9 1 d 16 X 8 1 d 24 X 8 1 d -5 Y -8 X -7 -1 d -25 X -8 -1 d -25 X -9 -1 d -18 X -9 -1 d -27 X -9 -1 d -19 X -10 -1 d -20 X -10 -1 d -10 X -11 -1 d -21 X -10 -1 d -11 X -11 -1 d -23 X -12 -1 d -11 X -12 -1 d -13 X -12 -1 d -25 X -13 -1 d -13 X
 -13 -1 d -28 X -14 -1 d -29 X -15 -1 d -96 X -17 1 d -17 X -18 1 d -19 1 d -19 2 d -19 2 d -20 2 d -20 4 d -21 3 d -21 5 d -22 4 d -12 2 d -23 X -11 1 d -169 X -6 1 d -107 X -7 1 d -50 X -7 1 d -30 X -8 1 d -8 X -8 1 d -8 X -8 1 d -8 1 d -8 1 d -8 2
 d -8 2 d -9 2 d -8 3 d -9 3 d -9 1 d -9 1 d -45 X -10 -1 d -9 -2 d -10 -4 d -5 -3 d -5 -3 d -5 -3 d -5 -3 d -5 -3 d -5 -3 d -5 -3 d -5 -3 d -5 -3 d -6 -3 d -5 -4 d -5 -3 d -5 -4 d -6 -3 d -5 -4 d -5 -4 d -6 -4 d -5 -5 d -6 -4 d -6 -5 d -2 -3 d -3 -2
 d -3 -3 d -3 -3 d -3 -3 d -2 -3 d -3 -2 d -3 -3 d -3 -4 d -3 -3 d -3 -3 d -3 -3 d -3 -3 d -3 -4 d -3 -3 d -3 -4 d -2 -3 d -3 -4 d -3 -4 d -3 -3 d -3 -4 d -3 -4 d -4 -4 d -3 -4 d -3 -5 d -3 -4 d -3 -4 d -3 -5 d -3 -4 d -3 -5 d -3 -5 d -3 -5 d -4 -4 d
 -3 -6 d -3 -5 d -3 -5 d -3 -5 d -4 -6 d -3 -5 d -3 -6 d -3 -5 d -4 -6 d -3 -6 d -3 -6 d -3 -6 d -4 -6 d -3 -7 d -4 -6 d -3 -7 d -3 -6 d -4 -7 d -3 -7 d -4 -7 d -3 -7 d -3 -7 d -4 -8 d -3 -7 d -4 -8 d -3 -7 d -4 -8 d -36 -86 d -39 -100 d -40 -111 d
 -42 -111 d f black 272 262 m 42 111 d 40 111 d 39 100 d 36 86 d 4 7 d 3 8 d 4 8 d 3 7 d 4 8 d 3 7 d 3 7 d 4 7 d 3 7 d 4 6 d 3 7 d 3 7 d 4 6 d 3 6 d 4 7 d 3 6 d 3 6 d 3 6 d 4 5 d 3 6 d 3 6 d 3 5 d 4 5 d 3 6 d 3 5 d 3 5 d 3 5 d 4 5 d 3 5 d 3 4 d 3 5 d
 3 5 d 3 4 d 3 4 d 3 5 d 3 4 d 3 4 d 4 4 d 3 4 d 3 4 d 3 4 d 3 3 d 3 4 d 2 3 d 3 4 d 3 3 d 3 4 d 3 3 d 3 3 d 3 3 d 3 3 d 3 3 d 3 3 d 3 3 d 2 3 d 3 2 d 3 3 d 3 2 d 3 3 d 2 2 d 6 5 d 6 5 d 5 4 d 6 4 d 5 4 d 5 4 d 6 4 d 5 3 d 5 4 d 5 3 d 6 3 d 5 3 d 5 3
 d 5 4 d 5 3 d 5 2 d 5 3 d 5 3 d 5 3 d 5 3 d 10 4 d 9 2 d 10 1 d 45 X 9 -1 d 9 -1 d 9 -2 d 8 -4 d 9 -2 d 8 -2 d 8 -2 d 8 -1 d 8 -1 d 8 -1 d 8 X 8 -1 d 8 X 8 -1 d 30 X 7 -1 d 50 X 7 -1 d 107 X 6 -1 d 169 X 11 -1 d 23 X 12 -1 d 22 -5 d 21 -4 d 21 -4 d
 20 -2 d 20 -3 d 19 -2 d 19 -1 d 19 -1 d 18 -1 d 17 -1 d 17 X 17 -1 d 64 X 15 1 d 44 X 14 1 d 14 X 14 1 d 26 X 13 1 d 13 X 12 1 d 12 X 13 1 d 23 X 12 1 d 11 X 12 1 d 22 X 10 1 d 11 X 10 1 d 21 X 10 1 d 10 X 10 1 d 19 X 10 1 d 18 X 9 1 d 27 X 9 1 d 17
 X 9 1 d 24 X 9 1 d 15 X 8 1 d s 272 301 m 42 98 d 40 101 d 39 94 d 36 82 d 4 8 d 3 7 d 4 7 d 3 7 d 4 7 d 3 7 d 3 7 d 4 7 d 3 7 d 4 6 d 3 7 d 3 6 d 4 6 d 3 6 d 4 6 d 3 6 d 3 6 d 3 6 d 4 5 d 3 6 d 3 5 d 3 5 d 4 6 d 3 5 d 3 5 d 3 5 d 3 5 d 4 4 d 3 5 d
 3 5 d 3 4 d 3 4 d 3 5 d 3 4 d 3 4 d 3 4 d 3 4 d 4 4 d 3 4 d 3 4 d 3 3 d 3 4 d 3 3 d 2 4 d 3 3 d 3 4 d 3 3 d 3 3 d 3 3 d 3 3 d 3 3 d 3 3 d 3 3 d 3 2 d 2 3 d 3 3 d 3 2 d 3 3 d 3 2 d 2 3 d 6 5 d 6 4 d 5 4 d 6 4 d 5 4 d 5 4 d 6 4 d 5 3 d 5 4 d 5 3 d 6 3
 d 5 4 d 5 3 d 5 3 d 5 3 d 5 3 d 5 3 d 5 3 d 5 4 d 5 3 d 10 4 d 9 2 d 10 1 d 36 X 9 -1 d 9 -1 d 9 -2 d 9 -4 d 8 -5 d 9 -5 d 8 -4 d 8 -2 d 8 -2 d 8 -2 d 8 -1 d 8 -2 d 8 X 8 -1 d 8 -1 d 7 X 8 -1 d 7 X 8 -1 d 14 X 8 -1 d 21 X 7 -1 d 40 X 7 -1 d 62 X 6
 -1 d 80 X 13 -1 d 99 X 12 -1 d 11 X 12 -1 d 22 -5 d 21 -4 d 21 -4 d 20 -3 d 20 -2 d 19 -2 d 19 -2 d 19 -1 d 18 -1 d 17 -1 d 34 X 17 -1 d 47 X 15 1 d 44 X 14 1 d 28 X 13 1 d 26 X 13 1 d 12 X 12 1 d 13 X 12 1 d 23 X 11 1 d 12 X 11 1 d 21 X 11 1 d 21 X
 10 1 d 10 X 10 1 d 20 X 9 1 d 19 X 9 1 d 27 X 9 1 d 18 X 8 1 d 25 X 8 1 d 24 X 8 1 d s 0 0 0.4 c black 0 0 0.4 c 272 304 m 42 98 d 40 102 d 39 93 d 36 82 d 4 7 d 3 8 d 4 7 d 3 7 d 4 7 d 3 7 d 3 7 d 4 7 d 3 6 d 4 7 d 3 6 d 3 7 d 4 6 d 3 6 d 4 6 d 3 6
 d 3 6 d 3 5 d 4 6 d 3 5 d 3 6 d 3 5 d 4 5 d 3 5 d 3 5 d 3 5 d 3 5 d 4 5 d 3 4 d 3 5 d 3 4 d 3 5 d 3 4 d 3 4 d 3 4 d 3 4 d 3 4 d 4 4 d 3 4 d 3 4 d 3 3 d 3 4 d 3 3 d 2 4 d 3 3 d 3 3 d 3 4 d 3 3 d 3 3 d 3 3 d 3 3 d 3 2 d 3 3 d 3 3 d 2 2 d 3 3 d 3 2 d 3
 3 d 3 2 d 2 2 d 6 5 d 6 5 d 5 4 d 6 4 d 5 4 d 5 4 d 6 3 d 5 4 d 5 3 d 5 4 d 6 3 d 5 3 d 5 3 d 5 3 d 5 3 d 5 3 d 5 3 d 5 4 d 5 3 d 5 3 d 10 5 d 9 1 d 10 1 d 36 X 9 -1 d 9 -1 d 9 -2 d 9 -4 d 8 -5 d 9 -5 d 8 -4 d 8 -2 d 8 -2 d 8 -2 d 8 -1 d 8 -2 d 8 X
 8 -1 d 8 -1 d 7 X 8 -1 d 7 X 8 -1 d 14 X 8 -1 d 21 X 7 -1 d 40 X 7 -1 d 62 X 6 -1 d 80 X 13 -1 d 99 X 12 -1 d 11 X 12 -1 d 22 -4 d 21 -4 d 21 -3 d 20 -3 d 20 -2 d 19 -2 d 19 -1 d 19 -1 d 18 -1 d 17 -1 d 34 X 17 -1 d 62 X 15 1 d 43 X 14 1 d 27 X 13 1
 d 13 X 13 1 d 24 X 13 1 d 12 X 11 1 d 23 X 12 1 d 11 X 11 1 d 21 X 10 1 d 11 X 10 1 d 20 X 10 1 d 19 X 10 1 d 18 X 9 1 d 18 X 9 1 d 18 X 8 1 d 25 X 8 1 d 17 X 7 1 d 8 X -5 Y -8 X -7 -1 d -33 X -8 -1 d -26 X -9 -1 d -18 X -9 -1 d -27 X -10 -1 d -19 X
 -10 -1 d -20 X -10 -1 d -11 X -10 -1 d -21 X -11 -1 d -23 X -11 -1 d -12 X -11 -1 d -12 X -13 -1 d -24 X -13 -1 d -13 X -13 -1 d -27 X -14 -1 d -28 X -15 -1 d -111 X -17 1 d -17 1 d -18 1 d -19 1 d -19 1 d -19 3 d -20 2 d -20 3 d -21 4 d -21 5 d -22
 4 d -12 2 d -11 X -12 1 d -99 X -13 1 d -80 X -6 1 d -62 X -7 1 d -40 X -7 1 d -21 X -8 1 d -14 X -8 1 d -7 X -8 1 d -7 X -8 1 d -8 1 d -8 X -8 2 d -8 1 d -8 2 d -8 2 d -8 2 d -8 4 d -9 5 d -8 5 d -9 4 d -9 2 d -9 1 d -9 1 d -36 X -10 -1 d -9 -2 d
 -10 -4 d -5 -3 d -5 -4 d -5 -3 d -5 -3 d -5 -3 d -5 -3 d -5 -4 d -5 -3 d -5 -3 d -6 -3 d -5 -3 d -5 -4 d -5 -3 d -6 -4 d -5 -4 d -5 -4 d -6 -4 d -5 -5 d -6 -4 d -6 -5 d -2 -2 d -3 -3 d -3 -3 d -3 -2 d -3 -3 d -2 -3 d -3 -3 d -3 -3 d -3 -3 d -3 -3 d
 -3 -3 d -3 -3 d -3 -3 d -3 -3 d -3 -4 d -3 -3 d -2 -4 d -3 -3 d -3 -4 d -3 -3 d -3 -4 d -3 -4 d -4 -4 d -3 -4 d -3 -4 d -3 -4 d -3 -5 d -3 -4 d -3 -4 d -3 -5 d -3 -4 d -3 -5 d -4 -5 d -3 -5 d -3 -5 d -3 -5 d -3 -5 d -4 -5 d -3 -6 d -3 -5 d -3 -6 d
 -4 -5 d -3 -6 d -3 -6 d -3 -6 d -4 -6 d -3 -6 d -4 -6 d -3 -6 d -3 -7 d -4 -6 d -3 -7 d -4 -7 d -3 -6 d -3 -7 d -4 -8 d -3 -7 d -4 -7 d -3 -7 d -4 -8 d -36 -82 d -39 -94 d -40 -101 d -42 -98 d f black 272 301 m 42 98 d 40 101 d 39 94 d 36 82 d 4 8 d
 3 7 d 4 7 d 3 7 d 4 7 d 3 7 d 3 7 d 4 7 d 3 7 d 4 6 d 3 7 d 3 6 d 4 6 d 3 6 d 4 6 d 3 6 d 3 6 d 3 6 d 4 5 d 3 6 d 3 5 d 3 5 d 4 6 d 3 5 d 3 5 d 3 5 d 3 5 d 4 4 d 3 5 d 3 5 d 3 4 d 3 4 d 3 5 d 3 4 d 3 4 d 3 4 d 3 4 d 4 4 d 3 4 d 3 4 d 3 3 d 3 4 d 3 3
 d 2 4 d 3 3 d 3 4 d 3 3 d 3 3 d 3 3 d 3 3 d 3 3 d 3 3 d 3 3 d 3 2 d 2 3 d 3 3 d 3 2 d 3 3 d 3 2 d 2 3 d 6 5 d 6 4 d 5 4 d 6 4 d 5 4 d 5 4 d 6 4 d 5 3 d 5 4 d 5 3 d 6 3 d 5 4 d 5 3 d 5 3 d 5 3 d 5 3 d 5 3 d 5 3 d 5 4 d 5 3 d 10 4 d 9 2 d 10 1 d 36 X
 9 -1 d 9 -1 d 9 -2 d 9 -4 d 8 -5 d 9 -5 d 8 -4 d 8 -2 d 8 -2 d 8 -2 d 8 -1 d 8 -2 d 8 X 8 -1 d 8 -1 d 7 X 8 -1 d 7 X 8 -1 d 14 X 8 -1 d 21 X 7 -1 d 40 X 7 -1 d 62 X 6 -1 d 80 X 13 -1 d 99 X 12 -1 d 11 X 12 -1 d 22 -5 d 21 -4 d 21 -4 d 20 -3 d 20 -2
 d 19 -2 d 19 -2 d 19 -1 d 18 -1 d 17 -1 d 34 X 17 -1 d 47 X 15 1 d 44 X 14 1 d 28 X 13 1 d 26 X 13 1 d 12 X 12 1 d 13 X 12 1 d 23 X 11 1 d 12 X 11 1 d 21 X 11 1 d 21 X 10 1 d 10 X 10 1 d 20 X 9 1 d 19 X 9 1 d 27 X 9 1 d 18 X 8 1 d 25 X 8 1 d 24 X 8
 1 d s
 gsave  2268 1630 0 0 C 2199.34 1142.4 t 90 r /Helvetica-BoldOblique findfont 37.0356 sf 0 0 m 
 420 402 381 360 349 319 283 273 247 222 211 186 156 127 116 89 78 51 23
(LHC HIGGS XS WG 2011) K NC gr  0.2 0.2 0.2 c black 0.2 0.2 0.2 c
 gsave  2268 1630 0 0 C 1435.84 905.947 t 0 r /Symbol findfont 59.8267 sf 0 0 m (t) show NC gr  black 0.2 0.2 0.2 c
 gsave  2268 1630 0 0 C 1424.45 905.947 t 0 r /Helvetica findfont 59.8267 sf 0 0 m (,) show NC gr  black 0.2 0.2 0.2 c
 gsave  2268 1630 0 0 C 1390.26 905.947 t 0 r /Symbol findfont 59.8267 sf 0 0 m (m) show NC gr  black 0.2 0.2 0.2 c
 gsave  2268 1630 0 0 C 1210.78 905.947 t 0 r /Helvetica findfont 59.8267 sf 0 0 m (llll, l=e,) show NC gr  1 0 0 c black 1 0 0 c
 gsave  2268 1630 0 0 C 1390.26 809.085 t 0 r /Symbol findfont 59.8267 sf 0 0 m (m) show NC gr  black 1 0 0 c
 gsave  2268 1630 0 0 C 1210.78 809.085 t 0 r /Helvetica findfont 59.8267 sf 0 0 m (llll, l=e,) show NC gr  0 0 0.6 c black 0 0 0.6 c
 gsave  2268 1630 0 0 C 1210.78 638.151 t 0 r /Helvetica findfont 59.8267 sf 0 0 m (eeee) show NC gr  0 0.4 0 c black 0 0.4 0 c
 gsave  2268 1630 0 0 C 1310.49 720.769 t 0 r /Symbol findfont 59.8267 sf 0 0 m (m) show NC gr  black 0 0.4 0 c
 gsave  2268 1630 0 0 C 1276.3 720.769 t 0 r /Symbol findfont 59.8267 sf 0 0 m (m) show NC gr  black 0 0.4 0 c
 gsave  2268 1630 0 0 C 1210.78 720.769 t 0 r /Helvetica findfont 59.8267 sf 0 0 m (ee) show NC gr  0.8 0.2 0.2 c black 0.8 0.2 0.2 c
 gsave  2268 1630 0 0 C 1236.42 1296.24 t 0 r /Helvetica findfont 59.8267 sf 0 0 m (=any) show NC gr  black 0.8 0.2 0.2 c
 gsave  2268 1630 0 0 C 1205.08 1296.24 t 0 r /Symbol findfont 59.8267 sf 0 0 m (n) show NC gr  black 0.8 0.2 0.2 c
 gsave  2268 1630 0 0 C 1179.44 1296.24 t 0 r /Helvetica findfont 59.8267 sf 0 0 m (, ) show NC gr  black 0.8 0.2 0.2 c
 gsave  2268 1630 0 0 C 1153.8 1296.24 t 0 r /Symbol findfont 59.8267 sf 0 0 m (t) show NC gr  black 0.8 0.2 0.2 c
 gsave  2268 1630 0 0 C 1142.4 1296.24 t 0 r /Helvetica findfont 59.8267 sf 0 0 m (,) show NC gr  black 0.8 0.2 0.2 c
 gsave  2268 1630 0 0 C 1108.22 1296.24 t 0 r /Symbol findfont 59.8267 sf 0 0 m (m) show NC gr  black 0.8 0.2 0.2 c
 gsave  2268 1630 0 0 C 980.018 1296.24 t 0 r /Helvetica findfont 59.8267 sf 0 0 m (, l=e,) show NC gr  black 0.8 0.2 0.2 c
 gsave  2268 1630 0 0 C 948.68 1296.24 t 0 r /Symbol findfont 59.8267 sf 0 0 m (n) show NC gr  black 0.8 0.2 0.2 c
 gsave  2268 1630 0 0 C 917.343 1296.24 t 0 r /Symbol findfont 59.8267 sf 0 0 m (n) show NC gr  black 0.8 0.2 0.2 c
 gsave  2268 1630 0 0 C 894.552 1296.24 t 0 r /Helvetica findfont 59.8267 sf 0 0 m (ll) show NC gr  0.6 0.2 0.8 c black 0.6 0.2 0.8 c
 gsave  2268 1630 0 0 C 1199.38 1199.38 t 0 r /Helvetica findfont 59.8267 sf 0 0 m (=any) show NC gr  black 0.6 0.2 0.8 c
 gsave  2268 1630 0 0 C 1168.04 1199.38 t 0 r /Symbol findfont 59.8267 sf 0 0 m (n) show NC gr  black 0.6 0.2 0.8 c
 gsave  2268 1630 0 0 C 1142.4 1199.38 t 0 r /Helvetica findfont 59.8267 sf 0 0 m (, ) show NC gr  black 0.6 0.2 0.8 c
 gsave  2268 1630 0 0 C 1108.22 1199.38 t 0 r /Symbol findfont 59.8267 sf 0 0 m (m) show NC gr  black 0.6 0.2 0.8 c
 gsave  2268 1630 0 0 C 980.018 1199.38 t 0 r /Helvetica findfont 59.8267 sf 0 0 m (, l=e,) show NC gr  black 0.6 0.2 0.8 c
 gsave  2268 1630 0 0 C 948.68 1199.38 t 0 r /Symbol findfont 59.8267 sf 0 0 m (n) show NC gr  black 0.6 0.2 0.8 c
 gsave  2268 1630 0 0 C 917.343 1199.38 t 0 r /Symbol findfont 59.8267 sf 0 0 m (n) show NC gr  black 0.6 0.2 0.8 c
 gsave  2268 1630 0 0 C 894.552 1199.38 t 0 r /Helvetica findfont 59.8267 sf 0 0 m (ll) show NC gr  1 0 1 c black 1 0 1 c
 gsave  2268 1630 0 0 C 1005.66 1031.3 t 0 r /Symbol findfont 59.8267 sf 0 0 m (n) show NC gr  black 1 0 1 c
 gsave  2268 1630 0 0 C 957.227 1031.3 t 0 r /Helvetica findfont 59.8267 sf 0 0 m ( e) show NC gr  black 1 0 1 c
 gsave  2268 1630 0 0 C 925.889 1031.3 t 0 r /Symbol findfont 59.8267 sf 0 0 m (n) show NC gr  black 1 0 1 c
 gsave  2268 1630 0 0 C 894.552 1031.3 t 0 r /Helvetica findfont 59.8267 sf 0 0 m (e) show NC gr  0 0 0.4 c black 0 0 0.4 c
 gsave  2268 1630 0 0 C 1019.9 960.076 t 0 r /Symbol findfont 59.8267 sf 0 0 m (n) show NC gr  black 0 0 0.4 c
 gsave  2268 1630 0 0 C 1005.66 960.076 t 0 r /Helvetica findfont 59.8267 sf 0 0 m ( ) show NC gr  black 0 0 0.4 c
 gsave  2268 1630 0 0 C 971.472 960.076 t 0 r /Symbol findfont 59.8267 sf 0 0 m (m) show NC gr  black 0 0 0.4 c
 gsave  2268 1630 0 0 C 957.227 960.076 t 0 r /Helvetica findfont 59.8267 sf 0 0 m ( ) show NC gr  black 0 0 0.4 c
 gsave  2268 1630 0 0 C 925.889 960.076 t 0 r /Symbol findfont 59.8267 sf 0 0 m (n) show NC gr  black 0 0 0.4 c
 gsave  2268 1630 0 0 C 894.552 960.076 t 0 r /Helvetica findfont 59.8267 sf 0 0 m (e) show NC gr 
 gr  gr showpage
end
%%EOF
