%!PS-Adobe-2.0 EPSF-2.0
%%BoundingBox:  0 0 567 415
%%Title: weight_pTM_130.eps: c1
%%Creator: ROOT Version 5.27/06b
%%CreationDate: Mon Dec  5 16:24:26 2011
%%EndComments
%%BeginProlog
80 dict begin
/s {stroke} def /l {lineto} def /m {moveto} def /t {translate} def
/r {rotate} def /rl {roll}  def /R {repeat} def
/d {rlineto} def /rm {rmoveto} def /gr {grestore} def /f {eofill} def
/c {setrgbcolor} def /black {0 setgray} def /sd {setdash} def
/cl {closepath} def /sf {scalefont setfont} def /lw {setlinewidth} def
/box {m dup 0 exch d exch 0 d 0 exch neg d cl} def
/NC{systemdict begin initclip end}def/C{NC box clip newpath}def
/bl {box s} def /bf {box f} def /Y { 0 exch d} def /X { 0 d} def 
/K {{pop pop 0 moveto} exch kshow} bind def
/ita {/ang 15 def gsave [1 0 ang dup sin exch cos div 1 0 0] concat} def 
/mp {newpath /y exch def /x exch def} def
/side {[w .77 mul w .23 mul] .385 w mul sd w 0 l currentpoint t -144 r} def
/mr {mp x y w2 0 360 arc} def /m24 {mr s} def /m20 {mr f} def
/mb {mp x y w2 add m w2 neg 0 d 0 w neg d w 0 d 0 w d cl} def
/mt {mp x y w2 add m w2 neg w neg d w 0 d cl} def
/m21 {mb f} def /m25 {mb s} def /m22 {mt f} def /m26{mt s} def
/m23 {mp x y w2 sub m w2 w d w neg 0 d cl f} def
/m27 {mp x y w2 add m w3 neg w2 neg d w3 w2 neg d w3 w2 d cl s} def
/m28 {mp x w2 sub y w2 sub w3 add m w3 0 d  0 w3 neg d w3 0 d 0 w3 d w3 0 d  0 w3 d w3 neg 0 d 0 w3 d w3 neg 0 d 0 w3 neg d w3 neg 0 d cl s } def
/m29 {mp gsave x w2 sub y w2 add w3 sub m currentpoint t 4 {side} repeat cl fill gr} def
/m30 {mp gsave x w2 sub y w2 add w3 sub m currentpoint t 4 {side} repeat cl s gr} def
/m31 {mp x y w2 sub m 0 w d x w2 sub y m w 0 d x w2 sub y w2 add m w w neg d x w2 sub y w2 sub m w w d s} def
/m32 {mp x y w2 sub m w2 w d w neg 0 d cl s} def
/m33 {mp x y w2 add m w3 neg w2 neg d w3 w2 neg d w3 w2 d cl f} def
/m34 {mp x w2 sub y w2 sub w3 add m w3 0 d  0 w3 neg d w3 0 d 0 w3 d w3 0 d  0 w3 d w3 neg 0 d 0 w3 d w3 neg 0 d 0 w3 neg d w3 neg 0 d cl f } def
/m2 {mp x y w2 sub m 0 w d x w2 sub y m w 0 d s} def
/m5 {mp x w2 sub y w2 sub m w w d x w2 sub y w2 add m w w neg d s} def
/reEncode {exch findfont dup length dict begin {1 index /FID eq  {pop pop} {def} ifelse } forall /Encoding exch def currentdict end dup /FontName get exch definefont pop } def [/Times-Bold /Times-Italic /Times-BoldItalic /Helvetica /Helvetica-Oblique
 /Helvetica-Bold /Helvetica-BoldOblique /Courier /Courier-Oblique /Courier-Bold /Courier-BoldOblique /Times-Roman /AvantGarde-Book /AvantGarde-BookOblique /AvantGarde-Demi /AvantGarde-DemiOblique /Bookman-Demi /Bookman-DemiItalic /Bookman-Light
 /Bookman-LightItalic /Helvetica-Narrow /Helvetica-Narrow-Bold /Helvetica-Narrow-BoldOblique /Helvetica-Narrow-Oblique /NewCenturySchlbk-Roman /NewCenturySchlbk-Bold /NewCenturySchlbk-BoldItalic /NewCenturySchlbk-Italic /Palatino-Bold
 /Palatino-BoldItalic /Palatino-Italic /Palatino-Roman ] {ISOLatin1Encoding reEncode } forall%%EndProlog
%%BeginSetup
%%EndSetup
newpath  gsave  .25 .25 scale  gsave  0 0 t black[  ] 0 sd 3 lw 1 1 1 c 2268 1660 0 0 bf black 1 1 1 c 1791 1311 363 266 bf black 1791 1311 363 266 bl 1 1 1 c 1791 1311 363 266 bf black 1791 1311 363 266 bl 363 266 m 1791 X s
 gsave  2268 1660 0 0 C 1933.12 103.75 t 0 r /Helvetica findfont 78.706 sf 0 0 m ( [GeV]) show NC gr 
 gsave  2268 1660 0 0 C 1901.12 61.9375 t 0 r /Helvetica findfont 51.6508 sf 0 0 m (T) show NC gr 
 gsave  2268 1660 0 0 C 1859.31 103.75 t 0 r /Helvetica findfont 78.706 sf 0 0 m (p) show NC gr  363 305 m -39 Y s
 gsave  2268 1660 0 0 C 363 162.312 t 0 r  -21 0 t /Helvetica findfont 78.706 sf 0 0 m (1) show NC gr  563 285 m -19 Y s 680 285 m -19 Y s 763 285 m -19 Y s 827 285 m -19 Y s 879 285 m -19 Y s 924 285 m -19 Y s 962 285 m -19 Y s 996 285 m -19 Y s
 1027 305 m -39 Y s
 gsave  2268 1660 0 0 C 1026.44 162.312 t 0 r  -43 0 t /Helvetica findfont 78.706 sf 0 0 m (10) show NC gr  1226 285 m -19 Y s 1343 285 m -19 Y s 1426 285 m -19 Y s 1490 285 m -19 Y s 1543 285 m -19 Y s 1587 285 m -19 Y s 1626 285 m -19 Y s 1660 285
 m -19 Y s 1690 305 m -39 Y s
 gsave  2268 1660 0 0 C 1719.12 197.125 t 0 r /Helvetica findfont 51.6508 sf 0 0 m (2) show NC gr 
 gsave  2268 1660 0 0 C 1633.06 162.75 t 0 r /Helvetica findfont 78.706 sf 0 0 m (10) show NC gr  1890 285 m -19 Y s 2007 285 m -19 Y s 2089 285 m -19 Y s 2154 285 m -19 Y s 363 1577 m 1791 X s 363 1538 m 39 Y s 563 1558 m 19 Y s 680 1558 m 19 Y s
 763 1558 m 19 Y s 827 1558 m 19 Y s 879 1558 m 19 Y s 924 1558 m 19 Y s 962 1558 m 19 Y s 996 1558 m 19 Y s 1027 1538 m 39 Y s 1226 1558 m 19 Y s 1343 1558 m 19 Y s 1426 1558 m 19 Y s 1490 1558 m 19 Y s 1543 1558 m 19 Y s 1587 1558 m 19 Y s 1626
 1558 m 19 Y s 1660 1558 m 19 Y s 1690 1538 m 39 Y s 1890 1558 m 19 Y s 2007 1558 m 19 Y s 2089 1558 m 19 Y s 2154 1558 m 19 Y s 363 266 m 1311 Y s
 gsave  2268 1660 0 0 C 174.562 799.75 t 90 r /Helvetica findfont 78.706 sf 0 0 m (HqT/POWHEG weight) show NC gr  417 335 m -54 X s 390 369 m -27 X s 390 404 m -27 X s 390 438 m -27 X s 417 473 m -54 X s 390 507 m -27 X s 390 542 m -27 X s 390 576 m
 -27 X s 417 611 m -54 X s 390 645 m -27 X s 390 680 m -27 X s 390 714 m -27 X s 417 749 m -54 X s 390 783 m -27 X s 390 818 m -27 X s 390 852 m -27 X s 417 887 m -54 X s 390 921 m -27 X s 390 956 m -27 X s 390 990 m -27 X s 417 1025 m -54 X s 390
 1059 m -27 X s 390 1094 m -27 X s 390 1129 m -27 X s 417 1163 m -54 X s 390 1198 m -27 X s 390 1232 m -27 X s 390 1267 m -27 X s 417 1301 m -54 X s 390 1336 m -27 X s 390 1370 m -27 X s 390 1405 m -27 X s 417 1439 m -54 X s 390 1474 m -27 X s 390
 1508 m -27 X s 390 1543 m -27 X s 417 1577 m -54 X s 417 335 m -54 X s 390 300 m -27 X s 390 266 m -27 X s 417 1577 m -54 X s
 gsave  2268 1660 0 0 C 243.438 307.812 t 0 r /Helvetica findfont 78.706 sf 0 0 m (0.2) show NC gr 
 gsave  2268 1660 0 0 C 243.438 445.562 t 0 r /Helvetica findfont 78.706 sf 0 0 m (0.4) show NC gr 
 gsave  2268 1660 0 0 C 241 583.312 t 0 r /Helvetica findfont 78.706 sf 0 0 m (0.6) show NC gr 
 gsave  2268 1660 0 0 C 241 721 t 0 r /Helvetica findfont 78.706 sf 0 0 m (0.8) show NC gr 
 gsave  2268 1660 0 0 C 319.688 858.75 t 0 r /Helvetica findfont 78.706 sf 0 0 m (1) show NC gr 
 gsave  2268 1660 0 0 C 243.438 996.5 t 0 r /Helvetica findfont 78.706 sf 0 0 m (1.2) show NC gr 
 gsave  2268 1660 0 0 C 243.438 1134.25 t 0 r /Helvetica findfont 78.706 sf 0 0 m (1.4) show NC gr 
 gsave  2268 1660 0 0 C 241 1271.94 t 0 r /Helvetica findfont 78.706 sf 0 0 m (1.6) show NC gr 
 gsave  2268 1660 0 0 C 241 1412.19 t 0 r /Helvetica findfont 78.706 sf 0 0 m (1.8) show NC gr 
 gsave  2268 1660 0 0 C 307.375 1549.88 t 0 r /Helvetica findfont 78.706 sf 0 0 m (2) show NC gr  2154 266 m 1311 Y s 2101 335 m 53 X s 2127 369 m 27 X s 2127 404 m 27 X s 2127 438 m 27 X s 2101 473 m 53 X s 2127 507 m 27 X s 2127 542 m 27 X s 2127
 576 m 27 X s 2101 611 m 53 X s 2127 645 m 27 X s 2127 680 m 27 X s 2127 714 m 27 X s 2101 749 m 53 X s 2127 783 m 27 X s 2127 818 m 27 X s 2127 852 m 27 X s 2101 887 m 53 X s 2127 921 m 27 X s 2127 956 m 27 X s 2127 990 m 27 X s 2101 1025 m 53 X s
 2127 1059 m 27 X s 2127 1094 m 27 X s 2127 1129 m 27 X s 2101 1163 m 53 X s 2127 1198 m 27 X s 2127 1232 m 27 X s 2127 1267 m 27 X s 2101 1301 m 53 X s 2127 1336 m 27 X s 2127 1370 m 27 X s 2127 1405 m 27 X s 2101 1439 m 53 X s 2127 1474 m 27 X s
 2127 1508 m 27 X s 2127 1543 m 27 X s 2101 1577 m 53 X s 2101 335 m 53 X s 2127 300 m 27 X s 2127 266 m 27 X s 2101 1577 m 53 X s 6 lw 1 1 1 c black 377 829 m cl s 426 895 m cl s 471 947 m cl s 507 989 m cl s 539 1021 m cl s 569 1045 m cl s 596 1060
 m cl s 621 1070 m cl s 643 1075 m cl s 665 1075 m cl s 684 1075 m cl s 702 1070 m cl s 719 1067 m cl s 736 1065 m cl s 751 1063 m cl s 766 1063 m cl s 778 1065 m cl s 793 1067 m cl s 805 1072 m cl s 817 1072 m cl s 830 1072 m cl s 839 1070 m cl s
 852 1063 m cl s 862 1055 m cl s 871 1048 m cl s 881 1040 m cl s 891 1035 m cl s 898 1031 m cl s 908 1028 m cl s 916 1028 m cl s 926 1026 m cl s 933 1023 m cl s 940 1021 m cl s 948 1016 m cl s 955 1013 m cl s 962 1013 m cl s 970 1013 m cl s 977 1016
 m cl s 985 1016 m cl s 989 1016 m cl s 997 1013 m cl s 1004 1011 m cl s 1009 1006 m cl s 1014 1001 m cl s 1021 996 m cl s 1026 991 m cl s 1034 991 m cl s 1039 991 m cl s 1044 994 m cl s 1049 996 m cl s 1053 999 m cl s 1058 999 m cl s 1066 1001 m cl
 s 1071 1001 m cl s 1076 1001 m cl s 1080 1001 m cl s 1083 1001 m cl s 1088 999 m cl s 1093 996 m cl s 1098 996 m cl s 1103 999 m cl s 1108 1004 m cl s 1110 1008 m cl s 1115 1013 m cl s 1120 1013 m cl s 1122 1013 m cl s 1127 1006 m cl s 1132 996 m cl
 s 1135 986 m cl s 1140 976 m cl s 1144 969 m cl s 1147 969 m cl s 1152 972 m cl s 1154 979 m cl s 1159 984 m cl s 1162 986 m cl s 1167 989 m cl s 1169 986 m cl s 1171 984 m cl s 1176 981 m cl s 1179 981 m cl s 1184 979 m cl s 1186 981 m cl s 1189
 981 m cl s 1194 984 m cl s 1196 984 m cl s 1199 981 m cl s 1201 976 m cl s 1206 974 m cl s 1208 969 m cl s 1211 967 m cl s 1213 964 m cl s 1218 967 m cl s 1221 967 m cl s 1223 969 m cl s 1226 972 m cl s 1228 974 m cl s 1231 974 m cl s 1235 976 m cl
 s 1238 976 m cl s 1240 976 m cl s 1243 974 m cl s 1245 974 m cl s 1248 969 m cl s 1250 967 m cl s 1253 962 m cl s 1255 957 m cl s 1258 952 m cl s 1260 947 m cl s 1262 944 m cl s 1265 944 m cl s 1267 944 m cl s 1270 949 m cl s 1272 954 m cl s 1275
 959 m cl s 1277 967 m cl s 1280 972 m cl s 1282 974 m cl s 1285 976 m cl s 1287 976 m cl s 1290 974 m cl s 1292 967 m cl s 1294 957 m cl s 1297 944 m cl s 1299 937 m cl s 1302 932 m cl s 1304 930 m cl s 1307 940 m -8 Y s 1309 944 m cl s 1312 949 m
 cl s 1314 952 m cl s 1317 954 m cl s 1319 952 m cl s 1322 949 m -7 Y s 1324 935 m cl s 1326 925 m cl s 1329 915 m cl s 1331 910 m cl s 1334 908 m -3 Y s 1336 912 m cl s 1339 920 m cl s 1341 925 m cl s 1344 932 m -2 Y s 1346 932 m cl s 1349 927 m cl
 s 1351 925 m -3 Y s 1353 920 m cl s 1356 917 m cl s 1358 917 m -2 Y s 1361 912 m cl s 1363 908 m cl s 1366 903 m -8 Y s 1368 893 m cl s 1371 888 m cl s 1373 888 m cl s 1376 895 m -5 Y s 1378 900 m cl s 1381 908 m cl s 1383 922 m -7 Y s 1385 927 m cl
 s 1388 930 m -3 Y s 1390 925 m cl s 1393 917 m -7 Y s 1395 900 m cl s 1398 888 m -10 Y s 1400 868 m -5 Y s 1403 858 m cl s 1405 866 m -5 Y s 1408 873 m cl s 1410 885 m -4 Y s 1413 893 m -3 Y s 1415 893 m cl s 1417 893 m -3 Y s 1420 888 m -3 Y s 1422
 883 m cl s 1425 883 m cl s 1427 883 m cl s 1430 885 m cl s 1432 885 m cl s 1435 883 m -2 Y s 1437 876 m -3 Y s 1440 871 m -3 Y s 1442 868 m cl s 1445 868 m cl s 1447 866 m -5 Y s 1449 856 m -5 Y s 1452 846 m -2 Y s 1454 849 m -3 Y s 1457 856 m -3 Y
 s 1459 853 m cl s 1462 849 m -10 Y s 1464 831 m -7 Y s 1467 824 m -3 Y s 1469 841 m -10 Y s 1472 853 m -4 Y s 1474 856 m -3 Y s 1476 846 m -5 Y s 1479 836 m -5 Y s 1481 831 m -2 Y s 1484 834 m -3 Y s 1486 836 m cl s 1489 836 m cl s 1491 836 m -2 Y s
 1494 831 m -5 Y s 1496 821 m -7 Y s 1499 807 m -5 Y s 1501 802 m -3 Y s 1504 821 m -14 Y s 1506 834 m -5 Y s 1508 834 m -5 Y s 1511 824 m -5 Y s 1513 817 m cl s 1516 824 m -3 Y s 1518 826 m -2 Y s 1521 821 m -12 Y s 1523 799 m -7 Y s 1526 782 m -12
 Y s 1528 775 m -5 Y s 1531 797 m -15 Y s 1533 802 m cl s 1536 797 m -10 Y s 1538 782 m -5 Y s 1540 780 m -3 Y s 1543 787 m -5 Y s 1545 797 m -5 Y s 1548 797 m -3 Y s 1550 787 m -12 Y s 1553 767 m -7 Y s 1555 760 m cl s 1558 767 m -5 Y s 1560 770 m
 -3 Y s 1563 762 m -9 Y s 1565 745 m -2 Y s 1567 743 m -3 Y s 1570 743 m -3 Y s 1572 738 m -8 Y s 1575 740 m -10 Y s 1577 755 m -10 Y s 1580 755 m -5 Y s 1582 748 m cl s 1585 753 m -5 Y s 1587 758 m -3 Y s 1590 753 m -10 Y s 1592 740 m -5 Y s 1595
 735 m -2 Y s 1597 730 m -2 Y s 1599 728 m -5 Y s 1602 723 m -5 Y s 1604 713 m -7 Y s 1607 701 m -12 Y s 1609 684 m -5 Y s 1612 713 m -22 Y s 1614 730 m -7 Y s 1617 728 m -12 Y s 1619 708 m -9 Y s 1622 706 m -7 Y s 1624 721 m -10 Y s 1627 721 m -3 Y
 s 1629 713 m -5 Y s 1631 711 m -3 Y s 1634 721 m -8 Y s 1636 721 m -8 Y s 1639 706 m -10 Y s 1641 701 m -5 Y s 1644 701 m -5 Y s 1646 691 m -20 Y s 1649 667 m -5 Y s 1651 694 m -27 Y s 1654 701 m -7 Y s 1656 689 m -10 Y s 1658 679 m -3 Y s 1661 684
 m -5 Y s 1663 689 m -3 Y s 1666 686 m -12 Y s 1668 667 m -8 Y s 1671 667 m -5 Y s 1673 664 m -2 Y s 1676 689 m -25 Y s 1678 723 m -24 Y s 1681 723 m -39 Y s 1683 667 m -35 Y s 1686 647 m -15 Y s 1688 667 m -13 Y s 1690 667 m -18 Y s 1693 644 m -7 Y
 s 1695 635 m -3 Y s 1698 642 m -5 Y s 1700 644 m cl s 1703 642 m -5 Y s 1705 635 m -3 Y s 1708 630 m -10 Y s 1710 625 m -10 Y s 1713 667 m -35 Y s 1715 679 m -17 Y s 1718 649 m -27 Y s 1720 625 m -3 Y s 1722 637 m -10 Y s 1725 637 m -12 Y s 1727 620
 m -20 Y s 1730 615 m -15 Y s 1732 622 m -12 Y s 1735 600 m -10 Y s 1737 632 m -22 Y s 1740 632 m -20 Y s 1742 605 m -7 Y s 1745 627 m -24 Y s 1747 637 m -15 Y s 1749 615 m -17 Y s 1752 615 m -17 Y s 1754 632 m -10 Y s 1757 625 m -57 Y s 1759 603 m
 -40 Y s 1762 608 m -32 Y s 1764 617 m -39 Y s 1767 647 m -20 Y s 1769 630 m -57 Y s 1772 600 m -34 Y s 1774 659 m -42 Y s 1777 647 m -67 Y s 1779 585 m -14 Y s 1781 603 m -13 Y s 1784 600 m -17 Y s 1786 588 m -8 Y s 1789 632 m -39 Y s 1791 637 m -54
 Y s 1794 588 m -10 Y s 1796 593 m -8 Y s 1799 637 m -37 Y s 1801 649 m -7 Y s 1804 635 m -52 Y s 1806 593 m -25 Y s 1809 617 m -27 Y s 1811 610 m -34 Y s 1813 610 m -12 Y s 1816 622 m -19 Y s 1818 627 m -37 Y s 1821 652 m -32 Y s 1823 595 m -51 Y s
 1826 608 m -37 Y s 1828 662 m -91 Y s 1831 686 m -59 Y s 1833 612 m -12 Y s 1836 622 m -17 Y s 1838 642 m -39 Y s 1840 639 m -46 Y s 1843 588 m -12 Y s 1845 657 m -54 Y s 1848 620 m -62 Y s 1850 671 m -95 Y s 1853 652 m -113 Y s 1855 583 m -49 Y s
 1858 583 m -10 Y s 1860 625 m -52 Y s 1863 647 m -71 Y s 1865 568 m -2 Y s 1868 630 m -62 Y s 1870 600 m -61 Y s 1872 625 m -40 Y s 1875 630 m -32 Y s 1877 593 m -35 Y s 1880 625 m -72 Y s 1882 649 m -22 Y s 1885 627 m -59 Y s 1887 612 m -98 Y s
 1890 652 m -69 Y s 1892 600 m -74 Y s 1895 652 m -128 Y s 1897 617 m -78 Y s 1900 649 m -59 Y s 1902 598 m -50 Y s 1904 561 m -64 Y s 1907 600 m -96 Y s 1909 632 m -74 Y s 1912 637 m -125 Y s 1914 711 m -187 Y s 1917 713 m -182 Y s 1919 654 m -93 Y
 s 1922 590 m -22 Y s 1924 610 m -37 Y s 1927 635 m -27 Y s 1929 595 m -47 Y s 1931 622 m -56 Y s 1934 644 m -113 Y s 1936 608 m -45 Y s 1939 743 m -155 Y s 1941 689 m -126 Y s 1944 758 m -69 Y s 1946 762 m -250 Y s 1949 600 m -91 Y s 1951 662 m -47
 Y s 1954 691 m -54 Y s 1956 689 m -234 Y s 1959 667 m -192 Y s 1961 603 m -94 Y s 1963 603 m -37 Y s 1966 799 m -204 Y s 1968 743 m -261 Y s 1971 721 m -222 Y s 1973 726 m -232 Y s 1976 770 m -219 Y s 1978 713 m -169 Y s 1981 758 m -232 Y s 1983 708
 m -93 Y s 1986 667 m -106 Y s 1988 750 m -241 Y s 1991 1013 m -241 Y s 1993 817 m -320 Y s 1995 600 m -128 Y s 1998 1107 m -677 Y s 2000 679 m -165 Y s 2003 733 m -320 Y s 2005 639 m -135 Y s 2008 681 m -206 Y s 2010 728 m -192 Y s 2013 735 m -199 Y
 s 2015 1018 m -506 Y s 2018 974 m -487 Y s 2020 777 m -411 Y s 2022 853 m -383 Y s 2025 824 m -293 Y s 2027 563 m -142 Y s 2030 794 m -201 Y s 2032 691 m -128 Y s 2035 730 m -199 Y s 2037 615 m -49 Y s 2040 703 m -186 Y s 2042 846 m -374 Y s 2045
 814 m -374 Y s 2047 706 m -268 Y s 2050 622 m -142 Y s 2052 627 m -174 Y s 2054 603 m -227 Y s 2057 952 m -595 Y s 2059 571 m -114 Y s 2062 519 m -37 Y s 2064 1525 m -1119 Y s 2067 755 m -300 Y s 2069 615 m -148 Y s 2072 644 m -155 Y s 2074 777 m
 -315 Y s 2077 935 m -559 Y s 2079 647 m -226 Y s 2082 917 m -400 Y s 2084 772 m -248 Y s 2086 676 m -209 Y s 2089 804 m -177 Y s 2091 1577 m -1083 Y s 2094 1577 m -1154 Y s 2096 1107 m -723 Y s 2099 539 m -148 Y s 2101 679 m -256 Y s 2104 900 m -568
 Y s 2106 881 m -556 Y s 2109 846 m -393 Y s 2111 659 m -214 Y s 2114 617 m -226 Y s 2116 762 m -366 Y s 2118 1274 m -775 Y s 2121 740 m -442 Y s 2123 691 m -371 Y s 2126 1163 m -664 Y s 2128 703 m -351 Y s 2131 1136 m -560 Y s 2133 1168 m -740 Y s
 2136 1006 m -731 Y s 2138 610 m -280 Y s 2141 920 m -482 Y s 2143 856 m -571 Y s 2145 898 m -605 Y s 2148 1577 m -1304 Y s 2150 841 m -573 Y s 2153 821 m -501 Y s 377 829 m 49 66 d 45 52 d 36 42 d 32 32 d 30 24 d 27 15 d 25 10 d 22 5 d 41 X 18 -5 d
 17 -3 d 17 -2 d 15 -2 d 15 X 12 2 d 15 2 d 12 5 d 25 X 9 -2 d 13 -7 d 10 -8 d 9 -7 d 10 -8 d 10 -5 d 7 -4 d 10 -3 d 8 X 10 -2 d 7 -3 d 7 -2 d 8 -5 d 7 -3 d 15 X 7 3 d 12 X 8 -3 d 7 -2 d 5 -5 d 5 -5 d 7 -5 d 5 -5 d 13 X 5 3 d 5 2 d 4 3 d 5 X 8 2 d 17
 X 5 -2 d 5 -3 d 5 X 5 3 d 5 5 d 2 4 d 5 5 d 7 X 5 -7 d 5 -10 d 3 -10 d 5 -10 d 4 -7 d 3 X 5 3 d 2 7 d 5 5 d 3 2 d 5 3 d 2 -3 d 2 -2 d 5 -3 d 3 X 5 -2 d 2 2 d 3 X 5 3 d 2 X 3 -3 d 2 -5 d 5 -2 d 2 -5 d 3 -2 d 2 -3 d 5 3 d 3 X 2 2 d 3 3 d 2 2 d 3 X 4 2
 d 5 X 3 -2 d 2 X 3 -5 d 2 -2 d 3 -5 d 2 -5 d 3 -5 d 2 -5 d 2 -3 d 5 X 3 5 d 2 5 d 3 5 d 2 8 d 3 5 d 2 2 d 3 2 d 2 X 3 -2 d 2 -7 d 2 -10 d 3 -13 d 2 -7 d 3 -5 d 2 -2 d 3 7 d 2 7 d 3 5 d 2 3 d 3 2 d 2 -2 d 3 -5 d 2 -12 d 2 -10 d 3 -10 d 2 -5 d 3 -2 d
 2 4 d 3 8 d 2 5 d 3 7 d 2 X 3 -5 d 2 -2 d 2 -5 d 3 -3 d 2 X 3 -5 d 2 -4 d 3 -8 d 2 -7 d 3 -5 d 2 X 3 5 d 2 7 d 3 8 d 2 12 d 2 7 d 3 3 d 2 -5 d 3 -10 d 2 -15 d 3 -17 d 2 -17 d 3 -8 d 2 5 d 3 10 d 2 10 d 3 10 d 4 X 3 -5 d 2 -5 d 5 X 3 2 d 2 X 3 -2 d 2
 -7 d 3 -5 d 2 -3 d 3 X 2 -5 d 2 -10 d 3 -7 d 2 3 d 3 7 d 2 -3 d 3 -9 d 2 -15 d 3 -5 d 2 12 d 3 15 d 2 5 d 2 -12 d 3 -10 d 2 -3 d 3 3 d 2 2 d 5 X 3 -7 d 2 -10 d 3 -15 d 2 -2 d 3 12 d 2 17 d 2 X 3 -10 d 2 -4 d 3 7 d 2 2 d 3 -9 d 2 -20 d 3 -20 d 2 -5 d
 3 18 d 2 12 d 3 -10 d 2 -12 d 2 X 3 5 d 2 9 d 3 3 d 2 -15 d 3 -17 d 2 -5 d 3 5 d 2 5 d 3 -12 d 2 -13 d 2 -2 d 3 X 2 -8 d 3 X 2 15 d 3 3 d 2 -5 d 3 2 d 2 8 d 3 -10 d 2 -10 d 3 -3 d 2 -5 d 2 -4 d 3 -5 d 2 -10 d 3 -15 d 2 -15 d 3 22 d 2 25 d 3 -5 d 2
 -20 d 3 X 2 13 d 3 5 d 2 -10 d 2 X 3 7 d 2 X 3 -17 d 2 -2 d 3 X 2 -18 d 3 -17 d 2 17 d 3 18 d 2 -15 d 2 -5 d 3 2 d 2 8 d 3 -8 d 2 -17 d 5 X 3 12 d 2 35 d 3 -8 d 2 -54 d 3 -10 d 2 23 d 2 -3 d 3 -17 d 2 -7 d 3 4 d 2 5 d 3 -5 d 2 -4 d 3 -10 d 2 -5 d 3
 29 d 2 22 d 3 -34 d 2 -12 d 2 7 d 3 X 2 -22 d 3 -2 d 2 9 d 3 -22 d 2 27 d 3 X 2 -19 d 3 12 d 2 15 d 2 -22 d 3 X 2 19 d 3 -29 d 2 -15 d 3 10 d 2 5 d 3 39 d 2 -34 d 3 -20 d 2 56 d 3 -24 d 2 -37 d 2 20 d 3 -5 d 2 -8 d 3 27 d 2 -2 d 3 -27 d 2 7 d 3 30 d
 2 27 d 3 -37 d 2 -30 d 3 25 d 2 -12 d 2 12 d 3 7 d 2 -2 d 3 27 d 2 -66 d 3 19 d 2 27 d 3 40 d 2 -49 d 3 7 d 2 7 d 2 -5 d 3 -34 d 2 47 d 3 -40 d 2 35 d 3 -30 d 2 -37 d 3 20 d 2 22 d 3 12 d 2 -44 d 3 32 d 2 -29 d 2 34 d 3 10 d 2 -39 d 3 14 d 2 49 d 3
 -41 d 2 -35 d 3 54 d 2 -54 d 3 25 d 2 -10 d 3 42 d 2 -47 d 2 -44 d 3 24 d 2 42 d 3 -19 d 2 41 d 3 5 d 2 -14 d 3 -28 d 2 13 d 3 29 d 2 -49 d 2 22 d 3 -7 d 2 -3 d 3 82 d 2 -40 d 3 96 d 2 -86 d 3 -81 d 2 83 d 3 25 d 2 -91 d 3 -2 d 2 -15 d 2 29 d 3 114
 d 2 -87 d 3 -2 d 2 X 3 52 d 2 -32 d 3 12 d 2 20 d 3 -47 d 2 15 d 3 263 d 2 -236 d 2 -121 d 3 234 d 2 -172 d 3 -25 d 2 X 3 5 d 2 54 d 3 5 d 2 128 d 3 -35 d 2 -157 d 2 89 d 3 17 d 2 -187 d 3 202 d 2 -67 d 3 5 d 2 -42 d 3 20 d 2 49 d 3 -32 d 2 -54 d 3
 -22 d 2 -10 d 2 -52 d 3 165 d 2 -140 d 3 -12 d 2 465 d 3 -362 d 2 -64 d 3 27 d 2 52 d 3 37 d 2 -123 d 3 184 d 2 -69 d 2 -76 d 3 143 d 2 487 d 3 -77 d 2 -381 d 3 -280 d 2 86 d 3 66 d 2 -14 d 3 46 d 2 -96 d 3 -49 d 2 76 d 2 308 d 3 -369 d 2 -12 d 3
 324 d 2 -302 d 3 327 d 2 -57 d 3 -157 d 2 -172 d 3 209 d 2 -108 d 2 24 d 3 982 d s 2148 1577 m 2 -1021 d s 2150 556 m 3 15 d s 1 0 0 c 1 1 1 c black 1 0 0 c 363 822 m 199 214 d 117 42 d 83 -9 d 64 -7 d 53 -7 d 44 -6 d 39 -7 d 34 -7 d 30 -6 d 27 -6 d
 26 -7 d 23 -6 d 21 -6 d 20 -7 d 18 -6 d 18 -6 d 16 -6 d 16 -6 d 15 -6 d 14 -5 d 13 -6 d 13 -6 d 12 -6 d 12 -5 d 11 -6 d 11 -5 d 11 -6 d 10 -5 d 10 -5 d 9 -6 d 9 -5 d 9 -5 d 9 -5 d 8 -5 d 8 -5 d 8 -5 d 8 -5 d 7 -5 d 7 -5 d 8 -5 d 6 -4 d 7 -5 d 7 -5 d
 6 -4 d 7 -5 d 6 -4 d 6 -4 d 6 -5 d 6 -4 d s 1490 816 m 5 -4 d 6 -4 d 6 -5 d 5 -4 d 5 -4 d 5 -4 d 5 -4 d 5 -4 d 5 -3 d 5 -4 d 5 -4 d 5 -4 d 4 -3 d 5 -4 d 4 -4 d 5 -3 d 4 -4 d 4 -3 d 5 -4 d 4 -3 d 4 -3 d 4 -4 d 4 -3 d 4 -3 d 4 -3 d 3 -3 d 4 -3 d 4 -3
 d 4 -3 d 3 -3 d 4 -3 d 3 -3 d 4 -3 d 3 -2 d 4 -3 d 3 -3 d 3 -2 d 4 -3 d 3 -3 d 3 -2 d 3 -3 d 3 -2 d 4 -2 d 3 -3 d 3 -2 d 3 -2 d 3 -3 d 3 -2 d 3 -2 d s 1687 661 m 2 -2 d 3 -2 d 3 -2 d 3 -2 d 3 -2 d 3 -2 d 2 -2 d 3 -2 d 3 -2 d 2 -2 d 3 -2 d 3 -1 d 2
 -2 d 3 -2 d 2 -1 d 3 -2 d 2 -2 d 3 -1 d 2 -2 d 3 -1 d 2 -2 d 2 -1 d 3 -1 d 2 -2 d 2 -1 d 3 -1 d 2 -2 d 2 -1 d 3 -1 d 2 -1 d 2 -1 d 2 -2 d 2 -1 d 3 -1 d 2 -1 d 2 -1 d 2 -1 d 2 -1 d 2 -1 d 2 X 2 -1 d 2 -1 d 2 -1 d 3 -1 d 2 -1 d 2 X 1 -1 d 2 -1 d 2 X s
 1802 595 m 2 -1 d 2 -1 d 2 X 2 -1 d 2 X 2 -1 d 2 X 2 -1 d 1 X 2 -1 d 4 X 2 -1 d 3 X 2 -1 d 3 X 2 -1 d 9 X 1 -1 d 21 X 2 1 d 7 X 2 1 d 4 X 2 1 d s 1885 588 m 4 X 2 1 d 2 X 2 1 d 3 X 1 1 d 3 X 1 1 d 2 X 1 1 d 3 X 1 1 d 1 X 2 1 d 1 X 1 1 d 2 X 1 1 d 1
 X 2 1 d 1 X 1 1 d 1 X 2 1 d 1 X 1 1 d 1 X 2 1 d 1 X 1 1 d 1 X 2 1 d 1 X 1 1 d 1 X 1 1 d 2 1 d 1 X 1 1 d 1 X 1 1 d 2 X 1 1 d s 1949 610 m 1 X 1 1 d 1 1 d 4 X 1 -1 d 2 X 1 -1 d 4 X 1 -1 d 3 X 1 -1 d 2 X 1 -1 d 4 X 1 -1 d 3 X 1 -1 d 2 X 1 -1 d 3 X 1 -1
 d 2 X 1 -1 d 3 X 1 -1 d 3 X 1 -1 d 2 X s 2001 600 m 1 -1 d 3 X 1 -1 d 3 X 1 -1 d 2 X 1 -1 d 2 X 1 -1 d 2 X 1 -1 d 3 X 1 -1 d 2 X 1 -1 d 2 X 1 -1 d 3 X 1 -1 d 1 X 1 -1 d 3 X 1 -1 d 2 X 1 -1 d 2 X 1 -1 d s 2045 586 m 2 X 1 -1 d 2 X 1 -1 d 2 X 1 -1 d 2
 X 1 -1 d 2 X -1 Y 3 X 1 -1 d 2 X 1 -1 d 1 X 1 -1 d 2 X 1 -1 d 2 X 1 -1 d 2 X -1 Y 3 X -1 Y 2 X 1 -1 d 2 X s 2084 573 m 1 -1 d 2 X -1 Y 2 X 1 -1 d 2 X -1 Y 3 X -1 Y 2 X -1 Y 2 X 1 -1 d 2 X -1 Y 2 X 1 -1 d 2 X 1 -1 d 1 X 1 -1 d 2 X -1 Y 2 X 1 -1 d 1 X
 1 -1 d 1 X s 2118 559 m 1 X 1 -1 d 1 X 1 -1 d 1 X 1 -1 d 2 X 1 -1 d 1 X 1 -1 d 1 X 1 -1 d 1 X 1 -1 d 2 X -1 Y 2 X 1 -1 d 1 X 1 -1 d 1 X 1 -1 d 2 X -1 Y 2 X -1 Y 2 X s 2148 546 m 1 -1 d 1 X -1 Y 2 X 1 -1 d 1 X s black
 gsave  2268 1660 0 0 C 2198.75 1230.12 t 90 r /Helvetica-BoldOblique findfont 31.9743 sf 0 0 m 
 343 328 311 294 285 261 232 223 202 182 173 152 128 104 95 73 64 42 20
(LHC HIGGS XS WG 2011) K NC gr 
 gr  gr showpage
end
%%EOF
