%!PS-Adobe-2.0 EPSF-2.0
%%BoundingBox:  0 0 567 384
%%Title: ptH.eps: ptH
%%Creator: ROOT Version 5.27/06b
%%CreationDate: Fri Dec  9 13:47:38 2011
%%EndComments
%%BeginProlog
80 dict begin
/s {stroke} def /l {lineto} def /m {moveto} def /t {translate} def
/r {rotate} def /rl {roll}  def /R {repeat} def
/d {rlineto} def /rm {rmoveto} def /gr {grestore} def /f {eofill} def
/c {setrgbcolor} def /black {0 setgray} def /sd {setdash} def
/cl {closepath} def /sf {scalefont setfont} def /lw {setlinewidth} def
/box {m dup 0 exch d exch 0 d 0 exch neg d cl} def
/NC{systemdict begin initclip end}def/C{NC box clip newpath}def
/bl {box s} def /bf {box f} def /Y { 0 exch d} def /X { 0 d} def 
/K {{pop pop 0 moveto} exch kshow} bind def
/ita {/ang 15 def gsave [1 0 ang dup sin exch cos div 1 0 0] concat} def 
/mp {newpath /y exch def /x exch def} def
/side {[w .77 mul w .23 mul] .385 w mul sd w 0 l currentpoint t -144 r} def
/mr {mp x y w2 0 360 arc} def /m24 {mr s} def /m20 {mr f} def
/mb {mp x y w2 add m w2 neg 0 d 0 w neg d w 0 d 0 w d cl} def
/mt {mp x y w2 add m w2 neg w neg d w 0 d cl} def
/m21 {mb f} def /m25 {mb s} def /m22 {mt f} def /m26{mt s} def
/m23 {mp x y w2 sub m w2 w d w neg 0 d cl f} def
/m27 {mp x y w2 add m w3 neg w2 neg d w3 w2 neg d w3 w2 d cl s} def
/m28 {mp x w2 sub y w2 sub w3 add m w3 0 d  0 w3 neg d w3 0 d 0 w3 d w3 0 d  0 w3 d w3 neg 0 d 0 w3 d w3 neg 0 d 0 w3 neg d w3 neg 0 d cl s } def
/m29 {mp gsave x w2 sub y w2 add w3 sub m currentpoint t 4 {side} repeat cl fill gr} def
/m30 {mp gsave x w2 sub y w2 add w3 sub m currentpoint t 4 {side} repeat cl s gr} def
/m31 {mp x y w2 sub m 0 w d x w2 sub y m w 0 d x w2 sub y w2 add m w w neg d x w2 sub y w2 sub m w w d s} def
/m32 {mp x y w2 sub m w2 w d w neg 0 d cl s} def
/m33 {mp x y w2 add m w3 neg w2 neg d w3 w2 neg d w3 w2 d cl f} def
/m34 {mp x w2 sub y w2 sub w3 add m w3 0 d  0 w3 neg d w3 0 d 0 w3 d w3 0 d  0 w3 d w3 neg 0 d 0 w3 d w3 neg 0 d 0 w3 neg d w3 neg 0 d cl f } def
/m2 {mp x y w2 sub m 0 w d x w2 sub y m w 0 d s} def
/m5 {mp x w2 sub y w2 sub m w w d x w2 sub y w2 add m w w neg d s} def
/reEncode {exch findfont dup length dict begin {1 index /FID eq  {pop pop} {def} ifelse } forall /Encoding exch def currentdict end dup /FontName get exch definefont pop } def [/Times-Bold /Times-Italic /Times-BoldItalic /Helvetica /Helvetica-Oblique
 /Helvetica-Bold /Helvetica-BoldOblique /Courier /Courier-Oblique /Courier-Bold /Courier-BoldOblique /Times-Roman /AvantGarde-Book /AvantGarde-BookOblique /AvantGarde-Demi /AvantGarde-DemiOblique /Bookman-Demi /Bookman-DemiItalic /Bookman-Light
 /Bookman-LightItalic /Helvetica-Narrow /Helvetica-Narrow-Bold /Helvetica-Narrow-BoldOblique /Helvetica-Narrow-Oblique /NewCenturySchlbk-Roman /NewCenturySchlbk-Bold /NewCenturySchlbk-BoldItalic /NewCenturySchlbk-Italic /Palatino-Bold
 /Palatino-BoldItalic /Palatino-Italic /Palatino-Roman ] {ISOLatin1Encoding reEncode } forall%%EndProlog
%%BeginSetup
%%EndSetup
newpath  gsave  .25 .25 scale  gsave  0 0 t black[  ] 0 sd 3 lw 1 1 1 c 2268 1538 0 0 bf black 1 1 1 c 1791 1215 363 246 bf black 1791 1215 363 246 bl 1 0 0 c 6 lw 1 1 1 c black 3 lw /w 31 def /w2 {w 2 div} def /w3 {w 3 div} def 417 1367 m20 6 lw 3
 lw 452 1296 m20 6 lw 3 lw 488 1237 m20 6 lw 3 lw 524 1188 m20 6 lw 3 lw 560 1147 m20 6 lw 3 lw 596 1110 m20 6 lw 3 lw 632 1076 m20 6 lw 3 lw 667 1047 m20 6 lw 3 lw 703 1019 m20 6 lw 3 lw 739 995 m20 6 lw 3 lw 775 968 m20 6 lw 3 lw 811 950 m20 6 lw 3
 lw 847 929 m20 6 lw 3 lw 882 902 m20 6 lw 3 lw 918 889 m20 6 lw 3 lw 954 869 m20 6 lw 3 lw 990 850 m20 6 lw 3 lw 1026 827 m20 6 lw 3 lw 1062 816 m20 6 lw 3 lw 1097 799 m20 6 lw 3 lw 1133 781 m20 6 lw 1 0 0 c 1169 764 m 1 Y s 3 lw black 1169 778 m20
 6 lw 1 0 0 c 1205 718 m 6 Y s 1205 750 m 4 Y s 3 lw black 1205 737 m20 6 lw 3 lw 1241 728 m20 6 lw 3 lw 1276 720 m20 6 lw 3 lw 1312 704 m20 6 lw 3 lw 1348 689 m20 6 lw 3 lw 1384 672 m20 6 lw 3 lw 1420 662 m20 6 lw 3 lw 1456 648 m20 6 lw 3 lw 1491
 626 m20 6 lw 3 lw 1527 618 m20 6 lw 3 lw 1563 601 m20 6 lw 3 lw 1599 592 m20 6 lw 3 lw 1635 576 m20 6 lw 3 lw 1671 564 m20 6 lw 3 lw 1706 549 m20 6 lw 3 lw 1742 540 m20 6 lw 3 lw 1778 518 m20 6 lw 3 lw 1814 512 m20 6 lw 3 lw 1850 494 m20 6 lw 3 lw
 1886 482 m20 6 lw 3 lw 1921 472 m20 6 lw 3 lw 1957 447 m20 6 lw 3 lw 1993 450 m20 6 lw 3 lw 2029 432 m20 6 lw 1 0 0 c 2065 418 m 6 Y s 2065 450 m 4 Y s 3 lw black 2065 437 m20 6 lw 1 0 0 c 2101 347 m 15 Y s 2101 388 m 10 Y s 3 lw black 2101 375 m20
 6 lw 3 lw 2136 405 m20 6 lw 1 0 0 c 1 1 1 c black 1 0 0 c 363 246 m 36 X 1121 Y 35 X -71 Y 36 X -59 Y 36 X -49 Y 36 X -41 Y 36 X -37 Y 36 X -34 Y 35 X -29 Y 36 X -28 Y 36 X -24 Y 36 X -27 Y 36 X -18 Y 36 X -21 Y 35 X -27 Y 36 X -13 Y 36 X -20 Y 36 X
 -19 Y 36 X -23 Y 36 X -11 Y 35 X -17 Y 36 X -18 Y 36 X -3 Y 36 X -41 Y 36 X -9 Y 36 X -8 Y 35 X -16 Y 36 X -15 Y 36 X -17 Y 36 X -10 Y 36 X -14 Y 36 X -22 Y 35 X -8 Y 36 X -17 Y 36 X -9 Y 36 X -16 Y 36 X -12 Y 36 X -15 Y 35 X -9 Y 36 X -22 Y 36 X -6
 Y 36 X -18 Y 36 X -12 Y 36 X -10 Y 35 X -25 Y 36 X 3 Y 36 X -18 Y 36 X 5 Y 36 X -62 Y 36 X 30 Y 35 X s black 3 lw 363 246 m 1791 X s
 gsave  2268 1538 0 0 C 1955.06 98.25 t 0 r /Helvetica findfont 71.6807 sf 0 0 m ( [GeV]) show NC gr 
 gsave  2268 1538 0 0 C 1925.75 59.1875 t 0 r /Helvetica findfont 48.8732 sf 0 0 m (T) show NC gr 
 gsave  2268 1538 0 0 C 1684.62 98.25 t 0 r /Helvetica findfont 71.6807 sf 0 0 m (Higgs p) show NC gr  363 283 m -37 Y s 399 264 m -18 Y s 434 264 m -18 Y s 470 264 m -18 Y s 506 264 m -18 Y s 542 283 m -37 Y s 578 264 m -18 Y s 614 264 m -18 Y s 649
 264 m -18 Y s 685 264 m -18 Y s 721 283 m -37 Y s 757 264 m -18 Y s 793 264 m -18 Y s 829 264 m -18 Y s 864 264 m -18 Y s 900 283 m -37 Y s 936 264 m -18 Y s 972 264 m -18 Y s 1008 264 m -18 Y s 1044 264 m -18 Y s 1079 283 m -37 Y s 1115 264 m -18 Y
 s 1151 264 m -18 Y s 1187 264 m -18 Y s 1223 264 m -18 Y s 1259 283 m -37 Y s 1294 264 m -18 Y s 1330 264 m -18 Y s 1366 264 m -18 Y s 1402 264 m -18 Y s 1438 283 m -37 Y s 1474 264 m -18 Y s 1509 264 m -18 Y s 1545 264 m -18 Y s 1581 264 m -18 Y s
 1617 283 m -37 Y s 1653 264 m -18 Y s 1689 264 m -18 Y s 1724 264 m -18 Y s 1760 264 m -18 Y s 1796 283 m -37 Y s 1832 264 m -18 Y s 1868 264 m -18 Y s 1904 264 m -18 Y s 1939 264 m -18 Y s 1975 283 m -37 Y s 2011 264 m -18 Y s 2047 264 m -18 Y s
 2083 264 m -18 Y s 2119 264 m -18 Y s 2154 283 m -37 Y s
 gsave  2268 1538 0 0 C 342.25 179.75 t 0 r /Helvetica findfont 71.6807 sf 0 0 m (0) show NC gr 
 gsave  2268 1538 0 0 C 501.938 179.75 t 0 r /Helvetica findfont 71.6807 sf 0 0 m (50) show NC gr 
 gsave  2268 1538 0 0 C 661.562 179.75 t 0 r /Helvetica findfont 71.6807 sf 0 0 m (100) show NC gr 
 gsave  2268 1538 0 0 C 840.75 179.75 t 0 r /Helvetica findfont 71.6807 sf 0 0 m (150) show NC gr 
 gsave  2268 1538 0 0 C 1020 179.75 t 0 r /Helvetica findfont 71.6807 sf 0 0 m (200) show NC gr 
 gsave  2268 1538 0 0 C 1199.19 179.75 t 0 r /Helvetica findfont 71.6807 sf 0 0 m (250) show NC gr 
 gsave  2268 1538 0 0 C 1378.38 179.75 t 0 r /Helvetica findfont 71.6807 sf 0 0 m (300) show NC gr 
 gsave  2268 1538 0 0 C 1557.56 179.75 t 0 r /Helvetica findfont 71.6807 sf 0 0 m (350) show NC gr 
 gsave  2268 1538 0 0 C 1736.81 179.75 t 0 r /Helvetica findfont 71.6807 sf 0 0 m (400) show NC gr 
 gsave  2268 1538 0 0 C 1916 179.75 t 0 r /Helvetica findfont 71.6807 sf 0 0 m (450) show NC gr 
 gsave  2268 1538 0 0 C 2095.19 179.75 t 0 r /Helvetica findfont 71.6807 sf 0 0 m (500) show NC gr  363 1461 m 1791 X s 363 1425 m 36 Y s 399 1443 m 18 Y s 434 1443 m 18 Y s 470 1443 m 18 Y s 506 1443 m 18 Y s 542 1425 m 36 Y s 578 1443 m 18 Y s 614
 1443 m 18 Y s 649 1443 m 18 Y s 685 1443 m 18 Y s 721 1425 m 36 Y s 757 1443 m 18 Y s 793 1443 m 18 Y s 829 1443 m 18 Y s 864 1443 m 18 Y s 900 1425 m 36 Y s 936 1443 m 18 Y s 972 1443 m 18 Y s 1008 1443 m 18 Y s 1044 1443 m 18 Y s 1079 1425 m 36 Y
 s 1115 1443 m 18 Y s 1151 1443 m 18 Y s 1187 1443 m 18 Y s 1223 1443 m 18 Y s 1259 1425 m 36 Y s 1294 1443 m 18 Y s 1330 1443 m 18 Y s 1366 1443 m 18 Y s 1402 1443 m 18 Y s 1438 1425 m 36 Y s 1474 1443 m 18 Y s 1509 1443 m 18 Y s 1545 1443 m 18 Y s
 1581 1443 m 18 Y s 1617 1425 m 36 Y s 1653 1443 m 18 Y s 1689 1443 m 18 Y s 1724 1443 m 18 Y s 1760 1443 m 18 Y s 1796 1425 m 36 Y s 1832 1443 m 18 Y s 1868 1443 m 18 Y s 1904 1443 m 18 Y s 1939 1443 m 18 Y s 1975 1425 m 36 Y s 2011 1443 m 18 Y s
 2047 1443 m 18 Y s 2083 1443 m 18 Y s 2119 1443 m 18 Y s 2154 1425 m 36 Y s 363 246 m 1215 Y s
 gsave  2268 1538 0 0 C 172.875 756.438 t 90 r /Helvetica findfont 71.6807 sf 0 0 m (arbitrary normalization) show NC gr  390 309 m -27 X s 390 368 m -27 X s 390 410 m -27 X s 390 443 m -27 X s 390 470 m -27 X s 390 492 m -27 X s 390 512 m -27 X s
 390 529 m -27 X s 417 544 m -54 X s
 gsave  2268 1538 0 0 C 300 547.875 t 0 r /Helvetica findfont 48.8732 sf 0 0 m (\2553) show NC gr 
 gsave  2268 1538 0 0 C 221.75 515.312 t 0 r /Helvetica findfont 71.6807 sf 0 0 m (10) show NC gr  390 645 m -27 X s 390 705 m -27 X s 390 747 m -27 X s 390 779 m -27 X s 390 806 m -27 X s 390 828 m -27 X s 390 848 m -27 X s 390 865 m -27 X s 417 880
 m -54 X s
 gsave  2268 1538 0 0 C 300 880.25 t 0 r /Helvetica findfont 48.8732 sf 0 0 m (\2552) show NC gr 
 gsave  2268 1538 0 0 C 221.75 850.938 t 0 r /Helvetica findfont 71.6807 sf 0 0 m (10) show NC gr  390 981 m -27 X s 390 1041 m -27 X s 390 1083 m -27 X s 390 1115 m -27 X s 390 1142 m -27 X s 390 1164 m -27 X s 390 1184 m -27 X s 390 1201 m -27 X s
 417 1216 m -54 X s
 gsave  2268 1538 0 0 C 306.5 1215.81 t 0 r /Helvetica findfont 48.8732 sf 0 0 m (\2551) show NC gr 
 gsave  2268 1538 0 0 C 228.312 1186.5 t 0 r /Helvetica findfont 71.6807 sf 0 0 m (10) show NC gr  390 1318 m -27 X s 390 1377 m -27 X s 390 1419 m -27 X s 390 1451 m -27 X s 2154 246 m 1215 Y s 2127 309 m 27 X s 2127 368 m 27 X s 2127 410 m 27 X s
 2127 443 m 27 X s 2127 470 m 27 X s 2127 492 m 27 X s 2127 512 m 27 X s 2127 529 m 27 X s 2101 544 m 53 X s 2127 645 m 27 X s 2127 705 m 27 X s 2127 747 m 27 X s 2127 779 m 27 X s 2127 806 m 27 X s 2127 828 m 27 X s 2127 848 m 27 X s 2127 865 m 27 X
 s 2101 880 m 53 X s 2127 981 m 27 X s 2127 1041 m 27 X s 2127 1083 m 27 X s 2127 1115 m 27 X s 2127 1142 m 27 X s 2127 1164 m 27 X s 2127 1184 m 27 X s 2127 1201 m 27 X s 2101 1216 m 53 X s 2127 1318 m 27 X s 2127 1377 m 27 X s 2127 1419 m 27 X s
 2127 1451 m 27 X s 6 lw 1 1 1 c black 363 1156 m 36 X 92 Y 35 X -8 Y 36 X -25 Y 36 X -27 Y 36 X -27 Y 36 X -28 Y 36 X -25 Y 35 X -24 Y 36 X -22 Y 36 X -22 Y 36 X -19 Y 36 X -22 Y 36 X -19 Y 35 X -20 Y 36 X -21 Y 36 X -19 Y 36 X -14 Y 36 X -19 Y 36 X
 -13 Y 35 X -17 Y 36 X -15 Y 36 X -9 Y 36 X -22 Y 36 X -8 Y 36 X -20 Y 35 X -22 Y 36 X -5 Y 36 X -14 Y 36 X -23 Y 36 X -7 Y 36 X -20 Y 35 X 3 Y 36 X -14 Y 36 X -28 Y 36 X -9 Y 36 X -17 Y 36 X -25 Y 35 X -2 Y 36 X -11 Y 36 X -4 Y 36 X -10 Y 36 X -23 Y
 36 X -3 Y 35 X -15 Y 36 X -8 Y 36 X -20 Y 36 X -14 Y 36 X -12 Y 36 X 6 Y 35 X s 0 0 1 c[  12 12 ] 0 sd 1 1 1 c black 0 0 1 c 363 1155 m 36 X 100 Y 35 X -7 Y 36 X -26 Y 36 X -26 Y 36 X -27 Y 36 X -28 Y 36 X -27 Y 35 X -25 Y 36 X -23 Y 36 X -23 Y 36 X
 -21 Y 36 X -25 Y 36 X -21 Y 35 X -22 Y 36 X -24 Y 36 X -23 Y 36 X -18 Y 36 X -23 Y 36 X -19 Y 35 X -24 Y 36 X -18 Y 36 X -11 Y 36 X -25 Y 36 X -10 Y 36 X -22 Y 35 X -25 Y 36 X -7 Y 36 X -16 Y 36 X -24 Y 36 X -10 Y 36 X -21 Y 35 X 1 Y 36 X -15 Y 36 X
 -30 Y 36 X -10 Y 36 X -18 Y 36 X -27 Y 35 X -2 Y 36 X -12 Y 36 X -5 Y 36 X -10 Y 36 X -23 Y 36 X -4 Y 35 X -16 Y 36 X -8 Y 36 X -20 Y 36 X -14 Y 36 X -13 Y 36 X 5 Y 35 X s black
 gsave  2268 1538 0 0 C 2199.44 1124.62 t 90 r /Helvetica-BoldOblique findfont 29.3239 sf 0 0 m 
 317 303 287 271 263 240 213 205 186 167 159 140 118 95 87 67 59 38 17
(LHC HIGGS XS WG 2011) K NC gr 
 gr  gr showpage
end
%%EOF
