%!PS-Adobe-2.0 EPSF-2.0
%%BoundingBox:  0 0 567 384
%%Title: pto1.eps: pto1
%%Creator: ROOT Version 5.27/06b
%%CreationDate: Fri Dec  9 12:45:17 2011
%%EndComments
%%BeginProlog
80 dict begin
/s {stroke} def /l {lineto} def /m {moveto} def /t {translate} def
/r {rotate} def /rl {roll}  def /R {repeat} def
/d {rlineto} def /rm {rmoveto} def /gr {grestore} def /f {eofill} def
/c {setrgbcolor} def /black {0 setgray} def /sd {setdash} def
/cl {closepath} def /sf {scalefont setfont} def /lw {setlinewidth} def
/box {m dup 0 exch d exch 0 d 0 exch neg d cl} def
/NC{systemdict begin initclip end}def/C{NC box clip newpath}def
/bl {box s} def /bf {box f} def /Y { 0 exch d} def /X { 0 d} def 
/K {{pop pop 0 moveto} exch kshow} bind def
/ita {/ang 15 def gsave [1 0 ang dup sin exch cos div 1 0 0] concat} def 
/mp {newpath /y exch def /x exch def} def
/side {[w .77 mul w .23 mul] .385 w mul sd w 0 l currentpoint t -144 r} def
/mr {mp x y w2 0 360 arc} def /m24 {mr s} def /m20 {mr f} def
/mb {mp x y w2 add m w2 neg 0 d 0 w neg d w 0 d 0 w d cl} def
/mt {mp x y w2 add m w2 neg w neg d w 0 d cl} def
/m21 {mb f} def /m25 {mb s} def /m22 {mt f} def /m26{mt s} def
/m23 {mp x y w2 sub m w2 w d w neg 0 d cl f} def
/m27 {mp x y w2 add m w3 neg w2 neg d w3 w2 neg d w3 w2 d cl s} def
/m28 {mp x w2 sub y w2 sub w3 add m w3 0 d  0 w3 neg d w3 0 d 0 w3 d w3 0 d  0 w3 d w3 neg 0 d 0 w3 d w3 neg 0 d 0 w3 neg d w3 neg 0 d cl s } def
/m29 {mp gsave x w2 sub y w2 add w3 sub m currentpoint t 4 {side} repeat cl fill gr} def
/m30 {mp gsave x w2 sub y w2 add w3 sub m currentpoint t 4 {side} repeat cl s gr} def
/m31 {mp x y w2 sub m 0 w d x w2 sub y m w 0 d x w2 sub y w2 add m w w neg d x w2 sub y w2 sub m w w d s} def
/m32 {mp x y w2 sub m w2 w d w neg 0 d cl s} def
/m33 {mp x y w2 add m w3 neg w2 neg d w3 w2 neg d w3 w2 d cl f} def
/m34 {mp x w2 sub y w2 sub w3 add m w3 0 d  0 w3 neg d w3 0 d 0 w3 d w3 0 d  0 w3 d w3 neg 0 d 0 w3 d w3 neg 0 d 0 w3 neg d w3 neg 0 d cl f } def
/m2 {mp x y w2 sub m 0 w d x w2 sub y m w 0 d s} def
/m5 {mp x w2 sub y w2 sub m w w d x w2 sub y w2 add m w w neg d s} def
/reEncode {exch findfont dup length dict begin {1 index /FID eq  {pop pop} {def} ifelse } forall /Encoding exch def currentdict end dup /FontName get exch definefont pop } def [/Times-Bold /Times-Italic /Times-BoldItalic /Helvetica /Helvetica-Oblique
 /Helvetica-Bold /Helvetica-BoldOblique /Courier /Courier-Oblique /Courier-Bold /Courier-BoldOblique /Times-Roman /AvantGarde-Book /AvantGarde-BookOblique /AvantGarde-Demi /AvantGarde-DemiOblique /Bookman-Demi /Bookman-DemiItalic /Bookman-Light
 /Bookman-LightItalic /Helvetica-Narrow /Helvetica-Narrow-Bold /Helvetica-Narrow-BoldOblique /Helvetica-Narrow-Oblique /NewCenturySchlbk-Roman /NewCenturySchlbk-Bold /NewCenturySchlbk-BoldItalic /NewCenturySchlbk-Italic /Palatino-Bold
 /Palatino-BoldItalic /Palatino-Italic /Palatino-Roman ] {ISOLatin1Encoding reEncode } forall%%EndProlog
%%BeginSetup
%%EndSetup
newpath  gsave  .25 .25 scale  gsave  0 0 t black[  ] 0 sd 3 lw 1 1 1 c 2268 1538 0 0 bf black 1 1 1 c 1791 1215 363 246 bf black 1791 1215 363 246 bl 1 0 0 c 6 lw 1 1 1 c black 1 0 0 c 430 246 m 248 Y s 430 520 m 238 Y s 3 lw black /w 31 def /w2 {w
 2 div} def /w3 {w 3 div} def 430 507 m20 6 lw 1 0 0 c 475 546 m 255 Y s 475 828 m 75 Y s 3 lw black 475 814 m20 6 lw 1 0 0 c 520 1001 m 27 Y s 520 1054 m 18 Y s 3 lw black 520 1041 m20 6 lw 1 0 0 c 564 1100 m 13 Y s 564 1139 m 9 Y s 3 lw black 564
 1126 m20 6 lw 1 0 0 c 609 1198 m 5 Y s 609 1229 m 3 Y s 3 lw black 609 1216 m20 6 lw 3 lw 654 1285 m20 6 lw 3 lw 699 1323 m20 6 lw 3 lw 744 1347 m20 6 lw 3 lw 788 1363 m20 6 lw 3 lw 833 1299 m20 6 lw 3 lw 878 1212 m20 6 lw 3 lw 923 1121 m20 6 lw 3
 lw 967 1055 m20 6 lw 3 lw 1012 1001 m20 6 lw 3 lw 1057 950 m20 6 lw 3 lw 1102 913 m20 6 lw 3 lw 1147 875 m20 6 lw 3 lw 1191 839 m20 6 lw 3 lw 1236 805 m20 6 lw 3 lw 1281 773 m20 6 lw 3 lw 1326 755 m20 6 lw 1 0 0 c 1371 696 m 6 Y s 1371 728 m 3 Y s 3
 lw black 1371 715 m20 6 lw 1 0 0 c 1415 652 m 2 Y s 1415 680 m 1 Y s 3 lw black 1415 667 m20 6 lw 3 lw 1460 670 m20 6 lw 3 lw 1505 638 m20 6 lw 3 lw 1550 615 m20 6 lw 3 lw 1594 593 m20 6 lw 3 lw 1639 571 m20 6 lw 3 lw 1684 546 m20 6 lw 3 lw 1729 528
 m20 6 lw 3 lw 1774 507 m20 6 lw 3 lw 1818 493 m20 6 lw 3 lw 1863 455 m20 6 lw 3 lw 1908 458 m20 6 lw 3 lw 1953 427 m20 6 lw 3 lw 1998 407 m20 6 lw 3 lw 2042 396 m20 6 lw 3 lw 2087 380 m20 6 lw 3 lw 2132 353 m20 6 lw 1 0 0 c 1 1 1 c black 1 0 0 c 363
 246 m 45 X 261 Y 44 X 307 Y 45 X 227 Y 45 X 85 Y 45 X 90 Y 45 X 69 Y 44 X 38 Y 45 X 24 Y 45 X 16 Y 45 X -64 Y 44 X -87 Y 45 X -91 Y 45 X -66 Y 45 X -54 Y 45 X -51 Y 44 X -37 Y 45 X -38 Y 45 X -36 Y 45 X -34 Y 45 X -32 Y 44 X -18 Y 45 X -40 Y 45 X
 -48 Y 45 X 3 Y 45 X -32 Y 44 X -23 Y 45 X -22 Y 45 X -22 Y 45 X -25 Y 44 X -18 Y 45 X -21 Y 45 X -14 Y 45 X -38 Y 45 X 3 Y 44 X -31 Y 45 X -20 Y 45 X -11 Y 45 X -16 Y 45 X -27 Y 44 X s black 3 lw 363 246 m 1791 X s
 gsave  2268 1538 0 0 C 1955.06 97.4375 t 0 r /Helvetica findfont 71.6807 sf 0 0 m ( [GeV]) show NC gr 
 gsave  2268 1538 0 0 C 1925.75 58.375 t 0 r /Helvetica findfont 48.8732 sf 0 0 m (T) show NC gr 
 gsave  2268 1538 0 0 C 1420.75 97.4375 t 0 r /Helvetica findfont 71.6807 sf 0 0 m (leading lepton p) show NC gr  363 283 m -37 Y s 408 264 m -18 Y s 452 264 m -18 Y s 497 264 m -18 Y s 542 283 m -37 Y s 587 264 m -18 Y s 632 264 m -18 Y s 676 264 m
 -18 Y s 721 283 m -37 Y s 766 264 m -18 Y s 811 264 m -18 Y s 855 264 m -18 Y s 900 283 m -37 Y s 945 264 m -18 Y s 990 264 m -18 Y s 1035 264 m -18 Y s 1079 283 m -37 Y s 1124 264 m -18 Y s 1169 264 m -18 Y s 1214 264 m -18 Y s 1259 283 m -37 Y s
 1303 264 m -18 Y s 1348 264 m -18 Y s 1393 264 m -18 Y s 1438 283 m -37 Y s 1483 264 m -18 Y s 1527 264 m -18 Y s 1572 264 m -18 Y s 1617 283 m -37 Y s 1662 264 m -18 Y s 1706 264 m -18 Y s 1751 264 m -18 Y s 1796 283 m -37 Y s 1841 264 m -18 Y s
 1886 264 m -18 Y s 1930 264 m -18 Y s 1975 283 m -37 Y s 2020 264 m -18 Y s 2065 264 m -18 Y s 2110 264 m -18 Y s 2154 283 m -37 Y s
 gsave  2268 1538 0 0 C 342.25 178.875 t 0 r /Helvetica findfont 71.6807 sf 0 0 m (0) show NC gr 
 gsave  2268 1538 0 0 C 501.938 178.875 t 0 r /Helvetica findfont 71.6807 sf 0 0 m (20) show NC gr 
 gsave  2268 1538 0 0 C 681.125 178.875 t 0 r /Helvetica findfont 71.6807 sf 0 0 m (40) show NC gr 
 gsave  2268 1538 0 0 C 860.312 178.875 t 0 r /Helvetica findfont 71.6807 sf 0 0 m (60) show NC gr 
 gsave  2268 1538 0 0 C 1039.5 178.875 t 0 r /Helvetica findfont 71.6807 sf 0 0 m (80) show NC gr 
 gsave  2268 1538 0 0 C 1199.19 178.875 t 0 r /Helvetica findfont 71.6807 sf 0 0 m (100) show NC gr 
 gsave  2268 1538 0 0 C 1378.38 178.875 t 0 r /Helvetica findfont 71.6807 sf 0 0 m (120) show NC gr 
 gsave  2268 1538 0 0 C 1557.56 178.875 t 0 r /Helvetica findfont 71.6807 sf 0 0 m (140) show NC gr 
 gsave  2268 1538 0 0 C 1736.81 178.875 t 0 r /Helvetica findfont 71.6807 sf 0 0 m (160) show NC gr 
 gsave  2268 1538 0 0 C 1916 178.875 t 0 r /Helvetica findfont 71.6807 sf 0 0 m (180) show NC gr 
 gsave  2268 1538 0 0 C 2095.19 178.875 t 0 r /Helvetica findfont 71.6807 sf 0 0 m (200) show NC gr  363 1461 m 1791 X s 363 1425 m 36 Y s 408 1443 m 18 Y s 452 1443 m 18 Y s 497 1443 m 18 Y s 542 1425 m 36 Y s 587 1443 m 18 Y s 632 1443 m 18 Y s 676
 1443 m 18 Y s 721 1425 m 36 Y s 766 1443 m 18 Y s 811 1443 m 18 Y s 855 1443 m 18 Y s 900 1425 m 36 Y s 945 1443 m 18 Y s 990 1443 m 18 Y s 1035 1443 m 18 Y s 1079 1425 m 36 Y s 1124 1443 m 18 Y s 1169 1443 m 18 Y s 1214 1443 m 18 Y s 1259 1425 m 36
 Y s 1303 1443 m 18 Y s 1348 1443 m 18 Y s 1393 1443 m 18 Y s 1438 1425 m 36 Y s 1483 1443 m 18 Y s 1527 1443 m 18 Y s 1572 1443 m 18 Y s 1617 1425 m 36 Y s 1662 1443 m 18 Y s 1706 1443 m 18 Y s 1751 1443 m 18 Y s 1796 1425 m 36 Y s 1841 1443 m 18 Y
 s 1886 1443 m 18 Y s 1930 1443 m 18 Y s 1975 1425 m 36 Y s 2020 1443 m 18 Y s 2065 1443 m 18 Y s 2110 1443 m 18 Y s 2154 1425 m 36 Y s 363 246 m 1215 Y s
 gsave  2268 1538 0 0 C 172.875 755.625 t 90 r /Helvetica findfont 71.6807 sf 0 0 m (arbitrary normalization) show NC gr  390 252 m -27 X s 390 269 m -27 X s 417 284 m -54 X s
 gsave  2268 1538 0 0 C 300 283.188 t 0 r /Helvetica findfont 48.8732 sf 0 0 m (\2554) show NC gr 
 gsave  2268 1538 0 0 C 221.75 253.812 t 0 r /Helvetica findfont 71.6807 sf 0 0 m (10) show NC gr  390 384 m -27 X s 390 442 m -27 X s 390 484 m -27 X s 390 516 m -27 X s 390 542 m -27 X s 390 564 m -27 X s 390 584 m -27 X s 390 601 m -27 X s 417 616
 m -54 X s
 gsave  2268 1538 0 0 C 300 618.75 t 0 r /Helvetica findfont 48.8732 sf 0 0 m (\2553) show NC gr 
 gsave  2268 1538 0 0 C 221.75 586.188 t 0 r /Helvetica findfont 71.6807 sf 0 0 m (10) show NC gr  390 716 m -27 X s 390 774 m -27 X s 390 815 m -27 X s 390 848 m -27 X s 390 874 m -27 X s 390 896 m -27 X s 390 915 m -27 X s 390 932 m -27 X s 417 947
 m -54 X s
 gsave  2268 1538 0 0 C 300 944.562 t 0 r /Helvetica findfont 48.8732 sf 0 0 m (\2552) show NC gr 
 gsave  2268 1538 0 0 C 221.75 915.25 t 0 r /Helvetica findfont 71.6807 sf 0 0 m (10) show NC gr  390 1047 m -27 X s 390 1106 m -27 X s 390 1147 m -27 X s 390 1179 m -27 X s 390 1205 m -27 X s 390 1228 m -27 X s 390 1247 m -27 X s 390 1264 m -27 X s
 417 1279 m -54 X s
 gsave  2268 1538 0 0 C 306.5 1276.94 t 0 r /Helvetica findfont 48.8732 sf 0 0 m (\2551) show NC gr 
 gsave  2268 1538 0 0 C 228.312 1247.56 t 0 r /Helvetica findfont 71.6807 sf 0 0 m (10) show NC gr  390 1379 m -27 X s 390 1437 m -27 X s 2154 246 m 1215 Y s 2127 252 m 27 X s 2127 269 m 27 X s 2101 284 m 53 X s 2127 384 m 27 X s 2127 442 m 27 X s
 2127 484 m 27 X s 2127 516 m 27 X s 2127 542 m 27 X s 2127 564 m 27 X s 2127 584 m 27 X s 2127 601 m 27 X s 2101 616 m 53 X s 2127 716 m 27 X s 2127 774 m 27 X s 2127 815 m 27 X s 2127 848 m 27 X s 2127 874 m 27 X s 2127 896 m 27 X s 2127 915 m 27 X
 s 2127 932 m 27 X s 2101 947 m 53 X s 2127 1047 m 27 X s 2127 1106 m 27 X s 2127 1147 m 27 X s 2127 1179 m 27 X s 2127 1205 m 27 X s 2127 1228 m 27 X s 2127 1247 m 27 X s 2127 1264 m 27 X s 2101 1279 m 53 X s 2127 1379 m 27 X s 2127 1437 m 27 X s 6
 lw 1 1 1 c black 363 246 m 45 X 127 Y 44 X 434 Y 45 X 205 Y 45 X 103 Y 45 X 74 Y 45 X 65 Y 44 X 43 Y 45 X 32 Y 45 X 25 Y 45 X -47 Y 44 X -69 Y 45 X -65 Y 45 X -56 Y 45 X -50 Y 45 X -41 Y 44 X -40 Y 45 X -39 Y 45 X -29 Y 45 X -35 Y 45 X -35 Y 44 X
 -26 Y 45 X -21 Y 45 X -32 Y 45 X -29 Y 45 X -20 Y 44 X -22 Y 45 X -24 Y 45 X -25 Y 45 X -22 Y 44 X -18 Y 45 X -18 Y 45 X -15 Y 45 X -11 Y 45 X -13 Y 44 X -36 Y 45 X -19 Y 45 X -48 Y 45 X 19 Y 45 X -43 Y 44 X s 0 0 1 c[  12 12 ] 0 sd 1 1 1 c black 0
 0 1 c 363 246 m 45 X 156 Y 44 X 427 Y 45 X 202 Y 45 X 100 Y 45 X 72 Y 45 X 64 Y 44 X 41 Y 45 X 32 Y 45 X 24 Y 45 X -54 Y 44 X -80 Y 45 X -79 Y 45 X -67 Y 45 X -59 Y 45 X -49 Y 44 X -46 Y 45 X -44 Y 45 X -35 Y 45 X -38 Y 45 X -38 Y 44 X -29 Y 45 X
 -22 Y 45 X -34 Y 45 X -29 Y 45 X -21 Y 44 X -22 Y 45 X -25 Y 45 X -25 Y 45 X -23 Y 44 X -17 Y 45 X -18 Y 45 X -15 Y 45 X -11 Y 45 X -13 Y 44 X -37 Y 45 X -18 Y 45 X -49 Y 45 X 16 Y 45 X -39 Y 44 X s black
 gsave  2268 1538 0 0 C 2199.44 1123.75 t 90 r /Helvetica-BoldOblique findfont 29.3239 sf 0 0 m 
 317 303 287 271 263 240 213 205 186 167 159 140 118 95 87 67 59 38 17
(LHC HIGGS XS WG 2011) K NC gr 
 gr  gr showpage
end
%%EOF
