%!PS-Adobe-2.0 EPSF-2.0
%%BoundingBox:  0 0 567 310
%%Title: /home/shiki/lhchiggsstyle-v2/CrossSection_qcd.eps: Higgs Cross Section
%%Creator: ROOT Version 5.28/00
%%CreationDate: Tue Nov 22 17:27:50 2011
%%EndComments
%%BeginProlog
80 dict begin
/s {stroke} def /l {lineto} def /m {moveto} def /t {translate} def
/r {rotate} def /rl {roll}  def /R {repeat} def
/d {rlineto} def /rm {rmoveto} def /gr {grestore} def /f {eofill} def
/c {setrgbcolor} def /black {0 setgray} def /sd {setdash} def
/cl {closepath} def /sf {scalefont setfont} def /lw {setlinewidth} def
/box {m dup 0 exch d exch 0 d 0 exch neg d cl} def
/NC{systemdict begin initclip end}def/C{NC box clip newpath}def
/bl {box s} def /bf {box f} def /Y { 0 exch d} def /X { 0 d} def 
/K {{pop pop 0 moveto} exch kshow} bind def
/ita {/ang 15 def gsave [1 0 ang dup sin exch cos div 1 0 0] concat} def 
/mp {newpath /y exch def /x exch def} def
/side {[w .77 mul w .23 mul] .385 w mul sd w 0 l currentpoint t -144 r} def
/mr {mp x y w2 0 360 arc} def /m24 {mr s} def /m20 {mr f} def
/mb {mp x y w2 add m w2 neg 0 d 0 w neg d w 0 d 0 w d cl} def
/mt {mp x y w2 add m w2 neg w neg d w 0 d cl} def
/m21 {mb f} def /m25 {mb s} def /m22 {mt f} def /m26{mt s} def
/m23 {mp x y w2 sub m w2 w d w neg 0 d cl f} def
/m27 {mp x y w2 add m w3 neg w2 neg d w3 w2 neg d w3 w2 d cl s} def
/m28 {mp x w2 sub y w2 sub w3 add m w3 0 d  0 w3 neg d w3 0 d 0 w3 d w3 0 d  0 w3 d w3 neg 0 d 0 w3 d w3 neg 0 d 0 w3 neg d w3 neg 0 d cl s } def
/m29 {mp gsave x w2 sub y w2 add w3 sub m currentpoint t 4 {side} repeat cl fill gr} def
/m30 {mp gsave x w2 sub y w2 add w3 sub m currentpoint t 4 {side} repeat cl s gr} def
/m31 {mp x y w2 sub m 0 w d x w2 sub y m w 0 d x w2 sub y w2 add m w w neg d x w2 sub y w2 sub m w w d s} def
/m32 {mp x y w2 sub m w2 w d w neg 0 d cl s} def
/m33 {mp x y w2 add m w3 neg w2 neg d w3 w2 neg d w3 w2 d cl f} def
/m34 {mp x w2 sub y w2 sub w3 add m w3 0 d  0 w3 neg d w3 0 d 0 w3 d w3 0 d  0 w3 d w3 neg 0 d 0 w3 d w3 neg 0 d 0 w3 neg d w3 neg 0 d cl f } def
/m2 {mp x y w2 sub m 0 w d x w2 sub y m w 0 d s} def
/m5 {mp x w2 sub y w2 sub m w w d x w2 sub y w2 add m w w neg d s} def
/reEncode {exch findfont dup length dict begin {1 index /FID eq  {pop pop} {def} ifelse } forall /Encoding exch def currentdict end dup /FontName get exch definefont pop } def [/Times-Bold /Times-Italic /Times-BoldItalic /Helvetica /Helvetica-Oblique
 /Helvetica-Bold /Helvetica-BoldOblique /Courier /Courier-Oblique /Courier-Bold /Courier-BoldOblique /Times-Roman /AvantGarde-Book /AvantGarde-BookOblique /AvantGarde-Demi /AvantGarde-DemiOblique /Bookman-Demi /Bookman-DemiItalic /Bookman-Light
 /Bookman-LightItalic /Helvetica-Narrow /Helvetica-Narrow-Bold /Helvetica-Narrow-BoldOblique /Helvetica-Narrow-Oblique /NewCenturySchlbk-Roman /NewCenturySchlbk-Bold /NewCenturySchlbk-BoldItalic /NewCenturySchlbk-Italic /Palatino-Bold
 /Palatino-BoldItalic /Palatino-Italic /Palatino-Roman ] {ISOLatin1Encoding reEncode } forall%%EndProlog
%%BeginSetup
%%EndSetup
newpath  gsave  .25 .25 scale  gsave  0 0 t black[  ] 0 sd 3 lw 1 1 1 c 2268 1239 0 0 bf black 1 1 1 c 1088 1214 23 12 bf black 1 1 1 c 861 958 195 208 bf black 861 958 195 208 bl 1 1 1 c 861 958 195 208 bf black 861 958 195 208 bl 6 lw 1 1 1 c black
 195 208 m 861 X s 3 lw 195 208 m 861 X s
 gsave  1088 1214 23 12 C 941.625 105.812 t 0 r /Helvetica findfont 40.9078 sf 0 0 m ( [GeV]) show NC gr 
 gsave  1088 1214 23 12 C 922.062 95.125 t 0 r /Helvetica findfont 26.679 sf 0 0 m (4l) show NC gr 
 gsave  1088 1214 23 12 C 890.125 105.812 t 0 r /Helvetica findfont 40.9078 sf 0 0 m (M) show NC gr  274 237 m -29 Y s 305 222 m -14 Y s 336 222 m -14 Y s 368 222 m -14 Y s 399 222 m -14 Y s 430 237 m -29 Y s 461 222 m -14 Y s 493 222 m -14 Y s 524
 222 m -14 Y s 555 222 m -14 Y s 586 237 m -29 Y s 618 222 m -14 Y s 649 222 m -14 Y s 680 222 m -14 Y s 712 222 m -14 Y s 743 237 m -29 Y s 774 222 m -14 Y s 805 222 m -14 Y s 837 222 m -14 Y s 868 222 m -14 Y s 899 237 m -29 Y s 931 222 m -14 Y s
 962 222 m -14 Y s 993 222 m -14 Y s 1024 222 m -14 Y s 1056 237 m -29 Y s 274 237 m -29 Y s 242 222 m -14 Y s 211 222 m -14 Y s
 gsave  1088 1214 23 12 C 239.625 164.438 t 0 r /Helvetica findfont 40.9078 sf 0 0 m (100) show NC gr 
 gsave  1088 1214 23 12 C 396.062 164.438 t 0 r /Helvetica findfont 40.9078 sf 0 0 m (200) show NC gr 
 gsave  1088 1214 23 12 C 552.438 164.438 t 0 r /Helvetica findfont 40.9078 sf 0 0 m (300) show NC gr 
 gsave  1088 1214 23 12 C 708.812 164.438 t 0 r /Helvetica findfont 40.9078 sf 0 0 m (400) show NC gr 
 gsave  1088 1214 23 12 C 865.25 164.438 t 0 r /Helvetica findfont 40.9078 sf 0 0 m (500) show NC gr 
 gsave  1088 1214 23 12 C 1021.62 164.438 t 0 r /Helvetica findfont 40.9078 sf 0 0 m (600) show NC gr  195 1166 m 861 X s 274 1137 m 29 Y s 305 1151 m 15 Y s 336 1151 m 15 Y s 368 1151 m 15 Y s 399 1151 m 15 Y s 430 1137 m 29 Y s 461 1151 m 15 Y s
 493 1151 m 15 Y s 524 1151 m 15 Y s 555 1151 m 15 Y s 586 1137 m 29 Y s 618 1151 m 15 Y s 649 1151 m 15 Y s 680 1151 m 15 Y s 712 1151 m 15 Y s 743 1137 m 29 Y s 774 1151 m 15 Y s 805 1151 m 15 Y s 837 1151 m 15 Y s 868 1151 m 15 Y s 899 1137 m 29 Y
 s 931 1151 m 15 Y s 962 1151 m 15 Y s 993 1151 m 15 Y s 1024 1151 m 15 Y s 1056 1137 m 29 Y s 274 1137 m 29 Y s 242 1151 m 15 Y s 211 1151 m 15 Y s 195 208 m 958 Y s
 gsave  1088 1214 23 12 C 94 1081.5 t 90 r /Helvetica findfont 40.9078 sf 0 0 m (\(mZ\)) show NC gr 
 gsave  1088 1214 23 12 C 94 1056.62 t 90 r /Symbol findfont 40.9078 sf 0 0 m (s) show NC gr 
 gsave  1088 1214 23 12 C 94 964.188 t 90 r /Helvetica findfont 40.9078 sf 0 0 m (\(Q\) / ) show NC gr 
 gsave  1088 1214 23 12 C 94 939.312 t 90 r /Symbol findfont 40.9078 sf 0 0 m (s) show NC gr 
 gsave  1088 1214 23 12 C 94 738.5 t 90 r /Helvetica findfont 40.9078 sf 0 0 m (NLO Ratio ) show NC gr  221 208 m -26 X s 208 227 m -13 X s 208 246 m -13 X s 208 265 m -13 X s 208 285 m -13 X s 221 304 m -26 X s 208 323 m -13 X s 208 342 m -13 X s
 208 361 m -13 X s 208 380 m -13 X s 221 400 m -26 X s 208 419 m -13 X s 208 438 m -13 X s 208 457 m -13 X s 208 476 m -13 X s 221 495 m -26 X s 208 514 m -13 X s 208 534 m -13 X s 208 553 m -13 X s 208 572 m -13 X s 221 591 m -26 X s 208 610 m -13 X
 s 208 629 m -13 X s 208 649 m -13 X s 208 668 m -13 X s 221 687 m -26 X s 208 706 m -13 X s 208 725 m -13 X s 208 744 m -13 X s 208 764 m -13 X s 221 783 m -26 X s 208 802 m -13 X s 208 821 m -13 X s 208 840 m -13 X s 208 859 m -13 X s 221 878 m -26
 X s 208 898 m -13 X s 208 917 m -13 X s 208 936 m -13 X s 208 955 m -13 X s 221 974 m -26 X s 208 993 m -13 X s 208 1013 m -13 X s 208 1032 m -13 X s 208 1051 m -13 X s 221 1070 m -26 X s 208 1089 m -13 X s 208 1108 m -13 X s 208 1128 m -13 X s 208
 1147 m -13 X s 221 1166 m -26 X s
 gsave  1088 1214 23 12 C 131.25 192.875 t 0 r /Helvetica findfont 40.9078 sf 0 0 m (0.5) show NC gr 
 gsave  1088 1214 23 12 C 133 288.875 t 0 r /Helvetica findfont 40.9078 sf 0 0 m (0.6) show NC gr 
 gsave  1088 1214 23 12 C 133 384.812 t 0 r /Helvetica findfont 40.9078 sf 0 0 m (0.7) show NC gr 
 gsave  1088 1214 23 12 C 133 480.812 t 0 r /Helvetica findfont 40.9078 sf 0 0 m (0.8) show NC gr 
 gsave  1088 1214 23 12 C 133 576.75 t 0 r /Helvetica findfont 40.9078 sf 0 0 m (0.9) show NC gr 
 gsave  1088 1214 23 12 C 172.125 672.75 t 0 r /Helvetica findfont 40.9078 sf 0 0 m (1) show NC gr 
 gsave  1088 1214 23 12 C 138.375 768.688 t 0 r /Helvetica findfont 40.9078 sf 0 0 m (1.1) show NC gr 
 gsave  1088 1214 23 12 C 133 864.688 t 0 r /Helvetica findfont 40.9078 sf 0 0 m (1.2) show NC gr 
 gsave  1088 1214 23 12 C 133 960.625 t 0 r /Helvetica findfont 40.9078 sf 0 0 m (1.3) show NC gr 
 gsave  1088 1214 23 12 C 133 1056.62 t 0 r /Helvetica findfont 40.9078 sf 0 0 m (1.4) show NC gr 
 gsave  1088 1214 23 12 C 131.25 1150.81 t 0 r /Helvetica findfont 40.9078 sf 0 0 m (1.5) show NC gr  1056 208 m 958 Y s 1030 208 m 26 X s 1043 227 m 13 X s 1043 246 m 13 X s 1043 265 m 13 X s 1043 285 m 13 X s 1030 304 m 26 X s 1043 323 m 13 X s
 1043 342 m 13 X s 1043 361 m 13 X s 1043 380 m 13 X s 1030 400 m 26 X s 1043 419 m 13 X s 1043 438 m 13 X s 1043 457 m 13 X s 1043 476 m 13 X s 1030 495 m 26 X s 1043 514 m 13 X s 1043 534 m 13 X s 1043 553 m 13 X s 1043 572 m 13 X s 1030 591 m 26 X
 s 1043 610 m 13 X s 1043 629 m 13 X s 1043 649 m 13 X s 1043 668 m 13 X s 1030 687 m 26 X s 1043 706 m 13 X s 1043 725 m 13 X s 1043 744 m 13 X s 1043 764 m 13 X s 1030 783 m 26 X s 1043 802 m 13 X s 1043 821 m 13 X s 1043 840 m 13 X s 1043 859 m 13
 X s 1030 878 m 26 X s 1043 898 m 13 X s 1043 917 m 13 X s 1043 936 m 13 X s 1043 955 m 13 X s 1030 974 m 26 X s 1043 993 m 13 X s 1043 1013 m 13 X s 1043 1032 m 13 X s 1043 1051 m 13 X s 1030 1070 m 26 X s 1043 1089 m 13 X s 1043 1108 m 13 X s 1043
 1128 m 13 X s 1043 1147 m 13 X s 1030 1166 m 26 X s 6 lw 1 1 1 c 0 0 1 c 3 lw /w 14 def /w2 {w 2 div} def /w3 {w 3 div} def 235 677 313 693 391 708 469 708 547 715 626 727 704 733 782 739 860 741 938 747 1017 748 11 { m22} R 6 lw black 1 1 1 c 1 0 1
 c 3 lw 235 703 313 697 391 683 469 674 547 659 626 658 704 660 782 642 860 635 938 655 1017 640 11 { m24} R 6 lw 1 0 0 c 0.95 0.95 0.95 c black 1 0 0 c 200 702 m 8 1 d 9 1 d 9 2 d 8 1 d 9 1 d 8 X 9 1 d 9 1 d 8 1 d 9 1 d 8 1 d 9 X 9 1 d 8 1 d 9 X 8 1
 d 9 1 d 9 X 8 1 d 9 1 d 8 X 9 1 d 9 X 8 1 d 9 1 d 8 X 9 1 d 9 X 8 1 d 9 X 8 1 d 9 X 9 1 d 8 X 9 1 d 8 X 9 1 d 9 X 8 1 d 9 X 8 1 d 18 X 8 1 d 9 X 8 1 d 9 X 9 1 d 8 X s 621 733 m 9 X 8 1 d 9 X 9 1 d 8 X 9 1 d 17 X 9 1 d 17 X 8 1 d 9 X 9 1 d 17 X 9 1 d
 17 X 8 1 d 9 X 9 1 d 17 X 8 1 d 18 X 8 1 d 17 X 9 1 d 17 X 9 1 d 17 X 9 1 d 17 X 8 1 d 18 X 8 1 d 26 X 9 1 d 17 X s 1043 750 m 8 1 d s 0.95 0.95 0.95 c black 1 0 0 c 200 672 m 8 -1 d 9 -1 d 9 -1 d 8 -1 d 9 -1 d 8 -1 d 9 -1 d 9 -1 d 8 -1 d 9 X 8 -1 d
 9 -1 d 9 X 8 -1 d 9 -1 d 8 X 9 -1 d 9 -1 d 8 X 9 -1 d 8 X 9 -1 d 9 -1 d 8 X 9 -1 d 8 X 9 -1 d 9 X 8 -1 d 9 X 8 -1 d 18 X 8 -1 d 9 X 8 -1 d 9 X 9 -1 d 8 X 9 -1 d 17 X 9 -1 d 8 X 9 -1 d 17 X 9 -1 d 8 X s 621 643 m 9 -1 d 17 X 9 -1 d 17 X 8 -1 d 18 X 8
 -1 d 9 X 8 -1 d 18 X 8 -1 d 18 X 8 -1 d 26 X 9 -1 d 17 X 8 -1 d 18 X 8 -1 d 17 X 9 -1 d 26 X 8 -1 d 18 X 8 -1 d 26 X 9 -1 d 17 X 8 -1 d 26 X 9 -1 d s 1043 627 m 8 X s black
 gsave  1088 1214 23 12 C 291.188 1083.25 t 0 r /Helvetica findfont 51.5794 sf 0 0 m 
 139 110 85 72 44 29
(= 7 TeV) K NC gr 
 gsave  1088 1214 23 12 C 266.312 1083.25 t 0 r /Helvetica findfont 51.5794 sf 0 0 m (s) show NC gr  233 1111 m 23 -30 d s 0 lw 256 1081 m 5 44 d s 261 1125 m 30 X s
 gsave  1088 1214 23 12 C 1099.81 814.938 t 90 r /Helvetica-BoldOblique findfont 30.2362 sf 0 0 m 
 336 321 304 287 279 255 226 218 198 177 169 148 125 101 93 71 62 40 18
(LHC HIGGS XS WG 2011) K NC gr 
 gsave  1088 1214 23 12 C 239.625 256.875 t 0 r /Helvetica findfont 51.5794 sf 0 0 m (QCD Scale Uncertainty) show NC gr  3 lw 1 1 1 c 524 181 437 828 bf black 448 828 m -7 Y 521 X 178 Y -8 X -171 Y f 437 828 m 181 Y 524 X -181 Y -524 X cl s
 gsave  1088 1214 23 12 C 566.625 957.125 t 0 r /Helvetica findfont 24.9004 sf 0 0 m (QCD Scale Q = mZ/2 \(NLO CT10\)) show NC gr  0 0 1 c 503 964 m22 black
 gsave  1088 1214 23 12 C 566.625 866.438 t 0 r /Helvetica findfont 24.9004 sf 0 0 m (QCD Scale Q = 2mZ \(NLO CT10\)) show NC gr  1 0 1 c 503 873 m24 black 1 1 1 c 1088 1214 1157 12 bf black 1 1 1 c 860 959 1331 207 bf black 860 959 1331 207 bl 1 1 1
 c 860 959 1331 207 bf black 860 959 1331 207 bl 6 lw 1 1 1 c black 1331 207 m 860 X s 3 lw 1331 207 m 860 X s
 gsave  1088 1214 1157 12 C 2076.25 103.938 t 0 r /Helvetica findfont 40.9078 sf 0 0 m ( [GeV]) show NC gr 
 gsave  1088 1214 1157 12 C 2056.69 93.25 t 0 r /Helvetica findfont 26.679 sf 0 0 m (4l) show NC gr 
 gsave  1088 1214 1157 12 C 2024.69 103.938 t 0 r /Helvetica findfont 40.9078 sf 0 0 m (M) show NC gr  1409 235 m -28 Y s 1440 221 m -14 Y s 1471 221 m -14 Y s 1503 221 m -14 Y s 1534 221 m -14 Y s 1565 235 m -28 Y s 1596 221 m -14 Y s 1628 221 m -14
 Y s 1659 221 m -14 Y s 1690 221 m -14 Y s 1722 235 m -28 Y s 1753 221 m -14 Y s 1784 221 m -14 Y s 1815 221 m -14 Y s 1847 221 m -14 Y s 1878 235 m -28 Y s 1909 221 m -14 Y s 1940 221 m -14 Y s 1972 221 m -14 Y s 2003 221 m -14 Y s 2034 235 m -28 Y
 s 2066 221 m -14 Y s 2097 221 m -14 Y s 2128 221 m -14 Y s 2159 221 m -14 Y s 2191 235 m -28 Y s 1409 235 m -28 Y s 1378 221 m -14 Y s 1346 221 m -14 Y s
 gsave  1088 1214 1157 12 C 1374.25 162.562 t 0 r /Helvetica findfont 40.9078 sf 0 0 m (100) show NC gr 
 gsave  1088 1214 1157 12 C 1530.62 162.562 t 0 r /Helvetica findfont 40.9078 sf 0 0 m (200) show NC gr 
 gsave  1088 1214 1157 12 C 1687 162.562 t 0 r /Helvetica findfont 40.9078 sf 0 0 m (300) show NC gr 
 gsave  1088 1214 1157 12 C 1843.44 162.562 t 0 r /Helvetica findfont 40.9078 sf 0 0 m (400) show NC gr 
 gsave  1088 1214 1157 12 C 1999.81 162.562 t 0 r /Helvetica findfont 40.9078 sf 0 0 m (500) show NC gr 
 gsave  1088 1214 1157 12 C 2156.19 162.562 t 0 r /Helvetica findfont 40.9078 sf 0 0 m (600) show NC gr  1331 1166 m 860 X s 1409 1137 m 29 Y s 1440 1151 m 15 Y s 1471 1151 m 15 Y s 1503 1151 m 15 Y s 1534 1151 m 15 Y s 1565 1137 m 29 Y s 1596 1151 m
 15 Y s 1628 1151 m 15 Y s 1659 1151 m 15 Y s 1690 1151 m 15 Y s 1722 1137 m 29 Y s 1753 1151 m 15 Y s 1784 1151 m 15 Y s 1815 1151 m 15 Y s 1847 1151 m 15 Y s 1878 1137 m 29 Y s 1909 1151 m 15 Y s 1940 1151 m 15 Y s 1972 1151 m 15 Y s 2003 1151 m 15
 Y s 2034 1137 m 29 Y s 2066 1151 m 15 Y s 2097 1151 m 15 Y s 2128 1151 m 15 Y s 2159 1151 m 15 Y s 2191 1137 m 29 Y s 1409 1137 m 29 Y s 1378 1151 m 15 Y s 1346 1151 m 15 Y s 1331 207 m 959 Y s
 gsave  1088 1214 1157 12 C 1230.25 1081.38 t 90 r /Helvetica findfont 40.9078 sf 0 0 m (\(mZ\)) show NC gr 
 gsave  1088 1214 1157 12 C 1230.25 1056.5 t 90 r /Symbol findfont 40.9078 sf 0 0 m (s) show NC gr 
 gsave  1088 1214 1157 12 C 1230.25 964.062 t 90 r /Helvetica findfont 40.9078 sf 0 0 m (\(Q\) / ) show NC gr 
 gsave  1088 1214 1157 12 C 1230.25 939.188 t 90 r /Symbol findfont 40.9078 sf 0 0 m (s) show NC gr 
 gsave  1088 1214 1157 12 C 1230.25 777.5 t 90 r /Helvetica findfont 40.9078 sf 0 0 m (gg Ratio ) show NC gr  1356 207 m -25 X s 1344 226 m -13 X s 1344 245 m -13 X s 1344 264 m -13 X s 1344 283 m -13 X s 1356 303 m -25 X s 1344 322 m -13 X s 1344
 341 m -13 X s 1344 360 m -13 X s 1344 379 m -13 X s 1356 398 m -25 X s 1344 418 m -13 X s 1344 437 m -13 X s 1344 456 m -13 X s 1344 475 m -13 X s 1356 494 m -25 X s 1344 514 m -13 X s 1344 533 m -13 X s 1344 552 m -13 X s 1344 571 m -13 X s 1356
 590 m -25 X s 1344 609 m -13 X s 1344 629 m -13 X s 1344 648 m -13 X s 1344 667 m -13 X s 1356 686 m -25 X s 1344 705 m -13 X s 1344 724 m -13 X s 1344 744 m -13 X s 1344 763 m -13 X s 1356 782 m -25 X s 1344 801 m -13 X s 1344 820 m -13 X s 1344
 840 m -13 X s 1344 859 m -13 X s 1356 878 m -25 X s 1344 897 m -13 X s 1344 916 m -13 X s 1344 935 m -13 X s 1344 955 m -13 X s 1356 974 m -25 X s 1344 993 m -13 X s 1344 1012 m -13 X s 1344 1031 m -13 X s 1344 1051 m -13 X s 1356 1070 m -25 X s
 1344 1089 m -13 X s 1344 1108 m -13 X s 1344 1127 m -13 X s 1344 1146 m -13 X s 1356 1166 m -25 X s
 gsave  1088 1214 1157 12 C 1267.62 192.75 t 0 r /Helvetica findfont 40.9078 sf 0 0 m (0.5) show NC gr 
 gsave  1088 1214 1157 12 C 1269.38 288.75 t 0 r /Helvetica findfont 40.9078 sf 0 0 m (0.6) show NC gr 
 gsave  1088 1214 1157 12 C 1269.38 384.688 t 0 r /Helvetica findfont 40.9078 sf 0 0 m (0.7) show NC gr 
 gsave  1088 1214 1157 12 C 1269.38 480.688 t 0 r /Helvetica findfont 40.9078 sf 0 0 m (0.8) show NC gr 
 gsave  1088 1214 1157 12 C 1269.38 576.625 t 0 r /Helvetica findfont 40.9078 sf 0 0 m (0.9) show NC gr 
 gsave  1088 1214 1157 12 C 1308.5 672.625 t 0 r /Helvetica findfont 40.9078 sf 0 0 m (1) show NC gr 
 gsave  1088 1214 1157 12 C 1274.69 768.562 t 0 r /Helvetica findfont 40.9078 sf 0 0 m (1.1) show NC gr 
 gsave  1088 1214 1157 12 C 1269.38 862.75 t 0 r /Helvetica findfont 40.9078 sf 0 0 m (1.2) show NC gr 
 gsave  1088 1214 1157 12 C 1269.38 958.75 t 0 r /Helvetica findfont 40.9078 sf 0 0 m (1.3) show NC gr 
 gsave  1088 1214 1157 12 C 1269.38 1054.69 t 0 r /Helvetica findfont 40.9078 sf 0 0 m (1.4) show NC gr 
 gsave  1088 1214 1157 12 C 1267.62 1150.69 t 0 r /Helvetica findfont 40.9078 sf 0 0 m (1.5) show NC gr  2191 207 m 959 Y s 2165 207 m 26 X s 2178 226 m 13 X s 2178 245 m 13 X s 2178 264 m 13 X s 2178 283 m 13 X s 2165 303 m 26 X s 2178 322 m 13 X s
 2178 341 m 13 X s 2178 360 m 13 X s 2178 379 m 13 X s 2165 398 m 26 X s 2178 418 m 13 X s 2178 437 m 13 X s 2178 456 m 13 X s 2178 475 m 13 X s 2165 494 m 26 X s 2178 514 m 13 X s 2178 533 m 13 X s 2178 552 m 13 X s 2178 571 m 13 X s 2165 590 m 26 X
 s 2178 609 m 13 X s 2178 629 m 13 X s 2178 648 m 13 X s 2178 667 m 13 X s 2165 686 m 26 X s 2178 705 m 13 X s 2178 724 m 13 X s 2178 744 m 13 X s 2178 763 m 13 X s 2165 782 m 26 X s 2178 801 m 13 X s 2178 820 m 13 X s 2178 840 m 13 X s 2178 859 m 13
 X s 2165 878 m 26 X s 2178 897 m 13 X s 2178 916 m 13 X s 2178 935 m 13 X s 2178 955 m 13 X s 2165 974 m 26 X s 2178 993 m 13 X s 2178 1012 m 13 X s 2178 1031 m 13 X s 2178 1051 m 13 X s 2165 1070 m 26 X s 2178 1089 m 13 X s 2178 1108 m 13 X s 2178
 1127 m 13 X s 2178 1146 m 13 X s 2165 1166 m 26 X s 6 lw 1 1 1 c 0 0 1 c 3 lw 1370 844 1448 922 1526 955 1604 974 1682 994 1761 1021 1839 1023 1917 1045 1995 1087 2073 1110 2152 1116 11 { m22} R 6 lw black 1 1 1 c 1 0 1 c 3 lw 1370 547 1448 518 1526
 491 1604 480 1682 466 1761 456 1839 440 1917 443 1995 436 2073 442 2152 403 11 { m24} R 6 lw 1 0 0 c 0.95 0.95 0.95 c black 1 0 0 c 1335 871 m 9 4 d 8 4 d 9 4 d 8 4 d 9 4 d 9 4 d 8 3 d 9 4 d 8 3 d 9 4 d 9 3 d 8 4 d 9 3 d 8 3 d 9 3 d 9 3 d 8 3 d 9 3
 d 8 3 d 9 3 d 9 3 d 8 3 d 9 3 d 8 3 d 9 3 d 9 2 d 8 3 d 9 3 d 8 2 d 9 3 d 9 3 d 8 2 d 9 3 d 8 2 d 9 3 d 9 2 d 8 2 d 9 3 d 8 2 d 9 3 d 9 2 d 8 2 d 9 3 d 8 2 d 9 2 d 9 2 d 8 3 d 9 2 d 8 2 d s 1756 1013 m 9 2 d 9 2 d 8 3 d 9 2 d 8 2 d 9 2 d 9 2 d 8 2 d
 9 2 d 8 2 d 9 2 d 9 2 d 8 2 d 9 2 d 8 2 d 9 2 d 9 2 d 8 2 d 9 2 d 8 2 d 9 2 d 9 2 d 8 2 d 9 2 d 8 1 d 9 2 d 9 2 d 8 2 d 9 2 d 8 2 d 9 1 d 9 2 d 8 2 d 9 2 d 8 2 d 9 1 d 9 2 d 8 2 d 9 2 d 8 1 d 9 2 d 9 2 d 8 2 d 9 1 d 8 2 d 9 2 d 9 1 d 8 2 d 9 2 d s
 2178 1106 m 8 1 d s 0.95 0.95 0.95 c black 1 0 0 c 1335 531 m 9 -3 d 8 -2 d 9 -3 d 8 -3 d 9 -3 d 9 -2 d 8 -3 d 9 -2 d 8 -2 d 9 -3 d 9 -2 d 8 -2 d 9 -2 d 8 -2 d 9 -2 d 9 -2 d 8 -2 d 9 -2 d 8 -2 d 9 -2 d 9 -2 d 8 -1 d 9 -2 d 8 -2 d 9 -2 d 9 -1 d 8 -2
 d 9 -2 d 8 -1 d 9 -2 d 9 -1 d 8 -2 d 9 -1 d 8 -2 d 9 -1 d 9 -2 d 8 -1 d 9 -1 d 8 -2 d 9 -1 d 9 -2 d 8 -1 d 9 -1 d 8 -1 d 9 -2 d 9 -1 d 8 -1 d 9 -1 d 8 -2 d s 1756 442 m 9 -1 d 9 -1 d 8 -1 d 9 -1 d 8 -2 d 9 -1 d 9 -1 d 8 -1 d 9 -1 d 8 -1 d 9 -1 d 9
 -1 d 8 -2 d 9 -1 d 8 -1 d 9 -1 d 9 -1 d 8 -1 d 9 -1 d 8 -1 d 9 -1 d 9 -1 d 8 -1 d 9 -1 d 8 -1 d 9 -1 d 9 -1 d 8 -1 d 9 X 8 -1 d 9 -1 d 9 -1 d 8 -1 d 9 -1 d 8 -1 d 9 -1 d 9 -1 d 8 -1 d 9 X 8 -1 d 9 -1 d 9 -1 d 8 -1 d 9 -1 d 8 X 9 -1 d 9 -1 d 8 -1 d 9
 -1 d s 2178 394 m 8 -1 d s black
 gsave  1088 1214 1157 12 C 1425.75 1083.12 t 0 r /Helvetica findfont 51.5794 sf 0 0 m 
 139 111 85 72 44 30
(= 7 TeV) K NC gr 
 gsave  1088 1214 1157 12 C 1400.88 1083.12 t 0 r /Helvetica findfont 51.5794 sf 0 0 m (s) show NC gr  1367 1111 m 23 -30 d s 0 lw 1390 1081 m 5 44 d s 1395 1125 m 30 X s
 gsave  1088 1214 1157 12 C 2234.38 814.812 t 90 r /Helvetica-BoldOblique findfont 30.2362 sf 0 0 m 
 336 321 304 287 279 255 226 218 198 177 169 148 125 101 93 71 62 40 18
(LHC HIGGS XS WG 2011) K NC gr 
 gsave  1088 1214 1157 12 C 1374.25 256.75 t 0 r /Helvetica findfont 51.5794 sf 0 0 m (QCD Scale Uncertainty) show NC gr  3 lw 1 1 1 c 535 182 1612 778 bf black 1623 778 m -7 Y 531 X 178 Y -7 X -171 Y f 1612 778 m 182 Y 535 X -182 Y -535 X cl s
 gsave  1088 1214 1157 12 C 1745.69 907.188 t 0 r /Helvetica findfont 24.9004 sf 0 0 m (QCD Scale Q = mZ/2 \(gg CT10\)) show NC gr  0 0 1 c 1679 914 m22 black
 gsave  1088 1214 1157 12 C 1745.69 816.562 t 0 r /Helvetica findfont 24.9004 sf 0 0 m (QCD Scale Q = 2mZ \(gg CT10\)) show NC gr  1 0 1 c 1679 824 m24
 gr  gr showpage
end
%%EOF
