%!PS-Adobe-2.0 EPSF-2.0
%%BoundingBox:  0 0 567 491
%%Title: /Users/lorenzo/data/code/PHOTONS/Higgs/Interference/delta_vs_thetaStar.eps: c1
%%Creator: ROOT Version 5.27/02
%%CreationDate: Wed Nov  2 15:56:16 2011
%%EndComments
%%BeginProlog
80 dict begin
/s {stroke} def /l {lineto} def /m {moveto} def /t {translate} def
/r {rotate} def /rl {roll}  def /R {repeat} def
/d {rlineto} def /rm {rmoveto} def /gr {grestore} def /f {eofill} def
/c {setrgbcolor} def /black {0 setgray} def /sd {setdash} def
/cl {closepath} def /sf {scalefont setfont} def /lw {setlinewidth} def
/box {m dup 0 exch d exch 0 d 0 exch neg d cl} def
/NC{systemdict begin initclip end}def/C{NC box clip newpath}def
/bl {box s} def /bf {box f} def /Y { 0 exch d} def /X { 0 d} def 
/K {{pop pop 0 moveto} exch kshow} bind def
/ita {/ang 15 def gsave [1 0 ang dup sin exch cos div 1 0 0] concat} def 
/mp {newpath /y exch def /x exch def} def
/side {[w .77 mul w .23 mul] .385 w mul sd w 0 l currentpoint t -144 r} def
/mr {mp x y w2 0 360 arc} def /m24 {mr s} def /m20 {mr f} def
/mb {mp x y w2 add m w2 neg 0 d 0 w neg d w 0 d 0 w d cl} def
/mt {mp x y w2 add m w2 neg w neg d w 0 d cl} def
/m21 {mb f} def /m25 {mb s} def /m22 {mt f} def /m26{mt s} def
/m23 {mp x y w2 sub m w2 w d w neg 0 d cl f} def
/m27 {mp x y w2 add m w3 neg w2 neg d w3 w2 neg d w3 w2 d cl s} def
/m28 {mp x w2 sub y w2 sub w3 add m w3 0 d  0 w3 neg d w3 0 d 0 w3 d w3 0 d  0 w3 d w3 neg 0 d 0 w3 d w3 neg 0 d
 0 w3 neg d w3 neg 0 d cl s } def
/m29 {mp gsave x w2 sub y w2 add w3 sub m currentpoint t
 4 {side} repeat cl fill gr} def
/m30 {mp gsave x w2 sub y w2 add w3 sub m currentpoint t
 4 {side} repeat cl s gr} def
/m31 {mp x y w2 sub m 0 w d x w2 sub y m w 0 d x w2 sub y w2 add m w w neg d x w2 sub y w2
 sub m w w d s} def
/m32 {mp x y w2 sub m w2 w d w neg 0 d cl s} def
/m33 {mp x y w2 add m w3 neg w2 neg d w3 w2 neg d w3 w2 d cl f} def
/m34 {mp x w2 sub y w2 sub w3 add m w3 0 d  0 w3 neg d w3 0 d 0 w3 d w3 0 d  0 w3 d w3 neg 0 d 0 w3 d w3 neg 0 d
 0 w3 neg d w3 neg 0 d cl f } def
/m2 {mp x y w2 sub m 0 w d x w2 sub y m w 0 d s} def
/m5 {mp x w2 sub y w2 sub m w w d x w2 sub y w2 add m w w neg d s} def
/reEncode {exch findfont dup length dict begin {1 index /FID eq  {pop pop} {def} ifelse } forall /Encoding exch def currentdict end dup /FontName get exch definefont pop } def [/Times-Bold /Times-Italic /Times-BoldItalic /Helvetica
 /Helvetica-Oblique /Helvetica-Bold /Helvetica-BoldOblique /Courier /Courier-Oblique /Courier-Bold /Courier-BoldOblique /Times-Roman /AvantGarde-Book /AvantGarde-BookOblique /AvantGarde-Demi /AvantGarde-DemiOblique /Bookman-Demi
 /Bookman-DemiItalic /Bookman-Light /Bookman-LightItalic /Helvetica-Narrow /Helvetica-Narrow-Bold /Helvetica-Narrow-BoldOblique /Helvetica-Narrow-Oblique /NewCenturySchlbk-Roman /NewCenturySchlbk-Bold
 /NewCenturySchlbk-BoldItalic /NewCenturySchlbk-Italic /Palatino-Bold /Palatino-BoldItalic /Palatino-Italic /Palatino-Roman ] {ISOLatin1Encoding reEncode } forall
%%EndProlog
%%BeginSetup
%%EndSetup
newpath  gsave  .25 .25 scale  gsave  0 0 t black[  ] 0 sd 3 lw 1 1 1 c 2268 1966 0 0 bf black 1 1 1 c 1815 1573 225 198 bf black 1815 1573 225 198 bl 1 1 1 c 1815 1573 225 198 bf black 1815 1573 225 198 bl 225 198 m 1815 X s[ 4 8] 0 sd 376 1771 m
 -1573 Y s 565 1771 m -1573 Y s 754 1771 m -1573 Y s 943 1771 m -1573 Y s 1132 1771 m -1573 Y s 1321 1771 m -1573 Y s 1510 1771 m -1573 Y s 1699 1771 m -1573 Y s 1888 1771 m -1573 Y s 376 1771 m -1573 Y s 1888 1771 m -1573 Y s[  ] 0 sd 225 1771 m
 1815 X s 225 198 m 1573 Y s[ 4 8] 0 sd 2040 285 m -1815 X s 2040 507 m -1815 X s 2040 729 m -1815 X s 2040 951 m -1815 X s 2040 1173 m -1815 X s 2040 1395 m -1815 X s 2040 1617 m -1815 X s 2040 285 m -1815 X s 2040 1617 m -1815 X s[  ] 0 sd 2040
 198 m 1573 Y s 225 198 m 1815 X s
 gsave  2268 1966 0 0 C 1691 50 t 0 r /Helvetica-Bold findfont 73.8014 sf 0 0 m ( \(degrees\)) show NC gr 
 gsave  2268 1966 0 0 C 1654 50 t 0 r /Symbol findfont 73.8014 sf 0 0 m (q) show NC gr  376 245 m -47 Y s 414 222 m -24 Y s 452 222 m -24 Y s 489 222 m -24 Y s 527 222 m -24 Y s 565 245 m -47 Y s 603 222 m -24 Y s 641 222 m -24 Y s 678 222 m -24 Y s
 716 222 m -24 Y s 754 245 m -47 Y s 792 222 m -24 Y s 830 222 m -24 Y s 868 222 m -24 Y s 905 222 m -24 Y s 943 245 m -47 Y s 981 222 m -24 Y s 1019 222 m -24 Y s 1057 222 m -24 Y s 1094 222 m -24 Y s 1132 245 m -47 Y s 1170 222 m -24 Y s 1208 222
 m -24 Y s 1246 222 m -24 Y s 1283 222 m -24 Y s 1321 245 m -47 Y s 1359 222 m -24 Y s 1397 222 m -24 Y s 1435 222 m -24 Y s 1472 222 m -24 Y s 1510 245 m -47 Y s 1548 222 m -24 Y s 1586 222 m -24 Y s 1624 222 m -24 Y s 1662 222 m -24 Y s 1699 245 m
 -47 Y s 1737 222 m -24 Y s 1775 222 m -24 Y s 1813 222 m -24 Y s 1851 222 m -24 Y s 1888 245 m -47 Y s 376 245 m -47 Y s 338 222 m -24 Y s 300 222 m -24 Y s 263 222 m -24 Y s 225 222 m -24 Y s 1888 245 m -47 Y s 1926 222 m -24 Y s 1964 222 m -24 Y
 s 2002 222 m -24 Y s
 gsave  2268 1966 0 0 C 335 127 t 0 r /Helvetica-Bold findfont 73.8014 sf 0 0 m (10) show NC gr 
 gsave  2268 1966 0 0 C 523 127 t 0 r /Helvetica-Bold findfont 73.8014 sf 0 0 m (20) show NC gr 
 gsave  2268 1966 0 0 C 711 127 t 0 r /Helvetica-Bold findfont 73.8014 sf 0 0 m (30) show NC gr 
 gsave  2268 1966 0 0 C 902 127 t 0 r /Helvetica-Bold findfont 73.8014 sf 0 0 m (40) show NC gr 
 gsave  2268 1966 0 0 C 1090 127 t 0 r /Helvetica-Bold findfont 73.8014 sf 0 0 m (50) show NC gr 
 gsave  2268 1966 0 0 C 1278 127 t 0 r /Helvetica-Bold findfont 73.8014 sf 0 0 m (60) show NC gr 
 gsave  2268 1966 0 0 C 1469 127 t 0 r /Helvetica-Bold findfont 73.8014 sf 0 0 m (70) show NC gr 
 gsave  2268 1966 0 0 C 1657 127 t 0 r /Helvetica-Bold findfont 73.8014 sf 0 0 m (80) show NC gr 
 gsave  2268 1966 0 0 C 1845 127 t 0 r /Helvetica-Bold findfont 73.8014 sf 0 0 m (90) show NC gr  225 1771 m 1815 X s 376 1724 m 47 Y s 414 1748 m 23 Y s 452 1748 m 23 Y s 489 1748 m 23 Y s 527 1748 m 23 Y s 565 1724 m 47 Y s 603 1748 m 23 Y s 641
 1748 m 23 Y s 678 1748 m 23 Y s 716 1748 m 23 Y s 754 1724 m 47 Y s 792 1748 m 23 Y s 830 1748 m 23 Y s 868 1748 m 23 Y s 905 1748 m 23 Y s 943 1724 m 47 Y s 981 1748 m 23 Y s 1019 1748 m 23 Y s 1057 1748 m 23 Y s 1094 1748 m 23 Y s 1132 1724 m 47
 Y s 1170 1748 m 23 Y s 1208 1748 m 23 Y s 1246 1748 m 23 Y s 1283 1748 m 23 Y s 1321 1724 m 47 Y s 1359 1748 m 23 Y s 1397 1748 m 23 Y s 1435 1748 m 23 Y s 1472 1748 m 23 Y s 1510 1724 m 47 Y s 1548 1748 m 23 Y s 1586 1748 m 23 Y s 1624 1748 m 23 Y
 s 1662 1748 m 23 Y s 1699 1724 m 47 Y s 1737 1748 m 23 Y s 1775 1748 m 23 Y s 1813 1748 m 23 Y s 1851 1748 m 23 Y s 1888 1724 m 47 Y s 376 1724 m 47 Y s 338 1748 m 23 Y s 300 1748 m 23 Y s 263 1748 m 23 Y s 225 1748 m 23 Y s 1888 1724 m 47 Y s 1926
 1748 m 23 Y s 1964 1748 m 23 Y s 2002 1748 m 23 Y s 225 198 m 1573 Y s
 gsave  2268 1966 0 0 C 97 1637 t 90 r /Helvetica-Bold findfont 73.8014 sf 0 0 m ( \(%\)) show NC gr 
 gsave  2268 1966 0 0 C 97 1600 t 90 r /Symbol findfont 73.8014 sf 0 0 m (d) show NC gr  279 285 m -54 X s 252 340 m -27 X s 252 396 m -27 X s 252 451 m -27 X s 279 507 m -54 X s 252 562 m -27 X s 252 618 m -27 X s 252 673 m -27 X s 279 729 m -54 X
 s 252 784 m -27 X s 252 840 m -27 X s 252 895 m -27 X s 279 951 m -54 X s 252 1006 m -27 X s 252 1062 m -27 X s 252 1117 m -27 X s 279 1173 m -54 X s 252 1228 m -27 X s 252 1284 m -27 X s 252 1339 m -27 X s 279 1395 m -54 X s 252 1450 m -27 X s 252
 1506 m -27 X s 252 1561 m -27 X s 279 1617 m -54 X s 279 285 m -54 X s 252 229 m -27 X s 279 1617 m -54 X s 252 1672 m -27 X s 252 1728 m -27 X s
 gsave  2268 1966 0 0 C 104 255 t 0 r /Helvetica-Bold findfont 73.8014 sf 0 0 m (\25514) show NC gr 
 gsave  2268 1966 0 0 C 107 480 t 0 r /Helvetica-Bold findfont 73.8014 sf 0 0 m (\25512) show NC gr 
 gsave  2268 1966 0 0 C 107 704 t 0 r /Helvetica-Bold findfont 73.8014 sf 0 0 m (\25510) show NC gr 
 gsave  2268 1966 0 0 C 148 926 t 0 r /Helvetica-Bold findfont 73.8014 sf 0 0 m (\2558) show NC gr 
 gsave  2268 1966 0 0 C 148 1147 t 0 r /Helvetica-Bold findfont 73.8014 sf 0 0 m (\2556) show NC gr 
 gsave  2268 1966 0 0 C 144 1365 t 0 r /Helvetica-Bold findfont 73.8014 sf 0 0 m (\2554) show NC gr 
 gsave  2268 1966 0 0 C 148 1587 t 0 r /Helvetica-Bold findfont 73.8014 sf 0 0 m (\2552) show NC gr  2040 198 m 1573 Y s 1985 285 m 55 X s 2012 340 m 28 X s 2012 396 m 28 X s 2012 451 m 28 X s 1985 507 m 55 X s 2012 562 m 28 X s 2012 618 m 28 X s
 2012 673 m 28 X s 1985 729 m 55 X s 2012 784 m 28 X s 2012 840 m 28 X s 2012 895 m 28 X s 1985 951 m 55 X s 2012 1006 m 28 X s 2012 1062 m 28 X s 2012 1117 m 28 X s 1985 1173 m 55 X s 2012 1228 m 28 X s 2012 1284 m 28 X s 2012 1339 m 28 X s 1985
 1395 m 55 X s 2012 1450 m 28 X s 2012 1506 m 28 X s 2012 1561 m 28 X s 1985 1617 m 55 X s 1985 285 m 55 X s 2012 229 m 28 X s 1985 1617 m 55 X s 2012 1672 m 28 X s 2012 1728 m 28 X s 0 0 1 c black 0 0 1 c /w 54
 def /w2 {w 2 div} def /w3 {w 3 div} def 376 329 565 1088 754 1356 943 1486 1132 1557 1321 1598 1510 1623 1699 1636 1888 1640 9 { m29} R black 1 1 1 c black 416 155 1050 1100 bl 1070 1100 m -13 Y 409 X 147 Y -13 X -134 Y f 1050 1100 m 155 Y 416 X
 -155 Y -416 X cl s 1 1 1 c black
 gsave  2268 1966 0 0 C 1067 1151 t 0 r /Helvetica-Bold findfont 70.4468 sf 0 0 m (M=120 GeV) show NC gr 
 gr  gr 
showpage
end
%%EOF
