%!PS-Adobe-1.0
%%Creator: Unified Graphics System
%%Pages: (atend)
%%DocumentFonts: Courier
%%BoundingBox:   99  204  481  563
%%EndComments
/Sw{setlinewidth}def
/Sg{setgray}def
/Sd{setdash}def
/P {newpath
    moveto
0 0 rlineto
    stroke}def
/M {moveto}def
/D {lineto}def
/N {newpath}def
/S {stroke}def
/T {/Courier findfont
    exch
    scalefont
    setfont}def
/R {rotate}def
/W {show}def
/F {fill}def
/X {gsave}def
/Y {grestore}def
%%EndProlog
%%Page: 1 1
0.24000 0.24000 scale
1 setlinecap
1 setlinejoin
4 Sw
0 0 0 setrgbcolor
[] 0 Sd
N
887 2259 M
887 2227 D
S
N
889 2259 M
889 2227 D
S
N
889 2254 M
892 2257 D
895 2259 D
898 2259 D
902 2257 D
905 2254 D
907 2249 D
907 2246 D
905 2242 D
902 2239 D
898 2237 D
895 2237 D
892 2239 D
889 2242 D
S
N
898 2259 M
901 2257 D
904 2254 D
905 2249 D
905 2246 D
904 2242 D
901 2239 D
898 2237 D
S
N
882 2259 M
889 2259 D
S
N
882 2227 M
893 2227 D
S
N
919 2259 M
919 2227 D
S
N
920 2259 M
920 2227 D
S
N
920 2254 M
923 2257 D
926 2259 D
929 2259 D
934 2257 D
937 2254 D
938 2249 D
938 2246 D
937 2242 D
934 2239 D
929 2237 D
926 2237 D
923 2239 D
920 2242 D
S
N
929 2259 M
932 2257 D
935 2254 D
937 2249 D
937 2246 D
935 2242 D
932 2239 D
929 2237 D
S
N
914 2259 M
920 2259 D
S
N
914 2227 M
925 2227 D
S
N
996 2254 M
1000 2251 D
996 2248 D
S
N
991 2259 M
999 2251 D
991 2243 D
S
N
973 2251 M
999 2251 D
S
N
1045 2269 M
1035 2237 D
S
N
1045 2269 M
1056 2237 D
S
N
1045 2265 M
1055 2237 D
S
N
1038 2246 M
1052 2246 D
S
N
1032 2237 M
1041 2237 D
S
N
1050 2237 M
1059 2237 D
S
N
1068 2269 M
1068 2243 D
1070 2239 D
1073 2237 D
1076 2237 D
1079 2239 D
1080 2242 D
S
N
1070 2269 M
1070 2243 D
1071 2239 D
1073 2237 D
S
N
1064 2259 M
1076 2259 D
S
N
1091 2269 M
1091 2243 D
1092 2239 D
1095 2237 D
1098 2237 D
1101 2239 D
1103 2242 D
S
N
1092 2269 M
1092 2243 D
1094 2239 D
1095 2237 D
S
N
1086 2259 M
1098 2259 D
S
N
1082 2278 M
1115 2278 D
S
N
1210 2269 M
1210 2237 D
S
N
1212 2269 M
1212 2237 D
S
N
1210 2254 M
1207 2257 D
1204 2259 D
1201 2259 D
1196 2257 D
1193 2254 D
1192 2249 D
1192 2246 D
1193 2242 D
1196 2239 D
1201 2237 D
1204 2237 D
1207 2239 D
1210 2242 D
S
N
1201 2259 M
1198 2257 D
1195 2254 D
1193 2249 D
1193 2246 D
1195 2242 D
1198 2239 D
1201 2237 D
S
N
1205 2269 M
1212 2269 D
S
N
1210 2237 M
1216 2237 D
S
N
1248 2259 M
1233 2259 D
1228 2257 D
1225 2252 D
1224 2248 D
1224 2243 D
1225 2240 D
1227 2239 D
1230 2237 D
1233 2237 D
1237 2239 D
1240 2243 D
1242 2248 D
1242 2252 D
1240 2256 D
1239 2257 D
1236 2259 D
S
N
1233 2259 M
1230 2257 D
1227 2252 D
1225 2248 D
1225 2242 D
1227 2239 D
S
N
1233 2237 M
1236 2239 D
1239 2243 D
1240 2248 D
1240 2254 D
1239 2257 D
S
N
1239 2257 M
1248 2257 D
S
N
1281 2275 M
1254 2227 D
S
N
1307 2269 M
1307 2237 D
S
N
1308 2269 M
1308 2237 D
S
N
1307 2254 M
1304 2257 D
1301 2259 D
1298 2259 D
1293 2257 D
1290 2254 D
1289 2249 D
1289 2246 D
1290 2242 D
1293 2239 D
1298 2237 D
1301 2237 D
1304 2239 D
1307 2242 D
S
N
1298 2259 M
1295 2257 D
1292 2254 D
1290 2249 D
1290 2246 D
1292 2242 D
1295 2239 D
1298 2237 D
S
N
1302 2269 M
1308 2269 D
S
N
1307 2237 M
1313 2237 D
S
N
1323 2269 M
1323 2237 D
S
N
1325 2269 M
1334 2242 D
S
N
1323 2269 M
1334 2237 D
S
N
1344 2269 M
1334 2237 D
S
N
1344 2269 M
1344 2237 D
S
N
1346 2269 M
1346 2237 D
S
N
1319 2269 M
1325 2269 D
S
N
1344 2269 M
1350 2269 D
S
N
1319 2237 M
1328 2237 D
S
N
1340 2237 M
1350 2237 D
S
N
1361 2246 M
1360 2245 D
1361 2244 D
1362 2245 D
1361 2246 D
S
N
1362 2239 M
1362 2221 D
1361 2219 D
1359 2218 D
1357 2218 D
1356 2219 D
1356 2220 D
1357 2221 D
1358 2220 D
1357 2219 D
S
N
1361 2239 M
1361 2221 D
1360 2219 D
1359 2218 D
S
N
1358 2239 M
1362 2239 D
S
N
1373 2246 M
1372 2245 D
1373 2244 D
1374 2245 D
1373 2246 D
S
N
1374 2239 M
1374 2221 D
1373 2219 D
1371 2218 D
1368 2218 D
1367 2219 D
1367 2220 D
1368 2221 D
1370 2220 D
1368 2219 D
S
N
1373 2239 M
1373 2221 D
1372 2219 D
1371 2218 D
S
N
1370 2239 M
1374 2239 D
S
N
1410 2275 M
1410 2227 D
S
N
1411 2275 M
1411 2227 D
S
N
1410 2275 M
1420 2275 D
S
N
1410 2227 M
1420 2227 D
S
N
1432 2259 M
1432 2227 D
S
N
1434 2259 M
1434 2227 D
S
N
1434 2254 M
1437 2257 D
1440 2259 D
1443 2259 D
1447 2257 D
1451 2254 D
1452 2249 D
1452 2246 D
1451 2242 D
1447 2239 D
1443 2237 D
1440 2237 D
1437 2239 D
1434 2242 D
S
N
1443 2259 M
1446 2257 D
1449 2254 D
1451 2249 D
1451 2246 D
1449 2242 D
1446 2239 D
1443 2237 D
S
N
1428 2259 M
1434 2259 D
S
N
1428 2227 M
1438 2227 D
S
N
1464 2269 M
1464 2237 D
S
N
1466 2269 M
1466 2237 D
S
N
1466 2254 M
1469 2257 D
1472 2259 D
1475 2259 D
1479 2257 D
1482 2254 D
1484 2249 D
1484 2246 D
1482 2242 D
1479 2239 D
1475 2237 D
1472 2237 D
1469 2239 D
1466 2242 D
S
N
1475 2259 M
1478 2257 D
1481 2254 D
1482 2249 D
1482 2246 D
1481 2242 D
1478 2239 D
1475 2237 D
S
N
1460 2269 M
1466 2269 D
S
N
1502 2275 M
1502 2227 D
S
N
1503 2275 M
1503 2227 D
S
N
1493 2275 M
1503 2275 D
S
N
1493 2227 M
1503 2227 D
S
N
1565 2256 M
1565 2254 D
1564 2254 D
1564 2256 D
1565 2257 D
1568 2259 D
1574 2259 D
1577 2257 D
1579 2256 D
1580 2252 D
1580 2242 D
1582 2239 D
1583 2237 D
S
N
1579 2255 M
1579 2242 D
1580 2239 D
1583 2237 D
1585 2237 D
S
N
1579 2252 M
1577 2251 D
1568 2249 D
1564 2248 D
1562 2245 D
1562 2242 D
1564 2239 D
1568 2237 D
1573 2237 D
1576 2239 D
1579 2242 D
S
N
1568 2249 M
1565 2248 D
1564 2245 D
1564 2242 D
1565 2239 D
1568 2237 D
S
N
1595 2269 M
1595 2243 D
1597 2239 D
1600 2237 D
1603 2237 D
1606 2239 D
1607 2242 D
S
N
1597 2269 M
1597 2243 D
1598 2239 D
1600 2237 D
S
N
1591 2259 M
1603 2259 D
S
N
1642 2269 M
1642 2237 D
S
N
1644 2269 M
1644 2237 D
S
N
1638 2269 M
1648 2269 D
S
N
1638 2237 M
1660 2237 D
1660 2246 D
1659 2237 D
S
N
1669 2269 M
1669 2237 D
S
N
1671 2269 M
1671 2237 D
S
N
1689 2269 M
1689 2237 D
S
N
1690 2269 M
1690 2237 D
S
N
1665 2269 M
1675 2269 D
S
N
1684 2269 M
1695 2269 D
S
N
1671 2254 M
1689 2254 D
S
N
1665 2237 M
1675 2237 D
S
N
1684 2237 M
1695 2237 D
S
N
1724 2265 M
1725 2260 D
1725 2269 D
1724 2265 D
1721 2268 D
1716 2269 D
1713 2269 D
1709 2268 D
1706 2265 D
1704 2262 D
1703 2257 D
1703 2249 D
1704 2245 D
1706 2242 D
1709 2239 D
1713 2237 D
1716 2237 D
1721 2239 D
1724 2242 D
1725 2245 D
S
N
1713 2269 M
1710 2268 D
1707 2265 D
1706 2262 D
1704 2257 D
1704 2249 D
1706 2245 D
1707 2242 D
1710 2239 D
1713 2237 D
S
N
1758 2269 M
1758 2260 D
S
N
1758 2263 M
1760 2266 D
1763 2269 D
1766 2269 D
1774 2265 D
1777 2265 D
1778 2266 D
1780 2269 D
S
N
1760 2266 M
1763 2268 D
1766 2268 D
1774 2265 D
S
N
1780 2269 M
1780 2265 D
1778 2260 D
1772 2252 D
1770 2249 D
1769 2245 D
1769 2237 D
S
N
1778 2260 M
1770 2252 D
1769 2249 D
1767 2245 D
1767 2237 D
S
N
1822 2269 M
1822 2237 D
S
N
1823 2269 M
1823 2237 D
S
N
1813 2269 M
1811 2260 D
1811 2269 D
1834 2269 D
1834 2260 D
1832 2269 D
S
N
1817 2237 M
1828 2237 D
S
N
1843 2249 M
1861 2249 D
1861 2252 D
1860 2255 D
1858 2257 D
1855 2259 D
1850 2259 D
1846 2257 D
1843 2254 D
1841 2249 D
1841 2246 D
1843 2242 D
1846 2239 D
1850 2237 D
1854 2237 D
1858 2239 D
1861 2242 D
S
N
1860 2249 M
1860 2254 D
1858 2257 D
S
N
1850 2259 M
1847 2257 D
1844 2254 D
1843 2249 D
1843 2246 D
1844 2242 D
1847 2239 D
1850 2237 D
S
N
1870 2269 M
1881 2237 D
S
N
1872 2269 M
1881 2242 D
S
N
1891 2269 M
1881 2237 D
S
N
1867 2269 M
1876 2269 D
S
N
1885 2269 M
1894 2269 D
S
3 Sw
N
1455 2186 M
1455 2185 D
1453 2185 D
1453 2186 D
1455 2188 D
1458 2189 D
1464 2189 D
1467 2188 D
1468 2186 D
1470 2183 D
1470 2173 D
1471 2170 D
1473 2168 D
S
N
1468 2186 M
1468 2173 D
1470 2170 D
1473 2168 D
1474 2168 D
S
N
1468 2183 M
1467 2182 D
1458 2180 D
1453 2179 D
1452 2176 D
1452 2173 D
1453 2170 D
1458 2168 D
1462 2168 D
1465 2170 D
1468 2173 D
S
N
1458 2180 M
1455 2179 D
1453 2176 D
1453 2173 D
1455 2170 D
1458 2168 D
S
N
1485 2200 M
1485 2168 D
S
N
1486 2200 M
1495 2173 D
S
N
1485 2200 M
1495 2168 D
S
N
1506 2200 M
1495 2168 D
S
N
1506 2200 M
1506 2168 D
S
N
1508 2200 M
1508 2168 D
S
N
1480 2200 M
1486 2200 D
S
N
1506 2200 M
1512 2200 D
S
N
1480 2168 M
1489 2168 D
S
N
1502 2168 M
1512 2168 D
S
N
1541 2195 M
1542 2191 D
1542 2200 D
1541 2195 D
1538 2198 D
1533 2200 D
1530 2200 D
1526 2198 D
1523 2195 D
1521 2192 D
1520 2188 D
1520 2180 D
1521 2176 D
1523 2173 D
1526 2170 D
1530 2168 D
1533 2168 D
1538 2170 D
1541 2173 D
1542 2176 D
S
N
1530 2200 M
1527 2198 D
1524 2195 D
1523 2192 D
1521 2188 D
1521 2180 D
1523 2176 D
1524 2173 D
1527 2170 D
1530 2168 D
S
N
1574 2188 M
1572 2191 D
1569 2192 D
1565 2192 D
1562 2191 D
1560 2189 D
1559 2185 D
1559 2180 D
1560 2177 D
1563 2176 D
1568 2176 D
1571 2177 D
1572 2180 D
S
N
1565 2192 M
1562 2189 D
1560 2185 D
1560 2180 D
1562 2177 D
1563 2176 D
S
N
1574 2192 M
1572 2180 D
1572 2177 D
1575 2176 D
1579 2176 D
1582 2179 D
1583 2183 D
1583 2186 D
1582 2191 D
1580 2194 D
1577 2197 D
1574 2198 D
1569 2200 D
1565 2200 D
1560 2198 D
1557 2197 D
1554 2194 D
1553 2191 D
1551 2186 D
1551 2182 D
1553 2177 D
1554 2174 D
1557 2171 D
1560 2170 D
1565 2168 D
1569 2168 D
1574 2170 D
1577 2171 D
1579 2173 D
S
N
1575 2192 M
1574 2180 D
1574 2177 D
1575 2176 D
S
N
1595 2200 M
1595 2168 D
S
N
1597 2200 M
1615 2171 D
S
N
1597 2197 M
1615 2168 D
S
N
1615 2200 M
1615 2168 D
S
N
1591 2200 M
1597 2200 D
S
N
1610 2200 M
1619 2200 D
S
N
1591 2168 M
1600 2168 D
S
N
1630 2200 M
1630 2168 D
S
N
1631 2200 M
1631 2168 D
S
N
1625 2200 M
1636 2200 D
S
N
1625 2168 M
1648 2168 D
1648 2177 D
1646 2168 D
S
N
1665 2200 M
1660 2198 D
1657 2195 D
1655 2192 D
1654 2186 D
1654 2182 D
1655 2176 D
1657 2173 D
1660 2170 D
1665 2168 D
1668 2168 D
1672 2170 D
1675 2173 D
1677 2176 D
1678 2182 D
1678 2186 D
1677 2192 D
1675 2195 D
1672 2198 D
1668 2200 D
1665 2200 D
S
N
1665 2200 M
1662 2198 D
1659 2195 D
1657 2192 D
1655 2186 D
1655 2182 D
1657 2176 D
1659 2173 D
1662 2170 D
1665 2168 D
S
N
1668 2168 M
1671 2170 D
1674 2173 D
1675 2176 D
1677 2182 D
1677 2186 D
1675 2192 D
1674 2195 D
1671 2198 D
1668 2200 D
S
N
1702 2195 M
1702 2168 D
S
N
1689 2182 M
1716 2182 D
S
N
1729 2200 M
1729 2168 D
S
N
1731 2200 M
1731 2168 D
S
N
1731 2185 M
1734 2188 D
1738 2189 D
1742 2189 D
1746 2188 D
1748 2185 D
1748 2168 D
S
N
1742 2189 M
1745 2188 D
1746 2185 D
1746 2168 D
S
N
1725 2200 M
1731 2200 D
S
N
1725 2168 M
1735 2168 D
S
N
1742 2168 M
1752 2168 D
S
N
1761 2180 M
1779 2180 D
1779 2183 D
1778 2186 D
1776 2188 D
1773 2189 D
1769 2189 D
1764 2188 D
1761 2185 D
1760 2180 D
1760 2177 D
1761 2173 D
1764 2170 D
1769 2168 D
1772 2168 D
1776 2170 D
1779 2173 D
S
N
1778 2180 M
1778 2185 D
1776 2188 D
S
N
1769 2189 M
1766 2188 D
1763 2185 D
1761 2180 D
1761 2177 D
1763 2173 D
1766 2170 D
1769 2168 D
S
N
1791 2189 M
1791 2168 D
S
N
1793 2189 M
1793 2168 D
S
N
1793 2180 M
1794 2185 D
1797 2188 D
1800 2189 D
1805 2189 D
1806 2188 D
1806 2186 D
1805 2185 D
1803 2186 D
1805 2188 D
S
N
1787 2189 M
1793 2189 D
S
N
1787 2168 M
1797 2168 D
S
N
1815 2189 M
1822 2168 D
S
N
1817 2189 M
1822 2173 D
S
N
1828 2189 M
1822 2168 D
S
N
1828 2189 M
1834 2168 D
S
N
1829 2189 M
1834 2173 D
S
N
1840 2189 M
1834 2168 D
S
N
1811 2189 M
1822 2189 D
S
N
1835 2189 M
1844 2189 D
S
N
1853 2200 M
1852 2198 D
1853 2197 D
1855 2198 D
1853 2200 D
S
N
1853 2189 M
1853 2168 D
S
N
1855 2189 M
1855 2168 D
S
N
1849 2189 M
1855 2189 D
S
N
1849 2168 M
1859 2168 D
S
N
1874 2189 M
1871 2188 D
1870 2186 D
1868 2183 D
1868 2180 D
1870 2177 D
1871 2176 D
1874 2174 D
1877 2174 D
1880 2176 D
1882 2177 D
1883 2180 D
1883 2183 D
1882 2186 D
1880 2188 D
1877 2189 D
1874 2189 D
S
N
1871 2188 M
1870 2185 D
1870 2179 D
1871 2176 D
S
N
1880 2176 M
1882 2179 D
1882 2185 D
1880 2188 D
S
N
1882 2186 M
1883 2188 D
1886 2189 D
1886 2188 D
1883 2188 D
S
N
1870 2177 M
1868 2176 D
1867 2173 D
1867 2171 D
1868 2168 D
1873 2167 D
1880 2167 D
1885 2165 D
1886 2164 D
S
N
1867 2171 M
1868 2170 D
1873 2168 D
1880 2168 D
1885 2167 D
1886 2164 D
1886 2162 D
1885 2159 D
1880 2158 D
1871 2158 D
1867 2159 D
1865 2162 D
1865 2164 D
1867 2167 D
1871 2168 D
S
N
1455 2131 M
1455 2099 D
S
N
1456 2131 M
1456 2099 D
S
N
1450 2131 M
1468 2131 D
1473 2129 D
1474 2128 D
1476 2125 D
1476 2120 D
1474 2117 D
1473 2116 D
1468 2114 D
1456 2114 D
S
N
1468 2131 M
1471 2129 D
1473 2128 D
1474 2125 D
1474 2120 D
1473 2117 D
1471 2116 D
1468 2114 D
S
N
1450 2099 M
1461 2099 D
S
N
1495 2131 M
1491 2129 D
1488 2126 D
1486 2123 D
1485 2117 D
1485 2113 D
1486 2107 D
1488 2104 D
1491 2100 D
1495 2099 D
1499 2099 D
1503 2100 D
1506 2104 D
1508 2107 D
1509 2113 D
1509 2117 D
1508 2123 D
1506 2126 D
1503 2129 D
1499 2131 D
1495 2131 D
S
N
1495 2131 M
1492 2129 D
1489 2126 D
1488 2123 D
1486 2117 D
1486 2113 D
1488 2107 D
1489 2104 D
1492 2100 D
1495 2099 D
S
N
1499 2099 M
1502 2100 D
1505 2104 D
1506 2107 D
1508 2113 D
1508 2117 D
1506 2123 D
1505 2126 D
1502 2129 D
1499 2131 D
S
N
1520 2131 M
1526 2099 D
S
N
1521 2131 M
1526 2107 D
S
N
1532 2131 M
1526 2099 D
S
N
1532 2131 M
1538 2099 D
S
N
1533 2131 M
1538 2107 D
S
N
1544 2131 M
1538 2099 D
S
N
1515 2131 M
1526 2131 D
S
N
1539 2131 M
1548 2131 D
S
N
1557 2131 M
1557 2099 D
S
N
1559 2131 M
1559 2099 D
S
N
1577 2131 M
1577 2099 D
S
N
1579 2131 M
1579 2099 D
S
N
1553 2131 M
1563 2131 D
S
N
1572 2131 M
1583 2131 D
S
N
1559 2116 M
1577 2116 D
S
N
1553 2099 M
1563 2099 D
S
N
1572 2099 M
1583 2099 D
S
N
1594 2131 M
1594 2099 D
S
N
1595 2131 M
1595 2099 D
S
N
1604 2122 M
1604 2110 D
S
N
1589 2131 M
1613 2131 D
1613 2122 D
1612 2131 D
S
N
1595 2116 M
1604 2116 D
S
N
1589 2099 M
1613 2099 D
1613 2108 D
1612 2099 D
S
N
1625 2131 M
1625 2099 D
S
N
1627 2131 M
1627 2099 D
S
N
1621 2131 M
1631 2131 D
S
N
1621 2099 M
1643 2099 D
1643 2108 D
1642 2099 D
S
N
1665 2126 M
1665 2099 D
S
N
1651 2113 M
1678 2113 D
S
N
1692 2131 M
1692 2099 D
S
N
1693 2131 M
1693 2099 D
S
N
1693 2116 M
1696 2119 D
1701 2120 D
1704 2120 D
1708 2119 D
1710 2116 D
1710 2099 D
S
N
1704 2120 M
1707 2119 D
1708 2116 D
1708 2099 D
S
N
1687 2131 M
1693 2131 D
S
N
1687 2099 M
1698 2099 D
S
N
1704 2099 M
1714 2099 D
S
N
1723 2111 M
1742 2111 D
1742 2114 D
1740 2117 D
1738 2119 D
1735 2120 D
1731 2120 D
1726 2119 D
1723 2116 D
1722 2111 D
1722 2108 D
1723 2104 D
1726 2100 D
1731 2099 D
1734 2099 D
1738 2100 D
1742 2104 D
S
N
1740 2111 M
1740 2116 D
1738 2119 D
S
N
1731 2120 M
1728 2119 D
1725 2116 D
1723 2111 D
1723 2108 D
1725 2104 D
1728 2100 D
1731 2099 D
S
N
1754 2120 M
1754 2099 D
S
N
1755 2120 M
1755 2099 D
S
N
1755 2111 M
1757 2116 D
1760 2119 D
1763 2120 D
1767 2120 D
1769 2119 D
1769 2117 D
1767 2116 D
1766 2117 D
1767 2119 D
S
N
1749 2120 M
1755 2120 D
S
N
1749 2099 M
1760 2099 D
S
N
1778 2120 M
1784 2099 D
S
N
1779 2120 M
1784 2104 D
S
N
1790 2120 M
1784 2099 D
S
N
1790 2120 M
1796 2099 D
S
N
1791 2120 M
1796 2104 D
S
N
1802 2120 M
1796 2099 D
S
N
1773 2120 M
1784 2120 D
S
N
1797 2120 M
1806 2120 D
S
N
1815 2131 M
1814 2129 D
1815 2128 D
1817 2129 D
1815 2131 D
S
N
1815 2120 M
1815 2099 D
S
N
1817 2120 M
1817 2099 D
S
N
1811 2120 M
1817 2120 D
S
N
1811 2099 M
1822 2099 D
S
N
1837 2120 M
1834 2119 D
1832 2117 D
1831 2114 D
1831 2111 D
1832 2108 D
1834 2107 D
1837 2105 D
1840 2105 D
1843 2107 D
1844 2108 D
1846 2111 D
1846 2114 D
1844 2117 D
1843 2119 D
1840 2120 D
1837 2120 D
S
N
1834 2119 M
1832 2116 D
1832 2110 D
1834 2107 D
S
N
1843 2107 M
1844 2110 D
1844 2116 D
1843 2119 D
S
N
1844 2117 M
1846 2119 D
1849 2120 D
1849 2119 D
1846 2119 D
S
N
1832 2108 M
1831 2107 D
1829 2104 D
1829 2102 D
1831 2099 D
1835 2097 D
1843 2097 D
1847 2096 D
1849 2094 D
S
N
1829 2102 M
1831 2100 D
1835 2099 D
1843 2099 D
1847 2097 D
1849 2094 D
1849 2093 D
1847 2090 D
1843 2088 D
1834 2088 D
1829 2090 D
1828 2093 D
1828 2094 D
1829 2097 D
1834 2099 D
S
N
1470 2046 M
1468 2045 D
1470 2043 D
1471 2045 D
1471 2046 D
1468 2049 D
1465 2051 D
1461 2051 D
1456 2049 D
1453 2046 D
1452 2042 D
1452 2039 D
1453 2034 D
1456 2031 D
1461 2030 D
1464 2030 D
1468 2031 D
1471 2034 D
S
N
1461 2051 M
1458 2049 D
1455 2046 D
1453 2042 D
1453 2039 D
1455 2034 D
1458 2031 D
1461 2030 D
S
N
1483 2051 M
1483 2034 D
1485 2031 D
1489 2030 D
1492 2030 D
1497 2031 D
1500 2034 D
S
N
1485 2051 M
1485 2034 D
1486 2031 D
1489 2030 D
S
N
1500 2051 M
1500 2030 D
S
N
1502 2051 M
1502 2030 D
S
N
1479 2051 M
1485 2051 D
S
N
1495 2051 M
1502 2051 D
S
N
1500 2030 M
1506 2030 D
S
N
1517 2061 M
1517 2036 D
1518 2031 D
1521 2030 D
1524 2030 D
1527 2031 D
1529 2034 D
S
N
1518 2061 M
1518 2036 D
1520 2031 D
1521 2030 D
S
N
1512 2051 M
1524 2051 D
S
N
1551 2048 M
1553 2051 D
1553 2045 D
1551 2048 D
1550 2049 D
1547 2051 D
1541 2051 D
1538 2049 D
1536 2048 D
1536 2045 D
1538 2043 D
1541 2042 D
1548 2039 D
1551 2037 D
1553 2036 D
S
N
1536 2046 M
1538 2045 D
1541 2043 D
1548 2040 D
1551 2039 D
1553 2037 D
1553 2033 D
1551 2031 D
1548 2030 D
1542 2030 D
1539 2031 D
1538 2033 D
1536 2036 D
1536 2030 D
1538 2033 D
S
N
1588 2055 M
1589 2054 D
1588 2052 D
1586 2054 D
1586 2055 D
1588 2058 D
1589 2060 D
1594 2061 D
1600 2061 D
1604 2060 D
1606 2057 D
1606 2052 D
1604 2049 D
1600 2048 D
1595 2048 D
S
N
1600 2061 M
1603 2060 D
1604 2057 D
1604 2052 D
1603 2049 D
1600 2048 D
S
N
1600 2048 M
1603 2046 D
1606 2043 D
1607 2040 D
1607 2036 D
1606 2033 D
1604 2031 D
1600 2030 D
1594 2030 D
1589 2031 D
1588 2033 D
1586 2036 D
1586 2037 D
1588 2039 D
1589 2037 D
1588 2036 D
S
N
1604 2045 M
1606 2040 D
1606 2036 D
1604 2033 D
1603 2031 D
1600 2030 D
S
1 Sw
N
1986 2034 M
2003 2034 D
S
N
1986 2034 M
2003 2034 D
S
N
1986 2031 M
1986 2037 D
S
N
2003 2031 M
2003 2043 D
1998 2043 D
2003 2042 D
S
N
1986 2048 M
2003 2048 D
S
N
1986 2049 M
2003 2049 D
S
N
1986 2058 M
2003 2058 D
S
N
1986 2059 M
2003 2059 D
S
N
1986 2046 M
1986 2051 D
S
N
1986 2056 M
1986 2062 D
S
N
1994 2049 M
1994 2058 D
S
N
2003 2046 M
2003 2051 D
S
N
2003 2056 M
2003 2062 D
S
N
1988 2077 M
1991 2078 D
1986 2078 D
1988 2077 D
1987 2075 D
1986 2073 D
1986 2071 D
1987 2069 D
1988 2067 D
1990 2066 D
1992 2066 D
1996 2066 D
1999 2066 D
2000 2067 D
2002 2069 D
2003 2071 D
2003 2073 D
2002 2075 D
2000 2077 D
1999 2078 D
S
N
1986 2071 M
1987 2070 D
1988 2068 D
1990 2067 D
1992 2066 D
1996 2066 D
1999 2067 D
2000 2068 D
2002 2070 D
2003 2071 D
S
N
1986 2097 M
2003 2097 D
S
N
1986 2097 M
2003 2097 D
S
N
1986 2107 M
2003 2107 D
S
N
1986 2108 M
2003 2108 D
S
N
1986 2094 M
1986 2100 D
S
N
1986 2105 M
1986 2110 D
S
N
1994 2097 M
1994 2107 D
S
N
2003 2094 M
2003 2100 D
S
N
2003 2105 M
2003 2110 D
S
N
1986 2116 M
2003 2116 D
S
N
1986 2117 M
2003 2117 D
S
N
1986 2113 M
1986 2119 D
S
N
2003 2113 M
2003 2119 D
S
N
1988 2134 M
1991 2135 D
1986 2135 D
1988 2134 D
1987 2132 D
1986 2130 D
1986 2129 D
1987 2126 D
1988 2125 D
1990 2124 D
1992 2123 D
1996 2123 D
1999 2124 D
2000 2125 D
2002 2126 D
2003 2129 D
2003 2130 D
2002 2132 D
2000 2134 D
S
N
1986 2129 M
1987 2127 D
1988 2125 D
1990 2125 D
1992 2124 D
1996 2124 D
1999 2125 D
2000 2125 D
2002 2127 D
2003 2129 D
S
N
1996 2134 M
2003 2134 D
S
N
1996 2135 M
2003 2135 D
S
N
1996 2132 M
1996 2137 D
S
N
1988 2152 M
1991 2153 D
1986 2153 D
1988 2152 D
1987 2151 D
1986 2148 D
1986 2147 D
1987 2144 D
1988 2143 D
1990 2142 D
1992 2141 D
1996 2141 D
1999 2142 D
2000 2143 D
2002 2144 D
2003 2147 D
2003 2148 D
2002 2151 D
2000 2152 D
S
N
1986 2147 M
1987 2145 D
1988 2144 D
1990 2143 D
1992 2142 D
1996 2142 D
1999 2143 D
2000 2144 D
2002 2145 D
2003 2147 D
S
N
1996 2152 M
2003 2152 D
S
N
1996 2153 M
2003 2153 D
S
N
1996 2150 M
1996 2156 D
S
N
1988 2170 M
1986 2171 D
1991 2171 D
1988 2170 D
1987 2168 D
1986 2166 D
1986 2164 D
1987 2161 D
1988 2160 D
1990 2160 D
1991 2160 D
1992 2161 D
1993 2163 D
1995 2168 D
1995 2169 D
1997 2171 D
S
N
1990 2160 M
1991 2161 D
1992 2163 D
1994 2168 D
1995 2169 D
1995 2170 D
1997 2171 D
2000 2171 D
2002 2169 D
2003 2167 D
2003 2164 D
2002 2162 D
2000 2160 D
1998 2160 D
2003 2160 D
2000 2160 D
S
N
1986 2188 M
2003 2199 D
S
N
1986 2189 M
2003 2199 D
S
N
1986 2199 M
2003 2188 D
S
N
1986 2187 M
1986 2191 D
S
N
1986 2196 M
1986 2201 D
S
N
2003 2187 M
2003 2191 D
S
N
2003 2196 M
2003 2201 D
S
N
1988 2215 M
1986 2215 D
1991 2215 D
1988 2215 D
1987 2213 D
1986 2211 D
1986 2208 D
1987 2206 D
1988 2204 D
1990 2204 D
1991 2205 D
1992 2206 D
1993 2207 D
1995 2212 D
1995 2214 D
1997 2215 D
S
N
1990 2204 M
1991 2206 D
1992 2207 D
1994 2212 D
1995 2214 D
1995 2215 D
1997 2215 D
2000 2215 D
2002 2214 D
2003 2211 D
2003 2209 D
2002 2207 D
2000 2205 D
1998 2204 D
2003 2204 D
2000 2205 D
S
N
1986 2234 M
2003 2237 D
S
N
1986 2234 M
1999 2237 D
S
N
1986 2240 M
2003 2237 D
S
N
1986 2240 M
2003 2243 D
S
N
1986 2241 M
1999 2243 D
S
N
1986 2246 M
2003 2243 D
S
N
1986 2231 M
1986 2237 D
S
N
1986 2244 M
1986 2249 D
S
N
1988 2263 M
1991 2264 D
1986 2264 D
1988 2263 D
1987 2262 D
1986 2259 D
1986 2258 D
1987 2255 D
1988 2254 D
1990 2253 D
1992 2252 D
1996 2252 D
1999 2253 D
2000 2254 D
2002 2255 D
2003 2258 D
2003 2259 D
2002 2262 D
2000 2263 D
S
N
1986 2258 M
1987 2256 D
1988 2254 D
1990 2254 D
1992 2253 D
1996 2253 D
1999 2254 D
2000 2254 D
2002 2256 D
2003 2258 D
S
N
1996 2263 M
2003 2263 D
S
N
1996 2264 M
2003 2264 D
S
N
1996 2261 M
1996 2266 D
S
N
1989 2284 M
1990 2285 D
1991 2284 D
1990 2283 D
1989 2283 D
1987 2284 D
1987 2285 D
1986 2287 D
1986 2290 D
1987 2293 D
1987 2293 D
1989 2294 D
1991 2294 D
1992 2293 D
1994 2291 D
1995 2287 D
1996 2285 D
1998 2284 D
2000 2283 D
2003 2283 D
S
N
1986 2290 M
1987 2292 D
1987 2293 D
1989 2293 D
1991 2293 D
1992 2293 D
1994 2290 D
1995 2287 D
S
N
2001 2283 M
2000 2284 D
2000 2285 D
2002 2289 D
2002 2292 D
2001 2293 D
2000 2294 D
S
N
2000 2285 M
2003 2289 D
2003 2293 D
2002 2293 D
2000 2294 D
1999 2294 D
S
N
1986 2304 M
1987 2301 D
1989 2300 D
1993 2299 D
1995 2299 D
1999 2300 D
2002 2301 D
2003 2304 D
2003 2305 D
2002 2308 D
1999 2309 D
1995 2310 D
1993 2310 D
1989 2309 D
1987 2308 D
1986 2305 D
1986 2304 D
S
N
1986 2304 M
1987 2302 D
1987 2301 D
1989 2301 D
1993 2300 D
1995 2300 D
1999 2301 D
2001 2301 D
2002 2302 D
2003 2304 D
S
N
2003 2305 M
2002 2307 D
2001 2308 D
1999 2309 D
1995 2309 D
1993 2309 D
1989 2309 D
1987 2308 D
1987 2307 D
1986 2305 D
S
N
1989 2317 M
1988 2319 D
1986 2321 D
2003 2321 D
S
N
1987 2321 M
2003 2321 D
S
N
2003 2317 M
2003 2325 D
S
N
1989 2333 M
1988 2335 D
1986 2337 D
2003 2337 D
S
N
1987 2336 M
2003 2336 D
S
N
2003 2333 M
2003 2340 D
S
4 Sw
N
583 2342 M
583 1520 D
S
N
583 1520 M
1967 1520 D
S
N
1967 1520 M
1967 2342 D
S
N
1967 2342 M
583 2342 D
S
N
583 1520 M
1967 1520 D
S
N
583 1520 M
583 1551 D
S
N
633 1531 M
633 1520 D
S
N
684 1520 M
684 1531 D
S
N
734 1531 M
734 1520 D
S
N
784 1520 M
784 1531 D
S
N
835 1551 M
835 1520 D
S
N
885 1520 M
885 1531 D
S
N
935 1531 M
935 1520 D
S
N
986 1520 M
986 1531 D
S
N
1036 1531 M
1036 1520 D
S
N
1086 1520 M
1086 1551 D
S
N
1137 1531 M
1137 1520 D
S
N
1187 1520 M
1187 1531 D
S
N
1237 1531 M
1237 1520 D
S
N
1288 1520 M
1288 1531 D
S
N
1338 1551 M
1338 1520 D
S
N
1388 1520 M
1388 1531 D
S
N
1439 1531 M
1439 1520 D
S
N
1489 1520 M
1489 1531 D
S
N
1539 1531 M
1539 1520 D
S
N
1590 1520 M
1590 1551 D
S
N
1640 1531 M
1640 1520 D
S
N
1690 1520 M
1690 1531 D
S
N
1741 1531 M
1741 1520 D
S
N
1791 1520 M
1791 1531 D
S
N
1841 1551 M
1841 1520 D
S
N
1892 1520 M
1892 1531 D
S
N
1942 1531 M
1942 1520 D
S
N
583 2342 M
1967 2342 D
S
N
583 2311 M
583 2342 D
S
N
633 2342 M
633 2332 D
S
N
684 2332 M
684 2342 D
S
N
734 2342 M
734 2332 D
S
N
784 2332 M
784 2342 D
S
N
835 2342 M
835 2311 D
S
N
885 2332 M
885 2342 D
S
N
935 2342 M
935 2332 D
S
N
986 2332 M
986 2342 D
S
N
1036 2342 M
1036 2332 D
S
N
1086 2311 M
1086 2342 D
S
N
1137 2342 M
1137 2332 D
S
N
1187 2332 M
1187 2342 D
S
N
1237 2342 M
1237 2332 D
S
N
1288 2332 M
1288 2342 D
S
N
1338 2342 M
1338 2311 D
S
N
1388 2332 M
1388 2342 D
S
N
1439 2342 M
1439 2332 D
S
N
1489 2332 M
1489 2342 D
S
N
1539 2342 M
1539 2332 D
S
N
1590 2311 M
1590 2342 D
S
N
1640 2342 M
1640 2332 D
S
N
1690 2332 M
1690 2342 D
S
N
1741 2342 M
1741 2332 D
S
N
1791 2332 M
1791 2342 D
S
N
1841 2342 M
1841 2311 D
S
N
1892 2332 M
1892 2342 D
S
N
1942 2342 M
1942 2332 D
S
N
583 1520 M
583 2342 D
S
N
583 1593 M
593 1593 D
S
N
593 1650 M
583 1650 D
S
N
583 1691 M
593 1691 D
S
N
614 1722 M
583 1722 D
S
N
583 1748 M
593 1748 D
S
N
593 1770 M
583 1770 D
S
N
583 1789 M
593 1789 D
S
N
593 1805 M
583 1805 D
S
N
583 1820 M
614 1820 D
S
N
593 1918 M
583 1918 D
S
N
583 1976 M
593 1976 D
S
N
593 2016 M
583 2016 D
S
N
583 2048 M
614 2048 D
S
N
593 2074 M
583 2074 D
S
N
583 2095 M
593 2095 D
S
N
593 2114 M
583 2114 D
S
N
583 2131 M
593 2131 D
S
N
614 2146 M
583 2146 D
S
N
583 2244 M
593 2244 D
S
N
593 2301 M
583 2301 D
S
N
583 2342 M
593 2342 D
S
N
542 1736 M
539 1721 D
S
N
539 1721 M
542 1724 D
547 1725 D
551 1725 D
556 1724 D
559 1721 D
560 1716 D
560 1713 D
559 1709 D
556 1706 D
551 1704 D
547 1704 D
542 1706 D
541 1707 D
539 1710 D
539 1712 D
541 1713 D
542 1712 D
541 1710 D
S
N
551 1725 M
554 1724 D
557 1721 D
559 1716 D
559 1713 D
557 1709 D
554 1706 D
551 1704 D
S
N
542 1736 M
557 1736 D
S
N
542 1734 M
550 1734 D
557 1736 D
S
N
420 1828 M
423 1829 D
427 1834 D
427 1802 D
S
N
426 1832 M
426 1802 D
S
N
420 1802 M
433 1802 D
S
N
454 1834 M
450 1832 D
447 1828 D
445 1820 D
445 1816 D
447 1808 D
450 1804 D
454 1802 D
457 1802 D
462 1804 D
465 1808 D
466 1816 D
466 1820 D
465 1828 D
462 1832 D
457 1834 D
454 1834 D
S
N
454 1834 M
451 1832 D
450 1831 D
448 1828 D
447 1820 D
447 1816 D
448 1808 D
450 1805 D
451 1804 D
454 1802 D
S
N
457 1802 M
460 1804 D
462 1805 D
463 1808 D
465 1816 D
465 1820 D
463 1828 D
462 1831 D
460 1832 D
457 1834 D
S
N
477 1834 M
504 1834 D
S
N
518 1852 M
515 1837 D
S
N
515 1837 M
518 1840 D
522 1841 D
527 1841 D
531 1840 D
534 1837 D
536 1832 D
536 1829 D
534 1825 D
531 1822 D
527 1820 D
522 1820 D
518 1822 D
516 1823 D
515 1826 D
515 1828 D
516 1829 D
518 1828 D
516 1826 D
S
N
527 1841 M
530 1840 D
533 1837 D
534 1832 D
534 1829 D
533 1825 D
530 1822 D
527 1820 D
S
N
518 1852 M
533 1852 D
S
N
518 1850 M
525 1850 D
533 1852 D
S
N
542 2061 M
539 2046 D
S
N
539 2046 M
542 2049 D
547 2051 D
551 2051 D
556 2049 D
559 2046 D
560 2042 D
560 2039 D
559 2034 D
556 2031 D
551 2030 D
547 2030 D
542 2031 D
541 2033 D
539 2036 D
539 2037 D
541 2039 D
542 2037 D
541 2036 D
S
N
551 2051 M
554 2049 D
557 2046 D
559 2042 D
559 2039 D
557 2034 D
554 2031 D
551 2030 D
S
N
542 2061 M
557 2061 D
S
N
542 2060 M
550 2060 D
557 2061 D
S
N
420 2153 M
423 2155 D
427 2159 D
427 2128 D
S
N
426 2158 M
426 2128 D
S
N
420 2128 M
433 2128 D
S
N
454 2159 M
450 2158 D
447 2153 D
445 2146 D
445 2141 D
447 2134 D
450 2129 D
454 2128 D
457 2128 D
462 2129 D
465 2134 D
466 2141 D
466 2146 D
465 2153 D
462 2158 D
457 2159 D
454 2159 D
S
N
454 2159 M
451 2158 D
450 2156 D
448 2153 D
447 2146 D
447 2141 D
448 2134 D
450 2131 D
451 2129 D
454 2128 D
S
N
457 2128 M
460 2129 D
462 2131 D
463 2134 D
465 2141 D
465 2146 D
463 2153 D
462 2156 D
460 2158 D
457 2159 D
S
N
477 2159 M
504 2159 D
S
N
528 2175 M
528 2146 D
S
N
530 2178 M
530 2146 D
S
N
530 2178 M
513 2155 D
537 2155 D
S
N
524 2146 M
534 2146 D
S
N
1967 1520 M
1967 2342 D
S
N
1957 1593 M
1967 1593 D
S
N
1967 1650 M
1957 1650 D
S
N
1957 1691 M
1967 1691 D
S
N
1967 1722 M
1936 1722 D
S
N
1957 1748 M
1967 1748 D
S
N
1967 1770 M
1957 1770 D
S
N
1957 1789 M
1967 1789 D
S
N
1967 1805 M
1957 1805 D
S
N
1936 1820 M
1967 1820 D
S
N
1967 1918 M
1957 1918 D
S
N
1957 1976 M
1967 1976 D
S
N
1967 2016 M
1957 2016 D
S
N
1936 2048 M
1967 2048 D
S
N
1967 2074 M
1957 2074 D
S
N
1957 2095 M
1967 2095 D
S
N
1967 2114 M
1957 2114 D
S
N
1957 2131 M
1967 2131 D
S
N
1967 2146 M
1936 2146 D
S
N
1957 2244 M
1967 2244 D
S
N
1967 2301 M
1957 2301 D
S
N
1957 2342 M
1967 2342 D
S
N
1327 2186 M
1431 2186 D
S
N
583 1520 M
583 1520 D
S
N
633 1520 M
633 1796 D
658 1796 D
658 1981 D
684 1981 D
684 2057 D
709 2057 D
709 2110 D
734 2110 D
734 2151 D
759 2151 D
759 2187 D
784 2187 D
784 2198 D
809 2198 D
809 2193 D
835 2193 D
835 2193 D
860 2193 D
860 2193 D
885 2193 D
885 2169 D
910 2169 D
910 2152 D
935 2152 D
935 2138 D
960 2138 D
960 2121 D
986 2121 D
986 2111 D
1011 2111 D
1011 2097 D
1036 2097 D
1036 2085 D
1061 2085 D
1061 2070 D
1086 2070 D
1086 2054 D
1111 2054 D
1111 2042 D
1137 2042 D
1137 2029 D
1162 2029 D
1162 2014 D
1187 2014 D
1187 1999 D
1212 1999 D
1212 1986 D
1237 1986 D
1237 1974 D
1262 1974 D
1262 1961 D
1288 1961 D
1288 1946 D
1313 1946 D
1313 1931 D
1338 1931 D
1338 1922 D
1363 1922 D
1363 1906 D
1388 1906 D
1388 1893 D
1413 1893 D
1413 1883 D
1439 1883 D
1439 1868 D
1464 1868 D
1464 1852 D
1489 1852 D
1489 1842 D
1514 1842 D
1514 1834 D
1539 1834 D
1539 1814 D
1564 1814 D
1564 1805 D
1590 1805 D
1590 1790 D
1615 1790 D
1615 1780 D
1640 1780 D
1640 1769 D
1665 1769 D
1665 1762 D
1690 1762 D
1690 1739 D
1715 1739 D
1715 1734 D
1741 1734 D
1741 1723 D
1766 1723 D
1766 1714 D
1791 1714 D
1791 1700 D
1816 1700 D
1816 1690 D
1841 1690 D
1841 1673 D
1866 1673 D
1866 1658 D
1892 1658 D
1892 1652 D
1917 1652 D
1917 1645 D
1942 1645 D
1942 1636 D
1967 1636 D
S
0 0 1 setrgbcolor
N
1327 2117 M
1339 2117 D
S
N
1351 2117 M
1363 2117 D
S
N
1375 2117 M
1387 2117 D
S
N
1400 2117 M
1412 2117 D
S
N
1424 2117 M
1431 2117 D
S
N
583 1520 M
583 1520 D
S
N
633 1520 M
633 1532 D
S
N
633 1544 M
633 1556 D
S
N
633 1569 M
633 1581 D
S
N
633 1593 M
633 1605 D
S
N
633 1617 M
633 1629 D
S
N
633 1641 M
633 1653 D
S
N
633 1665 M
633 1678 D
S
N
633 1690 M
633 1702 D
S
N
633 1714 M
633 1726 D
S
N
633 1738 M
633 1750 D
S
N
633 1762 M
633 1774 D
S
N
633 1787 M
633 1799 D
S
N
633 1811 M
633 1823 D
S
N
633 1835 M
633 1847 D
S
N
633 1859 M
633 1871 D
S
N
637 1879 M
649 1879 D
S
N
658 1883 M
658 1895 D
S
N
658 1907 M
658 1919 D
S
N
658 1931 M
658 1943 D
S
N
658 1955 M
658 1967 D
S
N
658 1979 M
658 1991 D
S
N
658 2004 M
658 2016 D
S
N
666 2020 M
679 2020 D
S
N
684 2027 M
684 2039 D
S
N
684 2051 M
684 2063 D
S
N
684 2075 M
684 2078 D
693 2078 D
S
N
705 2078 M
709 2078 D
709 2086 D
S
N
709 2099 M
709 2111 D
S
N
709 2122 M
721 2122 D
S
N
733 2122 M
734 2122 D
734 2134 D
S
N
734 2146 M
734 2158 D
S
N
742 2162 M
754 2162 D
S
N
759 2169 M
759 2181 D
S
N
759 2194 M
759 2196 D
769 2196 D
S
N
781 2196 M
784 2196 D
784 2201 D
788 2201 D
S
N
800 2201 M
809 2201 D
809 2199 D
S
N
820 2197 M
832 2197 D
S
N
840 2193 M
852 2193 D
S
N
862 2190 M
874 2190 D
S
N
885 2190 M
885 2177 D
S
N
885 2165 M
885 2163 D
895 2163 D
S
N
907 2163 M
910 2163 D
910 2154 D
S
N
914 2146 M
926 2146 D
S
N
935 2143 M
935 2131 D
S
N
947 2131 M
959 2131 D
S
N
960 2120 M
960 2116 D
969 2116 D
S
N
981 2116 M
986 2116 D
986 2109 D
S
N
990 2100 M
1002 2100 D
S
N
1011 2097 M
1011 2089 D
1014 2089 D
S
N
1027 2089 M
1036 2089 D
1036 2086 D
S
N
1036 2074 M
1036 2073 D
1047 2073 D
S
N
1059 2073 M
1061 2073 D
1061 2063 D
S
N
1068 2058 M
1080 2058 D
S
N
1086 2052 M
1086 2042 D
1088 2042 D
S
N
1101 2042 M
1111 2042 D
1111 2041 D
S
N
1112 2029 M
1124 2029 D
S
N
1136 2029 M
1137 2029 D
1137 2017 D
S
N
1147 2016 M
1159 2016 D
S
N
1162 2006 M
1162 2001 D
1168 2001 D
S
N
1181 2001 M
1187 2001 D
1187 1995 D
S
N
1190 1986 M
1203 1986 D
S
N
1212 1984 M
1212 1972 D
S
N
1221 1968 M
1233 1968 D
S
N
1237 1961 M
1237 1955 D
1244 1955 D
S
N
1256 1955 M
1262 1955 D
1262 1949 D
S
N
1264 1939 M
1276 1939 D
S
N
1288 1938 M
1288 1926 D
S
N
1296 1922 M
1308 1922 D
S
N
1313 1915 M
1313 1911 D
1321 1911 D
S
N
1333 1911 M
1338 1911 D
1338 1904 D
S
N
1342 1896 M
1355 1896 D
S
N
1363 1893 M
1363 1883 D
1365 1883 D
S
N
1377 1883 M
1388 1883 D
1388 1882 D
S
N
1390 1871 M
1402 1871 D
S
N
1413 1870 M
1413 1858 D
S
N
1423 1856 M
1435 1856 D
S
N
1439 1847 M
1439 1842 D
1446 1842 D
S
N
1458 1842 M
1464 1842 D
1464 1836 D
S
N
1467 1827 M
1479 1827 D
S
N
1489 1825 M
1489 1817 D
1493 1817 D
S
N
1505 1817 M
1514 1817 D
1514 1814 D
S
N
1516 1803 M
1528 1803 D
S
N
1539 1802 M
1539 1790 D
S
N
1548 1787 M
1560 1787 D
S
N
1564 1779 M
1564 1775 D
1573 1775 D
S
N
1585 1775 M
1590 1775 D
1590 1768 D
S
N
1600 1767 M
1612 1767 D
S
N
1615 1757 M
1615 1749 D
1619 1749 D
S
N
1631 1749 M
1640 1749 D
1640 1746 D
S
N
1646 1739 M
1658 1739 D
S
N
1665 1734 M
1665 1725 D
1668 1725 D
S
N
1680 1725 M
1690 1725 D
1690 1723 D
S
N
1694 1715 M
1706 1715 D
S
N
1715 1712 M
1715 1702 D
1717 1702 D
S
N
1729 1702 M
1741 1702 D
1741 1701 D
S
N
1741 1689 M
1741 1686 D
1750 1686 D
S
N
1762 1686 M
1766 1686 D
1766 1678 D
S
N
1767 1666 M
1779 1666 D
S
N
1791 1666 M
1791 1666 D
1791 1662 D
1799 1662 D
S
N
1811 1662 M
1816 1662 D
1816 1656 D
1817 1656 D
S
N
1829 1656 M
1841 1656 D
S
N
1843 1646 M
1855 1646 D
S
N
1866 1645 M
1866 1634 D
1867 1634 D
S
N
1879 1634 M
1892 1634 D
1892 1634 D
S
N
1892 1622 M
1892 1612 D
1894 1612 D
S
N
1906 1612 M
1917 1612 D
1917 1611 D
S
N
1926 1608 M
1938 1608 D
S
N
1943 1600 M
1955 1600 D
S
N
1967 1600 M
1967 1600 D
S
3 Sw
0 0 0 setrgbcolor
N
833 1477 M
833 1476 D
832 1476 D
832 1477 D
833 1478 D
836 1480 D
841 1480 D
844 1478 D
845 1477 D
847 1474 D
847 1465 D
848 1462 D
849 1461 D
S
N
845 1477 M
845 1465 D
847 1462 D
849 1461 D
851 1461 D
S
N
845 1474 M
844 1473 D
836 1472 D
832 1470 D
830 1467 D
830 1465 D
832 1462 D
836 1461 D
840 1461 D
843 1462 D
845 1465 D
S
N
836 1472 M
833 1470 D
832 1467 D
832 1465 D
833 1462 D
836 1461 D
S
N
860 1489 M
860 1461 D
S
N
862 1489 M
870 1465 D
S
N
860 1489 M
870 1461 D
S
N
879 1489 M
870 1461 D
S
N
879 1489 M
879 1461 D
S
N
881 1489 M
881 1461 D
S
N
856 1489 M
862 1489 D
S
N
879 1489 M
885 1489 D
S
N
856 1461 M
864 1461 D
S
N
875 1461 M
885 1461 D
S
N
911 1485 M
912 1481 D
912 1489 D
911 1485 D
908 1488 D
904 1489 D
901 1489 D
897 1488 D
895 1485 D
893 1482 D
892 1478 D
892 1472 D
893 1467 D
895 1465 D
897 1462 D
901 1461 D
904 1461 D
908 1462 D
911 1465 D
912 1467 D
S
N
901 1489 M
899 1488 D
896 1485 D
895 1482 D
893 1478 D
893 1472 D
895 1467 D
896 1465 D
899 1462 D
901 1461 D
S
N
941 1478 M
940 1481 D
937 1482 D
933 1482 D
930 1481 D
929 1480 D
927 1476 D
927 1472 D
929 1469 D
931 1467 D
936 1467 D
938 1469 D
940 1472 D
S
N
933 1482 M
930 1480 D
929 1476 D
929 1472 D
930 1469 D
931 1467 D
S
N
941 1482 M
940 1472 D
940 1469 D
942 1467 D
945 1467 D
948 1470 D
949 1474 D
949 1477 D
948 1481 D
947 1484 D
944 1487 D
941 1488 D
937 1489 D
933 1489 D
929 1488 D
926 1487 D
923 1484 D
922 1481 D
921 1477 D
921 1473 D
922 1469 D
923 1466 D
926 1463 D
929 1462 D
933 1461 D
937 1461 D
941 1462 D
944 1463 D
945 1465 D
S
N
942 1482 M
941 1472 D
941 1469 D
942 1467 D
S
N
960 1489 M
960 1461 D
S
N
962 1489 M
978 1463 D
S
N
962 1487 M
978 1461 D
S
N
978 1489 M
978 1461 D
S
N
956 1489 M
962 1489 D
S
N
974 1489 M
982 1489 D
S
N
956 1461 M
964 1461 D
S
N
992 1489 M
992 1461 D
S
N
993 1489 M
993 1461 D
S
N
988 1489 M
997 1489 D
S
N
988 1461 M
1008 1461 D
1008 1469 D
1007 1461 D
S
N
1023 1489 M
1019 1488 D
1016 1485 D
1015 1482 D
1014 1477 D
1014 1473 D
1015 1467 D
1016 1465 D
1019 1462 D
1023 1461 D
1026 1461 D
1030 1462 D
1033 1465 D
1034 1467 D
1035 1473 D
1035 1477 D
1034 1482 D
1033 1485 D
1030 1488 D
1026 1489 D
1023 1489 D
S
N
1023 1489 M
1020 1488 D
1018 1485 D
1016 1482 D
1015 1477 D
1015 1473 D
1016 1467 D
1018 1465 D
1020 1462 D
1023 1461 D
S
N
1026 1461 M
1029 1462 D
1031 1465 D
1033 1467 D
1034 1473 D
1034 1477 D
1033 1482 D
1031 1485 D
1029 1488 D
1026 1489 D
S
N
1046 1480 M
1045 1478 D
1046 1477 D
1048 1478 D
1046 1480 D
S
N
1046 1463 M
1045 1462 D
1046 1461 D
1048 1462 D
1046 1463 D
S
N
1093 1477 M
1094 1480 D
1094 1474 D
1093 1477 D
1092 1478 D
1089 1480 D
1083 1480 D
1081 1478 D
1079 1477 D
1079 1474 D
1081 1473 D
1083 1472 D
1090 1469 D
1093 1467 D
1094 1466 D
S
N
1079 1476 M
1081 1474 D
1083 1473 D
1090 1470 D
1093 1469 D
1094 1467 D
1094 1463 D
1093 1462 D
1090 1461 D
1085 1461 D
1082 1462 D
1081 1463 D
1079 1466 D
1079 1461 D
1081 1463 D
S
N
1119 1476 M
1118 1474 D
1119 1473 D
1120 1474 D
1120 1476 D
1118 1478 D
1115 1480 D
1111 1480 D
1107 1478 D
1104 1476 D
1103 1472 D
1103 1469 D
1104 1465 D
1107 1462 D
1111 1461 D
1114 1461 D
1118 1462 D
1120 1465 D
S
N
1111 1480 M
1108 1478 D
1105 1476 D
1104 1472 D
1104 1469 D
1105 1465 D
1108 1462 D
1111 1461 D
S
N
1131 1477 M
1131 1476 D
1130 1476 D
1130 1477 D
1131 1478 D
1134 1480 D
1140 1480 D
1142 1478 D
1144 1477 D
1145 1474 D
1145 1465 D
1146 1462 D
1148 1461 D
S
N
1144 1477 M
1144 1465 D
1145 1462 D
1148 1461 D
1149 1461 D
S
N
1144 1474 M
1142 1473 D
1134 1472 D
1130 1470 D
1129 1467 D
1129 1465 D
1130 1462 D
1134 1461 D
1138 1461 D
1141 1462 D
1144 1465 D
S
N
1134 1472 M
1131 1470 D
1130 1467 D
1130 1465 D
1131 1462 D
1134 1461 D
S
N
1159 1489 M
1159 1461 D
S
N
1160 1489 M
1160 1461 D
S
N
1155 1489 M
1160 1489 D
S
N
1155 1461 M
1164 1461 D
S
N
1172 1472 M
1189 1472 D
1189 1474 D
1187 1477 D
1186 1478 D
1183 1480 D
1179 1480 D
1175 1478 D
1172 1476 D
1171 1472 D
1171 1469 D
1172 1465 D
1175 1462 D
1179 1461 D
1182 1461 D
1186 1462 D
1189 1465 D
S
N
1187 1472 M
1187 1476 D
1186 1478 D
S
N
1179 1480 M
1176 1478 D
1174 1476 D
1172 1472 D
1172 1469 D
1174 1465 D
1176 1462 D
1179 1461 D
S
N
1222 1480 M
1222 1465 D
1223 1462 D
1227 1461 D
1230 1461 D
1234 1462 D
1237 1465 D
S
N
1223 1480 M
1223 1465 D
1224 1462 D
1227 1461 D
S
N
1237 1480 M
1237 1461 D
S
N
1238 1480 M
1238 1461 D
S
N
1218 1480 M
1223 1480 D
S
N
1233 1480 M
1238 1480 D
S
N
1237 1461 M
1242 1461 D
S
N
1252 1480 M
1252 1461 D
S
N
1253 1480 M
1253 1461 D
S
N
1253 1476 M
1256 1478 D
1260 1480 D
1263 1480 D
1267 1478 D
1268 1476 D
1268 1461 D
S
N
1263 1480 M
1265 1478 D
1267 1476 D
1267 1461 D
S
N
1248 1480 M
1253 1480 D
S
N
1248 1461 M
1257 1461 D
S
N
1263 1461 M
1272 1461 D
S
N
1296 1476 M
1294 1474 D
1296 1473 D
1297 1474 D
1297 1476 D
1294 1478 D
1291 1480 D
1287 1480 D
1283 1478 D
1281 1476 D
1279 1472 D
1279 1469 D
1281 1465 D
1283 1462 D
1287 1461 D
1290 1461 D
1294 1462 D
1297 1465 D
S
N
1287 1480 M
1285 1478 D
1282 1476 D
1281 1472 D
1281 1469 D
1282 1465 D
1285 1462 D
1287 1461 D
S
N
1308 1463 M
1307 1462 D
1308 1461 D
1309 1462 D
1308 1463 D
S
N
833 1304 M
833 1303 D
832 1303 D
832 1304 D
833 1305 D
836 1307 D
841 1307 D
844 1305 D
845 1304 D
847 1301 D
847 1292 D
848 1289 D
849 1288 D
S
N
845 1304 M
845 1292 D
847 1289 D
849 1288 D
851 1288 D
S
N
845 1301 M
844 1300 D
836 1299 D
832 1297 D
830 1294 D
830 1292 D
832 1289 D
836 1288 D
840 1288 D
843 1289 D
845 1292 D
S
N
836 1299 M
833 1297 D
832 1294 D
832 1292 D
833 1289 D
836 1288 D
S
N
860 1316 M
860 1288 D
S
N
862 1316 M
870 1292 D
S
N
860 1316 M
870 1288 D
S
N
879 1316 M
870 1288 D
S
N
879 1316 M
879 1288 D
S
N
881 1316 M
881 1288 D
S
N
856 1316 M
862 1316 D
S
N
879 1316 M
885 1316 D
S
N
856 1288 M
864 1288 D
S
N
875 1288 M
885 1288 D
S
N
911 1312 M
912 1308 D
912 1316 D
911 1312 D
908 1315 D
904 1316 D
901 1316 D
897 1315 D
895 1312 D
893 1309 D
892 1305 D
892 1299 D
893 1294 D
895 1292 D
897 1289 D
901 1288 D
904 1288 D
908 1289 D
911 1292 D
912 1294 D
S
N
901 1316 M
899 1315 D
896 1312 D
895 1309 D
893 1305 D
893 1299 D
895 1294 D
896 1292 D
899 1289 D
901 1288 D
S
N
941 1305 M
940 1308 D
937 1309 D
933 1309 D
930 1308 D
929 1307 D
927 1303 D
927 1299 D
929 1296 D
931 1294 D
936 1294 D
938 1296 D
940 1299 D
S
N
933 1309 M
930 1307 D
929 1303 D
929 1299 D
930 1296 D
931 1294 D
S
N
941 1309 M
940 1299 D
940 1296 D
942 1294 D
945 1294 D
948 1297 D
949 1301 D
949 1304 D
948 1308 D
947 1311 D
944 1314 D
941 1315 D
937 1316 D
933 1316 D
929 1315 D
926 1314 D
923 1311 D
922 1308 D
921 1304 D
921 1300 D
922 1296 D
923 1293 D
926 1290 D
929 1289 D
933 1288 D
937 1288 D
941 1289 D
944 1290 D
945 1292 D
S
N
942 1309 M
941 1299 D
941 1296 D
942 1294 D
S
N
960 1316 M
960 1288 D
S
N
962 1316 M
978 1290 D
S
N
962 1314 M
978 1288 D
S
N
978 1316 M
978 1288 D
S
N
956 1316 M
962 1316 D
S
N
974 1316 M
982 1316 D
S
N
956 1288 M
964 1288 D
S
N
992 1316 M
992 1288 D
S
N
993 1316 M
993 1288 D
S
N
988 1316 M
997 1316 D
S
N
988 1288 M
1008 1288 D
1008 1296 D
1007 1288 D
S
N
1023 1316 M
1019 1315 D
1016 1312 D
1015 1309 D
1014 1304 D
1014 1300 D
1015 1294 D
1016 1292 D
1019 1289 D
1023 1288 D
1026 1288 D
1030 1289 D
1033 1292 D
1034 1294 D
1035 1300 D
1035 1304 D
1034 1309 D
1033 1312 D
1030 1315 D
1026 1316 D
1023 1316 D
S
N
1023 1316 M
1020 1315 D
1018 1312 D
1016 1309 D
1015 1304 D
1015 1300 D
1016 1294 D
1018 1292 D
1020 1289 D
1023 1288 D
S
N
1026 1288 M
1029 1289 D
1031 1292 D
1033 1294 D
1034 1300 D
1034 1304 D
1033 1309 D
1031 1312 D
1029 1315 D
1026 1316 D
S
N
1046 1307 M
1045 1305 D
1046 1304 D
1048 1305 D
1046 1307 D
S
N
1046 1290 M
1045 1289 D
1046 1288 D
1048 1289 D
1046 1290 D
S
N
1082 1307 M
1082 1278 D
S
N
1083 1307 M
1083 1278 D
S
N
1083 1303 M
1086 1305 D
1089 1307 D
1092 1307 D
1096 1305 D
1098 1303 D
1100 1299 D
1100 1296 D
1098 1292 D
1096 1289 D
1092 1288 D
1089 1288 D
1086 1289 D
1083 1292 D
S
N
1092 1307 M
1094 1305 D
1097 1303 D
1098 1299 D
1098 1296 D
1097 1292 D
1094 1289 D
1092 1288 D
S
N
1078 1307 M
1083 1307 D
S
N
1078 1278 M
1088 1278 D
S
N
1124 1316 M
1124 1288 D
S
N
1126 1316 M
1126 1288 D
S
N
1124 1303 M
1122 1305 D
1119 1307 D
1116 1307 D
1112 1305 D
1109 1303 D
1108 1299 D
1108 1296 D
1109 1292 D
1112 1289 D
1116 1288 D
1119 1288 D
1122 1289 D
1124 1292 D
S
N
1116 1307 M
1114 1305 D
1111 1303 D
1109 1299 D
1109 1296 D
1111 1292 D
1114 1289 D
1116 1288 D
S
N
1120 1316 M
1126 1316 D
S
N
1124 1288 M
1130 1288 D
S
N
1146 1315 M
1145 1314 D
1146 1312 D
1148 1314 D
1148 1315 D
1146 1316 D
1144 1316 D
1141 1315 D
1140 1312 D
1140 1288 D
S
N
1144 1316 M
1142 1315 D
1141 1312 D
1141 1288 D
S
N
1135 1307 M
1146 1307 D
S
N
1135 1288 M
1145 1288 D
S
N
1179 1307 M
1179 1292 D
1181 1289 D
1185 1288 D
1187 1288 D
1192 1289 D
1194 1292 D
S
N
1181 1307 M
1181 1292 D
1182 1289 D
1185 1288 D
S
N
1194 1307 M
1194 1288 D
S
N
1196 1307 M
1196 1288 D
S
N
1175 1307 M
1181 1307 D
S
N
1190 1307 M
1196 1307 D
S
N
1194 1288 M
1200 1288 D
S
N
1209 1307 M
1209 1288 D
S
N
1211 1307 M
1211 1288 D
S
N
1211 1303 M
1213 1305 D
1218 1307 D
1220 1307 D
1224 1305 D
1226 1303 D
1226 1288 D
S
N
1220 1307 M
1223 1305 D
1224 1303 D
1224 1288 D
S
N
1205 1307 M
1211 1307 D
S
N
1205 1288 M
1215 1288 D
S
N
1220 1288 M
1230 1288 D
S
N
1253 1303 M
1252 1301 D
1253 1300 D
1254 1301 D
1254 1303 D
1252 1305 D
1249 1307 D
1245 1307 D
1241 1305 D
1238 1303 D
1237 1299 D
1237 1296 D
1238 1292 D
1241 1289 D
1245 1288 D
1248 1288 D
1252 1289 D
1254 1292 D
S
N
1245 1307 M
1242 1305 D
1239 1303 D
1238 1299 D
1238 1296 D
1239 1292 D
1242 1289 D
1245 1288 D
S
N
1265 1290 M
1264 1289 D
1265 1288 D
1267 1289 D
1265 1290 D
S
4 Sw
N
583 1520 M
583 1261 D
S
N
583 1261 M
1967 1261 D
S
N
1967 1261 M
1967 1520 D
S
N
1967 1520 M
583 1520 D
S
N
583 1261 M
1967 1261 D
S
N
583 1261 M
583 1276 D
S
N
633 1266 M
633 1261 D
S
N
684 1261 M
684 1266 D
S
N
734 1266 M
734 1261 D
S
N
784 1261 M
784 1266 D
S
N
835 1276 M
835 1261 D
S
N
885 1261 M
885 1266 D
S
N
935 1266 M
935 1261 D
S
N
986 1261 M
986 1266 D
S
N
1036 1266 M
1036 1261 D
S
N
1086 1261 M
1086 1276 D
S
N
1137 1266 M
1137 1261 D
S
N
1187 1261 M
1187 1266 D
S
N
1237 1266 M
1237 1261 D
S
N
1288 1261 M
1288 1266 D
S
N
1338 1276 M
1338 1261 D
S
N
1388 1261 M
1388 1266 D
S
N
1439 1266 M
1439 1261 D
S
N
1489 1261 M
1489 1266 D
S
N
1539 1266 M
1539 1261 D
S
N
1590 1261 M
1590 1276 D
S
N
1640 1266 M
1640 1261 D
S
N
1690 1261 M
1690 1266 D
S
N
1741 1266 M
1741 1261 D
S
N
1791 1261 M
1791 1266 D
S
N
1841 1276 M
1841 1261 D
S
N
1892 1261 M
1892 1266 D
S
N
1942 1266 M
1942 1261 D
S
N
583 1520 M
1967 1520 D
S
N
583 1505 M
583 1520 D
S
N
633 1520 M
633 1515 D
S
N
684 1515 M
684 1520 D
S
N
734 1520 M
734 1515 D
S
N
784 1515 M
784 1520 D
S
N
835 1520 M
835 1505 D
S
N
885 1515 M
885 1520 D
S
N
935 1520 M
935 1515 D
S
N
986 1515 M
986 1520 D
S
N
1036 1520 M
1036 1515 D
S
N
1086 1505 M
1086 1520 D
S
N
1137 1520 M
1137 1515 D
S
N
1187 1515 M
1187 1520 D
S
N
1237 1520 M
1237 1515 D
S
N
1288 1515 M
1288 1520 D
S
N
1338 1520 M
1338 1505 D
S
N
1388 1515 M
1388 1520 D
S
N
1439 1520 M
1439 1515 D
S
N
1489 1515 M
1489 1520 D
S
N
1539 1520 M
1539 1515 D
S
N
1590 1505 M
1590 1520 D
S
N
1640 1520 M
1640 1515 D
S
N
1690 1515 M
1690 1520 D
S
N
1741 1520 M
1741 1515 D
S
N
1791 1515 M
1791 1520 D
S
N
1841 1520 M
1841 1505 D
S
N
1892 1515 M
1892 1520 D
S
N
1942 1520 M
1942 1515 D
S
N
583 1261 M
583 1520 D
S
N
583 1261 M
588 1261 D
S
N
588 1273 M
583 1273 D
S
N
583 1285 M
599 1285 D
S
N
588 1297 M
583 1297 D
S
N
583 1309 M
588 1309 D
S
N
588 1321 M
583 1321 D
S
N
583 1333 M
588 1333 D
S
N
599 1345 M
583 1345 D
S
N
583 1357 M
588 1357 D
S
N
588 1369 M
583 1369 D
S
N
583 1381 M
588 1381 D
S
N
588 1394 M
583 1394 D
S
N
583 1406 M
599 1406 D
S
N
588 1418 M
583 1418 D
S
N
583 1430 M
588 1430 D
S
N
588 1442 M
583 1442 D
S
N
583 1454 M
588 1454 D
S
N
599 1466 M
583 1466 D
S
N
583 1478 M
588 1478 D
S
N
588 1490 M
583 1490 D
S
N
583 1502 M
588 1502 D
S
N
588 1514 M
583 1514 D
S
N
503 1298 M
498 1297 D
495 1292 D
494 1285 D
494 1280 D
495 1273 D
498 1268 D
503 1267 D
506 1267 D
510 1268 D
513 1273 D
515 1280 D
515 1285 D
513 1292 D
510 1297 D
506 1298 D
503 1298 D
S
N
503 1298 M
500 1297 D
498 1295 D
497 1292 D
495 1285 D
495 1280 D
497 1273 D
498 1270 D
500 1268 D
503 1267 D
S
N
506 1267 M
509 1268 D
510 1270 D
512 1273 D
513 1280 D
513 1285 D
512 1292 D
510 1295 D
509 1297 D
506 1298 D
S
N
527 1270 M
525 1268 D
527 1267 D
528 1268 D
527 1270 D
S
N
547 1298 M
542 1297 D
541 1294 D
541 1289 D
542 1286 D
547 1285 D
553 1285 D
557 1286 D
559 1289 D
559 1294 D
557 1297 D
553 1298 D
547 1298 D
S
N
547 1298 M
544 1297 D
542 1294 D
542 1289 D
544 1286 D
547 1285 D
S
N
553 1285 M
556 1286 D
557 1289 D
557 1294 D
556 1297 D
553 1298 D
S
N
547 1285 M
542 1283 D
541 1282 D
539 1279 D
539 1273 D
541 1270 D
542 1268 D
547 1267 D
553 1267 D
557 1268 D
559 1270 D
560 1273 D
560 1279 D
559 1282 D
557 1283 D
553 1285 D
S
N
547 1285 M
544 1283 D
542 1282 D
541 1279 D
541 1273 D
542 1270 D
544 1268 D
547 1267 D
S
N
553 1267 M
556 1268 D
557 1270 D
559 1273 D
559 1279 D
557 1282 D
556 1283 D
553 1285 D
S
N
503 1359 M
498 1357 D
495 1353 D
494 1345 D
494 1341 D
495 1333 D
498 1329 D
503 1327 D
506 1327 D
510 1329 D
513 1333 D
515 1341 D
515 1345 D
513 1353 D
510 1357 D
506 1359 D
503 1359 D
S
N
503 1359 M
500 1357 D
498 1356 D
497 1353 D
495 1345 D
495 1341 D
497 1333 D
498 1330 D
500 1329 D
503 1327 D
S
N
506 1327 M
509 1329 D
510 1330 D
512 1333 D
513 1341 D
513 1345 D
512 1353 D
510 1356 D
509 1357 D
506 1359 D
S
N
527 1330 M
525 1329 D
527 1327 D
528 1329 D
527 1330 D
S
N
559 1348 M
557 1344 D
554 1341 D
550 1339 D
548 1339 D
544 1341 D
541 1344 D
539 1348 D
539 1350 D
541 1354 D
544 1357 D
548 1359 D
551 1359 D
556 1357 D
559 1354 D
560 1350 D
560 1341 D
559 1335 D
557 1332 D
554 1329 D
550 1327 D
545 1327 D
542 1329 D
541 1332 D
541 1333 D
542 1335 D
544 1333 D
542 1332 D
S
N
548 1339 M
545 1341 D
542 1344 D
541 1348 D
541 1350 D
542 1354 D
545 1357 D
548 1359 D
S
N
551 1359 M
554 1357 D
557 1354 D
559 1350 D
559 1341 D
557 1335 D
556 1332 D
553 1329 D
550 1327 D
S
N
498 1413 M
501 1415 D
506 1419 D
506 1387 D
S
N
504 1418 M
504 1387 D
S
N
498 1387 M
512 1387 D
S
N
527 1390 M
525 1389 D
527 1387 D
528 1389 D
527 1390 D
S
N
548 1419 M
544 1418 D
541 1413 D
539 1406 D
539 1401 D
541 1394 D
544 1389 D
548 1387 D
551 1387 D
556 1389 D
559 1394 D
560 1401 D
560 1406 D
559 1413 D
556 1418 D
551 1419 D
548 1419 D
S
N
548 1419 M
545 1418 D
544 1416 D
542 1413 D
541 1406 D
541 1401 D
542 1394 D
544 1390 D
545 1389 D
548 1387 D
S
N
551 1387 M
554 1389 D
556 1390 D
557 1394 D
559 1401 D
559 1406 D
557 1413 D
556 1416 D
554 1418 D
551 1419 D
S
N
498 1473 M
501 1475 D
506 1480 D
506 1448 D
S
N
504 1478 M
504 1448 D
S
N
498 1448 M
512 1448 D
S
N
527 1451 M
525 1449 D
527 1448 D
528 1449 D
527 1451 D
S
N
544 1473 M
547 1475 D
551 1480 D
551 1448 D
S
N
550 1478 M
550 1448 D
S
N
544 1448 M
557 1448 D
S
N
1967 1261 M
1967 1520 D
S
N
1962 1261 M
1967 1261 D
S
N
1967 1273 M
1962 1273 D
S
N
1951 1285 M
1967 1285 D
S
N
1967 1297 M
1962 1297 D
S
N
1962 1309 M
1967 1309 D
S
N
1967 1321 M
1962 1321 D
S
N
1962 1333 M
1967 1333 D
S
N
1967 1345 M
1951 1345 D
S
N
1962 1357 M
1967 1357 D
S
N
1967 1369 M
1962 1369 D
S
N
1962 1381 M
1967 1381 D
S
N
1967 1394 M
1962 1394 D
S
N
1951 1406 M
1967 1406 D
S
N
1967 1418 M
1962 1418 D
S
N
1962 1430 M
1967 1430 D
S
N
1967 1442 M
1962 1442 D
S
N
1962 1454 M
1967 1454 D
S
N
1967 1466 M
1951 1466 D
S
N
1962 1478 M
1967 1478 D
S
N
1967 1490 M
1962 1490 D
S
N
1962 1502 M
1967 1502 D
S
N
1967 1514 M
1962 1514 D
S
N
608 1261 M
608 1432 D
633 1432 D
633 1435 D
658 1435 D
658 1435 D
684 1435 D
684 1436 D
709 1436 D
709 1436 D
734 1436 D
734 1436 D
759 1436 D
759 1436 D
784 1436 D
784 1437 D
809 1437 D
809 1436 D
835 1436 D
835 1437 D
860 1437 D
860 1437 D
885 1437 D
885 1437 D
910 1437 D
910 1437 D
935 1437 D
935 1438 D
960 1438 D
960 1438 D
986 1438 D
986 1438 D
1011 1438 D
1011 1439 D
1036 1439 D
1036 1439 D
1061 1439 D
1061 1440 D
1086 1440 D
1086 1440 D
1111 1440 D
1111 1441 D
1137 1441 D
1137 1441 D
1162 1441 D
1162 1441 D
1187 1441 D
1187 1441 D
1212 1441 D
1212 1442 D
1237 1442 D
1237 1443 D
1262 1443 D
1262 1443 D
1288 1443 D
1288 1443 D
1313 1443 D
S
N
1313 1443 M
1313 1444 D
1338 1444 D
1338 1444 D
1363 1444 D
1363 1445 D
1388 1445 D
1388 1444 D
1413 1444 D
1413 1446 D
1439 1446 D
1439 1446 D
1464 1446 D
1464 1447 D
1489 1447 D
1489 1447 D
1514 1447 D
1514 1447 D
1539 1447 D
1539 1448 D
1564 1448 D
1564 1447 D
1590 1447 D
1590 1448 D
1615 1448 D
1615 1449 D
1640 1449 D
1640 1449 D
1665 1449 D
1665 1450 D
1690 1450 D
1690 1449 D
1715 1449 D
1715 1450 D
1741 1450 D
1741 1450 D
1766 1450 D
1766 1451 D
1791 1451 D
1791 1451 D
1816 1451 D
1816 1452 D
1841 1452 D
1841 1452 D
1866 1452 D
1866 1452 D
1892 1452 D
1892 1451 D
1917 1451 D
1917 1453 D
1942 1453 D
1942 1454 D
1967 1454 D
S
N
608 1261 M
608 1375 D
633 1375 D
633 1371 D
658 1371 D
658 1371 D
684 1371 D
684 1371 D
709 1371 D
709 1370 D
734 1370 D
734 1370 D
759 1370 D
759 1371 D
784 1371 D
784 1370 D
809 1370 D
809 1370 D
835 1370 D
835 1370 D
860 1370 D
860 1370 D
885 1370 D
885 1369 D
910 1369 D
910 1369 D
935 1369 D
935 1369 D
960 1369 D
960 1368 D
986 1368 D
986 1368 D
1011 1368 D
1011 1368 D
1036 1368 D
1036 1367 D
1061 1367 D
1061 1367 D
1086 1367 D
1086 1367 D
1111 1367 D
1111 1366 D
1137 1366 D
1137 1366 D
1162 1366 D
1162 1365 D
1187 1365 D
1187 1365 D
1212 1365 D
1212 1365 D
1237 1365 D
1237 1364 D
1262 1364 D
1262 1364 D
1288 1364 D
1288 1363 D
1313 1363 D
1313 1363 D
1338 1363 D
1338 1363 D
1363 1363 D
1363 1362 D
1388 1362 D
1388 1362 D
1413 1362 D
1413 1361 D
1439 1361 D
1439 1361 D
1464 1361 D
1464 1360 D
1489 1360 D
1489 1360 D
1514 1360 D
1514 1360 D
1539 1360 D
1539 1359 D
1564 1359 D
1564 1360 D
1590 1360 D
1590 1360 D
1615 1360 D
1615 1358 D
1640 1358 D
1640 1359 D
1665 1359 D
1665 1357 D
1690 1357 D
1690 1358 D
1715 1358 D
1715 1357 D
1741 1357 D
1741 1357 D
1766 1357 D
1766 1357 D
1791 1357 D
1791 1356 D
1816 1356 D
1816 1356 D
1841 1356 D
1841 1356 D
1866 1356 D
1866 1356 D
1892 1356 D
1892 1357 D
1917 1357 D
1917 1355 D
1942 1355 D
1942 1353 D
1967 1353 D
S
N
721 1304 M
808 1304 D
S
0 0 1 setrgbcolor
N
608 1261 M
608 1273 D
S
N
608 1285 M
608 1297 D
S
N
608 1309 M
608 1321 D
S
N
608 1333 M
608 1346 D
S
N
608 1358 M
608 1370 D
S
N
608 1382 M
608 1394 D
S
N
608 1406 M
608 1418 D
S
N
616 1423 M
628 1423 D
S
N
633 1429 M
633 1441 D
S
N
633 1454 M
633 1458 D
641 1458 D
S
N
653 1458 M
658 1458 D
658 1452 D
S
N
669 1450 M
681 1450 D
S
N
687 1456 M
699 1456 D
S
N
709 1454 M
709 1449 D
716 1449 D
S
N
728 1449 M
734 1449 D
734 1446 D
738 1446 D
S
N
750 1446 M
759 1446 D
759 1448 D
760 1448 D
S
N
772 1448 M
784 1448 D
S
N
793 1452 M
805 1452 D
S
N
816 1453 M
828 1453 D
S
N
838 1450 M
850 1450 D
S
N
860 1453 M
860 1454 D
870 1454 D
S
N
882 1454 M
885 1454 D
885 1450 D
890 1450 D
S
N
902 1450 M
910 1450 D
910 1454 D
S
N
918 1458 M
930 1458 D
S
N
941 1457 M
953 1457 D
S
N
963 1455 M
975 1455 D
S
N
986 1456 M
998 1456 D
S
N
1011 1456 M
1011 1456 D
1011 1457 D
1022 1457 D
S
N
1034 1457 M
1036 1457 D
1036 1462 D
1041 1462 D
S
N
1053 1462 M
1061 1462 D
1061 1462 D
1065 1462 D
S
N
1077 1462 M
1086 1462 D
1086 1465 D
1086 1465 D
S
N
1099 1465 M
1111 1465 D
S
N
1123 1465 M
1135 1465 D
S
N
1142 1460 M
1154 1460 D
S
N
1164 1462 M
1176 1462 D
S
N
1188 1463 M
1200 1463 D
S
N
1212 1463 M
1212 1463 D
1212 1465 D
1221 1465 D
S
N
1233 1465 M
1237 1465 D
1237 1461 D
1240 1461 D
S
N
1252 1461 M
1262 1461 D
1262 1463 D
S
N
1265 1472 M
1277 1472 D
S
N
1288 1471 M
1288 1463 D
1292 1463 D
S
N
1305 1463 M
1313 1463 D
1313 1466 D
1314 1466 D
S
N
1326 1466 M
1338 1466 D
1338 1466 D
S
N
1348 1464 M
1360 1464 D
S
N
1363 1473 M
1363 1474 D
1374 1474 D
S
N
1386 1474 M
1388 1474 D
1388 1467 D
1392 1467 D
S
N
1404 1467 M
1413 1467 D
1413 1469 D
1414 1469 D
S
N
1426 1469 M
1438 1469 D
S
N
1450 1469 M
1462 1469 D
S
N
1469 1474 M
1481 1474 D
S
N
1489 1479 M
1489 1480 D
1500 1480 D
S
N
1512 1480 M
1514 1480 D
1514 1487 D
1517 1487 D
S
N
1529 1487 M
1539 1487 D
1539 1485 D
S
N
1539 1473 M
1539 1467 D
1546 1467 D
S
N
1558 1467 M
1564 1467 D
1564 1473 D
S
N
1573 1476 M
1586 1476 D
S
N
1598 1476 M
1610 1476 D
S
N
1619 1474 M
1631 1474 D
S
N
1640 1477 M
1640 1481 D
1648 1481 D
S
N
1660 1481 M
1665 1481 D
1665 1488 D
S
N
1670 1496 M
1682 1496 D
S
N
1690 1492 M
1690 1480 D
S
N
1690 1467 M
1690 1465 D
1700 1465 D
S
N
1712 1465 M
1715 1465 D
1715 1473 D
S
N
1717 1484 M
1729 1484 D
S
N
1741 1484 M
1741 1482 D
1751 1482 D
S
N
1763 1482 M
1766 1482 D
1766 1487 D
1771 1487 D
S
N
1783 1487 M
1791 1487 D
1791 1483 D
S
N
1800 1480 M
1812 1480 D
S
N
1816 1488 M
1816 1500 D
S
N
1820 1508 M
1832 1508 D
S
N
1842 1507 M
1855 1507 D
S
N
1866 1506 M
1866 1503 D
1875 1503 D
S
N
1887 1503 M
1892 1503 D
1892 1495 D
S
N
1896 1488 M
1908 1488 D
S
N
1917 1484 M
1917 1481 D
1926 1481 D
S
N
1938 1481 M
1942 1481 D
1942 1473 D
S
N
1954 1473 M
1966 1473 D
S
N
608 1261 M
608 1273 D
S
N
608 1285 M
608 1297 D
S
N
608 1309 M
608 1321 D
S
N
608 1333 M
608 1346 D
S
N
614 1352 M
626 1352 D
S
N
633 1346 M
633 1334 D
S
N
637 1326 M
649 1326 D
S
N
658 1329 M
658 1330 D
670 1330 D
S
N
682 1330 M
684 1330 D
684 1327 D
692 1327 D
S
N
704 1327 M
709 1327 D
709 1330 D
712 1330 D
S
N
725 1330 M
734 1330 D
734 1331 D
736 1331 D
S
N
748 1331 M
759 1331 D
759 1330 D
759 1330 D
S
N
771 1330 M
784 1330 D
S
N
794 1328 M
806 1328 D
S
N
818 1328 M
830 1328 D
S
N
841 1329 M
853 1329 D
S
N
864 1327 M
876 1327 D
S
N
886 1329 M
898 1329 D
S
N
910 1329 M
910 1325 D
919 1325 D
S
N
931 1325 M
935 1325 D
935 1326 D
942 1326 D
S
N
954 1326 M
960 1326 D
960 1326 D
966 1326 D
S
N
978 1326 M
986 1326 D
986 1326 D
990 1326 D
S
N
1002 1326 M
1011 1326 D
1011 1325 D
1013 1325 D
S
N
1025 1325 M
1036 1325 D
1036 1324 D
S
N
1047 1323 M
1059 1323 D
S
N
1071 1323 M
1084 1323 D
S
N
1094 1321 M
1106 1321 D
S
N
1118 1321 M
1130 1321 D
S
N
1141 1323 M
1153 1323 D
S
N
1164 1322 M
1176 1322 D
S
N
1188 1322 M
1200 1322 D
S
N
1212 1322 M
1212 1322 D
1212 1321 D
1223 1321 D
S
N
1235 1321 M
1237 1321 D
1237 1322 D
1245 1322 D
S
N
1257 1322 M
1262 1322 D
1262 1317 D
1264 1317 D
S
N
1276 1317 M
1288 1317 D
1288 1318 D
S
N
1296 1321 M
1308 1321 D
S
N
1318 1319 M
1330 1319 D
S
N
1341 1320 M
1353 1320 D
S
N
1363 1318 M
1363 1316 D
1373 1316 D
S
N
1385 1316 M
1388 1316 D
1388 1319 D
1395 1319 D
S
N
1407 1319 M
1413 1319 D
1413 1318 D
1418 1318 D
S
N
1431 1318 M
1439 1318 D
1439 1318 D
1443 1318 D
S
N
1455 1318 M
1464 1318 D
1464 1315 D
1464 1315 D
S
N
1476 1315 M
1488 1315 D
S
N
1498 1313 M
1511 1313 D
S
N
1519 1310 M
1531 1310 D
S
N
1539 1314 M
1539 1317 D
1548 1317 D
S
N
1560 1317 M
1564 1317 D
1564 1315 D
1570 1315 D
S
N
1582 1315 M
1590 1315 D
1590 1314 D
1593 1314 D
S
N
1605 1314 M
1615 1314 D
1615 1316 D
1615 1316 D
S
N
1627 1316 M
1639 1316 D
S
N
1646 1312 M
1658 1312 D
S
N
1665 1306 M
1665 1306 D
1677 1306 D
S
N
1689 1306 M
1690 1306 D
1690 1317 D
S
N
1701 1318 M
1713 1318 D
S
N
1717 1310 M
1729 1310 D
S
N
1741 1311 M
1741 1311 D
1752 1311 D
S
N
1765 1311 M
1766 1311 D
1766 1309 D
1774 1309 D
S
N
1786 1309 M
1791 1309 D
1791 1312 D
1795 1312 D
S
N
1808 1312 M
1816 1312 D
1816 1308 D
S
N
1820 1300 M
1832 1300 D
S
N
1844 1300 M
1856 1300 D
S
N
1866 1302 M
1866 1302 D
1878 1302 D
S
N
1890 1302 M
1892 1302 D
1892 1308 D
1897 1308 D
S
N
1909 1308 M
1917 1308 D
1917 1311 D
1919 1311 D
S
N
1931 1311 M
1942 1311 D
1942 1312 D
S
N
1951 1314 M
1964 1314 D
S
N
721 1477 M
734 1477 D
S
N
746 1477 M
758 1477 D
S
N
770 1477 M
782 1477 D
S
N
794 1477 M
806 1477 D
S
3 Sw
0 0 0 setrgbcolor
N
833 1230 M
833 1201 D
S
N
834 1230 M
834 1201 D
S
N
829 1230 M
845 1230 D
849 1228 D
851 1227 D
852 1224 D
852 1220 D
851 1217 D
849 1216 D
845 1215 D
834 1215 D
S
N
845 1230 M
848 1228 D
849 1227 D
851 1224 D
851 1220 D
849 1217 D
848 1216 D
845 1215 D
S
N
829 1201 M
838 1201 D
S
N
870 1230 M
866 1228 D
863 1226 D
862 1223 D
860 1217 D
860 1213 D
862 1208 D
863 1205 D
866 1202 D
870 1201 D
873 1201 D
877 1202 D
879 1205 D
881 1208 D
882 1213 D
882 1217 D
881 1223 D
879 1226 D
877 1228 D
873 1230 D
870 1230 D
S
N
870 1230 M
867 1228 D
864 1226 D
863 1223 D
862 1217 D
862 1213 D
863 1208 D
864 1205 D
867 1202 D
870 1201 D
S
N
873 1201 M
875 1202 D
878 1205 D
879 1208 D
881 1213 D
881 1217 D
879 1223 D
878 1226 D
875 1228 D
873 1230 D
S
N
892 1230 M
897 1201 D
S
N
893 1230 M
897 1208 D
S
N
903 1230 M
897 1201 D
S
N
903 1230 M
908 1201 D
S
N
904 1230 M
908 1208 D
S
N
914 1230 M
908 1201 D
S
N
888 1230 M
897 1230 D
S
N
910 1230 M
918 1230 D
S
N
926 1230 M
926 1201 D
S
N
927 1230 M
927 1201 D
S
N
944 1230 M
944 1201 D
S
N
945 1230 M
945 1201 D
S
N
922 1230 M
931 1230 D
S
N
940 1230 M
949 1230 D
S
N
927 1216 M
944 1216 D
S
N
922 1201 M
931 1201 D
S
N
940 1201 M
949 1201 D
S
N
959 1230 M
959 1201 D
S
N
960 1230 M
960 1201 D
S
N
968 1222 M
968 1211 D
S
N
955 1230 M
977 1230 D
977 1222 D
975 1230 D
S
N
960 1216 M
968 1216 D
S
N
955 1201 M
977 1201 D
977 1209 D
975 1201 D
S
N
988 1230 M
988 1201 D
S
N
989 1230 M
989 1201 D
S
N
983 1230 M
993 1230 D
S
N
983 1201 M
1004 1201 D
1004 1209 D
1003 1201 D
S
N
1012 1220 M
1011 1219 D
1012 1217 D
1014 1219 D
1012 1220 D
S
N
1012 1204 M
1011 1202 D
1012 1201 D
1014 1202 D
1012 1204 D
S
N
1048 1220 M
1048 1191 D
S
N
1049 1220 M
1049 1191 D
S
N
1049 1216 M
1052 1219 D
1055 1220 D
1057 1220 D
1061 1219 D
1064 1216 D
1066 1212 D
1066 1209 D
1064 1205 D
1061 1202 D
1057 1201 D
1055 1201 D
1052 1202 D
1049 1205 D
S
N
1057 1220 M
1060 1219 D
1063 1216 D
1064 1212 D
1064 1209 D
1063 1205 D
1060 1202 D
1057 1201 D
S
N
1044 1220 M
1049 1220 D
S
N
1044 1191 M
1053 1191 D
S
N
1075 1220 M
1083 1201 D
S
N
1077 1220 M
1083 1204 D
S
N
1092 1220 M
1083 1201 D
1081 1196 D
1078 1193 D
1075 1191 D
1074 1191 D
1072 1193 D
1074 1194 D
1075 1193 D
S
N
1072 1220 M
1081 1220 D
S
N
1086 1220 M
1094 1220 D
S
N
1103 1230 M
1103 1207 D
1104 1202 D
1107 1201 D
1109 1201 D
1112 1202 D
1114 1205 D
S
N
1104 1230 M
1104 1207 D
1105 1202 D
1107 1201 D
S
N
1098 1220 M
1109 1220 D
S
N
1123 1230 M
1123 1201 D
S
N
1124 1230 M
1124 1201 D
S
N
1124 1216 M
1127 1219 D
1131 1220 D
1134 1220 D
1138 1219 D
1140 1216 D
1140 1201 D
S
N
1134 1220 M
1137 1219 D
1138 1216 D
1138 1201 D
S
N
1119 1230 M
1124 1230 D
S
N
1119 1201 M
1129 1201 D
S
N
1134 1201 M
1144 1201 D
S
N
1153 1230 M
1152 1228 D
1153 1227 D
1155 1228 D
1153 1230 D
S
N
1153 1220 M
1153 1201 D
S
N
1155 1220 M
1155 1201 D
S
N
1149 1220 M
1155 1220 D
S
N
1149 1201 M
1159 1201 D
S
N
1168 1217 M
1168 1216 D
1167 1216 D
1167 1217 D
1168 1219 D
1171 1220 D
1176 1220 D
1179 1219 D
1181 1217 D
1182 1215 D
1182 1205 D
1183 1202 D
1185 1201 D
S
N
1181 1217 M
1181 1205 D
1182 1202 D
1185 1201 D
1186 1201 D
S
N
1181 1215 M
1179 1213 D
1171 1212 D
1167 1211 D
1166 1208 D
1166 1205 D
1167 1202 D
1171 1201 D
1175 1201 D
1178 1202 D
1181 1205 D
S
N
1171 1212 M
1168 1211 D
1167 1208 D
1167 1205 D
1168 1202 D
1171 1201 D
S
N
1216 1235 M
1192 1191 D
S
N
1226 1230 M
1226 1201 D
S
N
1227 1230 M
1227 1201 D
S
N
1227 1216 M
1230 1219 D
1234 1220 D
1237 1220 D
1241 1219 D
1242 1216 D
1242 1201 D
S
N
1237 1220 M
1239 1219 D
1241 1216 D
1241 1201 D
S
N
1222 1230 M
1227 1230 D
S
N
1222 1201 M
1231 1201 D
S
N
1237 1201 M
1246 1201 D
S
N
1254 1212 M
1271 1212 D
1271 1215 D
1270 1217 D
1268 1219 D
1265 1220 D
1261 1220 D
1257 1219 D
1254 1216 D
1253 1212 D
1253 1209 D
1254 1205 D
1257 1202 D
1261 1201 D
1264 1201 D
1268 1202 D
1271 1205 D
S
N
1270 1212 M
1270 1216 D
1268 1219 D
S
N
1261 1220 M
1259 1219 D
1256 1216 D
1254 1212 D
1254 1209 D
1256 1205 D
1259 1202 D
1261 1201 D
S
N
1282 1220 M
1282 1201 D
S
N
1283 1220 M
1283 1201 D
S
N
1283 1212 M
1285 1216 D
1287 1219 D
1290 1220 D
1294 1220 D
1296 1219 D
1296 1217 D
1294 1216 D
1293 1217 D
1294 1219 D
S
N
1278 1220 M
1283 1220 D
S
N
1278 1201 M
1287 1201 D
S
N
1304 1220 M
1309 1201 D
S
N
1305 1220 M
1309 1205 D
S
N
1315 1220 M
1309 1201 D
S
N
1315 1220 M
1320 1201 D
S
N
1316 1220 M
1320 1205 D
S
N
1326 1220 M
1320 1201 D
S
N
1300 1220 M
1309 1220 D
S
N
1322 1220 M
1330 1220 D
S
N
1338 1230 M
1337 1228 D
1338 1227 D
1339 1228 D
1338 1230 D
S
N
1338 1220 M
1338 1201 D
S
N
1339 1220 M
1339 1201 D
S
N
1334 1220 M
1339 1220 D
S
N
1334 1201 M
1343 1201 D
S
N
1357 1220 M
1354 1219 D
1353 1217 D
1352 1215 D
1352 1212 D
1353 1209 D
1354 1208 D
1357 1207 D
1360 1207 D
1363 1208 D
1364 1209 D
1365 1212 D
1365 1215 D
1364 1217 D
1363 1219 D
1360 1220 D
1357 1220 D
S
N
1354 1219 M
1353 1216 D
1353 1211 D
1354 1208 D
S
N
1363 1208 M
1364 1211 D
1364 1216 D
1363 1219 D
S
N
1364 1217 M
1365 1219 D
1368 1220 D
1368 1219 D
1365 1219 D
S
N
1353 1209 M
1352 1208 D
1350 1205 D
1350 1204 D
1352 1201 D
1356 1200 D
1363 1200 D
1367 1198 D
1368 1197 D
S
N
1350 1204 M
1352 1202 D
1356 1201 D
1363 1201 D
1367 1200 D
1368 1197 D
1368 1196 D
1367 1193 D
1363 1191 D
1354 1191 D
1350 1193 D
1349 1196 D
1349 1197 D
1350 1200 D
1354 1201 D
S
N
833 1057 M
833 1028 D
S
N
834 1057 M
834 1028 D
S
N
829 1057 M
845 1057 D
849 1055 D
851 1054 D
852 1051 D
852 1047 D
851 1044 D
849 1043 D
845 1042 D
834 1042 D
S
N
845 1057 M
848 1055 D
849 1054 D
851 1051 D
851 1047 D
849 1044 D
848 1043 D
845 1042 D
S
N
829 1028 M
838 1028 D
S
N
870 1057 M
866 1055 D
863 1053 D
862 1050 D
860 1044 D
860 1040 D
862 1035 D
863 1032 D
866 1029 D
870 1028 D
873 1028 D
877 1029 D
879 1032 D
881 1035 D
882 1040 D
882 1044 D
881 1050 D
879 1053 D
877 1055 D
873 1057 D
870 1057 D
S
N
870 1057 M
867 1055 D
864 1053 D
863 1050 D
862 1044 D
862 1040 D
863 1035 D
864 1032 D
867 1029 D
870 1028 D
S
N
873 1028 M
875 1029 D
878 1032 D
879 1035 D
881 1040 D
881 1044 D
879 1050 D
878 1053 D
875 1055 D
873 1057 D
S
N
892 1057 M
897 1028 D
S
N
893 1057 M
897 1035 D
S
N
903 1057 M
897 1028 D
S
N
903 1057 M
908 1028 D
S
N
904 1057 M
908 1035 D
S
N
914 1057 M
908 1028 D
S
N
888 1057 M
897 1057 D
S
N
910 1057 M
918 1057 D
S
N
926 1057 M
926 1028 D
S
N
927 1057 M
927 1028 D
S
N
944 1057 M
944 1028 D
S
N
945 1057 M
945 1028 D
S
N
922 1057 M
931 1057 D
S
N
940 1057 M
949 1057 D
S
N
927 1043 M
944 1043 D
S
N
922 1028 M
931 1028 D
S
N
940 1028 M
949 1028 D
S
N
959 1057 M
959 1028 D
S
N
960 1057 M
960 1028 D
S
N
968 1049 M
968 1038 D
S
N
955 1057 M
977 1057 D
977 1049 D
975 1057 D
S
N
960 1043 M
968 1043 D
S
N
955 1028 M
977 1028 D
977 1036 D
975 1028 D
S
N
988 1057 M
988 1028 D
S
N
989 1057 M
989 1028 D
S
N
983 1057 M
993 1057 D
S
N
983 1028 M
1004 1028 D
1004 1036 D
1003 1028 D
S
N
1033 1062 M
1008 1018 D
S
N
1042 1044 M
1042 1043 D
1041 1043 D
1041 1044 D
1042 1046 D
1045 1047 D
1051 1047 D
1053 1046 D
1055 1044 D
1056 1042 D
1056 1032 D
1057 1029 D
1059 1028 D
S
N
1055 1044 M
1055 1032 D
1056 1029 D
1059 1028 D
1060 1028 D
S
N
1055 1042 M
1053 1040 D
1045 1039 D
1041 1038 D
1040 1035 D
1040 1032 D
1041 1029 D
1045 1028 D
1049 1028 D
1052 1029 D
1055 1032 D
S
N
1045 1039 M
1042 1038 D
1041 1035 D
1041 1032 D
1042 1029 D
1045 1028 D
S
N
1070 1057 M
1070 1028 D
S
N
1071 1057 M
1079 1032 D
S
N
1070 1057 M
1079 1028 D
S
N
1089 1057 M
1079 1028 D
S
N
1089 1057 M
1089 1028 D
S
N
1090 1057 M
1090 1028 D
S
N
1066 1057 M
1071 1057 D
S
N
1089 1057 M
1094 1057 D
S
N
1066 1028 M
1074 1028 D
S
N
1085 1028 M
1094 1028 D
S
N
1120 1053 M
1122 1049 D
1122 1057 D
1120 1053 D
1118 1055 D
1114 1057 D
1111 1057 D
1107 1055 D
1104 1053 D
1103 1050 D
1101 1046 D
1101 1039 D
1103 1035 D
1104 1032 D
1107 1029 D
1111 1028 D
1114 1028 D
1118 1029 D
1120 1032 D
1122 1035 D
S
N
1111 1057 M
1108 1055 D
1105 1053 D
1104 1050 D
1103 1046 D
1103 1039 D
1104 1035 D
1105 1032 D
1108 1029 D
1111 1028 D
S
N
1150 1046 M
1149 1049 D
1146 1050 D
1142 1050 D
1140 1049 D
1138 1047 D
1137 1043 D
1137 1039 D
1138 1036 D
1141 1035 D
1145 1035 D
1148 1036 D
1149 1039 D
S
N
1142 1050 M
1140 1047 D
1138 1043 D
1138 1039 D
1140 1036 D
1141 1035 D
S
N
1150 1050 M
1149 1039 D
1149 1036 D
1152 1035 D
1155 1035 D
1157 1038 D
1159 1042 D
1159 1044 D
1157 1049 D
1156 1051 D
1153 1054 D
1150 1055 D
1146 1057 D
1142 1057 D
1138 1055 D
1135 1054 D
1133 1051 D
1131 1049 D
1130 1044 D
1130 1040 D
1131 1036 D
1133 1034 D
1135 1031 D
1138 1029 D
1142 1028 D
1146 1028 D
1150 1029 D
1153 1031 D
1155 1032 D
S
N
1152 1050 M
1150 1039 D
1150 1036 D
1152 1035 D
S
N
1170 1057 M
1170 1028 D
S
N
1171 1057 M
1187 1031 D
S
N
1171 1054 M
1187 1028 D
S
N
1187 1057 M
1187 1028 D
S
N
1166 1057 M
1171 1057 D
S
N
1183 1057 M
1192 1057 D
S
N
1166 1028 M
1174 1028 D
S
N
1201 1057 M
1201 1028 D
S
N
1202 1057 M
1202 1028 D
S
N
1197 1057 M
1207 1057 D
S
N
1197 1028 M
1218 1028 D
1218 1036 D
1216 1028 D
S
N
1233 1057 M
1228 1055 D
1226 1053 D
1224 1050 D
1223 1044 D
1223 1040 D
1224 1035 D
1226 1032 D
1228 1029 D
1233 1028 D
1235 1028 D
1239 1029 D
1242 1032 D
1244 1035 D
1245 1040 D
1245 1044 D
1244 1050 D
1242 1053 D
1239 1055 D
1235 1057 D
1233 1057 D
S
N
1233 1057 M
1230 1055 D
1227 1053 D
1226 1050 D
1224 1044 D
1224 1040 D
1226 1035 D
1227 1032 D
1230 1029 D
1233 1028 D
S
N
1235 1028 M
1238 1029 D
1241 1032 D
1242 1035 D
1244 1040 D
1244 1044 D
1242 1050 D
1241 1053 D
1238 1055 D
1235 1057 D
S
4 Sw
N
1673 906 M
1673 874 D
S
N
1675 906 M
1684 879 D
S
N
1673 906 M
1684 874 D
S
N
1694 906 M
1684 874 D
S
N
1694 906 M
1694 874 D
S
N
1696 906 M
1696 874 D
S
N
1669 906 M
1675 906 D
S
N
1694 906 M
1700 906 D
S
N
1669 874 M
1678 874 D
S
N
1690 874 M
1700 874 D
S
N
1711 883 M
1710 882 D
1711 881 D
1712 882 D
1711 883 D
S
N
1712 876 M
1712 858 D
1711 856 D
1709 855 D
1707 855 D
1706 856 D
1706 857 D
1707 858 D
1708 857 D
1707 856 D
S
N
1711 876 M
1711 858 D
1710 856 D
1709 855 D
S
N
1708 876 M
1712 876 D
S
N
1722 883 M
1721 882 D
1722 881 D
1723 882 D
1722 883 D
S
N
1723 876 M
1723 858 D
1722 856 D
1720 855 D
1718 855 D
1717 856 D
1717 857 D
1718 858 D
1719 857 D
1718 856 D
S
N
1722 876 M
1722 858 D
1721 856 D
1720 855 D
S
N
1719 876 M
1723 876 D
S
N
1746 912 M
1743 909 D
1740 904 D
1737 898 D
1735 891 D
1735 885 D
1737 877 D
1740 871 D
1743 867 D
1746 864 D
S
N
1743 909 M
1740 903 D
1738 898 D
1737 891 D
1737 885 D
1738 877 D
1740 873 D
1743 867 D
S
N
1758 906 M
1758 874 D
S
N
1760 906 M
1760 874 D
S
N
1778 906 M
1778 874 D
S
N
1779 906 M
1779 874 D
S
N
1754 906 M
1764 906 D
S
N
1773 906 M
1784 906 D
S
N
1760 891 M
1778 891 D
S
N
1754 874 M
1764 874 D
S
N
1773 874 M
1784 874 D
S
N
1791 912 M
1794 909 D
1797 904 D
1800 898 D
1802 891 D
1802 885 D
1800 877 D
1797 871 D
1794 867 D
1791 864 D
S
N
1794 909 M
1797 903 D
1799 898 D
1800 891 D
1800 885 D
1799 877 D
1797 873 D
1794 867 D
S
N
1838 912 M
1838 864 D
S
N
1840 912 M
1840 864 D
S
N
1838 912 M
1849 912 D
S
N
1838 864 M
1849 864 D
S
N
1879 901 M
1880 897 D
1880 906 D
1879 901 D
1876 904 D
1871 906 D
1868 906 D
1864 904 D
1861 901 D
1859 898 D
1858 894 D
1858 886 D
1859 882 D
1861 879 D
1864 876 D
1868 874 D
1871 874 D
1876 876 D
1879 879 D
S
N
1868 906 M
1865 904 D
1862 901 D
1861 898 D
1859 894 D
1859 886 D
1861 882 D
1862 879 D
1865 876 D
1868 874 D
S
N
1879 886 M
1879 874 D
S
N
1880 886 M
1880 874 D
S
N
1874 886 M
1885 886 D
S
N
1894 886 M
1912 886 D
1912 889 D
1911 892 D
1909 894 D
1906 895 D
1901 895 D
1897 894 D
1894 891 D
1892 886 D
1892 883 D
1894 879 D
1897 876 D
1901 874 D
1905 874 D
1909 876 D
1912 879 D
S
N
1911 886 M
1911 891 D
1909 894 D
S
N
1901 895 M
1898 894 D
1895 891 D
1894 886 D
1894 883 D
1895 879 D
1898 876 D
1901 874 D
S
N
1921 906 M
1932 874 D
S
N
1923 906 M
1932 879 D
S
N
1942 906 M
1932 874 D
S
N
1918 906 M
1927 906 D
S
N
1936 906 M
1945 906 D
S
N
1960 912 M
1960 864 D
S
N
1962 912 M
1962 864 D
S
N
1951 912 M
1962 912 D
S
N
1951 864 M
1962 864 D
S
N
583 1261 M
583 1001 D
S
N
583 1001 M
1967 1001 D
S
N
1967 1001 M
1967 1261 D
S
N
1967 1261 M
583 1261 D
S
N
583 1001 M
583 1017 D
S
N
633 1006 M
633 1001 D
S
N
684 1001 M
684 1006 D
S
N
734 1006 M
734 1001 D
S
N
784 1001 M
784 1006 D
S
N
835 1017 M
835 1001 D
S
N
885 1001 M
885 1006 D
S
N
935 1006 M
935 1001 D
S
N
986 1001 M
986 1006 D
S
N
1036 1006 M
1036 1001 D
S
N
1086 1001 M
1086 1017 D
S
N
1137 1006 M
1137 1001 D
S
N
1187 1001 M
1187 1006 D
S
N
1237 1006 M
1237 1001 D
S
N
1288 1001 M
1288 1006 D
S
N
1338 1017 M
1338 1001 D
S
N
1388 1001 M
1388 1006 D
S
N
1439 1006 M
1439 1001 D
S
N
1489 1001 M
1489 1006 D
S
N
1539 1006 M
1539 1001 D
S
N
1590 1001 M
1590 1017 D
S
N
1640 1006 M
1640 1001 D
S
N
1690 1001 M
1690 1006 D
S
N
1741 1006 M
1741 1001 D
S
N
1791 1001 M
1791 1006 D
S
N
1841 1017 M
1841 1001 D
S
N
1892 1001 M
1892 1006 D
S
N
1942 1006 M
1942 1001 D
S
N
581 971 M
577 970 D
574 965 D
572 958 D
572 953 D
574 946 D
577 941 D
581 940 D
585 940 D
589 941 D
592 946 D
594 953 D
594 958 D
592 965 D
589 970 D
585 971 D
581 971 D
S
N
581 971 M
578 970 D
577 968 D
575 965 D
574 958 D
574 953 D
575 946 D
577 943 D
578 941 D
581 940 D
S
N
585 940 M
588 941 D
589 943 D
591 946 D
592 953 D
592 958 D
591 965 D
589 968 D
588 970 D
585 971 D
S
N
798 965 M
801 967 D
806 971 D
806 940 D
S
N
804 970 M
804 940 D
S
N
798 940 M
812 940 D
S
N
833 971 M
829 970 D
826 965 D
824 958 D
824 953 D
826 946 D
829 941 D
833 940 D
836 940 D
841 941 D
844 946 D
845 953 D
845 958 D
844 965 D
841 970 D
836 971 D
833 971 D
S
N
833 971 M
830 970 D
829 968 D
827 965 D
826 958 D
826 953 D
827 946 D
829 943 D
830 941 D
833 940 D
S
N
836 940 M
839 941 D
841 943 D
842 946 D
844 953 D
844 958 D
842 965 D
841 968 D
839 970 D
836 971 D
S
N
863 971 M
859 970 D
856 965 D
854 958 D
854 953 D
856 946 D
859 941 D
863 940 D
866 940 D
871 941 D
874 946 D
875 953 D
875 958 D
874 965 D
871 970 D
866 971 D
863 971 D
S
N
863 971 M
860 970 D
859 968 D
857 965 D
856 958 D
856 953 D
857 946 D
859 943 D
860 941 D
863 940 D
S
N
866 940 M
869 941 D
871 943 D
872 946 D
874 953 D
874 958 D
872 965 D
871 968 D
869 970 D
866 971 D
S
N
1047 965 M
1048 964 D
1047 962 D
1045 964 D
1045 965 D
1047 968 D
1048 970 D
1053 971 D
1059 971 D
1064 970 D
1065 968 D
1067 965 D
1067 962 D
1065 959 D
1061 956 D
1053 953 D
1050 952 D
1047 949 D
1045 944 D
1045 940 D
S
N
1059 971 M
1062 970 D
1064 968 D
1065 965 D
1065 962 D
1064 959 D
1059 956 D
1053 953 D
S
N
1045 943 M
1047 944 D
1050 944 D
1058 941 D
1062 941 D
1065 943 D
1067 944 D
S
N
1050 944 M
1058 940 D
1064 940 D
1065 941 D
1067 944 D
1067 947 D
S
N
1085 971 M
1080 970 D
1077 965 D
1076 958 D
1076 953 D
1077 946 D
1080 941 D
1085 940 D
1088 940 D
1092 941 D
1095 946 D
1097 953 D
1097 958 D
1095 965 D
1092 970 D
1088 971 D
1085 971 D
S
N
1085 971 M
1082 970 D
1080 968 D
1079 965 D
1077 958 D
1077 953 D
1079 946 D
1080 943 D
1082 941 D
1085 940 D
S
N
1088 940 M
1091 941 D
1092 943 D
1094 946 D
1095 953 D
1095 958 D
1094 965 D
1092 968 D
1091 970 D
1088 971 D
S
N
1115 971 M
1110 970 D
1107 965 D
1106 958 D
1106 953 D
1107 946 D
1110 941 D
1115 940 D
1118 940 D
1122 941 D
1125 946 D
1127 953 D
1127 958 D
1125 965 D
1122 970 D
1118 971 D
1115 971 D
S
N
1115 971 M
1112 970 D
1110 968 D
1109 965 D
1107 958 D
1107 953 D
1109 946 D
1110 943 D
1112 941 D
1115 940 D
S
N
1118 940 M
1121 941 D
1122 943 D
1124 946 D
1125 953 D
1125 958 D
1124 965 D
1122 968 D
1121 970 D
1118 971 D
S
N
1299 965 M
1300 964 D
1299 962 D
1297 964 D
1297 965 D
1299 968 D
1300 970 D
1305 971 D
1311 971 D
1315 970 D
1317 967 D
1317 962 D
1315 959 D
1311 958 D
1306 958 D
S
N
1311 971 M
1314 970 D
1315 967 D
1315 962 D
1314 959 D
1311 958 D
S
N
1311 958 M
1314 956 D
1317 953 D
1318 950 D
1318 946 D
1317 943 D
1315 941 D
1311 940 D
1305 940 D
1300 941 D
1299 943 D
1297 946 D
1297 947 D
1299 949 D
1300 947 D
1299 946 D
S
N
1315 955 M
1317 950 D
1317 946 D
1315 943 D
1314 941 D
1311 940 D
S
N
1336 971 M
1332 970 D
1329 965 D
1327 958 D
1327 953 D
1329 946 D
1332 941 D
1336 940 D
1339 940 D
1344 941 D
1347 946 D
1348 953 D
1348 958 D
1347 965 D
1344 970 D
1339 971 D
1336 971 D
S
N
1336 971 M
1333 970 D
1332 968 D
1330 965 D
1329 958 D
1329 953 D
1330 946 D
1332 943 D
1333 941 D
1336 940 D
S
N
1339 940 M
1342 941 D
1344 943 D
1345 946 D
1347 953 D
1347 958 D
1345 965 D
1344 968 D
1342 970 D
1339 971 D
S
N
1367 971 M
1362 970 D
1359 965 D
1357 958 D
1357 953 D
1359 946 D
1362 941 D
1367 940 D
1370 940 D
1374 941 D
1377 946 D
1379 953 D
1379 958 D
1377 965 D
1374 970 D
1370 971 D
1367 971 D
S
N
1367 971 M
1363 970 D
1362 968 D
1360 965 D
1359 958 D
1359 953 D
1360 946 D
1362 943 D
1363 941 D
1367 940 D
S
N
1370 940 M
1373 941 D
1374 943 D
1376 946 D
1377 953 D
1377 958 D
1376 965 D
1374 968 D
1373 970 D
1370 971 D
S
N
1562 968 M
1562 940 D
S
N
1564 971 M
1564 940 D
S
N
1564 971 M
1547 949 D
1571 949 D
S
N
1558 940 M
1568 940 D
S
N
1588 971 M
1583 970 D
1580 965 D
1579 958 D
1579 953 D
1580 946 D
1583 941 D
1588 940 D
1591 940 D
1596 941 D
1599 946 D
1600 953 D
1600 958 D
1599 965 D
1596 970 D
1591 971 D
1588 971 D
S
N
1588 971 M
1585 970 D
1583 968 D
1582 965 D
1580 958 D
1580 953 D
1582 946 D
1583 943 D
1585 941 D
1588 940 D
S
N
1591 940 M
1594 941 D
1596 943 D
1597 946 D
1599 953 D
1599 958 D
1597 965 D
1596 968 D
1594 970 D
1591 971 D
S
N
1618 971 M
1614 970 D
1611 965 D
1609 958 D
1609 953 D
1611 946 D
1614 941 D
1618 940 D
1621 940 D
1626 941 D
1629 946 D
1630 953 D
1630 958 D
1629 965 D
1626 970 D
1621 971 D
1618 971 D
S
N
1618 971 M
1615 970 D
1614 968 D
1612 965 D
1611 958 D
1611 953 D
1612 946 D
1614 943 D
1615 941 D
1618 940 D
S
N
1621 940 M
1624 941 D
1626 943 D
1627 946 D
1629 953 D
1629 958 D
1627 965 D
1626 968 D
1624 970 D
1621 971 D
S
N
1803 971 M
1800 956 D
S
N
1800 956 M
1803 959 D
1808 961 D
1812 961 D
1817 959 D
1820 956 D
1821 952 D
1821 949 D
1820 944 D
1817 941 D
1812 940 D
1808 940 D
1803 941 D
1802 943 D
1800 946 D
1800 947 D
1802 949 D
1803 947 D
1802 946 D
S
N
1812 961 M
1815 959 D
1818 956 D
1820 952 D
1820 949 D
1818 944 D
1815 941 D
1812 940 D
S
N
1803 971 M
1818 971 D
S
N
1803 970 M
1811 970 D
1818 971 D
S
N
1840 971 M
1835 970 D
1832 965 D
1831 958 D
1831 953 D
1832 946 D
1835 941 D
1840 940 D
1843 940 D
1847 941 D
1850 946 D
1852 953 D
1852 958 D
1850 965 D
1847 970 D
1843 971 D
1840 971 D
S
N
1840 971 M
1837 970 D
1835 968 D
1834 965 D
1832 958 D
1832 953 D
1834 946 D
1835 943 D
1837 941 D
1840 940 D
S
N
1843 940 M
1846 941 D
1847 943 D
1849 946 D
1850 953 D
1850 958 D
1849 965 D
1847 968 D
1846 970 D
1843 971 D
S
N
1870 971 M
1865 970 D
1862 965 D
1861 958 D
1861 953 D
1862 946 D
1865 941 D
1870 940 D
1873 940 D
1877 941 D
1880 946 D
1882 953 D
1882 958 D
1880 965 D
1877 970 D
1873 971 D
1870 971 D
S
N
1870 971 M
1867 970 D
1865 968 D
1864 965 D
1862 958 D
1862 953 D
1864 946 D
1865 943 D
1867 941 D
1870 940 D
S
N
1873 940 M
1876 941 D
1877 943 D
1879 946 D
1880 953 D
1880 958 D
1879 965 D
1877 968 D
1876 970 D
1873 971 D
S
N
583 1261 M
1967 1261 D
S
N
583 1245 M
583 1261 D
S
N
633 1261 M
633 1256 D
S
N
684 1256 M
684 1261 D
S
N
734 1261 M
734 1256 D
S
N
784 1256 M
784 1261 D
S
N
835 1261 M
835 1245 D
S
N
885 1256 M
885 1261 D
S
N
935 1261 M
935 1256 D
S
N
986 1256 M
986 1261 D
S
N
1036 1261 M
1036 1256 D
S
N
1086 1245 M
1086 1261 D
S
N
1137 1261 M
1137 1256 D
S
N
1187 1256 M
1187 1261 D
S
N
1237 1261 M
1237 1256 D
S
N
1288 1256 M
1288 1261 D
S
N
1338 1261 M
1338 1245 D
S
N
1388 1256 M
1388 1261 D
S
N
1439 1261 M
1439 1256 D
S
N
1489 1256 M
1489 1261 D
S
N
1539 1261 M
1539 1256 D
S
N
1590 1245 M
1590 1261 D
S
N
1640 1261 M
1640 1256 D
S
N
1690 1256 M
1690 1261 D
S
N
1741 1261 M
1741 1256 D
S
N
1791 1256 M
1791 1261 D
S
N
1841 1261 M
1841 1245 D
S
N
1892 1256 M
1892 1261 D
S
N
1942 1261 M
1942 1256 D
S
N
583 1001 M
583 1261 D
S
N
583 1006 M
588 1006 D
S
N
588 1022 M
583 1022 D
S
N
583 1038 M
588 1038 D
S
N
599 1053 M
583 1053 D
S
N
583 1069 M
588 1069 D
S
N
588 1084 M
583 1084 D
S
N
583 1100 M
588 1100 D
S
N
588 1115 M
583 1115 D
S
N
583 1131 M
599 1131 D
S
N
588 1147 M
583 1147 D
S
N
583 1162 M
588 1162 D
S
N
588 1178 M
583 1178 D
S
N
583 1193 M
588 1193 D
S
N
599 1209 M
583 1209 D
S
N
583 1224 M
588 1224 D
S
N
588 1240 M
583 1240 D
S
N
583 1256 M
588 1256 D
S
N
503 1067 M
498 1065 D
495 1061 D
494 1053 D
494 1049 D
495 1041 D
498 1037 D
503 1035 D
506 1035 D
510 1037 D
513 1041 D
515 1049 D
515 1053 D
513 1061 D
510 1065 D
506 1067 D
503 1067 D
S
N
503 1067 M
500 1065 D
498 1064 D
497 1061 D
495 1053 D
495 1049 D
497 1041 D
498 1038 D
500 1037 D
503 1035 D
S
N
506 1035 M
509 1037 D
510 1038 D
512 1041 D
513 1049 D
513 1053 D
512 1061 D
510 1064 D
509 1065 D
506 1067 D
S
N
527 1038 M
525 1037 D
527 1035 D
528 1037 D
527 1038 D
S
N
547 1067 M
542 1065 D
541 1062 D
541 1058 D
542 1055 D
547 1053 D
553 1053 D
557 1055 D
559 1058 D
559 1062 D
557 1065 D
553 1067 D
547 1067 D
S
N
547 1067 M
544 1065 D
542 1062 D
542 1058 D
544 1055 D
547 1053 D
S
N
553 1053 M
556 1055 D
557 1058 D
557 1062 D
556 1065 D
553 1067 D
S
N
547 1053 M
542 1052 D
541 1050 D
539 1047 D
539 1041 D
541 1038 D
542 1037 D
547 1035 D
553 1035 D
557 1037 D
559 1038 D
560 1041 D
560 1047 D
559 1050 D
557 1052 D
553 1053 D
S
N
547 1053 M
544 1052 D
542 1050 D
541 1047 D
541 1041 D
542 1038 D
544 1037 D
547 1035 D
S
N
553 1035 M
556 1037 D
557 1038 D
559 1041 D
559 1047 D
557 1050 D
556 1052 D
553 1053 D
S
N
498 1139 M
501 1140 D
506 1145 D
506 1113 D
S
N
504 1143 M
504 1113 D
S
N
498 1113 M
512 1113 D
S
N
527 1116 M
525 1114 D
527 1113 D
528 1114 D
527 1116 D
S
N
548 1145 M
544 1143 D
541 1139 D
539 1131 D
539 1126 D
541 1119 D
544 1114 D
548 1113 D
551 1113 D
556 1114 D
559 1119 D
560 1126 D
560 1131 D
559 1139 D
556 1143 D
551 1145 D
548 1145 D
S
N
548 1145 M
545 1143 D
544 1142 D
542 1139 D
541 1131 D
541 1126 D
542 1119 D
544 1116 D
545 1114 D
548 1113 D
S
N
551 1113 M
554 1114 D
556 1116 D
557 1119 D
559 1126 D
559 1131 D
557 1139 D
556 1142 D
554 1143 D
551 1145 D
S
N
498 1216 M
501 1218 D
506 1222 D
506 1191 D
S
N
504 1221 M
504 1191 D
S
N
498 1191 M
512 1191 D
S
N
527 1194 M
525 1192 D
527 1191 D
528 1192 D
527 1194 D
S
N
541 1216 M
542 1215 D
541 1213 D
539 1215 D
539 1216 D
541 1219 D
542 1221 D
547 1222 D
553 1222 D
557 1221 D
559 1219 D
560 1216 D
560 1213 D
559 1210 D
554 1207 D
547 1204 D
544 1203 D
541 1200 D
539 1195 D
539 1191 D
S
N
553 1222 M
556 1221 D
557 1219 D
559 1216 D
559 1213 D
557 1210 D
553 1207 D
547 1204 D
S
N
539 1194 M
541 1195 D
544 1195 D
551 1192 D
556 1192 D
559 1194 D
560 1195 D
S
N
544 1195 M
551 1191 D
557 1191 D
559 1192 D
560 1195 D
560 1198 D
S
N
1967 1001 M
1967 1261 D
S
N
1962 1006 M
1967 1006 D
S
N
1967 1022 M
1962 1022 D
S
N
1962 1038 M
1967 1038 D
S
N
1967 1053 M
1951 1053 D
S
N
1962 1069 M
1967 1069 D
S
N
1967 1084 M
1962 1084 D
S
N
1962 1100 M
1967 1100 D
S
N
1967 1115 M
1962 1115 D
S
N
1951 1131 M
1967 1131 D
S
N
1967 1147 M
1962 1147 D
S
N
1962 1162 M
1967 1162 D
S
N
1967 1178 M
1962 1178 D
S
N
1962 1193 M
1967 1193 D
S
N
1967 1209 M
1951 1209 D
S
N
1962 1224 M
1967 1224 D
S
N
1967 1240 M
1962 1240 D
S
N
1962 1256 M
1967 1256 D
S
N
608 1001 M
608 1151 D
633 1151 D
633 1150 D
658 1150 D
658 1141 D
684 1141 D
684 1141 D
709 1141 D
709 1148 D
734 1148 D
734 1151 D
759 1151 D
759 1143 D
784 1143 D
784 1134 D
809 1134 D
809 1133 D
835 1133 D
835 1132 D
860 1132 D
860 1127 D
885 1127 D
885 1139 D
910 1139 D
910 1144 D
935 1144 D
935 1140 D
960 1140 D
960 1136 D
986 1136 D
986 1143 D
1011 1143 D
1011 1133 D
1036 1133 D
1036 1142 D
1061 1142 D
1061 1138 D
1086 1138 D
1086 1145 D
1111 1145 D
1111 1136 D
1137 1136 D
1137 1139 D
1162 1139 D
1162 1138 D
1187 1138 D
1187 1136 D
1212 1136 D
1212 1150 D
1237 1150 D
1237 1141 D
1262 1141 D
1262 1154 D
1288 1154 D
1288 1159 D
1313 1159 D
1313 1152 D
1338 1152 D
1338 1154 D
1363 1154 D
1363 1149 D
1388 1149 D
1388 1150 D
1413 1150 D
1413 1147 D
1439 1147 D
1439 1159 D
1464 1159 D
1464 1160 D
1489 1160 D
1489 1149 D
1514 1149 D
1514 1147 D
1539 1147 D
1539 1147 D
1564 1147 D
1564 1139 D
1590 1139 D
1590 1147 D
1615 1147 D
1615 1139 D
1640 1139 D
1640 1132 D
1665 1132 D
1665 1136 D
1690 1136 D
1690 1145 D
1715 1145 D
1715 1147 D
1741 1147 D
1741 1148 D
1766 1148 D
1766 1176 D
1791 1176 D
1791 1169 D
1816 1169 D
1816 1147 D
1841 1147 D
1841 1129 D
1866 1129 D
1866 1110 D
1892 1110 D
1892 1174 D
1917 1174 D
1917 1133 D
1942 1133 D
1942 1146 D
1967 1146 D
S
N
721 1217 M
808 1217 D
S
0 0 1 setrgbcolor
N
608 1001 M
608 1013 D
S
N
608 1025 M
608 1038 D
S
N
608 1050 M
608 1062 D
S
N
608 1074 M
608 1086 D
S
N
608 1098 M
608 1110 D
S
N
608 1122 M
608 1134 D
S
N
608 1147 M
608 1159 D
S
N
608 1171 M
608 1183 D
S
N
608 1195 M
608 1207 D
S
N
608 1219 M
608 1231 D
S
N
608 1243 M
608 1256 D
S
N
658 1254 M
658 1253 D
670 1253 D
S
N
682 1253 M
684 1253 D
684 1243 D
S
N
684 1231 M
684 1218 D
S
N
684 1206 M
684 1194 D
S
N
695 1193 M
707 1193 D
S
N
709 1183 M
709 1171 D
S
N
717 1167 M
729 1167 D
S
N
739 1165 M
751 1165 D
S
N
759 1161 M
759 1154 D
765 1154 D
S
N
777 1154 M
784 1154 D
784 1150 D
S
N
788 1141 M
800 1141 D
S
N
812 1142 M
824 1142 D
S
N
835 1141 M
835 1131 D
837 1131 D
S
N
849 1131 M
860 1131 D
860 1129 D
S
N
867 1124 M
879 1124 D
S
N
885 1118 M
885 1115 D
894 1115 D
S
N
906 1115 M
910 1115 D
910 1116 D
917 1116 D
S
N
929 1116 M
935 1116 D
935 1111 D
937 1111 D
S
N
949 1111 M
960 1111 D
960 1112 D
S
N
966 1118 M
978 1118 D
S
N
986 1114 M
986 1102 D
986 1102 D
S
N
998 1102 M
1011 1102 D
S
N
1017 1109 M
1029 1109 D
S
N
1036 1104 M
1036 1099 D
1044 1099 D
S
N
1056 1099 M
1061 1099 D
1061 1099 D
1068 1099 D
S
N
1080 1099 M
1086 1099 D
1086 1098 D
1091 1098 D
S
N
1103 1098 M
1111 1098 D
1111 1098 D
1115 1098 D
S
N
1127 1098 M
1137 1098 D
1137 1096 D
1137 1096 D
S
N
1149 1096 M
1161 1096 D
S
N
1173 1096 M
1186 1096 D
S
N
1195 1098 M
1207 1098 D
S
N
1212 1091 M
1212 1085 D
1218 1085 D
S
N
1230 1085 M
1237 1085 D
1237 1082 D
1239 1082 D
S
N
1252 1082 M
1262 1082 D
1262 1081 D
S
N
1267 1073 M
1279 1073 D
S
N
1289 1071 M
1301 1071 D
S
N
1313 1071 M
1313 1079 D
1317 1079 D
S
N
1329 1079 M
1338 1079 D
1338 1076 D
S
N
1341 1067 M
1354 1067 D
S
N
1363 1070 M
1363 1072 D
1373 1072 D
S
N
1385 1072 M
1388 1072 D
1388 1075 D
1394 1075 D
S
N
1406 1075 M
1413 1075 D
1413 1071 D
S
N
1418 1063 M
1430 1063 D
S
N
1439 1066 M
1452 1066 D
S
N
1464 1066 M
1464 1066 D
1464 1067 D
1475 1067 D
S
N
1487 1067 M
1489 1067 D
1489 1068 D
1499 1068 D
S
N
1511 1068 M
1514 1068 D
1514 1059 D
S
N
1522 1055 M
1534 1055 D
S
N
1539 1062 M
1539 1063 D
1550 1063 D
S
N
1563 1063 M
1564 1063 D
1564 1058 D
1570 1058 D
S
N
1582 1058 M
1590 1058 D
1590 1063 D
S
N
1592 1073 M
1604 1073 D
S
N
1615 1071 M
1615 1059 D
S
N
1622 1055 M
1634 1055 D
S
N
1644 1057 M
1657 1057 D
S
N
1665 1053 M
1665 1041 D
1665 1041 D
S
N
1677 1041 M
1689 1041 D
S
N
1690 1052 M
1690 1064 D
S
N
1696 1071 M
1708 1071 D
S
N
1715 1066 M
1715 1054 D
S
N
1726 1053 M
1738 1053 D
S
N
1741 1043 M
1741 1042 D
1752 1042 D
S
N
1764 1042 M
1766 1042 D
1766 1032 D
S
N
1766 1021 M
1778 1021 D
S
N
1791 1021 M
1791 1021 D
1791 1032 D
S
N
1796 1039 M
1808 1039 D
S
N
1816 1043 M
1816 1047 D
1824 1047 D
S
N
1836 1047 M
1841 1047 D
1841 1055 D
S
N
1844 1063 M
1857 1063 D
S
N
1866 1066 M
1866 1071 D
1874 1071 D
S
N
1886 1071 M
1892 1071 D
1892 1064 D
S
N
1892 1052 M
1892 1040 D
S
N
1900 1037 M
1912 1037 D
S
N
1921 1040 M
1934 1040 D
S
N
1942 1044 M
1942 1044 D
1953 1044 D
S
N
1965 1044 M
1967 1044 D
S
N
721 1044 M
734 1044 D
S
N
746 1044 M
758 1044 D
S
N
770 1044 M
782 1044 D
S
N
794 1044 M
806 1044 D
S
showpage
%%Trailer
%%Pages: 1
%%BoundingBox: 99 203 482 563
