%!PS-Adobe-1.0
%%Creator: Unified Graphics System
%%Pages: (atend)
%%DocumentFonts: Courier
%%BoundingBox:   99  205  481  563
%%EndComments
/Sw{setlinewidth}def
/Sg{setgray}def
/Sd{setdash}def
/P {newpath
    moveto
0 0 rlineto
    stroke}def
/M {moveto}def
/D {lineto}def
/N {newpath}def
/S {stroke}def
/T {/Courier findfont
    exch
    scalefont
    setfont}def
/R {rotate}def
/W {show}def
/F {fill}def
/X {gsave}def
/Y {grestore}def
%%EndProlog
%%Page: 1 1
0.24000 0.24000 scale
1 setlinecap
1 setlinejoin
4 Sw
0 0 0 setrgbcolor
[] 0 Sd
N
890 2259 M
890 2227 D
S
N
892 2259 M
892 2227 D
S
N
892 2254 M
895 2257 D
898 2259 D
901 2259 D
905 2257 D
908 2254 D
910 2249 D
910 2246 D
908 2242 D
905 2239 D
901 2237 D
898 2237 D
895 2239 D
892 2242 D
S
N
901 2259 M
904 2257 D
907 2254 D
908 2249 D
908 2246 D
907 2242 D
904 2239 D
901 2237 D
S
N
886 2259 M
892 2259 D
S
N
886 2227 M
896 2227 D
S
N
922 2259 M
922 2227 D
S
N
923 2259 M
923 2227 D
S
N
923 2254 M
926 2257 D
929 2259 D
932 2259 D
937 2257 D
940 2254 D
941 2249 D
941 2246 D
940 2242 D
937 2239 D
932 2237 D
929 2237 D
926 2239 D
923 2242 D
S
N
932 2259 M
935 2257 D
938 2254 D
940 2249 D
940 2246 D
938 2242 D
935 2239 D
932 2237 D
S
N
917 2259 M
923 2259 D
S
N
917 2227 M
928 2227 D
S
N
999 2254 M
1003 2251 D
999 2248 D
S
N
994 2259 M
1002 2251 D
994 2243 D
S
N
976 2251 M
1002 2251 D
S
N
1041 2269 M
1041 2237 D
S
N
1042 2269 M
1042 2237 D
S
N
1061 2269 M
1061 2237 D
S
N
1062 2269 M
1062 2237 D
S
N
1036 2269 M
1047 2269 D
S
N
1056 2269 M
1067 2269 D
S
N
1042 2254 M
1061 2254 D
S
N
1036 2237 M
1047 2237 D
S
N
1056 2237 M
1067 2237 D
S
N
1077 2269 M
1077 2243 D
1079 2239 D
1082 2237 D
1085 2237 D
1088 2239 D
1089 2242 D
S
N
1079 2269 M
1079 2243 D
1080 2239 D
1082 2237 D
S
N
1073 2259 M
1085 2259 D
S
N
1100 2269 M
1100 2243 D
1101 2239 D
1104 2237 D
1107 2237 D
1110 2239 D
1112 2242 D
S
N
1101 2269 M
1101 2243 D
1103 2239 D
1104 2237 D
S
N
1095 2259 M
1107 2259 D
S
N
1091 2278 M
1124 2278 D
S
N
1219 2269 M
1219 2237 D
S
N
1221 2269 M
1221 2237 D
S
N
1219 2254 M
1216 2257 D
1213 2259 D
1210 2259 D
1205 2257 D
1202 2254 D
1201 2249 D
1201 2246 D
1202 2242 D
1205 2239 D
1210 2237 D
1213 2237 D
1216 2239 D
1219 2242 D
S
N
1210 2259 M
1207 2257 D
1204 2254 D
1202 2249 D
1202 2246 D
1204 2242 D
1207 2239 D
1210 2237 D
S
N
1215 2269 M
1221 2269 D
S
N
1219 2237 M
1225 2237 D
S
N
1257 2259 M
1242 2259 D
1237 2257 D
1234 2252 D
1233 2248 D
1233 2243 D
1234 2240 D
1236 2239 D
1239 2237 D
1242 2237 D
1246 2239 D
1249 2243 D
1251 2248 D
1251 2252 D
1249 2256 D
1248 2257 D
1245 2259 D
S
N
1242 2259 M
1239 2257 D
1236 2252 D
1234 2248 D
1234 2242 D
1236 2239 D
S
N
1242 2237 M
1245 2239 D
1248 2243 D
1249 2248 D
1249 2254 D
1248 2257 D
S
N
1248 2257 M
1257 2257 D
S
N
1290 2275 M
1263 2227 D
S
N
1316 2269 M
1316 2237 D
S
N
1317 2269 M
1317 2237 D
S
N
1316 2254 M
1313 2257 D
1310 2259 D
1307 2259 D
1302 2257 D
1299 2254 D
1298 2249 D
1298 2246 D
1299 2242 D
1302 2239 D
1307 2237 D
1310 2237 D
1313 2239 D
1316 2242 D
S
N
1307 2259 M
1304 2257 D
1301 2254 D
1299 2249 D
1299 2246 D
1301 2242 D
1304 2239 D
1307 2237 D
S
N
1311 2269 M
1317 2269 D
S
N
1316 2237 M
1322 2237 D
S
N
1332 2269 M
1332 2237 D
S
N
1334 2269 M
1334 2237 D
S
N
1343 2260 M
1343 2248 D
S
N
1328 2269 M
1352 2269 D
1352 2260 D
1350 2269 D
S
N
1334 2254 M
1343 2254 D
S
N
1328 2237 M
1352 2237 D
1352 2246 D
1350 2237 D
S
N
1367 2246 M
1367 2225 D
S
N
1369 2246 M
1369 2225 D
S
N
1361 2246 M
1360 2240 D
1360 2246 D
1376 2246 D
1376 2240 D
1375 2246 D
S
N
1364 2225 M
1372 2225 D
S
N
1410 2275 M
1410 2227 D
S
N
1411 2275 M
1411 2227 D
S
N
1410 2275 M
1420 2275 D
S
N
1410 2227 M
1420 2227 D
S
N
1432 2259 M
1432 2227 D
S
N
1434 2259 M
1434 2227 D
S
N
1434 2254 M
1437 2257 D
1440 2259 D
1443 2259 D
1447 2257 D
1451 2254 D
1452 2249 D
1452 2246 D
1451 2242 D
1447 2239 D
1443 2237 D
1440 2237 D
1437 2239 D
1434 2242 D
S
N
1443 2259 M
1446 2257 D
1449 2254 D
1451 2249 D
1451 2246 D
1449 2242 D
1446 2239 D
1443 2237 D
S
N
1428 2259 M
1434 2259 D
S
N
1428 2227 M
1438 2227 D
S
N
1464 2269 M
1464 2237 D
S
N
1466 2269 M
1466 2237 D
S
N
1466 2254 M
1469 2257 D
1472 2259 D
1475 2259 D
1479 2257 D
1482 2254 D
1484 2249 D
1484 2246 D
1482 2242 D
1479 2239 D
1475 2237 D
1472 2237 D
1469 2239 D
1466 2242 D
S
N
1475 2259 M
1478 2257 D
1481 2254 D
1482 2249 D
1482 2246 D
1481 2242 D
1478 2239 D
1475 2237 D
S
N
1460 2269 M
1466 2269 D
S
N
1502 2275 M
1502 2227 D
S
N
1503 2275 M
1503 2227 D
S
N
1493 2275 M
1503 2275 D
S
N
1493 2227 M
1503 2227 D
S
N
1565 2255 M
1565 2254 D
1564 2254 D
1564 2255 D
1565 2257 D
1568 2259 D
1574 2259 D
1577 2257 D
1579 2255 D
1580 2252 D
1580 2242 D
1582 2239 D
1583 2237 D
S
N
1579 2255 M
1579 2242 D
1580 2239 D
1583 2237 D
1585 2237 D
S
N
1579 2252 M
1577 2251 D
1568 2249 D
1564 2248 D
1562 2245 D
1562 2242 D
1564 2239 D
1568 2237 D
1573 2237 D
1576 2239 D
1579 2242 D
S
N
1568 2249 M
1565 2248 D
1564 2245 D
1564 2242 D
1565 2239 D
1568 2237 D
S
N
1595 2269 M
1595 2243 D
1597 2239 D
1600 2237 D
1603 2237 D
1606 2239 D
1607 2242 D
S
N
1597 2269 M
1597 2243 D
1598 2239 D
1600 2237 D
S
N
1591 2259 M
1603 2259 D
S
N
1642 2269 M
1642 2237 D
S
N
1644 2269 M
1644 2237 D
S
N
1638 2269 M
1648 2269 D
S
N
1638 2237 M
1660 2237 D
1660 2246 D
1659 2237 D
S
N
1669 2269 M
1669 2237 D
S
N
1671 2269 M
1671 2237 D
S
N
1689 2269 M
1689 2237 D
S
N
1691 2269 M
1691 2237 D
S
N
1665 2269 M
1675 2269 D
S
N
1684 2269 M
1695 2269 D
S
N
1671 2254 M
1689 2254 D
S
N
1665 2237 M
1675 2237 D
S
N
1684 2237 M
1695 2237 D
S
N
1724 2265 M
1725 2260 D
1725 2269 D
1724 2265 D
1721 2268 D
1716 2269 D
1713 2269 D
1709 2268 D
1706 2265 D
1704 2262 D
1703 2257 D
1703 2249 D
1704 2245 D
1706 2242 D
1709 2239 D
1713 2237 D
1716 2237 D
1721 2239 D
1724 2242 D
1725 2245 D
S
N
1713 2269 M
1710 2268 D
1707 2265 D
1706 2262 D
1704 2257 D
1704 2249 D
1706 2245 D
1707 2242 D
1710 2239 D
1713 2237 D
S
N
1758 2269 M
1758 2260 D
S
N
1758 2263 M
1760 2266 D
1763 2269 D
1766 2269 D
1774 2265 D
1777 2265 D
1778 2266 D
1780 2269 D
S
N
1760 2266 M
1763 2268 D
1766 2268 D
1774 2265 D
S
N
1780 2269 M
1780 2265 D
1778 2260 D
1772 2252 D
1771 2249 D
1769 2245 D
1769 2237 D
S
N
1778 2260 M
1771 2252 D
1769 2249 D
1767 2245 D
1767 2237 D
S
N
1822 2269 M
1822 2237 D
S
N
1823 2269 M
1823 2237 D
S
N
1813 2269 M
1811 2260 D
1811 2269 D
1834 2269 D
1834 2260 D
1832 2269 D
S
N
1817 2237 M
1828 2237 D
S
N
1843 2249 M
1861 2249 D
1861 2252 D
1860 2255 D
1858 2257 D
1855 2259 D
1850 2259 D
1846 2257 D
1843 2254 D
1841 2249 D
1841 2246 D
1843 2242 D
1846 2239 D
1850 2237 D
1854 2237 D
1858 2239 D
1861 2242 D
S
N
1860 2249 M
1860 2254 D
1858 2257 D
S
N
1851 2259 M
1847 2257 D
1844 2254 D
1843 2249 D
1843 2246 D
1844 2242 D
1847 2239 D
1851 2237 D
S
N
1870 2269 M
1881 2237 D
S
N
1872 2269 M
1881 2242 D
S
N
1891 2269 M
1881 2237 D
S
N
1867 2269 M
1876 2269 D
S
N
1885 2269 M
1894 2269 D
S
3 Sw
N
1455 2186 M
1455 2185 D
1453 2185 D
1453 2186 D
1455 2188 D
1458 2189 D
1464 2189 D
1467 2188 D
1468 2186 D
1470 2183 D
1470 2173 D
1471 2170 D
1473 2168 D
S
N
1468 2186 M
1468 2173 D
1470 2170 D
1473 2168 D
1474 2168 D
S
N
1468 2183 M
1467 2182 D
1458 2180 D
1453 2179 D
1452 2176 D
1452 2173 D
1453 2170 D
1458 2168 D
1462 2168 D
1465 2170 D
1468 2173 D
S
N
1458 2180 M
1455 2179 D
1453 2176 D
1453 2173 D
1455 2170 D
1458 2168 D
S
N
1485 2200 M
1485 2168 D
S
N
1486 2200 M
1495 2173 D
S
N
1485 2200 M
1495 2168 D
S
N
1506 2200 M
1495 2168 D
S
N
1506 2200 M
1506 2168 D
S
N
1508 2200 M
1508 2168 D
S
N
1480 2200 M
1486 2200 D
S
N
1506 2200 M
1512 2200 D
S
N
1480 2168 M
1489 2168 D
S
N
1502 2168 M
1512 2168 D
S
N
1541 2195 M
1542 2191 D
1542 2200 D
1541 2195 D
1538 2198 D
1533 2200 D
1530 2200 D
1526 2198 D
1523 2195 D
1521 2192 D
1520 2188 D
1520 2180 D
1521 2176 D
1523 2173 D
1526 2170 D
1530 2168 D
1533 2168 D
1538 2170 D
1541 2173 D
1542 2176 D
S
N
1530 2200 M
1527 2198 D
1524 2195 D
1523 2192 D
1521 2188 D
1521 2180 D
1523 2176 D
1524 2173 D
1527 2170 D
1530 2168 D
S
N
1574 2188 M
1572 2191 D
1569 2192 D
1565 2192 D
1562 2191 D
1560 2189 D
1559 2185 D
1559 2180 D
1560 2177 D
1563 2176 D
1568 2176 D
1571 2177 D
1572 2180 D
S
N
1565 2192 M
1562 2189 D
1560 2185 D
1560 2180 D
1562 2177 D
1563 2176 D
S
N
1574 2192 M
1572 2180 D
1572 2177 D
1575 2176 D
1579 2176 D
1582 2179 D
1583 2183 D
1583 2186 D
1582 2191 D
1580 2194 D
1577 2197 D
1574 2198 D
1569 2200 D
1565 2200 D
1560 2198 D
1557 2197 D
1554 2194 D
1553 2191 D
1551 2186 D
1551 2182 D
1553 2177 D
1554 2174 D
1557 2171 D
1560 2170 D
1565 2168 D
1569 2168 D
1574 2170 D
1577 2171 D
1579 2173 D
S
N
1575 2192 M
1574 2180 D
1574 2177 D
1575 2176 D
S
N
1595 2200 M
1595 2168 D
S
N
1597 2200 M
1615 2171 D
S
N
1597 2197 M
1615 2168 D
S
N
1615 2200 M
1615 2168 D
S
N
1591 2200 M
1597 2200 D
S
N
1610 2200 M
1619 2200 D
S
N
1591 2168 M
1600 2168 D
S
N
1630 2200 M
1630 2168 D
S
N
1631 2200 M
1631 2168 D
S
N
1625 2200 M
1636 2200 D
S
N
1625 2168 M
1648 2168 D
1648 2177 D
1646 2168 D
S
N
1665 2200 M
1660 2198 D
1657 2195 D
1655 2192 D
1654 2186 D
1654 2182 D
1655 2176 D
1657 2173 D
1660 2170 D
1665 2168 D
1668 2168 D
1672 2170 D
1675 2173 D
1677 2176 D
1678 2182 D
1678 2186 D
1677 2192 D
1675 2195 D
1672 2198 D
1668 2200 D
1665 2200 D
S
N
1665 2200 M
1662 2198 D
1659 2195 D
1657 2192 D
1655 2186 D
1655 2182 D
1657 2176 D
1659 2173 D
1662 2170 D
1665 2168 D
S
N
1668 2168 M
1671 2170 D
1674 2173 D
1675 2176 D
1677 2182 D
1677 2186 D
1675 2192 D
1674 2195 D
1671 2198 D
1668 2200 D
S
N
1702 2195 M
1702 2168 D
S
N
1689 2182 M
1716 2182 D
S
N
1729 2200 M
1729 2168 D
S
N
1731 2200 M
1731 2168 D
S
N
1731 2185 M
1734 2188 D
1738 2189 D
1742 2189 D
1746 2188 D
1748 2185 D
1748 2168 D
S
N
1742 2189 M
1745 2188 D
1746 2185 D
1746 2168 D
S
N
1725 2200 M
1731 2200 D
S
N
1725 2168 M
1735 2168 D
S
N
1742 2168 M
1752 2168 D
S
N
1761 2180 M
1779 2180 D
1779 2183 D
1778 2186 D
1776 2188 D
1773 2189 D
1769 2189 D
1764 2188 D
1761 2185 D
1760 2180 D
1760 2177 D
1761 2173 D
1764 2170 D
1769 2168 D
1772 2168 D
1776 2170 D
1779 2173 D
S
N
1778 2180 M
1778 2185 D
1776 2188 D
S
N
1769 2189 M
1766 2188 D
1763 2185 D
1761 2180 D
1761 2177 D
1763 2173 D
1766 2170 D
1769 2168 D
S
N
1791 2189 M
1791 2168 D
S
N
1793 2189 M
1793 2168 D
S
N
1793 2180 M
1794 2185 D
1797 2188 D
1800 2189 D
1805 2189 D
1806 2188 D
1806 2186 D
1805 2185 D
1803 2186 D
1805 2188 D
S
N
1787 2189 M
1793 2189 D
S
N
1787 2168 M
1797 2168 D
S
N
1815 2189 M
1822 2168 D
S
N
1817 2189 M
1822 2173 D
S
N
1828 2189 M
1822 2168 D
S
N
1828 2189 M
1834 2168 D
S
N
1829 2189 M
1834 2173 D
S
N
1840 2189 M
1834 2168 D
S
N
1811 2189 M
1822 2189 D
S
N
1835 2189 M
1844 2189 D
S
N
1853 2200 M
1852 2198 D
1853 2197 D
1855 2198 D
1853 2200 D
S
N
1853 2189 M
1853 2168 D
S
N
1855 2189 M
1855 2168 D
S
N
1849 2189 M
1855 2189 D
S
N
1849 2168 M
1859 2168 D
S
N
1874 2189 M
1871 2188 D
1870 2186 D
1868 2183 D
1868 2180 D
1870 2177 D
1871 2176 D
1874 2174 D
1877 2174 D
1880 2176 D
1882 2177 D
1883 2180 D
1883 2183 D
1882 2186 D
1880 2188 D
1877 2189 D
1874 2189 D
S
N
1871 2188 M
1870 2185 D
1870 2179 D
1871 2176 D
S
N
1880 2176 M
1882 2179 D
1882 2185 D
1880 2188 D
S
N
1882 2186 M
1883 2188 D
1886 2189 D
1886 2188 D
1883 2188 D
S
N
1870 2177 M
1868 2176 D
1867 2173 D
1867 2171 D
1868 2168 D
1873 2167 D
1880 2167 D
1885 2165 D
1886 2164 D
S
N
1867 2171 M
1868 2170 D
1873 2168 D
1880 2168 D
1885 2167 D
1886 2164 D
1886 2162 D
1885 2159 D
1880 2158 D
1871 2158 D
1867 2159 D
1865 2162 D
1865 2164 D
1867 2167 D
1871 2168 D
S
N
1455 2131 M
1455 2099 D
S
N
1456 2131 M
1456 2099 D
S
N
1450 2131 M
1468 2131 D
1473 2129 D
1474 2128 D
1476 2125 D
1476 2120 D
1474 2117 D
1473 2116 D
1468 2114 D
1456 2114 D
S
N
1468 2131 M
1471 2129 D
1473 2128 D
1474 2125 D
1474 2120 D
1473 2117 D
1471 2116 D
1468 2114 D
S
N
1450 2099 M
1461 2099 D
S
N
1495 2131 M
1491 2129 D
1488 2126 D
1486 2123 D
1485 2117 D
1485 2113 D
1486 2107 D
1488 2104 D
1491 2100 D
1495 2099 D
1499 2099 D
1503 2100 D
1506 2104 D
1508 2107 D
1509 2113 D
1509 2117 D
1508 2123 D
1506 2126 D
1503 2129 D
1499 2131 D
1495 2131 D
S
N
1495 2131 M
1492 2129 D
1489 2126 D
1488 2123 D
1486 2117 D
1486 2113 D
1488 2107 D
1489 2104 D
1492 2100 D
1495 2099 D
S
N
1499 2099 M
1502 2100 D
1505 2104 D
1506 2107 D
1508 2113 D
1508 2117 D
1506 2123 D
1505 2126 D
1502 2129 D
1499 2131 D
S
N
1520 2131 M
1526 2099 D
S
N
1521 2131 M
1526 2107 D
S
N
1532 2131 M
1526 2099 D
S
N
1532 2131 M
1538 2099 D
S
N
1533 2131 M
1538 2107 D
S
N
1544 2131 M
1538 2099 D
S
N
1515 2131 M
1526 2131 D
S
N
1539 2131 M
1548 2131 D
S
N
1557 2131 M
1557 2099 D
S
N
1559 2131 M
1559 2099 D
S
N
1577 2131 M
1577 2099 D
S
N
1579 2131 M
1579 2099 D
S
N
1553 2131 M
1563 2131 D
S
N
1572 2131 M
1583 2131 D
S
N
1559 2116 M
1577 2116 D
S
N
1553 2099 M
1563 2099 D
S
N
1572 2099 M
1583 2099 D
S
N
1594 2131 M
1594 2099 D
S
N
1595 2131 M
1595 2099 D
S
N
1604 2122 M
1604 2110 D
S
N
1589 2131 M
1613 2131 D
1613 2122 D
1612 2131 D
S
N
1595 2116 M
1604 2116 D
S
N
1589 2099 M
1613 2099 D
1613 2108 D
1612 2099 D
S
N
1625 2131 M
1625 2099 D
S
N
1627 2131 M
1627 2099 D
S
N
1621 2131 M
1631 2131 D
S
N
1621 2099 M
1643 2099 D
1643 2108 D
1642 2099 D
S
N
1665 2126 M
1665 2099 D
S
N
1651 2113 M
1678 2113 D
S
N
1692 2131 M
1692 2099 D
S
N
1693 2131 M
1693 2099 D
S
N
1693 2116 M
1696 2119 D
1701 2120 D
1704 2120 D
1708 2119 D
1710 2116 D
1710 2099 D
S
N
1704 2120 M
1707 2119 D
1708 2116 D
1708 2099 D
S
N
1687 2131 M
1693 2131 D
S
N
1687 2099 M
1698 2099 D
S
N
1704 2099 M
1714 2099 D
S
N
1723 2111 M
1742 2111 D
1742 2114 D
1740 2117 D
1738 2119 D
1735 2120 D
1731 2120 D
1726 2119 D
1723 2116 D
1722 2111 D
1722 2108 D
1723 2104 D
1726 2100 D
1731 2099 D
1734 2099 D
1738 2100 D
1742 2104 D
S
N
1740 2111 M
1740 2116 D
1738 2119 D
S
N
1731 2120 M
1728 2119 D
1725 2116 D
1723 2111 D
1723 2108 D
1725 2104 D
1728 2100 D
1731 2099 D
S
N
1754 2120 M
1754 2099 D
S
N
1755 2120 M
1755 2099 D
S
N
1755 2111 M
1757 2116 D
1760 2119 D
1763 2120 D
1767 2120 D
1769 2119 D
1769 2117 D
1767 2116 D
1766 2117 D
1767 2119 D
S
N
1749 2120 M
1755 2120 D
S
N
1749 2099 M
1760 2099 D
S
N
1778 2120 M
1784 2099 D
S
N
1779 2120 M
1784 2104 D
S
N
1790 2120 M
1784 2099 D
S
N
1790 2120 M
1796 2099 D
S
N
1791 2120 M
1796 2104 D
S
N
1802 2120 M
1796 2099 D
S
N
1773 2120 M
1784 2120 D
S
N
1797 2120 M
1806 2120 D
S
N
1815 2131 M
1814 2129 D
1815 2128 D
1817 2129 D
1815 2131 D
S
N
1815 2120 M
1815 2099 D
S
N
1817 2120 M
1817 2099 D
S
N
1811 2120 M
1817 2120 D
S
N
1811 2099 M
1822 2099 D
S
N
1837 2120 M
1834 2119 D
1832 2117 D
1831 2114 D
1831 2111 D
1832 2108 D
1834 2107 D
1837 2105 D
1840 2105 D
1843 2107 D
1844 2108 D
1846 2111 D
1846 2114 D
1844 2117 D
1843 2119 D
1840 2120 D
1837 2120 D
S
N
1834 2119 M
1832 2116 D
1832 2110 D
1834 2107 D
S
N
1843 2107 M
1844 2110 D
1844 2116 D
1843 2119 D
S
N
1844 2117 M
1846 2119 D
1849 2120 D
1849 2119 D
1846 2119 D
S
N
1832 2108 M
1831 2107 D
1829 2104 D
1829 2102 D
1831 2099 D
1835 2097 D
1843 2097 D
1847 2096 D
1849 2094 D
S
N
1829 2102 M
1831 2100 D
1835 2099 D
1843 2099 D
1847 2097 D
1849 2094 D
1849 2093 D
1847 2090 D
1843 2088 D
1834 2088 D
1829 2090 D
1828 2093 D
1828 2094 D
1829 2097 D
1834 2099 D
S
N
1470 2046 M
1468 2045 D
1470 2043 D
1471 2045 D
1471 2046 D
1468 2049 D
1465 2051 D
1461 2051 D
1456 2049 D
1453 2046 D
1452 2042 D
1452 2039 D
1453 2034 D
1456 2031 D
1461 2030 D
1464 2030 D
1468 2031 D
1471 2034 D
S
N
1461 2051 M
1458 2049 D
1455 2046 D
1453 2042 D
1453 2039 D
1455 2034 D
1458 2031 D
1461 2030 D
S
N
1483 2051 M
1483 2034 D
1485 2031 D
1489 2030 D
1492 2030 D
1497 2031 D
1500 2034 D
S
N
1485 2051 M
1485 2034 D
1486 2031 D
1489 2030 D
S
N
1500 2051 M
1500 2030 D
S
N
1502 2051 M
1502 2030 D
S
N
1479 2051 M
1485 2051 D
S
N
1495 2051 M
1502 2051 D
S
N
1500 2030 M
1506 2030 D
S
N
1517 2061 M
1517 2036 D
1518 2031 D
1521 2030 D
1524 2030 D
1527 2031 D
1529 2034 D
S
N
1518 2061 M
1518 2036 D
1520 2031 D
1521 2030 D
S
N
1512 2051 M
1524 2051 D
S
N
1551 2048 M
1553 2051 D
1553 2045 D
1551 2048 D
1550 2049 D
1547 2051 D
1541 2051 D
1538 2049 D
1536 2048 D
1536 2045 D
1538 2043 D
1541 2042 D
1548 2039 D
1551 2037 D
1553 2036 D
S
N
1536 2046 M
1538 2045 D
1541 2043 D
1548 2040 D
1551 2039 D
1553 2037 D
1553 2033 D
1551 2031 D
1548 2030 D
1542 2030 D
1539 2031 D
1538 2033 D
1536 2036 D
1536 2030 D
1538 2033 D
S
N
1588 2055 M
1589 2054 D
1588 2052 D
1586 2054 D
1586 2055 D
1588 2058 D
1589 2060 D
1594 2061 D
1600 2061 D
1604 2060 D
1606 2057 D
1606 2052 D
1604 2049 D
1600 2048 D
1595 2048 D
S
N
1600 2061 M
1603 2060 D
1604 2057 D
1604 2052 D
1603 2049 D
1600 2048 D
S
N
1600 2048 M
1603 2046 D
1606 2043 D
1607 2040 D
1607 2036 D
1606 2033 D
1604 2031 D
1600 2030 D
1594 2030 D
1589 2031 D
1588 2033 D
1586 2036 D
1586 2037 D
1588 2039 D
1589 2037 D
1588 2036 D
S
N
1604 2045 M
1606 2040 D
1606 2036 D
1604 2033 D
1603 2031 D
1600 2030 D
S
1 Sw
N
1986 2034 M
2003 2034 D
S
N
1986 2034 M
2003 2034 D
S
N
1986 2031 M
1986 2037 D
S
N
2003 2031 M
2003 2043 D
1998 2043 D
2003 2042 D
S
N
1986 2048 M
2003 2048 D
S
N
1986 2049 M
2003 2049 D
S
N
1986 2058 M
2003 2058 D
S
N
1986 2059 M
2003 2059 D
S
N
1986 2046 M
1986 2051 D
S
N
1986 2056 M
1986 2062 D
S
N
1994 2049 M
1994 2058 D
S
N
2003 2046 M
2003 2051 D
S
N
2003 2056 M
2003 2062 D
S
N
1988 2077 M
1991 2078 D
1986 2078 D
1988 2077 D
1987 2075 D
1986 2073 D
1986 2071 D
1987 2069 D
1988 2067 D
1990 2066 D
1992 2066 D
1996 2066 D
1999 2066 D
2000 2067 D
2002 2069 D
2003 2071 D
2003 2073 D
2002 2075 D
2000 2077 D
1999 2078 D
S
N
1986 2071 M
1987 2070 D
1988 2068 D
1990 2067 D
1992 2066 D
1996 2066 D
1999 2067 D
2000 2068 D
2002 2070 D
2003 2071 D
S
N
1986 2097 M
2003 2097 D
S
N
1986 2097 M
2003 2097 D
S
N
1986 2107 M
2003 2107 D
S
N
1986 2108 M
2003 2108 D
S
N
1986 2094 M
1986 2100 D
S
N
1986 2105 M
1986 2110 D
S
N
1994 2097 M
1994 2107 D
S
N
2003 2094 M
2003 2100 D
S
N
2003 2105 M
2003 2110 D
S
N
1986 2116 M
2003 2116 D
S
N
1986 2117 M
2003 2117 D
S
N
1986 2113 M
1986 2119 D
S
N
2003 2113 M
2003 2119 D
S
N
1988 2134 M
1991 2135 D
1986 2135 D
1988 2134 D
1987 2132 D
1986 2130 D
1986 2129 D
1987 2126 D
1988 2125 D
1990 2124 D
1992 2123 D
1996 2123 D
1999 2124 D
2000 2125 D
2002 2126 D
2003 2129 D
2003 2130 D
2002 2132 D
2000 2134 D
S
N
1986 2129 M
1987 2127 D
1988 2125 D
1990 2125 D
1992 2124 D
1996 2124 D
1999 2125 D
2000 2125 D
2002 2127 D
2003 2129 D
S
N
1996 2134 M
2003 2134 D
S
N
1996 2135 M
2003 2135 D
S
N
1996 2132 M
1996 2137 D
S
N
1988 2152 M
1991 2153 D
1986 2153 D
1988 2152 D
1987 2151 D
1986 2148 D
1986 2147 D
1987 2144 D
1988 2143 D
1990 2142 D
1992 2141 D
1996 2141 D
1999 2142 D
2000 2143 D
2002 2144 D
2003 2147 D
2003 2148 D
2002 2151 D
2000 2152 D
S
N
1986 2147 M
1987 2145 D
1988 2144 D
1990 2143 D
1992 2142 D
1996 2142 D
1999 2143 D
2000 2144 D
2002 2145 D
2003 2147 D
S
N
1996 2152 M
2003 2152 D
S
N
1996 2153 M
2003 2153 D
S
N
1996 2150 M
1996 2156 D
S
N
1988 2170 M
1986 2171 D
1991 2171 D
1988 2170 D
1987 2168 D
1986 2166 D
1986 2164 D
1987 2161 D
1988 2160 D
1990 2160 D
1991 2160 D
1992 2161 D
1993 2163 D
1995 2168 D
1995 2169 D
1997 2171 D
S
N
1990 2160 M
1991 2161 D
1992 2163 D
1994 2168 D
1995 2169 D
1995 2170 D
1997 2171 D
2000 2171 D
2002 2169 D
2003 2167 D
2003 2164 D
2002 2162 D
2000 2160 D
1998 2160 D
2003 2160 D
2000 2160 D
S
N
1986 2188 M
2003 2199 D
S
N
1986 2189 M
2003 2199 D
S
N
1986 2199 M
2003 2188 D
S
N
1986 2187 M
1986 2191 D
S
N
1986 2196 M
1986 2201 D
S
N
2003 2187 M
2003 2191 D
S
N
2003 2196 M
2003 2201 D
S
N
1988 2215 M
1986 2215 D
1991 2215 D
1988 2215 D
1987 2213 D
1986 2211 D
1986 2208 D
1987 2206 D
1988 2204 D
1990 2204 D
1991 2205 D
1992 2206 D
1993 2207 D
1995 2212 D
1995 2214 D
1997 2215 D
S
N
1990 2204 M
1991 2206 D
1992 2207 D
1994 2212 D
1995 2214 D
1995 2215 D
1997 2215 D
2000 2215 D
2002 2214 D
2003 2211 D
2003 2209 D
2002 2207 D
2000 2205 D
1998 2204 D
2003 2204 D
2000 2205 D
S
N
1986 2234 M
2003 2237 D
S
N
1986 2234 M
1999 2237 D
S
N
1986 2240 M
2003 2237 D
S
N
1986 2240 M
2003 2243 D
S
N
1986 2241 M
1999 2243 D
S
N
1986 2246 M
2003 2243 D
S
N
1986 2231 M
1986 2237 D
S
N
1986 2244 M
1986 2249 D
S
N
1988 2263 M
1991 2264 D
1986 2264 D
1988 2263 D
1987 2262 D
1986 2259 D
1986 2258 D
1987 2255 D
1988 2254 D
1990 2253 D
1992 2252 D
1996 2252 D
1999 2253 D
2000 2254 D
2002 2255 D
2003 2258 D
2003 2259 D
2002 2262 D
2000 2263 D
S
N
1986 2258 M
1987 2256 D
1988 2254 D
1990 2254 D
1992 2253 D
1996 2253 D
1999 2254 D
2000 2254 D
2002 2256 D
2003 2258 D
S
N
1996 2263 M
2003 2263 D
S
N
1996 2264 M
2003 2264 D
S
N
1996 2261 M
1996 2266 D
S
N
1989 2284 M
1990 2285 D
1991 2284 D
1990 2283 D
1989 2283 D
1987 2284 D
1987 2285 D
1986 2287 D
1986 2290 D
1987 2293 D
1987 2293 D
1989 2294 D
1991 2294 D
1992 2293 D
1994 2291 D
1995 2287 D
1996 2285 D
1998 2284 D
2000 2283 D
2003 2283 D
S
N
1986 2290 M
1987 2292 D
1987 2293 D
1989 2293 D
1991 2293 D
1992 2293 D
1994 2290 D
1995 2287 D
S
N
2001 2283 M
2000 2284 D
2000 2285 D
2002 2289 D
2002 2292 D
2001 2293 D
2000 2294 D
S
N
2000 2285 M
2003 2289 D
2003 2293 D
2002 2293 D
2000 2294 D
1999 2294 D
S
N
1986 2304 M
1987 2301 D
1989 2300 D
1993 2299 D
1995 2299 D
1999 2300 D
2002 2301 D
2003 2304 D
2003 2305 D
2002 2308 D
1999 2309 D
1995 2310 D
1993 2310 D
1989 2309 D
1987 2308 D
1986 2305 D
1986 2304 D
S
N
1986 2304 M
1987 2302 D
1987 2301 D
1989 2301 D
1993 2300 D
1995 2300 D
1999 2301 D
2001 2301 D
2002 2302 D
2003 2304 D
S
N
2003 2305 M
2002 2307 D
2001 2308 D
1999 2309 D
1995 2309 D
1993 2309 D
1989 2309 D
1987 2308 D
1987 2307 D
1986 2305 D
S
N
1989 2317 M
1988 2319 D
1986 2321 D
2003 2321 D
S
N
1987 2321 M
2003 2321 D
S
N
2003 2317 M
2003 2325 D
S
N
1989 2333 M
1988 2335 D
1986 2337 D
2003 2337 D
S
N
1987 2336 M
2003 2336 D
S
N
2003 2333 M
2003 2340 D
S
4 Sw
N
583 2342 M
583 1520 D
S
N
583 1520 M
1967 1520 D
S
N
1967 1520 M
1967 2342 D
S
N
1967 2342 M
583 2342 D
S
N
583 1520 M
1967 1520 D
S
N
583 1520 M
583 1551 D
S
N
646 1531 M
646 1520 D
S
N
709 1520 M
709 1531 D
S
N
772 1531 M
772 1520 D
S
N
835 1520 M
835 1531 D
S
N
898 1551 M
898 1520 D
S
N
960 1520 M
960 1531 D
S
N
1023 1531 M
1023 1520 D
S
N
1086 1520 M
1086 1531 D
S
N
1149 1531 M
1149 1520 D
S
N
1212 1520 M
1212 1551 D
S
N
1275 1531 M
1275 1520 D
S
N
1338 1520 M
1338 1531 D
S
N
1401 1531 M
1401 1520 D
S
N
1464 1520 M
1464 1531 D
S
N
1527 1551 M
1527 1520 D
S
N
1590 1520 M
1590 1531 D
S
N
1652 1531 M
1652 1520 D
S
N
1715 1520 M
1715 1531 D
S
N
1778 1531 M
1778 1520 D
S
N
1841 1520 M
1841 1551 D
S
N
1904 1531 M
1904 1520 D
S
N
583 2342 M
1967 2342 D
S
N
583 2311 M
583 2342 D
S
N
646 2342 M
646 2332 D
S
N
709 2332 M
709 2342 D
S
N
772 2342 M
772 2332 D
S
N
835 2332 M
835 2342 D
S
N
898 2342 M
898 2311 D
S
N
960 2332 M
960 2342 D
S
N
1023 2342 M
1023 2332 D
S
N
1086 2332 M
1086 2342 D
S
N
1149 2342 M
1149 2332 D
S
N
1212 2311 M
1212 2342 D
S
N
1275 2342 M
1275 2332 D
S
N
1338 2332 M
1338 2342 D
S
N
1401 2342 M
1401 2332 D
S
N
1464 2332 M
1464 2342 D
S
N
1527 2342 M
1527 2311 D
S
N
1590 2332 M
1590 2342 D
S
N
1652 2342 M
1652 2332 D
S
N
1715 2332 M
1715 2342 D
S
N
1778 2342 M
1778 2332 D
S
N
1841 2311 M
1841 2342 D
S
N
1904 2342 M
1904 2332 D
S
N
583 1520 M
583 2342 D
S
N
583 1520 M
593 1520 D
S
N
593 1541 M
583 1541 D
S
N
583 1560 M
593 1560 D
S
N
593 1576 M
583 1576 D
S
N
583 1590 M
614 1590 D
S
N
593 1685 M
583 1685 D
S
N
583 1741 M
593 1741 D
S
N
593 1780 M
583 1780 D
S
N
583 1811 M
614 1811 D
S
N
593 1836 M
583 1836 D
S
N
583 1857 M
593 1857 D
S
N
593 1876 M
583 1876 D
S
N
583 1892 M
593 1892 D
S
N
614 1906 M
583 1906 D
S
N
583 2001 M
593 2001 D
S
N
593 2057 M
583 2057 D
S
N
583 2096 M
593 2096 D
S
N
614 2127 M
583 2127 D
S
N
583 2152 M
593 2152 D
S
N
593 2173 M
583 2173 D
S
N
583 2191 M
593 2191 D
S
N
593 2207 M
583 2207 D
S
N
583 2222 M
614 2222 D
S
N
593 2317 M
583 2317 D
S
N
420 1598 M
423 1599 D
427 1604 D
427 1572 D
S
N
426 1602 M
426 1572 D
S
N
420 1572 M
433 1572 D
S
N
454 1604 M
450 1602 D
447 1598 D
445 1590 D
445 1586 D
447 1578 D
450 1574 D
454 1572 D
457 1572 D
462 1574 D
465 1578 D
466 1586 D
466 1590 D
465 1598 D
462 1602 D
457 1604 D
454 1604 D
S
N
454 1604 M
451 1602 D
450 1601 D
448 1598 D
447 1590 D
447 1586 D
448 1578 D
450 1575 D
451 1574 D
454 1572 D
S
N
457 1572 M
460 1574 D
462 1575 D
463 1578 D
465 1586 D
465 1590 D
463 1598 D
462 1601 D
460 1602 D
457 1604 D
S
N
477 1604 M
504 1604 D
S
N
533 1617 M
531 1616 D
533 1614 D
534 1616 D
534 1617 D
533 1620 D
530 1622 D
525 1622 D
521 1620 D
518 1617 D
516 1614 D
515 1608 D
515 1599 D
516 1595 D
519 1592 D
524 1590 D
527 1590 D
531 1592 D
534 1595 D
536 1599 D
536 1601 D
534 1605 D
531 1608 D
527 1610 D
525 1610 D
521 1608 D
518 1605 D
516 1601 D
S
N
525 1622 M
522 1620 D
519 1617 D
518 1614 D
516 1608 D
516 1599 D
518 1595 D
521 1592 D
524 1590 D
S
N
527 1590 M
530 1592 D
533 1595 D
534 1599 D
534 1601 D
533 1605 D
530 1608 D
527 1610 D
S
N
542 1825 M
539 1810 D
S
N
539 1810 M
542 1813 D
547 1814 D
551 1814 D
556 1813 D
559 1810 D
560 1805 D
560 1802 D
559 1797 D
556 1794 D
551 1793 D
547 1793 D
542 1794 D
541 1796 D
539 1799 D
539 1800 D
541 1802 D
542 1800 D
541 1799 D
S
N
551 1814 M
554 1813 D
557 1810 D
559 1805 D
559 1802 D
557 1797 D
554 1794 D
551 1793 D
S
N
542 1825 M
557 1825 D
S
N
542 1823 M
550 1823 D
557 1825 D
S
N
420 1914 M
423 1915 D
427 1920 D
427 1888 D
S
N
426 1918 M
426 1888 D
S
N
420 1888 M
433 1888 D
S
N
454 1920 M
450 1918 D
447 1914 D
445 1906 D
445 1902 D
447 1894 D
450 1890 D
454 1888 D
457 1888 D
462 1890 D
465 1894 D
466 1902 D
466 1906 D
465 1914 D
462 1918 D
457 1920 D
454 1920 D
S
N
454 1920 M
451 1918 D
450 1917 D
448 1914 D
447 1906 D
447 1902 D
448 1894 D
450 1891 D
451 1890 D
454 1888 D
S
N
457 1888 M
460 1890 D
462 1891 D
463 1894 D
465 1902 D
465 1906 D
463 1914 D
462 1917 D
460 1918 D
457 1920 D
S
N
477 1920 M
504 1920 D
S
N
518 1938 M
515 1923 D
S
N
515 1923 M
518 1926 D
522 1927 D
527 1927 D
531 1926 D
534 1923 D
536 1918 D
536 1915 D
534 1911 D
531 1908 D
527 1906 D
522 1906 D
518 1908 D
516 1909 D
515 1912 D
515 1914 D
516 1915 D
518 1914 D
516 1912 D
S
N
527 1927 M
530 1926 D
533 1923 D
534 1918 D
534 1915 D
533 1911 D
530 1908 D
527 1906 D
S
N
518 1938 M
533 1938 D
S
N
518 1936 M
525 1936 D
533 1938 D
S
N
542 2140 M
539 2125 D
S
N
539 2125 M
542 2128 D
547 2130 D
551 2130 D
556 2128 D
559 2125 D
560 2121 D
560 2118 D
559 2113 D
556 2110 D
551 2109 D
547 2109 D
542 2110 D
541 2112 D
539 2115 D
539 2116 D
541 2118 D
542 2116 D
541 2115 D
S
N
551 2130 M
554 2128 D
557 2125 D
559 2121 D
559 2118 D
557 2113 D
554 2110 D
551 2109 D
S
N
542 2140 M
557 2140 D
S
N
542 2139 M
550 2139 D
557 2140 D
S
N
420 2229 M
423 2231 D
427 2236 D
427 2204 D
S
N
426 2234 M
426 2204 D
S
N
420 2204 M
433 2204 D
S
N
454 2236 M
450 2234 D
447 2229 D
445 2222 D
445 2217 D
447 2210 D
450 2205 D
454 2204 D
457 2204 D
462 2205 D
465 2210 D
466 2217 D
466 2222 D
465 2229 D
462 2234 D
457 2236 D
454 2236 D
S
N
454 2236 M
451 2234 D
450 2232 D
448 2229 D
447 2222 D
447 2217 D
448 2210 D
450 2207 D
451 2205 D
454 2204 D
S
N
457 2204 M
460 2205 D
462 2207 D
463 2210 D
465 2217 D
465 2222 D
463 2229 D
462 2232 D
460 2234 D
457 2236 D
S
N
477 2236 M
504 2236 D
S
N
528 2251 M
528 2222 D
S
N
530 2254 M
530 2222 D
S
N
530 2254 M
513 2231 D
537 2231 D
S
N
524 2222 M
534 2222 D
S
N
1957 1520 M
1967 1520 D
S
N
1967 1541 M
1957 1541 D
S
N
1957 1560 M
1967 1560 D
S
N
1967 1576 M
1957 1576 D
S
N
1936 1590 M
1967 1590 D
S
N
1967 1685 M
1957 1685 D
S
N
1957 1741 M
1967 1741 D
S
N
1967 1780 M
1957 1780 D
S
N
1936 1811 M
1967 1811 D
S
N
1967 1836 M
1957 1836 D
S
N
1957 1857 M
1967 1857 D
S
N
1967 1876 M
1957 1876 D
S
N
1957 1892 M
1967 1892 D
S
N
1967 1906 M
1936 1906 D
S
N
1957 2001 M
1967 2001 D
S
N
1967 2057 M
1957 2057 D
S
N
1957 2096 M
1967 2096 D
S
N
1967 2127 M
1936 2127 D
S
N
1957 2152 M
1967 2152 D
S
N
1967 2173 M
1957 2173 D
S
N
1957 2191 M
1967 2191 D
S
N
1967 2207 M
1957 2207 D
S
N
1936 2222 M
1967 2222 D
S
N
1967 2317 M
1957 2317 D
S
N
1327 2186 M
1431 2186 D
S
583 1520 P
N
583 1520 M
583 1520 D
S
N
709 1520 M
709 2279 D
772 2279 D
772 2222 D
835 2222 D
835 2175 D
898 2175 D
898 2130 D
960 2130 D
960 2083 D
1023 2083 D
1023 2041 D
1086 2041 D
1086 1999 D
1149 1999 D
1149 1965 D
1212 1965 D
1212 1932 D
1275 1932 D
1275 1886 D
1338 1886 D
1338 1851 D
1401 1851 D
1401 1822 D
1464 1822 D
1464 1791 D
1527 1791 D
1527 1746 D
1590 1746 D
1590 1724 D
1652 1724 D
1652 1687 D
1715 1687 D
1715 1656 D
1778 1656 D
1778 1633 D
1841 1633 D
1841 1606 D
1904 1606 D
1904 1581 D
1967 1581 D
S
0 0 1 setrgbcolor
N
1327 2117 M
1339 2117 D
S
N
1351 2117 M
1363 2117 D
S
N
1375 2117 M
1387 2117 D
S
N
1400 2117 M
1412 2117 D
S
N
1424 2117 M
1431 2117 D
S
583 1520 P
N
583 1520 M
583 1520 D
S
N
709 1520 M
709 1532 D
S
N
709 1544 M
709 1556 D
S
N
709 1569 M
709 1581 D
S
N
709 1593 M
709 1605 D
S
N
709 1617 M
709 1629 D
S
N
709 1641 M
709 1653 D
S
N
709 1665 M
709 1678 D
S
N
709 1690 M
709 1702 D
S
N
709 1714 M
709 1726 D
S
N
709 1738 M
709 1750 D
S
N
709 1762 M
709 1774 D
S
N
709 1787 M
709 1799 D
S
N
709 1811 M
709 1823 D
S
N
709 1835 M
709 1847 D
S
N
709 1859 M
709 1871 D
S
N
709 1883 M
709 1896 D
S
N
709 1908 M
709 1920 D
S
N
709 1932 M
709 1944 D
S
N
709 1956 M
709 1968 D
S
N
709 1980 M
709 1992 D
S
N
709 2005 M
709 2017 D
S
N
709 2029 M
709 2041 D
S
N
709 2053 M
709 2065 D
S
N
709 2077 M
709 2089 D
S
N
709 2101 M
709 2114 D
S
N
709 2126 M
709 2138 D
S
N
709 2150 M
709 2162 D
S
N
709 2174 M
709 2186 D
S
N
709 2198 M
709 2210 D
S
N
709 2223 M
709 2235 D
S
N
709 2247 M
709 2259 D
S
N
709 2271 M
709 2278 D
714 2278 D
S
N
726 2278 M
738 2278 D
S
N
750 2278 M
762 2278 D
S
N
772 2275 M
772 2263 D
S
N
772 2251 M
772 2239 D
S
N
772 2227 M
772 2224 D
781 2224 D
S
N
793 2224 M
805 2224 D
S
N
817 2224 M
829 2224 D
S
N
835 2217 M
835 2205 D
S
N
835 2193 M
835 2181 D
S
N
840 2174 M
852 2174 D
S
N
864 2174 M
876 2174 D
S
N
888 2174 M
898 2174 D
898 2171 D
S
N
898 2159 M
898 2147 D
S
N
898 2135 M
898 2124 D
899 2124 D
S
N
911 2124 M
923 2124 D
S
N
936 2124 M
948 2124 D
S
N
960 2124 M
960 2124 D
960 2113 D
S
N
960 2101 M
960 2089 D
S
N
965 2081 M
977 2081 D
S
N
989 2081 M
1002 2081 D
S
N
1014 2081 M
1023 2081 D
1023 2079 D
S
N
1023 2067 M
1023 2055 D
S
N
1023 2043 M
1023 2039 D
1032 2039 D
S
N
1044 2039 M
1056 2039 D
S
N
1068 2039 M
1080 2039 D
S
N
1086 2033 M
1086 2021 D
S
N
1086 2009 M
1086 1999 D
1089 1999 D
S
N
1101 1999 M
1113 1999 D
S
N
1125 1999 M
1137 1999 D
S
N
1149 1999 M
1149 1999 D
1149 1987 D
S
N
1149 1975 M
1149 1963 D
S
N
1157 1958 M
1169 1958 D
S
N
1181 1958 M
1193 1958 D
S
N
1205 1958 M
1212 1958 D
1212 1953 D
S
N
1212 1941 M
1212 1929 D
S
N
1222 1927 M
1235 1927 D
S
N
1247 1927 M
1259 1927 D
S
N
1271 1927 M
1275 1927 D
1275 1919 D
S
N
1275 1907 M
1275 1895 D
S
N
1277 1885 M
1289 1885 D
S
N
1301 1885 M
1314 1885 D
S
N
1326 1885 M
1338 1885 D
S
N
1338 1873 M
1338 1861 D
S
N
1338 1849 M
1338 1848 D
1349 1848 D
S
N
1361 1848 M
1373 1848 D
S
N
1386 1848 M
1398 1848 D
S
N
1401 1839 M
1401 1827 D
S
N
1401 1815 M
1401 1806 D
1404 1806 D
S
N
1416 1806 M
1428 1806 D
S
N
1440 1806 M
1452 1806 D
S
N
1464 1805 M
1464 1793 D
S
N
1464 1781 M
1464 1770 D
1465 1770 D
S
N
1477 1770 M
1489 1770 D
S
N
1501 1770 M
1513 1770 D
S
N
1525 1770 M
1527 1770 D
1527 1759 D
S
N
1527 1747 M
1527 1736 D
1528 1736 D
S
N
1540 1736 M
1552 1736 D
S
N
1564 1736 M
1576 1736 D
S
N
1588 1736 M
1590 1736 D
1590 1725 D
S
N
1591 1714 M
1603 1714 D
S
N
1615 1714 M
1627 1714 D
S
N
1639 1714 M
1651 1714 D
S
N
1652 1703 M
1652 1691 D
S
N
1661 1687 M
1673 1687 D
S
N
1685 1687 M
1697 1687 D
S
N
1709 1687 M
1715 1687 D
1715 1681 D
S
N
1715 1669 M
1715 1657 D
S
N
1715 1645 M
1715 1639 D
1721 1639 D
S
N
1734 1639 M
1746 1639 D
S
N
1758 1639 M
1770 1639 D
S
N
1778 1635 M
1778 1623 D
1779 1623 D
S
N
1791 1623 M
1803 1623 D
S
N
1815 1623 M
1827 1623 D
S
N
1839 1623 M
1841 1623 D
1841 1613 D
S
N
1841 1601 M
1841 1589 D
1841 1589 D
S
N
1854 1589 M
1866 1589 D
S
N
1878 1589 M
1890 1589 D
S
N
1902 1589 M
1904 1589 D
1904 1579 D
S
N
1905 1568 M
1917 1568 D
S
N
1930 1568 M
1942 1568 D
S
N
1954 1568 M
1966 1568 D
S
3 Sw
0 0 0 setrgbcolor
N
833 1477 M
833 1476 D
832 1476 D
832 1477 D
833 1478 D
836 1480 D
841 1480 D
844 1478 D
845 1477 D
847 1474 D
847 1465 D
848 1462 D
849 1461 D
S
N
845 1477 M
845 1465 D
847 1462 D
849 1461 D
851 1461 D
S
N
845 1474 M
844 1473 D
836 1472 D
832 1470 D
830 1467 D
830 1465 D
832 1462 D
836 1461 D
840 1461 D
843 1462 D
845 1465 D
S
N
836 1472 M
833 1470 D
832 1467 D
832 1465 D
833 1462 D
836 1461 D
S
N
860 1489 M
860 1461 D
S
N
862 1489 M
870 1465 D
S
N
860 1489 M
870 1461 D
S
N
879 1489 M
870 1461 D
S
N
879 1489 M
879 1461 D
S
N
881 1489 M
881 1461 D
S
N
856 1489 M
862 1489 D
S
N
879 1489 M
885 1489 D
S
N
856 1461 M
864 1461 D
S
N
875 1461 M
885 1461 D
S
N
911 1485 M
912 1481 D
912 1489 D
911 1485 D
908 1488 D
904 1489 D
901 1489 D
897 1488 D
895 1485 D
893 1482 D
892 1478 D
892 1472 D
893 1467 D
895 1465 D
897 1462 D
901 1461 D
904 1461 D
908 1462 D
911 1465 D
912 1467 D
S
N
901 1489 M
899 1488 D
896 1485 D
895 1482 D
893 1478 D
893 1472 D
895 1467 D
896 1465 D
899 1462 D
901 1461 D
S
N
941 1478 M
940 1481 D
937 1482 D
933 1482 D
930 1481 D
929 1480 D
927 1476 D
927 1472 D
929 1469 D
931 1467 D
936 1467 D
938 1469 D
940 1472 D
S
N
933 1482 M
930 1480 D
929 1476 D
929 1472 D
930 1469 D
931 1467 D
S
N
941 1482 M
940 1472 D
940 1469 D
942 1467 D
945 1467 D
948 1470 D
949 1474 D
949 1477 D
948 1481 D
947 1484 D
944 1487 D
941 1488 D
937 1489 D
933 1489 D
929 1488 D
926 1487 D
923 1484 D
922 1481 D
921 1477 D
921 1473 D
922 1469 D
923 1466 D
926 1463 D
929 1462 D
933 1461 D
937 1461 D
941 1462 D
944 1463 D
945 1465 D
S
N
942 1482 M
941 1472 D
941 1469 D
942 1467 D
S
N
960 1489 M
960 1461 D
S
N
962 1489 M
978 1463 D
S
N
962 1487 M
978 1461 D
S
N
978 1489 M
978 1461 D
S
N
956 1489 M
962 1489 D
S
N
974 1489 M
982 1489 D
S
N
956 1461 M
964 1461 D
S
N
992 1489 M
992 1461 D
S
N
993 1489 M
993 1461 D
S
N
988 1489 M
997 1489 D
S
N
988 1461 M
1008 1461 D
1008 1469 D
1007 1461 D
S
N
1023 1489 M
1019 1488 D
1016 1485 D
1015 1482 D
1014 1477 D
1014 1473 D
1015 1467 D
1016 1465 D
1019 1462 D
1023 1461 D
1026 1461 D
1030 1462 D
1033 1465 D
1034 1467 D
1035 1473 D
1035 1477 D
1034 1482 D
1033 1485 D
1030 1488 D
1026 1489 D
1023 1489 D
S
N
1023 1489 M
1020 1488 D
1018 1485 D
1016 1482 D
1015 1477 D
1015 1473 D
1016 1467 D
1018 1465 D
1020 1462 D
1023 1461 D
S
N
1026 1461 M
1029 1462 D
1031 1465 D
1033 1467 D
1034 1473 D
1034 1477 D
1033 1482 D
1031 1485 D
1029 1488 D
1026 1489 D
S
N
1046 1480 M
1045 1478 D
1046 1477 D
1048 1478 D
1046 1480 D
S
N
1046 1463 M
1045 1462 D
1046 1461 D
1048 1462 D
1046 1463 D
S
N
1093 1477 M
1094 1480 D
1094 1474 D
1093 1477 D
1092 1478 D
1089 1480 D
1083 1480 D
1081 1478 D
1079 1477 D
1079 1474 D
1081 1473 D
1083 1472 D
1090 1469 D
1093 1467 D
1094 1466 D
S
N
1079 1476 M
1081 1474 D
1083 1473 D
1090 1470 D
1093 1469 D
1094 1467 D
1094 1463 D
1093 1462 D
1090 1461 D
1085 1461 D
1082 1462 D
1081 1463 D
1079 1466 D
1079 1461 D
1081 1463 D
S
N
1119 1476 M
1118 1474 D
1119 1473 D
1120 1474 D
1120 1476 D
1118 1478 D
1115 1480 D
1111 1480 D
1107 1478 D
1104 1476 D
1103 1472 D
1103 1469 D
1104 1465 D
1107 1462 D
1111 1461 D
1114 1461 D
1118 1462 D
1120 1465 D
S
N
1111 1480 M
1108 1478 D
1105 1476 D
1104 1472 D
1104 1469 D
1105 1465 D
1108 1462 D
1111 1461 D
S
N
1131 1477 M
1131 1476 D
1130 1476 D
1130 1477 D
1131 1478 D
1134 1480 D
1140 1480 D
1142 1478 D
1144 1477 D
1145 1474 D
1145 1465 D
1146 1462 D
1148 1461 D
S
N
1144 1477 M
1144 1465 D
1145 1462 D
1148 1461 D
1149 1461 D
S
N
1144 1474 M
1142 1473 D
1134 1472 D
1130 1470 D
1129 1467 D
1129 1465 D
1130 1462 D
1134 1461 D
1138 1461 D
1141 1462 D
1144 1465 D
S
N
1134 1472 M
1131 1470 D
1130 1467 D
1130 1465 D
1131 1462 D
1134 1461 D
S
N
1159 1489 M
1159 1461 D
S
N
1160 1489 M
1160 1461 D
S
N
1155 1489 M
1160 1489 D
S
N
1155 1461 M
1164 1461 D
S
N
1172 1472 M
1189 1472 D
1189 1474 D
1187 1477 D
1186 1478 D
1183 1480 D
1179 1480 D
1175 1478 D
1172 1476 D
1171 1472 D
1171 1469 D
1172 1465 D
1175 1462 D
1179 1461 D
1182 1461 D
1186 1462 D
1189 1465 D
S
N
1187 1472 M
1187 1476 D
1186 1478 D
S
N
1179 1480 M
1176 1478 D
1174 1476 D
1172 1472 D
1172 1469 D
1174 1465 D
1176 1462 D
1179 1461 D
S
N
1222 1480 M
1222 1465 D
1223 1462 D
1227 1461 D
1230 1461 D
1234 1462 D
1237 1465 D
S
N
1223 1480 M
1223 1465 D
1224 1462 D
1227 1461 D
S
N
1237 1480 M
1237 1461 D
S
N
1238 1480 M
1238 1461 D
S
N
1218 1480 M
1223 1480 D
S
N
1233 1480 M
1238 1480 D
S
N
1237 1461 M
1242 1461 D
S
N
1252 1480 M
1252 1461 D
S
N
1253 1480 M
1253 1461 D
S
N
1253 1476 M
1256 1478 D
1260 1480 D
1263 1480 D
1267 1478 D
1268 1476 D
1268 1461 D
S
N
1263 1480 M
1265 1478 D
1267 1476 D
1267 1461 D
S
N
1248 1480 M
1253 1480 D
S
N
1248 1461 M
1257 1461 D
S
N
1263 1461 M
1272 1461 D
S
N
1296 1476 M
1294 1474 D
1296 1473 D
1297 1474 D
1297 1476 D
1294 1478 D
1291 1480 D
1287 1480 D
1283 1478 D
1281 1476 D
1279 1472 D
1279 1469 D
1281 1465 D
1283 1462 D
1287 1461 D
1290 1461 D
1294 1462 D
1297 1465 D
S
N
1287 1480 M
1285 1478 D
1282 1476 D
1281 1472 D
1281 1469 D
1282 1465 D
1285 1462 D
1287 1461 D
S
N
1308 1463 M
1307 1462 D
1308 1461 D
1309 1462 D
1308 1463 D
S
N
833 1304 M
833 1303 D
832 1303 D
832 1304 D
833 1305 D
836 1307 D
841 1307 D
844 1305 D
845 1304 D
847 1301 D
847 1292 D
848 1289 D
849 1288 D
S
N
845 1304 M
845 1292 D
847 1289 D
849 1288 D
851 1288 D
S
N
845 1301 M
844 1300 D
836 1299 D
832 1297 D
830 1294 D
830 1292 D
832 1289 D
836 1288 D
840 1288 D
843 1289 D
845 1292 D
S
N
836 1299 M
833 1297 D
832 1294 D
832 1292 D
833 1289 D
836 1288 D
S
N
860 1316 M
860 1288 D
S
N
862 1316 M
870 1292 D
S
N
860 1316 M
870 1288 D
S
N
879 1316 M
870 1288 D
S
N
879 1316 M
879 1288 D
S
N
881 1316 M
881 1288 D
S
N
856 1316 M
862 1316 D
S
N
879 1316 M
885 1316 D
S
N
856 1288 M
864 1288 D
S
N
875 1288 M
885 1288 D
S
N
911 1312 M
912 1308 D
912 1316 D
911 1312 D
908 1315 D
904 1316 D
901 1316 D
897 1315 D
895 1312 D
893 1309 D
892 1305 D
892 1299 D
893 1294 D
895 1292 D
897 1289 D
901 1288 D
904 1288 D
908 1289 D
911 1292 D
912 1294 D
S
N
901 1316 M
899 1315 D
896 1312 D
895 1309 D
893 1305 D
893 1299 D
895 1294 D
896 1292 D
899 1289 D
901 1288 D
S
N
941 1305 M
940 1308 D
937 1309 D
933 1309 D
930 1308 D
929 1307 D
927 1303 D
927 1299 D
929 1296 D
931 1294 D
936 1294 D
938 1296 D
940 1299 D
S
N
933 1309 M
930 1307 D
929 1303 D
929 1299 D
930 1296 D
931 1294 D
S
N
941 1309 M
940 1299 D
940 1296 D
942 1294 D
945 1294 D
948 1297 D
949 1301 D
949 1304 D
948 1308 D
947 1311 D
944 1314 D
941 1315 D
937 1316 D
933 1316 D
929 1315 D
926 1314 D
923 1311 D
922 1308 D
921 1304 D
921 1300 D
922 1296 D
923 1293 D
926 1290 D
929 1289 D
933 1288 D
937 1288 D
941 1289 D
944 1290 D
945 1292 D
S
N
942 1309 M
941 1299 D
941 1296 D
942 1294 D
S
N
960 1316 M
960 1288 D
S
N
962 1316 M
978 1290 D
S
N
962 1314 M
978 1288 D
S
N
978 1316 M
978 1288 D
S
N
956 1316 M
962 1316 D
S
N
974 1316 M
982 1316 D
S
N
956 1288 M
964 1288 D
S
N
992 1316 M
992 1288 D
S
N
993 1316 M
993 1288 D
S
N
988 1316 M
997 1316 D
S
N
988 1288 M
1008 1288 D
1008 1296 D
1007 1288 D
S
N
1023 1316 M
1019 1315 D
1016 1312 D
1015 1309 D
1014 1304 D
1014 1300 D
1015 1294 D
1016 1292 D
1019 1289 D
1023 1288 D
1026 1288 D
1030 1289 D
1033 1292 D
1034 1294 D
1035 1300 D
1035 1304 D
1034 1309 D
1033 1312 D
1030 1315 D
1026 1316 D
1023 1316 D
S
N
1023 1316 M
1020 1315 D
1018 1312 D
1016 1309 D
1015 1304 D
1015 1300 D
1016 1294 D
1018 1292 D
1020 1289 D
1023 1288 D
S
N
1026 1288 M
1029 1289 D
1031 1292 D
1033 1294 D
1034 1300 D
1034 1304 D
1033 1309 D
1031 1312 D
1029 1315 D
1026 1316 D
S
N
1046 1307 M
1045 1305 D
1046 1304 D
1048 1305 D
1046 1307 D
S
N
1046 1290 M
1045 1289 D
1046 1288 D
1048 1289 D
1046 1290 D
S
N
1082 1307 M
1082 1278 D
S
N
1083 1307 M
1083 1278 D
S
N
1083 1303 M
1086 1305 D
1089 1307 D
1092 1307 D
1096 1305 D
1098 1303 D
1100 1299 D
1100 1296 D
1098 1292 D
1096 1289 D
1092 1288 D
1089 1288 D
1086 1289 D
1083 1292 D
S
N
1092 1307 M
1094 1305 D
1097 1303 D
1098 1299 D
1098 1296 D
1097 1292 D
1094 1289 D
1092 1288 D
S
N
1078 1307 M
1083 1307 D
S
N
1078 1278 M
1088 1278 D
S
N
1124 1316 M
1124 1288 D
S
N
1126 1316 M
1126 1288 D
S
N
1124 1303 M
1122 1305 D
1119 1307 D
1116 1307 D
1112 1305 D
1109 1303 D
1108 1299 D
1108 1296 D
1109 1292 D
1112 1289 D
1116 1288 D
1119 1288 D
1122 1289 D
1124 1292 D
S
N
1116 1307 M
1114 1305 D
1111 1303 D
1109 1299 D
1109 1296 D
1111 1292 D
1114 1289 D
1116 1288 D
S
N
1120 1316 M
1126 1316 D
S
N
1124 1288 M
1130 1288 D
S
N
1146 1315 M
1145 1314 D
1146 1312 D
1148 1314 D
1148 1315 D
1146 1316 D
1144 1316 D
1141 1315 D
1140 1312 D
1140 1288 D
S
N
1144 1316 M
1142 1315 D
1141 1312 D
1141 1288 D
S
N
1135 1307 M
1146 1307 D
S
N
1135 1288 M
1145 1288 D
S
N
1179 1307 M
1179 1292 D
1181 1289 D
1185 1288 D
1187 1288 D
1192 1289 D
1194 1292 D
S
N
1181 1307 M
1181 1292 D
1182 1289 D
1185 1288 D
S
N
1194 1307 M
1194 1288 D
S
N
1196 1307 M
1196 1288 D
S
N
1175 1307 M
1181 1307 D
S
N
1190 1307 M
1196 1307 D
S
N
1194 1288 M
1200 1288 D
S
N
1209 1307 M
1209 1288 D
S
N
1211 1307 M
1211 1288 D
S
N
1211 1303 M
1213 1305 D
1218 1307 D
1220 1307 D
1224 1305 D
1226 1303 D
1226 1288 D
S
N
1220 1307 M
1223 1305 D
1224 1303 D
1224 1288 D
S
N
1205 1307 M
1211 1307 D
S
N
1205 1288 M
1215 1288 D
S
N
1220 1288 M
1230 1288 D
S
N
1253 1303 M
1252 1301 D
1253 1300 D
1254 1301 D
1254 1303 D
1252 1305 D
1249 1307 D
1245 1307 D
1241 1305 D
1238 1303 D
1237 1299 D
1237 1296 D
1238 1292 D
1241 1289 D
1245 1288 D
1248 1288 D
1252 1289 D
1254 1292 D
S
N
1245 1307 M
1242 1305 D
1239 1303 D
1238 1299 D
1238 1296 D
1239 1292 D
1242 1289 D
1245 1288 D
S
N
1265 1290 M
1264 1289 D
1265 1288 D
1267 1289 D
1265 1290 D
S
4 Sw
N
583 1520 M
583 1261 D
S
N
583 1261 M
1967 1261 D
S
N
1967 1261 M
1967 1520 D
S
N
1967 1520 M
583 1520 D
S
N
583 1261 M
1967 1261 D
S
N
583 1261 M
583 1276 D
S
N
646 1266 M
646 1261 D
S
N
709 1261 M
709 1266 D
S
N
772 1266 M
772 1261 D
S
N
835 1261 M
835 1266 D
S
N
898 1276 M
898 1261 D
S
N
960 1261 M
960 1266 D
S
N
1023 1266 M
1023 1261 D
S
N
1086 1261 M
1086 1266 D
S
N
1149 1266 M
1149 1261 D
S
N
1212 1261 M
1212 1276 D
S
N
1275 1266 M
1275 1261 D
S
N
1338 1261 M
1338 1266 D
S
N
1401 1266 M
1401 1261 D
S
N
1464 1261 M
1464 1266 D
S
N
1527 1276 M
1527 1261 D
S
N
1590 1261 M
1590 1266 D
S
N
1652 1266 M
1652 1261 D
S
N
1715 1261 M
1715 1266 D
S
N
1778 1266 M
1778 1261 D
S
N
1841 1261 M
1841 1276 D
S
N
1904 1266 M
1904 1261 D
S
N
583 1520 M
1967 1520 D
S
N
583 1505 M
583 1520 D
S
N
646 1520 M
646 1515 D
S
N
709 1515 M
709 1520 D
S
N
772 1520 M
772 1515 D
S
N
835 1515 M
835 1520 D
S
N
898 1520 M
898 1505 D
S
N
960 1515 M
960 1520 D
S
N
1023 1520 M
1023 1515 D
S
N
1086 1515 M
1086 1520 D
S
N
1149 1520 M
1149 1515 D
S
N
1212 1505 M
1212 1520 D
S
N
1275 1520 M
1275 1515 D
S
N
1338 1515 M
1338 1520 D
S
N
1401 1520 M
1401 1515 D
S
N
1464 1515 M
1464 1520 D
S
N
1527 1520 M
1527 1505 D
S
N
1590 1515 M
1590 1520 D
S
N
1652 1520 M
1652 1515 D
S
N
1715 1515 M
1715 1520 D
S
N
1778 1520 M
1778 1515 D
S
N
1841 1505 M
1841 1520 D
S
N
1904 1520 M
1904 1515 D
S
N
583 1261 M
583 1520 D
S
N
583 1261 M
588 1261 D
S
N
588 1273 M
583 1273 D
S
N
583 1285 M
599 1285 D
S
N
588 1297 M
583 1297 D
S
N
583 1309 M
588 1309 D
S
N
588 1321 M
583 1321 D
S
N
583 1333 M
588 1333 D
S
N
599 1345 M
583 1345 D
S
N
583 1357 M
588 1357 D
S
N
588 1369 M
583 1369 D
S
N
583 1381 M
588 1381 D
S
N
588 1394 M
583 1394 D
S
N
583 1406 M
599 1406 D
S
N
588 1418 M
583 1418 D
S
N
583 1430 M
588 1430 D
S
N
588 1442 M
583 1442 D
S
N
583 1454 M
588 1454 D
S
N
599 1466 M
583 1466 D
S
N
583 1478 M
588 1478 D
S
N
588 1490 M
583 1490 D
S
N
583 1502 M
588 1502 D
S
N
588 1514 M
583 1514 D
S
N
503 1298 M
498 1297 D
495 1292 D
494 1285 D
494 1280 D
495 1273 D
498 1268 D
503 1267 D
506 1267 D
510 1268 D
513 1273 D
515 1280 D
515 1285 D
513 1292 D
510 1297 D
506 1298 D
503 1298 D
S
N
503 1298 M
500 1297 D
498 1295 D
497 1292 D
495 1285 D
495 1280 D
497 1273 D
498 1270 D
500 1268 D
503 1267 D
S
N
506 1267 M
509 1268 D
510 1270 D
512 1273 D
513 1280 D
513 1285 D
512 1292 D
510 1295 D
509 1297 D
506 1298 D
S
N
527 1270 M
525 1268 D
527 1267 D
528 1268 D
527 1270 D
S
N
547 1298 M
542 1297 D
541 1294 D
541 1289 D
542 1286 D
547 1285 D
553 1285 D
557 1286 D
559 1289 D
559 1294 D
557 1297 D
553 1298 D
547 1298 D
S
N
547 1298 M
544 1297 D
542 1294 D
542 1289 D
544 1286 D
547 1285 D
S
N
553 1285 M
556 1286 D
557 1289 D
557 1294 D
556 1297 D
553 1298 D
S
N
547 1285 M
542 1283 D
541 1282 D
539 1279 D
539 1273 D
541 1270 D
542 1268 D
547 1267 D
553 1267 D
557 1268 D
559 1270 D
560 1273 D
560 1279 D
559 1282 D
557 1283 D
553 1285 D
S
N
547 1285 M
544 1283 D
542 1282 D
541 1279 D
541 1273 D
542 1270 D
544 1268 D
547 1267 D
S
N
553 1267 M
556 1268 D
557 1270 D
559 1273 D
559 1279 D
557 1282 D
556 1283 D
553 1285 D
S
N
503 1359 M
498 1357 D
495 1353 D
494 1345 D
494 1341 D
495 1333 D
498 1329 D
503 1327 D
506 1327 D
510 1329 D
513 1333 D
515 1341 D
515 1345 D
513 1353 D
510 1357 D
506 1359 D
503 1359 D
S
N
503 1359 M
500 1357 D
498 1356 D
497 1353 D
495 1345 D
495 1341 D
497 1333 D
498 1330 D
500 1329 D
503 1327 D
S
N
506 1327 M
509 1329 D
510 1330 D
512 1333 D
513 1341 D
513 1345 D
512 1353 D
510 1356 D
509 1357 D
506 1359 D
S
N
527 1330 M
525 1329 D
527 1327 D
528 1329 D
527 1330 D
S
N
559 1348 M
557 1344 D
554 1341 D
550 1339 D
548 1339 D
544 1341 D
541 1344 D
539 1348 D
539 1350 D
541 1354 D
544 1357 D
548 1359 D
551 1359 D
556 1357 D
559 1354 D
560 1350 D
560 1341 D
559 1335 D
557 1332 D
554 1329 D
550 1327 D
545 1327 D
542 1329 D
541 1332 D
541 1333 D
542 1335 D
544 1333 D
542 1332 D
S
N
548 1339 M
545 1341 D
542 1344 D
541 1348 D
541 1350 D
542 1354 D
545 1357 D
548 1359 D
S
N
551 1359 M
554 1357 D
557 1354 D
559 1350 D
559 1341 D
557 1335 D
556 1332 D
553 1329 D
550 1327 D
S
N
498 1413 M
501 1415 D
506 1419 D
506 1387 D
S
N
504 1418 M
504 1387 D
S
N
498 1387 M
512 1387 D
S
N
527 1390 M
525 1389 D
527 1387 D
528 1389 D
527 1390 D
S
N
548 1419 M
544 1418 D
541 1413 D
539 1406 D
539 1401 D
541 1394 D
544 1389 D
548 1387 D
551 1387 D
556 1389 D
559 1394 D
560 1401 D
560 1406 D
559 1413 D
556 1418 D
551 1419 D
548 1419 D
S
N
548 1419 M
545 1418 D
544 1416 D
542 1413 D
541 1406 D
541 1401 D
542 1394 D
544 1390 D
545 1389 D
548 1387 D
S
N
551 1387 M
554 1389 D
556 1390 D
557 1394 D
559 1401 D
559 1406 D
557 1413 D
556 1416 D
554 1418 D
551 1419 D
S
N
498 1473 M
501 1475 D
506 1480 D
506 1448 D
S
N
504 1478 M
504 1448 D
S
N
498 1448 M
512 1448 D
S
N
527 1451 M
525 1449 D
527 1448 D
528 1449 D
527 1451 D
S
N
544 1473 M
547 1475 D
551 1480 D
551 1448 D
S
N
550 1478 M
550 1448 D
S
N
544 1448 M
557 1448 D
S
N
1962 1261 M
1967 1261 D
S
N
1967 1273 M
1962 1273 D
S
N
1951 1285 M
1967 1285 D
S
N
1967 1297 M
1962 1297 D
S
N
1962 1309 M
1967 1309 D
S
N
1967 1321 M
1962 1321 D
S
N
1962 1333 M
1967 1333 D
S
N
1967 1345 M
1951 1345 D
S
N
1962 1357 M
1967 1357 D
S
N
1967 1369 M
1962 1369 D
S
N
1962 1381 M
1967 1381 D
S
N
1967 1394 M
1962 1394 D
S
N
1951 1406 M
1967 1406 D
S
N
1967 1418 M
1962 1418 D
S
N
1962 1430 M
1967 1430 D
S
N
1967 1442 M
1962 1442 D
S
N
1962 1454 M
1967 1454 D
S
N
1967 1466 M
1951 1466 D
S
N
1962 1478 M
1967 1478 D
S
N
1967 1490 M
1962 1490 D
S
N
1962 1502 M
1967 1502 D
S
N
1967 1514 M
1962 1514 D
S
N
709 1261 M
709 1425 D
772 1425 D
772 1426 D
835 1426 D
835 1426 D
898 1426 D
898 1427 D
960 1427 D
960 1427 D
1023 1427 D
1023 1427 D
1086 1427 D
1086 1428 D
1149 1428 D
1149 1429 D
1212 1429 D
1212 1430 D
1275 1430 D
1275 1431 D
1338 1431 D
1338 1431 D
1401 1431 D
1401 1431 D
1464 1431 D
1464 1433 D
1527 1433 D
1527 1433 D
1590 1433 D
1590 1437 D
1652 1437 D
1652 1434 D
1715 1434 D
1715 1435 D
1778 1435 D
1778 1437 D
1841 1437 D
1841 1438 D
1904 1438 D
1904 1443 D
1967 1443 D
S
N
709 1261 M
709 1383 D
772 1383 D
772 1383 D
835 1383 D
835 1382 D
898 1382 D
898 1382 D
960 1382 D
960 1381 D
1023 1381 D
1023 1381 D
1086 1381 D
1086 1380 D
1149 1380 D
1149 1380 D
1212 1380 D
1212 1379 D
1275 1379 D
1275 1378 D
1338 1378 D
1338 1378 D
1401 1378 D
1401 1377 D
1464 1377 D
1464 1375 D
1527 1375 D
1527 1376 D
1590 1376 D
1590 1372 D
1652 1372 D
1652 1375 D
1715 1375 D
1715 1374 D
1778 1374 D
1778 1371 D
1841 1371 D
1841 1371 D
1904 1371 D
1904 1365 D
1967 1365 D
S
N
721 1304 M
808 1304 D
S
0 0 1 setrgbcolor
N
709 1261 M
709 1273 D
S
N
709 1285 M
709 1297 D
S
N
709 1309 M
709 1321 D
S
N
709 1333 M
709 1346 D
S
N
709 1358 M
709 1370 D
S
N
709 1382 M
709 1394 D
S
N
709 1406 M
709 1418 D
S
N
709 1430 M
709 1442 D
S
N
713 1450 M
725 1450 D
S
N
737 1450 M
749 1450 D
S
N
762 1450 M
772 1450 D
772 1448 D
S
N
772 1436 M
772 1431 D
779 1431 D
S
N
791 1431 M
803 1431 D
S
N
815 1431 M
827 1431 D
S
N
835 1436 M
835 1439 D
843 1439 D
S
N
855 1439 M
867 1439 D
S
N
880 1439 M
892 1439 D
S
N
900 1436 M
912 1436 D
S
N
924 1436 M
936 1436 D
S
N
949 1436 M
960 1436 D
960 1436 D
S
N
971 1438 M
983 1438 D
S
N
995 1438 M
1007 1438 D
S
N
1019 1438 M
1023 1438 D
1023 1439 D
1030 1439 D
S
N
1042 1439 M
1054 1439 D
S
N
1066 1439 M
1078 1439 D
S
N
1087 1443 M
1099 1443 D
S
N
1111 1443 M
1123 1443 D
S
N
1135 1443 M
1147 1443 D
S
N
1159 1444 M
1171 1444 D
S
N
1183 1444 M
1195 1444 D
S
N
1207 1444 M
1212 1444 D
1212 1446 D
1216 1446 D
S
N
1229 1446 M
1241 1446 D
S
N
1253 1446 M
1265 1446 D
S
N
1275 1448 M
1287 1448 D
S
N
1299 1448 M
1312 1448 D
S
N
1324 1448 M
1336 1448 D
S
N
1338 1438 M
1338 1427 D
1339 1427 D
S
N
1351 1427 M
1363 1427 D
S
N
1376 1427 M
1388 1427 D
S
N
1400 1427 M
1401 1427 D
1401 1439 D
S
N
1401 1451 M
1401 1463 D
S
N
1401 1475 M
1401 1487 D
S
N
1401 1499 M
1401 1505 D
1407 1505 D
S
N
1419 1505 M
1431 1505 D
S
N
1443 1505 M
1456 1505 D
S
N
1464 1501 M
1464 1489 D
S
N
1464 1477 M
1464 1465 D
S
N
1464 1453 M
1464 1440 D
S
N
1464 1428 M
1464 1419 D
1466 1419 D
S
N
1478 1419 M
1490 1419 D
S
N
1503 1419 M
1515 1419 D
S
N
1527 1419 M
1527 1428 D
1529 1428 D
S
N
1541 1428 M
1554 1428 D
S
N
1566 1428 M
1578 1428 D
S
N
1590 1429 M
1590 1441 D
S
N
1590 1452 M
1602 1452 D
S
N
1614 1452 M
1626 1452 D
S
N
1638 1452 M
1650 1452 D
S
N
1659 1449 M
1671 1449 D
S
N
1683 1449 M
1695 1449 D
S
N
1707 1449 M
1715 1449 D
1715 1445 D
S
N
1721 1438 M
1733 1438 D
S
N
1745 1438 M
1757 1438 D
S
N
1769 1438 M
1778 1438 D
1778 1441 D
S
N
1778 1453 M
1778 1465 D
S
N
1778 1477 M
1778 1489 D
1779 1489 D
S
N
1791 1489 M
1803 1489 D
S
N
1815 1489 M
1827 1489 D
S
N
1839 1489 M
1841 1489 D
1841 1478 D
S
N
1841 1466 M
1841 1459 D
1846 1459 D
S
N
1858 1459 M
1871 1459 D
S
N
1883 1459 M
1895 1459 D
S
N
1904 1457 M
1904 1445 D
S
N
1915 1443 M
1927 1443 D
S
N
1939 1443 M
1951 1443 D
S
N
1963 1443 M
1967 1443 D
S
N
709 1261 M
709 1273 D
S
N
709 1285 M
709 1297 D
S
N
709 1309 M
709 1321 D
S
N
709 1333 M
709 1337 D
717 1337 D
S
N
729 1337 M
741 1337 D
S
N
753 1337 M
766 1337 D
S
N
772 1343 M
772 1345 D
782 1345 D
S
N
794 1345 M
806 1345 D
S
N
818 1345 M
830 1345 D
S
N
838 1341 M
850 1341 D
S
N
863 1341 M
875 1341 D
S
N
887 1341 M
898 1341 D
898 1342 D
S
N
909 1343 M
921 1343 D
S
N
934 1343 M
946 1343 D
S
N
958 1343 M
960 1343 D
960 1341 D
968 1341 D
S
N
980 1341 M
993 1341 D
S
N
1005 1341 M
1017 1341 D
S
N
1028 1340 M
1040 1340 D
S
N
1052 1340 M
1064 1340 D
S
N
1077 1340 M
1086 1340 D
1086 1339 D
1087 1339 D
S
N
1099 1339 M
1111 1339 D
S
N
1123 1339 M
1136 1339 D
S
N
1148 1339 M
1149 1339 D
1149 1337 D
1158 1337 D
S
N
1170 1337 M
1182 1337 D
S
N
1195 1337 M
1207 1337 D
S
N
1217 1336 M
1229 1336 D
S
N
1241 1336 M
1254 1336 D
S
N
1266 1336 M
1275 1336 D
1275 1335 D
1277 1335 D
S
N
1289 1335 M
1302 1335 D
S
N
1314 1335 M
1326 1335 D
S
N
1338 1335 M
1338 1345 D
1340 1345 D
S
N
1352 1345 M
1365 1345 D
S
N
1377 1345 M
1389 1345 D
S
N
1401 1345 M
1401 1333 D
S
N
1409 1329 M
1421 1329 D
S
N
1433 1329 M
1446 1329 D
S
N
1458 1329 M
1464 1329 D
1464 1335 D
S
N
1464 1347 M
1464 1359 D
S
N
1475 1361 M
1487 1361 D
S
N
1499 1361 M
1511 1361 D
S
N
1523 1361 M
1527 1361 D
1527 1352 D
S
N
1530 1343 M
1542 1343 D
S
N
1554 1343 M
1566 1343 D
S
N
1578 1343 M
1590 1343 D
1590 1342 D
S
N
1591 1332 M
1603 1332 D
S
N
1615 1332 M
1627 1332 D
S
N
1640 1332 M
1652 1332 D
S
N
1652 1343 M
1652 1348 D
1660 1348 D
S
N
1672 1348 M
1684 1348 D
S
N
1696 1348 M
1709 1348 D
S
N
1718 1350 M
1730 1350 D
S
N
1742 1350 M
1754 1350 D
S
N
1766 1350 M
1778 1350 D
1778 1350 D
S
N
1778 1338 M
1778 1326 D
S
N
1779 1314 M
1791 1314 D
S
N
1803 1314 M
1815 1314 D
S
N
1827 1314 M
1839 1314 D
S
N
1841 1324 M
1841 1329 D
1849 1329 D
S
N
1861 1329 M
1873 1329 D
S
N
1885 1329 M
1898 1329 D
S
N
1904 1334 M
1904 1343 D
1908 1343 D
S
N
1920 1343 M
1932 1343 D
S
N
1944 1343 M
1956 1343 D
S
N
721 1477 M
734 1477 D
S
N
746 1477 M
758 1477 D
S
N
770 1477 M
782 1477 D
S
N
794 1477 M
806 1477 D
S
3 Sw
0 0 0 setrgbcolor
N
833 1230 M
833 1201 D
S
N
834 1230 M
834 1201 D
S
N
829 1230 M
845 1230 D
849 1228 D
851 1227 D
852 1224 D
852 1220 D
851 1217 D
849 1216 D
845 1215 D
834 1215 D
S
N
845 1230 M
848 1228 D
849 1227 D
851 1224 D
851 1220 D
849 1217 D
848 1216 D
845 1215 D
S
N
829 1201 M
838 1201 D
S
N
870 1230 M
866 1228 D
863 1226 D
862 1223 D
860 1217 D
860 1213 D
862 1208 D
863 1205 D
866 1202 D
870 1201 D
873 1201 D
877 1202 D
879 1205 D
881 1208 D
882 1213 D
882 1217 D
881 1223 D
879 1226 D
877 1228 D
873 1230 D
870 1230 D
S
N
870 1230 M
867 1228 D
864 1226 D
863 1223 D
862 1217 D
862 1213 D
863 1208 D
864 1205 D
867 1202 D
870 1201 D
S
N
873 1201 M
875 1202 D
878 1205 D
879 1208 D
881 1213 D
881 1217 D
879 1223 D
878 1226 D
875 1228 D
873 1230 D
S
N
892 1230 M
897 1201 D
S
N
893 1230 M
897 1208 D
S
N
903 1230 M
897 1201 D
S
N
903 1230 M
908 1201 D
S
N
904 1230 M
908 1208 D
S
N
914 1230 M
908 1201 D
S
N
888 1230 M
897 1230 D
S
N
910 1230 M
918 1230 D
S
N
926 1230 M
926 1201 D
S
N
927 1230 M
927 1201 D
S
N
944 1230 M
944 1201 D
S
N
945 1230 M
945 1201 D
S
N
922 1230 M
931 1230 D
S
N
940 1230 M
949 1230 D
S
N
927 1216 M
944 1216 D
S
N
922 1201 M
931 1201 D
S
N
940 1201 M
949 1201 D
S
N
959 1230 M
959 1201 D
S
N
960 1230 M
960 1201 D
S
N
968 1222 M
968 1211 D
S
N
955 1230 M
977 1230 D
977 1222 D
975 1230 D
S
N
960 1216 M
968 1216 D
S
N
955 1201 M
977 1201 D
977 1209 D
975 1201 D
S
N
988 1230 M
988 1201 D
S
N
989 1230 M
989 1201 D
S
N
983 1230 M
993 1230 D
S
N
983 1201 M
1004 1201 D
1004 1209 D
1003 1201 D
S
N
1012 1220 M
1011 1219 D
1012 1217 D
1014 1219 D
1012 1220 D
S
N
1012 1204 M
1011 1202 D
1012 1201 D
1014 1202 D
1012 1204 D
S
N
1048 1220 M
1048 1191 D
S
N
1049 1220 M
1049 1191 D
S
N
1049 1216 M
1052 1219 D
1055 1220 D
1057 1220 D
1061 1219 D
1064 1216 D
1066 1212 D
1066 1209 D
1064 1205 D
1061 1202 D
1057 1201 D
1055 1201 D
1052 1202 D
1049 1205 D
S
N
1057 1220 M
1060 1219 D
1063 1216 D
1064 1212 D
1064 1209 D
1063 1205 D
1060 1202 D
1057 1201 D
S
N
1044 1220 M
1049 1220 D
S
N
1044 1191 M
1053 1191 D
S
N
1075 1220 M
1083 1201 D
S
N
1077 1220 M
1083 1204 D
S
N
1092 1220 M
1083 1201 D
1081 1196 D
1078 1193 D
1075 1191 D
1074 1191 D
1072 1193 D
1074 1194 D
1075 1193 D
S
N
1072 1220 M
1081 1220 D
S
N
1086 1220 M
1094 1220 D
S
N
1103 1230 M
1103 1207 D
1104 1202 D
1107 1201 D
1109 1201 D
1112 1202 D
1114 1205 D
S
N
1104 1230 M
1104 1207 D
1105 1202 D
1107 1201 D
S
N
1098 1220 M
1109 1220 D
S
N
1123 1230 M
1123 1201 D
S
N
1124 1230 M
1124 1201 D
S
N
1124 1216 M
1127 1219 D
1131 1220 D
1134 1220 D
1138 1219 D
1140 1216 D
1140 1201 D
S
N
1134 1220 M
1137 1219 D
1138 1216 D
1138 1201 D
S
N
1119 1230 M
1124 1230 D
S
N
1119 1201 M
1129 1201 D
S
N
1134 1201 M
1144 1201 D
S
N
1153 1230 M
1152 1228 D
1153 1227 D
1155 1228 D
1153 1230 D
S
N
1153 1220 M
1153 1201 D
S
N
1155 1220 M
1155 1201 D
S
N
1149 1220 M
1155 1220 D
S
N
1149 1201 M
1159 1201 D
S
N
1168 1217 M
1168 1216 D
1167 1216 D
1167 1217 D
1168 1219 D
1171 1220 D
1176 1220 D
1179 1219 D
1181 1217 D
1182 1215 D
1182 1205 D
1183 1202 D
1185 1201 D
S
N
1181 1217 M
1181 1205 D
1182 1202 D
1185 1201 D
1186 1201 D
S
N
1181 1215 M
1179 1213 D
1171 1212 D
1167 1211 D
1166 1208 D
1166 1205 D
1167 1202 D
1171 1201 D
1175 1201 D
1178 1202 D
1181 1205 D
S
N
1171 1212 M
1168 1211 D
1167 1208 D
1167 1205 D
1168 1202 D
1171 1201 D
S
N
1216 1235 M
1192 1191 D
S
N
1226 1230 M
1226 1201 D
S
N
1227 1230 M
1227 1201 D
S
N
1227 1216 M
1230 1219 D
1234 1220 D
1237 1220 D
1241 1219 D
1242 1216 D
1242 1201 D
S
N
1237 1220 M
1239 1219 D
1241 1216 D
1241 1201 D
S
N
1222 1230 M
1227 1230 D
S
N
1222 1201 M
1231 1201 D
S
N
1237 1201 M
1246 1201 D
S
N
1254 1212 M
1271 1212 D
1271 1215 D
1270 1217 D
1268 1219 D
1265 1220 D
1261 1220 D
1257 1219 D
1254 1216 D
1253 1212 D
1253 1209 D
1254 1205 D
1257 1202 D
1261 1201 D
1264 1201 D
1268 1202 D
1271 1205 D
S
N
1270 1212 M
1270 1216 D
1268 1219 D
S
N
1261 1220 M
1259 1219 D
1256 1216 D
1254 1212 D
1254 1209 D
1256 1205 D
1259 1202 D
1261 1201 D
S
N
1282 1220 M
1282 1201 D
S
N
1283 1220 M
1283 1201 D
S
N
1283 1212 M
1285 1216 D
1287 1219 D
1290 1220 D
1294 1220 D
1296 1219 D
1296 1217 D
1294 1216 D
1293 1217 D
1294 1219 D
S
N
1278 1220 M
1283 1220 D
S
N
1278 1201 M
1287 1201 D
S
N
1304 1220 M
1309 1201 D
S
N
1305 1220 M
1309 1205 D
S
N
1315 1220 M
1309 1201 D
S
N
1315 1220 M
1320 1201 D
S
N
1316 1220 M
1320 1205 D
S
N
1326 1220 M
1320 1201 D
S
N
1300 1220 M
1309 1220 D
S
N
1322 1220 M
1330 1220 D
S
N
1338 1230 M
1337 1228 D
1338 1227 D
1339 1228 D
1338 1230 D
S
N
1338 1220 M
1338 1201 D
S
N
1339 1220 M
1339 1201 D
S
N
1334 1220 M
1339 1220 D
S
N
1334 1201 M
1343 1201 D
S
N
1357 1220 M
1354 1219 D
1353 1217 D
1352 1215 D
1352 1212 D
1353 1209 D
1354 1208 D
1357 1207 D
1360 1207 D
1363 1208 D
1364 1209 D
1365 1212 D
1365 1215 D
1364 1217 D
1363 1219 D
1360 1220 D
1357 1220 D
S
N
1354 1219 M
1353 1216 D
1353 1211 D
1354 1208 D
S
N
1363 1208 M
1364 1211 D
1364 1216 D
1363 1219 D
S
N
1364 1217 M
1365 1219 D
1368 1220 D
1368 1219 D
1365 1219 D
S
N
1353 1209 M
1352 1208 D
1350 1205 D
1350 1204 D
1352 1201 D
1356 1200 D
1363 1200 D
1367 1198 D
1368 1197 D
S
N
1350 1204 M
1352 1202 D
1356 1201 D
1363 1201 D
1367 1200 D
1368 1197 D
1368 1196 D
1367 1193 D
1363 1191 D
1354 1191 D
1350 1193 D
1349 1196 D
1349 1197 D
1350 1200 D
1354 1201 D
S
N
833 1057 M
833 1028 D
S
N
834 1057 M
834 1028 D
S
N
829 1057 M
845 1057 D
849 1055 D
851 1054 D
852 1051 D
852 1047 D
851 1044 D
849 1043 D
845 1042 D
834 1042 D
S
N
845 1057 M
848 1055 D
849 1054 D
851 1051 D
851 1047 D
849 1044 D
848 1043 D
845 1042 D
S
N
829 1028 M
838 1028 D
S
N
870 1057 M
866 1055 D
863 1053 D
862 1050 D
860 1044 D
860 1040 D
862 1035 D
863 1032 D
866 1029 D
870 1028 D
873 1028 D
877 1029 D
879 1032 D
881 1035 D
882 1040 D
882 1044 D
881 1050 D
879 1053 D
877 1055 D
873 1057 D
870 1057 D
S
N
870 1057 M
867 1055 D
864 1053 D
863 1050 D
862 1044 D
862 1040 D
863 1035 D
864 1032 D
867 1029 D
870 1028 D
S
N
873 1028 M
875 1029 D
878 1032 D
879 1035 D
881 1040 D
881 1044 D
879 1050 D
878 1053 D
875 1055 D
873 1057 D
S
N
892 1057 M
897 1028 D
S
N
893 1057 M
897 1035 D
S
N
903 1057 M
897 1028 D
S
N
903 1057 M
908 1028 D
S
N
904 1057 M
908 1035 D
S
N
914 1057 M
908 1028 D
S
N
888 1057 M
897 1057 D
S
N
910 1057 M
918 1057 D
S
N
926 1057 M
926 1028 D
S
N
927 1057 M
927 1028 D
S
N
944 1057 M
944 1028 D
S
N
945 1057 M
945 1028 D
S
N
922 1057 M
931 1057 D
S
N
940 1057 M
949 1057 D
S
N
927 1043 M
944 1043 D
S
N
922 1028 M
931 1028 D
S
N
940 1028 M
949 1028 D
S
N
959 1057 M
959 1028 D
S
N
960 1057 M
960 1028 D
S
N
968 1049 M
968 1038 D
S
N
955 1057 M
977 1057 D
977 1049 D
975 1057 D
S
N
960 1043 M
968 1043 D
S
N
955 1028 M
977 1028 D
977 1036 D
975 1028 D
S
N
988 1057 M
988 1028 D
S
N
989 1057 M
989 1028 D
S
N
983 1057 M
993 1057 D
S
N
983 1028 M
1004 1028 D
1004 1036 D
1003 1028 D
S
N
1033 1062 M
1008 1018 D
S
N
1042 1044 M
1042 1043 D
1041 1043 D
1041 1044 D
1042 1046 D
1045 1047 D
1051 1047 D
1053 1046 D
1055 1044 D
1056 1042 D
1056 1032 D
1057 1029 D
1059 1028 D
S
N
1055 1044 M
1055 1032 D
1056 1029 D
1059 1028 D
1060 1028 D
S
N
1055 1042 M
1053 1040 D
1045 1039 D
1041 1038 D
1040 1035 D
1040 1032 D
1041 1029 D
1045 1028 D
1049 1028 D
1052 1029 D
1055 1032 D
S
N
1045 1039 M
1042 1038 D
1041 1035 D
1041 1032 D
1042 1029 D
1045 1028 D
S
N
1070 1057 M
1070 1028 D
S
N
1071 1057 M
1079 1032 D
S
N
1070 1057 M
1079 1028 D
S
N
1089 1057 M
1079 1028 D
S
N
1089 1057 M
1089 1028 D
S
N
1090 1057 M
1090 1028 D
S
N
1066 1057 M
1071 1057 D
S
N
1089 1057 M
1094 1057 D
S
N
1066 1028 M
1074 1028 D
S
N
1085 1028 M
1094 1028 D
S
N
1120 1053 M
1122 1049 D
1122 1057 D
1120 1053 D
1118 1055 D
1114 1057 D
1111 1057 D
1107 1055 D
1104 1053 D
1103 1050 D
1101 1046 D
1101 1039 D
1103 1035 D
1104 1032 D
1107 1029 D
1111 1028 D
1114 1028 D
1118 1029 D
1120 1032 D
1122 1035 D
S
N
1111 1057 M
1108 1055 D
1105 1053 D
1104 1050 D
1103 1046 D
1103 1039 D
1104 1035 D
1105 1032 D
1108 1029 D
1111 1028 D
S
N
1150 1046 M
1149 1049 D
1146 1050 D
1142 1050 D
1140 1049 D
1138 1047 D
1137 1043 D
1137 1039 D
1138 1036 D
1141 1035 D
1145 1035 D
1148 1036 D
1149 1039 D
S
N
1142 1050 M
1140 1047 D
1138 1043 D
1138 1039 D
1140 1036 D
1141 1035 D
S
N
1150 1050 M
1149 1039 D
1149 1036 D
1152 1035 D
1155 1035 D
1157 1038 D
1159 1042 D
1159 1044 D
1157 1049 D
1156 1051 D
1153 1054 D
1150 1055 D
1146 1057 D
1142 1057 D
1138 1055 D
1135 1054 D
1133 1051 D
1131 1049 D
1130 1044 D
1130 1040 D
1131 1036 D
1133 1034 D
1135 1031 D
1138 1029 D
1142 1028 D
1146 1028 D
1150 1029 D
1153 1031 D
1155 1032 D
S
N
1152 1050 M
1150 1039 D
1150 1036 D
1152 1035 D
S
N
1170 1057 M
1170 1028 D
S
N
1171 1057 M
1187 1031 D
S
N
1171 1054 M
1187 1028 D
S
N
1187 1057 M
1187 1028 D
S
N
1166 1057 M
1171 1057 D
S
N
1183 1057 M
1192 1057 D
S
N
1166 1028 M
1174 1028 D
S
N
1201 1057 M
1201 1028 D
S
N
1202 1057 M
1202 1028 D
S
N
1197 1057 M
1207 1057 D
S
N
1197 1028 M
1218 1028 D
1218 1036 D
1216 1028 D
S
N
1233 1057 M
1228 1055 D
1226 1053 D
1224 1050 D
1223 1044 D
1223 1040 D
1224 1035 D
1226 1032 D
1228 1029 D
1233 1028 D
1235 1028 D
1239 1029 D
1242 1032 D
1244 1035 D
1245 1040 D
1245 1044 D
1244 1050 D
1242 1053 D
1239 1055 D
1235 1057 D
1233 1057 D
S
N
1233 1057 M
1230 1055 D
1227 1053 D
1226 1050 D
1224 1044 D
1224 1040 D
1226 1035 D
1227 1032 D
1230 1029 D
1233 1028 D
S
N
1235 1028 M
1238 1029 D
1241 1032 D
1242 1035 D
1244 1040 D
1244 1044 D
1242 1050 D
1241 1053 D
1238 1055 D
1235 1057 D
S
4 Sw
N
1672 906 M
1672 874 D
S
N
1673 906 M
1673 874 D
S
N
1682 897 M
1682 885 D
S
N
1667 906 M
1691 906 D
1691 897 D
1690 906 D
S
N
1673 891 M
1682 891 D
S
N
1667 874 M
1691 874 D
1691 883 D
1690 874 D
S
N
1707 883 M
1707 862 D
S
N
1708 883 M
1708 862 D
S
N
1701 883 M
1700 877 D
1700 883 D
1715 883 D
1715 877 D
1714 883 D
S
N
1704 862 M
1711 862 D
S
N
1735 912 M
1732 909 D
1729 904 D
1726 898 D
1725 891 D
1725 885 D
1726 877 D
1729 871 D
1732 867 D
1735 864 D
S
N
1732 909 M
1729 903 D
1728 898 D
1726 891 D
1726 885 D
1728 877 D
1729 873 D
1732 867 D
S
N
1748 906 M
1748 874 D
S
N
1749 906 M
1749 874 D
S
N
1743 906 M
1749 906 D
S
N
1743 874 M
1754 874 D
S
N
1772 916 M
1772 898 D
S
N
1763 907 M
1781 907 D
S
N
1791 912 M
1794 909 D
1797 904 D
1800 898 D
1802 891 D
1802 885 D
1800 877 D
1797 871 D
1794 867 D
1791 864 D
S
N
1794 909 M
1797 903 D
1799 898 D
1800 891 D
1800 885 D
1799 877 D
1797 873 D
1794 867 D
S
N
1838 912 M
1838 864 D
S
N
1840 912 M
1840 864 D
S
N
1838 912 M
1849 912 D
S
N
1838 864 M
1849 864 D
S
N
1879 901 M
1880 897 D
1880 906 D
1879 901 D
1876 904 D
1871 906 D
1868 906 D
1864 904 D
1861 901 D
1859 898 D
1858 894 D
1858 886 D
1859 882 D
1861 879 D
1864 876 D
1868 874 D
1871 874 D
1876 876 D
1879 879 D
S
N
1868 906 M
1865 904 D
1862 901 D
1861 898 D
1859 894 D
1859 886 D
1861 882 D
1862 879 D
1865 876 D
1868 874 D
S
N
1879 886 M
1879 874 D
S
N
1880 886 M
1880 874 D
S
N
1874 886 M
1885 886 D
S
N
1894 886 M
1912 886 D
1912 889 D
1911 892 D
1909 894 D
1906 895 D
1901 895 D
1897 894 D
1894 891 D
1892 886 D
1892 883 D
1894 879 D
1897 876 D
1901 874 D
1905 874 D
1909 876 D
1912 879 D
S
N
1911 886 M
1911 891 D
1909 894 D
S
N
1901 895 M
1898 894 D
1895 891 D
1894 886 D
1894 883 D
1895 879 D
1898 876 D
1901 874 D
S
N
1921 906 M
1932 874 D
S
N
1923 906 M
1932 879 D
S
N
1942 906 M
1932 874 D
S
N
1918 906 M
1927 906 D
S
N
1936 906 M
1945 906 D
S
N
1960 912 M
1960 864 D
S
N
1962 912 M
1962 864 D
S
N
1951 912 M
1962 912 D
S
N
1951 864 M
1962 864 D
S
N
583 1261 M
583 1001 D
S
N
583 1001 M
1967 1001 D
S
N
1967 1001 M
1967 1261 D
S
N
1967 1261 M
583 1261 D
S
N
583 1001 M
583 1017 D
S
N
646 1006 M
646 1001 D
S
N
709 1001 M
709 1006 D
S
N
772 1006 M
772 1001 D
S
N
835 1001 M
835 1006 D
S
N
898 1017 M
898 1001 D
S
N
960 1001 M
960 1006 D
S
N
1023 1006 M
1023 1001 D
S
N
1086 1001 M
1086 1006 D
S
N
1149 1006 M
1149 1001 D
S
N
1212 1001 M
1212 1017 D
S
N
1275 1006 M
1275 1001 D
S
N
1338 1001 M
1338 1006 D
S
N
1401 1006 M
1401 1001 D
S
N
1464 1001 M
1464 1006 D
S
N
1527 1017 M
1527 1001 D
S
N
1590 1001 M
1590 1006 D
S
N
1652 1006 M
1652 1001 D
S
N
1715 1001 M
1715 1006 D
S
N
1778 1006 M
1778 1001 D
S
N
1841 1001 M
1841 1017 D
S
N
1904 1006 M
1904 1001 D
S
N
581 971 M
577 970 D
574 965 D
572 958 D
572 953 D
574 946 D
577 941 D
581 940 D
585 940 D
589 941 D
592 946 D
594 953 D
594 958 D
592 965 D
589 970 D
585 971 D
581 971 D
S
N
581 971 M
578 970 D
577 968 D
575 965 D
574 958 D
574 953 D
575 946 D
577 943 D
578 941 D
581 940 D
S
N
585 940 M
588 941 D
589 943 D
591 946 D
592 953 D
592 958 D
591 965 D
589 968 D
588 970 D
585 971 D
S
N
875 971 M
872 956 D
S
N
872 956 M
875 959 D
879 961 D
884 961 D
888 959 D
891 956 D
893 952 D
893 949 D
891 944 D
888 941 D
884 940 D
879 940 D
875 941 D
873 943 D
872 946 D
872 947 D
873 949 D
875 947 D
873 946 D
S
N
884 961 M
887 959 D
890 956 D
891 952 D
891 949 D
890 944 D
887 941 D
884 940 D
S
N
875 971 M
890 971 D
S
N
875 970 M
882 970 D
890 971 D
S
N
911 971 M
907 970 D
904 965 D
902 958 D
902 953 D
904 946 D
907 941 D
911 940 D
914 940 D
919 941 D
922 946 D
923 953 D
923 958 D
922 965 D
919 970 D
914 971 D
911 971 D
S
N
911 971 M
908 970 D
907 968 D
905 965 D
904 958 D
904 953 D
905 946 D
907 943 D
908 941 D
911 940 D
S
N
914 940 M
917 941 D
919 943 D
920 946 D
922 953 D
922 958 D
920 965 D
919 968 D
917 970 D
914 971 D
S
N
1176 965 M
1179 967 D
1183 971 D
1183 940 D
S
N
1182 970 M
1182 940 D
S
N
1176 940 M
1189 940 D
S
N
1211 971 M
1206 970 D
1203 965 D
1201 958 D
1201 953 D
1203 946 D
1206 941 D
1211 940 D
1214 940 D
1218 941 D
1221 946 D
1223 953 D
1223 958 D
1221 965 D
1218 970 D
1214 971 D
1211 971 D
S
N
1211 971 M
1207 970 D
1206 968 D
1204 965 D
1203 958 D
1203 953 D
1204 946 D
1206 943 D
1207 941 D
1211 940 D
S
N
1214 940 M
1217 941 D
1218 943 D
1220 946 D
1221 953 D
1221 958 D
1220 965 D
1218 968 D
1217 970 D
1214 971 D
S
N
1241 971 M
1236 970 D
1233 965 D
1232 958 D
1232 953 D
1233 946 D
1236 941 D
1241 940 D
1244 940 D
1248 941 D
1251 946 D
1253 953 D
1253 958 D
1251 965 D
1248 970 D
1244 971 D
1241 971 D
S
N
1241 971 M
1238 970 D
1236 968 D
1235 965 D
1233 958 D
1233 953 D
1235 946 D
1236 943 D
1238 941 D
1241 940 D
S
N
1244 940 M
1247 941 D
1248 943 D
1250 946 D
1251 953 D
1251 958 D
1250 965 D
1248 968 D
1247 970 D
1244 971 D
S
N
1490 965 M
1493 967 D
1498 971 D
1498 940 D
S
N
1496 970 M
1496 940 D
S
N
1490 940 M
1504 940 D
S
N
1519 971 M
1516 956 D
S
N
1516 956 M
1519 959 D
1524 961 D
1528 961 D
1533 959 D
1536 956 D
1537 952 D
1537 949 D
1536 944 D
1533 941 D
1528 940 D
1524 940 D
1519 941 D
1518 943 D
1516 946 D
1516 947 D
1518 949 D
1519 947 D
1518 946 D
S
N
1528 961 M
1531 959 D
1534 956 D
1536 952 D
1536 949 D
1534 944 D
1531 941 D
1528 940 D
S
N
1519 971 M
1534 971 D
S
N
1519 970 M
1527 970 D
1534 971 D
S
N
1555 971 M
1551 970 D
1548 965 D
1546 958 D
1546 953 D
1548 946 D
1551 941 D
1555 940 D
1558 940 D
1563 941 D
1566 946 D
1567 953 D
1567 958 D
1566 965 D
1563 970 D
1558 971 D
1555 971 D
S
N
1555 971 M
1552 970 D
1551 968 D
1549 965 D
1548 958 D
1548 953 D
1549 946 D
1551 943 D
1552 941 D
1555 940 D
S
N
1558 940 M
1561 941 D
1563 943 D
1564 946 D
1566 953 D
1566 958 D
1564 965 D
1563 968 D
1561 970 D
1558 971 D
S
N
1802 965 M
1803 964 D
1802 962 D
1800 964 D
1800 965 D
1802 968 D
1803 970 D
1808 971 D
1814 971 D
1818 970 D
1820 968 D
1821 965 D
1821 962 D
1820 959 D
1815 956 D
1808 953 D
1805 952 D
1802 949 D
1800 944 D
1800 940 D
S
N
1814 971 M
1817 970 D
1818 968 D
1820 965 D
1820 962 D
1818 959 D
1814 956 D
1808 953 D
S
N
1800 943 M
1802 944 D
1805 944 D
1812 941 D
1817 941 D
1820 943 D
1821 944 D
S
N
1805 944 M
1812 940 D
1818 940 D
1820 941 D
1821 944 D
1821 947 D
S
N
1840 971 M
1835 970 D
1832 965 D
1831 958 D
1831 953 D
1832 946 D
1835 941 D
1840 940 D
1843 940 D
1847 941 D
1850 946 D
1852 953 D
1852 958 D
1850 965 D
1847 970 D
1843 971 D
1840 971 D
S
N
1840 971 M
1837 970 D
1835 968 D
1834 965 D
1832 958 D
1832 953 D
1834 946 D
1835 943 D
1837 941 D
1840 940 D
S
N
1843 940 M
1846 941 D
1847 943 D
1849 946 D
1850 953 D
1850 958 D
1849 965 D
1847 968 D
1846 970 D
1843 971 D
S
N
1870 971 M
1865 970 D
1862 965 D
1861 958 D
1861 953 D
1862 946 D
1865 941 D
1870 940 D
1873 940 D
1877 941 D
1880 946 D
1882 953 D
1882 958 D
1880 965 D
1877 970 D
1873 971 D
1870 971 D
S
N
1870 971 M
1867 970 D
1865 968 D
1864 965 D
1862 958 D
1862 953 D
1864 946 D
1865 943 D
1867 941 D
1870 940 D
S
N
1873 940 M
1876 941 D
1877 943 D
1879 946 D
1880 953 D
1880 958 D
1879 965 D
1877 968 D
1876 970 D
1873 971 D
S
N
583 1261 M
1967 1261 D
S
N
583 1245 M
583 1261 D
S
N
646 1261 M
646 1256 D
S
N
709 1256 M
709 1261 D
S
N
772 1261 M
772 1256 D
S
N
835 1256 M
835 1261 D
S
N
898 1261 M
898 1245 D
S
N
960 1256 M
960 1261 D
S
N
1023 1261 M
1023 1256 D
S
N
1086 1256 M
1086 1261 D
S
N
1149 1261 M
1149 1256 D
S
N
1212 1245 M
1212 1261 D
S
N
1275 1261 M
1275 1256 D
S
N
1338 1256 M
1338 1261 D
S
N
1401 1261 M
1401 1256 D
S
N
1464 1256 M
1464 1261 D
S
N
1527 1261 M
1527 1245 D
S
N
1590 1256 M
1590 1261 D
S
N
1652 1261 M
1652 1256 D
S
N
1715 1256 M
1715 1261 D
S
N
1778 1261 M
1778 1256 D
S
N
1841 1245 M
1841 1261 D
S
N
1904 1261 M
1904 1256 D
S
N
583 1001 M
583 1261 D
S
N
583 1006 M
588 1006 D
S
N
588 1022 M
583 1022 D
S
N
583 1038 M
588 1038 D
S
N
599 1053 M
583 1053 D
S
N
583 1069 M
588 1069 D
S
N
588 1084 M
583 1084 D
S
N
583 1100 M
588 1100 D
S
N
588 1115 M
583 1115 D
S
N
583 1131 M
599 1131 D
S
N
588 1147 M
583 1147 D
S
N
583 1162 M
588 1162 D
S
N
588 1178 M
583 1178 D
S
N
583 1193 M
588 1193 D
S
N
599 1209 M
583 1209 D
S
N
583 1224 M
588 1224 D
S
N
588 1240 M
583 1240 D
S
N
583 1256 M
588 1256 D
S
N
503 1067 M
498 1065 D
495 1061 D
494 1053 D
494 1049 D
495 1041 D
498 1037 D
503 1035 D
506 1035 D
510 1037 D
513 1041 D
515 1049 D
515 1053 D
513 1061 D
510 1065 D
506 1067 D
503 1067 D
S
N
503 1067 M
500 1065 D
498 1064 D
497 1061 D
495 1053 D
495 1049 D
497 1041 D
498 1038 D
500 1037 D
503 1035 D
S
N
506 1035 M
509 1037 D
510 1038 D
512 1041 D
513 1049 D
513 1053 D
512 1061 D
510 1064 D
509 1065 D
506 1067 D
S
N
527 1038 M
525 1037 D
527 1035 D
528 1037 D
527 1038 D
S
N
547 1067 M
542 1065 D
541 1062 D
541 1058 D
542 1055 D
547 1053 D
553 1053 D
557 1055 D
559 1058 D
559 1062 D
557 1065 D
553 1067 D
547 1067 D
S
N
547 1067 M
544 1065 D
542 1062 D
542 1058 D
544 1055 D
547 1053 D
S
N
553 1053 M
556 1055 D
557 1058 D
557 1062 D
556 1065 D
553 1067 D
S
N
547 1053 M
542 1052 D
541 1050 D
539 1047 D
539 1041 D
541 1038 D
542 1037 D
547 1035 D
553 1035 D
557 1037 D
559 1038 D
560 1041 D
560 1047 D
559 1050 D
557 1052 D
553 1053 D
S
N
547 1053 M
544 1052 D
542 1050 D
541 1047 D
541 1041 D
542 1038 D
544 1037 D
547 1035 D
S
N
553 1035 M
556 1037 D
557 1038 D
559 1041 D
559 1047 D
557 1050 D
556 1052 D
553 1053 D
S
N
498 1139 M
501 1140 D
506 1145 D
506 1113 D
S
N
504 1143 M
504 1113 D
S
N
498 1113 M
512 1113 D
S
N
527 1116 M
525 1114 D
527 1113 D
528 1114 D
527 1116 D
S
N
548 1145 M
544 1143 D
541 1139 D
539 1131 D
539 1126 D
541 1119 D
544 1114 D
548 1113 D
551 1113 D
556 1114 D
559 1119 D
560 1126 D
560 1131 D
559 1139 D
556 1143 D
551 1145 D
548 1145 D
S
N
548 1145 M
545 1143 D
544 1142 D
542 1139 D
541 1131 D
541 1126 D
542 1119 D
544 1116 D
545 1114 D
548 1113 D
S
N
551 1113 M
554 1114 D
556 1116 D
557 1119 D
559 1126 D
559 1131 D
557 1139 D
556 1142 D
554 1143 D
551 1145 D
S
N
498 1216 M
501 1218 D
506 1222 D
506 1191 D
S
N
504 1221 M
504 1191 D
S
N
498 1191 M
512 1191 D
S
N
527 1194 M
525 1192 D
527 1191 D
528 1192 D
527 1194 D
S
N
541 1216 M
542 1215 D
541 1213 D
539 1215 D
539 1216 D
541 1219 D
542 1221 D
547 1222 D
553 1222 D
557 1221 D
559 1219 D
560 1216 D
560 1213 D
559 1210 D
554 1207 D
547 1204 D
544 1203 D
541 1200 D
539 1195 D
539 1191 D
S
N
553 1222 M
556 1221 D
557 1219 D
559 1216 D
559 1213 D
557 1210 D
553 1207 D
547 1204 D
S
N
539 1194 M
541 1195 D
544 1195 D
551 1192 D
556 1192 D
559 1194 D
560 1195 D
S
N
544 1195 M
551 1191 D
557 1191 D
559 1192 D
560 1195 D
560 1198 D
S
N
1962 1006 M
1967 1006 D
S
N
1967 1022 M
1962 1022 D
S
N
1962 1038 M
1967 1038 D
S
N
1967 1053 M
1951 1053 D
S
N
1962 1069 M
1967 1069 D
S
N
1967 1084 M
1962 1084 D
S
N
1962 1100 M
1967 1100 D
S
N
1967 1115 M
1962 1115 D
S
N
1951 1131 M
1967 1131 D
S
N
1967 1147 M
1962 1147 D
S
N
1962 1162 M
1967 1162 D
S
N
1967 1178 M
1962 1178 D
S
N
1962 1193 M
1967 1193 D
S
N
1967 1209 M
1951 1209 D
S
N
1962 1224 M
1967 1224 D
S
N
1967 1240 M
1962 1240 D
S
N
1962 1256 M
1967 1256 D
S
N
709 1001 M
709 1141 D
772 1141 D
772 1134 D
835 1134 D
835 1128 D
898 1128 D
898 1123 D
960 1123 D
960 1126 D
1023 1126 D
1023 1115 D
1086 1115 D
1086 1135 D
1149 1135 D
1149 1122 D
1212 1122 D
1212 1101 D
1275 1101 D
1275 1127 D
1338 1127 D
1338 1124 D
1401 1124 D
1401 1103 D
1464 1103 D
1464 1128 D
1527 1128 D
1527 1149 D
1590 1149 D
1590 1107 D
1652 1107 D
1652 1031 D
1715 1031 D
1715 1181 D
1778 1181 D
1778 1091 D
1841 1091 D
1841 1131 D
1904 1131 D
1904 1136 D
1967 1136 D
S
N
721 1217 M
808 1217 D
S
0 0 1 setrgbcolor
N
709 1001 M
709 1013 D
S
N
709 1025 M
709 1038 D
S
N
709 1050 M
709 1062 D
S
N
709 1074 M
709 1086 D
S
N
709 1098 M
709 1110 D
S
N
709 1122 M
709 1130 D
714 1130 D
S
N
726 1130 M
738 1130 D
S
N
750 1130 M
762 1130 D
S
N
772 1132 M
772 1135 D
781 1135 D
S
N
793 1135 M
805 1135 D
S
N
817 1135 M
829 1135 D
S
N
835 1129 M
835 1127 D
845 1127 D
S
N
857 1127 M
869 1127 D
S
N
881 1127 M
893 1127 D
S
N
898 1119 M
898 1117 D
907 1117 D
S
N
919 1117 M
931 1117 D
S
N
944 1117 M
956 1117 D
S
N
960 1124 M
960 1125 D
971 1125 D
S
N
983 1125 M
995 1125 D
S
N
1008 1125 M
1020 1125 D
S
N
1032 1125 M
1044 1125 D
S
N
1056 1125 M
1068 1125 D
S
N
1080 1125 M
1086 1125 D
1086 1131 D
1086 1131 D
S
N
1098 1131 M
1111 1131 D
S
N
1123 1131 M
1135 1131 D
S
N
1147 1131 M
1149 1131 D
1149 1122 D
S
N
1153 1113 M
1165 1113 D
S
N
1177 1113 M
1189 1113 D
S
N
1201 1113 M
1212 1113 D
1212 1114 D
S
N
1220 1118 M
1233 1118 D
S
N
1245 1118 M
1257 1118 D
S
N
1269 1118 M
1275 1118 D
1275 1124 D
S
N
1283 1129 M
1295 1129 D
S
N
1307 1129 M
1319 1129 D
S
N
1331 1129 M
1338 1129 D
1338 1123 D
S
N
1349 1122 M
1361 1122 D
S
N
1373 1122 M
1385 1122 D
S
N
1397 1122 M
1401 1122 D
1401 1114 D
S
N
1401 1101 M
1401 1089 D
S
N
1412 1089 M
1424 1089 D
S
N
1436 1089 M
1449 1089 D
S
N
1461 1089 M
1464 1089 D
1464 1080 D
S
N
1471 1074 M
1483 1074 D
S
N
1495 1074 M
1507 1074 D
S
N
1519 1074 M
1527 1074 D
1527 1079 D
S
N
1527 1091 M
1527 1103 D
S
N
1537 1105 M
1549 1105 D
S
N
1562 1105 M
1574 1105 D
S
N
1586 1105 M
1590 1105 D
1590 1102 D
1595 1102 D
S
N
1607 1102 M
1619 1102 D
S
N
1631 1102 M
1643 1102 D
S
N
1652 1105 M
1652 1117 D
S
N
1652 1129 M
1652 1130 D
1663 1130 D
S
N
1675 1130 M
1688 1130 D
S
N
1700 1130 M
1712 1130 D
S
N
1715 1122 M
1715 1110 D
S
N
1715 1098 M
1715 1086 D
S
N
1726 1084 M
1738 1084 D
S
N
1750 1084 M
1762 1084 D
S
N
1774 1084 M
1778 1084 D
1778 1092 D
S
N
1778 1104 M
1778 1105 D
1789 1105 D
S
N
1802 1105 M
1814 1105 D
S
N
1826 1105 M
1838 1105 D
S
N
1841 1096 M
1841 1085 D
1843 1085 D
S
N
1855 1085 M
1867 1085 D
S
N
1879 1085 M
1891 1085 D
S
N
1903 1085 M
1904 1085 D
1904 1097 D
S
N
1916 1097 M
1928 1097 D
S
N
1940 1097 M
1952 1097 D
S
N
1964 1097 M
1967 1097 D
S
N
721 1044 M
734 1044 D
S
N
746 1044 M
758 1044 D
S
N
770 1044 M
782 1044 D
S
N
794 1044 M
806 1044 D
S
showpage
%%Trailer
%%Pages: 1
%%BoundingBox: 99 205 482 563
