%!PS-Adobe-1.0
%%Creator: Unified Graphics System
%%Pages: (atend)
%%DocumentFonts: Helvetica
%%BoundingBox:   78   75  496  413
%%EndComments
/Sw{setlinewidth}def
/Sg{setgray}def
/Sd{setdash}def
/P {newpath
    moveto
0 0 rlineto
    stroke}def
/M {moveto}def
/D {lineto}def
/N {newpath}def
/S {stroke}def
/T {/Helvetica findfont
    exch
    scalefont
    setfont}def
/R {rotate}def
/W {show}def
/F {fill}def
/X {gsave}def
/Y {grestore}def
%%EndProlog
%%Page: 1 1
0.12000 0.12000 scale
1 setlinecap
1 setlinejoin
12 Sw
0.00 0.00 0.00 setrgbcolor
[] 0 Sd
N
1339 3414 M
1339 992 D
S
N
1339 992 M
4107 992 D
S
N
4107 992 M
4107 3414 D
S
N
4107 3414 M
1339 3414 D
S
N
1680 1073 M
1611 1073 D
S
N
1645 1073 M
1645 1059 D
S
N
1680 1059 M
1611 1059 D
S
N
2293 1230 M
2224 1230 D
S
N
2258 1230 M
2258 1224 D
S
N
2293 1224 M
2224 1224 D
S
N
2906 1440 M
2837 1440 D
S
N
2871 1440 M
2871 1436 D
S
N
2906 1436 M
2837 1436 D
S
N
3519 1844 M
3450 1844 D
S
N
3484 1844 M
3484 1843 D
S
N
3519 1843 M
3450 1843 D
S
N
3979 2357 M
3909 2357 D
S
N
3944 2357 M
3944 2356 D
S
N
3979 2356 M
3909 2356 D
S
N
1339 992 M
1339 1017 D
S
N
1436 1000 M
1436 992 D
S
N
1534 992 M
1534 1000 D
S
N
1631 1000 M
1631 992 D
S
N
1728 992 M
1728 1000 D
S
N
1825 1017 M
1825 992 D
S
N
1923 992 M
1923 1000 D
S
N
2020 1000 M
2020 992 D
S
N
2117 992 M
2117 1000 D
S
N
2215 1000 M
2215 992 D
S
N
2312 992 M
2312 1017 D
S
N
2409 1000 M
2409 992 D
S
N
2507 992 M
2507 1000 D
S
N
2604 1000 M
2604 992 D
S
N
2701 992 M
2701 1000 D
S
N
2798 1017 M
2798 992 D
S
N
2896 992 M
2896 1000 D
S
N
2993 1000 M
2993 992 D
S
N
3090 992 M
3090 1000 D
S
N
3188 1000 M
3188 992 D
S
N
3285 992 M
3285 1017 D
S
N
3382 1000 M
3382 992 D
S
N
3479 992 M
3479 1000 D
S
N
3577 1000 M
3577 992 D
S
N
3674 992 M
3674 1000 D
S
N
3771 1017 M
3771 992 D
S
N
3869 992 M
3869 1000 D
S
N
3966 1000 M
3966 992 D
S
N
4063 992 M
4063 1000 D
S
N
1293 935 M
1284 932 D
1278 923 D
1276 909 D
1276 900 D
1278 886 D
1284 877 D
1293 874 D
1299 874 D
1307 877 D
1313 886 D
1316 900 D
1316 909 D
1313 923 D
1307 932 D
1299 935 D
1293 935 D
S
N
1293 935 M
1287 932 D
1284 929 D
1281 923 D
1278 909 D
1278 900 D
1281 886 D
1284 880 D
1287 877 D
1293 874 D
S
N
1299 874 M
1304 877 D
1307 880 D
1310 886 D
1313 900 D
1313 909 D
1310 923 D
1307 929 D
1304 932 D
1299 935 D
S
N
1339 880 M
1336 877 D
1339 874 D
1342 877 D
1339 880 D
S
N
1379 935 M
1371 932 D
1365 923 D
1362 909 D
1362 900 D
1365 886 D
1371 877 D
1379 874 D
1385 874 D
1394 877 D
1400 886 D
1402 900 D
1402 909 D
1400 923 D
1394 932 D
1385 935 D
1379 935 D
S
N
1379 935 M
1374 932 D
1371 929 D
1368 923 D
1365 909 D
1365 900 D
1368 886 D
1371 880 D
1374 877 D
1379 874 D
S
N
1385 874 M
1391 877 D
1394 880 D
1397 886 D
1400 900 D
1400 909 D
1397 923 D
1394 929 D
1391 932 D
1385 935 D
S
N
1779 935 M
1771 932 D
1765 923 D
1762 909 D
1762 900 D
1765 886 D
1771 877 D
1779 874 D
1785 874 D
1794 877 D
1800 886 D
1802 900 D
1802 909 D
1800 923 D
1794 932 D
1785 935 D
1779 935 D
S
N
1779 935 M
1774 932 D
1771 929 D
1768 923 D
1765 909 D
1765 900 D
1768 886 D
1771 880 D
1774 877 D
1779 874 D
S
N
1785 874 M
1791 877 D
1794 880 D
1797 886 D
1800 900 D
1800 909 D
1797 923 D
1794 929 D
1791 932 D
1785 935 D
S
N
1825 880 M
1823 877 D
1825 874 D
1828 877 D
1825 880 D
S
N
1854 935 M
1849 906 D
S
N
1849 906 M
1854 912 D
1863 915 D
1872 915 D
1880 912 D
1886 906 D
1889 897 D
1889 892 D
1886 883 D
1880 877 D
1872 874 D
1863 874 D
1854 877 D
1851 880 D
1849 886 D
1849 889 D
1851 892 D
1854 889 D
1851 886 D
S
N
1872 915 M
1877 912 D
1883 906 D
1886 897 D
1886 892 D
1883 883 D
1877 877 D
1872 874 D
S
N
1854 935 M
1883 935 D
S
N
1854 932 M
1869 932 D
1883 935 D
S
N
2257 923 M
2263 926 D
2272 935 D
2272 874 D
S
N
2269 932 M
2269 874 D
S
N
2257 874 M
2283 874 D
S
N
2312 880 M
2309 877 D
2312 874 D
2315 877 D
2312 880 D
S
N
2352 935 M
2344 932 D
2338 923 D
2335 909 D
2335 900 D
2338 886 D
2344 877 D
2352 874 D
2358 874 D
2367 877 D
2372 886 D
2375 900 D
2375 909 D
2372 923 D
2367 932 D
2358 935 D
2352 935 D
S
N
2352 935 M
2347 932 D
2344 929 D
2341 923 D
2338 909 D
2338 900 D
2341 886 D
2344 880 D
2347 877 D
2352 874 D
S
N
2358 874 M
2364 877 D
2367 880 D
2370 886 D
2372 900 D
2372 909 D
2370 923 D
2367 929 D
2364 932 D
2358 935 D
S
N
2744 923 M
2749 926 D
2758 935 D
2758 874 D
S
N
2755 932 M
2755 874 D
S
N
2744 874 M
2770 874 D
S
N
2798 880 M
2796 877 D
2798 874 D
2801 877 D
2798 880 D
S
N
2827 935 M
2821 906 D
S
N
2821 906 M
2827 912 D
2836 915 D
2845 915 D
2853 912 D
2859 906 D
2862 897 D
2862 892 D
2859 883 D
2853 877 D
2845 874 D
2836 874 D
2827 877 D
2824 880 D
2821 886 D
2821 889 D
2824 892 D
2827 889 D
2824 886 D
S
N
2845 915 M
2850 912 D
2856 906 D
2859 897 D
2859 892 D
2856 883 D
2850 877 D
2845 874 D
S
N
2827 935 M
2856 935 D
S
N
2827 932 M
2842 932 D
2856 935 D
S
N
3224 923 M
3227 920 D
3224 918 D
3221 920 D
3221 923 D
3224 929 D
3227 932 D
3236 935 D
3247 935 D
3256 932 D
3259 929 D
3262 923 D
3262 918 D
3259 912 D
3250 906 D
3236 900 D
3230 897 D
3224 892 D
3221 883 D
3221 874 D
S
N
3247 935 M
3253 932 D
3256 929 D
3259 923 D
3259 918 D
3256 912 D
3247 906 D
3236 900 D
S
N
3221 880 M
3224 883 D
3230 883 D
3245 877 D
3253 877 D
3259 880 D
3262 883 D
S
N
3230 883 M
3245 874 D
3256 874 D
3259 877 D
3262 883 D
3262 889 D
S
N
3285 880 M
3282 877 D
3285 874 D
3288 877 D
3285 880 D
S
N
3325 935 M
3317 932 D
3311 923 D
3308 909 D
3308 900 D
3311 886 D
3317 877 D
3325 874 D
3331 874 D
3340 877 D
3345 886 D
3348 900 D
3348 909 D
3345 923 D
3340 932 D
3331 935 D
3325 935 D
S
N
3325 935 M
3319 932 D
3317 929 D
3314 923 D
3311 909 D
3311 900 D
3314 886 D
3317 880 D
3319 877 D
3325 874 D
S
N
3331 874 M
3337 877 D
3340 880 D
3343 886 D
3345 900 D
3345 909 D
3343 923 D
3340 929 D
3337 932 D
3331 935 D
S
N
3711 923 M
3714 920 D
3711 918 D
3708 920 D
3708 923 D
3711 929 D
3714 932 D
3722 935 D
3734 935 D
3743 932 D
3745 929 D
3748 923 D
3748 918 D
3745 912 D
3737 906 D
3722 900 D
3717 897 D
3711 892 D
3708 883 D
3708 874 D
S
N
3734 935 M
3740 932 D
3743 929 D
3745 923 D
3745 918 D
3743 912 D
3734 906 D
3722 900 D
S
N
3708 880 M
3711 883 D
3717 883 D
3731 877 D
3740 877 D
3745 880 D
3748 883 D
S
N
3717 883 M
3731 874 D
3743 874 D
3745 877 D
3748 883 D
3748 889 D
S
N
3771 880 M
3768 877 D
3771 874 D
3774 877 D
3771 880 D
S
N
3800 935 M
3794 906 D
S
N
3794 906 M
3800 912 D
3809 915 D
3817 915 D
3826 912 D
3832 906 D
3835 897 D
3835 892 D
3832 883 D
3826 877 D
3817 874 D
3809 874 D
3800 877 D
3797 880 D
3794 886 D
3794 889 D
3797 892 D
3800 889 D
3797 886 D
S
N
3817 915 M
3823 912 D
3829 906 D
3832 897 D
3832 892 D
3829 883 D
3823 877 D
3817 874 D
S
N
3800 935 M
3829 935 D
S
N
3800 932 M
3815 932 D
3829 935 D
S
N
1339 992 M
1347 992 D
S
N
1347 1047 M
1339 1047 D
S
N
1339 1096 M
1347 1096 D
S
N
1364 1139 M
1339 1139 D
S
N
1339 1425 M
1347 1425 D
S
N
1347 1592 M
1339 1592 D
S
N
1339 1710 M
1347 1710 D
S
N
1364 1802 M
1339 1802 D
S
N
1339 1877 M
1347 1877 D
S
N
1347 1941 M
1339 1941 D
S
N
1339 1996 M
1347 1996 D
S
N
1347 2044 M
1339 2044 D
S
N
1339 2088 M
1364 2088 D
S
N
1347 2373 M
1339 2373 D
S
N
1339 2540 M
1347 2540 D
S
N
1347 2659 M
1339 2659 D
S
N
1339 2751 M
1364 2751 D
S
N
1347 2826 M
1339 2826 D
S
N
1339 2889 M
1347 2889 D
S
N
1347 2945 M
1339 2945 D
S
N
1339 2993 M
1347 2993 D
S
N
1364 3036 M
1339 3036 D
S
N
1339 3322 M
1347 3322 D
S
N
1264 1153 M
1270 1156 D
1278 1165 D
1278 1104 D
S
N
1276 1162 M
1276 1104 D
S
N
1264 1104 M
1290 1104 D
S
N
1261 1828 M
1255 1799 D
S
N
1255 1799 M
1261 1805 D
1270 1808 D
1278 1808 D
1287 1805 D
1293 1799 D
1296 1791 D
1296 1785 D
1293 1776 D
1287 1770 D
1278 1768 D
1270 1768 D
1261 1770 D
1258 1773 D
1255 1779 D
1255 1782 D
1258 1785 D
1261 1782 D
1258 1779 D
S
N
1278 1808 M
1284 1805 D
1290 1799 D
1293 1791 D
1293 1785 D
1290 1776 D
1284 1770 D
1278 1768 D
S
N
1261 1828 M
1290 1828 D
S
N
1261 1825 M
1276 1825 D
1290 1828 D
S
N
1206 2102 M
1212 2105 D
1221 2114 D
1221 2053 D
S
N
1218 2111 M
1218 2053 D
S
N
1206 2053 M
1232 2053 D
S
N
1273 2114 M
1264 2111 D
1258 2102 D
1255 2088 D
1255 2079 D
1258 2065 D
1264 2056 D
1273 2053 D
1278 2053 D
1287 2056 D
1293 2065 D
1296 2079 D
1296 2088 D
1293 2102 D
1287 2111 D
1278 2114 D
1273 2114 D
S
N
1273 2114 M
1267 2111 D
1264 2108 D
1261 2102 D
1258 2088 D
1258 2079 D
1261 2065 D
1264 2059 D
1267 2056 D
1273 2053 D
S
N
1278 2053 M
1284 2056 D
1287 2059 D
1290 2065 D
1293 2079 D
1293 2088 D
1290 2102 D
1287 2108 D
1284 2111 D
1278 2114 D
S
N
1203 2777 M
1198 2748 D
S
N
1198 2748 M
1203 2754 D
1212 2757 D
1221 2757 D
1229 2754 D
1235 2748 D
1238 2739 D
1238 2734 D
1235 2725 D
1229 2719 D
1221 2716 D
1212 2716 D
1203 2719 D
1201 2722 D
1198 2728 D
1198 2731 D
1201 2734 D
1203 2731 D
1201 2728 D
S
N
1221 2757 M
1227 2754 D
1232 2748 D
1235 2739 D
1235 2734 D
1232 2725 D
1227 2719 D
1221 2716 D
S
N
1203 2777 M
1232 2777 D
S
N
1203 2774 M
1218 2774 D
1232 2777 D
S
N
1273 2777 M
1264 2774 D
1258 2765 D
1255 2751 D
1255 2742 D
1258 2728 D
1264 2719 D
1273 2716 D
1278 2716 D
1287 2719 D
1293 2728 D
1296 2742 D
1296 2751 D
1293 2765 D
1287 2774 D
1278 2777 D
1273 2777 D
S
N
1273 2777 M
1267 2774 D
1264 2771 D
1261 2765 D
1258 2751 D
1258 2742 D
1261 2728 D
1264 2722 D
1267 2719 D
1273 2716 D
S
N
1278 2716 M
1284 2719 D
1287 2722 D
1290 2728 D
1293 2742 D
1293 2751 D
1290 2765 D
1287 2771 D
1284 2774 D
1278 2777 D
S
N
1149 3051 M
1154 3054 D
1163 3062 D
1163 3002 D
S
N
1160 3060 M
1160 3002 D
S
N
1149 3002 M
1175 3002 D
S
N
1215 3062 M
1206 3060 D
1201 3051 D
1198 3036 D
1198 3028 D
1201 3013 D
1206 3005 D
1215 3002 D
1221 3002 D
1229 3005 D
1235 3013 D
1238 3028 D
1238 3036 D
1235 3051 D
1229 3060 D
1221 3062 D
1215 3062 D
S
N
1215 3062 M
1209 3060 D
1206 3057 D
1203 3051 D
1201 3036 D
1201 3028 D
1203 3013 D
1206 3008 D
1209 3005 D
1215 3002 D
S
N
1221 3002 M
1227 3005 D
1229 3008 D
1232 3013 D
1235 3028 D
1235 3036 D
1232 3051 D
1229 3057 D
1227 3060 D
1221 3062 D
S
N
1273 3062 M
1264 3060 D
1258 3051 D
1255 3036 D
1255 3028 D
1258 3013 D
1264 3005 D
1273 3002 D
1278 3002 D
1287 3005 D
1293 3013 D
1296 3028 D
1296 3036 D
1293 3051 D
1287 3060 D
1278 3062 D
1273 3062 D
S
N
1273 3062 M
1267 3060 D
1264 3057 D
1261 3051 D
1258 3036 D
1258 3028 D
1261 3013 D
1264 3008 D
1267 3005 D
1273 3002 D
S
N
1278 3002 M
1284 3005 D
1287 3008 D
1290 3013 D
1293 3028 D
1293 3036 D
1290 3051 D
1287 3057 D
1284 3060 D
1278 3062 D
S
N
4099 992 M
4107 992 D
S
N
4107 1047 M
4099 1047 D
S
N
4099 1096 M
4107 1096 D
S
N
4107 1139 M
4082 1139 D
S
N
4099 1425 M
4107 1425 D
S
N
4107 1592 M
4099 1592 D
S
N
4099 1710 M
4107 1710 D
S
N
4107 1802 M
4082 1802 D
S
N
4099 1877 M
4107 1877 D
S
N
4107 1941 M
4099 1941 D
S
N
4099 1996 M
4107 1996 D
S
N
4107 2044 M
4099 2044 D
S
N
4082 2088 M
4107 2088 D
S
N
4107 2373 M
4099 2373 D
S
N
4099 2540 M
4107 2540 D
S
N
4107 2659 M
4099 2659 D
S
N
4082 2751 M
4107 2751 D
S
N
4107 2826 M
4099 2826 D
S
N
4099 2889 M
4107 2889 D
S
N
4107 2945 M
4099 2945 D
S
N
4099 2993 M
4107 2993 D
S
N
4107 3036 M
4082 3036 D
S
N
4099 3322 M
4107 3322 D
S
N
1680 1690 M
1611 1690 D
S
N
1645 1690 M
1645 1605 D
S
N
1680 1605 M
1611 1605 D
S
N
2293 1752 M
2224 1752 D
S
N
2258 1752 M
2258 1710 D
S
N
2293 1710 M
2224 1710 D
S
N
2906 1887 M
2837 1887 D
S
N
2871 1887 M
2871 1819 D
S
N
2906 1819 M
2837 1819 D
S
N
3519 2218 M
3450 2218 D
S
N
3484 2218 M
3484 2167 D
S
N
3519 2167 M
3450 2167 D
S
N
3979 2754 M
3909 2754 D
S
N
3944 2754 M
3944 2594 D
S
N
3979 2594 M
3909 2594 D
S
N
1680 1844 M
1611 1844 D
S
N
1645 1844 M
1645 1685 D
S
N
1680 1685 M
1611 1685 D
S
N
1622 1761 M
1622 1784 D
1634 1795 D
1657 1795 D
1669 1784 D
1669 1761 D
1657 1749 D
1634 1749 D
1622 1761 D
S
N
2290 1917 M
2221 1917 D
S
N
2256 1917 M
2256 1749 D
S
N
2290 1749 M
2221 1749 D
S
N
2232 1830 M
2232 1853 D
2244 1864 D
2267 1864 D
2279 1853 D
2279 1830 D
2267 1818 D
2244 1818 D
2232 1830 D
S
N
2902 1929 M
2833 1929 D
S
N
2867 1929 M
2867 1730 D
S
N
2902 1730 M
2833 1730 D
S
N
2844 1830 M
2844 1853 D
2856 1864 D
2879 1864 D
2891 1853 D
2891 1830 D
2879 1818 D
2856 1818 D
2844 1830 D
S
N
3513 2334 M
3444 2334 D
S
N
3478 2334 M
3478 2226 D
S
N
3513 2226 M
3444 2226 D
S
N
3455 2272 M
3455 2295 D
3467 2307 D
3490 2307 D
3502 2295 D
3502 2272 D
3490 2261 D
3467 2261 D
3455 2272 D
S
N
4001 2796 M
3931 2796 D
S
N
3966 2796 M
3966 2636 D
S
N
4001 2636 M
3931 2636 D
S
N
3943 2712 M
3943 2735 D
3954 2747 D
3977 2747 D
3989 2735 D
3989 2712 D
3977 2701 D
3954 2701 D
3943 2712 D
S
N
1665 2783 M
1596 2783 D
S
N
1631 2783 M
1631 2679 D
S
N
1665 2679 M
1596 2679 D
S
N
1608 2723 M
1608 2746 D
1619 2757 D
1642 2757 D
1654 2746 D
1654 2723 D
1642 2711 D
1619 2711 D
1608 2723 D
S
8 Sw
0.00 0.00 1.00 setrgbcolor
N
1339 992 M
1339 1650 D
1952 1650 D
1952 1732 D
2565 1732 D
2565 1855 D
3178 1855 D
3178 2193 D
3714 2193 D
3714 2682 D
4097 2682 D
4097 3245 D
4107 3245 D
S
N
1680 1690 M
1611 1690 D
S
N
1645 1690 M
1645 1605 D
S
N
1680 1605 M
1611 1605 D
S
N
2293 1752 M
2224 1752 D
S
N
2258 1752 M
2258 1710 D
S
N
2293 1710 M
2224 1710 D
S
N
2906 1887 M
2837 1887 D
S
N
2871 1887 M
2871 1819 D
S
N
2906 1819 M
2837 1819 D
S
N
3519 2218 M
3450 2218 D
S
N
3484 2218 M
3484 2167 D
S
N
3519 2167 M
3450 2167 D
S
N
3979 2754 M
3909 2754 D
S
N
3944 2754 M
3944 2594 D
S
N
3979 2594 M
3909 2594 D
S
0.00 0.00 0.00 setrgbcolor
[39] 0 Sd
N
1339 992 M
1339 1066 D
1952 1066 D
1952 1227 D
2565 1227 D
2565 1438 D
3178 1438 D
3178 1844 D
3714 1844 D
3714 2356 D
4097 2356 D
4097 2827 D
4107 2827 D
S
0.00 0.00 1.00 setrgbcolor
[] 0 Sd
N
1534 3160 M
1825 3160 D
S
0.00 0.00 0.00 setrgbcolor
[39] 0 Sd
N
1534 2934 M
1825 2934 D
S
[] 0 Sd
N
1898 3193 M
1898 3117 D
S
N
1901 3193 M
1944 3124 D
S
N
1901 3185 M
1944 3117 D
S
N
1944 3193 M
1944 3117 D
S
N
1887 3193 M
1901 3193 D
S
N
1934 3193 M
1955 3193 D
S
N
1887 3117 M
1908 3117 D
S
N
1980 3193 M
1980 3117 D
S
N
1984 3193 M
2027 3124 D
S
N
1984 3185 M
2027 3117 D
S
N
2027 3193 M
2027 3117 D
S
N
1970 3193 M
1984 3193 D
S
N
2016 3193 M
2038 3193 D
S
N
1970 3117 M
1991 3117 D
S
N
2063 3193 M
2063 3117 D
S
N
2067 3193 M
2067 3117 D
S
N
2053 3193 M
2078 3193 D
S
N
2053 3117 M
2107 3117 D
2107 3138 D
2103 3117 D
S
N
2146 3193 M
2135 3189 D
2128 3182 D
2125 3175 D
2121 3160 D
2121 3149 D
2125 3135 D
2128 3128 D
2135 3120 D
2146 3117 D
2153 3117 D
2164 3120 D
2171 3128 D
2175 3135 D
2179 3149 D
2179 3160 D
2175 3175 D
2171 3182 D
2164 3189 D
2153 3193 D
2146 3193 D
S
N
2146 3193 M
2139 3189 D
2132 3182 D
2128 3175 D
2125 3160 D
2125 3149 D
2128 3135 D
2132 3128 D
2139 3120 D
2146 3117 D
S
N
2153 3117 M
2161 3120 D
2168 3128 D
2171 3135 D
2175 3149 D
2175 3160 D
2171 3175 D
2168 3182 D
2161 3189 D
2153 3193 D
S
N
1898 2967 M
1898 2891 D
S
N
1901 2967 M
1944 2898 D
S
N
1901 2959 M
1944 2891 D
S
N
1944 2967 M
1944 2891 D
S
N
1887 2967 M
1901 2967 D
S
N
1934 2967 M
1955 2967 D
S
N
1887 2891 M
1908 2891 D
S
N
1980 2967 M
1980 2891 D
S
N
1984 2967 M
1984 2891 D
S
N
1970 2967 M
1995 2967 D
S
N
1970 2891 M
2024 2891 D
2024 2912 D
2020 2891 D
S
N
2063 2967 M
2053 2963 D
2045 2956 D
2042 2948 D
2038 2934 D
2038 2923 D
2042 2909 D
2045 2902 D
2053 2894 D
2063 2891 D
2071 2891 D
2081 2894 D
2089 2902 D
2092 2909 D
2096 2923 D
2096 2934 D
2092 2948 D
2089 2956 D
2081 2963 D
2071 2967 D
2063 2967 D
S
N
2063 2967 M
2056 2963 D
2049 2956 D
2045 2948 D
2042 2934 D
2042 2923 D
2045 2909 D
2049 2902 D
2056 2894 D
2063 2891 D
S
N
2071 2891 M
2078 2894 D
2085 2902 D
2089 2909 D
2092 2923 D
2092 2934 D
2089 2948 D
2085 2956 D
2078 2963 D
2071 2967 D
S
N
1941 2756 M
1944 2745 D
1944 2766 D
1941 2756 D
1934 2763 D
1923 2766 D
1916 2766 D
1905 2763 D
1898 2756 D
1894 2748 D
1890 2738 D
1890 2720 D
1894 2709 D
1898 2702 D
1905 2694 D
1916 2691 D
1923 2691 D
1934 2694 D
1941 2702 D
1944 2709 D
S
N
1916 2766 M
1908 2763 D
1901 2756 D
1898 2748 D
1894 2738 D
1894 2720 D
1898 2709 D
1901 2702 D
1908 2694 D
1916 2691 D
S
N
1973 2766 M
1973 2691 D
S
N
1977 2766 M
1998 2702 D
S
N
1973 2766 M
1998 2691 D
S
N
2024 2766 M
1998 2691 D
S
N
2024 2766 M
2024 2691 D
S
N
2027 2766 M
2027 2691 D
S
N
1962 2766 M
1977 2766 D
S
N
2024 2766 M
2038 2766 D
S
N
1962 2691 M
1984 2691 D
S
N
2013 2691 M
2038 2691 D
S
N
2103 2756 M
2107 2766 D
2107 2745 D
2103 2756 D
2096 2763 D
2085 2766 D
2074 2766 D
2063 2763 D
2056 2756 D
2056 2748 D
2060 2741 D
2063 2738 D
2071 2734 D
2092 2727 D
2099 2723 D
2107 2716 D
S
N
2056 2748 M
2063 2741 D
2071 2738 D
2092 2730 D
2099 2727 D
2103 2723 D
2107 2716 D
2107 2702 D
2099 2694 D
2089 2691 D
2078 2691 D
2067 2694 D
2060 2702 D
2056 2712 D
2056 2691 D
2060 2702 D
S
1.00 0.00 0.00 setrgbcolor
N
2472 3058 M
2476 3054 D
2472 3049 D
2468 3054 D
2468 3058 D
2472 3067 D
2476 3071 D
2489 3075 D
2507 3075 D
2519 3071 D
2524 3067 D
2528 3058 D
2528 3049 D
2524 3041 D
2511 3032 D
2489 3023 D
2481 3019 D
2472 3011 D
2468 2998 D
2468 2985 D
S
N
2507 3075 M
2515 3071 D
2519 3067 D
2524 3058 D
2524 3049 D
2519 3041 D
2507 3032 D
2489 3023 D
S
N
2468 2993 M
2472 2998 D
2481 2998 D
2502 2989 D
2515 2989 D
2524 2993 D
2528 2998 D
S
N
2481 2998 M
2502 2985 D
2519 2985 D
2524 2989 D
2528 2998 D
2528 3006 D
S
N
2545 3032 M
2554 3041 D
2563 3045 D
2571 3045 D
2580 3041 D
2584 3036 D
2589 3023 D
2589 3006 D
2584 2989 D
2571 2954 D
S
N
2550 3036 M
2558 3041 D
2576 3041 D
2584 3036 D
S
N
2619 3045 M
2615 3032 D
2610 3023 D
2589 2993 D
2576 2972 D
2567 2954 D
S
N
2615 3045 M
2610 3032 D
2606 3023 D
2589 2993 D
S
N
2649 3075 M
2649 2985 D
S
N
2654 3075 M
2705 2993 D
S
N
2654 3067 M
2705 2985 D
S
N
2705 3075 M
2705 2985 D
S
N
2636 3075 M
2654 3075 D
S
N
2692 3075 M
2718 3075 D
S
N
2636 2985 M
2662 2985 D
S
N
2749 3075 M
2749 2985 D
S
N
2753 3075 M
2805 2993 D
S
N
2753 3067 M
2805 2985 D
S
N
2805 3075 M
2805 2985 D
S
N
2736 3075 M
2753 3075 D
S
N
2792 3075 M
2818 3075 D
S
N
2736 2985 M
2762 2985 D
S
N
2848 3075 M
2848 2985 D
S
N
2853 3075 M
2853 2985 D
S
N
2835 3075 M
2865 3075 D
S
N
2835 2985 M
2900 2985 D
2900 3011 D
2896 2985 D
S
N
2948 3075 M
2935 3071 D
2926 3062 D
2922 3054 D
2917 3036 D
2917 3023 D
2922 3006 D
2926 2998 D
2935 2989 D
2948 2985 D
2956 2985 D
2969 2989 D
2978 2998 D
2982 3006 D
2987 3023 D
2987 3036 D
2982 3054 D
2978 3062 D
2969 3071 D
2956 3075 D
2948 3075 D
S
N
2948 3075 M
2939 3071 D
2930 3062 D
2926 3054 D
2922 3036 D
2922 3023 D
2926 3006 D
2930 2998 D
2939 2989 D
2948 2985 D
S
N
2956 2985 M
2965 2989 D
2974 2998 D
2978 3006 D
2982 3023 D
2982 3036 D
2978 3054 D
2974 3062 D
2965 3071 D
2956 3075 D
S
0.00 0.00 0.00 setrgbcolor
N
2489 2819 M
2467 2744 D
S
N
2492 2819 M
2470 2744 D
S
N
2489 2808 M
2485 2787 D
2485 2776 D
2492 2769 D
2499 2769 D
2507 2772 D
2514 2780 D
2521 2790 D
S
N
2528 2819 M
2517 2780 D
2517 2772 D
2521 2769 D
2532 2769 D
2539 2776 D
2543 2783 D
S
N
2532 2819 M
2521 2780 D
2521 2772 D
2525 2769 D
S
N
2563 2790 M
2563 2740 D
S
N
2565 2790 M
2565 2740 D
S
N
2556 2790 M
2585 2790 D
2592 2788 D
2594 2786 D
2597 2781 D
2597 2776 D
2594 2771 D
2592 2769 D
2585 2766 D
2565 2766 D
S
N
2585 2790 M
2589 2788 D
2592 2786 D
2594 2781 D
2594 2776 D
2592 2771 D
2589 2769 D
2585 2766 D
S
N
2556 2740 M
2573 2740 D
S
N
2577 2766 M
2582 2764 D
2585 2762 D
2592 2745 D
2594 2742 D
2597 2742 D
2599 2745 D
S
N
2582 2764 M
2585 2759 D
2589 2742 D
2592 2740 D
2597 2740 D
2599 2745 D
2599 2747 D
S
N
2623 2812 M
2688 2812 D
S
N
2623 2790 M
2688 2790 D
S
N
2728 2819 M
2706 2744 D
S
N
2731 2819 M
2710 2744 D
S
N
2728 2808 M
2724 2787 D
2724 2776 D
2731 2769 D
2738 2769 D
2746 2772 D
2753 2780 D
2760 2790 D
S
N
2767 2819 M
2756 2780 D
2756 2772 D
2760 2769 D
2771 2769 D
2778 2776 D
2782 2783 D
S
N
2771 2819 M
2760 2780 D
2760 2772 D
2764 2769 D
S
N
2802 2790 M
2802 2740 D
S
N
2804 2790 M
2804 2740 D
S
N
2819 2776 M
2819 2757 D
S
N
2795 2790 M
2833 2790 D
2833 2776 D
2831 2790 D
S
N
2804 2766 M
2819 2766 D
S
N
2795 2740 M
2812 2740 D
S
N
2857 2812 M
2922 2812 D
S
N
2857 2790 M
2922 2790 D
S
N
2955 2844 M
2955 2769 D
S
N
2958 2844 M
2980 2780 D
S
N
2955 2844 M
2980 2769 D
S
N
3005 2844 M
2980 2769 D
S
N
3005 2844 M
3005 2769 D
S
N
3009 2844 M
3009 2769 D
S
N
2944 2844 M
2958 2844 D
S
N
3005 2844 M
3020 2844 D
S
N
2944 2769 M
2965 2769 D
S
N
2994 2769 M
3020 2769 D
S
N
3034 2766 M
3039 2771 D
3044 2774 D
3048 2774 D
3053 2771 D
3056 2769 D
3058 2762 D
3058 2752 D
3056 2742 D
3048 2723 D
S
N
3036 2769 M
3041 2771 D
3051 2771 D
3056 2769 D
S
N
3075 2774 M
3072 2766 D
3070 2762 D
3058 2745 D
3051 2733 D
3046 2723 D
S
N
3072 2774 M
3070 2766 D
3068 2762 D
3058 2745 D
S
N
3082 2766 M
3087 2771 D
3092 2774 D
3096 2774 D
3101 2771 D
3104 2769 D
3106 2762 D
3106 2752 D
3104 2742 D
3096 2723 D
S
N
3084 2769 M
3089 2771 D
3099 2771 D
3104 2769 D
S
N
3123 2774 M
3120 2766 D
3118 2762 D
3106 2745 D
3099 2733 D
3094 2723 D
S
N
3120 2774 M
3118 2766 D
3116 2762 D
3106 2745 D
S
N
701 1820 M
777 1820 D
S
N
701 1824 M
777 1824 D
S
N
737 1820 M
730 1813 D
726 1806 D
726 1799 D
730 1788 D
737 1781 D
748 1777 D
755 1777 D
766 1781 D
773 1788 D
777 1799 D
777 1806 D
773 1813 D
766 1820 D
S
N
726 1799 M
730 1792 D
737 1784 D
748 1781 D
755 1781 D
766 1784 D
773 1792 D
777 1799 D
S
N
701 1810 M
701 1824 D
S
N
777 1820 M
777 1835 D
S
N
726 1910 M
726 1874 D
730 1864 D
741 1856 D
752 1853 D
762 1853 D
770 1856 D
773 1860 D
777 1867 D
777 1874 D
773 1885 D
762 1892 D
752 1896 D
741 1896 D
734 1892 D
730 1889 D
726 1882 D
S
N
726 1874 M
730 1867 D
741 1860 D
752 1856 D
766 1856 D
773 1860 D
S
N
777 1874 M
773 1882 D
762 1889 D
752 1892 D
737 1892 D
730 1889 D
S
N
730 1889 M
730 1910 D
S
N
687 1990 M
802 1925 D
S
N
701 2051 M
777 2051 D
S
N
701 2055 M
777 2055 D
S
N
737 2051 M
730 2044 D
726 2037 D
726 2029 D
730 2019 D
737 2011 D
748 2008 D
755 2008 D
766 2011 D
773 2019 D
777 2029 D
777 2037 D
773 2044 D
766 2051 D
S
N
726 2029 M
730 2022 D
737 2015 D
748 2011 D
755 2011 D
766 2015 D
773 2022 D
777 2029 D
S
N
701 2040 M
701 2055 D
S
N
777 2051 M
777 2065 D
S
N
701 2109 M
777 2080 D
S
N
701 2109 M
777 2138 D
S
N
712 2109 M
777 2134 D
S
N
773 2083 M
773 2134 D
S
N
777 2080 M
777 2138 D
S
N
701 2195 M
802 2174 D
S
N
701 2199 M
802 2170 D
S
N
726 2181 M
730 2166 D
737 2159 D
748 2156 D
759 2156 D
766 2159 D
773 2166 D
777 2177 D
777 2188 D
773 2202 D
766 2210 D
755 2213 D
744 2213 D
737 2210 D
730 2202 D
726 2192 D
726 2181 D
S
N
726 2181 M
730 2170 D
737 2163 D
748 2159 D
759 2159 D
766 2163 D
773 2170 D
777 2177 D
S
N
777 2188 M
773 2199 D
766 2206 D
755 2210 D
744 2210 D
737 2206 D
730 2199 D
726 2192 D
S
N
779 2231 M
774 2236 D
772 2241 D
772 2246 D
774 2250 D
777 2253 D
784 2255 D
794 2255 D
803 2253 D
822 2246 D
S
N
777 2234 M
774 2238 D
774 2248 D
777 2253 D
S
N
772 2272 M
779 2270 D
784 2267 D
801 2255 D
813 2248 D
822 2243 D
S
N
772 2270 M
779 2267 D
784 2265 D
801 2255 D
S
N
779 2279 M
774 2284 D
772 2289 D
772 2294 D
774 2299 D
777 2301 D
784 2303 D
794 2303 D
803 2301 D
822 2294 D
S
N
777 2282 M
774 2286 D
774 2296 D
777 2301 D
S
N
772 2320 M
779 2318 D
784 2315 D
801 2303 D
813 2296 D
822 2291 D
S
N
772 2318 M
779 2315 D
784 2313 D
801 2303 D
S
N
687 2427 M
694 2420 D
705 2413 D
719 2405 D
737 2402 D
752 2402 D
770 2405 D
784 2413 D
795 2420 D
802 2427 D
S
N
694 2420 M
708 2413 D
719 2409 D
737 2405 D
752 2405 D
770 2409 D
780 2413 D
795 2420 D
S
N
726 2456 M
802 2456 D
S
N
726 2459 M
802 2459 D
S
N
737 2459 M
730 2467 D
726 2474 D
726 2481 D
730 2492 D
737 2499 D
748 2503 D
755 2503 D
766 2499 D
773 2492 D
777 2481 D
777 2474 D
773 2467 D
766 2459 D
S
N
726 2481 M
730 2488 D
737 2496 D
748 2499 D
755 2499 D
766 2496 D
773 2488 D
777 2481 D
S
N
726 2445 M
726 2459 D
S
N
802 2445 M
802 2470 D
S
N
701 2532 M
777 2532 D
S
N
701 2535 M
777 2535 D
S
N
737 2535 M
730 2542 D
726 2550 D
726 2557 D
730 2568 D
737 2575 D
748 2578 D
755 2578 D
766 2575 D
773 2568 D
777 2557 D
777 2550 D
773 2542 D
766 2535 D
S
N
726 2557 M
730 2564 D
737 2571 D
748 2575 D
755 2575 D
766 2571 D
773 2564 D
777 2557 D
S
N
701 2521 M
701 2535 D
S
N
687 2600 M
694 2607 D
705 2614 D
719 2622 D
737 2625 D
752 2625 D
770 2622 D
784 2614 D
795 2607 D
802 2600 D
S
N
694 2607 M
708 2614 D
719 2618 D
737 2622 D
752 2622 D
770 2618 D
780 2614 D
795 2607 D
S
N
2595 799 M
2562 711 D
S
N
2595 799 M
2629 711 D
S
N
2595 787 M
2625 711 D
S
N
2566 715 M
2625 715 D
S
N
2562 711 M
2629 711 D
S
N
2696 799 M
2671 682 D
S
N
2700 799 M
2667 682 D
S
N
2679 770 M
2662 766 D
2654 757 D
2650 745 D
2650 732 D
2654 724 D
2662 715 D
2675 711 D
2687 711 D
2704 715 D
2713 724 D
2717 736 D
2717 749 D
2713 757 D
2704 766 D
2692 770 D
2679 770 D
S
N
2679 770 M
2667 766 D
2658 757 D
2654 745 D
2654 732 D
2658 724 D
2667 715 D
2675 711 D
S
N
2687 711 M
2700 715 D
2708 724 D
2713 736 D
2713 749 D
2708 757 D
2700 766 D
2692 770 D
S
N
2738 708 M
2743 714 D
2749 717 D
2754 717 D
2760 714 D
2763 711 D
2765 703 D
2765 692 D
2763 681 D
2754 658 D
S
N
2740 711 M
2746 714 D
2757 714 D
2763 711 D
S
N
2785 717 M
2782 708 D
2779 703 D
2765 683 D
2757 669 D
2752 658 D
S
N
2782 717 M
2779 708 D
2777 703 D
2765 683 D
S
N
2793 708 M
2799 714 D
2804 717 D
2810 717 D
2816 714 D
2818 711 D
2821 703 D
2821 692 D
2818 681 D
2810 658 D
S
N
2796 711 M
2802 714 D
2813 714 D
2818 711 D
S
N
2841 717 M
2838 708 D
2835 703 D
2821 683 D
2813 669 D
2807 658 D
S
N
2838 717 M
2835 708 D
2832 703 D
2821 683 D
S
showpage
%%Trailer
%%Pages: 1
%%BoundingBox:
