%!PS-Adobe-2.0 EPSF-2.0
%%BoundingBox:  0 0 567 384
%%Title: : DisplayReweightedBornBox_DiphoxGamma2MC_qt_Kqt_Kmgg_new
%%Creator: ROOT Version 5.26/00
%%CreationDate: Fri Jan  6 19:47:12 2012
%%EndComments
%%BeginProlog
80 dict begin
/s {stroke} def /l {lineto} def /m {moveto} def /t {translate} def
/sw {stringwidth} def /r {rotate} def /rl {roll}  def /R {repeat} def
/d {rlineto} def /rm {rmoveto} def /gr {grestore} def /f {eofill} def
/c {setrgbcolor} def /black {0 setgray} def /sd {setdash} def
/cl {closepath} def /sf {scalefont setfont} def /lw {setlinewidth} def
/box {m dup 0 exch d exch 0 d 0 exch neg d cl} def
/NC{systemdict begin initclip end}def/C{NC box clip newpath}def
/bl {box s} def /bf {box f} def /Y { 0 exch d} def /X { 0 d} def 
/mp {newpath /y exch def /x exch def} def
/side {[w .77 mul w .23 mul] .385 w mul sd w 0 l currentpoint t -144 r} def
/mr {mp x y w2 0 360 arc} def /m24 {mr s} def /m20 {mr f} def
/mb {mp x y w2 add m w2 neg 0 d 0 w neg d w 0 d 0 w d cl} def
/mt {mp x y w2 add m w2 neg w neg d w 0 d cl} def
/m21 {mb f} def /m25 {mb s} def /m22 {mt f} def /m26{mt s} def
/m23 {mp x y w2 sub m w2 w d w neg 0 d cl f} def
/m27 {mp x y w2 add m w3 neg w2 neg d w3 w2 neg d w3 w2 d cl s} def
/m28 {mp x w2 sub y w2 sub w3 add m w3 0 d  0 w3 neg d w3 0 d 0 w3 d w3 0 d  0 w3 d w3 neg 0 d 0 w3 d w3 neg 0 d
 0 w3 neg d w3 neg 0 d cl s } def
/m29 {mp gsave x w2 sub y w2 add w3 sub m currentpoint t
 4 {side} repeat cl fill gr} def
/m30 {mp gsave x w2 sub y w2 add w3 sub m currentpoint t
 4 {side} repeat cl s gr} def
/m31 {mp x y w2 sub m 0 w d x w2 sub y m w 0 d x w2 sub y w2 add m w w neg d x w2 sub y w2
 sub m w w d s} def
/m2 {mp x y w2 sub m 0 w d x w2 sub y m w 0 d s} def
/m5 {mp x w2 sub y w2 sub m w w d x w2 sub y w2 add m w w neg d s} def
/reEncode {exch findfont dup length dict begin {1 index /FID eq  {pop pop} {def} ifelse } forall /Encoding exch def currentdict end dup /FontName get exch definefont pop } def [/Times-Bold /Times-Italic /Times-BoldItalic /Helvetica
 /Helvetica-Oblique /Helvetica-Bold /Helvetica-BoldOblique /Courier /Courier-Oblique /Courier-Bold /Courier-BoldOblique /Times-Roman /AvantGarde-Book /AvantGarde-BookOblique /AvantGarde-Demi /AvantGarde-DemiOblique /Bookman-Demi
 /Bookman-DemiItalic /Bookman-Light /Bookman-LightItalic /Helvetica-Narrow /Helvetica-Narrow-Bold /Helvetica-Narrow-BoldOblique /Helvetica-Narrow-Oblique /NewCenturySchlbk-Roman /NewCenturySchlbk-Bold
 /NewCenturySchlbk-BoldItalic /NewCenturySchlbk-Italic /Palatino-Bold /Palatino-BoldItalic /Palatino-Italic /Palatino-Roman ] {ISOLatin1Encoding reEncode } forall
/oshow {gsave [] 0 sd true charpath stroke gr} def
/stwn { /fs exch def /fn exch def /text exch def fn findfont fs sf
 text sw pop xs add /xs exch def} def
/stwb { /fs exch def /fn exch def /nbas exch def /textf exch deftextf length /tlen exch def nbas tlen gt {/nbas tlendef} iffn findfont fs sf textf dup length nbas sub nbas getinterval sw
pop neg xs add /xs exch def} def
%%EndProlog
%%BeginSetup
%%EndSetup
newpath  gsave  .25 .25 scale  gsave  0 0 t black[  ] 0 sd 3 lw 1 1 1 c 2268 1538 0 0 bf black 1 1 1 c 1791 1215 363 246 bf black 1791 1215 363 246 bl 1 1 1 c 1791 1215 363 246 bf black 1791 1215 363 246 bl 1 0 0 c 6 lw 1 1 1 c black 1 0 0 c 363
 1332 m 149 X -86 Y 50 X -63 Y 50 X -50 Y 49 X -44 Y 50 X -38 Y 50 X -33 Y 50 X -35 Y 49 X -25 Y 50 X -29 Y 50 X -26 Y 50 X -27 Y 50 X -29 Y 49 X -17 Y 50 X -31 Y 50 X -25 Y 50 X -18 Y 49 X -27 Y 50 X -20 Y 50 X -20 Y 50 X -32 Y 49 X -17 Y 50 X -27
 Y 50 X -14 Y 50 X -31 Y 49 X -15 Y 50 X -19 Y 50 X -33 Y 50 X -19 Y 50 X -20 Y 49 X -16 Y 50 X -41 Y 50 X -18 Y 50 X -1 Y 49 X s black 3 lw 363 246 m 1791 X s
 gsave  2268 1538 0 0 C 1922 127 t 0 r /Helvetica findfont 71.6807 sf 0 0 m (  \(GeV\)) show NC gr 
 gsave  2268 1538 0 0 C 1893 88 t 0 r /Helvetica findfont 48.8732 sf 0 0 m (T) show NC gr 
 gsave  2268 1538 0 0 C 1857 127 t 0 r /Helvetica findfont 71.6807 sf 0 0 m (q) show NC gr  363 283 m -37 Y s 425 264 m -18 Y s 487 264 m -18 Y s 549 264 m -18 Y s 612 283 m -37 Y s 674 264 m -18 Y s 736 264 m -18 Y s 798 264 m -18 Y s 860 283 m -37
 Y s 923 264 m -18 Y s 985 264 m -18 Y s 1047 264 m -18 Y s 1109 283 m -37 Y s 1171 264 m -18 Y s 1234 264 m -18 Y s 1296 264 m -18 Y s 1358 283 m -37 Y s 1420 264 m -18 Y s 1483 264 m -18 Y s 1545 264 m -18 Y s 1607 283 m -37 Y s 1669 264 m -18 Y s
 1731 264 m -18 Y s 1794 264 m -18 Y s 1856 283 m -37 Y s 1918 264 m -18 Y s 1980 264 m -18 Y s 2042 264 m -18 Y s 2105 283 m -37 Y s 2105 283 m -37 Y s
 gsave  2268 1538 0 0 C 342 179 t 0 r /Helvetica findfont 71.6807 sf 0 0 m (0) show NC gr 
 gsave  2268 1538 0 0 C 570 179 t 0 r /Helvetica findfont 71.6807 sf 0 0 m (20) show NC gr 
 gsave  2268 1538 0 0 C 821 179 t 0 r /Helvetica findfont 71.6807 sf 0 0 m (40) show NC gr 
 gsave  2268 1538 0 0 C 1069 179 t 0 r /Helvetica findfont 71.6807 sf 0 0 m (60) show NC gr 
 gsave  2268 1538 0 0 C 1316 179 t 0 r /Helvetica findfont 71.6807 sf 0 0 m (80) show NC gr 
 gsave  2268 1538 0 0 C 1548 179 t 0 r /Helvetica findfont 71.6807 sf 0 0 m (100) show NC gr 
 gsave  2268 1538 0 0 C 1795 179 t 0 r /Helvetica findfont 71.6807 sf 0 0 m (120) show NC gr 
 gsave  2268 1538 0 0 C 2043 179 t 0 r /Helvetica findfont 71.6807 sf 0 0 m (140) show NC gr  363 1461 m 1791 X s 363 1425 m 36 Y s 425 1443 m 18 Y s 487 1443 m 18 Y s 549 1443 m 18 Y s 612 1425 m 36 Y s 674 1443 m 18 Y s 736 1443 m 18 Y s 798 1443
 m 18 Y s 860 1425 m 36 Y s 923 1443 m 18 Y s 985 1443 m 18 Y s 1047 1443 m 18 Y s 1109 1425 m 36 Y s 1171 1443 m 18 Y s 1234 1443 m 18 Y s 1296 1443 m 18 Y s 1358 1425 m 36 Y s 1420 1443 m 18 Y s 1483 1443 m 18 Y s 1545 1443 m 18 Y s 1607 1425 m 36
 Y s 1669 1443 m 18 Y s 1731 1443 m 18 Y s 1794 1443 m 18 Y s 1856 1425 m 36 Y s 1918 1443 m 18 Y s 1980 1443 m 18 Y s 2042 1443 m 18 Y s 2105 1425 m 36 Y s 2105 1425 m 36 Y s 363 246 m 1215 Y s
 gsave  2268 1538 0 0 C 98 1153 t 90 r /Helvetica findfont 71.6807 sf 0 0 m ( \(pb/GeV\)) show NC gr 
 gsave  2268 1538 0 0 C 137 1124 t 90 r /Helvetica findfont 48.8732 sf 0 0 m (T) show NC gr 
 gsave  2268 1538 0 0 C 98 1030 t 90 r /Helvetica findfont 71.6807 sf 0 0 m (/dq) show NC gr 
 gsave  2268 1538 0 0 C 98 987 t 90 r /Symbol findfont 71.6807 sf 0 0 m (s) show NC gr 
 gsave  2268 1538 0 0 C 98 951 t 90 r /Helvetica findfont 71.6807 sf 0 0 m (d) show NC gr  390 278 m -27 X s 390 360 m -27 X s 390 417 m -27 X s 390 462 m -27 X s 390 499 m -27 X s 390 530 m -27 X s 390 557 m -27 X s 390 581 m -27 X s 417 602 m -54
 X s
 gsave  2268 1538 0 0 C 300 600 t 0 r /Helvetica findfont 48.8732 sf 0 0 m (\2552) show NC gr 
 gsave  2268 1538 0 0 C 222 570 t 0 r /Helvetica findfont 71.6807 sf 0 0 m (10) show NC gr  390 741 m -27 X s 390 823 m -27 X s 390 881 m -27 X s 390 926 m -27 X s 390 962 m -27 X s 390 993 m -27 X s 390 1020 m -27 X s 390 1044 m -27 X s 417 1065 m
 -54 X s
 gsave  2268 1538 0 0 C 306 1062 t 0 r /Helvetica findfont 48.8732 sf 0 0 m (\2551) show NC gr 
 gsave  2268 1538 0 0 C 228 1033 t 0 r /Helvetica findfont 71.6807 sf 0 0 m (10) show NC gr  390 1205 m -27 X s 390 1286 m -27 X s 390 1344 m -27 X s 390 1389 m -27 X s 390 1426 m -27 X s 390 1457 m -27 X s 2154 246 m 1215 Y s 2127 278 m 27 X s 2127
 360 m 27 X s 2127 417 m 27 X s 2127 462 m 27 X s 2127 499 m 27 X s 2127 530 m 27 X s 2127 557 m 27 X s 2127 581 m 27 X s 2101 602 m 53 X s 2127 741 m 27 X s 2127 823 m 27 X s 2127 881 m 27 X s 2127 926 m 27 X s 2127 962 m 27 X s 2127 993 m 27 X s
 2127 1020 m 27 X s 2127 1044 m 27 X s 2101 1065 m 53 X s 2127 1205 m 27 X s 2127 1286 m 27 X s 2127 1344 m 27 X s 2127 1389 m 27 X s 2127 1426 m 27 X s 2127 1457 m 27 X s 0 0 1 c 6 lw 1 1 1 c black 0 0 1 c 363 1237 m 50 X 71 Y 49 X -40 Y 50 X -27 Y
 50 X -28 Y 50 X -39 Y 49 X -24 Y 50 X -35 Y 50 X -25 Y 50 X -36 Y 49 X -22 Y 50 X -28 Y 50 X -19 Y 50 X -36 Y 50 X -34 Y 49 X -25 Y 50 X -19 Y 50 X -35 Y 50 X -20 Y 49 X -35 Y 50 X -27 Y 50 X -27 Y 50 X -23 Y 49 X -21 Y 50 X -23 Y 50 X -31 Y 50 X
 -37 Y 49 X -12 Y 50 X -7 Y 50 X -37 Y 50 X -20 Y 50 X -42 Y 49 X -13 Y 50 X -48 Y 50 X -30 Y 50 X 8 Y 49 X s 0.35 0.83 0.33 c 1 1 1 c black 0.35 0.83 0.33 c 363 1331 m 99 X -2 Y 50 X -86 Y 50 X -62 Y 50 X -50 Y 49 X -45 Y 50 X -38 Y 50 X -33 Y 50 X
 -35 Y 49 X -25 Y 50 X -30 Y 50 X -26 Y 50 X -27 Y 50 X -29 Y 49 X -17 Y 50 X -31 Y 50 X -26 Y 50 X -19 Y 49 X -26 Y 50 X -20 Y 50 X -19 Y 50 X -33 Y 49 X -17 Y 50 X -29 Y 50 X -15 Y 50 X -33 Y 49 X -20 Y 50 X -15 Y 50 X -31 Y 50 X -34 Y 50 X -14 Y
 49 X -22 Y 50 X -46 Y 50 X -23 Y 50 X 8 Y 49 X s black 3 lw 1 1 1 c 1218 384 893 1046 bf black 912 1046 m -13 Y 1212 X 378 Y -13 X -365 Y f 893 1046 m 384 Y 1218 X -384 Y -1218 X cl s
 gsave  2268 1538 0 0 C 1196 1355 t 0 r /Helvetica findfont 39.0986 sf 0 0 m (Diphox Born with 1\255,2\255frag + Gamma2MC Box NLO) show NC gr  1 0 0 c 6 lw 938 1366 m 214 X s black
 gsave  2268 1538 0 0 C 1196 1225 t 0 r /Helvetica findfont 39.0986 sf 0 0 m (Madgraph Born + Pythia Box) show NC gr  0 0 1 c 938 1238 m 214 X s black
 gsave  2268 1538 0 0 C 1883 1105 t 0 r /Helvetica findfont 39.0986 sf 0 0 m (\)) show NC gr 
 gsave  2268 1538 0 0 C 1870 1088 t 0 r /Symbol findfont 26.0657 sf 0 0 m (g) show NC gr 
 gsave  2268 1538 0 0 C 1857 1088 t 0 r /Symbol findfont 26.0657 sf 0 0 m (g) show NC gr 
 gsave  2268 1538 0 0 C 1815 1105 t 0 r /Helvetica findfont 39.0986 sf 0 0 m (,M) show NC gr 
 gsave  2268 1538 0 0 C 1799 1085 t 0 r /Helvetica findfont 26.0657 sf 0 0 m (T) show NC gr 
 gsave  2268 1538 0 0 C 1196 1105 t 0 r /Helvetica findfont 39.0986 sf 0 0 m (Madgraph Born + Pythia Box x K\(q) show NC gr  0.35 0.83 0.33 c 938 1110 m 214 X s black
 gsave  2268 1538 0 0 C 2199 1078 t 90 r /Helvetica-BoldOblique findfont 29.3239 sf 0 0 m (LHC HIGGS XS WG 2011) show NC gr 
 gr  gr 
showpage
end
%%EOF
