%!PS-Adobe-2.0 EPSF-2.0
%%BoundingBox: 0 0 567 425
%%Title: xs4f5fhks.eps
%%Creator: HIGZ Version 1.29/04
%%CreationDate: 2011/05/23   22.33
%%EndComments
%%BeginProlog
80 dict begin
/s {stroke} def /l {lineto} def /m {moveto} def /t {translate} def
/sw {stringwidth} def /r {rotate} def /rl {roll}  def /R {repeat} def
/d {rlineto} def /rm {rmoveto} def /gr {grestore} def /f {eofill} def
/c {setrgbcolor} def /lw {setlinewidth} def /sd {setdash} def
/cl {closepath} def /sf {scalefont setfont} def /black {0 setgray} def
/box {m dup 0 exch d exch 0 d 0 exch neg d cl} def
/NC{systemdict begin initclip end}def/C{NC box clip newpath}def
/bl {box s} def /bf {box f} def /Y { 0 exch d} def /X { 0 d} def 
/mp {newpath /y exch def /x exch def} def
/side {[w .77 mul w .23 mul] .385 w mul sd w 0 l currentpoint t -144 r} def
/mr {mp x y w2 0 360 arc} def /m24 {mr s} def /m20 {mr f} def
/mb {mp x y w2 add m w2 neg 0 d 0 w neg d w 0 d 0 w d cl} def
/mt {mp x y w2 add m w2 neg w neg d w 0 d cl} def
/m21 {mb f} def /m25 {mb s} def /m22 {mt f} def /m26 {mt s} def
/m23 {mp x y w2 sub m w2 w d w neg 0 d cl f} def
/m27 {mp x y w2 add m w3 neg w2 neg d w3 w2 neg d w3  w2 d cl s} def
/m28 {mp x w2 sub y w2 sub w3 add m w3 0 d 0 w3 neg d w3 0 d 0 w3 d w3 0 d
 0 w3 d w3 neg 0 d 0 w3 d w3 neg 0 d
 0 w3 neg d w3 neg 0 d cl s } def
/m29 {mp gsave x w2 sub y w2 add w3 sub m currentpoint t
 4 {side} repeat cl fill gr} def
/m30 {mp gsave x w2 sub y w2 add w3 sub m currentpoint t
 5 {side} repeat s gr} def
/m31 {mp x y w2 sub m 0 w d x w2 sub y m w 0 d
 x w2 sub y w2 add m w w neg d x w2 sub y w2
 sub m w w d s} def
/m2 {mp x y w2 sub m 0 w d x w2 sub y m w 0 d s} def
/m5 {mp x w2 sub y w2 sub m w w d x w2 sub y w2 add m w w neg d s} def
/reencdict 24 dict def /ReEncode {reencdict begin /nco&na exch def
/nfnam exch def /basefontname exch def /basefontdict basefontname findfont def
/newfont basefontdict maxlength dict def basefontdict {exch dup /FID ne
{dup /Encoding eq {exch dup length array copy newfont 3 1 roll put} {exch
newfont 3 1 roll put} ifelse} {pop pop} ifelse } forall newfont
/FontName nfnam put nco&na aload pop nco&na length 2 idiv {newfont
/Encoding get 3 1 roll put} repeat nfnam newfont definefont pop end } def
/accvec [ 176 /agrave 181 /Agrave 190 /acircumflex 192 /Acircumflex
201 /adieresis 204 /Adieresis 209 /ccedilla 210 /Ccedilla 211 /eacute
212 /Eacute 213 /egrave 214 /Egrave 215 /ecircumflex 216 /Ecircumflex
217 /edieresis 218 /Edieresis 219 /icircumflex 220 /Icircumflex
221 /idieresis 222 /Idieresis 223 /ntilde 224 /Ntilde 226 /ocircumflex
228 /Ocircumflex 229 /odieresis 230 /Odieresis 231 /ucircumflex 236 /Ucircumflex
237 /udieresis 238 /Udieresis 239 /aring 242 /Aring 243 /ydieresis
244 /Ydieresis 246 /aacute 247 /Aacute 252 /ugrave 253 /Ugrave] def
/Times-Roman /Times-Roman accvec ReEncode
/Times-Italic /Times-Italic accvec ReEncode
/Times-Bold /Times-Bold accvec ReEncode
/Times-BoldItalic /Times-BoldItalic accvec ReEncode
/Helvetica /Helvetica accvec ReEncode
/Helvetica-Oblique /Helvetica-Oblique accvec ReEncode
/Helvetica-Bold /Helvetica-Bold accvec ReEncode
/Helvetica-BoldOblique /Helvetica-BoldOblique  accvec ReEncode
/Courier /Courier accvec ReEncode
/Courier-Oblique /Courier-Oblique accvec ReEncode
/Courier-Bold /Courier-Bold accvec ReEncode
/Courier-BoldOblique /Courier-BoldOblique accvec ReEncode
/oshow {gsave [] 0 sd true charpath stroke gr} def
/stwn { /fs exch def /fn exch def /text exch def fn findfont fs sf
 text sw pop xs add /xs exch def} def
/stwb { /fs exch def /fn exch def /nbas exch def /textf exch def
textf length /tlen exch def nbas tlen gt {/nbas tlen def} if
fn findfont fs sf textf dup length nbas sub nbas getinterval sw
pop neg xs add /xs exch def} def
/accspe [ 65 /plusminus 66 /bar 67 /existential 68 /universal
69 /exclam 70 /numbersign 71 /greater 72 /question 73 /integral
74 /colon 75 /semicolon 76 /less 77 /bracketleft 78 /bracketright
79 /greaterequal 80 /braceleft 81 /braceright 82 /radical
83 /spade 84 /heart 85 /diamond 86 /club 87 /lessequal
88 /multiply 89 /percent 90 /infinity 48 /circlemultiply 49 /circleplus
50 /emptyset 51 /lozenge 52 /bullet 53 /arrowright 54 /arrowup
55 /arrowleft 56 /arrowdown 57 /arrowboth 48 /degree 44 /comma 43 /plus
 45 /angle 42 /angleleft 47 /divide 61 /notequal 40 /equivalence 41 /second
 97 /approxequal 98 /congruent 99 /perpendicular 100 /partialdiff 101 /florin
 102 /intersection 103 /union 104 /propersuperset 105 /reflexsuperset
 106 /notsubset 107 /propersubset 108 /reflexsubset 109 /element 110 /notelement
 111 /gradient 112 /logicaland 113 /logicalor 114 /arrowdblboth
 115 /arrowdblleft 116 /arrowdblup 117 /arrowdblright 118 /arrowdbldown
 119 /ampersand 120 /omega1 121 /similar 122 /aleph ] def
/Symbol /Special accspe ReEncode
%%EndProlog
%%BeginSetup
%%EndSetup
newpath  gsave  .25 .25 scale  gsave 0 0 t black [] 0 sd 1 lw 227 227 m 1247 Y s
 3 lw 261 227 m -34 X s
 /xs 0 def 
(10)
 /Times-Bold     59 stwn 
 gsave  162 207
 t   0 r  xs neg 0 t 0 0 m
 /Times-Bold findfont   59 sf 0    0 m 
(10)
 show 
 gr 
 /xs 0 def 
(-1)
 /Times-Bold     47 stwn 
 gsave  221 256
 t   0 r  xs neg 0 t 0 0 m
 /Times-Bold findfont   47 sf 0    0 m 
(-1)
 show 
 gr  244 328 m -17 X s 244 388 m -17 X s 244 430 m -17 X s 244 463 m -17 X s 244
 489 m -17 X s 244 512 m -17 X s 244 531 m -17 X s 244 549 m -17 X s 261 564 m
 -34 X s
 /xs 0 def 
(1)
 /Times-Bold     59 stwn 
 gsave  181 544
 t   0 r  xs neg 0 t 0 0 m
 /Times-Bold findfont   59 sf 0    0 m 
(1)
 show 
 gr  244 666 m -17 X s 244 725 m -17 X s 244 767 m -17 X s 244 800 m -17 X s 244
 826 m -17 X s 244 849 m -17 X s 244 869 m -17 X s 244 886 m -17 X s 261 901 m
 -34 X s
 /xs 0 def 
(10)
 /Times-Bold     59 stwn 
 gsave  181 881
 t   0 r  xs neg 0 t 0 0 m
 /Times-Bold findfont   59 sf 0    0 m 
(10)
 show 
 gr  244 1003 m -17 X s 244 1062 m -17 X s 244 1104 m -17 X s 244 1137 m -17 X s
 244 1164 m -17 X s 244 1186 m -17 X s 244 1206 m -17 X s 244 1223 m -17 X s 261
 1238 m -34 X s
 /xs 0 def 
(10)
 /Times-Bold     59 stwn 
 gsave  181 1219
 t   0 r  xs neg 0 t 0 0 m
 /Times-Bold findfont   59 sf 0    0 m 
(10)
 show 
 gr 
 /xs 0 def 
(2)
 /Times-Bold     47 stwn 
 gsave  221 1247
 t   0 r  xs neg 0 t 0 0 m
 /Times-Bold findfont   47 sf 0    0 m 
(2)
 show 
 gr  244 1340 m -17 X s 244 1399 m -17 X s 244 1442 m -17 X s 244 1474 m -17 X s
 1 lw 227 227 m 1814 X s 3 lw 227 261 m -34 Y s 272 244 m -17 Y s 318 244 m -17
 Y s 363 244 m -17 Y s 408 244 m -17 Y s 454 261 m -34 Y s 499 244 m -17 Y s 544
 244 m -17 Y s 590 244 m -17 Y s 635 244 m -17 Y s 680 261 m -34 Y s 726 244 m
 -17 Y s 771 244 m -17 Y s 816 244 m -17 Y s 862 244 m -17 Y s 907 261 m -34 Y s
 953 244 m -17 Y s 998 244 m -17 Y s 1043 244 m -17 Y s 1089 244 m -17 Y s 1134
 261 m -34 Y s 1179 244 m -17 Y s 1225 244 m -17 Y s 1270 244 m -17 Y s 1315 244
 m -17 Y s 1361 261 m -34 Y s 1406 244 m -17 Y s 1452 244 m -17 Y s 1497 244 m
 -17 Y s 1542 244 m -17 Y s 1588 261 m -34 Y s 1633 244 m -17 Y s 1678 244 m -17
 Y s 1724 244 m -17 Y s 1769 244 m -17 Y s 1814 261 m -34 Y s 1860 244 m -17 Y s
 1905 244 m -17 Y s 1950 244 m -17 Y s 1996 244 m -17 Y s 2041 261 m -34 Y s
 /xs 0 def 
(100)
 /Times-Bold     59 stwn 
 gsave  227 164
 t   0 r  xs 2 div neg 0 t 0 0 m
 /Times-Bold findfont   59 sf 0    0 m 
(100)
 show 
 gr 
 /xs 0 def 
(150)
 /Times-Bold     59 stwn 
 gsave  454 164
 t   0 r  xs 2 div neg 0 t 0 0 m
 /Times-Bold findfont   59 sf 0    0 m 
(150)
 show 
 gr 
 /xs 0 def 
(200)
 /Times-Bold     59 stwn 
 gsave  680 164
 t   0 r  xs 2 div neg 0 t 0 0 m
 /Times-Bold findfont   59 sf 0    0 m 
(200)
 show 
 gr 
 /xs 0 def 
(250)
 /Times-Bold     59 stwn 
 gsave  907 164
 t   0 r  xs 2 div neg 0 t 0 0 m
 /Times-Bold findfont   59 sf 0    0 m 
(250)
 show 
 gr 
 /xs 0 def 
(300)
 /Times-Bold     59 stwn 
 gsave  1134 164
 t   0 r  xs 2 div neg 0 t 0 0 m
 /Times-Bold findfont   59 sf 0    0 m 
(300)
 show 
 gr 
 /xs 0 def 
(350)
 /Times-Bold     59 stwn 
 gsave  1361 164
 t   0 r  xs 2 div neg 0 t 0 0 m
 /Times-Bold findfont   59 sf 0    0 m 
(350)
 show 
 gr 
 /xs 0 def 
(400)
 /Times-Bold     59 stwn 
 gsave  1588 164
 t   0 r  xs 2 div neg 0 t 0 0 m
 /Times-Bold findfont   59 sf 0    0 m 
(400)
 show 
 gr 
 /xs 0 def 
(450)
 /Times-Bold     59 stwn 
 gsave  1814 164
 t   0 r  xs 2 div neg 0 t 0 0 m
 /Times-Bold findfont   59 sf 0    0 m 
(450)
 show 
 gr 
 /xs 0 def 
(500)
 /Times-Bold     59 stwn 
 gsave  2041 164
 t   0 r  xs 2 div neg 0 t 0 0 m
 /Times-Bold findfont   59 sf 0    0 m 
(500)
 show 
 gr  1814 1247 227 227 C NC 1 lw 2041 227 m 1247 Y s 3 lw 2007 227 m 34 X s 2024
 328 m 17 X s 2024 388 m 17 X s 2024 430 m 17 X s 2024 463 m 17 X s 2024 489 m
 17 X s 2024 512 m 17 X s 2024 531 m 17 X s 2024 549 m 17 X s 2007 564 m 34 X s
 2024 666 m 17 X s 2024 725 m 17 X s 2024 767 m 17 X s 2024 800 m 17 X s 2024
 826 m 17 X s 2024 849 m 17 X s 2024 869 m 17 X s 2024 886 m 17 X s 2007 901 m
 34 X s 2024 1003 m 17 X s 2024 1062 m 17 X s 2024 1104 m 17 X s 2024 1137 m 17
 X s 2024 1164 m 17 X s 2024 1186 m 17 X s 2024 1206 m 17 X s 2024 1223 m 17 X s
 2007 1238 m 34 X s 2024 1340 m 17 X s 2024 1399 m 17 X s 2024 1442 m 17 X s
 2024 1474 m 17 X s 1 lw 227 1474 m 1814 X s 3 lw 227 1440 m 34 Y s 272 1457 m
 17 Y s 318 1457 m 17 Y s 363 1457 m 17 Y s 408 1457 m 17 Y s 454 1440 m 34 Y s
 499 1457 m 17 Y s 544 1457 m 17 Y s 590 1457 m 17 Y s 635 1457 m 17 Y s 680
 1440 m 34 Y s 726 1457 m 17 Y s 771 1457 m 17 Y s 816 1457 m 17 Y s 862 1457 m
 17 Y s 907 1440 m 34 Y s 953 1457 m 17 Y s 998 1457 m 17 Y s 1043 1457 m 17 Y s
 1089 1457 m 17 Y s 1134 1440 m 34 Y s 1179 1457 m 17 Y s 1225 1457 m 17 Y s
 1270 1457 m 17 Y s 1315 1457 m 17 Y s 1361 1440 m 34 Y s 1406 1457 m 17 Y s
 1452 1457 m 17 Y s 1497 1457 m 17 Y s 1542 1457 m 17 Y s 1588 1440 m 34 Y s
 1633 1457 m 17 Y s 1678 1457 m 17 Y s 1724 1457 m 17 Y s 1769 1457 m 17 Y s
 1814 1440 m 34 Y s 1860 1457 m 17 Y s 1905 1457 m 17 Y s 1950 1457 m 17 Y s
 1996 1457 m 17 Y s 2041 1440 m 34 Y s 1814 1247 227 227 C 2268 2269 0 -284 C 8
 lw 1 0 0 c 231 1415 m 5 -5 d s 236 1410 m 4 -4 d s 240 1406 m 5 -5 d s 245 1401
 m 2 -2 d s 262 1382 m 1 -1 d s 263 1381 m 5 -4 d s 268 1377 m 4 -5 d s 272 1372
 m 5 -5 d s 277 1367 m 1 -1 d s 294 1350 m 1 -1 d s 295 1349 m 4 -5 d s 299 1344
 m 5 -4 d s 304 1340 m 4 -5 d s 308 1335 m 2 -1 d s 326 1318 m 1 X s 327 1318 m
 4 -5 d s 331 1313 m 5 -4 d s 336 1309 m 4 -4 d s 340 1305 m 3 -3 d s 359 1287 m
 4 -4 d s 363 1283 m 4 -4 d s 367 1279 m 5 -4 d s 372 1275 m 4 -3 d s 393 1256 m
 2 -1 d s 395 1255 m 4 -4 d s 399 1251 m 5 -4 d s 404 1247 m 4 -4 d s 408 1243 m
 2 -2 d s 427 1227 m 4 -4 d s 431 1223 m 4 -4 d s 435 1219 m 5 -3 d s 440 1216 m
 4 -4 d s 462 1197 m 1 X s 463 1197 m 4 -4 d s 467 1193 m 5 -4 d s 472 1189 m 4
 -3 d s 476 1186 m 3 -3 d s 497 1169 m 2 -1 d s 499 1168 m 4 -4 d s 503 1164 m 5
 -4 d s 508 1160 m 5 -3 d s 513 1157 m 2 -2 d s 533 1141 m 2 -2 d s 535 1139 m 5
 -3 d s 540 1136 m 4 -4 d s 544 1132 m 5 -3 d s 549 1129 m 2 -2 d s 569 1114 m 3
 -2 d s 572 1112 m 4 -3 d s 576 1109 m 5 -4 d s 581 1105 m 4 -3 d s 585 1102 m 2
 -2 d s 606 1087 m 2 -1 d s 608 1086 m 4 -4 d s 612 1082 m 5 -3 d s 617 1079 m 4
 -3 d s 621 1076 m 3 -2 d s 643 1061 m 1 -1 d s 644 1060 m 5 -3 d s 649 1057 m 4
 -3 d s 653 1054 m 5 -3 d s 658 1051 m 4 -3 d s 680 1035 m s 680 1035 m 5 -3 d s
 685 1032 m 4 -3 d s 689 1029 m 5 -3 d s 694 1026 m 5 -3 d s 699 1023 m s 718
 1010 m 3 -2 d s 721 1008 m 5 -3 d s 726 1005 m 4 -3 d s 730 1002 m 5 -2 d s 735
 1000 m 2 -2 d s 756 986 m 2 -1 d s 758 985 m 4 -3 d s 762 982 m 5 -3 d s 767
 979 m 4 -3 d s 771 976 m 4 -2 d s 795 962 m 3 -2 d s 798 960 m 5 -3 d s 803 957
 m 4 -3 d s 807 954 m 5 -3 d s 812 951 m 2 -1 d s 833 938 m 2 -1 d s 835 937 m 4
 -2 d s 839 935 m 5 -3 d s 844 932 m 4 -3 d s 848 929 m 5 -2 d s 853 927 m -1 Y
 s 873 915 m 2 -2 d s 875 913 m 5 -2 d s 880 911 m 5 -3 d s 885 908 m 4 -3 d s
 889 905 m 3 -1 d s 912 892 m 4 -2 d s 916 890 m 5 -3 d s 921 887 m 4 -2 d s 925
 885 m 5 -3 d s 930 882 m 2 -1 d s 951 870 m 2 -1 d s 953 869 m 4 -2 d s 957 867
 m 5 -3 d s 962 864 m 4 -2 d s 966 862 m 5 -3 d s 971 859 m s 991 848 m 2 -1 d s
 993 847 m 5 -3 d s 998 844 m 4 -2 d s 1002 842 m 5 -2 d s 1007 840 m 4 -3 d s
 1031 827 m 3 -2 d s 1034 825 m 5 -2 d s 1039 823 m 4 -3 d s 1043 820 m 5 -2 d s
 1048 818 m 3 -2 d s 1071 806 m 4 -2 d s 1075 804 m 5 -3 d s 1080 801 m 4 -2 d s
 1084 799 m 5 -2 d s 1089 797 m 2 -2 d s 1112 785 m 4 -2 d s 1116 783 m 4 -3 d s
 1120 780 m 5 -2 d s 1125 778 m 4 -2 d s 1129 776 m 3 -1 d s 1152 765 m s 1152
 765 m 5 -3 d s 1157 762 m 4 -2 d s 1161 760 m 5 -2 d s 1166 758 m 4 -2 d s 1170
 756 m 2 -1 d s 1193 745 m -1 Y s 1193 744 m 5 -2 d s 1198 742 m 4 -2 d s 1202
 740 m 5 -2 d s 1207 738 m 4 -2 d s 1211 736 m 2 -1 d s 1234 725 m s 1234 725 m
 4 -2 d s 1238 723 m 5 -3 d s 1243 720 m 4 -2 d s 1247 718 m 5 -2 d s 1252 716 m
 2 -1 d s 1275 705 m 4 -2 d s 1279 703 m 5 -2 d s 1284 701 m 4 -2 d s 1288 699 m
 5 -2 d s 1293 697 m 2 -1 d s 1316 686 m 4 -1 d s 1320 685 m 5 -3 d s 1325 682 m
 4 -2 d s 1329 680 m 5 -2 d s 1334 678 m 2 -1 d s 1357 668 m 4 -2 d s 1361 666 m
 4 -2 d s 1365 664 m 5 -2 d s 1370 662 m 4 -2 d s 1374 660 m 4 -2 d s 1399 649 m
 3 -1 d s 1402 648 m 4 -2 d s 1406 646 m 5 -2 d s 1411 644 m 4 -2 d s 1415 642 m
 4 -2 d s 1440 631 m 2 -1 d s 1442 630 m 5 -2 d s 1447 628 m 5 -2 d s 1452 626 m
 4 -2 d s 1456 624 m 5 -2 d s 1461 622 m s 1482 613 m 1 -1 d s 1483 612 m 5 -2 d
 s 1488 610 m 4 -1 d s 1492 609 m 5 -2 d s 1497 607 m 4 -2 d s 1501 605 m 2 -1 d
 s 1524 595 m s 1524 595 m 5 -2 d s 1529 593 m 4 -2 d s 1533 591 m 5 -2 d s 1538
 589 m 4 -1 d s 1542 588 m 2 -1 d s 1565 578 m 4 -2 d s 1569 576 m 5 -2 d s 1574
 574 m 5 -2 d s 1579 572 m 4 -1 d s 1583 571 m 3 -2 d s 1607 561 m 3 -1 d s 1610
 560 m 5 -2 d s 1615 558 m 4 -2 d s 1619 556 m 5 -2 d s 1624 554 m 4 -2 d s 1649
 544 m 2 -1 d s 1651 543 m 5 -2 d s 1656 541 m 4 -2 d s 1660 539 m 5 -1 d s 1665
 538 m 4 -2 d s 1669 536 m 1 -1 d s 1692 527 m s 1692 527 m 4 -2 d s 1696 525 m
 5 -2 d s 1701 523 m 5 -1 d s 1706 522 m 4 -2 d s 1710 520 m 3 -1 d s 1734 510 m
 3 -1 d s 1737 509 m 5 -2 d s 1742 507 m 4 -1 d s 1746 506 m 5 -2 d s 1751 504 m
 4 -2 d s 1776 494 m 2 -1 d s 1778 493 m 5 -1 d s 1783 492 m 4 -2 d s 1787 490 m
 5 -2 d s 1792 488 m 4 -1 d s 1796 487 m 1 -1 d s 1819 478 m s 1819 478 m 4 -2 d
 s 1823 476 m 5 -1 d s 1828 475 m 5 -2 d s 1833 473 m 4 -2 d s 1837 471 m 3 -1 d
 s 1861 462 m 3 -1 d s 1864 461 m 5 -2 d s 1869 459 m 4 -1 d s 1873 458 m 5 -2 d
 s 1878 456 m 4 -2 d s 1904 446 m 1 X s 1905 446 m 5 -2 d s 1910 444 m 4 -1 d s
 1914 443 m 5 -2 d s 1919 441 m 4 -2 d s 1923 439 m 2 X s 1946 431 m 4 -2 d s
 1950 429 m 5 -1 d s 1955 428 m 5 -2 d s 1960 426 m 4 -2 d s 1964 424 m 4 -1 d s
 1989 416 m 2 -1 d s 1991 415 m 5 -2 d s 1996 413 m 4 -2 d s 2000 411 m 5 -1 d s
 2005 410 m 4 -2 d s 2009 408 m 1 X s 2032 400 m s 2032 400 m 5 -1 d s 2037 399
 m 4 -2 d s 1814 1247 227 227 C 2268 2269 0 -284 C 0 1 0 c /w 16
 def /w2 {w 2 div} def /w3 {w 3 div} def 239 1413 m20 271 1381 m20 304 1349 m20
 337 1319 m20 371 1289 m20 406 1259 m20 441 1230 m20 476 1202 m20 512 1175 m20
 549 1148 m20 586 1122 m20 623 1096 m20 661 1071 m20 699 1046 m20 738 1022 m20
 776 998 m20 815 975 m20 854 952 m20 894 930 m20 934 908 m20 974 887 m20 1014
 866 m20 1054 845 m20 1095 825 m20 1136 805 m20 1176 785 m20 1218 766 m20 1259
 747 m20 1300 728 m20 1342 710 m20 1383 692 m20 1425 674 m20 1467 657 m20 1509
 639 m20 1551 622 m20 1593 606 m20 1635 589 m20 1677 573 m20 1720 557 m20 1762
 541 m20 1805 525 m20 1847 509 m20 1890 494 m20 1933 479 m20 1976 464 m20 2019
 449 m20 1814 1247 227 227 C 0 0 1 c 231 1418 m 5 -4 d 4 -5 d 5 -5 d 4 -5 d 5 -4
 d 5 -5 d 4 -5 d 5 -4 d 4 -5 d 5 -4 d 4 -5 d 5 -4 d 4 -5 d 5 -4 d 4 -5 d 5 -4 d
 4 -4 d 5 -5 d 5 -4 d 4 -4 d 5 -4 d 4 -5 d 5 -4 d 4 -4 d 5 -4 d 4 -4 d 5 -4 d 4
 -4 d 5 -4 d 4 -5 d 5 -4 d 4 -4 d 5 -3 d 5 -4 d 4 -4 d 5 -4 d 4 -4 d 5 -4 d 4 -4
 d 5 -4 d 4 -3 d 5 -4 d 4 -4 d 5 -4 d 4 -3 d 5 -4 d 5 -4 d 4 -3 d 5 -4 d 4 -4 d
 5 -3 d 4 -4 d 5 -4 d 4 -3 d 5 -4 d 4 -3 d 5 -4 d 4 -3 d 5 -4 d 4 -3 d 5 -4 d 5
 -3 d 4 -3 d 5 -4 d 4 -3 d 5 -4 d 4 -3 d 5 -3 d 4 -4 d 5 -3 d 4 -3 d 5 -4 d 4 -3
 d 5 -3 d 5 -3 d 4 -4 d 5 -3 d 4 -3 d 5 -3 d 4 -3 d 5 -4 d 4 -3 d 5 -3 d 4 -3 d
 5 -3 d 4 -3 d 5 -3 d 5 -4 d 4 -3 d 5 -3 d 4 -3 d 5 -3 d 4 -3 d 5 -3 d 4 -3 d 5
 -3 d 4 -3 d 5 -3 d 4 -3 d 5 -3 d 4 -3 d 5 -3 d 5 -3 d 4 -2 d 5 -3 d 4 -3 d 5 -3
 d 4 -3 d 5 -3 d 4 -3 d 5 -3 d 4 -2 d 5 -3 d 4 -3 d 5 -3 d 5 -3 d 4 -2 d 5 -3 d
 4 -3 d 5 -3 d 4 -2 d 5 -3 d 4 -3 d 5 -3 d 4 -2 d 5 -3 d 4 -3 d 5 -2 d 4 -3 d 5
 -3 d 5 -2 d 4 -3 d 5 -3 d 4 -2 d 5 -3 d 4 -3 d 5 -2 d 4 -3 d 5 -2 d 4 -3 d 5 -3
 d 4 -2 d 5 -3 d 5 -2 d 4 -3 d 5 -2 d 4 -3 d 5 -2 d 4 -3 d 5 -2 d 4 -3 d 5 -2 d
 4 -3 d 5 -2 d 4 -3 d 5 -2 d 4 -3 d 5 -2 d 5 -3 d 4 -2 d 5 -3 d 4 -2 d 5 -3 d 4
 -2 d 5 -2 d 4 -3 d 5 -2 d 4 -3 d 5 -2 d 4 -2 d 5 -3 d 5 -2 d 4 -2 d 5 -3 d 4 -2
 d 5 -2 d 4 -3 d 5 -2 d 4 -2 d 5 -3 d 4 -2 d 5 -2 d 4 -3 d 5 -2 d 4 -2 d 5 -3 d
 5 -2 d 4 -2 d 5 -2 d 4 -3 d 5 -2 d 4 -2 d 5 -2 d 4 -3 d 5 -2 d 4 -2 d 5 -2 d 4
 -3 d 5 -2 d 5 -2 d 4 -2 d 5 -2 d 4 -3 d 5 -2 d 4 -2 d 5 -2 d 4 -2 d 5 -2 d 4 -3
 d 5 -2 d 4 -2 d 5 -2 d 5 -2 d 4 -2 d 5 -2 d 4 -3 d 5 -2 d 4 -2 d 5 -2 d 4 -2 d
 5 -2 d 4 -2 d 5 -2 d 4 -2 d 5 -3 d 4 -2 d 5 -2 d 5 -2 d 4 -2 d 5 -2 d 4 -2 d 5
 -2 d 4 -2 d 5 -2 d 4 -2 d 5 -2 d 4 -2 d 5 -2 d 4 -2 d 5 -2 d 5 -2 d 4 -2 d 5 -2
 d 4 -2 d 5 -2 d 4 -2 d 5 -2 d 4 -2 d 5 -2 d 4 -2 d 5 -2 d 4 -2 d 5 -2 d 4 -2 d
 5 -2 d 5 -2 d 4 -2 d 5 -2 d 4 -2 d 5 -2 d 4 -2 d 5 -2 d 4 -2 d 5 -2 d 4 -1 d 5
 -2 d 4 -2 d 5 -2 d 5 -2 d 4 -2 d 5 -2 d 4 -2 d 5 -2 d 4 -2 d 5 -1 d 4 -2 d 5 -2
 d 4 -2 d 5 -2 d 4 -2 d 5 -2 d 4 -2 d 5 -1 d 5 -2 d 4 -2 d 5 -2 d 4 -2 d 5 -2 d
 4 -1 d 5 -2 d 4 -2 d 5 -2 d 4 -2 d 5 -2 d 4 -1 d 5 -2 d 5 -2 d 4 -2 d 5 -2 d 4
 -1 d 5 -2 d 4 -2 d 5 -2 d 4 -2 d 5 -1 d 4 -2 d 5 -2 d 4 -2 d 5 -2 d 4 -1 d 5 -2
 d 5 -2 d 4 -2 d 5 -1 d 4 -2 d 5 -2 d 4 -2 d 5 -1 d 4 -2 d 5 -2 d 4 -2 d 5 -1 d
 4 -2 d 5 -2 d 5 -2 d 4 -1 d 5 -2 d 4 -2 d 5 -1 d 4 -2 d 5 -2 d 4 -2 d 5 -1 d 4
 -2 d 5 -2 d 4 -1 d 5 -2 d 5 -2 d 4 -1 d 5 -2 d 4 -2 d 5 -2 d 4 -1 d 5 -2 d 4 -2
 d 5 -1 d 4 -2 d 5 -2 d 4 -1 d 5 -2 d 4 -2 d 5 -1 d 5 -2 d 4 -2 d 5 -1 d 4 -2 d
 5 -1 d 4 -2 d 5 -2 d 4 -1 d 5 -2 d 4 -2 d 5 -1 d 4 -2 d 5 -2 d 5 -1 d 4 -2 d 5
 -1 d 4 -2 d 5 -2 d 4 -1 d 5 -2 d 4 -1 d 5 -2 d 4 -2 d 5 -1 d 4 -2 d 5 -1 d 4 -2
 d 5 -2 d 5 -1 d 4 -2 d 5 -1 d 4 -2 d 5 -2 d 4 -1 d 5 -2 d 4 -1 d 5 -2 d 4 -1 d
 5 -2 d 4 -2 d 5 -1 d 5 -2 d 4 -1 d 5 -2 d 4 -1 d 5 -2 d 4 -1 d s 2268 1701 0 0
 C NC 4 lw black 1814 1247 227 227 bl 2268 1701 0 0 C
 /xs 0 def 
(m)
 /Times-Bold     67 stwn 
(H)
 /Times-Bold     47 stwn 
( \(GeV\))
 /Times-Bold     67 stwn 
 gsave  2041 91
 t   0 r  xs neg 0 t 0 0 m
 /Times-Bold findfont   67 sf 0    0 m 
(m)
 show 
 currentpoint pop 0 t 
 /Times-Bold findfont   47 sf 0  -22 m 
(H)
 show 
 currentpoint pop 0 t 
 /Times-Bold findfont   67 sf 0    0 m 
( \(GeV\))
 show 
 gr 
 /xs 0 def 
(s)
 /Symbol     67 stwn 
( \(fb\))
 /Times-Bold     67 stwn 
 gsave  68 1474
 t  90 r  xs neg 0 t 0 0 m
 /Symbol findfont   67 sf 0    0 m 
(s)
 show 
 currentpoint pop 0 t 
 /Times-Bold findfont   67 sf 0    0 m 
( \(fb\))
 show 
 gr 
 gsave  1225 1327
 t   0 r 0 0 m
 /Special findfont   67 sf 0    0 m 
(R)
 show 
 currentpoint pop 0 t 
 /Times-Bold findfont   67 sf 0    0 m 
(s =7 TeV)
 show 
 gr  1 0 0 c
 gsave  1225 1202
 t   0 r 0 0 m
 /Times-Bold findfont   67 sf 0    0 m 
(4FS gg)
 show 
 currentpoint pop 0 t 
 /Special findfont   67 sf 0    0 m 
(5)
 show 
 currentpoint pop 0 t 
 /Times-Bold findfont   67 sf 0    0 m 
(bbH \(NLO\))
 show 
 gr  0 1 0 c
 gsave  1225 1077
 t   0 r 0 0 m
 /Times-Bold findfont   67 sf 0    0 m 
(5FS bb)
 show 
 currentpoint pop 0 t 
 /Special findfont   67 sf 0    0 m 
(5)
 show 
 currentpoint pop 0 t 
 /Times-Bold findfont   67 sf 0    0 m 
(H \(NNLO\))
 show 
 gr  0 0 1 c
 gsave  1225 953
 t   0 r 0 0 m
 /Times-Bold findfont   67 sf 0    0 m 
(matched)
 show 
 gr  black
 gsave  318 516
 t   0 r 0 0 m
 /Symbol findfont   67 sf 0    0 m 
(m)
 show 
 currentpoint pop 0 t 
 /Times-Bold findfont   67 sf 0    0 m 
(=\(2m)
 show 
 currentpoint pop 0 t 
 /Times-Bold findfont   47 sf 0  -22 m 
(b)
 show 
 currentpoint pop 0 t 
 /Times-Bold findfont   67 sf 0    0 m 
(+m)
 show 
 currentpoint pop 0 t 
 /Times-Bold findfont   47 sf 0  -22 m 
(H)
 show 
 currentpoint pop 0 t 
 /Times-Bold findfont   67 sf 0    0 m 
(\)/4)
 show 
 gr 
 gsave  318 391
 t   0 r 0 0 m
 /Times-Bold findfont   67 sf 0    0 m 
(MSTW2008)
 show 
 gr  1814 1247 227 227 C 2268 2269 0 -284 C 8 lw 1 0 0 c 907 1225 m 23 X s 953
 1225 m 22 X s 998 1225 m 23 X s 1043 1225 m 23 X s 1814 1247 227 227 C 2268
 2269 0 -284 C 0 1 0 c 919 1100 m20 964 1100 m20 1009 1100 m20 1055 1100 m20
 1814 1247 227 227 C 0 0 1 c 907 975 m 182 X s
 gr  gr 
showpage
end
%%EOF
