%!PS-Adobe-2.0 EPSF-2.0
%%BoundingBox:  0 0 567 384
%%Title: mZ1.eps: mZ1
%%Creator: ROOT Version 5.27/06b
%%CreationDate: Mon Dec 12 11:15:46 2011
%%EndComments
%%BeginProlog
80 dict begin
/s {stroke} def /l {lineto} def /m {moveto} def /t {translate} def
/r {rotate} def /rl {roll}  def /R {repeat} def
/d {rlineto} def /rm {rmoveto} def /gr {grestore} def /f {eofill} def
/c {setrgbcolor} def /black {0 setgray} def /sd {setdash} def
/cl {closepath} def /sf {scalefont setfont} def /lw {setlinewidth} def
/box {m dup 0 exch d exch 0 d 0 exch neg d cl} def
/NC{systemdict begin initclip end}def/C{NC box clip newpath}def
/bl {box s} def /bf {box f} def /Y { 0 exch d} def /X { 0 d} def 
/K {{pop pop 0 moveto} exch kshow} bind def
/ita {/ang 15 def gsave [1 0 ang dup sin exch cos div 1 0 0] concat} def 
/mp {newpath /y exch def /x exch def} def
/side {[w .77 mul w .23 mul] .385 w mul sd w 0 l currentpoint t -144 r} def
/mr {mp x y w2 0 360 arc} def /m24 {mr s} def /m20 {mr f} def
/mb {mp x y w2 add m w2 neg 0 d 0 w neg d w 0 d 0 w d cl} def
/mt {mp x y w2 add m w2 neg w neg d w 0 d cl} def
/m21 {mb f} def /m25 {mb s} def /m22 {mt f} def /m26{mt s} def
/m23 {mp x y w2 sub m w2 w d w neg 0 d cl f} def
/m27 {mp x y w2 add m w3 neg w2 neg d w3 w2 neg d w3 w2 d cl s} def
/m28 {mp x w2 sub y w2 sub w3 add m w3 0 d  0 w3 neg d w3 0 d 0 w3 d w3 0 d  0 w3 d w3 neg 0 d 0 w3 d w3 neg 0 d 0 w3 neg d w3 neg 0 d cl s } def
/m29 {mp gsave x w2 sub y w2 add w3 sub m currentpoint t 4 {side} repeat cl fill gr} def
/m30 {mp gsave x w2 sub y w2 add w3 sub m currentpoint t 4 {side} repeat cl s gr} def
/m31 {mp x y w2 sub m 0 w d x w2 sub y m w 0 d x w2 sub y w2 add m w w neg d x w2 sub y w2 sub m w w d s} def
/m32 {mp x y w2 sub m w2 w d w neg 0 d cl s} def
/m33 {mp x y w2 add m w3 neg w2 neg d w3 w2 neg d w3 w2 d cl f} def
/m34 {mp x w2 sub y w2 sub w3 add m w3 0 d  0 w3 neg d w3 0 d 0 w3 d w3 0 d  0 w3 d w3 neg 0 d 0 w3 d w3 neg 0 d 0 w3 neg d w3 neg 0 d cl f } def
/m2 {mp x y w2 sub m 0 w d x w2 sub y m w 0 d s} def
/m5 {mp x w2 sub y w2 sub m w w d x w2 sub y w2 add m w w neg d s} def
/reEncode {exch findfont dup length dict begin {1 index /FID eq  {pop pop} {def} ifelse } forall /Encoding exch def currentdict end dup /FontName get exch definefont pop } def [/Times-Bold /Times-Italic /Times-BoldItalic /Helvetica /Helvetica-Oblique
 /Helvetica-Bold /Helvetica-BoldOblique /Courier /Courier-Oblique /Courier-Bold /Courier-BoldOblique /Times-Roman /AvantGarde-Book /AvantGarde-BookOblique /AvantGarde-Demi /AvantGarde-DemiOblique /Bookman-Demi /Bookman-DemiItalic /Bookman-Light
 /Bookman-LightItalic /Helvetica-Narrow /Helvetica-Narrow-Bold /Helvetica-Narrow-BoldOblique /Helvetica-Narrow-Oblique /NewCenturySchlbk-Roman /NewCenturySchlbk-Bold /NewCenturySchlbk-BoldItalic /NewCenturySchlbk-Italic /Palatino-Bold
 /Palatino-BoldItalic /Palatino-Italic /Palatino-Roman ] {ISOLatin1Encoding reEncode } forall%%EndProlog
%%BeginSetup
%%EndSetup
newpath  gsave  .25 .25 scale  gsave  0 0 t black[  ] 0 sd 3 lw 1 1 1 c 2268 1538 0 0 bf black 1 1 1 c 1791 1215 363 246 bf black 1791 1215 363 246 bl 1 0 0 c 6 lw 1 1 1 c black 1 0 0 c 373 246 m 315 Y s 373 587 m 397 Y s 3 lw black /w 31 def /w2 {w
 2 div} def /w3 {w 3 div} def 373 574 m20 6 lw 1 0 0 c 394 246 m 492 Y s 394 764 m 227 Y s 3 lw black 394 751 m20 6 lw 1 0 0 c 457 246 m 525 Y s 457 798 m 252 Y s 3 lw black 457 785 m20 6 lw 1 0 0 c 477 246 m 654 Y s 477 926 m 141 Y s 3 lw black 477
 913 m20 6 lw 1 0 0 c 498 246 m 654 Y s 498 926 m 146 Y s 3 lw black 498 913 m20 6 lw 1 0 0 c 519 246 m 675 Y s 519 947 m 143 Y s 3 lw black 519 934 m20 6 lw 1 0 0 c 540 246 m 713 Y s 540 985 m 103 Y s 3 lw black 540 972 m20 6 lw 1 0 0 c 561 246 m
 772 Y s 561 1044 m 66 Y s 3 lw black 561 1031 m20 6 lw 1 0 0 c 582 246 m 739 Y s 582 1011 m 87 Y s 3 lw black 582 998 m20 6 lw 1 0 0 c 602 246 m 775 Y s 602 1047 m 70 Y s 3 lw black 602 1034 m20 6 lw 1 0 0 c 623 246 m 787 Y s 623 1060 m 58 Y s 3 lw
 black 623 1046 m20 6 lw 1 0 0 c 644 246 m 781 Y s 644 1053 m 66 Y s 3 lw black 644 1040 m20 6 lw 1 0 0 c 665 246 m 807 Y s 665 1079 m 48 Y s 3 lw black 665 1066 m20 6 lw 1 0 0 c 686 246 m 834 Y s 686 1106 m 41 Y s 3 lw black 686 1093 m20 6 lw 1 0 0
 c 707 246 m 821 Y s 707 1093 m 47 Y s 3 lw black 707 1080 m20 6 lw 1 0 0 c 727 1049 m 68 Y s 727 1143 m 20 Y s 3 lw black 727 1130 m20 6 lw 1 0 0 c 748 246 m 833 Y s 748 1105 m 43 Y s 3 lw black 748 1092 m20 6 lw 1 0 0 c 769 1099 m 41 Y s 769 1166 m
 15 Y s 3 lw black 769 1153 m20 6 lw 1 0 0 c 790 1064 m 58 Y s 790 1148 m 19 Y s 3 lw black 790 1135 m20 6 lw 1 0 0 c 811 1077 m 55 Y s 811 1158 m 18 Y s 3 lw black 811 1145 m20 6 lw 1 0 0 c 832 1084 m 48 Y s 832 1158 m 17 Y s 3 lw black 832 1145 m20
 6 lw 1 0 0 c 852 1119 m 30 Y s 852 1175 m 12 Y s 3 lw black 852 1162 m20 6 lw 1 0 0 c 873 1131 m 24 Y s 873 1181 m 10 Y s 3 lw black 873 1168 m20 6 lw 1 0 0 c 894 1102 m 41 Y s 894 1169 m 15 Y s 3 lw black 894 1156 m20 6 lw 1 0 0 c 915 1076 m 68 Y s
 915 1170 m 21 Y s 3 lw black 915 1157 m20 6 lw 1 0 0 c 936 1158 m 17 Y s 936 1201 m 7 Y s 3 lw black 936 1188 m20 6 lw 1 0 0 c 957 1173 m 14 Y s 957 1213 m 6 Y s 3 lw black 957 1200 m20 6 lw 1 0 0 c 977 1168 m 13 Y s 977 1207 m 6 Y s 3 lw black 977
 1194 m20 6 lw 1 0 0 c 998 1199 m 8 Y s 998 1233 m 2 Y s 3 lw black 998 1220 m20 6 lw 1 0 0 c 1019 1186 m 10 Y s 1019 1222 m 3 Y s 3 lw black 1019 1209 m20 6 lw 1 0 0 c 1040 1197 m 6 Y s 1040 1230 m 1 Y s 3 lw black 1040 1216 m20 6 lw 1 0 0 c 1061
 1202 m 3 Y s 3 lw black 1061 1218 m20 6 lw 1 0 0 c 1082 1212 m 3 Y s 3 lw black 1082 1228 m20 6 lw 1 0 0 c 1102 1218 m 2 Y s 3 lw black 1102 1233 m20 6 lw 1 0 0 c 1123 1217 m 2 Y s 3 lw black 1123 1232 m20 6 lw 1 0 0 c 1144 1217 m 6 Y s 1144 1249 m
 1 Y s 3 lw black 1144 1236 m20 6 lw 3 lw 1165 1248 m20 6 lw 3 lw 1186 1246 m20 6 lw 3 lw 1207 1253 m20 6 lw 3 lw 1227 1244 m20 6 lw 3 lw 1248 1250 m20 6 lw 3 lw 1269 1249 m20 6 lw 3 lw 1290 1245 m20 6 lw 3 lw 1311 1243 m20 6 lw 3 lw 1331 1244 m20 6
 lw 3 lw 1352 1237 m20 6 lw 3 lw 1373 1243 m20 6 lw 3 lw 1394 1246 m20 6 lw 3 lw 1415 1249 m20 6 lw 3 lw 1436 1252 m20 6 lw 3 lw 1456 1253 m20 6 lw 3 lw 1477 1259 m20 6 lw 3 lw 1498 1268 m20 6 lw 3 lw 1519 1274 m20 6 lw 3 lw 1540 1285 m20 6 lw 3 lw
 1561 1301 m20 6 lw 3 lw 1581 1332 m20 6 lw 3 lw 1602 1374 m20 6 lw 3 lw 1623 1420 m20 6 lw 3 lw 1644 1388 m20 6 lw 3 lw 1665 1299 m20 6 lw 1 0 0 c 1686 1209 m 3 Y s 3 lw black 1686 1225 m20 6 lw 1 0 0 c 1706 1153 m 10 Y s 1706 1189 m 3 Y s 3 lw
 black 1706 1176 m20 6 lw 1 0 0 c 1727 1097 m 30 Y s 1727 1153 m 12 Y s 3 lw black 1727 1140 m20 6 lw 1 0 0 c 1748 946 m 124 Y s 1748 1096 m 27 Y s 3 lw black 1748 1083 m20 6 lw 1 0 0 c 1769 246 m 748 Y s 1769 1020 m 60 Y s 3 lw black 1769 1007 m20 6
 lw 1 0 0 c 1790 246 m 753 Y s 1790 1025 m 46 Y s 3 lw black 1790 1012 m20 6 lw 1 0 0 c 1811 246 m 726 Y s 1811 999 m 55 Y s 3 lw black 1811 985 m20 6 lw 1 0 0 c 1831 246 m 666 Y s 1831 939 m 85 Y s 3 lw black 1831 925 m20 6 lw 1 0 0 c 1852 246 m 604
 Y s 1852 876 m 130 Y s 3 lw black 1852 863 m20 6 lw 1 0 0 c 1873 246 m 556 Y s 1873 828 m 149 Y s 3 lw black 1873 815 m20 6 lw 1 0 0 c 1894 246 m 430 Y s 1894 702 m 258 Y s 3 lw black 1894 689 m20 6 lw 1 0 0 c 1915 246 m 400 Y s 1915 672 m 271 Y s 3
 lw black 1915 659 m20 6 lw 1 0 0 c 1936 246 m 360 Y s 1936 632 m 290 Y s 3 lw black 1936 619 m20 6 lw 1 0 0 c 1956 246 m 344 Y s 1956 616 m 271 Y s 3 lw black 1956 603 m20 6 lw 1 0 0 c 1977 246 m 198 Y s 1977 470 m 355 Y s 3 lw black 1977 457 m20 6
 lw 1 0 0 c 1998 246 m 30 Y s 1998 302 m 466 Y s 3 lw black 1998 289 m20 6 lw 1 0 0 c 1 1 1 c black 1 0 0 c 363 574 m 21 X 177 Y 20 X -505 Y 42 X 539 Y 21 X 128 Y 42 X 21 Y 20 X 38 Y 21 X 59 Y 21 X -33 Y 21 X 36 Y 21 X 12 Y 21 X -6 Y 20 X 26 Y 21 X
 27 Y 21 X -13 Y 21 X 50 Y 21 X -38 Y 21 X 61 Y 20 X -18 Y 21 X 10 Y 42 X 17 Y 21 X 6 Y 21 X -12 Y 20 X 1 Y 21 X 31 Y 21 X 12 Y 21 X -6 Y 21 X 26 Y 21 X -11 Y 20 X 7 Y 21 X 2 Y 21 X 10 Y 21 X 5 Y 21 X -1 Y 21 X 4 Y 20 X 12 Y 21 X -2 Y 21 X 7 Y 21 X
 -9 Y 21 X 6 Y 21 X -1 Y 20 X -4 Y 21 X -2 Y 21 X 1 Y 21 X -7 Y 21 X 6 Y 21 X 3 Y 20 X 3 Y 21 X 3 Y 21 X 1 Y 21 X 6 Y 21 X 9 Y 21 X 6 Y 20 X 11 Y 21 X 16 Y 21 X 31 Y 21 X 42 Y 21 X 46 Y 21 X -32 Y 20 X -89 Y 21 X -74 Y 21 X -49 Y 21 X -36 Y 21 X -57
 Y 21 X -76 Y 20 X 5 Y 21 X -27 Y 21 X -60 Y 21 X -62 Y 21 X -48 Y 21 X -126 Y 20 X -30 Y 21 X -40 Y 21 X -16 Y 21 X -146 Y 21 X -168 Y 21 X -43 Y 145 X s black 3 lw 363 246 m 1791 X s
 gsave  2268 1538 0 0 C 1515.25 85.125 t 0 r /Helvetica findfont 71.6807 sf 0 0 m (larger Z mass [GeV]) show NC gr  363 283 m -37 Y s 432 264 m -18 Y s 502 264 m -18 Y s 571 264 m -18 Y s 641 283 m -37 Y s 710 264 m -18 Y s 779 264 m -18 Y s 849 264
 m -18 Y s 918 283 m -37 Y s 988 264 m -18 Y s 1057 264 m -18 Y s 1127 264 m -18 Y s 1196 283 m -37 Y s 1266 264 m -18 Y s 1335 264 m -18 Y s 1404 264 m -18 Y s 1474 283 m -37 Y s 1543 264 m -18 Y s 1613 264 m -18 Y s 1682 264 m -18 Y s 1752 283 m
 -37 Y s 1821 264 m -18 Y s 1890 264 m -18 Y s 1960 264 m -18 Y s 2029 283 m -37 Y s 2029 283 m -37 Y s 2099 264 m -18 Y s
 gsave  2268 1538 0 0 C 342.25 179.625 t 0 r /Helvetica findfont 71.6807 sf 0 0 m (0) show NC gr 
 gsave  2268 1538 0 0 C 599.688 179.625 t 0 r /Helvetica findfont 71.6807 sf 0 0 m (20) show NC gr 
 gsave  2268 1538 0 0 C 876.625 179.625 t 0 r /Helvetica findfont 71.6807 sf 0 0 m (40) show NC gr 
 gsave  2268 1538 0 0 C 1156.81 179.625 t 0 r /Helvetica findfont 71.6807 sf 0 0 m (60) show NC gr 
 gsave  2268 1538 0 0 C 1433.75 179.625 t 0 r /Helvetica findfont 71.6807 sf 0 0 m (80) show NC gr 
 gsave  2268 1538 0 0 C 1691.19 179.625 t 0 r /Helvetica findfont 71.6807 sf 0 0 m (100) show NC gr 
 gsave  2268 1538 0 0 C 1968.12 179.625 t 0 r /Helvetica findfont 71.6807 sf 0 0 m (120) show NC gr  363 1461 m 1791 X s 363 1425 m 36 Y s 432 1443 m 18 Y s 502 1443 m 18 Y s 571 1443 m 18 Y s 641 1425 m 36 Y s 710 1443 m 18 Y s 779 1443 m 18 Y s 849
 1443 m 18 Y s 918 1425 m 36 Y s 988 1443 m 18 Y s 1057 1443 m 18 Y s 1127 1443 m 18 Y s 1196 1425 m 36 Y s 1266 1443 m 18 Y s 1335 1443 m 18 Y s 1404 1443 m 18 Y s 1474 1425 m 36 Y s 1543 1443 m 18 Y s 1613 1443 m 18 Y s 1682 1443 m 18 Y s 1752 1425
 m 36 Y s 1821 1443 m 18 Y s 1890 1443 m 18 Y s 1960 1443 m 18 Y s 2029 1425 m 36 Y s 2029 1425 m 36 Y s 2099 1443 m 18 Y s 363 246 m 1215 Y s
 gsave  2268 1538 0 0 C 172.875 756.312 t 90 r /Helvetica findfont 71.6807 sf 0 0 m (arbitrary normalization) show NC gr  390 277 m -27 X s 390 302 m -27 X s 390 320 m -27 X s 390 334 m -27 X s 390 345 m -27 X s 390 355 m -27 X s 390 363 m -27 X s
 390 370 m -27 X s 417 377 m -54 X s
 gsave  2268 1538 0 0 C 300 378.375 t 0 r /Helvetica findfont 48.8732 sf 0 0 m (\2558) show NC gr 
 gsave  2268 1538 0 0 C 221.75 345.75 t 0 r /Helvetica findfont 71.6807 sf 0 0 m (10) show NC gr  390 419 m -27 X s 390 444 m -27 X s 390 462 m -27 X s 390 476 m -27 X s 390 487 m -27 X s 390 497 m -27 X s 390 505 m -27 X s 390 512 m -27 X s 417 519
 m -54 X s
 gsave  2268 1538 0 0 C 300 518.438 t 0 r /Helvetica findfont 48.8732 sf 0 0 m (\2557) show NC gr 
 gsave  2268 1538 0 0 C 221.75 489.125 t 0 r /Helvetica findfont 71.6807 sf 0 0 m (10) show NC gr  390 561 m -27 X s 390 586 m -27 X s 390 604 m -27 X s 390 618 m -27 X s 390 629 m -27 X s 390 639 m -27 X s 390 647 m -27 X s 390 654 m -27 X s 417 661
 m -54 X s
 gsave  2268 1538 0 0 C 300 661.812 t 0 r /Helvetica findfont 48.8732 sf 0 0 m (\2556) show NC gr 
 gsave  2268 1538 0 0 C 221.75 629.25 t 0 r /Helvetica findfont 71.6807 sf 0 0 m (10) show NC gr  390 703 m -27 X s 390 728 m -27 X s 390 746 m -27 X s 390 760 m -27 X s 390 771 m -27 X s 390 781 m -27 X s 390 789 m -27 X s 390 796 m -27 X s 417 803
 m -54 X s
 gsave  2268 1538 0 0 C 300 805.188 t 0 r /Helvetica findfont 48.8732 sf 0 0 m (\2555) show NC gr 
 gsave  2268 1538 0 0 C 221.75 772.625 t 0 r /Helvetica findfont 71.6807 sf 0 0 m (10) show NC gr  390 845 m -27 X s 390 870 m -27 X s 390 888 m -27 X s 390 902 m -27 X s 390 913 m -27 X s 390 923 m -27 X s 390 931 m -27 X s 390 938 m -27 X s 417 945
 m -54 X s
 gsave  2268 1538 0 0 C 300 942.062 t 0 r /Helvetica findfont 48.8732 sf 0 0 m (\2554) show NC gr 
 gsave  2268 1538 0 0 C 221.75 912.688 t 0 r /Helvetica findfont 71.6807 sf 0 0 m (10) show NC gr  390 987 m -27 X s 390 1012 m -27 X s 390 1030 m -27 X s 390 1044 m -27 X s 390 1055 m -27 X s 390 1065 m -27 X s 390 1073 m -27 X s 390 1080 m -27 X s
 417 1087 m -54 X s
 gsave  2268 1538 0 0 C 300 1088.62 t 0 r /Helvetica findfont 48.8732 sf 0 0 m (\2553) show NC gr 
 gsave  2268 1538 0 0 C 221.75 1056.06 t 0 r /Helvetica findfont 71.6807 sf 0 0 m (10) show NC gr  390 1129 m -27 X s 390 1154 m -27 X s 390 1172 m -27 X s 390 1186 m -27 X s 390 1197 m -27 X s 390 1207 m -27 X s 390 1215 m -27 X s 390 1222 m -27 X s
 417 1229 m -54 X s
 gsave  2268 1538 0 0 C 300 1228.75 t 0 r /Helvetica findfont 48.8732 sf 0 0 m (\2552) show NC gr 
 gsave  2268 1538 0 0 C 221.75 1199.44 t 0 r /Helvetica findfont 71.6807 sf 0 0 m (10) show NC gr  390 1271 m -27 X s 390 1296 m -27 X s 390 1314 m -27 X s 390 1328 m -27 X s 390 1339 m -27 X s 390 1349 m -27 X s 390 1357 m -27 X s 390 1364 m -27 X s
 417 1371 m -54 X s
 gsave  2268 1538 0 0 C 306.5 1368.88 t 0 r /Helvetica findfont 48.8732 sf 0 0 m (\2551) show NC gr 
 gsave  2268 1538 0 0 C 228.312 1339.56 t 0 r /Helvetica findfont 71.6807 sf 0 0 m (10) show NC gr  390 1413 m -27 X s 390 1438 m -27 X s 390 1456 m -27 X s 2154 246 m 1215 Y s 2127 277 m 27 X s 2127 302 m 27 X s 2127 320 m 27 X s 2127 334 m 27 X s
 2127 345 m 27 X s 2127 355 m 27 X s 2127 363 m 27 X s 2127 370 m 27 X s 2101 377 m 53 X s 2127 419 m 27 X s 2127 444 m 27 X s 2127 462 m 27 X s 2127 476 m 27 X s 2127 487 m 27 X s 2127 497 m 27 X s 2127 505 m 27 X s 2127 512 m 27 X s 2101 519 m 53 X
 s 2127 561 m 27 X s 2127 586 m 27 X s 2127 604 m 27 X s 2127 618 m 27 X s 2127 629 m 27 X s 2127 639 m 27 X s 2127 647 m 27 X s 2127 654 m 27 X s 2101 661 m 53 X s 2127 703 m 27 X s 2127 728 m 27 X s 2127 746 m 27 X s 2127 760 m 27 X s 2127 771 m 27
 X s 2127 781 m 27 X s 2127 789 m 27 X s 2127 796 m 27 X s 2101 803 m 53 X s 2127 845 m 27 X s 2127 870 m 27 X s 2127 888 m 27 X s 2127 902 m 27 X s 2127 913 m 27 X s 2127 923 m 27 X s 2127 931 m 27 X s 2127 938 m 27 X s 2101 945 m 53 X s 2127 987 m
 27 X s 2127 1012 m 27 X s 2127 1030 m 27 X s 2127 1044 m 27 X s 2127 1055 m 27 X s 2127 1065 m 27 X s 2127 1073 m 27 X s 2127 1080 m 27 X s 2101 1087 m 53 X s 2127 1129 m 27 X s 2127 1154 m 27 X s 2127 1172 m 27 X s 2127 1186 m 27 X s 2127 1197 m 27
 X s 2127 1207 m 27 X s 2127 1215 m 27 X s 2127 1222 m 27 X s 2101 1229 m 53 X s 2127 1271 m 27 X s 2127 1296 m 27 X s 2127 1314 m 27 X s 2127 1328 m 27 X s 2127 1339 m 27 X s 2127 1349 m 27 X s 2127 1357 m 27 X s 2127 1364 m 27 X s 2101 1371 m 53 X
 s 2127 1413 m 27 X s 2127 1438 m 27 X s 2127 1456 m 27 X s 6 lw 1 1 1 c black 363 246 m 62 X 532 Y 21 X 25 Y 21 X 52 Y 21 X 47 Y 21 X 4 Y 20 X -23 Y 21 X 66 Y 21 X 7 Y 21 X 34 Y 21 X 13 Y 21 X -7 Y 20 X 32 Y 21 X 6 Y 21 X 16 Y 21 X 9 Y 21 X 8 Y 21 X
 18 Y 20 X 2 Y 21 X 14 Y 21 X 4 Y 21 X 10 Y 21 X 11 Y 21 X 8 Y 20 X 9 Y 21 X 7 Y 21 X 11 Y 21 X 6 Y 21 X 4 Y 21 X 7 Y 20 X 10 Y 21 X 9 Y 21 X 5 Y 21 X 8 Y 21 X 8 Y 21 X 4 Y 20 X 9 Y 21 X 4 Y 21 X 1 Y 21 X -1 Y 21 X 1 Y 21 X -4 Y 20 X 2 Y 42 X 2 Y 42
 X 2 Y 21 X 2 Y 20 X 2 Y 21 X 3 Y 21 X 4 Y 21 X 6 Y 21 X 9 Y 21 X 9 Y 20 X 15 Y 21 X 19 Y 21 X 28 Y 21 X 45 Y 21 X 48 Y 21 X -33 Y 20 X -83 Y 21 X -68 Y 21 X -55 Y 21 X -49 Y 21 X -44 Y 21 X -41 Y 20 X -41 Y 21 X -36 Y 21 X -39 Y 21 X -29 Y 21 X -27
 Y 21 X -80 Y 20 X -557 Y 250 X s 0 0 1 c[  12 12 ] 0 sd 1 1 1 c black 0 0 1 c 363 246 m 62 X 544 Y 21 X 24 Y 21 X 37 Y 21 X 52 Y 21 X -5 Y 20 X -17 Y 21 X 69 Y 21 X 9 Y 21 X 30 Y 21 X 13 Y 21 X -5 Y 20 X 30 Y 21 X 7 Y 21 X 16 Y 21 X 8 Y 21 X 9 Y 21
 X 17 Y 20 X 3 Y 21 X 14 Y 21 X 4 Y 21 X 9 Y 21 X 11 Y 21 X 9 Y 20 X 9 Y 21 X 7 Y 21 X 11 Y 21 X 6 Y 21 X 4 Y 21 X 7 Y 20 X 10 Y 21 X 9 Y 21 X 5 Y 21 X 8 Y 21 X 9 Y 21 X 3 Y 20 X 9 Y 21 X 4 Y 21 X 2 Y 21 X -2 Y 21 X 1 Y 21 X -4 Y 20 X 1 Y 21 X 1 Y 21
 X 2 Y 42 X 1 Y 21 X 2 Y 20 X 3 Y 21 X 2 Y 21 X 5 Y 21 X 6 Y 21 X 9 Y 21 X 10 Y 20 X 14 Y 21 X 19 Y 21 X 28 Y 21 X 45 Y 21 X 48 Y 21 X -33 Y 20 X -83 Y 21 X -68 Y 21 X -55 Y 21 X -49 Y 21 X -43 Y 21 X -40 Y 20 X -44 Y 21 X -35 Y 21 X -36 Y 21 X -34 Y
 21 X -20 Y 21 X -80 Y 20 X -562 Y 250 X s black
 gsave  2268 1538 0 0 C 2199.44 1124.5 t 90 r /Helvetica-BoldOblique findfont 29.3239 sf 0 0 m 
 317 303 287 271 263 240 213 205 186 167 159 140 118 95 87 67 59 38 17
(LHC HIGGS XS WG 2011) K NC gr 
 gr  gr showpage
end
%%EOF
