%!PS-Adobe-2.0 EPSF-2.0
%%BoundingBox:  0 0 567 544
%%Title: /home/shiki/Desktop/MCFM/YR/CUT1/CUT1_POWHEG_MCFM_LHC.eps: Higgs Cross Section
%%Creator: ROOT Version 5.28/00
%%CreationDate: Tue Nov 22 18:36:49 2011
%%EndComments
%%BeginProlog
80 dict begin
/s {stroke} def /l {lineto} def /m {moveto} def /t {translate} def
/r {rotate} def /rl {roll}  def /R {repeat} def
/d {rlineto} def /rm {rmoveto} def /gr {grestore} def /f {eofill} def
/c {setrgbcolor} def /black {0 setgray} def /sd {setdash} def
/cl {closepath} def /sf {scalefont setfont} def /lw {setlinewidth} def
/box {m dup 0 exch d exch 0 d 0 exch neg d cl} def
/NC{systemdict begin initclip end}def/C{NC box clip newpath}def
/bl {box s} def /bf {box f} def /Y { 0 exch d} def /X { 0 d} def 
/K {{pop pop 0 moveto} exch kshow} bind def
/ita {/ang 15 def gsave [1 0 ang dup sin exch cos div 1 0 0] concat} def 
/mp {newpath /y exch def /x exch def} def
/side {[w .77 mul w .23 mul] .385 w mul sd w 0 l currentpoint t -144 r} def
/mr {mp x y w2 0 360 arc} def /m24 {mr s} def /m20 {mr f} def
/mb {mp x y w2 add m w2 neg 0 d 0 w neg d w 0 d 0 w d cl} def
/mt {mp x y w2 add m w2 neg w neg d w 0 d cl} def
/m21 {mb f} def /m25 {mb s} def /m22 {mt f} def /m26{mt s} def
/m23 {mp x y w2 sub m w2 w d w neg 0 d cl f} def
/m27 {mp x y w2 add m w3 neg w2 neg d w3 w2 neg d w3 w2 d cl s} def
/m28 {mp x w2 sub y w2 sub w3 add m w3 0 d  0 w3 neg d w3 0 d 0 w3 d w3 0 d  0 w3 d w3 neg 0 d 0 w3 d w3 neg 0 d 0 w3 neg d w3 neg 0 d cl s } def
/m29 {mp gsave x w2 sub y w2 add w3 sub m currentpoint t 4 {side} repeat cl fill gr} def
/m30 {mp gsave x w2 sub y w2 add w3 sub m currentpoint t 4 {side} repeat cl s gr} def
/m31 {mp x y w2 sub m 0 w d x w2 sub y m w 0 d x w2 sub y w2 add m w w neg d x w2 sub y w2 sub m w w d s} def
/m32 {mp x y w2 sub m w2 w d w neg 0 d cl s} def
/m33 {mp x y w2 add m w3 neg w2 neg d w3 w2 neg d w3 w2 d cl f} def
/m34 {mp x w2 sub y w2 sub w3 add m w3 0 d  0 w3 neg d w3 0 d 0 w3 d w3 0 d  0 w3 d w3 neg 0 d 0 w3 d w3 neg 0 d 0 w3 neg d w3 neg 0 d cl f } def
/m2 {mp x y w2 sub m 0 w d x w2 sub y m w 0 d s} def
/m5 {mp x w2 sub y w2 sub m w w d x w2 sub y w2 add m w w neg d s} def
/reEncode {exch findfont dup length dict begin {1 index /FID eq  {pop pop} {def} ifelse } forall /Encoding exch def currentdict end dup /FontName get exch definefont pop } def [/Times-Bold /Times-Italic /Times-BoldItalic /Helvetica /Helvetica-Oblique
 /Helvetica-Bold /Helvetica-BoldOblique /Courier /Courier-Oblique /Courier-Bold /Courier-BoldOblique /Times-Roman /AvantGarde-Book /AvantGarde-BookOblique /AvantGarde-Demi /AvantGarde-DemiOblique /Bookman-Demi /Bookman-DemiItalic /Bookman-Light
 /Bookman-LightItalic /Helvetica-Narrow /Helvetica-Narrow-Bold /Helvetica-Narrow-BoldOblique /Helvetica-Narrow-Oblique /NewCenturySchlbk-Roman /NewCenturySchlbk-Bold /NewCenturySchlbk-BoldItalic /NewCenturySchlbk-Italic /Palatino-Bold
 /Palatino-BoldItalic /Palatino-Italic /Palatino-Roman ] {ISOLatin1Encoding reEncode } forall%%EndProlog
%%BeginSetup
%%EndSetup
newpath  gsave  .25 .25 scale  gsave  0 0 t black[  ] 0 sd 3 lw 1 1 1 c 2268 2176 0 0 bf black 1 1 1 c 1791 1720 363 348 bf black 1791 1720 363 348 bl 1 1 1 c 1791 1720 363 348 bf black 1791 1720 363 348 bl 6 lw 1 1 1 c black 363 348 m 1791 X s 3 lw
 363 348 m 1791 X s
 gsave  2268 2176 0 0 C 1929.12 164 t 0 r /Helvetica findfont 79.9028 sf 0 0 m ( [GeV]) show NC gr 
 gsave  2268 2176 0 0 C 1891.06 137.375 t 0 r /Helvetica findfont 53.2685 sf 0 0 m (4l) show NC gr 
 gsave  2268 2176 0 0 C 1830.19 164 t 0 r /Helvetica findfont 79.9028 sf 0 0 m (M) show NC gr  526 400 m -52 Y s 591 374 m -26 Y s 656 374 m -26 Y s 721 374 m -26 Y s 786 374 m -26 Y s 851 400 m -52 Y s 917 374 m -26 Y s 982 374 m -26 Y s 1047 374 m
 -26 Y s 1112 374 m -26 Y s 1177 400 m -52 Y s 1242 374 m -26 Y s 1307 374 m -26 Y s 1373 374 m -26 Y s 1438 374 m -26 Y s 1503 400 m -52 Y s 1568 374 m -26 Y s 1633 374 m -26 Y s 1698 374 m -26 Y s 1763 374 m -26 Y s 1829 400 m -52 Y s 1894 374 m
 -26 Y s 1959 374 m -26 Y s 2024 374 m -26 Y s 2089 374 m -26 Y s 2154 400 m -52 Y s 526 400 m -52 Y s 461 374 m -26 Y s 395 374 m -26 Y s
 gsave  2268 2176 0 0 C 456.625 270.562 t 0 r /Helvetica findfont 79.9028 sf 0 0 m (100) show NC gr 
 gsave  2268 2176 0 0 C 780 270.562 t 0 r /Helvetica findfont 79.9028 sf 0 0 m (200) show NC gr 
 gsave  2268 2176 0 0 C 1107.25 270.562 t 0 r /Helvetica findfont 79.9028 sf 0 0 m (300) show NC gr 
 gsave  2268 2176 0 0 C 1430.69 270.562 t 0 r /Helvetica findfont 79.9028 sf 0 0 m (400) show NC gr 
 gsave  2268 2176 0 0 C 1757.88 270.562 t 0 r /Helvetica findfont 79.9028 sf 0 0 m (500) show NC gr 
 gsave  2268 2176 0 0 C 2085.12 270.562 t 0 r /Helvetica findfont 79.9028 sf 0 0 m (600) show NC gr  363 2068 m 1791 X s 526 2016 m 52 Y s 591 2042 m 26 Y s 656 2042 m 26 Y s 721 2042 m 26 Y s 786 2042 m 26 Y s 851 2016 m 52 Y s 917 2042 m 26 Y s 982
 2042 m 26 Y s 1047 2042 m 26 Y s 1112 2042 m 26 Y s 1177 2016 m 52 Y s 1242 2042 m 26 Y s 1307 2042 m 26 Y s 1373 2042 m 26 Y s 1438 2042 m 26 Y s 1503 2016 m 52 Y s 1568 2042 m 26 Y s 1633 2042 m 26 Y s 1698 2042 m 26 Y s 1763 2042 m 26 Y s 1829
 2016 m 52 Y s 1894 2042 m 26 Y s 1959 2042 m 26 Y s 2024 2042 m 26 Y s 2089 2042 m 26 Y s 2154 2016 m 52 Y s 526 2016 m 52 Y s 461 2042 m 26 Y s 395 2042 m 26 Y s 363 348 m 1720 Y s
 gsave  2268 2176 0 0 C 159.875 2020.75 t 90 r /Helvetica findfont 79.9028 sf 0 0 m ( \)) show NC gr 
 gsave  2268 2176 0 0 C 125.625 1986.5 t 90 r /Helvetica findfont 53.2685 sf 0 0 m (\2551) show NC gr 
 gsave  2268 2176 0 0 C 159.875 749.938 t 90 r /Helvetica findfont 79.9028 sf 0 0 m (Events/10GeV \( Normalized to 1 fb) show NC gr  390 348 m -27 X s 390 389 m -27 X s 390 423 m -27 X s 390 452 m -27 X s 390 478 m -27 X s 417 501 m -54 X s
 gsave  2268 2176 0 0 C 296.812 498.812 t 0 r /Helvetica findfont 53.2685 sf 0 0 m (\2552) show NC gr 
 gsave  2268 2176 0 0 C 209.312 464.562 t 0 r /Helvetica findfont 79.9028 sf 0 0 m (10) show NC gr  390 654 m -27 X s 390 744 m -27 X s 390 808 m -27 X s 390 857 m -27 X s 390 897 m -27 X s 390 931 m -27 X s 390 961 m -27 X s 390 987 m -27 X s 417
 1010 m -54 X s
 gsave  2268 2176 0 0 C 304.438 1008.69 t 0 r /Helvetica findfont 53.2685 sf 0 0 m (\2551) show NC gr 
 gsave  2268 2176 0 0 C 216.875 974.438 t 0 r /Helvetica findfont 79.9028 sf 0 0 m (10) show NC gr  390 1163 m -27 X s 390 1253 m -27 X s 390 1316 m -27 X s 390 1366 m -27 X s 390 1406 m -27 X s 390 1440 m -27 X s 390 1469 m -27 X s 390 1495 m -27 X
 s 417 1519 m -54 X s
 gsave  2268 2176 0 0 C 344.25 1485.5 t 0 r  -45 0 t /Helvetica findfont 79.9028 sf 0 0 m (1) show NC gr  390 1672 m -27 X s 390 1761 m -27 X s 390 1825 m -27 X s 390 1874 m -27 X s 390 1914 m -27 X s 390 1949 m -27 X s 390 1978 m -27 X s 390 2004 m
 -27 X s 417 2027 m -54 X s
 gsave  2268 2176 0 0 C 344.25 1994.12 t 0 r  -90 0 t /Helvetica findfont 79.9028 sf 0 0 m (10) show NC gr  2154 348 m 1720 Y s 2127 348 m 27 X s 2127 389 m 27 X s 2127 423 m 27 X s 2127 452 m 27 X s 2127 478 m 27 X s 2101 501 m 53 X s 2127 654 m 27
 X s 2127 744 m 27 X s 2127 808 m 27 X s 2127 857 m 27 X s 2127 897 m 27 X s 2127 931 m 27 X s 2127 961 m 27 X s 2127 987 m 27 X s 2101 1010 m 53 X s 2127 1163 m 27 X s 2127 1253 m 27 X s 2127 1316 m 27 X s 2127 1366 m 27 X s 2127 1406 m 27 X s 2127
 1440 m 27 X s 2127 1469 m 27 X s 2127 1495 m 27 X s 2101 1519 m 53 X s 2127 1672 m 27 X s 2127 1761 m 27 X s 2127 1825 m 27 X s 2127 1874 m 27 X s 2127 1914 m 27 X s 2127 1949 m 27 X s 2127 1978 m 27 X s 2127 2004 m 27 X s 2101 2027 m 53 X s 6 lw 1
 1 1 c 0 0 1 c 3 lw /w 30 def /w2 {w 2 div} def /w3 {w 3 div} def 379 1289 412 1261 444 1274 477 1684 509 1945 542 1421 575 1491 607 1488 640 1453 672 1412 705 1373 737 1340 770 1338 803 1512 835 1603 868 1597 900 1575 933 1545 965 1512 998 1485 1031
 1453 1063 1419 1096 1385 1128 1365 1161 1330 1193 1305 1226 1277 1259 1248 1291 1220 1324 1200 1356 1176 1389 1148 1421 1126 1454 1108 1487 1084 1519 1055 1552 1035 1584 1015 1617 1003 1649 979 1682 960 1715 939 1747 912 1780 907 1812 886 1845 846
 1877 849 1910 830 1943 814 1975 791 50 { m24} R 6 lw 3 lw 1975 791 2008 770 2040 739 2073 741 2105 711 2138 716 6 { m24} R 6 lw black 1 1 1 c 0.35 0.83 0.33 c 3 lw 379 1294 412 1403 444 1270 477 1678 509 1943 542 1412 575 1487 607 1489 640 1454 672
 1416 705 1377 737 1345 770 1339 803 1513 835 1603 868 1599 900 1580 933 1550 965 1519 998 1488 1031 1460 1063 1433 1096 1395 1128 1370 1161 1347 1193 1312 1226 1286 1259 1261 1291 1242 1324 1209 1356 1190 1389 1165 1421 1140 1454 1118 1487 1103 1519
 1078 1552 1063 1584 1027 1617 1016 1649 1002 1682 972 1715 950 1747 925 1780 929 1812 895 1845 881 1877 904 1910 875 1943 820 1975 811 50 { m24} R 6 lw 3 lw 1975 811 2008 786 2040 764 2073 768 2105 757 2138 743 6 { m24} R 6 lw black 1 1 1 c 1 0 0 c
 3 lw 379 1294 412 1261 444 1269 477 1686 509 1928 542 1425 575 1492 607 1484 640 1451 672 1409 705 1369 737 1338 770 1335 803 1515 835 1600 868 1597 900 1574 933 1545 965 1514 998 1483 1031 1450 1063 1419 1096 1388 1128 1363 1161 1334 1193 1299 1226
 1279 1259 1250 1291 1224 1324 1191 1356 1177 1389 1152 1421 1120 1454 1092 1487 1073 1519 1051 1552 1040 1584 1012 1617 987 1649 973 1682 949 1715 926 1747 912 1780 863 1812 859 1845 856 1877 836 1910 807 1943 785 1975 774 50 { m20} R 6 lw 3 lw 1975
 774 2008 761 2040 738 2073 728 2105 705 2138 711 6 { m20} R 6 lw black 1 1 1 c 1 0 1 c 3 lw 379 1290 412 1301 444 1264 477 1678 509 1943 542 1407 575 1489 607 1487 640 1450 672 1414 705 1371 737 1334 770 1335 803 1511 835 1600 868 1598 900 1574 933
 1544 965 1515 998 1487 1031 1455 1063 1425 1096 1395 1128 1364 1161 1336 1193 1312 1226 1284 1259 1259 1291 1229 1324 1209 1356 1179 1389 1159 1421 1139 1454 1112 1487 1087 1519 1067 1552 1070 1584 1032 1617 1012 1649 990 1682 973 1715 948 1747 933
 1780 915 1812 905 1845 894 1877 846 1910 831 1943 828 1975 810 50 { m22} R 6 lw 3 lw 1975 810 2008 779 2040 759 2073 763 2105 726 2138 720 6 { m22} R 6 lw black
 gsave  2268 2176 0 0 C 669.688 1918 t 0 r /Helvetica findfont 102.732 sf 0 0 m 
 278 221 171 144 88 60
(= 7 TeV) K NC gr 
 gsave  2268 2176 0 0 C 620.25 1918 t 0 r /Helvetica findfont 102.732 sf 0 0 m (s) show NC gr  556 1975 m 41 -61 d s 0 lw 597 1914 m 12 91 d s 609 2005 m 61 X s
 gsave  2268 2176 0 0 C 2244.94 1351.12 t 90 r /Helvetica-BoldOblique findfont 60.8783 sf 0 0 m 
 672 642 608 575 558 510 453 436 395 355 338 297 250 203 186 142 125 81 37
(LHC HIGGS XS WG 2011) K NC gr  3 lw 1 1 1 c 845 449 1191 1476 bf black 1214 1476 m -15 Y 837 X 441 Y -15 X -426 Y f 1191 1476 m 449 Y 845 X -449 Y -845 X cl s
 gsave  2268 2176 0 0 C 1594.25 1876.12 t 0 r /Helvetica findfont 49.4636 sf 0 0 m ( > 12GeV) show NC gr 
 gsave  2268 2176 0 0 C 1552.44 1849.5 t 0 r /Helvetica findfont 34.244 sf 0 0 m (Z2) show NC gr 
 gsave  2268 2176 0 0 C 1472.5 1876.12 t 0 r /Helvetica findfont 49.4636 sf 0 0 m ( , M) show NC gr 
 gsave  2268 2176 0 0 C 1438.25 1857.12 t 0 r /Helvetica findfont 34.244 sf 0 0 m (Z1) show NC gr 
 gsave  2268 2176 0 0 C 1400.25 1876.12 t 0 r /Helvetica findfont 49.4636 sf 0 0 m (M) show NC gr  0.999 0.999 0.999 c black
 gsave  2268 2176 0 0 C 1400.25 1773.44 t 0 r /Helvetica findfont 49.4636 sf 0 0 m (MSTW POWHEG 2e2mu) show NC gr  0 0 1 c 1297 1791 m24 black
 gsave  2268 2176 0 0 C 1400.25 1682.06 t 0 r /Helvetica findfont 49.4636 sf 0 0 m (MSTW MCFM 2e2mu) show NC gr  0.35 0.83 0.33 c 1297 1701 m24 black
 gsave  2268 2176 0 0 C 1400.25 1594.56 t 0 r /Helvetica findfont 49.4636 sf 0 0 m (CT10 POWHEG 2e2mu) show NC gr  1 0 0 c 1297 1611 m20 black
 gsave  2268 2176 0 0 C 1400.25 1503.25 t 0 r /Helvetica findfont 49.4636 sf 0 0 m (CT10 MCFM 2e2mu) show NC gr  1 0 1 c 1297 1521 m22
 gr  gr showpage
end
%%EOF
