%!PS-Adobe-2.0 EPSF-2.0
%%BoundingBox:  0 0 567 384
%%Title: : DisplayReweightedBornBox_DiphoxGamma2MC_mgg_Kqt_Kmgg_new
%%Creator: ROOT Version 5.26/00
%%CreationDate: Fri Jan  6 19:50:54 2012
%%EndComments
%%BeginProlog
80 dict begin
/s {stroke} def /l {lineto} def /m {moveto} def /t {translate} def
/sw {stringwidth} def /r {rotate} def /rl {roll}  def /R {repeat} def
/d {rlineto} def /rm {rmoveto} def /gr {grestore} def /f {eofill} def
/c {setrgbcolor} def /black {0 setgray} def /sd {setdash} def
/cl {closepath} def /sf {scalefont setfont} def /lw {setlinewidth} def
/box {m dup 0 exch d exch 0 d 0 exch neg d cl} def
/NC{systemdict begin initclip end}def/C{NC box clip newpath}def
/bl {box s} def /bf {box f} def /Y { 0 exch d} def /X { 0 d} def 
/mp {newpath /y exch def /x exch def} def
/side {[w .77 mul w .23 mul] .385 w mul sd w 0 l currentpoint t -144 r} def
/mr {mp x y w2 0 360 arc} def /m24 {mr s} def /m20 {mr f} def
/mb {mp x y w2 add m w2 neg 0 d 0 w neg d w 0 d 0 w d cl} def
/mt {mp x y w2 add m w2 neg w neg d w 0 d cl} def
/m21 {mb f} def /m25 {mb s} def /m22 {mt f} def /m26{mt s} def
/m23 {mp x y w2 sub m w2 w d w neg 0 d cl f} def
/m27 {mp x y w2 add m w3 neg w2 neg d w3 w2 neg d w3 w2 d cl s} def
/m28 {mp x w2 sub y w2 sub w3 add m w3 0 d  0 w3 neg d w3 0 d 0 w3 d w3 0 d  0 w3 d w3 neg 0 d 0 w3 d w3 neg 0 d
 0 w3 neg d w3 neg 0 d cl s } def
/m29 {mp gsave x w2 sub y w2 add w3 sub m currentpoint t
 4 {side} repeat cl fill gr} def
/m30 {mp gsave x w2 sub y w2 add w3 sub m currentpoint t
 4 {side} repeat cl s gr} def
/m31 {mp x y w2 sub m 0 w d x w2 sub y m w 0 d x w2 sub y w2 add m w w neg d x w2 sub y w2
 sub m w w d s} def
/m2 {mp x y w2 sub m 0 w d x w2 sub y m w 0 d s} def
/m5 {mp x w2 sub y w2 sub m w w d x w2 sub y w2 add m w w neg d s} def
/reEncode {exch findfont dup length dict begin {1 index /FID eq  {pop pop} {def} ifelse } forall /Encoding exch def currentdict end dup /FontName get exch definefont pop } def [/Times-Bold /Times-Italic /Times-BoldItalic /Helvetica
 /Helvetica-Oblique /Helvetica-Bold /Helvetica-BoldOblique /Courier /Courier-Oblique /Courier-Bold /Courier-BoldOblique /Times-Roman /AvantGarde-Book /AvantGarde-BookOblique /AvantGarde-Demi /AvantGarde-DemiOblique /Bookman-Demi
 /Bookman-DemiItalic /Bookman-Light /Bookman-LightItalic /Helvetica-Narrow /Helvetica-Narrow-Bold /Helvetica-Narrow-BoldOblique /Helvetica-Narrow-Oblique /NewCenturySchlbk-Roman /NewCenturySchlbk-Bold
 /NewCenturySchlbk-BoldItalic /NewCenturySchlbk-Italic /Palatino-Bold /Palatino-BoldItalic /Palatino-Italic /Palatino-Roman ] {ISOLatin1Encoding reEncode } forall
/oshow {gsave [] 0 sd true charpath stroke gr} def
/stwn { /fs exch def /fn exch def /text exch def fn findfont fs sf
 text sw pop xs add /xs exch def} def
/stwb { /fs exch def /fn exch def /nbas exch def /textf exch deftextf length /tlen exch def nbas tlen gt {/nbas tlendef} iffn findfont fs sf textf dup length nbas sub nbas getinterval sw
pop neg xs add /xs exch def} def
%%EndProlog
%%BeginSetup
%%EndSetup
newpath  gsave  .25 .25 scale  gsave  0 0 t black[  ] 0 sd 3 lw 1 1 1 c 2268 1538 0 0 bf black 1 1 1 c 1791 1215 363 246 bf black 1791 1215 363 246 bl 1 1 1 c 1791 1215 363 246 bf black 1791 1215 363 246 bl 1 0 0 c 6 lw 1 1 1 c black 1 0 0 c 363
 1403 m 85 X -167 Y 85 X -146 Y 86 X -134 Y 85 X -110 Y 85 X -78 Y 86 X -79 Y 85 X -57 Y 85 X -51 Y 86 X -51 Y 85 X -40 Y 85 X -34 Y 86 X -24 Y 85 X -21 Y 85 X -18 Y 85 X -22 Y 86 X -17 Y 85 X -17 Y 85 X -9 Y 86 X -10 Y 85 X -17 Y 85 X s black 3 lw
 363 246 m 1791 X s
 gsave  2268 1538 0 0 C 1922 121 t 0 r /Helvetica findfont 71.6807 sf 0 0 m (  \(GeV\)) show NC gr 
 gsave  2268 1538 0 0 C 1896 108 t 0 r /Symbol findfont 48.8732 sf 0 0 m (g) show NC gr 
 gsave  2268 1538 0 0 C 1870 108 t 0 r /Symbol findfont 48.8732 sf 0 0 m (g) show NC gr 
 gsave  2268 1538 0 0 C 1815 121 t 0 r /Helvetica findfont 71.6807 sf 0 0 m (M) show NC gr  363 283 m -37 Y s 448 264 m -18 Y s 533 264 m -18 Y s 619 264 m -18 Y s 704 283 m -37 Y s 789 264 m -18 Y s 875 264 m -18 Y s 960 264 m -18 Y s 1045 283 m
 -37 Y s 1131 264 m -18 Y s 1216 264 m -18 Y s 1301 264 m -18 Y s 1387 283 m -37 Y s 1472 264 m -18 Y s 1557 264 m -18 Y s 1642 264 m -18 Y s 1728 283 m -37 Y s 1813 264 m -18 Y s 1898 264 m -18 Y s 1984 264 m -18 Y s 2069 283 m -37 Y s 2069 283 m
 -37 Y s 2154 264 m -18 Y s
 gsave  2268 1538 0 0 C 303 179 t 0 r /Helvetica findfont 71.6807 sf 0 0 m (100) show NC gr 
 gsave  2268 1538 0 0 C 645 179 t 0 r /Helvetica findfont 71.6807 sf 0 0 m (120) show NC gr 
 gsave  2268 1538 0 0 C 984 179 t 0 r /Helvetica findfont 71.6807 sf 0 0 m (140) show NC gr 
 gsave  2268 1538 0 0 C 1326 179 t 0 r /Helvetica findfont 71.6807 sf 0 0 m (160) show NC gr 
 gsave  2268 1538 0 0 C 1668 179 t 0 r /Helvetica findfont 71.6807 sf 0 0 m (180) show NC gr 
 gsave  2268 1538 0 0 C 2010 179 t 0 r /Helvetica findfont 71.6807 sf 0 0 m (200) show NC gr  363 1461 m 1791 X s 363 1425 m 36 Y s 448 1443 m 18 Y s 533 1443 m 18 Y s 619 1443 m 18 Y s 704 1425 m 36 Y s 789 1443 m 18 Y s 875 1443 m 18 Y s 960 1443
 m 18 Y s 1045 1425 m 36 Y s 1131 1443 m 18 Y s 1216 1443 m 18 Y s 1301 1443 m 18 Y s 1387 1425 m 36 Y s 1472 1443 m 18 Y s 1557 1443 m 18 Y s 1642 1443 m 18 Y s 1728 1425 m 36 Y s 1813 1443 m 18 Y s 1898 1443 m 18 Y s 1984 1443 m 18 Y s 2069 1425 m
 36 Y s 2069 1425 m 36 Y s 2154 1443 m 18 Y s 363 246 m 1215 Y s
 gsave  2268 1538 0 0 C 101 1153 t 90 r /Helvetica findfont 71.6807 sf 0 0 m ( \(pb/GeV\)) show NC gr 
 gsave  2268 1538 0 0 C 121 1127 t 90 r /Symbol findfont 48.8732 sf 0 0 m (g) show NC gr 
 gsave  2268 1538 0 0 C 121 1101 t 90 r /Symbol findfont 48.8732 sf 0 0 m (g) show NC gr 
 gsave  2268 1538 0 0 C 101 987 t 90 r /Helvetica findfont 71.6807 sf 0 0 m (/dM) show NC gr 
 gsave  2268 1538 0 0 C 101 945 t 90 r /Symbol findfont 71.6807 sf 0 0 m (s) show NC gr 
 gsave  2268 1538 0 0 C 101 909 t 90 r /Helvetica findfont 71.6807 sf 0 0 m (d) show NC gr  417 445 m -54 X s 390 491 m -27 X s 390 536 m -27 X s 390 582 m -27 X s 390 628 m -27 X s 417 673 m -54 X s 390 719 m -27 X s 390 764 m -27 X s 390 810 m -27
 X s 390 856 m -27 X s 417 901 m -54 X s 390 947 m -27 X s 390 992 m -27 X s 390 1038 m -27 X s 390 1084 m -27 X s 417 1129 m -54 X s 390 1175 m -27 X s 390 1220 m -27 X s 390 1266 m -27 X s 390 1312 m -27 X s 417 1357 m -54 X s 417 445 m -54 X s
 390 399 m -27 X s 390 354 m -27 X s 390 308 m -27 X s 390 263 m -27 X s 417 1357 m -54 X s 390 1403 m -27 X s 390 1448 m -27 X s
 gsave  2268 1538 0 0 C 212 420 t 0 r /Helvetica findfont 71.6807 sf 0 0 m (0.05) show NC gr 
 gsave  2268 1538 0 0 C 261 648 t 0 r /Helvetica findfont 71.6807 sf 0 0 m (0.1) show NC gr 
 gsave  2268 1538 0 0 C 212 876 t 0 r /Helvetica findfont 71.6807 sf 0 0 m (0.15) show NC gr 
 gsave  2268 1538 0 0 C 251 1105 t 0 r /Helvetica findfont 71.6807 sf 0 0 m (0.2) show NC gr 
 gsave  2268 1538 0 0 C 212 1333 t 0 r /Helvetica findfont 71.6807 sf 0 0 m (0.25) show NC gr  2154 246 m 1215 Y s 2101 445 m 53 X s 2127 491 m 27 X s 2127 536 m 27 X s 2127 582 m 27 X s 2127 628 m 27 X s 2101 673 m 53 X s 2127 719 m 27 X s 2127 764
 m 27 X s 2127 810 m 27 X s 2127 856 m 27 X s 2101 901 m 53 X s 2127 947 m 27 X s 2127 992 m 27 X s 2127 1038 m 27 X s 2127 1084 m 27 X s 2101 1129 m 53 X s 2127 1175 m 27 X s 2127 1220 m 27 X s 2127 1266 m 27 X s 2127 1312 m 27 X s 2101 1357 m 53 X
 s 2101 445 m 53 X s 2127 399 m 27 X s 2127 354 m 27 X s 2127 308 m 27 X s 2127 263 m 27 X s 2101 1357 m 53 X s 2127 1403 m 27 X s 2127 1448 m 27 X s 0 0 1 c 6 lw 1 1 1 c black 0 0 1 c 363 1401 m 85 X -180 Y 85 X -133 Y 86 X -123 Y 85 X -107 Y 85 X
 -81 Y 86 X -78 Y 85 X -65 Y 85 X -45 Y 86 X -58 Y 85 X -26 Y 85 X -33 Y 86 X -25 Y 85 X -27 Y 85 X -20 Y 85 X -26 Y 86 X -12 Y 85 X -15 Y 85 X -15 Y 86 X -7 Y 85 X -15 Y 85 X s 0.35 0.83 0.33 c 1 1 1 c black 0.35 0.83 0.33 c 363 1404 m 85 X -168 Y
 85 X -146 Y 86 X -127 Y 85 X -117 Y 85 X -78 Y 86 X -78 Y 85 X -58 Y 85 X -53 Y 86 X -49 Y 85 X -41 Y 85 X -34 Y 86 X -23 Y 85 X -22 Y 85 X -17 Y 85 X -23 Y 86 X -17 Y 85 X -16 Y 85 X -9 Y 86 X -10 Y 85 X -17 Y 85 X s black 3 lw 1 1 1 c 1252 385
 876 1039 bf black 896 1039 m -13 Y 1245 X 378 Y -13 X -365 Y f 876 1039 m 385 Y 1252 X -385 Y -1252 X cl s
 gsave  2268 1538 0 0 C 1189 1349 t 0 r /Helvetica findfont 42.3568 sf 0 0 m (Diphox Born with 1\255,2\255frag + Gamma2MC Box NLO) show NC gr  1 0 0 c 6 lw 923 1360 m 219 X s black
 gsave  2268 1538 0 0 C 1189 1219 t 0 r /Helvetica findfont 42.3568 sf 0 0 m (Madgraph Born + Pythia Box) show NC gr  0 0 1 c 923 1232 m 219 X s black
 gsave  2268 1538 0 0 C 1929 1098 t 0 r /Helvetica findfont 42.3568 sf 0 0 m (\)) show NC gr 
 gsave  2268 1538 0 0 C 1916 1082 t 0 r /Symbol findfont 26.0657 sf 0 0 m (g) show NC gr 
 gsave  2268 1538 0 0 C 1903 1082 t 0 r /Symbol findfont 26.0657 sf 0 0 m (g) show NC gr 
 gsave  2268 1538 0 0 C 1857 1098 t 0 r /Helvetica findfont 42.3568 sf 0 0 m (,M) show NC gr 
 gsave  2268 1538 0 0 C 1841 1075 t 0 r /Helvetica findfont 26.0657 sf 0 0 m (T) show NC gr 
 gsave  2268 1538 0 0 C 1189 1098 t 0 r /Helvetica findfont 42.3568 sf 0 0 m (Madgraph Born + Pythia Box x K\(q) show NC gr  0.35 0.83 0.33 c 923 1103 m 219 X s black
 gsave  2268 1538 0 0 C 2199 1078 t 90 r /Helvetica-BoldOblique findfont 29.3239 sf 0 0 m (LHC HIGGS XS WG 2011) show NC gr 
 gr  gr 
showpage
end
%%EOF
