%!PS-Adobe-2.0 EPSF-2.0
%%BoundingBox:  0 0 567 384
%%Title: /home/dimicco/HiggsScan/compare_MCNLO_MCFM/ptleading.eps: canvas_ptleading
%%Creator: ROOT Version 5.26/00
%%CreationDate: Fri Dec  9 15:05:18 2011
%%EndComments
%%BeginProlog
80 dict begin
/s {stroke} def /l {lineto} def /m {moveto} def /t {translate} def
/sw {stringwidth} def /r {rotate} def /rl {roll}  def /R {repeat} def
/d {rlineto} def /rm {rmoveto} def /gr {grestore} def /f {eofill} def
/c {setrgbcolor} def /black {0 setgray} def /sd {setdash} def
/cl {closepath} def /sf {scalefont setfont} def /lw {setlinewidth} def
/box {m dup 0 exch d exch 0 d 0 exch neg d cl} def
/NC{systemdict begin initclip end}def/C{NC box clip newpath}def
/bl {box s} def /bf {box f} def /Y { 0 exch d} def /X { 0 d} def 
/mp {newpath /y exch def /x exch def} def
/side {[w .77 mul w .23 mul] .385 w mul sd w 0 l currentpoint t -144 r} def
/mr {mp x y w2 0 360 arc} def /m24 {mr s} def /m20 {mr f} def
/mb {mp x y w2 add m w2 neg 0 d 0 w neg d w 0 d 0 w d cl} def
/mt {mp x y w2 add m w2 neg w neg d w 0 d cl} def
/m21 {mb f} def /m25 {mb s} def /m22 {mt f} def /m26{mt s} def
/m23 {mp x y w2 sub m w2 w d w neg 0 d cl f} def
/m27 {mp x y w2 add m w3 neg w2 neg d w3 w2 neg d w3 w2 d cl s} def
/m28 {mp x w2 sub y w2 sub w3 add m w3 0 d  0 w3 neg d w3 0 d 0 w3 d w3 0 d  0 w3 d w3 neg 0 d 0 w3 d w3 neg 0 d
 0 w3 neg d w3 neg 0 d cl s } def
/m29 {mp gsave x w2 sub y w2 add w3 sub m currentpoint t
 4 {side} repeat cl fill gr} def
/m30 {mp gsave x w2 sub y w2 add w3 sub m currentpoint t
 4 {side} repeat cl s gr} def
/m31 {mp x y w2 sub m 0 w d x w2 sub y m w 0 d x w2 sub y w2 add m w w neg d x w2 sub y w2
 sub m w w d s} def
/m2 {mp x y w2 sub m 0 w d x w2 sub y m w 0 d s} def
/m5 {mp x w2 sub y w2 sub m w w d x w2 sub y w2 add m w w neg d s} def
/reEncode {exch findfont dup length dict begin {1 index /FID eq  {pop pop} {def} ifelse } forall /Encoding exch def currentdict end dup /FontName get exch definefont pop } def [/Times-Bold /Times-Italic /Times-BoldItalic /Helvetica
 /Helvetica-Oblique /Helvetica-Bold /Helvetica-BoldOblique /Courier /Courier-Oblique /Courier-Bold /Courier-BoldOblique /Times-Roman /AvantGarde-Book /AvantGarde-BookOblique /AvantGarde-Demi /AvantGarde-DemiOblique /Bookman-Demi
 /Bookman-DemiItalic /Bookman-Light /Bookman-LightItalic /Helvetica-Narrow /Helvetica-Narrow-Bold /Helvetica-Narrow-BoldOblique /Helvetica-Narrow-Oblique /NewCenturySchlbk-Roman /NewCenturySchlbk-Bold
 /NewCenturySchlbk-BoldItalic /NewCenturySchlbk-Italic /Palatino-Bold /Palatino-BoldItalic /Palatino-Italic /Palatino-Roman ] {ISOLatin1Encoding reEncode } forall
/oshow {gsave [] 0 sd true charpath stroke gr} def
/stwn { /fs exch def /fn exch def /text exch def fn findfont fs sf
 text sw pop xs add /xs exch def} def
/stwb { /fs exch def /fn exch def /nbas exch def /textf exch deftextf length /tlen exch def nbas tlen gt {/nbas tlendef} iffn findfont fs sf textf dup length nbas sub nbas getinterval sw
pop neg xs add /xs exch def} def
%%EndProlog
%%BeginSetup
%%EndSetup
newpath  gsave  .25 .25 scale  gsave  0 0 t black[  ] 0 sd 3 lw 1 1 1 c 2268 1538 0 0 bf black 1 1 1 c 1791 1215 363 246 bf black 1791 1215 363 246 bl 1 1 1 c 1791 1215 363 246 bf black 1791 1215 363 246 bl 1 0 0 c 6 lw 1 1 1 c 1 0 0 c 793 465 m 5 X
 s 824 465 m 5 X s 3 lw /w 29 def /w2 {w 2 div} def /w3 {w 3 div} def 811 465 m20 6 lw 847 758 m 5 Y s 847 789 m 5 Y s 829 776 m 5 X s 860 776 m 4 X s 3 lw 847 776 m20 6 lw 882 911 m 7 Y s 882 944 m 8 Y s 864 931 m 5 X s 895 931 m 5 X s 3 lw 882 931
 m20 6 lw 918 1042 m 9 Y s 918 1077 m 9 Y s 900 1064 m 5 X s 931 1064 m 5 X s 3 lw 918 1064 m20 6 lw 954 1183 m 11 Y s 954 1220 m 11 Y s 936 1207 m 5 X s 967 1207 m 5 X s 3 lw 954 1207 m20 6 lw 990 1258 m 12 Y s 990 1296 m 12 Y s 972 1283 m 5 X s
 1003 1283 m 5 X s 3 lw 990 1283 m20 6 lw 1026 1273 m 12 Y s 1026 1311 m 13 Y s 1008 1298 m 5 X s 1039 1298 m 5 X s 3 lw 1026 1298 m20 6 lw 1062 1351 m 13 Y s 1062 1390 m 13 Y s 1044 1377 m 4 X s 1075 1377 m 4 X s 3 lw 1062 1377 m20 6 lw 1097 1291 m
 12 Y s 1097 1330 m 12 Y s 1079 1316 m 5 X s 1110 1316 m 5 X s 3 lw 1097 1316 m20 6 lw 1133 1287 m 13 Y s 1133 1326 m 12 Y s 1115 1313 m 5 X s 1146 1313 m 5 X s 3 lw 1133 1313 m20 6 lw 1169 1241 m 12 Y s 1169 1280 m 12 Y s 1151 1267 m 5 X s 1182
 1267 m 5 X s 3 lw 1169 1267 m20 6 lw 1205 1232 m 12 Y s 1205 1270 m 11 Y s 1187 1257 m 5 X s 1218 1257 m 5 X s 3 lw 1205 1257 m20 6 lw 1241 1121 m 10 Y s 1241 1157 m 11 Y s 1223 1144 m 5 X s 1254 1144 m 5 X s 3 lw 1241 1144 m20 6 lw 1276 1118 m 10
 Y s 1276 1154 m 10 Y s 1259 1141 m 4 X s 1290 1141 m 4 X s 3 lw 1276 1141 m20 6 lw 1312 1073 m 9 Y s 1312 1108 m 9 Y s 1294 1095 m 5 X s 1325 1095 m 5 X s 3 lw 1312 1095 m20 6 lw 1348 1007 m 8 Y s 1348 1041 m 8 Y s 1330 1028 m 5 X s 1361 1028 m 5 X
 s 3 lw 1348 1028 m20 6 lw 1384 955 m 7 Y s 1384 989 m 7 Y s 1366 975 m 5 X s 1397 975 m 5 X s 3 lw 1384 975 m20 6 lw 1420 917 m 7 Y s 1420 950 m 7 Y s 1402 937 m 5 X s 1433 937 m 5 X s 3 lw 1420 937 m20 6 lw 1456 855 m 5 Y s 1456 886 m 6 Y s 1438
 873 m 5 X s 1469 873 m 5 X s 3 lw 1456 873 m20 6 lw 1491 812 m 5 Y s 1491 843 m 5 Y s 1474 830 m 4 X s 1505 830 m 4 X s 3 lw 1491 830 m20 6 lw 1527 731 m 4 Y s 1527 761 m 4 Y s 1509 748 m 5 X s 1540 748 m 5 X s 3 lw 1527 748 m20 6 lw 1563 699 m 3 Y
 s 1563 728 m 3 Y s 1545 715 m 5 X s 1576 715 m 5 X s 3 lw 1563 715 m20 6 lw 1599 662 m 3 Y s 1599 691 m 2 Y s 1581 678 m 5 X s 1612 678 m 5 X s 3 lw 1599 678 m20 6 lw 1635 643 m 2 Y s 1635 671 m 3 Y s 1617 658 m 5 X s 1648 658 m 5 X s 3 lw 1635 658
 m20 6 lw 1671 606 m 1 Y s 1671 633 m 2 Y s 1653 620 m 5 X s 1684 620 m 5 X s 3 lw 1671 620 m20 6 lw 1706 599 m 1 Y s 1706 626 m 1 Y s 1689 613 m 4 X s 1719 613 m 5 X s 3 lw 1706 613 m20 6 lw 1742 553 m s 1742 579 m s 1724 566 m 5 X s 1755 566 m 5 X
 s 3 lw 1742 566 m20 6 lw 1760 525 m 5 X s 1791 525 m 5 X s 3 lw 1778 525 m20 6 lw 1796 513 m 5 X s 1827 513 m 5 X s 3 lw 1814 513 m20 6 lw 1832 510 m 5 X s 1863 510 m 5 X s 3 lw 1850 510 m20 6 lw 1868 463 m 5 X s 1899 463 m 5 X s 3 lw 1886 463 m20
 6 lw 1904 449 m 4 X s 1934 449 m 5 X s 3 lw 1921 449 m20 6 lw 1939 449 m 5 X s 1970 449 m 5 X s 3 lw 1957 449 m20 6 lw 1975 443 m 5 X s 2006 443 m 5 X s 3 lw 1993 443 m20 6 lw 2011 416 m 5 X s 2042 416 m 5 X s 3 lw 2029 416 m20 6 lw 2047 416 m 5 X
 s 2078 416 m 5 X s 3 lw 2065 416 m20 6 lw 2083 401 m 5 X s 2114 401 m 5 X s 3 lw 2101 401 m20 6 lw 2119 387 m 4 X s 2149 387 m 5 X s 3 lw 2136 387 m20 6 lw black 3 lw 363 246 m 1791 X s
 gsave  2268 1538 0 0 C 1955 91 t 0 r /Helvetica findfont 71.6807 sf 0 0 m ( [GeV]) show NC gr 
 gsave  2268 1538 0 0 C 1900 52 t 0 r /Helvetica findfont 48.8732 sf 0 0 m (T2) show NC gr 
 gsave  2268 1538 0 0 C 1860 91 t 0 r /Helvetica findfont 71.6807 sf 0 0 m (p) show NC gr  363 283 m -37 Y s 399 264 m -18 Y s 434 264 m -18 Y s 470 264 m -18 Y s 506 264 m -18 Y s 542 283 m -37 Y s 578 264 m -18 Y s 614 264 m -18 Y s 649 264 m -18
 Y s 685 264 m -18 Y s 721 283 m -37 Y s 757 264 m -18 Y s 793 264 m -18 Y s 829 264 m -18 Y s 864 264 m -18 Y s 900 283 m -37 Y s 936 264 m -18 Y s 972 264 m -18 Y s 1008 264 m -18 Y s 1044 264 m -18 Y s 1079 283 m -37 Y s 1115 264 m -18 Y s 1151
 264 m -18 Y s 1187 264 m -18 Y s 1223 264 m -18 Y s 1259 283 m -37 Y s 1294 264 m -18 Y s 1330 264 m -18 Y s 1366 264 m -18 Y s 1402 264 m -18 Y s 1438 283 m -37 Y s 1474 264 m -18 Y s 1509 264 m -18 Y s 1545 264 m -18 Y s 1581 264 m -18 Y s 1617
 283 m -37 Y s 1653 264 m -18 Y s 1689 264 m -18 Y s 1724 264 m -18 Y s 1760 264 m -18 Y s 1796 283 m -37 Y s 1832 264 m -18 Y s 1868 264 m -18 Y s 1904 264 m -18 Y s 1939 264 m -18 Y s 1975 283 m -37 Y s 2011 264 m -18 Y s 2047 264 m -18 Y s 2083
 264 m -18 Y s 2119 264 m -18 Y s 2154 283 m -37 Y s
 gsave  2268 1538 0 0 C 342 179 t 0 r /Helvetica findfont 71.6807 sf 0 0 m (0) show NC gr 
 gsave  2268 1538 0 0 C 502 179 t 0 r /Helvetica findfont 71.6807 sf 0 0 m (10) show NC gr 
 gsave  2268 1538 0 0 C 681 179 t 0 r /Helvetica findfont 71.6807 sf 0 0 m (20) show NC gr 
 gsave  2268 1538 0 0 C 860 179 t 0 r /Helvetica findfont 71.6807 sf 0 0 m (30) show NC gr 
 gsave  2268 1538 0 0 C 1039 179 t 0 r /Helvetica findfont 71.6807 sf 0 0 m (40) show NC gr 
 gsave  2268 1538 0 0 C 1219 179 t 0 r /Helvetica findfont 71.6807 sf 0 0 m (50) show NC gr 
 gsave  2268 1538 0 0 C 1398 179 t 0 r /Helvetica findfont 71.6807 sf 0 0 m (60) show NC gr 
 gsave  2268 1538 0 0 C 1577 179 t 0 r /Helvetica findfont 71.6807 sf 0 0 m (70) show NC gr 
 gsave  2268 1538 0 0 C 1756 179 t 0 r /Helvetica findfont 71.6807 sf 0 0 m (80) show NC gr 
 gsave  2268 1538 0 0 C 1935 179 t 0 r /Helvetica findfont 71.6807 sf 0 0 m (90) show NC gr 
 gsave  2268 1538 0 0 C 2095 179 t 0 r /Helvetica findfont 71.6807 sf 0 0 m (100) show NC gr  363 1461 m 1791 X s 363 1425 m 36 Y s 399 1443 m 18 Y s 434 1443 m 18 Y s 470 1443 m 18 Y s 506 1443 m 18 Y s 542 1425 m 36 Y s 578 1443 m 18 Y s 614 1443
 m 18 Y s 649 1443 m 18 Y s 685 1443 m 18 Y s 721 1425 m 36 Y s 757 1443 m 18 Y s 793 1443 m 18 Y s 829 1443 m 18 Y s 864 1443 m 18 Y s 900 1425 m 36 Y s 936 1443 m 18 Y s 972 1443 m 18 Y s 1008 1443 m 18 Y s 1044 1443 m 18 Y s 1079 1425 m 36 Y s
 1115 1443 m 18 Y s 1151 1443 m 18 Y s 1187 1443 m 18 Y s 1223 1443 m 18 Y s 1259 1425 m 36 Y s 1294 1443 m 18 Y s 1330 1443 m 18 Y s 1366 1443 m 18 Y s 1402 1443 m 18 Y s 1438 1425 m 36 Y s 1474 1443 m 18 Y s 1509 1443 m 18 Y s 1545 1443 m 18 Y s
 1581 1443 m 18 Y s 1617 1425 m 36 Y s 1653 1443 m 18 Y s 1689 1443 m 18 Y s 1724 1443 m 18 Y s 1760 1443 m 18 Y s 1796 1425 m 36 Y s 1832 1443 m 18 Y s 1868 1443 m 18 Y s 1904 1443 m 18 Y s 1939 1443 m 18 Y s 1975 1425 m 36 Y s 2011 1443 m 18 Y s
 2047 1443 m 18 Y s 2083 1443 m 18 Y s 2119 1443 m 18 Y s 2154 1425 m 36 Y s 363 246 m 1215 Y s
 gsave  2268 1538 0 0 C 163 1030 t 90 r /Helvetica findfont 71.6807 sf 0 0 m (arbitrary units) show NC gr  417 246 m -54 X s 390 290 m -27 X s 390 333 m -27 X s 390 377 m -27 X s 390 420 m -27 X s 417 464 m -54 X s 390 508 m -27 X s 390 551 m -27 X
 s 390 595 m -27 X s 390 638 m -27 X s 417 682 m -54 X s 390 726 m -27 X s 390 769 m -27 X s 390 813 m -27 X s 390 856 m -27 X s 417 900 m -54 X s 390 944 m -27 X s 390 987 m -27 X s 390 1031 m -27 X s 390 1074 m -27 X s 417 1118 m -54 X s 390 1162
 m -27 X s 390 1205 m -27 X s 390 1249 m -27 X s 390 1292 m -27 X s 417 1336 m -54 X s 417 1336 m -54 X s 390 1380 m -27 X s 390 1423 m -27 X s
 gsave  2268 1538 0 0 C 310 222 t 0 r /Helvetica findfont 71.6807 sf 0 0 m (0) show NC gr 
 gsave  2268 1538 0 0 C 222 440 t 0 r /Helvetica findfont 71.6807 sf 0 0 m (0.01) show NC gr 
 gsave  2268 1538 0 0 C 212 658 t 0 r /Helvetica findfont 71.6807 sf 0 0 m (0.02) show NC gr 
 gsave  2268 1538 0 0 C 212 876 t 0 r /Helvetica findfont 71.6807 sf 0 0 m (0.03) show NC gr 
 gsave  2268 1538 0 0 C 212 1095 t 0 r /Helvetica findfont 71.6807 sf 0 0 m (0.04) show NC gr 
 gsave  2268 1538 0 0 C 212 1313 t 0 r /Helvetica findfont 71.6807 sf 0 0 m (0.05) show NC gr  2154 246 m 1215 Y s 2101 246 m 53 X s 2127 290 m 27 X s 2127 333 m 27 X s 2127 377 m 27 X s 2127 420 m 27 X s 2101 464 m 53 X s 2127 508 m 27 X s 2127 551
 m 27 X s 2127 595 m 27 X s 2127 638 m 27 X s 2101 682 m 53 X s 2127 726 m 27 X s 2127 769 m 27 X s 2127 813 m 27 X s 2127 856 m 27 X s 2101 900 m 53 X s 2127 944 m 27 X s 2127 987 m 27 X s 2127 1031 m 27 X s 2127 1074 m 27 X s 2101 1118 m 53 X s
 2127 1162 m 27 X s 2127 1205 m 27 X s 2127 1249 m 27 X s 2127 1292 m 27 X s 2101 1336 m 53 X s 2101 1336 m 53 X s 2127 1380 m 27 X s 2127 1423 m 27 X s 0 0 1 c 6 lw 1 1 1 c black 0 0 1 c 363 246 m 430 X 185 Y 36 X 282 Y 35 X 153 Y 36 X 116 Y 36 X
 136 Y 36 X 114 Y 36 X 84 Y 36 X 34 Y 35 X 6 Y 36 X -2 Y 36 X -31 Y 36 X -60 Y 36 X -35 Y 36 X -67 Y 35 X -64 Y 36 X -62 Y 36 X -57 Y 36 X -52 Y 36 X -40 Y 36 X -60 Y 35 X -48 Y 36 X -36 Y 36 X -48 Y 36 X -28 Y 36 X -38 Y 36 X -29 Y 35 X -30 Y 36 X
 -22 Y 36 X -22 Y 36 X -18 Y 36 X -21 Y 36 X -22 Y 35 X -12 Y 36 X -19 Y 36 X -9 Y 36 X -15 Y 36 X -10 Y 36 X -12 Y 35 X s 1 1 1 c 0 lw 707 228 929 345 bf 3 lw 948 345 m -13 Y 701 X 222 Y -13 X -209 Y f 0 lw 929 345 m 228 Y 707 X -228 Y -707 X cl s
 black
 gsave  2268 1538 0 0 C 1105 485 t 0 r /Helvetica findfont 87.9718 sf 0 0 m (MCFM) show NC gr  1 1 1 c 3 lw 955 477 m 124 X 79 Y -124 X f 0 lw 0 0 1 c 6 lw 955 516 m 124 X s black 3 lw 1017 516 m20 6 lw
 gsave  2268 1538 0 0 C 1105 378 t 0 r /Helvetica findfont 87.9718 sf 0 0 m (MC@NLO) show NC gr  1 1 1 c 3 lw 955 362 m 124 X 80 Y -124 X f 6 lw 1 0 0 c 955 402 m 124 X s 3 lw 1017 402 m20 6 lw black
 gsave  2268 1538 0 0 C 2222 1118 t 90 r /Helvetica-BoldOblique findfont 29.3239 sf 0 0 m (LHC HIGGS XS WG 2011) show NC gr 
 gr  gr 
showpage
end
%%EOF
