%!PS-Adobe-2.0 EPSF-2.0
%%BoundingBox: 0 0 567 425
%%Title: matcheduncertaintyand4f5fcentral.eps
%%Creator: HIGZ Version 1.29/04
%%CreationDate: 2011/05/31   14.40
%%EndComments
%%BeginProlog
80 dict begin
/s {stroke} def /l {lineto} def /m {moveto} def /t {translate} def
/sw {stringwidth} def /r {rotate} def /rl {roll}  def /R {repeat} def
/d {rlineto} def /rm {rmoveto} def /gr {grestore} def /f {eofill} def
/c {setrgbcolor} def /lw {setlinewidth} def /sd {setdash} def
/cl {closepath} def /sf {scalefont setfont} def /black {0 setgray} def
/box {m dup 0 exch d exch 0 d 0 exch neg d cl} def
/NC{systemdict begin initclip end}def/C{NC box clip newpath}def
/bl {box s} def /bf {box f} def /Y { 0 exch d} def /X { 0 d} def 
/mp {newpath /y exch def /x exch def} def
/side {[w .77 mul w .23 mul] .385 w mul sd w 0 l currentpoint t -144 r} def
/mr {mp x y w2 0 360 arc} def /m24 {mr s} def /m20 {mr f} def
/mb {mp x y w2 add m w2 neg 0 d 0 w neg d w 0 d 0 w d cl} def
/mt {mp x y w2 add m w2 neg w neg d w 0 d cl} def
/m21 {mb f} def /m25 {mb s} def /m22 {mt f} def /m26 {mt s} def
/m23 {mp x y w2 sub m w2 w d w neg 0 d cl f} def
/m27 {mp x y w2 add m w3 neg w2 neg d w3 w2 neg d w3  w2 d cl s} def
/m28 {mp x w2 sub y w2 sub w3 add m w3 0 d 0 w3 neg d w3 0 d 0 w3 d w3 0 d
 0 w3 d w3 neg 0 d 0 w3 d w3 neg 0 d
 0 w3 neg d w3 neg 0 d cl s } def
/m29 {mp gsave x w2 sub y w2 add w3 sub m currentpoint t
 4 {side} repeat cl fill gr} def
/m30 {mp gsave x w2 sub y w2 add w3 sub m currentpoint t
 5 {side} repeat s gr} def
/m31 {mp x y w2 sub m 0 w d x w2 sub y m w 0 d
 x w2 sub y w2 add m w w neg d x w2 sub y w2
 sub m w w d s} def
/m2 {mp x y w2 sub m 0 w d x w2 sub y m w 0 d s} def
/m5 {mp x w2 sub y w2 sub m w w d x w2 sub y w2 add m w w neg d s} def
/reencdict 24 dict def /ReEncode {reencdict begin /nco&na exch def
/nfnam exch def /basefontname exch def /basefontdict basefontname findfont def
/newfont basefontdict maxlength dict def basefontdict {exch dup /FID ne
{dup /Encoding eq {exch dup length array copy newfont 3 1 roll put} {exch
newfont 3 1 roll put} ifelse} {pop pop} ifelse } forall newfont
/FontName nfnam put nco&na aload pop nco&na length 2 idiv {newfont
/Encoding get 3 1 roll put} repeat nfnam newfont definefont pop end } def
/accvec [ 176 /agrave 181 /Agrave 190 /acircumflex 192 /Acircumflex
201 /adieresis 204 /Adieresis 209 /ccedilla 210 /Ccedilla 211 /eacute
212 /Eacute 213 /egrave 214 /Egrave 215 /ecircumflex 216 /Ecircumflex
217 /edieresis 218 /Edieresis 219 /icircumflex 220 /Icircumflex
221 /idieresis 222 /Idieresis 223 /ntilde 224 /Ntilde 226 /ocircumflex
228 /Ocircumflex 229 /odieresis 230 /Odieresis 231 /ucircumflex 236 /Ucircumflex
237 /udieresis 238 /Udieresis 239 /aring 242 /Aring 243 /ydieresis
244 /Ydieresis 246 /aacute 247 /Aacute 252 /ugrave 253 /Ugrave] def
/Times-Roman /Times-Roman accvec ReEncode
/Times-Italic /Times-Italic accvec ReEncode
/Times-Bold /Times-Bold accvec ReEncode
/Times-BoldItalic /Times-BoldItalic accvec ReEncode
/Helvetica /Helvetica accvec ReEncode
/Helvetica-Oblique /Helvetica-Oblique accvec ReEncode
/Helvetica-Bold /Helvetica-Bold accvec ReEncode
/Helvetica-BoldOblique /Helvetica-BoldOblique  accvec ReEncode
/Courier /Courier accvec ReEncode
/Courier-Oblique /Courier-Oblique accvec ReEncode
/Courier-Bold /Courier-Bold accvec ReEncode
/Courier-BoldOblique /Courier-BoldOblique accvec ReEncode
/oshow {gsave [] 0 sd true charpath stroke gr} def
/stwn { /fs exch def /fn exch def /text exch def fn findfont fs sf
 text sw pop xs add /xs exch def} def
/stwb { /fs exch def /fn exch def /nbas exch def /textf exch def
textf length /tlen exch def nbas tlen gt {/nbas tlen def} if
fn findfont fs sf textf dup length nbas sub nbas getinterval sw
pop neg xs add /xs exch def} def
/accspe [ 65 /plusminus 66 /bar 67 /existential 68 /universal
69 /exclam 70 /numbersign 71 /greater 72 /question 73 /integral
74 /colon 75 /semicolon 76 /less 77 /bracketleft 78 /bracketright
79 /greaterequal 80 /braceleft 81 /braceright 82 /radical
83 /spade 84 /heart 85 /diamond 86 /club 87 /lessequal
88 /multiply 89 /percent 90 /infinity 48 /circlemultiply 49 /circleplus
50 /emptyset 51 /lozenge 52 /bullet 53 /arrowright 54 /arrowup
55 /arrowleft 56 /arrowdown 57 /arrowboth 48 /degree 44 /comma 43 /plus
 45 /angle 42 /angleleft 47 /divide 61 /notequal 40 /equivalence 41 /second
 97 /approxequal 98 /congruent 99 /perpendicular 100 /partialdiff 101 /florin
 102 /intersection 103 /union 104 /propersuperset 105 /reflexsuperset
 106 /notsubset 107 /propersubset 108 /reflexsubset 109 /element 110 /notelement
 111 /gradient 112 /logicaland 113 /logicalor 114 /arrowdblboth
 115 /arrowdblleft 116 /arrowdblup 117 /arrowdblright 118 /arrowdbldown
 119 /ampersand 120 /omega1 121 /similar 122 /aleph ] def
/Symbol /Special accspe ReEncode
%%EndProlog
%%BeginSetup
%%EndSetup
newpath  gsave  .25 .25 scale  gsave 0 0 t black [] 0 sd 1 lw 2268 1701 0 0 C
 /xs 0 def 
(m)
 /Times-Bold     67 stwn 
(H)
 /Times-Bold     47 stwn 
( \(GeV\))
 /Times-Bold     67 stwn 
 gsave  2041 91
 t   0 r  xs neg 0 t 0 0 m
 /Times-Bold findfont   67 sf 0    0 m 
(m)
 show 
 currentpoint pop 0 t 
 /Times-Bold findfont   47 sf 0  -22 m 
(H)
 show 
 currentpoint pop 0 t 
 /Times-Bold findfont   67 sf 0    0 m 
( \(GeV\))
 show 
 gr 
 /xs 0 def 
(relative differences on\040)
 /Times-Bold     67 stwn 
(s)
 /Symbol     67 stwn 
 gsave  68 1474
 t  90 r  xs neg 0 t 0 0 m
 /Times-Bold findfont   67 sf 0    0 m 
(relative differences on\040)
 show 
 currentpoint pop 0 t 
 /Symbol findfont   67 sf 0    0 m 
(s)
 show 
 gr  1 0 0 c
 gsave  1043 1327
 t   0 r 0 0 m
 /Times-Bold findfont   67 sf 0    0 m 
(\()
 show 
 currentpoint pop 0 t 
 /Symbol findfont   67 sf 0    0 m 
(s)
 show 
 currentpoint pop 0 t 
 /Times-Bold findfont   47 sf 0  -22 m 
(4FS)
 show 
 currentpoint pop 0 t 
 /Times-Bold findfont   67 sf 0    0 m 
(\040)
 show 
 currentpoint pop 0 t 
 /Special findfont   67 sf 0    0 m 
(A)
 show 
 currentpoint pop 0 t 
 /Times-Bold findfont   67 sf 0    0 m 
(\040)
 show 
 currentpoint pop 0 t 
 /Symbol findfont   67 sf 0    0 m 
(Ds)
 show 
 currentpoint pop 0 t 
 /Special findfont   47 sf 0  -22 m 
(A)
 show 
 currentpoint pop 0 t 
/Special findfont   47 sf 
(A)
 dup length 1 sub 1 getinterval 
 stringwidth pop 2 div neg    0 rm 
 /Times-Bold findfont   47 sf 0   47 rm 
(    4FS)
 stringwidth pop 2 div neg 0 rm 
(    4FS)
 show
 /Times-Bold findfont   67 sf 0    0 m 
(    -\040)
 show 
 currentpoint pop 0 t 
 /Symbol findfont   67 sf 0    0 m 
(s)
 show 
 currentpoint pop 0 t 
 /Times-Bold findfont   47 sf 0  -22 m 
(matched)
 show 
 currentpoint pop 0 t 
 /Times-Bold findfont   67 sf 0    0 m 
(\) /\040)
 show 
 currentpoint pop 0 t 
 /Symbol findfont   67 sf 0    0 m 
(s)
 show 
 currentpoint pop 0 t 
 /Times-Bold findfont   47 sf 0  -22 m 
(matched)
 show 
 gsave  gr  gr  0 1 0 c
 gsave  1043 1233
 t   0 r 0 0 m
 /Times-Bold findfont   67 sf 0    0 m 
(\()
 show 
 currentpoint pop 0 t 
 /Symbol findfont   67 sf 0    0 m 
(s)
 show 
 currentpoint pop 0 t 
 /Times-Bold findfont   47 sf 0  -22 m 
(5FS)
 show 
 currentpoint pop 0 t 
 /Times-Bold findfont   67 sf 0    0 m 
(\040)
 show 
 currentpoint pop 0 t 
 /Special findfont   67 sf 0    0 m 
(A)
 show 
 currentpoint pop 0 t 
 /Times-Bold findfont   67 sf 0    0 m 
(\040)
 show 
 currentpoint pop 0 t 
 /Symbol findfont   67 sf 0    0 m 
(Ds)
 show 
 currentpoint pop 0 t 
 /Special findfont   47 sf 0  -22 m 
(A)
 show 
 currentpoint pop 0 t 
/Special findfont   47 sf 
(A)
 dup length 1 sub 1 getinterval 
 stringwidth pop 2 div neg    0 rm 
 /Times-Bold findfont   47 sf 0   47 rm 
(    5FS)
 stringwidth pop 2 div neg 0 rm 
(    5FS)
 show
 /Times-Bold findfont   67 sf 0    0 m 
(    -\040)
 show 
 currentpoint pop 0 t 
 /Symbol findfont   67 sf 0    0 m 
(s)
 show 
 currentpoint pop 0 t 
 /Times-Bold findfont   47 sf 0  -22 m 
(matched)
 show 
 currentpoint pop 0 t 
 /Times-Bold findfont   67 sf 0    0 m 
(\) /\040)
 show 
 currentpoint pop 0 t 
 /Symbol findfont   67 sf 0    0 m 
(s)
 show 
 currentpoint pop 0 t 
 /Times-Bold findfont   47 sf 0  -22 m 
(matched)
 show 
 gsave  gr  gr  0 0 1 c
 gsave  1043 1140
 t   0 r 0 0 m
 /Times-Bold findfont   67 sf 0    0 m 
(matched uncertainty)
 show 
 gr  black
 gsave  318 1327
 t   0 r 0 0 m
 /Special findfont   67 sf 0    0 m 
(R)
 show 
 currentpoint pop 0 t 
 /Times-Bold findfont   67 sf 0    0 m 
(s =7 TeV)
 show 
 gr 
 gsave  318 1227
 t   0 r 0 0 m
 /Symbol findfont   67 sf 0    0 m 
(m)
 show 
 currentpoint pop 0 t 
 /Times-Bold findfont   67 sf 0    0 m 
(=\(2m)
 show 
 currentpoint pop 0 t 
 /Times-Bold findfont   47 sf 0  -22 m 
(b)
 show 
 currentpoint pop 0 t 
 /Times-Bold findfont   67 sf 0    0 m 
(+m)
 show 
 currentpoint pop 0 t 
 /Times-Bold findfont   47 sf 0  -22 m 
(H)
 show 
 currentpoint pop 0 t 
 /Times-Bold findfont   67 sf 0    0 m 
(\)/4)
 show 
 gr 
 gsave  318 1140
 t   0 r 0 0 m
 /Times-Bold findfont   67 sf 0    0 m 
(MSTW2008)
 show 
 gr  1814 1247 227 227 C NC 4 lw 1814 1247 227 227 bl 1814 1247 227 227 C NC 1
 lw 227 227 m 1247 Y s 3 lw 261 227 m -34 X s 244 252 m -17 X s 244 277 m -17 X
 s 244 302 m -17 X s 244 327 m -17 X s 261 352 m -34 X s 244 376 m -17 X s 244
 401 m -17 X s 244 426 m -17 X s 244 451 m -17 X s 261 476 m -34 X s 244 501 m
 -17 X s 244 526 m -17 X s 244 551 m -17 X s 244 576 m -17 X s 261 601 m -34 X s
 244 626 m -17 X s 244 651 m -17 X s 244 676 m -17 X s 244 701 m -17 X s 261 726
 m -34 X s 244 751 m -17 X s 244 776 m -17 X s 244 801 m -17 X s 244 826 m -17 X
 s 261 851 m -34 X s 244 875 m -17 X s 244 900 m -17 X s 244 925 m -17 X s 244
 950 m -17 X s 261 975 m -34 X s 244 1000 m -17 X s 244 1025 m -17 X s 244 1050
 m -17 X s 244 1075 m -17 X s 261 1100 m -34 X s 244 1125 m -17 X s 244 1150 m
 -17 X s 244 1175 m -17 X s 244 1200 m -17 X s 261 1225 m -34 X s 244 1250 m -17
 X s 244 1275 m -17 X s 244 1300 m -17 X s 244 1325 m -17 X s 261 1349 m -34 X s
 244 1374 m -17 X s 244 1399 m -17 X s 244 1424 m -17 X s 244 1449 m -17 X s 261
 1474 m -34 X s
 /xs 0 def 
(-0.5)
 /Times-Bold     59 stwn 
 gsave  204 207
 t   0 r  xs neg 0 t 0 0 m
 /Times-Bold findfont   59 sf 0    0 m 
(-0.5)
 show 
 gr 
 /xs 0 def 
(-0.4)
 /Times-Bold     59 stwn 
 gsave  204 332
 t   0 r  xs neg 0 t 0 0 m
 /Times-Bold findfont   59 sf 0    0 m 
(-0.4)
 show 
 gr 
 /xs 0 def 
(-0.3)
 /Times-Bold     59 stwn 
 gsave  204 456
 t   0 r  xs neg 0 t 0 0 m
 /Times-Bold findfont   59 sf 0    0 m 
(-0.3)
 show 
 gr 
 /xs 0 def 
(-0.2)
 /Times-Bold     59 stwn 
 gsave  204 581
 t   0 r  xs neg 0 t 0 0 m
 /Times-Bold findfont   59 sf 0    0 m 
(-0.2)
 show 
 gr 
 /xs 0 def 
(-0.1)
 /Times-Bold     59 stwn 
 gsave  204 706
 t   0 r  xs neg 0 t 0 0 m
 /Times-Bold findfont   59 sf 0    0 m 
(-0.1)
 show 
 gr 
 /xs 0 def 
(-0)
 /Times-Bold     59 stwn 
 gsave  204 831
 t   0 r  xs neg 0 t 0 0 m
 /Times-Bold findfont   59 sf 0    0 m 
(-0)
 show 
 gr 
 /xs 0 def 
(0.1)
 /Times-Bold     59 stwn 
 gsave  204 955
 t   0 r  xs neg 0 t 0 0 m
 /Times-Bold findfont   59 sf 0    0 m 
(0.1)
 show 
 gr 
 /xs 0 def 
(0.2)
 /Times-Bold     59 stwn 
 gsave  204 1080
 t   0 r  xs neg 0 t 0 0 m
 /Times-Bold findfont   59 sf 0    0 m 
(0.2)
 show 
 gr 
 /xs 0 def 
(0.3)
 /Times-Bold     59 stwn 
 gsave  204 1205
 t   0 r  xs neg 0 t 0 0 m
 /Times-Bold findfont   59 sf 0    0 m 
(0.3)
 show 
 gr 
 /xs 0 def 
(0.4)
 /Times-Bold     59 stwn 
 gsave  204 1330
 t   0 r  xs neg 0 t 0 0 m
 /Times-Bold findfont   59 sf 0    0 m 
(0.4)
 show 
 gr 
 /xs 0 def 
(0.5)
 /Times-Bold     59 stwn 
 gsave  204 1454
 t   0 r  xs neg 0 t 0 0 m
 /Times-Bold findfont   59 sf 0    0 m 
(0.5)
 show 
 gr  1 lw 227 227 m 1814 X s 3 lw 227 261 m -34 Y s 272 244 m -17 Y s 318 244 m
 -17 Y s 363 244 m -17 Y s 408 244 m -17 Y s 454 261 m -34 Y s 499 244 m -17 Y s
 544 244 m -17 Y s 590 244 m -17 Y s 635 244 m -17 Y s 680 261 m -34 Y s 726 244
 m -17 Y s 771 244 m -17 Y s 816 244 m -17 Y s 862 244 m -17 Y s 907 261 m -34 Y
 s 953 244 m -17 Y s 998 244 m -17 Y s 1043 244 m -17 Y s 1089 244 m -17 Y s
 1134 261 m -34 Y s 1179 244 m -17 Y s 1225 244 m -17 Y s 1270 244 m -17 Y s
 1315 244 m -17 Y s 1361 261 m -34 Y s 1406 244 m -17 Y s 1452 244 m -17 Y s
 1497 244 m -17 Y s 1542 244 m -17 Y s 1588 261 m -34 Y s 1633 244 m -17 Y s
 1678 244 m -17 Y s 1724 244 m -17 Y s 1769 244 m -17 Y s 1814 261 m -34 Y s
 1860 244 m -17 Y s 1905 244 m -17 Y s 1950 244 m -17 Y s 1996 244 m -17 Y s
 2041 261 m -34 Y s
 /xs 0 def 
(100)
 /Times-Bold     59 stwn 
 gsave  227 164
 t   0 r  xs 2 div neg 0 t 0 0 m
 /Times-Bold findfont   59 sf 0    0 m 
(100)
 show 
 gr 
 /xs 0 def 
(150)
 /Times-Bold     59 stwn 
 gsave  454 164
 t   0 r  xs 2 div neg 0 t 0 0 m
 /Times-Bold findfont   59 sf 0    0 m 
(150)
 show 
 gr 
 /xs 0 def 
(200)
 /Times-Bold     59 stwn 
 gsave  680 164
 t   0 r  xs 2 div neg 0 t 0 0 m
 /Times-Bold findfont   59 sf 0    0 m 
(200)
 show 
 gr 
 /xs 0 def 
(250)
 /Times-Bold     59 stwn 
 gsave  907 164
 t   0 r  xs 2 div neg 0 t 0 0 m
 /Times-Bold findfont   59 sf 0    0 m 
(250)
 show 
 gr 
 /xs 0 def 
(300)
 /Times-Bold     59 stwn 
 gsave  1134 164
 t   0 r  xs 2 div neg 0 t 0 0 m
 /Times-Bold findfont   59 sf 0    0 m 
(300)
 show 
 gr 
 /xs 0 def 
(350)
 /Times-Bold     59 stwn 
 gsave  1361 164
 t   0 r  xs 2 div neg 0 t 0 0 m
 /Times-Bold findfont   59 sf 0    0 m 
(350)
 show 
 gr 
 /xs 0 def 
(400)
 /Times-Bold     59 stwn 
 gsave  1588 164
 t   0 r  xs 2 div neg 0 t 0 0 m
 /Times-Bold findfont   59 sf 0    0 m 
(400)
 show 
 gr 
 /xs 0 def 
(450)
 /Times-Bold     59 stwn 
 gsave  1814 164
 t   0 r  xs 2 div neg 0 t 0 0 m
 /Times-Bold findfont   59 sf 0    0 m 
(450)
 show 
 gr 
 /xs 0 def 
(500)
 /Times-Bold     59 stwn 
 gsave  2041 164
 t   0 r  xs 2 div neg 0 t 0 0 m
 /Times-Bold findfont   59 sf 0    0 m 
(500)
 show 
 gr  1814 1247 227 227 C NC 1 lw 2041 227 m 1247 Y s 3 lw 2007 227 m 34 X s 2024
 252 m 17 X s 2024 277 m 17 X s 2024 302 m 17 X s 2024 327 m 17 X s 2007 352 m
 34 X s 2024 376 m 17 X s 2024 401 m 17 X s 2024 426 m 17 X s 2024 451 m 17 X s
 2007 476 m 34 X s 2024 501 m 17 X s 2024 526 m 17 X s 2024 551 m 17 X s 2024
 576 m 17 X s 2007 601 m 34 X s 2024 626 m 17 X s 2024 651 m 17 X s 2024 676 m
 17 X s 2024 701 m 17 X s 2007 726 m 34 X s 2024 751 m 17 X s 2024 776 m 17 X s
 2024 801 m 17 X s 2024 826 m 17 X s 2007 851 m 34 X s 2024 875 m 17 X s 2024
 900 m 17 X s 2024 925 m 17 X s 2024 950 m 17 X s 2007 975 m 34 X s 2024 1000 m
 17 X s 2024 1025 m 17 X s 2024 1050 m 17 X s 2024 1075 m 17 X s 2007 1100 m 34
 X s 2024 1125 m 17 X s 2024 1150 m 17 X s 2024 1175 m 17 X s 2024 1200 m 17 X s
 2007 1225 m 34 X s 2024 1250 m 17 X s 2024 1275 m 17 X s 2024 1300 m 17 X s
 2024 1325 m 17 X s 2007 1349 m 34 X s 2024 1374 m 17 X s 2024 1399 m 17 X s
 2024 1424 m 17 X s 2024 1449 m 17 X s 2007 1474 m 34 X s 1 lw 227 1474 m 1814 X
 s 3 lw 227 1440 m 34 Y s 272 1457 m 17 Y s 318 1457 m 17 Y s 363 1457 m 17 Y s
 408 1457 m 17 Y s 454 1440 m 34 Y s 499 1457 m 17 Y s 544 1457 m 17 Y s 590
 1457 m 17 Y s 635 1457 m 17 Y s 680 1440 m 34 Y s 726 1457 m 17 Y s 771 1457 m
 17 Y s 816 1457 m 17 Y s 862 1457 m 17 Y s 907 1440 m 34 Y s 953 1457 m 17 Y s
 998 1457 m 17 Y s 1043 1457 m 17 Y s 1089 1457 m 17 Y s 1134 1440 m 34 Y s 1179
 1457 m 17 Y s 1225 1457 m 17 Y s 1270 1457 m 17 Y s 1315 1457 m 17 Y s 1361
 1440 m 34 Y s 1406 1457 m 17 Y s 1452 1457 m 17 Y s 1497 1457 m 17 Y s 1542
 1457 m 17 Y s 1588 1440 m 34 Y s 1633 1457 m 17 Y s 1678 1457 m 17 Y s 1724
 1457 m 17 Y s 1769 1457 m 17 Y s 1814 1440 m 34 Y s 1860 1457 m 17 Y s 1905
 1457 m 17 Y s 1950 1457 m 17 Y s 1996 1457 m 17 Y s 2041 1440 m 34 Y s 1814
 1247 227 227 C 2268 2269 0 -284 C 8 lw 1 0 0 c 231 825 m 5 -1 d s 236 824 m 4
 -1 d s 240 823 m 5 -1 d s 245 822 m 4 -2 d s 249 820 m 4 -1 d s 275 814 m 2 -1
 d s 277 813 m 4 -1 d s 281 812 m 5 -1 d s 286 811 m 4 -1 d s 290 810 m 5 -2 d s
 295 808 m 2 X s 319 802 m 3 X s 322 802 m 5 -2 d s 327 800 m 4 -1 d s 331 799 m
 5 -1 d s 336 798 m 4 -1 d s 340 797 m 1 X s 363 792 m 4 -1 d s 367 791 m 5 -1 d
 s 372 790 m 4 -1 d s 376 789 m 5 -2 d s 381 787 m 4 X s 407 782 m 1 -1 d s 408
 781 m 5 -1 d s 413 780 m 4 -1 d s 417 779 m 5 -1 d s 422 778 m 4 -1 d s 426 777
 m 4 X s 452 772 m 2 X s 454 772 m 4 -1 d s 458 771 m 5 -1 d s 463 770 m 4 -1 d
 s 467 769 m 5 -1 d s 472 768 m 2 -1 d s 496 763 m 3 -1 d s 499 762 m 4 -1 d s
 503 761 m 5 X s 508 761 m 5 -1 d s 513 760 m 4 -1 d s 517 759 m 1 -1 d s 541
 754 m 3 X s 544 754 m 5 -1 d s 549 753 m 4 -1 d s 553 752 m 5 -1 d s 558 751 m
 4 -1 d s 562 750 m 1 X s 585 746 m 5 -1 d s 590 745 m 4 X s 594 745 m 5 -1 d s
 599 744 m 4 -1 d s 603 743 m 5 -1 d s 630 738 m 1 X s 631 738 m 4 X s 635 738 m
 5 -1 d s 640 737 m 4 -1 d s 644 736 m 5 -1 d s 649 735 m 3 X s 675 731 m 1 X s
 676 731 m 4 -1 d s 680 730 m 5 -1 d s 685 729 m 4 X s 689 729 m 5 -1 d s 694
 728 m 3 -1 d s 720 724 m 1 X s 721 724 m 5 -1 d s 726 723 m 4 -1 d s 730 722 m
 5 X s 735 722 m 4 -1 d s 739 721 m 3 X s 764 717 m 3 X s 767 717 m 4 -1 d s 771
 716 m 5 X s 776 716 m 4 -1 d s 780 715 m 5 -1 d s 785 714 m 2 X s 809 711 m 3 X
 s 812 711 m 4 -1 d s 816 710 m 5 -1 d s 821 709 m 5 X s 826 709 m 4 -1 d s 830
 708 m 2 X s 854 705 m 3 -1 d s 857 704 m 5 X s 862 704 m 4 -1 d s 866 703 m 5 X
 s 871 703 m 4 -1 d s 875 702 m 2 X s 899 699 m 4 -1 d s 903 698 m 4 X s 907 698
 m 5 -1 d s 912 697 m 4 X s 916 697 m 5 -1 d s 921 696 m 1 X s 944 693 m 4 X s
 948 693 m 5 -1 d s 953 692 m 4 X s 957 692 m 5 -1 d s 962 691 m 4 X s 966 691 m
 1 -1 d s 989 688 m 4 -1 d s 993 687 m 5 X s 998 687 m 4 -1 d s 1002 686 m 5 X s
 1007 686 m 5 -1 d s 1012 685 m s 1034 683 m 5 -1 d s 1039 682 m 4 X s 1043 682
 m 5 -1 d s 1048 681 m 4 X s 1052 681 m 5 -1 d s 1057 680 m s 1079 677 m 1 X s
 1080 677 m 4 X s 1084 677 m 5 -1 d s 1089 676 m 4 X s 1093 676 m 5 -1 d s 1098
 675 m 4 X s 1125 673 m s 1125 673 m 4 -1 d s 1129 672 m 5 X s 1134 672 m 5 -1 d
 s 1139 671 m 4 X s 1143 671 m 4 -1 d s 1170 668 m s 1170 668 m 5 -1 d s 1175
 667 m 4 X s 1179 667 m 5 -1 d s 1184 666 m 4 X s 1188 666 m 4 X s 1215 663 m 1
 X s 1216 663 m 4 X s 1220 663 m 5 -1 d s 1225 662 m 4 X s 1229 662 m 5 -1 d s
 1234 661 m 3 X s 1260 659 m 1 X s 1261 659 m 5 -1 d s 1266 658 m 4 X s 1270 658
 m 5 -1 d s 1275 657 m 4 X s 1279 657 m 4 X s 1305 654 m 1 X s 1306 654 m 5 X s
 1311 654 m 4 -1 d s 1315 653 m 5 X s 1320 653 m 5 X s 1325 653 m 3 -1 d s 1350
 650 m 2 X s 1352 650 m 4 X s 1356 650 m 5 -1 d s 1361 649 m 4 X s 1365 649 m 5
 -1 d s 1370 648 m 3 X s 1395 646 m 2 X s 1397 646 m 5 X s 1402 646 m 4 -1 d s
 1406 645 m 5 X s 1411 645 m 4 -1 d s 1415 644 m 3 X s 1441 642 m 1 X s 1442 642
 m 5 -1 d s 1447 641 m 5 X s 1452 641 m 4 X s 1456 641 m 5 -1 d s 1461 640 m 2 X
 s 1486 638 m 2 X s 1488 638 m 4 X s 1492 638 m 5 -1 d s 1497 637 m 4 X s 1501
 637 m 5 -1 d s 1506 636 m 2 X s 1531 634 m 2 X s 1533 634 m 5 X s 1538 634 m 4
 -1 d s 1542 633 m 5 X s 1547 633 m 4 X s 1551 633 m 3 -1 d s 1576 630 m 3 X s
 1579 630 m 4 X s 1583 630 m 5 X s 1588 630 m 4 -1 d s 1592 629 m 5 X s 1597 629
 m 2 X s 1621 627 m 3 X s 1624 627 m 4 -1 d s 1628 626 m 5 X s 1633 626 m 4 -1 d
 s 1637 625 m 5 X s 1642 625 m 2 X s 1667 623 m 2 X s 1669 623 m 5 X s 1674 623
 m 4 -1 d s 1678 622 m 5 X s 1683 622 m 4 X s 1687 622 m 2 -1 d s 1712 620 m 3
 -1 d s 1715 619 m 4 X s 1719 619 m 5 X s 1724 619 m 4 -1 d s 1728 618 m 5 X s
 1733 618 m 1 X s 1757 616 m 3 X s 1760 616 m 5 X s 1765 616 m 4 -1 d s 1769 615
 m 5 X s 1774 615 m 4 -1 d s 1778 614 m 2 X s 1802 613 m 3 -1 d s 1805 612 m 5 X
 s 1810 612 m 4 X s 1814 612 m 5 -1 d s 1819 611 m 4 X s 1823 611 m 2 X s 1848
 609 m 3 X s 1851 609 m 4 X s 1855 609 m 5 -1 d s 1860 608 m 4 X s 1864 608 m 5
 X s 1869 608 m 1 X s 1893 606 m 3 X s 1896 606 m 5 -1 d s 1901 605 m 4 X s 1905
 605 m 5 X s 1910 605 m 4 -1 d s 1914 604 m 1 X s 1938 603 m 3 -1 d s 1941 602 m
 5 X s 1946 602 m 4 X s 1950 602 m 5 -1 d s 1955 601 m 5 X s 1960 601 m 1 X s
 1983 599 m 4 X s 1987 599 m 4 X s 1991 599 m 5 -1 d s 1996 598 m 4 X s 2000 598
 m 5 X s 2005 598 m 1 X s 2028 596 m 4 X s 2032 596 m 5 X s 2037 596 m 4 -1 d s
 1814 1247 227 227 C 2268 2269 0 -284 C 0 1 0 c /w 16
 def /w2 {w 2 div} def /w3 {w 3 div} def 242 877 m20 287 885 m20 332 891 m20 377
 897 m20 422 902 m20 467 906 m20 512 910 m20 558 913 m20 603 916 m20 648 918 m20
 694 920 m20 739 922 m20 784 924 m20 830 926 m20 875 927 m20 920 929 m20 966 930
 m20 1011 931 m20 1056 932 m20 1102 933 m20 1147 934 m20 1192 935 m20 1238 936
 m20 1283 937 m20 1328 937 m20 1374 938 m20 1419 939 m20 1464 940 m20 1510 940
 m20 1555 941 m20 1600 941 m20 1646 942 m20 1691 943 m20 1737 943 m20 1782 944
 m20 1827 944 m20 1873 945 m20 1918 945 m20 1963 946 m20 2009 946 m20 1814 1247
 227 227 C 0 0 1 c 231 1052 m 5 -1 d 4 -1 d 5 -1 d 4 -1 d 5 -1 d 5 -1 d 4 -1 d 5
 -1 d 4 -1 d 5 -1 d 4 -1 d 5 X 4 -1 d 5 -1 d 4 -1 d 5 -1 d 4 X 5 -1 d 5 -1 d 4
 -1 d 5 X 4 -1 d 5 -1 d 4 X 5 -1 d 4 -1 d 5 X 4 -1 d 5 -1 d 4 X 5 -1 d 4 X 5 -1
 d 5 X 4 -1 d 5 X 4 -1 d 5 X 4 -1 d 5 X 4 -1 d 5 X 4 -1 d 5 X 4 -1 d 5 X 5 -1 d
 9 X 4 -1 d 5 X 4 -1 d 9 X 5 -1 d 4 X 5 -1 d 9 X 4 -1 d 10 X 4 -1 d 14 X 4 -1 d
 9 X 5 -1 d 13 X 5 -1 d 14 X 4 -1 d 18 X 5 -1 d 18 X 5 -1 d 18 X 4 -1 d 23 X 4
 -1 d 32 X 5 -1 d 31 X 5 -1 d 50 X 4 -1 d 73 X 5 -1 d 244 X 5 1 d 100 X 4 1 d 68
 X 5 1 d 59 X 4 1 d 55 X 4 1 d 46 X 4 1 d 46 X 4 1 d 41 X 5 1 d 40 X 5 1 d 41 X
 4 1 d 37 X 4 1 d 36 X 5 1 d 36 X 5 1 d 31 X 5 1 d 36 X 5 1 d 32 X 4 1 d 36 X 5
 1 d 32 X 4 1 d 32 X 5 1 d 22 X s 231 546 m 5 2 d 4 2 d 5 2 d 4 2 d 5 1 d 5 2 d
 4 2 d 5 2 d 4 2 d 5 1 d 4 2 d 5 2 d 4 1 d 5 2 d 4 2 d 5 1 d 4 2 d 5 1 d 5 2 d 4
 1 d 5 2 d 4 1 d 5 1 d 4 2 d 5 1 d 4 2 d 5 1 d 4 1 d 5 1 d 4 2 d 5 1 d 4 1 d 5 1
 d 5 1 d 4 1 d 5 2 d 4 1 d 5 1 d 4 1 d 5 1 d 4 1 d 5 1 d 4 1 d 5 1 d 4 1 d 5 X 5
 1 d 4 1 d 5 1 d 4 1 d 5 1 d 4 1 d 5 X 4 1 d 5 1 d 4 1 d 5 X 4 1 d 5 1 d 4 1 d 5
 X 5 1 d 4 1 d 5 X 4 1 d 5 1 d 4 X 5 1 d 4 X 5 1 d 4 X 5 1 d 4 1 d 5 X 5 1 d 4 X
 5 1 d 4 X 5 1 d 4 X 5 1 d 4 X 5 1 d 4 X 5 1 d 9 X 5 1 d 4 X 5 1 d 9 X 4 1 d 5 X
 4 1 d 9 X 5 1 d 9 X 4 1 d 5 X 5 1 d 9 X 4 1 d 9 X 5 1 d 13 X 5 1 d 9 X 5 1 d 9
 X 4 1 d 14 X 4 1 d 14 X 4 1 d 14 X 5 1 d 13 X 5 1 d 13 X 5 1 d 13 X 5 1 d 18 X
 5 1 d 13 X 5 1 d 18 X 4 1 d 19 X 4 1 d 18 X 5 1 d 23 X 4 1 d 23 X 4 1 d 23 X 4
 1 d 23 X 5 1 d 27 X 4 1 d 32 X 5 1 d 32 X 4 1 d 41 X 4 1 d 50 X 5 1 d 77 X 4 1
 d 264 X 4 -1 d 104 X 5 -1 d 86 X 5 -1 d 77 X 4 -1 d 82 X 5 -1 d 22 X s 2268
 2269 0 -284 C 1 0 0 c 816 1349 m 23 X s 862 1349 m 23 X s 907 1349 m 23 X s 953
 1349 m 22 X s 1814 1247 227 227 C 2268 2269 0 -284 C 0 1 0 c 828 1256 m20 873
 1256 m20 919 1256 m20 964 1256 m20 1814 1247 227 227 C 0 0 1 c 816 1162 m 182 X
 s 2268 2269 0 -284 C 1 0 0 c 231 1128 m 5 -2 d s 236 1126 m 4 -2 d s 240 1124 m
 5 -2 d s 245 1122 m 4 -2 d s 249 1120 m 3 -2 d s 273 1110 m 4 -2 d s 277 1108 m
 4 -2 d s 281 1106 m 5 -1 d s 286 1105 m 4 -2 d s 290 1103 m 4 -2 d s 315 1093 m
 3 -1 d s 318 1092 m 4 -2 d s 322 1090 m 5 -1 d s 327 1089 m 4 -2 d s 331 1087 m
 5 -2 d s 336 1085 m 1 X s 358 1078 m -1 Y s 358 1077 m 5 -1 d s 363 1076 m 4 -2
 d s 367 1074 m 5 -1 d s 372 1073 m 4 -2 d s 376 1071 m 3 -1 d s 401 1063 m 3 -1
 d s 404 1062 m 4 -1 d s 408 1061 m 5 -2 d s 413 1059 m 4 -1 d s 417 1058 m 5 -1
 d s 422 1057 m 1 -1 d s 444 1050 m 1 X s 445 1050 m 4 -2 d s 449 1048 m 5 -1 d
 s 454 1047 m 4 -1 d s 458 1046 m 5 -2 d s 463 1044 m 3 X s 488 1037 m 2 X s 490
 1037 m 4 -1 d s 494 1036 m 5 -2 d s 499 1034 m 4 -1 d s 503 1033 m 5 -1 d s 508
 1032 m 2 X s 532 1026 m 3 -1 d s 535 1025 m 5 -1 d s 540 1024 m 4 -1 d s 544
 1023 m 5 -1 d s 549 1022 m 4 -1 d s 553 1021 m 1 -1 d s 576 1015 m s 576 1015 m
 5 -1 d s 581 1014 m 4 -1 d s 585 1013 m 5 -1 d s 590 1012 m 4 -1 d s 594 1011 m
 4 -1 d s 620 1005 m 1 X s 621 1005 m 5 -1 d s 626 1004 m 5 -1 d s 631 1003 m 4
 -1 d s 635 1002 m 5 -1 d s 640 1001 m 2 X s 664 996 m 3 -1 d s 667 995 m 4 X s
 671 995 m 5 -1 d s 676 994 m 4 -1 d s 680 993 m 5 -1 d s 685 992 m 2 X s 709
 987 m 3 X s 712 987 m 5 -1 d s 717 986 m 4 -1 d s 721 985 m 5 -1 d s 726 984 m
 4 -1 d s 730 983 m 1 X s 754 979 m 4 -1 d s 758 978 m 4 X s 762 978 m 5 -1 d s
 767 977 m 4 -1 d s 771 976 m 5 -1 d s 776 975 m s 798 972 m 5 -1 d s 803 971 m
 4 -1 d s 807 970 m 5 -1 d s 812 969 m 4 X s 816 969 m 5 -1 d s 843 964 m 1 X s
 844 964 m 4 X s 848 964 m 5 -1 d s 853 963 m 4 -1 d s 857 962 m 5 X s 862 962 m
 4 -1 d s 888 958 m 1 -1 d s 889 957 m 5 X s 894 957 m 4 -1 d s 898 956 m 5 -1 d
 s 903 955 m 4 X s 907 955 m 3 -1 d s 933 951 m 1 X s 934 951 m 5 -1 d s 939 950
 m 4 X s 943 950 m 5 -1 d s 948 949 m 5 X s 953 949 m 2 -1 d s 978 945 m 2 X s
 980 945 m 4 -1 d s 984 944 m 5 X s 989 944 m 4 -1 d s 993 943 m 5 X s 998 943 m
 2 -1 d s 1023 939 m 2 X s 1025 939 m 5 X s 1030 939 m 4 -1 d s 1034 938 m 5 X s
 1039 938 m 4 -1 d s 1043 937 m 2 X s 1068 934 m 2 X s 1070 934 m 5 -1 d s 1075
 933 m 5 X s 1080 933 m 4 -1 d s 1084 932 m 5 X s 1089 932 m 1 -1 d s 1113 929 m
 3 X s 1116 929 m 4 -1 d s 1120 928 m 5 X s 1125 928 m 4 -1 d s 1129 927 m 5 X s
 1134 927 m 1 -1 d s 1158 924 m 3 X s 1161 924 m 5 -1 d s 1166 923 m 4 X s 1170
 923 m 5 -1 d s 1175 922 m 4 X s 1179 922 m 2 -1 d s 1203 919 m 4 X s 1207 919 m
 4 -1 d s 1211 918 m 5 X s 1216 918 m 4 -1 d s 1220 917 m 5 X s 1225 917 m 1 X s
 1248 915 m 4 -1 d s 1252 914 m 4 X s 1256 914 m 5 -1 d s 1261 913 m 5 X s 1266
 913 m 4 -1 d s 1270 912 m 1 X s 1293 910 m 4 X s 1297 910 m 5 -1 d s 1302 909 m
 4 X s 1306 909 m 5 X s 1311 909 m 4 -1 d s 1315 908 m 1 X s 1339 906 m 4 X s
 1343 906 m 4 -1 d s 1347 905 m 5 X s 1352 905 m 4 -1 d s 1356 904 m 5 X s 1361
 904 m s 1384 902 m 4 X s 1388 902 m 5 -1 d s 1393 901 m 4 X s 1397 901 m 5 -1 d
 s 1402 900 m 4 X s 1406 900 m s 1429 898 m 4 X s 1433 898 m 5 -1 d s 1438 897 m
 4 X s 1442 897 m 5 -1 d s 1447 896 m 5 X s 1452 896 m s 1474 894 m s 1474 894 m
 5 X s 1479 894 m 4 -1 d s 1483 893 m 5 X s 1488 893 m 4 X s 1492 893 m 5 -1 d s
 1519 890 m 1 X s 1520 890 m 4 X s 1524 890 m 5 X s 1529 890 m 4 -1 d s 1533 889
 m 5 X s 1538 889 m 4 X s 1565 887 m s 1565 887 m 4 -1 d s 1569 886 m 5 X s 1574
 886 m 5 X s 1579 886 m 4 -1 d s 1583 885 m 4 X s 1610 883 m s 1610 883 m 5 X s
 1615 883 m 4 X s 1619 883 m 5 -1 d s 1624 882 m 4 X s 1628 882 m 4 X s 1655 880
 m 1 X s 1656 880 m 4 X s 1660 880 m 5 -1 d s 1665 879 m 4 X s 1669 879 m 5 X s
 1674 879 m 4 -1 d s 1700 877 m 1 X s 1701 877 m 5 -1 d s 1706 876 m 4 X s 1710
 876 m 5 X s 1715 876 m 4 -1 d s 1719 875 m 4 X s 1746 873 m s 1746 873 m 5 X s
 1751 873 m 4 X s 1755 873 m 5 -1 d s 1760 872 m 5 X s 1765 872 m 3 X s 1791 870
 m 1 X s 1792 870 m 4 X s 1796 870 m 5 -1 d s 1801 869 m 4 X s 1805 869 m 5 X s
 1810 869 m 3 X s 1836 867 m 1 X s 1837 867 m 5 X s 1842 867 m 4 -1 d s 1846 866
 m 5 X s 1851 866 m 4 X s 1855 866 m 4 -1 d s 1881 864 m 1 X s 1882 864 m 5 X s
 1887 864 m 5 -1 d s 1892 863 m 4 X s 1896 863 m 5 X s 1901 863 m 3 -1 d s 1927
 861 m 1 X s 1928 861 m 4 X s 1932 861 m 5 -1 d s 1937 860 m 4 X s 1941 860 m 5
 X s 1946 860 m 3 -1 d s 1972 858 m 1 X s 1973 858 m 5 X s 1978 858 m 4 -1 d s
 1982 857 m 5 X s 1987 857 m 4 X s 1991 857 m 3 -1 d s 2017 855 m 2 X s 2019 855
 m 4 X s 2023 855 m 5 -1 d s 2028 854 m 4 X s 2032 854 m 5 X s 2037 854 m 3 X s
 1814 1247 227 227 C 2268 2269 0 -284 C 231 561 m 5 -2 d s 236 559 m 4 -1 d s
 240 558 m 5 -1 d s 245 557 m 4 -1 d s 249 556 m 4 X s 276 551 m 1 -1 d s 277
 550 m 4 -1 d s 281 549 m 5 -1 d s 286 548 m 4 -1 d s 290 547 m 5 X s 295 547 m
 3 -1 d s 320 541 m 2 X s 322 541 m 5 -1 d s 327 540 m 4 -1 d s 331 539 m 5 -1 d
 s 336 538 m 4 -1 d s 340 537 m 2 X s 364 532 m 3 -1 d s 367 531 m 5 X s 372 531
 m 4 -1 d s 376 530 m 5 -1 d s 381 529 m 5 -1 d s 386 528 m 1 X s 409 523 m 4 X
 s 413 523 m 4 -1 d s 417 522 m 5 -1 d s 422 521 m 4 -1 d s 426 520 m 5 -1 d s
 431 519 m s 454 515 m s 454 515 m 4 -1 d s 458 514 m 5 -1 d s 463 513 m 4 X s
 467 513 m 5 -1 d s 472 512 m 4 -1 d s 498 507 m 1 X s 499 507 m 4 -1 d s 503
 506 m 5 -1 d s 508 505 m 5 X s 513 505 m 4 -1 d s 517 504 m 4 -1 d s 543 500 m
 1 -1 d s 544 499 m 5 X s 549 499 m 4 -1 d s 553 498 m 5 -1 d s 558 497 m 4 -1 d
 s 562 496 m 3 X s 588 492 m 2 X s 590 492 m 4 -1 d s 594 491 m 5 X s 599 491 m
 4 -1 d s 603 490 m 5 -1 d s 608 489 m 2 X s 633 486 m 2 -1 d s 635 485 m 5 X s
 640 485 m 4 -1 d s 644 484 m 5 -1 d s 649 483 m 4 X s 653 483 m 2 -1 d s 677
 479 m 3 X s 680 479 m 5 -1 d s 685 478 m 4 -1 d s 689 477 m 5 X s 694 477 m 5
 -1 d s 699 476 m 1 X s 722 473 m 4 -1 d s 726 472 m 4 X s 730 472 m 5 -1 d s
 735 471 m 4 X s 739 471 m 5 -1 d s 744 470 m 1 X s 767 467 m 4 -1 d s 771 466 m
 5 X s 776 466 m 4 -1 d s 780 465 m 5 X s 785 465 m 4 -1 d s 789 464 m 1 X s 812
 461 m 4 X s 816 461 m 5 -1 d s 821 460 m 5 -1 d s 826 459 m 4 X s 830 459 m 5
 -1 d s 835 458 m s 857 456 m 5 -1 d s 862 455 m 4 X s 866 455 m 5 -1 d s 871
 454 m 4 -1 d s 875 453 m 5 X s 902 450 m 1 X s 903 450 m 4 X s 907 450 m 5 -1 d
 s 912 449 m 4 X s 916 449 m 5 -1 d s 921 448 m 4 X s 947 445 m 1 X s 948 445 m
 5 X s 953 445 m 4 -1 d s 957 444 m 5 X s 962 444 m 4 -1 d s 966 443 m 4 X s 993
 440 m s 993 440 m 5 X s 998 440 m 4 -1 d s 1002 439 m 5 X s 1007 439 m 5 -1 d s
 1012 438 m 3 X s 1038 435 m 1 X s 1039 435 m 4 X s 1043 435 m 5 -1 d s 1048 434
 m 4 X s 1052 434 m 5 -1 d s 1057 433 m 3 X s 1083 431 m 1 X s 1084 431 m 5 -1 d
 s 1089 430 m 4 X s 1093 430 m 5 -1 d s 1098 429 m 4 X s 1102 429 m 3 X s 1128
 426 m 1 X s 1129 426 m 5 X s 1134 426 m 5 -1 d s 1139 425 m 4 X s 1143 425 m 5
 -1 d s 1148 424 m 2 X s 1173 422 m 2 X s 1175 422 m 4 -1 d s 1179 421 m 5 X s
 1184 421 m 4 X s 1188 421 m 5 -1 d s 1193 420 m 3 X s 1218 418 m 2 X s 1220 418
 m 5 -1 d s 1225 417 m 4 X s 1229 417 m 5 -1 d s 1234 416 m 4 X s 1238 416 m 3 X
 s 1263 414 m 3 X s 1266 414 m 4 -1 d s 1270 413 m 5 X s 1275 413 m 4 -1 d s
 1279 412 m 5 X s 1284 412 m 2 X s 1309 410 m 2 X s 1311 410 m 4 -1 d s 1315 409
 m 5 X s 1320 409 m 5 -1 d s 1325 408 m 4 X s 1329 408 m 2 X s 1354 406 m 2 X s
 1356 406 m 5 -1 d s 1361 405 m 4 X s 1365 405 m 5 X s 1370 405 m 4 -1 d s 1374
 404 m 2 X s 1399 402 m 3 X s 1402 402 m 4 X s 1406 402 m 5 -1 d s 1411 401 m 4
 X s 1415 401 m 5 -1 d s 1420 400 m 2 X s 1444 398 m 3 X s 1447 398 m 5 X s 1452
 398 m 4 X s 1456 398 m 5 -1 d s 1461 397 m 4 X s 1465 397 m 2 X s 1489 395 m 3
 X s 1492 395 m 5 -1 d s 1497 394 m 4 X s 1501 394 m 5 X s 1506 394 m 4 -1 d s
 1510 393 m 2 X s 1535 391 m 3 X s 1538 391 m 4 X s 1542 391 m 5 -1 d s 1547 390
 m 4 X s 1551 390 m 5 X s 1556 390 m 1 X s 1580 388 m 3 X s 1583 388 m 5 -1 d s
 1588 387 m 4 X s 1592 387 m 5 X s 1597 387 m 4 -1 d s 1601 386 m 2 X s 1625 385
 m 3 -1 d s 1628 384 m 5 X s 1633 384 m 4 X s 1637 384 m 5 -1 d s 1642 383 m 5 X
 s 1647 383 m 1 X s 1670 381 m 4 X s 1674 381 m 4 X s 1678 381 m 5 -1 d s 1683
 380 m 4 X s 1687 380 m 5 X s 1692 380 m 1 X s 1716 378 m 3 X s 1719 378 m 5 -1
 d s 1724 377 m 4 X s 1728 377 m 5 X s 1733 377 m 4 X s 1737 377 m 1 -1 d s 1761
 375 m 4 X s 1765 375 m 4 -1 d s 1769 374 m 5 X s 1774 374 m 4 X s 1778 374 m 5
 -1 d s 1783 373 m s 1806 372 m 4 X s 1810 372 m 4 -1 d s 1814 371 m 5 X s 1819
 371 m 4 X s 1823 371 m 5 -1 d s 1828 370 m 1 X s 1851 369 m 4 -1 d s 1855 368 m
 5 X s 1860 368 m 4 X s 1864 368 m 5 X s 1869 368 m 4 -1 d s 1873 367 m 1 X s
 1897 366 m 4 -1 d s 1901 365 m 4 X s 1905 365 m 5 X s 1910 365 m 4 X s 1914 365
 m 5 -1 d s 1919 364 m s 1942 363 m 4 X s 1946 363 m 4 -1 d s 1950 362 m 5 X s
 1955 362 m 5 X s 1960 362 m 4 -1 d s 1964 361 m 1 X s 1987 360 m 4 X s 1991 360
 m 5 -1 d s 1996 359 m 4 X s 2000 359 m 5 X s 2005 359 m 4 -1 d s 2009 358 m 1 X
 s 2032 357 m 5 X s 2037 357 m 4 -1 d s 1814 1247 227 227 C 2268 2269 0 -284 C 0
 1 0 c 243 981 m20 288 986 m20 333 990 m20 378 994 m20 423 997 m20 469 1000 m20
 514 1003 m20 559 1006 m20 604 1008 m20 650 1011 m20 695 1014 m20 740 1016 m20
 786 1019 m20 831 1021 m20 876 1023 m20 922 1026 m20 967 1028 m20 1012 1030 m20
 1057 1033 m20 1103 1035 m20 1148 1037 m20 1193 1039 m20 1239 1042 m20 1284 1044
 m20 1329 1046 m20 1375 1049 m20 1420 1051 m20 1465 1053 m20 1510 1056 m20 1556
 1058 m20 1601 1060 m20 1646 1063 m20 1692 1065 m20 1737 1067 m20 1782 1070 m20
 1828 1072 m20 1873 1074 m20 1918 1077 m20 1963 1079 m20 2009 1081 m20 1814 1247
 227 227 C 2268 2269 0 -284 C 239 541 m20 272 572 m20 307 601 m20 344 627 m20
 383 649 m20 424 669 m20 466 685 m20 510 699 m20 554 711 m20 598 720 m20 642 728
 m20 687 735 m20 732 742 m20 777 747 m20 822 752 m20 868 756 m20 913 760 m20 958
 763 m20 1003 767 m20 1048 770 m20 1094 772 m20 1139 775 m20 1184 777 m20 1230
 779 m20 1275 780 m20 1320 782 m20 1366 783 m20 1411 784 m20 1456 784 m20 1502
 784 m20 1547 785 m20 1592 785 m20 1638 784 m20 1683 784 m20 1729 784 m20 1774
 783 m20 1819 783 m20 1865 782 m20 1910 782 m20 1955 781 m20 2001 781 m20 1814
 1247 227 227 C
 gr  gr 
showpage
end
%%EOF
