%!PS-Adobe-1.0
%%Creator: Unified Graphics System
%%Pages: (atend)
%%DocumentFonts: Courier
%%BoundingBox:   95  205  481  563
%%EndComments
/Sw{setlinewidth}def
/Sg{setgray}def
/Sd{setdash}def
/P {newpath
    moveto
0 0 rlineto
    stroke}def
/M {moveto}def
/D {lineto}def
/N {newpath}def
/S {stroke}def
/T {/Courier findfont
    exch
    scalefont
    setfont}def
/R {rotate}def
/W {show}def
/F {fill}def
/X {gsave}def
/Y {grestore}def
%%EndProlog
%%Page: 1 1
0.24000 0.24000 scale
1 setlinecap
1 setlinejoin
4 Sw
0 0 0 setrgbcolor
[] 0 Sd
N
645 2259 M
645 2227 D
S
N
646 2259 M
646 2227 D
S
N
646 2254 M
649 2257 D
652 2259 D
655 2259 D
660 2257 D
663 2254 D
664 2249 D
664 2246 D
663 2242 D
660 2239 D
655 2237 D
652 2237 D
649 2239 D
646 2242 D
S
N
655 2259 M
658 2257 D
661 2254 D
663 2249 D
663 2246 D
661 2242 D
658 2239 D
655 2237 D
S
N
640 2259 M
646 2259 D
S
N
640 2227 M
651 2227 D
S
N
677 2259 M
677 2227 D
S
N
678 2259 M
678 2227 D
S
N
678 2254 M
681 2257 D
684 2259 D
687 2259 D
692 2257 D
695 2254 D
696 2249 D
696 2246 D
695 2242 D
692 2239 D
687 2237 D
684 2237 D
681 2239 D
678 2242 D
S
N
687 2259 M
690 2257 D
693 2254 D
695 2249 D
695 2246 D
693 2242 D
690 2239 D
687 2237 D
S
N
672 2259 M
678 2259 D
S
N
672 2227 M
683 2227 D
S
N
753 2254 M
758 2251 D
753 2248 D
S
N
749 2259 M
757 2251 D
749 2243 D
S
N
731 2251 M
757 2251 D
S
N
796 2269 M
796 2237 D
S
N
797 2269 M
797 2237 D
S
N
815 2269 M
815 2237 D
S
N
817 2269 M
817 2237 D
S
N
791 2269 M
802 2269 D
S
N
811 2269 M
821 2269 D
S
N
797 2254 M
815 2254 D
S
N
791 2237 M
802 2237 D
S
N
811 2237 M
821 2237 D
S
N
832 2269 M
832 2243 D
833 2239 D
836 2237 D
840 2237 D
843 2239 D
844 2242 D
S
N
833 2269 M
833 2243 D
835 2239 D
836 2237 D
S
N
827 2259 M
840 2259 D
S
N
855 2269 M
855 2243 D
856 2239 D
859 2237 D
862 2237 D
865 2239 D
867 2242 D
S
N
856 2269 M
856 2243 D
858 2239 D
859 2237 D
S
N
850 2259 M
862 2259 D
S
N
846 2278 M
879 2278 D
S
N
974 2269 M
974 2237 D
S
N
975 2269 M
975 2237 D
S
N
974 2254 M
971 2257 D
968 2259 D
965 2259 D
960 2257 D
957 2254 D
956 2249 D
956 2246 D
957 2242 D
960 2239 D
965 2237 D
968 2237 D
971 2239 D
974 2242 D
S
N
965 2259 M
962 2257 D
959 2254 D
957 2249 D
957 2246 D
959 2242 D
962 2239 D
965 2237 D
S
N
969 2269 M
975 2269 D
S
N
974 2237 M
980 2237 D
S
N
1012 2259 M
996 2259 D
992 2257 D
989 2252 D
987 2248 D
987 2243 D
989 2240 D
990 2239 D
993 2237 D
996 2237 D
1001 2239 D
1004 2243 D
1006 2248 D
1006 2252 D
1004 2256 D
1003 2257 D
1000 2259 D
S
N
996 2259 M
993 2257 D
990 2252 D
989 2248 D
989 2242 D
990 2239 D
S
N
996 2237 M
1000 2239 D
1003 2243 D
1004 2248 D
1004 2254 D
1003 2257 D
S
N
1003 2257 M
1012 2257 D
S
N
1045 2275 M
1018 2227 D
S
N
1070 2269 M
1070 2237 D
S
N
1072 2269 M
1072 2237 D
S
N
1070 2254 M
1067 2257 D
1064 2259 D
1061 2259 D
1057 2257 D
1054 2254 D
1052 2249 D
1052 2246 D
1054 2242 D
1057 2239 D
1061 2237 D
1064 2237 D
1067 2239 D
1070 2242 D
S
N
1061 2259 M
1058 2257 D
1055 2254 D
1054 2249 D
1054 2246 D
1055 2242 D
1058 2239 D
1061 2237 D
S
N
1066 2269 M
1072 2269 D
S
N
1070 2237 M
1076 2237 D
S
N
1087 2269 M
1087 2237 D
S
N
1089 2269 M
1089 2237 D
S
N
1083 2269 M
1089 2269 D
S
N
1083 2237 M
1093 2237 D
S
N
1110 2259 M
1105 2257 D
1102 2254 D
1101 2249 D
1101 2246 D
1102 2242 D
1105 2239 D
1110 2237 D
1113 2237 D
1117 2239 D
1120 2242 D
1122 2246 D
1122 2249 D
1120 2254 D
1117 2257 D
1113 2259 D
1110 2259 D
S
N
1110 2259 M
1107 2257 D
1104 2254 D
1102 2249 D
1102 2246 D
1104 2242 D
1107 2239 D
1110 2237 D
S
N
1113 2237 M
1116 2239 D
1119 2242 D
1120 2246 D
1120 2249 D
1119 2254 D
1116 2257 D
1113 2259 D
S
N
1138 2259 M
1135 2257 D
1134 2256 D
1132 2252 D
1132 2249 D
1134 2246 D
1135 2245 D
1138 2243 D
1141 2243 D
1144 2245 D
1146 2246 D
1147 2249 D
1147 2252 D
1146 2256 D
1144 2257 D
1141 2259 D
1138 2259 D
S
N
1135 2257 M
1134 2254 D
1134 2248 D
1135 2245 D
S
N
1144 2245 M
1146 2248 D
1146 2254 D
1144 2257 D
S
N
1146 2256 M
1147 2257 D
1150 2259 D
1150 2257 D
1147 2257 D
S
N
1134 2246 M
1132 2245 D
1131 2242 D
1131 2240 D
1132 2237 D
1137 2236 D
1144 2236 D
1149 2234 D
1150 2233 D
S
N
1131 2240 M
1132 2239 D
1137 2237 D
1144 2237 D
1149 2236 D
1150 2233 D
1150 2231 D
1149 2228 D
1144 2227 D
1135 2227 D
1131 2228 D
1129 2231 D
1129 2233 D
1131 2236 D
1135 2237 D
S
N
1161 2275 M
1161 2227 D
S
N
1163 2275 M
1163 2227 D
S
N
1161 2275 M
1172 2275 D
S
N
1161 2227 M
1172 2227 D
S
N
1184 2259 M
1184 2227 D
S
N
1185 2259 M
1185 2227 D
S
N
1185 2254 M
1188 2257 D
1191 2259 D
1194 2259 D
1199 2257 D
1202 2254 D
1203 2249 D
1203 2246 D
1202 2242 D
1199 2239 D
1194 2237 D
1191 2237 D
1188 2239 D
1185 2242 D
S
N
1194 2259 M
1197 2257 D
1200 2254 D
1202 2249 D
1202 2246 D
1200 2242 D
1197 2239 D
1194 2237 D
S
N
1179 2259 M
1185 2259 D
S
N
1179 2227 M
1190 2227 D
S
N
1219 2246 M
1219 2225 D
S
N
1220 2246 M
1220 2225 D
S
N
1213 2246 M
1212 2240 D
1212 2246 D
1227 2246 D
1227 2240 D
1226 2246 D
S
N
1216 2225 M
1223 2225 D
S
N
1261 2275 M
1234 2227 D
S
N
1290 2265 M
1291 2260 D
1291 2269 D
1290 2265 D
1287 2268 D
1282 2269 D
1279 2269 D
1275 2268 D
1272 2265 D
1270 2262 D
1269 2257 D
1269 2249 D
1270 2245 D
1272 2242 D
1275 2239 D
1279 2237 D
1282 2237 D
1287 2239 D
1290 2242 D
S
N
1279 2269 M
1276 2268 D
1273 2265 D
1272 2262 D
1270 2257 D
1270 2249 D
1272 2245 D
1273 2242 D
1276 2239 D
1279 2237 D
S
N
1290 2249 M
1290 2237 D
S
N
1291 2249 M
1291 2237 D
S
N
1285 2249 M
1296 2249 D
S
N
1305 2249 M
1323 2249 D
1323 2252 D
1322 2256 D
1320 2257 D
1317 2259 D
1312 2259 D
1308 2257 D
1305 2254 D
1303 2249 D
1303 2246 D
1305 2242 D
1308 2239 D
1312 2237 D
1315 2237 D
1320 2239 D
1323 2242 D
S
N
1322 2249 M
1322 2254 D
1320 2257 D
S
N
1312 2259 M
1309 2257 D
1306 2254 D
1305 2249 D
1305 2246 D
1306 2242 D
1309 2239 D
1312 2237 D
S
N
1332 2269 M
1343 2237 D
S
N
1334 2269 M
1343 2242 D
S
N
1353 2269 M
1343 2237 D
S
N
1329 2269 M
1338 2269 D
S
N
1347 2269 M
1356 2269 D
S
N
1371 2275 M
1371 2227 D
S
N
1373 2275 M
1373 2227 D
S
N
1362 2275 M
1373 2275 D
S
N
1362 2227 M
1373 2227 D
S
N
1409 2275 M
1409 2227 D
S
N
1411 2275 M
1411 2227 D
S
N
1409 2275 M
1420 2275 D
S
N
1409 2227 M
1420 2227 D
S
N
1432 2259 M
1432 2227 D
S
N
1433 2259 M
1433 2227 D
S
N
1433 2254 M
1436 2257 D
1439 2259 D
1442 2259 D
1447 2257 D
1450 2254 D
1451 2249 D
1451 2246 D
1450 2242 D
1447 2239 D
1442 2237 D
1439 2237 D
1436 2239 D
1433 2242 D
S
N
1442 2259 M
1445 2257 D
1448 2254 D
1450 2249 D
1450 2246 D
1448 2242 D
1445 2239 D
1442 2237 D
S
N
1427 2259 M
1433 2259 D
S
N
1427 2227 M
1438 2227 D
S
N
1463 2269 M
1463 2237 D
S
N
1465 2269 M
1465 2237 D
S
N
1465 2254 M
1468 2257 D
1471 2259 D
1474 2259 D
1478 2257 D
1482 2254 D
1483 2249 D
1483 2246 D
1482 2242 D
1478 2239 D
1474 2237 D
1471 2237 D
1468 2239 D
1465 2242 D
S
N
1474 2259 M
1477 2257 D
1480 2254 D
1482 2249 D
1482 2246 D
1480 2242 D
1477 2239 D
1474 2237 D
S
N
1459 2269 M
1465 2269 D
S
N
1501 2275 M
1501 2227 D
S
N
1503 2275 M
1503 2227 D
S
N
1492 2275 M
1503 2275 D
S
N
1492 2227 M
1503 2227 D
S
N
1565 2256 M
1565 2254 D
1563 2254 D
1563 2256 D
1565 2257 D
1568 2259 D
1574 2259 D
1577 2257 D
1578 2256 D
1580 2252 D
1580 2242 D
1581 2239 D
1583 2237 D
S
N
1578 2256 M
1578 2242 D
1580 2239 D
1583 2237 D
1584 2237 D
S
N
1578 2252 M
1577 2251 D
1568 2249 D
1563 2248 D
1562 2245 D
1562 2242 D
1563 2239 D
1568 2237 D
1572 2237 D
1575 2239 D
1578 2242 D
S
N
1568 2249 M
1565 2248 D
1563 2245 D
1563 2242 D
1565 2239 D
1568 2237 D
S
N
1595 2269 M
1595 2243 D
1596 2239 D
1599 2237 D
1602 2237 D
1605 2239 D
1607 2242 D
S
N
1596 2269 M
1596 2243 D
1598 2239 D
1599 2237 D
S
N
1590 2259 M
1602 2259 D
S
N
1641 2269 M
1641 2237 D
S
N
1643 2269 M
1643 2237 D
S
N
1637 2269 M
1648 2269 D
S
N
1637 2237 M
1660 2237 D
1660 2246 D
1658 2237 D
S
N
1669 2269 M
1669 2237 D
S
N
1670 2269 M
1670 2237 D
S
N
1688 2269 M
1688 2237 D
S
N
1690 2269 M
1690 2237 D
S
N
1664 2269 M
1675 2269 D
S
N
1684 2269 M
1694 2269 D
S
N
1670 2254 M
1688 2254 D
S
N
1664 2237 M
1675 2237 D
S
N
1684 2237 M
1694 2237 D
S
N
1723 2265 M
1725 2260 D
1725 2269 D
1723 2265 D
1720 2268 D
1715 2269 D
1712 2269 D
1708 2268 D
1705 2265 D
1703 2262 D
1702 2257 D
1702 2249 D
1703 2245 D
1705 2242 D
1708 2239 D
1712 2237 D
1715 2237 D
1720 2239 D
1723 2242 D
1725 2245 D
S
N
1712 2269 M
1709 2268 D
1706 2265 D
1705 2262 D
1703 2257 D
1703 2249 D
1705 2245 D
1706 2242 D
1709 2239 D
1712 2237 D
S
N
1758 2269 M
1758 2260 D
S
N
1758 2263 M
1759 2266 D
1762 2269 D
1765 2269 D
1773 2265 D
1776 2265 D
1777 2266 D
1779 2269 D
S
N
1759 2266 M
1762 2268 D
1765 2268 D
1773 2265 D
S
N
1779 2269 M
1779 2265 D
1777 2260 D
1771 2252 D
1770 2249 D
1768 2245 D
1768 2237 D
S
N
1777 2260 M
1770 2252 D
1768 2249 D
1767 2245 D
1767 2237 D
S
N
1821 2269 M
1821 2237 D
S
N
1823 2269 M
1823 2237 D
S
N
1812 2269 M
1811 2260 D
1811 2269 D
1833 2269 D
1833 2260 D
1832 2269 D
S
N
1817 2237 M
1827 2237 D
S
N
1842 2249 M
1860 2249 D
1860 2252 D
1859 2255 D
1857 2257 D
1854 2259 D
1850 2259 D
1845 2257 D
1842 2254 D
1841 2249 D
1841 2246 D
1842 2242 D
1845 2239 D
1850 2237 D
1853 2237 D
1857 2239 D
1860 2242 D
S
N
1859 2249 M
1859 2254 D
1857 2257 D
S
N
1850 2259 M
1847 2257 D
1844 2254 D
1842 2249 D
1842 2246 D
1844 2242 D
1847 2239 D
1850 2237 D
S
N
1869 2269 M
1880 2237 D
S
N
1871 2269 M
1880 2242 D
S
N
1891 2269 M
1880 2237 D
S
N
1866 2269 M
1875 2269 D
S
N
1885 2269 M
1894 2269 D
S
3 Sw
N
1455 2186 M
1455 2185 D
1453 2185 D
1453 2186 D
1455 2188 D
1458 2189 D
1464 2189 D
1467 2188 D
1468 2186 D
1470 2183 D
1470 2173 D
1471 2170 D
1473 2168 D
S
N
1468 2186 M
1468 2173 D
1470 2170 D
1473 2168 D
1474 2168 D
S
N
1468 2183 M
1467 2182 D
1458 2180 D
1453 2179 D
1452 2176 D
1452 2173 D
1453 2170 D
1458 2168 D
1462 2168 D
1465 2170 D
1468 2173 D
S
N
1458 2180 M
1455 2179 D
1453 2176 D
1453 2173 D
1455 2170 D
1458 2168 D
S
N
1485 2200 M
1485 2168 D
S
N
1486 2200 M
1495 2173 D
S
N
1485 2200 M
1495 2168 D
S
N
1506 2200 M
1495 2168 D
S
N
1506 2200 M
1506 2168 D
S
N
1508 2200 M
1508 2168 D
S
N
1480 2200 M
1486 2200 D
S
N
1506 2200 M
1512 2200 D
S
N
1480 2168 M
1489 2168 D
S
N
1502 2168 M
1512 2168 D
S
N
1541 2195 M
1542 2191 D
1542 2200 D
1541 2195 D
1538 2198 D
1533 2200 D
1530 2200 D
1526 2198 D
1523 2195 D
1521 2192 D
1520 2188 D
1520 2180 D
1521 2176 D
1523 2173 D
1526 2170 D
1530 2168 D
1533 2168 D
1538 2170 D
1541 2173 D
1542 2176 D
S
N
1530 2200 M
1527 2198 D
1524 2195 D
1523 2192 D
1521 2188 D
1521 2180 D
1523 2176 D
1524 2173 D
1527 2170 D
1530 2168 D
S
N
1574 2188 M
1572 2191 D
1569 2192 D
1565 2192 D
1562 2191 D
1560 2189 D
1559 2185 D
1559 2180 D
1560 2177 D
1563 2176 D
1568 2176 D
1571 2177 D
1572 2180 D
S
N
1565 2192 M
1562 2189 D
1560 2185 D
1560 2180 D
1562 2177 D
1563 2176 D
S
N
1574 2192 M
1572 2180 D
1572 2177 D
1575 2176 D
1579 2176 D
1582 2179 D
1583 2183 D
1583 2186 D
1582 2191 D
1580 2194 D
1577 2197 D
1574 2198 D
1569 2200 D
1565 2200 D
1560 2198 D
1557 2197 D
1554 2194 D
1553 2191 D
1551 2186 D
1551 2182 D
1553 2177 D
1554 2174 D
1557 2171 D
1560 2170 D
1565 2168 D
1569 2168 D
1574 2170 D
1577 2171 D
1579 2173 D
S
N
1575 2192 M
1574 2180 D
1574 2177 D
1575 2176 D
S
N
1595 2200 M
1595 2168 D
S
N
1597 2200 M
1615 2171 D
S
N
1597 2197 M
1615 2168 D
S
N
1615 2200 M
1615 2168 D
S
N
1591 2200 M
1597 2200 D
S
N
1610 2200 M
1619 2200 D
S
N
1591 2168 M
1600 2168 D
S
N
1630 2200 M
1630 2168 D
S
N
1631 2200 M
1631 2168 D
S
N
1625 2200 M
1636 2200 D
S
N
1625 2168 M
1648 2168 D
1648 2177 D
1646 2168 D
S
N
1665 2200 M
1660 2198 D
1657 2195 D
1655 2192 D
1654 2186 D
1654 2182 D
1655 2176 D
1657 2173 D
1660 2170 D
1665 2168 D
1668 2168 D
1672 2170 D
1675 2173 D
1677 2176 D
1678 2182 D
1678 2186 D
1677 2192 D
1675 2195 D
1672 2198 D
1668 2200 D
1665 2200 D
S
N
1665 2200 M
1662 2198 D
1659 2195 D
1657 2192 D
1655 2186 D
1655 2182 D
1657 2176 D
1659 2173 D
1662 2170 D
1665 2168 D
S
N
1668 2168 M
1671 2170 D
1674 2173 D
1675 2176 D
1677 2182 D
1677 2186 D
1675 2192 D
1674 2195 D
1671 2198 D
1668 2200 D
S
N
1702 2195 M
1702 2168 D
S
N
1689 2182 M
1716 2182 D
S
N
1729 2200 M
1729 2168 D
S
N
1731 2200 M
1731 2168 D
S
N
1731 2185 M
1734 2188 D
1738 2189 D
1742 2189 D
1746 2188 D
1748 2185 D
1748 2168 D
S
N
1742 2189 M
1745 2188 D
1746 2185 D
1746 2168 D
S
N
1725 2200 M
1731 2200 D
S
N
1725 2168 M
1735 2168 D
S
N
1742 2168 M
1752 2168 D
S
N
1761 2180 M
1779 2180 D
1779 2183 D
1778 2186 D
1776 2188 D
1773 2189 D
1769 2189 D
1764 2188 D
1761 2185 D
1760 2180 D
1760 2177 D
1761 2173 D
1764 2170 D
1769 2168 D
1772 2168 D
1776 2170 D
1779 2173 D
S
N
1778 2180 M
1778 2185 D
1776 2188 D
S
N
1769 2189 M
1766 2188 D
1763 2185 D
1761 2180 D
1761 2177 D
1763 2173 D
1766 2170 D
1769 2168 D
S
N
1791 2189 M
1791 2168 D
S
N
1793 2189 M
1793 2168 D
S
N
1793 2180 M
1794 2185 D
1797 2188 D
1800 2189 D
1805 2189 D
1806 2188 D
1806 2186 D
1805 2185 D
1803 2186 D
1805 2188 D
S
N
1787 2189 M
1793 2189 D
S
N
1787 2168 M
1797 2168 D
S
N
1815 2189 M
1822 2168 D
S
N
1817 2189 M
1822 2173 D
S
N
1828 2189 M
1822 2168 D
S
N
1828 2189 M
1834 2168 D
S
N
1829 2189 M
1834 2173 D
S
N
1840 2189 M
1834 2168 D
S
N
1811 2189 M
1822 2189 D
S
N
1835 2189 M
1844 2189 D
S
N
1853 2200 M
1852 2198 D
1853 2197 D
1855 2198 D
1853 2200 D
S
N
1853 2189 M
1853 2168 D
S
N
1855 2189 M
1855 2168 D
S
N
1849 2189 M
1855 2189 D
S
N
1849 2168 M
1859 2168 D
S
N
1874 2189 M
1871 2188 D
1870 2186 D
1868 2183 D
1868 2180 D
1870 2177 D
1871 2176 D
1874 2174 D
1877 2174 D
1880 2176 D
1882 2177 D
1883 2180 D
1883 2183 D
1882 2186 D
1880 2188 D
1877 2189 D
1874 2189 D
S
N
1871 2188 M
1870 2185 D
1870 2179 D
1871 2176 D
S
N
1880 2176 M
1882 2179 D
1882 2185 D
1880 2188 D
S
N
1882 2186 M
1883 2188 D
1886 2189 D
1886 2188 D
1883 2188 D
S
N
1870 2177 M
1868 2176 D
1867 2173 D
1867 2171 D
1868 2168 D
1873 2167 D
1880 2167 D
1885 2165 D
1886 2164 D
S
N
1867 2171 M
1868 2170 D
1873 2168 D
1880 2168 D
1885 2167 D
1886 2164 D
1886 2162 D
1885 2159 D
1880 2158 D
1871 2158 D
1867 2159 D
1865 2162 D
1865 2164 D
1867 2167 D
1871 2168 D
S
N
1455 2131 M
1455 2099 D
S
N
1456 2131 M
1456 2099 D
S
N
1450 2131 M
1468 2131 D
1473 2129 D
1474 2128 D
1476 2125 D
1476 2120 D
1474 2117 D
1473 2116 D
1468 2114 D
1456 2114 D
S
N
1468 2131 M
1471 2129 D
1473 2128 D
1474 2125 D
1474 2120 D
1473 2117 D
1471 2116 D
1468 2114 D
S
N
1450 2099 M
1461 2099 D
S
N
1495 2131 M
1491 2129 D
1488 2126 D
1486 2123 D
1485 2117 D
1485 2113 D
1486 2107 D
1488 2104 D
1491 2100 D
1495 2099 D
1499 2099 D
1503 2100 D
1506 2104 D
1508 2107 D
1509 2113 D
1509 2117 D
1508 2123 D
1506 2126 D
1503 2129 D
1499 2131 D
1495 2131 D
S
N
1495 2131 M
1492 2129 D
1489 2126 D
1488 2123 D
1486 2117 D
1486 2113 D
1488 2107 D
1489 2104 D
1492 2100 D
1495 2099 D
S
N
1499 2099 M
1502 2100 D
1505 2104 D
1506 2107 D
1508 2113 D
1508 2117 D
1506 2123 D
1505 2126 D
1502 2129 D
1499 2131 D
S
N
1520 2131 M
1526 2099 D
S
N
1521 2131 M
1526 2107 D
S
N
1532 2131 M
1526 2099 D
S
N
1532 2131 M
1538 2099 D
S
N
1533 2131 M
1538 2107 D
S
N
1544 2131 M
1538 2099 D
S
N
1515 2131 M
1526 2131 D
S
N
1539 2131 M
1548 2131 D
S
N
1557 2131 M
1557 2099 D
S
N
1559 2131 M
1559 2099 D
S
N
1577 2131 M
1577 2099 D
S
N
1579 2131 M
1579 2099 D
S
N
1553 2131 M
1563 2131 D
S
N
1572 2131 M
1583 2131 D
S
N
1559 2116 M
1577 2116 D
S
N
1553 2099 M
1563 2099 D
S
N
1572 2099 M
1583 2099 D
S
N
1594 2131 M
1594 2099 D
S
N
1595 2131 M
1595 2099 D
S
N
1604 2122 M
1604 2110 D
S
N
1589 2131 M
1613 2131 D
1613 2122 D
1612 2131 D
S
N
1595 2116 M
1604 2116 D
S
N
1589 2099 M
1613 2099 D
1613 2108 D
1612 2099 D
S
N
1625 2131 M
1625 2099 D
S
N
1627 2131 M
1627 2099 D
S
N
1621 2131 M
1631 2131 D
S
N
1621 2099 M
1643 2099 D
1643 2108 D
1642 2099 D
S
N
1665 2126 M
1665 2099 D
S
N
1651 2113 M
1678 2113 D
S
N
1692 2131 M
1692 2099 D
S
N
1693 2131 M
1693 2099 D
S
N
1693 2116 M
1696 2119 D
1701 2120 D
1704 2120 D
1708 2119 D
1710 2116 D
1710 2099 D
S
N
1704 2120 M
1707 2119 D
1708 2116 D
1708 2099 D
S
N
1687 2131 M
1693 2131 D
S
N
1687 2099 M
1698 2099 D
S
N
1704 2099 M
1714 2099 D
S
N
1723 2111 M
1742 2111 D
1742 2114 D
1740 2117 D
1738 2119 D
1735 2120 D
1731 2120 D
1726 2119 D
1723 2116 D
1722 2111 D
1722 2108 D
1723 2104 D
1726 2100 D
1731 2099 D
1734 2099 D
1738 2100 D
1742 2104 D
S
N
1740 2111 M
1740 2116 D
1738 2119 D
S
N
1731 2120 M
1728 2119 D
1725 2116 D
1723 2111 D
1723 2108 D
1725 2104 D
1728 2100 D
1731 2099 D
S
N
1754 2120 M
1754 2099 D
S
N
1755 2120 M
1755 2099 D
S
N
1755 2111 M
1757 2116 D
1760 2119 D
1763 2120 D
1767 2120 D
1769 2119 D
1769 2117 D
1767 2116 D
1766 2117 D
1767 2119 D
S
N
1749 2120 M
1755 2120 D
S
N
1749 2099 M
1760 2099 D
S
N
1778 2120 M
1784 2099 D
S
N
1779 2120 M
1784 2104 D
S
N
1790 2120 M
1784 2099 D
S
N
1790 2120 M
1796 2099 D
S
N
1791 2120 M
1796 2104 D
S
N
1802 2120 M
1796 2099 D
S
N
1773 2120 M
1784 2120 D
S
N
1797 2120 M
1806 2120 D
S
N
1815 2131 M
1814 2129 D
1815 2128 D
1817 2129 D
1815 2131 D
S
N
1815 2120 M
1815 2099 D
S
N
1817 2120 M
1817 2099 D
S
N
1811 2120 M
1817 2120 D
S
N
1811 2099 M
1822 2099 D
S
N
1837 2120 M
1834 2119 D
1832 2117 D
1831 2114 D
1831 2111 D
1832 2108 D
1834 2107 D
1837 2105 D
1840 2105 D
1843 2107 D
1844 2108 D
1846 2111 D
1846 2114 D
1844 2117 D
1843 2119 D
1840 2120 D
1837 2120 D
S
N
1834 2119 M
1832 2116 D
1832 2110 D
1834 2107 D
S
N
1843 2107 M
1844 2110 D
1844 2116 D
1843 2119 D
S
N
1844 2117 M
1846 2119 D
1849 2120 D
1849 2119 D
1846 2119 D
S
N
1832 2108 M
1831 2107 D
1829 2104 D
1829 2102 D
1831 2099 D
1835 2097 D
1843 2097 D
1847 2096 D
1849 2094 D
S
N
1829 2102 M
1831 2100 D
1835 2099 D
1843 2099 D
1847 2097 D
1849 2094 D
1849 2093 D
1847 2090 D
1843 2088 D
1834 2088 D
1829 2090 D
1828 2093 D
1828 2094 D
1829 2097 D
1834 2099 D
S
1 Sw
N
1986 2034 M
2003 2034 D
S
N
1986 2034 M
2003 2034 D
S
N
1986 2031 M
1986 2037 D
S
N
2003 2031 M
2003 2043 D
1998 2043 D
2003 2042 D
S
N
1986 2048 M
2003 2048 D
S
N
1986 2049 M
2003 2049 D
S
N
1986 2058 M
2003 2058 D
S
N
1986 2059 M
2003 2059 D
S
N
1986 2046 M
1986 2051 D
S
N
1986 2056 M
1986 2062 D
S
N
1994 2049 M
1994 2058 D
S
N
2003 2046 M
2003 2051 D
S
N
2003 2056 M
2003 2062 D
S
N
1988 2077 M
1991 2078 D
1986 2078 D
1988 2077 D
1987 2075 D
1986 2073 D
1986 2071 D
1987 2069 D
1988 2067 D
1990 2066 D
1992 2066 D
1996 2066 D
1999 2066 D
2000 2067 D
2002 2069 D
2003 2071 D
2003 2073 D
2002 2075 D
2000 2077 D
1999 2078 D
S
N
1986 2071 M
1987 2070 D
1988 2068 D
1990 2067 D
1992 2066 D
1996 2066 D
1999 2067 D
2000 2068 D
2002 2070 D
2003 2071 D
S
N
1986 2097 M
2003 2097 D
S
N
1986 2097 M
2003 2097 D
S
N
1986 2107 M
2003 2107 D
S
N
1986 2108 M
2003 2108 D
S
N
1986 2094 M
1986 2100 D
S
N
1986 2105 M
1986 2110 D
S
N
1994 2097 M
1994 2107 D
S
N
2003 2094 M
2003 2100 D
S
N
2003 2105 M
2003 2110 D
S
N
1986 2116 M
2003 2116 D
S
N
1986 2117 M
2003 2117 D
S
N
1986 2113 M
1986 2119 D
S
N
2003 2113 M
2003 2119 D
S
N
1988 2134 M
1991 2135 D
1986 2135 D
1988 2134 D
1987 2132 D
1986 2130 D
1986 2129 D
1987 2126 D
1988 2125 D
1990 2124 D
1992 2123 D
1996 2123 D
1999 2124 D
2000 2125 D
2002 2126 D
2003 2129 D
2003 2130 D
2002 2132 D
2000 2134 D
S
N
1986 2129 M
1987 2127 D
1988 2125 D
1990 2125 D
1992 2124 D
1996 2124 D
1999 2125 D
2000 2125 D
2002 2127 D
2003 2129 D
S
N
1996 2134 M
2003 2134 D
S
N
1996 2135 M
2003 2135 D
S
N
1996 2132 M
1996 2137 D
S
N
1988 2152 M
1991 2153 D
1986 2153 D
1988 2152 D
1987 2151 D
1986 2148 D
1986 2147 D
1987 2144 D
1988 2143 D
1990 2142 D
1992 2141 D
1996 2141 D
1999 2142 D
2000 2143 D
2002 2144 D
2003 2147 D
2003 2148 D
2002 2151 D
2000 2152 D
S
N
1986 2147 M
1987 2145 D
1988 2144 D
1990 2143 D
1992 2142 D
1996 2142 D
1999 2143 D
2000 2144 D
2002 2145 D
2003 2147 D
S
N
1996 2152 M
2003 2152 D
S
N
1996 2153 M
2003 2153 D
S
N
1996 2150 M
1996 2156 D
S
N
1988 2170 M
1986 2171 D
1991 2171 D
1988 2170 D
1987 2168 D
1986 2166 D
1986 2164 D
1987 2161 D
1988 2160 D
1990 2160 D
1991 2160 D
1992 2161 D
1993 2163 D
1995 2168 D
1995 2169 D
1997 2171 D
S
N
1990 2160 M
1991 2161 D
1992 2163 D
1994 2168 D
1995 2169 D
1995 2170 D
1997 2171 D
2000 2171 D
2002 2169 D
2003 2167 D
2003 2164 D
2002 2162 D
2000 2160 D
1998 2160 D
2003 2160 D
2000 2160 D
S
N
1986 2188 M
2003 2199 D
S
N
1986 2189 M
2003 2199 D
S
N
1986 2199 M
2003 2188 D
S
N
1986 2187 M
1986 2191 D
S
N
1986 2196 M
1986 2201 D
S
N
2003 2187 M
2003 2191 D
S
N
2003 2196 M
2003 2201 D
S
N
1988 2215 M
1986 2215 D
1991 2215 D
1988 2215 D
1987 2213 D
1986 2211 D
1986 2208 D
1987 2206 D
1988 2204 D
1990 2204 D
1991 2205 D
1992 2206 D
1993 2207 D
1995 2212 D
1995 2214 D
1997 2215 D
S
N
1990 2204 M
1991 2206 D
1992 2207 D
1994 2212 D
1995 2214 D
1995 2215 D
1997 2215 D
2000 2215 D
2002 2214 D
2003 2211 D
2003 2209 D
2002 2207 D
2000 2205 D
1998 2204 D
2003 2204 D
2000 2205 D
S
N
1986 2234 M
2003 2237 D
S
N
1986 2234 M
1999 2237 D
S
N
1986 2240 M
2003 2237 D
S
N
1986 2240 M
2003 2243 D
S
N
1986 2241 M
1999 2243 D
S
N
1986 2246 M
2003 2243 D
S
N
1986 2231 M
1986 2237 D
S
N
1986 2244 M
1986 2249 D
S
N
1988 2263 M
1991 2264 D
1986 2264 D
1988 2263 D
1987 2262 D
1986 2259 D
1986 2258 D
1987 2255 D
1988 2254 D
1990 2253 D
1992 2252 D
1996 2252 D
1999 2253 D
2000 2254 D
2002 2255 D
2003 2258 D
2003 2259 D
2002 2262 D
2000 2263 D
S
N
1986 2258 M
1987 2256 D
1988 2254 D
1990 2254 D
1992 2253 D
1996 2253 D
1999 2254 D
2000 2254 D
2002 2256 D
2003 2258 D
S
N
1996 2263 M
2003 2263 D
S
N
1996 2264 M
2003 2264 D
S
N
1996 2261 M
1996 2266 D
S
N
1989 2284 M
1990 2285 D
1991 2284 D
1990 2283 D
1989 2283 D
1987 2284 D
1987 2285 D
1986 2287 D
1986 2290 D
1987 2293 D
1987 2293 D
1989 2294 D
1991 2294 D
1992 2293 D
1994 2291 D
1995 2287 D
1996 2285 D
1998 2284 D
2000 2283 D
2003 2283 D
S
N
1986 2290 M
1987 2292 D
1987 2293 D
1989 2293 D
1991 2293 D
1992 2293 D
1994 2290 D
1995 2287 D
S
N
2001 2283 M
2000 2284 D
2000 2285 D
2002 2289 D
2002 2292 D
2001 2293 D
2000 2294 D
S
N
2000 2285 M
2003 2289 D
2003 2293 D
2002 2293 D
2000 2294 D
1999 2294 D
S
N
1986 2304 M
1987 2301 D
1989 2300 D
1993 2299 D
1995 2299 D
1999 2300 D
2002 2301 D
2003 2304 D
2003 2305 D
2002 2308 D
1999 2309 D
1995 2310 D
1993 2310 D
1989 2309 D
1987 2308 D
1986 2305 D
1986 2304 D
S
N
1986 2304 M
1987 2302 D
1987 2301 D
1989 2301 D
1993 2300 D
1995 2300 D
1999 2301 D
2001 2301 D
2002 2302 D
2003 2304 D
S
N
2003 2305 M
2002 2307 D
2001 2308 D
1999 2309 D
1995 2309 D
1993 2309 D
1989 2309 D
1987 2308 D
1987 2307 D
1986 2305 D
S
N
1989 2317 M
1988 2319 D
1986 2321 D
2003 2321 D
S
N
1987 2321 M
2003 2321 D
S
N
2003 2317 M
2003 2325 D
S
N
1989 2333 M
1988 2335 D
1986 2337 D
2003 2337 D
S
N
1987 2336 M
2003 2336 D
S
N
2003 2333 M
2003 2340 D
S
4 Sw
N
583 2342 M
583 1520 D
S
N
583 1520 M
1967 1520 D
S
N
1967 1520 M
1967 2342 D
S
N
1967 2342 M
583 2342 D
S
N
583 1520 M
583 1531 D
S
N
634 1531 M
634 1520 D
S
N
686 1520 M
686 1531 D
S
N
737 1551 M
737 1520 D
S
N
788 1520 M
788 1531 D
S
N
839 1531 M
839 1520 D
S
N
891 1520 M
891 1531 D
S
N
942 1531 M
942 1520 D
S
N
993 1520 M
993 1551 D
S
N
1044 1531 M
1044 1520 D
S
N
1096 1520 M
1096 1531 D
S
N
1147 1531 M
1147 1520 D
S
N
1198 1520 M
1198 1531 D
S
N
1249 1551 M
1249 1520 D
S
N
1301 1520 M
1301 1531 D
S
N
1352 1531 M
1352 1520 D
S
N
1403 1520 M
1403 1531 D
S
N
1454 1531 M
1454 1520 D
S
N
1506 1520 M
1506 1551 D
S
N
1557 1531 M
1557 1520 D
S
N
1608 1520 M
1608 1531 D
S
N
1659 1531 M
1659 1520 D
S
N
1711 1520 M
1711 1531 D
S
N
1762 1551 M
1762 1520 D
S
N
1813 1520 M
1813 1531 D
S
N
1864 1531 M
1864 1520 D
S
N
1916 1520 M
1916 1531 D
S
N
1967 1531 M
1967 1520 D
S
N
583 2342 M
1967 2342 D
S
N
583 2332 M
583 2342 D
S
N
634 2342 M
634 2332 D
S
N
686 2332 M
686 2342 D
S
N
737 2342 M
737 2311 D
S
N
788 2332 M
788 2342 D
S
N
839 2342 M
839 2332 D
S
N
891 2332 M
891 2342 D
S
N
942 2342 M
942 2332 D
S
N
993 2311 M
993 2342 D
S
N
1044 2342 M
1044 2332 D
S
N
1096 2332 M
1096 2342 D
S
N
1147 2342 M
1147 2332 D
S
N
1198 2332 M
1198 2342 D
S
N
1249 2342 M
1249 2311 D
S
N
1301 2332 M
1301 2342 D
S
N
1352 2342 M
1352 2332 D
S
N
1403 2332 M
1403 2342 D
S
N
1454 2342 M
1454 2332 D
S
N
1506 2311 M
1506 2342 D
S
N
1557 2342 M
1557 2332 D
S
N
1608 2332 M
1608 2342 D
S
N
1659 2342 M
1659 2332 D
S
N
1711 2332 M
1711 2342 D
S
N
1762 2342 M
1762 2311 D
S
N
1813 2332 M
1813 2342 D
S
N
1864 2342 M
1864 2332 D
S
N
1916 2332 M
1916 2342 D
S
N
1967 2342 M
1967 2332 D
S
N
583 1520 M
583 2342 D
S
N
593 1550 M
583 1550 D
S
N
583 1573 M
614 1573 D
S
N
593 1591 M
583 1591 D
S
N
583 1607 M
593 1607 D
S
N
593 1621 M
583 1621 D
S
N
583 1633 M
593 1633 D
S
N
614 1644 M
583 1644 D
S
N
583 1715 M
593 1715 D
S
N
593 1757 M
583 1757 D
S
N
583 1786 M
593 1786 D
S
N
614 1809 M
583 1809 D
S
N
583 1828 M
593 1828 D
S
N
593 1844 M
583 1844 D
S
N
583 1857 M
593 1857 D
S
N
593 1869 M
583 1869 D
S
N
583 1880 M
614 1880 D
S
N
593 1951 M
583 1951 D
S
N
583 1993 M
593 1993 D
S
N
593 2022 M
583 2022 D
S
N
583 2045 M
614 2045 D
S
N
593 2064 M
583 2064 D
S
N
583 2080 M
593 2080 D
S
N
593 2094 M
583 2094 D
S
N
583 2106 M
593 2106 D
S
N
614 2116 M
583 2116 D
S
N
583 2188 M
593 2188 D
S
N
593 2229 M
583 2229 D
S
N
583 2259 M
593 2259 D
S
N
614 2282 M
583 2282 D
S
N
583 2300 M
593 2300 D
S
N
593 2316 M
583 2316 D
S
N
583 2330 M
593 2330 D
S
N
593 2342 M
583 2342 D
S
N
412 1586 M
407 1585 D
404 1580 D
403 1573 D
403 1568 D
404 1561 D
407 1556 D
412 1555 D
415 1555 D
420 1556 D
423 1561 D
424 1568 D
424 1573 D
423 1580 D
420 1585 D
415 1586 D
412 1586 D
S
N
412 1586 M
409 1585 D
407 1583 D
406 1580 D
404 1573 D
404 1568 D
406 1561 D
407 1558 D
409 1556 D
412 1555 D
S
N
415 1555 M
418 1556 D
420 1558 D
421 1561 D
423 1568 D
423 1573 D
421 1580 D
420 1583 D
418 1585 D
415 1586 D
S
N
436 1558 M
435 1556 D
436 1555 D
438 1556 D
436 1558 D
S
N
457 1586 M
453 1585 D
450 1580 D
448 1573 D
448 1568 D
450 1561 D
453 1556 D
457 1555 D
460 1555 D
465 1556 D
468 1561 D
469 1568 D
469 1573 D
468 1580 D
465 1585 D
460 1586 D
457 1586 D
S
N
457 1586 M
454 1585 D
453 1583 D
451 1580 D
450 1573 D
450 1568 D
451 1561 D
453 1558 D
454 1556 D
457 1555 D
S
N
460 1555 M
463 1556 D
465 1558 D
466 1561 D
468 1568 D
468 1573 D
466 1580 D
465 1583 D
463 1585 D
460 1586 D
S
N
487 1586 M
483 1585 D
480 1580 D
478 1573 D
478 1568 D
480 1561 D
483 1556 D
487 1555 D
490 1555 D
495 1556 D
498 1561 D
500 1568 D
500 1573 D
498 1580 D
495 1585 D
490 1586 D
487 1586 D
S
N
487 1586 M
484 1585 D
483 1583 D
481 1580 D
480 1573 D
480 1568 D
481 1561 D
483 1558 D
484 1556 D
487 1555 D
S
N
490 1555 M
493 1556 D
495 1558 D
496 1561 D
498 1568 D
498 1573 D
496 1580 D
495 1583 D
493 1585 D
490 1586 D
S
N
518 1586 M
513 1585 D
510 1580 D
509 1573 D
509 1568 D
510 1561 D
513 1556 D
518 1555 D
521 1555 D
525 1556 D
528 1561 D
530 1568 D
530 1573 D
528 1580 D
525 1585 D
521 1586 D
518 1586 D
S
N
518 1586 M
515 1585 D
513 1583 D
512 1580 D
510 1573 D
510 1568 D
512 1561 D
513 1558 D
515 1556 D
518 1555 D
S
N
521 1555 M
524 1556 D
525 1558 D
527 1561 D
528 1568 D
528 1573 D
527 1580 D
525 1583 D
524 1585 D
521 1586 D
S
N
542 1586 M
539 1571 D
S
N
539 1571 M
542 1574 D
546 1576 D
551 1576 D
555 1574 D
558 1571 D
560 1567 D
560 1564 D
558 1559 D
555 1556 D
551 1555 D
546 1555 D
542 1556 D
540 1558 D
539 1561 D
539 1562 D
540 1564 D
542 1562 D
540 1561 D
S
N
551 1576 M
554 1574 D
557 1571 D
558 1567 D
558 1564 D
557 1559 D
554 1556 D
551 1555 D
S
N
542 1586 M
557 1586 D
S
N
542 1585 M
549 1585 D
557 1586 D
S
N
412 1657 M
407 1656 D
404 1651 D
403 1644 D
403 1639 D
404 1632 D
407 1627 D
412 1626 D
415 1626 D
420 1627 D
423 1632 D
424 1639 D
424 1644 D
423 1651 D
420 1656 D
415 1657 D
412 1657 D
S
N
412 1657 M
409 1656 D
407 1654 D
406 1651 D
404 1644 D
404 1639 D
406 1632 D
407 1629 D
409 1627 D
412 1626 D
S
N
415 1626 M
418 1627 D
420 1629 D
421 1632 D
423 1639 D
423 1644 D
421 1651 D
420 1654 D
418 1656 D
415 1657 D
S
N
436 1629 M
435 1627 D
436 1626 D
438 1627 D
436 1629 D
S
N
457 1657 M
453 1656 D
450 1651 D
448 1644 D
448 1639 D
450 1632 D
453 1627 D
457 1626 D
460 1626 D
465 1627 D
468 1632 D
469 1639 D
469 1644 D
468 1651 D
465 1656 D
460 1657 D
457 1657 D
S
N
457 1657 M
454 1656 D
453 1654 D
451 1651 D
450 1644 D
450 1639 D
451 1632 D
453 1629 D
454 1627 D
457 1626 D
S
N
460 1626 M
463 1627 D
465 1629 D
466 1632 D
468 1639 D
468 1644 D
466 1651 D
465 1654 D
463 1656 D
460 1657 D
S
N
487 1657 M
483 1656 D
480 1651 D
478 1644 D
478 1639 D
480 1632 D
483 1627 D
487 1626 D
490 1626 D
495 1627 D
498 1632 D
500 1639 D
500 1644 D
498 1651 D
495 1656 D
490 1657 D
487 1657 D
S
N
487 1657 M
484 1656 D
483 1654 D
481 1651 D
480 1644 D
480 1639 D
481 1632 D
483 1629 D
484 1627 D
487 1626 D
S
N
490 1626 M
493 1627 D
495 1629 D
496 1632 D
498 1639 D
498 1644 D
496 1651 D
495 1654 D
493 1656 D
490 1657 D
S
N
513 1651 M
516 1653 D
521 1657 D
521 1626 D
S
N
519 1656 M
519 1626 D
S
N
513 1626 M
527 1626 D
S
N
548 1657 M
543 1656 D
540 1651 D
539 1644 D
539 1639 D
540 1632 D
543 1627 D
548 1626 D
551 1626 D
555 1627 D
558 1632 D
560 1639 D
560 1644 D
558 1651 D
555 1656 D
551 1657 D
548 1657 D
S
N
548 1657 M
545 1656 D
543 1654 D
542 1651 D
540 1644 D
540 1639 D
542 1632 D
543 1629 D
545 1627 D
548 1626 D
S
N
551 1626 M
554 1627 D
555 1629 D
557 1632 D
558 1639 D
558 1644 D
557 1651 D
555 1654 D
554 1656 D
551 1657 D
S
N
412 1823 M
407 1821 D
404 1817 D
403 1809 D
403 1804 D
404 1797 D
407 1792 D
412 1791 D
415 1791 D
420 1792 D
423 1797 D
424 1804 D
424 1809 D
423 1817 D
420 1821 D
415 1823 D
412 1823 D
S
N
412 1823 M
409 1821 D
407 1820 D
406 1817 D
404 1809 D
404 1804 D
406 1797 D
407 1794 D
409 1792 D
412 1791 D
S
N
415 1791 M
418 1792 D
420 1794 D
421 1797 D
423 1804 D
423 1809 D
421 1817 D
420 1820 D
418 1821 D
415 1823 D
S
N
436 1794 M
435 1792 D
436 1791 D
438 1792 D
436 1794 D
S
N
457 1823 M
453 1821 D
450 1817 D
448 1809 D
448 1804 D
450 1797 D
453 1792 D
457 1791 D
460 1791 D
465 1792 D
468 1797 D
469 1804 D
469 1809 D
468 1817 D
465 1821 D
460 1823 D
457 1823 D
S
N
457 1823 M
454 1821 D
453 1820 D
451 1817 D
450 1809 D
450 1804 D
451 1797 D
453 1794 D
454 1792 D
457 1791 D
S
N
460 1791 M
463 1792 D
465 1794 D
466 1797 D
468 1804 D
468 1809 D
466 1817 D
465 1820 D
463 1821 D
460 1823 D
S
N
487 1823 M
483 1821 D
480 1817 D
478 1809 D
478 1804 D
480 1797 D
483 1792 D
487 1791 D
490 1791 D
495 1792 D
498 1797 D
500 1804 D
500 1809 D
498 1817 D
495 1821 D
490 1823 D
487 1823 D
S
N
487 1823 M
484 1821 D
483 1820 D
481 1817 D
480 1809 D
480 1804 D
481 1797 D
483 1794 D
484 1792 D
487 1791 D
S
N
490 1791 M
493 1792 D
495 1794 D
496 1797 D
498 1804 D
498 1809 D
496 1817 D
495 1820 D
493 1821 D
490 1823 D
S
N
512 1823 M
509 1808 D
S
N
509 1808 M
512 1811 D
516 1812 D
521 1812 D
525 1811 D
528 1808 D
530 1803 D
530 1800 D
528 1795 D
525 1792 D
521 1791 D
516 1791 D
512 1792 D
510 1794 D
509 1797 D
509 1798 D
510 1800 D
512 1798 D
510 1797 D
S
N
521 1812 M
524 1811 D
527 1808 D
528 1803 D
528 1800 D
527 1795 D
524 1792 D
521 1791 D
S
N
512 1823 M
527 1823 D
S
N
512 1821 M
519 1821 D
527 1823 D
S
N
548 1823 M
543 1821 D
540 1817 D
539 1809 D
539 1804 D
540 1797 D
543 1792 D
548 1791 D
551 1791 D
555 1792 D
558 1797 D
560 1804 D
560 1809 D
558 1817 D
555 1821 D
551 1823 D
548 1823 D
S
N
548 1823 M
545 1821 D
543 1820 D
542 1817 D
540 1809 D
540 1804 D
542 1797 D
543 1794 D
545 1792 D
548 1791 D
S
N
551 1791 M
554 1792 D
555 1794 D
557 1797 D
558 1804 D
558 1809 D
557 1817 D
555 1820 D
554 1821 D
551 1823 D
S
N
412 1894 M
407 1892 D
404 1888 D
403 1880 D
403 1876 D
404 1868 D
407 1864 D
412 1862 D
415 1862 D
420 1864 D
423 1868 D
424 1876 D
424 1880 D
423 1888 D
420 1892 D
415 1894 D
412 1894 D
S
N
412 1894 M
409 1892 D
407 1891 D
406 1888 D
404 1880 D
404 1876 D
406 1868 D
407 1865 D
409 1864 D
412 1862 D
S
N
415 1862 M
418 1864 D
420 1865 D
421 1868 D
423 1876 D
423 1880 D
421 1888 D
420 1891 D
418 1892 D
415 1894 D
S
N
436 1865 M
435 1864 D
436 1862 D
438 1864 D
436 1865 D
S
N
457 1894 M
453 1892 D
450 1888 D
448 1880 D
448 1876 D
450 1868 D
453 1864 D
457 1862 D
460 1862 D
465 1864 D
468 1868 D
469 1876 D
469 1880 D
468 1888 D
465 1892 D
460 1894 D
457 1894 D
S
N
457 1894 M
454 1892 D
453 1891 D
451 1888 D
450 1880 D
450 1876 D
451 1868 D
453 1865 D
454 1864 D
457 1862 D
S
N
460 1862 M
463 1864 D
465 1865 D
466 1868 D
468 1876 D
468 1880 D
466 1888 D
465 1891 D
463 1892 D
460 1894 D
S
N
483 1888 M
486 1889 D
490 1894 D
490 1862 D
S
N
489 1892 M
489 1862 D
S
N
483 1862 M
496 1862 D
S
N
518 1894 M
513 1892 D
510 1888 D
509 1880 D
509 1876 D
510 1868 D
513 1864 D
518 1862 D
521 1862 D
525 1864 D
528 1868 D
530 1876 D
530 1880 D
528 1888 D
525 1892 D
521 1894 D
518 1894 D
S
N
518 1894 M
515 1892 D
513 1891 D
512 1888 D
510 1880 D
510 1876 D
512 1868 D
513 1865 D
515 1864 D
518 1862 D
S
N
521 1862 M
524 1864 D
525 1865 D
527 1868 D
528 1876 D
528 1880 D
527 1888 D
525 1891 D
524 1892 D
521 1894 D
S
N
548 1894 M
543 1892 D
540 1888 D
539 1880 D
539 1876 D
540 1868 D
543 1864 D
548 1862 D
551 1862 D
555 1864 D
558 1868 D
560 1876 D
560 1880 D
558 1888 D
555 1892 D
551 1894 D
548 1894 D
S
N
548 1894 M
545 1892 D
543 1891 D
542 1888 D
540 1880 D
540 1876 D
542 1868 D
543 1865 D
545 1864 D
548 1862 D
S
N
551 1862 M
554 1864 D
555 1865 D
557 1868 D
558 1876 D
558 1880 D
557 1888 D
555 1891 D
554 1892 D
551 1894 D
S
N
412 2059 M
407 2057 D
404 2053 D
403 2045 D
403 2041 D
404 2033 D
407 2029 D
412 2027 D
415 2027 D
420 2029 D
423 2033 D
424 2041 D
424 2045 D
423 2053 D
420 2057 D
415 2059 D
412 2059 D
S
N
412 2059 M
409 2057 D
407 2056 D
406 2053 D
404 2045 D
404 2041 D
406 2033 D
407 2030 D
409 2029 D
412 2027 D
S
N
415 2027 M
418 2029 D
420 2030 D
421 2033 D
423 2041 D
423 2045 D
421 2053 D
420 2056 D
418 2057 D
415 2059 D
S
N
436 2030 M
435 2029 D
436 2027 D
438 2029 D
436 2030 D
S
N
457 2059 M
453 2057 D
450 2053 D
448 2045 D
448 2041 D
450 2033 D
453 2029 D
457 2027 D
460 2027 D
465 2029 D
468 2033 D
469 2041 D
469 2045 D
468 2053 D
465 2057 D
460 2059 D
457 2059 D
S
N
457 2059 M
454 2057 D
453 2056 D
451 2053 D
450 2045 D
450 2041 D
451 2033 D
453 2030 D
454 2029 D
457 2027 D
S
N
460 2027 M
463 2029 D
465 2030 D
466 2033 D
468 2041 D
468 2045 D
466 2053 D
465 2056 D
463 2057 D
460 2059 D
S
N
481 2059 M
478 2044 D
S
N
478 2044 M
481 2047 D
486 2048 D
490 2048 D
495 2047 D
498 2044 D
500 2039 D
500 2036 D
498 2032 D
495 2029 D
490 2027 D
486 2027 D
481 2029 D
480 2030 D
478 2033 D
478 2035 D
480 2036 D
481 2035 D
480 2033 D
S
N
490 2048 M
493 2047 D
496 2044 D
498 2039 D
498 2036 D
496 2032 D
493 2029 D
490 2027 D
S
N
481 2059 M
496 2059 D
S
N
481 2057 M
489 2057 D
496 2059 D
S
N
518 2059 M
513 2057 D
510 2053 D
509 2045 D
509 2041 D
510 2033 D
513 2029 D
518 2027 D
521 2027 D
525 2029 D
528 2033 D
530 2041 D
530 2045 D
528 2053 D
525 2057 D
521 2059 D
518 2059 D
S
N
518 2059 M
515 2057 D
513 2056 D
512 2053 D
510 2045 D
510 2041 D
512 2033 D
513 2030 D
515 2029 D
518 2027 D
S
N
521 2027 M
524 2029 D
525 2030 D
527 2033 D
528 2041 D
528 2045 D
527 2053 D
525 2056 D
524 2057 D
521 2059 D
S
N
548 2059 M
543 2057 D
540 2053 D
539 2045 D
539 2041 D
540 2033 D
543 2029 D
548 2027 D
551 2027 D
555 2029 D
558 2033 D
560 2041 D
560 2045 D
558 2053 D
555 2057 D
551 2059 D
548 2059 D
S
N
548 2059 M
545 2057 D
543 2056 D
542 2053 D
540 2045 D
540 2041 D
542 2033 D
543 2030 D
545 2029 D
548 2027 D
S
N
551 2027 M
554 2029 D
555 2030 D
557 2033 D
558 2041 D
558 2045 D
557 2053 D
555 2056 D
554 2057 D
551 2059 D
S
N
412 2130 M
407 2129 D
404 2124 D
403 2116 D
403 2112 D
404 2104 D
407 2100 D
412 2098 D
415 2098 D
420 2100 D
423 2104 D
424 2112 D
424 2116 D
423 2124 D
420 2129 D
415 2130 D
412 2130 D
S
N
412 2130 M
409 2129 D
407 2127 D
406 2124 D
404 2116 D
404 2112 D
406 2104 D
407 2101 D
409 2100 D
412 2098 D
S
N
415 2098 M
418 2100 D
420 2101 D
421 2104 D
423 2112 D
423 2116 D
421 2124 D
420 2127 D
418 2129 D
415 2130 D
S
N
436 2101 M
435 2100 D
436 2098 D
438 2100 D
436 2101 D
S
N
453 2124 M
456 2126 D
460 2130 D
460 2098 D
S
N
459 2129 M
459 2098 D
S
N
453 2098 M
466 2098 D
S
N
487 2130 M
483 2129 D
480 2124 D
478 2116 D
478 2112 D
480 2104 D
483 2100 D
487 2098 D
490 2098 D
495 2100 D
498 2104 D
500 2112 D
500 2116 D
498 2124 D
495 2129 D
490 2130 D
487 2130 D
S
N
487 2130 M
484 2129 D
483 2127 D
481 2124 D
480 2116 D
480 2112 D
481 2104 D
483 2101 D
484 2100 D
487 2098 D
S
N
490 2098 M
493 2100 D
495 2101 D
496 2104 D
498 2112 D
498 2116 D
496 2124 D
495 2127 D
493 2129 D
490 2130 D
S
N
518 2130 M
513 2129 D
510 2124 D
509 2116 D
509 2112 D
510 2104 D
513 2100 D
518 2098 D
521 2098 D
525 2100 D
528 2104 D
530 2112 D
530 2116 D
528 2124 D
525 2129 D
521 2130 D
518 2130 D
S
N
518 2130 M
515 2129 D
513 2127 D
512 2124 D
510 2116 D
510 2112 D
512 2104 D
513 2101 D
515 2100 D
518 2098 D
S
N
521 2098 M
524 2100 D
525 2101 D
527 2104 D
528 2112 D
528 2116 D
527 2124 D
525 2127 D
524 2129 D
521 2130 D
S
N
548 2130 M
543 2129 D
540 2124 D
539 2116 D
539 2112 D
540 2104 D
543 2100 D
548 2098 D
551 2098 D
555 2100 D
558 2104 D
560 2112 D
560 2116 D
558 2124 D
555 2129 D
551 2130 D
548 2130 D
S
N
548 2130 M
545 2129 D
543 2127 D
542 2124 D
540 2116 D
540 2112 D
542 2104 D
543 2101 D
545 2100 D
548 2098 D
S
N
551 2098 M
554 2100 D
555 2101 D
557 2104 D
558 2112 D
558 2116 D
557 2124 D
555 2127 D
554 2129 D
551 2130 D
S
N
412 2295 M
407 2294 D
404 2289 D
403 2282 D
403 2277 D
404 2270 D
407 2265 D
412 2264 D
415 2264 D
420 2265 D
423 2270 D
424 2277 D
424 2282 D
423 2289 D
420 2294 D
415 2295 D
412 2295 D
S
N
412 2295 M
409 2294 D
407 2292 D
406 2289 D
404 2282 D
404 2277 D
406 2270 D
407 2267 D
409 2265 D
412 2264 D
S
N
415 2264 M
418 2265 D
420 2267 D
421 2270 D
423 2277 D
423 2282 D
421 2289 D
420 2292 D
418 2294 D
415 2295 D
S
N
436 2267 M
435 2265 D
436 2264 D
438 2265 D
436 2267 D
S
N
451 2295 M
448 2280 D
S
N
448 2280 M
451 2283 D
456 2285 D
460 2285 D
465 2283 D
468 2280 D
469 2276 D
469 2273 D
468 2268 D
465 2265 D
460 2264 D
456 2264 D
451 2265 D
450 2267 D
448 2270 D
448 2271 D
450 2273 D
451 2271 D
450 2270 D
S
N
460 2285 M
463 2283 D
466 2280 D
468 2276 D
468 2273 D
466 2268 D
463 2265 D
460 2264 D
S
N
451 2295 M
466 2295 D
S
N
451 2294 M
459 2294 D
466 2295 D
S
N
487 2295 M
483 2294 D
480 2289 D
478 2282 D
478 2277 D
480 2270 D
483 2265 D
487 2264 D
490 2264 D
495 2265 D
498 2270 D
500 2277 D
500 2282 D
498 2289 D
495 2294 D
490 2295 D
487 2295 D
S
N
487 2295 M
484 2294 D
483 2292 D
481 2289 D
480 2282 D
480 2277 D
481 2270 D
483 2267 D
484 2265 D
487 2264 D
S
N
490 2264 M
493 2265 D
495 2267 D
496 2270 D
498 2277 D
498 2282 D
496 2289 D
495 2292 D
493 2294 D
490 2295 D
S
N
518 2295 M
513 2294 D
510 2289 D
509 2282 D
509 2277 D
510 2270 D
513 2265 D
518 2264 D
521 2264 D
525 2265 D
528 2270 D
530 2277 D
530 2282 D
528 2289 D
525 2294 D
521 2295 D
518 2295 D
S
N
518 2295 M
515 2294 D
513 2292 D
512 2289 D
510 2282 D
510 2277 D
512 2270 D
513 2267 D
515 2265 D
518 2264 D
S
N
521 2264 M
524 2265 D
525 2267 D
527 2270 D
528 2277 D
528 2282 D
527 2289 D
525 2292 D
524 2294 D
521 2295 D
S
N
548 2295 M
543 2294 D
540 2289 D
539 2282 D
539 2277 D
540 2270 D
543 2265 D
548 2264 D
551 2264 D
555 2265 D
558 2270 D
560 2277 D
560 2282 D
558 2289 D
555 2294 D
551 2295 D
548 2295 D
S
N
548 2295 M
545 2294 D
543 2292 D
542 2289 D
540 2282 D
540 2277 D
542 2270 D
543 2267 D
545 2265 D
548 2264 D
S
N
551 2264 M
554 2265 D
555 2267 D
557 2270 D
558 2277 D
558 2282 D
557 2289 D
555 2292 D
554 2294 D
551 2295 D
S
N
1967 1520 M
1967 2342 D
S
N
1967 1550 M
1957 1550 D
S
N
1936 1573 M
1967 1573 D
S
N
1967 1591 M
1957 1591 D
S
N
1957 1607 M
1967 1607 D
S
N
1967 1621 M
1957 1621 D
S
N
1957 1633 M
1967 1633 D
S
N
1967 1644 M
1936 1644 D
S
N
1957 1715 M
1967 1715 D
S
N
1967 1757 M
1957 1757 D
S
N
1957 1786 M
1967 1786 D
S
N
1967 1809 M
1936 1809 D
S
N
1957 1828 M
1967 1828 D
S
N
1967 1844 M
1957 1844 D
S
N
1957 1857 M
1967 1857 D
S
N
1967 1869 M
1957 1869 D
S
N
1936 1880 M
1967 1880 D
S
N
1967 1951 M
1957 1951 D
S
N
1957 1993 M
1967 1993 D
S
N
1967 2022 M
1957 2022 D
S
N
1936 2045 M
1967 2045 D
S
N
1967 2064 M
1957 2064 D
S
N
1957 2080 M
1967 2080 D
S
N
1967 2094 M
1957 2094 D
S
N
1957 2106 M
1967 2106 D
S
N
1967 2116 M
1936 2116 D
S
N
1957 2188 M
1967 2188 D
S
N
1967 2229 M
1957 2229 D
S
N
1957 2259 M
1967 2259 D
S
N
1967 2282 M
1936 2282 D
S
N
1957 2300 M
1967 2300 D
S
N
1967 2316 M
1957 2316 D
S
N
1957 2330 M
1967 2330 D
S
N
1967 2342 M
1957 2342 D
S
N
1327 2186 M
1431 2186 D
S
583 1520 P
583 1762 P
N
583 1762 M
583 1783 D
609 1783 D
609 1800 D
634 1800 D
634 1822 D
660 1822 D
660 1842 D
686 1842 D
686 1861 D
711 1861 D
711 1877 D
737 1877 D
737 1895 D
762 1895 D
762 1910 D
788 1910 D
788 1928 D
814 1928 D
814 1941 D
839 1941 D
839 1954 D
865 1954 D
865 1967 D
891 1967 D
891 1982 D
916 1982 D
916 1992 D
942 1992 D
942 2002 D
967 2002 D
967 2013 D
993 2013 D
993 2024 D
1019 2024 D
1019 2032 D
1044 2032 D
1044 2041 D
1070 2041 D
1070 2050 D
1096 2050 D
1096 2057 D
1121 2057 D
1121 2064 D
1147 2064 D
1147 2070 D
1172 2070 D
1172 2076 D
1198 2076 D
1198 2081 D
1224 2081 D
1224 2086 D
1249 2086 D
1249 2088 D
1275 2088 D
1275 2090 D
1301 2090 D
1301 2093 D
1326 2093 D
1326 2094 D
1352 2094 D
1352 2094 D
1378 2094 D
1378 2092 D
1403 2092 D
1403 2091 D
1429 2091 D
1429 2087 D
1454 2087 D
1454 2083 D
1480 2083 D
1480 2077 D
1506 2077 D
1506 2071 D
1531 2071 D
1531 2063 D
1557 2063 D
1557 2053 D
1583 2053 D
1583 2043 D
1608 2043 D
1608 2028 D
1634 2028 D
1634 2013 D
1659 2013 D
1659 1996 D
1685 1996 D
1685 1977 D
1711 1977 D
1711 1956 D
1736 1956 D
1736 1931 D
1762 1931 D
1762 1905 D
1788 1905 D
1788 1874 D
1813 1874 D
1813 1842 D
1839 1842 D
1839 1803 D
1864 1803 D
1864 1760 D
1890 1760 D
1890 1712 D
1916 1712 D
1916 1654 D
1941 1654 D
1941 1586 D
1967 1586 D
S
0 0 1 setrgbcolor
N
1327 2117 M
1339 2117 D
S
N
1351 2117 M
1363 2117 D
S
N
1375 2117 M
1387 2117 D
S
N
1400 2117 M
1412 2117 D
S
N
1424 2117 M
1431 2117 D
S
583 1520 P
583 1809 P
N
583 1809 M
583 1821 D
S
N
586 1831 M
598 1831 D
S
N
609 1832 M
609 1844 D
S
N
617 1848 M
629 1848 D
S
N
634 1855 M
634 1866 D
636 1866 D
S
N
648 1866 M
660 1866 D
660 1866 D
S
N
660 1878 M
660 1883 D
666 1883 D
S
N
678 1883 M
686 1883 D
686 1888 D
S
N
686 1901 M
686 1901 D
697 1901 D
S
N
709 1901 M
711 1901 D
711 1911 D
S
N
719 1916 M
731 1916 D
S
N
737 1922 M
737 1933 D
738 1933 D
S
N
750 1933 M
762 1933 D
S
N
766 1941 M
778 1941 D
S
N
788 1943 M
788 1955 D
S
N
800 1956 M
812 1956 D
S
N
814 1966 M
826 1966 D
S
N
838 1966 M
839 1966 D
839 1976 D
840 1976 D
S
N
852 1976 M
864 1976 D
S
N
866 1986 M
878 1986 D
S
N
890 1986 M
891 1986 D
891 1996 D
893 1996 D
S
N
905 1996 M
916 1996 D
916 1997 D
S
N
919 2006 M
931 2006 D
S
N
942 2008 M
942 2014 D
948 2014 D
S
N
960 2014 M
967 2014 D
967 2018 D
S
N
973 2025 M
985 2025 D
S
N
993 2029 M
993 2032 D
1002 2032 D
S
N
1014 2032 M
1019 2032 D
1019 2040 D
1019 2040 D
S
N
1031 2040 M
1043 2040 D
S
N
1049 2046 M
1061 2046 D
S
N
1070 2049 M
1070 2055 D
1076 2055 D
S
N
1088 2055 M
1096 2055 D
1096 2060 D
S
N
1106 2062 M
1118 2062 D
S
N
1124 2068 M
1136 2068 D
S
N
1147 2069 M
1147 2073 D
1155 2073 D
S
N
1167 2073 M
1172 2073 D
1172 2078 D
1174 2078 D
S
N
1186 2078 M
1198 2078 D
1198 2078 D
S
N
1206 2082 M
1218 2082 D
S
N
1227 2086 M
1239 2086 D
S
N
1250 2087 M
1262 2087 D
S
N
1274 2087 M
1275 2087 D
1275 2090 D
1283 2090 D
S
N
1295 2090 M
1301 2090 D
1301 2090 D
1306 2090 D
S
N
1319 2090 M
1326 2090 D
1326 2090 D
1330 2090 D
S
N
1342 2090 M
1352 2090 D
1352 2088 D
1353 2088 D
S
N
1365 2088 M
1377 2088 D
S
N
1387 2086 M
1399 2086 D
S
N
1408 2083 M
1420 2083 D
S
N
1429 2079 M
1429 2079 D
1441 2079 D
S
N
1453 2079 M
1454 2079 D
1454 2074 D
1460 2074 D
S
N
1472 2074 M
1480 2074 D
1480 2070 D
S
N
1489 2067 M
1501 2067 D
S
N
1507 2061 M
1519 2061 D
S
N
1531 2061 M
1531 2061 D
1531 2052 D
1534 2052 D
S
N
1546 2052 M
1557 2052 D
1557 2050 D
S
N
1560 2041 M
1572 2041 D
S
N
1583 2039 M
1583 2032 D
1587 2032 D
S
N
1599 2032 M
1608 2032 D
1608 2029 D
S
N
1611 2020 M
1623 2020 D
S
N
1634 2018 M
1634 2006 D
S
N
1645 2005 M
1657 2005 D
S
N
1659 1995 M
1659 1990 D
1666 1990 D
S
N
1678 1990 M
1685 1990 D
1685 1985 D
S
N
1685 1972 M
1685 1971 D
1696 1971 D
S
N
1708 1971 M
1711 1971 D
1711 1962 D
S
N
1714 1953 M
1726 1953 D
S
N
1736 1951 M
1736 1939 D
S
N
1740 1931 M
1752 1931 D
S
N
1762 1928 M
1762 1916 D
S
N
1765 1907 M
1777 1907 D
S
N
1788 1905 M
1788 1893 D
S
N
1788 1881 M
1788 1877 D
1796 1877 D
S
N
1808 1877 M
1813 1877 D
1813 1870 D
S
N
1813 1858 M
1813 1846 D
S
N
1823 1844 M
1835 1844 D
S
N
1839 1836 M
1839 1823 D
S
N
1839 1811 M
1839 1801 D
1841 1801 D
S
N
1853 1801 M
1864 1801 D
1864 1801 D
S
N
1864 1789 M
1864 1776 D
S
N
1866 1765 M
1878 1765 D
S
N
1890 1765 M
1890 1765 D
1890 1754 D
S
N
1890 1742 M
1890 1729 D
S
N
1890 1717 M
1890 1711 D
1896 1711 D
S
N
1908 1711 M
1916 1711 D
1916 1707 D
S
N
1916 1694 M
1916 1682 D
S
N
1916 1670 M
1916 1658 D
S
N
1925 1655 M
1937 1655 D
S
N
1941 1647 M
1941 1635 D
S
N
1941 1623 M
1941 1611 D
S
N
1948 1606 M
1960 1606 D
S
3 Sw
0 0 0 setrgbcolor
N
833 1477 M
833 1476 D
832 1476 D
832 1477 D
833 1478 D
836 1480 D
841 1480 D
844 1478 D
845 1477 D
847 1474 D
847 1465 D
848 1462 D
849 1461 D
S
N
845 1477 M
845 1465 D
847 1462 D
849 1461 D
851 1461 D
S
N
845 1474 M
844 1473 D
836 1472 D
832 1470 D
830 1467 D
830 1465 D
832 1462 D
836 1461 D
840 1461 D
843 1462 D
845 1465 D
S
N
836 1472 M
833 1470 D
832 1467 D
832 1465 D
833 1462 D
836 1461 D
S
N
860 1489 M
860 1461 D
S
N
862 1489 M
870 1465 D
S
N
860 1489 M
870 1461 D
S
N
879 1489 M
870 1461 D
S
N
879 1489 M
879 1461 D
S
N
881 1489 M
881 1461 D
S
N
856 1489 M
862 1489 D
S
N
879 1489 M
885 1489 D
S
N
856 1461 M
864 1461 D
S
N
875 1461 M
885 1461 D
S
N
911 1485 M
912 1481 D
912 1489 D
911 1485 D
908 1488 D
904 1489 D
901 1489 D
897 1488 D
895 1485 D
893 1482 D
892 1478 D
892 1472 D
893 1467 D
895 1465 D
897 1462 D
901 1461 D
904 1461 D
908 1462 D
911 1465 D
912 1467 D
S
N
901 1489 M
899 1488 D
896 1485 D
895 1482 D
893 1478 D
893 1472 D
895 1467 D
896 1465 D
899 1462 D
901 1461 D
S
N
941 1478 M
940 1481 D
937 1482 D
933 1482 D
930 1481 D
929 1480 D
927 1476 D
927 1472 D
929 1469 D
931 1467 D
936 1467 D
938 1469 D
940 1472 D
S
N
933 1482 M
930 1480 D
929 1476 D
929 1472 D
930 1469 D
931 1467 D
S
N
941 1482 M
940 1472 D
940 1469 D
942 1467 D
945 1467 D
948 1470 D
949 1474 D
949 1477 D
948 1481 D
947 1484 D
944 1487 D
941 1488 D
937 1489 D
933 1489 D
929 1488 D
926 1487 D
923 1484 D
922 1481 D
921 1477 D
921 1473 D
922 1469 D
923 1466 D
926 1463 D
929 1462 D
933 1461 D
937 1461 D
941 1462 D
944 1463 D
945 1465 D
S
N
942 1482 M
941 1472 D
941 1469 D
942 1467 D
S
N
960 1489 M
960 1461 D
S
N
962 1489 M
978 1463 D
S
N
962 1487 M
978 1461 D
S
N
978 1489 M
978 1461 D
S
N
956 1489 M
962 1489 D
S
N
974 1489 M
982 1489 D
S
N
956 1461 M
964 1461 D
S
N
992 1489 M
992 1461 D
S
N
993 1489 M
993 1461 D
S
N
988 1489 M
997 1489 D
S
N
988 1461 M
1008 1461 D
1008 1469 D
1007 1461 D
S
N
1023 1489 M
1019 1488 D
1016 1485 D
1015 1482 D
1014 1477 D
1014 1473 D
1015 1467 D
1016 1465 D
1019 1462 D
1023 1461 D
1026 1461 D
1030 1462 D
1033 1465 D
1034 1467 D
1035 1473 D
1035 1477 D
1034 1482 D
1033 1485 D
1030 1488 D
1026 1489 D
1023 1489 D
S
N
1023 1489 M
1020 1488 D
1018 1485 D
1016 1482 D
1015 1477 D
1015 1473 D
1016 1467 D
1018 1465 D
1020 1462 D
1023 1461 D
S
N
1026 1461 M
1029 1462 D
1031 1465 D
1033 1467 D
1034 1473 D
1034 1477 D
1033 1482 D
1031 1485 D
1029 1488 D
1026 1489 D
S
N
1046 1480 M
1045 1478 D
1046 1477 D
1048 1478 D
1046 1480 D
S
N
1046 1463 M
1045 1462 D
1046 1461 D
1048 1462 D
1046 1463 D
S
N
1093 1477 M
1094 1480 D
1094 1474 D
1093 1477 D
1092 1478 D
1089 1480 D
1083 1480 D
1081 1478 D
1079 1477 D
1079 1474 D
1081 1473 D
1083 1472 D
1090 1469 D
1093 1467 D
1094 1466 D
S
N
1079 1476 M
1081 1474 D
1083 1473 D
1090 1470 D
1093 1469 D
1094 1467 D
1094 1463 D
1093 1462 D
1090 1461 D
1085 1461 D
1082 1462 D
1081 1463 D
1079 1466 D
1079 1461 D
1081 1463 D
S
N
1119 1476 M
1118 1474 D
1119 1473 D
1120 1474 D
1120 1476 D
1118 1478 D
1115 1480 D
1111 1480 D
1107 1478 D
1104 1476 D
1103 1472 D
1103 1469 D
1104 1465 D
1107 1462 D
1111 1461 D
1114 1461 D
1118 1462 D
1120 1465 D
S
N
1111 1480 M
1108 1478 D
1105 1476 D
1104 1472 D
1104 1469 D
1105 1465 D
1108 1462 D
1111 1461 D
S
N
1131 1477 M
1131 1476 D
1130 1476 D
1130 1477 D
1131 1478 D
1134 1480 D
1140 1480 D
1142 1478 D
1144 1477 D
1145 1474 D
1145 1465 D
1146 1462 D
1148 1461 D
S
N
1144 1477 M
1144 1465 D
1145 1462 D
1148 1461 D
1149 1461 D
S
N
1144 1474 M
1142 1473 D
1134 1472 D
1130 1470 D
1129 1467 D
1129 1465 D
1130 1462 D
1134 1461 D
1138 1461 D
1141 1462 D
1144 1465 D
S
N
1134 1472 M
1131 1470 D
1130 1467 D
1130 1465 D
1131 1462 D
1134 1461 D
S
N
1159 1489 M
1159 1461 D
S
N
1160 1489 M
1160 1461 D
S
N
1155 1489 M
1160 1489 D
S
N
1155 1461 M
1164 1461 D
S
N
1172 1472 M
1189 1472 D
1189 1474 D
1187 1477 D
1186 1478 D
1183 1480 D
1179 1480 D
1175 1478 D
1172 1476 D
1171 1472 D
1171 1469 D
1172 1465 D
1175 1462 D
1179 1461 D
1182 1461 D
1186 1462 D
1189 1465 D
S
N
1187 1472 M
1187 1476 D
1186 1478 D
S
N
1179 1480 M
1176 1478 D
1174 1476 D
1172 1472 D
1172 1469 D
1174 1465 D
1176 1462 D
1179 1461 D
S
N
1222 1480 M
1222 1465 D
1223 1462 D
1227 1461 D
1230 1461 D
1234 1462 D
1237 1465 D
S
N
1223 1480 M
1223 1465 D
1224 1462 D
1227 1461 D
S
N
1237 1480 M
1237 1461 D
S
N
1238 1480 M
1238 1461 D
S
N
1218 1480 M
1223 1480 D
S
N
1233 1480 M
1238 1480 D
S
N
1237 1461 M
1242 1461 D
S
N
1252 1480 M
1252 1461 D
S
N
1253 1480 M
1253 1461 D
S
N
1253 1476 M
1256 1478 D
1260 1480 D
1263 1480 D
1267 1478 D
1268 1476 D
1268 1461 D
S
N
1263 1480 M
1265 1478 D
1267 1476 D
1267 1461 D
S
N
1248 1480 M
1253 1480 D
S
N
1248 1461 M
1257 1461 D
S
N
1263 1461 M
1272 1461 D
S
N
1296 1476 M
1294 1474 D
1296 1473 D
1297 1474 D
1297 1476 D
1294 1478 D
1291 1480 D
1287 1480 D
1283 1478 D
1281 1476 D
1279 1472 D
1279 1469 D
1281 1465 D
1283 1462 D
1287 1461 D
1290 1461 D
1294 1462 D
1297 1465 D
S
N
1287 1480 M
1285 1478 D
1282 1476 D
1281 1472 D
1281 1469 D
1282 1465 D
1285 1462 D
1287 1461 D
S
N
1308 1463 M
1307 1462 D
1308 1461 D
1309 1462 D
1308 1463 D
S
N
833 1304 M
833 1303 D
832 1303 D
832 1304 D
833 1305 D
836 1307 D
841 1307 D
844 1305 D
845 1304 D
847 1301 D
847 1292 D
848 1289 D
849 1288 D
S
N
845 1304 M
845 1292 D
847 1289 D
849 1288 D
851 1288 D
S
N
845 1301 M
844 1300 D
836 1299 D
832 1297 D
830 1294 D
830 1292 D
832 1289 D
836 1288 D
840 1288 D
843 1289 D
845 1292 D
S
N
836 1299 M
833 1297 D
832 1294 D
832 1292 D
833 1289 D
836 1288 D
S
N
860 1316 M
860 1288 D
S
N
862 1316 M
870 1292 D
S
N
860 1316 M
870 1288 D
S
N
879 1316 M
870 1288 D
S
N
879 1316 M
879 1288 D
S
N
881 1316 M
881 1288 D
S
N
856 1316 M
862 1316 D
S
N
879 1316 M
885 1316 D
S
N
856 1288 M
864 1288 D
S
N
875 1288 M
885 1288 D
S
N
911 1312 M
912 1308 D
912 1316 D
911 1312 D
908 1315 D
904 1316 D
901 1316 D
897 1315 D
895 1312 D
893 1309 D
892 1305 D
892 1299 D
893 1294 D
895 1292 D
897 1289 D
901 1288 D
904 1288 D
908 1289 D
911 1292 D
912 1294 D
S
N
901 1316 M
899 1315 D
896 1312 D
895 1309 D
893 1305 D
893 1299 D
895 1294 D
896 1292 D
899 1289 D
901 1288 D
S
N
941 1305 M
940 1308 D
937 1309 D
933 1309 D
930 1308 D
929 1307 D
927 1303 D
927 1299 D
929 1296 D
931 1294 D
936 1294 D
938 1296 D
940 1299 D
S
N
933 1309 M
930 1307 D
929 1303 D
929 1299 D
930 1296 D
931 1294 D
S
N
941 1309 M
940 1299 D
940 1296 D
942 1294 D
945 1294 D
948 1297 D
949 1301 D
949 1304 D
948 1308 D
947 1311 D
944 1314 D
941 1315 D
937 1316 D
933 1316 D
929 1315 D
926 1314 D
923 1311 D
922 1308 D
921 1304 D
921 1300 D
922 1296 D
923 1293 D
926 1290 D
929 1289 D
933 1288 D
937 1288 D
941 1289 D
944 1290 D
945 1292 D
S
N
942 1309 M
941 1299 D
941 1296 D
942 1294 D
S
N
960 1316 M
960 1288 D
S
N
962 1316 M
978 1290 D
S
N
962 1314 M
978 1288 D
S
N
978 1316 M
978 1288 D
S
N
956 1316 M
962 1316 D
S
N
974 1316 M
982 1316 D
S
N
956 1288 M
964 1288 D
S
N
992 1316 M
992 1288 D
S
N
993 1316 M
993 1288 D
S
N
988 1316 M
997 1316 D
S
N
988 1288 M
1008 1288 D
1008 1296 D
1007 1288 D
S
N
1023 1316 M
1019 1315 D
1016 1312 D
1015 1309 D
1014 1304 D
1014 1300 D
1015 1294 D
1016 1292 D
1019 1289 D
1023 1288 D
1026 1288 D
1030 1289 D
1033 1292 D
1034 1294 D
1035 1300 D
1035 1304 D
1034 1309 D
1033 1312 D
1030 1315 D
1026 1316 D
1023 1316 D
S
N
1023 1316 M
1020 1315 D
1018 1312 D
1016 1309 D
1015 1304 D
1015 1300 D
1016 1294 D
1018 1292 D
1020 1289 D
1023 1288 D
S
N
1026 1288 M
1029 1289 D
1031 1292 D
1033 1294 D
1034 1300 D
1034 1304 D
1033 1309 D
1031 1312 D
1029 1315 D
1026 1316 D
S
N
1046 1307 M
1045 1305 D
1046 1304 D
1048 1305 D
1046 1307 D
S
N
1046 1290 M
1045 1289 D
1046 1288 D
1048 1289 D
1046 1290 D
S
N
1082 1307 M
1082 1278 D
S
N
1083 1307 M
1083 1278 D
S
N
1083 1303 M
1086 1305 D
1089 1307 D
1092 1307 D
1096 1305 D
1098 1303 D
1100 1299 D
1100 1296 D
1098 1292 D
1096 1289 D
1092 1288 D
1089 1288 D
1086 1289 D
1083 1292 D
S
N
1092 1307 M
1094 1305 D
1097 1303 D
1098 1299 D
1098 1296 D
1097 1292 D
1094 1289 D
1092 1288 D
S
N
1078 1307 M
1083 1307 D
S
N
1078 1278 M
1088 1278 D
S
N
1124 1316 M
1124 1288 D
S
N
1126 1316 M
1126 1288 D
S
N
1124 1303 M
1122 1305 D
1119 1307 D
1116 1307 D
1112 1305 D
1109 1303 D
1108 1299 D
1108 1296 D
1109 1292 D
1112 1289 D
1116 1288 D
1119 1288 D
1122 1289 D
1124 1292 D
S
N
1116 1307 M
1114 1305 D
1111 1303 D
1109 1299 D
1109 1296 D
1111 1292 D
1114 1289 D
1116 1288 D
S
N
1120 1316 M
1126 1316 D
S
N
1124 1288 M
1130 1288 D
S
N
1146 1315 M
1145 1314 D
1146 1312 D
1148 1314 D
1148 1315 D
1146 1316 D
1144 1316 D
1141 1315 D
1140 1312 D
1140 1288 D
S
N
1144 1316 M
1142 1315 D
1141 1312 D
1141 1288 D
S
N
1135 1307 M
1146 1307 D
S
N
1135 1288 M
1145 1288 D
S
N
1179 1307 M
1179 1292 D
1181 1289 D
1185 1288 D
1187 1288 D
1192 1289 D
1194 1292 D
S
N
1181 1307 M
1181 1292 D
1182 1289 D
1185 1288 D
S
N
1194 1307 M
1194 1288 D
S
N
1196 1307 M
1196 1288 D
S
N
1175 1307 M
1181 1307 D
S
N
1190 1307 M
1196 1307 D
S
N
1194 1288 M
1200 1288 D
S
N
1209 1307 M
1209 1288 D
S
N
1211 1307 M
1211 1288 D
S
N
1211 1303 M
1213 1305 D
1218 1307 D
1220 1307 D
1224 1305 D
1226 1303 D
1226 1288 D
S
N
1220 1307 M
1223 1305 D
1224 1303 D
1224 1288 D
S
N
1205 1307 M
1211 1307 D
S
N
1205 1288 M
1215 1288 D
S
N
1220 1288 M
1230 1288 D
S
N
1253 1303 M
1252 1301 D
1253 1300 D
1254 1301 D
1254 1303 D
1252 1305 D
1249 1307 D
1245 1307 D
1241 1305 D
1238 1303 D
1237 1299 D
1237 1296 D
1238 1292 D
1241 1289 D
1245 1288 D
1248 1288 D
1252 1289 D
1254 1292 D
S
N
1245 1307 M
1242 1305 D
1239 1303 D
1238 1299 D
1238 1296 D
1239 1292 D
1242 1289 D
1245 1288 D
S
N
1265 1290 M
1264 1289 D
1265 1288 D
1267 1289 D
1265 1290 D
S
4 Sw
N
583 1520 M
583 1261 D
S
N
583 1261 M
1967 1261 D
S
N
1967 1261 M
1967 1520 D
S
N
1967 1520 M
583 1520 D
S
N
583 1261 M
1967 1261 D
S
N
583 1261 M
583 1266 D
S
N
634 1266 M
634 1261 D
S
N
686 1261 M
686 1266 D
S
N
737 1276 M
737 1261 D
S
N
788 1261 M
788 1266 D
S
N
839 1266 M
839 1261 D
S
N
891 1261 M
891 1266 D
S
N
942 1266 M
942 1261 D
S
N
993 1261 M
993 1276 D
S
N
1044 1266 M
1044 1261 D
S
N
1096 1261 M
1096 1266 D
S
N
1147 1266 M
1147 1261 D
S
N
1198 1261 M
1198 1266 D
S
N
1249 1276 M
1249 1261 D
S
N
1301 1261 M
1301 1266 D
S
N
1352 1266 M
1352 1261 D
S
N
1403 1261 M
1403 1266 D
S
N
1454 1266 M
1454 1261 D
S
N
1506 1261 M
1506 1276 D
S
N
1557 1266 M
1557 1261 D
S
N
1608 1261 M
1608 1266 D
S
N
1659 1266 M
1659 1261 D
S
N
1711 1261 M
1711 1266 D
S
N
1762 1276 M
1762 1261 D
S
N
1813 1261 M
1813 1266 D
S
N
1864 1266 M
1864 1261 D
S
N
1916 1261 M
1916 1266 D
S
N
1967 1266 M
1967 1261 D
S
N
583 1520 M
1967 1520 D
S
N
583 1515 M
583 1520 D
S
N
634 1520 M
634 1515 D
S
N
686 1515 M
686 1520 D
S
N
737 1520 M
737 1505 D
S
N
788 1515 M
788 1520 D
S
N
839 1520 M
839 1515 D
S
N
891 1515 M
891 1520 D
S
N
942 1520 M
942 1515 D
S
N
993 1505 M
993 1520 D
S
N
1044 1520 M
1044 1515 D
S
N
1096 1515 M
1096 1520 D
S
N
1147 1520 M
1147 1515 D
S
N
1198 1515 M
1198 1520 D
S
N
1249 1520 M
1249 1505 D
S
N
1301 1515 M
1301 1520 D
S
N
1352 1520 M
1352 1515 D
S
N
1403 1515 M
1403 1520 D
S
N
1454 1520 M
1454 1515 D
S
N
1506 1505 M
1506 1520 D
S
N
1557 1520 M
1557 1515 D
S
N
1608 1515 M
1608 1520 D
S
N
1659 1520 M
1659 1515 D
S
N
1711 1515 M
1711 1520 D
S
N
1762 1520 M
1762 1505 D
S
N
1813 1515 M
1813 1520 D
S
N
1864 1520 M
1864 1515 D
S
N
1916 1515 M
1916 1520 D
S
N
1967 1520 M
1967 1515 D
S
N
583 1261 M
583 1520 D
S
N
583 1261 M
588 1261 D
S
N
588 1273 M
583 1273 D
S
N
583 1285 M
599 1285 D
S
N
588 1297 M
583 1297 D
S
N
583 1309 M
588 1309 D
S
N
588 1321 M
583 1321 D
S
N
583 1333 M
588 1333 D
S
N
599 1345 M
583 1345 D
S
N
583 1357 M
588 1357 D
S
N
588 1369 M
583 1369 D
S
N
583 1381 M
588 1381 D
S
N
588 1394 M
583 1394 D
S
N
583 1406 M
599 1406 D
S
N
588 1418 M
583 1418 D
S
N
583 1430 M
588 1430 D
S
N
588 1442 M
583 1442 D
S
N
583 1454 M
588 1454 D
S
N
599 1466 M
583 1466 D
S
N
583 1478 M
588 1478 D
S
N
588 1490 M
583 1490 D
S
N
583 1502 M
588 1502 D
S
N
588 1514 M
583 1514 D
S
N
503 1298 M
498 1297 D
495 1292 D
494 1285 D
494 1280 D
495 1273 D
498 1268 D
503 1267 D
506 1267 D
510 1268 D
513 1273 D
515 1280 D
515 1285 D
513 1292 D
510 1297 D
506 1298 D
503 1298 D
S
N
503 1298 M
500 1297 D
498 1295 D
497 1292 D
495 1285 D
495 1280 D
497 1273 D
498 1270 D
500 1268 D
503 1267 D
S
N
506 1267 M
509 1268 D
510 1270 D
512 1273 D
513 1280 D
513 1285 D
512 1292 D
510 1295 D
509 1297 D
506 1298 D
S
N
527 1270 M
525 1268 D
527 1267 D
528 1268 D
527 1270 D
S
N
547 1298 M
542 1297 D
541 1294 D
541 1289 D
542 1286 D
547 1285 D
553 1285 D
557 1286 D
559 1289 D
559 1294 D
557 1297 D
553 1298 D
547 1298 D
S
N
547 1298 M
544 1297 D
542 1294 D
542 1289 D
544 1286 D
547 1285 D
S
N
553 1285 M
556 1286 D
557 1289 D
557 1294 D
556 1297 D
553 1298 D
S
N
547 1285 M
542 1283 D
541 1282 D
539 1279 D
539 1273 D
541 1270 D
542 1268 D
547 1267 D
553 1267 D
557 1268 D
559 1270 D
560 1273 D
560 1279 D
559 1282 D
557 1283 D
553 1285 D
S
N
547 1285 M
544 1283 D
542 1282 D
541 1279 D
541 1273 D
542 1270 D
544 1268 D
547 1267 D
S
N
553 1267 M
556 1268 D
557 1270 D
559 1273 D
559 1279 D
557 1282 D
556 1283 D
553 1285 D
S
N
503 1359 M
498 1357 D
495 1353 D
494 1345 D
494 1341 D
495 1333 D
498 1329 D
503 1327 D
506 1327 D
510 1329 D
513 1333 D
515 1341 D
515 1345 D
513 1353 D
510 1357 D
506 1359 D
503 1359 D
S
N
503 1359 M
500 1357 D
498 1356 D
497 1353 D
495 1345 D
495 1341 D
497 1333 D
498 1330 D
500 1329 D
503 1327 D
S
N
506 1327 M
509 1329 D
510 1330 D
512 1333 D
513 1341 D
513 1345 D
512 1353 D
510 1356 D
509 1357 D
506 1359 D
S
N
527 1330 M
525 1329 D
527 1327 D
528 1329 D
527 1330 D
S
N
559 1348 M
557 1344 D
554 1341 D
550 1339 D
548 1339 D
544 1341 D
541 1344 D
539 1348 D
539 1350 D
541 1354 D
544 1357 D
548 1359 D
551 1359 D
556 1357 D
559 1354 D
560 1350 D
560 1341 D
559 1335 D
557 1332 D
554 1329 D
550 1327 D
545 1327 D
542 1329 D
541 1332 D
541 1333 D
542 1335 D
544 1333 D
542 1332 D
S
N
548 1339 M
545 1341 D
542 1344 D
541 1348 D
541 1350 D
542 1354 D
545 1357 D
548 1359 D
S
N
551 1359 M
554 1357 D
557 1354 D
559 1350 D
559 1341 D
557 1335 D
556 1332 D
553 1329 D
550 1327 D
S
N
498 1413 M
501 1415 D
506 1419 D
506 1387 D
S
N
504 1418 M
504 1387 D
S
N
498 1387 M
512 1387 D
S
N
527 1390 M
525 1389 D
527 1387 D
528 1389 D
527 1390 D
S
N
548 1419 M
544 1418 D
541 1413 D
539 1406 D
539 1401 D
541 1394 D
544 1389 D
548 1387 D
551 1387 D
556 1389 D
559 1394 D
560 1401 D
560 1406 D
559 1413 D
556 1418 D
551 1419 D
548 1419 D
S
N
548 1419 M
545 1418 D
544 1416 D
542 1413 D
541 1406 D
541 1401 D
542 1394 D
544 1390 D
545 1389 D
548 1387 D
S
N
551 1387 M
554 1389 D
556 1390 D
557 1394 D
559 1401 D
559 1406 D
557 1413 D
556 1416 D
554 1418 D
551 1419 D
S
N
498 1473 M
501 1475 D
506 1480 D
506 1448 D
S
N
504 1478 M
504 1448 D
S
N
498 1448 M
512 1448 D
S
N
527 1451 M
525 1449 D
527 1448 D
528 1449 D
527 1451 D
S
N
544 1473 M
547 1475 D
551 1480 D
551 1448 D
S
N
550 1478 M
550 1448 D
S
N
544 1448 M
557 1448 D
S
N
1967 1261 M
1967 1520 D
S
N
1962 1261 M
1967 1261 D
S
N
1967 1273 M
1962 1273 D
S
N
1951 1285 M
1967 1285 D
S
N
1967 1297 M
1962 1297 D
S
N
1962 1309 M
1967 1309 D
S
N
1967 1321 M
1962 1321 D
S
N
1962 1333 M
1967 1333 D
S
N
1967 1345 M
1951 1345 D
S
N
1962 1357 M
1967 1357 D
S
N
1967 1369 M
1962 1369 D
S
N
1962 1381 M
1967 1381 D
S
N
1967 1394 M
1962 1394 D
S
N
1951 1406 M
1967 1406 D
S
N
1967 1418 M
1962 1418 D
S
N
1962 1430 M
1967 1430 D
S
N
1967 1442 M
1962 1442 D
S
N
1962 1454 M
1967 1454 D
S
N
1967 1466 M
1951 1466 D
S
N
1962 1478 M
1967 1478 D
S
N
1967 1490 M
1962 1490 D
S
N
1962 1502 M
1967 1502 D
S
N
1967 1514 M
1962 1514 D
S
583 1418 P
N
583 1418 M
583 1417 D
609 1417 D
609 1418 D
634 1418 D
634 1418 D
660 1418 D
660 1417 D
686 1417 D
686 1417 D
711 1417 D
S
N
711 1417 M
711 1417 D
737 1417 D
737 1417 D
762 1417 D
762 1417 D
788 1417 D
788 1417 D
814 1417 D
814 1417 D
839 1417 D
839 1417 D
865 1417 D
865 1417 D
891 1417 D
891 1417 D
916 1417 D
916 1417 D
942 1417 D
942 1417 D
967 1417 D
967 1417 D
993 1417 D
993 1417 D
1019 1417 D
1019 1418 D
1044 1418 D
1044 1418 D
1070 1418 D
1070 1419 D
1096 1419 D
1096 1420 D
1121 1420 D
1121 1420 D
1147 1420 D
1147 1421 D
1172 1421 D
1172 1422 D
1198 1422 D
1198 1423 D
1224 1423 D
1224 1423 D
1249 1423 D
1249 1424 D
1275 1424 D
1275 1424 D
1301 1424 D
1301 1425 D
1326 1425 D
1326 1425 D
1352 1425 D
1352 1426 D
1378 1426 D
1378 1426 D
1403 1426 D
1403 1427 D
1429 1427 D
1429 1427 D
1454 1427 D
1454 1428 D
1480 1428 D
1480 1428 D
1506 1428 D
1506 1428 D
1531 1428 D
1531 1429 D
1557 1429 D
1557 1429 D
1583 1429 D
1583 1430 D
1608 1430 D
1608 1431 D
1634 1431 D
1634 1432 D
1659 1432 D
1659 1433 D
1685 1433 D
1685 1434 D
1711 1434 D
1711 1435 D
1736 1435 D
1736 1437 D
1762 1437 D
1762 1438 D
1788 1438 D
1788 1440 D
1813 1440 D
1813 1442 D
1839 1442 D
1839 1445 D
1864 1445 D
1864 1446 D
1890 1446 D
1890 1451 D
1916 1451 D
1916 1453 D
1941 1453 D
1941 1459 D
1967 1459 D
S
583 1396 P
N
583 1396 M
583 1397 D
609 1397 D
609 1396 D
634 1396 D
634 1396 D
660 1396 D
660 1397 D
686 1397 D
686 1397 D
711 1397 D
711 1397 D
737 1397 D
737 1397 D
762 1397 D
762 1397 D
788 1397 D
788 1397 D
814 1397 D
814 1397 D
839 1397 D
839 1397 D
865 1397 D
865 1397 D
891 1397 D
891 1397 D
916 1397 D
916 1396 D
942 1396 D
942 1396 D
967 1396 D
967 1395 D
993 1395 D
993 1394 D
1019 1394 D
1019 1394 D
1044 1394 D
1044 1392 D
1070 1392 D
1070 1391 D
1096 1391 D
1096 1390 D
1121 1390 D
1121 1389 D
1147 1389 D
1147 1388 D
1172 1388 D
1172 1387 D
1198 1387 D
1198 1386 D
1224 1386 D
1224 1386 D
1249 1386 D
1249 1385 D
1275 1385 D
1275 1384 D
1301 1384 D
1301 1383 D
1326 1383 D
1326 1382 D
1352 1382 D
1352 1382 D
1378 1382 D
1378 1381 D
1403 1381 D
1403 1380 D
1429 1380 D
1429 1380 D
1454 1380 D
1454 1379 D
1480 1379 D
1480 1379 D
1506 1379 D
1506 1379 D
1531 1379 D
1531 1378 D
1557 1378 D
1557 1378 D
1583 1378 D
1583 1377 D
1608 1377 D
1608 1376 D
1634 1376 D
1634 1376 D
1659 1376 D
1659 1375 D
1685 1375 D
1685 1374 D
1711 1374 D
1711 1373 D
1736 1373 D
1736 1372 D
1762 1372 D
1762 1371 D
1788 1371 D
1788 1369 D
1813 1369 D
1813 1367 D
1839 1367 D
1839 1365 D
1864 1365 D
1864 1364 D
1890 1364 D
1890 1360 D
1916 1360 D
1916 1359 D
1941 1359 D
1941 1354 D
1967 1354 D
S
N
721 1304 M
808 1304 D
S
0 0 1 setrgbcolor
583 1417 P
N
583 1417 M
583 1413 D
592 1413 D
S
N
604 1413 M
609 1413 D
609 1410 D
612 1410 D
S
N
624 1410 M
634 1410 D
634 1412 D
S
N
646 1412 M
658 1412 D
S
N
669 1413 M
681 1413 D
S
N
690 1410 M
702 1410 D
S
N
711 1413 M
711 1414 D
723 1414 D
S
N
735 1414 M
737 1414 D
737 1412 D
745 1412 D
S
N
757 1412 M
762 1412 D
762 1410 D
767 1410 D
S
N
779 1410 M
788 1410 D
788 1409 D
791 1409 D
S
N
803 1409 M
814 1409 D
814 1410 D
814 1410 D
S
N
826 1410 M
838 1410 D
S
N
848 1408 M
861 1408 D
S
N
870 1411 M
882 1411 D
S
N
892 1410 M
904 1410 D
S
N
916 1410 M
916 1412 D
926 1412 D
S
N
938 1412 M
942 1412 D
942 1411 D
949 1411 D
S
N
961 1411 M
967 1411 D
967 1409 D
972 1409 D
S
N
984 1409 M
993 1409 D
993 1409 D
995 1409 D
S
N
1007 1409 M
1019 1409 D
1019 1409 D
1019 1409 D
S
N
1031 1409 M
1043 1409 D
S
N
1054 1407 M
1066 1407 D
S
N
1077 1408 M
1089 1408 D
S
N
1101 1409 M
1113 1409 D
S
N
1122 1406 M
1134 1406 D
S
N
1146 1406 M
1147 1406 D
1147 1406 D
1158 1406 D
S
N
1170 1406 M
1172 1406 D
1172 1408 D
1181 1408 D
S
N
1193 1408 M
1198 1408 D
1198 1408 D
1205 1408 D
S
N
1217 1408 M
1224 1408 D
1224 1413 D
S
N
1232 1417 M
1244 1417 D
S
N
1249 1410 M
1249 1410 D
1261 1410 D
S
N
1274 1410 M
1275 1410 D
1275 1411 D
1285 1411 D
S
N
1297 1411 M
1301 1411 D
1301 1412 D
1307 1412 D
S
N
1319 1412 M
1326 1412 D
1326 1417 D
S
N
1337 1419 M
1349 1419 D
S
N
1359 1421 M
1371 1421 D
S
N
1379 1426 M
1391 1426 D
S
N
1403 1426 M
1403 1426 D
1403 1435 D
1405 1435 D
S
N
1418 1435 M
1429 1435 D
1429 1436 D
S
N
1440 1437 M
1452 1437 D
S
N
1454 1447 M
1454 1447 D
1466 1447 D
S
N
1478 1447 M
1480 1447 D
1480 1457 D
1480 1457 D
S
N
1492 1457 M
1504 1457 D
S
N
1506 1468 M
1506 1475 D
1511 1475 D
S
N
1523 1475 M
1531 1475 D
1531 1479 D
S
N
1542 1481 M
1554 1481 D
S
N
1557 1490 M
1557 1494 D
1565 1494 D
S
N
1577 1494 M
1583 1494 D
1583 1500 D
S
N
1583 1512 M
1583 1520 D
1587 1520 D
S
N
1599 1520 M
1608 1520 D
1608 1520 D
S
583 1341 P
N
583 1341 M
583 1348 D
588 1348 D
S
N
600 1348 M
609 1348 D
609 1344 D
S
N
611 1334 M
623 1334 D
S
N
634 1333 M
634 1328 D
641 1328 D
S
N
653 1328 M
660 1328 D
660 1333 D
S
N
666 1338 M
679 1338 D
S
N
689 1337 M
701 1337 D
S
N
713 1336 M
725 1336 D
S
N
737 1336 M
737 1334 D
747 1334 D
S
N
759 1334 M
762 1334 D
762 1343 D
762 1343 D
S
N
775 1343 M
787 1343 D
S
N
795 1347 M
807 1347 D
S
N
814 1341 M
814 1332 D
817 1332 D
S
N
829 1332 M
839 1332 D
839 1334 D
S
N
848 1338 M
860 1338 D
S
N
871 1337 M
883 1337 D
S
N
891 1342 M
891 1344 D
901 1344 D
S
N
913 1344 M
916 1344 D
916 1335 D
S
N
927 1334 M
939 1334 D
S
N
943 1342 M
956 1342 D
S
N
967 1342 M
967 1346 D
976 1346 D
S
N
988 1346 M
993 1346 D
993 1346 D
999 1346 D
S
N
1012 1346 M
1019 1346 D
1019 1347 D
1023 1347 D
S
N
1035 1347 M
1044 1347 D
1044 1350 D
S
N
1056 1351 M
1068 1351 D
S
N
1075 1356 M
1087 1356 D
S
N
1096 1359 M
1096 1361 D
1106 1361 D
S
N
1118 1361 M
1121 1361 D
1121 1361 D
1130 1361 D
S
N
1142 1361 M
1147 1361 D
1147 1366 D
1150 1366 D
S
N
1162 1366 M
1172 1366 D
1172 1367 D
S
N
1180 1371 M
1192 1371 D
S
N
1203 1373 M
1215 1373 D
S
N
1224 1369 M
1224 1364 D
1230 1364 D
S
N
1243 1364 M
1249 1364 D
1249 1369 D
1250 1369 D
S
N
1262 1369 M
1274 1369 D
S
N
1281 1364 M
1293 1364 D
S
N
1302 1361 M
1314 1361 D
S
N
1326 1360 M
1326 1356 D
1334 1356 D
S
N
1346 1356 M
1352 1356 D
1352 1353 D
1356 1353 D
S
N
1368 1353 M
1378 1353 D
1378 1351 D
S
N
1388 1350 M
1400 1350 D
S
N
1406 1343 M
1418 1343 D
S
N
1429 1342 M
1429 1341 D
1440 1341 D
S
N
1452 1341 M
1454 1341 D
1454 1335 D
1458 1335 D
S
N
1470 1335 M
1480 1335 D
1480 1333 D
S
N
1489 1330 M
1502 1330 D
S
N
1506 1322 M
1518 1322 D
S
N
1530 1322 M
1531 1322 D
1531 1319 D
1539 1319 D
S
N
1551 1319 M
1557 1319 D
1557 1313 D
1557 1313 D
S
N
1569 1313 M
1582 1313 D
S
N
1583 1302 M
1583 1302 D
1595 1302 D
S
N
1607 1302 M
1608 1302 D
1608 1294 D
1611 1294 D
S
N
1623 1294 M
1634 1294 D
1634 1293 D
S
N
1635 1282 M
1647 1282 D
S
N
1659 1282 M
1659 1270 D
1660 1270 D
S
N
1672 1270 M
1684 1270 D
S
N
1687 1261 M
1699 1261 D
S
N
721 1477 M
734 1477 D
S
N
746 1477 M
758 1477 D
S
N
770 1477 M
782 1477 D
S
N
794 1477 M
806 1477 D
S
3 Sw
0 0 0 setrgbcolor
N
833 1230 M
833 1201 D
S
N
834 1230 M
834 1201 D
S
N
829 1230 M
845 1230 D
849 1228 D
851 1227 D
852 1224 D
852 1220 D
851 1217 D
849 1216 D
845 1215 D
834 1215 D
S
N
845 1230 M
848 1228 D
849 1227 D
851 1224 D
851 1220 D
849 1217 D
848 1216 D
845 1215 D
S
N
829 1201 M
838 1201 D
S
N
870 1230 M
866 1228 D
863 1226 D
862 1223 D
860 1217 D
860 1213 D
862 1208 D
863 1205 D
866 1202 D
870 1201 D
873 1201 D
877 1202 D
879 1205 D
881 1208 D
882 1213 D
882 1217 D
881 1223 D
879 1226 D
877 1228 D
873 1230 D
870 1230 D
S
N
870 1230 M
867 1228 D
864 1226 D
863 1223 D
862 1217 D
862 1213 D
863 1208 D
864 1205 D
867 1202 D
870 1201 D
S
N
873 1201 M
875 1202 D
878 1205 D
879 1208 D
881 1213 D
881 1217 D
879 1223 D
878 1226 D
875 1228 D
873 1230 D
S
N
892 1230 M
897 1201 D
S
N
893 1230 M
897 1208 D
S
N
903 1230 M
897 1201 D
S
N
903 1230 M
908 1201 D
S
N
904 1230 M
908 1208 D
S
N
914 1230 M
908 1201 D
S
N
888 1230 M
897 1230 D
S
N
910 1230 M
918 1230 D
S
N
926 1230 M
926 1201 D
S
N
927 1230 M
927 1201 D
S
N
944 1230 M
944 1201 D
S
N
945 1230 M
945 1201 D
S
N
922 1230 M
931 1230 D
S
N
940 1230 M
949 1230 D
S
N
927 1216 M
944 1216 D
S
N
922 1201 M
931 1201 D
S
N
940 1201 M
949 1201 D
S
N
959 1230 M
959 1201 D
S
N
960 1230 M
960 1201 D
S
N
968 1222 M
968 1211 D
S
N
955 1230 M
977 1230 D
977 1222 D
975 1230 D
S
N
960 1216 M
968 1216 D
S
N
955 1201 M
977 1201 D
977 1209 D
975 1201 D
S
N
988 1230 M
988 1201 D
S
N
989 1230 M
989 1201 D
S
N
983 1230 M
993 1230 D
S
N
983 1201 M
1004 1201 D
1004 1209 D
1003 1201 D
S
N
1012 1220 M
1011 1219 D
1012 1217 D
1014 1219 D
1012 1220 D
S
N
1012 1204 M
1011 1202 D
1012 1201 D
1014 1202 D
1012 1204 D
S
N
1048 1220 M
1048 1191 D
S
N
1049 1220 M
1049 1191 D
S
N
1049 1216 M
1052 1219 D
1055 1220 D
1057 1220 D
1061 1219 D
1064 1216 D
1066 1212 D
1066 1209 D
1064 1205 D
1061 1202 D
1057 1201 D
1055 1201 D
1052 1202 D
1049 1205 D
S
N
1057 1220 M
1060 1219 D
1063 1216 D
1064 1212 D
1064 1209 D
1063 1205 D
1060 1202 D
1057 1201 D
S
N
1044 1220 M
1049 1220 D
S
N
1044 1191 M
1053 1191 D
S
N
1075 1220 M
1083 1201 D
S
N
1077 1220 M
1083 1204 D
S
N
1092 1220 M
1083 1201 D
1081 1196 D
1078 1193 D
1075 1191 D
1074 1191 D
1072 1193 D
1074 1194 D
1075 1193 D
S
N
1072 1220 M
1081 1220 D
S
N
1086 1220 M
1094 1220 D
S
N
1103 1230 M
1103 1207 D
1104 1202 D
1107 1201 D
1109 1201 D
1112 1202 D
1114 1205 D
S
N
1104 1230 M
1104 1207 D
1105 1202 D
1107 1201 D
S
N
1098 1220 M
1109 1220 D
S
N
1123 1230 M
1123 1201 D
S
N
1124 1230 M
1124 1201 D
S
N
1124 1216 M
1127 1219 D
1131 1220 D
1134 1220 D
1138 1219 D
1140 1216 D
1140 1201 D
S
N
1134 1220 M
1137 1219 D
1138 1216 D
1138 1201 D
S
N
1119 1230 M
1124 1230 D
S
N
1119 1201 M
1129 1201 D
S
N
1134 1201 M
1144 1201 D
S
N
1153 1230 M
1152 1228 D
1153 1227 D
1155 1228 D
1153 1230 D
S
N
1153 1220 M
1153 1201 D
S
N
1155 1220 M
1155 1201 D
S
N
1149 1220 M
1155 1220 D
S
N
1149 1201 M
1159 1201 D
S
N
1168 1217 M
1168 1216 D
1167 1216 D
1167 1217 D
1168 1219 D
1171 1220 D
1176 1220 D
1179 1219 D
1181 1217 D
1182 1215 D
1182 1205 D
1183 1202 D
1185 1201 D
S
N
1181 1217 M
1181 1205 D
1182 1202 D
1185 1201 D
1186 1201 D
S
N
1181 1215 M
1179 1213 D
1171 1212 D
1167 1211 D
1166 1208 D
1166 1205 D
1167 1202 D
1171 1201 D
1175 1201 D
1178 1202 D
1181 1205 D
S
N
1171 1212 M
1168 1211 D
1167 1208 D
1167 1205 D
1168 1202 D
1171 1201 D
S
N
1216 1235 M
1192 1191 D
S
N
1226 1230 M
1226 1201 D
S
N
1227 1230 M
1227 1201 D
S
N
1227 1216 M
1230 1219 D
1234 1220 D
1237 1220 D
1241 1219 D
1242 1216 D
1242 1201 D
S
N
1237 1220 M
1239 1219 D
1241 1216 D
1241 1201 D
S
N
1222 1230 M
1227 1230 D
S
N
1222 1201 M
1231 1201 D
S
N
1237 1201 M
1246 1201 D
S
N
1254 1212 M
1271 1212 D
1271 1215 D
1270 1217 D
1268 1219 D
1265 1220 D
1261 1220 D
1257 1219 D
1254 1216 D
1253 1212 D
1253 1209 D
1254 1205 D
1257 1202 D
1261 1201 D
1264 1201 D
1268 1202 D
1271 1205 D
S
N
1270 1212 M
1270 1216 D
1268 1219 D
S
N
1261 1220 M
1259 1219 D
1256 1216 D
1254 1212 D
1254 1209 D
1256 1205 D
1259 1202 D
1261 1201 D
S
N
1282 1220 M
1282 1201 D
S
N
1283 1220 M
1283 1201 D
S
N
1283 1212 M
1285 1216 D
1287 1219 D
1290 1220 D
1294 1220 D
1296 1219 D
1296 1217 D
1294 1216 D
1293 1217 D
1294 1219 D
S
N
1278 1220 M
1283 1220 D
S
N
1278 1201 M
1287 1201 D
S
N
1304 1220 M
1309 1201 D
S
N
1305 1220 M
1309 1205 D
S
N
1315 1220 M
1309 1201 D
S
N
1315 1220 M
1320 1201 D
S
N
1316 1220 M
1320 1205 D
S
N
1326 1220 M
1320 1201 D
S
N
1300 1220 M
1309 1220 D
S
N
1322 1220 M
1330 1220 D
S
N
1338 1230 M
1337 1228 D
1338 1227 D
1339 1228 D
1338 1230 D
S
N
1338 1220 M
1338 1201 D
S
N
1339 1220 M
1339 1201 D
S
N
1334 1220 M
1339 1220 D
S
N
1334 1201 M
1343 1201 D
S
N
1357 1220 M
1354 1219 D
1353 1217 D
1352 1215 D
1352 1212 D
1353 1209 D
1354 1208 D
1357 1207 D
1360 1207 D
1363 1208 D
1364 1209 D
1365 1212 D
1365 1215 D
1364 1217 D
1363 1219 D
1360 1220 D
1357 1220 D
S
N
1354 1219 M
1353 1216 D
1353 1211 D
1354 1208 D
S
N
1363 1208 M
1364 1211 D
1364 1216 D
1363 1219 D
S
N
1364 1217 M
1365 1219 D
1368 1220 D
1368 1219 D
1365 1219 D
S
N
1353 1209 M
1352 1208 D
1350 1205 D
1350 1204 D
1352 1201 D
1356 1200 D
1363 1200 D
1367 1198 D
1368 1197 D
S
N
1350 1204 M
1352 1202 D
1356 1201 D
1363 1201 D
1367 1200 D
1368 1197 D
1368 1196 D
1367 1193 D
1363 1191 D
1354 1191 D
1350 1193 D
1349 1196 D
1349 1197 D
1350 1200 D
1354 1201 D
S
N
833 1057 M
833 1028 D
S
N
834 1057 M
834 1028 D
S
N
829 1057 M
845 1057 D
849 1055 D
851 1054 D
852 1051 D
852 1047 D
851 1044 D
849 1043 D
845 1042 D
834 1042 D
S
N
845 1057 M
848 1055 D
849 1054 D
851 1051 D
851 1047 D
849 1044 D
848 1043 D
845 1042 D
S
N
829 1028 M
838 1028 D
S
N
870 1057 M
866 1055 D
863 1053 D
862 1050 D
860 1044 D
860 1040 D
862 1035 D
863 1032 D
866 1029 D
870 1028 D
873 1028 D
877 1029 D
879 1032 D
881 1035 D
882 1040 D
882 1044 D
881 1050 D
879 1053 D
877 1055 D
873 1057 D
870 1057 D
S
N
870 1057 M
867 1055 D
864 1053 D
863 1050 D
862 1044 D
862 1040 D
863 1035 D
864 1032 D
867 1029 D
870 1028 D
S
N
873 1028 M
875 1029 D
878 1032 D
879 1035 D
881 1040 D
881 1044 D
879 1050 D
878 1053 D
875 1055 D
873 1057 D
S
N
892 1057 M
897 1028 D
S
N
893 1057 M
897 1035 D
S
N
903 1057 M
897 1028 D
S
N
903 1057 M
908 1028 D
S
N
904 1057 M
908 1035 D
S
N
914 1057 M
908 1028 D
S
N
888 1057 M
897 1057 D
S
N
910 1057 M
918 1057 D
S
N
926 1057 M
926 1028 D
S
N
927 1057 M
927 1028 D
S
N
944 1057 M
944 1028 D
S
N
945 1057 M
945 1028 D
S
N
922 1057 M
931 1057 D
S
N
940 1057 M
949 1057 D
S
N
927 1043 M
944 1043 D
S
N
922 1028 M
931 1028 D
S
N
940 1028 M
949 1028 D
S
N
959 1057 M
959 1028 D
S
N
960 1057 M
960 1028 D
S
N
968 1049 M
968 1038 D
S
N
955 1057 M
977 1057 D
977 1049 D
975 1057 D
S
N
960 1043 M
968 1043 D
S
N
955 1028 M
977 1028 D
977 1036 D
975 1028 D
S
N
988 1057 M
988 1028 D
S
N
989 1057 M
989 1028 D
S
N
983 1057 M
993 1057 D
S
N
983 1028 M
1004 1028 D
1004 1036 D
1003 1028 D
S
N
1033 1062 M
1008 1018 D
S
N
1042 1044 M
1042 1043 D
1041 1043 D
1041 1044 D
1042 1046 D
1045 1047 D
1051 1047 D
1053 1046 D
1055 1044 D
1056 1042 D
1056 1032 D
1057 1029 D
1059 1028 D
S
N
1055 1044 M
1055 1032 D
1056 1029 D
1059 1028 D
1060 1028 D
S
N
1055 1042 M
1053 1040 D
1045 1039 D
1041 1038 D
1040 1035 D
1040 1032 D
1041 1029 D
1045 1028 D
1049 1028 D
1052 1029 D
1055 1032 D
S
N
1045 1039 M
1042 1038 D
1041 1035 D
1041 1032 D
1042 1029 D
1045 1028 D
S
N
1070 1057 M
1070 1028 D
S
N
1071 1057 M
1079 1032 D
S
N
1070 1057 M
1079 1028 D
S
N
1089 1057 M
1079 1028 D
S
N
1089 1057 M
1089 1028 D
S
N
1090 1057 M
1090 1028 D
S
N
1066 1057 M
1071 1057 D
S
N
1089 1057 M
1094 1057 D
S
N
1066 1028 M
1074 1028 D
S
N
1085 1028 M
1094 1028 D
S
N
1120 1053 M
1122 1049 D
1122 1057 D
1120 1053 D
1118 1055 D
1114 1057 D
1111 1057 D
1107 1055 D
1104 1053 D
1103 1050 D
1101 1046 D
1101 1039 D
1103 1035 D
1104 1032 D
1107 1029 D
1111 1028 D
1114 1028 D
1118 1029 D
1120 1032 D
1122 1035 D
S
N
1111 1057 M
1108 1055 D
1105 1053 D
1104 1050 D
1103 1046 D
1103 1039 D
1104 1035 D
1105 1032 D
1108 1029 D
1111 1028 D
S
N
1150 1046 M
1149 1049 D
1146 1050 D
1142 1050 D
1140 1049 D
1138 1047 D
1137 1043 D
1137 1039 D
1138 1036 D
1141 1035 D
1145 1035 D
1148 1036 D
1149 1039 D
S
N
1142 1050 M
1140 1047 D
1138 1043 D
1138 1039 D
1140 1036 D
1141 1035 D
S
N
1150 1050 M
1149 1039 D
1149 1036 D
1152 1035 D
1155 1035 D
1157 1038 D
1159 1042 D
1159 1044 D
1157 1049 D
1156 1051 D
1153 1054 D
1150 1055 D
1146 1057 D
1142 1057 D
1138 1055 D
1135 1054 D
1133 1051 D
1131 1049 D
1130 1044 D
1130 1040 D
1131 1036 D
1133 1034 D
1135 1031 D
1138 1029 D
1142 1028 D
1146 1028 D
1150 1029 D
1153 1031 D
1155 1032 D
S
N
1152 1050 M
1150 1039 D
1150 1036 D
1152 1035 D
S
N
1170 1057 M
1170 1028 D
S
N
1171 1057 M
1187 1031 D
S
N
1171 1054 M
1187 1028 D
S
N
1187 1057 M
1187 1028 D
S
N
1166 1057 M
1171 1057 D
S
N
1183 1057 M
1192 1057 D
S
N
1166 1028 M
1174 1028 D
S
N
1201 1057 M
1201 1028 D
S
N
1202 1057 M
1202 1028 D
S
N
1197 1057 M
1207 1057 D
S
N
1197 1028 M
1218 1028 D
1218 1036 D
1216 1028 D
S
N
1233 1057 M
1228 1055 D
1226 1053 D
1224 1050 D
1223 1044 D
1223 1040 D
1224 1035 D
1226 1032 D
1228 1029 D
1233 1028 D
1235 1028 D
1239 1029 D
1242 1032 D
1244 1035 D
1245 1040 D
1245 1044 D
1244 1050 D
1242 1053 D
1239 1055 D
1235 1057 D
1233 1057 D
S
N
1233 1057 M
1230 1055 D
1227 1053 D
1226 1050 D
1224 1044 D
1224 1040 D
1226 1035 D
1227 1032 D
1230 1029 D
1233 1028 D
S
N
1235 1028 M
1238 1029 D
1241 1032 D
1242 1035 D
1244 1040 D
1244 1044 D
1242 1050 D
1241 1053 D
1238 1055 D
1235 1057 D
S
4 Sw
N
1543 906 M
1543 874 D
S
N
1544 906 M
1544 874 D
S
N
1538 906 M
1544 906 D
S
N
1538 874 M
1549 874 D
S
N
1566 895 M
1561 894 D
1558 891 D
1556 886 D
1556 883 D
1558 879 D
1561 876 D
1566 874 D
1569 874 D
1573 876 D
1576 879 D
1578 883 D
1578 886 D
1576 891 D
1573 894 D
1569 895 D
1566 895 D
S
N
1566 895 M
1563 894 D
1559 891 D
1558 886 D
1558 883 D
1559 879 D
1563 876 D
1566 874 D
S
N
1569 874 M
1572 876 D
1575 879 D
1576 883 D
1576 886 D
1575 891 D
1572 894 D
1569 895 D
S
N
1594 895 M
1591 894 D
1590 892 D
1588 889 D
1588 886 D
1590 883 D
1591 882 D
1594 880 D
1597 880 D
1600 882 D
1602 883 D
1603 886 D
1603 889 D
1602 892 D
1600 894 D
1597 895 D
1594 895 D
S
N
1591 894 M
1590 891 D
1590 885 D
1591 882 D
S
N
1600 882 M
1602 885 D
1602 891 D
1600 894 D
S
N
1602 892 M
1603 894 D
1606 895 D
1606 894 D
1603 894 D
S
N
1590 883 M
1588 882 D
1587 879 D
1587 877 D
1588 874 D
1593 873 D
1600 873 D
1605 871 D
1606 870 D
S
N
1587 877 M
1588 876 D
1593 874 D
1600 874 D
1605 873 D
1606 870 D
1606 868 D
1605 865 D
1600 864 D
1591 864 D
1587 865 D
1585 868 D
1585 870 D
1587 873 D
1591 874 D
S
N
1617 912 M
1617 864 D
S
N
1618 912 M
1618 864 D
S
N
1617 912 M
1627 912 D
S
N
1617 864 M
1627 864 D
S
N
1639 895 M
1639 864 D
S
N
1641 895 M
1641 864 D
S
N
1641 891 M
1644 894 D
1647 895 D
1650 895 D
1655 894 D
1658 891 D
1659 886 D
1659 883 D
1658 879 D
1655 876 D
1650 874 D
1647 874 D
1644 876 D
1641 879 D
S
N
1650 895 M
1653 894 D
1656 891 D
1658 886 D
1658 883 D
1656 879 D
1653 876 D
1650 874 D
S
N
1635 895 M
1641 895 D
S
N
1635 864 M
1646 864 D
S
N
1675 883 M
1675 862 D
S
N
1676 883 M
1676 862 D
S
N
1669 883 M
1668 877 D
1668 883 D
1683 883 D
1683 877 D
1682 883 D
S
N
1672 862 M
1679 862 D
S
N
1703 912 M
1700 909 D
1697 904 D
1694 898 D
1693 891 D
1693 885 D
1694 877 D
1697 871 D
1700 867 D
1703 864 D
S
N
1700 909 M
1697 903 D
1696 898 D
1694 891 D
1694 885 D
1696 877 D
1697 873 D
1700 867 D
S
N
1715 906 M
1715 880 D
1717 876 D
1720 874 D
1723 874 D
1726 876 D
1728 879 D
S
N
1717 906 M
1717 880 D
1718 876 D
1720 874 D
S
N
1711 895 M
1723 895 D
S
N
1738 906 M
1738 880 D
1740 876 D
1743 874 D
1746 874 D
1749 876 D
1750 879 D
S
N
1740 906 M
1740 880 D
1741 876 D
1743 874 D
S
N
1734 895 M
1746 895 D
S
N
1729 915 M
1762 915 D
S
N
1770 906 M
1770 874 D
S
N
1771 906 M
1771 874 D
S
N
1789 906 M
1789 874 D
S
N
1791 906 M
1791 874 D
S
N
1765 906 M
1776 906 D
S
N
1785 906 M
1795 906 D
S
N
1771 891 M
1789 891 D
S
N
1765 874 M
1776 874 D
S
N
1785 874 M
1795 874 D
S
N
1803 912 M
1806 909 D
1809 904 D
1812 898 D
1814 891 D
1814 885 D
1812 877 D
1809 871 D
1806 867 D
1803 864 D
S
N
1806 909 M
1809 903 D
1811 898 D
1812 891 D
1812 885 D
1811 877 D
1809 873 D
1806 867 D
S
N
1850 912 M
1823 864 D
S
N
1878 901 M
1880 897 D
1880 906 D
1878 901 D
1875 904 D
1871 906 D
1868 906 D
1863 904 D
1860 901 D
1859 898 D
1857 894 D
1857 886 D
1859 882 D
1860 879 D
1863 876 D
1868 874 D
1871 874 D
1875 876 D
1878 879 D
S
N
1868 906 M
1865 904 D
1862 901 D
1860 898 D
1859 894 D
1859 886 D
1860 882 D
1862 879 D
1865 876 D
1868 874 D
S
N
1878 886 M
1878 874 D
S
N
1880 886 M
1880 874 D
S
N
1874 886 M
1885 886 D
S
N
1894 886 M
1912 886 D
1912 889 D
1910 892 D
1909 894 D
1906 895 D
1901 895 D
1897 894 D
1894 891 D
1892 886 D
1892 883 D
1894 879 D
1897 876 D
1901 874 D
1904 874 D
1909 876 D
1912 879 D
S
N
1910 886 M
1910 891 D
1909 894 D
S
N
1901 895 M
1898 894 D
1895 891 D
1894 886 D
1894 883 D
1895 879 D
1898 876 D
1901 874 D
S
N
1921 906 M
1931 874 D
S
N
1922 906 M
1931 879 D
S
N
1942 906 M
1931 874 D
S
N
1918 906 M
1927 906 D
S
N
1936 906 M
1945 906 D
S
N
1960 912 M
1960 864 D
S
N
1961 912 M
1961 864 D
S
N
1951 912 M
1961 912 D
S
N
1951 864 M
1961 864 D
S
N
583 1261 M
583 1001 D
S
N
583 1001 M
1967 1001 D
S
N
1967 1001 M
1967 1261 D
S
N
1967 1261 M
583 1261 D
S
N
583 1001 M
583 1006 D
S
N
634 1006 M
634 1001 D
S
N
686 1001 M
686 1006 D
S
N
737 1017 M
737 1001 D
S
N
788 1001 M
788 1006 D
S
N
839 1006 M
839 1001 D
S
N
891 1001 M
891 1006 D
S
N
942 1006 M
942 1001 D
S
N
993 1001 M
993 1017 D
S
N
1044 1006 M
1044 1001 D
S
N
1096 1001 M
1096 1006 D
S
N
1147 1006 M
1147 1001 D
S
N
1198 1001 M
1198 1006 D
S
N
1249 1017 M
1249 1001 D
S
N
1301 1001 M
1301 1006 D
S
N
1352 1006 M
1352 1001 D
S
N
1403 1001 M
1403 1006 D
S
N
1454 1006 M
1454 1001 D
S
N
1506 1001 M
1506 1017 D
S
N
1557 1006 M
1557 1001 D
S
N
1608 1001 M
1608 1006 D
S
N
1659 1006 M
1659 1001 D
S
N
1711 1001 M
1711 1006 D
S
N
1762 1017 M
1762 1001 D
S
N
1813 1001 M
1813 1006 D
S
N
1864 1006 M
1864 1001 D
S
N
1916 1001 M
1916 1006 D
S
N
1967 1006 M
1967 1001 D
S
N
713 971 M
708 970 D
705 965 D
704 958 D
704 953 D
705 946 D
708 941 D
713 940 D
716 940 D
720 941 D
723 946 D
725 953 D
725 958 D
723 965 D
720 970 D
716 971 D
713 971 D
S
N
713 971 M
710 970 D
708 968 D
707 965 D
705 958 D
705 953 D
707 946 D
708 943 D
710 941 D
713 940 D
S
N
716 940 M
719 941 D
720 943 D
722 946 D
723 953 D
723 958 D
722 965 D
720 968 D
719 970 D
716 971 D
S
N
737 943 M
735 941 D
737 940 D
738 941 D
737 943 D
S
N
752 971 M
749 956 D
S
N
749 956 M
752 959 D
756 961 D
761 961 D
765 959 D
768 956 D
770 952 D
770 949 D
768 944 D
765 941 D
761 940 D
756 940 D
752 941 D
750 943 D
749 946 D
749 947 D
750 949 D
752 947 D
750 946 D
S
N
761 961 M
764 959 D
767 956 D
768 952 D
768 949 D
767 944 D
764 941 D
761 940 D
S
N
752 971 M
767 971 D
S
N
752 970 M
759 970 D
767 971 D
S
N
964 965 M
967 967 D
972 971 D
972 940 D
S
N
970 970 M
970 940 D
S
N
964 940 M
978 940 D
S
N
993 943 M
992 941 D
993 940 D
995 941 D
993 943 D
S
N
1014 971 M
1010 970 D
1007 965 D
1005 958 D
1005 953 D
1007 946 D
1010 941 D
1014 940 D
1017 940 D
1022 941 D
1025 946 D
1026 953 D
1026 958 D
1025 965 D
1022 970 D
1017 971 D
1014 971 D
S
N
1014 971 M
1011 970 D
1010 968 D
1008 965 D
1007 958 D
1007 953 D
1008 946 D
1010 943 D
1011 941 D
1014 940 D
S
N
1017 940 M
1020 941 D
1022 943 D
1023 946 D
1025 953 D
1025 958 D
1023 965 D
1022 968 D
1020 970 D
1017 971 D
S
N
1221 965 M
1224 967 D
1228 971 D
1228 940 D
S
N
1227 970 M
1227 940 D
S
N
1221 940 M
1234 940 D
S
N
1249 943 M
1248 941 D
1249 940 D
1251 941 D
1249 943 D
S
N
1264 971 M
1261 956 D
S
N
1261 956 M
1264 959 D
1269 961 D
1273 961 D
1278 959 D
1281 956 D
1283 952 D
1283 949 D
1281 944 D
1278 941 D
1273 940 D
1269 940 D
1264 941 D
1263 943 D
1261 946 D
1261 947 D
1263 949 D
1264 947 D
1263 946 D
S
N
1273 961 M
1276 959 D
1280 956 D
1281 952 D
1281 949 D
1280 944 D
1276 941 D
1273 940 D
S
N
1264 971 M
1280 971 D
S
N
1264 970 M
1272 970 D
1280 971 D
S
N
1474 965 M
1475 964 D
1474 962 D
1472 964 D
1472 965 D
1474 968 D
1475 970 D
1480 971 D
1486 971 D
1491 970 D
1492 968 D
1494 965 D
1494 962 D
1492 959 D
1487 956 D
1480 953 D
1477 952 D
1474 949 D
1472 944 D
1472 940 D
S
N
1486 971 M
1489 970 D
1491 968 D
1492 965 D
1492 962 D
1491 959 D
1486 956 D
1480 953 D
S
N
1472 943 M
1474 944 D
1477 944 D
1484 941 D
1489 941 D
1492 943 D
1494 944 D
S
N
1477 944 M
1484 940 D
1491 940 D
1492 941 D
1494 944 D
1494 947 D
S
N
1506 943 M
1504 941 D
1506 940 D
1507 941 D
1506 943 D
S
N
1527 971 M
1522 970 D
1519 965 D
1518 958 D
1518 953 D
1519 946 D
1522 941 D
1527 940 D
1530 940 D
1534 941 D
1537 946 D
1539 953 D
1539 958 D
1537 965 D
1534 970 D
1530 971 D
1527 971 D
S
N
1527 971 M
1524 970 D
1522 968 D
1521 965 D
1519 958 D
1519 953 D
1521 946 D
1522 943 D
1524 941 D
1527 940 D
S
N
1530 940 M
1533 941 D
1534 943 D
1536 946 D
1537 953 D
1537 958 D
1536 965 D
1534 968 D
1533 970 D
1530 971 D
S
N
1730 965 M
1732 964 D
1730 962 D
1729 964 D
1729 965 D
1730 968 D
1732 970 D
1736 971 D
1742 971 D
1747 970 D
1748 968 D
1750 965 D
1750 962 D
1748 959 D
1744 956 D
1736 953 D
1733 952 D
1730 949 D
1729 944 D
1729 940 D
S
N
1742 971 M
1745 970 D
1747 968 D
1748 965 D
1748 962 D
1747 959 D
1742 956 D
1736 953 D
S
N
1729 943 M
1730 944 D
1733 944 D
1741 941 D
1745 941 D
1748 943 D
1750 944 D
S
N
1733 944 M
1741 940 D
1747 940 D
1748 941 D
1750 944 D
1750 947 D
S
N
1762 943 M
1760 941 D
1762 940 D
1763 941 D
1762 943 D
S
N
1777 971 M
1774 956 D
S
N
1774 956 M
1777 959 D
1782 961 D
1786 961 D
1791 959 D
1794 956 D
1795 952 D
1795 949 D
1794 944 D
1791 941 D
1786 940 D
1782 940 D
1777 941 D
1775 943 D
1774 946 D
1774 947 D
1775 949 D
1777 947 D
1775 946 D
S
N
1786 961 M
1789 959 D
1792 956 D
1794 952 D
1794 949 D
1792 944 D
1789 941 D
1786 940 D
S
N
1777 971 M
1792 971 D
S
N
1777 970 M
1785 970 D
1792 971 D
S
N
583 1261 M
1967 1261 D
S
N
583 1256 M
583 1261 D
S
N
634 1261 M
634 1256 D
S
N
686 1256 M
686 1261 D
S
N
737 1261 M
737 1245 D
S
N
788 1256 M
788 1261 D
S
N
839 1261 M
839 1256 D
S
N
891 1256 M
891 1261 D
S
N
942 1261 M
942 1256 D
S
N
993 1245 M
993 1261 D
S
N
1044 1261 M
1044 1256 D
S
N
1096 1256 M
1096 1261 D
S
N
1147 1261 M
1147 1256 D
S
N
1198 1256 M
1198 1261 D
S
N
1249 1261 M
1249 1245 D
S
N
1301 1256 M
1301 1261 D
S
N
1352 1261 M
1352 1256 D
S
N
1403 1256 M
1403 1261 D
S
N
1454 1261 M
1454 1256 D
S
N
1506 1245 M
1506 1261 D
S
N
1557 1261 M
1557 1256 D
S
N
1608 1256 M
1608 1261 D
S
N
1659 1261 M
1659 1256 D
S
N
1711 1256 M
1711 1261 D
S
N
1762 1261 M
1762 1245 D
S
N
1813 1256 M
1813 1261 D
S
N
1864 1261 M
1864 1256 D
S
N
1916 1256 M
1916 1261 D
S
N
1967 1261 M
1967 1256 D
S
N
583 1001 M
583 1261 D
S
N
583 1006 M
588 1006 D
S
N
588 1022 M
583 1022 D
S
N
583 1038 M
588 1038 D
S
N
599 1053 M
583 1053 D
S
N
583 1069 M
588 1069 D
S
N
588 1084 M
583 1084 D
S
N
583 1100 M
588 1100 D
S
N
588 1115 M
583 1115 D
S
N
583 1131 M
599 1131 D
S
N
588 1147 M
583 1147 D
S
N
583 1162 M
588 1162 D
S
N
588 1178 M
583 1178 D
S
N
583 1193 M
588 1193 D
S
N
599 1209 M
583 1209 D
S
N
583 1224 M
588 1224 D
S
N
588 1240 M
583 1240 D
S
N
583 1256 M
588 1256 D
S
N
503 1067 M
498 1065 D
495 1061 D
494 1053 D
494 1049 D
495 1041 D
498 1037 D
503 1035 D
506 1035 D
510 1037 D
513 1041 D
515 1049 D
515 1053 D
513 1061 D
510 1065 D
506 1067 D
503 1067 D
S
N
503 1067 M
500 1065 D
498 1064 D
497 1061 D
495 1053 D
495 1049 D
497 1041 D
498 1038 D
500 1037 D
503 1035 D
S
N
506 1035 M
509 1037 D
510 1038 D
512 1041 D
513 1049 D
513 1053 D
512 1061 D
510 1064 D
509 1065 D
506 1067 D
S
N
527 1038 M
525 1037 D
527 1035 D
528 1037 D
527 1038 D
S
N
547 1067 M
542 1065 D
541 1062 D
541 1058 D
542 1055 D
547 1053 D
553 1053 D
557 1055 D
559 1058 D
559 1062 D
557 1065 D
553 1067 D
547 1067 D
S
N
547 1067 M
544 1065 D
542 1062 D
542 1058 D
544 1055 D
547 1053 D
S
N
553 1053 M
556 1055 D
557 1058 D
557 1062 D
556 1065 D
553 1067 D
S
N
547 1053 M
542 1052 D
541 1050 D
539 1047 D
539 1041 D
541 1038 D
542 1037 D
547 1035 D
553 1035 D
557 1037 D
559 1038 D
560 1041 D
560 1047 D
559 1050 D
557 1052 D
553 1053 D
S
N
547 1053 M
544 1052 D
542 1050 D
541 1047 D
541 1041 D
542 1038 D
544 1037 D
547 1035 D
S
N
553 1035 M
556 1037 D
557 1038 D
559 1041 D
559 1047 D
557 1050 D
556 1052 D
553 1053 D
S
N
498 1139 M
501 1140 D
506 1145 D
506 1113 D
S
N
504 1143 M
504 1113 D
S
N
498 1113 M
512 1113 D
S
N
527 1116 M
525 1114 D
527 1113 D
528 1114 D
527 1116 D
S
N
548 1145 M
544 1143 D
541 1139 D
539 1131 D
539 1126 D
541 1119 D
544 1114 D
548 1113 D
551 1113 D
556 1114 D
559 1119 D
560 1126 D
560 1131 D
559 1139 D
556 1143 D
551 1145 D
548 1145 D
S
N
548 1145 M
545 1143 D
544 1142 D
542 1139 D
541 1131 D
541 1126 D
542 1119 D
544 1116 D
545 1114 D
548 1113 D
S
N
551 1113 M
554 1114 D
556 1116 D
557 1119 D
559 1126 D
559 1131 D
557 1139 D
556 1142 D
554 1143 D
551 1145 D
S
N
498 1216 M
501 1218 D
506 1222 D
506 1191 D
S
N
504 1221 M
504 1191 D
S
N
498 1191 M
512 1191 D
S
N
527 1194 M
525 1192 D
527 1191 D
528 1192 D
527 1194 D
S
N
541 1216 M
542 1215 D
541 1213 D
539 1215 D
539 1216 D
541 1219 D
542 1221 D
547 1222 D
553 1222 D
557 1221 D
559 1219 D
560 1216 D
560 1213 D
559 1210 D
554 1207 D
547 1204 D
544 1203 D
541 1200 D
539 1195 D
539 1191 D
S
N
553 1222 M
556 1221 D
557 1219 D
559 1216 D
559 1213 D
557 1210 D
553 1207 D
547 1204 D
S
N
539 1194 M
541 1195 D
544 1195 D
551 1192 D
556 1192 D
559 1194 D
560 1195 D
S
N
544 1195 M
551 1191 D
557 1191 D
559 1192 D
560 1195 D
560 1198 D
S
N
1967 1001 M
1967 1261 D
S
N
1962 1006 M
1967 1006 D
S
N
1967 1022 M
1962 1022 D
S
N
1962 1038 M
1967 1038 D
S
N
1967 1053 M
1951 1053 D
S
N
1962 1069 M
1967 1069 D
S
N
1967 1084 M
1962 1084 D
S
N
1962 1100 M
1967 1100 D
S
N
1967 1115 M
1962 1115 D
S
N
1951 1131 M
1967 1131 D
S
N
1967 1147 M
1962 1147 D
S
N
1962 1162 M
1967 1162 D
S
N
1967 1178 M
1962 1178 D
S
N
1962 1193 M
1967 1193 D
S
N
1967 1209 M
1951 1209 D
S
N
1962 1224 M
1967 1224 D
S
N
1967 1240 M
1962 1240 D
S
N
1962 1256 M
1967 1256 D
S
583 1187 P
N
583 1187 M
583 1190 D
609 1190 D
609 1183 D
634 1183 D
634 1171 D
660 1171 D
660 1160 D
686 1160 D
686 1149 D
711 1149 D
711 1141 D
737 1141 D
737 1123 D
762 1123 D
762 1128 D
788 1128 D
788 1118 D
814 1118 D
814 1122 D
839 1122 D
839 1131 D
865 1131 D
865 1125 D
891 1125 D
891 1128 D
916 1128 D
916 1124 D
942 1124 D
942 1129 D
967 1129 D
967 1119 D
993 1119 D
993 1123 D
1019 1123 D
1019 1125 D
1044 1125 D
1044 1133 D
1070 1133 D
1070 1120 D
1096 1120 D
1096 1119 D
1121 1119 D
1121 1117 D
1147 1117 D
1147 1125 D
1172 1125 D
1172 1123 D
1198 1123 D
1198 1117 D
1224 1117 D
1224 1121 D
1249 1121 D
1249 1122 D
1275 1122 D
1275 1114 D
1301 1114 D
1301 1124 D
1326 1124 D
1326 1123 D
1352 1123 D
1352 1127 D
1378 1127 D
1378 1127 D
1403 1127 D
1403 1126 D
1429 1126 D
1429 1127 D
1454 1127 D
1454 1126 D
1480 1126 D
1480 1131 D
1506 1131 D
1506 1130 D
1531 1130 D
1531 1143 D
1557 1143 D
1557 1140 D
1583 1140 D
1583 1144 D
1608 1144 D
1608 1146 D
1634 1146 D
1634 1151 D
1659 1151 D
1659 1151 D
1685 1151 D
1685 1167 D
1711 1167 D
1711 1154 D
1736 1154 D
1736 1168 D
1762 1168 D
1762 1173 D
1788 1173 D
1788 1187 D
1813 1187 D
1813 1204 D
1839 1204 D
1839 1238 D
1864 1238 D
1864 1212 D
1890 1212 D
1890 1237 D
1916 1237 D
1916 1248 D
1941 1248 D
1941 1261 D
S
N
721 1217 M
808 1217 D
S
0 0 1 setrgbcolor
N
788 1261 M
788 1253 D
792 1253 D
S
N
804 1253 M
814 1253 D
814 1250 D
S
N
815 1239 M
827 1239 D
S
N
839 1239 M
839 1239 D
839 1227 D
S
N
849 1225 M
861 1225 D
S
N
865 1217 M
865 1211 D
872 1211 D
S
N
884 1211 M
891 1211 D
891 1206 D
S
N
891 1194 M
891 1190 D
899 1190 D
S
N
911 1190 M
916 1190 D
916 1189 D
922 1189 D
S
N
935 1189 M
942 1189 D
942 1184 D
S
N
947 1177 M
959 1177 D
S
N
970 1178 M
982 1178 D
S
N
993 1177 M
993 1165 D
S
N
1003 1163 M
1015 1163 D
S
N
1023 1159 M
1036 1159 D
S
N
1044 1156 M
1044 1148 D
1049 1148 D
S
N
1061 1148 M
1070 1148 D
1070 1151 D
S
N
1080 1153 M
1092 1153 D
S
N
1102 1152 M
1114 1152 D
S
N
1121 1146 M
1121 1146 D
1133 1146 D
S
N
1145 1146 M
1147 1146 D
1147 1144 D
S
N
1147 1144 M
1155 1144 D
S
N
1167 1144 M
1172 1144 D
1172 1137 D
1173 1137 D
S
N
1185 1137 M
1197 1137 D
S
N
1207 1136 M
1219 1136 D
S
N
1227 1131 M
1239 1131 D
S
N
1249 1129 M
1249 1126 D
1259 1126 D
S
N
1271 1126 M
1275 1126 D
1275 1131 D
1279 1131 D
S
N
1291 1131 M
1301 1131 D
1301 1128 D
S
N
1303 1119 M
1315 1119 D
S
N
1326 1118 M
1326 1116 D
1337 1116 D
S
N
1349 1116 M
1352 1116 D
1352 1110 D
1355 1110 D
S
N
1367 1110 M
1378 1110 D
1378 1109 D
1378 1109 D
S
N
1391 1109 M
1403 1109 D
S
N
1408 1103 M
1420 1103 D
S
N
1432 1103 M
1444 1103 D
S
N
1454 1101 M
1454 1099 D
1464 1099 D
S
N
1476 1099 M
1480 1099 D
1480 1097 D
1487 1097 D
S
N
1499 1097 M
1506 1097 D
1506 1095 D
1509 1095 D
S
N
1521 1095 M
1531 1095 D
1531 1093 D
S
N
1541 1091 M
1553 1091 D
S
N
1563 1089 M
1575 1089 D
S
N
1585 1091 M
1597 1091 D
S
N
1608 1092 M
1608 1099 D
1613 1099 D
S
N
1625 1099 M
1634 1099 D
1634 1102 D
S
N
1644 1104 M
1656 1104 D
S
N
1663 1110 M
1675 1110 D
S
N
1685 1108 M
1685 1107 D
1696 1107 D
S
N
1708 1107 M
1711 1107 D
1711 1116 D
S
N
1719 1120 M
1731 1120 D
S
N
1736 1127 M
1736 1130 D
1746 1130 D
S
N
1758 1130 M
1762 1130 D
1762 1138 D
S
N
1773 1139 M
1785 1139 D
S
N
1793 1143 M
1805 1143 D
S
N
1814 1139 M
1826 1139 D
S
N
1838 1139 M
1839 1139 D
1839 1128 D
S
N
1849 1126 M
1861 1126 D
S
N
1864 1134 M
1864 1146 D
S
N
1870 1153 M
1882 1153 D
S
N
1890 1149 M
1890 1137 D
S
N
1890 1125 M
1902 1125 D
S
N
1914 1125 M
1916 1125 D
1916 1134 D
1918 1134 D
S
N
1930 1134 M
1941 1134 D
1941 1134 D
S
N
1941 1147 M
1941 1159 D
S
N
1941 1171 M
1941 1183 D
S
N
1941 1195 M
1941 1207 D
S
N
1949 1212 M
1961 1212 D
S
N
721 1044 M
734 1044 D
S
N
746 1044 M
758 1044 D
S
N
770 1044 M
782 1044 D
S
N
794 1044 M
806 1044 D
S
showpage
%%Trailer
%%Pages: 1
%%BoundingBox: 95 205 482 563
