%!PS-Adobe-3.0 EPSF-3.0
%%BoundingBox: (atend)
%%LanguageLevel: 2
%%Creator: Grace-5.1.22
%%CreationDate: Mon Dec 19 08:01:06 2011
%%DocumentData: Clean8Bit
%%Orientation: Portrait
%%Title: dsdeta_t_err_band.agr
%%For: laura
%%DocumentNeededResources: (atend)
%%EndComments
%%BeginProlog
/m {moveto} def
/l {lineto} def
/s {stroke} def
/n {newpath} def
/c {closepath} def
/RL {rlineto} def
/SLW {setlinewidth} def
/GS {gsave} def
/GR {grestore} def
/SC {setcolor} def
/SGRY {setgray} def
/SRGB {setrgbcolor} def
/SD {setdash} def
/SLC {setlinecap} def
/SLJ {setlinejoin} def
/SCS {setcolorspace} def
/FFSF {findfont setfont} def
/CC {concat} def
/PXL {n m 0 0 RL s} def
/Color0 {1.0000 1.0000 1.0000} def
/Color1 {0.0000 0.0000 0.0000} def
/Color2 {1.0000 0.0000 0.0000} def
/Color3 {0.0000 1.0000 0.0000} def
/Color4 {0.0000 0.0000 1.0000} def
/Color5 {1.0000 1.0000 0.0000} def
/Color6 {0.7373 0.5608 0.5608} def
/Color7 {0.8627 0.8627 0.8627} def
/Color8 {0.5804 0.0000 0.8275} def
/Color9 {0.0000 1.0000 1.0000} def
/Color10 {1.0000 0.0000 1.0000} def
/Color11 {1.0000 0.6471 0.0000} def
/Color12 {0.4471 0.1294 0.7373} def
/Color13 {0.4039 0.0275 0.2824} def
/Color14 {0.2510 0.8784 0.8157} def
/Color15 {0.0000 0.5451 0.0000} def
/Color16 {0.7529 0.7529 0.7529} def
/Color17 {0.5059 0.5059 0.5059} def
/Color18 {0.2588 0.2588 0.2588} def
/PTRN {
 /pat_bits exch def 
 <<
  /PaintType 2
  /PatternType 1 /TilingType 1
  /BBox[0 0 16 16]
  /XStep 16 /YStep 16
  /PaintProc {
   pop
   16 16 true [-1 0 0 -1 16 16] pat_bits imagemask
  }
 >>
 [0.0016 0 0 0.0016 0 0]
 makepattern
} def
/Pattern0 {<0000000000000000000000000000000000000000000000000000000000000000> PTRN} bind def
/Pattern1 {<ffffffffffffffffffffffffffffffffffffffffffffffffffffffffffffffff> PTRN} bind def
/Pattern2 {<eeeeffffbbbbffffeeeeffffbbbbffffeeeeffffbbbbffffeeeeffffbbbbffff> PTRN} bind def
/Pattern3 {<eeeebbbbeeeebbbbeeeebbbbeeeebbbbeeeebbbbeeeebbbbeeeebbbbeeeebbbb> PTRN} bind def
/Pattern4 {<5555aaaa5555aaaa5555aaaa5555aaaa5555aaaa5555aaaa5555aaaa5555aaaa> PTRN} bind def
/Pattern5 {<1111444411114444111144441111444411114444111144441111444411114444> PTRN} bind def
/Pattern6 {<1111000044440000111100004444000011110000444400001111000044440000> PTRN} bind def
/Pattern7 {<1010000000000000010100000000000010100000000000000101000000000000> PTRN} bind def
/Pattern8 {<0000000000000000000000000000000000000000000000000000000000000000> PTRN} bind def
/Pattern9 {<1e1e0f0f8787c3c3e1e1f0f078783c3c1e1e0f0f8787c3c3e1e1f0f078783c3c> PTRN} bind def
/Pattern10 {<7878f0f0e1e1c3c387870f0f1e1e3c3c7878f0f0e1e1c3c387870f0f1e1e3c3c> PTRN} bind def
/Pattern11 {<3333333333333333333333333333333333333333333333333333333333333333> PTRN} bind def
/Pattern12 {<ffffffff00000000ffffffff00000000ffffffff00000000ffffffff00000000> PTRN} bind def
/Pattern13 {<8181424224241818181824244242818181814242242418181818242442428181> PTRN} bind def
/Pattern14 {<8080404020201010080804040202010180804040202010100808040402020101> PTRN} bind def
/Pattern15 {<0101020204040808101020204040808001010202040408081010202040408080> PTRN} bind def
/Pattern16 {<2222222222222222222222222222222222222222222222222222222222222222> PTRN} bind def
/Pattern17 {<0000ffff000000000000ffff000000000000ffff000000000000ffff00000000> PTRN} bind def
/Pattern18 {<2222ffff222222222222ffff222222222222ffff222222222222ffff22222222> PTRN} bind def
/Pattern19 {<ffffffff33333333ffffffff33333333ffffffff33333333ffffffff33333333> PTRN} bind def
/Pattern20 {<0f0f0f0f0f0f0f0ff0f0f0f0f0f0f0f00f0f0f0f0f0f0f0ff0f0f0f0f0f0f0f0> PTRN} bind def
/Pattern21 {<ff00ff00ff00ff00ff00ff00ff00ff0000ff00ff00ff00ff00ff00ff00ff00ff> PTRN} bind def
/Pattern22 {<8001800180018001800180018001ffffffff8001800180018001800180018001> PTRN} bind def
/Pattern23 {<c003c003c003c003c003c003ffffffffffffffffc003c003c003c003c003c003> PTRN} bind def
/Pattern24 {<040404040404ffff404040404040ffff040404040404ffff404040404040ffff> PTRN} bind def
/Pattern25 {<180018001800180018001800ffffffff001800180018001800180018ffffffff> PTRN} bind def
/Pattern26 {<1111b8b87c7c3a3a1111a3a3c7c78b8b1111b8b87c7c3a3a1111a3a3c7c78b8b> PTRN} bind def
/Pattern27 {<101010102828c7c70101010182827c7c101010102828c7c70101010182827c7c> PTRN} bind def
/Pattern28 {<1c1c121211112121c1c12121111112121c1c121211112121c1c1212111111212> PTRN} bind def
/Pattern29 {<3e3e414180808080e3e31414080808083e3e414180808080e3e3141408080808> PTRN} bind def
/Pattern30 {<4848888884848383848488884848383848488888848483838484888848483838> PTRN} bind def
/Pattern31 {<03030404080808080c0c12122121c0c003030404080808080c0c12122121c0c0> PTRN} bind def
/ellipsedict 8 dict def
ellipsedict /mtrx matrix put
/EARC {
 ellipsedict begin
  /endangle exch def
  /startangle exch def
  /yrad exch def
  /xrad exch def
  /y exch def
  /x exch def
  /savematrix mtrx currentmatrix def
  x y translate
  xrad yrad scale
  0 0 1 startangle endangle arc
  savematrix setmatrix
 end
} def
/TL {
  /kcomp exch def
  /linewidth exch def
  /offset exch def
  GS
  0 offset rmoveto
  linewidth SLW
  dup stringwidth exch kcomp add exch RL s
  GR
} def
/KINIT
{
 /kvector exch def
 /kid 0 def
} def
/KPROC
{
 pop pop
 kvector kid get
 0 rmoveto
 /kid 1 kid add def
} def
/DefEncoding [
 /.notdef
 /.notdef
 /.notdef
 /.notdef
 /.notdef
 /.notdef
 /.notdef
 /.notdef
 /.notdef
 /.notdef
 /.notdef
 /.notdef
 /.notdef
 /.notdef
 /.notdef
 /.notdef
 /.notdef
 /.notdef
 /.notdef
 /.notdef
 /.notdef
 /.notdef
 /.notdef
 /.notdef
 /.notdef
 /.notdef
 /.notdef
 /.notdef
 /.notdef
 /.notdef
 /.notdef
 /.notdef
 /space
 /exclam
 /quotedbl
 /numbersign
 /dollar
 /percent
 /ampersand
 /quoteright
 /parenleft
 /parenright
 /asterisk
 /plus
 /comma
 /hyphen
 /period
 /slash
 /zero
 /one
 /two
 /three
 /four
 /five
 /six
 /seven
 /eight
 /nine
 /colon
 /semicolon
 /less
 /equal
 /greater
 /question
 /at
 /A
 /B
 /C
 /D
 /E
 /F
 /G
 /H
 /I
 /J
 /K
 /L
 /M
 /N
 /O
 /P
 /Q
 /R
 /S
 /T
 /U
 /V
 /W
 /X
 /Y
 /Z
 /bracketleft
 /backslash
 /bracketright
 /asciicircum
 /underscore
 /grave
 /a
 /b
 /c
 /d
 /e
 /f
 /g
 /h
 /i
 /j
 /k
 /l
 /m
 /n
 /o
 /p
 /q
 /r
 /s
 /t
 /u
 /v
 /w
 /x
 /y
 /z
 /braceleft
 /bar
 /braceright
 /asciitilde
 /.notdef
 /.notdef
 /.notdef
 /.notdef
 /.notdef
 /.notdef
 /.notdef
 /.notdef
 /.notdef
 /.notdef
 /.notdef
 /.notdef
 /.notdef
 /.notdef
 /.notdef
 /.notdef
 /.notdef
 /.notdef
 /.notdef
 /.notdef
 /.notdef
 /.notdef
 /.notdef
 /.notdef
 /.notdef
 /.notdef
 /.notdef
 /.notdef
 /.notdef
 /.notdef
 /.notdef
 /.notdef
 /.notdef
 /space
 /exclamdown
 /cent
 /sterling
 /currency
 /yen
 /brokenbar
 /section
 /dieresis
 /copyright
 /ordfeminine
 /guillemotleft
 /logicalnot
 /hyphen
 /registered
 /macron
 /degree
 /plusminus
 /twosuperior
 /threesuperior
 /acute
 /mu
 /paragraph
 /periodcentered
 /cedilla
 /onesuperior
 /ordmasculine
 /guillemotright
 /onequarter
 /onehalf
 /threequarters
 /questiondown
 /Agrave
 /Aacute
 /Acircumflex
 /Atilde
 /Adieresis
 /Aring
 /AE
 /Ccedilla
 /Egrave
 /Eacute
 /Ecircumflex
 /Edieresis
 /Igrave
 /Iacute
 /Icircumflex
 /Idieresis
 /Eth
 /Ntilde
 /Ograve
 /Oacute
 /Ocircumflex
 /Otilde
 /Odieresis
 /multiply
 /Oslash
 /Ugrave
 /Uacute
 /Ucircumflex
 /Udieresis
 /Yacute
 /Thorn
 /germandbls
 /agrave
 /aacute
 /acircumflex
 /atilde
 /adieresis
 /aring
 /ae
 /ccedilla
 /egrave
 /eacute
 /ecircumflex
 /edieresis
 /igrave
 /iacute
 /icircumflex
 /idieresis
 /eth
 /ntilde
 /ograve
 /oacute
 /ocircumflex
 /otilde
 /odieresis
 /divide
 /oslash
 /ugrave
 /uacute
 /ucircumflex
 /udieresis
 /yacute
 /thorn
 /ydieresis
] def
%%EndProlog
%%BeginSetup
%%EndSetup
612.00 612.00 scale
n
0.0000 0.0000 m
0.0000 1.0000 l
1.2941 1.0000 l
1.2941 0.0000 l
c
[/DeviceRGB] SCS
Color0 SC
fill
[/DeviceRGB] SCS
Color1 SC
[] 0 SD
0.0030 SLW
0 SLC
0 SLJ
n
0.1499 0.2979 m
0.1500 0.2979 l
0.1500 0.3549 l
0.1750 0.3549 l
0.1750 0.3924 l
0.2000 0.3924 l
0.2000 0.4076 l
0.2250 0.4076 l
0.2250 0.4536 l
0.2500 0.4536 l
0.2500 0.4895 l
0.2750 0.4895 l
0.2750 0.5237 l
0.3000 0.5237 l
0.3000 0.5480 l
0.3250 0.5480 l
0.3250 0.5792 l
0.3500 0.5792 l
0.3500 0.5955 l
0.3750 0.5955 l
0.3750 0.6118 l
0.4000 0.6118 l
0.4000 0.6319 l
0.4250 0.6319 l
0.4250 0.6461 l
0.4500 0.6461 l
0.4500 0.6582 l
0.4750 0.6582 l
0.4750 0.6600 l
0.5000 0.6600 l
0.5000 0.6617 l
0.5250 0.6617 l
0.5250 0.6654 l
0.5500 0.6654 l
0.5500 0.6709 l
0.5750 0.6709 l
0.5750 0.6668 l
0.6000 0.6668 l
0.6000 0.6681 l
0.6250 0.6681 l
0.6250 0.6630 l
0.6500 0.6630 l
0.6500 0.6644 l
0.6750 0.6644 l
0.6750 0.6594 l
0.7000 0.6594 l
0.7000 0.6649 l
0.7250 0.6649 l
0.7250 0.6590 l
0.7500 0.6590 l
0.7500 0.6588 l
0.7750 0.6588 l
0.7750 0.6515 l
0.8000 0.6515 l
0.8000 0.6453 l
0.8250 0.6453 l
0.8250 0.6324 l
0.8500 0.6324 l
0.8500 0.6144 l
0.8750 0.6144 l
0.8750 0.6002 l
0.9000 0.6002 l
0.9000 0.5806 l
0.9250 0.5806 l
0.9250 0.5546 l
0.9500 0.5546 l
0.9500 0.5296 l
0.9750 0.5296 l
0.9750 0.4886 l
1.0000 0.4886 l
1.0000 0.4603 l
1.0250 0.4603 l
1.0250 0.4313 l
1.0500 0.4313 l
1.0500 0.3837 l
1.0750 0.3837 l
1.0750 0.3606 l
1.1000 0.3606 l
1.1000 0.3080 l
1.1250 0.3080 l
1.1250 0.2415 l
1.1500 0.2415 l
1.1500 0.2173 l
1.1501 0.2173 l
s
[/DeviceRGB] SCS
Color2 SC
n
0.1499 0.2913 m
0.1500 0.2913 l
0.1500 0.3302 l
0.1750 0.3302 l
0.1750 0.3722 l
0.2000 0.3722 l
0.2000 0.3990 l
0.2250 0.3990 l
0.2250 0.4394 l
0.2500 0.4394 l
0.2500 0.4751 l
0.2750 0.4751 l
0.2750 0.5132 l
0.3000 0.5132 l
0.3000 0.5389 l
0.3250 0.5389 l
0.3250 0.5669 l
0.3500 0.5669 l
0.3500 0.5848 l
0.3750 0.5848 l
0.3750 0.6052 l
0.4000 0.6052 l
0.4000 0.6229 l
0.4250 0.6229 l
0.4250 0.6356 l
0.4500 0.6356 l
0.4500 0.6488 l
0.4750 0.6488 l
0.4750 0.6490 l
0.5000 0.6490 l
0.5000 0.6534 l
0.5250 0.6534 l
0.5250 0.6582 l
0.5500 0.6582 l
0.5500 0.6615 l
0.5750 0.6615 l
0.5750 0.6569 l
0.6000 0.6569 l
0.6000 0.6595 l
0.6250 0.6595 l
0.6250 0.6562 l
0.6500 0.6562 l
0.6500 0.6579 l
0.6750 0.6579 l
0.6750 0.6511 l
0.7000 0.6511 l
0.7000 0.6547 l
0.7250 0.6547 l
0.7250 0.6533 l
0.7500 0.6533 l
0.7500 0.6504 l
0.7750 0.6504 l
0.7750 0.6416 l
0.8000 0.6416 l
0.8000 0.6350 l
0.8250 0.6350 l
0.8250 0.6250 l
0.8500 0.6250 l
0.8500 0.6070 l
0.8750 0.6070 l
0.8750 0.5919 l
0.9000 0.5919 l
0.9000 0.5647 l
0.9250 0.5647 l
0.9250 0.5470 l
0.9500 0.5470 l
0.9500 0.5168 l
0.9750 0.5168 l
0.9750 0.4828 l
1.0000 0.4828 l
1.0000 0.4478 l
1.0250 0.4478 l
1.0250 0.4175 l
1.0500 0.4175 l
1.0500 0.3758 l
1.0750 0.3758 l
1.0750 0.3471 l
1.1000 0.3471 l
1.1000 0.3013 l
1.1250 0.3013 l
1.1250 0.1771 l
1.1500 0.1771 l
1.1500 0.2063 l
1.1501 0.2063 l
s
n
0.1499 0.3158 m
0.1500 0.3158 l
0.1500 0.3510 l
0.1750 0.3510 l
0.1750 0.4037 l
0.2000 0.4037 l
0.2000 0.4179 l
0.2250 0.4179 l
0.2250 0.4676 l
0.2500 0.4676 l
0.2500 0.4989 l
0.2750 0.4989 l
0.2750 0.5263 l
0.3000 0.5263 l
0.3000 0.5561 l
0.3250 0.5561 l
0.3250 0.5855 l
0.3500 0.5855 l
0.3500 0.5997 l
0.3750 0.5997 l
0.3750 0.6186 l
0.4000 0.6186 l
0.4000 0.6401 l
0.4250 0.6401 l
0.4250 0.6528 l
0.4500 0.6528 l
0.4500 0.6616 l
0.4750 0.6616 l
0.4750 0.6631 l
0.5000 0.6631 l
0.5000 0.6584 l
0.5250 0.6584 l
0.5250 0.6731 l
0.5500 0.6731 l
0.5500 0.6748 l
0.5750 0.6748 l
0.5750 0.6680 l
0.6000 0.6680 l
0.6000 0.6719 l
0.6250 0.6719 l
0.6250 0.6631 l
0.6500 0.6631 l
0.6500 0.6706 l
0.6750 0.6706 l
0.6750 0.6544 l
0.7000 0.6544 l
0.7000 0.6677 l
0.7250 0.6677 l
0.7250 0.6663 l
0.7500 0.6663 l
0.7500 0.6620 l
0.7750 0.6620 l
0.7750 0.6513 l
0.8000 0.6513 l
0.8000 0.6499 l
0.8250 0.6499 l
0.8250 0.6405 l
0.8500 0.6405 l
0.8500 0.6242 l
0.8750 0.6242 l
0.8750 0.6023 l
0.9000 0.6023 l
0.9000 0.5899 l
0.9250 0.5899 l
0.9250 0.5636 l
0.9500 0.5636 l
0.9500 0.5385 l
0.9750 0.5385 l
0.9750 0.5085 l
1.0000 0.5085 l
1.0000 0.4583 l
1.0250 0.4583 l
1.0250 0.4411 l
1.0500 0.4411 l
1.0500 0.3943 l
1.0750 0.3943 l
1.0750 0.3685 l
1.1000 0.3685 l
1.1000 0.3270 l
1.1250 0.3270 l
1.1250 0.2415 l
1.1500 0.2415 l
1.1500 0.2173 l
1.1501 0.2173 l
s
[/DeviceRGB] SCS
Color4 SC
n
0.1499 0.1947 m
0.1500 0.1947 l
0.1500 0.2537 l
0.1750 0.2537 l
0.1750 0.3086 l
0.2000 0.3086 l
0.2000 0.3739 l
0.2250 0.3739 l
0.2250 0.3899 l
0.2500 0.3899 l
0.2500 0.4277 l
0.2750 0.4277 l
0.2750 0.4938 l
0.3000 0.4938 l
0.3000 0.5136 l
0.3250 0.5136 l
0.3250 0.5499 l
0.3500 0.5499 l
0.3500 0.5663 l
0.3750 0.5663 l
0.3750 0.5892 l
0.4000 0.5892 l
0.4000 0.6055 l
0.4250 0.6055 l
0.4250 0.6209 l
0.4500 0.6209 l
0.4500 0.6321 l
0.4750 0.6321 l
0.4750 0.6348 l
0.5000 0.6348 l
0.5000 0.6409 l
0.5250 0.6409 l
0.5250 0.6445 l
0.5500 0.6445 l
0.5500 0.6485 l
0.5750 0.6485 l
0.5750 0.6428 l
0.6000 0.6428 l
0.6000 0.6484 l
0.6250 0.6484 l
0.6250 0.6432 l
0.6500 0.6432 l
0.6500 0.6395 l
0.6750 0.6395 l
0.6750 0.6391 l
0.7000 0.6391 l
0.7000 0.6364 l
0.7250 0.6364 l
0.7250 0.6410 l
0.7500 0.6410 l
0.7500 0.6375 l
0.7750 0.6375 l
0.7750 0.6267 l
0.8000 0.6267 l
0.8000 0.6150 l
0.8250 0.6150 l
0.8250 0.6056 l
0.8500 0.6056 l
0.8500 0.5961 l
0.8750 0.5961 l
0.8750 0.5763 l
0.9000 0.5763 l
0.9000 0.5196 l
0.9250 0.5196 l
0.9250 0.5316 l
0.9500 0.5316 l
0.9500 0.4945 l
0.9750 0.4945 l
0.9750 0.4539 l
1.0000 0.4539 l
1.0000 0.4224 l
1.0250 0.4224 l
1.0250 0.3859 l
1.0500 0.3859 l
1.0500 0.3529 l
1.0750 0.3529 l
1.0750 0.3154 l
1.1000 0.3154 l
1.1000 0.2054 l
1.1250 0.2054 l
1.1250 0.1499 l
s
n
0.1499 0.3573 m
0.1500 0.3573 l
0.1500 0.3862 l
0.1750 0.3862 l
0.1750 0.4329 l
0.2000 0.4329 l
0.2000 0.4374 l
0.2250 0.4374 l
0.2250 0.4930 l
0.2500 0.4930 l
0.2500 0.5254 l
0.2750 0.5254 l
0.2750 0.5415 l
0.3000 0.5415 l
0.3000 0.5742 l
0.3250 0.5742 l
0.3250 0.5990 l
0.3500 0.5990 l
0.3500 0.6125 l
0.3750 0.6125 l
0.3750 0.6314 l
0.4000 0.6314 l
0.4000 0.6533 l
0.4250 0.6533 l
0.4250 0.6638 l
0.4500 0.6638 l
0.4500 0.6776 l
0.4750 0.6776 l
0.4750 0.6773 l
0.5000 0.6773 l
0.5000 0.6749 l
0.5250 0.6749 l
0.5250 0.6835 l
0.5500 0.6835 l
0.5500 0.6857 l
0.5750 0.6857 l
0.5750 0.6814 l
0.6000 0.6814 l
0.6000 0.6812 l
0.6250 0.6812 l
0.6250 0.6771 l
0.6500 0.6771 l
0.6500 0.6863 l
0.6750 0.6863 l
0.6750 0.6728 l
0.7000 0.6728 l
0.7000 0.6811 l
0.7250 0.6811 l
0.7250 0.6780 l
0.7500 0.6780 l
0.7500 0.6756 l
0.7750 0.6756 l
0.7750 0.6638 l
0.8000 0.6638 l
0.8000 0.6688 l
0.8250 0.6688 l
0.8250 0.6560 l
0.8500 0.6560 l
0.8500 0.6351 l
0.8750 0.6351 l
0.8750 0.6192 l
0.9000 0.6192 l
0.9000 0.6140 l
0.9250 0.6140 l
0.9250 0.5761 l
0.9500 0.5761 l
0.9500 0.5534 l
0.9750 0.5534 l
0.9750 0.5286 l
1.0000 0.5286 l
1.0000 0.4859 l
1.0250 0.4859 l
1.0250 0.4619 l
1.0500 0.4619 l
1.0500 0.4099 l
1.0750 0.4099 l
1.0750 0.3874 l
1.1000 0.3874 l
1.1000 0.3651 l
1.1250 0.3651 l
1.1250 0.2718 l
1.1500 0.2718 l
1.1500 0.2616 l
1.1501 0.2616 l
s
[/DeviceRGB] SCS
Color1 SC
[] 0 SD
0.0015 SLW
n
0.1500 0.1500 m
1.1500 0.1500 l
s
n
0.1500 0.8500 m
1.1500 0.8500 l
s
[] 0 SD
0.0030 SLW
n
0.2750 0.1500 m
0.2750 0.1600 l
s
n
0.2750 0.8500 m
0.2750 0.8400 l
s
n
0.5250 0.1500 m
0.5250 0.1600 l
s
n
0.5250 0.8500 m
0.5250 0.8400 l
s
n
0.7750 0.1500 m
0.7750 0.1600 l
s
n
0.7750 0.8500 m
0.7750 0.8400 l
s
n
1.0250 0.1500 m
1.0250 0.1600 l
s
n
1.0250 0.8500 m
1.0250 0.8400 l
s
n
0.1500 0.1500 m
0.1500 0.1700 l
s
n
0.1500 0.8500 m
0.1500 0.8300 l
s
n
0.4000 0.1500 m
0.4000 0.1700 l
s
n
0.4000 0.8500 m
0.4000 0.8300 l
s
n
0.6500 0.1500 m
0.6500 0.1700 l
s
n
0.6500 0.8500 m
0.6500 0.8300 l
s
n
0.9000 0.1500 m
0.9000 0.1700 l
s
n
0.9000 0.8500 m
0.9000 0.8300 l
s
n
1.1500 0.1500 m
1.1500 0.1700 l
s
n
1.1500 0.8500 m
1.1500 0.8300 l
s
/Times-Roman findfont
dup length dict begin
 {1 index /FID ne {def} {pop pop} ifelse} forall
 /Encoding DefEncoding def
 currentdict
end
/Font0 exch definefont pop
/Font0 FFSF
0.1369 0.1180 m
GS
[0.0328 0.0000 0.0000 0.0328 0 0] CC
(-4) show
GR
/Font0 FFSF
0.3867 0.1180 m
GS
[0.0328 0.0000 0.0000 0.0328 0 0] CC
(-2) show
GR
/Font0 FFSF
0.6422 0.1180 m
GS
[0.0328 0.0000 0.0000 0.0328 0 0] CC
(0) show
GR
/Font0 FFSF
0.8922 0.1180 m
GS
[0.0328 0.0000 0.0000 0.0328 0 0] CC
(2) show
GR
/Font0 FFSF
1.1424 0.1180 m
GS
[0.0328 0.0000 0.0000 0.0328 0 0] CC
(4) show
GR
/Symbol findfont
/Font12 exch definefont pop
/Font12 FFSF
0.6363 0.0729 m
GS
[0.0344 0.0000 0.0000 0.0344 0 0] CC
(h) show
GR
/Font0 FFSF
0.6571 0.0935 m
GS
[0.0244 0.0000 0.0000 0.0244 0 0] CC
(t) show
GR
[] 0 SD
0.0015 SLW
n
0.1500 0.1500 m
0.1500 0.8500 l
s
n
1.1500 0.1500 m
1.1500 0.8500 l
s
[] 0 SD
0.0030 SLW
n
0.1500 0.2163 m
0.1600 0.2163 l
s
n
1.1500 0.2163 m
1.1400 0.2163 l
s
n
0.1500 0.2552 m
0.1600 0.2552 l
s
n
1.1500 0.2552 m
1.1400 0.2552 l
s
n
0.1500 0.2827 m
0.1600 0.2827 l
s
n
1.1500 0.2827 m
1.1400 0.2827 l
s
n
0.1500 0.3041 m
0.1600 0.3041 l
s
n
1.1500 0.3041 m
1.1400 0.3041 l
s
n
0.1500 0.3215 m
0.1600 0.3215 l
s
n
1.1500 0.3215 m
1.1400 0.3215 l
s
n
0.1500 0.3363 m
0.1600 0.3363 l
s
n
1.1500 0.3363 m
1.1400 0.3363 l
s
n
0.1500 0.3490 m
0.1600 0.3490 l
s
n
1.1500 0.3490 m
1.1400 0.3490 l
s
n
0.1500 0.3603 m
0.1600 0.3603 l
s
n
1.1500 0.3603 m
1.1400 0.3603 l
s
n
0.1500 0.3704 m
0.1600 0.3704 l
s
n
1.1500 0.3704 m
1.1400 0.3704 l
s
n
0.1500 0.4367 m
0.1600 0.4367 l
s
n
1.1500 0.4367 m
1.1400 0.4367 l
s
n
0.1500 0.4756 m
0.1600 0.4756 l
s
n
1.1500 0.4756 m
1.1400 0.4756 l
s
n
0.1500 0.5031 m
0.1600 0.5031 l
s
n
1.1500 0.5031 m
1.1400 0.5031 l
s
n
0.1500 0.5244 m
0.1600 0.5244 l
s
n
1.1500 0.5244 m
1.1400 0.5244 l
s
n
0.1500 0.5419 m
0.1600 0.5419 l
s
n
1.1500 0.5419 m
1.1400 0.5419 l
s
n
0.1500 0.5567 m
0.1600 0.5567 l
s
n
1.1500 0.5567 m
1.1400 0.5567 l
s
n
0.1500 0.5694 m
0.1600 0.5694 l
s
n
1.1500 0.5694 m
1.1400 0.5694 l
s
n
0.1500 0.5807 m
0.1600 0.5807 l
s
n
1.1500 0.5807 m
1.1400 0.5807 l
s
n
0.1500 0.5908 m
0.1600 0.5908 l
s
n
1.1500 0.5908 m
1.1400 0.5908 l
s
n
0.1500 0.6571 m
0.1600 0.6571 l
s
n
1.1500 0.6571 m
1.1400 0.6571 l
s
n
0.1500 0.6959 m
0.1600 0.6959 l
s
n
1.1500 0.6959 m
1.1400 0.6959 l
s
n
0.1500 0.7235 m
0.1600 0.7235 l
s
n
1.1500 0.7235 m
1.1400 0.7235 l
s
n
0.1500 0.7448 m
0.1600 0.7448 l
s
n
1.1500 0.7448 m
1.1400 0.7448 l
s
n
0.1500 0.7623 m
0.1600 0.7623 l
s
n
1.1500 0.7623 m
1.1400 0.7623 l
s
n
0.1500 0.7771 m
0.1600 0.7771 l
s
n
1.1500 0.7771 m
1.1400 0.7771 l
s
n
0.1500 0.7898 m
0.1600 0.7898 l
s
n
1.1500 0.7898 m
1.1400 0.7898 l
s
n
0.1500 0.8011 m
0.1600 0.8011 l
s
n
1.1500 0.8011 m
1.1400 0.8011 l
s
n
0.1500 0.8112 m
0.1600 0.8112 l
s
n
1.1500 0.8112 m
1.1400 0.8112 l
s
n
0.1500 0.1500 m
0.1700 0.1500 l
s
n
1.1500 0.1500 m
1.1300 0.1500 l
s
n
0.1500 0.3704 m
0.1700 0.3704 l
s
n
1.1500 0.3704 m
1.1300 0.3704 l
s
n
0.1500 0.5908 m
0.1700 0.5908 l
s
n
1.1500 0.5908 m
1.1300 0.5908 l
s
n
0.1500 0.8112 m
0.1700 0.8112 l
s
n
1.1500 0.8112 m
1.1300 0.8112 l
s
/Font0 FFSF
0.0533 0.1392 m
GS
[0.0328 0.0000 0.0000 0.0328 0 0] CC
(0.0001) show
GR
/Font0 FFSF
0.0698 0.3596 m
GS
[0.0328 0.0000 0.0000 0.0328 0 0] CC
(0.001) show
GR
/Font0 FFSF
0.0863 0.5800 m
GS
[0.0328 0.0000 0.0000 0.0328 0 0] CC
(0.01) show
GR
/Font0 FFSF
0.1024 0.8004 m
GS
[0.0328 0.0000 0.0000 0.0328 0 0] CC
(0.1) show
GR
/Font0 FFSF
0.0355 0.4224 m
GS
[0.0000 0.0344 -0.0344 0.0000 0 0] CC
(d) show
GR
/Font12 FFSF
0.0355 0.4396 m
GS
[0.0000 0.0344 -0.0344 0.0000 0 0] CC
(s) show
GR
/Font0 FFSF
0.0355 0.4604 m
GS
[0.0000 0.0344 -0.0344 0.0000 0 0] CC
(/d) show
GR
/Font12 FFSF
0.0355 0.4871 m
GS
[0.0000 0.0344 -0.0344 0.0000 0 0] CC
(h) show
GR
/Font0 FFSF
0.0148 0.5078 m
GS
[0.0000 0.0244 -0.0244 0.0000 0 0] CC
(t) show
GR
/Font0 FFSF
0.0355 0.5145 m
GS
[0.0000 0.0344 -0.0344 0.0000 0 0] CC
( [pb]) show
GR
/Font0 FFSF
1.1892 0.5475 m
GS
[0.0000 0.0280 -0.0280 0.0000 0 0] CC
(LHC HIGGS XS WG 2011) show
GR
n
0.1500 0.1500 m
0.1500 0.8500 l
1.1500 0.8500 l
1.1500 0.1500 l
0.1500 0.1500 l
c
s
n
0.8250 0.8011 m
0.8250 0.6929 l
1.1147 0.6929 l
1.1147 0.8011 l
c
[/DeviceRGB] SCS
Color0 SC
fill
[/DeviceRGB] SCS
Color1 SC
n
0.8250 0.8011 m
0.8250 0.6929 l
1.1147 0.6929 l
1.1147 0.8011 l
0.8250 0.8011 l
c
s
/Font0 FFSF
0.8965 0.7688 m
GS
[0.0328 0.0000 0.0000 0.0328 0 0] CC
(central value) show
GR
n
0.8365 0.7797 m
0.8765 0.7797 l
s
/Font0 FFSF
0.8965 0.7360 m
GS
[0.0328 0.0000 0.0000 0.0328 0 0] CC
(error from scale) show
GR
[/DeviceRGB] SCS
Color2 SC
n
0.8365 0.7470 m
0.8765 0.7470 l
s
/Font0 FFSF
[/DeviceRGB] SCS
Color1 SC
0.8965 0.7033 m
GS
[0.0328 0.0000 0.0000 0.0328 0 0] CC
(total error) show
GR
[/DeviceRGB] SCS
Color4 SC
n
0.8365 0.7142 m
0.8765 0.7142 l
s
/Font0 FFSF
[/DeviceRGB] SCS
Color1 SC
0.5351 0.3370 m
GS
[0.0353 0.0000 0.0000 0.0353 0 0] CC
(LHC at 7 TeV) show
GR
%%Trailer
%%BoundingBox: -1 38 730 523
%%DocumentNeededResources: font Times-Roman
%%+ font Symbol
%%EOF
