%!PS-Adobe-2.0
%%BoundingBox: 89 89 404 290
%%HiResBoundingBox: 89.333997 89.207997 403.925894 289.650015
%%EndComments
%!PS-Adobe-2.0 EPSF-2.0
%%Title: comb-11-mH-mcatnlo_py-log.eps
%%Creator: gnuplot 4.2 patchlevel 6 
%%CreationDate: Wed Nov 30 15:57:56 2011
%%DocumentFonts: (atend)
%%BoundingBox: 50 50 410 302
%%EndComments
%%BeginProlog
/gnudict 256 dict def
gnudict begin
%
% The following 6 true/false flags may be edited by hand if required
% The unit line width may also be changed
%
/Color true def
/Blacktext false def
/Solid false def
/Dashlength 1 def
/Landscape false def
/Level1 false def
/Rounded false def
/TransparentPatterns false def
/gnulinewidth 5.000 def
/userlinewidth gnulinewidth def
%
/vshift -80 def
/dl1 {
  10.0 Dashlength mul mul
  Rounded { currentlinewidth 0.75 mul sub dup 0 le { pop 0.01 } if } if
} def
/dl2 {
  10.0 Dashlength mul mul
  Rounded { currentlinewidth 0.75 mul add } if
} def
/hpt_ 31.5 def
/vpt_ 31.5 def
/hpt hpt_ def
/vpt vpt_ def
Level1 {} {
/SDict 10 dict def
systemdict /pdfmark known not {
  userdict /pdfmark systemdict /cleartomark get put
} if
SDict begin [
  /Title (comb-11-mH-mcatnlo_py-log.eps)
  /Subject (gnuplot plot)
  /Creator (gnuplot 4.2 patchlevel 6 )
  /Author (nason,,,)
%  /Producer (gnuplot)
%  /Keywords ()
  /CreationDate (Wed Nov 30 15:57:56 2011)
  /DOCINFO pdfmark
end
} ifelse
%
% Gnuplot Prolog Version 4.2 (August 2006)
%
/M {moveto} bind def
/L {lineto} bind def
/R {rmoveto} bind def
/V {rlineto} bind def
/N {newpath moveto} bind def
/Z {closepath} bind def
/C {setrgbcolor} bind def
/f {rlineto fill} bind def
/vpt2 vpt 2 mul def
/hpt2 hpt 2 mul def
/Lshow {currentpoint stroke M 0 vshift R 
	Blacktext {gsave 0 setgray show grestore} {show} ifelse} def
/Rshow {currentpoint stroke M dup stringwidth pop neg vshift R
	Blacktext {gsave 0 setgray show grestore} {show} ifelse} def
/Cshow {currentpoint stroke M dup stringwidth pop -2 div vshift R 
	Blacktext {gsave 0 setgray show grestore} {show} ifelse} def
/UP {dup vpt_ mul /vpt exch def hpt_ mul /hpt exch def
  /hpt2 hpt 2 mul def /vpt2 vpt 2 mul def} def
/DL {Color {setrgbcolor Solid {pop []} if 0 setdash}
 {pop pop pop 0 setgray Solid {pop []} if 0 setdash} ifelse} def
/BL {stroke userlinewidth 2 mul setlinewidth
	Rounded {1 setlinejoin 1 setlinecap} if} def
/AL {stroke userlinewidth 2 div setlinewidth
	Rounded {1 setlinejoin 1 setlinecap} if} def
/UL {dup gnulinewidth mul /userlinewidth exch def
	dup 1 lt {pop 1} if 10 mul /udl exch def} def
/PL {stroke userlinewidth setlinewidth
	Rounded {1 setlinejoin 1 setlinecap} if} def
% Default Line colors
/LCw {1 1 1} def
/LCb {0 0 0} def
/LCa {0 0 0} def
/LC0 {1 0 0} def
/LC1 {0 1 0} def
/LC2 {0 0 1} def
/LC3 {1 0 1} def
/LC4 {0 1 1} def
/LC5 {1 1 0} def
/LC6 {0 0 0} def
/LC7 {1 0.3 0} def
/LC8 {0.5 0.5 0.5} def
% Default Line Types
/LTw {PL [] 1 setgray} def
/LTb {BL [] LCb DL} def
/LTa {AL [1 udl mul 2 udl mul] 0 setdash LCa setrgbcolor} def
/LT0 {PL [] LC0 DL} def
/LT1 {PL [4 dl1 2 dl2] LC1 DL} def
/LT2 {PL [2 dl1 3 dl2] LC2 DL} def
/LT3 {PL [1 dl1 1.5 dl2] LC3 DL} def
/LT4 {PL [6 dl1 2 dl2 1 dl1 2 dl2] LC4 DL} def
/LT5 {PL [3 dl1 3 dl2 1 dl1 3 dl2] LC5 DL} def
/LT6 {PL [2 dl1 2 dl2 2 dl1 6 dl2] LC6 DL} def
/LT7 {PL [1 dl1 2 dl2 6 dl1 2 dl2 1 dl1 2 dl2] LC7 DL} def
/LT8 {PL [2 dl1 2 dl2 2 dl1 2 dl2 2 dl1 2 dl2 2 dl1 4 dl2] LC8 DL} def
/Pnt {stroke [] 0 setdash gsave 1 setlinecap M 0 0 V stroke grestore} def
/Dia {stroke [] 0 setdash 2 copy vpt add M
  hpt neg vpt neg V hpt vpt neg V
  hpt vpt V hpt neg vpt V closepath stroke
  Pnt} def
/Pls {stroke [] 0 setdash vpt sub M 0 vpt2 V
  currentpoint stroke M
  hpt neg vpt neg R hpt2 0 V stroke
 } def
/Box {stroke [] 0 setdash 2 copy exch hpt sub exch vpt add M
  0 vpt2 neg V hpt2 0 V 0 vpt2 V
  hpt2 neg 0 V closepath stroke
  Pnt} def
/Crs {stroke [] 0 setdash exch hpt sub exch vpt add M
  hpt2 vpt2 neg V currentpoint stroke M
  hpt2 neg 0 R hpt2 vpt2 V stroke} def
/TriU {stroke [] 0 setdash 2 copy vpt 1.12 mul add M
  hpt neg vpt -1.62 mul V
  hpt 2 mul 0 V
  hpt neg vpt 1.62 mul V closepath stroke
  Pnt} def
/Star {2 copy Pls Crs} def
/BoxF {stroke [] 0 setdash exch hpt sub exch vpt add M
  0 vpt2 neg V hpt2 0 V 0 vpt2 V
  hpt2 neg 0 V closepath fill} def
/TriUF {stroke [] 0 setdash vpt 1.12 mul add M
  hpt neg vpt -1.62 mul V
  hpt 2 mul 0 V
  hpt neg vpt 1.62 mul V closepath fill} def
/TriD {stroke [] 0 setdash 2 copy vpt 1.12 mul sub M
  hpt neg vpt 1.62 mul V
  hpt 2 mul 0 V
  hpt neg vpt -1.62 mul V closepath stroke
  Pnt} def
/TriDF {stroke [] 0 setdash vpt 1.12 mul sub M
  hpt neg vpt 1.62 mul V
  hpt 2 mul 0 V
  hpt neg vpt -1.62 mul V closepath fill} def
/DiaF {stroke [] 0 setdash vpt add M
  hpt neg vpt neg V hpt vpt neg V
  hpt vpt V hpt neg vpt V closepath fill} def
/Pent {stroke [] 0 setdash 2 copy gsave
  translate 0 hpt M 4 {72 rotate 0 hpt L} repeat
  closepath stroke grestore Pnt} def
/PentF {stroke [] 0 setdash gsave
  translate 0 hpt M 4 {72 rotate 0 hpt L} repeat
  closepath fill grestore} def
/Circle {stroke [] 0 setdash 2 copy
  hpt 0 360 arc stroke Pnt} def
/CircleF {stroke [] 0 setdash hpt 0 360 arc fill} def
/C0 {BL [] 0 setdash 2 copy moveto vpt 90 450 arc} bind def
/C1 {BL [] 0 setdash 2 copy moveto
	2 copy vpt 0 90 arc closepath fill
	vpt 0 360 arc closepath} bind def
/C2 {BL [] 0 setdash 2 copy moveto
	2 copy vpt 90 180 arc closepath fill
	vpt 0 360 arc closepath} bind def
/C3 {BL [] 0 setdash 2 copy moveto
	2 copy vpt 0 180 arc closepath fill
	vpt 0 360 arc closepath} bind def
/C4 {BL [] 0 setdash 2 copy moveto
	2 copy vpt 180 270 arc closepath fill
	vpt 0 360 arc closepath} bind def
/C5 {BL [] 0 setdash 2 copy moveto
	2 copy vpt 0 90 arc
	2 copy moveto
	2 copy vpt 180 270 arc closepath fill
	vpt 0 360 arc} bind def
/C6 {BL [] 0 setdash 2 copy moveto
	2 copy vpt 90 270 arc closepath fill
	vpt 0 360 arc closepath} bind def
/C7 {BL [] 0 setdash 2 copy moveto
	2 copy vpt 0 270 arc closepath fill
	vpt 0 360 arc closepath} bind def
/C8 {BL [] 0 setdash 2 copy moveto
	2 copy vpt 270 360 arc closepath fill
	vpt 0 360 arc closepath} bind def
/C9 {BL [] 0 setdash 2 copy moveto
	2 copy vpt 270 450 arc closepath fill
	vpt 0 360 arc closepath} bind def
/C10 {BL [] 0 setdash 2 copy 2 copy moveto vpt 270 360 arc closepath fill
	2 copy moveto
	2 copy vpt 90 180 arc closepath fill
	vpt 0 360 arc closepath} bind def
/C11 {BL [] 0 setdash 2 copy moveto
	2 copy vpt 0 180 arc closepath fill
	2 copy moveto
	2 copy vpt 270 360 arc closepath fill
	vpt 0 360 arc closepath} bind def
/C12 {BL [] 0 setdash 2 copy moveto
	2 copy vpt 180 360 arc closepath fill
	vpt 0 360 arc closepath} bind def
/C13 {BL [] 0 setdash 2 copy moveto
	2 copy vpt 0 90 arc closepath fill
	2 copy moveto
	2 copy vpt 180 360 arc closepath fill
	vpt 0 360 arc closepath} bind def
/C14 {BL [] 0 setdash 2 copy moveto
	2 copy vpt 90 360 arc closepath fill
	vpt 0 360 arc} bind def
/C15 {BL [] 0 setdash 2 copy vpt 0 360 arc closepath fill
	vpt 0 360 arc closepath} bind def
/Rec {newpath 4 2 roll moveto 1 index 0 rlineto 0 exch rlineto
	neg 0 rlineto closepath} bind def
/Square {dup Rec} bind def
/Bsquare {vpt sub exch vpt sub exch vpt2 Square} bind def
/S0 {BL [] 0 setdash 2 copy moveto 0 vpt rlineto BL Bsquare} bind def
/S1 {BL [] 0 setdash 2 copy vpt Square fill Bsquare} bind def
/S2 {BL [] 0 setdash 2 copy exch vpt sub exch vpt Square fill Bsquare} bind def
/S3 {BL [] 0 setdash 2 copy exch vpt sub exch vpt2 vpt Rec fill Bsquare} bind def
/S4 {BL [] 0 setdash 2 copy exch vpt sub exch vpt sub vpt Square fill Bsquare} bind def
/S5 {BL [] 0 setdash 2 copy 2 copy vpt Square fill
	exch vpt sub exch vpt sub vpt Square fill Bsquare} bind def
/S6 {BL [] 0 setdash 2 copy exch vpt sub exch vpt sub vpt vpt2 Rec fill Bsquare} bind def
/S7 {BL [] 0 setdash 2 copy exch vpt sub exch vpt sub vpt vpt2 Rec fill
	2 copy vpt Square fill Bsquare} bind def
/S8 {BL [] 0 setdash 2 copy vpt sub vpt Square fill Bsquare} bind def
/S9 {BL [] 0 setdash 2 copy vpt sub vpt vpt2 Rec fill Bsquare} bind def
/S10 {BL [] 0 setdash 2 copy vpt sub vpt Square fill 2 copy exch vpt sub exch vpt Square fill
	Bsquare} bind def
/S11 {BL [] 0 setdash 2 copy vpt sub vpt Square fill 2 copy exch vpt sub exch vpt2 vpt Rec fill
	Bsquare} bind def
/S12 {BL [] 0 setdash 2 copy exch vpt sub exch vpt sub vpt2 vpt Rec fill Bsquare} bind def
/S13 {BL [] 0 setdash 2 copy exch vpt sub exch vpt sub vpt2 vpt Rec fill
	2 copy vpt Square fill Bsquare} bind def
/S14 {BL [] 0 setdash 2 copy exch vpt sub exch vpt sub vpt2 vpt Rec fill
	2 copy exch vpt sub exch vpt Square fill Bsquare} bind def
/S15 {BL [] 0 setdash 2 copy Bsquare fill Bsquare} bind def
/D0 {gsave translate 45 rotate 0 0 S0 stroke grestore} bind def
/D1 {gsave translate 45 rotate 0 0 S1 stroke grestore} bind def
/D2 {gsave translate 45 rotate 0 0 S2 stroke grestore} bind def
/D3 {gsave translate 45 rotate 0 0 S3 stroke grestore} bind def
/D4 {gsave translate 45 rotate 0 0 S4 stroke grestore} bind def
/D5 {gsave translate 45 rotate 0 0 S5 stroke grestore} bind def
/D6 {gsave translate 45 rotate 0 0 S6 stroke grestore} bind def
/D7 {gsave translate 45 rotate 0 0 S7 stroke grestore} bind def
/D8 {gsave translate 45 rotate 0 0 S8 stroke grestore} bind def
/D9 {gsave translate 45 rotate 0 0 S9 stroke grestore} bind def
/D10 {gsave translate 45 rotate 0 0 S10 stroke grestore} bind def
/D11 {gsave translate 45 rotate 0 0 S11 stroke grestore} bind def
/D12 {gsave translate 45 rotate 0 0 S12 stroke grestore} bind def
/D13 {gsave translate 45 rotate 0 0 S13 stroke grestore} bind def
/D14 {gsave translate 45 rotate 0 0 S14 stroke grestore} bind def
/D15 {gsave translate 45 rotate 0 0 S15 stroke grestore} bind def
/DiaE {stroke [] 0 setdash vpt add M
  hpt neg vpt neg V hpt vpt neg V
  hpt vpt V hpt neg vpt V closepath stroke} def
/BoxE {stroke [] 0 setdash exch hpt sub exch vpt add M
  0 vpt2 neg V hpt2 0 V 0 vpt2 V
  hpt2 neg 0 V closepath stroke} def
/TriUE {stroke [] 0 setdash vpt 1.12 mul add M
  hpt neg vpt -1.62 mul V
  hpt 2 mul 0 V
  hpt neg vpt 1.62 mul V closepath stroke} def
/TriDE {stroke [] 0 setdash vpt 1.12 mul sub M
  hpt neg vpt 1.62 mul V
  hpt 2 mul 0 V
  hpt neg vpt -1.62 mul V closepath stroke} def
/PentE {stroke [] 0 setdash gsave
  translate 0 hpt M 4 {72 rotate 0 hpt L} repeat
  closepath stroke grestore} def
/CircE {stroke [] 0 setdash 
  hpt 0 360 arc stroke} def
/Opaque {gsave closepath 1 setgray fill grestore 0 setgray closepath} def
/DiaW {stroke [] 0 setdash vpt add M
  hpt neg vpt neg V hpt vpt neg V
  hpt vpt V hpt neg vpt V Opaque stroke} def
/BoxW {stroke [] 0 setdash exch hpt sub exch vpt add M
  0 vpt2 neg V hpt2 0 V 0 vpt2 V
  hpt2 neg 0 V Opaque stroke} def
/TriUW {stroke [] 0 setdash vpt 1.12 mul add M
  hpt neg vpt -1.62 mul V
  hpt 2 mul 0 V
  hpt neg vpt 1.62 mul V Opaque stroke} def
/TriDW {stroke [] 0 setdash vpt 1.12 mul sub M
  hpt neg vpt 1.62 mul V
  hpt 2 mul 0 V
  hpt neg vpt -1.62 mul V Opaque stroke} def
/PentW {stroke [] 0 setdash gsave
  translate 0 hpt M 4 {72 rotate 0 hpt L} repeat
  Opaque stroke grestore} def
/CircW {stroke [] 0 setdash 
  hpt 0 360 arc Opaque stroke} def
/BoxFill {gsave Rec 1 setgray fill grestore} def
/Density {
  /Fillden exch def
  currentrgbcolor
  /ColB exch def /ColG exch def /ColR exch def
  /ColR ColR Fillden mul Fillden sub 1 add def
  /ColG ColG Fillden mul Fillden sub 1 add def
  /ColB ColB Fillden mul Fillden sub 1 add def
  ColR ColG ColB setrgbcolor} def
/BoxColFill {gsave Rec PolyFill} def
/PolyFill {gsave Density fill grestore grestore} def
/h {rlineto rlineto rlineto gsave closepath fill grestore} bind def
%
% PostScript Level 1 Pattern Fill routine for rectangles
% Usage: x y w h s a XX PatternFill
%	x,y = lower left corner of box to be filled
%	w,h = width and height of box
%	  a = angle in degrees between lines and x-axis
%	 XX = 0/1 for no/yes cross-hatch
%
/PatternFill {gsave /PFa [ 9 2 roll ] def
  PFa 0 get PFa 2 get 2 div add PFa 1 get PFa 3 get 2 div add translate
  PFa 2 get -2 div PFa 3 get -2 div PFa 2 get PFa 3 get Rec
  gsave 1 setgray fill grestore clip
  currentlinewidth 0.5 mul setlinewidth
  /PFs PFa 2 get dup mul PFa 3 get dup mul add sqrt def
  0 0 M PFa 5 get rotate PFs -2 div dup translate
  0 1 PFs PFa 4 get div 1 add floor cvi
	{PFa 4 get mul 0 M 0 PFs V} for
  0 PFa 6 get ne {
	0 1 PFs PFa 4 get div 1 add floor cvi
	{PFa 4 get mul 0 2 1 roll M PFs 0 V} for
 } if
  stroke grestore} def
%
/languagelevel where
 {pop languagelevel} {1} ifelse
 2 lt
	{/InterpretLevel1 true def}
	{/InterpretLevel1 Level1 def}
 ifelse
%
% PostScript level 2 pattern fill definitions
%
/Level2PatternFill {
/Tile8x8 {/PaintType 2 /PatternType 1 /TilingType 1 /BBox [0 0 8 8] /XStep 8 /YStep 8}
	bind def
/KeepColor {currentrgbcolor [/Pattern /DeviceRGB] setcolorspace} bind def
<< Tile8x8
 /PaintProc {0.5 setlinewidth pop 0 0 M 8 8 L 0 8 M 8 0 L stroke} 
>> matrix makepattern
/Pat1 exch def
<< Tile8x8
 /PaintProc {0.5 setlinewidth pop 0 0 M 8 8 L 0 8 M 8 0 L stroke
	0 4 M 4 8 L 8 4 L 4 0 L 0 4 L stroke}
>> matrix makepattern
/Pat2 exch def
<< Tile8x8
 /PaintProc {0.5 setlinewidth pop 0 0 M 0 8 L
	8 8 L 8 0 L 0 0 L fill}
>> matrix makepattern
/Pat3 exch def
<< Tile8x8
 /PaintProc {0.5 setlinewidth pop -4 8 M 8 -4 L
	0 12 M 12 0 L stroke}
>> matrix makepattern
/Pat4 exch def
<< Tile8x8
 /PaintProc {0.5 setlinewidth pop -4 0 M 8 12 L
	0 -4 M 12 8 L stroke}
>> matrix makepattern
/Pat5 exch def
<< Tile8x8
 /PaintProc {0.5 setlinewidth pop -2 8 M 4 -4 L
	0 12 M 8 -4 L 4 12 M 10 0 L stroke}
>> matrix makepattern
/Pat6 exch def
<< Tile8x8
 /PaintProc {0.5 setlinewidth pop -2 0 M 4 12 L
	0 -4 M 8 12 L 4 -4 M 10 8 L stroke}
>> matrix makepattern
/Pat7 exch def
<< Tile8x8
 /PaintProc {0.5 setlinewidth pop 8 -2 M -4 4 L
	12 0 M -4 8 L 12 4 M 0 10 L stroke}
>> matrix makepattern
/Pat8 exch def
<< Tile8x8
 /PaintProc {0.5 setlinewidth pop 0 -2 M 12 4 L
	-4 0 M 12 8 L -4 4 M 8 10 L stroke}
>> matrix makepattern
/Pat9 exch def
/Pattern1 {PatternBgnd KeepColor Pat1 setpattern} bind def
/Pattern2 {PatternBgnd KeepColor Pat2 setpattern} bind def
/Pattern3 {PatternBgnd KeepColor Pat3 setpattern} bind def
/Pattern4 {PatternBgnd KeepColor Landscape {Pat5} {Pat4} ifelse setpattern} bind def
/Pattern5 {PatternBgnd KeepColor Landscape {Pat4} {Pat5} ifelse setpattern} bind def
/Pattern6 {PatternBgnd KeepColor Landscape {Pat9} {Pat6} ifelse setpattern} bind def
/Pattern7 {PatternBgnd KeepColor Landscape {Pat8} {Pat7} ifelse setpattern} bind def
} def
%
%
%End of PostScript Level 2 code
%
/PatternBgnd {
  TransparentPatterns {} {gsave 1 setgray fill grestore} ifelse
} def
%
% Substitute for Level 2 pattern fill codes with
% grayscale if Level 2 support is not selected.
%
/Level1PatternFill {
/Pattern1 {0.250 Density} bind def
/Pattern2 {0.500 Density} bind def
/Pattern3 {0.750 Density} bind def
/Pattern4 {0.125 Density} bind def
/Pattern5 {0.375 Density} bind def
/Pattern6 {0.625 Density} bind def
/Pattern7 {0.875 Density} bind def
} def
%
% Now test for support of Level 2 code
%
Level1 {Level1PatternFill} {Level2PatternFill} ifelse
%
/Symbol-Oblique /Symbol findfont [1 0 .167 1 0 0] makefont
dup length dict begin {1 index /FID eq {pop pop} {def} ifelse} forall
currentdict end definefont pop
/MFshow {
   { dup 5 get 3 ge
     { 5 get 3 eq {gsave} {grestore} ifelse }
     {dup dup 0 get findfont exch 1 get scalefont setfont
     [ currentpoint ] exch dup 2 get 0 exch R dup 5 get 2 ne {dup dup 6
     get exch 4 get {show} {stringwidth pop 0 R} ifelse }if dup 5 get 0 eq
     {dup 3 get {2 get neg 0 exch R pop} {pop aload pop M} ifelse} {dup 5
     get 1 eq {dup 2 get exch dup 3 get exch 6 get stringwidth pop -2 div
     dup 0 R} {dup 6 get stringwidth pop -2 div 0 R 6 get
     show 2 index {aload pop M neg 3 -1 roll neg R pop pop} {pop pop pop
     pop aload pop M} ifelse }ifelse }ifelse }
     ifelse }
   forall} bind def
/MFwidth {0 exch { dup 5 get 3 ge { 5 get 3 eq { 0 } { pop } ifelse }
 {dup 3 get{dup dup 0 get findfont exch 1 get scalefont setfont
     6 get stringwidth pop add} {pop} ifelse} ifelse} forall} bind def
/MLshow { currentpoint stroke M
  0 exch R
  Blacktext {gsave 0 setgray MFshow grestore} {MFshow} ifelse } bind def
/MRshow { currentpoint stroke M
  exch dup MFwidth neg 3 -1 roll R
  Blacktext {gsave 0 setgray MFshow grestore} {MFshow} ifelse } bind def
/MCshow { currentpoint stroke M
  exch dup MFwidth -2 div 3 -1 roll R
  Blacktext {gsave 0 setgray MFshow grestore} {MFshow} ifelse } bind def
/XYsave    { [( ) 1 2 true false 3 ()] } bind def
/XYrestore { [( ) 1 2 true false 4 ()] } bind def
end
%%EndProlog
gnudict begin
gsave
50 50 translate
0.050 0.050 scale
0 setgray
newpath
(Helvetica) findfont 240 scalefont setfont
1.000 UL
LTb
1800 2898 M
63 0 V
4977 0 R
-63 0 V
stroke
1656 2898 M
[ [(Helvetica) 240.0 0.0 true true 0 (10)]
[(Helvetica) 192.0 120.0 true true 0 (-4)]
] -104.0 MRshow
1.000 UL
LTb
1800 3276 M
63 0 V
4977 0 R
-63 0 V
stroke
1656 3276 M
[ [(Helvetica) 240.0 0.0 true true 0 (10)]
[(Helvetica) 192.0 120.0 true true 0 (-3)]
] -104.0 MRshow
1.000 UL
LTb
1800 3654 M
63 0 V
4977 0 R
-63 0 V
stroke
1656 3654 M
[ [(Helvetica) 240.0 0.0 true true 0 (10)]
[(Helvetica) 192.0 120.0 true true 0 (-2)]
] -104.0 MRshow
1.000 UL
LTb
1800 4032 M
63 0 V
4977 0 R
-63 0 V
stroke
1656 4032 M
[ [(Helvetica) 240.0 0.0 true true 0 (0.1)]
] -80.0 MRshow
1.000 UL
LTb
1800 4410 M
63 0 V
4977 0 R
-63 0 V
stroke
1656 4410 M
[ [(Helvetica) 240.0 0.0 true true 0 (1)]
] -80.0 MRshow
1.000 UL
LTb
1800 2520 M
0 63 V
0 2205 R
0 -63 V
2430 2520 M
0 63 V
0 2205 R
0 -63 V
3060 2520 M
0 63 V
0 2205 R
0 -63 V
3690 2520 M
0 63 V
0 2205 R
0 -63 V
4320 2520 M
0 63 V
0 2205 R
0 -63 V
4950 2520 M
0 63 V
0 2205 R
0 -63 V
5580 2520 M
0 63 V
0 2205 R
0 -63 V
6210 2520 M
0 63 V
0 2205 R
0 -63 V
6840 2520 M
0 63 V
0 2205 R
0 -63 V
stroke
1800 4788 N
0 -2268 V
5040 0 V
0 2268 V
-5040 0 V
Z stroke
LCb setrgbcolor
960 3654 M
currentpoint gsave translate 90 rotate 0 0 moveto
[ [(Helvetica) 240.0 0.0 true true 0 (d)]
[(Symbol) 240.0 0.0 true true 0 (s)]
[(Helvetica) 240.0 0.0 true true 0 (/d p)]
[(Helvetica) 192.0 -72.0 true true 0 (T)]
[(Helvetica) 240.0 0.0 true true 0 ( \(pb/GeV\))]
] -56.0 MCshow
grestore
LTb
1.000 UP
1.000 UL
LTb
1.000 UP
1.000 UL
LT0
LTb
5769 4605 M
[ [(Helvetica) 240.0 0.0 true true 0 (MCATNLO-py)]
] -80.0 MRshow
LT0
5913 4605 M
639 0 V
-639 31 R
0 -62 V
639 62 R
0 -62 V
1813 4052 M
25 146 V
25 29 V
25 1 V
25 -10 V
26 -11 V
25 -16 V
25 -18 V
25 -17 V
25 -19 V
38 -23 V
51 -35 V
50 -30 V
76 -46 V
113 -66 V
126 -68 V
126 -69 V
126 -61 V
189 -79 V
441 -168 V
630 -182 V
630 -130 V
630 -132 V
945 -144 V
1813 4052 M
-31 0 R
62 0 V
-62 0 R
62 0 V
-6 146 R
-31 0 R
62 0 V
-62 0 R
62 0 V
-6 29 R
-31 0 R
62 0 V
-62 0 R
62 0 V
-6 1 R
-31 0 R
62 0 V
-62 0 R
62 0 V
-6 -10 R
-31 0 R
62 0 V
-62 0 R
62 0 V
-5 -11 R
-31 0 R
62 0 V
-62 0 R
62 0 V
-6 -16 R
-31 0 R
62 0 V
-62 0 R
62 0 V
-6 -18 R
-31 0 R
62 0 V
-62 0 R
62 0 V
-6 -17 R
-31 0 R
62 0 V
-62 0 R
62 0 V
-6 -19 R
-31 0 R
62 0 V
-62 0 R
62 0 V
7 -23 R
-31 0 R
62 0 V
-62 0 R
62 0 V
20 -35 R
-31 0 R
62 0 V
-62 0 R
62 0 V
19 -30 R
-31 0 R
62 0 V
-62 0 R
62 0 V
45 -46 R
-31 0 R
62 0 V
-62 0 R
62 0 V
82 -66 R
-31 0 R
62 0 V
-62 0 R
62 0 V
stroke 2398 3937 M
95 -68 R
-31 0 R
62 0 V
-62 0 R
62 0 V
95 -69 R
-31 0 R
62 0 V
-62 0 R
62 0 V
95 -61 R
-31 0 R
62 0 V
-62 0 R
62 0 V
158 -79 R
-31 0 R
62 0 V
-62 0 R
62 0 V
410 -168 R
-31 0 R
62 0 V
-62 0 R
62 0 V
599 -182 R
-31 0 R
62 0 V
-62 0 R
62 0 V
599 -130 R
-31 0 R
62 0 V
-62 0 R
62 0 V
599 -132 R
-31 0 R
62 0 V
-62 0 R
62 0 V
914 -144 R
-31 0 R
62 0 V
-62 0 R
62 0 V
1800 4052 M
25 0 V
-25 -31 R
0 62 V
25 -62 R
0 62 V
0 115 R
25 0 V
-25 -31 R
0 62 V
25 -62 R
0 62 V
0 -2 R
26 0 V
-26 -31 R
0 62 V
26 -62 R
0 62 V
0 -30 R
25 0 V
-25 -31 R
0 62 V
25 -62 R
0 62 V
0 -41 R
25 0 V
-25 -31 R
0 62 V
25 -62 R
0 62 V
0 -42 R
25 0 V
-25 -31 R
0 62 V
25 -62 R
0 62 V
0 -47 R
25 0 V
-25 -31 R
0 62 V
25 -62 R
0 62 V
0 -49 R
26 0 V
-26 -31 R
0 62 V
26 -62 R
0 62 V
0 -48 R
25 0 V
-25 -31 R
0 62 V
25 -62 R
0 62 V
0 -50 R
25 0 V
-25 -31 R
0 62 V
25 -62 R
0 62 V
stroke 2052 4168 M
0 -54 R
50 0 V
-50 -31 R
0 62 V
50 -62 R
0 62 V
0 -66 R
51 0 V
-51 -31 R
0 62 V
51 -62 R
0 62 V
0 -61 R
50 0 V
-50 -31 R
0 62 V
50 -62 R
0 62 V
0 -77 R
101 0 V
-101 -31 R
0 62 V
101 -62 R
0 62 V
0 -97 R
126 0 V
-126 -31 R
0 62 V
126 -62 R
0 62 V
0 -99 R
126 0 V
-126 -31 R
0 62 V
126 -62 R
0 62 V
0 -100 R
126 0 V
-126 -31 R
0 62 V
126 -62 R
0 62 V
0 -92 R
126 0 V
-126 -31 R
0 62 V
126 -62 R
0 62 V
0 -110 R
252 0 V
-252 -31 R
0 62 V
252 -62 R
0 62 V
0 -199 R
630 0 V
-630 -31 R
0 62 V
630 -62 R
0 62 V
0 -213 R
630 0 V
-630 -31 R
0 62 V
630 -62 R
0 62 V
0 -161 R
630 0 V
-630 -31 R
0 62 V
630 -62 R
0 62 V
0 -163 R
630 0 V
-630 -31 R
0 62 V
630 -62 R
0 62 V
0 -175 R
1260 0 V
5580 2873 M
0 62 V
1260 -62 R
0 62 V
1813 4052 Pls
1838 4198 Pls
1863 4227 Pls
1888 4228 Pls
1913 4218 Pls
1939 4207 Pls
1964 4191 Pls
1989 4173 Pls
2014 4156 Pls
2039 4137 Pls
2077 4114 Pls
2128 4079 Pls
2178 4049 Pls
2254 4003 Pls
2367 3937 Pls
2493 3869 Pls
2619 3800 Pls
2745 3739 Pls
2934 3660 Pls
3375 3492 Pls
4005 3310 Pls
4635 3180 Pls
5265 3048 Pls
6210 2904 Pls
6232 4605 Pls
1.000 UP
1.000 UL
LT0
LTb
5769 4365 M
[ [(Helvetica) 240.0 0.0 true true 0 ( )]
] -80.0 MRshow
LT0
5913 4365 M
639 0 V
-639 31 R
0 -62 V
639 62 R
0 -62 V
1813 4096 M
25 144 V
25 33 V
25 1 V
25 -9 V
26 -13 V
25 -16 V
25 -14 V
25 -18 V
25 -17 V
38 -23 V
51 -32 V
50 -31 V
76 -42 V
113 -59 V
126 -61 V
126 -57 V
126 -56 V
189 -68 V
441 -149 V
630 -168 V
630 -135 V
630 -122 V
945 -151 V
1813 4096 M
-31 0 R
62 0 V
-62 0 R
62 0 V
-6 144 R
-31 0 R
62 0 V
-62 0 R
62 0 V
-6 33 R
-31 0 R
62 0 V
-62 0 R
62 0 V
-6 1 R
-31 0 R
62 0 V
-62 0 R
62 0 V
-6 -9 R
-31 0 R
62 0 V
-62 0 R
62 0 V
-5 -13 R
-31 0 R
62 0 V
-62 0 R
62 0 V
-6 -16 R
-31 0 R
62 0 V
-62 0 R
62 0 V
-6 -14 R
-31 0 R
62 0 V
-62 0 R
62 0 V
-6 -18 R
-31 0 R
62 0 V
-62 0 R
62 0 V
-6 -17 R
-31 0 R
62 0 V
-62 0 R
62 0 V
7 -23 R
-31 0 R
62 0 V
-62 0 R
62 0 V
20 -32 R
-31 0 R
62 0 V
-62 0 R
62 0 V
19 -31 R
-31 0 R
62 0 V
-62 0 R
62 0 V
45 -42 R
-31 0 R
62 0 V
-62 0 R
62 0 V
82 -59 R
-31 0 R
62 0 V
-62 0 R
62 0 V
stroke 2398 4000 M
95 -61 R
-31 0 R
62 0 V
-62 0 R
62 0 V
95 -57 R
-31 0 R
62 0 V
-62 0 R
62 0 V
95 -56 R
-31 0 R
62 0 V
-62 0 R
62 0 V
158 -68 R
-31 0 R
62 0 V
-62 0 R
62 0 V
410 -149 R
-31 0 R
62 0 V
-62 0 R
62 0 V
599 -168 R
-31 0 R
62 0 V
-62 0 R
62 0 V
599 -135 R
-31 0 R
62 0 V
-62 0 R
62 0 V
599 -122 R
-31 0 R
62 0 V
-62 0 R
62 0 V
914 -151 R
-31 0 R
62 0 V
-62 0 R
62 0 V
1800 4096 M
25 0 V
-25 -31 R
0 62 V
25 -62 R
0 62 V
0 113 R
25 0 V
-25 -31 R
0 62 V
25 -62 R
0 62 V
0 2 R
26 0 V
-26 -31 R
0 62 V
26 -62 R
0 62 V
0 -30 R
25 0 V
-25 -31 R
0 62 V
25 -62 R
0 62 V
0 -40 R
25 0 V
-25 -31 R
0 62 V
25 -62 R
0 62 V
0 -44 R
25 0 V
-25 -31 R
0 62 V
25 -62 R
0 62 V
0 -47 R
25 0 V
-25 -31 R
0 62 V
25 -62 R
0 62 V
0 -45 R
26 0 V
-26 -31 R
0 62 V
26 -62 R
0 62 V
0 -49 R
25 0 V
-25 -31 R
0 62 V
25 -62 R
0 62 V
0 -48 R
25 0 V
-25 -31 R
0 62 V
25 -62 R
0 62 V
stroke 2052 4218 M
0 -54 R
50 0 V
-50 -31 R
0 62 V
50 -62 R
0 62 V
0 -63 R
51 0 V
-51 -31 R
0 62 V
51 -62 R
0 62 V
0 -62 R
50 0 V
-50 -31 R
0 62 V
50 -62 R
0 62 V
0 -73 R
101 0 V
-101 -31 R
0 62 V
101 -62 R
0 62 V
0 -90 R
126 0 V
-126 -31 R
0 62 V
126 -62 R
0 62 V
0 -92 R
126 0 V
-126 -31 R
0 62 V
126 -62 R
0 62 V
0 -88 R
126 0 V
-126 -31 R
0 62 V
126 -62 R
0 62 V
0 -87 R
126 0 V
-126 -31 R
0 62 V
126 -62 R
0 62 V
0 -99 R
252 0 V
-252 -31 R
0 62 V
252 -62 R
0 62 V
0 -180 R
630 0 V
-630 -31 R
0 62 V
630 -62 R
0 62 V
0 -199 R
630 0 V
-630 -31 R
0 62 V
630 -62 R
0 62 V
0 -166 R
630 0 V
-630 -31 R
0 62 V
630 -62 R
0 62 V
0 -153 R
630 0 V
-630 -31 R
0 62 V
630 -62 R
0 62 V
0 -182 R
1260 0 V
5580 3002 M
0 62 V
1260 -62 R
0 62 V
1813 4096 Crs
1838 4240 Crs
1863 4273 Crs
1888 4274 Crs
1913 4265 Crs
1939 4252 Crs
1964 4236 Crs
1989 4222 Crs
2014 4204 Crs
2039 4187 Crs
2077 4164 Crs
2128 4132 Crs
2178 4101 Crs
2254 4059 Crs
2367 4000 Crs
2493 3939 Crs
2619 3882 Crs
2745 3826 Crs
2934 3758 Crs
3375 3609 Crs
4005 3441 Crs
4635 3306 Crs
5265 3184 Crs
6210 3033 Crs
6232 4365 Crs
1.000 UP
1.000 UL
LT2
LTb
5769 4125 M
[ [(Helvetica) 240.0 0.0 true true 0 (HqT)]
] -80.0 MRshow
LT2
5913 4125 M
639 0 V
-639 31 R
0 -62 V
639 62 R
0 -62 V
1813 3924 M
25 251 V
25 51 V
25 17 V
25 2 V
26 -5 V
25 -10 V
25 -12 V
25 -13 V
25 -14 V
38 -22 V
51 -30 V
50 -30 V
76 -43 V
113 -62 V
126 -65 V
126 -61 V
126 -57 V
189 -78 V
441 -152 V
630 -177 V
630 -147 V
630 -128 V
945 -161 V
1813 3924 M
-31 0 R
62 0 V
-62 0 R
62 0 V
-6 251 R
-31 0 R
62 0 V
-62 0 R
62 0 V
-6 51 R
-31 0 R
62 0 V
-62 0 R
62 0 V
-6 17 R
-31 0 R
62 0 V
-62 0 R
62 0 V
-6 2 R
-31 0 R
62 0 V
-62 0 R
62 0 V
-5 -5 R
-31 0 R
62 0 V
-62 0 R
62 0 V
-6 -10 R
-31 0 R
62 0 V
-62 0 R
62 0 V
-6 -12 R
-31 0 R
62 0 V
-62 0 R
62 0 V
-6 -13 R
-31 0 R
62 0 V
-62 0 R
62 0 V
-6 -14 R
-31 0 R
62 0 V
-62 0 R
62 0 V
7 -22 R
-31 0 R
62 0 V
-62 0 R
62 0 V
20 -30 R
-31 0 R
62 0 V
-62 0 R
62 0 V
19 -30 R
-31 0 R
62 0 V
-62 0 R
62 0 V
45 -43 R
-31 0 R
62 0 V
-62 0 R
62 0 V
82 -62 R
-31 0 R
62 0 V
-62 0 R
62 0 V
stroke 2398 4004 M
95 -65 R
-31 0 R
62 0 V
-62 0 R
62 0 V
95 -61 R
-31 0 R
62 0 V
-62 0 R
62 0 V
95 -57 R
-31 0 R
62 0 V
-62 0 R
62 0 V
158 -78 R
-31 0 R
62 0 V
-62 0 R
62 0 V
410 -152 R
-31 0 R
62 0 V
-62 0 R
62 0 V
599 -177 R
-31 0 R
62 0 V
-62 0 R
62 0 V
599 -147 R
-31 0 R
62 0 V
-62 0 R
62 0 V
599 -128 R
-31 0 R
62 0 V
-62 0 R
62 0 V
914 -161 R
-31 0 R
62 0 V
-62 0 R
62 0 V
1800 3924 M
25 0 V
-25 -31 R
0 62 V
25 -62 R
0 62 V
0 220 R
25 0 V
-25 -31 R
0 62 V
25 -62 R
0 62 V
0 20 R
26 0 V
-26 -31 R
0 62 V
26 -62 R
0 62 V
0 -14 R
25 0 V
-25 -31 R
0 62 V
25 -62 R
0 62 V
0 -29 R
25 0 V
-25 -31 R
0 62 V
25 -62 R
0 62 V
0 -36 R
25 0 V
-25 -31 R
0 62 V
25 -62 R
0 62 V
0 -41 R
25 0 V
-25 -31 R
0 62 V
25 -62 R
0 62 V
0 -43 R
26 0 V
-26 -31 R
0 62 V
26 -62 R
0 62 V
0 -44 R
25 0 V
-25 -31 R
0 62 V
25 -62 R
0 62 V
0 -45 R
25 0 V
-25 -31 R
0 62 V
25 -62 R
0 62 V
stroke 2052 4222 M
0 -53 R
50 0 V
-50 -31 R
0 62 V
50 -62 R
0 62 V
0 -61 R
51 0 V
-51 -31 R
0 62 V
51 -62 R
0 62 V
0 -61 R
50 0 V
-50 -31 R
0 62 V
50 -62 R
0 62 V
0 -74 R
101 0 V
-101 -31 R
0 62 V
101 -62 R
0 62 V
0 -93 R
126 0 V
-126 -31 R
0 62 V
126 -62 R
0 62 V
0 -96 R
126 0 V
-126 -31 R
0 62 V
126 -62 R
0 62 V
0 -92 R
126 0 V
-126 -31 R
0 62 V
126 -62 R
0 62 V
0 -88 R
126 0 V
-126 -31 R
0 62 V
126 -62 R
0 62 V
0 -109 R
252 0 V
-252 -31 R
0 62 V
252 -62 R
0 62 V
0 -183 R
630 0 V
-630 -31 R
0 62 V
630 -62 R
0 62 V
0 -208 R
630 0 V
-630 -31 R
0 62 V
630 -62 R
0 62 V
0 -178 R
630 0 V
-630 -31 R
0 62 V
630 -62 R
0 62 V
0 -159 R
630 0 V
-630 -31 R
0 62 V
630 -62 R
0 62 V
0 -192 R
1260 0 V
5580 2947 M
0 62 V
1260 -62 R
0 62 V
1813 3924 Star
1838 4175 Star
1863 4226 Star
1888 4243 Star
1913 4245 Star
1939 4240 Star
1964 4230 Star
1989 4218 Star
2014 4205 Star
2039 4191 Star
2077 4169 Star
2128 4139 Star
2178 4109 Star
2254 4066 Star
2367 4004 Star
2493 3939 Star
2619 3878 Star
2745 3821 Star
2934 3743 Star
3375 3591 Star
4005 3414 Star
4635 3267 Star
5265 3139 Star
6210 2978 Star
6232 4125 Star
1.000 UP
1.000 UL
LT2
LTb
5769 3885 M
[ [(Helvetica) 240.0 0.0 true true 0 ( )]
] -80.0 MRshow
LT2
5913 3885 M
639 0 V
-639 31 R
0 -62 V
639 62 R
0 -62 V
1813 3994 M
25 193 V
25 58 V
25 20 V
25 5 V
26 -4 V
25 -8 V
25 -11 V
25 -12 V
25 -13 V
38 -20 V
51 -28 V
50 -28 V
76 -40 V
113 -58 V
126 -61 V
126 -57 V
126 -54 V
189 -72 V
441 -140 V
630 -175 V
630 -152 V
630 -134 V
945 -170 V
1813 3994 M
-31 0 R
62 0 V
-62 0 R
62 0 V
-6 193 R
-31 0 R
62 0 V
-62 0 R
62 0 V
-6 58 R
-31 0 R
62 0 V
-62 0 R
62 0 V
-6 20 R
-31 0 R
62 0 V
-62 0 R
62 0 V
-6 5 R
-31 0 R
62 0 V
-62 0 R
62 0 V
-5 -4 R
-31 0 R
62 0 V
-62 0 R
62 0 V
-6 -8 R
-31 0 R
62 0 V
-62 0 R
62 0 V
-6 -11 R
-31 0 R
62 0 V
-62 0 R
62 0 V
-6 -12 R
-31 0 R
62 0 V
-62 0 R
62 0 V
-6 -13 R
-31 0 R
62 0 V
-62 0 R
62 0 V
7 -20 R
-31 0 R
62 0 V
-62 0 R
62 0 V
20 -28 R
-31 0 R
62 0 V
-62 0 R
62 0 V
19 -28 R
-31 0 R
62 0 V
-62 0 R
62 0 V
45 -40 R
-31 0 R
62 0 V
-62 0 R
62 0 V
82 -58 R
-31 0 R
62 0 V
-62 0 R
62 0 V
stroke 2398 4048 M
95 -61 R
-31 0 R
62 0 V
-62 0 R
62 0 V
95 -57 R
-31 0 R
62 0 V
-62 0 R
62 0 V
95 -54 R
-31 0 R
62 0 V
-62 0 R
62 0 V
158 -72 R
-31 0 R
62 0 V
-62 0 R
62 0 V
410 -140 R
-31 0 R
62 0 V
-62 0 R
62 0 V
599 -175 R
-31 0 R
62 0 V
-62 0 R
62 0 V
599 -152 R
-31 0 R
62 0 V
-62 0 R
62 0 V
599 -134 R
-31 0 R
62 0 V
-62 0 R
62 0 V
914 -170 R
-31 0 R
62 0 V
-62 0 R
62 0 V
1800 3994 M
25 0 V
-25 -31 R
0 62 V
25 -62 R
0 62 V
0 162 R
25 0 V
-25 -31 R
0 62 V
25 -62 R
0 62 V
0 27 R
26 0 V
-26 -31 R
0 62 V
26 -62 R
0 62 V
0 -11 R
25 0 V
-25 -31 R
0 62 V
25 -62 R
0 62 V
0 -26 R
25 0 V
-25 -31 R
0 62 V
25 -62 R
0 62 V
0 -35 R
25 0 V
-25 -31 R
0 62 V
25 -62 R
0 62 V
0 -39 R
25 0 V
-25 -31 R
0 62 V
25 -62 R
0 62 V
0 -42 R
26 0 V
-26 -31 R
0 62 V
26 -62 R
0 62 V
0 -43 R
25 0 V
-25 -31 R
0 62 V
25 -62 R
0 62 V
0 -44 R
25 0 V
-25 -31 R
0 62 V
25 -62 R
0 62 V
stroke 2052 4253 M
0 -51 R
50 0 V
-50 -31 R
0 62 V
50 -62 R
0 62 V
0 -59 R
51 0 V
-51 -31 R
0 62 V
51 -62 R
0 62 V
0 -59 R
50 0 V
-50 -31 R
0 62 V
50 -62 R
0 62 V
0 -71 R
101 0 V
-101 -31 R
0 62 V
101 -62 R
0 62 V
0 -89 R
126 0 V
-126 -31 R
0 62 V
126 -62 R
0 62 V
0 -92 R
126 0 V
-126 -31 R
0 62 V
126 -62 R
0 62 V
0 -88 R
126 0 V
-126 -31 R
0 62 V
126 -62 R
0 62 V
0 -85 R
126 0 V
-126 -31 R
0 62 V
126 -62 R
0 62 V
0 -103 R
252 0 V
-252 -31 R
0 62 V
252 -62 R
0 62 V
0 -171 R
630 0 V
-630 -31 R
0 62 V
630 -62 R
0 62 V
0 -206 R
630 0 V
-630 -31 R
0 62 V
630 -62 R
0 62 V
0 -183 R
630 0 V
-630 -31 R
0 62 V
630 -62 R
0 62 V
0 -165 R
630 0 V
-630 -31 R
0 62 V
630 -62 R
0 62 V
0 -201 R
1260 0 V
5580 3002 M
0 62 V
1260 -62 R
0 62 V
1813 3994 Box
1838 4187 Box
1863 4245 Box
1888 4265 Box
1913 4270 Box
1939 4266 Box
1964 4258 Box
1989 4247 Box
2014 4235 Box
2039 4222 Box
2077 4202 Box
2128 4174 Box
2178 4146 Box
2254 4106 Box
2367 4048 Box
2493 3987 Box
2619 3930 Box
2745 3876 Box
2934 3804 Box
3375 3664 Box
4005 3489 Box
4635 3337 Box
5265 3203 Box
6210 3033 Box
6232 3885 Box
1.000 UP
1.000 UL
LT1
LTb
5769 3645 M
[ [(Helvetica) 240.0 0.0 true true 0 (PYTHIA)]
] -80.0 MRshow
LT1
5913 3645 M
639 0 V
-639 31 R
0 -62 V
639 62 R
0 -62 V
1813 4081 M
25 143 V
25 32 V
25 0 V
25 -10 V
26 -15 V
25 -17 V
25 -16 V
25 -19 V
25 -16 V
38 -29 V
51 -32 V
50 -37 V
76 -50 V
113 -76 V
126 -87 V
126 -84 V
126 -94 V
189 -130 V
441 -353 V
582 -671 V
1813 4081 M
-31 0 R
62 0 V
-62 0 R
62 0 V
-6 143 R
-31 0 R
62 0 V
-62 0 R
62 0 V
-6 32 R
-31 0 R
62 0 V
-62 0 R
62 0 V
-6 0 R
-31 0 R
62 0 V
-62 0 R
62 0 V
-6 -10 R
-31 0 R
62 0 V
-62 0 R
62 0 V
-5 -15 R
-31 0 R
62 0 V
-62 0 R
62 0 V
-6 -17 R
-31 0 R
62 0 V
-62 0 R
62 0 V
-6 -16 R
-31 0 R
62 0 V
-62 0 R
62 0 V
-6 -19 R
-31 0 R
62 0 V
-62 0 R
62 0 V
-6 -16 R
-31 0 R
62 0 V
-62 0 R
62 0 V
7 -29 R
-31 0 R
62 0 V
-62 0 R
62 0 V
20 -32 R
-31 0 R
62 0 V
-62 0 R
62 0 V
19 -37 R
-31 0 R
62 0 V
-62 0 R
62 0 V
45 -50 R
-31 0 R
62 0 V
-62 0 R
62 0 V
82 -76 R
-31 0 R
62 0 V
-62 0 R
62 0 V
95 -87 R
-31 0 R
62 0 V
stroke 2524 3852 M
-62 0 R
62 0 V
95 -84 R
-31 0 R
62 0 V
-62 0 R
62 0 V
95 -94 R
-31 0 R
62 0 V
-62 0 R
62 0 V
158 -130 R
-31 0 R
62 0 V
-62 0 R
62 0 V
410 -353 R
-31 0 R
62 0 V
-62 0 R
62 0 V
1800 4081 M
25 0 V
-25 -31 R
0 62 V
25 -62 R
0 62 V
0 112 R
25 0 V
-25 -31 R
0 62 V
25 -62 R
0 62 V
0 1 R
26 0 V
-26 -31 R
0 62 V
26 -62 R
0 62 V
0 -31 R
25 0 V
-25 -31 R
0 62 V
25 -62 R
0 62 V
0 -41 R
25 0 V
-25 -31 R
0 62 V
25 -62 R
0 62 V
0 -46 R
25 0 V
-25 -31 R
0 62 V
25 -62 R
0 62 V
0 -48 R
25 0 V
-25 -31 R
0 62 V
25 -62 R
0 62 V
0 -47 R
26 0 V
-26 -31 R
0 62 V
26 -62 R
0 62 V
0 -50 R
25 0 V
-25 -31 R
0 62 V
25 -62 R
0 62 V
0 -47 R
25 0 V
-25 -31 R
0 62 V
25 -62 R
0 62 V
0 -60 R
50 0 V
-50 -31 R
0 62 V
50 -62 R
0 62 V
0 -63 R
51 0 V
-51 -31 R
0 62 V
51 -62 R
0 62 V
0 -68 R
50 0 V
-50 -31 R
0 62 V
50 -62 R
0 62 V
0 -81 R
101 0 V
-101 -31 R
0 62 V
stroke 2203 4046 M
101 -62 R
0 62 V
0 -107 R
126 0 V
-126 -31 R
0 62 V
126 -62 R
0 62 V
0 -118 R
126 0 V
-126 -31 R
0 62 V
126 -62 R
0 62 V
0 -115 R
126 0 V
-126 -31 R
0 62 V
126 -62 R
0 62 V
0 -125 R
126 0 V
-126 -31 R
0 62 V
126 -62 R
0 62 V
0 -161 R
252 0 V
-252 -31 R
0 62 V
252 -62 R
0 62 V
0 -384 R
630 0 V
-630 -31 R
0 62 V
630 -62 R
0 62 V
1813 4081 BoxF
1838 4224 BoxF
1863 4256 BoxF
1888 4256 BoxF
1913 4246 BoxF
1939 4231 BoxF
1964 4214 BoxF
1989 4198 BoxF
2014 4179 BoxF
2039 4163 BoxF
2077 4134 BoxF
2128 4102 BoxF
2178 4065 BoxF
2254 4015 BoxF
2367 3939 BoxF
2493 3852 BoxF
2619 3768 BoxF
2745 3674 BoxF
2934 3544 BoxF
3375 3191 BoxF
6232 3645 BoxF
1.000 UL
LTb
1800 4788 N
0 -2268 V
5040 0 V
0 2268 V
-5040 0 V
Z stroke
1.000 UP
1.000 UL
LTb
1.000 UL
LTb
1800 1512 M
63 0 V
4977 0 R
-63 0 V
stroke
1656 1512 M
[ [(Helvetica) 240.0 0.0 true true 0 (0)]
] -80.0 MRshow
1.000 UL
LTb
1800 1764 M
63 0 V
4977 0 R
-63 0 V
stroke
1656 1764 M
[ [(Helvetica) 240.0 0.0 true true 0 (0.5)]
] -80.0 MRshow
1.000 UL
LTb
1800 2016 M
63 0 V
4977 0 R
-63 0 V
stroke
1656 2016 M
[ [(Helvetica) 240.0 0.0 true true 0 (1)]
] -80.0 MRshow
1.000 UL
LTb
1800 2268 M
63 0 V
4977 0 R
-63 0 V
stroke
1656 2268 M
[ [(Helvetica) 240.0 0.0 true true 0 (1.5)]
] -80.0 MRshow
1.000 UL
LTb
1800 2520 M
63 0 V
4977 0 R
-63 0 V
stroke
1656 2520 M
[ [(Helvetica) 240.0 0.0 true true 0 ( )]
] -80.0 MRshow
1.000 UL
LTb
1800 1512 M
0 63 V
0 945 R
0 -63 V
stroke
1800 1272 M
[ [(Helvetica) 240.0 0.0 true true 0 ( 0)]
] -80.0 MCshow
1.000 UL
LTb
2430 1512 M
0 63 V
0 945 R
0 -63 V
stroke
2430 1272 M
[ [(Helvetica) 240.0 0.0 true true 0 ( 50)]
] -80.0 MCshow
1.000 UL
LTb
3060 1512 M
0 63 V
0 945 R
0 -63 V
stroke
3060 1272 M
[ [(Helvetica) 240.0 0.0 true true 0 ( 100)]
] -80.0 MCshow
1.000 UL
LTb
3690 1512 M
0 63 V
0 945 R
0 -63 V
stroke
3690 1272 M
[ [(Helvetica) 240.0 0.0 true true 0 ( 150)]
] -80.0 MCshow
1.000 UL
LTb
4320 1512 M
0 63 V
0 945 R
0 -63 V
stroke
4320 1272 M
[ [(Helvetica) 240.0 0.0 true true 0 ( 200)]
] -80.0 MCshow
1.000 UL
LTb
4950 1512 M
0 63 V
0 945 R
0 -63 V
stroke
4950 1272 M
[ [(Helvetica) 240.0 0.0 true true 0 ( 250)]
] -80.0 MCshow
1.000 UL
LTb
5580 1512 M
0 63 V
0 945 R
0 -63 V
stroke
5580 1272 M
[ [(Helvetica) 240.0 0.0 true true 0 ( 300)]
] -80.0 MCshow
1.000 UL
LTb
6210 1512 M
0 63 V
0 945 R
0 -63 V
stroke
6210 1272 M
[ [(Helvetica) 240.0 0.0 true true 0 ( 350)]
] -80.0 MCshow
1.000 UL
LTb
6840 1512 M
0 63 V
0 945 R
0 -63 V
stroke
6840 1272 M
[ [(Helvetica) 240.0 0.0 true true 0 ( 400)]
] -80.0 MCshow
1.000 UL
LTb
1.000 UL
LTb
1800 2520 N
0 -1008 V
5040 0 V
0 1008 V
-5040 0 V
Z stroke
LCb setrgbcolor
960 2016 M
currentpoint gsave translate 90 rotate 0 0 moveto
[ [(Helvetica) 240.0 0.0 true true 0 (ratio to HqT)]
] -80.0 MCshow
grestore
LTb
LCb setrgbcolor
4320 912 M
[ [(Helvetica) 240.0 0.0 true true 0 (p)]
[(Helvetica) 192.0 -72.0 true true 0 (T)]
[(Helvetica) 240.0 0.0 true true 0 ( \(GeV\))]
] -56.0 MCshow
LTb
1.000 UP
1.000 UL
LTb
1.000 UP
1.000 UL
LT0
1813 2520 M
25 -282 V
25 -87 V
25 -68 V
25 -44 V
26 -27 V
25 -22 V
25 -10 V
25 -13 V
25 -9 V
38 -7 V
51 -7 V
50 -5 V
76 -3 V
113 5 V
126 6 V
126 6 V
126 -3 V
189 22 V
441 -10 V
630 19 V
630 37 V
630 27 V
945 40 V
1838 2238 M
-31 0 R
62 0 V
-62 0 R
62 0 V
-6 -87 R
-31 0 R
62 0 V
-62 0 R
62 0 V
-6 -68 R
-31 0 R
62 0 V
-62 0 R
62 0 V
-6 -44 R
-31 0 R
62 0 V
-62 0 R
62 0 V
-5 -27 R
-31 0 R
62 0 V
-62 0 R
62 0 V
-6 -22 R
-31 0 R
62 0 V
-62 0 R
62 0 V
-6 -10 R
-31 0 R
62 0 V
-62 0 R
62 0 V
-6 -13 R
-31 0 R
62 0 V
-62 0 R
62 0 V
-6 -9 R
-31 0 R
62 0 V
-62 0 R
62 0 V
7 -7 R
-31 0 R
62 0 V
-62 0 R
62 0 V
20 -7 R
-31 0 R
62 0 V
-62 0 R
62 0 V
19 -5 R
-31 0 R
62 0 V
-62 0 R
62 0 V
45 -3 R
-31 0 R
62 0 V
-62 0 R
62 0 V
82 5 R
-31 0 R
62 0 V
-62 0 R
62 0 V
95 6 R
-31 0 R
62 0 V
-62 0 R
62 0 V
95 6 R
-31 0 R
62 0 V
-62 0 R
62 0 V
95 -3 R
-31 0 R
62 0 V
stroke 2776 1950 M
-62 0 R
62 0 V
158 22 R
-31 0 R
62 0 V
-62 0 R
62 0 V
410 -10 R
-31 0 R
62 0 V
-62 0 R
62 0 V
599 19 R
-31 0 R
62 0 V
-62 0 R
62 0 V
599 37 R
-31 0 R
62 0 V
-62 0 R
62 0 V
599 27 R
-31 0 R
62 0 V
-62 0 R
62 0 V
914 40 R
-31 0 R
62 0 V
-62 0 R
62 0 V
1825 2238 M
25 0 V
-25 -31 R
0 62 V
25 -62 R
0 62 V
0 -118 R
26 0 V
-26 -31 R
0 62 V
26 -62 R
0 62 V
0 -99 R
25 0 V
-25 -31 R
0 62 V
25 -62 R
0 62 V
0 -75 R
25 0 V
-25 -31 R
0 62 V
25 -62 R
0 62 V
0 -58 R
25 0 V
-25 -31 R
0 62 V
25 -62 R
0 62 V
0 -53 R
25 0 V
-25 -31 R
0 62 V
25 -62 R
0 62 V
0 -41 R
26 0 V
-26 -31 R
0 62 V
26 -62 R
0 62 V
0 -44 R
25 0 V
-25 -31 R
0 62 V
25 -62 R
0 62 V
0 -40 R
25 0 V
-25 -31 R
0 62 V
25 -62 R
0 62 V
0 -38 R
50 0 V
-50 -31 R
0 62 V
50 -62 R
0 62 V
0 -38 R
51 0 V
-51 -31 R
0 62 V
51 -62 R
0 62 V
0 -36 R
50 0 V
-50 -31 R
0 62 V
50 -62 R
0 62 V
stroke 2203 1970 M
0 -34 R
101 0 V
-101 -31 R
0 62 V
101 -62 R
0 62 V
0 -26 R
126 0 V
-126 -31 R
0 62 V
126 -62 R
0 62 V
0 -25 R
126 0 V
-126 -31 R
0 62 V
126 -62 R
0 62 V
0 -25 R
126 0 V
-126 -31 R
0 62 V
126 -62 R
0 62 V
0 -34 R
126 0 V
-126 -31 R
0 62 V
126 -62 R
0 62 V
0 -9 R
252 0 V
-252 -31 R
0 62 V
252 -62 R
0 62 V
0 -41 R
630 0 V
-630 -31 R
0 62 V
630 -62 R
0 62 V
0 -12 R
630 0 V
-630 -31 R
0 62 V
630 -62 R
0 62 V
0 6 R
630 0 V
-630 -31 R
0 62 V
630 -62 R
0 62 V
0 -4 R
630 0 V
-630 -31 R
0 62 V
630 -62 R
0 62 V
0 9 R
1260 0 V
5580 2054 M
0 62 V
1260 -62 R
0 62 V
1838 2238 Pls
1863 2151 Pls
1888 2083 Pls
1913 2039 Pls
1939 2012 Pls
1964 1990 Pls
1989 1980 Pls
2014 1967 Pls
2039 1958 Pls
2077 1951 Pls
2128 1944 Pls
2178 1939 Pls
2254 1936 Pls
2367 1941 Pls
2493 1947 Pls
2619 1953 Pls
2745 1950 Pls
2934 1972 Pls
3375 1962 Pls
4005 1981 Pls
4635 2018 Pls
5265 2045 Pls
6210 2085 Pls
1.000 UP
1.000 UL
LT0
1813 2287 M
25 -212 V
25 -80 V
25 -51 V
25 -35 V
26 -18 V
25 -16 V
25 -15 V
25 -9 V
25 -11 V
38 -4 V
51 -11 V
50 -3 V
76 -7 V
113 -11 V
126 -8 V
126 -17 V
126 -9 V
189 -6 V
441 -32 V
630 -9 V
630 25 V
630 -3 V
945 28 V
1813 2287 M
-31 0 R
62 0 V
-62 0 R
62 0 V
-6 -212 R
-31 0 R
62 0 V
-62 0 R
62 0 V
-6 -80 R
-31 0 R
62 0 V
-62 0 R
62 0 V
-6 -51 R
-31 0 R
62 0 V
-62 0 R
62 0 V
-6 -35 R
-31 0 R
62 0 V
-62 0 R
62 0 V
-5 -18 R
-31 0 R
62 0 V
-62 0 R
62 0 V
-6 -16 R
-31 0 R
62 0 V
-62 0 R
62 0 V
-6 -15 R
-31 0 R
62 0 V
-62 0 R
62 0 V
-6 -9 R
-31 0 R
62 0 V
-62 0 R
62 0 V
-6 -11 R
-31 0 R
62 0 V
-62 0 R
62 0 V
7 -4 R
-31 0 R
62 0 V
-62 0 R
62 0 V
20 -11 R
-31 0 R
62 0 V
-62 0 R
62 0 V
19 -3 R
-31 0 R
62 0 V
-62 0 R
62 0 V
45 -7 R
-31 0 R
62 0 V
-62 0 R
62 0 V
82 -11 R
-31 0 R
62 0 V
-62 0 R
62 0 V
95 -8 R
-31 0 R
62 0 V
-62 0 R
62 0 V
95 -17 R
-31 0 R
62 0 V
stroke 2650 1779 M
-62 0 R
62 0 V
95 -9 R
-31 0 R
62 0 V
-62 0 R
62 0 V
158 -6 R
-31 0 R
62 0 V
-62 0 R
62 0 V
410 -32 R
-31 0 R
62 0 V
-62 0 R
62 0 V
599 -9 R
-31 0 R
62 0 V
-62 0 R
62 0 V
599 25 R
-31 0 R
62 0 V
-62 0 R
62 0 V
599 -3 R
-31 0 R
62 0 V
-62 0 R
62 0 V
914 28 R
-31 0 R
62 0 V
-62 0 R
62 0 V
1800 2287 M
25 0 V
-25 -31 R
0 62 V
25 -62 R
0 62 V
0 -243 R
25 0 V
-25 -31 R
0 62 V
25 -62 R
0 62 V
0 -111 R
26 0 V
-26 -31 R
0 62 V
26 -62 R
0 62 V
0 -82 R
25 0 V
-25 -31 R
0 62 V
25 -62 R
0 62 V
0 -66 R
25 0 V
-25 -31 R
0 62 V
25 -62 R
0 62 V
0 -49 R
25 0 V
-25 -31 R
0 62 V
25 -62 R
0 62 V
0 -47 R
25 0 V
-25 -31 R
0 62 V
25 -62 R
0 62 V
0 -46 R
26 0 V
-26 -31 R
0 62 V
26 -62 R
0 62 V
0 -40 R
25 0 V
-25 -31 R
0 62 V
25 -62 R
0 62 V
0 -42 R
25 0 V
-25 -31 R
0 62 V
25 -62 R
0 62 V
0 -35 R
50 0 V
-50 -31 R
0 62 V
50 -62 R
0 62 V
0 -42 R
51 0 V
stroke 2153 1825 M
-51 -31 R
0 62 V
51 -62 R
0 62 V
0 -34 R
50 0 V
-50 -31 R
0 62 V
50 -62 R
0 62 V
0 -38 R
101 0 V
-101 -31 R
0 62 V
101 -62 R
0 62 V
0 -42 R
126 0 V
-126 -31 R
0 62 V
126 -62 R
0 62 V
0 -39 R
126 0 V
-126 -31 R
0 62 V
126 -62 R
0 62 V
0 -48 R
126 0 V
-126 -31 R
0 62 V
126 -62 R
0 62 V
0 -40 R
126 0 V
-126 -31 R
0 62 V
126 -62 R
0 62 V
0 -37 R
252 0 V
-252 -31 R
0 62 V
252 -62 R
0 62 V
0 -63 R
630 0 V
-630 -31 R
0 62 V
630 -62 R
0 62 V
0 -40 R
630 0 V
-630 -31 R
0 62 V
630 -62 R
0 62 V
0 -6 R
630 0 V
-630 -31 R
0 62 V
630 -62 R
0 62 V
0 -34 R
630 0 V
-630 -31 R
0 62 V
630 -62 R
0 62 V
0 -3 R
1260 0 V
5580 1742 M
0 62 V
1260 -62 R
0 62 V
1813 2287 Crs
1838 2075 Crs
1863 1995 Crs
1888 1944 Crs
1913 1909 Crs
1939 1891 Crs
1964 1875 Crs
1989 1860 Crs
2014 1851 Crs
2039 1840 Crs
2077 1836 Crs
2128 1825 Crs
2178 1822 Crs
2254 1815 Crs
2367 1804 Crs
2493 1796 Crs
2619 1779 Crs
2745 1770 Crs
2934 1764 Crs
3375 1732 Crs
4005 1723 Crs
4635 1748 Crs
5265 1745 Crs
6210 1773 Crs
1.000 UP
1.000 UL
LT2
1813 2055 M
25 -17 V
25 11 V
25 4 V
25 2 V
26 1 V
25 1 V
25 2 V
25 2 V
25 1 V
38 3 V
51 3 V
50 4 V
76 5 V
113 7 V
126 8 V
126 8 V
126 8 V
189 10 V
441 22 V
630 -1 V
630 -13 V
630 -16 V
945 -25 V
1813 2055 M
-31 0 R
62 0 V
-62 0 R
62 0 V
-6 -17 R
-31 0 R
62 0 V
-62 0 R
62 0 V
-6 11 R
-31 0 R
62 0 V
-62 0 R
62 0 V
-6 4 R
-31 0 R
62 0 V
-62 0 R
62 0 V
-6 2 R
-31 0 R
62 0 V
-62 0 R
62 0 V
-5 1 R
-31 0 R
62 0 V
-62 0 R
62 0 V
-6 1 R
-31 0 R
62 0 V
-62 0 R
62 0 V
-6 2 R
-31 0 R
62 0 V
-62 0 R
62 0 V
-6 2 R
-31 0 R
62 0 V
-62 0 R
62 0 V
-6 1 R
-31 0 R
62 0 V
-62 0 R
62 0 V
7 3 R
-31 0 R
62 0 V
-62 0 R
62 0 V
20 3 R
-31 0 R
62 0 V
-62 0 R
62 0 V
19 4 R
-31 0 R
62 0 V
-62 0 R
62 0 V
45 5 R
-31 0 R
62 0 V
-62 0 R
62 0 V
82 7 R
-31 0 R
62 0 V
-62 0 R
62 0 V
95 8 R
-31 0 R
62 0 V
-62 0 R
62 0 V
95 8 R
-31 0 R
62 0 V
stroke 2650 2100 M
-62 0 R
62 0 V
95 8 R
-31 0 R
62 0 V
-62 0 R
62 0 V
158 10 R
-31 0 R
62 0 V
-62 0 R
62 0 V
410 22 R
-31 0 R
62 0 V
-62 0 R
62 0 V
599 -1 R
-31 0 R
62 0 V
-62 0 R
62 0 V
599 -13 R
-31 0 R
62 0 V
-62 0 R
62 0 V
599 -16 R
-31 0 R
62 0 V
-62 0 R
62 0 V
914 -25 R
-31 0 R
62 0 V
-62 0 R
62 0 V
1800 2055 M
25 0 V
-25 -31 R
0 62 V
25 -62 R
0 62 V
0 -48 R
25 0 V
-25 -31 R
0 62 V
25 -62 R
0 62 V
0 -20 R
26 0 V
-26 -31 R
0 62 V
26 -62 R
0 62 V
0 -27 R
25 0 V
-25 -31 R
0 62 V
25 -62 R
0 62 V
0 -29 R
25 0 V
-25 -31 R
0 62 V
25 -62 R
0 62 V
0 -30 R
25 0 V
-25 -31 R
0 62 V
25 -62 R
0 62 V
0 -30 R
25 0 V
-25 -31 R
0 62 V
25 -62 R
0 62 V
0 -29 R
26 0 V
-26 -31 R
0 62 V
26 -62 R
0 62 V
0 -29 R
25 0 V
-25 -31 R
0 62 V
25 -62 R
0 62 V
0 -30 R
25 0 V
-25 -31 R
0 62 V
25 -62 R
0 62 V
0 -28 R
50 0 V
-50 -31 R
0 62 V
50 -62 R
0 62 V
0 -28 R
51 0 V
stroke 2153 2068 M
-51 -31 R
0 62 V
51 -62 R
0 62 V
0 -27 R
50 0 V
-50 -31 R
0 62 V
50 -62 R
0 62 V
0 -26 R
101 0 V
-101 -31 R
0 62 V
101 -62 R
0 62 V
0 -24 R
126 0 V
-126 -31 R
0 62 V
126 -62 R
0 62 V
0 -23 R
126 0 V
-126 -31 R
0 62 V
126 -62 R
0 62 V
0 -23 R
126 0 V
-126 -31 R
0 62 V
126 -62 R
0 62 V
0 -23 R
126 0 V
-126 -31 R
0 62 V
126 -62 R
0 62 V
0 -21 R
252 0 V
-252 -31 R
0 62 V
252 -62 R
0 62 V
0 -9 R
630 0 V
-630 -31 R
0 62 V
630 -62 R
0 62 V
0 -32 R
630 0 V
-630 -31 R
0 62 V
630 -62 R
0 62 V
0 -44 R
630 0 V
-630 -31 R
0 62 V
630 -62 R
0 62 V
0 -47 R
630 0 V
-630 -31 R
0 62 V
630 -62 R
0 62 V
0 -56 R
1260 0 V
5580 2054 M
0 62 V
1260 -62 R
0 62 V
1813 2055 Star
1838 2038 Star
1863 2049 Star
1888 2053 Star
1913 2055 Star
1939 2056 Star
1964 2057 Star
1989 2059 Star
2014 2061 Star
2039 2062 Star
2077 2065 Star
2128 2068 Star
2178 2072 Star
2254 2077 Star
2367 2084 Star
2493 2092 Star
2619 2100 Star
2745 2108 Star
2934 2118 Star
3375 2140 Star
4005 2139 Star
4635 2126 Star
5265 2110 Star
6210 2085 Star
1.000 UP
1.000 UL
LT2
1813 1866 M
25 137 V
25 -11 V
25 -7 V
25 -5 V
26 -4 V
25 -3 V
25 -2 V
25 -2 V
25 -2 V
38 -2 V
51 -3 V
50 -2 V
76 -4 V
113 -4 V
126 -5 V
126 -5 V
126 -4 V
189 -8 V
441 -15 V
630 -5 V
630 3 V
630 3 V
945 6 V
1813 1866 M
-31 0 R
62 0 V
-62 0 R
62 0 V
-6 137 R
-31 0 R
62 0 V
-62 0 R
62 0 V
-6 -11 R
-31 0 R
62 0 V
-62 0 R
62 0 V
-6 -7 R
-31 0 R
62 0 V
-62 0 R
62 0 V
-6 -5 R
-31 0 R
62 0 V
-62 0 R
62 0 V
-5 -4 R
-31 0 R
62 0 V
-62 0 R
62 0 V
-6 -3 R
-31 0 R
62 0 V
-62 0 R
62 0 V
-6 -2 R
-31 0 R
62 0 V
-62 0 R
62 0 V
-6 -2 R
-31 0 R
62 0 V
-62 0 R
62 0 V
-6 -2 R
-31 0 R
62 0 V
-62 0 R
62 0 V
7 -2 R
-31 0 R
62 0 V
-62 0 R
62 0 V
20 -3 R
-31 0 R
62 0 V
-62 0 R
62 0 V
19 -2 R
-31 0 R
62 0 V
-62 0 R
62 0 V
45 -4 R
-31 0 R
62 0 V
-62 0 R
62 0 V
82 -4 R
-31 0 R
62 0 V
-62 0 R
62 0 V
95 -5 R
-31 0 R
62 0 V
-62 0 R
62 0 V
95 -5 R
-31 0 R
62 0 V
stroke 2650 1942 M
-62 0 R
62 0 V
95 -4 R
-31 0 R
62 0 V
-62 0 R
62 0 V
158 -8 R
-31 0 R
62 0 V
-62 0 R
62 0 V
410 -15 R
-31 0 R
62 0 V
-62 0 R
62 0 V
599 -5 R
-31 0 R
62 0 V
-62 0 R
62 0 V
599 3 R
-31 0 R
62 0 V
-62 0 R
62 0 V
599 3 R
-31 0 R
62 0 V
-62 0 R
62 0 V
914 6 R
-31 0 R
62 0 V
-62 0 R
62 0 V
1800 1866 M
25 0 V
-25 -31 R
0 62 V
25 -62 R
0 62 V
0 106 R
25 0 V
-25 -31 R
0 62 V
25 -62 R
0 62 V
0 -42 R
26 0 V
-26 -31 R
0 62 V
26 -62 R
0 62 V
0 -38 R
25 0 V
-25 -31 R
0 62 V
25 -62 R
0 62 V
0 -36 R
25 0 V
-25 -31 R
0 62 V
25 -62 R
0 62 V
0 -35 R
25 0 V
-25 -31 R
0 62 V
25 -62 R
0 62 V
0 -34 R
25 0 V
-25 -31 R
0 62 V
25 -62 R
0 62 V
0 -33 R
26 0 V
-26 -31 R
0 62 V
26 -62 R
0 62 V
0 -33 R
25 0 V
-25 -31 R
0 62 V
25 -62 R
0 62 V
0 -33 R
25 0 V
-25 -31 R
0 62 V
25 -62 R
0 62 V
0 -33 R
50 0 V
-50 -31 R
0 62 V
50 -62 R
0 62 V
0 -34 R
51 0 V
stroke 2153 1962 M
-51 -31 R
0 62 V
51 -62 R
0 62 V
0 -33 R
50 0 V
-50 -31 R
0 62 V
50 -62 R
0 62 V
0 -35 R
101 0 V
-101 -31 R
0 62 V
101 -62 R
0 62 V
0 -35 R
126 0 V
-126 -31 R
0 62 V
126 -62 R
0 62 V
0 -36 R
126 0 V
-126 -31 R
0 62 V
126 -62 R
0 62 V
0 -36 R
126 0 V
-126 -31 R
0 62 V
126 -62 R
0 62 V
0 -35 R
126 0 V
-126 -31 R
0 62 V
126 -62 R
0 62 V
0 -39 R
252 0 V
-252 -31 R
0 62 V
252 -62 R
0 62 V
0 -46 R
630 0 V
-630 -31 R
0 62 V
630 -62 R
0 62 V
0 -36 R
630 0 V
-630 -31 R
0 62 V
630 -62 R
0 62 V
0 -28 R
630 0 V
-630 -31 R
0 62 V
630 -62 R
0 62 V
0 -28 R
630 0 V
-630 -31 R
0 62 V
630 -62 R
0 62 V
0 -25 R
1260 0 V
5580 1891 M
0 62 V
1260 -62 R
0 62 V
1813 1866 Box
1838 2003 Box
1863 1992 Box
1888 1985 Box
1913 1980 Box
1939 1976 Box
1964 1973 Box
1989 1971 Box
2014 1969 Box
2039 1967 Box
2077 1965 Box
2128 1962 Box
2178 1960 Box
2254 1956 Box
2367 1952 Box
2493 1947 Box
2619 1942 Box
2745 1938 Box
2934 1930 Box
3375 1915 Box
4005 1910 Box
4635 1913 Box
5265 1916 Box
6210 1922 Box
1.000 UP
1.000 UL
LT1
1813 2432 M
25 -259 V
25 -87 V
25 -62 V
25 -42 V
26 -30 V
25 -22 V
25 -13 V
25 -15 V
25 -6 V
38 -17 V
51 -7 V
50 -18 V
76 -17 V
113 -30 V
126 -39 V
126 -36 V
126 -46 V
189 -50 V
441 -89 V
630 -34 V
1813 2432 M
-31 0 R
62 0 V
-62 0 R
62 0 V
-6 -259 R
-31 0 R
62 0 V
-62 0 R
62 0 V
-6 -87 R
-31 0 R
62 0 V
-62 0 R
62 0 V
-6 -62 R
-31 0 R
62 0 V
-62 0 R
62 0 V
-6 -42 R
-31 0 R
62 0 V
-62 0 R
62 0 V
-5 -30 R
-31 0 R
62 0 V
-62 0 R
62 0 V
-6 -22 R
-31 0 R
62 0 V
-62 0 R
62 0 V
-6 -13 R
-31 0 R
62 0 V
-62 0 R
62 0 V
-6 -15 R
-31 0 R
62 0 V
-62 0 R
62 0 V
-6 -6 R
-31 0 R
62 0 V
-62 0 R
62 0 V
7 -17 R
-31 0 R
62 0 V
-62 0 R
62 0 V
20 -7 R
-31 0 R
62 0 V
-62 0 R
62 0 V
19 -18 R
-31 0 R
62 0 V
-62 0 R
62 0 V
45 -17 R
-31 0 R
62 0 V
-62 0 R
62 0 V
82 -30 R
-31 0 R
62 0 V
-62 0 R
62 0 V
95 -39 R
-31 0 R
62 0 V
-62 0 R
62 0 V
95 -36 R
-31 0 R
62 0 V
-62 0 R
62 0 V
stroke 2650 1732 M
95 -46 R
-31 0 R
62 0 V
-62 0 R
62 0 V
158 -50 R
-31 0 R
62 0 V
-62 0 R
62 0 V
410 -89 R
-31 0 R
62 0 V
-62 0 R
62 0 V
599 -34 R
-31 0 R
62 0 V
-62 0 R
62 0 V
1800 2432 M
25 0 V
-25 -31 R
0 62 V
25 -62 R
0 62 V
0 -290 R
25 0 V
-25 -31 R
0 62 V
25 -62 R
0 62 V
0 -118 R
26 0 V
-26 -31 R
0 62 V
26 -62 R
0 62 V
0 -93 R
25 0 V
-25 -31 R
0 62 V
25 -62 R
0 62 V
0 -73 R
25 0 V
-25 -31 R
0 62 V
25 -62 R
0 62 V
0 -61 R
25 0 V
-25 -31 R
0 62 V
25 -62 R
0 62 V
0 -53 R
25 0 V
-25 -31 R
0 62 V
25 -62 R
0 62 V
0 -44 R
26 0 V
-26 -31 R
0 62 V
26 -62 R
0 62 V
0 -46 R
25 0 V
-25 -31 R
0 62 V
25 -62 R
0 62 V
0 -37 R
25 0 V
-25 -31 R
0 62 V
25 -62 R
0 62 V
0 -48 R
50 0 V
-50 -31 R
0 62 V
50 -62 R
0 62 V
0 -38 R
51 0 V
-51 -31 R
0 62 V
51 -62 R
0 62 V
0 -49 R
50 0 V
-50 -31 R
0 62 V
50 -62 R
0 62 V
0 -48 R
101 0 V
-101 -31 R
0 62 V
101 -62 R
0 62 V
stroke 2304 1868 M
0 -61 R
126 0 V
-126 -31 R
0 62 V
126 -62 R
0 62 V
0 -70 R
126 0 V
-126 -31 R
0 62 V
126 -62 R
0 62 V
0 -67 R
126 0 V
-126 -31 R
0 62 V
126 -62 R
0 62 V
0 -77 R
126 0 V
-126 -31 R
0 62 V
126 -62 R
0 62 V
0 -81 R
252 0 V
-252 -31 R
0 62 V
252 -62 R
0 62 V
0 -120 R
630 0 V
-630 -31 R
0 62 V
630 -62 R
0 62 V
0 -65 R
630 0 V
-630 -31 R
0 62 V
630 -62 R
0 62 V
1813 2432 BoxF
1838 2173 BoxF
1863 2086 BoxF
1888 2024 BoxF
1913 1982 BoxF
1939 1952 BoxF
1964 1930 BoxF
1989 1917 BoxF
2014 1902 BoxF
2039 1896 BoxF
2077 1879 BoxF
2128 1872 BoxF
2178 1854 BoxF
2254 1837 BoxF
2367 1807 BoxF
2493 1768 BoxF
2619 1732 BoxF
2745 1686 BoxF
2934 1636 BoxF
3375 1547 BoxF
4005 1513 BoxF
1.000 UL
LTb
/Helvetica findfont 240 scalefont setfont
1800 2016 M
51 0 V
51 0 V
51 0 V
51 0 V
51 0 V
50 0 V
51 0 V
51 0 V
51 0 V
51 0 V
51 0 V
51 0 V
51 0 V
51 0 V
51 0 V
51 0 V
50 0 V
51 0 V
51 0 V
51 0 V
51 0 V
51 0 V
51 0 V
51 0 V
51 0 V
51 0 V
51 0 V
50 0 V
51 0 V
51 0 V
51 0 V
51 0 V
51 0 V
51 0 V
51 0 V
51 0 V
51 0 V
51 0 V
50 0 V
51 0 V
51 0 V
51 0 V
51 0 V
51 0 V
51 0 V
51 0 V
51 0 V
51 0 V
51 0 V
50 0 V
51 0 V
51 0 V
51 0 V
51 0 V
51 0 V
51 0 V
51 0 V
51 0 V
51 0 V
51 0 V
50 0 V
51 0 V
51 0 V
51 0 V
51 0 V
51 0 V
51 0 V
51 0 V
51 0 V
51 0 V
51 0 V
50 0 V
51 0 V
51 0 V
51 0 V
51 0 V
51 0 V
51 0 V
51 0 V
51 0 V
51 0 V
51 0 V
50 0 V
51 0 V
51 0 V
51 0 V
51 0 V
51 0 V
51 0 V
51 0 V
51 0 V
51 0 V
51 0 V
50 0 V
51 0 V
51 0 V
51 0 V
51 0 V
51 0 V
stroke
1800 2520 N
0 -1008 V
5040 0 V
0 1008 V
-5040 0 V
Z stroke
1.000 UP
1.000 UL
LTb
stroke
grestore
end
showpage
%%Trailer
%%DocumentFonts: Symbol Helvetica
