%!PS-Adobe-1.0
%%Creator: Unified Graphics System
%%Pages: (atend)
%%DocumentFonts: Courier
%%BoundingBox:   99  205  481  566
%%EndComments
/Sw{setlinewidth}def
/Sg{setgray}def
/Sd{setdash}def
/P {newpath
    moveto
0 0 rlineto
    stroke}def
/M {moveto}def
/D {lineto}def
/N {newpath}def
/S {stroke}def
/T {/Courier findfont
    exch
    scalefont
    setfont}def
/R {rotate}def
/W {show}def
/F {fill}def
/X {gsave}def
/Y {grestore}def
%%EndProlog
%%Page: 1 1
0.24000 0.24000 scale
1 setlinecap
1 setlinejoin
4 Sw
0 0 0 setrgbcolor
[] 0 Sd
N
896 2259 M
896 2227 D
S
N
898 2259 M
898 2227 D
S
N
898 2254 M
901 2257 D
904 2259 D
907 2259 D
911 2257 D
914 2254 D
916 2249 D
916 2246 D
914 2242 D
911 2239 D
907 2237 D
904 2237 D
901 2239 D
898 2242 D
S
N
907 2259 M
910 2257 D
913 2254 D
914 2249 D
914 2246 D
913 2242 D
910 2239 D
907 2237 D
S
N
892 2259 M
898 2259 D
S
N
892 2227 M
902 2227 D
S
N
928 2259 M
928 2227 D
S
N
929 2259 M
929 2227 D
S
N
929 2254 M
932 2257 D
935 2259 D
938 2259 D
943 2257 D
946 2254 D
947 2249 D
947 2246 D
946 2242 D
943 2239 D
938 2237 D
935 2237 D
932 2239 D
929 2242 D
S
N
938 2259 M
941 2257 D
944 2254 D
946 2249 D
946 2246 D
944 2242 D
941 2239 D
938 2237 D
S
N
923 2259 M
929 2259 D
S
N
923 2227 M
934 2227 D
S
N
1005 2254 M
1009 2251 D
1005 2248 D
S
N
1000 2259 M
1008 2251 D
1000 2243 D
S
N
982 2251 M
1008 2251 D
S
N
1055 2269 M
1044 2237 D
S
N
1055 2269 M
1065 2237 D
S
N
1055 2265 M
1064 2237 D
S
N
1047 2246 M
1061 2246 D
S
N
1041 2237 M
1050 2237 D
S
N
1059 2237 M
1068 2237 D
S
N
1077 2269 M
1077 2243 D
1079 2239 D
1082 2237 D
1085 2237 D
1088 2239 D
1089 2242 D
S
N
1079 2269 M
1079 2243 D
1080 2239 D
1082 2237 D
S
N
1073 2259 M
1085 2259 D
S
N
1100 2269 M
1100 2243 D
1101 2239 D
1104 2237 D
1107 2237 D
1110 2239 D
1112 2242 D
S
N
1101 2269 M
1101 2243 D
1103 2239 D
1104 2237 D
S
N
1095 2259 M
1107 2259 D
S
N
1091 2278 M
1124 2278 D
S
N
1219 2269 M
1219 2237 D
S
N
1221 2269 M
1221 2237 D
S
N
1219 2254 M
1216 2257 D
1213 2259 D
1210 2259 D
1206 2257 D
1202 2254 D
1201 2249 D
1201 2246 D
1202 2242 D
1206 2239 D
1210 2237 D
1213 2237 D
1216 2239 D
1219 2242 D
S
N
1210 2259 M
1207 2257 D
1204 2254 D
1202 2249 D
1202 2246 D
1204 2242 D
1207 2239 D
1210 2237 D
S
N
1215 2269 M
1221 2269 D
S
N
1219 2237 M
1225 2237 D
S
N
1257 2259 M
1242 2259 D
1237 2257 D
1234 2252 D
1233 2248 D
1233 2243 D
1234 2240 D
1236 2239 D
1239 2237 D
1242 2237 D
1246 2239 D
1249 2243 D
1251 2248 D
1251 2252 D
1249 2256 D
1248 2257 D
1245 2259 D
S
N
1242 2259 M
1239 2257 D
1236 2252 D
1234 2248 D
1234 2242 D
1236 2239 D
S
N
1242 2237 M
1245 2239 D
1248 2243 D
1249 2248 D
1249 2254 D
1248 2257 D
S
N
1248 2257 M
1257 2257 D
S
N
1290 2275 M
1263 2227 D
S
N
1316 2269 M
1316 2237 D
S
N
1317 2269 M
1317 2237 D
S
N
1316 2254 M
1313 2257 D
1310 2259 D
1307 2259 D
1302 2257 D
1299 2254 D
1298 2249 D
1298 2246 D
1299 2242 D
1302 2239 D
1307 2237 D
1310 2237 D
1313 2239 D
1316 2242 D
S
N
1307 2259 M
1304 2257 D
1301 2254 D
1299 2249 D
1299 2246 D
1301 2242 D
1304 2239 D
1307 2237 D
S
N
1311 2269 M
1317 2269 D
S
N
1316 2237 M
1322 2237 D
S
N
1332 2259 M
1332 2227 D
S
N
1334 2259 M
1334 2227 D
S
N
1334 2254 M
1337 2257 D
1340 2259 D
1343 2259 D
1347 2257 D
1350 2254 D
1352 2249 D
1352 2246 D
1350 2242 D
1347 2239 D
1343 2237 D
1340 2237 D
1337 2239 D
1334 2242 D
S
N
1343 2259 M
1346 2257 D
1349 2254 D
1350 2249 D
1350 2246 D
1349 2242 D
1346 2239 D
1343 2237 D
S
N
1328 2259 M
1334 2259 D
S
N
1328 2227 M
1338 2227 D
S
N
1368 2246 M
1368 2225 D
S
N
1369 2246 M
1369 2225 D
S
N
1361 2246 M
1360 2240 D
1360 2246 D
1376 2246 D
1376 2240 D
1375 2246 D
S
N
1364 2225 M
1372 2225 D
S
N
1410 2275 M
1410 2227 D
S
N
1411 2275 M
1411 2227 D
S
N
1410 2275 M
1420 2275 D
S
N
1410 2227 M
1420 2227 D
S
N
1432 2259 M
1432 2227 D
S
N
1434 2259 M
1434 2227 D
S
N
1434 2254 M
1437 2257 D
1440 2259 D
1443 2259 D
1448 2257 D
1451 2254 D
1452 2249 D
1452 2246 D
1451 2242 D
1448 2239 D
1443 2237 D
1440 2237 D
1437 2239 D
1434 2242 D
S
N
1443 2259 M
1446 2257 D
1449 2254 D
1451 2249 D
1451 2246 D
1449 2242 D
1446 2239 D
1443 2237 D
S
N
1428 2259 M
1434 2259 D
S
N
1428 2227 M
1438 2227 D
S
N
1464 2269 M
1464 2237 D
S
N
1466 2269 M
1466 2237 D
S
N
1466 2254 M
1469 2257 D
1472 2259 D
1475 2259 D
1479 2257 D
1482 2254 D
1484 2249 D
1484 2246 D
1482 2242 D
1479 2239 D
1475 2237 D
1472 2237 D
1469 2239 D
1466 2242 D
S
N
1475 2259 M
1478 2257 D
1481 2254 D
1482 2249 D
1482 2246 D
1481 2242 D
1478 2239 D
1475 2237 D
S
N
1460 2269 M
1466 2269 D
S
N
1502 2275 M
1502 2227 D
S
N
1503 2275 M
1503 2227 D
S
N
1493 2275 M
1503 2275 D
S
N
1493 2227 M
1503 2227 D
S
N
1565 2256 M
1565 2254 D
1564 2254 D
1564 2256 D
1565 2257 D
1568 2259 D
1574 2259 D
1577 2257 D
1579 2256 D
1580 2252 D
1580 2242 D
1582 2239 D
1583 2237 D
S
N
1579 2255 M
1579 2242 D
1580 2239 D
1583 2237 D
1585 2237 D
S
N
1579 2252 M
1577 2251 D
1568 2249 D
1564 2248 D
1562 2245 D
1562 2242 D
1564 2239 D
1568 2237 D
1573 2237 D
1576 2239 D
1579 2242 D
S
N
1568 2249 M
1565 2248 D
1564 2245 D
1564 2242 D
1565 2239 D
1568 2237 D
S
N
1595 2269 M
1595 2243 D
1597 2239 D
1600 2237 D
1603 2237 D
1606 2239 D
1608 2242 D
S
N
1597 2269 M
1597 2243 D
1598 2239 D
1600 2237 D
S
N
1591 2259 M
1603 2259 D
S
N
1642 2269 M
1642 2237 D
S
N
1644 2269 M
1644 2237 D
S
N
1638 2269 M
1648 2269 D
S
N
1638 2237 M
1660 2237 D
1660 2246 D
1659 2237 D
S
N
1669 2269 M
1669 2237 D
S
N
1671 2269 M
1671 2237 D
S
N
1689 2269 M
1689 2237 D
S
N
1691 2269 M
1691 2237 D
S
N
1665 2269 M
1675 2269 D
S
N
1684 2269 M
1695 2269 D
S
N
1671 2254 M
1689 2254 D
S
N
1665 2237 M
1675 2237 D
S
N
1684 2237 M
1695 2237 D
S
N
1724 2265 M
1725 2260 D
1725 2269 D
1724 2265 D
1721 2268 D
1716 2269 D
1713 2269 D
1709 2268 D
1706 2265 D
1704 2262 D
1703 2257 D
1703 2249 D
1704 2245 D
1706 2242 D
1709 2239 D
1713 2237 D
1716 2237 D
1721 2239 D
1724 2242 D
1725 2245 D
S
N
1713 2269 M
1710 2268 D
1707 2265 D
1706 2262 D
1704 2257 D
1704 2249 D
1706 2245 D
1707 2242 D
1710 2239 D
1713 2237 D
S
N
1758 2269 M
1758 2260 D
S
N
1758 2263 M
1760 2266 D
1763 2269 D
1766 2269 D
1774 2265 D
1777 2265 D
1778 2266 D
1780 2269 D
S
N
1760 2266 M
1763 2268 D
1766 2268 D
1774 2265 D
S
N
1780 2269 M
1780 2265 D
1778 2260 D
1772 2252 D
1771 2249 D
1769 2245 D
1769 2237 D
S
N
1778 2260 M
1771 2252 D
1769 2249 D
1768 2245 D
1768 2237 D
S
N
1822 2269 M
1822 2237 D
S
N
1823 2269 M
1823 2237 D
S
N
1813 2269 M
1811 2260 D
1811 2269 D
1834 2269 D
1834 2260 D
1832 2269 D
S
N
1817 2237 M
1828 2237 D
S
N
1843 2249 M
1861 2249 D
1861 2252 D
1860 2255 D
1858 2257 D
1855 2259 D
1851 2259 D
1846 2257 D
1843 2254 D
1841 2249 D
1841 2246 D
1843 2242 D
1846 2239 D
1851 2237 D
1854 2237 D
1858 2239 D
1861 2242 D
S
N
1860 2249 M
1860 2254 D
1858 2257 D
S
N
1851 2259 M
1847 2257 D
1844 2254 D
1843 2249 D
1843 2246 D
1844 2242 D
1847 2239 D
1851 2237 D
S
N
1870 2269 M
1881 2237 D
S
N
1872 2269 M
1881 2242 D
S
N
1891 2269 M
1881 2237 D
S
N
1867 2269 M
1876 2269 D
S
N
1885 2269 M
1894 2269 D
S
3 Sw
N
1455 2186 M
1455 2185 D
1453 2185 D
1453 2186 D
1455 2188 D
1458 2189 D
1464 2189 D
1467 2188 D
1468 2186 D
1470 2183 D
1470 2173 D
1471 2170 D
1473 2168 D
S
N
1468 2186 M
1468 2173 D
1470 2170 D
1473 2168 D
1474 2168 D
S
N
1468 2183 M
1467 2182 D
1458 2180 D
1453 2179 D
1452 2176 D
1452 2173 D
1453 2170 D
1458 2168 D
1462 2168 D
1465 2170 D
1468 2173 D
S
N
1458 2180 M
1455 2179 D
1453 2176 D
1453 2173 D
1455 2170 D
1458 2168 D
S
N
1485 2200 M
1485 2168 D
S
N
1486 2200 M
1495 2173 D
S
N
1485 2200 M
1495 2168 D
S
N
1506 2200 M
1495 2168 D
S
N
1506 2200 M
1506 2168 D
S
N
1508 2200 M
1508 2168 D
S
N
1480 2200 M
1486 2200 D
S
N
1506 2200 M
1512 2200 D
S
N
1480 2168 M
1489 2168 D
S
N
1502 2168 M
1512 2168 D
S
N
1541 2195 M
1542 2191 D
1542 2200 D
1541 2195 D
1538 2198 D
1533 2200 D
1530 2200 D
1526 2198 D
1523 2195 D
1521 2192 D
1520 2188 D
1520 2180 D
1521 2176 D
1523 2173 D
1526 2170 D
1530 2168 D
1533 2168 D
1538 2170 D
1541 2173 D
1542 2176 D
S
N
1530 2200 M
1527 2198 D
1524 2195 D
1523 2192 D
1521 2188 D
1521 2180 D
1523 2176 D
1524 2173 D
1527 2170 D
1530 2168 D
S
N
1574 2188 M
1572 2191 D
1569 2192 D
1565 2192 D
1562 2191 D
1560 2189 D
1559 2185 D
1559 2180 D
1560 2177 D
1563 2176 D
1568 2176 D
1571 2177 D
1572 2180 D
S
N
1565 2192 M
1562 2189 D
1560 2185 D
1560 2180 D
1562 2177 D
1563 2176 D
S
N
1574 2192 M
1572 2180 D
1572 2177 D
1575 2176 D
1579 2176 D
1582 2179 D
1583 2183 D
1583 2186 D
1582 2191 D
1580 2194 D
1577 2197 D
1574 2198 D
1569 2200 D
1565 2200 D
1560 2198 D
1557 2197 D
1554 2194 D
1553 2191 D
1551 2186 D
1551 2182 D
1553 2177 D
1554 2174 D
1557 2171 D
1560 2170 D
1565 2168 D
1569 2168 D
1574 2170 D
1577 2171 D
1579 2173 D
S
N
1575 2192 M
1574 2180 D
1574 2177 D
1575 2176 D
S
N
1595 2200 M
1595 2168 D
S
N
1597 2200 M
1615 2171 D
S
N
1597 2197 M
1615 2168 D
S
N
1615 2200 M
1615 2168 D
S
N
1591 2200 M
1597 2200 D
S
N
1610 2200 M
1619 2200 D
S
N
1591 2168 M
1600 2168 D
S
N
1630 2200 M
1630 2168 D
S
N
1631 2200 M
1631 2168 D
S
N
1625 2200 M
1636 2200 D
S
N
1625 2168 M
1648 2168 D
1648 2177 D
1646 2168 D
S
N
1665 2200 M
1660 2198 D
1657 2195 D
1655 2192 D
1654 2186 D
1654 2182 D
1655 2176 D
1657 2173 D
1660 2170 D
1665 2168 D
1668 2168 D
1672 2170 D
1675 2173 D
1677 2176 D
1678 2182 D
1678 2186 D
1677 2192 D
1675 2195 D
1672 2198 D
1668 2200 D
1665 2200 D
S
N
1665 2200 M
1662 2198 D
1659 2195 D
1657 2192 D
1655 2186 D
1655 2182 D
1657 2176 D
1659 2173 D
1662 2170 D
1665 2168 D
S
N
1668 2168 M
1671 2170 D
1674 2173 D
1675 2176 D
1677 2182 D
1677 2186 D
1675 2192 D
1674 2195 D
1671 2198 D
1668 2200 D
S
N
1702 2195 M
1702 2168 D
S
N
1689 2182 M
1716 2182 D
S
N
1729 2200 M
1729 2168 D
S
N
1731 2200 M
1731 2168 D
S
N
1731 2185 M
1734 2188 D
1738 2189 D
1742 2189 D
1746 2188 D
1748 2185 D
1748 2168 D
S
N
1742 2189 M
1745 2188 D
1746 2185 D
1746 2168 D
S
N
1725 2200 M
1731 2200 D
S
N
1725 2168 M
1735 2168 D
S
N
1742 2168 M
1752 2168 D
S
N
1761 2180 M
1779 2180 D
1779 2183 D
1778 2186 D
1776 2188 D
1773 2189 D
1769 2189 D
1764 2188 D
1761 2185 D
1760 2180 D
1760 2177 D
1761 2173 D
1764 2170 D
1769 2168 D
1772 2168 D
1776 2170 D
1779 2173 D
S
N
1778 2180 M
1778 2185 D
1776 2188 D
S
N
1769 2189 M
1766 2188 D
1763 2185 D
1761 2180 D
1761 2177 D
1763 2173 D
1766 2170 D
1769 2168 D
S
N
1791 2189 M
1791 2168 D
S
N
1793 2189 M
1793 2168 D
S
N
1793 2180 M
1794 2185 D
1797 2188 D
1800 2189 D
1805 2189 D
1806 2188 D
1806 2186 D
1805 2185 D
1803 2186 D
1805 2188 D
S
N
1787 2189 M
1793 2189 D
S
N
1787 2168 M
1797 2168 D
S
N
1815 2189 M
1822 2168 D
S
N
1817 2189 M
1822 2173 D
S
N
1828 2189 M
1822 2168 D
S
N
1828 2189 M
1834 2168 D
S
N
1829 2189 M
1834 2173 D
S
N
1840 2189 M
1834 2168 D
S
N
1811 2189 M
1822 2189 D
S
N
1835 2189 M
1844 2189 D
S
N
1853 2200 M
1852 2198 D
1853 2197 D
1855 2198 D
1853 2200 D
S
N
1853 2189 M
1853 2168 D
S
N
1855 2189 M
1855 2168 D
S
N
1849 2189 M
1855 2189 D
S
N
1849 2168 M
1859 2168 D
S
N
1874 2189 M
1871 2188 D
1870 2186 D
1868 2183 D
1868 2180 D
1870 2177 D
1871 2176 D
1874 2174 D
1877 2174 D
1880 2176 D
1882 2177 D
1883 2180 D
1883 2183 D
1882 2186 D
1880 2188 D
1877 2189 D
1874 2189 D
S
N
1871 2188 M
1870 2185 D
1870 2179 D
1871 2176 D
S
N
1880 2176 M
1882 2179 D
1882 2185 D
1880 2188 D
S
N
1882 2186 M
1883 2188 D
1886 2189 D
1886 2188 D
1883 2188 D
S
N
1870 2177 M
1868 2176 D
1867 2173 D
1867 2171 D
1868 2168 D
1873 2167 D
1880 2167 D
1885 2165 D
1886 2164 D
S
N
1867 2171 M
1868 2170 D
1873 2168 D
1880 2168 D
1885 2167 D
1886 2164 D
1886 2162 D
1885 2159 D
1880 2158 D
1871 2158 D
1867 2159 D
1865 2162 D
1865 2164 D
1867 2167 D
1871 2168 D
S
N
1455 2131 M
1455 2099 D
S
N
1456 2131 M
1456 2099 D
S
N
1450 2131 M
1468 2131 D
1473 2129 D
1474 2128 D
1476 2125 D
1476 2120 D
1474 2117 D
1473 2116 D
1468 2114 D
1456 2114 D
S
N
1468 2131 M
1471 2129 D
1473 2128 D
1474 2125 D
1474 2120 D
1473 2117 D
1471 2116 D
1468 2114 D
S
N
1450 2099 M
1461 2099 D
S
N
1495 2131 M
1491 2129 D
1488 2126 D
1486 2123 D
1485 2117 D
1485 2113 D
1486 2107 D
1488 2104 D
1491 2100 D
1495 2099 D
1499 2099 D
1503 2100 D
1506 2104 D
1508 2107 D
1509 2113 D
1509 2117 D
1508 2123 D
1506 2126 D
1503 2129 D
1499 2131 D
1495 2131 D
S
N
1495 2131 M
1492 2129 D
1489 2126 D
1488 2123 D
1486 2117 D
1486 2113 D
1488 2107 D
1489 2104 D
1492 2100 D
1495 2099 D
S
N
1499 2099 M
1502 2100 D
1505 2104 D
1506 2107 D
1508 2113 D
1508 2117 D
1506 2123 D
1505 2126 D
1502 2129 D
1499 2131 D
S
N
1520 2131 M
1526 2099 D
S
N
1521 2131 M
1526 2107 D
S
N
1532 2131 M
1526 2099 D
S
N
1532 2131 M
1538 2099 D
S
N
1533 2131 M
1538 2107 D
S
N
1544 2131 M
1538 2099 D
S
N
1515 2131 M
1526 2131 D
S
N
1539 2131 M
1548 2131 D
S
N
1557 2131 M
1557 2099 D
S
N
1559 2131 M
1559 2099 D
S
N
1577 2131 M
1577 2099 D
S
N
1579 2131 M
1579 2099 D
S
N
1553 2131 M
1563 2131 D
S
N
1572 2131 M
1583 2131 D
S
N
1559 2116 M
1577 2116 D
S
N
1553 2099 M
1563 2099 D
S
N
1572 2099 M
1583 2099 D
S
N
1594 2131 M
1594 2099 D
S
N
1595 2131 M
1595 2099 D
S
N
1604 2122 M
1604 2110 D
S
N
1589 2131 M
1613 2131 D
1613 2122 D
1612 2131 D
S
N
1595 2116 M
1604 2116 D
S
N
1589 2099 M
1613 2099 D
1613 2108 D
1612 2099 D
S
N
1625 2131 M
1625 2099 D
S
N
1627 2131 M
1627 2099 D
S
N
1621 2131 M
1631 2131 D
S
N
1621 2099 M
1643 2099 D
1643 2108 D
1642 2099 D
S
N
1665 2126 M
1665 2099 D
S
N
1651 2113 M
1678 2113 D
S
N
1692 2131 M
1692 2099 D
S
N
1693 2131 M
1693 2099 D
S
N
1693 2116 M
1696 2119 D
1701 2120 D
1704 2120 D
1708 2119 D
1710 2116 D
1710 2099 D
S
N
1704 2120 M
1707 2119 D
1708 2116 D
1708 2099 D
S
N
1687 2131 M
1693 2131 D
S
N
1687 2099 M
1698 2099 D
S
N
1704 2099 M
1714 2099 D
S
N
1723 2111 M
1742 2111 D
1742 2114 D
1740 2117 D
1738 2119 D
1735 2120 D
1731 2120 D
1726 2119 D
1723 2116 D
1722 2111 D
1722 2108 D
1723 2104 D
1726 2100 D
1731 2099 D
1734 2099 D
1738 2100 D
1742 2104 D
S
N
1740 2111 M
1740 2116 D
1738 2119 D
S
N
1731 2120 M
1728 2119 D
1725 2116 D
1723 2111 D
1723 2108 D
1725 2104 D
1728 2100 D
1731 2099 D
S
N
1754 2120 M
1754 2099 D
S
N
1755 2120 M
1755 2099 D
S
N
1755 2111 M
1757 2116 D
1760 2119 D
1763 2120 D
1767 2120 D
1769 2119 D
1769 2117 D
1767 2116 D
1766 2117 D
1767 2119 D
S
N
1749 2120 M
1755 2120 D
S
N
1749 2099 M
1760 2099 D
S
N
1778 2120 M
1784 2099 D
S
N
1779 2120 M
1784 2104 D
S
N
1790 2120 M
1784 2099 D
S
N
1790 2120 M
1796 2099 D
S
N
1791 2120 M
1796 2104 D
S
N
1802 2120 M
1796 2099 D
S
N
1773 2120 M
1784 2120 D
S
N
1797 2120 M
1806 2120 D
S
N
1815 2131 M
1814 2129 D
1815 2128 D
1817 2129 D
1815 2131 D
S
N
1815 2120 M
1815 2099 D
S
N
1817 2120 M
1817 2099 D
S
N
1811 2120 M
1817 2120 D
S
N
1811 2099 M
1822 2099 D
S
N
1837 2120 M
1834 2119 D
1832 2117 D
1831 2114 D
1831 2111 D
1832 2108 D
1834 2107 D
1837 2105 D
1840 2105 D
1843 2107 D
1844 2108 D
1846 2111 D
1846 2114 D
1844 2117 D
1843 2119 D
1840 2120 D
1837 2120 D
S
N
1834 2119 M
1832 2116 D
1832 2110 D
1834 2107 D
S
N
1843 2107 M
1844 2110 D
1844 2116 D
1843 2119 D
S
N
1844 2117 M
1846 2119 D
1849 2120 D
1849 2119 D
1846 2119 D
S
N
1832 2108 M
1831 2107 D
1829 2104 D
1829 2102 D
1831 2099 D
1835 2097 D
1843 2097 D
1847 2096 D
1849 2094 D
S
N
1829 2102 M
1831 2100 D
1835 2099 D
1843 2099 D
1847 2097 D
1849 2094 D
1849 2093 D
1847 2090 D
1843 2088 D
1834 2088 D
1829 2090 D
1828 2093 D
1828 2094 D
1829 2097 D
1834 2099 D
S
1 Sw
N
1986 2034 M
2003 2034 D
S
N
1986 2034 M
2003 2034 D
S
N
1986 2031 M
1986 2037 D
S
N
2003 2031 M
2003 2043 D
1998 2043 D
2003 2042 D
S
N
1986 2048 M
2003 2048 D
S
N
1986 2049 M
2003 2049 D
S
N
1986 2058 M
2003 2058 D
S
N
1986 2059 M
2003 2059 D
S
N
1986 2046 M
1986 2051 D
S
N
1986 2056 M
1986 2062 D
S
N
1994 2049 M
1994 2058 D
S
N
2003 2046 M
2003 2051 D
S
N
2003 2056 M
2003 2062 D
S
N
1988 2077 M
1991 2078 D
1986 2078 D
1988 2077 D
1987 2075 D
1986 2073 D
1986 2071 D
1987 2069 D
1988 2067 D
1990 2066 D
1992 2066 D
1996 2066 D
1999 2066 D
2000 2067 D
2002 2069 D
2003 2071 D
2003 2073 D
2002 2075 D
2000 2077 D
1999 2078 D
S
N
1986 2071 M
1987 2070 D
1988 2068 D
1990 2067 D
1992 2066 D
1996 2066 D
1999 2067 D
2000 2068 D
2002 2070 D
2003 2071 D
S
N
1986 2097 M
2003 2097 D
S
N
1986 2097 M
2003 2097 D
S
N
1986 2107 M
2003 2107 D
S
N
1986 2108 M
2003 2108 D
S
N
1986 2094 M
1986 2100 D
S
N
1986 2105 M
1986 2110 D
S
N
1994 2097 M
1994 2107 D
S
N
2003 2094 M
2003 2100 D
S
N
2003 2105 M
2003 2110 D
S
N
1986 2116 M
2003 2116 D
S
N
1986 2117 M
2003 2117 D
S
N
1986 2113 M
1986 2119 D
S
N
2003 2113 M
2003 2119 D
S
N
1988 2134 M
1991 2135 D
1986 2135 D
1988 2134 D
1987 2132 D
1986 2130 D
1986 2129 D
1987 2126 D
1988 2125 D
1990 2124 D
1992 2123 D
1996 2123 D
1999 2124 D
2000 2125 D
2002 2126 D
2003 2129 D
2003 2130 D
2002 2132 D
2000 2134 D
S
N
1986 2129 M
1987 2127 D
1988 2125 D
1990 2125 D
1992 2124 D
1996 2124 D
1999 2125 D
2000 2125 D
2002 2127 D
2003 2129 D
S
N
1996 2134 M
2003 2134 D
S
N
1996 2135 M
2003 2135 D
S
N
1996 2132 M
1996 2137 D
S
N
1988 2152 M
1991 2153 D
1986 2153 D
1988 2152 D
1987 2151 D
1986 2148 D
1986 2147 D
1987 2144 D
1988 2143 D
1990 2142 D
1992 2141 D
1996 2141 D
1999 2142 D
2000 2143 D
2002 2144 D
2003 2147 D
2003 2148 D
2002 2151 D
2000 2152 D
S
N
1986 2147 M
1987 2145 D
1988 2144 D
1990 2143 D
1992 2142 D
1996 2142 D
1999 2143 D
2000 2144 D
2002 2145 D
2003 2147 D
S
N
1996 2152 M
2003 2152 D
S
N
1996 2153 M
2003 2153 D
S
N
1996 2150 M
1996 2156 D
S
N
1988 2170 M
1986 2171 D
1991 2171 D
1988 2170 D
1987 2168 D
1986 2166 D
1986 2164 D
1987 2161 D
1988 2160 D
1990 2160 D
1991 2160 D
1992 2161 D
1993 2163 D
1995 2168 D
1995 2169 D
1997 2171 D
S
N
1990 2160 M
1991 2161 D
1992 2163 D
1994 2168 D
1995 2169 D
1995 2170 D
1997 2171 D
2000 2171 D
2002 2169 D
2003 2167 D
2003 2164 D
2002 2162 D
2000 2160 D
1998 2160 D
2003 2160 D
2000 2160 D
S
N
1986 2188 M
2003 2199 D
S
N
1986 2189 M
2003 2199 D
S
N
1986 2199 M
2003 2188 D
S
N
1986 2187 M
1986 2191 D
S
N
1986 2196 M
1986 2201 D
S
N
2003 2187 M
2003 2191 D
S
N
2003 2196 M
2003 2201 D
S
N
1988 2215 M
1986 2215 D
1991 2215 D
1988 2215 D
1987 2213 D
1986 2211 D
1986 2208 D
1987 2206 D
1988 2204 D
1990 2204 D
1991 2205 D
1992 2206 D
1993 2207 D
1995 2212 D
1995 2214 D
1997 2215 D
S
N
1990 2204 M
1991 2206 D
1992 2207 D
1994 2212 D
1995 2214 D
1995 2215 D
1997 2215 D
2000 2215 D
2002 2214 D
2003 2211 D
2003 2209 D
2002 2207 D
2000 2205 D
1998 2204 D
2003 2204 D
2000 2205 D
S
N
1986 2234 M
2003 2237 D
S
N
1986 2234 M
1999 2237 D
S
N
1986 2240 M
2003 2237 D
S
N
1986 2240 M
2003 2243 D
S
N
1986 2241 M
1999 2243 D
S
N
1986 2246 M
2003 2243 D
S
N
1986 2231 M
1986 2237 D
S
N
1986 2244 M
1986 2249 D
S
N
1988 2263 M
1991 2264 D
1986 2264 D
1988 2263 D
1987 2262 D
1986 2259 D
1986 2258 D
1987 2255 D
1988 2254 D
1990 2253 D
1992 2252 D
1996 2252 D
1999 2253 D
2000 2254 D
2002 2255 D
2003 2258 D
2003 2259 D
2002 2262 D
2000 2263 D
S
N
1986 2258 M
1987 2256 D
1988 2254 D
1990 2254 D
1992 2253 D
1996 2253 D
1999 2254 D
2000 2254 D
2002 2256 D
2003 2258 D
S
N
1996 2263 M
2003 2263 D
S
N
1996 2264 M
2003 2264 D
S
N
1996 2261 M
1996 2266 D
S
N
1989 2284 M
1990 2285 D
1991 2284 D
1990 2283 D
1989 2283 D
1987 2284 D
1987 2285 D
1986 2287 D
1986 2290 D
1987 2293 D
1987 2293 D
1989 2294 D
1991 2294 D
1992 2293 D
1994 2291 D
1995 2287 D
1996 2285 D
1998 2284 D
2000 2283 D
2003 2283 D
S
N
1986 2290 M
1987 2292 D
1987 2293 D
1989 2293 D
1991 2293 D
1992 2293 D
1994 2290 D
1995 2287 D
S
N
2001 2283 M
2000 2284 D
2000 2285 D
2002 2289 D
2002 2292 D
2001 2293 D
2000 2294 D
S
N
2000 2285 M
2003 2289 D
2003 2293 D
2002 2293 D
2000 2294 D
1999 2294 D
S
N
1986 2304 M
1987 2301 D
1989 2300 D
1993 2299 D
1995 2299 D
1999 2300 D
2002 2301 D
2003 2304 D
2003 2305 D
2002 2308 D
1999 2309 D
1995 2310 D
1993 2310 D
1989 2309 D
1987 2308 D
1986 2305 D
1986 2304 D
S
N
1986 2304 M
1987 2302 D
1987 2301 D
1989 2301 D
1993 2300 D
1995 2300 D
1999 2301 D
2001 2301 D
2002 2302 D
2003 2304 D
S
N
2003 2305 M
2002 2307 D
2001 2308 D
1999 2309 D
1995 2309 D
1993 2309 D
1989 2309 D
1987 2308 D
1987 2307 D
1986 2305 D
S
N
1989 2317 M
1988 2319 D
1986 2321 D
2003 2321 D
S
N
1987 2321 M
2003 2321 D
S
N
2003 2317 M
2003 2325 D
S
N
1989 2333 M
1988 2335 D
1986 2337 D
2003 2337 D
S
N
1987 2336 M
2003 2336 D
S
N
2003 2333 M
2003 2340 D
S
4 Sw
N
583 2342 M
583 1520 D
S
N
583 1520 M
1967 1520 D
S
N
1967 1520 M
1967 2342 D
S
N
1967 2342 M
583 2342 D
S
N
583 1520 M
1967 1520 D
S
N
583 1520 M
583 1551 D
S
N
633 1531 M
633 1520 D
S
N
684 1520 M
684 1531 D
S
N
734 1531 M
734 1520 D
S
N
784 1520 M
784 1531 D
S
N
835 1551 M
835 1520 D
S
N
885 1520 M
885 1531 D
S
N
935 1531 M
935 1520 D
S
N
986 1520 M
986 1531 D
S
N
1036 1531 M
1036 1520 D
S
N
1086 1520 M
1086 1551 D
S
N
1137 1531 M
1137 1520 D
S
N
1187 1520 M
1187 1531 D
S
N
1237 1531 M
1237 1520 D
S
N
1288 1520 M
1288 1531 D
S
N
1338 1551 M
1338 1520 D
S
N
1388 1520 M
1388 1531 D
S
N
1439 1531 M
1439 1520 D
S
N
1489 1520 M
1489 1531 D
S
N
1539 1531 M
1539 1520 D
S
N
1590 1520 M
1590 1551 D
S
N
1640 1531 M
1640 1520 D
S
N
1690 1520 M
1690 1531 D
S
N
1741 1531 M
1741 1520 D
S
N
1791 1520 M
1791 1531 D
S
N
1841 1551 M
1841 1520 D
S
N
1892 1520 M
1892 1531 D
S
N
1942 1531 M
1942 1520 D
S
N
583 2342 M
1967 2342 D
S
N
583 2311 M
583 2342 D
S
N
633 2342 M
633 2332 D
S
N
684 2332 M
684 2342 D
S
N
734 2342 M
734 2332 D
S
N
784 2332 M
784 2342 D
S
N
835 2342 M
835 2311 D
S
N
885 2332 M
885 2342 D
S
N
935 2342 M
935 2332 D
S
N
986 2332 M
986 2342 D
S
N
1036 2342 M
1036 2332 D
S
N
1086 2311 M
1086 2342 D
S
N
1137 2342 M
1137 2332 D
S
N
1187 2332 M
1187 2342 D
S
N
1237 2342 M
1237 2332 D
S
N
1288 2332 M
1288 2342 D
S
N
1338 2342 M
1338 2311 D
S
N
1388 2332 M
1388 2342 D
S
N
1439 2342 M
1439 2332 D
S
N
1489 2332 M
1489 2342 D
S
N
1539 2342 M
1539 2332 D
S
N
1590 2311 M
1590 2342 D
S
N
1640 2342 M
1640 2332 D
S
N
1690 2332 M
1690 2342 D
S
N
1741 2342 M
1741 2332 D
S
N
1791 2332 M
1791 2342 D
S
N
1841 2342 M
1841 2311 D
S
N
1892 2332 M
1892 2342 D
S
N
1942 2342 M
1942 2332 D
S
N
583 1520 M
583 2342 D
S
N
583 1520 M
593 1520 D
S
N
593 1535 M
583 1535 D
S
N
583 1549 M
614 1549 D
S
N
593 1637 M
583 1637 D
S
N
583 1689 M
593 1689 D
S
N
593 1726 M
583 1726 D
S
N
583 1754 M
614 1754 D
S
N
593 1777 M
583 1777 D
S
N
583 1797 M
593 1797 D
S
N
593 1814 M
583 1814 D
S
N
583 1829 M
593 1829 D
S
N
614 1843 M
583 1843 D
S
N
583 1931 M
593 1931 D
S
N
593 1983 M
583 1983 D
S
N
583 2020 M
593 2020 D
S
N
614 2048 M
583 2048 D
S
N
583 2071 M
593 2071 D
S
N
593 2091 M
583 2091 D
S
N
583 2108 M
593 2108 D
S
N
593 2123 M
583 2123 D
S
N
583 2137 M
614 2137 D
S
N
593 2225 M
583 2225 D
S
N
583 2277 M
593 2277 D
S
N
593 2314 M
583 2314 D
S
N
583 2342 M
614 2342 D
S
N
420 1556 M
423 1558 D
427 1562 D
427 1531 D
S
N
426 1561 M
426 1531 D
S
N
420 1531 M
433 1531 D
S
N
454 1562 M
450 1561 D
447 1556 D
445 1549 D
445 1544 D
447 1537 D
450 1532 D
454 1531 D
457 1531 D
462 1532 D
465 1537 D
466 1544 D
466 1549 D
465 1556 D
462 1561 D
457 1562 D
454 1562 D
S
N
454 1562 M
451 1561 D
450 1559 D
448 1556 D
447 1549 D
447 1544 D
448 1537 D
450 1534 D
451 1532 D
454 1531 D
S
N
457 1531 M
460 1532 D
462 1534 D
463 1537 D
465 1544 D
465 1549 D
463 1556 D
462 1559 D
460 1561 D
457 1562 D
S
N
477 1562 M
504 1562 D
S
N
533 1576 M
531 1574 D
533 1573 D
534 1574 D
534 1576 D
533 1579 D
530 1580 D
525 1580 D
521 1579 D
518 1576 D
516 1573 D
515 1567 D
515 1558 D
516 1553 D
519 1550 D
524 1549 D
527 1549 D
531 1550 D
534 1553 D
536 1558 D
536 1559 D
534 1564 D
531 1567 D
527 1568 D
525 1568 D
521 1567 D
518 1564 D
516 1559 D
S
N
525 1580 M
522 1579 D
519 1576 D
518 1573 D
516 1567 D
516 1558 D
518 1553 D
521 1550 D
524 1549 D
S
N
527 1549 M
530 1550 D
533 1553 D
534 1558 D
534 1559 D
533 1564 D
530 1567 D
527 1568 D
S
N
542 1768 M
539 1753 D
S
N
539 1753 M
542 1756 D
547 1757 D
551 1757 D
556 1756 D
559 1753 D
560 1748 D
560 1745 D
559 1741 D
556 1738 D
551 1736 D
547 1736 D
542 1738 D
541 1739 D
539 1742 D
539 1744 D
541 1745 D
542 1744 D
541 1742 D
S
N
551 1757 M
554 1756 D
557 1753 D
559 1748 D
559 1745 D
557 1741 D
554 1738 D
551 1736 D
S
N
542 1768 M
557 1768 D
S
N
542 1766 M
550 1766 D
557 1768 D
S
N
420 1850 M
423 1852 D
427 1856 D
427 1825 D
S
N
426 1855 M
426 1825 D
S
N
420 1825 M
433 1825 D
S
N
454 1856 M
450 1855 D
447 1850 D
445 1843 D
445 1838 D
447 1831 D
450 1826 D
454 1825 D
457 1825 D
462 1826 D
465 1831 D
466 1838 D
466 1843 D
465 1850 D
462 1855 D
457 1856 D
454 1856 D
S
N
454 1856 M
451 1855 D
450 1853 D
448 1850 D
447 1843 D
447 1838 D
448 1831 D
450 1828 D
451 1826 D
454 1825 D
S
N
457 1825 M
460 1826 D
462 1828 D
463 1831 D
465 1838 D
465 1843 D
463 1850 D
462 1853 D
460 1855 D
457 1856 D
S
N
477 1856 M
504 1856 D
S
N
518 1874 M
515 1859 D
S
N
515 1859 M
518 1862 D
522 1864 D
527 1864 D
531 1862 D
534 1859 D
536 1855 D
536 1852 D
534 1847 D
531 1844 D
527 1843 D
522 1843 D
518 1844 D
516 1846 D
515 1849 D
515 1850 D
516 1852 D
518 1850 D
516 1849 D
S
N
527 1864 M
530 1862 D
533 1859 D
534 1855 D
534 1852 D
533 1847 D
530 1844 D
527 1843 D
S
N
518 1874 M
533 1874 D
S
N
518 1873 M
525 1873 D
533 1874 D
S
N
542 2062 M
539 2047 D
S
N
539 2047 M
542 2050 D
547 2051 D
551 2051 D
556 2050 D
559 2047 D
560 2042 D
560 2039 D
559 2035 D
556 2031 D
551 2030 D
547 2030 D
542 2031 D
541 2033 D
539 2036 D
539 2038 D
541 2039 D
542 2038 D
541 2036 D
S
N
551 2051 M
554 2050 D
557 2047 D
559 2042 D
559 2039 D
557 2035 D
554 2031 D
551 2030 D
S
N
542 2062 M
557 2062 D
S
N
542 2060 M
550 2060 D
557 2062 D
S
N
420 2144 M
423 2146 D
427 2150 D
427 2118 D
S
N
426 2149 M
426 2118 D
S
N
420 2118 M
433 2118 D
S
N
454 2150 M
450 2149 D
447 2144 D
445 2137 D
445 2132 D
447 2124 D
450 2120 D
454 2118 D
457 2118 D
462 2120 D
465 2124 D
466 2132 D
466 2137 D
465 2144 D
462 2149 D
457 2150 D
454 2150 D
S
N
454 2150 M
451 2149 D
450 2147 D
448 2144 D
447 2137 D
447 2132 D
448 2124 D
450 2121 D
451 2120 D
454 2118 D
S
N
457 2118 M
460 2120 D
462 2121 D
463 2124 D
465 2132 D
465 2137 D
463 2144 D
462 2147 D
460 2149 D
457 2150 D
S
N
477 2150 M
504 2150 D
S
N
528 2165 M
528 2137 D
S
N
530 2168 M
530 2137 D
S
N
530 2168 M
513 2146 D
537 2146 D
S
N
524 2137 M
534 2137 D
S
N
542 2356 M
539 2340 D
S
N
539 2340 M
542 2344 D
547 2345 D
551 2345 D
556 2344 D
559 2340 D
560 2336 D
560 2333 D
559 2328 D
556 2325 D
551 2324 D
547 2324 D
542 2325 D
541 2327 D
539 2330 D
539 2331 D
541 2333 D
542 2331 D
541 2330 D
S
N
551 2345 M
554 2344 D
557 2340 D
559 2336 D
559 2333 D
557 2328 D
554 2325 D
551 2324 D
S
N
542 2356 M
557 2356 D
S
N
542 2354 M
550 2354 D
557 2356 D
S
N
1967 1520 M
1967 2342 D
S
N
1957 1520 M
1967 1520 D
S
N
1967 1535 M
1957 1535 D
S
N
1936 1549 M
1967 1549 D
S
N
1967 1637 M
1957 1637 D
S
N
1957 1689 M
1967 1689 D
S
N
1967 1726 M
1957 1726 D
S
N
1936 1754 M
1967 1754 D
S
N
1967 1777 M
1957 1777 D
S
N
1957 1797 M
1967 1797 D
S
N
1967 1814 M
1957 1814 D
S
N
1957 1829 M
1967 1829 D
S
N
1967 1843 M
1936 1843 D
S
N
1957 1931 M
1967 1931 D
S
N
1967 1983 M
1957 1983 D
S
N
1957 2020 M
1967 2020 D
S
N
1967 2048 M
1936 2048 D
S
N
1957 2071 M
1967 2071 D
S
N
1967 2091 M
1957 2091 D
S
N
1957 2108 M
1967 2108 D
S
N
1967 2123 M
1957 2123 D
S
N
1936 2137 M
1967 2137 D
S
N
1967 2225 M
1957 2225 D
S
N
1957 2277 M
1967 2277 D
S
N
1967 2314 M
1957 2314 D
S
N
1936 2342 M
1967 2342 D
S
N
1327 2186 M
1431 2186 D
S
N
583 1520 M
583 1889 D
608 1889 D
608 2028 D
633 2028 D
633 2089 D
658 2089 D
658 2129 D
684 2129 D
684 2154 D
709 2154 D
709 2172 D
734 2172 D
734 2184 D
759 2184 D
759 2193 D
784 2193 D
784 2198 D
809 2198 D
809 2199 D
835 2199 D
835 2200 D
860 2200 D
860 2198 D
885 2198 D
885 2193 D
910 2193 D
910 2187 D
935 2187 D
935 2180 D
960 2180 D
960 2171 D
986 2171 D
986 2161 D
1011 2161 D
1011 2151 D
1036 2151 D
1036 2141 D
1061 2141 D
1061 2128 D
1086 2128 D
1086 2116 D
1111 2116 D
1111 2103 D
1137 2103 D
1137 2089 D
1162 2089 D
1162 2074 D
1187 2074 D
1187 2060 D
1212 2060 D
1212 2045 D
1237 2045 D
1237 2032 D
1262 2032 D
1262 2017 D
1288 2017 D
1288 2001 D
1313 2001 D
1313 1982 D
1338 1982 D
1338 1969 D
1363 1969 D
1363 1952 D
1388 1952 D
1388 1938 D
1413 1938 D
1413 1920 D
1439 1920 D
1439 1905 D
1464 1905 D
1464 1890 D
1489 1890 D
1489 1871 D
1514 1871 D
1514 1856 D
1539 1856 D
1539 1842 D
1564 1842 D
1564 1825 D
1590 1825 D
1590 1806 D
1615 1806 D
1615 1790 D
1640 1790 D
1640 1777 D
1665 1777 D
1665 1764 D
1690 1764 D
1690 1742 D
1715 1742 D
1715 1726 D
1741 1726 D
1741 1707 D
1766 1707 D
1766 1694 D
1791 1694 D
1791 1680 D
1816 1680 D
1816 1667 D
1841 1667 D
1841 1646 D
1866 1646 D
1866 1628 D
1892 1628 D
1892 1617 D
1917 1617 D
1917 1598 D
1942 1598 D
1942 1596 D
1967 1596 D
S
0 0 1 setrgbcolor
N
1327 2117 M
1339 2117 D
S
N
1351 2117 M
1363 2117 D
S
N
1375 2117 M
1387 2117 D
S
N
1400 2117 M
1412 2117 D
S
N
1424 2117 M
1431 2117 D
S
N
583 1520 M
583 1532 D
S
N
583 1544 M
583 1557 D
S
N
583 1569 M
583 1581 D
S
N
583 1593 M
583 1605 D
S
N
583 1617 M
583 1629 D
S
N
583 1641 M
583 1653 D
S
N
583 1666 M
583 1678 D
S
N
583 1690 M
583 1702 D
S
N
583 1714 M
583 1726 D
S
N
583 1738 M
583 1750 D
S
N
583 1762 M
583 1775 D
S
N
583 1787 M
583 1799 D
S
N
583 1811 M
583 1823 D
S
N
583 1835 M
583 1847 D
S
N
583 1859 M
583 1871 D
S
N
583 1884 M
583 1892 D
587 1892 D
S
N
599 1892 M
608 1892 D
608 1895 D
S
N
608 1907 M
608 1919 D
S
N
608 1931 M
608 1943 D
S
N
608 1955 M
608 1967 D
S
N
608 1979 M
608 1992 D
S
N
608 2004 M
608 2016 D
S
N
608 2028 M
608 2033 D
615 2033 D
S
N
627 2033 M
633 2033 D
633 2039 D
S
N
633 2051 M
633 2063 D
S
N
633 2075 M
633 2088 D
S
N
638 2095 M
651 2095 D
S
N
658 2099 M
658 2111 D
S
N
658 2123 M
658 2133 D
660 2133 D
S
N
672 2133 M
684 2133 D
684 2134 D
S
N
684 2146 M
684 2158 D
S
N
695 2159 M
707 2159 D
S
N
709 2169 M
709 2176 D
714 2176 D
S
N
726 2176 M
734 2176 D
734 2181 D
S
N
737 2189 M
749 2189 D
S
N
759 2192 M
759 2196 D
767 2196 D
S
N
779 2196 M
784 2196 D
784 2201 D
786 2201 D
S
N
798 2201 M
809 2201 D
809 2202 D
810 2202 D
S
N
822 2202 M
834 2202 D
S
N
845 2201 M
858 2201 D
S
N
868 2199 M
880 2199 D
S
N
886 2194 M
899 2194 D
S
N
910 2193 M
910 2187 D
916 2187 D
S
N
928 2187 M
935 2187 D
935 2182 D
S
N
946 2181 M
958 2181 D
S
N
960 2171 M
960 2171 D
972 2171 D
S
N
984 2171 M
986 2171 D
986 2161 D
987 2161 D
S
N
999 2161 M
1011 2161 D
S
N
1013 2150 M
1025 2150 D
S
N
1036 2150 M
1036 2138 D
1037 2138 D
S
N
1049 2138 M
1061 2138 D
1061 2138 D
S
N
1061 2126 M
1061 2125 D
1072 2125 D
S
N
1084 2125 M
1086 2125 D
1086 2115 D
S
N
1097 2114 M
1109 2114 D
S
N
1111 2104 M
1111 2101 D
1120 2101 D
S
N
1132 2101 M
1137 2101 D
1137 2093 D
S
N
1140 2084 M
1152 2084 D
S
N
1162 2082 M
1162 2071 D
1163 2071 D
S
N
1175 2071 M
1187 2071 D
1187 2070 D
S
N
1187 2058 M
1187 2058 D
1199 2058 D
S
N
1211 2058 M
1212 2058 D
1212 2047 D
S
N
1219 2042 M
1231 2042 D
S
N
1237 2036 M
1237 2026 D
1239 2026 D
S
N
1251 2026 M
1262 2026 D
1262 2025 D
S
N
1262 2013 M
1262 2012 D
1274 2012 D
S
N
1286 2012 M
1288 2012 D
1288 2002 D
S
N
1292 1994 M
1304 1994 D
S
N
1313 1990 M
1313 1979 D
1313 1979 D
S
N
1325 1979 M
1337 1979 D
S
N
1338 1967 M
1338 1964 D
1347 1964 D
S
N
1359 1964 M
1363 1964 D
1363 1956 D
S
N
1364 1945 M
1376 1945 D
S
N
1388 1945 M
1388 1933 D
S
N
1396 1929 M
1408 1929 D
S
N
1413 1921 M
1413 1912 D
1416 1912 D
S
N
1428 1912 M
1439 1912 D
1439 1910 D
S
N
1439 1898 M
1439 1895 D
1448 1895 D
S
N
1460 1895 M
1464 1895 D
1464 1887 D
S
N
1467 1878 M
1479 1878 D
S
N
1489 1876 M
1489 1868 D
1493 1868 D
S
N
1505 1868 M
1514 1868 D
1514 1865 D
S
N
1514 1853 M
1514 1845 D
1518 1845 D
S
N
1530 1845 M
1539 1845 D
1539 1841 D
S
N
1540 1830 M
1552 1830 D
S
N
1564 1830 M
1564 1818 D
S
N
1571 1813 M
1583 1813 D
S
N
1590 1807 M
1590 1798 D
1593 1798 D
S
N
1605 1798 M
1615 1798 D
1615 1796 D
S
N
1616 1785 M
1628 1785 D
S
N
1640 1785 M
1640 1773 D
S
N
1643 1764 M
1655 1764 D
S
N
1665 1761 M
1665 1750 D
1665 1750 D
S
N
1678 1750 M
1690 1750 D
S
N
1690 1738 M
1690 1730 D
1694 1730 D
S
N
1706 1730 M
1715 1730 D
1715 1727 D
S
N
1725 1725 M
1737 1725 D
S
N
1741 1716 M
1741 1708 D
1745 1708 D
S
N
1757 1708 M
1766 1708 D
1766 1705 D
S
N
1766 1692 M
1766 1680 D
S
N
1775 1677 M
1787 1677 D
S
N
1791 1669 M
1791 1669 D
1803 1669 D
S
N
1815 1669 M
1816 1669 D
1816 1658 D
S
N
1816 1646 M
1816 1643 D
1826 1643 D
S
N
1838 1643 M
1841 1643 D
1841 1637 D
1844 1637 D
S
N
1856 1637 M
1866 1637 D
1866 1636 D
S
N
1866 1624 M
1866 1615 D
1870 1615 D
S
N
1882 1615 M
1892 1615 D
1892 1612 D
S
N
1896 1605 M
1909 1605 D
S
N
1917 1601 M
1917 1589 D
S
N
1928 1588 M
1940 1588 D
S
N
1942 1578 M
1942 1568 D
1943 1568 D
S
N
1956 1568 M
1967 1568 D
S
3 Sw
0 0 0 setrgbcolor
N
833 1477 M
833 1476 D
832 1476 D
832 1477 D
833 1478 D
836 1480 D
841 1480 D
844 1478 D
845 1477 D
847 1474 D
847 1465 D
848 1462 D
849 1461 D
S
N
845 1477 M
845 1465 D
847 1462 D
849 1461 D
851 1461 D
S
N
845 1474 M
844 1473 D
836 1472 D
832 1470 D
830 1467 D
830 1465 D
832 1462 D
836 1461 D
840 1461 D
843 1462 D
845 1465 D
S
N
836 1472 M
833 1470 D
832 1467 D
832 1465 D
833 1462 D
836 1461 D
S
N
860 1489 M
860 1461 D
S
N
862 1489 M
870 1465 D
S
N
860 1489 M
870 1461 D
S
N
879 1489 M
870 1461 D
S
N
879 1489 M
879 1461 D
S
N
881 1489 M
881 1461 D
S
N
856 1489 M
862 1489 D
S
N
879 1489 M
885 1489 D
S
N
856 1461 M
864 1461 D
S
N
875 1461 M
885 1461 D
S
N
911 1485 M
912 1481 D
912 1489 D
911 1485 D
908 1488 D
904 1489 D
901 1489 D
897 1488 D
895 1485 D
893 1482 D
892 1478 D
892 1472 D
893 1467 D
895 1465 D
897 1462 D
901 1461 D
904 1461 D
908 1462 D
911 1465 D
912 1467 D
S
N
901 1489 M
899 1488 D
896 1485 D
895 1482 D
893 1478 D
893 1472 D
895 1467 D
896 1465 D
899 1462 D
901 1461 D
S
N
941 1478 M
940 1481 D
937 1482 D
933 1482 D
930 1481 D
929 1480 D
927 1476 D
927 1472 D
929 1469 D
931 1467 D
936 1467 D
938 1469 D
940 1472 D
S
N
933 1482 M
930 1480 D
929 1476 D
929 1472 D
930 1469 D
931 1467 D
S
N
941 1482 M
940 1472 D
940 1469 D
942 1467 D
945 1467 D
948 1470 D
949 1474 D
949 1477 D
948 1481 D
947 1484 D
944 1487 D
941 1488 D
937 1489 D
933 1489 D
929 1488 D
926 1487 D
923 1484 D
922 1481 D
921 1477 D
921 1473 D
922 1469 D
923 1466 D
926 1463 D
929 1462 D
933 1461 D
937 1461 D
941 1462 D
944 1463 D
945 1465 D
S
N
942 1482 M
941 1472 D
941 1469 D
942 1467 D
S
N
960 1489 M
960 1461 D
S
N
962 1489 M
978 1463 D
S
N
962 1487 M
978 1461 D
S
N
978 1489 M
978 1461 D
S
N
956 1489 M
962 1489 D
S
N
974 1489 M
982 1489 D
S
N
956 1461 M
964 1461 D
S
N
992 1489 M
992 1461 D
S
N
993 1489 M
993 1461 D
S
N
988 1489 M
997 1489 D
S
N
988 1461 M
1008 1461 D
1008 1469 D
1007 1461 D
S
N
1023 1489 M
1019 1488 D
1016 1485 D
1015 1482 D
1014 1477 D
1014 1473 D
1015 1467 D
1016 1465 D
1019 1462 D
1023 1461 D
1026 1461 D
1030 1462 D
1033 1465 D
1034 1467 D
1035 1473 D
1035 1477 D
1034 1482 D
1033 1485 D
1030 1488 D
1026 1489 D
1023 1489 D
S
N
1023 1489 M
1020 1488 D
1018 1485 D
1016 1482 D
1015 1477 D
1015 1473 D
1016 1467 D
1018 1465 D
1020 1462 D
1023 1461 D
S
N
1026 1461 M
1029 1462 D
1031 1465 D
1033 1467 D
1034 1473 D
1034 1477 D
1033 1482 D
1031 1485 D
1029 1488 D
1026 1489 D
S
N
1046 1480 M
1045 1478 D
1046 1477 D
1048 1478 D
1046 1480 D
S
N
1046 1463 M
1045 1462 D
1046 1461 D
1048 1462 D
1046 1463 D
S
N
1093 1477 M
1094 1480 D
1094 1474 D
1093 1477 D
1092 1478 D
1089 1480 D
1083 1480 D
1081 1478 D
1079 1477 D
1079 1474 D
1081 1473 D
1083 1472 D
1090 1469 D
1093 1467 D
1094 1466 D
S
N
1079 1476 M
1081 1474 D
1083 1473 D
1090 1470 D
1093 1469 D
1094 1467 D
1094 1463 D
1093 1462 D
1090 1461 D
1085 1461 D
1082 1462 D
1081 1463 D
1079 1466 D
1079 1461 D
1081 1463 D
S
N
1119 1476 M
1118 1474 D
1119 1473 D
1120 1474 D
1120 1476 D
1118 1478 D
1115 1480 D
1111 1480 D
1107 1478 D
1104 1476 D
1103 1472 D
1103 1469 D
1104 1465 D
1107 1462 D
1111 1461 D
1114 1461 D
1118 1462 D
1120 1465 D
S
N
1111 1480 M
1108 1478 D
1105 1476 D
1104 1472 D
1104 1469 D
1105 1465 D
1108 1462 D
1111 1461 D
S
N
1131 1477 M
1131 1476 D
1130 1476 D
1130 1477 D
1131 1478 D
1134 1480 D
1140 1480 D
1142 1478 D
1144 1477 D
1145 1474 D
1145 1465 D
1146 1462 D
1148 1461 D
S
N
1144 1477 M
1144 1465 D
1145 1462 D
1148 1461 D
1149 1461 D
S
N
1144 1474 M
1142 1473 D
1134 1472 D
1130 1470 D
1129 1467 D
1129 1465 D
1130 1462 D
1134 1461 D
1138 1461 D
1141 1462 D
1144 1465 D
S
N
1134 1472 M
1131 1470 D
1130 1467 D
1130 1465 D
1131 1462 D
1134 1461 D
S
N
1159 1489 M
1159 1461 D
S
N
1160 1489 M
1160 1461 D
S
N
1155 1489 M
1160 1489 D
S
N
1155 1461 M
1164 1461 D
S
N
1172 1472 M
1189 1472 D
1189 1474 D
1187 1477 D
1186 1478 D
1183 1480 D
1179 1480 D
1175 1478 D
1172 1476 D
1171 1472 D
1171 1469 D
1172 1465 D
1175 1462 D
1179 1461 D
1182 1461 D
1186 1462 D
1189 1465 D
S
N
1187 1472 M
1187 1476 D
1186 1478 D
S
N
1179 1480 M
1176 1478 D
1174 1476 D
1172 1472 D
1172 1469 D
1174 1465 D
1176 1462 D
1179 1461 D
S
N
1222 1480 M
1222 1465 D
1223 1462 D
1227 1461 D
1230 1461 D
1234 1462 D
1237 1465 D
S
N
1223 1480 M
1223 1465 D
1224 1462 D
1227 1461 D
S
N
1237 1480 M
1237 1461 D
S
N
1238 1480 M
1238 1461 D
S
N
1218 1480 M
1223 1480 D
S
N
1233 1480 M
1238 1480 D
S
N
1237 1461 M
1242 1461 D
S
N
1252 1480 M
1252 1461 D
S
N
1253 1480 M
1253 1461 D
S
N
1253 1476 M
1256 1478 D
1260 1480 D
1263 1480 D
1267 1478 D
1268 1476 D
1268 1461 D
S
N
1263 1480 M
1265 1478 D
1267 1476 D
1267 1461 D
S
N
1248 1480 M
1253 1480 D
S
N
1248 1461 M
1257 1461 D
S
N
1263 1461 M
1272 1461 D
S
N
1296 1476 M
1294 1474 D
1296 1473 D
1297 1474 D
1297 1476 D
1294 1478 D
1291 1480 D
1287 1480 D
1283 1478 D
1281 1476 D
1279 1472 D
1279 1469 D
1281 1465 D
1283 1462 D
1287 1461 D
1290 1461 D
1294 1462 D
1297 1465 D
S
N
1287 1480 M
1285 1478 D
1282 1476 D
1281 1472 D
1281 1469 D
1282 1465 D
1285 1462 D
1287 1461 D
S
N
1308 1463 M
1307 1462 D
1308 1461 D
1309 1462 D
1308 1463 D
S
N
833 1304 M
833 1303 D
832 1303 D
832 1304 D
833 1305 D
836 1307 D
841 1307 D
844 1305 D
845 1304 D
847 1301 D
847 1292 D
848 1289 D
849 1288 D
S
N
845 1304 M
845 1292 D
847 1289 D
849 1288 D
851 1288 D
S
N
845 1301 M
844 1300 D
836 1299 D
832 1297 D
830 1294 D
830 1292 D
832 1289 D
836 1288 D
840 1288 D
843 1289 D
845 1292 D
S
N
836 1299 M
833 1297 D
832 1294 D
832 1292 D
833 1289 D
836 1288 D
S
N
860 1316 M
860 1288 D
S
N
862 1316 M
870 1292 D
S
N
860 1316 M
870 1288 D
S
N
879 1316 M
870 1288 D
S
N
879 1316 M
879 1288 D
S
N
881 1316 M
881 1288 D
S
N
856 1316 M
862 1316 D
S
N
879 1316 M
885 1316 D
S
N
856 1288 M
864 1288 D
S
N
875 1288 M
885 1288 D
S
N
911 1312 M
912 1308 D
912 1316 D
911 1312 D
908 1315 D
904 1316 D
901 1316 D
897 1315 D
895 1312 D
893 1309 D
892 1305 D
892 1299 D
893 1294 D
895 1292 D
897 1289 D
901 1288 D
904 1288 D
908 1289 D
911 1292 D
912 1294 D
S
N
901 1316 M
899 1315 D
896 1312 D
895 1309 D
893 1305 D
893 1299 D
895 1294 D
896 1292 D
899 1289 D
901 1288 D
S
N
941 1305 M
940 1308 D
937 1309 D
933 1309 D
930 1308 D
929 1307 D
927 1303 D
927 1299 D
929 1296 D
931 1294 D
936 1294 D
938 1296 D
940 1299 D
S
N
933 1309 M
930 1307 D
929 1303 D
929 1299 D
930 1296 D
931 1294 D
S
N
941 1309 M
940 1299 D
940 1296 D
942 1294 D
945 1294 D
948 1297 D
949 1301 D
949 1304 D
948 1308 D
947 1311 D
944 1314 D
941 1315 D
937 1316 D
933 1316 D
929 1315 D
926 1314 D
923 1311 D
922 1308 D
921 1304 D
921 1300 D
922 1296 D
923 1293 D
926 1290 D
929 1289 D
933 1288 D
937 1288 D
941 1289 D
944 1290 D
945 1292 D
S
N
942 1309 M
941 1299 D
941 1296 D
942 1294 D
S
N
960 1316 M
960 1288 D
S
N
962 1316 M
978 1290 D
S
N
962 1314 M
978 1288 D
S
N
978 1316 M
978 1288 D
S
N
956 1316 M
962 1316 D
S
N
974 1316 M
982 1316 D
S
N
956 1288 M
964 1288 D
S
N
992 1316 M
992 1288 D
S
N
993 1316 M
993 1288 D
S
N
988 1316 M
997 1316 D
S
N
988 1288 M
1008 1288 D
1008 1296 D
1007 1288 D
S
N
1023 1316 M
1019 1315 D
1016 1312 D
1015 1309 D
1014 1304 D
1014 1300 D
1015 1294 D
1016 1292 D
1019 1289 D
1023 1288 D
1026 1288 D
1030 1289 D
1033 1292 D
1034 1294 D
1035 1300 D
1035 1304 D
1034 1309 D
1033 1312 D
1030 1315 D
1026 1316 D
1023 1316 D
S
N
1023 1316 M
1020 1315 D
1018 1312 D
1016 1309 D
1015 1304 D
1015 1300 D
1016 1294 D
1018 1292 D
1020 1289 D
1023 1288 D
S
N
1026 1288 M
1029 1289 D
1031 1292 D
1033 1294 D
1034 1300 D
1034 1304 D
1033 1309 D
1031 1312 D
1029 1315 D
1026 1316 D
S
N
1046 1307 M
1045 1305 D
1046 1304 D
1048 1305 D
1046 1307 D
S
N
1046 1290 M
1045 1289 D
1046 1288 D
1048 1289 D
1046 1290 D
S
N
1082 1307 M
1082 1278 D
S
N
1083 1307 M
1083 1278 D
S
N
1083 1303 M
1086 1305 D
1089 1307 D
1092 1307 D
1096 1305 D
1098 1303 D
1100 1299 D
1100 1296 D
1098 1292 D
1096 1289 D
1092 1288 D
1089 1288 D
1086 1289 D
1083 1292 D
S
N
1092 1307 M
1094 1305 D
1097 1303 D
1098 1299 D
1098 1296 D
1097 1292 D
1094 1289 D
1092 1288 D
S
N
1078 1307 M
1083 1307 D
S
N
1078 1278 M
1088 1278 D
S
N
1124 1316 M
1124 1288 D
S
N
1126 1316 M
1126 1288 D
S
N
1124 1303 M
1122 1305 D
1119 1307 D
1116 1307 D
1112 1305 D
1109 1303 D
1108 1299 D
1108 1296 D
1109 1292 D
1112 1289 D
1116 1288 D
1119 1288 D
1122 1289 D
1124 1292 D
S
N
1116 1307 M
1114 1305 D
1111 1303 D
1109 1299 D
1109 1296 D
1111 1292 D
1114 1289 D
1116 1288 D
S
N
1120 1316 M
1126 1316 D
S
N
1124 1288 M
1130 1288 D
S
N
1146 1315 M
1145 1314 D
1146 1312 D
1148 1314 D
1148 1315 D
1146 1316 D
1144 1316 D
1141 1315 D
1140 1312 D
1140 1288 D
S
N
1144 1316 M
1142 1315 D
1141 1312 D
1141 1288 D
S
N
1135 1307 M
1146 1307 D
S
N
1135 1288 M
1145 1288 D
S
N
1179 1307 M
1179 1292 D
1181 1289 D
1185 1288 D
1187 1288 D
1192 1289 D
1194 1292 D
S
N
1181 1307 M
1181 1292 D
1182 1289 D
1185 1288 D
S
N
1194 1307 M
1194 1288 D
S
N
1196 1307 M
1196 1288 D
S
N
1175 1307 M
1181 1307 D
S
N
1190 1307 M
1196 1307 D
S
N
1194 1288 M
1200 1288 D
S
N
1209 1307 M
1209 1288 D
S
N
1211 1307 M
1211 1288 D
S
N
1211 1303 M
1213 1305 D
1218 1307 D
1220 1307 D
1224 1305 D
1226 1303 D
1226 1288 D
S
N
1220 1307 M
1223 1305 D
1224 1303 D
1224 1288 D
S
N
1205 1307 M
1211 1307 D
S
N
1205 1288 M
1215 1288 D
S
N
1220 1288 M
1230 1288 D
S
N
1253 1303 M
1252 1301 D
1253 1300 D
1254 1301 D
1254 1303 D
1252 1305 D
1249 1307 D
1245 1307 D
1241 1305 D
1238 1303 D
1237 1299 D
1237 1296 D
1238 1292 D
1241 1289 D
1245 1288 D
1248 1288 D
1252 1289 D
1254 1292 D
S
N
1245 1307 M
1242 1305 D
1239 1303 D
1238 1299 D
1238 1296 D
1239 1292 D
1242 1289 D
1245 1288 D
S
N
1265 1290 M
1264 1289 D
1265 1288 D
1267 1289 D
1265 1290 D
S
4 Sw
N
583 1520 M
583 1261 D
S
N
583 1261 M
1967 1261 D
S
N
1967 1261 M
1967 1520 D
S
N
1967 1520 M
583 1520 D
S
N
583 1261 M
1967 1261 D
S
N
583 1261 M
583 1276 D
S
N
633 1266 M
633 1261 D
S
N
684 1261 M
684 1266 D
S
N
734 1266 M
734 1261 D
S
N
784 1261 M
784 1266 D
S
N
835 1276 M
835 1261 D
S
N
885 1261 M
885 1266 D
S
N
935 1266 M
935 1261 D
S
N
986 1261 M
986 1266 D
S
N
1036 1266 M
1036 1261 D
S
N
1086 1261 M
1086 1276 D
S
N
1137 1266 M
1137 1261 D
S
N
1187 1261 M
1187 1266 D
S
N
1237 1266 M
1237 1261 D
S
N
1288 1261 M
1288 1266 D
S
N
1338 1276 M
1338 1261 D
S
N
1388 1261 M
1388 1266 D
S
N
1439 1266 M
1439 1261 D
S
N
1489 1261 M
1489 1266 D
S
N
1539 1266 M
1539 1261 D
S
N
1590 1261 M
1590 1276 D
S
N
1640 1266 M
1640 1261 D
S
N
1690 1261 M
1690 1266 D
S
N
1741 1266 M
1741 1261 D
S
N
1791 1261 M
1791 1266 D
S
N
1841 1276 M
1841 1261 D
S
N
1892 1261 M
1892 1266 D
S
N
1942 1266 M
1942 1261 D
S
N
583 1520 M
1967 1520 D
S
N
583 1505 M
583 1520 D
S
N
633 1520 M
633 1515 D
S
N
684 1515 M
684 1520 D
S
N
734 1520 M
734 1515 D
S
N
784 1515 M
784 1520 D
S
N
835 1520 M
835 1505 D
S
N
885 1515 M
885 1520 D
S
N
935 1520 M
935 1515 D
S
N
986 1515 M
986 1520 D
S
N
1036 1520 M
1036 1515 D
S
N
1086 1505 M
1086 1520 D
S
N
1137 1520 M
1137 1515 D
S
N
1187 1515 M
1187 1520 D
S
N
1237 1520 M
1237 1515 D
S
N
1288 1515 M
1288 1520 D
S
N
1338 1520 M
1338 1505 D
S
N
1388 1515 M
1388 1520 D
S
N
1439 1520 M
1439 1515 D
S
N
1489 1515 M
1489 1520 D
S
N
1539 1520 M
1539 1515 D
S
N
1590 1505 M
1590 1520 D
S
N
1640 1520 M
1640 1515 D
S
N
1690 1515 M
1690 1520 D
S
N
1741 1520 M
1741 1515 D
S
N
1791 1515 M
1791 1520 D
S
N
1841 1520 M
1841 1505 D
S
N
1892 1515 M
1892 1520 D
S
N
1942 1520 M
1942 1515 D
S
N
583 1261 M
583 1520 D
S
N
583 1261 M
588 1261 D
S
N
588 1273 M
583 1273 D
S
N
583 1285 M
599 1285 D
S
N
588 1297 M
583 1297 D
S
N
583 1309 M
588 1309 D
S
N
588 1321 M
583 1321 D
S
N
583 1333 M
588 1333 D
S
N
599 1345 M
583 1345 D
S
N
583 1357 M
588 1357 D
S
N
588 1369 M
583 1369 D
S
N
583 1381 M
588 1381 D
S
N
588 1394 M
583 1394 D
S
N
583 1406 M
599 1406 D
S
N
588 1418 M
583 1418 D
S
N
583 1430 M
588 1430 D
S
N
588 1442 M
583 1442 D
S
N
583 1454 M
588 1454 D
S
N
599 1466 M
583 1466 D
S
N
583 1478 M
588 1478 D
S
N
588 1490 M
583 1490 D
S
N
583 1502 M
588 1502 D
S
N
588 1514 M
583 1514 D
S
N
503 1298 M
498 1297 D
495 1292 D
494 1285 D
494 1280 D
495 1273 D
498 1268 D
503 1267 D
506 1267 D
510 1268 D
513 1273 D
515 1280 D
515 1285 D
513 1292 D
510 1297 D
506 1298 D
503 1298 D
S
N
503 1298 M
500 1297 D
498 1295 D
497 1292 D
495 1285 D
495 1280 D
497 1273 D
498 1270 D
500 1268 D
503 1267 D
S
N
506 1267 M
509 1268 D
510 1270 D
512 1273 D
513 1280 D
513 1285 D
512 1292 D
510 1295 D
509 1297 D
506 1298 D
S
N
527 1270 M
525 1268 D
527 1267 D
528 1268 D
527 1270 D
S
N
547 1298 M
542 1297 D
541 1294 D
541 1289 D
542 1286 D
547 1285 D
553 1285 D
557 1286 D
559 1289 D
559 1294 D
557 1297 D
553 1298 D
547 1298 D
S
N
547 1298 M
544 1297 D
542 1294 D
542 1289 D
544 1286 D
547 1285 D
S
N
553 1285 M
556 1286 D
557 1289 D
557 1294 D
556 1297 D
553 1298 D
S
N
547 1285 M
542 1283 D
541 1282 D
539 1279 D
539 1273 D
541 1270 D
542 1268 D
547 1267 D
553 1267 D
557 1268 D
559 1270 D
560 1273 D
560 1279 D
559 1282 D
557 1283 D
553 1285 D
S
N
547 1285 M
544 1283 D
542 1282 D
541 1279 D
541 1273 D
542 1270 D
544 1268 D
547 1267 D
S
N
553 1267 M
556 1268 D
557 1270 D
559 1273 D
559 1279 D
557 1282 D
556 1283 D
553 1285 D
S
N
503 1359 M
498 1357 D
495 1353 D
494 1345 D
494 1341 D
495 1333 D
498 1329 D
503 1327 D
506 1327 D
510 1329 D
513 1333 D
515 1341 D
515 1345 D
513 1353 D
510 1357 D
506 1359 D
503 1359 D
S
N
503 1359 M
500 1357 D
498 1356 D
497 1353 D
495 1345 D
495 1341 D
497 1333 D
498 1330 D
500 1329 D
503 1327 D
S
N
506 1327 M
509 1329 D
510 1330 D
512 1333 D
513 1341 D
513 1345 D
512 1353 D
510 1356 D
509 1357 D
506 1359 D
S
N
527 1330 M
525 1329 D
527 1327 D
528 1329 D
527 1330 D
S
N
559 1348 M
557 1344 D
554 1341 D
550 1339 D
548 1339 D
544 1341 D
541 1344 D
539 1348 D
539 1350 D
541 1354 D
544 1357 D
548 1359 D
551 1359 D
556 1357 D
559 1354 D
560 1350 D
560 1341 D
559 1335 D
557 1332 D
554 1329 D
550 1327 D
545 1327 D
542 1329 D
541 1332 D
541 1333 D
542 1335 D
544 1333 D
542 1332 D
S
N
548 1339 M
545 1341 D
542 1344 D
541 1348 D
541 1350 D
542 1354 D
545 1357 D
548 1359 D
S
N
551 1359 M
554 1357 D
557 1354 D
559 1350 D
559 1341 D
557 1335 D
556 1332 D
553 1329 D
550 1327 D
S
N
498 1413 M
501 1415 D
506 1419 D
506 1387 D
S
N
504 1418 M
504 1387 D
S
N
498 1387 M
512 1387 D
S
N
527 1390 M
525 1389 D
527 1387 D
528 1389 D
527 1390 D
S
N
548 1419 M
544 1418 D
541 1413 D
539 1406 D
539 1401 D
541 1394 D
544 1389 D
548 1387 D
551 1387 D
556 1389 D
559 1394 D
560 1401 D
560 1406 D
559 1413 D
556 1418 D
551 1419 D
548 1419 D
S
N
548 1419 M
545 1418 D
544 1416 D
542 1413 D
541 1406 D
541 1401 D
542 1394 D
544 1390 D
545 1389 D
548 1387 D
S
N
551 1387 M
554 1389 D
556 1390 D
557 1394 D
559 1401 D
559 1406 D
557 1413 D
556 1416 D
554 1418 D
551 1419 D
S
N
498 1473 M
501 1475 D
506 1480 D
506 1448 D
S
N
504 1478 M
504 1448 D
S
N
498 1448 M
512 1448 D
S
N
527 1451 M
525 1449 D
527 1448 D
528 1449 D
527 1451 D
S
N
544 1473 M
547 1475 D
551 1480 D
551 1448 D
S
N
550 1478 M
550 1448 D
S
N
544 1448 M
557 1448 D
S
N
1967 1261 M
1967 1520 D
S
N
1962 1261 M
1967 1261 D
S
N
1967 1273 M
1962 1273 D
S
N
1951 1285 M
1967 1285 D
S
N
1967 1297 M
1962 1297 D
S
N
1962 1309 M
1967 1309 D
S
N
1967 1321 M
1962 1321 D
S
N
1962 1333 M
1967 1333 D
S
N
1967 1345 M
1951 1345 D
S
N
1962 1357 M
1967 1357 D
S
N
1967 1369 M
1962 1369 D
S
N
1962 1381 M
1967 1381 D
S
N
1967 1394 M
1962 1394 D
S
N
1951 1406 M
1967 1406 D
S
N
1967 1418 M
1962 1418 D
S
N
1962 1430 M
1967 1430 D
S
N
1967 1442 M
1962 1442 D
S
N
1962 1454 M
1967 1454 D
S
N
1967 1466 M
1951 1466 D
S
N
1962 1478 M
1967 1478 D
S
N
1967 1490 M
1962 1490 D
S
N
1962 1502 M
1967 1502 D
S
N
1967 1514 M
1962 1514 D
S
N
583 1261 M
583 1431 D
608 1431 D
608 1432 D
633 1432 D
633 1432 D
658 1432 D
658 1432 D
684 1432 D
684 1432 D
709 1432 D
709 1432 D
734 1432 D
734 1432 D
759 1432 D
759 1432 D
784 1432 D
784 1433 D
809 1433 D
809 1433 D
835 1433 D
835 1433 D
S
N
835 1433 M
860 1433 D
860 1434 D
885 1434 D
885 1434 D
910 1434 D
910 1434 D
935 1434 D
935 1435 D
960 1435 D
960 1435 D
986 1435 D
986 1436 D
1011 1436 D
1011 1436 D
1036 1436 D
1036 1437 D
1061 1437 D
1061 1437 D
1086 1437 D
1086 1438 D
1111 1438 D
1111 1438 D
1137 1438 D
1137 1439 D
1162 1439 D
1162 1439 D
1187 1439 D
1187 1440 D
1212 1440 D
1212 1441 D
1237 1441 D
1237 1441 D
1262 1441 D
1262 1442 D
1288 1442 D
1288 1442 D
1313 1442 D
1313 1443 D
1338 1443 D
1338 1443 D
1363 1443 D
1363 1444 D
1388 1444 D
1388 1444 D
1413 1444 D
1413 1445 D
1439 1445 D
1439 1446 D
1464 1446 D
1464 1447 D
1489 1447 D
1489 1447 D
1514 1447 D
1514 1448 D
1539 1448 D
1539 1447 D
1564 1447 D
1564 1450 D
1590 1450 D
1590 1450 D
1615 1450 D
1615 1449 D
1640 1449 D
1640 1451 D
1665 1451 D
1665 1452 D
1690 1452 D
1690 1451 D
1715 1451 D
1715 1454 D
1741 1454 D
1741 1452 D
1766 1452 D
1766 1453 D
1791 1453 D
1791 1454 D
1816 1454 D
1816 1453 D
1841 1453 D
1841 1454 D
1866 1454 D
1866 1455 D
1892 1455 D
1892 1456 D
1917 1456 D
1917 1458 D
1942 1458 D
1942 1457 D
1967 1457 D
S
N
583 1261 M
583 1375 D
608 1375 D
608 1374 D
633 1374 D
633 1374 D
658 1374 D
658 1374 D
684 1374 D
684 1374 D
709 1374 D
709 1374 D
734 1374 D
734 1374 D
759 1374 D
759 1374 D
784 1374 D
784 1373 D
809 1373 D
809 1373 D
835 1373 D
835 1373 D
860 1373 D
860 1372 D
885 1372 D
885 1372 D
910 1372 D
910 1372 D
935 1372 D
935 1371 D
960 1371 D
960 1371 D
986 1371 D
986 1371 D
1011 1371 D
1011 1370 D
1036 1370 D
1036 1370 D
1061 1370 D
1061 1369 D
1086 1369 D
1086 1368 D
1111 1368 D
1111 1368 D
1137 1368 D
1137 1368 D
1162 1368 D
1162 1367 D
1187 1367 D
1187 1367 D
1212 1367 D
1212 1366 D
1237 1366 D
1237 1366 D
1262 1366 D
1262 1365 D
1288 1365 D
1288 1365 D
1313 1365 D
1313 1364 D
1338 1364 D
1338 1364 D
1363 1364 D
1363 1363 D
1388 1363 D
1388 1363 D
1413 1363 D
1413 1363 D
1439 1363 D
1439 1362 D
1464 1362 D
1464 1361 D
1489 1361 D
1489 1361 D
1514 1361 D
1514 1360 D
1539 1360 D
1539 1361 D
1564 1361 D
1564 1359 D
1590 1359 D
1590 1359 D
1615 1359 D
1615 1359 D
1640 1359 D
1640 1357 D
1665 1357 D
1665 1357 D
1690 1357 D
1690 1358 D
1715 1358 D
1715 1355 D
1741 1355 D
1741 1357 D
1766 1357 D
1766 1356 D
1791 1356 D
1791 1355 D
1816 1355 D
1816 1357 D
1841 1357 D
1841 1356 D
1866 1356 D
1866 1356 D
1892 1356 D
1892 1355 D
1917 1355 D
1917 1352 D
1942 1352 D
1942 1353 D
1967 1353 D
S
N
721 1304 M
808 1304 D
S
0 0 1 setrgbcolor
N
583 1261 M
583 1273 D
S
N
583 1285 M
583 1297 D
S
N
583 1309 M
583 1321 D
S
N
583 1333 M
583 1346 D
S
N
583 1358 M
583 1370 D
S
N
583 1382 M
583 1394 D
S
N
583 1406 M
583 1418 D
S
N
594 1420 M
606 1420 D
S
N
608 1429 M
608 1430 D
620 1430 D
S
N
632 1430 M
633 1430 D
633 1436 D
638 1436 D
S
N
650 1436 M
658 1436 D
658 1437 D
661 1437 D
S
N
674 1437 M
684 1437 D
684 1436 D
685 1436 D
S
N
697 1436 M
709 1436 D
709 1437 D
S
N
719 1438 M
731 1438 D
S
N
743 1438 M
755 1438 D
S
N
766 1440 M
778 1440 D
S
N
788 1442 M
800 1442 D
S
N
812 1441 M
824 1441 D
S
N
835 1443 M
835 1446 D
844 1446 D
S
N
856 1446 M
860 1446 D
860 1447 D
867 1447 D
S
N
879 1447 M
885 1447 D
885 1445 D
890 1445 D
S
N
902 1445 M
910 1445 D
910 1449 D
S
N
921 1450 M
933 1450 D
S
N
944 1449 M
956 1449 D
S
N
967 1451 M
979 1451 D
S
N
986 1445 M
986 1445 D
997 1445 D
S
N
1009 1445 M
1011 1445 D
1011 1447 D
1019 1447 D
S
N
1031 1447 M
1036 1447 D
1036 1453 D
1037 1453 D
S
N
1049 1453 M
1061 1453 D
1061 1453 D
S
N
1068 1458 M
1080 1458 D
S
N
1086 1452 M
1086 1452 D
1098 1452 D
S
N
1110 1452 M
1111 1452 D
1111 1457 D
1117 1457 D
S
N
1129 1457 M
1137 1457 D
1137 1452 D
S
N
1144 1447 M
1156 1447 D
S
N
1163 1451 M
1175 1451 D
S
N
1187 1452 M
1187 1452 D
1199 1452 D
S
N
1211 1452 M
1212 1452 D
1212 1452 D
1223 1452 D
S
N
1235 1452 M
1237 1452 D
1237 1455 D
1244 1455 D
S
N
1256 1455 M
1262 1455 D
1262 1458 D
1265 1458 D
S
N
1277 1458 M
1288 1458 D
1288 1457 D
1288 1457 D
S
N
1300 1457 M
1312 1457 D
S
N
1321 1453 M
1333 1453 D
S
N
1340 1448 M
1352 1448 D
S
N
1363 1448 M
1363 1452 D
1371 1452 D
S
N
1384 1452 M
1388 1452 D
1388 1449 D
1393 1449 D
S
N
1405 1449 M
1413 1449 D
1413 1446 D
S
N
1416 1436 M
1428 1436 D
S
N
1439 1437 M
1439 1449 D
S
N
1448 1452 M
1460 1452 D
S
N
1464 1460 M
1464 1461 D
1475 1461 D
S
N
1487 1461 M
1489 1461 D
1489 1457 D
1495 1457 D
S
N
1507 1457 M
1514 1457 D
1514 1456 D
1518 1456 D
S
N
1530 1456 M
1539 1456 D
1539 1456 D
1542 1456 D
S
N
1554 1456 M
1564 1456 D
1564 1455 D
S
N
1569 1447 M
1581 1447 D
S
N
1591 1445 M
1603 1445 D
S
N
1615 1445 M
1628 1445 D
S
N
1640 1445 M
1640 1445 D
1640 1452 D
1645 1452 D
S
N
1657 1452 M
1665 1452 D
1665 1456 D
S
N
1677 1457 M
1689 1457 D
S
N
1690 1446 M
1690 1445 D
1701 1445 D
S
N
1713 1445 M
1715 1445 D
1715 1442 D
1723 1442 D
S
N
1735 1442 M
1741 1442 D
1741 1447 D
1742 1447 D
S
N
1754 1447 M
1766 1447 D
1766 1447 D
S
N
1766 1459 M
1778 1459 D
S
N
1790 1459 M
1791 1459 D
1791 1456 D
1800 1456 D
S
N
1812 1456 M
1816 1456 D
1816 1448 D
S
N
1821 1441 M
1833 1441 D
S
N
1841 1445 M
1841 1447 D
1851 1447 D
S
N
1863 1447 M
1866 1447 D
1866 1446 D
1874 1446 D
S
N
1886 1446 M
1892 1446 D
1892 1440 D
1893 1440 D
S
N
1905 1440 M
1917 1440 D
1917 1440 D
S
N
1923 1434 M
1935 1434 D
S
N
1942 1440 M
1942 1452 D
S
N
1953 1453 M
1965 1453 D
S
N
583 1261 M
583 1273 D
S
N
583 1285 M
583 1297 D
S
N
583 1309 M
583 1321 D
S
N
583 1333 M
583 1346 D
S
N
592 1349 M
604 1349 D
S
N
610 1342 M
622 1342 D
S
N
633 1341 M
633 1337 D
641 1337 D
S
N
653 1337 M
658 1337 D
658 1339 D
664 1339 D
S
N
676 1339 M
684 1339 D
684 1339 D
688 1339 D
S
N
700 1339 M
709 1339 D
709 1336 D
S
N
721 1336 M
733 1336 D
S
N
744 1336 M
756 1336 D
S
N
768 1336 M
780 1336 D
S
N
792 1335 M
804 1335 D
S
N
815 1334 M
827 1334 D
S
N
837 1332 M
849 1332 D
S
N
861 1331 M
873 1331 D
S
N
885 1331 M
885 1331 D
885 1332 D
896 1332 D
S
N
908 1332 M
910 1332 D
910 1330 D
918 1330 D
S
N
930 1330 M
935 1330 D
935 1330 D
942 1330 D
S
N
954 1330 M
960 1330 D
960 1329 D
965 1329 D
S
N
977 1329 M
986 1329 D
986 1332 D
987 1332 D
S
N
999 1332 M
1011 1332 D
1011 1331 D
S
N
1022 1331 M
1034 1331 D
S
N
1044 1328 M
1056 1328 D
S
N
1066 1326 M
1078 1326 D
S
N
1087 1328 M
1099 1328 D
S
N
1111 1328 M
1111 1326 D
1121 1326 D
S
N
1134 1326 M
1137 1326 D
1137 1330 D
1142 1330 D
S
N
1154 1330 M
1162 1330 D
1162 1328 D
1164 1328 D
S
N
1176 1328 M
1187 1328 D
1187 1328 D
1188 1328 D
S
N
1200 1328 M
1212 1328 D
S
N
1224 1327 M
1236 1327 D
S
N
1247 1326 M
1259 1326 D
S
N
1269 1324 M
1282 1324 D
S
N
1293 1325 M
1305 1325 D
S
N
1316 1326 M
1328 1326 D
S
N
1338 1329 M
1338 1329 D
1350 1329 D
S
N
1362 1329 M
1363 1329 D
1363 1326 D
1372 1326 D
S
N
1384 1326 M
1388 1326 D
1388 1328 D
1395 1328 D
S
N
1407 1328 M
1413 1328 D
1413 1333 D
S
N
1425 1334 M
1437 1334 D
S
N
1441 1326 M
1454 1326 D
S
N
1464 1324 M
1464 1322 D
1474 1322 D
S
N
1486 1322 M
1489 1322 D
1489 1324 D
1496 1324 D
S
N
1508 1324 M
1514 1324 D
1514 1324 D
1520 1324 D
S
N
1533 1324 M
1539 1324 D
1539 1324 D
1544 1324 D
S
N
1557 1324 M
1564 1324 D
1564 1327 D
1565 1327 D
S
N
1578 1327 M
1590 1327 D
1590 1327 D
S
N
1601 1328 M
1613 1328 D
S
N
1625 1329 M
1637 1329 D
S
N
1646 1326 M
1658 1326 D
S
N
1668 1323 M
1680 1323 D
S
N
1690 1325 M
1690 1328 D
1699 1328 D
S
N
1712 1328 M
1715 1328 D
1715 1331 D
1721 1331 D
S
N
1733 1331 M
1741 1331 D
1741 1327 D
1741 1327 D
S
N
1753 1327 M
1765 1327 D
S
N
1772 1322 M
1784 1322 D
S
N
1795 1323 M
1807 1323 D
S
N
1816 1326 M
1816 1331 D
1823 1331 D
S
N
1835 1331 M
1841 1331 D
1841 1327 D
1844 1327 D
S
N
1856 1327 M
1866 1327 D
1866 1328 D
1868 1328 D
S
N
1880 1328 M
1892 1328 D
1892 1328 D
S
N
1897 1335 M
1909 1335 D
S
N
1917 1339 M
1917 1342 D
1926 1342 D
S
N
1939 1342 M
1942 1342 D
1942 1333 D
S
N
1946 1325 M
1958 1325 D
S
N
721 1477 M
734 1477 D
S
N
746 1477 M
758 1477 D
S
N
770 1477 M
782 1477 D
S
N
794 1477 M
806 1477 D
S
3 Sw
0 0 0 setrgbcolor
N
833 1230 M
833 1201 D
S
N
834 1230 M
834 1201 D
S
N
829 1230 M
845 1230 D
849 1228 D
851 1227 D
852 1224 D
852 1220 D
851 1217 D
849 1216 D
845 1215 D
834 1215 D
S
N
845 1230 M
848 1228 D
849 1227 D
851 1224 D
851 1220 D
849 1217 D
848 1216 D
845 1215 D
S
N
829 1201 M
838 1201 D
S
N
870 1230 M
866 1228 D
863 1226 D
862 1223 D
860 1217 D
860 1213 D
862 1208 D
863 1205 D
866 1202 D
870 1201 D
873 1201 D
877 1202 D
879 1205 D
881 1208 D
882 1213 D
882 1217 D
881 1223 D
879 1226 D
877 1228 D
873 1230 D
870 1230 D
S
N
870 1230 M
867 1228 D
864 1226 D
863 1223 D
862 1217 D
862 1213 D
863 1208 D
864 1205 D
867 1202 D
870 1201 D
S
N
873 1201 M
875 1202 D
878 1205 D
879 1208 D
881 1213 D
881 1217 D
879 1223 D
878 1226 D
875 1228 D
873 1230 D
S
N
892 1230 M
897 1201 D
S
N
893 1230 M
897 1208 D
S
N
903 1230 M
897 1201 D
S
N
903 1230 M
908 1201 D
S
N
904 1230 M
908 1208 D
S
N
914 1230 M
908 1201 D
S
N
888 1230 M
897 1230 D
S
N
910 1230 M
918 1230 D
S
N
926 1230 M
926 1201 D
S
N
927 1230 M
927 1201 D
S
N
944 1230 M
944 1201 D
S
N
945 1230 M
945 1201 D
S
N
922 1230 M
931 1230 D
S
N
940 1230 M
949 1230 D
S
N
927 1216 M
944 1216 D
S
N
922 1201 M
931 1201 D
S
N
940 1201 M
949 1201 D
S
N
959 1230 M
959 1201 D
S
N
960 1230 M
960 1201 D
S
N
968 1222 M
968 1211 D
S
N
955 1230 M
977 1230 D
977 1222 D
975 1230 D
S
N
960 1216 M
968 1216 D
S
N
955 1201 M
977 1201 D
977 1209 D
975 1201 D
S
N
988 1230 M
988 1201 D
S
N
989 1230 M
989 1201 D
S
N
983 1230 M
993 1230 D
S
N
983 1201 M
1004 1201 D
1004 1209 D
1003 1201 D
S
N
1012 1220 M
1011 1219 D
1012 1217 D
1014 1219 D
1012 1220 D
S
N
1012 1204 M
1011 1202 D
1012 1201 D
1014 1202 D
1012 1204 D
S
N
1048 1220 M
1048 1191 D
S
N
1049 1220 M
1049 1191 D
S
N
1049 1216 M
1052 1219 D
1055 1220 D
1057 1220 D
1061 1219 D
1064 1216 D
1066 1212 D
1066 1209 D
1064 1205 D
1061 1202 D
1057 1201 D
1055 1201 D
1052 1202 D
1049 1205 D
S
N
1057 1220 M
1060 1219 D
1063 1216 D
1064 1212 D
1064 1209 D
1063 1205 D
1060 1202 D
1057 1201 D
S
N
1044 1220 M
1049 1220 D
S
N
1044 1191 M
1053 1191 D
S
N
1075 1220 M
1083 1201 D
S
N
1077 1220 M
1083 1204 D
S
N
1092 1220 M
1083 1201 D
1081 1196 D
1078 1193 D
1075 1191 D
1074 1191 D
1072 1193 D
1074 1194 D
1075 1193 D
S
N
1072 1220 M
1081 1220 D
S
N
1086 1220 M
1094 1220 D
S
N
1103 1230 M
1103 1207 D
1104 1202 D
1107 1201 D
1109 1201 D
1112 1202 D
1114 1205 D
S
N
1104 1230 M
1104 1207 D
1105 1202 D
1107 1201 D
S
N
1098 1220 M
1109 1220 D
S
N
1123 1230 M
1123 1201 D
S
N
1124 1230 M
1124 1201 D
S
N
1124 1216 M
1127 1219 D
1131 1220 D
1134 1220 D
1138 1219 D
1140 1216 D
1140 1201 D
S
N
1134 1220 M
1137 1219 D
1138 1216 D
1138 1201 D
S
N
1119 1230 M
1124 1230 D
S
N
1119 1201 M
1129 1201 D
S
N
1134 1201 M
1144 1201 D
S
N
1153 1230 M
1152 1228 D
1153 1227 D
1155 1228 D
1153 1230 D
S
N
1153 1220 M
1153 1201 D
S
N
1155 1220 M
1155 1201 D
S
N
1149 1220 M
1155 1220 D
S
N
1149 1201 M
1159 1201 D
S
N
1168 1217 M
1168 1216 D
1167 1216 D
1167 1217 D
1168 1219 D
1171 1220 D
1176 1220 D
1179 1219 D
1181 1217 D
1182 1215 D
1182 1205 D
1183 1202 D
1185 1201 D
S
N
1181 1217 M
1181 1205 D
1182 1202 D
1185 1201 D
1186 1201 D
S
N
1181 1215 M
1179 1213 D
1171 1212 D
1167 1211 D
1166 1208 D
1166 1205 D
1167 1202 D
1171 1201 D
1175 1201 D
1178 1202 D
1181 1205 D
S
N
1171 1212 M
1168 1211 D
1167 1208 D
1167 1205 D
1168 1202 D
1171 1201 D
S
N
1216 1235 M
1192 1191 D
S
N
1226 1230 M
1226 1201 D
S
N
1227 1230 M
1227 1201 D
S
N
1227 1216 M
1230 1219 D
1234 1220 D
1237 1220 D
1241 1219 D
1242 1216 D
1242 1201 D
S
N
1237 1220 M
1239 1219 D
1241 1216 D
1241 1201 D
S
N
1222 1230 M
1227 1230 D
S
N
1222 1201 M
1231 1201 D
S
N
1237 1201 M
1246 1201 D
S
N
1254 1212 M
1271 1212 D
1271 1215 D
1270 1217 D
1268 1219 D
1265 1220 D
1261 1220 D
1257 1219 D
1254 1216 D
1253 1212 D
1253 1209 D
1254 1205 D
1257 1202 D
1261 1201 D
1264 1201 D
1268 1202 D
1271 1205 D
S
N
1270 1212 M
1270 1216 D
1268 1219 D
S
N
1261 1220 M
1259 1219 D
1256 1216 D
1254 1212 D
1254 1209 D
1256 1205 D
1259 1202 D
1261 1201 D
S
N
1282 1220 M
1282 1201 D
S
N
1283 1220 M
1283 1201 D
S
N
1283 1212 M
1285 1216 D
1287 1219 D
1290 1220 D
1294 1220 D
1296 1219 D
1296 1217 D
1294 1216 D
1293 1217 D
1294 1219 D
S
N
1278 1220 M
1283 1220 D
S
N
1278 1201 M
1287 1201 D
S
N
1304 1220 M
1309 1201 D
S
N
1305 1220 M
1309 1205 D
S
N
1315 1220 M
1309 1201 D
S
N
1315 1220 M
1320 1201 D
S
N
1316 1220 M
1320 1205 D
S
N
1326 1220 M
1320 1201 D
S
N
1300 1220 M
1309 1220 D
S
N
1322 1220 M
1330 1220 D
S
N
1338 1230 M
1337 1228 D
1338 1227 D
1339 1228 D
1338 1230 D
S
N
1338 1220 M
1338 1201 D
S
N
1339 1220 M
1339 1201 D
S
N
1334 1220 M
1339 1220 D
S
N
1334 1201 M
1343 1201 D
S
N
1357 1220 M
1354 1219 D
1353 1217 D
1352 1215 D
1352 1212 D
1353 1209 D
1354 1208 D
1357 1207 D
1360 1207 D
1363 1208 D
1364 1209 D
1365 1212 D
1365 1215 D
1364 1217 D
1363 1219 D
1360 1220 D
1357 1220 D
S
N
1354 1219 M
1353 1216 D
1353 1211 D
1354 1208 D
S
N
1363 1208 M
1364 1211 D
1364 1216 D
1363 1219 D
S
N
1364 1217 M
1365 1219 D
1368 1220 D
1368 1219 D
1365 1219 D
S
N
1353 1209 M
1352 1208 D
1350 1205 D
1350 1204 D
1352 1201 D
1356 1200 D
1363 1200 D
1367 1198 D
1368 1197 D
S
N
1350 1204 M
1352 1202 D
1356 1201 D
1363 1201 D
1367 1200 D
1368 1197 D
1368 1196 D
1367 1193 D
1363 1191 D
1354 1191 D
1350 1193 D
1349 1196 D
1349 1197 D
1350 1200 D
1354 1201 D
S
N
833 1057 M
833 1028 D
S
N
834 1057 M
834 1028 D
S
N
829 1057 M
845 1057 D
849 1055 D
851 1054 D
852 1051 D
852 1047 D
851 1044 D
849 1043 D
845 1042 D
834 1042 D
S
N
845 1057 M
848 1055 D
849 1054 D
851 1051 D
851 1047 D
849 1044 D
848 1043 D
845 1042 D
S
N
829 1028 M
838 1028 D
S
N
870 1057 M
866 1055 D
863 1053 D
862 1050 D
860 1044 D
860 1040 D
862 1035 D
863 1032 D
866 1029 D
870 1028 D
873 1028 D
877 1029 D
879 1032 D
881 1035 D
882 1040 D
882 1044 D
881 1050 D
879 1053 D
877 1055 D
873 1057 D
870 1057 D
S
N
870 1057 M
867 1055 D
864 1053 D
863 1050 D
862 1044 D
862 1040 D
863 1035 D
864 1032 D
867 1029 D
870 1028 D
S
N
873 1028 M
875 1029 D
878 1032 D
879 1035 D
881 1040 D
881 1044 D
879 1050 D
878 1053 D
875 1055 D
873 1057 D
S
N
892 1057 M
897 1028 D
S
N
893 1057 M
897 1035 D
S
N
903 1057 M
897 1028 D
S
N
903 1057 M
908 1028 D
S
N
904 1057 M
908 1035 D
S
N
914 1057 M
908 1028 D
S
N
888 1057 M
897 1057 D
S
N
910 1057 M
918 1057 D
S
N
926 1057 M
926 1028 D
S
N
927 1057 M
927 1028 D
S
N
944 1057 M
944 1028 D
S
N
945 1057 M
945 1028 D
S
N
922 1057 M
931 1057 D
S
N
940 1057 M
949 1057 D
S
N
927 1043 M
944 1043 D
S
N
922 1028 M
931 1028 D
S
N
940 1028 M
949 1028 D
S
N
959 1057 M
959 1028 D
S
N
960 1057 M
960 1028 D
S
N
968 1049 M
968 1038 D
S
N
955 1057 M
977 1057 D
977 1049 D
975 1057 D
S
N
960 1043 M
968 1043 D
S
N
955 1028 M
977 1028 D
977 1036 D
975 1028 D
S
N
988 1057 M
988 1028 D
S
N
989 1057 M
989 1028 D
S
N
983 1057 M
993 1057 D
S
N
983 1028 M
1004 1028 D
1004 1036 D
1003 1028 D
S
N
1033 1062 M
1008 1018 D
S
N
1042 1044 M
1042 1043 D
1041 1043 D
1041 1044 D
1042 1046 D
1045 1047 D
1051 1047 D
1053 1046 D
1055 1044 D
1056 1042 D
1056 1032 D
1057 1029 D
1059 1028 D
S
N
1055 1044 M
1055 1032 D
1056 1029 D
1059 1028 D
1060 1028 D
S
N
1055 1042 M
1053 1040 D
1045 1039 D
1041 1038 D
1040 1035 D
1040 1032 D
1041 1029 D
1045 1028 D
1049 1028 D
1052 1029 D
1055 1032 D
S
N
1045 1039 M
1042 1038 D
1041 1035 D
1041 1032 D
1042 1029 D
1045 1028 D
S
N
1070 1057 M
1070 1028 D
S
N
1071 1057 M
1079 1032 D
S
N
1070 1057 M
1079 1028 D
S
N
1089 1057 M
1079 1028 D
S
N
1089 1057 M
1089 1028 D
S
N
1090 1057 M
1090 1028 D
S
N
1066 1057 M
1071 1057 D
S
N
1089 1057 M
1094 1057 D
S
N
1066 1028 M
1074 1028 D
S
N
1085 1028 M
1094 1028 D
S
N
1120 1053 M
1122 1049 D
1122 1057 D
1120 1053 D
1118 1055 D
1114 1057 D
1111 1057 D
1107 1055 D
1104 1053 D
1103 1050 D
1101 1046 D
1101 1039 D
1103 1035 D
1104 1032 D
1107 1029 D
1111 1028 D
1114 1028 D
1118 1029 D
1120 1032 D
1122 1035 D
S
N
1111 1057 M
1108 1055 D
1105 1053 D
1104 1050 D
1103 1046 D
1103 1039 D
1104 1035 D
1105 1032 D
1108 1029 D
1111 1028 D
S
N
1150 1046 M
1149 1049 D
1146 1050 D
1142 1050 D
1140 1049 D
1138 1047 D
1137 1043 D
1137 1039 D
1138 1036 D
1141 1035 D
1145 1035 D
1148 1036 D
1149 1039 D
S
N
1142 1050 M
1140 1047 D
1138 1043 D
1138 1039 D
1140 1036 D
1141 1035 D
S
N
1150 1050 M
1149 1039 D
1149 1036 D
1152 1035 D
1155 1035 D
1157 1038 D
1159 1042 D
1159 1044 D
1157 1049 D
1156 1051 D
1153 1054 D
1150 1055 D
1146 1057 D
1142 1057 D
1138 1055 D
1135 1054 D
1133 1051 D
1131 1049 D
1130 1044 D
1130 1040 D
1131 1036 D
1133 1034 D
1135 1031 D
1138 1029 D
1142 1028 D
1146 1028 D
1150 1029 D
1153 1031 D
1155 1032 D
S
N
1152 1050 M
1150 1039 D
1150 1036 D
1152 1035 D
S
N
1170 1057 M
1170 1028 D
S
N
1171 1057 M
1187 1031 D
S
N
1171 1054 M
1187 1028 D
S
N
1187 1057 M
1187 1028 D
S
N
1166 1057 M
1171 1057 D
S
N
1183 1057 M
1192 1057 D
S
N
1166 1028 M
1174 1028 D
S
N
1201 1057 M
1201 1028 D
S
N
1202 1057 M
1202 1028 D
S
N
1197 1057 M
1207 1057 D
S
N
1197 1028 M
1218 1028 D
1218 1036 D
1216 1028 D
S
N
1233 1057 M
1228 1055 D
1226 1053 D
1224 1050 D
1223 1044 D
1223 1040 D
1224 1035 D
1226 1032 D
1228 1029 D
1233 1028 D
1235 1028 D
1239 1029 D
1242 1032 D
1244 1035 D
1245 1040 D
1245 1044 D
1244 1050 D
1242 1053 D
1239 1055 D
1235 1057 D
1233 1057 D
S
N
1233 1057 M
1230 1055 D
1227 1053 D
1226 1050 D
1224 1044 D
1224 1040 D
1226 1035 D
1227 1032 D
1230 1029 D
1233 1028 D
S
N
1235 1028 M
1238 1029 D
1241 1032 D
1242 1035 D
1244 1040 D
1244 1044 D
1242 1050 D
1241 1053 D
1238 1055 D
1235 1057 D
S
4 Sw
N
1682 895 M
1682 864 D
S
N
1684 895 M
1684 864 D
S
N
1684 891 M
1687 894 D
1690 895 D
1693 895 D
1697 894 D
1700 891 D
1702 886 D
1702 883 D
1700 879 D
1697 876 D
1693 874 D
1690 874 D
1687 876 D
1684 879 D
S
N
1693 895 M
1696 894 D
1699 891 D
1700 886 D
1700 883 D
1699 879 D
1696 876 D
1693 874 D
S
N
1678 895 M
1684 895 D
S
N
1678 864 M
1688 864 D
S
N
1717 883 M
1717 862 D
S
N
1718 883 M
1718 862 D
S
N
1711 883 M
1710 877 D
1710 883 D
1725 883 D
1725 877 D
1724 883 D
S
N
1714 862 M
1721 862 D
S
N
1746 912 M
1743 909 D
1740 904 D
1737 898 D
1735 891 D
1735 885 D
1737 877 D
1740 871 D
1743 867 D
1746 864 D
S
N
1743 909 M
1740 903 D
1739 898 D
1737 891 D
1737 885 D
1739 877 D
1740 873 D
1743 867 D
S
N
1758 906 M
1758 874 D
S
N
1760 906 M
1760 874 D
S
N
1778 906 M
1778 874 D
S
N
1779 906 M
1779 874 D
S
N
1754 906 M
1764 906 D
S
N
1773 906 M
1784 906 D
S
N
1760 891 M
1778 891 D
S
N
1754 874 M
1764 874 D
S
N
1773 874 M
1784 874 D
S
N
1791 912 M
1794 909 D
1797 904 D
1800 898 D
1802 891 D
1802 885 D
1800 877 D
1797 871 D
1794 867 D
1791 864 D
S
N
1794 909 M
1797 903 D
1799 898 D
1800 891 D
1800 885 D
1799 877 D
1797 873 D
1794 867 D
S
N
1838 912 M
1838 864 D
S
N
1840 912 M
1840 864 D
S
N
1838 912 M
1849 912 D
S
N
1838 864 M
1849 864 D
S
N
1879 901 M
1880 897 D
1880 906 D
1879 901 D
1876 904 D
1871 906 D
1868 906 D
1864 904 D
1861 901 D
1859 898 D
1858 894 D
1858 886 D
1859 882 D
1861 879 D
1864 876 D
1868 874 D
1871 874 D
1876 876 D
1879 879 D
S
N
1868 906 M
1865 904 D
1862 901 D
1861 898 D
1859 894 D
1859 886 D
1861 882 D
1862 879 D
1865 876 D
1868 874 D
S
N
1879 886 M
1879 874 D
S
N
1880 886 M
1880 874 D
S
N
1874 886 M
1885 886 D
S
N
1894 886 M
1912 886 D
1912 889 D
1911 892 D
1909 894 D
1906 895 D
1902 895 D
1897 894 D
1894 891 D
1892 886 D
1892 883 D
1894 879 D
1897 876 D
1902 874 D
1905 874 D
1909 876 D
1912 879 D
S
N
1911 886 M
1911 891 D
1909 894 D
S
N
1902 895 M
1899 894 D
1895 891 D
1894 886 D
1894 883 D
1895 879 D
1899 876 D
1902 874 D
S
N
1921 906 M
1932 874 D
S
N
1923 906 M
1932 879 D
S
N
1942 906 M
1932 874 D
S
N
1918 906 M
1927 906 D
S
N
1936 906 M
1945 906 D
S
N
1960 912 M
1960 864 D
S
N
1962 912 M
1962 864 D
S
N
1951 912 M
1962 912 D
S
N
1951 864 M
1962 864 D
S
N
583 1261 M
583 1001 D
S
N
583 1001 M
1967 1001 D
S
N
1967 1001 M
1967 1261 D
S
N
1967 1261 M
583 1261 D
S
N
583 1001 M
583 1017 D
S
N
633 1006 M
633 1001 D
S
N
684 1001 M
684 1006 D
S
N
734 1006 M
734 1001 D
S
N
784 1001 M
784 1006 D
S
N
835 1017 M
835 1001 D
S
N
885 1001 M
885 1006 D
S
N
935 1006 M
935 1001 D
S
N
986 1001 M
986 1006 D
S
N
1036 1006 M
1036 1001 D
S
N
1086 1001 M
1086 1017 D
S
N
1137 1006 M
1137 1001 D
S
N
1187 1001 M
1187 1006 D
S
N
1237 1006 M
1237 1001 D
S
N
1288 1001 M
1288 1006 D
S
N
1338 1017 M
1338 1001 D
S
N
1388 1001 M
1388 1006 D
S
N
1439 1006 M
1439 1001 D
S
N
1489 1001 M
1489 1006 D
S
N
1539 1006 M
1539 1001 D
S
N
1590 1001 M
1590 1017 D
S
N
1640 1006 M
1640 1001 D
S
N
1690 1001 M
1690 1006 D
S
N
1741 1006 M
1741 1001 D
S
N
1791 1001 M
1791 1006 D
S
N
1841 1017 M
1841 1001 D
S
N
1892 1001 M
1892 1006 D
S
N
1942 1006 M
1942 1001 D
S
N
581 971 M
577 970 D
574 965 D
572 958 D
572 953 D
574 946 D
577 941 D
581 940 D
585 940 D
589 941 D
592 946 D
594 953 D
594 958 D
592 965 D
589 970 D
585 971 D
581 971 D
S
N
581 971 M
578 970 D
577 968 D
575 965 D
574 958 D
574 953 D
575 946 D
577 943 D
578 941 D
581 940 D
S
N
585 940 M
588 941 D
589 943 D
591 946 D
592 953 D
592 958 D
591 965 D
589 968 D
588 970 D
585 971 D
S
N
798 965 M
801 967 D
806 971 D
806 940 D
S
N
804 970 M
804 940 D
S
N
798 940 M
812 940 D
S
N
833 971 M
829 970 D
826 965 D
824 958 D
824 953 D
826 946 D
829 941 D
833 940 D
836 940 D
841 941 D
844 946 D
845 953 D
845 958 D
844 965 D
841 970 D
836 971 D
833 971 D
S
N
833 971 M
830 970 D
829 968 D
827 965 D
826 958 D
826 953 D
827 946 D
829 943 D
830 941 D
833 940 D
S
N
836 940 M
839 941 D
841 943 D
842 946 D
844 953 D
844 958 D
842 965 D
841 968 D
839 970 D
836 971 D
S
N
863 971 M
859 970 D
856 965 D
854 958 D
854 953 D
856 946 D
859 941 D
863 940 D
866 940 D
871 941 D
874 946 D
875 953 D
875 958 D
874 965 D
871 970 D
866 971 D
863 971 D
S
N
863 971 M
860 970 D
859 968 D
857 965 D
856 958 D
856 953 D
857 946 D
859 943 D
860 941 D
863 940 D
S
N
866 940 M
869 941 D
871 943 D
872 946 D
874 953 D
874 958 D
872 965 D
871 968 D
869 970 D
866 971 D
S
N
1047 965 M
1048 964 D
1047 962 D
1045 964 D
1045 965 D
1047 968 D
1048 970 D
1053 971 D
1059 971 D
1064 970 D
1065 968 D
1067 965 D
1067 962 D
1065 959 D
1061 956 D
1053 953 D
1050 952 D
1047 949 D
1045 944 D
1045 940 D
S
N
1059 971 M
1062 970 D
1064 968 D
1065 965 D
1065 962 D
1064 959 D
1059 956 D
1053 953 D
S
N
1045 943 M
1047 944 D
1050 944 D
1058 941 D
1062 941 D
1065 943 D
1067 944 D
S
N
1050 944 M
1058 940 D
1064 940 D
1065 941 D
1067 944 D
1067 947 D
S
N
1085 971 M
1080 970 D
1077 965 D
1076 958 D
1076 953 D
1077 946 D
1080 941 D
1085 940 D
1088 940 D
1092 941 D
1095 946 D
1097 953 D
1097 958 D
1095 965 D
1092 970 D
1088 971 D
1085 971 D
S
N
1085 971 M
1082 970 D
1080 968 D
1079 965 D
1077 958 D
1077 953 D
1079 946 D
1080 943 D
1082 941 D
1085 940 D
S
N
1088 940 M
1091 941 D
1092 943 D
1094 946 D
1095 953 D
1095 958 D
1094 965 D
1092 968 D
1091 970 D
1088 971 D
S
N
1115 971 M
1110 970 D
1107 965 D
1106 958 D
1106 953 D
1107 946 D
1110 941 D
1115 940 D
1118 940 D
1122 941 D
1125 946 D
1127 953 D
1127 958 D
1125 965 D
1122 970 D
1118 971 D
1115 971 D
S
N
1115 971 M
1112 970 D
1110 968 D
1109 965 D
1107 958 D
1107 953 D
1109 946 D
1110 943 D
1112 941 D
1115 940 D
S
N
1118 940 M
1121 941 D
1122 943 D
1124 946 D
1125 953 D
1125 958 D
1124 965 D
1122 968 D
1121 970 D
1118 971 D
S
N
1299 965 M
1300 964 D
1299 962 D
1297 964 D
1297 965 D
1299 968 D
1300 970 D
1305 971 D
1311 971 D
1315 970 D
1317 967 D
1317 962 D
1315 959 D
1311 958 D
1306 958 D
S
N
1311 971 M
1314 970 D
1315 967 D
1315 962 D
1314 959 D
1311 958 D
S
N
1311 958 M
1314 956 D
1317 953 D
1318 950 D
1318 946 D
1317 943 D
1315 941 D
1311 940 D
1305 940 D
1300 941 D
1299 943 D
1297 946 D
1297 947 D
1299 949 D
1300 947 D
1299 946 D
S
N
1315 955 M
1317 950 D
1317 946 D
1315 943 D
1314 941 D
1311 940 D
S
N
1336 971 M
1332 970 D
1329 965 D
1327 958 D
1327 953 D
1329 946 D
1332 941 D
1336 940 D
1339 940 D
1344 941 D
1347 946 D
1348 953 D
1348 958 D
1347 965 D
1344 970 D
1339 971 D
1336 971 D
S
N
1336 971 M
1333 970 D
1332 968 D
1330 965 D
1329 958 D
1329 953 D
1330 946 D
1332 943 D
1333 941 D
1336 940 D
S
N
1339 940 M
1342 941 D
1344 943 D
1345 946 D
1347 953 D
1347 958 D
1345 965 D
1344 968 D
1342 970 D
1339 971 D
S
N
1367 971 M
1362 970 D
1359 965 D
1357 958 D
1357 953 D
1359 946 D
1362 941 D
1367 940 D
1370 940 D
1374 941 D
1377 946 D
1379 953 D
1379 958 D
1377 965 D
1374 970 D
1370 971 D
1367 971 D
S
N
1367 971 M
1363 970 D
1362 968 D
1360 965 D
1359 958 D
1359 953 D
1360 946 D
1362 943 D
1363 941 D
1367 940 D
S
N
1370 940 M
1373 941 D
1374 943 D
1376 946 D
1377 953 D
1377 958 D
1376 965 D
1374 968 D
1373 970 D
1370 971 D
S
N
1562 968 M
1562 940 D
S
N
1564 971 M
1564 940 D
S
N
1564 971 M
1547 949 D
1571 949 D
S
N
1558 940 M
1568 940 D
S
N
1588 971 M
1583 970 D
1580 965 D
1579 958 D
1579 953 D
1580 946 D
1583 941 D
1588 940 D
1591 940 D
1596 941 D
1599 946 D
1600 953 D
1600 958 D
1599 965 D
1596 970 D
1591 971 D
1588 971 D
S
N
1588 971 M
1585 970 D
1583 968 D
1582 965 D
1580 958 D
1580 953 D
1582 946 D
1583 943 D
1585 941 D
1588 940 D
S
N
1591 940 M
1594 941 D
1596 943 D
1597 946 D
1599 953 D
1599 958 D
1597 965 D
1596 968 D
1594 970 D
1591 971 D
S
N
1618 971 M
1614 970 D
1611 965 D
1609 958 D
1609 953 D
1611 946 D
1614 941 D
1618 940 D
1621 940 D
1626 941 D
1629 946 D
1630 953 D
1630 958 D
1629 965 D
1626 970 D
1621 971 D
1618 971 D
S
N
1618 971 M
1615 970 D
1614 968 D
1612 965 D
1611 958 D
1611 953 D
1612 946 D
1614 943 D
1615 941 D
1618 940 D
S
N
1621 940 M
1624 941 D
1626 943 D
1627 946 D
1629 953 D
1629 958 D
1627 965 D
1626 968 D
1624 970 D
1621 971 D
S
N
1803 971 M
1800 956 D
S
N
1800 956 M
1803 959 D
1808 961 D
1812 961 D
1817 959 D
1820 956 D
1821 952 D
1821 949 D
1820 944 D
1817 941 D
1812 940 D
1808 940 D
1803 941 D
1802 943 D
1800 946 D
1800 947 D
1802 949 D
1803 947 D
1802 946 D
S
N
1812 961 M
1815 959 D
1818 956 D
1820 952 D
1820 949 D
1818 944 D
1815 941 D
1812 940 D
S
N
1803 971 M
1818 971 D
S
N
1803 970 M
1811 970 D
1818 971 D
S
N
1840 971 M
1835 970 D
1832 965 D
1831 958 D
1831 953 D
1832 946 D
1835 941 D
1840 940 D
1843 940 D
1847 941 D
1850 946 D
1852 953 D
1852 958 D
1850 965 D
1847 970 D
1843 971 D
1840 971 D
S
N
1840 971 M
1837 970 D
1835 968 D
1834 965 D
1832 958 D
1832 953 D
1834 946 D
1835 943 D
1837 941 D
1840 940 D
S
N
1843 940 M
1846 941 D
1847 943 D
1849 946 D
1850 953 D
1850 958 D
1849 965 D
1847 968 D
1846 970 D
1843 971 D
S
N
1870 971 M
1865 970 D
1862 965 D
1861 958 D
1861 953 D
1862 946 D
1865 941 D
1870 940 D
1873 940 D
1877 941 D
1880 946 D
1882 953 D
1882 958 D
1880 965 D
1877 970 D
1873 971 D
1870 971 D
S
N
1870 971 M
1867 970 D
1865 968 D
1864 965 D
1862 958 D
1862 953 D
1864 946 D
1865 943 D
1867 941 D
1870 940 D
S
N
1873 940 M
1876 941 D
1877 943 D
1879 946 D
1880 953 D
1880 958 D
1879 965 D
1877 968 D
1876 970 D
1873 971 D
S
N
583 1261 M
1967 1261 D
S
N
583 1245 M
583 1261 D
S
N
633 1261 M
633 1256 D
S
N
684 1256 M
684 1261 D
S
N
734 1261 M
734 1256 D
S
N
784 1256 M
784 1261 D
S
N
835 1261 M
835 1245 D
S
N
885 1256 M
885 1261 D
S
N
935 1261 M
935 1256 D
S
N
986 1256 M
986 1261 D
S
N
1036 1261 M
1036 1256 D
S
N
1086 1245 M
1086 1261 D
S
N
1137 1261 M
1137 1256 D
S
N
1187 1256 M
1187 1261 D
S
N
1237 1261 M
1237 1256 D
S
N
1288 1256 M
1288 1261 D
S
N
1338 1261 M
1338 1245 D
S
N
1388 1256 M
1388 1261 D
S
N
1439 1261 M
1439 1256 D
S
N
1489 1256 M
1489 1261 D
S
N
1539 1261 M
1539 1256 D
S
N
1590 1245 M
1590 1261 D
S
N
1640 1261 M
1640 1256 D
S
N
1690 1256 M
1690 1261 D
S
N
1741 1261 M
1741 1256 D
S
N
1791 1256 M
1791 1261 D
S
N
1841 1261 M
1841 1245 D
S
N
1892 1256 M
1892 1261 D
S
N
1942 1261 M
1942 1256 D
S
N
583 1001 M
583 1261 D
S
N
583 1006 M
588 1006 D
S
N
588 1022 M
583 1022 D
S
N
583 1038 M
588 1038 D
S
N
599 1053 M
583 1053 D
S
N
583 1069 M
588 1069 D
S
N
588 1084 M
583 1084 D
S
N
583 1100 M
588 1100 D
S
N
588 1115 M
583 1115 D
S
N
583 1131 M
599 1131 D
S
N
588 1147 M
583 1147 D
S
N
583 1162 M
588 1162 D
S
N
588 1178 M
583 1178 D
S
N
583 1193 M
588 1193 D
S
N
599 1209 M
583 1209 D
S
N
583 1224 M
588 1224 D
S
N
588 1240 M
583 1240 D
S
N
583 1256 M
588 1256 D
S
N
503 1067 M
498 1065 D
495 1061 D
494 1053 D
494 1049 D
495 1041 D
498 1037 D
503 1035 D
506 1035 D
510 1037 D
513 1041 D
515 1049 D
515 1053 D
513 1061 D
510 1065 D
506 1067 D
503 1067 D
S
N
503 1067 M
500 1065 D
498 1064 D
497 1061 D
495 1053 D
495 1049 D
497 1041 D
498 1038 D
500 1037 D
503 1035 D
S
N
506 1035 M
509 1037 D
510 1038 D
512 1041 D
513 1049 D
513 1053 D
512 1061 D
510 1064 D
509 1065 D
506 1067 D
S
N
527 1038 M
525 1037 D
527 1035 D
528 1037 D
527 1038 D
S
N
547 1067 M
542 1065 D
541 1062 D
541 1058 D
542 1055 D
547 1053 D
553 1053 D
557 1055 D
559 1058 D
559 1062 D
557 1065 D
553 1067 D
547 1067 D
S
N
547 1067 M
544 1065 D
542 1062 D
542 1058 D
544 1055 D
547 1053 D
S
N
553 1053 M
556 1055 D
557 1058 D
557 1062 D
556 1065 D
553 1067 D
S
N
547 1053 M
542 1052 D
541 1050 D
539 1047 D
539 1041 D
541 1038 D
542 1037 D
547 1035 D
553 1035 D
557 1037 D
559 1038 D
560 1041 D
560 1047 D
559 1050 D
557 1052 D
553 1053 D
S
N
547 1053 M
544 1052 D
542 1050 D
541 1047 D
541 1041 D
542 1038 D
544 1037 D
547 1035 D
S
N
553 1035 M
556 1037 D
557 1038 D
559 1041 D
559 1047 D
557 1050 D
556 1052 D
553 1053 D
S
N
498 1139 M
501 1140 D
506 1145 D
506 1113 D
S
N
504 1143 M
504 1113 D
S
N
498 1113 M
512 1113 D
S
N
527 1116 M
525 1114 D
527 1113 D
528 1114 D
527 1116 D
S
N
548 1145 M
544 1143 D
541 1139 D
539 1131 D
539 1126 D
541 1119 D
544 1114 D
548 1113 D
551 1113 D
556 1114 D
559 1119 D
560 1126 D
560 1131 D
559 1139 D
556 1143 D
551 1145 D
548 1145 D
S
N
548 1145 M
545 1143 D
544 1142 D
542 1139 D
541 1131 D
541 1126 D
542 1119 D
544 1116 D
545 1114 D
548 1113 D
S
N
551 1113 M
554 1114 D
556 1116 D
557 1119 D
559 1126 D
559 1131 D
557 1139 D
556 1142 D
554 1143 D
551 1145 D
S
N
498 1216 M
501 1218 D
506 1222 D
506 1191 D
S
N
504 1221 M
504 1191 D
S
N
498 1191 M
512 1191 D
S
N
527 1194 M
525 1192 D
527 1191 D
528 1192 D
527 1194 D
S
N
541 1216 M
542 1215 D
541 1213 D
539 1215 D
539 1216 D
541 1219 D
542 1221 D
547 1222 D
553 1222 D
557 1221 D
559 1219 D
560 1216 D
560 1213 D
559 1210 D
554 1207 D
547 1204 D
544 1203 D
541 1200 D
539 1195 D
539 1191 D
S
N
553 1222 M
556 1221 D
557 1219 D
559 1216 D
559 1213 D
557 1210 D
553 1207 D
547 1204 D
S
N
539 1194 M
541 1195 D
544 1195 D
551 1192 D
556 1192 D
559 1194 D
560 1195 D
S
N
544 1195 M
551 1191 D
557 1191 D
559 1192 D
560 1195 D
560 1198 D
S
N
1967 1001 M
1967 1261 D
S
N
1962 1006 M
1967 1006 D
S
N
1967 1022 M
1962 1022 D
S
N
1962 1038 M
1967 1038 D
S
N
1967 1053 M
1951 1053 D
S
N
1962 1069 M
1967 1069 D
S
N
1967 1084 M
1962 1084 D
S
N
1962 1100 M
1967 1100 D
S
N
1967 1115 M
1962 1115 D
S
N
1951 1131 M
1967 1131 D
S
N
1967 1147 M
1962 1147 D
S
N
1962 1162 M
1967 1162 D
S
N
1967 1178 M
1962 1178 D
S
N
1962 1193 M
1967 1193 D
S
N
1967 1209 M
1951 1209 D
S
N
1962 1224 M
1967 1224 D
S
N
1967 1240 M
1962 1240 D
S
N
1962 1256 M
1967 1256 D
S
N
583 1001 M
583 1109 D
608 1109 D
608 1109 D
633 1109 D
633 1113 D
658 1113 D
658 1116 D
684 1116 D
684 1114 D
709 1114 D
709 1118 D
734 1118 D
734 1119 D
759 1119 D
759 1124 D
784 1124 D
784 1122 D
809 1122 D
809 1127 D
835 1127 D
835 1126 D
860 1126 D
860 1127 D
885 1127 D
885 1133 D
910 1133 D
910 1130 D
935 1130 D
935 1131 D
960 1131 D
960 1137 D
986 1137 D
986 1135 D
1011 1135 D
1011 1137 D
1036 1137 D
1036 1137 D
1061 1137 D
1061 1136 D
1086 1136 D
1086 1141 D
1111 1141 D
1111 1136 D
1137 1136 D
1137 1146 D
1162 1146 D
1162 1144 D
1187 1144 D
1187 1145 D
1212 1145 D
1212 1145 D
1237 1145 D
1237 1143 D
1262 1143 D
1262 1144 D
1288 1144 D
1288 1149 D
1313 1149 D
1313 1157 D
1338 1157 D
1338 1145 D
1363 1145 D
1363 1150 D
1388 1150 D
1388 1154 D
1413 1154 D
1413 1146 D
1439 1146 D
1439 1147 D
1464 1147 D
1464 1164 D
1489 1164 D
1489 1144 D
1514 1144 D
1514 1163 D
1539 1163 D
1539 1140 D
1564 1140 D
1564 1146 D
1590 1146 D
1590 1156 D
1615 1156 D
1615 1157 D
1640 1157 D
1640 1165 D
1665 1165 D
1665 1169 D
1690 1169 D
1690 1169 D
1715 1169 D
1715 1161 D
1741 1161 D
1741 1146 D
1766 1146 D
1766 1176 D
1791 1176 D
1791 1171 D
1816 1171 D
1816 1149 D
1841 1149 D
1841 1156 D
1866 1156 D
1866 1192 D
1892 1192 D
1892 1116 D
1917 1116 D
1917 1169 D
S
N
1917 1169 M
1942 1169 D
1942 1163 D
1967 1163 D
S
N
721 1217 M
808 1217 D
S
0 0 1 setrgbcolor
N
583 1001 M
583 1013 D
S
N
583 1025 M
583 1038 D
S
N
583 1050 M
583 1062 D
S
N
583 1074 M
583 1086 D
S
N
583 1098 M
583 1110 D
S
N
583 1122 M
583 1134 D
S
N
590 1139 M
602 1139 D
S
N
608 1146 M
608 1147 D
619 1147 D
S
N
631 1147 M
633 1147 D
633 1148 D
642 1148 D
S
N
654 1148 M
658 1148 D
658 1144 D
663 1144 D
S
N
675 1144 M
684 1144 D
684 1148 D
684 1148 D
S
N
696 1148 M
709 1148 D
S
N
717 1144 M
729 1144 D
S
N
737 1148 M
749 1148 D
S
N
759 1146 M
759 1140 D
766 1140 D
S
N
778 1140 M
784 1140 D
784 1140 D
790 1140 D
S
N
802 1140 M
809 1140 D
809 1139 D
814 1139 D
S
N
826 1139 M
835 1139 D
835 1136 D
S
N
846 1135 M
858 1135 D
S
N
869 1135 M
882 1135 D
S
N
891 1132 M
903 1132 D
S
N
914 1130 M
926 1130 D
S
N
935 1133 M
935 1134 D
946 1134 D
S
N
959 1134 M
960 1134 D
960 1129 D
966 1129 D
S
N
978 1129 M
986 1129 D
986 1129 D
990 1129 D
S
N
1002 1129 M
1011 1129 D
1011 1130 D
1014 1130 D
S
N
1026 1130 M
1036 1130 D
1036 1128 D
S
N
1043 1123 M
1055 1123 D
S
N
1067 1122 M
1079 1122 D
S
N
1089 1124 M
1101 1124 D
S
N
1112 1122 M
1124 1122 D
S
N
1136 1122 M
1137 1122 D
1137 1117 D
1143 1117 D
S
N
1155 1117 M
1162 1117 D
1162 1120 D
1164 1120 D
S
N
1177 1120 M
1187 1120 D
1187 1122 D
S
N
1196 1124 M
1209 1124 D
S
N
1218 1122 M
1230 1122 D
S
N
1237 1117 M
1237 1113 D
1246 1113 D
S
N
1258 1113 M
1262 1113 D
1262 1115 D
1268 1115 D
S
N
1280 1115 M
1288 1115 D
1288 1111 D
S
N
1298 1110 M
1311 1110 D
S
N
1313 1120 M
1313 1120 D
1325 1120 D
S
N
1337 1120 M
1338 1120 D
1338 1115 D
1344 1115 D
S
N
1356 1115 M
1363 1115 D
1363 1110 D
S
N
1374 1109 M
1387 1109 D
S
N
1393 1104 M
1405 1104 D
S
N
1416 1106 M
1428 1106 D
S
N
1439 1104 M
1439 1103 D
1450 1103 D
S
N
1462 1103 M
1464 1103 D
1464 1096 D
1467 1096 D
S
N
1479 1096 M
1489 1096 D
1489 1099 D
S
N
1489 1111 M
1489 1121 D
1490 1121 D
S
N
1502 1121 M
1514 1121 D
1514 1121 D
S
N
1514 1109 M
1514 1099 D
1517 1099 D
S
N
1529 1099 M
1539 1099 D
1539 1097 D
S
N
1550 1096 M
1562 1096 D
S
N
1573 1097 M
1585 1097 D
S
N
1590 1104 M
1590 1108 D
1598 1108 D
S
N
1610 1108 M
1615 1108 D
1615 1116 D
S
N
1627 1116 M
1639 1116 D
S
N
1640 1105 M
1640 1093 D
1641 1093 D
S
N
1653 1093 M
1665 1093 D
S
N
1673 1089 M
1685 1089 D
S
N
1691 1095 M
1703 1095 D
S
N
1715 1095 M
1715 1095 D
1715 1107 D
S
N
1715 1119 M
1715 1128 D
1719 1128 D
S
N
1731 1128 M
1741 1128 D
1741 1130 D
S
N
1747 1136 M
1759 1136 D
S
N
1766 1130 M
1766 1118 D
S
N
1766 1106 M
1766 1094 D
S
N
1767 1083 M
1779 1083 D
S
N
1791 1083 M
1791 1095 D
S
N
1799 1099 M
1811 1099 D
S
N
1816 1091 M
1816 1079 D
S
N
1816 1067 M
1816 1067 D
1828 1067 D
S
N
1840 1067 M
1841 1067 D
1841 1077 D
S
N
1841 1089 M
1841 1102 D
S
N
1850 1105 M
1862 1105 D
S
N
1866 1097 M
1866 1094 D
1876 1094 D
S
N
1888 1094 M
1892 1094 D
1892 1097 D
1896 1097 D
S
N
1909 1097 M
1917 1097 D
1917 1101 D
S
N
1928 1102 M
1940 1102 D
S
N
1942 1091 M
1942 1079 D
S
N
1942 1067 M
1942 1055 D
S
N
1952 1052 M
1964 1052 D
S
N
721 1044 M
734 1044 D
S
N
746 1044 M
758 1044 D
S
N
770 1044 M
782 1044 D
S
N
794 1044 M
806 1044 D
S
showpage
%%Trailer
%%Pages: 1
%%BoundingBox: 99 205 482 566
