%!PS-Adobe-3.0 EPSF-3.0
%%BoundingBox: (atend)
%%LanguageLevel: 2
%%Creator: Grace-5.1.22
%%CreationDate: Mon Dec 19 07:31:03 2011
%%DocumentData: Clean8Bit
%%Orientation: Portrait
%%Title: dsdeta_t_perc_err_band.agr
%%For: laura
%%DocumentNeededResources: (atend)
%%EndComments
%%BeginProlog
/m {moveto} def
/l {lineto} def
/s {stroke} def
/n {newpath} def
/c {closepath} def
/RL {rlineto} def
/SLW {setlinewidth} def
/GS {gsave} def
/GR {grestore} def
/SC {setcolor} def
/SGRY {setgray} def
/SRGB {setrgbcolor} def
/SD {setdash} def
/SLC {setlinecap} def
/SLJ {setlinejoin} def
/SCS {setcolorspace} def
/FFSF {findfont setfont} def
/CC {concat} def
/PXL {n m 0 0 RL s} def
/Color0 {1.0000 1.0000 1.0000} def
/Color1 {0.0000 0.0000 0.0000} def
/Color2 {1.0000 0.0000 0.0000} def
/Color3 {0.0000 1.0000 0.0000} def
/Color4 {0.0000 0.0000 1.0000} def
/Color5 {1.0000 1.0000 0.0000} def
/Color6 {0.7373 0.5608 0.5608} def
/Color7 {0.8627 0.8627 0.8627} def
/Color8 {0.5804 0.0000 0.8275} def
/Color9 {0.0000 1.0000 1.0000} def
/Color10 {1.0000 0.0000 1.0000} def
/Color11 {1.0000 0.6471 0.0000} def
/Color12 {0.4471 0.1294 0.7373} def
/Color13 {0.4039 0.0275 0.2824} def
/Color14 {0.2510 0.8784 0.8157} def
/Color15 {0.0000 0.5451 0.0000} def
/Color16 {0.7529 0.7529 0.7529} def
/Color17 {0.5059 0.5059 0.5059} def
/Color18 {0.2588 0.2588 0.2588} def
/PTRN {
 /pat_bits exch def 
 <<
  /PaintType 2
  /PatternType 1 /TilingType 1
  /BBox[0 0 16 16]
  /XStep 16 /YStep 16
  /PaintProc {
   pop
   16 16 true [-1 0 0 -1 16 16] pat_bits imagemask
  }
 >>
 [0.0016 0 0 0.0016 0 0]
 makepattern
} def
/Pattern0 {<0000000000000000000000000000000000000000000000000000000000000000> PTRN} bind def
/Pattern1 {<ffffffffffffffffffffffffffffffffffffffffffffffffffffffffffffffff> PTRN} bind def
/Pattern2 {<eeeeffffbbbbffffeeeeffffbbbbffffeeeeffffbbbbffffeeeeffffbbbbffff> PTRN} bind def
/Pattern3 {<eeeebbbbeeeebbbbeeeebbbbeeeebbbbeeeebbbbeeeebbbbeeeebbbbeeeebbbb> PTRN} bind def
/Pattern4 {<5555aaaa5555aaaa5555aaaa5555aaaa5555aaaa5555aaaa5555aaaa5555aaaa> PTRN} bind def
/Pattern5 {<1111444411114444111144441111444411114444111144441111444411114444> PTRN} bind def
/Pattern6 {<1111000044440000111100004444000011110000444400001111000044440000> PTRN} bind def
/Pattern7 {<1010000000000000010100000000000010100000000000000101000000000000> PTRN} bind def
/Pattern8 {<0000000000000000000000000000000000000000000000000000000000000000> PTRN} bind def
/Pattern9 {<1e1e0f0f8787c3c3e1e1f0f078783c3c1e1e0f0f8787c3c3e1e1f0f078783c3c> PTRN} bind def
/Pattern10 {<7878f0f0e1e1c3c387870f0f1e1e3c3c7878f0f0e1e1c3c387870f0f1e1e3c3c> PTRN} bind def
/Pattern11 {<3333333333333333333333333333333333333333333333333333333333333333> PTRN} bind def
/Pattern12 {<ffffffff00000000ffffffff00000000ffffffff00000000ffffffff00000000> PTRN} bind def
/Pattern13 {<8181424224241818181824244242818181814242242418181818242442428181> PTRN} bind def
/Pattern14 {<8080404020201010080804040202010180804040202010100808040402020101> PTRN} bind def
/Pattern15 {<0101020204040808101020204040808001010202040408081010202040408080> PTRN} bind def
/Pattern16 {<2222222222222222222222222222222222222222222222222222222222222222> PTRN} bind def
/Pattern17 {<0000ffff000000000000ffff000000000000ffff000000000000ffff00000000> PTRN} bind def
/Pattern18 {<2222ffff222222222222ffff222222222222ffff222222222222ffff22222222> PTRN} bind def
/Pattern19 {<ffffffff33333333ffffffff33333333ffffffff33333333ffffffff33333333> PTRN} bind def
/Pattern20 {<0f0f0f0f0f0f0f0ff0f0f0f0f0f0f0f00f0f0f0f0f0f0f0ff0f0f0f0f0f0f0f0> PTRN} bind def
/Pattern21 {<ff00ff00ff00ff00ff00ff00ff00ff0000ff00ff00ff00ff00ff00ff00ff00ff> PTRN} bind def
/Pattern22 {<8001800180018001800180018001ffffffff8001800180018001800180018001> PTRN} bind def
/Pattern23 {<c003c003c003c003c003c003ffffffffffffffffc003c003c003c003c003c003> PTRN} bind def
/Pattern24 {<040404040404ffff404040404040ffff040404040404ffff404040404040ffff> PTRN} bind def
/Pattern25 {<180018001800180018001800ffffffff001800180018001800180018ffffffff> PTRN} bind def
/Pattern26 {<1111b8b87c7c3a3a1111a3a3c7c78b8b1111b8b87c7c3a3a1111a3a3c7c78b8b> PTRN} bind def
/Pattern27 {<101010102828c7c70101010182827c7c101010102828c7c70101010182827c7c> PTRN} bind def
/Pattern28 {<1c1c121211112121c1c12121111112121c1c121211112121c1c1212111111212> PTRN} bind def
/Pattern29 {<3e3e414180808080e3e31414080808083e3e414180808080e3e3141408080808> PTRN} bind def
/Pattern30 {<4848888884848383848488884848383848488888848483838484888848483838> PTRN} bind def
/Pattern31 {<03030404080808080c0c12122121c0c003030404080808080c0c12122121c0c0> PTRN} bind def
/ellipsedict 8 dict def
ellipsedict /mtrx matrix put
/EARC {
 ellipsedict begin
  /endangle exch def
  /startangle exch def
  /yrad exch def
  /xrad exch def
  /y exch def
  /x exch def
  /savematrix mtrx currentmatrix def
  x y translate
  xrad yrad scale
  0 0 1 startangle endangle arc
  savematrix setmatrix
 end
} def
/TL {
  /kcomp exch def
  /linewidth exch def
  /offset exch def
  GS
  0 offset rmoveto
  linewidth SLW
  dup stringwidth exch kcomp add exch RL s
  GR
} def
/KINIT
{
 /kvector exch def
 /kid 0 def
} def
/KPROC
{
 pop pop
 kvector kid get
 0 rmoveto
 /kid 1 kid add def
} def
/DefEncoding [
 /.notdef
 /.notdef
 /.notdef
 /.notdef
 /.notdef
 /.notdef
 /.notdef
 /.notdef
 /.notdef
 /.notdef
 /.notdef
 /.notdef
 /.notdef
 /.notdef
 /.notdef
 /.notdef
 /.notdef
 /.notdef
 /.notdef
 /.notdef
 /.notdef
 /.notdef
 /.notdef
 /.notdef
 /.notdef
 /.notdef
 /.notdef
 /.notdef
 /.notdef
 /.notdef
 /.notdef
 /.notdef
 /space
 /exclam
 /quotedbl
 /numbersign
 /dollar
 /percent
 /ampersand
 /quoteright
 /parenleft
 /parenright
 /asterisk
 /plus
 /comma
 /hyphen
 /period
 /slash
 /zero
 /one
 /two
 /three
 /four
 /five
 /six
 /seven
 /eight
 /nine
 /colon
 /semicolon
 /less
 /equal
 /greater
 /question
 /at
 /A
 /B
 /C
 /D
 /E
 /F
 /G
 /H
 /I
 /J
 /K
 /L
 /M
 /N
 /O
 /P
 /Q
 /R
 /S
 /T
 /U
 /V
 /W
 /X
 /Y
 /Z
 /bracketleft
 /backslash
 /bracketright
 /asciicircum
 /underscore
 /grave
 /a
 /b
 /c
 /d
 /e
 /f
 /g
 /h
 /i
 /j
 /k
 /l
 /m
 /n
 /o
 /p
 /q
 /r
 /s
 /t
 /u
 /v
 /w
 /x
 /y
 /z
 /braceleft
 /bar
 /braceright
 /asciitilde
 /.notdef
 /.notdef
 /.notdef
 /.notdef
 /.notdef
 /.notdef
 /.notdef
 /.notdef
 /.notdef
 /.notdef
 /.notdef
 /.notdef
 /.notdef
 /.notdef
 /.notdef
 /.notdef
 /.notdef
 /.notdef
 /.notdef
 /.notdef
 /.notdef
 /.notdef
 /.notdef
 /.notdef
 /.notdef
 /.notdef
 /.notdef
 /.notdef
 /.notdef
 /.notdef
 /.notdef
 /.notdef
 /.notdef
 /space
 /exclamdown
 /cent
 /sterling
 /currency
 /yen
 /brokenbar
 /section
 /dieresis
 /copyright
 /ordfeminine
 /guillemotleft
 /logicalnot
 /hyphen
 /registered
 /macron
 /degree
 /plusminus
 /twosuperior
 /threesuperior
 /acute
 /mu
 /paragraph
 /periodcentered
 /cedilla
 /onesuperior
 /ordmasculine
 /guillemotright
 /onequarter
 /onehalf
 /threequarters
 /questiondown
 /Agrave
 /Aacute
 /Acircumflex
 /Atilde
 /Adieresis
 /Aring
 /AE
 /Ccedilla
 /Egrave
 /Eacute
 /Ecircumflex
 /Edieresis
 /Igrave
 /Iacute
 /Icircumflex
 /Idieresis
 /Eth
 /Ntilde
 /Ograve
 /Oacute
 /Ocircumflex
 /Otilde
 /Odieresis
 /multiply
 /Oslash
 /Ugrave
 /Uacute
 /Ucircumflex
 /Udieresis
 /Yacute
 /Thorn
 /germandbls
 /agrave
 /aacute
 /acircumflex
 /atilde
 /adieresis
 /aring
 /ae
 /ccedilla
 /egrave
 /eacute
 /ecircumflex
 /edieresis
 /igrave
 /iacute
 /icircumflex
 /idieresis
 /eth
 /ntilde
 /ograve
 /oacute
 /ocircumflex
 /otilde
 /odieresis
 /divide
 /oslash
 /ugrave
 /uacute
 /ucircumflex
 /udieresis
 /yacute
 /thorn
 /ydieresis
] def
%%EndProlog
%%BeginSetup
%%EndSetup
612.00 612.00 scale
n
0.0000 0.0000 m
0.0000 1.0000 l
1.2941 1.0000 l
1.2941 0.0000 l
c
[/DeviceRGB] SCS
Color0 SC
fill
[/DeviceRGB] SCS
Color2 SC
[] 0 SD
0.0030 SLW
0 SLC
0 SLJ
n
0.1499 0.4892 m
0.1500 0.4892 l
0.1500 0.4470 l
0.1750 0.4470 l
0.1750 0.4539 l
0.2000 0.4539 l
0.2000 0.4799 l
0.2250 0.4799 l
0.2250 0.4684 l
0.2500 0.4684 l
0.2500 0.4681 l
0.2750 0.4681 l
0.2750 0.4756 l
0.3000 0.4756 l
0.3000 0.4797 l
0.3250 0.4797 l
0.3250 0.4719 l
0.3500 0.4719 l
0.3500 0.4754 l
0.3750 0.4754 l
0.3750 0.4841 l
0.4000 0.4841 l
0.4000 0.4798 l
0.4250 0.4798 l
0.4250 0.4757 l
0.4500 0.4757 l
0.4500 0.4782 l
0.4750 0.4782 l
0.4750 0.4747 l
0.5000 0.4747 l
0.5000 0.4806 l
0.5250 0.4806 l
0.5250 0.4829 l
0.5500 0.4829 l
0.5500 0.4782 l
0.5750 0.4782 l
0.5750 0.4770 l
0.6000 0.4770 l
0.6000 0.4799 l
0.6250 0.4799 l
0.6250 0.4840 l
0.6500 0.4840 l
0.6500 0.4847 l
0.6750 0.4847 l
0.6750 0.4806 l
0.7000 0.4806 l
0.7000 0.4764 l
0.7250 0.4764 l
0.7250 0.4867 l
0.7500 0.4867 l
0.7500 0.4805 l
0.7750 0.4805 l
0.7750 0.4770 l
0.8000 0.4770 l
0.8000 0.4761 l
0.8250 0.4761 l
0.8250 0.4828 l
0.8500 0.4828 l
0.8500 0.4838 l
0.8750 0.4838 l
0.8750 0.4811 l
0.9000 0.4811 l
0.9000 0.4642 l
0.9250 0.4642 l
0.9250 0.4835 l
0.9500 0.4835 l
0.9500 0.4716 l
0.9750 0.4716 l
0.9750 0.4870 l
1.0000 0.4870 l
1.0000 0.4718 l
1.0250 0.4718 l
1.0250 0.4690 l
1.0500 0.4690 l
1.0500 0.4814 l
1.0750 0.4814 l
1.0750 0.4681 l
1.1000 0.4681 l
1.1000 0.4905 l
1.1250 0.4905 l
1.1250 0.4008 l
1.1500 0.4008 l
1.1500 0.5534 l
1.1501 0.5534 l
s
n
0.1499 0.5666 m
0.1500 0.5666 l
0.1500 0.4907 l
0.1750 0.4907 l
0.1750 0.5313 l
0.2000 0.5313 l
0.2000 0.5264 l
0.2250 0.5264 l
0.2250 0.5411 l
0.2500 0.5411 l
0.2500 0.5297 l
0.2750 0.5297 l
0.2750 0.5074 l
0.3000 0.5074 l
0.3000 0.5221 l
0.3250 0.5221 l
0.3250 0.5164 l
0.3500 0.5164 l
0.3500 0.5103 l
0.3750 0.5103 l
0.3750 0.5174 l
0.4000 0.5174 l
0.4000 0.5223 l
0.4250 0.5223 l
0.4250 0.5167 l
0.4500 0.5167 l
0.4500 0.5079 l
0.4750 0.5079 l
0.4750 0.5077 l
0.5000 0.5077 l
0.5000 0.4921 l
0.5250 0.4921 l
0.5250 0.5195 l
0.5500 0.5195 l
0.5500 0.5098 l
0.5750 0.5098 l
0.5750 0.5029 l
0.6000 0.5029 l
0.6000 0.5094 l
0.6250 0.5094 l
0.6250 0.5002 l
0.6500 0.5002 l
0.6500 0.5153 l
0.6750 0.5153 l
0.6750 0.4881 l
0.7000 0.4881 l
0.7000 0.5069 l
0.7250 0.5069 l
0.7250 0.5185 l
0.7500 0.5185 l
0.7500 0.5080 l
0.7750 0.5080 l
0.7750 0.4995 l
0.8000 0.4995 l
0.8000 0.5114 l
0.8250 0.5114 l
0.8250 0.5203 l
0.8500 0.5203 l
0.8500 0.5275 l
0.8750 0.5275 l
0.8750 0.5063 l
0.9000 0.5063 l
0.9000 0.5248 l
0.9250 0.5248 l
0.9250 0.5231 l
0.9500 0.5231 l
0.9500 0.5221 l
0.9750 0.5221 l
0.9750 0.5538 l
1.0000 0.5538 l
1.0000 0.4957 l
1.0250 0.4957 l
1.0250 0.5268 l
1.0500 0.5268 l
1.0500 0.5267 l
1.0750 0.5267 l
1.0750 0.5251 l
1.1000 0.5251 l
1.1000 0.5668 l
1.1250 0.5668 l
1.1250 0.5000 l
1.1500 0.5000 l
1.1500 0.5000 l
1.1501 0.5000 l
s
[/DeviceRGB] SCS
Color4 SC
n
0.1499 0.3324 m
0.1500 0.3324 l
0.1500 0.3479 l
0.1750 0.3479 l
0.1750 0.3609 l
0.2000 0.3609 l
0.2000 0.4307 l
0.2250 0.4307 l
0.2250 0.3856 l
0.2500 0.3856 l
0.2500 0.3825 l
0.2750 0.3825 l
0.2750 0.4373 l
0.3000 0.4373 l
0.3000 0.4320 l
0.3250 0.4320 l
0.3250 0.4381 l
0.3500 0.4381 l
0.3500 0.4390 l
0.3750 0.4390 l
0.3750 0.4505 l
0.4000 0.4505 l
0.4000 0.4444 l
0.4250 0.4444 l
0.4250 0.4458 l
0.4500 0.4458 l
0.4500 0.4442 l
0.4750 0.4442 l
0.4750 0.4461 l
0.5000 0.4461 l
0.5000 0.4544 l
0.5250 0.4544 l
0.5250 0.4542 l
0.5500 0.4542 l
0.5500 0.4513 l
0.5750 0.4513 l
0.5750 0.4483 l
0.6000 0.4483 l
0.6000 0.4565 l
0.6250 0.4565 l
0.6250 0.4563 l
0.6500 0.4563 l
0.6500 0.4466 l
0.6750 0.4466 l
0.6750 0.4555 l
0.7000 0.4555 l
0.7000 0.4399 l
0.7250 0.4399 l
0.7250 0.4601 l
0.7500 0.4601 l
0.7500 0.4535 l
0.7750 0.4535 l
0.7750 0.4466 l
0.8000 0.4466 l
0.8000 0.4367 l
0.8250 0.4367 l
0.8250 0.4435 l
0.8500 0.4435 l
0.8500 0.4604 l
0.8750 0.4604 l
0.8750 0.4475 l
0.9000 0.4475 l
0.9000 0.3906 l
0.9250 0.3906 l
0.9250 0.4512 l
0.9500 0.4512 l
0.9500 0.4301 l
0.9750 0.4301 l
0.9750 0.4298 l
1.0000 0.4298 l
1.0000 0.4240 l
1.0250 0.4240 l
1.0250 0.4105 l
1.0500 0.4105 l
1.0500 0.4354 l
1.0750 0.4354 l
1.0750 0.4055 l
1.1000 0.4055 l
1.1000 0.3457 l
1.1250 0.3457 l
1.1250 0.2945 l
1.1500 0.2945 l
1.1500 0.1499 l
s
n
0.1499 0.7342 m
0.1500 0.7342 l
0.1500 0.5903 l
0.1750 0.5903 l
0.1750 0.6264 l
0.2000 0.6264 l
0.2000 0.5850 l
0.2250 0.5850 l
0.2250 0.6262 l
0.2500 0.6262 l
0.2500 0.6197 l
0.2750 0.6197 l
0.2750 0.5478 l
0.3000 0.5478 l
0.3000 0.5739 l
0.3250 0.5739 l
0.3250 0.5543 l
0.3500 0.5543 l
0.3500 0.5451 l
0.3750 0.5451 l
0.3750 0.5534 l
0.4000 0.5534 l
0.4000 0.5602 l
0.4250 0.5602 l
0.4250 0.5474 l
0.4500 0.5474 l
0.4500 0.5521 l
0.4750 0.5521 l
0.4750 0.5462 l
0.5000 0.5462 l
0.5000 0.5344 l
0.5250 0.5344 l
0.5250 0.5485 l
0.5500 0.5485 l
0.5500 0.5390 l
0.5750 0.5390 l
0.5750 0.5384 l
0.6000 0.5384 l
0.6000 0.5341 l
0.6250 0.5341 l
0.6250 0.5371 l
0.6500 0.5371 l
0.6500 0.5595 l
0.6750 0.5595 l
0.6750 0.5351 l
0.7000 0.5351 l
0.7000 0.5432 l
0.7250 0.5432 l
0.7250 0.5512 l
0.7500 0.5512 l
0.7500 0.5449 l
0.7750 0.5449 l
0.7750 0.5321 l
0.8000 0.5321 l
0.8000 0.5648 l
0.8250 0.5648 l
0.8250 0.5647 l
0.8500 0.5647 l
0.8500 0.5590 l
0.8750 0.5590 l
0.8750 0.5531 l
0.9000 0.5531 l
0.9000 0.5983 l
0.9250 0.5983 l
0.9250 0.5595 l
0.9500 0.5595 l
0.9500 0.5644 l
0.9750 0.5644 l
0.9750 0.6212 l
1.0000 0.6212 l
1.0000 0.5713 l
1.0250 0.5713 l
1.0250 0.5922 l
1.0500 0.5922 l
1.0500 0.5731 l
1.0750 0.5731 l
1.0750 0.5863 l
1.1000 0.5863 l
1.1000 0.7113 l
1.1250 0.7113 l
1.1250 0.5980 l
1.1500 0.5980 l
1.1500 0.7247 l
1.1501 0.7247 l
s
[/DeviceRGB] SCS
Color1 SC
[] 0 SD
0.0015 SLW
n
0.1500 0.1500 m
1.1500 0.1500 l
s
n
0.1500 0.8500 m
1.1500 0.8500 l
s
[] 0 SD
0.0030 SLW
n
0.2750 0.1500 m
0.2750 0.1600 l
s
n
0.2750 0.8500 m
0.2750 0.8400 l
s
n
0.5250 0.1500 m
0.5250 0.1600 l
s
n
0.5250 0.8500 m
0.5250 0.8400 l
s
n
0.7750 0.1500 m
0.7750 0.1600 l
s
n
0.7750 0.8500 m
0.7750 0.8400 l
s
n
1.0250 0.1500 m
1.0250 0.1600 l
s
n
1.0250 0.8500 m
1.0250 0.8400 l
s
n
0.1500 0.1500 m
0.1500 0.1700 l
s
n
0.1500 0.8500 m
0.1500 0.8300 l
s
n
0.4000 0.1500 m
0.4000 0.1700 l
s
n
0.4000 0.8500 m
0.4000 0.8300 l
s
n
0.6500 0.1500 m
0.6500 0.1700 l
s
n
0.6500 0.8500 m
0.6500 0.8300 l
s
n
0.9000 0.1500 m
0.9000 0.1700 l
s
n
0.9000 0.8500 m
0.9000 0.8300 l
s
n
1.1500 0.1500 m
1.1500 0.1700 l
s
n
1.1500 0.8500 m
1.1500 0.8300 l
s
/Times-Roman findfont
dup length dict begin
 {1 index /FID ne {def} {pop pop} ifelse} forall
 /Encoding DefEncoding def
 currentdict
end
/Font0 exch definefont pop
/Font0 FFSF
0.1363 0.1169 m
GS
[0.0344 0.0000 0.0000 0.0344 0 0] CC
(-4) show
GR
/Font0 FFSF
0.3861 0.1169 m
GS
[0.0344 0.0000 0.0000 0.0344 0 0] CC
(-2) show
GR
/Font0 FFSF
0.6418 0.1169 m
GS
[0.0344 0.0000 0.0000 0.0344 0 0] CC
(0) show
GR
/Font0 FFSF
0.8918 0.1169 m
GS
[0.0344 0.0000 0.0000 0.0344 0 0] CC
(2) show
GR
/Font0 FFSF
1.1420 0.1169 m
GS
[0.0344 0.0000 0.0000 0.0344 0 0] CC
(4) show
GR
/Symbol findfont
/Font12 exch definefont pop
/Font12 FFSF
0.6363 0.0717 m
GS
[0.0344 0.0000 0.0000 0.0344 0 0] CC
(h) show
GR
/Font0 FFSF
0.6571 0.0924 m
GS
[0.0244 0.0000 0.0000 0.0244 0 0] CC
(t) show
GR
[] 0 SD
0.0015 SLW
n
0.1500 0.1500 m
0.1500 0.8500 l
s
n
1.1500 0.1500 m
1.1500 0.8500 l
s
[] 0 SD
0.0030 SLW
n
0.1500 0.1500 m
0.1600 0.1500 l
s
n
1.1500 0.1500 m
1.1400 0.1500 l
s
n
0.1500 0.3833 m
0.1600 0.3833 l
s
n
1.1500 0.3833 m
1.1400 0.3833 l
s
n
0.1500 0.6167 m
0.1600 0.6167 l
s
n
1.1500 0.6167 m
1.1400 0.6167 l
s
n
0.1500 0.8500 m
0.1600 0.8500 l
s
n
1.1500 0.8500 m
1.1400 0.8500 l
s
n
0.1500 0.2667 m
0.1700 0.2667 l
s
n
1.1500 0.2667 m
1.1300 0.2667 l
s
n
0.1500 0.5000 m
0.1700 0.5000 l
s
n
1.1500 0.5000 m
1.1300 0.5000 l
s
n
0.1500 0.7333 m
0.1700 0.7333 l
s
n
1.1500 0.7333 m
1.1300 0.7333 l
s
/Font0 FFSF
0.1235 0.2553 m
GS
[0.0344 0.0000 0.0000 0.0344 0 0] CC
(0) show
GR
/Font0 FFSF
0.1263 0.4884 m
GS
[0.0344 0.0000 0.0000 0.0344 0 0] CC
(1) show
GR
/Font0 FFSF
0.1235 0.7218 m
GS
[0.0344 0.0000 0.0000 0.0344 0 0] CC
(2) show
GR
/Font0 FFSF
0.1057 0.4065 m
GS
[0.0000 0.0344 -0.0344 0.0000 0 0] CC
(\(d) show
GR
/Font12 FFSF
0.1057 0.4351 m
GS
[0.0000 0.0344 -0.0344 0.0000 0 0] CC
(s) show
GR
/Font0 FFSF
0.1057 0.4559 m
GS
[0.0000 0.0344 -0.0344 0.0000 0 0] CC
(/d) show
GR
/Font12 FFSF
0.1057 0.4825 m
GS
[0.0000 0.0344 -0.0344 0.0000 0 0] CC
(h) show
GR
/Font0 FFSF
0.0850 0.5033 m
GS
[0.0000 0.0244 -0.0244 0.0000 0 0] CC
(t) show
GR
/Font0 FFSF
0.1057 0.5100 m
GS
[0.0000 0.0344 -0.0344 0.0000 0 0] CC
(\)/C.V.) show
GR
/Font0 FFSF
1.1892 0.5475 m
GS
[0.0000 0.0280 -0.0280 0.0000 0 0] CC
(LHC HIGGS XS WG 2011) show
GR
n
0.1500 0.1500 m
0.1500 0.8500 l
1.1500 0.8500 l
1.1500 0.1500 l
0.1500 0.1500 l
c
s
n
0.7750 0.8033 m
0.7750 0.7263 l
1.0722 0.7263 l
1.0722 0.8033 l
c
[/DeviceRGB] SCS
Color0 SC
fill
[/DeviceRGB] SCS
Color1 SC
[] 0 SD
0.0015 SLW
n
0.7750 0.8033 m
0.7750 0.7263 l
1.0722 0.7263 l
1.0722 0.8033 l
0.7750 0.8033 l
c
s
/Font0 FFSF
0.8465 0.7702 m
GS
[0.0339 0.0000 0.0000 0.0339 0 0] CC
(error from scale) show
GR
[/DeviceRGB] SCS
Color2 SC
[] 0 SD
0.0030 SLW
n
0.7865 0.7816 m
0.8265 0.7816 l
s
/Font0 FFSF
[/DeviceRGB] SCS
Color1 SC
0.8465 0.7367 m
GS
[0.0339 0.0000 0.0000 0.0339 0 0] CC
(total error) show
GR
[/DeviceRGB] SCS
Color4 SC
n
0.7865 0.7480 m
0.8265 0.7480 l
s
/Font0 FFSF
[/DeviceRGB] SCS
Color1 SC
0.5478 0.2866 m
GS
[0.0353 0.0000 0.0000 0.0353 0 0] CC
(LHC at 7 TeV) show
GR
%%Trailer
%%BoundingBox: 42 38 730 523
%%DocumentNeededResources: font Times-Roman
%%+ font Symbol
%%EOF
