%!PS-Adobe-1.0
%%Creator: Unified Graphics System
%%Pages: (atend)
%%DocumentFonts: Helvetica
%%BoundingBox:   64   76  318  330
%%EndComments
/Sw{setlinewidth}def
/Sg{setgray}def
/Sd{setdash}def
/P {newpath
    moveto
0 0 rlineto
    stroke}def
/M {moveto}def
/D {lineto}def
/N {newpath}def
/S {stroke}def
/T {/Helvetica findfont
    exch
    scalefont
    setfont}def
/R {rotate}def
/W {show}def
/F {fill}def
/X {gsave}def
/Y {grestore}def
%%EndProlog
%%Page: 1 1
0.12000 0.12000 scale
1 setlinecap
1 setlinejoin
8 Sw
0.00 0.00 0.00 setrgbcolor
[] 0 Sd
N
580 1349 M
656 1349 D
S
N
580 1352 M
656 1352 D
S
N
616 1349 M
609 1342 D
605 1334 D
605 1327 D
609 1316 D
616 1309 D
627 1306 D
634 1306 D
645 1309 D
652 1316 D
656 1327 D
656 1334 D
652 1342 D
645 1349 D
S
N
605 1327 M
609 1320 D
616 1313 D
627 1309 D
634 1309 D
645 1313 D
652 1320 D
656 1327 D
S
N
580 1338 M
580 1352 D
S
N
656 1349 M
656 1363 D
S
N
605 1439 M
605 1403 D
609 1392 D
620 1385 D
630 1381 D
641 1381 D
648 1385 D
652 1388 D
656 1396 D
656 1403 D
652 1414 D
641 1421 D
630 1425 D
620 1425 D
612 1421 D
609 1417 D
605 1410 D
S
N
605 1403 M
609 1396 D
620 1388 D
630 1385 D
645 1385 D
652 1388 D
S
N
656 1403 M
652 1410 D
641 1417 D
630 1421 D
616 1421 D
609 1417 D
S
N
609 1417 M
609 1439 D
S
N
566 1518 M
681 1453 D
S
N
580 1579 M
656 1579 D
S
N
580 1583 M
656 1583 D
S
N
616 1579 M
609 1572 D
605 1565 D
605 1558 D
609 1547 D
616 1540 D
627 1536 D
634 1536 D
645 1540 D
652 1547 D
656 1558 D
656 1565 D
652 1572 D
645 1579 D
S
N
605 1558 M
609 1551 D
616 1543 D
627 1540 D
634 1540 D
645 1543 D
652 1551 D
656 1558 D
S
N
580 1569 M
580 1583 D
S
N
656 1579 M
656 1594 D
S
N
605 1619 M
681 1619 D
S
N
605 1623 M
681 1623 D
S
N
616 1623 M
609 1630 D
605 1637 D
605 1644 D
609 1655 D
616 1662 D
627 1666 D
634 1666 D
645 1662 D
652 1655 D
656 1644 D
656 1637 D
652 1630 D
645 1623 D
S
N
605 1644 M
609 1652 D
616 1659 D
627 1662 D
634 1662 D
645 1659 D
652 1652 D
656 1644 D
S
N
605 1608 M
605 1623 D
S
N
681 1608 M
681 1634 D
S
N
634 1703 M
684 1703 D
S
N
634 1706 M
684 1706 D
S
N
634 1689 M
648 1686 D
634 1686 D
634 1722 D
648 1722 D
634 1720 D
S
N
684 1696 M
684 1713 D
S
N
684 1739 M
682 1737 D
680 1739 D
682 1742 D
687 1742 D
692 1739 D
694 1737 D
S
N
634 1763 M
684 1763 D
S
N
634 1766 M
684 1766 D
S
N
658 1766 M
653 1771 D
651 1775 D
651 1780 D
653 1787 D
658 1792 D
665 1795 D
670 1795 D
677 1792 D
682 1787 D
684 1780 D
684 1775 D
682 1771 D
677 1766 D
S
N
651 1780 M
653 1785 D
658 1790 D
665 1792 D
670 1792 D
677 1790 D
682 1785 D
684 1780 D
S
N
634 1756 M
634 1766 D
S
N
634 1814 M
684 1814 D
S
N
634 1816 M
684 1816 D
S
N
658 1816 M
653 1821 D
651 1826 D
651 1831 D
653 1838 D
658 1843 D
665 1845 D
670 1845 D
677 1843 D
682 1838 D
684 1831 D
684 1826 D
682 1821 D
677 1816 D
S
N
651 1831 M
653 1835 D
658 1840 D
665 1843 D
670 1843 D
677 1840 D
682 1835 D
684 1831 D
S
N
634 1807 M
634 1816 D
S
N
566 1929 M
681 1929 D
S
N
566 1933 M
681 1933 D
S
N
566 1929 M
566 1954 D
S
N
681 1929 M
681 1954 D
S
N
584 2001 M
587 1998 D
591 2001 D
587 2005 D
584 2005 D
580 2001 D
580 1994 D
584 1987 D
591 1983 D
656 1983 D
S
N
580 1994 M
584 1990 D
591 1987 D
656 1987 D
S
N
605 1972 M
605 2001 D
S
N
656 1972 M
656 1998 D
S
N
580 2030 M
656 2030 D
S
N
580 2034 M
656 2034 D
S
N
616 2034 M
609 2041 D
605 2048 D
605 2055 D
609 2066 D
616 2073 D
627 2077 D
634 2077 D
645 2073 D
652 2066 D
656 2055 D
656 2048 D
652 2041 D
645 2034 D
S
N
605 2055 M
609 2062 D
616 2070 D
627 2073 D
634 2073 D
645 2070 D
652 2062 D
656 2055 D
S
N
580 2019 M
580 2034 D
S
N
566 2160 M
681 2095 D
S
N
591 2228 M
602 2232 D
580 2232 D
591 2228 D
584 2221 D
580 2210 D
580 2203 D
584 2192 D
591 2185 D
598 2181 D
609 2178 D
627 2178 D
638 2181 D
645 2185 D
652 2192 D
656 2203 D
656 2210 D
652 2221 D
645 2228 D
S
N
580 2203 M
584 2196 D
591 2189 D
598 2185 D
609 2181 D
627 2181 D
638 2185 D
645 2189 D
652 2196 D
656 2203 D
S
N
627 2228 M
656 2228 D
S
N
627 2232 M
656 2232 D
S
N
627 2217 M
627 2243 D
S
N
627 2264 M
627 2308 D
620 2308 D
612 2304 D
609 2300 D
605 2293 D
605 2282 D
609 2271 D
616 2264 D
627 2261 D
634 2261 D
645 2264 D
652 2271 D
656 2282 D
656 2290 D
652 2300 D
645 2308 D
S
N
627 2304 M
616 2304 D
609 2300 D
S
N
605 2282 M
609 2275 D
616 2268 D
627 2264 D
634 2264 D
645 2268 D
652 2275 D
656 2282 D
S
N
580 2329 M
656 2354 D
S
N
580 2333 M
645 2354 D
S
N
580 2380 M
656 2354 D
S
N
580 2322 M
580 2344 D
S
N
580 2365 M
580 2387 D
S
N
566 2423 M
681 2423 D
S
N
566 2426 M
681 2426 D
S
N
566 2401 M
566 2426 D
S
N
681 2401 M
681 2426 D
S
N
1487 757 M
1487 681 D
S
N
1490 757 M
1490 681 D
S
N
1490 746 M
1498 753 D
1505 757 D
1512 757 D
1523 753 D
1530 746 D
1534 735 D
1534 728 D
1530 717 D
1523 710 D
1512 707 D
1505 707 D
1498 710 D
1490 717 D
S
N
1512 757 M
1519 753 D
1526 746 D
1530 735 D
1530 728 D
1526 717 D
1519 710 D
1512 707 D
S
N
1476 757 M
1490 757 D
S
N
1476 681 M
1501 681 D
S
N
1571 728 M
1571 678 D
S
N
1573 728 M
1573 678 D
S
N
1556 728 M
1554 714 D
1554 728 D
1590 728 D
1590 714 D
1588 728 D
S
N
1564 678 M
1580 678 D
S
N
1607 678 M
1605 680 D
1607 683 D
1609 680 D
1609 675 D
1607 671 D
1605 668 D
S
N
1631 728 M
1631 678 D
S
N
1633 728 M
1633 678 D
S
N
1633 704 M
1638 709 D
1643 711 D
1648 711 D
1655 709 D
1660 704 D
1662 697 D
1662 692 D
1660 685 D
1655 680 D
1648 678 D
1643 678 D
1638 680 D
1633 685 D
S
N
1648 711 M
1653 709 D
1657 704 D
1660 697 D
1660 692 D
1657 685 D
1653 680 D
1648 678 D
S
N
1624 728 M
1633 728 D
S
N
1681 728 M
1681 678 D
S
N
1684 728 M
1684 678 D
S
N
1684 704 M
1689 709 D
1693 711 D
1698 711 D
1705 709 D
1710 704 D
1713 697 D
1713 692 D
1710 685 D
1705 680 D
1698 678 D
1693 678 D
1689 680 D
1684 685 D
S
N
1698 711 M
1703 709 D
1708 704 D
1710 697 D
1710 692 D
1708 685 D
1703 680 D
1698 678 D
S
N
1674 728 M
1684 728 D
S
N
1797 797 M
1797 681 D
S
N
1800 797 M
1800 681 D
S
N
1797 797 M
1822 797 D
S
N
1797 681 M
1822 681 D
S
N
1894 771 M
1898 761 D
1898 782 D
1894 771 D
1887 779 D
1876 782 D
1869 782 D
1858 779 D
1851 771 D
1847 764 D
1844 753 D
1844 735 D
1847 725 D
1851 717 D
1858 710 D
1869 707 D
1876 707 D
1887 710 D
1894 717 D
S
N
1869 782 M
1862 779 D
1854 771 D
1851 764 D
1847 753 D
1847 735 D
1851 725 D
1854 717 D
1862 710 D
1869 707 D
S
N
1894 735 M
1894 707 D
S
N
1898 735 M
1898 707 D
S
N
1883 735 M
1908 735 D
S
N
1930 735 M
1973 735 D
1973 743 D
1970 750 D
1966 753 D
1959 757 D
1948 757 D
1937 753 D
1930 746 D
1926 735 D
1926 728 D
1930 717 D
1937 710 D
1948 707 D
1955 707 D
1966 710 D
1973 717 D
S
N
1970 735 M
1970 746 D
1966 753 D
S
N
1948 757 M
1941 753 D
1934 746 D
1930 735 D
1930 728 D
1934 717 D
1941 710 D
1948 707 D
S
N
1995 782 M
2020 707 D
S
N
1999 782 M
2020 717 D
S
N
2045 782 M
2020 707 D
S
N
1988 782 M
2009 782 D
S
N
2031 782 M
2053 782 D
S
N
2089 797 M
2089 681 D
S
N
2092 797 M
2092 681 D
S
N
2067 797 M
2092 797 D
S
N
2067 681 M
2092 681 D
S
N
2330 2630 M
2330 2555 D
S
N
2334 2630 M
2334 2555 D
S
N
2334 2594 M
2341 2601 D
2348 2605 D
2355 2605 D
2366 2601 D
2373 2594 D
2377 2583 D
2377 2576 D
2373 2565 D
2366 2558 D
2355 2555 D
2348 2555 D
2341 2558 D
2334 2565 D
S
N
2355 2605 M
2363 2601 D
2370 2594 D
2373 2583 D
2373 2576 D
2370 2565 D
2363 2558 D
2355 2555 D
S
N
2319 2630 M
2334 2630 D
S
N
2399 2645 M
2406 2637 D
2413 2627 D
2420 2612 D
2424 2594 D
2424 2580 D
2420 2562 D
2413 2547 D
2406 2536 D
2399 2529 D
S
N
2406 2637 M
2413 2623 D
2417 2612 D
2420 2594 D
2420 2580 D
2417 2562 D
2413 2551 D
2406 2536 D
S
N
993 2722 M
993 992 D
S
N
993 992 M
2550 992 D
S
N
2550 992 M
2550 2722 D
S
N
2550 2722 M
993 2722 D
S
N
993 992 M
993 1044 D
S
N
1071 1009 M
1071 992 D
S
N
1149 992 M
1149 1009 D
S
N
1227 1009 M
1227 992 D
S
N
1304 992 M
1304 1009 D
S
N
1382 1044 M
1382 992 D
S
N
1460 992 M
1460 1009 D
S
N
1538 1009 M
1538 992 D
S
N
1616 992 M
1616 1009 D
S
N
1694 1009 M
1694 992 D
S
N
1772 992 M
1772 1044 D
S
N
1849 1009 M
1849 992 D
S
N
1927 992 M
1927 1009 D
S
N
2005 1009 M
2005 992 D
S
N
2083 992 M
2083 1009 D
S
N
2161 1044 M
2161 992 D
S
N
2239 992 M
2239 1009 D
S
N
2316 1009 M
2316 992 D
S
N
2394 992 M
2394 1009 D
S
N
2472 1009 M
2472 992 D
S
N
2550 992 M
2550 1044 D
S
N
990 935 M
981 932 D
976 923 D
973 909 D
973 900 D
976 886 D
981 877 D
990 874 D
996 874 D
1005 877 D
1010 886 D
1013 900 D
1013 909 D
1010 923 D
1005 932 D
996 935 D
990 935 D
S
N
990 935 M
984 932 D
981 929 D
979 923 D
976 909 D
976 900 D
979 886 D
981 880 D
984 877 D
990 874 D
S
N
996 874 M
1002 877 D
1005 880 D
1007 886 D
1010 900 D
1010 909 D
1007 923 D
1005 929 D
1002 932 D
996 935 D
S
N
1313 923 M
1319 926 D
1327 935 D
1327 874 D
S
N
1325 932 M
1325 874 D
S
N
1313 874 M
1339 874 D
S
N
1379 935 M
1371 932 D
1365 923 D
1362 909 D
1362 900 D
1365 886 D
1371 877 D
1379 874 D
1385 874 D
1394 877 D
1400 886 D
1402 900 D
1402 909 D
1400 923 D
1394 932 D
1385 935 D
1379 935 D
S
N
1379 935 M
1374 932 D
1371 929 D
1368 923 D
1365 909 D
1365 900 D
1368 886 D
1371 880 D
1374 877 D
1379 874 D
S
N
1385 874 M
1391 877 D
1394 880 D
1397 886 D
1400 900 D
1400 909 D
1397 923 D
1394 929 D
1391 932 D
1385 935 D
S
N
1437 935 M
1428 932 D
1423 923 D
1420 909 D
1420 900 D
1423 886 D
1428 877 D
1437 874 D
1443 874 D
1451 877 D
1457 886 D
1460 900 D
1460 909 D
1457 923 D
1451 932 D
1443 935 D
1437 935 D
S
N
1437 935 M
1431 932 D
1428 929 D
1425 923 D
1423 909 D
1423 900 D
1425 886 D
1428 880 D
1431 877 D
1437 874 D
S
N
1443 874 M
1449 877 D
1451 880 D
1454 886 D
1457 900 D
1457 909 D
1454 923 D
1451 929 D
1449 932 D
1443 935 D
S
N
1697 923 M
1699 920 D
1697 918 D
1694 920 D
1694 923 D
1697 929 D
1699 932 D
1708 935 D
1720 935 D
1728 932 D
1731 929 D
1734 923 D
1734 918 D
1731 912 D
1722 906 D
1708 900 D
1702 897 D
1697 892 D
1694 883 D
1694 874 D
S
N
1720 935 M
1725 932 D
1728 929 D
1731 923 D
1731 918 D
1728 912 D
1720 906 D
1708 900 D
S
N
1694 880 M
1697 883 D
1702 883 D
1717 877 D
1725 877 D
1731 880 D
1734 883 D
S
N
1702 883 M
1717 874 D
1728 874 D
1731 877 D
1734 883 D
1734 889 D
S
N
1769 935 M
1760 932 D
1754 923 D
1751 909 D
1751 900 D
1754 886 D
1760 877 D
1769 874 D
1774 874 D
1783 877 D
1789 886 D
1792 900 D
1792 909 D
1789 923 D
1783 932 D
1774 935 D
1769 935 D
S
N
1769 935 M
1763 932 D
1760 929 D
1757 923 D
1754 909 D
1754 900 D
1757 886 D
1760 880 D
1763 877 D
1769 874 D
S
N
1774 874 M
1780 877 D
1783 880 D
1786 886 D
1789 900 D
1789 909 D
1786 923 D
1783 929 D
1780 932 D
1774 935 D
S
N
1826 935 M
1818 932 D
1812 923 D
1809 909 D
1809 900 D
1812 886 D
1818 877 D
1826 874 D
1832 874 D
1841 877 D
1846 886 D
1849 900 D
1849 909 D
1846 923 D
1841 932 D
1832 935 D
1826 935 D
S
N
1826 935 M
1821 932 D
1818 929 D
1815 923 D
1812 909 D
1812 900 D
1815 886 D
1818 880 D
1821 877 D
1826 874 D
S
N
1832 874 M
1838 877 D
1841 880 D
1844 886 D
1846 900 D
1846 909 D
1844 923 D
1841 929 D
1838 932 D
1832 935 D
S
N
2086 923 M
2089 920 D
2086 918 D
2083 920 D
2083 923 D
2086 929 D
2089 932 D
2097 935 D
2109 935 D
2118 932 D
2120 926 D
2120 918 D
2118 912 D
2109 909 D
2100 909 D
S
N
2109 935 M
2115 932 D
2118 926 D
2118 918 D
2115 912 D
2109 909 D
S
N
2109 909 M
2115 906 D
2120 900 D
2123 895 D
2123 886 D
2120 880 D
2118 877 D
2109 874 D
2097 874 D
2089 877 D
2086 880 D
2083 886 D
2083 889 D
2086 892 D
2089 889 D
2086 886 D
S
N
2118 903 M
2120 895 D
2120 886 D
2118 880 D
2115 877 D
2109 874 D
S
N
2158 935 M
2149 932 D
2143 923 D
2141 909 D
2141 900 D
2143 886 D
2149 877 D
2158 874 D
2164 874 D
2172 877 D
2178 886 D
2181 900 D
2181 909 D
2178 923 D
2172 932 D
2164 935 D
2158 935 D
S
N
2158 935 M
2152 932 D
2149 929 D
2146 923 D
2143 909 D
2143 900 D
2146 886 D
2149 880 D
2152 877 D
2158 874 D
S
N
2164 874 M
2169 877 D
2172 880 D
2175 886 D
2178 900 D
2178 909 D
2175 923 D
2172 929 D
2169 932 D
2164 935 D
S
N
2216 935 M
2207 932 D
2201 923 D
2198 909 D
2198 900 D
2201 886 D
2207 877 D
2216 874 D
2221 874 D
2230 877 D
2236 886 D
2239 900 D
2239 909 D
2236 923 D
2230 932 D
2221 935 D
2216 935 D
S
N
2216 935 M
2210 932 D
2207 929 D
2204 923 D
2201 909 D
2201 900 D
2204 886 D
2207 880 D
2210 877 D
2216 874 D
S
N
2221 874 M
2227 877 D
2230 880 D
2233 886 D
2236 900 D
2236 909 D
2233 923 D
2230 929 D
2227 932 D
2221 935 D
S
N
2498 929 M
2498 874 D
S
N
2501 935 M
2501 874 D
S
N
2501 935 M
2469 892 D
2515 892 D
S
N
2489 874 M
2510 874 D
S
N
2547 935 M
2538 932 D
2533 923 D
2530 909 D
2530 900 D
2533 886 D
2538 877 D
2547 874 D
2553 874 D
2562 877 D
2567 886 D
2570 900 D
2570 909 D
2567 923 D
2562 932 D
2553 935 D
2547 935 D
S
N
2547 935 M
2541 932 D
2538 929 D
2536 923 D
2533 909 D
2533 900 D
2536 886 D
2538 880 D
2541 877 D
2547 874 D
S
N
2553 874 M
2559 877 D
2562 880 D
2564 886 D
2567 900 D
2567 909 D
2564 923 D
2562 929 D
2559 932 D
2553 935 D
S
N
2605 935 M
2596 932 D
2590 923 D
2587 909 D
2587 900 D
2590 886 D
2596 877 D
2605 874 D
2611 874 D
2619 877 D
2625 886 D
2628 900 D
2628 909 D
2625 923 D
2619 932 D
2611 935 D
2605 935 D
S
N
2605 935 M
2599 932 D
2596 929 D
2593 923 D
2590 909 D
2590 900 D
2593 886 D
2596 880 D
2599 877 D
2605 874 D
S
N
2611 874 M
2616 877 D
2619 880 D
2622 886 D
2625 900 D
2625 909 D
2622 923 D
2619 929 D
2616 932 D
2611 935 D
S
N
993 2670 M
993 2722 D
S
N
1071 2722 M
1071 2705 D
S
N
1149 2705 M
1149 2722 D
S
N
1227 2722 M
1227 2705 D
S
N
1304 2705 M
1304 2722 D
S
N
1382 2722 M
1382 2670 D
S
N
1460 2705 M
1460 2722 D
S
N
1538 2722 M
1538 2705 D
S
N
1616 2705 M
1616 2722 D
S
N
1694 2722 M
1694 2705 D
S
N
1772 2670 M
1772 2722 D
S
N
1849 2722 M
1849 2705 D
S
N
1927 2705 M
1927 2722 D
S
N
2005 2722 M
2005 2705 D
S
N
2083 2705 M
2083 2722 D
S
N
2161 2722 M
2161 2670 D
S
N
2239 2705 M
2239 2722 D
S
N
2316 2722 M
2316 2705 D
S
N
2394 2705 M
2394 2722 D
S
N
2472 2722 M
2472 2705 D
S
N
2550 2670 M
2550 2722 D
S
N
993 992 M
993 2722 D
S
N
1010 1185 M
993 1185 D
S
N
993 1298 M
1010 1298 D
S
N
1010 1378 M
993 1378 D
S
N
993 1440 M
1010 1440 D
S
N
1010 1491 M
993 1491 D
S
N
993 1534 M
1010 1534 D
S
N
1010 1571 M
993 1571 D
S
N
993 1604 M
1010 1604 D
S
N
1045 1633 M
993 1633 D
S
N
993 1826 M
1010 1826 D
S
N
1010 1939 M
993 1939 D
S
N
993 2019 M
1010 2019 D
S
N
1010 2081 M
993 2081 D
S
N
993 2132 M
1010 2132 D
S
N
1010 2175 M
993 2175 D
S
N
993 2212 M
1010 2212 D
S
N
1010 2245 M
993 2245 D
S
N
993 2274 M
1045 2274 D
S
N
1010 2467 M
993 2467 D
S
N
993 2580 M
1010 2580 D
S
N
1010 2660 M
993 2660 D
S
N
682 1006 M
687 1009 D
696 1018 D
696 957 D
S
N
693 1015 M
693 957 D
S
N
682 957 M
708 957 D
S
N
748 1018 M
739 1015 D
734 1006 D
731 992 D
731 983 D
734 969 D
739 960 D
748 957 D
754 957 D
762 960 D
768 969 D
771 983 D
771 992 D
768 1006 D
762 1015 D
754 1018 D
748 1018 D
S
N
748 1018 M
742 1015 D
739 1012 D
736 1006 D
734 992 D
734 983 D
736 969 D
739 963 D
742 960 D
748 957 D
S
N
754 957 M
759 960 D
762 963 D
765 969 D
768 983 D
768 992 D
765 1006 D
762 1012 D
759 1015 D
754 1018 D
S
N
791 1018 M
843 1018 D
S
N
872 1041 M
878 1044 D
886 1053 D
886 992 D
S
N
883 1050 M
883 992 D
S
N
872 992 M
898 992 D
S
N
757 1647 M
762 1650 D
771 1659 D
771 1598 D
S
N
768 1656 M
768 1598 D
S
N
757 1598 M
783 1598 D
S
N
823 1659 M
814 1656 D
808 1647 D
806 1633 D
806 1624 D
808 1610 D
814 1601 D
823 1598 D
829 1598 D
837 1601 D
843 1610 D
846 1624 D
846 1633 D
843 1647 D
837 1656 D
829 1659 D
823 1659 D
S
N
823 1659 M
817 1656 D
814 1653 D
811 1647 D
808 1633 D
808 1624 D
811 1610 D
814 1604 D
817 1601 D
823 1598 D
S
N
829 1598 M
834 1601 D
837 1604 D
840 1610 D
843 1624 D
843 1633 D
840 1647 D
837 1653 D
834 1656 D
829 1659 D
S
N
881 1694 M
872 1691 D
866 1682 D
863 1668 D
863 1659 D
866 1645 D
872 1636 D
881 1633 D
886 1633 D
895 1636 D
901 1645 D
904 1659 D
904 1668 D
901 1682 D
895 1691 D
886 1694 D
881 1694 D
S
N
881 1694 M
875 1691 D
872 1688 D
869 1682 D
866 1668 D
866 1659 D
869 1645 D
872 1639 D
875 1636 D
881 1633 D
S
N
886 1633 M
892 1636 D
895 1639 D
898 1645 D
901 1659 D
901 1668 D
898 1682 D
895 1688 D
892 1691 D
886 1694 D
S
N
757 2288 M
762 2291 D
771 2300 D
771 2239 D
S
N
768 2297 M
768 2239 D
S
N
757 2239 M
783 2239 D
S
N
823 2300 M
814 2297 D
808 2288 D
806 2274 D
806 2265 D
808 2251 D
814 2242 D
823 2239 D
829 2239 D
837 2242 D
843 2251 D
846 2265 D
846 2274 D
843 2288 D
837 2297 D
829 2300 D
823 2300 D
S
N
823 2300 M
817 2297 D
814 2294 D
811 2288 D
808 2274 D
808 2265 D
811 2251 D
814 2245 D
817 2242 D
823 2239 D
S
N
829 2239 M
834 2242 D
837 2245 D
840 2251 D
843 2265 D
843 2274 D
840 2288 D
837 2294 D
834 2297 D
829 2300 D
S
N
872 2323 M
878 2326 D
886 2335 D
886 2274 D
S
N
883 2332 M
883 2274 D
S
N
872 2274 M
898 2274 D
S
N
2550 992 M
2550 2722 D
S
N
2550 1185 M
2533 1185 D
S
N
2533 1298 M
2550 1298 D
S
N
2550 1378 M
2533 1378 D
S
N
2533 1440 M
2550 1440 D
S
N
2550 1491 M
2533 1491 D
S
N
2533 1534 M
2550 1534 D
S
N
2550 1571 M
2533 1571 D
S
N
2533 1604 M
2550 1604 D
S
N
2550 1633 M
2498 1633 D
S
N
2533 1826 M
2550 1826 D
S
N
2550 1939 M
2533 1939 D
S
N
2533 2019 M
2550 2019 D
S
N
2550 2081 M
2533 2081 D
S
N
2533 2132 M
2550 2132 D
S
N
2550 2175 M
2533 2175 D
S
N
2533 2212 M
2550 2212 D
S
N
2550 2245 M
2533 2245 D
S
N
2498 2274 M
2550 2274 D
S
N
2550 2467 M
2533 2467 D
S
N
2533 2580 M
2550 2580 D
S
N
2550 2660 M
2533 2660 D
S
1.00 0.00 0.00 setrgbcolor
993 1919 P
1012 1919 P
1051 2158 P
1090 2267 P
1129 2376 P
1168 2494 P
1207 2505 P
1246 2482 P
1285 2450 P
1324 2422 P
1363 2382 P
1402 2342 P
1441 2311 P
1480 2276 P
1518 2240 P
1557 2205 P
1596 2168 P
1635 2138 P
1674 2108 P
1713 2077 P
1752 2042 P
1791 2016 P
1830 1974 P
1869 1947 P
1908 1921 P
1947 1895 P
1986 1869 P
2025 1835 P
2063 1805 P
2102 1777 P
2141 1744 P
2180 1711 P
2219 1708 P
2258 1674 P
2297 1646 P
2336 1626 P
2375 1566 P
2414 1571 P
2453 1532 P
2492 1482 P
2531 1483 P
N
993 1919 M
1032 1919 D
1032 2158 D
1071 2158 D
1071 2267 D
1110 2267 D
1110 2376 D
1149 2376 D
1149 2494 D
1188 2494 D
1188 2505 D
1227 2505 D
1227 2482 D
1265 2482 D
1265 2450 D
1304 2450 D
1304 2422 D
1343 2422 D
1343 2382 D
1382 2382 D
1382 2342 D
1421 2342 D
1421 2311 D
1460 2311 D
1460 2276 D
1499 2276 D
1499 2240 D
1538 2240 D
1538 2205 D
1577 2205 D
1577 2168 D
1616 2168 D
1616 2138 D
1655 2138 D
1655 2108 D
1694 2108 D
1694 2077 D
1733 2077 D
1733 2042 D
1772 2042 D
1772 2016 D
1810 2016 D
1810 1974 D
1849 1974 D
1849 1947 D
1888 1947 D
1888 1921 D
1927 1921 D
1927 1895 D
1966 1895 D
1966 1869 D
2005 1869 D
2005 1835 D
2044 1835 D
2044 1805 D
2083 1805 D
2083 1777 D
2122 1777 D
2122 1744 D
2161 1744 D
2161 1711 D
2200 1711 D
2200 1708 D
2239 1708 D
2239 1674 D
2278 1674 D
2278 1646 D
2316 1646 D
2316 1626 D
2355 1626 D
2355 1566 D
2394 1566 D
2394 1571 D
2433 1571 D
2433 1532 D
2472 1532 D
2472 1482 D
2511 1482 D
2511 1483 D
2550 1483 D
S
0.00 0.00 1.00 setrgbcolor
993 1754 P
1012 1754 P
1051 1995 P
1090 2100 P
1129 2212 P
1168 2316 P
1207 2327 P
1246 2309 P
1285 2277 P
1324 2246 P
1363 2210 P
1402 2177 P
1441 2143 P
1480 2111 P
1518 2077 P
1557 2046 P
1596 2011 P
1635 1981 P
1674 1949 P
1713 1920 P
1752 1891 P
1791 1859 P
1830 1832 P
1869 1800 P
1908 1773 P
1947 1742 P
1986 1719 P
2025 1683 P
2063 1659 P
2102 1634 P
2141 1604 P
2180 1581 P
2219 1549 P
2258 1523 P
2297 1494 P
2336 1470 P
2375 1442 P
2414 1418 P
2453 1383 P
2492 1363 P
2531 1340 P
[8 30] 0 Sd
N
993 1754 M
1032 1754 D
1032 1995 D
1071 1995 D
1071 2100 D
1110 2100 D
1110 2212 D
1149 2212 D
1149 2316 D
1188 2316 D
1188 2327 D
1227 2327 D
1227 2309 D
1265 2309 D
1265 2277 D
1304 2277 D
1304 2246 D
1343 2246 D
1343 2210 D
1382 2210 D
1382 2177 D
1421 2177 D
1421 2143 D
1460 2143 D
1460 2111 D
1499 2111 D
1499 2077 D
1538 2077 D
1538 2046 D
1577 2046 D
1577 2011 D
1616 2011 D
1616 1981 D
1655 1981 D
1655 1949 D
1694 1949 D
1694 1920 D
1733 1920 D
1733 1891 D
1772 1891 D
1772 1859 D
1810 1859 D
1810 1832 D
1849 1832 D
1849 1800 D
1888 1800 D
1888 1773 D
1927 1773 D
1927 1742 D
1966 1742 D
1966 1719 D
2005 1719 D
2005 1683 D
2044 1683 D
2044 1659 D
2083 1659 D
2083 1634 D
2122 1634 D
2122 1604 D
2161 1604 D
2161 1581 D
2200 1581 D
2200 1549 D
2239 1549 D
2239 1523 D
2278 1523 D
2278 1494 D
2316 1494 D
2316 1470 D
2355 1470 D
2355 1442 D
2394 1442 D
2394 1418 D
2433 1418 D
2433 1383 D
2472 1383 D
2472 1363 D
2511 1363 D
2511 1340 D
2550 1340 D
S
0.00 1.00 0.00 setrgbcolor
[] 0 Sd
993 1132 P
1012 1132 P
1051 1423 P
1090 1540 P
1129 1618 P
1168 1664 P
1207 1689 P
1246 1704 P
1285 1698 P
1324 1693 P
1363 1686 P
1402 1665 P
1441 1643 P
1480 1625 P
1518 1596 P
1557 1574 P
1596 1545 P
1635 1519 P
1674 1482 P
1713 1457 P
1752 1421 P
1791 1395 P
1830 1360 P
1869 1334 P
1908 1305 P
1947 1276 P
1986 1232 P
2025 1220 P
2063 1180 P
2102 1145 P
2141 1111 P
2180 1068 P
2219 1008 P
[30 30 8 30] 0 Sd
N
993 1132 M
1032 1132 D
1032 1423 D
1071 1423 D
1071 1540 D
1110 1540 D
1110 1618 D
1149 1618 D
1149 1664 D
1188 1664 D
1188 1689 D
1227 1689 D
1227 1704 D
1265 1704 D
1265 1698 D
1304 1698 D
1304 1693 D
1343 1693 D
1343 1686 D
1382 1686 D
1382 1665 D
1421 1665 D
1421 1643 D
1460 1643 D
1460 1625 D
1499 1625 D
1499 1596 D
1538 1596 D
1538 1574 D
1577 1574 D
1577 1545 D
1616 1545 D
1616 1519 D
1655 1519 D
1655 1482 D
1694 1482 D
1694 1457 D
1733 1457 D
1733 1421 D
1772 1421 D
1772 1395 D
1810 1395 D
1810 1360 D
1849 1360 D
1849 1334 D
1888 1334 D
1888 1305 D
1927 1305 D
1927 1276 D
1966 1276 D
1966 1232 D
2005 1232 D
2005 1220 D
2044 1220 D
2044 1180 D
2083 1180 D
2083 1145 D
2122 1145 D
2122 1111 D
2161 1111 D
2161 1068 D
2200 1068 D
2200 1008 D
2239 1008 D
2239 992 D
S
0.00 1.00 1.00 setrgbcolor
[] 0 Sd
993 1038 P
1012 1038 P
1051 1334 P
1090 1461 P
1129 1533 P
1168 1578 P
1207 1604 P
1246 1616 P
1285 1619 P
1324 1614 P
1363 1600 P
1402 1584 P
1441 1564 P
1480 1538 P
1518 1512 P
1557 1484 P
1596 1452 P
1635 1422 P
1674 1388 P
1713 1353 P
1752 1318 P
1791 1284 P
1830 1251 P
1869 1223 P
1908 1186 P
1947 1156 P
1986 1123 P
2025 1091 P
2063 1062 P
2102 1028 P
2141 998 P
[39] 0 Sd
N
993 1038 M
1032 1038 D
1032 1334 D
1071 1334 D
1071 1461 D
1110 1461 D
1110 1533 D
1149 1533 D
1149 1578 D
1188 1578 D
1188 1604 D
1227 1604 D
1227 1616 D
1265 1616 D
1265 1619 D
1304 1619 D
1304 1614 D
1343 1614 D
1343 1600 D
1382 1600 D
1382 1584 D
1421 1584 D
1421 1564 D
1460 1564 D
1460 1538 D
1499 1538 D
1499 1512 D
1538 1512 D
1538 1484 D
1577 1484 D
1577 1452 D
1616 1452 D
1616 1422 D
1655 1422 D
1655 1388 D
1694 1388 D
1694 1353 D
1733 1353 D
1733 1318 D
1772 1318 D
1772 1284 D
1810 1284 D
1810 1251 D
1849 1251 D
1849 1223 D
1888 1223 D
1888 1186 D
1927 1186 D
1927 1156 D
1966 1156 D
1966 1123 D
2005 1123 D
2005 1091 D
2044 1091 D
2044 1062 D
2083 1062 D
2083 1028 D
2122 1028 D
2122 998 D
2161 998 D
2161 992 D
S
showpage
%%Trailer
%%Pages: 1
%%BoundingBox:
