%!PS-Adobe-2.0 EPSF-2.0
%%BoundingBox:  0 0 567 310
%%Title: /home/shiki/Desktop/MCFM/YR/CUT2/CUT2_CT10_MSTW_LHC.eps: Higgs Cross Section
%%Creator: ROOT Version 5.28/00
%%CreationDate: Tue Nov 22 18:43:46 2011
%%EndComments
%%BeginProlog
80 dict begin
/s {stroke} def /l {lineto} def /m {moveto} def /t {translate} def
/r {rotate} def /rl {roll}  def /R {repeat} def
/d {rlineto} def /rm {rmoveto} def /gr {grestore} def /f {eofill} def
/c {setrgbcolor} def /black {0 setgray} def /sd {setdash} def
/cl {closepath} def /sf {scalefont setfont} def /lw {setlinewidth} def
/box {m dup 0 exch d exch 0 d 0 exch neg d cl} def
/NC{systemdict begin initclip end}def/C{NC box clip newpath}def
/bl {box s} def /bf {box f} def /Y { 0 exch d} def /X { 0 d} def 
/K {{pop pop 0 moveto} exch kshow} bind def
/ita {/ang 15 def gsave [1 0 ang dup sin exch cos div 1 0 0] concat} def 
/mp {newpath /y exch def /x exch def} def
/side {[w .77 mul w .23 mul] .385 w mul sd w 0 l currentpoint t -144 r} def
/mr {mp x y w2 0 360 arc} def /m24 {mr s} def /m20 {mr f} def
/mb {mp x y w2 add m w2 neg 0 d 0 w neg d w 0 d 0 w d cl} def
/mt {mp x y w2 add m w2 neg w neg d w 0 d cl} def
/m21 {mb f} def /m25 {mb s} def /m22 {mt f} def /m26{mt s} def
/m23 {mp x y w2 sub m w2 w d w neg 0 d cl f} def
/m27 {mp x y w2 add m w3 neg w2 neg d w3 w2 neg d w3 w2 d cl s} def
/m28 {mp x w2 sub y w2 sub w3 add m w3 0 d  0 w3 neg d w3 0 d 0 w3 d w3 0 d  0 w3 d w3 neg 0 d 0 w3 d w3 neg 0 d 0 w3 neg d w3 neg 0 d cl s } def
/m29 {mp gsave x w2 sub y w2 add w3 sub m currentpoint t 4 {side} repeat cl fill gr} def
/m30 {mp gsave x w2 sub y w2 add w3 sub m currentpoint t 4 {side} repeat cl s gr} def
/m31 {mp x y w2 sub m 0 w d x w2 sub y m w 0 d x w2 sub y w2 add m w w neg d x w2 sub y w2 sub m w w d s} def
/m32 {mp x y w2 sub m w2 w d w neg 0 d cl s} def
/m33 {mp x y w2 add m w3 neg w2 neg d w3 w2 neg d w3 w2 d cl f} def
/m34 {mp x w2 sub y w2 sub w3 add m w3 0 d  0 w3 neg d w3 0 d 0 w3 d w3 0 d  0 w3 d w3 neg 0 d 0 w3 d w3 neg 0 d 0 w3 neg d w3 neg 0 d cl f } def
/m2 {mp x y w2 sub m 0 w d x w2 sub y m w 0 d s} def
/m5 {mp x w2 sub y w2 sub m w w d x w2 sub y w2 add m w w neg d s} def
/reEncode {exch findfont dup length dict begin {1 index /FID eq  {pop pop} {def} ifelse } forall /Encoding exch def currentdict end dup /FontName get exch definefont pop } def [/Times-Bold /Times-Italic /Times-BoldItalic /Helvetica /Helvetica-Oblique
 /Helvetica-Bold /Helvetica-BoldOblique /Courier /Courier-Oblique /Courier-Bold /Courier-BoldOblique /Times-Roman /AvantGarde-Book /AvantGarde-BookOblique /AvantGarde-Demi /AvantGarde-DemiOblique /Bookman-Demi /Bookman-DemiItalic /Bookman-Light
 /Bookman-LightItalic /Helvetica-Narrow /Helvetica-Narrow-Bold /Helvetica-Narrow-BoldOblique /Helvetica-Narrow-Oblique /NewCenturySchlbk-Roman /NewCenturySchlbk-Bold /NewCenturySchlbk-BoldItalic /NewCenturySchlbk-Italic /Palatino-Bold
 /Palatino-BoldItalic /Palatino-Italic /Palatino-Roman ] {ISOLatin1Encoding reEncode } forall%%EndProlog
%%BeginSetup
%%EndSetup
newpath  gsave  .25 .25 scale  gsave  0 0 t black[  ] 0 sd 3 lw 1 1 1 c 2268 1239 0 0 bf black 1 1 1 c 1088 1214 23 12 bf black 1 1 1 c 860 959 197 207 bf black 860 959 197 207 bl 1 1 1 c 860 959 197 207 bf black 860 959 197 207 bl 6 lw 1 1 1 c black
 197 207 m 860 X s 3 lw 197 207 m 860 X s
 gsave  1088 1214 23 12 C 942.375 102.938 t 0 r /Helvetica findfont 40.9078 sf 0 0 m ( [GeV]) show NC gr 
 gsave  1088 1214 23 12 C 922.812 92.3125 t 0 r /Helvetica findfont 26.679 sf 0 0 m (4l) show NC gr 
 gsave  1088 1214 23 12 C 890.812 102.938 t 0 r /Helvetica findfont 40.9078 sf 0 0 m (M) show NC gr  230 235 m -28 Y s 263 221 m -14 Y s 296 221 m -14 Y s 329 221 m -14 Y s 362 221 m -14 Y s 395 235 m -28 Y s 428 221 m -14 Y s 461 221 m -14 Y s 495
 221 m -14 Y s 528 221 m -14 Y s 561 235 m -28 Y s 594 221 m -14 Y s 627 221 m -14 Y s 660 221 m -14 Y s 693 221 m -14 Y s 726 235 m -28 Y s 759 221 m -14 Y s 792 221 m -14 Y s 825 221 m -14 Y s 858 221 m -14 Y s 891 235 m -28 Y s 924 221 m -14 Y s
 958 221 m -14 Y s 991 221 m -14 Y s 1024 221 m -14 Y s 1057 235 m -28 Y s 230 235 m -28 Y s
 gsave  1088 1214 23 12 C 195.938 161.625 t 0 r /Helvetica findfont 40.9078 sf 0 0 m (100) show NC gr 
 gsave  1088 1214 23 12 C 361.188 161.625 t 0 r /Helvetica findfont 40.9078 sf 0 0 m (200) show NC gr 
 gsave  1088 1214 23 12 C 526.5 161.625 t 0 r /Helvetica findfont 40.9078 sf 0 0 m (300) show NC gr 
 gsave  1088 1214 23 12 C 691.75 161.625 t 0 r /Helvetica findfont 40.9078 sf 0 0 m (400) show NC gr 
 gsave  1088 1214 23 12 C 857.062 161.625 t 0 r /Helvetica findfont 40.9078 sf 0 0 m (500) show NC gr 
 gsave  1088 1214 23 12 C 1022.31 161.625 t 0 r /Helvetica findfont 40.9078 sf 0 0 m (600) show NC gr  197 1166 m 860 X s 230 1137 m 29 Y s 263 1151 m 15 Y s 296 1151 m 15 Y s 329 1151 m 15 Y s 362 1151 m 15 Y s 395 1137 m 29 Y s 428 1151 m 15 Y s
 461 1151 m 15 Y s 495 1151 m 15 Y s 528 1151 m 15 Y s 561 1137 m 29 Y s 594 1151 m 15 Y s 627 1151 m 15 Y s 660 1151 m 15 Y s 693 1151 m 15 Y s 726 1137 m 29 Y s 759 1151 m 15 Y s 792 1151 m 15 Y s 825 1151 m 15 Y s 858 1151 m 15 Y s 891 1137 m 29 Y
 s 924 1151 m 15 Y s 958 1151 m 15 Y s 991 1151 m 15 Y s 1024 1151 m 15 Y s 1057 1137 m 29 Y s 230 1137 m 29 Y s 197 207 m 959 Y s
 gsave  1088 1214 23 12 C 101.75 1140.81 t 90 r /Helvetica findfont 40.9078 sf 0 0 m ( \)) show NC gr 
 gsave  1088 1214 23 12 C 82.1875 1123 t 90 r /Helvetica findfont 26.679 sf 0 0 m (\2551) show NC gr 
 gsave  1088 1214 23 12 C 101.75 490.375 t 90 r /Helvetica findfont 40.9078 sf 0 0 m (Events/10GeV \( Normalized to 1 fb) show NC gr  210 207 m -13 X s 210 232 m -13 X s 210 253 m -13 X s 210 272 m -13 X s 210 288 m -13 X s 223 303 m -26 X s
 gsave  1088 1214 23 12 C 163.938 303.812 t 0 r /Helvetica findfont 26.679 sf 0 0 m (\2552) show NC gr 
 gsave  1088 1214 23 12 C 119.5 284.25 t 0 r /Helvetica findfont 40.9078 sf 0 0 m (10) show NC gr  210 399 m -13 X s 210 455 m -13 X s 210 495 m -13 X s 210 526 m -13 X s 210 552 m -13 X s 210 573 m -13 X s 210 592 m -13 X s 210 608 m -13 X s 223 623
 m -26 X s
 gsave  1088 1214 23 12 C 167.5 623.688 t 0 r /Helvetica findfont 26.679 sf 0 0 m (\2551) show NC gr 
 gsave  1088 1214 23 12 C 123.062 604.125 t 0 r /Helvetica findfont 40.9078 sf 0 0 m (10) show NC gr  210 719 m -13 X s 210 775 m -13 X s 210 815 m -13 X s 210 846 m -13 X s 210 871 m -13 X s 210 893 m -13 X s 210 911 m -13 X s 210 928 m -13 X s 223
 942 m -26 X s
 gsave  1088 1214 23 12 C 188.312 924.938 t 0 r  -22 0 t /Helvetica findfont 40.9078 sf 0 0 m (1) show NC gr  210 1038 m -13 X s 210 1095 m -13 X s 210 1135 m -13 X s 1057 207 m 959 Y s 1044 207 m 13 X s 1044 232 m 13 X s 1044 253 m 13 X s 1044 272 m
 13 X s 1044 288 m 13 X s 1031 303 m 26 X s 1044 399 m 13 X s 1044 455 m 13 X s 1044 495 m 13 X s 1044 526 m 13 X s 1044 552 m 13 X s 1044 573 m 13 X s 1044 592 m 13 X s 1044 608 m 13 X s 1031 623 m 26 X s 1044 719 m 13 X s 1044 775 m 13 X s 1044 815
 m 13 X s 1044 846 m 13 X s 1044 871 m 13 X s 1044 893 m 13 X s 1044 911 m 13 X s 1044 928 m 13 X s 1031 942 m 26 X s 1044 1038 m 13 X s 1044 1095 m 13 X s 1044 1135 m 13 X s 6 lw 1 1 1 c 0 0 1 c 3 lw /w 14 def /w2 {w 2 div} def /w3 {w 3 div} def 205
 798 222 987 238 678 255 754 271 767 288 754 304 732 321 713 337 702 354 713 370 858 387 925 404 922 420 908 437 890 453 869 470 850 486 830 503 807 519 785 536 772 552 752 569 735 585 714 602 696 619 676 635 663 652 647 668 630 685 613 701 598 718
 582 734 565 751 552 767 531 784 531 800 515 817 498 834 489 850 470 867 461 883 444 900 416 916 416 933 410 949 397 966 371 982 344 999 344 1015 340 50 { m24} R 6 lw 3 lw 1015 340 1032 331 1048 322 3 { m24} R 6 lw black 1 1 1 c 0.35 0.83 0.33 c 3 lw
 205 727 222 913 238 585 255 644 271 657 288 644 304 628 321 612 337 593 354 610 370 756 387 821 404 820 420 805 437 789 453 770 470 751 486 730 503 709 519 690 536 672 552 654 569 632 585 620 602 599 619 579 635 564 652 549 668 525 685 509 701 498
 718 481 734 469 751 457 767 442 784 422 800 410 817 384 834 375 850 370 867 357 883 343 900 329 916 319 933 316 949 293 966 276 982 268 999 267 1015 250 50 { m26} R 6 lw 3 lw 1015 250 1032 246 1048 215 3 { m26} R 6 lw black 1 1 1 c 1 0 1 c 3 lw 205
 729 222 890 238 595 255 647 271 666 288 647 304 636 321 611 337 596 354 607 370 761 387 825 404 826 420 814 437 794 453 774 470 754 486 735 503 716 519 692 536 673 552 657 569 636 585 622 602 602 619 586 635 573 652 544 668 532 685 517 701 500 718
 487 734 466 751 453 767 439 784 421 800 413 817 390 834 389 850 368 867 357 883 354 900 337 916 325 933 300 949 291 966 273 982 259 999 269 1015 247 50 { m22} R 6 lw 3 lw 1015 247 1032 230 1048 225 3 { m22} R 6 lw black 1 1 1 c 1 0 0 c 3 lw 205 799
 222 977 238 678 255 749 271 762 288 749 304 730 321 710 337 703 354 713 370 862 387 922 404 923 420 908 437 890 453 868 470 848 486 826 503 809 519 788 536 772 552 752 569 728 585 717 602 694 619 681 635 652 652 647 668 631 685 609 701 587 718 571
 734 563 751 557 767 533 784 511 800 505 817 488 834 475 850 468 867 436 883 423 900 423 916 403 933 389 949 370 966 366 982 359 999 342 1015 337 50 { m20} R 6 lw 3 lw 1015 337 1032 310 1048 322 3 { m20} R 6 lw black
 gsave  1088 1214 23 12 C 291.875 1082.12 t 0 r /Helvetica findfont 51.5794 sf 0 0 m 
 139 111 85 72 44 30
(= 7 TeV) K NC gr 
 gsave  1088 1214 23 12 C 267 1082.12 t 0 r /Helvetica findfont 51.5794 sf 0 0 m (s) show NC gr  233 1111 m 23 -30 d s 0 lw 256 1081 m 5 44 d s 261 1125 m 30 X s
 gsave  1088 1214 23 12 C 1100.5 813.875 t 90 r /Helvetica-BoldOblique findfont 30.2362 sf 0 0 m 
 336 321 304 287 279 255 226 218 198 177 169 148 125 101 93 71 62 40 18
(LHC HIGGS XS WG 2011) K NC gr  3 lw 1 1 1 c 441 244 558 826 bf black 569 826 m -7 Y 437 X 240 Y -7 X -233 Y f 558 826 m 244 Y 441 X -244 Y -441 X cl s
 gsave  1088 1214 23 12 C 830.375 1044.81 t 0 r /Helvetica findfont 23.1218 sf 0 0 m (>12GeV) show NC gr 
 gsave  1088 1214 23 12 C 814.375 1035.94 t 0 r /Helvetica findfont 14.2288 sf 0 0 m (Z2) show NC gr 
 gsave  1088 1214 23 12 C 700.625 1044.81 t 0 r /Helvetica findfont 23.1218 sf 0 0 m 
 93 87 81 68 55 38 26 13
(>50GeV, M) K NC gr 
 gsave  1088 1214 23 12 C 686.438 1039.5 t 0 r /Helvetica findfont 14.2288 sf 0 0 m (Z1) show NC gr 
 gsave  1088 1214 23 12 C 668.688 1044.81 t 0 r /Helvetica findfont 23.1218 sf 0 0 m (M) show NC gr  0.999 0.999 0.999 c black
 gsave  1088 1214 23 12 C 668.688 1002.19 t 0 r /Helvetica findfont 23.1218 sf 0 0 m 
 243 237 225 212 206 193 187 175 169 163 156 144 131 114 101 88 75 62 56 50 37 19 13
(e/mu: pT>5GeV, |eta|<2.5) K NC gr  0.999 0.999 0.999 c black
 gsave  1088 1214 23 12 C 668.688 959.5 t 0 r /Helvetica findfont 23.1218 sf 0 0 m (MSTW POWHEG 2e2mu) show NC gr  0 0 1 c 613 968 m24 black
 gsave  1088 1214 23 12 C 668.688 920.438 t 0 r /Helvetica findfont 23.1218 sf 0 0 m (CT10 POWHEG 2e2mu) show NC gr  1 0 0 c 613 928 m20 black
 gsave  1088 1214 23 12 C 668.688 879.625 t 0 r /Helvetica findfont 23.1218 sf 0 0 m (MSTW POWHEG 4e) show NC gr  0.35 0.83 0.33 c 613 887 m26 black
 gsave  1088 1214 23 12 C 668.688 838.75 t 0 r /Helvetica findfont 23.1218 sf 0 0 m (CT10 POWHEG 4e) show NC gr  1 0 1 c 613 847 m22 black 1 1 1 c 1088 1214 1157 12 bf black 1 1 1 c 860 959 1331 207 bf black 860 959 1331 207 bl 1 1 1 c 860 959 1331
 207 bf black 860 959 1331 207 bl 6 lw 1 1 1 c black 1331 207 m 860 X s 3 lw 1331 207 m 860 X s
 gsave  1088 1214 1157 12 C 2075.38 103.5 t 0 r /Helvetica findfont 40.9078 sf 0 0 m ( [GeV]) show NC gr 
 gsave  1088 1214 1157 12 C 2055.88 92.8125 t 0 r /Helvetica findfont 26.679 sf 0 0 m (4l) show NC gr 
 gsave  1088 1214 1157 12 C 2023.88 103.5 t 0 r /Helvetica findfont 40.9078 sf 0 0 m (M) show NC gr  1364 235 m -28 Y s 1397 221 m -14 Y s 1430 221 m -14 Y s 1463 221 m -14 Y s 1496 221 m -14 Y s 1529 235 m -28 Y s 1562 221 m -14 Y s 1595 221 m -14 Y
 s 1628 221 m -14 Y s 1661 221 m -14 Y s 1695 235 m -28 Y s 1728 221 m -14 Y s 1761 221 m -14 Y s 1794 221 m -14 Y s 1827 221 m -14 Y s 1860 235 m -28 Y s 1893 221 m -14 Y s 1926 221 m -14 Y s 1959 221 m -14 Y s 1992 221 m -14 Y s 2025 235 m -28 Y s
 2058 221 m -14 Y s 2091 221 m -14 Y s 2124 221 m -14 Y s 2158 221 m -14 Y s 2191 235 m -28 Y s 1364 235 m -28 Y s
 gsave  1088 1214 1157 12 C 1329 162.125 t 0 r /Helvetica findfont 40.9078 sf 0 0 m (100) show NC gr 
 gsave  1088 1214 1157 12 C 1494.25 162.125 t 0 r /Helvetica findfont 40.9078 sf 0 0 m (200) show NC gr 
 gsave  1088 1214 1157 12 C 1659.56 162.125 t 0 r /Helvetica findfont 40.9078 sf 0 0 m (300) show NC gr 
 gsave  1088 1214 1157 12 C 1824.81 162.125 t 0 r /Helvetica findfont 40.9078 sf 0 0 m (400) show NC gr 
 gsave  1088 1214 1157 12 C 1990.12 162.125 t 0 r /Helvetica findfont 40.9078 sf 0 0 m (500) show NC gr 
 gsave  1088 1214 1157 12 C 2155.38 162.125 t 0 r /Helvetica findfont 40.9078 sf 0 0 m (600) show NC gr  1331 1166 m 860 X s 1364 1137 m 29 Y s 1397 1151 m 15 Y s 1430 1151 m 15 Y s 1463 1151 m 15 Y s 1496 1151 m 15 Y s 1529 1137 m 29 Y s 1562 1151 m
 15 Y s 1595 1151 m 15 Y s 1628 1151 m 15 Y s 1661 1151 m 15 Y s 1695 1137 m 29 Y s 1728 1151 m 15 Y s 1761 1151 m 15 Y s 1794 1151 m 15 Y s 1827 1151 m 15 Y s 1860 1137 m 29 Y s 1893 1151 m 15 Y s 1926 1151 m 15 Y s 1959 1151 m 15 Y s 1992 1151 m 15
 Y s 2025 1137 m 29 Y s 2058 1151 m 15 Y s 2091 1151 m 15 Y s 2124 1151 m 15 Y s 2158 1151 m 15 Y s 2191 1137 m 29 Y s 1364 1137 m 29 Y s 1331 207 m 959 Y s
 gsave  1088 1214 1157 12 C 1240.12 1086.25 t 90 r /Helvetica findfont 26.679 sf 0 0 m (2e2mu) show NC gr 
 gsave  1088 1214 1157 12 C 1227.69 1061.38 t 90 r /Symbol findfont 40.9078 sf 0 0 m (s) show NC gr 
 gsave  1088 1214 1157 12 C 1227.69 1048.94 t 90 r /Helvetica findfont 40.9078 sf 0 0 m (/) show NC gr 
 gsave  1088 1214 1157 12 C 1240.12 1018.69 t 90 r /Helvetica findfont 26.679 sf 0 0 m (4e) show NC gr 
 gsave  1088 1214 1157 12 C 1227.69 993.812 t 90 r /Symbol findfont 40.9078 sf 0 0 m (s) show NC gr 
 gsave  1088 1214 1157 12 C 1227.69 888.938 t 90 r /Helvetica findfont 40.9078 sf 0 0 m (Ratio ) show NC gr  1356 207 m -25 X s 1344 234 m -13 X s 1344 261 m -13 X s 1344 289 m -13 X s 1344 316 m -13 X s 1356 344 m -25 X s 1344 371 m -13 X s 1344 398
 m -13 X s 1344 426 m -13 X s 1344 453 m -13 X s 1356 481 m -25 X s 1344 508 m -13 X s 1344 535 m -13 X s 1344 563 m -13 X s 1344 590 m -13 X s 1356 618 m -25 X s 1344 645 m -13 X s 1344 672 m -13 X s 1344 700 m -13 X s 1344 727 m -13 X s 1356 755 m
 -25 X s 1344 782 m -13 X s 1344 809 m -13 X s 1344 837 m -13 X s 1344 864 m -13 X s 1356 892 m -25 X s 1344 919 m -13 X s 1344 946 m -13 X s 1344 974 m -13 X s 1344 1001 m -13 X s 1356 1029 m -25 X s 1344 1056 m -13 X s 1344 1083 m -13 X s 1344 1111
 m -13 X s 1344 1138 m -13 X s 1356 1166 m -25 X s 1356 1166 m -25 X s
 gsave  1088 1214 1157 12 C 1302.31 192.375 t 0 r /Helvetica findfont 40.9078 sf 0 0 m (0) show NC gr 
 gsave  1088 1214 1157 12 C 1273.88 329.125 t 0 r /Helvetica findfont 40.9078 sf 0 0 m (0.1) show NC gr 
 gsave  1088 1214 1157 12 C 1268.56 466 t 0 r /Helvetica findfont 40.9078 sf 0 0 m (0.2) show NC gr 
 gsave  1088 1214 1157 12 C 1268.56 602.812 t 0 r /Helvetica findfont 40.9078 sf 0 0 m (0.3) show NC gr 
 gsave  1088 1214 1157 12 C 1268.56 739.688 t 0 r /Helvetica findfont 40.9078 sf 0 0 m (0.4) show NC gr 
 gsave  1088 1214 1157 12 C 1266.75 876.5 t 0 r /Helvetica findfont 40.9078 sf 0 0 m (0.5) show NC gr 
 gsave  1088 1214 1157 12 C 1268.56 1013.38 t 0 r /Helvetica findfont 40.9078 sf 0 0 m (0.6) show NC gr 
 gsave  1088 1214 1157 12 C 1268.56 1150.19 t 0 r /Helvetica findfont 40.9078 sf 0 0 m (0.7) show NC gr  2191 207 m 959 Y s 2165 207 m 26 X s 2178 234 m 13 X s 2178 261 m 13 X s 2178 289 m 13 X s 2178 316 m 13 X s 2165 344 m 26 X s 2178 371 m 13 X s
 2178 398 m 13 X s 2178 426 m 13 X s 2178 453 m 13 X s 2165 481 m 26 X s 2178 508 m 13 X s 2178 535 m 13 X s 2178 563 m 13 X s 2178 590 m 13 X s 2165 618 m 26 X s 2178 645 m 13 X s 2178 672 m 13 X s 2178 700 m 13 X s 2178 727 m 13 X s 2165 755 m 26 X
 s 2178 782 m 13 X s 2178 809 m 13 X s 2178 837 m 13 X s 2178 864 m 13 X s 2165 892 m 26 X s 2178 919 m 13 X s 2178 946 m 13 X s 2178 974 m 13 X s 2178 1001 m 13 X s 2165 1029 m 26 X s 2178 1056 m 13 X s 2178 1083 m 13 X s 2178 1111 m 13 X s 2178
 1138 m 13 X s 2165 1166 m 26 X s 2165 1166 m 26 X s 6 lw 1 1 1 c 0 0 1 c 3 lw 1339 1033 1356 1012 1372 911 1389 825 1405 826 1422 829 1438 855 1455 868 1471 833 1488 856 1504 865 1521 851 1537 863 1554 860 1570 869 1587 878 1604 876 1620 871 1637
 886 1653 896 1670 873 1686 886 1703 860 1719 903 1736 883 1752 885 1769 880 1785 881 1802 848 1819 858 1835 873 1852 870 1868 894 1885 896 1901 929 1918 831 1934 850 1951 811 1967 810 1984 873 2000 857 2017 865 2034 940 2050 886 2067 907 2083 853
 2100 896 2116 1002 2133 997 2149 926 50 { m24} R 6 lw 3 lw 2149 926 2166 951 2182 844 3 { m24} R 6 lw black 1 1 1 c 1 0 0 c 3 lw 1339 1034 1356 938 1372 958 1389 860 1405 892 1422 864 1438 905 1455 880 1471 841 1488 849 1504 871 1521 886 1537 891
 1554 905 1570 893 1587 905 1604 903 1620 914 1637 908 1653 895 1670 876 1686 896 1703 917 1719 897 1736 909 1752 897 1769 983 1785 857 1802 880 1819 916 1835 938 1852 958 1868 890 1885 856 1901 902 1918 926 1934 912 1951 882 1967 946 1984 875 2000
 984 2017 1042 2034 941 2050 990 2067 924 2083 985 2100 908 2116 873 2133 1022 2149 925 50 { m20} R 6 lw 3 lw 2149 925 2166 976 2182 889 3 { m20} R 6 lw 9 lw 0.95 0.95 0.95 c black 1 0 0 c 1335 892 m 421 X s 1756 892 m 422 X s 2178 892 m 8 X s black
 gsave  1088 1214 1157 12 C 1478.25 1082.69 t 0 r /Helvetica findfont 51.5794 sf 0 0 m 
 139 110 85 72 44 29
(= 7 TeV) K NC gr 
 gsave  1088 1214 1157 12 C 1453.38 1082.69 t 0 r /Helvetica findfont 51.5794 sf 0 0 m (s) show NC gr  6 lw 1420 1111 m 23 -30 d s 0 lw 1443 1081 m 5 44 d s 1448 1125 m 31 X s
 gsave  1088 1214 1157 12 C 2233.56 814.312 t 90 r /Helvetica-BoldOblique findfont 30.2362 sf 0 0 m 
 336 321 304 287 279 255 226 218 197 177 169 148 125 101 93 71 62 40 18
(LHC HIGGS XS WG 2011) K NC gr  3 lw 1 1 1 c 610 123 1500 611 bf black 1511 611 m -7 Y 606 X 119 Y -7 X -112 Y f 1500 611 m 123 Y 610 X -123 Y -610 X cl s
 gsave  1088 1214 1157 12 C 1650.62 695.25 t 0 r /Helvetica findfont 23.1218 sf 0 0 m (MSTW POWHEG 4e / POWHEG 2e2mu) show NC gr  0 0 1 c 1576 703 m24 black
 gsave  1088 1214 1157 12 C 1650.62 634.812 t 0 r /Helvetica findfont 23.1218 sf 0 0 m (CT10 POWHEG 4e / POWHEG 2e2mu) show NC gr  1 0 0 c 1576 642 m20
 gr  gr showpage
end
%%EOF
