%!PS-Adobe-2.0 EPSF-2.0
%%BoundingBox: 0 0 567 425
%%Title: uncertaintyband.eps
%%Creator: HIGZ Version 1.29/04
%%CreationDate: 2011/05/23   22.33
%%EndComments
%%BeginProlog
80 dict begin
/s {stroke} def /l {lineto} def /m {moveto} def /t {translate} def
/sw {stringwidth} def /r {rotate} def /rl {roll}  def /R {repeat} def
/d {rlineto} def /rm {rmoveto} def /gr {grestore} def /f {eofill} def
/c {setrgbcolor} def /lw {setlinewidth} def /sd {setdash} def
/cl {closepath} def /sf {scalefont setfont} def /black {0 setgray} def
/box {m dup 0 exch d exch 0 d 0 exch neg d cl} def
/NC{systemdict begin initclip end}def/C{NC box clip newpath}def
/bl {box s} def /bf {box f} def /Y { 0 exch d} def /X { 0 d} def 
/mp {newpath /y exch def /x exch def} def
/side {[w .77 mul w .23 mul] .385 w mul sd w 0 l currentpoint t -144 r} def
/mr {mp x y w2 0 360 arc} def /m24 {mr s} def /m20 {mr f} def
/mb {mp x y w2 add m w2 neg 0 d 0 w neg d w 0 d 0 w d cl} def
/mt {mp x y w2 add m w2 neg w neg d w 0 d cl} def
/m21 {mb f} def /m25 {mb s} def /m22 {mt f} def /m26 {mt s} def
/m23 {mp x y w2 sub m w2 w d w neg 0 d cl f} def
/m27 {mp x y w2 add m w3 neg w2 neg d w3 w2 neg d w3  w2 d cl s} def
/m28 {mp x w2 sub y w2 sub w3 add m w3 0 d 0 w3 neg d w3 0 d 0 w3 d w3 0 d
 0 w3 d w3 neg 0 d 0 w3 d w3 neg 0 d
 0 w3 neg d w3 neg 0 d cl s } def
/m29 {mp gsave x w2 sub y w2 add w3 sub m currentpoint t
 4 {side} repeat cl fill gr} def
/m30 {mp gsave x w2 sub y w2 add w3 sub m currentpoint t
 5 {side} repeat s gr} def
/m31 {mp x y w2 sub m 0 w d x w2 sub y m w 0 d
 x w2 sub y w2 add m w w neg d x w2 sub y w2
 sub m w w d s} def
/m2 {mp x y w2 sub m 0 w d x w2 sub y m w 0 d s} def
/m5 {mp x w2 sub y w2 sub m w w d x w2 sub y w2 add m w w neg d s} def
/reencdict 24 dict def /ReEncode {reencdict begin /nco&na exch def
/nfnam exch def /basefontname exch def /basefontdict basefontname findfont def
/newfont basefontdict maxlength dict def basefontdict {exch dup /FID ne
{dup /Encoding eq {exch dup length array copy newfont 3 1 roll put} {exch
newfont 3 1 roll put} ifelse} {pop pop} ifelse } forall newfont
/FontName nfnam put nco&na aload pop nco&na length 2 idiv {newfont
/Encoding get 3 1 roll put} repeat nfnam newfont definefont pop end } def
/accvec [ 176 /agrave 181 /Agrave 190 /acircumflex 192 /Acircumflex
201 /adieresis 204 /Adieresis 209 /ccedilla 210 /Ccedilla 211 /eacute
212 /Eacute 213 /egrave 214 /Egrave 215 /ecircumflex 216 /Ecircumflex
217 /edieresis 218 /Edieresis 219 /icircumflex 220 /Icircumflex
221 /idieresis 222 /Idieresis 223 /ntilde 224 /Ntilde 226 /ocircumflex
228 /Ocircumflex 229 /odieresis 230 /Odieresis 231 /ucircumflex 236 /Ucircumflex
237 /udieresis 238 /Udieresis 239 /aring 242 /Aring 243 /ydieresis
244 /Ydieresis 246 /aacute 247 /Aacute 252 /ugrave 253 /Ugrave] def
/Times-Roman /Times-Roman accvec ReEncode
/Times-Italic /Times-Italic accvec ReEncode
/Times-Bold /Times-Bold accvec ReEncode
/Times-BoldItalic /Times-BoldItalic accvec ReEncode
/Helvetica /Helvetica accvec ReEncode
/Helvetica-Oblique /Helvetica-Oblique accvec ReEncode
/Helvetica-Bold /Helvetica-Bold accvec ReEncode
/Helvetica-BoldOblique /Helvetica-BoldOblique  accvec ReEncode
/Courier /Courier accvec ReEncode
/Courier-Oblique /Courier-Oblique accvec ReEncode
/Courier-Bold /Courier-Bold accvec ReEncode
/Courier-BoldOblique /Courier-BoldOblique accvec ReEncode
/oshow {gsave [] 0 sd true charpath stroke gr} def
/stwn { /fs exch def /fn exch def /text exch def fn findfont fs sf
 text sw pop xs add /xs exch def} def
/stwb { /fs exch def /fn exch def /nbas exch def /textf exch def
textf length /tlen exch def nbas tlen gt {/nbas tlen def} if
fn findfont fs sf textf dup length nbas sub nbas getinterval sw
pop neg xs add /xs exch def} def
/accspe [ 65 /plusminus 66 /bar 67 /existential 68 /universal
69 /exclam 70 /numbersign 71 /greater 72 /question 73 /integral
74 /colon 75 /semicolon 76 /less 77 /bracketleft 78 /bracketright
79 /greaterequal 80 /braceleft 81 /braceright 82 /radical
83 /spade 84 /heart 85 /diamond 86 /club 87 /lessequal
88 /multiply 89 /percent 90 /infinity 48 /circlemultiply 49 /circleplus
50 /emptyset 51 /lozenge 52 /bullet 53 /arrowright 54 /arrowup
55 /arrowleft 56 /arrowdown 57 /arrowboth 48 /degree 44 /comma 43 /plus
 45 /angle 42 /angleleft 47 /divide 61 /notequal 40 /equivalence 41 /second
 97 /approxequal 98 /congruent 99 /perpendicular 100 /partialdiff 101 /florin
 102 /intersection 103 /union 104 /propersuperset 105 /reflexsuperset
 106 /notsubset 107 /propersubset 108 /reflexsubset 109 /element 110 /notelement
 111 /gradient 112 /logicaland 113 /logicalor 114 /arrowdblboth
 115 /arrowdblleft 116 /arrowdblup 117 /arrowdblright 118 /arrowdbldown
 119 /ampersand 120 /omega1 121 /similar 122 /aleph ] def
/Symbol /Special accspe ReEncode
%%EndProlog
%%BeginSetup
%%EndSetup
newpath  gsave  .25 .25 scale  gsave 0 0 t black [] 0 sd 1 lw 227 227 m 1247 Y s
 3 lw 261 227 m -34 X s
 /xs 0 def 
(10)
 /Times-Bold     59 stwn 
 gsave  156 207
 t   0 r  xs neg 0 t 0 0 m
 /Times-Bold findfont   59 sf 0    0 m 
(10)
 show 
 gr 
 /xs 0 def 
(-1)
 /Times-Bold     47 stwn 
 gsave  215 256
 t   0 r  xs neg 0 t 0 0 m
 /Times-Bold findfont   47 sf 0    0 m 
(-1)
 show 
 gr  244 328 m -17 X s 244 388 m -17 X s 244 430 m -17 X s 244 463 m -17 X s 244
 489 m -17 X s 244 512 m -17 X s 244 531 m -17 X s 244 549 m -17 X s 261 564 m
 -34 X s
 /xs 0 def 
(1)
 /Times-Bold     59 stwn 
 gsave  176 544
 t   0 r  xs neg 0 t 0 0 m
 /Times-Bold findfont   59 sf 0    0 m 
(1)
 show 
 gr  244 666 m -17 X s 244 725 m -17 X s 244 767 m -17 X s 244 800 m -17 X s 244
 826 m -17 X s 244 849 m -17 X s 244 869 m -17 X s 244 886 m -17 X s 261 901 m
 -34 X s
 /xs 0 def 
(10)
 /Times-Bold     59 stwn 
 gsave  176 881
 t   0 r  xs neg 0 t 0 0 m
 /Times-Bold findfont   59 sf 0    0 m 
(10)
 show 
 gr  244 1003 m -17 X s 244 1062 m -17 X s 244 1104 m -17 X s 244 1137 m -17 X s
 244 1164 m -17 X s 244 1186 m -17 X s 244 1206 m -17 X s 244 1223 m -17 X s 261
 1238 m -34 X s
 /xs 0 def 
(10)
 /Times-Bold     59 stwn 
 gsave  176 1219
 t   0 r  xs neg 0 t 0 0 m
 /Times-Bold findfont   59 sf 0    0 m 
(10)
 show 
 gr 
 /xs 0 def 
(2)
 /Times-Bold     47 stwn 
 gsave  215 1247
 t   0 r  xs neg 0 t 0 0 m
 /Times-Bold findfont   47 sf 0    0 m 
(2)
 show 
 gr  244 1340 m -17 X s 244 1399 m -17 X s 244 1442 m -17 X s 244 1474 m -17 X s
 1 lw 227 227 m 1814 X s 3 lw 227 261 m -34 Y s 272 244 m -17 Y s 318 244 m -17
 Y s 363 244 m -17 Y s 408 244 m -17 Y s 454 261 m -34 Y s 499 244 m -17 Y s 544
 244 m -17 Y s 590 244 m -17 Y s 635 244 m -17 Y s 680 261 m -34 Y s 726 244 m
 -17 Y s 771 244 m -17 Y s 816 244 m -17 Y s 862 244 m -17 Y s 907 261 m -34 Y s
 953 244 m -17 Y s 998 244 m -17 Y s 1043 244 m -17 Y s 1089 244 m -17 Y s 1134
 261 m -34 Y s 1179 244 m -17 Y s 1225 244 m -17 Y s 1270 244 m -17 Y s 1315 244
 m -17 Y s 1361 261 m -34 Y s 1406 244 m -17 Y s 1452 244 m -17 Y s 1497 244 m
 -17 Y s 1542 244 m -17 Y s 1588 261 m -34 Y s 1633 244 m -17 Y s 1678 244 m -17
 Y s 1724 244 m -17 Y s 1769 244 m -17 Y s 1814 261 m -34 Y s 1860 244 m -17 Y s
 1905 244 m -17 Y s 1950 244 m -17 Y s 1996 244 m -17 Y s 2041 261 m -34 Y s
 /xs 0 def 
(100)
 /Times-Bold     59 stwn 
 gsave  227 164
 t   0 r  xs 2 div neg 0 t 0 0 m
 /Times-Bold findfont   59 sf 0    0 m 
(100)
 show 
 gr 
 /xs 0 def 
(150)
 /Times-Bold     59 stwn 
 gsave  454 164
 t   0 r  xs 2 div neg 0 t 0 0 m
 /Times-Bold findfont   59 sf 0    0 m 
(150)
 show 
 gr 
 /xs 0 def 
(200)
 /Times-Bold     59 stwn 
 gsave  680 164
 t   0 r  xs 2 div neg 0 t 0 0 m
 /Times-Bold findfont   59 sf 0    0 m 
(200)
 show 
 gr 
 /xs 0 def 
(250)
 /Times-Bold     59 stwn 
 gsave  907 164
 t   0 r  xs 2 div neg 0 t 0 0 m
 /Times-Bold findfont   59 sf 0    0 m 
(250)
 show 
 gr 
 /xs 0 def 
(300)
 /Times-Bold     59 stwn 
 gsave  1134 164
 t   0 r  xs 2 div neg 0 t 0 0 m
 /Times-Bold findfont   59 sf 0    0 m 
(300)
 show 
 gr 
 /xs 0 def 
(350)
 /Times-Bold     59 stwn 
 gsave  1361 164
 t   0 r  xs 2 div neg 0 t 0 0 m
 /Times-Bold findfont   59 sf 0    0 m 
(350)
 show 
 gr 
 /xs 0 def 
(400)
 /Times-Bold     59 stwn 
 gsave  1588 164
 t   0 r  xs 2 div neg 0 t 0 0 m
 /Times-Bold findfont   59 sf 0    0 m 
(400)
 show 
 gr 
 /xs 0 def 
(450)
 /Times-Bold     59 stwn 
 gsave  1814 164
 t   0 r  xs 2 div neg 0 t 0 0 m
 /Times-Bold findfont   59 sf 0    0 m 
(450)
 show 
 gr 
 /xs 0 def 
(500)
 /Times-Bold     59 stwn 
 gsave  2041 164
 t   0 r  xs 2 div neg 0 t 0 0 m
 /Times-Bold findfont   59 sf 0    0 m 
(500)
 show 
 gr  1814 1247 227 227 C NC 1 lw 2041 227 m 1247 Y s 3 lw 2007 227 m 34 X s 2024
 328 m 17 X s 2024 388 m 17 X s 2024 430 m 17 X s 2024 463 m 17 X s 2024 489 m
 17 X s 2024 512 m 17 X s 2024 531 m 17 X s 2024 549 m 17 X s 2007 564 m 34 X s
 2024 666 m 17 X s 2024 725 m 17 X s 2024 767 m 17 X s 2024 800 m 17 X s 2024
 826 m 17 X s 2024 849 m 17 X s 2024 869 m 17 X s 2024 886 m 17 X s 2007 901 m
 34 X s 2024 1003 m 17 X s 2024 1062 m 17 X s 2024 1104 m 17 X s 2024 1137 m 17
 X s 2024 1164 m 17 X s 2024 1186 m 17 X s 2024 1206 m 17 X s 2024 1223 m 17 X s
 2007 1238 m 34 X s 2024 1340 m 17 X s 2024 1399 m 17 X s 2024 1442 m 17 X s
 2024 1474 m 17 X s 1 lw 227 1474 m 1814 X s 3 lw 227 1440 m 34 Y s 272 1457 m
 17 Y s 318 1457 m 17 Y s 363 1457 m 17 Y s 408 1457 m 17 Y s 454 1440 m 34 Y s
 499 1457 m 17 Y s 544 1457 m 17 Y s 590 1457 m 17 Y s 635 1457 m 17 Y s 680
 1440 m 34 Y s 726 1457 m 17 Y s 771 1457 m 17 Y s 816 1457 m 17 Y s 862 1457 m
 17 Y s 907 1440 m 34 Y s 953 1457 m 17 Y s 998 1457 m 17 Y s 1043 1457 m 17 Y s
 1089 1457 m 17 Y s 1134 1440 m 34 Y s 1179 1457 m 17 Y s 1225 1457 m 17 Y s
 1270 1457 m 17 Y s 1315 1457 m 17 Y s 1361 1440 m 34 Y s 1406 1457 m 17 Y s
 1452 1457 m 17 Y s 1497 1457 m 17 Y s 1542 1457 m 17 Y s 1588 1440 m 34 Y s
 1633 1457 m 17 Y s 1678 1457 m 17 Y s 1724 1457 m 17 Y s 1769 1457 m 17 Y s
 1814 1440 m 34 Y s 1860 1457 m 17 Y s 1905 1457 m 17 Y s 1950 1457 m 17 Y s
 1996 1457 m 17 Y s 2041 1440 m 34 Y s 1814 1247 227 227 C 2268 2269 0 -284 C 8
 lw 1 0 0 c 231 1448 m 5 -5 d s 236 1443 m 4 -5 d s 240 1438 m 5 -5 d s 245 1433
 m 2 -2 d s 262 1414 m 1 -1 d s 263 1413 m 5 -4 d s 268 1409 m 4 -5 d s 272 1404
 m 5 -5 d s 277 1399 m 1 -1 d s 294 1382 m 1 -1 d s 295 1381 m 4 -5 d s 299 1376
 m 5 -5 d s 304 1371 m 4 -4 d s 308 1367 m 2 -1 d s 326 1350 m 1 -1 d s 327 1349
 m 4 -4 d s 331 1345 m 5 -5 d s 336 1340 m 4 -4 d s 340 1336 m 2 -2 d s 359 1319
 m 4 -4 d s 363 1315 m 4 -4 d s 367 1311 m 5 -5 d s 372 1306 m 3 -3 d s 392 1288
 m 3 -2 d s 395 1286 m 4 -4 d s 399 1282 m 5 -4 d s 404 1278 m 4 -4 d s 408 1274
 m 1 -1 d s 426 1258 m 5 -4 d s 431 1254 m 4 -3 d s 435 1251 m 5 -4 d s 440 1247
 m 4 -3 d s 461 1229 m 2 -1 d s 463 1228 m 4 -4 d s 467 1224 m 5 -4 d s 472 1220
 m 4 -3 d s 476 1217 m 3 -2 d s 496 1201 m 3 -3 d s 499 1198 m 4 -3 d s 503 1195
 m 5 -4 d s 508 1191 m 5 -3 d s 513 1188 m 1 -2 d s 532 1173 m 3 -3 d s 535 1170
 m 5 -3 d s 540 1167 m 4 -4 d s 544 1163 m 5 -3 d s 549 1160 m 1 -1 d s 568 1145
 m 4 -2 d s 572 1143 m 4 -4 d s 576 1139 m 5 -3 d s 581 1136 m 4 -3 d s 585 1133
 m 2 -1 d s 605 1119 m 3 -3 d s 608 1116 m 4 -3 d s 612 1113 m 5 -3 d s 617 1110
 m 4 -3 d s 621 1107 m 2 -2 d s 642 1092 m 2 -1 d s 644 1091 m 5 -3 d s 649 1088
 m 4 -3 d s 653 1085 m 5 -4 d s 658 1081 m 3 -2 d s 679 1067 m 1 -1 d s 680 1066
 m 5 -3 d s 685 1063 m 4 -3 d s 689 1060 m 5 -3 d s 694 1057 m 4 -3 d s 717 1042
 m 4 -3 d s 721 1039 m 5 -3 d s 726 1036 m 4 -3 d s 730 1033 m 5 -3 d s 735 1030
 m 1 -1 d s 755 1017 m 3 -1 d s 758 1016 m 4 -3 d s 762 1013 m 5 -3 d s 767 1010
 m 4 -3 d s 771 1007 m 4 -2 d s 794 993 m 4 -3 d s 798 990 m 5 -3 d s 803 987 m
 4 -2 d s 807 985 m 5 -3 d s 812 982 m 1 -1 d s 833 969 m 2 -1 d s 835 968 m 4
 -2 d s 839 966 m 5 -3 d s 844 963 m 4 -3 d s 848 960 m 4 -2 d s 872 946 m 3 -2
 d s 875 944 m 5 -3 d s 880 941 m 5 -2 d s 885 939 m 4 -3 d s 889 936 m 2 -1 d s
 911 924 m 1 -1 d s 912 923 m 4 -2 d s 916 921 m 5 -3 d s 921 918 m 4 -2 d s 925
 916 m 5 -3 d s 930 913 m 1 X s 950 901 m 3 -1 d s 953 900 m 4 -2 d s 957 898 m
 5 -3 d s 962 895 m 4 -2 d s 966 893 m 4 -2 d s 990 880 m 3 -2 d s 993 878 m 5
 -3 d s 998 875 m 4 -2 d s 1002 873 m 5 -2 d s 1007 871 m 3 -2 d s 1030 858 m 4
 -2 d s 1034 856 m 5 -2 d s 1039 854 m 4 -3 d s 1043 851 m 5 -2 d s 1048 849 m 2
 -1 d s 1070 837 m s 1070 837 m 5 -2 d s 1075 835 m 5 -3 d s 1080 832 m 4 -2 d s
 1084 830 m 5 -2 d s 1089 828 m 2 -1 d s 1111 817 m -1 Y s 1111 816 m 5 -2 d s
 1116 814 m 4 -2 d s 1120 812 m 5 -3 d s 1125 809 m 4 -2 d s 1129 807 m 2 -1 d s
 1151 796 m 1 X s 1152 796 m 5 -2 d s 1157 794 m 4 -3 d s 1161 791 m 5 -2 d s
 1166 789 m 4 -2 d s 1170 787 m 2 -1 d s 1192 776 m 1 X s 1193 776 m 5 -2 d s
 1198 774 m 4 -2 d s 1202 772 m 5 -3 d s 1207 769 m 4 -2 d s 1211 767 m 2 X s
 1233 757 m 1 -1 d s 1234 756 m 4 -2 d s 1238 754 m 5 -2 d s 1243 752 m 4 -2 d s
 1247 750 m 5 -2 d s 1252 748 m 1 -1 d s 1274 737 m 1 X s 1275 737 m 4 -2 d s
 1279 735 m 5 -2 d s 1284 733 m 4 -2 d s 1288 731 m 5 -2 d s 1293 729 m 2 -1 d s
 1315 718 m s 1315 718 m 5 -2 d s 1320 716 m 5 -2 d s 1325 714 m 4 -2 d s 1329
 712 m 5 -2 d s 1334 710 m 2 -1 d s 1357 700 m 4 -2 d s 1361 698 m 4 -2 d s 1365
 696 m 5 -2 d s 1370 694 m 4 -2 d s 1374 692 m 3 -1 d s 1398 681 m 4 -1 d s 1402
 680 m 4 -2 d s 1406 678 m 5 -2 d s 1411 676 m 4 -2 d s 1415 674 m 4 -2 d s 1440
 663 m 2 -1 d s 1442 662 m 5 -2 d s 1447 660 m 5 -2 d s 1452 658 m 4 -2 d s 1456
 656 m 4 -2 d s 1481 645 m 2 X s 1483 645 m 5 -2 d s 1488 643 m 4 -2 d s 1492
 641 m 5 -2 d s 1497 639 m 4 -2 d s 1501 637 m 1 X s 1523 628 m 1 -1 d s 1524
 627 m 5 -1 d s 1529 626 m 4 -2 d s 1533 624 m 5 -2 d s 1538 622 m 4 -2 d s 1542
 620 m 2 -1 d s 1565 611 m 4 -2 d s 1569 609 m 5 -2 d s 1574 607 m 5 -2 d s 1579
 605 m 4 -2 d s 1583 603 m 3 -1 d s 1607 593 m 3 -1 d s 1610 592 m 5 -2 d s 1615
 590 m 4 -2 d s 1619 588 m 5 -1 d s 1624 587 m 4 -2 d s 1649 577 m 2 -1 d s 1651
 576 m 5 -2 d s 1656 574 m 4 -2 d s 1660 572 m 5 -2 d s 1665 570 m 4 -1 d s 1669
 569 m 1 -1 d s 1691 560 m 1 X s 1692 560 m 4 -2 d s 1696 558 m 5 -2 d s 1701
 556 m 5 -2 d s 1706 554 m 4 -1 d s 1710 553 m 3 -1 d s 1734 544 m 3 -2 d s 1737
 542 m 5 -2 d s 1742 540 m 4 -1 d s 1746 539 m 5 -2 d s 1751 537 m 4 -2 d s 1776
 527 m 2 X s 1778 527 m 5 -2 d s 1783 525 m 4 -2 d s 1787 523 m 5 -2 d s 1792
 521 m 4 -1 d s 1796 520 m 1 -1 d s 1818 511 m 1 X s 1819 511 m 4 -2 d s 1823
 509 m 5 -1 d s 1828 508 m 5 -2 d s 1833 506 m 4 -2 d s 1837 504 m 3 -1 d s 1861
 496 m 3 -2 d s 1864 494 m 5 -1 d s 1869 493 m 4 -2 d s 1873 491 m 5 -2 d s 1878
 489 m 4 -1 d s 1904 480 m 1 -1 d s 1905 479 m 5 -1 d s 1910 478 m 4 -2 d s 1914
 476 m 5 -2 d s 1919 474 m 4 -1 d s 1923 473 m 2 -1 d s 1946 464 m 4 -1 d s 1950
 463 m 5 -2 d s 1955 461 m 5 -1 d s 1960 460 m 4 -2 d s 1964 458 m 4 -1 d s 1989
 449 m 2 -1 d s 1991 448 m 5 -1 d s 1996 447 m 4 -2 d s 2000 445 m 5 -1 d s 2005
 444 m 4 -2 d s 2009 442 m 1 X s 2032 434 m s 2032 434 m 5 -2 d s 2037 432 m 4
 -1 d s 1814 1247 227 227 C 2268 2269 0 -284 C 231 1380 m 5 -5 d s 236 1375 m 4
 -5 d s 240 1370 m 5 -5 d s 245 1365 m 2 -2 d s 262 1346 m 1 X s 263 1346 m 5 -5
 d s 268 1341 m 4 -5 d s 272 1336 m 5 -5 d s 277 1331 m 1 -1 d s 294 1314 m 1 -1
 d s 295 1313 m 4 -5 d s 299 1308 m 5 -4 d s 304 1304 m 4 -5 d s 308 1299 m 2 -1
 d s 326 1282 m 1 X s 327 1282 m 4 -5 d s 331 1277 m 5 -4 d s 336 1273 m 4 -4 d
 s 340 1269 m 3 -3 d s 359 1251 m 4 -4 d s 363 1247 m 4 -4 d s 367 1243 m 5 -4 d
 s 372 1239 m 4 -3 d s 393 1220 m 2 -1 d s 395 1219 m 4 -4 d s 399 1215 m 5 -4 d
 s 404 1211 m 4 -4 d s 408 1207 m 2 -2 d s 427 1191 m 4 -4 d s 431 1187 m 4 -4 d
 s 435 1183 m 5 -4 d s 440 1179 m 4 -3 d s 462 1161 m 1 -1 d s 463 1160 m 4 -3 d
 s 467 1157 m 5 -4 d s 472 1153 m 4 -4 d s 476 1149 m 3 -2 d s 497 1133 m 2 -2 d
 s 499 1131 m 4 -3 d s 503 1128 m 5 -4 d s 508 1124 m 5 -4 d s 513 1120 m 2 -1 d
 s 533 1105 m 2 -2 d s 535 1103 m 5 -4 d s 540 1099 m 4 -3 d s 544 1096 m 5 -4 d
 s 549 1092 m 2 -1 d s 569 1078 m 3 -3 d s 572 1075 m 4 -3 d s 576 1072 m 5 -3 d
 s 581 1069 m 4 -4 d s 585 1065 m 2 -1 d s 605 1051 m 3 -2 d s 608 1049 m 4 -3 d
 s 612 1046 m 5 -4 d s 617 1042 m 4 -3 d s 621 1039 m 3 -1 d s 642 1025 m 2 -2 d
 s 644 1023 m 5 -3 d s 649 1020 m 4 -3 d s 653 1017 m 5 -3 d s 658 1014 m 3 -2 d
 s 680 999 m -1 Y s 680 998 m 5 -3 d s 685 995 m 4 -3 d s 689 992 m 5 -3 d s 694
 989 m 5 -3 d s 717 974 m 4 -3 d s 721 971 m 5 -3 d s 726 968 m 4 -3 d s 730 965
 m 5 -3 d s 735 962 m 1 -1 d s 756 949 m 2 -1 d s 758 948 m 4 -3 d s 762 945 m 5
 -3 d s 767 942 m 4 -3 d s 771 939 m 4 -2 d s 794 925 m 4 -3 d s 798 922 m 5 -3
 d s 803 919 m 4 -2 d s 807 917 m 5 -3 d s 812 914 m 1 -1 d s 833 901 m 2 -1 d s
 835 900 m 4 -3 d s 839 897 m 5 -2 d s 844 895 m 4 -3 d s 848 892 m 4 -2 d s 872
 878 m 3 -2 d s 875 876 m 5 -3 d s 880 873 m 5 -3 d s 885 870 m 4 -2 d s 889 868
 m 2 -1 d s 911 855 m 1 X s 912 855 m 4 -3 d s 916 852 m 5 -3 d s 921 849 m 4 -2
 d s 925 847 m 5 -3 d s 930 844 m s 950 833 m 3 -1 d s 953 832 m 4 -3 d s 957
 829 m 5 -3 d s 962 826 m 4 -2 d s 966 824 m 4 -2 d s 990 811 m 3 -2 d s 993 809
 m 5 -2 d s 998 807 m 4 -3 d s 1002 804 m 5 -2 d s 1007 802 m 3 -2 d s 1030 789
 m 4 -2 d s 1034 787 m 5 -2 d s 1039 785 m 4 -3 d s 1043 782 m 5 -2 d s 1048 780
 m 2 -1 d s 1070 768 m s 1070 768 m 5 -2 d s 1075 766 m 5 -3 d s 1080 763 m 4 -2
 d s 1084 761 m 5 -3 d s 1089 758 m 1 X s 1110 747 m 1 X s 1111 747 m 5 -3 d s
 1116 744 m 4 -2 d s 1120 742 m 5 -2 d s 1125 740 m 4 -2 d s 1129 738 m 1 -1 d s
 1151 727 m 1 -1 d s 1152 726 m 5 -2 d s 1157 724 m 4 -2 d s 1161 722 m 5 -3 d s
 1166 719 m 4 -2 d s 1170 717 m 1 X s 1191 707 m 2 -1 d s 1193 706 m 5 -2 d s
 1198 704 m 4 -2 d s 1202 702 m 5 -3 d s 1207 699 m 4 -2 d s 1211 697 m 1 X s
 1232 687 m 2 -1 d s 1234 686 m 4 -2 d s 1238 684 m 5 -2 d s 1243 682 m 4 -2 d s
 1247 680 m 5 -2 d s 1252 678 m 1 -1 d s 1273 668 m 2 -1 d s 1275 667 m 4 -2 d s
 1279 665 m 5 -2 d s 1284 663 m 4 -3 d s 1288 660 m 5 -2 d s 1293 658 m 1 X s
 1314 648 m 1 X s 1315 648 m 5 -2 d s 1320 646 m 5 -2 d s 1325 644 m 4 -2 d s
 1329 642 m 5 -3 d s 1334 639 m 1 X s 1356 629 m s 1356 629 m 5 -2 d s 1361 627
 m 4 -2 d s 1365 625 m 5 -2 d s 1370 623 m 4 -2 d s 1374 621 m 2 -1 d s 1397 611
 m s 1397 611 m 5 -2 d s 1402 609 m 4 -2 d s 1406 607 m 5 -2 d s 1411 605 m 4 -2
 d s 1415 603 m 3 -1 d s 1438 593 m 4 -2 d s 1442 591 m 5 -2 d s 1447 589 m 5 -2
 d s 1452 587 m 4 -2 d s 1456 585 m 3 -1 d s 1480 575 m 3 -2 d s 1483 573 m 5 -2
 d s 1488 571 m 4 -2 d s 1492 569 m 5 -2 d s 1497 567 m 4 -1 d s 1522 557 m 2 -1
 d s 1524 556 m 5 -2 d s 1529 554 m 4 -2 d s 1533 552 m 5 -2 d s 1538 550 m 4 -2
 d s 1542 548 m 1 X s 1564 539 m 1 X s 1565 539 m 4 -2 d s 1569 537 m 5 -2 d s
 1574 535 m 5 -2 d s 1579 533 m 4 -2 d s 1583 531 m 2 X s 1606 522 m s 1606 522
 m 4 -2 d s 1610 520 m 5 -2 d s 1615 518 m 4 -2 d s 1619 516 m 5 -1 d s 1624 515
 m 3 -2 d s 1648 505 m 3 -1 d s 1651 504 m 5 -2 d s 1656 502 m 4 -2 d s 1660 500
 m 5 -2 d s 1665 498 m 4 -2 d s 1690 488 m 2 -1 d s 1692 487 m 4 -2 d s 1696 485
 m 5 -1 d s 1701 484 m 5 -2 d s 1706 482 m 4 -2 d s 1710 480 m 1 X s 1732 471 m
 1 X s 1733 471 m 4 -2 d s 1737 469 m 5 -1 d s 1742 468 m 4 -2 d s 1746 466 m 5
 -2 d s 1751 464 m 2 -1 d s 1774 455 m 4 -1 d s 1778 454 m 5 -2 d s 1783 452 m 4
 -2 d s 1787 450 m 5 -2 d s 1792 448 m 3 -1 d s 1817 439 m 2 -1 d s 1819 438 m 4
 -2 d s 1823 436 m 5 -1 d s 1828 435 m 5 -2 d s 1833 433 m 4 -2 d s 1837 431 m 1
 X s 1859 423 m 1 X s 1860 423 m 4 -2 d s 1864 421 m 5 -2 d s 1869 419 m 4 -1 d
 s 1873 418 m 5 -2 d s 1878 416 m 2 -1 d s 1902 407 m 3 -1 d s 1905 406 m 5 -2 d
 s 1910 404 m 4 -2 d s 1914 402 m 5 -1 d s 1919 401 m 4 -2 d s 1944 391 m 2 X s
 1946 391 m 4 -2 d s 1950 389 m 5 -1 d s 1955 388 m 5 -2 d s 1960 386 m 4 -2 d s
 1964 384 m 1 X s 1987 376 m 4 -2 d s 1991 374 m 5 -1 d s 1996 373 m 4 -2 d s
 2000 371 m 5 -1 d s 2005 370 m 3 -2 d s 2030 361 m 2 -1 d s 2032 360 m 5 -2 d s
 2037 358 m 4 -1 d s 1814 1247 227 227 C 2268 2269 0 -284 C 0 1 0 c /w 16
 def /w2 {w 2 div} def /w3 {w 3 div} def 239 1425 m20 271 1392 m20 303 1361 m20
 337 1330 m20 370 1300 m20 405 1270 m20 440 1241 m20 476 1213 m20 512 1186 m20
 548 1159 m20 585 1132 m20 622 1107 m20 660 1081 m20 698 1057 m20 737 1033 m20
 775 1009 m20 814 986 m20 854 963 m20 893 941 m20 933 919 m20 973 898 m20 1013
 877 m20 1054 856 m20 1094 836 m20 1135 816 m20 1176 797 m20 1217 777 m20 1258
 759 m20 1300 740 m20 1341 722 m20 1383 704 m20 1425 686 m20 1466 669 m20 1508
 652 m20 1551 635 m20 1593 618 m20 1635 602 m20 1677 585 m20 1720 569 m20 1762
 554 m20 1805 538 m20 1848 523 m20 1890 507 m20 1933 492 m20 1976 478 m20 2019
 463 m20 1814 1247 227 227 C 2268 2269 0 -284 C 240 1368 m20 274 1338 m20 308
 1308 m20 343 1279 m20 378 1251 m20 414 1223 m20 450 1195 m20 486 1168 m20 523
 1141 m20 560 1115 m20 598 1090 m20 636 1065 m20 674 1040 m20 712 1016 m20 751
 992 m20 790 969 m20 829 946 m20 869 924 m20 908 902 m20 948 881 m20 988 860 m20
 1029 839 m20 1069 819 m20 1110 799 m20 1151 779 m20 1192 760 m20 1233 741 m20
 1274 722 m20 1316 703 m20 1357 685 m20 1399 667 m20 1441 649 m20 1483 632 m20
 1525 615 m20 1567 598 m20 1609 581 m20 1651 564 m20 1693 548 m20 1736 532 m20
 1778 516 m20 1821 500 m20 1863 485 m20 1906 469 m20 1949 454 m20 1992 439 m20
 2034 424 m20 1814 1247 227 227 C 0 0 1 c 231 1440 m 5 -5 d 4 -4 d 5 -5 d 4 -5 d
 5 -5 d 5 -5 d 4 -4 d 5 -5 d 4 -5 d 5 -4 d 4 -5 d 5 -5 d 4 -4 d 5 -5 d 4 -4 d 5
 -5 d 4 -4 d 5 -4 d 5 -5 d 4 -4 d 5 -4 d 4 -5 d 5 -4 d 4 -4 d 5 -4 d 4 -5 d 5 -4
 d 4 -4 d 5 -4 d 4 -4 d 5 -4 d 4 -4 d 5 -4 d 5 -4 d 4 -4 d 5 -4 d 4 -4 d 5 -4 d
 4 -4 d 5 -4 d 4 -4 d 5 -3 d 4 -4 d 5 -4 d 4 -4 d 5 -3 d 5 -4 d 4 -4 d 5 -4 d 4
 -3 d 5 -4 d 4 -4 d 5 -3 d 4 -4 d 5 -3 d 4 -4 d 5 -4 d 4 -3 d 5 -4 d 4 -3 d 5 -4
 d 5 -3 d 4 -4 d 5 -3 d 4 -3 d 5 -4 d 4 -3 d 5 -4 d 4 -3 d 5 -3 d 4 -4 d 5 -3 d
 4 -3 d 5 -4 d 5 -3 d 4 -3 d 5 -3 d 4 -4 d 5 -3 d 4 -3 d 5 -3 d 4 -3 d 5 -4 d 4
 -3 d 5 -3 d 4 -3 d 5 -3 d 5 -3 d 4 -3 d 5 -3 d 4 -3 d 5 -4 d 4 -3 d 5 -3 d 4 -3
 d 5 -3 d 4 -3 d 5 -3 d 4 -3 d 5 -3 d 4 -3 d 5 -2 d 5 -3 d 4 -3 d 5 -3 d 4 -3 d
 5 -3 d 4 -3 d 5 -3 d 4 -3 d 5 -3 d 4 -2 d 5 -3 d 4 -3 d 5 -3 d 5 -3 d 4 -2 d 5
 -3 d 4 -3 d 5 -3 d 4 -3 d 5 -2 d 4 -3 d 5 -3 d 4 -2 d 5 -3 d 4 -3 d 5 -3 d 4 -2
 d 5 -3 d 5 -3 d 4 -2 d 5 -3 d 4 -3 d 5 -2 d 4 -3 d 5 -2 d 4 -3 d 5 -3 d 4 -2 d
 5 -3 d 4 -2 d 5 -3 d 5 -3 d 4 -2 d 5 -3 d 4 -2 d 5 -3 d 4 -2 d 5 -3 d 4 -2 d 5
 -3 d 4 -2 d 5 -3 d 4 -2 d 5 -3 d 4 -2 d 5 -3 d 5 -2 d 4 -3 d 5 -2 d 4 -2 d 5 -3
 d 4 -2 d 5 -3 d 4 -2 d 5 -2 d 4 -3 d 5 -2 d 4 -3 d 5 -2 d 5 -2 d 4 -3 d 5 -2 d
 4 -2 d 5 -3 d 4 -2 d 5 -2 d 4 -3 d 5 -2 d 4 -2 d 5 -3 d 4 -2 d 5 -2 d 4 -3 d 5
 -2 d 5 -2 d 4 -2 d 5 -3 d 4 -2 d 5 -2 d 4 -2 d 5 -3 d 4 -2 d 5 -2 d 4 -2 d 5 -3
 d 4 -2 d 5 -2 d 5 -2 d 4 -2 d 5 -3 d 4 -2 d 5 -2 d 4 -2 d 5 -2 d 4 -2 d 5 -3 d
 4 -2 d 5 -2 d 4 -2 d 5 -2 d 5 -2 d 4 -3 d 5 -2 d 4 -2 d 5 -2 d 4 -2 d 5 -2 d 4
 -2 d 5 -2 d 4 -2 d 5 -2 d 4 -3 d 5 -2 d 4 -2 d 5 -2 d 5 -2 d 4 -2 d 5 -2 d 4 -2
 d 5 -2 d 4 -2 d 5 -2 d 4 -2 d 5 -2 d 4 -2 d 5 -2 d 4 -2 d 5 -2 d 5 -2 d 4 -2 d
 5 -2 d 4 -2 d 5 -2 d 4 -2 d 5 -2 d 4 -2 d 5 -2 d 4 -2 d 5 -2 d 4 -2 d 5 -2 d 4
 -2 d 5 -2 d 5 -2 d 4 -2 d 5 -2 d 4 -2 d 5 -2 d 4 -2 d 5 -2 d 4 -1 d 5 -2 d 4 -2
 d 5 -2 d 4 -2 d 5 -2 d 5 -2 d 4 -2 d 5 -2 d 4 -2 d 5 -1 d 4 -2 d 5 -2 d 4 -2 d
 5 -2 d 4 -2 d 5 -2 d 4 -2 d 5 -1 d 4 -2 d 5 -2 d 5 -2 d 4 -2 d 5 -2 d 4 -1 d 5
 -2 d 4 -2 d 5 -2 d 4 -2 d 5 -2 d 4 -1 d 5 -2 d 4 -2 d 5 -2 d 5 -2 d 4 -1 d 5 -2
 d 4 -2 d 5 -2 d 4 -2 d 5 -1 d 4 -2 d 5 -2 d 4 -2 d 5 -1 d 4 -2 d 5 -2 d 4 -2 d
 5 -1 d 5 -2 d 4 -2 d 5 -2 d 4 -1 d 5 -2 d 4 -2 d 5 -2 d 4 -1 d 5 -2 d 4 -2 d 5
 -2 d 4 -1 d 5 -2 d 5 -2 d 4 -2 d 5 -1 d 4 -2 d 5 -2 d 4 -1 d 5 -2 d 4 -2 d 5 -1
 d 4 -2 d 5 -2 d 4 -1 d 5 -2 d 5 -2 d 4 -2 d 5 -1 d 4 -2 d 5 -2 d 4 -1 d 5 -2 d
 4 -2 d 5 -1 d 4 -2 d 5 -2 d 4 -1 d 5 -2 d 4 -1 d 5 -2 d 5 -2 d 4 -1 d 5 -2 d 4
 -2 d 5 -1 d 4 -2 d 5 -2 d 4 -1 d 5 -2 d 4 -1 d 5 -2 d 4 -2 d 5 -1 d 5 -2 d 4 -2
 d 5 -1 d 4 -2 d 5 -1 d 4 -2 d 5 -2 d 4 -1 d 5 -2 d 4 -1 d 5 -2 d 4 -1 d 5 -2 d
 4 -2 d 5 -1 d 5 -2 d 4 -1 d 5 -2 d 4 -2 d 5 -1 d 4 -2 d 5 -1 d 4 -2 d 5 -1 d 4
 -2 d 5 -1 d 4 -2 d 5 -2 d 5 -1 d 4 -2 d 5 -1 d 4 -2 d 5 -1 d 4 -2 d s 231 1377
 m 5 -4 d 4 -5 d 5 -4 d 4 -4 d 5 -5 d 5 -4 d 4 -5 d 5 -4 d 4 -4 d 5 -5 d 4 -4 d
 5 -4 d 4 -4 d 5 -4 d 4 -5 d 5 -4 d 4 -4 d 5 -4 d 5 -4 d 4 -4 d 5 -4 d 4 -4 d 5
 -4 d 4 -4 d 5 -4 d 4 -4 d 5 -4 d 4 -4 d 5 -3 d 4 -4 d 5 -4 d 4 -4 d 5 -4 d 5 -3
 d 4 -4 d 5 -4 d 4 -4 d 5 -3 d 4 -4 d 5 -4 d 4 -3 d 5 -4 d 4 -4 d 5 -3 d 4 -4 d
 5 -3 d 5 -4 d 4 -4 d 5 -3 d 4 -4 d 5 -3 d 4 -4 d 5 -3 d 4 -3 d 5 -4 d 4 -3 d 5
 -4 d 4 -3 d 5 -4 d 4 -3 d 5 -3 d 5 -4 d 4 -3 d 5 -3 d 4 -4 d 5 -3 d 4 -3 d 5 -3
 d 4 -4 d 5 -3 d 4 -3 d 5 -3 d 4 -3 d 5 -4 d 5 -3 d 4 -3 d 5 -3 d 4 -3 d 5 -3 d
 4 -4 d 5 -3 d 4 -3 d 5 -3 d 4 -3 d 5 -3 d 4 -3 d 5 -3 d 5 -3 d 4 -3 d 5 -3 d 4
 -3 d 5 -3 d 4 -3 d 5 -3 d 4 -3 d 5 -3 d 4 -3 d 5 -3 d 4 -3 d 5 -3 d 4 -2 d 5 -3
 d 5 -3 d 4 -3 d 5 -3 d 4 -3 d 5 -3 d 4 -2 d 5 -3 d 4 -3 d 5 -3 d 4 -3 d 5 -2 d
 4 -3 d 5 -3 d 5 -3 d 4 -2 d 5 -3 d 4 -3 d 5 -3 d 4 -2 d 5 -3 d 4 -3 d 5 -2 d 4
 -3 d 5 -3 d 4 -2 d 5 -3 d 4 -3 d 5 -2 d 5 -3 d 4 -3 d 5 -2 d 4 -3 d 5 -2 d 4 -3
 d 5 -3 d 4 -2 d 5 -3 d 4 -2 d 5 -3 d 4 -2 d 5 -3 d 5 -2 d 4 -3 d 5 -2 d 4 -3 d
 5 -2 d 4 -3 d 5 -2 d 4 -3 d 5 -2 d 4 -3 d 5 -2 d 4 -3 d 5 -2 d 4 -3 d 5 -2 d 5
 -2 d 4 -3 d 5 -2 d 4 -3 d 5 -2 d 4 -3 d 5 -2 d 4 -2 d 5 -3 d 4 -2 d 5 -2 d 4 -3
 d 5 -2 d 5 -2 d 4 -3 d 5 -2 d 4 -2 d 5 -3 d 4 -2 d 5 -2 d 4 -3 d 5 -2 d 4 -2 d
 5 -3 d 4 -2 d 5 -2 d 4 -2 d 5 -3 d 5 -2 d 4 -2 d 5 -2 d 4 -3 d 5 -2 d 4 -2 d 5
 -2 d 4 -2 d 5 -3 d 4 -2 d 5 -2 d 4 -2 d 5 -3 d 5 -2 d 4 -2 d 5 -2 d 4 -2 d 5 -2
 d 4 -3 d 5 -2 d 4 -2 d 5 -2 d 4 -2 d 5 -2 d 4 -2 d 5 -3 d 5 -2 d 4 -2 d 5 -2 d
 4 -2 d 5 -2 d 4 -2 d 5 -2 d 4 -2 d 5 -3 d 4 -2 d 5 -2 d 4 -2 d 5 -2 d 4 -2 d 5
 -2 d 5 -2 d 4 -2 d 5 -2 d 4 -2 d 5 -2 d 4 -2 d 5 -2 d 4 -2 d 5 -2 d 4 -2 d 5 -2
 d 4 -2 d 5 -2 d 5 -2 d 4 -2 d 5 -2 d 4 -2 d 5 -2 d 4 -2 d 5 -2 d 4 -2 d 5 -2 d
 4 -2 d 5 -2 d 4 -2 d 5 -2 d 4 -2 d 5 -2 d 5 -2 d 4 -2 d 5 -2 d 4 -2 d 5 -2 d 4
 -2 d 5 -2 d 4 -2 d 5 -2 d 4 -1 d 5 -2 d 4 -2 d 5 -2 d 5 -2 d 4 -2 d 5 -2 d 4 -2
 d 5 -2 d 4 -2 d 5 -1 d 4 -2 d 5 -2 d 4 -2 d 5 -2 d 4 -2 d 5 -2 d 4 -2 d 5 -1 d
 5 -2 d 4 -2 d 5 -2 d 4 -2 d 5 -2 d 4 -2 d 5 -1 d 4 -2 d 5 -2 d 4 -2 d 5 -2 d 4
 -1 d 5 -2 d 5 -2 d 4 -2 d 5 -2 d 4 -2 d 5 -1 d 4 -2 d 5 -2 d 4 -2 d 5 -2 d 4 -1
 d 5 -2 d 4 -2 d 5 -2 d 4 -1 d 5 -2 d 5 -2 d 4 -2 d 5 -1 d 4 -2 d 5 -2 d 4 -2 d
 5 -2 d 4 -1 d 5 -2 d 4 -2 d 5 -2 d 4 -1 d 5 -2 d 5 -2 d 4 -1 d 5 -2 d 4 -2 d 5
 -2 d 4 -1 d 5 -2 d 4 -2 d 5 -2 d 4 -1 d 5 -2 d 4 -2 d 5 -1 d 5 -2 d 4 -2 d 5 -1
 d 4 -2 d 5 -2 d 4 -1 d 5 -2 d 4 -2 d 5 -2 d 4 -1 d 5 -2 d 4 -2 d 5 -1 d 4 -2 d
 5 -2 d 5 -1 d 4 -2 d 5 -2 d 4 -1 d 5 -2 d 4 -2 d 5 -1 d 4 -2 d 5 -1 d 4 -2 d 5
 -2 d 4 -1 d 5 -2 d 5 -2 d 4 -1 d 5 -2 d 4 -1 d 5 -2 d 4 -2 d 5 -1 d 4 -2 d 5 -2
 d 4 -1 d 5 -2 d 4 -1 d 5 -2 d 4 -2 d 5 -1 d 5 -2 d 4 -1 d 5 -2 d 4 -2 d 5 -1 d
 4 -2 d 5 -1 d 4 -2 d 5 -1 d 4 -2 d 5 -2 d 4 -1 d 5 -2 d 5 -1 d 4 -2 d 5 -1 d 4
 -2 d 5 -2 d 4 -1 d s 2268 1701 0 0 C NC 4 lw black 1814 1247 227 227 bl 2268
 1701 0 0 C
 /xs 0 def 
(m)
 /Times-Bold     67 stwn 
(H)
 /Times-Bold     47 stwn 
( \(GeV\))
 /Times-Bold     67 stwn 
 gsave  2041 91
 t   0 r  xs neg 0 t 0 0 m
 /Times-Bold findfont   67 sf 0    0 m 
(m)
 show 
 currentpoint pop 0 t 
 /Times-Bold findfont   47 sf 0  -22 m 
(H)
 show 
 currentpoint pop 0 t 
 /Times-Bold findfont   67 sf 0    0 m 
( \(GeV\))
 show 
 gr 
 /xs 0 def 
(uncertainty band for\040)
 /Times-Bold     67 stwn 
(s)
 /Symbol     67 stwn 
(  \040)
 /Times-Bold     67 stwn 
(s)
 /Symbol     67 stwn 
(A)
 /Special     67 stwn 
(Ds)
 /Symbol     67 stwn 
(A)
 /Special     47 stwn 
( \(fb\))
 /Times-Bold     67 stwn 
 gsave  68 1474
 t  90 r  xs neg 0 t 0 0 m
 /Times-Bold findfont   67 sf 0    0 m 
(uncertainty band for\040)
 show 
 currentpoint pop 0 t 
 /Symbol findfont   67 sf 0    0 m 
(s)
 show 
 currentpoint pop 0 t 
 /Times-Bold findfont   67 sf 0    0 m 
(  \040)
 show 
 currentpoint pop 0 t 
 /Symbol findfont   67 sf 0    0 m 
(s)
 show 
 currentpoint pop 0 t 
 /Special findfont   67 sf 0    0 m 
(A)
 show 
 currentpoint pop 0 t 
 /Symbol findfont   67 sf 0    0 m 
(Ds)
 show 
 currentpoint pop 0 t 
 /Special findfont   47 sf 0  -22 m 
(A)
 show 
 currentpoint pop 0 t 
 /Times-Bold findfont   67 sf 0    0 m 
( \(fb\))
 show 
 gr  1 0 0 c
 gsave  1134 1327
 t   0 r 0 0 m
 /Times-Bold findfont   67 sf 0    0 m 
(4FS gg)
 show 
 currentpoint pop 0 t 
 /Special findfont   67 sf 0    0 m 
(5)
 show 
 currentpoint pop 0 t 
 /Times-Bold findfont   67 sf 0    0 m 
(bbH \(NLO\))
 show 
 gr  0 1 0 c
 gsave  1134 1202
 t   0 r 0 0 m
 /Times-Bold findfont   67 sf 0    0 m 
(5FS bb)
 show 
 currentpoint pop 0 t 
 /Special findfont   67 sf 0    0 m 
(5)
 show 
 currentpoint pop 0 t 
 /Times-Bold findfont   67 sf 0    0 m 
(H \(NNLO\))
 show 
 gr  0 0 1 c
 gsave  1134 1077
 t   0 r 0 0 m
 /Times-Bold findfont   67 sf 0    0 m 
(matched)
 show 
 gr  black
 gsave  318 578
 t   0 r 0 0 m
 /Special findfont   67 sf 0    0 m 
(R)
 show 
 currentpoint pop 0 t 
 /Times-Bold findfont   67 sf 0    0 m 
(s =7 TeV)
 show 
 gr 
 gsave  318 454
 t   0 r 0 0 m
 /Symbol findfont   67 sf 0    0 m 
(m)
 show 
 currentpoint pop 0 t 
 /Times-Bold findfont   67 sf 0    0 m 
(=\(2m)
 show 
 currentpoint pop 0 t 
 /Times-Bold findfont   47 sf 0  -22 m 
(b)
 show 
 currentpoint pop 0 t 
 /Times-Bold findfont   67 sf 0    0 m 
(+m)
 show 
 currentpoint pop 0 t 
 /Times-Bold findfont   47 sf 0  -22 m 
(H)
 show 
 currentpoint pop 0 t 
 /Times-Bold findfont   67 sf 0    0 m 
(\)/4)
 show 
 gr 
 gsave  318 329
 t   0 r 0 0 m
 /Times-Bold findfont   67 sf 0    0 m 
(MSTW2008)
 show 
 gr  1814 1247 227 227 C 2268 2269 0 -284 C 8 lw 1 0 0 c 907 1349 m 23 X s 953
 1349 m 22 X s 998 1349 m 23 X s 1043 1349 m 23 X s 1814 1247 227 227 C 2268
 2269 0 -284 C 0 1 0 c 919 1225 m20 964 1225 m20 1009 1225 m20 1055 1225 m20
 1814 1247 227 227 C 0 0 1 c 907 1100 m 182 X s
 gr  gr 
showpage
end
%%EOF
