%!PS-Adobe-1.0
%%Creator: Unified Graphics System
%%Pages: (atend)
%%DocumentFonts: Courier
%%BoundingBox:   99  205  481  565
%%EndComments
/Sw{setlinewidth}def
/Sg{setgray}def
/Sd{setdash}def
/P {newpath
    moveto
0 0 rlineto
    stroke}def
/M {moveto}def
/D {lineto}def
/N {newpath}def
/S {stroke}def
/T {/Courier findfont
    exch
    scalefont
    setfont}def
/R {rotate}def
/W {show}def
/F {fill}def
/X {gsave}def
/Y {grestore}def
%%EndProlog
%%Page: 1 1
0.24000 0.24000 scale
1 setlinecap
1 setlinejoin
4 Sw
0 0 0 setrgbcolor
[] 0 Sd
N
885 2259 M
885 2227 D
S
N
887 2259 M
887 2227 D
S
N
887 2254 M
890 2257 D
893 2259 D
896 2259 D
901 2257 D
904 2254 D
905 2249 D
905 2246 D
904 2242 D
901 2239 D
896 2237 D
893 2237 D
890 2239 D
887 2242 D
S
N
896 2259 M
899 2257 D
902 2254 D
904 2249 D
904 2246 D
902 2242 D
899 2239 D
896 2237 D
S
N
881 2259 M
887 2259 D
S
N
881 2227 M
892 2227 D
S
N
917 2259 M
917 2227 D
S
N
919 2259 M
919 2227 D
S
N
919 2254 M
922 2257 D
925 2259 D
928 2259 D
932 2257 D
935 2254 D
937 2249 D
937 2246 D
935 2242 D
932 2239 D
928 2237 D
925 2237 D
922 2239 D
919 2242 D
S
N
928 2259 M
931 2257 D
934 2254 D
935 2249 D
935 2246 D
934 2242 D
931 2239 D
928 2237 D
S
N
913 2259 M
919 2259 D
S
N
913 2227 M
923 2227 D
S
N
994 2254 M
999 2251 D
994 2248 D
S
N
990 2259 M
997 2251 D
990 2243 D
S
N
972 2251 M
997 2251 D
S
N
1036 2269 M
1036 2237 D
S
N
1038 2269 M
1038 2237 D
S
N
1056 2269 M
1056 2237 D
S
N
1058 2269 M
1058 2237 D
S
N
1032 2269 M
1042 2269 D
S
N
1052 2269 M
1062 2269 D
S
N
1038 2254 M
1056 2254 D
S
N
1032 2237 M
1042 2237 D
S
N
1052 2237 M
1062 2237 D
S
N
1073 2269 M
1073 2243 D
1074 2239 D
1077 2237 D
1080 2237 D
1083 2239 D
1085 2242 D
S
N
1074 2269 M
1074 2243 D
1076 2239 D
1077 2237 D
S
N
1068 2259 M
1080 2259 D
S
N
1095 2269 M
1095 2243 D
1097 2239 D
1100 2237 D
1103 2237 D
1106 2239 D
1107 2242 D
S
N
1097 2269 M
1097 2243 D
1098 2239 D
1100 2237 D
S
N
1091 2259 M
1103 2259 D
S
N
1086 2278 M
1119 2278 D
S
N
1215 2269 M
1215 2237 D
S
N
1216 2269 M
1216 2237 D
S
N
1215 2254 M
1212 2257 D
1208 2259 D
1205 2259 D
1201 2257 D
1198 2254 D
1196 2249 D
1196 2246 D
1198 2242 D
1201 2239 D
1205 2237 D
1208 2237 D
1212 2239 D
1215 2242 D
S
N
1205 2259 M
1202 2257 D
1199 2254 D
1198 2249 D
1198 2246 D
1199 2242 D
1202 2239 D
1205 2237 D
S
N
1210 2269 M
1216 2269 D
S
N
1215 2237 M
1221 2237 D
S
N
1252 2259 M
1237 2259 D
1233 2257 D
1230 2252 D
1228 2248 D
1228 2243 D
1230 2240 D
1231 2239 D
1234 2237 D
1237 2237 D
1242 2239 D
1245 2243 D
1246 2248 D
1246 2252 D
1245 2256 D
1243 2257 D
1240 2259 D
S
N
1237 2259 M
1234 2257 D
1231 2252 D
1230 2248 D
1230 2242 D
1231 2239 D
S
N
1237 2237 M
1240 2239 D
1243 2243 D
1245 2248 D
1245 2254 D
1243 2257 D
S
N
1243 2257 M
1252 2257 D
S
N
1285 2275 M
1258 2227 D
S
N
1311 2269 M
1311 2237 D
S
N
1313 2269 M
1313 2237 D
S
N
1311 2254 M
1308 2257 D
1305 2259 D
1302 2259 D
1298 2257 D
1295 2254 D
1293 2249 D
1293 2246 D
1295 2242 D
1298 2239 D
1302 2237 D
1305 2237 D
1308 2239 D
1311 2242 D
S
N
1302 2259 M
1299 2257 D
1296 2254 D
1295 2249 D
1295 2246 D
1296 2242 D
1299 2239 D
1302 2237 D
S
N
1307 2269 M
1313 2269 D
S
N
1311 2237 M
1317 2237 D
S
N
1328 2269 M
1328 2237 D
S
N
1329 2269 M
1329 2237 D
S
N
1347 2269 M
1347 2237 D
S
N
1349 2269 M
1349 2237 D
S
N
1323 2269 M
1334 2269 D
S
N
1343 2269 M
1353 2269 D
S
N
1329 2254 M
1347 2254 D
S
N
1323 2237 M
1334 2237 D
S
N
1343 2237 M
1353 2237 D
S
N
1367 2246 M
1367 2225 D
S
N
1368 2246 M
1368 2225 D
S
N
1361 2246 M
1360 2240 D
1360 2246 D
1376 2246 D
1376 2240 D
1375 2246 D
S
N
1364 2225 M
1372 2225 D
S
N
1410 2275 M
1410 2227 D
S
N
1411 2275 M
1411 2227 D
S
N
1410 2275 M
1420 2275 D
S
N
1410 2227 M
1420 2227 D
S
N
1432 2259 M
1432 2227 D
S
N
1434 2259 M
1434 2227 D
S
N
1434 2254 M
1437 2257 D
1440 2259 D
1443 2259 D
1447 2257 D
1451 2254 D
1452 2249 D
1452 2246 D
1451 2242 D
1447 2239 D
1443 2237 D
1440 2237 D
1437 2239 D
1434 2242 D
S
N
1443 2259 M
1446 2257 D
1449 2254 D
1451 2249 D
1451 2246 D
1449 2242 D
1446 2239 D
1443 2237 D
S
N
1428 2259 M
1434 2259 D
S
N
1428 2227 M
1438 2227 D
S
N
1464 2269 M
1464 2237 D
S
N
1466 2269 M
1466 2237 D
S
N
1466 2254 M
1469 2257 D
1472 2259 D
1475 2259 D
1479 2257 D
1482 2254 D
1484 2249 D
1484 2246 D
1482 2242 D
1479 2239 D
1475 2237 D
1472 2237 D
1469 2239 D
1466 2242 D
S
N
1475 2259 M
1478 2257 D
1481 2254 D
1482 2249 D
1482 2246 D
1481 2242 D
1478 2239 D
1475 2237 D
S
N
1460 2269 M
1466 2269 D
S
N
1502 2275 M
1502 2227 D
S
N
1503 2275 M
1503 2227 D
S
N
1493 2275 M
1503 2275 D
S
N
1493 2227 M
1503 2227 D
S
N
1565 2255 M
1565 2254 D
1564 2254 D
1564 2255 D
1565 2257 D
1568 2259 D
1574 2259 D
1577 2257 D
1579 2255 D
1580 2252 D
1580 2242 D
1582 2239 D
1583 2237 D
S
N
1579 2255 M
1579 2242 D
1580 2239 D
1583 2237 D
1585 2237 D
S
N
1579 2252 M
1577 2251 D
1568 2249 D
1564 2248 D
1562 2245 D
1562 2242 D
1564 2239 D
1568 2237 D
1573 2237 D
1576 2239 D
1579 2242 D
S
N
1568 2249 M
1565 2248 D
1564 2245 D
1564 2242 D
1565 2239 D
1568 2237 D
S
N
1595 2269 M
1595 2243 D
1597 2239 D
1600 2237 D
1603 2237 D
1606 2239 D
1607 2242 D
S
N
1597 2269 M
1597 2243 D
1598 2239 D
1600 2237 D
S
N
1591 2259 M
1603 2259 D
S
N
1642 2269 M
1642 2237 D
S
N
1644 2269 M
1644 2237 D
S
N
1638 2269 M
1648 2269 D
S
N
1638 2237 M
1660 2237 D
1660 2246 D
1659 2237 D
S
N
1669 2269 M
1669 2237 D
S
N
1671 2269 M
1671 2237 D
S
N
1689 2269 M
1689 2237 D
S
N
1690 2269 M
1690 2237 D
S
N
1665 2269 M
1675 2269 D
S
N
1684 2269 M
1695 2269 D
S
N
1671 2254 M
1689 2254 D
S
N
1665 2237 M
1675 2237 D
S
N
1684 2237 M
1695 2237 D
S
N
1724 2265 M
1725 2260 D
1725 2269 D
1724 2265 D
1721 2268 D
1716 2269 D
1713 2269 D
1709 2268 D
1706 2265 D
1704 2262 D
1703 2257 D
1703 2249 D
1704 2245 D
1706 2242 D
1709 2239 D
1713 2237 D
1716 2237 D
1721 2239 D
1724 2242 D
1725 2245 D
S
N
1713 2269 M
1710 2268 D
1707 2265 D
1706 2262 D
1704 2257 D
1704 2249 D
1706 2245 D
1707 2242 D
1710 2239 D
1713 2237 D
S
N
1758 2269 M
1758 2260 D
S
N
1758 2263 M
1760 2266 D
1763 2269 D
1766 2269 D
1774 2265 D
1777 2265 D
1778 2266 D
1780 2269 D
S
N
1760 2266 M
1763 2268 D
1766 2268 D
1774 2265 D
S
N
1780 2269 M
1780 2265 D
1778 2260 D
1772 2252 D
1770 2249 D
1769 2245 D
1769 2237 D
S
N
1778 2260 M
1770 2252 D
1769 2249 D
1767 2245 D
1767 2237 D
S
N
1822 2269 M
1822 2237 D
S
N
1823 2269 M
1823 2237 D
S
N
1813 2269 M
1811 2260 D
1811 2269 D
1834 2269 D
1834 2260 D
1832 2269 D
S
N
1817 2237 M
1828 2237 D
S
N
1843 2249 M
1861 2249 D
1861 2252 D
1860 2255 D
1858 2257 D
1855 2259 D
1850 2259 D
1846 2257 D
1843 2254 D
1841 2249 D
1841 2246 D
1843 2242 D
1846 2239 D
1850 2237 D
1854 2237 D
1858 2239 D
1861 2242 D
S
N
1860 2249 M
1860 2254 D
1858 2257 D
S
N
1850 2259 M
1847 2257 D
1844 2254 D
1843 2249 D
1843 2246 D
1844 2242 D
1847 2239 D
1850 2237 D
S
N
1870 2269 M
1881 2237 D
S
N
1872 2269 M
1881 2242 D
S
N
1891 2269 M
1881 2237 D
S
N
1867 2269 M
1876 2269 D
S
N
1885 2269 M
1894 2269 D
S
3 Sw
N
1455 2186 M
1455 2185 D
1453 2185 D
1453 2186 D
1455 2188 D
1458 2189 D
1464 2189 D
1467 2188 D
1468 2186 D
1470 2183 D
1470 2173 D
1471 2170 D
1473 2168 D
S
N
1468 2186 M
1468 2173 D
1470 2170 D
1473 2168 D
1474 2168 D
S
N
1468 2183 M
1467 2182 D
1458 2180 D
1453 2179 D
1452 2176 D
1452 2173 D
1453 2170 D
1458 2168 D
1462 2168 D
1465 2170 D
1468 2173 D
S
N
1458 2180 M
1455 2179 D
1453 2176 D
1453 2173 D
1455 2170 D
1458 2168 D
S
N
1485 2200 M
1485 2168 D
S
N
1486 2200 M
1495 2173 D
S
N
1485 2200 M
1495 2168 D
S
N
1506 2200 M
1495 2168 D
S
N
1506 2200 M
1506 2168 D
S
N
1508 2200 M
1508 2168 D
S
N
1480 2200 M
1486 2200 D
S
N
1506 2200 M
1512 2200 D
S
N
1480 2168 M
1489 2168 D
S
N
1502 2168 M
1512 2168 D
S
N
1541 2195 M
1542 2191 D
1542 2200 D
1541 2195 D
1538 2198 D
1533 2200 D
1530 2200 D
1526 2198 D
1523 2195 D
1521 2192 D
1520 2188 D
1520 2180 D
1521 2176 D
1523 2173 D
1526 2170 D
1530 2168 D
1533 2168 D
1538 2170 D
1541 2173 D
1542 2176 D
S
N
1530 2200 M
1527 2198 D
1524 2195 D
1523 2192 D
1521 2188 D
1521 2180 D
1523 2176 D
1524 2173 D
1527 2170 D
1530 2168 D
S
N
1574 2188 M
1572 2191 D
1569 2192 D
1565 2192 D
1562 2191 D
1560 2189 D
1559 2185 D
1559 2180 D
1560 2177 D
1563 2176 D
1568 2176 D
1571 2177 D
1572 2180 D
S
N
1565 2192 M
1562 2189 D
1560 2185 D
1560 2180 D
1562 2177 D
1563 2176 D
S
N
1574 2192 M
1572 2180 D
1572 2177 D
1575 2176 D
1579 2176 D
1582 2179 D
1583 2183 D
1583 2186 D
1582 2191 D
1580 2194 D
1577 2197 D
1574 2198 D
1569 2200 D
1565 2200 D
1560 2198 D
1557 2197 D
1554 2194 D
1553 2191 D
1551 2186 D
1551 2182 D
1553 2177 D
1554 2174 D
1557 2171 D
1560 2170 D
1565 2168 D
1569 2168 D
1574 2170 D
1577 2171 D
1579 2173 D
S
N
1575 2192 M
1574 2180 D
1574 2177 D
1575 2176 D
S
N
1595 2200 M
1595 2168 D
S
N
1597 2200 M
1615 2171 D
S
N
1597 2197 M
1615 2168 D
S
N
1615 2200 M
1615 2168 D
S
N
1591 2200 M
1597 2200 D
S
N
1610 2200 M
1619 2200 D
S
N
1591 2168 M
1600 2168 D
S
N
1630 2200 M
1630 2168 D
S
N
1631 2200 M
1631 2168 D
S
N
1625 2200 M
1636 2200 D
S
N
1625 2168 M
1648 2168 D
1648 2177 D
1646 2168 D
S
N
1665 2200 M
1660 2198 D
1657 2195 D
1655 2192 D
1654 2186 D
1654 2182 D
1655 2176 D
1657 2173 D
1660 2170 D
1665 2168 D
1668 2168 D
1672 2170 D
1675 2173 D
1677 2176 D
1678 2182 D
1678 2186 D
1677 2192 D
1675 2195 D
1672 2198 D
1668 2200 D
1665 2200 D
S
N
1665 2200 M
1662 2198 D
1659 2195 D
1657 2192 D
1655 2186 D
1655 2182 D
1657 2176 D
1659 2173 D
1662 2170 D
1665 2168 D
S
N
1668 2168 M
1671 2170 D
1674 2173 D
1675 2176 D
1677 2182 D
1677 2186 D
1675 2192 D
1674 2195 D
1671 2198 D
1668 2200 D
S
N
1702 2195 M
1702 2168 D
S
N
1689 2182 M
1716 2182 D
S
N
1729 2200 M
1729 2168 D
S
N
1731 2200 M
1731 2168 D
S
N
1731 2185 M
1734 2188 D
1738 2189 D
1742 2189 D
1746 2188 D
1748 2185 D
1748 2168 D
S
N
1742 2189 M
1745 2188 D
1746 2185 D
1746 2168 D
S
N
1725 2200 M
1731 2200 D
S
N
1725 2168 M
1735 2168 D
S
N
1742 2168 M
1752 2168 D
S
N
1761 2180 M
1779 2180 D
1779 2183 D
1778 2186 D
1776 2188 D
1773 2189 D
1769 2189 D
1764 2188 D
1761 2185 D
1760 2180 D
1760 2177 D
1761 2173 D
1764 2170 D
1769 2168 D
1772 2168 D
1776 2170 D
1779 2173 D
S
N
1778 2180 M
1778 2185 D
1776 2188 D
S
N
1769 2189 M
1766 2188 D
1763 2185 D
1761 2180 D
1761 2177 D
1763 2173 D
1766 2170 D
1769 2168 D
S
N
1791 2189 M
1791 2168 D
S
N
1793 2189 M
1793 2168 D
S
N
1793 2180 M
1794 2185 D
1797 2188 D
1800 2189 D
1805 2189 D
1806 2188 D
1806 2186 D
1805 2185 D
1803 2186 D
1805 2188 D
S
N
1787 2189 M
1793 2189 D
S
N
1787 2168 M
1797 2168 D
S
N
1815 2189 M
1822 2168 D
S
N
1817 2189 M
1822 2173 D
S
N
1828 2189 M
1822 2168 D
S
N
1828 2189 M
1834 2168 D
S
N
1829 2189 M
1834 2173 D
S
N
1840 2189 M
1834 2168 D
S
N
1811 2189 M
1822 2189 D
S
N
1835 2189 M
1844 2189 D
S
N
1853 2200 M
1852 2198 D
1853 2197 D
1855 2198 D
1853 2200 D
S
N
1853 2189 M
1853 2168 D
S
N
1855 2189 M
1855 2168 D
S
N
1849 2189 M
1855 2189 D
S
N
1849 2168 M
1859 2168 D
S
N
1874 2189 M
1871 2188 D
1870 2186 D
1868 2183 D
1868 2180 D
1870 2177 D
1871 2176 D
1874 2174 D
1877 2174 D
1880 2176 D
1882 2177 D
1883 2180 D
1883 2183 D
1882 2186 D
1880 2188 D
1877 2189 D
1874 2189 D
S
N
1871 2188 M
1870 2185 D
1870 2179 D
1871 2176 D
S
N
1880 2176 M
1882 2179 D
1882 2185 D
1880 2188 D
S
N
1882 2186 M
1883 2188 D
1886 2189 D
1886 2188 D
1883 2188 D
S
N
1870 2177 M
1868 2176 D
1867 2173 D
1867 2171 D
1868 2168 D
1873 2167 D
1880 2167 D
1885 2165 D
1886 2164 D
S
N
1867 2171 M
1868 2170 D
1873 2168 D
1880 2168 D
1885 2167 D
1886 2164 D
1886 2162 D
1885 2159 D
1880 2158 D
1871 2158 D
1867 2159 D
1865 2162 D
1865 2164 D
1867 2167 D
1871 2168 D
S
N
1455 2131 M
1455 2099 D
S
N
1456 2131 M
1456 2099 D
S
N
1450 2131 M
1468 2131 D
1473 2129 D
1474 2128 D
1476 2125 D
1476 2120 D
1474 2117 D
1473 2116 D
1468 2114 D
1456 2114 D
S
N
1468 2131 M
1471 2129 D
1473 2128 D
1474 2125 D
1474 2120 D
1473 2117 D
1471 2116 D
1468 2114 D
S
N
1450 2099 M
1461 2099 D
S
N
1495 2131 M
1491 2129 D
1488 2126 D
1486 2123 D
1485 2117 D
1485 2113 D
1486 2107 D
1488 2104 D
1491 2100 D
1495 2099 D
1499 2099 D
1503 2100 D
1506 2104 D
1508 2107 D
1509 2113 D
1509 2117 D
1508 2123 D
1506 2126 D
1503 2129 D
1499 2131 D
1495 2131 D
S
N
1495 2131 M
1492 2129 D
1489 2126 D
1488 2123 D
1486 2117 D
1486 2113 D
1488 2107 D
1489 2104 D
1492 2100 D
1495 2099 D
S
N
1499 2099 M
1502 2100 D
1505 2104 D
1506 2107 D
1508 2113 D
1508 2117 D
1506 2123 D
1505 2126 D
1502 2129 D
1499 2131 D
S
N
1520 2131 M
1526 2099 D
S
N
1521 2131 M
1526 2107 D
S
N
1532 2131 M
1526 2099 D
S
N
1532 2131 M
1538 2099 D
S
N
1533 2131 M
1538 2107 D
S
N
1544 2131 M
1538 2099 D
S
N
1515 2131 M
1526 2131 D
S
N
1539 2131 M
1548 2131 D
S
N
1557 2131 M
1557 2099 D
S
N
1559 2131 M
1559 2099 D
S
N
1577 2131 M
1577 2099 D
S
N
1579 2131 M
1579 2099 D
S
N
1553 2131 M
1563 2131 D
S
N
1572 2131 M
1583 2131 D
S
N
1559 2116 M
1577 2116 D
S
N
1553 2099 M
1563 2099 D
S
N
1572 2099 M
1583 2099 D
S
N
1594 2131 M
1594 2099 D
S
N
1595 2131 M
1595 2099 D
S
N
1604 2122 M
1604 2110 D
S
N
1589 2131 M
1613 2131 D
1613 2122 D
1612 2131 D
S
N
1595 2116 M
1604 2116 D
S
N
1589 2099 M
1613 2099 D
1613 2108 D
1612 2099 D
S
N
1625 2131 M
1625 2099 D
S
N
1627 2131 M
1627 2099 D
S
N
1621 2131 M
1631 2131 D
S
N
1621 2099 M
1643 2099 D
1643 2108 D
1642 2099 D
S
N
1665 2126 M
1665 2099 D
S
N
1651 2113 M
1678 2113 D
S
N
1692 2131 M
1692 2099 D
S
N
1693 2131 M
1693 2099 D
S
N
1693 2116 M
1696 2119 D
1701 2120 D
1704 2120 D
1708 2119 D
1710 2116 D
1710 2099 D
S
N
1704 2120 M
1707 2119 D
1708 2116 D
1708 2099 D
S
N
1687 2131 M
1693 2131 D
S
N
1687 2099 M
1698 2099 D
S
N
1704 2099 M
1714 2099 D
S
N
1723 2111 M
1742 2111 D
1742 2114 D
1740 2117 D
1738 2119 D
1735 2120 D
1731 2120 D
1726 2119 D
1723 2116 D
1722 2111 D
1722 2108 D
1723 2104 D
1726 2100 D
1731 2099 D
1734 2099 D
1738 2100 D
1742 2104 D
S
N
1740 2111 M
1740 2116 D
1738 2119 D
S
N
1731 2120 M
1728 2119 D
1725 2116 D
1723 2111 D
1723 2108 D
1725 2104 D
1728 2100 D
1731 2099 D
S
N
1754 2120 M
1754 2099 D
S
N
1755 2120 M
1755 2099 D
S
N
1755 2111 M
1757 2116 D
1760 2119 D
1763 2120 D
1767 2120 D
1769 2119 D
1769 2117 D
1767 2116 D
1766 2117 D
1767 2119 D
S
N
1749 2120 M
1755 2120 D
S
N
1749 2099 M
1760 2099 D
S
N
1778 2120 M
1784 2099 D
S
N
1779 2120 M
1784 2104 D
S
N
1790 2120 M
1784 2099 D
S
N
1790 2120 M
1796 2099 D
S
N
1791 2120 M
1796 2104 D
S
N
1802 2120 M
1796 2099 D
S
N
1773 2120 M
1784 2120 D
S
N
1797 2120 M
1806 2120 D
S
N
1815 2131 M
1814 2129 D
1815 2128 D
1817 2129 D
1815 2131 D
S
N
1815 2120 M
1815 2099 D
S
N
1817 2120 M
1817 2099 D
S
N
1811 2120 M
1817 2120 D
S
N
1811 2099 M
1822 2099 D
S
N
1837 2120 M
1834 2119 D
1832 2117 D
1831 2114 D
1831 2111 D
1832 2108 D
1834 2107 D
1837 2105 D
1840 2105 D
1843 2107 D
1844 2108 D
1846 2111 D
1846 2114 D
1844 2117 D
1843 2119 D
1840 2120 D
1837 2120 D
S
N
1834 2119 M
1832 2116 D
1832 2110 D
1834 2107 D
S
N
1843 2107 M
1844 2110 D
1844 2116 D
1843 2119 D
S
N
1844 2117 M
1846 2119 D
1849 2120 D
1849 2119 D
1846 2119 D
S
N
1832 2108 M
1831 2107 D
1829 2104 D
1829 2102 D
1831 2099 D
1835 2097 D
1843 2097 D
1847 2096 D
1849 2094 D
S
N
1829 2102 M
1831 2100 D
1835 2099 D
1843 2099 D
1847 2097 D
1849 2094 D
1849 2093 D
1847 2090 D
1843 2088 D
1834 2088 D
1829 2090 D
1828 2093 D
1828 2094 D
1829 2097 D
1834 2099 D
S
N
1470 2046 M
1468 2045 D
1470 2043 D
1471 2045 D
1471 2046 D
1468 2049 D
1465 2051 D
1461 2051 D
1456 2049 D
1453 2046 D
1452 2042 D
1452 2039 D
1453 2034 D
1456 2031 D
1461 2030 D
1464 2030 D
1468 2031 D
1471 2034 D
S
N
1461 2051 M
1458 2049 D
1455 2046 D
1453 2042 D
1453 2039 D
1455 2034 D
1458 2031 D
1461 2030 D
S
N
1483 2051 M
1483 2034 D
1485 2031 D
1489 2030 D
1492 2030 D
1497 2031 D
1500 2034 D
S
N
1485 2051 M
1485 2034 D
1486 2031 D
1489 2030 D
S
N
1500 2051 M
1500 2030 D
S
N
1502 2051 M
1502 2030 D
S
N
1479 2051 M
1485 2051 D
S
N
1495 2051 M
1502 2051 D
S
N
1500 2030 M
1506 2030 D
S
N
1517 2061 M
1517 2036 D
1518 2031 D
1521 2030 D
1524 2030 D
1527 2031 D
1529 2034 D
S
N
1518 2061 M
1518 2036 D
1520 2031 D
1521 2030 D
S
N
1512 2051 M
1524 2051 D
S
N
1551 2048 M
1553 2051 D
1553 2045 D
1551 2048 D
1550 2049 D
1547 2051 D
1541 2051 D
1538 2049 D
1536 2048 D
1536 2045 D
1538 2043 D
1541 2042 D
1548 2039 D
1551 2037 D
1553 2036 D
S
N
1536 2046 M
1538 2045 D
1541 2043 D
1548 2040 D
1551 2039 D
1553 2037 D
1553 2033 D
1551 2031 D
1548 2030 D
1542 2030 D
1539 2031 D
1538 2033 D
1536 2036 D
1536 2030 D
1538 2033 D
S
N
1588 2055 M
1589 2054 D
1588 2052 D
1586 2054 D
1586 2055 D
1588 2058 D
1589 2060 D
1594 2061 D
1600 2061 D
1604 2060 D
1606 2058 D
1607 2055 D
1607 2052 D
1606 2049 D
1601 2046 D
1594 2043 D
1591 2042 D
1588 2039 D
1586 2034 D
1586 2030 D
S
N
1600 2061 M
1603 2060 D
1604 2058 D
1606 2055 D
1606 2052 D
1604 2049 D
1600 2046 D
1594 2043 D
S
N
1586 2033 M
1588 2034 D
1591 2034 D
1598 2031 D
1603 2031 D
1606 2033 D
1607 2034 D
S
N
1591 2034 M
1598 2030 D
1604 2030 D
1606 2031 D
1607 2034 D
1607 2037 D
S
1 Sw
N
1986 2034 M
2003 2034 D
S
N
1986 2034 M
2003 2034 D
S
N
1986 2031 M
1986 2037 D
S
N
2003 2031 M
2003 2043 D
1998 2043 D
2003 2042 D
S
N
1986 2048 M
2003 2048 D
S
N
1986 2049 M
2003 2049 D
S
N
1986 2058 M
2003 2058 D
S
N
1986 2059 M
2003 2059 D
S
N
1986 2046 M
1986 2051 D
S
N
1986 2056 M
1986 2062 D
S
N
1994 2049 M
1994 2058 D
S
N
2003 2046 M
2003 2051 D
S
N
2003 2056 M
2003 2062 D
S
N
1988 2077 M
1991 2078 D
1986 2078 D
1988 2077 D
1987 2075 D
1986 2073 D
1986 2071 D
1987 2069 D
1988 2067 D
1990 2066 D
1992 2066 D
1996 2066 D
1999 2066 D
2000 2067 D
2002 2069 D
2003 2071 D
2003 2073 D
2002 2075 D
2000 2077 D
1999 2078 D
S
N
1986 2071 M
1987 2070 D
1988 2068 D
1990 2067 D
1992 2066 D
1996 2066 D
1999 2067 D
2000 2068 D
2002 2070 D
2003 2071 D
S
N
1986 2097 M
2003 2097 D
S
N
1986 2097 M
2003 2097 D
S
N
1986 2107 M
2003 2107 D
S
N
1986 2108 M
2003 2108 D
S
N
1986 2094 M
1986 2100 D
S
N
1986 2105 M
1986 2110 D
S
N
1994 2097 M
1994 2107 D
S
N
2003 2094 M
2003 2100 D
S
N
2003 2105 M
2003 2110 D
S
N
1986 2116 M
2003 2116 D
S
N
1986 2117 M
2003 2117 D
S
N
1986 2113 M
1986 2119 D
S
N
2003 2113 M
2003 2119 D
S
N
1988 2134 M
1991 2135 D
1986 2135 D
1988 2134 D
1987 2132 D
1986 2130 D
1986 2129 D
1987 2126 D
1988 2125 D
1990 2124 D
1992 2123 D
1996 2123 D
1999 2124 D
2000 2125 D
2002 2126 D
2003 2129 D
2003 2130 D
2002 2132 D
2000 2134 D
S
N
1986 2129 M
1987 2127 D
1988 2125 D
1990 2125 D
1992 2124 D
1996 2124 D
1999 2125 D
2000 2125 D
2002 2127 D
2003 2129 D
S
N
1996 2134 M
2003 2134 D
S
N
1996 2135 M
2003 2135 D
S
N
1996 2132 M
1996 2137 D
S
N
1988 2152 M
1991 2153 D
1986 2153 D
1988 2152 D
1987 2151 D
1986 2148 D
1986 2147 D
1987 2144 D
1988 2143 D
1990 2142 D
1992 2141 D
1996 2141 D
1999 2142 D
2000 2143 D
2002 2144 D
2003 2147 D
2003 2148 D
2002 2151 D
2000 2152 D
S
N
1986 2147 M
1987 2145 D
1988 2144 D
1990 2143 D
1992 2142 D
1996 2142 D
1999 2143 D
2000 2144 D
2002 2145 D
2003 2147 D
S
N
1996 2152 M
2003 2152 D
S
N
1996 2153 M
2003 2153 D
S
N
1996 2150 M
1996 2156 D
S
N
1988 2170 M
1986 2171 D
1991 2171 D
1988 2170 D
1987 2168 D
1986 2166 D
1986 2164 D
1987 2161 D
1988 2160 D
1990 2160 D
1991 2160 D
1992 2161 D
1993 2163 D
1995 2168 D
1995 2169 D
1997 2171 D
S
N
1990 2160 M
1991 2161 D
1992 2163 D
1994 2168 D
1995 2169 D
1995 2170 D
1997 2171 D
2000 2171 D
2002 2169 D
2003 2167 D
2003 2164 D
2002 2162 D
2000 2160 D
1998 2160 D
2003 2160 D
2000 2160 D
S
N
1986 2188 M
2003 2199 D
S
N
1986 2189 M
2003 2199 D
S
N
1986 2199 M
2003 2188 D
S
N
1986 2187 M
1986 2191 D
S
N
1986 2196 M
1986 2201 D
S
N
2003 2187 M
2003 2191 D
S
N
2003 2196 M
2003 2201 D
S
N
1988 2215 M
1986 2215 D
1991 2215 D
1988 2215 D
1987 2213 D
1986 2211 D
1986 2208 D
1987 2206 D
1988 2204 D
1990 2204 D
1991 2205 D
1992 2206 D
1993 2207 D
1995 2212 D
1995 2214 D
1997 2215 D
S
N
1990 2204 M
1991 2206 D
1992 2207 D
1994 2212 D
1995 2214 D
1995 2215 D
1997 2215 D
2000 2215 D
2002 2214 D
2003 2211 D
2003 2209 D
2002 2207 D
2000 2205 D
1998 2204 D
2003 2204 D
2000 2205 D
S
N
1986 2234 M
2003 2237 D
S
N
1986 2234 M
1999 2237 D
S
N
1986 2240 M
2003 2237 D
S
N
1986 2240 M
2003 2243 D
S
N
1986 2241 M
1999 2243 D
S
N
1986 2246 M
2003 2243 D
S
N
1986 2231 M
1986 2237 D
S
N
1986 2244 M
1986 2249 D
S
N
1988 2263 M
1991 2264 D
1986 2264 D
1988 2263 D
1987 2262 D
1986 2259 D
1986 2258 D
1987 2255 D
1988 2254 D
1990 2253 D
1992 2252 D
1996 2252 D
1999 2253 D
2000 2254 D
2002 2255 D
2003 2258 D
2003 2259 D
2002 2262 D
2000 2263 D
S
N
1986 2258 M
1987 2256 D
1988 2254 D
1990 2254 D
1992 2253 D
1996 2253 D
1999 2254 D
2000 2254 D
2002 2256 D
2003 2258 D
S
N
1996 2263 M
2003 2263 D
S
N
1996 2264 M
2003 2264 D
S
N
1996 2261 M
1996 2266 D
S
N
1989 2284 M
1990 2285 D
1991 2284 D
1990 2283 D
1989 2283 D
1987 2284 D
1987 2285 D
1986 2287 D
1986 2290 D
1987 2293 D
1987 2293 D
1989 2294 D
1991 2294 D
1992 2293 D
1994 2291 D
1995 2287 D
1996 2285 D
1998 2284 D
2000 2283 D
2003 2283 D
S
N
1986 2290 M
1987 2292 D
1987 2293 D
1989 2293 D
1991 2293 D
1992 2293 D
1994 2290 D
1995 2287 D
S
N
2001 2283 M
2000 2284 D
2000 2285 D
2002 2289 D
2002 2292 D
2001 2293 D
2000 2294 D
S
N
2000 2285 M
2003 2289 D
2003 2293 D
2002 2293 D
2000 2294 D
1999 2294 D
S
N
1986 2304 M
1987 2301 D
1989 2300 D
1993 2299 D
1995 2299 D
1999 2300 D
2002 2301 D
2003 2304 D
2003 2305 D
2002 2308 D
1999 2309 D
1995 2310 D
1993 2310 D
1989 2309 D
1987 2308 D
1986 2305 D
1986 2304 D
S
N
1986 2304 M
1987 2302 D
1987 2301 D
1989 2301 D
1993 2300 D
1995 2300 D
1999 2301 D
2001 2301 D
2002 2302 D
2003 2304 D
S
N
2003 2305 M
2002 2307 D
2001 2308 D
1999 2309 D
1995 2309 D
1993 2309 D
1989 2309 D
1987 2308 D
1987 2307 D
1986 2305 D
S
N
1989 2317 M
1988 2319 D
1986 2321 D
2003 2321 D
S
N
1987 2321 M
2003 2321 D
S
N
2003 2317 M
2003 2325 D
S
N
1989 2333 M
1988 2335 D
1986 2337 D
2003 2337 D
S
N
1987 2336 M
2003 2336 D
S
N
2003 2333 M
2003 2340 D
S
4 Sw
N
583 2342 M
583 1520 D
S
N
583 1520 M
1967 1520 D
S
N
1967 1520 M
1967 2342 D
S
N
1967 2342 M
583 2342 D
S
N
583 1520 M
1967 1520 D
S
N
583 1520 M
583 1551 D
S
N
662 1531 M
662 1520 D
S
N
741 1520 M
741 1531 D
S
N
820 1531 M
820 1520 D
S
N
899 1520 M
899 1531 D
S
N
978 1551 M
978 1520 D
S
N
1058 1520 M
1058 1531 D
S
N
1137 1531 M
1137 1520 D
S
N
1216 1520 M
1216 1531 D
S
N
1295 1531 M
1295 1520 D
S
N
1374 1520 M
1374 1551 D
S
N
1453 1531 M
1453 1520 D
S
N
1532 1520 M
1532 1531 D
S
N
1611 1531 M
1611 1520 D
S
N
1690 1520 M
1690 1531 D
S
N
1769 1551 M
1769 1520 D
S
N
1848 1520 M
1848 1531 D
S
N
1927 1531 M
1927 1520 D
S
N
583 2342 M
1967 2342 D
S
N
583 2311 M
583 2342 D
S
N
662 2342 M
662 2332 D
S
N
741 2332 M
741 2342 D
S
N
820 2342 M
820 2332 D
S
N
899 2332 M
899 2342 D
S
N
978 2342 M
978 2311 D
S
N
1058 2332 M
1058 2342 D
S
N
1137 2342 M
1137 2332 D
S
N
1216 2332 M
1216 2342 D
S
N
1295 2342 M
1295 2332 D
S
N
1374 2311 M
1374 2342 D
S
N
1453 2342 M
1453 2332 D
S
N
1532 2332 M
1532 2342 D
S
N
1611 2342 M
1611 2332 D
S
N
1690 2332 M
1690 2342 D
S
N
1769 2342 M
1769 2311 D
S
N
1848 2332 M
1848 2342 D
S
N
1927 2342 M
1927 2332 D
S
N
583 1520 M
583 2342 D
S
N
583 1520 M
593 1520 D
S
N
593 1530 M
583 1530 D
S
N
583 1539 M
614 1539 D
S
N
593 1598 M
583 1598 D
S
N
583 1632 M
593 1632 D
S
N
593 1657 M
583 1657 D
S
N
583 1676 M
593 1676 D
S
N
593 1691 M
583 1691 D
S
N
583 1704 M
593 1704 D
S
N
593 1715 M
583 1715 D
S
N
583 1725 M
593 1725 D
S
N
614 1734 M
583 1734 D
S
N
583 1793 M
593 1793 D
S
N
593 1827 M
583 1827 D
S
N
583 1852 M
593 1852 D
S
N
593 1871 M
583 1871 D
S
N
583 1886 M
593 1886 D
S
N
593 1899 M
583 1899 D
S
N
583 1911 M
593 1911 D
S
N
593 1921 M
583 1921 D
S
N
583 1929 M
614 1929 D
S
N
593 1988 M
583 1988 D
S
N
583 2023 M
593 2023 D
S
N
593 2047 M
583 2047 D
S
N
583 2066 M
593 2066 D
S
N
593 2081 M
583 2081 D
S
N
583 2094 M
593 2094 D
S
N
593 2106 M
583 2106 D
S
N
583 2116 M
593 2116 D
S
N
614 2125 M
583 2125 D
S
N
583 2183 M
593 2183 D
S
N
593 2218 M
583 2218 D
S
N
583 2242 M
593 2242 D
S
N
593 2261 M
583 2261 D
S
N
583 2276 M
593 2276 D
S
N
593 2290 M
583 2290 D
S
N
583 2301 M
593 2301 D
S
N
593 2311 M
583 2311 D
S
N
583 2320 M
614 2320 D
S
N
420 1547 M
423 1548 D
427 1553 D
427 1521 D
S
N
426 1551 M
426 1521 D
S
N
420 1521 M
433 1521 D
S
N
454 1553 M
450 1551 D
447 1547 D
445 1539 D
445 1535 D
447 1527 D
450 1523 D
454 1521 D
457 1521 D
462 1523 D
465 1527 D
466 1535 D
466 1539 D
465 1547 D
462 1551 D
457 1553 D
454 1553 D
S
N
454 1553 M
451 1551 D
450 1550 D
448 1547 D
447 1539 D
447 1535 D
448 1527 D
450 1524 D
451 1523 D
454 1521 D
S
N
457 1521 M
460 1523 D
462 1524 D
463 1527 D
465 1535 D
465 1539 D
463 1547 D
462 1550 D
460 1551 D
457 1553 D
S
N
477 1553 M
504 1553 D
S
N
515 1571 M
515 1562 D
S
N
515 1565 M
516 1568 D
519 1571 D
522 1571 D
530 1566 D
533 1566 D
534 1568 D
536 1571 D
S
N
516 1568 M
519 1569 D
522 1569 D
530 1566 D
S
N
536 1571 M
536 1566 D
534 1562 D
528 1554 D
527 1551 D
525 1547 D
525 1539 D
S
N
534 1562 M
527 1554 D
525 1551 D
524 1547 D
524 1539 D
S
N
420 1742 M
423 1743 D
427 1748 D
427 1716 D
S
N
426 1746 M
426 1716 D
S
N
420 1716 M
433 1716 D
S
N
454 1748 M
450 1746 D
447 1742 D
445 1734 D
445 1730 D
447 1722 D
450 1718 D
454 1716 D
457 1716 D
462 1718 D
465 1722 D
466 1730 D
466 1734 D
465 1742 D
462 1746 D
457 1748 D
454 1748 D
S
N
454 1748 M
451 1746 D
450 1745 D
448 1742 D
447 1734 D
447 1730 D
448 1722 D
450 1719 D
451 1718 D
454 1716 D
S
N
457 1716 M
460 1718 D
462 1719 D
463 1722 D
465 1730 D
465 1734 D
463 1742 D
462 1745 D
460 1746 D
457 1748 D
S
N
477 1748 M
504 1748 D
S
N
533 1761 M
531 1760 D
533 1758 D
534 1760 D
534 1761 D
533 1764 D
530 1766 D
525 1766 D
521 1764 D
518 1761 D
516 1758 D
515 1752 D
515 1743 D
516 1739 D
519 1736 D
524 1734 D
527 1734 D
531 1736 D
534 1739 D
536 1743 D
536 1745 D
534 1749 D
531 1752 D
527 1754 D
525 1754 D
521 1752 D
518 1749 D
516 1745 D
S
N
525 1766 M
522 1764 D
519 1761 D
518 1758 D
516 1752 D
516 1743 D
518 1739 D
521 1736 D
524 1734 D
S
N
527 1734 M
530 1736 D
533 1739 D
534 1743 D
534 1745 D
533 1749 D
530 1752 D
527 1754 D
S
N
420 1937 M
423 1939 D
427 1943 D
427 1911 D
S
N
426 1942 M
426 1911 D
S
N
420 1911 M
433 1911 D
S
N
454 1943 M
450 1942 D
447 1937 D
445 1929 D
445 1925 D
447 1917 D
450 1913 D
454 1911 D
457 1911 D
462 1913 D
465 1917 D
466 1925 D
466 1929 D
465 1937 D
462 1942 D
457 1943 D
454 1943 D
S
N
454 1943 M
451 1942 D
450 1940 D
448 1937 D
447 1929 D
447 1925 D
448 1917 D
450 1914 D
451 1913 D
454 1911 D
S
N
457 1911 M
460 1913 D
462 1914 D
463 1917 D
465 1925 D
465 1929 D
463 1937 D
462 1940 D
460 1942 D
457 1943 D
S
N
477 1943 M
504 1943 D
S
N
518 1961 M
515 1946 D
S
N
515 1946 M
518 1949 D
522 1951 D
527 1951 D
531 1949 D
534 1946 D
536 1942 D
536 1939 D
534 1934 D
531 1931 D
527 1929 D
522 1929 D
518 1931 D
516 1932 D
515 1936 D
515 1937 D
516 1939 D
518 1937 D
516 1936 D
S
N
527 1951 M
530 1949 D
533 1946 D
534 1942 D
534 1939 D
533 1934 D
530 1931 D
527 1929 D
S
N
518 1961 M
533 1961 D
S
N
518 1960 M
525 1960 D
533 1961 D
S
N
420 2132 M
423 2134 D
427 2138 D
427 2107 D
S
N
426 2137 M
426 2107 D
S
N
420 2107 M
433 2107 D
S
N
454 2138 M
450 2137 D
447 2132 D
445 2125 D
445 2120 D
447 2113 D
450 2108 D
454 2107 D
457 2107 D
462 2108 D
465 2113 D
466 2120 D
466 2125 D
465 2132 D
462 2137 D
457 2138 D
454 2138 D
S
N
454 2138 M
451 2137 D
450 2135 D
448 2132 D
447 2125 D
447 2120 D
448 2113 D
450 2110 D
451 2108 D
454 2107 D
S
N
457 2107 M
460 2108 D
462 2110 D
463 2113 D
465 2120 D
465 2125 D
463 2132 D
462 2135 D
460 2137 D
457 2138 D
S
N
477 2138 M
504 2138 D
S
N
528 2153 M
528 2125 D
S
N
530 2156 M
530 2125 D
S
N
530 2156 M
513 2134 D
537 2134 D
S
N
524 2125 M
534 2125 D
S
N
420 2327 M
423 2329 D
427 2333 D
427 2302 D
S
N
426 2332 M
426 2302 D
S
N
420 2302 M
433 2302 D
S
N
454 2333 M
450 2332 D
447 2327 D
445 2320 D
445 2315 D
447 2308 D
450 2303 D
454 2302 D
457 2302 D
462 2303 D
465 2308 D
466 2315 D
466 2320 D
465 2327 D
462 2332 D
457 2333 D
454 2333 D
S
N
454 2333 M
451 2332 D
450 2330 D
448 2327 D
447 2320 D
447 2315 D
448 2308 D
450 2305 D
451 2303 D
454 2302 D
S
N
457 2302 M
460 2303 D
462 2305 D
463 2308 D
465 2315 D
465 2320 D
463 2327 D
462 2330 D
460 2332 D
457 2333 D
S
N
477 2333 M
504 2333 D
S
N
516 2345 M
518 2344 D
516 2342 D
515 2344 D
515 2345 D
516 2348 D
518 2350 D
522 2351 D
528 2351 D
533 2350 D
534 2347 D
534 2342 D
533 2339 D
528 2338 D
524 2338 D
S
N
528 2351 M
531 2350 D
533 2347 D
533 2342 D
531 2339 D
528 2338 D
S
N
528 2338 M
531 2336 D
534 2333 D
536 2330 D
536 2326 D
534 2323 D
533 2321 D
528 2320 D
522 2320 D
518 2321 D
516 2323 D
515 2326 D
515 2327 D
516 2329 D
518 2327 D
516 2326 D
S
N
533 2335 M
534 2330 D
534 2326 D
533 2323 D
531 2321 D
528 2320 D
S
N
1957 1520 M
1967 1520 D
S
N
1967 1530 M
1957 1530 D
S
N
1936 1539 M
1967 1539 D
S
N
1967 1598 M
1957 1598 D
S
N
1957 1632 M
1967 1632 D
S
N
1967 1657 M
1957 1657 D
S
N
1957 1676 M
1967 1676 D
S
N
1967 1691 M
1957 1691 D
S
N
1957 1704 M
1967 1704 D
S
N
1967 1715 M
1957 1715 D
S
N
1957 1725 M
1967 1725 D
S
N
1967 1734 M
1936 1734 D
S
N
1957 1793 M
1967 1793 D
S
N
1967 1827 M
1957 1827 D
S
N
1957 1852 M
1967 1852 D
S
N
1967 1871 M
1957 1871 D
S
N
1957 1886 M
1967 1886 D
S
N
1967 1899 M
1957 1899 D
S
N
1957 1911 M
1967 1911 D
S
N
1967 1921 M
1957 1921 D
S
N
1936 1929 M
1967 1929 D
S
N
1967 1988 M
1957 1988 D
S
N
1957 2023 M
1967 2023 D
S
N
1967 2047 M
1957 2047 D
S
N
1957 2066 M
1967 2066 D
S
N
1967 2081 M
1957 2081 D
S
N
1957 2094 M
1967 2094 D
S
N
1967 2106 M
1957 2106 D
S
N
1957 2116 M
1967 2116 D
S
N
1967 2125 M
1936 2125 D
S
N
1957 2183 M
1967 2183 D
S
N
1967 2218 M
1957 2218 D
S
N
1957 2242 M
1967 2242 D
S
N
1967 2261 M
1957 2261 D
S
N
1957 2276 M
1967 2276 D
S
N
1967 2290 M
1957 2290 D
S
N
1957 2301 M
1967 2301 D
S
N
1967 2311 M
1957 2311 D
S
N
1936 2320 M
1967 2320 D
S
N
1327 2186 M
1431 2186 D
S
N
583 1520 M
583 1520 D
S
N
694 1520 M
694 1683 D
710 1683 D
710 1804 D
725 1804 D
725 1895 D
741 1895 D
741 1973 D
757 1973 D
757 2025 D
773 2025 D
773 2069 D
789 2069 D
789 2105 D
804 2105 D
804 2134 D
820 2134 D
820 2156 D
836 2156 D
836 2173 D
852 2173 D
852 2187 D
868 2187 D
868 2196 D
884 2196 D
884 2202 D
899 2202 D
899 2205 D
915 2205 D
915 2204 D
931 2204 D
931 2202 D
947 2202 D
947 2199 D
963 2199 D
963 2194 D
978 2194 D
978 2188 D
994 2188 D
994 2182 D
1010 2182 D
1010 2174 D
1026 2174 D
1026 2166 D
1042 2166 D
1042 2158 D
1058 2158 D
1058 2151 D
1073 2151 D
1073 2142 D
1089 2142 D
1089 2134 D
1105 2134 D
1105 2125 D
1121 2125 D
1121 2114 D
1137 2114 D
1137 2105 D
1152 2105 D
1152 2097 D
1168 2097 D
1168 2087 D
1184 2087 D
1184 2078 D
1200 2078 D
1200 2070 D
1216 2070 D
1216 2061 D
1232 2061 D
1232 2051 D
1247 2051 D
1247 2043 D
1263 2043 D
1263 2033 D
1279 2033 D
1279 2024 D
1295 2024 D
1295 2014 D
1311 2014 D
1311 2005 D
1326 2005 D
1326 1997 D
1342 1997 D
1342 1986 D
1358 1986 D
1358 1977 D
1374 1977 D
1374 1968 D
1390 1968 D
1390 1959 D
1405 1959 D
1405 1953 D
1421 1953 D
1421 1944 D
1437 1944 D
1437 1931 D
1453 1931 D
1453 1926 D
1469 1926 D
1469 1916 D
1485 1916 D
1485 1909 D
1500 1909 D
1500 1899 D
1516 1899 D
1516 1890 D
1532 1890 D
1532 1881 D
1548 1881 D
1548 1872 D
1564 1872 D
1564 1864 D
1579 1864 D
1579 1851 D
1595 1851 D
1595 1844 D
1611 1844 D
1611 1839 D
1627 1839 D
1627 1829 D
1643 1829 D
1643 1819 D
1659 1819 D
1659 1805 D
1659 1805 D
1659 1805 D
1674 1805 D
1674 1806 D
1690 1806 D
1690 1796 D
1706 1796 D
1706 1781 D
1722 1781 D
1722 1776 D
1738 1776 D
1738 1769 D
1753 1769 D
1753 1762 D
1769 1762 D
1769 1749 D
1785 1749 D
1785 1753 D
1801 1753 D
1801 1734 D
1817 1734 D
1817 1731 D
1833 1731 D
1833 1716 D
1848 1716 D
1848 1709 D
1864 1709 D
1864 1705 D
1880 1705 D
1880 1697 D
1896 1697 D
1896 1685 D
1912 1685 D
1912 1687 D
1927 1687 D
1927 1682 D
1943 1682 D
1943 1672 D
1959 1672 D
1959 1670 D
1967 1670 D
S
0 0 1 setrgbcolor
N
1327 2117 M
1339 2117 D
S
N
1351 2117 M
1363 2117 D
S
N
1375 2117 M
1387 2117 D
S
N
1400 2117 M
1412 2117 D
S
N
1424 2117 M
1431 2117 D
S
N
694 1520 M
694 1532 D
S
N
694 1544 M
694 1557 D
S
N
694 1569 M
694 1581 D
S
N
694 1593 M
694 1602 D
697 1602 D
S
N
709 1602 M
710 1602 D
710 1613 D
S
N
710 1625 M
710 1638 D
S
N
710 1650 M
710 1662 D
S
N
710 1674 M
710 1686 D
S
N
710 1698 M
710 1709 D
711 1709 D
S
N
723 1709 M
725 1709 D
725 1719 D
S
N
725 1731 M
725 1743 D
S
N
725 1755 M
725 1767 D
S
N
725 1779 M
725 1791 D
S
N
725 1803 M
725 1816 D
S
N
732 1821 M
741 1821 D
741 1824 D
S
N
741 1836 M
741 1848 D
S
N
741 1860 M
741 1872 D
S
N
741 1884 M
741 1892 D
746 1892 D
S
N
757 1893 M
757 1905 D
S
N
757 1917 M
757 1929 D
S
N
757 1941 M
757 1953 D
S
N
765 1958 M
773 1958 D
773 1962 D
S
N
773 1974 M
773 1986 D
S
N
773 1998 M
773 2010 D
S
N
783 2012 M
789 2012 D
789 2019 D
S
N
789 2031 M
789 2043 D
S
N
789 2055 M
789 2059 D
797 2059 D
S
N
804 2063 M
804 2076 D
S
N
804 2088 M
804 2097 D
807 2097 D
S
N
820 2097 M
820 2097 D
820 2108 D
S
N
820 2120 M
820 2129 D
824 2129 D
S
N
836 2129 M
836 2141 D
S
N
836 2153 M
836 2154 D
847 2154 D
S
N
852 2161 M
852 2173 D
S
N
862 2175 M
868 2175 D
868 2182 D
S
N
872 2190 M
884 2190 D
884 2190 D
S
N
886 2200 M
898 2200 D
S
N
905 2205 M
915 2205 D
915 2207 D
S
N
927 2208 M
931 2208 D
931 2208 D
939 2208 D
S
N
949 2206 M
961 2206 D
S
N
968 2201 M
978 2201 D
978 2199 D
S
N
986 2195 M
994 2195 D
994 2191 D
S
N
1006 2190 M
1010 2190 D
1010 2182 D
S
N
1022 2182 M
1026 2182 D
1026 2175 D
1027 2175 D
S
N
1039 2175 M
1042 2175 D
1042 2168 D
1044 2168 D
S
N
1056 2168 M
1058 2168 D
1058 2160 D
1060 2160 D
S
N
1073 2160 M
1073 2160 D
1073 2151 D
1076 2151 D
S
N
1088 2151 M
1089 2151 D
1089 2143 D
1092 2143 D
S
N
1104 2143 M
1105 2143 D
1105 2134 D
1107 2134 D
S
N
1119 2134 M
1121 2134 D
1121 2125 D
1122 2125 D
S
N
1134 2125 M
1137 2125 D
1137 2117 D
1138 2117 D
S
N
1150 2117 M
1152 2117 D
1152 2108 D
1154 2108 D
S
N
1166 2108 M
1168 2108 D
1168 2098 D
S
N
1180 2098 M
1184 2098 D
1184 2090 D
S
N
1193 2087 M
1200 2087 D
1200 2081 D
S
N
1210 2079 M
1216 2079 D
1216 2073 D
S
N
1223 2068 M
1232 2068 D
1232 2065 D
S
N
1240 2061 M
1247 2061 D
1247 2056 D
S
N
1253 2050 M
1263 2050 D
1263 2048 D
S
N
1270 2042 M
1279 2042 D
1279 2039 D
S
N
1284 2033 M
1295 2033 D
1295 2031 D
S
N
1298 2022 M
1310 2022 D
S
N
1314 2014 M
1326 2014 D
S
N
1329 2005 M
1341 2005 D
S
N
1345 1996 M
1357 1996 D
S
N
1358 1985 M
1358 1985 D
1370 1985 D
S
N
1374 1977 M
1374 1975 D
1384 1975 D
S
N
1390 1969 M
1390 1965 D
1399 1965 D
S
N
1405 1960 M
1405 1957 D
1415 1957 D
S
N
1421 1952 M
1421 1945 D
1427 1945 D
S
N
1437 1943 M
1437 1938 D
1444 1938 D
S
N
1453 1935 M
1453 1929 D
1459 1929 D
S
N
1469 1927 M
1469 1920 D
1474 1920 D
S
N
1485 1918 M
1485 1915 D
1494 1915 D
S
N
1500 1910 M
1500 1898 D
1501 1898 D
S
N
1513 1898 M
1516 1898 D
1516 1896 D
1523 1896 D
S
N
1532 1893 M
1532 1889 D
1540 1889 D
S
N
1548 1884 M
1548 1875 D
1551 1875 D
S
N
1563 1875 M
1564 1875 D
1564 1864 D
S
N
1574 1862 M
1579 1862 D
1579 1856 D
S
N
1591 1855 M
1595 1855 D
1595 1847 D
1595 1847 D
S
N
1607 1847 M
1611 1847 D
1611 1839 D
1611 1839 D
S
N
1623 1839 M
1627 1839 D
1627 1830 D
S
N
1629 1820 M
1641 1820 D
S
N
1650 1824 M
1659 1824 D
1659 1820 D
S
N
1670 1819 M
1674 1819 D
1674 1812 D
S
N
1681 1806 M
1690 1806 D
1690 1806 D
1692 1806 D
S
N
1704 1806 M
1706 1806 D
1706 1796 D
S
N
1714 1791 M
1722 1791 D
1722 1787 D
S
N
1726 1779 M
1738 1779 D
1738 1779 D
S
N
1740 1769 M
1752 1769 D
S
N
1757 1762 M
1769 1762 D
S
N
1776 1756 M
1785 1756 D
1785 1754 D
S
N
1785 1742 M
1785 1736 D
1792 1736 D
S
N
1802 1737 M
1815 1737 D
S
N
1823 1734 M
1833 1734 D
1833 1731 D
S
N
1834 1720 M
1846 1720 D
S
N
1848 1711 M
1848 1705 D
1855 1705 D
S
N
1864 1708 M
1864 1720 D
S
N
1875 1721 M
1880 1721 D
1880 1713 D
S
N
1889 1710 M
1896 1710 D
1896 1705 D
S
N
1896 1693 M
1896 1682 D
1897 1682 D
S
N
1909 1682 M
1912 1682 D
1912 1688 D
1915 1688 D
S
N
1927 1688 M
1927 1675 D
S
N
1934 1670 M
1943 1670 D
1943 1667 D
S
N
1955 1666 M
1959 1666 D
1959 1659 D
1959 1659 D
S
3 Sw
0 0 0 setrgbcolor
N
833 1477 M
833 1476 D
832 1476 D
832 1477 D
833 1478 D
836 1480 D
841 1480 D
844 1478 D
845 1477 D
847 1474 D
847 1465 D
848 1462 D
849 1461 D
S
N
845 1477 M
845 1465 D
847 1462 D
849 1461 D
851 1461 D
S
N
845 1474 M
844 1473 D
836 1472 D
832 1470 D
830 1467 D
830 1465 D
832 1462 D
836 1461 D
840 1461 D
843 1462 D
845 1465 D
S
N
836 1472 M
833 1470 D
832 1467 D
832 1465 D
833 1462 D
836 1461 D
S
N
860 1489 M
860 1461 D
S
N
862 1489 M
870 1465 D
S
N
860 1489 M
870 1461 D
S
N
879 1489 M
870 1461 D
S
N
879 1489 M
879 1461 D
S
N
881 1489 M
881 1461 D
S
N
856 1489 M
862 1489 D
S
N
879 1489 M
885 1489 D
S
N
856 1461 M
864 1461 D
S
N
875 1461 M
885 1461 D
S
N
911 1485 M
912 1481 D
912 1489 D
911 1485 D
908 1488 D
904 1489 D
901 1489 D
897 1488 D
895 1485 D
893 1482 D
892 1478 D
892 1472 D
893 1467 D
895 1465 D
897 1462 D
901 1461 D
904 1461 D
908 1462 D
911 1465 D
912 1467 D
S
N
901 1489 M
899 1488 D
896 1485 D
895 1482 D
893 1478 D
893 1472 D
895 1467 D
896 1465 D
899 1462 D
901 1461 D
S
N
941 1478 M
940 1481 D
937 1482 D
933 1482 D
930 1481 D
929 1480 D
927 1476 D
927 1472 D
929 1469 D
931 1467 D
936 1467 D
938 1469 D
940 1472 D
S
N
933 1482 M
930 1480 D
929 1476 D
929 1472 D
930 1469 D
931 1467 D
S
N
941 1482 M
940 1472 D
940 1469 D
942 1467 D
945 1467 D
948 1470 D
949 1474 D
949 1477 D
948 1481 D
947 1484 D
944 1487 D
941 1488 D
937 1489 D
933 1489 D
929 1488 D
926 1487 D
923 1484 D
922 1481 D
921 1477 D
921 1473 D
922 1469 D
923 1466 D
926 1463 D
929 1462 D
933 1461 D
937 1461 D
941 1462 D
944 1463 D
945 1465 D
S
N
942 1482 M
941 1472 D
941 1469 D
942 1467 D
S
N
960 1489 M
960 1461 D
S
N
962 1489 M
978 1463 D
S
N
962 1487 M
978 1461 D
S
N
978 1489 M
978 1461 D
S
N
956 1489 M
962 1489 D
S
N
974 1489 M
982 1489 D
S
N
956 1461 M
964 1461 D
S
N
992 1489 M
992 1461 D
S
N
993 1489 M
993 1461 D
S
N
988 1489 M
997 1489 D
S
N
988 1461 M
1008 1461 D
1008 1469 D
1007 1461 D
S
N
1023 1489 M
1019 1488 D
1016 1485 D
1015 1482 D
1014 1477 D
1014 1473 D
1015 1467 D
1016 1465 D
1019 1462 D
1023 1461 D
1026 1461 D
1030 1462 D
1033 1465 D
1034 1467 D
1035 1473 D
1035 1477 D
1034 1482 D
1033 1485 D
1030 1488 D
1026 1489 D
1023 1489 D
S
N
1023 1489 M
1020 1488 D
1018 1485 D
1016 1482 D
1015 1477 D
1015 1473 D
1016 1467 D
1018 1465 D
1020 1462 D
1023 1461 D
S
N
1026 1461 M
1029 1462 D
1031 1465 D
1033 1467 D
1034 1473 D
1034 1477 D
1033 1482 D
1031 1485 D
1029 1488 D
1026 1489 D
S
N
1046 1480 M
1045 1478 D
1046 1477 D
1048 1478 D
1046 1480 D
S
N
1046 1463 M
1045 1462 D
1046 1461 D
1048 1462 D
1046 1463 D
S
N
1093 1477 M
1094 1480 D
1094 1474 D
1093 1477 D
1092 1478 D
1089 1480 D
1083 1480 D
1081 1478 D
1079 1477 D
1079 1474 D
1081 1473 D
1083 1472 D
1090 1469 D
1093 1467 D
1094 1466 D
S
N
1079 1476 M
1081 1474 D
1083 1473 D
1090 1470 D
1093 1469 D
1094 1467 D
1094 1463 D
1093 1462 D
1090 1461 D
1085 1461 D
1082 1462 D
1081 1463 D
1079 1466 D
1079 1461 D
1081 1463 D
S
N
1119 1476 M
1118 1474 D
1119 1473 D
1120 1474 D
1120 1476 D
1118 1478 D
1115 1480 D
1111 1480 D
1107 1478 D
1104 1476 D
1103 1472 D
1103 1469 D
1104 1465 D
1107 1462 D
1111 1461 D
1114 1461 D
1118 1462 D
1120 1465 D
S
N
1111 1480 M
1108 1478 D
1105 1476 D
1104 1472 D
1104 1469 D
1105 1465 D
1108 1462 D
1111 1461 D
S
N
1131 1477 M
1131 1476 D
1130 1476 D
1130 1477 D
1131 1478 D
1134 1480 D
1140 1480 D
1142 1478 D
1144 1477 D
1145 1474 D
1145 1465 D
1146 1462 D
1148 1461 D
S
N
1144 1477 M
1144 1465 D
1145 1462 D
1148 1461 D
1149 1461 D
S
N
1144 1474 M
1142 1473 D
1134 1472 D
1130 1470 D
1129 1467 D
1129 1465 D
1130 1462 D
1134 1461 D
1138 1461 D
1141 1462 D
1144 1465 D
S
N
1134 1472 M
1131 1470 D
1130 1467 D
1130 1465 D
1131 1462 D
1134 1461 D
S
N
1159 1489 M
1159 1461 D
S
N
1160 1489 M
1160 1461 D
S
N
1155 1489 M
1160 1489 D
S
N
1155 1461 M
1164 1461 D
S
N
1172 1472 M
1189 1472 D
1189 1474 D
1187 1477 D
1186 1478 D
1183 1480 D
1179 1480 D
1175 1478 D
1172 1476 D
1171 1472 D
1171 1469 D
1172 1465 D
1175 1462 D
1179 1461 D
1182 1461 D
1186 1462 D
1189 1465 D
S
N
1187 1472 M
1187 1476 D
1186 1478 D
S
N
1179 1480 M
1176 1478 D
1174 1476 D
1172 1472 D
1172 1469 D
1174 1465 D
1176 1462 D
1179 1461 D
S
N
1222 1480 M
1222 1465 D
1223 1462 D
1227 1461 D
1230 1461 D
1234 1462 D
1237 1465 D
S
N
1223 1480 M
1223 1465 D
1224 1462 D
1227 1461 D
S
N
1237 1480 M
1237 1461 D
S
N
1238 1480 M
1238 1461 D
S
N
1218 1480 M
1223 1480 D
S
N
1233 1480 M
1238 1480 D
S
N
1237 1461 M
1242 1461 D
S
N
1252 1480 M
1252 1461 D
S
N
1253 1480 M
1253 1461 D
S
N
1253 1476 M
1256 1478 D
1260 1480 D
1263 1480 D
1267 1478 D
1268 1476 D
1268 1461 D
S
N
1263 1480 M
1265 1478 D
1267 1476 D
1267 1461 D
S
N
1248 1480 M
1253 1480 D
S
N
1248 1461 M
1257 1461 D
S
N
1263 1461 M
1272 1461 D
S
N
1296 1476 M
1294 1474 D
1296 1473 D
1297 1474 D
1297 1476 D
1294 1478 D
1291 1480 D
1287 1480 D
1283 1478 D
1281 1476 D
1279 1472 D
1279 1469 D
1281 1465 D
1283 1462 D
1287 1461 D
1290 1461 D
1294 1462 D
1297 1465 D
S
N
1287 1480 M
1285 1478 D
1282 1476 D
1281 1472 D
1281 1469 D
1282 1465 D
1285 1462 D
1287 1461 D
S
N
1308 1463 M
1307 1462 D
1308 1461 D
1309 1462 D
1308 1463 D
S
N
833 1304 M
833 1303 D
832 1303 D
832 1304 D
833 1305 D
836 1307 D
841 1307 D
844 1305 D
845 1304 D
847 1301 D
847 1292 D
848 1289 D
849 1288 D
S
N
845 1304 M
845 1292 D
847 1289 D
849 1288 D
851 1288 D
S
N
845 1301 M
844 1300 D
836 1299 D
832 1297 D
830 1294 D
830 1292 D
832 1289 D
836 1288 D
840 1288 D
843 1289 D
845 1292 D
S
N
836 1299 M
833 1297 D
832 1294 D
832 1292 D
833 1289 D
836 1288 D
S
N
860 1316 M
860 1288 D
S
N
862 1316 M
870 1292 D
S
N
860 1316 M
870 1288 D
S
N
879 1316 M
870 1288 D
S
N
879 1316 M
879 1288 D
S
N
881 1316 M
881 1288 D
S
N
856 1316 M
862 1316 D
S
N
879 1316 M
885 1316 D
S
N
856 1288 M
864 1288 D
S
N
875 1288 M
885 1288 D
S
N
911 1312 M
912 1308 D
912 1316 D
911 1312 D
908 1315 D
904 1316 D
901 1316 D
897 1315 D
895 1312 D
893 1309 D
892 1305 D
892 1299 D
893 1294 D
895 1292 D
897 1289 D
901 1288 D
904 1288 D
908 1289 D
911 1292 D
912 1294 D
S
N
901 1316 M
899 1315 D
896 1312 D
895 1309 D
893 1305 D
893 1299 D
895 1294 D
896 1292 D
899 1289 D
901 1288 D
S
N
941 1305 M
940 1308 D
937 1309 D
933 1309 D
930 1308 D
929 1307 D
927 1303 D
927 1299 D
929 1296 D
931 1294 D
936 1294 D
938 1296 D
940 1299 D
S
N
933 1309 M
930 1307 D
929 1303 D
929 1299 D
930 1296 D
931 1294 D
S
N
941 1309 M
940 1299 D
940 1296 D
942 1294 D
945 1294 D
948 1297 D
949 1301 D
949 1304 D
948 1308 D
947 1311 D
944 1314 D
941 1315 D
937 1316 D
933 1316 D
929 1315 D
926 1314 D
923 1311 D
922 1308 D
921 1304 D
921 1300 D
922 1296 D
923 1293 D
926 1290 D
929 1289 D
933 1288 D
937 1288 D
941 1289 D
944 1290 D
945 1292 D
S
N
942 1309 M
941 1299 D
941 1296 D
942 1294 D
S
N
960 1316 M
960 1288 D
S
N
962 1316 M
978 1290 D
S
N
962 1314 M
978 1288 D
S
N
978 1316 M
978 1288 D
S
N
956 1316 M
962 1316 D
S
N
974 1316 M
982 1316 D
S
N
956 1288 M
964 1288 D
S
N
992 1316 M
992 1288 D
S
N
993 1316 M
993 1288 D
S
N
988 1316 M
997 1316 D
S
N
988 1288 M
1008 1288 D
1008 1296 D
1007 1288 D
S
N
1023 1316 M
1019 1315 D
1016 1312 D
1015 1309 D
1014 1304 D
1014 1300 D
1015 1294 D
1016 1292 D
1019 1289 D
1023 1288 D
1026 1288 D
1030 1289 D
1033 1292 D
1034 1294 D
1035 1300 D
1035 1304 D
1034 1309 D
1033 1312 D
1030 1315 D
1026 1316 D
1023 1316 D
S
N
1023 1316 M
1020 1315 D
1018 1312 D
1016 1309 D
1015 1304 D
1015 1300 D
1016 1294 D
1018 1292 D
1020 1289 D
1023 1288 D
S
N
1026 1288 M
1029 1289 D
1031 1292 D
1033 1294 D
1034 1300 D
1034 1304 D
1033 1309 D
1031 1312 D
1029 1315 D
1026 1316 D
S
N
1046 1307 M
1045 1305 D
1046 1304 D
1048 1305 D
1046 1307 D
S
N
1046 1290 M
1045 1289 D
1046 1288 D
1048 1289 D
1046 1290 D
S
N
1082 1307 M
1082 1278 D
S
N
1083 1307 M
1083 1278 D
S
N
1083 1303 M
1086 1305 D
1089 1307 D
1092 1307 D
1096 1305 D
1098 1303 D
1100 1299 D
1100 1296 D
1098 1292 D
1096 1289 D
1092 1288 D
1089 1288 D
1086 1289 D
1083 1292 D
S
N
1092 1307 M
1094 1305 D
1097 1303 D
1098 1299 D
1098 1296 D
1097 1292 D
1094 1289 D
1092 1288 D
S
N
1078 1307 M
1083 1307 D
S
N
1078 1278 M
1088 1278 D
S
N
1124 1316 M
1124 1288 D
S
N
1126 1316 M
1126 1288 D
S
N
1124 1303 M
1122 1305 D
1119 1307 D
1116 1307 D
1112 1305 D
1109 1303 D
1108 1299 D
1108 1296 D
1109 1292 D
1112 1289 D
1116 1288 D
1119 1288 D
1122 1289 D
1124 1292 D
S
N
1116 1307 M
1114 1305 D
1111 1303 D
1109 1299 D
1109 1296 D
1111 1292 D
1114 1289 D
1116 1288 D
S
N
1120 1316 M
1126 1316 D
S
N
1124 1288 M
1130 1288 D
S
N
1146 1315 M
1145 1314 D
1146 1312 D
1148 1314 D
1148 1315 D
1146 1316 D
1144 1316 D
1141 1315 D
1140 1312 D
1140 1288 D
S
N
1144 1316 M
1142 1315 D
1141 1312 D
1141 1288 D
S
N
1135 1307 M
1146 1307 D
S
N
1135 1288 M
1145 1288 D
S
N
1179 1307 M
1179 1292 D
1181 1289 D
1185 1288 D
1187 1288 D
1192 1289 D
1194 1292 D
S
N
1181 1307 M
1181 1292 D
1182 1289 D
1185 1288 D
S
N
1194 1307 M
1194 1288 D
S
N
1196 1307 M
1196 1288 D
S
N
1175 1307 M
1181 1307 D
S
N
1190 1307 M
1196 1307 D
S
N
1194 1288 M
1200 1288 D
S
N
1209 1307 M
1209 1288 D
S
N
1211 1307 M
1211 1288 D
S
N
1211 1303 M
1213 1305 D
1218 1307 D
1220 1307 D
1224 1305 D
1226 1303 D
1226 1288 D
S
N
1220 1307 M
1223 1305 D
1224 1303 D
1224 1288 D
S
N
1205 1307 M
1211 1307 D
S
N
1205 1288 M
1215 1288 D
S
N
1220 1288 M
1230 1288 D
S
N
1253 1303 M
1252 1301 D
1253 1300 D
1254 1301 D
1254 1303 D
1252 1305 D
1249 1307 D
1245 1307 D
1241 1305 D
1238 1303 D
1237 1299 D
1237 1296 D
1238 1292 D
1241 1289 D
1245 1288 D
1248 1288 D
1252 1289 D
1254 1292 D
S
N
1245 1307 M
1242 1305 D
1239 1303 D
1238 1299 D
1238 1296 D
1239 1292 D
1242 1289 D
1245 1288 D
S
N
1265 1290 M
1264 1289 D
1265 1288 D
1267 1289 D
1265 1290 D
S
4 Sw
N
583 1520 M
583 1261 D
S
N
583 1261 M
1967 1261 D
S
N
1967 1261 M
1967 1520 D
S
N
1967 1520 M
583 1520 D
S
N
583 1261 M
1967 1261 D
S
N
583 1261 M
583 1276 D
S
N
662 1266 M
662 1261 D
S
N
741 1261 M
741 1266 D
S
N
820 1266 M
820 1261 D
S
N
899 1261 M
899 1266 D
S
N
978 1276 M
978 1261 D
S
N
1058 1261 M
1058 1266 D
S
N
1137 1266 M
1137 1261 D
S
N
1216 1261 M
1216 1266 D
S
N
1295 1266 M
1295 1261 D
S
N
1374 1261 M
1374 1276 D
S
N
1453 1266 M
1453 1261 D
S
N
1532 1261 M
1532 1266 D
S
N
1611 1266 M
1611 1261 D
S
N
1690 1261 M
1690 1266 D
S
N
1769 1276 M
1769 1261 D
S
N
1848 1261 M
1848 1266 D
S
N
1927 1266 M
1927 1261 D
S
N
583 1520 M
1967 1520 D
S
N
583 1505 M
583 1520 D
S
N
662 1520 M
662 1515 D
S
N
741 1515 M
741 1520 D
S
N
820 1520 M
820 1515 D
S
N
899 1515 M
899 1520 D
S
N
978 1520 M
978 1505 D
S
N
1058 1515 M
1058 1520 D
S
N
1137 1520 M
1137 1515 D
S
N
1216 1515 M
1216 1520 D
S
N
1295 1520 M
1295 1515 D
S
N
1374 1505 M
1374 1520 D
S
N
1453 1520 M
1453 1515 D
S
N
1532 1515 M
1532 1520 D
S
N
1611 1520 M
1611 1515 D
S
N
1690 1515 M
1690 1520 D
S
N
1769 1520 M
1769 1505 D
S
N
1848 1515 M
1848 1520 D
S
N
1927 1520 M
1927 1515 D
S
N
583 1261 M
583 1520 D
S
N
583 1261 M
588 1261 D
S
N
588 1273 M
583 1273 D
S
N
583 1285 M
599 1285 D
S
N
588 1297 M
583 1297 D
S
N
583 1309 M
588 1309 D
S
N
588 1321 M
583 1321 D
S
N
583 1333 M
588 1333 D
S
N
599 1345 M
583 1345 D
S
N
583 1357 M
588 1357 D
S
N
588 1369 M
583 1369 D
S
N
583 1381 M
588 1381 D
S
N
588 1394 M
583 1394 D
S
N
583 1406 M
599 1406 D
S
N
588 1418 M
583 1418 D
S
N
583 1430 M
588 1430 D
S
N
588 1442 M
583 1442 D
S
N
583 1454 M
588 1454 D
S
N
599 1466 M
583 1466 D
S
N
583 1478 M
588 1478 D
S
N
588 1490 M
583 1490 D
S
N
583 1502 M
588 1502 D
S
N
588 1514 M
583 1514 D
S
N
503 1298 M
498 1297 D
495 1292 D
494 1285 D
494 1280 D
495 1273 D
498 1268 D
503 1267 D
506 1267 D
510 1268 D
513 1273 D
515 1280 D
515 1285 D
513 1292 D
510 1297 D
506 1298 D
503 1298 D
S
N
503 1298 M
500 1297 D
498 1295 D
497 1292 D
495 1285 D
495 1280 D
497 1273 D
498 1270 D
500 1268 D
503 1267 D
S
N
506 1267 M
509 1268 D
510 1270 D
512 1273 D
513 1280 D
513 1285 D
512 1292 D
510 1295 D
509 1297 D
506 1298 D
S
N
527 1270 M
525 1268 D
527 1267 D
528 1268 D
527 1270 D
S
N
547 1298 M
542 1297 D
541 1294 D
541 1289 D
542 1286 D
547 1285 D
553 1285 D
557 1286 D
559 1289 D
559 1294 D
557 1297 D
553 1298 D
547 1298 D
S
N
547 1298 M
544 1297 D
542 1294 D
542 1289 D
544 1286 D
547 1285 D
S
N
553 1285 M
556 1286 D
557 1289 D
557 1294 D
556 1297 D
553 1298 D
S
N
547 1285 M
542 1283 D
541 1282 D
539 1279 D
539 1273 D
541 1270 D
542 1268 D
547 1267 D
553 1267 D
557 1268 D
559 1270 D
560 1273 D
560 1279 D
559 1282 D
557 1283 D
553 1285 D
S
N
547 1285 M
544 1283 D
542 1282 D
541 1279 D
541 1273 D
542 1270 D
544 1268 D
547 1267 D
S
N
553 1267 M
556 1268 D
557 1270 D
559 1273 D
559 1279 D
557 1282 D
556 1283 D
553 1285 D
S
N
503 1359 M
498 1357 D
495 1353 D
494 1345 D
494 1341 D
495 1333 D
498 1329 D
503 1327 D
506 1327 D
510 1329 D
513 1333 D
515 1341 D
515 1345 D
513 1353 D
510 1357 D
506 1359 D
503 1359 D
S
N
503 1359 M
500 1357 D
498 1356 D
497 1353 D
495 1345 D
495 1341 D
497 1333 D
498 1330 D
500 1329 D
503 1327 D
S
N
506 1327 M
509 1329 D
510 1330 D
512 1333 D
513 1341 D
513 1345 D
512 1353 D
510 1356 D
509 1357 D
506 1359 D
S
N
527 1330 M
525 1329 D
527 1327 D
528 1329 D
527 1330 D
S
N
559 1348 M
557 1344 D
554 1341 D
550 1339 D
548 1339 D
544 1341 D
541 1344 D
539 1348 D
539 1350 D
541 1354 D
544 1357 D
548 1359 D
551 1359 D
556 1357 D
559 1354 D
560 1350 D
560 1341 D
559 1335 D
557 1332 D
554 1329 D
550 1327 D
545 1327 D
542 1329 D
541 1332 D
541 1333 D
542 1335 D
544 1333 D
542 1332 D
S
N
548 1339 M
545 1341 D
542 1344 D
541 1348 D
541 1350 D
542 1354 D
545 1357 D
548 1359 D
S
N
551 1359 M
554 1357 D
557 1354 D
559 1350 D
559 1341 D
557 1335 D
556 1332 D
553 1329 D
550 1327 D
S
N
498 1413 M
501 1415 D
506 1419 D
506 1387 D
S
N
504 1418 M
504 1387 D
S
N
498 1387 M
512 1387 D
S
N
527 1390 M
525 1389 D
527 1387 D
528 1389 D
527 1390 D
S
N
548 1419 M
544 1418 D
541 1413 D
539 1406 D
539 1401 D
541 1394 D
544 1389 D
548 1387 D
551 1387 D
556 1389 D
559 1394 D
560 1401 D
560 1406 D
559 1413 D
556 1418 D
551 1419 D
548 1419 D
S
N
548 1419 M
545 1418 D
544 1416 D
542 1413 D
541 1406 D
541 1401 D
542 1394 D
544 1390 D
545 1389 D
548 1387 D
S
N
551 1387 M
554 1389 D
556 1390 D
557 1394 D
559 1401 D
559 1406 D
557 1413 D
556 1416 D
554 1418 D
551 1419 D
S
N
498 1473 M
501 1475 D
506 1480 D
506 1448 D
S
N
504 1478 M
504 1448 D
S
N
498 1448 M
512 1448 D
S
N
527 1451 M
525 1449 D
527 1448 D
528 1449 D
527 1451 D
S
N
544 1473 M
547 1475 D
551 1480 D
551 1448 D
S
N
550 1478 M
550 1448 D
S
N
544 1448 M
557 1448 D
S
N
1962 1261 M
1967 1261 D
S
N
1967 1273 M
1962 1273 D
S
N
1951 1285 M
1967 1285 D
S
N
1967 1297 M
1962 1297 D
S
N
1962 1309 M
1967 1309 D
S
N
1967 1321 M
1962 1321 D
S
N
1962 1333 M
1967 1333 D
S
N
1967 1345 M
1951 1345 D
S
N
1962 1357 M
1967 1357 D
S
N
1967 1369 M
1962 1369 D
S
N
1962 1381 M
1967 1381 D
S
N
1967 1394 M
1962 1394 D
S
N
1951 1406 M
1967 1406 D
S
N
1967 1418 M
1962 1418 D
S
N
1962 1430 M
1967 1430 D
S
N
1967 1442 M
1962 1442 D
S
N
1962 1454 M
1967 1454 D
S
N
1967 1466 M
1951 1466 D
S
N
1962 1478 M
1967 1478 D
S
N
1967 1490 M
1962 1490 D
S
N
1962 1502 M
1967 1502 D
S
N
1967 1514 M
1962 1514 D
S
N
678 1261 M
678 1417 D
694 1417 D
694 1419 D
710 1419 D
710 1419 D
725 1419 D
725 1418 D
741 1418 D
741 1418 D
757 1418 D
757 1418 D
773 1418 D
773 1418 D
789 1418 D
789 1417 D
804 1417 D
804 1418 D
820 1418 D
820 1418 D
836 1418 D
836 1418 D
852 1418 D
852 1418 D
868 1418 D
868 1419 D
884 1419 D
884 1419 D
899 1419 D
899 1420 D
915 1420 D
915 1420 D
931 1420 D
931 1421 D
947 1421 D
947 1422 D
963 1422 D
963 1422 D
978 1422 D
978 1423 D
994 1423 D
994 1424 D
1010 1424 D
1010 1424 D
1026 1424 D
1026 1425 D
1042 1425 D
1042 1426 D
1058 1426 D
1058 1427 D
1073 1427 D
1073 1427 D
1089 1427 D
1089 1428 D
1105 1428 D
1105 1428 D
1121 1428 D
1121 1429 D
1137 1429 D
1137 1430 D
1152 1430 D
1152 1430 D
1168 1430 D
1168 1431 D
1184 1431 D
1184 1432 D
1200 1432 D
1200 1432 D
1216 1432 D
1216 1433 D
1232 1433 D
1232 1434 D
1247 1434 D
1247 1434 D
1263 1434 D
1263 1434 D
1279 1434 D
1279 1435 D
1295 1435 D
1295 1436 D
1311 1436 D
1311 1437 D
1326 1437 D
1326 1437 D
1342 1437 D
1342 1438 D
1358 1438 D
1358 1438 D
1374 1438 D
1374 1439 D
1390 1439 D
1390 1440 D
1405 1440 D
1405 1440 D
1421 1440 D
1421 1441 D
1437 1441 D
1437 1442 D
1453 1442 D
1453 1442 D
1469 1442 D
1469 1443 D
1485 1443 D
1485 1444 D
1500 1444 D
1500 1443 D
1516 1443 D
1516 1445 D
1532 1445 D
1532 1445 D
1548 1445 D
1548 1446 D
1564 1446 D
1564 1446 D
1579 1446 D
1579 1446 D
1595 1446 D
1595 1448 D
1611 1448 D
1611 1447 D
1627 1447 D
1627 1449 D
1643 1449 D
1643 1448 D
1659 1448 D
1659 1450 D
1659 1450 D
1659 1450 D
1674 1450 D
1674 1448 D
1690 1448 D
1690 1449 D
1706 1449 D
1706 1453 D
1722 1453 D
1722 1452 D
1738 1452 D
1738 1450 D
1753 1450 D
1753 1452 D
1769 1452 D
1769 1456 D
1785 1456 D
1785 1454 D
1801 1454 D
1801 1457 D
1817 1457 D
1817 1455 D
1833 1455 D
1833 1453 D
1848 1453 D
1848 1453 D
1864 1453 D
1864 1457 D
1880 1457 D
1880 1457 D
1896 1457 D
1896 1451 D
1912 1451 D
1912 1462 D
1927 1462 D
1927 1459 D
1943 1459 D
1943 1455 D
1959 1455 D
1959 1457 D
1967 1457 D
S
N
678 1261 M
678 1396 D
694 1396 D
694 1391 D
710 1391 D
710 1391 D
725 1391 D
725 1393 D
741 1393 D
741 1392 D
757 1392 D
757 1392 D
773 1392 D
773 1392 D
789 1392 D
789 1392 D
804 1392 D
804 1392 D
820 1392 D
820 1392 D
836 1392 D
836 1391 D
852 1391 D
852 1391 D
868 1391 D
868 1390 D
884 1390 D
884 1390 D
899 1390 D
899 1389 D
915 1389 D
915 1388 D
931 1388 D
931 1388 D
947 1388 D
947 1387 D
963 1387 D
963 1386 D
978 1386 D
978 1385 D
994 1385 D
994 1384 D
1010 1384 D
1010 1384 D
1026 1384 D
1026 1383 D
1042 1383 D
1042 1383 D
1058 1383 D
1058 1382 D
1073 1382 D
1073 1381 D
1089 1381 D
1089 1380 D
1105 1380 D
1105 1380 D
1121 1380 D
1121 1379 D
1137 1379 D
1137 1379 D
1152 1379 D
1152 1378 D
1168 1378 D
1168 1377 D
1184 1377 D
1184 1377 D
1200 1377 D
1200 1376 D
1216 1376 D
1216 1376 D
1232 1376 D
1232 1375 D
1247 1375 D
1247 1374 D
1263 1374 D
1263 1374 D
1279 1374 D
1279 1374 D
1295 1374 D
1295 1373 D
1311 1373 D
1311 1372 D
1326 1372 D
1326 1372 D
1342 1372 D
1342 1371 D
1358 1371 D
1358 1371 D
1374 1371 D
1374 1370 D
1390 1370 D
1390 1370 D
1405 1370 D
1405 1370 D
1421 1370 D
1421 1369 D
1437 1369 D
1437 1368 D
1453 1368 D
1453 1367 D
1469 1367 D
1469 1366 D
1485 1366 D
1485 1365 D
1500 1365 D
1500 1366 D
1516 1366 D
1516 1365 D
1532 1365 D
1532 1365 D
1548 1365 D
1548 1364 D
1564 1364 D
1564 1364 D
1579 1364 D
1579 1364 D
1595 1364 D
1595 1362 D
1611 1362 D
1611 1363 D
1627 1363 D
1627 1362 D
1643 1362 D
1643 1362 D
1659 1362 D
1659 1360 D
1659 1360 D
1659 1360 D
1674 1360 D
1674 1363 D
1690 1363 D
1690 1361 D
1706 1361 D
1706 1358 D
1722 1358 D
1722 1358 D
1738 1358 D
1738 1361 D
1753 1361 D
1753 1359 D
1769 1359 D
1769 1355 D
1785 1355 D
1785 1356 D
1801 1356 D
1801 1354 D
1817 1354 D
1817 1356 D
1833 1356 D
1833 1359 D
1848 1359 D
1848 1358 D
1864 1358 D
1864 1355 D
1880 1355 D
1880 1355 D
1896 1355 D
1896 1360 D
1912 1360 D
1912 1350 D
1927 1350 D
1927 1352 D
1943 1352 D
1943 1356 D
1959 1356 D
1959 1354 D
1967 1354 D
S
N
721 1304 M
808 1304 D
S
0 0 1 setrgbcolor
N
678 1261 M
678 1273 D
S
N
678 1285 M
678 1297 D
S
N
678 1309 M
678 1321 D
S
N
678 1333 M
678 1346 D
S
N
678 1358 M
678 1370 D
S
N
678 1382 M
678 1394 D
S
N
678 1406 M
678 1418 D
S
N
678 1430 M
678 1442 D
S
N
680 1452 M
692 1452 D
S
N
694 1442 M
694 1430 D
S
N
694 1418 M
694 1414 D
702 1414 D
S
N
713 1415 M
725 1415 D
S
N
729 1407 M
741 1407 D
741 1408 D
S
N
752 1408 M
757 1408 D
757 1409 D
764 1409 D
S
N
775 1408 M
787 1408 D
S
N
799 1407 M
804 1407 D
804 1409 D
809 1409 D
S
N
820 1409 M
833 1409 D
S
N
843 1408 M
852 1408 D
852 1410 D
853 1410 D
S
N
865 1410 M
868 1410 D
868 1409 D
876 1409 D
S
N
886 1411 M
898 1411 D
S
N
908 1414 M
915 1414 D
915 1412 D
919 1412 D
S
N
931 1412 M
931 1412 D
931 1417 D
938 1417 D
S
N
949 1416 M
961 1416 D
S
N
970 1419 M
978 1419 D
978 1422 D
979 1422 D
S
N
991 1422 M
994 1422 D
994 1428 D
997 1428 D
S
N
1009 1428 M
1010 1428 D
1010 1435 D
1014 1435 D
S
N
1026 1436 M
1026 1436 D
1037 1436 D
S
N
1047 1439 M
1058 1439 D
1058 1440 D
S
N
1065 1445 M
1073 1445 D
1073 1449 D
1073 1449 D
S
N
1086 1449 M
1089 1449 D
1089 1448 D
1097 1448 D
S
N
1105 1452 M
1105 1459 D
1111 1459 D
S
N
1121 1457 M
1133 1457 D
S
N
1138 1464 M
1150 1464 D
S
N
1162 1464 M
1168 1464 D
1168 1470 D
S
N
1174 1476 M
1184 1476 D
1184 1477 D
1184 1477 D
S
N
1197 1477 M
1200 1477 D
1200 1486 D
S
N
1208 1490 M
1216 1490 D
1216 1490 D
1220 1490 D
S
N
1232 1491 M
1232 1494 D
1240 1494 D
S
N
1250 1496 M
1263 1496 D
S
N
1269 1502 M
1279 1502 D
1279 1504 D
S
N
1283 1512 M
1295 1512 D
1295 1512 D
S
N
1297 1502 M
1309 1502 D
S
N
1311 1513 M
1311 1520 D
S
N
1326 1520 M
1326 1515 D
S
N
1326 1503 M
1326 1500 D
1335 1500 D
S
N
1342 1505 M
1342 1517 D
S
N
678 1261 M
678 1273 D
S
N
678 1285 M
678 1297 D
S
N
678 1309 M
678 1321 D
S
N
678 1333 M
678 1346 D
S
N
684 1352 M
694 1352 D
694 1350 D
S
N
698 1342 M
710 1342 D
710 1342 D
S
N
719 1339 M
725 1339 D
725 1344 D
726 1344 D
S
N
738 1344 M
741 1344 D
741 1353 D
S
N
741 1365 M
741 1373 D
746 1373 D
S
N
757 1372 M
757 1362 D
759 1362 D
S
N
771 1362 M
773 1362 D
773 1372 D
773 1372 D
S
N
785 1372 M
789 1372 D
789 1369 D
794 1369 D
S
N
804 1371 M
804 1375 D
812 1375 D
S
N
821 1371 M
833 1371 D
S
N
842 1375 M
852 1375 D
852 1373 D
S
N
864 1372 M
868 1372 D
868 1371 D
874 1371 D
S
N
884 1368 M
884 1368 D
896 1368 D
S
N
903 1363 M
915 1363 D
S
N
927 1363 M
931 1363 D
931 1359 D
934 1359 D
S
N
946 1359 M
947 1359 D
947 1359 D
958 1359 D
S
N
966 1356 M
978 1356 D
S
N
987 1353 M
994 1353 D
994 1348 D
S
N
1006 1347 M
1010 1347 D
1010 1343 D
1014 1343 D
S
N
1026 1343 M
1026 1343 D
1026 1343 D
1038 1343 D
S
N
1048 1341 M
1058 1341 D
1058 1338 D
S
N
1069 1338 M
1073 1338 D
1073 1336 D
1079 1336 D
S
N
1091 1335 M
1103 1335 D
S
N
1110 1331 M
1121 1331 D
1121 1331 D
1122 1331 D
S
N
1134 1331 M
1137 1331 D
1137 1328 D
1143 1328 D
S
N
1155 1328 M
1167 1328 D
S
N
1173 1322 M
1184 1322 D
1184 1321 D
1184 1321 D
S
N
1196 1321 M
1200 1321 D
1200 1316 D
1203 1316 D
S
N
1215 1316 M
1216 1316 D
1216 1315 D
1227 1315 D
S
N
1237 1313 M
1247 1313 D
1247 1312 D
1248 1312 D
S
N
1260 1312 M
1263 1312 D
1263 1310 D
1270 1310 D
S
N
1279 1307 M
1279 1305 D
1290 1305 D
S
N
1298 1309 M
1310 1309 D
S
N
1314 1301 M
1326 1301 D
1326 1301 D
S
N
1330 1309 M
1342 1309 D
S
N
1345 1300 M
1357 1300 D
S
N
1367 1298 M
1374 1298 D
1374 1294 D
1375 1294 D
S
N
1387 1294 M
1390 1294 D
1390 1295 D
1398 1295 D
S
N
1410 1294 M
1421 1294 D
1421 1293 D
S
N
1433 1293 M
1437 1293 D
1437 1295 D
1443 1295 D
S
N
1453 1293 M
1453 1286 D
1458 1286 D
S
N
1469 1288 M
1469 1294 D
1475 1294 D
S
N
1485 1292 M
1485 1281 D
1486 1281 D
S
N
1498 1281 M
1500 1281 D
1500 1283 D
1508 1283 D
S
N
1518 1285 M
1530 1285 D
S
N
1541 1285 M
1548 1285 D
1548 1280 D
1549 1280 D
S
N
1561 1280 M
1564 1280 D
1564 1280 D
1572 1280 D
S
N
1579 1275 M
1579 1275 D
1591 1275 D
S
N
1601 1273 M
1611 1273 D
1611 1274 D
S
N
1623 1274 M
1627 1274 D
1627 1270 D
1631 1270 D
S
N
1643 1271 M
1643 1275 D
1650 1275 D
S
N
1659 1271 M
1659 1270 D
1659 1270 D
1659 1270 D
1669 1270 D
S
N
1676 1265 M
1688 1265 D
S
N
1699 1266 M
1706 1266 D
1706 1263 D
1708 1263 D
S
N
1721 1263 M
1722 1263 D
1722 1267 D
1729 1267 D
S
N
1738 1270 M
1738 1273 D
1747 1273 D
S
N
1753 1267 M
1753 1267 D
1765 1267 D
S
N
1785 1262 M
1785 1265 D
1795 1265 D
S
N
1833 1262 M
1833 1271 D
1836 1271 D
S
N
1848 1271 M
1848 1271 D
1848 1261 D
S
N
1864 1261 M
1864 1262 D
S
N
1874 1265 M
1880 1265 D
1880 1261 D
S
N
1896 1261 M
1896 1262 D
S
N
1905 1266 M
1912 1266 D
1912 1261 D
S
N
721 1477 M
734 1477 D
S
N
746 1477 M
758 1477 D
S
N
770 1477 M
782 1477 D
S
N
794 1477 M
806 1477 D
S
3 Sw
0 0 0 setrgbcolor
N
833 1230 M
833 1201 D
S
N
834 1230 M
834 1201 D
S
N
829 1230 M
845 1230 D
849 1228 D
851 1227 D
852 1224 D
852 1220 D
851 1217 D
849 1216 D
845 1215 D
834 1215 D
S
N
845 1230 M
848 1228 D
849 1227 D
851 1224 D
851 1220 D
849 1217 D
848 1216 D
845 1215 D
S
N
829 1201 M
838 1201 D
S
N
870 1230 M
866 1228 D
863 1226 D
862 1223 D
860 1217 D
860 1213 D
862 1208 D
863 1205 D
866 1202 D
870 1201 D
873 1201 D
877 1202 D
879 1205 D
881 1208 D
882 1213 D
882 1217 D
881 1223 D
879 1226 D
877 1228 D
873 1230 D
870 1230 D
S
N
870 1230 M
867 1228 D
864 1226 D
863 1223 D
862 1217 D
862 1213 D
863 1208 D
864 1205 D
867 1202 D
870 1201 D
S
N
873 1201 M
875 1202 D
878 1205 D
879 1208 D
881 1213 D
881 1217 D
879 1223 D
878 1226 D
875 1228 D
873 1230 D
S
N
892 1230 M
897 1201 D
S
N
893 1230 M
897 1208 D
S
N
903 1230 M
897 1201 D
S
N
903 1230 M
908 1201 D
S
N
904 1230 M
908 1208 D
S
N
914 1230 M
908 1201 D
S
N
888 1230 M
897 1230 D
S
N
910 1230 M
918 1230 D
S
N
926 1230 M
926 1201 D
S
N
927 1230 M
927 1201 D
S
N
944 1230 M
944 1201 D
S
N
945 1230 M
945 1201 D
S
N
922 1230 M
931 1230 D
S
N
940 1230 M
949 1230 D
S
N
927 1216 M
944 1216 D
S
N
922 1201 M
931 1201 D
S
N
940 1201 M
949 1201 D
S
N
959 1230 M
959 1201 D
S
N
960 1230 M
960 1201 D
S
N
968 1222 M
968 1211 D
S
N
955 1230 M
977 1230 D
977 1222 D
975 1230 D
S
N
960 1216 M
968 1216 D
S
N
955 1201 M
977 1201 D
977 1209 D
975 1201 D
S
N
988 1230 M
988 1201 D
S
N
989 1230 M
989 1201 D
S
N
983 1230 M
993 1230 D
S
N
983 1201 M
1004 1201 D
1004 1209 D
1003 1201 D
S
N
1012 1220 M
1011 1219 D
1012 1217 D
1014 1219 D
1012 1220 D
S
N
1012 1204 M
1011 1202 D
1012 1201 D
1014 1202 D
1012 1204 D
S
N
1048 1220 M
1048 1191 D
S
N
1049 1220 M
1049 1191 D
S
N
1049 1216 M
1052 1219 D
1055 1220 D
1057 1220 D
1061 1219 D
1064 1216 D
1066 1212 D
1066 1209 D
1064 1205 D
1061 1202 D
1057 1201 D
1055 1201 D
1052 1202 D
1049 1205 D
S
N
1057 1220 M
1060 1219 D
1063 1216 D
1064 1212 D
1064 1209 D
1063 1205 D
1060 1202 D
1057 1201 D
S
N
1044 1220 M
1049 1220 D
S
N
1044 1191 M
1053 1191 D
S
N
1075 1220 M
1083 1201 D
S
N
1077 1220 M
1083 1204 D
S
N
1092 1220 M
1083 1201 D
1081 1196 D
1078 1193 D
1075 1191 D
1074 1191 D
1072 1193 D
1074 1194 D
1075 1193 D
S
N
1072 1220 M
1081 1220 D
S
N
1086 1220 M
1094 1220 D
S
N
1103 1230 M
1103 1207 D
1104 1202 D
1107 1201 D
1109 1201 D
1112 1202 D
1114 1205 D
S
N
1104 1230 M
1104 1207 D
1105 1202 D
1107 1201 D
S
N
1098 1220 M
1109 1220 D
S
N
1123 1230 M
1123 1201 D
S
N
1124 1230 M
1124 1201 D
S
N
1124 1216 M
1127 1219 D
1131 1220 D
1134 1220 D
1138 1219 D
1140 1216 D
1140 1201 D
S
N
1134 1220 M
1137 1219 D
1138 1216 D
1138 1201 D
S
N
1119 1230 M
1124 1230 D
S
N
1119 1201 M
1129 1201 D
S
N
1134 1201 M
1144 1201 D
S
N
1153 1230 M
1152 1228 D
1153 1227 D
1155 1228 D
1153 1230 D
S
N
1153 1220 M
1153 1201 D
S
N
1155 1220 M
1155 1201 D
S
N
1149 1220 M
1155 1220 D
S
N
1149 1201 M
1159 1201 D
S
N
1168 1217 M
1168 1216 D
1167 1216 D
1167 1217 D
1168 1219 D
1171 1220 D
1176 1220 D
1179 1219 D
1181 1217 D
1182 1215 D
1182 1205 D
1183 1202 D
1185 1201 D
S
N
1181 1217 M
1181 1205 D
1182 1202 D
1185 1201 D
1186 1201 D
S
N
1181 1215 M
1179 1213 D
1171 1212 D
1167 1211 D
1166 1208 D
1166 1205 D
1167 1202 D
1171 1201 D
1175 1201 D
1178 1202 D
1181 1205 D
S
N
1171 1212 M
1168 1211 D
1167 1208 D
1167 1205 D
1168 1202 D
1171 1201 D
S
N
1216 1235 M
1192 1191 D
S
N
1226 1230 M
1226 1201 D
S
N
1227 1230 M
1227 1201 D
S
N
1227 1216 M
1230 1219 D
1234 1220 D
1237 1220 D
1241 1219 D
1242 1216 D
1242 1201 D
S
N
1237 1220 M
1239 1219 D
1241 1216 D
1241 1201 D
S
N
1222 1230 M
1227 1230 D
S
N
1222 1201 M
1231 1201 D
S
N
1237 1201 M
1246 1201 D
S
N
1254 1212 M
1271 1212 D
1271 1215 D
1270 1217 D
1268 1219 D
1265 1220 D
1261 1220 D
1257 1219 D
1254 1216 D
1253 1212 D
1253 1209 D
1254 1205 D
1257 1202 D
1261 1201 D
1264 1201 D
1268 1202 D
1271 1205 D
S
N
1270 1212 M
1270 1216 D
1268 1219 D
S
N
1261 1220 M
1259 1219 D
1256 1216 D
1254 1212 D
1254 1209 D
1256 1205 D
1259 1202 D
1261 1201 D
S
N
1282 1220 M
1282 1201 D
S
N
1283 1220 M
1283 1201 D
S
N
1283 1212 M
1285 1216 D
1287 1219 D
1290 1220 D
1294 1220 D
1296 1219 D
1296 1217 D
1294 1216 D
1293 1217 D
1294 1219 D
S
N
1278 1220 M
1283 1220 D
S
N
1278 1201 M
1287 1201 D
S
N
1304 1220 M
1309 1201 D
S
N
1305 1220 M
1309 1205 D
S
N
1315 1220 M
1309 1201 D
S
N
1315 1220 M
1320 1201 D
S
N
1316 1220 M
1320 1205 D
S
N
1326 1220 M
1320 1201 D
S
N
1300 1220 M
1309 1220 D
S
N
1322 1220 M
1330 1220 D
S
N
1338 1230 M
1337 1228 D
1338 1227 D
1339 1228 D
1338 1230 D
S
N
1338 1220 M
1338 1201 D
S
N
1339 1220 M
1339 1201 D
S
N
1334 1220 M
1339 1220 D
S
N
1334 1201 M
1343 1201 D
S
N
1357 1220 M
1354 1219 D
1353 1217 D
1352 1215 D
1352 1212 D
1353 1209 D
1354 1208 D
1357 1207 D
1360 1207 D
1363 1208 D
1364 1209 D
1365 1212 D
1365 1215 D
1364 1217 D
1363 1219 D
1360 1220 D
1357 1220 D
S
N
1354 1219 M
1353 1216 D
1353 1211 D
1354 1208 D
S
N
1363 1208 M
1364 1211 D
1364 1216 D
1363 1219 D
S
N
1364 1217 M
1365 1219 D
1368 1220 D
1368 1219 D
1365 1219 D
S
N
1353 1209 M
1352 1208 D
1350 1205 D
1350 1204 D
1352 1201 D
1356 1200 D
1363 1200 D
1367 1198 D
1368 1197 D
S
N
1350 1204 M
1352 1202 D
1356 1201 D
1363 1201 D
1367 1200 D
1368 1197 D
1368 1196 D
1367 1193 D
1363 1191 D
1354 1191 D
1350 1193 D
1349 1196 D
1349 1197 D
1350 1200 D
1354 1201 D
S
N
833 1057 M
833 1028 D
S
N
834 1057 M
834 1028 D
S
N
829 1057 M
845 1057 D
849 1055 D
851 1054 D
852 1051 D
852 1047 D
851 1044 D
849 1043 D
845 1042 D
834 1042 D
S
N
845 1057 M
848 1055 D
849 1054 D
851 1051 D
851 1047 D
849 1044 D
848 1043 D
845 1042 D
S
N
829 1028 M
838 1028 D
S
N
870 1057 M
866 1055 D
863 1053 D
862 1050 D
860 1044 D
860 1040 D
862 1035 D
863 1032 D
866 1029 D
870 1028 D
873 1028 D
877 1029 D
879 1032 D
881 1035 D
882 1040 D
882 1044 D
881 1050 D
879 1053 D
877 1055 D
873 1057 D
870 1057 D
S
N
870 1057 M
867 1055 D
864 1053 D
863 1050 D
862 1044 D
862 1040 D
863 1035 D
864 1032 D
867 1029 D
870 1028 D
S
N
873 1028 M
875 1029 D
878 1032 D
879 1035 D
881 1040 D
881 1044 D
879 1050 D
878 1053 D
875 1055 D
873 1057 D
S
N
892 1057 M
897 1028 D
S
N
893 1057 M
897 1035 D
S
N
903 1057 M
897 1028 D
S
N
903 1057 M
908 1028 D
S
N
904 1057 M
908 1035 D
S
N
914 1057 M
908 1028 D
S
N
888 1057 M
897 1057 D
S
N
910 1057 M
918 1057 D
S
N
926 1057 M
926 1028 D
S
N
927 1057 M
927 1028 D
S
N
944 1057 M
944 1028 D
S
N
945 1057 M
945 1028 D
S
N
922 1057 M
931 1057 D
S
N
940 1057 M
949 1057 D
S
N
927 1043 M
944 1043 D
S
N
922 1028 M
931 1028 D
S
N
940 1028 M
949 1028 D
S
N
959 1057 M
959 1028 D
S
N
960 1057 M
960 1028 D
S
N
968 1049 M
968 1038 D
S
N
955 1057 M
977 1057 D
977 1049 D
975 1057 D
S
N
960 1043 M
968 1043 D
S
N
955 1028 M
977 1028 D
977 1036 D
975 1028 D
S
N
988 1057 M
988 1028 D
S
N
989 1057 M
989 1028 D
S
N
983 1057 M
993 1057 D
S
N
983 1028 M
1004 1028 D
1004 1036 D
1003 1028 D
S
N
1033 1062 M
1008 1018 D
S
N
1042 1044 M
1042 1043 D
1041 1043 D
1041 1044 D
1042 1046 D
1045 1047 D
1051 1047 D
1053 1046 D
1055 1044 D
1056 1042 D
1056 1032 D
1057 1029 D
1059 1028 D
S
N
1055 1044 M
1055 1032 D
1056 1029 D
1059 1028 D
1060 1028 D
S
N
1055 1042 M
1053 1040 D
1045 1039 D
1041 1038 D
1040 1035 D
1040 1032 D
1041 1029 D
1045 1028 D
1049 1028 D
1052 1029 D
1055 1032 D
S
N
1045 1039 M
1042 1038 D
1041 1035 D
1041 1032 D
1042 1029 D
1045 1028 D
S
N
1070 1057 M
1070 1028 D
S
N
1071 1057 M
1079 1032 D
S
N
1070 1057 M
1079 1028 D
S
N
1089 1057 M
1079 1028 D
S
N
1089 1057 M
1089 1028 D
S
N
1090 1057 M
1090 1028 D
S
N
1066 1057 M
1071 1057 D
S
N
1089 1057 M
1094 1057 D
S
N
1066 1028 M
1074 1028 D
S
N
1085 1028 M
1094 1028 D
S
N
1120 1053 M
1122 1049 D
1122 1057 D
1120 1053 D
1118 1055 D
1114 1057 D
1111 1057 D
1107 1055 D
1104 1053 D
1103 1050 D
1101 1046 D
1101 1039 D
1103 1035 D
1104 1032 D
1107 1029 D
1111 1028 D
1114 1028 D
1118 1029 D
1120 1032 D
1122 1035 D
S
N
1111 1057 M
1108 1055 D
1105 1053 D
1104 1050 D
1103 1046 D
1103 1039 D
1104 1035 D
1105 1032 D
1108 1029 D
1111 1028 D
S
N
1150 1046 M
1149 1049 D
1146 1050 D
1142 1050 D
1140 1049 D
1138 1047 D
1137 1043 D
1137 1039 D
1138 1036 D
1141 1035 D
1145 1035 D
1148 1036 D
1149 1039 D
S
N
1142 1050 M
1140 1047 D
1138 1043 D
1138 1039 D
1140 1036 D
1141 1035 D
S
N
1150 1050 M
1149 1039 D
1149 1036 D
1152 1035 D
1155 1035 D
1157 1038 D
1159 1042 D
1159 1044 D
1157 1049 D
1156 1051 D
1153 1054 D
1150 1055 D
1146 1057 D
1142 1057 D
1138 1055 D
1135 1054 D
1133 1051 D
1131 1049 D
1130 1044 D
1130 1040 D
1131 1036 D
1133 1034 D
1135 1031 D
1138 1029 D
1142 1028 D
1146 1028 D
1150 1029 D
1153 1031 D
1155 1032 D
S
N
1152 1050 M
1150 1039 D
1150 1036 D
1152 1035 D
S
N
1170 1057 M
1170 1028 D
S
N
1171 1057 M
1187 1031 D
S
N
1171 1054 M
1187 1028 D
S
N
1187 1057 M
1187 1028 D
S
N
1166 1057 M
1171 1057 D
S
N
1183 1057 M
1192 1057 D
S
N
1166 1028 M
1174 1028 D
S
N
1201 1057 M
1201 1028 D
S
N
1202 1057 M
1202 1028 D
S
N
1197 1057 M
1207 1057 D
S
N
1197 1028 M
1218 1028 D
1218 1036 D
1216 1028 D
S
N
1233 1057 M
1228 1055 D
1226 1053 D
1224 1050 D
1223 1044 D
1223 1040 D
1224 1035 D
1226 1032 D
1228 1029 D
1233 1028 D
1235 1028 D
1239 1029 D
1242 1032 D
1244 1035 D
1245 1040 D
1245 1044 D
1244 1050 D
1242 1053 D
1239 1055 D
1235 1057 D
1233 1057 D
S
N
1233 1057 M
1230 1055 D
1227 1053 D
1226 1050 D
1224 1044 D
1224 1040 D
1226 1035 D
1227 1032 D
1230 1029 D
1233 1028 D
S
N
1235 1028 M
1238 1029 D
1241 1032 D
1242 1035 D
1244 1040 D
1244 1044 D
1242 1050 D
1241 1053 D
1238 1055 D
1235 1057 D
S
4 Sw
N
1756 906 M
1756 874 D
S
N
1758 906 M
1758 874 D
S
N
1776 906 M
1776 874 D
S
N
1777 906 M
1777 874 D
S
N
1752 906 M
1762 906 D
S
N
1771 906 M
1782 906 D
S
N
1758 891 M
1776 891 D
S
N
1752 874 M
1762 874 D
S
N
1771 874 M
1782 874 D
S
N
1796 883 M
1796 862 D
S
N
1797 883 M
1797 862 D
S
N
1790 883 M
1789 877 D
1789 883 D
1804 883 D
1804 877 D
1803 883 D
S
N
1793 862 M
1800 862 D
S
N
1838 912 M
1838 864 D
S
N
1840 912 M
1840 864 D
S
N
1838 912 M
1849 912 D
S
N
1838 864 M
1849 864 D
S
N
1879 901 M
1881 897 D
1881 906 D
1879 901 D
1876 904 D
1872 906 D
1869 906 D
1864 904 D
1861 901 D
1859 898 D
1858 894 D
1858 886 D
1859 882 D
1861 879 D
1864 876 D
1869 874 D
1872 874 D
1876 876 D
1879 879 D
S
N
1869 906 M
1866 904 D
1862 901 D
1861 898 D
1859 894 D
1859 886 D
1861 882 D
1862 879 D
1866 876 D
1869 874 D
S
N
1879 886 M
1879 874 D
S
N
1881 886 M
1881 874 D
S
N
1875 886 M
1885 886 D
S
N
1894 886 M
1912 886 D
1912 889 D
1911 892 D
1909 894 D
1906 895 D
1902 895 D
1897 894 D
1894 891 D
1893 886 D
1893 883 D
1894 879 D
1897 876 D
1902 874 D
1905 874 D
1909 876 D
1912 879 D
S
N
1911 886 M
1911 891 D
1909 894 D
S
N
1902 895 M
1899 894 D
1896 891 D
1894 886 D
1894 883 D
1896 879 D
1899 876 D
1902 874 D
S
N
1921 906 M
1932 874 D
S
N
1923 906 M
1932 879 D
S
N
1942 906 M
1932 874 D
S
N
1918 906 M
1927 906 D
S
N
1936 906 M
1946 906 D
S
N
1961 912 M
1961 864 D
S
N
1962 912 M
1962 864 D
S
N
1952 912 M
1962 912 D
S
N
1952 864 M
1962 864 D
S
N
583 1261 M
583 1001 D
S
N
583 1001 M
1967 1001 D
S
N
1967 1001 M
1967 1261 D
S
N
1967 1261 M
583 1261 D
S
N
583 1001 M
583 1017 D
S
N
662 1006 M
662 1001 D
S
N
741 1001 M
741 1006 D
S
N
820 1006 M
820 1001 D
S
N
899 1001 M
899 1006 D
S
N
978 1017 M
978 1001 D
S
N
1058 1001 M
1058 1006 D
S
N
1137 1006 M
1137 1001 D
S
N
1216 1001 M
1216 1006 D
S
N
1295 1006 M
1295 1001 D
S
N
1374 1001 M
1374 1017 D
S
N
1453 1006 M
1453 1001 D
S
N
1532 1001 M
1532 1006 D
S
N
1611 1006 M
1611 1001 D
S
N
1690 1001 M
1690 1006 D
S
N
1769 1017 M
1769 1001 D
S
N
1848 1001 M
1848 1006 D
S
N
1927 1006 M
1927 1001 D
S
N
581 971 M
577 970 D
574 965 D
572 958 D
572 953 D
574 946 D
577 941 D
581 940 D
585 940 D
589 941 D
592 946 D
594 953 D
594 958 D
592 965 D
589 970 D
585 971 D
581 971 D
S
N
581 971 M
578 970 D
577 968 D
575 965 D
574 958 D
574 953 D
575 946 D
577 943 D
578 941 D
581 940 D
S
N
585 940 M
588 941 D
589 943 D
591 946 D
592 953 D
592 958 D
591 965 D
589 968 D
588 970 D
585 971 D
S
N
941 971 M
938 956 D
S
N
938 956 M
941 959 D
945 961 D
950 961 D
954 959 D
957 956 D
959 952 D
959 949 D
957 944 D
954 941 D
950 940 D
945 940 D
941 941 D
939 943 D
938 946 D
938 947 D
939 949 D
941 947 D
939 946 D
S
N
950 961 M
953 959 D
956 956 D
957 952 D
957 949 D
956 944 D
953 941 D
950 940 D
S
N
941 971 M
956 971 D
S
N
941 970 M
948 970 D
956 971 D
S
N
977 971 M
972 970 D
969 965 D
968 958 D
968 953 D
969 946 D
972 941 D
977 940 D
980 940 D
984 941 D
987 946 D
989 953 D
989 958 D
987 965 D
984 970 D
980 971 D
977 971 D
S
N
977 971 M
974 970 D
972 968 D
971 965 D
969 958 D
969 953 D
971 946 D
972 943 D
974 941 D
977 940 D
S
N
980 940 M
983 941 D
984 943 D
986 946 D
987 953 D
987 958 D
986 965 D
984 968 D
983 970 D
980 971 D
S
N
1007 971 M
1002 970 D
999 965 D
998 958 D
998 953 D
999 946 D
1002 941 D
1007 940 D
1010 940 D
1015 941 D
1018 946 D
1019 953 D
1019 958 D
1018 965 D
1015 970 D
1010 971 D
1007 971 D
S
N
1007 971 M
1004 970 D
1002 968 D
1001 965 D
999 958 D
999 953 D
1001 946 D
1002 943 D
1004 941 D
1007 940 D
S
N
1010 940 M
1013 941 D
1015 943 D
1016 946 D
1018 953 D
1018 958 D
1016 965 D
1015 968 D
1013 970 D
1010 971 D
S
N
1322 965 M
1325 967 D
1330 971 D
1330 940 D
S
N
1328 970 M
1328 940 D
S
N
1322 940 M
1336 940 D
S
N
1357 971 M
1353 970 D
1350 965 D
1348 958 D
1348 953 D
1350 946 D
1353 941 D
1357 940 D
1360 940 D
1365 941 D
1368 946 D
1369 953 D
1369 958 D
1368 965 D
1365 970 D
1360 971 D
1357 971 D
S
N
1357 971 M
1354 970 D
1353 968 D
1351 965 D
1350 958 D
1350 953 D
1351 946 D
1353 943 D
1354 941 D
1357 940 D
S
N
1360 940 M
1363 941 D
1365 943 D
1366 946 D
1368 953 D
1368 958 D
1366 965 D
1365 968 D
1363 970 D
1360 971 D
S
N
1387 971 M
1383 970 D
1380 965 D
1378 958 D
1378 953 D
1380 946 D
1383 941 D
1387 940 D
1390 940 D
1395 941 D
1398 946 D
1399 953 D
1399 958 D
1398 965 D
1395 970 D
1390 971 D
1387 971 D
S
N
1387 971 M
1384 970 D
1383 968 D
1381 965 D
1380 958 D
1380 953 D
1381 946 D
1383 943 D
1384 941 D
1387 940 D
S
N
1390 940 M
1393 941 D
1395 943 D
1396 946 D
1398 953 D
1398 958 D
1396 965 D
1395 968 D
1393 970 D
1390 971 D
S
N
1418 971 M
1413 970 D
1410 965 D
1408 958 D
1408 953 D
1410 946 D
1413 941 D
1418 940 D
1421 940 D
1425 941 D
1428 946 D
1430 953 D
1430 958 D
1428 965 D
1425 970 D
1421 971 D
1418 971 D
S
N
1418 971 M
1414 970 D
1413 968 D
1411 965 D
1410 958 D
1410 953 D
1411 946 D
1413 943 D
1414 941 D
1418 940 D
S
N
1421 940 M
1424 941 D
1425 943 D
1427 946 D
1428 953 D
1428 958 D
1427 965 D
1425 968 D
1424 970 D
1421 971 D
S
N
1718 965 M
1721 967 D
1725 971 D
1725 940 D
S
N
1724 970 M
1724 940 D
S
N
1718 940 M
1731 940 D
S
N
1747 971 M
1744 956 D
S
N
1744 956 M
1747 959 D
1751 961 D
1756 961 D
1760 959 D
1763 956 D
1765 952 D
1765 949 D
1763 944 D
1760 941 D
1756 940 D
1751 940 D
1747 941 D
1745 943 D
1744 946 D
1744 947 D
1745 949 D
1747 947 D
1745 946 D
S
N
1756 961 M
1759 959 D
1762 956 D
1763 952 D
1763 949 D
1762 944 D
1759 941 D
1756 940 D
S
N
1747 971 M
1762 971 D
S
N
1747 970 M
1754 970 D
1762 971 D
S
N
1783 971 M
1778 970 D
1775 965 D
1774 958 D
1774 953 D
1775 946 D
1778 941 D
1783 940 D
1786 940 D
1790 941 D
1793 946 D
1795 953 D
1795 958 D
1793 965 D
1790 970 D
1786 971 D
1783 971 D
S
N
1783 971 M
1780 970 D
1778 968 D
1777 965 D
1775 958 D
1775 953 D
1777 946 D
1778 943 D
1780 941 D
1783 940 D
S
N
1786 940 M
1789 941 D
1790 943 D
1792 946 D
1793 953 D
1793 958 D
1792 965 D
1790 968 D
1789 970 D
1786 971 D
S
N
1813 971 M
1808 970 D
1805 965 D
1804 958 D
1804 953 D
1805 946 D
1808 941 D
1813 940 D
1816 940 D
1820 941 D
1824 946 D
1825 953 D
1825 958 D
1824 965 D
1820 970 D
1816 971 D
1813 971 D
S
N
1813 971 M
1810 970 D
1808 968 D
1807 965 D
1805 958 D
1805 953 D
1807 946 D
1808 943 D
1810 941 D
1813 940 D
S
N
1816 940 M
1819 941 D
1820 943 D
1822 946 D
1824 953 D
1824 958 D
1822 965 D
1820 968 D
1819 970 D
1816 971 D
S
N
583 1261 M
1967 1261 D
S
N
583 1245 M
583 1261 D
S
N
662 1261 M
662 1256 D
S
N
741 1256 M
741 1261 D
S
N
820 1261 M
820 1256 D
S
N
899 1256 M
899 1261 D
S
N
978 1261 M
978 1245 D
S
N
1058 1256 M
1058 1261 D
S
N
1137 1261 M
1137 1256 D
S
N
1216 1256 M
1216 1261 D
S
N
1295 1261 M
1295 1256 D
S
N
1374 1245 M
1374 1261 D
S
N
1453 1261 M
1453 1256 D
S
N
1532 1256 M
1532 1261 D
S
N
1611 1261 M
1611 1256 D
S
N
1690 1256 M
1690 1261 D
S
N
1769 1261 M
1769 1245 D
S
N
1848 1256 M
1848 1261 D
S
N
1927 1261 M
1927 1256 D
S
N
583 1001 M
583 1261 D
S
N
583 1006 M
588 1006 D
S
N
588 1022 M
583 1022 D
S
N
583 1038 M
588 1038 D
S
N
599 1053 M
583 1053 D
S
N
583 1069 M
588 1069 D
S
N
588 1084 M
583 1084 D
S
N
583 1100 M
588 1100 D
S
N
588 1115 M
583 1115 D
S
N
583 1131 M
599 1131 D
S
N
588 1147 M
583 1147 D
S
N
583 1162 M
588 1162 D
S
N
588 1178 M
583 1178 D
S
N
583 1193 M
588 1193 D
S
N
599 1209 M
583 1209 D
S
N
583 1224 M
588 1224 D
S
N
588 1240 M
583 1240 D
S
N
583 1256 M
588 1256 D
S
N
503 1067 M
498 1065 D
495 1061 D
494 1053 D
494 1049 D
495 1041 D
498 1037 D
503 1035 D
506 1035 D
510 1037 D
513 1041 D
515 1049 D
515 1053 D
513 1061 D
510 1065 D
506 1067 D
503 1067 D
S
N
503 1067 M
500 1065 D
498 1064 D
497 1061 D
495 1053 D
495 1049 D
497 1041 D
498 1038 D
500 1037 D
503 1035 D
S
N
506 1035 M
509 1037 D
510 1038 D
512 1041 D
513 1049 D
513 1053 D
512 1061 D
510 1064 D
509 1065 D
506 1067 D
S
N
527 1038 M
525 1037 D
527 1035 D
528 1037 D
527 1038 D
S
N
547 1067 M
542 1065 D
541 1062 D
541 1058 D
542 1055 D
547 1053 D
553 1053 D
557 1055 D
559 1058 D
559 1062 D
557 1065 D
553 1067 D
547 1067 D
S
N
547 1067 M
544 1065 D
542 1062 D
542 1058 D
544 1055 D
547 1053 D
S
N
553 1053 M
556 1055 D
557 1058 D
557 1062 D
556 1065 D
553 1067 D
S
N
547 1053 M
542 1052 D
541 1050 D
539 1047 D
539 1041 D
541 1038 D
542 1037 D
547 1035 D
553 1035 D
557 1037 D
559 1038 D
560 1041 D
560 1047 D
559 1050 D
557 1052 D
553 1053 D
S
N
547 1053 M
544 1052 D
542 1050 D
541 1047 D
541 1041 D
542 1038 D
544 1037 D
547 1035 D
S
N
553 1035 M
556 1037 D
557 1038 D
559 1041 D
559 1047 D
557 1050 D
556 1052 D
553 1053 D
S
N
498 1139 M
501 1140 D
506 1145 D
506 1113 D
S
N
504 1143 M
504 1113 D
S
N
498 1113 M
512 1113 D
S
N
527 1116 M
525 1114 D
527 1113 D
528 1114 D
527 1116 D
S
N
548 1145 M
544 1143 D
541 1139 D
539 1131 D
539 1126 D
541 1119 D
544 1114 D
548 1113 D
551 1113 D
556 1114 D
559 1119 D
560 1126 D
560 1131 D
559 1139 D
556 1143 D
551 1145 D
548 1145 D
S
N
548 1145 M
545 1143 D
544 1142 D
542 1139 D
541 1131 D
541 1126 D
542 1119 D
544 1116 D
545 1114 D
548 1113 D
S
N
551 1113 M
554 1114 D
556 1116 D
557 1119 D
559 1126 D
559 1131 D
557 1139 D
556 1142 D
554 1143 D
551 1145 D
S
N
498 1216 M
501 1218 D
506 1222 D
506 1191 D
S
N
504 1221 M
504 1191 D
S
N
498 1191 M
512 1191 D
S
N
527 1194 M
525 1192 D
527 1191 D
528 1192 D
527 1194 D
S
N
541 1216 M
542 1215 D
541 1213 D
539 1215 D
539 1216 D
541 1219 D
542 1221 D
547 1222 D
553 1222 D
557 1221 D
559 1219 D
560 1216 D
560 1213 D
559 1210 D
554 1207 D
547 1204 D
544 1203 D
541 1200 D
539 1195 D
539 1191 D
S
N
553 1222 M
556 1221 D
557 1219 D
559 1216 D
559 1213 D
557 1210 D
553 1207 D
547 1204 D
S
N
539 1194 M
541 1195 D
544 1195 D
551 1192 D
556 1192 D
559 1194 D
560 1195 D
S
N
544 1195 M
551 1191 D
557 1191 D
559 1192 D
560 1195 D
560 1198 D
S
N
1962 1006 M
1967 1006 D
S
N
1967 1022 M
1962 1022 D
S
N
1962 1038 M
1967 1038 D
S
N
1967 1053 M
1951 1053 D
S
N
1962 1069 M
1967 1069 D
S
N
1967 1084 M
1962 1084 D
S
N
1962 1100 M
1967 1100 D
S
N
1967 1115 M
1962 1115 D
S
N
1951 1131 M
1967 1131 D
S
N
1967 1147 M
1962 1147 D
S
N
1962 1162 M
1967 1162 D
S
N
1967 1178 M
1962 1178 D
S
N
1962 1193 M
1967 1193 D
S
N
1967 1209 M
1951 1209 D
S
N
1962 1224 M
1967 1224 D
S
N
1967 1240 M
1962 1240 D
S
N
1962 1256 M
1967 1256 D
S
N
678 1001 M
678 1261 D
S
N
694 1261 M
694 1180 D
710 1180 D
710 1261 D
S
N
725 1261 M
725 1153 D
741 1153 D
741 1173 D
757 1173 D
757 1178 D
773 1178 D
773 1171 D
789 1171 D
789 1153 D
804 1153 D
804 1162 D
820 1162 D
820 1144 D
836 1144 D
836 1145 D
852 1145 D
852 1134 D
868 1134 D
868 1135 D
884 1135 D
884 1132 D
899 1132 D
899 1130 D
915 1130 D
915 1125 D
931 1125 D
931 1119 D
947 1119 D
947 1117 D
963 1117 D
963 1116 D
978 1116 D
978 1124 D
994 1124 D
994 1117 D
1010 1117 D
1010 1123 D
1026 1123 D
1026 1118 D
1042 1118 D
1042 1122 D
1058 1122 D
1058 1121 D
1073 1121 D
1073 1122 D
1089 1122 D
S
N
1089 1122 M
1089 1123 D
1105 1123 D
1105 1126 D
1121 1126 D
1121 1127 D
1137 1127 D
1137 1123 D
1152 1123 D
1152 1129 D
1168 1129 D
1168 1131 D
1184 1131 D
1184 1133 D
1200 1133 D
1200 1136 D
1216 1136 D
1216 1141 D
1232 1141 D
1232 1135 D
1247 1135 D
1247 1146 D
1263 1146 D
1263 1138 D
1279 1138 D
1279 1140 D
1295 1140 D
1295 1149 D
1311 1149 D
1311 1138 D
1326 1138 D
1326 1142 D
1342 1142 D
1342 1141 D
1358 1141 D
1358 1155 D
1374 1155 D
1374 1154 D
1390 1154 D
1390 1167 D
1405 1167 D
1405 1154 D
1421 1154 D
1421 1166 D
1437 1166 D
1437 1158 D
1453 1158 D
1453 1141 D
1469 1141 D
1469 1156 D
1485 1156 D
1485 1131 D
1500 1131 D
1500 1181 D
1516 1181 D
1516 1139 D
1532 1139 D
1532 1145 D
1548 1145 D
1548 1171 D
1564 1171 D
1564 1189 D
1579 1189 D
1579 1186 D
1595 1186 D
1595 1168 D
1611 1168 D
1611 1170 D
1627 1170 D
1627 1258 D
1643 1258 D
1643 1168 D
1659 1168 D
1659 1153 D
1659 1153 D
1659 1153 D
1674 1153 D
1674 1171 D
1690 1171 D
1690 1188 D
1706 1188 D
1706 1206 D
1722 1206 D
1722 1204 D
1738 1204 D
1738 1192 D
1753 1192 D
1753 1191 D
1769 1191 D
1769 1216 D
1785 1216 D
1785 1209 D
1801 1209 D
1801 1228 D
1817 1228 D
1817 1194 D
1833 1194 D
1833 1175 D
1848 1175 D
1848 1229 D
1864 1229 D
1864 1163 D
1880 1163 D
1880 1229 D
1896 1229 D
1896 1243 D
1912 1243 D
1912 1163 D
1927 1163 D
1927 1261 D
S
N
1943 1261 M
1943 1252 D
1959 1252 D
1959 1172 D
1967 1172 D
S
N
721 1217 M
808 1217 D
S
0 0 1 setrgbcolor
N
820 1001 M
820 1013 D
S
N
823 1023 M
835 1023 D
S
N
836 1034 M
836 1046 D
S
N
841 1053 M
852 1053 D
852 1054 D
S
N
852 1066 M
852 1079 D
S
N
863 1079 M
868 1079 D
868 1087 D
S
N
868 1099 M
868 1101 D
878 1101 D
S
N
884 1108 M
884 1119 D
884 1119 D
S
N
896 1119 M
899 1119 D
899 1128 D
S
N
908 1132 M
915 1132 D
915 1136 D
S
N
916 1147 M
928 1147 D
S
N
931 1157 M
931 1158 D
942 1158 D
S
N
951 1161 M
963 1161 D
963 1162 D
S
N
972 1164 M
978 1164 D
978 1165 D
984 1165 D
S
N
994 1166 M
994 1169 D
1004 1169 D
S
N
1016 1169 M
1026 1169 D
1026 1171 D
S
N
1033 1176 M
1042 1176 D
1042 1178 D
1043 1178 D
S
N
1055 1178 M
1058 1178 D
1058 1176 D
1066 1176 D
S
N
1077 1177 M
1089 1177 D
S
N
1100 1176 M
1105 1176 D
1105 1176 D
1112 1176 D
S
N
1121 1179 M
1121 1181 D
1131 1181 D
S
N
1138 1186 M
1150 1186 D
S
N
1162 1187 M
1168 1187 D
1168 1182 D
1170 1182 D
S
N
1182 1182 M
1184 1182 D
1184 1173 D
1184 1173 D
S
N
1196 1173 M
1200 1173 D
1200 1178 D
1203 1178 D
S
N
1215 1178 M
1216 1178 D
1216 1167 D
S
N
1228 1167 M
1232 1167 D
1232 1175 D
S
N
1240 1178 M
1247 1178 D
1247 1173 D
S
N
1252 1165 M
1263 1165 D
1263 1166 D
S
N
1266 1176 M
1278 1176 D
S
N
1289 1175 M
1295 1175 D
1295 1172 D
1298 1172 D
S
N
1310 1172 M
1311 1172 D
1311 1172 D
1322 1172 D
S
N
1330 1168 M
1342 1168 D
1342 1168 D
S
N
1342 1180 M
1342 1182 D
1353 1182 D
S
N
1358 1175 M
1358 1170 D
1366 1170 D
S
N
1374 1166 M
1374 1166 D
1386 1166 D
S
N
1396 1164 M
1405 1164 D
1405 1162 D
S
N
1407 1151 M
1419 1151 D
S
N
1421 1141 M
1421 1136 D
1429 1136 D
S
N
1437 1140 M
1437 1152 D
S
N
1437 1164 M
1437 1167 D
1446 1167 D
S
N
1453 1162 M
1453 1150 D
S
N
1460 1144 M
1469 1144 D
1469 1147 D
S
N
1479 1149 M
1485 1149 D
1485 1156 D
S
N
1491 1161 M
1500 1161 D
1500 1158 D
S
N
1500 1146 M
1500 1134 D
S
N
1504 1125 M
1516 1125 D
S
N
1516 1136 M
1516 1148 D
S
N
1516 1161 M
1516 1163 D
1526 1163 D
S
N
1532 1169 M
1532 1169 D
1544 1169 D
S
N
1548 1161 M
1548 1149 D
S
N
1557 1146 M
1564 1146 D
1564 1140 D
S
N
1564 1128 M
1564 1120 D
1567 1120 D
S
N
1579 1120 M
1579 1120 D
1579 1132 D
S
N
1579 1144 M
1579 1149 D
1586 1149 D
S
N
1595 1146 M
1595 1145 D
1607 1145 D
S
N
1611 1138 M
1611 1129 D
1615 1129 D
S
N
1627 1129 M
1627 1129 D
1627 1117 D
S
N
1627 1105 M
1627 1093 D
1627 1093 D
S
N
1639 1093 M
1643 1093 D
1643 1102 D
S
N
1643 1114 M
1643 1126 D
S
N
1643 1138 M
1643 1151 D
S
N
1650 1155 M
1659 1155 D
1659 1159 D
S
N
1659 1171 M
1659 1183 D
S
N
1659 1195 M
1659 1199 D
1659 1199 D
1659 1199 D
1666 1199 D
S
N
1674 1195 M
1674 1183 D
S
N
1674 1171 M
1674 1159 D
S
N
1674 1147 M
1674 1135 D
S
N
1681 1129 M
1690 1129 D
1690 1132 D
S
N
1690 1144 M
1690 1156 D
S
N
1690 1169 M
1690 1181 D
S
N
1702 1181 M
1706 1181 D
1706 1184 D
1711 1184 D
S
N
1722 1182 M
1722 1170 D
S
N
1722 1158 M
1722 1146 D
S
N
1731 1143 M
1738 1143 D
1738 1138 D
S
N
1742 1130 M
1753 1130 D
1753 1130 D
1754 1130 D
S
N
1766 1130 M
1769 1130 D
1769 1138 D
S
N
1769 1150 M
1769 1163 D
S
N
1777 1167 M
1785 1167 D
1785 1162 D
S
N
1785 1150 M
1785 1138 D
S
N
1785 1126 M
1785 1114 D
S
N
1785 1102 M
1785 1090 D
S
N
1785 1077 M
1785 1065 D
S
N
1793 1061 M
1801 1061 D
1801 1065 D
S
N
1801 1078 M
1801 1090 D
S
N
1801 1102 M
1801 1114 D
S
N
1801 1126 M
1801 1138 D
S
N
1805 1146 M
1817 1146 D
1817 1146 D
S
N
1825 1143 M
1833 1143 D
1833 1148 D
S
N
1842 1151 M
1848 1151 D
1848 1145 D
S
N
1848 1133 M
1848 1121 D
S
N
1853 1113 M
1864 1113 D
1864 1114 D
S
N
1864 1126 M
1864 1138 D
S
N
1864 1150 M
1864 1162 D
S
N
1864 1175 M
1864 1187 D
S
N
1864 1199 M
1864 1209 D
1866 1209 D
S
N
1878 1209 M
1880 1209 D
1880 1200 D
S
N
1887 1194 M
1896 1194 D
1896 1191 D
S
N
1896 1179 M
1896 1167 D
S
N
1896 1155 M
1896 1143 D
S
N
1896 1131 M
1896 1118 D
S
N
1907 1118 M
1912 1118 D
1912 1126 D
S
N
1917 1132 M
1927 1132 D
1927 1130 D
S
N
1927 1118 M
1927 1106 D
S
N
1927 1094 M
1927 1082 D
1928 1082 D
S
N
1940 1082 M
1943 1082 D
1943 1091 D
S
N
1943 1103 M
1943 1104 D
1954 1104 D
S
N
1959 1097 M
1959 1085 D
S
N
1967 1081 M
1967 1081 D
S
N
721 1044 M
734 1044 D
S
N
746 1044 M
758 1044 D
S
N
770 1044 M
782 1044 D
S
N
794 1044 M
806 1044 D
S
showpage
%%Trailer
%%Pages: 1
%%BoundingBox: 99 205 482 565
