%!PS-Adobe-2.0 EPSF-2.0
%%BoundingBox:  0 0 567 384
%%Title: eta1.eps: eta1
%%Creator: ROOT Version 5.27/06b
%%CreationDate: Fri Dec  9 13:28:48 2011
%%EndComments
%%BeginProlog
80 dict begin
/s {stroke} def /l {lineto} def /m {moveto} def /t {translate} def
/r {rotate} def /rl {roll}  def /R {repeat} def
/d {rlineto} def /rm {rmoveto} def /gr {grestore} def /f {eofill} def
/c {setrgbcolor} def /black {0 setgray} def /sd {setdash} def
/cl {closepath} def /sf {scalefont setfont} def /lw {setlinewidth} def
/box {m dup 0 exch d exch 0 d 0 exch neg d cl} def
/NC{systemdict begin initclip end}def/C{NC box clip newpath}def
/bl {box s} def /bf {box f} def /Y { 0 exch d} def /X { 0 d} def 
/K {{pop pop 0 moveto} exch kshow} bind def
/ita {/ang 15 def gsave [1 0 ang dup sin exch cos div 1 0 0] concat} def 
/mp {newpath /y exch def /x exch def} def
/side {[w .77 mul w .23 mul] .385 w mul sd w 0 l currentpoint t -144 r} def
/mr {mp x y w2 0 360 arc} def /m24 {mr s} def /m20 {mr f} def
/mb {mp x y w2 add m w2 neg 0 d 0 w neg d w 0 d 0 w d cl} def
/mt {mp x y w2 add m w2 neg w neg d w 0 d cl} def
/m21 {mb f} def /m25 {mb s} def /m22 {mt f} def /m26{mt s} def
/m23 {mp x y w2 sub m w2 w d w neg 0 d cl f} def
/m27 {mp x y w2 add m w3 neg w2 neg d w3 w2 neg d w3 w2 d cl s} def
/m28 {mp x w2 sub y w2 sub w3 add m w3 0 d  0 w3 neg d w3 0 d 0 w3 d w3 0 d  0 w3 d w3 neg 0 d 0 w3 d w3 neg 0 d 0 w3 neg d w3 neg 0 d cl s } def
/m29 {mp gsave x w2 sub y w2 add w3 sub m currentpoint t 4 {side} repeat cl fill gr} def
/m30 {mp gsave x w2 sub y w2 add w3 sub m currentpoint t 4 {side} repeat cl s gr} def
/m31 {mp x y w2 sub m 0 w d x w2 sub y m w 0 d x w2 sub y w2 add m w w neg d x w2 sub y w2 sub m w w d s} def
/m32 {mp x y w2 sub m w2 w d w neg 0 d cl s} def
/m33 {mp x y w2 add m w3 neg w2 neg d w3 w2 neg d w3 w2 d cl f} def
/m34 {mp x w2 sub y w2 sub w3 add m w3 0 d  0 w3 neg d w3 0 d 0 w3 d w3 0 d  0 w3 d w3 neg 0 d 0 w3 d w3 neg 0 d 0 w3 neg d w3 neg 0 d cl f } def
/m2 {mp x y w2 sub m 0 w d x w2 sub y m w 0 d s} def
/m5 {mp x w2 sub y w2 sub m w w d x w2 sub y w2 add m w w neg d s} def
/reEncode {exch findfont dup length dict begin {1 index /FID eq  {pop pop} {def} ifelse } forall /Encoding exch def currentdict end dup /FontName get exch definefont pop } def [/Times-Bold /Times-Italic /Times-BoldItalic /Helvetica /Helvetica-Oblique
 /Helvetica-Bold /Helvetica-BoldOblique /Courier /Courier-Oblique /Courier-Bold /Courier-BoldOblique /Times-Roman /AvantGarde-Book /AvantGarde-BookOblique /AvantGarde-Demi /AvantGarde-DemiOblique /Bookman-Demi /Bookman-DemiItalic /Bookman-Light
 /Bookman-LightItalic /Helvetica-Narrow /Helvetica-Narrow-Bold /Helvetica-Narrow-BoldOblique /Helvetica-Narrow-Oblique /NewCenturySchlbk-Roman /NewCenturySchlbk-Bold /NewCenturySchlbk-BoldItalic /NewCenturySchlbk-Italic /Palatino-Bold
 /Palatino-BoldItalic /Palatino-Italic /Palatino-Roman ] {ISOLatin1Encoding reEncode } forall%%EndProlog
%%BeginSetup
%%EndSetup
newpath  gsave  .25 .25 scale  gsave  0 0 t black[  ] 0 sd 3 lw 1 1 1 c 2268 1538 0 0 bf black 1 1 1 c 1791 1215 363 246 bf black 1791 1215 363 246 bl 1 0 0 c 6 lw 1 1 1 c black 3 lw /w 31 def /w2 {w 2 div} def /w3 {w 3 div} def 381 306 m20 6 lw 3 lw
 417 307 m20 6 lw 3 lw 452 308 m20 6 lw 3 lw 488 310 m20 6 lw 3 lw 524 312 m20 6 lw 3 lw 560 326 m20 6 lw 3 lw 596 331 m20 6 lw 3 lw 632 342 m20 6 lw 3 lw 667 375 m20 6 lw 1 0 0 c 703 399 m 2 Y s 703 427 m 2 Y s 3 lw black 703 414 m20 6 lw 1 0 0 c
 739 422 m 3 Y s 739 451 m 3 Y s 3 lw black 739 438 m20 6 lw 1 0 0 c 775 463 m 5 Y s 775 494 m 4 Y s 3 lw black 775 481 m20 6 lw 1 0 0 c 811 526 m 5 Y s 811 557 m 6 Y s 3 lw black 811 544 m20 6 lw 1 0 0 c 847 624 m 21 Y s 847 672 m 21 Y s 3 lw black
 847 659 m20 6 lw 1 0 0 c 882 652 m 17 Y s 882 695 m 18 Y s 3 lw black 882 682 m20 6 lw 1 0 0 c 918 722 m 20 Y s 918 768 m 19 Y s 3 lw black 918 755 m20 6 lw 1 0 0 c 954 872 m 14 Y s 954 912 m 15 Y s 3 lw black 954 899 m20 6 lw 1 0 0 c 990 943 m 12 Y
 s 990 981 m 11 Y s 3 lw black 990 968 m20 6 lw 1 0 0 c 1026 979 m 27 Y s 1026 1032 m 26 Y s 3 lw black 1026 1019 m20 6 lw 1 0 0 c 1062 1051 m 18 Y s 1062 1095 m 18 Y s 3 lw black 1062 1082 m20 6 lw 1 0 0 c 1097 1123 m 20 Y s 1097 1169 m 20 Y s 3 lw
 black 1097 1156 m20 6 lw 1 0 0 c 1133 1256 m 50 Y s 1133 1332 m 50 Y s 3 lw black 1133 1319 m20 6 lw 1 0 0 c 1169 1280 m 33 Y s 1169 1339 m 33 Y s 3 lw black 1169 1326 m20 6 lw 1 0 0 c 1205 1317 m 30 Y s 1205 1373 m 30 Y s 3 lw black 1205 1360 m20 6
 lw 1 0 0 c 1241 1326 m 12 Y s 1241 1364 m 13 Y s 3 lw black 1241 1351 m20 6 lw 1 0 0 c 1276 1261 m 26 Y s 1276 1313 m 27 Y s 3 lw black 1276 1300 m20 6 lw 1 0 0 c 1312 1166 m 64 Y s 1312 1256 m 65 Y s 3 lw black 1312 1243 m20 6 lw 1 0 0 c 1348 1261
 m 21 Y s 1348 1308 m 21 Y s 3 lw black 1348 1295 m20 6 lw 1 0 0 c 1384 1214 m 18 Y s 1384 1258 m 17 Y s 3 lw black 1384 1245 m20 6 lw 1 0 0 c 1420 1187 m 15 Y s 1420 1228 m 15 Y s 3 lw black 1420 1215 m20 6 lw 1 0 0 c 1456 1043 m 21 Y s 1456 1090 m
 20 Y s 3 lw black 1456 1077 m20 6 lw 1 0 0 c 1491 968 m 21 Y s 1491 1015 m 21 Y s 3 lw black 1491 1002 m20 6 lw 1 0 0 c 1527 851 m 43 Y s 1527 921 m 43 Y s 3 lw black 1527 907 m20 6 lw 1 0 0 c 1563 874 m 15 Y s 1563 915 m 14 Y s 3 lw black 1563 902
 m20 6 lw 1 0 0 c 1599 782 m 9 Y s 1599 817 m 10 Y s 3 lw black 1599 804 m20 6 lw 1 0 0 c 1635 668 m 16 Y s 1635 711 m 16 Y s 3 lw black 1635 697 m20 6 lw 1 0 0 c 1671 605 m 10 Y s 1671 641 m 10 Y s 3 lw black 1671 628 m20 6 lw 1 0 0 c 1706 519 m 15
 Y s 1706 560 m 14 Y s 3 lw black 1706 547 m20 6 lw 1 0 0 c 1742 457 m 8 Y s 1742 491 m 8 Y s 3 lw black 1742 478 m20 6 lw 1 0 0 c 1778 439 m 3 Y s 1778 468 m 3 Y s 3 lw black 1778 455 m20 6 lw 1 0 0 c 1814 392 m 2 Y s 1814 420 m 2 Y s 3 lw black
 1814 407 m20 6 lw 1 0 0 c 1850 366 m 1 Y s 1850 393 m 1 Y s 3 lw black 1850 380 m20 6 lw 3 lw 1886 346 m20 6 lw 3 lw 1921 335 m20 6 lw 3 lw 1957 323 m20 6 lw 3 lw 1993 314 m20 6 lw 3 lw 2029 308 m20 6 lw 3 lw 2065 306 m20 6 lw 3 lw 2101 305 m20 6 lw
 3 lw 2136 305 m20 6 lw 1 0 0 c 1 1 1 c black 1 0 0 c 363 306 m 36 X 1 Y 35 X 1 Y 36 X 2 Y 36 X 2 Y 36 X 14 Y 36 X 5 Y 36 X 11 Y 35 X 33 Y 36 X 39 Y 36 X 24 Y 36 X 43 Y 36 X 63 Y 36 X 115 Y 35 X 23 Y 36 X 73 Y 36 X 144 Y 36 X 69 Y 36 X 51 Y 36 X 63 Y
 35 X 74 Y 36 X 163 Y 36 X 7 Y 36 X 34 Y 36 X -9 Y 36 X -51 Y 35 X -57 Y 36 X 52 Y 36 X -50 Y 36 X -30 Y 36 X -138 Y 36 X -75 Y 35 X -95 Y 36 X -5 Y 36 X -98 Y 36 X -107 Y 36 X -69 Y 36 X -81 Y 35 X -69 Y 36 X -23 Y 36 X -48 Y 36 X -27 Y 36 X -34 Y
 36 X -11 Y 35 X -12 Y 36 X -9 Y 36 X -6 Y 36 X -2 Y 36 X -1 Y 71 X -59 Y s black 3 lw 363 246 m 1791 X s
 gsave  2268 1538 0 0 C 1218.94 87.75 t 0 r /Helvetica findfont 71.6807 sf 0 0 m (leading lepton pseudorapidity) show NC gr  363 283 m -37 Y s 399 264 m -18 Y s 434 264 m -18 Y s 470 264 m -18 Y s 506 264 m -18 Y s 542 283 m -37 Y s 578 264 m -18 Y s
 614 264 m -18 Y s 649 264 m -18 Y s 685 264 m -18 Y s 721 283 m -37 Y s 757 264 m -18 Y s 793 264 m -18 Y s 829 264 m -18 Y s 864 264 m -18 Y s 900 283 m -37 Y s 936 264 m -18 Y s 972 264 m -18 Y s 1008 264 m -18 Y s 1044 264 m -18 Y s 1079 283 m
 -37 Y s 1115 264 m -18 Y s 1151 264 m -18 Y s 1187 264 m -18 Y s 1223 264 m -18 Y s 1259 283 m -37 Y s 1294 264 m -18 Y s 1330 264 m -18 Y s 1366 264 m -18 Y s 1402 264 m -18 Y s 1438 283 m -37 Y s 1474 264 m -18 Y s 1509 264 m -18 Y s 1545 264 m
 -18 Y s 1581 264 m -18 Y s 1617 283 m -37 Y s 1653 264 m -18 Y s 1689 264 m -18 Y s 1724 264 m -18 Y s 1760 264 m -18 Y s 1796 283 m -37 Y s 1832 264 m -18 Y s 1868 264 m -18 Y s 1904 264 m -18 Y s 1939 264 m -18 Y s 1975 283 m -37 Y s 2011 264 m
 -18 Y s 2047 264 m -18 Y s 2083 264 m -18 Y s 2119 264 m -18 Y s 2154 283 m -37 Y s
 gsave  2268 1538 0 0 C 329.562 179 t 0 r /Helvetica findfont 71.6807 sf 0 0 m (\2555) show NC gr 
 gsave  2268 1538 0 0 C 508.75 179 t 0 r /Helvetica findfont 71.6807 sf 0 0 m (\2554) show NC gr 
 gsave  2268 1538 0 0 C 687.938 179 t 0 r /Helvetica findfont 71.6807 sf 0 0 m (\2553) show NC gr 
 gsave  2268 1538 0 0 C 867.125 179 t 0 r /Helvetica findfont 71.6807 sf 0 0 m (\2552) show NC gr 
 gsave  2268 1538 0 0 C 1052.88 179 t 0 r /Helvetica findfont 71.6807 sf 0 0 m (\2551) show NC gr 
 gsave  2268 1538 0 0 C 1238.5 179 t 0 r /Helvetica findfont 71.6807 sf 0 0 m (0) show NC gr 
 gsave  2268 1538 0 0 C 1421 179 t 0 r /Helvetica findfont 71.6807 sf 0 0 m (1) show NC gr 
 gsave  2268 1538 0 0 C 1596.94 179 t 0 r /Helvetica findfont 71.6807 sf 0 0 m (2) show NC gr 
 gsave  2268 1538 0 0 C 1776.12 179 t 0 r /Helvetica findfont 71.6807 sf 0 0 m (3) show NC gr 
 gsave  2268 1538 0 0 C 1955.31 179 t 0 r /Helvetica findfont 71.6807 sf 0 0 m (4) show NC gr 
 gsave  2268 1538 0 0 C 2134.5 179 t 0 r /Helvetica findfont 71.6807 sf 0 0 m (5) show NC gr  363 1461 m 1791 X s 363 1425 m 36 Y s 399 1443 m 18 Y s 434 1443 m 18 Y s 470 1443 m 18 Y s 506 1443 m 18 Y s 542 1425 m 36 Y s 578 1443 m 18 Y s 614 1443 m
 18 Y s 649 1443 m 18 Y s 685 1443 m 18 Y s 721 1425 m 36 Y s 757 1443 m 18 Y s 793 1443 m 18 Y s 829 1443 m 18 Y s 864 1443 m 18 Y s 900 1425 m 36 Y s 936 1443 m 18 Y s 972 1443 m 18 Y s 1008 1443 m 18 Y s 1044 1443 m 18 Y s 1079 1425 m 36 Y s 1115
 1443 m 18 Y s 1151 1443 m 18 Y s 1187 1443 m 18 Y s 1223 1443 m 18 Y s 1259 1425 m 36 Y s 1294 1443 m 18 Y s 1330 1443 m 18 Y s 1366 1443 m 18 Y s 1402 1443 m 18 Y s 1438 1425 m 36 Y s 1474 1443 m 18 Y s 1509 1443 m 18 Y s 1545 1443 m 18 Y s 1581
 1443 m 18 Y s 1617 1425 m 36 Y s 1653 1443 m 18 Y s 1689 1443 m 18 Y s 1724 1443 m 18 Y s 1760 1443 m 18 Y s 1796 1425 m 36 Y s 1832 1443 m 18 Y s 1868 1443 m 18 Y s 1904 1443 m 18 Y s 1939 1443 m 18 Y s 1975 1425 m 36 Y s 2011 1443 m 18 Y s 2047
 1443 m 18 Y s 2083 1443 m 18 Y s 2119 1443 m 18 Y s 2154 1425 m 36 Y s 363 246 m 1215 Y s
 gsave  2268 1538 0 0 C 173.125 755.625 t 90 r /Helvetica findfont 71.6807 sf 0 0 m (arbitrary normalization) show NC gr  417 305 m -54 X s 390 344 m -27 X s 390 382 m -27 X s 390 421 m -27 X s 390 459 m -27 X s 417 498 m -54 X s 390 536 m -27 X s
 390 575 m -27 X s 390 613 m -27 X s 390 651 m -27 X s 417 690 m -54 X s 390 728 m -27 X s 390 767 m -27 X s 390 805 m -27 X s 390 844 m -27 X s 417 882 m -54 X s 390 921 m -27 X s 390 959 m -27 X s 390 998 m -27 X s 390 1036 m -27 X s 417 1075 m -54
 X s 390 1113 m -27 X s 390 1151 m -27 X s 390 1190 m -27 X s 390 1228 m -27 X s 417 1267 m -54 X s 390 1305 m -27 X s 390 1344 m -27 X s 390 1382 m -27 X s 390 1421 m -27 X s 417 1459 m -54 X s 417 305 m -54 X s 390 267 m -27 X s 417 1459 m -54 X s
 gsave  2268 1538 0 0 C 310 280 t 0 r /Helvetica findfont 71.6807 sf 0 0 m (0) show NC gr 
 gsave  2268 1538 0 0 C 222 472.188 t 0 r /Helvetica findfont 71.6807 sf 0 0 m (0.01) show NC gr 
 gsave  2268 1538 0 0 C 212.25 664.438 t 0 r /Helvetica findfont 71.6807 sf 0 0 m (0.02) show NC gr 
 gsave  2268 1538 0 0 C 212.25 856.688 t 0 r /Helvetica findfont 71.6807 sf 0 0 m (0.03) show NC gr 
 gsave  2268 1538 0 0 C 212.25 1048.88 t 0 r /Helvetica findfont 71.6807 sf 0 0 m (0.04) show NC gr 
 gsave  2268 1538 0 0 C 212.25 1241.12 t 0 r /Helvetica findfont 71.6807 sf 0 0 m (0.05) show NC gr 
 gsave  2268 1538 0 0 C 212.25 1433.38 t 0 r /Helvetica findfont 71.6807 sf 0 0 m (0.06) show NC gr  2154 246 m 1215 Y s 2101 305 m 53 X s 2127 344 m 27 X s 2127 382 m 27 X s 2127 421 m 27 X s 2127 459 m 27 X s 2101 498 m 53 X s 2127 536 m 27 X s
 2127 575 m 27 X s 2127 613 m 27 X s 2127 651 m 27 X s 2101 690 m 53 X s 2127 728 m 27 X s 2127 767 m 27 X s 2127 805 m 27 X s 2127 844 m 27 X s 2101 882 m 53 X s 2127 921 m 27 X s 2127 959 m 27 X s 2127 998 m 27 X s 2127 1036 m 27 X s 2101 1075 m 53
 X s 2127 1113 m 27 X s 2127 1151 m 27 X s 2127 1190 m 27 X s 2127 1228 m 27 X s 2101 1267 m 53 X s 2127 1305 m 27 X s 2127 1344 m 27 X s 2127 1382 m 27 X s 2127 1421 m 27 X s 2101 1459 m 53 X s 2101 305 m 53 X s 2127 267 m 27 X s 2101 1459 m 53 X s
 6 lw 1 1 1 c black 363 306 m 36 X 1 Y 35 X 1 Y 36 X 2 Y 36 X 5 Y 36 X 6 Y 36 X 12 Y 36 X 16 Y 35 X 23 Y 36 X 33 Y 36 X 40 Y 36 X 55 Y 36 X 56 Y 36 X 69 Y 35 X 80 Y 36 X 84 Y 36 X 82 Y 36 X 76 Y 36 X 93 Y 36 X 74 Y 35 X 54 Y 36 X 77 Y 36 X 28 Y 36 X
 43 Y 36 X 7 Y 36 X 2 Y 35 X -13 Y 36 X -25 Y 36 X -52 Y 36 X -55 Y 36 X -65 Y 36 X -85 Y 35 X -80 Y 36 X -77 Y 36 X -92 Y 36 X -80 Y 36 X -71 Y 36 X -69 Y 35 X -60 Y 36 X -53 Y 36 X -40 Y 36 X -41 Y 36 X -18 Y 36 X -15 Y 35 X -13 Y 36 X -7 Y 36 X -3
 Y 36 X -4 Y 36 X -1 Y 71 X -60 Y s 0 0 1 c[  12 12 ] 0 sd 1 1 1 c black 0 0 1 c 363 306 m 36 X 1 Y 35 X 2 Y 36 X 2 Y 36 X 5 Y 36 X 6 Y 36 X 14 Y 36 X 16 Y 35 X 24 Y 36 X 34 Y 36 X 43 Y 36 X 55 Y 36 X 56 Y 36 X 70 Y 35 X 79 Y 36 X 79 Y 36 X 82 Y 36 X
 76 Y 36 X 90 Y 36 X 66 Y 35 X 53 Y 36 X 76 Y 36 X 27 Y 36 X 39 Y 36 X 7 Y 36 X 3 Y 35 X -11 Y 36 X -29 Y 36 X -44 Y 36 X -55 Y 36 X -64 Y 36 X -78 Y 35 X -78 Y 36 X -78 Y 36 X -89 Y 36 X -76 Y 36 X -73 Y 36 X -69 Y 35 X -58 Y 36 X -54 Y 36 X -40 Y
 36 X -44 Y 36 X -18 Y 36 X -16 Y 35 X -14 Y 36 X -8 Y 36 X -4 Y 36 X -3 Y 36 X -2 Y 71 X -60 Y s black
 gsave  2268 1538 0 0 C 2199.69 1123.81 t 90 r /Helvetica-BoldOblique findfont 29.3239 sf 0 0 m 
 317 303 287 271 263 240 213 205 186 167 159 140 118 95 87 67 59 38 17
(LHC HIGGS XS WG 2011) K NC gr 
 gr  gr showpage
end
%%EOF
