%!PS-Adobe-2.0 EPSF-2.0
%%BoundingBox:  0 0 567 310
%%Title: /home/shiki/lhchiggsstyle-v2/CrossSection_qcd.eps: Higgs Cross Section
%%Creator: ROOT Version 5.28/00
%%CreationDate: Tue Nov 22 17:35:09 2011
%%EndComments
%%BeginProlog
80 dict begin
/s {stroke} def /l {lineto} def /m {moveto} def /t {translate} def
/r {rotate} def /rl {roll}  def /R {repeat} def
/d {rlineto} def /rm {rmoveto} def /gr {grestore} def /f {eofill} def
/c {setrgbcolor} def /black {0 setgray} def /sd {setdash} def
/cl {closepath} def /sf {scalefont setfont} def /lw {setlinewidth} def
/box {m dup 0 exch d exch 0 d 0 exch neg d cl} def
/NC{systemdict begin initclip end}def/C{NC box clip newpath}def
/bl {box s} def /bf {box f} def /Y { 0 exch d} def /X { 0 d} def 
/K {{pop pop 0 moveto} exch kshow} bind def
/ita {/ang 15 def gsave [1 0 ang dup sin exch cos div 1 0 0] concat} def 
/mp {newpath /y exch def /x exch def} def
/side {[w .77 mul w .23 mul] .385 w mul sd w 0 l currentpoint t -144 r} def
/mr {mp x y w2 0 360 arc} def /m24 {mr s} def /m20 {mr f} def
/mb {mp x y w2 add m w2 neg 0 d 0 w neg d w 0 d 0 w d cl} def
/mt {mp x y w2 add m w2 neg w neg d w 0 d cl} def
/m21 {mb f} def /m25 {mb s} def /m22 {mt f} def /m26{mt s} def
/m23 {mp x y w2 sub m w2 w d w neg 0 d cl f} def
/m27 {mp x y w2 add m w3 neg w2 neg d w3 w2 neg d w3 w2 d cl s} def
/m28 {mp x w2 sub y w2 sub w3 add m w3 0 d  0 w3 neg d w3 0 d 0 w3 d w3 0 d  0 w3 d w3 neg 0 d 0 w3 d w3 neg 0 d 0 w3 neg d w3 neg 0 d cl s } def
/m29 {mp gsave x w2 sub y w2 add w3 sub m currentpoint t 4 {side} repeat cl fill gr} def
/m30 {mp gsave x w2 sub y w2 add w3 sub m currentpoint t 4 {side} repeat cl s gr} def
/m31 {mp x y w2 sub m 0 w d x w2 sub y m w 0 d x w2 sub y w2 add m w w neg d x w2 sub y w2 sub m w w d s} def
/m32 {mp x y w2 sub m w2 w d w neg 0 d cl s} def
/m33 {mp x y w2 add m w3 neg w2 neg d w3 w2 neg d w3 w2 d cl f} def
/m34 {mp x w2 sub y w2 sub w3 add m w3 0 d  0 w3 neg d w3 0 d 0 w3 d w3 0 d  0 w3 d w3 neg 0 d 0 w3 d w3 neg 0 d 0 w3 neg d w3 neg 0 d cl f } def
/m2 {mp x y w2 sub m 0 w d x w2 sub y m w 0 d s} def
/m5 {mp x w2 sub y w2 sub m w w d x w2 sub y w2 add m w w neg d s} def
/reEncode {exch findfont dup length dict begin {1 index /FID eq  {pop pop} {def} ifelse } forall /Encoding exch def currentdict end dup /FontName get exch definefont pop } def [/Times-Bold /Times-Italic /Times-BoldItalic /Helvetica /Helvetica-Oblique
 /Helvetica-Bold /Helvetica-BoldOblique /Courier /Courier-Oblique /Courier-Bold /Courier-BoldOblique /Times-Roman /AvantGarde-Book /AvantGarde-BookOblique /AvantGarde-Demi /AvantGarde-DemiOblique /Bookman-Demi /Bookman-DemiItalic /Bookman-Light
 /Bookman-LightItalic /Helvetica-Narrow /Helvetica-Narrow-Bold /Helvetica-Narrow-BoldOblique /Helvetica-Narrow-Oblique /NewCenturySchlbk-Roman /NewCenturySchlbk-Bold /NewCenturySchlbk-BoldItalic /NewCenturySchlbk-Italic /Palatino-Bold
 /Palatino-BoldItalic /Palatino-Italic /Palatino-Roman ] {ISOLatin1Encoding reEncode } forall%%EndProlog
%%BeginSetup
%%EndSetup
newpath  gsave  .25 .25 scale  gsave  0 0 t black[  ] 0 sd 3 lw 1 1 1 c 2268 1239 0 0 bf black 1 1 1 c 1088 1214 23 12 bf black 1 1 1 c 861 958 195 208 bf black 861 958 195 208 bl 1 1 1 c 861 958 195 208 bf black 861 958 195 208 bl 6 lw 1 1 1 c black
 195 208 m 861 X s 3 lw 195 208 m 861 X s
 gsave  1088 1214 23 12 C 941.625 105.25 t 0 r /Helvetica findfont 40.9078 sf 0 0 m ( [GeV]) show NC gr 
 gsave  1088 1214 23 12 C 922.062 94.5625 t 0 r /Helvetica findfont 26.679 sf 0 0 m (4l) show NC gr 
 gsave  1088 1214 23 12 C 890.125 105.25 t 0 r /Helvetica findfont 40.9078 sf 0 0 m (M) show NC gr  274 237 m -29 Y s 305 222 m -14 Y s 336 222 m -14 Y s 368 222 m -14 Y s 399 222 m -14 Y s 430 237 m -29 Y s 461 222 m -14 Y s 493 222 m -14 Y s 524
 222 m -14 Y s 555 222 m -14 Y s 586 237 m -29 Y s 618 222 m -14 Y s 649 222 m -14 Y s 680 222 m -14 Y s 712 222 m -14 Y s 743 237 m -29 Y s 774 222 m -14 Y s 805 222 m -14 Y s 837 222 m -14 Y s 868 222 m -14 Y s 899 237 m -29 Y s 931 222 m -14 Y s
 962 222 m -14 Y s 993 222 m -14 Y s 1024 222 m -14 Y s 1056 237 m -29 Y s 274 237 m -29 Y s 242 222 m -14 Y s 211 222 m -14 Y s
 gsave  1088 1214 23 12 C 239.625 163.875 t 0 r /Helvetica findfont 40.9078 sf 0 0 m (100) show NC gr 
 gsave  1088 1214 23 12 C 396.062 163.875 t 0 r /Helvetica findfont 40.9078 sf 0 0 m (200) show NC gr 
 gsave  1088 1214 23 12 C 552.438 163.875 t 0 r /Helvetica findfont 40.9078 sf 0 0 m (300) show NC gr 
 gsave  1088 1214 23 12 C 708.812 163.875 t 0 r /Helvetica findfont 40.9078 sf 0 0 m (400) show NC gr 
 gsave  1088 1214 23 12 C 865.25 163.875 t 0 r /Helvetica findfont 40.9078 sf 0 0 m (500) show NC gr 
 gsave  1088 1214 23 12 C 1021.62 163.875 t 0 r /Helvetica findfont 40.9078 sf 0 0 m (600) show NC gr  195 1166 m 861 X s 274 1137 m 29 Y s 305 1151 m 15 Y s 336 1151 m 15 Y s 368 1151 m 15 Y s 399 1151 m 15 Y s 430 1137 m 29 Y s 461 1151 m 15 Y s
 493 1151 m 15 Y s 524 1151 m 15 Y s 555 1151 m 15 Y s 586 1137 m 29 Y s 618 1151 m 15 Y s 649 1151 m 15 Y s 680 1151 m 15 Y s 712 1151 m 15 Y s 743 1137 m 29 Y s 774 1151 m 15 Y s 805 1151 m 15 Y s 837 1151 m 15 Y s 868 1151 m 15 Y s 899 1137 m 29 Y
 s 931 1151 m 15 Y s 962 1151 m 15 Y s 993 1151 m 15 Y s 1024 1151 m 15 Y s 1056 1137 m 29 Y s 274 1137 m 29 Y s 242 1151 m 15 Y s 211 1151 m 15 Y s 195 208 m 958 Y s
 gsave  1088 1214 23 12 C 99.3125 1141.31 t 90 r /Helvetica findfont 40.9078 sf 0 0 m ( \)) show NC gr 
 gsave  1088 1214 23 12 C 79.75 1123.5 t 90 r /Helvetica findfont 26.679 sf 0 0 m (\2551) show NC gr 
 gsave  1088 1214 23 12 C 99.3125 394.938 t 90 r /Helvetica findfont 40.9078 sf 0 0 m (NLO Events/10GeV \( Normalized to 1 fb) show NC gr  208 208 m -13 X s 208 233 m -13 X s 208 255 m -13 X s 208 273 m -13 X s 208 289 m -13 X s 221 304 m -26 X s
 gsave  1088 1214 23 12 C 161.438 306.062 t 0 r /Helvetica findfont 26.679 sf 0 0 m (\2552) show NC gr 
 gsave  1088 1214 23 12 C 117 286.5 t 0 r /Helvetica findfont 40.9078 sf 0 0 m (10) show NC gr  208 400 m -13 X s 208 456 m -13 X s 208 496 m -13 X s 208 527 m -13 X s 208 553 m -13 X s 208 574 m -13 X s 208 592 m -13 X s 208 609 m -13 X s 221 623 m
 -26 X s
 gsave  1088 1214 23 12 C 165 624.188 t 0 r /Helvetica findfont 26.679 sf 0 0 m (\2551) show NC gr 
 gsave  1088 1214 23 12 C 120.562 604.625 t 0 r /Helvetica findfont 40.9078 sf 0 0 m (10) show NC gr  208 719 m -13 X s 208 776 m -13 X s 208 816 m -13 X s 208 847 m -13 X s 208 872 m -13 X s 208 893 m -13 X s 208 912 m -13 X s 208 928 m -13 X s 221
 943 m -26 X s
 gsave  1088 1214 23 12 C 186.312 925.938 t 0 r  -22 0 t /Helvetica findfont 40.9078 sf 0 0 m (1) show NC gr  208 1039 m -13 X s 208 1095 m -13 X s 208 1135 m -13 X s 1056 208 m 958 Y s 1043 208 m 13 X s 1043 233 m 13 X s 1043 255 m 13 X s 1043 273 m
 13 X s 1043 289 m 13 X s 1030 304 m 26 X s 1043 400 m 13 X s 1043 456 m 13 X s 1043 496 m 13 X s 1043 527 m 13 X s 1043 553 m 13 X s 1043 574 m 13 X s 1043 592 m 13 X s 1043 609 m 13 X s 1030 623 m 26 X s 1043 719 m 13 X s 1043 776 m 13 X s 1043 816
 m 13 X s 1043 847 m 13 X s 1043 872 m 13 X s 1043 893 m 13 X s 1043 912 m 13 X s 1043 928 m 13 X s 1030 943 m 26 X s 1043 1039 m 13 X s 1043 1095 m 13 X s 1043 1135 m 13 X s 6 lw 1 1 1 c 0 0 1 c 3 lw /w 14 def /w2 {w 2 div} def /w3 {w 3 div} def 219
 502 235 533 250 825 266 1004 282 667 297 721 313 739 328 730 344 716 360 698 375 689 391 702 407 856 422 920 438 919 454 907 469 889 485 868 500 851 516 829 532 810 547 793 563 775 579 753 594 739 610 719 626 701 641 684 657 665 672 651 688 634 704
 621 719 605 735 586 751 573 766 555 782 548 798 532 813 521 829 510 845 499 860 479 876 465 891 451 907 443 923 427 938 410 954 393 970 390 985 369 50 { m22} R 6 lw 3 lw 985 369 1001 367 1017 360 1032 335 1048 329 5 { m22} R 6 lw black 1 1 1 c 1 0 1
 c 3 lw 219 487 235 533 250 833 266 1004 282 661 297 721 313 738 328 733 344 714 360 697 375 687 391 701 407 851 422 917 438 917 454 905 469 886 485 865 500 847 516 827 532 807 547 786 563 769 579 751 594 731 610 713 626 695 641 680 657 661 672 643
 688 628 704 614 719 600 735 581 751 563 766 556 782 538 798 525 813 510 829 500 845 485 860 467 876 457 891 461 907 432 923 418 938 403 954 386 970 383 985 363 50 { m24} R 6 lw 3 lw 985 363 1001 350 1017 344 1032 333 1048 330 5 { m24} R 6 lw black 1
 1 1 c 0.35 0.83 0.33 c 3 lw 219 502 235 544 250 835 266 1006 282 663 297 720 313 741 328 735 344 715 360 698 375 684 391 702 407 852 422 916 438 916 454 903 469 884 485 863 500 843 516 823 532 803 547 784 563 764 579 745 594 728 610 709 626 694 641
 671 657 657 672 641 688 625 704 608 719 597 735 575 751 560 766 541 782 532 798 521 813 506 829 490 845 482 860 461 876 459 891 437 907 425 923 409 938 408 954 381 970 376 985 361 50 { m26} R 6 lw 3 lw 985 361 1001 348 1017 333 1032 332 1048 308 5 {
 m26} R 6 lw black
 gsave  1088 1214 23 12 C 291.188 1082.62 t 0 r /Helvetica findfont 51.5794 sf 0 0 m 
 139 110 85 72 44 29
(= 7 TeV) K NC gr 
 gsave  1088 1214 23 12 C 266.312 1082.62 t 0 r /Helvetica findfont 51.5794 sf 0 0 m (s) show NC gr  233 1111 m 23 -30 d s 0 lw 256 1081 m 5 44 d s 261 1125 m 30 X s
 gsave  1088 1214 23 12 C 1099.81 814.312 t 90 r /Helvetica-BoldOblique findfont 30.2362 sf 0 0 m 
 336 321 304 287 279 255 226 218 198 177 169 148 125 101 93 71 62 40 18
(LHC HIGGS XS WG 2011) K NC gr  3 lw 1 1 1 c 528 182 487 913 bf black 498 913 m -7 Y 524 X 178 Y -7 X -171 Y f 487 913 m 182 Y 528 X -182 Y -528 X cl s
 gsave  1088 1214 23 12 C 618.188 1056 t 0 r /Helvetica findfont 24.9004 sf 0 0 m (QCD Scale Q = mZ/2 \(NLO CT10\)) show NC gr  0 0 1 c 553 1065 m22 black
 gsave  1088 1214 23 12 C 618.188 995.562 t 0 r /Helvetica findfont 24.9004 sf 0 0 m (QCD Scale Q = mZ \(NLO CT10\)) show NC gr  1 0 1 c 553 1004 m24 black
 gsave  1088 1214 23 12 C 618.188 935.125 t 0 r /Helvetica findfont 24.9004 sf 0 0 m (QCD Scale Q = 2mZ \(NLO CT10\)) show NC gr  0.35 0.83 0.33 c 553 944 m26 black 1 1 1 c 1088 1214 1157 12 bf black 1 1 1 c 860 959 1331 207 bf black 860 959 1331 207
 bl 1 1 1 c 860 959 1331 207 bf black 860 959 1331 207 bl 6 lw 1 1 1 c black 1331 207 m 860 X s 3 lw 1331 207 m 860 X s
 gsave  1088 1214 1157 12 C 2076.25 103.5 t 0 r /Helvetica findfont 40.9078 sf 0 0 m ( [GeV]) show NC gr 
 gsave  1088 1214 1157 12 C 2056.69 92.8125 t 0 r /Helvetica findfont 26.679 sf 0 0 m (4l) show NC gr 
 gsave  1088 1214 1157 12 C 2024.69 103.5 t 0 r /Helvetica findfont 40.9078 sf 0 0 m (M) show NC gr  1409 235 m -28 Y s 1440 221 m -14 Y s 1471 221 m -14 Y s 1503 221 m -14 Y s 1534 221 m -14 Y s 1565 235 m -28 Y s 1596 221 m -14 Y s 1628 221 m -14 Y
 s 1659 221 m -14 Y s 1690 221 m -14 Y s 1722 235 m -28 Y s 1753 221 m -14 Y s 1784 221 m -14 Y s 1815 221 m -14 Y s 1847 221 m -14 Y s 1878 235 m -28 Y s 1909 221 m -14 Y s 1940 221 m -14 Y s 1972 221 m -14 Y s 2003 221 m -14 Y s 2034 235 m -28 Y s
 2066 221 m -14 Y s 2097 221 m -14 Y s 2128 221 m -14 Y s 2159 221 m -14 Y s 2191 235 m -28 Y s 1409 235 m -28 Y s 1378 221 m -14 Y s 1346 221 m -14 Y s
 gsave  1088 1214 1157 12 C 1374.25 162.125 t 0 r /Helvetica findfont 40.9078 sf 0 0 m (100) show NC gr 
 gsave  1088 1214 1157 12 C 1530.62 162.125 t 0 r /Helvetica findfont 40.9078 sf 0 0 m (200) show NC gr 
 gsave  1088 1214 1157 12 C 1687 162.125 t 0 r /Helvetica findfont 40.9078 sf 0 0 m (300) show NC gr 
 gsave  1088 1214 1157 12 C 1843.44 162.125 t 0 r /Helvetica findfont 40.9078 sf 0 0 m (400) show NC gr 
 gsave  1088 1214 1157 12 C 1999.81 162.125 t 0 r /Helvetica findfont 40.9078 sf 0 0 m (500) show NC gr 
 gsave  1088 1214 1157 12 C 2156.19 162.125 t 0 r /Helvetica findfont 40.9078 sf 0 0 m (600) show NC gr  1331 1166 m 860 X s 1409 1137 m 29 Y s 1440 1151 m 15 Y s 1471 1151 m 15 Y s 1503 1151 m 15 Y s 1534 1151 m 15 Y s 1565 1137 m 29 Y s 1596 1151 m
 15 Y s 1628 1151 m 15 Y s 1659 1151 m 15 Y s 1690 1151 m 15 Y s 1722 1137 m 29 Y s 1753 1151 m 15 Y s 1784 1151 m 15 Y s 1815 1151 m 15 Y s 1847 1151 m 15 Y s 1878 1137 m 29 Y s 1909 1151 m 15 Y s 1940 1151 m 15 Y s 1972 1151 m 15 Y s 2003 1151 m 15
 Y s 2034 1137 m 29 Y s 2066 1151 m 15 Y s 2097 1151 m 15 Y s 2128 1151 m 15 Y s 2159 1151 m 15 Y s 2191 1137 m 29 Y s 1409 1137 m 29 Y s 1378 1151 m 15 Y s 1346 1151 m 15 Y s 1331 207 m 959 Y s
 gsave  1088 1214 1157 12 C 1235.62 1141.31 t 90 r /Helvetica findfont 40.9078 sf 0 0 m ( \)) show NC gr 
 gsave  1088 1214 1157 12 C 1216.06 1123.56 t 90 r /Helvetica findfont 26.679 sf 0 0 m (\2551) show NC gr 
 gsave  1088 1214 1157 12 C 1235.62 434.062 t 90 r /Helvetica findfont 40.9078 sf 0 0 m (gg Events/10GeV \( Normalized to 1 fb) show NC gr  1356 207 m -25 X s
 gsave  1088 1214 1157 12 C 1297.81 210.125 t 0 r /Helvetica findfont 26.679 sf 0 0 m (\2555) show NC gr 
 gsave  1088 1214 1157 12 C 1253.38 188.812 t 0 r /Helvetica findfont 40.9078 sf 0 0 m (10) show NC gr  1344 264 m -13 X s 1344 298 m -13 X s 1344 322 m -13 X s 1344 341 m -13 X s 1344 356 m -13 X s 1344 369 m -13 X s 1344 380 m -13 X s 1344 390 m
 -13 X s 1356 398 m -25 X s
 gsave  1088 1214 1157 12 C 1297.81 400.312 t 0 r /Helvetica findfont 26.679 sf 0 0 m (\2554) show NC gr 
 gsave  1088 1214 1157 12 C 1253.38 380.75 t 0 r /Helvetica findfont 40.9078 sf 0 0 m (10) show NC gr  1344 456 m -13 X s 1344 490 m -13 X s 1344 514 m -13 X s 1344 532 m -13 X s 1344 548 m -13 X s 1344 561 m -13 X s 1344 572 m -13 X s 1344 581 m -13
 X s 1356 590 m -25 X s
 gsave  1088 1214 1157 12 C 1297.81 594 t 0 r /Helvetica findfont 26.679 sf 0 0 m (\2553) show NC gr 
 gsave  1088 1214 1157 12 C 1253.38 572.688 t 0 r /Helvetica findfont 40.9078 sf 0 0 m (10) show NC gr  1344 648 m -13 X s 1344 682 m -13 X s 1344 706 m -13 X s 1344 724 m -13 X s 1344 739 m -13 X s 1344 752 m -13 X s 1344 763 m -13 X s 1344 773 m
 -13 X s 1356 782 m -25 X s
 gsave  1088 1214 1157 12 C 1297.81 784.188 t 0 r /Helvetica findfont 26.679 sf 0 0 m (\2552) show NC gr 
 gsave  1088 1214 1157 12 C 1253.38 764.625 t 0 r /Helvetica findfont 40.9078 sf 0 0 m (10) show NC gr  1344 840 m -13 X s 1344 874 m -13 X s 1344 898 m -13 X s 1344 916 m -13 X s 1344 931 m -13 X s 1344 944 m -13 X s 1344 955 m -13 X s 1344 965 m
 -13 X s 1356 974 m -25 X s
 gsave  1088 1214 1157 12 C 1301.38 974.312 t 0 r /Helvetica findfont 26.679 sf 0 0 m (\2551) show NC gr 
 gsave  1088 1214 1157 12 C 1256.94 954.75 t 0 r /Helvetica findfont 40.9078 sf 0 0 m (10) show NC gr  1344 1032 m -13 X s 1344 1065 m -13 X s 1344 1089 m -13 X s 1344 1108 m -13 X s 1344 1123 m -13 X s 1344 1136 m -13 X s 1344 1147 m -13 X s 1344
 1157 m -13 X s 1356 1166 m -25 X s
 gsave  1088 1214 1157 12 C 1322.19 1148.94 t 0 r  -22 0 t /Helvetica findfont 40.9078 sf 0 0 m (1) show NC gr  2191 207 m 959 Y s 2165 207 m 26 X s 2178 264 m 13 X s 2178 298 m 13 X s 2178 322 m 13 X s 2178 341 m 13 X s 2178 356 m 13 X s 2178 369 m
 13 X s 2178 380 m 13 X s 2178 390 m 13 X s 2165 398 m 26 X s 2178 456 m 13 X s 2178 490 m 13 X s 2178 514 m 13 X s 2178 532 m 13 X s 2178 548 m 13 X s 2178 561 m 13 X s 2178 572 m 13 X s 2178 581 m 13 X s 2165 590 m 26 X s 2178 648 m 13 X s 2178 682
 m 13 X s 2178 706 m 13 X s 2178 724 m 13 X s 2178 739 m 13 X s 2178 752 m 13 X s 2178 763 m 13 X s 2178 773 m 13 X s 2165 782 m 26 X s 2178 840 m 13 X s 2178 874 m 13 X s 2178 898 m 13 X s 2178 916 m 13 X s 2178 931 m 13 X s 2178 944 m 13 X s 2178
 955 m 13 X s 2178 965 m 13 X s 2165 974 m 26 X s 2178 1032 m 13 X s 2178 1065 m 13 X s 2178 1089 m 13 X s 2178 1108 m 13 X s 2178 1123 m 13 X s 2178 1136 m 13 X s 2178 1147 m 13 X s 2178 1157 m 13 X s 2165 1166 m 26 X s 6 lw 1 1 1 c 0 0 1 c 3 lw
 1354 741 1370 729 1385 714 1401 690 1417 675 1432 692 1448 712 1464 723 1479 721 1495 726 1510 741 1526 792 1542 926 1557 957 1573 955 1589 947 1604 937 1620 926 1636 913 1651 900 1667 888 1682 875 1698 862 1714 848 1729 836 1745 823 1761 811 1776
 800 1792 788 1808 773 1823 763 1839 752 1854 740 1870 729 1886 718 1901 707 1917 696 1933 688 1948 677 1964 669 1980 657 1995 649 2011 641 2026 625 2042 622 2058 609 2073 602 2089 592 2105 583 2120 578 50 { m22} R 6 lw 3 lw 2120 578 2136 572 2152
 558 2167 554 2183 541 5 { m22} R 6 lw black 1 1 1 c 1 0 1 c 3 lw 1354 730 1370 709 1385 696 1401 676 1417 660 1432 675 1448 695 1464 702 1479 702 1495 710 1510 719 1526 771 1542 905 1557 936 1573 934 1589 926 1604 915 1620 903 1636 891 1651 877 1667
 865 1682 852 1698 837 1714 824 1729 812 1745 799 1761 786 1776 774 1792 762 1808 750 1823 738 1839 726 1854 713 1870 702 1886 692 1901 681 1917 669 1933 660 1948 652 1964 640 1980 626 1995 622 2011 607 2026 602 2042 591 2058 585 2073 568 2089 561
 2105 551 2120 550 50 { m24} R 6 lw 3 lw 2120 550 2136 542 2152 525 2167 524 2183 508 5 { m24} R 6 lw black 1 1 1 c 0.35 0.83 0.33 c 3 lw 1354 719 1370 701 1385 681 1401 659 1417 644 1432 660 1448 677 1464 685 1479 687 1495 689 1510 705 1526 754 1542
 886 1557 917 1573 914 1589 906 1604 895 1620 883 1636 870 1651 856 1667 843 1682 830 1698 815 1714 803 1729 789 1745 776 1761 763 1776 752 1792 738 1808 725 1823 714 1839 701 1854 691 1870 677 1886 667 1901 658 1917 645 1933 637 1948 624 1964 614
 1980 606 1995 593 2011 585 2026 571 2042 565 2058 560 2073 543 2089 543 2105 523 2120 521 50 { m26} R 6 lw 3 lw 2120 521 2136 512 2152 493 2167 493 2183 485 5 { m26} R 6 lw black
 gsave  1088 1214 1157 12 C 1425.75 1082.75 t 0 r /Helvetica findfont 51.5794 sf 0 0 m 
 139 111 85 72 44 30
(= 7 TeV) K NC gr 
 gsave  1088 1214 1157 12 C 1400.88 1082.75 t 0 r /Helvetica findfont 51.5794 sf 0 0 m (s) show NC gr  1367 1111 m 23 -30 d s 0 lw 1390 1081 m 5 44 d s 1395 1125 m 30 X s
 gsave  1088 1214 1157 12 C 2234.38 814.375 t 90 r /Helvetica-BoldOblique findfont 30.2362 sf 0 0 m 
 336 321 304 287 279 255 226 218 198 177 169 148 125 101 93 71 62 40 18
(LHC HIGGS XS WG 2011) K NC gr  3 lw 1 1 1 c 478 182 1671 913 bf black 1681 913 m -7 Y 475 X 178 Y -7 X -171 Y f 1671 913 m 182 Y 478 X -182 Y -478 X cl s
 gsave  1088 1214 1157 12 C 1790.12 1056.06 t 0 r /Helvetica findfont 24.9004 sf 0 0 m (QCD Scale Q = mZ/2 \(gg CT10\)) show NC gr  0 0 1 c 1730 1065 m22 black
 gsave  1088 1214 1157 12 C 1790.12 995.625 t 0 r /Helvetica findfont 24.9004 sf 0 0 m (QCD Scale Q = mZ \(gg CT10\)) show NC gr  1 0 1 c 1730 1004 m24 black
 gsave  1088 1214 1157 12 C 1790.12 935.25 t 0 r /Helvetica findfont 24.9004 sf 0 0 m (QCD Scale Q = 2mZ \(gg CT10\)) show NC gr  0.35 0.83 0.33 c 1730 944 m26
 gr  gr showpage
end
%%EOF
