%!PS-Adobe-2.0 EPSF-2.0
%%BoundingBox:  0 0 567 384
%%Title: comparison_dPhi_gg.eps: c2
%%Creator: ROOT Version 5.28/00a
%%CreationDate: Sat Jan  7 09:51:09 2012
%%EndComments
%%BeginProlog
80 dict begin
/s {stroke} def /l {lineto} def /m {moveto} def /t {translate} def
/r {rotate} def /rl {roll}  def /R {repeat} def
/d {rlineto} def /rm {rmoveto} def /gr {grestore} def /f {eofill} def
/c {setrgbcolor} def /black {0 setgray} def /sd {setdash} def
/cl {closepath} def /sf {scalefont setfont} def /lw {setlinewidth} def
/box {m dup 0 exch d exch 0 d 0 exch neg d cl} def
/NC{systemdict begin initclip end}def/C{NC box clip newpath}def
/bl {box s} def /bf {box f} def /Y { 0 exch d} def /X { 0 d} def 
/K {{pop pop 0 moveto} exch kshow} bind def
/ita {/ang 15 def gsave [1 0 ang dup sin exch cos div 1 0 0] concat} def 
/mp {newpath /y exch def /x exch def} def
/side {[w .77 mul w .23 mul] .385 w mul sd w 0 l currentpoint t -144 r} def
/mr {mp x y w2 0 360 arc} def /m24 {mr s} def /m20 {mr f} def
/mb {mp x y w2 add m w2 neg 0 d 0 w neg d w 0 d 0 w d cl} def
/mt {mp x y w2 add m w2 neg w neg d w 0 d cl} def
/m21 {mb f} def /m25 {mb s} def /m22 {mt f} def /m26{mt s} def
/m23 {mp x y w2 sub m w2 w d w neg 0 d cl f} def
/m27 {mp x y w2 add m w3 neg w2 neg d w3 w2 neg d w3 w2 d cl s} def
/m28 {mp x w2 sub y w2 sub w3 add m w3 0 d  0 w3 neg d w3 0 d 0 w3 d w3 0 d  0 w3 d w3 neg 0 d 0 w3 d w3 neg 0 d 0 w3 neg d w3 neg 0 d cl s } def
/m29 {mp gsave x w2 sub y w2 add w3 sub m currentpoint t 4 {side} repeat cl fill gr} def
/m30 {mp gsave x w2 sub y w2 add w3 sub m currentpoint t 4 {side} repeat cl s gr} def
/m31 {mp x y w2 sub m 0 w d x w2 sub y m w 0 d x w2 sub y w2 add m w w neg d x w2 sub y w2 sub m w w d s} def
/m32 {mp x y w2 sub m w2 w d w neg 0 d cl s} def
/m33 {mp x y w2 add m w3 neg w2 neg d w3 w2 neg d w3 w2 d cl f} def
/m34 {mp x w2 sub y w2 sub w3 add m w3 0 d  0 w3 neg d w3 0 d 0 w3 d w3 0 d  0 w3 d w3 neg 0 d 0 w3 d w3 neg 0 d 0 w3 neg d w3 neg 0 d cl f } def
/m2 {mp x y w2 sub m 0 w d x w2 sub y m w 0 d s} def
/m5 {mp x w2 sub y w2 sub m w w d x w2 sub y w2 add m w w neg d s} def
/reEncode {exch findfont dup length dict begin {1 index /FID eq  {pop pop} {def} ifelse } forall /Encoding exch def currentdict end dup /FontName get exch definefont pop } def [/Times-Bold /Times-Italic /Times-BoldItalic /Helvetica /Helvetica-Oblique
 /Helvetica-Bold /Helvetica-BoldOblique /Courier /Courier-Oblique /Courier-Bold /Courier-BoldOblique /Times-Roman /AvantGarde-Book /AvantGarde-BookOblique /AvantGarde-Demi /AvantGarde-DemiOblique /Bookman-Demi /Bookman-DemiItalic /Bookman-Light
 /Bookman-LightItalic /Helvetica-Narrow /Helvetica-Narrow-Bold /Helvetica-Narrow-BoldOblique /Helvetica-Narrow-Oblique /NewCenturySchlbk-Roman /NewCenturySchlbk-Bold /NewCenturySchlbk-BoldItalic /NewCenturySchlbk-Italic /Palatino-Bold
 /Palatino-BoldItalic /Palatino-Italic /Palatino-Roman ] {ISOLatin1Encoding reEncode } forall%%EndProlog
%%BeginSetup
%%EndSetup
newpath  gsave  .25 .25 scale  gsave  0 0 t black[  ] 0 sd 3 lw 1 1 1 c 2268 1538 0 0 bf black 1 1 1 c 1791 1215 363 246 bf black 1791 1215 363 246 bl 1 0 0 c 6 lw 1 1 1 c black 1 0 0 c 363 257 m 60 X 2 Y 119 X -2 Y 60 X 3 Y 59 X 3 Y 60 X 1 Y 60 X 1
 Y 60 X 6 Y 59 X -1 Y 60 X 3 Y 60 X 2 Y 59 X 6 Y 60 X 4 Y 60 X 1 Y 60 X 7 Y 59 X 4 Y 60 X 7 Y 60 X 11 Y 59 X 10 Y 60 X 19 Y 60 X 19 Y 60 X 26 Y 59 X 29 Y 60 X 58 Y 60 X 61 Y 59 X 92 Y 60 X 145 Y 60 X 207 Y 60 X 211 Y 59 X s black 3 lw 363 246 m 1791
 X s
 gsave  2268 1538 0 0 C 2127.75 123.812 t 0 r /Symbol findfont 48.8732 sf 0 0 m (g) show NC gr 
 gsave  2268 1538 0 0 C 2101.69 123.812 t 0 r /Symbol findfont 48.8732 sf 0 0 m (g) show NC gr 
 gsave  2268 1538 0 0 C 2065.88 78.1875 t 0 r /Symbol findfont 71.6807 sf 0 0 m (f) show NC gr 
 gsave  2268 1538 0 0 C 2046.31 78.1875 t 0 r /Helvetica findfont 71.6807 sf 0 0 m ( ) show NC gr 
 gsave  2268 1538 0 0 C 2000.69 78.1875 t 0 r /Symbol findfont 71.6807 sf 0 0 m (D) show NC gr  363 283 m -37 Y s 420 264 m -18 Y s 477 264 m -18 Y s 534 264 m -18 Y s 591 264 m -18 Y s 648 283 m -37 Y s 705 264 m -18 Y s 762 264 m -18 Y s 819 264 m
 -18 Y s 876 264 m -18 Y s 933 283 m -37 Y s 990 264 m -18 Y s 1047 264 m -18 Y s 1104 264 m -18 Y s 1161 264 m -18 Y s 1218 283 m -37 Y s 1275 264 m -18 Y s 1332 264 m -18 Y s 1389 264 m -18 Y s 1446 264 m -18 Y s 1503 283 m -37 Y s 1560 264 m -18 Y
 s 1617 264 m -18 Y s 1674 264 m -18 Y s 1731 264 m -18 Y s 1788 283 m -37 Y s 1845 264 m -18 Y s 1903 264 m -18 Y s 1960 264 m -18 Y s 2017 264 m -18 Y s 2074 283 m -37 Y s 2074 283 m -37 Y s 2131 264 m -18 Y s
 gsave  2268 1538 0 0 C 342.25 179.188 t 0 r /Helvetica findfont 71.6807 sf 0 0 m (0) show NC gr 
 gsave  2268 1538 0 0 C 596.438 179.188 t 0 r /Helvetica findfont 71.6807 sf 0 0 m (0.5) show NC gr 
 gsave  2268 1538 0 0 C 915.688 179.188 t 0 r /Helvetica findfont 71.6807 sf 0 0 m (1) show NC gr 
 gsave  2268 1538 0 0 C 1166.62 179.188 t 0 r /Helvetica findfont 71.6807 sf 0 0 m (1.5) show NC gr 
 gsave  2268 1538 0 0 C 1482.62 179.188 t 0 r /Helvetica findfont 71.6807 sf 0 0 m (2) show NC gr 
 gsave  2268 1538 0 0 C 1736.81 179.188 t 0 r /Helvetica findfont 71.6807 sf 0 0 m (2.5) show NC gr 
 gsave  2268 1538 0 0 C 2052.81 179.188 t 0 r /Helvetica findfont 71.6807 sf 0 0 m (3) show NC gr  363 1461 m 1791 X s 363 1425 m 36 Y s 420 1443 m 18 Y s 477 1443 m 18 Y s 534 1443 m 18 Y s 591 1443 m 18 Y s 648 1425 m 36 Y s 705 1443 m 18 Y s 762
 1443 m 18 Y s 819 1443 m 18 Y s 876 1443 m 18 Y s 933 1425 m 36 Y s 990 1443 m 18 Y s 1047 1443 m 18 Y s 1104 1443 m 18 Y s 1161 1443 m 18 Y s 1218 1425 m 36 Y s 1275 1443 m 18 Y s 1332 1443 m 18 Y s 1389 1443 m 18 Y s 1446 1443 m 18 Y s 1503 1425 m
 36 Y s 1560 1443 m 18 Y s 1617 1443 m 18 Y s 1674 1443 m 18 Y s 1731 1443 m 18 Y s 1788 1425 m 36 Y s 1845 1443 m 18 Y s 1903 1443 m 18 Y s 1960 1443 m 18 Y s 2017 1443 m 18 Y s 2074 1425 m 36 Y s 2074 1425 m 36 Y s 2131 1443 m 18 Y s 363 246 m 1215
 Y s
 gsave  2268 1538 0 0 C 133.812 1244.56 t 90 r /Helvetica findfont 71.6807 sf 0 0 m (Events) show NC gr  417 246 m -54 X s 390 280 m -27 X s 390 314 m -27 X s 390 347 m -27 X s 417 381 m -54 X s 390 415 m -27 X s 390 449 m -27 X s 390 482 m -27 X s
 417 516 m -54 X s 390 550 m -27 X s 390 584 m -27 X s 390 617 m -27 X s 417 651 m -54 X s 390 685 m -27 X s 390 719 m -27 X s 390 752 m -27 X s 417 786 m -54 X s 390 820 m -27 X s 390 854 m -27 X s 390 887 m -27 X s 417 921 m -54 X s 390 955 m -27 X
 s 390 989 m -27 X s 390 1022 m -27 X s 417 1056 m -54 X s 390 1090 m -27 X s 390 1124 m -27 X s 390 1157 m -27 X s 417 1191 m -54 X s 390 1225 m -27 X s 390 1258 m -27 X s 390 1292 m -27 X s 417 1326 m -54 X s 390 1360 m -27 X s 390 1393 m -27 X s
 390 1427 m -27 X s 417 1461 m -54 X s
 gsave  2268 1538 0 0 C 309.75 221.562 t 0 r /Helvetica findfont 71.6807 sf 0 0 m (0) show NC gr 
 gsave  2268 1538 0 0 C 192.438 355.062 t 0 r /Helvetica findfont 71.6807 sf 0 0 m (2000) show NC gr 
 gsave  2268 1538 0 0 C 192.438 491.938 t 0 r /Helvetica findfont 71.6807 sf 0 0 m (4000) show NC gr 
 gsave  2268 1538 0 0 C 192.438 625.5 t 0 r /Helvetica findfont 71.6807 sf 0 0 m (6000) show NC gr 
 gsave  2268 1538 0 0 C 192.438 762.375 t 0 r /Helvetica findfont 71.6807 sf 0 0 m (8000) show NC gr 
 gsave  2268 1538 0 0 C 150.125 895.938 t 0 r /Helvetica findfont 71.6807 sf 0 0 m (10000) show NC gr 
 gsave  2268 1538 0 0 C 150.125 1032.81 t 0 r /Helvetica findfont 71.6807 sf 0 0 m (12000) show NC gr 
 gsave  2268 1538 0 0 C 150.125 1166.38 t 0 r /Helvetica findfont 71.6807 sf 0 0 m (14000) show NC gr 
 gsave  2268 1538 0 0 C 150.125 1300 t 0 r /Helvetica findfont 71.6807 sf 0 0 m (16000) show NC gr 
 gsave  2268 1538 0 0 C 150.125 1436.81 t 0 r /Helvetica findfont 71.6807 sf 0 0 m (18000) show NC gr  2154 246 m 1215 Y s 2101 246 m 53 X s 2127 280 m 27 X s 2127 314 m 27 X s 2127 347 m 27 X s 2101 381 m 53 X s 2127 415 m 27 X s 2127 449 m 27 X s
 2127 482 m 27 X s 2101 516 m 53 X s 2127 550 m 27 X s 2127 584 m 27 X s 2127 617 m 27 X s 2101 651 m 53 X s 2127 685 m 27 X s 2127 719 m 27 X s 2127 752 m 27 X s 2101 786 m 53 X s 2127 820 m 27 X s 2127 854 m 27 X s 2127 887 m 27 X s 2101 921 m 53 X
 s 2127 955 m 27 X s 2127 989 m 27 X s 2127 1022 m 27 X s 2101 1056 m 53 X s 2127 1090 m 27 X s 2127 1124 m 27 X s 2127 1157 m 27 X s 2101 1191 m 53 X s 2127 1225 m 27 X s 2127 1258 m 27 X s 2127 1292 m 27 X s 2101 1326 m 53 X s 2127 1360 m 27 X s
 2127 1393 m 27 X s 2127 1427 m 27 X s 2101 1461 m 53 X s 0 0 1 c 6 lw 1 1 1 c 0 0 1 c 363 253 m 17 X s 406 253 m 17 X s 3 lw /w 31 def /w2 {w 2 div} def /w3 {w 3 div} def 393 253 m20 6 lw 423 253 m 16 X s 465 253 m 17 X s 3 lw 452 253 m20 6 lw 482
 254 m 17 X s 525 254 m 17 X s 3 lw 512 254 m20 6 lw 542 253 m 17 X s 585 253 m 17 X s 3 lw 572 253 m20 6 lw 602 254 m 17 X s 645 254 m 16 X s 3 lw 632 254 m20 6 lw 661 256 m 17 X s 704 256 m 17 X s 3 lw 691 256 m20 6 lw 721 257 m 17 X s 764 257 m 17
 X s 3 lw 751 257 m20 6 lw 781 258 m 17 X s 824 258 m 17 X s 3 lw 811 258 m20 6 lw 841 261 m 16 X s 883 261 m 17 X s 3 lw 870 261 m20 6 lw 900 260 m 17 X s 943 260 m 17 X s 3 lw 930 260 m20 6 lw 960 262 m 17 X s 1003 262 m 17 X s 3 lw 990 262 m20 6
 lw 1020 263 m 17 X s 1063 263 m 16 X s 3 lw 1050 263 m20 6 lw 1079 267 m 17 X s 1122 267 m 17 X s 3 lw 1109 267 m20 6 lw 1139 270 m 17 X s 1182 270 m 17 X s 3 lw 1169 270 m20 6 lw 1199 271 m 17 X s 1242 271 m 17 X s 3 lw 1229 271 m20 6 lw 1259 276 m
 16 X s 1301 276 m 17 X s 3 lw 1288 276 m20 6 lw 1318 280 m 17 X s 1361 280 m 17 X s 3 lw 1348 280 m20 6 lw 1378 286 m 17 X s 1421 286 m 17 X s 3 lw 1408 286 m20 6 lw 1438 296 m 17 X s 1481 296 m 16 X s 3 lw 1468 296 m20 6 lw 1497 306 m 17 X s 1540
 306 m 17 X s 3 lw 1527 306 m20 6 lw 1557 323 m 17 X s 1600 323 m 17 X s 3 lw 1587 323 m20 6 lw 1617 342 m 17 X s 1660 342 m 17 X s 3 lw 1647 342 m20 6 lw 1677 369 m 16 X s 1719 369 m 17 X s 3 lw 1706 369 m20 6 lw 1736 400 m 17 X s 1779 400 m 17 X s
 3 lw 1766 400 m20 6 lw 1796 461 m 17 X s 1839 461 m 17 X s 3 lw 1826 461 m20 6 lw 1856 532 m 17 X s 1899 532 m 16 X s 3 lw 1886 532 m20 6 lw 1915 639 m 17 X s 1958 639 m 17 X s 3 lw 1945 639 m20 6 lw 1975 818 m 17 X s 2018 818 m 17 X s 3 lw 2005 818
 m20 6 lw 2035 1090 m 17 X s 2078 1090 m 17 X s 3 lw 2065 1090 m20 6 lw 2095 1382 m 16 X s 2138 1382 m 16 X s 3 lw 2124 1382 m20 6 lw black 3 lw 1 1 1 c 680 231 794 461 bf 813 461 m -13 Y 674 X 224 Y -13 X -211 Y f black 794 461 m 231 Y 680 X -231 Y
 -680 X cl s
 gsave  2268 1538 0 0 C 961.312 619 t 0 r /Helvetica findfont 45.615 sf 0 0 m 
 438 413 403 391 366 341 331 306 274 249 234 222 196 171 139 126 101 87 62 50 25
(before HqT reweighting) K NC gr  1 0 0 c 6 lw 819 634 m 119 X s black
 gsave  2268 1538 0 0 C 961.312 504.938 t 0 r /Helvetica findfont 45.615 sf 0 0 m 
 401 376 366 354 329 304 294 269 237 212 197 185 159 134 102 89 74 50 37 25
(after HqT reweighting) K NC gr  0 0 1 c 3 lw 879 519 m20 6 lw black
 gsave  2268 1538 0 0 C 2222.25 1117.5 t 90 r /Helvetica-BoldOblique findfont 29.3239 sf 0 0 m 
 317 303 287 271 263 240 213 205 186 167 159 140 118 95 87 67 59 38 17
(LHC HIGGS XS WG 2011) K NC gr 
 gr  gr showpage
end
%%EOF
