%!PS-Adobe-3.0 EPSF-3.0
%%BoundingBox: (atend)
%%LanguageLevel: 2
%%Creator: Grace-5.1.22
%%CreationDate: Mon Dec 19 07:06:28 2011
%%DocumentData: Clean8Bit
%%Orientation: Portrait
%%Title: dsdpt_t_err_band.agr
%%For: laura
%%DocumentNeededResources: (atend)
%%EndComments
%%BeginProlog
/m {moveto} def
/l {lineto} def
/s {stroke} def
/n {newpath} def
/c {closepath} def
/RL {rlineto} def
/SLW {setlinewidth} def
/GS {gsave} def
/GR {grestore} def
/SC {setcolor} def
/SGRY {setgray} def
/SRGB {setrgbcolor} def
/SD {setdash} def
/SLC {setlinecap} def
/SLJ {setlinejoin} def
/SCS {setcolorspace} def
/FFSF {findfont setfont} def
/CC {concat} def
/PXL {n m 0 0 RL s} def
/Color0 {1.0000 1.0000 1.0000} def
/Color1 {0.0000 0.0000 0.0000} def
/Color2 {1.0000 0.0000 0.0000} def
/Color3 {0.0000 1.0000 0.0000} def
/Color4 {0.0000 0.0000 1.0000} def
/Color5 {1.0000 1.0000 0.0000} def
/Color6 {0.7373 0.5608 0.5608} def
/Color7 {0.8627 0.8627 0.8627} def
/Color8 {0.5804 0.0000 0.8275} def
/Color9 {0.0000 1.0000 1.0000} def
/Color10 {1.0000 0.0000 1.0000} def
/Color11 {1.0000 0.6471 0.0000} def
/Color12 {0.4471 0.1294 0.7373} def
/Color13 {0.4039 0.0275 0.2824} def
/Color14 {0.2510 0.8784 0.8157} def
/Color15 {0.0000 0.5451 0.0000} def
/Color16 {0.7529 0.7529 0.7529} def
/Color17 {0.5059 0.5059 0.5059} def
/Color18 {0.2588 0.2588 0.2588} def
/PTRN {
 /pat_bits exch def 
 <<
  /PaintType 2
  /PatternType 1 /TilingType 1
  /BBox[0 0 16 16]
  /XStep 16 /YStep 16
  /PaintProc {
   pop
   16 16 true [-1 0 0 -1 16 16] pat_bits imagemask
  }
 >>
 [0.0016 0 0 0.0016 0 0]
 makepattern
} def
/Pattern0 {<0000000000000000000000000000000000000000000000000000000000000000> PTRN} bind def
/Pattern1 {<ffffffffffffffffffffffffffffffffffffffffffffffffffffffffffffffff> PTRN} bind def
/Pattern2 {<eeeeffffbbbbffffeeeeffffbbbbffffeeeeffffbbbbffffeeeeffffbbbbffff> PTRN} bind def
/Pattern3 {<eeeebbbbeeeebbbbeeeebbbbeeeebbbbeeeebbbbeeeebbbbeeeebbbbeeeebbbb> PTRN} bind def
/Pattern4 {<5555aaaa5555aaaa5555aaaa5555aaaa5555aaaa5555aaaa5555aaaa5555aaaa> PTRN} bind def
/Pattern5 {<1111444411114444111144441111444411114444111144441111444411114444> PTRN} bind def
/Pattern6 {<1111000044440000111100004444000011110000444400001111000044440000> PTRN} bind def
/Pattern7 {<1010000000000000010100000000000010100000000000000101000000000000> PTRN} bind def
/Pattern8 {<0000000000000000000000000000000000000000000000000000000000000000> PTRN} bind def
/Pattern9 {<1e1e0f0f8787c3c3e1e1f0f078783c3c1e1e0f0f8787c3c3e1e1f0f078783c3c> PTRN} bind def
/Pattern10 {<7878f0f0e1e1c3c387870f0f1e1e3c3c7878f0f0e1e1c3c387870f0f1e1e3c3c> PTRN} bind def
/Pattern11 {<3333333333333333333333333333333333333333333333333333333333333333> PTRN} bind def
/Pattern12 {<ffffffff00000000ffffffff00000000ffffffff00000000ffffffff00000000> PTRN} bind def
/Pattern13 {<8181424224241818181824244242818181814242242418181818242442428181> PTRN} bind def
/Pattern14 {<8080404020201010080804040202010180804040202010100808040402020101> PTRN} bind def
/Pattern15 {<0101020204040808101020204040808001010202040408081010202040408080> PTRN} bind def
/Pattern16 {<2222222222222222222222222222222222222222222222222222222222222222> PTRN} bind def
/Pattern17 {<0000ffff000000000000ffff000000000000ffff000000000000ffff00000000> PTRN} bind def
/Pattern18 {<2222ffff222222222222ffff222222222222ffff222222222222ffff22222222> PTRN} bind def
/Pattern19 {<ffffffff33333333ffffffff33333333ffffffff33333333ffffffff33333333> PTRN} bind def
/Pattern20 {<0f0f0f0f0f0f0f0ff0f0f0f0f0f0f0f00f0f0f0f0f0f0f0ff0f0f0f0f0f0f0f0> PTRN} bind def
/Pattern21 {<ff00ff00ff00ff00ff00ff00ff00ff0000ff00ff00ff00ff00ff00ff00ff00ff> PTRN} bind def
/Pattern22 {<8001800180018001800180018001ffffffff8001800180018001800180018001> PTRN} bind def
/Pattern23 {<c003c003c003c003c003c003ffffffffffffffffc003c003c003c003c003c003> PTRN} bind def
/Pattern24 {<040404040404ffff404040404040ffff040404040404ffff404040404040ffff> PTRN} bind def
/Pattern25 {<180018001800180018001800ffffffff001800180018001800180018ffffffff> PTRN} bind def
/Pattern26 {<1111b8b87c7c3a3a1111a3a3c7c78b8b1111b8b87c7c3a3a1111a3a3c7c78b8b> PTRN} bind def
/Pattern27 {<101010102828c7c70101010182827c7c101010102828c7c70101010182827c7c> PTRN} bind def
/Pattern28 {<1c1c121211112121c1c12121111112121c1c121211112121c1c1212111111212> PTRN} bind def
/Pattern29 {<3e3e414180808080e3e31414080808083e3e414180808080e3e3141408080808> PTRN} bind def
/Pattern30 {<4848888884848383848488884848383848488888848483838484888848483838> PTRN} bind def
/Pattern31 {<03030404080808080c0c12122121c0c003030404080808080c0c12122121c0c0> PTRN} bind def
/ellipsedict 8 dict def
ellipsedict /mtrx matrix put
/EARC {
 ellipsedict begin
  /endangle exch def
  /startangle exch def
  /yrad exch def
  /xrad exch def
  /y exch def
  /x exch def
  /savematrix mtrx currentmatrix def
  x y translate
  xrad yrad scale
  0 0 1 startangle endangle arc
  savematrix setmatrix
 end
} def
/TL {
  /kcomp exch def
  /linewidth exch def
  /offset exch def
  GS
  0 offset rmoveto
  linewidth SLW
  dup stringwidth exch kcomp add exch RL s
  GR
} def
/KINIT
{
 /kvector exch def
 /kid 0 def
} def
/KPROC
{
 pop pop
 kvector kid get
 0 rmoveto
 /kid 1 kid add def
} def
/DefEncoding [
 /.notdef
 /.notdef
 /.notdef
 /.notdef
 /.notdef
 /.notdef
 /.notdef
 /.notdef
 /.notdef
 /.notdef
 /.notdef
 /.notdef
 /.notdef
 /.notdef
 /.notdef
 /.notdef
 /.notdef
 /.notdef
 /.notdef
 /.notdef
 /.notdef
 /.notdef
 /.notdef
 /.notdef
 /.notdef
 /.notdef
 /.notdef
 /.notdef
 /.notdef
 /.notdef
 /.notdef
 /.notdef
 /space
 /exclam
 /quotedbl
 /numbersign
 /dollar
 /percent
 /ampersand
 /quoteright
 /parenleft
 /parenright
 /asterisk
 /plus
 /comma
 /hyphen
 /period
 /slash
 /zero
 /one
 /two
 /three
 /four
 /five
 /six
 /seven
 /eight
 /nine
 /colon
 /semicolon
 /less
 /equal
 /greater
 /question
 /at
 /A
 /B
 /C
 /D
 /E
 /F
 /G
 /H
 /I
 /J
 /K
 /L
 /M
 /N
 /O
 /P
 /Q
 /R
 /S
 /T
 /U
 /V
 /W
 /X
 /Y
 /Z
 /bracketleft
 /backslash
 /bracketright
 /asciicircum
 /underscore
 /grave
 /a
 /b
 /c
 /d
 /e
 /f
 /g
 /h
 /i
 /j
 /k
 /l
 /m
 /n
 /o
 /p
 /q
 /r
 /s
 /t
 /u
 /v
 /w
 /x
 /y
 /z
 /braceleft
 /bar
 /braceright
 /asciitilde
 /.notdef
 /.notdef
 /.notdef
 /.notdef
 /.notdef
 /.notdef
 /.notdef
 /.notdef
 /.notdef
 /.notdef
 /.notdef
 /.notdef
 /.notdef
 /.notdef
 /.notdef
 /.notdef
 /.notdef
 /.notdef
 /.notdef
 /.notdef
 /.notdef
 /.notdef
 /.notdef
 /.notdef
 /.notdef
 /.notdef
 /.notdef
 /.notdef
 /.notdef
 /.notdef
 /.notdef
 /.notdef
 /.notdef
 /space
 /exclamdown
 /cent
 /sterling
 /currency
 /yen
 /brokenbar
 /section
 /dieresis
 /copyright
 /ordfeminine
 /guillemotleft
 /logicalnot
 /hyphen
 /registered
 /macron
 /degree
 /plusminus
 /twosuperior
 /threesuperior
 /acute
 /mu
 /paragraph
 /periodcentered
 /cedilla
 /onesuperior
 /ordmasculine
 /guillemotright
 /onequarter
 /onehalf
 /threequarters
 /questiondown
 /Agrave
 /Aacute
 /Acircumflex
 /Atilde
 /Adieresis
 /Aring
 /AE
 /Ccedilla
 /Egrave
 /Eacute
 /Ecircumflex
 /Edieresis
 /Igrave
 /Iacute
 /Icircumflex
 /Idieresis
 /Eth
 /Ntilde
 /Ograve
 /Oacute
 /Ocircumflex
 /Otilde
 /Odieresis
 /multiply
 /Oslash
 /Ugrave
 /Uacute
 /Ucircumflex
 /Udieresis
 /Yacute
 /Thorn
 /germandbls
 /agrave
 /aacute
 /acircumflex
 /atilde
 /adieresis
 /aring
 /ae
 /ccedilla
 /egrave
 /eacute
 /ecircumflex
 /edieresis
 /igrave
 /iacute
 /icircumflex
 /idieresis
 /eth
 /ntilde
 /ograve
 /oacute
 /ocircumflex
 /otilde
 /odieresis
 /divide
 /oslash
 /ugrave
 /uacute
 /ucircumflex
 /udieresis
 /yacute
 /thorn
 /ydieresis
] def
%%EndProlog
%%BeginSetup
%%EndSetup
612.00 612.00 scale
n
0.0000 0.0000 m
0.0000 1.0000 l
1.2941 1.0000 l
1.2941 0.0000 l
c
[/DeviceRGB] SCS
Color0 SC
fill
[/DeviceRGB] SCS
Color1 SC
[] 0 SD
0.0030 SLW
0 SLC
0 SLJ
n
0.1500 0.4078 m
0.1500 0.5464 l
0.1750 0.5464 l
0.1750 0.6097 l
0.2000 0.6097 l
0.2000 0.6508 l
0.2250 0.6508 l
0.2250 0.6737 l
0.2500 0.6737 l
0.2500 0.6963 l
0.2750 0.6963 l
0.2750 0.7006 l
0.3000 0.7006 l
0.3000 0.7146 l
0.3250 0.7146 l
0.3250 0.7142 l
0.3500 0.7142 l
0.3500 0.7077 l
0.3750 0.7077 l
0.3750 0.7153 l
0.4000 0.7153 l
0.4000 0.7201 l
0.4250 0.7201 l
0.4250 0.7117 l
0.4500 0.7117 l
0.4500 0.6887 l
0.4750 0.6887 l
0.4750 0.6880 l
0.5000 0.6880 l
0.5000 0.6804 l
0.5250 0.6804 l
0.5250 0.6781 l
0.5500 0.6781 l
0.5500 0.6562 l
0.5750 0.6562 l
0.5750 0.6527 l
0.6000 0.6527 l
0.6000 0.6418 l
0.6250 0.6418 l
0.6250 0.6259 l
0.6500 0.6259 l
0.6500 0.6095 l
0.6750 0.6095 l
0.6750 0.6087 l
0.7000 0.6087 l
0.7000 0.5870 l
0.7250 0.5870 l
0.7250 0.5723 l
0.7500 0.5723 l
0.7500 0.5611 l
0.7750 0.5611 l
0.7750 0.5307 l
0.8000 0.5307 l
0.8000 0.5232 l
0.8250 0.5232 l
0.8250 0.5209 l
0.8500 0.5209 l
0.8500 0.5048 l
0.8750 0.5048 l
0.8750 0.4803 l
0.9000 0.4803 l
0.9000 0.4547 l
0.9250 0.4547 l
0.9250 0.4340 l
0.9500 0.4340 l
0.9500 0.4249 l
0.9750 0.4249 l
0.9750 0.3974 l
1.0000 0.3974 l
1.0000 0.3951 l
1.0250 0.3951 l
1.0250 0.3898 l
1.0500 0.3898 l
1.0500 0.3617 l
1.0750 0.3617 l
1.0750 0.3651 l
1.1000 0.3651 l
1.1000 0.3605 l
1.1250 0.3605 l
1.1250 0.3087 l
1.1500 0.3087 l
1.1500 0.2982 l
1.1501 0.2982 l
s
[/DeviceRGB] SCS
Color2 SC
n
0.1500 0.3977 m
0.1500 0.5386 l
0.1750 0.5386 l
0.1750 0.5974 l
0.2000 0.5974 l
0.2000 0.6399 l
0.2250 0.6399 l
0.2250 0.6644 l
0.2500 0.6644 l
0.2500 0.6793 l
0.2750 0.6793 l
0.2750 0.6874 l
0.3000 0.6874 l
0.3000 0.6996 l
0.3250 0.6996 l
0.3250 0.7033 l
0.3500 0.7033 l
0.3500 0.6981 l
0.3750 0.6981 l
0.3750 0.7022 l
0.4000 0.7022 l
0.4000 0.7048 l
0.4250 0.7048 l
0.4250 0.6945 l
0.4500 0.6945 l
0.4500 0.6780 l
0.4750 0.6780 l
0.4750 0.6811 l
0.5000 0.6811 l
0.5000 0.6704 l
0.5250 0.6704 l
0.5250 0.6593 l
0.5500 0.6593 l
0.5500 0.6517 l
0.5750 0.6517 l
0.5750 0.6376 l
0.6000 0.6376 l
0.6000 0.6310 l
0.6250 0.6310 l
0.6250 0.6158 l
0.6500 0.6158 l
0.6500 0.6011 l
0.6750 0.6011 l
0.6750 0.5877 l
0.7000 0.5877 l
0.7000 0.5802 l
0.7250 0.5802 l
0.7250 0.5607 l
0.7500 0.5607 l
0.7500 0.5491 l
0.7750 0.5491 l
0.7750 0.5194 l
0.8000 0.5194 l
0.8000 0.5203 l
0.8250 0.5203 l
0.8250 0.5056 l
0.8500 0.5056 l
0.8500 0.4858 l
0.8750 0.4858 l
0.8750 0.4501 l
0.9000 0.4501 l
0.9000 0.4314 l
0.9250 0.4314 l
0.9250 0.4238 l
0.9500 0.4238 l
0.9500 0.3893 l
0.9750 0.3893 l
0.9750 0.3832 l
1.0000 0.3832 l
1.0000 0.3809 l
1.0250 0.3809 l
1.0250 0.3623 l
1.0500 0.3623 l
1.0500 0.3665 l
1.0750 0.3665 l
1.0750 0.3390 l
1.1000 0.3390 l
1.1000 0.3149 l
1.1250 0.3149 l
1.1250 0.2826 l
1.1500 0.2826 l
1.1500 0.2671 l
1.1501 0.2671 l
s
n
0.1500 0.4193 m
0.1500 0.5564 l
0.1750 0.5564 l
0.1750 0.6171 l
0.2000 0.6171 l
0.2000 0.6591 l
0.2250 0.6591 l
0.2250 0.6839 l
0.2500 0.6839 l
0.2500 0.7019 l
0.2750 0.7019 l
0.2750 0.7135 l
0.3000 0.7135 l
0.3000 0.7223 l
0.3250 0.7223 l
0.3250 0.7167 l
0.3500 0.7167 l
0.3500 0.7198 l
0.3750 0.7198 l
0.3750 0.7272 l
0.4000 0.7272 l
0.4000 0.7344 l
0.4250 0.7344 l
0.4250 0.7183 l
0.4500 0.7183 l
0.4500 0.6897 l
0.4750 0.6897 l
0.4750 0.6938 l
0.5000 0.6938 l
0.5000 0.6833 l
0.5250 0.6833 l
0.5250 0.6854 l
0.5500 0.6854 l
0.5500 0.6631 l
0.5750 0.6631 l
0.5750 0.6528 l
0.6000 0.6528 l
0.6000 0.6452 l
0.6250 0.6452 l
0.6250 0.6358 l
0.6500 0.6358 l
0.6500 0.6161 l
0.6750 0.6161 l
0.6750 0.5970 l
0.7000 0.5970 l
0.7000 0.6055 l
0.7250 0.6055 l
0.7250 0.5790 l
0.7500 0.5790 l
0.7500 0.5541 l
0.7750 0.5541 l
0.7750 0.5386 l
0.8000 0.5386 l
0.8000 0.5312 l
0.8250 0.5312 l
0.8250 0.5199 l
0.8500 0.5199 l
0.8500 0.5108 l
0.8750 0.5108 l
0.8750 0.4763 l
0.9000 0.4763 l
0.9000 0.4542 l
0.9250 0.4542 l
0.9250 0.4351 l
0.9500 0.4351 l
0.9500 0.4230 l
0.9750 0.4230 l
0.9750 0.4003 l
1.0000 0.4003 l
1.0000 0.3974 l
1.0250 0.3974 l
1.0250 0.4036 l
1.0500 0.4036 l
1.0500 0.3718 l
1.0750 0.3718 l
1.0750 0.3564 l
1.1000 0.3564 l
1.1000 0.3455 l
1.1250 0.3455 l
1.1250 0.3480 l
1.1500 0.3480 l
1.1500 0.3130 l
1.1501 0.3130 l
s
[/DeviceRGB] SCS
Color4 SC
n
0.1500 0.3742 m
0.1500 0.5240 l
0.1750 0.5240 l
0.1750 0.5844 l
0.2000 0.5844 l
0.2000 0.6271 l
0.2250 0.6271 l
0.2250 0.6473 l
0.2500 0.6473 l
0.2500 0.6614 l
0.2750 0.6614 l
0.2750 0.6706 l
0.3000 0.6706 l
0.3000 0.6837 l
0.3250 0.6837 l
0.3250 0.6867 l
0.3500 0.6867 l
0.3500 0.6802 l
0.3750 0.6802 l
0.3750 0.6834 l
0.4000 0.6834 l
0.4000 0.6869 l
0.4250 0.6869 l
0.4250 0.6717 l
0.4500 0.6717 l
0.4500 0.6584 l
0.4750 0.6584 l
0.4750 0.6664 l
0.5000 0.6664 l
0.5000 0.6510 l
0.5250 0.6510 l
0.5250 0.6206 l
0.5500 0.6206 l
0.5500 0.6241 l
0.5750 0.6241 l
0.5750 0.6092 l
0.6000 0.6092 l
0.6000 0.6100 l
0.6250 0.6100 l
0.6250 0.5923 l
0.6500 0.5923 l
0.6500 0.5720 l
0.6750 0.5720 l
0.6750 0.5598 l
0.7000 0.5598 l
0.7000 0.5489 l
0.7250 0.5489 l
0.7250 0.5262 l
0.7500 0.5262 l
0.7500 0.5200 l
0.7750 0.5200 l
0.7750 0.4832 l
0.8000 0.4832 l
0.8000 0.4880 l
0.8250 0.4880 l
0.8250 0.4663 l
0.8500 0.4663 l
0.8500 0.4231 l
0.8750 0.4231 l
0.8750 0.3921 l
0.9000 0.3921 l
0.9000 0.3740 l
0.9250 0.3740 l
0.9250 0.3653 l
0.9500 0.3653 l
0.9500 0.3277 l
0.9750 0.3277 l
0.9750 0.2880 l
1.0000 0.2880 l
1.0000 0.3183 l
1.0250 0.3183 l
1.0250 0.2230 l
1.0500 0.2230 l
1.0500 0.2521 l
1.0750 0.2521 l
1.0750 0.2516 l
1.1000 0.2516 l
1.1000 0.1499 l
s
n
0.1500 0.4383 m
0.1500 0.5685 l
0.1750 0.5685 l
0.1750 0.6270 l
0.2000 0.6270 l
0.2000 0.6705 l
0.2250 0.6705 l
0.2250 0.6977 l
0.2500 0.6977 l
0.2500 0.7139 l
0.2750 0.7139 l
0.2750 0.7274 l
0.3000 0.7274 l
0.3000 0.7335 l
0.3250 0.7335 l
0.3250 0.7299 l
0.3500 0.7299 l
0.3500 0.7342 l
0.3750 0.7342 l
0.3750 0.7423 l
0.4000 0.7423 l
0.4000 0.7497 l
0.4250 0.7497 l
0.4250 0.7332 l
0.4500 0.7332 l
0.4500 0.7059 l
0.4750 0.7059 l
0.4750 0.7081 l
0.5000 0.7081 l
0.5000 0.6982 l
0.5250 0.6982 l
0.5250 0.7145 l
0.5500 0.7145 l
0.5500 0.6819 l
0.5750 0.6819 l
0.5750 0.6804 l
0.6000 0.6804 l
0.6000 0.6628 l
0.6250 0.6628 l
0.6250 0.6603 l
0.6500 0.6603 l
0.6500 0.6421 l
0.6750 0.6421 l
0.6750 0.6342 l
0.7000 0.6342 l
0.7000 0.6327 l
0.7250 0.6327 l
0.7250 0.6085 l
0.7500 0.6085 l
0.7500 0.5881 l
0.7750 0.5881 l
0.7750 0.5628 l
0.8000 0.5628 l
0.8000 0.5600 l
0.8250 0.5600 l
0.8250 0.5581 l
0.8500 0.5581 l
0.8500 0.5439 l
0.8750 0.5439 l
0.8750 0.5197 l
0.9000 0.5197 l
0.9000 0.4918 l
0.9250 0.4918 l
0.9250 0.4771 l
0.9500 0.4771 l
0.9500 0.4589 l
0.9750 0.4589 l
0.9750 0.4511 l
1.0000 0.4511 l
1.0000 0.4462 l
1.0250 0.4462 l
1.0250 0.4563 l
1.0500 0.4563 l
1.0500 0.4200 l
1.0750 0.4200 l
1.0750 0.4113 l
1.1000 0.4113 l
1.1000 0.4302 l
1.1250 0.4302 l
1.1250 0.4214 l
1.1500 0.4214 l
1.1500 0.3909 l
1.1501 0.3909 l
s
[/DeviceRGB] SCS
Color1 SC
[] 0 SD
0.0015 SLW
n
0.1500 0.1500 m
1.1500 0.1500 l
s
n
0.1500 0.8500 m
1.1500 0.8500 l
s
[] 0 SD
0.0030 SLW
n
0.2750 0.1500 m
0.2750 0.1600 l
s
n
0.2750 0.8500 m
0.2750 0.8400 l
s
n
0.5250 0.1500 m
0.5250 0.1600 l
s
n
0.5250 0.8500 m
0.5250 0.8400 l
s
n
0.7750 0.1500 m
0.7750 0.1600 l
s
n
0.7750 0.8500 m
0.7750 0.8400 l
s
n
1.0250 0.1500 m
1.0250 0.1600 l
s
n
1.0250 0.8500 m
1.0250 0.8400 l
s
n
0.1500 0.1500 m
0.1500 0.1700 l
s
n
0.1500 0.8500 m
0.1500 0.8300 l
s
n
0.4000 0.1500 m
0.4000 0.1700 l
s
n
0.4000 0.8500 m
0.4000 0.8300 l
s
n
0.6500 0.1500 m
0.6500 0.1700 l
s
n
0.6500 0.8500 m
0.6500 0.8300 l
s
n
0.9000 0.1500 m
0.9000 0.1700 l
s
n
0.9000 0.8500 m
0.9000 0.8300 l
s
n
1.1500 0.1500 m
1.1500 0.1700 l
s
n
1.1500 0.8500 m
1.1500 0.8300 l
s
/Times-Roman findfont
dup length dict begin
 {1 index /FID ne {def} {pop pop} ifelse} forall
 /Encoding DefEncoding def
 currentdict
end
/Font0 exch definefont pop
/Font0 FFSF
0.1418 0.1169 m
GS
[0.0344 0.0000 0.0000 0.0344 0 0] CC
(0) show
GR
/Font0 FFSF
0.3745 0.1169 m
GS
[0.0344 0.0000 0.0000 0.0344 0 0] CC
(100) show
GR
/Font0 FFSF
0.6245 0.1169 m
GS
[0.0344 0.0000 0.0000 0.0344 0 0] CC
(200) show
GR
/Font0 FFSF
0.8745 0.1169 m
GS
[0.0344 0.0000 0.0000 0.0344 0 0] CC
(300) show
GR
/Font0 FFSF
1.1245 0.1169 m
GS
[0.0344 0.0000 0.0000 0.0344 0 0] CC
(400) show
GR
/Font0 FFSF
0.5837 0.0717 m
GS
[0.0344 0.0000 0.0000 0.0344 0 0] CC
(p) show
GR
/Font0 FFSF
0.6010 0.0579 m
GS
[0.0244 0.0000 0.0000 0.0244 0 0] CC
(T) show
GR
/Font0 FFSF
0.6159 0.0924 m
GS
[0.0244 0.0000 0.0000 0.0244 0 0] CC
(t) show
GR
/Font0 FFSF
0.6225 0.0717 m
GS
[0.0344 0.0000 0.0000 0.0344 0 0] CC
( [GeV]) show
GR
[] 0 SD
0.0015 SLW
n
0.1500 0.1500 m
0.1500 0.8500 l
s
n
1.1500 0.1500 m
1.1500 0.8500 l
s
[] 0 SD
0.0030 SLW
n
0.1500 0.1724 m
0.1600 0.1724 l
s
n
1.1500 0.1724 m
1.1400 0.1724 l
s
n
0.1500 0.1913 m
0.1600 0.1913 l
s
n
1.1500 0.1913 m
1.1400 0.1913 l
s
n
0.1500 0.2077 m
0.1600 0.2077 l
s
n
1.1500 0.2077 m
1.1400 0.2077 l
s
n
0.1500 0.2221 m
0.1600 0.2221 l
s
n
1.1500 0.2221 m
1.1400 0.2221 l
s
n
0.1500 0.2351 m
0.1600 0.2351 l
s
n
1.1500 0.2351 m
1.1400 0.2351 l
s
n
0.1500 0.3201 m
0.1600 0.3201 l
s
n
1.1500 0.3201 m
1.1400 0.3201 l
s
n
0.1500 0.3699 m
0.1600 0.3699 l
s
n
1.1500 0.3699 m
1.1400 0.3699 l
s
n
0.1500 0.4052 m
0.1600 0.4052 l
s
n
1.1500 0.4052 m
1.1400 0.4052 l
s
n
0.1500 0.4326 m
0.1600 0.4326 l
s
n
1.1500 0.4326 m
1.1400 0.4326 l
s
n
0.1500 0.4550 m
0.1600 0.4550 l
s
n
1.1500 0.4550 m
1.1400 0.4550 l
s
n
0.1500 0.4739 m
0.1600 0.4739 l
s
n
1.1500 0.4739 m
1.1400 0.4739 l
s
n
0.1500 0.4903 m
0.1600 0.4903 l
s
n
1.1500 0.4903 m
1.1400 0.4903 l
s
n
0.1500 0.5047 m
0.1600 0.5047 l
s
n
1.1500 0.5047 m
1.1400 0.5047 l
s
n
0.1500 0.5177 m
0.1600 0.5177 l
s
n
1.1500 0.5177 m
1.1400 0.5177 l
s
n
0.1500 0.6027 m
0.1600 0.6027 l
s
n
1.1500 0.6027 m
1.1400 0.6027 l
s
n
0.1500 0.6525 m
0.1600 0.6525 l
s
n
1.1500 0.6525 m
1.1400 0.6525 l
s
n
0.1500 0.6878 m
0.1600 0.6878 l
s
n
1.1500 0.6878 m
1.1400 0.6878 l
s
n
0.1500 0.7152 m
0.1600 0.7152 l
s
n
1.1500 0.7152 m
1.1400 0.7152 l
s
n
0.1500 0.7375 m
0.1600 0.7375 l
s
n
1.1500 0.7375 m
1.1400 0.7375 l
s
n
0.1500 0.7565 m
0.1600 0.7565 l
s
n
1.1500 0.7565 m
1.1400 0.7565 l
s
n
0.1500 0.7729 m
0.1600 0.7729 l
s
n
1.1500 0.7729 m
1.1400 0.7729 l
s
n
0.1500 0.7873 m
0.1600 0.7873 l
s
n
1.1500 0.7873 m
1.1400 0.7873 l
s
n
0.1500 0.8002 m
0.1600 0.8002 l
s
n
1.1500 0.8002 m
1.1400 0.8002 l
s
n
0.1500 0.2351 m
0.1700 0.2351 l
s
n
1.1500 0.2351 m
1.1300 0.2351 l
s
n
0.1500 0.5177 m
0.1700 0.5177 l
s
n
1.1500 0.5177 m
1.1300 0.5177 l
s
n
0.1500 0.8002 m
0.1700 0.8002 l
s
n
1.1500 0.8002 m
1.1300 0.8002 l
s
/Font0 FFSF
0.0749 0.2251 m
GS
[0.0294 0.0000 0.0000 0.0294 0 0] CC
(1e-05) show
GR
/Font0 FFSF
0.0620 0.5078 m
GS
[0.0294 0.0000 0.0000 0.0294 0 0] CC
(0.0001) show
GR
/Font0 FFSF
0.0769 0.7904 m
GS
[0.0294 0.0000 0.0000 0.0294 0 0] CC
(0.001) show
GR
/Font0 FFSF
0.0382 0.3794 m
GS
[0.0000 0.0344 -0.0344 0.0000 0 0] CC
(d) show
GR
/Symbol findfont
/Font12 exch definefont pop
/Font12 FFSF
0.0382 0.3967 m
GS
[0.0000 0.0344 -0.0344 0.0000 0 0] CC
(s) show
GR
/Font0 FFSF
0.0382 0.4175 m
GS
[0.0000 0.0344 -0.0344 0.0000 0 0] CC
(/dp) show
GR
/Font0 FFSF
0.0520 0.4614 m
GS
[0.0000 0.0244 -0.0244 0.0000 0 0] CC
(T) show
GR
/Font0 FFSF
0.0175 0.4763 m
GS
[0.0000 0.0244 -0.0244 0.0000 0 0] CC
(t) show
GR
/Font0 FFSF
0.0382 0.4829 m
GS
[0.0000 0.0344 -0.0344 0.0000 0 0] CC
( [pb/GeV]) show
GR
/Font0 FFSF
1.1892 0.5498 m
GS
[0.0000 0.0280 -0.0280 0.0000 0 0] CC
(LHC HIGSS XS WG 2011) show
GR
n
0.1500 0.1500 m
0.1500 0.8500 l
1.1500 0.8500 l
1.1500 0.1500 l
0.1500 0.1500 l
c
s
n
0.7875 0.7803 m
0.7875 0.6697 l
1.0847 0.6697 l
1.0847 0.7803 l
c
[/DeviceRGB] SCS
Color0 SC
fill
[/DeviceRGB] SCS
Color1 SC
[] 0 SD
0.0015 SLW
n
0.7875 0.7803 m
0.7875 0.6697 l
1.0847 0.6697 l
1.0847 0.7803 l
0.7875 0.7803 l
c
s
/Font0 FFSF
0.8590 0.7472 m
GS
[0.0339 0.0000 0.0000 0.0339 0 0] CC
(central value) show
GR
[] 0 SD
0.0030 SLW
n
0.7990 0.7585 m
0.8390 0.7585 l
s
/Font0 FFSF
0.8590 0.7136 m
GS
[0.0339 0.0000 0.0000 0.0339 0 0] CC
(error from scale) show
GR
[/DeviceRGB] SCS
Color2 SC
n
0.7990 0.7250 m
0.8390 0.7250 l
s
/Font0 FFSF
[/DeviceRGB] SCS
Color1 SC
0.8590 0.6801 m
GS
[0.0339 0.0000 0.0000 0.0339 0 0] CC
(total error) show
GR
[/DeviceRGB] SCS
Color4 SC
n
0.7990 0.6915 m
0.8390 0.6915 l
s
/Font0 FFSF
[/DeviceRGB] SCS
Color1 SC
0.2904 0.3100 m
GS
[0.0353 0.0000 0.0000 0.0353 0 0] CC
(LHC at 7 TeV) show
GR
%%Trailer
%%BoundingBox: 1 34 730 523
%%DocumentNeededResources: font Times-Roman
%%+ font Symbol
%%EOF
