%!PS-Adobe-2.0 EPSF-2.0
%%BoundingBox:  0 0 567 488
%%Title: Results/m120-600-mjjmaxpt-mstw2008.eps: VBF - HAWK
%%Creator: ROOT Version 5.28/00c
%%CreationDate: Fri Nov 25 16:07:18 2011
%%EndComments
%%BeginProlog
80 dict begin
/s {stroke} def /l {lineto} def /m {moveto} def /t {translate} def
/r {rotate} def /rl {roll}  def /R {repeat} def
/d {rlineto} def /rm {rmoveto} def /gr {grestore} def /f {eofill} def
/c {setrgbcolor} def /black {0 setgray} def /sd {setdash} def
/cl {closepath} def /sf {scalefont setfont} def /lw {setlinewidth} def
/box {m dup 0 exch d exch 0 d 0 exch neg d cl} def
/NC{systemdict begin initclip end}def/C{NC box clip newpath}def
/bl {box s} def /bf {box f} def /Y { 0 exch d} def /X { 0 d} def 
/K {{pop pop 0 moveto} exch kshow} bind def
/ita {/ang 15 def gsave [1 0 ang dup sin exch cos div 1 0 0] concat} def 
/mp {newpath /y exch def /x exch def} def
/side {[w .77 mul w .23 mul] .385 w mul sd w 0 l currentpoint t -144 r} def
/mr {mp x y w2 0 360 arc} def /m24 {mr s} def /m20 {mr f} def
/mb {mp x y w2 add m w2 neg 0 d 0 w neg d w 0 d 0 w d cl} def
/mt {mp x y w2 add m w2 neg w neg d w 0 d cl} def
/m21 {mb f} def /m25 {mb s} def /m22 {mt f} def /m26{mt s} def
/m23 {mp x y w2 sub m w2 w d w neg 0 d cl f} def
/m27 {mp x y w2 add m w3 neg w2 neg d w3 w2 neg d w3 w2 d cl s} def
/m28 {mp x w2 sub y w2 sub w3 add m w3 0 d  0 w3 neg d w3 0 d 0 w3 d w3 0 d  0 w3 d w3 neg 0 d 0 w3 d w3 neg 0 d 0 w3 neg d w3 neg 0 d cl s } def
/m29 {mp gsave x w2 sub y w2 add w3 sub m currentpoint t 4 {side} repeat cl fill gr} def
/m30 {mp gsave x w2 sub y w2 add w3 sub m currentpoint t 4 {side} repeat cl s gr} def
/m31 {mp x y w2 sub m 0 w d x w2 sub y m w 0 d x w2 sub y w2 add m w w neg d x w2 sub y w2 sub m w w d s} def
/m32 {mp x y w2 sub m w2 w d w neg 0 d cl s} def
/m33 {mp x y w2 add m w3 neg w2 neg d w3 w2 neg d w3 w2 d cl f} def
/m34 {mp x w2 sub y w2 sub w3 add m w3 0 d  0 w3 neg d w3 0 d 0 w3 d w3 0 d  0 w3 d w3 neg 0 d 0 w3 d w3 neg 0 d 0 w3 neg d w3 neg 0 d cl f } def
/m2 {mp x y w2 sub m 0 w d x w2 sub y m w 0 d s} def
/m5 {mp x w2 sub y w2 sub m w w d x w2 sub y w2 add m w w neg d s} def
/reEncode {exch findfont dup length dict begin {1 index /FID eq  {pop pop} {def} ifelse } forall /Encoding exch def currentdict end dup /FontName get exch definefont pop } def [/Times-Bold /Times-Italic /Times-BoldItalic /Helvetica /Helvetica-Oblique
 /Helvetica-Bold /Helvetica-BoldOblique /Courier /Courier-Oblique /Courier-Bold /Courier-BoldOblique /Times-Roman /AvantGarde-Book /AvantGarde-BookOblique /AvantGarde-Demi /AvantGarde-DemiOblique /Bookman-Demi /Bookman-DemiItalic /Bookman-Light
 /Bookman-LightItalic /Helvetica-Narrow /Helvetica-Narrow-Bold /Helvetica-Narrow-BoldOblique /Helvetica-Narrow-Oblique /NewCenturySchlbk-Roman /NewCenturySchlbk-Bold /NewCenturySchlbk-BoldItalic /NewCenturySchlbk-Italic /Palatino-Bold
 /Palatino-BoldItalic /Palatino-Italic /Palatino-Roman ] {ISOLatin1Encoding reEncode } forall%%EndProlog
%%BeginSetup
%%EndSetup
newpath  gsave  .25 .25 scale  gsave  0 0 t black[  ] 0 sd 3 lw 1 1 1 c 2268 1954 0 0 bf black 1 1 1 c 2177 1329 45 586 bf black 1 1 1 c 1677 1063 328 719 bf black 1677 1063 328 719 bl 1 1 1 c 1677 1063 328 719 bf black 1677 1063 328 719 bl 0.8 0 0
 c[  12 12 ] 0 sd 6 lw 1 1 1 c black 0.8 0 0 c 328 1682 m 105 X -39 Y 105 X -47 Y 105 X -48 Y 104 X -53 Y 105 X -48 Y 105 X -56 Y 105 X -68 Y 105 X -35 Y 104 X -80 Y 105 X -52 Y 105 X -86 Y 105 X -8 Y 104 X -107 Y 105 X -68 Y 105 X -60 Y 105 X s
 black[  ] 0 sd 3 lw 328 719 m 1677 X s
 gsave  2177 1329 45 586 C 1834.93 615.017 t 0 r /Helvetica findfont 60.8537 sf 0 0 m ( [GeV]) show NC gr 
 gsave  2177 1329 45 586 C 1814.68 597.3 t 0 r /Helvetica findfont 40.5691 sf 0 0 m (jj) show NC gr 
 gsave  2177 1329 45 586 C 1766.59 615.017 t 0 r /Helvetica findfont 60.8537 sf 0 0 m (m) show NC gr  608 750 m -31 Y s 678 734 m -15 Y s 747 734 m -15 Y s 817 734 m -15 Y s 887 734 m -15 Y s 957 750 m -31 Y s 1027 734 m -15 Y s 1097 734 m -15 Y s
 1167 734 m -15 Y s 1236 734 m -15 Y s 1306 750 m -31 Y s 1376 734 m -15 Y s 1446 734 m -15 Y s 1516 734 m -15 Y s 1586 734 m -15 Y s 1655 750 m -31 Y s 1725 734 m -15 Y s 1795 734 m -15 Y s 1865 734 m -15 Y s 1935 734 m -15 Y s 2005 750 m -31 Y s
 608 750 m -31 Y s 538 734 m -15 Y s 468 734 m -15 Y s 398 734 m -15 Y s 328 734 m -15 Y s
 gsave  2177 1329 45 586 C 556.805 675.759 t 0 r /Helvetica findfont 45.6403 sf 0 0 m (1000) show NC gr 
 gsave  2177 1329 45 586 C 906.074 675.759 t 0 r /Helvetica findfont 45.6403 sf 0 0 m (1500) show NC gr 
 gsave  2177 1329 45 586 C 1255.34 675.759 t 0 r /Helvetica findfont 45.6403 sf 0 0 m (2000) show NC gr 
 gsave  2177 1329 45 586 C 1604.61 675.759 t 0 r /Helvetica findfont 45.6403 sf 0 0 m (2500) show NC gr 
 gsave  2177 1329 45 586 C 1953.88 675.759 t 0 r /Helvetica findfont 45.6403 sf 0 0 m (3000) show NC gr  328 719 m 1063 Y s
 gsave  2177 1329 45 586 C 217.66 1546.4 t 90 r /Helvetica findfont 60.8537 sf 0 0 m ( [fb/GeV]) show NC gr 
 gsave  2177 1329 45 586 C 240.439 1526.15 t 90 r /Helvetica findfont 40.5691 sf 0 0 m (jj) show NC gr 
 gsave  2177 1329 45 586 C 217.66 1427.45 t 90 r /Helvetica findfont 60.8537 sf 0 0 m (/dm) show NC gr 
 gsave  2177 1329 45 586 C 217.66 1389.48 t 90 r /Symbol findfont 60.8537 sf 0 0 m (s) show NC gr 
 gsave  2177 1329 45 586 C 217.66 1359.11 t 90 r /Helvetica findfont 60.8537 sf 0 0 m (d) show NC gr  354 823 m -26 X s 354 886 m -26 X s 354 931 m -26 X s 354 966 m -26 X s 354 994 m -26 X s 354 1018 m -26 X s 354 1039 m -26 X s 354 1057 m -26 X s
 381 1074 m -53 X s
 gsave  2177 1329 45 586 C 280.934 1073.12 t 0 r /Helvetica findfont 30.4268 sf 0 0 m (\2552) show NC gr 
 gsave  2177 1329 45 586 C 230.315 1055.4 t 0 r /Helvetica findfont 45.6403 sf 0 0 m (10) show NC gr  354 1182 m -26 X s 354 1245 m -26 X s 354 1289 m -26 X s 354 1324 m -26 X s 354 1353 m -26 X s 354 1377 m -26 X s 354 1397 m -26 X s 354 1416 m -26
 X s 381 1432 m -53 X s
 gsave  2177 1329 45 586 C 285.996 1429.98 t 0 r /Helvetica findfont 30.4268 sf 0 0 m (\2551) show NC gr 
 gsave  2177 1329 45 586 C 235.377 1412.26 t 0 r /Helvetica findfont 45.6403 sf 0 0 m (10) show NC gr  354 1540 m -26 X s 354 1603 m -26 X s 354 1648 m -26 X s 354 1683 m -26 X s 354 1711 m -26 X s 354 1735 m -26 X s 354 1756 m -26 X s 354 1774 m -26
 X s 0.4 0.4 0.8 c 6 lw 1 1 1 c black 0.4 0.4 0.8 c 328 1671 m 105 X -38 Y 105 X -51 Y 105 X -49 Y 104 X -51 Y 105 X -54 Y 105 X -57 Y 105 X -57 Y 105 X -48 Y 104 X -73 Y 105 X -58 Y 105 X -48 Y 105 X -73 Y 104 X -56 Y 105 X -73 Y 105 X -78 Y 105 X s
 0 0.8 0 c[ 20 12 4 12] 0 sd 1 1 1 c black 0 0.8 0 c 328 1682 m 105 X -37 Y 105 X -50 Y 105 X -48 Y 104 X -50 Y 105 X -53 Y 105 X -59 Y 105 X -53 Y 105 X -48 Y 104 X -73 Y 105 X -55 Y 105 X -56 Y 105 X -64 Y 104 X -61 Y 105 X -74 Y 105 X -74 Y 105 X
 s 0.2 0 0.4 c[ 20 20] 0 sd 1 1 1 c black 0.2 0 0.4 c 328 1665 m 105 X -37 Y 105 X -48 Y 105 X -46 Y 104 X -57 Y 105 X -53 Y 105 X -57 Y 105 X -56 Y 105 X -54 Y 104 X -61 Y 105 X -66 Y 105 X -56 Y 105 X -68 Y 104 X -66 Y 105 X -71 Y 105 X -67 Y 105 X
 s 0.8 0 0 c[  12 12 ] 0 sd 1 1 1 c black 0.8 0 0 c 328 1216 m 105 X -7 Y 105 X -24 Y 105 X -32 Y 104 X -38 Y 105 X -39 Y 105 X -52 Y 105 X -42 Y 105 X -59 Y 104 X -62 Y 105 X -41 Y 105 X -72 Y 105 X -29 Y 419 X s 0.4 0.4 0.8 c[  ] 0 sd 1 1 1 c black
 0.4 0.4 0.8 c 328 1264 m 105 X -8 Y 105 X -30 Y 105 X -41 Y 104 X -33 Y 105 X -46 Y 105 X -45 Y 105 X -57 Y 105 X -58 Y 104 X -44 Y 105 X -74 Y 105 X -48 Y 105 X -61 Y 419 X s 0 0.8 0 c[ 20 12 4 12] 0 sd 1 1 1 c black 0 0.8 0 c 328 1261 m 105 X -10
 Y 105 X -30 Y 105 X -40 Y 104 X -33 Y 105 X -44 Y 105 X -44 Y 105 X -56 Y 105 X -58 Y 104 X -44 Y 105 X -73 Y 105 X -49 Y 105 X -61 Y 419 X s 0.2 0 0.4 c[ 20 20] 0 sd 1 1 1 c black 0.2 0 0.4 c 328 1223 m 105 X -2 Y 105 X -23 Y 105 X -34 Y 104 X -39
 Y 105 X -42 Y 105 X -49 Y 105 X -52 Y 105 X -49 Y 104 X -58 Y 105 X -60 Y 105 X -62 Y 105 X -34 Y 419 X s black
 gsave  2177 1329 45 586 C 2057.65 1338.86 t 90 r /Helvetica-BoldOblique findfont 38.0336 sf 0 0 m 
 410 392 371 351 340 311 276 266 241 216 206 181 152 123 113 86 76 49 22
(LHC HIGGS XS WG 2011) K NC gr 
 gsave  2177 1329 45 586 C 1650.17 1705.85 t 0 r /Helvetica findfont 30.4268 sf 0 0 m 
 239 229 212 191 183 154 135 126 118 97 88 69 41 22
(HAWK w/ EW Corr) K NC gr  0.4 0.4 0.8 c[  ] 0 sd 1544 1717 m 88 X s black
 gsave  2177 1329 45 586 C 1650.17 1629.92 t 0 r /Helvetica findfont 30.4268 sf 0 0 m (POWHEG) show NC gr  0.8 0 0 c[  12 12 ] 0 sd 1544 1641 m 88 X s black
 gsave  2177 1329 45 586 C 1650.17 1553.99 t 0 r /Helvetica findfont 30.4268 sf 0 0 m 
 255 245 228 207 199 170 151 142 126 118 96 88 68 40 21
(HAWK w/o EW Corr) K NC gr  0 0.8 0 c[ 20 12 4 12] 0 sd 1544 1564 m 88 X s black
 gsave  2177 1329 45 586 C 1650.17 1475.53 t 0 r /Helvetica findfont 30.4268 sf 0 0 m (VBFNLO w/ EW Corr) show NC gr  0.2 0 0.4 c[ 20 20] 0 sd 1544 1488 m 88 X s black[  ] 0 sd 3 lw 1 1 1 c black 1 1 1 c 1677 300 328 231 bf black 1677 300 328 231 bl
 1 1 1 c 1677 300 328 231 bf black 1677 300 328 231 bl 328 231 m 1677 X s
 gsave  2177 547 45 39 C 1834.93 126.547 t 0 r /Helvetica findfont 60.7874 sf 0 0 m ( [GeV]) show NC gr 
 gsave  2177 547 45 39 C 1814.68 108.83 t 0 r /Helvetica findfont 40.5249 sf 0 0 m (jj) show NC gr 
 gsave  2177 547 45 39 C 1766.59 126.547 t 0 r /Helvetica findfont 60.7874 sf 0 0 m (m) show NC gr  608 243 m -12 Y s 678 237 m -6 Y s 747 237 m -6 Y s 817 237 m -6 Y s 887 237 m -6 Y s 957 243 m -12 Y s 1027 237 m -6 Y s 1097 237 m -6 Y s 1167 237 m
 -6 Y s 1236 237 m -6 Y s 1306 243 m -12 Y s 1376 237 m -6 Y s 1446 237 m -6 Y s 1516 237 m -6 Y s 1586 237 m -6 Y s 1655 243 m -12 Y s 1725 237 m -6 Y s 1795 237 m -6 Y s 1865 237 m -6 Y s 1935 237 m -6 Y s 2005 243 m -12 Y s 608 243 m -12 Y s 538
 237 m -6 Y s 468 237 m -6 Y s 398 237 m -6 Y s 328 237 m -6 Y s
 gsave  2177 547 45 39 C 556.805 189.82 t 0 r /Helvetica findfont 45.5906 sf 0 0 m (1000) show NC gr 
 gsave  2177 547 45 39 C 906.074 189.82 t 0 r /Helvetica findfont 45.5906 sf 0 0 m (1500) show NC gr 
 gsave  2177 547 45 39 C 1255.34 189.82 t 0 r /Helvetica findfont 45.5906 sf 0 0 m (2000) show NC gr 
 gsave  2177 547 45 39 C 1604.61 189.82 t 0 r /Helvetica findfont 45.5906 sf 0 0 m (2500) show NC gr 
 gsave  2177 547 45 39 C 1953.88 189.82 t 0 r /Helvetica findfont 45.5906 sf 0 0 m (3000) show NC gr  328 231 m 300 Y s
 gsave  2177 547 45 39 C 222.722 430.259 t 90 r /Helvetica findfont 60.7874 sf 0 0 m ( [%]) show NC gr 
 gsave  2177 547 45 39 C 245.501 364.454 t 90 r /Helvetica findfont 40.5249 sf 0 0 m (EW) show NC gr 
 gsave  2177 547 45 39 C 222.722 334.083 t 90 r /Symbol findfont 60.7874 sf 0 0 m (d) show NC gr  364 313 m -36 X s 346 340 m -18 X s 346 367 m -18 X s 346 395 m -18 X s 346 422 m -18 X s 364 449 m -36 X s 364 313 m -36 X s 346 285 m -18 X s 346 258
 m -18 X s 346 231 m -18 X s 364 449 m -36 X s 346 477 m -18 X s 346 504 m -18 X s 346 531 m -18 X s
 gsave  2177 547 45 39 C 250.562 296.119 t 0 r /Helvetica findfont 45.5906 sf 0 0 m (\25510) show NC gr 
 gsave  2177 547 45 39 C 291.057 432.79 t 0 r /Helvetica findfont 45.5906 sf 0 0 m (0) show NC gr  381 360 m -53 X s 328 355 m 10 Y s 381 360 m 52 X s 433 355 m 10 Y s 381 360 m 1 Y s 376 361 m 10 X s 381 360 m -1 Y s 376 359 m 10 X s 486 348 m -53 X
 s 433 343 m 11 Y s 486 348 m 52 X s 538 343 m 11 Y s 486 348 m 2 Y s 480 350 m 11 X s 486 348 m -1 Y s 480 347 m 11 X s 590 339 m -52 X s 538 334 m 10 Y s 590 339 m 53 X s 643 334 m 10 Y s 590 339 m 2 Y s 585 341 m 10 X s 590 339 m -1 Y s 585 338 m
 10 X s 695 332 m -52 X s 643 327 m 10 Y s 695 332 m 52 X s 747 327 m 10 Y s 695 332 m 2 Y s 690 334 m 10 X s 695 332 m -2 Y s 690 330 m 10 X s 800 328 m -53 X s 747 323 m 10 Y s 800 328 m 52 X s 852 323 m 10 Y s 800 328 m 2 Y s 795 330 m 10 X s 800
 328 m -3 Y s 795 325 m 10 X s 905 322 m -53 X s 852 317 m 10 Y s 905 322 m 52 X s 957 317 m 10 Y s 905 322 m 3 Y s 900 325 m 10 X s 905 322 m -3 Y s 900 319 m 10 X s 1009 315 m -52 X s 957 310 m 10 Y s 1009 315 m 53 X s 1062 310 m 10 Y s 1009 315 m
 4 Y s 1004 319 m 10 X s 1009 315 m -4 Y s 1004 311 m 10 X s 1114 313 m -52 X s 1062 308 m 10 Y s 1114 313 m 53 X s 1167 308 m 10 Y s 1114 313 m 4 Y s 1109 317 m 10 X s 1114 313 m -5 Y s 1109 308 m 10 X s 1219 310 m -52 X s 1167 305 m 10 Y s 1219 310
 m 52 X s 1271 305 m 10 Y s 1219 310 m 6 Y s 1214 316 m 10 X s 1219 310 m -6 Y s 1214 304 m 10 X s 1324 302 m -53 X s 1271 297 m 10 Y s 1324 302 m 52 X s 1376 297 m 10 Y s 1324 302 m 8 Y s 1319 310 m 10 X s 1324 302 m -7 Y s 1319 295 m 10 X s 1428
 300 m -52 X s 1376 294 m 11 Y s 1428 300 m 53 X s 1481 294 m 11 Y s 1428 300 m 8 Y s 1423 308 m 10 X s 1428 300 m -9 Y s 1423 291 m 10 X s 1533 304 m -52 X s 1481 298 m 11 Y s 1533 304 m 53 X s 1586 298 m 11 Y s 1533 304 m 11 Y s 1528 315 m 10 X s
 1533 304 m -11 Y s 1528 293 m 10 X s 1638 294 m -52 X s 1586 289 m 10 Y s 1638 294 m 52 X s 1690 289 m 10 Y s 1638 294 m 13 Y s 1633 307 m 10 X s 1638 294 m -13 Y s 1633 281 m 10 X s 1743 295 m -53 X s 1690 290 m 10 Y s 1743 295 m 52 X s 1795 290 m
 10 Y s 1743 295 m 14 Y s 1738 309 m 10 X s 1743 295 m -14 Y s 1738 281 m 10 X s 1848 311 m -53 X s 1795 306 m 10 Y s 1848 311 m 52 X s 1900 306 m 10 Y s 1848 311 m 14 Y s 1842 325 m 11 X s 1848 311 m -14 Y s 1842 297 m 11 X s 1952 277 m -52 X s 1900
 272 m 10 Y s 1952 277 m 53 X s 2005 272 m 10 Y s 1952 277 m 24 Y s 1947 301 m 10 X s 1952 277 m -24 Y s 1947 253 m 10 X s 0.4 0.4 0.4 c black /w 4 def /w2 {w 2 div} def /w3 {w 3 div} def 381 360 486 348 590 339 695 332 800 328 905 322 1009 315 1114
 313 1219 310 1324 302 1428 300 1533 304 1638 294 1743 295 1848 311 1952 277 16 { m21} R 0.4 0.4 0.4 c black 0.4 0.4 0.4 c
 gsave  2177 547 45 39 C 450.506 301.181 t 0 r /Helvetica findfont 40.5249 sf 0 0 m ( = 120 GeV) show NC gr  black 0.4 0.4 0.4 c
 gsave  2177 547 45 39 C 430.259 291.057 t 0 r /Helvetica findfont 27.8609 sf 0 0 m (H) show NC gr  black 0.4 0.4 0.4 c
 gsave  2177 547 45 39 C 397.357 301.181 t 0 r /Helvetica findfont 40.5249 sf 0 0 m (M) show NC gr  0.6 0 0 c 381 499 m -53 X s 328 494 m 10 Y s 381 499 m 52 X s 433 494 m 10 Y s 381 499 m 3 Y s 376 502 m 10 X s 381 499 m -3 Y s 376 496 m 10 X s 486
 495 m -53 X s 433 490 m 10 Y s 486 495 m 52 X s 538 490 m 10 Y s 486 495 m 2 Y s 480 497 m 11 X s 486 495 m -3 Y s 480 492 m 11 X s 590 487 m -52 X s 538 482 m 10 Y s 590 487 m 53 X s 643 482 m 10 Y s 590 487 m 1 Y s 585 488 m 10 X s 590 487 m -2 Y
 s 585 485 m 10 X s 695 485 m -52 X s 643 480 m 10 Y s 695 485 m 52 X s 747 480 m 10 Y s 695 485 m 2 Y s 690 487 m 10 X s 695 485 m -2 Y s 690 483 m 10 X s 800 475 m -53 X s 747 470 m 10 Y s 800 475 m 52 X s 852 470 m 10 Y s 800 475 m 2 Y s 795 477 m
 10 X s 800 475 m -2 Y s 795 473 m 10 X s 905 468 m -53 X s 852 463 m 10 Y s 905 468 m 52 X s 957 463 m 10 Y s 905 468 m 2 Y s 900 470 m 10 X s 905 468 m -2 Y s 900 466 m 10 X s 1009 458 m -52 X s 957 453 m 10 Y s 1009 458 m 53 X s 1062 453 m 10 Y s
 1009 458 m 2 Y s 1004 460 m 10 X s 1009 458 m -2 Y s 1004 456 m 10 X s 1114 454 m -52 X s 1062 449 m 10 Y s 1114 454 m 53 X s 1167 449 m 10 Y s 1114 454 m 2 Y s 1109 456 m 10 X s 1114 454 m -3 Y s 1109 451 m 10 X s 1219 445 m -52 X s 1167 440 m 10 Y
 s 1219 445 m 52 X s 1271 440 m 10 Y s 1219 445 m 3 Y s 1214 448 m 10 X s 1219 445 m -3 Y s 1214 442 m 10 X s 1324 444 m -53 X s 1271 439 m 10 Y s 1324 444 m 52 X s 1376 439 m 10 Y s 1324 444 m 3 Y s 1319 447 m 10 X s 1324 444 m -3 Y s 1319 441 m 10
 X s 1428 437 m -52 X s 1376 432 m 10 Y s 1428 437 m 53 X s 1481 432 m 10 Y s 1428 437 m 3 Y s 1423 440 m 10 X s 1428 437 m -4 Y s 1423 433 m 10 X s 1533 436 m -52 X s 1481 430 m 11 Y s 1533 436 m 53 X s 1586 430 m 11 Y s 1533 436 m 3 Y s 1528 439 m
 10 X s 1533 436 m -4 Y s 1528 432 m 10 X s 1638 435 m -52 X s 1586 430 m 10 Y s 1638 435 m 52 X s 1690 430 m 10 Y s 1638 435 m 6 Y s 1633 441 m 10 X s 1638 435 m -6 Y s 1633 429 m 10 X s 1743 425 m -53 X s 1690 420 m 10 Y s 1743 425 m 52 X s 1795
 420 m 10 Y s 1743 425 m 6 Y s 1738 431 m 10 X s 1743 425 m -6 Y s 1738 419 m 10 X s 1848 421 m -53 X s 1795 416 m 10 Y s 1848 421 m 52 X s 1900 416 m 10 Y s 1848 421 m 8 Y s 1842 429 m 11 X s 1848 421 m -9 Y s 1842 412 m 11 X s 1952 412 m -52 X s
 1900 407 m 10 Y s 1952 412 m 53 X s 2005 407 m 10 Y s 1952 412 m 7 Y s 1947 419 m 10 X s 1952 412 m -7 Y s 1947 405 m 10 X s black 381 499 486 495 590 487 695 485 800 475 905 468 1009 458 1114 454 1219 445 1324 444 1428 437 1533 436 1638 435 1743
 425 1848 421 1952 412 16 { m22} R 0.6 0 0 c black 0.6 0 0 c
 gsave  2177 547 45 39 C 450.506 437.852 t 0 r /Helvetica findfont 40.5249 sf 0 0 m ( = 600 GeV) show NC gr  black 0.6 0 0 c
 gsave  2177 547 45 39 C 430.259 427.728 t 0 r /Helvetica findfont 27.8609 sf 0 0 m (H) show NC gr  black 0.6 0 0 c
 gsave  2177 547 45 39 C 397.357 437.852 t 0 r /Helvetica findfont 40.5249 sf 0 0 m (M) show NC gr 
 gr  gr showpage
end
%%EOF
