%!PS-Adobe-3.0 EPSF-3.0
%%BoundingBox: (atend)
%%LanguageLevel: 2
%%Creator: Grace-5.1.22
%%CreationDate: Mon Dec 19 07:22:09 2011
%%DocumentData: Clean8Bit
%%Orientation: Portrait
%%Title: dsdpt_t_perc_err_band.agr
%%For: laura
%%DocumentNeededResources: (atend)
%%EndComments
%%BeginProlog
/m {moveto} def
/l {lineto} def
/s {stroke} def
/n {newpath} def
/c {closepath} def
/RL {rlineto} def
/SLW {setlinewidth} def
/GS {gsave} def
/GR {grestore} def
/SC {setcolor} def
/SGRY {setgray} def
/SRGB {setrgbcolor} def
/SD {setdash} def
/SLC {setlinecap} def
/SLJ {setlinejoin} def
/SCS {setcolorspace} def
/FFSF {findfont setfont} def
/CC {concat} def
/PXL {n m 0 0 RL s} def
/Color0 {1.0000 1.0000 1.0000} def
/Color1 {0.0000 0.0000 0.0000} def
/Color2 {1.0000 0.0000 0.0000} def
/Color3 {0.0000 1.0000 0.0000} def
/Color4 {0.0000 0.0000 1.0000} def
/Color5 {1.0000 1.0000 0.0000} def
/Color6 {0.7373 0.5608 0.5608} def
/Color7 {0.8627 0.8627 0.8627} def
/Color8 {0.5804 0.0000 0.8275} def
/Color9 {0.0000 1.0000 1.0000} def
/Color10 {1.0000 0.0000 1.0000} def
/Color11 {1.0000 0.6471 0.0000} def
/Color12 {0.4471 0.1294 0.7373} def
/Color13 {0.4039 0.0275 0.2824} def
/Color14 {0.2510 0.8784 0.8157} def
/Color15 {0.0000 0.5451 0.0000} def
/Color16 {0.7529 0.7529 0.7529} def
/Color17 {0.5059 0.5059 0.5059} def
/Color18 {0.2588 0.2588 0.2588} def
/PTRN {
 /pat_bits exch def 
 <<
  /PaintType 2
  /PatternType 1 /TilingType 1
  /BBox[0 0 16 16]
  /XStep 16 /YStep 16
  /PaintProc {
   pop
   16 16 true [-1 0 0 -1 16 16] pat_bits imagemask
  }
 >>
 [0.0016 0 0 0.0016 0 0]
 makepattern
} def
/Pattern0 {<0000000000000000000000000000000000000000000000000000000000000000> PTRN} bind def
/Pattern1 {<ffffffffffffffffffffffffffffffffffffffffffffffffffffffffffffffff> PTRN} bind def
/Pattern2 {<eeeeffffbbbbffffeeeeffffbbbbffffeeeeffffbbbbffffeeeeffffbbbbffff> PTRN} bind def
/Pattern3 {<eeeebbbbeeeebbbbeeeebbbbeeeebbbbeeeebbbbeeeebbbbeeeebbbbeeeebbbb> PTRN} bind def
/Pattern4 {<5555aaaa5555aaaa5555aaaa5555aaaa5555aaaa5555aaaa5555aaaa5555aaaa> PTRN} bind def
/Pattern5 {<1111444411114444111144441111444411114444111144441111444411114444> PTRN} bind def
/Pattern6 {<1111000044440000111100004444000011110000444400001111000044440000> PTRN} bind def
/Pattern7 {<1010000000000000010100000000000010100000000000000101000000000000> PTRN} bind def
/Pattern8 {<0000000000000000000000000000000000000000000000000000000000000000> PTRN} bind def
/Pattern9 {<1e1e0f0f8787c3c3e1e1f0f078783c3c1e1e0f0f8787c3c3e1e1f0f078783c3c> PTRN} bind def
/Pattern10 {<7878f0f0e1e1c3c387870f0f1e1e3c3c7878f0f0e1e1c3c387870f0f1e1e3c3c> PTRN} bind def
/Pattern11 {<3333333333333333333333333333333333333333333333333333333333333333> PTRN} bind def
/Pattern12 {<ffffffff00000000ffffffff00000000ffffffff00000000ffffffff00000000> PTRN} bind def
/Pattern13 {<8181424224241818181824244242818181814242242418181818242442428181> PTRN} bind def
/Pattern14 {<8080404020201010080804040202010180804040202010100808040402020101> PTRN} bind def
/Pattern15 {<0101020204040808101020204040808001010202040408081010202040408080> PTRN} bind def
/Pattern16 {<2222222222222222222222222222222222222222222222222222222222222222> PTRN} bind def
/Pattern17 {<0000ffff000000000000ffff000000000000ffff000000000000ffff00000000> PTRN} bind def
/Pattern18 {<2222ffff222222222222ffff222222222222ffff222222222222ffff22222222> PTRN} bind def
/Pattern19 {<ffffffff33333333ffffffff33333333ffffffff33333333ffffffff33333333> PTRN} bind def
/Pattern20 {<0f0f0f0f0f0f0f0ff0f0f0f0f0f0f0f00f0f0f0f0f0f0f0ff0f0f0f0f0f0f0f0> PTRN} bind def
/Pattern21 {<ff00ff00ff00ff00ff00ff00ff00ff0000ff00ff00ff00ff00ff00ff00ff00ff> PTRN} bind def
/Pattern22 {<8001800180018001800180018001ffffffff8001800180018001800180018001> PTRN} bind def
/Pattern23 {<c003c003c003c003c003c003ffffffffffffffffc003c003c003c003c003c003> PTRN} bind def
/Pattern24 {<040404040404ffff404040404040ffff040404040404ffff404040404040ffff> PTRN} bind def
/Pattern25 {<180018001800180018001800ffffffff001800180018001800180018ffffffff> PTRN} bind def
/Pattern26 {<1111b8b87c7c3a3a1111a3a3c7c78b8b1111b8b87c7c3a3a1111a3a3c7c78b8b> PTRN} bind def
/Pattern27 {<101010102828c7c70101010182827c7c101010102828c7c70101010182827c7c> PTRN} bind def
/Pattern28 {<1c1c121211112121c1c12121111112121c1c121211112121c1c1212111111212> PTRN} bind def
/Pattern29 {<3e3e414180808080e3e31414080808083e3e414180808080e3e3141408080808> PTRN} bind def
/Pattern30 {<4848888884848383848488884848383848488888848483838484888848483838> PTRN} bind def
/Pattern31 {<03030404080808080c0c12122121c0c003030404080808080c0c12122121c0c0> PTRN} bind def
/ellipsedict 8 dict def
ellipsedict /mtrx matrix put
/EARC {
 ellipsedict begin
  /endangle exch def
  /startangle exch def
  /yrad exch def
  /xrad exch def
  /y exch def
  /x exch def
  /savematrix mtrx currentmatrix def
  x y translate
  xrad yrad scale
  0 0 1 startangle endangle arc
  savematrix setmatrix
 end
} def
/TL {
  /kcomp exch def
  /linewidth exch def
  /offset exch def
  GS
  0 offset rmoveto
  linewidth SLW
  dup stringwidth exch kcomp add exch RL s
  GR
} def
/KINIT
{
 /kvector exch def
 /kid 0 def
} def
/KPROC
{
 pop pop
 kvector kid get
 0 rmoveto
 /kid 1 kid add def
} def
/DefEncoding [
 /.notdef
 /.notdef
 /.notdef
 /.notdef
 /.notdef
 /.notdef
 /.notdef
 /.notdef
 /.notdef
 /.notdef
 /.notdef
 /.notdef
 /.notdef
 /.notdef
 /.notdef
 /.notdef
 /.notdef
 /.notdef
 /.notdef
 /.notdef
 /.notdef
 /.notdef
 /.notdef
 /.notdef
 /.notdef
 /.notdef
 /.notdef
 /.notdef
 /.notdef
 /.notdef
 /.notdef
 /.notdef
 /space
 /exclam
 /quotedbl
 /numbersign
 /dollar
 /percent
 /ampersand
 /quoteright
 /parenleft
 /parenright
 /asterisk
 /plus
 /comma
 /hyphen
 /period
 /slash
 /zero
 /one
 /two
 /three
 /four
 /five
 /six
 /seven
 /eight
 /nine
 /colon
 /semicolon
 /less
 /equal
 /greater
 /question
 /at
 /A
 /B
 /C
 /D
 /E
 /F
 /G
 /H
 /I
 /J
 /K
 /L
 /M
 /N
 /O
 /P
 /Q
 /R
 /S
 /T
 /U
 /V
 /W
 /X
 /Y
 /Z
 /bracketleft
 /backslash
 /bracketright
 /asciicircum
 /underscore
 /grave
 /a
 /b
 /c
 /d
 /e
 /f
 /g
 /h
 /i
 /j
 /k
 /l
 /m
 /n
 /o
 /p
 /q
 /r
 /s
 /t
 /u
 /v
 /w
 /x
 /y
 /z
 /braceleft
 /bar
 /braceright
 /asciitilde
 /.notdef
 /.notdef
 /.notdef
 /.notdef
 /.notdef
 /.notdef
 /.notdef
 /.notdef
 /.notdef
 /.notdef
 /.notdef
 /.notdef
 /.notdef
 /.notdef
 /.notdef
 /.notdef
 /.notdef
 /.notdef
 /.notdef
 /.notdef
 /.notdef
 /.notdef
 /.notdef
 /.notdef
 /.notdef
 /.notdef
 /.notdef
 /.notdef
 /.notdef
 /.notdef
 /.notdef
 /.notdef
 /.notdef
 /space
 /exclamdown
 /cent
 /sterling
 /currency
 /yen
 /brokenbar
 /section
 /dieresis
 /copyright
 /ordfeminine
 /guillemotleft
 /logicalnot
 /hyphen
 /registered
 /macron
 /degree
 /plusminus
 /twosuperior
 /threesuperior
 /acute
 /mu
 /paragraph
 /periodcentered
 /cedilla
 /onesuperior
 /ordmasculine
 /guillemotright
 /onequarter
 /onehalf
 /threequarters
 /questiondown
 /Agrave
 /Aacute
 /Acircumflex
 /Atilde
 /Adieresis
 /Aring
 /AE
 /Ccedilla
 /Egrave
 /Eacute
 /Ecircumflex
 /Edieresis
 /Igrave
 /Iacute
 /Icircumflex
 /Idieresis
 /Eth
 /Ntilde
 /Ograve
 /Oacute
 /Ocircumflex
 /Otilde
 /Odieresis
 /multiply
 /Oslash
 /Ugrave
 /Uacute
 /Ucircumflex
 /Udieresis
 /Yacute
 /Thorn
 /germandbls
 /agrave
 /aacute
 /acircumflex
 /atilde
 /adieresis
 /aring
 /ae
 /ccedilla
 /egrave
 /eacute
 /ecircumflex
 /edieresis
 /igrave
 /iacute
 /icircumflex
 /idieresis
 /eth
 /ntilde
 /ograve
 /oacute
 /ocircumflex
 /otilde
 /odieresis
 /divide
 /oslash
 /ugrave
 /uacute
 /ucircumflex
 /udieresis
 /yacute
 /thorn
 /ydieresis
] def
%%EndProlog
%%BeginSetup
%%EndSetup
612.00 612.00 scale
n
0.0000 0.0000 m
0.0000 1.0000 l
1.2941 1.0000 l
1.2941 0.0000 l
c
[/DeviceRGB] SCS
Color0 SC
fill
[/DeviceRGB] SCS
Color2 SC
[] 0 SD
0.0030 SLW
0 SLC
0 SLJ
n
0.1500 0.4844 m
0.1500 0.4884 l
0.1750 0.4884 l
0.1750 0.4829 l
0.2000 0.4829 l
0.2000 0.4851 l
0.2250 0.4851 l
0.2250 0.4875 l
0.2500 0.4875 l
0.2500 0.4774 l
0.2750 0.4774 l
0.2750 0.4823 l
0.3000 0.4823 l
0.3000 0.4799 l
0.3250 0.4799 l
0.3250 0.4851 l
0.3500 0.4851 l
0.3500 0.4869 l
0.3750 0.4869 l
0.3750 0.4823 l
0.4000 0.4823 l
0.4000 0.4794 l
0.4250 0.4794 l
0.4250 0.4773 l
0.4500 0.4773 l
0.4500 0.4856 l
0.4750 0.4856 l
0.4750 0.4905 l
0.5000 0.4905 l
0.5000 0.4868 l
0.5250 0.4868 l
0.5250 0.4757 l
0.5500 0.4757 l
0.5500 0.4944 l
0.5750 0.4944 l
0.5750 0.4798 l
0.6000 0.4798 l
0.6000 0.4859 l
0.6250 0.4859 l
0.6250 0.4861 l
0.6500 0.4861 l
0.6500 0.4890 l
0.6750 0.4890 l
0.6750 0.4726 l
0.7000 0.4726 l
0.7000 0.4906 l
0.7250 0.4906 l
0.7250 0.4840 l
0.7500 0.4840 l
0.7500 0.4836 l
0.7750 0.4836 l
0.7750 0.4842 l
0.8000 0.4842 l
0.8000 0.4961 l
0.8250 0.4961 l
0.8250 0.4796 l
0.8500 0.4796 l
0.8500 0.4769 l
0.8750 0.4769 l
0.8750 0.4613 l
0.9000 0.4613 l
0.9000 0.4695 l
0.9250 0.4695 l
0.9250 0.4899 l
0.9500 0.4899 l
0.9500 0.4578 l
0.9750 0.4578 l
0.9750 0.4805 l
1.0000 0.4805 l
1.0000 0.4811 l
1.0250 0.4811 l
1.0250 0.4662 l
1.0500 0.4662 l
1.0500 0.5073 l
1.0750 0.5073 l
1.0750 0.4663 l
1.1000 0.4663 l
1.1000 0.4457 l
1.1250 0.4457 l
1.1250 0.4704 l
1.1500 0.4704 l
1.1500 0.4743 l
1.1501 0.4743 l
s
n
0.1500 0.5163 m
0.1500 0.5141 l
0.1750 0.5141 l
0.1750 0.5111 l
0.2000 0.5111 l
0.2000 0.5125 l
0.2250 0.5125 l
0.2250 0.5152 l
0.2500 0.5152 l
0.2500 0.5083 l
0.2750 0.5083 l
0.2750 0.5191 l
0.3000 0.5191 l
0.3000 0.5111 l
0.3250 0.5111 l
0.3250 0.5037 l
0.3500 0.5037 l
0.3500 0.5181 l
0.3750 0.5181 l
0.3750 0.5178 l
0.4000 0.5178 l
0.4000 0.5219 l
0.4250 0.5219 l
0.4250 0.5094 l
0.4500 0.5094 l
0.4500 0.5014 l
0.4750 0.5014 l
0.4750 0.5087 l
0.5000 0.5087 l
0.5000 0.5043 l
0.5250 0.5043 l
0.5250 0.5116 l
0.5500 0.5116 l
0.5500 0.5102 l
0.5750 0.5102 l
0.5750 0.5000 l
0.6000 0.5000 l
0.6000 0.5050 l
0.6250 0.5050 l
0.6250 0.5144 l
0.6500 0.5144 l
0.6500 0.5106 l
0.6750 0.5106 l
0.6750 0.4848 l
0.7000 0.4848 l
0.7000 0.5288 l
0.7250 0.5288 l
0.7250 0.5100 l
0.7500 0.5100 l
0.7500 0.4903 l
0.7750 0.4903 l
0.7750 0.5113 l
0.8000 0.5113 l
0.8000 0.5120 l
0.8250 0.5120 l
0.8250 0.4999 l
0.8500 0.4999 l
0.8500 0.5090 l
0.8750 0.5090 l
0.8750 0.4954 l
0.9000 0.4954 l
0.9000 0.4991 l
0.9250 0.4991 l
0.9250 0.5051 l
0.9500 0.5051 l
0.9500 0.4970 l
0.9750 0.4970 l
0.9750 0.5038 l
1.0000 0.5038 l
1.0000 0.5044 l
1.0250 0.5044 l
1.0250 0.5224 l
1.0500 0.5224 l
1.0500 0.5153 l
1.0750 0.5153 l
1.0750 0.4882 l
1.1000 0.4882 l
1.1000 0.4799 l
1.1250 0.4799 l
1.1250 0.5753 l
1.1500 0.5753 l
1.1500 0.5657 l
1.1501 0.5657 l
s
[/DeviceRGB] SCS
Color4 SC
n
0.1500 0.4577 m
0.1500 0.4695 l
0.1750 0.4695 l
0.1750 0.4666 l
0.2000 0.4666 l
0.2000 0.4693 l
0.2250 0.4693 l
0.2250 0.4667 l
0.2500 0.4667 l
0.2500 0.4566 l
0.2750 0.4566 l
0.2750 0.4624 l
0.3000 0.4624 l
0.3000 0.4611 l
0.3250 0.4611 l
0.3250 0.4649 l
0.3500 0.4649 l
0.3500 0.4650 l
0.3750 0.4650 l
0.3750 0.4600 l
0.4000 0.4600 l
0.4000 0.4584 l
0.4250 0.4584 l
0.4250 0.4513 l
0.4500 0.4513 l
0.4500 0.4621 l
0.4750 0.4621 l
0.4750 0.4717 l
0.5000 0.4717 l
0.5000 0.4634 l
0.5250 0.4634 l
0.5250 0.4353 l
0.5500 0.4353 l
0.5500 0.4605 l
0.5750 0.4605 l
0.5750 0.4477 l
0.6000 0.4477 l
0.6000 0.4607 l
0.6250 0.4607 l
0.6250 0.4581 l
0.6500 0.4581 l
0.6500 0.4541 l
0.6750 0.4541 l
0.6750 0.4431 l
0.7000 0.4431 l
0.7000 0.4532 l
0.7250 0.4532 l
0.7250 0.4454 l
0.7500 0.4454 l
0.7500 0.4502 l
0.7750 0.4502 l
0.7750 0.4440 l
0.8000 0.4440 l
0.8000 0.4564 l
0.8250 0.4564 l
0.8250 0.4373 l
0.8500 0.4373 l
0.8500 0.4164 l
0.8750 0.4164 l
0.8750 0.4097 l
0.9000 0.4097 l
0.9000 0.4154 l
0.9250 0.4154 l
0.9250 0.4258 l
0.9500 0.4258 l
0.9500 0.4055 l
0.9750 0.4055 l
0.9750 0.3963 l
1.0000 0.3963 l
1.0000 0.4187 l
1.0250 0.4187 l
1.0250 0.3721 l
1.0500 0.3721 l
1.0500 0.3962 l
1.0750 0.3962 l
1.0750 0.3933 l
1.1000 0.3933 l
1.1000 0.3451 l
1.1250 0.3451 l
1.1250 0.3110 l
1.1500 0.3110 l
1.1500 0.3320 l
1.1501 0.3320 l
s
n
0.1500 0.5458 m
0.1500 0.5337 l
0.1750 0.5337 l
0.1750 0.5270 l
0.2000 0.5270 l
0.2000 0.5307 l
0.2250 0.5307 l
0.2250 0.5374 l
0.2500 0.5374 l
0.2500 0.5270 l
0.2750 0.5270 l
0.2750 0.5424 l
0.3000 0.5424 l
0.3000 0.5289 l
0.3250 0.5289 l
0.3250 0.5239 l
0.3500 0.5239 l
0.3500 0.5421 l
0.3750 0.5421 l
0.3750 0.5431 l
0.4000 0.5431 l
0.4000 0.5481 l
0.4250 0.5481 l
0.4250 0.5335 l
0.4500 0.5335 l
0.4500 0.5260 l
0.4750 0.5260 l
0.4750 0.5314 l
0.5000 0.5314 l
0.5000 0.5277 l
0.5250 0.5277 l
0.5250 0.5610 l
0.5500 0.5610 l
0.5500 0.5407 l
0.5750 0.5407 l
0.5750 0.5443 l
0.6000 0.5443 l
0.6000 0.5327 l
0.6250 0.5327 l
0.6250 0.5565 l
0.6500 0.5565 l
0.6500 0.5548 l
0.6750 0.5548 l
0.6750 0.5397 l
0.7000 0.5397 l
0.7000 0.5796 l
0.7250 0.5796 l
0.7250 0.5601 l
0.7500 0.5601 l
0.7500 0.5431 l
0.7750 0.5431 l
0.7750 0.5515 l
0.8000 0.5515 l
0.8000 0.5612 l
0.8250 0.5612 l
0.8250 0.5622 l
0.8500 0.5622 l
0.8500 0.5672 l
0.8750 0.5672 l
0.8750 0.5665 l
0.9000 0.5665 l
0.9000 0.5616 l
0.9250 0.5616 l
0.9250 0.5768 l
0.9500 0.5768 l
0.9500 0.5570 l
0.9750 0.5570 l
0.9750 0.5959 l
1.0000 0.5959 l
1.0000 0.5910 l
1.0250 0.5910 l
1.0250 0.6262 l
1.0500 0.6262 l
1.0500 0.6071 l
1.0750 0.6071 l
1.0750 0.5808 l
1.1000 0.5808 l
1.1000 0.6337 l
1.1250 0.6337 l
1.1250 0.7720 l
1.1500 0.7720 l
1.1500 0.7512 l
1.1501 0.7512 l
s
[/DeviceRGB] SCS
Color1 SC
[] 0 SD
0.0015 SLW
n
0.1500 0.1500 m
1.1500 0.1500 l
s
n
0.1500 0.8500 m
1.1500 0.8500 l
s
[] 0 SD
0.0030 SLW
n
0.2750 0.1500 m
0.2750 0.1600 l
s
n
0.2750 0.8500 m
0.2750 0.8400 l
s
n
0.5250 0.1500 m
0.5250 0.1600 l
s
n
0.5250 0.8500 m
0.5250 0.8400 l
s
n
0.7750 0.1500 m
0.7750 0.1600 l
s
n
0.7750 0.8500 m
0.7750 0.8400 l
s
n
1.0250 0.1500 m
1.0250 0.1600 l
s
n
1.0250 0.8500 m
1.0250 0.8400 l
s
n
0.1500 0.1500 m
0.1500 0.1700 l
s
n
0.1500 0.8500 m
0.1500 0.8300 l
s
n
0.4000 0.1500 m
0.4000 0.1700 l
s
n
0.4000 0.8500 m
0.4000 0.8300 l
s
n
0.6500 0.1500 m
0.6500 0.1700 l
s
n
0.6500 0.8500 m
0.6500 0.8300 l
s
n
0.9000 0.1500 m
0.9000 0.1700 l
s
n
0.9000 0.8500 m
0.9000 0.8300 l
s
n
1.1500 0.1500 m
1.1500 0.1700 l
s
n
1.1500 0.8500 m
1.1500 0.8300 l
s
/Times-Roman findfont
dup length dict begin
 {1 index /FID ne {def} {pop pop} ifelse} forall
 /Encoding DefEncoding def
 currentdict
end
/Font0 exch definefont pop
/Font0 FFSF
0.1418 0.1169 m
GS
[0.0344 0.0000 0.0000 0.0344 0 0] CC
(0) show
GR
/Font0 FFSF
0.3745 0.1169 m
GS
[0.0344 0.0000 0.0000 0.0344 0 0] CC
(100) show
GR
/Font0 FFSF
0.6245 0.1169 m
GS
[0.0344 0.0000 0.0000 0.0344 0 0] CC
(200) show
GR
/Font0 FFSF
0.8745 0.1169 m
GS
[0.0344 0.0000 0.0000 0.0344 0 0] CC
(300) show
GR
/Font0 FFSF
1.1245 0.1169 m
GS
[0.0344 0.0000 0.0000 0.0344 0 0] CC
(400) show
GR
/Font0 FFSF
0.5837 0.0717 m
GS
[0.0344 0.0000 0.0000 0.0344 0 0] CC
(p) show
GR
/Font0 FFSF
0.6010 0.0579 m
GS
[0.0244 0.0000 0.0000 0.0244 0 0] CC
(T) show
GR
/Font0 FFSF
0.6159 0.0924 m
GS
[0.0244 0.0000 0.0000 0.0244 0 0] CC
(t) show
GR
/Font0 FFSF
0.6225 0.0717 m
GS
[0.0344 0.0000 0.0000 0.0344 0 0] CC
( [GeV]) show
GR
[] 0 SD
0.0015 SLW
n
0.1500 0.1500 m
0.1500 0.8500 l
s
n
1.1500 0.1500 m
1.1500 0.8500 l
s
[] 0 SD
0.0030 SLW
n
0.1500 0.2375 m
0.1600 0.2375 l
s
n
1.1500 0.2375 m
1.1400 0.2375 l
s
n
0.1500 0.4125 m
0.1600 0.4125 l
s
n
1.1500 0.4125 m
1.1400 0.4125 l
s
n
0.1500 0.5875 m
0.1600 0.5875 l
s
n
1.1500 0.5875 m
1.1400 0.5875 l
s
n
0.1500 0.7625 m
0.1600 0.7625 l
s
n
1.1500 0.7625 m
1.1400 0.7625 l
s
n
0.1500 0.1500 m
0.1700 0.1500 l
s
n
1.1500 0.1500 m
1.1300 0.1500 l
s
n
0.1500 0.3250 m
0.1700 0.3250 l
s
n
1.1500 0.3250 m
1.1300 0.3250 l
s
n
0.1500 0.5000 m
0.1700 0.5000 l
s
n
1.1500 0.5000 m
1.1300 0.5000 l
s
n
0.1500 0.6750 m
0.1700 0.6750 l
s
n
1.1500 0.6750 m
1.1300 0.6750 l
s
n
0.1500 0.8500 m
0.1700 0.8500 l
s
n
1.1500 0.8500 m
1.1300 0.8500 l
s
/Font0 FFSF
0.1149 0.1384 m
GS
[0.0344 0.0000 0.0000 0.0344 0 0] CC
(-1) show
GR
/Font0 FFSF
0.1235 0.3136 m
GS
[0.0344 0.0000 0.0000 0.0344 0 0] CC
(0) show
GR
/Font0 FFSF
0.1263 0.4884 m
GS
[0.0344 0.0000 0.0000 0.0344 0 0] CC
(1) show
GR
/Font0 FFSF
0.1235 0.6634 m
GS
[0.0344 0.0000 0.0000 0.0344 0 0] CC
(2) show
GR
/Font0 FFSF
0.1251 0.8386 m
GS
[0.0344 0.0000 0.0000 0.0344 0 0] CC
(3) show
GR
/Font0 FFSF
0.0911 0.4008 m
GS
[0.0000 0.0344 -0.0344 0.0000 0 0] CC
(\(d) show
GR
/Symbol findfont
/Font12 exch definefont pop
/Font12 FFSF
0.0911 0.4294 m
GS
[0.0000 0.0344 -0.0344 0.0000 0 0] CC
(s) show
GR
/Font0 FFSF
0.0911 0.4502 m
GS
[0.0000 0.0344 -0.0344 0.0000 0 0] CC
(/dp) show
GR
/Font0 FFSF
0.1049 0.4941 m
GS
[0.0000 0.0244 -0.0244 0.0000 0 0] CC
(T) show
GR
/Font0 FFSF
0.0705 0.5090 m
GS
[0.0000 0.0244 -0.0244 0.0000 0 0] CC
(t) show
GR
/Font0 FFSF
0.0911 0.5157 m
GS
[0.0000 0.0344 -0.0344 0.0000 0 0] CC
(\)/C.V.) show
GR
/Font0 FFSF
1.1892 0.5475 m
GS
[0.0000 0.0280 -0.0280 0.0000 0 0] CC
(LHC HIGGS XS WG 2011) show
GR
n
0.1500 0.1500 m
0.1500 0.8500 l
1.1500 0.8500 l
1.1500 0.1500 l
0.1500 0.1500 l
c
s
n
0.7000 0.7887 m
0.7000 0.7101 l
1.0042 0.7101 l
1.0042 0.7887 l
c
[/DeviceRGB] SCS
Color0 SC
fill
[/DeviceRGB] SCS
Color1 SC
[] 0 SD
0.0015 SLW
n
0.7000 0.7887 m
0.7000 0.7101 l
1.0042 0.7101 l
1.0042 0.7887 l
0.7000 0.7887 l
c
s
/Font0 FFSF
0.7715 0.7548 m
GS
[0.0350 0.0000 0.0000 0.0350 0 0] CC
(error from scale) show
GR
[/DeviceRGB] SCS
Color2 SC
[] 0 SD
0.0030 SLW
n
0.7115 0.7666 m
0.7515 0.7666 l
s
/Font0 FFSF
[/DeviceRGB] SCS
Color1 SC
0.7715 0.7205 m
GS
[0.0350 0.0000 0.0000 0.0350 0 0] CC
(total error) show
GR
[/DeviceRGB] SCS
Color4 SC
n
0.7115 0.7323 m
0.7515 0.7323 l
s
/Font0 FFSF
[/DeviceRGB] SCS
Color1 SC
0.3137 0.2745 m
GS
[0.0339 0.0000 0.0000 0.0339 0 0] CC
(LHC at 7 TeV) show
GR
%%Trailer
%%BoundingBox: 33 34 730 529
%%DocumentNeededResources: font Times-Roman
%%+ font Symbol
%%EOF
