%!PS-Adobe-2.0 EPSF-2.0
%%BoundingBox:  0 0 567 362
%%Title: Results/m120/POWHEG.pveto-mstw2008.eps: VBF - HAWK
%%Creator: ROOT Version 5.28/00c
%%CreationDate: Fri Nov 25 16:38:24 2011
%%EndComments
%%BeginProlog
80 dict begin
/s {stroke} def /l {lineto} def /m {moveto} def /t {translate} def
/r {rotate} def /rl {roll}  def /R {repeat} def
/d {rlineto} def /rm {rmoveto} def /gr {grestore} def /f {eofill} def
/c {setrgbcolor} def /black {0 setgray} def /sd {setdash} def
/cl {closepath} def /sf {scalefont setfont} def /lw {setlinewidth} def
/box {m dup 0 exch d exch 0 d 0 exch neg d cl} def
/NC{systemdict begin initclip end}def/C{NC box clip newpath}def
/bl {box s} def /bf {box f} def /Y { 0 exch d} def /X { 0 d} def 
/K {{pop pop 0 moveto} exch kshow} bind def
/ita {/ang 15 def gsave [1 0 ang dup sin exch cos div 1 0 0] concat} def 
/mp {newpath /y exch def /x exch def} def
/side {[w .77 mul w .23 mul] .385 w mul sd w 0 l currentpoint t -144 r} def
/mr {mp x y w2 0 360 arc} def /m24 {mr s} def /m20 {mr f} def
/mb {mp x y w2 add m w2 neg 0 d 0 w neg d w 0 d 0 w d cl} def
/mt {mp x y w2 add m w2 neg w neg d w 0 d cl} def
/m21 {mb f} def /m25 {mb s} def /m22 {mt f} def /m26{mt s} def
/m23 {mp x y w2 sub m w2 w d w neg 0 d cl f} def
/m27 {mp x y w2 add m w3 neg w2 neg d w3 w2 neg d w3 w2 d cl s} def
/m28 {mp x w2 sub y w2 sub w3 add m w3 0 d  0 w3 neg d w3 0 d 0 w3 d w3 0 d  0 w3 d w3 neg 0 d 0 w3 d w3 neg 0 d 0 w3 neg d w3 neg 0 d cl s } def
/m29 {mp gsave x w2 sub y w2 add w3 sub m currentpoint t 4 {side} repeat cl fill gr} def
/m30 {mp gsave x w2 sub y w2 add w3 sub m currentpoint t 4 {side} repeat cl s gr} def
/m31 {mp x y w2 sub m 0 w d x w2 sub y m w 0 d x w2 sub y w2 add m w w neg d x w2 sub y w2 sub m w w d s} def
/m32 {mp x y w2 sub m w2 w d w neg 0 d cl s} def
/m33 {mp x y w2 add m w3 neg w2 neg d w3 w2 neg d w3 w2 d cl f} def
/m34 {mp x w2 sub y w2 sub w3 add m w3 0 d  0 w3 neg d w3 0 d 0 w3 d w3 0 d  0 w3 d w3 neg 0 d 0 w3 d w3 neg 0 d 0 w3 neg d w3 neg 0 d cl f } def
/m2 {mp x y w2 sub m 0 w d x w2 sub y m w 0 d s} def
/m5 {mp x w2 sub y w2 sub m w w d x w2 sub y w2 add m w w neg d s} def
/reEncode {exch findfont dup length dict begin {1 index /FID eq  {pop pop} {def} ifelse } forall /Encoding exch def currentdict end dup /FontName get exch definefont pop } def [/Times-Bold /Times-Italic /Times-BoldItalic /Helvetica /Helvetica-Oblique
 /Helvetica-Bold /Helvetica-BoldOblique /Courier /Courier-Oblique /Courier-Bold /Courier-BoldOblique /Times-Roman /AvantGarde-Book /AvantGarde-BookOblique /AvantGarde-Demi /AvantGarde-DemiOblique /Bookman-Demi /Bookman-DemiItalic /Bookman-Light
 /Bookman-LightItalic /Helvetica-Narrow /Helvetica-Narrow-Bold /Helvetica-Narrow-BoldOblique /Helvetica-Narrow-Oblique /NewCenturySchlbk-Roman /NewCenturySchlbk-Bold /NewCenturySchlbk-BoldItalic /NewCenturySchlbk-Italic /Palatino-Bold
 /Palatino-BoldItalic /Palatino-Italic /Palatino-Roman ] {ISOLatin1Encoding reEncode } forall%%EndProlog
%%BeginSetup
%%EndSetup
newpath  gsave  .25 .25 scale  gsave  0 0 t black[  ] 0 sd 3 lw 1 1 1 c 2268 1448 0 0 bf black 1 1 1 c 1814 1158 227 145 bf black 1814 1158 227 145 bl 1 1 1 c 1814 1158 227 145 bf black 1814 1158 227 145 bl 0.8 0 0 c[  12 12 ] 0 sd 6 lw 1 1 1 c black
 0.8 0 0 c 227 1025 m 90 X -79 Y 91 X -75 Y 91 X -70 Y 91 X -60 Y 90 X -55 Y 91 X -48 Y 91 X -44 Y 90 X -38 Y 91 X -33 Y 91 X -32 Y 91 X -31 Y 90 X -28 Y 91 X -25 Y 91 X -23 Y 90 X -19 Y 91 X -19 Y 91 X -17 Y 91 X -15 Y 90 X -14 Y 91 X s black[  ] 0
 sd 3 lw 227 145 m 1814 X s
 gsave  2268 1448 0 0 C 1870.36 37.964 t 0 r /Helvetica findfont 60.7424 sf 0 0 m ( [GeV]) show NC gr 
 gsave  2268 1448 0 0 C 1761.53 7.5928 t 0 r /Helvetica findfont 40.4949 sf 0 0 m 
 85 74 51 31 20
(T,veto) K NC gr 
 gsave  2268 1448 0 0 C 1728.63 37.964 t 0 r /Helvetica findfont 60.7424 sf 0 0 m (p) show NC gr  227 180 m -35 Y s 272 162 m -17 Y s 317 162 m -17 Y s 363 162 m -17 Y s 408 180 m -35 Y s 454 162 m -17 Y s 499 162 m -17 Y s 544 162 m -17 Y s 590 180
 m -35 Y s 635 162 m -17 Y s 680 162 m -17 Y s 726 162 m -17 Y s 771 180 m -35 Y s 816 162 m -17 Y s 862 162 m -17 Y s 907 162 m -17 Y s 952 180 m -35 Y s 998 162 m -17 Y s 1043 162 m -17 Y s 1089 162 m -17 Y s 1134 180 m -35 Y s 1179 162 m -17 Y s
 1225 162 m -17 Y s 1270 162 m -17 Y s 1315 180 m -35 Y s 1361 162 m -17 Y s 1406 162 m -17 Y s 1451 162 m -17 Y s 1497 180 m -35 Y s 1542 162 m -17 Y s 1587 162 m -17 Y s 1633 162 m -17 Y s 1678 180 m -35 Y s 1723 162 m -17 Y s 1769 162 m -17 Y s
 1814 162 m -17 Y s 1860 180 m -35 Y s 1905 162 m -17 Y s 1950 162 m -17 Y s 1996 162 m -17 Y s 2041 180 m -35 Y s
 gsave  2268 1448 0 0 C 194.882 93.6445 t 0 r /Helvetica findfont 53.1496 sf 0 0 m (20) show NC gr 
 gsave  2268 1448 0 0 C 377.109 93.6445 t 0 r /Helvetica findfont 53.1496 sf 0 0 m (22) show NC gr 
 gsave  2268 1448 0 0 C 556.805 93.6445 t 0 r /Helvetica findfont 53.1496 sf 0 0 m (24) show NC gr 
 gsave  2268 1448 0 0 C 739.033 93.6445 t 0 r /Helvetica findfont 53.1496 sf 0 0 m (26) show NC gr 
 gsave  2268 1448 0 0 C 921.26 93.6445 t 0 r /Helvetica findfont 53.1496 sf 0 0 m (28) show NC gr 
 gsave  2268 1448 0 0 C 1103.49 93.6445 t 0 r /Helvetica findfont 53.1496 sf 0 0 m (30) show NC gr 
 gsave  2268 1448 0 0 C 1283.18 93.6445 t 0 r /Helvetica findfont 53.1496 sf 0 0 m (32) show NC gr 
 gsave  2268 1448 0 0 C 1465.41 93.6445 t 0 r /Helvetica findfont 53.1496 sf 0 0 m (34) show NC gr 
 gsave  2268 1448 0 0 C 1647.64 93.6445 t 0 r /Helvetica findfont 53.1496 sf 0 0 m (36) show NC gr 
 gsave  2268 1448 0 0 C 1827.33 93.6445 t 0 r /Helvetica findfont 53.1496 sf 0 0 m (38) show NC gr 
 gsave  2268 1448 0 0 C 2009.56 93.6445 t 0 r /Helvetica findfont 53.1496 sf 0 0 m (40) show NC gr  227 145 m 1158 Y s
 gsave  2268 1448 0 0 C 111.361 1227.5 t 90 r /Helvetica findfont 40.4949 sf 0 0 m (veto) show NC gr 
 gsave  2268 1448 0 0 C 78.4589 1194.6 t 90 r /Helvetica findfont 60.7424 sf 0 0 m (p) show NC gr  281 145 m -54 X s 254 168 m -27 X s 254 191 m -27 X s 254 214 m -27 X s 254 237 m -27 X s 281 261 m -54 X s 254 284 m -27 X s 254 307 m -27 X s 254 330
 m -27 X s 254 353 m -27 X s 281 376 m -54 X s 254 400 m -27 X s 254 423 m -27 X s 254 446 m -27 X s 254 469 m -27 X s 281 492 m -54 X s 254 515 m -27 X s 254 539 m -27 X s 254 562 m -27 X s 254 585 m -27 X s 281 608 m -54 X s 254 631 m -27 X s 254
 654 m -27 X s 254 678 m -27 X s 254 701 m -27 X s 281 724 m -54 X s 254 747 m -27 X s 254 770 m -27 X s 254 793 m -27 X s 254 816 m -27 X s 281 840 m -54 X s 254 863 m -27 X s 254 886 m -27 X s 254 909 m -27 X s 254 932 m -27 X s 281 955 m -54 X s
 254 979 m -27 X s 254 1002 m -27 X s 254 1025 m -27 X s 254 1048 m -27 X s 281 1071 m -54 X s 254 1094 m -27 X s 254 1118 m -27 X s 254 1141 m -27 X s 254 1164 m -27 X s 281 1187 m -54 X s 254 1210 m -27 X s 254 1233 m -27 X s 254 1257 m -27 X s 254
 1280 m -27 X s 281 1303 m -54 X s
 gsave  2268 1448 0 0 C 187.289 126.547 t 0 r /Helvetica findfont 53.1496 sf 0 0 m (0) show NC gr 
 gsave  2268 1448 0 0 C 121.485 240.439 t 0 r /Helvetica findfont 53.1496 sf 0 0 m (0.01) show NC gr 
 gsave  2268 1448 0 0 C 113.892 356.862 t 0 r /Helvetica findfont 53.1496 sf 0 0 m (0.02) show NC gr 
 gsave  2268 1448 0 0 C 113.892 473.285 t 0 r /Helvetica findfont 53.1496 sf 0 0 m (0.03) show NC gr 
 gsave  2268 1448 0 0 C 113.892 589.708 t 0 r /Helvetica findfont 53.1496 sf 0 0 m (0.04) show NC gr 
 gsave  2268 1448 0 0 C 111.361 703.6 t 0 r /Helvetica findfont 53.1496 sf 0 0 m (0.05) show NC gr 
 gsave  2268 1448 0 0 C 113.892 820.023 t 0 r /Helvetica findfont 53.1496 sf 0 0 m (0.06) show NC gr 
 gsave  2268 1448 0 0 C 113.892 936.445 t 0 r /Helvetica findfont 53.1496 sf 0 0 m (0.07) show NC gr 
 gsave  2268 1448 0 0 C 113.892 1052.87 t 0 r /Helvetica findfont 53.1496 sf 0 0 m (0.08) show NC gr 
 gsave  2268 1448 0 0 C 113.892 1169.29 t 0 r /Helvetica findfont 53.1496 sf 0 0 m (0.09) show NC gr 
 gsave  2268 1448 0 0 C 149.325 1283.18 t 0 r /Helvetica findfont 53.1496 sf 0 0 m (0.1) show NC gr  0.4 0.4 0.8 c 6 lw 1 1 1 c black 0.4 0.4 0.8 c 227 980 m 90 X -61 Y 91 X -56 Y 91 X -52 Y 91 X -48 Y 90 X -45 Y 91 X -40 Y 91 X -39 Y 90 X -34 Y 91 X
 -34 Y 91 X -31 Y 91 X -29 Y 90 X -26 Y 91 X -26 Y 91 X -23 Y 90 X -21 Y 91 X -21 Y 91 X -19 Y 91 X -17 Y 90 X -16 Y 91 X s 0 0.8 0 c[ 20 12 4 12] 0 sd 1 1 1 c black 0 0.8 0 c 227 860 m 90 X -56 Y 91 X -54 Y 91 X -49 Y 91 X -42 Y 90 X -42 Y 91 X -39
 Y 91 X -28 Y 90 X -31 Y 91 X -31 Y 91 X -27 Y 91 X -29 Y 90 X -22 Y 91 X -20 Y 91 X -22 Y 90 X -21 Y 91 X -16 Y 91 X -18 Y 91 X -14 Y 90 X -11 Y 91 X s 0.4 0 0.8 c[ 20 12 4 12 4 12 4 12] 0 sd 1 1 1 c black 0.4 0 0.8 c 227 812 m 90 X -50 Y 91 X -46 Y
 91 X -42 Y 91 X -38 Y 90 X -35 Y 91 X -33 Y 91 X -31 Y 90 X -28 Y 91 X -27 Y 91 X -25 Y 91 X -24 Y 90 X -20 Y 91 X -20 Y 91 X -18 Y 90 X -17 Y 91 X -16 Y 91 X -15 Y 91 X -13 Y 90 X -13 Y 91 X s 0.6 0.6 0.6 c[ 20 20] 0 sd 1 1 1 c black 0.6 0.6 0.6 c
 227 1212 m 90 X -76 Y 91 X -71 Y 91 X -68 Y 91 X -61 Y 90 X -57 Y 91 X -53 Y 91 X -48 Y 90 X -46 Y 91 X -42 Y 91 X -38 Y 91 X -36 Y 90 X -34 Y 91 X -31 Y 91 X -29 Y 90 X -28 Y 91 X -25 Y 91 X -24 Y 91 X -23 Y 90 X -20 Y 91 X s black
 gsave  2268 1448 0 0 C 2085.49 827.615 t 90 r /Helvetica-BoldOblique findfont 40.4949 sf 0 0 m 
 447 428 405 382 371 340 302 290 263 236 225 198 166 135 124 95 83 54 25
(LHC HIGGS XS WG 2011) K NC gr 
 gsave  2268 1448 0 0 C 1888.08 1192.07 t 0 r /Helvetica findfont 32.9021 sf 0 0 m (W) show NC gr 
 gsave  2268 1448 0 0 C 1819.74 1207.26 t 0 r /Helvetica findfont 50.6187 sf 0 0 m (=M) show NC gr 
 gsave  2268 1448 0 0 C 1799.49 1179.42 t 0 r /Helvetica findfont 32.9021 sf 0 0 m (F) show NC gr 
 gsave  2268 1448 0 0 C 1769.12 1207.26 t 0 r /Symbol findfont 50.6187 sf 0 0 m (m) show NC gr 
 gsave  2268 1448 0 0 C 1741.28 1207.26 t 0 r /Helvetica findfont 50.6187 sf 0 0 m (=) show NC gr 
 gsave  2268 1448 0 0 C 1715.97 1179.42 t 0 r /Helvetica findfont 32.9021 sf 0 0 m (R) show NC gr 
 gsave  2268 1448 0 0 C 1685.6 1207.26 t 0 r /Symbol findfont 50.6187 sf 0 0 m (m) show NC gr 
 gsave  2268 1448 0 0 C 1326.21 1207.26 t 0 r /Helvetica findfont 50.6187 sf 0 0 m (POWHEG NLO ) show NC gr  0.4 0.4 0.8 c[  ] 0 sd 1105 1215 m 182 X s black
 gsave  2268 1448 0 0 C 1915.92 1131.33 t 0 r /Helvetica findfont 32.9021 sf 0 0 m (W) show NC gr 
 gsave  2268 1448 0 0 C 1819.74 1146.51 t 0 r /Helvetica findfont 50.6187 sf 0 0 m (=2M) show NC gr 
 gsave  2268 1448 0 0 C 1799.49 1118.67 t 0 r /Helvetica findfont 32.9021 sf 0 0 m (F) show NC gr 
 gsave  2268 1448 0 0 C 1769.12 1146.51 t 0 r /Symbol findfont 50.6187 sf 0 0 m (m) show NC gr 
 gsave  2268 1448 0 0 C 1741.28 1146.51 t 0 r /Helvetica findfont 50.6187 sf 0 0 m (=) show NC gr 
 gsave  2268 1448 0 0 C 1715.97 1118.67 t 0 r /Helvetica findfont 32.9021 sf 0 0 m (R) show NC gr 
 gsave  2268 1448 0 0 C 1685.6 1146.51 t 0 r /Symbol findfont 50.6187 sf 0 0 m (m) show NC gr 
 gsave  2268 1448 0 0 C 1326.21 1146.51 t 0 r /Helvetica findfont 50.6187 sf 0 0 m (POWHEG NLO ) show NC gr  0.4 0 0.8 c[ 20 12 4 12 4 12 4 12] 0 sd 1105 1154 m 182 X s black
 gsave  2268 1448 0 0 C 1920.98 1085.77 t 0 r /Helvetica findfont 50.6187 sf 0 0 m (/2) show NC gr 
 gsave  2268 1448 0 0 C 1888.08 1070.58 t 0 r /Helvetica findfont 32.9021 sf 0 0 m (W) show NC gr 
 gsave  2268 1448 0 0 C 1819.74 1085.77 t 0 r /Helvetica findfont 50.6187 sf 0 0 m (=M) show NC gr 
 gsave  2268 1448 0 0 C 1799.49 1057.93 t 0 r /Helvetica findfont 32.9021 sf 0 0 m (F) show NC gr 
 gsave  2268 1448 0 0 C 1769.12 1085.77 t 0 r /Symbol findfont 50.6187 sf 0 0 m (m) show NC gr 
 gsave  2268 1448 0 0 C 1741.28 1085.77 t 0 r /Helvetica findfont 50.6187 sf 0 0 m (=) show NC gr 
 gsave  2268 1448 0 0 C 1715.97 1057.93 t 0 r /Helvetica findfont 32.9021 sf 0 0 m (R) show NC gr 
 gsave  2268 1448 0 0 C 1685.6 1085.77 t 0 r /Symbol findfont 50.6187 sf 0 0 m (m) show NC gr 
 gsave  2268 1448 0 0 C 1326.21 1085.77 t 0 r /Helvetica findfont 50.6187 sf 0 0 m (POWHEG NLO ) show NC gr  0.6 0.6 0.6 c[ 20 20] 0 sd 1105 1093 m 182 X s black
 gsave  2268 1448 0 0 C 1326.21 1012.37 t 0 r /Helvetica findfont 50.6187 sf 0 0 m (POWHEG + PYTHIA) show NC gr  0.8 0 0 c[  12 12 ] 0 sd 1105 1032 m 182 X s black
 gsave  2268 1448 0 0 C 1326.21 951.631 t 0 r /Helvetica findfont 50.6187 sf 0 0 m 
 460 446 398 361 327 291 276 246 232 193 159 122 73 34
(POWHEG + HERWIG) K NC gr  0 0.8 0 c[ 20 12 4 12] 0 sd 1105 971 m 182 X s
 gr  gr showpage
end
%%EOF
