%!PS-Adobe-2.0 EPSF-2.0
%%BoundingBox:  0 0 567 362
%%Title: Results/m120/POWHEG.yj3maxpt-mstw2008.eps: VBF - HAWK
%%Creator: ROOT Version 5.28/00c
%%CreationDate: Fri Nov 25 16:25:42 2011
%%EndComments
%%BeginProlog
80 dict begin
/s {stroke} def /l {lineto} def /m {moveto} def /t {translate} def
/r {rotate} def /rl {roll}  def /R {repeat} def
/d {rlineto} def /rm {rmoveto} def /gr {grestore} def /f {eofill} def
/c {setrgbcolor} def /black {0 setgray} def /sd {setdash} def
/cl {closepath} def /sf {scalefont setfont} def /lw {setlinewidth} def
/box {m dup 0 exch d exch 0 d 0 exch neg d cl} def
/NC{systemdict begin initclip end}def/C{NC box clip newpath}def
/bl {box s} def /bf {box f} def /Y { 0 exch d} def /X { 0 d} def 
/K {{pop pop 0 moveto} exch kshow} bind def
/ita {/ang 15 def gsave [1 0 ang dup sin exch cos div 1 0 0] concat} def 
/mp {newpath /y exch def /x exch def} def
/side {[w .77 mul w .23 mul] .385 w mul sd w 0 l currentpoint t -144 r} def
/mr {mp x y w2 0 360 arc} def /m24 {mr s} def /m20 {mr f} def
/mb {mp x y w2 add m w2 neg 0 d 0 w neg d w 0 d 0 w d cl} def
/mt {mp x y w2 add m w2 neg w neg d w 0 d cl} def
/m21 {mb f} def /m25 {mb s} def /m22 {mt f} def /m26{mt s} def
/m23 {mp x y w2 sub m w2 w d w neg 0 d cl f} def
/m27 {mp x y w2 add m w3 neg w2 neg d w3 w2 neg d w3 w2 d cl s} def
/m28 {mp x w2 sub y w2 sub w3 add m w3 0 d  0 w3 neg d w3 0 d 0 w3 d w3 0 d  0 w3 d w3 neg 0 d 0 w3 d w3 neg 0 d 0 w3 neg d w3 neg 0 d cl s } def
/m29 {mp gsave x w2 sub y w2 add w3 sub m currentpoint t 4 {side} repeat cl fill gr} def
/m30 {mp gsave x w2 sub y w2 add w3 sub m currentpoint t 4 {side} repeat cl s gr} def
/m31 {mp x y w2 sub m 0 w d x w2 sub y m w 0 d x w2 sub y w2 add m w w neg d x w2 sub y w2 sub m w w d s} def
/m32 {mp x y w2 sub m w2 w d w neg 0 d cl s} def
/m33 {mp x y w2 add m w3 neg w2 neg d w3 w2 neg d w3 w2 d cl f} def
/m34 {mp x w2 sub y w2 sub w3 add m w3 0 d  0 w3 neg d w3 0 d 0 w3 d w3 0 d  0 w3 d w3 neg 0 d 0 w3 d w3 neg 0 d 0 w3 neg d w3 neg 0 d cl f } def
/m2 {mp x y w2 sub m 0 w d x w2 sub y m w 0 d s} def
/m5 {mp x w2 sub y w2 sub m w w d x w2 sub y w2 add m w w neg d s} def
/reEncode {exch findfont dup length dict begin {1 index /FID eq  {pop pop} {def} ifelse } forall /Encoding exch def currentdict end dup /FontName get exch definefont pop } def [/Times-Bold /Times-Italic /Times-BoldItalic /Helvetica /Helvetica-Oblique
 /Helvetica-Bold /Helvetica-BoldOblique /Courier /Courier-Oblique /Courier-Bold /Courier-BoldOblique /Times-Roman /AvantGarde-Book /AvantGarde-BookOblique /AvantGarde-Demi /AvantGarde-DemiOblique /Bookman-Demi /Bookman-DemiItalic /Bookman-Light
 /Bookman-LightItalic /Helvetica-Narrow /Helvetica-Narrow-Bold /Helvetica-Narrow-BoldOblique /Helvetica-Narrow-Oblique /NewCenturySchlbk-Roman /NewCenturySchlbk-Bold /NewCenturySchlbk-BoldItalic /NewCenturySchlbk-Italic /Palatino-Bold
 /Palatino-BoldItalic /Palatino-Italic /Palatino-Roman ] {ISOLatin1Encoding reEncode } forall%%EndProlog
%%BeginSetup
%%EndSetup
newpath  gsave  .25 .25 scale  gsave  0 0 t black[  ] 0 sd 3 lw 1 1 1 c 2268 1448 0 0 bf black 1 1 1 c 1814 1158 227 145 bf black 1814 1158 227 145 bl 1 1 1 c 1814 1158 227 145 bf black 1814 1158 227 145 bl 0.8 0 0 c[  12 12 ] 0 sd 6 lw 1 1 1 c black
 0.8 0 0 c 227 202 m 101 X 160 Y 100 X 170 Y 101 X 141 Y 101 X 99 Y 101 X -105 Y 100 X -102 Y 101 X -95 Y 101 X -114 Y 101 X 308 Y 101 X -83 Y 100 X 50 Y 101 X 126 Y 101 X -40 Y 101 X -187 Y 101 X -178 Y 100 X -150 Y 101 X -57 Y 101 X s black[  ] 0
 sd 3 lw 227 145 m 1814 X s
 gsave  2268 1448 0 0 C 2007.03 12.6547 t 0 r /Helvetica findfont 40.4949 sf 0 0 m (j3) show NC gr 
 gsave  2268 1448 0 0 C 1976.66 48.0877 t 0 r /Helvetica findfont 60.7424 sf 0 0 m (y) show NC gr  345 180 m -35 Y s 385 162 m -17 Y s 424 162 m -17 Y s 463 162 m -17 Y s 503 162 m -17 Y s 542 180 m -35 Y s 582 162 m -17 Y s 621 162 m -17 Y s 661 162
 m -17 Y s 700 162 m -17 Y s 739 180 m -35 Y s 779 162 m -17 Y s 818 162 m -17 Y s 858 162 m -17 Y s 897 162 m -17 Y s 937 180 m -35 Y s 976 162 m -17 Y s 1016 162 m -17 Y s 1055 162 m -17 Y s 1094 162 m -17 Y s 1134 180 m -35 Y s 1173 162 m -17 Y s
 1213 162 m -17 Y s 1252 162 m -17 Y s 1292 162 m -17 Y s 1331 180 m -35 Y s 1370 162 m -17 Y s 1410 162 m -17 Y s 1449 162 m -17 Y s 1489 162 m -17 Y s 1528 180 m -35 Y s 1568 162 m -17 Y s 1607 162 m -17 Y s 1647 162 m -17 Y s 1686 162 m -17 Y s
 1725 180 m -35 Y s 1765 162 m -17 Y s 1804 162 m -17 Y s 1844 162 m -17 Y s 1883 162 m -17 Y s 1923 180 m -35 Y s 345 180 m -35 Y s 306 162 m -17 Y s 266 162 m -17 Y s 1923 180 m -35 Y s 1962 162 m -17 Y s 2002 162 m -17 Y s 2041 162 m -17 Y s
 gsave  2268 1448 0 0 C 321.429 93.6445 t 0 r /Helvetica findfont 53.1496 sf 0 0 m (\2554) show NC gr 
 gsave  2268 1448 0 0 C 518.841 93.6445 t 0 r /Helvetica findfont 53.1496 sf 0 0 m (\2553) show NC gr 
 gsave  2268 1448 0 0 C 716.254 93.6445 t 0 r /Helvetica findfont 53.1496 sf 0 0 m (\2552) show NC gr 
 gsave  2268 1448 0 0 C 916.198 93.6445 t 0 r /Helvetica findfont 53.1496 sf 0 0 m (\2551) show NC gr 
 gsave  2268 1448 0 0 C 1118.67 93.6445 t 0 r /Helvetica findfont 53.1496 sf 0 0 m (0) show NC gr 
 gsave  2268 1448 0 0 C 1318.62 93.6445 t 0 r /Helvetica findfont 53.1496 sf 0 0 m (1) show NC gr 
 gsave  2268 1448 0 0 C 1510.97 93.6445 t 0 r /Helvetica findfont 53.1496 sf 0 0 m (2) show NC gr 
 gsave  2268 1448 0 0 C 1708.38 93.6445 t 0 r /Helvetica findfont 53.1496 sf 0 0 m (3) show NC gr 
 gsave  2268 1448 0 0 C 1905.79 93.6445 t 0 r /Helvetica findfont 53.1496 sf 0 0 m (4) show NC gr  227 145 m 1158 Y s
 gsave  2268 1448 0 0 C 113.892 1204.72 t 90 r /Helvetica findfont 60.7424 sf 0 0 m ( [fb]) show NC gr 
 gsave  2268 1448 0 0 C 146.794 1171.82 t 90 r /Helvetica findfont 40.4949 sf 0 0 m (j3) show NC gr 
 gsave  2268 1448 0 0 C 113.892 1090.83 t 90 r /Helvetica findfont 60.7424 sf 0 0 m (/dy) show NC gr 
 gsave  2268 1448 0 0 C 113.892 1052.87 t 90 r /Symbol findfont 60.7424 sf 0 0 m (s) show NC gr 
 gsave  2268 1448 0 0 C 113.892 1022.5 t 90 r /Helvetica findfont 60.7424 sf 0 0 m (d) show NC gr  281 145 m -54 X s 254 193 m -27 X s 254 241 m -27 X s 254 290 m -27 X s 281 338 m -54 X s 254 386 m -27 X s 254 434 m -27 X s 254 483 m -27 X s 281 531
 m -54 X s 254 579 m -27 X s 254 627 m -27 X s 254 676 m -27 X s 281 724 m -54 X s 254 772 m -27 X s 254 820 m -27 X s 254 869 m -27 X s 281 917 m -54 X s 254 965 m -27 X s 254 1013 m -27 X s 254 1062 m -27 X s 281 1110 m -54 X s 254 1158 m -27 X s
 254 1206 m -27 X s 254 1255 m -27 X s 281 1303 m -54 X s
 gsave  2268 1448 0 0 C 187.289 126.547 t 0 r /Helvetica findfont 53.1496 sf 0 0 m (0) show NC gr 
 gsave  2268 1448 0 0 C 187.289 316.367 t 0 r /Helvetica findfont 53.1496 sf 0 0 m (2) show NC gr 
 gsave  2268 1448 0 0 C 187.289 508.718 t 0 r /Helvetica findfont 53.1496 sf 0 0 m (4) show NC gr 
 gsave  2268 1448 0 0 C 187.289 703.6 t 0 r /Helvetica findfont 53.1496 sf 0 0 m (6) show NC gr 
 gsave  2268 1448 0 0 C 187.289 898.481 t 0 r /Helvetica findfont 53.1496 sf 0 0 m (8) show NC gr 
 gsave  2268 1448 0 0 C 156.918 1090.83 t 0 r /Helvetica findfont 53.1496 sf 0 0 m (10) show NC gr 
 gsave  2268 1448 0 0 C 156.918 1280.65 t 0 r /Helvetica findfont 53.1496 sf 0 0 m (12) show NC gr  0.4 0.4 0.8 c 6 lw 1 1 1 c black 0.4 0.4 0.8 c 227 251 m 101 X 196 Y 100 X 250 Y 101 X 192 Y 101 X -38 Y 101 X -134 Y 100 X -165 Y 101 X -151 Y 101 X
 -79 Y 101 X 246 Y 101 X -25 Y 100 X 188 Y 101 X 140 Y 101 X 13 Y 101 X -172 Y 101 X -251 Y 100 X -211 Y 101 X -105 Y 101 X s 0 0.8 0 c[ 20 12 4 12] 0 sd 1 1 1 c black 0 0.8 0 c 227 203 m 101 X 162 Y 100 X 175 Y 101 X 149 Y 101 X 44 Y 101 X -86 Y 100
 X -182 Y 101 X -110 Y 101 X -65 Y 101 X 258 Y 101 X -82 Y 100 X 148 Y 101 X 79 Y 101 X -4 Y 101 X -136 Y 101 X -222 Y 100 X -124 Y 101 X -62 Y 101 X s black
 gsave  2268 1448 0 0 C 2095.61 827.615 t 90 r /Helvetica-BoldOblique findfont 40.4949 sf 0 0 m 
 447 428 405 382 371 340 301 290 263 236 225 198 166 135 124 94 83 54 25
(LHC HIGGS XS WG 2011) K NC gr 
 gsave  2268 1448 0 0 C 1546.4 1214.85 t 0 r /Helvetica findfont 43.0259 sf 0 0 m (POWHEG NLO) show NC gr  0.4 0.4 0.8 c[  ] 0 sd 1389 1231 m 131 X s black
 gsave  2268 1448 0 0 C 1546.4 1126.27 t 0 r /Helvetica findfont 43.0259 sf 0 0 m (POWHEG + PYTHIA) show NC gr  0.8 0 0 c[  12 12 ] 0 sd 1389 1144 m 131 X s black
 gsave  2268 1448 0 0 C 1546.4 1040.21 t 0 r /Helvetica findfont 43.0259 sf 0 0 m 
 383 372 332 301 273 242 231 206 194 161 132 102 62 28
(POWHEG + HERWIG) K NC gr  0 0.8 0 c[ 20 12 4 12] 0 sd 1389 1057 m 131 X s
 gr  gr showpage
end
%%EOF
