%!PS-Adobe-3.0 EPSF-3.0
%%BoundingBox: (atend)
%%LanguageLevel: 2
%%Creator: Grace-5.1.22
%%CreationDate: Mon Dec 19 07:39:28 2011
%%DocumentData: Clean8Bit
%%Orientation: Portrait
%%Title: dsdR_tH_err_band.agr
%%For: laura
%%DocumentNeededResources: (atend)
%%EndComments
%%BeginProlog
/m {moveto} def
/l {lineto} def
/s {stroke} def
/n {newpath} def
/c {closepath} def
/RL {rlineto} def
/SLW {setlinewidth} def
/GS {gsave} def
/GR {grestore} def
/SC {setcolor} def
/SGRY {setgray} def
/SRGB {setrgbcolor} def
/SD {setdash} def
/SLC {setlinecap} def
/SLJ {setlinejoin} def
/SCS {setcolorspace} def
/FFSF {findfont setfont} def
/CC {concat} def
/PXL {n m 0 0 RL s} def
/Color0 {1.0000 1.0000 1.0000} def
/Color1 {0.0000 0.0000 0.0000} def
/Color2 {1.0000 0.0000 0.0000} def
/Color3 {0.0000 1.0000 0.0000} def
/Color4 {0.0000 0.0000 1.0000} def
/Color5 {1.0000 1.0000 0.0000} def
/Color6 {0.7373 0.5608 0.5608} def
/Color7 {0.8627 0.8627 0.8627} def
/Color8 {0.5804 0.0000 0.8275} def
/Color9 {0.0000 1.0000 1.0000} def
/Color10 {1.0000 0.0000 1.0000} def
/Color11 {1.0000 0.6471 0.0000} def
/Color12 {0.4471 0.1294 0.7373} def
/Color13 {0.4039 0.0275 0.2824} def
/Color14 {0.2510 0.8784 0.8157} def
/Color15 {0.0000 0.5451 0.0000} def
/Color16 {0.7529 0.7529 0.7529} def
/Color17 {0.5059 0.5059 0.5059} def
/Color18 {0.2588 0.2588 0.2588} def
/PTRN {
 /pat_bits exch def 
 <<
  /PaintType 2
  /PatternType 1 /TilingType 1
  /BBox[0 0 16 16]
  /XStep 16 /YStep 16
  /PaintProc {
   pop
   16 16 true [-1 0 0 -1 16 16] pat_bits imagemask
  }
 >>
 [0.0016 0 0 0.0016 0 0]
 makepattern
} def
/Pattern0 {<0000000000000000000000000000000000000000000000000000000000000000> PTRN} bind def
/Pattern1 {<ffffffffffffffffffffffffffffffffffffffffffffffffffffffffffffffff> PTRN} bind def
/Pattern2 {<eeeeffffbbbbffffeeeeffffbbbbffffeeeeffffbbbbffffeeeeffffbbbbffff> PTRN} bind def
/Pattern3 {<eeeebbbbeeeebbbbeeeebbbbeeeebbbbeeeebbbbeeeebbbbeeeebbbbeeeebbbb> PTRN} bind def
/Pattern4 {<5555aaaa5555aaaa5555aaaa5555aaaa5555aaaa5555aaaa5555aaaa5555aaaa> PTRN} bind def
/Pattern5 {<1111444411114444111144441111444411114444111144441111444411114444> PTRN} bind def
/Pattern6 {<1111000044440000111100004444000011110000444400001111000044440000> PTRN} bind def
/Pattern7 {<1010000000000000010100000000000010100000000000000101000000000000> PTRN} bind def
/Pattern8 {<0000000000000000000000000000000000000000000000000000000000000000> PTRN} bind def
/Pattern9 {<1e1e0f0f8787c3c3e1e1f0f078783c3c1e1e0f0f8787c3c3e1e1f0f078783c3c> PTRN} bind def
/Pattern10 {<7878f0f0e1e1c3c387870f0f1e1e3c3c7878f0f0e1e1c3c387870f0f1e1e3c3c> PTRN} bind def
/Pattern11 {<3333333333333333333333333333333333333333333333333333333333333333> PTRN} bind def
/Pattern12 {<ffffffff00000000ffffffff00000000ffffffff00000000ffffffff00000000> PTRN} bind def
/Pattern13 {<8181424224241818181824244242818181814242242418181818242442428181> PTRN} bind def
/Pattern14 {<8080404020201010080804040202010180804040202010100808040402020101> PTRN} bind def
/Pattern15 {<0101020204040808101020204040808001010202040408081010202040408080> PTRN} bind def
/Pattern16 {<2222222222222222222222222222222222222222222222222222222222222222> PTRN} bind def
/Pattern17 {<0000ffff000000000000ffff000000000000ffff000000000000ffff00000000> PTRN} bind def
/Pattern18 {<2222ffff222222222222ffff222222222222ffff222222222222ffff22222222> PTRN} bind def
/Pattern19 {<ffffffff33333333ffffffff33333333ffffffff33333333ffffffff33333333> PTRN} bind def
/Pattern20 {<0f0f0f0f0f0f0f0ff0f0f0f0f0f0f0f00f0f0f0f0f0f0f0ff0f0f0f0f0f0f0f0> PTRN} bind def
/Pattern21 {<ff00ff00ff00ff00ff00ff00ff00ff0000ff00ff00ff00ff00ff00ff00ff00ff> PTRN} bind def
/Pattern22 {<8001800180018001800180018001ffffffff8001800180018001800180018001> PTRN} bind def
/Pattern23 {<c003c003c003c003c003c003ffffffffffffffffc003c003c003c003c003c003> PTRN} bind def
/Pattern24 {<040404040404ffff404040404040ffff040404040404ffff404040404040ffff> PTRN} bind def
/Pattern25 {<180018001800180018001800ffffffff001800180018001800180018ffffffff> PTRN} bind def
/Pattern26 {<1111b8b87c7c3a3a1111a3a3c7c78b8b1111b8b87c7c3a3a1111a3a3c7c78b8b> PTRN} bind def
/Pattern27 {<101010102828c7c70101010182827c7c101010102828c7c70101010182827c7c> PTRN} bind def
/Pattern28 {<1c1c121211112121c1c12121111112121c1c121211112121c1c1212111111212> PTRN} bind def
/Pattern29 {<3e3e414180808080e3e31414080808083e3e414180808080e3e3141408080808> PTRN} bind def
/Pattern30 {<4848888884848383848488884848383848488888848483838484888848483838> PTRN} bind def
/Pattern31 {<03030404080808080c0c12122121c0c003030404080808080c0c12122121c0c0> PTRN} bind def
/ellipsedict 8 dict def
ellipsedict /mtrx matrix put
/EARC {
 ellipsedict begin
  /endangle exch def
  /startangle exch def
  /yrad exch def
  /xrad exch def
  /y exch def
  /x exch def
  /savematrix mtrx currentmatrix def
  x y translate
  xrad yrad scale
  0 0 1 startangle endangle arc
  savematrix setmatrix
 end
} def
/TL {
  /kcomp exch def
  /linewidth exch def
  /offset exch def
  GS
  0 offset rmoveto
  linewidth SLW
  dup stringwidth exch kcomp add exch RL s
  GR
} def
/KINIT
{
 /kvector exch def
 /kid 0 def
} def
/KPROC
{
 pop pop
 kvector kid get
 0 rmoveto
 /kid 1 kid add def
} def
/DefEncoding [
 /.notdef
 /.notdef
 /.notdef
 /.notdef
 /.notdef
 /.notdef
 /.notdef
 /.notdef
 /.notdef
 /.notdef
 /.notdef
 /.notdef
 /.notdef
 /.notdef
 /.notdef
 /.notdef
 /.notdef
 /.notdef
 /.notdef
 /.notdef
 /.notdef
 /.notdef
 /.notdef
 /.notdef
 /.notdef
 /.notdef
 /.notdef
 /.notdef
 /.notdef
 /.notdef
 /.notdef
 /.notdef
 /space
 /exclam
 /quotedbl
 /numbersign
 /dollar
 /percent
 /ampersand
 /quoteright
 /parenleft
 /parenright
 /asterisk
 /plus
 /comma
 /hyphen
 /period
 /slash
 /zero
 /one
 /two
 /three
 /four
 /five
 /six
 /seven
 /eight
 /nine
 /colon
 /semicolon
 /less
 /equal
 /greater
 /question
 /at
 /A
 /B
 /C
 /D
 /E
 /F
 /G
 /H
 /I
 /J
 /K
 /L
 /M
 /N
 /O
 /P
 /Q
 /R
 /S
 /T
 /U
 /V
 /W
 /X
 /Y
 /Z
 /bracketleft
 /backslash
 /bracketright
 /asciicircum
 /underscore
 /grave
 /a
 /b
 /c
 /d
 /e
 /f
 /g
 /h
 /i
 /j
 /k
 /l
 /m
 /n
 /o
 /p
 /q
 /r
 /s
 /t
 /u
 /v
 /w
 /x
 /y
 /z
 /braceleft
 /bar
 /braceright
 /asciitilde
 /.notdef
 /.notdef
 /.notdef
 /.notdef
 /.notdef
 /.notdef
 /.notdef
 /.notdef
 /.notdef
 /.notdef
 /.notdef
 /.notdef
 /.notdef
 /.notdef
 /.notdef
 /.notdef
 /.notdef
 /.notdef
 /.notdef
 /.notdef
 /.notdef
 /.notdef
 /.notdef
 /.notdef
 /.notdef
 /.notdef
 /.notdef
 /.notdef
 /.notdef
 /.notdef
 /.notdef
 /.notdef
 /.notdef
 /space
 /exclamdown
 /cent
 /sterling
 /currency
 /yen
 /brokenbar
 /section
 /dieresis
 /copyright
 /ordfeminine
 /guillemotleft
 /logicalnot
 /hyphen
 /registered
 /macron
 /degree
 /plusminus
 /twosuperior
 /threesuperior
 /acute
 /mu
 /paragraph
 /periodcentered
 /cedilla
 /onesuperior
 /ordmasculine
 /guillemotright
 /onequarter
 /onehalf
 /threequarters
 /questiondown
 /Agrave
 /Aacute
 /Acircumflex
 /Atilde
 /Adieresis
 /Aring
 /AE
 /Ccedilla
 /Egrave
 /Eacute
 /Ecircumflex
 /Edieresis
 /Igrave
 /Iacute
 /Icircumflex
 /Idieresis
 /Eth
 /Ntilde
 /Ograve
 /Oacute
 /Ocircumflex
 /Otilde
 /Odieresis
 /multiply
 /Oslash
 /Ugrave
 /Uacute
 /Ucircumflex
 /Udieresis
 /Yacute
 /Thorn
 /germandbls
 /agrave
 /aacute
 /acircumflex
 /atilde
 /adieresis
 /aring
 /ae
 /ccedilla
 /egrave
 /eacute
 /ecircumflex
 /edieresis
 /igrave
 /iacute
 /icircumflex
 /idieresis
 /eth
 /ntilde
 /ograve
 /oacute
 /ocircumflex
 /otilde
 /odieresis
 /divide
 /oslash
 /ugrave
 /uacute
 /ucircumflex
 /udieresis
 /yacute
 /thorn
 /ydieresis
] def
%%EndProlog
%%BeginSetup
%%EndSetup
612.00 612.00 scale
n
0.0000 0.0000 m
0.0000 1.0000 l
1.2941 1.0000 l
1.2941 0.0000 l
c
[/DeviceRGB] SCS
Color0 SC
fill
[/DeviceRGB] SCS
Color1 SC
[] 0 SD
0.0030 SLW
0 SLC
0 SLJ
n
0.1500 0.1848 m
0.1500 0.2045 l
0.1700 0.2045 l
0.1700 0.2340 l
0.1900 0.2340 l
0.1900 0.2609 l
0.2100 0.2609 l
0.2100 0.2838 l
0.2300 0.2838 l
0.2300 0.2877 l
0.2500 0.2877 l
0.2500 0.3097 l
0.2700 0.3097 l
0.2700 0.3221 l
0.2900 0.3221 l
0.2900 0.3416 l
0.3100 0.3416 l
0.3100 0.3401 l
0.3300 0.3401 l
0.3300 0.3564 l
0.3500 0.3564 l
0.3500 0.3649 l
0.3700 0.3649 l
0.3700 0.3665 l
0.3900 0.3665 l
0.3900 0.4037 l
0.4100 0.4037 l
0.4100 0.3918 l
0.4300 0.3918 l
0.4300 0.3981 l
0.4500 0.3981 l
0.4500 0.4154 l
0.4700 0.4154 l
0.4700 0.4108 l
0.4900 0.4108 l
0.4900 0.4439 l
0.5100 0.4439 l
0.5100 0.4615 l
0.5300 0.4615 l
0.5300 0.4847 l
0.5500 0.4847 l
0.5500 0.5101 l
0.5700 0.5101 l
0.5700 0.5089 l
0.5900 0.5089 l
0.5900 0.5312 l
0.6100 0.5312 l
0.6100 0.5658 l
0.6300 0.5658 l
0.6300 0.5641 l
0.6500 0.5641 l
0.6500 0.6052 l
0.6700 0.6052 l
0.6700 0.6374 l
0.6900 0.6374 l
0.6900 0.6880 l
0.7100 0.6880 l
0.7100 0.7189 l
0.7300 0.7189 l
0.7300 0.7092 l
0.7500 0.7092 l
0.7500 0.6658 l
0.7700 0.6658 l
0.7700 0.4796 l
0.7900 0.4796 l
0.7900 0.3990 l
0.8100 0.3990 l
0.8100 0.3189 l
0.8300 0.3189 l
0.8300 0.2975 l
0.8500 0.2975 l
0.8500 0.2678 l
0.8700 0.2678 l
0.8700 0.2478 l
0.8900 0.2478 l
0.8900 0.2277 l
0.9100 0.2277 l
0.9100 0.2320 l
0.9300 0.2320 l
0.9300 0.2154 l
0.9500 0.2154 l
0.9500 0.2056 l
0.9700 0.2056 l
0.9700 0.2029 l
0.9900 0.2029 l
0.9900 0.2043 l
1.0100 0.2043 l
1.0100 0.1970 l
1.0300 0.1970 l
1.0300 0.1904 l
1.0500 0.1904 l
1.0500 0.1837 l
1.0700 0.1837 l
1.0700 0.1815 l
1.0900 0.1815 l
1.0900 0.1789 l
1.1100 0.1789 l
1.1100 0.1786 l
1.1300 0.1786 l
1.1300 0.1774 l
1.1500 0.1774 l
1.1500 0.1757 l
1.1501 0.1757 l
s
[/DeviceRGB] SCS
Color2 SC
[] 0 SD
0.0023 SLW
n
0.1500 0.1830 m
0.1500 0.2023 l
0.1700 0.2023 l
0.1700 0.2250 l
0.1900 0.2250 l
0.1900 0.2470 l
0.2100 0.2470 l
0.2100 0.2687 l
0.2300 0.2687 l
0.2300 0.2816 l
0.2500 0.2816 l
0.2500 0.2927 l
0.2700 0.2927 l
0.2700 0.3065 l
0.2900 0.3065 l
0.2900 0.3188 l
0.3100 0.3188 l
0.3100 0.3228 l
0.3300 0.3228 l
0.3300 0.3406 l
0.3500 0.3406 l
0.3500 0.3479 l
0.3700 0.3479 l
0.3700 0.3489 l
0.3900 0.3489 l
0.3900 0.3772 l
0.4100 0.3772 l
0.4100 0.3690 l
0.4300 0.3690 l
0.4300 0.3840 l
0.4500 0.3840 l
0.4500 0.3900 l
0.4700 0.3900 l
0.4700 0.4033 l
0.4900 0.4033 l
0.4900 0.4147 l
0.5100 0.4147 l
0.5100 0.4384 l
0.5300 0.4384 l
0.5300 0.4560 l
0.5500 0.4560 l
0.5500 0.4663 l
0.5700 0.4663 l
0.5700 0.4937 l
0.5900 0.4937 l
0.5900 0.4898 l
0.6100 0.4898 l
0.6100 0.5183 l
0.6300 0.5183 l
0.6300 0.5468 l
0.6500 0.5468 l
0.6500 0.5692 l
0.6700 0.5692 l
0.6700 0.5983 l
0.6900 0.5983 l
0.6900 0.6477 l
0.7100 0.6477 l
0.7100 0.6578 l
0.7300 0.6578 l
0.7300 0.6925 l
0.7500 0.6925 l
0.7500 0.6227 l
0.7700 0.6227 l
0.7700 0.4514 l
0.7900 0.4514 l
0.7900 0.3675 l
0.8100 0.3675 l
0.8100 0.3185 l
0.8300 0.3185 l
0.8300 0.2821 l
0.8500 0.2821 l
0.8500 0.2555 l
0.8700 0.2555 l
0.8700 0.2430 l
0.8900 0.2430 l
0.8900 0.2312 l
0.9100 0.2312 l
0.9100 0.2173 l
0.9300 0.2173 l
0.9300 0.2062 l
0.9500 0.2062 l
0.9500 0.2029 l
0.9700 0.2029 l
0.9700 0.1999 l
0.9900 0.1999 l
0.9900 0.1997 l
1.0100 0.1997 l
1.0100 0.1893 l
1.0300 0.1893 l
1.0300 0.1845 l
1.0500 0.1845 l
1.0500 0.1868 l
1.0700 0.1868 l
1.0700 0.1777 l
1.0900 0.1777 l
1.0900 0.1786 l
1.1100 0.1786 l
1.1100 0.1774 l
1.1300 0.1774 l
1.1300 0.1758 l
1.1500 0.1758 l
1.1500 0.1742 l
1.1501 0.1742 l
s
[] 0 SD
0.0030 SLW
n
0.1500 0.1898 m
0.1500 0.2052 l
0.1700 0.2052 l
0.1700 0.2393 l
0.1900 0.2393 l
0.1900 0.2693 l
0.2100 0.2693 l
0.2100 0.2872 l
0.2300 0.2872 l
0.2300 0.3170 l
0.2500 0.3170 l
0.2500 0.3194 l
0.2700 0.3194 l
0.2700 0.3295 l
0.2900 0.3295 l
0.2900 0.3451 l
0.3100 0.3451 l
0.3100 0.3823 l
0.3300 0.3823 l
0.3300 0.3444 l
0.3500 0.3444 l
0.3500 0.3943 l
0.3700 0.3943 l
0.3700 0.3791 l
0.3900 0.3791 l
0.3900 0.4028 l
0.4100 0.4028 l
0.4100 0.4262 l
0.4300 0.4262 l
0.4300 0.4164 l
0.4500 0.4164 l
0.4500 0.4225 l
0.4700 0.4225 l
0.4700 0.4571 l
0.4900 0.4571 l
0.4900 0.4315 l
0.5100 0.4315 l
0.5100 0.4718 l
0.5300 0.4718 l
0.5300 0.5083 l
0.5500 0.5083 l
0.5500 0.5335 l
0.5700 0.5335 l
0.5700 0.5349 l
0.5900 0.5349 l
0.5900 0.5504 l
0.6100 0.5504 l
0.6100 0.6019 l
0.6300 0.6019 l
0.6300 0.5719 l
0.6500 0.5719 l
0.6500 0.5864 l
0.6700 0.5864 l
0.6700 0.6513 l
0.6900 0.6513 l
0.6900 0.6903 l
0.7100 0.6903 l
0.7100 0.6997 l
0.7300 0.6997 l
0.7300 0.7279 l
0.7500 0.7279 l
0.7500 0.6711 l
0.7700 0.6711 l
0.7700 0.4906 l
0.7900 0.4906 l
0.7900 0.4094 l
0.8100 0.4094 l
0.8100 0.3440 l
0.8300 0.3440 l
0.8300 0.2894 l
0.8500 0.2894 l
0.8500 0.2699 l
0.8700 0.2699 l
0.8700 0.2489 l
0.8900 0.2489 l
0.8900 0.2401 l
0.9100 0.2401 l
0.9100 0.2179 l
0.9300 0.2179 l
0.9300 0.2238 l
0.9500 0.2238 l
0.9500 0.2099 l
0.9700 0.2099 l
0.9700 0.2001 l
0.9900 0.2001 l
0.9900 0.2003 l
1.0100 0.2003 l
1.0100 0.2076 l
1.0300 0.2076 l
1.0300 0.1874 l
1.0500 0.1874 l
1.0500 0.1907 l
1.0700 0.1907 l
1.0700 0.1902 l
1.0900 0.1902 l
1.0900 0.1791 l
1.1100 0.1791 l
1.1100 0.1803 l
1.1300 0.1803 l
1.1300 0.1792 l
1.1500 0.1792 l
1.1500 0.1791 l
1.1501 0.1791 l
s
[/DeviceRGB] SCS
Color4 SC
n
0.1500 0.1770 m
0.1500 0.1925 l
0.1700 0.1925 l
0.1700 0.2171 l
0.1900 0.2171 l
0.1900 0.2267 l
0.2100 0.2267 l
0.2100 0.2511 l
0.2300 0.2511 l
0.2300 0.2628 l
0.2500 0.2628 l
0.2500 0.2761 l
0.2700 0.2761 l
0.2700 0.2908 l
0.2900 0.2908 l
0.2900 0.2961 l
0.3100 0.2961 l
0.3100 0.2921 l
0.3300 0.2921 l
0.3300 0.3159 l
0.3500 0.3159 l
0.3500 0.3266 l
0.3700 0.3266 l
0.3700 0.3296 l
0.3900 0.3296 l
0.3900 0.3479 l
0.4100 0.3479 l
0.4100 0.3325 l
0.4300 0.3325 l
0.4300 0.3574 l
0.4500 0.3574 l
0.4500 0.3450 l
0.4700 0.3450 l
0.4700 0.3718 l
0.4900 0.3718 l
0.4900 0.3880 l
0.5100 0.3880 l
0.5100 0.4096 l
0.5300 0.4096 l
0.5300 0.4056 l
0.5500 0.4056 l
0.5500 0.4210 l
0.5700 0.4210 l
0.5700 0.4709 l
0.5900 0.4709 l
0.5900 0.4245 l
0.6100 0.4245 l
0.6100 0.4730 l
0.6300 0.4730 l
0.6300 0.5217 l
0.6500 0.5217 l
0.6500 0.5380 l
0.6700 0.5380 l
0.6700 0.5672 l
0.6900 0.5672 l
0.6900 0.6028 l
0.7100 0.6028 l
0.7100 0.5937 l
0.7300 0.5937 l
0.7300 0.6473 l
0.7500 0.6473 l
0.7500 0.5561 l
0.7700 0.5561 l
0.7700 0.4034 l
0.7900 0.4034 l
0.7900 0.3411 l
0.8100 0.3411 l
0.8100 0.2938 l
0.8300 0.2938 l
0.8300 0.2687 l
0.8500 0.2687 l
0.8500 0.2299 l
0.8700 0.2299 l
0.8700 0.2223 l
0.8900 0.2223 l
0.8900 0.2075 l
0.9100 0.2075 l
0.9100 0.1989 l
0.9300 0.1989 l
0.9300 0.1849 l
0.9500 0.1849 l
0.9500 0.1908 l
0.9700 0.1908 l
0.9700 0.1857 l
0.9900 0.1857 l
0.9900 0.1871 l
1.0100 0.1871 l
1.0100 0.1722 l
1.0300 0.1722 l
1.0300 0.1715 l
1.0500 0.1715 l
1.0500 0.1743 l
1.0700 0.1743 l
1.0700 0.1724 l
1.0900 0.1724 l
1.0900 0.1736 l
1.1100 0.1736 l
1.1100 0.1724 l
1.1300 0.1724 l
1.1300 0.1699 l
1.1500 0.1699 l
1.1500 0.1687 l
1.1501 0.1687 l
s
n
0.1500 0.1966 m
0.1500 0.2152 l
0.1700 0.2152 l
0.1700 0.2462 l
0.1900 0.2462 l
0.1900 0.2907 l
0.2100 0.2907 l
0.2100 0.3006 l
0.2300 0.3006 l
0.2300 0.3455 l
0.2500 0.3455 l
0.2500 0.3359 l
0.2700 0.3359 l
0.2700 0.3450 l
0.2900 0.3450 l
0.2900 0.3666 l
0.3100 0.3666 l
0.3100 0.4238 l
0.3300 0.4238 l
0.3300 0.3931 l
0.3500 0.3931 l
0.3500 0.4211 l
0.3700 0.4211 l
0.3700 0.4024 l
0.3900 0.4024 l
0.3900 0.4309 l
0.4100 0.4309 l
0.4100 0.4754 l
0.4300 0.4754 l
0.4300 0.4460 l
0.4500 0.4460 l
0.4500 0.4668 l
0.4700 0.4668 l
0.4700 0.4988 l
0.4900 0.4988 l
0.4900 0.4772 l
0.5100 0.4772 l
0.5100 0.5025 l
0.5300 0.5025 l
0.5300 0.5640 l
0.5500 0.5640 l
0.5500 0.5748 l
0.5700 0.5748 l
0.5700 0.5667 l
0.5900 0.5667 l
0.5900 0.6187 l
0.6100 0.6187 l
0.6100 0.6472 l
0.6300 0.6472 l
0.6300 0.6037 l
0.6500 0.6037 l
0.6500 0.6521 l
0.6700 0.6521 l
0.6700 0.6925 l
0.6900 0.6925 l
0.6900 0.7303 l
0.7100 0.7303 l
0.7100 0.7924 l
0.7300 0.7924 l
0.7300 0.7924 l
0.7500 0.7924 l
0.7500 0.7339 l
0.7700 0.7339 l
0.7700 0.5391 l
0.7900 0.5391 l
0.7900 0.4336 l
0.8100 0.4336 l
0.8100 0.3760 l
0.8300 0.3760 l
0.8300 0.3183 l
0.8500 0.3183 l
0.8500 0.2880 l
0.8700 0.2880 l
0.8700 0.2711 l
0.8900 0.2711 l
0.8900 0.2577 l
0.9100 0.2577 l
0.9100 0.2604 l
0.9300 0.2604 l
0.9300 0.2440 l
0.9500 0.2440 l
0.9500 0.2217 l
0.9700 0.2217 l
0.9700 0.2192 l
0.9900 0.2192 l
0.9900 0.2209 l
1.0100 0.2209 l
1.0100 0.2242 l
1.0300 0.2242 l
1.0300 0.2052 l
1.0500 0.2052 l
1.0500 0.1983 l
1.0700 0.1983 l
1.0700 0.1975 l
1.0900 0.1975 l
1.0900 0.1841 l
1.1100 0.1841 l
1.1100 0.1852 l
1.1300 0.1852 l
1.1300 0.1861 l
1.1500 0.1861 l
1.1500 0.1848 l
1.1501 0.1848 l
s
[/DeviceRGB] SCS
Color1 SC
[] 0 SD
0.0015 SLW
n
0.1500 0.1500 m
1.1500 0.1500 l
s
n
0.1500 0.8500 m
1.1500 0.8500 l
s
[] 0 SD
0.0030 SLW
n
0.3500 0.1500 m
0.3500 0.1600 l
s
n
0.3500 0.8500 m
0.3500 0.8400 l
s
n
0.7500 0.1500 m
0.7500 0.1600 l
s
n
0.7500 0.8500 m
0.7500 0.8400 l
s
n
1.1500 0.1500 m
1.1500 0.1600 l
s
n
1.1500 0.8500 m
1.1500 0.8400 l
s
n
0.1500 0.1500 m
0.1500 0.1700 l
s
n
0.1500 0.8500 m
0.1500 0.8300 l
s
n
0.5500 0.1500 m
0.5500 0.1700 l
s
n
0.5500 0.8500 m
0.5500 0.8300 l
s
n
0.9500 0.1500 m
0.9500 0.1700 l
s
n
0.9500 0.8500 m
0.9500 0.8300 l
s
/Times-Roman findfont
dup length dict begin
 {1 index /FID ne {def} {pop pop} ifelse} forall
 /Encoding DefEncoding def
 currentdict
end
/Font0 exch definefont pop
/Font0 FFSF
0.1418 0.1169 m
GS
[0.0344 0.0000 0.0000 0.0344 0 0] CC
(0) show
GR
/Font0 FFSF
0.5418 0.1169 m
GS
[0.0344 0.0000 0.0000 0.0344 0 0] CC
(2) show
GR
/Font0 FFSF
0.9420 0.1169 m
GS
[0.0344 0.0000 0.0000 0.0344 0 0] CC
(4) show
GR
/Font0 FFSF
0.6063 0.0833 m
GS
[0.0344 0.0000 0.0000 0.0344 0 0] CC
(R\(t,H\)) show
GR
[] 0 SD
0.0015 SLW
n
0.1500 0.1500 m
0.1500 0.8500 l
s
n
1.1500 0.1500 m
1.1500 0.8500 l
s
[] 0 SD
0.0030 SLW
n
0.1500 0.2231 m
0.1600 0.2231 l
s
n
1.1500 0.2231 m
1.1400 0.2231 l
s
n
0.1500 0.3276 m
0.1600 0.3276 l
s
n
1.1500 0.3276 m
1.1400 0.3276 l
s
n
0.1500 0.4321 m
0.1600 0.4321 l
s
n
1.1500 0.4321 m
1.1400 0.4321 l
s
n
0.1500 0.5366 m
0.1600 0.5366 l
s
n
1.1500 0.5366 m
1.1400 0.5366 l
s
n
0.1500 0.6410 m
0.1600 0.6410 l
s
n
1.1500 0.6410 m
1.1400 0.6410 l
s
n
0.1500 0.7455 m
0.1600 0.7455 l
s
n
1.1500 0.7455 m
1.1400 0.7455 l
s
n
0.1500 0.8500 m
0.1600 0.8500 l
s
n
1.1500 0.8500 m
1.1400 0.8500 l
s
n
0.1500 0.1709 m
0.1700 0.1709 l
s
n
1.1500 0.1709 m
1.1300 0.1709 l
s
n
0.1500 0.2754 m
0.1700 0.2754 l
s
n
1.1500 0.2754 m
1.1300 0.2754 l
s
n
0.1500 0.3799 m
0.1700 0.3799 l
s
n
1.1500 0.3799 m
1.1300 0.3799 l
s
n
0.1500 0.4843 m
0.1700 0.4843 l
s
n
1.1500 0.4843 m
1.1300 0.4843 l
s
n
0.1500 0.5888 m
0.1700 0.5888 l
s
n
1.1500 0.5888 m
1.1300 0.5888 l
s
n
0.1500 0.6933 m
0.1700 0.6933 l
s
n
1.1500 0.6933 m
1.1300 0.6933 l
s
n
0.1500 0.7978 m
0.1700 0.7978 l
s
n
1.1500 0.7978 m
1.1300 0.7978 l
s
/Font0 FFSF
0.1235 0.1595 m
GS
[0.0344 0.0000 0.0000 0.0344 0 0] CC
(0) show
GR
/Font0 FFSF
0.0831 0.2640 m
GS
[0.0344 0.0000 0.0000 0.0344 0 0] CC
(0.01) show
GR
/Font0 FFSF
0.0804 0.3685 m
GS
[0.0344 0.0000 0.0000 0.0344 0 0] CC
(0.02) show
GR
/Font0 FFSF
0.0820 0.4730 m
GS
[0.0344 0.0000 0.0000 0.0344 0 0] CC
(0.03) show
GR
/Font0 FFSF
0.0808 0.5774 m
GS
[0.0344 0.0000 0.0000 0.0344 0 0] CC
(0.04) show
GR
/Font0 FFSF
0.0820 0.6817 m
GS
[0.0344 0.0000 0.0000 0.0344 0 0] CC
(0.05) show
GR
/Font0 FFSF
0.0808 0.7862 m
GS
[0.0344 0.0000 0.0000 0.0344 0 0] CC
(0.06) show
GR
/Font0 FFSF
0.0629 0.3916 m
GS
[0.0000 0.0344 -0.0344 0.0000 0 0] CC
(d) show
GR
/Symbol findfont
/Font12 exch definefont pop
/Font12 FFSF
0.0629 0.4088 m
GS
[0.0000 0.0344 -0.0344 0.0000 0 0] CC
(s) show
GR
/Font0 FFSF
0.0629 0.4296 m
GS
[0.0000 0.0344 -0.0344 0.0000 0 0] CC
(/dR\(t,H\) [pb]) show
GR
/Font0 FFSF
1.1892 0.5475 m
GS
[0.0000 0.0280 -0.0280 0.0000 0 0] CC
(LHC HIGGS XS WG 2011) show
GR
n
0.1500 0.1500 m
0.1500 0.8500 l
1.1500 0.8500 l
1.1500 0.1500 l
0.1500 0.1500 l
c
s
n
0.8100 0.7769 m
0.8100 0.6663 l
1.1072 0.6663 l
1.1072 0.7769 l
c
[/DeviceRGB] SCS
Color0 SC
fill
[/DeviceRGB] SCS
Color1 SC
[] 0 SD
0.0015 SLW
n
0.8100 0.7769 m
0.8100 0.6663 l
1.1072 0.6663 l
1.1072 0.7769 l
0.8100 0.7769 l
c
s
/Font0 FFSF
0.8815 0.7437 m
GS
[0.0339 0.0000 0.0000 0.0339 0 0] CC
(central value) show
GR
[] 0 SD
0.0030 SLW
n
0.8215 0.7551 m
0.8615 0.7551 l
s
/Font0 FFSF
0.8815 0.7102 m
GS
[0.0339 0.0000 0.0000 0.0339 0 0] CC
(error from scale) show
GR
[/DeviceRGB] SCS
Color2 SC
[] 0 SD
0.0023 SLW
n
0.8215 0.7216 m
0.8615 0.7216 l
s
/Font0 FFSF
[/DeviceRGB] SCS
Color1 SC
0.8815 0.6767 m
GS
[0.0339 0.0000 0.0000 0.0339 0 0] CC
(total error) show
GR
[/DeviceRGB] SCS
Color4 SC
[] 0 SD
0.0030 SLW
n
0.8215 0.6880 m
0.8615 0.6880 l
s
/Font0 FFSF
[/DeviceRGB] SCS
Color1 SC
0.2659 0.6507 m
GS
[0.0339 0.0000 0.0000 0.0339 0 0] CC
(LHC with 7 TeV) show
GR
%%Trailer
%%BoundingBox: 23 46 730 523
%%DocumentNeededResources: font Times-Roman
%%+ font Symbol
%%EOF
