%!PS-Adobe-2.0 EPSF-2.0
%%BoundingBox:  0 0 567 545
%%Title: /home/shiki/Desktop/MCFM/YR/CUT2/CUT2_MCFM_POWHEG_LHC.eps: Higgs Cross Section
%%Creator: ROOT Version 5.28/00
%%CreationDate: Tue Nov 22 18:48:00 2011
%%EndComments
%%BeginProlog
80 dict begin
/s {stroke} def /l {lineto} def /m {moveto} def /t {translate} def
/r {rotate} def /rl {roll}  def /R {repeat} def
/d {rlineto} def /rm {rmoveto} def /gr {grestore} def /f {eofill} def
/c {setrgbcolor} def /black {0 setgray} def /sd {setdash} def
/cl {closepath} def /sf {scalefont setfont} def /lw {setlinewidth} def
/box {m dup 0 exch d exch 0 d 0 exch neg d cl} def
/NC{systemdict begin initclip end}def/C{NC box clip newpath}def
/bl {box s} def /bf {box f} def /Y { 0 exch d} def /X { 0 d} def 
/K {{pop pop 0 moveto} exch kshow} bind def
/ita {/ang 15 def gsave [1 0 ang dup sin exch cos div 1 0 0] concat} def 
/mp {newpath /y exch def /x exch def} def
/side {[w .77 mul w .23 mul] .385 w mul sd w 0 l currentpoint t -144 r} def
/mr {mp x y w2 0 360 arc} def /m24 {mr s} def /m20 {mr f} def
/mb {mp x y w2 add m w2 neg 0 d 0 w neg d w 0 d 0 w d cl} def
/mt {mp x y w2 add m w2 neg w neg d w 0 d cl} def
/m21 {mb f} def /m25 {mb s} def /m22 {mt f} def /m26{mt s} def
/m23 {mp x y w2 sub m w2 w d w neg 0 d cl f} def
/m27 {mp x y w2 add m w3 neg w2 neg d w3 w2 neg d w3 w2 d cl s} def
/m28 {mp x w2 sub y w2 sub w3 add m w3 0 d  0 w3 neg d w3 0 d 0 w3 d w3 0 d  0 w3 d w3 neg 0 d 0 w3 d w3 neg 0 d 0 w3 neg d w3 neg 0 d cl s } def
/m29 {mp gsave x w2 sub y w2 add w3 sub m currentpoint t 4 {side} repeat cl fill gr} def
/m30 {mp gsave x w2 sub y w2 add w3 sub m currentpoint t 4 {side} repeat cl s gr} def
/m31 {mp x y w2 sub m 0 w d x w2 sub y m w 0 d x w2 sub y w2 add m w w neg d x w2 sub y w2 sub m w w d s} def
/m32 {mp x y w2 sub m w2 w d w neg 0 d cl s} def
/m33 {mp x y w2 add m w3 neg w2 neg d w3 w2 neg d w3 w2 d cl f} def
/m34 {mp x w2 sub y w2 sub w3 add m w3 0 d  0 w3 neg d w3 0 d 0 w3 d w3 0 d  0 w3 d w3 neg 0 d 0 w3 d w3 neg 0 d 0 w3 neg d w3 neg 0 d cl f } def
/m2 {mp x y w2 sub m 0 w d x w2 sub y m w 0 d s} def
/m5 {mp x w2 sub y w2 sub m w w d x w2 sub y w2 add m w w neg d s} def
/reEncode {exch findfont dup length dict begin {1 index /FID eq  {pop pop} {def} ifelse } forall /Encoding exch def currentdict end dup /FontName get exch definefont pop } def [/Times-Bold /Times-Italic /Times-BoldItalic /Helvetica /Helvetica-Oblique
 /Helvetica-Bold /Helvetica-BoldOblique /Courier /Courier-Oblique /Courier-Bold /Courier-BoldOblique /Times-Roman /AvantGarde-Book /AvantGarde-BookOblique /AvantGarde-Demi /AvantGarde-DemiOblique /Bookman-Demi /Bookman-DemiItalic /Bookman-Light
 /Bookman-LightItalic /Helvetica-Narrow /Helvetica-Narrow-Bold /Helvetica-Narrow-BoldOblique /Helvetica-Narrow-Oblique /NewCenturySchlbk-Roman /NewCenturySchlbk-Bold /NewCenturySchlbk-BoldItalic /NewCenturySchlbk-Italic /Palatino-Bold
 /Palatino-BoldItalic /Palatino-Italic /Palatino-Roman ] {ISOLatin1Encoding reEncode } forall%%EndProlog
%%BeginSetup
%%EndSetup
newpath  gsave  .25 .25 scale  gsave  0 0 t black[  ] 0 sd 3 lw 1 1 1 c 2268 2181 0 0 bf black 1 1 1 c 1791 1723 363 349 bf black 1791 1723 363 349 bl 1 1 1 c 1791 1723 363 349 bf black 1791 1723 363 349 bl 6 lw 1 1 1 c black 363 349 m 1791 X s 3 lw
 363 349 m 1791 X s
 gsave  2268 2181 0 0 C 1930.62 163.25 t 0 r /Helvetica findfont 79.6961 sf 0 0 m ( [GeV]) show NC gr 
 gsave  2268 2181 0 0 C 1890.75 141.5 t 0 r /Helvetica findfont 54.3383 sf 0 0 m (4l) show NC gr 
 gsave  2268 2181 0 0 C 1829.19 163.25 t 0 r /Helvetica findfont 79.6961 sf 0 0 m (M) show NC gr  432 401 m -52 Y s 501 375 m -26 Y s 570 375 m -26 Y s 638 375 m -26 Y s 707 375 m -26 Y s 776 401 m -52 Y s 845 375 m -26 Y s 914 375 m -26 Y s 983 375
 m -26 Y s 1052 375 m -26 Y s 1121 401 m -52 Y s 1190 375 m -26 Y s 1259 375 m -26 Y s 1327 375 m -26 Y s 1396 375 m -26 Y s 1465 401 m -52 Y s 1534 375 m -26 Y s 1603 375 m -26 Y s 1672 375 m -26 Y s 1741 375 m -26 Y s 1810 401 m -52 Y s 1879 375 m
 -26 Y s 1948 375 m -26 Y s 2017 375 m -26 Y s 2085 375 m -26 Y s 2154 401 m -52 Y s 432 401 m -52 Y s
 gsave  2268 2181 0 0 C 365.688 271.938 t 0 r /Helvetica findfont 79.6961 sf 0 0 m (100) show NC gr 
 gsave  2268 2181 0 0 C 709.812 271.938 t 0 r /Helvetica findfont 79.6961 sf 0 0 m (200) show NC gr 
 gsave  2268 2181 0 0 C 1053.94 271.938 t 0 r /Helvetica findfont 79.6961 sf 0 0 m (300) show NC gr 
 gsave  2268 2181 0 0 C 1398.12 271.938 t 0 r /Helvetica findfont 79.6961 sf 0 0 m (400) show NC gr 
 gsave  2268 2181 0 0 C 1742.25 271.938 t 0 r /Helvetica findfont 79.6961 sf 0 0 m (500) show NC gr 
 gsave  2268 2181 0 0 C 2086.38 271.938 t 0 r /Helvetica findfont 79.6961 sf 0 0 m (600) show NC gr  363 2072 m 1791 X s 432 2020 m 52 Y s 501 2046 m 26 Y s 570 2046 m 26 Y s 638 2046 m 26 Y s 707 2046 m 26 Y s 776 2020 m 52 Y s 845 2046 m 26 Y s 914
 2046 m 26 Y s 983 2046 m 26 Y s 1052 2046 m 26 Y s 1121 2020 m 52 Y s 1190 2046 m 26 Y s 1259 2046 m 26 Y s 1327 2046 m 26 Y s 1396 2046 m 26 Y s 1465 2020 m 52 Y s 1534 2046 m 26 Y s 1603 2046 m 26 Y s 1672 2046 m 26 Y s 1741 2046 m 26 Y s 1810
 2020 m 52 Y s 1879 2046 m 26 Y s 1948 2046 m 26 Y s 2017 2046 m 26 Y s 2085 2046 m 26 Y s 2154 2020 m 52 Y s 432 2020 m 52 Y s 363 349 m 1723 Y s
 gsave  2268 2181 0 0 C 162.812 2025.19 t 90 r /Helvetica findfont 79.6961 sf 0 0 m ( \)) show NC gr 
 gsave  2268 2181 0 0 C 122.938 1988.94 t 90 r /Helvetica findfont 54.3383 sf 0 0 m (\2551) show NC gr 
 gsave  2268 2181 0 0 C 162.812 757.312 t 90 r /Helvetica findfont 79.6961 sf 0 0 m (Events/10GeV \( Normalized to 1 fb) show NC gr  390 349 m -27 X s 390 390 m -27 X s 390 425 m -27 X s 390 455 m -27 X s 390 482 m -27 X s 417 506 m -54 X s
 gsave  2268 2181 0 0 C 296.812 503.75 t 0 r /Helvetica findfont 54.3383 sf 0 0 m (\2552) show NC gr 
 gsave  2268 2181 0 0 C 209.875 471.125 t 0 r /Helvetica findfont 79.6961 sf 0 0 m (10) show NC gr  390 663 m -27 X s 390 755 m -27 X s 390 820 m -27 X s 390 871 m -27 X s 390 912 m -27 X s 390 947 m -27 X s 390 977 m -27 X s 390 1004 m -27 X s 417
 1028 m -54 X s
 gsave  2268 2181 0 0 C 304.062 1025.38 t 0 r /Helvetica findfont 54.3383 sf 0 0 m (\2551) show NC gr 
 gsave  2268 2181 0 0 C 217.125 992.812 t 0 r /Helvetica findfont 79.6961 sf 0 0 m (10) show NC gr  390 1185 m -27 X s 390 1277 m -27 X s 390 1342 m -27 X s 390 1393 m -27 X s 390 1434 m -27 X s 390 1469 m -27 X s 390 1499 m -27 X s 390 1526 m -27 X
 s 417 1550 m -54 X s
 gsave  2268 2181 0 0 C 344.062 1515.19 t 0 r  -45 0 t /Helvetica findfont 79.6961 sf 0 0 m (1) show NC gr  390 1707 m -27 X s 390 1799 m -27 X s 390 1864 m -27 X s 390 1915 m -27 X s 390 1956 m -27 X s 390 1991 m -27 X s 390 2021 m -27 X s 390 2048
 m -27 X s 417 2072 m -54 X s
 gsave  2268 2181 0 0 C 344.062 2037.12 t 0 r  -90 0 t /Helvetica findfont 79.6961 sf 0 0 m (10) show NC gr  2154 349 m 1723 Y s 2127 349 m 27 X s 2127 390 m 27 X s 2127 425 m 27 X s 2127 455 m 27 X s 2127 482 m 27 X s 2101 506 m 53 X s 2127 663 m 27
 X s 2127 755 m 27 X s 2127 820 m 27 X s 2127 871 m 27 X s 2127 912 m 27 X s 2127 947 m 27 X s 2127 977 m 27 X s 2127 1004 m 27 X s 2101 1028 m 53 X s 2127 1185 m 27 X s 2127 1277 m 27 X s 2127 1342 m 27 X s 2127 1393 m 27 X s 2127 1434 m 27 X s 2127
 1469 m 27 X s 2127 1499 m 27 X s 2127 1526 m 27 X s 2101 1550 m 53 X s 2127 1707 m 27 X s 2127 1799 m 27 X s 2127 1864 m 27 X s 2127 1915 m 27 X s 2127 1956 m 27 X s 2127 1991 m 27 X s 2127 2021 m 27 X s 2127 2048 m 27 X s 2101 2072 m 53 X s 6 lw 1
 1 1 c 0 0 1 c 3 lw /w 29 def /w2 {w 2 div} def /w3 {w 3 div} def 380 1314 415 1623 449 1118 483 1243 518 1264 552 1242 587 1206 621 1176 656 1157 690 1176 725 1412 759 1522 793 1517 828 1494 862 1465 897 1431 931 1400 966 1367 1000 1329 1035 1293
 1069 1272 1104 1239 1138 1212 1172 1177 1207 1149 1241 1116 1276 1094 1310 1068 1345 1040 1379 1012 1414 988 1448 962 1483 934 1517 913 1551 878 1586 878 1620 852 1655 825 1689 809 1724 780 1758 764 1793 737 1827 690 1861 692 1896 680 1930 660 1965
 617 1999 573 2034 573 2068 567 50 { m24} R 6 lw 3 lw 2068 567 2103 552 2137 537 3 { m24} R 6 lw black 1 1 1 c 0.35 0.83 0.33 c 3 lw 380 1308 415 1618 449 1109 483 1233 518 1259 552 1240 587 1209 621 1176 656 1156 690 1180 725 1416 759 1519 793 1522
 828 1501 862 1470 897 1428 931 1407 966 1372 1000 1342 1035 1312 1069 1280 1104 1248 1138 1220 1172 1190 1207 1160 1241 1132 1276 1106 1310 1077 1345 1054 1379 1031 1414 1008 1448 977 1483 955 1517 933 1551 900 1586 880 1620 867 1655 848 1689 826
 1724 799 1758 775 1793 766 1827 746 1861 716 1896 685 1930 684 1965 651 1999 640 2034 617 2068 590 50 { m24} R 6 lw 3 lw 2068 590 2103 574 2137 574 3 { m24} R 6 lw black 1 1 1 c 1 0 0 c 3 lw 380 1316 415 1606 449 1119 483 1235 518 1256 552 1234 587
 1203 621 1170 656 1159 690 1175 725 1419 759 1518 793 1518 828 1494 862 1465 897 1429 931 1396 966 1361 1000 1332 1035 1298 1069 1272 1104 1240 1138 1200 1172 1182 1207 1145 1241 1123 1276 1076 1310 1068 1345 1041 1379 1006 1414 971 1448 943 1483
 931 1517 921 1551 882 1586 845 1620 836 1655 808 1689 787 1724 775 1758 723 1793 702 1827 703 1861 669 1896 647 1930 616 1965 609 1999 598 2034 569 2068 562 50 { m20} R 6 lw 3 lw 2068 562 2103 518 2137 537 3 { m20} R 6 lw black 1 1 1 c 1 0 1 c 3 lw
 380 1307 415 1615 449 1112 483 1228 518 1253 552 1237 587 1205 621 1173 656 1147 690 1177 725 1418 759 1517 793 1516 828 1492 862 1467 897 1426 931 1399 966 1363 1000 1334 1035 1304 1069 1271 1104 1239 1138 1215 1172 1181 1207 1157 1241 1125 1276
 1102 1310 1067 1345 1049 1379 1016 1414 998 1448 969 1483 947 1517 923 1551 896 1586 878 1620 854 1655 833 1689 798 1724 793 1758 756 1793 737 1827 718 1861 703 1896 694 1930 669 1965 639 1999 618 2034 611 2068 596 50 { m22} R 6 lw 3 lw 2068 596
 2103 612 2137 550 3 { m22} R 6 lw black
 gsave  2268 2181 0 0 C 554.062 1920.12 t 0 r /Helvetica findfont 101.431 sf 0 0 m 
 279 222 171 144 88 60
(= 7 TeV) K NC gr 
 gsave  2268 2181 0 0 C 506.938 1920.12 t 0 r /Helvetica findfont 101.431 sf 0 0 m (s) show NC gr  442 1974 m 43 -58 d s 0 lw 485 1916 m 11 87 d s 496 2003 m 58 X s
 gsave  2268 2181 0 0 C 2242.12 1355.06 t 90 r /Helvetica-BoldOblique findfont 61.5834 sf 0 0 m 
 674 645 611 577 560 513 455 438 397 356 339 299 251 204 187 142 125 81 37
(LHC HIGGS XS WG 2011) K NC gr  3 lw 1 1 1 c 891 536 1145 1380 bf black 1166 1380 m -14 Y 884 X 529 Y -14 X -515 Y f 1145 1380 m 536 Y 891 X -536 Y -891 X cl s
 gsave  2268 2181 0 0 C 1677.06 1865.75 t 0 r /Helvetica findfont 43.4706 sf 0 0 m (>12GeV) show NC gr 
 gsave  2268 2181 0 0 C 1644.44 1844.06 t 0 r /Helvetica findfont 28.9804 sf 0 0 m (Z2) show NC gr 
 gsave  2268 2181 0 0 C 1430.69 1865.75 t 0 r /Helvetica findfont 43.4706 sf 0 0 m 
 186 174 161 136 111 76 51 26
(>50GeV, M) K NC gr 
 gsave  2268 2181 0 0 C 1401.75 1851.25 t 0 r /Helvetica findfont 28.9804 sf 0 0 m (Z1) show NC gr 
 gsave  2268 2181 0 0 C 1365.5 1865.75 t 0 r /Helvetica findfont 43.4706 sf 0 0 m (M) show NC gr  0.999 0.999 0.999 c black
 gsave  2268 2181 0 0 C 1365.5 1767.94 t 0 r /Helvetica findfont 43.4706 sf 0 0 m 
 488 475 450 424 412 387 375 350 338 326 313 288 263 228 203 177 150 125 112 100 75 37 25
(e/mu: pT>5GeV, |eta|<2.5) K NC gr  0.999 0.999 0.999 c black
 gsave  2268 2181 0 0 C 1365.5 1677.38 t 0 r /Helvetica findfont 43.4706 sf 0 0 m (MSTW POWHEG 2e2mu) show NC gr  0 0 1 c 1256 1693 m24 black
 gsave  2268 2181 0 0 C 1365.5 1586.81 t 0 r /Helvetica findfont 43.4706 sf 0 0 m (MSTW MCFM 2e2mu) show NC gr  0.35 0.83 0.33 c 1256 1604 m24 black
 gsave  2268 2181 0 0 C 1365.5 1496.25 t 0 r /Helvetica findfont 43.4706 sf 0 0 m (CT10 POWHEG 2e2mu) show NC gr  1 0 0 c 1256 1514 m20 black
 gsave  2268 2181 0 0 C 1365.5 1409.38 t 0 r /Helvetica findfont 43.4706 sf 0 0 m (CT10 MCFM 2e2mu) show NC gr  1 0 1 c 1256 1425 m22
 gr  gr showpage
end
%%EOF
