%!PS-Adobe-2.0 EPSF-2.0
%%BoundingBox:  0 0 567 384
%%Title: /home/dimicco/HiggsScan/compare_MCNLO_MCFM/delta_hi_ll.eps: canvas_delta_phi_common
%%Creator: ROOT Version 5.26/00
%%CreationDate: Fri Dec  9 14:59:54 2011
%%EndComments
%%BeginProlog
80 dict begin
/s {stroke} def /l {lineto} def /m {moveto} def /t {translate} def
/sw {stringwidth} def /r {rotate} def /rl {roll}  def /R {repeat} def
/d {rlineto} def /rm {rmoveto} def /gr {grestore} def /f {eofill} def
/c {setrgbcolor} def /black {0 setgray} def /sd {setdash} def
/cl {closepath} def /sf {scalefont setfont} def /lw {setlinewidth} def
/box {m dup 0 exch d exch 0 d 0 exch neg d cl} def
/NC{systemdict begin initclip end}def/C{NC box clip newpath}def
/bl {box s} def /bf {box f} def /Y { 0 exch d} def /X { 0 d} def 
/mp {newpath /y exch def /x exch def} def
/side {[w .77 mul w .23 mul] .385 w mul sd w 0 l currentpoint t -144 r} def
/mr {mp x y w2 0 360 arc} def /m24 {mr s} def /m20 {mr f} def
/mb {mp x y w2 add m w2 neg 0 d 0 w neg d w 0 d 0 w d cl} def
/mt {mp x y w2 add m w2 neg w neg d w 0 d cl} def
/m21 {mb f} def /m25 {mb s} def /m22 {mt f} def /m26{mt s} def
/m23 {mp x y w2 sub m w2 w d w neg 0 d cl f} def
/m27 {mp x y w2 add m w3 neg w2 neg d w3 w2 neg d w3 w2 d cl s} def
/m28 {mp x w2 sub y w2 sub w3 add m w3 0 d  0 w3 neg d w3 0 d 0 w3 d w3 0 d  0 w3 d w3 neg 0 d 0 w3 d w3 neg 0 d
 0 w3 neg d w3 neg 0 d cl s } def
/m29 {mp gsave x w2 sub y w2 add w3 sub m currentpoint t
 4 {side} repeat cl fill gr} def
/m30 {mp gsave x w2 sub y w2 add w3 sub m currentpoint t
 4 {side} repeat cl s gr} def
/m31 {mp x y w2 sub m 0 w d x w2 sub y m w 0 d x w2 sub y w2 add m w w neg d x w2 sub y w2
 sub m w w d s} def
/m2 {mp x y w2 sub m 0 w d x w2 sub y m w 0 d s} def
/m5 {mp x w2 sub y w2 sub m w w d x w2 sub y w2 add m w w neg d s} def
/reEncode {exch findfont dup length dict begin {1 index /FID eq  {pop pop} {def} ifelse } forall /Encoding exch def currentdict end dup /FontName get exch definefont pop } def [/Times-Bold /Times-Italic /Times-BoldItalic /Helvetica
 /Helvetica-Oblique /Helvetica-Bold /Helvetica-BoldOblique /Courier /Courier-Oblique /Courier-Bold /Courier-BoldOblique /Times-Roman /AvantGarde-Book /AvantGarde-BookOblique /AvantGarde-Demi /AvantGarde-DemiOblique /Bookman-Demi
 /Bookman-DemiItalic /Bookman-Light /Bookman-LightItalic /Helvetica-Narrow /Helvetica-Narrow-Bold /Helvetica-Narrow-BoldOblique /Helvetica-Narrow-Oblique /NewCenturySchlbk-Roman /NewCenturySchlbk-Bold
 /NewCenturySchlbk-BoldItalic /NewCenturySchlbk-Italic /Palatino-Bold /Palatino-BoldItalic /Palatino-Italic /Palatino-Roman ] {ISOLatin1Encoding reEncode } forall
/oshow {gsave [] 0 sd true charpath stroke gr} def
/stwn { /fs exch def /fn exch def /text exch def fn findfont fs sf
 text sw pop xs add /xs exch def} def
/stwb { /fs exch def /fn exch def /nbas exch def /textf exch deftextf length /tlen exch def nbas tlen gt {/nbas tlendef} iffn findfont fs sf textf dup length nbas sub nbas getinterval sw
pop neg xs add /xs exch def} def
%%EndProlog
%%BeginSetup
%%EndSetup
newpath  gsave  .25 .25 scale  gsave  0 0 t black[  ] 0 sd 3 lw 1 1 1 c 2268 1538 0 0 bf black 1 1 1 c 1791 1215 363 246 bf black 1791 1215 363 246 bl 1 1 1 c 1791 1215 363 246 bf black 1791 1215 363 246 bl 1 0 0 c 6 lw 1 1 1 c 1 0 0 c 381 694 m 25
 Y s 381 745 m 26 Y s 363 732 m 5 X s 394 732 m 5 X s 3 lw /w 29 def /w2 {w 2 div} def /w3 {w 3 div} def 381 732 m20 6 lw 417 659 m 25 Y s 417 710 m 25 Y s 399 697 m 5 X s 430 697 m 4 X s 3 lw 417 697 m20 6 lw 452 647 m 25 Y s 452 698 m 25 Y s 434
 685 m 5 X s 465 685 m 5 X s 3 lw 452 685 m20 6 lw 488 629 m 24 Y s 488 679 m 25 Y s 470 666 m 5 X s 501 666 m 5 X s 3 lw 488 666 m20 6 lw 524 665 m 25 Y s 524 716 m 25 Y s 506 703 m 5 X s 537 703 m 5 X s 3 lw 524 703 m20 6 lw 560 624 m 25 Y s 560
 675 m 26 Y s 542 662 m 5 X s 573 662 m 5 X s 3 lw 560 662 m20 6 lw 596 659 m 26 Y s 596 711 m 26 Y s 578 698 m 5 X s 609 698 m 5 X s 3 lw 596 698 m20 6 lw 632 701 m 26 Y s 632 753 m 26 Y s 614 740 m 5 X s 645 740 m 4 X s 3 lw 632 740 m20 6 lw 667
 757 m 27 Y s 667 810 m 28 Y s 649 797 m 5 X s 680 797 m 5 X s 3 lw 667 797 m20 6 lw 703 697 m 26 Y s 703 749 m 26 Y s 685 736 m 5 X s 716 736 m 5 X s 3 lw 703 736 m20 6 lw 739 699 m 27 Y s 739 752 m 27 Y s 721 739 m 5 X s 752 739 m 5 X s 3 lw 739
 739 m20 6 lw 775 741 m 28 Y s 775 795 m 28 Y s 757 782 m 5 X s 788 782 m 5 X s 3 lw 775 782 m20 6 lw 811 791 m 28 Y s 811 845 m 28 Y s 793 832 m 5 X s 824 832 m 5 X s 3 lw 811 832 m20 6 lw 847 762 m 28 Y s 847 816 m 27 Y s 829 803 m 5 X s 860 803 m
 4 X s 3 lw 847 803 m20 6 lw 882 792 m 28 Y s 882 846 m 29 Y s 864 833 m 5 X s 895 833 m 5 X s 3 lw 882 833 m20 6 lw 918 895 m 30 Y s 918 951 m 30 Y s 900 938 m 5 X s 931 938 m 5 X s 3 lw 918 938 m20 6 lw 954 855 m 30 Y s 954 911 m 30 Y s 936 898 m
 5 X s 967 898 m 5 X s 3 lw 954 898 m20 6 lw 990 894 m 32 Y s 990 952 m 31 Y s 972 939 m 5 X s 1003 939 m 5 X s 3 lw 990 939 m20 6 lw 1026 931 m 32 Y s 1026 989 m 32 Y s 1008 976 m 5 X s 1039 976 m 5 X s 3 lw 1026 976 m20 6 lw 1062 1012 m 32 Y s
 1062 1070 m 33 Y s 1044 1057 m 4 X s 1075 1057 m 4 X s 3 lw 1062 1057 m20 6 lw 1097 1001 m 33 Y s 1097 1060 m 33 Y s 1079 1047 m 5 X s 1110 1047 m 5 X s 3 lw 1097 1047 m20 6 lw 1133 988 m 33 Y s 1133 1047 m 34 Y s 1115 1034 m 5 X s 1146 1034 m 5 X
 s 3 lw 1133 1034 m20 6 lw 1169 1057 m 33 Y s 1169 1116 m 34 Y s 1151 1103 m 5 X s 1182 1103 m 5 X s 3 lw 1169 1103 m20 6 lw 1205 1115 m 35 Y s 1205 1176 m 35 Y s 1187 1163 m 5 X s 1218 1163 m 5 X s 3 lw 1205 1163 m20 6 lw 1241 1041 m 34 Y s 1241
 1101 m 34 Y s 1223 1088 m 5 X s 1254 1088 m 5 X s 3 lw 1241 1088 m20 6 lw 1276 1180 m 36 Y s 1276 1242 m 37 Y s 1259 1229 m 4 X s 1290 1229 m 4 X s 3 lw 1276 1229 m20 6 lw 1312 1119 m 36 Y s 1312 1181 m 36 Y s 1294 1168 m 5 X s 1325 1168 m 5 X s 3
 lw 1312 1168 m20 6 lw 1348 1228 m 37 Y s 1348 1291 m 37 Y s 1330 1278 m 5 X s 1361 1278 m 5 X s 3 lw 1348 1278 m20 6 lw 1384 1210 m 36 Y s 1384 1272 m 35 Y s 1366 1259 m 5 X s 1397 1259 m 5 X s 3 lw 1384 1259 m20 6 lw 1420 1300 m 39 Y s 1420 1365 m
 38 Y s 1402 1352 m 5 X s 1433 1352 m 5 X s 3 lw 1420 1352 m20 6 lw 1456 1253 m 37 Y s 1456 1316 m 38 Y s 1438 1303 m 5 X s 1469 1303 m 5 X s 3 lw 1456 1303 m20 6 lw 1491 1248 m 37 Y s 1491 1311 m 38 Y s 1474 1298 m 4 X s 1505 1298 m 4 X s 3 lw 1491
 1298 m20 6 lw 1527 1169 m 37 Y s 1527 1232 m 37 Y s 1509 1219 m 5 X s 1540 1219 m 5 X s 3 lw 1527 1219 m20 6 lw 1563 1292 m 38 Y s 1563 1356 m 38 Y s 1545 1343 m 5 X s 1576 1343 m 5 X s 3 lw 1563 1343 m20 6 lw 1599 1236 m 36 Y s 1599 1299 m 36 Y s
 1581 1285 m 5 X s 1612 1285 m 5 X s 3 lw 1599 1285 m20 6 lw 1635 1096 m 34 Y s 1635 1156 m 34 Y s 1617 1143 m 5 X s 1648 1143 m 5 X s 3 lw 1635 1143 m20 6 lw 1671 1124 m 34 Y s 1671 1184 m 33 Y s 1653 1171 m 5 X s 1684 1171 m 5 X s 3 lw 1671 1171
 m20 6 lw 1706 1094 m 33 Y s 1706 1153 m 33 Y s 1689 1140 m 4 X s 1719 1140 m 5 X s 3 lw 1706 1140 m20 6 lw 1742 998 m 32 Y s 1742 1056 m 33 Y s 1724 1043 m 5 X s 1755 1043 m 5 X s 3 lw 1742 1043 m20 6 lw 1778 1032 m 31 Y s 1778 1090 m 31 Y s 1760
 1077 m 5 X s 1791 1077 m 5 X s 3 lw 1778 1077 m20 6 lw 1814 867 m 30 Y s 1814 923 m 29 Y s 1796 910 m 5 X s 1827 910 m 5 X s 3 lw 1814 910 m20 6 lw 1850 759 m 27 Y s 1850 812 m 26 Y s 1832 799 m 5 X s 1863 799 m 5 X s 3 lw 1850 799 m20 6 lw 1886
 767 m 25 Y s 1886 818 m 26 Y s 1868 805 m 5 X s 1899 805 m 5 X s 3 lw 1886 805 m20 6 lw 1921 653 m 23 Y s 1921 702 m 23 Y s 1904 689 m 4 X s 1934 689 m 5 X s 3 lw 1921 689 m20 6 lw 1957 591 m 21 Y s 1957 638 m 22 Y s 1939 625 m 5 X s 1970 625 m 5 X
 s 3 lw 1957 625 m20 6 lw 1993 528 m 21 Y s 1993 575 m 20 Y s 1975 562 m 5 X s 2006 562 m 5 X s 3 lw 1993 562 m20 6 lw 2029 472 m 18 Y s 2029 516 m 18 Y s 2011 503 m 5 X s 2042 503 m 5 X s 3 lw 2029 503 m20 6 lw 2065 350 m 16 Y s 2065 393 m 16 Y s
 2047 379 m 5 X s 2078 379 m 5 X s 3 lw 2065 379 m20 6 lw 2101 327 m 15 Y s 2101 368 m 15 Y s 2083 355 m 5 X s 2114 355 m 5 X s 3 lw 2101 355 m20 6 lw 2136 301 m 14 Y s 2136 342 m 14 Y s 2119 329 m 4 X s 2149 329 m 5 X s 3 lw 2136 329 m20 6 lw black
 3 lw 363 246 m 1791 X s
 gsave  2268 1538 0 0 C 2134 98 t 0 r /Helvetica findfont 48.8732 sf 0 0 m (ll) show NC gr 
 gsave  2268 1538 0 0 C 2098 121 t 0 r /Symbol findfont 71.6807 sf 0 0 m (f) show NC gr 
 gsave  2268 1538 0 0 C 2053 121 t 0 r /Symbol findfont 71.6807 sf 0 0 m (D) show NC gr  363 283 m -37 Y s 420 264 m -18 Y s 477 264 m -18 Y s 533 264 m -18 Y s 590 264 m -18 Y s 647 283 m -37 Y s 704 264 m -18 Y s 761 264 m -18 Y s 818 264 m -18 Y
 s 875 264 m -18 Y s 932 283 m -37 Y s 988 264 m -18 Y s 1045 264 m -18 Y s 1102 264 m -18 Y s 1159 264 m -18 Y s 1216 283 m -37 Y s 1273 264 m -18 Y s 1330 264 m -18 Y s 1387 264 m -18 Y s 1443 264 m -18 Y s 1500 283 m -37 Y s 1557 264 m -18 Y s
 1614 264 m -18 Y s 1671 264 m -18 Y s 1728 264 m -18 Y s 1785 283 m -37 Y s 1842 264 m -18 Y s 1898 264 m -18 Y s 1955 264 m -18 Y s 2012 264 m -18 Y s 2069 283 m -37 Y s 2069 283 m -37 Y s 2126 264 m -18 Y s
 gsave  2268 1538 0 0 C 342 179 t 0 r /Helvetica findfont 71.6807 sf 0 0 m (0) show NC gr 
 gsave  2268 1538 0 0 C 596 179 t 0 r /Helvetica findfont 71.6807 sf 0 0 m (0.5) show NC gr 
 gsave  2268 1538 0 0 C 912 179 t 0 r /Helvetica findfont 71.6807 sf 0 0 m (1) show NC gr 
 gsave  2268 1538 0 0 C 1166 179 t 0 r /Helvetica findfont 71.6807 sf 0 0 m (1.5) show NC gr 
 gsave  2268 1538 0 0 C 1479 179 t 0 r /Helvetica findfont 71.6807 sf 0 0 m (2) show NC gr 
 gsave  2268 1538 0 0 C 1733 179 t 0 r /Helvetica findfont 71.6807 sf 0 0 m (2.5) show NC gr 
 gsave  2268 1538 0 0 C 2049 179 t 0 r /Helvetica findfont 71.6807 sf 0 0 m (3) show NC gr  363 1461 m 1791 X s 363 1425 m 36 Y s 420 1443 m 18 Y s 477 1443 m 18 Y s 533 1443 m 18 Y s 590 1443 m 18 Y s 647 1425 m 36 Y s 704 1443 m 18 Y s 761 1443 m
 18 Y s 818 1443 m 18 Y s 875 1443 m 18 Y s 932 1425 m 36 Y s 988 1443 m 18 Y s 1045 1443 m 18 Y s 1102 1443 m 18 Y s 1159 1443 m 18 Y s 1216 1425 m 36 Y s 1273 1443 m 18 Y s 1330 1443 m 18 Y s 1387 1443 m 18 Y s 1443 1443 m 18 Y s 1500 1425 m 36 Y
 s 1557 1443 m 18 Y s 1614 1443 m 18 Y s 1671 1443 m 18 Y s 1728 1443 m 18 Y s 1785 1425 m 36 Y s 1842 1443 m 18 Y s 1898 1443 m 18 Y s 1955 1443 m 18 Y s 2012 1443 m 18 Y s 2069 1425 m 36 Y s 2069 1425 m 36 Y s 2126 1443 m 18 Y s 363 246 m 1215 Y s
 gsave  2268 1538 0 0 C 143 1030 t 90 r /Helvetica findfont 71.6807 sf 0 0 m (arbitrary units) show NC gr  417 390 m -54 X s 390 443 m -27 X s 390 495 m -27 X s 390 547 m -27 X s 390 599 m -27 X s 417 651 m -54 X s 390 704 m -27 X s 390 756 m -27 X
 s 390 808 m -27 X s 390 860 m -27 X s 417 912 m -54 X s 390 964 m -27 X s 390 1017 m -27 X s 390 1069 m -27 X s 390 1121 m -27 X s 417 1173 m -54 X s 390 1225 m -27 X s 390 1278 m -27 X s 390 1330 m -27 X s 390 1382 m -27 X s 417 1434 m -54 X s 417
 390 m -54 X s 390 338 m -27 X s 390 286 m -27 X s 417 1434 m -54 X s
 gsave  2268 1538 0 0 C 222 365 t 0 r /Helvetica findfont 71.6807 sf 0 0 m (0.01) show NC gr 
 gsave  2268 1538 0 0 C 169 626 t 0 r /Helvetica findfont 71.6807 sf 0 0 m (0.015) show NC gr 
 gsave  2268 1538 0 0 C 212 889 t 0 r /Helvetica findfont 71.6807 sf 0 0 m (0.02) show NC gr 
 gsave  2268 1538 0 0 C 169 1150 t 0 r /Helvetica findfont 71.6807 sf 0 0 m (0.025) show NC gr 
 gsave  2268 1538 0 0 C 212 1411 t 0 r /Helvetica findfont 71.6807 sf 0 0 m (0.03) show NC gr  2154 246 m 1215 Y s 2101 390 m 53 X s 2127 443 m 27 X s 2127 495 m 27 X s 2127 547 m 27 X s 2127 599 m 27 X s 2101 651 m 53 X s 2127 704 m 27 X s 2127 756
 m 27 X s 2127 808 m 27 X s 2127 860 m 27 X s 2101 912 m 53 X s 2127 964 m 27 X s 2127 1017 m 27 X s 2127 1069 m 27 X s 2127 1121 m 27 X s 2101 1173 m 53 X s 2127 1225 m 27 X s 2127 1278 m 27 X s 2127 1330 m 27 X s 2127 1382 m 27 X s 2101 1434 m 53
 X s 2101 390 m 53 X s 2127 338 m 27 X s 2127 286 m 27 X s 2101 1434 m 53 X s 0 0 1 c 6 lw 1 1 1 c black 0 0 1 c 363 728 m 36 X 13 Y 35 X -16 Y 36 X 26 Y 36 X -2 Y 36 X 5 Y 36 X -4 Y 36 X 26 Y 35 X 21 Y 36 X 5 Y 36 X 33 Y 36 X -20 Y 36 X 36 Y 36 X
 18 Y 35 X 40 Y 36 X 6 Y 36 X 27 Y 36 X 42 Y 36 X 23 Y 36 X 1 Y 35 X 58 Y 36 X 13 Y 36 X 19 Y 36 X 47 Y 36 X 32 Y 36 X 33 Y 35 X 15 Y 36 X 24 Y 36 X 25 Y 36 X 13 Y 36 X 21 Y 36 X -42 Y 35 X 20 Y 36 X -29 Y 36 X -39 Y 36 X -30 Y 36 X -30 Y 36 X -70 Y
 35 X -79 Y 36 X -72 Y 36 X -83 Y 36 X -50 Y 36 X -107 Y 36 X -87 Y 35 X -56 Y 36 X -77 Y 36 X -58 Y 36 X -40 Y 36 X -46 Y 36 X -79 Y 35 X s 1 1 1 c 0 lw 710 231 388 1193 bf 3 lw 407 1193 m -14 Y 704 X 225 Y -13 X -211 Y f 0 lw 388 1193 m 231 Y 710
 X -231 Y -710 X cl s black
 gsave  2268 1538 0 0 C 564 1336 t 0 r /Helvetica findfont 87.9718 sf 0 0 m (MCFM) show NC gr  1 1 1 c 3 lw 414 1326 m 125 X 80 Y -125 X f 0 lw 0 0 1 c 6 lw 414 1366 m 125 X s black 3 lw 477 1366 m20 6 lw
 gsave  2268 1538 0 0 C 564 1225 t 0 r /Helvetica findfont 87.9718 sf 0 0 m (MC@NLO) show NC gr  1 1 1 c 3 lw 414 1210 m 125 X 81 Y -125 X f 6 lw 1 0 0 c 414 1250 m 125 X s 3 lw 477 1250 m20 6 lw black
 gsave  2268 1538 0 0 C 2222 1118 t 90 r /Helvetica-BoldOblique findfont 29.3239 sf 0 0 m (LHC HIGGS XS WG 2011) show NC gr 
 gr  gr 
showpage
end
%%EOF
