%!PS-Adobe-1.0
%%Creator: Unified Graphics System
%%Pages: (atend)
%%DocumentFonts: Courier
%%BoundingBox:   95  205  481  563
%%EndComments
/Sw{setlinewidth}def
/Sg{setgray}def
/Sd{setdash}def
/P {newpath
    moveto
0 0 rlineto
    stroke}def
/M {moveto}def
/D {lineto}def
/N {newpath}def
/S {stroke}def
/T {/Courier findfont
    exch
    scalefont
    setfont}def
/R {rotate}def
/W {show}def
/F {fill}def
/X {gsave}def
/Y {grestore}def
%%EndProlog
%%Page: 1 1
0.24000 0.24000 scale
1 setlinecap
1 setlinejoin
4 Sw
0 0 0 setrgbcolor
[] 0 Sd
N
839 2259 M
839 2227 D
S
N
841 2259 M
841 2227 D
S
N
841 2254 M
844 2257 D
847 2259 D
850 2259 D
854 2257 D
857 2254 D
859 2249 D
859 2246 D
857 2242 D
854 2239 D
850 2237 D
847 2237 D
844 2239 D
841 2242 D
S
N
850 2259 M
853 2257 D
856 2254 D
857 2249 D
857 2246 D
856 2242 D
853 2239 D
850 2237 D
S
N
835 2259 M
841 2259 D
S
N
835 2227 M
845 2227 D
S
N
871 2259 M
871 2227 D
S
N
872 2259 M
872 2227 D
S
N
872 2254 M
875 2257 D
878 2259 D
881 2259 D
886 2257 D
889 2254 D
890 2249 D
890 2246 D
889 2242 D
886 2239 D
881 2237 D
878 2237 D
875 2239 D
872 2242 D
S
N
881 2259 M
884 2257 D
887 2254 D
889 2249 D
889 2246 D
887 2242 D
884 2239 D
881 2237 D
S
N
866 2259 M
872 2259 D
S
N
866 2227 M
877 2227 D
S
N
948 2254 M
952 2251 D
948 2248 D
S
N
943 2259 M
951 2251 D
943 2243 D
S
N
925 2251 M
951 2251 D
S
N
998 2269 M
987 2237 D
S
N
998 2269 M
1008 2237 D
S
N
998 2265 M
1007 2237 D
S
N
990 2246 M
1004 2246 D
S
N
984 2237 M
993 2237 D
S
N
1002 2237 M
1011 2237 D
S
N
1020 2269 M
1020 2243 D
1022 2239 D
1025 2237 D
1028 2237 D
1031 2239 D
1032 2242 D
S
N
1022 2269 M
1022 2243 D
1023 2239 D
1025 2237 D
S
N
1016 2259 M
1028 2259 D
S
N
1043 2269 M
1043 2243 D
1044 2239 D
1047 2237 D
1050 2237 D
1053 2239 D
1055 2242 D
S
N
1044 2269 M
1044 2243 D
1046 2239 D
1047 2237 D
S
N
1038 2259 M
1050 2259 D
S
N
1034 2278 M
1067 2278 D
S
N
1162 2269 M
1162 2237 D
S
N
1164 2269 M
1164 2237 D
S
N
1162 2254 M
1159 2257 D
1156 2259 D
1153 2259 D
1148 2257 D
1145 2254 D
1144 2249 D
1144 2246 D
1145 2242 D
1148 2239 D
1153 2237 D
1156 2237 D
1159 2239 D
1162 2242 D
S
N
1153 2259 M
1150 2257 D
1147 2254 D
1145 2249 D
1145 2246 D
1147 2242 D
1150 2239 D
1153 2237 D
S
N
1158 2269 M
1164 2269 D
S
N
1162 2237 M
1168 2237 D
S
N
1200 2259 M
1185 2259 D
1180 2257 D
1177 2252 D
1176 2248 D
1176 2243 D
1177 2240 D
1179 2239 D
1182 2237 D
1185 2237 D
1189 2239 D
1192 2243 D
1194 2248 D
1194 2252 D
1192 2256 D
1191 2257 D
1188 2259 D
S
N
1185 2259 M
1182 2257 D
1179 2252 D
1177 2248 D
1177 2242 D
1179 2239 D
S
N
1185 2237 M
1188 2239 D
1191 2243 D
1192 2248 D
1192 2254 D
1191 2257 D
S
N
1191 2257 M
1200 2257 D
S
N
1233 2275 M
1206 2227 D
S
N
1259 2269 M
1259 2237 D
S
N
1260 2269 M
1260 2237 D
S
N
1259 2254 M
1256 2257 D
1253 2259 D
1250 2259 D
1245 2257 D
1242 2254 D
1241 2249 D
1241 2246 D
1242 2242 D
1245 2239 D
1250 2237 D
1253 2237 D
1256 2239 D
1259 2242 D
S
N
1250 2259 M
1247 2257 D
1244 2254 D
1242 2249 D
1242 2246 D
1244 2242 D
1247 2239 D
1250 2237 D
S
N
1254 2269 M
1260 2269 D
S
N
1259 2237 M
1265 2237 D
S
N
1283 2269 M
1271 2237 D
S
N
1283 2269 M
1295 2237 D
S
N
1283 2265 M
1293 2237 D
S
N
1272 2239 M
1293 2239 D
S
N
1271 2237 M
1295 2237 D
S
N
1305 2269 M
1305 2237 D
S
N
1307 2269 M
1307 2237 D
S
N
1301 2269 M
1319 2269 D
1324 2268 D
1325 2266 D
1327 2263 D
1327 2260 D
1325 2257 D
1324 2255 D
1319 2254 D
1307 2254 D
S
N
1319 2269 M
1322 2268 D
1324 2266 D
1325 2263 D
1325 2260 D
1324 2257 D
1322 2256 D
1319 2254 D
S
N
1301 2237 M
1312 2237 D
S
N
1315 2254 M
1318 2252 D
1319 2251 D
1324 2240 D
1325 2239 D
1327 2239 D
1328 2240 D
S
N
1318 2252 M
1319 2249 D
1322 2239 D
1324 2237 D
1327 2237 D
1328 2240 D
1328 2242 D
S
N
1338 2246 M
1338 2225 D
S
N
1339 2246 M
1339 2225 D
S
N
1335 2246 M
1347 2246 D
1350 2245 D
1351 2244 D
1352 2242 D
1352 2240 D
1351 2238 D
1350 2237 D
1347 2236 D
S
N
1347 2246 M
1349 2245 D
1350 2244 D
1351 2242 D
1351 2240 D
1350 2238 D
1349 2237 D
1347 2236 D
S
N
1339 2236 M
1347 2236 D
1350 2235 D
1351 2234 D
1352 2232 D
1352 2229 D
1351 2227 D
1350 2226 D
1347 2225 D
1335 2225 D
S
N
1347 2236 M
1349 2235 D
1350 2234 D
1351 2232 D
1351 2229 D
1350 2227 D
1349 2226 D
1347 2225 D
S
N
1360 2246 M
1360 2225 D
S
N
1361 2246 M
1361 2225 D
S
N
1357 2246 M
1369 2246 D
1372 2245 D
1373 2244 D
1374 2242 D
1374 2240 D
1373 2238 D
1372 2237 D
1369 2236 D
S
N
1369 2246 M
1371 2245 D
1372 2244 D
1373 2242 D
1373 2240 D
1372 2238 D
1371 2237 D
1369 2236 D
S
N
1361 2236 M
1369 2236 D
1372 2235 D
1373 2234 D
1374 2232 D
1374 2229 D
1373 2227 D
1372 2226 D
1369 2225 D
1357 2225 D
S
N
1369 2236 M
1371 2235 D
1372 2234 D
1373 2232 D
1373 2229 D
1372 2227 D
1371 2226 D
1369 2225 D
S
N
1410 2275 M
1410 2227 D
S
N
1411 2275 M
1411 2227 D
S
N
1410 2275 M
1420 2275 D
S
N
1410 2227 M
1420 2227 D
S
N
1432 2259 M
1432 2227 D
S
N
1434 2259 M
1434 2227 D
S
N
1434 2254 M
1437 2257 D
1440 2259 D
1443 2259 D
1447 2257 D
1450 2254 D
1452 2249 D
1452 2246 D
1450 2242 D
1447 2239 D
1443 2237 D
1440 2237 D
1437 2239 D
1434 2242 D
S
N
1443 2259 M
1446 2257 D
1449 2254 D
1450 2249 D
1450 2246 D
1449 2242 D
1446 2239 D
1443 2237 D
S
N
1428 2259 M
1434 2259 D
S
N
1428 2227 M
1438 2227 D
S
N
1464 2269 M
1464 2237 D
S
N
1465 2269 M
1465 2237 D
S
N
1465 2254 M
1468 2257 D
1471 2259 D
1475 2259 D
1479 2257 D
1482 2254 D
1484 2249 D
1484 2246 D
1482 2242 D
1479 2239 D
1475 2237 D
1471 2237 D
1468 2239 D
1465 2242 D
S
N
1475 2259 M
1478 2257 D
1481 2254 D
1482 2249 D
1482 2246 D
1481 2242 D
1478 2239 D
1475 2237 D
S
N
1459 2269 M
1465 2269 D
S
N
1502 2275 M
1502 2227 D
S
N
1503 2275 M
1503 2227 D
S
N
1493 2275 M
1503 2275 D
S
N
1493 2227 M
1503 2227 D
S
N
1565 2255 M
1565 2254 D
1564 2254 D
1564 2255 D
1565 2257 D
1568 2259 D
1574 2259 D
1577 2257 D
1579 2255 D
1580 2252 D
1580 2242 D
1582 2239 D
1583 2237 D
S
N
1579 2255 M
1579 2242 D
1580 2239 D
1583 2237 D
1585 2237 D
S
N
1579 2252 M
1577 2251 D
1568 2249 D
1564 2248 D
1562 2245 D
1562 2242 D
1564 2239 D
1568 2237 D
1573 2237 D
1576 2239 D
1579 2242 D
S
N
1568 2249 M
1565 2248 D
1564 2245 D
1564 2242 D
1565 2239 D
1568 2237 D
S
N
1595 2269 M
1595 2243 D
1597 2239 D
1600 2237 D
1603 2237 D
1606 2239 D
1607 2242 D
S
N
1597 2269 M
1597 2243 D
1598 2239 D
1600 2237 D
S
N
1591 2259 M
1603 2259 D
S
N
1642 2269 M
1642 2237 D
S
N
1644 2269 M
1644 2237 D
S
N
1638 2269 M
1648 2269 D
S
N
1638 2237 M
1660 2237 D
1660 2246 D
1659 2237 D
S
N
1669 2269 M
1669 2237 D
S
N
1671 2269 M
1671 2237 D
S
N
1689 2269 M
1689 2237 D
S
N
1690 2269 M
1690 2237 D
S
N
1665 2269 M
1675 2269 D
S
N
1684 2269 M
1695 2269 D
S
N
1671 2254 M
1689 2254 D
S
N
1665 2237 M
1675 2237 D
S
N
1684 2237 M
1695 2237 D
S
N
1724 2265 M
1725 2260 D
1725 2269 D
1724 2265 D
1721 2268 D
1716 2269 D
1713 2269 D
1708 2268 D
1705 2265 D
1704 2262 D
1702 2257 D
1702 2249 D
1704 2245 D
1705 2242 D
1708 2239 D
1713 2237 D
1716 2237 D
1721 2239 D
1724 2242 D
1725 2245 D
S
N
1713 2269 M
1710 2268 D
1707 2265 D
1705 2262 D
1704 2257 D
1704 2249 D
1705 2245 D
1707 2242 D
1710 2239 D
1713 2237 D
S
N
1758 2269 M
1758 2260 D
S
N
1758 2263 M
1760 2266 D
1763 2269 D
1766 2269 D
1773 2265 D
1776 2265 D
1778 2266 D
1779 2269 D
S
N
1760 2266 M
1763 2268 D
1766 2268 D
1773 2265 D
S
N
1779 2269 M
1779 2265 D
1778 2260 D
1772 2252 D
1770 2249 D
1769 2245 D
1769 2237 D
S
N
1778 2260 M
1770 2252 D
1769 2249 D
1767 2245 D
1767 2237 D
S
N
1822 2269 M
1822 2237 D
S
N
1823 2269 M
1823 2237 D
S
N
1813 2269 M
1811 2260 D
1811 2269 D
1834 2269 D
1834 2260 D
1832 2269 D
S
N
1817 2237 M
1828 2237 D
S
N
1843 2249 M
1861 2249 D
1861 2252 D
1859 2255 D
1858 2257 D
1855 2259 D
1850 2259 D
1846 2257 D
1843 2254 D
1841 2249 D
1841 2246 D
1843 2242 D
1846 2239 D
1850 2237 D
1853 2237 D
1858 2239 D
1861 2242 D
S
N
1859 2249 M
1859 2254 D
1858 2257 D
S
N
1850 2259 M
1847 2257 D
1844 2254 D
1843 2249 D
1843 2246 D
1844 2242 D
1847 2239 D
1850 2237 D
S
N
1870 2269 M
1881 2237 D
S
N
1871 2269 M
1881 2242 D
S
N
1891 2269 M
1881 2237 D
S
N
1867 2269 M
1876 2269 D
S
N
1885 2269 M
1894 2269 D
S
3 Sw
N
1455 2186 M
1455 2185 D
1453 2185 D
1453 2186 D
1455 2188 D
1458 2189 D
1464 2189 D
1467 2188 D
1468 2186 D
1470 2183 D
1470 2173 D
1471 2170 D
1473 2168 D
S
N
1468 2186 M
1468 2173 D
1470 2170 D
1473 2168 D
1474 2168 D
S
N
1468 2183 M
1467 2182 D
1458 2180 D
1453 2179 D
1452 2176 D
1452 2173 D
1453 2170 D
1458 2168 D
1462 2168 D
1465 2170 D
1468 2173 D
S
N
1458 2180 M
1455 2179 D
1453 2176 D
1453 2173 D
1455 2170 D
1458 2168 D
S
N
1485 2200 M
1485 2168 D
S
N
1486 2200 M
1495 2173 D
S
N
1485 2200 M
1495 2168 D
S
N
1506 2200 M
1495 2168 D
S
N
1506 2200 M
1506 2168 D
S
N
1508 2200 M
1508 2168 D
S
N
1480 2200 M
1486 2200 D
S
N
1506 2200 M
1512 2200 D
S
N
1480 2168 M
1489 2168 D
S
N
1502 2168 M
1512 2168 D
S
N
1541 2195 M
1542 2191 D
1542 2200 D
1541 2195 D
1538 2198 D
1533 2200 D
1530 2200 D
1526 2198 D
1523 2195 D
1521 2192 D
1520 2188 D
1520 2180 D
1521 2176 D
1523 2173 D
1526 2170 D
1530 2168 D
1533 2168 D
1538 2170 D
1541 2173 D
1542 2176 D
S
N
1530 2200 M
1527 2198 D
1524 2195 D
1523 2192 D
1521 2188 D
1521 2180 D
1523 2176 D
1524 2173 D
1527 2170 D
1530 2168 D
S
N
1574 2188 M
1572 2191 D
1569 2192 D
1565 2192 D
1562 2191 D
1560 2189 D
1559 2185 D
1559 2180 D
1560 2177 D
1563 2176 D
1568 2176 D
1571 2177 D
1572 2180 D
S
N
1565 2192 M
1562 2189 D
1560 2185 D
1560 2180 D
1562 2177 D
1563 2176 D
S
N
1574 2192 M
1572 2180 D
1572 2177 D
1575 2176 D
1579 2176 D
1582 2179 D
1583 2183 D
1583 2186 D
1582 2191 D
1580 2194 D
1577 2197 D
1574 2198 D
1569 2200 D
1565 2200 D
1560 2198 D
1557 2197 D
1554 2194 D
1553 2191 D
1551 2186 D
1551 2182 D
1553 2177 D
1554 2174 D
1557 2171 D
1560 2170 D
1565 2168 D
1569 2168 D
1574 2170 D
1577 2171 D
1579 2173 D
S
N
1575 2192 M
1574 2180 D
1574 2177 D
1575 2176 D
S
N
1595 2200 M
1595 2168 D
S
N
1597 2200 M
1615 2171 D
S
N
1597 2197 M
1615 2168 D
S
N
1615 2200 M
1615 2168 D
S
N
1591 2200 M
1597 2200 D
S
N
1610 2200 M
1619 2200 D
S
N
1591 2168 M
1600 2168 D
S
N
1630 2200 M
1630 2168 D
S
N
1631 2200 M
1631 2168 D
S
N
1625 2200 M
1636 2200 D
S
N
1625 2168 M
1648 2168 D
1648 2177 D
1646 2168 D
S
N
1665 2200 M
1660 2198 D
1657 2195 D
1655 2192 D
1654 2186 D
1654 2182 D
1655 2176 D
1657 2173 D
1660 2170 D
1665 2168 D
1668 2168 D
1672 2170 D
1675 2173 D
1677 2176 D
1678 2182 D
1678 2186 D
1677 2192 D
1675 2195 D
1672 2198 D
1668 2200 D
1665 2200 D
S
N
1665 2200 M
1662 2198 D
1659 2195 D
1657 2192 D
1655 2186 D
1655 2182 D
1657 2176 D
1659 2173 D
1662 2170 D
1665 2168 D
S
N
1668 2168 M
1671 2170 D
1674 2173 D
1675 2176 D
1677 2182 D
1677 2186 D
1675 2192 D
1674 2195 D
1671 2198 D
1668 2200 D
S
N
1702 2195 M
1702 2168 D
S
N
1689 2182 M
1716 2182 D
S
N
1729 2200 M
1729 2168 D
S
N
1731 2200 M
1731 2168 D
S
N
1731 2185 M
1734 2188 D
1738 2189 D
1742 2189 D
1746 2188 D
1748 2185 D
1748 2168 D
S
N
1742 2189 M
1745 2188 D
1746 2185 D
1746 2168 D
S
N
1725 2200 M
1731 2200 D
S
N
1725 2168 M
1735 2168 D
S
N
1742 2168 M
1752 2168 D
S
N
1761 2180 M
1779 2180 D
1779 2183 D
1778 2186 D
1776 2188 D
1773 2189 D
1769 2189 D
1764 2188 D
1761 2185 D
1760 2180 D
1760 2177 D
1761 2173 D
1764 2170 D
1769 2168 D
1772 2168 D
1776 2170 D
1779 2173 D
S
N
1778 2180 M
1778 2185 D
1776 2188 D
S
N
1769 2189 M
1766 2188 D
1763 2185 D
1761 2180 D
1761 2177 D
1763 2173 D
1766 2170 D
1769 2168 D
S
N
1791 2189 M
1791 2168 D
S
N
1793 2189 M
1793 2168 D
S
N
1793 2180 M
1794 2185 D
1797 2188 D
1800 2189 D
1805 2189 D
1806 2188 D
1806 2186 D
1805 2185 D
1803 2186 D
1805 2188 D
S
N
1787 2189 M
1793 2189 D
S
N
1787 2168 M
1797 2168 D
S
N
1815 2189 M
1822 2168 D
S
N
1817 2189 M
1822 2173 D
S
N
1828 2189 M
1822 2168 D
S
N
1828 2189 M
1834 2168 D
S
N
1829 2189 M
1834 2173 D
S
N
1840 2189 M
1834 2168 D
S
N
1811 2189 M
1822 2189 D
S
N
1835 2189 M
1844 2189 D
S
N
1853 2200 M
1852 2198 D
1853 2197 D
1855 2198 D
1853 2200 D
S
N
1853 2189 M
1853 2168 D
S
N
1855 2189 M
1855 2168 D
S
N
1849 2189 M
1855 2189 D
S
N
1849 2168 M
1859 2168 D
S
N
1874 2189 M
1871 2188 D
1870 2186 D
1868 2183 D
1868 2180 D
1870 2177 D
1871 2176 D
1874 2174 D
1877 2174 D
1880 2176 D
1882 2177 D
1883 2180 D
1883 2183 D
1882 2186 D
1880 2188 D
1877 2189 D
1874 2189 D
S
N
1871 2188 M
1870 2185 D
1870 2179 D
1871 2176 D
S
N
1880 2176 M
1882 2179 D
1882 2185 D
1880 2188 D
S
N
1882 2186 M
1883 2188 D
1886 2189 D
1886 2188 D
1883 2188 D
S
N
1870 2177 M
1868 2176 D
1867 2173 D
1867 2171 D
1868 2168 D
1873 2167 D
1880 2167 D
1885 2165 D
1886 2164 D
S
N
1867 2171 M
1868 2170 D
1873 2168 D
1880 2168 D
1885 2167 D
1886 2164 D
1886 2162 D
1885 2159 D
1880 2158 D
1871 2158 D
1867 2159 D
1865 2162 D
1865 2164 D
1867 2167 D
1871 2168 D
S
N
1455 2131 M
1455 2099 D
S
N
1456 2131 M
1456 2099 D
S
N
1450 2131 M
1468 2131 D
1473 2129 D
1474 2128 D
1476 2125 D
1476 2120 D
1474 2117 D
1473 2116 D
1468 2114 D
1456 2114 D
S
N
1468 2131 M
1471 2129 D
1473 2128 D
1474 2125 D
1474 2120 D
1473 2117 D
1471 2116 D
1468 2114 D
S
N
1450 2099 M
1461 2099 D
S
N
1495 2131 M
1491 2129 D
1488 2126 D
1486 2123 D
1485 2117 D
1485 2113 D
1486 2107 D
1488 2104 D
1491 2100 D
1495 2099 D
1499 2099 D
1503 2100 D
1506 2104 D
1508 2107 D
1509 2113 D
1509 2117 D
1508 2123 D
1506 2126 D
1503 2129 D
1499 2131 D
1495 2131 D
S
N
1495 2131 M
1492 2129 D
1489 2126 D
1488 2123 D
1486 2117 D
1486 2113 D
1488 2107 D
1489 2104 D
1492 2100 D
1495 2099 D
S
N
1499 2099 M
1502 2100 D
1505 2104 D
1506 2107 D
1508 2113 D
1508 2117 D
1506 2123 D
1505 2126 D
1502 2129 D
1499 2131 D
S
N
1520 2131 M
1526 2099 D
S
N
1521 2131 M
1526 2107 D
S
N
1532 2131 M
1526 2099 D
S
N
1532 2131 M
1538 2099 D
S
N
1533 2131 M
1538 2107 D
S
N
1544 2131 M
1538 2099 D
S
N
1515 2131 M
1526 2131 D
S
N
1539 2131 M
1548 2131 D
S
N
1557 2131 M
1557 2099 D
S
N
1559 2131 M
1559 2099 D
S
N
1577 2131 M
1577 2099 D
S
N
1579 2131 M
1579 2099 D
S
N
1553 2131 M
1563 2131 D
S
N
1572 2131 M
1583 2131 D
S
N
1559 2116 M
1577 2116 D
S
N
1553 2099 M
1563 2099 D
S
N
1572 2099 M
1583 2099 D
S
N
1594 2131 M
1594 2099 D
S
N
1595 2131 M
1595 2099 D
S
N
1604 2122 M
1604 2110 D
S
N
1589 2131 M
1613 2131 D
1613 2122 D
1612 2131 D
S
N
1595 2116 M
1604 2116 D
S
N
1589 2099 M
1613 2099 D
1613 2108 D
1612 2099 D
S
N
1625 2131 M
1625 2099 D
S
N
1627 2131 M
1627 2099 D
S
N
1621 2131 M
1631 2131 D
S
N
1621 2099 M
1643 2099 D
1643 2108 D
1642 2099 D
S
N
1665 2126 M
1665 2099 D
S
N
1651 2113 M
1678 2113 D
S
N
1692 2131 M
1692 2099 D
S
N
1693 2131 M
1693 2099 D
S
N
1693 2116 M
1696 2119 D
1701 2120 D
1704 2120 D
1708 2119 D
1710 2116 D
1710 2099 D
S
N
1704 2120 M
1707 2119 D
1708 2116 D
1708 2099 D
S
N
1687 2131 M
1693 2131 D
S
N
1687 2099 M
1698 2099 D
S
N
1704 2099 M
1714 2099 D
S
N
1723 2111 M
1742 2111 D
1742 2114 D
1740 2117 D
1738 2119 D
1735 2120 D
1731 2120 D
1726 2119 D
1723 2116 D
1722 2111 D
1722 2108 D
1723 2104 D
1726 2100 D
1731 2099 D
1734 2099 D
1738 2100 D
1742 2104 D
S
N
1740 2111 M
1740 2116 D
1738 2119 D
S
N
1731 2120 M
1728 2119 D
1725 2116 D
1723 2111 D
1723 2108 D
1725 2104 D
1728 2100 D
1731 2099 D
S
N
1754 2120 M
1754 2099 D
S
N
1755 2120 M
1755 2099 D
S
N
1755 2111 M
1757 2116 D
1760 2119 D
1763 2120 D
1767 2120 D
1769 2119 D
1769 2117 D
1767 2116 D
1766 2117 D
1767 2119 D
S
N
1749 2120 M
1755 2120 D
S
N
1749 2099 M
1760 2099 D
S
N
1778 2120 M
1784 2099 D
S
N
1779 2120 M
1784 2104 D
S
N
1790 2120 M
1784 2099 D
S
N
1790 2120 M
1796 2099 D
S
N
1791 2120 M
1796 2104 D
S
N
1802 2120 M
1796 2099 D
S
N
1773 2120 M
1784 2120 D
S
N
1797 2120 M
1806 2120 D
S
N
1815 2131 M
1814 2129 D
1815 2128 D
1817 2129 D
1815 2131 D
S
N
1815 2120 M
1815 2099 D
S
N
1817 2120 M
1817 2099 D
S
N
1811 2120 M
1817 2120 D
S
N
1811 2099 M
1822 2099 D
S
N
1837 2120 M
1834 2119 D
1832 2117 D
1831 2114 D
1831 2111 D
1832 2108 D
1834 2107 D
1837 2105 D
1840 2105 D
1843 2107 D
1844 2108 D
1846 2111 D
1846 2114 D
1844 2117 D
1843 2119 D
1840 2120 D
1837 2120 D
S
N
1834 2119 M
1832 2116 D
1832 2110 D
1834 2107 D
S
N
1843 2107 M
1844 2110 D
1844 2116 D
1843 2119 D
S
N
1844 2117 M
1846 2119 D
1849 2120 D
1849 2119 D
1846 2119 D
S
N
1832 2108 M
1831 2107 D
1829 2104 D
1829 2102 D
1831 2099 D
1835 2097 D
1843 2097 D
1847 2096 D
1849 2094 D
S
N
1829 2102 M
1831 2100 D
1835 2099 D
1843 2099 D
1847 2097 D
1849 2094 D
1849 2093 D
1847 2090 D
1843 2088 D
1834 2088 D
1829 2090 D
1828 2093 D
1828 2094 D
1829 2097 D
1834 2099 D
S
1 Sw
N
1986 2034 M
2003 2034 D
S
N
1986 2034 M
2003 2034 D
S
N
1986 2031 M
1986 2037 D
S
N
2003 2031 M
2003 2043 D
1998 2043 D
2003 2042 D
S
N
1986 2048 M
2003 2048 D
S
N
1986 2049 M
2003 2049 D
S
N
1986 2058 M
2003 2058 D
S
N
1986 2059 M
2003 2059 D
S
N
1986 2046 M
1986 2051 D
S
N
1986 2056 M
1986 2062 D
S
N
1994 2049 M
1994 2058 D
S
N
2003 2046 M
2003 2051 D
S
N
2003 2056 M
2003 2062 D
S
N
1988 2077 M
1991 2078 D
1986 2078 D
1988 2077 D
1987 2075 D
1986 2073 D
1986 2071 D
1987 2069 D
1988 2067 D
1990 2066 D
1992 2066 D
1996 2066 D
1999 2066 D
2000 2067 D
2002 2069 D
2003 2071 D
2003 2073 D
2002 2075 D
2000 2077 D
1999 2078 D
S
N
1986 2071 M
1987 2070 D
1988 2068 D
1990 2067 D
1992 2066 D
1996 2066 D
1999 2067 D
2000 2068 D
2002 2070 D
2003 2071 D
S
N
1986 2097 M
2003 2097 D
S
N
1986 2097 M
2003 2097 D
S
N
1986 2107 M
2003 2107 D
S
N
1986 2108 M
2003 2108 D
S
N
1986 2094 M
1986 2100 D
S
N
1986 2105 M
1986 2110 D
S
N
1994 2097 M
1994 2107 D
S
N
2003 2094 M
2003 2100 D
S
N
2003 2105 M
2003 2110 D
S
N
1986 2116 M
2003 2116 D
S
N
1986 2117 M
2003 2117 D
S
N
1986 2113 M
1986 2119 D
S
N
2003 2113 M
2003 2119 D
S
N
1988 2134 M
1991 2135 D
1986 2135 D
1988 2134 D
1987 2132 D
1986 2130 D
1986 2129 D
1987 2126 D
1988 2125 D
1990 2124 D
1992 2123 D
1996 2123 D
1999 2124 D
2000 2125 D
2002 2126 D
2003 2129 D
2003 2130 D
2002 2132 D
2000 2134 D
S
N
1986 2129 M
1987 2127 D
1988 2125 D
1990 2125 D
1992 2124 D
1996 2124 D
1999 2125 D
2000 2125 D
2002 2127 D
2003 2129 D
S
N
1996 2134 M
2003 2134 D
S
N
1996 2135 M
2003 2135 D
S
N
1996 2132 M
1996 2137 D
S
N
1988 2152 M
1991 2153 D
1986 2153 D
1988 2152 D
1987 2151 D
1986 2148 D
1986 2147 D
1987 2144 D
1988 2143 D
1990 2142 D
1992 2141 D
1996 2141 D
1999 2142 D
2000 2143 D
2002 2144 D
2003 2147 D
2003 2148 D
2002 2151 D
2000 2152 D
S
N
1986 2147 M
1987 2145 D
1988 2144 D
1990 2143 D
1992 2142 D
1996 2142 D
1999 2143 D
2000 2144 D
2002 2145 D
2003 2147 D
S
N
1996 2152 M
2003 2152 D
S
N
1996 2153 M
2003 2153 D
S
N
1996 2150 M
1996 2156 D
S
N
1988 2170 M
1986 2171 D
1991 2171 D
1988 2170 D
1987 2168 D
1986 2166 D
1986 2164 D
1987 2161 D
1988 2160 D
1990 2160 D
1991 2160 D
1992 2161 D
1993 2163 D
1995 2168 D
1995 2169 D
1997 2171 D
S
N
1990 2160 M
1991 2161 D
1992 2163 D
1994 2168 D
1995 2169 D
1995 2170 D
1997 2171 D
2000 2171 D
2002 2169 D
2003 2167 D
2003 2164 D
2002 2162 D
2000 2160 D
1998 2160 D
2003 2160 D
2000 2160 D
S
N
1986 2188 M
2003 2199 D
S
N
1986 2189 M
2003 2199 D
S
N
1986 2199 M
2003 2188 D
S
N
1986 2187 M
1986 2191 D
S
N
1986 2196 M
1986 2201 D
S
N
2003 2187 M
2003 2191 D
S
N
2003 2196 M
2003 2201 D
S
N
1988 2215 M
1986 2215 D
1991 2215 D
1988 2215 D
1987 2213 D
1986 2211 D
1986 2208 D
1987 2206 D
1988 2204 D
1990 2204 D
1991 2205 D
1992 2206 D
1993 2207 D
1995 2212 D
1995 2214 D
1997 2215 D
S
N
1990 2204 M
1991 2206 D
1992 2207 D
1994 2212 D
1995 2214 D
1995 2215 D
1997 2215 D
2000 2215 D
2002 2214 D
2003 2211 D
2003 2209 D
2002 2207 D
2000 2205 D
1998 2204 D
2003 2204 D
2000 2205 D
S
N
1986 2234 M
2003 2237 D
S
N
1986 2234 M
1999 2237 D
S
N
1986 2240 M
2003 2237 D
S
N
1986 2240 M
2003 2243 D
S
N
1986 2241 M
1999 2243 D
S
N
1986 2246 M
2003 2243 D
S
N
1986 2231 M
1986 2237 D
S
N
1986 2244 M
1986 2249 D
S
N
1988 2263 M
1991 2264 D
1986 2264 D
1988 2263 D
1987 2262 D
1986 2259 D
1986 2258 D
1987 2255 D
1988 2254 D
1990 2253 D
1992 2252 D
1996 2252 D
1999 2253 D
2000 2254 D
2002 2255 D
2003 2258 D
2003 2259 D
2002 2262 D
2000 2263 D
S
N
1986 2258 M
1987 2256 D
1988 2254 D
1990 2254 D
1992 2253 D
1996 2253 D
1999 2254 D
2000 2254 D
2002 2256 D
2003 2258 D
S
N
1996 2263 M
2003 2263 D
S
N
1996 2264 M
2003 2264 D
S
N
1996 2261 M
1996 2266 D
S
N
1989 2284 M
1990 2285 D
1991 2284 D
1990 2283 D
1989 2283 D
1987 2284 D
1987 2285 D
1986 2287 D
1986 2290 D
1987 2293 D
1987 2293 D
1989 2294 D
1991 2294 D
1992 2293 D
1994 2291 D
1995 2287 D
1996 2285 D
1998 2284 D
2000 2283 D
2003 2283 D
S
N
1986 2290 M
1987 2292 D
1987 2293 D
1989 2293 D
1991 2293 D
1992 2293 D
1994 2290 D
1995 2287 D
S
N
2001 2283 M
2000 2284 D
2000 2285 D
2002 2289 D
2002 2292 D
2001 2293 D
2000 2294 D
S
N
2000 2285 M
2003 2289 D
2003 2293 D
2002 2293 D
2000 2294 D
1999 2294 D
S
N
1986 2304 M
1987 2301 D
1989 2300 D
1993 2299 D
1995 2299 D
1999 2300 D
2002 2301 D
2003 2304 D
2003 2305 D
2002 2308 D
1999 2309 D
1995 2310 D
1993 2310 D
1989 2309 D
1987 2308 D
1986 2305 D
1986 2304 D
S
N
1986 2304 M
1987 2302 D
1987 2301 D
1989 2301 D
1993 2300 D
1995 2300 D
1999 2301 D
2001 2301 D
2002 2302 D
2003 2304 D
S
N
2003 2305 M
2002 2307 D
2001 2308 D
1999 2309 D
1995 2309 D
1993 2309 D
1989 2309 D
1987 2308 D
1987 2307 D
1986 2305 D
S
N
1989 2317 M
1988 2319 D
1986 2321 D
2003 2321 D
S
N
1987 2321 M
2003 2321 D
S
N
2003 2317 M
2003 2325 D
S
N
1989 2333 M
1988 2335 D
1986 2337 D
2003 2337 D
S
N
1987 2336 M
2003 2336 D
S
N
2003 2333 M
2003 2340 D
S
4 Sw
N
583 2342 M
583 1520 D
S
N
583 1520 M
1967 1520 D
S
N
1967 1520 M
1967 2342 D
S
N
1967 2342 M
583 2342 D
S
N
583 1520 M
1967 1520 D
S
N
583 1520 M
583 1551 D
S
N
645 1531 M
645 1520 D
S
N
706 1520 M
706 1531 D
S
N
768 1531 M
768 1520 D
S
N
829 1520 M
829 1531 D
S
N
891 1551 M
891 1520 D
S
N
952 1520 M
952 1531 D
S
N
1014 1531 M
1014 1520 D
S
N
1075 1520 M
1075 1531 D
S
N
1137 1531 M
1137 1520 D
S
N
1198 1520 M
1198 1551 D
S
N
1260 1531 M
1260 1520 D
S
N
1321 1520 M
1321 1531 D
S
N
1383 1531 M
1383 1520 D
S
N
1444 1520 M
1444 1531 D
S
N
1506 1551 M
1506 1520 D
S
N
1567 1520 M
1567 1531 D
S
N
1629 1531 M
1629 1520 D
S
N
1690 1520 M
1690 1531 D
S
N
1752 1531 M
1752 1520 D
S
N
1813 1520 M
1813 1551 D
S
N
1875 1531 M
1875 1520 D
S
N
1936 1520 M
1936 1531 D
S
N
583 2311 M
583 2342 D
S
N
645 2342 M
645 2332 D
S
N
706 2332 M
706 2342 D
S
N
768 2342 M
768 2332 D
S
N
829 2332 M
829 2342 D
S
N
891 2342 M
891 2311 D
S
N
952 2332 M
952 2342 D
S
N
1014 2342 M
1014 2332 D
S
N
1075 2332 M
1075 2342 D
S
N
1137 2342 M
1137 2332 D
S
N
1198 2311 M
1198 2342 D
S
N
1260 2342 M
1260 2332 D
S
N
1321 2332 M
1321 2342 D
S
N
1383 2342 M
1383 2332 D
S
N
1444 2332 M
1444 2342 D
S
N
1506 2342 M
1506 2311 D
S
N
1567 2332 M
1567 2342 D
S
N
1629 2342 M
1629 2332 D
S
N
1690 2332 M
1690 2342 D
S
N
1752 2342 M
1752 2332 D
S
N
1813 2311 M
1813 2342 D
S
N
1875 2342 M
1875 2332 D
S
N
1936 2332 M
1936 2342 D
S
N
583 1520 M
583 2342 D
S
N
583 1529 M
593 1529 D
S
N
593 1565 M
583 1565 D
S
N
583 1593 M
614 1593 D
S
N
593 1616 M
583 1616 D
S
N
583 1635 M
593 1635 D
S
N
593 1652 M
583 1652 D
S
N
583 1666 M
593 1666 D
S
N
614 1679 M
583 1679 D
S
N
583 1766 M
593 1766 D
S
N
593 1817 M
583 1817 D
S
N
583 1853 M
593 1853 D
S
N
614 1881 M
583 1881 D
S
N
583 1903 M
593 1903 D
S
N
593 1923 M
583 1923 D
S
N
583 1939 M
593 1939 D
S
N
593 1954 M
583 1954 D
S
N
583 1967 M
614 1967 D
S
N
593 2054 M
583 2054 D
S
N
583 2105 M
593 2105 D
S
N
593 2141 M
583 2141 D
S
N
583 2169 M
614 2169 D
S
N
593 2191 M
583 2191 D
S
N
583 2211 M
593 2211 D
S
N
593 2227 M
583 2227 D
S
N
583 2242 M
593 2242 D
S
N
614 2255 M
583 2255 D
S
N
412 1606 M
407 1605 D
404 1600 D
403 1593 D
403 1588 D
404 1581 D
407 1576 D
412 1575 D
415 1575 D
420 1576 D
423 1581 D
424 1588 D
424 1593 D
423 1600 D
420 1605 D
415 1606 D
412 1606 D
S
N
412 1606 M
409 1605 D
407 1603 D
406 1600 D
404 1593 D
404 1588 D
406 1581 D
407 1578 D
409 1576 D
412 1575 D
S
N
415 1575 M
418 1576 D
420 1578 D
421 1581 D
423 1588 D
423 1593 D
421 1600 D
420 1603 D
418 1605 D
415 1606 D
S
N
436 1578 M
435 1576 D
436 1575 D
438 1576 D
436 1578 D
S
N
457 1606 M
453 1605 D
450 1600 D
448 1593 D
448 1588 D
450 1581 D
453 1576 D
457 1575 D
460 1575 D
465 1576 D
468 1581 D
469 1588 D
469 1593 D
468 1600 D
465 1605 D
460 1606 D
457 1606 D
S
N
457 1606 M
454 1605 D
453 1603 D
451 1600 D
450 1593 D
450 1588 D
451 1581 D
453 1578 D
454 1576 D
457 1575 D
S
N
460 1575 M
463 1576 D
465 1578 D
466 1581 D
468 1588 D
468 1593 D
466 1600 D
465 1603 D
463 1605 D
460 1606 D
S
N
487 1606 M
483 1605 D
480 1600 D
478 1593 D
478 1588 D
480 1581 D
483 1576 D
487 1575 D
490 1575 D
495 1576 D
498 1581 D
500 1588 D
500 1593 D
498 1600 D
495 1605 D
490 1606 D
487 1606 D
S
N
487 1606 M
484 1605 D
483 1603 D
481 1600 D
480 1593 D
480 1588 D
481 1581 D
483 1578 D
484 1576 D
487 1575 D
S
N
490 1575 M
493 1576 D
495 1578 D
496 1581 D
498 1588 D
498 1593 D
496 1600 D
495 1603 D
493 1605 D
490 1606 D
S
N
518 1606 M
513 1605 D
510 1600 D
509 1593 D
509 1588 D
510 1581 D
513 1576 D
518 1575 D
521 1575 D
525 1576 D
528 1581 D
530 1588 D
530 1593 D
528 1600 D
525 1605 D
521 1606 D
518 1606 D
S
N
518 1606 M
515 1605 D
513 1603 D
512 1600 D
510 1593 D
510 1588 D
512 1581 D
513 1578 D
515 1576 D
518 1575 D
S
N
521 1575 M
524 1576 D
525 1578 D
527 1581 D
528 1588 D
528 1593 D
527 1600 D
525 1603 D
524 1605 D
521 1606 D
S
N
542 1606 M
539 1591 D
S
N
539 1591 M
542 1594 D
546 1596 D
551 1596 D
555 1594 D
558 1591 D
560 1587 D
560 1584 D
558 1579 D
555 1576 D
551 1575 D
546 1575 D
542 1576 D
540 1578 D
539 1581 D
539 1582 D
540 1584 D
542 1582 D
540 1581 D
S
N
551 1596 M
554 1594 D
557 1591 D
558 1587 D
558 1584 D
557 1579 D
554 1576 D
551 1575 D
S
N
542 1606 M
557 1606 D
S
N
542 1605 M
549 1605 D
557 1606 D
S
N
412 1693 M
407 1692 D
404 1687 D
403 1679 D
403 1675 D
404 1667 D
407 1663 D
412 1661 D
415 1661 D
420 1663 D
423 1667 D
424 1675 D
424 1679 D
423 1687 D
420 1692 D
415 1693 D
412 1693 D
S
N
412 1693 M
409 1692 D
407 1690 D
406 1687 D
404 1679 D
404 1675 D
406 1667 D
407 1664 D
409 1663 D
412 1661 D
S
N
415 1661 M
418 1663 D
420 1664 D
421 1667 D
423 1675 D
423 1679 D
421 1687 D
420 1690 D
418 1692 D
415 1693 D
S
N
436 1664 M
435 1663 D
436 1661 D
438 1663 D
436 1664 D
S
N
457 1693 M
453 1692 D
450 1687 D
448 1679 D
448 1675 D
450 1667 D
453 1663 D
457 1661 D
460 1661 D
465 1663 D
468 1667 D
469 1675 D
469 1679 D
468 1687 D
465 1692 D
460 1693 D
457 1693 D
S
N
457 1693 M
454 1692 D
453 1690 D
451 1687 D
450 1679 D
450 1675 D
451 1667 D
453 1664 D
454 1663 D
457 1661 D
S
N
460 1661 M
463 1663 D
465 1664 D
466 1667 D
468 1675 D
468 1679 D
466 1687 D
465 1690 D
463 1692 D
460 1693 D
S
N
487 1693 M
483 1692 D
480 1687 D
478 1679 D
478 1675 D
480 1667 D
483 1663 D
487 1661 D
490 1661 D
495 1663 D
498 1667 D
500 1675 D
500 1679 D
498 1687 D
495 1692 D
490 1693 D
487 1693 D
S
N
487 1693 M
484 1692 D
483 1690 D
481 1687 D
480 1679 D
480 1675 D
481 1667 D
483 1664 D
484 1663 D
487 1661 D
S
N
490 1661 M
493 1663 D
495 1664 D
496 1667 D
498 1675 D
498 1679 D
496 1687 D
495 1690 D
493 1692 D
490 1693 D
S
N
513 1687 M
516 1688 D
521 1693 D
521 1661 D
S
N
519 1692 M
519 1661 D
S
N
513 1661 M
527 1661 D
S
N
548 1693 M
543 1692 D
540 1687 D
539 1679 D
539 1675 D
540 1667 D
543 1663 D
548 1661 D
551 1661 D
555 1663 D
558 1667 D
560 1675 D
560 1679 D
558 1687 D
555 1692 D
551 1693 D
548 1693 D
S
N
548 1693 M
545 1692 D
543 1690 D
542 1687 D
540 1679 D
540 1675 D
542 1667 D
543 1664 D
545 1663 D
548 1661 D
S
N
551 1661 M
554 1663 D
555 1664 D
557 1667 D
558 1675 D
558 1679 D
557 1687 D
555 1690 D
554 1692 D
551 1693 D
S
N
412 1894 M
407 1893 D
404 1888 D
403 1881 D
403 1876 D
404 1869 D
407 1864 D
412 1863 D
415 1863 D
420 1864 D
423 1869 D
424 1876 D
424 1881 D
423 1888 D
420 1893 D
415 1894 D
412 1894 D
S
N
412 1894 M
409 1893 D
407 1891 D
406 1888 D
404 1881 D
404 1876 D
406 1869 D
407 1866 D
409 1864 D
412 1863 D
S
N
415 1863 M
418 1864 D
420 1866 D
421 1869 D
423 1876 D
423 1881 D
421 1888 D
420 1891 D
418 1893 D
415 1894 D
S
N
436 1866 M
435 1864 D
436 1863 D
438 1864 D
436 1866 D
S
N
457 1894 M
453 1893 D
450 1888 D
448 1881 D
448 1876 D
450 1869 D
453 1864 D
457 1863 D
460 1863 D
465 1864 D
468 1869 D
469 1876 D
469 1881 D
468 1888 D
465 1893 D
460 1894 D
457 1894 D
S
N
457 1894 M
454 1893 D
453 1891 D
451 1888 D
450 1881 D
450 1876 D
451 1869 D
453 1866 D
454 1864 D
457 1863 D
S
N
460 1863 M
463 1864 D
465 1866 D
466 1869 D
468 1876 D
468 1881 D
466 1888 D
465 1891 D
463 1893 D
460 1894 D
S
N
487 1894 M
483 1893 D
480 1888 D
478 1881 D
478 1876 D
480 1869 D
483 1864 D
487 1863 D
490 1863 D
495 1864 D
498 1869 D
500 1876 D
500 1881 D
498 1888 D
495 1893 D
490 1894 D
487 1894 D
S
N
487 1894 M
484 1893 D
483 1891 D
481 1888 D
480 1881 D
480 1876 D
481 1869 D
483 1866 D
484 1864 D
487 1863 D
S
N
490 1863 M
493 1864 D
495 1866 D
496 1869 D
498 1876 D
498 1881 D
496 1888 D
495 1891 D
493 1893 D
490 1894 D
S
N
512 1894 M
509 1879 D
S
N
509 1879 M
512 1882 D
516 1884 D
521 1884 D
525 1882 D
528 1879 D
530 1875 D
530 1872 D
528 1867 D
525 1864 D
521 1863 D
516 1863 D
512 1864 D
510 1866 D
509 1869 D
509 1870 D
510 1872 D
512 1870 D
510 1869 D
S
N
521 1884 M
524 1882 D
527 1879 D
528 1875 D
528 1872 D
527 1867 D
524 1864 D
521 1863 D
S
N
512 1894 M
527 1894 D
S
N
512 1893 M
519 1893 D
527 1894 D
S
N
548 1894 M
543 1893 D
540 1888 D
539 1881 D
539 1876 D
540 1869 D
543 1864 D
548 1863 D
551 1863 D
555 1864 D
558 1869 D
560 1876 D
560 1881 D
558 1888 D
555 1893 D
551 1894 D
548 1894 D
S
N
548 1894 M
545 1893 D
543 1891 D
542 1888 D
540 1881 D
540 1876 D
542 1869 D
543 1866 D
545 1864 D
548 1863 D
S
N
551 1863 M
554 1864 D
555 1866 D
557 1869 D
558 1876 D
558 1881 D
557 1888 D
555 1891 D
554 1893 D
551 1894 D
S
N
412 1981 M
407 1979 D
404 1975 D
403 1967 D
403 1963 D
404 1955 D
407 1951 D
412 1949 D
415 1949 D
420 1951 D
423 1955 D
424 1963 D
424 1967 D
423 1975 D
420 1979 D
415 1981 D
412 1981 D
S
N
412 1981 M
409 1979 D
407 1978 D
406 1975 D
404 1967 D
404 1963 D
406 1955 D
407 1952 D
409 1951 D
412 1949 D
S
N
415 1949 M
418 1951 D
420 1952 D
421 1955 D
423 1963 D
423 1967 D
421 1975 D
420 1978 D
418 1979 D
415 1981 D
S
N
436 1952 M
435 1951 D
436 1949 D
438 1951 D
436 1952 D
S
N
457 1981 M
453 1979 D
450 1975 D
448 1967 D
448 1963 D
450 1955 D
453 1951 D
457 1949 D
460 1949 D
465 1951 D
468 1955 D
469 1963 D
469 1967 D
468 1975 D
465 1979 D
460 1981 D
457 1981 D
S
N
457 1981 M
454 1979 D
453 1978 D
451 1975 D
450 1967 D
450 1963 D
451 1955 D
453 1952 D
454 1951 D
457 1949 D
S
N
460 1949 M
463 1951 D
465 1952 D
466 1955 D
468 1963 D
468 1967 D
466 1975 D
465 1978 D
463 1979 D
460 1981 D
S
N
483 1975 M
486 1976 D
490 1981 D
490 1949 D
S
N
489 1979 M
489 1949 D
S
N
483 1949 M
496 1949 D
S
N
518 1981 M
513 1979 D
510 1975 D
509 1967 D
509 1963 D
510 1955 D
513 1951 D
518 1949 D
521 1949 D
525 1951 D
528 1955 D
530 1963 D
530 1967 D
528 1975 D
525 1979 D
521 1981 D
518 1981 D
S
N
518 1981 M
515 1979 D
513 1978 D
512 1975 D
510 1967 D
510 1963 D
512 1955 D
513 1952 D
515 1951 D
518 1949 D
S
N
521 1949 M
524 1951 D
525 1952 D
527 1955 D
528 1963 D
528 1967 D
527 1975 D
525 1978 D
524 1979 D
521 1981 D
S
N
548 1981 M
543 1979 D
540 1975 D
539 1967 D
539 1963 D
540 1955 D
543 1951 D
548 1949 D
551 1949 D
555 1951 D
558 1955 D
560 1963 D
560 1967 D
558 1975 D
555 1979 D
551 1981 D
548 1981 D
S
N
548 1981 M
545 1979 D
543 1978 D
542 1975 D
540 1967 D
540 1963 D
542 1955 D
543 1952 D
545 1951 D
548 1949 D
S
N
551 1949 M
554 1951 D
555 1952 D
557 1955 D
558 1963 D
558 1967 D
557 1975 D
555 1978 D
554 1979 D
551 1981 D
S
N
412 2182 M
407 2181 D
404 2176 D
403 2169 D
403 2164 D
404 2157 D
407 2152 D
412 2151 D
415 2151 D
420 2152 D
423 2157 D
424 2164 D
424 2169 D
423 2176 D
420 2181 D
415 2182 D
412 2182 D
S
N
412 2182 M
409 2181 D
407 2179 D
406 2176 D
404 2169 D
404 2164 D
406 2157 D
407 2154 D
409 2152 D
412 2151 D
S
N
415 2151 M
418 2152 D
420 2154 D
421 2157 D
423 2164 D
423 2169 D
421 2176 D
420 2179 D
418 2181 D
415 2182 D
S
N
436 2154 M
435 2152 D
436 2151 D
438 2152 D
436 2154 D
S
N
457 2182 M
453 2181 D
450 2176 D
448 2169 D
448 2164 D
450 2157 D
453 2152 D
457 2151 D
460 2151 D
465 2152 D
468 2157 D
469 2164 D
469 2169 D
468 2176 D
465 2181 D
460 2182 D
457 2182 D
S
N
457 2182 M
454 2181 D
453 2179 D
451 2176 D
450 2169 D
450 2164 D
451 2157 D
453 2154 D
454 2152 D
457 2151 D
S
N
460 2151 M
463 2152 D
465 2154 D
466 2157 D
468 2164 D
468 2169 D
466 2176 D
465 2179 D
463 2181 D
460 2182 D
S
N
481 2182 M
478 2167 D
S
N
478 2167 M
481 2170 D
486 2172 D
490 2172 D
495 2170 D
498 2167 D
500 2163 D
500 2160 D
498 2155 D
495 2152 D
490 2151 D
486 2151 D
481 2152 D
480 2154 D
478 2157 D
478 2158 D
480 2160 D
481 2158 D
480 2157 D
S
N
490 2172 M
493 2170 D
496 2167 D
498 2163 D
498 2160 D
496 2155 D
493 2152 D
490 2151 D
S
N
481 2182 M
496 2182 D
S
N
481 2181 M
489 2181 D
496 2182 D
S
N
518 2182 M
513 2181 D
510 2176 D
509 2169 D
509 2164 D
510 2157 D
513 2152 D
518 2151 D
521 2151 D
525 2152 D
528 2157 D
530 2164 D
530 2169 D
528 2176 D
525 2181 D
521 2182 D
518 2182 D
S
N
518 2182 M
515 2181 D
513 2179 D
512 2176 D
510 2169 D
510 2164 D
512 2157 D
513 2154 D
515 2152 D
518 2151 D
S
N
521 2151 M
524 2152 D
525 2154 D
527 2157 D
528 2164 D
528 2169 D
527 2176 D
525 2179 D
524 2181 D
521 2182 D
S
N
548 2182 M
543 2181 D
540 2176 D
539 2169 D
539 2164 D
540 2157 D
543 2152 D
548 2151 D
551 2151 D
555 2152 D
558 2157 D
560 2164 D
560 2169 D
558 2176 D
555 2181 D
551 2182 D
548 2182 D
S
N
548 2182 M
545 2181 D
543 2179 D
542 2176 D
540 2169 D
540 2164 D
542 2157 D
543 2154 D
545 2152 D
548 2151 D
S
N
551 2151 M
554 2152 D
555 2154 D
557 2157 D
558 2164 D
558 2169 D
557 2176 D
555 2179 D
554 2181 D
551 2182 D
S
N
412 2269 M
407 2267 D
404 2263 D
403 2255 D
403 2251 D
404 2243 D
407 2239 D
412 2237 D
415 2237 D
420 2239 D
423 2243 D
424 2251 D
424 2255 D
423 2263 D
420 2267 D
415 2269 D
412 2269 D
S
N
412 2269 M
409 2267 D
407 2266 D
406 2263 D
404 2255 D
404 2251 D
406 2243 D
407 2240 D
409 2239 D
412 2237 D
S
N
415 2237 M
418 2239 D
420 2240 D
421 2243 D
423 2251 D
423 2255 D
421 2263 D
420 2266 D
418 2267 D
415 2269 D
S
N
436 2240 M
435 2239 D
436 2237 D
438 2239 D
436 2240 D
S
N
453 2263 M
456 2264 D
460 2269 D
460 2237 D
S
N
459 2267 M
459 2237 D
S
N
453 2237 M
466 2237 D
S
N
487 2269 M
483 2267 D
480 2263 D
478 2255 D
478 2251 D
480 2243 D
483 2239 D
487 2237 D
490 2237 D
495 2239 D
498 2243 D
500 2251 D
500 2255 D
498 2263 D
495 2267 D
490 2269 D
487 2269 D
S
N
487 2269 M
484 2267 D
483 2266 D
481 2263 D
480 2255 D
480 2251 D
481 2243 D
483 2240 D
484 2239 D
487 2237 D
S
N
490 2237 M
493 2239 D
495 2240 D
496 2243 D
498 2251 D
498 2255 D
496 2263 D
495 2266 D
493 2267 D
490 2269 D
S
N
518 2269 M
513 2267 D
510 2263 D
509 2255 D
509 2251 D
510 2243 D
513 2239 D
518 2237 D
521 2237 D
525 2239 D
528 2243 D
530 2251 D
530 2255 D
528 2263 D
525 2267 D
521 2269 D
518 2269 D
S
N
518 2269 M
515 2267 D
513 2266 D
512 2263 D
510 2255 D
510 2251 D
512 2243 D
513 2240 D
515 2239 D
518 2237 D
S
N
521 2237 M
524 2239 D
525 2240 D
527 2243 D
528 2251 D
528 2255 D
527 2263 D
525 2266 D
524 2267 D
521 2269 D
S
N
548 2269 M
543 2267 D
540 2263 D
539 2255 D
539 2251 D
540 2243 D
543 2239 D
548 2237 D
551 2237 D
555 2239 D
558 2243 D
560 2251 D
560 2255 D
558 2263 D
555 2267 D
551 2269 D
548 2269 D
S
N
548 2269 M
545 2267 D
543 2266 D
542 2263 D
540 2255 D
540 2251 D
542 2243 D
543 2240 D
545 2239 D
548 2237 D
S
N
551 2237 M
554 2239 D
555 2240 D
557 2243 D
558 2251 D
558 2255 D
557 2263 D
555 2266 D
554 2267 D
551 2269 D
S
N
1967 1520 M
1967 2342 D
S
N
1957 1529 M
1967 1529 D
S
N
1967 1565 M
1957 1565 D
S
N
1936 1593 M
1967 1593 D
S
N
1967 1616 M
1957 1616 D
S
N
1957 1635 M
1967 1635 D
S
N
1967 1652 M
1957 1652 D
S
N
1957 1666 M
1967 1666 D
S
N
1967 1679 M
1936 1679 D
S
N
1957 1766 M
1967 1766 D
S
N
1967 1817 M
1957 1817 D
S
N
1957 1853 M
1967 1853 D
S
N
1967 1881 M
1936 1881 D
S
N
1957 1903 M
1967 1903 D
S
N
1967 1923 M
1957 1923 D
S
N
1957 1939 M
1967 1939 D
S
N
1967 1954 M
1957 1954 D
S
N
1936 1967 M
1967 1967 D
S
N
1967 2054 M
1957 2054 D
S
N
1957 2105 M
1967 2105 D
S
N
1967 2141 M
1957 2141 D
S
N
1936 2169 M
1967 2169 D
S
N
1967 2191 M
1957 2191 D
S
N
1957 2211 M
1967 2211 D
S
N
1967 2227 M
1957 2227 D
S
N
1957 2242 M
1967 2242 D
S
N
1967 2255 M
1936 2255 D
S
N
1327 2186 M
1431 2186 D
S
583 1520 P
N
583 1521 M
631 1521 D
631 1660 D
680 1660 D
680 1755 D
728 1755 D
728 1829 D
776 1829 D
776 1883 D
825 1883 D
825 1912 D
873 1912 D
873 1925 D
921 1925 D
921 1931 D
969 1931 D
969 1934 D
1018 1934 D
1018 1937 D
1066 1937 D
1066 1943 D
1114 1943 D
1114 1951 D
1163 1951 D
1163 1961 D
1211 1961 D
1211 1973 D
1259 1973 D
1259 1985 D
1308 1985 D
1308 1999 D
1356 1999 D
1356 2013 D
1404 2013 D
1404 2025 D
1453 2025 D
1453 2035 D
1501 2035 D
1501 2043 D
1549 2043 D
1549 1983 D
1598 1983 D
1598 1910 D
1646 1910 D
1646 1850 D
1694 1850 D
1694 1793 D
1742 1793 D
1742 1739 D
1791 1739 D
1791 1686 D
1839 1686 D
1839 1632 D
1887 1632 D
1887 1574 D
1936 1574 D
1936 1520 D
S
0 0 1 setrgbcolor
N
1327 2117 M
1339 2117 D
S
N
1351 2117 M
1363 2117 D
S
N
1375 2117 M
1387 2117 D
S
N
1400 2117 M
1412 2117 D
S
N
1424 2117 M
1431 2117 D
S
583 1520 P
N
583 1523 M
595 1523 D
S
N
607 1523 M
619 1523 D
S
N
631 1523 M
631 1535 D
S
N
631 1547 M
631 1559 D
S
N
631 1571 M
631 1583 D
S
N
631 1596 M
631 1608 D
S
N
631 1620 M
631 1632 D
S
N
631 1644 M
631 1656 D
S
N
638 1662 M
650 1662 D
S
N
662 1662 M
674 1662 D
S
N
680 1668 M
680 1680 D
S
N
680 1693 M
680 1705 D
S
N
680 1717 M
680 1729 D
S
N
680 1741 M
680 1753 D
S
N
690 1755 M
702 1755 D
S
N
715 1755 M
727 1755 D
S
N
728 1765 M
728 1777 D
S
N
728 1790 M
728 1802 D
S
N
728 1814 M
728 1826 D
S
N
737 1829 M
749 1829 D
S
N
761 1829 M
773 1829 D
S
N
776 1838 M
776 1850 D
S
N
776 1862 M
776 1874 D
S
N
782 1880 M
794 1880 D
S
N
807 1880 M
819 1880 D
S
N
825 1887 M
825 1899 D
S
N
825 1911 M
825 1911 D
837 1911 D
S
N
849 1911 M
861 1911 D
S
N
873 1911 M
873 1923 D
S
N
882 1926 M
894 1926 D
S
N
907 1926 M
919 1926 D
S
N
925 1932 M
937 1932 D
S
N
949 1932 M
961 1932 D
S
N
970 1935 M
982 1935 D
S
N
994 1935 M
1006 1935 D
S
N
1018 1936 M
1018 1940 D
1026 1940 D
S
N
1038 1940 M
1050 1940 D
S
N
1062 1940 M
1066 1940 D
1066 1945 D
1069 1945 D
S
N
1081 1945 M
1093 1945 D
S
N
1105 1945 M
1114 1945 D
1114 1948 D
S
N
1121 1953 M
1134 1953 D
S
N
1146 1953 M
1158 1953 D
S
N
1163 1960 M
1163 1963 D
1172 1963 D
S
N
1185 1963 M
1197 1963 D
S
N
1209 1963 M
1211 1963 D
1211 1973 D
S
N
1222 1974 M
1234 1974 D
S
N
1246 1974 M
1258 1974 D
S
N
1259 1985 M
1259 1986 D
1270 1986 D
S
N
1282 1986 M
1294 1986 D
S
N
1306 1986 M
1308 1986 D
1308 1997 D
S
N
1316 2000 M
1329 2000 D
S
N
1341 2000 M
1353 2000 D
S
N
1356 2009 M
1356 2013 D
1364 2013 D
S
N
1376 2013 M
1389 2013 D
S
N
1401 2013 M
1404 2013 D
1404 2021 D
S
N
1413 2025 M
1425 2025 D
S
N
1437 2025 M
1449 2025 D
S
N
1453 2034 M
1453 2035 D
1463 2035 D
S
N
1475 2035 M
1487 2035 D
S
N
1499 2035 M
1501 2035 D
1501 2042 D
1504 2042 D
S
N
1516 2042 M
1529 2042 D
S
N
1541 2042 M
1549 2042 D
1549 2039 D
S
N
1549 2027 M
1549 2015 D
S
N
1549 2003 M
1549 1990 D
S
N
1553 1982 M
1565 1982 D
S
N
1577 1982 M
1589 1982 D
S
N
1598 1978 M
1598 1966 D
S
N
1598 1954 M
1598 1942 D
S
N
1598 1930 M
1598 1918 D
S
N
1600 1908 M
1612 1908 D
S
N
1624 1908 M
1636 1908 D
S
N
1646 1905 M
1646 1893 D
S
N
1646 1881 M
1646 1869 D
S
N
1646 1857 M
1646 1847 D
1648 1847 D
S
N
1660 1847 M
1672 1847 D
S
N
1684 1847 M
1694 1847 D
1694 1845 D
S
N
1694 1833 M
1694 1821 D
S
N
1694 1808 M
1694 1796 D
S
N
1700 1790 M
1712 1790 D
S
N
1724 1790 M
1736 1790 D
S
N
1742 1784 M
1742 1772 D
S
N
1742 1760 M
1742 1748 D
S
N
1742 1736 M
1742 1733 D
1752 1733 D
S
N
1764 1733 M
1776 1733 D
S
N
1788 1733 M
1791 1733 D
1791 1723 D
S
N
1791 1711 M
1791 1699 D
S
N
1791 1687 M
1791 1675 D
1791 1675 D
S
N
1803 1675 M
1815 1675 D
S
N
1827 1675 M
1839 1675 D
1839 1675 D
S
N
1839 1663 M
1839 1651 D
S
N
1839 1638 M
1839 1626 D
S
N
1841 1617 M
1853 1617 D
S
N
1866 1617 M
1878 1617 D
S
N
1887 1614 M
1887 1602 D
S
N
1887 1590 M
1887 1578 D
S
N
1887 1566 M
1887 1561 D
1894 1561 D
S
N
1907 1561 M
1919 1561 D
S
N
1931 1561 M
1936 1561 D
1936 1553 D
S
N
1936 1541 M
1936 1529 D
S
3 Sw
0 0 0 setrgbcolor
N
833 1477 M
833 1476 D
832 1476 D
832 1477 D
833 1478 D
836 1480 D
841 1480 D
844 1478 D
845 1477 D
847 1474 D
847 1465 D
848 1462 D
849 1461 D
S
N
845 1477 M
845 1465 D
847 1462 D
849 1461 D
851 1461 D
S
N
845 1474 M
844 1473 D
836 1472 D
832 1470 D
830 1467 D
830 1465 D
832 1462 D
836 1461 D
840 1461 D
843 1462 D
845 1465 D
S
N
836 1472 M
833 1470 D
832 1467 D
832 1465 D
833 1462 D
836 1461 D
S
N
860 1489 M
860 1461 D
S
N
862 1489 M
870 1465 D
S
N
860 1489 M
870 1461 D
S
N
879 1489 M
870 1461 D
S
N
879 1489 M
879 1461 D
S
N
881 1489 M
881 1461 D
S
N
856 1489 M
862 1489 D
S
N
879 1489 M
885 1489 D
S
N
856 1461 M
864 1461 D
S
N
875 1461 M
885 1461 D
S
N
911 1485 M
912 1481 D
912 1489 D
911 1485 D
908 1488 D
904 1489 D
901 1489 D
897 1488 D
895 1485 D
893 1482 D
892 1478 D
892 1472 D
893 1467 D
895 1465 D
897 1462 D
901 1461 D
904 1461 D
908 1462 D
911 1465 D
912 1467 D
S
N
901 1489 M
899 1488 D
896 1485 D
895 1482 D
893 1478 D
893 1472 D
895 1467 D
896 1465 D
899 1462 D
901 1461 D
S
N
941 1478 M
940 1481 D
937 1482 D
933 1482 D
930 1481 D
929 1480 D
927 1476 D
927 1472 D
929 1469 D
931 1467 D
936 1467 D
938 1469 D
940 1472 D
S
N
933 1482 M
930 1480 D
929 1476 D
929 1472 D
930 1469 D
931 1467 D
S
N
941 1482 M
940 1472 D
940 1469 D
942 1467 D
945 1467 D
948 1470 D
949 1474 D
949 1477 D
948 1481 D
947 1484 D
944 1487 D
941 1488 D
937 1489 D
933 1489 D
929 1488 D
926 1487 D
923 1484 D
922 1481 D
921 1477 D
921 1473 D
922 1469 D
923 1466 D
926 1463 D
929 1462 D
933 1461 D
937 1461 D
941 1462 D
944 1463 D
945 1465 D
S
N
942 1482 M
941 1472 D
941 1469 D
942 1467 D
S
N
960 1489 M
960 1461 D
S
N
962 1489 M
978 1463 D
S
N
962 1487 M
978 1461 D
S
N
978 1489 M
978 1461 D
S
N
956 1489 M
962 1489 D
S
N
974 1489 M
982 1489 D
S
N
956 1461 M
964 1461 D
S
N
992 1489 M
992 1461 D
S
N
993 1489 M
993 1461 D
S
N
988 1489 M
997 1489 D
S
N
988 1461 M
1008 1461 D
1008 1469 D
1007 1461 D
S
N
1023 1489 M
1019 1488 D
1016 1485 D
1015 1482 D
1014 1477 D
1014 1473 D
1015 1467 D
1016 1465 D
1019 1462 D
1023 1461 D
1026 1461 D
1030 1462 D
1033 1465 D
1034 1467 D
1035 1473 D
1035 1477 D
1034 1482 D
1033 1485 D
1030 1488 D
1026 1489 D
1023 1489 D
S
N
1023 1489 M
1020 1488 D
1018 1485 D
1016 1482 D
1015 1477 D
1015 1473 D
1016 1467 D
1018 1465 D
1020 1462 D
1023 1461 D
S
N
1026 1461 M
1029 1462 D
1031 1465 D
1033 1467 D
1034 1473 D
1034 1477 D
1033 1482 D
1031 1485 D
1029 1488 D
1026 1489 D
S
N
1046 1480 M
1045 1478 D
1046 1477 D
1048 1478 D
1046 1480 D
S
N
1046 1463 M
1045 1462 D
1046 1461 D
1048 1462 D
1046 1463 D
S
N
1093 1477 M
1094 1480 D
1094 1474 D
1093 1477 D
1092 1478 D
1089 1480 D
1083 1480 D
1081 1478 D
1079 1477 D
1079 1474 D
1081 1473 D
1083 1472 D
1090 1469 D
1093 1467 D
1094 1466 D
S
N
1079 1476 M
1081 1474 D
1083 1473 D
1090 1470 D
1093 1469 D
1094 1467 D
1094 1463 D
1093 1462 D
1090 1461 D
1085 1461 D
1082 1462 D
1081 1463 D
1079 1466 D
1079 1461 D
1081 1463 D
S
N
1119 1476 M
1118 1474 D
1119 1473 D
1120 1474 D
1120 1476 D
1118 1478 D
1115 1480 D
1111 1480 D
1107 1478 D
1104 1476 D
1103 1472 D
1103 1469 D
1104 1465 D
1107 1462 D
1111 1461 D
1114 1461 D
1118 1462 D
1120 1465 D
S
N
1111 1480 M
1108 1478 D
1105 1476 D
1104 1472 D
1104 1469 D
1105 1465 D
1108 1462 D
1111 1461 D
S
N
1131 1477 M
1131 1476 D
1130 1476 D
1130 1477 D
1131 1478 D
1134 1480 D
1140 1480 D
1142 1478 D
1144 1477 D
1145 1474 D
1145 1465 D
1146 1462 D
1148 1461 D
S
N
1144 1477 M
1144 1465 D
1145 1462 D
1148 1461 D
1149 1461 D
S
N
1144 1474 M
1142 1473 D
1134 1472 D
1130 1470 D
1129 1467 D
1129 1465 D
1130 1462 D
1134 1461 D
1138 1461 D
1141 1462 D
1144 1465 D
S
N
1134 1472 M
1131 1470 D
1130 1467 D
1130 1465 D
1131 1462 D
1134 1461 D
S
N
1159 1489 M
1159 1461 D
S
N
1160 1489 M
1160 1461 D
S
N
1155 1489 M
1160 1489 D
S
N
1155 1461 M
1164 1461 D
S
N
1172 1472 M
1189 1472 D
1189 1474 D
1187 1477 D
1186 1478 D
1183 1480 D
1179 1480 D
1175 1478 D
1172 1476 D
1171 1472 D
1171 1469 D
1172 1465 D
1175 1462 D
1179 1461 D
1182 1461 D
1186 1462 D
1189 1465 D
S
N
1187 1472 M
1187 1476 D
1186 1478 D
S
N
1179 1480 M
1176 1478 D
1174 1476 D
1172 1472 D
1172 1469 D
1174 1465 D
1176 1462 D
1179 1461 D
S
N
1222 1480 M
1222 1465 D
1223 1462 D
1227 1461 D
1230 1461 D
1234 1462 D
1237 1465 D
S
N
1223 1480 M
1223 1465 D
1224 1462 D
1227 1461 D
S
N
1237 1480 M
1237 1461 D
S
N
1238 1480 M
1238 1461 D
S
N
1218 1480 M
1223 1480 D
S
N
1233 1480 M
1238 1480 D
S
N
1237 1461 M
1242 1461 D
S
N
1252 1480 M
1252 1461 D
S
N
1253 1480 M
1253 1461 D
S
N
1253 1476 M
1256 1478 D
1260 1480 D
1263 1480 D
1267 1478 D
1268 1476 D
1268 1461 D
S
N
1263 1480 M
1265 1478 D
1267 1476 D
1267 1461 D
S
N
1248 1480 M
1253 1480 D
S
N
1248 1461 M
1257 1461 D
S
N
1263 1461 M
1272 1461 D
S
N
1296 1476 M
1294 1474 D
1296 1473 D
1297 1474 D
1297 1476 D
1294 1478 D
1291 1480 D
1287 1480 D
1283 1478 D
1281 1476 D
1279 1472 D
1279 1469 D
1281 1465 D
1283 1462 D
1287 1461 D
1290 1461 D
1294 1462 D
1297 1465 D
S
N
1287 1480 M
1285 1478 D
1282 1476 D
1281 1472 D
1281 1469 D
1282 1465 D
1285 1462 D
1287 1461 D
S
N
1308 1463 M
1307 1462 D
1308 1461 D
1309 1462 D
1308 1463 D
S
N
833 1304 M
833 1303 D
832 1303 D
832 1304 D
833 1305 D
836 1307 D
841 1307 D
844 1305 D
845 1304 D
847 1301 D
847 1292 D
848 1289 D
849 1288 D
S
N
845 1304 M
845 1292 D
847 1289 D
849 1288 D
851 1288 D
S
N
845 1301 M
844 1300 D
836 1299 D
832 1297 D
830 1294 D
830 1292 D
832 1289 D
836 1288 D
840 1288 D
843 1289 D
845 1292 D
S
N
836 1299 M
833 1297 D
832 1294 D
832 1292 D
833 1289 D
836 1288 D
S
N
860 1316 M
860 1288 D
S
N
862 1316 M
870 1292 D
S
N
860 1316 M
870 1288 D
S
N
879 1316 M
870 1288 D
S
N
879 1316 M
879 1288 D
S
N
881 1316 M
881 1288 D
S
N
856 1316 M
862 1316 D
S
N
879 1316 M
885 1316 D
S
N
856 1288 M
864 1288 D
S
N
875 1288 M
885 1288 D
S
N
911 1312 M
912 1308 D
912 1316 D
911 1312 D
908 1315 D
904 1316 D
901 1316 D
897 1315 D
895 1312 D
893 1309 D
892 1305 D
892 1299 D
893 1294 D
895 1292 D
897 1289 D
901 1288 D
904 1288 D
908 1289 D
911 1292 D
912 1294 D
S
N
901 1316 M
899 1315 D
896 1312 D
895 1309 D
893 1305 D
893 1299 D
895 1294 D
896 1292 D
899 1289 D
901 1288 D
S
N
941 1305 M
940 1308 D
937 1309 D
933 1309 D
930 1308 D
929 1307 D
927 1303 D
927 1299 D
929 1296 D
931 1294 D
936 1294 D
938 1296 D
940 1299 D
S
N
933 1309 M
930 1307 D
929 1303 D
929 1299 D
930 1296 D
931 1294 D
S
N
941 1309 M
940 1299 D
940 1296 D
942 1294 D
945 1294 D
948 1297 D
949 1301 D
949 1304 D
948 1308 D
947 1311 D
944 1314 D
941 1315 D
937 1316 D
933 1316 D
929 1315 D
926 1314 D
923 1311 D
922 1308 D
921 1304 D
921 1300 D
922 1296 D
923 1293 D
926 1290 D
929 1289 D
933 1288 D
937 1288 D
941 1289 D
944 1290 D
945 1292 D
S
N
942 1309 M
941 1299 D
941 1296 D
942 1294 D
S
N
960 1316 M
960 1288 D
S
N
962 1316 M
978 1290 D
S
N
962 1314 M
978 1288 D
S
N
978 1316 M
978 1288 D
S
N
956 1316 M
962 1316 D
S
N
974 1316 M
982 1316 D
S
N
956 1288 M
964 1288 D
S
N
992 1316 M
992 1288 D
S
N
993 1316 M
993 1288 D
S
N
988 1316 M
997 1316 D
S
N
988 1288 M
1008 1288 D
1008 1296 D
1007 1288 D
S
N
1023 1316 M
1019 1315 D
1016 1312 D
1015 1309 D
1014 1304 D
1014 1300 D
1015 1294 D
1016 1292 D
1019 1289 D
1023 1288 D
1026 1288 D
1030 1289 D
1033 1292 D
1034 1294 D
1035 1300 D
1035 1304 D
1034 1309 D
1033 1312 D
1030 1315 D
1026 1316 D
1023 1316 D
S
N
1023 1316 M
1020 1315 D
1018 1312 D
1016 1309 D
1015 1304 D
1015 1300 D
1016 1294 D
1018 1292 D
1020 1289 D
1023 1288 D
S
N
1026 1288 M
1029 1289 D
1031 1292 D
1033 1294 D
1034 1300 D
1034 1304 D
1033 1309 D
1031 1312 D
1029 1315 D
1026 1316 D
S
N
1046 1307 M
1045 1305 D
1046 1304 D
1048 1305 D
1046 1307 D
S
N
1046 1290 M
1045 1289 D
1046 1288 D
1048 1289 D
1046 1290 D
S
N
1082 1307 M
1082 1278 D
S
N
1083 1307 M
1083 1278 D
S
N
1083 1303 M
1086 1305 D
1089 1307 D
1092 1307 D
1096 1305 D
1098 1303 D
1100 1299 D
1100 1296 D
1098 1292 D
1096 1289 D
1092 1288 D
1089 1288 D
1086 1289 D
1083 1292 D
S
N
1092 1307 M
1094 1305 D
1097 1303 D
1098 1299 D
1098 1296 D
1097 1292 D
1094 1289 D
1092 1288 D
S
N
1078 1307 M
1083 1307 D
S
N
1078 1278 M
1088 1278 D
S
N
1124 1316 M
1124 1288 D
S
N
1126 1316 M
1126 1288 D
S
N
1124 1303 M
1122 1305 D
1119 1307 D
1116 1307 D
1112 1305 D
1109 1303 D
1108 1299 D
1108 1296 D
1109 1292 D
1112 1289 D
1116 1288 D
1119 1288 D
1122 1289 D
1124 1292 D
S
N
1116 1307 M
1114 1305 D
1111 1303 D
1109 1299 D
1109 1296 D
1111 1292 D
1114 1289 D
1116 1288 D
S
N
1120 1316 M
1126 1316 D
S
N
1124 1288 M
1130 1288 D
S
N
1146 1315 M
1145 1314 D
1146 1312 D
1148 1314 D
1148 1315 D
1146 1316 D
1144 1316 D
1141 1315 D
1140 1312 D
1140 1288 D
S
N
1144 1316 M
1142 1315 D
1141 1312 D
1141 1288 D
S
N
1135 1307 M
1146 1307 D
S
N
1135 1288 M
1145 1288 D
S
N
1179 1307 M
1179 1292 D
1181 1289 D
1185 1288 D
1187 1288 D
1192 1289 D
1194 1292 D
S
N
1181 1307 M
1181 1292 D
1182 1289 D
1185 1288 D
S
N
1194 1307 M
1194 1288 D
S
N
1196 1307 M
1196 1288 D
S
N
1175 1307 M
1181 1307 D
S
N
1190 1307 M
1196 1307 D
S
N
1194 1288 M
1200 1288 D
S
N
1209 1307 M
1209 1288 D
S
N
1211 1307 M
1211 1288 D
S
N
1211 1303 M
1213 1305 D
1218 1307 D
1220 1307 D
1224 1305 D
1226 1303 D
1226 1288 D
S
N
1220 1307 M
1223 1305 D
1224 1303 D
1224 1288 D
S
N
1205 1307 M
1211 1307 D
S
N
1205 1288 M
1215 1288 D
S
N
1220 1288 M
1230 1288 D
S
N
1253 1303 M
1252 1301 D
1253 1300 D
1254 1301 D
1254 1303 D
1252 1305 D
1249 1307 D
1245 1307 D
1241 1305 D
1238 1303 D
1237 1299 D
1237 1296 D
1238 1292 D
1241 1289 D
1245 1288 D
1248 1288 D
1252 1289 D
1254 1292 D
S
N
1245 1307 M
1242 1305 D
1239 1303 D
1238 1299 D
1238 1296 D
1239 1292 D
1242 1289 D
1245 1288 D
S
N
1265 1290 M
1264 1289 D
1265 1288 D
1267 1289 D
1265 1290 D
S
4 Sw
N
583 1520 M
583 1261 D
S
N
583 1261 M
1967 1261 D
S
N
1967 1261 M
1967 1520 D
S
N
1967 1520 M
583 1520 D
S
N
583 1261 M
1967 1261 D
S
N
583 1261 M
583 1276 D
S
N
645 1266 M
645 1261 D
S
N
706 1261 M
706 1266 D
S
N
768 1266 M
768 1261 D
S
N
829 1261 M
829 1266 D
S
N
891 1276 M
891 1261 D
S
N
952 1261 M
952 1266 D
S
N
1014 1266 M
1014 1261 D
S
N
1075 1261 M
1075 1266 D
S
N
1137 1266 M
1137 1261 D
S
N
1198 1261 M
1198 1276 D
S
N
1260 1266 M
1260 1261 D
S
N
1321 1261 M
1321 1266 D
S
N
1383 1266 M
1383 1261 D
S
N
1444 1261 M
1444 1266 D
S
N
1506 1276 M
1506 1261 D
S
N
1567 1261 M
1567 1266 D
S
N
1629 1266 M
1629 1261 D
S
N
1690 1261 M
1690 1266 D
S
N
1752 1266 M
1752 1261 D
S
N
1813 1261 M
1813 1276 D
S
N
1875 1266 M
1875 1261 D
S
N
1936 1261 M
1936 1266 D
S
N
583 1520 M
1967 1520 D
S
N
583 1505 M
583 1520 D
S
N
645 1520 M
645 1515 D
S
N
706 1515 M
706 1520 D
S
N
768 1520 M
768 1515 D
S
N
829 1515 M
829 1520 D
S
N
891 1520 M
891 1505 D
S
N
952 1515 M
952 1520 D
S
N
1014 1520 M
1014 1515 D
S
N
1075 1515 M
1075 1520 D
S
N
1137 1520 M
1137 1515 D
S
N
1198 1505 M
1198 1520 D
S
N
1260 1520 M
1260 1515 D
S
N
1321 1515 M
1321 1520 D
S
N
1383 1520 M
1383 1515 D
S
N
1444 1515 M
1444 1520 D
S
N
1506 1520 M
1506 1505 D
S
N
1567 1515 M
1567 1520 D
S
N
1629 1520 M
1629 1515 D
S
N
1690 1515 M
1690 1520 D
S
N
1752 1520 M
1752 1515 D
S
N
1813 1505 M
1813 1520 D
S
N
1875 1520 M
1875 1515 D
S
N
1936 1515 M
1936 1520 D
S
N
583 1261 M
583 1520 D
S
N
583 1261 M
588 1261 D
S
N
588 1273 M
583 1273 D
S
N
583 1285 M
599 1285 D
S
N
588 1297 M
583 1297 D
S
N
583 1309 M
588 1309 D
S
N
588 1321 M
583 1321 D
S
N
583 1333 M
588 1333 D
S
N
599 1345 M
583 1345 D
S
N
583 1357 M
588 1357 D
S
N
588 1369 M
583 1369 D
S
N
583 1381 M
588 1381 D
S
N
588 1394 M
583 1394 D
S
N
583 1406 M
599 1406 D
S
N
588 1418 M
583 1418 D
S
N
583 1430 M
588 1430 D
S
N
588 1442 M
583 1442 D
S
N
583 1454 M
588 1454 D
S
N
599 1466 M
583 1466 D
S
N
583 1478 M
588 1478 D
S
N
588 1490 M
583 1490 D
S
N
583 1502 M
588 1502 D
S
N
588 1514 M
583 1514 D
S
N
503 1298 M
498 1297 D
495 1292 D
494 1285 D
494 1280 D
495 1273 D
498 1268 D
503 1267 D
506 1267 D
510 1268 D
513 1273 D
515 1280 D
515 1285 D
513 1292 D
510 1297 D
506 1298 D
503 1298 D
S
N
503 1298 M
500 1297 D
498 1295 D
497 1292 D
495 1285 D
495 1280 D
497 1273 D
498 1270 D
500 1268 D
503 1267 D
S
N
506 1267 M
509 1268 D
510 1270 D
512 1273 D
513 1280 D
513 1285 D
512 1292 D
510 1295 D
509 1297 D
506 1298 D
S
N
527 1270 M
525 1268 D
527 1267 D
528 1268 D
527 1270 D
S
N
547 1298 M
542 1297 D
541 1294 D
541 1289 D
542 1286 D
547 1285 D
553 1285 D
557 1286 D
559 1289 D
559 1294 D
557 1297 D
553 1298 D
547 1298 D
S
N
547 1298 M
544 1297 D
542 1294 D
542 1289 D
544 1286 D
547 1285 D
S
N
553 1285 M
556 1286 D
557 1289 D
557 1294 D
556 1297 D
553 1298 D
S
N
547 1285 M
542 1283 D
541 1282 D
539 1279 D
539 1273 D
541 1270 D
542 1268 D
547 1267 D
553 1267 D
557 1268 D
559 1270 D
560 1273 D
560 1279 D
559 1282 D
557 1283 D
553 1285 D
S
N
547 1285 M
544 1283 D
542 1282 D
541 1279 D
541 1273 D
542 1270 D
544 1268 D
547 1267 D
S
N
553 1267 M
556 1268 D
557 1270 D
559 1273 D
559 1279 D
557 1282 D
556 1283 D
553 1285 D
S
N
503 1359 M
498 1357 D
495 1353 D
494 1345 D
494 1341 D
495 1333 D
498 1329 D
503 1327 D
506 1327 D
510 1329 D
513 1333 D
515 1341 D
515 1345 D
513 1353 D
510 1357 D
506 1359 D
503 1359 D
S
N
503 1359 M
500 1357 D
498 1356 D
497 1353 D
495 1345 D
495 1341 D
497 1333 D
498 1330 D
500 1329 D
503 1327 D
S
N
506 1327 M
509 1329 D
510 1330 D
512 1333 D
513 1341 D
513 1345 D
512 1353 D
510 1356 D
509 1357 D
506 1359 D
S
N
527 1330 M
525 1329 D
527 1327 D
528 1329 D
527 1330 D
S
N
559 1348 M
557 1344 D
554 1341 D
550 1339 D
548 1339 D
544 1341 D
541 1344 D
539 1348 D
539 1350 D
541 1354 D
544 1357 D
548 1359 D
551 1359 D
556 1357 D
559 1354 D
560 1350 D
560 1341 D
559 1335 D
557 1332 D
554 1329 D
550 1327 D
545 1327 D
542 1329 D
541 1332 D
541 1333 D
542 1335 D
544 1333 D
542 1332 D
S
N
548 1339 M
545 1341 D
542 1344 D
541 1348 D
541 1350 D
542 1354 D
545 1357 D
548 1359 D
S
N
551 1359 M
554 1357 D
557 1354 D
559 1350 D
559 1341 D
557 1335 D
556 1332 D
553 1329 D
550 1327 D
S
N
498 1413 M
501 1415 D
506 1419 D
506 1387 D
S
N
504 1418 M
504 1387 D
S
N
498 1387 M
512 1387 D
S
N
527 1390 M
525 1389 D
527 1387 D
528 1389 D
527 1390 D
S
N
548 1419 M
544 1418 D
541 1413 D
539 1406 D
539 1401 D
541 1394 D
544 1389 D
548 1387 D
551 1387 D
556 1389 D
559 1394 D
560 1401 D
560 1406 D
559 1413 D
556 1418 D
551 1419 D
548 1419 D
S
N
548 1419 M
545 1418 D
544 1416 D
542 1413 D
541 1406 D
541 1401 D
542 1394 D
544 1390 D
545 1389 D
548 1387 D
S
N
551 1387 M
554 1389 D
556 1390 D
557 1394 D
559 1401 D
559 1406 D
557 1413 D
556 1416 D
554 1418 D
551 1419 D
S
N
498 1473 M
501 1475 D
506 1480 D
506 1448 D
S
N
504 1478 M
504 1448 D
S
N
498 1448 M
512 1448 D
S
N
527 1451 M
525 1449 D
527 1448 D
528 1449 D
527 1451 D
S
N
544 1473 M
547 1475 D
551 1480 D
551 1448 D
S
N
550 1478 M
550 1448 D
S
N
544 1448 M
557 1448 D
S
N
1967 1261 M
1967 1520 D
S
N
1962 1261 M
1967 1261 D
S
N
1967 1273 M
1962 1273 D
S
N
1951 1285 M
1967 1285 D
S
N
1967 1297 M
1962 1297 D
S
N
1962 1309 M
1967 1309 D
S
N
1967 1321 M
1962 1321 D
S
N
1962 1333 M
1967 1333 D
S
N
1967 1345 M
1951 1345 D
S
N
1962 1357 M
1967 1357 D
S
N
1967 1369 M
1962 1369 D
S
N
1962 1381 M
1967 1381 D
S
N
1967 1394 M
1962 1394 D
S
N
1951 1406 M
1967 1406 D
S
N
1967 1418 M
1962 1418 D
S
N
1962 1430 M
1967 1430 D
S
N
1967 1442 M
1962 1442 D
S
N
1962 1454 M
1967 1454 D
S
N
1967 1466 M
1951 1466 D
S
N
1962 1478 M
1967 1478 D
S
N
1967 1490 M
1962 1490 D
S
N
1962 1502 M
1967 1502 D
S
N
1967 1514 M
1962 1514 D
S
N
583 1432 M
631 1432 D
631 1433 D
680 1433 D
680 1437 D
728 1437 D
728 1439 D
776 1439 D
776 1438 D
825 1438 D
825 1437 D
873 1437 D
873 1435 D
921 1435 D
921 1434 D
969 1434 D
969 1434 D
1018 1434 D
1018 1433 D
1066 1433 D
1066 1433 D
1114 1433 D
1114 1433 D
1163 1433 D
1163 1433 D
1211 1433 D
1211 1434 D
1259 1434 D
1259 1434 D
1308 1434 D
1308 1434 D
1356 1434 D
1356 1435 D
1404 1435 D
1404 1435 D
1453 1435 D
1453 1435 D
1501 1435 D
1501 1436 D
1549 1436 D
1549 1438 D
1598 1438 D
1598 1440 D
1646 1440 D
1646 1442 D
1694 1442 D
1694 1444 D
1742 1444 D
1742 1446 D
1791 1446 D
1791 1448 D
1839 1448 D
1839 1450 D
1887 1450 D
1887 1451 D
1936 1451 D
1936 1454 D
1967 1454 D
S
N
583 1375 M
631 1375 D
631 1374 D
680 1374 D
680 1370 D
728 1370 D
728 1368 D
776 1368 D
776 1369 D
825 1369 D
825 1370 D
873 1370 D
873 1371 D
921 1371 D
921 1372 D
969 1372 D
969 1372 D
1018 1372 D
1018 1373 D
1066 1373 D
1066 1373 D
1114 1373 D
1114 1373 D
1163 1373 D
1163 1373 D
1211 1373 D
1211 1372 D
1259 1372 D
1259 1372 D
1308 1372 D
1308 1372 D
1356 1372 D
1356 1372 D
1404 1372 D
1404 1371 D
1453 1371 D
1453 1371 D
1501 1371 D
1501 1370 D
1549 1370 D
1549 1369 D
1598 1369 D
1598 1366 D
1646 1366 D
1646 1364 D
1694 1364 D
1694 1362 D
1742 1362 D
1742 1360 D
1791 1360 D
1791 1358 D
1839 1358 D
1839 1356 D
1887 1356 D
1887 1355 D
1936 1355 D
1936 1352 D
1967 1352 D
S
N
721 1304 M
808 1304 D
S
0 0 1 setrgbcolor
N
583 1461 M
595 1461 D
S
N
607 1461 M
619 1461 D
S
N
631 1461 M
631 1449 D
S
N
637 1442 M
649 1442 D
S
N
661 1442 M
673 1442 D
S
N
680 1448 M
680 1451 D
689 1451 D
S
N
701 1451 M
713 1451 D
S
N
725 1451 M
728 1451 D
728 1452 D
736 1452 D
S
N
748 1452 M
761 1452 D
S
N
773 1452 M
776 1452 D
776 1458 D
779 1458 D
S
N
791 1458 M
803 1458 D
S
N
815 1458 M
825 1458 D
825 1456 D
S
N
835 1455 M
848 1455 D
S
N
860 1455 M
872 1455 D
S
N
879 1460 M
891 1460 D
S
N
903 1460 M
915 1460 D
S
N
921 1454 M
921 1452 D
932 1452 D
S
N
944 1452 M
956 1452 D
S
N
968 1452 M
969 1452 D
969 1449 D
977 1449 D
S
N
989 1449 M
1001 1449 D
S
N
1013 1449 M
1018 1449 D
1018 1451 D
1023 1451 D
S
N
1035 1451 M
1048 1451 D
S
N
1060 1451 M
1066 1451 D
1066 1451 D
1071 1451 D
S
N
1083 1451 M
1095 1451 D
S
N
1107 1451 M
1114 1451 D
1114 1447 D
S
N
1126 1446 M
1138 1446 D
S
N
1151 1446 M
1163 1446 D
S
N
1167 1439 M
1179 1439 D
S
N
1191 1439 M
1204 1439 D
S
N
1211 1444 M
1211 1445 D
1222 1445 D
S
N
1234 1445 M
1246 1445 D
S
N
1258 1445 M
1259 1445 D
1259 1441 D
1266 1441 D
S
N
1279 1441 M
1291 1441 D
S
N
1303 1441 M
1308 1441 D
1308 1440 D
1314 1440 D
S
N
1326 1440 M
1338 1440 D
S
N
1351 1440 M
1356 1440 D
1356 1439 D
1362 1439 D
S
N
1374 1439 M
1386 1439 D
S
N
1398 1439 M
1404 1439 D
1404 1439 D
1409 1439 D
S
N
1421 1439 M
1434 1439 D
S
N
1446 1439 M
1453 1439 D
1453 1440 D
1456 1440 D
S
N
1468 1440 M
1481 1440 D
S
N
1493 1440 M
1501 1440 D
1501 1439 D
1504 1439 D
S
N
1516 1439 M
1528 1439 D
S
N
1540 1439 M
1549 1439 D
1549 1442 D
1550 1442 D
S
N
1562 1442 M
1574 1442 D
S
N
1586 1442 M
1598 1442 D
1598 1442 D
S
N
1606 1446 M
1618 1446 D
S
N
1630 1446 M
1642 1446 D
S
N
1646 1455 M
1646 1459 D
1653 1459 D
S
N
1665 1459 M
1677 1459 D
S
N
1690 1459 M
1694 1459 D
1694 1464 D
1697 1464 D
S
N
1709 1464 M
1722 1464 D
S
N
1734 1464 M
1742 1464 D
1742 1462 D
1744 1462 D
S
N
1757 1462 M
1769 1462 D
S
N
1781 1462 M
1791 1462 D
1791 1465 D
S
N
1800 1467 M
1812 1467 D
S
N
1824 1467 M
1836 1467 D
S
N
1842 1474 M
1854 1474 D
S
N
1866 1474 M
1879 1474 D
S
N
1890 1474 M
1902 1474 D
S
N
1914 1474 M
1926 1474 D
S
N
1936 1477 M
1936 1480 D
1945 1480 D
S
N
1957 1480 M
1967 1480 D
S
N
583 1327 M
595 1327 D
S
N
607 1327 M
619 1327 D
S
N
631 1327 M
631 1335 D
636 1335 D
S
N
648 1335 M
660 1335 D
S
N
672 1335 M
680 1335 D
680 1330 D
S
N
691 1330 M
703 1330 D
S
N
715 1330 M
727 1330 D
S
N
738 1328 M
750 1328 D
S
N
763 1328 M
775 1328 D
S
N
784 1326 M
796 1326 D
S
N
808 1326 M
821 1326 D
S
N
831 1328 M
843 1328 D
S
N
855 1328 M
867 1328 D
S
N
877 1326 M
890 1326 D
S
N
902 1326 M
914 1326 D
S
N
922 1329 M
935 1329 D
S
N
947 1329 M
959 1329 D
S
N
969 1331 M
969 1331 D
981 1331 D
S
N
993 1331 M
1006 1331 D
S
N
1018 1331 M
1018 1331 D
1018 1330 D
1029 1330 D
S
N
1041 1330 M
1053 1330 D
S
N
1065 1330 M
1066 1330 D
1066 1330 D
1077 1330 D
S
N
1089 1330 M
1101 1330 D
S
N
1114 1330 M
1114 1330 D
1114 1332 D
1124 1332 D
S
N
1136 1332 M
1148 1332 D
S
N
1160 1332 M
1163 1332 D
1163 1335 D
1169 1335 D
S
N
1181 1335 M
1193 1335 D
S
N
1205 1335 M
1211 1335 D
1211 1332 D
1215 1332 D
S
N
1227 1332 M
1239 1332 D
S
N
1251 1332 M
1259 1332 D
1259 1334 D
1261 1334 D
S
N
1273 1334 M
1285 1334 D
S
N
1298 1334 M
1308 1334 D
1308 1334 D
1310 1334 D
S
N
1322 1334 M
1334 1334 D
S
N
1346 1334 M
1356 1334 D
1356 1335 D
1357 1335 D
S
N
1369 1335 M
1381 1335 D
S
N
1393 1335 M
1404 1335 D
1404 1336 D
1404 1336 D
S
N
1416 1336 M
1429 1336 D
S
N
1441 1336 M
1453 1336 D
1453 1336 D
S
N
1463 1335 M
1475 1335 D
S
N
1488 1335 M
1500 1335 D
S
N
1512 1335 M
1524 1335 D
S
N
1536 1335 M
1548 1335 D
S
N
1557 1332 M
1569 1332 D
S
N
1582 1332 M
1594 1332 D
S
N
1602 1328 M
1614 1328 D
S
N
1627 1328 M
1639 1328 D
S
N
1646 1324 M
1646 1322 D
1656 1322 D
S
N
1668 1322 M
1680 1322 D
S
N
1693 1322 M
1694 1322 D
1694 1319 D
1702 1319 D
S
N
1714 1319 M
1726 1319 D
S
N
1738 1319 M
1742 1319 D
1742 1318 D
1749 1318 D
S
N
1761 1318 M
1774 1318 D
S
N
1786 1318 M
1791 1318 D
1791 1315 D
1794 1315 D
S
N
1807 1315 M
1819 1315 D
S
N
1831 1315 M
1839 1315 D
1839 1311 D
1839 1311 D
S
N
1851 1311 M
1863 1311 D
S
N
1876 1311 M
1887 1311 D
1887 1311 D
S
N
1899 1310 M
1911 1310 D
S
N
1923 1310 M
1935 1310 D
S
N
1943 1306 M
1955 1306 D
S
N
721 1477 M
734 1477 D
S
N
746 1477 M
758 1477 D
S
N
770 1477 M
782 1477 D
S
N
794 1477 M
806 1477 D
S
3 Sw
0 0 0 setrgbcolor
N
833 1230 M
833 1201 D
S
N
834 1230 M
834 1201 D
S
N
829 1230 M
845 1230 D
849 1228 D
851 1227 D
852 1224 D
852 1220 D
851 1217 D
849 1216 D
845 1215 D
834 1215 D
S
N
845 1230 M
848 1228 D
849 1227 D
851 1224 D
851 1220 D
849 1217 D
848 1216 D
845 1215 D
S
N
829 1201 M
838 1201 D
S
N
870 1230 M
866 1228 D
863 1226 D
862 1223 D
860 1217 D
860 1213 D
862 1208 D
863 1205 D
866 1202 D
870 1201 D
873 1201 D
877 1202 D
879 1205 D
881 1208 D
882 1213 D
882 1217 D
881 1223 D
879 1226 D
877 1228 D
873 1230 D
870 1230 D
S
N
870 1230 M
867 1228 D
864 1226 D
863 1223 D
862 1217 D
862 1213 D
863 1208 D
864 1205 D
867 1202 D
870 1201 D
S
N
873 1201 M
875 1202 D
878 1205 D
879 1208 D
881 1213 D
881 1217 D
879 1223 D
878 1226 D
875 1228 D
873 1230 D
S
N
892 1230 M
897 1201 D
S
N
893 1230 M
897 1208 D
S
N
903 1230 M
897 1201 D
S
N
903 1230 M
908 1201 D
S
N
904 1230 M
908 1208 D
S
N
914 1230 M
908 1201 D
S
N
888 1230 M
897 1230 D
S
N
910 1230 M
918 1230 D
S
N
926 1230 M
926 1201 D
S
N
927 1230 M
927 1201 D
S
N
944 1230 M
944 1201 D
S
N
945 1230 M
945 1201 D
S
N
922 1230 M
931 1230 D
S
N
940 1230 M
949 1230 D
S
N
927 1216 M
944 1216 D
S
N
922 1201 M
931 1201 D
S
N
940 1201 M
949 1201 D
S
N
959 1230 M
959 1201 D
S
N
960 1230 M
960 1201 D
S
N
968 1222 M
968 1211 D
S
N
955 1230 M
977 1230 D
977 1222 D
975 1230 D
S
N
960 1216 M
968 1216 D
S
N
955 1201 M
977 1201 D
977 1209 D
975 1201 D
S
N
988 1230 M
988 1201 D
S
N
989 1230 M
989 1201 D
S
N
983 1230 M
993 1230 D
S
N
983 1201 M
1004 1201 D
1004 1209 D
1003 1201 D
S
N
1012 1220 M
1011 1219 D
1012 1217 D
1014 1219 D
1012 1220 D
S
N
1012 1204 M
1011 1202 D
1012 1201 D
1014 1202 D
1012 1204 D
S
N
1048 1220 M
1048 1191 D
S
N
1049 1220 M
1049 1191 D
S
N
1049 1216 M
1052 1219 D
1055 1220 D
1057 1220 D
1061 1219 D
1064 1216 D
1066 1212 D
1066 1209 D
1064 1205 D
1061 1202 D
1057 1201 D
1055 1201 D
1052 1202 D
1049 1205 D
S
N
1057 1220 M
1060 1219 D
1063 1216 D
1064 1212 D
1064 1209 D
1063 1205 D
1060 1202 D
1057 1201 D
S
N
1044 1220 M
1049 1220 D
S
N
1044 1191 M
1053 1191 D
S
N
1075 1220 M
1083 1201 D
S
N
1077 1220 M
1083 1204 D
S
N
1092 1220 M
1083 1201 D
1081 1196 D
1078 1193 D
1075 1191 D
1074 1191 D
1072 1193 D
1074 1194 D
1075 1193 D
S
N
1072 1220 M
1081 1220 D
S
N
1086 1220 M
1094 1220 D
S
N
1103 1230 M
1103 1207 D
1104 1202 D
1107 1201 D
1109 1201 D
1112 1202 D
1114 1205 D
S
N
1104 1230 M
1104 1207 D
1105 1202 D
1107 1201 D
S
N
1098 1220 M
1109 1220 D
S
N
1123 1230 M
1123 1201 D
S
N
1124 1230 M
1124 1201 D
S
N
1124 1216 M
1127 1219 D
1131 1220 D
1134 1220 D
1138 1219 D
1140 1216 D
1140 1201 D
S
N
1134 1220 M
1137 1219 D
1138 1216 D
1138 1201 D
S
N
1119 1230 M
1124 1230 D
S
N
1119 1201 M
1129 1201 D
S
N
1134 1201 M
1144 1201 D
S
N
1153 1230 M
1152 1228 D
1153 1227 D
1155 1228 D
1153 1230 D
S
N
1153 1220 M
1153 1201 D
S
N
1155 1220 M
1155 1201 D
S
N
1149 1220 M
1155 1220 D
S
N
1149 1201 M
1159 1201 D
S
N
1168 1217 M
1168 1216 D
1167 1216 D
1167 1217 D
1168 1219 D
1171 1220 D
1176 1220 D
1179 1219 D
1181 1217 D
1182 1215 D
1182 1205 D
1183 1202 D
1185 1201 D
S
N
1181 1217 M
1181 1205 D
1182 1202 D
1185 1201 D
1186 1201 D
S
N
1181 1215 M
1179 1213 D
1171 1212 D
1167 1211 D
1166 1208 D
1166 1205 D
1167 1202 D
1171 1201 D
1175 1201 D
1178 1202 D
1181 1205 D
S
N
1171 1212 M
1168 1211 D
1167 1208 D
1167 1205 D
1168 1202 D
1171 1201 D
S
N
1216 1235 M
1192 1191 D
S
N
1226 1230 M
1226 1201 D
S
N
1227 1230 M
1227 1201 D
S
N
1227 1216 M
1230 1219 D
1234 1220 D
1237 1220 D
1241 1219 D
1242 1216 D
1242 1201 D
S
N
1237 1220 M
1239 1219 D
1241 1216 D
1241 1201 D
S
N
1222 1230 M
1227 1230 D
S
N
1222 1201 M
1231 1201 D
S
N
1237 1201 M
1246 1201 D
S
N
1254 1212 M
1271 1212 D
1271 1215 D
1270 1217 D
1268 1219 D
1265 1220 D
1261 1220 D
1257 1219 D
1254 1216 D
1253 1212 D
1253 1209 D
1254 1205 D
1257 1202 D
1261 1201 D
1264 1201 D
1268 1202 D
1271 1205 D
S
N
1270 1212 M
1270 1216 D
1268 1219 D
S
N
1261 1220 M
1259 1219 D
1256 1216 D
1254 1212 D
1254 1209 D
1256 1205 D
1259 1202 D
1261 1201 D
S
N
1282 1220 M
1282 1201 D
S
N
1283 1220 M
1283 1201 D
S
N
1283 1212 M
1285 1216 D
1287 1219 D
1290 1220 D
1294 1220 D
1296 1219 D
1296 1217 D
1294 1216 D
1293 1217 D
1294 1219 D
S
N
1278 1220 M
1283 1220 D
S
N
1278 1201 M
1287 1201 D
S
N
1304 1220 M
1309 1201 D
S
N
1305 1220 M
1309 1205 D
S
N
1315 1220 M
1309 1201 D
S
N
1315 1220 M
1320 1201 D
S
N
1316 1220 M
1320 1205 D
S
N
1326 1220 M
1320 1201 D
S
N
1300 1220 M
1309 1220 D
S
N
1322 1220 M
1330 1220 D
S
N
1338 1230 M
1337 1228 D
1338 1227 D
1339 1228 D
1338 1230 D
S
N
1338 1220 M
1338 1201 D
S
N
1339 1220 M
1339 1201 D
S
N
1334 1220 M
1339 1220 D
S
N
1334 1201 M
1343 1201 D
S
N
1357 1220 M
1354 1219 D
1353 1217 D
1352 1215 D
1352 1212 D
1353 1209 D
1354 1208 D
1357 1207 D
1360 1207 D
1363 1208 D
1364 1209 D
1365 1212 D
1365 1215 D
1364 1217 D
1363 1219 D
1360 1220 D
1357 1220 D
S
N
1354 1219 M
1353 1216 D
1353 1211 D
1354 1208 D
S
N
1363 1208 M
1364 1211 D
1364 1216 D
1363 1219 D
S
N
1364 1217 M
1365 1219 D
1368 1220 D
1368 1219 D
1365 1219 D
S
N
1353 1209 M
1352 1208 D
1350 1205 D
1350 1204 D
1352 1201 D
1356 1200 D
1363 1200 D
1367 1198 D
1368 1197 D
S
N
1350 1204 M
1352 1202 D
1356 1201 D
1363 1201 D
1367 1200 D
1368 1197 D
1368 1196 D
1367 1193 D
1363 1191 D
1354 1191 D
1350 1193 D
1349 1196 D
1349 1197 D
1350 1200 D
1354 1201 D
S
N
833 1057 M
833 1028 D
S
N
834 1057 M
834 1028 D
S
N
829 1057 M
845 1057 D
849 1055 D
851 1054 D
852 1051 D
852 1047 D
851 1044 D
849 1043 D
845 1042 D
834 1042 D
S
N
845 1057 M
848 1055 D
849 1054 D
851 1051 D
851 1047 D
849 1044 D
848 1043 D
845 1042 D
S
N
829 1028 M
838 1028 D
S
N
870 1057 M
866 1055 D
863 1053 D
862 1050 D
860 1044 D
860 1040 D
862 1035 D
863 1032 D
866 1029 D
870 1028 D
873 1028 D
877 1029 D
879 1032 D
881 1035 D
882 1040 D
882 1044 D
881 1050 D
879 1053 D
877 1055 D
873 1057 D
870 1057 D
S
N
870 1057 M
867 1055 D
864 1053 D
863 1050 D
862 1044 D
862 1040 D
863 1035 D
864 1032 D
867 1029 D
870 1028 D
S
N
873 1028 M
875 1029 D
878 1032 D
879 1035 D
881 1040 D
881 1044 D
879 1050 D
878 1053 D
875 1055 D
873 1057 D
S
N
892 1057 M
897 1028 D
S
N
893 1057 M
897 1035 D
S
N
903 1057 M
897 1028 D
S
N
903 1057 M
908 1028 D
S
N
904 1057 M
908 1035 D
S
N
914 1057 M
908 1028 D
S
N
888 1057 M
897 1057 D
S
N
910 1057 M
918 1057 D
S
N
926 1057 M
926 1028 D
S
N
927 1057 M
927 1028 D
S
N
944 1057 M
944 1028 D
S
N
945 1057 M
945 1028 D
S
N
922 1057 M
931 1057 D
S
N
940 1057 M
949 1057 D
S
N
927 1043 M
944 1043 D
S
N
922 1028 M
931 1028 D
S
N
940 1028 M
949 1028 D
S
N
959 1057 M
959 1028 D
S
N
960 1057 M
960 1028 D
S
N
968 1049 M
968 1038 D
S
N
955 1057 M
977 1057 D
977 1049 D
975 1057 D
S
N
960 1043 M
968 1043 D
S
N
955 1028 M
977 1028 D
977 1036 D
975 1028 D
S
N
988 1057 M
988 1028 D
S
N
989 1057 M
989 1028 D
S
N
983 1057 M
993 1057 D
S
N
983 1028 M
1004 1028 D
1004 1036 D
1003 1028 D
S
N
1033 1062 M
1008 1018 D
S
N
1042 1044 M
1042 1043 D
1041 1043 D
1041 1044 D
1042 1046 D
1045 1047 D
1051 1047 D
1053 1046 D
1055 1044 D
1056 1042 D
1056 1032 D
1057 1029 D
1059 1028 D
S
N
1055 1044 M
1055 1032 D
1056 1029 D
1059 1028 D
1060 1028 D
S
N
1055 1042 M
1053 1040 D
1045 1039 D
1041 1038 D
1040 1035 D
1040 1032 D
1041 1029 D
1045 1028 D
1049 1028 D
1052 1029 D
1055 1032 D
S
N
1045 1039 M
1042 1038 D
1041 1035 D
1041 1032 D
1042 1029 D
1045 1028 D
S
N
1070 1057 M
1070 1028 D
S
N
1071 1057 M
1079 1032 D
S
N
1070 1057 M
1079 1028 D
S
N
1089 1057 M
1079 1028 D
S
N
1089 1057 M
1089 1028 D
S
N
1090 1057 M
1090 1028 D
S
N
1066 1057 M
1071 1057 D
S
N
1089 1057 M
1094 1057 D
S
N
1066 1028 M
1074 1028 D
S
N
1085 1028 M
1094 1028 D
S
N
1120 1053 M
1122 1049 D
1122 1057 D
1120 1053 D
1118 1055 D
1114 1057 D
1111 1057 D
1107 1055 D
1104 1053 D
1103 1050 D
1101 1046 D
1101 1039 D
1103 1035 D
1104 1032 D
1107 1029 D
1111 1028 D
1114 1028 D
1118 1029 D
1120 1032 D
1122 1035 D
S
N
1111 1057 M
1108 1055 D
1105 1053 D
1104 1050 D
1103 1046 D
1103 1039 D
1104 1035 D
1105 1032 D
1108 1029 D
1111 1028 D
S
N
1150 1046 M
1149 1049 D
1146 1050 D
1142 1050 D
1140 1049 D
1138 1047 D
1137 1043 D
1137 1039 D
1138 1036 D
1141 1035 D
1145 1035 D
1148 1036 D
1149 1039 D
S
N
1142 1050 M
1140 1047 D
1138 1043 D
1138 1039 D
1140 1036 D
1141 1035 D
S
N
1150 1050 M
1149 1039 D
1149 1036 D
1152 1035 D
1155 1035 D
1157 1038 D
1159 1042 D
1159 1044 D
1157 1049 D
1156 1051 D
1153 1054 D
1150 1055 D
1146 1057 D
1142 1057 D
1138 1055 D
1135 1054 D
1133 1051 D
1131 1049 D
1130 1044 D
1130 1040 D
1131 1036 D
1133 1034 D
1135 1031 D
1138 1029 D
1142 1028 D
1146 1028 D
1150 1029 D
1153 1031 D
1155 1032 D
S
N
1152 1050 M
1150 1039 D
1150 1036 D
1152 1035 D
S
N
1170 1057 M
1170 1028 D
S
N
1171 1057 M
1187 1031 D
S
N
1171 1054 M
1187 1028 D
S
N
1187 1057 M
1187 1028 D
S
N
1166 1057 M
1171 1057 D
S
N
1183 1057 M
1192 1057 D
S
N
1166 1028 M
1174 1028 D
S
N
1201 1057 M
1201 1028 D
S
N
1202 1057 M
1202 1028 D
S
N
1197 1057 M
1207 1057 D
S
N
1197 1028 M
1218 1028 D
1218 1036 D
1216 1028 D
S
N
1233 1057 M
1228 1055 D
1226 1053 D
1224 1050 D
1223 1044 D
1223 1040 D
1224 1035 D
1226 1032 D
1228 1029 D
1233 1028 D
1235 1028 D
1239 1029 D
1242 1032 D
1244 1035 D
1245 1040 D
1245 1044 D
1244 1050 D
1242 1053 D
1239 1055 D
1235 1057 D
1233 1057 D
S
N
1233 1057 M
1230 1055 D
1227 1053 D
1226 1050 D
1224 1044 D
1224 1040 D
1226 1035 D
1227 1032 D
1230 1029 D
1233 1028 D
S
N
1235 1028 M
1238 1029 D
1241 1032 D
1242 1035 D
1244 1040 D
1244 1044 D
1242 1050 D
1241 1053 D
1238 1055 D
1235 1057 D
S
4 Sw
N
1872 906 M
1860 874 D
S
N
1872 906 M
1884 874 D
S
N
1872 901 M
1882 874 D
S
N
1861 876 M
1882 876 D
S
N
1860 874 M
1884 874 D
S
N
1894 906 M
1894 874 D
S
N
1896 906 M
1896 874 D
S
N
1890 906 M
1908 906 D
1913 904 D
1914 903 D
1916 900 D
1916 897 D
1914 894 D
1913 892 D
1908 891 D
1896 891 D
S
N
1908 906 M
1911 904 D
1913 903 D
1914 900 D
1914 897 D
1913 894 D
1911 892 D
1908 891 D
S
N
1890 874 M
1901 874 D
S
N
1904 891 M
1907 889 D
1908 888 D
1913 877 D
1914 876 D
1916 876 D
1917 877 D
S
N
1907 889 M
1908 886 D
1911 876 D
1913 874 D
1916 874 D
1917 877 D
1917 879 D
S
N
1927 883 M
1927 862 D
S
N
1928 883 M
1928 862 D
S
N
1924 883 M
1936 883 D
1939 882 D
1940 881 D
1941 879 D
1941 877 D
1940 875 D
1939 874 D
1936 873 D
S
N
1936 883 M
1938 882 D
1939 881 D
1940 879 D
1940 877 D
1939 875 D
1938 874 D
1936 873 D
S
N
1928 873 M
1936 873 D
1939 872 D
1940 871 D
1941 869 D
1941 866 D
1940 864 D
1939 863 D
1936 862 D
1924 862 D
S
N
1936 873 M
1938 872 D
1939 871 D
1940 869 D
1940 866 D
1939 864 D
1938 863 D
1936 862 D
S
N
1949 883 M
1949 862 D
S
N
1950 883 M
1950 862 D
S
N
1946 883 M
1958 883 D
1961 882 D
1962 881 D
1963 879 D
1963 877 D
1962 875 D
1961 874 D
1958 873 D
S
N
1958 883 M
1960 882 D
1961 881 D
1962 879 D
1962 877 D
1961 875 D
1960 874 D
1958 873 D
S
N
1950 873 M
1958 873 D
1961 872 D
1962 871 D
1963 869 D
1963 866 D
1962 864 D
1961 863 D
1958 862 D
1946 862 D
S
N
1958 873 M
1960 872 D
1961 871 D
1962 869 D
1962 866 D
1961 864 D
1960 863 D
1958 862 D
S
N
583 1261 M
583 1001 D
S
N
583 1001 M
1967 1001 D
S
N
1967 1001 M
1967 1261 D
S
N
1967 1261 M
583 1261 D
S
N
583 1001 M
583 1017 D
S
N
645 1006 M
645 1001 D
S
N
706 1001 M
706 1006 D
S
N
768 1006 M
768 1001 D
S
N
829 1001 M
829 1006 D
S
N
891 1017 M
891 1001 D
S
N
952 1001 M
952 1006 D
S
N
1014 1006 M
1014 1001 D
S
N
1075 1001 M
1075 1006 D
S
N
1137 1006 M
1137 1001 D
S
N
1198 1001 M
1198 1017 D
S
N
1260 1006 M
1260 1001 D
S
N
1321 1001 M
1321 1006 D
S
N
1383 1006 M
1383 1001 D
S
N
1444 1001 M
1444 1006 D
S
N
1506 1017 M
1506 1001 D
S
N
1567 1001 M
1567 1006 D
S
N
1629 1006 M
1629 1001 D
S
N
1690 1001 M
1690 1006 D
S
N
1752 1006 M
1752 1001 D
S
N
1813 1001 M
1813 1017 D
S
N
1875 1006 M
1875 1001 D
S
N
1936 1001 M
1936 1006 D
S
N
581 971 M
577 970 D
574 965 D
572 958 D
572 953 D
574 946 D
577 941 D
581 940 D
585 940 D
589 941 D
592 946 D
594 953 D
594 958 D
592 965 D
589 970 D
585 971 D
581 971 D
S
N
581 971 M
578 970 D
577 968 D
575 965 D
574 958 D
574 953 D
575 946 D
577 943 D
578 941 D
581 940 D
S
N
585 940 M
588 941 D
589 943 D
591 946 D
592 953 D
592 958 D
591 965 D
589 968 D
588 970 D
585 971 D
S
N
885 965 M
888 967 D
892 971 D
892 940 D
S
N
891 970 M
891 940 D
S
N
885 940 M
898 940 D
S
N
1189 965 M
1191 964 D
1189 962 D
1188 964 D
1188 965 D
1189 968 D
1191 970 D
1195 971 D
1201 971 D
1206 970 D
1207 968 D
1209 965 D
1209 962 D
1207 959 D
1203 956 D
1195 953 D
1192 952 D
1189 949 D
1188 944 D
1188 940 D
S
N
1201 971 M
1204 970 D
1206 968 D
1207 965 D
1207 962 D
1206 959 D
1201 956 D
1195 953 D
S
N
1188 943 M
1189 944 D
1192 944 D
1200 941 D
1204 941 D
1207 943 D
1209 944 D
S
N
1192 944 M
1200 940 D
1206 940 D
1207 941 D
1209 944 D
1209 947 D
S
N
1497 965 M
1498 964 D
1497 962 D
1495 964 D
1495 965 D
1497 968 D
1498 970 D
1503 971 D
1509 971 D
1513 970 D
1515 967 D
1515 962 D
1513 959 D
1509 958 D
1504 958 D
S
N
1509 971 M
1512 970 D
1513 967 D
1513 962 D
1512 959 D
1509 958 D
S
N
1509 958 M
1512 956 D
1515 953 D
1516 950 D
1516 946 D
1515 943 D
1513 941 D
1509 940 D
1503 940 D
1498 941 D
1497 943 D
1495 946 D
1495 947 D
1497 949 D
1498 947 D
1497 946 D
S
N
1513 955 M
1515 950 D
1515 946 D
1513 943 D
1512 941 D
1509 940 D
S
N
1816 968 M
1816 940 D
S
N
1818 971 M
1818 940 D
S
N
1818 971 M
1801 949 D
1825 949 D
S
N
1812 940 M
1822 940 D
S
N
583 1261 M
1967 1261 D
S
N
583 1245 M
583 1261 D
S
N
645 1261 M
645 1256 D
S
N
706 1256 M
706 1261 D
S
N
768 1261 M
768 1256 D
S
N
829 1256 M
829 1261 D
S
N
891 1261 M
891 1245 D
S
N
952 1256 M
952 1261 D
S
N
1014 1261 M
1014 1256 D
S
N
1075 1256 M
1075 1261 D
S
N
1137 1261 M
1137 1256 D
S
N
1198 1245 M
1198 1261 D
S
N
1260 1261 M
1260 1256 D
S
N
1321 1256 M
1321 1261 D
S
N
1383 1261 M
1383 1256 D
S
N
1444 1256 M
1444 1261 D
S
N
1506 1261 M
1506 1245 D
S
N
1567 1256 M
1567 1261 D
S
N
1629 1261 M
1629 1256 D
S
N
1690 1256 M
1690 1261 D
S
N
1752 1261 M
1752 1256 D
S
N
1813 1245 M
1813 1261 D
S
N
1875 1261 M
1875 1256 D
S
N
1936 1256 M
1936 1261 D
S
N
583 1001 M
583 1261 D
S
N
583 1006 M
588 1006 D
S
N
588 1022 M
583 1022 D
S
N
583 1038 M
588 1038 D
S
N
599 1053 M
583 1053 D
S
N
583 1069 M
588 1069 D
S
N
588 1084 M
583 1084 D
S
N
583 1100 M
588 1100 D
S
N
588 1115 M
583 1115 D
S
N
583 1131 M
599 1131 D
S
N
588 1147 M
583 1147 D
S
N
583 1162 M
588 1162 D
S
N
588 1178 M
583 1178 D
S
N
583 1193 M
588 1193 D
S
N
599 1209 M
583 1209 D
S
N
583 1224 M
588 1224 D
S
N
588 1240 M
583 1240 D
S
N
583 1256 M
588 1256 D
S
N
503 1067 M
498 1065 D
495 1061 D
494 1053 D
494 1049 D
495 1041 D
498 1037 D
503 1035 D
506 1035 D
510 1037 D
513 1041 D
515 1049 D
515 1053 D
513 1061 D
510 1065 D
506 1067 D
503 1067 D
S
N
503 1067 M
500 1065 D
498 1064 D
497 1061 D
495 1053 D
495 1049 D
497 1041 D
498 1038 D
500 1037 D
503 1035 D
S
N
506 1035 M
509 1037 D
510 1038 D
512 1041 D
513 1049 D
513 1053 D
512 1061 D
510 1064 D
509 1065 D
506 1067 D
S
N
527 1038 M
525 1037 D
527 1035 D
528 1037 D
527 1038 D
S
N
547 1067 M
542 1065 D
541 1062 D
541 1058 D
542 1055 D
547 1053 D
553 1053 D
557 1055 D
559 1058 D
559 1062 D
557 1065 D
553 1067 D
547 1067 D
S
N
547 1067 M
544 1065 D
542 1062 D
542 1058 D
544 1055 D
547 1053 D
S
N
553 1053 M
556 1055 D
557 1058 D
557 1062 D
556 1065 D
553 1067 D
S
N
547 1053 M
542 1052 D
541 1050 D
539 1047 D
539 1041 D
541 1038 D
542 1037 D
547 1035 D
553 1035 D
557 1037 D
559 1038 D
560 1041 D
560 1047 D
559 1050 D
557 1052 D
553 1053 D
S
N
547 1053 M
544 1052 D
542 1050 D
541 1047 D
541 1041 D
542 1038 D
544 1037 D
547 1035 D
S
N
553 1035 M
556 1037 D
557 1038 D
559 1041 D
559 1047 D
557 1050 D
556 1052 D
553 1053 D
S
N
498 1139 M
501 1140 D
506 1145 D
506 1113 D
S
N
504 1143 M
504 1113 D
S
N
498 1113 M
512 1113 D
S
N
527 1116 M
525 1114 D
527 1113 D
528 1114 D
527 1116 D
S
N
548 1145 M
544 1143 D
541 1139 D
539 1131 D
539 1126 D
541 1119 D
544 1114 D
548 1113 D
551 1113 D
556 1114 D
559 1119 D
560 1126 D
560 1131 D
559 1139 D
556 1143 D
551 1145 D
548 1145 D
S
N
548 1145 M
545 1143 D
544 1142 D
542 1139 D
541 1131 D
541 1126 D
542 1119 D
544 1116 D
545 1114 D
548 1113 D
S
N
551 1113 M
554 1114 D
556 1116 D
557 1119 D
559 1126 D
559 1131 D
557 1139 D
556 1142 D
554 1143 D
551 1145 D
S
N
498 1216 M
501 1218 D
506 1222 D
506 1191 D
S
N
504 1221 M
504 1191 D
S
N
498 1191 M
512 1191 D
S
N
527 1194 M
525 1192 D
527 1191 D
528 1192 D
527 1194 D
S
N
541 1216 M
542 1215 D
541 1213 D
539 1215 D
539 1216 D
541 1219 D
542 1221 D
547 1222 D
553 1222 D
557 1221 D
559 1219 D
560 1216 D
560 1213 D
559 1210 D
554 1207 D
547 1204 D
544 1203 D
541 1200 D
539 1195 D
539 1191 D
S
N
553 1222 M
556 1221 D
557 1219 D
559 1216 D
559 1213 D
557 1210 D
553 1207 D
547 1204 D
S
N
539 1194 M
541 1195 D
544 1195 D
551 1192 D
556 1192 D
559 1194 D
560 1195 D
S
N
544 1195 M
551 1191 D
557 1191 D
559 1192 D
560 1195 D
560 1198 D
S
N
1967 1001 M
1967 1261 D
S
N
1962 1006 M
1967 1006 D
S
N
1967 1022 M
1962 1022 D
S
N
1962 1038 M
1967 1038 D
S
N
1967 1053 M
1951 1053 D
S
N
1962 1069 M
1967 1069 D
S
N
1967 1084 M
1962 1084 D
S
N
1962 1100 M
1967 1100 D
S
N
1967 1115 M
1962 1115 D
S
N
1951 1131 M
1967 1131 D
S
N
1967 1147 M
1962 1147 D
S
N
1962 1162 M
1967 1162 D
S
N
1967 1178 M
1962 1178 D
S
N
1962 1193 M
1967 1193 D
S
N
1967 1209 M
1951 1209 D
S
N
1962 1224 M
1967 1224 D
S
N
1967 1240 M
1962 1240 D
S
N
1962 1256 M
1967 1256 D
S
N
583 1177 M
631 1177 D
631 1148 D
680 1148 D
680 1118 D
728 1118 D
728 1125 D
776 1125 D
776 1127 D
825 1127 D
825 1127 D
873 1127 D
873 1125 D
921 1125 D
921 1133 D
969 1133 D
969 1134 D
1018 1134 D
1018 1133 D
1066 1133 D
1066 1128 D
1114 1128 D
1114 1131 D
1163 1131 D
1163 1131 D
1211 1131 D
1211 1131 D
1259 1131 D
1259 1129 D
1308 1129 D
1308 1130 D
1356 1130 D
1356 1131 D
1404 1131 D
1404 1132 D
1453 1132 D
1453 1129 D
1501 1129 D
1501 1133 D
1549 1133 D
1549 1133 D
1598 1133 D
1598 1134 D
1646 1134 D
1646 1132 D
1694 1132 D
1694 1134 D
1742 1134 D
1742 1138 D
1791 1138 D
1791 1139 D
1839 1139 D
1839 1139 D
1887 1139 D
1887 1153 D
1936 1153 D
1936 1175 D
1967 1175 D
S
N
721 1217 M
808 1217 D
S
0 0 1 setrgbcolor
N
583 1136 M
595 1136 D
S
N
607 1136 M
619 1136 D
S
N
631 1136 M
631 1137 D
642 1137 D
S
N
654 1137 M
667 1137 D
S
N
679 1137 M
680 1137 D
680 1129 D
683 1129 D
S
N
695 1129 M
707 1129 D
S
N
719 1129 M
728 1129 D
728 1129 D
731 1129 D
S
N
743 1129 M
755 1129 D
S
N
767 1129 M
776 1129 D
776 1126 D
S
N
785 1123 M
797 1123 D
S
N
809 1123 M
821 1123 D
S
N
827 1129 M
839 1129 D
S
N
851 1129 M
863 1129 D
S
N
873 1131 M
873 1135 D
882 1135 D
S
N
894 1135 M
906 1135 D
S
N
918 1135 M
921 1135 D
921 1135 D
930 1135 D
S
N
942 1135 M
954 1135 D
S
N
966 1135 M
969 1135 D
969 1137 D
976 1137 D
S
N
988 1137 M
1000 1137 D
S
N
1012 1137 M
1018 1137 D
1018 1138 D
1024 1138 D
S
N
1036 1138 M
1048 1138 D
S
N
1060 1138 M
1066 1138 D
1066 1140 D
1070 1140 D
S
N
1082 1140 M
1095 1140 D
S
N
1107 1140 M
1114 1140 D
1114 1138 D
1117 1138 D
S
N
1130 1138 M
1142 1138 D
S
N
1154 1138 M
1163 1138 D
1163 1138 D
1165 1138 D
S
N
1177 1138 M
1189 1138 D
S
N
1201 1138 M
1211 1138 D
1211 1135 D
S
N
1223 1135 M
1235 1135 D
S
N
1247 1135 M
1259 1135 D
1259 1135 D
S
N
1271 1135 M
1283 1135 D
S
N
1295 1135 M
1308 1135 D
S
N
1318 1134 M
1331 1134 D
S
N
1343 1134 M
1355 1134 D
S
N
1364 1130 M
1376 1130 D
S
N
1388 1130 M
1400 1130 D
S
N
1412 1131 M
1424 1131 D
S
N
1436 1131 M
1448 1131 D
S
N
1460 1130 M
1472 1130 D
S
N
1485 1130 M
1497 1130 D
S
N
1509 1130 M
1521 1130 D
S
N
1533 1130 M
1545 1130 D
S
N
1555 1128 M
1567 1128 D
S
N
1579 1128 M
1591 1128 D
S
N
1599 1124 M
1611 1124 D
S
N
1623 1124 M
1636 1124 D
S
N
1646 1122 M
1646 1121 D
1657 1121 D
S
N
1669 1121 M
1681 1121 D
S
N
1693 1121 M
1694 1121 D
1694 1121 D
1705 1121 D
S
N
1717 1121 M
1729 1121 D
S
N
1742 1121 M
1742 1121 D
1742 1114 D
1747 1114 D
S
N
1759 1114 M
1771 1114 D
S
N
1783 1114 M
1791 1114 D
1791 1110 D
S
N
1791 1098 M
1803 1098 D
S
N
1815 1098 M
1827 1098 D
S
N
1839 1097 M
1839 1087 D
1841 1087 D
S
N
1853 1087 M
1865 1087 D
S
N
1877 1087 M
1887 1087 D
1887 1089 D
S
N
1898 1091 M
1910 1091 D
S
N
1922 1091 M
1934 1091 D
S
N
1946 1092 M
1958 1092 D
S
N
721 1044 M
734 1044 D
S
N
746 1044 M
758 1044 D
S
N
770 1044 M
782 1044 D
S
N
794 1044 M
806 1044 D
S
showpage
%%Trailer
%%Pages: 1
%%BoundingBox: 95 205 482 563
