%!PS-Adobe-2.0 EPSF-2.0
%%BoundingBox:  0 0 567 384
%%Title: /home/dimicco/HiggsScan/compare_MCNLO_MCFM/pTsubleading.eps: canvas_ptsoft
%%Creator: ROOT Version 5.26/00
%%CreationDate: Fri Dec  9 15:06:15 2011
%%EndComments
%%BeginProlog
80 dict begin
/s {stroke} def /l {lineto} def /m {moveto} def /t {translate} def
/sw {stringwidth} def /r {rotate} def /rl {roll}  def /R {repeat} def
/d {rlineto} def /rm {rmoveto} def /gr {grestore} def /f {eofill} def
/c {setrgbcolor} def /black {0 setgray} def /sd {setdash} def
/cl {closepath} def /sf {scalefont setfont} def /lw {setlinewidth} def
/box {m dup 0 exch d exch 0 d 0 exch neg d cl} def
/NC{systemdict begin initclip end}def/C{NC box clip newpath}def
/bl {box s} def /bf {box f} def /Y { 0 exch d} def /X { 0 d} def 
/mp {newpath /y exch def /x exch def} def
/side {[w .77 mul w .23 mul] .385 w mul sd w 0 l currentpoint t -144 r} def
/mr {mp x y w2 0 360 arc} def /m24 {mr s} def /m20 {mr f} def
/mb {mp x y w2 add m w2 neg 0 d 0 w neg d w 0 d 0 w d cl} def
/mt {mp x y w2 add m w2 neg w neg d w 0 d cl} def
/m21 {mb f} def /m25 {mb s} def /m22 {mt f} def /m26{mt s} def
/m23 {mp x y w2 sub m w2 w d w neg 0 d cl f} def
/m27 {mp x y w2 add m w3 neg w2 neg d w3 w2 neg d w3 w2 d cl s} def
/m28 {mp x w2 sub y w2 sub w3 add m w3 0 d  0 w3 neg d w3 0 d 0 w3 d w3 0 d  0 w3 d w3 neg 0 d 0 w3 d w3 neg 0 d
 0 w3 neg d w3 neg 0 d cl s } def
/m29 {mp gsave x w2 sub y w2 add w3 sub m currentpoint t
 4 {side} repeat cl fill gr} def
/m30 {mp gsave x w2 sub y w2 add w3 sub m currentpoint t
 4 {side} repeat cl s gr} def
/m31 {mp x y w2 sub m 0 w d x w2 sub y m w 0 d x w2 sub y w2 add m w w neg d x w2 sub y w2
 sub m w w d s} def
/m2 {mp x y w2 sub m 0 w d x w2 sub y m w 0 d s} def
/m5 {mp x w2 sub y w2 sub m w w d x w2 sub y w2 add m w w neg d s} def
/reEncode {exch findfont dup length dict begin {1 index /FID eq  {pop pop} {def} ifelse } forall /Encoding exch def currentdict end dup /FontName get exch definefont pop } def [/Times-Bold /Times-Italic /Times-BoldItalic /Helvetica
 /Helvetica-Oblique /Helvetica-Bold /Helvetica-BoldOblique /Courier /Courier-Oblique /Courier-Bold /Courier-BoldOblique /Times-Roman /AvantGarde-Book /AvantGarde-BookOblique /AvantGarde-Demi /AvantGarde-DemiOblique /Bookman-Demi
 /Bookman-DemiItalic /Bookman-Light /Bookman-LightItalic /Helvetica-Narrow /Helvetica-Narrow-Bold /Helvetica-Narrow-BoldOblique /Helvetica-Narrow-Oblique /NewCenturySchlbk-Roman /NewCenturySchlbk-Bold
 /NewCenturySchlbk-BoldItalic /NewCenturySchlbk-Italic /Palatino-Bold /Palatino-BoldItalic /Palatino-Italic /Palatino-Roman ] {ISOLatin1Encoding reEncode } forall
/oshow {gsave [] 0 sd true charpath stroke gr} def
/stwn { /fs exch def /fn exch def /text exch def fn findfont fs sf
 text sw pop xs add /xs exch def} def
/stwb { /fs exch def /fn exch def /nbas exch def /textf exch deftextf length /tlen exch def nbas tlen gt {/nbas tlendef} iffn findfont fs sf textf dup length nbas sub nbas getinterval sw
pop neg xs add /xs exch def} def
%%EndProlog
%%BeginSetup
%%EndSetup
newpath  gsave  .25 .25 scale  gsave  0 0 t black[  ] 0 sd 3 lw 1 1 1 c 2268 1538 0 0 bf black 1 1 1 c 1791 1215 363 246 bf black 1791 1215 363 246 bl 1 1 1 c 1791 1215 363 246 bf black 1791 1215 363 246 bl 1 0 0 c 6 lw 1 1 1 c 1 0 0 c 614 625 m 5 X
 s 645 625 m 4 X s 3 lw /w 29 def /w2 {w 2 div} def /w3 {w 3 div} def 632 625 m20 6 lw 667 1065 m 5 Y s 667 1096 m 5 Y s 649 1083 m 5 X s 680 1083 m 5 X s 3 lw 667 1083 m20 6 lw 703 1154 m 6 Y s 703 1186 m 6 Y s 685 1173 m 5 X s 716 1173 m 5 X s 3
 lw 703 1173 m20 6 lw 739 1254 m 6 Y s 739 1287 m 6 Y s 721 1274 m 5 X s 752 1274 m 5 X s 3 lw 739 1274 m20 6 lw 775 1319 m 7 Y s 775 1352 m 8 Y s 757 1339 m 5 X s 788 1339 m 5 X s 3 lw 775 1339 m20 6 lw 811 1361 m 8 Y s 811 1395 m 8 Y s 793 1382 m
 5 X s 824 1382 m 5 X s 3 lw 811 1382 m20 6 lw 847 1323 m 7 Y s 847 1356 m 8 Y s 829 1343 m 5 X s 860 1343 m 4 X s 3 lw 847 1343 m20 6 lw 882 1247 m 7 Y s 882 1280 m 7 Y s 864 1267 m 5 X s 895 1267 m 5 X s 3 lw 882 1267 m20 6 lw 918 1187 m 6 Y s 918
 1219 m 6 Y s 900 1206 m 5 X s 931 1206 m 5 X s 3 lw 918 1206 m20 6 lw 954 1072 m 5 Y s 954 1103 m 5 Y s 936 1090 m 5 X s 967 1090 m 5 X s 3 lw 954 1090 m20 6 lw 990 990 m 4 Y s 990 1020 m 4 Y s 972 1007 m 5 X s 1003 1007 m 5 X s 3 lw 990 1007 m20 6
 lw 1026 878 m 3 Y s 1026 907 m 3 Y s 1008 894 m 5 X s 1039 894 m 5 X s 3 lw 1026 894 m20 6 lw 1062 816 m 2 Y s 1062 844 m 2 Y s 1044 831 m 4 X s 1075 831 m 4 X s 3 lw 1062 831 m20 6 lw 1097 735 m 1 Y s 1097 762 m 1 Y s 1079 749 m 5 X s 1110 749 m 5
 X s 3 lw 1097 749 m20 6 lw 1115 662 m 5 X s 1146 662 m 5 X s 3 lw 1133 662 m20 6 lw 1151 626 m 5 X s 1182 626 m 5 X s 3 lw 1169 626 m20 6 lw 1187 569 m 5 X s 1218 569 m 5 X s 3 lw 1205 569 m20 6 lw 1223 530 m 5 X s 1254 530 m 5 X s 3 lw 1241 530
 m20 6 lw 1259 489 m 4 X s 1290 489 m 4 X s 3 lw 1276 489 m20 6 lw 1294 477 m 5 X s 1325 477 m 5 X s 3 lw 1312 477 m20 6 lw 1330 454 m 5 X s 1361 454 m 5 X s 3 lw 1348 454 m20 6 lw 1366 426 m 5 X s 1397 426 m 5 X s 3 lw 1384 426 m20 6 lw 1402 388 m
 5 X s 1433 388 m 5 X s 3 lw 1420 388 m20 6 lw 1438 375 m 5 X s 1469 375 m 5 X s 3 lw 1456 375 m20 6 lw 1474 364 m 4 X s 1505 364 m 4 X s 3 lw 1491 364 m20 6 lw 1509 347 m 5 X s 1540 347 m 5 X s 3 lw 1527 347 m20 6 lw 1545 340 m 5 X s 1576 340 m 5 X
 s 3 lw 1563 340 m20 6 lw 1581 323 m 5 X s 1612 323 m 5 X s 3 lw 1599 323 m20 6 lw 1617 319 m 5 X s 1648 319 m 5 X s 3 lw 1635 319 m20 6 lw 1653 305 m 5 X s 1684 305 m 5 X s 3 lw 1671 305 m20 6 lw 1689 305 m 4 X s 1719 305 m 5 X s 3 lw 1706 305 m20
 6 lw 1724 308 m 5 X s 1755 308 m 5 X s 3 lw 1742 308 m20 6 lw 1760 295 m 5 X s 1791 295 m 5 X s 3 lw 1778 295 m20 6 lw 1796 286 m 5 X s 1827 286 m 5 X s 3 lw 1814 286 m20 6 lw 1832 283 m 5 X s 1863 283 m 5 X s 3 lw 1850 283 m20 6 lw 1868 285 m 5 X
 s 1899 285 m 5 X s 3 lw 1886 285 m20 6 lw 1904 279 m 4 X s 1934 279 m 5 X s 3 lw 1921 279 m20 6 lw 1939 278 m 5 X s 1970 278 m 5 X s 3 lw 1957 278 m20 6 lw 1975 277 m 5 X s 2006 277 m 5 X s 3 lw 1993 277 m20 6 lw 2011 270 m 5 X s 2042 270 m 5 X s 3
 lw 2029 270 m20 6 lw 2047 275 m 5 X s 2078 275 m 5 X s 3 lw 2065 275 m20 6 lw 2083 270 m 5 X s 2114 270 m 5 X s 3 lw 2101 270 m20 6 lw 2119 270 m 4 X s 2149 270 m 5 X s 3 lw 2136 270 m20 6 lw black 3 lw 363 246 m 1791 X s
 gsave  2268 1538 0 0 C 1955 91 t 0 r /Helvetica findfont 71.6807 sf 0 0 m ( [GeV]) show NC gr 
 gsave  2268 1538 0 0 C 1906 52 t 0 r /Helvetica findfont 48.8732 sf 0 0 m (T1) show NC gr 
 gsave  2268 1538 0 0 C 1867 91 t 0 r /Helvetica findfont 71.6807 sf 0 0 m (p) show NC gr  363 283 m -37 Y s 399 264 m -18 Y s 434 264 m -18 Y s 470 264 m -18 Y s 506 264 m -18 Y s 542 283 m -37 Y s 578 264 m -18 Y s 614 264 m -18 Y s 649 264 m -18
 Y s 685 264 m -18 Y s 721 283 m -37 Y s 757 264 m -18 Y s 793 264 m -18 Y s 829 264 m -18 Y s 864 264 m -18 Y s 900 283 m -37 Y s 936 264 m -18 Y s 972 264 m -18 Y s 1008 264 m -18 Y s 1044 264 m -18 Y s 1079 283 m -37 Y s 1115 264 m -18 Y s 1151
 264 m -18 Y s 1187 264 m -18 Y s 1223 264 m -18 Y s 1259 283 m -37 Y s 1294 264 m -18 Y s 1330 264 m -18 Y s 1366 264 m -18 Y s 1402 264 m -18 Y s 1438 283 m -37 Y s 1474 264 m -18 Y s 1509 264 m -18 Y s 1545 264 m -18 Y s 1581 264 m -18 Y s 1617
 283 m -37 Y s 1653 264 m -18 Y s 1689 264 m -18 Y s 1724 264 m -18 Y s 1760 264 m -18 Y s 1796 283 m -37 Y s 1832 264 m -18 Y s 1868 264 m -18 Y s 1904 264 m -18 Y s 1939 264 m -18 Y s 1975 283 m -37 Y s 2011 264 m -18 Y s 2047 264 m -18 Y s 2083
 264 m -18 Y s 2119 264 m -18 Y s 2154 283 m -37 Y s
 gsave  2268 1538 0 0 C 342 179 t 0 r /Helvetica findfont 71.6807 sf 0 0 m (0) show NC gr 
 gsave  2268 1538 0 0 C 502 179 t 0 r /Helvetica findfont 71.6807 sf 0 0 m (10) show NC gr 
 gsave  2268 1538 0 0 C 681 179 t 0 r /Helvetica findfont 71.6807 sf 0 0 m (20) show NC gr 
 gsave  2268 1538 0 0 C 860 179 t 0 r /Helvetica findfont 71.6807 sf 0 0 m (30) show NC gr 
 gsave  2268 1538 0 0 C 1039 179 t 0 r /Helvetica findfont 71.6807 sf 0 0 m (40) show NC gr 
 gsave  2268 1538 0 0 C 1219 179 t 0 r /Helvetica findfont 71.6807 sf 0 0 m (50) show NC gr 
 gsave  2268 1538 0 0 C 1398 179 t 0 r /Helvetica findfont 71.6807 sf 0 0 m (60) show NC gr 
 gsave  2268 1538 0 0 C 1577 179 t 0 r /Helvetica findfont 71.6807 sf 0 0 m (70) show NC gr 
 gsave  2268 1538 0 0 C 1756 179 t 0 r /Helvetica findfont 71.6807 sf 0 0 m (80) show NC gr 
 gsave  2268 1538 0 0 C 1935 179 t 0 r /Helvetica findfont 71.6807 sf 0 0 m (90) show NC gr 
 gsave  2268 1538 0 0 C 2095 179 t 0 r /Helvetica findfont 71.6807 sf 0 0 m (100) show NC gr  363 1461 m 1791 X s 363 1425 m 36 Y s 399 1443 m 18 Y s 434 1443 m 18 Y s 470 1443 m 18 Y s 506 1443 m 18 Y s 542 1425 m 36 Y s 578 1443 m 18 Y s 614 1443
 m 18 Y s 649 1443 m 18 Y s 685 1443 m 18 Y s 721 1425 m 36 Y s 757 1443 m 18 Y s 793 1443 m 18 Y s 829 1443 m 18 Y s 864 1443 m 18 Y s 900 1425 m 36 Y s 936 1443 m 18 Y s 972 1443 m 18 Y s 1008 1443 m 18 Y s 1044 1443 m 18 Y s 1079 1425 m 36 Y s
 1115 1443 m 18 Y s 1151 1443 m 18 Y s 1187 1443 m 18 Y s 1223 1443 m 18 Y s 1259 1425 m 36 Y s 1294 1443 m 18 Y s 1330 1443 m 18 Y s 1366 1443 m 18 Y s 1402 1443 m 18 Y s 1438 1425 m 36 Y s 1474 1443 m 18 Y s 1509 1443 m 18 Y s 1545 1443 m 18 Y s
 1581 1443 m 18 Y s 1617 1425 m 36 Y s 1653 1443 m 18 Y s 1689 1443 m 18 Y s 1724 1443 m 18 Y s 1760 1443 m 18 Y s 1796 1425 m 36 Y s 1832 1443 m 18 Y s 1868 1443 m 18 Y s 1904 1443 m 18 Y s 1939 1443 m 18 Y s 1975 1425 m 36 Y s 2011 1443 m 18 Y s
 2047 1443 m 18 Y s 2083 1443 m 18 Y s 2119 1443 m 18 Y s 2154 1425 m 36 Y s 363 246 m 1215 Y s
 gsave  2268 1538 0 0 C 163 1030 t 90 r /Helvetica findfont 71.6807 sf 0 0 m (arbitrary units) show NC gr  417 246 m -54 X s 390 277 m -27 X s 390 307 m -27 X s 390 338 m -27 X s 390 369 m -27 X s 417 400 m -54 X s 390 430 m -27 X s 390 461 m -27 X
 s 390 492 m -27 X s 390 522 m -27 X s 417 553 m -54 X s 390 584 m -27 X s 390 615 m -27 X s 390 645 m -27 X s 390 676 m -27 X s 417 707 m -54 X s 390 737 m -27 X s 390 768 m -27 X s 390 799 m -27 X s 390 830 m -27 X s 417 860 m -54 X s 390 891 m
 -27 X s 390 922 m -27 X s 390 952 m -27 X s 390 983 m -27 X s 417 1014 m -54 X s 390 1045 m -27 X s 390 1075 m -27 X s 390 1106 m -27 X s 390 1137 m -27 X s 417 1167 m -54 X s 390 1198 m -27 X s 390 1229 m -27 X s 390 1260 m -27 X s 390 1290 m -27
 X s 417 1321 m -54 X s 417 1321 m -54 X s 390 1352 m -27 X s 390 1382 m -27 X s 390 1413 m -27 X s 390 1444 m -27 X s
 gsave  2268 1538 0 0 C 310 222 t 0 r /Helvetica findfont 71.6807 sf 0 0 m (0) show NC gr 
 gsave  2268 1538 0 0 C 222 375 t 0 r /Helvetica findfont 71.6807 sf 0 0 m (0.01) show NC gr 
 gsave  2268 1538 0 0 C 212 528 t 0 r /Helvetica findfont 71.6807 sf 0 0 m (0.02) show NC gr 
 gsave  2268 1538 0 0 C 212 681 t 0 r /Helvetica findfont 71.6807 sf 0 0 m (0.03) show NC gr 
 gsave  2268 1538 0 0 C 212 837 t 0 r /Helvetica findfont 71.6807 sf 0 0 m (0.04) show NC gr 
 gsave  2268 1538 0 0 C 212 990 t 0 r /Helvetica findfont 71.6807 sf 0 0 m (0.05) show NC gr 
 gsave  2268 1538 0 0 C 212 1144 t 0 r /Helvetica findfont 71.6807 sf 0 0 m (0.06) show NC gr 
 gsave  2268 1538 0 0 C 212 1297 t 0 r /Helvetica findfont 71.6807 sf 0 0 m (0.07) show NC gr  2154 246 m 1215 Y s 2101 246 m 53 X s 2127 277 m 27 X s 2127 307 m 27 X s 2127 338 m 27 X s 2127 369 m 27 X s 2101 400 m 53 X s 2127 430 m 27 X s 2127 461
 m 27 X s 2127 492 m 27 X s 2127 522 m 27 X s 2101 553 m 53 X s 2127 584 m 27 X s 2127 615 m 27 X s 2127 645 m 27 X s 2127 676 m 27 X s 2101 707 m 53 X s 2127 737 m 27 X s 2127 768 m 27 X s 2127 799 m 27 X s 2127 830 m 27 X s 2101 860 m 53 X s 2127
 891 m 27 X s 2127 922 m 27 X s 2127 952 m 27 X s 2127 983 m 27 X s 2101 1014 m 53 X s 2127 1045 m 27 X s 2127 1075 m 27 X s 2127 1106 m 27 X s 2127 1137 m 27 X s 2101 1167 m 53 X s 2127 1198 m 27 X s 2127 1229 m 27 X s 2127 1260 m 27 X s 2127 1290
 m 27 X s 2101 1321 m 53 X s 2101 1321 m 53 X s 2127 1352 m 27 X s 2127 1382 m 27 X s 2127 1413 m 27 X s 2127 1444 m 27 X s 0 0 1 c 6 lw 1 1 1 c black 0 0 1 c 363 246 m 251 X 344 Y 35 X 420 Y 36 X 118 Y 36 X 93 Y 36 X 86 Y 36 X 67 Y 36 X -26 Y 35 X
 -43 Y 36 X -72 Y 36 X -99 Y 36 X -98 Y 36 X -104 Y 36 X -95 Y 35 X -81 Y 36 X -69 Y 36 X -59 Y 36 X -46 Y 36 X -47 Y 36 X -34 Y 35 X -31 Y 36 X -31 Y 36 X -20 Y 36 X -22 Y 36 X -18 Y 36 X -11 Y 35 X -16 Y 36 X -14 Y 36 X -8 Y 36 X -6 Y 36 X -12 Y
 36 X -6 Y 35 X -4 Y 36 X -8 Y 36 X -3 Y 36 X -4 Y 36 X -4 Y 36 X -5 Y 71 X -4 Y 36 X -2 Y 36 X -3 Y 36 X -2 Y 36 X -2 Y 35 X s 1 1 1 c 0 lw 707 228 1163 1075 bf 3 lw 1183 1075 m -13 Y 700 X 222 Y -13 X -209 Y f 0 lw 1163 1075 m 228 Y 707 X -228 Y
 -707 X cl s black
 gsave  2268 1538 0 0 C 1339 1215 t 0 r /Helvetica findfont 87.9718 sf 0 0 m (MCFM) show NC gr  1 1 1 c 3 lw 1190 1206 m 123 X 80 Y -123 X f 0 lw 0 0 1 c 6 lw 1190 1246 m 123 X s black 3 lw 1252 1246 m20 6 lw
 gsave  2268 1538 0 0 C 1339 1108 t 0 r /Helvetica findfont 87.9718 sf 0 0 m (MC@NLO) show NC gr  1 1 1 c 3 lw 1190 1092 m 123 X 80 Y -123 X f 6 lw 1 0 0 c 1190 1132 m 123 X s 3 lw 1252 1132 m20 6 lw black
 gsave  2268 1538 0 0 C 2222 1118 t 90 r /Helvetica-BoldOblique findfont 29.3239 sf 0 0 m (LHC HIGGS XS WG 2011) show NC gr 
 gr  gr 
showpage
end
%%EOF
