%!PS-Adobe-1.0
%%Creator: Unified Graphics System
%%Pages: (atend)
%%DocumentFonts: Helvetica
%%BoundingBox:   72   77  318  330
%%EndComments
/Sw{setlinewidth}def
/Sg{setgray}def
/Sd{setdash}def
/P {newpath
    moveto
0 0 rlineto
    stroke}def
/M {moveto}def
/D {lineto}def
/N {newpath}def
/S {stroke}def
/T {/Helvetica findfont
    exch
    scalefont
    setfont}def
/R {rotate}def
/W {show}def
/F {fill}def
/X {gsave}def
/Y {grestore}def
%%EndProlog
%%Page: 1 1
0.12000 0.12000 scale
1 setlinecap
1 setlinejoin
8 Sw
0.00 0.00 0.00 setrgbcolor
[] 0 Sd
N
649 1349 M
725 1349 D
S
N
649 1352 M
725 1352 D
S
N
685 1349 M
678 1342 D
674 1334 D
674 1327 D
678 1316 D
685 1309 D
696 1306 D
703 1306 D
714 1309 D
721 1316 D
725 1327 D
725 1334 D
721 1342 D
714 1349 D
S
N
674 1327 M
678 1320 D
685 1313 D
696 1309 D
703 1309 D
714 1313 D
721 1320 D
725 1327 D
S
N
649 1338 M
649 1352 D
S
N
725 1349 M
725 1363 D
S
N
674 1439 M
674 1403 D
678 1392 D
689 1385 D
700 1381 D
710 1381 D
718 1385 D
721 1388 D
725 1396 D
725 1403 D
721 1414 D
710 1421 D
700 1425 D
689 1425 D
682 1421 D
678 1417 D
674 1410 D
S
N
674 1403 M
678 1396 D
689 1388 D
700 1385 D
714 1385 D
721 1388 D
S
N
725 1403 M
721 1410 D
710 1417 D
700 1421 D
685 1421 D
678 1417 D
S
N
678 1417 M
678 1439 D
S
N
635 1518 M
750 1453 D
S
N
649 1579 M
725 1579 D
S
N
649 1583 M
725 1583 D
S
N
685 1579 M
678 1572 D
674 1565 D
674 1558 D
678 1547 D
685 1540 D
696 1536 D
703 1536 D
714 1540 D
721 1547 D
725 1558 D
725 1565 D
721 1572 D
714 1579 D
S
N
674 1558 M
678 1551 D
685 1543 D
696 1540 D
703 1540 D
714 1543 D
721 1551 D
725 1558 D
S
N
649 1569 M
649 1583 D
S
N
725 1579 M
725 1594 D
S
N
674 1619 M
725 1619 D
S
N
674 1623 M
725 1623 D
S
N
685 1623 M
678 1630 D
674 1641 D
674 1648 D
678 1659 D
685 1662 D
725 1662 D
S
N
674 1648 M
678 1655 D
685 1659 D
725 1659 D
S
N
685 1662 M
678 1670 D
674 1680 D
674 1688 D
678 1698 D
685 1702 D
725 1702 D
S
N
674 1688 M
678 1695 D
685 1698 D
725 1698 D
S
N
674 1608 M
674 1623 D
S
N
725 1608 M
725 1634 D
S
N
725 1648 M
725 1673 D
S
N
725 1688 M
725 1713 D
S
N
703 1737 M
754 1737 D
S
N
703 1739 M
754 1739 D
S
N
727 1739 M
722 1744 D
720 1749 D
720 1754 D
722 1761 D
727 1766 D
734 1768 D
739 1768 D
746 1766 D
751 1761 D
754 1754 D
754 1749 D
751 1744 D
746 1739 D
S
N
720 1754 M
722 1758 D
727 1763 D
734 1766 D
739 1766 D
746 1763 D
751 1758 D
754 1754 D
S
N
703 1730 M
703 1739 D
S
N
703 1787 M
754 1787 D
S
N
703 1790 M
754 1790 D
S
N
727 1790 M
722 1795 D
720 1799 D
720 1804 D
722 1811 D
727 1816 D
734 1819 D
739 1819 D
746 1816 D
751 1811 D
754 1804 D
754 1799 D
751 1795 D
746 1790 D
S
N
720 1804 M
722 1809 D
727 1814 D
734 1816 D
739 1816 D
746 1814 D
751 1809 D
754 1804 D
S
N
703 1780 M
703 1790 D
S
N
635 1941 M
750 1941 D
S
N
635 1945 M
750 1945 D
S
N
635 1941 M
635 1966 D
S
N
750 1941 M
750 1966 D
S
N
653 2013 M
656 2010 D
660 2013 D
656 2017 D
653 2017 D
649 2013 D
649 2006 D
653 1999 D
660 1995 D
725 1995 D
S
N
649 2006 M
653 2002 D
660 1999 D
725 1999 D
S
N
674 1984 M
674 2013 D
S
N
725 1984 M
725 2010 D
S
N
649 2042 M
725 2042 D
S
N
649 2046 M
725 2046 D
S
N
685 2046 M
678 2053 D
674 2060 D
674 2067 D
678 2078 D
685 2085 D
696 2089 D
703 2089 D
714 2085 D
721 2078 D
725 2067 D
725 2060 D
721 2053 D
714 2046 D
S
N
674 2067 M
678 2074 D
685 2082 D
696 2085 D
703 2085 D
714 2082 D
721 2074 D
725 2067 D
S
N
649 2031 M
649 2046 D
S
N
635 2172 M
750 2107 D
S
N
660 2240 M
671 2244 D
649 2244 D
660 2240 D
653 2233 D
649 2222 D
649 2215 D
653 2204 D
660 2197 D
667 2193 D
678 2190 D
696 2190 D
707 2193 D
714 2197 D
721 2204 D
725 2215 D
725 2222 D
721 2233 D
714 2240 D
S
N
649 2215 M
653 2208 D
660 2201 D
667 2197 D
678 2193 D
696 2193 D
707 2197 D
714 2201 D
721 2208 D
725 2215 D
S
N
696 2240 M
725 2240 D
S
N
696 2244 M
725 2244 D
S
N
696 2229 M
696 2255 D
S
N
696 2276 M
696 2320 D
689 2320 D
682 2316 D
678 2312 D
674 2305 D
674 2294 D
678 2283 D
685 2276 D
696 2273 D
703 2273 D
714 2276 D
721 2283 D
725 2294 D
725 2302 D
721 2312 D
714 2320 D
S
N
696 2316 M
685 2316 D
678 2312 D
S
N
674 2294 M
678 2287 D
685 2280 D
696 2276 D
703 2276 D
714 2280 D
721 2287 D
725 2294 D
S
N
649 2341 M
725 2366 D
S
N
649 2345 M
714 2366 D
S
N
649 2392 M
725 2366 D
S
N
649 2334 M
649 2356 D
S
N
649 2377 M
649 2399 D
S
N
635 2435 M
750 2435 D
S
N
635 2438 M
750 2438 D
S
N
635 2413 M
635 2438 D
S
N
750 2413 M
750 2438 D
S
N
1556 757 M
1556 707 D
S
N
1560 757 M
1560 707 D
S
N
1560 746 M
1567 753 D
1578 757 D
1585 757 D
1596 753 D
1599 746 D
1599 707 D
S
N
1585 757 M
1592 753 D
1596 746 D
1596 707 D
S
N
1599 746 M
1606 753 D
1617 757 D
1624 757 D
1635 753 D
1639 746 D
1639 707 D
S
N
1624 757 M
1632 753 D
1635 746 D
1635 707 D
S
N
1545 757 M
1560 757 D
S
N
1545 707 M
1570 707 D
S
N
1585 707 M
1610 707 D
S
N
1624 707 M
1650 707 D
S
N
1674 728 M
1674 678 D
S
N
1676 728 M
1676 678 D
S
N
1676 704 M
1681 709 D
1686 711 D
1691 711 D
1698 709 D
1703 704 D
1705 697 D
1705 692 D
1703 685 D
1698 680 D
1691 678 D
1686 678 D
1681 680 D
1676 685 D
S
N
1691 711 M
1695 709 D
1700 704 D
1703 697 D
1703 692 D
1700 685 D
1695 680 D
1691 678 D
S
N
1666 728 M
1676 728 D
S
N
1724 728 M
1724 678 D
S
N
1727 728 M
1727 678 D
S
N
1727 704 M
1731 709 D
1736 711 D
1741 711 D
1748 709 D
1753 704 D
1755 697 D
1755 692 D
1753 685 D
1748 680 D
1741 678 D
1736 678 D
1731 680 D
1727 685 D
S
N
1741 711 M
1746 709 D
1751 704 D
1753 697 D
1753 692 D
1751 685 D
1746 680 D
1741 678 D
S
N
1717 728 M
1727 728 D
S
N
1878 797 M
1878 681 D
S
N
1882 797 M
1882 681 D
S
N
1878 797 M
1903 797 D
S
N
1878 681 M
1903 681 D
S
N
1975 771 M
1979 761 D
1979 782 D
1975 771 D
1968 779 D
1957 782 D
1950 782 D
1939 779 D
1932 771 D
1928 764 D
1925 753 D
1925 735 D
1928 725 D
1932 717 D
1939 710 D
1950 707 D
1957 707 D
1968 710 D
1975 717 D
S
N
1950 782 M
1943 779 D
1936 771 D
1932 764 D
1928 753 D
1928 735 D
1932 725 D
1936 717 D
1943 710 D
1950 707 D
S
N
1975 735 M
1975 707 D
S
N
1979 735 M
1979 707 D
S
N
1964 735 M
1990 735 D
S
N
2011 735 M
2055 735 D
2055 743 D
2051 750 D
2047 753 D
2040 757 D
2029 757 D
2019 753 D
2011 746 D
2008 735 D
2008 728 D
2011 717 D
2019 710 D
2029 707 D
2037 707 D
2047 710 D
2055 717 D
S
N
2051 735 M
2051 746 D
2047 753 D
S
N
2029 757 M
2022 753 D
2015 746 D
2011 735 D
2011 728 D
2015 717 D
2022 710 D
2029 707 D
S
N
2076 782 M
2101 707 D
S
N
2080 782 M
2101 717 D
S
N
2127 782 M
2101 707 D
S
N
2069 782 M
2091 782 D
S
N
2112 782 M
2134 782 D
S
N
2170 797 M
2170 681 D
S
N
2173 797 M
2173 681 D
S
N
2148 797 M
2173 797 D
S
N
2148 681 M
2173 681 D
S
N
2330 2559 M
2330 2556 D
2327 2556 D
2327 2559 D
2330 2563 D
2337 2567 D
2352 2567 D
2359 2563 D
2363 2559 D
2366 2552 D
2366 2527 D
2370 2520 D
2373 2516 D
S
N
2363 2559 M
2363 2527 D
2366 2520 D
2373 2516 D
2377 2516 D
S
N
2363 2552 M
2359 2548 D
2337 2545 D
2327 2541 D
2323 2534 D
2323 2527 D
2327 2520 D
2337 2516 D
2348 2516 D
2355 2520 D
2363 2527 D
S
N
2337 2545 M
2330 2541 D
2327 2534 D
2327 2527 D
2330 2520 D
2337 2516 D
S
N
2395 2606 M
2402 2599 D
2409 2588 D
2417 2574 D
2420 2556 D
2420 2541 D
2417 2523 D
2409 2509 D
2402 2498 D
2395 2491 D
S
N
2402 2599 M
2409 2585 D
2413 2574 D
2417 2556 D
2417 2541 D
2413 2523 D
2409 2512 D
2402 2498 D
S
N
993 2722 M
993 992 D
S
N
993 992 M
2550 992 D
S
N
2550 992 M
2550 2722 D
S
N
2550 2722 M
993 2722 D
S
N
993 992 M
2550 992 D
S
N
993 992 M
993 1044 D
S
N
1071 1009 M
1071 992 D
S
N
1149 992 M
1149 1009 D
S
N
1227 1009 M
1227 992 D
S
N
1304 992 M
1304 1009 D
S
N
1382 1044 M
1382 992 D
S
N
1460 992 M
1460 1009 D
S
N
1538 1009 M
1538 992 D
S
N
1616 992 M
1616 1009 D
S
N
1694 1009 M
1694 992 D
S
N
1772 992 M
1772 1044 D
S
N
1849 1009 M
1849 992 D
S
N
1927 992 M
1927 1009 D
S
N
2005 1009 M
2005 992 D
S
N
2083 992 M
2083 1009 D
S
N
2161 1044 M
2161 992 D
S
N
2239 992 M
2239 1009 D
S
N
2316 1009 M
2316 992 D
S
N
2394 992 M
2394 1009 D
S
N
2472 1009 M
2472 992 D
S
N
2550 992 M
2550 1044 D
S
N
990 935 M
981 932 D
976 923 D
973 909 D
973 900 D
976 886 D
981 877 D
990 874 D
996 874 D
1005 877 D
1010 886 D
1013 900 D
1013 909 D
1010 923 D
1005 932 D
996 935 D
990 935 D
S
N
990 935 M
984 932 D
981 929 D
979 923 D
976 909 D
976 900 D
979 886 D
981 880 D
984 877 D
990 874 D
S
N
996 874 M
1002 877 D
1005 880 D
1007 886 D
1010 900 D
1010 909 D
1007 923 D
1005 929 D
1002 932 D
996 935 D
S
N
1313 923 M
1319 926 D
1327 935 D
1327 874 D
S
N
1325 932 M
1325 874 D
S
N
1313 874 M
1339 874 D
S
N
1379 935 M
1371 932 D
1365 923 D
1362 909 D
1362 900 D
1365 886 D
1371 877 D
1379 874 D
1385 874 D
1394 877 D
1400 886 D
1402 900 D
1402 909 D
1400 923 D
1394 932 D
1385 935 D
1379 935 D
S
N
1379 935 M
1374 932 D
1371 929 D
1368 923 D
1365 909 D
1365 900 D
1368 886 D
1371 880 D
1374 877 D
1379 874 D
S
N
1385 874 M
1391 877 D
1394 880 D
1397 886 D
1400 900 D
1400 909 D
1397 923 D
1394 929 D
1391 932 D
1385 935 D
S
N
1437 935 M
1428 932 D
1423 923 D
1420 909 D
1420 900 D
1423 886 D
1428 877 D
1437 874 D
1443 874 D
1451 877 D
1457 886 D
1460 900 D
1460 909 D
1457 923 D
1451 932 D
1443 935 D
1437 935 D
S
N
1437 935 M
1431 932 D
1428 929 D
1425 923 D
1423 909 D
1423 900 D
1425 886 D
1428 880 D
1431 877 D
1437 874 D
S
N
1443 874 M
1449 877 D
1451 880 D
1454 886 D
1457 900 D
1457 909 D
1454 923 D
1451 929 D
1449 932 D
1443 935 D
S
N
1697 923 M
1699 920 D
1697 918 D
1694 920 D
1694 923 D
1697 929 D
1699 932 D
1708 935 D
1720 935 D
1728 932 D
1731 929 D
1734 923 D
1734 918 D
1731 912 D
1722 906 D
1708 900 D
1702 897 D
1697 892 D
1694 883 D
1694 874 D
S
N
1720 935 M
1725 932 D
1728 929 D
1731 923 D
1731 918 D
1728 912 D
1720 906 D
1708 900 D
S
N
1694 880 M
1697 883 D
1702 883 D
1717 877 D
1725 877 D
1731 880 D
1734 883 D
S
N
1702 883 M
1717 874 D
1728 874 D
1731 877 D
1734 883 D
1734 889 D
S
N
1769 935 M
1760 932 D
1754 923 D
1751 909 D
1751 900 D
1754 886 D
1760 877 D
1769 874 D
1774 874 D
1783 877 D
1789 886 D
1792 900 D
1792 909 D
1789 923 D
1783 932 D
1774 935 D
1769 935 D
S
N
1769 935 M
1763 932 D
1760 929 D
1757 923 D
1754 909 D
1754 900 D
1757 886 D
1760 880 D
1763 877 D
1769 874 D
S
N
1774 874 M
1780 877 D
1783 880 D
1786 886 D
1789 900 D
1789 909 D
1786 923 D
1783 929 D
1780 932 D
1774 935 D
S
N
1826 935 M
1818 932 D
1812 923 D
1809 909 D
1809 900 D
1812 886 D
1818 877 D
1826 874 D
1832 874 D
1841 877 D
1846 886 D
1849 900 D
1849 909 D
1846 923 D
1841 932 D
1832 935 D
1826 935 D
S
N
1826 935 M
1821 932 D
1818 929 D
1815 923 D
1812 909 D
1812 900 D
1815 886 D
1818 880 D
1821 877 D
1826 874 D
S
N
1832 874 M
1838 877 D
1841 880 D
1844 886 D
1846 900 D
1846 909 D
1844 923 D
1841 929 D
1838 932 D
1832 935 D
S
N
2086 923 M
2089 920 D
2086 918 D
2083 920 D
2083 923 D
2086 929 D
2089 932 D
2097 935 D
2109 935 D
2118 932 D
2120 926 D
2120 918 D
2118 912 D
2109 909 D
2100 909 D
S
N
2109 935 M
2115 932 D
2118 926 D
2118 918 D
2115 912 D
2109 909 D
S
N
2109 909 M
2115 906 D
2120 900 D
2123 895 D
2123 886 D
2120 880 D
2118 877 D
2109 874 D
2097 874 D
2089 877 D
2086 880 D
2083 886 D
2083 889 D
2086 892 D
2089 889 D
2086 886 D
S
N
2118 903 M
2120 895 D
2120 886 D
2118 880 D
2115 877 D
2109 874 D
S
N
2158 935 M
2149 932 D
2143 923 D
2141 909 D
2141 900 D
2143 886 D
2149 877 D
2158 874 D
2164 874 D
2172 877 D
2178 886 D
2181 900 D
2181 909 D
2178 923 D
2172 932 D
2164 935 D
2158 935 D
S
N
2158 935 M
2152 932 D
2149 929 D
2146 923 D
2143 909 D
2143 900 D
2146 886 D
2149 880 D
2152 877 D
2158 874 D
S
N
2164 874 M
2169 877 D
2172 880 D
2175 886 D
2178 900 D
2178 909 D
2175 923 D
2172 929 D
2169 932 D
2164 935 D
S
N
2216 935 M
2207 932 D
2201 923 D
2198 909 D
2198 900 D
2201 886 D
2207 877 D
2216 874 D
2221 874 D
2230 877 D
2236 886 D
2239 900 D
2239 909 D
2236 923 D
2230 932 D
2221 935 D
2216 935 D
S
N
2216 935 M
2210 932 D
2207 929 D
2204 923 D
2201 909 D
2201 900 D
2204 886 D
2207 880 D
2210 877 D
2216 874 D
S
N
2221 874 M
2227 877 D
2230 880 D
2233 886 D
2236 900 D
2236 909 D
2233 923 D
2230 929 D
2227 932 D
2221 935 D
S
N
2498 929 M
2498 874 D
S
N
2501 935 M
2501 874 D
S
N
2501 935 M
2469 892 D
2515 892 D
S
N
2489 874 M
2510 874 D
S
N
2547 935 M
2538 932 D
2533 923 D
2530 909 D
2530 900 D
2533 886 D
2538 877 D
2547 874 D
2553 874 D
2562 877 D
2567 886 D
2570 900 D
2570 909 D
2567 923 D
2562 932 D
2553 935 D
2547 935 D
S
N
2547 935 M
2541 932 D
2538 929 D
2536 923 D
2533 909 D
2533 900 D
2536 886 D
2538 880 D
2541 877 D
2547 874 D
S
N
2553 874 M
2559 877 D
2562 880 D
2564 886 D
2567 900 D
2567 909 D
2564 923 D
2562 929 D
2559 932 D
2553 935 D
S
N
2605 935 M
2596 932 D
2590 923 D
2587 909 D
2587 900 D
2590 886 D
2596 877 D
2605 874 D
2611 874 D
2619 877 D
2625 886 D
2628 900 D
2628 909 D
2625 923 D
2619 932 D
2611 935 D
2605 935 D
S
N
2605 935 M
2599 932 D
2596 929 D
2593 923 D
2590 909 D
2590 900 D
2593 886 D
2596 880 D
2599 877 D
2605 874 D
S
N
2611 874 M
2616 877 D
2619 880 D
2622 886 D
2625 900 D
2625 909 D
2622 923 D
2619 929 D
2616 932 D
2611 935 D
S
N
993 2722 M
2550 2722 D
S
N
993 2670 M
993 2722 D
S
N
1071 2722 M
1071 2705 D
S
N
1149 2705 M
1149 2722 D
S
N
1227 2722 M
1227 2705 D
S
N
1304 2705 M
1304 2722 D
S
N
1382 2722 M
1382 2670 D
S
N
1460 2705 M
1460 2722 D
S
N
1538 2722 M
1538 2705 D
S
N
1616 2705 M
1616 2722 D
S
N
1694 2722 M
1694 2705 D
S
N
1772 2670 M
1772 2722 D
S
N
1849 2722 M
1849 2705 D
S
N
1927 2705 M
1927 2722 D
S
N
2005 2722 M
2005 2705 D
S
N
2083 2705 M
2083 2722 D
S
N
2161 2722 M
2161 2670 D
S
N
2239 2705 M
2239 2722 D
S
N
2316 2722 M
2316 2705 D
S
N
2394 2705 M
2394 2722 D
S
N
2472 2722 M
2472 2705 D
S
N
2550 2670 M
2550 2722 D
S
N
993 992 M
993 2722 D
S
N
993 1095 M
1010 1095 D
S
N
1010 1204 M
993 1204 D
S
N
993 1312 M
1010 1312 D
S
N
1010 1420 M
993 1420 D
S
N
993 1529 M
1045 1529 D
S
N
1010 1637 M
993 1637 D
S
N
993 1746 M
1010 1746 D
S
N
1010 1854 M
993 1854 D
S
N
993 1963 M
1010 1963 D
S
N
1045 2071 M
993 2071 D
S
N
993 2180 M
1010 2180 D
S
N
1010 2288 M
993 2288 D
S
N
993 2397 M
1010 2397 D
S
N
1010 2505 M
993 2505 D
S
N
993 2614 M
1045 2614 D
S
N
1010 2722 M
993 2722 D
S
N
860 1543 M
866 1546 D
875 1555 D
875 1494 D
S
N
872 1552 M
872 1494 D
S
N
860 1494 M
886 1494 D
S
N
927 1555 M
918 1552 D
912 1543 D
909 1529 D
909 1520 D
912 1506 D
918 1497 D
927 1494 D
932 1494 D
941 1497 D
947 1506 D
950 1520 D
950 1529 D
947 1543 D
941 1552 D
932 1555 D
927 1555 D
S
N
927 1555 M
921 1552 D
918 1549 D
915 1543 D
912 1529 D
912 1520 D
915 1506 D
918 1500 D
921 1497 D
927 1494 D
S
N
932 1494 M
938 1497 D
941 1500 D
944 1506 D
947 1520 D
947 1529 D
944 1543 D
941 1549 D
938 1552 D
932 1555 D
S
N
855 2086 M
857 2083 D
855 2080 D
852 2083 D
852 2086 D
855 2091 D
857 2094 D
866 2097 D
878 2097 D
886 2094 D
889 2091 D
892 2086 D
892 2080 D
889 2074 D
881 2068 D
866 2063 D
860 2060 D
855 2054 D
852 2045 D
852 2037 D
S
N
878 2097 M
883 2094 D
886 2091 D
889 2086 D
889 2080 D
886 2074 D
878 2068 D
866 2063 D
S
N
852 2042 M
855 2045 D
860 2045 D
875 2039 D
883 2039 D
889 2042 D
892 2045 D
S
N
860 2045 M
875 2037 D
886 2037 D
889 2039 D
892 2045 D
892 2051 D
S
N
927 2097 M
918 2094 D
912 2086 D
909 2071 D
909 2063 D
912 2048 D
918 2039 D
927 2037 D
932 2037 D
941 2039 D
947 2048 D
950 2063 D
950 2071 D
947 2086 D
941 2094 D
932 2097 D
927 2097 D
S
N
927 2097 M
921 2094 D
918 2091 D
915 2086 D
912 2071 D
912 2063 D
915 2048 D
918 2042 D
921 2039 D
927 2037 D
S
N
932 2037 M
938 2039 D
941 2042 D
944 2048 D
947 2063 D
947 2071 D
944 2086 D
941 2091 D
938 2094 D
932 2097 D
S
N
855 2628 M
857 2625 D
855 2622 D
852 2625 D
852 2628 D
855 2634 D
857 2637 D
866 2639 D
878 2639 D
886 2637 D
889 2631 D
889 2622 D
886 2616 D
878 2614 D
869 2614 D
S
N
878 2639 M
883 2637 D
886 2631 D
886 2622 D
883 2616 D
878 2614 D
S
N
878 2614 M
883 2611 D
889 2605 D
892 2599 D
892 2590 D
889 2585 D
886 2582 D
878 2579 D
866 2579 D
857 2582 D
855 2585 D
852 2590 D
852 2593 D
855 2596 D
857 2593 D
855 2590 D
S
N
886 2608 M
889 2599 D
889 2590 D
886 2585 D
883 2582 D
878 2579 D
S
N
927 2639 M
918 2637 D
912 2628 D
909 2614 D
909 2605 D
912 2590 D
918 2582 D
927 2579 D
932 2579 D
941 2582 D
947 2590 D
950 2605 D
950 2614 D
947 2628 D
941 2637 D
932 2639 D
927 2639 D
S
N
927 2639 M
921 2637 D
918 2634 D
915 2628 D
912 2614 D
912 2605 D
915 2590 D
918 2585 D
921 2582 D
927 2579 D
S
N
932 2579 M
938 2582 D
941 2585 D
944 2590 D
947 2605 D
947 2614 D
944 2628 D
941 2634 D
938 2637 D
932 2639 D
S
N
2550 992 M
2550 2722 D
S
N
2533 1095 M
2550 1095 D
S
N
2550 1204 M
2533 1204 D
S
N
2533 1312 M
2550 1312 D
S
N
2550 1420 M
2533 1420 D
S
N
2498 1529 M
2550 1529 D
S
N
2550 1637 M
2533 1637 D
S
N
2533 1746 M
2550 1746 D
S
N
2550 1854 M
2533 1854 D
S
N
2533 1963 M
2550 1963 D
S
N
2550 2071 M
2498 2071 D
S
N
2533 2180 M
2550 2180 D
S
N
2550 2288 M
2533 2288 D
S
N
2533 2397 M
2550 2397 D
S
N
2550 2505 M
2533 2505 D
S
N
2498 2614 M
2550 2614 D
S
N
2550 2722 M
2533 2722 D
S
1.00 0.00 0.00 setrgbcolor
1051 1023 P
1090 1659 P
1129 2237 P
1168 2477 P
1207 2446 P
1246 2298 P
1285 2102 P
1324 1925 P
1363 1773 P
1402 1665 P
1441 1560 P
1480 1481 P
1518 1404 P
1557 1349 P
1596 1304 P
1635 1256 P
1674 1231 P
1713 1194 P
1752 1177 P
1791 1149 P
1830 1133 P
1869 1120 P
1908 1106 P
1947 1092 P
1986 1081 P
2025 1073 P
2063 1064 P
2102 1055 P
2141 1048 P
2180 1044 P
2219 1038 P
2258 1032 P
2297 1031 P
2336 1026 P
2375 1023 P
2414 1019 P
2453 1017 P
2492 1015 P
2531 1013 P
N
1032 992 M
1032 1023 D
1071 1023 D
1071 1659 D
1110 1659 D
1110 2237 D
1149 2237 D
1149 2477 D
1188 2477 D
1188 2446 D
1227 2446 D
1227 2298 D
1265 2298 D
1265 2102 D
1304 2102 D
1304 1925 D
1343 1925 D
1343 1773 D
1382 1773 D
1382 1665 D
1421 1665 D
1421 1560 D
1460 1560 D
1460 1481 D
1499 1481 D
1499 1404 D
1538 1404 D
1538 1349 D
1577 1349 D
1577 1304 D
1616 1304 D
1616 1256 D
1655 1256 D
1655 1231 D
1694 1231 D
1694 1194 D
1733 1194 D
1733 1177 D
1772 1177 D
1772 1149 D
1810 1149 D
1810 1133 D
1849 1133 D
1849 1120 D
1888 1120 D
1888 1106 D
1927 1106 D
1927 1092 D
1966 1092 D
1966 1081 D
2005 1081 D
2005 1073 D
2044 1073 D
2044 1064 D
2083 1064 D
2083 1055 D
2122 1055 D
2122 1048 D
2161 1048 D
2161 1044 D
2200 1044 D
2200 1038 D
2239 1038 D
2239 1032 D
2278 1032 D
2278 1031 D
2316 1031 D
2316 1026 D
2355 1026 D
2355 1023 D
2394 1023 D
2394 1019 D
2433 1019 D
2433 1017 D
2472 1017 D
2472 1015 D
2511 1015 D
2511 1013 D
2550 1013 D
S
0.00 0.00 1.00 setrgbcolor
1051 1009 P
1090 1356 P
1129 1651 P
1168 1776 P
1207 1771 P
1246 1687 P
1285 1589 P
1324 1497 P
1363 1417 P
1402 1356 P
1441 1302 P
1480 1258 P
1518 1221 P
1557 1191 P
1596 1164 P
1635 1142 P
1674 1123 P
1713 1108 P
1752 1094 P
1791 1083 P
1830 1073 P
1869 1064 P
1908 1056 P
1947 1048 P
1986 1043 P
2025 1038 P
2063 1033 P
2102 1029 P
2141 1025 P
2180 1022 P
2219 1019 P
2258 1016 P
2297 1014 P
2336 1011 P
2375 1009 P
2414 1007 P
2453 1006 P
2492 1004 P
2531 1003 P
[8 30] 0 Sd
N
1032 992 M
1032 1009 D
1071 1009 D
1071 1356 D
1110 1356 D
1110 1651 D
1149 1651 D
1149 1776 D
1188 1776 D
1188 1771 D
1227 1771 D
1227 1687 D
1265 1687 D
1265 1589 D
1304 1589 D
1304 1497 D
1343 1497 D
1343 1417 D
1382 1417 D
1382 1356 D
1421 1356 D
1421 1302 D
1460 1302 D
1460 1258 D
1499 1258 D
1499 1221 D
1538 1221 D
1538 1191 D
1577 1191 D
1577 1164 D
1616 1164 D
1616 1142 D
1655 1142 D
1655 1123 D
1694 1123 D
1694 1108 D
1733 1108 D
1733 1094 D
1772 1094 D
1772 1083 D
1810 1083 D
1810 1073 D
1849 1073 D
1849 1064 D
1888 1064 D
1888 1056 D
1927 1056 D
1927 1048 D
1966 1048 D
1966 1043 D
2005 1043 D
2005 1038 D
2044 1038 D
2044 1033 D
2083 1033 D
2083 1029 D
2122 1029 D
2122 1025 D
2161 1025 D
2161 1022 D
2200 1022 D
2200 1019 D
2239 1019 D
2239 1016 D
2278 1016 D
2278 1014 D
2316 1014 D
2316 1011 D
2355 1011 D
2355 1009 D
2394 1009 D
2394 1007 D
2433 1007 D
2433 1006 D
2472 1006 D
2472 1004 D
2511 1004 D
2511 1003 D
2550 1003 D
S
0.00 1.00 0.00 setrgbcolor
[] 0 Sd
1285 995 P
1324 999 P
1363 1005 P
1402 1017 P
1441 1047 P
1480 1541 P
1518 1277 P
1557 1031 P
1596 1011 P
1635 1002 P
1674 998 P
1713 995 P
1752 993 P
[30 30 8 30] 0 Sd
N
1265 992 M
1265 995 D
1304 995 D
1304 999 D
1343 999 D
1343 1005 D
1382 1005 D
1382 1017 D
1421 1017 D
1421 1047 D
1460 1047 D
1460 1541 D
1499 1541 D
1499 1277 D
1538 1277 D
1538 1031 D
1577 1031 D
1577 1011 D
1616 1011 D
1616 1002 D
1655 1002 D
1655 998 D
1694 998 D
1694 995 D
1733 995 D
1733 993 D
1772 993 D
1772 992 D
S
0.00 1.00 1.00 setrgbcolor
[] 0 Sd
1480 1394 P
1518 1394 P
[39] 0 Sd
N
1460 992 M
1460 1394 D
1499 1394 D
1499 1394 D
1538 1394 D
1538 992 D
S
showpage
%%Trailer
%%Pages: 1
%%BoundingBox:
