%!PS-Adobe-2.0 EPSF-2.0
%%BoundingBox:  0 0 567 488
%%Title: Results/m120-m600-yh-mstw2008.eps: VBF - HAWK
%%Creator: ROOT Version 5.28/00c
%%CreationDate: Wed Nov 30 09:17:28 2011
%%EndComments
%%BeginProlog
80 dict begin
/s {stroke} def /l {lineto} def /m {moveto} def /t {translate} def
/r {rotate} def /rl {roll}  def /R {repeat} def
/d {rlineto} def /rm {rmoveto} def /gr {grestore} def /f {eofill} def
/c {setrgbcolor} def /black {0 setgray} def /sd {setdash} def
/cl {closepath} def /sf {scalefont setfont} def /lw {setlinewidth} def
/box {m dup 0 exch d exch 0 d 0 exch neg d cl} def
/NC{systemdict begin initclip end}def/C{NC box clip newpath}def
/bl {box s} def /bf {box f} def /Y { 0 exch d} def /X { 0 d} def 
/K {{pop pop 0 moveto} exch kshow} bind def
/ita {/ang 15 def gsave [1 0 ang dup sin exch cos div 1 0 0] concat} def 
/mp {newpath /y exch def /x exch def} def
/side {[w .77 mul w .23 mul] .385 w mul sd w 0 l currentpoint t -144 r} def
/mr {mp x y w2 0 360 arc} def /m24 {mr s} def /m20 {mr f} def
/mb {mp x y w2 add m w2 neg 0 d 0 w neg d w 0 d 0 w d cl} def
/mt {mp x y w2 add m w2 neg w neg d w 0 d cl} def
/m21 {mb f} def /m25 {mb s} def /m22 {mt f} def /m26{mt s} def
/m23 {mp x y w2 sub m w2 w d w neg 0 d cl f} def
/m27 {mp x y w2 add m w3 neg w2 neg d w3 w2 neg d w3 w2 d cl s} def
/m28 {mp x w2 sub y w2 sub w3 add m w3 0 d  0 w3 neg d w3 0 d 0 w3 d w3 0 d  0 w3 d w3 neg 0 d 0 w3 d w3 neg 0 d 0 w3 neg d w3 neg 0 d cl s } def
/m29 {mp gsave x w2 sub y w2 add w3 sub m currentpoint t 4 {side} repeat cl fill gr} def
/m30 {mp gsave x w2 sub y w2 add w3 sub m currentpoint t 4 {side} repeat cl s gr} def
/m31 {mp x y w2 sub m 0 w d x w2 sub y m w 0 d x w2 sub y w2 add m w w neg d x w2 sub y w2 sub m w w d s} def
/m32 {mp x y w2 sub m w2 w d w neg 0 d cl s} def
/m33 {mp x y w2 add m w3 neg w2 neg d w3 w2 neg d w3 w2 d cl f} def
/m34 {mp x w2 sub y w2 sub w3 add m w3 0 d  0 w3 neg d w3 0 d 0 w3 d w3 0 d  0 w3 d w3 neg 0 d 0 w3 d w3 neg 0 d 0 w3 neg d w3 neg 0 d cl f } def
/m2 {mp x y w2 sub m 0 w d x w2 sub y m w 0 d s} def
/m5 {mp x w2 sub y w2 sub m w w d x w2 sub y w2 add m w w neg d s} def
/reEncode {exch findfont dup length dict begin {1 index /FID eq  {pop pop} {def} ifelse } forall /Encoding exch def currentdict end dup /FontName get exch definefont pop } def [/Times-Bold /Times-Italic /Times-BoldItalic /Helvetica /Helvetica-Oblique
 /Helvetica-Bold /Helvetica-BoldOblique /Courier /Courier-Oblique /Courier-Bold /Courier-BoldOblique /Times-Roman /AvantGarde-Book /AvantGarde-BookOblique /AvantGarde-Demi /AvantGarde-DemiOblique /Bookman-Demi /Bookman-DemiItalic /Bookman-Light
 /Bookman-LightItalic /Helvetica-Narrow /Helvetica-Narrow-Bold /Helvetica-Narrow-BoldOblique /Helvetica-Narrow-Oblique /NewCenturySchlbk-Roman /NewCenturySchlbk-Bold /NewCenturySchlbk-BoldItalic /NewCenturySchlbk-Italic /Palatino-Bold
 /Palatino-BoldItalic /Palatino-Italic /Palatino-Roman ] {ISOLatin1Encoding reEncode } forall%%EndProlog
%%BeginSetup
%%EndSetup
newpath  gsave  .25 .25 scale  gsave  0 0 t black[  ] 0 sd 3 lw 1 1 1 c 2268 1954 0 0 bf black 1 1 1 c 2177 1329 45 586 bf black 1 1 1 c 1677 1063 328 719 bf black 1677 1063 328 719 bl 1 1 1 c 1677 1063 328 719 bf black 1677 1063 328 719 bl 0.8 0 0
 c[  12 12 ] 0 sd 6 lw 1 1 1 c black 0.8 0 0 c 328 723 m 120 X 31 Y 120 X 102 Y 120 X 203 Y 119 X 264 Y 120 X 250 Y 120 X 142 Y 120 X 16 Y 119 X -157 Y 120 X -247 Y 120 X -257 Y 119 X -215 Y 120 X -101 Y 120 X -33 Y 120 X s black[  ] 0 sd 3 lw 328
 719 m 1677 X s
 gsave  2177 1329 45 586 C 1976.66 589.708 t 0 r /Helvetica findfont 40.5691 sf 0 0 m (H) show NC gr 
 gsave  2177 1329 45 586 C 1946.29 625.141 t 0 r /Helvetica findfont 60.8537 sf 0 0 m (y) show NC gr  448 750 m -31 Y s 496 734 m -15 Y s 544 734 m -15 Y s 592 734 m -15 Y s 640 734 m -15 Y s 688 750 m -31 Y s 735 734 m -15 Y s 783 734 m -15 Y s 831
 734 m -15 Y s 879 734 m -15 Y s 927 750 m -31 Y s 975 734 m -15 Y s 1023 734 m -15 Y s 1071 734 m -15 Y s 1119 734 m -15 Y s 1167 750 m -31 Y s 1214 734 m -15 Y s 1262 734 m -15 Y s 1310 734 m -15 Y s 1358 734 m -15 Y s 1406 750 m -31 Y s 1454 734 m
 -15 Y s 1502 734 m -15 Y s 1550 734 m -15 Y s 1598 734 m -15 Y s 1645 750 m -31 Y s 1693 734 m -15 Y s 1741 734 m -15 Y s 1789 734 m -15 Y s 1837 734 m -15 Y s 1885 750 m -31 Y s 448 750 m -31 Y s 400 734 m -15 Y s 352 734 m -15 Y s 1885 750 m -31 Y
 s 1933 734 m -15 Y s 1981 734 m -15 Y s
 gsave  2177 1329 45 586 C 427.728 675.759 t 0 r /Helvetica findfont 45.6403 sf 0 0 m (\2553) show NC gr 
 gsave  2177 1329 45 586 C 665.636 675.759 t 0 r /Helvetica findfont 45.6403 sf 0 0 m (\2552) show NC gr 
 gsave  2177 1329 45 586 C 908.605 675.759 t 0 r /Helvetica findfont 45.6403 sf 0 0 m (\2551) show NC gr 
 gsave  2177 1329 45 586 C 1151.57 675.759 t 0 r /Helvetica findfont 45.6403 sf 0 0 m (0) show NC gr 
 gsave  2177 1329 45 586 C 1394.54 675.759 t 0 r /Helvetica findfont 45.6403 sf 0 0 m (1) show NC gr 
 gsave  2177 1329 45 586 C 1632.45 675.759 t 0 r /Helvetica findfont 45.6403 sf 0 0 m (2) show NC gr 
 gsave  2177 1329 45 586 C 1870.36 675.759 t 0 r /Helvetica findfont 45.6403 sf 0 0 m (3) show NC gr  328 719 m 1063 Y s
 gsave  2177 1329 45 586 C 217.66 1685.6 t 90 r /Helvetica findfont 60.8537 sf 0 0 m ( [fb]) show NC gr 
 gsave  2177 1329 45 586 C 250.562 1657.76 t 90 r /Helvetica findfont 40.5691 sf 0 0 m (H) show NC gr 
 gsave  2177 1329 45 586 C 217.66 1576.77 t 90 r /Helvetica findfont 60.8537 sf 0 0 m (/dy) show NC gr 
 gsave  2177 1329 45 586 C 217.66 1538.81 t 90 r /Symbol findfont 60.8537 sf 0 0 m (s) show NC gr 
 gsave  2177 1329 45 586 C 217.66 1508.44 t 90 r /Helvetica findfont 60.8537 sf 0 0 m (d) show NC gr  381 719 m -53 X s 354 772 m -26 X s 354 825 m -26 X s 354 878 m -26 X s 381 931 m -53 X s 354 984 m -26 X s 354 1037 m -26 X s 354 1089 m -26 X s
 381 1142 m -53 X s 354 1195 m -26 X s 354 1248 m -26 X s 354 1301 m -26 X s 381 1354 m -53 X s 354 1407 m -26 X s 354 1460 m -26 X s 354 1513 m -26 X s 381 1566 m -53 X s 354 1619 m -26 X s 354 1672 m -26 X s 354 1724 m -26 X s 381 1777 m -53 X s
 381 1777 m -53 X s
 gsave  2177 1329 45 586 C 291.057 703.6 t 0 r /Helvetica findfont 45.6403 sf 0 0 m (0) show NC gr 
 gsave  2177 1329 45 586 C 265.748 913.667 t 0 r /Helvetica findfont 45.6403 sf 0 0 m (20) show NC gr 
 gsave  2177 1329 45 586 C 265.748 1126.27 t 0 r /Helvetica findfont 45.6403 sf 0 0 m (40) show NC gr 
 gsave  2177 1329 45 586 C 265.748 1338.86 t 0 r /Helvetica findfont 45.6403 sf 0 0 m (60) show NC gr 
 gsave  2177 1329 45 586 C 265.748 1548.93 t 0 r /Helvetica findfont 45.6403 sf 0 0 m (80) show NC gr 
 gsave  2177 1329 45 586 C 240.439 1761.53 t 0 r /Helvetica findfont 45.6403 sf 0 0 m (100) show NC gr  0.4 0.4 0.8 c 6 lw 1 1 1 c black 0.4 0.4 0.8 c 328 722 m 120 X 26 Y 120 X 96 Y 120 X 193 Y 119 X 239 Y 120 X 241 Y 120 X 132 Y 120 X -7 Y 119 X
 -142 Y 120 X -220 Y 120 X -247 Y 119 X -186 Y 120 X -98 Y 120 X -28 Y 120 X s 0 0.8 0 c[ 20 12 4 12] 0 sd 1 1 1 c black 0 0.8 0 c 328 722 m 120 X 29 Y 120 X 103 Y 120 X 210 Y 119 X 259 Y 120 X 261 Y 120 X 149 Y 120 X -9 Y 119 X -155 Y 120 X -242 Y
 120 X -267 Y 119 X -203 Y 120 X -106 Y 120 X -29 Y 120 X s 0.2 0 0.4 c[ 20 20] 0 sd 1 1 1 c black 0.2 0 0.4 c 328 721 m 120 X 27 Y 120 X 95 Y 120 X 187 Y 119 X 242 Y 120 X 219 Y 120 X 139 Y 120 X -10 Y 119 X -125 Y 120 X -220 Y 120 X -251 Y 119 X
 -188 Y 120 X -88 Y 120 X -27 Y 120 X s 0.8 0 0 c[  12 12 ] 0 sd 1 1 1 c black 0.8 0 0 c 328 719 m 360 X 4 Y 119 X 20 Y 120 X 47 Y 120 X 42 Y 239 X -42 Y 120 X -47 Y 120 X -21 Y 119 X -3 Y 360 X s 0.4 0.4 0.8 c[  ] 0 sd 1 1 1 c black 0.4 0.4 0.8 c
 328 719 m 240 X 1 Y 120 X 6 Y 119 X 30 Y 120 X 54 Y 120 X 45 Y 239 X -45 Y 120 X -56 Y 120 X -27 Y 119 X -6 Y 120 X -2 Y 240 X s 0 0.8 0 c[ 20 12 4 12] 0 sd 1 1 1 c black 0 0.8 0 c 328 719 m 240 X 2 Y 120 X 5 Y 119 X 29 Y 120 X 54 Y 120 X 43 Y 239 X
 -44 Y 120 X -55 Y 120 X -26 Y 119 X -7 Y 120 X -1 Y 240 X s 0.2 0 0.4 c[ 20 20] 0 sd 1 1 1 c black 0.2 0 0.4 c 328 719 m 360 X 3 Y 119 X 22 Y 120 X 51 Y 120 X 47 Y 239 X -47 Y 120 X -51 Y 120 X -22 Y 119 X -3 Y 360 X s black
 gsave  2177 1329 45 586 C 2057.65 1338.86 t 90 r /Helvetica-BoldOblique findfont 38.0336 sf 0 0 m 
 410 392 371 351 340 311 276 266 241 216 206 181 152 123 113 86 76 49 22
(LHC HIGGS XS WG 2011) K NC gr 
 gsave  2177 1329 45 586 C 1650.17 1705.85 t 0 r /Helvetica findfont 30.4268 sf 0 0 m 
 239 229 212 191 183 154 135 126 118 97 88 68 40 22
(HAWK w/ EW Corr) K NC gr  0.4 0.4 0.8 c[  ] 0 sd 1544 1717 m 88 X s black
 gsave  2177 1329 45 586 C 1650.17 1629.92 t 0 r /Helvetica findfont 30.4268 sf 0 0 m (POWHEG) show NC gr  0.8 0 0 c[  12 12 ] 0 sd 1544 1641 m 88 X s black
 gsave  2177 1329 45 586 C 1650.17 1553.99 t 0 r /Helvetica findfont 30.4268 sf 0 0 m 
 255 245 228 207 199 170 151 142 126 118 96 88 68 40 21
(HAWK w/o EW Corr) K NC gr  0 0.8 0 c[ 20 12 4 12] 0 sd 1544 1564 m 88 X s black
 gsave  2177 1329 45 586 C 1650.17 1475.53 t 0 r /Helvetica findfont 30.4268 sf 0 0 m (VBFNLO w/ EW Corr) show NC gr  0.2 0 0.4 c[ 20 20] 0 sd 1544 1488 m 88 X s black[  ] 0 sd 3 lw 1 1 1 c black 1 1 1 c 1677 300 328 231 bf black 1677 300 328 231 bl
 1 1 1 c 1677 300 328 231 bf black 1677 300 328 231 bl 328 231 m 1677 X s
 gsave  2177 547 45 39 C 1976.66 111.361 t 0 r /Helvetica findfont 40.5249 sf 0 0 m (H) show NC gr 
 gsave  2177 547 45 39 C 1946.29 146.794 t 0 r /Helvetica findfont 60.7874 sf 0 0 m (y) show NC gr  448 243 m -12 Y s 496 237 m -6 Y s 544 237 m -6 Y s 592 237 m -6 Y s 640 237 m -6 Y s 688 243 m -12 Y s 735 237 m -6 Y s 783 237 m -6 Y s 831 237 m -6
 Y s 879 237 m -6 Y s 927 243 m -12 Y s 975 237 m -6 Y s 1023 237 m -6 Y s 1071 237 m -6 Y s 1119 237 m -6 Y s 1167 243 m -12 Y s 1214 237 m -6 Y s 1262 237 m -6 Y s 1310 237 m -6 Y s 1358 237 m -6 Y s 1406 243 m -12 Y s 1454 237 m -6 Y s 1502 237 m
 -6 Y s 1550 237 m -6 Y s 1598 237 m -6 Y s 1645 243 m -12 Y s 1693 237 m -6 Y s 1741 237 m -6 Y s 1789 237 m -6 Y s 1837 237 m -6 Y s 1885 243 m -12 Y s 448 243 m -12 Y s 400 237 m -6 Y s 352 237 m -6 Y s 1885 243 m -12 Y s 1933 237 m -6 Y s 1981
 237 m -6 Y s
 gsave  2177 547 45 39 C 427.728 189.82 t 0 r /Helvetica findfont 45.5906 sf 0 0 m (\2553) show NC gr 
 gsave  2177 547 45 39 C 665.636 189.82 t 0 r /Helvetica findfont 45.5906 sf 0 0 m (\2552) show NC gr 
 gsave  2177 547 45 39 C 908.605 189.82 t 0 r /Helvetica findfont 45.5906 sf 0 0 m (\2551) show NC gr 
 gsave  2177 547 45 39 C 1151.57 189.82 t 0 r /Helvetica findfont 45.5906 sf 0 0 m (0) show NC gr 
 gsave  2177 547 45 39 C 1394.54 189.82 t 0 r /Helvetica findfont 45.5906 sf 0 0 m (1) show NC gr 
 gsave  2177 547 45 39 C 1632.45 189.82 t 0 r /Helvetica findfont 45.5906 sf 0 0 m (2) show NC gr 
 gsave  2177 547 45 39 C 1870.36 189.82 t 0 r /Helvetica findfont 45.5906 sf 0 0 m (3) show NC gr  328 231 m 300 Y s
 gsave  2177 547 45 39 C 222.722 430.259 t 90 r /Helvetica findfont 60.7874 sf 0 0 m ( [%]) show NC gr 
 gsave  2177 547 45 39 C 245.501 364.454 t 90 r /Helvetica findfont 40.5249 sf 0 0 m (EW) show NC gr 
 gsave  2177 547 45 39 C 222.722 334.083 t 90 r /Symbol findfont 60.7874 sf 0 0 m (d) show NC gr  364 231 m -36 X s 346 251 m -18 X s 346 271 m -18 X s 346 291 m -18 X s 346 311 m -18 X s 364 331 m -36 X s 346 351 m -18 X s 346 371 m -18 X s 346 391
 m -18 X s 346 411 m -18 X s 364 431 m -36 X s 346 451 m -18 X s 346 471 m -18 X s 346 491 m -18 X s 346 511 m -18 X s 364 531 m -36 X s
 gsave  2177 547 45 39 C 250.562 215.129 t 0 r /Helvetica findfont 45.5906 sf 0 0 m (\25510) show NC gr 
 gsave  2177 547 45 39 C 275.872 313.836 t 0 r /Helvetica findfont 45.5906 sf 0 0 m (\2555) show NC gr 
 gsave  2177 547 45 39 C 291.057 415.073 t 0 r /Helvetica findfont 45.5906 sf 0 0 m (0) show NC gr 
 gsave  2177 547 45 39 C 291.057 513.78 t 0 r /Helvetica findfont 45.5906 sf 0 0 m (5) show NC gr  0.4 0.4 0.4 c 388 334 m -60 X s 328 329 m 10 Y s 388 334 m 60 X s 448 329 m 10 Y s 388 334 m 18 Y s 383 352 m 10 X s 388 334 m -18 Y s 383 316 m 10 X s
 508 281 m -60 X s 448 276 m 10 Y s 508 281 m 60 X s 568 276 m 10 Y s 508 281 m 12 Y s 503 293 m 10 X s 508 281 m -12 Y s 503 269 m 10 X s 628 283 m -60 X s 568 278 m 10 Y s 628 283 m 60 X s 688 278 m 10 Y s 628 283 m 6 Y s 623 289 m 10 X s 628 283 m
 -7 Y s 623 276 m 10 X s 747 270 m -59 X s 688 265 m 10 Y s 747 270 m 60 X s 807 265 m 10 Y s 747 270 m 5 Y s 742 275 m 11 X s 747 270 m -4 Y s 742 266 m 11 X s 867 275 m -60 X s 807 270 m 10 Y s 867 275 m 60 X s 927 270 m 10 Y s 867 275 m 3 Y s 862
 278 m 10 X s 867 275 m -3 Y s 862 272 m 10 X s 987 273 m -60 X s 927 267 m 11 Y s 987 273 m 60 X s 1047 267 m 11 Y s 987 273 m 2 Y s 982 275 m 10 X s 987 273 m -3 Y s 982 270 m 10 X s 1107 267 m -60 X s 1047 262 m 10 Y s 1107 267 m 60 X s 1167 262 m
 10 Y s 1107 267 m 3 Y s 1102 270 m 10 X s 1107 267 m -3 Y s 1102 264 m 10 X s 1226 266 m -59 X s 1167 261 m 10 Y s 1226 266 m 60 X s 1286 261 m 10 Y s 1226 266 m 1 Y s 1221 267 m 10 X s 1226 266 m -2 Y s 1221 264 m 10 X s 1346 267 m -60 X s 1286 262
 m 10 Y s 1346 267 m 60 X s 1406 262 m 10 Y s 1346 267 m 3 Y s 1341 270 m 10 X s 1346 267 m -2 Y s 1341 265 m 10 X s 1466 275 m -60 X s 1406 270 m 10 Y s 1466 275 m 60 X s 1526 270 m 10 Y s 1466 275 m 2 Y s 1461 277 m 10 X s 1466 275 m -2 Y s 1461
 273 m 10 X s 1586 274 m -60 X s 1526 269 m 10 Y s 1586 274 m 59 X s 1645 269 m 10 Y s 1586 274 m 1 Y s 1581 275 m 10 X s 1586 274 m -2 Y s 1581 272 m 10 X s 1705 282 m -60 X s 1645 277 m 10 Y s 1705 282 m 60 X s 1765 277 m 10 Y s 1705 282 m 1 Y s
 1700 283 m 10 X s 1705 282 m -2 Y s 1700 280 m 10 X s 1825 296 m -60 X s 1765 291 m 10 Y s 1825 296 m 60 X s 1885 291 m 10 Y s 1825 296 m 3 Y s 1820 299 m 10 X s 1825 296 m -2 Y s 1820 294 m 10 X s 1945 310 m -60 X s 1885 305 m 10 Y s 1945 310 m 60
 X s 2005 305 m 10 Y s 1945 310 m 4 Y s 1940 314 m 10 X s 1945 310 m -4 Y s 1940 306 m 10 X s black /w 4 def /w2 {w 2 div} def /w3 {w 3 div} def 388 334 508 281 628 283 747 270 867 275 987 273 1107 267 1226 266 1346 267 1466 275 1586 274 1705 282
 1825 296 1945 310 14 { m21} R 0.4 0.4 0.4 c black 0.4 0.4 0.4 c
 gsave  2177 547 45 39 C 1698.26 311.305 t 0 r /Helvetica findfont 40.5249 sf 0 0 m ( = 120 GeV) show NC gr  black 0.4 0.4 0.4 c
 gsave  2177 547 45 39 C 1678.01 301.181 t 0 r /Helvetica findfont 27.8609 sf 0 0 m (H) show NC gr  black 0.4 0.4 0.4 c
 gsave  2177 547 45 39 C 1645.11 311.305 t 0 r /Helvetica findfont 40.5249 sf 0 0 m (M) show NC gr  0.6 0 0 c 388 387 m -60 X s 328 382 m 10 Y s 388 387 m 60 X s 448 382 m 10 Y s 388 387 m 48 Y s 383 435 m 10 X s 388 387 m -48 Y s 383 339 m 10 X s
 508 333 m -60 X s 448 328 m 10 Y s 508 333 m 60 X s 568 328 m 10 Y s 508 333 m 58 Y s 503 391 m 10 X s 508 333 m -58 Y s 503 275 m 10 X s 628 443 m -60 X s 568 438 m 10 Y s 628 443 m 60 X s 688 438 m 10 Y s 628 443 m 27 Y s 623 470 m 10 X s 628 443
 m -26 Y s 623 417 m 10 X s 747 479 m -59 X s 688 473 m 11 Y s 747 479 m 60 X s 807 473 m 11 Y s 747 479 m 16 Y s 742 495 m 11 X s 747 479 m -17 Y s 742 462 m 11 X s 867 478 m -60 X s 807 473 m 10 Y s 867 478 m 60 X s 927 473 m 10 Y s 867 478 m 7 Y s
 862 485 m 10 X s 867 478 m -7 Y s 862 471 m 10 X s 987 476 m -60 X s 927 471 m 10 Y s 987 476 m 60 X s 1047 471 m 10 Y s 987 476 m 2 Y s 982 478 m 10 X s 987 476 m -3 Y s 982 473 m 10 X s 1107 479 m -60 X s 1047 474 m 10 Y s 1107 479 m 60 X s 1167
 474 m 10 Y s 1107 479 m 3 Y s 1102 482 m 10 X s 1107 479 m -3 Y s 1102 476 m 10 X s 1226 480 m -59 X s 1167 475 m 10 Y s 1226 480 m 60 X s 1286 475 m 10 Y s 1226 480 m 1 Y s 1221 481 m 10 X s 1226 480 m -2 Y s 1221 478 m 10 X s 1346 477 m -60 X s
 1286 472 m 10 Y s 1346 477 m 60 X s 1406 472 m 10 Y s 1346 477 m 1 Y s 1341 478 m 10 X s 1346 477 m -2 Y s 1341 475 m 10 X s 1466 476 m -60 X s 1406 471 m 10 Y s 1466 476 m 60 X s 1526 471 m 10 Y s 1466 476 m 3 Y s 1461 479 m 10 X s 1466 476 m -2 Y
 s 1461 474 m 10 X s 1586 481 m -60 X s 1526 476 m 10 Y s 1586 481 m 59 X s 1645 476 m 10 Y s 1586 481 m 8 Y s 1581 489 m 10 X s 1586 481 m -9 Y s 1581 472 m 10 X s 1705 470 m -60 X s 1645 465 m 10 Y s 1705 470 m 60 X s 1765 465 m 10 Y s 1705 470 m
 24 Y s 1700 494 m 10 X s 1705 470 m -25 Y s 1700 445 m 10 X s 1825 491 m -60 X s 1765 486 m 10 Y s 1825 491 m 60 X s 1885 486 m 10 Y s 1825 491 m 33 Y s 1820 524 m 10 X s 1825 491 m -33 Y s 1820 458 m 10 X s 1945 437 m -60 X s 1885 432 m 10 Y s 1945
 437 m 60 X s 2005 432 m 10 Y s 1945 437 m 18 Y s 1940 455 m 10 X s 1945 437 m -19 Y s 1940 418 m 10 X s black 388 387 508 333 628 443 747 479 867 478 987 476 1107 479 1226 480 1346 477 1466 476 1586 481 1705 470 1825 491 1945 437 14 { m22} R 0.6 0 0
 c black 0.6 0 0 c
 gsave  2177 547 45 39 C 1698.26 392.295 t 0 r /Helvetica findfont 40.5249 sf 0 0 m ( = 600 GeV) show NC gr  black 0.6 0 0 c
 gsave  2177 547 45 39 C 1678.01 382.171 t 0 r /Helvetica findfont 27.8609 sf 0 0 m (H) show NC gr  black 0.6 0 0 c
 gsave  2177 547 45 39 C 1645.11 392.295 t 0 r /Helvetica findfont 40.5249 sf 0 0 m (M) show NC gr 
 gr  gr showpage
end
%%EOF
