%!PS-Adobe-1.0
%%Creator: Unified Graphics System
%%Pages: (atend)
%%DocumentFonts: Helvetica
%%BoundingBox:   40  236  464  568
%%EndComments
/Sw{setlinewidth}def
/Sg{setgray}def
/Sd{setdash}def
/P {newpath
    moveto
0 0 rlineto
    stroke}def
/M {moveto}def
/D {lineto}def
/N {newpath}def
/S {stroke}def
/T {/Helvetica findfont
    exch
    scalefont
    setfont}def
/R {rotate}def
/W {show}def
/F {fill}def
/X {gsave}def
/Y {grestore}def
%%EndProlog
%%Page: 1 1
0.12000 0.12000 scale
1 setlinecap
1 setlinejoin
6 Sw
0.00 0.00 0.00 setrgbcolor
[] 0 Sd
N
785 4685 M
785 2262 D
S
N
785 2262 M
3762 2262 D
S
N
3762 2262 M
3762 4685 D
S
N
3762 4685 M
785 4685 D
S
N
785 2262 M
3762 2262 D
S
N
785 2262 M
785 2296 D
S
N
989 2296 M
989 2262 D
S
N
1147 2262 M
1147 2366 D
S
N
1276 2296 M
1276 2262 D
S
N
1385 2262 M
1385 2296 D
S
N
1480 2296 M
1480 2262 D
S
N
1563 2262 M
1563 2296 D
S
N
1638 2366 M
1638 2262 D
S
N
2129 2262 M
2129 2366 D
S
N
2417 2296 M
2417 2262 D
S
N
2621 2262 M
2621 2296 D
S
N
2779 2366 M
2779 2262 D
S
N
2908 2262 M
2908 2296 D
S
N
3017 2296 M
3017 2262 D
S
N
3112 2262 M
3112 2296 D
S
N
3196 2296 M
3196 2262 D
S
N
3270 2262 M
3270 2366 D
S
N
3762 2366 M
3762 2262 D
S
N
1132 2205 M
1126 2176 D
S
N
1126 2176 M
1132 2182 D
1141 2184 D
1150 2184 D
1158 2182 D
1164 2176 D
1167 2167 D
1167 2161 D
1164 2153 D
1158 2147 D
1150 2144 D
1141 2144 D
1132 2147 D
1129 2150 D
1126 2156 D
1126 2158 D
1129 2161 D
1132 2158 D
1129 2156 D
S
N
1150 2184 M
1155 2182 D
1161 2176 D
1164 2167 D
1164 2161 D
1161 2153 D
1155 2147 D
1150 2144 D
S
N
1132 2205 M
1161 2205 D
S
N
1132 2202 M
1147 2202 D
1161 2205 D
S
N
1598 2193 M
1603 2196 D
1612 2205 D
1612 2144 D
S
N
1609 2202 M
1609 2144 D
S
N
1598 2144 M
1624 2144 D
S
N
1664 2205 M
1655 2202 D
1650 2193 D
1647 2179 D
1647 2170 D
1650 2156 D
1655 2147 D
1664 2144 D
1670 2144 D
1678 2147 D
1684 2156 D
1687 2170 D
1687 2179 D
1684 2193 D
1678 2202 D
1670 2205 D
1664 2205 D
S
N
1664 2205 M
1658 2202 D
1655 2199 D
1653 2193 D
1650 2179 D
1650 2170 D
1653 2156 D
1655 2150 D
1658 2147 D
1664 2144 D
S
N
1670 2144 M
1676 2147 D
1678 2150 D
1681 2156 D
1684 2170 D
1684 2179 D
1681 2193 D
1678 2199 D
1676 2202 D
1670 2205 D
S
N
2083 2193 M
2086 2190 D
2083 2187 D
2080 2190 D
2080 2193 D
2083 2199 D
2086 2202 D
2095 2205 D
2106 2205 D
2115 2202 D
2118 2199 D
2121 2193 D
2121 2187 D
2118 2182 D
2109 2176 D
2095 2170 D
2089 2167 D
2083 2161 D
2080 2153 D
2080 2144 D
S
N
2106 2205 M
2112 2202 D
2115 2199 D
2118 2193 D
2118 2187 D
2115 2182 D
2106 2176 D
2095 2170 D
S
N
2080 2150 M
2083 2153 D
2089 2153 D
2103 2147 D
2112 2147 D
2118 2150 D
2121 2153 D
S
N
2089 2153 M
2103 2144 D
2115 2144 D
2118 2147 D
2121 2153 D
2121 2158 D
S
N
2155 2205 M
2147 2202 D
2141 2193 D
2138 2179 D
2138 2170 D
2141 2156 D
2147 2147 D
2155 2144 D
2161 2144 D
2170 2147 D
2176 2156 D
2178 2170 D
2178 2179 D
2176 2193 D
2170 2202 D
2161 2205 D
2155 2205 D
S
N
2155 2205 M
2150 2202 D
2147 2199 D
2144 2193 D
2141 2179 D
2141 2170 D
2144 2156 D
2147 2150 D
2150 2147 D
2155 2144 D
S
N
2161 2144 M
2167 2147 D
2170 2150 D
2173 2156 D
2176 2170 D
2176 2179 D
2173 2193 D
2170 2199 D
2167 2202 D
2161 2205 D
S
N
2736 2205 M
2730 2176 D
S
N
2730 2176 M
2736 2182 D
2744 2184 D
2753 2184 D
2762 2182 D
2767 2176 D
2770 2167 D
2770 2161 D
2767 2153 D
2762 2147 D
2753 2144 D
2744 2144 D
2736 2147 D
2733 2150 D
2730 2156 D
2730 2158 D
2733 2161 D
2736 2158 D
2733 2156 D
S
N
2753 2184 M
2759 2182 D
2764 2176 D
2767 2167 D
2767 2161 D
2764 2153 D
2759 2147 D
2753 2144 D
S
N
2736 2205 M
2764 2205 D
S
N
2736 2202 M
2750 2202 D
2764 2205 D
S
N
2805 2205 M
2796 2202 D
2790 2193 D
2788 2179 D
2788 2170 D
2790 2156 D
2796 2147 D
2805 2144 D
2811 2144 D
2819 2147 D
2825 2156 D
2828 2170 D
2828 2179 D
2825 2193 D
2819 2202 D
2811 2205 D
2805 2205 D
S
N
2805 2205 M
2799 2202 D
2796 2199 D
2793 2193 D
2790 2179 D
2790 2170 D
2793 2156 D
2796 2150 D
2799 2147 D
2805 2144 D
S
N
2811 2144 M
2816 2147 D
2819 2150 D
2822 2156 D
2825 2170 D
2825 2179 D
2822 2193 D
2819 2199 D
2816 2202 D
2811 2205 D
S
N
3201 2193 M
3207 2196 D
3215 2205 D
3215 2144 D
S
N
3213 2202 M
3213 2144 D
S
N
3201 2144 M
3227 2144 D
S
N
3267 2205 M
3259 2202 D
3253 2193 D
3250 2179 D
3250 2170 D
3253 2156 D
3259 2147 D
3267 2144 D
3273 2144 D
3282 2147 D
3288 2156 D
3290 2170 D
3290 2179 D
3288 2193 D
3282 2202 D
3273 2205 D
3267 2205 D
S
N
3267 2205 M
3262 2202 D
3259 2199 D
3256 2193 D
3253 2179 D
3253 2170 D
3256 2156 D
3259 2150 D
3262 2147 D
3267 2144 D
S
N
3273 2144 M
3279 2147 D
3282 2150 D
3285 2156 D
3288 2170 D
3288 2179 D
3285 2193 D
3282 2199 D
3279 2202 D
3273 2205 D
S
N
3325 2205 M
3316 2202 D
3311 2193 D
3308 2179 D
3308 2170 D
3311 2156 D
3316 2147 D
3325 2144 D
3331 2144 D
3340 2147 D
3345 2156 D
3348 2170 D
3348 2179 D
3345 2193 D
3340 2202 D
3331 2205 D
3325 2205 D
S
N
3325 2205 M
3319 2202 D
3316 2199 D
3314 2193 D
3311 2179 D
3311 2170 D
3314 2156 D
3316 2150 D
3319 2147 D
3325 2144 D
S
N
3331 2144 M
3337 2147 D
3340 2150 D
3342 2156 D
3345 2170 D
3345 2179 D
3342 2193 D
3340 2199 D
3337 2202 D
3331 2205 D
S
N
3687 2193 M
3689 2190 D
3687 2187 D
3684 2190 D
3684 2193 D
3687 2199 D
3689 2202 D
3698 2205 D
3710 2205 D
3718 2202 D
3721 2199 D
3724 2193 D
3724 2187 D
3721 2182 D
3713 2176 D
3698 2170 D
3692 2167 D
3687 2161 D
3684 2153 D
3684 2144 D
S
N
3710 2205 M
3715 2202 D
3718 2199 D
3721 2193 D
3721 2187 D
3718 2182 D
3710 2176 D
3698 2170 D
S
N
3684 2150 M
3687 2153 D
3692 2153 D
3707 2147 D
3715 2147 D
3721 2150 D
3724 2153 D
S
N
3692 2153 M
3707 2144 D
3718 2144 D
3721 2147 D
3724 2153 D
3724 2158 D
S
N
3759 2205 M
3750 2202 D
3744 2193 D
3741 2179 D
3741 2170 D
3744 2156 D
3750 2147 D
3759 2144 D
3764 2144 D
3773 2147 D
3779 2156 D
3782 2170 D
3782 2179 D
3779 2193 D
3773 2202 D
3764 2205 D
3759 2205 D
S
N
3759 2205 M
3753 2202 D
3750 2199 D
3747 2193 D
3744 2179 D
3744 2170 D
3747 2156 D
3750 2150 D
3753 2147 D
3759 2144 D
S
N
3764 2144 M
3770 2147 D
3773 2150 D
3776 2156 D
3779 2170 D
3779 2179 D
3776 2193 D
3773 2199 D
3770 2202 D
3764 2205 D
S
N
3816 2205 M
3808 2202 D
3802 2193 D
3799 2179 D
3799 2170 D
3802 2156 D
3808 2147 D
3816 2144 D
3822 2144 D
3831 2147 D
3837 2156 D
3840 2170 D
3840 2179 D
3837 2193 D
3831 2202 D
3822 2205 D
3816 2205 D
S
N
3816 2205 M
3811 2202 D
3808 2199 D
3805 2193 D
3802 2179 D
3802 2170 D
3805 2156 D
3808 2150 D
3811 2147 D
3816 2144 D
S
N
3822 2144 M
3828 2147 D
3831 2150 D
3834 2156 D
3837 2170 D
3837 2179 D
3834 2193 D
3831 2199 D
3828 2202 D
3822 2205 D
S
N
785 2262 M
785 4685 D
S
N
785 2262 M
888 2262 D
S
N
819 2343 M
785 2343 D
S
N
785 2423 M
819 2423 D
S
N
819 2504 M
785 2504 D
S
N
785 2585 M
819 2585 D
S
N
888 2666 M
785 2666 D
S
N
785 2746 M
819 2746 D
S
N
819 2827 M
785 2827 D
S
N
785 2908 M
819 2908 D
S
N
819 2989 M
785 2989 D
S
N
785 3069 M
888 3069 D
S
N
819 3150 M
785 3150 D
S
N
785 3231 M
819 3231 D
S
N
819 3312 M
785 3312 D
S
N
785 3393 M
819 3393 D
S
N
888 3473 M
785 3473 D
S
N
785 3554 M
819 3554 D
S
N
819 3635 M
785 3635 D
S
N
785 3716 M
819 3716 D
S
N
819 3796 M
785 3796 D
S
N
785 3877 M
888 3877 D
S
N
819 3958 M
785 3958 D
S
N
785 4039 M
819 4039 D
S
N
819 4119 M
785 4119 D
S
N
785 4200 M
819 4200 D
S
N
888 4281 M
785 4281 D
S
N
785 4362 M
819 4362 D
S
N
819 4443 M
785 4443 D
S
N
785 4523 M
819 4523 D
S
N
819 4604 M
785 4604 D
S
N
785 4685 M
888 4685 D
S
N
485 2253 M
537 2253 D
S
N
574 2288 M
565 2285 D
560 2276 D
557 2262 D
557 2253 D
560 2239 D
565 2230 D
574 2227 D
580 2227 D
589 2230 D
594 2239 D
597 2253 D
597 2262 D
594 2276 D
589 2285 D
580 2288 D
574 2288 D
S
N
574 2288 M
568 2285 D
565 2282 D
563 2276 D
560 2262 D
560 2253 D
563 2239 D
565 2233 D
568 2230 D
574 2227 D
S
N
580 2227 M
586 2230 D
589 2233 D
591 2239 D
594 2253 D
594 2262 D
591 2276 D
589 2282 D
586 2285 D
580 2288 D
S
N
620 2233 M
617 2230 D
620 2227 D
623 2230 D
620 2233 D
S
N
652 2276 M
658 2279 D
667 2288 D
667 2227 D
S
N
664 2285 M
664 2227 D
S
N
652 2227 M
678 2227 D
S
N
707 2288 M
701 2259 D
S
N
701 2259 M
707 2265 D
716 2268 D
724 2268 D
733 2265 D
739 2259 D
742 2250 D
742 2244 D
739 2236 D
733 2230 D
724 2227 D
716 2227 D
707 2230 D
704 2233 D
701 2239 D
701 2242 D
704 2244 D
707 2242 D
704 2239 D
S
N
724 2268 M
730 2265 D
736 2259 D
739 2250 D
739 2244 D
736 2236 D
730 2230 D
724 2227 D
S
N
707 2288 M
736 2288 D
S
N
707 2285 M
721 2285 D
736 2288 D
S
N
485 2657 M
537 2657 D
S
N
574 2692 M
565 2689 D
560 2680 D
557 2666 D
557 2657 D
560 2643 D
565 2634 D
574 2631 D
580 2631 D
589 2634 D
594 2643 D
597 2657 D
597 2666 D
594 2680 D
589 2689 D
580 2692 D
574 2692 D
S
N
574 2692 M
568 2689 D
565 2686 D
563 2680 D
560 2666 D
560 2657 D
563 2643 D
565 2637 D
568 2634 D
574 2631 D
S
N
580 2631 M
586 2634 D
589 2637 D
591 2643 D
594 2657 D
594 2666 D
591 2680 D
589 2686 D
586 2689 D
580 2692 D
S
N
620 2637 M
617 2634 D
620 2631 D
623 2634 D
620 2637 D
S
N
652 2680 M
658 2683 D
667 2692 D
667 2631 D
S
N
664 2689 M
664 2631 D
S
N
652 2631 M
678 2631 D
S
N
718 2692 M
710 2689 D
704 2680 D
701 2666 D
701 2657 D
704 2643 D
710 2634 D
718 2631 D
724 2631 D
733 2634 D
739 2643 D
742 2657 D
742 2666 D
739 2680 D
733 2689 D
724 2692 D
718 2692 D
S
N
718 2692 M
713 2689 D
710 2686 D
707 2680 D
704 2666 D
704 2657 D
707 2643 D
710 2637 D
713 2634 D
718 2631 D
S
N
724 2631 M
730 2634 D
733 2637 D
736 2643 D
739 2657 D
739 2666 D
736 2680 D
733 2686 D
730 2689 D
724 2692 D
S
N
485 3061 M
537 3061 D
S
N
574 3095 M
565 3093 D
560 3084 D
557 3069 D
557 3061 D
560 3046 D
565 3038 D
574 3035 D
580 3035 D
589 3038 D
594 3046 D
597 3061 D
597 3069 D
594 3084 D
589 3093 D
580 3095 D
574 3095 D
S
N
574 3095 M
568 3093 D
565 3090 D
563 3084 D
560 3069 D
560 3061 D
563 3046 D
565 3041 D
568 3038 D
574 3035 D
S
N
580 3035 M
586 3038 D
589 3041 D
591 3046 D
594 3061 D
594 3069 D
591 3084 D
589 3090 D
586 3093 D
580 3095 D
S
N
620 3041 M
617 3038 D
620 3035 D
623 3038 D
620 3041 D
S
N
661 3095 M
652 3093 D
646 3084 D
643 3069 D
643 3061 D
646 3046 D
652 3038 D
661 3035 D
667 3035 D
675 3038 D
681 3046 D
684 3061 D
684 3069 D
681 3084 D
675 3093 D
667 3095 D
661 3095 D
S
N
661 3095 M
655 3093 D
652 3090 D
649 3084 D
646 3069 D
646 3061 D
649 3046 D
652 3041 D
655 3038 D
661 3035 D
S
N
667 3035 M
672 3038 D
675 3041 D
678 3046 D
681 3061 D
681 3069 D
678 3084 D
675 3090 D
672 3093 D
667 3095 D
S
N
707 3095 M
701 3067 D
S
N
701 3067 M
707 3072 D
716 3075 D
724 3075 D
733 3072 D
739 3067 D
742 3058 D
742 3052 D
739 3043 D
733 3038 D
724 3035 D
716 3035 D
707 3038 D
704 3041 D
701 3046 D
701 3049 D
704 3052 D
707 3049 D
704 3046 D
S
N
724 3075 M
730 3072 D
736 3067 D
739 3058 D
739 3052 D
736 3043 D
730 3038 D
724 3035 D
S
N
707 3095 M
736 3095 D
S
N
707 3093 M
721 3093 D
736 3095 D
S
N
574 3499 M
565 3496 D
560 3488 D
557 3473 D
557 3465 D
560 3450 D
565 3442 D
574 3439 D
580 3439 D
589 3442 D
594 3450 D
597 3465 D
597 3473 D
594 3488 D
589 3496 D
580 3499 D
574 3499 D
S
N
574 3499 M
568 3496 D
565 3494 D
563 3488 D
560 3473 D
560 3465 D
563 3450 D
565 3444 D
568 3442 D
574 3439 D
S
N
580 3439 M
586 3442 D
589 3444 D
591 3450 D
594 3465 D
594 3473 D
591 3488 D
589 3494 D
586 3496 D
580 3499 D
S
N
620 3444 M
617 3442 D
620 3439 D
623 3442 D
620 3444 D
S
N
661 3499 M
652 3496 D
646 3488 D
643 3473 D
643 3465 D
646 3450 D
652 3442 D
661 3439 D
666 3439 D
675 3442 D
681 3450 D
684 3465 D
684 3473 D
681 3488 D
675 3496 D
666 3499 D
661 3499 D
S
N
661 3499 M
655 3496 D
652 3494 D
649 3488 D
646 3473 D
646 3465 D
649 3450 D
652 3444 D
655 3442 D
661 3439 D
S
N
666 3439 M
672 3442 D
675 3444 D
678 3450 D
681 3465 D
681 3473 D
678 3488 D
675 3494 D
672 3496 D
666 3499 D
S
N
718 3499 M
710 3496 D
704 3488 D
701 3473 D
701 3465 D
704 3450 D
710 3442 D
718 3439 D
724 3439 D
733 3442 D
739 3450 D
742 3465 D
742 3473 D
739 3488 D
733 3496 D
724 3499 D
718 3499 D
S
N
718 3499 M
713 3496 D
710 3494 D
707 3488 D
704 3473 D
704 3465 D
707 3450 D
710 3444 D
713 3442 D
718 3439 D
S
N
724 3439 M
730 3442 D
733 3444 D
736 3450 D
739 3465 D
739 3473 D
736 3488 D
733 3494 D
730 3496 D
724 3499 D
S
N
574 3903 M
565 3900 D
560 3892 D
557 3877 D
557 3868 D
560 3854 D
565 3845 D
574 3843 D
580 3843 D
589 3845 D
594 3854 D
597 3868 D
597 3877 D
594 3892 D
589 3900 D
580 3903 D
574 3903 D
S
N
574 3903 M
568 3900 D
565 3897 D
563 3892 D
560 3877 D
560 3868 D
563 3854 D
565 3848 D
568 3845 D
574 3843 D
S
N
580 3843 M
586 3845 D
589 3848 D
591 3854 D
594 3868 D
594 3877 D
591 3892 D
589 3897 D
586 3900 D
580 3903 D
S
N
620 3848 M
617 3845 D
620 3843 D
623 3845 D
620 3848 D
S
N
661 3903 M
652 3900 D
646 3892 D
643 3877 D
643 3868 D
646 3854 D
652 3845 D
661 3843 D
666 3843 D
675 3845 D
681 3854 D
684 3868 D
684 3877 D
681 3892 D
675 3900 D
666 3903 D
661 3903 D
S
N
661 3903 M
655 3900 D
652 3897 D
649 3892 D
646 3877 D
646 3868 D
649 3854 D
652 3848 D
655 3845 D
661 3843 D
S
N
666 3843 M
672 3845 D
675 3848 D
678 3854 D
681 3868 D
681 3877 D
678 3892 D
675 3897 D
672 3900 D
666 3903 D
S
N
707 3903 M
701 3874 D
S
N
701 3874 M
707 3880 D
716 3883 D
724 3883 D
733 3880 D
739 3874 D
742 3866 D
742 3860 D
739 3851 D
733 3845 D
724 3843 D
716 3843 D
707 3845 D
704 3848 D
701 3854 D
701 3857 D
704 3860 D
707 3857 D
704 3854 D
S
N
724 3883 M
730 3880 D
736 3874 D
739 3866 D
739 3860 D
736 3851 D
730 3845 D
724 3843 D
S
N
707 3903 M
736 3903 D
S
N
707 3900 M
721 3900 D
736 3903 D
S
N
574 4307 M
565 4304 D
560 4295 D
557 4281 D
557 4272 D
560 4258 D
565 4249 D
574 4246 D
580 4246 D
589 4249 D
594 4258 D
597 4272 D
597 4281 D
594 4295 D
589 4304 D
580 4307 D
574 4307 D
S
N
574 4307 M
568 4304 D
565 4301 D
563 4295 D
560 4281 D
560 4272 D
563 4258 D
565 4252 D
568 4249 D
574 4246 D
S
N
580 4246 M
586 4249 D
589 4252 D
591 4258 D
594 4272 D
594 4281 D
591 4295 D
589 4301 D
586 4304 D
580 4307 D
S
N
620 4252 M
617 4249 D
620 4246 D
623 4249 D
620 4252 D
S
N
652 4295 M
658 4298 D
666 4307 D
666 4246 D
S
N
664 4304 M
664 4246 D
S
N
652 4246 M
678 4246 D
S
N
718 4307 M
710 4304 D
704 4295 D
701 4281 D
701 4272 D
704 4258 D
710 4249 D
718 4246 D
724 4246 D
733 4249 D
739 4258 D
742 4272 D
742 4281 D
739 4295 D
733 4304 D
724 4307 D
718 4307 D
S
N
718 4307 M
713 4304 D
710 4301 D
707 4295 D
704 4281 D
704 4272 D
707 4258 D
710 4252 D
713 4249 D
718 4246 D
S
N
724 4246 M
730 4249 D
733 4252 D
736 4258 D
739 4272 D
739 4281 D
736 4295 D
733 4301 D
730 4304 D
724 4307 D
S
N
574 4711 M
565 4708 D
560 4699 D
557 4685 D
557 4676 D
560 4662 D
565 4653 D
574 4650 D
580 4650 D
589 4653 D
594 4662 D
597 4676 D
597 4685 D
594 4699 D
589 4708 D
580 4711 D
574 4711 D
S
N
574 4711 M
568 4708 D
565 4705 D
563 4699 D
560 4685 D
560 4676 D
563 4662 D
565 4656 D
568 4653 D
574 4650 D
S
N
580 4650 M
586 4653 D
589 4656 D
591 4662 D
594 4676 D
594 4685 D
591 4699 D
589 4705 D
586 4708 D
580 4711 D
S
N
620 4656 M
617 4653 D
620 4650 D
623 4653 D
620 4656 D
S
N
652 4699 M
658 4702 D
666 4711 D
666 4650 D
S
N
664 4708 M
664 4650 D
S
N
652 4650 M
678 4650 D
S
N
707 4711 M
701 4682 D
S
N
701 4682 M
707 4688 D
716 4691 D
724 4691 D
733 4688 D
739 4682 D
742 4673 D
742 4668 D
739 4659 D
733 4653 D
724 4650 D
716 4650 D
707 4653 D
704 4656 D
701 4662 D
701 4665 D
704 4668 D
707 4665 D
704 4662 D
S
N
724 4691 M
730 4688 D
736 4682 D
739 4673 D
739 4668 D
736 4659 D
730 4653 D
724 4650 D
S
N
707 4711 M
736 4711 D
S
N
707 4708 M
721 4708 D
736 4711 D
S
N
3762 2262 M
3762 4685 D
S
N
3658 2262 M
3762 2262 D
S
N
3762 2343 M
3727 2343 D
S
N
3727 2423 M
3762 2423 D
S
N
3762 2504 M
3727 2504 D
S
N
3727 2585 M
3762 2585 D
S
N
3762 2666 M
3658 2666 D
S
N
3727 2746 M
3762 2746 D
S
N
3762 2827 M
3727 2827 D
S
N
3727 2908 M
3762 2908 D
S
N
3762 2989 M
3727 2989 D
S
N
3658 3069 M
3762 3069 D
S
N
3762 3150 M
3727 3150 D
S
N
3727 3231 M
3762 3231 D
S
N
3762 3312 M
3727 3312 D
S
N
3727 3393 M
3762 3393 D
S
N
3762 3473 M
3658 3473 D
S
N
3727 3554 M
3762 3554 D
S
N
3762 3635 M
3727 3635 D
S
N
3727 3716 M
3762 3716 D
S
N
3762 3796 M
3727 3796 D
S
N
3658 3877 M
3762 3877 D
S
N
3762 3958 M
3727 3958 D
S
N
3727 4039 M
3762 4039 D
S
N
3762 4119 M
3727 4119 D
S
N
3727 4200 M
3762 4200 D
S
N
3762 4281 M
3658 4281 D
S
N
3727 4362 M
3762 4362 D
S
N
3762 4443 M
3727 4443 D
S
N
3727 4523 M
3762 4523 D
S
N
3762 4604 M
3727 4604 D
S
N
3658 4685 M
3762 4685 D
S
N
2082 2060 M
2082 1999 D
S
N
2085 2060 M
2085 1999 D
S
N
2085 2051 M
2091 2057 D
2097 2060 D
2102 2060 D
2111 2057 D
2117 2051 D
2120 2043 D
2120 2037 D
2117 2028 D
2111 2022 D
2102 2019 D
2097 2019 D
2091 2022 D
2085 2028 D
S
N
2102 2060 M
2108 2057 D
2114 2051 D
2117 2043 D
2117 2037 D
2114 2028 D
2108 2022 D
2102 2019 D
S
N
2074 2060 M
2085 2060 D
S
N
2074 1999 M
2094 1999 D
S
N
2150 2037 M
2150 1996 D
S
N
2151 2037 M
2151 1996 D
S
N
2138 2037 M
2136 2025 D
2136 2037 D
2165 2037 D
2165 2025 D
2163 2037 D
S
N
2144 1996 M
2157 1996 D
S
N
2251 2092 M
2245 2086 D
2239 2077 D
2233 2066 D
2230 2051 D
2230 2040 D
2233 2025 D
2239 2014 D
2245 2005 D
2251 1999 D
S
N
2245 2086 M
2239 2074 D
2236 2066 D
2233 2051 D
2233 2040 D
2236 2025 D
2239 2017 D
2245 2005 D
S
N
2308 2071 M
2311 2063 D
2311 2080 D
2308 2071 D
2303 2077 D
2294 2080 D
2288 2080 D
2280 2077 D
2274 2071 D
2271 2066 D
2268 2057 D
2268 2043 D
2271 2034 D
2274 2028 D
2280 2022 D
2288 2019 D
2294 2019 D
2303 2022 D
2308 2028 D
S
N
2288 2080 M
2282 2077 D
2277 2071 D
2274 2066 D
2271 2057 D
2271 2043 D
2274 2034 D
2277 2028 D
2282 2022 D
2288 2019 D
S
N
2308 2043 M
2308 2019 D
S
N
2311 2043 M
2311 2019 D
S
N
2300 2043 M
2320 2043 D
S
N
2337 2043 M
2372 2043 D
2372 2048 D
2369 2054 D
2366 2057 D
2360 2060 D
2352 2060 D
2343 2057 D
2337 2051 D
2334 2043 D
2334 2037 D
2337 2028 D
2343 2022 D
2352 2019 D
2357 2019 D
2366 2022 D
2372 2028 D
S
N
2369 2043 M
2369 2051 D
2366 2057 D
S
N
2352 2060 M
2346 2057 D
2340 2051 D
2337 2043 D
2337 2037 D
2340 2028 D
2346 2022 D
2352 2019 D
S
N
2389 2080 M
2409 2019 D
S
N
2392 2080 M
2409 2028 D
S
N
2430 2080 M
2409 2019 D
S
N
2383 2080 M
2401 2080 D
S
N
2418 2080 M
2435 2080 D
S
N
2447 2092 M
2453 2086 D
2459 2077 D
2464 2066 D
2467 2051 D
2467 2040 D
2464 2025 D
2459 2014 D
2453 2005 D
2447 1999 D
S
N
2453 2086 M
2459 2074 D
2461 2066 D
2464 2051 D
2464 2040 D
2461 2025 D
2459 2017 D
2453 2005 D
S
N
366 3124 M
372 3118 D
381 3113 D
392 3107 D
407 3104 D
418 3104 D
433 3107 D
444 3113 D
453 3118 D
459 3124 D
S
N
372 3118 M
384 3113 D
392 3110 D
407 3107 D
418 3107 D
433 3110 D
441 3113 D
453 3118 D
S
N
378 3142 M
438 3179 D
S
N
378 3144 M
438 3182 D
S
N
378 3182 M
438 3142 D
S
N
378 3136 M
378 3153 D
S
N
378 3170 M
378 3188 D
S
N
438 3136 M
438 3153 D
S
N
438 3170 M
438 3188 D
S
N
413 3248 M
413 3300 D
S
N
378 3367 M
438 3404 D
S
N
378 3370 M
438 3407 D
S
N
378 3407 M
438 3367 D
S
N
378 3361 M
378 3378 D
S
N
378 3396 M
378 3413 D
S
N
438 3361 M
438 3378 D
S
N
438 3396 M
438 3413 D
S
N
427 3452 M
433 3454 D
421 3454 D
427 3452 D
423 3449 D
421 3443 D
421 3439 D
423 3433 D
427 3429 D
431 3427 D
437 3426 D
446 3426 D
452 3427 D
456 3429 D
460 3433 D
462 3439 D
462 3443 D
460 3449 D
456 3452 D
452 3454 D
S
N
421 3439 M
423 3435 D
427 3431 D
431 3429 D
437 3427 D
446 3427 D
452 3429 D
456 3431 D
460 3435 D
462 3439 D
S
N
366 3473 M
372 3478 D
381 3484 D
392 3490 D
407 3493 D
418 3493 D
433 3490 D
444 3484 D
453 3478 D
459 3473 D
S
N
372 3478 M
384 3484 D
392 3487 D
407 3490 D
418 3490 D
433 3487 D
441 3484 D
453 3478 D
S
N
366 3562 M
459 3510 D
S
N
378 3577 M
438 3614 D
S
N
378 3580 M
438 3617 D
S
N
378 3617 M
438 3577 D
S
N
378 3571 M
378 3588 D
S
N
378 3606 M
378 3623 D
S
N
438 3571 M
438 3588 D
S
N
438 3606 M
438 3623 D
S
N
427 3662 M
433 3664 D
421 3664 D
427 3662 D
423 3658 D
421 3653 D
421 3649 D
423 3643 D
427 3639 D
431 3637 D
437 3635 D
446 3635 D
452 3637 D
456 3639 D
460 3643 D
462 3649 D
462 3653 D
460 3658 D
456 3662 D
452 3664 D
S
N
421 3649 M
423 3645 D
427 3641 D
431 3639 D
437 3637 D
446 3637 D
452 3639 D
456 3641 D
460 3645 D
462 3649 D
S
N
3834 3870 M
3834 3896 D
3824 3899 D
3834 3894 D
S
N
3834 3877 M
3798 3887 D
S
N
3798 3885 M
3834 3875 D
S
N
3798 3892 M
3798 3880 D
S
N
3834 3908 M
3834 3920 D
S
N
3834 3915 M
3798 3925 D
S
N
3798 3923 M
3834 3913 D
S
N
3834 3930 M
3834 3942 D
S
N
3834 3937 M
3798 3947 D
S
N
3798 3946 M
3834 3935 D
S
N
3815 3940 M
3815 3920 D
S
N
3798 3930 M
3798 3918 D
S
N
3798 3940 M
3798 3953 D
S
N
3826 3989 M
3829 3987 D
3832 3984 D
3834 3980 D
3834 3975 D
3832 3971 D
3831 3970 D
3826 3968 D
3820 3968 D
3813 3970 D
3808 3971 D
3803 3975 D
3800 3978 D
3798 3982 D
3800 3977 D
3803 3973 D
3808 3970 D
3813 3968 D
3820 3966 D
3826 3966 D
3831 3968 D
3832 3970 D
3834 3975 D
S
N
3798 3982 M
3798 3987 D
3800 3990 D
3801 3992 D
3801 3994 D
3798 3996 D
3808 3994 D
3805 3994 D
3801 3992 D
S
N
3834 4032 M
3834 4044 D
S
N
3834 4039 M
3798 4049 D
S
N
3798 4047 M
3834 4037 D
S
N
3834 4054 M
3834 4066 D
S
N
3834 4061 M
3798 4072 D
S
N
3798 4070 M
3834 4059 D
S
N
3815 4065 M
3815 4044 D
S
N
3798 4054 M
3798 4042 D
S
N
3798 4065 M
3798 4077 D
S
N
3834 4085 M
3834 4097 D
S
N
3834 4092 M
3798 4103 D
S
N
3798 4101 M
3834 4091 D
S
N
3798 4108 M
3798 4096 D
S
N
3822 4139 M
3822 4151 D
S
N
3822 4146 M
3829 4142 D
3832 4139 D
3834 4134 D
3832 4137 D
3829 4141 D
3822 4144 D
S
N
3834 4134 M
3834 4130 D
3832 4127 D
3831 4125 D
3826 4123 D
3820 4123 D
3813 4125 D
3808 4127 D
3803 4130 D
3800 4134 D
3798 4137 D
3800 4132 D
3803 4128 D
3808 4125 D
3813 4123 D
3820 4122 D
3826 4122 D
3831 4123 D
3832 4125 D
3834 4130 D
S
N
3798 4137 M
3798 4142 D
3800 4146 D
3801 4147 D
3801 4149 D
3798 4151 D
3808 4149 D
3805 4149 D
3801 4147 D
S
N
3822 4182 M
3822 4194 D
S
N
3822 4189 M
3829 4185 D
3832 4182 D
3834 4177 D
3832 4180 D
3829 4184 D
3822 4187 D
S
N
3834 4177 M
3834 4173 D
3832 4170 D
3831 4168 D
3826 4166 D
3820 4166 D
3813 4168 D
3808 4170 D
3803 4173 D
3800 4177 D
3798 4180 D
3800 4175 D
3803 4172 D
3808 4168 D
3813 4166 D
3820 4165 D
3826 4165 D
3831 4166 D
3832 4168 D
3834 4173 D
S
N
3798 4180 M
3798 4185 D
3800 4189 D
3801 4191 D
3801 4192 D
3798 4194 D
3808 4192 D
3805 4192 D
3801 4191 D
S
N
3834 4206 M
3831 4208 D
3831 4210 D
3832 4211 D
3834 4216 D
3834 4223 D
3832 4229 D
3831 4230 D
3827 4232 D
3822 4232 D
3819 4229 D
3812 4216 D
3810 4215 D
3807 4213 D
3810 4216 D
3817 4229 D
3819 4230 D
3822 4232 D
S
N
3807 4213 M
3803 4213 D
3800 4216 D
3798 4222 D
3798 4229 D
3800 4234 D
3801 4235 D
3801 4237 D
3798 4239 D
3808 4237 D
3805 4237 D
3801 4235 D
S
N
3831 4210 M
3827 4208 D
3824 4208 D
3834 4206 D
S
N
3834 4273 M
3834 4284 D
S
N
3834 4277 M
3798 4311 D
S
N
3798 4315 M
3798 4304 D
S
N
3798 4294 M
3798 4284 D
S
N
3798 4287 M
3834 4299 D
S
N
3834 4301 M
3798 4289 D
S
N
3834 4304 M
3834 4294 D
S
N
3834 4327 M
3831 4329 D
3831 4330 D
3832 4332 D
3834 4337 D
3834 4344 D
3832 4349 D
3831 4351 D
3827 4353 D
3822 4353 D
3819 4349 D
3812 4337 D
3810 4335 D
3807 4334 D
3810 4337 D
3817 4349 D
3819 4351 D
3822 4353 D
S
N
3807 4334 M
3803 4334 D
3800 4337 D
3798 4342 D
3798 4349 D
3800 4354 D
3801 4356 D
3801 4358 D
3798 4360 D
3808 4358 D
3805 4358 D
3801 4356 D
S
N
3831 4330 M
3827 4329 D
3824 4329 D
3834 4327 D
S
N
3831 4408 M
3798 4411 D
S
N
3798 4410 M
3834 4406 D
3798 4423 D
3834 4420 D
3798 4437 D
S
N
3798 4442 M
3798 4432 D
S
N
3798 4425 M
3831 4422 D
S
N
3798 4417 M
3798 4404 D
S
N
3822 4473 M
3822 4486 D
S
N
3822 4480 M
3829 4477 D
3832 4473 D
3834 4468 D
3832 4472 D
3829 4475 D
3822 4479 D
S
N
3834 4468 M
3834 4465 D
3832 4461 D
3831 4460 D
3826 4458 D
3820 4458 D
3813 4460 D
3808 4461 D
3803 4465 D
3800 4468 D
3798 4472 D
3800 4467 D
3803 4463 D
3808 4460 D
3813 4458 D
3820 4456 D
3826 4456 D
3831 4458 D
3832 4460 D
3834 4465 D
S
N
3798 4472 M
3798 4477 D
3800 4480 D
3801 4482 D
3801 4484 D
3798 4486 D
3808 4484 D
3805 4484 D
3801 4482 D
S
N
3834 4523 M
3827 4527 D
3824 4530 D
3820 4536 D
3813 4546 D
3810 4549 D
3807 4551 D
3803 4551 D
3800 4549 D
3798 4546 D
3800 4551 D
3803 4553 D
3807 4553 D
3810 4551 D
3813 4548 D
3817 4542 D
3820 4536 D
S
N
3831 4525 M
3829 4527 D
3829 4530 D
3834 4539 D
3834 4544 D
3832 4548 D
3827 4549 D
3831 4548 D
3832 4544 D
3832 4539 D
3829 4530 D
S
N
3805 4534 M
3807 4536 D
3808 4534 D
3807 4532 D
3805 4532 D
3801 4534 D
3800 4536 D
3798 4541 D
3798 4546 D
S
N
3826 4567 M
3831 4568 D
3832 4570 D
3834 4574 D
3831 4570 D
3826 4568 D
3820 4568 D
3813 4570 D
3808 4572 D
3803 4575 D
3800 4579 D
3798 4582 D
3798 4586 D
3801 4589 D
3807 4591 D
3812 4591 D
3819 4589 D
3824 4587 D
3829 4584 D
3832 4580 D
3834 4577 D
3834 4574 D
S
N
3834 4577 M
3832 4582 D
3829 4586 D
3824 4589 D
3819 4591 D
3812 4592 D
3807 4592 D
3801 4591 D
3800 4589 D
3798 4586 D
S
N
3798 4582 M
3800 4577 D
3803 4574 D
3808 4570 D
3813 4568 D
3820 4567 D
3826 4567 D
S
N
3834 4613 M
3805 4622 D
S
N
3803 4624 M
3807 4617 D
3808 4611 D
3807 4615 D
3803 4620 D
3798 4625 D
3834 4615 D
S
N
3834 4646 M
3805 4655 D
S
N
3803 4656 M
3807 4649 D
3808 4644 D
3807 4648 D
3803 4653 D
3798 4658 D
3834 4648 D
S
N
785 3473 M
3762 3473 D
S
1.00 0.00 0.00 setrgbcolor
N
2327 4635 M
2327 4590 D
S
N
2329 4635 M
2342 4596 D
S
N
2327 4635 M
2342 4590 D
S
N
2357 4635 M
2342 4590 D
S
N
2357 4635 M
2357 4590 D
S
N
2359 4635 M
2359 4590 D
S
N
2320 4635 M
2329 4635 D
S
N
2357 4635 M
2366 4635 D
S
N
2320 4590 M
2333 4590 D
S
N
2350 4590 M
2366 4590 D
S
N
2404 4629 M
2407 4635 D
2407 4622 D
2404 4629 D
2400 4633 D
2394 4635 D
2387 4635 D
2381 4633 D
2376 4629 D
2376 4624 D
2379 4620 D
2381 4618 D
2385 4616 D
2398 4611 D
2402 4609 D
2407 4605 D
S
N
2376 4624 M
2381 4620 D
2385 4618 D
2398 4613 D
2402 4611 D
2404 4609 D
2407 4605 D
2407 4596 D
2402 4592 D
2396 4590 D
2389 4590 D
2383 4592 D
2379 4596 D
2376 4603 D
2376 4590 D
2379 4596 D
S
N
2432 4635 M
2432 4590 D
S
N
2435 4635 M
2435 4590 D
S
N
2419 4635 M
2417 4622 D
2417 4635 D
2450 4635 D
2450 4622 D
2448 4635 D
S
N
2426 4590 M
2441 4590 D
S
N
2463 4635 M
2471 4590 D
S
N
2465 4635 M
2471 4601 D
S
N
2480 4635 M
2471 4590 D
S
N
2480 4635 M
2488 4590 D
S
N
2482 4635 M
2488 4601 D
S
N
2497 4635 M
2488 4590 D
S
N
2456 4635 M
2471 4635 D
S
N
2491 4635 M
2504 4635 D
S
N
2514 4626 M
2517 4624 D
2514 4622 D
2512 4624 D
2512 4626 D
2514 4631 D
2517 4633 D
2523 4635 D
2532 4635 D
2538 4633 D
2540 4631 D
2542 4626 D
2542 4622 D
2540 4618 D
2534 4613 D
2523 4609 D
2519 4607 D
2514 4603 D
2512 4596 D
2512 4590 D
S
N
2532 4635 M
2536 4633 D
2538 4631 D
2540 4626 D
2540 4622 D
2538 4618 D
2532 4613 D
2523 4609 D
S
N
2512 4594 M
2514 4596 D
2519 4596 D
2529 4592 D
2536 4592 D
2540 4594 D
2542 4596 D
S
N
2519 4596 M
2529 4590 D
2538 4590 D
2540 4592 D
2542 4596 D
2542 4601 D
S
N
2568 4635 M
2562 4633 D
2557 4626 D
2555 4616 D
2555 4609 D
2557 4598 D
2562 4592 D
2568 4590 D
2573 4590 D
2579 4592 D
2583 4598 D
2586 4609 D
2586 4616 D
2583 4626 D
2579 4633 D
2573 4635 D
2568 4635 D
S
N
2568 4635 M
2564 4633 D
2562 4631 D
2560 4626 D
2557 4616 D
2557 4609 D
2560 4598 D
2562 4594 D
2564 4592 D
2568 4590 D
S
N
2573 4590 M
2577 4592 D
2579 4594 D
2581 4598 D
2583 4609 D
2583 4616 D
2581 4626 D
2579 4631 D
2577 4633 D
2573 4635 D
S
N
2611 4635 M
2605 4633 D
2601 4626 D
2598 4616 D
2598 4609 D
2601 4598 D
2605 4592 D
2611 4590 D
2616 4590 D
2622 4592 D
2626 4598 D
2629 4609 D
2629 4616 D
2626 4626 D
2622 4633 D
2616 4635 D
2611 4635 D
S
N
2611 4635 M
2607 4633 D
2605 4631 D
2603 4626 D
2601 4616 D
2601 4609 D
2603 4598 D
2605 4594 D
2607 4592 D
2611 4590 D
S
N
2616 4590 M
2620 4592 D
2622 4594 D
2624 4598 D
2626 4609 D
2626 4616 D
2624 4626 D
2622 4631 D
2620 4633 D
2616 4635 D
S
N
2652 4635 M
2646 4633 D
2644 4629 D
2644 4622 D
2646 4618 D
2652 4616 D
2661 4616 D
2667 4618 D
2670 4622 D
2670 4629 D
2667 4633 D
2661 4635 D
2652 4635 D
S
N
2652 4635 M
2648 4633 D
2646 4629 D
2646 4622 D
2648 4618 D
2652 4616 D
S
N
2661 4616 M
2665 4618 D
2667 4622 D
2667 4629 D
2665 4633 D
2661 4635 D
S
N
2652 4616 M
2646 4613 D
2644 4611 D
2642 4607 D
2642 4598 D
2644 4594 D
2646 4592 D
2652 4590 D
2661 4590 D
2667 4592 D
2670 4594 D
2672 4598 D
2672 4607 D
2670 4611 D
2667 4613 D
2661 4616 D
S
N
2652 4616 M
2648 4613 D
2646 4611 D
2644 4607 D
2644 4598 D
2646 4594 D
2648 4592 D
2652 4590 D
S
N
2661 4590 M
2665 4592 D
2667 4594 D
2670 4598 D
2670 4607 D
2667 4611 D
2665 4613 D
2661 4616 D
S
N
2724 4635 M
2724 4590 D
S
N
2726 4635 M
2752 4594 D
S
N
2726 4631 M
2752 4590 D
S
N
2752 4635 M
2752 4590 D
S
N
2717 4635 M
2726 4635 D
S
N
2745 4635 M
2758 4635 D
S
N
2717 4590 M
2730 4590 D
S
N
2773 4635 M
2773 4590 D
S
N
2775 4635 M
2801 4594 D
S
N
2775 4631 M
2801 4590 D
S
N
2801 4635 M
2801 4590 D
S
N
2767 4635 M
2775 4635 D
S
N
2795 4635 M
2808 4635 D
S
N
2767 4590 M
2780 4590 D
S
N
2823 4635 M
2823 4590 D
S
N
2825 4635 M
2825 4590 D
S
N
2816 4635 M
2831 4635 D
S
N
2816 4590 M
2849 4590 D
2849 4603 D
2846 4590 D
S
N
2872 4635 M
2866 4633 D
2862 4629 D
2859 4624 D
2857 4616 D
2857 4609 D
2859 4601 D
2862 4596 D
2866 4592 D
2872 4590 D
2877 4590 D
2883 4592 D
2887 4596 D
2890 4601 D
2892 4609 D
2892 4616 D
2890 4624 D
2887 4629 D
2883 4633 D
2877 4635 D
2872 4635 D
S
N
2872 4635 M
2868 4633 D
2864 4629 D
2862 4624 D
2859 4616 D
2859 4609 D
2862 4601 D
2864 4596 D
2868 4592 D
2872 4590 D
S
N
2877 4590 M
2881 4592 D
2885 4596 D
2887 4601 D
2890 4609 D
2890 4616 D
2887 4624 D
2885 4629 D
2881 4633 D
2877 4635 D
S
N
1925 4644 M
2164 4644 D
2164 4564 D
1925 4564 D
1925 4644 D
S
N
1972 4564 M
1925 4610 D
S
N
2057 4564 M
1976 4644 D
S
N
2142 4564 M
2061 4644 D
S
N
2164 4626 M
2146 4644 D
S
N
2164 4621 M
2107 4564 D
S
N
2103 4644 M
2022 4564 D
S
N
2018 4644 M
1937 4564 D
S
N
1933 4644 M
1925 4637 D
S
0.00 0.00 1.00 setrgbcolor
N
2327 4510 M
2327 4465 D
S
N
2329 4510 M
2355 4469 D
S
N
2329 4506 M
2355 4465 D
S
N
2355 4510 M
2355 4465 D
S
N
2320 4510 M
2329 4510 D
S
N
2348 4510 M
2361 4510 D
S
N
2320 4465 M
2333 4465 D
S
N
2376 4510 M
2376 4465 D
S
N
2379 4510 M
2404 4469 D
S
N
2379 4506 M
2404 4465 D
S
N
2404 4510 M
2404 4465 D
S
N
2370 4510 M
2379 4510 D
S
N
2398 4510 M
2411 4510 D
S
N
2370 4465 M
2383 4465 D
S
N
2426 4510 M
2426 4465 D
S
N
2428 4510 M
2428 4465 D
S
N
2419 4510 M
2445 4510 D
2452 4508 D
2454 4506 D
2456 4502 D
2456 4495 D
2454 4491 D
2452 4489 D
2445 4487 D
2428 4487 D
S
N
2445 4510 M
2450 4508 D
2452 4506 D
2454 4502 D
2454 4495 D
2452 4491 D
2450 4489 D
2445 4487 D
S
N
2419 4465 M
2435 4465 D
S
N
2473 4510 M
2473 4465 D
S
N
2476 4510 M
2476 4465 D
S
N
2467 4510 M
2488 4510 D
2495 4508 D
2499 4504 D
2501 4500 D
2504 4493 D
2504 4482 D
2501 4476 D
2499 4472 D
2495 4467 D
2488 4465 D
2467 4465 D
S
N
2488 4510 M
2493 4508 D
2497 4504 D
2499 4500 D
2501 4493 D
2501 4482 D
2499 4476 D
2497 4472 D
2493 4467 D
2488 4465 D
S
N
2521 4510 M
2521 4465 D
S
N
2523 4510 M
2523 4465 D
S
N
2536 4497 M
2536 4480 D
S
N
2514 4510 M
2549 4510 D
2549 4497 D
2547 4510 D
S
N
2523 4489 M
2536 4489 D
S
N
2514 4465 M
2529 4465 D
S
N
2562 4502 M
2564 4500 D
2562 4497 D
2560 4500 D
2560 4502 D
2562 4506 D
2564 4508 D
2570 4510 D
2579 4510 D
2586 4508 D
2588 4506 D
2590 4502 D
2590 4497 D
2588 4493 D
2581 4489 D
2570 4485 D
2566 4482 D
2562 4478 D
2560 4472 D
2560 4465 D
S
N
2579 4510 M
2583 4508 D
2586 4506 D
2588 4502 D
2588 4497 D
2586 4493 D
2579 4489 D
2570 4485 D
S
N
2560 4469 M
2562 4472 D
2566 4472 D
2577 4467 D
2583 4467 D
2588 4469 D
2590 4472 D
S
N
2566 4472 M
2577 4465 D
2586 4465 D
2588 4467 D
2590 4472 D
2590 4476 D
S
N
2607 4469 M
2605 4467 D
2607 4465 D
2609 4467 D
2607 4469 D
S
N
2631 4502 M
2635 4504 D
2642 4510 D
2642 4465 D
S
N
2639 4508 M
2639 4465 D
S
N
2631 4465 M
2650 4465 D
S
N
2706 4510 M
2706 4465 D
S
N
2708 4510 M
2734 4469 D
S
N
2708 4506 M
2734 4465 D
S
N
2734 4510 M
2734 4465 D
S
N
2700 4510 M
2708 4510 D
S
N
2728 4510 M
2741 4510 D
S
N
2700 4465 M
2713 4465 D
S
N
2756 4510 M
2756 4465 D
S
N
2758 4510 M
2784 4469 D
S
N
2758 4506 M
2784 4465 D
S
N
2784 4510 M
2784 4465 D
S
N
2749 4510 M
2758 4510 D
S
N
2777 4510 M
2790 4510 D
S
N
2749 4465 M
2762 4465 D
S
N
2805 4510 M
2805 4465 D
S
N
2808 4510 M
2808 4465 D
S
N
2799 4510 M
2814 4510 D
S
N
2799 4465 M
2831 4465 D
2831 4478 D
2829 4465 D
S
N
2855 4510 M
2849 4508 D
2844 4504 D
2842 4500 D
2840 4491 D
2840 4485 D
2842 4476 D
2844 4472 D
2849 4467 D
2855 4465 D
2859 4465 D
2866 4467 D
2870 4472 D
2872 4476 D
2874 4485 D
2874 4491 D
2872 4500 D
2870 4504 D
2866 4508 D
2859 4510 D
2855 4510 D
S
N
2855 4510 M
2851 4508 D
2846 4504 D
2844 4500 D
2842 4491 D
2842 4485 D
2844 4476 D
2846 4472 D
2851 4467 D
2855 4465 D
S
N
2859 4465 M
2864 4467 D
2868 4472 D
2870 4476 D
2872 4485 D
2872 4491 D
2870 4500 D
2868 4504 D
2864 4508 D
2859 4510 D
S
[39] 0 Sd
N
1925 4523 M
2164 4523 D
2164 4443 D
1925 4443 D
1925 4523 D
S
N
2009 4443 M
1928 4523 D
S
N
2093 4443 M
2013 4523 D
S
N
2164 4457 M
2097 4523 D
S
N
2164 4451 M
2155 4443 D
S
N
2151 4523 M
2070 4443 D
S
N
2066 4523 M
1986 4443 D
S
N
1982 4523 M
1925 4467 D
S
1.00 0.00 1.00 setrgbcolor
[] 0 Sd
N
2338 4386 M
2338 4349 D
2335 4343 D
2331 4341 D
2327 4341 D
2322 4343 D
2320 4347 D
2320 4351 D
2322 4353 D
2325 4351 D
2322 4349 D
S
N
2335 4386 M
2335 4349 D
2333 4343 D
2331 4341 D
S
N
2329 4386 M
2344 4386 D
S
N
2359 4386 M
2359 4341 D
S
N
2361 4386 M
2361 4341 D
S
N
2353 4386 M
2379 4386 D
2385 4384 D
2387 4381 D
2389 4377 D
2389 4373 D
2387 4369 D
2385 4366 D
2379 4364 D
2361 4364 D
S
N
2379 4386 M
2383 4384 D
2385 4381 D
2387 4377 D
2387 4373 D
2385 4369 D
2383 4366 D
2379 4364 D
S
N
2353 4341 M
2368 4341 D
S
N
2372 4364 M
2376 4362 D
2379 4360 D
2385 4345 D
2387 4343 D
2389 4343 D
2391 4345 D
S
N
2376 4362 M
2379 4358 D
2383 4343 D
2385 4341 D
2389 4341 D
2391 4345 D
2391 4347 D
S
N
2415 4386 M
2409 4384 D
2404 4377 D
2402 4366 D
2402 4360 D
2404 4349 D
2409 4343 D
2415 4341 D
2419 4341 D
2426 4343 D
2430 4349 D
2432 4360 D
2432 4366 D
2430 4377 D
2426 4384 D
2419 4386 D
2415 4386 D
S
N
2415 4386 M
2411 4384 D
2409 4381 D
2407 4377 D
2404 4366 D
2404 4360 D
2407 4349 D
2409 4345 D
2411 4343 D
2415 4341 D
S
N
2419 4341 M
2424 4343 D
2426 4345 D
2428 4349 D
2430 4360 D
2430 4366 D
2428 4377 D
2426 4381 D
2424 4384 D
2419 4386 D
S
N
2473 4371 M
2471 4364 D
2467 4360 D
2460 4358 D
2458 4358 D
2452 4360 D
2448 4364 D
2445 4371 D
2445 4373 D
2448 4379 D
2452 4384 D
2458 4386 D
2463 4386 D
2469 4384 D
2473 4379 D
2476 4373 D
2476 4360 D
2473 4351 D
2471 4347 D
2467 4343 D
2460 4341 D
2454 4341 D
2450 4343 D
2448 4347 D
2448 4349 D
2450 4351 D
2452 4349 D
2450 4347 D
S
N
2458 4358 M
2454 4360 D
2450 4364 D
2448 4371 D
2448 4373 D
2450 4379 D
2454 4384 D
2458 4386 D
S
N
2463 4386 M
2467 4384 D
2471 4379 D
2473 4373 D
2473 4360 D
2471 4351 D
2469 4347 D
2465 4343 D
2460 4341 D
S
N
2488 4386 M
2504 4341 D
S
N
2491 4386 M
2504 4347 D
S
N
2519 4386 M
2504 4341 D
S
N
2484 4386 M
2497 4386 D
S
N
2510 4386 M
2523 4386 D
S
N
2536 4386 M
2536 4341 D
S
N
2538 4386 M
2538 4341 D
S
N
2551 4373 M
2551 4356 D
S
N
2529 4386 M
2564 4386 D
2564 4373 D
2562 4386 D
S
N
2538 4364 M
2551 4364 D
S
N
2529 4341 M
2545 4341 D
S
N
2614 4386 M
2614 4341 D
S
N
2616 4386 M
2642 4345 D
S
N
2616 4381 M
2642 4341 D
S
N
2642 4386 M
2642 4341 D
S
N
2607 4386 M
2616 4386 D
S
N
2635 4386 M
2648 4386 D
S
N
2607 4341 M
2620 4341 D
S
N
2663 4386 M
2663 4341 D
S
N
2665 4386 M
2691 4345 D
S
N
2665 4381 M
2691 4341 D
S
N
2691 4386 M
2691 4341 D
S
N
2657 4386 M
2665 4386 D
S
N
2685 4386 M
2698 4386 D
S
N
2657 4341 M
2670 4341 D
S
N
2713 4386 M
2713 4341 D
S
N
2715 4386 M
2715 4341 D
S
N
2706 4386 M
2721 4386 D
S
N
2706 4341 M
2739 4341 D
2739 4353 D
2736 4341 D
S
N
2762 4386 M
2756 4384 D
2752 4379 D
2749 4375 D
2747 4366 D
2747 4360 D
2749 4351 D
2752 4347 D
2756 4343 D
2762 4341 D
2767 4341 D
2773 4343 D
2777 4347 D
2780 4351 D
2782 4360 D
2782 4366 D
2780 4375 D
2777 4379 D
2773 4384 D
2767 4386 D
2762 4386 D
S
N
2762 4386 M
2758 4384 D
2754 4379 D
2752 4375 D
2749 4366 D
2749 4360 D
2752 4351 D
2754 4347 D
2758 4343 D
2762 4341 D
S
N
2767 4341 M
2771 4343 D
2775 4347 D
2777 4351 D
2780 4360 D
2780 4366 D
2777 4375 D
2775 4379 D
2771 4384 D
2767 4386 D
S
[6 30] 0 Sd
N
1925 4402 M
2164 4402 D
2164 4321 D
1925 4321 D
1925 4402 D
S
N
1960 4321 M
1925 4356 D
S
N
2045 4321 M
1964 4402 D
S
N
2130 4321 M
2049 4402 D
S
N
2164 4372 M
2134 4402 D
S
N
2164 4366 M
2119 4321 D
S
N
2115 4402 M
2034 4321 D
S
N
2030 4402 M
1949 4321 D
S
N
1945 4402 M
1925 4382 D
S
0.00 1.00 0.00 setrgbcolor
[] 0 Sd
N
2338 4261 M
2322 4216 D
S
N
2338 4261 M
2353 4216 D
S
N
2338 4255 M
2350 4216 D
S
N
2327 4229 M
2346 4229 D
S
N
2318 4216 M
2331 4216 D
S
N
2344 4216 M
2357 4216 D
S
N
2370 4261 M
2370 4216 D
S
N
2372 4261 M
2372 4216 D
S
N
2363 4261 M
2389 4261 D
2396 4259 D
2398 4257 D
2400 4253 D
2400 4248 D
2398 4244 D
2396 4242 D
2389 4240 D
S
N
2389 4261 M
2394 4259 D
2396 4257 D
2398 4253 D
2398 4248 D
2396 4244 D
2394 4242 D
2389 4240 D
S
N
2372 4240 M
2389 4240 D
2396 4237 D
2398 4235 D
2400 4231 D
2400 4225 D
2398 4220 D
2396 4218 D
2389 4216 D
2363 4216 D
S
N
2389 4240 M
2394 4237 D
2396 4235 D
2398 4231 D
2398 4225 D
2396 4220 D
2394 4218 D
2389 4216 D
S
N
2417 4261 M
2417 4216 D
S
N
2419 4261 M
2419 4216 D
S
N
2448 4261 M
2419 4233 D
S
N
2430 4242 M
2448 4216 D
S
N
2428 4242 M
2445 4216 D
S
N
2411 4261 M
2426 4261 D
S
N
2439 4261 M
2452 4261 D
S
N
2411 4216 M
2426 4216 D
S
N
2439 4216 M
2452 4216 D
S
N
2465 4261 M
2465 4216 D
S
N
2467 4261 M
2480 4222 D
S
N
2465 4261 M
2480 4216 D
S
N
2495 4261 M
2480 4216 D
S
N
2495 4261 M
2495 4216 D
S
N
2497 4261 M
2497 4216 D
S
N
2458 4261 M
2467 4261 D
S
N
2495 4261 M
2504 4261 D
S
N
2458 4216 M
2471 4216 D
S
N
2488 4216 M
2504 4216 D
S
N
2527 4261 M
2521 4259 D
2517 4253 D
2514 4242 D
2514 4235 D
2517 4225 D
2521 4218 D
2527 4216 D
2532 4216 D
2538 4218 D
2542 4225 D
2545 4235 D
2545 4242 D
2542 4253 D
2538 4259 D
2532 4261 D
2527 4261 D
S
N
2527 4261 M
2523 4259 D
2521 4257 D
2519 4253 D
2517 4242 D
2517 4235 D
2519 4225 D
2521 4220 D
2523 4218 D
2527 4216 D
S
N
2532 4216 M
2536 4218 D
2538 4220 D
2540 4225 D
2542 4235 D
2542 4242 D
2540 4253 D
2538 4257 D
2536 4259 D
2532 4261 D
S
N
2586 4246 M
2583 4240 D
2579 4235 D
2573 4233 D
2570 4233 D
2564 4235 D
2560 4240 D
2557 4246 D
2557 4248 D
2560 4255 D
2564 4259 D
2570 4261 D
2575 4261 D
2581 4259 D
2586 4255 D
2588 4248 D
2588 4235 D
2586 4227 D
2583 4222 D
2579 4218 D
2573 4216 D
2566 4216 D
2562 4218 D
2560 4222 D
2560 4225 D
2562 4227 D
2564 4225 D
2562 4222 D
S
N
2570 4233 M
2566 4235 D
2562 4240 D
2560 4246 D
2560 4248 D
2562 4255 D
2566 4259 D
2570 4261 D
S
N
2575 4261 M
2579 4259 D
2583 4255 D
2586 4248 D
2586 4235 D
2583 4227 D
2581 4222 D
2577 4218 D
2573 4216 D
S
N
2601 4231 M
2618 4242 D
2635 4231 D
S
N
2601 4231 M
2618 4240 D
2635 4231 D
S
N
2652 4261 M
2648 4240 D
S
N
2648 4240 M
2652 4244 D
2659 4246 D
2665 4246 D
2672 4244 D
2676 4240 D
2678 4233 D
2678 4229 D
2676 4222 D
2672 4218 D
2665 4216 D
2659 4216 D
2652 4218 D
2650 4220 D
2648 4225 D
2648 4227 D
2650 4229 D
2652 4227 D
2650 4225 D
S
N
2665 4246 M
2670 4244 D
2674 4240 D
2676 4233 D
2676 4229 D
2674 4222 D
2670 4218 D
2665 4216 D
S
N
2652 4261 M
2674 4261 D
S
N
2652 4259 M
2663 4259 D
2674 4261 D
S
N
2730 4261 M
2730 4216 D
S
N
2732 4261 M
2758 4220 D
S
N
2732 4257 M
2758 4216 D
S
N
2758 4261 M
2758 4216 D
S
N
2724 4261 M
2732 4261 D
S
N
2752 4261 M
2764 4261 D
S
N
2724 4216 M
2736 4216 D
S
N
2780 4261 M
2780 4216 D
S
N
2782 4261 M
2808 4220 D
S
N
2782 4257 M
2808 4216 D
S
N
2808 4261 M
2808 4216 D
S
N
2773 4261 M
2782 4261 D
S
N
2801 4261 M
2814 4261 D
S
N
2773 4216 M
2786 4216 D
S
N
2829 4261 M
2829 4216 D
S
N
2831 4261 M
2831 4216 D
S
N
2823 4261 M
2838 4261 D
S
N
2823 4216 M
2855 4216 D
2855 4229 D
2853 4216 D
S
N
2879 4261 M
2872 4259 D
2868 4255 D
2866 4250 D
2864 4242 D
2864 4235 D
2866 4227 D
2868 4222 D
2872 4218 D
2879 4216 D
2883 4216 D
2890 4218 D
2894 4222 D
2896 4227 D
2898 4235 D
2898 4242 D
2896 4250 D
2894 4255 D
2890 4259 D
2883 4261 D
2879 4261 D
S
N
2879 4261 M
2874 4259 D
2870 4255 D
2868 4250 D
2866 4242 D
2866 4235 D
2868 4227 D
2870 4222 D
2874 4218 D
2879 4216 D
S
N
2883 4216 M
2887 4218 D
2892 4222 D
2894 4227 D
2896 4235 D
2896 4242 D
2894 4250 D
2892 4255 D
2887 4259 D
2883 4261 D
S
[30 30 6 30] 0 Sd
N
1925 4281 M
2164 4281 D
2164 4200 D
1925 4200 D
1925 4281 D
S
N
1996 4200 M
1925 4271 D
S
N
2081 4200 M
2000 4281 D
S
N
2164 4202 M
2085 4281 D
S
N
2164 4281 M
2083 4200 D
S
N
2079 4281 M
1998 4200 D
S
N
1994 4281 M
1925 4213 D
S
1.00 0.00 0.00 setrgbcolor
[] 0 Sd
785 3618 P
N
785 3618 M
1147 3554 D
1385 3543 D
1563 3534 D
1706 3527 D
1824 3522 D
1925 3518 D
2014 3515 D
2093 3513 D
2213 3513 D
2355 3516 D
2474 3521 D
2575 3526 D
2664 3533 D
2743 3539 D
2846 3548 D
2965 3560 D
3066 3572 D
3155 3583 D
3234 3594 D
3338 3609 D
3456 3629 D
3558 3647 D
3646 3663 D
3758 3676 D
3758 3271 D
3646 3284 D
3558 3299 D
3456 3317 D
3338 3338 D
3234 3353 D
3155 3364 D
3066 3375 D
2965 3387 D
2846 3399 D
2743 3408 D
2664 3414 D
2575 3420 D
2474 3426 D
2355 3431 D
2213 3434 D
2093 3433 D
2014 3432 D
1925 3429 D
1824 3425 D
1706 3419 D
1563 3412 D
1385 3404 D
1147 3393 D
785 3328 D
785 3328 D
S
N
825 3335 M
785 3375 D
S
N
897 3348 M
785 3460 D
S
N
969 3361 M
785 3545 D
S
N
1041 3374 M
799 3616 D
S
N
1113 3387 M
902 3598 D
S
N
1190 3395 M
1005 3579 D
S
N
1271 3398 M
1108 3561 D
S
N
1352 3402 M
1203 3551 D
S
N
1433 3406 M
1292 3547 D
S
N
1514 3410 M
1380 3543 D
S
N
1595 3414 M
1470 3539 D
S
N
1676 3418 M
1559 3535 D
S
N
1757 3422 M
1648 3530 D
S
N
1838 3425 M
1737 3526 D
S
N
1919 3429 M
1826 3522 D
S
N
2002 3431 M
1915 3518 D
S
N
2085 3433 M
2002 3515 D
S
N
2169 3433 M
2089 3513 D
S
N
2255 3433 M
2174 3513 D
S
N
2341 3431 M
2258 3514 D
S
N
2429 3428 M
2342 3515 D
S
N
2519 3423 M
2423 3519 D
S
N
2609 3418 M
2504 3522 D
S
N
2700 3411 M
2585 3527 D
S
N
2793 3403 M
2664 3533 D
S
N
2887 3395 M
2743 3539 D
S
N
2981 3385 M
2821 3546 D
S
N
3077 3374 M
2898 3553 D
S
N
3175 3361 M
2975 3561 D
S
N
3274 3347 M
3051 3570 D
S
N
3374 3331 M
3126 3579 D
S
N
3477 3314 M
3201 3589 D
S
N
3580 3296 M
3275 3600 D
S
N
3680 3280 M
3349 3611 D
S
N
3758 3287 M
3422 3623 D
S
N
3758 3372 M
3494 3636 D
S
N
3758 3457 M
3566 3649 D
S
N
3758 3542 M
3638 3661 D
S
N
3758 3626 M
3714 3671 D
S
N
3758 3330 M
3705 3277 D
S
N
3758 3415 M
3630 3287 D
S
N
3758 3500 M
3558 3299 D
S
N
3758 3584 M
3486 3312 D
S
N
3758 3669 M
3413 3325 D
S
N
3669 3665 M
3341 3337 D
S
N
3568 3649 M
3267 3348 D
S
N
3465 3631 M
3193 3358 D
S
N
3363 3613 M
3118 3368 D
S
N
3263 3598 M
3042 3378 D
S
N
3164 3584 M
2966 3387 D
S
N
3066 3572 M
2889 3394 D
S
N
2970 3561 M
2812 3402 D
S
N
2876 3551 M
2734 3409 D
S
N
2782 3542 M
2655 3415 D
S
N
2690 3535 M
2575 3420 D
S
N
2599 3528 M
2495 3425 D
S
N
2508 3523 M
2414 3428 D
S
N
2419 3518 M
2332 3431 D
S
N
2331 3515 M
2249 3433 D
S
N
2245 3514 M
2165 3433 D
S
N
2159 3513 M
2079 3433 D
S
N
2075 3514 M
1992 3431 D
S
N
1992 3516 M
1905 3428 D
S
N
1910 3518 M
1816 3424 D
S
N
1828 3522 M
1727 3420 D
S
N
1747 3525 M
1638 3416 D
S
N
1666 3529 M
1549 3412 D
S
N
1585 3533 M
1459 3407 D
S
N
1505 3537 M
1370 3403 D
S
N
1424 3541 M
1281 3399 D
S
N
1343 3545 M
1192 3395 D
S
N
1261 3549 M
1097 3384 D
S
N
1180 3552 M
993 3365 D
S
N
1105 3561 M
890 3347 D
S
N
1033 3574 M
787 3329 D
S
N
961 3587 M
785 3411 D
S
N
888 3600 M
785 3496 D
S
N
816 3613 M
785 3581 D
S
0.00 0.00 1.00 setrgbcolor
785 3215 P
[39] 0 Sd
N
785 3215 M
1147 3260 D
1385 3347 D
1563 3415 D
1706 3466 D
1824 3504 D
1925 3534 D
2014 3557 D
2093 3575 D
2213 3598 D
2355 3621 D
2474 3635 D
2575 3645 D
2664 3651 D
2743 3655 D
2846 3659 D
2965 3659 D
3066 3657 D
3155 3654 D
3234 3650 D
3338 3643 D
3456 3637 D
3558 3630 D
3646 3626 D
3758 3623 D
3758 3191 D
3646 3229 D
3558 3273 D
3456 3322 D
3338 3375 D
3234 3418 D
3155 3447 D
3066 3474 D
2965 3500 D
2846 3524 D
2743 3538 D
2664 3544 D
2575 3547 D
2474 3544 D
2355 3533 D
2213 3509 D
2093 3480 D
2014 3457 D
1925 3427 D
1824 3390 D
1706 3342 D
1563 3281 D
1385 3204 D
1147 3111 D
785 2956 D
785 2956 D
S
N
840 2980 M
785 3036 D
S
N
900 3005 M
785 3121 D
S
N
959 3031 M
785 3206 D
S
N
1019 3056 M
852 3224 D
S
N
1078 3082 M
927 3233 D
S
N
1138 3107 M
1003 3242 D
S
N
1199 3131 M
1078 3251 D
S
N
1260 3155 M
1153 3262 D
S
N
1321 3179 M
1215 3285 D
S
N
1382 3203 M
1277 3308 D
S
N
1441 3228 M
1339 3330 D
S
N
1500 3254 M
1401 3353 D
S
N
1560 3279 M
1462 3376 D
S
N
1619 3305 M
1524 3400 D
S
N
1678 3330 M
1586 3423 D
S
N
1738 3355 M
1648 3445 D
S
N
1799 3379 M
1711 3467 D
S
N
1860 3403 M
1775 3488 D
S
N
1922 3426 M
1839 3509 D
S
N
1986 3447 M
1905 3528 D
S
N
2050 3467 M
1972 3546 D
S
N
2117 3486 M
2040 3563 D
S
N
2185 3502 M
2109 3578 D
S
N
2256 3516 M
2180 3592 D
S
N
2328 3529 M
2253 3605 D
S
N
2404 3538 M
2326 3616 D
S
N
2482 3545 M
2401 3626 D
S
N
2565 3547 M
2476 3635 D
S
N
2652 3544 M
2554 3643 D
S
N
2744 3537 M
2632 3649 D
S
N
2842 3524 M
2712 3654 D
S
N
2947 3504 M
2794 3657 D
S
N
3060 3476 M
2877 3659 D
S
N
3185 3436 M
2962 3659 D
S
N
3325 3381 M
3048 3658 D
S
N
3480 3310 M
3136 3655 D
S
N
3646 3229 M
3225 3651 D
S
N
3758 3202 M
3315 3645 D
S
N
3758 3287 M
3406 3639 D
S
N
3758 3372 M
3496 3634 D
S
N
3758 3457 M
3586 3629 D
S
N
3758 3542 M
3674 3625 D
S
N
3758 3245 M
3718 3205 D
S
N
3758 3330 M
3654 3226 D
S
N
3758 3415 M
3597 3253 D
S
N
3758 3500 M
3540 3281 D
S
N
3758 3584 M
3483 3309 D
S
N
3713 3624 M
3425 3336 D
S
N
3631 3627 M
3366 3363 D
S
N
3550 3631 M
3307 3388 D
S
N
3470 3636 M
3247 3413 D
S
N
3390 3640 M
3185 3436 D
S
N
3310 3645 M
3121 3457 D
S
N
3230 3651 M
3056 3477 D
S
N
3149 3654 M
2989 3494 D
S
N
3067 3657 M
2919 3509 D
S
N
2984 3659 M
2848 3523 D
S
N
2899 3659 M
2774 3533 D
S
N
2813 3657 M
2697 3541 D
S
N
2725 3654 M
2616 3546 D
S
N
2635 3649 M
2531 3546 D
S
N
2542 3642 M
2442 3541 D
S
N
2448 3632 M
2348 3532 D
S
N
2351 3620 M
2246 3515 D
S
N
2250 3604 M
2137 3490 D
S
N
2147 3585 M
2019 3458 D
S
N
2039 3562 M
1891 3414 D
S
N
1925 3534 M
1752 3361 D
S
N
1805 3498 M
1606 3299 D
S
N
1678 3456 M
1457 3235 D
S
N
1545 3408 M
1313 3176 D
S
N
1408 3356 M
1173 3121 D
S
N
1274 3306 M
1027 3060 D
S
N
1142 3259 M
879 2997 D
S
N
1045 3247 M
785 2987 D
S
N
948 3235 M
785 3072 D
S
N
851 3224 M
785 3157 D
S
1.00 0.00 1.00 setrgbcolor
[6 30] 0 Sd
N
953 4685 M
1147 4429 D
1385 4094 D
1563 3851 D
1706 3670 D
1824 3538 D
1925 3439 D
2014 3369 D
2093 3331 D
2213 3325 D
2355 3351 D
2474 3388 D
2575 3430 D
2664 3474 D
2743 3519 D
2846 3588 D
2965 3682 D
3066 3777 D
3155 3870 D
3234 3962 D
3338 4094 D
3456 4259 D
3558 4403 D
3646 4526 D
3758 4626 D
3758 3167 D
3646 3182 D
3558 3183 D
3456 3170 D
3338 3142 D
3234 3115 D
3155 3095 D
3066 3074 D
2965 3056 D
2846 3043 D
2743 3041 D
2664 3046 D
2575 3058 D
2474 3082 D
2355 3124 D
2213 3191 D
2093 3250 D
2014 3270 D
1925 3279 D
1824 3288 D
1706 3304 D
1563 3330 D
1385 3373 D
1147 3446 D
785 3585 D
785 3585 D
S
N
858 3557 M
785 3630 D
S
N
995 3504 M
785 3715 D
S
N
1133 3451 M
785 3800 D
S
N
1257 3412 M
785 3885 D
S
N
1379 3375 M
785 3969 D
S
N
1492 3347 M
785 4054 D
S
N
1601 3323 M
785 4139 D
S
N
1705 3304 M
785 4224 D
S
N
1802 3291 M
785 4309 D
S
N
1896 3282 M
785 4394 D
S
N
1990 3273 M
785 4478 D
S
N
2102 3246 M
785 4563 D
S
N
2267 3166 M
2102 3331 D
S
N
1513 3920 M
785 4648 D
S
N
2415 3103 M
2191 3326 D
S
N
1290 4228 M
833 4685 D
S
N
2534 3068 M
2267 3335 D
S
N
1063 4539 M
918 4685 D
S
N
2638 3050 M
2339 3348 D
S
N
2730 3042 M
2405 3367 D
S
N
2814 3043 M
2470 3387 D
S
N
2894 3048 M
2531 3411 D
S
N
2970 3057 M
2590 3437 D
S
N
3042 3070 M
2646 3465 D
S
N
3112 3085 M
2701 3495 D
S
N
3180 3102 M
2755 3527 D
S
N
3247 3119 M
2805 3561 D
S
N
3315 3136 M
2856 3595 D
S
N
3383 3153 M
2903 3633 D
S
N
3452 3169 M
2950 3671 D
S
N
3527 3179 M
2995 3711 D
S
N
3608 3182 M
3039 3752 D
S
N
3701 3175 M
3082 3793 D
S
N
3758 3202 M
3123 3837 D
S
N
3758 3287 M
3164 3881 D
S
N
3758 3372 M
3203 3927 D
S
N
3758 3457 M
3242 3973 D
S
N
3758 3542 M
3280 4020 D
S
N
3758 3626 M
3317 4067 D
S
N
3758 3711 M
3354 4116 D
S
N
3758 3796 M
3389 4165 D
S
N
3758 3881 M
3424 4215 D
S
N
3758 3966 M
3460 4264 D
S
N
3758 4051 M
3495 4314 D
S
N
3758 4136 M
3530 4364 D
S
N
3758 4220 M
3565 4413 D
S
N
3758 4305 M
3601 4463 D
S
N
3758 4390 M
3636 4512 D
S
N
3758 4475 M
3678 4555 D
S
N
3758 4560 M
3723 4595 D
S
N
3758 3245 M
3689 3176 D
S
N
3758 3330 M
3610 3182 D
S
N
3758 3415 M
3521 3178 D
S
N
3758 3500 M
3420 3161 D
S
N
3758 3584 M
3308 3134 D
S
N
3758 3669 M
3194 3105 D
S
N
3758 3754 M
3082 3078 D
S
N
3758 3839 M
2977 3058 D
S
N
3758 3924 M
2881 3047 D
S
N
3758 4009 M
2791 3042 D
S
N
3758 4094 M
2708 3043 D
S
N
3758 4178 M
2630 3051 D
S
N
3758 4263 M
2557 3063 D
S
N
3758 4348 M
2489 3079 D
S
N
3758 4433 M
2425 3100 D
S
N
3758 4518 M
3348 4108 D
S
N
2792 3552 M
2362 3122 D
S
N
3758 4603 M
3555 4400 D
S
N
2595 3439 M
2304 3148 D
S
N
2452 3381 M
2246 3176 D
S
N
2333 3347 M
2189 3203 D
S
N
2229 3328 M
2132 3231 D
S
N
2144 3329 M
2072 3256 D
S
N
2072 3341 M
2003 3272 D
S
N
2015 3369 M
1926 3279 D
S
N
1967 3406 M
1848 3286 D
S
N
1920 3444 M
1772 3295 D
S
N
1877 3486 M
1697 3305 D
S
N
1835 3528 M
1625 3319 D
S
N
1794 3572 M
1554 3332 D
S
N
1754 3617 M
1486 3349 D
S
N
1714 3661 M
1417 3365 D
S
N
1676 3708 M
1351 3383 D
S
N
1638 3756 M
1286 3403 D
S
N
1601 3803 M
1221 3423 D
S
N
1564 3851 M
1156 3443 D
S
N
1528 3900 M
1094 3466 D
S
N
1492 3949 M
1033 3490 D
S
N
1456 3998 M
971 3513 D
S
N
1420 4047 M
910 3537 D
S
N
1384 4095 M
849 3560 D
S
N
1349 4145 M
788 3584 D
S
N
1313 4195 M
785 3666 D
S
N
1278 4244 M
785 3751 D
S
N
1243 4294 M
785 3835 D
S
N
1208 4343 M
785 3920 D
S
N
1172 4393 M
785 4005 D
S
N
1137 4442 M
785 4090 D
S
N
1100 4490 M
785 4175 D
S
N
1064 4539 M
785 4260 D
S
N
1027 4587 M
785 4345 D
S
N
990 4635 M
785 4429 D
S
N
954 4684 M
785 4514 D
S
N
870 4685 M
785 4599 D
S
N
785 4685 M
785 4684 D
S
0.00 1.00 0.00 setrgbcolor
[30 30 6 30] 0 Sd
N
1211 4685 M
1385 4400 D
1563 4109 D
1706 3891 D
1824 3723 D
1925 3598 D
2014 3514 D
2093 3457 D
2213 3384 D
2355 3310 D
2474 3255 D
2575 3212 D
2664 3177 D
2743 3147 D
2846 3109 D
2965 3068 D
3066 3032 D
3155 3000 D
3234 2970 D
3338 2927 D
3456 2875 D
3558 2825 D
3646 2778 D
3758 2734 D
3758 2262 D
S
N
3520 2262 M
3456 2321 D
3338 2420 D
3234 2498 D
3155 2553 D
3066 2610 D
2965 2673 D
2846 2746 D
2743 2812 D
2664 2864 D
2575 2926 D
2474 3002 D
2355 3101 D
2213 3234 D
2093 3357 D
2014 3439 D
1925 3522 D
1824 3602 D
1706 3689 D
1563 3795 D
1385 3930 D
1147 4100 D
785 4338 D
785 4338 D
S
N
947 4232 M
785 4394 D
S
N
1203 4060 M
785 4478 D
S
N
1520 3828 M
785 4563 D
S
N
1857 3576 M
785 4648 D
S
N
2632 2886 M
833 4685 D
S
N
2872 2730 M
2224 3378 D
S
N
1694 3908 M
918 4685 D
S
N
3097 2590 M
2397 3291 D
S
N
1540 4147 M
1003 4685 D
S
N
3426 2346 M
2549 3223 D
S
N
1405 4367 M
1087 4685 D
S
N
3595 2262 M
2690 3167 D
S
N
1272 4585 M
1172 4685 D
S
N
3680 2262 M
2825 3117 D
S
N
3758 2269 M
2956 3071 D
S
N
3758 2354 M
3087 3024 D
S
N
3758 2439 M
3222 2974 D
S
N
3758 2523 M
3368 2914 D
S
N
3758 2608 M
3526 2840 D
S
N
3758 2693 M
3691 2760 D
S
N
3758 2312 M
3708 2262 D
S
N
3758 2397 M
3623 2262 D
S
N
3758 2481 M
3538 2262 D
S
N
3758 2566 M
3486 2294 D
S
N
3758 2651 M
3441 2334 D
S
N
3757 2734 M
3394 2372 D
S
N
3696 2758 M
3348 2411 D
S
N
3636 2783 M
3300 2448 D
S
N
3580 2813 M
3252 2485 D
S
N
3524 2841 M
3203 2520 D
S
N
3467 2869 M
3152 2555 D
S
N
3409 2896 M
3101 2588 D
S
N
3350 2922 M
3049 2621 D
S
N
3290 2947 M
2997 2654 D
S
N
3230 2971 M
2944 2686 D
S
N
3168 2995 M
2892 2718 D
S
N
3106 3018 M
2839 2751 D
S
N
3044 3040 M
2787 2783 D
S
N
2981 3062 M
2735 2816 D
S
N
2918 3084 M
2684 2850 D
S
N
2856 3106 M
2634 2885 D
S
N
2793 3129 M
2584 2919 D
S
N
2731 3151 M
2535 2956 D
S
N
2669 3175 M
2487 2992 D
S
N
2609 3199 M
2440 3030 D
S
N
2548 3223 M
2394 3069 D
S
N
2489 3249 M
2348 3108 D
S
N
2430 3275 M
2304 3149 D
S
N
2372 3302 M
2260 3190 D
S
N
2316 3330 M
2216 3231 D
S
N
2260 3360 M
2174 3273 D
S
N
2205 3389 M
2132 3316 D
S
N
2152 3421 M
2091 3360 D
S
N
2099 3453 M
2049 3403 D
S
N
2049 3488 M
2007 3446 D
S
N
2002 3525 M
1963 3487 D
S
N
1958 3567 M
1919 3527 D
S
N
1916 3610 M
1871 3565 D
S
N
1878 3656 M
1824 3602 D
S
N
1840 3703 M
1775 3638 D
S
N
1804 3752 M
1726 3674 D
S
N
1769 3801 M
1678 3710 D
S
N
1734 3851 M
1629 3746 D
S
N
1699 3901 M
1580 3783 D
S
N
1665 3953 M
1532 3819 D
S
N
1632 4004 M
1483 3856 D
S
N
1599 4055 M
1435 3892 D
S
N
1565 4107 M
1387 3929 D
S
N
1533 4159 M
1337 3964 D
S
N
1500 4212 M
1288 3999 D
S
N
1468 4265 M
1238 4035 D
S
N
1436 4317 M
1189 4070 D
S
N
1404 4370 M
1139 4105 D
S
N
1371 4422 M
1088 4139 D
S
N
1339 4475 M
1037 4172 D
S
N
1307 4528 M
985 4206 D
S
N
1275 4580 M
934 4240 D
S
N
1243 4633 M
883 4273 D
S
N
1210 4685 M
832 4307 D
S
N
1125 4685 M
785 4345 D
S
N
1040 4685 M
785 4429 D
S
N
955 4685 M
785 4514 D
S
N
870 4685 M
785 4599 D
S
N
785 4685 M
785 4684 D
S
0.00 0.00 0.00 setrgbcolor
[] 0 Sd
N
898 2544 M
909 2544 D
926 2511 D
S
N
907 2544 M
926 2506 D
950 2580 D
S
N
986 2539 M
989 2544 D
989 2533 D
986 2539 D
983 2541 D
978 2544 D
967 2544 D
961 2541 D
959 2539 D
959 2533 D
961 2530 D
967 2528 D
981 2522 D
986 2520 D
989 2517 D
S
N
959 2536 M
961 2533 D
967 2530 D
981 2525 D
986 2522 D
989 2520 D
989 2511 D
986 2509 D
981 2506 D
970 2506 D
964 2509 D
961 2511 D
959 2517 D
959 2506 D
961 2511 D
S
N
1008 2539 M
1057 2539 D
S
N
1008 2522 M
1057 2522 D
S
N
1076 2563 M
1076 2547 D
S
N
1076 2552 M
1079 2558 D
1085 2563 D
1090 2563 D
1104 2555 D
1109 2555 D
1112 2558 D
1115 2563 D
S
N
1079 2558 M
1085 2561 D
1090 2561 D
1104 2555 D
S
N
1115 2563 M
1115 2555 D
1112 2547 D
1101 2533 D
1098 2528 D
1096 2520 D
1096 2506 D
S
N
1112 2547 M
1098 2533 D
1096 2528 D
1093 2520 D
1093 2506 D
S
N
1191 2563 M
1191 2506 D
S
N
1194 2563 M
1194 2506 D
S
N
1175 2563 M
1172 2547 D
1172 2563 D
1213 2563 D
1213 2547 D
1211 2563 D
S
N
1183 2506 M
1202 2506 D
S
N
1230 2528 M
1263 2528 D
1263 2533 D
1260 2539 D
1257 2541 D
1252 2544 D
1243 2544 D
1235 2541 D
1230 2536 D
1227 2528 D
1227 2522 D
1230 2514 D
1235 2509 D
1243 2506 D
1249 2506 D
1257 2509 D
1263 2514 D
S
N
1260 2528 M
1260 2536 D
1257 2541 D
S
N
1243 2544 M
1238 2541 D
1232 2536 D
1230 2528 D
1230 2522 D
1232 2514 D
1238 2509 D
1243 2506 D
S
N
1279 2563 M
1298 2506 D
S
N
1282 2563 M
1298 2514 D
S
N
1317 2563 M
1298 2506 D
S
N
1273 2563 M
1290 2563 D
S
N
1306 2563 M
1323 2563 D
S
N
931 2417 M
929 2414 D
931 2411 D
934 2414 D
934 2417 D
931 2422 D
926 2425 D
918 2425 D
909 2422 D
904 2417 D
901 2411 D
898 2400 D
898 2384 D
901 2376 D
907 2370 D
915 2367 D
920 2367 D
929 2370 D
934 2376 D
937 2384 D
937 2387 D
934 2395 D
929 2400 D
920 2403 D
918 2403 D
909 2400 D
904 2395 D
901 2387 D
S
N
918 2425 M
912 2422 D
907 2417 D
904 2411 D
901 2400 D
901 2384 D
904 2376 D
909 2370 D
915 2367 D
S
N
920 2367 M
926 2370 D
931 2376 D
934 2384 D
934 2387 D
931 2395 D
926 2400 D
920 2403 D
S
N
967 2425 M
959 2422 D
956 2417 D
956 2408 D
959 2403 D
967 2400 D
978 2400 D
986 2403 D
989 2408 D
989 2417 D
986 2422 D
978 2425 D
967 2425 D
S
N
967 2425 M
961 2422 D
959 2417 D
959 2408 D
961 2403 D
967 2400 D
S
N
978 2400 M
983 2403 D
986 2408 D
986 2417 D
983 2422 D
978 2425 D
S
N
967 2400 M
959 2397 D
956 2395 D
953 2389 D
953 2378 D
956 2373 D
959 2370 D
967 2367 D
978 2367 D
986 2370 D
989 2373 D
992 2378 D
992 2389 D
989 2395 D
986 2397 D
978 2400 D
S
N
967 2400 M
961 2397 D
959 2395 D
956 2389 D
956 2378 D
959 2373 D
961 2370 D
967 2367 D
S
N
978 2367 M
983 2370 D
986 2373 D
989 2378 D
989 2389 D
986 2395 D
983 2397 D
978 2400 D
S
N
1057 2425 M
1008 2367 D
S
N
1022 2425 M
1027 2419 D
1027 2414 D
1024 2408 D
1019 2406 D
1013 2406 D
1008 2411 D
1008 2417 D
1011 2422 D
1016 2425 D
1022 2425 D
1027 2422 D
1035 2419 D
1044 2419 D
1052 2422 D
1057 2425 D
S
N
1046 2387 M
1041 2384 D
1038 2378 D
1038 2373 D
1044 2367 D
1049 2367 D
1054 2370 D
1057 2376 D
1057 2381 D
1052 2387 D
1046 2387 D
S
N
1156 2417 M
1159 2408 D
1159 2425 D
1156 2417 D
1150 2422 D
1142 2425 D
1137 2425 D
1128 2422 D
1123 2417 D
1120 2411 D
1117 2403 D
1117 2389 D
1120 2381 D
1123 2376 D
1128 2370 D
1137 2367 D
1142 2367 D
1150 2370 D
1156 2376 D
1159 2381 D
S
N
1137 2425 M
1131 2422 D
1126 2417 D
1123 2411 D
1120 2403 D
1120 2389 D
1123 2381 D
1126 2376 D
1131 2370 D
1137 2367 D
S
N
1180 2425 M
1180 2367 D
S
N
1183 2425 M
1183 2367 D
S
N
1172 2425 M
1191 2425 D
S
N
1172 2367 M
1213 2367 D
1213 2384 D
1211 2367 D
S
N
1273 2425 M
1273 2367 D
S
N
1276 2425 M
1276 2367 D
S
N
1265 2425 M
1298 2425 D
1306 2422 D
1309 2419 D
1312 2414 D
1312 2406 D
1309 2400 D
1306 2397 D
1298 2395 D
1276 2395 D
S
N
1298 2425 M
1304 2422 D
1306 2419 D
1309 2414 D
1309 2406 D
1306 2400 D
1304 2397 D
1298 2395 D
S
N
1265 2367 M
1284 2367 D
S
N
1334 2425 M
1334 2367 D
S
N
1336 2425 M
1336 2367 D
S
N
1325 2425 M
1353 2425 D
1361 2422 D
1367 2417 D
1369 2411 D
1372 2403 D
1372 2389 D
1369 2381 D
1367 2376 D
1361 2370 D
1353 2367 D
1325 2367 D
S
N
1353 2425 M
1358 2422 D
1364 2417 D
1367 2411 D
1369 2403 D
1369 2389 D
1367 2381 D
1364 2376 D
1358 2370 D
1353 2367 D
S
N
1394 2425 M
1394 2367 D
S
N
1397 2425 M
1397 2367 D
S
N
1413 2408 M
1413 2387 D
S
N
1386 2425 M
1430 2425 D
1430 2408 D
1427 2425 D
S
N
1397 2397 M
1413 2397 D
S
N
1386 2367 M
1405 2367 D
S
N
1490 2389 M
1523 2389 D
1523 2395 D
1520 2400 D
1517 2403 D
1512 2406 D
1503 2406 D
1495 2403 D
1490 2397 D
1487 2389 D
1487 2384 D
1490 2376 D
1495 2370 D
1503 2367 D
1509 2367 D
1517 2370 D
1523 2376 D
S
N
1520 2389 M
1520 2397 D
1517 2403 D
S
N
1503 2406 M
1498 2403 D
1492 2397 D
1490 2389 D
1490 2384 D
1492 2376 D
1498 2370 D
1503 2367 D
S
N
1544 2406 M
1544 2367 D
S
N
1547 2406 M
1547 2367 D
S
N
1547 2389 M
1550 2397 D
1555 2403 D
1561 2406 D
1569 2406 D
1572 2403 D
1572 2400 D
1569 2397 D
1566 2400 D
1569 2403 D
S
N
1536 2406 M
1547 2406 D
S
N
1536 2367 M
1555 2367 D
S
N
1591 2406 M
1591 2367 D
S
N
1594 2406 M
1594 2367 D
S
N
1594 2389 M
1597 2397 D
1602 2403 D
1607 2406 D
1616 2406 D
1618 2403 D
1618 2400 D
1616 2397 D
1613 2400 D
1616 2403 D
S
N
1583 2406 M
1594 2406 D
S
N
1583 2367 M
1602 2367 D
S
N
1649 2406 M
1640 2403 D
1635 2397 D
1632 2389 D
1632 2384 D
1635 2376 D
1640 2370 D
1649 2367 D
1654 2367 D
1662 2370 D
1668 2376 D
1670 2384 D
1670 2389 D
1668 2397 D
1662 2403 D
1654 2406 D
1649 2406 D
S
N
1649 2406 M
1643 2403 D
1638 2397 D
1635 2389 D
1635 2384 D
1638 2376 D
1643 2370 D
1649 2367 D
S
N
1654 2367 M
1659 2370 D
1665 2376 D
1668 2384 D
1668 2389 D
1665 2397 D
1659 2403 D
1654 2406 D
S
N
1692 2406 M
1692 2367 D
S
N
1695 2406 M
1695 2367 D
S
N
1695 2389 M
1698 2397 D
1703 2403 D
1709 2406 D
1717 2406 D
1720 2403 D
1720 2400 D
1717 2397 D
1714 2400 D
1717 2403 D
S
N
1684 2406 M
1695 2406 D
S
N
1684 2367 M
1703 2367 D
S
N
1783 2425 M
1783 2367 D
S
N
1785 2425 M
1785 2367 D
S
N
1785 2397 M
1791 2403 D
1796 2406 D
1802 2406 D
1810 2403 D
1816 2397 D
1818 2389 D
1818 2384 D
1816 2376 D
1810 2370 D
1802 2367 D
1796 2367 D
1791 2370 D
1785 2376 D
S
N
1802 2406 M
1807 2403 D
1813 2397 D
1816 2389 D
1816 2384 D
1813 2376 D
1807 2370 D
1802 2367 D
S
N
1774 2425 M
1785 2425 D
S
N
1840 2400 M
1840 2397 D
1837 2397 D
1837 2400 D
1840 2403 D
1846 2406 D
1857 2406 D
1862 2403 D
1865 2400 D
1868 2395 D
1868 2376 D
1870 2370 D
1873 2367 D
S
N
1865 2400 M
1865 2376 D
1868 2370 D
1873 2367 D
1876 2367 D
S
N
1865 2395 M
1862 2392 D
1846 2389 D
1837 2387 D
1835 2381 D
1835 2376 D
1837 2370 D
1846 2367 D
1854 2367 D
1859 2370 D
1865 2376 D
S
N
1846 2389 M
1840 2387 D
1837 2381 D
1837 2376 D
1840 2370 D
1846 2367 D
S
N
1895 2406 M
1895 2367 D
S
N
1898 2406 M
1898 2367 D
S
N
1898 2397 M
1903 2403 D
1911 2406 D
1917 2406 D
1925 2403 D
1928 2397 D
1928 2367 D
S
N
1917 2406 M
1922 2403 D
1925 2397 D
1925 2367 D
S
N
1887 2406 M
1898 2406 D
S
N
1887 2367 M
1906 2367 D
S
N
1917 2367 M
1936 2367 D
S
N
1982 2425 M
1982 2367 D
S
N
1985 2425 M
1985 2367 D
S
N
1982 2397 M
1977 2403 D
1972 2406 D
1966 2406 D
1958 2403 D
1952 2397 D
1950 2389 D
1950 2384 D
1952 2376 D
1958 2370 D
1966 2367 D
1972 2367 D
1977 2370 D
1982 2376 D
S
N
1966 2406 M
1961 2403 D
1955 2397 D
1952 2389 D
1952 2384 D
1955 2376 D
1961 2370 D
1966 2367 D
S
N
1974 2425 M
1985 2425 D
S
N
1982 2367 M
1993 2367 D
S
N
904 2683 M
904 2625 D
S
N
907 2683 M
907 2625 D
S
N
907 2674 M
912 2680 D
918 2683 D
923 2683 D
931 2680 D
937 2674 D
940 2666 D
940 2661 D
937 2653 D
931 2647 D
923 2644 D
918 2644 D
912 2647 D
907 2653 D
S
N
923 2683 M
929 2680 D
934 2674 D
937 2666 D
937 2661 D
934 2653 D
929 2647 D
923 2644 D
S
N
896 2683 M
907 2683 D
S
N
896 2625 M
915 2625 D
S
N
961 2683 M
961 2625 D
S
N
964 2683 M
964 2625 D
S
N
964 2674 M
970 2680 D
975 2683 D
981 2683 D
989 2680 D
994 2674 D
997 2666 D
997 2661 D
994 2653 D
989 2647 D
981 2644 D
975 2644 D
970 2647 D
964 2653 D
S
N
981 2683 M
986 2680 D
992 2674 D
994 2666 D
994 2661 D
992 2653 D
986 2647 D
981 2644 D
S
N
953 2683 M
964 2683 D
S
N
953 2625 M
972 2625 D
S
N
1057 2674 M
1065 2669 D
1057 2663 D
S
N
1049 2683 M
1063 2669 D
1049 2655 D
S
N
1016 2669 M
1063 2669 D
S
N
1090 2702 M
1090 2644 D
S
N
1093 2702 M
1093 2644 D
S
N
1126 2702 M
1126 2644 D
S
N
1128 2702 M
1128 2644 D
S
N
1082 2702 M
1101 2702 D
S
N
1117 2702 M
1137 2702 D
S
N
1093 2674 M
1126 2674 D
S
N
1082 2644 M
1101 2644 D
S
N
1117 2644 M
1137 2644 D
S
N
1178 2694 M
1178 2644 D
S
N
1153 2669 M
1202 2669 D
S
N
1221 2702 M
1257 2644 D
S
N
1224 2702 M
1260 2644 D
S
N
1260 2702 M
1221 2644 D
S
N
1216 2702 M
1232 2702 D
S
N
1249 2702 M
1265 2702 D
S
N
1216 2644 M
1232 2644 D
S
N
1249 2644 M
1265 2644 D
S
N
1413 2702 M
1413 2644 D
S
N
1416 2702 M
1432 2653 D
S
N
1413 2702 M
1432 2644 D
S
N
1451 2702 M
1432 2644 D
S
N
1451 2702 M
1451 2644 D
S
N
1454 2702 M
1454 2644 D
S
N
1405 2702 M
1416 2702 D
S
N
1451 2702 M
1462 2702 D
S
N
1405 2644 M
1421 2644 D
S
N
1443 2644 M
1462 2644 D
S
N
1481 2661 M
1481 2622 D
S
N
1482 2661 M
1482 2622 D
S
N
1504 2661 M
1504 2622 D
S
N
1506 2661 M
1506 2622 D
S
N
1475 2661 M
1488 2661 D
S
N
1499 2661 M
1512 2661 D
S
N
1482 2642 M
1504 2642 D
S
N
1475 2622 M
1488 2622 D
S
N
1499 2622 M
1512 2622 D
S
N
1530 2677 M
1579 2677 D
S
N
1530 2661 M
1579 2661 D
S
N
1607 2691 M
1612 2694 D
1620 2702 D
1620 2644 D
S
N
1617 2699 M
1617 2644 D
S
N
1607 2644 M
1631 2644 D
S
N
1656 2691 M
1659 2688 D
1656 2685 D
1653 2688 D
1653 2691 D
1656 2696 D
1659 2699 D
1667 2702 D
1678 2702 D
1686 2699 D
1689 2696 D
1691 2691 D
1691 2685 D
1689 2680 D
1680 2674 D
1667 2669 D
1661 2666 D
1656 2661 D
1653 2653 D
1653 2644 D
S
N
1678 2702 M
1683 2699 D
1686 2696 D
1689 2691 D
1689 2685 D
1686 2680 D
1678 2674 D
1667 2669 D
S
N
1653 2650 M
1656 2653 D
1661 2653 D
1675 2647 D
1683 2647 D
1689 2650 D
1691 2653 D
S
N
1661 2653 M
1675 2644 D
1686 2644 D
1689 2647 D
1691 2653 D
1691 2658 D
S
N
1724 2702 M
1716 2699 D
1711 2691 D
1708 2677 D
1708 2669 D
1711 2655 D
1716 2647 D
1724 2644 D
1730 2644 D
1738 2647 D
1743 2655 D
1746 2669 D
1746 2677 D
1743 2691 D
1738 2699 D
1730 2702 D
1724 2702 D
S
N
1724 2702 M
1719 2699 D
1716 2696 D
1713 2691 D
1711 2677 D
1711 2669 D
1713 2655 D
1716 2650 D
1719 2647 D
1724 2644 D
S
N
1730 2644 M
1735 2647 D
1738 2650 D
1741 2655 D
1743 2669 D
1743 2677 D
1741 2691 D
1738 2696 D
1735 2699 D
1730 2702 D
S
N
1845 2694 M
1847 2685 D
1847 2702 D
1845 2694 D
1839 2699 D
1831 2702 D
1826 2702 D
1817 2699 D
1812 2694 D
1809 2688 D
1806 2680 D
1806 2666 D
1809 2658 D
1812 2653 D
1817 2647 D
1826 2644 D
1831 2644 D
1839 2647 D
1845 2653 D
S
N
1826 2702 M
1820 2699 D
1815 2694 D
1812 2688 D
1809 2680 D
1809 2666 D
1812 2658 D
1815 2653 D
1820 2647 D
1826 2644 D
S
N
1845 2666 M
1845 2644 D
S
N
1847 2666 M
1847 2644 D
S
N
1836 2666 M
1856 2666 D
S
N
1872 2666 M
1905 2666 D
1905 2672 D
1902 2677 D
1899 2680 D
1894 2683 D
1886 2683 D
1878 2680 D
1872 2674 D
1869 2666 D
1869 2661 D
1872 2653 D
1878 2647 D
1886 2644 D
1891 2644 D
1899 2647 D
1905 2653 D
S
N
1902 2666 M
1902 2674 D
1899 2680 D
S
N
1886 2683 M
1880 2680 D
1875 2674 D
1872 2666 D
1872 2661 D
1875 2653 D
1880 2647 D
1886 2644 D
S
N
1921 2702 M
1941 2644 D
S
N
1924 2702 M
1941 2653 D
S
N
1960 2702 M
1941 2644 D
S
N
1916 2702 M
1932 2702 D
S
N
1949 2702 M
1965 2702 D
S
N
785 4685 M
785 2262 D
S
N
785 2262 M
3762 2262 D
S
N
3762 2262 M
3762 4685 D
S
N
3762 4685 M
785 4685 D
S
N
785 2262 M
3762 2262 D
S
N
785 2262 M
785 2296 D
S
N
989 2296 M
989 2262 D
S
N
1147 2262 M
1147 2366 D
S
N
1276 2296 M
1276 2262 D
S
N
1385 2262 M
1385 2296 D
S
N
1480 2296 M
1480 2262 D
S
N
1563 2262 M
1563 2296 D
S
N
1638 2366 M
1638 2262 D
S
N
2129 2262 M
2129 2366 D
S
N
2417 2296 M
2417 2262 D
S
N
2621 2262 M
2621 2296 D
S
N
2779 2366 M
2779 2262 D
S
N
2908 2262 M
2908 2296 D
S
N
3017 2296 M
3017 2262 D
S
N
3112 2262 M
3112 2296 D
S
N
3196 2296 M
3196 2262 D
S
N
3270 2262 M
3270 2366 D
S
N
3762 2366 M
3762 2262 D
S
N
1132 2205 M
1126 2176 D
S
N
1126 2176 M
1132 2182 D
1141 2184 D
1150 2184 D
1158 2182 D
1164 2176 D
1167 2167 D
1167 2161 D
1164 2153 D
1158 2147 D
1150 2144 D
1141 2144 D
1132 2147 D
1129 2150 D
1126 2156 D
1126 2158 D
1129 2161 D
1132 2158 D
1129 2156 D
S
N
1150 2184 M
1155 2182 D
1161 2176 D
1164 2167 D
1164 2161 D
1161 2153 D
1155 2147 D
1150 2144 D
S
N
1132 2205 M
1161 2205 D
S
N
1132 2202 M
1147 2202 D
1161 2205 D
S
N
1598 2193 M
1603 2196 D
1612 2205 D
1612 2144 D
S
N
1609 2202 M
1609 2144 D
S
N
1598 2144 M
1624 2144 D
S
N
1664 2205 M
1655 2202 D
1650 2193 D
1647 2179 D
1647 2170 D
1650 2156 D
1655 2147 D
1664 2144 D
1670 2144 D
1678 2147 D
1684 2156 D
1687 2170 D
1687 2179 D
1684 2193 D
1678 2202 D
1670 2205 D
1664 2205 D
S
N
1664 2205 M
1658 2202 D
1655 2199 D
1653 2193 D
1650 2179 D
1650 2170 D
1653 2156 D
1655 2150 D
1658 2147 D
1664 2144 D
S
N
1670 2144 M
1676 2147 D
1678 2150 D
1681 2156 D
1684 2170 D
1684 2179 D
1681 2193 D
1678 2199 D
1676 2202 D
1670 2205 D
S
N
2083 2193 M
2086 2190 D
2083 2187 D
2080 2190 D
2080 2193 D
2083 2199 D
2086 2202 D
2095 2205 D
2106 2205 D
2115 2202 D
2118 2199 D
2121 2193 D
2121 2187 D
2118 2182 D
2109 2176 D
2095 2170 D
2089 2167 D
2083 2161 D
2080 2153 D
2080 2144 D
S
N
2106 2205 M
2112 2202 D
2115 2199 D
2118 2193 D
2118 2187 D
2115 2182 D
2106 2176 D
2095 2170 D
S
N
2080 2150 M
2083 2153 D
2089 2153 D
2103 2147 D
2112 2147 D
2118 2150 D
2121 2153 D
S
N
2089 2153 M
2103 2144 D
2115 2144 D
2118 2147 D
2121 2153 D
2121 2158 D
S
N
2155 2205 M
2147 2202 D
2141 2193 D
2138 2179 D
2138 2170 D
2141 2156 D
2147 2147 D
2155 2144 D
2161 2144 D
2170 2147 D
2176 2156 D
2178 2170 D
2178 2179 D
2176 2193 D
2170 2202 D
2161 2205 D
2155 2205 D
S
N
2155 2205 M
2150 2202 D
2147 2199 D
2144 2193 D
2141 2179 D
2141 2170 D
2144 2156 D
2147 2150 D
2150 2147 D
2155 2144 D
S
N
2161 2144 M
2167 2147 D
2170 2150 D
2173 2156 D
2176 2170 D
2176 2179 D
2173 2193 D
2170 2199 D
2167 2202 D
2161 2205 D
S
N
2736 2205 M
2730 2176 D
S
N
2730 2176 M
2736 2182 D
2744 2184 D
2753 2184 D
2762 2182 D
2767 2176 D
2770 2167 D
2770 2161 D
2767 2153 D
2762 2147 D
2753 2144 D
2744 2144 D
2736 2147 D
2733 2150 D
2730 2156 D
2730 2158 D
2733 2161 D
2736 2158 D
2733 2156 D
S
N
2753 2184 M
2759 2182 D
2764 2176 D
2767 2167 D
2767 2161 D
2764 2153 D
2759 2147 D
2753 2144 D
S
N
2736 2205 M
2764 2205 D
S
N
2736 2202 M
2750 2202 D
2764 2205 D
S
N
2805 2205 M
2796 2202 D
2790 2193 D
2788 2179 D
2788 2170 D
2790 2156 D
2796 2147 D
2805 2144 D
2811 2144 D
2819 2147 D
2825 2156 D
2828 2170 D
2828 2179 D
2825 2193 D
2819 2202 D
2811 2205 D
2805 2205 D
S
N
2805 2205 M
2799 2202 D
2796 2199 D
2793 2193 D
2790 2179 D
2790 2170 D
2793 2156 D
2796 2150 D
2799 2147 D
2805 2144 D
S
N
2811 2144 M
2816 2147 D
2819 2150 D
2822 2156 D
2825 2170 D
2825 2179 D
2822 2193 D
2819 2199 D
2816 2202 D
2811 2205 D
S
N
3201 2193 M
3207 2196 D
3215 2205 D
3215 2144 D
S
N
3213 2202 M
3213 2144 D
S
N
3201 2144 M
3227 2144 D
S
N
3267 2205 M
3259 2202 D
3253 2193 D
3250 2179 D
3250 2170 D
3253 2156 D
3259 2147 D
3267 2144 D
3273 2144 D
3282 2147 D
3288 2156 D
3290 2170 D
3290 2179 D
3288 2193 D
3282 2202 D
3273 2205 D
3267 2205 D
S
N
3267 2205 M
3262 2202 D
3259 2199 D
3256 2193 D
3253 2179 D
3253 2170 D
3256 2156 D
3259 2150 D
3262 2147 D
3267 2144 D
S
N
3273 2144 M
3279 2147 D
3282 2150 D
3285 2156 D
3288 2170 D
3288 2179 D
3285 2193 D
3282 2199 D
3279 2202 D
3273 2205 D
S
N
3325 2205 M
3316 2202 D
3311 2193 D
3308 2179 D
3308 2170 D
3311 2156 D
3316 2147 D
3325 2144 D
3331 2144 D
3340 2147 D
3345 2156 D
3348 2170 D
3348 2179 D
3345 2193 D
3340 2202 D
3331 2205 D
3325 2205 D
S
N
3325 2205 M
3319 2202 D
3316 2199 D
3314 2193 D
3311 2179 D
3311 2170 D
3314 2156 D
3316 2150 D
3319 2147 D
3325 2144 D
S
N
3331 2144 M
3337 2147 D
3340 2150 D
3342 2156 D
3345 2170 D
3345 2179 D
3342 2193 D
3340 2199 D
3337 2202 D
3331 2205 D
S
N
3687 2193 M
3689 2190 D
3687 2187 D
3684 2190 D
3684 2193 D
3687 2199 D
3689 2202 D
3698 2205 D
3710 2205 D
3718 2202 D
3721 2199 D
3724 2193 D
3724 2187 D
3721 2182 D
3713 2176 D
3698 2170 D
3692 2167 D
3687 2161 D
3684 2153 D
3684 2144 D
S
N
3710 2205 M
3715 2202 D
3718 2199 D
3721 2193 D
3721 2187 D
3718 2182 D
3710 2176 D
3698 2170 D
S
N
3684 2150 M
3687 2153 D
3692 2153 D
3707 2147 D
3715 2147 D
3721 2150 D
3724 2153 D
S
N
3692 2153 M
3707 2144 D
3718 2144 D
3721 2147 D
3724 2153 D
3724 2158 D
S
N
3759 2205 M
3750 2202 D
3744 2193 D
3741 2179 D
3741 2170 D
3744 2156 D
3750 2147 D
3759 2144 D
3764 2144 D
3773 2147 D
3779 2156 D
3782 2170 D
3782 2179 D
3779 2193 D
3773 2202 D
3764 2205 D
3759 2205 D
S
N
3759 2205 M
3753 2202 D
3750 2199 D
3747 2193 D
3744 2179 D
3744 2170 D
3747 2156 D
3750 2150 D
3753 2147 D
3759 2144 D
S
N
3764 2144 M
3770 2147 D
3773 2150 D
3776 2156 D
3779 2170 D
3779 2179 D
3776 2193 D
3773 2199 D
3770 2202 D
3764 2205 D
S
N
3816 2205 M
3808 2202 D
3802 2193 D
3799 2179 D
3799 2170 D
3802 2156 D
3808 2147 D
3816 2144 D
3822 2144 D
3831 2147 D
3837 2156 D
3840 2170 D
3840 2179 D
3837 2193 D
3831 2202 D
3822 2205 D
3816 2205 D
S
N
3816 2205 M
3811 2202 D
3808 2199 D
3805 2193 D
3802 2179 D
3802 2170 D
3805 2156 D
3808 2150 D
3811 2147 D
3816 2144 D
S
N
3822 2144 M
3828 2147 D
3831 2150 D
3834 2156 D
3837 2170 D
3837 2179 D
3834 2193 D
3831 2199 D
3828 2202 D
3822 2205 D
S
N
785 2262 M
785 4685 D
S
N
785 2262 M
888 2262 D
S
N
819 2343 M
785 2343 D
S
N
785 2423 M
819 2423 D
S
N
819 2504 M
785 2504 D
S
N
785 2585 M
819 2585 D
S
N
888 2666 M
785 2666 D
S
N
785 2746 M
819 2746 D
S
N
819 2827 M
785 2827 D
S
N
785 2908 M
819 2908 D
S
N
819 2989 M
785 2989 D
S
N
785 3069 M
888 3069 D
S
N
819 3150 M
785 3150 D
S
N
785 3231 M
819 3231 D
S
N
819 3312 M
785 3312 D
S
N
785 3393 M
819 3393 D
S
N
888 3473 M
785 3473 D
S
N
785 3554 M
819 3554 D
S
N
819 3635 M
785 3635 D
S
N
785 3716 M
819 3716 D
S
N
819 3796 M
785 3796 D
S
N
785 3877 M
888 3877 D
S
N
819 3958 M
785 3958 D
S
N
785 4039 M
819 4039 D
S
N
819 4119 M
785 4119 D
S
N
785 4200 M
819 4200 D
S
N
888 4281 M
785 4281 D
S
N
785 4362 M
819 4362 D
S
N
819 4443 M
785 4443 D
S
N
785 4523 M
819 4523 D
S
N
819 4604 M
785 4604 D
S
N
785 4685 M
888 4685 D
S
N
485 2253 M
537 2253 D
S
N
574 2288 M
565 2285 D
560 2276 D
557 2262 D
557 2253 D
560 2239 D
565 2230 D
574 2227 D
580 2227 D
589 2230 D
594 2239 D
597 2253 D
597 2262 D
594 2276 D
589 2285 D
580 2288 D
574 2288 D
S
N
574 2288 M
568 2285 D
565 2282 D
563 2276 D
560 2262 D
560 2253 D
563 2239 D
565 2233 D
568 2230 D
574 2227 D
S
N
580 2227 M
586 2230 D
589 2233 D
591 2239 D
594 2253 D
594 2262 D
591 2276 D
589 2282 D
586 2285 D
580 2288 D
S
N
620 2233 M
617 2230 D
620 2227 D
623 2230 D
620 2233 D
S
N
652 2276 M
658 2279 D
667 2288 D
667 2227 D
S
N
664 2285 M
664 2227 D
S
N
652 2227 M
678 2227 D
S
N
707 2288 M
701 2259 D
S
N
701 2259 M
707 2265 D
716 2268 D
724 2268 D
733 2265 D
739 2259 D
742 2250 D
742 2244 D
739 2236 D
733 2230 D
724 2227 D
716 2227 D
707 2230 D
704 2233 D
701 2239 D
701 2242 D
704 2244 D
707 2242 D
704 2239 D
S
N
724 2268 M
730 2265 D
736 2259 D
739 2250 D
739 2244 D
736 2236 D
730 2230 D
724 2227 D
S
N
707 2288 M
736 2288 D
S
N
707 2285 M
721 2285 D
736 2288 D
S
N
485 2657 M
537 2657 D
S
N
574 2692 M
565 2689 D
560 2680 D
557 2666 D
557 2657 D
560 2643 D
565 2634 D
574 2631 D
580 2631 D
589 2634 D
594 2643 D
597 2657 D
597 2666 D
594 2680 D
589 2689 D
580 2692 D
574 2692 D
S
N
574 2692 M
568 2689 D
565 2686 D
563 2680 D
560 2666 D
560 2657 D
563 2643 D
565 2637 D
568 2634 D
574 2631 D
S
N
580 2631 M
586 2634 D
589 2637 D
591 2643 D
594 2657 D
594 2666 D
591 2680 D
589 2686 D
586 2689 D
580 2692 D
S
N
620 2637 M
617 2634 D
620 2631 D
623 2634 D
620 2637 D
S
N
652 2680 M
658 2683 D
667 2692 D
667 2631 D
S
N
664 2689 M
664 2631 D
S
N
652 2631 M
678 2631 D
S
N
718 2692 M
710 2689 D
704 2680 D
701 2666 D
701 2657 D
704 2643 D
710 2634 D
718 2631 D
724 2631 D
733 2634 D
739 2643 D
742 2657 D
742 2666 D
739 2680 D
733 2689 D
724 2692 D
718 2692 D
S
N
718 2692 M
713 2689 D
710 2686 D
707 2680 D
704 2666 D
704 2657 D
707 2643 D
710 2637 D
713 2634 D
718 2631 D
S
N
724 2631 M
730 2634 D
733 2637 D
736 2643 D
739 2657 D
739 2666 D
736 2680 D
733 2686 D
730 2689 D
724 2692 D
S
N
485 3061 M
537 3061 D
S
N
574 3095 M
565 3093 D
560 3084 D
557 3069 D
557 3061 D
560 3046 D
565 3038 D
574 3035 D
580 3035 D
589 3038 D
594 3046 D
597 3061 D
597 3069 D
594 3084 D
589 3093 D
580 3095 D
574 3095 D
S
N
574 3095 M
568 3093 D
565 3090 D
563 3084 D
560 3069 D
560 3061 D
563 3046 D
565 3041 D
568 3038 D
574 3035 D
S
N
580 3035 M
586 3038 D
589 3041 D
591 3046 D
594 3061 D
594 3069 D
591 3084 D
589 3090 D
586 3093 D
580 3095 D
S
N
620 3041 M
617 3038 D
620 3035 D
623 3038 D
620 3041 D
S
N
661 3095 M
652 3093 D
646 3084 D
643 3069 D
643 3061 D
646 3046 D
652 3038 D
661 3035 D
667 3035 D
675 3038 D
681 3046 D
684 3061 D
684 3069 D
681 3084 D
675 3093 D
667 3095 D
661 3095 D
S
N
661 3095 M
655 3093 D
652 3090 D
649 3084 D
646 3069 D
646 3061 D
649 3046 D
652 3041 D
655 3038 D
661 3035 D
S
N
667 3035 M
672 3038 D
675 3041 D
678 3046 D
681 3061 D
681 3069 D
678 3084 D
675 3090 D
672 3093 D
667 3095 D
S
N
707 3095 M
701 3067 D
S
N
701 3067 M
707 3072 D
716 3075 D
724 3075 D
733 3072 D
739 3067 D
742 3058 D
742 3052 D
739 3043 D
733 3038 D
724 3035 D
716 3035 D
707 3038 D
704 3041 D
701 3046 D
701 3049 D
704 3052 D
707 3049 D
704 3046 D
S
N
724 3075 M
730 3072 D
736 3067 D
739 3058 D
739 3052 D
736 3043 D
730 3038 D
724 3035 D
S
N
707 3095 M
736 3095 D
S
N
707 3093 M
721 3093 D
736 3095 D
S
N
574 3499 M
565 3496 D
560 3488 D
557 3473 D
557 3465 D
560 3450 D
565 3442 D
574 3439 D
580 3439 D
589 3442 D
594 3450 D
597 3465 D
597 3473 D
594 3488 D
589 3496 D
580 3499 D
574 3499 D
S
N
574 3499 M
568 3496 D
565 3494 D
563 3488 D
560 3473 D
560 3465 D
563 3450 D
565 3444 D
568 3442 D
574 3439 D
S
N
580 3439 M
586 3442 D
589 3444 D
591 3450 D
594 3465 D
594 3473 D
591 3488 D
589 3494 D
586 3496 D
580 3499 D
S
N
620 3444 M
617 3442 D
620 3439 D
623 3442 D
620 3444 D
S
N
661 3499 M
652 3496 D
646 3488 D
643 3473 D
643 3465 D
646 3450 D
652 3442 D
661 3439 D
666 3439 D
675 3442 D
681 3450 D
684 3465 D
684 3473 D
681 3488 D
675 3496 D
666 3499 D
661 3499 D
S
N
661 3499 M
655 3496 D
652 3494 D
649 3488 D
646 3473 D
646 3465 D
649 3450 D
652 3444 D
655 3442 D
661 3439 D
S
N
666 3439 M
672 3442 D
675 3444 D
678 3450 D
681 3465 D
681 3473 D
678 3488 D
675 3494 D
672 3496 D
666 3499 D
S
N
718 3499 M
710 3496 D
704 3488 D
701 3473 D
701 3465 D
704 3450 D
710 3442 D
718 3439 D
724 3439 D
733 3442 D
739 3450 D
742 3465 D
742 3473 D
739 3488 D
733 3496 D
724 3499 D
718 3499 D
S
N
718 3499 M
713 3496 D
710 3494 D
707 3488 D
704 3473 D
704 3465 D
707 3450 D
710 3444 D
713 3442 D
718 3439 D
S
N
724 3439 M
730 3442 D
733 3444 D
736 3450 D
739 3465 D
739 3473 D
736 3488 D
733 3494 D
730 3496 D
724 3499 D
S
N
574 3903 M
565 3900 D
560 3892 D
557 3877 D
557 3868 D
560 3854 D
565 3845 D
574 3843 D
580 3843 D
589 3845 D
594 3854 D
597 3868 D
597 3877 D
594 3892 D
589 3900 D
580 3903 D
574 3903 D
S
N
574 3903 M
568 3900 D
565 3897 D
563 3892 D
560 3877 D
560 3868 D
563 3854 D
565 3848 D
568 3845 D
574 3843 D
S
N
580 3843 M
586 3845 D
589 3848 D
591 3854 D
594 3868 D
594 3877 D
591 3892 D
589 3897 D
586 3900 D
580 3903 D
S
N
620 3848 M
617 3845 D
620 3843 D
623 3845 D
620 3848 D
S
N
661 3903 M
652 3900 D
646 3892 D
643 3877 D
643 3868 D
646 3854 D
652 3845 D
661 3843 D
666 3843 D
675 3845 D
681 3854 D
684 3868 D
684 3877 D
681 3892 D
675 3900 D
666 3903 D
661 3903 D
S
N
661 3903 M
655 3900 D
652 3897 D
649 3892 D
646 3877 D
646 3868 D
649 3854 D
652 3848 D
655 3845 D
661 3843 D
S
N
666 3843 M
672 3845 D
675 3848 D
678 3854 D
681 3868 D
681 3877 D
678 3892 D
675 3897 D
672 3900 D
666 3903 D
S
N
707 3903 M
701 3874 D
S
N
701 3874 M
707 3880 D
716 3883 D
724 3883 D
733 3880 D
739 3874 D
742 3866 D
742 3860 D
739 3851 D
733 3845 D
724 3843 D
716 3843 D
707 3845 D
704 3848 D
701 3854 D
701 3857 D
704 3860 D
707 3857 D
704 3854 D
S
N
724 3883 M
730 3880 D
736 3874 D
739 3866 D
739 3860 D
736 3851 D
730 3845 D
724 3843 D
S
N
707 3903 M
736 3903 D
S
N
707 3900 M
721 3900 D
736 3903 D
S
N
574 4307 M
565 4304 D
560 4295 D
557 4281 D
557 4272 D
560 4258 D
565 4249 D
574 4246 D
580 4246 D
589 4249 D
594 4258 D
597 4272 D
597 4281 D
594 4295 D
589 4304 D
580 4307 D
574 4307 D
S
N
574 4307 M
568 4304 D
565 4301 D
563 4295 D
560 4281 D
560 4272 D
563 4258 D
565 4252 D
568 4249 D
574 4246 D
S
N
580 4246 M
586 4249 D
589 4252 D
591 4258 D
594 4272 D
594 4281 D
591 4295 D
589 4301 D
586 4304 D
580 4307 D
S
N
620 4252 M
617 4249 D
620 4246 D
623 4249 D
620 4252 D
S
N
652 4295 M
658 4298 D
666 4307 D
666 4246 D
S
N
664 4304 M
664 4246 D
S
N
652 4246 M
678 4246 D
S
N
718 4307 M
710 4304 D
704 4295 D
701 4281 D
701 4272 D
704 4258 D
710 4249 D
718 4246 D
724 4246 D
733 4249 D
739 4258 D
742 4272 D
742 4281 D
739 4295 D
733 4304 D
724 4307 D
718 4307 D
S
N
718 4307 M
713 4304 D
710 4301 D
707 4295 D
704 4281 D
704 4272 D
707 4258 D
710 4252 D
713 4249 D
718 4246 D
S
N
724 4246 M
730 4249 D
733 4252 D
736 4258 D
739 4272 D
739 4281 D
736 4295 D
733 4301 D
730 4304 D
724 4307 D
S
N
574 4711 M
565 4708 D
560 4699 D
557 4685 D
557 4676 D
560 4662 D
565 4653 D
574 4650 D
580 4650 D
589 4653 D
594 4662 D
597 4676 D
597 4685 D
594 4699 D
589 4708 D
580 4711 D
574 4711 D
S
N
574 4711 M
568 4708 D
565 4705 D
563 4699 D
560 4685 D
560 4676 D
563 4662 D
565 4656 D
568 4653 D
574 4650 D
S
N
580 4650 M
586 4653 D
589 4656 D
591 4662 D
594 4676 D
594 4685 D
591 4699 D
589 4705 D
586 4708 D
580 4711 D
S
N
620 4656 M
617 4653 D
620 4650 D
623 4653 D
620 4656 D
S
N
652 4699 M
658 4702 D
666 4711 D
666 4650 D
S
N
664 4708 M
664 4650 D
S
N
652 4650 M
678 4650 D
S
N
707 4711 M
701 4682 D
S
N
701 4682 M
707 4688 D
716 4691 D
724 4691 D
733 4688 D
739 4682 D
742 4673 D
742 4668 D
739 4659 D
733 4653 D
724 4650 D
716 4650 D
707 4653 D
704 4656 D
701 4662 D
701 4665 D
704 4668 D
707 4665 D
704 4662 D
S
N
724 4691 M
730 4688 D
736 4682 D
739 4673 D
739 4668 D
736 4659 D
730 4653 D
724 4650 D
S
N
707 4711 M
736 4711 D
S
N
707 4708 M
721 4708 D
736 4711 D
S
N
3762 2262 M
3762 4685 D
S
N
3658 2262 M
3762 2262 D
S
N
3762 2343 M
3727 2343 D
S
N
3727 2423 M
3762 2423 D
S
N
3762 2504 M
3727 2504 D
S
N
3727 2585 M
3762 2585 D
S
N
3762 2666 M
3658 2666 D
S
N
3727 2746 M
3762 2746 D
S
N
3762 2827 M
3727 2827 D
S
N
3727 2908 M
3762 2908 D
S
N
3762 2989 M
3727 2989 D
S
N
3658 3069 M
3762 3069 D
S
N
3762 3150 M
3727 3150 D
S
N
3727 3231 M
3762 3231 D
S
N
3762 3312 M
3727 3312 D
S
N
3727 3393 M
3762 3393 D
S
N
3762 3473 M
3658 3473 D
S
N
3727 3554 M
3762 3554 D
S
N
3762 3635 M
3727 3635 D
S
N
3727 3716 M
3762 3716 D
S
N
3762 3796 M
3727 3796 D
S
N
3658 3877 M
3762 3877 D
S
N
3762 3958 M
3727 3958 D
S
N
3727 4039 M
3762 4039 D
S
N
3762 4119 M
3727 4119 D
S
N
3727 4200 M
3762 4200 D
S
N
3762 4281 M
3658 4281 D
S
N
3727 4362 M
3762 4362 D
S
N
3762 4443 M
3727 4443 D
S
N
3727 4523 M
3762 4523 D
S
N
3762 4604 M
3727 4604 D
S
N
3658 4685 M
3762 4685 D
S
N
785 3473 M
3762 3473 D
S
N
2355 2429 M
2355 2362 D
S
N
2358 2429 M
2358 2362 D
S
N
2396 2429 M
2396 2362 D
S
N
2399 2429 M
2399 2362 D
S
N
2345 2429 M
2367 2429 D
S
N
2386 2429 M
2409 2429 D
S
N
2358 2397 M
2396 2397 D
S
N
2345 2362 M
2367 2362 D
S
N
2386 2362 M
2409 2362 D
S
N
2462 2407 M
2462 2340 D
S
N
2466 2407 M
2466 2340 D
S
N
2462 2397 M
2456 2403 D
2450 2407 D
2443 2407 D
2434 2403 D
2428 2397 D
2424 2388 D
2424 2381 D
2428 2372 D
2434 2365 D
2443 2362 D
2450 2362 D
2456 2365 D
2462 2372 D
S
N
2443 2407 M
2437 2403 D
2431 2397 D
2428 2388 D
2428 2381 D
2431 2372 D
2437 2365 D
2443 2362 D
S
N
2453 2340 M
2475 2340 D
S
N
2507 2429 M
2507 2362 D
S
N
2510 2429 M
2510 2362 D
S
N
2488 2429 M
2485 2410 D
2485 2429 D
2532 2429 D
2532 2410 D
2529 2429 D
S
N
2497 2362 M
2520 2362 D
S
N
2551 2416 M
2554 2413 D
2551 2410 D
2548 2413 D
2548 2416 D
2551 2422 D
2554 2426 D
2564 2429 D
2577 2429 D
2586 2426 D
2589 2422 D
2592 2416 D
2592 2410 D
2589 2403 D
2580 2397 D
2564 2391 D
2558 2388 D
2551 2381 D
2548 2372 D
2548 2362 D
S
N
2577 2429 M
2583 2426 D
2586 2422 D
2589 2416 D
2589 2410 D
2586 2403 D
2577 2397 D
2564 2391 D
S
N
2548 2369 M
2551 2372 D
2558 2372 D
2573 2365 D
2583 2365 D
2589 2369 D
2592 2372 D
S
N
2558 2372 M
2573 2362 D
2586 2362 D
2589 2365 D
2592 2372 D
2592 2378 D
S
N
2618 2369 M
2615 2365 D
2618 2362 D
2621 2365 D
2618 2369 D
S
N
2662 2429 M
2653 2426 D
2646 2416 D
2643 2400 D
2643 2391 D
2646 2375 D
2653 2365 D
2662 2362 D
2668 2362 D
2678 2365 D
2684 2375 D
2687 2391 D
2687 2400 D
2684 2416 D
2678 2426 D
2668 2429 D
2662 2429 D
S
N
2662 2429 M
2656 2426 D
2653 2422 D
2649 2416 D
2646 2400 D
2646 2391 D
2649 2375 D
2653 2369 D
2656 2365 D
2662 2362 D
S
N
2668 2362 M
2675 2365 D
2678 2369 D
2681 2375 D
2684 2391 D
2684 2400 D
2681 2416 D
2678 2422 D
2675 2426 D
2668 2429 D
S
showpage
%%Trailer
%%Pages: 1
%%BoundingBox: 40 236 464 568
