%!PS-Adobe-3.0 EPSF-3.0
%%BoundingBox: (atend)
%%LanguageLevel: 2
%%Creator: Grace-5.1.22
%%CreationDate: Mon Dec 19 07:36:22 2011
%%DocumentData: Clean8Bit
%%Orientation: Portrait
%%Title: dsdR_ttb_err_band.agr
%%For: laura
%%DocumentNeededResources: (atend)
%%EndComments
%%BeginProlog
/m {moveto} def
/l {lineto} def
/s {stroke} def
/n {newpath} def
/c {closepath} def
/RL {rlineto} def
/SLW {setlinewidth} def
/GS {gsave} def
/GR {grestore} def
/SC {setcolor} def
/SGRY {setgray} def
/SRGB {setrgbcolor} def
/SD {setdash} def
/SLC {setlinecap} def
/SLJ {setlinejoin} def
/SCS {setcolorspace} def
/FFSF {findfont setfont} def
/CC {concat} def
/PXL {n m 0 0 RL s} def
/Color0 {1.0000 1.0000 1.0000} def
/Color1 {0.0000 0.0000 0.0000} def
/Color2 {1.0000 0.0000 0.0000} def
/Color3 {0.0000 1.0000 0.0000} def
/Color4 {0.0000 0.0000 1.0000} def
/Color5 {1.0000 1.0000 0.0000} def
/Color6 {0.7373 0.5608 0.5608} def
/Color7 {0.8627 0.8627 0.8627} def
/Color8 {0.5804 0.0000 0.8275} def
/Color9 {0.0000 1.0000 1.0000} def
/Color10 {1.0000 0.0000 1.0000} def
/Color11 {1.0000 0.6471 0.0000} def
/Color12 {0.4471 0.1294 0.7373} def
/Color13 {0.4039 0.0275 0.2824} def
/Color14 {0.2510 0.8784 0.8157} def
/Color15 {0.0000 0.5451 0.0000} def
/Color16 {0.7529 0.7529 0.7529} def
/Color17 {0.5059 0.5059 0.5059} def
/Color18 {0.2588 0.2588 0.2588} def
/PTRN {
 /pat_bits exch def 
 <<
  /PaintType 2
  /PatternType 1 /TilingType 1
  /BBox[0 0 16 16]
  /XStep 16 /YStep 16
  /PaintProc {
   pop
   16 16 true [-1 0 0 -1 16 16] pat_bits imagemask
  }
 >>
 [0.0016 0 0 0.0016 0 0]
 makepattern
} def
/Pattern0 {<0000000000000000000000000000000000000000000000000000000000000000> PTRN} bind def
/Pattern1 {<ffffffffffffffffffffffffffffffffffffffffffffffffffffffffffffffff> PTRN} bind def
/Pattern2 {<eeeeffffbbbbffffeeeeffffbbbbffffeeeeffffbbbbffffeeeeffffbbbbffff> PTRN} bind def
/Pattern3 {<eeeebbbbeeeebbbbeeeebbbbeeeebbbbeeeebbbbeeeebbbbeeeebbbbeeeebbbb> PTRN} bind def
/Pattern4 {<5555aaaa5555aaaa5555aaaa5555aaaa5555aaaa5555aaaa5555aaaa5555aaaa> PTRN} bind def
/Pattern5 {<1111444411114444111144441111444411114444111144441111444411114444> PTRN} bind def
/Pattern6 {<1111000044440000111100004444000011110000444400001111000044440000> PTRN} bind def
/Pattern7 {<1010000000000000010100000000000010100000000000000101000000000000> PTRN} bind def
/Pattern8 {<0000000000000000000000000000000000000000000000000000000000000000> PTRN} bind def
/Pattern9 {<1e1e0f0f8787c3c3e1e1f0f078783c3c1e1e0f0f8787c3c3e1e1f0f078783c3c> PTRN} bind def
/Pattern10 {<7878f0f0e1e1c3c387870f0f1e1e3c3c7878f0f0e1e1c3c387870f0f1e1e3c3c> PTRN} bind def
/Pattern11 {<3333333333333333333333333333333333333333333333333333333333333333> PTRN} bind def
/Pattern12 {<ffffffff00000000ffffffff00000000ffffffff00000000ffffffff00000000> PTRN} bind def
/Pattern13 {<8181424224241818181824244242818181814242242418181818242442428181> PTRN} bind def
/Pattern14 {<8080404020201010080804040202010180804040202010100808040402020101> PTRN} bind def
/Pattern15 {<0101020204040808101020204040808001010202040408081010202040408080> PTRN} bind def
/Pattern16 {<2222222222222222222222222222222222222222222222222222222222222222> PTRN} bind def
/Pattern17 {<0000ffff000000000000ffff000000000000ffff000000000000ffff00000000> PTRN} bind def
/Pattern18 {<2222ffff222222222222ffff222222222222ffff222222222222ffff22222222> PTRN} bind def
/Pattern19 {<ffffffff33333333ffffffff33333333ffffffff33333333ffffffff33333333> PTRN} bind def
/Pattern20 {<0f0f0f0f0f0f0f0ff0f0f0f0f0f0f0f00f0f0f0f0f0f0f0ff0f0f0f0f0f0f0f0> PTRN} bind def
/Pattern21 {<ff00ff00ff00ff00ff00ff00ff00ff0000ff00ff00ff00ff00ff00ff00ff00ff> PTRN} bind def
/Pattern22 {<8001800180018001800180018001ffffffff8001800180018001800180018001> PTRN} bind def
/Pattern23 {<c003c003c003c003c003c003ffffffffffffffffc003c003c003c003c003c003> PTRN} bind def
/Pattern24 {<040404040404ffff404040404040ffff040404040404ffff404040404040ffff> PTRN} bind def
/Pattern25 {<180018001800180018001800ffffffff001800180018001800180018ffffffff> PTRN} bind def
/Pattern26 {<1111b8b87c7c3a3a1111a3a3c7c78b8b1111b8b87c7c3a3a1111a3a3c7c78b8b> PTRN} bind def
/Pattern27 {<101010102828c7c70101010182827c7c101010102828c7c70101010182827c7c> PTRN} bind def
/Pattern28 {<1c1c121211112121c1c12121111112121c1c121211112121c1c1212111111212> PTRN} bind def
/Pattern29 {<3e3e414180808080e3e31414080808083e3e414180808080e3e3141408080808> PTRN} bind def
/Pattern30 {<4848888884848383848488884848383848488888848483838484888848483838> PTRN} bind def
/Pattern31 {<03030404080808080c0c12122121c0c003030404080808080c0c12122121c0c0> PTRN} bind def
/ellipsedict 8 dict def
ellipsedict /mtrx matrix put
/EARC {
 ellipsedict begin
  /endangle exch def
  /startangle exch def
  /yrad exch def
  /xrad exch def
  /y exch def
  /x exch def
  /savematrix mtrx currentmatrix def
  x y translate
  xrad yrad scale
  0 0 1 startangle endangle arc
  savematrix setmatrix
 end
} def
/TL {
  /kcomp exch def
  /linewidth exch def
  /offset exch def
  GS
  0 offset rmoveto
  linewidth SLW
  dup stringwidth exch kcomp add exch RL s
  GR
} def
/KINIT
{
 /kvector exch def
 /kid 0 def
} def
/KPROC
{
 pop pop
 kvector kid get
 0 rmoveto
 /kid 1 kid add def
} def
/DefEncoding [
 /.notdef
 /.notdef
 /.notdef
 /.notdef
 /.notdef
 /.notdef
 /.notdef
 /.notdef
 /.notdef
 /.notdef
 /.notdef
 /.notdef
 /.notdef
 /.notdef
 /.notdef
 /.notdef
 /.notdef
 /.notdef
 /.notdef
 /.notdef
 /.notdef
 /.notdef
 /.notdef
 /.notdef
 /.notdef
 /.notdef
 /.notdef
 /.notdef
 /.notdef
 /.notdef
 /.notdef
 /.notdef
 /space
 /exclam
 /quotedbl
 /numbersign
 /dollar
 /percent
 /ampersand
 /quoteright
 /parenleft
 /parenright
 /asterisk
 /plus
 /comma
 /hyphen
 /period
 /slash
 /zero
 /one
 /two
 /three
 /four
 /five
 /six
 /seven
 /eight
 /nine
 /colon
 /semicolon
 /less
 /equal
 /greater
 /question
 /at
 /A
 /B
 /C
 /D
 /E
 /F
 /G
 /H
 /I
 /J
 /K
 /L
 /M
 /N
 /O
 /P
 /Q
 /R
 /S
 /T
 /U
 /V
 /W
 /X
 /Y
 /Z
 /bracketleft
 /backslash
 /bracketright
 /asciicircum
 /underscore
 /grave
 /a
 /b
 /c
 /d
 /e
 /f
 /g
 /h
 /i
 /j
 /k
 /l
 /m
 /n
 /o
 /p
 /q
 /r
 /s
 /t
 /u
 /v
 /w
 /x
 /y
 /z
 /braceleft
 /bar
 /braceright
 /asciitilde
 /.notdef
 /.notdef
 /.notdef
 /.notdef
 /.notdef
 /.notdef
 /.notdef
 /.notdef
 /.notdef
 /.notdef
 /.notdef
 /.notdef
 /.notdef
 /.notdef
 /.notdef
 /.notdef
 /.notdef
 /.notdef
 /.notdef
 /.notdef
 /.notdef
 /.notdef
 /.notdef
 /.notdef
 /.notdef
 /.notdef
 /.notdef
 /.notdef
 /.notdef
 /.notdef
 /.notdef
 /.notdef
 /.notdef
 /space
 /exclamdown
 /cent
 /sterling
 /currency
 /yen
 /brokenbar
 /section
 /dieresis
 /copyright
 /ordfeminine
 /guillemotleft
 /logicalnot
 /hyphen
 /registered
 /macron
 /degree
 /plusminus
 /twosuperior
 /threesuperior
 /acute
 /mu
 /paragraph
 /periodcentered
 /cedilla
 /onesuperior
 /ordmasculine
 /guillemotright
 /onequarter
 /onehalf
 /threequarters
 /questiondown
 /Agrave
 /Aacute
 /Acircumflex
 /Atilde
 /Adieresis
 /Aring
 /AE
 /Ccedilla
 /Egrave
 /Eacute
 /Ecircumflex
 /Edieresis
 /Igrave
 /Iacute
 /Icircumflex
 /Idieresis
 /Eth
 /Ntilde
 /Ograve
 /Oacute
 /Ocircumflex
 /Otilde
 /Odieresis
 /multiply
 /Oslash
 /Ugrave
 /Uacute
 /Ucircumflex
 /Udieresis
 /Yacute
 /Thorn
 /germandbls
 /agrave
 /aacute
 /acircumflex
 /atilde
 /adieresis
 /aring
 /ae
 /ccedilla
 /egrave
 /eacute
 /ecircumflex
 /edieresis
 /igrave
 /iacute
 /icircumflex
 /idieresis
 /eth
 /ntilde
 /ograve
 /oacute
 /ocircumflex
 /otilde
 /odieresis
 /divide
 /oslash
 /ugrave
 /uacute
 /ucircumflex
 /udieresis
 /yacute
 /thorn
 /ydieresis
] def
%%EndProlog
%%BeginSetup
%%EndSetup
612.00 612.00 scale
n
0.0000 0.0000 m
0.0000 1.0000 l
1.2941 1.0000 l
1.2941 0.0000 l
c
[/DeviceRGB] SCS
Color0 SC
fill
[/DeviceRGB] SCS
Color1 SC
[] 0 SD
0.0030 SLW
0 SLC
0 SLJ
n
0.1500 0.1638 m
0.1500 0.1675 l
0.1700 0.1675 l
0.1700 0.1708 l
0.1900 0.1708 l
0.1900 0.1749 l
0.2100 0.1749 l
0.2100 0.1772 l
0.2300 0.1772 l
0.2300 0.1822 l
0.2500 0.1822 l
0.2500 0.1842 l
0.2700 0.1842 l
0.2700 0.1875 l
0.2900 0.1875 l
0.2900 0.1922 l
0.3100 0.1922 l
0.3100 0.1972 l
0.3300 0.1972 l
0.3300 0.1986 l
0.3500 0.1986 l
0.3500 0.2075 l
0.3700 0.2075 l
0.3700 0.2104 l
0.3900 0.2104 l
0.3900 0.2163 l
0.4100 0.2163 l
0.4100 0.2202 l
0.4300 0.2202 l
0.4300 0.2277 l
0.4500 0.2277 l
0.4500 0.2342 l
0.4700 0.2342 l
0.4700 0.2451 l
0.4900 0.2451 l
0.4900 0.2570 l
0.5100 0.2570 l
0.5100 0.2722 l
0.5300 0.2722 l
0.5300 0.2817 l
0.5500 0.2817 l
0.5500 0.3102 l
0.5700 0.3102 l
0.5700 0.3191 l
0.5900 0.3191 l
0.5900 0.3394 l
0.6100 0.3394 l
0.6100 0.3726 l
0.6300 0.3726 l
0.6300 0.4135 l
0.6500 0.4135 l
0.6500 0.4516 l
0.6700 0.4516 l
0.6700 0.5176 l
0.6900 0.5176 l
0.6900 0.5719 l
0.7100 0.5719 l
0.7100 0.6276 l
0.7300 0.6276 l
0.7300 0.7118 l
0.7500 0.7118 l
0.7500 0.6592 l
0.7700 0.6592 l
0.7700 0.4611 l
0.7900 0.4611 l
0.7900 0.3834 l
0.8100 0.3834 l
0.8100 0.3299 l
0.8300 0.3299 l
0.8300 0.3011 l
0.8500 0.3011 l
0.8500 0.2714 l
0.8700 0.2714 l
0.8700 0.2591 l
0.8900 0.2591 l
0.8900 0.2361 l
0.9100 0.2361 l
0.9100 0.2169 l
0.9300 0.2169 l
0.9300 0.2109 l
0.9500 0.2109 l
0.9500 0.1982 l
0.9700 0.1982 l
0.9700 0.1994 l
0.9900 0.1994 l
0.9900 0.1892 l
1.0100 0.1892 l
1.0100 0.1861 l
1.0300 0.1861 l
1.0300 0.1826 l
1.0500 0.1826 l
1.0500 0.1752 l
1.0700 0.1752 l
1.0700 0.1738 l
1.0900 0.1738 l
1.0900 0.1724 l
1.1100 0.1724 l
1.1100 0.1718 l
1.1300 0.1718 l
1.1300 0.1697 l
1.1500 0.1697 l
1.1500 0.1698 l
1.1501 0.1698 l
s
[/DeviceRGB] SCS
Color2 SC
n
0.1500 0.1637 m
0.1500 0.1669 l
0.1700 0.1669 l
0.1700 0.1696 l
0.1900 0.1696 l
0.1900 0.1728 l
0.2100 0.1728 l
0.2100 0.1765 l
0.2300 0.1765 l
0.2300 0.1774 l
0.2500 0.1774 l
0.2500 0.1829 l
0.2700 0.1829 l
0.2700 0.1832 l
0.2900 0.1832 l
0.2900 0.1871 l
0.3100 0.1871 l
0.3100 0.1914 l
0.3300 0.1914 l
0.3300 0.1950 l
0.3500 0.1950 l
0.3500 0.2003 l
0.3700 0.2003 l
0.3700 0.2034 l
0.3900 0.2034 l
0.3900 0.2059 l
0.4100 0.2059 l
0.4100 0.2151 l
0.4300 0.2151 l
0.4300 0.2192 l
0.4500 0.2192 l
0.4500 0.2242 l
0.4700 0.2242 l
0.4700 0.2348 l
0.4900 0.2348 l
0.4900 0.2448 l
0.5100 0.2448 l
0.5100 0.2561 l
0.5300 0.2561 l
0.5300 0.2706 l
0.5500 0.2706 l
0.5500 0.2885 l
0.5700 0.2885 l
0.5700 0.3009 l
0.5900 0.3009 l
0.5900 0.3233 l
0.6100 0.3233 l
0.6100 0.3499 l
0.6300 0.3499 l
0.6300 0.3908 l
0.6500 0.3908 l
0.6500 0.4293 l
0.6700 0.4293 l
0.6700 0.4880 l
0.6900 0.4880 l
0.6900 0.5450 l
0.7100 0.5450 l
0.7100 0.5949 l
0.7300 0.5949 l
0.7300 0.6819 l
0.7500 0.6819 l
0.7500 0.6344 l
0.7700 0.6344 l
0.7700 0.4385 l
0.7900 0.4385 l
0.7900 0.3668 l
0.8100 0.3668 l
0.8100 0.3144 l
0.8300 0.3144 l
0.8300 0.2917 l
0.8500 0.2917 l
0.8500 0.2594 l
0.8700 0.2594 l
0.8700 0.2496 l
0.8900 0.2496 l
0.8900 0.2221 l
0.9100 0.2221 l
0.9100 0.2150 l
0.9300 0.2150 l
0.9300 0.2030 l
0.9500 0.2030 l
0.9500 0.1967 l
0.9700 0.1967 l
0.9700 0.1908 l
0.9900 0.1908 l
0.9900 0.1866 l
1.0100 0.1866 l
1.0100 0.1833 l
1.0300 0.1833 l
1.0300 0.1779 l
1.0500 0.1779 l
1.0500 0.1774 l
1.0700 0.1774 l
1.0700 0.1711 l
1.0900 0.1711 l
1.0900 0.1728 l
1.1100 0.1728 l
1.1100 0.1705 l
1.1300 0.1705 l
1.1300 0.1698 l
1.1500 0.1698 l
1.1500 0.1675 l
1.1501 0.1675 l
s
n
0.1500 0.1642 m
0.1500 0.1687 l
0.1700 0.1687 l
0.1700 0.1720 l
0.1900 0.1720 l
0.1900 0.1792 l
0.2100 0.1792 l
0.2100 0.1795 l
0.2300 0.1795 l
0.2300 0.1860 l
0.2500 0.1860 l
0.2500 0.1885 l
0.2700 0.1885 l
0.2700 0.1932 l
0.2900 0.1932 l
0.2900 0.1983 l
0.3100 0.1983 l
0.3100 0.2025 l
0.3300 0.2025 l
0.3300 0.2064 l
0.3500 0.2064 l
0.3500 0.2117 l
0.3700 0.2117 l
0.3700 0.2221 l
0.3900 0.2221 l
0.3900 0.2252 l
0.4100 0.2252 l
0.4100 0.2254 l
0.4300 0.2254 l
0.4300 0.2393 l
0.4500 0.2393 l
0.4500 0.2419 l
0.4700 0.2419 l
0.4700 0.2557 l
0.4900 0.2557 l
0.4900 0.2664 l
0.5100 0.2664 l
0.5100 0.2814 l
0.5300 0.2814 l
0.5300 0.2973 l
0.5500 0.2973 l
0.5500 0.3172 l
0.5700 0.3172 l
0.5700 0.3496 l
0.5900 0.3496 l
0.5900 0.3630 l
0.6100 0.3630 l
0.6100 0.3852 l
0.6300 0.3852 l
0.6300 0.4213 l
0.6500 0.4213 l
0.6500 0.4598 l
0.6700 0.4598 l
0.6700 0.5363 l
0.6900 0.5363 l
0.6900 0.5665 l
0.7100 0.5665 l
0.7100 0.6247 l
0.7300 0.6247 l
0.7300 0.7171 l
0.7500 0.7171 l
0.7500 0.6408 l
0.7700 0.6408 l
0.7700 0.4578 l
0.7900 0.4578 l
0.7900 0.3711 l
0.8100 0.3711 l
0.8100 0.3495 l
0.8300 0.3495 l
0.8300 0.2955 l
0.8500 0.2955 l
0.8500 0.2696 l
0.8700 0.2696 l
0.8700 0.2635 l
0.8900 0.2635 l
0.8900 0.2482 l
0.9100 0.2482 l
0.9100 0.2218 l
0.9300 0.2218 l
0.9300 0.2161 l
0.9500 0.2161 l
0.9500 0.1998 l
0.9700 0.1998 l
0.9700 0.1971 l
0.9900 0.1971 l
0.9900 0.1902 l
1.0100 0.1902 l
1.0100 0.1875 l
1.0300 0.1875 l
1.0300 0.1863 l
1.0500 0.1863 l
1.0500 0.1828 l
1.0700 0.1828 l
1.0700 0.1727 l
1.0900 0.1727 l
1.0900 0.1751 l
1.1100 0.1751 l
1.1100 0.1743 l
1.1300 0.1743 l
1.1300 0.1728 l
1.1500 0.1728 l
1.1500 0.1711 l
1.1501 0.1711 l
s
[/DeviceRGB] SCS
Color4 SC
n
0.1500 0.1632 m
0.1500 0.1661 l
0.1700 0.1661 l
0.1700 0.1682 l
0.1900 0.1682 l
0.1900 0.1707 l
0.2100 0.1707 l
0.2100 0.1743 l
0.2300 0.1743 l
0.2300 0.1728 l
0.2500 0.1728 l
0.2500 0.1806 l
0.2700 0.1806 l
0.2700 0.1785 l
0.2900 0.1785 l
0.2900 0.1822 l
0.3100 0.1822 l
0.3100 0.1858 l
0.3300 0.1858 l
0.3300 0.1917 l
0.3500 0.1917 l
0.3500 0.1959 l
0.3700 0.1959 l
0.3700 0.1968 l
0.3900 0.1968 l
0.3900 0.1983 l
0.4100 0.1983 l
0.4100 0.2102 l
0.4300 0.2102 l
0.4300 0.2102 l
0.4500 0.2102 l
0.4500 0.2140 l
0.4700 0.2140 l
0.4700 0.2273 l
0.4900 0.2273 l
0.4900 0.2352 l
0.5100 0.2352 l
0.5100 0.2451 l
0.5300 0.2451 l
0.5300 0.2578 l
0.5500 0.2578 l
0.5500 0.2762 l
0.5700 0.2762 l
0.5700 0.2772 l
0.5900 0.2772 l
0.5900 0.3029 l
0.6100 0.3029 l
0.6100 0.3225 l
0.6300 0.3225 l
0.6300 0.3709 l
0.6500 0.3709 l
0.6500 0.4024 l
0.6700 0.4024 l
0.6700 0.4584 l
0.6900 0.4584 l
0.6900 0.5075 l
0.7100 0.5075 l
0.7100 0.5380 l
0.7300 0.5380 l
0.7300 0.6294 l
0.7500 0.6294 l
0.7500 0.5797 l
0.7700 0.5797 l
0.7700 0.4033 l
0.7900 0.4033 l
0.7900 0.3345 l
0.8100 0.3345 l
0.8100 0.2898 l
0.8300 0.2898 l
0.8300 0.2788 l
0.8500 0.2788 l
0.8500 0.2480 l
0.8700 0.2480 l
0.8700 0.2363 l
0.8900 0.2363 l
0.8900 0.2008 l
0.9100 0.2008 l
0.9100 0.2057 l
0.9300 0.2057 l
0.9300 0.1897 l
0.9500 0.1897 l
0.9500 0.1908 l
0.9700 0.1908 l
0.9700 0.1812 l
0.9900 0.1812 l
0.9900 0.1766 l
1.0100 0.1766 l
1.0100 0.1739 l
1.0300 0.1739 l
1.0300 0.1678 l
1.0500 0.1678 l
1.0500 0.1689 l
1.0700 0.1689 l
1.0700 0.1669 l
1.0900 0.1669 l
1.0900 0.1665 l
1.1100 0.1665 l
1.1100 0.1653 l
1.1300 0.1653 l
1.1300 0.1609 l
1.1500 0.1609 l
1.1500 0.1632 l
1.1501 0.1632 l
s
n
0.1500 0.1647 m
0.1500 0.1697 l
0.1700 0.1697 l
0.1700 0.1733 l
0.1900 0.1733 l
0.1900 0.1819 l
0.2100 0.1819 l
0.2100 0.1817 l
0.2300 0.1817 l
0.2300 0.1899 l
0.2500 0.1899 l
0.2500 0.1918 l
0.2700 0.1918 l
0.2700 0.1974 l
0.2900 0.1974 l
0.2900 0.2040 l
0.3100 0.2040 l
0.3100 0.2079 l
0.3300 0.2079 l
0.3300 0.2099 l
0.3500 0.2099 l
0.3500 0.2157 l
0.3700 0.2157 l
0.3700 0.2308 l
0.3900 0.2308 l
0.3900 0.2312 l
0.4100 0.2312 l
0.4100 0.2308 l
0.4300 0.2308 l
0.4300 0.2490 l
0.4500 0.2490 l
0.4500 0.2514 l
0.4700 0.2514 l
0.4700 0.2632 l
0.4900 0.2632 l
0.4900 0.2760 l
0.5100 0.2760 l
0.5100 0.2906 l
0.5300 0.2906 l
0.5300 0.3119 l
0.5500 0.3119 l
0.5500 0.3281 l
0.5700 0.3281 l
0.5700 0.3775 l
0.5900 0.3775 l
0.5900 0.3874 l
0.6100 0.3874 l
0.6100 0.4135 l
0.6300 0.4135 l
0.6300 0.4405 l
0.6500 0.4405 l
0.6500 0.4888 l
0.6700 0.4888 l
0.6700 0.5738 l
0.6900 0.5738 l
0.6900 0.6144 l
0.7100 0.6144 l
0.7100 0.6949 l
0.7300 0.6949 l
0.7300 0.7823 l
0.7500 0.7823 l
0.7500 0.7325 l
0.7700 0.7325 l
0.7700 0.5017 l
0.7900 0.5017 l
0.7900 0.4247 l
0.8100 0.4247 l
0.8100 0.3829 l
0.8300 0.3829 l
0.8300 0.3191 l
0.8500 0.3191 l
0.8500 0.2846 l
0.8700 0.2846 l
0.8700 0.2739 l
0.8900 0.2739 l
0.8900 0.2671 l
0.9100 0.2671 l
0.9100 0.2343 l
0.9300 0.2343 l
0.9300 0.2294 l
0.9500 0.2294 l
0.9500 0.2054 l
0.9700 0.2054 l
0.9700 0.2089 l
0.9900 0.2089 l
0.9900 0.2009 l
1.0100 0.2009 l
1.0100 0.1960 l
1.0300 0.1960 l
1.0300 0.1961 l
1.0500 0.1961 l
1.0500 0.1876 l
1.0700 0.1876 l
1.0700 0.1785 l
1.0900 0.1785 l
1.0900 0.1818 l
1.1100 0.1818 l
1.1100 0.1803 l
1.1300 0.1803 l
1.1300 0.1814 l
1.1500 0.1814 l
1.1500 0.1751 l
1.1501 0.1751 l
s
[/DeviceRGB] SCS
Color1 SC
[] 0 SD
0.0015 SLW
n
0.1500 0.1500 m
1.1500 0.1500 l
s
n
0.1500 0.8500 m
1.1500 0.8500 l
s
[] 0 SD
0.0030 SLW
n
0.3500 0.1500 m
0.3500 0.1600 l
s
n
0.3500 0.8500 m
0.3500 0.8400 l
s
n
0.7500 0.1500 m
0.7500 0.1600 l
s
n
0.7500 0.8500 m
0.7500 0.8400 l
s
n
1.1500 0.1500 m
1.1500 0.1600 l
s
n
1.1500 0.8500 m
1.1500 0.8400 l
s
n
0.1500 0.1500 m
0.1500 0.1700 l
s
n
0.1500 0.8500 m
0.1500 0.8300 l
s
n
0.5500 0.1500 m
0.5500 0.1700 l
s
n
0.5500 0.8500 m
0.5500 0.8300 l
s
n
0.9500 0.1500 m
0.9500 0.1700 l
s
n
0.9500 0.8500 m
0.9500 0.8300 l
s
/Times-Roman findfont
dup length dict begin
 {1 index /FID ne {def} {pop pop} ifelse} forall
 /Encoding DefEncoding def
 currentdict
end
/Font0 exch definefont pop
/Font0 FFSF
0.1418 0.1169 m
GS
[0.0344 0.0000 0.0000 0.0344 0 0] CC
(0) show
GR
/Font0 FFSF
0.5418 0.1169 m
GS
[0.0344 0.0000 0.0000 0.0344 0 0] CC
(2) show
GR
/Font0 FFSF
0.9420 0.1169 m
GS
[0.0344 0.0000 0.0000 0.0344 0 0] CC
(4) show
GR
/Font0 FFSF
0.6053 0.0829 m
GS
[0.0344 0.0000 0.0000 0.0344 0 0] CC
(R\(t,tb\)) show
GR
[] 0 SD
0.0015 SLW
n
0.1500 0.1500 m
0.1500 0.8500 l
s
n
1.1500 0.1500 m
1.1500 0.8500 l
s
[] 0 SD
0.0030 SLW
n
0.1500 0.2250 m
0.1600 0.2250 l
s
n
1.1500 0.2250 m
1.1400 0.2250 l
s
n
0.1500 0.3500 m
0.1600 0.3500 l
s
n
1.1500 0.3500 m
1.1400 0.3500 l
s
n
0.1500 0.4750 m
0.1600 0.4750 l
s
n
1.1500 0.4750 m
1.1400 0.4750 l
s
n
0.1500 0.6000 m
0.1600 0.6000 l
s
n
1.1500 0.6000 m
1.1400 0.6000 l
s
n
0.1500 0.7250 m
0.1600 0.7250 l
s
n
1.1500 0.7250 m
1.1400 0.7250 l
s
n
0.1500 0.8500 m
0.1600 0.8500 l
s
n
1.1500 0.8500 m
1.1400 0.8500 l
s
n
0.1500 0.1625 m
0.1700 0.1625 l
s
n
1.1500 0.1625 m
1.1300 0.1625 l
s
n
0.1500 0.2875 m
0.1700 0.2875 l
s
n
1.1500 0.2875 m
1.1300 0.2875 l
s
n
0.1500 0.4125 m
0.1700 0.4125 l
s
n
1.1500 0.4125 m
1.1300 0.4125 l
s
n
0.1500 0.5375 m
0.1700 0.5375 l
s
n
1.1500 0.5375 m
1.1300 0.5375 l
s
n
0.1500 0.6625 m
0.1700 0.6625 l
s
n
1.1500 0.6625 m
1.1300 0.6625 l
s
n
0.1500 0.7875 m
0.1700 0.7875 l
s
n
1.1500 0.7875 m
1.1300 0.7875 l
s
/Font0 FFSF
0.1235 0.1511 m
GS
[0.0344 0.0000 0.0000 0.0344 0 0] CC
(0) show
GR
/Font0 FFSF
0.0804 0.2761 m
GS
[0.0344 0.0000 0.0000 0.0344 0 0] CC
(0.02) show
GR
/Font0 FFSF
0.0808 0.4011 m
GS
[0.0344 0.0000 0.0000 0.0344 0 0] CC
(0.04) show
GR
/Font0 FFSF
0.0808 0.5259 m
GS
[0.0344 0.0000 0.0000 0.0344 0 0] CC
(0.06) show
GR
/Font0 FFSF
0.0816 0.6511 m
GS
[0.0344 0.0000 0.0000 0.0344 0 0] CC
(0.08) show
GR
/Font0 FFSF
0.1004 0.7761 m
GS
[0.0344 0.0000 0.0000 0.0344 0 0] CC
(0.1) show
GR
/Font0 FFSF
0.0629 0.3906 m
GS
[0.0000 0.0344 -0.0344 0.0000 0 0] CC
(d) show
GR
/Symbol findfont
/Font12 exch definefont pop
/Font12 FFSF
0.0629 0.4078 m
GS
[0.0000 0.0344 -0.0344 0.0000 0 0] CC
(s) show
GR
/Font0 FFSF
0.0629 0.4286 m
GS
[0.0000 0.0344 -0.0344 0.0000 0 0] CC
(/dR\(t,tb\) [pb]) show
GR
[] 0 SD
0.0015 SLW
n
0.1500 0.1500 m
0.1500 0.8500 l
s
n
1.1500 0.1500 m
1.1500 0.8500 l
s
n
0.1500 0.7875 m
0.1600 0.7875 l
s
n
1.1500 0.7875 m
1.1400 0.7875 l
s
n
0.1500 0.1625 m
0.1700 0.1625 l
s
n
1.1500 0.1625 m
1.1300 0.1625 l
s
/Font0 FFSF
0.1267 0.1533 m
GS
[0.0280 0.0000 0.0000 0.0280 0 0] CC
(0) show
GR
/Font0 FFSF
1.1892 0.5475 m
GS
[0.0000 0.0280 -0.0280 0.0000 0 0] CC
(LHC HIGGS XS WG 2011) show
GR
[] 0 SD
0.0030 SLW
n
0.1500 0.1500 m
0.1500 0.8500 l
1.1500 0.8500 l
1.1500 0.1500 l
0.1500 0.1500 l
c
s
n
0.2500 0.7875 m
0.2500 0.6769 l
0.5472 0.6769 l
0.5472 0.7875 l
c
[/DeviceRGB] SCS
Color0 SC
fill
[/DeviceRGB] SCS
Color1 SC
[] 0 SD
0.0015 SLW
n
0.2500 0.7875 m
0.2500 0.6769 l
0.5472 0.6769 l
0.5472 0.7875 l
0.2500 0.7875 l
c
s
/Font0 FFSF
0.3215 0.7544 m
GS
[0.0339 0.0000 0.0000 0.0339 0 0] CC
(central value) show
GR
[] 0 SD
0.0030 SLW
n
0.2615 0.7657 m
0.3015 0.7657 l
s
/Font0 FFSF
0.3215 0.7208 m
GS
[0.0339 0.0000 0.0000 0.0339 0 0] CC
(error from scale) show
GR
[/DeviceRGB] SCS
Color2 SC
n
0.2615 0.7322 m
0.3015 0.7322 l
s
/Font0 FFSF
[/DeviceRGB] SCS
Color1 SC
0.3215 0.6873 m
GS
[0.0339 0.0000 0.0000 0.0339 0 0] CC
(total error) show
GR
[/DeviceRGB] SCS
Color4 SC
n
0.2615 0.6987 m
0.3015 0.6987 l
s
/Font0 FFSF
[/DeviceRGB] SCS
Color1 SC
0.2463 0.3995 m
GS
[0.0353 0.0000 0.0000 0.0353 0 0] CC
(LHC with 7 TeV) show
GR
%%Trailer
%%BoundingBox: 23 45 730 523
%%DocumentNeededResources: font Times-Roman
%%+ font Symbol
%%EOF
