%!PS-Adobe-2.0 EPSF-2.0
%%BoundingBox:  0 0 567 547
%%Title: /home/shiki/Desktop/MCFM/HiggsAcc/mH400/mH400_LHC.eps: Higgs Cross Section
%%Creator: ROOT Version 5.28/00
%%CreationDate: Tue Nov 29 16:27:02 2011
%%EndComments
%%BeginProlog
80 dict begin
/s {stroke} def /l {lineto} def /m {moveto} def /t {translate} def
/r {rotate} def /rl {roll}  def /R {repeat} def
/d {rlineto} def /rm {rmoveto} def /gr {grestore} def /f {eofill} def
/c {setrgbcolor} def /black {0 setgray} def /sd {setdash} def
/cl {closepath} def /sf {scalefont setfont} def /lw {setlinewidth} def
/box {m dup 0 exch d exch 0 d 0 exch neg d cl} def
/NC{systemdict begin initclip end}def/C{NC box clip newpath}def
/bl {box s} def /bf {box f} def /Y { 0 exch d} def /X { 0 d} def 
/K {{pop pop 0 moveto} exch kshow} bind def
/ita {/ang 15 def gsave [1 0 ang dup sin exch cos div 1 0 0] concat} def 
/mp {newpath /y exch def /x exch def} def
/side {[w .77 mul w .23 mul] .385 w mul sd w 0 l currentpoint t -144 r} def
/mr {mp x y w2 0 360 arc} def /m24 {mr s} def /m20 {mr f} def
/mb {mp x y w2 add m w2 neg 0 d 0 w neg d w 0 d 0 w d cl} def
/mt {mp x y w2 add m w2 neg w neg d w 0 d cl} def
/m21 {mb f} def /m25 {mb s} def /m22 {mt f} def /m26{mt s} def
/m23 {mp x y w2 sub m w2 w d w neg 0 d cl f} def
/m27 {mp x y w2 add m w3 neg w2 neg d w3 w2 neg d w3 w2 d cl s} def
/m28 {mp x w2 sub y w2 sub w3 add m w3 0 d  0 w3 neg d w3 0 d 0 w3 d w3 0 d  0 w3 d w3 neg 0 d 0 w3 d w3 neg 0 d 0 w3 neg d w3 neg 0 d cl s } def
/m29 {mp gsave x w2 sub y w2 add w3 sub m currentpoint t 4 {side} repeat cl fill gr} def
/m30 {mp gsave x w2 sub y w2 add w3 sub m currentpoint t 4 {side} repeat cl s gr} def
/m31 {mp x y w2 sub m 0 w d x w2 sub y m w 0 d x w2 sub y w2 add m w w neg d x w2 sub y w2 sub m w w d s} def
/m32 {mp x y w2 sub m w2 w d w neg 0 d cl s} def
/m33 {mp x y w2 add m w3 neg w2 neg d w3 w2 neg d w3 w2 d cl f} def
/m34 {mp x w2 sub y w2 sub w3 add m w3 0 d  0 w3 neg d w3 0 d 0 w3 d w3 0 d  0 w3 d w3 neg 0 d 0 w3 d w3 neg 0 d 0 w3 neg d w3 neg 0 d cl f } def
/m2 {mp x y w2 sub m 0 w d x w2 sub y m w 0 d s} def
/m5 {mp x w2 sub y w2 sub m w w d x w2 sub y w2 add m w w neg d s} def
/reEncode {exch findfont dup length dict begin {1 index /FID eq  {pop pop} {def} ifelse } forall /Encoding exch def currentdict end dup /FontName get exch definefont pop } def [/Times-Bold /Times-Italic /Times-BoldItalic /Helvetica /Helvetica-Oblique
 /Helvetica-Bold /Helvetica-BoldOblique /Courier /Courier-Oblique /Courier-Bold /Courier-BoldOblique /Times-Roman /AvantGarde-Book /AvantGarde-BookOblique /AvantGarde-Demi /AvantGarde-DemiOblique /Bookman-Demi /Bookman-DemiItalic /Bookman-Light
 /Bookman-LightItalic /Helvetica-Narrow /Helvetica-Narrow-Bold /Helvetica-Narrow-BoldOblique /Helvetica-Narrow-Oblique /NewCenturySchlbk-Roman /NewCenturySchlbk-Bold /NewCenturySchlbk-BoldItalic /NewCenturySchlbk-Italic /Palatino-Bold
 /Palatino-BoldItalic /Palatino-Italic /Palatino-Roman ] {ISOLatin1Encoding reEncode } forall%%EndProlog
%%BeginSetup
%%EndSetup
newpath  gsave  .25 .25 scale  gsave  0 0 t black[  ] 0 sd 3 lw 1 1 1 c 2268 2190 0 0 bf black 1 1 1 c 1792 1730 362 352 bf black 1792 1730 362 352 bl 1 1 1 c 1792 1730 362 352 bf black 1792 1730 362 352 bl 362 352 m 1792 X s
 gsave  2268 2190 0 0 C 1251.69 190.062 t 0 r /Helvetica-Bold findfont 81.4553 sf 0 0 m 
 881 831 804 777 754 704 654 631 604 558 513 467 445 399 354 304 272 213 190 167 122 94 44
(Total Cross section \(fb\)) K NC gr  439 404 m -52 Y s 505 378 m -26 Y s 570 378 m -26 Y s 636 378 m -26 Y s 702 404 m -52 Y s 767 378 m -26 Y s 833 378 m -26 Y s 899 378 m -26 Y s 964 404 m -52 Y s 1030 378 m -26 Y s 1095 378 m -26 Y s 1161 378 m
 -26 Y s 1227 404 m -52 Y s 1292 378 m -26 Y s 1358 378 m -26 Y s 1424 378 m -26 Y s 1489 404 m -52 Y s 1555 378 m -26 Y s 1621 378 m -26 Y s 1686 378 m -26 Y s 1752 404 m -52 Y s 1818 378 m -26 Y s 1883 378 m -26 Y s 1949 378 m -26 Y s 2015 404 m
 -52 Y s 439 404 m -52 Y s 373 378 m -26 Y s 2015 404 m -52 Y s 2080 378 m -26 Y s 2146 378 m -26 Y s
 gsave  2268 2190 0 0 C 365.438 281.312 t 0 r /Helvetica-Bold findfont 71.6807 sf 0 0 m (0.26) show NC gr 
 gsave  2268 2190 0 0 C 632.625 281.312 t 0 r /Helvetica-Bold findfont 71.6807 sf 0 0 m (0.28) show NC gr 
 gsave  2268 2190 0 0 C 912.812 281.312 t 0 r /Helvetica-Bold findfont 71.6807 sf 0 0 m (0.3) show NC gr 
 gsave  2268 2190 0 0 C 1157.19 281.312 t 0 r /Helvetica-Bold findfont 71.6807 sf 0 0 m (0.32) show NC gr 
 gsave  2268 2190 0 0 C 1417.81 281.312 t 0 r /Helvetica-Bold findfont 71.6807 sf 0 0 m (0.34) show NC gr 
 gsave  2268 2190 0 0 C 1678.5 281.312 t 0 r /Helvetica-Bold findfont 71.6807 sf 0 0 m (0.36) show NC gr 
 gsave  2268 2190 0 0 C 1945.69 281.312 t 0 r /Helvetica-Bold findfont 71.6807 sf 0 0 m (0.38) show NC gr  362 2082 m 1792 X s 439 2030 m 52 Y s 505 2056 m 26 Y s 570 2056 m 26 Y s 636 2056 m 26 Y s 702 2030 m 52 Y s 767 2056 m 26 Y s 833 2056 m 26 Y
 s 899 2056 m 26 Y s 964 2030 m 52 Y s 1030 2056 m 26 Y s 1095 2056 m 26 Y s 1161 2056 m 26 Y s 1227 2030 m 52 Y s 1292 2056 m 26 Y s 1358 2056 m 26 Y s 1424 2056 m 26 Y s 1489 2030 m 52 Y s 1555 2056 m 26 Y s 1621 2056 m 26 Y s 1686 2056 m 26 Y s
 1752 2030 m 52 Y s 1818 2056 m 26 Y s 1883 2056 m 26 Y s 1949 2056 m 26 Y s 2015 2030 m 52 Y s 439 2030 m 52 Y s 373 2056 m 26 Y s 2015 2030 m 52 Y s 2080 2056 m 26 Y s 2146 2056 m 26 Y s 362 352 m 1730 Y s
 gsave  2268 2190 0 0 C 150.375 1203.38 t 90 r /Helvetica-Bold findfont 81.4553 sf 0 0 m (Lepton cut acceptance) show NC gr  415 530 m -53 X s 389 584 m -27 X s 389 637 m -27 X s 389 691 m -27 X s 389 745 m -27 X s 415 799 m -53 X s 389 852 m -27 X s
 389 906 m -27 X s 389 960 m -27 X s 389 1014 m -27 X s 415 1067 m -53 X s 389 1121 m -27 X s 389 1175 m -27 X s 389 1229 m -27 X s 389 1282 m -27 X s 415 1336 m -53 X s 389 1390 m -27 X s 389 1444 m -27 X s 389 1498 m -27 X s 389 1551 m -27 X s 415
 1605 m -53 X s 389 1659 m -27 X s 389 1713 m -27 X s 389 1766 m -27 X s 389 1820 m -27 X s 415 1874 m -53 X s 415 530 m -53 X s 389 476 m -27 X s 389 422 m -27 X s 389 369 m -27 X s 415 1874 m -53 X s 389 1928 m -27 X s 389 1981 m -27 X s 389 2035 m
 -27 X s
 gsave  2268 2190 0 0 C 251.375 506.125 t 0 r /Helvetica-Bold findfont 71.6807 sf 0 0 m (0.8) show NC gr 
 gsave  2268 2190 0 0 C 218.812 776.562 t 0 r /Helvetica-Bold findfont 71.6807 sf 0 0 m (0.81) show NC gr 
 gsave  2268 2190 0 0 C 212.312 1043.75 t 0 r /Helvetica-Bold findfont 71.6807 sf 0 0 m (0.82) show NC gr 
 gsave  2268 2190 0 0 C 212.312 1314.12 t 0 r /Helvetica-Bold findfont 71.6807 sf 0 0 m (0.83) show NC gr 
 gsave  2268 2190 0 0 C 209.062 1581.31 t 0 r /Helvetica-Bold findfont 71.6807 sf 0 0 m (0.84) show NC gr 
 gsave  2268 2190 0 0 C 209.062 1851.75 t 0 r /Helvetica-Bold findfont 71.6807 sf 0 0 m (0.85) show NC gr  2154 352 m 1730 Y s 2100 530 m 54 X s 2127 584 m 27 X s 2127 637 m 27 X s 2127 691 m 27 X s 2127 745 m 27 X s 2100 799 m 54 X s 2127 852 m 27 X
 s 2127 906 m 27 X s 2127 960 m 27 X s 2127 1014 m 27 X s 2100 1067 m 54 X s 2127 1121 m 27 X s 2127 1175 m 27 X s 2127 1229 m 27 X s 2127 1282 m 27 X s 2100 1336 m 54 X s 2127 1390 m 27 X s 2127 1444 m 27 X s 2127 1498 m 27 X s 2127 1551 m 27 X s
 2100 1605 m 54 X s 2127 1659 m 27 X s 2127 1713 m 27 X s 2127 1766 m 27 X s 2127 1820 m 27 X s 2100 1874 m 54 X s 2100 530 m 54 X s 2127 476 m 27 X s 2127 422 m 27 X s 2127 369 m 27 X s 2100 1874 m 54 X s 2127 1928 m 27 X s 2127 1981 m 27 X s 2127
 2035 m 27 X s 0.999 0.999 0.999 c black 0 0 1 c /w 39 def /w2 {w 2 div} def /w3 {w 3 div} def 1200 1136 1342 1243 1197 1400 1019 1336 1143 1540 1269 1313 1118 1309 1106 1424 1363 1164 1208 1169 1229 1526 1350 970 956 1339 1199 1367 1310 1561 1138
 1464 1270 1506 1220 1324 1194 1218 1173 1265 1178 1380 1077 1180 1058 1735 1194 1287 1257 1321 1015 1341 992 1290 1157 1245 1256 1288 1148 1400 1217 1647 995 1184 1627 927 1580 997 1258 1118 1042 1369 1343 1236 1274 1037 1390 1206 1177 1169 1309
 1267 1529 1074 967 1562 1527 861 1396 1211 1190 1286 1240 1153 1453 1200 1369 1357 1230 1314 1475 1244 1495 1106 1252 1186 1199 1190 1607 1229 1163 1369 1297 1295 1315 1279 1197 1170 983 1287 1329 1309 1458 1185 1547 1135 1156 1262 1294 1378 1269
 1221 1177 1255 1160 1502 1135 1236 1607 1237 1016 1606 1388 1473 1388 1126 1308 1311 1209 1205 1095 1333 1307 1249 511 1175 1345 1205 1165 1270 1180 1432 1296 1248 738 1629 1075 1938 1452 1192 1091 1356 1621 949 1347 1116 1167 1208 1381 1132 1376
 1245 1343 1225 1314 1211 1017 1174 1167 1186 1329 1222 1203 1234 1145 1180 1706 1125 1435 1292 100 { m22} R 1175 1414 1448 1103 1528 1249 1475 1160 1185 1238 1265 1089 1187 1201 1361 1216 1184 1693 1203 1220 1311 1071 1417 1244 1185 1119 1162 1443
 981 1372 1300 1312 1222 1324 1188 1224 1184 1271 1168 1321 1244 1282 1191 1218 1285 1068 1417 1226 1315 1093 1175 1457 1339 1239 1193 1147 1181 1258 1207 1532 1148 1241 1097 1493 1068 1163 1248 1344 1561 1119 1416 1104 1347 1068 1302 1377 1273 1494
 1286 1250 1113 1357 996 1567 1352 1213 1312 1199 1359 1113 1801 739 1444 1211 1169 1196 1310 1276 1305 1227 1164 1263 1226 1144 1516 834 1446 961 1174 1206 1446 1269 1093 1562 1443 1226 1249 1317 1140 1199 995 1404 1171 1359 1193 1588 1329 1223 1121
 1211 1131 1247 1352 1064 1135 1281 1207 1101 1505 882 901 1248 1099 1180 1355 1210 1088 1191 944 1376 1096 1316 1174 1309 1446 1165 1359 1283 1181 1283 1713 911 1023 1564 1205 1442 976 1208 1386 1241 1044 1337 1200 1341 1096 1279 1457 842 1615 891
 1212 1149 1311 1331 1266 1165 1339 1268 1348 1273 823 1306 905 1487 1345 1237 1398 883 1334 1154 100 { m22} R 1445 1367 1264 1289 1481 1053 1063 1170 1584 904 1523 1487 1568 913 1465 991 1346 1350 1342 1290 1718 1042 1512 1104 1683 891 1450 946 1396
 1178 1465 951 1591 1237 1584 1023 1367 1143 1396 1122 1414 1109 1566 1280 1575 1131 1533 1194 1564 771 1337 1070 1570 1218 1288 1297 1473 1240 1368 1282 1335 1147 1500 1151 1298 1238 1739 1153 1609 1088 1586 1172 1491 1180 1555 1062 1333 1258 1614
 1203 1408 1248 1576 1229 1403 1257 1520 1079 1249 1145 1339 1230 1533 1226 1441 1254 1672 1217 1538 1121 1604 1269 1477 1302 1566 1076 1274 1239 1514 1204 1580 1143 1591 1230 1714 770 1830 839 1580 1152 1473 1148 1358 1284 1347 1200 1455 1219 1279
 1177 1353 1541 1246 1212 1354 1204 1499 1204 1452 1173 1704 1199 1284 1255 1423 1230 986 1458 1591 1165 1630 1258 1515 1241 1431 1158 1375 1229 1545 1278 1435 1244 1657 1149 1634 1469 1460 1362 1488 1125 2004 783 1594 1205 1673 1166 1770 1030 1446
 1428 1551 789 1474 1180 1482 1177 1551 1145 1284 1231 1535 1322 1535 1044 1494 1290 1491 1453 1393 1263 100 { m22} R 1584 1281 1771 1176 1524 1130 1759 1219 1681 1244 1454 1167 1560 520 1863 1142 8 { m22} R black 1 0 0 c 1056 828 1082 773 1030 882
 1069 844 1030 882 1069 844 1030 882 1240 798 885 877 1069 844 1030 794 1056 915 1043 899 1122 823 951 961 1030 882 1069 844 1056 740 1056 828 964 888 1095 790 990 832 1122 823 951 1141 1201 496 1030 882 1095 877 1030 882 1069 844 1082 860 1030 882
 1004 849 1095 877 1174 972 1017 689 1082 860 1043 811 1043 899 1056 828 990 921 1109 806 1095 790 1030 794 1082 773 1030 882 1030 794 1082 860 1030 882 1148 598 1043 899 1056 828 1069 844 990 921 53 { m20} R black 0.35 0.83 0.33 c 1280 1012 1297
 1012 1266 1012 1280 1013 1280 1011 1281 1012 1279 1012 1283 1012 1278 1012 1275 1013 1287 1011 1250 1017 1299 1009 1284 1011 1274 1014 1274 1017 1282 1010 1233 1030 1337 990 1283 1009 1277 1014 1359 969 1149 1081 1227 1039 1315 994 1247 1028 1296
 1005 1260 1018 1301 1001 1245 1020 1341 998 1268 1019 1285 1009 1289 1008 1274 1014 1299 997 1270 1020 1295 1091 1283 916 1286 1009 1278 1013 41 { m21} R black
 gsave  2268 2190 0 0 C 668.438 1929.94 t 0 r /Helvetica findfont 101.005 sf 0 0 m 
 279 222 171 145 88 60
(= 7 TeV) K NC gr 
 gsave  2268 2190 0 0 C 619.562 1929.94 t 0 r /Helvetica findfont 101.005 sf 0 0 m (s) show NC gr  6 lw 554 1984 m 46 -58 d s 0 lw 600 1926 m 9 88 d s 609 2014 m 59 X s
 gsave  2268 2190 0 0 C 2245.44 1359.75 t 90 r /Helvetica-BoldOblique findfont 61.9061 sf 0 0 m 
 676 647 613 579 562 514 456 439 398 357 340 300 252 204 187 143 126 82 37
(LHC HIGGS XS WG 2011) K NC gr  3 lw 1 1 1 c 847 329 1303 1756 bf black 1323 1756 m -13 Y 840 X 323 Y -13 X -310 Y f 1303 1756 m 329 Y 847 X -329 Y -847 X cl s
 gsave  2268 2190 0 0 C 1515.56 2027.69 t 0 r /Helvetica findfont 52.1314 sf 0 0 m (mH = 400 GeV) show NC gr  0.999 0.999 0.999 c black
 gsave  2268 2190 0 0 C 1515.56 1946.25 t 0 r /Helvetica findfont 52.1314 sf 0 0 m (CT10: corr = \2550.503928) show NC gr  1 0 0 c 1409 1962 m20 black
 gsave  2268 2190 0 0 C 1515.56 1861.56 t 0 r /Helvetica findfont 52.1314 sf 0 0 m 
 446 418 389 375 347 330 315 286 271 254 237 209 184 169 155 108 76 42
(MSTW: corr = \2550.566) K NC gr  0.35 0.83 0.33 c 1409 1880 m21 black
 gsave  2268 2190 0 0 C 1515.56 1780.06 t 0 r /Helvetica findfont 52.1314 sf 0 0 m (NNPDF: corr = \2550.531601) show NC gr  0 0 1 c 1409 1797 m22
 gr  gr showpage
end
%%EOF
