%!PS-Adobe-2.0 EPSF-2.0
%%BoundingBox:  0 0 567 547
%%Title: Hqt_powheg_weight_function.eps: c1
%%Creator: ROOT Version 5.28/00a
%%CreationDate: Sat Jan  7 17:37:30 2012
%%EndComments
%%BeginProlog
80 dict begin
/s {stroke} def /l {lineto} def /m {moveto} def /t {translate} def
/r {rotate} def /rl {roll}  def /R {repeat} def
/d {rlineto} def /rm {rmoveto} def /gr {grestore} def /f {eofill} def
/c {setrgbcolor} def /black {0 setgray} def /sd {setdash} def
/cl {closepath} def /sf {scalefont setfont} def /lw {setlinewidth} def
/box {m dup 0 exch d exch 0 d 0 exch neg d cl} def
/NC{systemdict begin initclip end}def/C{NC box clip newpath}def
/bl {box s} def /bf {box f} def /Y { 0 exch d} def /X { 0 d} def 
/K {{pop pop 0 moveto} exch kshow} bind def
/ita {/ang 15 def gsave [1 0 ang dup sin exch cos div 1 0 0] concat} def 
/mp {newpath /y exch def /x exch def} def
/side {[w .77 mul w .23 mul] .385 w mul sd w 0 l currentpoint t -144 r} def
/mr {mp x y w2 0 360 arc} def /m24 {mr s} def /m20 {mr f} def
/mb {mp x y w2 add m w2 neg 0 d 0 w neg d w 0 d 0 w d cl} def
/mt {mp x y w2 add m w2 neg w neg d w 0 d cl} def
/m21 {mb f} def /m25 {mb s} def /m22 {mt f} def /m26{mt s} def
/m23 {mp x y w2 sub m w2 w d w neg 0 d cl f} def
/m27 {mp x y w2 add m w3 neg w2 neg d w3 w2 neg d w3 w2 d cl s} def
/m28 {mp x w2 sub y w2 sub w3 add m w3 0 d  0 w3 neg d w3 0 d 0 w3 d w3 0 d  0 w3 d w3 neg 0 d 0 w3 d w3 neg 0 d 0 w3 neg d w3 neg 0 d cl s } def
/m29 {mp gsave x w2 sub y w2 add w3 sub m currentpoint t 4 {side} repeat cl fill gr} def
/m30 {mp gsave x w2 sub y w2 add w3 sub m currentpoint t 4 {side} repeat cl s gr} def
/m31 {mp x y w2 sub m 0 w d x w2 sub y m w 0 d x w2 sub y w2 add m w w neg d x w2 sub y w2 sub m w w d s} def
/m32 {mp x y w2 sub m w2 w d w neg 0 d cl s} def
/m33 {mp x y w2 add m w3 neg w2 neg d w3 w2 neg d w3 w2 d cl f} def
/m34 {mp x w2 sub y w2 sub w3 add m w3 0 d  0 w3 neg d w3 0 d 0 w3 d w3 0 d  0 w3 d w3 neg 0 d 0 w3 d w3 neg 0 d 0 w3 neg d w3 neg 0 d cl f } def
/m2 {mp x y w2 sub m 0 w d x w2 sub y m w 0 d s} def
/m5 {mp x w2 sub y w2 sub m w w d x w2 sub y w2 add m w w neg d s} def
/reEncode {exch findfont dup length dict begin {1 index /FID eq  {pop pop} {def} ifelse } forall /Encoding exch def currentdict end dup /FontName get exch definefont pop } def [/Times-Bold /Times-Italic /Times-BoldItalic /Helvetica /Helvetica-Oblique
 /Helvetica-Bold /Helvetica-BoldOblique /Courier /Courier-Oblique /Courier-Bold /Courier-BoldOblique /Times-Roman /AvantGarde-Book /AvantGarde-BookOblique /AvantGarde-Demi /AvantGarde-DemiOblique /Bookman-Demi /Bookman-DemiItalic /Bookman-Light
 /Bookman-LightItalic /Helvetica-Narrow /Helvetica-Narrow-Bold /Helvetica-Narrow-BoldOblique /Helvetica-Narrow-Oblique /NewCenturySchlbk-Roman /NewCenturySchlbk-Bold /NewCenturySchlbk-BoldItalic /NewCenturySchlbk-Italic /Palatino-Bold
 /Palatino-BoldItalic /Palatino-Italic /Palatino-Roman ] {ISOLatin1Encoding reEncode } forall%%EndProlog
%%BeginSetup
%%EndSetup
newpath  gsave  .25 .25 scale  gsave  0 0 t black[  ] 0 sd 3 lw 1 1 1 c 2268 2190 0 0 bf black 1 1 1 c 1791 1730 363 350 bf black 1791 1730 363 350 bl 1 0 0 c 6 lw 0.95 0.95 0.95 c black 1 0 0 c 372 1998 m 18 -78 d 18 -72 d 18 -67 d 17 -63 d 18 -58 d
 18 -55 d 18 -51 d 18 -48 d 18 -45 d 18 -42 d 18 -40 d 18 -37 d 18 -36 d 18 -34 d 18 -32 d 17 -31 d 18 -29 d 18 -29 d 18 -27 d 18 -27 d 18 -27 d 18 -25 d 18 -26 d 18 -25 d 18 -25 d 18 -24 d 17 -25 d 18 -24 d 18 -24 d 18 -24 d 18 -25 d 18 -23 d 18 -24
 d 18 -24 d 18 -23 d 18 -23 d 18 -23 d 18 -22 d 17 -21 d 18 -21 d 18 -20 d 18 -18 d 18 -18 d 18 -16 d 18 -15 d 18 -13 d 18 -10 d 18 -9 d 18 -6 d s 1250 494 m 18 -3 d 17 -1 d 18 3 d 18 7 d 18 10 d 18 -81 d 770 X s 2127 429 m 18 X s black 3 lw 363 350
 m 1791 X s
 gsave  2268 2190 0 0 C 1857.31 131.125 t 0 r /Helvetica findfont 101.005 sf 0 0 m ( \(GeV\)) show NC gr 
 gsave  2268 2190 0 0 C 1815 79 t 0 r /Helvetica findfont 68.4225 sf 0 0 m (T) show NC gr 
 gsave  2268 2190 0 0 C 1463.06 131.125 t 0 r /Helvetica findfont 101.005 sf 0 0 m (Higgs P) show NC gr  363 402 m -52 Y s 408 376 m -26 Y s 452 376 m -26 Y s 497 376 m -26 Y s 542 402 m -52 Y s 587 376 m -26 Y s 632 376 m -26 Y s 676 376 m -26 Y s
 721 402 m -52 Y s 766 376 m -26 Y s 811 376 m -26 Y s 855 376 m -26 Y s 900 402 m -52 Y s 945 376 m -26 Y s 990 376 m -26 Y s 1035 376 m -26 Y s 1079 402 m -52 Y s 1124 376 m -26 Y s 1169 376 m -26 Y s 1214 376 m -26 Y s 1259 402 m -52 Y s 1303 376
 m -26 Y s 1348 376 m -26 Y s 1393 376 m -26 Y s 1438 402 m -52 Y s 1483 376 m -26 Y s 1527 376 m -26 Y s 1572 376 m -26 Y s 1617 402 m -52 Y s 1662 376 m -26 Y s 1706 376 m -26 Y s 1751 376 m -26 Y s 1796 402 m -52 Y s 1841 376 m -26 Y s 1886 376 m
 -26 Y s 1930 376 m -26 Y s 1975 402 m -52 Y s 2020 376 m -26 Y s 2065 376 m -26 Y s 2110 376 m -26 Y s 2154 402 m -52 Y s
 gsave  2268 2190 0 0 C 335.812 254.938 t 0 r /Helvetica findfont 101.005 sf 0 0 m (0) show NC gr 
 gsave  2268 2190 0 0 C 485.625 254.938 t 0 r /Helvetica findfont 101.005 sf 0 0 m (20) show NC gr 
 gsave  2268 2190 0 0 C 664.812 254.938 t 0 r /Helvetica findfont 101.005 sf 0 0 m (40) show NC gr 
 gsave  2268 2190 0 0 C 844.062 254.938 t 0 r /Helvetica findfont 101.005 sf 0 0 m (60) show NC gr 
 gsave  2268 2190 0 0 C 1023.25 254.938 t 0 r /Helvetica findfont 101.005 sf 0 0 m (80) show NC gr 
 gsave  2268 2190 0 0 C 1173.12 254.938 t 0 r /Helvetica findfont 101.005 sf 0 0 m (100) show NC gr 
 gsave  2268 2190 0 0 C 1352.31 254.938 t 0 r /Helvetica findfont 101.005 sf 0 0 m (120) show NC gr 
 gsave  2268 2190 0 0 C 1531.5 254.938 t 0 r /Helvetica findfont 101.005 sf 0 0 m (140) show NC gr 
 gsave  2268 2190 0 0 C 1710.69 254.938 t 0 r /Helvetica findfont 101.005 sf 0 0 m (160) show NC gr 
 gsave  2268 2190 0 0 C 1889.94 254.938 t 0 r /Helvetica findfont 101.005 sf 0 0 m (180) show NC gr 
 gsave  2268 2190 0 0 C 2069.12 254.938 t 0 r /Helvetica findfont 101.005 sf 0 0 m (200) show NC gr  363 2080 m 1791 X s 363 2028 m 52 Y s 408 2054 m 26 Y s 452 2054 m 26 Y s 497 2054 m 26 Y s 542 2028 m 52 Y s 587 2054 m 26 Y s 632 2054 m 26 Y s 676
 2054 m 26 Y s 721 2028 m 52 Y s 766 2054 m 26 Y s 811 2054 m 26 Y s 855 2054 m 26 Y s 900 2028 m 52 Y s 945 2054 m 26 Y s 990 2054 m 26 Y s 1035 2054 m 26 Y s 1079 2028 m 52 Y s 1124 2054 m 26 Y s 1169 2054 m 26 Y s 1214 2054 m 26 Y s 1259 2028 m 52
 Y s 1303 2054 m 26 Y s 1348 2054 m 26 Y s 1393 2054 m 26 Y s 1438 2028 m 52 Y s 1483 2054 m 26 Y s 1527 2054 m 26 Y s 1572 2054 m 26 Y s 1617 2028 m 52 Y s 1662 2054 m 26 Y s 1706 2054 m 26 Y s 1751 2054 m 26 Y s 1796 2028 m 52 Y s 1841 2054 m 26 Y
 s 1886 2054 m 26 Y s 1930 2054 m 26 Y s 1975 2028 m 52 Y s 2020 2054 m 26 Y s 2065 2054 m 26 Y s 2110 2054 m 26 Y s 2154 2028 m 52 Y s 363 350 m 1730 Y s
 gsave  2268 2190 0 0 C 169.625 1157.44 t 90 r /Helvetica findfont 101.005 sf 0 0 m 
 907 850 794 771 714 619 591 534 477 420 347 290 222 193 130 74
(HqT/Powheg Weight) K NC gr  417 487 m -54 X s 390 525 m -27 X s 390 564 m -27 X s 390 602 m -27 X s 390 640 m -27 X s 417 678 m -54 X s 390 717 m -27 X s 390 755 m -27 X s 390 793 m -27 X s 390 831 m -27 X s 417 870 m -54 X s 390 908 m -27 X s 390
 946 m -27 X s 390 984 m -27 X s 390 1023 m -27 X s 417 1061 m -54 X s 390 1099 m -27 X s 390 1137 m -27 X s 390 1176 m -27 X s 390 1214 m -27 X s 417 1252 m -54 X s 390 1291 m -27 X s 390 1329 m -27 X s 390 1367 m -27 X s 390 1405 m -27 X s 417 1444
 m -54 X s 390 1482 m -27 X s 390 1520 m -27 X s 390 1558 m -27 X s 390 1597 m -27 X s 417 1635 m -54 X s 390 1673 m -27 X s 390 1711 m -27 X s 390 1750 m -27 X s 390 1788 m -27 X s 417 1826 m -54 X s 390 1864 m -27 X s 390 1903 m -27 X s 390 1941 m
 -27 X s 390 1979 m -27 X s 417 2018 m -54 X s 417 487 m -54 X s 390 449 m -27 X s 390 411 m -27 X s 390 372 m -27 X s 417 2018 m -54 X s 390 2056 m -27 X s
 gsave  2268 2190 0 0 C 212 450.438 t 0 r /Helvetica findfont 101.005 sf 0 0 m (0.6) show NC gr 
 gsave  2268 2190 0 0 C 212 642.625 t 0 r /Helvetica findfont 101.005 sf 0 0 m (0.7) show NC gr 
 gsave  2268 2190 0 0 C 212 831.625 t 0 r /Helvetica findfont 101.005 sf 0 0 m (0.8) show NC gr 
 gsave  2268 2190 0 0 C 212 1023.88 t 0 r /Helvetica findfont 101.005 sf 0 0 m (0.9) show NC gr 
 gsave  2268 2190 0 0 C 309.75 1216.12 t 0 r /Helvetica findfont 101.005 sf 0 0 m (1) show NC gr 
 gsave  2268 2190 0 0 C 225.062 1408.31 t 0 r /Helvetica findfont 101.005 sf 0 0 m (1.1) show NC gr 
 gsave  2268 2190 0 0 C 212 1597.31 t 0 r /Helvetica findfont 101.005 sf 0 0 m (1.2) show NC gr 
 gsave  2268 2190 0 0 C 212 1789.56 t 0 r /Helvetica findfont 101.005 sf 0 0 m (1.3) show NC gr 
 gsave  2268 2190 0 0 C 212 1981.75 t 0 r /Helvetica findfont 101.005 sf 0 0 m (1.4) show NC gr  2154 350 m 1730 Y s 2101 487 m 53 X s 2127 525 m 27 X s 2127 564 m 27 X s 2127 602 m 27 X s 2127 640 m 27 X s 2101 678 m 53 X s 2127 717 m 27 X s 2127
 755 m 27 X s 2127 793 m 27 X s 2127 831 m 27 X s 2101 870 m 53 X s 2127 908 m 27 X s 2127 946 m 27 X s 2127 984 m 27 X s 2127 1023 m 27 X s 2101 1061 m 53 X s 2127 1099 m 27 X s 2127 1137 m 27 X s 2127 1176 m 27 X s 2127 1214 m 27 X s 2101 1252 m 53
 X s 2127 1291 m 27 X s 2127 1329 m 27 X s 2127 1367 m 27 X s 2127 1405 m 27 X s 2101 1444 m 53 X s 2127 1482 m 27 X s 2127 1520 m 27 X s 2127 1558 m 27 X s 2127 1597 m 27 X s 2101 1635 m 53 X s 2127 1673 m 27 X s 2127 1711 m 27 X s 2127 1750 m 27 X
 s 2127 1788 m 27 X s 2101 1826 m 53 X s 2127 1864 m 27 X s 2127 1903 m 27 X s 2127 1941 m 27 X s 2127 1979 m 27 X s 2101 2018 m 53 X s 2101 487 m 53 X s 2127 449 m 27 X s 2127 411 m 27 X s 2127 372 m 27 X s 2101 2018 m 53 X s 2127 2056 m 27 X s 0 1
 0 c 6 lw 0.95 0.95 0.95 c black 0 1 0 c 372 1981 m 18 -74 d 18 -69 d 18 -65 d 17 -61 d 18 -56 d 18 -54 d 18 -49 d 18 -47 d 18 -43 d 18 -41 d 18 -39 d 18 -36 d 18 -34 d 18 -32 d 18 -31 d 17 -29 d 18 -28 d 18 -26 d 18 -25 d 18 -25 d 18 -23 d 18 -23 d
 18 -22 d 18 -22 d 18 -21 d 18 -21 d 17 -21 d 18 -20 d 18 -21 d 18 -20 d 18 -20 d 18 -20 d 18 -20 d 18 -20 d 18 -20 d 18 -20 d 18 -20 d 18 -19 d 17 -20 d 18 -19 d 18 -19 d 18 -19 d 18 -19 d 18 -17 d 18 -18 d 18 -17 d 18 -15 d 18 -15 d 18 -14 d s 1250
 552 m 18 -13 d 17 -12 d 18 -10 d 18 -8 d 18 -6 d 18 -5 d 18 -2 d 18 X 18 3 d 18 5 d 18 -64 d 680 X s 2127 440 m 18 X s 0 0 1 c 0.95 0.95 0.95 c black 0 0 1 c 372 1985 m 18 -73 d 18 -69 d 18 -63 d 17 -60 d 18 -56 d 18 -51 d 18 -49 d 18 -45 d 18 -42 d
 18 -40 d 18 -37 d 18 -34 d 18 -33 d 18 -31 d 18 -29 d 17 -27 d 18 -26 d 18 -25 d 18 -24 d 18 -23 d 18 -22 d 18 -22 d 18 -21 d 18 -21 d 18 -20 d 18 -20 d 17 -20 d 18 -19 d 18 -20 d 18 -20 d 18 -19 d 18 -20 d 18 -20 d 18 -20 d 18 -20 d 18 -20 d 18 -21
 d 18 -20 d 17 -20 d 18 -21 d 18 -20 d 18 -20 d 18 -20 d 18 -20 d 18 -19 d 18 -19 d 18 -18 d 18 -18 d 18 -17 d s 1250 571 m 18 -16 d 17 -15 d 18 -14 d 18 -12 d 18 -11 d 18 -9 d 18 -7 d 18 -5 d 18 -2 d 18 X 18 2 d 18 6 d 18 9 d 17 12 d 18 17 d 18 -90
 d 591 X s 2127 436 m 18 X s 1 0 1 c 0.95 0.95 0.95 c black 1 0 1 c 372 1853 m 18 -48 d 18 -47 d 18 -44 d 17 -42 d 18 -41 d 18 -38 d 18 -37 d 18 -36 d 18 -34 d 18 -32 d 18 -31 d 18 -30 d 18 -29 d 18 -28 d 18 -27 d 17 -26 d 18 -25 d 18 -24 d 18 -24 d
 18 -23 d 18 -22 d 18 -22 d 18 -21 d 18 -21 d 18 -21 d 18 -20 d 17 -20 d 18 -20 d 18 -19 d 18 -19 d 18 -19 d 18 -19 d 18 -19 d 18 -18 d 18 -19 d 18 -18 d 18 -18 d 18 -18 d 17 -18 d 18 -18 d 18 -18 d 18 -18 d 18 -17 d 18 -18 d 18 -17 d 18 -17 d 18 -17
 d 18 -17 d 18 -16 d s 1250 643 m 18 -16 d 17 -16 d 18 -15 d 18 -15 d 18 -14 d 18 -14 d 18 -14 d 18 -12 d 18 -12 d 18 -11 d 18 -11 d 18 -9 d 18 -9 d 17 -7 d 18 -7 d 18 -5 d 18 -4 d 18 -2 d 18 -1 d 18 1 d 18 20 d 501 X s 2127 470 m 18 X s black 3 lw 1
 1 1 c 907 548 1134 1423 bf black
 gsave  2268 2190 0 0 C 1485.88 1877.5 t 0 r /Helvetica findfont 104.263 sf 0 0 m 
 450 392 312 283 225 168 118 89 29
( = 110 GeV) K NC gr 
 gsave  2268 2190 0 0 C 1440.31 1848.19 t 0 r /Helvetica findfont 68.4225 sf 0 0 m (H) show NC gr 
 gsave  2268 2190 0 0 C 1358.81 1877.5 t 0 r /Helvetica findfont 104.263 sf 0 0 m (M) show NC gr  1 0 0 c 6 lw 1168 1902 m 159 X s black
 gsave  2268 2190 0 0 C 1485.88 1740.69 t 0 r /Helvetica findfont 104.263 sf 0 0 m ( = 120 GeV) show NC gr 
 gsave  2268 2190 0 0 C 1440.31 1711.38 t 0 r /Helvetica findfont 68.4225 sf 0 0 m (H) show NC gr 
 gsave  2268 2190 0 0 C 1358.81 1740.69 t 0 r /Helvetica findfont 104.263 sf 0 0 m (M) show NC gr  0 1 0 c 1168 1765 m 159 X s black
 gsave  2268 2190 0 0 C 1485.88 1603.81 t 0 r /Helvetica findfont 104.263 sf 0 0 m ( = 130 GeV) show NC gr 
 gsave  2268 2190 0 0 C 1440.31 1574.5 t 0 r /Helvetica findfont 68.4225 sf 0 0 m (H) show NC gr 
 gsave  2268 2190 0 0 C 1358.81 1603.81 t 0 r /Helvetica findfont 104.263 sf 0 0 m (M) show NC gr  0 0 1 c 1168 1628 m 159 X s black
 gsave  2268 2190 0 0 C 1485.88 1467 t 0 r /Helvetica findfont 104.263 sf 0 0 m ( = 140 GeV) show NC gr 
 gsave  2268 2190 0 0 C 1440.31 1437.69 t 0 r /Helvetica findfont 68.4225 sf 0 0 m (H) show NC gr 
 gsave  2268 2190 0 0 C 1358.81 1467 t 0 r /Helvetica findfont 104.263 sf 0 0 m (M) show NC gr  1 0 1 c 1168 1492 m 159 X s black[  12 12 ] 0 sd 363 1252 m 1800 X s
 gsave  2268 2190 0 0 C 2222.25 1590.81 t 90 r /Helvetica-BoldOblique findfont 42.3568 sf 0 0 m 
 452 432 409 387 375 343 305 293 266 239 227 200 168 136 125 96 84 55 25
(LHC HIGGS XS WG 2011) K NC gr 
 gr  gr showpage
end
%%EOF
