%!PS-Adobe-2.0
%%BoundingBox: 116 64 401 290
%%HiResBoundingBox: 116.603996 64.007998 400.589917 289.650015
%%EndComments
%!PS-Adobe-2.0 EPSF-2.0
%%Title: comb-11-MCNLO-1mmcnlo_UE_mT-lin.eps
%%Creator: gnuplot 4.2 patchlevel 6 
%%CreationDate: Thu Nov 24 19:16:31 2011
%%DocumentFonts: (atend)
%%BoundingBox: 50 50 410 302
%%EndComments
%%BeginProlog
/gnudict 256 dict def
gnudict begin
%
% The following 6 true/false flags may be edited by hand if required
% The unit line width may also be changed
%
/Color true def
/Blacktext false def
/Solid false def
/Dashlength 1 def
/Landscape false def
/Level1 false def
/Rounded false def
/TransparentPatterns false def
/gnulinewidth 5.000 def
/userlinewidth gnulinewidth def
%
/vshift -80 def
/dl1 {
  10.0 Dashlength mul mul
  Rounded { currentlinewidth 0.75 mul sub dup 0 le { pop 0.01 } if } if
} def
/dl2 {
  10.0 Dashlength mul mul
  Rounded { currentlinewidth 0.75 mul add } if
} def
/hpt_ 31.5 def
/vpt_ 31.5 def
/hpt hpt_ def
/vpt vpt_ def
Level1 {} {
/SDict 10 dict def
systemdict /pdfmark known not {
  userdict /pdfmark systemdict /cleartomark get put
} if
SDict begin [
  /Title (comb-11-MCNLO-1mmcnlo_UE_mT-lin.eps)
  /Subject (gnuplot plot)
  /Creator (gnuplot 4.2 patchlevel 6 )
  /Author (Paolo Nason,,,)
%  /Producer (gnuplot)
%  /Keywords ()
  /CreationDate (Thu Nov 24 19:16:31 2011)
  /DOCINFO pdfmark
end
} ifelse
%
% Gnuplot Prolog Version 4.2 (August 2006)
%
/M {moveto} bind def
/L {lineto} bind def
/R {rmoveto} bind def
/V {rlineto} bind def
/N {newpath moveto} bind def
/Z {closepath} bind def
/C {setrgbcolor} bind def
/f {rlineto fill} bind def
/vpt2 vpt 2 mul def
/hpt2 hpt 2 mul def
/Lshow {currentpoint stroke M 0 vshift R 
	Blacktext {gsave 0 setgray show grestore} {show} ifelse} def
/Rshow {currentpoint stroke M dup stringwidth pop neg vshift R
	Blacktext {gsave 0 setgray show grestore} {show} ifelse} def
/Cshow {currentpoint stroke M dup stringwidth pop -2 div vshift R 
	Blacktext {gsave 0 setgray show grestore} {show} ifelse} def
/UP {dup vpt_ mul /vpt exch def hpt_ mul /hpt exch def
  /hpt2 hpt 2 mul def /vpt2 vpt 2 mul def} def
/DL {Color {setrgbcolor Solid {pop []} if 0 setdash}
 {pop pop pop 0 setgray Solid {pop []} if 0 setdash} ifelse} def
/BL {stroke userlinewidth 2 mul setlinewidth
	Rounded {1 setlinejoin 1 setlinecap} if} def
/AL {stroke userlinewidth 2 div setlinewidth
	Rounded {1 setlinejoin 1 setlinecap} if} def
/UL {dup gnulinewidth mul /userlinewidth exch def
	dup 1 lt {pop 1} if 10 mul /udl exch def} def
/PL {stroke userlinewidth setlinewidth
	Rounded {1 setlinejoin 1 setlinecap} if} def
% Default Line colors
/LCw {1 1 1} def
/LCb {0 0 0} def
/LCa {0 0 0} def
/LC0 {1 0 0} def
/LC1 {0 1 0} def
/LC2 {0 0 1} def
/LC3 {1 0 1} def
/LC4 {0 1 1} def
/LC5 {1 1 0} def
/LC6 {0 0 0} def
/LC7 {1 0.3 0} def
/LC8 {0.5 0.5 0.5} def
% Default Line Types
/LTw {PL [] 1 setgray} def
/LTb {BL [] LCb DL} def
/LTa {AL [1 udl mul 2 udl mul] 0 setdash LCa setrgbcolor} def
/LT0 {PL [] LC0 DL} def
/LT1 {PL [4 dl1 2 dl2] LC1 DL} def
/LT2 {PL [2 dl1 3 dl2] LC2 DL} def
/LT3 {PL [1 dl1 1.5 dl2] LC3 DL} def
/LT4 {PL [6 dl1 2 dl2 1 dl1 2 dl2] LC4 DL} def
/LT5 {PL [3 dl1 3 dl2 1 dl1 3 dl2] LC5 DL} def
/LT6 {PL [2 dl1 2 dl2 2 dl1 6 dl2] LC6 DL} def
/LT7 {PL [1 dl1 2 dl2 6 dl1 2 dl2 1 dl1 2 dl2] LC7 DL} def
/LT8 {PL [2 dl1 2 dl2 2 dl1 2 dl2 2 dl1 2 dl2 2 dl1 4 dl2] LC8 DL} def
/Pnt {stroke [] 0 setdash gsave 1 setlinecap M 0 0 V stroke grestore} def
/Dia {stroke [] 0 setdash 2 copy vpt add M
  hpt neg vpt neg V hpt vpt neg V
  hpt vpt V hpt neg vpt V closepath stroke
  Pnt} def
/Pls {stroke [] 0 setdash vpt sub M 0 vpt2 V
  currentpoint stroke M
  hpt neg vpt neg R hpt2 0 V stroke
 } def
/Box {stroke [] 0 setdash 2 copy exch hpt sub exch vpt add M
  0 vpt2 neg V hpt2 0 V 0 vpt2 V
  hpt2 neg 0 V closepath stroke
  Pnt} def
/Crs {stroke [] 0 setdash exch hpt sub exch vpt add M
  hpt2 vpt2 neg V currentpoint stroke M
  hpt2 neg 0 R hpt2 vpt2 V stroke} def
/TriU {stroke [] 0 setdash 2 copy vpt 1.12 mul add M
  hpt neg vpt -1.62 mul V
  hpt 2 mul 0 V
  hpt neg vpt 1.62 mul V closepath stroke
  Pnt} def
/Star {2 copy Pls Crs} def
/BoxF {stroke [] 0 setdash exch hpt sub exch vpt add M
  0 vpt2 neg V hpt2 0 V 0 vpt2 V
  hpt2 neg 0 V closepath fill} def
/TriUF {stroke [] 0 setdash vpt 1.12 mul add M
  hpt neg vpt -1.62 mul V
  hpt 2 mul 0 V
  hpt neg vpt 1.62 mul V closepath fill} def
/TriD {stroke [] 0 setdash 2 copy vpt 1.12 mul sub M
  hpt neg vpt 1.62 mul V
  hpt 2 mul 0 V
  hpt neg vpt -1.62 mul V closepath stroke
  Pnt} def
/TriDF {stroke [] 0 setdash vpt 1.12 mul sub M
  hpt neg vpt 1.62 mul V
  hpt 2 mul 0 V
  hpt neg vpt -1.62 mul V closepath fill} def
/DiaF {stroke [] 0 setdash vpt add M
  hpt neg vpt neg V hpt vpt neg V
  hpt vpt V hpt neg vpt V closepath fill} def
/Pent {stroke [] 0 setdash 2 copy gsave
  translate 0 hpt M 4 {72 rotate 0 hpt L} repeat
  closepath stroke grestore Pnt} def
/PentF {stroke [] 0 setdash gsave
  translate 0 hpt M 4 {72 rotate 0 hpt L} repeat
  closepath fill grestore} def
/Circle {stroke [] 0 setdash 2 copy
  hpt 0 360 arc stroke Pnt} def
/CircleF {stroke [] 0 setdash hpt 0 360 arc fill} def
/C0 {BL [] 0 setdash 2 copy moveto vpt 90 450 arc} bind def
/C1 {BL [] 0 setdash 2 copy moveto
	2 copy vpt 0 90 arc closepath fill
	vpt 0 360 arc closepath} bind def
/C2 {BL [] 0 setdash 2 copy moveto
	2 copy vpt 90 180 arc closepath fill
	vpt 0 360 arc closepath} bind def
/C3 {BL [] 0 setdash 2 copy moveto
	2 copy vpt 0 180 arc closepath fill
	vpt 0 360 arc closepath} bind def
/C4 {BL [] 0 setdash 2 copy moveto
	2 copy vpt 180 270 arc closepath fill
	vpt 0 360 arc closepath} bind def
/C5 {BL [] 0 setdash 2 copy moveto
	2 copy vpt 0 90 arc
	2 copy moveto
	2 copy vpt 180 270 arc closepath fill
	vpt 0 360 arc} bind def
/C6 {BL [] 0 setdash 2 copy moveto
	2 copy vpt 90 270 arc closepath fill
	vpt 0 360 arc closepath} bind def
/C7 {BL [] 0 setdash 2 copy moveto
	2 copy vpt 0 270 arc closepath fill
	vpt 0 360 arc closepath} bind def
/C8 {BL [] 0 setdash 2 copy moveto
	2 copy vpt 270 360 arc closepath fill
	vpt 0 360 arc closepath} bind def
/C9 {BL [] 0 setdash 2 copy moveto
	2 copy vpt 270 450 arc closepath fill
	vpt 0 360 arc closepath} bind def
/C10 {BL [] 0 setdash 2 copy 2 copy moveto vpt 270 360 arc closepath fill
	2 copy moveto
	2 copy vpt 90 180 arc closepath fill
	vpt 0 360 arc closepath} bind def
/C11 {BL [] 0 setdash 2 copy moveto
	2 copy vpt 0 180 arc closepath fill
	2 copy moveto
	2 copy vpt 270 360 arc closepath fill
	vpt 0 360 arc closepath} bind def
/C12 {BL [] 0 setdash 2 copy moveto
	2 copy vpt 180 360 arc closepath fill
	vpt 0 360 arc closepath} bind def
/C13 {BL [] 0 setdash 2 copy moveto
	2 copy vpt 0 90 arc closepath fill
	2 copy moveto
	2 copy vpt 180 360 arc closepath fill
	vpt 0 360 arc closepath} bind def
/C14 {BL [] 0 setdash 2 copy moveto
	2 copy vpt 90 360 arc closepath fill
	vpt 0 360 arc} bind def
/C15 {BL [] 0 setdash 2 copy vpt 0 360 arc closepath fill
	vpt 0 360 arc closepath} bind def
/Rec {newpath 4 2 roll moveto 1 index 0 rlineto 0 exch rlineto
	neg 0 rlineto closepath} bind def
/Square {dup Rec} bind def
/Bsquare {vpt sub exch vpt sub exch vpt2 Square} bind def
/S0 {BL [] 0 setdash 2 copy moveto 0 vpt rlineto BL Bsquare} bind def
/S1 {BL [] 0 setdash 2 copy vpt Square fill Bsquare} bind def
/S2 {BL [] 0 setdash 2 copy exch vpt sub exch vpt Square fill Bsquare} bind def
/S3 {BL [] 0 setdash 2 copy exch vpt sub exch vpt2 vpt Rec fill Bsquare} bind def
/S4 {BL [] 0 setdash 2 copy exch vpt sub exch vpt sub vpt Square fill Bsquare} bind def
/S5 {BL [] 0 setdash 2 copy 2 copy vpt Square fill
	exch vpt sub exch vpt sub vpt Square fill Bsquare} bind def
/S6 {BL [] 0 setdash 2 copy exch vpt sub exch vpt sub vpt vpt2 Rec fill Bsquare} bind def
/S7 {BL [] 0 setdash 2 copy exch vpt sub exch vpt sub vpt vpt2 Rec fill
	2 copy vpt Square fill Bsquare} bind def
/S8 {BL [] 0 setdash 2 copy vpt sub vpt Square fill Bsquare} bind def
/S9 {BL [] 0 setdash 2 copy vpt sub vpt vpt2 Rec fill Bsquare} bind def
/S10 {BL [] 0 setdash 2 copy vpt sub vpt Square fill 2 copy exch vpt sub exch vpt Square fill
	Bsquare} bind def
/S11 {BL [] 0 setdash 2 copy vpt sub vpt Square fill 2 copy exch vpt sub exch vpt2 vpt Rec fill
	Bsquare} bind def
/S12 {BL [] 0 setdash 2 copy exch vpt sub exch vpt sub vpt2 vpt Rec fill Bsquare} bind def
/S13 {BL [] 0 setdash 2 copy exch vpt sub exch vpt sub vpt2 vpt Rec fill
	2 copy vpt Square fill Bsquare} bind def
/S14 {BL [] 0 setdash 2 copy exch vpt sub exch vpt sub vpt2 vpt Rec fill
	2 copy exch vpt sub exch vpt Square fill Bsquare} bind def
/S15 {BL [] 0 setdash 2 copy Bsquare fill Bsquare} bind def
/D0 {gsave translate 45 rotate 0 0 S0 stroke grestore} bind def
/D1 {gsave translate 45 rotate 0 0 S1 stroke grestore} bind def
/D2 {gsave translate 45 rotate 0 0 S2 stroke grestore} bind def
/D3 {gsave translate 45 rotate 0 0 S3 stroke grestore} bind def
/D4 {gsave translate 45 rotate 0 0 S4 stroke grestore} bind def
/D5 {gsave translate 45 rotate 0 0 S5 stroke grestore} bind def
/D6 {gsave translate 45 rotate 0 0 S6 stroke grestore} bind def
/D7 {gsave translate 45 rotate 0 0 S7 stroke grestore} bind def
/D8 {gsave translate 45 rotate 0 0 S8 stroke grestore} bind def
/D9 {gsave translate 45 rotate 0 0 S9 stroke grestore} bind def
/D10 {gsave translate 45 rotate 0 0 S10 stroke grestore} bind def
/D11 {gsave translate 45 rotate 0 0 S11 stroke grestore} bind def
/D12 {gsave translate 45 rotate 0 0 S12 stroke grestore} bind def
/D13 {gsave translate 45 rotate 0 0 S13 stroke grestore} bind def
/D14 {gsave translate 45 rotate 0 0 S14 stroke grestore} bind def
/D15 {gsave translate 45 rotate 0 0 S15 stroke grestore} bind def
/DiaE {stroke [] 0 setdash vpt add M
  hpt neg vpt neg V hpt vpt neg V
  hpt vpt V hpt neg vpt V closepath stroke} def
/BoxE {stroke [] 0 setdash exch hpt sub exch vpt add M
  0 vpt2 neg V hpt2 0 V 0 vpt2 V
  hpt2 neg 0 V closepath stroke} def
/TriUE {stroke [] 0 setdash vpt 1.12 mul add M
  hpt neg vpt -1.62 mul V
  hpt 2 mul 0 V
  hpt neg vpt 1.62 mul V closepath stroke} def
/TriDE {stroke [] 0 setdash vpt 1.12 mul sub M
  hpt neg vpt 1.62 mul V
  hpt 2 mul 0 V
  hpt neg vpt -1.62 mul V closepath stroke} def
/PentE {stroke [] 0 setdash gsave
  translate 0 hpt M 4 {72 rotate 0 hpt L} repeat
  closepath stroke grestore} def
/CircE {stroke [] 0 setdash 
  hpt 0 360 arc stroke} def
/Opaque {gsave closepath 1 setgray fill grestore 0 setgray closepath} def
/DiaW {stroke [] 0 setdash vpt add M
  hpt neg vpt neg V hpt vpt neg V
  hpt vpt V hpt neg vpt V Opaque stroke} def
/BoxW {stroke [] 0 setdash exch hpt sub exch vpt add M
  0 vpt2 neg V hpt2 0 V 0 vpt2 V
  hpt2 neg 0 V Opaque stroke} def
/TriUW {stroke [] 0 setdash vpt 1.12 mul add M
  hpt neg vpt -1.62 mul V
  hpt 2 mul 0 V
  hpt neg vpt 1.62 mul V Opaque stroke} def
/TriDW {stroke [] 0 setdash vpt 1.12 mul sub M
  hpt neg vpt 1.62 mul V
  hpt 2 mul 0 V
  hpt neg vpt -1.62 mul V Opaque stroke} def
/PentW {stroke [] 0 setdash gsave
  translate 0 hpt M 4 {72 rotate 0 hpt L} repeat
  Opaque stroke grestore} def
/CircW {stroke [] 0 setdash 
  hpt 0 360 arc Opaque stroke} def
/BoxFill {gsave Rec 1 setgray fill grestore} def
/Density {
  /Fillden exch def
  currentrgbcolor
  /ColB exch def /ColG exch def /ColR exch def
  /ColR ColR Fillden mul Fillden sub 1 add def
  /ColG ColG Fillden mul Fillden sub 1 add def
  /ColB ColB Fillden mul Fillden sub 1 add def
  ColR ColG ColB setrgbcolor} def
/BoxColFill {gsave Rec PolyFill} def
/PolyFill {gsave Density fill grestore grestore} def
/h {rlineto rlineto rlineto gsave closepath fill grestore} bind def
%
% PostScript Level 1 Pattern Fill routine for rectangles
% Usage: x y w h s a XX PatternFill
%	x,y = lower left corner of box to be filled
%	w,h = width and height of box
%	  a = angle in degrees between lines and x-axis
%	 XX = 0/1 for no/yes cross-hatch
%
/PatternFill {gsave /PFa [ 9 2 roll ] def
  PFa 0 get PFa 2 get 2 div add PFa 1 get PFa 3 get 2 div add translate
  PFa 2 get -2 div PFa 3 get -2 div PFa 2 get PFa 3 get Rec
  gsave 1 setgray fill grestore clip
  currentlinewidth 0.5 mul setlinewidth
  /PFs PFa 2 get dup mul PFa 3 get dup mul add sqrt def
  0 0 M PFa 5 get rotate PFs -2 div dup translate
  0 1 PFs PFa 4 get div 1 add floor cvi
	{PFa 4 get mul 0 M 0 PFs V} for
  0 PFa 6 get ne {
	0 1 PFs PFa 4 get div 1 add floor cvi
	{PFa 4 get mul 0 2 1 roll M PFs 0 V} for
 } if
  stroke grestore} def
%
/languagelevel where
 {pop languagelevel} {1} ifelse
 2 lt
	{/InterpretLevel1 true def}
	{/InterpretLevel1 Level1 def}
 ifelse
%
% PostScript level 2 pattern fill definitions
%
/Level2PatternFill {
/Tile8x8 {/PaintType 2 /PatternType 1 /TilingType 1 /BBox [0 0 8 8] /XStep 8 /YStep 8}
	bind def
/KeepColor {currentrgbcolor [/Pattern /DeviceRGB] setcolorspace} bind def
<< Tile8x8
 /PaintProc {0.5 setlinewidth pop 0 0 M 8 8 L 0 8 M 8 0 L stroke} 
>> matrix makepattern
/Pat1 exch def
<< Tile8x8
 /PaintProc {0.5 setlinewidth pop 0 0 M 8 8 L 0 8 M 8 0 L stroke
	0 4 M 4 8 L 8 4 L 4 0 L 0 4 L stroke}
>> matrix makepattern
/Pat2 exch def
<< Tile8x8
 /PaintProc {0.5 setlinewidth pop 0 0 M 0 8 L
	8 8 L 8 0 L 0 0 L fill}
>> matrix makepattern
/Pat3 exch def
<< Tile8x8
 /PaintProc {0.5 setlinewidth pop -4 8 M 8 -4 L
	0 12 M 12 0 L stroke}
>> matrix makepattern
/Pat4 exch def
<< Tile8x8
 /PaintProc {0.5 setlinewidth pop -4 0 M 8 12 L
	0 -4 M 12 8 L stroke}
>> matrix makepattern
/Pat5 exch def
<< Tile8x8
 /PaintProc {0.5 setlinewidth pop -2 8 M 4 -4 L
	0 12 M 8 -4 L 4 12 M 10 0 L stroke}
>> matrix makepattern
/Pat6 exch def
<< Tile8x8
 /PaintProc {0.5 setlinewidth pop -2 0 M 4 12 L
	0 -4 M 8 12 L 4 -4 M 10 8 L stroke}
>> matrix makepattern
/Pat7 exch def
<< Tile8x8
 /PaintProc {0.5 setlinewidth pop 8 -2 M -4 4 L
	12 0 M -4 8 L 12 4 M 0 10 L stroke}
>> matrix makepattern
/Pat8 exch def
<< Tile8x8
 /PaintProc {0.5 setlinewidth pop 0 -2 M 12 4 L
	-4 0 M 12 8 L -4 4 M 8 10 L stroke}
>> matrix makepattern
/Pat9 exch def
/Pattern1 {PatternBgnd KeepColor Pat1 setpattern} bind def
/Pattern2 {PatternBgnd KeepColor Pat2 setpattern} bind def
/Pattern3 {PatternBgnd KeepColor Pat3 setpattern} bind def
/Pattern4 {PatternBgnd KeepColor Landscape {Pat5} {Pat4} ifelse setpattern} bind def
/Pattern5 {PatternBgnd KeepColor Landscape {Pat4} {Pat5} ifelse setpattern} bind def
/Pattern6 {PatternBgnd KeepColor Landscape {Pat9} {Pat6} ifelse setpattern} bind def
/Pattern7 {PatternBgnd KeepColor Landscape {Pat8} {Pat7} ifelse setpattern} bind def
} def
%
%
%End of PostScript Level 2 code
%
/PatternBgnd {
  TransparentPatterns {} {gsave 1 setgray fill grestore} ifelse
} def
%
% Substitute for Level 2 pattern fill codes with
% grayscale if Level 2 support is not selected.
%
/Level1PatternFill {
/Pattern1 {0.250 Density} bind def
/Pattern2 {0.500 Density} bind def
/Pattern3 {0.750 Density} bind def
/Pattern4 {0.125 Density} bind def
/Pattern5 {0.375 Density} bind def
/Pattern6 {0.625 Density} bind def
/Pattern7 {0.875 Density} bind def
} def
%
% Now test for support of Level 2 code
%
Level1 {Level1PatternFill} {Level2PatternFill} ifelse
%
/Symbol-Oblique /Symbol findfont [1 0 .167 1 0 0] makefont
dup length dict begin {1 index /FID eq {pop pop} {def} ifelse} forall
currentdict end definefont pop
/MFshow {
   { dup 5 get 3 ge
     { 5 get 3 eq {gsave} {grestore} ifelse }
     {dup dup 0 get findfont exch 1 get scalefont setfont
     [ currentpoint ] exch dup 2 get 0 exch R dup 5 get 2 ne {dup dup 6
     get exch 4 get {show} {stringwidth pop 0 R} ifelse }if dup 5 get 0 eq
     {dup 3 get {2 get neg 0 exch R pop} {pop aload pop M} ifelse} {dup 5
     get 1 eq {dup 2 get exch dup 3 get exch 6 get stringwidth pop -2 div
     dup 0 R} {dup 6 get stringwidth pop -2 div 0 R 6 get
     show 2 index {aload pop M neg 3 -1 roll neg R pop pop} {pop pop pop
     pop aload pop M} ifelse }ifelse }ifelse }
     ifelse }
   forall} bind def
/MFwidth {0 exch { dup 5 get 3 ge { 5 get 3 eq { 0 } { pop } ifelse }
 {dup 3 get{dup dup 0 get findfont exch 1 get scalefont setfont
     6 get stringwidth pop add} {pop} ifelse} ifelse} forall} bind def
/MLshow { currentpoint stroke M
  0 exch R
  Blacktext {gsave 0 setgray MFshow grestore} {MFshow} ifelse } bind def
/MRshow { currentpoint stroke M
  exch dup MFwidth neg 3 -1 roll R
  Blacktext {gsave 0 setgray MFshow grestore} {MFshow} ifelse } bind def
/MCshow { currentpoint stroke M
  exch dup MFwidth -2 div 3 -1 roll R
  Blacktext {gsave 0 setgray MFshow grestore} {MFshow} ifelse } bind def
/XYsave    { [( ) 1 2 true false 3 ()] } bind def
/XYrestore { [( ) 1 2 true false 4 ()] } bind def
end
%%EndProlog
gnudict begin
gsave
50 50 translate
0.050 0.050 scale
0 setgray
newpath
(Helvetica) findfont 240 scalefont setfont
1.000 UL
LTb
1800 2520 M
63 0 V
4977 0 R
-63 0 V
stroke
1656 2520 M
[ [(Helvetica) 240.0 0.0 true true 0 (0)]
] -80.0 MRshow
1.000 UL
LTb
1800 3427 M
63 0 V
4977 0 R
-63 0 V
stroke
1656 3427 M
[ [(Helvetica) 240.0 0.0 true true 0 (0.2)]
] -80.0 MRshow
1.000 UL
LTb
1800 4334 M
63 0 V
4977 0 R
-63 0 V
stroke
1656 4334 M
[ [(Helvetica) 240.0 0.0 true true 0 (0.4)]
] -80.0 MRshow
1.000 UL
LTb
1800 2520 M
0 63 V
0 2205 R
0 -63 V
2430 2520 M
0 63 V
0 2205 R
0 -63 V
3060 2520 M
0 63 V
0 2205 R
0 -63 V
3690 2520 M
0 63 V
0 2205 R
0 -63 V
4320 2520 M
0 63 V
0 2205 R
0 -63 V
4950 2520 M
0 63 V
0 2205 R
0 -63 V
5580 2520 M
0 63 V
0 2205 R
0 -63 V
6210 2520 M
0 63 V
0 2205 R
0 -63 V
6840 2520 M
0 63 V
0 2205 R
0 -63 V
stroke
1800 4788 N
0 -2268 V
5040 0 V
0 2268 V
-5040 0 V
Z stroke
1.000 UP
1.000 UL
LTb
1.000 UP
1.000 UL
LT0
LTb
5769 4605 M
[ [(Helvetica) 240.0 0.0 true true 0 (MCatNLO-HW)]
] -80.0 MRshow
LT0
5913 4605 M
639 0 V
-639 31 R
0 -62 V
639 62 R
0 -62 V
1863 2897 M
126 532 V
126 288 V
126 215 V
126 82 V
126 33 V
126 -41 V
126 -53 V
126 -83 V
126 -85 V
189 -129 V
252 -162 V
252 -139 V
378 -173 V
567 -193 V
630 -147 V
630 -101 V
630 -68 V
315 -20 V
1863 2892 M
0 11 V
-31 -11 R
62 0 V
-62 11 R
62 0 V
95 518 R
0 16 V
-31 -16 R
62 0 V
-62 16 R
62 0 V
95 272 R
0 15 V
-31 -15 R
62 0 V
-62 15 R
62 0 V
95 200 R
0 15 V
-31 -15 R
62 0 V
-62 15 R
62 0 V
95 68 R
0 15 V
-31 -15 R
62 0 V
-62 15 R
62 0 V
95 17 R
0 15 V
-31 -15 R
62 0 V
-62 15 R
62 0 V
95 -55 R
0 15 V
-31 -15 R
62 0 V
-62 15 R
62 0 V
95 -68 R
0 14 V
-31 -14 R
62 0 V
-62 14 R
62 0 V
95 -96 R
0 13 V
-31 -13 R
62 0 V
-62 13 R
62 0 V
95 -99 R
0 13 V
-31 -13 R
62 0 V
-62 13 R
62 0 V
158 -139 R
0 8 V
-31 -8 R
62 0 V
-62 8 R
62 0 V
221 -170 R
0 8 V
-31 -8 R
62 0 V
-62 8 R
62 0 V
221 -146 R
0 7 V
-31 -7 R
62 0 V
-62 7 R
62 0 V
347 -179 R
0 4 V
stroke 4068 3184 M
-31 -4 R
62 0 V
-62 4 R
62 0 V
536 -197 R
0 4 V
-31 -4 R
62 0 V
-62 4 R
62 0 V
599 -151 R
0 3 V
-31 -3 R
62 0 V
-62 3 R
62 0 V
599 -103 R
0 2 V
-31 -2 R
62 0 V
-62 2 R
62 0 V
599 -70 R
0 2 V
-31 -2 R
62 0 V
-62 2 R
62 0 V
1800 2897 M
126 0 V
-126 -31 R
0 62 V
126 -62 R
0 62 V
0 501 R
126 0 V
-126 -31 R
0 62 V
126 -62 R
0 62 V
0 257 R
126 0 V
-126 -31 R
0 62 V
126 -62 R
0 62 V
0 184 R
126 0 V
-126 -31 R
0 62 V
126 -62 R
0 62 V
0 51 R
126 0 V
-126 -31 R
0 62 V
126 -62 R
0 62 V
0 2 R
126 0 V
-126 -31 R
0 62 V
126 -62 R
0 62 V
0 -72 R
126 0 V
-126 -31 R
0 62 V
126 -62 R
0 62 V
0 -84 R
126 0 V
-126 -31 R
0 62 V
126 -62 R
0 62 V
0 -114 R
126 0 V
-126 -31 R
0 62 V
126 -62 R
0 62 V
0 -116 R
126 0 V
-126 -31 R
0 62 V
126 -62 R
0 62 V
0 -160 R
252 0 V
-252 -31 R
0 62 V
252 -62 R
0 62 V
0 -193 R
252 0 V
-252 -31 R
0 62 V
252 -62 R
0 62 V
0 -170 R
252 0 V
-252 -31 R
0 62 V
stroke 3564 3386 M
252 -62 R
0 62 V
0 -204 R
504 0 V
-504 -31 R
0 62 V
504 -62 R
0 62 V
0 -224 R
630 0 V
-630 -31 R
0 62 V
630 -62 R
0 62 V
0 -178 R
630 0 V
-630 -31 R
0 62 V
630 -62 R
0 62 V
0 -132 R
630 0 V
-630 -31 R
0 62 V
630 -62 R
0 62 V
0 -99 R
630 0 V
-630 -31 R
0 62 V
630 -62 R
0 62 V
0 -93 R
0 -31 R
0 62 V
0 -62 R
0 62 V
1863 2897 Pls
1989 3429 Pls
2115 3717 Pls
2241 3932 Pls
2367 4014 Pls
2493 4047 Pls
2619 4006 Pls
2745 3953 Pls
2871 3870 Pls
2997 3785 Pls
3186 3656 Pls
3438 3494 Pls
3690 3355 Pls
4068 3182 Pls
4635 2989 Pls
5265 2842 Pls
5895 2741 Pls
6525 2673 Pls
6232 4605 Pls
1.000 UP
1.000 UL
LT0
LTb
5769 4365 M
[ [(Helvetica) 240.0 0.0 true true 0 ( )]
] -80.0 MRshow
LT0
5913 4365 M
639 0 V
-639 31 R
0 -62 V
639 62 R
0 -62 V
1863 2783 M
126 398 V
126 226 V
126 151 V
126 81 V
126 15 V
126 -36 V
126 -32 V
126 -68 V
126 -62 V
189 -92 V
252 -126 V
252 -107 V
378 -125 V
567 -150 V
630 -110 V
630 -75 V
630 -50 V
315 -15 V
1863 2779 M
0 8 V
-31 -8 R
62 0 V
-62 8 R
62 0 V
95 388 R
0 11 V
-31 -11 R
62 0 V
-62 11 R
62 0 V
95 216 R
0 10 V
-31 -10 R
62 0 V
-62 10 R
62 0 V
95 141 R
0 10 V
-31 -10 R
62 0 V
-62 10 R
62 0 V
95 71 R
0 10 V
-31 -10 R
62 0 V
-62 10 R
62 0 V
95 5 R
0 11 V
-31 -11 R
62 0 V
-62 11 R
62 0 V
95 -47 R
0 10 V
-31 -10 R
62 0 V
-62 10 R
62 0 V
95 -42 R
0 10 V
-31 -10 R
62 0 V
-62 10 R
62 0 V
95 -77 R
0 9 V
-31 -9 R
62 0 V
-62 9 R
62 0 V
95 -72 R
0 10 V
-31 -10 R
62 0 V
-62 10 R
62 0 V
158 -100 R
0 6 V
-31 -6 R
62 0 V
-62 6 R
62 0 V
221 -132 R
0 5 V
-31 -5 R
62 0 V
-62 5 R
62 0 V
221 -112 R
0 6 V
-31 -6 R
62 0 V
-62 6 R
62 0 V
347 -130 R
0 4 V
stroke 4068 3008 M
-31 -4 R
62 0 V
-62 4 R
62 0 V
536 -154 R
0 3 V
-31 -3 R
62 0 V
-62 3 R
62 0 V
599 -112 R
0 2 V
-31 -2 R
62 0 V
-62 2 R
62 0 V
599 -76 R
0 1 V
-31 -1 R
62 0 V
-62 1 R
62 0 V
599 -52 R
0 1 V
-31 -1 R
62 0 V
-62 1 R
62 0 V
1800 2783 M
126 0 V
-126 -31 R
0 62 V
126 -62 R
0 62 V
0 367 R
126 0 V
-126 -31 R
0 62 V
126 -62 R
0 62 V
0 195 R
126 0 V
-126 -31 R
0 62 V
126 -62 R
0 62 V
0 120 R
126 0 V
-126 -31 R
0 62 V
126 -62 R
0 62 V
0 50 R
126 0 V
-126 -31 R
0 62 V
126 -62 R
0 62 V
0 -16 R
126 0 V
-126 -31 R
0 62 V
126 -62 R
0 62 V
0 -67 R
126 0 V
-126 -31 R
0 62 V
126 -62 R
0 62 V
0 -63 R
126 0 V
-126 -31 R
0 62 V
126 -62 R
0 62 V
0 -99 R
126 0 V
-126 -31 R
0 62 V
126 -62 R
0 62 V
0 -93 R
126 0 V
-126 -31 R
0 62 V
126 -62 R
0 62 V
0 -123 R
252 0 V
-252 -31 R
0 62 V
252 -62 R
0 62 V
0 -157 R
252 0 V
-252 -31 R
0 62 V
252 -62 R
0 62 V
0 -138 R
252 0 V
-252 -31 R
0 62 V
stroke 3564 3162 M
252 -62 R
0 62 V
0 -156 R
504 0 V
-504 -31 R
0 62 V
504 -62 R
0 62 V
0 -181 R
630 0 V
-630 -31 R
0 62 V
630 -62 R
0 62 V
0 -141 R
630 0 V
-630 -31 R
0 62 V
630 -62 R
0 62 V
0 -106 R
630 0 V
-630 -31 R
0 62 V
630 -62 R
0 62 V
0 -81 R
630 0 V
-630 -31 R
0 62 V
630 -62 R
0 62 V
0 -76 R
0 -31 R
0 62 V
0 -62 R
0 62 V
1863 2783 Crs
1989 3181 Crs
2115 3407 Crs
2241 3558 Crs
2367 3639 Crs
2493 3654 Crs
2619 3618 Crs
2745 3586 Crs
2871 3518 Crs
2997 3456 Crs
3186 3364 Crs
3438 3238 Crs
3690 3131 Crs
4068 3006 Crs
4635 2856 Crs
5265 2746 Crs
5895 2671 Crs
6525 2621 Crs
6232 4365 Crs
1.000 UP
1.000 UL
LT2
LTb
5769 4125 M
[ [(Helvetica) 240.0 0.0 true true 0 (HqT)]
] -80.0 MRshow
LT2
5913 4125 M
639 0 V
-639 31 R
0 -62 V
639 62 R
0 -62 V
1863 2880 M
126 804 V
126 493 V
126 220 V
126 52 V
126 -42 V
126 -92 V
126 -114 V
126 -120 V
126 -119 V
189 -168 V
252 -199 V
252 -168 V
378 -197 V
567 -211 V
630 -155 V
630 -101 V
630 -67 V
315 -21 V
1863 2880 M
-31 0 R
62 0 V
-62 0 R
62 0 V
95 804 R
-31 0 R
62 0 V
-62 0 R
62 0 V
95 493 R
-31 0 R
62 0 V
-62 0 R
62 0 V
95 220 R
-31 0 R
62 0 V
-62 0 R
62 0 V
95 52 R
-31 0 R
62 0 V
-62 0 R
62 0 V
95 -42 R
-31 0 R
62 0 V
-62 0 R
62 0 V
95 -92 R
-31 0 R
62 0 V
-62 0 R
62 0 V
95 -114 R
-31 0 R
62 0 V
-62 0 R
62 0 V
95 -120 R
-31 0 R
62 0 V
-62 0 R
62 0 V
95 -119 R
-31 0 R
62 0 V
-62 0 R
62 0 V
158 -168 R
-31 0 R
62 0 V
-62 0 R
62 0 V
221 -199 R
-31 0 R
62 0 V
-62 0 R
62 0 V
221 -168 R
-31 0 R
62 0 V
-62 0 R
62 0 V
347 -197 R
-31 0 R
62 0 V
-62 0 R
62 0 V
536 -211 R
-31 0 R
62 0 V
-62 0 R
62 0 V
599 -155 R
-31 0 R
62 0 V
-62 0 R
62 0 V
stroke 5296 2864 M
599 -101 R
-31 0 R
62 0 V
-62 0 R
62 0 V
599 -67 R
-31 0 R
62 0 V
-62 0 R
62 0 V
1800 2880 M
126 0 V
-126 -31 R
0 62 V
126 -62 R
0 62 V
0 773 R
126 0 V
-126 -31 R
0 62 V
126 -62 R
0 62 V
0 462 R
126 0 V
-126 -31 R
0 62 V
126 -62 R
0 62 V
0 189 R
126 0 V
-126 -31 R
0 62 V
126 -62 R
0 62 V
0 21 R
126 0 V
-126 -31 R
0 62 V
126 -62 R
0 62 V
0 -73 R
126 0 V
-126 -31 R
0 62 V
126 -62 R
0 62 V
0 -123 R
126 0 V
-126 -31 R
0 62 V
126 -62 R
0 62 V
0 -145 R
126 0 V
-126 -31 R
0 62 V
126 -62 R
0 62 V
0 -151 R
126 0 V
-126 -31 R
0 62 V
126 -62 R
0 62 V
0 -150 R
126 0 V
-126 -31 R
0 62 V
126 -62 R
0 62 V
0 -199 R
252 0 V
-252 -31 R
0 62 V
252 -62 R
0 62 V
0 -230 R
252 0 V
-252 -31 R
0 62 V
252 -62 R
0 62 V
0 -199 R
252 0 V
-252 -31 R
0 62 V
252 -62 R
0 62 V
0 -228 R
504 0 V
-504 -31 R
0 62 V
504 -62 R
0 62 V
0 -242 R
630 0 V
-630 -31 R
0 62 V
630 -62 R
0 62 V
0 -186 R
630 0 V
-630 -31 R
0 62 V
stroke 4950 2895 M
630 -62 R
0 62 V
0 -132 R
630 0 V
-630 -31 R
0 62 V
630 -62 R
0 62 V
0 -98 R
630 0 V
-630 -31 R
0 62 V
630 -62 R
0 62 V
0 -94 R
0 -31 R
0 62 V
0 -62 R
0 62 V
1863 2880 Star
1989 3684 Star
2115 4177 Star
2241 4397 Star
2367 4449 Star
2493 4407 Star
2619 4315 Star
2745 4201 Star
2871 4081 Star
2997 3962 Star
3186 3794 Star
3438 3595 Star
3690 3427 Star
4068 3230 Star
4635 3019 Star
5265 2864 Star
5895 2763 Star
6525 2696 Star
6232 4125 Star
1.000 UP
1.000 UL
LT2
LTb
5769 3885 M
[ [(Helvetica) 240.0 0.0 true true 0 ( )]
] -80.0 MRshow
LT2
5913 3885 M
639 0 V
-639 31 R
0 -62 V
639 62 R
0 -62 V
1863 2754 M
126 851 V
126 396 V
126 160 V
126 21 V
126 -54 V
126 -91 V
126 -107 V
126 -111 V
126 -107 V
189 -149 V
252 -174 V
252 -144 V
378 -166 V
567 -176 V
630 -125 V
630 -80 V
630 -53 V
315 -15 V
1863 2754 M
-31 0 R
62 0 V
-62 0 R
62 0 V
95 851 R
-31 0 R
62 0 V
-62 0 R
62 0 V
95 396 R
-31 0 R
62 0 V
-62 0 R
62 0 V
95 160 R
-31 0 R
62 0 V
-62 0 R
62 0 V
95 21 R
-31 0 R
62 0 V
-62 0 R
62 0 V
95 -54 R
-31 0 R
62 0 V
-62 0 R
62 0 V
95 -91 R
-31 0 R
62 0 V
-62 0 R
62 0 V
95 -107 R
-31 0 R
62 0 V
-62 0 R
62 0 V
95 -111 R
-31 0 R
62 0 V
-62 0 R
62 0 V
95 -107 R
-31 0 R
62 0 V
-62 0 R
62 0 V
158 -149 R
-31 0 R
62 0 V
-62 0 R
62 0 V
221 -174 R
-31 0 R
62 0 V
-62 0 R
62 0 V
221 -144 R
-31 0 R
62 0 V
-62 0 R
62 0 V
347 -166 R
-31 0 R
62 0 V
-62 0 R
62 0 V
536 -176 R
-31 0 R
62 0 V
-62 0 R
62 0 V
599 -125 R
-31 0 R
62 0 V
-62 0 R
62 0 V
stroke 5296 2778 M
599 -80 R
-31 0 R
62 0 V
-62 0 R
62 0 V
599 -53 R
-31 0 R
62 0 V
-62 0 R
62 0 V
1800 2754 M
126 0 V
-126 -31 R
0 62 V
126 -62 R
0 62 V
0 820 R
126 0 V
-126 -31 R
0 62 V
126 -62 R
0 62 V
0 365 R
126 0 V
-126 -31 R
0 62 V
126 -62 R
0 62 V
0 129 R
126 0 V
-126 -31 R
0 62 V
126 -62 R
0 62 V
0 -10 R
126 0 V
-126 -31 R
0 62 V
126 -62 R
0 62 V
0 -85 R
126 0 V
-126 -31 R
0 62 V
126 -62 R
0 62 V
0 -122 R
126 0 V
-126 -31 R
0 62 V
126 -62 R
0 62 V
0 -138 R
126 0 V
-126 -31 R
0 62 V
126 -62 R
0 62 V
0 -142 R
126 0 V
-126 -31 R
0 62 V
126 -62 R
0 62 V
0 -138 R
126 0 V
-126 -31 R
0 62 V
126 -62 R
0 62 V
0 -180 R
252 0 V
-252 -31 R
0 62 V
252 -62 R
0 62 V
0 -205 R
252 0 V
-252 -31 R
0 62 V
252 -62 R
0 62 V
0 -175 R
252 0 V
-252 -31 R
0 62 V
252 -62 R
0 62 V
0 -197 R
504 0 V
-504 -31 R
0 62 V
504 -62 R
0 62 V
0 -207 R
630 0 V
-630 -31 R
0 62 V
630 -62 R
0 62 V
0 -156 R
630 0 V
-630 -31 R
0 62 V
stroke 4950 2809 M
630 -62 R
0 62 V
0 -111 R
630 0 V
-630 -31 R
0 62 V
630 -62 R
0 62 V
0 -84 R
630 0 V
-630 -31 R
0 62 V
630 -62 R
0 62 V
0 -78 R
0 -31 R
0 62 V
0 -62 R
0 62 V
1863 2754 Box
1989 3605 Box
2115 4001 Box
2241 4161 Box
2367 4182 Box
2493 4128 Box
2619 4037 Box
2745 3930 Box
2871 3819 Box
2997 3712 Box
3186 3563 Box
3438 3389 Box
3690 3245 Box
4068 3079 Box
4635 2903 Box
5265 2778 Box
5895 2698 Box
6525 2645 Box
6232 3885 Box
1.000 UL
LTb
1800 4788 N
0 -2268 V
5040 0 V
0 2268 V
-5040 0 V
Z stroke
1.000 UP
1.000 UL
LTb
1.000 UL
LTb
1800 1008 M
63 0 V
4977 0 R
-63 0 V
stroke
1656 1008 M
[ [(Helvetica) 240.0 0.0 true true 0 (0)]
] -80.0 MRshow
1.000 UL
LTb
1800 1386 M
63 0 V
4977 0 R
-63 0 V
stroke
1656 1386 M
[ [(Helvetica) 240.0 0.0 true true 0 (0.5)]
] -80.0 MRshow
1.000 UL
LTb
1800 1764 M
63 0 V
4977 0 R
-63 0 V
stroke
1656 1764 M
[ [(Helvetica) 240.0 0.0 true true 0 (1)]
] -80.0 MRshow
1.000 UL
LTb
1800 2142 M
63 0 V
4977 0 R
-63 0 V
stroke
1656 2142 M
[ [(Helvetica) 240.0 0.0 true true 0 (1.5)]
] -80.0 MRshow
1.000 UL
LTb
1800 2520 M
63 0 V
4977 0 R
-63 0 V
stroke
1656 2520 M
[ [(Helvetica) 240.0 0.0 true true 0 ( )]
] -80.0 MRshow
1.000 UL
LTb
1800 1008 M
0 63 V
0 1449 R
0 -63 V
stroke
1800 768 M
[ [(Helvetica) 240.0 0.0 true true 0 ( 0)]
] -80.0 MCshow
1.000 UL
LTb
2430 1008 M
0 63 V
0 1449 R
0 -63 V
stroke
2430 768 M
[ [(Helvetica) 240.0 0.0 true true 0 ( 10)]
] -80.0 MCshow
1.000 UL
LTb
3060 1008 M
0 63 V
0 1449 R
0 -63 V
stroke
3060 768 M
[ [(Helvetica) 240.0 0.0 true true 0 ( 20)]
] -80.0 MCshow
1.000 UL
LTb
3690 1008 M
0 63 V
0 1449 R
0 -63 V
stroke
3690 768 M
[ [(Helvetica) 240.0 0.0 true true 0 ( 30)]
] -80.0 MCshow
1.000 UL
LTb
4320 1008 M
0 63 V
0 1449 R
0 -63 V
stroke
4320 768 M
[ [(Helvetica) 240.0 0.0 true true 0 ( 40)]
] -80.0 MCshow
1.000 UL
LTb
4950 1008 M
0 63 V
0 1449 R
0 -63 V
stroke
4950 768 M
[ [(Helvetica) 240.0 0.0 true true 0 ( 50)]
] -80.0 MCshow
1.000 UL
LTb
5580 1008 M
0 63 V
0 1449 R
0 -63 V
stroke
5580 768 M
[ [(Helvetica) 240.0 0.0 true true 0 ( 60)]
] -80.0 MCshow
1.000 UL
LTb
6210 1008 M
0 63 V
0 1449 R
0 -63 V
stroke
6210 768 M
[ [(Helvetica) 240.0 0.0 true true 0 ( 70)]
] -80.0 MCshow
1.000 UL
LTb
6840 1008 M
0 63 V
0 1449 R
0 -63 V
stroke
6840 768 M
[ [(Helvetica) 240.0 0.0 true true 0 ( 80)]
] -80.0 MCshow
1.000 UL
LTb
1.000 UL
LTb
1800 2520 N
0 -1512 V
5040 0 V
0 1512 V
-5040 0 V
Z stroke
LCb setrgbcolor
4320 408 M
[ [(Helvetica) 240.0 0.0 true true 0 (p)]
[(Helvetica) 192.0 -72.0 true true 0 (T)]
[(Helvetica) 240.0 0.0 true true 0 ( \(GeV\))]
] -56.0 MCshow
LTb
1.000 UP
1.000 UL
LTb
1.000 UP
1.000 UL
LT0
1863 1862 M
126 -237 V
126 -35 V
126 28 V
126 21 V
126 30 V
126 17 V
126 21 V
126 13 V
126 12 V
189 16 V
252 16 V
252 17 V
378 17 V
567 17 V
630 7 V
630 -12 V
630 -21 V
315 -16 V
-4977 76 R
0 26 V
-31 -26 R
62 0 V
-62 26 R
62 0 V
95 -256 R
0 11 V
-31 -11 R
62 0 V
-62 11 R
62 0 V
95 -44 R
0 8 V
-31 -8 R
62 0 V
-62 8 R
62 0 V
95 21 R
0 6 V
-31 -6 R
62 0 V
-62 6 R
62 0 V
95 15 R
0 6 V
-31 -6 R
62 0 V
-62 6 R
62 0 V
95 24 R
0 6 V
-31 -6 R
62 0 V
-62 6 R
62 0 V
95 10 R
0 7 V
-31 -7 R
62 0 V
-62 7 R
62 0 V
95 15 R
0 6 V
-31 -6 R
62 0 V
-62 6 R
62 0 V
95 6 R
0 7 V
-31 -7 R
62 0 V
-62 7 R
62 0 V
95 5 R
0 8 V
-31 -8 R
62 0 V
-62 8 R
62 0 V
158 9 R
0 6 V
-31 -6 R
62 0 V
-62 6 R
62 0 V
221 10 R
0 6 V
-31 -6 R
62 0 V
-62 6 R
62 0 V
221 11 R
0 7 V
-31 -7 R
62 0 V
-62 7 R
62 0 V
347 10 R
0 5 V
-31 -5 R
62 0 V
-62 5 R
62 0 V
536 12 R
0 6 V
stroke 4635 1818 M
-31 -6 R
62 0 V
-62 6 R
62 0 V
599 0 R
0 7 V
-31 -7 R
62 0 V
-62 7 R
62 0 V
599 -20 R
0 9 V
-31 -9 R
62 0 V
-62 9 R
62 0 V
599 -30 R
0 10 V
-31 -10 R
62 0 V
-62 10 R
62 0 V
-4756 68 R
126 0 V
-126 -31 R
0 62 V
126 -62 R
0 62 V
0 -268 R
126 0 V
-126 -31 R
0 62 V
126 -62 R
0 62 V
0 -66 R
126 0 V
-126 -31 R
0 62 V
126 -62 R
0 62 V
0 -3 R
126 0 V
-126 -31 R
0 62 V
126 -62 R
0 62 V
0 -10 R
126 0 V
-126 -31 R
0 62 V
126 -62 R
0 62 V
0 -1 R
126 0 V
-126 -31 R
0 62 V
126 -62 R
0 62 V
0 -14 R
126 0 V
-126 -31 R
0 62 V
126 -62 R
0 62 V
0 -10 R
126 0 V
-126 -31 R
0 62 V
126 -62 R
0 62 V
0 -18 R
126 0 V
-126 -31 R
0 62 V
126 -62 R
0 62 V
0 -19 R
126 0 V
-126 -31 R
0 62 V
126 -62 R
0 62 V
0 -15 R
252 0 V
-252 -31 R
0 62 V
252 -62 R
0 62 V
0 -15 R
252 0 V
-252 -31 R
0 62 V
252 -62 R
0 62 V
0 -14 R
252 0 V
-252 -31 R
0 62 V
252 -62 R
0 62 V
0 -14 R
504 0 V
-504 -31 R
0 62 V
stroke 3816 1829 M
504 -62 R
0 62 V
0 -14 R
630 0 V
-630 -31 R
0 62 V
630 -62 R
0 62 V
0 -24 R
630 0 V
-630 -31 R
0 62 V
630 -62 R
0 62 V
0 -43 R
630 0 V
-630 -31 R
0 62 V
630 -62 R
0 62 V
0 -52 R
630 0 V
-630 -31 R
0 62 V
630 -62 R
0 62 V
0 -79 R
0 -31 R
0 62 V
0 -62 R
0 62 V
1863 1862 Pls
1989 1625 Pls
2115 1590 Pls
2241 1618 Pls
2367 1639 Pls
2493 1669 Pls
2619 1686 Pls
2745 1707 Pls
2871 1720 Pls
2997 1732 Pls
3186 1748 Pls
3438 1764 Pls
3690 1781 Pls
4068 1798 Pls
4635 1815 Pls
5265 1822 Pls
5895 1810 Pls
6525 1789 Pls
1.000 UP
1.000 UL
LT0
1863 1604 M
126 -148 V
126 -17 V
126 18 V
126 23 V
126 19 V
126 10 V
126 19 V
126 6 V
126 10 V
189 14 V
252 7 V
252 9 V
378 14 V
567 -2 V
630 -8 V
630 -21 V
630 -37 V
315 -19 V
-4977 94 R
0 17 V
-31 -17 R
62 0 V
-62 17 R
62 0 V
95 -159 R
0 7 V
-31 -7 R
62 0 V
-62 7 R
62 0 V
95 -23 R
0 5 V
-31 -5 R
62 0 V
-62 5 R
62 0 V
95 12 R
0 5 V
-31 -5 R
62 0 V
-62 5 R
62 0 V
95 19 R
0 5 V
-31 -5 R
62 0 V
-62 5 R
62 0 V
95 14 R
0 4 V
-31 -4 R
62 0 V
-62 4 R
62 0 V
95 5 R
0 5 V
-31 -5 R
62 0 V
-62 5 R
62 0 V
95 15 R
0 4 V
-31 -4 R
62 0 V
-62 4 R
62 0 V
95 2 R
0 5 V
-31 -5 R
62 0 V
-62 5 R
62 0 V
95 4 R
0 5 V
-31 -5 R
62 0 V
-62 5 R
62 0 V
158 10 R
0 4 V
-31 -4 R
62 0 V
-62 4 R
62 0 V
221 3 R
0 4 V
-31 -4 R
62 0 V
-62 4 R
62 0 V
221 4 R
0 5 V
-31 -5 R
62 0 V
-62 5 R
62 0 V
347 10 R
0 4 V
-31 -4 R
62 0 V
-62 4 R
62 0 V
536 -7 R
0 5 V
stroke 4635 1588 M
-31 -5 R
62 0 V
-62 5 R
62 0 V
599 -12 R
0 5 V
-31 -5 R
62 0 V
-62 5 R
62 0 V
599 -27 R
0 6 V
-31 -6 R
62 0 V
-62 6 R
62 0 V
599 -43 R
0 7 V
-31 -7 R
62 0 V
-62 7 R
62 0 V
-4756 80 R
126 0 V
-126 -31 R
0 62 V
126 -62 R
0 62 V
0 -179 R
126 0 V
-126 -31 R
0 62 V
126 -62 R
0 62 V
0 -48 R
126 0 V
-126 -31 R
0 62 V
126 -62 R
0 62 V
0 -13 R
126 0 V
-126 -31 R
0 62 V
126 -62 R
0 62 V
0 -8 R
126 0 V
-126 -31 R
0 62 V
126 -62 R
0 62 V
0 -12 R
126 0 V
-126 -31 R
0 62 V
126 -62 R
0 62 V
0 -21 R
126 0 V
-126 -31 R
0 62 V
126 -62 R
0 62 V
0 -12 R
126 0 V
-126 -31 R
0 62 V
126 -62 R
0 62 V
0 -25 R
126 0 V
-126 -31 R
0 62 V
126 -62 R
0 62 V
0 -21 R
126 0 V
-126 -31 R
0 62 V
126 -62 R
0 62 V
0 -17 R
252 0 V
-252 -31 R
0 62 V
252 -62 R
0 62 V
0 -24 R
252 0 V
-252 -31 R
0 62 V
252 -62 R
0 62 V
0 -22 R
252 0 V
-252 -31 R
0 62 V
252 -62 R
0 62 V
0 -17 R
504 0 V
-504 -31 R
0 62 V
stroke 3816 1619 M
504 -62 R
0 62 V
0 -33 R
630 0 V
-630 -31 R
0 62 V
630 -62 R
0 62 V
0 -39 R
630 0 V
-630 -31 R
0 62 V
630 -62 R
0 62 V
0 -52 R
630 0 V
-630 -31 R
0 62 V
630 -62 R
0 62 V
0 -68 R
630 0 V
-630 -31 R
0 62 V
630 -62 R
0 62 V
0 -90 R
0 -31 R
0 62 V
0 -62 R
0 62 V
1863 1604 Crs
1989 1456 Crs
2115 1439 Crs
2241 1457 Crs
2367 1480 Crs
2493 1499 Crs
2619 1509 Crs
2745 1528 Crs
2871 1534 Crs
2997 1544 Crs
3186 1558 Crs
3438 1565 Crs
3690 1574 Crs
4068 1588 Crs
4635 1586 Crs
5265 1578 Crs
5895 1557 Crs
6525 1520 Crs
1.000 UP
1.000 UL
LT2
1863 1823 M
126 -26 V
126 17 V
126 5 V
126 3 V
126 2 V
126 2 V
126 2 V
126 3 V
126 3 V
189 4 V
252 5 V
252 5 V
378 7 V
567 11 V
630 12 V
630 12 V
630 12 V
315 5 V
1863 1823 M
-31 0 R
62 0 V
-62 0 R
62 0 V
95 -26 R
-31 0 R
62 0 V
-62 0 R
62 0 V
95 17 R
-31 0 R
62 0 V
-62 0 R
62 0 V
95 5 R
-31 0 R
62 0 V
-62 0 R
62 0 V
95 3 R
-31 0 R
62 0 V
-62 0 R
62 0 V
95 2 R
-31 0 R
62 0 V
-62 0 R
62 0 V
95 2 R
-31 0 R
62 0 V
-62 0 R
62 0 V
95 2 R
-31 0 R
62 0 V
-62 0 R
62 0 V
95 3 R
-31 0 R
62 0 V
-62 0 R
62 0 V
95 3 R
-31 0 R
62 0 V
-62 0 R
62 0 V
158 4 R
-31 0 R
62 0 V
-62 0 R
62 0 V
221 5 R
-31 0 R
62 0 V
-62 0 R
62 0 V
221 5 R
-31 0 R
62 0 V
-62 0 R
62 0 V
347 7 R
-31 0 R
62 0 V
-62 0 R
62 0 V
536 11 R
-31 0 R
62 0 V
-62 0 R
62 0 V
599 12 R
-31 0 R
62 0 V
-62 0 R
62 0 V
599 12 R
-31 0 R
62 0 V
-62 0 R
62 0 V
599 12 R
-31 0 R
62 0 V
stroke 6556 1902 M
-62 0 R
62 0 V
1800 1823 M
126 0 V
-126 -31 R
0 62 V
126 -62 R
0 62 V
0 -57 R
126 0 V
-126 -31 R
0 62 V
126 -62 R
0 62 V
0 -14 R
126 0 V
-126 -31 R
0 62 V
126 -62 R
0 62 V
0 -26 R
126 0 V
-126 -31 R
0 62 V
126 -62 R
0 62 V
0 -28 R
126 0 V
-126 -31 R
0 62 V
126 -62 R
0 62 V
0 -29 R
126 0 V
-126 -31 R
0 62 V
126 -62 R
0 62 V
0 -29 R
126 0 V
-126 -31 R
0 62 V
126 -62 R
0 62 V
0 -29 R
126 0 V
-126 -31 R
0 62 V
126 -62 R
0 62 V
0 -28 R
126 0 V
-126 -31 R
0 62 V
126 -62 R
0 62 V
0 -28 R
126 0 V
-126 -31 R
0 62 V
126 -62 R
0 62 V
0 -27 R
252 0 V
-252 -31 R
0 62 V
252 -62 R
0 62 V
0 -26 R
252 0 V
-252 -31 R
0 62 V
252 -62 R
0 62 V
0 -26 R
252 0 V
-252 -31 R
0 62 V
252 -62 R
0 62 V
0 -24 R
504 0 V
-504 -31 R
0 62 V
504 -62 R
0 62 V
0 -20 R
630 0 V
-630 -31 R
0 62 V
630 -62 R
0 62 V
0 -19 R
630 0 V
-630 -31 R
0 62 V
630 -62 R
0 62 V
0 -19 R
630 0 V
-630 -31 R
0 62 V
630 -62 R
0 62 V
stroke 6210 1921 M
0 -19 R
630 0 V
-630 -31 R
0 62 V
630 -62 R
0 62 V
0 -15 R
0 -31 R
0 62 V
0 -62 R
0 62 V
1863 1823 Star
1989 1797 Star
2115 1814 Star
2241 1819 Star
2367 1822 Star
2493 1824 Star
2619 1826 Star
2745 1828 Star
2871 1831 Star
2997 1834 Star
3186 1838 Star
3438 1843 Star
3690 1848 Star
4068 1855 Star
4635 1866 Star
5265 1878 Star
5895 1890 Star
6525 1902 Star
1.000 UP
1.000 UL
LT2
1863 1538 M
126 206 V
126 -16 V
126 -11 V
126 -7 V
126 -6 V
126 -5 V
126 -3 V
126 -3 V
126 -3 V
189 -3 V
252 -4 V
252 -4 V
378 -4 V
567 -7 V
630 -8 V
630 -7 V
630 -7 V
315 -4 V
1863 1538 M
-31 0 R
62 0 V
-62 0 R
62 0 V
95 206 R
-31 0 R
62 0 V
-62 0 R
62 0 V
95 -16 R
-31 0 R
62 0 V
-62 0 R
62 0 V
95 -11 R
-31 0 R
62 0 V
-62 0 R
62 0 V
95 -7 R
-31 0 R
62 0 V
-62 0 R
62 0 V
95 -6 R
-31 0 R
62 0 V
-62 0 R
62 0 V
95 -5 R
-31 0 R
62 0 V
-62 0 R
62 0 V
95 -3 R
-31 0 R
62 0 V
-62 0 R
62 0 V
95 -3 R
-31 0 R
62 0 V
-62 0 R
62 0 V
95 -3 R
-31 0 R
62 0 V
-62 0 R
62 0 V
158 -3 R
-31 0 R
62 0 V
-62 0 R
62 0 V
221 -4 R
-31 0 R
62 0 V
-62 0 R
62 0 V
221 -4 R
-31 0 R
62 0 V
-62 0 R
62 0 V
347 -4 R
-31 0 R
62 0 V
-62 0 R
62 0 V
536 -7 R
-31 0 R
62 0 V
-62 0 R
62 0 V
599 -8 R
-31 0 R
62 0 V
-62 0 R
62 0 V
599 -7 R
-31 0 R
62 0 V
-62 0 R
62 0 V
599 -7 R
-31 0 R
62 0 V
stroke 6556 1646 M
-62 0 R
62 0 V
1800 1538 M
126 0 V
-126 -31 R
0 62 V
126 -62 R
0 62 V
0 175 R
126 0 V
-126 -31 R
0 62 V
126 -62 R
0 62 V
0 -47 R
126 0 V
-126 -31 R
0 62 V
126 -62 R
0 62 V
0 -42 R
126 0 V
-126 -31 R
0 62 V
126 -62 R
0 62 V
0 -38 R
126 0 V
-126 -31 R
0 62 V
126 -62 R
0 62 V
0 -37 R
126 0 V
-126 -31 R
0 62 V
126 -62 R
0 62 V
0 -36 R
126 0 V
-126 -31 R
0 62 V
126 -62 R
0 62 V
0 -34 R
126 0 V
-126 -31 R
0 62 V
126 -62 R
0 62 V
0 -34 R
126 0 V
-126 -31 R
0 62 V
126 -62 R
0 62 V
0 -34 R
126 0 V
-126 -31 R
0 62 V
126 -62 R
0 62 V
0 -34 R
252 0 V
-252 -31 R
0 62 V
252 -62 R
0 62 V
0 -35 R
252 0 V
-252 -31 R
0 62 V
252 -62 R
0 62 V
0 -35 R
252 0 V
-252 -31 R
0 62 V
252 -62 R
0 62 V
0 -35 R
504 0 V
-504 -31 R
0 62 V
504 -62 R
0 62 V
0 -38 R
630 0 V
-630 -31 R
0 62 V
630 -62 R
0 62 V
0 -39 R
630 0 V
-630 -31 R
0 62 V
630 -62 R
0 62 V
0 -38 R
630 0 V
-630 -31 R
0 62 V
630 -62 R
0 62 V
stroke 6210 1684 M
0 -38 R
630 0 V
-630 -31 R
0 62 V
630 -62 R
0 62 V
0 -42 R
0 -31 R
0 62 V
0 -62 R
0 62 V
1863 1538 Box
1989 1744 Box
2115 1728 Box
2241 1717 Box
2367 1710 Box
2493 1704 Box
2619 1699 Box
2745 1696 Box
2871 1693 Box
2997 1690 Box
3186 1687 Box
3438 1683 Box
3690 1679 Box
4068 1675 Box
4635 1668 Box
5265 1660 Box
5895 1653 Box
6525 1646 Box
1.000 UL
LTb
/Helvetica findfont 240 scalefont setfont
1800 1764 M
51 0 V
51 0 V
51 0 V
51 0 V
51 0 V
50 0 V
51 0 V
51 0 V
51 0 V
51 0 V
51 0 V
51 0 V
51 0 V
51 0 V
51 0 V
51 0 V
50 0 V
51 0 V
51 0 V
51 0 V
51 0 V
51 0 V
51 0 V
51 0 V
51 0 V
51 0 V
51 0 V
50 0 V
51 0 V
51 0 V
51 0 V
51 0 V
51 0 V
51 0 V
51 0 V
51 0 V
51 0 V
51 0 V
50 0 V
51 0 V
51 0 V
51 0 V
51 0 V
51 0 V
51 0 V
51 0 V
51 0 V
51 0 V
51 0 V
50 0 V
51 0 V
51 0 V
51 0 V
51 0 V
51 0 V
51 0 V
51 0 V
51 0 V
51 0 V
51 0 V
50 0 V
51 0 V
51 0 V
51 0 V
51 0 V
51 0 V
51 0 V
51 0 V
51 0 V
51 0 V
51 0 V
50 0 V
51 0 V
51 0 V
51 0 V
51 0 V
51 0 V
51 0 V
51 0 V
51 0 V
51 0 V
51 0 V
50 0 V
51 0 V
51 0 V
51 0 V
51 0 V
51 0 V
51 0 V
51 0 V
51 0 V
51 0 V
51 0 V
50 0 V
51 0 V
51 0 V
51 0 V
51 0 V
51 0 V
stroke
1800 2520 N
0 -1512 V
5040 0 V
0 1512 V
-5040 0 V
Z stroke
1.000 UP
1.000 UL
LTb
stroke
grestore
end
showpage
%%Trailer
%%DocumentFonts: Helvetica
