%!PS-Adobe-2.0 EPSF-2.0
%%BoundingBox:  0 0 567 384
%%Title: comparison_costheta.eps: c1
%%Creator: ROOT Version 5.28/00a
%%CreationDate: Sat Jan  7 09:51:09 2012
%%EndComments
%%BeginProlog
80 dict begin
/s {stroke} def /l {lineto} def /m {moveto} def /t {translate} def
/r {rotate} def /rl {roll}  def /R {repeat} def
/d {rlineto} def /rm {rmoveto} def /gr {grestore} def /f {eofill} def
/c {setrgbcolor} def /black {0 setgray} def /sd {setdash} def
/cl {closepath} def /sf {scalefont setfont} def /lw {setlinewidth} def
/box {m dup 0 exch d exch 0 d 0 exch neg d cl} def
/NC{systemdict begin initclip end}def/C{NC box clip newpath}def
/bl {box s} def /bf {box f} def /Y { 0 exch d} def /X { 0 d} def 
/K {{pop pop 0 moveto} exch kshow} bind def
/ita {/ang 15 def gsave [1 0 ang dup sin exch cos div 1 0 0] concat} def 
/mp {newpath /y exch def /x exch def} def
/side {[w .77 mul w .23 mul] .385 w mul sd w 0 l currentpoint t -144 r} def
/mr {mp x y w2 0 360 arc} def /m24 {mr s} def /m20 {mr f} def
/mb {mp x y w2 add m w2 neg 0 d 0 w neg d w 0 d 0 w d cl} def
/mt {mp x y w2 add m w2 neg w neg d w 0 d cl} def
/m21 {mb f} def /m25 {mb s} def /m22 {mt f} def /m26{mt s} def
/m23 {mp x y w2 sub m w2 w d w neg 0 d cl f} def
/m27 {mp x y w2 add m w3 neg w2 neg d w3 w2 neg d w3 w2 d cl s} def
/m28 {mp x w2 sub y w2 sub w3 add m w3 0 d  0 w3 neg d w3 0 d 0 w3 d w3 0 d  0 w3 d w3 neg 0 d 0 w3 d w3 neg 0 d 0 w3 neg d w3 neg 0 d cl s } def
/m29 {mp gsave x w2 sub y w2 add w3 sub m currentpoint t 4 {side} repeat cl fill gr} def
/m30 {mp gsave x w2 sub y w2 add w3 sub m currentpoint t 4 {side} repeat cl s gr} def
/m31 {mp x y w2 sub m 0 w d x w2 sub y m w 0 d x w2 sub y w2 add m w w neg d x w2 sub y w2 sub m w w d s} def
/m32 {mp x y w2 sub m w2 w d w neg 0 d cl s} def
/m33 {mp x y w2 add m w3 neg w2 neg d w3 w2 neg d w3 w2 d cl f} def
/m34 {mp x w2 sub y w2 sub w3 add m w3 0 d  0 w3 neg d w3 0 d 0 w3 d w3 0 d  0 w3 d w3 neg 0 d 0 w3 d w3 neg 0 d 0 w3 neg d w3 neg 0 d cl f } def
/m2 {mp x y w2 sub m 0 w d x w2 sub y m w 0 d s} def
/m5 {mp x w2 sub y w2 sub m w w d x w2 sub y w2 add m w w neg d s} def
/reEncode {exch findfont dup length dict begin {1 index /FID eq  {pop pop} {def} ifelse } forall /Encoding exch def currentdict end dup /FontName get exch definefont pop } def [/Times-Bold /Times-Italic /Times-BoldItalic /Helvetica /Helvetica-Oblique
 /Helvetica-Bold /Helvetica-BoldOblique /Courier /Courier-Oblique /Courier-Bold /Courier-BoldOblique /Times-Roman /AvantGarde-Book /AvantGarde-BookOblique /AvantGarde-Demi /AvantGarde-DemiOblique /Bookman-Demi /Bookman-DemiItalic /Bookman-Light
 /Bookman-LightItalic /Helvetica-Narrow /Helvetica-Narrow-Bold /Helvetica-Narrow-BoldOblique /Helvetica-Narrow-Oblique /NewCenturySchlbk-Roman /NewCenturySchlbk-Bold /NewCenturySchlbk-BoldItalic /NewCenturySchlbk-Italic /Palatino-Bold
 /Palatino-BoldItalic /Palatino-Italic /Palatino-Roman ] {ISOLatin1Encoding reEncode } forall%%EndProlog
%%BeginSetup
%%EndSetup
newpath  gsave  .25 .25 scale  gsave  0 0 t black[  ] 0 sd 3 lw 1 1 1 c 2268 1538 0 0 bf black 1 1 1 c 1791 1215 363 246 bf black 1791 1215 363 246 bl 1 0 0 c 6 lw 1 1 1 c black 1 0 0 c 363 1403 m 89 X -30 Y 90 X -46 Y 90 X 27 Y 179 X -39 Y 89 X -25
 Y 90 X -14 Y 89 X 41 Y 90 X -46 Y 90 X -36 Y 89 X -25 Y 90 X -75 Y 89 X -85 Y 90 X -99 Y 89 X -264 Y 90 X -359 Y 90 X -80 Y 89 X -2 Y 179 X s black 3 lw 363 246 m 1791 X s
 gsave  2268 1538 0 0 C 2111.5 78.1875 t 0 r /Helvetica findfont 71.6807 sf 0 0 m (*|) show NC gr 
 gsave  2268 1538 0 0 C 2075.62 78.1875 t 0 r /Symbol findfont 71.6807 sf 0 0 m (q) show NC gr 
 gsave  2268 1538 0 0 C 1925.75 78.1875 t 0 r /Helvetica findfont 71.6807 sf 0 0 m (|cos ) show NC gr  363 283 m -37 Y s 399 264 m -18 Y s 434 264 m -18 Y s 470 264 m -18 Y s 506 264 m -18 Y s 542 283 m -37 Y s 578 264 m -18 Y s 614 264 m -18 Y s 649
 264 m -18 Y s 685 264 m -18 Y s 721 283 m -37 Y s 757 264 m -18 Y s 793 264 m -18 Y s 829 264 m -18 Y s 864 264 m -18 Y s 900 283 m -37 Y s 936 264 m -18 Y s 972 264 m -18 Y s 1008 264 m -18 Y s 1044 264 m -18 Y s 1079 283 m -37 Y s 1115 264 m -18 Y
 s 1151 264 m -18 Y s 1187 264 m -18 Y s 1223 264 m -18 Y s 1259 283 m -37 Y s 1294 264 m -18 Y s 1330 264 m -18 Y s 1366 264 m -18 Y s 1402 264 m -18 Y s 1438 283 m -37 Y s 1474 264 m -18 Y s 1509 264 m -18 Y s 1545 264 m -18 Y s 1581 264 m -18 Y s
 1617 283 m -37 Y s 1653 264 m -18 Y s 1689 264 m -18 Y s 1724 264 m -18 Y s 1760 264 m -18 Y s 1796 283 m -37 Y s 1832 264 m -18 Y s 1868 264 m -18 Y s 1904 264 m -18 Y s 1939 264 m -18 Y s 1975 283 m -37 Y s 2011 264 m -18 Y s 2047 264 m -18 Y s
 2083 264 m -18 Y s 2119 264 m -18 Y s 2154 283 m -37 Y s
 gsave  2268 1538 0 0 C 342.25 179.188 t 0 r /Helvetica findfont 71.6807 sf 0 0 m (0) show NC gr 
 gsave  2268 1538 0 0 C 495.375 179.188 t 0 r /Helvetica findfont 71.6807 sf 0 0 m (0.1) show NC gr 
 gsave  2268 1538 0 0 C 671.375 179.188 t 0 r /Helvetica findfont 71.6807 sf 0 0 m (0.2) show NC gr 
 gsave  2268 1538 0 0 C 850.562 179.188 t 0 r /Helvetica findfont 71.6807 sf 0 0 m (0.3) show NC gr 
 gsave  2268 1538 0 0 C 1029.75 179.188 t 0 r /Helvetica findfont 71.6807 sf 0 0 m (0.4) show NC gr 
 gsave  2268 1538 0 0 C 1208.94 179.188 t 0 r /Helvetica findfont 71.6807 sf 0 0 m (0.5) show NC gr 
 gsave  2268 1538 0 0 C 1388.12 179.188 t 0 r /Helvetica findfont 71.6807 sf 0 0 m (0.6) show NC gr 
 gsave  2268 1538 0 0 C 1567.38 179.188 t 0 r /Helvetica findfont 71.6807 sf 0 0 m (0.7) show NC gr 
 gsave  2268 1538 0 0 C 1746.56 179.188 t 0 r /Helvetica findfont 71.6807 sf 0 0 m (0.8) show NC gr 
 gsave  2268 1538 0 0 C 1925.75 179.188 t 0 r /Helvetica findfont 71.6807 sf 0 0 m (0.9) show NC gr 
 gsave  2268 1538 0 0 C 2137.56 179.188 t 0 r /Helvetica findfont 71.6807 sf 0 0 m (1) show NC gr  363 1461 m 1791 X s 363 1425 m 36 Y s 399 1443 m 18 Y s 434 1443 m 18 Y s 470 1443 m 18 Y s 506 1443 m 18 Y s 542 1425 m 36 Y s 578 1443 m 18 Y s 614
 1443 m 18 Y s 649 1443 m 18 Y s 685 1443 m 18 Y s 721 1425 m 36 Y s 757 1443 m 18 Y s 793 1443 m 18 Y s 829 1443 m 18 Y s 864 1443 m 18 Y s 900 1425 m 36 Y s 936 1443 m 18 Y s 972 1443 m 18 Y s 1008 1443 m 18 Y s 1044 1443 m 18 Y s 1079 1425 m 36 Y
 s 1115 1443 m 18 Y s 1151 1443 m 18 Y s 1187 1443 m 18 Y s 1223 1443 m 18 Y s 1259 1425 m 36 Y s 1294 1443 m 18 Y s 1330 1443 m 18 Y s 1366 1443 m 18 Y s 1402 1443 m 18 Y s 1438 1425 m 36 Y s 1474 1443 m 18 Y s 1509 1443 m 18 Y s 1545 1443 m 18 Y s
 1581 1443 m 18 Y s 1617 1425 m 36 Y s 1653 1443 m 18 Y s 1689 1443 m 18 Y s 1724 1443 m 18 Y s 1760 1443 m 18 Y s 1796 1425 m 36 Y s 1832 1443 m 18 Y s 1868 1443 m 18 Y s 1904 1443 m 18 Y s 1939 1443 m 18 Y s 1975 1425 m 36 Y s 2011 1443 m 18 Y s
 2047 1443 m 18 Y s 2083 1443 m 18 Y s 2119 1443 m 18 Y s 2154 1425 m 36 Y s 363 246 m 1215 Y s
 gsave  2268 1538 0 0 C 169.625 1244.56 t 90 r /Helvetica findfont 71.6807 sf 0 0 m (Events) show NC gr  417 246 m -54 X s 390 271 m -27 X s 390 296 m -27 X s 390 320 m -27 X s 390 345 m -27 X s 417 370 m -54 X s 390 395 m -27 X s 390 419 m -27 X s
 390 444 m -27 X s 390 469 m -27 X s 417 494 m -54 X s 390 518 m -27 X s 390 543 m -27 X s 390 568 m -27 X s 390 592 m -27 X s 417 617 m -54 X s 390 642 m -27 X s 390 667 m -27 X s 390 691 m -27 X s 390 716 m -27 X s 417 741 m -54 X s 390 766 m -27 X
 s 390 790 m -27 X s 390 815 m -27 X s 390 840 m -27 X s 417 865 m -54 X s 390 889 m -27 X s 390 914 m -27 X s 390 939 m -27 X s 390 964 m -27 X s 417 988 m -54 X s 390 1013 m -27 X s 390 1038 m -27 X s 390 1063 m -27 X s 390 1087 m -27 X s 417 1112
 m -54 X s 390 1137 m -27 X s 390 1162 m -27 X s 390 1186 m -27 X s 390 1211 m -27 X s 417 1236 m -54 X s 390 1261 m -27 X s 390 1285 m -27 X s 390 1310 m -27 X s 390 1335 m -27 X s 417 1360 m -54 X s 417 1360 m -54 X s 390 1384 m -27 X s 390 1409 m
 -27 X s 390 1434 m -27 X s 390 1459 m -27 X s
 gsave  2268 1538 0 0 C 309.75 221.562 t 0 r /Helvetica findfont 71.6807 sf 0 0 m (0) show NC gr 
 gsave  2268 1538 0 0 C 231.562 345.312 t 0 r /Helvetica findfont 71.6807 sf 0 0 m (500) show NC gr 
 gsave  2268 1538 0 0 C 192.438 469.125 t 0 r /Helvetica findfont 71.6807 sf 0 0 m (1000) show NC gr 
 gsave  2268 1538 0 0 C 192.438 592.938 t 0 r /Helvetica findfont 71.6807 sf 0 0 m (1500) show NC gr 
 gsave  2268 1538 0 0 C 192.438 716.75 t 0 r /Helvetica findfont 71.6807 sf 0 0 m (2000) show NC gr 
 gsave  2268 1538 0 0 C 192.438 840.562 t 0 r /Helvetica findfont 71.6807 sf 0 0 m (2500) show NC gr 
 gsave  2268 1538 0 0 C 192.438 964.375 t 0 r /Helvetica findfont 71.6807 sf 0 0 m (3000) show NC gr 
 gsave  2268 1538 0 0 C 192.438 1088.19 t 0 r /Helvetica findfont 71.6807 sf 0 0 m (3500) show NC gr 
 gsave  2268 1538 0 0 C 192.438 1212 t 0 r /Helvetica findfont 71.6807 sf 0 0 m (4000) show NC gr 
 gsave  2268 1538 0 0 C 192.438 1335.81 t 0 r /Helvetica findfont 71.6807 sf 0 0 m (4500) show NC gr  2154 246 m 1215 Y s 2101 246 m 53 X s 2127 271 m 27 X s 2127 296 m 27 X s 2127 320 m 27 X s 2127 345 m 27 X s 2101 370 m 53 X s 2127 395 m 27 X s
 2127 419 m 27 X s 2127 444 m 27 X s 2127 469 m 27 X s 2101 494 m 53 X s 2127 518 m 27 X s 2127 543 m 27 X s 2127 568 m 27 X s 2127 592 m 27 X s 2101 617 m 53 X s 2127 642 m 27 X s 2127 667 m 27 X s 2127 691 m 27 X s 2127 716 m 27 X s 2101 741 m 53 X
 s 2127 766 m 27 X s 2127 790 m 27 X s 2127 815 m 27 X s 2127 840 m 27 X s 2101 865 m 53 X s 2127 889 m 27 X s 2127 914 m 27 X s 2127 939 m 27 X s 2127 964 m 27 X s 2101 988 m 53 X s 2127 1013 m 27 X s 2127 1038 m 27 X s 2127 1063 m 27 X s 2127 1087
 m 27 X s 2101 1112 m 53 X s 2127 1137 m 27 X s 2127 1162 m 27 X s 2127 1186 m 27 X s 2127 1211 m 27 X s 2101 1236 m 53 X s 2127 1261 m 27 X s 2127 1285 m 27 X s 2127 1310 m 27 X s 2127 1335 m 27 X s 2101 1360 m 53 X s 2101 1360 m 53 X s 2127 1384 m
 27 X s 2127 1409 m 27 X s 2127 1434 m 27 X s 2127 1459 m 27 X s 0 0 1 c 6 lw 1 1 1 c 0 0 1 c 408 1389 m 4 Y s 408 1419 m 4 Y s 363 1406 m 32 X s 421 1406 m 31 X s 3 lw /w 31 def /w2 {w 2 div} def /w3 {w 3 div} def 408 1406 m20 6 lw 497 1360 m 4 Y s
 497 1390 m 3 Y s 452 1377 m 32 X s 510 1377 m 32 X s 3 lw 497 1377 m20 6 lw 587 1314 m 3 Y s 587 1343 m 3 Y s 542 1330 m 32 X s 600 1330 m 32 X s 3 lw 587 1330 m20 6 lw 676 1340 m 4 Y s 676 1370 m 3 Y s 632 1357 m 31 X s 689 1357 m 32 X s 3 lw 676
 1357 m20 6 lw 766 1338 m 4 Y s 766 1368 m 3 Y s 721 1355 m 32 X s 779 1355 m 32 X s 3 lw 766 1355 m20 6 lw 855 1296 m 3 Y s 855 1325 m 4 Y s 811 1312 m 31 X s 869 1312 m 31 X s 3 lw 855 1312 m20 6 lw 945 1275 m 3 Y s 945 1304 m 3 Y s 900 1291 m 32 X
 s 958 1291 m 32 X s 3 lw 945 1291 m20 6 lw 1035 1262 m 3 Y s 1035 1291 m 3 Y s 990 1278 m 32 X s 1048 1278 m 31 X s 3 lw 1035 1278 m20 6 lw 1124 1301 m 3 Y s 1124 1330 m 3 Y s 1079 1317 m 32 X s 1137 1317 m 32 X s 3 lw 1124 1317 m20 6 lw 1214 1254 m
 3 Y s 1214 1283 m 3 Y s 1169 1270 m 32 X s 1227 1270 m 32 X s 3 lw 1214 1270 m20 6 lw 1303 1231 m 3 Y s 1303 1260 m 3 Y s 1259 1247 m 31 X s 1316 1247 m 32 X s 3 lw 1303 1247 m20 6 lw 1393 1206 m 2 Y s 1393 1234 m 3 Y s 1348 1221 m 32 X s 1406 1221
 m 32 X s 3 lw 1393 1221 m20 6 lw 1483 1136 m 2 Y s 1483 1164 m 2 Y s 1438 1151 m 31 X s 1496 1151 m 31 X s 3 lw 1483 1151 m20 6 lw 1572 1059 m 2 Y s 1572 1087 m 1 Y s 1527 1074 m 32 X s 1585 1074 m 32 X s 3 lw 1572 1074 m20 6 lw 1662 970 m s 1662
 996 m 1 Y s 1617 983 m 32 X s 1675 983 m 31 X s 3 lw 1662 983 m20 6 lw 1706 704 m 32 X s 1764 704 m 32 X s 3 lw 1751 704 m20 6 lw 1796 321 m 32 X s 1854 321 m 32 X s 3 lw 1841 321 m20 6 lw 1886 247 m 31 X s 1943 247 m 32 X s 3 lw 1930 247 m20 6 lw
 black 3 lw 1 1 1 c 680 231 794 461 bf 813 461 m -13 Y 674 X 224 Y -13 X -211 Y f black 794 461 m 231 Y 680 X -231 Y -680 X cl s
 gsave  2268 1538 0 0 C 961.312 619 t 0 r /Helvetica findfont 45.615 sf 0 0 m 
 438 413 403 391 366 341 331 306 274 249 234 222 196 171 139 126 101 87 62 50 25
(before HqT reweighting) K NC gr  1 0 0 c 6 lw 819 634 m 119 X s black
 gsave  2268 1538 0 0 C 961.312 504.938 t 0 r /Helvetica findfont 45.615 sf 0 0 m 
 401 376 366 354 329 304 294 269 237 212 197 185 159 134 102 89 74 50 37 25
(after HqT reweighting) K NC gr  0 0 1 c 3 lw 879 519 m20 6 lw black
 gsave  2268 1538 0 0 C 2222.25 1117.5 t 90 r /Helvetica-BoldOblique findfont 29.3239 sf 0 0 m 
 317 303 287 271 263 240 213 205 186 167 159 140 118 95 87 67 59 38 17
(LHC HIGGS XS WG 2011) K NC gr 
 gr  gr showpage
end
%%EOF
