%!PS-Adobe-2.0 EPSF-2.0
%%BoundingBox:  0 0 567 362
%%Title: Results/m120/POWHEG.ptrelj1-mstw2008.eps: VBF - HAWK
%%Creator: ROOT Version 5.28/00c
%%CreationDate: Fri Nov 25 16:28:09 2011
%%EndComments
%%BeginProlog
80 dict begin
/s {stroke} def /l {lineto} def /m {moveto} def /t {translate} def
/r {rotate} def /rl {roll}  def /R {repeat} def
/d {rlineto} def /rm {rmoveto} def /gr {grestore} def /f {eofill} def
/c {setrgbcolor} def /black {0 setgray} def /sd {setdash} def
/cl {closepath} def /sf {scalefont setfont} def /lw {setlinewidth} def
/box {m dup 0 exch d exch 0 d 0 exch neg d cl} def
/NC{systemdict begin initclip end}def/C{NC box clip newpath}def
/bl {box s} def /bf {box f} def /Y { 0 exch d} def /X { 0 d} def 
/K {{pop pop 0 moveto} exch kshow} bind def
/ita {/ang 15 def gsave [1 0 ang dup sin exch cos div 1 0 0] concat} def 
/mp {newpath /y exch def /x exch def} def
/side {[w .77 mul w .23 mul] .385 w mul sd w 0 l currentpoint t -144 r} def
/mr {mp x y w2 0 360 arc} def /m24 {mr s} def /m20 {mr f} def
/mb {mp x y w2 add m w2 neg 0 d 0 w neg d w 0 d 0 w d cl} def
/mt {mp x y w2 add m w2 neg w neg d w 0 d cl} def
/m21 {mb f} def /m25 {mb s} def /m22 {mt f} def /m26{mt s} def
/m23 {mp x y w2 sub m w2 w d w neg 0 d cl f} def
/m27 {mp x y w2 add m w3 neg w2 neg d w3 w2 neg d w3 w2 d cl s} def
/m28 {mp x w2 sub y w2 sub w3 add m w3 0 d  0 w3 neg d w3 0 d 0 w3 d w3 0 d  0 w3 d w3 neg 0 d 0 w3 d w3 neg 0 d 0 w3 neg d w3 neg 0 d cl s } def
/m29 {mp gsave x w2 sub y w2 add w3 sub m currentpoint t 4 {side} repeat cl fill gr} def
/m30 {mp gsave x w2 sub y w2 add w3 sub m currentpoint t 4 {side} repeat cl s gr} def
/m31 {mp x y w2 sub m 0 w d x w2 sub y m w 0 d x w2 sub y w2 add m w w neg d x w2 sub y w2 sub m w w d s} def
/m32 {mp x y w2 sub m w2 w d w neg 0 d cl s} def
/m33 {mp x y w2 add m w3 neg w2 neg d w3 w2 neg d w3 w2 d cl f} def
/m34 {mp x w2 sub y w2 sub w3 add m w3 0 d  0 w3 neg d w3 0 d 0 w3 d w3 0 d  0 w3 d w3 neg 0 d 0 w3 d w3 neg 0 d 0 w3 neg d w3 neg 0 d cl f } def
/m2 {mp x y w2 sub m 0 w d x w2 sub y m w 0 d s} def
/m5 {mp x w2 sub y w2 sub m w w d x w2 sub y w2 add m w w neg d s} def
/reEncode {exch findfont dup length dict begin {1 index /FID eq  {pop pop} {def} ifelse } forall /Encoding exch def currentdict end dup /FontName get exch definefont pop } def [/Times-Bold /Times-Italic /Times-BoldItalic /Helvetica /Helvetica-Oblique
 /Helvetica-Bold /Helvetica-BoldOblique /Courier /Courier-Oblique /Courier-Bold /Courier-BoldOblique /Times-Roman /AvantGarde-Book /AvantGarde-BookOblique /AvantGarde-Demi /AvantGarde-DemiOblique /Bookman-Demi /Bookman-DemiItalic /Bookman-Light
 /Bookman-LightItalic /Helvetica-Narrow /Helvetica-Narrow-Bold /Helvetica-Narrow-BoldOblique /Helvetica-Narrow-Oblique /NewCenturySchlbk-Roman /NewCenturySchlbk-Bold /NewCenturySchlbk-BoldItalic /NewCenturySchlbk-Italic /Palatino-Bold
 /Palatino-BoldItalic /Palatino-Italic /Palatino-Roman ] {ISOLatin1Encoding reEncode } forall%%EndProlog
%%BeginSetup
%%EndSetup
newpath  gsave  .25 .25 scale  gsave  0 0 t black[  ] 0 sd 3 lw 1 1 1 c 2268 1448 0 0 bf black 1 1 1 c 1814 1158 227 145 bf black 1814 1158 227 145 bl 1 1 1 c 1814 1158 227 145 bf black 1814 1158 227 145 bl 0.8 0 0 c[  12 12 ] 0 sd 6 lw 1 1 1 c black
 0.8 0 0 c 227 558 m 60 X 407 Y 61 X 182 Y 60 X 38 Y 61 X -34 Y 60 X -65 Y 61 X -62 Y 60 X -45 Y 61 X -45 Y 60 X -52 Y 60 X -33 Y 61 X -36 Y 60 X -34 Y 61 X -35 Y 60 X -26 Y 61 X -41 Y 60 X -42 Y 61 X -30 Y 60 X -14 Y 61 X -38 Y 60 X -45 Y 61 X -9 Y
 60 X -28 Y 61 X -33 Y 60 X -35 Y 61 X -36 Y 60 X -57 Y 61 X 40 Y 60 X -38 Y 60 X -78 Y 61 X s black[  ] 0 sd 3 lw 227 145 m 1814 X s
 gsave  2268 1448 0 0 C 1870.36 27.8403 t 0 r /Helvetica findfont 60.7424 sf 0 0 m ( [GeV]) show NC gr 
 gsave  2268 1448 0 0 C 1776.72 55.6805 t 0 r /Helvetica findfont 40.4949 sf 0 0 m (rel, j1) show NC gr 
 gsave  2268 1448 0 0 C 1776.72 -5.06187 t 0 r /Helvetica findfont 40.4949 sf 0 0 m (T) show NC gr 
 gsave  2268 1448 0 0 C 1743.81 27.8403 t 0 r /Helvetica findfont 60.7424 sf 0 0 m (p) show NC gr  227 180 m -35 Y s 287 162 m -17 Y s 348 162 m -17 Y s 408 162 m -17 Y s 469 162 m -17 Y s 529 180 m -35 Y s 590 162 m -17 Y s 650 162 m -17 Y s 711 162
 m -17 Y s 771 162 m -17 Y s 831 180 m -35 Y s 892 162 m -17 Y s 952 162 m -17 Y s 1013 162 m -17 Y s 1073 162 m -17 Y s 1134 180 m -35 Y s 1194 162 m -17 Y s 1255 162 m -17 Y s 1315 162 m -17 Y s 1376 162 m -17 Y s 1436 180 m -35 Y s 1497 162 m -17
 Y s 1557 162 m -17 Y s 1618 162 m -17 Y s 1678 162 m -17 Y s 1739 180 m -35 Y s 1799 162 m -17 Y s 1860 162 m -17 Y s 1920 162 m -17 Y s 1980 162 m -17 Y s 2041 180 m -35 Y s
 gsave  2268 1448 0 0 C 210.067 93.6445 t 0 r /Helvetica findfont 53.1496 sf 0 0 m (0) show NC gr 
 gsave  2268 1448 0 0 C 513.78 93.6445 t 0 r /Helvetica findfont 53.1496 sf 0 0 m (5) show NC gr 
 gsave  2268 1448 0 0 C 799.775 93.6445 t 0 r /Helvetica findfont 53.1496 sf 0 0 m (10) show NC gr 
 gsave  2268 1448 0 0 C 1103.49 93.6445 t 0 r /Helvetica findfont 53.1496 sf 0 0 m (15) show NC gr 
 gsave  2268 1448 0 0 C 1404.67 93.6445 t 0 r /Helvetica findfont 53.1496 sf 0 0 m (20) show NC gr 
 gsave  2268 1448 0 0 C 1705.85 93.6445 t 0 r /Helvetica findfont 53.1496 sf 0 0 m (25) show NC gr 
 gsave  2268 1448 0 0 C 2009.56 93.6445 t 0 r /Helvetica findfont 53.1496 sf 0 0 m (30) show NC gr  227 145 m 1158 Y s
 gsave  2268 1448 0 0 C 131.609 1065.52 t 90 r /Helvetica findfont 60.7424 sf 0 0 m ( [fb/GeV]) show NC gr 
 gsave  2268 1448 0 0 C 93.6445 971.879 t 90 r /Helvetica findfont 40.4949 sf 0 0 m (rel, j1) show NC gr 
 gsave  2268 1448 0 0 C 161.98 971.879 t 90 r /Helvetica findfont 40.4949 sf 0 0 m (T) show NC gr 
 gsave  2268 1448 0 0 C 131.609 888.358 t 90 r /Helvetica findfont 60.7424 sf 0 0 m (/dp) show NC gr 
 gsave  2268 1448 0 0 C 131.609 850.394 t 90 r /Symbol findfont 60.7424 sf 0 0 m (s) show NC gr 
 gsave  2268 1448 0 0 C 131.609 820.023 t 90 r /Helvetica findfont 60.7424 sf 0 0 m (d) show NC gr  281 145 m -54 X s
 gsave  2268 1448 0 0 C 182.227 144.263 t 0 r /Helvetica findfont 35.4331 sf 0 0 m (\2551) show NC gr 
 gsave  2268 1448 0 0 C 124.016 121.485 t 0 r /Helvetica findfont 53.1496 sf 0 0 m (10) show NC gr  254 261 m -27 X s 254 329 m -27 X s 254 377 m -27 X s 254 415 m -27 X s 254 445 m -27 X s 254 471 m -27 X s 254 493 m -27 X s 254 513 m -27 X s 281
 531 m -54 X s
 gsave  2268 1448 0 0 C 208.176 508.549 t 0 r  -30 0 t /Helvetica findfont 53.1496 sf 0 0 m (1) show NC gr  254 647 m -27 X s 254 715 m -27 X s 254 763 m -27 X s 254 801 m -27 X s 254 831 m -27 X s 254 857 m -27 X s 254 879 m -27 X s 254 899 m -27 X
 s 281 917 m -54 X s
 gsave  2268 1448 0 0 C 208.176 894.601 t 0 r  -60 0 t /Helvetica findfont 53.1496 sf 0 0 m (10) show NC gr  254 1033 m -27 X s 254 1101 m -27 X s 254 1149 m -27 X s 254 1187 m -27 X s 254 1217 m -27 X s 254 1243 m -27 X s 254 1266 m -27 X s 254 1285
 m -27 X s 281 1303 m -54 X s
 gsave  2268 1448 0 0 C 187.289 1300.9 t 0 r /Helvetica findfont 35.4331 sf 0 0 m (2) show NC gr 
 gsave  2268 1448 0 0 C 129.078 1278.12 t 0 r /Helvetica findfont 53.1496 sf 0 0 m (10) show NC gr  0.4 0.4 0.8 c 6 lw 1 1 1 c black 0.4 0.4 0.8 c 227 1264 m 60 X -17 Y 61 X -122 Y 60 X -76 Y 61 X -65 Y 60 X -53 Y 61 X -48 Y 60 X -31 Y 61 X -41 Y 60
 X -31 Y 60 X -33 Y 61 X -30 Y 60 X -24 Y 61 X -33 Y 60 X -35 Y 61 X -30 Y 60 X -24 Y 61 X -12 Y 60 X -34 Y 61 X -35 Y 60 X -17 Y 61 X -28 Y 60 X -35 Y 61 X -9 Y 60 X -32 Y 61 X -7 Y 60 X -52 Y 61 X -22 Y 60 X -17 Y 60 X -5 Y 61 X s 0 0.8 0 c[ 20 12
 4 12] 0 sd 1 1 1 c black 0 0.8 0 c 227 746 m 60 X 255 Y 61 X 133 Y 60 X 26 Y 61 X -28 Y 60 X -45 Y 61 X -52 Y 60 X -45 Y 61 X -49 Y 60 X -39 Y 60 X -43 Y 61 X -33 Y 60 X -38 Y 61 X -28 Y 60 X -32 Y 61 X -45 Y 60 X -21 Y 61 X -25 Y 60 X -23 Y 61 X
 -45 Y 60 X -8 Y 61 X -55 Y 60 X -57 Y 61 X 1 Y 60 X -15 Y 61 X -49 Y 60 X -45 Y 61 X 5 Y 60 X -12 Y 60 X -32 Y 61 X s black
 gsave  2268 1448 0 0 C 2095.61 827.615 t 90 r /Helvetica-BoldOblique findfont 40.4949 sf 0 0 m 
 447 428 405 382 371 340 301 290 263 236 225 198 166 135 124 94 83 54 25
(LHC HIGGS XS WG 2011) K NC gr 
 gsave  2268 1448 0 0 C 1546.4 1214.85 t 0 r /Helvetica findfont 43.0259 sf 0 0 m (POWHEG NLO) show NC gr  0.4 0.4 0.8 c[  ] 0 sd 1389 1231 m 131 X s black
 gsave  2268 1448 0 0 C 1546.4 1126.27 t 0 r /Helvetica findfont 43.0259 sf 0 0 m (POWHEG + PYTHIA) show NC gr  0.8 0 0 c[  12 12 ] 0 sd 1389 1144 m 131 X s black
 gsave  2268 1448 0 0 C 1546.4 1040.21 t 0 r /Helvetica findfont 43.0259 sf 0 0 m 
 383 372 332 301 273 242 231 206 194 161 132 102 62 28
(POWHEG + HERWIG) K NC gr  0 0.8 0 c[ 20 12 4 12] 0 sd 1389 1057 m 131 X s
 gr  gr showpage
end
%%EOF
