%!PS-Adobe-1.0
%%Creator: Unified Graphics System
%%Pages: (atend)
%%DocumentFonts: Helvetica
%%BoundingBox:   64   81  309  330
%%EndComments
/Sw{setlinewidth}def
/Sg{setgray}def
/Sd{setdash}def
/P {newpath
    moveto
0 0 rlineto
    stroke}def
/M {moveto}def
/D {lineto}def
/N {newpath}def
/S {stroke}def
/T {/Helvetica findfont
    exch
    scalefont
    setfont}def
/R {rotate}def
/W {show}def
/F {fill}def
/X {gsave}def
/Y {grestore}def
%%EndProlog
%%Page: 1 1
0.12000 0.12000 scale
1 setlinecap
1 setlinejoin
8 Sw
0.00 0.00 0.00 setrgbcolor
[] 0 Sd
N
580 1626 M
656 1626 D
S
N
580 1629 M
656 1629 D
S
N
616 1626 M
609 1618 D
605 1611 D
605 1604 D
609 1593 D
616 1586 D
627 1582 D
634 1582 D
645 1586 D
652 1593 D
656 1604 D
656 1611 D
652 1618 D
645 1626 D
S
N
605 1604 M
609 1597 D
616 1590 D
627 1586 D
634 1586 D
645 1590 D
652 1597 D
656 1604 D
S
N
580 1615 M
580 1629 D
S
N
656 1626 M
656 1640 D
S
N
605 1716 M
605 1680 D
609 1669 D
620 1662 D
630 1658 D
641 1658 D
648 1662 D
652 1665 D
656 1672 D
656 1680 D
652 1690 D
641 1698 D
630 1701 D
620 1701 D
612 1698 D
609 1694 D
605 1687 D
S
N
605 1680 M
609 1672 D
620 1665 D
630 1662 D
645 1662 D
652 1665 D
S
N
656 1680 M
652 1687 D
641 1694 D
630 1698 D
616 1698 D
609 1694 D
S
N
609 1694 M
609 1716 D
S
N
566 1795 M
681 1730 D
S
N
580 1856 M
656 1856 D
S
N
580 1860 M
656 1860 D
S
N
616 1856 M
609 1849 D
605 1842 D
605 1835 D
609 1824 D
616 1817 D
627 1813 D
634 1813 D
645 1817 D
652 1824 D
656 1835 D
656 1842 D
652 1849 D
645 1856 D
S
N
605 1835 M
609 1827 D
616 1820 D
627 1817 D
634 1817 D
645 1820 D
652 1827 D
656 1835 D
S
N
580 1845 M
580 1860 D
S
N
656 1856 M
656 1871 D
S
N
605 1892 M
656 1914 D
S
N
605 1896 M
648 1914 D
S
N
605 1936 M
656 1914 D
670 1907 D
677 1900 D
681 1892 D
681 1889 D
677 1885 D
674 1889 D
677 1892 D
S
N
605 1885 M
605 1907 D
S
N
605 1921 M
605 1943 D
S
N
634 1963 M
684 1963 D
S
N
634 1966 M
684 1966 D
S
N
658 1966 M
653 1970 D
651 1975 D
651 1980 D
653 1987 D
658 1992 D
665 1994 D
670 1994 D
677 1992 D
682 1987 D
684 1980 D
684 1975 D
682 1970 D
677 1966 D
S
N
651 1980 M
653 1985 D
658 1990 D
665 1992 D
670 1992 D
677 1990 D
682 1985 D
684 1980 D
S
N
634 1956 M
634 1966 D
S
N
634 2014 M
684 2014 D
S
N
634 2016 M
684 2016 D
S
N
658 2016 M
653 2021 D
651 2026 D
651 2030 D
653 2038 D
658 2042 D
665 2045 D
670 2045 D
677 2042 D
682 2038 D
684 2030 D
684 2026 D
682 2021 D
677 2016 D
S
N
651 2030 M
653 2035 D
658 2040 D
665 2042 D
670 2042 D
677 2040 D
682 2035 D
684 2030 D
S
N
634 2006 M
634 2016 D
S
N
566 2167 M
681 2167 D
S
N
566 2171 M
681 2171 D
S
N
566 2167 M
566 2193 D
S
N
681 2167 M
681 2193 D
S
N
584 2240 M
587 2236 D
591 2240 D
587 2243 D
584 2243 D
580 2240 D
580 2232 D
584 2225 D
591 2222 D
656 2222 D
S
N
580 2232 M
584 2229 D
591 2225 D
656 2225 D
S
N
605 2211 M
605 2240 D
S
N
656 2211 M
656 2236 D
S
N
580 2268 M
656 2268 D
S
N
580 2272 M
656 2272 D
S
N
616 2272 M
609 2279 D
605 2286 D
605 2294 D
609 2304 D
616 2312 D
627 2315 D
634 2315 D
645 2312 D
652 2304 D
656 2294 D
656 2286 D
652 2279 D
645 2272 D
S
N
605 2294 M
609 2301 D
616 2308 D
627 2312 D
634 2312 D
645 2308 D
652 2301 D
656 2294 D
S
N
580 2258 M
580 2272 D
S
N
566 2358 M
681 2358 D
S
N
566 2362 M
681 2362 D
S
N
566 2337 M
566 2362 D
S
N
681 2337 M
681 2362 D
S
N
1760 792 M
1782 741 D
S
N
1764 792 M
1782 748 D
S
N
1803 792 M
1782 741 D
1774 727 D
1767 720 D
1760 716 D
1756 716 D
1753 720 D
1756 723 D
1760 720 D
S
N
1753 792 M
1774 792 D
S
N
1789 792 M
1810 792 D
S
N
1831 763 M
1831 712 D
S
N
1833 763 M
1833 712 D
S
N
1833 739 M
1838 744 D
1843 746 D
1848 746 D
1855 744 D
1860 739 D
1862 732 D
1862 727 D
1860 720 D
1855 715 D
1848 712 D
1843 712 D
1838 715 D
1833 720 D
S
N
1848 746 M
1852 744 D
1857 739 D
1860 732 D
1860 727 D
1857 720 D
1852 715 D
1848 712 D
S
N
1824 763 M
1833 763 D
S
N
1881 763 M
1881 712 D
S
N
1884 763 M
1884 712 D
S
N
1884 739 M
1889 744 D
1893 746 D
1898 746 D
1905 744 D
1910 739 D
1913 732 D
1913 727 D
1910 720 D
1905 715 D
1898 712 D
1893 712 D
1889 715 D
1884 720 D
S
N
1898 746 M
1903 744 D
1908 739 D
1910 732 D
1910 727 D
1908 720 D
1903 715 D
1898 712 D
S
N
1874 763 M
1884 763 D
S
N
2374 2572 M
2370 2568 D
2374 2565 D
2378 2568 D
2378 2572 D
2370 2579 D
2363 2583 D
2352 2583 D
2342 2579 D
2334 2572 D
2331 2561 D
2331 2554 D
2334 2543 D
2342 2536 D
2352 2532 D
2360 2532 D
2370 2536 D
2378 2543 D
S
N
2352 2583 M
2345 2579 D
2338 2572 D
2334 2561 D
2334 2554 D
2338 2543 D
2345 2536 D
2352 2532 D
S
N
2399 2622 M
2406 2615 D
2414 2604 D
2421 2590 D
2424 2572 D
2424 2557 D
2421 2539 D
2414 2525 D
2406 2514 D
2399 2507 D
S
N
2406 2615 M
2414 2601 D
2417 2590 D
2421 2572 D
2421 2557 D
2417 2539 D
2414 2529 D
2406 2514 D
S
N
993 2722 M
993 992 D
S
N
993 992 M
2550 992 D
S
N
2550 992 M
2550 2722 D
S
N
2550 2722 M
993 2722 D
S
N
993 992 M
2550 992 D
S
N
1024 992 M
1024 1009 D
S
N
1086 1009 M
1086 992 D
S
N
1149 992 M
1149 1044 D
S
N
1211 1009 M
1211 992 D
S
N
1273 992 M
1273 1009 D
S
N
1336 1009 M
1336 992 D
S
N
1398 992 M
1398 1009 D
S
N
1460 1044 M
1460 992 D
S
N
1522 992 M
1522 1009 D
S
N
1585 1009 M
1585 992 D
S
N
1647 992 M
1647 1009 D
S
N
1709 1009 M
1709 992 D
S
N
1772 992 M
1772 1044 D
S
N
1834 1009 M
1834 992 D
S
N
1896 992 M
1896 1009 D
S
N
1958 1009 M
1958 992 D
S
N
2021 992 M
2021 1009 D
S
N
2083 1044 M
2083 992 D
S
N
2145 992 M
2145 1009 D
S
N
2207 1009 M
2207 992 D
S
N
2270 992 M
2270 1009 D
S
N
2332 1009 M
2332 992 D
S
N
2394 992 M
2394 1044 D
S
N
2457 1009 M
2457 992 D
S
N
2519 992 M
2519 1009 D
S
N
1094 900 M
1146 900 D
S
N
1169 923 M
1172 920 D
1169 918 D
1166 920 D
1166 923 D
1169 929 D
1172 932 D
1180 935 D
1192 935 D
1201 932 D
1203 929 D
1206 923 D
1206 918 D
1203 912 D
1195 906 D
1180 900 D
1175 897 D
1169 892 D
1166 883 D
1166 874 D
S
N
1192 935 M
1198 932 D
1201 929 D
1203 923 D
1203 918 D
1201 912 D
1192 906 D
1180 900 D
S
N
1166 880 M
1169 883 D
1175 883 D
1189 877 D
1198 877 D
1203 880 D
1206 883 D
S
N
1175 883 M
1189 874 D
1201 874 D
1203 877 D
1206 883 D
1206 889 D
S
N
1405 900 M
1457 900 D
S
N
1486 923 M
1492 926 D
1500 935 D
1500 874 D
S
N
1498 932 M
1498 874 D
S
N
1486 874 M
1512 874 D
S
N
1769 935 M
1760 932 D
1754 923 D
1751 909 D
1751 900 D
1754 886 D
1760 877 D
1769 874 D
1774 874 D
1783 877 D
1789 886 D
1792 900 D
1792 909 D
1789 923 D
1783 932 D
1774 935 D
1769 935 D
S
N
1769 935 M
1763 932 D
1760 929 D
1757 923 D
1754 909 D
1754 900 D
1757 886 D
1760 880 D
1763 877 D
1769 874 D
S
N
1774 874 M
1780 877 D
1783 880 D
1786 886 D
1789 900 D
1789 909 D
1786 923 D
1783 929 D
1780 932 D
1774 935 D
S
N
2071 923 M
2077 926 D
2086 935 D
2086 874 D
S
N
2083 932 M
2083 874 D
S
N
2071 874 M
2097 874 D
S
N
2377 923 M
2380 920 D
2377 918 D
2374 920 D
2374 923 D
2377 929 D
2380 932 D
2389 935 D
2400 935 D
2409 932 D
2412 929 D
2414 923 D
2414 918 D
2412 912 D
2403 906 D
2389 900 D
2383 897 D
2377 892 D
2374 883 D
2374 874 D
S
N
2400 935 M
2406 932 D
2409 929 D
2412 923 D
2412 918 D
2409 912 D
2400 906 D
2389 900 D
S
N
2374 880 M
2377 883 D
2383 883 D
2397 877 D
2406 877 D
2412 880 D
2414 883 D
S
N
2383 883 M
2397 874 D
2409 874 D
2412 877 D
2414 883 D
2414 889 D
S
N
993 2722 M
2550 2722 D
S
N
1024 2705 M
1024 2722 D
S
N
1086 2722 M
1086 2705 D
S
N
1149 2670 M
1149 2722 D
S
N
1211 2722 M
1211 2705 D
S
N
1273 2705 M
1273 2722 D
S
N
1336 2722 M
1336 2705 D
S
N
1398 2705 M
1398 2722 D
S
N
1460 2722 M
1460 2670 D
S
N
1522 2705 M
1522 2722 D
S
N
1585 2722 M
1585 2705 D
S
N
1647 2705 M
1647 2722 D
S
N
1709 2722 M
1709 2705 D
S
N
1772 2670 M
1772 2722 D
S
N
1834 2722 M
1834 2705 D
S
N
1896 2705 M
1896 2722 D
S
N
1958 2722 M
1958 2705 D
S
N
2021 2705 M
2021 2722 D
S
N
2083 2722 M
2083 2670 D
S
N
2145 2705 M
2145 2722 D
S
N
2207 2722 M
2207 2705 D
S
N
2270 2705 M
2270 2722 D
S
N
2332 2722 M
2332 2705 D
S
N
2394 2670 M
2394 2722 D
S
N
2457 2722 M
2457 2705 D
S
N
2519 2705 M
2519 2722 D
S
N
993 992 M
993 2722 D
S
N
993 992 M
1045 992 D
S
N
1010 1242 M
993 1242 D
S
N
993 1389 M
1010 1389 D
S
N
1010 1493 M
993 1493 D
S
N
993 1574 M
1010 1574 D
S
N
1010 1639 M
993 1639 D
S
N
993 1695 M
1010 1695 D
S
N
1010 1743 M
993 1743 D
S
N
993 1786 M
1010 1786 D
S
N
1045 1824 M
993 1824 D
S
N
993 2075 M
1010 2075 D
S
N
1010 2221 M
993 2221 D
S
N
993 2325 M
1010 2325 D
S
N
1010 2406 M
993 2406 D
S
N
993 2472 M
1010 2472 D
S
N
1010 2527 M
993 2527 D
S
N
993 2575 M
1010 2575 D
S
N
1010 2618 M
993 2618 D
S
N
993 2656 M
1045 2656 D
S
N
757 1006 M
762 1009 D
771 1018 D
771 957 D
S
N
768 1015 M
768 957 D
S
N
757 957 M
783 957 D
S
N
823 1018 M
814 1015 D
808 1006 D
806 992 D
806 983 D
808 969 D
814 960 D
823 957 D
829 957 D
837 960 D
843 969 D
846 983 D
846 992 D
843 1006 D
837 1015 D
829 1018 D
823 1018 D
S
N
823 1018 M
817 1015 D
814 1012 D
811 1006 D
808 992 D
808 983 D
811 969 D
814 963 D
817 960 D
823 957 D
S
N
829 957 M
834 960 D
837 963 D
840 969 D
843 983 D
843 992 D
840 1006 D
837 1012 D
834 1015 D
829 1018 D
S
N
872 1041 M
878 1044 D
886 1053 D
886 992 D
S
N
883 1050 M
883 992 D
S
N
872 992 M
898 992 D
S
N
757 1838 M
762 1841 D
771 1850 D
771 1789 D
S
N
768 1847 M
768 1789 D
S
N
757 1789 M
783 1789 D
S
N
823 1850 M
814 1847 D
808 1838 D
806 1824 D
806 1815 D
808 1801 D
814 1792 D
823 1789 D
829 1789 D
837 1792 D
843 1801 D
846 1815 D
846 1824 D
843 1838 D
837 1847 D
829 1850 D
823 1850 D
S
N
823 1850 M
817 1847 D
814 1844 D
811 1838 D
808 1824 D
808 1815 D
811 1801 D
814 1795 D
817 1792 D
823 1789 D
S
N
829 1789 M
834 1792 D
837 1795 D
840 1801 D
843 1815 D
843 1824 D
840 1838 D
837 1844 D
834 1847 D
829 1850 D
S
N
866 1873 M
869 1870 D
866 1867 D
863 1870 D
863 1873 D
866 1879 D
869 1882 D
878 1885 D
889 1885 D
898 1882 D
901 1879 D
904 1873 D
904 1867 D
901 1862 D
892 1856 D
878 1850 D
872 1847 D
866 1841 D
863 1833 D
863 1824 D
S
N
889 1885 M
895 1882 D
898 1879 D
901 1873 D
901 1867 D
898 1862 D
889 1856 D
878 1850 D
S
N
863 1830 M
866 1833 D
872 1833 D
886 1827 D
895 1827 D
901 1830 D
904 1833 D
S
N
872 1833 M
886 1824 D
898 1824 D
901 1827 D
904 1833 D
904 1838 D
S
N
757 2671 M
762 2673 D
771 2682 D
771 2622 D
S
N
768 2679 M
768 2622 D
S
N
757 2622 M
783 2622 D
S
N
823 2682 M
814 2679 D
808 2671 D
806 2656 D
806 2647 D
808 2633 D
814 2624 D
823 2622 D
829 2622 D
837 2624 D
843 2633 D
846 2647 D
846 2656 D
843 2671 D
837 2679 D
829 2682 D
823 2682 D
S
N
823 2682 M
817 2679 D
814 2676 D
811 2671 D
808 2656 D
808 2647 D
811 2633 D
814 2627 D
817 2624 D
823 2622 D
S
N
829 2622 M
834 2624 D
837 2627 D
840 2633 D
843 2647 D
843 2656 D
840 2671 D
837 2676 D
834 2679 D
829 2682 D
S
N
866 2705 M
869 2702 D
866 2699 D
863 2702 D
863 2705 D
866 2711 D
869 2714 D
878 2717 D
889 2717 D
898 2714 D
901 2708 D
901 2699 D
898 2694 D
889 2691 D
881 2691 D
S
N
889 2717 M
895 2714 D
898 2708 D
898 2699 D
895 2694 D
889 2691 D
S
N
889 2691 M
895 2688 D
901 2682 D
904 2676 D
904 2668 D
901 2662 D
898 2659 D
889 2656 D
878 2656 D
869 2659 D
866 2662 D
863 2668 D
863 2671 D
866 2673 D
869 2671 D
866 2668 D
S
N
898 2685 M
901 2676 D
901 2668 D
898 2662 D
895 2659 D
889 2656 D
S
N
2550 992 M
2550 2722 D
S
N
2498 992 M
2550 992 D
S
N
2550 1242 M
2533 1242 D
S
N
2533 1389 M
2550 1389 D
S
N
2550 1493 M
2533 1493 D
S
N
2533 1574 M
2550 1574 D
S
N
2550 1639 M
2533 1639 D
S
N
2533 1695 M
2550 1695 D
S
N
2550 1743 M
2533 1743 D
S
N
2533 1786 M
2550 1786 D
S
N
2550 1824 M
2498 1824 D
S
N
2533 2075 M
2550 2075 D
S
N
2550 2221 M
2533 2221 D
S
N
2533 2325 M
2550 2325 D
S
N
2550 2406 M
2533 2406 D
S
N
2533 2472 M
2550 2472 D
S
N
2550 2527 M
2533 2527 D
S
N
2533 2575 M
2550 2575 D
S
N
2550 2618 M
2533 2618 D
S
N
2498 2656 M
2550 2656 D
S
1.00 0.00 0.00 setrgbcolor
1012 1396 P
1051 1835 P
1090 2024 P
1129 2154 P
1168 2232 P
1207 2302 P
1246 2353 P
1285 2405 P
1324 2427 P
1363 2460 P
1402 2493 P
1441 2503 P
1480 2528 P
1518 2547 P
1557 2555 P
1596 2565 P
1635 2575 P
1674 2574 P
1713 2582 P
1752 2588 P
1791 2583 P
1830 2586 P
1869 2577 P
1908 2573 P
1947 2565 P
1986 2551 P
2025 2541 P
2063 2530 P
2102 2506 P
2141 2491 P
2180 2463 P
2219 2431 P
2258 2399 P
2297 2361 P
2336 2309 P
2375 2239 P
2414 2161 P
2453 2024 P
2492 1835 P
2531 1401 P
993 992 P
N
993 1396 M
1032 1396 D
1032 1835 D
1071 1835 D
1071 2024 D
1110 2024 D
1110 2154 D
1149 2154 D
1149 2232 D
1188 2232 D
1188 2302 D
1227 2302 D
1227 2353 D
1265 2353 D
1265 2405 D
1304 2405 D
1304 2427 D
1343 2427 D
1343 2460 D
1382 2460 D
1382 2493 D
1421 2493 D
1421 2503 D
1460 2503 D
1460 2528 D
1499 2528 D
1499 2547 D
1538 2547 D
1538 2555 D
1577 2555 D
1577 2565 D
1616 2565 D
1616 2575 D
1655 2575 D
1655 2574 D
1694 2574 D
1694 2582 D
1733 2582 D
1733 2588 D
1772 2588 D
1772 2583 D
1810 2583 D
1810 2586 D
1849 2586 D
1849 2577 D
1888 2577 D
1888 2573 D
1927 2573 D
1927 2565 D
1966 2565 D
1966 2551 D
2005 2551 D
2005 2541 D
2044 2541 D
2044 2530 D
2083 2530 D
2083 2506 D
2122 2506 D
2122 2491 D
2161 2491 D
2161 2463 D
2200 2463 D
2200 2431 D
2239 2431 D
2239 2399 D
2278 2399 D
2278 2361 D
2316 2361 D
2316 2309 D
2355 2309 D
2355 2239 D
2394 2239 D
2394 2161 D
2433 2161 D
2433 2024 D
2472 2024 D
2472 1835 D
2511 1835 D
2511 1401 D
2550 1401 D
S
2550 992 P
0.00 0.00 1.00 setrgbcolor
1012 1135 P
1051 1561 P
1090 1772 P
1129 1908 P
1168 2005 P
1207 2072 P
1246 2128 P
1285 2171 P
1324 2211 P
1363 2244 P
1402 2270 P
1441 2295 P
1480 2316 P
1518 2334 P
1557 2348 P
1596 2358 P
1635 2369 P
1674 2375 P
1713 2378 P
1752 2381 P
1791 2381 P
1830 2381 P
1869 2374 P
1908 2368 P
1947 2358 P
1986 2346 P
2025 2332 P
2063 2316 P
2102 2293 P
2141 2273 P
2180 2244 P
2219 2211 P
2258 2175 P
2297 2127 P
2336 2073 P
2375 2002 P
2414 1905 P
2453 1773 P
2492 1563 P
2531 1149 P
993 992 P
[8 30] 0 Sd
N
993 1135 M
1032 1135 D
1032 1561 D
1071 1561 D
1071 1772 D
1110 1772 D
1110 1908 D
1149 1908 D
1149 2005 D
1188 2005 D
1188 2072 D
1227 2072 D
1227 2128 D
1265 2128 D
1265 2171 D
1304 2171 D
1304 2211 D
1343 2211 D
1343 2244 D
1382 2244 D
1382 2270 D
1421 2270 D
1421 2295 D
1460 2295 D
1460 2316 D
1499 2316 D
1499 2334 D
1538 2334 D
1538 2348 D
1577 2348 D
1577 2358 D
1616 2358 D
1616 2369 D
1655 2369 D
1655 2375 D
1694 2375 D
1694 2378 D
1733 2378 D
1733 2381 D
1772 2381 D
1772 2381 D
1810 2381 D
1810 2381 D
1849 2381 D
1849 2374 D
1888 2374 D
1888 2368 D
1927 2368 D
1927 2358 D
1966 2358 D
1966 2346 D
2005 2346 D
2005 2332 D
2044 2332 D
2044 2316 D
2083 2316 D
2083 2293 D
2122 2293 D
2122 2273 D
2161 2273 D
2161 2244 D
2200 2244 D
2200 2211 D
2239 2211 D
2239 2175 D
2278 2175 D
2278 2127 D
2316 2127 D
2316 2073 D
2355 2073 D
2355 2002 D
2394 2002 D
2394 1905 D
2433 1905 D
2433 1773 D
2472 1773 D
2472 1563 D
2511 1563 D
2511 1149 D
2550 1149 D
S
[] 0 Sd
2550 992 P
0.00 1.00 0.00 setrgbcolor
1168 1111 P
1207 1214 P
1246 1303 P
1285 1386 P
1324 1446 P
1363 1501 P
1402 1539 P
1441 1588 P
1480 1626 P
1518 1655 P
1557 1678 P
1596 1693 P
1635 1708 P
1674 1719 P
1713 1727 P
1752 1724 P
1791 1734 P
1830 1731 P
1869 1717 P
1908 1709 P
1947 1700 P
1986 1677 P
2025 1650 P
2063 1626 P
2102 1587 P
2141 1556 P
2180 1501 P
2219 1443 P
2258 1383 P
2297 1311 P
2336 1194 P
2375 1119 P
993 992 P
[30 30 8 30] 0 Sd
N
1149 992 M
1149 1111 D
1188 1111 D
1188 1214 D
1227 1214 D
1227 1303 D
1265 1303 D
1265 1386 D
1304 1386 D
1304 1446 D
1343 1446 D
1343 1501 D
1382 1501 D
1382 1539 D
1421 1539 D
1421 1588 D
1460 1588 D
1460 1626 D
1499 1626 D
1499 1655 D
1538 1655 D
1538 1678 D
1577 1678 D
1577 1693 D
1616 1693 D
1616 1708 D
1655 1708 D
1655 1719 D
1694 1719 D
1694 1727 D
1733 1727 D
1733 1724 D
1772 1724 D
1772 1734 D
1810 1734 D
1810 1731 D
1849 1731 D
1849 1717 D
1888 1717 D
1888 1709 D
1927 1709 D
1927 1700 D
1966 1700 D
1966 1677 D
2005 1677 D
2005 1650 D
2044 1650 D
2044 1626 D
2083 1626 D
2083 1587 D
2122 1587 D
2122 1556 D
2161 1556 D
2161 1501 D
2200 1501 D
2200 1443 D
2239 1443 D
2239 1383 D
2278 1383 D
2278 1311 D
2316 1311 D
2316 1194 D
2355 1194 D
2355 1119 D
2394 1119 D
2394 992 D
S
[] 0 Sd
2550 992 P
0.00 1.00 1.00 setrgbcolor
1207 1091 P
1246 1183 P
1285 1257 P
1324 1323 P
1363 1382 P
1402 1431 P
1441 1471 P
1480 1506 P
1518 1536 P
1557 1559 P
1596 1576 P
1635 1591 P
1674 1600 P
1713 1610 P
1752 1613 P
1791 1612 P
1830 1607 P
1869 1602 P
1908 1590 P
1947 1576 P
1986 1558 P
2025 1536 P
2063 1507 P
2102 1473 P
2141 1432 P
2180 1385 P
2219 1326 P
2258 1259 P
2297 1181 P
2336 1089 P
993 992 P
993 992 P
[39] 0 Sd
N
1188 992 M
1188 1091 D
1227 1091 D
1227 1183 D
1265 1183 D
1265 1257 D
1304 1257 D
1304 1323 D
1343 1323 D
1343 1382 D
1382 1382 D
1382 1431 D
1421 1431 D
1421 1471 D
1460 1471 D
1460 1506 D
1499 1506 D
1499 1536 D
1538 1536 D
1538 1559 D
1577 1559 D
1577 1576 D
1616 1576 D
1616 1591 D
1655 1591 D
1655 1600 D
1694 1600 D
1694 1610 D
1733 1610 D
1733 1613 D
1772 1613 D
1772 1612 D
1810 1612 D
1810 1607 D
1849 1607 D
1849 1602 D
1888 1602 D
1888 1590 D
1927 1590 D
1927 1576 D
1966 1576 D
1966 1558 D
2005 1558 D
2005 1536 D
2044 1536 D
2044 1507 D
2083 1507 D
2083 1473 D
2122 1473 D
2122 1432 D
2161 1432 D
2161 1385 D
2200 1385 D
2200 1326 D
2239 1326 D
2239 1259 D
2278 1259 D
2278 1181 D
2316 1181 D
2316 1089 D
2355 1089 D
2355 992 D
S
[] 0 Sd
2550 992 P
2550 992 P
showpage
%%Trailer
%%Pages: 1
%%BoundingBox:
