%!PS-Adobe-2.0 EPSF-2.0
%%BoundingBox:  0 0 567 384
%%Title: /home/dimicco/HiggsScan/compare_MCNLO_MCFM/ptll.eps: canvas_ptll
%%Creator: ROOT Version 5.26/00
%%CreationDate: Fri Dec  9 17:10:29 2011
%%EndComments
%%BeginProlog
80 dict begin
/s {stroke} def /l {lineto} def /m {moveto} def /t {translate} def
/sw {stringwidth} def /r {rotate} def /rl {roll}  def /R {repeat} def
/d {rlineto} def /rm {rmoveto} def /gr {grestore} def /f {eofill} def
/c {setrgbcolor} def /black {0 setgray} def /sd {setdash} def
/cl {closepath} def /sf {scalefont setfont} def /lw {setlinewidth} def
/box {m dup 0 exch d exch 0 d 0 exch neg d cl} def
/NC{systemdict begin initclip end}def/C{NC box clip newpath}def
/bl {box s} def /bf {box f} def /Y { 0 exch d} def /X { 0 d} def 
/mp {newpath /y exch def /x exch def} def
/side {[w .77 mul w .23 mul] .385 w mul sd w 0 l currentpoint t -144 r} def
/mr {mp x y w2 0 360 arc} def /m24 {mr s} def /m20 {mr f} def
/mb {mp x y w2 add m w2 neg 0 d 0 w neg d w 0 d 0 w d cl} def
/mt {mp x y w2 add m w2 neg w neg d w 0 d cl} def
/m21 {mb f} def /m25 {mb s} def /m22 {mt f} def /m26{mt s} def
/m23 {mp x y w2 sub m w2 w d w neg 0 d cl f} def
/m27 {mp x y w2 add m w3 neg w2 neg d w3 w2 neg d w3 w2 d cl s} def
/m28 {mp x w2 sub y w2 sub w3 add m w3 0 d  0 w3 neg d w3 0 d 0 w3 d w3 0 d  0 w3 d w3 neg 0 d 0 w3 d w3 neg 0 d
 0 w3 neg d w3 neg 0 d cl s } def
/m29 {mp gsave x w2 sub y w2 add w3 sub m currentpoint t
 4 {side} repeat cl fill gr} def
/m30 {mp gsave x w2 sub y w2 add w3 sub m currentpoint t
 4 {side} repeat cl s gr} def
/m31 {mp x y w2 sub m 0 w d x w2 sub y m w 0 d x w2 sub y w2 add m w w neg d x w2 sub y w2
 sub m w w d s} def
/m2 {mp x y w2 sub m 0 w d x w2 sub y m w 0 d s} def
/m5 {mp x w2 sub y w2 sub m w w d x w2 sub y w2 add m w w neg d s} def
/reEncode {exch findfont dup length dict begin {1 index /FID eq  {pop pop} {def} ifelse } forall /Encoding exch def currentdict end dup /FontName get exch definefont pop } def [/Times-Bold /Times-Italic /Times-BoldItalic /Helvetica
 /Helvetica-Oblique /Helvetica-Bold /Helvetica-BoldOblique /Courier /Courier-Oblique /Courier-Bold /Courier-BoldOblique /Times-Roman /AvantGarde-Book /AvantGarde-BookOblique /AvantGarde-Demi /AvantGarde-DemiOblique /Bookman-Demi
 /Bookman-DemiItalic /Bookman-Light /Bookman-LightItalic /Helvetica-Narrow /Helvetica-Narrow-Bold /Helvetica-Narrow-BoldOblique /Helvetica-Narrow-Oblique /NewCenturySchlbk-Roman /NewCenturySchlbk-Bold
 /NewCenturySchlbk-BoldItalic /NewCenturySchlbk-Italic /Palatino-Bold /Palatino-BoldItalic /Palatino-Italic /Palatino-Roman ] {ISOLatin1Encoding reEncode } forall
/oshow {gsave [] 0 sd true charpath stroke gr} def
/stwn { /fs exch def /fn exch def /text exch def fn findfont fs sf
 text sw pop xs add /xs exch def} def
/stwb { /fs exch def /fn exch def /nbas exch def /textf exch deftextf length /tlen exch def nbas tlen gt {/nbas tlendef} iffn findfont fs sf textf dup length nbas sub nbas getinterval sw
pop neg xs add /xs exch def} def
%%EndProlog
%%BeginSetup
%%EndSetup
newpath  gsave  .25 .25 scale  gsave  0 0 t black[  ] 0 sd 3 lw 1 1 1 c 2268 1538 0 0 bf black 1 1 1 c 1791 1215 363 246 bf black 1791 1215 363 246 bl 1 1 1 c 1791 1215 363 246 bf black 1791 1215 363 246 bl 1 0 0 c 6 lw 1 1 1 c 1 0 0 c 363 301 m 61
 X s 451 301 m 61 X s 3 lw /w 29 def /w2 {w 2 div} def /w3 {w 3 div} def 437 301 m20 6 lw 512 414 m 62 X s 600 414 m 61 X s 3 lw 587 414 m20 6 lw 661 581 m 62 X s 749 581 m 62 X s 3 lw 736 581 m20 6 lw 811 841 m 61 X s 898 841 m 62 X s 3 lw 885 841
 m20 6 lw 1035 1175 m 1 Y s 1035 1202 m s 960 1189 m 62 X s 1048 1189 m 61 X s 3 lw 1035 1189 m20 6 lw 1184 1359 m 1 Y s 1184 1386 m 1 Y s 1109 1373 m 62 X s 1197 1373 m 62 X s 3 lw 1184 1373 m20 6 lw 1333 1374 m 2 Y s 1333 1402 m 1 Y s 1259 1389 m
 61 X s 1346 1389 m 62 X s 3 lw 1333 1389 m20 6 lw 1483 1192 m s 1483 1218 m s 1408 1205 m 61 X s 1496 1205 m 61 X s 3 lw 1483 1205 m20 6 lw 1557 980 m 62 X s 1645 980 m 61 X s 3 lw 1632 980 m20 6 lw 1706 727 m 62 X s 1794 727 m 62 X s 3 lw 1781 727
 m20 6 lw 1856 533 m 61 X s 1943 533 m 62 X s 3 lw 1930 533 m20 6 lw 2005 424 m 62 X s 2093 424 m 61 X s 3 lw 2080 424 m20 6 lw black 3 lw 363 246 m 1791 X s
 gsave  2268 1538 0 0 C 1955 88 t 0 r /Helvetica findfont 71.6807 sf 0 0 m ( [GeV]) show NC gr 
 gsave  2268 1538 0 0 C 1926 111 t 0 r /Helvetica findfont 48.8732 sf 0 0 m (ll) show NC gr 
 gsave  2268 1538 0 0 C 1926 52 t 0 r /Helvetica findfont 48.8732 sf 0 0 m (T) show NC gr 
 gsave  2268 1538 0 0 C 1887 88 t 0 r /Helvetica findfont 71.6807 sf 0 0 m (p) show NC gr  363 283 m -37 Y s 400 264 m -18 Y s 437 264 m -18 Y s 475 264 m -18 Y s 512 264 m -18 Y s 549 283 m -37 Y s 587 264 m -18 Y s 624 264 m -18 Y s 661 264 m -18
 Y s 699 264 m -18 Y s 736 283 m -37 Y s 773 264 m -18 Y s 811 264 m -18 Y s 848 264 m -18 Y s 885 264 m -18 Y s 923 283 m -37 Y s 960 264 m -18 Y s 997 264 m -18 Y s 1035 264 m -18 Y s 1072 264 m -18 Y s 1109 283 m -37 Y s 1147 264 m -18 Y s 1184
 264 m -18 Y s 1221 264 m -18 Y s 1259 264 m -18 Y s 1296 283 m -37 Y s 1333 264 m -18 Y s 1371 264 m -18 Y s 1408 264 m -18 Y s 1445 264 m -18 Y s 1483 283 m -37 Y s 1520 264 m -18 Y s 1557 264 m -18 Y s 1594 264 m -18 Y s 1632 264 m -18 Y s 1669
 283 m -37 Y s 1706 264 m -18 Y s 1744 264 m -18 Y s 1781 264 m -18 Y s 1818 264 m -18 Y s 1856 283 m -37 Y s 1893 264 m -18 Y s 1930 264 m -18 Y s 1968 264 m -18 Y s 2005 264 m -18 Y s 2042 283 m -37 Y s 2042 283 m -37 Y s 2080 264 m -18 Y s 2117
 264 m -18 Y s
 gsave  2268 1538 0 0 C 342 179 t 0 r /Helvetica findfont 71.6807 sf 0 0 m (0) show NC gr 
 gsave  2268 1538 0 0 C 508 179 t 0 r /Helvetica findfont 71.6807 sf 0 0 m (10) show NC gr 
 gsave  2268 1538 0 0 C 694 179 t 0 r /Helvetica findfont 71.6807 sf 0 0 m (20) show NC gr 
 gsave  2268 1538 0 0 C 883 179 t 0 r /Helvetica findfont 71.6807 sf 0 0 m (30) show NC gr 
 gsave  2268 1538 0 0 C 1069 179 t 0 r /Helvetica findfont 71.6807 sf 0 0 m (40) show NC gr 
 gsave  2268 1538 0 0 C 1254 179 t 0 r /Helvetica findfont 71.6807 sf 0 0 m (50) show NC gr 
 gsave  2268 1538 0 0 C 1443 179 t 0 r /Helvetica findfont 71.6807 sf 0 0 m (60) show NC gr 
 gsave  2268 1538 0 0 C 1629 179 t 0 r /Helvetica findfont 71.6807 sf 0 0 m (70) show NC gr 
 gsave  2268 1538 0 0 C 1815 179 t 0 r /Helvetica findfont 71.6807 sf 0 0 m (80) show NC gr 
 gsave  2268 1538 0 0 C 2001 179 t 0 r /Helvetica findfont 71.6807 sf 0 0 m (90) show NC gr  363 1461 m 1791 X s 363 1425 m 36 Y s 400 1443 m 18 Y s 437 1443 m 18 Y s 475 1443 m 18 Y s 512 1443 m 18 Y s 549 1425 m 36 Y s 587 1443 m 18 Y s 624 1443 m
 18 Y s 661 1443 m 18 Y s 699 1443 m 18 Y s 736 1425 m 36 Y s 773 1443 m 18 Y s 811 1443 m 18 Y s 848 1443 m 18 Y s 885 1443 m 18 Y s 923 1425 m 36 Y s 960 1443 m 18 Y s 997 1443 m 18 Y s 1035 1443 m 18 Y s 1072 1443 m 18 Y s 1109 1425 m 36 Y s 1147
 1443 m 18 Y s 1184 1443 m 18 Y s 1221 1443 m 18 Y s 1259 1443 m 18 Y s 1296 1425 m 36 Y s 1333 1443 m 18 Y s 1371 1443 m 18 Y s 1408 1443 m 18 Y s 1445 1443 m 18 Y s 1483 1425 m 36 Y s 1520 1443 m 18 Y s 1557 1443 m 18 Y s 1594 1443 m 18 Y s 1632
 1443 m 18 Y s 1669 1425 m 36 Y s 1706 1443 m 18 Y s 1744 1443 m 18 Y s 1781 1443 m 18 Y s 1818 1443 m 18 Y s 1856 1425 m 36 Y s 1893 1443 m 18 Y s 1930 1443 m 18 Y s 1968 1443 m 18 Y s 2005 1443 m 18 Y s 2042 1425 m 36 Y s 2042 1425 m 36 Y s 2080
 1443 m 18 Y s 2117 1443 m 18 Y s 363 246 m 1215 Y s
 gsave  2268 1538 0 0 C 163 1030 t 90 r /Helvetica findfont 71.6807 sf 0 0 m (arbitrary units) show NC gr  417 246 m -54 X s 390 281 m -27 X s 390 317 m -27 X s 390 352 m -27 X s 417 387 m -54 X s 390 423 m -27 X s 390 458 m -27 X s 390 493 m -27 X
 s 417 529 m -54 X s 390 564 m -27 X s 390 599 m -27 X s 390 635 m -27 X s 417 670 m -54 X s 390 705 m -27 X s 390 741 m -27 X s 390 776 m -27 X s 417 811 m -54 X s 390 847 m -27 X s 390 882 m -27 X s 390 917 m -27 X s 417 953 m -54 X s 390 988 m
 -27 X s 390 1023 m -27 X s 390 1059 m -27 X s 417 1094 m -54 X s 390 1129 m -27 X s 390 1165 m -27 X s 390 1200 m -27 X s 417 1235 m -54 X s 390 1271 m -27 X s 390 1306 m -27 X s 390 1341 m -27 X s 417 1377 m -54 X s 417 1377 m -54 X s 390 1412 m
 -27 X s 390 1447 m -27 X s
 gsave  2268 1538 0 0 C 310 222 t 0 r /Helvetica findfont 71.6807 sf 0 0 m (0) show NC gr 
 gsave  2268 1538 0 0 C 212 362 t 0 r /Helvetica findfont 71.6807 sf 0 0 m (0.02) show NC gr 
 gsave  2268 1538 0 0 C 212 505 t 0 r /Helvetica findfont 71.6807 sf 0 0 m (0.04) show NC gr 
 gsave  2268 1538 0 0 C 212 645 t 0 r /Helvetica findfont 71.6807 sf 0 0 m (0.06) show NC gr 
 gsave  2268 1538 0 0 C 212 788 t 0 r /Helvetica findfont 71.6807 sf 0 0 m (0.08) show NC gr 
 gsave  2268 1538 0 0 C 261 929 t 0 r /Helvetica findfont 71.6807 sf 0 0 m (0.1) show NC gr 
 gsave  2268 1538 0 0 C 212 1069 t 0 r /Helvetica findfont 71.6807 sf 0 0 m (0.12) show NC gr 
 gsave  2268 1538 0 0 C 212 1212 t 0 r /Helvetica findfont 71.6807 sf 0 0 m (0.14) show NC gr 
 gsave  2268 1538 0 0 C 212 1352 t 0 r /Helvetica findfont 71.6807 sf 0 0 m (0.16) show NC gr  2154 246 m 1215 Y s 2101 246 m 53 X s 2127 281 m 27 X s 2127 317 m 27 X s 2127 352 m 27 X s 2101 387 m 53 X s 2127 423 m 27 X s 2127 458 m 27 X s 2127 493
 m 27 X s 2101 529 m 53 X s 2127 564 m 27 X s 2127 599 m 27 X s 2127 635 m 27 X s 2101 670 m 53 X s 2127 705 m 27 X s 2127 741 m 27 X s 2127 776 m 27 X s 2101 811 m 53 X s 2127 847 m 27 X s 2127 882 m 27 X s 2127 917 m 27 X s 2101 953 m 53 X s 2127
 988 m 27 X s 2127 1023 m 27 X s 2127 1059 m 27 X s 2101 1094 m 53 X s 2127 1129 m 27 X s 2127 1165 m 27 X s 2127 1200 m 27 X s 2101 1235 m 53 X s 2127 1271 m 27 X s 2127 1306 m 27 X s 2127 1341 m 27 X s 2101 1377 m 53 X s 2101 1377 m 53 X s 2127
 1412 m 27 X s 2127 1447 m 27 X s 0 0 1 c 6 lw 1 1 1 c black 0 0 1 c 363 280 m 149 X 81 Y 149 X 118 Y 150 X 318 Y 149 X 369 Y 149 X 213 Y 150 X 31 Y 149 X -144 Y 149 X -219 Y 149 X -262 Y 150 X -231 Y 149 X -124 Y 149 X s 1 1 1 c 0 lw 707 228 997
 358 bf 3 lw 1017 358 m -13 Y 700 X 222 Y -13 X -209 Y f 0 lw 997 358 m 228 Y 707 X -228 Y -707 X cl s black
 gsave  2268 1538 0 0 C 1173 499 t 0 r /Helvetica findfont 87.9718 sf 0 0 m (MCFM) show NC gr  1 1 1 c 3 lw 1024 490 m 123 X 79 Y -123 X f 0 lw 0 0 1 c 6 lw 1024 529 m 123 X s black 3 lw 1085 529 m20 6 lw
 gsave  2268 1538 0 0 C 1173 391 t 0 r /Helvetica findfont 87.9718 sf 0 0 m (MC@NLO) show NC gr  1 1 1 c 3 lw 1024 376 m 123 X 79 Y -123 X f 6 lw 1 0 0 c 1024 415 m 123 X s 3 lw 1085 415 m20 6 lw black
 gsave  2268 1538 0 0 C 2222 1118 t 90 r /Helvetica-BoldOblique findfont 29.3239 sf 0 0 m (LHC HIGGS XS WG 2011) show NC gr 
 gr  gr 
showpage
end
%%EOF
