%!PS-Adobe-2.0 EPSF-2.0
%%BoundingBox:  0 0 567 384
%%Title: pto1.eps: pto1
%%Creator: ROOT Version 5.27/06b
%%CreationDate: Fri Dec  9 13:47:43 2011
%%EndComments
%%BeginProlog
80 dict begin
/s {stroke} def /l {lineto} def /m {moveto} def /t {translate} def
/r {rotate} def /rl {roll}  def /R {repeat} def
/d {rlineto} def /rm {rmoveto} def /gr {grestore} def /f {eofill} def
/c {setrgbcolor} def /black {0 setgray} def /sd {setdash} def
/cl {closepath} def /sf {scalefont setfont} def /lw {setlinewidth} def
/box {m dup 0 exch d exch 0 d 0 exch neg d cl} def
/NC{systemdict begin initclip end}def/C{NC box clip newpath}def
/bl {box s} def /bf {box f} def /Y { 0 exch d} def /X { 0 d} def 
/K {{pop pop 0 moveto} exch kshow} bind def
/ita {/ang 15 def gsave [1 0 ang dup sin exch cos div 1 0 0] concat} def 
/mp {newpath /y exch def /x exch def} def
/side {[w .77 mul w .23 mul] .385 w mul sd w 0 l currentpoint t -144 r} def
/mr {mp x y w2 0 360 arc} def /m24 {mr s} def /m20 {mr f} def
/mb {mp x y w2 add m w2 neg 0 d 0 w neg d w 0 d 0 w d cl} def
/mt {mp x y w2 add m w2 neg w neg d w 0 d cl} def
/m21 {mb f} def /m25 {mb s} def /m22 {mt f} def /m26{mt s} def
/m23 {mp x y w2 sub m w2 w d w neg 0 d cl f} def
/m27 {mp x y w2 add m w3 neg w2 neg d w3 w2 neg d w3 w2 d cl s} def
/m28 {mp x w2 sub y w2 sub w3 add m w3 0 d  0 w3 neg d w3 0 d 0 w3 d w3 0 d  0 w3 d w3 neg 0 d 0 w3 d w3 neg 0 d 0 w3 neg d w3 neg 0 d cl s } def
/m29 {mp gsave x w2 sub y w2 add w3 sub m currentpoint t 4 {side} repeat cl fill gr} def
/m30 {mp gsave x w2 sub y w2 add w3 sub m currentpoint t 4 {side} repeat cl s gr} def
/m31 {mp x y w2 sub m 0 w d x w2 sub y m w 0 d x w2 sub y w2 add m w w neg d x w2 sub y w2 sub m w w d s} def
/m32 {mp x y w2 sub m w2 w d w neg 0 d cl s} def
/m33 {mp x y w2 add m w3 neg w2 neg d w3 w2 neg d w3 w2 d cl f} def
/m34 {mp x w2 sub y w2 sub w3 add m w3 0 d  0 w3 neg d w3 0 d 0 w3 d w3 0 d  0 w3 d w3 neg 0 d 0 w3 d w3 neg 0 d 0 w3 neg d w3 neg 0 d cl f } def
/m2 {mp x y w2 sub m 0 w d x w2 sub y m w 0 d s} def
/m5 {mp x w2 sub y w2 sub m w w d x w2 sub y w2 add m w w neg d s} def
/reEncode {exch findfont dup length dict begin {1 index /FID eq  {pop pop} {def} ifelse } forall /Encoding exch def currentdict end dup /FontName get exch definefont pop } def [/Times-Bold /Times-Italic /Times-BoldItalic /Helvetica /Helvetica-Oblique
 /Helvetica-Bold /Helvetica-BoldOblique /Courier /Courier-Oblique /Courier-Bold /Courier-BoldOblique /Times-Roman /AvantGarde-Book /AvantGarde-BookOblique /AvantGarde-Demi /AvantGarde-DemiOblique /Bookman-Demi /Bookman-DemiItalic /Bookman-Light
 /Bookman-LightItalic /Helvetica-Narrow /Helvetica-Narrow-Bold /Helvetica-Narrow-BoldOblique /Helvetica-Narrow-Oblique /NewCenturySchlbk-Roman /NewCenturySchlbk-Bold /NewCenturySchlbk-BoldItalic /NewCenturySchlbk-Italic /Palatino-Bold
 /Palatino-BoldItalic /Palatino-Italic /Palatino-Roman ] {ISOLatin1Encoding reEncode } forall%%EndProlog
%%BeginSetup
%%EndSetup
newpath  gsave  .25 .25 scale  gsave  0 0 t black[  ] 0 sd 3 lw 1 1 1 c 2268 1538 0 0 bf black 1 1 1 c 1791 1215 363 246 bf black 1791 1215 363 246 bl 1 0 0 c 6 lw 1 1 1 c black 3 lw /w 31 def /w2 {w 2 div} def /w3 {w 3 div} def 385 348 m20 6 lw 3 lw
 430 348 m20 6 lw 3 lw 475 348 m20 6 lw 3 lw 520 348 m20 6 lw 3 lw 564 348 m20 6 lw 1 0 0 c 609 331 m 4 Y s 609 361 m 4 Y s 3 lw black 609 348 m20 6 lw 1 0 0 c 654 325 m 11 Y s 654 362 m 11 Y s 3 lw black 654 349 m20 6 lw 1 0 0 c 699 311 m 26 Y s 699
 363 m 26 Y s 3 lw black 699 350 m20 6 lw 1 0 0 c 744 301 m 41 Y s 744 368 m 41 Y s 3 lw black 744 355 m20 6 lw 1 0 0 c 788 312 m 66 Y s 788 404 m 66 Y s 3 lw black 788 391 m20 6 lw 1 0 0 c 833 321 m 79 Y s 833 427 m 79 Y s 3 lw black 833 414 m20 6
 lw 1 0 0 c 878 326 m 95 Y s 878 447 m 95 Y s 3 lw black 878 434 m20 6 lw 1 0 0 c 923 347 m 97 Y s 923 470 m 97 Y s 3 lw black 923 457 m20 6 lw 1 0 0 c 967 394 m 94 Y s 967 514 m 94 Y s 3 lw black 967 501 m20 6 lw 1 0 0 c 1012 398 m 98 Y s 1012 522 m
 98 Y s 3 lw black 1012 509 m20 6 lw 1 0 0 c 1057 429 m 99 Y s 1057 554 m 98 Y s 3 lw black 1057 541 m20 6 lw 1 0 0 c 1102 478 m 96 Y s 1102 600 m 96 Y s 3 lw black 1102 587 m20 6 lw 1 0 0 c 1147 493 m 111 Y s 1147 630 m 112 Y s 3 lw black 1147 617
 m20 6 lw 1 0 0 c 1191 491 m 98 Y s 1191 615 m 97 Y s 3 lw black 1191 602 m20 6 lw 1 0 0 c 1236 516 m 124 Y s 1236 666 m 125 Y s 3 lw black 1236 653 m20 6 lw 1 0 0 c 1281 543 m 107 Y s 1281 676 m 107 Y s 3 lw black 1281 663 m20 6 lw 1 0 0 c 1326 580
 m 135 Y s 1326 741 m 135 Y s 3 lw black 1326 728 m20 6 lw 1 0 0 c 1371 622 m 118 Y s 1371 766 m 118 Y s 3 lw black 1371 753 m20 6 lw 1 0 0 c 1415 630 m 142 Y s 1415 798 m 142 Y s 3 lw black 1415 785 m20 6 lw 1 0 0 c 1460 706 m 140 Y s 1460 872 m 140
 Y s 3 lw black 1460 859 m20 6 lw 1 0 0 c 1505 825 m 143 Y s 1505 994 m 144 Y s 3 lw black 1505 981 m20 6 lw 1 0 0 c 1550 834 m 143 Y s 1550 1003 m 143 Y s 3 lw black 1550 990 m20 6 lw 1 0 0 c 1594 861 m 157 Y s 1594 1044 m 157 Y s 3 lw black 1594
 1031 m20 6 lw 1 0 0 c 1639 946 m 151 Y s 1639 1123 m 151 Y s 3 lw black 1639 1110 m20 6 lw 1 0 0 c 1684 999 m 143 Y s 1684 1168 m 144 Y s 3 lw black 1684 1155 m20 6 lw 1 0 0 c 1729 1053 m 162 Y s 1729 1241 m 162 Y s 3 lw black 1729 1228 m20 6 lw 1 0
 0 c 1774 940 m 165 Y s 1774 1131 m 165 Y s 3 lw black 1774 1118 m20 6 lw 1 0 0 c 1818 1018 m 143 Y s 1818 1187 m 143 Y s 3 lw black 1818 1174 m20 6 lw 1 0 0 c 1863 958 m 128 Y s 1863 1112 m 128 Y s 3 lw black 1863 1099 m20 6 lw 1 0 0 c 1908 982 m
 156 Y s 1908 1164 m 156 Y s 3 lw black 1908 1151 m20 6 lw 1 0 0 c 1953 918 m 168 Y s 1953 1112 m 167 Y s 3 lw black 1953 1099 m20 6 lw 1 0 0 c 1998 976 m 134 Y s 1998 1136 m 134 Y s 3 lw black 1998 1123 m20 6 lw 1 0 0 c 2042 894 m 122 Y s 2042 1042
 m 122 Y s 3 lw black 2042 1029 m20 6 lw 1 0 0 c 2087 837 m 124 Y s 2087 987 m 124 Y s 3 lw black 2087 974 m20 6 lw 1 0 0 c 2132 841 m 110 Y s 2132 977 m 110 Y s 3 lw black 2132 964 m20 6 lw 1 0 0 c 1 1 1 c black 1 0 0 c 363 348 m 269 X 1 Y 44 X 1 Y
 45 X 5 Y 45 X 36 Y 45 X 23 Y 44 X 20 Y 45 X 23 Y 45 X 44 Y 45 X 8 Y 45 X 32 Y 44 X 46 Y 45 X 30 Y 45 X -15 Y 45 X 51 Y 45 X 10 Y 44 X 65 Y 45 X 25 Y 45 X 32 Y 45 X 74 Y 45 X 122 Y 44 X 9 Y 45 X 41 Y 45 X 79 Y 45 X 45 Y 44 X 73 Y 45 X -110 Y 45 X 56
 Y 45 X -75 Y 45 X 52 Y 44 X -52 Y 45 X 24 Y 45 X -94 Y 45 X -55 Y 45 X -10 Y 44 X s black 3 lw 363 246 m 1791 X s
 gsave  2268 1538 0 0 C 1955.06 97.6875 t 0 r /Helvetica findfont 71.6807 sf 0 0 m ( [GeV]) show NC gr 
 gsave  2268 1538 0 0 C 1925.75 58.5625 t 0 r /Helvetica findfont 48.8732 sf 0 0 m (T) show NC gr 
 gsave  2268 1538 0 0 C 1420.75 97.6875 t 0 r /Helvetica findfont 71.6807 sf 0 0 m (leading lepton p) show NC gr  363 283 m -37 Y s 408 264 m -18 Y s 452 264 m -18 Y s 497 264 m -18 Y s 542 283 m -37 Y s 587 264 m -18 Y s 632 264 m -18 Y s 676 264 m
 -18 Y s 721 283 m -37 Y s 766 264 m -18 Y s 811 264 m -18 Y s 855 264 m -18 Y s 900 283 m -37 Y s 945 264 m -18 Y s 990 264 m -18 Y s 1035 264 m -18 Y s 1079 283 m -37 Y s 1124 264 m -18 Y s 1169 264 m -18 Y s 1214 264 m -18 Y s 1259 283 m -37 Y s
 1303 264 m -18 Y s 1348 264 m -18 Y s 1393 264 m -18 Y s 1438 283 m -37 Y s 1483 264 m -18 Y s 1527 264 m -18 Y s 1572 264 m -18 Y s 1617 283 m -37 Y s 1662 264 m -18 Y s 1706 264 m -18 Y s 1751 264 m -18 Y s 1796 283 m -37 Y s 1841 264 m -18 Y s
 1886 264 m -18 Y s 1930 264 m -18 Y s 1975 283 m -37 Y s 2020 264 m -18 Y s 2065 264 m -18 Y s 2110 264 m -18 Y s 2154 283 m -37 Y s
 gsave  2268 1538 0 0 C 342.25 179.125 t 0 r /Helvetica findfont 71.6807 sf 0 0 m (0) show NC gr 
 gsave  2268 1538 0 0 C 501.938 179.125 t 0 r /Helvetica findfont 71.6807 sf 0 0 m (20) show NC gr 
 gsave  2268 1538 0 0 C 681.125 179.125 t 0 r /Helvetica findfont 71.6807 sf 0 0 m (40) show NC gr 
 gsave  2268 1538 0 0 C 860.312 179.125 t 0 r /Helvetica findfont 71.6807 sf 0 0 m (60) show NC gr 
 gsave  2268 1538 0 0 C 1039.5 179.125 t 0 r /Helvetica findfont 71.6807 sf 0 0 m (80) show NC gr 
 gsave  2268 1538 0 0 C 1199.19 179.125 t 0 r /Helvetica findfont 71.6807 sf 0 0 m (100) show NC gr 
 gsave  2268 1538 0 0 C 1378.38 179.125 t 0 r /Helvetica findfont 71.6807 sf 0 0 m (120) show NC gr 
 gsave  2268 1538 0 0 C 1557.56 179.125 t 0 r /Helvetica findfont 71.6807 sf 0 0 m (140) show NC gr 
 gsave  2268 1538 0 0 C 1736.81 179.125 t 0 r /Helvetica findfont 71.6807 sf 0 0 m (160) show NC gr 
 gsave  2268 1538 0 0 C 1916 179.125 t 0 r /Helvetica findfont 71.6807 sf 0 0 m (180) show NC gr 
 gsave  2268 1538 0 0 C 2095.19 179.125 t 0 r /Helvetica findfont 71.6807 sf 0 0 m (200) show NC gr  363 1461 m 1791 X s 363 1425 m 36 Y s 408 1443 m 18 Y s 452 1443 m 18 Y s 497 1443 m 18 Y s 542 1425 m 36 Y s 587 1443 m 18 Y s 632 1443 m 18 Y s 676
 1443 m 18 Y s 721 1425 m 36 Y s 766 1443 m 18 Y s 811 1443 m 18 Y s 855 1443 m 18 Y s 900 1425 m 36 Y s 945 1443 m 18 Y s 990 1443 m 18 Y s 1035 1443 m 18 Y s 1079 1425 m 36 Y s 1124 1443 m 18 Y s 1169 1443 m 18 Y s 1214 1443 m 18 Y s 1259 1425 m 36
 Y s 1303 1443 m 18 Y s 1348 1443 m 18 Y s 1393 1443 m 18 Y s 1438 1425 m 36 Y s 1483 1443 m 18 Y s 1527 1443 m 18 Y s 1572 1443 m 18 Y s 1617 1425 m 36 Y s 1662 1443 m 18 Y s 1706 1443 m 18 Y s 1751 1443 m 18 Y s 1796 1425 m 36 Y s 1841 1443 m 18 Y
 s 1886 1443 m 18 Y s 1930 1443 m 18 Y s 1975 1425 m 36 Y s 2020 1443 m 18 Y s 2065 1443 m 18 Y s 2110 1443 m 18 Y s 2154 1425 m 36 Y s 363 246 m 1215 Y s
 gsave  2268 1538 0 0 C 172.875 755.75 t 90 r /Helvetica findfont 71.6807 sf 0 0 m (arbitrary normalization) show NC gr  417 348 m -54 X s 390 378 m -27 X s 390 408 m -27 X s 390 438 m -27 X s 390 468 m -27 X s 417 498 m -54 X s 390 527 m -27 X s 390
 557 m -27 X s 390 587 m -27 X s 390 617 m -27 X s 417 647 m -54 X s 390 677 m -27 X s 390 707 m -27 X s 390 737 m -27 X s 390 766 m -27 X s 417 796 m -54 X s 390 826 m -27 X s 390 856 m -27 X s 390 886 m -27 X s 390 916 m -27 X s 417 946 m -54 X s
 390 975 m -27 X s 390 1005 m -27 X s 390 1035 m -27 X s 390 1065 m -27 X s 417 1095 m -54 X s 390 1125 m -27 X s 390 1155 m -27 X s 390 1185 m -27 X s 390 1214 m -27 X s 417 1244 m -54 X s 390 1274 m -27 X s 390 1304 m -27 X s 390 1334 m -27 X s 390
 1364 m -27 X s 417 1394 m -54 X s 417 348 m -54 X s 390 318 m -27 X s 390 288 m -27 X s 390 259 m -27 X s 417 1394 m -54 X s 390 1424 m -27 X s 390 1453 m -27 X s
 gsave  2268 1538 0 0 C 309.75 322.5 t 0 r /Helvetica findfont 71.6807 sf 0 0 m (0) show NC gr 
 gsave  2268 1538 0 0 C 221.75 472.312 t 0 r /Helvetica findfont 71.6807 sf 0 0 m (0.01) show NC gr 
 gsave  2268 1538 0 0 C 212 622.188 t 0 r /Helvetica findfont 71.6807 sf 0 0 m (0.02) show NC gr 
 gsave  2268 1538 0 0 C 212 772.062 t 0 r /Helvetica findfont 71.6807 sf 0 0 m (0.03) show NC gr 
 gsave  2268 1538 0 0 C 212 921.938 t 0 r /Helvetica findfont 71.6807 sf 0 0 m (0.04) show NC gr 
 gsave  2268 1538 0 0 C 212 1071.81 t 0 r /Helvetica findfont 71.6807 sf 0 0 m (0.05) show NC gr 
 gsave  2268 1538 0 0 C 212 1218.44 t 0 r /Helvetica findfont 71.6807 sf 0 0 m (0.06) show NC gr 
 gsave  2268 1538 0 0 C 212 1368.31 t 0 r /Helvetica findfont 71.6807 sf 0 0 m (0.07) show NC gr  2154 246 m 1215 Y s 2101 348 m 53 X s 2127 378 m 27 X s 2127 408 m 27 X s 2127 438 m 27 X s 2127 468 m 27 X s 2101 498 m 53 X s 2127 527 m 27 X s 2127
 557 m 27 X s 2127 587 m 27 X s 2127 617 m 27 X s 2101 647 m 53 X s 2127 677 m 27 X s 2127 707 m 27 X s 2127 737 m 27 X s 2127 766 m 27 X s 2101 796 m 53 X s 2127 826 m 27 X s 2127 856 m 27 X s 2127 886 m 27 X s 2127 916 m 27 X s 2101 946 m 53 X s
 2127 975 m 27 X s 2127 1005 m 27 X s 2127 1035 m 27 X s 2127 1065 m 27 X s 2101 1095 m 53 X s 2127 1125 m 27 X s 2127 1155 m 27 X s 2127 1185 m 27 X s 2127 1214 m 27 X s 2101 1244 m 53 X s 2127 1274 m 27 X s 2127 1304 m 27 X s 2127 1334 m 27 X s
 2127 1364 m 27 X s 2101 1394 m 53 X s 2101 348 m 53 X s 2127 318 m 27 X s 2127 288 m 27 X s 2127 259 m 27 X s 2101 1394 m 53 X s 2127 1424 m 27 X s 2127 1453 m 27 X s 6 lw 1 1 1 c black 363 349 m 45 X 1 Y 44 X 5 Y 45 X 4 Y 45 X 4 Y 45 X 4 Y 45 X 5 Y
 44 X 5 Y 45 X 17 Y 45 X 42 Y 45 X 40 Y 44 X 28 Y 45 X 30 Y 45 X 24 Y 45 X 33 Y 45 X 20 Y 44 X 33 Y 45 X 31 Y 45 X 26 Y 45 X 23 Y 45 X 42 Y 44 X 39 Y 45 X 30 Y 45 X 39 Y 45 X 33 Y 45 X 58 Y 44 X 25 Y 45 X 30 Y 45 X 32 Y 45 X 17 Y 44 X 8 Y 45 X -10 Y
 45 X -1 Y 45 X -27 Y 45 X -18 Y 44 X -22 Y 45 X -38 Y 45 X -48 Y 45 X -46 Y 45 X -39 Y 44 X s 0 0 1 c[  12 12 ] 0 sd 1 1 1 c black 0 0 1 c 363 349 m 45 X 2 Y 44 X 4 Y 45 X 4 Y 45 X 4 Y 45 X 5 Y 45 X 5 Y 44 X 5 Y 45 X 17 Y 45 X 43 Y 45 X 41 Y 44 X 29
 Y 45 X 30 Y 45 X 24 Y 45 X 34 Y 45 X 20 Y 44 X 32 Y 45 X 32 Y 45 X 26 Y 45 X 23 Y 45 X 42 Y 44 X 38 Y 45 X 30 Y 45 X 40 Y 45 X 31 Y 45 X 58 Y 44 X 25 Y 45 X 30 Y 45 X 28 Y 45 X 19 Y 44 X 6 Y 45 X -11 Y 45 X -4 Y 45 X -29 Y 45 X -18 Y 44 X -25 Y 45 X
 -38 Y 45 X -49 Y 45 X -46 Y 45 X -40 Y 44 X s black
 gsave  2268 1538 0 0 C 2199.44 1123.94 t 90 r /Helvetica-BoldOblique findfont 29.3239 sf 0 0 m 
 317 303 287 271 263 240 213 205 186 167 159 140 118 95 87 67 59 38 17
(LHC HIGGS XS WG 2011) K NC gr 
 gr  gr showpage
end
%%EOF
