%!PS-Adobe-2.0 EPSF-2.0
%%BoundingBox:  0 0 567 488
%%Title: Results/m120-600-dphijjmaxpt-mstw2008.eps: VBF - HAWK
%%Creator: ROOT Version 5.28/00c
%%CreationDate: Fri Nov 25 16:08:41 2011
%%EndComments
%%BeginProlog
80 dict begin
/s {stroke} def /l {lineto} def /m {moveto} def /t {translate} def
/r {rotate} def /rl {roll}  def /R {repeat} def
/d {rlineto} def /rm {rmoveto} def /gr {grestore} def /f {eofill} def
/c {setrgbcolor} def /black {0 setgray} def /sd {setdash} def
/cl {closepath} def /sf {scalefont setfont} def /lw {setlinewidth} def
/box {m dup 0 exch d exch 0 d 0 exch neg d cl} def
/NC{systemdict begin initclip end}def/C{NC box clip newpath}def
/bl {box s} def /bf {box f} def /Y { 0 exch d} def /X { 0 d} def 
/K {{pop pop 0 moveto} exch kshow} bind def
/ita {/ang 15 def gsave [1 0 ang dup sin exch cos div 1 0 0] concat} def 
/mp {newpath /y exch def /x exch def} def
/side {[w .77 mul w .23 mul] .385 w mul sd w 0 l currentpoint t -144 r} def
/mr {mp x y w2 0 360 arc} def /m24 {mr s} def /m20 {mr f} def
/mb {mp x y w2 add m w2 neg 0 d 0 w neg d w 0 d 0 w d cl} def
/mt {mp x y w2 add m w2 neg w neg d w 0 d cl} def
/m21 {mb f} def /m25 {mb s} def /m22 {mt f} def /m26{mt s} def
/m23 {mp x y w2 sub m w2 w d w neg 0 d cl f} def
/m27 {mp x y w2 add m w3 neg w2 neg d w3 w2 neg d w3 w2 d cl s} def
/m28 {mp x w2 sub y w2 sub w3 add m w3 0 d  0 w3 neg d w3 0 d 0 w3 d w3 0 d  0 w3 d w3 neg 0 d 0 w3 d w3 neg 0 d 0 w3 neg d w3 neg 0 d cl s } def
/m29 {mp gsave x w2 sub y w2 add w3 sub m currentpoint t 4 {side} repeat cl fill gr} def
/m30 {mp gsave x w2 sub y w2 add w3 sub m currentpoint t 4 {side} repeat cl s gr} def
/m31 {mp x y w2 sub m 0 w d x w2 sub y m w 0 d x w2 sub y w2 add m w w neg d x w2 sub y w2 sub m w w d s} def
/m32 {mp x y w2 sub m w2 w d w neg 0 d cl s} def
/m33 {mp x y w2 add m w3 neg w2 neg d w3 w2 neg d w3 w2 d cl f} def
/m34 {mp x w2 sub y w2 sub w3 add m w3 0 d  0 w3 neg d w3 0 d 0 w3 d w3 0 d  0 w3 d w3 neg 0 d 0 w3 d w3 neg 0 d 0 w3 neg d w3 neg 0 d cl f } def
/m2 {mp x y w2 sub m 0 w d x w2 sub y m w 0 d s} def
/m5 {mp x w2 sub y w2 sub m w w d x w2 sub y w2 add m w w neg d s} def
/reEncode {exch findfont dup length dict begin {1 index /FID eq  {pop pop} {def} ifelse } forall /Encoding exch def currentdict end dup /FontName get exch definefont pop } def [/Times-Bold /Times-Italic /Times-BoldItalic /Helvetica /Helvetica-Oblique
 /Helvetica-Bold /Helvetica-BoldOblique /Courier /Courier-Oblique /Courier-Bold /Courier-BoldOblique /Times-Roman /AvantGarde-Book /AvantGarde-BookOblique /AvantGarde-Demi /AvantGarde-DemiOblique /Bookman-Demi /Bookman-DemiItalic /Bookman-Light
 /Bookman-LightItalic /Helvetica-Narrow /Helvetica-Narrow-Bold /Helvetica-Narrow-BoldOblique /Helvetica-Narrow-Oblique /NewCenturySchlbk-Roman /NewCenturySchlbk-Bold /NewCenturySchlbk-BoldItalic /NewCenturySchlbk-Italic /Palatino-Bold
 /Palatino-BoldItalic /Palatino-Italic /Palatino-Roman ] {ISOLatin1Encoding reEncode } forall%%EndProlog
%%BeginSetup
%%EndSetup
newpath  gsave  .25 .25 scale  gsave  0 0 t black[  ] 0 sd 3 lw 1 1 1 c 2268 1954 0 0 bf black 1 1 1 c 2177 1329 45 586 bf black 1 1 1 c 1677 1063 328 719 bf black 1677 1063 328 719 bl 1 1 1 c 1677 1063 328 719 bf black 1677 1063 328 719 bl 0.8 0 0
 c[  12 12 ] 0 sd 6 lw 1 1 1 c black 0.8 0 0 c 328 1315 m 177 X 4 Y 88 X 4 Y 88 X -4 Y 88 X 6 Y 89 X 3 Y 88 X 8 Y 88 X -2 Y 88 X 4 Y 89 X 11 Y 88 X 7 Y 88 X -4 Y 88 X 16 Y 89 X -4 Y 88 X 11 Y 88 X 3 Y 88 X -3 Y 88 X 7 Y 89 X s black[  ] 0 sd 3 lw 328
 719 m 1677 X s
 gsave  2177 1329 45 586 C 1984.25 589.708 t 0 r /Helvetica findfont 40.5691 sf 0 0 m (jj) show NC gr 
 gsave  2177 1329 45 586 C 1946.29 625.141 t 0 r /Symbol findfont 60.8537 sf 0 0 m (j) show NC gr 
 gsave  2177 1329 45 586 C 1908.32 625.141 t 0 r /Symbol findfont 60.8537 sf 0 0 m (D) show NC gr  328 750 m -31 Y s 384 734 m -15 Y s 440 734 m -15 Y s 496 734 m -15 Y s 552 734 m -15 Y s 608 750 m -31 Y s 664 734 m -15 Y s 720 734 m -15 Y s 775 734
 m -15 Y s 831 734 m -15 Y s 887 750 m -31 Y s 943 734 m -15 Y s 999 734 m -15 Y s 1055 734 m -15 Y s 1111 734 m -15 Y s 1167 750 m -31 Y s 1222 734 m -15 Y s 1278 734 m -15 Y s 1334 734 m -15 Y s 1390 734 m -15 Y s 1446 750 m -31 Y s 1502 734 m -15
 Y s 1558 734 m -15 Y s 1614 734 m -15 Y s 1669 734 m -15 Y s 1725 750 m -31 Y s 1781 734 m -15 Y s 1837 734 m -15 Y s 1893 734 m -15 Y s 1949 734 m -15 Y s 2005 750 m -31 Y s
 gsave  2177 1329 45 586 C 313.836 675.759 t 0 r /Helvetica findfont 45.6403 sf 0 0 m (0) show NC gr 
 gsave  2177 1329 45 586 C 574.522 675.759 t 0 r /Helvetica findfont 45.6403 sf 0 0 m (0.5) show NC gr 
 gsave  2177 1329 45 586 C 875.703 675.759 t 0 r /Helvetica findfont 45.6403 sf 0 0 m (1) show NC gr 
 gsave  2177 1329 45 586 C 1131.33 675.759 t 0 r /Helvetica findfont 45.6403 sf 0 0 m (1.5) show NC gr 
 gsave  2177 1329 45 586 C 1432.51 675.759 t 0 r /Helvetica findfont 45.6403 sf 0 0 m (2) show NC gr 
 gsave  2177 1329 45 586 C 1690.66 675.759 t 0 r /Helvetica findfont 45.6403 sf 0 0 m (2.5) show NC gr 
 gsave  2177 1329 45 586 C 1991.84 675.759 t 0 r /Helvetica findfont 45.6403 sf 0 0 m (3) show NC gr  328 719 m 1063 Y s
 gsave  2177 1329 45 586 C 212.598 1685.6 t 90 r /Helvetica findfont 60.8537 sf 0 0 m ( [fb]) show NC gr 
 gsave  2177 1329 45 586 C 245.501 1665.35 t 90 r /Helvetica findfont 40.5691 sf 0 0 m (jj) show NC gr 
 gsave  2177 1329 45 586 C 212.598 1627.39 t 90 r /Symbol findfont 60.8537 sf 0 0 m (j) show NC gr 
 gsave  2177 1329 45 586 C 212.598 1589.43 t 90 r /Symbol findfont 60.8537 sf 0 0 m (D) show NC gr 
 gsave  2177 1329 45 586 C 212.598 1541.34 t 90 r /Helvetica findfont 60.8537 sf 0 0 m (/d) show NC gr 
 gsave  2177 1329 45 586 C 212.598 1503.37 t 90 r /Symbol findfont 60.8537 sf 0 0 m (s) show NC gr 
 gsave  2177 1329 45 586 C 212.598 1473 t 90 r /Helvetica findfont 60.8537 sf 0 0 m (d) show NC gr  381 719 m -53 X s
 gsave  2177 1329 45 586 C 311.177 700.806 t 0 r  -24 0 t /Helvetica findfont 45.6403 sf 0 0 m (1) show NC gr  354 816 m -26 X s 354 873 m -26 X s 354 913 m -26 X s 354 944 m -26 X s 354 970 m -26 X s 354 991 m -26 X s 354 1010 m -26 X s 354 1026 m
 -26 X s 381 1041 m -53 X s
 gsave  2177 1329 45 586 C 311.177 1022.8 t 0 r  -49 0 t /Helvetica findfont 45.6403 sf 0 0 m (10) show NC gr  354 1138 m -26 X s 354 1195 m -26 X s 354 1235 m -26 X s 354 1266 m -26 X s 354 1292 m -26 X s 354 1313 m -26 X s 354 1332 m -26 X s 354
 1348 m -26 X s 381 1363 m -53 X s
 gsave  2177 1329 45 586 C 291.057 1361.64 t 0 r /Helvetica findfont 30.4268 sf 0 0 m (2) show NC gr 
 gsave  2177 1329 45 586 C 240.439 1343.93 t 0 r /Helvetica findfont 45.6403 sf 0 0 m (10) show NC gr  354 1460 m -26 X s 354 1517 m -26 X s 354 1557 m -26 X s 354 1588 m -26 X s 354 1614 m -26 X s 354 1635 m -26 X s 354 1654 m -26 X s 354 1670 m -26
 X s 381 1685 m -53 X s
 gsave  2177 1329 45 586 C 291.057 1685.6 t 0 r /Helvetica findfont 30.4268 sf 0 0 m (3) show NC gr 
 gsave  2177 1329 45 586 C 240.439 1665.35 t 0 r /Helvetica findfont 45.6403 sf 0 0 m (10) show NC gr  354 1782 m -26 X s 0.4 0.4 0.8 c 6 lw 1 1 1 c black 0.4 0.4 0.8 c 328 1296 m 89 X 6 Y 88 X 1 Y 88 X 3 Y 176 X 9 Y 89 X 1 Y 176 X 6 Y 88 X 8 Y 89 X
 3 Y 88 X 7 Y 88 X 9 Y 88 X 1 Y 89 X 7 Y 88 X 6 Y 88 X -1 Y 88 X 6 Y 88 X 8 Y 89 X s 0 0.8 0 c[ 20 12 4 12] 0 sd 1 1 1 c black 0 0.8 0 c 328 1311 m 89 X 5 Y 88 X 3 Y 88 X 1 Y 176 X 8 Y 177 X 2 Y 88 X 4 Y 88 X 7 Y 89 X 4 Y 88 X 6 Y 88 X 9 Y 177 X 7 Y
 88 X 6 Y 176 X 4 Y 88 X 8 Y 89 X s 0.2 0 0.4 c[ 20 20] 0 sd 1 1 1 c black 0.2 0 0.4 c 328 1299 m 89 X 2 Y 88 X -1 Y 88 X 3 Y 88 X -1 Y 88 X 2 Y 89 X 12 Y 88 X 4 Y 88 X 2 Y 88 X 4 Y 89 X -4 Y 88 X 18 Y 88 X 2 Y 88 X 8 Y 89 X 6 Y 88 X 3 Y 88 X 6 Y 88
 X 2 Y 88 X -1 Y 89 X s 0.8 0 0 c[  12 12 ] 0 sd 1 1 1 c black 0.8 0 0 c 328 970 m 89 X 2 Y 88 X -2 Y 88 X 2 Y 88 X -1 Y 88 X 4 Y 89 X 2 Y 88 X -4 Y 88 X 1 Y 88 X 3 Y 89 X 2 Y 88 X 2 Y 88 X -2 Y 88 X 2 Y 89 X 3 Y 88 X 4 Y 88 X -5 Y 176 X 4 Y 89 X s
 0.4 0.4 0.8 c[  ] 0 sd 1 1 1 c black 0.4 0.4 0.8 c 328 1001 m 177 X 5 Y 88 X -3 Y 88 X -2 Y 88 X 3 Y 89 X 4 Y 88 X 2 Y 88 X -6 Y 88 X 7 Y 89 X 3 Y 88 X -2 Y 88 X 8 Y 88 X -1 Y 89 X 4 Y 88 X -7 Y 88 X 9 Y 88 X 7 Y 88 X -11 Y 89 X s 0 0.8 0 c[ 20 12 4
 12] 0 sd 1 1 1 c black 0 0.8 0 c 328 999 m 177 X 6 Y 88 X -5 Y 88 X -1 Y 88 X 3 Y 89 X 3 Y 88 X 2 Y 88 X -6 Y 88 X 7 Y 89 X 7 Y 88 X -8 Y 88 X 11 Y 88 X -3 Y 89 X 4 Y 88 X -6 Y 88 X 9 Y 88 X -1 Y 88 X 2 Y 89 X s 0.2 0 0.4 c[ 20 20] 0 sd 1 1 1 c
 black 0.2 0 0.4 c 328 979 m 89 X -1 Y 88 X 4 Y 88 X -3 Y 176 X 4 Y 89 X -1 Y 88 X 4 Y 88 X 1 Y 265 X 3 Y 176 X 5 Y 89 X -1 Y 88 X 3 Y 88 X -4 Y 88 X 2 Y 177 X s black
 gsave  2177 1329 45 586 C 2057.65 1338.86 t 90 r /Helvetica-BoldOblique findfont 38.0336 sf 0 0 m 
 410 392 371 351 340 311 276 266 241 216 206 181 152 123 113 86 76 49 22
(LHC HIGGS XS WG 2011) K NC gr 
 gsave  2177 1329 45 586 C 1650.17 1705.85 t 0 r /Helvetica findfont 30.4268 sf 0 0 m 
 239 229 212 191 182 154 135 126 118 97 88 68 40 22
(HAWK w/ EW Corr) K NC gr  0.4 0.4 0.8 c[  ] 0 sd 1544 1717 m 88 X s black
 gsave  2177 1329 45 586 C 1650.17 1629.92 t 0 r /Helvetica findfont 30.4268 sf 0 0 m (POWHEG) show NC gr  0.8 0 0 c[  12 12 ] 0 sd 1544 1641 m 88 X s black
 gsave  2177 1329 45 586 C 1650.17 1553.99 t 0 r /Helvetica findfont 30.4268 sf 0 0 m 
 255 245 228 207 198 170 151 142 126 117 96 88 68 40 21
(HAWK w/o EW Corr) K NC gr  0 0.8 0 c[ 20 12 4 12] 0 sd 1544 1564 m 88 X s black
 gsave  2177 1329 45 586 C 1650.17 1475.53 t 0 r /Helvetica findfont 30.4268 sf 0 0 m (VBFNLO w/ EW Corr) show NC gr  0.2 0 0.4 c[ 20 20] 0 sd 1544 1488 m 88 X s black[  ] 0 sd 3 lw 1 1 1 c black 1 1 1 c 1677 300 328 231 bf black 1677 300 328 231 bl
 1 1 1 c 1677 300 328 231 bf black 1677 300 328 231 bl 328 231 m 1677 X s
 gsave  2177 547 45 39 C 1984.25 91.1136 t 0 r /Helvetica findfont 40.5249 sf 0 0 m (jj) show NC gr 
 gsave  2177 547 45 39 C 1946.29 126.547 t 0 r /Symbol findfont 60.7874 sf 0 0 m (j) show NC gr 
 gsave  2177 547 45 39 C 1908.32 126.547 t 0 r /Symbol findfont 60.7874 sf 0 0 m (D) show NC gr  328 243 m -12 Y s 384 237 m -6 Y s 440 237 m -6 Y s 496 237 m -6 Y s 552 237 m -6 Y s 608 243 m -12 Y s 664 237 m -6 Y s 720 237 m -6 Y s 775 237 m -6 Y
 s 831 237 m -6 Y s 887 243 m -12 Y s 943 237 m -6 Y s 999 237 m -6 Y s 1055 237 m -6 Y s 1111 237 m -6 Y s 1167 243 m -12 Y s 1222 237 m -6 Y s 1278 237 m -6 Y s 1334 237 m -6 Y s 1390 237 m -6 Y s 1446 243 m -12 Y s 1502 237 m -6 Y s 1558 237 m -6
 Y s 1614 237 m -6 Y s 1669 237 m -6 Y s 1725 243 m -12 Y s 1781 237 m -6 Y s 1837 237 m -6 Y s 1893 237 m -6 Y s 1949 237 m -6 Y s 2005 243 m -12 Y s
 gsave  2177 547 45 39 C 313.836 189.82 t 0 r /Helvetica findfont 45.5906 sf 0 0 m (0) show NC gr 
 gsave  2177 547 45 39 C 574.522 189.82 t 0 r /Helvetica findfont 45.5906 sf 0 0 m (0.5) show NC gr 
 gsave  2177 547 45 39 C 875.703 189.82 t 0 r /Helvetica findfont 45.5906 sf 0 0 m (1) show NC gr 
 gsave  2177 547 45 39 C 1131.33 189.82 t 0 r /Helvetica findfont 45.5906 sf 0 0 m (1.5) show NC gr 
 gsave  2177 547 45 39 C 1432.51 189.82 t 0 r /Helvetica findfont 45.5906 sf 0 0 m (2) show NC gr 
 gsave  2177 547 45 39 C 1690.66 189.82 t 0 r /Helvetica findfont 45.5906 sf 0 0 m (2.5) show NC gr 
 gsave  2177 547 45 39 C 1991.84 189.82 t 0 r /Helvetica findfont 45.5906 sf 0 0 m (3) show NC gr  328 231 m 300 Y s
 gsave  2177 547 45 39 C 222.722 430.259 t 90 r /Helvetica findfont 60.7874 sf 0 0 m ( [%]) show NC gr 
 gsave  2177 547 45 39 C 245.501 364.454 t 90 r /Helvetica findfont 40.5249 sf 0 0 m (EW) show NC gr 
 gsave  2177 547 45 39 C 222.722 334.083 t 90 r /Symbol findfont 60.7874 sf 0 0 m (d) show NC gr  364 290 m -36 X s 346 319 m -18 X s 346 349 m -18 X s 346 378 m -18 X s 364 408 m -36 X s 346 437 m -18 X s 346 467 m -18 X s 346 496 m -18 X s 364 526
 m -36 X s 364 290 m -36 X s 346 260 m -18 X s 364 526 m -36 X s
 gsave  2177 547 45 39 C 237.908 273.341 t 0 r /Helvetica findfont 45.5906 sf 0 0 m (\2550.2) show NC gr 
 gsave  2177 547 45 39 C 291.057 392.295 t 0 r /Helvetica findfont 45.5906 sf 0 0 m (0) show NC gr 
 gsave  2177 547 45 39 C 253.093 508.718 t 0 r /Helvetica findfont 45.5906 sf 0 0 m (0.2) show NC gr  0.4 0.4 0.4 c 372 301 m -44 X s 328 296 m 10 Y s 372 301 m 44 X s 416 296 m 10 Y s 372 301 m 2 Y s 367 303 m 10 X s 372 301 m -3 Y s 367 298 m 10 X
 s 460 306 m -44 X s 416 300 m 11 Y s 460 306 m 44 X s 504 300 m 11 Y s 460 306 m 2 Y s 455 308 m 10 X s 460 306 m -3 Y s 455 303 m 10 X s 548 305 m -44 X s 504 300 m 10 Y s 548 305 m 44 X s 592 300 m 10 Y s 548 305 m 3 Y s 543 308 m 10 X s 548 305 m
 -2 Y s 543 303 m 10 X s 636 307 m -44 X s 592 302 m 10 Y s 636 307 m 43 X s 679 302 m 10 Y s 636 307 m 2 Y s 630 309 m 11 X s 636 307 m -3 Y s 630 304 m 11 X s 723 305 m -44 X s 679 300 m 10 Y s 723 305 m 44 X s 767 300 m 10 Y s 723 305 m 3 Y s 718
 308 m 10 X s 723 305 m -2 Y s 718 303 m 10 X s 811 313 m -44 X s 767 308 m 10 Y s 811 313 m 44 X s 855 308 m 10 Y s 811 313 m 2 Y s 806 315 m 10 X s 811 313 m -2 Y s 806 311 m 10 X s 899 317 m -44 X s 855 311 m 11 Y s 899 317 m 44 X s 943 311 m 11 Y
 s 899 317 m 2 Y s 894 319 m 10 X s 899 317 m -3 Y s 894 314 m 10 X s 987 314 m -44 X s 943 309 m 10 Y s 987 314 m 43 X s 1030 309 m 10 Y s 987 314 m 2 Y s 982 316 m 10 X s 987 314 m -3 Y s 982 311 m 10 X s 1074 315 m -43 X s 1031 310 m 10 Y s 1074
 315 m 44 X s 1118 310 m 10 Y s 1074 315 m 2 Y s 1069 317 m 10 X s 1074 315 m -3 Y s 1069 312 m 10 X s 1162 326 m -44 X s 1118 321 m 10 Y s 1162 326 m 44 X s 1206 321 m 10 Y s 1162 326 m 2 Y s 1157 328 m 10 X s 1162 326 m -2 Y s 1157 324 m 10 X s
 1250 328 m -44 X s 1206 322 m 11 Y s 1250 328 m 44 X s 1294 322 m 11 Y s 1250 328 m 2 Y s 1245 330 m 10 X s 1250 328 m -3 Y s 1245 325 m 10 X s 1338 328 m -44 X s 1294 323 m 10 Y s 1338 328 m 44 X s 1382 323 m 10 Y s 1338 328 m 2 Y s 1333 330 m 10 X
 s 1338 328 m -3 Y s 1333 325 m 10 X s 1425 334 m -43 X s 1382 329 m 10 Y s 1425 334 m 44 X s 1469 329 m 10 Y s 1425 334 m 2 Y s 1420 336 m 11 X s 1425 334 m -2 Y s 1420 332 m 11 X s 1513 334 m -44 X s 1469 329 m 10 Y s 1513 334 m 44 X s 1557 329 m
 10 Y s 1513 334 m 2 Y s 1508 336 m 10 X s 1513 334 m -2 Y s 1508 332 m 10 X s 1601 336 m -44 X s 1557 330 m 11 Y s 1601 336 m 44 X s 1645 330 m 11 Y s 1601 336 m 2 Y s 1596 338 m 10 X s 1601 336 m -3 Y s 1596 333 m 10 X s 1689 338 m -44 X s 1645 333
 m 10 Y s 1689 338 m 44 X s 1733 333 m 10 Y s 1689 338 m 2 Y s 1684 340 m 10 X s 1689 338 m -2 Y s 1684 336 m 10 X s 1777 334 m -44 X s 1733 329 m 11 Y s 1777 334 m 43 X s 1820 329 m 11 Y s 1777 334 m 2 Y s 1771 336 m 11 X s 1777 334 m -2 Y s 1771
 332 m 11 X s 1864 340 m -44 X s 1820 335 m 10 Y s 1864 340 m 44 X s 1908 335 m 10 Y s 1864 340 m 2 Y s 1859 342 m 10 X s 1864 340 m -1 Y s 1859 339 m 10 X s 1952 342 m -44 X s 1908 337 m 10 Y s 1952 342 m 44 X s 1996 337 m 10 Y s 1952 342 m 2 Y s
 1947 344 m 10 X s 1952 342 m -2 Y s 1947 340 m 10 X s black /w 4 def /w2 {w 2 div} def /w3 {w 3 div} def 372 301 460 306 548 305 636 307 723 305 811 313 899 317 987 314 1074 315 1162 326 1250 328 1338 328 1425 334 1513 334 1601 336 1689 338 1777 334
 1864 340 1952 342 19 { m21} R 0.4 0.4 0.4 c black 0.4 0.4 0.4 c
 gsave  2177 547 45 39 C 435.321 316.367 t 0 r /Helvetica findfont 40.5249 sf 0 0 m ( = 120 GeV) show NC gr  black 0.4 0.4 0.4 c
 gsave  2177 547 45 39 C 415.073 306.243 t 0 r /Helvetica findfont 27.8609 sf 0 0 m (H) show NC gr  black 0.4 0.4 0.4 c
 gsave  2177 547 45 39 C 382.171 316.367 t 0 r /Helvetica findfont 40.5249 sf 0 0 m (M) show NC gr  0.6 0 0 c 372 428 m -44 X s 328 423 m 10 Y s 372 428 m 44 X s 416 423 m 10 Y s 372 428 m 3 Y s 367 431 m 10 X s 372 428 m -3 Y s 367 425 m 10 X s 460
 432 m -44 X s 416 427 m 10 Y s 460 432 m 44 X s 504 427 m 10 Y s 460 432 m 4 Y s 455 436 m 10 X s 460 432 m -3 Y s 455 429 m 10 X s 548 430 m -44 X s 504 425 m 10 Y s 548 430 m 44 X s 592 425 m 10 Y s 548 430 m 2 Y s 543 432 m 10 X s 548 430 m -2 Y
 s 543 428 m 10 X s 636 429 m -44 X s 592 424 m 10 Y s 636 429 m 43 X s 679 424 m 10 Y s 636 429 m 2 Y s 630 431 m 11 X s 636 429 m -3 Y s 630 426 m 11 X s 723 431 m -44 X s 679 426 m 10 Y s 723 431 m 44 X s 767 426 m 10 Y s 723 431 m 3 Y s 718 434 m
 10 X s 723 431 m -2 Y s 718 429 m 10 X s 811 433 m -44 X s 767 428 m 10 Y s 811 433 m 44 X s 855 428 m 10 Y s 811 433 m 6 Y s 806 439 m 10 X s 811 433 m -7 Y s 806 426 m 10 X s 899 432 m -44 X s 855 427 m 10 Y s 899 432 m 44 X s 943 427 m 10 Y s 899
 432 m 2 Y s 894 434 m 10 X s 899 432 m -2 Y s 894 430 m 10 X s 987 429 m -44 X s 943 424 m 10 Y s 987 429 m 43 X s 1030 424 m 10 Y s 987 429 m 3 Y s 982 432 m 10 X s 987 429 m -3 Y s 982 426 m 10 X s 1074 431 m -43 X s 1031 426 m 10 Y s 1074 431 m
 44 X s 1118 426 m 10 Y s 1074 431 m 3 Y s 1069 434 m 10 X s 1074 431 m -2 Y s 1069 429 m 10 X s 1162 426 m -44 X s 1118 421 m 10 Y s 1162 426 m 44 X s 1206 421 m 10 Y s 1162 426 m 3 Y s 1157 429 m 10 X s 1162 426 m -3 Y s 1157 423 m 10 X s 1250 431
 m -44 X s 1206 426 m 10 Y s 1250 431 m 44 X s 1294 426 m 10 Y s 1250 431 m 2 Y s 1245 433 m 10 X s 1250 431 m -3 Y s 1245 428 m 10 X s 1338 439 m -44 X s 1294 434 m 10 Y s 1338 439 m 44 X s 1382 434 m 10 Y s 1338 439 m 7 Y s 1333 446 m 10 X s 1338
 439 m -7 Y s 1333 432 m 10 X s 1425 427 m -43 X s 1382 422 m 10 Y s 1425 427 m 44 X s 1469 422 m 10 Y s 1425 427 m 5 Y s 1420 432 m 11 X s 1425 427 m -6 Y s 1420 421 m 11 X s 1513 436 m -44 X s 1469 431 m 10 Y s 1513 436 m 44 X s 1557 431 m 10 Y s
 1513 436 m 3 Y s 1508 439 m 10 X s 1513 436 m -3 Y s 1508 433 m 10 X s 1601 435 m -44 X s 1557 430 m 10 Y s 1601 435 m 44 X s 1645 430 m 10 Y s 1601 435 m 3 Y s 1596 438 m 10 X s 1601 435 m -3 Y s 1596 432 m 10 X s 1689 426 m -44 X s 1645 421 m 10 Y
 s 1689 426 m 44 X s 1733 421 m 10 Y s 1689 426 m 3 Y s 1684 429 m 10 X s 1689 426 m -3 Y s 1684 423 m 10 X s 1777 426 m -44 X s 1733 421 m 10 Y s 1777 426 m 43 X s 1820 421 m 10 Y s 1777 426 m 7 Y s 1771 433 m 11 X s 1777 426 m -6 Y s 1771 420 m 11
 X s 1864 482 m -44 X s 1820 476 m 11 Y s 1864 482 m 44 X s 1908 476 m 11 Y s 1864 482 m 42 Y s 1859 524 m 10 X s 1864 482 m -43 Y s 1859 439 m 10 X s 1952 393 m -44 X s 1908 388 m 10 Y s 1952 393 m 44 X s 1996 388 m 10 Y s 1952 393 m 43 Y s 1947 436
 m 10 X s 1952 393 m -43 Y s 1947 350 m 10 X s black 372 428 460 432 548 430 636 429 723 431 811 433 899 432 987 429 1074 431 1162 426 1250 431 1338 439 1425 427 1513 436 1601 435 1689 426 1777 426 1864 482 1952 393 19 { m22} R 0.6 0 0 c black 0.6 0
 0 c
 gsave  2177 547 45 39 C 435.321 455.568 t 0 r /Helvetica findfont 40.5249 sf 0 0 m ( = 600 GeV) show NC gr  black 0.6 0 0 c
 gsave  2177 547 45 39 C 415.073 445.444 t 0 r /Helvetica findfont 27.8609 sf 0 0 m (H) show NC gr  black 0.6 0 0 c
 gsave  2177 547 45 39 C 382.171 455.568 t 0 r /Helvetica findfont 40.5249 sf 0 0 m (M) show NC gr 
 gr  gr showpage
end
%%EOF
