%!PS-Adobe-2.0 EPSF-2.0
%%BoundingBox:  0 0 567 384
%%Title: eta1.eps: eta1
%%Creator: ROOT Version 5.27/06b
%%CreationDate: Fri Dec  9 13:48:26 2011
%%EndComments
%%BeginProlog
80 dict begin
/s {stroke} def /l {lineto} def /m {moveto} def /t {translate} def
/r {rotate} def /rl {roll}  def /R {repeat} def
/d {rlineto} def /rm {rmoveto} def /gr {grestore} def /f {eofill} def
/c {setrgbcolor} def /black {0 setgray} def /sd {setdash} def
/cl {closepath} def /sf {scalefont setfont} def /lw {setlinewidth} def
/box {m dup 0 exch d exch 0 d 0 exch neg d cl} def
/NC{systemdict begin initclip end}def/C{NC box clip newpath}def
/bl {box s} def /bf {box f} def /Y { 0 exch d} def /X { 0 d} def 
/K {{pop pop 0 moveto} exch kshow} bind def
/ita {/ang 15 def gsave [1 0 ang dup sin exch cos div 1 0 0] concat} def 
/mp {newpath /y exch def /x exch def} def
/side {[w .77 mul w .23 mul] .385 w mul sd w 0 l currentpoint t -144 r} def
/mr {mp x y w2 0 360 arc} def /m24 {mr s} def /m20 {mr f} def
/mb {mp x y w2 add m w2 neg 0 d 0 w neg d w 0 d 0 w d cl} def
/mt {mp x y w2 add m w2 neg w neg d w 0 d cl} def
/m21 {mb f} def /m25 {mb s} def /m22 {mt f} def /m26{mt s} def
/m23 {mp x y w2 sub m w2 w d w neg 0 d cl f} def
/m27 {mp x y w2 add m w3 neg w2 neg d w3 w2 neg d w3 w2 d cl s} def
/m28 {mp x w2 sub y w2 sub w3 add m w3 0 d  0 w3 neg d w3 0 d 0 w3 d w3 0 d  0 w3 d w3 neg 0 d 0 w3 d w3 neg 0 d 0 w3 neg d w3 neg 0 d cl s } def
/m29 {mp gsave x w2 sub y w2 add w3 sub m currentpoint t 4 {side} repeat cl fill gr} def
/m30 {mp gsave x w2 sub y w2 add w3 sub m currentpoint t 4 {side} repeat cl s gr} def
/m31 {mp x y w2 sub m 0 w d x w2 sub y m w 0 d x w2 sub y w2 add m w w neg d x w2 sub y w2 sub m w w d s} def
/m32 {mp x y w2 sub m w2 w d w neg 0 d cl s} def
/m33 {mp x y w2 add m w3 neg w2 neg d w3 w2 neg d w3 w2 d cl f} def
/m34 {mp x w2 sub y w2 sub w3 add m w3 0 d  0 w3 neg d w3 0 d 0 w3 d w3 0 d  0 w3 d w3 neg 0 d 0 w3 d w3 neg 0 d 0 w3 neg d w3 neg 0 d cl f } def
/m2 {mp x y w2 sub m 0 w d x w2 sub y m w 0 d s} def
/m5 {mp x w2 sub y w2 sub m w w d x w2 sub y w2 add m w w neg d s} def
/reEncode {exch findfont dup length dict begin {1 index /FID eq  {pop pop} {def} ifelse } forall /Encoding exch def currentdict end dup /FontName get exch definefont pop } def [/Times-Bold /Times-Italic /Times-BoldItalic /Helvetica /Helvetica-Oblique
 /Helvetica-Bold /Helvetica-BoldOblique /Courier /Courier-Oblique /Courier-Bold /Courier-BoldOblique /Times-Roman /AvantGarde-Book /AvantGarde-BookOblique /AvantGarde-Demi /AvantGarde-DemiOblique /Bookman-Demi /Bookman-DemiItalic /Bookman-Light
 /Bookman-LightItalic /Helvetica-Narrow /Helvetica-Narrow-Bold /Helvetica-Narrow-BoldOblique /Helvetica-Narrow-Oblique /NewCenturySchlbk-Roman /NewCenturySchlbk-Bold /NewCenturySchlbk-BoldItalic /NewCenturySchlbk-Italic /Palatino-Bold
 /Palatino-BoldItalic /Palatino-Italic /Palatino-Roman ] {ISOLatin1Encoding reEncode } forall%%EndProlog
%%BeginSetup
%%EndSetup
newpath  gsave  .25 .25 scale  gsave  0 0 t black[  ] 0 sd 3 lw 1 1 1 c 2268 1538 0 0 bf black 1 1 1 c 1791 1215 363 246 bf black 1791 1215 363 246 bl 1 0 0 c 6 lw 1 1 1 c black 3 lw /w 31 def /w2 {w 2 div} def /w3 {w 3 div} def 381 307 m20 6 lw 3 lw
 417 307 m20 6 lw 3 lw 452 307 m20 6 lw 3 lw 488 307 m20 6 lw 3 lw 524 307 m20 6 lw 3 lw 560 307 m20 6 lw 3 lw 596 308 m20 6 lw 3 lw 632 308 m20 6 lw 3 lw 667 311 m20 6 lw 3 lw 703 313 m20 6 lw 3 lw 739 330 m20 6 lw 3 lw 775 339 m20 6 lw 1 0 0 c 811
 343 m 2 Y s 811 371 m 2 Y s 3 lw black 811 358 m20 6 lw 1 0 0 c 847 370 m 6 Y s 847 402 m 5 Y s 3 lw black 847 389 m20 6 lw 1 0 0 c 882 424 m 7 Y s 882 457 m 6 Y s 3 lw black 882 444 m20 6 lw 1 0 0 c 918 494 m 9 Y s 918 529 m 8 Y s 3 lw black 918
 516 m20 6 lw 1 0 0 c 954 585 m 13 Y s 954 624 m 12 Y s 3 lw black 954 611 m20 6 lw 1 0 0 c 990 652 m 15 Y s 990 693 m 14 Y s 3 lw black 990 680 m20 6 lw 1 0 0 c 1026 751 m 16 Y s 1026 793 m 16 Y s 3 lw black 1026 780 m20 6 lw 1 0 0 c 1062 830 m 27 Y
 s 1062 883 m 28 Y s 3 lw black 1062 870 m20 6 lw 1 0 0 c 1097 1012 m 16 Y s 1097 1054 m 16 Y s 3 lw black 1097 1041 m20 6 lw 1 0 0 c 1133 1071 m 23 Y s 1133 1120 m 22 Y s 3 lw black 1133 1107 m20 6 lw 1 0 0 c 1169 1191 m 28 Y s 1169 1245 m 28 Y s 3
 lw black 1169 1232 m20 6 lw 1 0 0 c 1205 1246 m 22 Y s 1205 1295 m 22 Y s 3 lw black 1205 1282 m20 6 lw 1 0 0 c 1241 1329 m 24 Y s 1241 1379 m 24 Y s 3 lw black 1241 1366 m20 6 lw 1 0 0 c 1276 1310 m 23 Y s 1276 1359 m 23 Y s 3 lw black 1276 1346
 m20 6 lw 1 0 0 c 1312 1292 m 29 Y s 1312 1347 m 29 Y s 3 lw black 1312 1334 m20 6 lw 1 0 0 c 1348 1219 m 24 Y s 1348 1269 m 24 Y s 3 lw black 1348 1256 m20 6 lw 1 0 0 c 1384 1111 m 22 Y s 1384 1159 m 23 Y s 3 lw black 1384 1146 m20 6 lw 1 0 0 c 1420
 961 m 22 Y s 1420 1009 m 21 Y s 3 lw black 1420 996 m20 6 lw 1 0 0 c 1456 891 m 23 Y s 1456 940 m 23 Y s 3 lw black 1456 927 m20 6 lw 1 0 0 c 1491 757 m 16 Y s 1491 799 m 17 Y s 3 lw black 1491 786 m20 6 lw 1 0 0 c 1527 650 m 24 Y s 1527 700 m 25 Y
 s 3 lw black 1527 687 m20 6 lw 1 0 0 c 1563 574 m 12 Y s 1563 612 m 11 Y s 3 lw black 1563 599 m20 6 lw 1 0 0 c 1599 503 m 8 Y s 1599 537 m 8 Y s 3 lw black 1599 524 m20 6 lw 1 0 0 c 1635 424 m 7 Y s 1635 457 m 7 Y s 3 lw black 1635 444 m20 6 lw 1 0
 0 c 1671 376 m 4 Y s 1671 406 m 4 Y s 3 lw black 1671 393 m20 6 lw 1 0 0 c 1706 333 m 4 Y s 1706 363 m 3 Y s 3 lw black 1706 350 m20 6 lw 3 lw 1742 340 m20 6 lw 3 lw 1778 320 m20 6 lw 3 lw 1814 311 m20 6 lw 3 lw 1850 310 m20 6 lw 3 lw 1886 307 m20 6
 lw 3 lw 1921 308 m20 6 lw 3 lw 1957 307 m20 6 lw 3 lw 1993 307 m20 6 lw 3 lw 2029 307 m20 6 lw 3 lw 2065 307 m20 6 lw 3 lw 2101 307 m20 6 lw 3 lw 2136 307 m20 6 lw 1 0 0 c 1 1 1 c black 1 0 0 c 363 307 m 215 X 1 Y 71 X 3 Y 36 X 2 Y 36 X 17 Y 36 X 9
 Y 36 X 19 Y 36 X 31 Y 35 X 55 Y 36 X 72 Y 36 X 95 Y 36 X 69 Y 36 X 100 Y 36 X 90 Y 35 X 171 Y 36 X 66 Y 36 X 125 Y 36 X 50 Y 36 X 84 Y 36 X -20 Y 35 X -12 Y 36 X -78 Y 36 X -110 Y 36 X -150 Y 36 X -69 Y 36 X -141 Y 35 X -99 Y 36 X -88 Y 36 X -75 Y
 36 X -80 Y 36 X -51 Y 36 X -43 Y 35 X -10 Y 36 X -20 Y 36 X -9 Y 36 X -1 Y 36 X -3 Y 36 X 1 Y 35 X -1 Y 215 X -61 Y s black 3 lw 363 246 m 1791 X s
 gsave  2268 1538 0 0 C 1218.94 87.9375 t 0 r /Helvetica findfont 71.6807 sf 0 0 m (leading lepton pseudorapidity) show NC gr  363 283 m -37 Y s 399 264 m -18 Y s 434 264 m -18 Y s 470 264 m -18 Y s 506 264 m -18 Y s 542 283 m -37 Y s 578 264 m -18 Y
 s 614 264 m -18 Y s 649 264 m -18 Y s 685 264 m -18 Y s 721 283 m -37 Y s 757 264 m -18 Y s 793 264 m -18 Y s 829 264 m -18 Y s 864 264 m -18 Y s 900 283 m -37 Y s 936 264 m -18 Y s 972 264 m -18 Y s 1008 264 m -18 Y s 1044 264 m -18 Y s 1079 283 m
 -37 Y s 1115 264 m -18 Y s 1151 264 m -18 Y s 1187 264 m -18 Y s 1223 264 m -18 Y s 1259 283 m -37 Y s 1294 264 m -18 Y s 1330 264 m -18 Y s 1366 264 m -18 Y s 1402 264 m -18 Y s 1438 283 m -37 Y s 1474 264 m -18 Y s 1509 264 m -18 Y s 1545 264 m
 -18 Y s 1581 264 m -18 Y s 1617 283 m -37 Y s 1653 264 m -18 Y s 1689 264 m -18 Y s 1724 264 m -18 Y s 1760 264 m -18 Y s 1796 283 m -37 Y s 1832 264 m -18 Y s 1868 264 m -18 Y s 1904 264 m -18 Y s 1939 264 m -18 Y s 1975 283 m -37 Y s 2011 264 m
 -18 Y s 2047 264 m -18 Y s 2083 264 m -18 Y s 2119 264 m -18 Y s 2154 283 m -37 Y s
 gsave  2268 1538 0 0 C 329.562 179.188 t 0 r /Helvetica findfont 71.6807 sf 0 0 m (\2555) show NC gr 
 gsave  2268 1538 0 0 C 508.75 179.188 t 0 r /Helvetica findfont 71.6807 sf 0 0 m (\2554) show NC gr 
 gsave  2268 1538 0 0 C 687.938 179.188 t 0 r /Helvetica findfont 71.6807 sf 0 0 m (\2553) show NC gr 
 gsave  2268 1538 0 0 C 867.125 179.188 t 0 r /Helvetica findfont 71.6807 sf 0 0 m (\2552) show NC gr 
 gsave  2268 1538 0 0 C 1052.88 179.188 t 0 r /Helvetica findfont 71.6807 sf 0 0 m (\2551) show NC gr 
 gsave  2268 1538 0 0 C 1238.5 179.188 t 0 r /Helvetica findfont 71.6807 sf 0 0 m (0) show NC gr 
 gsave  2268 1538 0 0 C 1421 179.188 t 0 r /Helvetica findfont 71.6807 sf 0 0 m (1) show NC gr 
 gsave  2268 1538 0 0 C 1596.94 179.188 t 0 r /Helvetica findfont 71.6807 sf 0 0 m (2) show NC gr 
 gsave  2268 1538 0 0 C 1776.12 179.188 t 0 r /Helvetica findfont 71.6807 sf 0 0 m (3) show NC gr 
 gsave  2268 1538 0 0 C 1955.31 179.188 t 0 r /Helvetica findfont 71.6807 sf 0 0 m (4) show NC gr 
 gsave  2268 1538 0 0 C 2134.5 179.188 t 0 r /Helvetica findfont 71.6807 sf 0 0 m (5) show NC gr  363 1461 m 1791 X s 363 1425 m 36 Y s 399 1443 m 18 Y s 434 1443 m 18 Y s 470 1443 m 18 Y s 506 1443 m 18 Y s 542 1425 m 36 Y s 578 1443 m 18 Y s 614
 1443 m 18 Y s 649 1443 m 18 Y s 685 1443 m 18 Y s 721 1425 m 36 Y s 757 1443 m 18 Y s 793 1443 m 18 Y s 829 1443 m 18 Y s 864 1443 m 18 Y s 900 1425 m 36 Y s 936 1443 m 18 Y s 972 1443 m 18 Y s 1008 1443 m 18 Y s 1044 1443 m 18 Y s 1079 1425 m 36 Y
 s 1115 1443 m 18 Y s 1151 1443 m 18 Y s 1187 1443 m 18 Y s 1223 1443 m 18 Y s 1259 1425 m 36 Y s 1294 1443 m 18 Y s 1330 1443 m 18 Y s 1366 1443 m 18 Y s 1402 1443 m 18 Y s 1438 1425 m 36 Y s 1474 1443 m 18 Y s 1509 1443 m 18 Y s 1545 1443 m 18 Y s
 1581 1443 m 18 Y s 1617 1425 m 36 Y s 1653 1443 m 18 Y s 1689 1443 m 18 Y s 1724 1443 m 18 Y s 1760 1443 m 18 Y s 1796 1425 m 36 Y s 1832 1443 m 18 Y s 1868 1443 m 18 Y s 1904 1443 m 18 Y s 1939 1443 m 18 Y s 1975 1425 m 36 Y s 2011 1443 m 18 Y s
 2047 1443 m 18 Y s 2083 1443 m 18 Y s 2119 1443 m 18 Y s 2154 1425 m 36 Y s 363 246 m 1215 Y s
 gsave  2268 1538 0 0 C 173.125 755.812 t 90 r /Helvetica findfont 71.6807 sf 0 0 m (arbitrary normalization) show NC gr  417 307 m -54 X s 390 334 m -27 X s 390 361 m -27 X s 390 389 m -27 X s 390 416 m -27 X s 417 443 m -54 X s 390 470 m -27 X s
 390 497 m -27 X s 390 525 m -27 X s 390 552 m -27 X s 417 579 m -54 X s 390 606 m -27 X s 390 633 m -27 X s 390 661 m -27 X s 390 688 m -27 X s 417 715 m -54 X s 390 742 m -27 X s 390 769 m -27 X s 390 797 m -27 X s 390 824 m -27 X s 417 851 m -54 X
 s 390 878 m -27 X s 390 905 m -27 X s 390 933 m -27 X s 390 960 m -27 X s 417 987 m -54 X s 390 1014 m -27 X s 390 1041 m -27 X s 390 1068 m -27 X s 390 1096 m -27 X s 417 1123 m -54 X s 390 1150 m -27 X s 390 1177 m -27 X s 390 1204 m -27 X s 390
 1232 m -27 X s 417 1259 m -54 X s 390 1286 m -27 X s 390 1313 m -27 X s 390 1340 m -27 X s 390 1368 m -27 X s 417 1395 m -54 X s 417 307 m -54 X s 390 280 m -27 X s 390 253 m -27 X s 417 1395 m -54 X s 390 1422 m -27 X s 390 1449 m -27 X s
 gsave  2268 1538 0 0 C 310 283.438 t 0 r /Helvetica findfont 71.6807 sf 0 0 m (0) show NC gr 
 gsave  2268 1538 0 0 C 222 417 t 0 r /Helvetica findfont 71.6807 sf 0 0 m (0.01) show NC gr 
 gsave  2268 1538 0 0 C 212.25 553.812 t 0 r /Helvetica findfont 71.6807 sf 0 0 m (0.02) show NC gr 
 gsave  2268 1538 0 0 C 212.25 690.688 t 0 r /Helvetica findfont 71.6807 sf 0 0 m (0.03) show NC gr 
 gsave  2268 1538 0 0 C 212.25 827.5 t 0 r /Helvetica findfont 71.6807 sf 0 0 m (0.04) show NC gr 
 gsave  2268 1538 0 0 C 212.25 961.062 t 0 r /Helvetica findfont 71.6807 sf 0 0 m (0.05) show NC gr 
 gsave  2268 1538 0 0 C 212.25 1097.94 t 0 r /Helvetica findfont 71.6807 sf 0 0 m (0.06) show NC gr 
 gsave  2268 1538 0 0 C 212.25 1234.81 t 0 r /Helvetica findfont 71.6807 sf 0 0 m (0.07) show NC gr 
 gsave  2268 1538 0 0 C 212.25 1371.62 t 0 r /Helvetica findfont 71.6807 sf 0 0 m (0.08) show NC gr  2154 246 m 1215 Y s 2101 307 m 53 X s 2127 334 m 27 X s 2127 361 m 27 X s 2127 389 m 27 X s 2127 416 m 27 X s 2101 443 m 53 X s 2127 470 m 27 X s
 2127 497 m 27 X s 2127 525 m 27 X s 2127 552 m 27 X s 2101 579 m 53 X s 2127 606 m 27 X s 2127 633 m 27 X s 2127 661 m 27 X s 2127 688 m 27 X s 2101 715 m 53 X s 2127 742 m 27 X s 2127 769 m 27 X s 2127 797 m 27 X s 2127 824 m 27 X s 2101 851 m 53 X
 s 2127 878 m 27 X s 2127 905 m 27 X s 2127 933 m 27 X s 2127 960 m 27 X s 2101 987 m 53 X s 2127 1014 m 27 X s 2127 1041 m 27 X s 2127 1068 m 27 X s 2127 1096 m 27 X s 2101 1123 m 53 X s 2127 1150 m 27 X s 2127 1177 m 27 X s 2127 1204 m 27 X s 2127
 1232 m 27 X s 2101 1259 m 53 X s 2127 1286 m 27 X s 2127 1313 m 27 X s 2127 1340 m 27 X s 2127 1368 m 27 X s 2101 1395 m 53 X s 2101 307 m 53 X s 2127 280 m 27 X s 2127 253 m 27 X s 2101 1395 m 53 X s 2127 1422 m 27 X s 2127 1449 m 27 X s 6 lw 1 1 1
 c black 363 307 m 215 X 1 Y 36 X 1 Y 35 X 4 Y 36 X 4 Y 36 X 9 Y 36 X 16 Y 36 X 25 Y 36 X 35 Y 35 X 53 Y 36 X 63 Y 36 X 86 Y 36 X 101 Y 36 X 99 Y 36 X 119 Y 35 X 110 Y 36 X 98 Y 36 X 86 Y 36 X 49 Y 36 X 43 Y 36 X -9 Y 35 X -21 Y 36 X -70 Y 36 X -82 Y
 36 X -105 Y 36 X -110 Y 36 X -101 Y 35 X -115 Y 36 X -98 Y 36 X -80 Y 36 X -64 Y 36 X -50 Y 36 X -34 Y 35 X -29 Y 36 X -14 Y 36 X -10 Y 36 X -5 Y 36 X -3 Y 36 X -1 Y 35 X -1 Y 215 X -61 Y s 0 0 1 c[  12 12 ] 0 sd 1 1 1 c black 0 0 1 c 363 307 m 179
 X 1 Y 72 X 1 Y 35 X 5 Y 36 X 4 Y 36 X 9 Y 36 X 16 Y 36 X 26 Y 36 X 36 Y 35 X 54 Y 36 X 64 Y 36 X 86 Y 36 X 100 Y 36 X 98 Y 36 X 118 Y 35 X 107 Y 36 X 94 Y 36 X 83 Y 36 X 48 Y 36 X 39 Y 36 X -6 Y 35 X -20 Y 36 X -67 Y 36 X -79 Y 36 X -103 Y 36 X -106
 Y 36 X -99 Y 35 X -115 Y 36 X -98 Y 36 X -80 Y 36 X -65 Y 36 X -51 Y 36 X -35 Y 35 X -29 Y 36 X -15 Y 36 X -11 Y 36 X -5 Y 36 X -3 Y 36 X -1 Y 35 X -1 Y 215 X -61 Y s black
 gsave  2268 1538 0 0 C 2199.69 1124 t 90 r /Helvetica-BoldOblique findfont 29.3239 sf 0 0 m 
 317 303 287 271 263 240 213 205 186 167 159 140 118 95 87 67 59 38 17
(LHC HIGGS XS WG 2011) K NC gr 
 gr  gr showpage
end
%%EOF
