%!PS-Adobe-2.0 EPSF-2.0
%%BoundingBox:  0 0 567 488
%%Title: Results/m120-600-ptjmax2pt-mstw2008.eps: VBF - HAWK
%%Creator: ROOT Version 5.28/00c
%%CreationDate: Wed Nov 30 09:20:52 2011
%%EndComments
%%BeginProlog
80 dict begin
/s {stroke} def /l {lineto} def /m {moveto} def /t {translate} def
/r {rotate} def /rl {roll}  def /R {repeat} def
/d {rlineto} def /rm {rmoveto} def /gr {grestore} def /f {eofill} def
/c {setrgbcolor} def /black {0 setgray} def /sd {setdash} def
/cl {closepath} def /sf {scalefont setfont} def /lw {setlinewidth} def
/box {m dup 0 exch d exch 0 d 0 exch neg d cl} def
/NC{systemdict begin initclip end}def/C{NC box clip newpath}def
/bl {box s} def /bf {box f} def /Y { 0 exch d} def /X { 0 d} def 
/K {{pop pop 0 moveto} exch kshow} bind def
/ita {/ang 15 def gsave [1 0 ang dup sin exch cos div 1 0 0] concat} def 
/mp {newpath /y exch def /x exch def} def
/side {[w .77 mul w .23 mul] .385 w mul sd w 0 l currentpoint t -144 r} def
/mr {mp x y w2 0 360 arc} def /m24 {mr s} def /m20 {mr f} def
/mb {mp x y w2 add m w2 neg 0 d 0 w neg d w 0 d 0 w d cl} def
/mt {mp x y w2 add m w2 neg w neg d w 0 d cl} def
/m21 {mb f} def /m25 {mb s} def /m22 {mt f} def /m26{mt s} def
/m23 {mp x y w2 sub m w2 w d w neg 0 d cl f} def
/m27 {mp x y w2 add m w3 neg w2 neg d w3 w2 neg d w3 w2 d cl s} def
/m28 {mp x w2 sub y w2 sub w3 add m w3 0 d  0 w3 neg d w3 0 d 0 w3 d w3 0 d  0 w3 d w3 neg 0 d 0 w3 d w3 neg 0 d 0 w3 neg d w3 neg 0 d cl s } def
/m29 {mp gsave x w2 sub y w2 add w3 sub m currentpoint t 4 {side} repeat cl fill gr} def
/m30 {mp gsave x w2 sub y w2 add w3 sub m currentpoint t 4 {side} repeat cl s gr} def
/m31 {mp x y w2 sub m 0 w d x w2 sub y m w 0 d x w2 sub y w2 add m w w neg d x w2 sub y w2 sub m w w d s} def
/m32 {mp x y w2 sub m w2 w d w neg 0 d cl s} def
/m33 {mp x y w2 add m w3 neg w2 neg d w3 w2 neg d w3 w2 d cl f} def
/m34 {mp x w2 sub y w2 sub w3 add m w3 0 d  0 w3 neg d w3 0 d 0 w3 d w3 0 d  0 w3 d w3 neg 0 d 0 w3 d w3 neg 0 d 0 w3 neg d w3 neg 0 d cl f } def
/m2 {mp x y w2 sub m 0 w d x w2 sub y m w 0 d s} def
/m5 {mp x w2 sub y w2 sub m w w d x w2 sub y w2 add m w w neg d s} def
/reEncode {exch findfont dup length dict begin {1 index /FID eq  {pop pop} {def} ifelse } forall /Encoding exch def currentdict end dup /FontName get exch definefont pop } def [/Times-Bold /Times-Italic /Times-BoldItalic /Helvetica /Helvetica-Oblique
 /Helvetica-Bold /Helvetica-BoldOblique /Courier /Courier-Oblique /Courier-Bold /Courier-BoldOblique /Times-Roman /AvantGarde-Book /AvantGarde-BookOblique /AvantGarde-Demi /AvantGarde-DemiOblique /Bookman-Demi /Bookman-DemiItalic /Bookman-Light
 /Bookman-LightItalic /Helvetica-Narrow /Helvetica-Narrow-Bold /Helvetica-Narrow-BoldOblique /Helvetica-Narrow-Oblique /NewCenturySchlbk-Roman /NewCenturySchlbk-Bold /NewCenturySchlbk-BoldItalic /NewCenturySchlbk-Italic /Palatino-Bold
 /Palatino-BoldItalic /Palatino-Italic /Palatino-Roman ] {ISOLatin1Encoding reEncode } forall%%EndProlog
%%BeginSetup
%%EndSetup
newpath  gsave  .25 .25 scale  gsave  0 0 t black[  ] 0 sd 3 lw 1 1 1 c 2268 1954 0 0 bf black 1 1 1 c 2177 1329 45 586 bf black 1 1 1 c 1677 1063 328 719 bf black 1677 1063 328 719 bl 1 1 1 c 1677 1063 328 719 bf black 1677 1063 328 719 bl 0.8 0 0
 c[  12 12 ] 0 sd 6 lw 1 1 1 c black 0.8 0 0 c 328 1476 m 99 X 201 Y 99 X -2 Y 98 X -14 Y 99 X -31 Y 98 X -39 Y 99 X -50 Y 99 X -60 Y 98 X -57 Y 99 X -69 Y 98 X -80 Y 99 X -49 Y 99 X -75 Y 98 X -66 Y 99 X -67 Y 98 X -45 Y 99 X -140 Y 99 X s black[  ]
 0 sd 3 lw 328 719 m 1677 X s
 gsave  2177 1329 45 586 C 1834.93 622.61 t 0 r /Helvetica findfont 60.8537 sf 0 0 m ( [GeV]) show NC gr 
 gsave  2177 1329 45 586 C 1779.25 589.708 t 0 r /Helvetica findfont 40.5691 sf 0 0 m (Tj2) show NC gr 
 gsave  2177 1329 45 586 C 1746.34 622.61 t 0 r /Helvetica findfont 60.8537 sf 0 0 m (p) show NC gr  394 750 m -31 Y s 460 734 m -15 Y s 526 734 m -15 Y s 591 734 m -15 Y s 657 750 m -31 Y s 723 734 m -15 Y s 789 734 m -15 Y s 854 734 m -15 Y s 920
 750 m -31 Y s 986 734 m -15 Y s 1051 734 m -15 Y s 1117 734 m -15 Y s 1183 750 m -31 Y s 1249 734 m -15 Y s 1314 734 m -15 Y s 1380 734 m -15 Y s 1446 750 m -31 Y s 1512 734 m -15 Y s 1577 734 m -15 Y s 1643 734 m -15 Y s 1709 750 m -31 Y s 1775 734
 m -15 Y s 1840 734 m -15 Y s 1906 734 m -15 Y s 1972 750 m -31 Y s 394 750 m -31 Y s 1972 750 m -31 Y s
 gsave  2177 1329 45 586 C 366.985 675.759 t 0 r /Helvetica findfont 45.6403 sf 0 0 m (20) show NC gr 
 gsave  2177 1329 45 586 C 630.202 675.759 t 0 r /Helvetica findfont 45.6403 sf 0 0 m (40) show NC gr 
 gsave  2177 1329 45 586 C 893.42 675.759 t 0 r /Helvetica findfont 45.6403 sf 0 0 m (60) show NC gr 
 gsave  2177 1329 45 586 C 1156.64 675.759 t 0 r /Helvetica findfont 45.6403 sf 0 0 m (80) show NC gr 
 gsave  2177 1329 45 586 C 1407.2 675.759 t 0 r /Helvetica findfont 45.6403 sf 0 0 m (100) show NC gr 
 gsave  2177 1329 45 586 C 1670.42 675.759 t 0 r /Helvetica findfont 45.6403 sf 0 0 m (120) show NC gr 
 gsave  2177 1329 45 586 C 1933.63 675.759 t 0 r /Helvetica findfont 45.6403 sf 0 0 m (140) show NC gr  328 719 m 1063 Y s
 gsave  2177 1329 45 586 C 212.598 1546.4 t 90 r /Helvetica findfont 60.8537 sf 0 0 m ( [fb/GeV]) show NC gr 
 gsave  2177 1329 45 586 C 245.501 1490.72 t 90 r /Helvetica findfont 40.5691 sf 0 0 m (Tj2) show NC gr 
 gsave  2177 1329 45 586 C 212.598 1407.2 t 90 r /Helvetica findfont 60.8537 sf 0 0 m (/dp) show NC gr 
 gsave  2177 1329 45 586 C 212.598 1369.24 t 90 r /Symbol findfont 60.8537 sf 0 0 m (s) show NC gr 
 gsave  2177 1329 45 586 C 212.598 1338.86 t 90 r /Helvetica findfont 60.8537 sf 0 0 m (d) show NC gr  354 732 m -26 X s 354 799 m -26 X s 354 846 m -26 X s 354 883 m -26 X s 354 912 m -26 X s 354 938 m -26 X s 354 960 m -26 X s 354 979 m -26 X s 381
 996 m -53 X s
 gsave  2177 1329 45 586 C 285.996 994.657 t 0 r /Helvetica findfont 30.4268 sf 0 0 m (\2551) show NC gr 
 gsave  2177 1329 45 586 C 235.377 976.94 t 0 r /Helvetica findfont 45.6403 sf 0 0 m (10) show NC gr  354 1110 m -26 X s 354 1176 m -26 X s 354 1223 m -26 X s 354 1260 m -26 X s 354 1290 m -26 X s 354 1315 m -26 X s 354 1337 m -26 X s 354 1356 m -26
 X s 381 1373 m -53 X s
 gsave  2177 1329 45 586 C 311.177 1355.25 t 0 r  -24 0 t /Helvetica findfont 45.6403 sf 0 0 m (1) show NC gr  354 1487 m -26 X s 354 1553 m -26 X s 354 1601 m -26 X s 354 1637 m -26 X s 354 1667 m -26 X s 354 1692 m -26 X s 354 1714 m -26 X s 354
 1734 m -26 X s 381 1751 m -53 X s
 gsave  2177 1329 45 586 C 311.177 1732.56 t 0 r  -49 0 t /Helvetica findfont 45.6403 sf 0 0 m (10) show NC gr  0.4 0.4 0.8 c 6 lw 1 1 1 c black 0.4 0.4 0.8 c 328 1462 m 99 X 199 Y 99 X 5 Y 98 X -18 Y 99 X -28 Y 98 X -46 Y 99 X -49 Y 99 X -54 Y 98 X
 -67 Y 99 X -63 Y 98 X -77 Y 99 X -61 Y 99 X -74 Y 98 X -61 Y 99 X -56 Y 98 X -93 Y 99 X -55 Y 99 X s 0 0.8 0 c[ 20 12 4 12] 0 sd 1 1 1 c black 0 0.8 0 c 328 1473 m 99 X 200 Y 99 X 6 Y 98 X -18 Y 99 X -28 Y 98 X -44 Y 99 X -49 Y 99 X -53 Y 98 X -68 Y
 99 X -61 Y 98 X -73 Y 99 X -65 Y 99 X -67 Y 98 X -69 Y 99 X -56 Y 98 X -87 Y 99 X -53 Y 99 X s 0.2 0 0.4 c[ 20 20] 0 sd 1 1 1 c black 0.2 0 0.4 c 328 1461 m 99 X 199 Y 99 X 3 Y 98 X -20 Y 99 X -31 Y 98 X -40 Y 99 X -48 Y 99 X -56 Y 98 X -63 Y 99 X
 -69 Y 98 X -75 Y 99 X -73 Y 99 X -59 Y 98 X -71 Y 99 X -66 Y 98 X -72 Y 99 X -74 Y 99 X s 0.8 0 0 c[  12 12 ] 0 sd 1 1 1 c black 0.8 0 0 c 328 1065 m 99 X 193 Y 99 X -6 Y 98 X -28 Y 99 X -35 Y 98 X -48 Y 99 X -53 Y 99 X -55 Y 98 X -57 Y 99 X -69 Y
 98 X -48 Y 99 X -72 Y 99 X -64 Y 98 X -4 Y 395 X s 0.4 0.4 0.8 c[  ] 0 sd 1 1 1 c black 0.4 0.4 0.8 c 328 1097 m 99 X 201 Y 99 X -7 Y 98 X -22 Y 99 X -40 Y 98 X -48 Y 99 X -48 Y 99 X -56 Y 98 X -64 Y 99 X -42 Y 98 X -86 Y 99 X -67 Y 99 X -37 Y 98 X
 -62 Y 395 X s 0 0.8 0 c[ 20 12 4 12] 0 sd 1 1 1 c black 0 0.8 0 c 328 1096 m 99 X 197 Y 99 X -4 Y 98 X -24 Y 99 X -39 Y 98 X -47 Y 99 X -50 Y 99 X -54 Y 98 X -68 Y 99 X -40 Y 98 X -88 Y 99 X -65 Y 99 X -36 Y 98 X -59 Y 395 X s 0.2 0 0.4 c[ 20 20] 0
 sd 1 1 1 c black 0.2 0 0.4 c 328 1075 m 99 X 195 Y 99 X -8 Y 98 X -25 Y 99 X -38 Y 98 X -48 Y 99 X -51 Y 99 X -54 Y 98 X -60 Y 99 X -67 Y 98 X -59 Y 99 X -64 Y 99 X -64 Y 98 X -13 Y 395 X s black
 gsave  2177 1329 45 586 C 2057.65 1338.86 t 90 r /Helvetica-BoldOblique findfont 38.0336 sf 0 0 m 
 410 392 371 351 340 311 276 266 241 216 206 181 152 123 113 86 76 49 22
(LHC HIGGS XS WG 2011) K NC gr 
 gsave  2177 1329 45 586 C 1650.17 1705.85 t 0 r /Helvetica findfont 30.4268 sf 0 0 m 
 239 229 212 191 182 154 135 126 118 97 88 68 40 22
(HAWK w/ EW Corr) K NC gr  0.4 0.4 0.8 c[  ] 0 sd 1544 1717 m 88 X s black
 gsave  2177 1329 45 586 C 1650.17 1629.92 t 0 r /Helvetica findfont 30.4268 sf 0 0 m (POWHEG) show NC gr  0.8 0 0 c[  12 12 ] 0 sd 1544 1641 m 88 X s black
 gsave  2177 1329 45 586 C 1650.17 1553.99 t 0 r /Helvetica findfont 30.4268 sf 0 0 m 
 255 245 228 207 198 170 151 142 126 118 96 88 68 40 21
(HAWK w/o EW Corr) K NC gr  0 0.8 0 c[ 20 12 4 12] 0 sd 1544 1564 m 88 X s black
 gsave  2177 1329 45 586 C 1650.17 1475.53 t 0 r /Helvetica findfont 30.4268 sf 0 0 m (VBFNLO w/ EW Corr) show NC gr  0.2 0 0.4 c[ 20 20] 0 sd 1544 1488 m 88 X s black[  ] 0 sd 3 lw 1 1 1 c black 1 1 1 c 1677 300 328 231 bf black 1677 300 328 231 bl
 1 1 1 c 1677 300 328 231 bf black 1677 300 328 231 bl 328 231 m 1677 X s
 gsave  2177 547 45 39 C 1834.93 134.139 t 0 r /Helvetica findfont 60.7874 sf 0 0 m ( [GeV]) show NC gr 
 gsave  2177 547 45 39 C 1779.25 101.237 t 0 r /Helvetica findfont 40.5249 sf 0 0 m (Tj2) show NC gr 
 gsave  2177 547 45 39 C 1746.34 134.139 t 0 r /Helvetica findfont 60.7874 sf 0 0 m (p) show NC gr  394 243 m -12 Y s 460 237 m -6 Y s 526 237 m -6 Y s 591 237 m -6 Y s 657 243 m -12 Y s 723 237 m -6 Y s 789 237 m -6 Y s 854 237 m -6 Y s 920 243 m
 -12 Y s 986 237 m -6 Y s 1051 237 m -6 Y s 1117 237 m -6 Y s 1183 243 m -12 Y s 1249 237 m -6 Y s 1314 237 m -6 Y s 1380 237 m -6 Y s 1446 243 m -12 Y s 1512 237 m -6 Y s 1577 237 m -6 Y s 1643 237 m -6 Y s 1709 243 m -12 Y s 1775 237 m -6 Y s 1840
 237 m -6 Y s 1906 237 m -6 Y s 1972 243 m -12 Y s 394 243 m -12 Y s 1972 243 m -12 Y s
 gsave  2177 547 45 39 C 366.985 189.82 t 0 r /Helvetica findfont 45.5906 sf 0 0 m (20) show NC gr 
 gsave  2177 547 45 39 C 630.202 189.82 t 0 r /Helvetica findfont 45.5906 sf 0 0 m (40) show NC gr 
 gsave  2177 547 45 39 C 893.42 189.82 t 0 r /Helvetica findfont 45.5906 sf 0 0 m (60) show NC gr 
 gsave  2177 547 45 39 C 1156.64 189.82 t 0 r /Helvetica findfont 45.5906 sf 0 0 m (80) show NC gr 
 gsave  2177 547 45 39 C 1407.2 189.82 t 0 r /Helvetica findfont 45.5906 sf 0 0 m (100) show NC gr 
 gsave  2177 547 45 39 C 1670.42 189.82 t 0 r /Helvetica findfont 45.5906 sf 0 0 m (120) show NC gr 
 gsave  2177 547 45 39 C 1933.63 189.82 t 0 r /Helvetica findfont 45.5906 sf 0 0 m (140) show NC gr  328 231 m 300 Y s
 gsave  2177 547 45 39 C 222.722 430.259 t 90 r /Helvetica findfont 60.7874 sf 0 0 m ( [%]) show NC gr 
 gsave  2177 547 45 39 C 245.501 364.454 t 90 r /Helvetica findfont 40.5249 sf 0 0 m (EW) show NC gr 
 gsave  2177 547 45 39 C 222.722 334.083 t 90 r /Symbol findfont 60.7874 sf 0 0 m (d) show NC gr  364 261 m -36 X s 346 281 m -18 X s 346 301 m -18 X s 346 321 m -18 X s 346 341 m -18 X s 364 361 m -36 X s 346 381 m -18 X s 346 401 m -18 X s 346 421
 m -18 X s 346 441 m -18 X s 364 461 m -36 X s 364 261 m -36 X s 346 241 m -18 X s 364 461 m -36 X s 346 481 m -18 X s 346 501 m -18 X s 346 521 m -18 X s
 gsave  2177 547 45 39 C 250.562 242.97 t 0 r /Helvetica findfont 45.5906 sf 0 0 m (\25520) show NC gr 
 gsave  2177 547 45 39 C 250.562 344.207 t 0 r /Helvetica findfont 45.5906 sf 0 0 m (\25510) show NC gr 
 gsave  2177 547 45 39 C 291.057 445.444 t 0 r /Helvetica findfont 45.5906 sf 0 0 m (0) show NC gr  378 386 m -50 X s 328 381 m 10 Y s 378 386 m 49 X s 427 381 m 10 Y s 378 386 m 1 Y s 373 387 m 10 X s 378 386 m -1 Y s 373 385 m 10 X s 476 384 m -49
 X s 427 379 m 10 Y s 476 384 m 50 X s 526 379 m 10 Y s 476 384 m 1 Y s 471 385 m 10 X s 476 384 m -1 Y s 471 383 m 10 X s 575 382 m -49 X s 526 377 m 10 Y s 575 382 m 49 X s 624 377 m 10 Y s 575 382 m 1 Y s 570 383 m 10 X s 575 382 m -1 Y s 570 381
 m 10 X s 673 377 m -49 X s 624 372 m 10 Y s 673 377 m 50 X s 723 372 m 10 Y s 673 377 m 2 Y s 668 379 m 11 X s 673 377 m -1 Y s 668 376 m 11 X s 772 376 m -49 X s 723 371 m 11 Y s 772 376 m 49 X s 821 371 m 11 Y s 772 376 m 2 Y s 767 378 m 10 X s
 772 376 m -1 Y s 767 375 m 10 X s 871 371 m -50 X s 821 366 m 10 Y s 871 371 m 49 X s 920 366 m 10 Y s 871 371 m 2 Y s 866 373 m 10 X s 871 371 m -2 Y s 866 369 m 10 X s 969 369 m -49 X s 920 364 m 10 Y s 969 369 m 50 X s 1019 364 m 10 Y s 969 369 m
 3 Y s 964 372 m 10 X s 969 369 m -3 Y s 964 366 m 10 X s 1068 367 m -49 X s 1019 362 m 10 Y s 1068 367 m 49 X s 1117 362 m 10 Y s 1068 367 m 3 Y s 1063 370 m 10 X s 1068 367 m -3 Y s 1063 364 m 10 X s 1167 348 m -50 X s 1117 343 m 10 Y s 1167 348 m
 49 X s 1216 343 m 10 Y s 1167 348 m 5 Y s 1161 353 m 11 X s 1167 348 m -4 Y s 1161 344 m 11 X s 1265 356 m -49 X s 1216 351 m 10 Y s 1265 356 m 49 X s 1314 351 m 10 Y s 1265 356 m 5 Y s 1260 361 m 10 X s 1265 356 m -5 Y s 1260 351 m 10 X s 1364 339
 m -50 X s 1314 334 m 10 Y s 1364 339 m 49 X s 1413 334 m 10 Y s 1364 339 m 7 Y s 1359 346 m 10 X s 1364 339 m -7 Y s 1359 332 m 10 X s 1462 351 m -49 X s 1413 346 m 10 Y s 1462 351 m 50 X s 1512 346 m 10 Y s 1462 351 m 8 Y s 1457 359 m 10 X s 1462
 351 m -8 Y s 1457 343 m 10 X s 1561 367 m -49 X s 1512 362 m 10 Y s 1561 367 m 49 X s 1610 362 m 10 Y s 1561 367 m 8 Y s 1556 375 m 10 X s 1561 367 m -8 Y s 1556 359 m 10 X s 1660 326 m -50 X s 1610 321 m 10 Y s 1660 326 m 49 X s 1709 321 m 10 Y s
 1660 326 m 14 Y s 1654 340 m 11 X s 1660 326 m -14 Y s 1654 312 m 11 X s 1758 331 m -49 X s 1709 326 m 10 Y s 1758 331 m 49 X s 1807 326 m 10 Y s 1758 331 m 16 Y s 1753 347 m 10 X s 1758 331 m -17 Y s 1753 314 m 10 X s 1857 298 m -50 X s 1807 293 m
 10 Y s 1857 298 m 49 X s 1906 293 m 10 Y s 1857 298 m 29 Y s 1852 327 m 10 X s 1857 298 m -29 Y s 1852 269 m 10 X s 1955 298 m -49 X s 1906 293 m 10 Y s 1955 298 m 50 X s 2005 293 m 10 Y s 1955 298 m 29 Y s 1950 327 m 10 X s 1955 298 m -29 Y s 1950
 269 m 10 X s 0.4 0.4 0.4 c black /w 4 def /w2 {w 2 div} def /w3 {w 3 div} def 378 386 476 384 575 382 673 377 772 376 871 371 969 369 1068 367 1167 348 1265 356 1364 339 1462 351 1561 367 1660 326 1758 331 1857 298 1955 298 17 { m21} R 0.4 0.4 0.4 c
 black 0.4 0.4 0.4 c
 gsave  2177 547 45 39 C 445.444 326.49 t 0 r /Helvetica findfont 40.5249 sf 0 0 m ( = 120 GeV) show NC gr  black 0.4 0.4 0.4 c
 gsave  2177 547 45 39 C 425.197 316.367 t 0 r /Helvetica findfont 27.8609 sf 0 0 m (H) show NC gr  black 0.4 0.4 0.4 c
 gsave  2177 547 45 39 C 392.295 326.49 t 0 r /Helvetica findfont 40.5249 sf 0 0 m (M) show NC gr  0.6 0 0 c 378 486 m -50 X s 328 481 m 10 Y s 378 486 m 49 X s 427 481 m 10 Y s 378 486 m 4 Y s 373 490 m 10 X s 378 486 m -3 Y s 373 483 m 10 X s 476
 485 m -49 X s 427 479 m 11 Y s 476 485 m 50 X s 526 479 m 11 Y s 476 485 m 1 Y s 471 486 m 10 X s 476 485 m -2 Y s 471 483 m 10 X s 575 483 m -49 X s 526 478 m 10 Y s 575 483 m 49 X s 624 478 m 10 Y s 575 483 m 1 Y s 570 484 m 10 X s 575 483 m -1 Y
 s 570 482 m 10 X s 673 484 m -49 X s 624 479 m 10 Y s 673 484 m 50 X s 723 479 m 10 Y s 673 484 m 2 Y s 668 486 m 11 X s 673 484 m -2 Y s 668 482 m 11 X s 772 486 m -49 X s 723 481 m 10 Y s 772 486 m 49 X s 821 481 m 10 Y s 772 486 m 2 Y s 767 488 m
 10 X s 772 486 m -2 Y s 767 484 m 10 X s 871 485 m -50 X s 821 480 m 10 Y s 871 485 m 49 X s 920 480 m 10 Y s 871 485 m 2 Y s 866 487 m 10 X s 871 485 m -1 Y s 866 484 m 10 X s 969 488 m -49 X s 920 483 m 10 Y s 969 488 m 50 X s 1019 483 m 10 Y s
 969 488 m 3 Y s 964 491 m 10 X s 969 488 m -3 Y s 964 485 m 10 X s 1068 481 m -49 X s 1019 476 m 10 Y s 1068 481 m 49 X s 1117 476 m 10 Y s 1068 481 m 3 Y s 1063 484 m 10 X s 1068 481 m -3 Y s 1063 478 m 10 X s 1167 487 m -50 X s 1117 482 m 11 Y s
 1167 487 m 49 X s 1216 482 m 11 Y s 1167 487 m 3 Y s 1161 490 m 11 X s 1167 487 m -2 Y s 1161 485 m 11 X s 1265 487 m -49 X s 1216 482 m 10 Y s 1265 487 m 49 X s 1314 482 m 10 Y s 1265 487 m 3 Y s 1260 490 m 10 X s 1265 487 m -4 Y s 1260 483 m 10 X
 s 1364 493 m -50 X s 1314 488 m 10 Y s 1364 493 m 49 X s 1413 488 m 10 Y s 1364 493 m 6 Y s 1359 499 m 10 X s 1364 493 m -5 Y s 1359 488 m 10 X s 1462 483 m -49 X s 1413 478 m 10 Y s 1462 483 m 50 X s 1512 478 m 10 Y s 1462 483 m 5 Y s 1457 488 m 10
 X s 1462 483 m -4 Y s 1457 479 m 10 X s 1561 478 m -49 X s 1512 473 m 10 Y s 1561 478 m 49 X s 1610 473 m 10 Y s 1561 478 m 5 Y s 1556 483 m 10 X s 1561 478 m -6 Y s 1556 472 m 10 X s 1660 473 m -50 X s 1610 468 m 10 Y s 1660 473 m 49 X s 1709 468 m
 10 Y s 1660 473 m 10 Y s 1654 483 m 11 X s 1660 473 m -10 Y s 1654 463 m 11 X s 1758 472 m -49 X s 1709 467 m 10 Y s 1758 472 m 49 X s 1807 467 m 10 Y s 1758 472 m 12 Y s 1753 484 m 10 X s 1758 472 m -11 Y s 1753 461 m 10 X s 1857 477 m -50 X s 1807
 472 m 10 Y s 1857 477 m 49 X s 1906 472 m 10 Y s 1857 477 m 8 Y s 1852 485 m 10 X s 1857 477 m -7 Y s 1852 470 m 10 X s 1955 474 m -49 X s 1906 469 m 10 Y s 1955 474 m 50 X s 2005 469 m 10 Y s 1955 474 m 12 Y s 1950 486 m 10 X s 1955 474 m -11 Y s
 1950 463 m 10 X s black 378 486 476 485 575 483 673 484 772 486 871 485 969 488 1068 481 1167 487 1265 487 1364 493 1462 483 1561 478 1660 473 1758 472 1857 477 1955 474 17 { m22} R 0.6 0 0 c black 0.6 0 0 c
 gsave  2177 547 45 39 C 445.444 422.666 t 0 r /Helvetica findfont 40.5249 sf 0 0 m ( = 600 GeV) show NC gr  black 0.6 0 0 c
 gsave  2177 547 45 39 C 425.197 412.542 t 0 r /Helvetica findfont 27.8609 sf 0 0 m (H) show NC gr  black 0.6 0 0 c
 gsave  2177 547 45 39 C 392.295 422.666 t 0 r /Helvetica findfont 40.5249 sf 0 0 m (M) show NC gr 
 gr  gr showpage
end
%%EOF
