%!PS-Adobe-2.0 EPSF-2.0
%%BoundingBox:  0 0 567 544
%%Title: /home/shiki/Desktop/MCFM/HiggsAcc/SigAcc_Pdf+alphas_uncertainty.eps: Higgs Cross Section
%%Creator: ROOT Version 5.28/00
%%CreationDate: Wed Nov 30 01:24:45 2011
%%EndComments
%%BeginProlog
80 dict begin
/s {stroke} def /l {lineto} def /m {moveto} def /t {translate} def
/r {rotate} def /rl {roll}  def /R {repeat} def
/d {rlineto} def /rm {rmoveto} def /gr {grestore} def /f {eofill} def
/c {setrgbcolor} def /black {0 setgray} def /sd {setdash} def
/cl {closepath} def /sf {scalefont setfont} def /lw {setlinewidth} def
/box {m dup 0 exch d exch 0 d 0 exch neg d cl} def
/NC{systemdict begin initclip end}def/C{NC box clip newpath}def
/bl {box s} def /bf {box f} def /Y { 0 exch d} def /X { 0 d} def 
/K {{pop pop 0 moveto} exch kshow} bind def
/ita {/ang 15 def gsave [1 0 ang dup sin exch cos div 1 0 0] concat} def 
/mp {newpath /y exch def /x exch def} def
/side {[w .77 mul w .23 mul] .385 w mul sd w 0 l currentpoint t -144 r} def
/mr {mp x y w2 0 360 arc} def /m24 {mr s} def /m20 {mr f} def
/mb {mp x y w2 add m w2 neg 0 d 0 w neg d w 0 d 0 w d cl} def
/mt {mp x y w2 add m w2 neg w neg d w 0 d cl} def
/m21 {mb f} def /m25 {mb s} def /m22 {mt f} def /m26{mt s} def
/m23 {mp x y w2 sub m w2 w d w neg 0 d cl f} def
/m27 {mp x y w2 add m w3 neg w2 neg d w3 w2 neg d w3 w2 d cl s} def
/m28 {mp x w2 sub y w2 sub w3 add m w3 0 d  0 w3 neg d w3 0 d 0 w3 d w3 0 d  0 w3 d w3 neg 0 d 0 w3 d w3 neg 0 d 0 w3 neg d w3 neg 0 d cl s } def
/m29 {mp gsave x w2 sub y w2 add w3 sub m currentpoint t 4 {side} repeat cl fill gr} def
/m30 {mp gsave x w2 sub y w2 add w3 sub m currentpoint t 4 {side} repeat cl s gr} def
/m31 {mp x y w2 sub m 0 w d x w2 sub y m w 0 d x w2 sub y w2 add m w w neg d x w2 sub y w2 sub m w w d s} def
/m32 {mp x y w2 sub m w2 w d w neg 0 d cl s} def
/m33 {mp x y w2 add m w3 neg w2 neg d w3 w2 neg d w3 w2 d cl f} def
/m34 {mp x w2 sub y w2 sub w3 add m w3 0 d  0 w3 neg d w3 0 d 0 w3 d w3 0 d  0 w3 d w3 neg 0 d 0 w3 d w3 neg 0 d 0 w3 neg d w3 neg 0 d cl f } def
/m2 {mp x y w2 sub m 0 w d x w2 sub y m w 0 d s} def
/m5 {mp x w2 sub y w2 sub m w w d x w2 sub y w2 add m w w neg d s} def
/reEncode {exch findfont dup length dict begin {1 index /FID eq  {pop pop} {def} ifelse } forall /Encoding exch def currentdict end dup /FontName get exch definefont pop } def [/Times-Bold /Times-Italic /Times-BoldItalic /Helvetica /Helvetica-Oblique
 /Helvetica-Bold /Helvetica-BoldOblique /Courier /Courier-Oblique /Courier-Bold /Courier-BoldOblique /Times-Roman /AvantGarde-Book /AvantGarde-BookOblique /AvantGarde-Demi /AvantGarde-DemiOblique /Bookman-Demi /Bookman-DemiItalic /Bookman-Light
 /Bookman-LightItalic /Helvetica-Narrow /Helvetica-Narrow-Bold /Helvetica-Narrow-BoldOblique /Helvetica-Narrow-Oblique /NewCenturySchlbk-Roman /NewCenturySchlbk-Bold /NewCenturySchlbk-BoldItalic /NewCenturySchlbk-Italic /Palatino-Bold
 /Palatino-BoldItalic /Palatino-Italic /Palatino-Roman ] {ISOLatin1Encoding reEncode } forall%%EndProlog
%%BeginSetup
%%EndSetup
newpath  gsave  .25 .25 scale  gsave  0 0 t black[  ] 0 sd 3 lw 1 1 1 c 2268 2176 0 0 bf black 1 1 1 c 1791 1720 363 348 bf black 1791 1720 363 348 bl 1 1 1 c 1791 1720 363 348 bf black 1791 1720 363 348 bl 6 lw 1 1 1 c black 363 348 m 1791 X s 3 lw
 363 348 m 1791 X s
 gsave  2268 2176 0 0 C 1928.81 164.562 t 0 r /Helvetica findfont 79.9028 sf 0 0 m ( [GeV]) show NC gr 
 gsave  2268 2176 0 0 C 1894.56 137.938 t 0 r /Helvetica findfont 53.2685 sf 0 0 m (H) show NC gr 
 gsave  2268 2176 0 0 C 1833.69 164.562 t 0 r /Helvetica findfont 79.9028 sf 0 0 m (M) show NC gr  363 400 m -52 Y s 432 374 m -26 Y s 501 374 m -26 Y s 570 374 m -26 Y s 638 374 m -26 Y s 707 400 m -52 Y s 776 374 m -26 Y s 845 374 m -26 Y s 914 374
 m -26 Y s 983 374 m -26 Y s 1052 400 m -52 Y s 1121 374 m -26 Y s 1190 374 m -26 Y s 1259 374 m -26 Y s 1327 374 m -26 Y s 1396 400 m -52 Y s 1465 374 m -26 Y s 1534 374 m -26 Y s 1603 374 m -26 Y s 1672 374 m -26 Y s 1741 400 m -52 Y s 1810 374 m
 -26 Y s 1879 374 m -26 Y s 1948 374 m -26 Y s 2017 374 m -26 Y s 2085 400 m -52 Y s 2085 400 m -52 Y s 2154 374 m -26 Y s
 gsave  2268 2176 0 0 C 292.688 271.125 t 0 r /Helvetica findfont 79.9028 sf 0 0 m (100) show NC gr 
 gsave  2268 2176 0 0 C 635.125 271.125 t 0 r /Helvetica findfont 79.9028 sf 0 0 m (200) show NC gr 
 gsave  2268 2176 0 0 C 981.375 271.125 t 0 r /Helvetica findfont 79.9028 sf 0 0 m (300) show NC gr 
 gsave  2268 2176 0 0 C 1323.81 271.125 t 0 r /Helvetica findfont 79.9028 sf 0 0 m (400) show NC gr 
 gsave  2268 2176 0 0 C 1670.06 271.125 t 0 r /Helvetica findfont 79.9028 sf 0 0 m (500) show NC gr 
 gsave  2268 2176 0 0 C 2016.31 271.125 t 0 r /Helvetica findfont 79.9028 sf 0 0 m (600) show NC gr  363 2068 m 1791 X s 363 2016 m 52 Y s 432 2042 m 26 Y s 501 2042 m 26 Y s 570 2042 m 26 Y s 638 2042 m 26 Y s 707 2016 m 52 Y s 776 2042 m 26 Y s 845
 2042 m 26 Y s 914 2042 m 26 Y s 983 2042 m 26 Y s 1052 2016 m 52 Y s 1121 2042 m 26 Y s 1190 2042 m 26 Y s 1259 2042 m 26 Y s 1327 2042 m 26 Y s 1396 2016 m 52 Y s 1465 2042 m 26 Y s 1534 2042 m 26 Y s 1603 2042 m 26 Y s 1672 2042 m 26 Y s 1741 2016
 m 52 Y s 1810 2042 m 26 Y s 1879 2042 m 26 Y s 1948 2042 m 26 Y s 2017 2042 m 26 Y s 2085 2016 m 52 Y s 2085 2016 m 52 Y s 2154 2042 m 26 Y s 363 348 m 1720 Y s
 gsave  2268 2176 0 0 C 148.125 1853.94 t 90 r /Helvetica findfont 79.9028 sf 0 0 m (\(NLO\)) show NC gr 
 gsave  2268 2176 0 0 C 170.938 1766.44 t 90 r /Helvetica findfont 53.2685 sf 0 0 m (env) show NC gr 
 gsave  2268 2176 0 0 C 148.125 1724.56 t 90 r /Symbol findfont 79.9028 sf 0 0 m (d) show NC gr 
 gsave  2268 2176 0 0 C 148.125 1595.19 t 90 r /Helvetica findfont 79.9028 sf 0 0 m (1 + ) show NC gr  417 348 m -54 X s 390 406 m -27 X s 390 463 m -27 X s 390 520 m -27 X s 390 577 m -27 X s 417 635 m -54 X s 390 692 m -27 X s 390 749 m -27 X s 390
 807 m -27 X s 390 864 m -27 X s 417 921 m -54 X s 390 979 m -27 X s 390 1036 m -27 X s 390 1093 m -27 X s 390 1151 m -27 X s 417 1208 m -54 X s 390 1265 m -27 X s 390 1323 m -27 X s 390 1380 m -27 X s 390 1437 m -27 X s 417 1494 m -54 X s 390 1552 m
 -27 X s 390 1609 m -27 X s 390 1666 m -27 X s 390 1724 m -27 X s 417 1781 m -54 X s 390 1838 m -27 X s 390 1896 m -27 X s 390 1953 m -27 X s 390 2010 m -27 X s 417 2068 m -54 X s
 gsave  2268 2176 0 0 C 197.562 320.562 t 0 r /Helvetica findfont 79.9028 sf 0 0 m (0.97) show NC gr 
 gsave  2268 2176 0 0 C 197.562 605.938 t 0 r /Helvetica findfont 79.9028 sf 0 0 m (0.98) show NC gr 
 gsave  2268 2176 0 0 C 197.562 895.125 t 0 r /Helvetica findfont 79.9028 sf 0 0 m (0.99) show NC gr 
 gsave  2268 2176 0 0 C 319.312 1176.69 t 0 r /Helvetica findfont 79.9028 sf 0 0 m (1) show NC gr 
 gsave  2268 2176 0 0 C 209 1465.81 t 0 r /Helvetica findfont 79.9028 sf 0 0 m (1.01) show NC gr 
 gsave  2268 2176 0 0 C 197.562 1755 t 0 r /Helvetica findfont 79.9028 sf 0 0 m (1.02) show NC gr 
 gsave  2268 2176 0 0 C 197.562 2040.38 t 0 r /Helvetica findfont 79.9028 sf 0 0 m (1.03) show NC gr  2154 348 m 1720 Y s 2101 348 m 53 X s 2127 406 m 27 X s 2127 463 m 27 X s 2127 520 m 27 X s 2127 577 m 27 X s 2101 635 m 53 X s 2127 692 m 27 X s
 2127 749 m 27 X s 2127 807 m 27 X s 2127 864 m 27 X s 2101 921 m 53 X s 2127 979 m 27 X s 2127 1036 m 27 X s 2127 1093 m 27 X s 2127 1151 m 27 X s 2101 1208 m 53 X s 2127 1265 m 27 X s 2127 1323 m 27 X s 2127 1380 m 27 X s 2127 1437 m 27 X s 2101
 1494 m 53 X s 2127 1552 m 27 X s 2127 1609 m 27 X s 2127 1666 m 27 X s 2127 1724 m 27 X s 2101 1781 m 53 X s 2127 1838 m 27 X s 2127 1896 m 27 X s 2127 1953 m 27 X s 2127 2010 m 27 X s 2101 2068 m 53 X s 6 lw 1 1 1 c 0 0 1 c 3 lw /w 46 def /w2 {w 2
 div} def /w3 {w 3 div} def 432 1688 1396 1759 2085 1804 3 { m22} R 6 lw black 1 1 1 c 0 0 1 c 3 lw 432 728 1396 657 2085 612 3 { m22} R 6 lw black 1 1 1 c 1 0 1 c 3 lw /w 30 def /w2 {w 2 div} def /w3 {w 3 div} def 432 1163 1396 1018 2085 1164 3 {
 m24} R 6 lw black 1 1 1 c 0 1 1 c 3 lw 432 1165 1396 1259 2085 1273 3 { m24} R 6 lw black 1 1 1 c 0.4 0.4 0.4 c 3 lw 432 1100 1396 1296 2085 1482 3 { m24} R 6 lw 1 0 0 c 0.95 0.95 0.95 c black 1 0 0 c 372 1781 m 878 X s 1250 1781 m 877 X s 2127 1781
 m 18 X s 0.95 0.95 0.95 c black 1 0 0 c 372 635 m 878 X s 1250 635 m 877 X s 2127 635 m 18 X s black
 gsave  2268 2176 0 0 C 669.375 1918.62 t 0 r /Helvetica findfont 102.732 sf 0 0 m 
 278 221 171 144 88 60
(= 7 TeV) K NC gr 
 gsave  2268 2176 0 0 C 619.875 1918.62 t 0 r /Helvetica findfont 102.732 sf 0 0 m (s) show NC gr  556 1975 m 41 -61 d s 0 lw 597 1914 m 12 91 d s 609 2005 m 61 X s
 gsave  2268 2176 0 0 C 2244.56 1351.69 t 90 r /Helvetica-BoldOblique findfont 60.8783 sf 0 0 m 
 672 642 608 575 558 510 453 436 395 355 338 297 250 202 186 142 125 81 37
(LHC HIGGS XS WG 2011) K NC gr  3 lw 1 1 1 c 886 281 1218 1861 bf black 1240 1861 m -16 Y 879 X 274 Y -15 X -258 Y f 1218 1861 m 281 Y 886 X -281 Y -886 X cl s
 gsave  2268 2176 0 0 C 1437.94 2082.25 t 0 r /Helvetica findfont 45.6587 sf 0 0 m (CT10 central value / Mid\255point) show NC gr  1 0 1 c 1328 2095 m24 black
 gsave  2268 2176 0 0 C 1437.94 1987.12 t 0 r /Helvetica findfont 45.6587 sf 0 0 m (MSTW central value / Mid\255point) show NC gr  0 1 1 c 1328 2001 m24 black
 gsave  2268 2176 0 0 C 1437.94 1895.81 t 0 r /Helvetica findfont 45.6587 sf 0 0 m (NNPDF central value / Mid\255point) show NC gr  0.4 0.4 0.4 c 1328 1908 m24
 gr  gr showpage
end
%%EOF
