%!PS-Adobe-1.0
%%Creator: Unified Graphics System
%%Pages: (atend)
%%DocumentFonts: Helvetica
%%BoundingBox:   48  236  464  568
%%EndComments
/Sw{setlinewidth}def
/Sg{setgray}def
/Sd{setdash}def
/P {newpath
    moveto
0 0 rlineto
    stroke}def
/M {moveto}def
/D {lineto}def
/N {newpath}def
/S {stroke}def
/T {/Helvetica findfont
    exch
    scalefont
    setfont}def
/R {rotate}def
/W {show}def
/F {fill}def
/X {gsave}def
/Y {grestore}def
%%EndProlog
%%Page: 1 1
0.12000 0.12000 scale
1 setlinecap
1 setlinejoin
6 Sw
0.00 0.00 0.00 setrgbcolor
[] 0 Sd
N
785 4685 M
785 2262 D
S
N
785 2262 M
3762 2262 D
S
N
3762 2262 M
3762 4685 D
S
N
3762 4685 M
785 4685 D
S
N
785 2262 M
3762 2262 D
S
N
785 2262 M
785 2366 D
S
N
1047 2296 M
1047 2262 D
S
N
1233 2262 M
1233 2296 D
S
N
1377 2366 M
1377 2262 D
S
N
1495 2262 M
1495 2296 D
S
N
1594 2296 M
1594 2262 D
S
N
1681 2262 M
1681 2296 D
S
N
1757 2296 M
1757 2262 D
S
N
1825 2262 M
1825 2366 D
S
N
2273 2366 M
2273 2262 D
S
N
2535 2262 M
2535 2296 D
S
N
2721 2296 M
2721 2262 D
S
N
2865 2262 M
2865 2366 D
S
N
2983 2296 M
2983 2262 D
S
N
3083 2262 M
3083 2296 D
S
N
3169 2296 M
3169 2262 D
S
N
3245 2262 M
3245 2296 D
S
N
3313 2366 M
3313 2262 D
S
N
767 2193 M
770 2190 D
767 2187 D
764 2190 D
764 2193 D
767 2199 D
770 2202 D
779 2205 D
790 2205 D
799 2202 D
802 2199 D
805 2193 D
805 2187 D
802 2182 D
793 2176 D
779 2170 D
773 2167 D
767 2161 D
764 2153 D
764 2144 D
S
N
790 2205 M
796 2202 D
799 2199 D
802 2193 D
802 2187 D
799 2182 D
790 2176 D
779 2170 D
S
N
764 2150 M
767 2153 D
773 2153 D
787 2147 D
796 2147 D
802 2150 D
805 2153 D
S
N
773 2153 M
787 2144 D
799 2144 D
802 2147 D
805 2153 D
805 2158 D
S
N
1362 2205 M
1357 2176 D
S
N
1357 2176 M
1362 2182 D
1371 2184 D
1380 2184 D
1388 2182 D
1394 2176 D
1397 2167 D
1397 2161 D
1394 2153 D
1388 2147 D
1380 2144 D
1371 2144 D
1362 2147 D
1360 2150 D
1357 2156 D
1357 2158 D
1360 2161 D
1362 2158 D
1360 2156 D
S
N
1380 2184 M
1386 2182 D
1391 2176 D
1394 2167 D
1394 2161 D
1391 2153 D
1386 2147 D
1380 2144 D
S
N
1362 2205 M
1391 2205 D
S
N
1362 2202 M
1377 2202 D
1391 2205 D
S
N
1785 2193 M
1790 2196 D
1799 2205 D
1799 2144 D
S
N
1796 2202 M
1796 2144 D
S
N
1785 2144 M
1811 2144 D
S
N
1851 2205 M
1842 2202 D
1837 2193 D
1834 2179 D
1834 2170 D
1837 2156 D
1842 2147 D
1851 2144 D
1857 2144 D
1865 2147 D
1871 2156 D
1874 2170 D
1874 2179 D
1871 2193 D
1865 2202 D
1857 2205 D
1851 2205 D
S
N
1851 2205 M
1845 2202 D
1842 2199 D
1839 2193 D
1837 2179 D
1837 2170 D
1839 2156 D
1842 2150 D
1845 2147 D
1851 2144 D
S
N
1857 2144 M
1863 2147 D
1865 2150 D
1868 2156 D
1871 2170 D
1871 2179 D
1868 2193 D
1865 2199 D
1863 2202 D
1857 2205 D
S
N
2227 2193 M
2230 2190 D
2227 2187 D
2224 2190 D
2224 2193 D
2227 2199 D
2230 2202 D
2238 2205 D
2250 2205 D
2259 2202 D
2262 2199 D
2264 2193 D
2264 2187 D
2262 2182 D
2253 2176 D
2238 2170 D
2233 2167 D
2227 2161 D
2224 2153 D
2224 2144 D
S
N
2250 2205 M
2256 2202 D
2259 2199 D
2262 2193 D
2262 2187 D
2259 2182 D
2250 2176 D
2238 2170 D
S
N
2224 2150 M
2227 2153 D
2233 2153 D
2247 2147 D
2256 2147 D
2262 2150 D
2264 2153 D
S
N
2233 2153 M
2247 2144 D
2259 2144 D
2262 2147 D
2264 2153 D
2264 2158 D
S
N
2299 2205 M
2290 2202 D
2285 2193 D
2282 2179 D
2282 2170 D
2285 2156 D
2290 2147 D
2299 2144 D
2305 2144 D
2314 2147 D
2319 2156 D
2322 2170 D
2322 2179 D
2319 2193 D
2314 2202 D
2305 2205 D
2299 2205 D
S
N
2299 2205 M
2293 2202 D
2290 2199 D
2288 2193 D
2285 2179 D
2285 2170 D
2288 2156 D
2290 2150 D
2293 2147 D
2299 2144 D
S
N
2305 2144 M
2311 2147 D
2314 2150 D
2316 2156 D
2319 2170 D
2319 2179 D
2316 2193 D
2314 2199 D
2311 2202 D
2305 2205 D
S
N
2822 2205 M
2816 2176 D
S
N
2816 2176 M
2822 2182 D
2831 2184 D
2839 2184 D
2848 2182 D
2854 2176 D
2857 2167 D
2857 2161 D
2854 2153 D
2848 2147 D
2839 2144 D
2831 2144 D
2822 2147 D
2819 2150 D
2816 2156 D
2816 2158 D
2819 2161 D
2822 2158 D
2819 2156 D
S
N
2839 2184 M
2845 2182 D
2851 2176 D
2854 2167 D
2854 2161 D
2851 2153 D
2845 2147 D
2839 2144 D
S
N
2822 2205 M
2851 2205 D
S
N
2822 2202 M
2837 2202 D
2851 2205 D
S
N
2891 2205 M
2883 2202 D
2877 2193 D
2874 2179 D
2874 2170 D
2877 2156 D
2883 2147 D
2891 2144 D
2897 2144 D
2906 2147 D
2912 2156 D
2915 2170 D
2915 2179 D
2912 2193 D
2906 2202 D
2897 2205 D
2891 2205 D
S
N
2891 2205 M
2886 2202 D
2883 2199 D
2880 2193 D
2877 2179 D
2877 2170 D
2880 2156 D
2883 2150 D
2886 2147 D
2891 2144 D
S
N
2897 2144 M
2903 2147 D
2906 2150 D
2909 2156 D
2912 2170 D
2912 2179 D
2909 2193 D
2906 2199 D
2903 2202 D
2897 2205 D
S
N
3244 2193 M
3250 2196 D
3259 2205 D
3259 2144 D
S
N
3256 2202 M
3256 2144 D
S
N
3244 2144 M
3270 2144 D
S
N
3311 2205 M
3302 2202 D
3296 2193 D
3293 2179 D
3293 2170 D
3296 2156 D
3302 2147 D
3311 2144 D
3316 2144 D
3325 2147 D
3331 2156 D
3334 2170 D
3334 2179 D
3331 2193 D
3325 2202 D
3316 2205 D
3311 2205 D
S
N
3311 2205 M
3305 2202 D
3302 2199 D
3299 2193 D
3296 2179 D
3296 2170 D
3299 2156 D
3302 2150 D
3305 2147 D
3311 2144 D
S
N
3316 2144 M
3322 2147 D
3325 2150 D
3328 2156 D
3331 2170 D
3331 2179 D
3328 2193 D
3325 2199 D
3322 2202 D
3316 2205 D
S
N
3368 2205 M
3360 2202 D
3354 2193 D
3351 2179 D
3351 2170 D
3354 2156 D
3360 2147 D
3368 2144 D
3374 2144 D
3383 2147 D
3389 2156 D
3391 2170 D
3391 2179 D
3389 2193 D
3383 2202 D
3374 2205 D
3368 2205 D
S
N
3368 2205 M
3363 2202 D
3360 2199 D
3357 2193 D
3354 2179 D
3354 2170 D
3357 2156 D
3360 2150 D
3363 2147 D
3368 2144 D
S
N
3374 2144 M
3380 2147 D
3383 2150 D
3386 2156 D
3389 2170 D
3389 2179 D
3386 2193 D
3383 2199 D
3380 2202 D
3374 2205 D
S
N
3687 2193 M
3689 2190 D
3687 2187 D
3684 2190 D
3684 2193 D
3687 2199 D
3689 2202 D
3698 2205 D
3710 2205 D
3718 2202 D
3721 2199 D
3724 2193 D
3724 2187 D
3721 2182 D
3713 2176 D
3698 2170 D
3692 2167 D
3687 2161 D
3684 2153 D
3684 2144 D
S
N
3710 2205 M
3715 2202 D
3718 2199 D
3721 2193 D
3721 2187 D
3718 2182 D
3710 2176 D
3698 2170 D
S
N
3684 2150 M
3687 2153 D
3692 2153 D
3707 2147 D
3715 2147 D
3721 2150 D
3724 2153 D
S
N
3692 2153 M
3707 2144 D
3718 2144 D
3721 2147 D
3724 2153 D
3724 2158 D
S
N
3759 2205 M
3750 2202 D
3744 2193 D
3741 2179 D
3741 2170 D
3744 2156 D
3750 2147 D
3759 2144 D
3764 2144 D
3773 2147 D
3779 2156 D
3782 2170 D
3782 2179 D
3779 2193 D
3773 2202 D
3764 2205 D
3759 2205 D
S
N
3759 2205 M
3753 2202 D
3750 2199 D
3747 2193 D
3744 2179 D
3744 2170 D
3747 2156 D
3750 2150 D
3753 2147 D
3759 2144 D
S
N
3764 2144 M
3770 2147 D
3773 2150 D
3776 2156 D
3779 2170 D
3779 2179 D
3776 2193 D
3773 2199 D
3770 2202 D
3764 2205 D
S
N
3816 2205 M
3808 2202 D
3802 2193 D
3799 2179 D
3799 2170 D
3802 2156 D
3808 2147 D
3816 2144 D
3822 2144 D
3831 2147 D
3837 2156 D
3840 2170 D
3840 2179 D
3837 2193 D
3831 2202 D
3822 2205 D
3816 2205 D
S
N
3816 2205 M
3811 2202 D
3808 2199 D
3805 2193 D
3802 2179 D
3802 2170 D
3805 2156 D
3808 2150 D
3811 2147 D
3816 2144 D
S
N
3822 2144 M
3828 2147 D
3831 2150 D
3834 2156 D
3837 2170 D
3837 2179 D
3834 2193 D
3831 2199 D
3828 2202 D
3822 2205 D
S
N
785 4685 M
3762 4685 D
S
N
785 4581 M
785 4685 D
S
N
1047 4685 M
1047 4650 D
S
N
1233 4650 M
1233 4685 D
S
N
1377 4685 M
1377 4581 D
S
N
1495 4650 M
1495 4685 D
S
N
1594 4685 M
1594 4650 D
S
N
1681 4650 M
1681 4685 D
S
N
1757 4685 M
1757 4650 D
S
N
1825 4581 M
1825 4685 D
S
N
2273 4685 M
2273 4581 D
S
N
2535 4650 M
2535 4685 D
S
N
2721 4685 M
2721 4650 D
S
N
2865 4581 M
2865 4685 D
S
N
2983 4685 M
2983 4650 D
S
N
3083 4650 M
3083 4685 D
S
N
3169 4685 M
3169 4650 D
S
N
3245 4650 M
3245 4685 D
S
N
3313 4685 M
3313 4581 D
S
N
785 2262 M
785 4685 D
S
N
785 2262 M
888 2262 D
S
N
819 2343 M
785 2343 D
S
N
785 2423 M
819 2423 D
S
N
819 2504 M
785 2504 D
S
N
785 2585 M
819 2585 D
S
N
888 2666 M
785 2666 D
S
N
785 2746 M
819 2746 D
S
N
819 2827 M
785 2827 D
S
N
785 2908 M
819 2908 D
S
N
819 2989 M
785 2989 D
S
N
785 3069 M
888 3069 D
S
N
819 3150 M
785 3150 D
S
N
785 3231 M
819 3231 D
S
N
819 3312 M
785 3312 D
S
N
785 3393 M
819 3393 D
S
N
888 3473 M
785 3473 D
S
N
785 3554 M
819 3554 D
S
N
819 3635 M
785 3635 D
S
N
785 3716 M
819 3716 D
S
N
819 3796 M
785 3796 D
S
N
785 3877 M
888 3877 D
S
N
819 3958 M
785 3958 D
S
N
785 4039 M
819 4039 D
S
N
819 4119 M
785 4119 D
S
N
785 4200 M
819 4200 D
S
N
888 4281 M
785 4281 D
S
N
785 4362 M
819 4362 D
S
N
819 4443 M
785 4443 D
S
N
785 4523 M
819 4523 D
S
N
819 4604 M
785 4604 D
S
N
785 4685 M
888 4685 D
S
N
542 2253 M
594 2253 D
S
N
632 2288 M
623 2285 D
617 2276 D
614 2262 D
614 2253 D
617 2239 D
623 2230 D
632 2227 D
638 2227 D
646 2230 D
652 2239 D
655 2253 D
655 2262 D
652 2276 D
646 2285 D
638 2288 D
632 2288 D
S
N
632 2288 M
626 2285 D
623 2282 D
620 2276 D
617 2262 D
617 2253 D
620 2239 D
623 2233 D
626 2230 D
632 2227 D
S
N
638 2227 M
643 2230 D
646 2233 D
649 2239 D
652 2253 D
652 2262 D
649 2276 D
646 2282 D
643 2285 D
638 2288 D
S
N
678 2233 M
675 2230 D
678 2227 D
681 2230 D
678 2233 D
S
N
736 2279 M
733 2276 D
736 2273 D
739 2276 D
739 2279 D
736 2285 D
730 2288 D
721 2288 D
713 2285 D
707 2279 D
704 2273 D
701 2262 D
701 2244 D
704 2236 D
710 2230 D
718 2227 D
724 2227 D
733 2230 D
739 2236 D
742 2244 D
742 2247 D
739 2256 D
733 2262 D
724 2265 D
721 2265 D
713 2262 D
707 2256 D
704 2247 D
S
N
721 2288 M
716 2285 D
710 2279 D
707 2273 D
704 2262 D
704 2244 D
707 2236 D
713 2230 D
718 2227 D
S
N
724 2227 M
730 2230 D
736 2236 D
739 2244 D
739 2247 D
736 2256 D
730 2262 D
724 2265 D
S
N
542 2657 M
594 2657 D
S
N
632 2692 M
623 2689 D
617 2680 D
614 2666 D
614 2657 D
617 2643 D
623 2634 D
632 2631 D
638 2631 D
646 2634 D
652 2643 D
655 2657 D
655 2666 D
652 2680 D
646 2689 D
638 2692 D
632 2692 D
S
N
632 2692 M
626 2689 D
623 2686 D
620 2680 D
617 2666 D
617 2657 D
620 2643 D
623 2637 D
626 2634 D
632 2631 D
S
N
638 2631 M
643 2634 D
646 2637 D
649 2643 D
652 2657 D
652 2666 D
649 2680 D
646 2686 D
643 2689 D
638 2692 D
S
N
678 2637 M
675 2634 D
678 2631 D
681 2634 D
678 2637 D
S
N
727 2686 M
727 2631 D
S
N
730 2692 M
730 2631 D
S
N
730 2692 M
698 2648 D
744 2648 D
S
N
718 2631 M
739 2631 D
S
N
542 3061 M
594 3061 D
S
N
632 3095 M
623 3093 D
617 3084 D
614 3069 D
614 3061 D
617 3046 D
623 3038 D
632 3035 D
638 3035 D
646 3038 D
652 3046 D
655 3061 D
655 3069 D
652 3084 D
646 3093 D
638 3095 D
632 3095 D
S
N
632 3095 M
626 3093 D
623 3090 D
620 3084 D
617 3069 D
617 3061 D
620 3046 D
623 3041 D
626 3038 D
632 3035 D
S
N
638 3035 M
643 3038 D
646 3041 D
649 3046 D
652 3061 D
652 3069 D
649 3084 D
646 3090 D
643 3093 D
638 3095 D
S
N
678 3041 M
675 3038 D
678 3035 D
681 3038 D
678 3041 D
S
N
704 3084 M
707 3081 D
704 3078 D
701 3081 D
701 3084 D
704 3090 D
707 3093 D
716 3095 D
727 3095 D
736 3093 D
739 3090 D
742 3084 D
742 3078 D
739 3072 D
730 3067 D
716 3061 D
710 3058 D
704 3052 D
701 3043 D
701 3035 D
S
N
727 3095 M
733 3093 D
736 3090 D
739 3084 D
739 3078 D
736 3072 D
727 3067 D
716 3061 D
S
N
701 3041 M
704 3043 D
710 3043 D
724 3038 D
733 3038 D
739 3041 D
742 3043 D
S
N
710 3043 M
724 3035 D
736 3035 D
739 3038 D
742 3043 D
742 3049 D
S
N
632 3499 M
623 3496 D
617 3488 D
614 3473 D
614 3465 D
617 3450 D
623 3442 D
632 3439 D
638 3439 D
646 3442 D
652 3450 D
655 3465 D
655 3473 D
652 3488 D
646 3496 D
638 3499 D
632 3499 D
S
N
632 3499 M
626 3496 D
623 3494 D
620 3488 D
617 3473 D
617 3465 D
620 3450 D
623 3444 D
626 3442 D
632 3439 D
S
N
638 3439 M
643 3442 D
646 3444 D
649 3450 D
652 3465 D
652 3473 D
649 3488 D
646 3494 D
643 3496 D
638 3499 D
S
N
678 3444 M
675 3442 D
678 3439 D
681 3442 D
678 3444 D
S
N
718 3499 M
710 3496 D
704 3488 D
701 3473 D
701 3465 D
704 3450 D
710 3442 D
718 3439 D
724 3439 D
733 3442 D
739 3450 D
741 3465 D
741 3473 D
739 3488 D
733 3496 D
724 3499 D
718 3499 D
S
N
718 3499 M
713 3496 D
710 3494 D
707 3488 D
704 3473 D
704 3465 D
707 3450 D
710 3444 D
713 3442 D
718 3439 D
S
N
724 3439 M
730 3442 D
733 3444 D
736 3450 D
739 3465 D
739 3473 D
736 3488 D
733 3494 D
730 3496 D
724 3499 D
S
N
632 3903 M
623 3900 D
617 3892 D
614 3877 D
614 3868 D
617 3854 D
623 3845 D
632 3843 D
638 3843 D
646 3845 D
652 3854 D
655 3868 D
655 3877 D
652 3892 D
646 3900 D
638 3903 D
632 3903 D
S
N
632 3903 M
626 3900 D
623 3897 D
620 3892 D
617 3877 D
617 3868 D
620 3854 D
623 3848 D
626 3845 D
632 3843 D
S
N
638 3843 M
643 3845 D
646 3848 D
649 3854 D
652 3868 D
652 3877 D
649 3892 D
646 3897 D
643 3900 D
638 3903 D
S
N
678 3848 M
675 3845 D
678 3843 D
681 3845 D
678 3848 D
S
N
704 3892 M
707 3889 D
704 3886 D
701 3889 D
701 3892 D
704 3897 D
707 3900 D
716 3903 D
727 3903 D
736 3900 D
739 3897 D
741 3892 D
741 3886 D
739 3880 D
730 3874 D
716 3868 D
710 3866 D
704 3860 D
701 3851 D
701 3843 D
S
N
727 3903 M
733 3900 D
736 3897 D
739 3892 D
739 3886 D
736 3880 D
727 3874 D
716 3868 D
S
N
701 3848 M
704 3851 D
710 3851 D
724 3845 D
733 3845 D
739 3848 D
741 3851 D
S
N
710 3851 M
724 3843 D
736 3843 D
739 3845 D
741 3851 D
741 3857 D
S
N
632 4307 M
623 4304 D
617 4295 D
614 4281 D
614 4272 D
617 4258 D
623 4249 D
632 4246 D
638 4246 D
646 4249 D
652 4258 D
655 4272 D
655 4281 D
652 4295 D
646 4304 D
638 4307 D
632 4307 D
S
N
632 4307 M
626 4304 D
623 4301 D
620 4295 D
617 4281 D
617 4272 D
620 4258 D
623 4252 D
626 4249 D
632 4246 D
S
N
638 4246 M
643 4249 D
646 4252 D
649 4258 D
652 4272 D
652 4281 D
649 4295 D
646 4301 D
643 4304 D
638 4307 D
S
N
678 4252 M
675 4249 D
678 4246 D
681 4249 D
678 4252 D
S
N
727 4301 M
727 4246 D
S
N
730 4307 M
730 4246 D
S
N
730 4307 M
698 4264 D
744 4264 D
S
N
718 4246 M
739 4246 D
S
N
632 4711 M
623 4708 D
617 4699 D
614 4685 D
614 4676 D
617 4662 D
623 4653 D
632 4650 D
638 4650 D
646 4653 D
652 4662 D
655 4676 D
655 4685 D
652 4699 D
646 4708 D
638 4711 D
632 4711 D
S
N
632 4711 M
626 4708 D
623 4705 D
620 4699 D
617 4685 D
617 4676 D
620 4662 D
623 4656 D
626 4653 D
632 4650 D
S
N
638 4650 M
643 4653 D
646 4656 D
649 4662 D
652 4676 D
652 4685 D
649 4699 D
646 4705 D
643 4708 D
638 4711 D
S
N
678 4656 M
675 4653 D
678 4650 D
681 4653 D
678 4656 D
S
N
736 4702 M
733 4699 D
736 4696 D
739 4699 D
739 4702 D
736 4708 D
730 4711 D
721 4711 D
713 4708 D
707 4702 D
704 4696 D
701 4685 D
701 4668 D
704 4659 D
710 4653 D
718 4650 D
724 4650 D
733 4653 D
739 4659 D
741 4668 D
741 4670 D
739 4679 D
733 4685 D
724 4688 D
721 4688 D
713 4685 D
707 4679 D
704 4670 D
S
N
721 4711 M
716 4708 D
710 4702 D
707 4696 D
704 4685 D
704 4668 D
707 4659 D
713 4653 D
718 4650 D
S
N
724 4650 M
730 4653 D
736 4659 D
739 4668 D
739 4670 D
736 4679 D
730 4685 D
724 4688 D
S
N
3658 2262 M
3762 2262 D
S
N
3762 2343 M
3727 2343 D
S
N
3727 2423 M
3762 2423 D
S
N
3762 2504 M
3727 2504 D
S
N
3727 2585 M
3762 2585 D
S
N
3762 2666 M
3658 2666 D
S
N
3727 2746 M
3762 2746 D
S
N
3762 2827 M
3727 2827 D
S
N
3727 2908 M
3762 2908 D
S
N
3762 2989 M
3727 2989 D
S
N
3658 3069 M
3762 3069 D
S
N
3762 3150 M
3727 3150 D
S
N
3727 3231 M
3762 3231 D
S
N
3762 3312 M
3727 3312 D
S
N
3727 3393 M
3762 3393 D
S
N
3762 3473 M
3658 3473 D
S
N
3727 3554 M
3762 3554 D
S
N
3762 3635 M
3727 3635 D
S
N
3727 3716 M
3762 3716 D
S
N
3762 3796 M
3727 3796 D
S
N
3658 3877 M
3762 3877 D
S
N
3762 3958 M
3727 3958 D
S
N
3727 4039 M
3762 4039 D
S
N
3762 4119 M
3727 4119 D
S
N
3727 4200 M
3762 4200 D
S
N
3762 4281 M
3658 4281 D
S
N
3727 4362 M
3762 4362 D
S
N
3762 4443 M
3727 4443 D
S
N
3727 4523 M
3762 4523 D
S
N
3762 4604 M
3727 4604 D
S
N
3658 4685 M
3762 4685 D
S
N
2082 2060 M
2082 1999 D
S
N
2085 2060 M
2085 1999 D
S
N
2085 2051 M
2091 2057 D
2097 2060 D
2102 2060 D
2111 2057 D
2117 2051 D
2120 2043 D
2120 2037 D
2117 2028 D
2111 2022 D
2102 2019 D
2097 2019 D
2091 2022 D
2085 2028 D
S
N
2102 2060 M
2108 2057 D
2114 2051 D
2117 2043 D
2117 2037 D
2114 2028 D
2108 2022 D
2102 2019 D
S
N
2074 2060 M
2085 2060 D
S
N
2074 1999 M
2094 1999 D
S
N
2150 2037 M
2150 1996 D
S
N
2151 2037 M
2151 1996 D
S
N
2138 2037 M
2136 2025 D
2136 2037 D
2165 2037 D
2165 2025 D
2163 2037 D
S
N
2144 1996 M
2157 1996 D
S
N
2251 2092 M
2245 2086 D
2239 2077 D
2233 2066 D
2230 2051 D
2230 2040 D
2233 2025 D
2239 2014 D
2245 2005 D
2251 1999 D
S
N
2245 2086 M
2239 2074 D
2236 2066 D
2233 2051 D
2233 2040 D
2236 2025 D
2239 2017 D
2245 2005 D
S
N
2308 2071 M
2311 2063 D
2311 2080 D
2308 2071 D
2303 2077 D
2294 2080 D
2288 2080 D
2280 2077 D
2274 2071 D
2271 2066 D
2268 2057 D
2268 2043 D
2271 2034 D
2274 2028 D
2280 2022 D
2288 2019 D
2294 2019 D
2303 2022 D
2308 2028 D
S
N
2288 2080 M
2282 2077 D
2277 2071 D
2274 2066 D
2271 2057 D
2271 2043 D
2274 2034 D
2277 2028 D
2282 2022 D
2288 2019 D
S
N
2308 2043 M
2308 2019 D
S
N
2311 2043 M
2311 2019 D
S
N
2300 2043 M
2320 2043 D
S
N
2337 2043 M
2372 2043 D
2372 2048 D
2369 2054 D
2366 2057 D
2360 2060 D
2352 2060 D
2343 2057 D
2337 2051 D
2334 2043 D
2334 2037 D
2337 2028 D
2343 2022 D
2352 2019 D
2357 2019 D
2366 2022 D
2372 2028 D
S
N
2369 2043 M
2369 2051 D
2366 2057 D
S
N
2352 2060 M
2346 2057 D
2340 2051 D
2337 2043 D
2337 2037 D
2340 2028 D
2346 2022 D
2352 2019 D
S
N
2389 2080 M
2409 2019 D
S
N
2392 2080 M
2409 2028 D
S
N
2430 2080 M
2409 2019 D
S
N
2383 2080 M
2401 2080 D
S
N
2418 2080 M
2435 2080 D
S
N
2447 2092 M
2453 2086 D
2459 2077 D
2464 2066 D
2467 2051 D
2467 2040 D
2464 2025 D
2459 2014 D
2453 2005 D
2447 1999 D
S
N
2453 2086 M
2459 2074 D
2461 2066 D
2464 2051 D
2464 2040 D
2461 2025 D
2459 2017 D
2453 2005 D
S
N
436 3124 M
441 3118 D
450 3113 D
462 3107 D
476 3104 D
488 3104 D
502 3107 D
514 3113 D
522 3118 D
528 3124 D
S
N
441 3118 M
453 3113 D
462 3110 D
476 3107 D
488 3107 D
502 3110 D
511 3113 D
522 3118 D
S
N
447 3142 M
508 3179 D
S
N
447 3144 M
508 3182 D
S
N
447 3182 M
508 3142 D
S
N
447 3136 M
447 3153 D
S
N
447 3170 M
447 3188 D
S
N
508 3136 M
508 3153 D
S
N
508 3170 M
508 3188 D
S
N
482 3248 M
482 3300 D
S
N
447 3367 M
508 3404 D
S
N
447 3370 M
508 3407 D
S
N
447 3407 M
508 3367 D
S
N
447 3361 M
447 3378 D
S
N
447 3396 M
447 3413 D
S
N
508 3361 M
508 3378 D
S
N
508 3396 M
508 3413 D
S
N
496 3452 M
502 3454 D
490 3454 D
496 3452 D
492 3449 D
490 3443 D
490 3439 D
492 3433 D
496 3429 D
500 3427 D
506 3426 D
515 3426 D
521 3427 D
525 3429 D
529 3433 D
531 3439 D
531 3443 D
529 3449 D
525 3452 D
521 3454 D
S
N
490 3439 M
492 3435 D
496 3431 D
500 3429 D
506 3427 D
515 3427 D
521 3429 D
525 3431 D
529 3435 D
531 3439 D
S
N
436 3473 M
441 3478 D
450 3484 D
462 3490 D
476 3493 D
488 3493 D
502 3490 D
514 3484 D
522 3478 D
528 3473 D
S
N
441 3478 M
453 3484 D
462 3487 D
476 3490 D
488 3490 D
502 3487 D
511 3484 D
522 3478 D
S
N
436 3562 M
528 3510 D
S
N
447 3577 M
508 3614 D
S
N
447 3580 M
508 3617 D
S
N
447 3617 M
508 3577 D
S
N
447 3571 M
447 3588 D
S
N
447 3606 M
447 3623 D
S
N
508 3571 M
508 3588 D
S
N
508 3606 M
508 3623 D
S
N
496 3662 M
502 3664 D
490 3664 D
496 3662 D
492 3658 D
490 3653 D
490 3649 D
492 3643 D
496 3639 D
500 3637 D
506 3635 D
515 3635 D
521 3637 D
525 3639 D
529 3643 D
531 3649 D
531 3653 D
529 3658 D
525 3662 D
521 3664 D
S
N
490 3649 M
492 3645 D
496 3641 D
500 3639 D
506 3637 D
515 3637 D
521 3639 D
525 3641 D
529 3645 D
531 3649 D
S
N
3834 3870 M
3834 3896 D
3824 3899 D
3834 3894 D
S
N
3834 3877 M
3798 3887 D
S
N
3798 3885 M
3834 3875 D
S
N
3798 3892 M
3798 3880 D
S
N
3834 3908 M
3834 3920 D
S
N
3834 3915 M
3798 3925 D
S
N
3798 3923 M
3834 3913 D
S
N
3834 3930 M
3834 3942 D
S
N
3834 3937 M
3798 3947 D
S
N
3798 3946 M
3834 3935 D
S
N
3815 3940 M
3815 3920 D
S
N
3798 3930 M
3798 3918 D
S
N
3798 3940 M
3798 3953 D
S
N
3826 3989 M
3829 3987 D
3832 3984 D
3834 3980 D
3834 3975 D
3832 3971 D
3831 3970 D
3826 3968 D
3820 3968 D
3813 3970 D
3808 3971 D
3803 3975 D
3800 3978 D
3798 3982 D
3800 3977 D
3803 3973 D
3808 3970 D
3813 3968 D
3820 3966 D
3826 3966 D
3831 3968 D
3832 3970 D
3834 3975 D
S
N
3798 3982 M
3798 3987 D
3800 3990 D
3801 3992 D
3801 3994 D
3798 3996 D
3808 3994 D
3805 3994 D
3801 3992 D
S
N
3834 4032 M
3834 4044 D
S
N
3834 4039 M
3798 4049 D
S
N
3798 4047 M
3834 4037 D
S
N
3834 4054 M
3834 4066 D
S
N
3834 4061 M
3798 4072 D
S
N
3798 4070 M
3834 4059 D
S
N
3815 4065 M
3815 4044 D
S
N
3798 4054 M
3798 4042 D
S
N
3798 4065 M
3798 4077 D
S
N
3834 4085 M
3834 4097 D
S
N
3834 4092 M
3798 4103 D
S
N
3798 4101 M
3834 4091 D
S
N
3798 4108 M
3798 4096 D
S
N
3822 4139 M
3822 4151 D
S
N
3822 4146 M
3829 4142 D
3832 4139 D
3834 4134 D
3832 4137 D
3829 4141 D
3822 4144 D
S
N
3834 4134 M
3834 4130 D
3832 4127 D
3831 4125 D
3826 4123 D
3820 4123 D
3813 4125 D
3808 4127 D
3803 4130 D
3800 4134 D
3798 4137 D
3800 4132 D
3803 4128 D
3808 4125 D
3813 4123 D
3820 4122 D
3826 4122 D
3831 4123 D
3832 4125 D
3834 4130 D
S
N
3798 4137 M
3798 4142 D
3800 4146 D
3801 4147 D
3801 4149 D
3798 4151 D
3808 4149 D
3805 4149 D
3801 4147 D
S
N
3822 4182 M
3822 4194 D
S
N
3822 4189 M
3829 4185 D
3832 4182 D
3834 4177 D
3832 4180 D
3829 4184 D
3822 4187 D
S
N
3834 4177 M
3834 4173 D
3832 4170 D
3831 4168 D
3826 4166 D
3820 4166 D
3813 4168 D
3808 4170 D
3803 4173 D
3800 4177 D
3798 4180 D
3800 4175 D
3803 4172 D
3808 4168 D
3813 4166 D
3820 4165 D
3826 4165 D
3831 4166 D
3832 4168 D
3834 4173 D
S
N
3798 4180 M
3798 4185 D
3800 4189 D
3801 4191 D
3801 4192 D
3798 4194 D
3808 4192 D
3805 4192 D
3801 4191 D
S
N
3834 4206 M
3831 4208 D
3831 4210 D
3832 4211 D
3834 4216 D
3834 4223 D
3832 4229 D
3831 4230 D
3827 4232 D
3822 4232 D
3819 4229 D
3812 4216 D
3810 4215 D
3807 4213 D
3810 4216 D
3817 4229 D
3819 4230 D
3822 4232 D
S
N
3807 4213 M
3803 4213 D
3800 4216 D
3798 4222 D
3798 4229 D
3800 4234 D
3801 4235 D
3801 4237 D
3798 4239 D
3808 4237 D
3805 4237 D
3801 4235 D
S
N
3831 4210 M
3827 4208 D
3824 4208 D
3834 4206 D
S
N
3834 4273 M
3834 4284 D
S
N
3834 4277 M
3798 4311 D
S
N
3798 4315 M
3798 4304 D
S
N
3798 4294 M
3798 4284 D
S
N
3798 4287 M
3834 4299 D
S
N
3834 4301 M
3798 4289 D
S
N
3834 4304 M
3834 4294 D
S
N
3834 4327 M
3831 4329 D
3831 4330 D
3832 4332 D
3834 4337 D
3834 4344 D
3832 4349 D
3831 4351 D
3827 4353 D
3822 4353 D
3819 4349 D
3812 4337 D
3810 4335 D
3807 4334 D
3810 4337 D
3817 4349 D
3819 4351 D
3822 4353 D
S
N
3807 4334 M
3803 4334 D
3800 4337 D
3798 4342 D
3798 4349 D
3800 4354 D
3801 4356 D
3801 4358 D
3798 4360 D
3808 4358 D
3805 4358 D
3801 4356 D
S
N
3831 4330 M
3827 4329 D
3824 4329 D
3834 4327 D
S
N
3831 4408 M
3798 4411 D
S
N
3798 4410 M
3834 4406 D
3798 4423 D
3834 4420 D
3798 4437 D
S
N
3798 4442 M
3798 4432 D
S
N
3798 4425 M
3831 4422 D
S
N
3798 4417 M
3798 4404 D
S
N
3822 4473 M
3822 4486 D
S
N
3822 4480 M
3829 4477 D
3832 4473 D
3834 4468 D
3832 4472 D
3829 4475 D
3822 4479 D
S
N
3834 4468 M
3834 4465 D
3832 4461 D
3831 4460 D
3826 4458 D
3820 4458 D
3813 4460 D
3808 4461 D
3803 4465 D
3800 4468 D
3798 4472 D
3800 4467 D
3803 4463 D
3808 4460 D
3813 4458 D
3820 4456 D
3826 4456 D
3831 4458 D
3832 4460 D
3834 4465 D
S
N
3798 4472 M
3798 4477 D
3800 4480 D
3801 4482 D
3801 4484 D
3798 4486 D
3808 4484 D
3805 4484 D
3801 4482 D
S
N
3834 4523 M
3827 4527 D
3824 4530 D
3820 4536 D
3813 4546 D
3810 4549 D
3807 4551 D
3803 4551 D
3800 4549 D
3798 4546 D
3800 4551 D
3803 4553 D
3807 4553 D
3810 4551 D
3813 4548 D
3817 4542 D
3820 4536 D
S
N
3831 4525 M
3829 4527 D
3829 4530 D
3834 4539 D
3834 4544 D
3832 4548 D
3827 4549 D
3831 4548 D
3832 4544 D
3832 4539 D
3829 4530 D
S
N
3805 4534 M
3807 4536 D
3808 4534 D
3807 4532 D
3805 4532 D
3801 4534 D
3800 4536 D
3798 4541 D
3798 4546 D
S
N
3826 4567 M
3831 4568 D
3832 4570 D
3834 4574 D
3831 4570 D
3826 4568 D
3820 4568 D
3813 4570 D
3808 4572 D
3803 4575 D
3800 4579 D
3798 4582 D
3798 4586 D
3801 4589 D
3807 4591 D
3812 4591 D
3819 4589 D
3824 4587 D
3829 4584 D
3832 4580 D
3834 4577 D
3834 4574 D
S
N
3834 4577 M
3832 4582 D
3829 4586 D
3824 4589 D
3819 4591 D
3812 4592 D
3807 4592 D
3801 4591 D
3800 4589 D
3798 4586 D
S
N
3798 4582 M
3800 4577 D
3803 4574 D
3808 4570 D
3813 4568 D
3820 4567 D
3826 4567 D
S
N
3834 4613 M
3805 4622 D
S
N
3803 4624 M
3807 4617 D
3808 4611 D
3807 4615 D
3803 4620 D
3798 4625 D
3834 4615 D
S
N
3834 4646 M
3805 4655 D
S
N
3803 4656 M
3807 4649 D
3808 4644 D
3807 4648 D
3803 4653 D
3798 4658 D
3834 4648 D
S
N
785 3473 M
3762 3473 D
S
0.00 0.00 1.00 setrgbcolor
N
785 3549 M
1047 3588 D
1233 3605 D
1377 3602 D
1495 3593 D
1594 3586 D
1681 3584 D
1757 3582 D
1825 3580 D
1887 3577 D
1943 3578 D
1995 3579 D
2043 3579 D
2087 3579 D
2129 3579 D
2168 3579 D
2205 3579 D
2240 3579 D
2273 3579 D
2305 3579 D
2335 3578 D
2363 3578 D
2391 3578 D
2417 3577 D
2443 3576 D
2467 3576 D
2491 3575 D
2513 3575 D
2535 3575 D
2556 3574 D
2577 3574 D
2597 3573 D
2616 3573 D
2635 3572 D
2653 3571 D
2671 3570 D
2688 3569 D
2705 3568 D
2721 3567 D
2737 3566 D
2753 3564 D
2768 3563 D
2783 3561 D
2797 3559 D
2811 3558 D
2825 3556 D
2839 3554 D
2852 3552 D
2865 3549 D
2878 3547 D
2891 3545 D
2903 3542 D
2915 3540 D
2927 3537 D
2939 3534 D
2950 3531 D
2961 3528 D
2972 3525 D
2983 3526 D
2994 3529 D
3004 3531 D
3015 3533 D
3025 3535 D
3035 3538 D
3045 3540 D
3055 3542 D
3064 3545 D
3074 3547 D
3083 3549 D
3092 3552 D
3101 3554 D
3110 3556 D
3119 3559 D
3128 3561 D
3136 3563 D
3145 3566 D
3153 3568 D
3161 3570 D
3169 3573 D
3177 3575 D
3185 3577 D
3193 3580 D
3201 3582 D
3208 3584 D
3216 3587 D
3223 3589 D
3231 3591 D
3238 3594 D
3245 3596 D
3253 3598 D
3260 3601 D
3267 3603 D
3273 3605 D
3280 3608 D
3287 3610 D
3294 3612 D
3300 3615 D
3307 3617 D
3313 3619 D
3320 3622 D
3326 3624 D
3333 3626 D
3339 3629 D
3345 3631 D
3351 3633 D
3357 3636 D
3363 3638 D
3369 3640 D
3375 3643 D
3381 3645 D
3387 3647 D
3392 3652 D
3398 3657 D
3404 3662 D
3409 3667 D
3415 3672 D
3420 3677 D
3426 3682 D
3431 3688 D
3437 3693 D
3442 3698 D
3447 3703 D
3453 3708 D
3458 3714 D
3463 3719 D
3468 3724 D
3473 3730 D
3478 3735 D
3483 3740 D
3488 3746 D
3493 3751 D
3498 3756 D
3503 3762 D
3507 3767 D
3512 3772 D
3517 3778 D
3522 3783 D
3526 3788 D
3531 3794 D
3536 3799 D
3540 3804 D
3545 3810 D
3549 3815 D
3554 3820 D
3558 3825 D
3563 3831 D
3567 3836 D
3571 3841 D
3576 3847 D
3580 3852 D
3584 3857 D
3588 3862 D
3593 3867 D
3597 3873 D
3601 3878 D
3605 3883 D
3609 3888 D
3613 3893 D
3617 3898 D
3621 3903 D
3625 3908 D
3629 3913 D
3633 3918 D
3637 3923 D
3641 3928 D
3645 3933 D
3649 3938 D
3653 3943 D
3656 3948 D
3660 3953 D
3664 3958 D
3668 3962 D
3672 3967 D
3675 3972 D
3679 3976 D
3683 3981 D
3686 3986 D
3690 3990 D
3693 3995 D
3697 3999 D
3701 4004 D
3704 4008 D
3708 4012 D
3711 4017 D
3715 4021 D
3718 4025 D
3722 4030 D
3725 4034 D
3728 4038 D
3732 4042 D
3735 4046 D
3739 4050 D
3742 4054 D
3745 4058 D
3748 4062 D
3752 4066 D
3755 4069 D
S
N
3755 4069 M
3758 4073 D
3762 4077 D
S
N
785 3289 M
1047 3340 D
1233 3361 D
1377 3374 D
1495 3385 D
1594 3394 D
1681 3400 D
1757 3406 D
1825 3410 D
1887 3415 D
1943 3418 D
1995 3422 D
2043 3425 D
2087 3428 D
2129 3430 D
2168 3433 D
2205 3436 D
2240 3438 D
2273 3440 D
2305 3439 D
2335 3438 D
2363 3436 D
2391 3434 D
2417 3433 D
2443 3431 D
2467 3430 D
2491 3429 D
2513 3428 D
2535 3427 D
2556 3426 D
2577 3425 D
2597 3424 D
2616 3424 D
2635 3424 D
2653 3423 D
2671 3423 D
2688 3423 D
2705 3423 D
2721 3423 D
2737 3423 D
2753 3424 D
2768 3424 D
2783 3425 D
2797 3425 D
2811 3426 D
2825 3427 D
2839 3428 D
2852 3429 D
2865 3430 D
2878 3432 D
2891 3433 D
2903 3434 D
2915 3436 D
2927 3436 D
2939 3436 D
2950 3435 D
2961 3435 D
2972 3434 D
2983 3433 D
2994 3433 D
3004 3432 D
3015 3432 D
3025 3431 D
3035 3430 D
3045 3430 D
3055 3429 D
3064 3428 D
3074 3428 D
3083 3427 D
3092 3426 D
3101 3422 D
3110 3418 D
3119 3414 D
3128 3410 D
3136 3406 D
3145 3402 D
3153 3398 D
3161 3393 D
3169 3389 D
3177 3384 D
3185 3380 D
3193 3375 D
3201 3370 D
3208 3366 D
3216 3361 D
3223 3356 D
3231 3351 D
3238 3345 D
3245 3340 D
3253 3335 D
3260 3329 D
3267 3323 D
3273 3316 D
3280 3308 D
3287 3300 D
3294 3292 D
3300 3284 D
3307 3276 D
3313 3267 D
3320 3259 D
3326 3250 D
3333 3241 D
3339 3232 D
3345 3223 D
3351 3214 D
3357 3204 D
3363 3195 D
3369 3185 D
3375 3175 D
3381 3165 D
3387 3155 D
3392 3145 D
3398 3134 D
3404 3124 D
3409 3113 D
3415 3102 D
3420 3091 D
3426 3080 D
3431 3069 D
3437 3057 D
3442 3046 D
3447 3034 D
3453 3022 D
3458 3010 D
3463 2998 D
3468 2985 D
3473 2973 D
3478 2960 D
3483 2947 D
3488 2934 D
3493 2921 D
3498 2908 D
3503 2895 D
3507 2881 D
3512 2867 D
3517 2854 D
3522 2840 D
3526 2825 D
3531 2811 D
3536 2797 D
3540 2782 D
3545 2767 D
3549 2753 D
3554 2737 D
3558 2722 D
3563 2707 D
3567 2691 D
3571 2676 D
3576 2660 D
3580 2644 D
3584 2628 D
3588 2612 D
3593 2596 D
3597 2579 D
3601 2562 D
3605 2546 D
3609 2529 D
3613 2512 D
3617 2494 D
3621 2477 D
3625 2460 D
3629 2442 D
3633 2424 D
3637 2406 D
3641 2388 D
3645 2370 D
3649 2352 D
3653 2334 D
3656 2315 D
3660 2296 D
3664 2277 D
3667 2262 D
S
1.00 0.00 0.00 setrgbcolor
[39] 0 Sd
N
785 3351 M
1047 3374 D
1233 3396 D
1377 3416 D
1495 3433 D
1594 3447 D
1681 3458 D
1757 3466 D
1825 3473 D
1887 3477 D
1943 3481 D
1995 3483 D
2043 3485 D
2087 3486 D
2129 3487 D
2168 3487 D
2205 3488 D
2240 3488 D
2273 3488 D
2305 3488 D
2335 3488 D
2363 3487 D
2391 3487 D
2417 3487 D
2443 3487 D
2467 3486 D
2491 3486 D
2513 3486 D
2535 3486 D
2556 3485 D
2577 3485 D
2597 3485 D
2616 3484 D
2635 3484 D
2653 3484 D
2671 3484 D
2688 3483 D
2705 3483 D
2721 3483 D
2737 3483 D
2753 3482 D
2768 3482 D
2783 3482 D
2797 3482 D
2811 3482 D
2825 3481 D
2839 3481 D
2852 3481 D
2865 3481 D
2878 3481 D
2891 3480 D
2903 3480 D
2915 3480 D
2927 3480 D
2939 3480 D
2950 3480 D
2961 3480 D
2972 3479 D
2983 3479 D
2994 3479 D
3004 3479 D
3015 3479 D
3025 3479 D
3035 3479 D
3045 3479 D
3055 3479 D
3064 3478 D
3074 3478 D
3083 3478 D
3092 3478 D
3101 3478 D
3110 3478 D
3119 3478 D
3128 3478 D
3136 3478 D
3145 3478 D
3153 3478 D
3161 3477 D
3169 3477 D
3177 3477 D
3185 3477 D
3193 3477 D
3201 3477 D
3208 3477 D
3216 3477 D
3223 3477 D
3231 3477 D
3238 3477 D
3245 3477 D
3253 3477 D
3260 3477 D
3267 3476 D
3273 3476 D
3280 3476 D
3287 3476 D
3294 3476 D
3300 3476 D
3307 3476 D
3313 3476 D
3320 3476 D
3326 3476 D
3333 3476 D
3339 3476 D
3345 3476 D
3351 3476 D
3357 3476 D
3363 3476 D
3369 3476 D
3375 3476 D
3381 3476 D
3387 3476 D
3392 3476 D
3398 3476 D
3404 3475 D
3409 3475 D
3415 3475 D
3420 3475 D
3426 3475 D
3431 3475 D
3437 3475 D
3442 3475 D
3447 3475 D
3453 3475 D
3458 3475 D
3463 3475 D
3468 3475 D
3473 3475 D
3478 3475 D
3483 3475 D
3488 3475 D
3493 3475 D
3498 3475 D
3503 3475 D
3507 3475 D
3512 3475 D
3517 3475 D
3522 3475 D
3526 3475 D
3531 3475 D
3536 3475 D
3540 3475 D
3545 3475 D
3549 3475 D
3554 3475 D
3558 3474 D
3563 3474 D
3567 3474 D
3571 3474 D
3576 3474 D
3580 3474 D
3584 3474 D
3588 3474 D
3593 3474 D
3597 3474 D
3601 3474 D
3605 3474 D
3609 3474 D
3613 3474 D
3617 3474 D
3621 3474 D
3625 3474 D
3629 3474 D
3633 3474 D
3637 3474 D
3641 3474 D
3645 3474 D
3649 3474 D
3653 3474 D
3656 3474 D
3660 3474 D
3664 3474 D
3668 3474 D
3672 3474 D
3675 3474 D
3679 3474 D
3683 3474 D
3686 3474 D
3690 3474 D
3693 3474 D
3697 3474 D
3701 3474 D
3704 3474 D
3708 3474 D
3711 3474 D
3715 3474 D
3718 3474 D
3722 3474 D
3725 3474 D
3728 3474 D
3732 3474 D
3735 3474 D
3739 3474 D
3742 3474 D
3745 3474 D
3748 3474 D
3752 3474 D
3755 3473 D
3758 3473 D
3762 3473 D
S
N
785 3141 M
1047 3190 D
1233 3237 D
1377 3284 D
1495 3329 D
1594 3370 D
1681 3404 D
1757 3433 D
1825 3456 D
1887 3475 D
1943 3488 D
1995 3499 D
2043 3507 D
2087 3512 D
2129 3516 D
2168 3519 D
2205 3520 D
2240 3521 D
2273 3522 D
2305 3522 D
2335 3522 D
2363 3521 D
2391 3521 D
2417 3520 D
2443 3519 D
2467 3518 D
2491 3517 D
2513 3516 D
2535 3515 D
2556 3514 D
2577 3513 D
2597 3512 D
2616 3511 D
2635 3510 D
2653 3509 D
2671 3508 D
2688 3507 D
2705 3507 D
2721 3506 D
2737 3505 D
2753 3504 D
2768 3503 D
2783 3503 D
2797 3502 D
2811 3501 D
2825 3501 D
2839 3500 D
2852 3499 D
2865 3499 D
2878 3498 D
2891 3498 D
2903 3497 D
2915 3497 D
2927 3496 D
2939 3496 D
2950 3495 D
2961 3495 D
2972 3494 D
2983 3494 D
2994 3493 D
3004 3493 D
3015 3493 D
3025 3492 D
3035 3492 D
3045 3491 D
3055 3491 D
3064 3491 D
3074 3490 D
3083 3490 D
3092 3490 D
3101 3489 D
3110 3489 D
3119 3489 D
3128 3488 D
3136 3488 D
3145 3488 D
3153 3488 D
3161 3487 D
3169 3487 D
3177 3487 D
3185 3487 D
3193 3486 D
3201 3486 D
3208 3486 D
3216 3486 D
3223 3485 D
3231 3485 D
3238 3485 D
3245 3485 D
3253 3485 D
3260 3484 D
3267 3484 D
3273 3484 D
3280 3484 D
3287 3484 D
3294 3483 D
3300 3483 D
3307 3483 D
3313 3483 D
3320 3483 D
3326 3483 D
3333 3482 D
3339 3482 D
3345 3482 D
3351 3482 D
3357 3482 D
3363 3482 D
3369 3481 D
3375 3481 D
S
N
3375 3481 M
3381 3481 D
3387 3481 D
3392 3481 D
3398 3481 D
3404 3481 D
3409 3480 D
3415 3480 D
3420 3480 D
3426 3480 D
3431 3480 D
3437 3480 D
3442 3480 D
3447 3480 D
3453 3480 D
3458 3479 D
3463 3479 D
3468 3479 D
3473 3479 D
3478 3479 D
3483 3479 D
3488 3479 D
3493 3479 D
3498 3479 D
3503 3478 D
3507 3478 D
3512 3478 D
3517 3478 D
3522 3478 D
3526 3478 D
3531 3478 D
3536 3478 D
3540 3478 D
3545 3478 D
3549 3478 D
3554 3477 D
3558 3477 D
3563 3477 D
3567 3477 D
3571 3477 D
3576 3477 D
3580 3477 D
3584 3477 D
3588 3477 D
3593 3477 D
3597 3477 D
3601 3477 D
3605 3476 D
3609 3476 D
3613 3476 D
3617 3476 D
3621 3476 D
3625 3476 D
3629 3476 D
3633 3476 D
3637 3476 D
3641 3476 D
3645 3476 D
3649 3476 D
3653 3476 D
3656 3476 D
3660 3475 D
3664 3475 D
3668 3475 D
3672 3475 D
3675 3475 D
3679 3475 D
3683 3475 D
3686 3475 D
3690 3475 D
3693 3475 D
3697 3475 D
3701 3475 D
3704 3475 D
3708 3475 D
3711 3475 D
3715 3475 D
3718 3475 D
3722 3474 D
3725 3474 D
3728 3474 D
3732 3474 D
3735 3474 D
3739 3474 D
3742 3474 D
3745 3474 D
3748 3474 D
3752 3474 D
3755 3474 D
3758 3474 D
3762 3474 D
S
[] 0 Sd
N
1495 3110 M
1425 3181 D
1413 3169 D
1377 3231 D
1438 3193 D
1425 3181 D
S
N
1574 3136 M
1574 3075 D
S
N
1577 3136 M
1612 3081 D
S
N
1577 3130 M
1612 3075 D
S
N
1612 3136 M
1612 3075 D
S
N
1566 3136 M
1577 3136 D
S
N
1603 3136 M
1620 3136 D
S
N
1566 3075 M
1583 3075 D
S
N
1641 3136 M
1641 3075 D
S
N
1644 3136 M
1644 3075 D
S
N
1632 3136 M
1667 3136 D
1675 3133 D
1678 3130 D
1681 3124 D
1681 3116 D
1678 3110 D
1675 3107 D
1667 3104 D
1644 3104 D
S
N
1667 3136 M
1672 3133 D
1675 3130 D
1678 3124 D
1678 3116 D
1675 3110 D
1672 3107 D
1667 3104 D
S
N
1632 3075 M
1652 3075 D
S
N
1747 3098 M
1782 3098 D
1782 3104 D
1779 3110 D
1776 3113 D
1771 3116 D
1762 3116 D
1753 3113 D
1747 3107 D
1745 3098 D
1745 3093 D
1747 3084 D
1753 3078 D
1762 3075 D
1768 3075 D
1776 3078 D
1782 3084 D
S
N
1779 3098 M
1779 3107 D
1776 3113 D
S
N
1762 3116 M
1756 3113 D
1750 3107 D
1747 3098 D
1747 3093 D
1750 3084 D
1756 3078 D
1762 3075 D
S
N
1820 3133 M
1817 3130 D
1820 3127 D
1823 3130 D
1823 3133 D
1820 3136 D
1814 3136 D
1808 3133 D
1805 3127 D
1805 3075 D
S
N
1814 3136 M
1811 3133 D
1808 3127 D
1808 3075 D
S
N
1797 3116 M
1820 3116 D
S
N
1797 3075 M
1817 3075 D
S
N
1857 3133 M
1854 3130 D
1857 3127 D
1860 3130 D
1860 3133 D
1857 3136 D
1851 3136 D
1846 3133 D
1843 3127 D
1843 3075 D
S
N
1851 3136 M
1849 3133 D
1846 3127 D
1846 3075 D
S
N
1834 3116 M
1857 3116 D
S
N
1834 3075 M
1854 3075 D
S
N
1877 3098 M
1912 3098 D
1912 3104 D
1909 3110 D
1906 3113 D
1901 3116 D
1892 3116 D
1883 3113 D
1877 3107 D
1875 3098 D
1875 3093 D
1877 3084 D
1883 3078 D
1892 3075 D
1898 3075 D
1906 3078 D
1912 3084 D
S
N
1909 3098 M
1909 3107 D
1906 3113 D
S
N
1892 3116 M
1886 3113 D
1880 3107 D
1877 3098 D
1877 3093 D
1880 3084 D
1886 3078 D
1892 3075 D
S
N
1964 3107 M
1961 3104 D
1964 3101 D
1967 3104 D
1967 3107 D
1961 3113 D
1955 3116 D
1947 3116 D
1938 3113 D
1932 3107 D
1929 3098 D
1929 3093 D
1932 3084 D
1938 3078 D
1947 3075 D
1952 3075 D
1961 3078 D
1967 3084 D
S
N
1947 3116 M
1941 3113 D
1935 3107 D
1932 3098 D
1932 3093 D
1935 3084 D
1941 3078 D
1947 3075 D
S
N
1990 3136 M
1990 3087 D
1993 3078 D
1999 3075 D
2004 3075 D
2010 3078 D
2013 3084 D
S
N
1993 3136 M
1993 3087 D
1996 3078 D
1999 3075 D
S
N
1981 3116 M
2004 3116 D
S
N
2056 3110 M
2059 3116 D
2059 3104 D
2056 3110 D
2054 3113 D
2048 3116 D
2036 3116 D
2030 3113 D
2028 3110 D
2028 3104 D
2030 3101 D
2036 3098 D
2051 3093 D
2056 3090 D
2059 3087 D
S
N
2028 3107 M
2030 3104 D
2036 3101 D
2051 3095 D
2056 3093 D
2059 3090 D
2059 3081 D
2056 3078 D
2051 3075 D
2039 3075 D
2033 3078 D
2030 3081 D
2028 3087 D
2028 3075 D
2030 3081 D
S
0.00 0.00 0.00 setrgbcolor
N
1487 4171 M
1498 4171 D
1514 4138 D
S
N
1495 4171 M
1514 4133 D
1539 4207 D
S
N
1575 4166 M
1577 4171 D
1577 4160 D
1575 4166 D
1572 4168 D
1566 4171 D
1555 4171 D
1550 4168 D
1547 4166 D
1547 4160 D
1550 4157 D
1555 4155 D
1569 4149 D
1575 4146 D
1577 4144 D
S
N
1547 4163 M
1550 4160 D
1555 4157 D
1569 4152 D
1575 4149 D
1577 4146 D
1577 4138 D
1575 4136 D
1569 4133 D
1558 4133 D
1553 4136 D
1550 4138 D
1547 4144 D
1547 4133 D
1550 4138 D
S
N
1596 4166 M
1646 4166 D
S
N
1596 4149 M
1646 4149 D
S
N
1665 4190 M
1665 4174 D
S
N
1665 4179 M
1668 4185 D
1673 4190 D
1679 4190 D
1692 4182 D
1698 4182 D
1700 4185 D
1703 4190 D
S
N
1668 4185 M
1673 4188 D
1679 4188 D
1692 4182 D
S
N
1703 4190 M
1703 4182 D
1700 4174 D
1689 4160 D
1687 4155 D
1684 4146 D
1684 4133 D
S
N
1700 4174 M
1687 4160 D
1684 4155 D
1681 4146 D
1681 4133 D
S
N
1780 4190 M
1780 4133 D
S
N
1783 4190 M
1783 4133 D
S
N
1763 4190 M
1761 4174 D
1761 4190 D
1802 4190 D
1802 4174 D
1799 4190 D
S
N
1772 4133 M
1791 4133 D
S
N
1818 4155 M
1851 4155 D
1851 4160 D
1848 4166 D
1846 4168 D
1840 4171 D
1832 4171 D
1824 4168 D
1818 4163 D
1815 4155 D
1815 4149 D
1818 4141 D
1824 4136 D
1832 4133 D
1837 4133 D
1846 4136 D
1851 4141 D
S
N
1848 4155 M
1848 4163 D
1846 4168 D
S
N
1832 4171 M
1826 4168 D
1821 4163 D
1818 4155 D
1818 4149 D
1821 4141 D
1826 4136 D
1832 4133 D
S
N
1867 4190 M
1887 4133 D
S
N
1870 4190 M
1887 4141 D
S
N
1906 4190 M
1887 4133 D
S
N
1862 4190 M
1878 4190 D
S
N
1895 4190 M
1911 4190 D
S
N
1492 4344 M
1492 4287 D
S
N
1495 4344 M
1495 4287 D
S
N
1495 4336 M
1501 4341 D
1506 4344 D
1512 4344 D
1520 4341 D
1525 4336 D
1528 4328 D
1528 4322 D
1525 4314 D
1520 4309 D
1512 4306 D
1506 4306 D
1501 4309 D
1495 4314 D
S
N
1512 4344 M
1517 4341 D
1522 4336 D
1525 4328 D
1525 4322 D
1522 4314 D
1517 4309 D
1512 4306 D
S
N
1484 4344 M
1495 4344 D
S
N
1484 4287 M
1503 4287 D
S
N
1550 4344 M
1550 4287 D
S
N
1553 4344 M
1553 4287 D
S
N
1553 4336 M
1558 4341 D
1564 4344 D
1569 4344 D
1577 4341 D
1583 4336 D
1585 4328 D
1585 4322 D
1583 4314 D
1577 4309 D
1569 4306 D
1564 4306 D
1558 4309 D
1553 4314 D
S
N
1569 4344 M
1575 4341 D
1580 4336 D
1583 4328 D
1583 4322 D
1580 4314 D
1575 4309 D
1569 4306 D
S
N
1542 4344 M
1553 4344 D
S
N
1542 4287 M
1561 4287 D
S
N
1646 4336 M
1654 4330 D
1646 4325 D
S
N
1637 4344 M
1651 4330 D
1637 4317 D
S
N
1605 4330 M
1651 4330 D
S
N
1679 4363 M
1679 4306 D
S
N
1681 4363 M
1681 4306 D
S
N
1714 4363 M
1714 4306 D
S
N
1717 4363 M
1717 4306 D
S
N
1670 4363 M
1689 4363 D
S
N
1706 4363 M
1725 4363 D
S
N
1681 4336 M
1714 4336 D
S
N
1670 4306 M
1689 4306 D
S
N
1706 4306 M
1725 4306 D
S
N
1766 4355 M
1766 4306 D
S
N
1741 4330 M
1791 4330 D
S
N
1810 4363 M
1846 4306 D
S
N
1813 4363 M
1848 4306 D
S
N
1848 4363 M
1810 4306 D
S
N
1804 4363 M
1821 4363 D
S
N
1837 4363 M
1854 4363 D
S
N
1804 4306 M
1821 4306 D
S
N
1837 4306 M
1854 4306 D
S
N
2089 4363 M
2089 4306 D
S
N
2092 4363 M
2108 4314 D
S
N
2089 4363 M
2108 4306 D
S
N
2127 4363 M
2108 4306 D
S
N
2127 4363 M
2127 4306 D
S
N
2130 4363 M
2130 4306 D
S
N
2081 4363 M
2092 4363 D
S
N
2127 4363 M
2138 4363 D
S
N
2081 4306 M
2097 4306 D
S
N
2119 4306 M
2138 4306 D
S
N
2157 4322 M
2157 4284 D
S
N
2159 4322 M
2159 4284 D
S
N
2180 4322 M
2180 4284 D
S
N
2182 4322 M
2182 4284 D
S
N
2151 4322 M
2164 4322 D
S
N
2175 4322 M
2188 4322 D
S
N
2159 4304 M
2180 4304 D
S
N
2151 4284 M
2164 4284 D
S
N
2175 4284 M
2188 4284 D
S
N
2206 4339 M
2255 4339 D
S
N
2206 4322 M
2255 4322 D
S
N
2283 4352 M
2288 4355 D
2296 4363 D
2296 4306 D
S
N
2294 4361 M
2294 4306 D
S
N
2283 4306 M
2307 4306 D
S
N
2362 4355 M
2359 4352 D
2362 4350 D
2365 4352 D
2365 4355 D
2362 4361 D
2357 4363 D
2348 4363 D
2340 4361 D
2335 4355 D
2332 4350 D
2329 4339 D
2329 4322 D
2332 4314 D
2337 4309 D
2346 4306 D
2351 4306 D
2359 4309 D
2365 4314 D
2367 4322 D
2367 4325 D
2365 4333 D
2359 4339 D
2351 4341 D
2348 4341 D
2340 4339 D
2335 4333 D
2332 4325 D
S
N
2348 4363 M
2343 4361 D
2337 4355 D
2335 4350 D
2332 4339 D
2332 4322 D
2335 4314 D
2340 4309 D
2346 4306 D
S
N
2351 4306 M
2357 4309 D
2362 4314 D
2365 4322 D
2365 4325 D
2362 4333 D
2357 4339 D
2351 4341 D
S
N
2389 4363 M
2384 4336 D
S
N
2384 4336 M
2389 4341 D
2398 4344 D
2406 4344 D
2414 4341 D
2419 4336 D
2422 4328 D
2422 4322 D
2419 4314 D
2414 4309 D
2406 4306 D
2398 4306 D
2389 4309 D
2387 4311 D
2384 4317 D
2384 4320 D
2387 4322 D
2389 4320 D
2387 4317 D
S
N
2406 4344 M
2411 4341 D
2417 4336 D
2419 4328 D
2419 4322 D
2417 4314 D
2411 4309 D
2406 4306 D
S
N
2389 4363 M
2417 4363 D
S
N
2389 4361 M
2403 4361 D
2417 4363 D
S
N
2521 4355 M
2524 4347 D
2524 4363 D
2521 4355 D
2515 4361 D
2507 4363 D
2502 4363 D
2493 4361 D
2488 4355 D
2485 4350 D
2482 4341 D
2482 4328 D
2485 4320 D
2488 4314 D
2493 4309 D
2502 4306 D
2507 4306 D
2515 4309 D
2521 4314 D
S
N
2502 4363 M
2496 4361 D
2491 4355 D
2488 4350 D
2485 4341 D
2485 4328 D
2488 4320 D
2491 4314 D
2496 4309 D
2502 4306 D
S
N
2521 4328 M
2521 4306 D
S
N
2524 4328 M
2524 4306 D
S
N
2513 4328 M
2532 4328 D
S
N
2548 4328 M
2581 4328 D
2581 4333 D
2578 4339 D
2576 4341 D
2570 4344 D
2562 4344 D
2554 4341 D
2548 4336 D
2545 4328 D
2545 4322 D
2548 4314 D
2554 4309 D
2562 4306 D
2567 4306 D
2576 4309 D
2581 4314 D
S
N
2578 4328 M
2578 4336 D
2576 4341 D
S
N
2562 4344 M
2556 4341 D
2551 4336 D
2548 4328 D
2548 4322 D
2551 4314 D
2556 4309 D
2562 4306 D
S
N
2597 4363 M
2617 4306 D
S
N
2600 4363 M
2617 4314 D
S
N
2636 4363 M
2617 4306 D
S
N
2592 4363 M
2608 4363 D
S
N
2625 4363 M
2641 4363 D
S
N
936 2429 M
936 2362 D
S
N
939 2429 M
939 2362 D
S
N
977 2429 M
977 2362 D
S
N
980 2429 M
980 2362 D
S
N
926 2429 M
948 2429 D
S
N
967 2429 M
989 2429 D
S
N
939 2397 M
977 2397 D
S
N
926 2362 M
948 2362 D
S
N
967 2362 M
989 2362 D
S
N
1043 2407 M
1043 2340 D
S
N
1046 2407 M
1046 2340 D
S
N
1043 2397 M
1037 2403 D
1031 2407 D
1024 2407 D
1015 2403 D
1008 2397 D
1005 2388 D
1005 2381 D
1008 2372 D
1015 2365 D
1024 2362 D
1031 2362 D
1037 2365 D
1043 2372 D
S
N
1024 2407 M
1018 2403 D
1012 2397 D
1008 2388 D
1008 2381 D
1012 2372 D
1018 2365 D
1024 2362 D
S
N
1034 2340 M
1056 2340 D
S
N
1088 2429 M
1088 2362 D
S
N
1091 2429 M
1091 2362 D
S
N
1069 2429 M
1065 2410 D
1065 2429 D
1113 2429 D
1113 2410 D
1110 2429 D
S
N
1078 2362 M
1100 2362 D
S
N
1132 2416 M
1135 2413 D
1132 2410 D
1129 2413 D
1129 2416 D
1132 2422 D
1135 2426 D
1145 2429 D
1157 2429 D
1167 2426 D
1170 2422 D
1173 2416 D
1173 2410 D
1170 2403 D
1160 2397 D
1145 2391 D
1138 2388 D
1132 2381 D
1129 2372 D
1129 2362 D
S
N
1157 2429 M
1164 2426 D
1167 2422 D
1170 2416 D
1170 2410 D
1167 2403 D
1157 2397 D
1145 2391 D
S
N
1129 2369 M
1132 2372 D
1138 2372 D
1154 2365 D
1164 2365 D
1170 2369 D
1173 2372 D
S
N
1138 2372 M
1154 2362 D
1167 2362 D
1170 2365 D
1173 2372 D
1173 2378 D
S
N
1199 2369 M
1195 2365 D
1199 2362 D
1202 2365 D
1199 2369 D
S
N
1243 2429 M
1233 2426 D
1227 2416 D
1224 2400 D
1224 2391 D
1227 2375 D
1233 2365 D
1243 2362 D
1249 2362 D
1259 2365 D
1265 2375 D
1268 2391 D
1268 2400 D
1265 2416 D
1259 2426 D
1249 2429 D
1243 2429 D
S
N
1243 2429 M
1237 2426 D
1233 2422 D
1230 2416 D
1227 2400 D
1227 2391 D
1230 2375 D
1233 2369 D
1237 2365 D
1243 2362 D
S
N
1249 2362 M
1256 2365 D
1259 2369 D
1262 2375 D
1265 2391 D
1265 2400 D
1262 2416 D
1259 2422 D
1256 2426 D
1249 2429 D
S
showpage
%%Trailer
%%Pages: 1
%%BoundingBox: 48 236 464 568
