%!PS-Adobe-2.0 EPSF-2.0
%%BoundingBox:  0 0 567 310
%%Title: /home/shiki/Desktop/MCFM/YR/CUT1/CUT1_CT10_MSTW_LHC.eps: Higgs Cross Section
%%Creator: ROOT Version 5.28/00
%%CreationDate: Tue Nov 22 18:45:12 2011
%%EndComments
%%BeginProlog
80 dict begin
/s {stroke} def /l {lineto} def /m {moveto} def /t {translate} def
/r {rotate} def /rl {roll}  def /R {repeat} def
/d {rlineto} def /rm {rmoveto} def /gr {grestore} def /f {eofill} def
/c {setrgbcolor} def /black {0 setgray} def /sd {setdash} def
/cl {closepath} def /sf {scalefont setfont} def /lw {setlinewidth} def
/box {m dup 0 exch d exch 0 d 0 exch neg d cl} def
/NC{systemdict begin initclip end}def/C{NC box clip newpath}def
/bl {box s} def /bf {box f} def /Y { 0 exch d} def /X { 0 d} def 
/K {{pop pop 0 moveto} exch kshow} bind def
/ita {/ang 15 def gsave [1 0 ang dup sin exch cos div 1 0 0] concat} def 
/mp {newpath /y exch def /x exch def} def
/side {[w .77 mul w .23 mul] .385 w mul sd w 0 l currentpoint t -144 r} def
/mr {mp x y w2 0 360 arc} def /m24 {mr s} def /m20 {mr f} def
/mb {mp x y w2 add m w2 neg 0 d 0 w neg d w 0 d 0 w d cl} def
/mt {mp x y w2 add m w2 neg w neg d w 0 d cl} def
/m21 {mb f} def /m25 {mb s} def /m22 {mt f} def /m26{mt s} def
/m23 {mp x y w2 sub m w2 w d w neg 0 d cl f} def
/m27 {mp x y w2 add m w3 neg w2 neg d w3 w2 neg d w3 w2 d cl s} def
/m28 {mp x w2 sub y w2 sub w3 add m w3 0 d  0 w3 neg d w3 0 d 0 w3 d w3 0 d  0 w3 d w3 neg 0 d 0 w3 d w3 neg 0 d 0 w3 neg d w3 neg 0 d cl s } def
/m29 {mp gsave x w2 sub y w2 add w3 sub m currentpoint t 4 {side} repeat cl fill gr} def
/m30 {mp gsave x w2 sub y w2 add w3 sub m currentpoint t 4 {side} repeat cl s gr} def
/m31 {mp x y w2 sub m 0 w d x w2 sub y m w 0 d x w2 sub y w2 add m w w neg d x w2 sub y w2 sub m w w d s} def
/m32 {mp x y w2 sub m w2 w d w neg 0 d cl s} def
/m33 {mp x y w2 add m w3 neg w2 neg d w3 w2 neg d w3 w2 d cl f} def
/m34 {mp x w2 sub y w2 sub w3 add m w3 0 d  0 w3 neg d w3 0 d 0 w3 d w3 0 d  0 w3 d w3 neg 0 d 0 w3 d w3 neg 0 d 0 w3 neg d w3 neg 0 d cl f } def
/m2 {mp x y w2 sub m 0 w d x w2 sub y m w 0 d s} def
/m5 {mp x w2 sub y w2 sub m w w d x w2 sub y w2 add m w w neg d s} def
/reEncode {exch findfont dup length dict begin {1 index /FID eq  {pop pop} {def} ifelse } forall /Encoding exch def currentdict end dup /FontName get exch definefont pop } def [/Times-Bold /Times-Italic /Times-BoldItalic /Helvetica /Helvetica-Oblique
 /Helvetica-Bold /Helvetica-BoldOblique /Courier /Courier-Oblique /Courier-Bold /Courier-BoldOblique /Times-Roman /AvantGarde-Book /AvantGarde-BookOblique /AvantGarde-Demi /AvantGarde-DemiOblique /Bookman-Demi /Bookman-DemiItalic /Bookman-Light
 /Bookman-LightItalic /Helvetica-Narrow /Helvetica-Narrow-Bold /Helvetica-Narrow-BoldOblique /Helvetica-Narrow-Oblique /NewCenturySchlbk-Roman /NewCenturySchlbk-Bold /NewCenturySchlbk-BoldItalic /NewCenturySchlbk-Italic /Palatino-Bold
 /Palatino-BoldItalic /Palatino-Italic /Palatino-Roman ] {ISOLatin1Encoding reEncode } forall%%EndProlog
%%BeginSetup
%%EndSetup
newpath  gsave  .25 .25 scale  gsave  0 0 t black[  ] 0 sd 3 lw 1 1 1 c 2268 1239 0 0 bf black 1 1 1 c 1088 1214 23 12 bf black 1 1 1 c 860 959 197 207 bf black 860 959 197 207 bl 1 1 1 c 860 959 197 207 bf black 860 959 197 207 bl 6 lw 1 1 1 c black
 197 207 m 860 X s 3 lw 197 207 m 860 X s
 gsave  1088 1214 23 12 C 942.375 103.062 t 0 r /Helvetica findfont 40.9078 sf 0 0 m ( [GeV]) show NC gr 
 gsave  1088 1214 23 12 C 922.812 92.375 t 0 r /Helvetica findfont 26.679 sf 0 0 m (4l) show NC gr 
 gsave  1088 1214 23 12 C 890.812 103.062 t 0 r /Helvetica findfont 40.9078 sf 0 0 m (M) show NC gr  230 235 m -28 Y s 263 221 m -14 Y s 296 221 m -14 Y s 329 221 m -14 Y s 362 221 m -14 Y s 395 235 m -28 Y s 428 221 m -14 Y s 461 221 m -14 Y s 495
 221 m -14 Y s 528 221 m -14 Y s 561 235 m -28 Y s 594 221 m -14 Y s 627 221 m -14 Y s 660 221 m -14 Y s 693 221 m -14 Y s 726 235 m -28 Y s 759 221 m -14 Y s 792 221 m -14 Y s 825 221 m -14 Y s 858 221 m -14 Y s 891 235 m -28 Y s 924 221 m -14 Y s
 958 221 m -14 Y s 991 221 m -14 Y s 1024 221 m -14 Y s 1057 235 m -28 Y s 230 235 m -28 Y s
 gsave  1088 1214 23 12 C 195.938 161.688 t 0 r /Helvetica findfont 40.9078 sf 0 0 m (100) show NC gr 
 gsave  1088 1214 23 12 C 361.188 161.688 t 0 r /Helvetica findfont 40.9078 sf 0 0 m (200) show NC gr 
 gsave  1088 1214 23 12 C 526.5 161.688 t 0 r /Helvetica findfont 40.9078 sf 0 0 m (300) show NC gr 
 gsave  1088 1214 23 12 C 691.75 161.688 t 0 r /Helvetica findfont 40.9078 sf 0 0 m (400) show NC gr 
 gsave  1088 1214 23 12 C 857.062 161.688 t 0 r /Helvetica findfont 40.9078 sf 0 0 m (500) show NC gr 
 gsave  1088 1214 23 12 C 1022.31 161.688 t 0 r /Helvetica findfont 40.9078 sf 0 0 m (600) show NC gr  197 1166 m 860 X s 230 1137 m 29 Y s 263 1151 m 15 Y s 296 1151 m 15 Y s 329 1151 m 15 Y s 362 1151 m 15 Y s 395 1137 m 29 Y s 428 1151 m 15 Y s
 461 1151 m 15 Y s 495 1151 m 15 Y s 528 1151 m 15 Y s 561 1137 m 29 Y s 594 1151 m 15 Y s 627 1151 m 15 Y s 660 1151 m 15 Y s 693 1151 m 15 Y s 726 1137 m 29 Y s 759 1151 m 15 Y s 792 1151 m 15 Y s 825 1151 m 15 Y s 858 1151 m 15 Y s 891 1137 m 29 Y
 s 924 1151 m 15 Y s 958 1151 m 15 Y s 991 1151 m 15 Y s 1024 1151 m 15 Y s 1057 1137 m 29 Y s 230 1137 m 29 Y s 197 207 m 959 Y s
 gsave  1088 1214 23 12 C 101.75 1140.88 t 90 r /Helvetica findfont 40.9078 sf 0 0 m ( \)) show NC gr 
 gsave  1088 1214 23 12 C 82.1875 1123.06 t 90 r /Helvetica findfont 26.679 sf 0 0 m (\2551) show NC gr 
 gsave  1088 1214 23 12 C 101.75 490.438 t 90 r /Helvetica findfont 40.9078 sf 0 0 m (Events/10GeV \( Normalized to 1 fb) show NC gr  210 207 m -13 X s 210 230 m -13 X s 210 249 m -13 X s 210 266 m -13 X s 210 281 m -13 X s 223 294 m -26 X s
 gsave  1088 1214 23 12 C 163.938 295 t 0 r /Helvetica findfont 26.679 sf 0 0 m (\2552) show NC gr 
 gsave  1088 1214 23 12 C 119.5 275.438 t 0 r /Helvetica findfont 40.9078 sf 0 0 m (10) show NC gr  210 382 m -13 X s 210 433 m -13 X s 210 469 m -13 X s 210 497 m -13 X s 210 520 m -13 X s 210 540 m -13 X s 210 556 m -13 X s 210 571 m -13 X s 223
 585 m -26 X s
 gsave  1088 1214 23 12 C 167.5 584.688 t 0 r /Helvetica findfont 26.679 sf 0 0 m (\2551) show NC gr 
 gsave  1088 1214 23 12 C 123.062 565.125 t 0 r /Helvetica findfont 40.9078 sf 0 0 m (10) show NC gr  210 672 m -13 X s 210 723 m -13 X s 210 760 m -13 X s 210 788 m -13 X s 210 811 m -13 X s 210 830 m -13 X s 210 847 m -13 X s 210 862 m -13 X s 223
 875 m -26 X s
 gsave  1088 1214 23 12 C 188.312 857.938 t 0 r  -22 0 t /Helvetica findfont 40.9078 sf 0 0 m (1) show NC gr  210 963 m -13 X s 210 1014 m -13 X s 210 1050 m -13 X s 210 1078 m -13 X s 210 1101 m -13 X s 210 1121 m -13 X s 210 1137 m -13 X s 210 1152
 m -13 X s 223 1166 m -26 X s
 gsave  1088 1214 23 12 C 188.312 1148.44 t 0 r  -45 0 t /Helvetica findfont 40.9078 sf 0 0 m (10) show NC gr  1057 207 m 959 Y s 1044 207 m 13 X s 1044 230 m 13 X s 1044 249 m 13 X s 1044 266 m 13 X s 1044 281 m 13 X s 1031 294 m 26 X s 1044 382 m
 13 X s 1044 433 m 13 X s 1044 469 m 13 X s 1044 497 m 13 X s 1044 520 m 13 X s 1044 540 m 13 X s 1044 556 m 13 X s 1044 571 m 13 X s 1031 585 m 26 X s 1044 672 m 13 X s 1044 723 m 13 X s 1044 760 m 13 X s 1044 788 m 13 X s 1044 811 m 13 X s 1044 830
 m 13 X s 1044 847 m 13 X s 1044 862 m 13 X s 1031 875 m 26 X s 1044 963 m 13 X s 1044 1014 m 13 X s 1044 1050 m 13 X s 1044 1078 m 13 X s 1044 1101 m 13 X s 1044 1121 m 13 X s 1044 1137 m 13 X s 1044 1152 m 13 X s 1031 1166 m 26 X s 6 lw 1 1 1 c 0 0
 1 c 3 lw /w 14 def /w2 {w 2 div} def /w3 {w 3 div} def 205 970 222 1119 238 820 255 859 271 858 288 837 304 814 321 792 337 773 354 772 370 872 387 923 404 920 420 907 437 890 453 871 470 856 486 837 503 818 519 799 536 787 552 767 569 753 585 737
 602 720 619 704 635 693 652 680 668 664 685 651 701 640 718 627 734 610 751 599 767 587 784 580 800 567 817 556 834 544 850 529 867 526 883 514 900 491 916 493 933 482 949 472 966 460 982 448 999 430 1015 431 50 { m24} R 6 lw 3 lw 1015 431 1032 414
 1048 417 3 { m24} R 6 lw black 1 1 1 c 0.35 0.83 0.33 c 3 lw 205 867 222 1020 238 711 255 750 271 751 288 732 304 713 321 690 337 673 354 676 370 776 387 829 404 827 420 813 437 798 453 780 470 763 486 745 503 728 519 710 536 694 552 678 569 661 585
 649 602 631 619 615 635 602 652 588 668 572 685 556 701 546 718 532 734 522 751 511 767 502 784 483 800 472 817 456 834 448 850 443 867 428 883 417 900 412 916 399 933 394 949 381 966 370 982 367 999 348 1015 344 50 { m26} R 6 lw 3 lw 1015 344 1032
 336 1048 316 3 { m26} R 6 lw black 1 1 1 c 1 0 1 c 3 lw 205 868 222 998 238 720 255 757 271 758 288 738 304 718 321 695 337 676 354 674 370 783 387 834 404 834 420 821 437 804 453 785 470 767 486 751 503 732 519 715 536 699 552 683 569 665 585 652
 602 633 619 621 635 611 652 590 668 578 685 565 701 549 718 537 734 523 751 512 767 502 784 489 800 484 817 461 834 455 850 443 867 434 883 427 900 412 916 404 933 387 949 375 966 367 982 354 999 354 1015 336 50 { m22} R 6 lw 3 lw 1015 336 1032 326
 1048 330 3 { m22} R 6 lw black 1 1 1 c 1 0 0 c 3 lw 205 970 222 1109 238 822 255 860 271 855 288 836 304 813 321 789 337 772 354 770 370 873 387 922 404 920 420 907 437 890 453 872 470 855 486 836 503 818 519 801 536 786 552 770 569 750 585 738 602
 721 619 707 635 688 652 680 668 666 685 647 701 632 718 621 734 608 751 602 767 586 784 571 800 563 817 550 834 536 850 529 867 501 883 498 900 497 916 485 933 469 949 456 966 450 982 442 999 430 1015 423 50 { m20} R 6 lw 3 lw 1015 423 1032 410 1048
 414 3 { m20} R 6 lw black
 gsave  1088 1214 23 12 C 345.188 1082.19 t 0 r /Helvetica findfont 51.5794 sf 0 0 m 
 139 111 85 72 44 30
(= 7 TeV) K NC gr 
 gsave  1088 1214 23 12 C 320.312 1082.19 t 0 r /Helvetica findfont 51.5794 sf 0 0 m (s) show NC gr  286 1111 m 23 -30 d s 0 lw 309 1081 m 6 44 d s 315 1125 m 30 X s
 gsave  1088 1214 23 12 C 1100.5 813.938 t 90 r /Helvetica-BoldOblique findfont 30.2362 sf 0 0 m 
 336 321 304 287 279 255 226 218 198 177 169 148 125 101 93 71 62 40 18
(LHC HIGGS XS WG 2011) K NC gr  3 lw 1 1 1 c 414 244 567 844 bf black 578 844 m -7 Y 410 X 240 Y -7 X -233 Y f 567 844 m 244 Y 414 X -244 Y -414 X cl s
 gsave  1088 1214 23 12 C 769.938 1059.12 t 0 r /Helvetica findfont 24.9004 sf 0 0 m (>12GeV) show NC gr 
 gsave  1088 1214 23 12 C 748.625 1048.44 t 0 r /Helvetica findfont 17.786 sf 0 0 m (Z2) show NC gr 
 gsave  1088 1214 23 12 C 707.75 1059.12 t 0 r /Helvetica findfont 24.9004 sf 0 0 m ( , M) show NC gr 
 gsave  1088 1214 23 12 C 690 1052 t 0 r /Helvetica findfont 17.786 sf 0 0 m (Z1) show NC gr 
 gsave  1088 1214 23 12 C 670.438 1059.12 t 0 r /Helvetica findfont 24.9004 sf 0 0 m (M) show NC gr  0.999 0.999 0.999 c black
 gsave  1088 1214 23 12 C 670.438 1004 t 0 r /Helvetica findfont 24.9004 sf 0 0 m (MSTW POWHEG 2e2mu) show NC gr  0 0 1 c 619 1015 m24 black
 gsave  1088 1214 23 12 C 670.438 956.062 t 0 r /Helvetica findfont 24.9004 sf 0 0 m (CT10 POWHEG 2e2mu) show NC gr  1 0 0 c 619 966 m20 black
 gsave  1088 1214 23 12 C 670.438 908.062 t 0 r /Helvetica findfont 24.9004 sf 0 0 m (MSTW POWHEG 4e) show NC gr  0.35 0.83 0.33 c 619 917 m26 black
 gsave  1088 1214 23 12 C 670.438 858.312 t 0 r /Helvetica findfont 24.9004 sf 0 0 m (CT10 POWHEG 4e) show NC gr  1 0 1 c 619 869 m22 black 1 1 1 c 1088 1214 1157 12 bf black 1 1 1 c 860 959 1331 207 bf black 860 959 1331 207 bl 1 1 1 c 860 959 1331
 207 bf black 860 959 1331 207 bl 6 lw 1 1 1 c black 1331 207 m 860 X s 3 lw 1331 207 m 860 X s
 gsave  1088 1214 1157 12 C 2076.25 103.5 t 0 r /Helvetica findfont 40.9078 sf 0 0 m ( [GeV]) show NC gr 
 gsave  1088 1214 1157 12 C 2056.69 92.8125 t 0 r /Helvetica findfont 26.679 sf 0 0 m (4l) show NC gr 
 gsave  1088 1214 1157 12 C 2024.69 103.5 t 0 r /Helvetica findfont 40.9078 sf 0 0 m (M) show NC gr  1409 235 m -28 Y s 1440 221 m -14 Y s 1471 221 m -14 Y s 1503 221 m -14 Y s 1534 221 m -14 Y s 1565 235 m -28 Y s 1596 221 m -14 Y s 1628 221 m -14 Y
 s 1659 221 m -14 Y s 1690 221 m -14 Y s 1722 235 m -28 Y s 1753 221 m -14 Y s 1784 221 m -14 Y s 1815 221 m -14 Y s 1847 221 m -14 Y s 1878 235 m -28 Y s 1909 221 m -14 Y s 1940 221 m -14 Y s 1972 221 m -14 Y s 2003 221 m -14 Y s 2034 235 m -28 Y s
 2066 221 m -14 Y s 2097 221 m -14 Y s 2128 221 m -14 Y s 2159 221 m -14 Y s 2191 235 m -28 Y s 1409 235 m -28 Y s 1378 221 m -14 Y s 1346 221 m -14 Y s
 gsave  1088 1214 1157 12 C 1374.25 162.125 t 0 r /Helvetica findfont 40.9078 sf 0 0 m (100) show NC gr 
 gsave  1088 1214 1157 12 C 1530.62 162.125 t 0 r /Helvetica findfont 40.9078 sf 0 0 m (200) show NC gr 
 gsave  1088 1214 1157 12 C 1687 162.125 t 0 r /Helvetica findfont 40.9078 sf 0 0 m (300) show NC gr 
 gsave  1088 1214 1157 12 C 1843.44 162.125 t 0 r /Helvetica findfont 40.9078 sf 0 0 m (400) show NC gr 
 gsave  1088 1214 1157 12 C 1999.81 162.125 t 0 r /Helvetica findfont 40.9078 sf 0 0 m (500) show NC gr 
 gsave  1088 1214 1157 12 C 2156.19 162.125 t 0 r /Helvetica findfont 40.9078 sf 0 0 m (600) show NC gr  1331 1166 m 860 X s 1409 1137 m 29 Y s 1440 1151 m 15 Y s 1471 1151 m 15 Y s 1503 1151 m 15 Y s 1534 1151 m 15 Y s 1565 1137 m 29 Y s 1596 1151 m
 15 Y s 1628 1151 m 15 Y s 1659 1151 m 15 Y s 1690 1151 m 15 Y s 1722 1137 m 29 Y s 1753 1151 m 15 Y s 1784 1151 m 15 Y s 1815 1151 m 15 Y s 1847 1151 m 15 Y s 1878 1137 m 29 Y s 1909 1151 m 15 Y s 1940 1151 m 15 Y s 1972 1151 m 15 Y s 2003 1151 m 15
 Y s 2034 1137 m 29 Y s 2066 1151 m 15 Y s 2097 1151 m 15 Y s 2128 1151 m 15 Y s 2159 1151 m 15 Y s 2191 1137 m 29 Y s 1409 1137 m 29 Y s 1378 1151 m 15 Y s 1346 1151 m 15 Y s 1331 207 m 959 Y s
 gsave  1088 1214 1157 12 C 1240.94 1086.25 t 90 r /Helvetica findfont 26.679 sf 0 0 m (2e2mu) show NC gr 
 gsave  1088 1214 1157 12 C 1228.5 1061.38 t 90 r /Symbol findfont 40.9078 sf 0 0 m (s) show NC gr 
 gsave  1088 1214 1157 12 C 1228.5 1048.94 t 90 r /Helvetica findfont 40.9078 sf 0 0 m (/) show NC gr 
 gsave  1088 1214 1157 12 C 1240.94 1018.69 t 90 r /Helvetica findfont 26.679 sf 0 0 m (4e) show NC gr 
 gsave  1088 1214 1157 12 C 1228.5 993.812 t 90 r /Symbol findfont 40.9078 sf 0 0 m (s) show NC gr 
 gsave  1088 1214 1157 12 C 1228.5 888.938 t 90 r /Helvetica findfont 40.9078 sf 0 0 m (Ratio ) show NC gr  1356 207 m -25 X s 1344 234 m -13 X s 1344 261 m -13 X s 1344 289 m -13 X s 1344 316 m -13 X s 1356 344 m -25 X s 1344 371 m -13 X s 1344 398
 m -13 X s 1344 426 m -13 X s 1344 453 m -13 X s 1356 481 m -25 X s 1344 508 m -13 X s 1344 535 m -13 X s 1344 563 m -13 X s 1344 590 m -13 X s 1356 618 m -25 X s 1344 645 m -13 X s 1344 672 m -13 X s 1344 700 m -13 X s 1344 727 m -13 X s 1356 755 m
 -25 X s 1344 782 m -13 X s 1344 809 m -13 X s 1344 837 m -13 X s 1344 864 m -13 X s 1356 892 m -25 X s 1344 919 m -13 X s 1344 946 m -13 X s 1344 974 m -13 X s 1344 1001 m -13 X s 1356 1029 m -25 X s 1344 1056 m -13 X s 1344 1083 m -13 X s 1344 1111
 m -13 X s 1344 1138 m -13 X s 1356 1166 m -25 X s 1356 1166 m -25 X s
 gsave  1088 1214 1157 12 C 1303.12 192.375 t 0 r /Helvetica findfont 40.9078 sf 0 0 m (0) show NC gr 
 gsave  1088 1214 1157 12 C 1274.69 329.125 t 0 r /Helvetica findfont 40.9078 sf 0 0 m (0.1) show NC gr 
 gsave  1088 1214 1157 12 C 1269.38 466 t 0 r /Helvetica findfont 40.9078 sf 0 0 m (0.2) show NC gr 
 gsave  1088 1214 1157 12 C 1269.38 602.812 t 0 r /Helvetica findfont 40.9078 sf 0 0 m (0.3) show NC gr 
 gsave  1088 1214 1157 12 C 1269.38 739.688 t 0 r /Helvetica findfont 40.9078 sf 0 0 m (0.4) show NC gr 
 gsave  1088 1214 1157 12 C 1267.62 876.5 t 0 r /Helvetica findfont 40.9078 sf 0 0 m (0.5) show NC gr 
 gsave  1088 1214 1157 12 C 1269.38 1013.38 t 0 r /Helvetica findfont 40.9078 sf 0 0 m (0.6) show NC gr 
 gsave  1088 1214 1157 12 C 1269.38 1150.19 t 0 r /Helvetica findfont 40.9078 sf 0 0 m (0.7) show NC gr  2191 207 m 959 Y s 2165 207 m 26 X s 2178 234 m 13 X s 2178 261 m 13 X s 2178 289 m 13 X s 2178 316 m 13 X s 2165 344 m 26 X s 2178 371 m 13 X s
 2178 398 m 13 X s 2178 426 m 13 X s 2178 453 m 13 X s 2165 481 m 26 X s 2178 508 m 13 X s 2178 535 m 13 X s 2178 563 m 13 X s 2178 590 m 13 X s 2165 618 m 26 X s 2178 645 m 13 X s 2178 672 m 13 X s 2178 700 m 13 X s 2178 727 m 13 X s 2165 755 m 26 X
 s 2178 782 m 13 X s 2178 809 m 13 X s 2178 837 m 13 X s 2178 864 m 13 X s 2165 892 m 26 X s 2178 919 m 13 X s 2178 946 m 13 X s 2178 974 m 13 X s 2178 1001 m 13 X s 2165 1029 m 26 X s 2178 1056 m 13 X s 2178 1083 m 13 X s 2178 1111 m 13 X s 2178
 1138 m 13 X s 2165 1166 m 26 X s 2165 1166 m 26 X s 6 lw 1 1 1 c 0 0 1 c 3 lw 1339 498 1354 586 1370 665 1385 816 1401 833 1417 788 1432 784 1448 794 1464 799 1479 820 1495 818 1510 827 1526 844 1542 851 1557 854 1573 864 1589 857 1604 869 1620 872
 1636 861 1651 864 1667 876 1682 886 1698 863 1714 881 1729 868 1745 890 1761 883 1776 879 1792 871 1808 871 1823 870 1839 854 1854 854 1870 854 1886 888 1901 889 1917 902 1933 840 1948 852 1964 828 1980 846 1995 902 2011 837 2026 844 2042 941 2058
 856 2073 890 2089 872 2105 878 50 { m24} R 6 lw 3 lw 2105 878 2120 926 2136 925 2152 895 2167 949 2183 825 6 { m24} R 6 lw black 1 1 1 c 1 0 0 c 3 lw 1339 502 1354 589 1370 715 1385 816 1401 774 1417 816 1432 813 1448 842 1464 837 1479 856 1495 856
 1510 846 1526 848 1542 879 1557 890 1573 899 1589 899 1604 899 1620 892 1636 891 1651 902 1667 901 1682 902 1698 892 1714 894 1729 906 1745 897 1761 889 1776 899 1792 949 1808 876 1823 892 1839 921 1854 918 1870 912 1886 905 1901 879 1917 914 1933
 922 1948 939 1964 884 1980 927 1995 901 2011 1015 2026 982 2042 907 2058 923 2073 924 2089 927 2105 919 50 { m20} R 6 lw 3 lw 2105 919 2120 887 2136 961 2152 893 2167 910 2183 912 6 { m20} R 6 lw 9 lw 0.95 0.95 0.95 c black 1 0 0 c 1335 892 m 421 X
 s 1756 892 m 422 X s 2178 892 m 8 X s black
 gsave  1088 1214 1157 12 C 1479.06 1082.69 t 0 r /Helvetica findfont 51.5794 sf 0 0 m 
 139 111 85 72 44 30
(= 7 TeV) K NC gr 
 gsave  1088 1214 1157 12 C 1454.19 1082.69 t 0 r /Helvetica findfont 51.5794 sf 0 0 m (s) show NC gr  6 lw 1420 1111 m 23 -30 d s 0 lw 1443 1081 m 5 44 d s 1448 1125 m 31 X s
 gsave  1088 1214 1157 12 C 2234.38 814.312 t 90 r /Helvetica-BoldOblique findfont 30.2362 sf 0 0 m 
 336 321 304 287 279 255 226 218 198 177 169 148 125 101 93 71 62 40 18
(LHC HIGGS XS WG 2011) K NC gr  3 lw 1 1 1 c 675 122 1459 617 bf black 1470 617 m -7 Y 672 X 119 Y -8 X -112 Y f 1459 617 m 122 Y 675 X -122 Y -675 X cl s
 gsave  1088 1214 1157 12 C 1628.38 698.812 t 0 r /Helvetica findfont 24.9004 sf 0 0 m (MSTW POWHEG 4e / POWHEG 2e2mu) show NC gr  0 0 1 c 1544 709 m24 black
 gsave  1088 1214 1157 12 C 1628.38 638.375 t 0 r /Helvetica findfont 24.9004 sf 0 0 m (CT10 POWHEG 4e / POWHEG 2e2mu) show NC gr  1 0 0 c 1544 647 m20
 gr  gr showpage
end
%%EOF
