%!PS-Adobe-2.0 EPSF-2.0
%%BoundingBox:  0 0 567 539
%%Title: compare.out/figures/dphi_jj.eps: 
%%Creator: ROOT Version 5.18/00b
%%CreationDate: Mon Nov 14 00:04:40 2011
%%EndComments
%%BeginProlog
80 dict begin
/s {stroke} def /l {lineto} def /m {moveto} def /t {translate} def
/sw {stringwidth} def /r {rotate} def /rl {roll}  def /R {repeat} def
/d {rlineto} def /rm {rmoveto} def /gr {grestore} def /f {eofill} def
/c {setrgbcolor} def /black {0 setgray} def /sd {setdash} def
/cl {closepath} def /sf {scalefont setfont} def /lw {setlinewidth} def
/box {m dup 0 exch d exch 0 d 0 exch neg d cl} def
/NC{systemdict begin initclip end}def/C{NC box clip newpath}def
/bl {box s} def /bf {box f} def /Y { 0 exch d} def /X { 0 d} def 
/mp {newpath /y exch def /x exch def} def
/side {[w .77 mul w .23 mul] .385 w mul sd w 0 l currentpoint t -144 r} def
/mr {mp x y w2 0 360 arc} def /m24 {mr s} def /m20 {mr f} def
/mb {mp x y w2 add m w2 neg 0 d 0 w neg d w 0 d 0 w d cl} def
/mt {mp x y w2 add m w2 neg w neg d w 0 d cl} def
/m21 {mb f} def /m25 {mb s} def /m22 {mt f} def /m26{mt s} def
/m23 {mp x y w2 sub m w2 w d w neg 0 d cl f} def
/m27 {mp x y w2 add m w3 neg w2 neg d w3 w2 neg d w3 w2 d cl s} def
/m28 {mp x w2 sub y w2 sub w3 add m w3 0 d  0 w3 neg d w3 0 d 0 w3 d w3 0 d  0 w3 d w3 neg 0 d 0 w3 d w3 neg 0 d
 0 w3 neg d w3 neg 0 d cl s } def
/m29 {mp gsave x w2 sub y w2 add w3 sub m currentpoint t
 4 {side} repeat cl fill gr} def
/m30 {mp gsave x w2 sub y w2 add w3 sub m currentpoint t
 4 {side} repeat cl s gr} def
/m31 {mp x y w2 sub m 0 w d x w2 sub y m w 0 d x w2 sub y w2 add m w w neg d x w2 sub y w2
 sub m w w d s} def
/m2 {mp x y w2 sub m 0 w d x w2 sub y m w 0 d s} def
/m5 {mp x w2 sub y w2 sub m w w d x w2 sub y w2 add m w w neg d s} def
/reencdict 24 dict def /ReEncode {reencdict begin /nco&na exch def
/nfnam exch def /basefontname exch def /basefontdict basefontname findfont def
/newfont basefontdict maxlength dict def basefontdict {exch dup /FID ne
{dup /Encoding eq {exch dup length array copy newfont 3 1 roll put} {exch 
newfont 3 1 roll put} ifelse} {pop pop} ifelse } forall newfont
/FontName nfnam put nco&na aload pop nco&na length 2 idiv {newfont
/Encoding get 3 1 roll put} repeat nfnam newfont definefont pop end } def
/accvec [ 176 /agrave 181 /Agrave 190 /acircumflex 192 /Acircumflex
201 /adieresis 204 /Adieresis 209 /ccedilla 210 /Ccedilla 211 /eacute
212 /Eacute 213 /egrave 214 /Egrave 215 /ecircumflex 216 /Ecircumflex
217 /edieresis 218 /Edieresis 219 /icircumflex 220 /Icircumflex
221 /idieresis 222 /Idieresis 223 /ntilde 224 /Ntilde 226 /ocircumflex
228 /Ocircumflex 230 /Odieresis 231 /ucircumflex 236 /Ucircumflex
237 /udieresis 238 /Udieresis 239 /aring 240 /odieresis 242 /Aring 243 /ydieresis
244 /Ydieresis 246 /aacute 247 /Aacute 252 /ugrave 253 /Ugrave
127 /atilde 128 /Atilde 129 /oacute 130 /Oacute 131 /iacute
132 /Iacute 133 /igrave 134 /Igrave 135 /otilde 136 /Otilde
137 /uacute 138 /Uacute] def
/Times-Roman /Times-Roman accvec ReEncode
/Times-Italic /Times-Italic accvec ReEncode
/Times-Bold /Times-Bold accvec ReEncode
/Times-BoldItalic /Times-BoldItalic accvec ReEncode
/Helvetica /Helvetica accvec ReEncode
/Helvetica-Oblique /Helvetica-Oblique accvec ReEncode
/Helvetica-Bold /Helvetica-Bold accvec ReEncode
/Helvetica-BoldOblique /Helvetica-BoldOblique  accvec ReEncode
/Courier /Courier accvec ReEncode
/Courier-Oblique /Courier-Oblique accvec ReEncode
/Courier-Bold /Courier-Bold accvec ReEncode
/Courier-BoldOblique /Courier-BoldOblique accvec ReEncode
/oshow {gsave [] 0 sd true charpath stroke gr} def
/stwn { /fs exch def /fn exch def /text exch def fn findfont fs sf
 text sw pop xs add /xs exch def} def
/stwb { /fs exch def /fn exch def /nbas exch def /textf exch deftextf length /tlen exch def nbas tlen gt {/nbas tlendef} iffn findfont fs sf textf dup length nbas sub nbas getinterval sw
pop neg xs add /xs exch def} def
/accspe [ 65 /plusminus  66 /bar  67 /existential  68 /universal 
69 /exclam  70 /numbersign 71 /greater  72 /question  73 /integral 
74 /colon  75 /semicolon  76 /less  77 /bracketleft  78 /bracketright
79 /greaterequal 80 /braceleft 81 /braceright 82 /radical
83 /spade 84 /heart 85 /diamond 86 /club 87 /lessequal
88 /multiply 89 /percent 90 /infinity 48 /circlemultiply 49 /circleplus
50 /emptyset  51 /lozenge 52 /bullet 53 /arrowright 54 /arrowup
55 /arrowleft 56 /arrowdown 57 /arrowboth 48 /degree 44 /comma 43 /plus 45 /angle 42 /angleleft 47 /divide 61 /notequal 40 /equivalence 41 /second 97 /approxequal 98 /congruent 99 /perpendicular 100 /partialdiff 101 /florin 102 /intersection
 103 /union 104 /propersuperset 105 /reflexsuperset 106 /notsubset 107 /propersubset 108 /reflexsubset 109 /element 110 /notelement 111 /gradient 112 /logicaland 113 /logicalor 114 /arrowdblboth 115 /arrowdblleft 116 /arrowdblup 117 /arrowdblright
 118 /arrowdbldown 119 /ampersand 120 /omega1 121 /similar 122 /aleph ] def
/Symbol /Special accspe ReEncode
%%EndProlog
%%BeginSetup
%%EndSetup
newpath  gsave  .25 .25 scale  gsave  0 0 t black[  ] 0 sd 0 lw 1 1 1 c black 3 lw 0.999 0.999 0.999 c black 1814 1726 227 216 bl 0.999 0.999 0.999 c black 1814 1726 227 216 bl 0 lw 227 216 m 1814 X s 227 216 m 1726 Y s 6 lw 517 1787 m 183 X s
 gsave  2268 2158 0 0 C 745 1765 t 0 r /Helvetica findfont 54.8641 sf 0 0 m (LO - MSSM) show NC gr  0.999 0.999 0.999 c black 227 1143 m 90 X 5 Y 91 X 8 Y 91 X 14 Y 91 X 18 Y 90 X 22 Y 91 X 27 Y 91 X 34 Y 90 X 34 Y 91 X 41 Y 91 X 50 Y 91 X 49 Y 90 X
 50 Y 91 X 54 Y 91 X 56 Y 90 X 50 Y 91 X 51 Y 91 X 39 Y 91 X 27 Y 90 X -562 Y 91 X s 0 1 0 c[ 4 8] 0 sd 9 lw 517 1718 m 183 X s black
 gsave  2268 2158 0 0 C 745 1696 t 0 r /Helvetica findfont 54.8641 sf 0 0 m (NLO - MSSM) show NC gr  0 1 0 c 0.999 0.999 0.999 c black 0 1 0 c 227 333 m 90 X -2 Y 91 X 24 Y 182 X 9 Y 90 X 47 Y 91 X 15 Y 91 X 29 Y 90 X 36 Y 91 X 43 Y 91 X 48 Y 91 X
 27 Y 90 X 39 Y 91 X 41 Y 91 X 30 Y 90 X 43 Y 91 X 14 Y 91 X 17 Y 91 X 12 Y 90 X -275 Y 91 X s 1 0 1 c[ 20 12 4 12] 0 sd 517 1649 m 183 X s black
 gsave  2268 2158 0 0 C 1280 1618 t 0 r /Helvetica findfont 36.5761 sf 0 0 m (A) show NC gr 
 gsave  2268 2158 0 0 C 745 1641 t 0 r /Helvetica findfont 54.8641 sf 0 0 m (NLO - rescaled SM, S) show NC gr  1 0 1 c 0.999 0.999 0.999 c black 1 0 1 c 227 1078 m 90 X -4 Y 91 X 21 Y 91 X -54 Y 91 X 61 Y 90 X 56 Y 91 X 13 Y 91 X 39 Y 90 X 35 Y 91 X
 30 Y 91 X 79 Y 91 X 39 Y 90 X 45 Y 91 X 51 Y 91 X 56 Y 90 X 51 Y 91 X 20 Y 91 X 57 Y 91 X 37 Y 90 X -573 Y 91 X s 1 0 0 c[ 12 12] 0 sd 517 1580 m 183 X s black
 gsave  2268 2158 0 0 C 1280 1550 t 0 r /Helvetica findfont 36.5761 sf 0 0 m (Z) show NC gr 
 gsave  2268 2158 0 0 C 745 1573 t 0 r /Helvetica findfont 54.8641 sf 0 0 m (NLO - rescaled SM, S) show NC gr  1 0 0 c 0.999 0.999 0.999 c black 1 0 0 c 227 1064 m 90 X -4 Y 91 X 21 Y 91 X -53 Y 91 X 59 Y 90 X 55 Y 91 X 13 Y 91 X 39 Y 90 X 34 Y 91 X
 29 Y 91 X 78 Y 91 X 39 Y 90 X 44 Y 91 X 50 Y 91 X 55 Y 90 X 50 Y 91 X 20 Y 91 X 56 Y 91 X 36 Y 90 X -563 Y 91 X s black[  ] 0 sd 0 lw 227 216 m 1726 Y s
 gsave  2268 2158 0 0 C 69 1843 t 90 r /Helvetica findfont 68.5801 sf 0 0 m (\(fb\)) show NC gr 
 gsave  2268 2158 0 0 C 110 1820 t 90 r /Helvetica findfont 45.7201 sf 0 0 m (jj) show NC gr 
 gsave  2268 2158 0 0 C 69 1783 t 90 r /Symbol findfont 68.5801 sf 0 0 m (f) show NC gr 
 gsave  2268 2158 0 0 C 69 1765 t 90 r /Helvetica findfont 68.5801 sf 0 0 m ( ) show NC gr 
 gsave  2268 2158 0 0 C 69 1719 t 90 r /Symbol findfont 68.5801 sf 0 0 m (D) show NC gr 
 gsave  2268 2158 0 0 C 69 1660 t 90 r /Helvetica findfont 68.5801 sf 0 0 m (/d) show NC gr 
 gsave  2268 2158 0 0 C 69 1618 t 90 r /Symbol findfont 68.5801 sf 0 0 m (s) show NC gr 
 gsave  2268 2158 0 0 C 69 1582 t 90 r /Helvetica findfont 68.5801 sf 0 0 m (d) show NC gr  281 216 m -54 X s 254 254 m -27 X s 254 293 m -27 X s 254 331 m -27 X s 254 369 m -27 X s 281 408 m -54 X s 254 446 m -27 X s 254 484 m -27 X s 254 523 m -27
 X s 254 561 m -27 X s 281 599 m -54 X s 254 638 m -27 X s 254 676 m -27 X s 254 715 m -27 X s 254 753 m -27 X s 281 791 m -54 X s 254 830 m -27 X s 254 868 m -27 X s 254 906 m -27 X s 254 945 m -27 X s 281 983 m -54 X s 254 1021 m -27 X s 254 1060
 m -27 X s 254 1098 m -27 X s 254 1137 m -27 X s 281 1175 m -54 X s 254 1213 m -27 X s 254 1252 m -27 X s 254 1290 m -27 X s 254 1328 m -27 X s 281 1367 m -54 X s 254 1405 m -27 X s 254 1443 m -27 X s 254 1482 m -27 X s 254 1520 m -27 X s 281 1559 m
 -54 X s 254 1597 m -27 X s 254 1635 m -27 X s 254 1674 m -27 X s 254 1712 m -27 X s 281 1750 m -54 X s 254 1789 m -27 X s 254 1827 m -27 X s 254 1865 m -27 X s 254 1904 m -27 X s 281 1942 m -54 X s
 gsave  2268 2158 0 0 C 183 201 t 0 r /Helvetica findfont 41.1481 sf 0 0 m (0) show NC gr 
 gsave  2268 2158 0 0 C 123 393 t 0 r /Helvetica findfont 41.1481 sf 0 0 m (0.05) show NC gr 
 gsave  2268 2158 0 0 C 155 585 t 0 r /Helvetica findfont 41.1481 sf 0 0 m (0.1) show NC gr 
 gsave  2268 2158 0 0 C 123 777 t 0 r /Helvetica findfont 41.1481 sf 0 0 m (0.15) show NC gr 
 gsave  2268 2158 0 0 C 146 969 t 0 r /Helvetica findfont 41.1481 sf 0 0 m (0.2) show NC gr 
 gsave  2268 2158 0 0 C 123 1157 t 0 r /Helvetica findfont 41.1481 sf 0 0 m (0.25) show NC gr 
 gsave  2268 2158 0 0 C 146 1349 t 0 r /Helvetica findfont 41.1481 sf 0 0 m (0.3) show NC gr 
 gsave  2268 2158 0 0 C 123 1541 t 0 r /Helvetica findfont 41.1481 sf 0 0 m (0.35) show NC gr 
 gsave  2268 2158 0 0 C 146 1733 t 0 r /Helvetica findfont 41.1481 sf 0 0 m (0.4) show NC gr 
 gsave  2268 2158 0 0 C 123 1925 t 0 r /Helvetica findfont 41.1481 sf 0 0 m (0.45) show NC gr  2041 216 m 1726 Y s 1987 216 m 54 X s 2014 254 m 27 X s 2014 293 m 27 X s 2014 331 m 27 X s 2014 369 m 27 X s 1987 408 m 54 X s 2014 446 m 27 X s 2014 484
 m 27 X s 2014 523 m 27 X s 2014 561 m 27 X s 1987 599 m 54 X s 2014 638 m 27 X s 2014 676 m 27 X s 2014 715 m 27 X s 2014 753 m 27 X s 1987 791 m 54 X s 2014 830 m 27 X s 2014 868 m 27 X s 2014 906 m 27 X s 2014 945 m 27 X s 1987 983 m 54 X s 2014
 1021 m 27 X s 2014 1060 m 27 X s 2014 1098 m 27 X s 2014 1137 m 27 X s 1987 1175 m 54 X s 2014 1213 m 27 X s 2014 1252 m 27 X s 2014 1290 m 27 X s 2014 1328 m 27 X s 1987 1367 m 54 X s 2014 1405 m 27 X s 2014 1443 m 27 X s 2014 1482 m 27 X s 2014
 1520 m 27 X s 1987 1559 m 54 X s 2014 1597 m 27 X s 2014 1635 m 27 X s 2014 1674 m 27 X s 2014 1712 m 27 X s 1987 1750 m 54 X s 2014 1789 m 27 X s 2014 1827 m 27 X s 2014 1865 m 27 X s 2014 1904 m 27 X s 1987 1942 m 54 X s 227 1942 m 1814 X s 227
 1890 m 52 Y s 283 1916 m 26 Y s 340 1916 m 26 Y s 397 1916 m 26 Y s 454 1916 m 26 Y s 510 1890 m 52 Y s 567 1916 m 26 Y s 624 1916 m 26 Y s 680 1916 m 26 Y s 737 1916 m 26 Y s 794 1890 m 52 Y s 850 1916 m 26 Y s 907 1916 m 26 Y s 964 1916 m 26 Y s
 1020 1916 m 26 Y s 1077 1890 m 52 Y s 1134 1916 m 26 Y s 1191 1916 m 26 Y s 1247 1916 m 26 Y s 1304 1916 m 26 Y s 1361 1890 m 52 Y s 1417 1916 m 26 Y s 1474 1916 m 26 Y s 1531 1916 m 26 Y s 1587 1916 m 26 Y s 1644 1890 m 52 Y s 1701 1916 m 26 Y s
 1757 1916 m 26 Y s 1814 1916 m 26 Y s 1871 1916 m 26 Y s 1928 1890 m 52 Y s 1928 1890 m 52 Y s 1984 1916 m 26 Y s 2041 1916 m 26 Y s 227 216 m 1814 X s
 gsave  2268 2158 0 0 C 2012 37 t 0 r /Helvetica findfont 54.8641 sf 0 0 m (jj) show NC gr 
 gsave  2268 2158 0 0 C 1971 78 t 0 r /Symbol findfont 82.2962 sf 0 0 m (f) show NC gr 
 gsave  2268 2158 0 0 C 1948 78 t 0 r /Helvetica findfont 82.2962 sf 0 0 m ( ) show NC gr 
 gsave  2268 2158 0 0 C 1897 78 t 0 r /Symbol findfont 82.2962 sf 0 0 m (D) show NC gr  227 268 m -52 Y s 283 242 m -26 Y s 340 242 m -26 Y s 397 242 m -26 Y s 454 242 m -26 Y s 510 268 m -52 Y s 567 242 m -26 Y s 624 242 m -26 Y s 680 242 m -26 Y s
 737 242 m -26 Y s 794 268 m -52 Y s 850 242 m -26 Y s 907 242 m -26 Y s 964 242 m -26 Y s 1020 242 m -26 Y s 1077 268 m -52 Y s 1134 242 m -26 Y s 1191 242 m -26 Y s 1247 242 m -26 Y s 1304 242 m -26 Y s 1361 268 m -52 Y s 1417 242 m -26 Y s 1474
 242 m -26 Y s 1531 242 m -26 Y s 1587 242 m -26 Y s 1644 268 m -52 Y s 1701 242 m -26 Y s 1757 242 m -26 Y s 1814 242 m -26 Y s 1871 242 m -26 Y s 1928 268 m -52 Y s 1928 268 m -52 Y s 1984 242 m -26 Y s 2041 242 m -26 Y s
 gsave  2268 2158 0 0 C 210 169 t 0 r /Helvetica findfont 41.1481 sf 0 0 m (0) show NC gr 
 gsave  2268 2158 0 0 C 475 169 t 0 r /Helvetica findfont 41.1481 sf 0 0 m (0.5) show NC gr 
 gsave  2268 2158 0 0 C 782 169 t 0 r /Helvetica findfont 41.1481 sf 0 0 m (1) show NC gr 
 gsave  2268 2158 0 0 C 1042 169 t 0 r /Helvetica findfont 41.1481 sf 0 0 m (1.5) show NC gr 
 gsave  2268 2158 0 0 C 1344 169 t 0 r /Helvetica findfont 41.1481 sf 0 0 m (2) show NC gr 
 gsave  2268 2158 0 0 C 1609 169 t 0 r /Helvetica findfont 41.1481 sf 0 0 m (2.5) show NC gr 
 gsave  2268 2158 0 0 C 1911 169 t 0 r /Helvetica findfont 41.1481 sf 0 0 m (3) show NC gr 
 gr  gr 
showpage
end
%%EOF
