%!PS-Adobe-2.0 EPSF-2.0
%%BoundingBox:  0 0 567 384
%%Title: plots/GenMHiggs_Powheg_v_Pythia.150GeV.gg.cut2.eps: c1
%%Creator: ROOT Version 5.28/00b
%%CreationDate: Sun Dec  4 23:59:30 2011
%%EndComments
%%BeginProlog
80 dict begin
/s {stroke} def /l {lineto} def /m {moveto} def /t {translate} def
/r {rotate} def /rl {roll}  def /R {repeat} def
/d {rlineto} def /rm {rmoveto} def /gr {grestore} def /f {eofill} def
/c {setrgbcolor} def /black {0 setgray} def /sd {setdash} def
/cl {closepath} def /sf {scalefont setfont} def /lw {setlinewidth} def
/box {m dup 0 exch d exch 0 d 0 exch neg d cl} def
/NC{systemdict begin initclip end}def/C{NC box clip newpath}def
/bl {box s} def /bf {box f} def /Y { 0 exch d} def /X { 0 d} def 
/K {{pop pop 0 moveto} exch kshow} bind def
/ita {/ang 15 def gsave [1 0 ang dup sin exch cos div 1 0 0] concat} def 
/mp {newpath /y exch def /x exch def} def
/side {[w .77 mul w .23 mul] .385 w mul sd w 0 l currentpoint t -144 r} def
/mr {mp x y w2 0 360 arc} def /m24 {mr s} def /m20 {mr f} def
/mb {mp x y w2 add m w2 neg 0 d 0 w neg d w 0 d 0 w d cl} def
/mt {mp x y w2 add m w2 neg w neg d w 0 d cl} def
/m21 {mb f} def /m25 {mb s} def /m22 {mt f} def /m26{mt s} def
/m23 {mp x y w2 sub m w2 w d w neg 0 d cl f} def
/m27 {mp x y w2 add m w3 neg w2 neg d w3 w2 neg d w3 w2 d cl s} def
/m28 {mp x w2 sub y w2 sub w3 add m w3 0 d  0 w3 neg d w3 0 d 0 w3 d w3 0 d  0 w3 d w3 neg 0 d 0 w3 d w3 neg 0 d 0 w3 neg d w3 neg 0 d cl s } def
/m29 {mp gsave x w2 sub y w2 add w3 sub m currentpoint t 4 {side} repeat cl fill gr} def
/m30 {mp gsave x w2 sub y w2 add w3 sub m currentpoint t 4 {side} repeat cl s gr} def
/m31 {mp x y w2 sub m 0 w d x w2 sub y m w 0 d x w2 sub y w2 add m w w neg d x w2 sub y w2 sub m w w d s} def
/m32 {mp x y w2 sub m w2 w d w neg 0 d cl s} def
/m33 {mp x y w2 add m w3 neg w2 neg d w3 w2 neg d w3 w2 d cl f} def
/m34 {mp x w2 sub y w2 sub w3 add m w3 0 d  0 w3 neg d w3 0 d 0 w3 d w3 0 d  0 w3 d w3 neg 0 d 0 w3 d w3 neg 0 d 0 w3 neg d w3 neg 0 d cl f } def
/m2 {mp x y w2 sub m 0 w d x w2 sub y m w 0 d s} def
/m5 {mp x w2 sub y w2 sub m w w d x w2 sub y w2 add m w w neg d s} def
/reEncode {exch findfont dup length dict begin {1 index /FID eq  {pop pop} {def} ifelse } forall /Encoding exch def currentdict end dup /FontName get exch definefont pop } def [/Times-Bold /Times-Italic /Times-BoldItalic /Helvetica /Helvetica-Oblique
 /Helvetica-Bold /Helvetica-BoldOblique /Courier /Courier-Oblique /Courier-Bold /Courier-BoldOblique /Times-Roman /AvantGarde-Book /AvantGarde-BookOblique /AvantGarde-Demi /AvantGarde-DemiOblique /Bookman-Demi /Bookman-DemiItalic /Bookman-Light
 /Bookman-LightItalic /Helvetica-Narrow /Helvetica-Narrow-Bold /Helvetica-Narrow-BoldOblique /Helvetica-Narrow-Oblique /NewCenturySchlbk-Roman /NewCenturySchlbk-Bold /NewCenturySchlbk-BoldItalic /NewCenturySchlbk-Italic /Palatino-Bold
 /Palatino-BoldItalic /Palatino-Italic /Palatino-Roman ] {ISOLatin1Encoding reEncode } forall%%EndProlog
%%BeginSetup
%%EndSetup
newpath  gsave  .25 .25 scale  gsave  0 0 t black[  ] 0 sd 3 lw 1 1 1 c 2268 1538 0 0 bf black 1 1 1 c 1791 1215 363 246 bf black 1791 1215 363 246 bl 1 0 0 c 6 lw 1 1 1 c black 1 0 0 c 363 249 m 9 X -3 Y 9 X 1 Y 9 X 1 Y 26 X 2 Y 9 X -4 Y 9 X 1 Y 9 X
 1 Y 9 X -1 Y 9 X 1 Y 9 X 1 Y 27 X -2 Y 8 X 2 Y 9 X -2 Y 9 X 5 Y 9 X -5 Y 18 X 3 Y 9 X -1 Y 18 X 2 Y 9 X -2 Y 17 X 2 Y 9 X -4 Y 9 X 2 Y 27 X -2 Y 9 X 5 Y 9 X -5 Y 9 X 2 Y 9 X 2 Y 18 X -2 Y 8 X 3 Y 9 X -2 Y 9 X 3 Y 9 X -3 Y 9 X 2 Y 9 X -1 Y 18 X 3 Y
 18 X -3 Y 9 X 4 Y 8 X -4 Y 18 X 3 Y 9 X -3 Y 9 X 2 Y 9 X 3 Y 9 X 3 Y 9 X -5 Y 9 X -1 Y 9 X 1 Y 9 X 6 Y 9 X -4 Y 8 X 1 Y 9 X 2 Y 9 X -5 Y 9 X 3 Y 9 X 1 Y 9 X 7 Y 18 X 2 Y 9 X -8 Y 9 X 11 Y 9 X -2 Y 8 X 4 Y 9 X -4 Y 9 X 6 Y 9 X 1 Y 18 X 9 Y 9 X 7 Y 18
 X 4 Y 9 X 8 Y 9 X -5 Y 9 X 21 Y 8 X 1 Y 9 X 8 Y 9 X 12 Y 9 X 9 Y 9 X 11 Y 9 X 27 Y 9 X 11 Y 9 X 61 Y 9 X 29 Y 9 X 60 Y 9 X 84 Y 8 X 107 Y 9 X 162 Y 9 X 169 Y 9 X 215 Y 9 X 91 Y 9 X 27 Y 9 X -149 Y 9 X -183 Y 9 X -198 Y 9 X -107 Y 9 X -116 Y 9 X -80
 Y 8 X -82 Y 9 X -23 Y 9 X -57 Y 9 X -30 Y 9 X -18 Y 9 X -14 Y 9 X -6 Y 9 X -16 Y 9 X -21 Y 9 X 4 Y 9 X -12 Y 8 X 10 Y 9 X -9 Y 9 X -14 Y 18 X 2 Y 18 X -10 Y 9 X 3 Y 9 X -1 Y 9 X -10 Y 9 X -3 Y 17 X -4 Y 9 X 6 Y 9 X 2 Y 9 X -2 Y 9 X -4 Y 9 X -3 Y 18
 X 1 Y 9 X 2 Y 18 X -2 Y 8 X -3 Y 9 X 5 Y 9 X -9 Y 9 X 3 Y 9 X -2 Y 18 X -1 Y 9 X 7 Y 9 X -8 Y 9 X 3 Y 18 X 3 Y 8 X -6 Y 9 X -2 Y 9 X 1 Y 9 X 3 Y 9 X -2 Y 18 X -1 Y 9 X 2 Y 18 X -1 Y 9 X -1 Y 8 X -1 Y 9 X 5 Y 9 X -5 Y 18 X -1 Y 9 X 2 Y 9 X 1 Y 9 X -3
 Y 9 X 1 Y 9 X -2 Y 9 X 3 Y 9 X 1 Y 17 X -3 Y 9 X -1 Y 9 X 4 Y 18 X -4 Y 9 X 4 Y 9 X -4 Y 18 X 3 Y 9 X 1 Y 8 X -2 Y 9 X 2 Y 9 X -4 Y 9 X 1 Y 18 X 1 Y 9 X -2 Y 9 X 4 Y 9 X -4 Y 18 X 2 Y 17 X -1 Y 9 X s black 3 lw 363 246 m 1791 X s
 gsave  2268 1538 0 0 C 1545 114.062 t 0 r /Helvetica findfont 71.6807 sf 0 0 m (Gen MHiggs \(GeV\)) show NC gr  372 283 m -37 Y s 416 264 m -18 Y s 461 264 m -18 Y s 505 264 m -18 Y s 550 264 m -18 Y s 595 283 m -37 Y s 639 264 m -18 Y s 684 264 m
 -18 Y s 728 264 m -18 Y s 773 264 m -18 Y s 817 283 m -37 Y s 862 264 m -18 Y s 907 264 m -18 Y s 951 264 m -18 Y s 996 264 m -18 Y s 1040 283 m -37 Y s 1085 264 m -18 Y s 1129 264 m -18 Y s 1174 264 m -18 Y s 1218 264 m -18 Y s 1263 283 m -37 Y s
 1308 264 m -18 Y s 1352 264 m -18 Y s 1397 264 m -18 Y s 1441 264 m -18 Y s 1486 283 m -37 Y s 1530 264 m -18 Y s 1575 264 m -18 Y s 1620 264 m -18 Y s 1664 264 m -18 Y s 1709 283 m -37 Y s 1753 264 m -18 Y s 1798 264 m -18 Y s 1842 264 m -18 Y s
 1887 264 m -18 Y s 1932 283 m -37 Y s 1976 264 m -18 Y s 2021 264 m -18 Y s 2065 264 m -18 Y s 2110 264 m -18 Y s 2154 283 m -37 Y s 372 283 m -37 Y s 2154 283 m -37 Y s
 gsave  2268 1538 0 0 C 280.812 179.188 t 0 r /Helvetica findfont 71.6807 sf 0 0 m (149.8) show NC gr 
 gsave  2268 1538 0 0 C 482.812 179.188 t 0 r /Helvetica findfont 71.6807 sf 0 0 m (149.85) show NC gr 
 gsave  2268 1538 0 0 C 723.938 179.188 t 0 r /Helvetica findfont 71.6807 sf 0 0 m (149.9) show NC gr 
 gsave  2268 1538 0 0 C 929.188 179.188 t 0 r /Helvetica findfont 71.6807 sf 0 0 m (149.95) show NC gr 
 gsave  2268 1538 0 0 C 1202.88 179.188 t 0 r /Helvetica findfont 71.6807 sf 0 0 m (150) show NC gr 
 gsave  2268 1538 0 0 C 1375.56 179.188 t 0 r /Helvetica findfont 71.6807 sf 0 0 m (150.05) show NC gr 
 gsave  2268 1538 0 0 C 1623.19 179.188 t 0 r /Helvetica findfont 71.6807 sf 0 0 m (150.1) show NC gr 
 gsave  2268 1538 0 0 C 1818.69 179.188 t 0 r /Helvetica findfont 71.6807 sf 0 0 m (150.15) show NC gr 
 gsave  2268 1538 0 0 C 2066.31 179.188 t 0 r /Helvetica findfont 71.6807 sf 0 0 m (150.2) show NC gr  363 1461 m 1791 X s 372 1425 m 36 Y s 416 1443 m 18 Y s 461 1443 m 18 Y s 505 1443 m 18 Y s 550 1443 m 18 Y s 595 1425 m 36 Y s 639 1443 m 18 Y s
 684 1443 m 18 Y s 728 1443 m 18 Y s 773 1443 m 18 Y s 817 1425 m 36 Y s 862 1443 m 18 Y s 907 1443 m 18 Y s 951 1443 m 18 Y s 996 1443 m 18 Y s 1040 1425 m 36 Y s 1085 1443 m 18 Y s 1129 1443 m 18 Y s 1174 1443 m 18 Y s 1218 1443 m 18 Y s 1263 1425
 m 36 Y s 1308 1443 m 18 Y s 1352 1443 m 18 Y s 1397 1443 m 18 Y s 1441 1443 m 18 Y s 1486 1425 m 36 Y s 1530 1443 m 18 Y s 1575 1443 m 18 Y s 1620 1443 m 18 Y s 1664 1443 m 18 Y s 1709 1425 m 36 Y s 1753 1443 m 18 Y s 1798 1443 m 18 Y s 1842 1443 m
 18 Y s 1887 1443 m 18 Y s 1932 1425 m 36 Y s 1976 1443 m 18 Y s 2021 1443 m 18 Y s 2065 1443 m 18 Y s 2110 1443 m 18 Y s 2154 1425 m 36 Y s 372 1425 m 36 Y s 2154 1425 m 36 Y s 363 246 m 1215 Y s
 gsave  2268 1538 0 0 C 127.688 690.688 t 90 r /Helvetica findfont 71.6807 sf 0 0 m (arbitrary units) show NC gr  417 246 m -54 X s 390 275 m -27 X s 390 303 m -27 X s 390 331 m -27 X s 390 360 m -27 X s 417 388 m -54 X s 390 417 m -27 X
 s 390 445 m -27 X s 390 474 m -27 X s 390 502 m -27 X s 417 531 m -54 X s 390 559 m -27 X s 390 588 m -27 X s 390 616 m -27 X s 390 645 m -27 X s 417 673 m -54 X s 390 701 m -27 X s 390 730 m -27 X s 390 758 m -27 X s 390 787 m -27 X s 417 815 m -54
 X s 390 844 m -27 X s 390 872 m -27 X s 390 901 m -27 X s 390 929 m -27 X s 417 958 m -54 X s 390 986 m -27 X s 390 1015 m -27 X s 390 1043 m -27 X s 390 1071 m -27 X s 417 1100 m -54 X s 390 1128 m -27 X s 390 1157 m -27 X s 390 1185 m -27 X s 390
 1214 m -27 X s 417 1242 m -54 X s 390 1271 m -27 X s 390 1299 m -27 X s 390 1328 m -27 X s 390 1356 m -27 X s 417 1385 m -54 X s 417 1385 m -54 X s 390 1413 m -27 X s 390 1442 m -27 X s
 gsave  2268 1538 0 0 C 310.125 221.562 t 0 r /Helvetica findfont 71.6807 sf 0 0 m (0) show NC gr 
 gsave  2268 1538 0 0 C 222.188 364.875 t 0 r /Helvetica findfont 71.6807 sf 0 0 m (0.01) show NC gr 
 gsave  2268 1538 0 0 C 212.375 504.938 t 0 r /Helvetica findfont 71.6807 sf 0 0 m (0.02) show NC gr 
 gsave  2268 1538 0 0 C 212.375 648.312 t 0 r /Helvetica findfont 71.6807 sf 0 0 m (0.03) show NC gr 
 gsave  2268 1538 0 0 C 212.375 791.688 t 0 r /Helvetica findfont 71.6807 sf 0 0 m (0.04) show NC gr 
 gsave  2268 1538 0 0 C 212.375 931.812 t 0 r /Helvetica findfont 71.6807 sf 0 0 m (0.05) show NC gr 
 gsave  2268 1538 0 0 C 212.375 1075.12 t 0 r /Helvetica findfont 71.6807 sf 0 0 m (0.06) show NC gr 
 gsave  2268 1538 0 0 C 212.375 1218.5 t 0 r /Helvetica findfont 71.6807 sf 0 0 m (0.07) show NC gr 
 gsave  2268 1538 0 0 C 212.375 1358.62 t 0 r /Helvetica findfont 71.6807 sf 0 0 m (0.08) show NC gr  2154 246 m 1215 Y s 2101 246 m 53 X s 2127 275 m 27 X s 2127 303 m 27 X s 2127 331 m 27 X s 2127 360 m 27 X s 2101 388 m 53 X s 2127 417 m 27 X s
 2127 445 m 27 X s 2127 474 m 27 X s 2127 502 m 27 X s 2101 531 m 53 X s 2127 559 m 27 X s 2127 588 m 27 X s 2127 616 m 27 X s 2127 645 m 27 X s 2101 673 m 53 X s 2127 701 m 27 X s 2127 730 m 27 X s 2127 758 m 27 X s 2127 787 m 27 X s 2101 815 m 53 X
 s 2127 844 m 27 X s 2127 872 m 27 X s 2127 901 m 27 X s 2127 929 m 27 X s 2101 958 m 53 X s 2127 986 m 27 X s 2127 1015 m 27 X s 2127 1043 m 27 X s 2127 1071 m 27 X s 2101 1100 m 53 X s 2127 1128 m 27 X s 2127 1157 m 27 X s 2127 1185 m 27 X s 2127
 1214 m 27 X s 2101 1242 m 53 X s 2127 1271 m 27 X s 2127 1299 m 27 X s 2127 1328 m 27 X s 2127 1356 m 27 X s 2101 1385 m 53 X s 2101 1385 m 53 X s 2127 1413 m 27 X s 2127 1442 m 27 X s 6 lw 1 1 1 c black 363 247 m 9 X 3 Y 9 X -3 Y 26 X 1 Y 18 X -2 Y
 9 X 2 Y 18 X 1 Y 9 X -3 Y 9 X 4 Y 9 X -1 Y 9 X -1 Y 9 X 4 Y 8 X -5 Y 9 X 2 Y 9 X -1 Y 9 X 2 Y 9 X 2 Y 18 X -3 Y 18 X -2 Y 9 X 3 Y 9 X -2 Y 17 X 2 Y 18 X -1 Y 9 X -3 Y 9 X 3 Y 18 X 1 Y 9 X -2 Y 9 X 6 Y 9 X -2 Y 9 X -2 Y 8 X -2 Y 9 X 10 Y 9 X -9 Y 9 X
 3 Y 18 X -4 Y 9 X 7 Y 9 X -6 Y 9 X 6 Y 9 X -3 Y 9 X 3 Y 8 X -6 Y 9 X 5 Y 9 X 1 Y 9 X -5 Y 9 X -1 Y 9 X 5 Y 9 X 2 Y 9 X 2 Y 9 X 4 Y 9 X -7 Y 9 X -3 Y 9 X 7 Y 8 X -2 Y 9 X 10 Y 9 X -3 Y 9 X -4 Y 9 X 2 Y 9 X -2 Y 9 X 2 Y 9 X 7 Y 9 X 1 Y 9 X -2 Y 9 X 5
 Y 8 X 3 Y 9 X 2 Y 9 X 2 Y 9 X 1 Y 18 X -1 Y 9 X 12 Y 9 X -8 Y 9 X 18 Y 9 X -9 Y 9 X 8 Y 9 X 17 Y 8 X -6 Y 9 X 24 Y 9 X 15 Y 9 X 24 Y 9 X 14 Y 9 X 19 Y 9 X 23 Y 9 X 35 Y 9 X 42 Y 9 X 57 Y 9 X 103 Y 8 X 87 Y 9 X 144 Y 9 X 140 Y 9 X 128 Y 9 X 76 Y 9 X
 68 Y 9 X -107 Y 9 X -157 Y 9 X -188 Y 9 X -134 Y 9 X -75 Y 9 X -91 Y 8 X -55 Y 9 X -49 Y 9 X -26 Y 9 X -20 Y 9 X -29 Y 9 X -24 Y 9 X -16 Y 9 X 14 Y 9 X -23 Y 9 X -7 Y 9 X -8 Y 8 X -5 Y 9 X -7 Y 9 X -16 Y 9 X -16 Y 9 X 7 Y 9 X 16 Y 9 X -25 Y 9 X 7 Y
 9 X -8 Y 9 X 3 Y 9 X -1 Y 9 X 1 Y 8 X -6 Y 9 X 2 Y 9 X -3 Y 18 X -3 Y 9 X -2 Y 9 X 2 Y 9 X -3 Y 9 X -2 Y 9 X 3 Y 9 X -4 Y 17 X -2 Y 9 X 5 Y 9 X 1 Y 9 X -2 Y 9 X -5 Y 9 X -3 Y 18 X 3 Y 9 X 5 Y 9 X -5 Y 9 X 4 Y 8 X -9 Y 9 X 7 Y 9 X -5 Y 9 X -1 Y 9 X
 10 Y 9 X -6 Y 9 X -3 Y 9 X -4 Y 9 X 6 Y 9 X -4 Y 9 X 5 Y 8 X -6 Y 9 X 2 Y 9 X 3 Y 18 X 5 Y 9 X -3 Y 9 X -7 Y 9 X 3 Y 9 X -2 Y 9 X 4 Y 9 X 2 Y 9 X -8 Y 8 X 6 Y 9 X -3 Y 9 X -2 Y 9 X 1 Y 9 X 5 Y 9 X -3 Y 18 X 4 Y 9 X -7 Y 9 X 3 Y 9 X -4 Y 8 X 1 Y 9 X
 1 Y 9 X -1 Y 9 X 2 Y 9 X 1 Y 9 X -3 Y 9 X 5 Y 9 X -6 Y 9 X 1 Y 9 X 1 Y 9 X -1 Y 9 X 2 Y 17 X s
 gsave  2268 1538 0 0 C 821.688 1313 t 0 r /Helvetica findfont 45.615 sf 0 0 m ( H\(150GeV\)) show NC gr 
 gsave  2268 1538 0 0 C 776.062 1313 t 0 r /Helvetica findfont 45.615 sf 0 0 m ( to ) show NC gr 
 gsave  2268 1538 0 0 C 538.188 1313 t 0 r /Helvetica findfont 45.615 sf 0 0 m ( Powheg gg) show NC gr  370 1326 m 139 X s
 gsave  2268 1538 0 0 C 821.688 1195.69 t 0 r /Helvetica findfont 45.615 sf 0 0 m ( H\(150GeV\)) show NC gr 
 gsave  2268 1538 0 0 C 776.062 1195.69 t 0 r /Helvetica findfont 45.615 sf 0 0 m ( to ) show NC gr 
 gsave  2268 1538 0 0 C 538.188 1195.69 t 0 r /Helvetica findfont 45.615 sf 0 0 m ( Pythia    gg) show NC gr  1 0 0 c 370 1211 m 139 X s black
 gsave  2268 1538 0 0 C 2222.69 1117.5 t 90 r /Helvetica-BoldOblique findfont 29.3239 sf 0 0 m 
 317 303 287 271 263 240 213 205 186 167 159 140 118 95 87 67 59 38 17
(LHC HIGGS XS WG 2011) K NC gr 
 gr  gr showpage
end
%%EOF
