%!PS-Adobe-2.0 EPSF-2.0
%%BoundingBox:  0 0 567 547
%%Title: /home/shiki/Desktop/MCFM/HiggsAcc/mH120/Correlation_120.eps: Higgs Cross Section
%%Creator: ROOT Version 5.28/00
%%CreationDate: Tue Nov 29 15:43:57 2011
%%EndComments
%%BeginProlog
80 dict begin
/s {stroke} def /l {lineto} def /m {moveto} def /t {translate} def
/r {rotate} def /rl {roll}  def /R {repeat} def
/d {rlineto} def /rm {rmoveto} def /gr {grestore} def /f {eofill} def
/c {setrgbcolor} def /black {0 setgray} def /sd {setdash} def
/cl {closepath} def /sf {scalefont setfont} def /lw {setlinewidth} def
/box {m dup 0 exch d exch 0 d 0 exch neg d cl} def
/NC{systemdict begin initclip end}def/C{NC box clip newpath}def
/bl {box s} def /bf {box f} def /Y { 0 exch d} def /X { 0 d} def 
/K {{pop pop 0 moveto} exch kshow} bind def
/ita {/ang 15 def gsave [1 0 ang dup sin exch cos div 1 0 0] concat} def 
/mp {newpath /y exch def /x exch def} def
/side {[w .77 mul w .23 mul] .385 w mul sd w 0 l currentpoint t -144 r} def
/mr {mp x y w2 0 360 arc} def /m24 {mr s} def /m20 {mr f} def
/mb {mp x y w2 add m w2 neg 0 d 0 w neg d w 0 d 0 w d cl} def
/mt {mp x y w2 add m w2 neg w neg d w 0 d cl} def
/m21 {mb f} def /m25 {mb s} def /m22 {mt f} def /m26{mt s} def
/m23 {mp x y w2 sub m w2 w d w neg 0 d cl f} def
/m27 {mp x y w2 add m w3 neg w2 neg d w3 w2 neg d w3 w2 d cl s} def
/m28 {mp x w2 sub y w2 sub w3 add m w3 0 d  0 w3 neg d w3 0 d 0 w3 d w3 0 d  0 w3 d w3 neg 0 d 0 w3 d w3 neg 0 d 0 w3 neg d w3 neg 0 d cl s } def
/m29 {mp gsave x w2 sub y w2 add w3 sub m currentpoint t 4 {side} repeat cl fill gr} def
/m30 {mp gsave x w2 sub y w2 add w3 sub m currentpoint t 4 {side} repeat cl s gr} def
/m31 {mp x y w2 sub m 0 w d x w2 sub y m w 0 d x w2 sub y w2 add m w w neg d x w2 sub y w2 sub m w w d s} def
/m32 {mp x y w2 sub m w2 w d w neg 0 d cl s} def
/m33 {mp x y w2 add m w3 neg w2 neg d w3 w2 neg d w3 w2 d cl f} def
/m34 {mp x w2 sub y w2 sub w3 add m w3 0 d  0 w3 neg d w3 0 d 0 w3 d w3 0 d  0 w3 d w3 neg 0 d 0 w3 d w3 neg 0 d 0 w3 neg d w3 neg 0 d cl f } def
/m2 {mp x y w2 sub m 0 w d x w2 sub y m w 0 d s} def
/m5 {mp x w2 sub y w2 sub m w w d x w2 sub y w2 add m w w neg d s} def
/reEncode {exch findfont dup length dict begin {1 index /FID eq  {pop pop} {def} ifelse } forall /Encoding exch def currentdict end dup /FontName get exch definefont pop } def [/Times-Bold /Times-Italic /Times-BoldItalic /Helvetica /Helvetica-Oblique
 /Helvetica-Bold /Helvetica-BoldOblique /Courier /Courier-Oblique /Courier-Bold /Courier-BoldOblique /Times-Roman /AvantGarde-Book /AvantGarde-BookOblique /AvantGarde-Demi /AvantGarde-DemiOblique /Bookman-Demi /Bookman-DemiItalic /Bookman-Light
 /Bookman-LightItalic /Helvetica-Narrow /Helvetica-Narrow-Bold /Helvetica-Narrow-BoldOblique /Helvetica-Narrow-Oblique /NewCenturySchlbk-Roman /NewCenturySchlbk-Bold /NewCenturySchlbk-BoldItalic /NewCenturySchlbk-Italic /Palatino-Bold
 /Palatino-BoldItalic /Palatino-Italic /Palatino-Roman ] {ISOLatin1Encoding reEncode } forall%%EndProlog
%%BeginSetup
%%EndSetup
newpath  gsave  .25 .25 scale  gsave  0 0 t black[  ] 0 sd 3 lw 1 1 1 c 2268 2190 0 0 bf black 1 1 1 c 1791 1730 363 350 bf black 1791 1730 363 350 bl 1 1 1 c 1791 1730 363 350 bf black 1791 1730 363 350 bl 363 350 m 1791 X s
 gsave  2268 2190 0 0 C 1252.25 190.375 t 0 r /Helvetica-Bold findfont 81.4553 sf 0 0 m 
 880 830 803 776 753 703 653 630 603 557 512 466 444 398 353 303 271 212 189 166 121 93 44
(Total Cross section \(fb\)) K NC gr  561 402 m -52 Y s 611 376 m -26 Y s 660 376 m -26 Y s 709 376 m -26 Y s 758 376 m -26 Y s 808 402 m -52 Y s 857 376 m -26 Y s 906 376 m -26 Y s 956 376 m -26 Y s 1005 376 m -26 Y s 1054 402 m -52 Y s 1103 376 m
 -26 Y s 1153 376 m -26 Y s 1202 376 m -26 Y s 1251 376 m -26 Y s 1300 402 m -52 Y s 1350 376 m -26 Y s 1399 376 m -26 Y s 1448 376 m -26 Y s 1497 376 m -26 Y s 1547 402 m -52 Y s 1596 376 m -26 Y s 1645 376 m -26 Y s 1694 376 m -26 Y s 1744 376 m
 -26 Y s 1793 402 m -52 Y s 1842 376 m -26 Y s 1892 376 m -26 Y s 1941 376 m -26 Y s 1990 376 m -26 Y s 2039 402 m -52 Y s 561 402 m -52 Y s 512 376 m -26 Y s 463 376 m -26 Y s 414 376 m -26 Y s 364 376 m -26 Y s 2039 402 m -52 Y s 2089 376 m -26 Y s
 2138 376 m -26 Y s
 gsave  2268 2190 0 0 C 493.062 281.562 t 0 r /Helvetica-Bold findfont 71.6807 sf 0 0 m (0.42) show NC gr 
 gsave  2268 2190 0 0 C 737.438 281.562 t 0 r /Helvetica-Bold findfont 71.6807 sf 0 0 m (0.43) show NC gr 
 gsave  2268 2190 0 0 C 981.812 281.562 t 0 r /Helvetica-Bold findfont 71.6807 sf 0 0 m (0.44) show NC gr 
 gsave  2268 2190 0 0 C 1229.44 281.562 t 0 r /Helvetica-Bold findfont 71.6807 sf 0 0 m (0.45) show NC gr 
 gsave  2268 2190 0 0 C 1473.75 281.562 t 0 r /Helvetica-Bold findfont 71.6807 sf 0 0 m (0.46) show NC gr 
 gsave  2268 2190 0 0 C 1724.69 281.562 t 0 r /Helvetica-Bold findfont 71.6807 sf 0 0 m (0.47) show NC gr 
 gsave  2268 2190 0 0 C 1969 281.562 t 0 r /Helvetica-Bold findfont 71.6807 sf 0 0 m (0.48) show NC gr  363 2080 m 1791 X s 561 2028 m 52 Y s 611 2054 m 26 Y s 660 2054 m 26 Y s 709 2054 m 26 Y s 758 2054 m 26 Y s 808 2028 m 52 Y s 857 2054 m 26 Y s
 906 2054 m 26 Y s 956 2054 m 26 Y s 1005 2054 m 26 Y s 1054 2028 m 52 Y s 1103 2054 m 26 Y s 1153 2054 m 26 Y s 1202 2054 m 26 Y s 1251 2054 m 26 Y s 1300 2028 m 52 Y s 1350 2054 m 26 Y s 1399 2054 m 26 Y s 1448 2054 m 26 Y s 1497 2054 m 26 Y s 1547
 2028 m 52 Y s 1596 2054 m 26 Y s 1645 2054 m 26 Y s 1694 2054 m 26 Y s 1744 2054 m 26 Y s 1793 2028 m 52 Y s 1842 2054 m 26 Y s 1892 2054 m 26 Y s 1941 2054 m 26 Y s 1990 2054 m 26 Y s 2039 2028 m 52 Y s 561 2028 m 52 Y s 512 2054 m 26 Y s 463 2054
 m 26 Y s 414 2054 m 26 Y s 364 2054 m 26 Y s 2039 2028 m 52 Y s 2089 2054 m 26 Y s 2138 2054 m 26 Y s 363 350 m 1730 Y s
 gsave  2268 2190 0 0 C 154.188 1203.62 t 90 r /Helvetica-Bold findfont 81.4553 sf 0 0 m (Lepton cut acceptance) show NC gr  417 532 m -54 X s 390 600 m -27 X s 390 667 m -27 X s 390 735 m -27 X s 390 802 m -27 X s 417 870 m -54 X s 390 937 m -27 X s
 390 1005 m -27 X s 390 1072 m -27 X s 390 1140 m -27 X s 417 1207 m -54 X s 390 1274 m -27 X s 390 1342 m -27 X s 390 1409 m -27 X s 390 1477 m -27 X s 417 1544 m -54 X s 390 1612 m -27 X s 390 1679 m -27 X s 390 1747 m -27 X s 390 1814 m -27 X s
 417 1882 m -54 X s 417 532 m -54 X s 390 465 m -27 X s 390 397 m -27 X s 417 1882 m -54 X s 390 1949 m -27 X s 390 2017 m -27 X s
 gsave  2268 2190 0 0 C 170.5 509.625 t 0 r /Helvetica-Bold findfont 71.6807 sf 0 0 m (0.535) show NC gr 
 gsave  2268 2190 0 0 C 209.562 845.25 t 0 r /Helvetica-Bold findfont 71.6807 sf 0 0 m (0.54) show NC gr 
 gsave  2268 2190 0 0 C 170.5 1184.12 t 0 r /Helvetica-Bold findfont 71.6807 sf 0 0 m (0.545) show NC gr 
 gsave  2268 2190 0 0 C 209.562 1522.94 t 0 r /Helvetica-Bold findfont 71.6807 sf 0 0 m (0.55) show NC gr 
 gsave  2268 2190 0 0 C 170.5 1858.56 t 0 r /Helvetica-Bold findfont 71.6807 sf 0 0 m (0.555) show NC gr  2154 350 m 1730 Y s 2101 532 m 53 X s 2127 600 m 27 X s 2127 667 m 27 X s 2127 735 m 27 X s 2127 802 m 27 X s 2101 870 m 53 X s 2127 937 m 27 X
 s 2127 1005 m 27 X s 2127 1072 m 27 X s 2127 1140 m 27 X s 2101 1207 m 53 X s 2127 1274 m 27 X s 2127 1342 m 27 X s 2127 1409 m 27 X s 2127 1477 m 27 X s 2101 1544 m 53 X s 2127 1612 m 27 X s 2127 1679 m 27 X s 2127 1747 m 27 X s 2127 1814 m 27 X s
 2101 1882 m 53 X s 2101 532 m 53 X s 2127 465 m 27 X s 2127 397 m 27 X s 2101 1882 m 53 X s 2127 1949 m 27 X s 2127 2017 m 27 X s 0.999 0.999 0.999 c black 0 0 1 c /w 39 def /w2 {w 2 div} def /w3 {w 3 div} def 847 1354 1039 1714 807 1478 941 1704
 884 1075 1154 859 1337 1055 1186 1336 899 1775 883 1157 871 898 950 1505 1083 1560 1187 1435 822 676 1164 1763 915 601 1319 1591 1235 1188 970 941 1434 1205 1434 1910 1354 1570 1319 1361 1310 1313 1125 1223 1196 1421 1003 1400 1298 1179 1151 999
 1108 1936 1313 1393 1287 1633 1572 1127 1758 1563 1435 1033 1366 1127 1443 1608 1272 1419 1493 1048 1300 918 1610 1019 1682 1289 1376 1364 1366 1228 1736 1596 1644 1509 1577 1383 1679 1494 2005 1055 50 { m22} R black 1 0 0 c 685 949 685 949 685 790
 709 863 660 876 857 826 512 915 808 838 537 989 734 778 635 803 685 949 685 949 635 643 758 1166 635 962 709 863 537 667 758 1008 611 1049 709 863 709 1180 660 717 783 1395 586 494 660 876 709 863 685 949 660 876 660 876 709 863 709 1022 660 876 734
 936 635 803 709 863 709 1022 685 949 685 790 685 790 709 1022 734 778 635 962 709 863 660 876 635 803 734 936 734 1094 586 655 685 949 660 876 734 936 537 989 53 { m20} R black 0 1 0 c 1373 952 1400 969 1351 937 1385 957 1359 946 1385 951 1356 953
 1384 951 1366 952 1353 956 1402 946 1256 975 1446 938 1404 949 1332 955 1332 954 1388 950 1350 1068 1372 820 1363 931 1382 971 1421 859 1287 1112 1348 1033 1389 900 1364 994 1377 932 1364 957 1395 933 1309 933 1490 973 1365 970 1376 944 1391 950
 1363 952 1370 909 1374 975 1420 1039 1278 772 1362 933 1376 956 41 { m21} R black
 gsave  2268 2190 0 0 C 669 1930.25 t 0 r /Helvetica findfont 101.005 sf 0 0 m 
 279 222 171 145 88 60
(= 7 TeV) K NC gr 
 gsave  2268 2190 0 0 C 620.125 1930.25 t 0 r /Helvetica findfont 101.005 sf 0 0 m (s) show NC gr  6 lw 554 1984 m 46 -58 d s 0 lw 600 1926 m 9 88 d s 609 2014 m 59 X s
 gsave  2268 2190 0 0 C 2246 1360.06 t 90 r /Helvetica-BoldOblique findfont 61.9061 sf 0 0 m 
 676 647 613 579 562 514 456 439 398 357 340 300 252 204 187 143 126 82 37
(LHC HIGGS XS WG 2011) K NC gr  3 lw 1 1 1 c 675 283 1479 1799 bf black 1499 1799 m -13 Y 668 X 276 Y -13 X -263 Y f 1479 1799 m 283 Y 675 X -283 Y -675 X cl s
 gsave  2268 2190 0 0 C 1646.44 2021.44 t 0 r /Helvetica findfont 42.3568 sf 0 0 m 
 385 365 342 320 297 274 263 240 228 205 193 180 166 143 123 111 100 77 55 30
(CT10: corr = 0.321411) K NC gr  1 0 0 c 1564 2035 m20 black
 gsave  2268 2190 0 0 C 1646.44 1927 t 0 r /Helvetica findfont 42.3568 sf 0 0 m 
 449 426 403 380 358 335 312 301 278 264 253 229 218 204 191 168 147 136 125 87 62 34
(MSTW: corr = \2550.0299493) K NC gr  0 1 0 c 1564 1940 m21 black
 gsave  2268 2190 0 0 C 1646.44 1832.5 t 0 r /Helvetica findfont 42.3568 sf 0 0 m (NNPDF: corr = 0.0905583) show NC gr  0 0 1 c 1564 1846 m22
 gr  gr showpage
end
%%EOF
