%!PS-Adobe-2.0 EPSF-2.0
%%BoundingBox:  0 0 567 415
%%Title: pTM_130.eps: c1
%%Creator: ROOT Version 5.27/06b
%%CreationDate: Tue Dec  6 12:37:49 2011
%%EndComments
%%BeginProlog
80 dict begin
/s {stroke} def /l {lineto} def /m {moveto} def /t {translate} def
/r {rotate} def /rl {roll}  def /R {repeat} def
/d {rlineto} def /rm {rmoveto} def /gr {grestore} def /f {eofill} def
/c {setrgbcolor} def /black {0 setgray} def /sd {setdash} def
/cl {closepath} def /sf {scalefont setfont} def /lw {setlinewidth} def
/box {m dup 0 exch d exch 0 d 0 exch neg d cl} def
/NC{systemdict begin initclip end}def/C{NC box clip newpath}def
/bl {box s} def /bf {box f} def /Y { 0 exch d} def /X { 0 d} def 
/K {{pop pop 0 moveto} exch kshow} bind def
/ita {/ang 15 def gsave [1 0 ang dup sin exch cos div 1 0 0] concat} def 
/mp {newpath /y exch def /x exch def} def
/side {[w .77 mul w .23 mul] .385 w mul sd w 0 l currentpoint t -144 r} def
/mr {mp x y w2 0 360 arc} def /m24 {mr s} def /m20 {mr f} def
/mb {mp x y w2 add m w2 neg 0 d 0 w neg d w 0 d 0 w d cl} def
/mt {mp x y w2 add m w2 neg w neg d w 0 d cl} def
/m21 {mb f} def /m25 {mb s} def /m22 {mt f} def /m26{mt s} def
/m23 {mp x y w2 sub m w2 w d w neg 0 d cl f} def
/m27 {mp x y w2 add m w3 neg w2 neg d w3 w2 neg d w3 w2 d cl s} def
/m28 {mp x w2 sub y w2 sub w3 add m w3 0 d  0 w3 neg d w3 0 d 0 w3 d w3 0 d  0 w3 d w3 neg 0 d 0 w3 d w3 neg 0 d 0 w3 neg d w3 neg 0 d cl s } def
/m29 {mp gsave x w2 sub y w2 add w3 sub m currentpoint t 4 {side} repeat cl fill gr} def
/m30 {mp gsave x w2 sub y w2 add w3 sub m currentpoint t 4 {side} repeat cl s gr} def
/m31 {mp x y w2 sub m 0 w d x w2 sub y m w 0 d x w2 sub y w2 add m w w neg d x w2 sub y w2 sub m w w d s} def
/m32 {mp x y w2 sub m w2 w d w neg 0 d cl s} def
/m33 {mp x y w2 add m w3 neg w2 neg d w3 w2 neg d w3 w2 d cl f} def
/m34 {mp x w2 sub y w2 sub w3 add m w3 0 d  0 w3 neg d w3 0 d 0 w3 d w3 0 d  0 w3 d w3 neg 0 d 0 w3 d w3 neg 0 d 0 w3 neg d w3 neg 0 d cl f } def
/m2 {mp x y w2 sub m 0 w d x w2 sub y m w 0 d s} def
/m5 {mp x w2 sub y w2 sub m w w d x w2 sub y w2 add m w w neg d s} def
/reEncode {exch findfont dup length dict begin {1 index /FID eq  {pop pop} {def} ifelse } forall /Encoding exch def currentdict end dup /FontName get exch definefont pop } def [/Times-Bold /Times-Italic /Times-BoldItalic /Helvetica /Helvetica-Oblique
 /Helvetica-Bold /Helvetica-BoldOblique /Courier /Courier-Oblique /Courier-Bold /Courier-BoldOblique /Times-Roman /AvantGarde-Book /AvantGarde-BookOblique /AvantGarde-Demi /AvantGarde-DemiOblique /Bookman-Demi /Bookman-DemiItalic /Bookman-Light
 /Bookman-LightItalic /Helvetica-Narrow /Helvetica-Narrow-Bold /Helvetica-Narrow-BoldOblique /Helvetica-Narrow-Oblique /NewCenturySchlbk-Roman /NewCenturySchlbk-Bold /NewCenturySchlbk-BoldItalic /NewCenturySchlbk-Italic /Palatino-Bold
 /Palatino-BoldItalic /Palatino-Italic /Palatino-Roman ] {ISOLatin1Encoding reEncode } forall%%EndProlog
%%BeginSetup
%%EndSetup
newpath  gsave  .25 .25 scale  gsave  0 0 t black[  ] 0 sd 3 lw 1 1 1 c 2268 1660 0 0 bf black 1 1 1 c 1791 1311 363 266 bf black 1791 1311 363 266 bl 363 266 m 1791 X s
 gsave  2268 1660 0 0 C 1933.38 103.688 t 0 r /Helvetica findfont 78.706 sf 0 0 m ( [GeV]) show NC gr 
 gsave  2268 1660 0 0 C 1901.38 61.875 t 0 r /Helvetica findfont 51.6508 sf 0 0 m (T) show NC gr 
 gsave  2268 1660 0 0 C 1859.56 103.688 t 0 r /Helvetica findfont 78.706 sf 0 0 m (p) show NC gr  363 305 m -39 Y s 434 285 m -19 Y s 506 285 m -19 Y s 577 285 m -19 Y s 649 285 m -19 Y s 720 305 m -39 Y s 792 285 m -19 Y s 863 285 m -19 Y s 935 285
 m -19 Y s 1006 285 m -19 Y s 1078 305 m -39 Y s 1150 285 m -19 Y s 1221 285 m -19 Y s 1293 285 m -19 Y s 1364 285 m -19 Y s 1436 305 m -39 Y s 1507 285 m -19 Y s 1579 285 m -19 Y s 1650 285 m -19 Y s 1722 285 m -19 Y s 1793 305 m -39 Y s 1865 285 m
 -19 Y s 1936 285 m -19 Y s 2008 285 m -19 Y s 2079 285 m -19 Y s 2151 305 m -39 Y s 2151 305 m -39 Y s
 gsave  2268 1660 0 0 C 339.625 192.25 t 0 r /Helvetica findfont 78.706 sf 0 0 m (0) show NC gr 
 gsave  2268 1660 0 0 C 654.375 192.25 t 0 r /Helvetica findfont 78.706 sf 0 0 m (100) show NC gr 
 gsave  2268 1660 0 0 C 1013.5 192.25 t 0 r /Helvetica findfont 78.706 sf 0 0 m (200) show NC gr 
 gsave  2268 1660 0 0 C 1370.12 192.25 t 0 r /Helvetica findfont 78.706 sf 0 0 m (300) show NC gr 
 gsave  2268 1660 0 0 C 1729.25 192.25 t 0 r /Helvetica findfont 78.706 sf 0 0 m (400) show NC gr 
 gsave  2268 1660 0 0 C 2085.88 192.25 t 0 r /Helvetica findfont 78.706 sf 0 0 m (500) show NC gr  363 1577 m 1791 X s 363 1538 m 39 Y s 434 1558 m 19 Y s 506 1558 m 19 Y s 577 1558 m 19 Y s 649 1558 m 19 Y s 720 1538 m 39 Y s 792 1558 m 19 Y s 863
 1558 m 19 Y s 935 1558 m 19 Y s 1006 1558 m 19 Y s 1078 1538 m 39 Y s 1150 1558 m 19 Y s 1221 1558 m 19 Y s 1293 1558 m 19 Y s 1364 1558 m 19 Y s 1436 1538 m 39 Y s 1507 1558 m 19 Y s 1579 1558 m 19 Y s 1650 1558 m 19 Y s 1722 1558 m 19 Y s 1793
 1538 m 39 Y s 1865 1558 m 19 Y s 1936 1558 m 19 Y s 2008 1558 m 19 Y s 2079 1558 m 19 Y s 2151 1538 m 39 Y s 2151 1538 m 39 Y s 363 266 m 1311 Y s
 gsave  2268 1660 0 0 C 162.562 1109.62 t 90 r /Helvetica findfont 78.706 sf 0 0 m (   \(pb/ 1 GeV\)) show NC gr 
 gsave  2268 1660 0 0 C 204.375 1077.62 t 90 r /Helvetica findfont 51.6508 sf 0 0 m (T) show NC gr 
 gsave  2268 1660 0 0 C 162.562 868.562 t 90 r /Helvetica findfont 78.706 sf 0 0 m (dN/dp) show NC gr  417 266 m -54 X s 390 318 m -27 X s 390 370 m -27 X s 390 422 m -27 X s 390 474 m -27 X s 417 526 m -54 X s 390 578 m -27 X s 390 630 m -27 X s 390
 682 m -27 X s 390 734 m -27 X s 417 786 m -54 X s 390 838 m -27 X s 390 890 m -27 X s 390 942 m -27 X s 390 994 m -27 X s 417 1046 m -54 X s 390 1098 m -27 X s 390 1150 m -27 X s 390 1202 m -27 X s 390 1254 m -27 X s 417 1306 m -54 X s 390 1359 m
 -27 X s 390 1411 m -27 X s 390 1463 m -27 X s 390 1515 m -27 X s 417 1567 m -54 X s 417 266 m -54 X s 417 1567 m -54 X s
 gsave  2268 1660 0 0 C 307.688 236.5 t 0 r /Helvetica findfont 78.706 sf 0 0 m (0) show NC gr 
 gsave  2268 1660 0 0 C 253.562 497.188 t 0 r /Helvetica findfont 78.706 sf 0 0 m (0.1) show NC gr 
 gsave  2268 1660 0 0 C 243.688 757.875 t 0 r /Helvetica findfont 78.706 sf 0 0 m (0.2) show NC gr 
 gsave  2268 1660 0 0 C 241.25 1018.62 t 0 r /Helvetica findfont 78.706 sf 0 0 m (0.3) show NC gr 
 gsave  2268 1660 0 0 C 243.688 1279.31 t 0 r /Helvetica findfont 78.706 sf 0 0 m (0.4) show NC gr 
 gsave  2268 1660 0 0 C 241.25 1537.56 t 0 r /Helvetica findfont 78.706 sf 0 0 m (0.5) show NC gr  2154 266 m 1311 Y s 2101 266 m 53 X s 2127 318 m 27 X s 2127 370 m 27 X s 2127 422 m 27 X s 2127 474 m 27 X s 2101 526 m 53 X s 2127 578 m 27 X s 2127
 630 m 27 X s 2127 682 m 27 X s 2127 734 m 27 X s 2101 786 m 53 X s 2127 838 m 27 X s 2127 890 m 27 X s 2127 942 m 27 X s 2127 994 m 27 X s 2101 1046 m 53 X s 2127 1098 m 27 X s 2127 1150 m 27 X s 2127 1202 m 27 X s 2127 1254 m 27 X s 2101 1306 m 53
 X s 2127 1359 m 27 X s 2127 1411 m 27 X s 2127 1463 m 27 X s 2127 1515 m 27 X s 2101 1567 m 53 X s 2101 266 m 53 X s 2101 1567 m 53 X s[  12 12 ] 0 sd 1 1 1 c 1 0 0 c[  ] 0 sd /w 24 def /w2 {w 2 div} def /w3 {w 3 div} def 368 465 372 685 375 863 379
 1004 382 1110 386 1186 390 1235 393 1263 397 1275 400 1274 404 1263 407 1246 411 1224 415 1198 418 1170 422 1141 425 1111 429 1080 432 1050 436 1019 440 990 443 961 447 933 450 906 454 880 457 855 461 831 465 808 468 786 472 765 475 745 479 725 482
 707 486 689 490 672 493 656 497 641 500 626 504 612 507 599 511 586 515 573 518 562 522 550 525 540 529 529 532 520 536 510 539 501 543 493 50 { m29} R[  12 12 ] 0 sd[  ] 0 sd 543 493 547 484 550 477 554 469 557 462 561 455 564 448 568 442 572 436
 575 430 579 424 582 419 586 413 589 408 593 404 597 399 600 395 604 390 607 386 611 382 614 379 618 375 622 371 625 368 629 365 632 362 636 359 639 356 643 353 647 350 650 348 654 345 657 343 661 340 664 338 668 336 672 334 675 332 679 330 682 328
 686 326 689 324 693 323 697 321 700 319 704 318 707 316 711 315 714 314 718 312 50 { m29} R[  12 12 ] 0 sd[  ] 0 sd 718 312 721 311 725 310 729 309 732 307 736 306 739 305 743 304 746 303 750 302 754 301 757 300 761 299 764 298 768 297 771 297 775
 296 779 295 782 294 786 294 789 293 793 292 796 291 800 291 804 290 807 290 811 289 814 289 818 288 821 288 825 287 829 287 832 286 836 286 839 285 843 285 846 285 850 284 854 284 857 283 861 283 864 283 868 282 871 282 875 282 879 281 882 281 886
 281 889 280 893 280 50 { m29} R[  12 12 ] 0 sd[  ] 0 sd 893 280 896 280 900 280 904 279 907 279 911 279 914 278 918 278 921 278 925 278 928 277 932 277 936 277 939 277 943 277 946 276 950 276 953 276 957 276 961 276 964 275 968 275 971 275 975 275
 978 275 982 275 986 274 989 274 993 274 996 274 1000 274 1003 274 1007 273 1011 273 1014 273 1018 273 1021 273 1025 273 1028 273 1032 272 1036 272 1039 272 1043 272 1046 272 1050 272 1053 272 1057 272 1061 272 1064 271 1068 271 50 { m29} R[  12 12 ]
 0 sd[  ] 0 sd 1068 271 1071 271 1075 271 1078 271 1082 271 1086 271 1089 271 1093 271 1096 271 1100 271 1103 270 1107 270 1110 270 1114 270 1118 270 1121 270 1125 270 1128 270 1132 270 1135 270 1139 270 1143 270 1146 270 1150 270 1153 269 1157 269
 1160 269 1164 269 1168 269 1171 269 1175 269 1178 269 1182 269 1185 269 1189 269 1193 269 1196 269 1200 269 1203 269 1207 269 1210 269 1214 269 1218 268 1221 268 1225 268 1228 268 1232 268 1235 268 1239 268 1243 268 50 { m29} R[  12 12 ] 0 sd[  ] 0
 sd 1243 268 1246 268 1250 268 1253 268 1257 268 1260 268 1264 268 1268 268 1271 268 1275 268 1278 268 1282 268 1285 268 1289 268 1292 268 1296 268 1300 268 1303 268 1307 268 1310 268 1314 268 1317 267 1321 267 1325 267 1328 267 1332 267 1335 267
 1339 267 1342 267 1346 267 1350 267 1353 267 1357 267 1360 267 1364 267 1367 267 1371 267 1375 267 1378 267 1382 267 1385 267 1389 267 1392 267 1396 267 1400 267 1403 267 1407 267 1410 267 1414 267 1417 267 50 { m29} R[  12 12 ] 0 sd[  ] 0 sd 1417
 267 1421 267 1425 267 1428 267 1432 267 1435 267 1439 267 1442 267 1446 267 1450 267 1453 267 1457 267 1460 267 1464 267 1467 267 1471 267 1474 267 1478 267 1482 267 1485 267 1489 267 1492 267 1496 267 1499 267 1503 267 1507 267 1510 266 1514 266
 1517 266 1521 266 1524 266 1528 266 1532 266 1535 266 1539 266 1542 266 1546 266 1549 266 1553 266 1557 266 1560 266 1564 266 1567 266 1571 266 1574 266 1578 266 1582 266 1585 266 1589 266 1592 266 50 { m29} R[  12 12 ] 0 sd[  ] 0 sd 1592 266 1596
 266 1599 266 1603 266 1607 266 1610 266 1614 266 1617 266 1621 266 1624 266 1628 266 1632 266 1635 266 1639 266 1642 266 1646 266 1649 266 1653 266 1656 266 1660 266 1664 266 1667 266 1671 266 1674 266 1678 266 1681 266 1685 266 1689 266 1692 266
 1696 266 1699 266 1703 266 1706 266 1710 266 1714 266 1717 266 1721 266 1724 266 1728 266 1731 266 1735 266 1739 266 1742 266 1746 266 1749 266 1753 266 1756 266 1760 266 1764 266 1767 266 50 { m29} R[  12 12 ] 0 sd[  ] 0 sd 1767 266 1771 266 1774
 266 1778 266 1781 266 1785 266 1789 266 1792 266 1796 266 1799 266 1803 266 1806 266 1810 266 1814 266 1817 266 1821 266 1824 266 1828 266 1831 266 1835 266 1839 266 1842 266 1846 266 1849 266 1853 266 1856 266 1860 266 1863 266 1867 266 1871 266
 1874 266 1878 266 1881 266 1885 266 1888 266 1892 266 1896 266 1899 266 1903 266 1906 266 1910 266 1913 266 1917 266 1921 266 1924 266 1928 266 1931 266 1935 266 1938 266 1942 266 50 { m29} R[  12 12 ] 0 sd[  ] 0 sd 1942 266 1946 266 1949 266 1953
 266 1956 266 1960 266 1963 266 1967 266 1971 266 1974 266 1978 266 1981 266 1985 266 1988 266 1992 266 1996 266 1999 266 2003 266 2006 266 2010 266 2013 266 2017 266 2021 266 2024 266 2028 266 2031 266 2035 266 2038 266 2042 266 2045 266 2049 266
 2053 266 2056 266 2060 266 2063 266 2067 266 2070 266 2074 266 2078 266 2081 266 2085 266 2088 266 2092 266 2095 266 2099 266 2103 266 2106 266 2110 266 2113 266 2117 266 50 { m29} R[  12 12 ] 0 sd[  ] 0 sd 2117 266 2120 266 2124 266 2128 266 2131
 266 2135 266 2138 266 2142 266 2145 266 2149 266 10 { m29} R[  12 12 ] 0 sd 0 0 1 c 6 lw 1 1 1 c 0 0 1 c 368 484 m 3 86 d 1 38 d 2 89 d 1 39 d 2 70 d 1 26 d 1 19 d 4 Y 3 76 d 1 21 d 2 45 d 1 15 d 8 Y 1 15 d 1 14 d 1 18 d 1 7 d 1 14 d 1 10 d 1 8 d 4
 Y 1 3 d 3 6 d 3 Y 1 8 d 1 8 d 1 3 d 1 Y 1 X 1 -3 d 2 -12 d 3 -19 d 2 -6 d 1 -6 d 1 -5 d 4 -35 d 1 2 d 8 Y 1 6 d 1 3 d 4 -44 d -5 Y 1 -5 d 2 -7 d -3 Y 4 -29 d 1 -4 d 2 -5 d -3 Y 1 -7 d 3 -24 d 3 -29 d 1 -2 d 1 -5 d 2 -9 d 1 -3 d 2 -2 d -3 Y 1 -2 d 3
 -42 d 2 -19 d 1 -6 d 1 -3 d -1 Y 1 2 d 1 5 d 1 1 d 4 -36 d 1 -8 d 1 -5 d 1 -3 d 1 X 1 2 d 1 3 d 1 X -1 Y 1 -4 d -7 Y 2 -22 d 1 -4 d 1 -5 d 1 -3 d 1 -6 d 3 -10 d 1 -2 d 1 -1 d 2 X -2 Y 1 -5 d 1 -8 d 2 -13 d 3 -25 d -5 Y 1 -2 d -2 Y 1 X 2 3 d 1 2 d 2
 5 d 1 Y 1 -1 d 3 -30 d 2 -7 d 1 -8 d 1 -1 d 1 -4 d 2 -6 d 4 -14 d 1 -2 d 3 -3 d 3 -10 d 2 -1 d 1 X 1 -1 d 1 -4 d 2 -11 d -1 Y 1 X 1 2 d 1 2 d 1 X -3 Y 3 -22 d 1 -2 d 3 X -1 Y 2 -5 d 1 -3 d 3 -8 d 1 -3 d s 543 511 m 2 -2 d 2 -1 d 2 1 d 1 -1 d -1 Y 1
 -1 d -3 Y 1 -3 d 1 -9 d -2 Y 1 -2 d -1 Y 1 -1 d 2 X 1 -2 d 1 -2 d 1 -6 d 1 -1 d -1 Y 1 X 1 1 d 1 1 d 1 X 2 3 d 1 Y 1 X -2 Y 1 -2 d -3 Y 2 -8 d -2 Y 1 -2 d -1 Y 1 X 1 1 d 1 X 1 -1 d 1 -3 d 2 -3 d 1 -3 d 1 -6 d 1 -1 d -1 Y 1 X 1 1 d 1 1 d 1 1 d 1 -1 d
 1 -1 d 1 -3 d 4 -7 d 1 X 2 2 d 1 X 3 -6 d 1 X 1 -1 d 1 X 1 -1 d -1 Y 3 -11 d 1 -1 d 1 X 1 -1 d 1 -1 d 1 -1 d 2 -5 d -1 Y 4 X 4 -3 d 3 -3 d 3 -1 d 1 -1 d 1 1 d 2 1 d 2 X 1 1 d -1 Y 1 -1 d -1 Y 3 -14 d 1 -1 d 1 X 2 1 d 1 Y 2 -1 d 1 -1 d 1 X -2 Y 3 -6
 d 1 -1 d 3 X 1 -2 d 2 -2 d 4 -5 d 1 X 1 1 d 1 1 d 1 -1 d 3 -3 d 4 X 1 Y 2 1 d 1 X 1 -1 d 3 -9 d 5 X 2 -1 d 3 -4 d 3 -2 d 2 X 2 1 d 1 X 3 -3 d 1 -1 d 2 X 1 -1 d -1 Y 3 -7 d -1 Y 2 -2 d 1 -1 d 1 1 d 1 2 d 1 2 d 3 Y 1 1 d 1 Y 2 X 1 -1 d -1 Y 1 -2 d s
 718 337 m -1 Y 1 -1 d -1 Y 1 X 1 -1 d -1 Y 1 X 1 1 d 1 X 1 1 d 4 X 1 -1 d 2 -2 d 2 -2 d 1 X 1 -1 d 3 X 4 -1 d 4 X 1 -1 d 1 -1 d 1 -2 d 1 -1 d 1 -2 d -2 Y 1 -1 d 1 -1 d 1 1 d 1 1 d 1 Y 1 X 1 1 d 3 X 3 -3 d 2 -1 d 3 X 1 1 d 1 X 1 Y 2 X 1 -1 d 1 X 4 -4
 d 1 Y 1 X 1 1 d 1 Y 1 X 1 -1 d 1 -2 d 1 -1 d -1 Y 1 X -1 Y 4 X 2 1 d 2 X 2 -2 d 1 -1 d 2 -2 d 1 -1 d 1 X 1 1 d 1 1 d 5 X 3 -3 d 1 -1 d 2 X 1 Y 1 X 1 1 d 2 Y 1 1 d 1 X 3 -5 d 2 X 1 Y 1 1 d 1 X 1 -1 d 2 -3 d 1 -1 d 2 -2 d 2 X 1 1 d 1 1 d 1 1 d 1 1 d 1
 X 1 Y 1 X -1 Y 1 X -1 Y 1 -1 d 1 -3 d -1 Y 1 -1 d 3 X 1 Y 1 X 1 Y 1 1 d 1 1 d 1 1 d 1 X 3 -2 d 1 -1 d 1 -1 d 3 X 1 1 d 3 X 1 -1 d 1 X 3 -2 d -1 Y 2 -1 d 1 X -1 Y 1 1 d 1 X 1 2 d 5 X 1 -1 d 3 X 3 -2 d 2 -2 d 1 -1 d 4 X s 893 288 m 1 1 d 1 1 d 1 X 1 1
 d 4 X -1 Y 1 -1 d 1 X -1 Y 2 X 1 Y 1 1 d 2 X 1 -1 d 1 -1 d 5 X -1 Y 2 -1 d 2 X 1 Y 2 X 4 -2 d 2 -1 d 2 X 1 Y 1 X 1 Y 1 1 d 2 Y 2 X -1 Y 1 -1 d -1 Y 1 X -1 Y 2 X 1 1 d 2 X 1 -1 d 1 -1 d 1 X -1 Y 2 -1 d -1 Y 2 X 1 1 d 1 1 d 6 X 1 -1 d 3 X 1 Y 2 X -1 Y
 3 -1 d 2 X 1 1 d 8 X 1 -1 d 1 -1 d 1 -1 d 1 X 1 1 d 1 1 d 1 X 1 Y 4 X -1 Y 1 X -1 Y 1 -1 d 1 -1 d 2 X 1 Y 2 1 d 1 1 d 1 1 d 1 X 1 Y 1 X -1 Y 1 X -1 Y 1 X 1 -1 d 9 X 1 -1 d 1 X -1 Y 2 X -1 Y 2 X 1 Y 1 X 1 1 d 8 X 1 -1 d 1 -1 d 2 X 1 1 d 1 1 d 3 X 1
 -1 d 1 X 1 -1 d 2 X 2 -1 d 3 X 2 1 d 6 X 1 Y 1 X 1 -1 d 2 -1 d 2 X -1 Y 8 X 1 Y 2 X s 1068 276 m 1 X -1 Y 3 X 1 Y 1 X 1 Y 1 X 1 Y 2 X 2 -4 d 2 X 1 1 d 6 X 1 Y 1 X 1 1 d -1 Y 1 X 1 -1 d -1 Y 1 X -1 Y 1 X 1 1 d 1 X 1 Y 5 X 3 -2 d 4 X 1 Y 2 X 1 1 d 2 X
 1 -1 d 2 X 1 Y 1 X 1 1 d 3 X -1 Y 2 X -1 Y 2 X -1 Y 2 X 1 1 d 3 X -1 Y 2 X -1 Y 2 X 1 1 d 2 X 1 Y 3 X 3 -3 d 1 X 1 Y 1 1 d 1 Y 2 X 3 -3 d 4 X 1 Y 1 X 1 1 d 2 X 2 -1 d 11 X 4 -1 d 5 X 1 1 d 8 X 1 -1 d 4 X 1 Y 3 X 1 -1 d 1 X -1 Y 2 X 1 Y 9 X 4 -2 d 2
 X 1 Y 2 X 2 1 d 2 X 3 -2 d 8 X 1 1 d 2 X 1 1 d 6 X s 1243 271 m -1 Y 4 X 1 -1 d 16 X 1 Y 1 X 1 1 d 1 Y 3 X -1 Y 1 -1 d 1 X 1 -1 d 4 X 1 Y 6 X -1 Y 5 X 1 1 d 2 X 2 -1 d 5 X 1 -1 d 3 X 1 Y 1 1 d 3 X -1 Y 1 X -1 Y 3 X 1 Y 3 X 1 1 d 5 X -1 Y 2 X -1 Y 9
 X 1 1 d 2 X 3 -1 d 9 X 1 1 d 2 X 3 -1 d 15 X 1 1 d 2 X 3 -1 d 3 X -1 Y 10 X 1 1 d 5 X 1 1 d 3 X 1 -1 d 5 X 1 1 d 2 X 1 -1 d 1 X -1 Y 4 X 1 Y 8 X s 1417 268 m 1 X -1 Y 4 X 1 Y 1 X 1 Y 3 X 2 -1 d 3 X -1 Y 1 X 1 Y 12 X 1 -1 d 5 X 2 1 d 5 X -1 Y 10 X -1
 Y 1 X 1 Y 2 X 1 Y 2 X 2 -1 d 1 X 1 Y 4 X -1 Y 2 X -1 Y 1 X 1 Y 2 X 1 Y 6 X -1 Y 4 X 1 Y 4 X -1 Y 14 X 1 Y 3 X 1 -1 d 3 X 1 Y 4 X -1 Y 44 X s 1567 267 m 10 X -1 Y 9 X 1 1 d 5 X s 1592 267 m 3 X -1 Y 1 X 1 Y 44 X -1 Y 4 X 1 1 d 28 X 1 -1 d 12 X 1 1 d
 6 X 1 -1 d 3 X 1 1 d 4 X 1 -1 d 5 X 1 1 d 2 X 3 -1 d 11 X 1 Y 5 X -1 Y 3 X 1 Y 4 X -1 Y 2 X s 1739 266 m 3 X 1 1 d 4 X 1 -1 d 19 X s 1767 266 m 66 X 1 Y 9 X -1 Y 26 X s 1868 266 m 6 X s 1874 266 m 67 X s 1941 266 m 19 X s 1960 266 m 88 X s 2048 266
 m 1 X s 2049 266 m 27 X s 2076 266 m 9 X s 2088 266 m 7 X s 2095 266 m 4 X s 2103 266 m 6 X s 2109 266 m 4 X s 2113 266 m 12 X s 2125 266 m 10 X s 2135 266 m 3 X s 2138 266 m 4 X s 2145 266 m 8 X s 368 484 m 4 124 d 3 128 d 4 119 d 3 76 d 4 89 d 4
 54 d 3 36 d 4 9 d 3 23 d 4 -15 d 3 -19 d 4 -17 d 4 -35 d 3 19 d 4 -44 d 3 -20 d 4 -29 d 3 -12 d 4 -31 d 4 -31 d 3 -14 d 4 -10 d 3 -42 d 4 -29 d 3 8 d 4 -36 d 4 -16 d 3 4 d 4 -37 d 3 -14 d 4 -12 d 3 -3 d 4 -26 d 4 -32 d 3 1 d 4 7 d 3 -30 d 4 -16 d 3
 -10 d 4 -14 d 4 -5 d 3 -10 d 4 -2 d 3 -16 d 4 4 d 3 -25 d 4 -3 d 3 -8 d 4 -11 d s 543 511 m 4 -3 d 3 -1 d 4 -20 d 3 -2 d 4 -11 d 3 1 d 4 3 d 4 -18 d 3 X 4 -7 d 3 -11 d 4 3 d 3 -5 d 4 -7 d 4 2 d 3 -6 d 4 -2 d 3 -12 d 4 -3 d 3 -7 d 4 X 4 -3 d 3 -3 d 4
 -2 d 3 2 d 4 -1 d 3 -15 d 4 1 d 4 -2 d 3 -8 d 4 -1 d 3 -4 d 4 -5 d 3 2 d 4 -4 d 4 X 3 2 d 4 -10 d 3 X 4 -1 d 3 -4 d 4 -2 d 4 1 d 3 -3 d 4 -2 d 3 -9 d 4 -2 d 3 9 d 4 -4 d s 718 337 m 3 -5 d 4 2 d 4 X 3 -3 d 4 -3 d 3 X 4 -1 d 3 X 4 -4 d 4 -7 d 3 3 d 4
 1 d 3 -3 d 4 -1 d 3 2 d 4 -1 d 4 -4 d 3 3 d 4 -5 d 3 -1 d 4 1 d 3 -2 d 4 -4 d 4 2 d 3 X 4 -3 d 3 X 4 4 d 3 -5 d 4 2 d 4 -5 d 3 -2 d 4 3 d 3 1 d 4 -7 d 3 1 d 4 4 d 4 -2 d 3 -2 d 4 1 d 3 -1 d 4 -2 d 3 -3 d 4 3 d 4 X 3 -1 d 4 -2 d 3 -3 d 4 X s 893 288
 m 3 2 d 4 1 d 4 -3 d 3 2 d 4 -2 d 3 X 4 -2 d 3 1 d 4 -2 d 3 -1 d 4 5 d 4 -4 d 3 1 d 4 -3 d 3 -2 d 4 2 d 3 X 4 -1 d 4 1 d 3 -2 d 4 1 d 7 X 3 -3 d 4 3 d 4 X 3 -4 d 4 2 d 3 3 d 4 -3 d 7 X 4 -1 d 3 -2 d 4 2 d 7 X 3 -2 d 4 2 d 4 -1 d 3 -1 d 4 -1 d 3 1 d
 4 X 3 1 d 4 -2 d 4 -1 d 3 X 4 1 d s 1068 276 m 3 -1 d 4 3 d 3 -4 d 4 1 d 4 X 3 2 d 4 -4 d 3 2 d 4 X 3 -2 d 4 X 3 2 d 4 -1 d 4 2 d 3 -1 d 4 -2 d 3 1 d 4 -1 d 3 X 4 1 d 4 -3 d 3 3 d 4 -3 d 3 X 4 2 d 3 -1 d 11 X 4 -1 d 3 X 4 1 d 7 X 4 -1 d 3 1 d 4 -2 d
 3 1 d 7 X 4 -2 d 4 1 d 3 1 d 4 -2 d 7 X 3 1 d 4 1 d 4 X s 1243 271 m 3 -1 d 4 -1 d 10 X 4 1 d 4 2 d 3 -2 d 4 -1 d 3 1 d 4 X 3 -1 d 4 1 d 3 -1 d 4 X 4 -1 d 3 2 d 4 -2 d 3 1 d 4 1 d 3 X 4 -2 d 7 X 4 1 d 3 -1 d 7 X 4 1 d 4 -1 d 14 X 3 1 d 4 -1 d 4 -1 d
 7 X 3 1 d 4 X 3 1 d 4 -1 d 4 X 3 1 d 4 -2 d 3 1 d 7 X s 1417 268 m 4 -1 d 4 2 d 3 -1 d 4 -1 d 3 1 d 7 X 4 -1 d 4 X 3 1 d 4 X 3 -1 d 4 X 3 -1 d 4 2 d 3 -1 d 4 1 d 4 -2 d 3 2 d 4 X 3 -1 d 4 1 d 3 -1 d 11 X 4 1 d 3 -1 d 4 1 d 3 -1 d 50 X 4 -1 d 7 X 4 1
 d 3 X s 1592 267 m 4 -1 d 3 1 d 40 X 3 -1 d 4 1 d 25 X 3 -1 d 11 X 4 1 d 3 X 4 -1 d 3 1 d 4 -1 d 3 X 4 1 d 4 -1 d 10 X 4 1 d 3 -1 d 4 1 d 4 -1 d 3 X 4 1 d 3 -1 d 18 X s 1767 266 m 64 X 4 1 d 4 X 3 -1 d 32 X s 1874 266 m 86 X s 1960 266 m 89 X s 2049
 266 m 36 X s 2088 266 m 11 X s 2103 266 m 10 X s 2113 266 m 22 X s 2135 266 m 7 X s 2145 266 m 8 X s black[  ] 0 sd 9 lw 0.95 0.95 0.95 c black 834 298 m 14 -2 d 13 -1 d 13 -2 d 13 -2 d 13 -2 d 14 -1 d 13 -2 d 13 -1 d 13 -1 d 14 -1 d 13 -1 d 13 -2 d
 13 -1 d 14 X 13 -1 d 13 -1 d 13 -1 d 13 -1 d 14 X 13 -1 d 13 X 13 -1 d 14 X 13 -1 d 13 X 13 -1 d 27 X 13 -1 d 26 X 14 -1 d 53 X 13 -1 d 106 X 13 -1 d 40 X s 1483 267 m 172 X 13 -1 d 463 X s 2131 266 m 13 X s 0 0 1 c[  12 12 ] 0 sd 6 lw 1 1 1 c 0 0 1
 c[  ] 0 sd 3 lw 368 484 372 608 375 736 379 855 382 931 386 1020 390 1074 393 1110 397 1119 400 1142 404 1127 407 1108 411 1091 415 1056 418 1075 422 1031 425 1011 429 982 432 970 436 939 440 908 443 894 447 884 450 842 454 813 457 821 461 785 465
 769 468 773 472 736 475 722 479 710 482 707 486 681 490 649 493 650 497 657 500 627 504 611 507 601 511 587 515 582 518 572 522 570 525 554 529 558 532 533 536 530 539 522 543 511 50 { m26} R[  12 12 ] 0 sd 6 lw 368 484 m 4 124 d 3 128 d 4 119 d 3
 76 d 4 89 d 4 54 d 3 36 d 4 9 d 3 23 d 4 -15 d 3 -19 d 4 -17 d 4 -35 d 3 19 d 4 -44 d 3 -20 d 4 -29 d 3 -12 d 4 -31 d 4 -31 d 3 -14 d 4 -10 d 3 -42 d 4 -29 d 3 8 d 4 -36 d 4 -16 d 3 4 d 4 -37 d 3 -14 d 4 -12 d 3 -3 d 4 -26 d 4 -32 d 3 1 d 4 7 d 3
 -30 d 4 -16 d 3 -10 d 4 -14 d 4 -5 d 3 -10 d 4 -2 d 3 -16 d 4 4 d 3 -25 d 4 -3 d 3 -8 d 4 -11 d s[  ] 0 sd 3 lw 543 511 547 508 550 507 554 487 557 485 561 474 564 475 568 478 572 460 575 460 579 453 582 442 586 445 589 440 593 433 597 435 600 429
 604 427 607 415 611 412 614 405 618 405 622 402 625 399 629 397 632 399 636 398 639 383 643 384 647 382 650 374 654 373 657 369 661 364 664 366 668 362 672 362 675 364 679 354 682 354 686 353 689 349 693 347 697 348 700 345 704 343 707 334 711 332
 714 341 718 337 50 { m26} R[  12 12 ] 0 sd 6 lw 543 511 m 4 -3 d 3 -1 d 4 -20 d 3 -2 d 4 -11 d 3 1 d 4 3 d 4 -18 d 3 X 4 -7 d 3 -11 d 4 3 d 3 -5 d 4 -7 d 4 2 d 3 -6 d 4 -2 d 3 -12 d 4 -3 d 3 -7 d 4 X 4 -3 d 3 -3 d 4 -2 d 3 2 d 4 -1 d 3 -15 d 4 1 d 4
 -2 d 3 -8 d 4 -1 d 3 -4 d 4 -5 d 3 2 d 4 -4 d 4 X 3 2 d 4 -10 d 3 X 4 -1 d 3 -4 d 4 -2 d 4 1 d 3 -3 d 4 -2 d 3 -9 d 4 -2 d 3 9 d 4 -4 d s[  ] 0 sd 3 lw 718 337 721 332 725 334 729 334 732 331 736 328 739 328 743 327 746 327 750 323 754 316 757 319
 761 320 764 317 768 316 771 318 775 317 779 313 782 316 786 311 789 310 793 311 796 309 800 305 804 307 807 307 811 304 814 304 818 308 821 303 825 305 829 300 832 298 836 301 839 302 843 295 846 296 850 300 854 298 857 296 861 297 864 296 868 294
 871 291 875 294 879 294 882 293 886 291 889 288 893 288 50 { m26} R[  12 12 ] 0 sd 6 lw 718 337 m 3 -5 d 4 2 d 4 X 3 -3 d 4 -3 d 3 X 4 -1 d 3 X 4 -4 d 4 -7 d 3 3 d 4 1 d 3 -3 d 4 -1 d 3 2 d 4 -1 d 4 -4 d 3 3 d 4 -5 d 3 -1 d 4 1 d 3 -2 d 4 -4 d 4 2 d
 3 X 4 -3 d 3 X 4 4 d 3 -5 d 4 2 d 4 -5 d 3 -2 d 4 3 d 3 1 d 4 -7 d 3 1 d 4 4 d 4 -2 d 3 -2 d 4 1 d 3 -1 d 4 -2 d 3 -3 d 4 3 d 4 X 3 -1 d 4 -2 d 3 -3 d 4 X s[  ] 0 sd 3 lw 893 288 896 290 900 291 904 288 907 290 911 288 914 288 918 286 921 287 925
 285 928 284 932 289 936 285 939 286 943 283 946 281 950 283 953 283 957 282 961 283 964 281 968 282 971 282 975 282 978 279 982 282 986 282 989 278 993 280 996 283 1000 280 1003 280 1007 280 1011 279 1014 277 1018 279 1021 279 1025 279 1028 277 1032
 279 1036 278 1039 277 1043 276 1046 277 1050 277 1053 278 1057 276 1061 275 1064 275 1068 276 50 { m26} R[  12 12 ] 0 sd 6 lw 893 288 m 3 2 d 4 1 d 4 -3 d 3 2 d 4 -2 d 3 X 4 -2 d 3 1 d 4 -2 d 3 -1 d 4 5 d 4 -4 d 3 1 d 4 -3 d 3 -2 d 4 2 d 3 X 4 -1 d
 4 1 d 3 -2 d 4 1 d 7 X 3 -3 d 4 3 d 4 X 3 -4 d 4 2 d 3 3 d 4 -3 d 7 X 4 -1 d 3 -2 d 4 2 d 7 X 3 -2 d 4 2 d 4 -1 d 3 -1 d 4 -1 d 3 1 d 4 X 3 1 d 4 -2 d 4 -1 d 3 X 4 1 d s[  ] 0 sd 3 lw 1068 276 1071 275 1075 278 1078 274 1082 275 1086 275 1089 277
 1093 273 1096 275 1100 275 1103 273 1107 273 1110 275 1114 274 1118 276 1121 275 1125 273 1128 274 1132 273 1135 273 1139 274 1143 271 1146 274 1150 271 1153 271 1157 273 1160 272 1164 272 1168 272 1171 272 1175 271 1178 271 1182 272 1185 272 1189
 272 1193 271 1196 272 1200 270 1203 271 1207 271 1210 271 1214 269 1218 270 1221 271 1225 269 1228 269 1232 269 1235 270 1239 271 1243 271 50 { m26} R[  12 12 ] 0 sd 6 lw 1068 276 m 3 -1 d 4 3 d 3 -4 d 4 1 d 4 X 3 2 d 4 -4 d 3 2 d 4 X 3 -2 d 4 X 3 2
 d 4 -1 d 4 2 d 3 -1 d 4 -2 d 3 1 d 4 -1 d 3 X 4 1 d 4 -3 d 3 3 d 4 -3 d 3 X 4 2 d 3 -1 d 11 X 4 -1 d 3 X 4 1 d 7 X 4 -1 d 3 1 d 4 -2 d 3 1 d 7 X 4 -2 d 4 1 d 3 1 d 4 -2 d 7 X 3 1 d 4 1 d 4 X s[  ] 0 sd 3 lw 1243 271 1246 270 1250 269 1253 269 1257
 269 1260 269 1264 270 1268 272 1271 270 1275 269 1278 270 1282 270 1285 269 1289 270 1292 269 1296 269 1300 268 1303 270 1307 268 1310 269 1314 270 1317 270 1321 268 1325 268 1328 268 1332 269 1335 268 1339 268 1342 268 1346 269 1350 268 1353 268
 1357 268 1360 268 1364 268 1367 269 1371 268 1375 267 1378 267 1382 267 1385 268 1389 268 1392 269 1396 268 1400 268 1403 269 1407 267 1410 268 1414 268 1417 268 50 { m26} R[  12 12 ] 0 sd 6 lw 1243 271 m 3 -1 d 4 -1 d 10 X 4 1 d 4 2 d 3 -2 d 4 -1 d
 3 1 d 4 X 3 -1 d 4 1 d 3 -1 d 4 X 4 -1 d 3 2 d 4 -2 d 3 1 d 4 1 d 3 X 4 -2 d 7 X 4 1 d 3 -1 d 7 X 4 1 d 4 -1 d 14 X 3 1 d 4 -1 d 4 -1 d 7 X 3 1 d 4 X 3 1 d 4 -1 d 4 X 3 1 d 4 -2 d 3 1 d 7 X s[  ] 0 sd 3 lw 1417 268 1421 267 1425 269 1428 268 1432
 267 1435 268 1439 268 1442 268 1446 267 1450 267 1453 268 1457 268 1460 267 1464 267 1467 266 1471 268 1474 267 1478 268 1482 266 1485 268 1489 268 1492 267 1496 268 1499 267 1503 267 1507 267 1510 267 1514 268 1517 267 1521 268 1524 267 1528 267
 1532 267 1535 267 1539 267 1542 267 1546 267 1549 267 1553 267 1557 267 1560 267 1564 267 1567 267 1571 267 1574 267 1578 266 1582 266 1585 266 1589 267 1592 267 50 { m26} R[  12 12 ] 0 sd 6 lw 1417 268 m 4 -1 d 4 2 d 3 -1 d 4 -1 d 3 1 d 7 X 4 -1 d
 4 X 3 1 d 4 X 3 -1 d 4 X 3 -1 d 4 2 d 3 -1 d 4 1 d 4 -2 d 3 2 d 4 X 3 -1 d 4 1 d 3 -1 d 11 X 4 1 d 3 -1 d 4 1 d 3 -1 d 50 X 4 -1 d 7 X 4 1 d 3 X s[  ] 0 sd 3 lw 1592 267 1596 266 1599 267 1603 267 1607 267 1610 267 1614 267 1617 267 1621 267 1624
 267 1628 267 1632 267 1635 267 1639 267 1642 266 1646 267 1649 267 1653 267 1656 267 1660 267 1664 267 1667 267 1671 267 1674 266 1678 266 1681 266 1685 266 1689 267 1692 267 1696 266 1699 267 1703 266 1706 266 1710 267 1714 266 1717 266 1721 266
 1724 266 1728 267 1731 266 1735 267 1739 266 1742 266 1746 267 1749 266 1753 266 1756 266 1760 266 1764 266 1767 266 50 { m26} R[  12 12 ] 0 sd 6 lw 1592 267 m 4 -1 d 3 1 d 40 X 3 -1 d 4 1 d 25 X 3 -1 d 11 X 4 1 d 3 X 4 -1 d 3 1 d 4 -1 d 3 X 4 1 d 4
 -1 d 10 X 4 1 d 3 -1 d 4 1 d 4 -1 d 3 X 4 1 d 3 -1 d 18 X s[  ] 0 sd 3 lw 1767 266 1771 266 1774 266 1778 266 1781 266 1785 266 1789 266 1792 266 1796 266 1799 266 1803 266 1806 266 1810 266 1814 266 1817 266 1821 266 1824 266 1828 266 1831 266 1835
 267 1839 267 1842 266 1846 266 1849 266 1853 266 1856 266 1860 266 1863 266 1867 266 1871 266 1874 266 31 { m26} R[  12 12 ] 0 sd 6 lw 1767 266 m 64 X 4 1 d 4 X 3 -1 d 32 X s[  ] 0 sd 3 lw 1874 266 1878 266 1881 266 1885 266 1888 266 1892 266 1896
 266 1899 266 1903 266 1906 266 1910 266 1913 266 1917 266 1921 266 1924 266 1928 266 1931 266 1935 266 1938 266 1942 266 1946 266 1949 266 1953 266 1956 266 1960 266 25 { m26} R[  12 12 ] 0 sd 6 lw 1874 266 m 86 X s[  ] 0 sd 3 lw 1960 266 1963 266
 1967 266 1971 266 1974 266 1978 266 1981 266 1985 266 1988 266 1992 266 1996 266 1999 266 2003 266 2006 266 2010 266 2013 266 2017 266 2021 266 2024 266 2028 266 2031 266 2035 266 2038 266 2042 266 2045 266 2049 266 26 { m26} R[  12 12 ] 0 sd 6 lw
 1960 266 m 89 X s[  ] 0 sd 3 lw 2049 266 2053 266 2056 266 2060 266 2063 266 2067 266 2070 266 2074 266 2078 266 2081 266 2085 266 11 { m26} R[  12 12 ] 0 sd 6 lw 2049 266 m 36 X s[  ] 0 sd 3 lw 2088 266 2092 266 2095 266 2099 266 4 { m26} R[  12 12
 ] 0 sd 6 lw 2088 266 m 11 X s[  ] 0 sd 3 lw 2103 266 2106 266 2110 266 2113 266 4 { m26} R[  12 12 ] 0 sd 6 lw 2103 266 m 10 X s[  ] 0 sd 3 lw 2113 266 2117 266 2120 266 2124 266 2128 266 2131 266 2135 266 7 { m26} R[  12 12 ] 0 sd 6 lw 2113 266 m
 22 X s[  ] 0 sd 3 lw 2135 266 2138 266 2142 266 3 { m26} R[  12 12 ] 0 sd 6 lw 2135 266 m 7 X s[  ] 0 sd 3 lw 2145 266 2149 266 2153 266 3 { m26} R[  12 12 ] 0 sd 6 lw 2145 266 m 8 X s black[  ] 0 sd 9 lw 0.95 0.95 0.95 c black 834 298 m 14 -2 d 13
 -1 d 13 -2 d 13 -2 d 13 -2 d 14 -1 d 13 -2 d 13 -1 d 13 -1 d 14 -1 d 13 -1 d 13 -2 d 13 -1 d 14 X 13 -1 d 13 -1 d 13 -1 d 13 -1 d 14 X 13 -1 d 13 X 13 -1 d 14 X 13 -1 d 13 X 13 -1 d 27 X 13 -1 d 26 X 14 -1 d 53 X 13 -1 d 106 X 13 -1 d 40 X s 1483
 267 m 172 X 13 -1 d 463 X s 2131 266 m 13 X s 1 1 1 c 0 lw 454 382 884 996 bf black
 gsave  2268 1660 0 0 C 996.25 1313.75 t 0 r /Helvetica findfont 61.4891 sf 0 0 m 
 185 168 133 116 79 45
(HqT 2.0) K NC gr  1 0 0 c 3 lw 941 1330 m29 0 lw black
 gsave  2268 1660 0 0 C 996.25 1212.94 t 0 r /Helvetica findfont 61.4891 sf 0 0 m (POWHEG + PYTHIA) show NC gr  0 0 1 c 3 lw 941 1235 m26 0 lw black
 gsave  2268 1660 0 0 C 1072.5 1126.81 t 0 r /Helvetica findfont 61.4891 sf 0 0 m ( = 130 GeV) show NC gr 
 gsave  2268 1660 0 0 C 1045.5 1107.12 t 0 r /Helvetica findfont 41.8126 sf 0 0 m (H) show NC gr 
 gsave  2268 1660 0 0 C 996.25 1126.81 t 0 r /Helvetica findfont 61.4891 sf 0 0 m (m) show NC gr 
 gsave  2268 1660 0 0 C 1453.75 1030.88 t 0 r /Helvetica findfont 61.4891 sf 0 0 m ( \(YR\)) show NC gr 
 gsave  2268 1660 0 0 C 1426.69 1011.25 t 0 r /Helvetica findfont 41.8126 sf 0 0 m (H) show NC gr 
 gsave  2268 1660 0 0 C 1389.81 1030.88 t 0 r /Symbol findfont 61.4891 sf 0 0 m (s) show NC gr 
 gsave  2268 1660 0 0 C 996.25 1030.88 t 0 r /Helvetica findfont 61.4891 sf 0 0 m (Normalized to ) show NC gr 
 gsave  2268 1660 0 0 C 2199 1230.12 t 90 r /Helvetica-BoldOblique findfont 31.9743 sf 0 0 m 
 343 328 311 294 285 261 232 223 202 182 173 152 128 104 95 73 64 42 20
(LHC HIGGS XS WG 2011) K NC gr 
 gr  gr showpage
end
%%EOF
