%!PS-Adobe-2.0 EPSF-2.0
%%BoundingBox:  0 0 567 488
%%Title: Results/m120-600-ptjmax1pt-mstw2008.eps: VBF - HAWK
%%Creator: ROOT Version 5.28/00c
%%CreationDate: Wed Nov 30 09:20:01 2011
%%EndComments
%%BeginProlog
80 dict begin
/s {stroke} def /l {lineto} def /m {moveto} def /t {translate} def
/r {rotate} def /rl {roll}  def /R {repeat} def
/d {rlineto} def /rm {rmoveto} def /gr {grestore} def /f {eofill} def
/c {setrgbcolor} def /black {0 setgray} def /sd {setdash} def
/cl {closepath} def /sf {scalefont setfont} def /lw {setlinewidth} def
/box {m dup 0 exch d exch 0 d 0 exch neg d cl} def
/NC{systemdict begin initclip end}def/C{NC box clip newpath}def
/bl {box s} def /bf {box f} def /Y { 0 exch d} def /X { 0 d} def 
/K {{pop pop 0 moveto} exch kshow} bind def
/ita {/ang 15 def gsave [1 0 ang dup sin exch cos div 1 0 0] concat} def 
/mp {newpath /y exch def /x exch def} def
/side {[w .77 mul w .23 mul] .385 w mul sd w 0 l currentpoint t -144 r} def
/mr {mp x y w2 0 360 arc} def /m24 {mr s} def /m20 {mr f} def
/mb {mp x y w2 add m w2 neg 0 d 0 w neg d w 0 d 0 w d cl} def
/mt {mp x y w2 add m w2 neg w neg d w 0 d cl} def
/m21 {mb f} def /m25 {mb s} def /m22 {mt f} def /m26{mt s} def
/m23 {mp x y w2 sub m w2 w d w neg 0 d cl f} def
/m27 {mp x y w2 add m w3 neg w2 neg d w3 w2 neg d w3 w2 d cl s} def
/m28 {mp x w2 sub y w2 sub w3 add m w3 0 d  0 w3 neg d w3 0 d 0 w3 d w3 0 d  0 w3 d w3 neg 0 d 0 w3 d w3 neg 0 d 0 w3 neg d w3 neg 0 d cl s } def
/m29 {mp gsave x w2 sub y w2 add w3 sub m currentpoint t 4 {side} repeat cl fill gr} def
/m30 {mp gsave x w2 sub y w2 add w3 sub m currentpoint t 4 {side} repeat cl s gr} def
/m31 {mp x y w2 sub m 0 w d x w2 sub y m w 0 d x w2 sub y w2 add m w w neg d x w2 sub y w2 sub m w w d s} def
/m32 {mp x y w2 sub m w2 w d w neg 0 d cl s} def
/m33 {mp x y w2 add m w3 neg w2 neg d w3 w2 neg d w3 w2 d cl f} def
/m34 {mp x w2 sub y w2 sub w3 add m w3 0 d  0 w3 neg d w3 0 d 0 w3 d w3 0 d  0 w3 d w3 neg 0 d 0 w3 d w3 neg 0 d 0 w3 neg d w3 neg 0 d cl f } def
/m2 {mp x y w2 sub m 0 w d x w2 sub y m w 0 d s} def
/m5 {mp x w2 sub y w2 sub m w w d x w2 sub y w2 add m w w neg d s} def
/reEncode {exch findfont dup length dict begin {1 index /FID eq  {pop pop} {def} ifelse } forall /Encoding exch def currentdict end dup /FontName get exch definefont pop } def [/Times-Bold /Times-Italic /Times-BoldItalic /Helvetica /Helvetica-Oblique
 /Helvetica-Bold /Helvetica-BoldOblique /Courier /Courier-Oblique /Courier-Bold /Courier-BoldOblique /Times-Roman /AvantGarde-Book /AvantGarde-BookOblique /AvantGarde-Demi /AvantGarde-DemiOblique /Bookman-Demi /Bookman-DemiItalic /Bookman-Light
 /Bookman-LightItalic /Helvetica-Narrow /Helvetica-Narrow-Bold /Helvetica-Narrow-BoldOblique /Helvetica-Narrow-Oblique /NewCenturySchlbk-Roman /NewCenturySchlbk-Bold /NewCenturySchlbk-BoldItalic /NewCenturySchlbk-Italic /Palatino-Bold
 /Palatino-BoldItalic /Palatino-Italic /Palatino-Roman ] {ISOLatin1Encoding reEncode } forall%%EndProlog
%%BeginSetup
%%EndSetup
newpath  gsave  .25 .25 scale  gsave  0 0 t black[  ] 0 sd 3 lw 1 1 1 c 2268 1954 0 0 bf black 1 1 1 c 2177 1329 45 586 bf black 1 1 1 c 1677 1063 328 719 bf black 1677 1063 328 719 bl 1 1 1 c 1677 1063 328 719 bf black 1677 1063 328 719 bl 0.8 0 0
 c[  12 12 ] 0 sd 6 lw 1 1 1 c black 0.8 0 0 c 328 1471 m 93 X 182 Y 94 X 27 Y 93 X -25 Y 93 X -63 Y 93 X -69 Y 93 X -81 Y 93 X -67 Y 93 X -87 Y 94 X -66 Y 93 X -77 Y 93 X -67 Y 93 X -75 Y 93 X -57 Y 93 X -71 Y 93 X -45 Y 93 X -111 Y 187 X s black[ 
 ] 0 sd 3 lw 328 719 m 1677 X s
 gsave  2177 1329 45 586 C 1834.93 622.61 t 0 r /Helvetica findfont 60.8537 sf 0 0 m ( [GeV]) show NC gr 
 gsave  2177 1329 45 586 C 1784.31 589.708 t 0 r /Helvetica findfont 40.5691 sf 0 0 m (Tj1) show NC gr 
 gsave  2177 1329 45 586 C 1751.41 622.61 t 0 r /Helvetica findfont 60.8537 sf 0 0 m (p) show NC gr  468 750 m -31 Y s 515 734 m -15 Y s 561 734 m -15 Y s 608 734 m -15 Y s 654 734 m -15 Y s 701 750 m -31 Y s 747 734 m -15 Y s 794 734 m -15 Y s 841
 734 m -15 Y s 887 734 m -15 Y s 934 750 m -31 Y s 980 734 m -15 Y s 1027 734 m -15 Y s 1073 734 m -15 Y s 1120 734 m -15 Y s 1167 750 m -31 Y s 1213 734 m -15 Y s 1260 734 m -15 Y s 1306 734 m -15 Y s 1353 734 m -15 Y s 1399 750 m -31 Y s 1446 734 m
 -15 Y s 1492 734 m -15 Y s 1539 734 m -15 Y s 1586 734 m -15 Y s 1632 750 m -31 Y s 1679 734 m -15 Y s 1725 734 m -15 Y s 1772 734 m -15 Y s 1818 734 m -15 Y s 1865 750 m -31 Y s 468 750 m -31 Y s 421 734 m -15 Y s 375 734 m -15 Y s 1865 750 m -31 Y
 s 1912 734 m -15 Y s 1958 734 m -15 Y s
 gsave  2177 1329 45 586 C 440.382 675.759 t 0 r /Helvetica findfont 45.6403 sf 0 0 m (50) show NC gr 
 gsave  2177 1329 45 586 C 660.574 675.759 t 0 r /Helvetica findfont 45.6403 sf 0 0 m (100) show NC gr 
 gsave  2177 1329 45 586 C 893.42 675.759 t 0 r /Helvetica findfont 45.6403 sf 0 0 m (150) show NC gr 
 gsave  2177 1329 45 586 C 1126.27 675.759 t 0 r /Helvetica findfont 45.6403 sf 0 0 m (200) show NC gr 
 gsave  2177 1329 45 586 C 1359.11 675.759 t 0 r /Helvetica findfont 45.6403 sf 0 0 m (250) show NC gr 
 gsave  2177 1329 45 586 C 1591.96 675.759 t 0 r /Helvetica findfont 45.6403 sf 0 0 m (300) show NC gr 
 gsave  2177 1329 45 586 C 1824.8 675.759 t 0 r /Helvetica findfont 45.6403 sf 0 0 m (350) show NC gr  328 719 m 1063 Y s
 gsave  2177 1329 45 586 C 212.598 1546.4 t 90 r /Helvetica findfont 60.8537 sf 0 0 m ( [fb/GeV]) show NC gr 
 gsave  2177 1329 45 586 C 245.501 1495.78 t 90 r /Helvetica findfont 40.5691 sf 0 0 m (Tj1) show NC gr 
 gsave  2177 1329 45 586 C 212.598 1412.26 t 90 r /Helvetica findfont 60.8537 sf 0 0 m (/dp) show NC gr 
 gsave  2177 1329 45 586 C 212.598 1374.3 t 90 r /Symbol findfont 60.8537 sf 0 0 m (s) show NC gr 
 gsave  2177 1329 45 586 C 212.598 1343.93 t 90 r /Helvetica findfont 60.8537 sf 0 0 m (d) show NC gr  354 725 m -26 X s 354 744 m -26 X s 381 761 m -53 X s
 gsave  2177 1329 45 586 C 280.934 759.28 t 0 r /Helvetica findfont 30.4268 sf 0 0 m (\2552) show NC gr 
 gsave  2177 1329 45 586 C 230.315 741.564 t 0 r /Helvetica findfont 45.6403 sf 0 0 m (10) show NC gr  354 872 m -26 X s 354 937 m -26 X s 354 983 m -26 X s 354 1019 m -26 X s 354 1048 m -26 X s 354 1073 m -26 X s 354 1094 m -26 X s 354 1113 m -26 X
 s 381 1130 m -53 X s
 gsave  2177 1329 45 586 C 285.996 1128.8 t 0 r /Helvetica findfont 30.4268 sf 0 0 m (\2551) show NC gr 
 gsave  2177 1329 45 586 C 235.377 1111.08 t 0 r /Helvetica findfont 45.6403 sf 0 0 m (10) show NC gr  354 1241 m -26 X s 354 1306 m -26 X s 354 1352 m -26 X s 354 1388 m -26 X s 354 1417 m -26 X s 354 1441 m -26 X s 354 1463 m -26 X s 354 1482 m -26
 X s 381 1499 m -53 X s
 gsave  2177 1329 45 586 C 311.177 1480.4 t 0 r  -24 0 t /Helvetica findfont 45.6403 sf 0 0 m (1) show NC gr  354 1610 m -26 X s 354 1675 m -26 X s 354 1721 m -26 X s 354 1756 m -26 X s 0.4 0.4 0.8 c 6 lw 1 1 1 c black 0.4 0.4 0.8 c 328 1461 m 93 X
 183 Y 94 X 24 Y 93 X -30 Y 93 X -58 Y 93 X -72 Y 93 X -78 Y 93 X -81 Y 93 X -73 Y 94 X -77 Y 93 X -72 Y 93 X -67 Y 93 X -82 Y 93 X -54 Y 93 X -74 Y 93 X -56 Y 93 X -61 Y 94 X -14 Y 93 X s 0 0.8 0 c[ 20 12 4 12] 0 sd 1 1 1 c black 0 0.8 0 c 328 1470
 m 93 X 184 Y 94 X 27 Y 93 X -30 Y 93 X -57 Y 93 X -71 Y 93 X -77 Y 93 X -80 Y 93 X -72 Y 94 X -75 Y 93 X -71 Y 93 X -65 Y 93 X -78 Y 93 X -55 Y 93 X -68 Y 93 X -52 Y 93 X -61 Y 94 X -48 Y 93 X s 0.2 0 0.4 c[ 20 20] 0 sd 1 1 1 c black 0.2 0 0.4 c 328
 1460 m 93 X 180 Y 94 X 25 Y 93 X -29 Y 93 X -60 Y 93 X -72 Y 93 X -78 Y 93 X -79 Y 93 X -76 Y 94 X -75 Y 93 X -76 Y 93 X -72 Y 93 X -67 Y 93 X -65 Y 93 X -55 Y 93 X -61 Y 93 X -52 Y 94 X -29 Y 93 X s 0.8 0 0 c[  12 12 ] 0 sd 1 1 1 c black 0.8 0 0 c
 328 1070 m 93 X 161 Y 94 X 11 Y 93 X -29 Y 93 X -55 Y 93 X -64 Y 93 X -63 Y 93 X -63 Y 93 X -61 Y 94 X -60 Y 93 X -60 Y 93 X -51 Y 93 X -17 Y 559 X s 0.4 0.4 0.8 c[  ] 0 sd 1 1 1 c black 0.4 0.4 0.8 c 328 1106 m 93 X 162 Y 94 X 18 Y 93 X -30 Y 93 X
 -55 Y 93 X -64 Y 93 X -65 Y 93 X -70 Y 93 X -61 Y 94 X -59 Y 93 X -74 Y 93 X -41 Y 93 X -48 Y 559 X s 0 0.8 0 c[ 20 12 4 12] 0 sd 1 1 1 c black 0 0.8 0 c 328 1106 m 93 X 159 Y 94 X 17 Y 93 X -30 Y 93 X -54 Y 93 X -65 Y 93 X -67 Y 93 X -66 Y 93 X -61
 Y 94 X -56 Y 93 X -76 Y 93 X -37 Y 93 X -51 Y 559 X s 0.2 0 0.4 c[ 20 20] 0 sd 1 1 1 c black 0.2 0 0.4 c 328 1084 m 93 X 158 Y 94 X 13 Y 93 X -33 Y 93 X -53 Y 93 X -65 Y 93 X -63 Y 93 X -66 Y 93 X -60 Y 94 X -66 Y 93 X -56 Y 93 X -51 Y 93 X -23 Y
 559 X s black
 gsave  2177 1329 45 586 C 2057.65 1338.86 t 90 r /Helvetica-BoldOblique findfont 38.0336 sf 0 0 m 
 410 392 371 351 340 311 276 266 241 216 206 181 152 123 113 86 76 49 22
(LHC HIGGS XS WG 2011) K NC gr 
 gsave  2177 1329 45 586 C 1650.17 1705.85 t 0 r /Helvetica findfont 30.4268 sf 0 0 m 
 239 229 212 191 182 154 135 126 118 97 88 68 40 22
(HAWK w/ EW Corr) K NC gr  0.4 0.4 0.8 c[  ] 0 sd 1544 1717 m 88 X s black
 gsave  2177 1329 45 586 C 1650.17 1629.92 t 0 r /Helvetica findfont 30.4268 sf 0 0 m (POWHEG) show NC gr  0.8 0 0 c[  12 12 ] 0 sd 1544 1641 m 88 X s black
 gsave  2177 1329 45 586 C 1650.17 1553.99 t 0 r /Helvetica findfont 30.4268 sf 0 0 m 
 255 245 228 207 198 170 151 142 126 118 96 88 68 40 21
(HAWK w/o EW Corr) K NC gr  0 0.8 0 c[ 20 12 4 12] 0 sd 1544 1564 m 88 X s black
 gsave  2177 1329 45 586 C 1650.17 1475.53 t 0 r /Helvetica findfont 30.4268 sf 0 0 m (VBFNLO w/ EW Corr) show NC gr  0.2 0 0.4 c[ 20 20] 0 sd 1544 1488 m 88 X s black[  ] 0 sd 3 lw 1 1 1 c black 1 1 1 c 1677 300 328 231 bf black 1677 300 328 231 bl
 1 1 1 c 1677 300 328 231 bf black 1677 300 328 231 bl 328 231 m 1677 X s
 gsave  2177 547 45 39 C 1834.93 134.139 t 0 r /Helvetica findfont 60.7874 sf 0 0 m ( [GeV]) show NC gr 
 gsave  2177 547 45 39 C 1784.31 101.237 t 0 r /Helvetica findfont 40.5249 sf 0 0 m (Tj1) show NC gr 
 gsave  2177 547 45 39 C 1751.41 134.139 t 0 r /Helvetica findfont 60.7874 sf 0 0 m (p) show NC gr  468 243 m -12 Y s 515 237 m -6 Y s 561 237 m -6 Y s 608 237 m -6 Y s 654 237 m -6 Y s 701 243 m -12 Y s 747 237 m -6 Y s 794 237 m -6 Y s 841 237 m -6
 Y s 887 237 m -6 Y s 934 243 m -12 Y s 980 237 m -6 Y s 1027 237 m -6 Y s 1073 237 m -6 Y s 1120 237 m -6 Y s 1167 243 m -12 Y s 1213 237 m -6 Y s 1260 237 m -6 Y s 1306 237 m -6 Y s 1353 237 m -6 Y s 1399 243 m -12 Y s 1446 237 m -6 Y s 1492 237 m
 -6 Y s 1539 237 m -6 Y s 1586 237 m -6 Y s 1632 243 m -12 Y s 1679 237 m -6 Y s 1725 237 m -6 Y s 1772 237 m -6 Y s 1818 237 m -6 Y s 1865 243 m -12 Y s 468 243 m -12 Y s 421 237 m -6 Y s 375 237 m -6 Y s 1865 243 m -12 Y s 1912 237 m -6 Y s 1958
 237 m -6 Y s
 gsave  2177 547 45 39 C 440.382 189.82 t 0 r /Helvetica findfont 45.5906 sf 0 0 m (50) show NC gr 
 gsave  2177 547 45 39 C 660.574 189.82 t 0 r /Helvetica findfont 45.5906 sf 0 0 m (100) show NC gr 
 gsave  2177 547 45 39 C 893.42 189.82 t 0 r /Helvetica findfont 45.5906 sf 0 0 m (150) show NC gr 
 gsave  2177 547 45 39 C 1126.27 189.82 t 0 r /Helvetica findfont 45.5906 sf 0 0 m (200) show NC gr 
 gsave  2177 547 45 39 C 1359.11 189.82 t 0 r /Helvetica findfont 45.5906 sf 0 0 m (250) show NC gr 
 gsave  2177 547 45 39 C 1591.96 189.82 t 0 r /Helvetica findfont 45.5906 sf 0 0 m (300) show NC gr 
 gsave  2177 547 45 39 C 1824.8 189.82 t 0 r /Helvetica findfont 45.5906 sf 0 0 m (350) show NC gr  328 231 m 300 Y s
 gsave  2177 547 45 39 C 222.722 430.259 t 90 r /Helvetica findfont 60.7874 sf 0 0 m ( [%]) show NC gr 
 gsave  2177 547 45 39 C 245.501 364.454 t 90 r /Helvetica findfont 40.5249 sf 0 0 m (EW) show NC gr 
 gsave  2177 547 45 39 C 222.722 334.083 t 90 r /Symbol findfont 60.7874 sf 0 0 m (d) show NC gr  364 279 m -36 X s 346 299 m -18 X s 346 318 m -18 X s 346 337 m -18 X s 346 357 m -18 X s 364 376 m -36 X s 346 396 m -18 X s 346 415 m -18 X s 346 434
 m -18 X s 346 454 m -18 X s 364 473 m -36 X s 364 279 m -36 X s 346 260 m -18 X s 346 240 m -18 X s 364 473 m -36 X s 346 493 m -18 X s 346 512 m -18 X s
 gsave  2177 547 45 39 C 250.562 263.217 t 0 r /Helvetica findfont 45.5906 sf 0 0 m (\25520) show NC gr 
 gsave  2177 547 45 39 C 250.562 359.393 t 0 r /Helvetica findfont 45.5906 sf 0 0 m (\25510) show NC gr 
 gsave  2177 547 45 39 C 291.057 455.568 t 0 r /Helvetica findfont 45.5906 sf 0 0 m (0) show NC gr  375 420 m -47 X s 328 415 m 10 Y s 375 420 m 46 X s 421 415 m 10 Y s 375 420 m 1 Y s 370 421 m 10 X s 375 420 m -2 Y s 370 418 m 10 X s 468 410 m -47
 X s 421 405 m 10 Y s 468 410 m 47 X s 515 405 m 10 Y s 468 410 m 1 Y s 463 411 m 10 X s 468 410 m -1 Y s 463 409 m 10 X s 561 402 m -46 X s 515 397 m 10 Y s 561 402 m 47 X s 608 397 m 10 Y s 561 402 m 1 Y s 556 403 m 10 X s 561 402 m -1 Y s 556 401
 m 10 X s 654 395 m -46 X s 608 390 m 10 Y s 654 395 m 47 X s 701 390 m 10 Y s 654 395 m 1 Y s 649 396 m 10 X s 654 395 m -1 Y s 649 394 m 10 X s 747 393 m -46 X s 701 388 m 10 Y s 747 393 m 47 X s 794 388 m 10 Y s 747 393 m 1 Y s 742 394 m 11 X s
 747 393 m -1 Y s 742 392 m 11 X s 841 385 m -47 X s 794 380 m 10 Y s 841 385 m 46 X s 887 380 m 10 Y s 841 385 m 2 Y s 836 387 m 10 X s 841 385 m -1 Y s 836 384 m 10 X s 934 379 m -47 X s 887 374 m 11 Y s 934 379 m 46 X s 980 374 m 11 Y s 934 379 m
 2 Y s 929 381 m 10 X s 934 379 m -1 Y s 929 378 m 10 X s 1027 374 m -47 X s 980 368 m 11 Y s 1027 374 m 46 X s 1073 368 m 11 Y s 1027 374 m 2 Y s 1022 376 m 10 X s 1027 374 m -3 Y s 1022 371 m 10 X s 1120 369 m -47 X s 1073 364 m 10 Y s 1120 369 m
 47 X s 1167 364 m 10 Y s 1120 369 m 3 Y s 1115 372 m 10 X s 1120 369 m -3 Y s 1115 366 m 10 X s 1213 360 m -46 X s 1167 355 m 10 Y s 1213 360 m 47 X s 1260 355 m 10 Y s 1213 360 m 4 Y s 1208 364 m 10 X s 1213 360 m -4 Y s 1208 356 m 10 X s 1306 350
 m -46 X s 1260 345 m 10 Y s 1306 350 m 47 X s 1353 345 m 10 Y s 1306 350 m 5 Y s 1301 355 m 10 X s 1306 350 m -5 Y s 1301 345 m 10 X s 1399 348 m -46 X s 1353 343 m 10 Y s 1399 348 m 47 X s 1446 343 m 10 Y s 1399 348 m 6 Y s 1394 354 m 10 X s 1399
 348 m -6 Y s 1394 342 m 10 X s 1492 323 m -46 X s 1446 318 m 10 Y s 1492 323 m 47 X s 1539 318 m 10 Y s 1492 323 m 9 Y s 1487 332 m 11 X s 1492 323 m -9 Y s 1487 314 m 11 X s 1586 320 m -47 X s 1539 315 m 10 Y s 1586 320 m 46 X s 1632 315 m 10 Y s
 1586 320 m 10 Y s 1581 330 m 10 X s 1586 320 m -10 Y s 1581 310 m 10 X s 1679 292 m -47 X s 1632 286 m 11 Y s 1679 292 m 46 X s 1725 286 m 11 Y s 1679 292 m 13 Y s 1674 305 m 10 X s 1679 292 m -14 Y s 1674 278 m 10 X s 1772 291 m -47 X s 1725 286 m
 10 Y s 1772 291 m 46 X s 1818 286 m 10 Y s 1772 291 m 16 Y s 1767 307 m 10 X s 1772 291 m -16 Y s 1767 275 m 10 X s 1865 276 m -47 X s 1818 271 m 11 Y s 1865 276 m 47 X s 1912 271 m 11 Y s 1865 276 m 20 Y s 1860 296 m 10 X s 1865 276 m -19 Y s 1860
 257 m 10 X s 1958 268 m -46 X s 1912 263 m 10 Y s 1958 268 m 47 X s 2005 263 m 10 Y s 1958 268 m 27 Y s 1953 295 m 10 X s 1958 268 m -27 Y s 1953 241 m 10 X s 0.4 0.4 0.4 c black /w 4 def /w2 {w 2 div} def /w3 {w 3 div} def 375 420 468 410 561 402
 654 395 747 393 841 385 934 379 1027 374 1120 369 1213 360 1306 350 1399 348 1492 323 1586 320 1679 292 1772 291 1865 276 1958 268 18 { m21} R 0.4 0.4 0.4 c black 0.4 0.4 0.4 c
 gsave  2177 547 45 39 C 427.728 356.862 t 0 r /Helvetica findfont 40.5249 sf 0 0 m ( = 120 GeV) show NC gr  black 0.4 0.4 0.4 c
 gsave  2177 547 45 39 C 407.48 346.738 t 0 r /Helvetica findfont 27.8609 sf 0 0 m (H) show NC gr  black 0.4 0.4 0.4 c
 gsave  2177 547 45 39 C 374.578 356.862 t 0 r /Helvetica findfont 40.5249 sf 0 0 m (M) show NC gr  0.6 0 0 c 375 497 m -47 X s 328 492 m 10 Y s 375 497 m 46 X s 421 492 m 10 Y s 375 497 m 2 Y s 370 499 m 10 X s 375 497 m -2 Y s 370 495 m 10 X s 468
 496 m -47 X s 421 491 m 10 Y s 468 496 m 47 X s 515 491 m 10 Y s 468 496 m 1 Y s 463 497 m 10 X s 468 496 m -2 Y s 463 494 m 10 X s 561 498 m -46 X s 515 493 m 10 Y s 561 498 m 47 X s 608 493 m 10 Y s 561 498 m 2 Y s 556 500 m 10 X s 561 498 m -1 Y
 s 556 497 m 10 X s 654 500 m -46 X s 608 495 m 10 Y s 654 500 m 47 X s 701 495 m 10 Y s 654 500 m 2 Y s 649 502 m 10 X s 654 500 m -1 Y s 649 499 m 10 X s 747 498 m -46 X s 701 493 m 10 Y s 747 498 m 47 X s 794 493 m 10 Y s 747 498 m 2 Y s 742 500 m
 11 X s 747 498 m -1 Y s 742 497 m 11 X s 841 503 m -47 X s 794 498 m 11 Y s 841 503 m 46 X s 887 498 m 11 Y s 841 503 m 2 Y s 836 505 m 10 X s 841 503 m -1 Y s 836 502 m 10 X s 934 505 m -47 X s 887 500 m 10 Y s 934 505 m 46 X s 980 500 m 10 Y s 934
 505 m 5 Y s 929 510 m 10 X s 934 505 m -5 Y s 929 500 m 10 X s 1027 491 m -47 X s 980 486 m 10 Y s 1027 491 m 46 X s 1073 486 m 10 Y s 1027 491 m 2 Y s 1022 493 m 10 X s 1027 491 m -2 Y s 1022 489 m 10 X s 1120 488 m -47 X s 1073 483 m 10 Y s 1120
 488 m 47 X s 1167 483 m 10 Y s 1120 488 m 3 Y s 1115 491 m 10 X s 1120 488 m -2 Y s 1115 486 m 10 X s 1213 476 m -46 X s 1167 471 m 10 Y s 1213 476 m 47 X s 1260 471 m 10 Y s 1213 476 m 3 Y s 1208 479 m 10 X s 1213 476 m -2 Y s 1208 474 m 10 X s
 1306 473 m -46 X s 1260 468 m 10 Y s 1306 473 m 47 X s 1353 468 m 10 Y s 1306 473 m 3 Y s 1301 476 m 10 X s 1306 473 m -4 Y s 1301 469 m 10 X s 1399 464 m -46 X s 1353 459 m 10 Y s 1399 464 m 47 X s 1446 459 m 10 Y s 1399 464 m 3 Y s 1394 467 m 10 X
 s 1399 464 m -3 Y s 1394 461 m 10 X s 1492 461 m -46 X s 1446 456 m 10 Y s 1492 461 m 47 X s 1539 456 m 10 Y s 1492 461 m 4 Y s 1487 465 m 11 X s 1492 461 m -4 Y s 1487 457 m 11 X s 1586 435 m -47 X s 1539 430 m 10 Y s 1586 435 m 46 X s 1632 430 m
 10 Y s 1586 435 m 4 Y s 1581 439 m 10 X s 1586 435 m -5 Y s 1581 430 m 10 X s 1679 437 m -47 X s 1632 432 m 10 Y s 1679 437 m 46 X s 1725 432 m 10 Y s 1679 437 m 4 Y s 1674 441 m 10 X s 1679 437 m -4 Y s 1674 433 m 10 X s 1772 422 m -47 X s 1725 417
 m 10 Y s 1772 422 m 46 X s 1818 417 m 10 Y s 1772 422 m 4 Y s 1767 426 m 10 X s 1772 422 m -5 Y s 1767 417 m 10 X s 1865 402 m -47 X s 1818 397 m 10 Y s 1865 402 m 47 X s 1912 397 m 10 Y s 1865 402 m 9 Y s 1860 411 m 10 X s 1865 402 m -8 Y s 1860
 394 m 10 X s 1958 398 m -46 X s 1912 393 m 10 Y s 1958 398 m 47 X s 2005 393 m 10 Y s 1958 398 m 9 Y s 1953 407 m 10 X s 1958 398 m -9 Y s 1953 389 m 10 X s black 375 497 468 496 561 498 654 500 747 498 841 503 934 505 1027 491 1120 488 1213 476
 1306 473 1399 464 1492 461 1586 435 1679 437 1772 422 1865 402 1958 398 18 { m22} R 0.6 0 0 c black 0.6 0 0 c
 gsave  2177 547 45 39 C 427.728 435.321 t 0 r /Helvetica findfont 40.5249 sf 0 0 m ( = 600 GeV) show NC gr  black 0.6 0 0 c
 gsave  2177 547 45 39 C 407.48 425.197 t 0 r /Helvetica findfont 27.8609 sf 0 0 m (H) show NC gr  black 0.6 0 0 c
 gsave  2177 547 45 39 C 374.578 435.321 t 0 r /Helvetica findfont 40.5249 sf 0 0 m (M) show NC gr 
 gr  gr showpage
end
%%EOF
