%!PS-Adobe-2.0 EPSF-2.0
%%BoundingBox:  0 0 567 384
%%Title: plotZZ/mZZ_PYTHIA_POWHEG.eps: c1
%%Creator: ROOT Version 5.27/06b
%%CreationDate: Mon Dec  5 16:39:33 2011
%%EndComments
%%BeginProlog
80 dict begin
/s {stroke} def /l {lineto} def /m {moveto} def /t {translate} def
/r {rotate} def /rl {roll}  def /R {repeat} def
/d {rlineto} def /rm {rmoveto} def /gr {grestore} def /f {eofill} def
/c {setrgbcolor} def /black {0 setgray} def /sd {setdash} def
/cl {closepath} def /sf {scalefont setfont} def /lw {setlinewidth} def
/box {m dup 0 exch d exch 0 d 0 exch neg d cl} def
/NC{systemdict begin initclip end}def/C{NC box clip newpath}def
/bl {box s} def /bf {box f} def /Y { 0 exch d} def /X { 0 d} def 
/K {{pop pop 0 moveto} exch kshow} bind def
/ita {/ang 15 def gsave [1 0 ang dup sin exch cos div 1 0 0] concat} def 
/mp {newpath /y exch def /x exch def} def
/side {[w .77 mul w .23 mul] .385 w mul sd w 0 l currentpoint t -144 r} def
/mr {mp x y w2 0 360 arc} def /m24 {mr s} def /m20 {mr f} def
/mb {mp x y w2 add m w2 neg 0 d 0 w neg d w 0 d 0 w d cl} def
/mt {mp x y w2 add m w2 neg w neg d w 0 d cl} def
/m21 {mb f} def /m25 {mb s} def /m22 {mt f} def /m26{mt s} def
/m23 {mp x y w2 sub m w2 w d w neg 0 d cl f} def
/m27 {mp x y w2 add m w3 neg w2 neg d w3 w2 neg d w3 w2 d cl s} def
/m28 {mp x w2 sub y w2 sub w3 add m w3 0 d  0 w3 neg d w3 0 d 0 w3 d w3 0 d  0 w3 d w3 neg 0 d 0 w3 d w3 neg 0 d 0 w3 neg d w3 neg 0 d cl s } def
/m29 {mp gsave x w2 sub y w2 add w3 sub m currentpoint t 4 {side} repeat cl fill gr} def
/m30 {mp gsave x w2 sub y w2 add w3 sub m currentpoint t 4 {side} repeat cl s gr} def
/m31 {mp x y w2 sub m 0 w d x w2 sub y m w 0 d x w2 sub y w2 add m w w neg d x w2 sub y w2 sub m w w d s} def
/m32 {mp x y w2 sub m w2 w d w neg 0 d cl s} def
/m33 {mp x y w2 add m w3 neg w2 neg d w3 w2 neg d w3 w2 d cl f} def
/m34 {mp x w2 sub y w2 sub w3 add m w3 0 d  0 w3 neg d w3 0 d 0 w3 d w3 0 d  0 w3 d w3 neg 0 d 0 w3 d w3 neg 0 d 0 w3 neg d w3 neg 0 d cl f } def
/m2 {mp x y w2 sub m 0 w d x w2 sub y m w 0 d s} def
/m5 {mp x w2 sub y w2 sub m w w d x w2 sub y w2 add m w w neg d s} def
/reEncode {exch findfont dup length dict begin {1 index /FID eq  {pop pop} {def} ifelse } forall /Encoding exch def currentdict end dup /FontName get exch definefont pop } def [/Times-Bold /Times-Italic /Times-BoldItalic /Helvetica /Helvetica-Oblique
 /Helvetica-Bold /Helvetica-BoldOblique /Courier /Courier-Oblique /Courier-Bold /Courier-BoldOblique /Times-Roman /AvantGarde-Book /AvantGarde-BookOblique /AvantGarde-Demi /AvantGarde-DemiOblique /Bookman-Demi /Bookman-DemiItalic /Bookman-Light
 /Bookman-LightItalic /Helvetica-Narrow /Helvetica-Narrow-Bold /Helvetica-Narrow-BoldOblique /Helvetica-Narrow-Oblique /NewCenturySchlbk-Roman /NewCenturySchlbk-Bold /NewCenturySchlbk-BoldItalic /NewCenturySchlbk-Italic /Palatino-Bold
 /Palatino-BoldItalic /Palatino-Italic /Palatino-Roman ] {ISOLatin1Encoding reEncode } forall%%EndProlog
%%BeginSetup
%%EndSetup
newpath  gsave  .25 .25 scale  gsave  0 0 t black[  ] 0 sd 3 lw 1 1 1 c 2268 1538 0 0 bf black 1 1 1 c 1791 1215 363 246 bf black 1791 1215 363 246 bl 1 1 1 c 1791 1215 363 246 bf black 1791 1215 363 246 bl 363 246 m 1791 X s
 gsave  2268 1538 0 0 C 1955.06 117.688 t 0 r /Helvetica findfont 71.6807 sf 0 0 m ( [GeV]) show NC gr 
 gsave  2268 1538 0 0 C 1896.44 98.125 t 0 r /Helvetica findfont 48.8732 sf 0 0 m (ZZ) show NC gr 
 gsave  2268 1538 0 0 C 1841.06 117.688 t 0 r /Helvetica findfont 71.6807 sf 0 0 m (M) show NC gr  363 283 m -37 Y s 423 264 m -18 Y s 482 264 m -18 Y s 542 264 m -18 Y s 602 264 m -18 Y s 661 283 m -37 Y s 721 264 m -18 Y s 781 264 m -18 Y s 841 264
 m -18 Y s 900 264 m -18 Y s 960 283 m -37 Y s 1020 264 m -18 Y s 1079 264 m -18 Y s 1139 264 m -18 Y s 1199 264 m -18 Y s 1259 283 m -37 Y s 1318 264 m -18 Y s 1378 264 m -18 Y s 1438 264 m -18 Y s 1497 264 m -18 Y s 1557 283 m -37 Y s 1617 264 m
 -18 Y s 1677 264 m -18 Y s 1736 264 m -18 Y s 1796 264 m -18 Y s 1856 283 m -37 Y s 1915 264 m -18 Y s 1975 264 m -18 Y s 2035 264 m -18 Y s 2095 264 m -18 Y s 2154 283 m -37 Y s
 gsave  2268 1538 0 0 C 348.812 205.625 t 0 r /Helvetica findfont 39.0986 sf 0 0 m (0) show NC gr 
 gsave  2268 1538 0 0 C 629 205.625 t 0 r /Helvetica findfont 39.0986 sf 0 0 m (100) show NC gr 
 gsave  2268 1538 0 0 C 925.5 205.625 t 0 r /Helvetica findfont 39.0986 sf 0 0 m (200) show NC gr 
 gsave  2268 1538 0 0 C 1225.25 205.625 t 0 r /Helvetica findfont 39.0986 sf 0 0 m (300) show NC gr 
 gsave  2268 1538 0 0 C 1521.75 205.625 t 0 r /Helvetica findfont 39.0986 sf 0 0 m (400) show NC gr 
 gsave  2268 1538 0 0 C 1821.5 205.625 t 0 r /Helvetica findfont 39.0986 sf 0 0 m (500) show NC gr 
 gsave  2268 1538 0 0 C 2121.25 205.625 t 0 r /Helvetica findfont 39.0986 sf 0 0 m (600) show NC gr  363 1461 m 1791 X s 363 1425 m 36 Y s 423 1443 m 18 Y s 482 1443 m 18 Y s 542 1443 m 18 Y s 602 1443 m 18 Y s 661 1425 m 36 Y s 721 1443 m 18 Y s 781
 1443 m 18 Y s 841 1443 m 18 Y s 900 1443 m 18 Y s 960 1425 m 36 Y s 1020 1443 m 18 Y s 1079 1443 m 18 Y s 1139 1443 m 18 Y s 1199 1443 m 18 Y s 1259 1425 m 36 Y s 1318 1443 m 18 Y s 1378 1443 m 18 Y s 1438 1443 m 18 Y s 1497 1443 m 18 Y s 1557 1425
 m 36 Y s 1617 1443 m 18 Y s 1677 1443 m 18 Y s 1736 1443 m 18 Y s 1796 1443 m 18 Y s 1856 1425 m 36 Y s 1915 1443 m 18 Y s 1975 1443 m 18 Y s 2035 1443 m 18 Y s 2095 1443 m 18 Y s 2154 1425 m 36 Y s 363 246 m 1215 Y s
 gsave  2268 1538 0 0 C 231.562 1124.38 t 90 r /Helvetica findfont 71.6807 sf 0 0 m ( [fb/6 GeV]) show NC gr 
 gsave  2268 1538 0 0 C 257.625 1065.75 t 90 r /Helvetica findfont 48.8732 sf 0 0 m (ZZ) show NC gr 
 gsave  2268 1538 0 0 C 231.562 857.188 t 90 r /Helvetica findfont 71.6807 sf 0 0 m (dN/dm) show NC gr  390 270 m -27 X s 390 309 m -27 X s 390 341 m -27 X s 390 368 m -27 X s 390 391 m -27 X s 390 412 m -27 X s 417 431 m -54 X s
 gsave  2268 1538 0 0 C 326.062 433.688 t 0 r /Helvetica findfont 26.0657 sf 0 0 m (\2551) show NC gr 
 gsave  2268 1538 0 0 C 283.688 414.188 t 0 r /Helvetica findfont 39.0986 sf 0 0 m (10) show NC gr  390 553 m -27 X s 390 624 m -27 X s 390 675 m -27 X s 390 714 m -27 X s 390 746 m -27 X s 390 773 m -27 X s 390 796 m -27 X s 390 817 m -27 X s 417
 836 m -54 X s
 gsave  2268 1538 0 0 C 346.75 820.312 t 0 r  -21 0 t /Helvetica findfont 39.0986 sf 0 0 m (1) show NC gr  390 958 m -27 X s 390 1029 m -27 X s 390 1079 m -27 X s 390 1119 m -27 X s 390 1151 m -27 X s 390 1178 m -27 X s 390 1201 m -27 X s 390 1222 m
 -27 X s 417 1241 m -54 X s
 gsave  2268 1538 0 0 C 346.75 1225.31 t 0 r  -42 0 t /Helvetica findfont 39.0986 sf 0 0 m (10) show NC gr  390 1363 m -27 X s 390 1434 m -27 X s 2154 246 m 1215 Y s 2127 270 m 27 X s 2127 309 m 27 X s 2127 341 m 27 X s 2127 368 m 27 X s 2127 391 m
 27 X s 2127 412 m 27 X s 2101 431 m 53 X s 2127 553 m 27 X s 2127 624 m 27 X s 2127 675 m 27 X s 2127 714 m 27 X s 2127 746 m 27 X s 2127 773 m 27 X s 2127 796 m 27 X s 2127 817 m 27 X s 2101 836 m 53 X s 2127 958 m 27 X s 2127 1029 m 27 X s 2127
 1079 m 27 X s 2127 1119 m 27 X s 2127 1151 m 27 X s 2127 1178 m 27 X s 2127 1201 m 27 X s 2127 1222 m 27 X s 2101 1241 m 53 X s 2127 1363 m 27 X s 2127 1434 m 27 X s 0 0 1 c 6 lw 1 1 1 c 0 0 1 c 363 246 m 89 X 63 Y 18 X 178 Y 18 X 176 Y 18 X -18 Y
 18 X -7 Y 18 X 92 Y 18 X -16 Y 18 X -5 Y 18 X 141 Y 18 X 325 Y 18 X 241 Y 17 X -415 Y 18 X -109 Y 18 X 56 Y 18 X 13 Y 18 X -8 Y 18 X -12 Y 18 X 5 Y 18 X -28 Y 18 X 6 Y 18 X -46 Y 18 X -7 Y 18 X -21 Y 17 X 25 Y 18 X -27 Y 18 X 113 Y 18 X 95 Y 18 X 15
 Y 36 X -13 Y 18 X 2 Y 18 X -24 Y 18 X -23 Y 18 X -11 Y 18 X 6 Y 17 X -30 Y 18 X 20 Y 18 X -51 Y 18 X -14 Y 18 X -31 Y 18 X -1 Y 18 X -23 Y 18 X -30 Y 18 X 23 Y 18 X -38 Y 18 X -6 Y 17 X -5 Y 18 X -15 Y 18 X 22 Y 18 X 7 Y 18 X -76 Y 18 X 36 Y 18 X
 -36 Y 18 X -22 Y 18 X 11 Y 18 X -64 Y 18 X 15 Y 18 X -10 Y 17 X -45 Y 18 X -7 Y 18 X -22 Y 18 X -8 Y 18 X 55 Y 18 X -47 Y 18 X 35 Y 18 X -59 Y 18 X 32 Y 18 X -41 Y 18 X -67 Y 18 X 57 Y 17 X 19 Y 36 X -51 Y 18 X -25 Y 18 X -46 Y 18 X -161 Y 18 X 161
 Y 18 X 17 Y 18 X 65 Y 18 X -145 Y 36 X 80 Y 17 X -107 Y 18 X 27 Y 18 X 63 Y 18 X -63 Y 18 X 24 Y 18 X 20 Y 18 X -71 Y 18 X 71 Y 18 X -71 Y 18 X 27 Y 18 X -149 Y 18 X 90 Y 17 X -102 Y 18 X s 1 0 0 c 1 1 1 c 1 0 0 c 363 246 m 71 X 179 Y 18 X 240 Y 18
 X 62 Y 18 X 10 Y 18 X -12 Y 18 X -20 Y 18 X -20 Y 18 X -27 Y 18 X -25 Y 18 X -16 Y 18 X -11 Y 18 X -17 Y 17 X 10 Y 18 X 163 Y 18 X 135 Y 18 X 34 Y 18 X -14 Y 18 X -8 Y 18 X -15 Y 18 X -26 Y 18 X -17 Y 18 X -25 Y 18 X -16 Y 18 X -15 Y 17 X -15 Y 18 X
 22 Y 18 X 102 Y 18 X 85 Y 18 X 19 Y 18 X 4 Y 18 X -10 Y 18 X -10 Y 18 X -15 Y 18 X -14 Y 18 X -16 Y 18 X -14 Y 17 X -20 Y 18 X -7 Y 18 X -24 Y 18 X -11 Y 18 X -18 Y 18 X -14 Y 18 X -12 Y 18 X -13 Y 18 X -18 Y 18 X -13 Y 18 X -22 Y 17 X -1 Y 18 X -13
 Y 18 X -18 Y 18 X -11 Y 18 X -8 Y 18 X -15 Y 18 X -11 Y 18 X -17 Y 18 X -11 Y 18 X -4 Y 18 X -19 Y 18 X -8 Y 17 X -6 Y 18 X -10 Y 18 X -15 Y 18 X -2 Y 18 X -8 Y 18 X -22 Y 18 X -14 Y 18 X -4 Y 18 X -5 Y 18 X -29 Y 18 X 3 Y 18 X -5 Y 17 X -28 Y 18 X
 -14 Y 18 X 11 Y 18 X -11 Y 18 X -13 Y 18 X -2 Y 18 X -15 Y 18 X 3 Y 18 X -5 Y 18 X -15 Y 36 X -15 Y 17 X 2 Y 18 X -34 Y 18 X 16 Y 18 X -8 Y 18 X -18 Y 18 X -27 Y 18 X 2 Y 18 X -35 Y 18 X 26 Y 18 X 2 Y 18 X -7 Y 18 X -21 Y 17 X -1 Y 18 X s 1 1 1 c 0
 lw 884 199 907 1077 bf black
 gsave  2268 1538 0 0 C 1127.5 1215.62 t 0 r /Helvetica findfont 42.3568 sf 0 0 m (POWHEG \(NLO\)) show NC gr  0 0 1 c 3 lw /w 31 def /w2 {w 2 div} def /w3 {w 3 div} def 1018 1226 m26 0 lw black
 gsave  2268 1538 0 0 C 1127.5 1114.62 t 0 r /Helvetica findfont 42.3568 sf 0 0 m 
 237 204 180 165 153 127 115 84 57 28
(PYTHIA \(LO\)) K NC gr  1 0 0 c 3 lw 1018 1126 m26 0 lw black
 gsave  2268 1538 0 0 C 2199.44 1124.38 t 90 r /Helvetica-BoldOblique findfont 29.3239 sf 0 0 m 
 317 303 287 271 263 240 213 205 186 167 159 140 118 95 87 67 59 38 17
(LHC HIGGS XS WG 2011) K NC gr 
 gr  gr showpage
end
%%EOF
