%!PS-Adobe-1.0
%%Creator: Unified Graphics System
%%Pages: (atend)
%%DocumentFonts: Courier
%%BoundingBox:  102  226  481  563
%%EndComments
/Sw{setlinewidth}def
/Sg{setgray}def
/Sd{setdash}def
/P {newpath
    moveto
0 0 rlineto
    stroke}def
/M {moveto}def
/D {lineto}def
/N {newpath}def
/S {stroke}def
/T {/Courier findfont
    exch
    scalefont
    setfont}def
/R {rotate}def
/W {show}def
/F {fill}def
/X {gsave}def
/Y {grestore}def
%%EndProlog
%%Page: 1 1
0.24000 0.24000 scale
1 setlinecap
1 setlinejoin
4 Sw
0 0 0 setrgbcolor
[] 0 Sd
N
1042 2259 M
1042 2227 D
S
N
1043 2259 M
1043 2227 D
S
N
1043 2254 M
1046 2257 D
1049 2259 D
1052 2259 D
1057 2257 D
1060 2254 D
1062 2249 D
1062 2246 D
1060 2242 D
1057 2239 D
1052 2237 D
1049 2237 D
1046 2239 D
1043 2242 D
S
N
1052 2259 M
1055 2257 D
1059 2254 D
1060 2249 D
1060 2246 D
1059 2242 D
1055 2239 D
1052 2237 D
S
N
1037 2259 M
1043 2259 D
S
N
1037 2227 M
1048 2227 D
S
N
1074 2259 M
1074 2227 D
S
N
1075 2259 M
1075 2227 D
S
N
1075 2254 M
1078 2257 D
1081 2259 D
1084 2259 D
1089 2257 D
1092 2254 D
1093 2249 D
1093 2246 D
1092 2242 D
1089 2239 D
1084 2237 D
1081 2237 D
1078 2239 D
1075 2242 D
S
N
1084 2259 M
1087 2257 D
1090 2254 D
1092 2249 D
1092 2246 D
1090 2242 D
1087 2239 D
1084 2237 D
S
N
1069 2259 M
1075 2259 D
S
N
1069 2227 M
1080 2227 D
S
N
1151 2254 M
1155 2251 D
1151 2248 D
S
N
1146 2259 M
1154 2251 D
1146 2243 D
S
N
1128 2251 M
1154 2251 D
S
N
1193 2269 M
1193 2237 D
S
N
1194 2269 M
1194 2237 D
S
N
1212 2269 M
1212 2237 D
S
N
1214 2269 M
1214 2237 D
S
N
1188 2269 M
1199 2269 D
S
N
1208 2269 M
1219 2269 D
S
N
1194 2254 M
1212 2254 D
S
N
1188 2237 M
1199 2237 D
S
N
1208 2237 M
1219 2237 D
S
N
1229 2269 M
1229 2243 D
1231 2239 D
1234 2237 D
1237 2237 D
1240 2239 D
1241 2242 D
S
N
1231 2269 M
1231 2243 D
1232 2239 D
1234 2237 D
S
N
1225 2259 M
1237 2259 D
S
N
1252 2269 M
1252 2243 D
1253 2239 D
1256 2237 D
1259 2237 D
1262 2239 D
1264 2242 D
S
N
1253 2269 M
1253 2243 D
1255 2239 D
1256 2237 D
S
N
1247 2259 M
1259 2259 D
S
N
1243 2278 M
1276 2278 D
S
N
1377 2259 M
1362 2259 D
1357 2257 D
1354 2252 D
1353 2248 D
1353 2243 D
1354 2240 D
1356 2239 D
1359 2237 D
1362 2237 D
1366 2239 D
1369 2243 D
1371 2248 D
1371 2252 D
1369 2256 D
1368 2257 D
1365 2259 D
S
N
1362 2259 M
1359 2257 D
1356 2252 D
1354 2248 D
1354 2242 D
1356 2239 D
S
N
1362 2237 M
1365 2239 D
1368 2243 D
1369 2248 D
1369 2254 D
1368 2257 D
S
N
1368 2257 M
1377 2257 D
S
N
1410 2275 M
1410 2227 D
S
N
1412 2275 M
1412 2227 D
S
N
1410 2275 M
1421 2275 D
S
N
1410 2227 M
1421 2227 D
S
N
1433 2259 M
1433 2227 D
S
N
1434 2259 M
1434 2227 D
S
N
1434 2254 M
1437 2257 D
1440 2259 D
1443 2259 D
1448 2257 D
1451 2254 D
1452 2249 D
1452 2246 D
1451 2242 D
1448 2239 D
1443 2237 D
1440 2237 D
1437 2239 D
1434 2242 D
S
N
1443 2259 M
1446 2257 D
1449 2254 D
1451 2249 D
1451 2246 D
1449 2242 D
1446 2239 D
1443 2237 D
S
N
1428 2259 M
1434 2259 D
S
N
1428 2227 M
1439 2227 D
S
N
1465 2269 M
1465 2237 D
S
N
1466 2269 M
1466 2237 D
S
N
1466 2254 M
1469 2257 D
1472 2259 D
1475 2259 D
1480 2257 D
1483 2254 D
1484 2249 D
1484 2246 D
1483 2242 D
1480 2239 D
1475 2237 D
1472 2237 D
1469 2239 D
1466 2242 D
S
N
1475 2259 M
1478 2257 D
1481 2254 D
1483 2249 D
1483 2246 D
1481 2242 D
1478 2239 D
1475 2237 D
S
N
1460 2269 M
1466 2269 D
S
N
1502 2275 M
1502 2227 D
S
N
1504 2275 M
1504 2227 D
S
N
1493 2275 M
1504 2275 D
S
N
1493 2227 M
1504 2227 D
S
N
1566 2256 M
1566 2254 D
1564 2254 D
1564 2256 D
1566 2257 D
1569 2259 D
1575 2259 D
1578 2257 D
1579 2256 D
1581 2252 D
1581 2242 D
1582 2239 D
1584 2237 D
S
N
1579 2256 M
1579 2242 D
1581 2239 D
1584 2237 D
1585 2237 D
S
N
1579 2252 M
1578 2251 D
1569 2249 D
1564 2248 D
1563 2245 D
1563 2242 D
1564 2239 D
1569 2237 D
1573 2237 D
1576 2239 D
1579 2242 D
S
N
1569 2249 M
1566 2248 D
1564 2245 D
1564 2242 D
1566 2239 D
1569 2237 D
S
N
1596 2269 M
1596 2243 D
1597 2239 D
1600 2237 D
1603 2237 D
1606 2239 D
1608 2242 D
S
N
1597 2269 M
1597 2243 D
1599 2239 D
1600 2237 D
S
N
1591 2259 M
1603 2259 D
S
N
1643 2269 M
1643 2237 D
S
N
1644 2269 M
1644 2237 D
S
N
1638 2269 M
1649 2269 D
S
N
1638 2237 M
1661 2237 D
1661 2246 D
1659 2237 D
S
N
1670 2269 M
1670 2237 D
S
N
1671 2269 M
1671 2237 D
S
N
1689 2269 M
1689 2237 D
S
N
1691 2269 M
1691 2237 D
S
N
1665 2269 M
1676 2269 D
S
N
1685 2269 M
1695 2269 D
S
N
1671 2254 M
1689 2254 D
S
N
1665 2237 M
1676 2237 D
S
N
1685 2237 M
1695 2237 D
S
N
1724 2265 M
1726 2260 D
1726 2269 D
1724 2265 D
1721 2268 D
1717 2269 D
1714 2269 D
1709 2268 D
1706 2265 D
1705 2262 D
1703 2257 D
1703 2249 D
1705 2245 D
1706 2242 D
1709 2239 D
1714 2237 D
1717 2237 D
1721 2239 D
1724 2242 D
1726 2245 D
S
N
1714 2269 M
1711 2268 D
1708 2265 D
1706 2262 D
1705 2257 D
1705 2249 D
1706 2245 D
1708 2242 D
1711 2239 D
1714 2237 D
S
N
1759 2269 M
1759 2260 D
S
N
1759 2263 M
1760 2266 D
1763 2269 D
1766 2269 D
1774 2265 D
1777 2265 D
1778 2266 D
1780 2269 D
S
N
1760 2266 M
1763 2268 D
1766 2268 D
1774 2265 D
S
N
1780 2269 M
1780 2265 D
1778 2260 D
1772 2252 D
1771 2249 D
1769 2245 D
1769 2237 D
S
N
1778 2260 M
1771 2252 D
1769 2249 D
1768 2245 D
1768 2237 D
S
N
1822 2269 M
1822 2237 D
S
N
1824 2269 M
1824 2237 D
S
N
1813 2269 M
1812 2260 D
1812 2269 D
1834 2269 D
1834 2260 D
1833 2269 D
S
N
1818 2237 M
1828 2237 D
S
N
1843 2249 M
1862 2249 D
1862 2252 D
1860 2255 D
1858 2257 D
1855 2259 D
1851 2259 D
1846 2257 D
1843 2254 D
1842 2249 D
1842 2246 D
1843 2242 D
1846 2239 D
1851 2237 D
1854 2237 D
1858 2239 D
1862 2242 D
S
N
1860 2249 M
1860 2254 D
1858 2257 D
S
N
1851 2259 M
1848 2257 D
1845 2254 D
1843 2249 D
1843 2246 D
1845 2242 D
1848 2239 D
1851 2237 D
S
N
1871 2269 M
1881 2237 D
S
N
1872 2269 M
1881 2242 D
S
N
1892 2269 M
1881 2237 D
S
N
1868 2269 M
1877 2269 D
S
N
1886 2269 M
1895 2269 D
S
3 Sw
N
1455 2186 M
1455 2185 D
1453 2185 D
1453 2186 D
1455 2188 D
1458 2189 D
1464 2189 D
1467 2188 D
1468 2186 D
1470 2183 D
1470 2173 D
1471 2170 D
1473 2168 D
S
N
1468 2186 M
1468 2173 D
1470 2170 D
1473 2168 D
1474 2168 D
S
N
1468 2183 M
1467 2182 D
1458 2180 D
1453 2179 D
1452 2176 D
1452 2173 D
1453 2170 D
1458 2168 D
1462 2168 D
1465 2170 D
1468 2173 D
S
N
1458 2180 M
1455 2179 D
1453 2176 D
1453 2173 D
1455 2170 D
1458 2168 D
S
N
1485 2200 M
1485 2168 D
S
N
1486 2200 M
1495 2173 D
S
N
1485 2200 M
1495 2168 D
S
N
1506 2200 M
1495 2168 D
S
N
1506 2200 M
1506 2168 D
S
N
1508 2200 M
1508 2168 D
S
N
1480 2200 M
1486 2200 D
S
N
1506 2200 M
1512 2200 D
S
N
1480 2168 M
1489 2168 D
S
N
1502 2168 M
1512 2168 D
S
N
1541 2195 M
1542 2191 D
1542 2200 D
1541 2195 D
1538 2198 D
1533 2200 D
1530 2200 D
1526 2198 D
1523 2195 D
1521 2192 D
1520 2188 D
1520 2180 D
1521 2176 D
1523 2173 D
1526 2170 D
1530 2168 D
1533 2168 D
1538 2170 D
1541 2173 D
1542 2176 D
S
N
1530 2200 M
1527 2198 D
1524 2195 D
1523 2192 D
1521 2188 D
1521 2180 D
1523 2176 D
1524 2173 D
1527 2170 D
1530 2168 D
S
N
1574 2188 M
1572 2191 D
1569 2192 D
1565 2192 D
1562 2191 D
1560 2189 D
1559 2185 D
1559 2180 D
1560 2177 D
1563 2176 D
1568 2176 D
1571 2177 D
1572 2180 D
S
N
1565 2192 M
1562 2189 D
1560 2185 D
1560 2180 D
1562 2177 D
1563 2176 D
S
N
1574 2192 M
1572 2180 D
1572 2177 D
1575 2176 D
1579 2176 D
1582 2179 D
1583 2183 D
1583 2186 D
1582 2191 D
1580 2194 D
1577 2197 D
1574 2198 D
1569 2200 D
1565 2200 D
1560 2198 D
1557 2197 D
1554 2194 D
1553 2191 D
1551 2186 D
1551 2182 D
1553 2177 D
1554 2174 D
1557 2171 D
1560 2170 D
1565 2168 D
1569 2168 D
1574 2170 D
1577 2171 D
1579 2173 D
S
N
1575 2192 M
1574 2180 D
1574 2177 D
1575 2176 D
S
N
1595 2200 M
1595 2168 D
S
N
1597 2200 M
1615 2171 D
S
N
1597 2197 M
1615 2168 D
S
N
1615 2200 M
1615 2168 D
S
N
1591 2200 M
1597 2200 D
S
N
1610 2200 M
1619 2200 D
S
N
1591 2168 M
1600 2168 D
S
N
1630 2200 M
1630 2168 D
S
N
1631 2200 M
1631 2168 D
S
N
1625 2200 M
1636 2200 D
S
N
1625 2168 M
1648 2168 D
1648 2177 D
1646 2168 D
S
N
1665 2200 M
1660 2198 D
1657 2195 D
1655 2192 D
1654 2186 D
1654 2182 D
1655 2176 D
1657 2173 D
1660 2170 D
1665 2168 D
1668 2168 D
1672 2170 D
1675 2173 D
1677 2176 D
1678 2182 D
1678 2186 D
1677 2192 D
1675 2195 D
1672 2198 D
1668 2200 D
1665 2200 D
S
N
1665 2200 M
1662 2198 D
1659 2195 D
1657 2192 D
1655 2186 D
1655 2182 D
1657 2176 D
1659 2173 D
1662 2170 D
1665 2168 D
S
N
1668 2168 M
1671 2170 D
1674 2173 D
1675 2176 D
1677 2182 D
1677 2186 D
1675 2192 D
1674 2195 D
1671 2198 D
1668 2200 D
S
N
1702 2195 M
1702 2168 D
S
N
1689 2182 M
1716 2182 D
S
N
1729 2200 M
1729 2168 D
S
N
1731 2200 M
1731 2168 D
S
N
1731 2185 M
1734 2188 D
1738 2189 D
1742 2189 D
1746 2188 D
1748 2185 D
1748 2168 D
S
N
1742 2189 M
1745 2188 D
1746 2185 D
1746 2168 D
S
N
1725 2200 M
1731 2200 D
S
N
1725 2168 M
1735 2168 D
S
N
1742 2168 M
1752 2168 D
S
N
1761 2180 M
1779 2180 D
1779 2183 D
1778 2186 D
1776 2188 D
1773 2189 D
1769 2189 D
1764 2188 D
1761 2185 D
1760 2180 D
1760 2177 D
1761 2173 D
1764 2170 D
1769 2168 D
1772 2168 D
1776 2170 D
1779 2173 D
S
N
1778 2180 M
1778 2185 D
1776 2188 D
S
N
1769 2189 M
1766 2188 D
1763 2185 D
1761 2180 D
1761 2177 D
1763 2173 D
1766 2170 D
1769 2168 D
S
N
1791 2189 M
1791 2168 D
S
N
1793 2189 M
1793 2168 D
S
N
1793 2180 M
1794 2185 D
1797 2188 D
1800 2189 D
1805 2189 D
1806 2188 D
1806 2186 D
1805 2185 D
1803 2186 D
1805 2188 D
S
N
1787 2189 M
1793 2189 D
S
N
1787 2168 M
1797 2168 D
S
N
1815 2189 M
1822 2168 D
S
N
1817 2189 M
1822 2173 D
S
N
1828 2189 M
1822 2168 D
S
N
1828 2189 M
1834 2168 D
S
N
1829 2189 M
1834 2173 D
S
N
1840 2189 M
1834 2168 D
S
N
1811 2189 M
1822 2189 D
S
N
1835 2189 M
1844 2189 D
S
N
1853 2200 M
1852 2198 D
1853 2197 D
1855 2198 D
1853 2200 D
S
N
1853 2189 M
1853 2168 D
S
N
1855 2189 M
1855 2168 D
S
N
1849 2189 M
1855 2189 D
S
N
1849 2168 M
1859 2168 D
S
N
1874 2189 M
1871 2188 D
1870 2186 D
1868 2183 D
1868 2180 D
1870 2177 D
1871 2176 D
1874 2174 D
1877 2174 D
1880 2176 D
1882 2177 D
1883 2180 D
1883 2183 D
1882 2186 D
1880 2188 D
1877 2189 D
1874 2189 D
S
N
1871 2188 M
1870 2185 D
1870 2179 D
1871 2176 D
S
N
1880 2176 M
1882 2179 D
1882 2185 D
1880 2188 D
S
N
1882 2186 M
1883 2188 D
1886 2189 D
1886 2188 D
1883 2188 D
S
N
1870 2177 M
1868 2176 D
1867 2173 D
1867 2171 D
1868 2168 D
1873 2167 D
1880 2167 D
1885 2165 D
1886 2164 D
S
N
1867 2171 M
1868 2170 D
1873 2168 D
1880 2168 D
1885 2167 D
1886 2164 D
1886 2162 D
1885 2159 D
1880 2158 D
1871 2158 D
1867 2159 D
1865 2162 D
1865 2164 D
1867 2167 D
1871 2168 D
S
N
1455 2131 M
1455 2099 D
S
N
1456 2131 M
1456 2099 D
S
N
1450 2131 M
1468 2131 D
1473 2129 D
1474 2128 D
1476 2125 D
1476 2120 D
1474 2117 D
1473 2116 D
1468 2114 D
1456 2114 D
S
N
1468 2131 M
1471 2129 D
1473 2128 D
1474 2125 D
1474 2120 D
1473 2117 D
1471 2116 D
1468 2114 D
S
N
1450 2099 M
1461 2099 D
S
N
1495 2131 M
1491 2129 D
1488 2126 D
1486 2123 D
1485 2117 D
1485 2113 D
1486 2107 D
1488 2104 D
1491 2100 D
1495 2099 D
1499 2099 D
1503 2100 D
1506 2104 D
1508 2107 D
1509 2113 D
1509 2117 D
1508 2123 D
1506 2126 D
1503 2129 D
1499 2131 D
1495 2131 D
S
N
1495 2131 M
1492 2129 D
1489 2126 D
1488 2123 D
1486 2117 D
1486 2113 D
1488 2107 D
1489 2104 D
1492 2100 D
1495 2099 D
S
N
1499 2099 M
1502 2100 D
1505 2104 D
1506 2107 D
1508 2113 D
1508 2117 D
1506 2123 D
1505 2126 D
1502 2129 D
1499 2131 D
S
N
1520 2131 M
1526 2099 D
S
N
1521 2131 M
1526 2107 D
S
N
1532 2131 M
1526 2099 D
S
N
1532 2131 M
1538 2099 D
S
N
1533 2131 M
1538 2107 D
S
N
1544 2131 M
1538 2099 D
S
N
1515 2131 M
1526 2131 D
S
N
1539 2131 M
1548 2131 D
S
N
1557 2131 M
1557 2099 D
S
N
1559 2131 M
1559 2099 D
S
N
1577 2131 M
1577 2099 D
S
N
1579 2131 M
1579 2099 D
S
N
1553 2131 M
1563 2131 D
S
N
1572 2131 M
1583 2131 D
S
N
1559 2116 M
1577 2116 D
S
N
1553 2099 M
1563 2099 D
S
N
1572 2099 M
1583 2099 D
S
N
1594 2131 M
1594 2099 D
S
N
1595 2131 M
1595 2099 D
S
N
1604 2122 M
1604 2110 D
S
N
1589 2131 M
1613 2131 D
1613 2122 D
1612 2131 D
S
N
1595 2116 M
1604 2116 D
S
N
1589 2099 M
1613 2099 D
1613 2108 D
1612 2099 D
S
N
1625 2131 M
1625 2099 D
S
N
1627 2131 M
1627 2099 D
S
N
1621 2131 M
1631 2131 D
S
N
1621 2099 M
1643 2099 D
1643 2108 D
1642 2099 D
S
N
1665 2126 M
1665 2099 D
S
N
1651 2113 M
1678 2113 D
S
N
1692 2131 M
1692 2099 D
S
N
1693 2131 M
1693 2099 D
S
N
1693 2116 M
1696 2119 D
1701 2120 D
1704 2120 D
1708 2119 D
1710 2116 D
1710 2099 D
S
N
1704 2120 M
1707 2119 D
1708 2116 D
1708 2099 D
S
N
1687 2131 M
1693 2131 D
S
N
1687 2099 M
1698 2099 D
S
N
1704 2099 M
1714 2099 D
S
N
1723 2111 M
1742 2111 D
1742 2114 D
1740 2117 D
1738 2119 D
1735 2120 D
1731 2120 D
1726 2119 D
1723 2116 D
1722 2111 D
1722 2108 D
1723 2104 D
1726 2100 D
1731 2099 D
1734 2099 D
1738 2100 D
1742 2104 D
S
N
1740 2111 M
1740 2116 D
1738 2119 D
S
N
1731 2120 M
1728 2119 D
1725 2116 D
1723 2111 D
1723 2108 D
1725 2104 D
1728 2100 D
1731 2099 D
S
N
1754 2120 M
1754 2099 D
S
N
1755 2120 M
1755 2099 D
S
N
1755 2111 M
1757 2116 D
1760 2119 D
1763 2120 D
1767 2120 D
1769 2119 D
1769 2117 D
1767 2116 D
1766 2117 D
1767 2119 D
S
N
1749 2120 M
1755 2120 D
S
N
1749 2099 M
1760 2099 D
S
N
1778 2120 M
1784 2099 D
S
N
1779 2120 M
1784 2104 D
S
N
1790 2120 M
1784 2099 D
S
N
1790 2120 M
1796 2099 D
S
N
1791 2120 M
1796 2104 D
S
N
1802 2120 M
1796 2099 D
S
N
1773 2120 M
1784 2120 D
S
N
1797 2120 M
1806 2120 D
S
N
1815 2131 M
1814 2129 D
1815 2128 D
1817 2129 D
1815 2131 D
S
N
1815 2120 M
1815 2099 D
S
N
1817 2120 M
1817 2099 D
S
N
1811 2120 M
1817 2120 D
S
N
1811 2099 M
1822 2099 D
S
N
1837 2120 M
1834 2119 D
1832 2117 D
1831 2114 D
1831 2111 D
1832 2108 D
1834 2107 D
1837 2105 D
1840 2105 D
1843 2107 D
1844 2108 D
1846 2111 D
1846 2114 D
1844 2117 D
1843 2119 D
1840 2120 D
1837 2120 D
S
N
1834 2119 M
1832 2116 D
1832 2110 D
1834 2107 D
S
N
1843 2107 M
1844 2110 D
1844 2116 D
1843 2119 D
S
N
1844 2117 M
1846 2119 D
1849 2120 D
1849 2119 D
1846 2119 D
S
N
1832 2108 M
1831 2107 D
1829 2104 D
1829 2102 D
1831 2099 D
1835 2097 D
1843 2097 D
1847 2096 D
1849 2094 D
S
N
1829 2102 M
1831 2100 D
1835 2099 D
1843 2099 D
1847 2097 D
1849 2094 D
1849 2093 D
1847 2090 D
1843 2088 D
1834 2088 D
1829 2090 D
1828 2093 D
1828 2094 D
1829 2097 D
1834 2099 D
S
1 Sw
N
1986 2034 M
2003 2034 D
S
N
1986 2034 M
2003 2034 D
S
N
1986 2031 M
1986 2037 D
S
N
2003 2031 M
2003 2043 D
1998 2043 D
2003 2042 D
S
N
1986 2048 M
2003 2048 D
S
N
1986 2049 M
2003 2049 D
S
N
1986 2058 M
2003 2058 D
S
N
1986 2059 M
2003 2059 D
S
N
1986 2046 M
1986 2051 D
S
N
1986 2056 M
1986 2062 D
S
N
1994 2049 M
1994 2058 D
S
N
2003 2046 M
2003 2051 D
S
N
2003 2056 M
2003 2062 D
S
N
1988 2077 M
1991 2078 D
1986 2078 D
1988 2077 D
1987 2075 D
1986 2073 D
1986 2071 D
1987 2069 D
1988 2067 D
1990 2066 D
1992 2066 D
1996 2066 D
1999 2066 D
2000 2067 D
2002 2069 D
2003 2071 D
2003 2073 D
2002 2075 D
2000 2077 D
1999 2078 D
S
N
1986 2071 M
1987 2070 D
1988 2068 D
1990 2067 D
1992 2066 D
1996 2066 D
1999 2067 D
2000 2068 D
2002 2070 D
2003 2071 D
S
N
1986 2097 M
2003 2097 D
S
N
1986 2097 M
2003 2097 D
S
N
1986 2107 M
2003 2107 D
S
N
1986 2108 M
2003 2108 D
S
N
1986 2094 M
1986 2100 D
S
N
1986 2105 M
1986 2110 D
S
N
1994 2097 M
1994 2107 D
S
N
2003 2094 M
2003 2100 D
S
N
2003 2105 M
2003 2110 D
S
N
1986 2116 M
2003 2116 D
S
N
1986 2117 M
2003 2117 D
S
N
1986 2113 M
1986 2119 D
S
N
2003 2113 M
2003 2119 D
S
N
1988 2134 M
1991 2135 D
1986 2135 D
1988 2134 D
1987 2132 D
1986 2130 D
1986 2129 D
1987 2126 D
1988 2125 D
1990 2124 D
1992 2123 D
1996 2123 D
1999 2124 D
2000 2125 D
2002 2126 D
2003 2129 D
2003 2130 D
2002 2132 D
2000 2134 D
S
N
1986 2129 M
1987 2127 D
1988 2125 D
1990 2125 D
1992 2124 D
1996 2124 D
1999 2125 D
2000 2125 D
2002 2127 D
2003 2129 D
S
N
1996 2134 M
2003 2134 D
S
N
1996 2135 M
2003 2135 D
S
N
1996 2132 M
1996 2137 D
S
N
1988 2152 M
1991 2153 D
1986 2153 D
1988 2152 D
1987 2151 D
1986 2148 D
1986 2147 D
1987 2144 D
1988 2143 D
1990 2142 D
1992 2141 D
1996 2141 D
1999 2142 D
2000 2143 D
2002 2144 D
2003 2147 D
2003 2148 D
2002 2151 D
2000 2152 D
S
N
1986 2147 M
1987 2145 D
1988 2144 D
1990 2143 D
1992 2142 D
1996 2142 D
1999 2143 D
2000 2144 D
2002 2145 D
2003 2147 D
S
N
1996 2152 M
2003 2152 D
S
N
1996 2153 M
2003 2153 D
S
N
1996 2150 M
1996 2156 D
S
N
1988 2170 M
1986 2171 D
1991 2171 D
1988 2170 D
1987 2168 D
1986 2166 D
1986 2164 D
1987 2161 D
1988 2160 D
1990 2160 D
1991 2160 D
1992 2161 D
1993 2163 D
1995 2168 D
1995 2169 D
1997 2171 D
S
N
1990 2160 M
1991 2161 D
1992 2163 D
1994 2168 D
1995 2169 D
1995 2170 D
1997 2171 D
2000 2171 D
2002 2169 D
2003 2167 D
2003 2164 D
2002 2162 D
2000 2160 D
1998 2160 D
2003 2160 D
2000 2160 D
S
N
1986 2188 M
2003 2199 D
S
N
1986 2189 M
2003 2199 D
S
N
1986 2199 M
2003 2188 D
S
N
1986 2187 M
1986 2191 D
S
N
1986 2196 M
1986 2201 D
S
N
2003 2187 M
2003 2191 D
S
N
2003 2196 M
2003 2201 D
S
N
1988 2215 M
1986 2215 D
1991 2215 D
1988 2215 D
1987 2213 D
1986 2211 D
1986 2208 D
1987 2206 D
1988 2204 D
1990 2204 D
1991 2205 D
1992 2206 D
1993 2207 D
1995 2212 D
1995 2214 D
1997 2215 D
S
N
1990 2204 M
1991 2206 D
1992 2207 D
1994 2212 D
1995 2214 D
1995 2215 D
1997 2215 D
2000 2215 D
2002 2214 D
2003 2211 D
2003 2209 D
2002 2207 D
2000 2205 D
1998 2204 D
2003 2204 D
2000 2205 D
S
N
1986 2234 M
2003 2237 D
S
N
1986 2234 M
1999 2237 D
S
N
1986 2240 M
2003 2237 D
S
N
1986 2240 M
2003 2243 D
S
N
1986 2241 M
1999 2243 D
S
N
1986 2246 M
2003 2243 D
S
N
1986 2231 M
1986 2237 D
S
N
1986 2244 M
1986 2249 D
S
N
1988 2263 M
1991 2264 D
1986 2264 D
1988 2263 D
1987 2262 D
1986 2259 D
1986 2258 D
1987 2255 D
1988 2254 D
1990 2253 D
1992 2252 D
1996 2252 D
1999 2253 D
2000 2254 D
2002 2255 D
2003 2258 D
2003 2259 D
2002 2262 D
2000 2263 D
S
N
1986 2258 M
1987 2256 D
1988 2254 D
1990 2254 D
1992 2253 D
1996 2253 D
1999 2254 D
2000 2254 D
2002 2256 D
2003 2258 D
S
N
1996 2263 M
2003 2263 D
S
N
1996 2264 M
2003 2264 D
S
N
1996 2261 M
1996 2266 D
S
N
1989 2284 M
1990 2285 D
1991 2284 D
1990 2283 D
1989 2283 D
1987 2284 D
1987 2285 D
1986 2287 D
1986 2290 D
1987 2293 D
1987 2293 D
1989 2294 D
1991 2294 D
1992 2293 D
1994 2291 D
1995 2287 D
1996 2285 D
1998 2284 D
2000 2283 D
2003 2283 D
S
N
1986 2290 M
1987 2292 D
1987 2293 D
1989 2293 D
1991 2293 D
1992 2293 D
1994 2290 D
1995 2287 D
S
N
2001 2283 M
2000 2284 D
2000 2285 D
2002 2289 D
2002 2292 D
2001 2293 D
2000 2294 D
S
N
2000 2285 M
2003 2289 D
2003 2293 D
2002 2293 D
2000 2294 D
1999 2294 D
S
N
1986 2304 M
1987 2301 D
1989 2300 D
1993 2299 D
1995 2299 D
1999 2300 D
2002 2301 D
2003 2304 D
2003 2305 D
2002 2308 D
1999 2309 D
1995 2310 D
1993 2310 D
1989 2309 D
1987 2308 D
1986 2305 D
1986 2304 D
S
N
1986 2304 M
1987 2302 D
1987 2301 D
1989 2301 D
1993 2300 D
1995 2300 D
1999 2301 D
2001 2301 D
2002 2302 D
2003 2304 D
S
N
2003 2305 M
2002 2307 D
2001 2308 D
1999 2309 D
1995 2309 D
1993 2309 D
1989 2309 D
1987 2308 D
1987 2307 D
1986 2305 D
S
N
1989 2317 M
1988 2319 D
1986 2321 D
2003 2321 D
S
N
1987 2321 M
2003 2321 D
S
N
2003 2317 M
2003 2325 D
S
N
1989 2333 M
1988 2335 D
1986 2337 D
2003 2337 D
S
N
1987 2336 M
2003 2336 D
S
N
2003 2333 M
2003 2340 D
S
4 Sw
N
583 2342 M
583 1520 D
S
N
583 1520 M
1967 1520 D
S
N
1967 1520 M
1967 2342 D
S
N
1967 2342 M
583 2342 D
S
N
583 1520 M
1967 1520 D
S
N
583 1520 M
583 1551 D
S
N
929 1551 M
929 1520 D
S
N
1275 1520 M
1275 1551 D
S
N
1621 1551 M
1621 1520 D
S
N
1967 1520 M
1967 1551 D
S
N
583 2342 M
1967 2342 D
S
N
583 2311 M
583 2342 D
S
N
929 2342 M
929 2311 D
S
N
1275 2311 M
1275 2342 D
S
N
1621 2342 M
1621 2311 D
S
N
1967 2311 M
1967 2342 D
S
N
583 1520 M
583 2342 D
S
N
583 1520 M
593 1520 D
S
N
614 1558 M
583 1558 D
S
N
583 1590 M
593 1590 D
S
N
593 1616 M
583 1616 D
S
N
583 1639 M
593 1639 D
S
N
593 1659 M
583 1659 D
S
N
583 1677 M
614 1677 D
S
N
614 1795 M
583 1795 D
S
N
583 1865 M
593 1865 D
S
N
593 1914 M
583 1914 D
S
N
583 1952 M
614 1952 D
S
N
593 1983 M
583 1983 D
S
N
583 2009 M
593 2009 D
S
N
593 2032 M
583 2032 D
S
N
583 2052 M
593 2052 D
S
N
614 2070 M
583 2070 D
S
N
583 2189 M
614 2189 D
S
N
593 2258 M
583 2258 D
S
N
583 2307 M
593 2307 D
S
N
442 1572 M
438 1570 D
435 1566 D
433 1558 D
433 1554 D
435 1546 D
438 1542 D
442 1540 D
445 1540 D
450 1542 D
453 1546 D
454 1554 D
454 1558 D
453 1566 D
450 1570 D
445 1572 D
442 1572 D
S
N
442 1572 M
439 1570 D
438 1569 D
436 1566 D
435 1558 D
435 1554 D
436 1546 D
438 1543 D
439 1542 D
442 1540 D
S
N
445 1540 M
448 1542 D
450 1543 D
451 1546 D
453 1554 D
453 1558 D
451 1566 D
450 1569 D
448 1570 D
445 1572 D
S
N
466 1543 M
465 1542 D
466 1540 D
468 1542 D
466 1543 D
S
N
488 1572 M
483 1570 D
480 1566 D
478 1558 D
478 1554 D
480 1546 D
483 1542 D
488 1540 D
491 1540 D
495 1542 D
498 1546 D
500 1554 D
500 1558 D
498 1566 D
495 1570 D
491 1572 D
488 1572 D
S
N
488 1572 M
484 1570 D
483 1569 D
481 1566 D
480 1558 D
480 1554 D
481 1546 D
483 1543 D
484 1542 D
488 1540 D
S
N
491 1540 M
494 1542 D
495 1543 D
497 1546 D
498 1554 D
498 1558 D
497 1566 D
495 1569 D
494 1570 D
491 1572 D
S
N
518 1572 M
513 1570 D
510 1566 D
509 1558 D
509 1554 D
510 1546 D
513 1542 D
518 1540 D
521 1540 D
525 1542 D
528 1546 D
530 1554 D
530 1558 D
528 1566 D
525 1570 D
521 1572 D
518 1572 D
S
N
518 1572 M
515 1570 D
513 1569 D
512 1566 D
510 1558 D
510 1554 D
512 1546 D
513 1543 D
515 1542 D
518 1540 D
S
N
521 1540 M
524 1542 D
525 1543 D
527 1546 D
528 1554 D
528 1558 D
527 1566 D
525 1569 D
524 1570 D
521 1572 D
S
N
542 1572 M
539 1557 D
S
N
539 1557 M
542 1560 D
546 1561 D
551 1561 D
555 1560 D
558 1557 D
560 1552 D
560 1549 D
558 1545 D
555 1542 D
551 1540 D
546 1540 D
542 1542 D
540 1543 D
539 1546 D
539 1548 D
540 1549 D
542 1548 D
540 1546 D
S
N
551 1561 M
554 1560 D
557 1557 D
558 1552 D
558 1549 D
557 1545 D
554 1542 D
551 1540 D
S
N
542 1572 M
557 1572 D
S
N
542 1570 M
549 1570 D
557 1572 D
S
N
442 1690 M
438 1689 D
435 1684 D
433 1677 D
433 1672 D
435 1665 D
438 1660 D
442 1659 D
445 1659 D
450 1660 D
453 1665 D
454 1672 D
454 1677 D
453 1684 D
450 1689 D
445 1690 D
442 1690 D
S
N
442 1690 M
439 1689 D
438 1687 D
436 1684 D
435 1677 D
435 1672 D
436 1665 D
438 1662 D
439 1660 D
442 1659 D
S
N
445 1659 M
448 1660 D
450 1662 D
451 1665 D
453 1672 D
453 1677 D
451 1684 D
450 1687 D
448 1689 D
445 1690 D
S
N
466 1662 M
465 1660 D
466 1659 D
468 1660 D
466 1662 D
S
N
488 1690 M
483 1689 D
480 1684 D
478 1677 D
478 1672 D
480 1665 D
483 1660 D
488 1659 D
491 1659 D
495 1660 D
498 1665 D
500 1672 D
500 1677 D
498 1684 D
495 1689 D
491 1690 D
488 1690 D
S
N
488 1690 M
484 1689 D
483 1687 D
481 1684 D
480 1677 D
480 1672 D
481 1665 D
483 1662 D
484 1660 D
488 1659 D
S
N
491 1659 M
494 1660 D
495 1662 D
497 1665 D
498 1672 D
498 1677 D
497 1684 D
495 1687 D
494 1689 D
491 1690 D
S
N
513 1684 M
516 1686 D
521 1690 D
521 1659 D
S
N
519 1689 M
519 1659 D
S
N
513 1659 M
527 1659 D
S
N
548 1690 M
543 1689 D
540 1684 D
539 1677 D
539 1672 D
540 1665 D
543 1660 D
548 1659 D
551 1659 D
555 1660 D
558 1665 D
560 1672 D
560 1677 D
558 1684 D
555 1689 D
551 1690 D
548 1690 D
S
N
548 1690 M
545 1689 D
543 1687 D
542 1684 D
540 1677 D
540 1672 D
542 1665 D
543 1662 D
545 1660 D
548 1659 D
S
N
551 1659 M
554 1660 D
555 1662 D
557 1665 D
558 1672 D
558 1677 D
557 1684 D
555 1687 D
554 1689 D
551 1690 D
S
N
442 1809 M
438 1807 D
435 1803 D
433 1795 D
433 1791 D
435 1783 D
438 1779 D
442 1777 D
445 1777 D
450 1779 D
453 1783 D
454 1791 D
454 1795 D
453 1803 D
450 1807 D
445 1809 D
442 1809 D
S
N
442 1809 M
439 1807 D
438 1806 D
436 1803 D
435 1795 D
435 1791 D
436 1783 D
438 1780 D
439 1779 D
442 1777 D
S
N
445 1777 M
448 1779 D
450 1780 D
451 1783 D
453 1791 D
453 1795 D
451 1803 D
450 1806 D
448 1807 D
445 1809 D
S
N
466 1780 M
465 1779 D
466 1777 D
468 1779 D
466 1780 D
S
N
488 1809 M
483 1807 D
480 1803 D
478 1795 D
478 1791 D
480 1783 D
483 1779 D
488 1777 D
491 1777 D
495 1779 D
498 1783 D
500 1791 D
500 1795 D
498 1803 D
495 1807 D
491 1809 D
488 1809 D
S
N
488 1809 M
484 1807 D
483 1806 D
481 1803 D
480 1795 D
480 1791 D
481 1783 D
483 1780 D
484 1779 D
488 1777 D
S
N
491 1777 M
494 1779 D
495 1780 D
497 1783 D
498 1791 D
498 1795 D
497 1803 D
495 1806 D
494 1807 D
491 1809 D
S
N
510 1803 M
512 1801 D
510 1800 D
509 1801 D
509 1803 D
510 1806 D
512 1807 D
516 1809 D
522 1809 D
527 1807 D
528 1806 D
530 1803 D
530 1800 D
528 1797 D
524 1794 D
516 1791 D
513 1789 D
510 1786 D
509 1782 D
509 1777 D
S
N
522 1809 M
525 1807 D
527 1806 D
528 1803 D
528 1800 D
527 1797 D
522 1794 D
516 1791 D
S
N
509 1780 M
510 1782 D
513 1782 D
521 1779 D
525 1779 D
528 1780 D
530 1782 D
S
N
513 1782 M
521 1777 D
527 1777 D
528 1779 D
530 1782 D
530 1785 D
S
N
548 1809 M
543 1807 D
540 1803 D
539 1795 D
539 1791 D
540 1783 D
543 1779 D
548 1777 D
551 1777 D
555 1779 D
558 1783 D
560 1791 D
560 1795 D
558 1803 D
555 1807 D
551 1809 D
548 1809 D
S
N
548 1809 M
545 1807 D
543 1806 D
542 1803 D
540 1795 D
540 1791 D
542 1783 D
543 1780 D
545 1779 D
548 1777 D
S
N
551 1777 M
554 1779 D
555 1780 D
557 1783 D
558 1791 D
558 1795 D
557 1803 D
555 1806 D
554 1807 D
551 1809 D
S
N
442 1966 M
438 1964 D
435 1959 D
433 1952 D
433 1947 D
435 1940 D
438 1935 D
442 1934 D
445 1934 D
450 1935 D
453 1940 D
454 1947 D
454 1952 D
453 1959 D
450 1964 D
445 1966 D
442 1966 D
S
N
442 1966 M
439 1964 D
438 1962 D
436 1959 D
435 1952 D
435 1947 D
436 1940 D
438 1937 D
439 1935 D
442 1934 D
S
N
445 1934 M
448 1935 D
450 1937 D
451 1940 D
453 1947 D
453 1952 D
451 1959 D
450 1962 D
448 1964 D
445 1966 D
S
N
466 1937 M
465 1935 D
466 1934 D
468 1935 D
466 1937 D
S
N
488 1966 M
483 1964 D
480 1959 D
478 1952 D
478 1947 D
480 1940 D
483 1935 D
488 1934 D
491 1934 D
495 1935 D
498 1940 D
500 1947 D
500 1952 D
498 1959 D
495 1964 D
491 1966 D
488 1966 D
S
N
488 1966 M
484 1964 D
483 1962 D
481 1959 D
480 1952 D
480 1947 D
481 1940 D
483 1937 D
484 1935 D
488 1934 D
S
N
491 1934 M
494 1935 D
495 1937 D
497 1940 D
498 1947 D
498 1952 D
497 1959 D
495 1962 D
494 1964 D
491 1966 D
S
N
512 1966 M
509 1950 D
S
N
509 1950 M
512 1953 D
516 1955 D
521 1955 D
525 1953 D
528 1950 D
530 1946 D
530 1943 D
528 1938 D
525 1935 D
521 1934 D
516 1934 D
512 1935 D
510 1937 D
509 1940 D
509 1941 D
510 1943 D
512 1941 D
510 1940 D
S
N
521 1955 M
524 1953 D
527 1950 D
528 1946 D
528 1943 D
527 1938 D
524 1935 D
521 1934 D
S
N
512 1966 M
527 1966 D
S
N
512 1964 M
519 1964 D
527 1966 D
S
N
548 1966 M
543 1964 D
540 1959 D
539 1952 D
539 1947 D
540 1940 D
543 1935 D
548 1934 D
551 1934 D
555 1935 D
558 1940 D
560 1947 D
560 1952 D
558 1959 D
555 1964 D
551 1966 D
548 1966 D
S
N
548 1966 M
545 1964 D
543 1962 D
542 1959 D
540 1952 D
540 1947 D
542 1940 D
543 1937 D
545 1935 D
548 1934 D
S
N
551 1934 M
554 1935 D
555 1937 D
557 1940 D
558 1947 D
558 1952 D
557 1959 D
555 1962 D
554 1964 D
551 1966 D
S
N
442 2084 M
438 2082 D
435 2078 D
433 2070 D
433 2066 D
435 2058 D
438 2054 D
442 2052 D
445 2052 D
450 2054 D
453 2058 D
454 2066 D
454 2070 D
453 2078 D
450 2082 D
445 2084 D
442 2084 D
S
N
442 2084 M
439 2082 D
438 2081 D
436 2078 D
435 2070 D
435 2066 D
436 2058 D
438 2055 D
439 2054 D
442 2052 D
S
N
445 2052 M
448 2054 D
450 2055 D
451 2058 D
453 2066 D
453 2070 D
451 2078 D
450 2081 D
448 2082 D
445 2084 D
S
N
466 2055 M
465 2054 D
466 2052 D
468 2054 D
466 2055 D
S
N
483 2078 M
486 2079 D
491 2084 D
491 2052 D
S
N
489 2082 M
489 2052 D
S
N
483 2052 M
497 2052 D
S
N
518 2084 M
513 2082 D
510 2078 D
509 2070 D
509 2066 D
510 2058 D
513 2054 D
518 2052 D
521 2052 D
525 2054 D
528 2058 D
530 2066 D
530 2070 D
528 2078 D
525 2082 D
521 2084 D
518 2084 D
S
N
518 2084 M
515 2082 D
513 2081 D
512 2078 D
510 2070 D
510 2066 D
512 2058 D
513 2055 D
515 2054 D
518 2052 D
S
N
521 2052 M
524 2054 D
525 2055 D
527 2058 D
528 2066 D
528 2070 D
527 2078 D
525 2081 D
524 2082 D
521 2084 D
S
N
548 2084 M
543 2082 D
540 2078 D
539 2070 D
539 2066 D
540 2058 D
543 2054 D
548 2052 D
551 2052 D
555 2054 D
558 2058 D
560 2066 D
560 2070 D
558 2078 D
555 2082 D
551 2084 D
548 2084 D
S
N
548 2084 M
545 2082 D
543 2081 D
542 2078 D
540 2070 D
540 2066 D
542 2058 D
543 2055 D
545 2054 D
548 2052 D
S
N
551 2052 M
554 2054 D
555 2055 D
557 2058 D
558 2066 D
558 2070 D
557 2078 D
555 2081 D
554 2082 D
551 2084 D
S
N
442 2202 M
438 2201 D
435 2196 D
433 2189 D
433 2184 D
435 2177 D
438 2172 D
442 2171 D
445 2171 D
450 2172 D
453 2177 D
454 2184 D
454 2189 D
453 2196 D
450 2201 D
445 2202 D
442 2202 D
S
N
442 2202 M
439 2201 D
438 2199 D
436 2196 D
435 2189 D
435 2184 D
436 2177 D
438 2174 D
439 2172 D
442 2171 D
S
N
445 2171 M
448 2172 D
450 2174 D
451 2177 D
453 2184 D
453 2189 D
451 2196 D
450 2199 D
448 2201 D
445 2202 D
S
N
466 2174 M
465 2172 D
466 2171 D
468 2172 D
466 2174 D
S
N
480 2196 M
481 2195 D
480 2193 D
478 2195 D
478 2196 D
480 2199 D
481 2201 D
486 2202 D
492 2202 D
497 2201 D
498 2199 D
500 2196 D
500 2193 D
498 2190 D
494 2187 D
486 2184 D
483 2183 D
480 2180 D
478 2175 D
478 2171 D
S
N
492 2202 M
495 2201 D
497 2199 D
498 2196 D
498 2193 D
497 2190 D
492 2187 D
486 2184 D
S
N
478 2174 M
480 2175 D
483 2175 D
491 2172 D
495 2172 D
498 2174 D
500 2175 D
S
N
483 2175 M
491 2171 D
497 2171 D
498 2172 D
500 2175 D
500 2178 D
S
N
518 2202 M
513 2201 D
510 2196 D
509 2189 D
509 2184 D
510 2177 D
513 2172 D
518 2171 D
521 2171 D
525 2172 D
528 2177 D
530 2184 D
530 2189 D
528 2196 D
525 2201 D
521 2202 D
518 2202 D
S
N
518 2202 M
515 2201 D
513 2199 D
512 2196 D
510 2189 D
510 2184 D
512 2177 D
513 2174 D
515 2172 D
518 2171 D
S
N
521 2171 M
524 2172 D
525 2174 D
527 2177 D
528 2184 D
528 2189 D
527 2196 D
525 2199 D
524 2201 D
521 2202 D
S
N
548 2202 M
543 2201 D
540 2196 D
539 2189 D
539 2184 D
540 2177 D
543 2172 D
548 2171 D
551 2171 D
555 2172 D
558 2177 D
560 2184 D
560 2189 D
558 2196 D
555 2201 D
551 2202 D
548 2202 D
S
N
548 2202 M
545 2201 D
543 2199 D
542 2196 D
540 2189 D
540 2184 D
542 2177 D
543 2174 D
545 2172 D
548 2171 D
S
N
551 2171 M
554 2172 D
555 2174 D
557 2177 D
558 2184 D
558 2189 D
557 2196 D
555 2199 D
554 2201 D
551 2202 D
S
N
1967 1520 M
1967 2342 D
S
N
1957 1520 M
1967 1520 D
S
N
1967 1558 M
1936 1558 D
S
N
1957 1590 M
1967 1590 D
S
N
1967 1616 M
1957 1616 D
S
N
1957 1639 M
1967 1639 D
S
N
1967 1659 M
1957 1659 D
S
N
1936 1677 M
1967 1677 D
S
N
1967 1795 M
1936 1795 D
S
N
1957 1865 M
1967 1865 D
S
N
1967 1914 M
1957 1914 D
S
N
1936 1952 M
1967 1952 D
S
N
1967 1983 M
1957 1983 D
S
N
1957 2009 M
1967 2009 D
S
N
1967 2032 M
1957 2032 D
S
N
1957 2052 M
1967 2052 D
S
N
1967 2070 M
1936 2070 D
S
N
1936 2189 M
1967 2189 D
S
N
1967 2258 M
1957 2258 D
S
N
1957 2307 M
1967 2307 D
S
N
1327 2186 M
1431 2186 D
S
583 1520 P
N
583 1520 M
583 2076 D
929 2076 D
929 1685 D
1275 1685 D
1275 2063 D
1621 2063 D
1621 1567 D
1967 1567 D
S
0 0 1 setrgbcolor
N
1327 2117 M
1339 2117 D
S
N
1351 2117 M
1363 2117 D
S
N
1375 2117 M
1387 2117 D
S
N
1400 2117 M
1412 2117 D
S
N
1424 2117 M
1431 2117 D
S
583 1520 P
N
583 1520 M
583 1532 D
S
N
583 1544 M
583 1557 D
S
N
583 1569 M
583 1581 D
S
N
583 1593 M
583 1605 D
S
N
583 1617 M
583 1629 D
S
N
583 1641 M
583 1653 D
S
N
583 1666 M
583 1678 D
S
N
583 1690 M
583 1702 D
S
N
583 1714 M
583 1726 D
S
N
583 1738 M
583 1750 D
S
N
583 1762 M
583 1775 D
S
N
583 1787 M
583 1799 D
S
N
583 1811 M
583 1823 D
S
N
583 1835 M
583 1847 D
S
N
583 1859 M
583 1871 D
S
N
583 1884 M
583 1896 D
S
N
583 1908 M
583 1920 D
S
N
583 1932 M
583 1944 D
S
N
583 1956 M
583 1968 D
S
N
583 1980 M
583 1993 D
S
N
583 2005 M
583 2017 D
S
N
583 2029 M
583 2041 D
S
N
583 2053 M
583 2065 D
S
N
583 2077 M
583 2078 D
594 2078 D
S
N
606 2078 M
619 2078 D
S
N
631 2078 M
643 2078 D
S
N
655 2078 M
667 2078 D
S
N
679 2078 M
691 2078 D
S
N
703 2078 M
715 2078 D
S
N
728 2078 M
740 2078 D
S
N
752 2078 M
764 2078 D
S
N
776 2078 M
788 2078 D
S
N
800 2078 M
812 2078 D
S
N
824 2078 M
837 2078 D
S
N
849 2078 M
861 2078 D
S
N
873 2078 M
885 2078 D
S
N
897 2078 M
909 2078 D
S
N
921 2078 M
929 2078 D
929 2074 D
S
N
929 2061 M
929 2049 D
S
N
929 2037 M
929 2025 D
S
N
929 2013 M
929 2001 D
S
N
929 1989 M
929 1977 D
S
N
929 1965 M
929 1953 D
S
N
929 1940 M
929 1928 D
S
N
929 1916 M
929 1904 D
S
N
929 1892 M
929 1880 D
S
N
929 1868 M
929 1856 D
S
N
929 1844 M
929 1831 D
S
N
929 1819 M
929 1807 D
S
N
929 1795 M
929 1783 D
S
N
929 1771 M
929 1759 D
S
N
929 1747 M
929 1735 D
S
N
929 1722 M
929 1710 D
S
N
929 1698 M
929 1686 D
S
N
931 1676 M
943 1676 D
S
N
956 1676 M
968 1676 D
S
N
980 1676 M
992 1676 D
S
N
1004 1676 M
1016 1676 D
S
N
1028 1676 M
1040 1676 D
S
N
1052 1676 M
1065 1676 D
S
N
1077 1676 M
1089 1676 D
S
N
1101 1676 M
1113 1676 D
S
N
1125 1676 M
1137 1676 D
S
N
1149 1676 M
1161 1676 D
S
N
1174 1676 M
1186 1676 D
S
N
1198 1676 M
1210 1676 D
S
N
1222 1676 M
1234 1676 D
S
N
1246 1676 M
1258 1676 D
S
N
1270 1676 M
1275 1676 D
1275 1684 D
S
N
1275 1696 M
1275 1708 D
S
N
1275 1720 M
1275 1732 D
S
N
1275 1744 M
1275 1757 D
S
N
1275 1769 M
1275 1781 D
S
N
1275 1793 M
1275 1805 D
S
N
1275 1817 M
1275 1829 D
S
N
1275 1841 M
1275 1853 D
S
N
1275 1866 M
1275 1878 D
S
N
1275 1890 M
1275 1902 D
S
N
1275 1914 M
1275 1926 D
S
N
1275 1938 M
1275 1950 D
S
N
1275 1962 M
1275 1975 D
S
N
1275 1987 M
1275 1999 D
S
N
1275 2011 M
1275 2023 D
S
N
1275 2035 M
1275 2047 D
S
N
1275 2059 M
1275 2065 D
1282 2065 D
S
N
1294 2065 M
1306 2065 D
S
N
1318 2065 M
1330 2065 D
S
N
1342 2065 M
1354 2065 D
S
N
1366 2065 M
1378 2065 D
S
N
1391 2065 M
1403 2065 D
S
N
1415 2065 M
1427 2065 D
S
N
1439 2065 M
1451 2065 D
S
N
1463 2065 M
1475 2065 D
S
N
1487 2065 M
1500 2065 D
S
N
1512 2065 M
1524 2065 D
S
N
1536 2065 M
1548 2065 D
S
N
1560 2065 M
1572 2065 D
S
N
1584 2065 M
1596 2065 D
S
N
1609 2065 M
1621 2065 D
S
N
1621 2053 M
1621 2041 D
S
N
1621 2029 M
1621 2017 D
S
N
1621 2005 M
1621 1993 D
S
N
1621 1980 M
1621 1968 D
S
N
1621 1956 M
1621 1944 D
S
N
1621 1932 M
1621 1920 D
S
N
1621 1908 M
1621 1896 D
S
N
1621 1884 M
1621 1871 D
S
N
1621 1859 M
1621 1847 D
S
N
1621 1835 M
1621 1823 D
S
N
1621 1811 M
1621 1799 D
S
N
1621 1787 M
1621 1775 D
S
N
1621 1762 M
1621 1750 D
S
N
1621 1738 M
1621 1726 D
S
N
1621 1714 M
1621 1702 D
S
N
1621 1690 M
1621 1678 D
S
N
1621 1666 M
1621 1653 D
S
N
1621 1641 M
1621 1629 D
S
N
1621 1617 M
1621 1605 D
S
N
1621 1593 M
1621 1581 D
S
N
1621 1569 M
1621 1565 D
1629 1565 D
S
N
1641 1565 M
1653 1565 D
S
N
1665 1565 M
1677 1565 D
S
N
1690 1565 M
1702 1565 D
S
N
1714 1565 M
1726 1565 D
S
N
1738 1565 M
1750 1565 D
S
N
1762 1565 M
1774 1565 D
S
N
1786 1565 M
1799 1565 D
S
N
1811 1565 M
1823 1565 D
S
N
1835 1565 M
1847 1565 D
S
N
1859 1565 M
1871 1565 D
S
N
1883 1565 M
1895 1565 D
S
N
1908 1565 M
1920 1565 D
S
N
1932 1565 M
1944 1565 D
S
N
1956 1565 M
1967 1565 D
S
3 Sw
0 0 0 setrgbcolor
N
833 1477 M
833 1476 D
832 1476 D
832 1477 D
833 1478 D
836 1480 D
841 1480 D
844 1478 D
845 1477 D
847 1474 D
847 1465 D
848 1462 D
849 1461 D
S
N
845 1477 M
845 1465 D
847 1462 D
849 1461 D
851 1461 D
S
N
845 1474 M
844 1473 D
836 1472 D
832 1470 D
830 1467 D
830 1465 D
832 1462 D
836 1461 D
840 1461 D
843 1462 D
845 1465 D
S
N
836 1472 M
833 1470 D
832 1467 D
832 1465 D
833 1462 D
836 1461 D
S
N
860 1489 M
860 1461 D
S
N
862 1489 M
870 1465 D
S
N
860 1489 M
870 1461 D
S
N
879 1489 M
870 1461 D
S
N
879 1489 M
879 1461 D
S
N
881 1489 M
881 1461 D
S
N
856 1489 M
862 1489 D
S
N
879 1489 M
885 1489 D
S
N
856 1461 M
864 1461 D
S
N
875 1461 M
885 1461 D
S
N
911 1485 M
912 1481 D
912 1489 D
911 1485 D
908 1488 D
904 1489 D
901 1489 D
897 1488 D
895 1485 D
893 1482 D
892 1478 D
892 1472 D
893 1467 D
895 1465 D
897 1462 D
901 1461 D
904 1461 D
908 1462 D
911 1465 D
912 1467 D
S
N
901 1489 M
899 1488 D
896 1485 D
895 1482 D
893 1478 D
893 1472 D
895 1467 D
896 1465 D
899 1462 D
901 1461 D
S
N
941 1478 M
940 1481 D
937 1482 D
933 1482 D
930 1481 D
929 1480 D
927 1476 D
927 1472 D
929 1469 D
931 1467 D
936 1467 D
938 1469 D
940 1472 D
S
N
933 1482 M
930 1480 D
929 1476 D
929 1472 D
930 1469 D
931 1467 D
S
N
941 1482 M
940 1472 D
940 1469 D
942 1467 D
945 1467 D
948 1470 D
949 1474 D
949 1477 D
948 1481 D
947 1484 D
944 1487 D
941 1488 D
937 1489 D
933 1489 D
929 1488 D
926 1487 D
923 1484 D
922 1481 D
921 1477 D
921 1473 D
922 1469 D
923 1466 D
926 1463 D
929 1462 D
933 1461 D
937 1461 D
941 1462 D
944 1463 D
945 1465 D
S
N
942 1482 M
941 1472 D
941 1469 D
942 1467 D
S
N
960 1489 M
960 1461 D
S
N
962 1489 M
978 1463 D
S
N
962 1487 M
978 1461 D
S
N
978 1489 M
978 1461 D
S
N
956 1489 M
962 1489 D
S
N
974 1489 M
982 1489 D
S
N
956 1461 M
964 1461 D
S
N
992 1489 M
992 1461 D
S
N
993 1489 M
993 1461 D
S
N
988 1489 M
997 1489 D
S
N
988 1461 M
1008 1461 D
1008 1469 D
1007 1461 D
S
N
1023 1489 M
1019 1488 D
1016 1485 D
1015 1482 D
1014 1477 D
1014 1473 D
1015 1467 D
1016 1465 D
1019 1462 D
1023 1461 D
1026 1461 D
1030 1462 D
1033 1465 D
1034 1467 D
1035 1473 D
1035 1477 D
1034 1482 D
1033 1485 D
1030 1488 D
1026 1489 D
1023 1489 D
S
N
1023 1489 M
1020 1488 D
1018 1485 D
1016 1482 D
1015 1477 D
1015 1473 D
1016 1467 D
1018 1465 D
1020 1462 D
1023 1461 D
S
N
1026 1461 M
1029 1462 D
1031 1465 D
1033 1467 D
1034 1473 D
1034 1477 D
1033 1482 D
1031 1485 D
1029 1488 D
1026 1489 D
S
N
1046 1480 M
1045 1478 D
1046 1477 D
1048 1478 D
1046 1480 D
S
N
1046 1463 M
1045 1462 D
1046 1461 D
1048 1462 D
1046 1463 D
S
N
1093 1477 M
1094 1480 D
1094 1474 D
1093 1477 D
1092 1478 D
1089 1480 D
1083 1480 D
1081 1478 D
1079 1477 D
1079 1474 D
1081 1473 D
1083 1472 D
1090 1469 D
1093 1467 D
1094 1466 D
S
N
1079 1476 M
1081 1474 D
1083 1473 D
1090 1470 D
1093 1469 D
1094 1467 D
1094 1463 D
1093 1462 D
1090 1461 D
1085 1461 D
1082 1462 D
1081 1463 D
1079 1466 D
1079 1461 D
1081 1463 D
S
N
1119 1476 M
1118 1474 D
1119 1473 D
1120 1474 D
1120 1476 D
1118 1478 D
1115 1480 D
1111 1480 D
1107 1478 D
1104 1476 D
1103 1472 D
1103 1469 D
1104 1465 D
1107 1462 D
1111 1461 D
1114 1461 D
1118 1462 D
1120 1465 D
S
N
1111 1480 M
1108 1478 D
1105 1476 D
1104 1472 D
1104 1469 D
1105 1465 D
1108 1462 D
1111 1461 D
S
N
1131 1477 M
1131 1476 D
1130 1476 D
1130 1477 D
1131 1478 D
1134 1480 D
1140 1480 D
1142 1478 D
1144 1477 D
1145 1474 D
1145 1465 D
1146 1462 D
1148 1461 D
S
N
1144 1477 M
1144 1465 D
1145 1462 D
1148 1461 D
1149 1461 D
S
N
1144 1474 M
1142 1473 D
1134 1472 D
1130 1470 D
1129 1467 D
1129 1465 D
1130 1462 D
1134 1461 D
1138 1461 D
1141 1462 D
1144 1465 D
S
N
1134 1472 M
1131 1470 D
1130 1467 D
1130 1465 D
1131 1462 D
1134 1461 D
S
N
1159 1489 M
1159 1461 D
S
N
1160 1489 M
1160 1461 D
S
N
1155 1489 M
1160 1489 D
S
N
1155 1461 M
1164 1461 D
S
N
1172 1472 M
1189 1472 D
1189 1474 D
1187 1477 D
1186 1478 D
1183 1480 D
1179 1480 D
1175 1478 D
1172 1476 D
1171 1472 D
1171 1469 D
1172 1465 D
1175 1462 D
1179 1461 D
1182 1461 D
1186 1462 D
1189 1465 D
S
N
1187 1472 M
1187 1476 D
1186 1478 D
S
N
1179 1480 M
1176 1478 D
1174 1476 D
1172 1472 D
1172 1469 D
1174 1465 D
1176 1462 D
1179 1461 D
S
N
1222 1480 M
1222 1465 D
1223 1462 D
1227 1461 D
1230 1461 D
1234 1462 D
1237 1465 D
S
N
1223 1480 M
1223 1465 D
1224 1462 D
1227 1461 D
S
N
1237 1480 M
1237 1461 D
S
N
1238 1480 M
1238 1461 D
S
N
1218 1480 M
1223 1480 D
S
N
1233 1480 M
1238 1480 D
S
N
1237 1461 M
1242 1461 D
S
N
1252 1480 M
1252 1461 D
S
N
1253 1480 M
1253 1461 D
S
N
1253 1476 M
1256 1478 D
1260 1480 D
1263 1480 D
1267 1478 D
1268 1476 D
1268 1461 D
S
N
1263 1480 M
1265 1478 D
1267 1476 D
1267 1461 D
S
N
1248 1480 M
1253 1480 D
S
N
1248 1461 M
1257 1461 D
S
N
1263 1461 M
1272 1461 D
S
N
1296 1476 M
1294 1474 D
1296 1473 D
1297 1474 D
1297 1476 D
1294 1478 D
1291 1480 D
1287 1480 D
1283 1478 D
1281 1476 D
1279 1472 D
1279 1469 D
1281 1465 D
1283 1462 D
1287 1461 D
1290 1461 D
1294 1462 D
1297 1465 D
S
N
1287 1480 M
1285 1478 D
1282 1476 D
1281 1472 D
1281 1469 D
1282 1465 D
1285 1462 D
1287 1461 D
S
N
1308 1463 M
1307 1462 D
1308 1461 D
1309 1462 D
1308 1463 D
S
N
833 1304 M
833 1303 D
832 1303 D
832 1304 D
833 1305 D
836 1307 D
841 1307 D
844 1305 D
845 1304 D
847 1301 D
847 1292 D
848 1289 D
849 1288 D
S
N
845 1304 M
845 1292 D
847 1289 D
849 1288 D
851 1288 D
S
N
845 1301 M
844 1300 D
836 1299 D
832 1297 D
830 1294 D
830 1292 D
832 1289 D
836 1288 D
840 1288 D
843 1289 D
845 1292 D
S
N
836 1299 M
833 1297 D
832 1294 D
832 1292 D
833 1289 D
836 1288 D
S
N
860 1316 M
860 1288 D
S
N
862 1316 M
870 1292 D
S
N
860 1316 M
870 1288 D
S
N
879 1316 M
870 1288 D
S
N
879 1316 M
879 1288 D
S
N
881 1316 M
881 1288 D
S
N
856 1316 M
862 1316 D
S
N
879 1316 M
885 1316 D
S
N
856 1288 M
864 1288 D
S
N
875 1288 M
885 1288 D
S
N
911 1312 M
912 1308 D
912 1316 D
911 1312 D
908 1315 D
904 1316 D
901 1316 D
897 1315 D
895 1312 D
893 1309 D
892 1305 D
892 1299 D
893 1294 D
895 1292 D
897 1289 D
901 1288 D
904 1288 D
908 1289 D
911 1292 D
912 1294 D
S
N
901 1316 M
899 1315 D
896 1312 D
895 1309 D
893 1305 D
893 1299 D
895 1294 D
896 1292 D
899 1289 D
901 1288 D
S
N
941 1305 M
940 1308 D
937 1309 D
933 1309 D
930 1308 D
929 1307 D
927 1303 D
927 1299 D
929 1296 D
931 1294 D
936 1294 D
938 1296 D
940 1299 D
S
N
933 1309 M
930 1307 D
929 1303 D
929 1299 D
930 1296 D
931 1294 D
S
N
941 1309 M
940 1299 D
940 1296 D
942 1294 D
945 1294 D
948 1297 D
949 1301 D
949 1304 D
948 1308 D
947 1311 D
944 1314 D
941 1315 D
937 1316 D
933 1316 D
929 1315 D
926 1314 D
923 1311 D
922 1308 D
921 1304 D
921 1300 D
922 1296 D
923 1293 D
926 1290 D
929 1289 D
933 1288 D
937 1288 D
941 1289 D
944 1290 D
945 1292 D
S
N
942 1309 M
941 1299 D
941 1296 D
942 1294 D
S
N
960 1316 M
960 1288 D
S
N
962 1316 M
978 1290 D
S
N
962 1314 M
978 1288 D
S
N
978 1316 M
978 1288 D
S
N
956 1316 M
962 1316 D
S
N
974 1316 M
982 1316 D
S
N
956 1288 M
964 1288 D
S
N
992 1316 M
992 1288 D
S
N
993 1316 M
993 1288 D
S
N
988 1316 M
997 1316 D
S
N
988 1288 M
1008 1288 D
1008 1296 D
1007 1288 D
S
N
1023 1316 M
1019 1315 D
1016 1312 D
1015 1309 D
1014 1304 D
1014 1300 D
1015 1294 D
1016 1292 D
1019 1289 D
1023 1288 D
1026 1288 D
1030 1289 D
1033 1292 D
1034 1294 D
1035 1300 D
1035 1304 D
1034 1309 D
1033 1312 D
1030 1315 D
1026 1316 D
1023 1316 D
S
N
1023 1316 M
1020 1315 D
1018 1312 D
1016 1309 D
1015 1304 D
1015 1300 D
1016 1294 D
1018 1292 D
1020 1289 D
1023 1288 D
S
N
1026 1288 M
1029 1289 D
1031 1292 D
1033 1294 D
1034 1300 D
1034 1304 D
1033 1309 D
1031 1312 D
1029 1315 D
1026 1316 D
S
N
1046 1307 M
1045 1305 D
1046 1304 D
1048 1305 D
1046 1307 D
S
N
1046 1290 M
1045 1289 D
1046 1288 D
1048 1289 D
1046 1290 D
S
N
1082 1307 M
1082 1278 D
S
N
1083 1307 M
1083 1278 D
S
N
1083 1303 M
1086 1305 D
1089 1307 D
1092 1307 D
1096 1305 D
1098 1303 D
1100 1299 D
1100 1296 D
1098 1292 D
1096 1289 D
1092 1288 D
1089 1288 D
1086 1289 D
1083 1292 D
S
N
1092 1307 M
1094 1305 D
1097 1303 D
1098 1299 D
1098 1296 D
1097 1292 D
1094 1289 D
1092 1288 D
S
N
1078 1307 M
1083 1307 D
S
N
1078 1278 M
1088 1278 D
S
N
1124 1316 M
1124 1288 D
S
N
1126 1316 M
1126 1288 D
S
N
1124 1303 M
1122 1305 D
1119 1307 D
1116 1307 D
1112 1305 D
1109 1303 D
1108 1299 D
1108 1296 D
1109 1292 D
1112 1289 D
1116 1288 D
1119 1288 D
1122 1289 D
1124 1292 D
S
N
1116 1307 M
1114 1305 D
1111 1303 D
1109 1299 D
1109 1296 D
1111 1292 D
1114 1289 D
1116 1288 D
S
N
1120 1316 M
1126 1316 D
S
N
1124 1288 M
1130 1288 D
S
N
1146 1315 M
1145 1314 D
1146 1312 D
1148 1314 D
1148 1315 D
1146 1316 D
1144 1316 D
1141 1315 D
1140 1312 D
1140 1288 D
S
N
1144 1316 M
1142 1315 D
1141 1312 D
1141 1288 D
S
N
1135 1307 M
1146 1307 D
S
N
1135 1288 M
1145 1288 D
S
N
1179 1307 M
1179 1292 D
1181 1289 D
1185 1288 D
1187 1288 D
1192 1289 D
1194 1292 D
S
N
1181 1307 M
1181 1292 D
1182 1289 D
1185 1288 D
S
N
1194 1307 M
1194 1288 D
S
N
1196 1307 M
1196 1288 D
S
N
1175 1307 M
1181 1307 D
S
N
1190 1307 M
1196 1307 D
S
N
1194 1288 M
1200 1288 D
S
N
1209 1307 M
1209 1288 D
S
N
1211 1307 M
1211 1288 D
S
N
1211 1303 M
1213 1305 D
1218 1307 D
1220 1307 D
1224 1305 D
1226 1303 D
1226 1288 D
S
N
1220 1307 M
1223 1305 D
1224 1303 D
1224 1288 D
S
N
1205 1307 M
1211 1307 D
S
N
1205 1288 M
1215 1288 D
S
N
1220 1288 M
1230 1288 D
S
N
1253 1303 M
1252 1301 D
1253 1300 D
1254 1301 D
1254 1303 D
1252 1305 D
1249 1307 D
1245 1307 D
1241 1305 D
1238 1303 D
1237 1299 D
1237 1296 D
1238 1292 D
1241 1289 D
1245 1288 D
1248 1288 D
1252 1289 D
1254 1292 D
S
N
1245 1307 M
1242 1305 D
1239 1303 D
1238 1299 D
1238 1296 D
1239 1292 D
1242 1289 D
1245 1288 D
S
N
1265 1290 M
1264 1289 D
1265 1288 D
1267 1289 D
1265 1290 D
S
4 Sw
N
583 1520 M
583 1261 D
S
N
583 1261 M
1967 1261 D
S
N
1967 1261 M
1967 1520 D
S
N
1967 1520 M
583 1520 D
S
N
583 1261 M
1967 1261 D
S
N
583 1261 M
583 1276 D
S
N
929 1276 M
929 1261 D
S
N
1275 1261 M
1275 1276 D
S
N
1621 1276 M
1621 1261 D
S
N
1967 1261 M
1967 1276 D
S
N
583 1520 M
1967 1520 D
S
N
583 1505 M
583 1520 D
S
N
929 1520 M
929 1505 D
S
N
1275 1505 M
1275 1520 D
S
N
1621 1520 M
1621 1505 D
S
N
1967 1505 M
1967 1520 D
S
N
583 1261 M
583 1520 D
S
N
583 1261 M
588 1261 D
S
N
588 1273 M
583 1273 D
S
N
583 1285 M
599 1285 D
S
N
588 1297 M
583 1297 D
S
N
583 1309 M
588 1309 D
S
N
588 1321 M
583 1321 D
S
N
583 1333 M
588 1333 D
S
N
599 1345 M
583 1345 D
S
N
583 1357 M
588 1357 D
S
N
588 1369 M
583 1369 D
S
N
583 1381 M
588 1381 D
S
N
588 1394 M
583 1394 D
S
N
583 1406 M
599 1406 D
S
N
588 1418 M
583 1418 D
S
N
583 1430 M
588 1430 D
S
N
588 1442 M
583 1442 D
S
N
583 1454 M
588 1454 D
S
N
599 1466 M
583 1466 D
S
N
583 1478 M
588 1478 D
S
N
588 1490 M
583 1490 D
S
N
583 1502 M
588 1502 D
S
N
588 1514 M
583 1514 D
S
N
503 1298 M
498 1297 D
495 1292 D
494 1285 D
494 1280 D
495 1273 D
498 1268 D
503 1267 D
506 1267 D
510 1268 D
513 1273 D
515 1280 D
515 1285 D
513 1292 D
510 1297 D
506 1298 D
503 1298 D
S
N
503 1298 M
500 1297 D
498 1295 D
497 1292 D
495 1285 D
495 1280 D
497 1273 D
498 1270 D
500 1268 D
503 1267 D
S
N
506 1267 M
509 1268 D
510 1270 D
512 1273 D
513 1280 D
513 1285 D
512 1292 D
510 1295 D
509 1297 D
506 1298 D
S
N
527 1270 M
525 1268 D
527 1267 D
528 1268 D
527 1270 D
S
N
547 1298 M
542 1297 D
541 1294 D
541 1289 D
542 1286 D
547 1285 D
553 1285 D
557 1286 D
559 1289 D
559 1294 D
557 1297 D
553 1298 D
547 1298 D
S
N
547 1298 M
544 1297 D
542 1294 D
542 1289 D
544 1286 D
547 1285 D
S
N
553 1285 M
556 1286 D
557 1289 D
557 1294 D
556 1297 D
553 1298 D
S
N
547 1285 M
542 1283 D
541 1282 D
539 1279 D
539 1273 D
541 1270 D
542 1268 D
547 1267 D
553 1267 D
557 1268 D
559 1270 D
560 1273 D
560 1279 D
559 1282 D
557 1283 D
553 1285 D
S
N
547 1285 M
544 1283 D
542 1282 D
541 1279 D
541 1273 D
542 1270 D
544 1268 D
547 1267 D
S
N
553 1267 M
556 1268 D
557 1270 D
559 1273 D
559 1279 D
557 1282 D
556 1283 D
553 1285 D
S
N
503 1359 M
498 1357 D
495 1353 D
494 1345 D
494 1341 D
495 1333 D
498 1329 D
503 1327 D
506 1327 D
510 1329 D
513 1333 D
515 1341 D
515 1345 D
513 1353 D
510 1357 D
506 1359 D
503 1359 D
S
N
503 1359 M
500 1357 D
498 1356 D
497 1353 D
495 1345 D
495 1341 D
497 1333 D
498 1330 D
500 1329 D
503 1327 D
S
N
506 1327 M
509 1329 D
510 1330 D
512 1333 D
513 1341 D
513 1345 D
512 1353 D
510 1356 D
509 1357 D
506 1359 D
S
N
527 1330 M
525 1329 D
527 1327 D
528 1329 D
527 1330 D
S
N
559 1348 M
557 1344 D
554 1341 D
550 1339 D
548 1339 D
544 1341 D
541 1344 D
539 1348 D
539 1350 D
541 1354 D
544 1357 D
548 1359 D
551 1359 D
556 1357 D
559 1354 D
560 1350 D
560 1341 D
559 1335 D
557 1332 D
554 1329 D
550 1327 D
545 1327 D
542 1329 D
541 1332 D
541 1333 D
542 1335 D
544 1333 D
542 1332 D
S
N
548 1339 M
545 1341 D
542 1344 D
541 1348 D
541 1350 D
542 1354 D
545 1357 D
548 1359 D
S
N
551 1359 M
554 1357 D
557 1354 D
559 1350 D
559 1341 D
557 1335 D
556 1332 D
553 1329 D
550 1327 D
S
N
498 1413 M
501 1415 D
506 1419 D
506 1387 D
S
N
504 1418 M
504 1387 D
S
N
498 1387 M
512 1387 D
S
N
527 1390 M
525 1389 D
527 1387 D
528 1389 D
527 1390 D
S
N
548 1419 M
544 1418 D
541 1413 D
539 1406 D
539 1401 D
541 1394 D
544 1389 D
548 1387 D
551 1387 D
556 1389 D
559 1394 D
560 1401 D
560 1406 D
559 1413 D
556 1418 D
551 1419 D
548 1419 D
S
N
548 1419 M
545 1418 D
544 1416 D
542 1413 D
541 1406 D
541 1401 D
542 1394 D
544 1390 D
545 1389 D
548 1387 D
S
N
551 1387 M
554 1389 D
556 1390 D
557 1394 D
559 1401 D
559 1406 D
557 1413 D
556 1416 D
554 1418 D
551 1419 D
S
N
498 1473 M
501 1475 D
506 1480 D
506 1448 D
S
N
504 1478 M
504 1448 D
S
N
498 1448 M
512 1448 D
S
N
527 1451 M
525 1449 D
527 1448 D
528 1449 D
527 1451 D
S
N
544 1473 M
547 1475 D
551 1480 D
551 1448 D
S
N
550 1478 M
550 1448 D
S
N
544 1448 M
557 1448 D
S
N
1967 1261 M
1967 1520 D
S
N
1962 1261 M
1967 1261 D
S
N
1967 1273 M
1962 1273 D
S
N
1951 1285 M
1967 1285 D
S
N
1967 1297 M
1962 1297 D
S
N
1962 1309 M
1967 1309 D
S
N
1967 1321 M
1962 1321 D
S
N
1962 1333 M
1967 1333 D
S
N
1967 1345 M
1951 1345 D
S
N
1962 1357 M
1967 1357 D
S
N
1967 1369 M
1962 1369 D
S
N
1962 1381 M
1967 1381 D
S
N
1967 1394 M
1962 1394 D
S
N
1951 1406 M
1967 1406 D
S
N
1967 1418 M
1962 1418 D
S
N
1962 1430 M
1967 1430 D
S
N
1967 1442 M
1962 1442 D
S
N
1962 1454 M
1967 1454 D
S
N
1967 1466 M
1951 1466 D
S
N
1962 1478 M
1967 1478 D
S
N
1967 1490 M
1962 1490 D
S
N
1962 1502 M
1967 1502 D
S
N
1967 1514 M
1962 1514 D
S
N
583 1261 M
583 1423 D
929 1423 D
929 1430 D
1275 1430 D
1275 1423 D
1621 1423 D
1621 1427 D
1967 1427 D
S
N
583 1261 M
583 1385 D
929 1385 D
929 1381 D
1275 1381 D
1275 1384 D
1621 1384 D
1621 1382 D
1967 1382 D
S
N
721 1304 M
808 1304 D
S
0 0 1 setrgbcolor
N
583 1261 M
583 1273 D
S
N
583 1285 M
583 1297 D
S
N
583 1309 M
583 1321 D
S
N
583 1333 M
583 1346 D
S
N
583 1358 M
583 1370 D
S
N
583 1382 M
583 1394 D
S
N
583 1406 M
583 1418 D
S
N
591 1422 M
604 1422 D
S
N
616 1422 M
628 1422 D
S
N
640 1422 M
652 1422 D
S
N
664 1422 M
676 1422 D
S
N
688 1422 M
700 1422 D
S
N
713 1422 M
725 1422 D
S
N
737 1422 M
749 1422 D
S
N
761 1422 M
773 1422 D
S
N
785 1422 M
797 1422 D
S
N
809 1422 M
822 1422 D
S
N
834 1422 M
846 1422 D
S
N
858 1422 M
870 1422 D
S
N
882 1422 M
894 1422 D
S
N
906 1422 M
918 1422 D
S
N
929 1423 M
929 1427 D
937 1427 D
S
N
950 1427 M
962 1427 D
S
N
974 1427 M
986 1427 D
S
N
998 1427 M
1010 1427 D
S
N
1022 1427 M
1034 1427 D
S
N
1046 1427 M
1059 1427 D
S
N
1071 1427 M
1083 1427 D
S
N
1095 1427 M
1107 1427 D
S
N
1119 1427 M
1131 1427 D
S
N
1143 1427 M
1155 1427 D
S
N
1168 1427 M
1180 1427 D
S
N
1192 1427 M
1204 1427 D
S
N
1216 1427 M
1228 1427 D
S
N
1240 1427 M
1252 1427 D
S
N
1264 1427 M
1275 1427 D
1275 1425 D
S
N
1285 1423 M
1297 1423 D
S
N
1309 1423 M
1321 1423 D
S
N
1333 1423 M
1345 1423 D
S
N
1358 1423 M
1370 1423 D
S
N
1382 1423 M
1394 1423 D
S
N
1406 1423 M
1418 1423 D
S
N
1430 1423 M
1442 1423 D
S
N
1454 1423 M
1467 1423 D
S
N
1479 1423 M
1491 1423 D
S
N
1503 1423 M
1515 1423 D
S
N
1527 1423 M
1539 1423 D
S
N
1551 1423 M
1563 1423 D
S
N
1576 1423 M
1588 1423 D
S
N
1600 1423 M
1612 1423 D
S
N
1621 1426 M
1621 1438 D
S
N
1631 1440 M
1643 1440 D
S
N
1655 1440 M
1667 1440 D
S
N
1680 1440 M
1692 1440 D
S
N
1704 1440 M
1716 1440 D
S
N
1728 1440 M
1740 1440 D
S
N
1752 1440 M
1764 1440 D
S
N
1776 1440 M
1789 1440 D
S
N
1801 1440 M
1813 1440 D
S
N
1825 1440 M
1837 1440 D
S
N
1849 1440 M
1861 1440 D
S
N
1873 1440 M
1885 1440 D
S
N
1898 1440 M
1910 1440 D
S
N
1922 1440 M
1934 1440 D
S
N
1946 1440 M
1958 1440 D
S
N
583 1261 M
583 1273 D
S
N
583 1285 M
583 1297 D
S
N
583 1309 M
583 1321 D
S
N
583 1333 M
583 1346 D
S
N
589 1351 M
601 1351 D
S
N
613 1351 M
626 1351 D
S
N
638 1351 M
650 1351 D
S
N
662 1351 M
674 1351 D
S
N
686 1351 M
698 1351 D
S
N
710 1351 M
722 1351 D
S
N
735 1351 M
747 1351 D
S
N
759 1351 M
771 1351 D
S
N
783 1351 M
795 1351 D
S
N
807 1351 M
819 1351 D
S
N
831 1351 M
844 1351 D
S
N
856 1351 M
868 1351 D
S
N
880 1351 M
892 1351 D
S
N
904 1351 M
916 1351 D
S
N
928 1351 M
929 1351 D
929 1348 D
937 1348 D
S
N
949 1348 M
961 1348 D
S
N
973 1348 M
985 1348 D
S
N
998 1348 M
1010 1348 D
S
N
1022 1348 M
1034 1348 D
S
N
1046 1348 M
1058 1348 D
S
N
1070 1348 M
1082 1348 D
S
N
1094 1348 M
1107 1348 D
S
N
1119 1348 M
1131 1348 D
S
N
1143 1348 M
1155 1348 D
S
N
1167 1348 M
1179 1348 D
S
N
1191 1348 M
1203 1348 D
S
N
1216 1348 M
1228 1348 D
S
N
1240 1348 M
1252 1348 D
S
N
1264 1348 M
1275 1348 D
1275 1349 D
S
N
1287 1350 M
1299 1350 D
S
N
1311 1350 M
1323 1350 D
S
N
1335 1350 M
1347 1350 D
S
N
1359 1350 M
1371 1350 D
S
N
1384 1350 M
1396 1350 D
S
N
1408 1350 M
1420 1350 D
S
N
1432 1350 M
1444 1350 D
S
N
1456 1350 M
1468 1350 D
S
N
1480 1350 M
1493 1350 D
S
N
1505 1350 M
1517 1350 D
S
N
1529 1350 M
1541 1350 D
S
N
1553 1350 M
1565 1350 D
S
N
1577 1350 M
1589 1350 D
S
N
1602 1350 M
1614 1350 D
S
N
1621 1345 M
1621 1340 D
1629 1340 D
S
N
1641 1340 M
1653 1340 D
S
N
1665 1340 M
1677 1340 D
S
N
1689 1340 M
1702 1340 D
S
N
1714 1340 M
1726 1340 D
S
N
1738 1340 M
1750 1340 D
S
N
1762 1340 M
1774 1340 D
S
N
1786 1340 M
1798 1340 D
S
N
1811 1340 M
1823 1340 D
S
N
1835 1340 M
1847 1340 D
S
N
1859 1340 M
1871 1340 D
S
N
1883 1340 M
1895 1340 D
S
N
1907 1340 M
1920 1340 D
S
N
1932 1340 M
1944 1340 D
S
N
1956 1340 M
1967 1340 D
S
N
721 1477 M
734 1477 D
S
N
746 1477 M
758 1477 D
S
N
770 1477 M
782 1477 D
S
N
794 1477 M
806 1477 D
S
3 Sw
0 0 0 setrgbcolor
N
833 1230 M
833 1201 D
S
N
834 1230 M
834 1201 D
S
N
829 1230 M
845 1230 D
849 1228 D
851 1227 D
852 1224 D
852 1220 D
851 1217 D
849 1216 D
845 1215 D
834 1215 D
S
N
845 1230 M
848 1228 D
849 1227 D
851 1224 D
851 1220 D
849 1217 D
848 1216 D
845 1215 D
S
N
829 1201 M
838 1201 D
S
N
870 1230 M
866 1228 D
863 1226 D
862 1223 D
860 1217 D
860 1213 D
862 1208 D
863 1205 D
866 1202 D
870 1201 D
873 1201 D
877 1202 D
879 1205 D
881 1208 D
882 1213 D
882 1217 D
881 1223 D
879 1226 D
877 1228 D
873 1230 D
870 1230 D
S
N
870 1230 M
867 1228 D
864 1226 D
863 1223 D
862 1217 D
862 1213 D
863 1208 D
864 1205 D
867 1202 D
870 1201 D
S
N
873 1201 M
875 1202 D
878 1205 D
879 1208 D
881 1213 D
881 1217 D
879 1223 D
878 1226 D
875 1228 D
873 1230 D
S
N
892 1230 M
897 1201 D
S
N
893 1230 M
897 1208 D
S
N
903 1230 M
897 1201 D
S
N
903 1230 M
908 1201 D
S
N
904 1230 M
908 1208 D
S
N
914 1230 M
908 1201 D
S
N
888 1230 M
897 1230 D
S
N
910 1230 M
918 1230 D
S
N
926 1230 M
926 1201 D
S
N
927 1230 M
927 1201 D
S
N
944 1230 M
944 1201 D
S
N
945 1230 M
945 1201 D
S
N
922 1230 M
931 1230 D
S
N
940 1230 M
949 1230 D
S
N
927 1216 M
944 1216 D
S
N
922 1201 M
931 1201 D
S
N
940 1201 M
949 1201 D
S
N
959 1230 M
959 1201 D
S
N
960 1230 M
960 1201 D
S
N
968 1222 M
968 1211 D
S
N
955 1230 M
977 1230 D
977 1222 D
975 1230 D
S
N
960 1216 M
968 1216 D
S
N
955 1201 M
977 1201 D
977 1209 D
975 1201 D
S
N
988 1230 M
988 1201 D
S
N
989 1230 M
989 1201 D
S
N
983 1230 M
993 1230 D
S
N
983 1201 M
1004 1201 D
1004 1209 D
1003 1201 D
S
N
1012 1220 M
1011 1219 D
1012 1217 D
1014 1219 D
1012 1220 D
S
N
1012 1204 M
1011 1202 D
1012 1201 D
1014 1202 D
1012 1204 D
S
N
1048 1220 M
1048 1191 D
S
N
1049 1220 M
1049 1191 D
S
N
1049 1216 M
1052 1219 D
1055 1220 D
1057 1220 D
1061 1219 D
1064 1216 D
1066 1212 D
1066 1209 D
1064 1205 D
1061 1202 D
1057 1201 D
1055 1201 D
1052 1202 D
1049 1205 D
S
N
1057 1220 M
1060 1219 D
1063 1216 D
1064 1212 D
1064 1209 D
1063 1205 D
1060 1202 D
1057 1201 D
S
N
1044 1220 M
1049 1220 D
S
N
1044 1191 M
1053 1191 D
S
N
1075 1220 M
1083 1201 D
S
N
1077 1220 M
1083 1204 D
S
N
1092 1220 M
1083 1201 D
1081 1196 D
1078 1193 D
1075 1191 D
1074 1191 D
1072 1193 D
1074 1194 D
1075 1193 D
S
N
1072 1220 M
1081 1220 D
S
N
1086 1220 M
1094 1220 D
S
N
1103 1230 M
1103 1207 D
1104 1202 D
1107 1201 D
1109 1201 D
1112 1202 D
1114 1205 D
S
N
1104 1230 M
1104 1207 D
1105 1202 D
1107 1201 D
S
N
1098 1220 M
1109 1220 D
S
N
1123 1230 M
1123 1201 D
S
N
1124 1230 M
1124 1201 D
S
N
1124 1216 M
1127 1219 D
1131 1220 D
1134 1220 D
1138 1219 D
1140 1216 D
1140 1201 D
S
N
1134 1220 M
1137 1219 D
1138 1216 D
1138 1201 D
S
N
1119 1230 M
1124 1230 D
S
N
1119 1201 M
1129 1201 D
S
N
1134 1201 M
1144 1201 D
S
N
1153 1230 M
1152 1228 D
1153 1227 D
1155 1228 D
1153 1230 D
S
N
1153 1220 M
1153 1201 D
S
N
1155 1220 M
1155 1201 D
S
N
1149 1220 M
1155 1220 D
S
N
1149 1201 M
1159 1201 D
S
N
1168 1217 M
1168 1216 D
1167 1216 D
1167 1217 D
1168 1219 D
1171 1220 D
1176 1220 D
1179 1219 D
1181 1217 D
1182 1215 D
1182 1205 D
1183 1202 D
1185 1201 D
S
N
1181 1217 M
1181 1205 D
1182 1202 D
1185 1201 D
1186 1201 D
S
N
1181 1215 M
1179 1213 D
1171 1212 D
1167 1211 D
1166 1208 D
1166 1205 D
1167 1202 D
1171 1201 D
1175 1201 D
1178 1202 D
1181 1205 D
S
N
1171 1212 M
1168 1211 D
1167 1208 D
1167 1205 D
1168 1202 D
1171 1201 D
S
N
1216 1235 M
1192 1191 D
S
N
1226 1230 M
1226 1201 D
S
N
1227 1230 M
1227 1201 D
S
N
1227 1216 M
1230 1219 D
1234 1220 D
1237 1220 D
1241 1219 D
1242 1216 D
1242 1201 D
S
N
1237 1220 M
1239 1219 D
1241 1216 D
1241 1201 D
S
N
1222 1230 M
1227 1230 D
S
N
1222 1201 M
1231 1201 D
S
N
1237 1201 M
1246 1201 D
S
N
1254 1212 M
1271 1212 D
1271 1215 D
1270 1217 D
1268 1219 D
1265 1220 D
1261 1220 D
1257 1219 D
1254 1216 D
1253 1212 D
1253 1209 D
1254 1205 D
1257 1202 D
1261 1201 D
1264 1201 D
1268 1202 D
1271 1205 D
S
N
1270 1212 M
1270 1216 D
1268 1219 D
S
N
1261 1220 M
1259 1219 D
1256 1216 D
1254 1212 D
1254 1209 D
1256 1205 D
1259 1202 D
1261 1201 D
S
N
1282 1220 M
1282 1201 D
S
N
1283 1220 M
1283 1201 D
S
N
1283 1212 M
1285 1216 D
1287 1219 D
1290 1220 D
1294 1220 D
1296 1219 D
1296 1217 D
1294 1216 D
1293 1217 D
1294 1219 D
S
N
1278 1220 M
1283 1220 D
S
N
1278 1201 M
1287 1201 D
S
N
1304 1220 M
1309 1201 D
S
N
1305 1220 M
1309 1205 D
S
N
1315 1220 M
1309 1201 D
S
N
1315 1220 M
1320 1201 D
S
N
1316 1220 M
1320 1205 D
S
N
1326 1220 M
1320 1201 D
S
N
1300 1220 M
1309 1220 D
S
N
1322 1220 M
1330 1220 D
S
N
1338 1230 M
1337 1228 D
1338 1227 D
1339 1228 D
1338 1230 D
S
N
1338 1220 M
1338 1201 D
S
N
1339 1220 M
1339 1201 D
S
N
1334 1220 M
1339 1220 D
S
N
1334 1201 M
1343 1201 D
S
N
1357 1220 M
1354 1219 D
1353 1217 D
1352 1215 D
1352 1212 D
1353 1209 D
1354 1208 D
1357 1207 D
1360 1207 D
1363 1208 D
1364 1209 D
1365 1212 D
1365 1215 D
1364 1217 D
1363 1219 D
1360 1220 D
1357 1220 D
S
N
1354 1219 M
1353 1216 D
1353 1211 D
1354 1208 D
S
N
1363 1208 M
1364 1211 D
1364 1216 D
1363 1219 D
S
N
1364 1217 M
1365 1219 D
1368 1220 D
1368 1219 D
1365 1219 D
S
N
1353 1209 M
1352 1208 D
1350 1205 D
1350 1204 D
1352 1201 D
1356 1200 D
1363 1200 D
1367 1198 D
1368 1197 D
S
N
1350 1204 M
1352 1202 D
1356 1201 D
1363 1201 D
1367 1200 D
1368 1197 D
1368 1196 D
1367 1193 D
1363 1191 D
1354 1191 D
1350 1193 D
1349 1196 D
1349 1197 D
1350 1200 D
1354 1201 D
S
N
833 1057 M
833 1028 D
S
N
834 1057 M
834 1028 D
S
N
829 1057 M
845 1057 D
849 1055 D
851 1054 D
852 1051 D
852 1047 D
851 1044 D
849 1043 D
845 1042 D
834 1042 D
S
N
845 1057 M
848 1055 D
849 1054 D
851 1051 D
851 1047 D
849 1044 D
848 1043 D
845 1042 D
S
N
829 1028 M
838 1028 D
S
N
870 1057 M
866 1055 D
863 1053 D
862 1050 D
860 1044 D
860 1040 D
862 1035 D
863 1032 D
866 1029 D
870 1028 D
873 1028 D
877 1029 D
879 1032 D
881 1035 D
882 1040 D
882 1044 D
881 1050 D
879 1053 D
877 1055 D
873 1057 D
870 1057 D
S
N
870 1057 M
867 1055 D
864 1053 D
863 1050 D
862 1044 D
862 1040 D
863 1035 D
864 1032 D
867 1029 D
870 1028 D
S
N
873 1028 M
875 1029 D
878 1032 D
879 1035 D
881 1040 D
881 1044 D
879 1050 D
878 1053 D
875 1055 D
873 1057 D
S
N
892 1057 M
897 1028 D
S
N
893 1057 M
897 1035 D
S
N
903 1057 M
897 1028 D
S
N
903 1057 M
908 1028 D
S
N
904 1057 M
908 1035 D
S
N
914 1057 M
908 1028 D
S
N
888 1057 M
897 1057 D
S
N
910 1057 M
918 1057 D
S
N
926 1057 M
926 1028 D
S
N
927 1057 M
927 1028 D
S
N
944 1057 M
944 1028 D
S
N
945 1057 M
945 1028 D
S
N
922 1057 M
931 1057 D
S
N
940 1057 M
949 1057 D
S
N
927 1043 M
944 1043 D
S
N
922 1028 M
931 1028 D
S
N
940 1028 M
949 1028 D
S
N
959 1057 M
959 1028 D
S
N
960 1057 M
960 1028 D
S
N
968 1049 M
968 1038 D
S
N
955 1057 M
977 1057 D
977 1049 D
975 1057 D
S
N
960 1043 M
968 1043 D
S
N
955 1028 M
977 1028 D
977 1036 D
975 1028 D
S
N
988 1057 M
988 1028 D
S
N
989 1057 M
989 1028 D
S
N
983 1057 M
993 1057 D
S
N
983 1028 M
1004 1028 D
1004 1036 D
1003 1028 D
S
N
1033 1062 M
1008 1018 D
S
N
1042 1044 M
1042 1043 D
1041 1043 D
1041 1044 D
1042 1046 D
1045 1047 D
1051 1047 D
1053 1046 D
1055 1044 D
1056 1042 D
1056 1032 D
1057 1029 D
1059 1028 D
S
N
1055 1044 M
1055 1032 D
1056 1029 D
1059 1028 D
1060 1028 D
S
N
1055 1042 M
1053 1040 D
1045 1039 D
1041 1038 D
1040 1035 D
1040 1032 D
1041 1029 D
1045 1028 D
1049 1028 D
1052 1029 D
1055 1032 D
S
N
1045 1039 M
1042 1038 D
1041 1035 D
1041 1032 D
1042 1029 D
1045 1028 D
S
N
1070 1057 M
1070 1028 D
S
N
1071 1057 M
1079 1032 D
S
N
1070 1057 M
1079 1028 D
S
N
1089 1057 M
1079 1028 D
S
N
1089 1057 M
1089 1028 D
S
N
1090 1057 M
1090 1028 D
S
N
1066 1057 M
1071 1057 D
S
N
1089 1057 M
1094 1057 D
S
N
1066 1028 M
1074 1028 D
S
N
1085 1028 M
1094 1028 D
S
N
1120 1053 M
1122 1049 D
1122 1057 D
1120 1053 D
1118 1055 D
1114 1057 D
1111 1057 D
1107 1055 D
1104 1053 D
1103 1050 D
1101 1046 D
1101 1039 D
1103 1035 D
1104 1032 D
1107 1029 D
1111 1028 D
1114 1028 D
1118 1029 D
1120 1032 D
1122 1035 D
S
N
1111 1057 M
1108 1055 D
1105 1053 D
1104 1050 D
1103 1046 D
1103 1039 D
1104 1035 D
1105 1032 D
1108 1029 D
1111 1028 D
S
N
1150 1046 M
1149 1049 D
1146 1050 D
1142 1050 D
1140 1049 D
1138 1047 D
1137 1043 D
1137 1039 D
1138 1036 D
1141 1035 D
1145 1035 D
1148 1036 D
1149 1039 D
S
N
1142 1050 M
1140 1047 D
1138 1043 D
1138 1039 D
1140 1036 D
1141 1035 D
S
N
1150 1050 M
1149 1039 D
1149 1036 D
1152 1035 D
1155 1035 D
1157 1038 D
1159 1042 D
1159 1044 D
1157 1049 D
1156 1051 D
1153 1054 D
1150 1055 D
1146 1057 D
1142 1057 D
1138 1055 D
1135 1054 D
1133 1051 D
1131 1049 D
1130 1044 D
1130 1040 D
1131 1036 D
1133 1034 D
1135 1031 D
1138 1029 D
1142 1028 D
1146 1028 D
1150 1029 D
1153 1031 D
1155 1032 D
S
N
1152 1050 M
1150 1039 D
1150 1036 D
1152 1035 D
S
N
1170 1057 M
1170 1028 D
S
N
1171 1057 M
1187 1031 D
S
N
1171 1054 M
1187 1028 D
S
N
1187 1057 M
1187 1028 D
S
N
1166 1057 M
1171 1057 D
S
N
1183 1057 M
1192 1057 D
S
N
1166 1028 M
1174 1028 D
S
N
1201 1057 M
1201 1028 D
S
N
1202 1057 M
1202 1028 D
S
N
1197 1057 M
1207 1057 D
S
N
1197 1028 M
1218 1028 D
1218 1036 D
1216 1028 D
S
N
1233 1057 M
1228 1055 D
1226 1053 D
1224 1050 D
1223 1044 D
1223 1040 D
1224 1035 D
1226 1032 D
1228 1029 D
1233 1028 D
1235 1028 D
1239 1029 D
1242 1032 D
1244 1035 D
1245 1040 D
1245 1044 D
1244 1050 D
1242 1053 D
1239 1055 D
1235 1057 D
1233 1057 D
S
N
1233 1057 M
1230 1055 D
1227 1053 D
1226 1050 D
1224 1044 D
1224 1040 D
1226 1035 D
1227 1032 D
1230 1029 D
1233 1028 D
S
N
1235 1028 M
1238 1029 D
1241 1032 D
1242 1035 D
1244 1040 D
1244 1044 D
1242 1050 D
1241 1053 D
1238 1055 D
1235 1057 D
S
4 Sw
N
659 970 M
659 949 D
S
N
660 970 M
660 949 D
S
N
660 965 M
663 968 D
668 970 D
671 970 D
676 968 D
677 965 D
677 949 D
S
N
671 970 M
674 968 D
676 965 D
676 949 D
S
N
654 970 M
660 970 D
S
N
654 949 M
665 949 D
S
N
671 949 M
682 949 D
S
N
698 970 M
694 968 D
691 965 D
689 961 D
689 958 D
691 953 D
694 950 D
698 949 D
701 949 D
706 950 D
709 953 D
710 958 D
710 961 D
709 965 D
706 968 D
701 970 D
698 970 D
S
N
698 970 M
695 968 D
692 965 D
691 961 D
691 958 D
692 953 D
695 950 D
698 949 D
S
N
701 949 M
704 950 D
707 953 D
709 958 D
709 961 D
707 965 D
704 968 D
701 970 D
S
N
762 965 M
760 964 D
762 962 D
763 964 D
763 965 D
760 968 D
757 970 D
753 970 D
748 968 D
745 965 D
743 961 D
743 958 D
745 953 D
748 950 D
753 949 D
756 949 D
760 950 D
763 953 D
S
N
753 970 M
749 968 D
746 965 D
745 961 D
745 958 D
746 953 D
749 950 D
753 949 D
S
N
775 970 M
775 953 D
777 950 D
781 949 D
784 949 D
789 950 D
792 953 D
S
N
777 970 M
777 953 D
778 950 D
781 949 D
S
N
792 970 M
792 949 D
S
N
793 970 M
793 949 D
S
N
771 970 M
777 970 D
S
N
787 970 M
793 970 D
S
N
792 949 M
798 949 D
S
N
808 980 M
808 955 D
810 950 D
813 949 D
816 949 D
819 950 D
820 953 D
S
N
810 980 M
810 955 D
811 950 D
813 949 D
S
N
804 970 M
816 970 D
S
N
843 967 M
845 970 D
845 964 D
843 967 D
842 968 D
839 970 D
833 970 D
829 968 D
828 967 D
828 964 D
829 962 D
833 961 D
840 958 D
843 956 D
845 955 D
S
N
828 965 M
829 964 D
833 962 D
840 959 D
843 958 D
845 956 D
845 952 D
843 950 D
840 949 D
834 949 D
831 950 D
829 952 D
828 955 D
828 949 D
829 952 D
S
N
1055 965 M
1053 964 D
1055 962 D
1056 964 D
1056 965 D
1053 968 D
1050 970 D
1046 970 D
1041 968 D
1038 965 D
1037 961 D
1037 958 D
1038 953 D
1041 950 D
1046 949 D
1049 949 D
1053 950 D
1056 953 D
S
N
1046 970 M
1043 968 D
1040 965 D
1038 961 D
1038 958 D
1040 953 D
1043 950 D
1046 949 D
S
N
1068 970 M
1068 953 D
1070 950 D
1074 949 D
1077 949 D
1082 950 D
1085 953 D
S
N
1070 970 M
1070 953 D
1071 950 D
1074 949 D
S
N
1085 970 M
1085 949 D
S
N
1086 970 M
1086 949 D
S
N
1064 970 M
1070 970 D
S
N
1080 970 M
1086 970 D
S
N
1085 949 M
1091 949 D
S
N
1101 980 M
1101 955 D
1103 950 D
1106 949 D
1109 949 D
1112 950 D
1113 953 D
S
N
1103 980 M
1103 955 D
1104 950 D
1106 949 D
S
N
1097 970 M
1109 970 D
S
N
1136 967 M
1138 970 D
1138 964 D
1136 967 D
1135 968 D
1132 970 D
1126 970 D
1123 968 D
1121 967 D
1121 964 D
1123 962 D
1126 961 D
1133 958 D
1136 956 D
1138 955 D
S
N
1121 965 M
1123 964 D
1126 962 D
1133 959 D
1136 958 D
1138 956 D
1138 952 D
1136 950 D
1133 949 D
1127 949 D
1124 950 D
1123 952 D
1121 955 D
1121 949 D
1123 952 D
S
N
1175 974 M
1178 976 D
1183 980 D
1183 949 D
S
N
1181 979 M
1181 949 D
S
N
1175 949 M
1189 949 D
S
N
1401 965 M
1399 964 D
1401 962 D
1402 964 D
1402 965 D
1399 968 D
1396 970 D
1392 970 D
1387 968 D
1384 965 D
1383 961 D
1383 958 D
1384 953 D
1387 950 D
1392 949 D
1395 949 D
1399 950 D
1402 953 D
S
N
1392 970 M
1389 968 D
1386 965 D
1384 961 D
1384 958 D
1386 953 D
1389 950 D
1392 949 D
S
N
1414 970 M
1414 953 D
1416 950 D
1420 949 D
1423 949 D
1428 950 D
1431 953 D
S
N
1416 970 M
1416 953 D
1417 950 D
1420 949 D
S
N
1431 970 M
1431 949 D
S
N
1432 970 M
1432 949 D
S
N
1410 970 M
1416 970 D
S
N
1426 970 M
1432 970 D
S
N
1431 949 M
1437 949 D
S
N
1447 980 M
1447 955 D
1449 950 D
1452 949 D
1455 949 D
1458 950 D
1459 953 D
S
N
1449 980 M
1449 955 D
1450 950 D
1452 949 D
S
N
1443 970 M
1455 970 D
S
N
1482 967 M
1484 970 D
1484 964 D
1482 967 D
1481 968 D
1478 970 D
1472 970 D
1469 968 D
1467 967 D
1467 964 D
1469 962 D
1472 961 D
1479 958 D
1482 956 D
1484 955 D
S
N
1467 965 M
1469 964 D
1472 962 D
1479 959 D
1482 958 D
1484 956 D
1484 952 D
1482 950 D
1479 949 D
1473 949 D
1470 950 D
1469 952 D
1467 955 D
1467 949 D
1469 952 D
S
N
1518 974 M
1520 973 D
1518 971 D
1517 973 D
1517 974 D
1518 977 D
1520 979 D
1524 980 D
1530 980 D
1535 979 D
1536 977 D
1538 974 D
1538 971 D
1536 968 D
1532 965 D
1524 962 D
1521 961 D
1518 958 D
1517 953 D
1517 949 D
S
N
1530 980 M
1533 979 D
1535 977 D
1536 974 D
1536 971 D
1535 968 D
1530 965 D
1524 962 D
S
N
1517 952 M
1518 953 D
1521 953 D
1529 950 D
1533 950 D
1536 952 D
1538 953 D
S
N
1521 953 M
1529 949 D
1535 949 D
1536 950 D
1538 953 D
1538 956 D
S
N
1747 965 M
1745 964 D
1747 962 D
1748 964 D
1748 965 D
1745 968 D
1742 970 D
1738 970 D
1733 968 D
1730 965 D
1729 961 D
1729 958 D
1730 953 D
1733 950 D
1738 949 D
1741 949 D
1745 950 D
1748 953 D
S
N
1738 970 M
1735 968 D
1732 965 D
1730 961 D
1730 958 D
1732 953 D
1735 950 D
1738 949 D
S
N
1760 970 M
1760 953 D
1762 950 D
1766 949 D
1769 949 D
1774 950 D
1777 953 D
S
N
1762 970 M
1762 953 D
1763 950 D
1766 949 D
S
N
1777 970 M
1777 949 D
S
N
1778 970 M
1778 949 D
S
N
1756 970 M
1762 970 D
S
N
1772 970 M
1778 970 D
S
N
1777 949 M
1783 949 D
S
N
1793 980 M
1793 955 D
1795 950 D
1798 949 D
1801 949 D
1804 950 D
1805 953 D
S
N
1795 980 M
1795 955 D
1796 950 D
1798 949 D
S
N
1789 970 M
1801 970 D
S
N
1828 967 M
1830 970 D
1830 964 D
1828 967 D
1827 968 D
1824 970 D
1818 970 D
1815 968 D
1813 967 D
1813 964 D
1815 962 D
1818 961 D
1825 958 D
1828 956 D
1830 955 D
S
N
1813 965 M
1815 964 D
1818 962 D
1825 959 D
1828 958 D
1830 956 D
1830 952 D
1828 950 D
1825 949 D
1819 949 D
1816 950 D
1815 952 D
1813 955 D
1813 949 D
1815 952 D
S
N
1864 974 M
1866 973 D
1864 971 D
1863 973 D
1863 974 D
1864 977 D
1866 979 D
1870 980 D
1876 980 D
1881 979 D
1882 976 D
1882 971 D
1881 968 D
1876 967 D
1872 967 D
S
N
1876 980 M
1879 979 D
1881 976 D
1881 971 D
1879 968 D
1876 967 D
S
N
1876 967 M
1879 965 D
1882 962 D
1884 959 D
1884 955 D
1882 952 D
1881 950 D
1876 949 D
1870 949 D
1866 950 D
1864 952 D
1863 955 D
1863 956 D
1864 958 D
1866 956 D
1864 955 D
S
N
1881 964 M
1882 959 D
1882 955 D
1881 952 D
1879 950 D
1876 949 D
S
N
583 1261 M
583 1001 D
S
N
583 1001 M
1967 1001 D
S
N
1967 1001 M
1967 1261 D
S
N
1967 1261 M
583 1261 D
S
N
583 1001 M
583 1017 D
S
N
929 1017 M
929 1001 D
S
N
1275 1001 M
1275 1017 D
S
N
1621 1017 M
1621 1001 D
S
N
1967 1001 M
1967 1017 D
S
N
583 1261 M
1967 1261 D
S
N
583 1245 M
583 1261 D
S
N
929 1261 M
929 1245 D
S
N
1275 1245 M
1275 1261 D
S
N
1621 1261 M
1621 1245 D
S
N
1967 1245 M
1967 1261 D
S
N
583 1001 M
583 1261 D
S
N
583 1006 M
588 1006 D
S
N
588 1022 M
583 1022 D
S
N
583 1038 M
588 1038 D
S
N
599 1053 M
583 1053 D
S
N
583 1069 M
588 1069 D
S
N
588 1084 M
583 1084 D
S
N
583 1100 M
588 1100 D
S
N
588 1115 M
583 1115 D
S
N
583 1131 M
599 1131 D
S
N
588 1147 M
583 1147 D
S
N
583 1162 M
588 1162 D
S
N
588 1178 M
583 1178 D
S
N
583 1193 M
588 1193 D
S
N
599 1209 M
583 1209 D
S
N
583 1224 M
588 1224 D
S
N
588 1240 M
583 1240 D
S
N
583 1256 M
588 1256 D
S
N
503 1067 M
498 1065 D
495 1061 D
494 1053 D
494 1049 D
495 1041 D
498 1037 D
503 1035 D
506 1035 D
510 1037 D
513 1041 D
515 1049 D
515 1053 D
513 1061 D
510 1065 D
506 1067 D
503 1067 D
S
N
503 1067 M
500 1065 D
498 1064 D
497 1061 D
495 1053 D
495 1049 D
497 1041 D
498 1038 D
500 1037 D
503 1035 D
S
N
506 1035 M
509 1037 D
510 1038 D
512 1041 D
513 1049 D
513 1053 D
512 1061 D
510 1064 D
509 1065 D
506 1067 D
S
N
527 1038 M
525 1037 D
527 1035 D
528 1037 D
527 1038 D
S
N
547 1067 M
542 1065 D
541 1062 D
541 1058 D
542 1055 D
547 1053 D
553 1053 D
557 1055 D
559 1058 D
559 1062 D
557 1065 D
553 1067 D
547 1067 D
S
N
547 1067 M
544 1065 D
542 1062 D
542 1058 D
544 1055 D
547 1053 D
S
N
553 1053 M
556 1055 D
557 1058 D
557 1062 D
556 1065 D
553 1067 D
S
N
547 1053 M
542 1052 D
541 1050 D
539 1047 D
539 1041 D
541 1038 D
542 1037 D
547 1035 D
553 1035 D
557 1037 D
559 1038 D
560 1041 D
560 1047 D
559 1050 D
557 1052 D
553 1053 D
S
N
547 1053 M
544 1052 D
542 1050 D
541 1047 D
541 1041 D
542 1038 D
544 1037 D
547 1035 D
S
N
553 1035 M
556 1037 D
557 1038 D
559 1041 D
559 1047 D
557 1050 D
556 1052 D
553 1053 D
S
N
498 1139 M
501 1140 D
506 1145 D
506 1113 D
S
N
504 1143 M
504 1113 D
S
N
498 1113 M
512 1113 D
S
N
527 1116 M
525 1114 D
527 1113 D
528 1114 D
527 1116 D
S
N
548 1145 M
544 1143 D
541 1139 D
539 1131 D
539 1126 D
541 1119 D
544 1114 D
548 1113 D
551 1113 D
556 1114 D
559 1119 D
560 1126 D
560 1131 D
559 1139 D
556 1143 D
551 1145 D
548 1145 D
S
N
548 1145 M
545 1143 D
544 1142 D
542 1139 D
541 1131 D
541 1126 D
542 1119 D
544 1116 D
545 1114 D
548 1113 D
S
N
551 1113 M
554 1114 D
556 1116 D
557 1119 D
559 1126 D
559 1131 D
557 1139 D
556 1142 D
554 1143 D
551 1145 D
S
N
498 1216 M
501 1218 D
506 1222 D
506 1191 D
S
N
504 1221 M
504 1191 D
S
N
498 1191 M
512 1191 D
S
N
527 1194 M
525 1192 D
527 1191 D
528 1192 D
527 1194 D
S
N
541 1216 M
542 1215 D
541 1213 D
539 1215 D
539 1216 D
541 1219 D
542 1221 D
547 1222 D
553 1222 D
557 1221 D
559 1219 D
560 1216 D
560 1213 D
559 1210 D
554 1207 D
547 1204 D
544 1203 D
541 1200 D
539 1195 D
539 1191 D
S
N
553 1222 M
556 1221 D
557 1219 D
559 1216 D
559 1213 D
557 1210 D
553 1207 D
547 1204 D
S
N
539 1194 M
541 1195 D
544 1195 D
551 1192 D
556 1192 D
559 1194 D
560 1195 D
S
N
544 1195 M
551 1191 D
557 1191 D
559 1192 D
560 1195 D
560 1198 D
S
N
1967 1001 M
1967 1261 D
S
N
1962 1006 M
1967 1006 D
S
N
1967 1022 M
1962 1022 D
S
N
1962 1038 M
1967 1038 D
S
N
1967 1053 M
1951 1053 D
S
N
1962 1069 M
1967 1069 D
S
N
1967 1084 M
1962 1084 D
S
N
1962 1100 M
1967 1100 D
S
N
1967 1115 M
1962 1115 D
S
N
1951 1131 M
1967 1131 D
S
N
1967 1147 M
1962 1147 D
S
N
1962 1162 M
1967 1162 D
S
N
1967 1178 M
1962 1178 D
S
N
1962 1193 M
1967 1193 D
S
N
1967 1209 M
1951 1209 D
S
N
1962 1224 M
1967 1224 D
S
N
1967 1240 M
1962 1240 D
S
N
1962 1256 M
1967 1256 D
S
N
583 1001 M
583 1131 D
929 1131 D
929 1155 D
1275 1155 D
1275 1129 D
1621 1129 D
1621 1131 D
1967 1131 D
S
N
721 1217 M
808 1217 D
S
0 0 1 setrgbcolor
N
583 1001 M
583 1013 D
S
N
583 1025 M
583 1038 D
S
N
583 1050 M
583 1062 D
S
N
583 1074 M
583 1086 D
S
N
583 1098 M
583 1110 D
S
N
583 1122 M
583 1134 D
S
N
594 1136 M
606 1136 D
S
N
618 1136 M
630 1136 D
S
N
642 1136 M
654 1136 D
S
N
666 1136 M
678 1136 D
S
N
690 1136 M
703 1136 D
S
N
715 1136 M
727 1136 D
S
N
739 1136 M
751 1136 D
S
N
763 1136 M
775 1136 D
S
N
787 1136 M
799 1136 D
S
N
812 1136 M
824 1136 D
S
N
836 1136 M
848 1136 D
S
N
860 1136 M
872 1136 D
S
N
884 1136 M
896 1136 D
S
N
908 1136 M
921 1136 D
S
N
929 1132 M
929 1120 D
S
N
933 1112 M
945 1112 D
S
N
957 1112 M
969 1112 D
S
N
981 1112 M
993 1112 D
S
N
1005 1112 M
1017 1112 D
S
N
1030 1112 M
1042 1112 D
S
N
1054 1112 M
1066 1112 D
S
N
1078 1112 M
1090 1112 D
S
N
1102 1112 M
1114 1112 D
S
N
1126 1112 M
1138 1112 D
S
N
1151 1112 M
1163 1112 D
S
N
1175 1112 M
1187 1112 D
S
N
1199 1112 M
1211 1112 D
S
N
1223 1112 M
1235 1112 D
S
N
1247 1112 M
1260 1112 D
S
N
1272 1112 M
1275 1112 D
1275 1121 D
S
N
1275 1133 M
1275 1135 D
1285 1135 D
S
N
1297 1135 M
1309 1135 D
S
N
1321 1135 M
1334 1135 D
S
N
1346 1135 M
1358 1135 D
S
N
1370 1135 M
1382 1135 D
S
N
1394 1135 M
1406 1135 D
S
N
1418 1135 M
1430 1135 D
S
N
1443 1135 M
1455 1135 D
S
N
1467 1135 M
1479 1135 D
S
N
1491 1135 M
1503 1135 D
S
N
1515 1135 M
1527 1135 D
S
N
1539 1135 M
1552 1135 D
S
N
1564 1135 M
1576 1135 D
S
N
1588 1135 M
1600 1135 D
S
N
1612 1135 M
1621 1135 D
1621 1131 D
S
N
1627 1126 M
1640 1126 D
S
N
1652 1126 M
1664 1126 D
S
N
1676 1126 M
1688 1126 D
S
N
1700 1126 M
1712 1126 D
S
N
1724 1126 M
1736 1126 D
S
N
1749 1126 M
1761 1126 D
S
N
1773 1126 M
1785 1126 D
S
N
1797 1126 M
1809 1126 D
S
N
1821 1126 M
1833 1126 D
S
N
1845 1126 M
1858 1126 D
S
N
1870 1126 M
1882 1126 D
S
N
1894 1126 M
1906 1126 D
S
N
1918 1126 M
1930 1126 D
S
N
1942 1126 M
1954 1126 D
S
N
1967 1126 M
1967 1126 D
S
N
721 1044 M
734 1044 D
S
N
746 1044 M
758 1044 D
S
N
770 1044 M
782 1044 D
S
N
794 1044 M
806 1044 D
S
showpage
%%Trailer
%%Pages: 1
%%BoundingBox: 102 226 482 563
