%!PS-Adobe-2.0 EPSF-2.0
%%BoundingBox:  0 0 567 544
%%Title: efficiencyvspt_mh120_nlo_29Nov2011.eps: Higgs Cross Section
%%Creator: ROOT Version 5.30/02
%%CreationDate: Tue Nov 29 15:35:55 2011
%%EndComments
%%BeginProlog
80 dict begin
/s {stroke} def /l {lineto} def /m {moveto} def /t {translate} def
/r {rotate} def /rl {roll}  def /R {repeat} def
/d {rlineto} def /rm {rmoveto} def /gr {grestore} def /f {eofill} def
/c {setrgbcolor} def /black {0 setgray} def /sd {setdash} def
/cl {closepath} def /sf {scalefont setfont} def /lw {setlinewidth} def
/box {m dup 0 exch d exch 0 d 0 exch neg d cl} def
/NC{systemdict begin initclip end}def/C{NC box clip newpath}def
/bl {box s} def /bf {box f} def /Y { 0 exch d} def /X { 0 d} def 
/K {{pop pop 0 moveto} exch kshow} bind def
/ita {/ang 15 def gsave [1 0 ang dup sin exch cos div 1 0 0] concat} def 
/mp {newpath /y exch def /x exch def} def
/side {[w .77 mul w .23 mul] .385 w mul sd w 0 l currentpoint t -144 r} def
/mr {mp x y w2 0 360 arc} def /m24 {mr s} def /m20 {mr f} def
/mb {mp x y w2 add m w2 neg 0 d 0 w neg d w 0 d 0 w d cl} def
/mt {mp x y w2 add m w2 neg w neg d w 0 d cl} def
/m21 {mb f} def /m25 {mb s} def /m22 {mt f} def /m26{mt s} def
/m23 {mp x y w2 sub m w2 w d w neg 0 d cl f} def
/m27 {mp x y w2 add m w3 neg w2 neg d w3 w2 neg d w3 w2 d cl s} def
/m28 {mp x w2 sub y w2 sub w3 add m w3 0 d  0 w3 neg d w3 0 d 0 w3 d w3 0 d  0 w3 d w3 neg 0 d 0 w3 d w3 neg 0 d 0 w3 neg d w3 neg 0 d cl s } def
/m29 {mp gsave x w2 sub y w2 add w3 sub m currentpoint t 4 {side} repeat cl fill gr} def
/m30 {mp gsave x w2 sub y w2 add w3 sub m currentpoint t 4 {side} repeat cl s gr} def
/m31 {mp x y w2 sub m 0 w d x w2 sub y m w 0 d x w2 sub y w2 add m w w neg d x w2 sub y w2 sub m w w d s} def
/m32 {mp x y w2 sub m w2 w d w neg 0 d cl s} def
/m33 {mp x y w2 add m w3 neg w2 neg d w3 w2 neg d w3 w2 d cl f} def
/m34 {mp x w2 sub y w2 sub w3 add m w3 0 d  0 w3 neg d w3 0 d 0 w3 d w3 0 d  0 w3 d w3 neg 0 d 0 w3 d w3 neg 0 d 0 w3 neg d w3 neg 0 d cl f } def
/m2 {mp x y w2 sub m 0 w d x w2 sub y m w 0 d s} def
/m5 {mp x w2 sub y w2 sub m w w d x w2 sub y w2 add m w w neg d s} def
/reEncode {exch findfont dup length dict begin {1 index /FID eq  {pop pop} {def} ifelse } forall /Encoding exch def currentdict end dup /FontName get exch definefont pop } def [/Times-Bold /Times-Italic /Times-BoldItalic /Helvetica /Helvetica-Oblique
 /Helvetica-Bold /Helvetica-BoldOblique /Courier /Courier-Oblique /Courier-Bold /Courier-BoldOblique /Times-Roman /AvantGarde-Book /AvantGarde-BookOblique /AvantGarde-Demi /AvantGarde-DemiOblique /Bookman-Demi /Bookman-DemiItalic /Bookman-Light
 /Bookman-LightItalic /Helvetica-Narrow /Helvetica-Narrow-Bold /Helvetica-Narrow-BoldOblique /Helvetica-Narrow-Oblique /NewCenturySchlbk-Roman /NewCenturySchlbk-Bold /NewCenturySchlbk-BoldItalic /NewCenturySchlbk-Italic /Palatino-Bold
 /Palatino-BoldItalic /Palatino-Italic /Palatino-Roman ] {ISOLatin1Encoding reEncode } forall%%EndProlog
%%BeginSetup
%%EndSetup
newpath  gsave  .25 .25 scale  gsave  0 0 t black[  ] 0 sd 3 lw 1 1 1 c 2268 2176 0 0 bf black 1 1 1 c 1791 1720 363 348 bf black 1791 1720 363 348 bl 1 1 1 c 1791 1720 363 348 bf black 1791 1720 363 348 bl 363 348 m 1791 X s
 gsave  2268 2176 0 0 C 1894.84 98.9272 t 0 r /Helvetica findfont 102.732 sf 0 0 m ([GeV]) show NC gr 
 gsave  2268 2176 0 0 C 1693.18 45.6587 t 0 r /Helvetica findfont 68.4881 sf 0 0 m 
 162 143 105 72 53 34
(T, veto) K NC gr 
 gsave  2268 2176 0 0 C 1639.91 98.9272 t 0 r /Helvetica findfont 102.732 sf 0 0 m (p) show NC gr  444 400 m -52 Y s 485 374 m -26 Y s 526 374 m -26 Y s 566 374 m -26 Y s 607 374 m -26 Y s 648 400 m -52 Y s 689 374 m -26 Y s 729 374 m -26 Y s 770 374
 m -26 Y s 811 374 m -26 Y s 851 400 m -52 Y s 892 374 m -26 Y s 933 374 m -26 Y s 974 374 m -26 Y s 1014 374 m -26 Y s 1055 400 m -52 Y s 1096 374 m -26 Y s 1136 374 m -26 Y s 1177 374 m -26 Y s 1218 374 m -26 Y s 1259 400 m -52 Y s 1299 374 m -26 Y
 s 1340 374 m -26 Y s 1381 374 m -26 Y s 1421 374 m -26 Y s 1462 400 m -52 Y s 1503 374 m -26 Y s 1544 374 m -26 Y s 1584 374 m -26 Y s 1625 374 m -26 Y s 1666 400 m -52 Y s 1706 374 m -26 Y s 1747 374 m -26 Y s 1788 374 m -26 Y s 1829 374 m -26 Y s
 1869 400 m -52 Y s 1910 374 m -26 Y s 1951 374 m -26 Y s 1991 374 m -26 Y s 2032 374 m -26 Y s 2073 400 m -52 Y s 444 400 m -52 Y s 404 374 m -26 Y s 2073 400 m -52 Y s 2114 374 m -26 Y s 2154 374 m -26 Y s
 gsave  2268 2176 0 0 C 384.294 251.123 t 0 r /Helvetica findfont 102.732 sf 0 0 m (20) show NC gr 
 gsave  2268 2176 0 0 C 589.758 251.123 t 0 r /Helvetica findfont 102.732 sf 0 0 m (30) show NC gr 
 gsave  2268 2176 0 0 C 791.418 251.123 t 0 r /Helvetica findfont 102.732 sf 0 0 m (40) show NC gr 
 gsave  2268 2176 0 0 C 996.882 251.123 t 0 r /Helvetica findfont 102.732 sf 0 0 m (50) show NC gr 
 gsave  2268 2176 0 0 C 1198.54 251.123 t 0 r /Helvetica findfont 102.732 sf 0 0 m (60) show NC gr 
 gsave  2268 2176 0 0 C 1404.01 251.123 t 0 r /Helvetica findfont 102.732 sf 0 0 m (70) show NC gr 
 gsave  2268 2176 0 0 C 1605.67 251.123 t 0 r /Helvetica findfont 102.732 sf 0 0 m (80) show NC gr 
 gsave  2268 2176 0 0 C 1811.13 251.123 t 0 r /Helvetica findfont 102.732 sf 0 0 m (90) show NC gr 
 gsave  2268 2176 0 0 C 1986.15 251.123 t 0 r /Helvetica findfont 102.732 sf 0 0 m (100) show NC gr  363 2068 m 1791 X s 444 2016 m 52 Y s 485 2042 m 26 Y s 526 2042 m 26 Y s 566 2042 m 26 Y s 607 2042 m 26 Y s 648 2016 m 52 Y s 689 2042 m 26 Y s 729
 2042 m 26 Y s 770 2042 m 26 Y s 811 2042 m 26 Y s 851 2016 m 52 Y s 892 2042 m 26 Y s 933 2042 m 26 Y s 974 2042 m 26 Y s 1014 2042 m 26 Y s 1055 2016 m 52 Y s 1096 2042 m 26 Y s 1136 2042 m 26 Y s 1177 2042 m 26 Y s 1218 2042 m 26 Y s 1259 2016 m
 52 Y s 1299 2042 m 26 Y s 1340 2042 m 26 Y s 1381 2042 m 26 Y s 1421 2042 m 26 Y s 1462 2016 m 52 Y s 1503 2042 m 26 Y s 1544 2042 m 26 Y s 1584 2042 m 26 Y s 1625 2042 m 26 Y s 1666 2016 m 52 Y s 1706 2042 m 26 Y s 1747 2042 m 26 Y s 1788 2042 m 26
 Y s 1829 2042 m 26 Y s 1869 2016 m 52 Y s 1910 2042 m 26 Y s 1951 2042 m 26 Y s 1991 2042 m 26 Y s 2032 2042 m 26 Y s 2073 2016 m 52 Y s 444 2016 m 52 Y s 404 2042 m 26 Y s 2073 2016 m 52 Y s 2114 2042 m 26 Y s 2154 2042 m 26 Y s 363 348 m 1720 Y s
 gsave  2268 2176 0 0 C 79.9028 1179.52 t 90 r /Helvetica findfont 102.732 sf 0 0 m 
 828 777 721 664 642 591 568 540 514 446 418 361 305 282 254 203 147 124 68
(Selection Efficiency) K NC gr  417 573 m -54 X s 390 637 m -27 X s 390 701 m -27 X s 390 765 m -27 X s 390 829 m -27 X s 417 893 m -54 X s 390 957 m -27 X s 390 1022 m -27 X s 390 1086 m -27 X s 390 1150 m -27 X s 417 1214 m -54 X s 390 1278 m -27 X
 s 390 1342 m -27 X s 390 1406 m -27 X s 390 1470 m -27 X s 417 1534 m -54 X s 390 1598 m -27 X s 390 1663 m -27 X s 390 1727 m -27 X s 390 1791 m -27 X s 417 1855 m -54 X s 417 573 m -54 X s 390 509 m -27 X s 390 445 m -27 X s 390 380 m -27 X s 417
 1855 m -54 X s 390 1919 m -27 X s 390 1983 m -27 X s 390 2047 m -27 X s
 gsave  2268 2176 0 0 C 95.1223 536.49 t 0 r /Helvetica findfont 102.732 sf 0 0 m (0.195) show NC gr 
 gsave  2268 2176 0 0 C 209.269 856.101 t 0 r /Helvetica findfont 102.732 sf 0 0 m (0.2) show NC gr 
 gsave  2268 2176 0 0 C 95.1223 1179.52 t 0 r /Helvetica findfont 102.732 sf 0 0 m (0.205) show NC gr 
 gsave  2268 2176 0 0 C 167.415 1499.13 t 0 r /Helvetica findfont 102.732 sf 0 0 m (0.21) show NC gr 
 gsave  2268 2176 0 0 C 95.1223 1818.74 t 0 r /Helvetica findfont 102.732 sf 0 0 m (0.215) show NC gr  2154 348 m 1720 Y s 2101 573 m 53 X s 2127 637 m 27 X s 2127 701 m 27 X s 2127 765 m 27 X s 2127 829 m 27 X s 2101 893 m 53 X s 2127 957 m 27 X s
 2127 1022 m 27 X s 2127 1086 m 27 X s 2127 1150 m 27 X s 2101 1214 m 53 X s 2127 1278 m 27 X s 2127 1342 m 27 X s 2127 1406 m 27 X s 2127 1470 m 27 X s 2101 1534 m 53 X s 2127 1598 m 27 X s 2127 1663 m 27 X s 2127 1727 m 27 X s 2127 1791 m 27 X s
 2101 1855 m 53 X s 2101 573 m 53 X s 2127 509 m 27 X s 2127 445 m 27 X s 2127 380 m 27 X s 2101 1855 m 53 X s 2127 1919 m 27 X s 2127 1983 m 27 X s 2127 2047 m 27 X s 6 lw 444 872 m 24 78 d 21 64 d 20 62 d 21 56 d 16 45 d 24 61 d 21 51 d 19 43 d 15
 33 d 16 30 d 7 12 d 13 23 d 16 22 d 73 83 d 57 70 d 24 26 d 20 21 d 27 24 d 29 22 d 30 20 d 16 10 d 27 13 d 33 13 d 42 13 d 38 11 d 46 8 d 120 16 d 150 23 d 53 6 d 204 12 d 203 19 d 117 6 d 87 3 d s 3 lw /w 37 def /w2 {w 2 div} def /w3 {w 3 div} def
 444 872 546 1177 648 1407 750 1535 851 1652 953 1728 1055 1767 1259 1802 1462 1831 1666 1843 1869 1862 2073 1871 12 { m20} R 6 lw 1 0 0 c black 1 0 0 c 444 995 m 16 42 d 18 47 d 18 46 d 18 42 d 18 40 d 14 29 d 16 31 d 18 34 d 19 33 d 19 31 d 21 31 d
 9 12 d 16 22 d 19 22 d 19 20 d 48 46 d 34 32 d 27 24 d 26 22 d 14 11 d 29 19 d 27 16 d 27 14 d 19 8 d 22 8 d 80 18 d 98 22 d 70 13 d 36 6 d 66 9 d 137 13 d 119 10 d 85 5 d 203 3 d 204 4 d s 3 lw 444 995 546 1241 648 1413 750 1523 851 1612 953 1669
 1055 1695 1259 1736 1462 1758 1666 1773 1869 1776 2073 1780 12 { m21} R 6 lw 0 0 1 c black 0 0 1 c 444 426 m 16 69 d 18 76 d 18 73 d 18 69 d 18 63 d 14 47 d 16 50 d 18 52 d 20 55 d 25 65 d 23 54 d 26 61 d 25 52 d 19 38 d 19 33 d 13 21 d 17 24 d 22
 26 d 62 60 d 62 62 d 27 25 d 13 10 d 27 18 d 31 17 d 44 22 d 67 31 d 53 22 d 52 18 d 32 9 d 47 10 d 156 17 d 151 21 d 53 5 d 60 2 d 143 -2 d 204 -3 d s 3 lw 444 426 546 823 648 1099 750 1304 851 1414 953 1511 1055 1568 1259 1648 1462 1675 1666 1701
 1869 1701 2073 1698 12 { m22} R 6 lw 1 0 0 c[  12 12 ] 0 sd black 1 0 0 c 444 896 m 16 53 d 18 58 d 18 55 d 18 53 d 18 48 d 14 37 d 16 38 d 18 42 d 19 40 d 19 39 d 21 38 d 9 15 d 16 26 d 19 27 d 19 25 d 48 57 d 34 39 d 27 30 d 26 26 d 14 14 d 29 23
 d 27 20 d 27 17 d 19 11 d 22 9 d 80 22 d 99 27 d 69 16 d 36 8 d 66 11 d 137 16 d 120 12 d 84 6 d 203 4 d 204 5 d s[  ] 0 sd 3 lw 444 896 546 1200 648 1412 750 1547 851 1656 953 1727 1055 1758 1259 1809 1462 1836 1666 1854 1869 1858 2073 1863 12 {
 m23} R[  12 12 ] 0 sd 6 lw 0 0 1 c black 0 0 1 c 444 977 m 16 54 d 18 61 d 18 58 d 18 54 d 18 51 d 14 36 d 16 40 d 18 42 d 20 43 d 25 52 d 23 43 d 26 48 d 25 41 d 19 31 d 19 26 d 13 17 d 17 19 d 22 20 d 62 48 d 62 49 d 27 20 d 13 8 d 27 14 d 31 14 d
 44 17 d 67 25 d 53 17 d 52 15 d 32 7 d 47 8 d 156 13 d 151 17 d 53 4 d 60 2 d 143 -2 d 204 -3 d s[  ] 0 sd 3 lw 444 977 546 1291 648 1511 750 1674 851 1761 953 1838 1055 1883 1259 1947 1462 1968 1666 1989 1869 1989 2073 1986 12 { m24} R[  12 12 ] 0
 sd 6 lw 1 1 1 c[  ] 0 sd 3 lw 884 871 1134 435 bf black
 gsave  2268 2176 0 0 C 1354.54 1190.93 t 0 r /Helvetica findfont 79.9028 sf 0 0 m 
 444 399 380 335 286 264 245 200 173 150 104 59
(Central Value) K NC gr  6 lw 1167 1219 m 155 X s 3 lw 1244 1219 m20 6 lw
 gsave  2268 2176 0 0 C 1951.91 1012.1 t 0 r /Helvetica findfont 53.2685 sf 0 0 m (W) show NC gr 
 gsave  2268 2176 0 0 C 1776.89 1034.93 t 0 r /Helvetica findfont 79.9028 sf 0 0 m (=2 M) show NC gr 
 gsave  2268 2176 0 0 C 1738.84 993.077 t 0 r /Helvetica findfont 53.2685 sf 0 0 m (R) show NC gr 
 gsave  2268 2176 0 0 C 1693.18 1034.93 t 0 r /Symbol findfont 79.9028 sf 0 0 m (m) show NC gr 
 gsave  2268 2176 0 0 C 1658.93 1034.93 t 0 r /Helvetica findfont 79.9028 sf 0 0 m (, ) show NC gr 
 gsave  2268 2176 0 0 C 1605.67 1012.1 t 0 r /Helvetica findfont 53.2685 sf 0 0 m (W) show NC gr 
 gsave  2268 2176 0 0 C 1430.64 1034.93 t 0 r /Helvetica findfont 79.9028 sf 0 0 m (=2 M) show NC gr 
 gsave  2268 2176 0 0 C 1400.2 993.077 t 0 r /Helvetica findfont 53.2685 sf 0 0 m (F) show NC gr 
 gsave  2268 2176 0 0 C 1354.54 1034.93 t 0 r /Symbol findfont 79.9028 sf 0 0 m (m) show NC gr  1 0 0 c 1167 1045 m 155 X s 3 lw 1244 1045 m21 6 lw black
 gsave  2268 2176 0 0 C 1944.3 859.906 t 0 r /Helvetica findfont 79.9028 sf 0 0 m (/2) show NC gr 
 gsave  2268 2176 0 0 C 1891.03 837.077 t 0 r /Helvetica findfont 53.2685 sf 0 0 m (W) show NC gr 
 gsave  2268 2176 0 0 C 1780.69 859.906 t 0 r /Helvetica findfont 79.9028 sf 0 0 m (=M) show NC gr 
 gsave  2268 2176 0 0 C 1742.64 818.052 t 0 r /Helvetica findfont 53.2685 sf 0 0 m (R) show NC gr 
 gsave  2268 2176 0 0 C 1696.98 859.906 t 0 r /Symbol findfont 79.9028 sf 0 0 m (m) show NC gr 
 gsave  2268 2176 0 0 C 1594.25 859.906 t 0 r /Helvetica findfont 79.9028 sf 0 0 m (/2, ) show NC gr 
 gsave  2268 2176 0 0 C 1540.98 837.077 t 0 r /Helvetica findfont 53.2685 sf 0 0 m (W) show NC gr 
 gsave  2268 2176 0 0 C 1430.64 859.906 t 0 r /Helvetica findfont 79.9028 sf 0 0 m (=M) show NC gr 
 gsave  2268 2176 0 0 C 1400.2 818.052 t 0 r /Helvetica findfont 53.2685 sf 0 0 m (F) show NC gr 
 gsave  2268 2176 0 0 C 1354.54 859.906 t 0 r /Symbol findfont 79.9028 sf 0 0 m (m) show NC gr  0 0 1 c 1167 871 m 155 X s 3 lw 1244 871 m22 6 lw black
 gsave  2268 2176 0 0 C 1940.5 688.686 t 0 r /Helvetica findfont 79.9028 sf 0 0 m (/2) show NC gr 
 gsave  2268 2176 0 0 C 1887.23 665.856 t 0 r /Helvetica findfont 53.2685 sf 0 0 m (W) show NC gr 
 gsave  2268 2176 0 0 C 1776.89 688.686 t 0 r /Helvetica findfont 79.9028 sf 0 0 m (=M) show NC gr 
 gsave  2268 2176 0 0 C 1738.84 646.832 t 0 r /Helvetica findfont 53.2685 sf 0 0 m (R) show NC gr 
 gsave  2268 2176 0 0 C 1693.18 688.686 t 0 r /Symbol findfont 79.9028 sf 0 0 m (m) show NC gr 
 gsave  2268 2176 0 0 C 1658.93 688.686 t 0 r /Helvetica findfont 79.9028 sf 0 0 m (, ) show NC gr 
 gsave  2268 2176 0 0 C 1605.67 665.856 t 0 r /Helvetica findfont 53.2685 sf 0 0 m (W) show NC gr 
 gsave  2268 2176 0 0 C 1430.64 688.686 t 0 r /Helvetica findfont 79.9028 sf 0 0 m (=2 M) show NC gr 
 gsave  2268 2176 0 0 C 1400.2 646.832 t 0 r /Helvetica findfont 53.2685 sf 0 0 m (F) show NC gr 
 gsave  2268 2176 0 0 C 1354.54 688.686 t 0 r /Symbol findfont 79.9028 sf 0 0 m (m) show NC gr  1 0 0 c[  12 12 ] 0 sd 1167 696 m 155 X s[  ] 0 sd 3 lw 1244 696 m23[  12 12 ] 0 sd 6 lw black
 gsave  2268 2176 0 0 C 1955.72 490.831 t 0 r /Helvetica findfont 53.2685 sf 0 0 m (W) show NC gr 
 gsave  2268 2176 0 0 C 1780.69 513.661 t 0 r /Helvetica findfont 79.9028 sf 0 0 m (=2 M) show NC gr 
 gsave  2268 2176 0 0 C 1742.64 471.807 t 0 r /Helvetica findfont 53.2685 sf 0 0 m (R) show NC gr 
 gsave  2268 2176 0 0 C 1696.98 513.661 t 0 r /Symbol findfont 79.9028 sf 0 0 m (m) show NC gr 
 gsave  2268 2176 0 0 C 1594.25 513.661 t 0 r /Helvetica findfont 79.9028 sf 0 0 m (/2, ) show NC gr 
 gsave  2268 2176 0 0 C 1540.98 490.831 t 0 r /Helvetica findfont 53.2685 sf 0 0 m (W) show NC gr 
 gsave  2268 2176 0 0 C 1430.64 513.661 t 0 r /Helvetica findfont 79.9028 sf 0 0 m (=M) show NC gr 
 gsave  2268 2176 0 0 C 1400.2 471.807 t 0 r /Helvetica findfont 53.2685 sf 0 0 m (F) show NC gr 
 gsave  2268 2176 0 0 C 1354.54 513.661 t 0 r /Symbol findfont 79.9028 sf 0 0 m (m) show NC gr  0 0 1 c 1167 522 m 155 X s[  ] 0 sd 3 lw 1244 522 m24[  12 12 ] 0 sd 6 lw black
 gsave  2268 2176 0 0 C 2222.06 1579.03 t 90 r /Helvetica-BoldOblique findfont 41.8538 sf 0 0 m 
 449 429 407 384 373 341 303 291 264 237 226 199 167 136 124 95 84 54 25
(LHC HIGGS XS WG 2011) K NC gr 
 gr  gr showpage
end
%%EOF
