%!PS-Adobe-2.0 EPSF-2.0
%%BoundingBox:  0 0 567 384
%%Title: yH.eps: yH
%%Creator: ROOT Version 5.27/06b
%%CreationDate: Fri Dec  9 13:07:06 2011
%%EndComments
%%BeginProlog
80 dict begin
/s {stroke} def /l {lineto} def /m {moveto} def /t {translate} def
/r {rotate} def /rl {roll}  def /R {repeat} def
/d {rlineto} def /rm {rmoveto} def /gr {grestore} def /f {eofill} def
/c {setrgbcolor} def /black {0 setgray} def /sd {setdash} def
/cl {closepath} def /sf {scalefont setfont} def /lw {setlinewidth} def
/box {m dup 0 exch d exch 0 d 0 exch neg d cl} def
/NC{systemdict begin initclip end}def/C{NC box clip newpath}def
/bl {box s} def /bf {box f} def /Y { 0 exch d} def /X { 0 d} def 
/K {{pop pop 0 moveto} exch kshow} bind def
/ita {/ang 15 def gsave [1 0 ang dup sin exch cos div 1 0 0] concat} def 
/mp {newpath /y exch def /x exch def} def
/side {[w .77 mul w .23 mul] .385 w mul sd w 0 l currentpoint t -144 r} def
/mr {mp x y w2 0 360 arc} def /m24 {mr s} def /m20 {mr f} def
/mb {mp x y w2 add m w2 neg 0 d 0 w neg d w 0 d 0 w d cl} def
/mt {mp x y w2 add m w2 neg w neg d w 0 d cl} def
/m21 {mb f} def /m25 {mb s} def /m22 {mt f} def /m26{mt s} def
/m23 {mp x y w2 sub m w2 w d w neg 0 d cl f} def
/m27 {mp x y w2 add m w3 neg w2 neg d w3 w2 neg d w3 w2 d cl s} def
/m28 {mp x w2 sub y w2 sub w3 add m w3 0 d  0 w3 neg d w3 0 d 0 w3 d w3 0 d  0 w3 d w3 neg 0 d 0 w3 d w3 neg 0 d 0 w3 neg d w3 neg 0 d cl s } def
/m29 {mp gsave x w2 sub y w2 add w3 sub m currentpoint t 4 {side} repeat cl fill gr} def
/m30 {mp gsave x w2 sub y w2 add w3 sub m currentpoint t 4 {side} repeat cl s gr} def
/m31 {mp x y w2 sub m 0 w d x w2 sub y m w 0 d x w2 sub y w2 add m w w neg d x w2 sub y w2 sub m w w d s} def
/m32 {mp x y w2 sub m w2 w d w neg 0 d cl s} def
/m33 {mp x y w2 add m w3 neg w2 neg d w3 w2 neg d w3 w2 d cl f} def
/m34 {mp x w2 sub y w2 sub w3 add m w3 0 d  0 w3 neg d w3 0 d 0 w3 d w3 0 d  0 w3 d w3 neg 0 d 0 w3 d w3 neg 0 d 0 w3 neg d w3 neg 0 d cl f } def
/m2 {mp x y w2 sub m 0 w d x w2 sub y m w 0 d s} def
/m5 {mp x w2 sub y w2 sub m w w d x w2 sub y w2 add m w w neg d s} def
/reEncode {exch findfont dup length dict begin {1 index /FID eq  {pop pop} {def} ifelse } forall /Encoding exch def currentdict end dup /FontName get exch definefont pop } def [/Times-Bold /Times-Italic /Times-BoldItalic /Helvetica /Helvetica-Oblique
 /Helvetica-Bold /Helvetica-BoldOblique /Courier /Courier-Oblique /Courier-Bold /Courier-BoldOblique /Times-Roman /AvantGarde-Book /AvantGarde-BookOblique /AvantGarde-Demi /AvantGarde-DemiOblique /Bookman-Demi /Bookman-DemiItalic /Bookman-Light
 /Bookman-LightItalic /Helvetica-Narrow /Helvetica-Narrow-Bold /Helvetica-Narrow-BoldOblique /Helvetica-Narrow-Oblique /NewCenturySchlbk-Roman /NewCenturySchlbk-Bold /NewCenturySchlbk-BoldItalic /NewCenturySchlbk-Italic /Palatino-Bold
 /Palatino-BoldItalic /Palatino-Italic /Palatino-Roman ] {ISOLatin1Encoding reEncode } forall%%EndProlog
%%BeginSetup
%%EndSetup
newpath  gsave  .25 .25 scale  gsave  0 0 t black[  ] 0 sd 3 lw 1 1 1 c 2268 1538 0 0 bf black 1 1 1 c 1791 1215 363 246 bf black 1791 1215 363 246 bl 1 0 0 c 6 lw 1 1 1 c black 1 0 0 c 423 1340 m 19 Y s 423 1385 m 18 Y s 3 lw black /w 31 def /w2 {w
 2 div} def /w3 {w 3 div} def 423 1372 m20 6 lw 1 0 0 c 542 1294 m 25 Y s 542 1345 m 24 Y s 3 lw black 542 1332 m20 6 lw 1 0 0 c 661 1278 m 26 Y s 661 1330 m 25 Y s 3 lw black 661 1317 m20 6 lw 1 0 0 c 781 1127 m 27 Y s 781 1180 m 27 Y s 3 lw black
 781 1167 m20 6 lw 1 0 0 c 900 1043 m 18 Y s 900 1087 m 18 Y s 3 lw black 900 1074 m20 6 lw 1 0 0 c 1020 930 m 17 Y s 1020 973 m 16 Y s 3 lw black 1020 960 m20 6 lw 1 0 0 c 1139 785 m 24 Y s 1139 835 m 24 Y s 3 lw black 1139 822 m20 6 lw 1 0 0 c 1259
 733 m 7 Y s 1259 766 m 7 Y s 3 lw black 1259 753 m20 6 lw 1 0 0 c 1378 594 m 7 Y s 1378 627 m 7 Y s 3 lw black 1378 614 m20 6 lw 1 0 0 c 1497 480 m 5 Y s 1497 511 m 4 Y s 3 lw black 1497 498 m20 6 lw 1 0 0 c 1617 420 m 4 Y s 1617 450 m 4 Y s 3 lw
 black 1617 437 m20 6 lw 3 lw 1736 343 m20 6 lw 3 lw 1856 292 m20 6 lw 3 lw 1975 261 m20 6 lw 3 lw 2095 249 m20 6 lw 1 0 0 c 1 1 1 c black 1 0 0 c 363 1372 m 119 X -40 Y 120 X -15 Y 119 X -150 Y 120 X -93 Y 119 X -114 Y 119 X -138 Y 120 X -69 Y 119 X
 -139 Y 120 X -116 Y 119 X -61 Y 120 X -94 Y 119 X -51 Y 119 X -31 Y 120 X -12 Y 119 X s black 3 lw 363 246 m 1791 X s
 gsave  2268 1538 0 0 C 1717.25 88 t 0 r /Helvetica findfont 71.6807 sf 0 0 m (Higgs rapidity) show NC gr  363 283 m -37 Y s 411 264 m -18 Y s 458 264 m -18 Y s 506 264 m -18 Y s 554 264 m -18 Y s 602 283 m -37 Y s 649 264 m -18 Y s 697 264 m -18 Y s
 745 264 m -18 Y s 793 264 m -18 Y s 841 283 m -37 Y s 888 264 m -18 Y s 936 264 m -18 Y s 984 264 m -18 Y s 1032 264 m -18 Y s 1079 283 m -37 Y s 1127 264 m -18 Y s 1175 264 m -18 Y s 1223 264 m -18 Y s 1271 264 m -18 Y s 1318 283 m -37 Y s 1366 264
 m -18 Y s 1414 264 m -18 Y s 1462 264 m -18 Y s 1509 264 m -18 Y s 1557 283 m -37 Y s 1605 264 m -18 Y s 1653 264 m -18 Y s 1700 264 m -18 Y s 1748 264 m -18 Y s 1796 283 m -37 Y s 1844 264 m -18 Y s 1892 264 m -18 Y s 1939 264 m -18 Y s 1987 264 m
 -18 Y s 2035 283 m -37 Y s 2035 283 m -37 Y s 2083 264 m -18 Y s 2130 264 m -18 Y s
 gsave  2268 1538 0 0 C 342.25 179.188 t 0 r /Helvetica findfont 71.6807 sf 0 0 m (0) show NC gr 
 gsave  2268 1538 0 0 C 550.812 179.188 t 0 r /Helvetica findfont 71.6807 sf 0 0 m (0.5) show NC gr 
 gsave  2268 1538 0 0 C 821.25 179.188 t 0 r /Helvetica findfont 71.6807 sf 0 0 m (1) show NC gr 
 gsave  2268 1538 0 0 C 1029.75 179.188 t 0 r /Helvetica findfont 71.6807 sf 0 0 m (1.5) show NC gr 
 gsave  2268 1538 0 0 C 1296.94 179.188 t 0 r /Helvetica findfont 71.6807 sf 0 0 m (2) show NC gr 
 gsave  2268 1538 0 0 C 1505.44 179.188 t 0 r /Helvetica findfont 71.6807 sf 0 0 m (2.5) show NC gr 
 gsave  2268 1538 0 0 C 1775.88 179.188 t 0 r /Helvetica findfont 71.6807 sf 0 0 m (3) show NC gr 
 gsave  2268 1538 0 0 C 1984.44 179.188 t 0 r /Helvetica findfont 71.6807 sf 0 0 m (3.5) show NC gr  363 1461 m 1791 X s 363 1425 m 36 Y s 411 1443 m 18 Y s 458 1443 m 18 Y s 506 1443 m 18 Y s 554 1443 m 18 Y s 602 1425 m 36 Y s 649 1443 m 18 Y s 697
 1443 m 18 Y s 745 1443 m 18 Y s 793 1443 m 18 Y s 841 1425 m 36 Y s 888 1443 m 18 Y s 936 1443 m 18 Y s 984 1443 m 18 Y s 1032 1443 m 18 Y s 1079 1425 m 36 Y s 1127 1443 m 18 Y s 1175 1443 m 18 Y s 1223 1443 m 18 Y s 1271 1443 m 18 Y s 1318 1425 m
 36 Y s 1366 1443 m 18 Y s 1414 1443 m 18 Y s 1462 1443 m 18 Y s 1509 1443 m 18 Y s 1557 1425 m 36 Y s 1605 1443 m 18 Y s 1653 1443 m 18 Y s 1700 1443 m 18 Y s 1748 1443 m 18 Y s 1796 1425 m 36 Y s 1844 1443 m 18 Y s 1892 1443 m 18 Y s 1939 1443 m 18
 Y s 1987 1443 m 18 Y s 2035 1425 m 36 Y s 2035 1425 m 36 Y s 2083 1443 m 18 Y s 2130 1443 m 18 Y s 363 246 m 1215 Y s
 gsave  2268 1538 0 0 C 172.875 755.875 t 90 r /Helvetica findfont 71.6807 sf 0 0 m (arbitrary normalization) show NC gr  417 246 m -54 X s 390 285 m -27 X s 390 324 m -27 X s 390 363 m -27 X s 417 402 m -54 X s 390 441 m -27 X s 390 480 m -27 X s
 390 519 m -27 X s 417 558 m -54 X s 390 597 m -27 X s 390 636 m -27 X s 390 675 m -27 X s 417 714 m -54 X s 390 753 m -27 X s 390 792 m -27 X s 390 831 m -27 X s 417 870 m -54 X s 390 909 m -27 X s 390 948 m -27 X s 390 987 m -27 X s 417 1026 m -54
 X s 390 1065 m -27 X s 390 1104 m -27 X s 390 1143 m -27 X s 417 1182 m -54 X s 390 1221 m -27 X s 390 1260 m -27 X s 390 1299 m -27 X s 417 1338 m -54 X s 417 1338 m -54 X s 390 1377 m -27 X s 390 1416 m -27 X s 390 1455 m -27 X s
 gsave  2268 1538 0 0 C 309.75 221.562 t 0 r /Helvetica findfont 71.6807 sf 0 0 m (0) show NC gr 
 gsave  2268 1538 0 0 C 212 377.875 t 0 r /Helvetica findfont 71.6807 sf 0 0 m (0.02) show NC gr 
 gsave  2268 1538 0 0 C 212 534.312 t 0 r /Helvetica findfont 71.6807 sf 0 0 m (0.04) show NC gr 
 gsave  2268 1538 0 0 C 212 690.688 t 0 r /Helvetica findfont 71.6807 sf 0 0 m (0.06) show NC gr 
 gsave  2268 1538 0 0 C 212 843.812 t 0 r /Helvetica findfont 71.6807 sf 0 0 m (0.08) show NC gr 
 gsave  2268 1538 0 0 C 260.875 1000.19 t 0 r /Helvetica findfont 71.6807 sf 0 0 m (0.1) show NC gr 
 gsave  2268 1538 0 0 C 212 1156.62 t 0 r /Helvetica findfont 71.6807 sf 0 0 m (0.12) show NC gr 
 gsave  2268 1538 0 0 C 212 1313 t 0 r /Helvetica findfont 71.6807 sf 0 0 m (0.14) show NC gr  2154 246 m 1215 Y s 2101 246 m 53 X s 2127 285 m 27 X s 2127 324 m 27 X s 2127 363 m 27 X s 2101 402 m 53 X s 2127 441 m 27 X s 2127 480 m 27 X s 2127 519
 m 27 X s 2101 558 m 53 X s 2127 597 m 27 X s 2127 636 m 27 X s 2127 675 m 27 X s 2101 714 m 53 X s 2127 753 m 27 X s 2127 792 m 27 X s 2127 831 m 27 X s 2101 870 m 53 X s 2127 909 m 27 X s 2127 948 m 27 X s 2127 987 m 27 X s 2101 1026 m 53 X s 2127
 1065 m 27 X s 2127 1104 m 27 X s 2127 1143 m 27 X s 2101 1182 m 53 X s 2127 1221 m 27 X s 2127 1260 m 27 X s 2127 1299 m 27 X s 2101 1338 m 53 X s 2101 1338 m 53 X s 2127 1377 m 27 X s 2127 1416 m 27 X s 2127 1455 m 27 X s 6 lw 1 1 1 c black 363
 1341 m 119 X -21 Y 120 X -52 Y 119 X -71 Y 120 X -114 Y 119 X -103 Y 119 X -121 Y 120 X -128 Y 119 X -115 Y 120 X -108 Y 119 X -87 Y 120 X -74 Y 119 X -47 Y 119 X -33 Y 120 X -16 Y 119 X s 0 0 1 c[  12 12 ] 0 sd 1 1 1 c black 0 0 1 c 363 1329 m 119
 X -21 Y 120 X -49 Y 119 X -68 Y 120 X -111 Y 119 X -99 Y 119 X -119 Y 120 X -125 Y 119 X -115 Y 120 X -107 Y 119 X -87 Y 120 X -76 Y 119 X -49 Y 119 X -34 Y 120 X -17 Y 119 X s black
 gsave  2268 1538 0 0 C 2199.44 1124 t 90 r /Helvetica-BoldOblique findfont 29.3239 sf 0 0 m 
 317 303 287 271 263 240 213 205 186 167 159 140 118 95 87 67 59 38 17
(LHC HIGGS XS WG 2011) K NC gr 
 gr  gr showpage
end
%%EOF
