%!PS-Adobe-3.0 EPSF-3.0
%%BoundingBox: (atend)
%%LanguageLevel: 2
%%Creator: Grace-5.1.22
%%CreationDate: Mon Dec 19 07:37:59 2011
%%DocumentData: Clean8Bit
%%Orientation: Portrait
%%Title: dsdR_ttb_perc_err_band.agr
%%For: laura
%%DocumentNeededResources: (atend)
%%EndComments
%%BeginProlog
/m {moveto} def
/l {lineto} def
/s {stroke} def
/n {newpath} def
/c {closepath} def
/RL {rlineto} def
/SLW {setlinewidth} def
/GS {gsave} def
/GR {grestore} def
/SC {setcolor} def
/SGRY {setgray} def
/SRGB {setrgbcolor} def
/SD {setdash} def
/SLC {setlinecap} def
/SLJ {setlinejoin} def
/SCS {setcolorspace} def
/FFSF {findfont setfont} def
/CC {concat} def
/PXL {n m 0 0 RL s} def
/Color0 {1.0000 1.0000 1.0000} def
/Color1 {0.0000 0.0000 0.0000} def
/Color2 {1.0000 0.0000 0.0000} def
/Color3 {0.0000 1.0000 0.0000} def
/Color4 {0.0000 0.0000 1.0000} def
/Color5 {1.0000 1.0000 0.0000} def
/Color6 {0.7373 0.5608 0.5608} def
/Color7 {0.8627 0.8627 0.8627} def
/Color8 {0.5804 0.0000 0.8275} def
/Color9 {0.0000 1.0000 1.0000} def
/Color10 {1.0000 0.0000 1.0000} def
/Color11 {1.0000 0.6471 0.0000} def
/Color12 {0.4471 0.1294 0.7373} def
/Color13 {0.4039 0.0275 0.2824} def
/Color14 {0.2510 0.8784 0.8157} def
/Color15 {0.0000 0.5451 0.0000} def
/Color16 {0.7529 0.7529 0.7529} def
/Color17 {0.5059 0.5059 0.5059} def
/Color18 {0.2588 0.2588 0.2588} def
/PTRN {
 /pat_bits exch def 
 <<
  /PaintType 2
  /PatternType 1 /TilingType 1
  /BBox[0 0 16 16]
  /XStep 16 /YStep 16
  /PaintProc {
   pop
   16 16 true [-1 0 0 -1 16 16] pat_bits imagemask
  }
 >>
 [0.0016 0 0 0.0016 0 0]
 makepattern
} def
/Pattern0 {<0000000000000000000000000000000000000000000000000000000000000000> PTRN} bind def
/Pattern1 {<ffffffffffffffffffffffffffffffffffffffffffffffffffffffffffffffff> PTRN} bind def
/Pattern2 {<eeeeffffbbbbffffeeeeffffbbbbffffeeeeffffbbbbffffeeeeffffbbbbffff> PTRN} bind def
/Pattern3 {<eeeebbbbeeeebbbbeeeebbbbeeeebbbbeeeebbbbeeeebbbbeeeebbbbeeeebbbb> PTRN} bind def
/Pattern4 {<5555aaaa5555aaaa5555aaaa5555aaaa5555aaaa5555aaaa5555aaaa5555aaaa> PTRN} bind def
/Pattern5 {<1111444411114444111144441111444411114444111144441111444411114444> PTRN} bind def
/Pattern6 {<1111000044440000111100004444000011110000444400001111000044440000> PTRN} bind def
/Pattern7 {<1010000000000000010100000000000010100000000000000101000000000000> PTRN} bind def
/Pattern8 {<0000000000000000000000000000000000000000000000000000000000000000> PTRN} bind def
/Pattern9 {<1e1e0f0f8787c3c3e1e1f0f078783c3c1e1e0f0f8787c3c3e1e1f0f078783c3c> PTRN} bind def
/Pattern10 {<7878f0f0e1e1c3c387870f0f1e1e3c3c7878f0f0e1e1c3c387870f0f1e1e3c3c> PTRN} bind def
/Pattern11 {<3333333333333333333333333333333333333333333333333333333333333333> PTRN} bind def
/Pattern12 {<ffffffff00000000ffffffff00000000ffffffff00000000ffffffff00000000> PTRN} bind def
/Pattern13 {<8181424224241818181824244242818181814242242418181818242442428181> PTRN} bind def
/Pattern14 {<8080404020201010080804040202010180804040202010100808040402020101> PTRN} bind def
/Pattern15 {<0101020204040808101020204040808001010202040408081010202040408080> PTRN} bind def
/Pattern16 {<2222222222222222222222222222222222222222222222222222222222222222> PTRN} bind def
/Pattern17 {<0000ffff000000000000ffff000000000000ffff000000000000ffff00000000> PTRN} bind def
/Pattern18 {<2222ffff222222222222ffff222222222222ffff222222222222ffff22222222> PTRN} bind def
/Pattern19 {<ffffffff33333333ffffffff33333333ffffffff33333333ffffffff33333333> PTRN} bind def
/Pattern20 {<0f0f0f0f0f0f0f0ff0f0f0f0f0f0f0f00f0f0f0f0f0f0f0ff0f0f0f0f0f0f0f0> PTRN} bind def
/Pattern21 {<ff00ff00ff00ff00ff00ff00ff00ff0000ff00ff00ff00ff00ff00ff00ff00ff> PTRN} bind def
/Pattern22 {<8001800180018001800180018001ffffffff8001800180018001800180018001> PTRN} bind def
/Pattern23 {<c003c003c003c003c003c003ffffffffffffffffc003c003c003c003c003c003> PTRN} bind def
/Pattern24 {<040404040404ffff404040404040ffff040404040404ffff404040404040ffff> PTRN} bind def
/Pattern25 {<180018001800180018001800ffffffff001800180018001800180018ffffffff> PTRN} bind def
/Pattern26 {<1111b8b87c7c3a3a1111a3a3c7c78b8b1111b8b87c7c3a3a1111a3a3c7c78b8b> PTRN} bind def
/Pattern27 {<101010102828c7c70101010182827c7c101010102828c7c70101010182827c7c> PTRN} bind def
/Pattern28 {<1c1c121211112121c1c12121111112121c1c121211112121c1c1212111111212> PTRN} bind def
/Pattern29 {<3e3e414180808080e3e31414080808083e3e414180808080e3e3141408080808> PTRN} bind def
/Pattern30 {<4848888884848383848488884848383848488888848483838484888848483838> PTRN} bind def
/Pattern31 {<03030404080808080c0c12122121c0c003030404080808080c0c12122121c0c0> PTRN} bind def
/ellipsedict 8 dict def
ellipsedict /mtrx matrix put
/EARC {
 ellipsedict begin
  /endangle exch def
  /startangle exch def
  /yrad exch def
  /xrad exch def
  /y exch def
  /x exch def
  /savematrix mtrx currentmatrix def
  x y translate
  xrad yrad scale
  0 0 1 startangle endangle arc
  savematrix setmatrix
 end
} def
/TL {
  /kcomp exch def
  /linewidth exch def
  /offset exch def
  GS
  0 offset rmoveto
  linewidth SLW
  dup stringwidth exch kcomp add exch RL s
  GR
} def
/KINIT
{
 /kvector exch def
 /kid 0 def
} def
/KPROC
{
 pop pop
 kvector kid get
 0 rmoveto
 /kid 1 kid add def
} def
/DefEncoding [
 /.notdef
 /.notdef
 /.notdef
 /.notdef
 /.notdef
 /.notdef
 /.notdef
 /.notdef
 /.notdef
 /.notdef
 /.notdef
 /.notdef
 /.notdef
 /.notdef
 /.notdef
 /.notdef
 /.notdef
 /.notdef
 /.notdef
 /.notdef
 /.notdef
 /.notdef
 /.notdef
 /.notdef
 /.notdef
 /.notdef
 /.notdef
 /.notdef
 /.notdef
 /.notdef
 /.notdef
 /.notdef
 /space
 /exclam
 /quotedbl
 /numbersign
 /dollar
 /percent
 /ampersand
 /quoteright
 /parenleft
 /parenright
 /asterisk
 /plus
 /comma
 /hyphen
 /period
 /slash
 /zero
 /one
 /two
 /three
 /four
 /five
 /six
 /seven
 /eight
 /nine
 /colon
 /semicolon
 /less
 /equal
 /greater
 /question
 /at
 /A
 /B
 /C
 /D
 /E
 /F
 /G
 /H
 /I
 /J
 /K
 /L
 /M
 /N
 /O
 /P
 /Q
 /R
 /S
 /T
 /U
 /V
 /W
 /X
 /Y
 /Z
 /bracketleft
 /backslash
 /bracketright
 /asciicircum
 /underscore
 /grave
 /a
 /b
 /c
 /d
 /e
 /f
 /g
 /h
 /i
 /j
 /k
 /l
 /m
 /n
 /o
 /p
 /q
 /r
 /s
 /t
 /u
 /v
 /w
 /x
 /y
 /z
 /braceleft
 /bar
 /braceright
 /asciitilde
 /.notdef
 /.notdef
 /.notdef
 /.notdef
 /.notdef
 /.notdef
 /.notdef
 /.notdef
 /.notdef
 /.notdef
 /.notdef
 /.notdef
 /.notdef
 /.notdef
 /.notdef
 /.notdef
 /.notdef
 /.notdef
 /.notdef
 /.notdef
 /.notdef
 /.notdef
 /.notdef
 /.notdef
 /.notdef
 /.notdef
 /.notdef
 /.notdef
 /.notdef
 /.notdef
 /.notdef
 /.notdef
 /.notdef
 /space
 /exclamdown
 /cent
 /sterling
 /currency
 /yen
 /brokenbar
 /section
 /dieresis
 /copyright
 /ordfeminine
 /guillemotleft
 /logicalnot
 /hyphen
 /registered
 /macron
 /degree
 /plusminus
 /twosuperior
 /threesuperior
 /acute
 /mu
 /paragraph
 /periodcentered
 /cedilla
 /onesuperior
 /ordmasculine
 /guillemotright
 /onequarter
 /onehalf
 /threequarters
 /questiondown
 /Agrave
 /Aacute
 /Acircumflex
 /Atilde
 /Adieresis
 /Aring
 /AE
 /Ccedilla
 /Egrave
 /Eacute
 /Ecircumflex
 /Edieresis
 /Igrave
 /Iacute
 /Icircumflex
 /Idieresis
 /Eth
 /Ntilde
 /Ograve
 /Oacute
 /Ocircumflex
 /Otilde
 /Odieresis
 /multiply
 /Oslash
 /Ugrave
 /Uacute
 /Ucircumflex
 /Udieresis
 /Yacute
 /Thorn
 /germandbls
 /agrave
 /aacute
 /acircumflex
 /atilde
 /adieresis
 /aring
 /ae
 /ccedilla
 /egrave
 /eacute
 /ecircumflex
 /edieresis
 /igrave
 /iacute
 /icircumflex
 /idieresis
 /eth
 /ntilde
 /ograve
 /oacute
 /ocircumflex
 /otilde
 /odieresis
 /divide
 /oslash
 /ugrave
 /uacute
 /ucircumflex
 /udieresis
 /yacute
 /thorn
 /ydieresis
] def
%%EndProlog
%%BeginSetup
%%EndSetup
612.00 612.00 scale
n
0.0000 0.0000 m
0.0000 1.0000 l
1.2941 1.0000 l
1.2941 0.0000 l
c
[/DeviceRGB] SCS
Color0 SC
fill
[/DeviceRGB] SCS
Color2 SC
[] 0 SD
0.0030 SLW
0 SLC
0 SLJ
n
0.1500 0.4827 m
0.1500 0.4780 l
0.1700 0.4780 l
0.1700 0.4733 l
0.1900 0.4733 l
0.1900 0.4699 l
0.2100 0.4699 l
0.2100 0.4915 l
0.2300 0.4915 l
0.2300 0.4573 l
0.2500 0.4573 l
0.2500 0.4896 l
0.2700 0.4896 l
0.2700 0.4695 l
0.2900 0.4695 l
0.2900 0.4704 l
0.3100 0.4704 l
0.3100 0.4706 l
0.3300 0.4706 l
0.3300 0.4829 l
0.3500 0.4829 l
0.3500 0.4722 l
0.3700 0.4722 l
0.3700 0.4744 l
0.3900 0.4744 l
0.3900 0.4660 l
0.4100 0.4660 l
0.4100 0.4846 l
0.4300 0.4846 l
0.4300 0.4771 l
0.4500 0.4771 l
0.4500 0.4756 l
0.4700 0.4756 l
0.4700 0.4781 l
0.4900 0.4781 l
0.4900 0.4774 l
0.5100 0.4774 l
0.5100 0.4742 l
0.5300 0.4742 l
0.5300 0.4837 l
0.5500 0.4837 l
0.5500 0.4743 l
0.5700 0.4743 l
0.5700 0.4796 l
0.5900 0.4796 l
0.5900 0.4840 l
0.6100 0.4840 l
0.6100 0.4811 l
0.6300 0.4811 l
0.6300 0.4842 l
0.6500 0.4842 l
0.6500 0.4865 l
0.6700 0.4865 l
0.6700 0.4854 l
0.6900 0.4854 l
0.6900 0.4885 l
0.7100 0.4885 l
0.7100 0.4877 l
0.7300 0.4877 l
0.7300 0.4905 l
0.7500 0.4905 l
0.7500 0.4913 l
0.7700 0.4913 l
0.7700 0.4868 l
0.7900 0.4868 l
0.7900 0.4869 l
0.8100 0.4869 l
0.8100 0.4838 l
0.8300 0.4838 l
0.8300 0.4882 l
0.8500 0.4882 l
0.8500 0.4807 l
0.8700 0.4807 l
0.8700 0.4828 l
0.8900 0.4828 l
0.8900 0.4667 l
0.9100 0.4667 l
0.9100 0.4938 l
0.9300 0.4938 l
0.9300 0.4713 l
0.9500 0.4713 l
0.9500 0.4924 l
0.9700 0.4924 l
0.9700 0.4592 l
0.9900 0.4592 l
0.9900 0.4829 l
1.0100 0.4829 l
1.0100 0.4792 l
1.0300 0.4792 l
1.0300 0.4588 l
1.0500 0.4588 l
1.0500 0.5302 l
1.0700 0.5302 l
1.0700 0.4584 l
1.0900 0.4584 l
1.0900 0.5070 l
1.1100 0.5070 l
1.1100 0.4758 l
1.1300 0.4758 l
1.1300 0.5043 l
1.1500 0.5043 l
1.1500 0.4449 l
1.1501 0.4449 l
s
n
0.1500 0.5499 m
0.1500 0.5431 l
0.1700 0.5431 l
0.1700 0.5244 l
0.1900 0.5244 l
0.1900 0.5614 l
0.2100 0.5614 l
0.2100 0.5284 l
0.2300 0.5284 l
0.2300 0.5331 l
0.2500 0.5331 l
0.2500 0.5346 l
0.2700 0.5346 l
0.2700 0.5399 l
0.2900 0.5399 l
0.2900 0.5361 l
0.3100 0.5361 l
0.3100 0.5267 l
0.3300 0.5267 l
0.3300 0.5380 l
0.3500 0.5380 l
0.3500 0.5166 l
0.3700 0.5166 l
0.3700 0.5428 l
0.3900 0.5428 l
0.3900 0.5288 l
0.4100 0.5288 l
0.4100 0.5157 l
0.4300 0.5157 l
0.4300 0.5310 l
0.4500 0.5310 l
0.4500 0.5188 l
0.4700 0.5188 l
0.4700 0.5223 l
0.4900 0.5223 l
0.4900 0.5174 l
0.5100 0.5174 l
0.5100 0.5147 l
0.5300 0.5147 l
0.5300 0.5230 l
0.5500 0.5230 l
0.5500 0.5083 l
0.5700 0.5083 l
0.5700 0.5340 l
0.5900 0.5340 l
0.5900 0.5233 l
0.6100 0.5233 l
0.6100 0.5105 l
0.6300 0.5105 l
0.6300 0.5055 l
0.6500 0.5055 l
0.6500 0.5050 l
0.6700 0.5050 l
0.6700 0.5092 l
0.6900 0.5092 l
0.6900 0.4977 l
0.7100 0.4977 l
0.7100 0.4989 l
0.7300 0.4989 l
0.7300 0.5017 l
0.7500 0.5017 l
0.7500 0.4935 l
0.7700 0.4935 l
0.7700 0.4981 l
0.7900 0.4981 l
0.7900 0.4903 l
0.8100 0.4903 l
0.8100 0.5205 l
0.8300 0.5205 l
0.8300 0.4930 l
0.8500 0.4930 l
0.8500 0.4972 l
0.8700 0.4972 l
0.8700 0.5080 l
0.8900 0.5080 l
0.8900 0.5287 l
0.9100 0.5287 l
0.9100 0.5157 l
0.9300 0.5157 l
0.9300 0.5187 l
0.9500 0.5187 l
0.9500 0.5074 l
0.9700 0.5074 l
0.9700 0.4893 l
0.9900 0.4893 l
0.9900 0.5062 l
1.0100 0.5062 l
1.0100 0.5105 l
1.0300 0.5105 l
1.0300 0.5321 l
1.0500 0.5321 l
1.0500 0.6044 l
1.0700 0.6044 l
1.0700 0.4832 l
1.0900 0.4832 l
1.0900 0.5475 l
1.1100 0.5475 l
1.1100 0.5455 l
1.1300 0.5455 l
1.1300 0.5761 l
1.1500 0.5761 l
1.1500 0.5303 l
1.1501 0.5303 l
s
[/DeviceRGB] SCS
Color4 SC
n
0.1500 0.4144 m
0.1500 0.4505 l
0.1700 0.4505 l
0.1700 0.4447 l
0.1900 0.4447 l
0.1900 0.4407 l
0.2100 0.4407 l
0.2100 0.4655 l
0.2300 0.4655 l
0.2300 0.4167 l
0.2500 0.4167 l
0.2500 0.4713 l
0.2700 0.4713 l
0.2700 0.4372 l
0.2900 0.4372 l
0.2900 0.4411 l
0.3100 0.4411 l
0.3100 0.4424 l
0.3300 0.4424 l
0.3300 0.4667 l
0.3500 0.4667 l
0.3500 0.4549 l
0.3700 0.4549 l
0.3700 0.4502 l
0.3900 0.4502 l
0.3900 0.4413 l
0.4100 0.4413 l
0.4100 0.4698 l
0.4300 0.4698 l
0.4300 0.4529 l
0.4500 0.4529 l
0.4500 0.4507 l
0.4700 0.4507 l
0.4700 0.4621 l
0.4900 0.4621 l
0.4900 0.4595 l
0.5100 0.4595 l
0.5100 0.4567 l
0.5300 0.4567 l
0.5300 0.4649 l
0.5500 0.4649 l
0.5500 0.4597 l
0.5700 0.4597 l
0.5700 0.4532 l
0.5900 0.4532 l
0.5900 0.4639 l
0.6100 0.4639 l
0.6100 0.4582 l
0.6300 0.4582 l
0.6300 0.4703 l
0.6500 0.4703 l
0.6500 0.4702 l
0.6700 0.4702 l
0.6700 0.4708 l
0.6900 0.4708 l
0.6900 0.4725 l
0.7100 0.4725 l
0.7100 0.4663 l
0.7300 0.4663 l
0.7300 0.4737 l
0.7500 0.4737 l
0.7500 0.4720 l
0.7700 0.4720 l
0.7700 0.4662 l
0.7900 0.4662 l
0.7900 0.4613 l
0.8100 0.4613 l
0.8100 0.4581 l
0.8300 0.4581 l
0.8300 0.4719 l
0.8500 0.4719 l
0.8500 0.4624 l
0.8700 0.4624 l
0.8700 0.4588 l
0.8900 0.4588 l
0.8900 0.4161 l
0.9100 0.4161 l
0.9100 0.4638 l
0.9300 0.4638 l
0.9300 0.4233 l
0.9500 0.4233 l
0.9500 0.4634 l
0.9700 0.4634 l
0.9700 0.4138 l
0.9900 0.4138 l
0.9900 0.4174 l
1.0100 0.4174 l
1.0100 0.4095 l
1.0300 0.4095 l
1.0300 0.3707 l
1.0500 0.3707 l
1.0500 0.4126 l
1.0700 0.4126 l
1.0700 0.3923 l
1.0900 0.3923 l
1.0900 0.3946 l
1.1100 0.3946 l
1.1100 0.3777 l
1.1300 0.3777 l
1.1300 0.2852 l
1.1500 0.2852 l
1.1500 0.3416 l
1.1501 0.3416 l
s
n
0.1500 0.6216 m
0.1500 0.5786 l
0.1700 0.5786 l
0.1700 0.5530 l
0.1900 0.5530 l
0.1900 0.5997 l
0.2100 0.5997 l
0.2100 0.5545 l
0.2300 0.5545 l
0.2300 0.5674 l
0.2500 0.5674 l
0.2500 0.5614 l
0.2700 0.5614 l
0.2700 0.5689 l
0.2900 0.5689 l
0.2900 0.5698 l
0.3100 0.5698 l
0.3100 0.5543 l
0.3300 0.5543 l
0.3300 0.5549 l
0.3500 0.5549 l
0.3500 0.5320 l
0.3700 0.5320 l
0.3700 0.5746 l
0.3900 0.5746 l
0.3900 0.5482 l
0.4100 0.5482 l
0.4100 0.5321 l
0.4300 0.5321 l
0.4300 0.5569 l
0.4500 0.5569 l
0.4500 0.5420 l
0.4700 0.5420 l
0.4700 0.5383 l
0.4900 0.5383 l
0.4900 0.5352 l
0.5100 0.5352 l
0.5100 0.5294 l
0.5300 0.5294 l
0.5300 0.5444 l
0.5500 0.5444 l
0.5500 0.5212 l
0.5700 0.5212 l
0.5700 0.5652 l
0.5900 0.5652 l
0.5900 0.5475 l
0.6100 0.5475 l
0.6100 0.5341 l
0.6300 0.5341 l
0.6300 0.5189 l
0.6500 0.5189 l
0.6500 0.5226 l
0.6700 0.5226 l
0.6700 0.5277 l
0.6900 0.5277 l
0.6900 0.5182 l
0.7100 0.5182 l
0.7100 0.5253 l
0.7300 0.5253 l
0.7300 0.5225 l
0.7500 0.5225 l
0.7500 0.5258 l
0.7700 0.5258 l
0.7700 0.5238 l
0.7900 0.5238 l
0.7900 0.5328 l
0.8100 0.5328 l
0.8100 0.5554 l
0.8300 0.5554 l
0.8300 0.5228 l
0.8500 0.5228 l
0.8500 0.5213 l
0.8700 0.5213 l
0.8700 0.5268 l
0.8900 0.5268 l
0.8900 0.5739 l
0.9100 0.5739 l
0.9100 0.5557 l
0.9300 0.5557 l
0.9300 0.5668 l
0.9500 0.5668 l
0.9500 0.5353 l
0.9700 0.5353 l
0.9700 0.5453 l
0.9900 0.5453 l
0.9900 0.5764 l
1.0100 0.5764 l
1.0100 0.5734 l
1.0300 0.5734 l
1.0300 0.6177 l
1.0500 0.6177 l
1.0500 0.6712 l
1.0700 0.6712 l
1.0700 0.5725 l
1.0900 0.5725 l
1.0900 0.6644 l
1.1100 0.6644 l
1.1100 0.6592 l
1.1300 0.6592 l
1.1300 0.7869 l
1.1500 0.7869 l
1.1500 0.6259 l
1.1501 0.6259 l
s
[/DeviceRGB] SCS
Color1 SC
[] 0 SD
0.0015 SLW
n
0.1500 0.1500 m
1.1500 0.1500 l
s
n
0.1500 0.8500 m
1.1500 0.8500 l
s
[] 0 SD
0.0030 SLW
n
0.3500 0.1500 m
0.3500 0.1600 l
s
n
0.3500 0.8500 m
0.3500 0.8400 l
s
n
0.7500 0.1500 m
0.7500 0.1600 l
s
n
0.7500 0.8500 m
0.7500 0.8400 l
s
n
1.1500 0.1500 m
1.1500 0.1600 l
s
n
1.1500 0.8500 m
1.1500 0.8400 l
s
n
0.1500 0.1500 m
0.1500 0.1700 l
s
n
0.1500 0.8500 m
0.1500 0.8300 l
s
n
0.5500 0.1500 m
0.5500 0.1700 l
s
n
0.5500 0.8500 m
0.5500 0.8300 l
s
n
0.9500 0.1500 m
0.9500 0.1700 l
s
n
0.9500 0.8500 m
0.9500 0.8300 l
s
/Times-Roman findfont
dup length dict begin
 {1 index /FID ne {def} {pop pop} ifelse} forall
 /Encoding DefEncoding def
 currentdict
end
/Font0 exch definefont pop
/Font0 FFSF
0.1418 0.1169 m
GS
[0.0344 0.0000 0.0000 0.0344 0 0] CC
(0) show
GR
/Font0 FFSF
0.5418 0.1169 m
GS
[0.0344 0.0000 0.0000 0.0344 0 0] CC
(2) show
GR
/Font0 FFSF
0.9420 0.1169 m
GS
[0.0344 0.0000 0.0000 0.0344 0 0] CC
(4) show
GR
/Font0 FFSF
0.6053 0.0829 m
GS
[0.0344 0.0000 0.0000 0.0344 0 0] CC
(R\(t,tb\)) show
GR
[] 0 SD
0.0015 SLW
n
0.1500 0.1500 m
0.1500 0.8500 l
s
n
1.1500 0.1500 m
1.1500 0.8500 l
s
[] 0 SD
0.0023 SLW
n
0.1500 0.2375 m
0.1600 0.2375 l
s
n
1.1500 0.2375 m
1.1400 0.2375 l
s
n
0.1500 0.4125 m
0.1600 0.4125 l
s
n
1.1500 0.4125 m
1.1400 0.4125 l
s
n
0.1500 0.5875 m
0.1600 0.5875 l
s
n
1.1500 0.5875 m
1.1400 0.5875 l
s
n
0.1500 0.7625 m
0.1600 0.7625 l
s
n
1.1500 0.7625 m
1.1400 0.7625 l
s
n
0.1500 0.1500 m
0.1700 0.1500 l
s
n
1.1500 0.1500 m
1.1300 0.1500 l
s
n
0.1500 0.3250 m
0.1700 0.3250 l
s
n
1.1500 0.3250 m
1.1300 0.3250 l
s
n
0.1500 0.5000 m
0.1700 0.5000 l
s
n
1.1500 0.5000 m
1.1300 0.5000 l
s
n
0.1500 0.6750 m
0.1700 0.6750 l
s
n
1.1500 0.6750 m
1.1300 0.6750 l
s
n
0.1500 0.8500 m
0.1700 0.8500 l
s
n
1.1500 0.8500 m
1.1300 0.8500 l
s
/Font0 FFSF
0.1149 0.1384 m
GS
[0.0344 0.0000 0.0000 0.0344 0 0] CC
(-1) show
GR
/Font0 FFSF
0.1235 0.3136 m
GS
[0.0344 0.0000 0.0000 0.0344 0 0] CC
(0) show
GR
/Font0 FFSF
0.1263 0.4884 m
GS
[0.0344 0.0000 0.0000 0.0344 0 0] CC
(1) show
GR
/Font0 FFSF
0.1235 0.6634 m
GS
[0.0344 0.0000 0.0000 0.0344 0 0] CC
(2) show
GR
/Font0 FFSF
0.1251 0.8386 m
GS
[0.0344 0.0000 0.0000 0.0344 0 0] CC
(3) show
GR
/Font0 FFSF
0.0986 0.3745 m
GS
[0.0000 0.0344 -0.0344 0.0000 0 0] CC
(\(d) show
GR
/Symbol findfont
/Font12 exch definefont pop
/Font12 FFSF
0.0986 0.4031 m
GS
[0.0000 0.0344 -0.0344 0.0000 0 0] CC
(s) show
GR
/Font0 FFSF
0.0986 0.4239 m
GS
[0.0000 0.0344 -0.0344 0.0000 0 0] CC
(/dR\(t,tb\)\)/C.V.) show
GR
/Font0 FFSF
1.1892 0.5475 m
GS
[0.0000 0.0280 -0.0280 0.0000 0 0] CC
(LHC HIGGS XS WG 2011) show
GR
[] 0 SD
0.0030 SLW
n
0.1500 0.1500 m
0.1500 0.8500 l
1.1500 0.8500 l
1.1500 0.1500 l
0.1500 0.1500 l
c
s
n
0.7500 0.7975 m
0.7500 0.7204 l
1.0472 0.7204 l
1.0472 0.7975 l
c
[/DeviceRGB] SCS
Color0 SC
fill
[/DeviceRGB] SCS
Color1 SC
[] 0 SD
0.0015 SLW
n
0.7500 0.7975 m
0.7500 0.7204 l
1.0472 0.7204 l
1.0472 0.7975 l
0.7500 0.7975 l
c
s
/Font0 FFSF
0.8215 0.7644 m
GS
[0.0339 0.0000 0.0000 0.0339 0 0] CC
(error from scale) show
GR
[/DeviceRGB] SCS
Color2 SC
[] 0 SD
0.0030 SLW
n
0.7615 0.7757 m
0.8015 0.7757 l
s
/Font0 FFSF
[/DeviceRGB] SCS
Color1 SC
0.8215 0.7308 m
GS
[0.0339 0.0000 0.0000 0.0339 0 0] CC
(total error) show
GR
[/DeviceRGB] SCS
Color4 SC
n
0.7615 0.7422 m
0.8015 0.7422 l
s
/Font0 FFSF
[/DeviceRGB] SCS
Color1 SC
0.5049 0.2855 m
GS
[0.0353 0.0000 0.0000 0.0353 0 0] CC
(LHC with 7 TeV) show
GR
%%Trailer
%%BoundingBox: 44 45 730 529
%%DocumentNeededResources: font Times-Roman
%%+ font Symbol
%%EOF
