%!PS-Adobe-2.0 EPSF-2.0
%%BoundingBox:  0 0 567 362
%%Title: Results/m120/POWHEG.dyjjmaxpt-mstw2008.eps: VBF - HAWK
%%Creator: ROOT Version 5.28/00c
%%CreationDate: Fri Nov 25 16:23:12 2011
%%EndComments
%%BeginProlog
80 dict begin
/s {stroke} def /l {lineto} def /m {moveto} def /t {translate} def
/r {rotate} def /rl {roll}  def /R {repeat} def
/d {rlineto} def /rm {rmoveto} def /gr {grestore} def /f {eofill} def
/c {setrgbcolor} def /black {0 setgray} def /sd {setdash} def
/cl {closepath} def /sf {scalefont setfont} def /lw {setlinewidth} def
/box {m dup 0 exch d exch 0 d 0 exch neg d cl} def
/NC{systemdict begin initclip end}def/C{NC box clip newpath}def
/bl {box s} def /bf {box f} def /Y { 0 exch d} def /X { 0 d} def 
/K {{pop pop 0 moveto} exch kshow} bind def
/ita {/ang 15 def gsave [1 0 ang dup sin exch cos div 1 0 0] concat} def 
/mp {newpath /y exch def /x exch def} def
/side {[w .77 mul w .23 mul] .385 w mul sd w 0 l currentpoint t -144 r} def
/mr {mp x y w2 0 360 arc} def /m24 {mr s} def /m20 {mr f} def
/mb {mp x y w2 add m w2 neg 0 d 0 w neg d w 0 d 0 w d cl} def
/mt {mp x y w2 add m w2 neg w neg d w 0 d cl} def
/m21 {mb f} def /m25 {mb s} def /m22 {mt f} def /m26{mt s} def
/m23 {mp x y w2 sub m w2 w d w neg 0 d cl f} def
/m27 {mp x y w2 add m w3 neg w2 neg d w3 w2 neg d w3 w2 d cl s} def
/m28 {mp x w2 sub y w2 sub w3 add m w3 0 d  0 w3 neg d w3 0 d 0 w3 d w3 0 d  0 w3 d w3 neg 0 d 0 w3 d w3 neg 0 d 0 w3 neg d w3 neg 0 d cl s } def
/m29 {mp gsave x w2 sub y w2 add w3 sub m currentpoint t 4 {side} repeat cl fill gr} def
/m30 {mp gsave x w2 sub y w2 add w3 sub m currentpoint t 4 {side} repeat cl s gr} def
/m31 {mp x y w2 sub m 0 w d x w2 sub y m w 0 d x w2 sub y w2 add m w w neg d x w2 sub y w2 sub m w w d s} def
/m32 {mp x y w2 sub m w2 w d w neg 0 d cl s} def
/m33 {mp x y w2 add m w3 neg w2 neg d w3 w2 neg d w3 w2 d cl f} def
/m34 {mp x w2 sub y w2 sub w3 add m w3 0 d  0 w3 neg d w3 0 d 0 w3 d w3 0 d  0 w3 d w3 neg 0 d 0 w3 d w3 neg 0 d 0 w3 neg d w3 neg 0 d cl f } def
/m2 {mp x y w2 sub m 0 w d x w2 sub y m w 0 d s} def
/m5 {mp x w2 sub y w2 sub m w w d x w2 sub y w2 add m w w neg d s} def
/reEncode {exch findfont dup length dict begin {1 index /FID eq  {pop pop} {def} ifelse } forall /Encoding exch def currentdict end dup /FontName get exch definefont pop } def [/Times-Bold /Times-Italic /Times-BoldItalic /Helvetica /Helvetica-Oblique
 /Helvetica-Bold /Helvetica-BoldOblique /Courier /Courier-Oblique /Courier-Bold /Courier-BoldOblique /Times-Roman /AvantGarde-Book /AvantGarde-BookOblique /AvantGarde-Demi /AvantGarde-DemiOblique /Bookman-Demi /Bookman-DemiItalic /Bookman-Light
 /Bookman-LightItalic /Helvetica-Narrow /Helvetica-Narrow-Bold /Helvetica-Narrow-BoldOblique /Helvetica-Narrow-Oblique /NewCenturySchlbk-Roman /NewCenturySchlbk-Bold /NewCenturySchlbk-BoldItalic /NewCenturySchlbk-Italic /Palatino-Bold
 /Palatino-BoldItalic /Palatino-Italic /Palatino-Roman ] {ISOLatin1Encoding reEncode } forall%%EndProlog
%%BeginSetup
%%EndSetup
newpath  gsave  .25 .25 scale  gsave  0 0 t black[  ] 0 sd 3 lw 1 1 1 c 2268 1448 0 0 bf black 1 1 1 c 1814 1158 227 145 bf black 1814 1158 227 145 bl 1 1 1 c 1814 1158 227 145 bf black 1814 1158 227 145 bl 0.8 0 0 c[  12 12 ] 0 sd 6 lw 1 1 1 c black
 0.8 0 0 c 227 762 m 181 X 306 Y 182 X 151 Y 181 X -88 Y 181 X -253 Y 182 X -299 Y 181 X -237 Y 182 X -120 Y 181 X -60 Y 182 X -15 Y 181 X s black[  ] 0 sd 3 lw 227 145 m 1814 X s
 gsave  2268 1448 0 0 C 2027.28 40.4949 t 0 r /Helvetica findfont 60.7424 sf 0 0 m (|) show NC gr 
 gsave  2268 1448 0 0 C 1994.38 7.5928 t 0 r /Helvetica findfont 40.4949 sf 0 0 m (j2) show NC gr 
 gsave  2268 1448 0 0 C 1943.76 40.4949 t 0 r /Helvetica findfont 60.7424 sf 0 0 m (\255y) show NC gr 
 gsave  2268 1448 0 0 C 1915.92 7.5928 t 0 r /Helvetica findfont 40.4949 sf 0 0 m (j1) show NC gr 
 gsave  2268 1448 0 0 C 1867.83 40.4949 t 0 r /Helvetica findfont 60.7424 sf 0 0 m (|y) show NC gr  227 180 m -35 Y s 263 162 m -17 Y s 299 162 m -17 Y s 336 162 m -17 Y s 372 162 m -17 Y s 408 180 m -35 Y s 444 162 m -17 Y s 481 162 m -17 Y s 517
 162 m -17 Y s 553 162 m -17 Y s 590 180 m -35 Y s 626 162 m -17 Y s 662 162 m -17 Y s 698 162 m -17 Y s 735 162 m -17 Y s 771 180 m -35 Y s 807 162 m -17 Y s 844 162 m -17 Y s 880 162 m -17 Y s 916 162 m -17 Y s 952 180 m -35 Y s 989 162 m -17 Y s
 1025 162 m -17 Y s 1061 162 m -17 Y s 1098 162 m -17 Y s 1134 180 m -35 Y s 1170 162 m -17 Y s 1206 162 m -17 Y s 1243 162 m -17 Y s 1279 162 m -17 Y s 1315 180 m -35 Y s 1352 162 m -17 Y s 1388 162 m -17 Y s 1424 162 m -17 Y s 1460 162 m -17 Y s
 1497 180 m -35 Y s 1533 162 m -17 Y s 1569 162 m -17 Y s 1606 162 m -17 Y s 1642 162 m -17 Y s 1678 180 m -35 Y s 1714 162 m -17 Y s 1751 162 m -17 Y s 1787 162 m -17 Y s 1823 162 m -17 Y s 1860 180 m -35 Y s 1896 162 m -17 Y s 1932 162 m -17 Y s
 1968 162 m -17 Y s 2005 162 m -17 Y s 2041 180 m -35 Y s
 gsave  2268 1448 0 0 C 210.067 93.6445 t 0 r /Helvetica findfont 53.1496 sf 0 0 m (4) show NC gr 
 gsave  2268 1448 0 0 C 369.516 93.6445 t 0 r /Helvetica findfont 53.1496 sf 0 0 m (4.5) show NC gr 
 gsave  2268 1448 0 0 C 571.991 93.6445 t 0 r /Helvetica findfont 53.1496 sf 0 0 m (5) show NC gr 
 gsave  2268 1448 0 0 C 731.44 93.6445 t 0 r /Helvetica findfont 53.1496 sf 0 0 m (5.5) show NC gr 
 gsave  2268 1448 0 0 C 936.445 93.6445 t 0 r /Helvetica findfont 53.1496 sf 0 0 m (6) show NC gr 
 gsave  2268 1448 0 0 C 1095.89 93.6445 t 0 r /Helvetica findfont 53.1496 sf 0 0 m (6.5) show NC gr 
 gsave  2268 1448 0 0 C 1298.37 93.6445 t 0 r /Helvetica findfont 53.1496 sf 0 0 m (7) show NC gr 
 gsave  2268 1448 0 0 C 1457.82 93.6445 t 0 r /Helvetica findfont 53.1496 sf 0 0 m (7.5) show NC gr 
 gsave  2268 1448 0 0 C 1662.82 93.6445 t 0 r /Helvetica findfont 53.1496 sf 0 0 m (8) show NC gr 
 gsave  2268 1448 0 0 C 1819.74 93.6445 t 0 r /Helvetica findfont 53.1496 sf 0 0 m (8.5) show NC gr 
 gsave  2268 1448 0 0 C 2024.75 93.6445 t 0 r /Helvetica findfont 53.1496 sf 0 0 m (9) show NC gr  227 145 m 1158 Y s
 gsave  2268 1448 0 0 C 113.892 1189.54 t 90 r /Helvetica findfont 60.7424 sf 0 0 m (| [fb]) show NC gr 
 gsave  2268 1448 0 0 C 146.794 1156.64 t 90 r /Helvetica findfont 40.4949 sf 0 0 m (j2) show NC gr 
 gsave  2268 1448 0 0 C 113.892 1106.02 t 90 r /Helvetica findfont 60.7424 sf 0 0 m (\255y) show NC gr 
 gsave  2268 1448 0 0 C 146.794 1078.18 t 90 r /Helvetica findfont 40.4949 sf 0 0 m (j1) show NC gr 
 gsave  2268 1448 0 0 C 113.892 979.471 t 90 r /Helvetica findfont 60.7424 sf 0 0 m (/d|y) show NC gr 
 gsave  2268 1448 0 0 C 113.892 941.507 t 90 r /Symbol findfont 60.7424 sf 0 0 m (s) show NC gr 
 gsave  2268 1448 0 0 C 113.892 911.136 t 90 r /Helvetica findfont 60.7424 sf 0 0 m (d) show NC gr  281 145 m -54 X s 254 193 m -27 X s 254 241 m -27 X s 254 290 m -27 X s 281 338 m -54 X s 254 386 m -27 X s 254 434 m -27 X s 254 483 m -27 X s 281
 531 m -54 X s 254 579 m -27 X s 254 627 m -27 X s 254 676 m -27 X s 281 724 m -54 X s 254 772 m -27 X s 254 820 m -27 X s 254 869 m -27 X s 281 917 m -54 X s 254 965 m -27 X s 254 1013 m -27 X s 254 1062 m -27 X s 281 1110 m -54 X s 254 1158 m -27 X
 s 254 1206 m -27 X s 254 1255 m -27 X s 281 1303 m -54 X s
 gsave  2268 1448 0 0 C 187.289 126.547 t 0 r /Helvetica findfont 53.1496 sf 0 0 m (0) show NC gr 
 gsave  2268 1448 0 0 C 156.918 318.898 t 0 r /Helvetica findfont 53.1496 sf 0 0 m (20) show NC gr 
 gsave  2268 1448 0 0 C 156.918 511.249 t 0 r /Helvetica findfont 53.1496 sf 0 0 m (40) show NC gr 
 gsave  2268 1448 0 0 C 156.918 703.6 t 0 r /Helvetica findfont 53.1496 sf 0 0 m (60) show NC gr 
 gsave  2268 1448 0 0 C 156.918 898.481 t 0 r /Helvetica findfont 53.1496 sf 0 0 m (80) show NC gr 
 gsave  2268 1448 0 0 C 126.547 1090.83 t 0 r /Helvetica findfont 53.1496 sf 0 0 m (100) show NC gr 
 gsave  2268 1448 0 0 C 126.547 1283.18 t 0 r /Helvetica findfont 53.1496 sf 0 0 m (120) show NC gr  0.4 0.4 0.8 c 6 lw 1 1 1 c black 0.4 0.4 0.8 c 227 782 m 181 X 324 Y 182 X 163 Y 181 X -57 Y 181 X -264 Y 182 X -317 Y 181 X -248 Y 182 X -138 Y 181
 X -79 Y 182 X -17 Y 181 X s 0 0.8 0 c[ 20 12 4 12] 0 sd 1 1 1 c black 0 0.8 0 c 227 741 m 181 X 310 Y 182 X 165 Y 181 X -85 Y 181 X -254 Y 182 X -297 Y 181 X -235 Y 182 X -122 Y 181 X -59 Y 182 X -18 Y 181 X s black
 gsave  2268 1448 0 0 C 2095.61 827.615 t 90 r /Helvetica-BoldOblique findfont 40.4949 sf 0 0 m 
 447 428 405 383 371 340 302 290 263 236 225 198 166 135 124 94 83 54 25
(LHC HIGGS XS WG 2011) K NC gr 
 gsave  2268 1448 0 0 C 1546.4 1214.85 t 0 r /Helvetica findfont 43.0259 sf 0 0 m (POWHEG NLO) show NC gr  0.4 0.4 0.8 c[  ] 0 sd 1389 1231 m 131 X s black
 gsave  2268 1448 0 0 C 1546.4 1126.27 t 0 r /Helvetica findfont 43.0259 sf 0 0 m (POWHEG + PYTHIA) show NC gr  0.8 0 0 c[  12 12 ] 0 sd 1389 1144 m 131 X s black
 gsave  2268 1448 0 0 C 1546.4 1040.21 t 0 r /Helvetica findfont 43.0259 sf 0 0 m 
 383 372 332 302 273 243 231 206 194 161 132 102 62 28
(POWHEG + HERWIG) K NC gr  0 0.8 0 c[ 20 12 4 12] 0 sd 1389 1057 m 131 X s
 gr  gr showpage
end
%%EOF
