%!PS-Adobe-2.0 EPSF-2.0
%%BoundingBox:  0 0 567 407
%%Title: /Volumes/Dani'sHD/mac-Work/Documents/LaTex/BRNote/4fNumbers/YRHXS_BR_fig3.eps: Higgs Cross Section
%%Creator: ROOT Version 5.28/00c
%%CreationDate: Fri Nov 25 15:26:27 2011
%%EndComments
%%BeginProlog
80 dict begin
/s {stroke} def /l {lineto} def /m {moveto} def /t {translate} def
/r {rotate} def /rl {roll}  def /R {repeat} def
/d {rlineto} def /rm {rmoveto} def /gr {grestore} def /f {eofill} def
/c {setrgbcolor} def /black {0 setgray} def /sd {setdash} def
/cl {closepath} def /sf {scalefont setfont} def /lw {setlinewidth} def
/box {m dup 0 exch d exch 0 d 0 exch neg d cl} def
/NC{systemdict begin initclip end}def/C{NC box clip newpath}def
/bl {box s} def /bf {box f} def /Y { 0 exch d} def /X { 0 d} def 
/K {{pop pop 0 moveto} exch kshow} bind def
/ita {/ang 15 def gsave [1 0 ang dup sin exch cos div 1 0 0] concat} def 
/mp {newpath /y exch def /x exch def} def
/side {[w .77 mul w .23 mul] .385 w mul sd w 0 l currentpoint t -144 r} def
/mr {mp x y w2 0 360 arc} def /m24 {mr s} def /m20 {mr f} def
/mb {mp x y w2 add m w2 neg 0 d 0 w neg d w 0 d 0 w d cl} def
/mt {mp x y w2 add m w2 neg w neg d w 0 d cl} def
/m21 {mb f} def /m25 {mb s} def /m22 {mt f} def /m26{mt s} def
/m23 {mp x y w2 sub m w2 w d w neg 0 d cl f} def
/m27 {mp x y w2 add m w3 neg w2 neg d w3 w2 neg d w3 w2 d cl s} def
/m28 {mp x w2 sub y w2 sub w3 add m w3 0 d  0 w3 neg d w3 0 d 0 w3 d w3 0 d  0 w3 d w3 neg 0 d 0 w3 d w3 neg 0 d 0 w3 neg d w3 neg 0 d cl s } def
/m29 {mp gsave x w2 sub y w2 add w3 sub m currentpoint t 4 {side} repeat cl fill gr} def
/m30 {mp gsave x w2 sub y w2 add w3 sub m currentpoint t 4 {side} repeat cl s gr} def
/m31 {mp x y w2 sub m 0 w d x w2 sub y m w 0 d x w2 sub y w2 add m w w neg d x w2 sub y w2 sub m w w d s} def
/m32 {mp x y w2 sub m w2 w d w neg 0 d cl s} def
/m33 {mp x y w2 add m w3 neg w2 neg d w3 w2 neg d w3 w2 d cl f} def
/m34 {mp x w2 sub y w2 sub w3 add m w3 0 d  0 w3 neg d w3 0 d 0 w3 d w3 0 d  0 w3 d w3 neg 0 d 0 w3 d w3 neg 0 d 0 w3 neg d w3 neg 0 d cl f } def
/m2 {mp x y w2 sub m 0 w d x w2 sub y m w 0 d s} def
/m5 {mp x w2 sub y w2 sub m w w d x w2 sub y w2 add m w w neg d s} def
/reEncode {exch findfont dup length dict begin {1 index /FID eq  {pop pop} {def} ifelse } forall /Encoding exch def currentdict end dup /FontName get exch definefont pop } def [/Times-Bold /Times-Italic /Times-BoldItalic /Helvetica /Helvetica-Oblique
 /Helvetica-Bold /Helvetica-BoldOblique /Courier /Courier-Oblique /Courier-Bold /Courier-BoldOblique /Times-Roman /AvantGarde-Book /AvantGarde-BookOblique /AvantGarde-Demi /AvantGarde-DemiOblique /Bookman-Demi /Bookman-DemiItalic /Bookman-Light
 /Bookman-LightItalic /Helvetica-Narrow /Helvetica-Narrow-Bold /Helvetica-Narrow-BoldOblique /Helvetica-Narrow-Oblique /NewCenturySchlbk-Roman /NewCenturySchlbk-Bold /NewCenturySchlbk-BoldItalic /NewCenturySchlbk-Italic /Palatino-Bold
 /Palatino-BoldItalic /Palatino-Italic /Palatino-Roman ] {ISOLatin1Encoding reEncode } forall%%EndProlog
%%BeginSetup
%%EndSetup
newpath  gsave  .25 .25 scale  gsave  0 0 t black[  ] 0 sd 3 lw 1 1 1 c 2268 1630 0 0 bf black 1 1 1 c 1882 1385 272 196 bf black 1882 1385 272 196 bl 1 1 1 c 1882 1385 272 196 bf black 1882 1385 272 196 bl 272 196 m 1882 X s
 gsave  2268 1630 0 0 C 1940.09 59.8267 t 0 r /Helvetica findfont 76.92 sf 0 0 m ( [GeV]) show NC gr 
 gsave  2268 1630 0 0 C 1905.91 39.8845 t 0 r /Helvetica findfont 51.28 sf 0 0 m (H) show NC gr 
 gsave  2268 1630 0 0 C 1846.08 59.8267 t 0 r /Helvetica findfont 76.92 sf 0 0 m (M) show NC gr  354 236 m -40 Y s
 gsave  2268 1630 0 0 C 354.481 120.588 t 0 r  -63 0 t /Helvetica findfont 76.92 sf 0 0 m (100) show NC gr  896 216 m -20 Y s
 gsave  2268 1630 0 0 C 831.876 122.502 t 0 r /Helvetica findfont 76.92 sf 0 0 m (200) show NC gr  1213 216 m -20 Y s
 gsave  2268 1630 0 0 C 1148.1 122.502 t 0 r /Helvetica findfont 76.92 sf 0 0 m (300) show NC gr  1438 216 m -20 Y s
 gsave  2268 1630 0 0 C 1373.17 122.502 t 0 r /Helvetica findfont 76.92 sf 0 0 m (400) show NC gr  1613 216 m -20 Y s
 gsave  2268 1630 0 0 C 1549.8 122.502 t 0 r /Helvetica findfont 76.92 sf 0 0 m (500) show NC gr  1755 216 m -20 Y s 1876 216 m -20 Y s 1980 216 m -20 Y s 2072 216 m -20 Y s 2154 236 m -40 Y s
 gsave  2268 1630 0 0 C 2154.33 120.588 t 0 r  -84 0 t /Helvetica findfont 76.92 sf 0 0 m (1000) show NC gr  272 1581 m 1882 X s 354 1540 m 41 Y s 896 1560 m 21 Y s 1213 1560 m 21 Y s 1438 1560 m 21 Y s 1613 1560 m 21 Y s 1755 1560 m 21 Y s 1876 1560
 m 21 Y s 1980 1560 m 21 Y s 2072 1560 m 21 Y s 2154 1540 m 41 Y s 272 196 m 1385 Y s
 gsave  2268 1630 0 0 C 108.258 757.805 t 90 r /Helvetica findfont 76.92 sf 0 0 m 
 790 765 723 685 643 588 567 550 507 486 444 406 386 342 321 266 215 194 156 114 71 54
(Higgs BR + Total Uncert) K NC gr  330 196 m -58 X s
 gsave  2268 1630 0 0 C 205.12 196.573 t 0 r /Helvetica findfont 51.28 sf 0 0 m (\2553) show NC gr 
 gsave  2268 1630 0 0 C 122.502 159.538 t 0 r /Helvetica findfont 76.92 sf 0 0 m (10) show NC gr  301 331 m -29 X s 301 410 m -29 X s 301 466 m -29 X s 301 510 m -29 X s 301 546 m -29 X s 301 576 m -29 X s 301 602 m -29 X s 301 625 m -29 X s 330 645
 m -58 X s
 gsave  2268 1630 0 0 C 205.12 643.849 t 0 r /Helvetica findfont 51.28 sf 0 0 m (\2552) show NC gr 
 gsave  2268 1630 0 0 C 122.502 609.662 t 0 r /Helvetica findfont 76.92 sf 0 0 m (10) show NC gr  301 781 m -29 X s 301 860 m -29 X s 301 916 m -29 X s 301 960 m -29 X s 301 995 m -29 X s 301 1026 m -29 X s 301 1052 m -29 X s 301 1075 m -29 X s 330
 1095 m -58 X s
 gsave  2268 1630 0 0 C 213.667 1093.97 t 0 r /Helvetica findfont 51.28 sf 0 0 m (\2551) show NC gr 
 gsave  2268 1630 0 0 C 131.049 1059.79 t 0 r /Helvetica findfont 76.92 sf 0 0 m (10) show NC gr  301 1231 m -29 X s 301 1310 m -29 X s 301 1366 m -29 X s 301 1410 m -29 X s 301 1445 m -29 X s 301 1475 m -29 X s 301 1501 m -29 X s 301 1524 m -29 X s
 330 1545 m -58 X s
 gsave  2268 1630 0 0 C 251.717 1513.15 t 0 r  -42 0 t /Helvetica findfont 76.92 sf 0 0 m (1) show NC gr  2154 196 m 1385 Y s 2097 196 m 57 X s 2125 331 m 29 X s 2125 410 m 29 X s 2125 466 m 29 X s 2125 510 m 29 X s 2125 546 m 29 X s 2125 576 m 29 X
 s 2125 602 m 29 X s 2125 625 m 29 X s 2097 645 m 57 X s 2125 781 m 29 X s 2125 860 m 29 X s 2125 916 m 29 X s 2125 960 m 29 X s 2125 995 m 29 X s 2125 1026 m 29 X s 2125 1052 m 29 X s 2125 1075 m 29 X s 2097 1095 m 57 X s 2125 1231 m 29 X s 2125
 1310 m 29 X s 2125 1366 m 29 X s 2125 1410 m 29 X s 2125 1445 m 29 X s 2125 1475 m 29 X s 2125 1501 m 29 X s 2125 1524 m 29 X s 2097 1545 m 57 X s 454 196 m 3 11 d s 457 207 m 3 13 d 4 12 d 3 13 d 3 13 d 4 12 d 3 12 d 4 12 d 3 12 d 3 12 d 3 11 d 4
 11 d 3 12 d 3 10 d 3 11 d 4 10 d 3 11 d 3 10 d 3 10 d 3 9 d 4 10 d 3 9 d 3 9 d 3 9 d 3 9 d 3 8 d 3 9 d 3 8 d 3 8 d 3 7 d 4 8 d 3 7 d 3 8 d 3 7 d 3 7 d 3 6 d 2 7 d 3 6 d 3 6 d 3 6 d 3 6 d 3 5 d 3 6 d 3 5 d 3 5 d 3 5 d 3 5 d 2 4 d 3 5 d 3 4 d 3 4 d 3
 4 d 2 3 d 6 7 d 6 7 d 5 5 d 6 5 d 5 4 d 5 4 d 6 2 d 5 2 d 5 1 d 5 -1 d 6 -1 d 5 -3 d 5 -4 d 5 -6 d 5 -8 d 5 -12 d 5 -15 d 5 -21 d 5 -28 d 5 -36 d 10 -76 d 9 -38 d 10 -12 d 9 4 d 9 12 d 9 19 d 9 26 d 9 34 d 9 44 d 9 60 d 9 79 d 8 74 d 9 45 d 8 28 d 8
 18 d 8 12 d 8 9 d 8 7 d 8 6 d 8 4 d 8 4 d 8 3 d 7 3 d 8 2 d 7 2 d 8 2 d 7 1 d 7 2 d 8 1 d 7 1 d 7 1 d 7 1 d 7 X 7 1 d 7 1 d 6 X 7 1 d 7 1 d 6 X 7 1 d 13 X 6 1 d 6 X 7 1 d 12 X 6 1 d 12 X 6 1 d 12 X 6 1 d 17 X 6 1 d 17 X 5 1 d 17 X 13 1 d 13 X 13 1 d
 25 X 13 1 d 24 X 11 1 d 12 X 11 -1 d 12 -2 d 22 -7 d 21 -6 d 21 -5 d 20 -4 d 20 -3 d 19 -3 d 19 -2 d 19 -1 d 18 -1 d 17 -1 d 34 X 17 1 d 16 X 16 1 d 15 X 15 1 d 15 1 d 15 X 14 1 d 14 1 d 14 1 d 14 1 d 13 1 d 13 1 d 13 1 d 13 1 d 12 1 d 12 1 d 13 1 d
 12 X 11 1 d 12 1 d 11 1 d 12 1 d 11 1 d 11 X 10 1 d 11 1 d 10 1 d 11 X 10 1 d 10 1 d 10 1 d 10 X 10 1 d 9 X 10 1 d 9 1 d 9 X 9 1 d 9 X 9 1 d 9 X 9 1 d 9 X 8 1 d 9 X 8 1 d 8 X 8 1 d 9 X 8 1 d 15 X s 454 196 m 3 11 d s 457 207 m 3 13 d 4 12 d 3 13 d 3
 13 d 4 12 d 3 12 d 4 12 d 3 12 d 3 12 d 3 11 d 4 11 d 3 12 d 3 10 d 3 11 d 4 10 d 3 11 d 3 10 d 3 10 d 3 9 d 4 10 d 3 9 d 3 9 d 3 9 d 3 9 d 3 8 d 3 9 d 3 8 d 3 8 d 3 7 d 4 8 d 3 7 d 3 8 d 3 7 d 3 7 d 3 6 d 2 7 d 3 6 d 3 6 d 3 6 d 3 6 d 3 5 d 3 6 d 3
 5 d 3 5 d 3 5 d 3 5 d 2 4 d 3 5 d 3 4 d 3 4 d 3 4 d 2 3 d 6 7 d 6 7 d 5 5 d 6 5 d 5 4 d 5 4 d 6 2 d 5 2 d 5 1 d 5 -1 d 6 -1 d 5 -3 d 5 -4 d 5 -6 d 5 -8 d 4 -10 d 1 -2 d 4 -10 d 1 -5 d 3 -12 d 2 -9 d 3 -15 d 2 -13 d 5 -36 d 5 -40 d 2 -22 d 3 -14 d 3
 -15 d 2 -11 d 3 -9 d 1 -3 d 3 -6 d 3 -4 d 4 -2 d 4 X 5 4 d 5 5 d 4 7 d 5 10 d 4 9 d 5 14 d 4 12 d 5 16 d 4 18 d 4 18 d 4 19 d 1 7 d 4 22 d 3 25 d 2 13 d 3 22 d 6 57 d 5 50 d 2 17 d 1 7 d 3 18 d 3 15 d 3 12 d 3 13 d 5 15 d 5 11 d 3 7 d 6 9 d 2 3 d 8
 9 d 8 7 d 8 6 d 8 4 d 8 4 d 8 3 d 7 3 d 8 2 d 7 2 d 8 2 d 7 1 d 7 2 d 8 1 d 7 1 d 7 1 d 7 1 d 7 X 7 1 d 7 1 d 6 X 7 1 d 7 1 d 6 X 7 1 d 13 X 6 1 d 6 X 7 1 d 12 X 6 1 d 12 X 6 1 d 12 X 6 1 d 17 X 6 1 d 17 X 5 1 d 17 X 13 1 d 13 X 13 1 d 25 X 13 1 d
 24 X 11 1 d 12 X 11 -1 d 12 -2 d 22 -7 d 21 -6 d 21 -5 d 20 -4 d 20 -3 d 19 -3 d 19 -2 d 19 -1 d 18 -1 d 17 -1 d 34 X 17 1 d 16 X 16 1 d 15 X 15 1 d 15 1 d 15 X 14 1 d 14 1 d 14 1 d 14 1 d 13 1 d 13 1 d 13 1 d 13 1 d 12 1 d 12 1 d 13 1 d 12 X 11 1 d
 12 1 d 11 1 d 12 1 d 11 1 d 11 X 10 1 d 11 1 d 10 1 d 11 X 10 1 d 10 1 d 10 1 d 10 X 10 1 d 9 X 10 1 d 9 1 d 9 X 9 1 d 9 X 9 1 d 9 X 9 1 d 9 X 8 1 d 9 X 8 1 d 8 X 8 1 d 9 X 8 1 d 15 X s 0.4 0.4 0.4 c black 0.4 0.4 0.4 c 453 196 m 2 Y 4 13 d 3 13 d 4
 13 d 3 13 d 3 12 d 4 13 d 3 12 d 4 12 d 3 12 d 3 11 d 3 12 d 4 11 d 3 11 d 3 11 d 3 10 d 4 11 d 3 10 d 3 10 d 3 10 d 3 9 d 4 10 d 3 9 d 3 9 d 3 9 d 3 9 d 3 8 d 3 8 d 3 8 d 3 8 d 3 8 d 4 8 d 3 7 d 3 7 d 3 7 d 3 7 d 3 6 d 2 7 d 3 6 d 3 6 d 3 6 d 3 6 d
 3 5 d 3 6 d 3 5 d 3 4 d 3 5 d 3 5 d 2 4 d 3 4 d 3 4 d 3 4 d 3 4 d 2 3 d 6 7 d 6 7 d 5 5 d 6 5 d 5 4 d 5 3 d 6 3 d 5 1 d 5 1 d 5 X 6 -2 d 5 -2 d 5 -5 d 5 -6 d 5 -8 d 5 -12 d 5 -15 d 5 -21 d 5 -28 d 5 -36 d 10 -76 d 9 -38 d 10 -11 d 9 3 d 9 12 d 9 19
 d 9 26 d 9 34 d 9 44 d 9 60 d 9 79 d 8 74 d 9 45 d 8 28 d 8 18 d 8 12 d 8 9 d 8 7 d 8 6 d 8 4 d 8 4 d 8 3 d 7 3 d 8 2 d 7 2 d 8 2 d 7 1 d 7 2 d 8 1 d 7 1 d 7 1 d 7 1 d 7 X 7 1 d 7 1 d 6 X 7 1 d 7 1 d 6 X 7 1 d 13 X 6 1 d 6 X 7 1 d 12 X 6 1 d 12 X 6
 1 d 12 X 6 1 d 17 X 6 1 d 17 X 5 1 d 17 X 13 1 d 13 X 13 1 d 25 X 13 1 d 24 X 11 1 d 23 X 12 -2 d 22 -6 d 21 -6 d 21 -4 d 20 -4 d 20 -3 d 19 -2 d 19 -2 d 19 -1 d 18 X 17 -1 d 51 X 16 1 d 16 X 15 1 d 15 X 15 1 d 15 1 d 14 1 d 14 1 d 14 1 d 14 1 d 13
 X 13 1 d 13 1 d 13 1 d 12 1 d 12 1 d 13 1 d 12 1 d 11 1 d 12 1 d 11 1 d 12 X 11 1 d 11 1 d 10 1 d 11 X 10 1 d 11 1 d 10 1 d 10 X 10 1 d 10 1 d 10 X 9 1 d 10 1 d 9 X 9 1 d 9 1 d 9 X 9 1 d 9 X 9 1 d 9 X 8 1 d 9 X 8 1 d 8 X 8 1 d 9 X 8 1 d 7 X 8 1 d -8
 Y -8 -1 d -7 X -8 -1 d -17 X -8 -1 d -8 X -9 -1 d -8 X -9 -1 d -9 X -9 -1 d -9 X -9 -1 d -9 X -9 -1 d -9 X -10 -1 d -9 X -10 -1 d -10 -1 d -10 X -10 -1 d -10 -1 d -11 X -10 -1 d -11 -1 d -10 -1 d -11 X -11 -1 d -12 -1 d -11 -1 d -12 -1 d -11 -1 d
 -12 X -13 -1 d -12 -1 d -12 -1 d -13 -1 d -13 -1 d -13 -1 d -13 -1 d -14 -1 d -14 -1 d -14 -1 d -14 -1 d -15 X -15 -1 d -15 -1 d -15 -1 d -16 -1 d -84 X -18 1 d -19 2 d -19 2 d -19 2 d -20 4 d -20 4 d -21 6 d -21 7 d -22 7 d -12 2 d -11 1 d -12 X
 -11 -1 d -24 X -13 -1 d -25 X -13 -1 d -13 X -13 -1 d -17 X -5 -1 d -17 X -6 -1 d -17 X -6 -1 d -12 X -6 -1 d -12 X -6 -1 d -12 X -7 -1 d -6 X -6 -1 d -13 X -7 -1 d -6 X -7 -1 d -7 -1 d -6 X -7 -1 d -7 -1 d -7 X -7 -1 d -7 -1 d -7 -1 d -8 -1 d -7 -2
 d -7 -1 d -8 -2 d -7 -2 d -8 -2 d -7 -3 d -8 -3 d -8 -4 d -8 -4 d -8 -6 d -8 -7 d -8 -9 d -8 -12 d -8 -18 d -8 -28 d -9 -45 d -8 -74 d -9 -79 d -9 -60 d -9 -44 d -9 -34 d -9 -26 d -9 -19 d -9 -12 d -9 -4 d -10 12 d -9 38 d -10 76 d -5 36 d -5 28 d
 -5 21 d -5 15 d -5 11 d -5 9 d -5 6 d -5 4 d -5 3 d -6 1 d -5 X -5 -1 d -5 -1 d -6 -3 d -5 -4 d -5 -4 d -6 -5 d -5 -5 d -6 -7 d -6 -6 d -2 -4 d -3 -4 d -3 -5 d -3 -4 d -3 -5 d -2 -4 d -3 -5 d -3 -5 d -3 -6 d -3 -5 d -3 -6 d -3 -5 d -3 -6 d -3 -6 d
 -3 -6 d -3 -7 d -2 -6 d -3 -7 d -3 -7 d -3 -7 d -3 -7 d -3 -7 d -4 -8 d -3 -8 d -3 -8 d -3 -8 d -3 -8 d -3 -9 d -3 -9 d -3 -9 d -3 -9 d -3 -9 d -4 -10 d -3 -9 d -3 -10 d -3 -10 d -3 -11 d -4 -10 d -3 -11 d -3 -11 d -3 -11 d -4 -11 d -3 -12 d -3 -11
 d -3 -12 d -4 -12 d -3 -12 d -4 -13 d -3 -13 d -3 -12 d -4 -13 d -3 -13 d -2 -6 d f black 454 196 m 3 11 d s 457 207 m 3 13 d 4 12 d 3 13 d 3 13 d 4 12 d 3 12 d 4 12 d 3 12 d 3 12 d 3 11 d 4 11 d 3 12 d 3 10 d 3 11 d 4 10 d 3 11 d 3 10 d 3 10 d 3 9
 d 4 10 d 3 9 d 3 9 d 3 9 d 3 9 d 3 8 d 3 9 d 3 8 d 3 8 d 3 7 d 4 8 d 3 7 d 3 8 d 3 7 d 3 7 d 3 6 d 2 7 d 3 6 d 3 6 d 3 6 d 3 6 d 3 5 d 3 6 d 3 5 d 3 5 d 3 5 d 3 5 d 2 4 d 3 5 d 3 4 d 3 4 d 3 4 d 2 3 d 6 7 d 6 7 d 5 5 d 6 5 d 5 4 d 5 4 d 6 2 d 5 2 d
 5 1 d 5 -1 d 6 -1 d 5 -3 d 5 -4 d 5 -6 d 5 -8 d 5 -12 d 5 -15 d 5 -21 d 5 -28 d 5 -36 d 10 -76 d 9 -38 d 10 -12 d 9 4 d 9 12 d 9 19 d 9 26 d 9 34 d 9 44 d 9 60 d 9 79 d 8 74 d 9 45 d 8 28 d 8 18 d 8 12 d 8 9 d 8 7 d 8 6 d 8 4 d 8 4 d 8 3 d 7 3 d 8 2
 d 7 2 d 8 2 d 7 1 d 7 2 d 8 1 d 7 1 d 7 1 d 7 1 d 7 X 7 1 d 7 1 d 6 X 7 1 d 7 1 d 6 X 7 1 d 13 X 6 1 d 6 X 7 1 d 12 X 6 1 d 12 X 6 1 d 12 X 6 1 d 17 X 6 1 d 17 X 5 1 d 17 X 13 1 d 13 X 13 1 d 25 X 13 1 d 24 X 11 1 d 12 X 11 -1 d 12 -2 d 22 -7 d 21
 -6 d 21 -5 d 20 -4 d 20 -3 d 19 -3 d 19 -2 d 19 -1 d 18 -1 d 17 -1 d 34 X 17 1 d 16 X 16 1 d 15 X 15 1 d 15 1 d 15 X 14 1 d 14 1 d 14 1 d 14 1 d 13 1 d 13 1 d 13 1 d 13 1 d 12 1 d 12 1 d 13 1 d 12 X 11 1 d 12 1 d 11 1 d 12 1 d 11 1 d 11 X 10 1 d 11
 1 d 10 1 d 11 X 10 1 d 10 1 d 10 1 d 10 X 10 1 d 9 X 10 1 d 9 1 d 9 X 9 1 d 9 X 9 1 d 9 X 9 1 d 9 X 8 1 d 9 X 8 1 d 8 X 8 1 d 9 X 8 1 d 15 X s 475 196 m 2 7 d s 477 203 m 4 12 d 3 12 d 3 12 d 3 11 d 4 11 d 3 11 d 3 11 d 3 11 d 4 10 d 3 11 d 3 10 d 3
 10 d 3 9 d 4 10 d 3 9 d 3 9 d 3 9 d 3 9 d 3 8 d 3 8 d 3 9 d 3 8 d 3 7 d 4 8 d 3 7 d 3 7 d 3 7 d 3 7 d 3 7 d 2 6 d 3 7 d 3 6 d 3 6 d 3 6 d 3 5 d 3 6 d 3 5 d 3 5 d 3 5 d 3 4 d 2 5 d 3 4 d 3 5 d 3 4 d 3 4 d 2 3 d 6 7 d 6 6 d 5 6 d 6 5 d 5 4 d 5 3 d 6 3
 d 5 2 d 10 X 6 -1 d 5 -3 d 5 -4 d 5 -6 d 5 -9 d 5 -11 d 5 -15 d 5 -21 d 5 -28 d 5 -36 d 10 -76 d 9 -39 d 10 -11 d 9 4 d 9 12 d 9 19 d 9 26 d 9 34 d 9 44 d 9 60 d 9 78 d 8 74 d 9 46 d 8 28 d 8 17 d 8 13 d 8 9 d 8 7 d 8 6 d 8 4 d 8 4 d 8 3 d 7 3 d 8 2
 d 7 2 d 8 2 d 7 1 d 7 1 d 8 2 d 7 1 d 7 1 d 7 X 7 1 d 7 1 d 7 1 d 6 X 7 1 d 7 X 6 1 d 7 X 6 1 d 7 X 6 1 d 13 X 6 1 d 6 X 6 1 d 18 X 6 1 d 12 X 6 1 d 17 X 6 1 d 16 X 6 1 d 24 X 13 1 d 13 X 13 1 d 25 X 12 1 d 23 X 12 1 d 11 -1 d 12 -2 d 22 -7 d 21 -6
 d 21 -5 d 20 -4 d 20 -4 d 19 -2 d 19 -2 d 19 -1 d 18 -1 d 17 -1 d 51 X 16 1 d 16 X 15 1 d 15 1 d 15 X 15 1 d 14 1 d 14 1 d 14 1 d 14 1 d 13 1 d 13 1 d 13 1 d 13 1 d 12 1 d 12 X 13 1 d 12 1 d 11 1 d 12 1 d 11 1 d 12 1 d 11 X 11 1 d 10 1 d 11 1 d 10 X
 11 1 d 10 1 d 10 1 d 10 X 10 1 d 10 1 d 9 X 10 1 d 9 X 9 1 d 9 1 d 9 X 9 1 d 9 X 9 1 d 9 X 8 1 d 9 X 8 1 d 8 X 8 1 d 17 X 7 1 d 8 X s 1 0 0 c black 1 0 0 c 474 196 m 3 11 d 4 12 d 3 12 d 3 12 d 3 11 d 4 12 d 3 11 d 3 10 d 3 11 d 4 10 d 3 11 d 3 10 d
 3 10 d 3 9 d 4 10 d 3 9 d 3 9 d 3 9 d 3 8 d 3 9 d 3 8 d 3 8 d 3 8 d 3 8 d 4 7 d 3 8 d 3 7 d 3 7 d 3 7 d 3 6 d 2 7 d 3 6 d 3 6 d 3 6 d 3 5 d 3 6 d 3 5 d 3 5 d 3 5 d 3 5 d 3 5 d 2 4 d 3 4 d 3 4 d 3 4 d 3 4 d 2 3 d 6 7 d 6 6 d 5 6 d 6 5 d 5 4 d 5 3 d 6
 3 d 5 1 d 5 1 d 5 X 6 -2 d 5 -2 d 5 -5 d 5 -6 d 5 -8 d 5 -12 d 5 -15 d 5 -21 d 5 -28 d 5 -36 d 10 -76 d 9 -38 d 10 -12 d 9 4 d 9 12 d 9 19 d 9 26 d 9 34 d 9 44 d 9 60 d 9 78 d 8 74 d 9 46 d 8 28 d 8 17 d 8 13 d 8 9 d 8 7 d 8 6 d 8 4 d 8 4 d 8 3 d 7
 3 d 8 2 d 7 2 d 8 2 d 7 1 d 7 1 d 8 2 d 7 1 d 7 1 d 7 X 7 1 d 7 1 d 7 1 d 6 X 7 1 d 7 X 6 1 d 7 X 6 1 d 7 X 6 1 d 13 X 6 1 d 6 X 6 1 d 18 X 6 1 d 12 X 6 1 d 17 X 6 1 d 16 X 6 1 d 24 X 13 1 d 13 X 13 1 d 12 X 13 1 d 35 X 12 1 d 11 -1 d 12 -2 d 22 -5
 d 21 -6 d 21 -4 d 20 -4 d 20 -3 d 19 -2 d 19 -2 d 19 -1 d 18 -1 d 68 X 16 1 d 31 X 15 1 d 15 1 d 15 1 d 14 1 d 14 1 d 14 X 14 1 d 13 1 d 13 1 d 13 1 d 13 1 d 12 1 d 12 1 d 13 1 d 12 1 d 11 1 d 12 X 11 1 d 12 1 d 11 1 d 11 1 d 10 1 d 11 X 10 1 d 11 1
 d 10 1 d 10 X 10 1 d 10 1 d 10 X 9 1 d 10 1 d 9 X 9 1 d 9 X 9 1 d 9 1 d 9 X 9 1 d 9 X 8 1 d 9 X 8 1 d 8 X 8 1 d 9 X 8 1 d 15 X -8 Y -15 X -8 -1 d -9 X -8 -1 d -16 X -9 -1 d -8 X -9 -1 d -9 X -9 -1 d -9 X -9 -1 d -9 X -9 -1 d -9 X -10 -1 d -9 -1 d
 -10 X -10 -1 d -10 X -10 -1 d -10 -1 d -11 X -10 -1 d -11 -1 d -10 -1 d -11 -1 d -11 X -12 -1 d -11 -1 d -12 -1 d -11 -1 d -12 -1 d -13 -1 d -12 -1 d -12 X -13 -1 d -13 -1 d -13 -1 d -13 -1 d -14 -1 d -14 -1 d -14 -1 d -14 -1 d -15 -1 d -15 X -15 -1
 d -15 -1 d -16 -1 d -33 X -17 -1 d -17 1 d -17 X -18 1 d -19 2 d -19 2 d -19 2 d -20 4 d -20 4 d -21 6 d -21 7 d -22 7 d -12 2 d -46 X -12 -1 d -25 X -13 -1 d -13 X -13 -1 d -24 X -6 -1 d -16 X -6 -1 d -17 X -6 -1 d -12 X -6 -1 d -18 X -6 -1 d -6 X
 -6 -1 d -13 X -6 -1 d -7 X -6 -1 d -7 X -6 -1 d -7 X -7 -1 d -6 X -7 -1 d -7 -1 d -7 -1 d -7 X -7 -1 d -7 -1 d -8 -2 d -7 -1 d -7 -1 d -8 -2 d -7 -2 d -8 -2 d -7 -3 d -8 -3 d -8 -4 d -8 -4 d -8 -6 d -8 -7 d -8 -9 d -8 -13 d -8 -17 d -8 -28 d -9 -46
 d -8 -74 d -9 -78 d -9 -60 d -9 -44 d -9 -34 d -9 -26 d -9 -19 d -9 -13 d -9 -3 d -10 11 d -9 39 d -10 75 d -5 37 d -5 28 d -5 20 d -5 16 d -5 11 d -5 8 d -5 6 d -5 5 d -5 2 d -6 2 d -5 X -5 -1 d -5 -2 d -6 -2 d -5 -4 d -5 -4 d -6 -5 d -5 -5 d -6 -7
 d -6 -7 d -2 -4 d -3 -4 d -3 -4 d -3 -4 d -3 -5 d -2 -5 d -3 -5 d -3 -5 d -3 -5 d -3 -5 d -3 -6 d -3 -5 d -3 -6 d -3 -6 d -3 -6 d -3 -7 d -2 -6 d -3 -7 d -3 -7 d -3 -7 d -3 -7 d -3 -8 d -4 -7 d -3 -8 d -3 -8 d -3 -8 d -3 -9 d -3 -8 d -3 -9 d -3 -9 d
 -3 -9 d -3 -9 d -4 -10 d -3 -10 d -3 -10 d -3 -10 d -3 -10 d -4 -10 d -3 -11 d -3 -11 d -3 -11 d -4 -11 d -3 -12 d -3 -12 d -3 -11 d -4 -13 d -1 -2 d f black 475 196 m 2 7 d s 477 203 m 4 12 d 3 12 d 3 12 d 3 11 d 4 11 d 3 11 d 3 11 d 3 11 d 4 10 d
 3 11 d 3 10 d 3 10 d 3 9 d 4 10 d 3 9 d 3 9 d 3 9 d 3 9 d 3 8 d 3 8 d 3 9 d 3 8 d 3 7 d 4 8 d 3 7 d 3 7 d 3 7 d 3 7 d 3 7 d 2 6 d 3 7 d 3 6 d 3 6 d 3 6 d 3 5 d 3 6 d 3 5 d 3 5 d 3 5 d 3 4 d 2 5 d 3 4 d 3 5 d 3 4 d 3 4 d 2 3 d 6 7 d 6 6 d 5 6 d 6 5 d
 5 4 d 5 3 d 6 3 d 5 2 d 10 X 6 -1 d 5 -3 d 5 -4 d 5 -6 d 5 -9 d 5 -11 d 5 -15 d 5 -21 d 5 -28 d 5 -36 d 10 -76 d 9 -39 d 10 -11 d 9 4 d 9 12 d 9 19 d 9 26 d 9 34 d 9 44 d 9 60 d 9 78 d 8 74 d 9 46 d 8 28 d 8 17 d 8 13 d 8 9 d 8 7 d 8 6 d 8 4 d 8 4 d
 8 3 d 7 3 d 8 2 d 7 2 d 8 2 d 7 1 d 7 1 d 8 2 d 7 1 d 7 1 d 7 X 7 1 d 7 1 d 7 1 d 6 X 7 1 d 7 X 6 1 d 7 X 6 1 d 7 X 6 1 d 13 X 6 1 d 6 X 6 1 d 18 X 6 1 d 12 X 6 1 d 17 X 6 1 d 16 X 6 1 d 24 X 13 1 d 13 X 13 1 d 25 X 12 1 d 23 X 12 1 d 11 -1 d 12 -2
 d 22 -7 d 21 -6 d 21 -5 d 20 -4 d 20 -4 d 19 -2 d 19 -2 d 19 -1 d 18 -1 d 17 -1 d 51 X 16 1 d 16 X 15 1 d 15 1 d 15 X 15 1 d 14 1 d 14 1 d 14 1 d 14 1 d 13 1 d 13 1 d 13 1 d 13 1 d 12 1 d 12 X 13 1 d 12 1 d 11 1 d 12 1 d 11 1 d 12 1 d 11 X 11 1 d 10
 1 d 11 1 d 10 X 11 1 d 10 1 d 10 1 d 10 X 10 1 d 10 1 d 9 X 10 1 d 9 X 9 1 d 9 1 d 9 X 9 1 d 9 X 9 1 d 9 X 8 1 d 9 X 8 1 d 8 X 8 1 d 17 X 7 1 d 8 X s 419 196 m 10 37 d s 429 233 m 4 14 d 3 14 d 4 14 d 3 13 d 4 14 d 3 13 d 3 14 d 4 13 d 3 13 d 4 13 d
 3 12 d 3 13 d 4 12 d 3 12 d 4 12 d 3 12 d 3 12 d 3 11 d 4 12 d 3 11 d 3 10 d 3 11 d 4 10 d 3 11 d 3 10 d 3 10 d 3 9 d 4 10 d 3 9 d 3 9 d 3 9 d 3 9 d 3 8 d 3 9 d 3 8 d 3 8 d 3 7 d 4 8 d 3 7 d 3 7 d 3 7 d 3 7 d 3 7 d 2 6 d 3 7 d 3 6 d 3 6 d 3 5 d 3 6
 d 3 5 d 3 6 d 3 5 d 3 4 d 3 5 d 2 5 d 3 4 d 3 4 d 3 4 d 3 4 d 2 4 d 6 7 d 6 6 d 5 6 d 6 4 d 5 5 d 5 3 d 6 3 d 5 1 d 5 1 d 5 X 6 -2 d 5 -2 d 5 -5 d 5 -6 d 5 -8 d 5 -12 d 5 -15 d 5 -21 d 5 -28 d 5 -36 d 10 -75 d 9 -39 d 10 -11 d 9 3 d 9 13 d 9 19 d 9
 26 d 9 34 d 9 44 d 9 60 d 9 78 d 8 74 d 9 46 d 8 27 d 8 18 d 8 13 d 8 9 d 8 7 d 8 6 d 8 4 d 8 4 d 8 3 d 7 2 d 8 3 d 7 2 d 8 1 d 7 2 d 7 1 d 8 1 d 7 1 d 7 1 d 7 1 d 7 1 d 7 1 d 7 X 6 1 d 7 1 d 7 X 6 1 d 7 X 6 1 d 7 X 6 1 d 13 X 6 1 d 12 X 6 1 d 12 X
 6 1 d 18 X 6 1 d 17 X 5 1 d 17 X 5 1 d 19 X 13 1 d 13 X 13 1 d 25 X 12 1 d 46 X 12 -2 d 22 -7 d 21 -6 d 21 -5 d 20 -5 d 20 -3 d 19 -2 d 19 -2 d 19 -2 d 18 X 17 -1 d 67 X 16 1 d 15 1 d 15 X 15 1 d 15 1 d 14 1 d 14 1 d 14 1 d 14 1 d 13 X 13 1 d 13 1 d
 13 1 d 12 1 d 12 1 d 13 1 d 12 1 d 11 1 d 12 1 d 11 X 12 1 d 11 1 d 11 1 d 10 1 d 11 X 10 1 d 11 1 d 10 X 10 1 d 10 1 d 10 X 10 1 d 9 1 d 10 X 9 1 d 9 1 d 9 X 9 1 d 9 X 9 1 d 9 X 9 1 d 8 X 9 1 d 8 X 8 1 d 17 X 8 1 d 7 X 8 1 d s 0 0 0.6 c black 0 0
 0.6 c 418 196 m 11 42 d 4 14 d 3 14 d 4 13 d 3 14 d 4 14 d 3 13 d 3 13 d 4 13 d 3 13 d 4 13 d 3 13 d 3 12 d 4 13 d 3 12 d 4 12 d 3 12 d 3 11 d 3 12 d 4 11 d 3 11 d 3 11 d 3 10 d 4 11 d 3 10 d 3 10 d 3 10 d 3 9 d 4 10 d 3 9 d 3 9 d 3 9 d 3 9 d 3 8 d
 3 8 d 3 8 d 3 8 d 3 8 d 4 7 d 3 8 d 3 7 d 3 7 d 3 6 d 3 7 d 2 6 d 3 7 d 3 6 d 3 6 d 3 5 d 3 6 d 3 5 d 3 5 d 3 5 d 3 5 d 3 4 d 2 5 d 3 4 d 3 4 d 3 4 d 3 3 d 2 4 d 6 7 d 6 6 d 5 5 d 6 5 d 5 4 d 5 4 d 6 2 d 5 2 d 10 X 6 -1 d 5 -3 d 5 -4 d 5 -6 d 5 -9 d
 5 -11 d 5 -16 d 5 -20 d 5 -28 d 5 -37 d 10 -75 d 9 -39 d 10 -11 d 9 3 d 9 13 d 9 19 d 9 26 d 9 34 d 9 44 d 9 60 d 9 78 d 8 74 d 9 46 d 8 27 d 8 18 d 8 13 d 8 9 d 8 7 d 8 6 d 8 4 d 8 4 d 8 3 d 7 3 d 8 2 d 7 2 d 8 1 d 7 2 d 7 1 d 8 1 d 7 1 d 7 1 d 7 1
 d 7 1 d 7 1 d 7 X 6 1 d 7 1 d 7 X 6 1 d 7 X 6 1 d 7 X 6 1 d 13 X 6 1 d 12 X 6 1 d 12 X 6 1 d 18 X 6 1 d 17 X 5 1 d 17 X 5 1 d 19 X 13 1 d 13 X 13 1 d 25 X 12 1 d 46 X 12 -2 d 22 -6 d 21 -5 d 21 -5 d 20 -3 d 20 -3 d 19 -2 d 19 -2 d 19 -1 d 18 -1 d
 100 X 15 1 d 15 1 d 15 1 d 15 X 14 1 d 14 1 d 14 1 d 14 1 d 13 1 d 13 1 d 13 1 d 13 1 d 12 1 d 12 1 d 13 X 12 1 d 11 1 d 12 1 d 11 1 d 12 1 d 11 1 d 11 X 10 1 d 11 1 d 10 1 d 11 X 10 1 d 10 1 d 10 X 10 1 d 10 1 d 9 X 10 1 d 9 1 d 9 X 9 1 d 9 X 9 1 d
 9 1 d 9 X 9 1 d 8 X 9 1 d 8 X 8 1 d 8 X 9 1 d 15 X 8 1 d -8 Y -8 -1 d -15 X -9 -1 d -8 X -8 -1 d -17 X -8 -1 d -9 X -9 -1 d -9 X -9 -1 d -9 X -9 -1 d -9 X -9 -1 d -10 X -9 -1 d -10 -1 d -10 X -10 -1 d -10 X -10 -1 d -11 -1 d -10 -1 d -11 X -10 -1 d
 -11 -1 d -11 -1 d -12 -1 d -11 X -12 -1 d -11 -1 d -12 -1 d -13 -1 d -12 -1 d -12 -1 d -13 -1 d -13 -1 d -13 -1 d -13 -1 d -14 X -14 -1 d -14 -1 d -14 -1 d -15 -1 d -15 -1 d -15 X -15 -1 d -16 -1 d -16 -1 d -51 X -17 1 d -18 1 d -19 1 d -19 2 d -19
 3 d -20 4 d -20 4 d -21 6 d -21 6 d -22 8 d -12 2 d -46 X -12 -1 d -25 X -13 -1 d -13 X -13 -1 d -19 X -5 -1 d -17 X -5 -1 d -17 X -6 -1 d -18 X -6 -1 d -12 X -6 -1 d -12 X -6 -1 d -13 X -6 -1 d -7 X -6 -1 d -7 X -6 -1 d -7 X -7 -1 d -6 -1 d -7 X -7
 -1 d -7 -1 d -7 -1 d -7 -1 d -7 -1 d -8 -1 d -7 -1 d -7 -2 d -8 -1 d -7 -2 d -8 -3 d -7 -2 d -8 -3 d -8 -4 d -8 -4 d -8 -6 d -8 -7 d -8 -9 d -8 -13 d -8 -18 d -8 -27 d -9 -46 d -8 -74 d -9 -78 d -9 -60 d -9 -44 d -9 -34 d -9 -26 d -9 -19 d -9 -13 d
 -9 -3 d -10 11 d -9 39 d -10 75 d -5 36 d -5 28 d -5 21 d -5 15 d -5 11 d -5 9 d -5 6 d -5 4 d -5 3 d -6 1 d -10 X -5 -2 d -6 -3 d -5 -3 d -5 -4 d -6 -5 d -5 -6 d -6 -6 d -6 -7 d -2 -4 d -3 -4 d -3 -4 d -3 -5 d -3 -4 d -2 -5 d -3 -5 d -3 -5 d -3 -5
 d -3 -6 d -3 -5 d -3 -6 d -3 -5 d -3 -6 d -3 -7 d -3 -6 d -2 -6 d -3 -7 d -3 -7 d -3 -7 d -3 -7 d -3 -8 d -4 -7 d -3 -8 d -3 -8 d -3 -8 d -3 -9 d -3 -8 d -3 -9 d -3 -9 d -3 -9 d -3 -9 d -4 -10 d -3 -9 d -3 -10 d -3 -10 d -3 -11 d -4 -10 d -3 -11 d
 -3 -11 d -3 -11 d -4 -11 d -3 -12 d -3 -11 d -3 -12 d -4 -12 d -3 -12 d -4 -13 d -3 -12 d -3 -13 d -4 -13 d -3 -13 d -4 -13 d -3 -13 d -3 -14 d -4 -13 d -3 -14 d -4 -14 d -3 -14 d -4 -14 d -9 -32 d f black 419 196 m 10 37 d s 429 233 m 4 14 d 3 14 d
 4 14 d 3 13 d 4 14 d 3 13 d 3 14 d 4 13 d 3 13 d 4 13 d 3 12 d 3 13 d 4 12 d 3 12 d 4 12 d 3 12 d 3 12 d 3 11 d 4 12 d 3 11 d 3 10 d 3 11 d 4 10 d 3 11 d 3 10 d 3 10 d 3 9 d 4 10 d 3 9 d 3 9 d 3 9 d 3 9 d 3 8 d 3 9 d 3 8 d 3 8 d 3 7 d 4 8 d 3 7 d 3
 7 d 3 7 d 3 7 d 3 7 d 2 6 d 3 7 d 3 6 d 3 6 d 3 5 d 3 6 d 3 5 d 3 6 d 3 5 d 3 4 d 3 5 d 2 5 d 3 4 d 3 4 d 3 4 d 3 4 d 2 4 d 6 7 d 6 6 d 5 6 d 6 4 d 5 5 d 5 3 d 6 3 d 5 1 d 5 1 d 5 X 6 -2 d 5 -2 d 5 -5 d 5 -6 d 5 -8 d 5 -12 d 5 -15 d 5 -21 d 5 -28 d
 5 -36 d 10 -75 d 9 -39 d 10 -11 d 9 3 d 9 13 d 9 19 d 9 26 d 9 34 d 9 44 d 9 60 d 9 78 d 8 74 d 9 46 d 8 27 d 8 18 d 8 13 d 8 9 d 8 7 d 8 6 d 8 4 d 8 4 d 8 3 d 7 2 d 8 3 d 7 2 d 8 1 d 7 2 d 7 1 d 8 1 d 7 1 d 7 1 d 7 1 d 7 1 d 7 1 d 7 X 6 1 d 7 1 d 7
 X 6 1 d 7 X 6 1 d 7 X 6 1 d 13 X 6 1 d 12 X 6 1 d 12 X 6 1 d 18 X 6 1 d 17 X 5 1 d 17 X 5 1 d 19 X 13 1 d 13 X 13 1 d 25 X 12 1 d 46 X 12 -2 d 22 -7 d 21 -6 d 21 -5 d 20 -5 d 20 -3 d 19 -2 d 19 -2 d 19 -2 d 18 X 17 -1 d 67 X 16 1 d 15 1 d 15 X 15 1
 d 15 1 d 14 1 d 14 1 d 14 1 d 14 1 d 13 X 13 1 d 13 1 d 13 1 d 12 1 d 12 1 d 13 1 d 12 1 d 11 1 d 12 1 d 11 X 12 1 d 11 1 d 11 1 d 10 1 d 11 X 10 1 d 11 1 d 10 X 10 1 d 10 1 d 10 X 10 1 d 9 1 d 10 X 9 1 d 9 1 d 9 X 9 1 d 9 X 9 1 d 9 X 9 1 d 8 X 9 1
 d 8 X 8 1 d 17 X 8 1 d 7 X 8 1 d s 332 196 m 22 92 d s 354 288 m 39 154 d 36 133 d 4 13 d 3 12 d 4 12 d 3 11 d 4 12 d 3 11 d 3 12 d 4 11 d 3 10 d 4 11 d 3 11 d 3 10 d 4 10 d 3 10 d 4 10 d 3 9 d 3 10 d 3 9 d 4 9 d 3 9 d 3 9 d 3 9 d 4 8 d 3 9 d 3 8 d
 3 8 d 3 8 d 4 8 d 3 8 d 3 7 d 3 7 d 3 8 d 3 7 d 3 7 d 3 6 d 3 7 d 3 7 d 4 6 d 3 6 d 3 6 d 3 6 d 3 6 d 3 6 d 2 6 d 3 5 d 3 5 d 3 6 d 3 5 d 3 5 d 3 5 d 3 5 d 3 4 d 3 5 d 3 5 d 2 4 d 3 4 d 3 5 d 3 4 d 3 4 d 2 4 d 6 7 d 6 8 d 5 7 d 6 6 d 5 7 d 5 6 d 6 6
 d 5 6 d 5 6 d 5 5 d 6 5 d 5 6 d 5 5 d 5 5 d 5 5 d 5 5 d 5 5 d 5 5 d 5 6 d 5 5 d 10 7 d 9 3 d 10 1 d 9 1 d 9 X 9 -1 d 9 X 9 -1 d 9 -2 d 9 -3 d 9 -6 d 8 -9 d 9 -8 d 8 -6 d 8 -4 d 8 -4 d 8 -2 d 8 -3 d 8 -1 d 8 -2 d 8 -1 d 8 -1 d 7 -1 d 8 -1 d 7 -1 d 8
 X 7 -1 d 7 X 8 -1 d 14 X 7 -1 d 14 X 7 -1 d 20 X 6 -1 d 32 X 7 -1 d 36 X 6 -1 d 52 X 5 -1 d 56 X 13 -1 d 49 X 11 -1 d 23 X 12 -3 d 22 -7 d 21 -7 d 21 -6 d 20 -5 d 20 -4 d 19 -3 d 19 -3 d 19 -2 d 18 -1 d 17 -2 d 17 X 17 -1 d 94 X 15 1 d 14 X 14 1 d
 14 X 14 1 d 13 X 13 1 d 13 1 d 13 X 12 1 d 12 1 d 13 X 12 1 d 11 1 d 12 X 11 1 d 12 1 d 11 X 11 1 d 10 X 11 1 d 10 1 d 11 X 10 1 d 10 X 10 1 d 10 X 10 1 d 9 X 10 1 d 9 X 9 1 d 9 X 9 1 d 9 X 9 1 d 9 X 9 1 d 8 X 9 1 d 16 X 8 1 d 9 X 8 1 d 15 X s 0 0.4
 0 c black 0 0.4 0 c 331 196 m 23 97 d 39 153 d 36 134 d 4 12 d 3 13 d 4 11 d 3 12 d 4 12 d 3 11 d 3 11 d 4 11 d 3 11 d 4 11 d 3 10 d 3 10 d 4 11 d 3 10 d 4 9 d 3 10 d 3 9 d 3 10 d 4 9 d 3 9 d 3 9 d 3 8 d 4 9 d 3 8 d 3 8 d 3 8 d 3 8 d 4 8 d 3 7 d 3 8
 d 3 7 d 3 7 d 3 7 d 3 7 d 3 7 d 3 7 d 3 6 d 4 6 d 3 7 d 3 6 d 3 6 d 3 5 d 3 6 d 2 6 d 3 5 d 3 6 d 3 5 d 3 5 d 3 5 d 3 5 d 3 4 d 3 5 d 3 4 d 3 5 d 2 4 d 3 4 d 3 4 d 3 4 d 3 4 d 2 4 d 6 7 d 6 8 d 5 7 d 6 6 d 5 7 d 5 6 d 6 6 d 5 6 d 5 5 d 5 6 d 6 5 d 5
 5 d 5 5 d 5 5 d 5 5 d 5 5 d 5 5 d 5 6 d 5 5 d 5 5 d 10 7 d 9 3 d 10 1 d 9 1 d 9 X 9 -1 d 9 X 9 -1 d 9 -2 d 9 -3 d 9 -6 d 8 -9 d 9 -8 d 8 -6 d 8 -4 d 8 -4 d 8 -2 d 8 -3 d 8 -1 d 8 -2 d 8 -1 d 8 -1 d 7 -1 d 8 -1 d 7 -1 d 8 X 7 -1 d 7 X 8 -1 d 14 X 7
 -1 d 14 X 7 -1 d 20 X 6 -1 d 32 X 7 -1 d 36 X 6 -1 d 52 X 5 -1 d 56 X 13 -1 d 60 X 12 -1 d 11 X 12 -2 d 22 -7 d 21 -6 d 21 -5 d 20 -5 d 20 -3 d 19 -3 d 19 -3 d 19 -1 d 18 -2 d 17 -1 d 17 -1 d 34 X 16 -1 d 46 X 15 1 d 15 X 14 1 d 14 X 14 1 d 14 X 13
 1 d 13 1 d 13 X 13 1 d 12 X 12 1 d 13 1 d 12 X 11 1 d 12 1 d 11 X 12 1 d 11 1 d 11 X 10 1 d 11 X 10 1 d 11 1 d 10 X 10 1 d 10 X 10 1 d 10 1 d 9 X 10 1 d 9 X 9 1 d 9 X 9 1 d 9 X 9 1 d 9 X 9 1 d 8 X 9 1 d 16 X 8 1 d 9 X 8 1 d 15 X -8 Y -15 X -8 -1 d
 -17 X -8 -1 d -17 X -8 -1 d -9 X -9 -1 d -18 X -9 -1 d -9 X -9 -1 d -9 X -10 -1 d -9 X -10 -1 d -10 X -10 -1 d -10 X -10 -1 d -11 X -10 -1 d -11 -1 d -10 X -11 -1 d -11 X -12 -1 d -11 -1 d -12 X -11 -1 d -12 -1 d -13 X -12 -1 d -12 -1 d -13 X -13 -1
 d -13 -1 d -13 X -14 -1 d -14 X -14 -1 d -14 X -15 -1 d -45 X -16 -1 d -33 X -17 1 d -17 1 d -17 1 d -18 2 d -19 2 d -19 3 d -19 3 d -20 4 d -20 5 d -21 7 d -21 7 d -22 8 d -12 3 d -23 X -11 1 d -49 X -13 1 d -56 X -5 1 d -52 X -6 1 d -36 X -7 1 d
 -32 X -6 1 d -20 X -7 1 d -14 X -7 1 d -14 X -8 1 d -7 X -7 1 d -8 X -7 1 d -8 1 d -7 1 d -8 1 d -8 1 d -8 2 d -8 1 d -8 3 d -8 2 d -8 4 d -8 4 d -8 6 d -9 8 d -8 9 d -9 6 d -9 3 d -9 2 d -9 1 d -9 X -9 1 d -9 X -9 -1 d -10 -1 d -9 -3 d -10 -7 d -5
 -5 d -5 -6 d -5 -5 d -5 -5 d -5 -6 d -5 -5 d -5 -5 d -5 -5 d -5 -5 d -6 -5 d -5 -6 d -5 -6 d -5 -5 d -6 -7 d -5 -6 d -5 -6 d -6 -7 d -5 -7 d -6 -7 d -6 -8 d -2 -4 d -3 -5 d -3 -4 d -3 -4 d -3 -5 d -2 -4 d -3 -5 d -3 -5 d -3 -5 d -3 -5 d -3 -5 d -3
 -5 d -3 -5 d -3 -6 d -3 -5 d -3 -6 d -2 -5 d -3 -6 d -3 -6 d -3 -6 d -3 -6 d -3 -7 d -4 -6 d -3 -7 d -3 -6 d -3 -7 d -3 -7 d -3 -7 d -3 -8 d -3 -7 d -3 -7 d -3 -8 d -4 -8 d -3 -8 d -3 -8 d -3 -8 d -3 -9 d -4 -8 d -3 -9 d -3 -9 d -3 -9 d -4 -9 d -3
 -9 d -3 -10 d -3 -10 d -4 -9 d -3 -10 d -4 -11 d -3 -10 d -3 -11 d -4 -10 d -3 -11 d -4 -11 d -3 -11 d -3 -12 d -4 -11 d -3 -12 d -4 -12 d -3 -12 d -4 -13 d -36 -133 d -39 -154 d -21 -87 d f black 332 196 m 22 92 d s 354 288 m 39 154 d 36 133 d 4 13
 d 3 12 d 4 12 d 3 11 d 4 12 d 3 11 d 3 12 d 4 11 d 3 10 d 4 11 d 3 11 d 3 10 d 4 10 d 3 10 d 4 10 d 3 9 d 3 10 d 3 9 d 4 9 d 3 9 d 3 9 d 3 9 d 4 8 d 3 9 d 3 8 d 3 8 d 3 8 d 4 8 d 3 8 d 3 7 d 3 7 d 3 8 d 3 7 d 3 7 d 3 6 d 3 7 d 3 7 d 4 6 d 3 6 d 3 6
 d 3 6 d 3 6 d 3 6 d 2 6 d 3 5 d 3 5 d 3 6 d 3 5 d 3 5 d 3 5 d 3 5 d 3 4 d 3 5 d 3 5 d 2 4 d 3 4 d 3 5 d 3 4 d 3 4 d 2 4 d 6 7 d 6 8 d 5 7 d 6 6 d 5 7 d 5 6 d 6 6 d 5 6 d 5 6 d 5 5 d 6 5 d 5 6 d 5 5 d 5 5 d 5 5 d 5 5 d 5 5 d 5 5 d 5 6 d 5 5 d 10 7 d
 9 3 d 10 1 d 9 1 d 9 X 9 -1 d 9 X 9 -1 d 9 -2 d 9 -3 d 9 -6 d 8 -9 d 9 -8 d 8 -6 d 8 -4 d 8 -4 d 8 -2 d 8 -3 d 8 -1 d 8 -2 d 8 -1 d 8 -1 d 7 -1 d 8 -1 d 7 -1 d 8 X 7 -1 d 7 X 8 -1 d 14 X 7 -1 d 14 X 7 -1 d 20 X 6 -1 d 32 X 7 -1 d 36 X 6 -1 d 52 X 5
 -1 d 56 X 13 -1 d 49 X 11 -1 d 23 X 12 -3 d 22 -7 d 21 -7 d 21 -6 d 20 -5 d 20 -4 d 19 -3 d 19 -3 d 19 -2 d 18 -1 d 17 -2 d 17 X 17 -1 d 94 X 15 1 d 14 X 14 1 d 14 X 14 1 d 13 X 13 1 d 13 1 d 13 X 12 1 d 12 1 d 13 X 12 1 d 11 1 d 12 X 11 1 d 12 1 d
 11 X 11 1 d 10 X 11 1 d 10 1 d 11 X 10 1 d 10 X 10 1 d 10 X 10 1 d 9 X 10 1 d 9 X 9 1 d 9 X 9 1 d 9 X 9 1 d 9 X 9 1 d 8 X 9 1 d 16 X 8 1 d 9 X 8 1 d 15 X s 272 205 m 42 155 d 40 163 d 39 153 d 36 136 d 4 12 d 3 13 d 4 12 d 3 12 d 4 12 d 3 11 d 3 12
 d 4 11 d 3 11 d 4 11 d 3 11 d 3 10 d 4 11 d 3 10 d 4 10 d 3 10 d 3 10 d 3 9 d 4 10 d 3 9 d 3 9 d 3 9 d 4 9 d 3 9 d 3 8 d 3 8 d 3 8 d 4 8 d 3 8 d 3 8 d 3 8 d 3 7 d 3 7 d 3 7 d 3 7 d 3 7 d 3 7 d 4 6 d 3 7 d 3 6 d 3 6 d 3 6 d 3 6 d 2 6 d 3 6 d 3 5 d 3
 6 d 3 5 d 3 5 d 3 5 d 3 5 d 3 5 d 3 4 d 3 5 d 2 4 d 3 5 d 3 4 d 3 4 d 3 4 d 2 4 d 6 8 d 6 7 d 5 7 d 6 6 d 5 6 d 5 6 d 6 6 d 5 5 d 5 5 d 5 5 d 6 5 d 5 4 d 5 4 d 5 4 d 5 4 d 5 4 d 5 3 d 5 4 d 5 3 d 5 3 d 10 4 d 9 2 d 10 1 d 9 1 d 27 X 9 1 d 18 X 9 1 d
 8 1 d 9 X 8 1 d 24 X 8 1 d 84 X 7 1 d 351 X 12 -3 d 22 -7 d 21 -7 d 21 -5 d 20 -5 d 20 -4 d 19 -3 d 19 -2 d 19 -2 d 18 -1 d 17 -1 d 17 -1 d 17 X 17 -1 d 16 X 16 1 d 30 X 15 1 d 15 X 14 1 d 14 1 d 14 X 14 1 d 13 1 d 13 X 13 1 d 13 1 d 12 1 d 12 X 13
 1 d 12 1 d 11 X 12 1 d 11 1 d 12 X 11 1 d 11 1 d 10 X 11 1 d 10 1 d 11 X 10 1 d 10 1 d 10 X 10 1 d 10 X 9 1 d 10 X 9 1 d 9 X 9 1 d 9 X 9 1 d 9 X 9 1 d 17 X 9 1 d 8 X 8 1 d 17 X 8 1 d 15 X s 0.8 0.4 0 c black 0.8 0.4 0 c 272 210 m 42 155 d 40 163 d
 39 153 d 36 135 d 4 13 d 3 12 d 4 13 d 3 11 d 4 12 d 3 12 d 3 11 d 4 12 d 3 11 d 4 11 d 3 10 d 3 11 d 4 10 d 3 11 d 4 10 d 3 9 d 3 10 d 3 10 d 4 9 d 3 9 d 3 9 d 3 9 d 4 9 d 3 9 d 3 8 d 3 8 d 3 8 d 4 8 d 3 8 d 3 8 d 3 7 d 3 8 d 3 7 d 3 7 d 3 7 d 3 7
 d 3 6 d 4 7 d 3 6 d 3 7 d 3 6 d 3 6 d 3 5 d 2 6 d 3 6 d 3 5 d 3 6 d 3 5 d 3 5 d 3 5 d 3 4 d 3 5 d 3 5 d 3 4 d 2 4 d 3 4 d 3 4 d 3 4 d 3 4 d 2 4 d 6 8 d 6 7 d 5 6 d 6 7 d 5 6 d 5 6 d 6 6 d 5 5 d 5 5 d 5 5 d 6 4 d 5 4 d 5 5 d 5 4 d 5 3 d 5 4 d 5 4 d 5
 3 d 5 3 d 5 3 d 10 4 d 9 2 d 10 1 d 9 1 d 27 X 9 1 d 18 X 9 1 d 8 1 d 9 X 8 1 d 24 X 8 1 d 76 X 8 1 d 358 X 12 -2 d 22 -7 d 21 -6 d 21 -5 d 20 -4 d 20 -3 d 19 -3 d 19 -2 d 19 -2 d 18 -1 d 17 -1 d 17 X 17 -1 d 64 X 15 1 d 15 X 15 1 d 14 X 14 1 d 14 1
 d 14 X 13 1 d 13 1 d 13 1 d 13 X 12 1 d 12 1 d 13 X 12 1 d 11 1 d 12 1 d 11 X 12 1 d 11 1 d 11 X 10 1 d 11 1 d 10 X 11 1 d 10 1 d 10 X 10 1 d 10 X 10 1 d 9 X 10 1 d 9 1 d 9 X 9 1 d 9 X 9 1 d 9 X 9 1 d 17 X 9 1 d 8 X 8 1 d 8 X 9 1 d 15 X 8 1 d -8 Y
 -8 -1 d -15 X -9 -1 d -16 X -8 -1 d -17 X -9 -1 d -9 X -9 -1 d -9 X -9 -1 d -18 X -9 -1 d -10 X -9 -1 d -10 X -10 -1 d -10 X -10 -1 d -10 -1 d -11 X -10 -1 d -11 X -10 -1 d -11 -1 d -11 -1 d -12 X -11 -1 d -12 -1 d -11 X -12 -1 d -13 -1 d -12 -1 d
 -12 X -13 -1 d -13 -1 d -13 X -13 -1 d -14 -1 d -14 -1 d -14 X -14 -1 d -15 X -15 -1 d -30 X -16 -1 d -50 X -17 1 d -17 1 d -18 1 d -19 2 d -19 3 d -19 3 d -20 4 d -20 5 d -21 6 d -21 7 d -22 8 d -12 3 d -351 X -7 -1 d -84 X -8 -1 d -24 X -8 -1 d -9
 X -8 -1 d -9 -1 d -18 X -9 -1 d -18 X -9 -1 d -9 X -10 -1 d -9 -2 d -10 -4 d -5 -3 d -5 -3 d -5 -4 d -5 -3 d -5 -4 d -5 -4 d -5 -4 d -5 -4 d -5 -5 d -6 -4 d -5 -5 d -5 -5 d -5 -6 d -6 -5 d -5 -6 d -5 -7 d -6 -6 d -5 -7 d -6 -7 d -6 -8 d -2 -4 d -3
 -4 d -3 -5 d -3 -4 d -3 -5 d -2 -4 d -3 -5 d -3 -5 d -3 -5 d -3 -5 d -3 -5 d -3 -5 d -3 -6 d -3 -5 d -3 -6 d -3 -5 d -2 -6 d -3 -6 d -3 -6 d -3 -6 d -3 -7 d -3 -6 d -4 -7 d -3 -6 d -3 -7 d -3 -7 d -3 -8 d -3 -7 d -3 -7 d -3 -8 d -3 -8 d -3 -8 d -4
 -8 d -3 -8 d -3 -8 d -3 -9 d -3 -8 d -4 -9 d -3 -9 d -3 -9 d -3 -10 d -4 -9 d -3 -10 d -3 -9 d -3 -10 d -4 -10 d -3 -11 d -4 -10 d -3 -11 d -3 -11 d -4 -11 d -3 -11 d -4 -11 d -3 -12 d -3 -11 d -4 -12 d -3 -12 d -4 -12 d -3 -13 d -4 -12 d -36 -136 d
 -39 -153 d -40 -163 d -42 -155 d f black 272 205 m 42 155 d 40 163 d 39 153 d 36 136 d 4 12 d 3 13 d 4 12 d 3 12 d 4 12 d 3 11 d 3 12 d 4 11 d 3 11 d 4 11 d 3 11 d 3 10 d 4 11 d 3 10 d 4 10 d 3 10 d 3 10 d 3 9 d 4 10 d 3 9 d 3 9 d 3 9 d 4 9 d 3 9 d
 3 8 d 3 8 d 3 8 d 4 8 d 3 8 d 3 8 d 3 8 d 3 7 d 3 7 d 3 7 d 3 7 d 3 7 d 3 7 d 4 6 d 3 7 d 3 6 d 3 6 d 3 6 d 3 6 d 2 6 d 3 6 d 3 5 d 3 6 d 3 5 d 3 5 d 3 5 d 3 5 d 3 5 d 3 4 d 3 5 d 2 4 d 3 5 d 3 4 d 3 4 d 3 4 d 2 4 d 6 8 d 6 7 d 5 7 d 6 6 d 5 6 d 5 6
 d 6 6 d 5 5 d 5 5 d 5 5 d 6 5 d 5 4 d 5 4 d 5 4 d 5 4 d 5 4 d 5 3 d 5 4 d 5 3 d 5 3 d 10 4 d 9 2 d 10 1 d 9 1 d 27 X 9 1 d 18 X 9 1 d 8 1 d 9 X 8 1 d 24 X 8 1 d 84 X 7 1 d 351 X 12 -3 d 22 -7 d 21 -7 d 21 -5 d 20 -5 d 20 -4 d 19 -3 d 19 -2 d 19 -2 d
 18 -1 d 17 -1 d 17 -1 d 17 X 17 -1 d 16 X 16 1 d 30 X 15 1 d 15 X 14 1 d 14 1 d 14 X 14 1 d 13 1 d 13 X 13 1 d 13 1 d 12 1 d 12 X 13 1 d 12 1 d 11 X 12 1 d 11 1 d 12 X 11 1 d 11 1 d 10 X 11 1 d 10 1 d 11 X 10 1 d 10 1 d 10 X 10 1 d 10 X 9 1 d 10 X 9
 1 d 9 X 9 1 d 9 X 9 1 d 9 X 9 1 d 17 X 9 1 d 8 X 8 1 d 17 X 8 1 d 15 X s 272 364 m 42 153 d 40 161 d 39 153 d 36 135 d 4 12 d 3 12 d 4 13 d 3 12 d 4 11 d 3 12 d 3 11 d 4 12 d 3 11 d 4 11 d 3 10 d 3 11 d 4 10 d 3 10 d 4 11 d 3 9 d 3 10 d 3 10 d 4 9 d
 3 9 d 3 9 d 3 9 d 4 9 d 3 9 d 3 8 d 3 8 d 3 9 d 4 7 d 3 8 d 3 8 d 3 8 d 3 7 d 3 7 d 3 7 d 3 7 d 3 7 d 3 7 d 4 6 d 3 7 d 3 6 d 3 6 d 3 6 d 3 6 d 2 6 d 3 5 d 3 6 d 3 5 d 3 5 d 3 6 d 3 5 d 3 4 d 3 5 d 3 5 d 3 4 d 2 5 d 3 4 d 3 4 d 3 5 d 3 4 d 2 4 d 6 7
 d 6 7 d 5 7 d 6 7 d 5 6 d 5 6 d 6 6 d 5 5 d 5 5 d 5 5 d 6 4 d 5 5 d 5 4 d 5 4 d 5 4 d 5 4 d 5 4 d 5 3 d 5 4 d 5 3 d 10 4 d 9 2 d 10 1 d 9 X 9 1 d 45 X 9 1 d 141 X 7 1 d 340 X 11 -1 d 12 -2 d 22 -7 d 21 -7 d 21 -6 d 20 -5 d 20 -3 d 19 -3 d 19 -3 d 19
 -2 d 18 -1 d 17 -1 d 17 -1 d 81 X 15 1 d 15 X 15 1 d 14 X 14 1 d 14 1 d 14 X 13 1 d 13 1 d 13 1 d 13 X 12 1 d 12 1 d 13 X 12 1 d 11 1 d 12 1 d 11 X 12 1 d 11 1 d 11 X 10 1 d 11 1 d 10 X 11 1 d 10 1 d 10 X 10 1 d 10 X 10 1 d 9 X 10 1 d 9 X 9 1 d 9 X
 9 1 d 9 X 9 1 d 9 X 9 1 d 8 X 9 1 d 8 X 8 1 d 17 X 8 1 d 15 X s 0.6 0.2 0.8 c black 0.6 0.2 0.8 c 272 369 m 42 153 d 40 161 d 39 153 d 36 134 d 4 13 d 3 12 d 4 12 d 3 12 d 4 12 d 3 12 d 3 11 d 4 11 d 3 11 d 4 11 d 3 11 d 3 10 d 4 11 d 3 10 d 4 10 d
 3 10 d 3 10 d 3 9 d 4 9 d 3 10 d 3 9 d 3 9 d 4 8 d 3 9 d 3 8 d 3 8 d 3 9 d 4 7 d 3 8 d 3 8 d 3 7 d 3 8 d 3 7 d 3 7 d 3 7 d 3 7 d 3 6 d 4 7 d 3 6 d 3 6 d 3 6 d 3 6 d 3 6 d 2 6 d 3 5 d 3 6 d 3 5 d 3 5 d 3 5 d 3 5 d 3 5 d 3 5 d 3 4 d 3 5 d 2 4 d 3 4 d
 3 4 d 3 4 d 3 4 d 2 4 d 6 7 d 6 7 d 5 7 d 6 7 d 5 6 d 5 6 d 6 5 d 5 5 d 5 5 d 5 5 d 6 5 d 5 4 d 5 5 d 5 4 d 5 3 d 5 4 d 5 4 d 5 3 d 5 4 d 5 3 d 10 4 d 9 2 d 10 1 d 9 X 9 1 d 36 X 9 1 d 142 X 8 1 d 347 X 11 -1 d 12 -2 d 22 -6 d 21 -6 d 21 -5 d 20 -4
 d 20 -4 d 19 -2 d 19 -3 d 19 -1 d 18 -1 d 17 -1 d 17 -1 d 96 X 15 1 d 15 X 14 1 d 14 1 d 14 X 14 1 d 13 1 d 13 X 13 1 d 13 1 d 12 X 12 1 d 13 1 d 12 1 d 11 X 12 1 d 11 1 d 12 X 11 1 d 11 1 d 10 1 d 11 X 10 1 d 11 X 10 1 d 10 1 d 10 X 10 1 d 10 1 d 9
 X 10 1 d 9 X 9 1 d 9 X 9 1 d 9 X 9 1 d 9 X 9 1 d 8 X 9 1 d 8 X 8 1 d 17 X 8 1 d 7 X 8 1 d -8 Y -8 -1 d -15 X -9 -1 d -8 X -8 -1 d -17 X -8 -1 d -9 X -9 -1 d -18 X -9 -1 d -9 X -9 -1 d -9 X -10 -1 d -9 X -10 -1 d -10 X -10 -1 d -10 X -10 -1 d -11 -1
 d -10 X -11 -1 d -10 -1 d -11 X -11 -1 d -12 -1 d -11 X -12 -1 d -11 -1 d -12 -1 d -13 X -12 -1 d -12 -1 d -13 -1 d -13 X -13 -1 d -13 -1 d -14 X -14 -1 d -14 -1 d -14 X -15 -1 d -15 X -15 -1 d -15 X -16 -1 d -33 X -17 1 d -17 1 d -17 1 d -18 1 d
 -19 2 d -19 2 d -19 4 d -20 4 d -20 5 d -21 6 d -21 7 d -22 8 d -12 2 d -11 1 d -333 X -7 -1 d -148 X -9 -1 d -45 X -9 -1 d -9 X -10 -1 d -9 -2 d -10 -4 d -5 -4 d -5 -3 d -5 -4 d -5 -3 d -5 -4 d -5 -4 d -5 -4 d -5 -5 d -5 -4 d -6 -5 d -5 -5 d -5 -5
 d -5 -5 d -6 -6 d -5 -6 d -5 -6 d -6 -7 d -5 -6 d -6 -8 d -6 -7 d -2 -4 d -3 -5 d -3 -4 d -3 -4 d -3 -5 d -2 -5 d -3 -4 d -3 -5 d -3 -5 d -3 -5 d -3 -5 d -3 -6 d -3 -5 d -3 -5 d -3 -6 d -3 -6 d -2 -5 d -3 -6 d -3 -6 d -3 -6 d -3 -7 d -3 -6 d -4 -7 d
 -3 -7 d -3 -6 d -3 -7 d -3 -8 d -3 -7 d -3 -7 d -3 -8 d -3 -8 d -3 -8 d -4 -8 d -3 -8 d -3 -8 d -3 -9 d -3 -8 d -4 -9 d -3 -9 d -3 -9 d -3 -9 d -4 -10 d -3 -9 d -3 -10 d -3 -10 d -4 -10 d -3 -10 d -4 -11 d -3 -10 d -3 -11 d -4 -11 d -3 -11 d -4 -11
 d -3 -12 d -3 -11 d -4 -12 d -3 -12 d -4 -12 d -3 -13 d -4 -12 d -36 -135 d -39 -153 d -40 -161 d -42 -153 d f black 272 364 m 42 153 d 40 161 d 39 153 d 36 135 d 4 12 d 3 12 d 4 13 d 3 12 d 4 11 d 3 12 d 3 11 d 4 12 d 3 11 d 4 11 d 3 10 d 3 11 d 4
 10 d 3 10 d 4 11 d 3 9 d 3 10 d 3 10 d 4 9 d 3 9 d 3 9 d 3 9 d 4 9 d 3 9 d 3 8 d 3 8 d 3 9 d 4 7 d 3 8 d 3 8 d 3 8 d 3 7 d 3 7 d 3 7 d 3 7 d 3 7 d 3 7 d 4 6 d 3 7 d 3 6 d 3 6 d 3 6 d 3 6 d 2 6 d 3 5 d 3 6 d 3 5 d 3 5 d 3 6 d 3 5 d 3 4 d 3 5 d 3 5 d
 3 4 d 2 5 d 3 4 d 3 4 d 3 5 d 3 4 d 2 4 d 6 7 d 6 7 d 5 7 d 6 7 d 5 6 d 5 6 d 6 6 d 5 5 d 5 5 d 5 5 d 6 4 d 5 5 d 5 4 d 5 4 d 5 4 d 5 4 d 5 4 d 5 3 d 5 4 d 5 3 d 10 4 d 9 2 d 10 1 d 9 X 9 1 d 45 X 9 1 d 141 X 7 1 d 340 X 11 -1 d 12 -2 d 22 -7 d 21
 -7 d 21 -6 d 20 -5 d 20 -3 d 19 -3 d 19 -3 d 19 -2 d 18 -1 d 17 -1 d 17 -1 d 81 X 15 1 d 15 X 15 1 d 14 X 14 1 d 14 1 d 14 X 13 1 d 13 1 d 13 1 d 13 X 12 1 d 12 1 d 13 X 12 1 d 11 1 d 12 1 d 11 X 12 1 d 11 1 d 11 X 10 1 d 11 1 d 10 X 11 1 d 10 1 d
 10 X 10 1 d 10 X 10 1 d 9 X 10 1 d 9 X 9 1 d 9 X 9 1 d 9 X 9 1 d 9 X 9 1 d 8 X 9 1 d 8 X 8 1 d 17 X 8 1 d 15 X s
 gsave  2268 1630 0 0 C 2199.34 1142.4 t 90 r /Helvetica-BoldOblique findfont 37.0356 sf 0 0 m 
 420 402 381 360 349 319 283 273 247 222 211 186 156 127 116 89 78 51 23
(LHC HIGGS XS WG 2011) K NC gr  0.2 0.2 0.2 c black 0.2 0.2 0.2 c
 gsave  2268 1630 0 0 C 1726.43 851.818 t 0 r /Helvetica findfont 59.8267 sf 0 0 m (, q=udcsb) show NC gr  black 0.2 0.2 0.2 c
 gsave  2268 1630 0 0 C 1700.79 851.818 t 0 r /Symbol findfont 59.8267 sf 0 0 m (t) show NC gr  black 0.2 0.2 0.2 c
 gsave  2268 1630 0 0 C 1689.39 851.818 t 0 r /Helvetica findfont 59.8267 sf 0 0 m (,) show NC gr  black 0.2 0.2 0.2 c
 gsave  2268 1630 0 0 C 1655.21 851.818 t 0 r /Symbol findfont 59.8267 sf 0 0 m (m) show NC gr  black 0.2 0.2 0.2 c
 gsave  2268 1630 0 0 C 1435.84 851.818 t 0 r /Helvetica findfont 59.8267 sf 0 0 m (llqq, l=e,) show NC gr  1 0 0 c black 1 0 0 c
 gsave  2268 1630 0 0 C 1689.39 772.049 t 0 r /Helvetica findfont 59.8267 sf 0 0 m (, q=udcsb) show NC gr  black 1 0 0 c
 gsave  2268 1630 0 0 C 1655.21 772.049 t 0 r /Symbol findfont 59.8267 sf 0 0 m (m) show NC gr  black 1 0 0 c
 gsave  2268 1630 0 0 C 1435.84 772.049 t 0 r /Helvetica findfont 59.8267 sf 0 0 m (llqq, l=e,) show NC gr  0 0 0.6 c black 0 0 0.6 c
 gsave  2268 1630 0 0 C 1623.87 991.414 t 0 r /Helvetica findfont 59.8267 sf 0 0 m 
 361 330 300 266 232 196 163 146 129 103 69 35
(=any, q=udcsb) K NC gr  black 0 0 0.6 c
 gsave  2268 1630 0 0 C 1592.53 991.414 t 0 r /Symbol findfont 59.8267 sf 0 0 m (n) show NC gr  black 0 0 0.6 c
 gsave  2268 1630 0 0 C 1498.52 991.414 t 0 r /Helvetica findfont 59.8267 sf 0 0 m (qq, ) show NC gr  black 0 0 0.6 c
 gsave  2268 1630 0 0 C 1467.18 991.414 t 0 r /Symbol findfont 59.8267 sf 0 0 m (n) show NC gr  black 0 0 0.6 c
 gsave  2268 1630 0 0 C 1435.84 991.414 t 0 r /Symbol findfont 59.8267 sf 0 0 m (n) show NC gr  0 0.4 0 c black 0 0.4 0 c
 gsave  2268 1630 0 0 C 1706.49 1096.82 t 0 r /Helvetica findfont 59.8267 sf 0 0 m (, q=udcsb) show NC gr  black 0 0.4 0 c
 gsave  2268 1630 0 0 C 1672.3 1096.82 t 0 r /Symbol findfont 59.8267 sf 0 0 m (m) show NC gr  black 0 0.4 0 c
 gsave  2268 1630 0 0 C 1478.57 1096.82 t 0 r /Helvetica findfont 59.8267 sf 0 0 m (qq, l=e,) show NC gr  black 0 0.4 0 c
 gsave  2268 1630 0 0 C 1447.24 1096.82 t 0 r /Symbol findfont 59.8267 sf 0 0 m (n) show NC gr  black 0 0.4 0 c
 gsave  2268 1630 0 0 C 1435.84 1096.82 t 0 r /Helvetica findfont 59.8267 sf 0 0 m (l) show NC gr  0.8 0.4 0 c black 0.8 0.4 0 c
 gsave  2268 1630 0 0 C 1435.84 1310.49 t 0 r /Helvetica findfont 59.8267 sf 0 0 m (qqqq, q=udcsb) show NC gr  0.6 0.2 0.8 c black 0.6 0.2 0.8 c
 gsave  2268 1630 0 0 C 1435.84 1444.39 t 0 r /Helvetica findfont 59.8267 sf 0 0 m 
 435 401 387 337 316 282 266 249 218 184 151 115 98 81 64 47 31 16
(ffff, f=any fermion) K NC gr 
 gr  gr showpage
end
%%EOF
