%!PS-Adobe-2.0 EPSF-2.0
%%BoundingBox:  0 0 567 384
%%Title: comparison_eta_gg.eps: c3
%%Creator: ROOT Version 5.28/00a
%%CreationDate: Sat Jan  7 09:51:09 2012
%%EndComments
%%BeginProlog
80 dict begin
/s {stroke} def /l {lineto} def /m {moveto} def /t {translate} def
/r {rotate} def /rl {roll}  def /R {repeat} def
/d {rlineto} def /rm {rmoveto} def /gr {grestore} def /f {eofill} def
/c {setrgbcolor} def /black {0 setgray} def /sd {setdash} def
/cl {closepath} def /sf {scalefont setfont} def /lw {setlinewidth} def
/box {m dup 0 exch d exch 0 d 0 exch neg d cl} def
/NC{systemdict begin initclip end}def/C{NC box clip newpath}def
/bl {box s} def /bf {box f} def /Y { 0 exch d} def /X { 0 d} def 
/K {{pop pop 0 moveto} exch kshow} bind def
/ita {/ang 15 def gsave [1 0 ang dup sin exch cos div 1 0 0] concat} def 
/mp {newpath /y exch def /x exch def} def
/side {[w .77 mul w .23 mul] .385 w mul sd w 0 l currentpoint t -144 r} def
/mr {mp x y w2 0 360 arc} def /m24 {mr s} def /m20 {mr f} def
/mb {mp x y w2 add m w2 neg 0 d 0 w neg d w 0 d 0 w d cl} def
/mt {mp x y w2 add m w2 neg w neg d w 0 d cl} def
/m21 {mb f} def /m25 {mb s} def /m22 {mt f} def /m26{mt s} def
/m23 {mp x y w2 sub m w2 w d w neg 0 d cl f} def
/m27 {mp x y w2 add m w3 neg w2 neg d w3 w2 neg d w3 w2 d cl s} def
/m28 {mp x w2 sub y w2 sub w3 add m w3 0 d  0 w3 neg d w3 0 d 0 w3 d w3 0 d  0 w3 d w3 neg 0 d 0 w3 d w3 neg 0 d 0 w3 neg d w3 neg 0 d cl s } def
/m29 {mp gsave x w2 sub y w2 add w3 sub m currentpoint t 4 {side} repeat cl fill gr} def
/m30 {mp gsave x w2 sub y w2 add w3 sub m currentpoint t 4 {side} repeat cl s gr} def
/m31 {mp x y w2 sub m 0 w d x w2 sub y m w 0 d x w2 sub y w2 add m w w neg d x w2 sub y w2 sub m w w d s} def
/m32 {mp x y w2 sub m w2 w d w neg 0 d cl s} def
/m33 {mp x y w2 add m w3 neg w2 neg d w3 w2 neg d w3 w2 d cl f} def
/m34 {mp x w2 sub y w2 sub w3 add m w3 0 d  0 w3 neg d w3 0 d 0 w3 d w3 0 d  0 w3 d w3 neg 0 d 0 w3 d w3 neg 0 d 0 w3 neg d w3 neg 0 d cl f } def
/m2 {mp x y w2 sub m 0 w d x w2 sub y m w 0 d s} def
/m5 {mp x w2 sub y w2 sub m w w d x w2 sub y w2 add m w w neg d s} def
/reEncode {exch findfont dup length dict begin {1 index /FID eq  {pop pop} {def} ifelse } forall /Encoding exch def currentdict end dup /FontName get exch definefont pop } def [/Times-Bold /Times-Italic /Times-BoldItalic /Helvetica /Helvetica-Oblique
 /Helvetica-Bold /Helvetica-BoldOblique /Courier /Courier-Oblique /Courier-Bold /Courier-BoldOblique /Times-Roman /AvantGarde-Book /AvantGarde-BookOblique /AvantGarde-Demi /AvantGarde-DemiOblique /Bookman-Demi /Bookman-DemiItalic /Bookman-Light
 /Bookman-LightItalic /Helvetica-Narrow /Helvetica-Narrow-Bold /Helvetica-Narrow-BoldOblique /Helvetica-Narrow-Oblique /NewCenturySchlbk-Roman /NewCenturySchlbk-Bold /NewCenturySchlbk-BoldItalic /NewCenturySchlbk-Italic /Palatino-Bold
 /Palatino-BoldItalic /Palatino-Italic /Palatino-Roman ] {ISOLatin1Encoding reEncode } forall%%EndProlog
%%BeginSetup
%%EndSetup
newpath  gsave  .25 .25 scale  gsave  0 0 t black[  ] 0 sd 3 lw 1 1 1 c 2268 1538 0 0 bf black 1 1 1 c 1791 1215 363 246 bf black 1791 1215 363 246 bl 1 0 0 c 6 lw 1 1 1 c black 1 0 0 c 363 269 m 60 X 25 Y 59 X 44 Y 60 X 99 Y 60 X 133 Y 59 X 160 Y 60
 X 233 Y 60 X 235 Y 60 X 139 Y 59 X 46 Y 60 X 20 Y 60 X -58 Y 59 X -132 Y 60 X -83 Y 60 X -50 Y 60 X -31 Y 59 X 49 Y 60 X 139 Y 60 X 107 Y 59 X 10 Y 60 X 25 Y 60 X -49 Y 60 X -137 Y 59 X -229 Y 60 X -211 Y 60 X -182 Y 59 X -141 Y 60 X -90 Y 60 X -46
 Y 60 X -30 Y 59 X s black 3 lw 363 246 m 1791 X s
 gsave  2268 1538 0 0 C 2128 120.562 t 0 r /Symbol findfont 48.8732 sf 0 0 m (g) show NC gr 
 gsave  2268 1538 0 0 C 2101.94 120.562 t 0 r /Symbol findfont 48.8732 sf 0 0 m (g) show NC gr 
 gsave  2268 1538 0 0 C 2062.81 81.4375 t 0 r /Symbol findfont 71.6807 sf 0 0 m (h) show NC gr  363 283 m -37 Y s 437 264 m -18 Y s 512 264 m -18 Y s 587 264 m -18 Y s 661 283 m -37 Y s 736 264 m -18 Y s 811 264 m -18 Y s 885 264 m -18 Y s 960 283 m
 -37 Y s 1035 264 m -18 Y s 1109 264 m -18 Y s 1184 264 m -18 Y s 1259 283 m -37 Y s 1333 264 m -18 Y s 1408 264 m -18 Y s 1483 264 m -18 Y s 1557 283 m -37 Y s 1632 264 m -18 Y s 1706 264 m -18 Y s 1781 264 m -18 Y s 1856 283 m -37 Y s 1930 264 m
 -18 Y s 2005 264 m -18 Y s 2080 264 m -18 Y s 2154 283 m -37 Y s 2154 283 m -37 Y s
 gsave  2268 1538 0 0 C 329.562 179.188 t 0 r /Helvetica findfont 71.6807 sf 0 0 m (\2556) show NC gr 
 gsave  2268 1538 0 0 C 629.312 179.188 t 0 r /Helvetica findfont 71.6807 sf 0 0 m (\2554) show NC gr 
 gsave  2268 1538 0 0 C 925.812 179.188 t 0 r /Helvetica findfont 71.6807 sf 0 0 m (\2552) show NC gr 
 gsave  2268 1538 0 0 C 1238.5 179.188 t 0 r /Helvetica findfont 71.6807 sf 0 0 m (0) show NC gr 
 gsave  2268 1538 0 0 C 1535 179.188 t 0 r /Helvetica findfont 71.6807 sf 0 0 m (2) show NC gr 
 gsave  2268 1538 0 0 C 1834.75 179.188 t 0 r /Helvetica findfont 71.6807 sf 0 0 m (4) show NC gr 
 gsave  2268 1538 0 0 C 2134.5 179.188 t 0 r /Helvetica findfont 71.6807 sf 0 0 m (6) show NC gr  363 1461 m 1791 X s 363 1425 m 36 Y s 437 1443 m 18 Y s 512 1443 m 18 Y s 587 1443 m 18 Y s 661 1425 m 36 Y s 736 1443 m 18 Y s 811 1443 m 18 Y s 885
 1443 m 18 Y s 960 1425 m 36 Y s 1035 1443 m 18 Y s 1109 1443 m 18 Y s 1184 1443 m 18 Y s 1259 1425 m 36 Y s 1333 1443 m 18 Y s 1408 1443 m 18 Y s 1483 1443 m 18 Y s 1557 1425 m 36 Y s 1632 1443 m 18 Y s 1706 1443 m 18 Y s 1781 1443 m 18 Y s 1856
 1425 m 36 Y s 1930 1443 m 18 Y s 2005 1443 m 18 Y s 2080 1443 m 18 Y s 2154 1425 m 36 Y s 2154 1425 m 36 Y s 363 246 m 1215 Y s
 gsave  2268 1538 0 0 C 169.875 1244.56 t 90 r /Helvetica findfont 71.6807 sf 0 0 m (Events) show NC gr  417 246 m -54 X s 390 278 m -27 X s 390 309 m -27 X s 390 340 m -27 X s 390 372 m -27 X s 417 403 m -54 X s 390 435 m -27 X s 390 466 m -27 X s
 390 498 m -27 X s 390 529 m -27 X s 417 561 m -54 X s 390 592 m -27 X s 390 623 m -27 X s 390 655 m -27 X s 390 686 m -27 X s 417 718 m -54 X s 390 749 m -27 X s 390 781 m -27 X s 390 812 m -27 X s 390 844 m -27 X s 417 875 m -54 X s 390 907 m -27 X
 s 390 938 m -27 X s 390 969 m -27 X s 390 1001 m -27 X s 417 1032 m -54 X s 390 1064 m -27 X s 390 1095 m -27 X s 390 1127 m -27 X s 390 1158 m -27 X s 417 1190 m -54 X s 390 1221 m -27 X s 390 1252 m -27 X s 390 1284 m -27 X s 390 1315 m -27 X s
 417 1347 m -54 X s 417 1347 m -54 X s 390 1378 m -27 X s 390 1410 m -27 X s 390 1441 m -27 X s
 gsave  2268 1538 0 0 C 310 221.562 t 0 r /Helvetica findfont 71.6807 sf 0 0 m (0) show NC gr 
 gsave  2268 1538 0 0 C 231.812 377.875 t 0 r /Helvetica findfont 71.6807 sf 0 0 m (500) show NC gr 
 gsave  2268 1538 0 0 C 192.688 537.562 t 0 r /Helvetica findfont 71.6807 sf 0 0 m (1000) show NC gr 
 gsave  2268 1538 0 0 C 192.688 693.938 t 0 r /Helvetica findfont 71.6807 sf 0 0 m (1500) show NC gr 
 gsave  2268 1538 0 0 C 192.688 850.312 t 0 r /Helvetica findfont 71.6807 sf 0 0 m (2000) show NC gr 
 gsave  2268 1538 0 0 C 192.688 1006.75 t 0 r /Helvetica findfont 71.6807 sf 0 0 m (2500) show NC gr 
 gsave  2268 1538 0 0 C 192.688 1166.38 t 0 r /Helvetica findfont 71.6807 sf 0 0 m (3000) show NC gr 
 gsave  2268 1538 0 0 C 192.688 1322.75 t 0 r /Helvetica findfont 71.6807 sf 0 0 m (3500) show NC gr  2154 246 m 1215 Y s 2101 246 m 53 X s 2127 278 m 27 X s 2127 309 m 27 X s 2127 340 m 27 X s 2127 372 m 27 X s 2101 403 m 53 X s 2127 435 m 27 X s
 2127 466 m 27 X s 2127 498 m 27 X s 2127 529 m 27 X s 2101 561 m 53 X s 2127 592 m 27 X s 2127 623 m 27 X s 2127 655 m 27 X s 2127 686 m 27 X s 2101 718 m 53 X s 2127 749 m 27 X s 2127 781 m 27 X s 2127 812 m 27 X s 2127 844 m 27 X s 2101 875 m 53 X
 s 2127 907 m 27 X s 2127 938 m 27 X s 2127 969 m 27 X s 2127 1001 m 27 X s 2101 1032 m 53 X s 2127 1064 m 27 X s 2127 1095 m 27 X s 2127 1127 m 27 X s 2127 1158 m 27 X s 2101 1190 m 53 X s 2127 1221 m 27 X s 2127 1252 m 27 X s 2127 1284 m 27 X s
 2127 1315 m 27 X s 2101 1347 m 53 X s 2101 1347 m 53 X s 2127 1378 m 27 X s 2127 1410 m 27 X s 2127 1441 m 27 X s 0 0 1 c 6 lw 1 1 1 c 0 0 1 c 363 277 m 17 X s 406 277 m 17 X s 3 lw /w 31 def /w2 {w 2 div} def /w3 {w 3 div} def 393 277 m20 6 lw 423
 310 m 16 X s 465 310 m 17 X s 3 lw 452 310 m20 6 lw 482 368 m 17 X s 525 368 m 17 X s 3 lw 512 368 m20 6 lw 542 491 m 17 X s 585 491 m 17 X s 3 lw 572 491 m20 6 lw 602 651 m 17 X s 645 651 m 16 X s 3 lw 632 651 m20 6 lw 691 816 m 1 Y s 691 843 m 1 Y
 s 661 830 m 17 X s 704 830 m 17 X s 3 lw 691 830 m20 6 lw 751 1063 m 3 Y s 751 1092 m 3 Y s 721 1079 m 17 X s 764 1079 m 17 X s 3 lw 751 1079 m20 6 lw 811 1283 m 5 Y s 811 1314 m 5 Y s 781 1301 m 17 X s 824 1301 m 17 X s 3 lw 811 1301 m20 6 lw 870
 1378 m 6 Y s 870 1411 m 5 Y s 841 1397 m 16 X s 883 1397 m 17 X s 3 lw 870 1397 m20 6 lw 930 1375 m 6 Y s 930 1407 m 6 Y s 900 1394 m 17 X s 943 1394 m 17 X s 3 lw 930 1394 m20 6 lw 990 1339 m 6 Y s 990 1371 m 5 Y s 960 1358 m 17 X s 1003 1358 m 17
 X s 3 lw 990 1358 m20 6 lw 1050 1234 m 5 Y s 1050 1265 m 5 Y s 1020 1252 m 17 X s 1063 1252 m 16 X s 3 lw 1050 1252 m20 6 lw 1109 1079 m 4 Y s 1109 1109 m 3 Y s 1079 1096 m 17 X s 1122 1096 m 17 X s 3 lw 1109 1096 m20 6 lw 1169 987 m 2 Y s 1169 1015
 m 3 Y s 1139 1002 m 17 X s 1182 1002 m 17 X s 3 lw 1169 1002 m20 6 lw 1229 935 m 2 Y s 1229 963 m 2 Y s 1199 950 m 17 X s 1242 950 m 17 X s 3 lw 1229 950 m20 6 lw 1288 901 m 1 Y s 1288 928 m 2 Y s 1259 915 m 16 X s 1301 915 m 17 X s 3 lw 1288 915
 m20 6 lw 1348 959 m 3 Y s 1348 988 m 2 Y s 1318 975 m 17 X s 1361 975 m 17 X s 3 lw 1348 975 m20 6 lw 1408 1104 m 3 Y s 1408 1133 m 4 Y s 1378 1120 m 17 X s 1421 1120 m 17 X s 3 lw 1408 1120 m20 6 lw 1468 1233 m 4 Y s 1468 1263 m 5 Y s 1438 1250 m
 17 X s 1481 1250 m 16 X s 3 lw 1468 1250 m20 6 lw 1527 1293 m 5 Y s 1527 1324 m 5 Y s 1497 1311 m 17 X s 1540 1311 m 17 X s 3 lw 1527 1311 m20 6 lw 1587 1371 m 6 Y s 1587 1403 m 6 Y s 1557 1390 m 17 X s 1600 1390 m 17 X s 3 lw 1587 1390 m20 6 lw
 1647 1375 m 6 Y s 1647 1407 m 6 Y s 1617 1394 m 17 X s 1660 1394 m 17 X s 3 lw 1647 1394 m20 6 lw 1706 1279 m 5 Y s 1706 1310 m 5 Y s 1677 1297 m 16 X s 1719 1297 m 17 X s 3 lw 1706 1297 m20 6 lw 1766 1062 m 3 Y s 1766 1091 m 3 Y s 1736 1078 m 17 X
 s 1779 1078 m 17 X s 3 lw 1766 1078 m20 6 lw 1826 843 m 1 Y s 1826 870 m 1 Y s 1796 857 m 17 X s 1839 857 m 17 X s 3 lw 1826 857 m20 6 lw 1856 651 m 17 X s 1899 651 m 16 X s 3 lw 1886 651 m20 6 lw 1915 482 m 17 X s 1958 482 m 17 X s 3 lw 1945 482
 m20 6 lw 1975 370 m 17 X s 2018 370 m 17 X s 3 lw 2005 370 m20 6 lw 2035 311 m 17 X s 2078 311 m 17 X s 3 lw 2065 311 m20 6 lw 2095 271 m 16 X s 2138 271 m 16 X s 3 lw 2124 271 m20 6 lw black 3 lw 1 1 1 c 680 231 794 461 bf 813 461 m -13 Y 674 X 224
 Y -13 X -211 Y f black 794 461 m 231 Y 680 X -231 Y -680 X cl s
 gsave  2268 1538 0 0 C 961.625 619 t 0 r /Helvetica findfont 45.615 sf 0 0 m 
 438 413 403 391 366 341 331 306 274 249 234 222 196 171 139 126 101 87 62 50 25
(before HqT reweighting) K NC gr  1 0 0 c 6 lw 819 634 m 119 X s black
 gsave  2268 1538 0 0 C 961.625 504.938 t 0 r /Helvetica findfont 45.615 sf 0 0 m 
 401 376 366 354 329 304 294 269 237 212 197 185 159 134 102 89 74 50 37 25
(after HqT reweighting) K NC gr  0 0 1 c 3 lw 879 519 m20 6 lw black
 gsave  2268 1538 0 0 C 2222.5 1117.5 t 90 r /Helvetica-BoldOblique findfont 29.3239 sf 0 0 m 
 317 303 287 271 263 240 213 205 186 167 159 140 118 95 87 67 59 38 17
(LHC HIGGS XS WG 2011) K NC gr 
 gr  gr showpage
end
%%EOF
