%!PS-Adobe-2.0 EPSF-2.0
%%BoundingBox:  0 0 567 384
%%Title: /home/dimicco/HiggsScan/compare_MCNLO_MCFM/etmiss.eps: canvas_EtMiss
%%Creator: ROOT Version 5.26/00
%%CreationDate: Fri Dec  9 14:58:37 2011
%%EndComments
%%BeginProlog
80 dict begin
/s {stroke} def /l {lineto} def /m {moveto} def /t {translate} def
/sw {stringwidth} def /r {rotate} def /rl {roll}  def /R {repeat} def
/d {rlineto} def /rm {rmoveto} def /gr {grestore} def /f {eofill} def
/c {setrgbcolor} def /black {0 setgray} def /sd {setdash} def
/cl {closepath} def /sf {scalefont setfont} def /lw {setlinewidth} def
/box {m dup 0 exch d exch 0 d 0 exch neg d cl} def
/NC{systemdict begin initclip end}def/C{NC box clip newpath}def
/bl {box s} def /bf {box f} def /Y { 0 exch d} def /X { 0 d} def 
/mp {newpath /y exch def /x exch def} def
/side {[w .77 mul w .23 mul] .385 w mul sd w 0 l currentpoint t -144 r} def
/mr {mp x y w2 0 360 arc} def /m24 {mr s} def /m20 {mr f} def
/mb {mp x y w2 add m w2 neg 0 d 0 w neg d w 0 d 0 w d cl} def
/mt {mp x y w2 add m w2 neg w neg d w 0 d cl} def
/m21 {mb f} def /m25 {mb s} def /m22 {mt f} def /m26{mt s} def
/m23 {mp x y w2 sub m w2 w d w neg 0 d cl f} def
/m27 {mp x y w2 add m w3 neg w2 neg d w3 w2 neg d w3 w2 d cl s} def
/m28 {mp x w2 sub y w2 sub w3 add m w3 0 d  0 w3 neg d w3 0 d 0 w3 d w3 0 d  0 w3 d w3 neg 0 d 0 w3 d w3 neg 0 d
 0 w3 neg d w3 neg 0 d cl s } def
/m29 {mp gsave x w2 sub y w2 add w3 sub m currentpoint t
 4 {side} repeat cl fill gr} def
/m30 {mp gsave x w2 sub y w2 add w3 sub m currentpoint t
 4 {side} repeat cl s gr} def
/m31 {mp x y w2 sub m 0 w d x w2 sub y m w 0 d x w2 sub y w2 add m w w neg d x w2 sub y w2
 sub m w w d s} def
/m2 {mp x y w2 sub m 0 w d x w2 sub y m w 0 d s} def
/m5 {mp x w2 sub y w2 sub m w w d x w2 sub y w2 add m w w neg d s} def
/reEncode {exch findfont dup length dict begin {1 index /FID eq  {pop pop} {def} ifelse } forall /Encoding exch def currentdict end dup /FontName get exch definefont pop } def [/Times-Bold /Times-Italic /Times-BoldItalic /Helvetica
 /Helvetica-Oblique /Helvetica-Bold /Helvetica-BoldOblique /Courier /Courier-Oblique /Courier-Bold /Courier-BoldOblique /Times-Roman /AvantGarde-Book /AvantGarde-BookOblique /AvantGarde-Demi /AvantGarde-DemiOblique /Bookman-Demi
 /Bookman-DemiItalic /Bookman-Light /Bookman-LightItalic /Helvetica-Narrow /Helvetica-Narrow-Bold /Helvetica-Narrow-BoldOblique /Helvetica-Narrow-Oblique /NewCenturySchlbk-Roman /NewCenturySchlbk-Bold
 /NewCenturySchlbk-BoldItalic /NewCenturySchlbk-Italic /Palatino-Bold /Palatino-BoldItalic /Palatino-Italic /Palatino-Roman ] {ISOLatin1Encoding reEncode } forall
/oshow {gsave [] 0 sd true charpath stroke gr} def
/stwn { /fs exch def /fn exch def /text exch def fn findfont fs sf
 text sw pop xs add /xs exch def} def
/stwb { /fs exch def /fn exch def /nbas exch def /textf exch deftextf length /tlen exch def nbas tlen gt {/nbas tlendef} iffn findfont fs sf textf dup length nbas sub nbas getinterval sw
pop neg xs add /xs exch def} def
%%EndProlog
%%BeginSetup
%%EndSetup
newpath  gsave  .25 .25 scale  gsave  0 0 t black[  ] 0 sd 3 lw 1 1 1 c 2268 1538 0 0 bf black 1 1 1 c 1791 1215 363 246 bf black 1791 1215 363 246 bl 1 1 1 c 1791 1215 363 246 bf black 1791 1215 363 246 bl 1 0 0 c 6 lw 1 1 1 c 1 0 0 c 918 1327 m 13
 Y s 918 1366 m 13 Y s 900 1353 m 5 X s 931 1353 m 5 X s 3 lw /w 29 def /w2 {w 2 div} def /w3 {w 3 div} def 918 1353 m20 6 lw 954 1286 m 13 Y s 954 1325 m 13 Y s 936 1312 m 5 X s 967 1312 m 5 X s 3 lw 954 1312 m20 6 lw 990 1308 m 13 Y s 990 1347 m
 13 Y s 972 1334 m 5 X s 1003 1334 m 5 X s 3 lw 990 1334 m20 6 lw 1026 1330 m 13 Y s 1026 1369 m 13 Y s 1008 1356 m 5 X s 1039 1356 m 5 X s 3 lw 1026 1356 m20 6 lw 1062 1351 m 13 Y s 1062 1390 m 13 Y s 1044 1377 m 4 X s 1075 1377 m 4 X s 3 lw 1062
 1377 m20 6 lw 1097 1310 m 13 Y s 1097 1349 m 13 Y s 1079 1336 m 5 X s 1110 1336 m 5 X s 3 lw 1097 1336 m20 6 lw 1133 1324 m 13 Y s 1133 1363 m 13 Y s 1115 1350 m 5 X s 1146 1350 m 5 X s 3 lw 1133 1350 m20 6 lw 1169 1308 m 13 Y s 1169 1347 m 13 Y s
 1151 1334 m 5 X s 1182 1334 m 5 X s 3 lw 1169 1334 m20 6 lw 1205 1216 m 12 Y s 1205 1254 m 12 Y s 1187 1241 m 5 X s 1218 1241 m 5 X s 3 lw 1205 1241 m20 6 lw 1241 1304 m 12 Y s 1241 1342 m 13 Y s 1223 1329 m 5 X s 1254 1329 m 5 X s 3 lw 1241 1329
 m20 6 lw 1276 1279 m 12 Y s 1276 1317 m 12 Y s 1259 1304 m 4 X s 1290 1304 m 4 X s 3 lw 1276 1304 m20 6 lw 1312 1204 m 11 Y s 1312 1241 m 12 Y s 1294 1228 m 5 X s 1325 1228 m 5 X s 3 lw 1312 1228 m20 6 lw 1348 1196 m 11 Y s 1348 1233 m 11 Y s 1330
 1220 m 5 X s 1361 1220 m 5 X s 3 lw 1348 1220 m20 6 lw 1384 1118 m 10 Y s 1384 1154 m 10 Y s 1366 1141 m 5 X s 1397 1141 m 5 X s 3 lw 1384 1141 m20 6 lw 1420 1084 m 10 Y s 1420 1120 m 10 Y s 1402 1107 m 5 X s 1433 1107 m 5 X s 3 lw 1420 1107 m20 6
 lw 1456 1068 m 9 Y s 1456 1103 m 10 Y s 1438 1090 m 5 X s 1469 1090 m 5 X s 3 lw 1456 1090 m20 6 lw 1491 1006 m 9 Y s 1491 1041 m 9 Y s 1474 1028 m 4 X s 1505 1028 m 4 X s 3 lw 1491 1028 m20 6 lw 1527 970 m 8 Y s 1527 1004 m 8 Y s 1509 991 m 5 X s
 1540 991 m 5 X s 3 lw 1527 991 m20 6 lw 1563 929 m 8 Y s 1563 963 m 7 Y s 1545 950 m 5 X s 1576 950 m 5 X s 3 lw 1563 950 m20 6 lw 1599 813 m 5 Y s 1599 844 m 6 Y s 1581 831 m 5 X s 1612 831 m 5 X s 3 lw 1599 831 m20 6 lw 1635 770 m 6 Y s 1635 802
 m 5 Y s 1617 789 m 5 X s 1648 789 m 5 X s 3 lw 1635 789 m20 6 lw 1671 740 m 4 Y s 1671 770 m 5 Y s 1653 757 m 5 X s 1684 757 m 5 X s 3 lw 1671 757 m20 6 lw 1706 700 m 3 Y s 1706 729 m 4 Y s 1689 716 m 4 X s 1719 716 m 5 X s 3 lw 1706 716 m20 6 lw
 1742 641 m 3 Y s 1742 670 m 2 Y s 1724 657 m 5 X s 1755 657 m 5 X s 3 lw 1742 657 m20 6 lw 1778 623 m 2 Y s 1778 651 m 2 Y s 1760 638 m 5 X s 1791 638 m 5 X s 3 lw 1778 638 m20 6 lw 1814 545 m 1 Y s 1814 572 m 1 Y s 1796 559 m 5 X s 1827 559 m 5 X
 s 3 lw 1814 559 m20 6 lw 1832 506 m 5 X s 1863 506 m 5 X s 3 lw 1850 506 m20 6 lw 1868 480 m 5 X s 1899 480 m 5 X s 3 lw 1886 480 m20 6 lw 1904 459 m 4 X s 1934 459 m 5 X s 3 lw 1921 459 m20 6 lw 1939 440 m 5 X s 1970 440 m 5 X s 3 lw 1957 440 m20
 6 lw 1975 430 m 5 X s 2006 430 m 5 X s 3 lw 1993 430 m20 6 lw 2011 405 m 5 X s 2042 405 m 5 X s 3 lw 2029 405 m20 6 lw 2047 374 m 5 X s 2078 374 m 5 X s 3 lw 2065 374 m20 6 lw 2083 355 m 5 X s 2114 355 m 5 X s 3 lw 2101 355 m20 6 lw 2119 360 m 4 X
 s 2149 360 m 5 X s 3 lw 2136 360 m20 6 lw black 3 lw 363 246 m 1791 X s
 gsave  2268 1538 0 0 C 1955 85 t 0 r /Helvetica findfont 71.6807 sf 0 0 m ( [GeV]) show NC gr 
 gsave  2268 1538 0 0 C 1854 121 t 0 r /Helvetica findfont 48.8732 sf 0 0 m (miss) show NC gr 
 gsave  2268 1538 0 0 C 1854 62 t 0 r /Helvetica findfont 48.8732 sf 0 0 m (T) show NC gr 
 gsave  2268 1538 0 0 C 1808 85 t 0 r /Helvetica findfont 71.6807 sf 0 0 m (E) show NC gr  363 283 m -37 Y s 399 264 m -18 Y s 434 264 m -18 Y s 470 264 m -18 Y s 506 264 m -18 Y s 542 283 m -37 Y s 578 264 m -18 Y s 614 264 m -18 Y s 649 264 m -18
 Y s 685 264 m -18 Y s 721 283 m -37 Y s 757 264 m -18 Y s 793 264 m -18 Y s 829 264 m -18 Y s 864 264 m -18 Y s 900 283 m -37 Y s 936 264 m -18 Y s 972 264 m -18 Y s 1008 264 m -18 Y s 1044 264 m -18 Y s 1079 283 m -37 Y s 1115 264 m -18 Y s 1151
 264 m -18 Y s 1187 264 m -18 Y s 1223 264 m -18 Y s 1259 283 m -37 Y s 1294 264 m -18 Y s 1330 264 m -18 Y s 1366 264 m -18 Y s 1402 264 m -18 Y s 1438 283 m -37 Y s 1474 264 m -18 Y s 1509 264 m -18 Y s 1545 264 m -18 Y s 1581 264 m -18 Y s 1617
 283 m -37 Y s 1653 264 m -18 Y s 1689 264 m -18 Y s 1724 264 m -18 Y s 1760 264 m -18 Y s 1796 283 m -37 Y s 1832 264 m -18 Y s 1868 264 m -18 Y s 1904 264 m -18 Y s 1939 264 m -18 Y s 1975 283 m -37 Y s 2011 264 m -18 Y s 2047 264 m -18 Y s 2083
 264 m -18 Y s 2119 264 m -18 Y s 2154 283 m -37 Y s
 gsave  2268 1538 0 0 C 342 179 t 0 r /Helvetica findfont 71.6807 sf 0 0 m (0) show NC gr 
 gsave  2268 1538 0 0 C 502 179 t 0 r /Helvetica findfont 71.6807 sf 0 0 m (10) show NC gr 
 gsave  2268 1538 0 0 C 681 179 t 0 r /Helvetica findfont 71.6807 sf 0 0 m (20) show NC gr 
 gsave  2268 1538 0 0 C 860 179 t 0 r /Helvetica findfont 71.6807 sf 0 0 m (30) show NC gr 
 gsave  2268 1538 0 0 C 1039 179 t 0 r /Helvetica findfont 71.6807 sf 0 0 m (40) show NC gr 
 gsave  2268 1538 0 0 C 1219 179 t 0 r /Helvetica findfont 71.6807 sf 0 0 m (50) show NC gr 
 gsave  2268 1538 0 0 C 1398 179 t 0 r /Helvetica findfont 71.6807 sf 0 0 m (60) show NC gr 
 gsave  2268 1538 0 0 C 1577 179 t 0 r /Helvetica findfont 71.6807 sf 0 0 m (70) show NC gr 
 gsave  2268 1538 0 0 C 1756 179 t 0 r /Helvetica findfont 71.6807 sf 0 0 m (80) show NC gr 
 gsave  2268 1538 0 0 C 1935 179 t 0 r /Helvetica findfont 71.6807 sf 0 0 m (90) show NC gr 
 gsave  2268 1538 0 0 C 2095 179 t 0 r /Helvetica findfont 71.6807 sf 0 0 m (100) show NC gr  363 1461 m 1791 X s 363 1425 m 36 Y s 399 1443 m 18 Y s 434 1443 m 18 Y s 470 1443 m 18 Y s 506 1443 m 18 Y s 542 1425 m 36 Y s 578 1443 m 18 Y s 614 1443
 m 18 Y s 649 1443 m 18 Y s 685 1443 m 18 Y s 721 1425 m 36 Y s 757 1443 m 18 Y s 793 1443 m 18 Y s 829 1443 m 18 Y s 864 1443 m 18 Y s 900 1425 m 36 Y s 936 1443 m 18 Y s 972 1443 m 18 Y s 1008 1443 m 18 Y s 1044 1443 m 18 Y s 1079 1425 m 36 Y s
 1115 1443 m 18 Y s 1151 1443 m 18 Y s 1187 1443 m 18 Y s 1223 1443 m 18 Y s 1259 1425 m 36 Y s 1294 1443 m 18 Y s 1330 1443 m 18 Y s 1366 1443 m 18 Y s 1402 1443 m 18 Y s 1438 1425 m 36 Y s 1474 1443 m 18 Y s 1509 1443 m 18 Y s 1545 1443 m 18 Y s
 1581 1443 m 18 Y s 1617 1425 m 36 Y s 1653 1443 m 18 Y s 1689 1443 m 18 Y s 1724 1443 m 18 Y s 1760 1443 m 18 Y s 1796 1425 m 36 Y s 1832 1443 m 18 Y s 1868 1443 m 18 Y s 1904 1443 m 18 Y s 1939 1443 m 18 Y s 1975 1425 m 36 Y s 2011 1443 m 18 Y s
 2047 1443 m 18 Y s 2083 1443 m 18 Y s 2119 1443 m 18 Y s 2154 1425 m 36 Y s 363 246 m 1215 Y s
 gsave  2268 1538 0 0 C 199 1030 t 90 r /Helvetica findfont 71.6807 sf 0 0 m (arbitrary units) show NC gr  417 246 m -54 X s 390 293 m -27 X s 390 340 m -27 X s 390 387 m -27 X s 390 434 m -27 X s 417 481 m -54 X s 390 528 m -27 X s 390 575 m -27 X
 s 390 622 m -27 X s 390 670 m -27 X s 417 717 m -54 X s 390 764 m -27 X s 390 811 m -27 X s 390 858 m -27 X s 390 905 m -27 X s 417 952 m -54 X s 390 999 m -27 X s 390 1046 m -27 X s 390 1093 m -27 X s 390 1140 m -27 X s 417 1187 m -54 X s 390 1234
 m -27 X s 390 1281 m -27 X s 390 1328 m -27 X s 390 1375 m -27 X s 417 1422 m -54 X s 417 1422 m -54 X s
 gsave  2268 1538 0 0 C 310 222 t 0 r /Helvetica findfont 71.6807 sf 0 0 m (0) show NC gr 
 gsave  2268 1538 0 0 C 222 456 t 0 r /Helvetica findfont 71.6807 sf 0 0 m (0.01) show NC gr 
 gsave  2268 1538 0 0 C 212 691 t 0 r /Helvetica findfont 71.6807 sf 0 0 m (0.02) show NC gr 
 gsave  2268 1538 0 0 C 212 929 t 0 r /Helvetica findfont 71.6807 sf 0 0 m (0.03) show NC gr 
 gsave  2268 1538 0 0 C 212 1163 t 0 r /Helvetica findfont 71.6807 sf 0 0 m (0.04) show NC gr 
 gsave  2268 1538 0 0 C 212 1398 t 0 r /Helvetica findfont 71.6807 sf 0 0 m (0.05) show NC gr  2154 246 m 1215 Y s 2101 246 m 53 X s 2127 293 m 27 X s 2127 340 m 27 X s 2127 387 m 27 X s 2127 434 m 27 X s 2101 481 m 53 X s 2127 528 m 27 X s 2127 575
 m 27 X s 2127 622 m 27 X s 2127 670 m 27 X s 2101 717 m 53 X s 2127 764 m 27 X s 2127 811 m 27 X s 2127 858 m 27 X s 2127 905 m 27 X s 2101 952 m 53 X s 2127 999 m 27 X s 2127 1046 m 27 X s 2127 1093 m 27 X s 2127 1140 m 27 X s 2101 1187 m 53 X s
 2127 1234 m 27 X s 2127 1281 m 27 X s 2127 1328 m 27 X s 2127 1375 m 27 X s 2101 1422 m 53 X s 2101 1422 m 53 X s 0 0 1 c 6 lw 1 1 1 c black 0 0 1 c 363 246 m 537 X 1088 Y 36 X -13 Y 36 X -9 Y 36 X 22 Y 36 X -21 Y 35 X 9 Y 36 X -12 Y 36 X -2 Y 36 X
 -13 Y 36 X -5 Y 36 X -26 Y 35 X -9 Y 36 X -44 Y 36 X -28 Y 36 X -42 Y 36 X -48 Y 36 X -38 Y 35 X -44 Y 36 X -62 Y 36 X -45 Y 36 X -74 Y 36 X -49 Y 36 X -51 Y 35 X -59 Y 36 X -57 Y 36 X -52 Y 36 X -43 Y 36 X -40 Y 36 X -30 Y 35 X -25 Y 36 X -18 Y 36
 X -19 Y 36 X -14 Y 36 X -12 Y 36 X -14 Y 35 X s 1 1 1 c 0 lw 707 228 1056 300 bf 3 lw 1075 300 m -13 Y 701 X 221 Y -13 X -208 Y f 0 lw 1056 300 m 228 Y 707 X -228 Y -707 X cl s black
 gsave  2268 1538 0 0 C 1232 440 t 0 r /Helvetica findfont 87.9718 sf 0 0 m (MCFM) show NC gr  1 1 1 c 3 lw 1082 431 m 124 X 80 Y -124 X f 0 lw 0 0 1 c 6 lw 1082 471 m 124 X s black 3 lw 1144 471 m20 6 lw
 gsave  2268 1538 0 0 C 1232 332 t 0 r /Helvetica findfont 87.9718 sf 0 0 m (MC@NLO) show NC gr  1 1 1 c 3 lw 1082 317 m 124 X 80 Y -124 X f 6 lw 1 0 0 c 1082 357 m 124 X s 3 lw 1144 357 m20 6 lw black
 gsave  2268 1538 0 0 C 2222 1118 t 90 r /Helvetica-BoldOblique findfont 29.3239 sf 0 0 m (LHC HIGGS XS WG 2011) show NC gr 
 gr  gr 
showpage
end
%%EOF
