%!PS-Adobe-3.0 EPSF-3.0
%%BoundingBox: (atend)
%%LanguageLevel: 2
%%Creator: Grace-5.1.22
%%CreationDate: Mon Dec 19 07:32:49 2011
%%DocumentData: Clean8Bit
%%Orientation: Portrait
%%Title: dsdeta_H_err_band.agr
%%For: laura
%%DocumentNeededResources: (atend)
%%EndComments
%%BeginProlog
/m {moveto} def
/l {lineto} def
/s {stroke} def
/n {newpath} def
/c {closepath} def
/RL {rlineto} def
/SLW {setlinewidth} def
/GS {gsave} def
/GR {grestore} def
/SC {setcolor} def
/SGRY {setgray} def
/SRGB {setrgbcolor} def
/SD {setdash} def
/SLC {setlinecap} def
/SLJ {setlinejoin} def
/SCS {setcolorspace} def
/FFSF {findfont setfont} def
/CC {concat} def
/PXL {n m 0 0 RL s} def
/Color0 {1.0000 1.0000 1.0000} def
/Color1 {0.0000 0.0000 0.0000} def
/Color2 {1.0000 0.0000 0.0000} def
/Color3 {0.0000 1.0000 0.0000} def
/Color4 {0.0000 0.0000 1.0000} def
/Color5 {1.0000 1.0000 0.0000} def
/Color6 {0.7373 0.5608 0.5608} def
/Color7 {0.8627 0.8627 0.8627} def
/Color8 {0.5804 0.0000 0.8275} def
/Color9 {0.0000 1.0000 1.0000} def
/Color10 {1.0000 0.0000 1.0000} def
/Color11 {1.0000 0.6471 0.0000} def
/Color12 {0.4471 0.1294 0.7373} def
/Color13 {0.4039 0.0275 0.2824} def
/Color14 {0.2510 0.8784 0.8157} def
/Color15 {0.0000 0.5451 0.0000} def
/Color16 {0.7529 0.7529 0.7529} def
/Color17 {0.5059 0.5059 0.5059} def
/Color18 {0.2588 0.2588 0.2588} def
/PTRN {
 /pat_bits exch def 
 <<
  /PaintType 2
  /PatternType 1 /TilingType 1
  /BBox[0 0 16 16]
  /XStep 16 /YStep 16
  /PaintProc {
   pop
   16 16 true [-1 0 0 -1 16 16] pat_bits imagemask
  }
 >>
 [0.0016 0 0 0.0016 0 0]
 makepattern
} def
/Pattern0 {<0000000000000000000000000000000000000000000000000000000000000000> PTRN} bind def
/Pattern1 {<ffffffffffffffffffffffffffffffffffffffffffffffffffffffffffffffff> PTRN} bind def
/Pattern2 {<eeeeffffbbbbffffeeeeffffbbbbffffeeeeffffbbbbffffeeeeffffbbbbffff> PTRN} bind def
/Pattern3 {<eeeebbbbeeeebbbbeeeebbbbeeeebbbbeeeebbbbeeeebbbbeeeebbbbeeeebbbb> PTRN} bind def
/Pattern4 {<5555aaaa5555aaaa5555aaaa5555aaaa5555aaaa5555aaaa5555aaaa5555aaaa> PTRN} bind def
/Pattern5 {<1111444411114444111144441111444411114444111144441111444411114444> PTRN} bind def
/Pattern6 {<1111000044440000111100004444000011110000444400001111000044440000> PTRN} bind def
/Pattern7 {<1010000000000000010100000000000010100000000000000101000000000000> PTRN} bind def
/Pattern8 {<0000000000000000000000000000000000000000000000000000000000000000> PTRN} bind def
/Pattern9 {<1e1e0f0f8787c3c3e1e1f0f078783c3c1e1e0f0f8787c3c3e1e1f0f078783c3c> PTRN} bind def
/Pattern10 {<7878f0f0e1e1c3c387870f0f1e1e3c3c7878f0f0e1e1c3c387870f0f1e1e3c3c> PTRN} bind def
/Pattern11 {<3333333333333333333333333333333333333333333333333333333333333333> PTRN} bind def
/Pattern12 {<ffffffff00000000ffffffff00000000ffffffff00000000ffffffff00000000> PTRN} bind def
/Pattern13 {<8181424224241818181824244242818181814242242418181818242442428181> PTRN} bind def
/Pattern14 {<8080404020201010080804040202010180804040202010100808040402020101> PTRN} bind def
/Pattern15 {<0101020204040808101020204040808001010202040408081010202040408080> PTRN} bind def
/Pattern16 {<2222222222222222222222222222222222222222222222222222222222222222> PTRN} bind def
/Pattern17 {<0000ffff000000000000ffff000000000000ffff000000000000ffff00000000> PTRN} bind def
/Pattern18 {<2222ffff222222222222ffff222222222222ffff222222222222ffff22222222> PTRN} bind def
/Pattern19 {<ffffffff33333333ffffffff33333333ffffffff33333333ffffffff33333333> PTRN} bind def
/Pattern20 {<0f0f0f0f0f0f0f0ff0f0f0f0f0f0f0f00f0f0f0f0f0f0f0ff0f0f0f0f0f0f0f0> PTRN} bind def
/Pattern21 {<ff00ff00ff00ff00ff00ff00ff00ff0000ff00ff00ff00ff00ff00ff00ff00ff> PTRN} bind def
/Pattern22 {<8001800180018001800180018001ffffffff8001800180018001800180018001> PTRN} bind def
/Pattern23 {<c003c003c003c003c003c003ffffffffffffffffc003c003c003c003c003c003> PTRN} bind def
/Pattern24 {<040404040404ffff404040404040ffff040404040404ffff404040404040ffff> PTRN} bind def
/Pattern25 {<180018001800180018001800ffffffff001800180018001800180018ffffffff> PTRN} bind def
/Pattern26 {<1111b8b87c7c3a3a1111a3a3c7c78b8b1111b8b87c7c3a3a1111a3a3c7c78b8b> PTRN} bind def
/Pattern27 {<101010102828c7c70101010182827c7c101010102828c7c70101010182827c7c> PTRN} bind def
/Pattern28 {<1c1c121211112121c1c12121111112121c1c121211112121c1c1212111111212> PTRN} bind def
/Pattern29 {<3e3e414180808080e3e31414080808083e3e414180808080e3e3141408080808> PTRN} bind def
/Pattern30 {<4848888884848383848488884848383848488888848483838484888848483838> PTRN} bind def
/Pattern31 {<03030404080808080c0c12122121c0c003030404080808080c0c12122121c0c0> PTRN} bind def
/ellipsedict 8 dict def
ellipsedict /mtrx matrix put
/EARC {
 ellipsedict begin
  /endangle exch def
  /startangle exch def
  /yrad exch def
  /xrad exch def
  /y exch def
  /x exch def
  /savematrix mtrx currentmatrix def
  x y translate
  xrad yrad scale
  0 0 1 startangle endangle arc
  savematrix setmatrix
 end
} def
/TL {
  /kcomp exch def
  /linewidth exch def
  /offset exch def
  GS
  0 offset rmoveto
  linewidth SLW
  dup stringwidth exch kcomp add exch RL s
  GR
} def
/KINIT
{
 /kvector exch def
 /kid 0 def
} def
/KPROC
{
 pop pop
 kvector kid get
 0 rmoveto
 /kid 1 kid add def
} def
/DefEncoding [
 /.notdef
 /.notdef
 /.notdef
 /.notdef
 /.notdef
 /.notdef
 /.notdef
 /.notdef
 /.notdef
 /.notdef
 /.notdef
 /.notdef
 /.notdef
 /.notdef
 /.notdef
 /.notdef
 /.notdef
 /.notdef
 /.notdef
 /.notdef
 /.notdef
 /.notdef
 /.notdef
 /.notdef
 /.notdef
 /.notdef
 /.notdef
 /.notdef
 /.notdef
 /.notdef
 /.notdef
 /.notdef
 /space
 /exclam
 /quotedbl
 /numbersign
 /dollar
 /percent
 /ampersand
 /quoteright
 /parenleft
 /parenright
 /asterisk
 /plus
 /comma
 /hyphen
 /period
 /slash
 /zero
 /one
 /two
 /three
 /four
 /five
 /six
 /seven
 /eight
 /nine
 /colon
 /semicolon
 /less
 /equal
 /greater
 /question
 /at
 /A
 /B
 /C
 /D
 /E
 /F
 /G
 /H
 /I
 /J
 /K
 /L
 /M
 /N
 /O
 /P
 /Q
 /R
 /S
 /T
 /U
 /V
 /W
 /X
 /Y
 /Z
 /bracketleft
 /backslash
 /bracketright
 /asciicircum
 /underscore
 /grave
 /a
 /b
 /c
 /d
 /e
 /f
 /g
 /h
 /i
 /j
 /k
 /l
 /m
 /n
 /o
 /p
 /q
 /r
 /s
 /t
 /u
 /v
 /w
 /x
 /y
 /z
 /braceleft
 /bar
 /braceright
 /asciitilde
 /.notdef
 /.notdef
 /.notdef
 /.notdef
 /.notdef
 /.notdef
 /.notdef
 /.notdef
 /.notdef
 /.notdef
 /.notdef
 /.notdef
 /.notdef
 /.notdef
 /.notdef
 /.notdef
 /.notdef
 /.notdef
 /.notdef
 /.notdef
 /.notdef
 /.notdef
 /.notdef
 /.notdef
 /.notdef
 /.notdef
 /.notdef
 /.notdef
 /.notdef
 /.notdef
 /.notdef
 /.notdef
 /.notdef
 /space
 /exclamdown
 /cent
 /sterling
 /currency
 /yen
 /brokenbar
 /section
 /dieresis
 /copyright
 /ordfeminine
 /guillemotleft
 /logicalnot
 /hyphen
 /registered
 /macron
 /degree
 /plusminus
 /twosuperior
 /threesuperior
 /acute
 /mu
 /paragraph
 /periodcentered
 /cedilla
 /onesuperior
 /ordmasculine
 /guillemotright
 /onequarter
 /onehalf
 /threequarters
 /questiondown
 /Agrave
 /Aacute
 /Acircumflex
 /Atilde
 /Adieresis
 /Aring
 /AE
 /Ccedilla
 /Egrave
 /Eacute
 /Ecircumflex
 /Edieresis
 /Igrave
 /Iacute
 /Icircumflex
 /Idieresis
 /Eth
 /Ntilde
 /Ograve
 /Oacute
 /Ocircumflex
 /Otilde
 /Odieresis
 /multiply
 /Oslash
 /Ugrave
 /Uacute
 /Ucircumflex
 /Udieresis
 /Yacute
 /Thorn
 /germandbls
 /agrave
 /aacute
 /acircumflex
 /atilde
 /adieresis
 /aring
 /ae
 /ccedilla
 /egrave
 /eacute
 /ecircumflex
 /edieresis
 /igrave
 /iacute
 /icircumflex
 /idieresis
 /eth
 /ntilde
 /ograve
 /oacute
 /ocircumflex
 /otilde
 /odieresis
 /divide
 /oslash
 /ugrave
 /uacute
 /ucircumflex
 /udieresis
 /yacute
 /thorn
 /ydieresis
] def
%%EndProlog
%%BeginSetup
%%EndSetup
612.00 612.00 scale
n
0.0000 0.0000 m
0.0000 1.0000 l
1.2941 1.0000 l
1.2941 0.0000 l
c
[/DeviceRGB] SCS
Color0 SC
fill
[/DeviceRGB] SCS
Color1 SC
[] 0 SD
0.0030 SLW
0 SLC
0 SLJ
n
0.1499 0.3007 m
0.1500 0.3007 l
0.1500 0.3359 l
0.1750 0.3359 l
0.1750 0.3835 l
0.2000 0.3835 l
0.2000 0.4016 l
0.2250 0.4016 l
0.2250 0.4436 l
0.2500 0.4436 l
0.2500 0.4752 l
0.2750 0.4752 l
0.2750 0.5047 l
0.3000 0.5047 l
0.3000 0.5328 l
0.3250 0.5328 l
0.3250 0.5574 l
0.3500 0.5574 l
0.3500 0.5785 l
0.3750 0.5785 l
0.3750 0.5945 l
0.4000 0.5945 l
0.4000 0.6125 l
0.4250 0.6125 l
0.4250 0.6238 l
0.4500 0.6238 l
0.4500 0.6391 l
0.4750 0.6391 l
0.4750 0.6402 l
0.5000 0.6402 l
0.5000 0.6466 l
0.5250 0.6466 l
0.5250 0.6484 l
0.5500 0.6484 l
0.5500 0.6516 l
0.5750 0.6516 l
0.5750 0.6474 l
0.6000 0.6474 l
0.6000 0.6496 l
0.6250 0.6496 l
0.6250 0.6475 l
0.6500 0.6475 l
0.6500 0.6483 l
0.6750 0.6483 l
0.6750 0.6438 l
0.7000 0.6438 l
0.7000 0.6437 l
0.7250 0.6437 l
0.7250 0.6417 l
0.7500 0.6417 l
0.7500 0.6389 l
0.7750 0.6389 l
0.7750 0.6313 l
0.8000 0.6313 l
0.8000 0.6265 l
0.8250 0.6265 l
0.8250 0.6169 l
0.8500 0.6169 l
0.8500 0.5942 l
0.8750 0.5942 l
0.8750 0.5786 l
0.9000 0.5786 l
0.9000 0.5615 l
0.9250 0.5615 l
0.9250 0.5351 l
0.9500 0.5351 l
0.9500 0.5077 l
0.9750 0.5077 l
0.9750 0.4709 l
1.0000 0.4709 l
1.0000 0.4520 l
1.0250 0.4520 l
1.0250 0.4205 l
1.0500 0.4205 l
1.0500 0.3828 l
1.0750 0.3828 l
1.0750 0.3349 l
1.1000 0.3349 l
1.1000 0.2968 l
1.1250 0.2968 l
1.1250 0.2498 l
1.1500 0.2498 l
1.1500 0.1870 l
1.1501 0.1870 l
s
[/DeviceRGB] SCS
Color2 SC
n
0.1499 0.2670 m
0.1500 0.2670 l
0.1500 0.3343 l
0.1750 0.3343 l
0.1750 0.3633 l
0.2000 0.3633 l
0.2000 0.3968 l
0.2250 0.3968 l
0.2250 0.4287 l
0.2500 0.4287 l
0.2500 0.4610 l
0.2750 0.4610 l
0.2750 0.4958 l
0.3000 0.4958 l
0.3000 0.5163 l
0.3250 0.5163 l
0.3250 0.5411 l
0.3500 0.5411 l
0.3500 0.5708 l
0.3750 0.5708 l
0.3750 0.5880 l
0.4000 0.5880 l
0.4000 0.5963 l
0.4250 0.5963 l
0.4250 0.6170 l
0.4500 0.6170 l
0.4500 0.6277 l
0.4750 0.6277 l
0.4750 0.6329 l
0.5000 0.6329 l
0.5000 0.6401 l
0.5250 0.6401 l
0.5250 0.6422 l
0.5500 0.6422 l
0.5500 0.6414 l
0.5750 0.6414 l
0.5750 0.6390 l
0.6000 0.6390 l
0.6000 0.6407 l
0.6250 0.6407 l
0.6250 0.6435 l
0.6500 0.6435 l
0.6500 0.6409 l
0.6750 0.6409 l
0.6750 0.6394 l
0.7000 0.6394 l
0.7000 0.6338 l
0.7250 0.6338 l
0.7250 0.6350 l
0.7500 0.6350 l
0.7500 0.6305 l
0.7750 0.6305 l
0.7750 0.6215 l
0.8000 0.6215 l
0.8000 0.6176 l
0.8250 0.6176 l
0.8250 0.6060 l
0.8500 0.6060 l
0.8500 0.5915 l
0.8750 0.5915 l
0.8750 0.5683 l
0.9000 0.5683 l
0.9000 0.5454 l
0.9250 0.5454 l
0.9250 0.5199 l
0.9500 0.5199 l
0.9500 0.4850 l
0.9750 0.4850 l
0.9750 0.4578 l
1.0000 0.4578 l
1.0000 0.4293 l
1.0250 0.4293 l
1.0250 0.4040 l
1.0500 0.4040 l
1.0500 0.3530 l
1.0750 0.3530 l
1.0750 0.2959 l
1.1000 0.2959 l
1.1000 0.2924 l
1.1250 0.2924 l
1.1250 0.2691 l
1.1500 0.2691 l
1.1500 0.2142 l
1.1501 0.2142 l
s
n
0.1499 0.3198 m
0.1500 0.3198 l
0.1500 0.3808 l
0.1750 0.3808 l
0.1750 0.4005 l
0.2000 0.4005 l
0.2000 0.4063 l
0.2250 0.4063 l
0.2250 0.4384 l
0.2500 0.4384 l
0.2500 0.4820 l
0.2750 0.4820 l
0.2750 0.5050 l
0.3000 0.5050 l
0.3000 0.5267 l
0.3250 0.5267 l
0.3250 0.5532 l
0.3500 0.5532 l
0.3500 0.5763 l
0.3750 0.5763 l
0.3750 0.5972 l
0.4000 0.5972 l
0.4000 0.6179 l
0.4250 0.6179 l
0.4250 0.6330 l
0.4500 0.6330 l
0.4500 0.6364 l
0.4750 0.6364 l
0.4750 0.6464 l
0.5000 0.6464 l
0.5000 0.6519 l
0.5250 0.6519 l
0.5250 0.6574 l
0.5500 0.6574 l
0.5500 0.6542 l
0.5750 0.6542 l
0.5750 0.6504 l
0.6000 0.6504 l
0.6000 0.6524 l
0.6250 0.6524 l
0.6250 0.6528 l
0.6500 0.6528 l
0.6500 0.6550 l
0.6750 0.6550 l
0.6750 0.6491 l
0.7000 0.6491 l
0.7000 0.6434 l
0.7250 0.6434 l
0.7250 0.6497 l
0.7500 0.6497 l
0.7500 0.6422 l
0.7750 0.6422 l
0.7750 0.6372 l
0.8000 0.6372 l
0.8000 0.6335 l
0.8250 0.6335 l
0.8250 0.6218 l
0.8500 0.6218 l
0.8500 0.6041 l
0.8750 0.6041 l
0.8750 0.5791 l
0.9000 0.5791 l
0.9000 0.5668 l
0.9250 0.5668 l
0.9250 0.5366 l
0.9500 0.5366 l
0.9500 0.4998 l
0.9750 0.4998 l
0.9750 0.4757 l
1.0000 0.4757 l
1.0000 0.4320 l
1.0250 0.4320 l
1.0250 0.4300 l
1.0500 0.4300 l
1.0500 0.3682 l
1.0750 0.3682 l
1.0750 0.3270 l
1.1000 0.3270 l
1.1000 0.3286 l
1.1250 0.3286 l
1.1250 0.2874 l
1.1500 0.2874 l
1.1500 0.2380 l
1.1501 0.2380 l
s
[/DeviceRGB] SCS
Color4 SC
n
0.1500 0.1499 m
0.1500 0.2107 l
0.1750 0.2107 l
0.1750 0.2569 l
0.2000 0.2569 l
0.2000 0.3196 l
0.2250 0.3196 l
0.2250 0.3805 l
0.2500 0.3805 l
0.2500 0.4257 l
0.2750 0.4257 l
0.2750 0.4715 l
0.3000 0.4715 l
0.3000 0.4850 l
0.3250 0.4850 l
0.3250 0.5211 l
0.3500 0.5211 l
0.3500 0.5529 l
0.3750 0.5529 l
0.3750 0.5731 l
0.4000 0.5731 l
0.4000 0.5759 l
0.4250 0.5759 l
0.4250 0.5973 l
0.4500 0.5973 l
0.4500 0.6165 l
0.4750 0.6165 l
0.4750 0.6219 l
0.5000 0.6219 l
0.5000 0.6282 l
0.5250 0.6282 l
0.5250 0.6281 l
0.5500 0.6281 l
0.5500 0.6307 l
0.5750 0.6307 l
0.5750 0.6264 l
0.6000 0.6264 l
0.6000 0.6302 l
0.6250 0.6302 l
0.6250 0.6330 l
0.6500 0.6330 l
0.6500 0.6282 l
0.6750 0.6282 l
0.6750 0.6269 l
0.7000 0.6269 l
0.7000 0.6209 l
0.7250 0.6209 l
0.7250 0.6168 l
0.7500 0.6168 l
0.7500 0.6172 l
0.7750 0.6172 l
0.7750 0.6005 l
0.8000 0.6005 l
0.8000 0.5962 l
0.8250 0.5962 l
0.8250 0.5903 l
0.8500 0.5903 l
0.8500 0.5744 l
0.8750 0.5744 l
0.8750 0.5458 l
0.9000 0.5458 l
0.9000 0.5276 l
0.9250 0.5276 l
0.9250 0.4883 l
0.9500 0.4883 l
0.9500 0.4535 l
0.9750 0.4535 l
0.9750 0.4340 l
1.0000 0.4340 l
1.0000 0.3786 l
1.0250 0.3786 l
1.0250 0.3579 l
1.0500 0.3579 l
1.0500 0.2772 l
1.0750 0.2772 l
1.0750 0.1499 l
s
n
1.1000 0.1499 m
1.1000 0.2074 l
1.1250 0.2074 l
1.1250 0.1499 l
s
n
0.1499 0.3580 m
0.1500 0.3580 l
0.1500 0.4143 l
0.1750 0.4143 l
0.1750 0.4418 l
0.2000 0.4418 l
0.2000 0.4387 l
0.2250 0.4387 l
0.2250 0.4632 l
0.2500 0.4632 l
0.2500 0.5028 l
0.2750 0.5028 l
0.2750 0.5226 l
0.3000 0.5226 l
0.3000 0.5507 l
0.3250 0.5507 l
0.3250 0.5720 l
0.3500 0.5720 l
0.3500 0.5972 l
0.3750 0.5972 l
0.3750 0.6097 l
0.4000 0.6097 l
0.4000 0.6322 l
0.4250 0.6322 l
0.4250 0.6456 l
0.4500 0.6456 l
0.4500 0.6514 l
0.4750 0.6514 l
0.4750 0.6543 l
0.5000 0.6543 l
0.5000 0.6614 l
0.5250 0.6614 l
0.5250 0.6691 l
0.5500 0.6691 l
0.5500 0.6623 l
0.5750 0.6623 l
0.5750 0.6604 l
0.6000 0.6604 l
0.6000 0.6605 l
0.6250 0.6605 l
0.6250 0.6624 l
0.6500 0.6624 l
0.6500 0.6648 l
0.6750 0.6648 l
0.6750 0.6605 l
0.7000 0.6605 l
0.7000 0.6549 l
0.7250 0.6549 l
0.7250 0.6651 l
0.7500 0.6651 l
0.7500 0.6534 l
0.7750 0.6534 l
0.7750 0.6530 l
0.8000 0.6530 l
0.8000 0.6504 l
0.8250 0.6504 l
0.8250 0.6345 l
0.8500 0.6345 l
0.8500 0.6177 l
0.8750 0.6177 l
0.8750 0.5984 l
0.9000 0.5984 l
0.9000 0.5799 l
0.9250 0.5799 l
0.9250 0.5560 l
0.9500 0.5560 l
0.9500 0.5248 l
0.9750 0.5248 l
0.9750 0.4917 l
1.0000 0.4917 l
1.0000 0.4786 l
1.0250 0.4786 l
1.0250 0.4563 l
1.0500 0.4563 l
1.0500 0.4278 l
1.0750 0.4278 l
1.0750 0.3819 l
1.1000 0.3819 l
1.1000 0.3614 l
1.1250 0.3614 l
1.1250 0.3293 l
1.1500 0.3293 l
1.1500 0.3254 l
1.1501 0.3254 l
s
[/DeviceRGB] SCS
Color1 SC
[] 0 SD
0.0015 SLW
n
0.1500 0.1500 m
1.1500 0.1500 l
s
n
0.1500 0.8500 m
1.1500 0.8500 l
s
[] 0 SD
0.0030 SLW
n
0.2750 0.1500 m
0.2750 0.1600 l
s
n
0.2750 0.8500 m
0.2750 0.8400 l
s
n
0.5250 0.1500 m
0.5250 0.1600 l
s
n
0.5250 0.8500 m
0.5250 0.8400 l
s
n
0.7750 0.1500 m
0.7750 0.1600 l
s
n
0.7750 0.8500 m
0.7750 0.8400 l
s
n
1.0250 0.1500 m
1.0250 0.1600 l
s
n
1.0250 0.8500 m
1.0250 0.8400 l
s
n
0.1500 0.1500 m
0.1500 0.1700 l
s
n
0.1500 0.8500 m
0.1500 0.8300 l
s
n
0.4000 0.1500 m
0.4000 0.1700 l
s
n
0.4000 0.8500 m
0.4000 0.8300 l
s
n
0.6500 0.1500 m
0.6500 0.1700 l
s
n
0.6500 0.8500 m
0.6500 0.8300 l
s
n
0.9000 0.1500 m
0.9000 0.1700 l
s
n
0.9000 0.8500 m
0.9000 0.8300 l
s
n
1.1500 0.1500 m
1.1500 0.1700 l
s
n
1.1500 0.8500 m
1.1500 0.8300 l
s
/Times-Roman findfont
dup length dict begin
 {1 index /FID ne {def} {pop pop} ifelse} forall
 /Encoding DefEncoding def
 currentdict
end
/Font0 exch definefont pop
/Font0 FFSF
0.1363 0.1169 m
GS
[0.0344 0.0000 0.0000 0.0344 0 0] CC
(-4) show
GR
/Font0 FFSF
0.3861 0.1169 m
GS
[0.0344 0.0000 0.0000 0.0344 0 0] CC
(-2) show
GR
/Font0 FFSF
0.6418 0.1169 m
GS
[0.0344 0.0000 0.0000 0.0344 0 0] CC
(0) show
GR
/Font0 FFSF
0.8918 0.1169 m
GS
[0.0344 0.0000 0.0000 0.0344 0 0] CC
(2) show
GR
/Font0 FFSF
1.1420 0.1169 m
GS
[0.0344 0.0000 0.0000 0.0344 0 0] CC
(4) show
GR
/Symbol findfont
/Font12 exch definefont pop
/Font12 FFSF
0.6308 0.0693 m
GS
[0.0344 0.0000 0.0000 0.0344 0 0] CC
(h) show
GR
/Font12 FFSF
0.6516 0.0900 m
GS
[0.0244 0.0000 0.0000 0.0244 0 0] CC
(H) show
GR
[] 0 SD
0.0015 SLW
n
0.1500 0.1500 m
0.1500 0.8500 l
s
n
1.1500 0.1500 m
1.1500 0.8500 l
s
[] 0 SD
0.0030 SLW
n
0.1500 0.2138 m
0.1600 0.2138 l
s
n
1.1500 0.2138 m
1.1400 0.2138 l
s
n
0.1500 0.2512 m
0.1600 0.2512 l
s
n
1.1500 0.2512 m
1.1400 0.2512 l
s
n
0.1500 0.2777 m
0.1600 0.2777 l
s
n
1.1500 0.2777 m
1.1400 0.2777 l
s
n
0.1500 0.2982 m
0.1600 0.2982 l
s
n
1.1500 0.2982 m
1.1400 0.2982 l
s
n
0.1500 0.3150 m
0.1600 0.3150 l
s
n
1.1500 0.3150 m
1.1400 0.3150 l
s
n
0.1500 0.3292 m
0.1600 0.3292 l
s
n
1.1500 0.3292 m
1.1400 0.3292 l
s
n
0.1500 0.3415 m
0.1600 0.3415 l
s
n
1.1500 0.3415 m
1.1400 0.3415 l
s
n
0.1500 0.3524 m
0.1600 0.3524 l
s
n
1.1500 0.3524 m
1.1400 0.3524 l
s
n
0.1500 0.3621 m
0.1600 0.3621 l
s
n
1.1500 0.3621 m
1.1400 0.3621 l
s
n
0.1500 0.4259 m
0.1600 0.4259 l
s
n
1.1500 0.4259 m
1.1400 0.4259 l
s
n
0.1500 0.4632 m
0.1600 0.4632 l
s
n
1.1500 0.4632 m
1.1400 0.4632 l
s
n
0.1500 0.4897 m
0.1600 0.4897 l
s
n
1.1500 0.4897 m
1.1400 0.4897 l
s
n
0.1500 0.5103 m
0.1600 0.5103 l
s
n
1.1500 0.5103 m
1.1400 0.5103 l
s
n
0.1500 0.5271 m
0.1600 0.5271 l
s
n
1.1500 0.5271 m
1.1400 0.5271 l
s
n
0.1500 0.5413 m
0.1600 0.5413 l
s
n
1.1500 0.5413 m
1.1400 0.5413 l
s
n
0.1500 0.5536 m
0.1600 0.5536 l
s
n
1.1500 0.5536 m
1.1400 0.5536 l
s
n
0.1500 0.5644 m
0.1600 0.5644 l
s
n
1.1500 0.5644 m
1.1400 0.5644 l
s
n
0.1500 0.5741 m
0.1600 0.5741 l
s
n
1.1500 0.5741 m
1.1400 0.5741 l
s
n
0.1500 0.6379 m
0.1600 0.6379 l
s
n
1.1500 0.6379 m
1.1400 0.6379 l
s
n
0.1500 0.6753 m
0.1600 0.6753 l
s
n
1.1500 0.6753 m
1.1400 0.6753 l
s
n
0.1500 0.7018 m
0.1600 0.7018 l
s
n
1.1500 0.7018 m
1.1400 0.7018 l
s
n
0.1500 0.7223 m
0.1600 0.7223 l
s
n
1.1500 0.7223 m
1.1400 0.7223 l
s
n
0.1500 0.7391 m
0.1600 0.7391 l
s
n
1.1500 0.7391 m
1.1400 0.7391 l
s
n
0.1500 0.7533 m
0.1600 0.7533 l
s
n
1.1500 0.7533 m
1.1400 0.7533 l
s
n
0.1500 0.7656 m
0.1600 0.7656 l
s
n
1.1500 0.7656 m
1.1400 0.7656 l
s
n
0.1500 0.7765 m
0.1600 0.7765 l
s
n
1.1500 0.7765 m
1.1400 0.7765 l
s
n
0.1500 0.7862 m
0.1600 0.7862 l
s
n
1.1500 0.7862 m
1.1400 0.7862 l
s
n
0.1500 0.8500 m
0.1600 0.8500 l
s
n
1.1500 0.8500 m
1.1400 0.8500 l
s
n
0.1500 0.1500 m
0.1700 0.1500 l
s
n
1.1500 0.1500 m
1.1300 0.1500 l
s
n
0.1500 0.3621 m
0.1700 0.3621 l
s
n
1.1500 0.3621 m
1.1300 0.3621 l
s
n
0.1500 0.5741 m
0.1700 0.5741 l
s
n
1.1500 0.5741 m
1.1300 0.5741 l
s
n
0.1500 0.7862 m
0.1700 0.7862 l
s
n
1.1500 0.7862 m
1.1300 0.7862 l
s
/Font0 FFSF
0.0533 0.1392 m
GS
[0.0328 0.0000 0.0000 0.0328 0 0] CC
(0.0001) show
GR
/Font0 FFSF
0.0698 0.3513 m
GS
[0.0328 0.0000 0.0000 0.0328 0 0] CC
(0.001) show
GR
/Font0 FFSF
0.0863 0.5633 m
GS
[0.0328 0.0000 0.0000 0.0328 0 0] CC
(0.01) show
GR
/Font0 FFSF
0.1024 0.7754 m
GS
[0.0328 0.0000 0.0000 0.0328 0 0] CC
(0.1) show
GR
/Font0 FFSF
0.0363 0.4180 m
GS
[0.0000 0.0322 -0.0322 0.0000 0 0] CC
(d) show
GR
/Font12 FFSF
0.0363 0.4341 m
GS
[0.0000 0.0322 -0.0322 0.0000 0 0] CC
(s) show
GR
/Font0 FFSF
0.0363 0.4537 m
GS
[0.0000 0.0322 -0.0322 0.0000 0 0] CC
(/d) show
GR
/Font12 FFSF
0.0363 0.4788 m
GS
[0.0000 0.0322 -0.0322 0.0000 0 0] CC
(h) show
GR
/Font0 FFSF
0.0170 0.4984 m
GS
[0.0000 0.0228 -0.0228 0.0000 0 0] CC
(H) show
GR
/Font0 FFSF
0.0363 0.5149 m
GS
[0.0000 0.0322 -0.0322 0.0000 0 0] CC
(  [pb]) show
GR
/Font0 FFSF
1.1892 0.5475 m
GS
[0.0000 0.0280 -0.0280 0.0000 0 0] CC
(LHC HIGGS XS WG 2011) show
GR
n
0.1500 0.1500 m
0.1500 0.8500 l
1.1500 0.8500 l
1.1500 0.1500 l
0.1500 0.1500 l
c
s
n
0.8187 0.8030 m
0.8187 0.6924 l
1.1159 0.6924 l
1.1159 0.8030 l
c
[/DeviceRGB] SCS
Color0 SC
fill
[/DeviceRGB] SCS
Color1 SC
n
0.8187 0.8030 m
0.8187 0.6924 l
1.1159 0.6924 l
1.1159 0.8030 l
0.8187 0.8030 l
c
s
/Font0 FFSF
0.8902 0.7698 m
GS
[0.0339 0.0000 0.0000 0.0339 0 0] CC
(central value) show
GR
n
0.8302 0.7812 m
0.8702 0.7812 l
s
/Font0 FFSF
0.8902 0.7363 m
GS
[0.0339 0.0000 0.0000 0.0339 0 0] CC
(error from scale) show
GR
[/DeviceRGB] SCS
Color2 SC
n
0.8302 0.7477 m
0.8702 0.7477 l
s
/Font0 FFSF
[/DeviceRGB] SCS
Color1 SC
0.8902 0.7028 m
GS
[0.0339 0.0000 0.0000 0.0339 0 0] CC
(total error) show
GR
[/DeviceRGB] SCS
Color4 SC
n
0.8302 0.7141 m
0.8702 0.7141 l
s
/Font0 FFSF
[/DeviceRGB] SCS
Color1 SC
0.5507 0.3517 m
GS
[0.0367 0.0000 0.0000 0.0367 0 0] CC
(LHC at 7 TeV) show
GR
%%Trailer
%%BoundingBox: 0 36 730 523
%%DocumentNeededResources: font Times-Roman
%%+ font Symbol
%%EOF
