%!PS-Adobe-1.0
%%Creator: Unified Graphics System
%%Pages: (atend)
%%DocumentFonts: Helvetica
%%BoundingBox:   60   72  318  337
%%EndComments
/Sw{setlinewidth}def
/Sg{setgray}def
/Sd{setdash}def
/P {newpath
    moveto
0 0 rlineto
    stroke}def
/M {moveto}def
/D {lineto}def
/N {newpath}def
/S {stroke}def
/T {/Helvetica findfont
    exch
    scalefont
    setfont}def
/R {rotate}def
/W {show}def
/F {fill}def
/X {gsave}def
/Y {grestore}def
%%EndProlog
%%Page: 1 1
0.12000 0.12000 scale
1 setlinecap
1 setlinejoin
8 Sw
0.00 0.00 0.00 setrgbcolor
[] 0 Sd
N
545 1453 M
621 1453 D
S
N
545 1456 M
621 1456 D
S
N
581 1453 M
574 1445 D
571 1438 D
571 1431 D
574 1420 D
581 1413 D
592 1409 D
599 1409 D
610 1413 D
617 1420 D
621 1431 D
621 1438 D
617 1445 D
610 1453 D
S
N
571 1431 M
574 1424 D
581 1417 D
592 1413 D
599 1413 D
610 1417 D
617 1424 D
621 1431 D
S
N
545 1442 M
545 1456 D
S
N
621 1453 M
621 1467 D
S
N
571 1543 M
571 1507 D
574 1496 D
585 1489 D
596 1485 D
607 1485 D
614 1489 D
617 1492 D
621 1499 D
621 1507 D
617 1517 D
607 1525 D
596 1528 D
585 1528 D
578 1525 D
574 1521 D
571 1514 D
S
N
571 1507 M
574 1499 D
585 1492 D
596 1489 D
610 1489 D
617 1492 D
S
N
621 1507 M
617 1514 D
607 1521 D
596 1525 D
581 1525 D
574 1521 D
S
N
574 1521 M
574 1543 D
S
N
531 1622 M
646 1557 D
S
N
545 1683 M
621 1683 D
S
N
545 1687 M
621 1687 D
S
N
581 1683 M
574 1676 D
571 1669 D
571 1662 D
574 1651 D
581 1644 D
592 1640 D
599 1640 D
610 1644 D
617 1651 D
621 1662 D
621 1669 D
617 1676 D
610 1683 D
S
N
571 1662 M
574 1654 D
581 1647 D
592 1644 D
599 1644 D
610 1647 D
617 1654 D
621 1662 D
S
N
545 1672 M
545 1687 D
S
N
621 1683 M
621 1698 D
S
N
571 1723 M
646 1723 D
S
N
571 1727 M
646 1727 D
S
N
581 1727 M
574 1734 D
571 1741 D
571 1748 D
574 1759 D
581 1766 D
592 1770 D
599 1770 D
610 1766 D
617 1759 D
621 1748 D
621 1741 D
617 1734 D
610 1727 D
S
N
571 1748 M
574 1755 D
581 1763 D
592 1766 D
599 1766 D
610 1763 D
617 1755 D
621 1748 D
S
N
571 1712 M
571 1727 D
S
N
646 1712 M
646 1737 D
S
N
599 1807 M
650 1807 D
S
N
599 1809 M
650 1809 D
S
N
599 1793 M
614 1790 D
599 1790 D
599 1826 D
614 1826 D
599 1824 D
S
N
650 1800 M
650 1817 D
S
N
650 1843 M
647 1841 D
645 1843 D
647 1845 D
652 1845 D
657 1843 D
659 1841 D
S
N
599 1867 M
650 1867 D
S
N
599 1869 M
650 1869 D
S
N
623 1869 M
619 1874 D
616 1879 D
616 1884 D
619 1891 D
623 1896 D
631 1898 D
635 1898 D
643 1896 D
647 1891 D
650 1884 D
650 1879 D
647 1874 D
643 1869 D
S
N
616 1884 M
619 1889 D
623 1894 D
631 1896 D
635 1896 D
643 1894 D
647 1889 D
650 1884 D
S
N
599 1860 M
599 1869 D
S
N
531 1982 M
646 1982 D
S
N
531 1986 M
646 1986 D
S
N
531 1982 M
531 2008 D
S
N
646 1982 M
646 2008 D
S
N
549 2055 M
553 2051 D
556 2055 D
553 2058 D
549 2058 D
545 2055 D
545 2047 D
549 2040 D
556 2036 D
621 2036 D
S
N
545 2047 M
549 2044 D
556 2040 D
621 2040 D
S
N
571 2026 M
571 2055 D
S
N
621 2026 M
621 2051 D
S
N
545 2083 M
621 2083 D
S
N
545 2087 M
621 2087 D
S
N
581 2087 M
574 2094 D
571 2101 D
571 2109 D
574 2119 D
581 2127 D
592 2130 D
599 2130 D
610 2127 D
617 2119 D
621 2109 D
621 2101 D
617 2094 D
610 2087 D
S
N
571 2109 M
574 2116 D
581 2123 D
592 2127 D
599 2127 D
610 2123 D
617 2116 D
621 2109 D
S
N
545 2073 M
545 2087 D
S
N
531 2213 M
646 2148 D
S
N
556 2282 M
567 2285 D
545 2285 D
556 2282 D
549 2274 D
545 2264 D
545 2256 D
549 2246 D
556 2238 D
563 2235 D
574 2231 D
592 2231 D
603 2235 D
610 2238 D
617 2246 D
621 2256 D
621 2264 D
617 2274 D
610 2282 D
S
N
545 2256 M
549 2249 D
556 2242 D
563 2238 D
574 2235 D
592 2235 D
603 2238 D
610 2242 D
617 2249 D
621 2256 D
S
N
592 2282 M
621 2282 D
S
N
592 2285 M
621 2285 D
S
N
592 2271 M
592 2296 D
S
N
592 2318 M
592 2361 D
585 2361 D
578 2357 D
574 2354 D
571 2346 D
571 2336 D
574 2325 D
581 2318 D
592 2314 D
599 2314 D
610 2318 D
617 2325 D
621 2336 D
621 2343 D
617 2354 D
610 2361 D
S
N
592 2357 M
581 2357 D
574 2354 D
S
N
571 2336 M
574 2328 D
581 2321 D
592 2318 D
599 2318 D
610 2321 D
617 2328 D
621 2336 D
S
N
545 2382 M
621 2408 D
S
N
545 2386 M
610 2408 D
S
N
545 2433 M
621 2408 D
S
N
545 2375 M
545 2397 D
S
N
545 2419 M
545 2440 D
S
N
531 2476 M
646 2476 D
S
N
531 2480 M
646 2480 D
S
N
531 2455 M
531 2480 D
S
N
646 2455 M
646 2480 D
S
N
1521 722 M
1521 647 D
S
N
1525 722 M
1525 647 D
S
N
1525 712 M
1532 719 D
1539 722 D
1547 722 D
1557 719 D
1565 712 D
1568 701 D
1568 694 D
1565 683 D
1557 676 D
1547 672 D
1539 672 D
1532 676 D
1525 683 D
S
N
1547 722 M
1554 719 D
1561 712 D
1565 701 D
1565 694 D
1561 683 D
1554 676 D
1547 672 D
S
N
1511 722 M
1525 722 D
S
N
1511 647 M
1536 647 D
S
N
1605 694 M
1605 643 D
S
N
1608 694 M
1608 643 D
S
N
1591 694 M
1589 679 D
1589 694 D
1625 694 D
1625 679 D
1622 694 D
S
N
1598 643 M
1615 643 D
S
N
1642 643 M
1639 646 D
1642 648 D
1644 646 D
1644 641 D
1642 636 D
1639 634 D
S
N
1666 694 M
1666 643 D
S
N
1668 694 M
1668 643 D
S
N
1668 670 M
1673 674 D
1678 677 D
1682 677 D
1690 674 D
1694 670 D
1697 662 D
1697 658 D
1694 650 D
1690 646 D
1682 643 D
1678 643 D
1673 646 D
1668 650 D
S
N
1682 677 M
1687 674 D
1692 670 D
1694 662 D
1694 658 D
1692 650 D
1687 646 D
1682 643 D
S
N
1658 694 M
1668 694 D
S
N
1781 762 M
1781 647 D
S
N
1784 762 M
1784 647 D
S
N
1781 762 M
1806 762 D
S
N
1781 647 M
1806 647 D
S
N
1878 737 M
1882 726 D
1882 748 D
1878 737 D
1871 744 D
1860 748 D
1853 748 D
1842 744 D
1835 737 D
1831 730 D
1828 719 D
1828 701 D
1831 690 D
1835 683 D
1842 676 D
1853 672 D
1860 672 D
1871 676 D
1878 683 D
S
N
1853 748 M
1846 744 D
1839 737 D
1835 730 D
1831 719 D
1831 701 D
1835 690 D
1839 683 D
1846 676 D
1853 672 D
S
N
1878 701 M
1878 672 D
S
N
1882 701 M
1882 672 D
S
N
1867 701 M
1893 701 D
S
N
1914 701 M
1957 701 D
1957 708 D
1954 715 D
1950 719 D
1943 722 D
1932 722 D
1921 719 D
1914 712 D
1911 701 D
1911 694 D
1914 683 D
1921 676 D
1932 672 D
1939 672 D
1950 676 D
1957 683 D
S
N
1954 701 M
1954 712 D
1950 719 D
S
N
1932 722 M
1925 719 D
1918 712 D
1914 701 D
1914 694 D
1918 683 D
1925 676 D
1932 672 D
S
N
1979 748 M
2004 672 D
S
N
1983 748 M
2004 683 D
S
N
2030 748 M
2004 672 D
S
N
1972 748 M
1994 748 D
S
N
2015 748 M
2037 748 D
S
N
2073 762 M
2073 647 D
S
N
2076 762 M
2076 647 D
S
N
2051 762 M
2076 762 D
S
N
2051 647 M
2076 647 D
S
N
2366 2635 M
2366 2559 D
S
N
2370 2635 M
2370 2559 D
S
N
2366 2599 M
2359 2606 D
2352 2609 D
2345 2609 D
2334 2606 D
2327 2599 D
2323 2588 D
2323 2581 D
2327 2570 D
2334 2563 D
2345 2559 D
2352 2559 D
2359 2563 D
2366 2570 D
S
N
2345 2609 M
2337 2606 D
2330 2599 D
2327 2588 D
2327 2581 D
2330 2570 D
2337 2563 D
2345 2559 D
S
N
2355 2635 M
2370 2635 D
S
N
2366 2559 M
2381 2559 D
S
N
2399 2649 M
2406 2642 D
2413 2631 D
2420 2617 D
2424 2599 D
2424 2584 D
2420 2566 D
2413 2552 D
2406 2541 D
2399 2534 D
S
N
2406 2642 M
2413 2628 D
2417 2617 D
2420 2599 D
2420 2584 D
2417 2566 D
2413 2555 D
2406 2541 D
S
N
993 2722 M
993 992 D
S
N
993 992 M
2550 992 D
S
N
2550 992 M
2550 2722 D
S
N
2550 2722 M
993 2722 D
S
N
993 992 M
993 1044 D
S
N
1071 1009 M
1071 992 D
S
N
1149 992 M
1149 1009 D
S
N
1227 1009 M
1227 992 D
S
N
1304 992 M
1304 1009 D
S
N
1382 1044 M
1382 992 D
S
N
1460 992 M
1460 1009 D
S
N
1538 1009 M
1538 992 D
S
N
1616 992 M
1616 1009 D
S
N
1694 1009 M
1694 992 D
S
N
1772 992 M
1772 1044 D
S
N
1849 1009 M
1849 992 D
S
N
1927 992 M
1927 1009 D
S
N
2005 1009 M
2005 992 D
S
N
2083 992 M
2083 1009 D
S
N
2161 1044 M
2161 992 D
S
N
2239 992 M
2239 1009 D
S
N
2316 1009 M
2316 992 D
S
N
2394 992 M
2394 1009 D
S
N
2472 1009 M
2472 992 D
S
N
2550 992 M
2550 1044 D
S
N
990 935 M
981 932 D
976 923 D
973 909 D
973 900 D
976 886 D
981 877 D
990 874 D
996 874 D
1005 877 D
1010 886 D
1013 900 D
1013 909 D
1010 923 D
1005 932 D
996 935 D
990 935 D
S
N
990 935 M
984 932 D
981 929 D
979 923 D
976 909 D
976 900 D
979 886 D
981 880 D
984 877 D
990 874 D
S
N
996 874 M
1002 877 D
1005 880 D
1007 886 D
1010 900 D
1010 909 D
1007 923 D
1005 929 D
1002 932 D
996 935 D
S
N
1313 923 M
1319 926 D
1327 935 D
1327 874 D
S
N
1325 932 M
1325 874 D
S
N
1313 874 M
1339 874 D
S
N
1379 935 M
1371 932 D
1365 923 D
1362 909 D
1362 900 D
1365 886 D
1371 877 D
1379 874 D
1385 874 D
1394 877 D
1400 886 D
1402 900 D
1402 909 D
1400 923 D
1394 932 D
1385 935 D
1379 935 D
S
N
1379 935 M
1374 932 D
1371 929 D
1368 923 D
1365 909 D
1365 900 D
1368 886 D
1371 880 D
1374 877 D
1379 874 D
S
N
1385 874 M
1391 877 D
1394 880 D
1397 886 D
1400 900 D
1400 909 D
1397 923 D
1394 929 D
1391 932 D
1385 935 D
S
N
1437 935 M
1428 932 D
1423 923 D
1420 909 D
1420 900 D
1423 886 D
1428 877 D
1437 874 D
1443 874 D
1451 877 D
1457 886 D
1460 900 D
1460 909 D
1457 923 D
1451 932 D
1443 935 D
1437 935 D
S
N
1437 935 M
1431 932 D
1428 929 D
1425 923 D
1423 909 D
1423 900 D
1425 886 D
1428 880 D
1431 877 D
1437 874 D
S
N
1443 874 M
1449 877 D
1451 880 D
1454 886 D
1457 900 D
1457 909 D
1454 923 D
1451 929 D
1449 932 D
1443 935 D
S
N
1697 923 M
1699 920 D
1697 918 D
1694 920 D
1694 923 D
1697 929 D
1699 932 D
1708 935 D
1720 935 D
1728 932 D
1731 929 D
1734 923 D
1734 918 D
1731 912 D
1722 906 D
1708 900 D
1702 897 D
1697 892 D
1694 883 D
1694 874 D
S
N
1720 935 M
1725 932 D
1728 929 D
1731 923 D
1731 918 D
1728 912 D
1720 906 D
1708 900 D
S
N
1694 880 M
1697 883 D
1702 883 D
1717 877 D
1725 877 D
1731 880 D
1734 883 D
S
N
1702 883 M
1717 874 D
1728 874 D
1731 877 D
1734 883 D
1734 889 D
S
N
1769 935 M
1760 932 D
1754 923 D
1751 909 D
1751 900 D
1754 886 D
1760 877 D
1769 874 D
1774 874 D
1783 877 D
1789 886 D
1792 900 D
1792 909 D
1789 923 D
1783 932 D
1774 935 D
1769 935 D
S
N
1769 935 M
1763 932 D
1760 929 D
1757 923 D
1754 909 D
1754 900 D
1757 886 D
1760 880 D
1763 877 D
1769 874 D
S
N
1774 874 M
1780 877 D
1783 880 D
1786 886 D
1789 900 D
1789 909 D
1786 923 D
1783 929 D
1780 932 D
1774 935 D
S
N
1826 935 M
1818 932 D
1812 923 D
1809 909 D
1809 900 D
1812 886 D
1818 877 D
1826 874 D
1832 874 D
1841 877 D
1846 886 D
1849 900 D
1849 909 D
1846 923 D
1841 932 D
1832 935 D
1826 935 D
S
N
1826 935 M
1821 932 D
1818 929 D
1815 923 D
1812 909 D
1812 900 D
1815 886 D
1818 880 D
1821 877 D
1826 874 D
S
N
1832 874 M
1838 877 D
1841 880 D
1844 886 D
1846 900 D
1846 909 D
1844 923 D
1841 929 D
1838 932 D
1832 935 D
S
N
2086 923 M
2089 920 D
2086 918 D
2083 920 D
2083 923 D
2086 929 D
2089 932 D
2097 935 D
2109 935 D
2118 932 D
2120 926 D
2120 918 D
2118 912 D
2109 909 D
2100 909 D
S
N
2109 935 M
2115 932 D
2118 926 D
2118 918 D
2115 912 D
2109 909 D
S
N
2109 909 M
2115 906 D
2120 900 D
2123 895 D
2123 886 D
2120 880 D
2118 877 D
2109 874 D
2097 874 D
2089 877 D
2086 880 D
2083 886 D
2083 889 D
2086 892 D
2089 889 D
2086 886 D
S
N
2118 903 M
2120 895 D
2120 886 D
2118 880 D
2115 877 D
2109 874 D
S
N
2158 935 M
2149 932 D
2143 923 D
2141 909 D
2141 900 D
2143 886 D
2149 877 D
2158 874 D
2164 874 D
2172 877 D
2178 886 D
2181 900 D
2181 909 D
2178 923 D
2172 932 D
2164 935 D
2158 935 D
S
N
2158 935 M
2152 932 D
2149 929 D
2146 923 D
2143 909 D
2143 900 D
2146 886 D
2149 880 D
2152 877 D
2158 874 D
S
N
2164 874 M
2169 877 D
2172 880 D
2175 886 D
2178 900 D
2178 909 D
2175 923 D
2172 929 D
2169 932 D
2164 935 D
S
N
2216 935 M
2207 932 D
2201 923 D
2198 909 D
2198 900 D
2201 886 D
2207 877 D
2216 874 D
2221 874 D
2230 877 D
2236 886 D
2239 900 D
2239 909 D
2236 923 D
2230 932 D
2221 935 D
2216 935 D
S
N
2216 935 M
2210 932 D
2207 929 D
2204 923 D
2201 909 D
2201 900 D
2204 886 D
2207 880 D
2210 877 D
2216 874 D
S
N
2221 874 M
2227 877 D
2230 880 D
2233 886 D
2236 900 D
2236 909 D
2233 923 D
2230 929 D
2227 932 D
2221 935 D
S
N
2498 929 M
2498 874 D
S
N
2501 935 M
2501 874 D
S
N
2501 935 M
2469 892 D
2515 892 D
S
N
2489 874 M
2510 874 D
S
N
2547 935 M
2538 932 D
2533 923 D
2530 909 D
2530 900 D
2533 886 D
2538 877 D
2547 874 D
2553 874 D
2562 877 D
2567 886 D
2570 900 D
2570 909 D
2567 923 D
2562 932 D
2553 935 D
2547 935 D
S
N
2547 935 M
2541 932 D
2538 929 D
2536 923 D
2533 909 D
2533 900 D
2536 886 D
2538 880 D
2541 877 D
2547 874 D
S
N
2553 874 M
2559 877 D
2562 880 D
2564 886 D
2567 900 D
2567 909 D
2564 923 D
2562 929 D
2559 932 D
2553 935 D
S
N
2605 935 M
2596 932 D
2590 923 D
2587 909 D
2587 900 D
2590 886 D
2596 877 D
2605 874 D
2611 874 D
2619 877 D
2625 886 D
2628 900 D
2628 909 D
2625 923 D
2619 932 D
2611 935 D
2605 935 D
S
N
2605 935 M
2599 932 D
2596 929 D
2593 923 D
2590 909 D
2590 900 D
2593 886 D
2596 880 D
2599 877 D
2605 874 D
S
N
2611 874 M
2616 877 D
2619 880 D
2622 886 D
2625 900 D
2625 909 D
2622 923 D
2619 929 D
2616 932 D
2611 935 D
S
N
993 2722 M
2550 2722 D
S
N
993 2670 M
993 2722 D
S
N
1071 2722 M
1071 2705 D
S
N
1149 2705 M
1149 2722 D
S
N
1227 2722 M
1227 2705 D
S
N
1304 2705 M
1304 2722 D
S
N
1382 2722 M
1382 2670 D
S
N
1460 2705 M
1460 2722 D
S
N
1538 2722 M
1538 2705 D
S
N
1616 2705 M
1616 2722 D
S
N
1694 2722 M
1694 2705 D
S
N
1772 2670 M
1772 2722 D
S
N
1849 2722 M
1849 2705 D
S
N
1927 2705 M
1927 2722 D
S
N
2005 2722 M
2005 2705 D
S
N
2083 2705 M
2083 2722 D
S
N
2161 2722 M
2161 2670 D
S
N
2239 2705 M
2239 2722 D
S
N
2316 2722 M
2316 2705 D
S
N
2394 2705 M
2394 2722 D
S
N
2472 2722 M
2472 2705 D
S
N
2550 2670 M
2550 2722 D
S
N
993 992 M
993 2722 D
S
N
1010 1166 M
993 1166 D
S
N
993 1267 M
1010 1267 D
S
N
1010 1339 M
993 1339 D
S
N
993 1395 M
1010 1395 D
S
N
1010 1441 M
993 1441 D
S
N
993 1479 M
1010 1479 D
S
N
1010 1513 M
993 1513 D
S
N
993 1542 M
1010 1542 D
S
N
1045 1569 M
993 1569 D
S
N
993 1742 M
1010 1742 D
S
N
1010 1844 M
993 1844 D
S
N
993 1916 M
1010 1916 D
S
N
1010 1972 M
993 1972 D
S
N
993 2017 M
1010 2017 D
S
N
1010 2056 M
993 2056 D
S
N
993 2089 M
1010 2089 D
S
N
1010 2119 M
993 2119 D
S
N
993 2145 M
1045 2145 D
S
N
1010 2319 M
993 2319 D
S
N
993 2420 M
1010 2420 D
S
N
1010 2493 M
993 2493 D
S
N
993 2548 M
1010 2548 D
S
N
1010 2594 M
993 2594 D
S
N
993 2633 M
1010 2633 D
S
N
1010 2666 M
993 2666 D
S
N
993 2696 M
1010 2696 D
S
N
1045 2722 M
993 2722 D
S
N
682 1006 M
687 1009 D
696 1018 D
696 957 D
S
N
693 1015 M
693 957 D
S
N
682 957 M
708 957 D
S
N
748 1018 M
739 1015 D
734 1006 D
731 992 D
731 983 D
734 969 D
739 960 D
748 957 D
754 957 D
762 960 D
768 969 D
771 983 D
771 992 D
768 1006 D
762 1015 D
754 1018 D
748 1018 D
S
N
748 1018 M
742 1015 D
739 1012 D
736 1006 D
734 992 D
734 983 D
736 969 D
739 963 D
742 960 D
748 957 D
S
N
754 957 M
759 960 D
762 963 D
765 969 D
768 983 D
768 992 D
765 1006 D
762 1012 D
759 1015 D
754 1018 D
S
N
791 1018 M
843 1018 D
S
N
872 1041 M
878 1044 D
886 1053 D
886 992 D
S
N
883 1050 M
883 992 D
S
N
872 992 M
898 992 D
S
N
757 1583 M
762 1586 D
771 1595 D
771 1534 D
S
N
768 1592 M
768 1534 D
S
N
757 1534 M
783 1534 D
S
N
823 1595 M
814 1592 D
808 1583 D
806 1569 D
806 1560 D
808 1546 D
814 1537 D
823 1534 D
829 1534 D
837 1537 D
843 1546 D
846 1560 D
846 1569 D
843 1583 D
837 1592 D
829 1595 D
823 1595 D
S
N
823 1595 M
817 1592 D
814 1589 D
811 1583 D
808 1569 D
808 1560 D
811 1546 D
814 1540 D
817 1537 D
823 1534 D
S
N
829 1534 M
834 1537 D
837 1540 D
840 1546 D
843 1560 D
843 1569 D
840 1583 D
837 1589 D
834 1592 D
829 1595 D
S
N
881 1629 M
872 1626 D
866 1618 D
863 1603 D
863 1595 D
866 1580 D
872 1572 D
881 1569 D
886 1569 D
895 1572 D
901 1580 D
904 1595 D
904 1603 D
901 1618 D
895 1626 D
886 1629 D
881 1629 D
S
N
881 1629 M
875 1626 D
872 1623 D
869 1618 D
866 1603 D
866 1595 D
869 1580 D
872 1574 D
875 1572 D
881 1569 D
S
N
886 1569 M
892 1572 D
895 1574 D
898 1580 D
901 1595 D
901 1603 D
898 1618 D
895 1623 D
892 1626 D
886 1629 D
S
N
757 2160 M
762 2163 D
771 2171 D
771 2111 D
S
N
768 2168 M
768 2111 D
S
N
757 2111 M
783 2111 D
S
N
823 2171 M
814 2168 D
808 2160 D
806 2145 D
806 2137 D
808 2122 D
814 2114 D
823 2111 D
829 2111 D
837 2114 D
843 2122 D
846 2137 D
846 2145 D
843 2160 D
837 2168 D
829 2171 D
823 2171 D
S
N
823 2171 M
817 2168 D
814 2166 D
811 2160 D
808 2145 D
808 2137 D
811 2122 D
814 2117 D
817 2114 D
823 2111 D
S
N
829 2111 M
834 2114 D
837 2117 D
840 2122 D
843 2137 D
843 2145 D
840 2160 D
837 2166 D
834 2168 D
829 2171 D
S
N
872 2194 M
878 2197 D
886 2206 D
886 2145 D
S
N
883 2203 M
883 2145 D
S
N
872 2145 M
898 2145 D
S
N
757 2736 M
762 2739 D
771 2748 D
771 2687 D
S
N
768 2745 M
768 2687 D
S
N
757 2687 M
783 2687 D
S
N
823 2748 M
814 2745 D
808 2736 D
806 2722 D
806 2713 D
808 2699 D
814 2690 D
823 2687 D
829 2687 D
837 2690 D
843 2699 D
846 2713 D
846 2722 D
843 2736 D
837 2745 D
829 2748 D
823 2748 D
S
N
823 2748 M
817 2745 D
814 2742 D
811 2736 D
808 2722 D
808 2713 D
811 2699 D
814 2693 D
817 2690 D
823 2687 D
S
N
829 2687 M
834 2690 D
837 2693 D
840 2699 D
843 2713 D
843 2722 D
840 2736 D
837 2742 D
834 2745 D
829 2748 D
S
N
866 2771 M
869 2768 D
866 2765 D
863 2768 D
863 2771 D
866 2777 D
869 2780 D
878 2783 D
889 2783 D
898 2780 D
901 2777 D
904 2771 D
904 2765 D
901 2759 D
892 2754 D
878 2748 D
872 2745 D
866 2739 D
863 2731 D
863 2722 D
S
N
889 2783 M
895 2780 D
898 2777 D
901 2771 D
901 2765 D
898 2759 D
889 2754 D
878 2748 D
S
N
863 2728 M
866 2731 D
872 2731 D
886 2725 D
895 2725 D
901 2728 D
904 2731 D
S
N
872 2731 M
886 2722 D
898 2722 D
901 2725 D
904 2731 D
904 2736 D
S
N
2550 992 M
2550 2722 D
S
N
2550 1166 M
2533 1166 D
S
N
2533 1267 M
2550 1267 D
S
N
2550 1339 M
2533 1339 D
S
N
2533 1395 M
2550 1395 D
S
N
2550 1441 M
2533 1441 D
S
N
2533 1479 M
2550 1479 D
S
N
2550 1513 M
2533 1513 D
S
N
2533 1542 M
2550 1542 D
S
N
2550 1569 M
2498 1569 D
S
N
2533 1742 M
2550 1742 D
S
N
2550 1844 M
2533 1844 D
S
N
2533 1916 M
2550 1916 D
S
N
2550 1972 M
2533 1972 D
S
N
2533 2017 M
2550 2017 D
S
N
2550 2056 M
2533 2056 D
S
N
2533 2089 M
2550 2089 D
S
N
2550 2119 M
2533 2119 D
S
N
2498 2145 M
2550 2145 D
S
N
2550 2319 M
2533 2319 D
S
N
2533 2420 M
2550 2420 D
S
N
2550 2493 M
2533 2493 D
S
N
2533 2548 M
2550 2548 D
S
N
2550 2594 M
2533 2594 D
S
N
2533 2633 M
2550 2633 D
S
N
2550 2666 M
2533 2666 D
S
N
2533 2696 M
2550 2696 D
S
N
2550 2722 M
2498 2722 D
S
1.00 0.00 0.00 setrgbcolor
1090 2614 P
1129 2509 P
1168 2423 P
1207 2348 P
1246 2286 P
1285 2227 P
1324 2172 P
1363 2122 P
1402 2077 P
1441 2033 P
1480 1987 P
1518 1948 P
1557 1909 P
1596 1873 P
1635 1841 P
1674 1806 P
1713 1772 P
1752 1735 P
1791 1702 P
1830 1677 P
1869 1651 P
1908 1608 P
1947 1591 P
1986 1562 P
2025 1531 P
2063 1502 P
2102 1465 P
2141 1445 P
2180 1429 P
2219 1394 P
2258 1370 P
2297 1346 P
2336 1302 P
2375 1312 P
2414 1257 P
2453 1244 P
2492 1200 P
2531 1205 P
N
993 992 M
993 992 D
S
N
1071 992 M
1071 2614 D
1110 2614 D
1110 2509 D
1149 2509 D
1149 2423 D
1188 2423 D
1188 2348 D
1227 2348 D
1227 2286 D
1265 2286 D
1265 2227 D
1304 2227 D
1304 2172 D
1343 2172 D
1343 2122 D
1382 2122 D
1382 2077 D
1421 2077 D
1421 2033 D
1460 2033 D
1460 1987 D
1499 1987 D
1499 1948 D
1538 1948 D
1538 1909 D
1577 1909 D
1577 1873 D
1616 1873 D
1616 1841 D
1655 1841 D
1655 1806 D
1694 1806 D
1694 1772 D
1733 1772 D
1733 1735 D
1772 1735 D
1772 1702 D
1810 1702 D
1810 1677 D
1849 1677 D
1849 1651 D
1888 1651 D
1888 1608 D
1927 1608 D
1927 1591 D
1966 1591 D
1966 1562 D
2005 1562 D
2005 1531 D
2044 1531 D
2044 1502 D
2083 1502 D
2083 1465 D
2122 1465 D
2122 1445 D
2161 1445 D
2161 1429 D
2200 1429 D
2200 1394 D
2239 1394 D
2239 1370 D
2278 1370 D
2278 1346 D
2316 1346 D
2316 1302 D
2355 1302 D
2355 1312 D
2394 1312 D
2394 1257 D
2433 1257 D
2433 1244 D
2472 1244 D
2472 1200 D
2511 1200 D
2511 1205 D
2550 1205 D
S
0.00 0.00 1.00 setrgbcolor
1090 2452 P
1129 2353 P
1168 2271 P
1207 2201 P
1246 2138 P
1285 2081 P
1324 2030 P
1363 1983 P
1402 1936 P
1441 1894 P
1480 1854 P
1518 1817 P
1557 1778 P
1596 1744 P
1635 1709 P
1674 1675 P
1713 1642 P
1752 1609 P
1791 1581 P
1830 1547 P
1869 1519 P
1908 1491 P
1947 1463 P
1986 1431 P
2025 1405 P
2063 1378 P
2102 1350 P
2141 1323 P
2180 1295 P
2219 1269 P
2258 1246 P
2297 1219 P
2336 1186 P
2375 1166 P
2414 1144 P
2453 1123 P
2492 1093 P
2531 1071 P
[8 30] 0 Sd
N
993 992 M
993 992 D
S
N
1071 992 M
1071 2452 D
1110 2452 D
1110 2353 D
1149 2353 D
1149 2271 D
1188 2271 D
1188 2201 D
1227 2201 D
1227 2138 D
1265 2138 D
1265 2081 D
1304 2081 D
1304 2030 D
1343 2030 D
1343 1983 D
1382 1983 D
1382 1936 D
1421 1936 D
1421 1894 D
1460 1894 D
1460 1854 D
1499 1854 D
1499 1817 D
1538 1817 D
1538 1778 D
1577 1778 D
1577 1744 D
1616 1744 D
1616 1709 D
1655 1709 D
1655 1675 D
1694 1675 D
1694 1642 D
1733 1642 D
1733 1609 D
1772 1609 D
1772 1581 D
1810 1581 D
1810 1547 D
1849 1547 D
1849 1519 D
1888 1519 D
1888 1491 D
1927 1491 D
1927 1463 D
1966 1463 D
1966 1431 D
2005 1431 D
2005 1405 D
2044 1405 D
2044 1378 D
2083 1378 D
2083 1350 D
2122 1350 D
2122 1323 D
2161 1323 D
2161 1295 D
2200 1295 D
2200 1269 D
2239 1269 D
2239 1246 D
2278 1246 D
2278 1219 D
2316 1219 D
2316 1186 D
2355 1186 D
2355 1166 D
2394 1166 D
2394 1144 D
2433 1144 D
2433 1123 D
2472 1123 D
2472 1093 D
2511 1093 D
2511 1071 D
2550 1071 D
S
0.00 1.00 0.00 setrgbcolor
[] 0 Sd
1090 1682 P
1129 1747 P
1168 1768 P
1207 1765 P
1246 1746 P
1285 1712 P
1324 1674 P
1363 1630 P
1402 1581 P
1441 1535 P
1480 1488 P
1518 1436 P
1557 1388 P
1596 1335 P
1635 1284 P
1674 1235 P
1713 1185 P
1752 1135 P
1791 1087 P
1830 1040 P
[30 30 8 30] 0 Sd
N
993 992 M
993 992 D
S
N
1071 992 M
1071 1682 D
1110 1682 D
1110 1747 D
1149 1747 D
1149 1768 D
1188 1768 D
1188 1765 D
1227 1765 D
1227 1746 D
1265 1746 D
1265 1712 D
1304 1712 D
1304 1674 D
1343 1674 D
1343 1630 D
1382 1630 D
1382 1581 D
1421 1581 D
1421 1535 D
1460 1535 D
1460 1488 D
1499 1488 D
1499 1436 D
1538 1436 D
1538 1388 D
1577 1388 D
1577 1335 D
1616 1335 D
1616 1284 D
1655 1284 D
1655 1235 D
1694 1235 D
1694 1185 D
1733 1185 D
1733 1135 D
1772 1135 D
1772 1087 D
1810 1087 D
1810 1040 D
1849 1040 D
1849 992 D
S
0.00 1.00 1.00 setrgbcolor
[] 0 Sd
1090 1581 P
1129 1666 P
1168 1697 P
1207 1696 P
1246 1676 P
1285 1643 P
1324 1603 P
1363 1558 P
1402 1508 P
1441 1457 P
1480 1405 P
1518 1352 P
1557 1298 P
1596 1244 P
1635 1192 P
1674 1139 P
1713 1086 P
1752 1034 P
[39] 0 Sd
N
993 992 M
993 992 D
S
N
1071 992 M
1071 1581 D
1110 1581 D
1110 1666 D
1149 1666 D
1149 1697 D
1188 1697 D
1188 1696 D
1227 1696 D
1227 1676 D
1265 1676 D
1265 1643 D
1304 1643 D
1304 1603 D
1343 1603 D
1343 1558 D
1382 1558 D
1382 1508 D
1421 1508 D
1421 1457 D
1460 1457 D
1460 1405 D
1499 1405 D
1499 1352 D
1538 1352 D
1538 1298 D
1577 1298 D
1577 1244 D
1616 1244 D
1616 1192 D
1655 1192 D
1655 1139 D
1694 1139 D
1694 1086 D
1733 1086 D
1733 1034 D
1772 1034 D
1772 992 D
S
showpage
%%Trailer
%%Pages: 1
%%BoundingBox:
