%!PS-Adobe-2.0 EPSF-2.0
%%BoundingBox:  0 0 567 384
%%Title: : DisplayReweightedBornBox_DiphoxGamma2MC_costhetastar_Kqt_Kmgg_new
%%Creator: ROOT Version 5.26/00
%%CreationDate: Fri Jan  6 19:41:04 2012
%%EndComments
%%BeginProlog
80 dict begin
/s {stroke} def /l {lineto} def /m {moveto} def /t {translate} def
/sw {stringwidth} def /r {rotate} def /rl {roll}  def /R {repeat} def
/d {rlineto} def /rm {rmoveto} def /gr {grestore} def /f {eofill} def
/c {setrgbcolor} def /black {0 setgray} def /sd {setdash} def
/cl {closepath} def /sf {scalefont setfont} def /lw {setlinewidth} def
/box {m dup 0 exch d exch 0 d 0 exch neg d cl} def
/NC{systemdict begin initclip end}def/C{NC box clip newpath}def
/bl {box s} def /bf {box f} def /Y { 0 exch d} def /X { 0 d} def 
/mp {newpath /y exch def /x exch def} def
/side {[w .77 mul w .23 mul] .385 w mul sd w 0 l currentpoint t -144 r} def
/mr {mp x y w2 0 360 arc} def /m24 {mr s} def /m20 {mr f} def
/mb {mp x y w2 add m w2 neg 0 d 0 w neg d w 0 d 0 w d cl} def
/mt {mp x y w2 add m w2 neg w neg d w 0 d cl} def
/m21 {mb f} def /m25 {mb s} def /m22 {mt f} def /m26{mt s} def
/m23 {mp x y w2 sub m w2 w d w neg 0 d cl f} def
/m27 {mp x y w2 add m w3 neg w2 neg d w3 w2 neg d w3 w2 d cl s} def
/m28 {mp x w2 sub y w2 sub w3 add m w3 0 d  0 w3 neg d w3 0 d 0 w3 d w3 0 d  0 w3 d w3 neg 0 d 0 w3 d w3 neg 0 d
 0 w3 neg d w3 neg 0 d cl s } def
/m29 {mp gsave x w2 sub y w2 add w3 sub m currentpoint t
 4 {side} repeat cl fill gr} def
/m30 {mp gsave x w2 sub y w2 add w3 sub m currentpoint t
 4 {side} repeat cl s gr} def
/m31 {mp x y w2 sub m 0 w d x w2 sub y m w 0 d x w2 sub y w2 add m w w neg d x w2 sub y w2
 sub m w w d s} def
/m2 {mp x y w2 sub m 0 w d x w2 sub y m w 0 d s} def
/m5 {mp x w2 sub y w2 sub m w w d x w2 sub y w2 add m w w neg d s} def
/reEncode {exch findfont dup length dict begin {1 index /FID eq  {pop pop} {def} ifelse } forall /Encoding exch def currentdict end dup /FontName get exch definefont pop } def [/Times-Bold /Times-Italic /Times-BoldItalic /Helvetica
 /Helvetica-Oblique /Helvetica-Bold /Helvetica-BoldOblique /Courier /Courier-Oblique /Courier-Bold /Courier-BoldOblique /Times-Roman /AvantGarde-Book /AvantGarde-BookOblique /AvantGarde-Demi /AvantGarde-DemiOblique /Bookman-Demi
 /Bookman-DemiItalic /Bookman-Light /Bookman-LightItalic /Helvetica-Narrow /Helvetica-Narrow-Bold /Helvetica-Narrow-BoldOblique /Helvetica-Narrow-Oblique /NewCenturySchlbk-Roman /NewCenturySchlbk-Bold
 /NewCenturySchlbk-BoldItalic /NewCenturySchlbk-Italic /Palatino-Bold /Palatino-BoldItalic /Palatino-Italic /Palatino-Roman ] {ISOLatin1Encoding reEncode } forall
/oshow {gsave [] 0 sd true charpath stroke gr} def
/stwn { /fs exch def /fn exch def /text exch def fn findfont fs sf
 text sw pop xs add /xs exch def} def
/stwb { /fs exch def /fn exch def /nbas exch def /textf exch deftextf length /tlen exch def nbas tlen gt {/nbas tlendef} iffn findfont fs sf textf dup length nbas sub nbas getinterval sw
pop neg xs add /xs exch def} def
%%EndProlog
%%BeginSetup
%%EndSetup
newpath  gsave  .25 .25 scale  gsave  0 0 t black[  ] 0 sd 3 lw 1 1 1 c 2268 1538 0 0 bf black 1 1 1 c 1791 1215 363 246 bf black 1791 1215 363 246 bl 1 1 1 c 1791 1215 363 246 bf black 1791 1215 363 246 bl 1 0 0 c 6 lw 1 1 1 c black 1 0 0 c 363 703
 m 119 X -6 Y 120 X 3 Y 119 X 4 Y 120 X 14 Y 119 X 18 Y 119 X 36 Y 120 X 18 Y 119 X 43 Y 120 X 66 Y 119 X 68 Y 120 X 97 Y 119 X 152 Y 119 X 88 Y 120 X -357 Y 119 X s black 3 lw 363 246 m 1791 X s
 gsave  2268 1538 0 0 C 2082 114 t 0 r /Helvetica findfont 71.6807 sf 0 0 m (*\) ) show NC gr 
 gsave  2268 1538 0 0 C 2046 114 t 0 r /Symbol findfont 71.6807 sf 0 0 m (q) show NC gr 
 gsave  2268 1538 0 0 C 1913 114 t 0 r /Helvetica findfont 71.6807 sf 0 0 m (cos\() show NC gr  363 283 m -37 Y s 399 264 m -18 Y s 434 264 m -18 Y s 470 264 m -18 Y s 506 264 m -18 Y s 542 283 m -37 Y s 578 264 m -18 Y s 614 264 m -18 Y s 649 264 m
 -18 Y s 685 264 m -18 Y s 721 283 m -37 Y s 757 264 m -18 Y s 793 264 m -18 Y s 829 264 m -18 Y s 864 264 m -18 Y s 900 283 m -37 Y s 936 264 m -18 Y s 972 264 m -18 Y s 1008 264 m -18 Y s 1044 264 m -18 Y s 1079 283 m -37 Y s 1115 264 m -18 Y s
 1151 264 m -18 Y s 1187 264 m -18 Y s 1223 264 m -18 Y s 1259 283 m -37 Y s 1294 264 m -18 Y s 1330 264 m -18 Y s 1366 264 m -18 Y s 1402 264 m -18 Y s 1438 283 m -37 Y s 1474 264 m -18 Y s 1509 264 m -18 Y s 1545 264 m -18 Y s 1581 264 m -18 Y s
 1617 283 m -37 Y s 1653 264 m -18 Y s 1689 264 m -18 Y s 1724 264 m -18 Y s 1760 264 m -18 Y s 1796 283 m -37 Y s 1832 264 m -18 Y s 1868 264 m -18 Y s 1904 264 m -18 Y s 1939 264 m -18 Y s 1975 283 m -37 Y s 2011 264 m -18 Y s 2047 264 m -18 Y s
 2083 264 m -18 Y s 2119 264 m -18 Y s 2154 283 m -37 Y s
 gsave  2268 1538 0 0 C 342 179 t 0 r /Helvetica findfont 71.6807 sf 0 0 m (0) show NC gr 
 gsave  2268 1538 0 0 C 495 179 t 0 r /Helvetica findfont 71.6807 sf 0 0 m (0.1) show NC gr 
 gsave  2268 1538 0 0 C 671 179 t 0 r /Helvetica findfont 71.6807 sf 0 0 m (0.2) show NC gr 
 gsave  2268 1538 0 0 C 850 179 t 0 r /Helvetica findfont 71.6807 sf 0 0 m (0.3) show NC gr 
 gsave  2268 1538 0 0 C 1030 179 t 0 r /Helvetica findfont 71.6807 sf 0 0 m (0.4) show NC gr 
 gsave  2268 1538 0 0 C 1209 179 t 0 r /Helvetica findfont 71.6807 sf 0 0 m (0.5) show NC gr 
 gsave  2268 1538 0 0 C 1388 179 t 0 r /Helvetica findfont 71.6807 sf 0 0 m (0.6) show NC gr 
 gsave  2268 1538 0 0 C 1567 179 t 0 r /Helvetica findfont 71.6807 sf 0 0 m (0.7) show NC gr 
 gsave  2268 1538 0 0 C 1746 179 t 0 r /Helvetica findfont 71.6807 sf 0 0 m (0.8) show NC gr 
 gsave  2268 1538 0 0 C 1926 179 t 0 r /Helvetica findfont 71.6807 sf 0 0 m (0.9) show NC gr 
 gsave  2268 1538 0 0 C 2137 179 t 0 r /Helvetica findfont 71.6807 sf 0 0 m (1) show NC gr  363 1461 m 1791 X s 363 1425 m 36 Y s 399 1443 m 18 Y s 434 1443 m 18 Y s 470 1443 m 18 Y s 506 1443 m 18 Y s 542 1425 m 36 Y s 578 1443 m 18 Y s 614 1443 m
 18 Y s 649 1443 m 18 Y s 685 1443 m 18 Y s 721 1425 m 36 Y s 757 1443 m 18 Y s 793 1443 m 18 Y s 829 1443 m 18 Y s 864 1443 m 18 Y s 900 1425 m 36 Y s 936 1443 m 18 Y s 972 1443 m 18 Y s 1008 1443 m 18 Y s 1044 1443 m 18 Y s 1079 1425 m 36 Y s 1115
 1443 m 18 Y s 1151 1443 m 18 Y s 1187 1443 m 18 Y s 1223 1443 m 18 Y s 1259 1425 m 36 Y s 1294 1443 m 18 Y s 1330 1443 m 18 Y s 1366 1443 m 18 Y s 1402 1443 m 18 Y s 1438 1425 m 36 Y s 1474 1443 m 18 Y s 1509 1443 m 18 Y s 1545 1443 m 18 Y s 1581
 1443 m 18 Y s 1617 1425 m 36 Y s 1653 1443 m 18 Y s 1689 1443 m 18 Y s 1724 1443 m 18 Y s 1760 1443 m 18 Y s 1796 1425 m 36 Y s 1832 1443 m 18 Y s 1868 1443 m 18 Y s 1904 1443 m 18 Y s 1939 1443 m 18 Y s 1975 1425 m 36 Y s 2011 1443 m 18 Y s 2047
 1443 m 18 Y s 2083 1443 m 18 Y s 2119 1443 m 18 Y s 2154 1425 m 36 Y s 363 246 m 1215 Y s
 gsave  2268 1538 0 0 C 111 1264 t 90 r /Helvetica findfont 71.6807 sf 0 0 m (*\) \(pb\)) show NC gr 
 gsave  2268 1538 0 0 C 108 1228 t 90 r /Symbol findfont 71.6807 sf 0 0 m (q) show NC gr 
 gsave  2268 1538 0 0 C 108 1033 t 90 r /Helvetica findfont 71.6807 sf 0 0 m (/dcos\() show NC gr 
 gsave  2268 1538 0 0 C 108 990 t 90 r /Symbol findfont 71.6807 sf 0 0 m (s) show NC gr 
 gsave  2268 1538 0 0 C 108 955 t 90 r /Helvetica findfont 71.6807 sf 0 0 m (d) show NC gr  417 246 m -54 X s 390 276 m -27 X s 390 307 m -27 X s 390 337 m -27 X s 417 368 m -54 X s 390 398 m -27 X s 390 428 m -27 X s 390 459 m -27 X s 417 489 m -54
 X s 390 519 m -27 X s 390 550 m -27 X s 390 580 m -27 X s 417 611 m -54 X s 390 641 m -27 X s 390 671 m -27 X s 390 702 m -27 X s 417 732 m -54 X s 390 762 m -27 X s 390 793 m -27 X s 390 823 m -27 X s 417 854 m -54 X s 390 884 m -27 X s 390 914 m
 -27 X s 390 945 m -27 X s 417 975 m -54 X s 390 1005 m -27 X s 390 1036 m -27 X s 390 1066 m -27 X s 417 1097 m -54 X s 390 1127 m -27 X s 390 1157 m -27 X s 390 1188 m -27 X s 417 1218 m -54 X s 390 1248 m -27 X s 390 1279 m -27 X s 390 1309 m -27
 X s 417 1339 m -54 X s 390 1370 m -27 X s 390 1400 m -27 X s 390 1431 m -27 X s 417 1461 m -54 X s
 gsave  2268 1538 0 0 C 310 222 t 0 r /Helvetica findfont 71.6807 sf 0 0 m (0) show NC gr 
 gsave  2268 1538 0 0 C 310 339 t 0 r /Helvetica findfont 71.6807 sf 0 0 m (2) show NC gr 
 gsave  2268 1538 0 0 C 310 463 t 0 r /Helvetica findfont 71.6807 sf 0 0 m (4) show NC gr 
 gsave  2268 1538 0 0 C 310 586 t 0 r /Helvetica findfont 71.6807 sf 0 0 m (6) show NC gr 
 gsave  2268 1538 0 0 C 310 707 t 0 r /Helvetica findfont 71.6807 sf 0 0 m (8) show NC gr 
 gsave  2268 1538 0 0 C 270 828 t 0 r /Helvetica findfont 71.6807 sf 0 0 m (10) show NC gr 
 gsave  2268 1538 0 0 C 270 948 t 0 r /Helvetica findfont 71.6807 sf 0 0 m (12) show NC gr 
 gsave  2268 1538 0 0 C 270 1069 t 0 r /Helvetica findfont 71.6807 sf 0 0 m (14) show NC gr 
 gsave  2268 1538 0 0 C 270 1193 t 0 r /Helvetica findfont 71.6807 sf 0 0 m (16) show NC gr 
 gsave  2268 1538 0 0 C 270 1316 t 0 r /Helvetica findfont 71.6807 sf 0 0 m (18) show NC gr 
 gsave  2268 1538 0 0 C 270 1437 t 0 r /Helvetica findfont 71.6807 sf 0 0 m (20) show NC gr  2154 246 m 1215 Y s 2101 246 m 53 X s 2127 276 m 27 X s 2127 307 m 27 X s 2127 337 m 27 X s 2101 368 m 53 X s 2127 398 m 27 X s 2127 428 m 27 X s 2127 459 m
 27 X s 2101 489 m 53 X s 2127 519 m 27 X s 2127 550 m 27 X s 2127 580 m 27 X s 2101 611 m 53 X s 2127 641 m 27 X s 2127 671 m 27 X s 2127 702 m 27 X s 2101 732 m 53 X s 2127 762 m 27 X s 2127 793 m 27 X s 2127 823 m 27 X s 2101 854 m 53 X s 2127
 884 m 27 X s 2127 914 m 27 X s 2127 945 m 27 X s 2101 975 m 53 X s 2127 1005 m 27 X s 2127 1036 m 27 X s 2127 1066 m 27 X s 2101 1097 m 53 X s 2127 1127 m 27 X s 2127 1157 m 27 X s 2127 1188 m 27 X s 2101 1218 m 53 X s 2127 1248 m 27 X s 2127 1279
 m 27 X s 2127 1309 m 27 X s 2101 1339 m 53 X s 2127 1370 m 27 X s 2127 1400 m 27 X s 2127 1431 m 27 X s 2101 1461 m 53 X s 0 0 1 c 6 lw 1 1 1 c black 0 0 1 c 363 718 m 119 X -4 Y 120 X 1 Y 119 X 7 Y 120 X 17 Y 119 X 22 Y 119 X 15 Y 120 X 26 Y 119 X
 59 Y 120 X 55 Y 119 X 53 Y 120 X 101 Y 119 X 139 Y 119 X 135 Y 120 X -345 Y 119 X s 0.35 0.83 0.33 c 1 1 1 c black 0.35 0.83 0.33 c 363 684 m 119 X -5 Y 120 X -1 Y 119 X 9 Y 120 X 21 Y 119 X 15 Y 119 X 18 Y 120 X 29 Y 119 X 67 Y 120 X 59 Y 119 X 54
 Y 120 X 109 Y 119 X 150 Y 119 X 128 Y 120 X -413 Y 119 X s black 3 lw 1 1 1 c 1235 423 414 1007 bf black 433 1007 m -13 Y 1229 X 417 Y -13 X -404 Y f 414 1007 m 423 Y 1235 X -423 Y -1235 X cl s
 gsave  2268 1538 0 0 C 720 1349 t 0 r /Helvetica findfont 42.3568 sf 0 0 m (Diphox Born with 1\255,2\255frag + Gamma2MC Box NLO) show NC gr  1 0 0 c 6 lw 460 1360 m 216 X s black
 gsave  2268 1538 0 0 C 720 1206 t 0 r /Helvetica findfont 42.3568 sf 0 0 m (Madgraph Born + Pythia Box) show NC gr  0 0 1 c 460 1219 m 216 X s black
 gsave  2268 1538 0 0 C 1460 1072 t 0 r /Helvetica findfont 42.3568 sf 0 0 m (\)) show NC gr 
 gsave  2268 1538 0 0 C 1447 1056 t 0 r /Symbol findfont 26.0657 sf 0 0 m (g) show NC gr 
 gsave  2268 1538 0 0 C 1434 1056 t 0 r /Symbol findfont 26.0657 sf 0 0 m (g) show NC gr 
 gsave  2268 1538 0 0 C 1388 1072 t 0 r /Helvetica findfont 42.3568 sf 0 0 m (,M) show NC gr 
 gsave  2268 1538 0 0 C 1372 1049 t 0 r /Helvetica findfont 26.0657 sf 0 0 m (T) show NC gr 
 gsave  2268 1538 0 0 C 720 1072 t 0 r /Helvetica findfont 42.3568 sf 0 0 m (Madgraph Born + Pythia Box x K\(q) show NC gr  0.35 0.83 0.33 c 460 1077 m 216 X s black
 gsave  2268 1538 0 0 C 2199 1078 t 90 r /Helvetica-BoldOblique findfont 29.3239 sf 0 0 m (LHC HIGGS XS WG 2011) show NC gr 
 gr  gr 
showpage
end
%%EOF
