%!PS-Adobe-2.0 EPSF-2.0
%%BoundingBox:  0 0 567 384
%%Title: /home/dimicco/HiggsScan/compare_MCNLO_MCFM/mT.eps: canvas_mT_common
%%Creator: ROOT Version 5.26/00
%%CreationDate: Fri Dec  9 15:02:01 2011
%%EndComments
%%BeginProlog
80 dict begin
/s {stroke} def /l {lineto} def /m {moveto} def /t {translate} def
/sw {stringwidth} def /r {rotate} def /rl {roll}  def /R {repeat} def
/d {rlineto} def /rm {rmoveto} def /gr {grestore} def /f {eofill} def
/c {setrgbcolor} def /black {0 setgray} def /sd {setdash} def
/cl {closepath} def /sf {scalefont setfont} def /lw {setlinewidth} def
/box {m dup 0 exch d exch 0 d 0 exch neg d cl} def
/NC{systemdict begin initclip end}def/C{NC box clip newpath}def
/bl {box s} def /bf {box f} def /Y { 0 exch d} def /X { 0 d} def 
/mp {newpath /y exch def /x exch def} def
/side {[w .77 mul w .23 mul] .385 w mul sd w 0 l currentpoint t -144 r} def
/mr {mp x y w2 0 360 arc} def /m24 {mr s} def /m20 {mr f} def
/mb {mp x y w2 add m w2 neg 0 d 0 w neg d w 0 d 0 w d cl} def
/mt {mp x y w2 add m w2 neg w neg d w 0 d cl} def
/m21 {mb f} def /m25 {mb s} def /m22 {mt f} def /m26{mt s} def
/m23 {mp x y w2 sub m w2 w d w neg 0 d cl f} def
/m27 {mp x y w2 add m w3 neg w2 neg d w3 w2 neg d w3 w2 d cl s} def
/m28 {mp x w2 sub y w2 sub w3 add m w3 0 d  0 w3 neg d w3 0 d 0 w3 d w3 0 d  0 w3 d w3 neg 0 d 0 w3 d w3 neg 0 d
 0 w3 neg d w3 neg 0 d cl s } def
/m29 {mp gsave x w2 sub y w2 add w3 sub m currentpoint t
 4 {side} repeat cl fill gr} def
/m30 {mp gsave x w2 sub y w2 add w3 sub m currentpoint t
 4 {side} repeat cl s gr} def
/m31 {mp x y w2 sub m 0 w d x w2 sub y m w 0 d x w2 sub y w2 add m w w neg d x w2 sub y w2
 sub m w w d s} def
/m2 {mp x y w2 sub m 0 w d x w2 sub y m w 0 d s} def
/m5 {mp x w2 sub y w2 sub m w w d x w2 sub y w2 add m w w neg d s} def
/reEncode {exch findfont dup length dict begin {1 index /FID eq  {pop pop} {def} ifelse } forall /Encoding exch def currentdict end dup /FontName get exch definefont pop } def [/Times-Bold /Times-Italic /Times-BoldItalic /Helvetica
 /Helvetica-Oblique /Helvetica-Bold /Helvetica-BoldOblique /Courier /Courier-Oblique /Courier-Bold /Courier-BoldOblique /Times-Roman /AvantGarde-Book /AvantGarde-BookOblique /AvantGarde-Demi /AvantGarde-DemiOblique /Bookman-Demi
 /Bookman-DemiItalic /Bookman-Light /Bookman-LightItalic /Helvetica-Narrow /Helvetica-Narrow-Bold /Helvetica-Narrow-BoldOblique /Helvetica-Narrow-Oblique /NewCenturySchlbk-Roman /NewCenturySchlbk-Bold
 /NewCenturySchlbk-BoldItalic /NewCenturySchlbk-Italic /Palatino-Bold /Palatino-BoldItalic /Palatino-Italic /Palatino-Roman ] {ISOLatin1Encoding reEncode } forall
/oshow {gsave [] 0 sd true charpath stroke gr} def
/stwn { /fs exch def /fn exch def /text exch def fn findfont fs sf
 text sw pop xs add /xs exch def} def
/stwb { /fs exch def /fn exch def /nbas exch def /textf exch deftextf length /tlen exch def nbas tlen gt {/nbas tlendef} iffn findfont fs sf textf dup length nbas sub nbas getinterval sw
pop neg xs add /xs exch def} def
%%EndProlog
%%BeginSetup
%%EndSetup
newpath  gsave  .25 .25 scale  gsave  0 0 t black[  ] 0 sd 3 lw 1 1 1 c 2268 1538 0 0 bf black 1 1 1 c 1791 1215 363 246 bf black 1791 1215 363 246 bl 1 1 1 c 1791 1215 363 246 bf black 1791 1215 363 246 bl 1 0 0 c 6 lw 1 1 1 c 1 0 0 c 3 lw /w 29
 def /w2 {w 2 div} def /w3 {w 3 div} def 400 303 m20 6 lw 3 lw 445 303 m20 6 lw 3 lw 460 305 m20 6 lw 3 lw 475 310 m20 6 lw 3 lw 490 310 m20 6 lw 3 lw 505 320 m20 6 lw 3 lw 520 308 m20 6 lw 3 lw 535 333 m20 6 lw 3 lw 549 321 m20 6 lw 3 lw 564 329
 m20 6 lw 3 lw 579 324 m20 6 lw 3 lw 594 330 m20 6 lw 3 lw 609 333 m20 6 lw 3 lw 624 329 m20 6 lw 3 lw 639 338 m20 6 lw 3 lw 654 325 m20 6 lw 3 lw 669 333 m20 6 lw 3 lw 684 344 m20 6 lw 3 lw 699 351 m20 6 lw 3 lw 714 347 m20 6 lw 3 lw 729 345 m20 6
 lw 3 lw 744 358 m20 6 lw 3 lw 758 352 m20 6 lw 3 lw 773 360 m20 6 lw 3 lw 788 369 m20 6 lw 3 lw 803 357 m20 6 lw 3 lw 818 364 m20 6 lw 3 lw 833 371 m20 6 lw 3 lw 848 385 m20 6 lw 3 lw 863 380 m20 6 lw 3 lw 878 395 m20 6 lw 3 lw 893 396 m20 6 lw 908
 414 m s 908 440 m 1 Y s 3 lw 908 427 m20 6 lw 923 428 m 1 Y s 923 455 m 2 Y s 3 lw 923 442 m20 6 lw 938 483 m 5 Y s 938 514 m 4 Y s 3 lw 938 501 m20 6 lw 953 533 m 6 Y s 953 565 m 5 Y s 3 lw 953 552 m20 6 lw 967 581 m 8 Y s 967 615 m 8 Y s 3 lw 967
 602 m20 6 lw 982 648 m 11 Y s 982 685 m 10 Y s 3 lw 982 672 m20 6 lw 997 668 m 12 Y s 997 706 m 12 Y s 3 lw 997 693 m20 6 lw 1012 796 m 14 Y s 1012 836 m 14 Y s 3 lw 1012 823 m20 6 lw 1027 765 m 16 Y s 1027 807 m 15 Y s 3 lw 1027 794 m20 6 lw 1042
 880 m 17 Y s 1042 923 m 18 Y s 3 lw 1042 910 m20 6 lw 1057 972 m 19 Y s 1057 1017 m 20 Y s 3 lw 1057 1004 m20 6 lw 1072 1023 m 20 Y s 1072 1069 m 20 Y s 3 lw 1072 1056 m20 6 lw 1087 1005 m 21 Y s 1087 1052 m 21 Y s 3 lw 1087 1039 m20 6 lw 1102 1052
 m 23 Y s 1102 1101 m 22 Y s 3 lw 1102 1088 m20 6 lw 1117 1097 m 23 Y s 1117 1146 m 23 Y s 3 lw 1117 1133 m20 6 lw 1132 1183 m 25 Y s 1132 1234 m 24 Y s 3 lw 1132 1221 m20 6 lw 1147 1183 m 25 Y s 1147 1234 m 24 Y s 3 lw 1147 1221 m20 6 lw 1162 1216
 m 25 Y s 1162 1267 m 25 Y s 3 lw 1162 1254 m20 6 lw 1176 1252 m 26 Y s 1176 1304 m 26 Y s 3 lw 1176 1291 m20 6 lw 1191 1308 m 26 Y s 1191 1360 m 26 Y s 3 lw 1191 1347 m20 6 lw 1206 1262 m 26 Y s 1206 1314 m 26 Y s 3 lw 1206 1301 m20 6 lw 1221 1241
 m 26 Y s 1221 1293 m 26 Y s 3 lw 1221 1280 m20 6 lw 1236 1223 m 26 Y s 1236 1275 m 26 Y s 3 lw 1236 1262 m20 6 lw 1251 1323 m 27 Y s 1251 1376 m 27 Y s 3 lw 1251 1363 m20 6 lw 1266 1324 m 26 Y s 1266 1376 m 27 Y s 3 lw 1266 1363 m20 6 lw 1281 1255
 m 25 Y s 1281 1306 m 25 Y s 3 lw 1281 1293 m20 6 lw 1296 1223 m 26 Y s 1296 1275 m 25 Y s 3 lw 1296 1262 m20 6 lw 1311 1175 m 25 Y s 1311 1226 m 25 Y s 3 lw 1311 1213 m20 6 lw 1326 1203 m 25 Y s 1326 1254 m 25 Y s 3 lw 1326 1241 m20 6 lw 1341 1191
 m 24 Y s 1341 1241 m 25 Y s 3 lw 1341 1228 m20 6 lw 1356 1191 m 24 Y s 1356 1241 m 24 Y s 3 lw 1356 1228 m20 6 lw 1371 1189 m 24 Y s 1371 1239 m 24 Y s 3 lw 1371 1226 m20 6 lw 1385 1140 m 23 Y s 1385 1189 m 23 Y s 3 lw 1385 1176 m20 6 lw 1400 1139
 m 23 Y s 1400 1188 m 23 Y s 3 lw 1400 1175 m20 6 lw 1415 1118 m 23 Y s 1415 1167 m 22 Y s 3 lw 1415 1154 m20 6 lw 1430 1071 m 22 Y s 1430 1119 m 22 Y s 3 lw 1430 1106 m20 6 lw 1445 1011 m 20 Y s 1445 1057 m 21 Y s 3 lw 1445 1044 m20 6 lw 1460 1022
 m 20 Y s 1460 1068 m 20 Y s 3 lw 1460 1055 m20 6 lw 1475 902 m 18 Y s 1475 946 m 18 Y s 3 lw 1475 933 m20 6 lw 1490 902 m 18 Y s 1490 946 m 18 Y s 3 lw 1490 933 m20 6 lw 1505 912 m 18 Y s 1505 956 m 18 Y s 3 lw 1505 943 m20 6 lw 1520 949 m 18 Y s
 1520 993 m 17 Y s 3 lw 1520 980 m20 6 lw 1535 862 m 17 Y s 1535 905 m 17 Y s 3 lw 1535 892 m20 6 lw 1550 807 m 15 Y s 1550 848 m 14 Y s 3 lw 1550 835 m20 6 lw 1565 810 m 15 Y s 1565 851 m 15 Y s 3 lw 1565 838 m20 6 lw 1580 784 m 14 Y s 1580 824 m
 14 Y s 3 lw 1580 811 m20 6 lw 1594 706 m 12 Y s 1594 744 m 13 Y s 3 lw 1594 731 m20 6 lw 1609 711 m 12 Y s 1609 749 m 12 Y s 3 lw 1609 736 m20 6 lw 1624 709 m 11 Y s 1624 746 m 12 Y s 3 lw 1624 733 m20 6 lw 1639 687 m 10 Y s 1639 724 m 10 Y s 3 lw
 1639 710 m20 6 lw 1654 635 m 9 Y s 1654 671 m 9 Y s 3 lw 1654 658 m20 6 lw 1669 643 m 9 Y s 1669 678 m 9 Y s 3 lw 1669 665 m20 6 lw 1684 591 m 9 Y s 1684 626 m 9 Y s 3 lw 1684 613 m20 6 lw 1699 603 m 8 Y s 1699 637 m 8 Y s 3 lw 1699 624 m20 6 lw
 1714 551 m 7 Y s 1714 584 m 7 Y s 3 lw 1714 571 m20 6 lw 1729 560 m 7 Y s 1729 593 m 6 Y s 3 lw 1729 580 m20 6 lw 1744 532 m 5 Y s 1744 564 m 5 Y s 3 lw 1744 551 m20 6 lw 1759 534 m 6 Y s 1759 566 m 5 Y s 3 lw 1759 553 m20 6 lw 1774 516 m 5 Y s
 1774 547 m 5 Y s 3 lw 1774 534 m20 6 lw 1789 547 m 6 Y s 1789 579 m 5 Y s 3 lw 1789 566 m20 6 lw 1803 484 m 4 Y s 1803 514 m 4 Y s 3 lw 1803 501 m20 6 lw 1818 497 m 4 Y s 1818 527 m 4 Y s 3 lw 1818 514 m20 6 lw 1833 503 m 4 Y s 1833 533 m 4 Y s 3
 lw 1833 520 m20 6 lw 1848 480 m 3 Y s 1848 510 m 3 Y s 3 lw 1848 496 m20 6 lw 1863 447 m 2 Y s 1863 475 m 2 Y s 3 lw 1863 462 m20 6 lw 1878 426 m 1 Y s 1878 453 m 2 Y s 3 lw 1878 440 m20 6 lw 1893 457 m 3 Y s 1893 486 m 2 Y s 3 lw 1893 473 m20 6 lw
 1908 430 m 2 Y s 1908 458 m 1 Y s 3 lw 1908 445 m20 6 lw 1923 420 m 1 Y s 1923 447 m s 3 lw 1923 434 m20 6 lw 1938 418 m 1 Y s 1938 445 m s 3 lw 1938 432 m20 6 lw 1953 432 m 1 Y s 1953 459 m 1 Y s 3 lw 1953 446 m20 6 lw 3 lw 1968 419 m20 6 lw 3 lw
 1983 426 m20 6 lw 3 lw 1998 414 m20 6 lw 3 lw 2013 415 m20 6 lw 3 lw 2027 402 m20 6 lw 3 lw 2042 387 m20 6 lw 3 lw 2057 398 m20 6 lw 3 lw 2072 378 m20 6 lw 3 lw 2087 382 m20 6 lw 3 lw 2102 371 m20 6 lw 3 lw 2117 368 m20 6 lw 3 lw 2132 397 m20 6 lw
 3 lw 2147 375 m20 6 lw black 3 lw 363 246 m 1791 X s
 gsave  2268 1538 0 0 C 1955 81 t 0 r /Helvetica findfont 71.6807 sf 0 0 m ( [GeV]) show NC gr 
 gsave  2268 1538 0 0 C 1926 62 t 0 r /Helvetica findfont 48.8732 sf 0 0 m (T) show NC gr 
 gsave  2268 1538 0 0 C 1870 81 t 0 r /Helvetica findfont 71.6807 sf 0 0 m (m) show NC gr  363 283 m -37 Y s 400 264 m -18 Y s 437 264 m -18 Y s 475 264 m -18 Y s 512 283 m -37 Y s 549 264 m -18 Y s 587 264 m -18 Y s 624 264 m -18 Y s 661 283 m -37
 Y s 699 264 m -18 Y s 736 264 m -18 Y s 773 264 m -18 Y s 811 283 m -37 Y s 848 264 m -18 Y s 885 264 m -18 Y s 923 264 m -18 Y s 960 283 m -37 Y s 997 264 m -18 Y s 1035 264 m -18 Y s 1072 264 m -18 Y s 1109 283 m -37 Y s 1147 264 m -18 Y s 1184
 264 m -18 Y s 1221 264 m -18 Y s 1259 283 m -37 Y s 1296 264 m -18 Y s 1333 264 m -18 Y s 1371 264 m -18 Y s 1408 283 m -37 Y s 1445 264 m -18 Y s 1483 264 m -18 Y s 1520 264 m -18 Y s 1557 283 m -37 Y s 1594 264 m -18 Y s 1632 264 m -18 Y s 1669
 264 m -18 Y s 1706 283 m -37 Y s 1744 264 m -18 Y s 1781 264 m -18 Y s 1818 264 m -18 Y s 1856 283 m -37 Y s 1893 264 m -18 Y s 1930 264 m -18 Y s 1968 264 m -18 Y s 2005 283 m -37 Y s 2042 264 m -18 Y s 2080 264 m -18 Y s 2117 264 m -18 Y s 2154
 283 m -37 Y s
 gsave  2268 1538 0 0 C 342 179 t 0 r /Helvetica findfont 71.6807 sf 0 0 m (0) show NC gr 
 gsave  2268 1538 0 0 C 472 179 t 0 r /Helvetica findfont 71.6807 sf 0 0 m (20) show NC gr 
 gsave  2268 1538 0 0 C 622 179 t 0 r /Helvetica findfont 71.6807 sf 0 0 m (40) show NC gr 
 gsave  2268 1538 0 0 C 769 179 t 0 r /Helvetica findfont 71.6807 sf 0 0 m (60) show NC gr 
 gsave  2268 1538 0 0 C 919 179 t 0 r /Helvetica findfont 71.6807 sf 0 0 m (80) show NC gr 
 gsave  2268 1538 0 0 C 1049 179 t 0 r /Helvetica findfont 71.6807 sf 0 0 m (100) show NC gr 
 gsave  2268 1538 0 0 C 1199 179 t 0 r /Helvetica findfont 71.6807 sf 0 0 m (120) show NC gr 
 gsave  2268 1538 0 0 C 1349 179 t 0 r /Helvetica findfont 71.6807 sf 0 0 m (140) show NC gr 
 gsave  2268 1538 0 0 C 1496 179 t 0 r /Helvetica findfont 71.6807 sf 0 0 m (160) show NC gr 
 gsave  2268 1538 0 0 C 1645 179 t 0 r /Helvetica findfont 71.6807 sf 0 0 m (180) show NC gr 
 gsave  2268 1538 0 0 C 1795 179 t 0 r /Helvetica findfont 71.6807 sf 0 0 m (200) show NC gr 
 gsave  2268 1538 0 0 C 1945 179 t 0 r /Helvetica findfont 71.6807 sf 0 0 m (220) show NC gr 
 gsave  2268 1538 0 0 C 2095 179 t 0 r /Helvetica findfont 71.6807 sf 0 0 m (240) show NC gr  363 1461 m 1791 X s 363 1425 m 36 Y s 400 1443 m 18 Y s 437 1443 m 18 Y s 475 1443 m 18 Y s 512 1425 m 36 Y s 549 1443 m 18 Y s 587 1443 m 18 Y s 624 1443
 m 18 Y s 661 1425 m 36 Y s 699 1443 m 18 Y s 736 1443 m 18 Y s 773 1443 m 18 Y s 811 1425 m 36 Y s 848 1443 m 18 Y s 885 1443 m 18 Y s 923 1443 m 18 Y s 960 1425 m 36 Y s 997 1443 m 18 Y s 1035 1443 m 18 Y s 1072 1443 m 18 Y s 1109 1425 m 36 Y s
 1147 1443 m 18 Y s 1184 1443 m 18 Y s 1221 1443 m 18 Y s 1259 1425 m 36 Y s 1296 1443 m 18 Y s 1333 1443 m 18 Y s 1371 1443 m 18 Y s 1408 1425 m 36 Y s 1445 1443 m 18 Y s 1483 1443 m 18 Y s 1520 1443 m 18 Y s 1557 1425 m 36 Y s 1594 1443 m 18 Y s
 1632 1443 m 18 Y s 1669 1443 m 18 Y s 1706 1425 m 36 Y s 1744 1443 m 18 Y s 1781 1443 m 18 Y s 1818 1443 m 18 Y s 1856 1425 m 36 Y s 1893 1443 m 18 Y s 1930 1443 m 18 Y s 1968 1443 m 18 Y s 2005 1425 m 36 Y s 2042 1443 m 18 Y s 2080 1443 m 18 Y s
 2117 1443 m 18 Y s 2154 1425 m 36 Y s 363 246 m 1215 Y s
 gsave  2268 1538 0 0 C 163 1030 t 90 r /Helvetica findfont 71.6807 sf 0 0 m (arbitrary units) show NC gr  417 302 m -54 X s 390 344 m -27 X s 390 386 m -27 X s 390 429 m -27 X s 390 471 m -27 X s 417 513 m -54 X s 390 555 m -27 X s 390 598 m -27 X
 s 390 640 m -27 X s 390 682 m -27 X s 417 724 m -54 X s 390 766 m -27 X s 390 809 m -27 X s 390 851 m -27 X s 390 893 m -27 X s 417 935 m -54 X s 390 978 m -27 X s 390 1020 m -27 X s 390 1062 m -27 X s 390 1104 m -27 X s 417 1146 m -54 X s 390 1189
 m -27 X s 390 1231 m -27 X s 390 1273 m -27 X s 390 1315 m -27 X s 417 1358 m -54 X s 417 302 m -54 X s 390 260 m -27 X s 417 1358 m -54 X s 390 1400 m -27 X s 390 1442 m -27 X s
 gsave  2268 1538 0 0 C 310 277 t 0 r /Helvetica findfont 71.6807 sf 0 0 m (0) show NC gr 
 gsave  2268 1538 0 0 C 169 489 t 0 r /Helvetica findfont 71.6807 sf 0 0 m (0.005) show NC gr 
 gsave  2268 1538 0 0 C 222 701 t 0 r /Helvetica findfont 71.6807 sf 0 0 m (0.01) show NC gr 
 gsave  2268 1538 0 0 C 169 912 t 0 r /Helvetica findfont 71.6807 sf 0 0 m (0.015) show NC gr 
 gsave  2268 1538 0 0 C 212 1121 t 0 r /Helvetica findfont 71.6807 sf 0 0 m (0.02) show NC gr 
 gsave  2268 1538 0 0 C 169 1333 t 0 r /Helvetica findfont 71.6807 sf 0 0 m (0.025) show NC gr  2154 246 m 1215 Y s 2101 302 m 53 X s 2127 344 m 27 X s 2127 386 m 27 X s 2127 429 m 27 X s 2127 471 m 27 X s 2101 513 m 53 X s 2127 555 m 27 X s 2127
 598 m 27 X s 2127 640 m 27 X s 2127 682 m 27 X s 2101 724 m 53 X s 2127 766 m 27 X s 2127 809 m 27 X s 2127 851 m 27 X s 2127 893 m 27 X s 2101 935 m 53 X s 2127 978 m 27 X s 2127 1020 m 27 X s 2127 1062 m 27 X s 2127 1104 m 27 X s 2101 1146 m 53 X
 s 2127 1189 m 27 X s 2127 1231 m 27 X s 2127 1273 m 27 X s 2127 1315 m 27 X s 2101 1358 m 53 X s 2101 302 m 53 X s 2127 260 m 27 X s 2101 1358 m 53 X s 2127 1400 m 27 X s 2127 1442 m 27 X s 0 0 1 c 6 lw 1 1 1 c black 0 0 1 c 363 302 m 60 X 1 Y 14 X
 1 Y 15 X 1 Y 15 X 1 Y 15 X 1 Y 15 X 2 Y 15 X 2 Y 15 X 2 Y 15 X 2 Y 15 X 2 Y 15 X 2 Y 30 X 4 Y 30 X 4 Y 14 X 1 Y 15 X 2 Y 15 X 2 Y 30 X 1 Y 15 X 3 Y 15 X 1 Y 15 X 2 Y 15 X 3 Y 15 X 1 Y 15 X 2 Y 15 X 4 Y 15 X 2 Y 15 X 3 Y 14 X 4 Y 15 X 3 Y 15 X 8 Y
 15 X 21 Y 15 X 21 Y 15 X 36 Y 15 X 55 Y 15 X 65 Y 15 X 46 Y 15 X 64 Y 15 X 60 Y 15 X 74 Y 15 X 79 Y 15 X 67 Y 15 X 23 Y 14 X 80 Y 15 X 54 Y 15 X 22 Y 15 X 47 Y 15 X 32 Y 15 X -10 Y 15 X 26 Y 15 X 20 Y 15 X 18 Y 15 X -15 Y 15 X 23 Y 15 X -3 Y 15 X
 15 Y 15 X -9 Y 14 X -5 Y 15 X -23 Y 15 X -9 Y 15 X 6 Y 15 X -35 Y 15 X 7 Y 15 X -24 Y 15 X -39 Y 15 X -1 Y 15 X -16 Y 15 X -49 Y 15 X -2 Y 15 X -42 Y 15 X -12 Y 14 X -28 Y 15 X -49 Y 15 X -18 Y 15 X -18 Y 15 X -43 Y 15 X -41 Y 15 X -20 Y 15 X -31 Y
 15 X -34 Y 15 X -25 Y 15 X -36 Y 15 X -6 Y 15 X -31 Y 15 X -22 Y 14 X -16 Y 15 X -17 Y 15 X -10 Y 15 X -18 Y 15 X -16 Y 15 X -15 Y 15 X -16 Y 15 X -2 Y 15 X -16 Y 15 X -14 Y 15 X -6 Y 15 X -14 Y 15 X -2 Y 15 X -11 Y 14 X -9 Y 15 X -5 Y 15 X -9 Y 15
 X -7 Y 15 X -2 Y 15 X -5 Y 15 X -10 Y 15 X 2 Y 15 X -11 Y 15 X -5 Y 15 X -6 Y 15 X -1 Y 15 X -4 Y 15 X -7 Y 14 X 1 Y 15 X -2 Y 15 X s 1 1 1 c 0 lw 710 231 388 1193 bf 3 lw 407 1193 m -14 Y 704 X 225 Y -13 X -211 Y f 0 lw 388 1193 m 231 Y 710 X -231
 Y -710 X cl s black
 gsave  2268 1538 0 0 C 564 1336 t 0 r /Helvetica findfont 87.9718 sf 0 0 m (MCFM) show NC gr  1 1 1 c 3 lw 414 1326 m 125 X 80 Y -125 X f 0 lw 0 0 1 c 6 lw 414 1366 m 125 X s black 3 lw 477 1366 m20 6 lw
 gsave  2268 1538 0 0 C 564 1225 t 0 r /Helvetica findfont 87.9718 sf 0 0 m (MC@NLO) show NC gr  1 1 1 c 3 lw 414 1210 m 125 X 81 Y -125 X f 6 lw 1 0 0 c 414 1250 m 125 X s 3 lw 477 1250 m20 6 lw black
 gsave  2268 1538 0 0 C 2222 1118 t 90 r /Helvetica-BoldOblique findfont 29.3239 sf 0 0 m (LHC HIGGS XS WG 2011) show NC gr 
 gr  gr 
showpage
end
%%EOF
