%!PS-Adobe-2.0 EPSF-2.0
%%BoundingBox:  0 0 567 384
%%Title: mZ2.eps: mZ2
%%Creator: ROOT Version 5.27/06b
%%CreationDate: Mon Dec 12 11:15:49 2011
%%EndComments
%%BeginProlog
80 dict begin
/s {stroke} def /l {lineto} def /m {moveto} def /t {translate} def
/r {rotate} def /rl {roll}  def /R {repeat} def
/d {rlineto} def /rm {rmoveto} def /gr {grestore} def /f {eofill} def
/c {setrgbcolor} def /black {0 setgray} def /sd {setdash} def
/cl {closepath} def /sf {scalefont setfont} def /lw {setlinewidth} def
/box {m dup 0 exch d exch 0 d 0 exch neg d cl} def
/NC{systemdict begin initclip end}def/C{NC box clip newpath}def
/bl {box s} def /bf {box f} def /Y { 0 exch d} def /X { 0 d} def 
/K {{pop pop 0 moveto} exch kshow} bind def
/ita {/ang 15 def gsave [1 0 ang dup sin exch cos div 1 0 0] concat} def 
/mp {newpath /y exch def /x exch def} def
/side {[w .77 mul w .23 mul] .385 w mul sd w 0 l currentpoint t -144 r} def
/mr {mp x y w2 0 360 arc} def /m24 {mr s} def /m20 {mr f} def
/mb {mp x y w2 add m w2 neg 0 d 0 w neg d w 0 d 0 w d cl} def
/mt {mp x y w2 add m w2 neg w neg d w 0 d cl} def
/m21 {mb f} def /m25 {mb s} def /m22 {mt f} def /m26{mt s} def
/m23 {mp x y w2 sub m w2 w d w neg 0 d cl f} def
/m27 {mp x y w2 add m w3 neg w2 neg d w3 w2 neg d w3 w2 d cl s} def
/m28 {mp x w2 sub y w2 sub w3 add m w3 0 d  0 w3 neg d w3 0 d 0 w3 d w3 0 d  0 w3 d w3 neg 0 d 0 w3 d w3 neg 0 d 0 w3 neg d w3 neg 0 d cl s } def
/m29 {mp gsave x w2 sub y w2 add w3 sub m currentpoint t 4 {side} repeat cl fill gr} def
/m30 {mp gsave x w2 sub y w2 add w3 sub m currentpoint t 4 {side} repeat cl s gr} def
/m31 {mp x y w2 sub m 0 w d x w2 sub y m w 0 d x w2 sub y w2 add m w w neg d x w2 sub y w2 sub m w w d s} def
/m32 {mp x y w2 sub m w2 w d w neg 0 d cl s} def
/m33 {mp x y w2 add m w3 neg w2 neg d w3 w2 neg d w3 w2 d cl f} def
/m34 {mp x w2 sub y w2 sub w3 add m w3 0 d  0 w3 neg d w3 0 d 0 w3 d w3 0 d  0 w3 d w3 neg 0 d 0 w3 d w3 neg 0 d 0 w3 neg d w3 neg 0 d cl f } def
/m2 {mp x y w2 sub m 0 w d x w2 sub y m w 0 d s} def
/m5 {mp x w2 sub y w2 sub m w w d x w2 sub y w2 add m w w neg d s} def
/reEncode {exch findfont dup length dict begin {1 index /FID eq  {pop pop} {def} ifelse } forall /Encoding exch def currentdict end dup /FontName get exch definefont pop } def [/Times-Bold /Times-Italic /Times-BoldItalic /Helvetica /Helvetica-Oblique
 /Helvetica-Bold /Helvetica-BoldOblique /Courier /Courier-Oblique /Courier-Bold /Courier-BoldOblique /Times-Roman /AvantGarde-Book /AvantGarde-BookOblique /AvantGarde-Demi /AvantGarde-DemiOblique /Bookman-Demi /Bookman-DemiItalic /Bookman-Light
 /Bookman-LightItalic /Helvetica-Narrow /Helvetica-Narrow-Bold /Helvetica-Narrow-BoldOblique /Helvetica-Narrow-Oblique /NewCenturySchlbk-Roman /NewCenturySchlbk-Bold /NewCenturySchlbk-BoldItalic /NewCenturySchlbk-Italic /Palatino-Bold
 /Palatino-BoldItalic /Palatino-Italic /Palatino-Roman ] {ISOLatin1Encoding reEncode } forall%%EndProlog
%%BeginSetup
%%EndSetup
newpath  gsave  .25 .25 scale  gsave  0 0 t black[  ] 0 sd 3 lw 1 1 1 c 2268 1538 0 0 bf black 1 1 1 c 1791 1215 363 246 bf black 1791 1215 363 246 bl 1 1 1 c 1791 1215 363 246 bf black 1791 1215 363 246 bl 363 246 m 1791 X s
 gsave  2268 1538 0 0 C 1466.38 84.5 t 0 r /Helvetica findfont 71.6807 sf 0 0 m (smaller Z mass [GeV]) show NC gr  363 283 m -37 Y s 418 264 m -18 Y s 473 264 m -18 Y s 528 264 m -18 Y s 583 264 m -18 Y s 638 283 m -37 Y s 694 264 m -18 Y s 749 264 m
 -18 Y s 804 264 m -18 Y s 859 264 m -18 Y s 914 283 m -37 Y s 969 264 m -18 Y s 1024 264 m -18 Y s 1079 264 m -18 Y s 1135 264 m -18 Y s 1190 283 m -37 Y s 1245 264 m -18 Y s 1300 264 m -18 Y s 1355 264 m -18 Y s 1410 264 m -18 Y s 1465 283 m -37 Y
 s 1520 264 m -18 Y s 1576 264 m -18 Y s 1631 264 m -18 Y s 1686 264 m -18 Y s 1741 283 m -37 Y s 1796 264 m -18 Y s 1851 264 m -18 Y s 1906 264 m -18 Y s 1961 264 m -18 Y s 2017 283 m -37 Y s 2017 283 m -37 Y s 2072 264 m -18 Y s 2127 264 m -18 Y s
 gsave  2268 1538 0 0 C 342.25 178.938 t 0 r /Helvetica findfont 71.6807 sf 0 0 m (0) show NC gr 
 gsave  2268 1538 0 0 C 596.438 178.938 t 0 r /Helvetica findfont 71.6807 sf 0 0 m (10) show NC gr 
 gsave  2268 1538 0 0 C 873.375 178.938 t 0 r /Helvetica findfont 71.6807 sf 0 0 m (20) show NC gr 
 gsave  2268 1538 0 0 C 1150.31 178.938 t 0 r /Helvetica findfont 71.6807 sf 0 0 m (30) show NC gr 
 gsave  2268 1538 0 0 C 1424 178.938 t 0 r /Helvetica findfont 71.6807 sf 0 0 m (40) show NC gr 
 gsave  2268 1538 0 0 C 1700.94 178.938 t 0 r /Helvetica findfont 71.6807 sf 0 0 m (50) show NC gr 
 gsave  2268 1538 0 0 C 1974.62 178.938 t 0 r /Helvetica findfont 71.6807 sf 0 0 m (60) show NC gr  363 1461 m 1791 X s 363 1425 m 36 Y s 418 1443 m 18 Y s 473 1443 m 18 Y s 528 1443 m 18 Y s 583 1443 m 18 Y s 638 1425 m 36 Y s 694 1443 m 18 Y s 749
 1443 m 18 Y s 804 1443 m 18 Y s 859 1443 m 18 Y s 914 1425 m 36 Y s 969 1443 m 18 Y s 1024 1443 m 18 Y s 1079 1443 m 18 Y s 1135 1443 m 18 Y s 1190 1425 m 36 Y s 1245 1443 m 18 Y s 1300 1443 m 18 Y s 1355 1443 m 18 Y s 1410 1443 m 18 Y s 1465 1425 m
 36 Y s 1520 1443 m 18 Y s 1576 1443 m 18 Y s 1631 1443 m 18 Y s 1686 1443 m 18 Y s 1741 1425 m 36 Y s 1796 1443 m 18 Y s 1851 1443 m 18 Y s 1906 1443 m 18 Y s 1961 1443 m 18 Y s 2017 1425 m 36 Y s 2017 1425 m 36 Y s 2072 1443 m 18 Y s 2127 1443 m 18
 Y s 363 246 m 1215 Y s
 gsave  2268 1538 0 0 C 172.875 755.688 t 90 r /Helvetica findfont 71.6807 sf 0 0 m (arbitrary normalization) show NC gr  390 261 m -27 X s 417 289 m -54 X s
 gsave  2268 1538 0 0 C 300 289.75 t 0 r /Helvetica findfont 48.8732 sf 0 0 m (\2553) show NC gr 
 gsave  2268 1538 0 0 C 221.75 257.188 t 0 r /Helvetica findfont 71.6807 sf 0 0 m (10) show NC gr  390 472 m -27 X s 390 579 m -27 X s 390 655 m -27 X s 390 714 m -27 X s 390 762 m -27 X s 390 802 m -27 X s 390 838 m -27 X s 390 869 m -27 X s 417 896
 m -54 X s
 gsave  2268 1538 0 0 C 300 895.75 t 0 r /Helvetica findfont 48.8732 sf 0 0 m (\2552) show NC gr 
 gsave  2268 1538 0 0 C 221.75 866.438 t 0 r /Helvetica findfont 71.6807 sf 0 0 m (10) show NC gr  390 1079 m -27 X s 390 1186 m -27 X s 390 1262 m -27 X s 390 1321 m -27 X s 390 1369 m -27 X s 390 1410 m -27 X s 390 1445 m -27 X s 2154 246 m 1215 Y
 s 2127 261 m 27 X s 2101 289 m 53 X s 2127 472 m 27 X s 2127 579 m 27 X s 2127 655 m 27 X s 2127 714 m 27 X s 2127 762 m 27 X s 2127 802 m 27 X s 2127 838 m 27 X s 2127 869 m 27 X s 2101 896 m 53 X s 2127 1079 m 27 X s 2127 1186 m 27 X s 2127 1262 m
 27 X s 2127 1321 m 27 X s 2127 1369 m 27 X s 2127 1410 m 27 X s 2127 1445 m 27 X s 1 0 0 c 6 lw 1 1 1 c black 1 0 0 c 384 246 m 199 Y s 384 471 m 123 Y s 3 lw black /w 31 def /w2 {w 2 div} def /w3 {w 3 div} def 384 458 m20 6 lw 1 0 0 c 425 615 m 93
 Y s 425 734 m 62 Y s 3 lw black 425 721 m20 6 lw 1 0 0 c 466 833 m 46 Y s 466 905 m 34 Y s 3 lw black 466 892 m20 6 lw 1 0 0 c 508 947 m 27 Y s 508 1000 m 21 Y s 3 lw black 508 987 m20 6 lw 1 0 0 c 549 1025 m 19 Y s 549 1070 m 16 Y s 3 lw black 549
 1057 m20 6 lw 1 0 0 c 590 1085 m 15 Y s 590 1126 m 12 Y s 3 lw black 590 1113 m20 6 lw 1 0 0 c 632 1136 m 14 Y s 632 1176 m 11 Y s 3 lw black 632 1163 m20 6 lw 1 0 0 c 673 1165 m 13 Y s 673 1204 m 11 Y s 3 lw black 673 1191 m20 6 lw 1 0 0 c 714 1193
 m 16 Y s 714 1235 m 13 Y s 3 lw black 714 1222 m20 6 lw 1 0 0 c 756 1249 m 9 Y s 756 1284 m 8 Y s 3 lw black 756 1271 m20 6 lw 1 0 0 c 797 1275 m 11 Y s 797 1312 m 9 Y s 3 lw black 797 1299 m20 6 lw 1 0 0 c 838 1319 m 4 Y s 838 1349 m 3 Y s 3 lw
 black 838 1336 m20 6 lw 1 0 0 c 880 1337 m 3 Y s 880 1366 m 3 Y s 3 lw black 880 1353 m20 6 lw 1 0 0 c 921 1352 m 2 Y s 921 1380 m 2 Y s 3 lw black 921 1367 m20 6 lw 1 0 0 c 962 1367 m 3 Y s 962 1396 m 2 Y s 3 lw black 962 1383 m20 6 lw 3 lw 1004
 1410 m20 6 lw 1 0 0 c 1045 1388 m 1 Y s 3 lw black 1045 1402 m20 6 lw 1 0 0 c 1086 1374 m 3 Y s 1086 1403 m 2 Y s 3 lw black 1086 1390 m20 6 lw 1 0 0 c 1128 1311 m 5 Y s 1128 1342 m 4 Y s 3 lw black 1128 1329 m20 6 lw 1 0 0 c 1169 1207 m 12 Y s 1169
 1245 m 10 Y s 3 lw black 1169 1232 m20 6 lw 1 0 0 c 1210 1131 m 12 Y s 1210 1169 m 10 Y s 3 lw black 1210 1156 m20 6 lw 1 0 0 c 1252 1030 m 34 Y s 1252 1090 m 26 Y s 3 lw black 1252 1077 m20 6 lw 1 0 0 c 1293 1058 m 20 Y s 1293 1104 m 17 Y s 3 lw
 black 1293 1091 m20 6 lw 1 0 0 c 1334 1017 m 21 Y s 1334 1065 m 17 Y s 3 lw black 1334 1052 m20 6 lw 1 0 0 c 1376 975 m 27 Y s 1376 1028 m 22 Y s 3 lw black 1376 1015 m20 6 lw 1 0 0 c 1417 983 m 28 Y s 1417 1037 m 22 Y s 3 lw black 1417 1024 m20 6
 lw 1 0 0 c 1458 956 m 28 Y s 1458 1010 m 23 Y s 3 lw black 1458 997 m20 6 lw 1 0 0 c 1500 923 m 28 Y s 1500 977 m 22 Y s 3 lw black 1500 964 m20 6 lw 1 0 0 c 1541 906 m 35 Y s 1541 967 m 28 Y s 3 lw black 1541 954 m20 6 lw 1 0 0 c 1582 911 m 36 Y s
 1582 974 m 28 Y s 3 lw black 1582 960 m20 6 lw 1 0 0 c 1624 855 m 41 Y s 1624 922 m 32 Y s 3 lw black 1624 909 m20 6 lw 1 0 0 c 1665 821 m 46 Y s 1665 893 m 35 Y s 3 lw black 1665 880 m20 6 lw 1 0 0 c 1706 786 m 54 Y s 1706 866 m 41 Y s 3 lw black
 1706 853 m20 6 lw 1 0 0 c 1748 763 m 52 Y s 1748 841 m 40 Y s 3 lw black 1748 828 m20 6 lw 1 0 0 c 1789 693 m 78 Y s 1789 797 m 54 Y s 3 lw black 1789 784 m20 6 lw 1 0 0 c 1830 647 m 72 Y s 1830 745 m 52 Y s 3 lw black 1830 732 m20 6 lw 1 0 0 c 1872
 491 m 114 Y s 1872 632 m 72 Y s 3 lw black 1872 618 m20 6 lw 1 0 0 c 1913 390 m 151 Y s 1913 567 m 87 Y s 3 lw black 1913 554 m20 6 lw 1 0 0 c 1955 246 m 81 Y s 1955 353 m 154 Y s 3 lw black 1955 340 m20 6 lw 1 0 0 c 1 1 1 c black 1 0 0 c 363 458 m
 41 X 263 Y 42 X 171 Y 41 X 95 Y 41 X 70 Y 42 X 56 Y 41 X 50 Y 41 X 28 Y 42 X 31 Y 41 X 49 Y 41 X 28 Y 42 X 37 Y 41 X 17 Y 41 X 14 Y 42 X 16 Y 41 X 27 Y 41 X -8 Y 42 X -12 Y 41 X -61 Y 41 X -97 Y 42 X -76 Y 41 X -79 Y 41 X 14 Y 42 X -39 Y 41 X -37 Y
 41 X 9 Y 42 X -27 Y 41 X -33 Y 41 X -10 Y 42 X 6 Y 41 X -51 Y 41 X -29 Y 42 X -27 Y 41 X -25 Y 41 X -44 Y 42 X -52 Y 41 X -114 Y 41 X -64 Y 42 X -214 Y 41 X -94 Y 179 X s black 1 1 1 c black 363 246 m 41 X 442 Y 42 X 215 Y 41 X 86 Y 41 X 72 Y 42 X
 66 Y 41 X 40 Y 41 X 50 Y 42 X 33 Y 41 X 39 Y 41 X 31 Y 42 X 27 Y 41 X 23 Y 41 X 19 Y 42 X 20 Y 41 X 4 Y 41 X 2 Y 42 X -20 Y 41 X -58 Y 41 X -117 Y 42 X -100 Y 41 X -54 Y 41 X -38 Y 42 X -28 Y 41 X -25 Y 41 X -22 Y 42 X -16 Y 41 X -16 Y 41 X -23 Y 42
 X -12 Y 41 X -34 Y 41 X -12 Y 42 X -35 Y 41 X -30 Y 41 X -47 Y 42 X -50 Y 41 X -63 Y 41 X -126 Y 42 X -140 Y 41 X -103 Y 179 X s 0 0 1 c[  12 12 ] 0 sd 1 1 1 c black 0 0 1 c 363 246 m 41 X 441 Y 42 X 215 Y 41 X 87 Y 41 X 71 Y 42 X 66 Y 41 X 41 Y 41
 X 50 Y 42 X 33 Y 41 X 38 Y 41 X 32 Y 42 X 27 Y 41 X 23 Y 41 X 19 Y 42 X 20 Y 41 X 3 Y 41 X 3 Y 42 X -19 Y 41 X -59 Y 41 X -117 Y 42 X -100 Y 41 X -55 Y 41 X -37 Y 42 X -27 Y 41 X -25 Y 41 X -24 Y 42 X -13 Y 41 X -19 Y 41 X -21 Y 42 X -13 Y 41 X -34
 Y 41 X -11 Y 42 X -35 Y 41 X -27 Y 41 X -48 Y 42 X -54 Y 41 X -60 Y 41 X -132 Y 42 X -137 Y 41 X -102 Y 179 X s black
 gsave  2268 1538 0 0 C 2199.44 1123.88 t 90 r /Helvetica-BoldOblique findfont 29.3239 sf 0 0 m 
 317 303 287 271 263 240 213 205 186 167 159 140 118 95 87 67 59 38 17
(LHC HIGGS XS WG 2011) K NC gr 
 gr  gr showpage
end
%%EOF
