%!PS-Adobe-2.0 EPSF-2.0
%%BoundingBox:  0 0 567 384
%%Title: mZ2.eps: mZ2
%%Creator: ROOT Version 5.27/06b
%%CreationDate: Mon Dec 12 11:24:52 2011
%%EndComments
%%BeginProlog
80 dict begin
/s {stroke} def /l {lineto} def /m {moveto} def /t {translate} def
/r {rotate} def /rl {roll}  def /R {repeat} def
/d {rlineto} def /rm {rmoveto} def /gr {grestore} def /f {eofill} def
/c {setrgbcolor} def /black {0 setgray} def /sd {setdash} def
/cl {closepath} def /sf {scalefont setfont} def /lw {setlinewidth} def
/box {m dup 0 exch d exch 0 d 0 exch neg d cl} def
/NC{systemdict begin initclip end}def/C{NC box clip newpath}def
/bl {box s} def /bf {box f} def /Y { 0 exch d} def /X { 0 d} def 
/K {{pop pop 0 moveto} exch kshow} bind def
/ita {/ang 15 def gsave [1 0 ang dup sin exch cos div 1 0 0] concat} def 
/mp {newpath /y exch def /x exch def} def
/side {[w .77 mul w .23 mul] .385 w mul sd w 0 l currentpoint t -144 r} def
/mr {mp x y w2 0 360 arc} def /m24 {mr s} def /m20 {mr f} def
/mb {mp x y w2 add m w2 neg 0 d 0 w neg d w 0 d 0 w d cl} def
/mt {mp x y w2 add m w2 neg w neg d w 0 d cl} def
/m21 {mb f} def /m25 {mb s} def /m22 {mt f} def /m26{mt s} def
/m23 {mp x y w2 sub m w2 w d w neg 0 d cl f} def
/m27 {mp x y w2 add m w3 neg w2 neg d w3 w2 neg d w3 w2 d cl s} def
/m28 {mp x w2 sub y w2 sub w3 add m w3 0 d  0 w3 neg d w3 0 d 0 w3 d w3 0 d  0 w3 d w3 neg 0 d 0 w3 d w3 neg 0 d 0 w3 neg d w3 neg 0 d cl s } def
/m29 {mp gsave x w2 sub y w2 add w3 sub m currentpoint t 4 {side} repeat cl fill gr} def
/m30 {mp gsave x w2 sub y w2 add w3 sub m currentpoint t 4 {side} repeat cl s gr} def
/m31 {mp x y w2 sub m 0 w d x w2 sub y m w 0 d x w2 sub y w2 add m w w neg d x w2 sub y w2 sub m w w d s} def
/m32 {mp x y w2 sub m w2 w d w neg 0 d cl s} def
/m33 {mp x y w2 add m w3 neg w2 neg d w3 w2 neg d w3 w2 d cl f} def
/m34 {mp x w2 sub y w2 sub w3 add m w3 0 d  0 w3 neg d w3 0 d 0 w3 d w3 0 d  0 w3 d w3 neg 0 d 0 w3 d w3 neg 0 d 0 w3 neg d w3 neg 0 d cl f } def
/m2 {mp x y w2 sub m 0 w d x w2 sub y m w 0 d s} def
/m5 {mp x w2 sub y w2 sub m w w d x w2 sub y w2 add m w w neg d s} def
/reEncode {exch findfont dup length dict begin {1 index /FID eq  {pop pop} {def} ifelse } forall /Encoding exch def currentdict end dup /FontName get exch definefont pop } def [/Times-Bold /Times-Italic /Times-BoldItalic /Helvetica /Helvetica-Oblique
 /Helvetica-Bold /Helvetica-BoldOblique /Courier /Courier-Oblique /Courier-Bold /Courier-BoldOblique /Times-Roman /AvantGarde-Book /AvantGarde-BookOblique /AvantGarde-Demi /AvantGarde-DemiOblique /Bookman-Demi /Bookman-DemiItalic /Bookman-Light
 /Bookman-LightItalic /Helvetica-Narrow /Helvetica-Narrow-Bold /Helvetica-Narrow-BoldOblique /Helvetica-Narrow-Oblique /NewCenturySchlbk-Roman /NewCenturySchlbk-Bold /NewCenturySchlbk-BoldItalic /NewCenturySchlbk-Italic /Palatino-Bold
 /Palatino-BoldItalic /Palatino-Italic /Palatino-Roman ] {ISOLatin1Encoding reEncode } forall%%EndProlog
%%BeginSetup
%%EndSetup
newpath  gsave  .25 .25 scale  gsave  0 0 t black[  ] 0 sd 3 lw 1 1 1 c 2268 1538 0 0 bf black 1 1 1 c 1791 1215 363 246 bf black 1791 1215 363 246 bl 1 1 1 c 1791 1215 363 246 bf black 1791 1215 363 246 bl 1 0 0 c 6 lw 1 1 1 c black 1 0 0 c 394 246
 m 387 Y s 394 659 m 254 Y s 3 lw black /w 31 def /w2 {w 2 div} def /w3 {w 3 div} def 394 646 m20 6 lw 1 0 0 c 436 246 m 495 Y s 436 767 m 176 Y s 3 lw black 436 754 m20 6 lw 1 0 0 c 457 246 m 41 Y s 457 313 m 615 Y s 3 lw black 457 300 m20 6 lw 1 0
 0 c 477 246 m 350 Y s 477 622 m 317 Y s 3 lw black 477 609 m20 6 lw 1 0 0 c 498 246 m 537 Y s 498 809 m 147 Y s 3 lw black 498 796 m20 6 lw 1 0 0 c 519 246 m 532 Y s 519 804 m 161 Y s 3 lw black 519 791 m20 6 lw 1 0 0 c 540 246 m 548 Y s 540 820 m
 146 Y s 3 lw black 540 807 m20 6 lw 1 0 0 c 561 246 m 483 Y s 561 755 m 204 Y s 3 lw black 561 742 m20 6 lw 1 0 0 c 582 246 m 559 Y s 582 832 m 145 Y s 3 lw black 582 819 m20 6 lw 1 0 0 c 602 246 m 536 Y s 602 808 m 160 Y s 3 lw black 602 795 m20 6
 lw 1 0 0 c 623 246 m 582 Y s 623 854 m 122 Y s 3 lw black 623 841 m20 6 lw 1 0 0 c 644 246 m 572 Y s 644 844 m 130 Y s 3 lw black 644 831 m20 6 lw 1 0 0 c 665 246 m 503 Y s 665 775 m 188 Y s 3 lw black 665 762 m20 6 lw 1 0 0 c 686 246 m 584 Y s 686
 856 m 121 Y s 3 lw black 686 843 m20 6 lw 1 0 0 c 707 246 m 608 Y s 707 880 m 111 Y s 3 lw black 707 867 m20 6 lw 1 0 0 c 727 246 m 575 Y s 727 847 m 135 Y s 3 lw black 727 834 m20 6 lw 1 0 0 c 748 246 m 534 Y s 748 806 m 163 Y s 3 lw black 748 793
 m20 6 lw 1 0 0 c 769 246 m 378 Y s 769 650 m 315 Y s 3 lw black 769 637 m20 6 lw 1 0 0 c 790 246 m 629 Y s 790 901 m 91 Y s 3 lw black 790 888 m20 6 lw 1 0 0 c 811 246 m 576 Y s 811 848 m 143 Y s 3 lw black 811 835 m20 6 lw 1 0 0 c 852 246 m 635 Y s
 852 908 m 91 Y s 3 lw black 852 894 m20 6 lw 1 0 0 c 873 246 m 586 Y s 873 858 m 131 Y s 3 lw black 873 845 m20 6 lw 1 0 0 c 894 246 m 523 Y s 894 795 m 183 Y s 3 lw black 894 782 m20 6 lw 1 0 0 c 915 246 m 514 Y s 915 786 m 202 Y s 3 lw black 915
 773 m20 6 lw 1 0 0 c 936 246 m 649 Y s 936 921 m 88 Y s 3 lw black 936 908 m20 6 lw 1 0 0 c 957 246 m 573 Y s 957 845 m 152 Y s 3 lw black 957 832 m20 6 lw 1 0 0 c 977 246 m 655 Y s 977 927 m 82 Y s 3 lw black 977 914 m20 6 lw 1 0 0 c 998 246 m 645
 Y s 998 917 m 95 Y s 3 lw black 998 904 m20 6 lw 1 0 0 c 1019 246 m 644 Y s 1019 916 m 102 Y s 3 lw black 1019 903 m20 6 lw 1 0 0 c 1040 246 m 631 Y s 1040 903 m 99 Y s 3 lw black 1040 890 m20 6 lw 1 0 0 c 1061 246 m 680 Y s 1061 952 m 74 Y s 3 lw
 black 1061 939 m20 6 lw 1 0 0 c 1082 246 m 686 Y s 1082 958 m 60 Y s 3 lw black 1082 945 m20 6 lw 1 0 0 c 1102 246 m 683 Y s 1102 955 m 74 Y s 3 lw black 1102 942 m20 6 lw 1 0 0 c 1123 246 m 711 Y s 1123 983 m 56 Y s 3 lw black 1123 970 m20 6 lw 1 0
 0 c 1144 246 m 681 Y s 1144 953 m 77 Y s 3 lw black 1144 940 m20 6 lw 1 0 0 c 1165 246 m 701 Y s 1165 973 m 67 Y s 3 lw black 1165 960 m20 6 lw 1 0 0 c 1186 246 m 623 Y s 1186 895 m 123 Y s 3 lw black 1186 882 m20 6 lw 1 0 0 c 1207 246 m 726 Y s
 1207 998 m 47 Y s 3 lw black 1207 985 m20 6 lw 1 0 0 c 1227 246 m 724 Y s 1227 996 m 53 Y s 3 lw black 1227 983 m20 6 lw 1 0 0 c 1248 246 m 736 Y s 1248 1008 m 51 Y s 3 lw black 1248 995 m20 6 lw 1 0 0 c 1269 246 m 730 Y s 1269 1002 m 53 Y s 3 lw
 black 1269 989 m20 6 lw 1 0 0 c 1290 753 m 245 Y s 1290 1024 m 40 Y s 3 lw black 1290 1011 m20 6 lw 1 0 0 c 1311 914 m 107 Y s 1311 1048 m 32 Y s 3 lw black 1311 1034 m20 6 lw 1 0 0 c 1331 887 m 130 Y s 1331 1043 m 35 Y s 3 lw black 1331 1030 m20 6
 lw 1 0 0 c 1352 246 m 739 Y s 1352 1011 m 54 Y s 3 lw black 1352 998 m20 6 lw 1 0 0 c 1373 915 m 114 Y s 1373 1055 m 32 Y s 3 lw black 1373 1042 m20 6 lw 1 0 0 c 1394 1008 m 50 Y s 1394 1084 m 22 Y s 3 lw black 1394 1071 m20 6 lw 1 0 0 c 1415 1023 m
 42 Y s 1415 1091 m 19 Y s 3 lw black 1415 1078 m20 6 lw 1 0 0 c 1436 1040 m 36 Y s 1436 1102 m 17 Y s 3 lw black 1436 1089 m20 6 lw 1 0 0 c 1456 1053 m 32 Y s 1456 1111 m 15 Y s 3 lw black 1456 1098 m20 6 lw 1 0 0 c 1477 1093 m 15 Y s 1477 1134 m 8
 Y s 3 lw black 1477 1121 m20 6 lw 1 0 0 c 1498 1124 m 12 Y s 1498 1162 m 6 Y s 3 lw black 1498 1149 m20 6 lw 1 0 0 c 1519 1151 m 5 Y s 1519 1183 m 2 Y s 3 lw black 1519 1170 m20 6 lw 3 lw 1540 1204 m20 6 lw 3 lw 1561 1241 m20 6 lw 3 lw 1581 1292 m20
 6 lw 3 lw 1602 1361 m20 6 lw 3 lw 1623 1410 m20 6 lw 3 lw 1644 1339 m20 6 lw 1 0 0 c 1665 1179 m 1 Y s 3 lw black 1665 1193 m20 6 lw 1 0 0 c 1686 1060 m 29 Y s 1686 1115 m 14 Y s 3 lw black 1686 1102 m20 6 lw 1 0 0 c 1706 926 m 96 Y s 1706 1048 m 30
 Y s 3 lw black 1706 1035 m20 6 lw 1 0 0 c 1727 246 m 708 Y s 1727 980 m 58 Y s 3 lw black 1727 967 m20 6 lw 1 0 0 c 1748 246 m 612 Y s 1748 885 m 111 Y s 3 lw black 1748 872 m20 6 lw 1 0 0 c 1769 246 m 646 Y s 1769 918 m 87 Y s 3 lw black 1769 905
 m20 6 lw 1 0 0 c 1790 246 m 563 Y s 1790 835 m 147 Y s 3 lw black 1790 822 m20 6 lw 1 0 0 c 1811 246 m 606 Y s 1811 878 m 105 Y s 3 lw black 1811 865 m20 6 lw 1 0 0 c 1831 246 m 579 Y s 1831 851 m 114 Y s 3 lw black 1831 838 m20 6 lw 1 0 0 c 1852
 246 m 500 Y s 1852 772 m 179 Y s 3 lw black 1852 759 m20 6 lw 1 0 0 c 1873 246 m 578 Y s 1873 850 m 111 Y s 3 lw black 1873 837 m20 6 lw 1 0 0 c 1894 246 m 485 Y s 1894 757 m 182 Y s 3 lw black 1894 744 m20 6 lw 1 0 0 c 1915 246 m 508 Y s 1915 780 m
 172 Y s 3 lw black 1915 767 m20 6 lw 1 0 0 c 1936 246 m 493 Y s 1936 765 m 169 Y s 3 lw black 1936 752 m20 6 lw 1 0 0 c 1956 246 m 460 Y s 1956 732 m 214 Y s 3 lw black 1956 719 m20 6 lw 1 0 0 c 1977 246 m 392 Y s 1977 664 m 316 Y s 3 lw black 1977
 651 m20 6 lw 1 0 0 c 1998 246 m 386 Y s 1998 658 m 281 Y s 3 lw black 1998 645 m20 6 lw 1 0 0 c 2061 246 m 381 Y s 2061 653 m 265 Y s 3 lw black 2061 640 m20 6 lw 1 0 0 c 2102 246 m 383 Y s 2102 655 m 304 Y s 3 lw black 2102 642 m20 6 lw 1 0 0 c
 2123 246 m 447 Y s 2123 719 m 192 Y s 3 lw black 2123 706 m20 6 lw 1 0 0 c 1 1 1 c black 1 0 0 c 363 246 m 21 X 400 Y 20 X -400 Y 21 X 508 Y 21 X -454 Y 21 X 309 Y 21 X 187 Y 21 X -5 Y 20 X 16 Y 21 X -65 Y 21 X 77 Y 21 X -24 Y 21 X 46 Y 21 X -10 Y
 20 X -69 Y 21 X 81 Y 21 X 24 Y 21 X -33 Y 21 X -41 Y 21 X -156 Y 20 X 251 Y 21 X -53 Y 21 X -589 Y 21 X 648 Y 21 X -49 Y 21 X -63 Y 20 X -9 Y 21 X 135 Y 21 X -76 Y 21 X 82 Y 21 X -10 Y 21 X -1 Y 20 X -13 Y 21 X 49 Y 21 X 6 Y 21 X -3 Y 21 X 28 Y 21 X
 -30 Y 20 X 20 Y 21 X -78 Y 21 X 103 Y 21 X -2 Y 21 X 12 Y 21 X -6 Y 20 X 22 Y 21 X 23 Y 21 X -4 Y 21 X -32 Y 21 X 44 Y 21 X 29 Y 20 X 7 Y 21 X 11 Y 21 X 9 Y 21 X 23 Y 21 X 28 Y 21 X 21 Y 20 X 34 Y 21 X 37 Y 21 X 51 Y 21 X 69 Y 21 X 49 Y 21 X -71 Y
 20 X -146 Y 21 X -91 Y 21 X -67 Y 21 X -68 Y 21 X -95 Y 21 X 33 Y 20 X -83 Y 21 X 43 Y 21 X -27 Y 21 X -79 Y 21 X 78 Y 21 X -93 Y 20 X 23 Y 21 X -15 Y 21 X -33 Y 21 X -68 Y 21 X -6 Y 21 X -399 Y 41 X 394 Y 21 X -394 Y 21 X 396 Y 21 X 64 Y 20 X -460
 Y 21 X s black 3 lw 363 246 m 1791 X s
 gsave  2268 1538 0 0 C 1466.38 85.125 t 0 r /Helvetica findfont 71.6807 sf 0 0 m (smaller Z mass [GeV]) show NC gr  363 283 m -37 Y s 432 264 m -18 Y s 502 264 m -18 Y s 571 264 m -18 Y s 641 283 m -37 Y s 710 264 m -18 Y s 779 264 m -18 Y s 849 264
 m -18 Y s 918 283 m -37 Y s 988 264 m -18 Y s 1057 264 m -18 Y s 1127 264 m -18 Y s 1196 283 m -37 Y s 1266 264 m -18 Y s 1335 264 m -18 Y s 1404 264 m -18 Y s 1474 283 m -37 Y s 1543 264 m -18 Y s 1613 264 m -18 Y s 1682 264 m -18 Y s 1752 283 m
 -37 Y s 1821 264 m -18 Y s 1890 264 m -18 Y s 1960 264 m -18 Y s 2029 283 m -37 Y s 2029 283 m -37 Y s 2099 264 m -18 Y s
 gsave  2268 1538 0 0 C 342.25 179.625 t 0 r /Helvetica findfont 71.6807 sf 0 0 m (0) show NC gr 
 gsave  2268 1538 0 0 C 599.688 179.625 t 0 r /Helvetica findfont 71.6807 sf 0 0 m (20) show NC gr 
 gsave  2268 1538 0 0 C 876.625 179.625 t 0 r /Helvetica findfont 71.6807 sf 0 0 m (40) show NC gr 
 gsave  2268 1538 0 0 C 1156.81 179.625 t 0 r /Helvetica findfont 71.6807 sf 0 0 m (60) show NC gr 
 gsave  2268 1538 0 0 C 1433.75 179.625 t 0 r /Helvetica findfont 71.6807 sf 0 0 m (80) show NC gr 
 gsave  2268 1538 0 0 C 1691.19 179.625 t 0 r /Helvetica findfont 71.6807 sf 0 0 m (100) show NC gr 
 gsave  2268 1538 0 0 C 1968.12 179.625 t 0 r /Helvetica findfont 71.6807 sf 0 0 m (120) show NC gr  363 1461 m 1791 X s 363 1425 m 36 Y s 432 1443 m 18 Y s 502 1443 m 18 Y s 571 1443 m 18 Y s 641 1425 m 36 Y s 710 1443 m 18 Y s 779 1443 m 18 Y s 849
 1443 m 18 Y s 918 1425 m 36 Y s 988 1443 m 18 Y s 1057 1443 m 18 Y s 1127 1443 m 18 Y s 1196 1425 m 36 Y s 1266 1443 m 18 Y s 1335 1443 m 18 Y s 1404 1443 m 18 Y s 1474 1425 m 36 Y s 1543 1443 m 18 Y s 1613 1443 m 18 Y s 1682 1443 m 18 Y s 1752 1425
 m 36 Y s 1821 1443 m 18 Y s 1890 1443 m 18 Y s 1960 1443 m 18 Y s 2029 1425 m 36 Y s 2029 1425 m 36 Y s 2099 1443 m 18 Y s 363 246 m 1215 Y s
 gsave  2268 1538 0 0 C 172.875 756.312 t 90 r /Helvetica findfont 71.6807 sf 0 0 m (arbitrary normalization) show NC gr  390 289 m -27 X s 390 321 m -27 X s 390 343 m -27 X s 390 360 m -27 X s 390 375 m -27 X s 390 387 m -27 X s 390 397 m -27 X s
 390 406 m -27 X s 417 414 m -54 X s
 gsave  2268 1538 0 0 C 300 417.438 t 0 r /Helvetica findfont 48.8732 sf 0 0 m (\2556) show NC gr 
 gsave  2268 1538 0 0 C 221.75 384.875 t 0 r /Helvetica findfont 71.6807 sf 0 0 m (10) show NC gr  390 468 m -27 X s 390 500 m -27 X s 390 522 m -27 X s 390 539 m -27 X s 390 553 m -27 X s 390 565 m -27 X s 390 576 m -27 X s 390 585 m -27 X s 417 593
 m -54 X s
 gsave  2268 1538 0 0 C 300 593.438 t 0 r /Helvetica findfont 48.8732 sf 0 0 m (\2555) show NC gr 
 gsave  2268 1538 0 0 C 221.75 560.812 t 0 r /Helvetica findfont 71.6807 sf 0 0 m (10) show NC gr  390 647 m -27 X s 390 678 m -27 X s 390 701 m -27 X s 390 718 m -27 X s 390 732 m -27 X s 390 744 m -27 X s 390 754 m -27 X s 390 764 m -27 X s 417 772
 m -54 X s
 gsave  2268 1538 0 0 C 300 769.375 t 0 r /Helvetica findfont 48.8732 sf 0 0 m (\2554) show NC gr 
 gsave  2268 1538 0 0 C 221.75 740 t 0 r /Helvetica findfont 71.6807 sf 0 0 m (10) show NC gr  390 826 m -27 X s 390 857 m -27 X s 390 879 m -27 X s 390 897 m -27 X s 390 911 m -27 X s 390 923 m -27 X s 390 933 m -27 X s 390 942 m -27 X s 417 950 m
 -54 X s
 gsave  2268 1538 0 0 C 300 951.812 t 0 r /Helvetica findfont 48.8732 sf 0 0 m (\2553) show NC gr 
 gsave  2268 1538 0 0 C 221.75 919.25 t 0 r /Helvetica findfont 71.6807 sf 0 0 m (10) show NC gr  390 1004 m -27 X s 390 1036 m -27 X s 390 1058 m -27 X s 390 1075 m -27 X s 390 1090 m -27 X s 390 1101 m -27 X s 390 1112 m -27 X s 390 1121 m -27 X s
 417 1129 m -54 X s
 gsave  2268 1538 0 0 C 300 1127.75 t 0 r /Helvetica findfont 48.8732 sf 0 0 m (\2552) show NC gr 
 gsave  2268 1538 0 0 C 221.75 1098.44 t 0 r /Helvetica findfont 71.6807 sf 0 0 m (10) show NC gr  390 1183 m -27 X s 390 1214 m -27 X s 390 1237 m -27 X s 390 1254 m -27 X s 390 1268 m -27 X s 390 1280 m -27 X s 390 1291 m -27 X s 390 1300 m -27 X s
 417 1308 m -54 X s
 gsave  2268 1538 0 0 C 306.5 1306.94 t 0 r /Helvetica findfont 48.8732 sf 0 0 m (\2551) show NC gr 
 gsave  2268 1538 0 0 C 228.312 1277.62 t 0 r /Helvetica findfont 71.6807 sf 0 0 m (10) show NC gr  390 1362 m -27 X s 390 1393 m -27 X s 390 1416 m -27 X s 390 1433 m -27 X s 390 1447 m -27 X s 390 1459 m -27 X s 2154 246 m 1215 Y s 2127 289 m 27 X
 s 2127 321 m 27 X s 2127 343 m 27 X s 2127 360 m 27 X s 2127 375 m 27 X s 2127 387 m 27 X s 2127 397 m 27 X s 2127 406 m 27 X s 2101 414 m 53 X s 2127 468 m 27 X s 2127 500 m 27 X s 2127 522 m 27 X s 2127 539 m 27 X s 2127 553 m 27 X s 2127 565 m 27
 X s 2127 576 m 27 X s 2127 585 m 27 X s 2101 593 m 53 X s 2127 647 m 27 X s 2127 678 m 27 X s 2127 701 m 27 X s 2127 718 m 27 X s 2127 732 m 27 X s 2127 744 m 27 X s 2127 754 m 27 X s 2127 764 m 27 X s 2101 772 m 53 X s 2127 826 m 27 X s 2127 857 m
 27 X s 2127 879 m 27 X s 2127 897 m 27 X s 2127 911 m 27 X s 2127 923 m 27 X s 2127 933 m 27 X s 2127 942 m 27 X s 2101 950 m 53 X s 2127 1004 m 27 X s 2127 1036 m 27 X s 2127 1058 m 27 X s 2127 1075 m 27 X s 2127 1090 m 27 X s 2127 1101 m 27 X s
 2127 1112 m 27 X s 2127 1121 m 27 X s 2101 1129 m 53 X s 2127 1183 m 27 X s 2127 1214 m 27 X s 2127 1237 m 27 X s 2127 1254 m 27 X s 2127 1268 m 27 X s 2127 1280 m 27 X s 2127 1291 m 27 X s 2127 1300 m 27 X s 2101 1308 m 53 X s 2127 1362 m 27 X s
 2127 1393 m 27 X s 2127 1416 m 27 X s 2127 1433 m 27 X s 2127 1447 m 27 X s 2127 1459 m 27 X s 6 lw 1 1 1 c black 363 246 m 21 X 554 Y 20 X 32 Y 21 X 17 Y 21 X 7 Y 21 X 26 Y 21 X 3 Y 21 X 8 Y 20 X -2 Y 21 X 16 Y 21 X -9 Y 21 X 4 Y 21 X 4 Y 21 X 5 Y
 20 X -5 Y 21 X -2 Y 21 X 2 Y 21 X 4 Y 21 X 5 Y 21 X -13 Y 20 X 10 Y 21 X 8 Y 21 X -5 Y 21 X 2 Y 21 X 10 Y 21 X -10 Y 20 X 7 Y 21 X 5 Y 21 X -6 Y 21 X 8 Y 21 X -4 Y 21 X 5 Y 41 X 6 Y 21 X 3 Y 21 X 10 Y 21 X 4 Y 21 X 7 Y 20 X 12 Y 21 X -3 Y 21 X 6 Y
 21 X 4 Y 21 X 23 Y 21 X -7 Y 20 X 18 Y 21 X 4 Y 21 X 9 Y 21 X 14 Y 21 X 10 Y 21 X 13 Y 20 X 12 Y 21 X 13 Y 21 X 19 Y 21 X 18 Y 21 X 21 Y 21 X 25 Y 20 X 33 Y 21 X 38 Y 21 X 48 Y 21 X 66 Y 21 X 52 Y 21 X -76 Y 20 X -142 Y 21 X -101 Y 21 X -74 Y 21 X
 -55 Y 21 X -37 Y 21 X -34 Y 20 X -60 Y 21 X -8 Y 21 X -34 Y 21 X -14 Y 21 X -27 Y 21 X -25 Y 20 X -44 Y 21 X -20 Y 21 X 11 Y 21 X -54 Y 21 X -108 Y 21 X 54 Y 20 X 85 Y 21 X -53 Y 42 X -86 Y 21 X 86 Y 41 X s 0 0 1 c[  12 12 ] 0 sd 1 1 1 c black 0 0 1
 c 363 246 m 21 X 557 Y 20 X 33 Y 21 X 14 Y 21 X 7 Y 21 X 27 Y 21 X 4 Y 21 X 9 Y 20 X -3 Y 21 X 15 Y 21 X -8 Y 21 X 4 Y 21 X 4 Y 21 X 5 Y 20 X -6 Y 21 X -2 Y 21 X 3 Y 21 X 3 Y 21 X 4 Y 21 X -12 Y 20 X 9 Y 21 X 9 Y 21 X -5 Y 21 X 1 Y 21 X 10 Y 21 X
 -10 Y 20 X 8 Y 21 X 4 Y 21 X -7 Y 21 X 10 Y 21 X -5 Y 21 X 5 Y 20 X 1 Y 21 X 5 Y 21 X 2 Y 21 X 11 Y 21 X 4 Y 21 X 7 Y 20 X 11 Y 21 X -3 Y 21 X 5 Y 21 X 5 Y 21 X 24 Y 21 X -8 Y 20 X 18 Y 21 X 4 Y 21 X 9 Y 21 X 15 Y 21 X 9 Y 21 X 14 Y 20 X 12 Y 21 X
 13 Y 21 X 18 Y 21 X 18 Y 21 X 21 Y 21 X 25 Y 20 X 33 Y 21 X 38 Y 21 X 48 Y 21 X 66 Y 21 X 52 Y 21 X -76 Y 20 X -142 Y 21 X -102 Y 21 X -73 Y 21 X -55 Y 21 X -36 Y 21 X -37 Y 20 X -60 Y 21 X -5 Y 21 X -35 Y 21 X -13 Y 21 X -34 Y 21 X -18 Y 20 X -41 Y
 21 X -19 Y 21 X 7 Y 21 X -51 Y 21 X -107 Y 21 X 53 Y 20 X 85 Y 21 X -89 Y 21 X 26 Y 21 X -76 Y 21 X 86 Y 20 X -13 Y 21 X s black
 gsave  2268 1538 0 0 C 2199.44 1124.5 t 90 r /Helvetica-BoldOblique findfont 29.3239 sf 0 0 m 
 317 303 287 271 263 240 213 205 186 167 159 140 118 95 87 67 59 38 17
(LHC HIGGS XS WG 2011) K NC gr 
 gr  gr showpage
end
%%EOF
