%!PS-Adobe-2.0 EPSF-2.0
%%BoundingBox:  0 0 567 384
%%Title: plots/GenMHiggs_Powheg_v_Pythia.150GeV.VBF.cut2.eps: c1
%%Creator: ROOT Version 5.28/00b
%%CreationDate: Sun Dec  4 23:59:34 2011
%%EndComments
%%BeginProlog
80 dict begin
/s {stroke} def /l {lineto} def /m {moveto} def /t {translate} def
/r {rotate} def /rl {roll}  def /R {repeat} def
/d {rlineto} def /rm {rmoveto} def /gr {grestore} def /f {eofill} def
/c {setrgbcolor} def /black {0 setgray} def /sd {setdash} def
/cl {closepath} def /sf {scalefont setfont} def /lw {setlinewidth} def
/box {m dup 0 exch d exch 0 d 0 exch neg d cl} def
/NC{systemdict begin initclip end}def/C{NC box clip newpath}def
/bl {box s} def /bf {box f} def /Y { 0 exch d} def /X { 0 d} def 
/K {{pop pop 0 moveto} exch kshow} bind def
/ita {/ang 15 def gsave [1 0 ang dup sin exch cos div 1 0 0] concat} def 
/mp {newpath /y exch def /x exch def} def
/side {[w .77 mul w .23 mul] .385 w mul sd w 0 l currentpoint t -144 r} def
/mr {mp x y w2 0 360 arc} def /m24 {mr s} def /m20 {mr f} def
/mb {mp x y w2 add m w2 neg 0 d 0 w neg d w 0 d 0 w d cl} def
/mt {mp x y w2 add m w2 neg w neg d w 0 d cl} def
/m21 {mb f} def /m25 {mb s} def /m22 {mt f} def /m26{mt s} def
/m23 {mp x y w2 sub m w2 w d w neg 0 d cl f} def
/m27 {mp x y w2 add m w3 neg w2 neg d w3 w2 neg d w3 w2 d cl s} def
/m28 {mp x w2 sub y w2 sub w3 add m w3 0 d  0 w3 neg d w3 0 d 0 w3 d w3 0 d  0 w3 d w3 neg 0 d 0 w3 d w3 neg 0 d 0 w3 neg d w3 neg 0 d cl s } def
/m29 {mp gsave x w2 sub y w2 add w3 sub m currentpoint t 4 {side} repeat cl fill gr} def
/m30 {mp gsave x w2 sub y w2 add w3 sub m currentpoint t 4 {side} repeat cl s gr} def
/m31 {mp x y w2 sub m 0 w d x w2 sub y m w 0 d x w2 sub y w2 add m w w neg d x w2 sub y w2 sub m w w d s} def
/m32 {mp x y w2 sub m w2 w d w neg 0 d cl s} def
/m33 {mp x y w2 add m w3 neg w2 neg d w3 w2 neg d w3 w2 d cl f} def
/m34 {mp x w2 sub y w2 sub w3 add m w3 0 d  0 w3 neg d w3 0 d 0 w3 d w3 0 d  0 w3 d w3 neg 0 d 0 w3 d w3 neg 0 d 0 w3 neg d w3 neg 0 d cl f } def
/m2 {mp x y w2 sub m 0 w d x w2 sub y m w 0 d s} def
/m5 {mp x w2 sub y w2 sub m w w d x w2 sub y w2 add m w w neg d s} def
/reEncode {exch findfont dup length dict begin {1 index /FID eq  {pop pop} {def} ifelse } forall /Encoding exch def currentdict end dup /FontName get exch definefont pop } def [/Times-Bold /Times-Italic /Times-BoldItalic /Helvetica /Helvetica-Oblique
 /Helvetica-Bold /Helvetica-BoldOblique /Courier /Courier-Oblique /Courier-Bold /Courier-BoldOblique /Times-Roman /AvantGarde-Book /AvantGarde-BookOblique /AvantGarde-Demi /AvantGarde-DemiOblique /Bookman-Demi /Bookman-DemiItalic /Bookman-Light
 /Bookman-LightItalic /Helvetica-Narrow /Helvetica-Narrow-Bold /Helvetica-Narrow-BoldOblique /Helvetica-Narrow-Oblique /NewCenturySchlbk-Roman /NewCenturySchlbk-Bold /NewCenturySchlbk-BoldItalic /NewCenturySchlbk-Italic /Palatino-Bold
 /Palatino-BoldItalic /Palatino-Italic /Palatino-Roman ] {ISOLatin1Encoding reEncode } forall%%EndProlog
%%BeginSetup
%%EndSetup
newpath  gsave  .25 .25 scale  gsave  0 0 t black[  ] 0 sd 3 lw 1 1 1 c 2268 1538 0 0 bf black 1 1 1 c 1791 1215 363 246 bf black 1791 1215 363 246 bl 1 0 0 c 6 lw 1 1 1 c black 1 0 0 c 363 246 m 9 X 10 Y 9 X -7 Y 9 X 4 Y 8 X -7 Y 9 X 3 Y 9 X -3 Y 9
 X 7 Y 9 X -4 Y 18 X -3 Y 18 X 3 Y 9 X -3 Y 9 X 7 Y 9 X -4 Y 8 X -3 Y 36 X 3 Y 9 X -3 Y 27 X 3 Y 26 X 4 Y 18 X -4 Y 9 X -3 Y 9 X 3 Y 9 X -3 Y 9 X 10 Y 9 X -7 Y 36 X 4 Y 8 X -4 Y 9 X -3 Y 9 X 3 Y 36 X 4 Y 9 X -7 Y 18 X 3 Y 9 X -3 Y 8 X 13 Y 9 X -3 Y 9
 X -7 Y 9 X 4 Y 9 X 6 Y 9 X -13 Y 9 X 16 Y 9 X -13 Y 9 X 7 Y 18 X -3 Y 9 X 6 Y 17 X 3 Y 9 X -3 Y 18 X 13 Y 9 X -19 Y 9 X 6 Y 9 X 3 Y 9 X -9 Y 9 X 9 Y 9 X 17 Y 8 X -3 Y 9 X 10 Y 9 X -14 Y 9 X -6 Y 9 X -7 Y 9 X 17 Y 9 X 3 Y 9 X -7 Y 9 X 4 Y 9 X 36 Y 9
 X 6 Y 9 X 10 Y 8 X -3 Y 9 X 16 Y 9 X 10 Y 9 X -26 Y 9 X 16 Y 9 X 20 Y 9 X 66 Y 9 X 16 Y 9 X 43 Y 9 X 33 Y 9 X 128 Y 8 X 43 Y 9 X 217 Y 9 X 141 Y 9 X 92 Y 9 X 263 Y 9 X -23 Y 9 X -161 Y 9 X -246 Y 9 X -73 Y 9 X -164 Y 9 X -102 Y 9 X -69 Y 8 X -76 Y 9
 X -29 Y 9 X -27 Y 9 X -52 Y 9 X 26 Y 9 X -23 Y 9 X -69 Y 9 X 23 Y 9 X -20 Y 9 X 66 Y 9 X -72 Y 8 X -30 Y 9 X 10 Y 9 X -10 Y 9 X -3 Y 9 X 10 Y 9 X -10 Y 9 X -17 Y 9 X 10 Y 18 X 4 Y 9 X 3 Y 9 X 3 Y 8 X -26 Y 9 X 3 Y 9 X 17 Y 9 X -14 Y 18 X -6 Y 9 X 10
 Y 9 X -4 Y 9 X 4 Y 9 X -10 Y 9 X -3 Y 8 X -4 Y 9 X 4 Y 9 X 3 Y 9 X -7 Y 18 X 4 Y 9 X 6 Y 9 X -6 Y 9 X 13 Y 9 X -17 Y 26 X 7 Y 9 X -7 Y 9 X 7 Y 9 X -3 Y 18 X 3 Y 18 X -3 Y 18 X -7 Y 9 X 7 Y 17 X -7 Y 9 X 3 Y 9 X -3 Y 18 X 3 Y 9 X 4 Y 18 X -4 Y 18 X
 -3 Y 17 X 7 Y 9 X -7 Y 9 X 3 Y 9 X 4 Y 18 X -4 Y 18 X -3 Y 18 X 3 Y 9 X -3 Y 26 X 7 Y 9 X -4 Y 9 X 4 Y 9 X -7 Y 18 X 10 Y 9 X -10 Y 9 X 3 Y 9 X -3 Y 17 X 3 Y 9 X s black 3 lw 363 246 m 1791 X s
 gsave  2268 1538 0 0 C 1545 114.062 t 0 r /Helvetica findfont 71.6807 sf 0 0 m (Gen MHiggs \(GeV\)) show NC gr  372 283 m -37 Y s 416 264 m -18 Y s 461 264 m -18 Y s 505 264 m -18 Y s 550 264 m -18 Y s 595 283 m -37 Y s 639 264 m -18 Y s 684 264 m
 -18 Y s 728 264 m -18 Y s 773 264 m -18 Y s 817 283 m -37 Y s 862 264 m -18 Y s 907 264 m -18 Y s 951 264 m -18 Y s 996 264 m -18 Y s 1040 283 m -37 Y s 1085 264 m -18 Y s 1129 264 m -18 Y s 1174 264 m -18 Y s 1218 264 m -18 Y s 1263 283 m -37 Y s
 1308 264 m -18 Y s 1352 264 m -18 Y s 1397 264 m -18 Y s 1441 264 m -18 Y s 1486 283 m -37 Y s 1530 264 m -18 Y s 1575 264 m -18 Y s 1620 264 m -18 Y s 1664 264 m -18 Y s 1709 283 m -37 Y s 1753 264 m -18 Y s 1798 264 m -18 Y s 1842 264 m -18 Y s
 1887 264 m -18 Y s 1932 283 m -37 Y s 1976 264 m -18 Y s 2021 264 m -18 Y s 2065 264 m -18 Y s 2110 264 m -18 Y s 2154 283 m -37 Y s 372 283 m -37 Y s 2154 283 m -37 Y s
 gsave  2268 1538 0 0 C 280.812 179.188 t 0 r /Helvetica findfont 71.6807 sf 0 0 m (149.8) show NC gr 
 gsave  2268 1538 0 0 C 482.812 179.188 t 0 r /Helvetica findfont 71.6807 sf 0 0 m (149.85) show NC gr 
 gsave  2268 1538 0 0 C 723.938 179.188 t 0 r /Helvetica findfont 71.6807 sf 0 0 m (149.9) show NC gr 
 gsave  2268 1538 0 0 C 929.188 179.188 t 0 r /Helvetica findfont 71.6807 sf 0 0 m (149.95) show NC gr 
 gsave  2268 1538 0 0 C 1202.88 179.188 t 0 r /Helvetica findfont 71.6807 sf 0 0 m (150) show NC gr 
 gsave  2268 1538 0 0 C 1375.56 179.188 t 0 r /Helvetica findfont 71.6807 sf 0 0 m (150.05) show NC gr 
 gsave  2268 1538 0 0 C 1623.19 179.188 t 0 r /Helvetica findfont 71.6807 sf 0 0 m (150.1) show NC gr 
 gsave  2268 1538 0 0 C 1818.69 179.188 t 0 r /Helvetica findfont 71.6807 sf 0 0 m (150.15) show NC gr 
 gsave  2268 1538 0 0 C 2066.31 179.188 t 0 r /Helvetica findfont 71.6807 sf 0 0 m (150.2) show NC gr  363 1461 m 1791 X s 372 1425 m 36 Y s 416 1443 m 18 Y s 461 1443 m 18 Y s 505 1443 m 18 Y s 550 1443 m 18 Y s 595 1425 m 36 Y s 639 1443 m 18 Y s
 684 1443 m 18 Y s 728 1443 m 18 Y s 773 1443 m 18 Y s 817 1425 m 36 Y s 862 1443 m 18 Y s 907 1443 m 18 Y s 951 1443 m 18 Y s 996 1443 m 18 Y s 1040 1425 m 36 Y s 1085 1443 m 18 Y s 1129 1443 m 18 Y s 1174 1443 m 18 Y s 1218 1443 m 18 Y s 1263 1425
 m 36 Y s 1308 1443 m 18 Y s 1352 1443 m 18 Y s 1397 1443 m 18 Y s 1441 1443 m 18 Y s 1486 1425 m 36 Y s 1530 1443 m 18 Y s 1575 1443 m 18 Y s 1620 1443 m 18 Y s 1664 1443 m 18 Y s 1709 1425 m 36 Y s 1753 1443 m 18 Y s 1798 1443 m 18 Y s 1842 1443 m
 18 Y s 1887 1443 m 18 Y s 1932 1425 m 36 Y s 1976 1443 m 18 Y s 2021 1443 m 18 Y s 2065 1443 m 18 Y s 2110 1443 m 18 Y s 2154 1425 m 36 Y s 372 1425 m 36 Y s 2154 1425 m 36 Y s 363 246 m 1215 Y s
 gsave  2268 1538 0 0 C 127.688 690.688 t 90 r /Helvetica findfont 71.6807 sf 0 0 m (arbitrary units) show NC gr  417 246 m -54 X s 390 274 m -27 X s 390 302 m -27 X s 390 330 m -27 X s 390 358 m -27 X s 417 386 m -54 X s 390 414 m -27 X
 s 390 442 m -27 X s 390 470 m -27 X s 390 498 m -27 X s 417 526 m -54 X s 390 554 m -27 X s 390 582 m -27 X s 390 610 m -27 X s 390 638 m -27 X s 417 666 m -54 X s 390 694 m -27 X s 390 722 m -27 X s 390 750 m -27 X s 390 778 m -27 X s 417 806 m -54
 X s 390 834 m -27 X s 390 862 m -27 X s 390 890 m -27 X s 390 918 m -27 X s 417 946 m -54 X s 390 974 m -27 X s 390 1002 m -27 X s 390 1030 m -27 X s 390 1058 m -27 X s 417 1086 m -54 X s 390 1114 m -27 X s 390 1142 m -27 X s 390 1170 m -27 X s 390
 1198 m -27 X s 417 1226 m -54 X s 390 1254 m -27 X s 390 1282 m -27 X s 390 1310 m -27 X s 390 1338 m -27 X s 417 1366 m -54 X s 417 1366 m -54 X s 390 1394 m -27 X s 390 1422 m -27 X s 390 1450 m -27 X s
 gsave  2268 1538 0 0 C 310.125 221.562 t 0 r /Helvetica findfont 71.6807 sf 0 0 m (0) show NC gr 
 gsave  2268 1538 0 0 C 222.188 361.625 t 0 r /Helvetica findfont 71.6807 sf 0 0 m (0.01) show NC gr 
 gsave  2268 1538 0 0 C 212.375 501.688 t 0 r /Helvetica findfont 71.6807 sf 0 0 m (0.02) show NC gr 
 gsave  2268 1538 0 0 C 212.375 641.812 t 0 r /Helvetica findfont 71.6807 sf 0 0 m (0.03) show NC gr 
 gsave  2268 1538 0 0 C 212.375 781.938 t 0 r /Helvetica findfont 71.6807 sf 0 0 m (0.04) show NC gr 
 gsave  2268 1538 0 0 C 212.375 922 t 0 r /Helvetica findfont 71.6807 sf 0 0 m (0.05) show NC gr 
 gsave  2268 1538 0 0 C 212.375 1062.12 t 0 r /Helvetica findfont 71.6807 sf 0 0 m (0.06) show NC gr 
 gsave  2268 1538 0 0 C 212.375 1202.25 t 0 r /Helvetica findfont 71.6807 sf 0 0 m (0.07) show NC gr 
 gsave  2268 1538 0 0 C 212.375 1342.31 t 0 r /Helvetica findfont 71.6807 sf 0 0 m (0.08) show NC gr  2154 246 m 1215 Y s 2101 246 m 53 X s 2127 274 m 27 X s 2127 302 m 27 X s 2127 330 m 27 X s 2127 358 m 27 X s 2101 386 m 53 X s 2127 414 m 27 X s
 2127 442 m 27 X s 2127 470 m 27 X s 2127 498 m 27 X s 2101 526 m 53 X s 2127 554 m 27 X s 2127 582 m 27 X s 2127 610 m 27 X s 2127 638 m 27 X s 2101 666 m 53 X s 2127 694 m 27 X s 2127 722 m 27 X s 2127 750 m 27 X s 2127 778 m 27 X s 2101 806 m 53 X
 s 2127 834 m 27 X s 2127 862 m 27 X s 2127 890 m 27 X s 2127 918 m 27 X s 2101 946 m 53 X s 2127 974 m 27 X s 2127 1002 m 27 X s 2127 1030 m 27 X s 2127 1058 m 27 X s 2101 1086 m 53 X s 2127 1114 m 27 X s 2127 1142 m 27 X s 2127 1170 m 27 X s 2127
 1198 m 27 X s 2101 1226 m 53 X s 2127 1254 m 27 X s 2127 1282 m 27 X s 2127 1310 m 27 X s 2127 1338 m 27 X s 2101 1366 m 53 X s 2101 1366 m 53 X s 2127 1394 m 27 X s 2127 1422 m 27 X s 2127 1450 m 27 X s 6 lw 1 1 1 c black 363 246 m 27 X 3 Y 8 X -3
 Y 45 X 3 Y 9 X -3 Y 9 X 3 Y 9 X -3 Y 9 X 7 Y 9 X -4 Y 9 X -3 Y 17 X 10 Y 18 X -7 Y 9 X -3 Y 27 X 3 Y 18 X -3 Y 17 X 7 Y 9 X 3 Y 9 X -7 Y 36 X 4 Y 18 X -4 Y 9 X -3 Y 9 X 3 Y 9 X -3 Y 8 X 7 Y 9 X 6 Y 9 X -6 Y 9 X -7 Y 9 X 7 Y 9 X -7 Y 9 X 3 Y 27 X -3
 Y 9 X 3 Y 8 X 4 Y 18 X -4 Y 18 X 4 Y 18 X -4 Y 9 X 10 Y 9 X -3 Y 9 X 9 Y 9 X -12 Y 17 X 6 Y 9 X 26 Y 9 X -7 Y 9 X -16 Y 9 X -9 Y 9 X 19 Y 9 X 6 Y 9 X -9 Y 9 X 3 Y 9 X 6 Y 9 X -9 Y 8 X -10 Y 9 X 29 Y 9 X -23 Y 9 X 17 Y 9 X -4 Y 18 X 20 Y 9 X -36 Y 9
 X 62 Y 9 X -26 Y 9 X 52 Y 9 X -33 Y 8 X 16 Y 9 X -16 Y 9 X 20 Y 9 X 19 Y 9 X -13 Y 9 X 3 Y 9 X 101 Y 9 X -23 Y 9 X 110 Y 9 X 94 Y 9 X 38 Y 8 X 78 Y 9 X 91 Y 9 X 139 Y 9 X 229 Y 9 X 78 Y 9 X 16 Y 9 X -175 Y 9 X -68 Y 9 X -184 Y 9 X -97 Y 9 X -181 Y 9
 X -3 Y 8 X -113 Y 9 X -4 Y 9 X -22 Y 9 X -49 Y 9 X -29 Y 9 X 3 Y 9 X -25 Y 9 X -4 Y 9 X -32 Y 9 X -16 Y 9 X 13 Y 8 X -13 Y 9 X 3 Y 9 X -29 Y 9 X 10 Y 18 X 3 Y 9 X -20 Y 18 X 23 Y 9 X -23 Y 9 X 10 Y 9 X -16 Y 8 X 13 Y 18 X -7 Y 9 X -3 Y 18 X -6 Y 9 X
 6 Y 9 X 7 Y 9 X -13 Y 18 X -7 Y 8 X 13 Y 9 X -6 Y 18 X -3 Y 9 X 3 Y 18 X 3 Y 9 X -6 Y 9 X 12 Y 9 X -19 Y 9 X 7 Y 9 X 6 Y 8 X -3 Y 9 X -10 Y 9 X 7 Y 9 X -4 Y 18 X 7 Y 36 X -7 Y 9 X 4 Y 8 X -4 Y 9 X 4 Y 9 X -4 Y 18 X 4 Y 18 X -4 Y 18 X 4 Y 9 X -7 Y 18
 X 10 Y 8 X -7 Y 9 X 4 Y 18 X -7 Y 9 X 7 Y 9 X -7 Y 27 X 3 Y 26 X 4 Y 9 X -7 Y 27 X 3 Y 9 X -3 Y 9 X 3 Y 9 X 4 Y 9 X -7 Y 9 X 7 Y 9 X 3 Y 9 X -10 Y 17 X s
 gsave  2268 1538 0 0 C 837.938 1316.25 t 0 r /Helvetica findfont 42.3568 sf 0 0 m ( H\(150GeV\)) show NC gr 
 gsave  2268 1538 0 0 C 795.625 1316.25 t 0 r /Helvetica findfont 42.3568 sf 0 0 m ( to ) show NC gr 
 gsave  2268 1538 0 0 C 538.188 1316.25 t 0 r /Helvetica findfont 42.3568 sf 0 0 m ( Powheg VBF) show NC gr  370 1326 m 139 X s
 gsave  2268 1538 0 0 C 837.938 1198.94 t 0 r /Helvetica findfont 42.3568 sf 0 0 m ( H\(150GeV\)) show NC gr 
 gsave  2268 1538 0 0 C 795.625 1198.94 t 0 r /Helvetica findfont 42.3568 sf 0 0 m ( to ) show NC gr 
 gsave  2268 1538 0 0 C 538.188 1198.94 t 0 r /Helvetica findfont 42.3568 sf 0 0 m ( Pythia    VBF) show NC gr  1 0 0 c 370 1211 m 139 X s black
 gsave  2268 1538 0 0 C 2222.69 1117.5 t 90 r /Helvetica-BoldOblique findfont 29.3239 sf 0 0 m 
 317 303 287 271 263 240 213 205 186 167 159 140 118 95 87 67 59 38 17
(LHC HIGGS XS WG 2011) K NC gr 
 gr  gr showpage
end
%%EOF
