%!PS-Adobe-2.0 EPSF-2.0
%%BoundingBox: 0 0 567 425
%%Title: weight.eps
%%Creator: HIGZ Version 1.29/04
%%CreationDate: 2011/05/23   22.33
%%EndComments
%%BeginProlog
80 dict begin
/s {stroke} def /l {lineto} def /m {moveto} def /t {translate} def
/sw {stringwidth} def /r {rotate} def /rl {roll}  def /R {repeat} def
/d {rlineto} def /rm {rmoveto} def /gr {grestore} def /f {eofill} def
/c {setrgbcolor} def /lw {setlinewidth} def /sd {setdash} def
/cl {closepath} def /sf {scalefont setfont} def /black {0 setgray} def
/box {m dup 0 exch d exch 0 d 0 exch neg d cl} def
/NC{systemdict begin initclip end}def/C{NC box clip newpath}def
/bl {box s} def /bf {box f} def /Y { 0 exch d} def /X { 0 d} def 
/mp {newpath /y exch def /x exch def} def
/side {[w .77 mul w .23 mul] .385 w mul sd w 0 l currentpoint t -144 r} def
/mr {mp x y w2 0 360 arc} def /m24 {mr s} def /m20 {mr f} def
/mb {mp x y w2 add m w2 neg 0 d 0 w neg d w 0 d 0 w d cl} def
/mt {mp x y w2 add m w2 neg w neg d w 0 d cl} def
/m21 {mb f} def /m25 {mb s} def /m22 {mt f} def /m26 {mt s} def
/m23 {mp x y w2 sub m w2 w d w neg 0 d cl f} def
/m27 {mp x y w2 add m w3 neg w2 neg d w3 w2 neg d w3  w2 d cl s} def
/m28 {mp x w2 sub y w2 sub w3 add m w3 0 d 0 w3 neg d w3 0 d 0 w3 d w3 0 d
 0 w3 d w3 neg 0 d 0 w3 d w3 neg 0 d
 0 w3 neg d w3 neg 0 d cl s } def
/m29 {mp gsave x w2 sub y w2 add w3 sub m currentpoint t
 4 {side} repeat cl fill gr} def
/m30 {mp gsave x w2 sub y w2 add w3 sub m currentpoint t
 5 {side} repeat s gr} def
/m31 {mp x y w2 sub m 0 w d x w2 sub y m w 0 d
 x w2 sub y w2 add m w w neg d x w2 sub y w2
 sub m w w d s} def
/m2 {mp x y w2 sub m 0 w d x w2 sub y m w 0 d s} def
/m5 {mp x w2 sub y w2 sub m w w d x w2 sub y w2 add m w w neg d s} def
/reencdict 24 dict def /ReEncode {reencdict begin /nco&na exch def
/nfnam exch def /basefontname exch def /basefontdict basefontname findfont def
/newfont basefontdict maxlength dict def basefontdict {exch dup /FID ne
{dup /Encoding eq {exch dup length array copy newfont 3 1 roll put} {exch
newfont 3 1 roll put} ifelse} {pop pop} ifelse } forall newfont
/FontName nfnam put nco&na aload pop nco&na length 2 idiv {newfont
/Encoding get 3 1 roll put} repeat nfnam newfont definefont pop end } def
/accvec [ 176 /agrave 181 /Agrave 190 /acircumflex 192 /Acircumflex
201 /adieresis 204 /Adieresis 209 /ccedilla 210 /Ccedilla 211 /eacute
212 /Eacute 213 /egrave 214 /Egrave 215 /ecircumflex 216 /Ecircumflex
217 /edieresis 218 /Edieresis 219 /icircumflex 220 /Icircumflex
221 /idieresis 222 /Idieresis 223 /ntilde 224 /Ntilde 226 /ocircumflex
228 /Ocircumflex 229 /odieresis 230 /Odieresis 231 /ucircumflex 236 /Ucircumflex
237 /udieresis 238 /Udieresis 239 /aring 242 /Aring 243 /ydieresis
244 /Ydieresis 246 /aacute 247 /Aacute 252 /ugrave 253 /Ugrave] def
/Times-Roman /Times-Roman accvec ReEncode
/Times-Italic /Times-Italic accvec ReEncode
/Times-Bold /Times-Bold accvec ReEncode
/Times-BoldItalic /Times-BoldItalic accvec ReEncode
/Helvetica /Helvetica accvec ReEncode
/Helvetica-Oblique /Helvetica-Oblique accvec ReEncode
/Helvetica-Bold /Helvetica-Bold accvec ReEncode
/Helvetica-BoldOblique /Helvetica-BoldOblique  accvec ReEncode
/Courier /Courier accvec ReEncode
/Courier-Oblique /Courier-Oblique accvec ReEncode
/Courier-Bold /Courier-Bold accvec ReEncode
/Courier-BoldOblique /Courier-BoldOblique accvec ReEncode
/oshow {gsave [] 0 sd true charpath stroke gr} def
/stwn { /fs exch def /fn exch def /text exch def fn findfont fs sf
 text sw pop xs add /xs exch def} def
/stwb { /fs exch def /fn exch def /nbas exch def /textf exch def
textf length /tlen exch def nbas tlen gt {/nbas tlen def} if
fn findfont fs sf textf dup length nbas sub nbas getinterval sw
pop neg xs add /xs exch def} def
/accspe [ 65 /plusminus 66 /bar 67 /existential 68 /universal
69 /exclam 70 /numbersign 71 /greater 72 /question 73 /integral
74 /colon 75 /semicolon 76 /less 77 /bracketleft 78 /bracketright
79 /greaterequal 80 /braceleft 81 /braceright 82 /radical
83 /spade 84 /heart 85 /diamond 86 /club 87 /lessequal
88 /multiply 89 /percent 90 /infinity 48 /circlemultiply 49 /circleplus
50 /emptyset 51 /lozenge 52 /bullet 53 /arrowright 54 /arrowup
55 /arrowleft 56 /arrowdown 57 /arrowboth 48 /degree 44 /comma 43 /plus
 45 /angle 42 /angleleft 47 /divide 61 /notequal 40 /equivalence 41 /second
 97 /approxequal 98 /congruent 99 /perpendicular 100 /partialdiff 101 /florin
 102 /intersection 103 /union 104 /propersuperset 105 /reflexsuperset
 106 /notsubset 107 /propersubset 108 /reflexsubset 109 /element 110 /notelement
 111 /gradient 112 /logicaland 113 /logicalor 114 /arrowdblboth
 115 /arrowdblleft 116 /arrowdblup 117 /arrowdblright 118 /arrowdbldown
 119 /ampersand 120 /omega1 121 /similar 122 /aleph ] def
/Symbol /Special accspe ReEncode
%%EndProlog
%%BeginSetup
%%EndSetup
newpath  gsave  .25 .25 scale  gsave 0 0 t black [] 0 sd 1 lw 2268 1701 0 0 C
 /xs 0 def 
(m)
 /Times-Bold     67 stwn 
(H)
 /Times-Bold     47 stwn 
( \(GeV\))
 /Times-Bold     67 stwn 
 gsave  2041 91
 t   0 r  xs neg 0 t 0 0 m
 /Times-Bold findfont   67 sf 0    0 m 
(m)
 show 
 currentpoint pop 0 t 
 /Times-Bold findfont   47 sf 0  -22 m 
(H)
 show 
 currentpoint pop 0 t 
 /Times-Bold findfont   67 sf 0    0 m 
( \(GeV\))
 show 
 gr 
 /xs 0 def 
(weight w)
 /Times-Bold     67 stwn 
 gsave  68 1474
 t  90 r  xs neg 0 t 0 0 m
 /Times-Bold findfont   67 sf 0    0 m 
(weight w)
 show 
 gr  1814 1247 227 227 C NC 4 lw 1814 1247 227 227 bl 1814 1247 227 227 C NC 1
 lw 227 227 m 1247 Y s 3 lw 261 227 m -34 X s 244 268 m -17 X s 244 310 m -17 X
 s 244 352 m -17 X s 244 393 m -17 X s 261 435 m -34 X s 244 476 m -17 X s 244
 518 m -17 X s 244 559 m -17 X s 244 601 m -17 X s 261 643 m -34 X s 244 684 m
 -17 X s 244 726 m -17 X s 244 767 m -17 X s 244 809 m -17 X s 261 851 m -34 X s
 244 892 m -17 X s 244 934 m -17 X s 244 975 m -17 X s 244 1017 m -17 X s 261
 1058 m -34 X s 244 1100 m -17 X s 244 1142 m -17 X s 244 1183 m -17 X s 244
 1225 m -17 X s 261 1266 m -34 X s 244 1308 m -17 X s 244 1349 m -17 X s 244
 1391 m -17 X s 244 1433 m -17 X s 261 1474 m -34 X s
 /xs 0 def 
(0)
 /Times-Bold     59 stwn 
 gsave  204 207
 t   0 r  xs neg 0 t 0 0 m
 /Times-Bold findfont   59 sf 0    0 m 
(0)
 show 
 gr 
 /xs 0 def 
(0.5)
 /Times-Bold     59 stwn 
 gsave  204 415
 t   0 r  xs neg 0 t 0 0 m
 /Times-Bold findfont   59 sf 0    0 m 
(0.5)
 show 
 gr 
 /xs 0 def 
(1)
 /Times-Bold     59 stwn 
 gsave  204 623
 t   0 r  xs neg 0 t 0 0 m
 /Times-Bold findfont   59 sf 0    0 m 
(1)
 show 
 gr 
 /xs 0 def 
(1.5)
 /Times-Bold     59 stwn 
 gsave  204 831
 t   0 r  xs neg 0 t 0 0 m
 /Times-Bold findfont   59 sf 0    0 m 
(1.5)
 show 
 gr 
 /xs 0 def 
(2)
 /Times-Bold     59 stwn 
 gsave  204 1039
 t   0 r  xs neg 0 t 0 0 m
 /Times-Bold findfont   59 sf 0    0 m 
(2)
 show 
 gr 
 /xs 0 def 
(2.5)
 /Times-Bold     59 stwn 
 gsave  204 1246
 t   0 r  xs neg 0 t 0 0 m
 /Times-Bold findfont   59 sf 0    0 m 
(2.5)
 show 
 gr 
 /xs 0 def 
(3)
 /Times-Bold     59 stwn 
 gsave  204 1454
 t   0 r  xs neg 0 t 0 0 m
 /Times-Bold findfont   59 sf 0    0 m 
(3)
 show 
 gr  1 lw 227 227 m 1814 X s 3 lw 227 261 m -34 Y s 272 244 m -17 Y s 318 244 m
 -17 Y s 363 244 m -17 Y s 408 244 m -17 Y s 454 261 m -34 Y s 499 244 m -17 Y s
 544 244 m -17 Y s 590 244 m -17 Y s 635 244 m -17 Y s 680 261 m -34 Y s 726 244
 m -17 Y s 771 244 m -17 Y s 816 244 m -17 Y s 862 244 m -17 Y s 907 261 m -34 Y
 s 953 244 m -17 Y s 998 244 m -17 Y s 1043 244 m -17 Y s 1089 244 m -17 Y s
 1134 261 m -34 Y s 1179 244 m -17 Y s 1225 244 m -17 Y s 1270 244 m -17 Y s
 1315 244 m -17 Y s 1361 261 m -34 Y s 1406 244 m -17 Y s 1452 244 m -17 Y s
 1497 244 m -17 Y s 1542 244 m -17 Y s 1588 261 m -34 Y s 1633 244 m -17 Y s
 1678 244 m -17 Y s 1724 244 m -17 Y s 1769 244 m -17 Y s 1814 261 m -34 Y s
 1860 244 m -17 Y s 1905 244 m -17 Y s 1950 244 m -17 Y s 1996 244 m -17 Y s
 2041 261 m -34 Y s
 /xs 0 def 
(100)
 /Times-Bold     59 stwn 
 gsave  227 164
 t   0 r  xs 2 div neg 0 t 0 0 m
 /Times-Bold findfont   59 sf 0    0 m 
(100)
 show 
 gr 
 /xs 0 def 
(150)
 /Times-Bold     59 stwn 
 gsave  454 164
 t   0 r  xs 2 div neg 0 t 0 0 m
 /Times-Bold findfont   59 sf 0    0 m 
(150)
 show 
 gr 
 /xs 0 def 
(200)
 /Times-Bold     59 stwn 
 gsave  680 164
 t   0 r  xs 2 div neg 0 t 0 0 m
 /Times-Bold findfont   59 sf 0    0 m 
(200)
 show 
 gr 
 /xs 0 def 
(250)
 /Times-Bold     59 stwn 
 gsave  907 164
 t   0 r  xs 2 div neg 0 t 0 0 m
 /Times-Bold findfont   59 sf 0    0 m 
(250)
 show 
 gr 
 /xs 0 def 
(300)
 /Times-Bold     59 stwn 
 gsave  1134 164
 t   0 r  xs 2 div neg 0 t 0 0 m
 /Times-Bold findfont   59 sf 0    0 m 
(300)
 show 
 gr 
 /xs 0 def 
(350)
 /Times-Bold     59 stwn 
 gsave  1361 164
 t   0 r  xs 2 div neg 0 t 0 0 m
 /Times-Bold findfont   59 sf 0    0 m 
(350)
 show 
 gr 
 /xs 0 def 
(400)
 /Times-Bold     59 stwn 
 gsave  1588 164
 t   0 r  xs 2 div neg 0 t 0 0 m
 /Times-Bold findfont   59 sf 0    0 m 
(400)
 show 
 gr 
 /xs 0 def 
(450)
 /Times-Bold     59 stwn 
 gsave  1814 164
 t   0 r  xs 2 div neg 0 t 0 0 m
 /Times-Bold findfont   59 sf 0    0 m 
(450)
 show 
 gr 
 /xs 0 def 
(500)
 /Times-Bold     59 stwn 
 gsave  2041 164
 t   0 r  xs 2 div neg 0 t 0 0 m
 /Times-Bold findfont   59 sf 0    0 m 
(500)
 show 
 gr  1814 1247 227 227 C NC 1 lw 2041 227 m 1247 Y s 3 lw 2007 227 m 34 X s 2024
 268 m 17 X s 2024 310 m 17 X s 2024 352 m 17 X s 2024 393 m 17 X s 2007 435 m
 34 X s 2024 476 m 17 X s 2024 518 m 17 X s 2024 559 m 17 X s 2024 601 m 17 X s
 2007 643 m 34 X s 2024 684 m 17 X s 2024 726 m 17 X s 2024 767 m 17 X s 2024
 809 m 17 X s 2007 851 m 34 X s 2024 892 m 17 X s 2024 934 m 17 X s 2024 975 m
 17 X s 2024 1017 m 17 X s 2007 1058 m 34 X s 2024 1100 m 17 X s 2024 1142 m 17
 X s 2024 1183 m 17 X s 2024 1225 m 17 X s 2007 1266 m 34 X s 2024 1308 m 17 X s
 2024 1349 m 17 X s 2024 1391 m 17 X s 2024 1433 m 17 X s 2007 1474 m 34 X s 1
 lw 227 1474 m 1814 X s 3 lw 227 1440 m 34 Y s 272 1457 m 17 Y s 318 1457 m 17 Y
 s 363 1457 m 17 Y s 408 1457 m 17 Y s 454 1440 m 34 Y s 499 1457 m 17 Y s 544
 1457 m 17 Y s 590 1457 m 17 Y s 635 1457 m 17 Y s 680 1440 m 34 Y s 726 1457 m
 17 Y s 771 1457 m 17 Y s 816 1457 m 17 Y s 862 1457 m 17 Y s 907 1440 m 34 Y s
 953 1457 m 17 Y s 998 1457 m 17 Y s 1043 1457 m 17 Y s 1089 1457 m 17 Y s 1134
 1440 m 34 Y s 1179 1457 m 17 Y s 1225 1457 m 17 Y s 1270 1457 m 17 Y s 1315
 1457 m 17 Y s 1361 1440 m 34 Y s 1406 1457 m 17 Y s 1452 1457 m 17 Y s 1497
 1457 m 17 Y s 1542 1457 m 17 Y s 1588 1440 m 34 Y s 1633 1457 m 17 Y s 1678
 1457 m 17 Y s 1724 1457 m 17 Y s 1769 1457 m 17 Y s 1814 1440 m 34 Y s 1860
 1457 m 17 Y s 1905 1457 m 17 Y s 1950 1457 m 17 Y s 1996 1457 m 17 Y s 2041
 1440 m 34 Y s 1814 1247 227 227 C 8 lw 231 666 m 5 4 d 4 4 d 5 4 d 4 4 d 5 4 d
 5 4 d 4 4 d 5 4 d 4 4 d 5 4 d 4 3 d 5 4 d 4 4 d 5 3 d 4 4 d 5 3 d 4 4 d 5 3 d 5
 4 d 4 3 d 5 4 d 4 3 d 5 4 d 4 3 d 5 3 d 4 4 d 5 3 d 4 3 d 5 3 d 4 3 d 5 4 d 4 3
 d 5 3 d 5 3 d 4 3 d 5 3 d 4 3 d 5 3 d 4 3 d 5 3 d 4 3 d 5 3 d 4 3 d 5 3 d 4 3 d
 5 2 d 5 3 d 4 3 d 5 3 d 4 3 d 5 2 d 4 3 d 5 3 d 4 2 d 5 3 d 4 3 d 5 2 d 4 3 d 5
 3 d 4 2 d 5 3 d 5 2 d 4 3 d 5 2 d 4 3 d 5 2 d 4 3 d 5 2 d 4 3 d 5 2 d 4 3 d 5 2
 d 4 2 d 5 3 d 5 2 d 4 3 d 5 2 d 4 2 d 5 3 d 4 2 d 5 2 d 4 2 d 5 3 d 4 2 d 5 2 d
 4 2 d 5 3 d 5 2 d 4 2 d 5 2 d 4 2 d 5 3 d 4 2 d 5 2 d 4 2 d 5 2 d 4 2 d 5 2 d 4
 2 d 5 2 d 4 3 d 5 2 d 5 2 d 4 2 d 5 2 d 4 2 d 5 2 d 4 2 d 5 2 d 4 2 d 5 2 d 4 2
 d 5 1 d 4 2 d 5 2 d 5 2 d 4 2 d 5 2 d 4 2 d 5 2 d 4 2 d 5 2 d 4 1 d 5 2 d 4 2 d
 5 2 d 4 2 d 5 2 d 4 1 d 5 2 d 5 2 d 4 2 d 5 2 d 4 1 d 5 2 d 4 2 d 5 2 d 4 1 d 5
 2 d 4 2 d 5 2 d 4 1 d 5 2 d 5 2 d 4 1 d 5 2 d 4 2 d 5 1 d 4 2 d 5 2 d 4 1 d 5 2
 d 4 2 d 5 1 d 4 2 d 5 2 d 4 1 d 5 2 d 5 1 d 4 2 d 5 2 d 4 1 d 5 2 d 4 1 d 5 2 d
 4 1 d 5 2 d 4 2 d 5 1 d 4 2 d 5 1 d 5 2 d 4 1 d 5 2 d 4 1 d 5 2 d 4 1 d 5 2 d 4
 1 d 5 2 d 4 1 d 5 2 d 4 1 d 5 2 d 4 1 d 5 2 d 5 1 d 4 1 d 5 2 d 4 1 d 5 2 d 4 1
 d 5 2 d 4 1 d 5 1 d 4 2 d 5 1 d 4 2 d 5 1 d 5 1 d 4 2 d 5 1 d 4 1 d 5 2 d 4 1 d
 5 2 d 4 1 d 5 1 d 4 2 d 5 1 d 4 1 d 5 2 d 5 1 d 4 1 d 5 2 d 4 1 d 5 1 d 4 1 d 5
 2 d 4 1 d 5 1 d 4 2 d 5 1 d 4 1 d 5 2 d 4 1 d 5 1 d 5 1 d 4 2 d 5 1 d 4 1 d 5 1
 d 4 2 d 5 1 d 4 1 d 5 1 d 4 2 d 5 1 d 4 1 d 5 1 d 5 1 d 4 2 d 5 1 d 4 1 d 5 1 d
 4 1 d 5 2 d 4 1 d 5 1 d 4 1 d 5 1 d 4 2 d 5 1 d 4 1 d 5 1 d 5 1 d 4 1 d 5 2 d 4
 1 d 5 1 d 4 1 d 5 1 d 4 1 d 5 1 d 4 2 d 5 1 d 4 1 d 5 1 d 5 1 d 4 1 d 5 1 d 4 2
 d 5 1 d 4 1 d 5 1 d 4 1 d 5 1 d 4 1 d 5 1 d 4 1 d 5 1 d 4 2 d 5 1 d 5 1 d 4 1 d
 5 1 d 4 1 d 5 1 d 4 1 d 5 1 d 4 1 d 5 1 d 4 1 d 5 1 d 4 1 d 5 1 d 5 1 d 4 2 d 5
 1 d 4 1 d 5 1 d 4 1 d 5 1 d 4 1 d 5 1 d 4 1 d 5 1 d 4 1 d 5 1 d 4 1 d 5 1 d 5 1
 d 4 1 d 5 1 d 4 1 d 5 1 d 4 1 d 5 1 d 4 1 d 5 1 d 4 1 d 5 1 d 4 1 d 5 1 d 5 1 d
 4 1 d 5 1 d 4 1 d 5 1 d 4 1 d 5 1 d 4 1 d 5 X 4 1 d 5 1 d 4 1 d 5 1 d 5 1 d 4 1
 d 5 1 d 4 1 d 5 1 d 4 1 d 5 1 d 4 1 d 5 1 d 4 1 d 5 1 d 4 1 d 5 X 4 1 d 5 1 d 5
 1 d 4 1 d 5 1 d 4 1 d 5 1 d 4 1 d 5 1 d 4 1 d 5 X 4 1 d 5 1 d 4 1 d 5 1 d 5 1 d
 4 1 d 5 1 d 4 1 d 5 1 d 4 X 5 1 d 4 1 d 5 1 d 4 1 d 5 1 d 4 1 d 5 1 d 4 X 5 1 d
 5 1 d 4 1 d 5 1 d 4 1 d 5 1 d 4 X 5 1 d 4 1 d 5 1 d 4 1 d 5 1 d 4 X 5 1 d 5 1 d
 4 1 d 5 1 d 4 1 d 5 1 d 4 X s
 gr  gr 
showpage
end
%%EOF
