%!PS-Adobe-2.0 EPSF-2.0
%%Title: corr-vbf-comp-2.eps
%%Creator: gnuplot 4.4 patchlevel 3
%%CreationDate: Thu Nov 24 14:09:07 2011
%%DocumentFonts: (atend)
%%BoundingBox: 122 50 842 831
%%EndComments
%%BeginProlog
/gnudict 256 dict def
gnudict begin
%
% The following true/false flags may be edited by hand if desired.
% The unit line width and grayscale image gamma correction may also be changed.
%
/Color true def
/Blacktext false def
/Solid false def
/Dashlength 4 def
/Landscape false def
/Level1 false def
/Rounded false def
/ClipToBoundingBox false def
/TransparentPatterns false def
/gnulinewidth 5.000 def
/userlinewidth gnulinewidth def
/Gamma 1.0 def
%
/vshift -73 def
/dl1 {
  10.0 Dashlength mul mul
  Rounded { currentlinewidth 0.75 mul sub dup 0 le { pop 0.01 } if } if
} def
/dl2 {
  10.0 Dashlength mul mul
  Rounded { currentlinewidth 0.75 mul add } if
} def
/hpt_ 31.5 def
/vpt_ 31.5 def
/hpt hpt_ def
/vpt vpt_ def
Level1 {} {
/SDict 10 dict def
systemdict /pdfmark known not {
  userdict /pdfmark systemdict /cleartomark get put
} if
SDict begin [
  /Title (corr-vbf-comp-2.eps)
  /Subject (gnuplot plot)
  /Creator (gnuplot 4.4 patchlevel 3)
  /Author (juanrojochacon)
%  /Producer (gnuplot)
%  /Keywords ()
  /CreationDate (Thu Nov 24 14:09:07 2011)
  /DOCINFO pdfmark
end
} ifelse
/doclip {
  ClipToBoundingBox {
    newpath 122 50 moveto 842 50 lineto 842 831 lineto 122 831 lineto closepath
    clip
  } if
} def
%
% Gnuplot Prolog Version 4.4 (August 2010)
%
%/SuppressPDFMark true def
%
/M {moveto} bind def
/L {lineto} bind def
/R {rmoveto} bind def
/V {rlineto} bind def
/N {newpath moveto} bind def
/Z {closepath} bind def
/C {setrgbcolor} bind def
/f {rlineto fill} bind def
/g {setgray} bind def
/Gshow {show} def   % May be redefined later in the file to support UTF-8
/vpt2 vpt 2 mul def
/hpt2 hpt 2 mul def
/Lshow {currentpoint stroke M 0 vshift R 
	Blacktext {gsave 0 setgray show grestore} {show} ifelse} def
/Rshow {currentpoint stroke M dup stringwidth pop neg vshift R
	Blacktext {gsave 0 setgray show grestore} {show} ifelse} def
/Cshow {currentpoint stroke M dup stringwidth pop -2 div vshift R 
	Blacktext {gsave 0 setgray show grestore} {show} ifelse} def
/UP {dup vpt_ mul /vpt exch def hpt_ mul /hpt exch def
  /hpt2 hpt 2 mul def /vpt2 vpt 2 mul def} def
/DL {Color {setrgbcolor Solid {pop []} if 0 setdash}
 {pop pop pop 0 setgray Solid {pop []} if 0 setdash} ifelse} def
/BL {stroke userlinewidth 2 mul setlinewidth
	Rounded {1 setlinejoin 1 setlinecap} if} def
/AL {stroke userlinewidth 2 div setlinewidth
	Rounded {1 setlinejoin 1 setlinecap} if} def
/UL {dup gnulinewidth mul /userlinewidth exch def
	dup 1 lt {pop 1} if 10 mul /udl exch def} def
/PL {stroke userlinewidth setlinewidth
	Rounded {1 setlinejoin 1 setlinecap} if} def
3.8 setmiterlimit
% Default Line colors
/LCw {1 1 1} def
/LCb {0 0 0} def
/LCa {0 0 0} def
/LC0 {1 0 0} def
/LC1 {0 1 0} def
/LC2 {0 0 1} def
/LC3 {1 0 1} def
/LC4 {0 1 1} def
/LC5 {1 1 0} def
/LC6 {0 0 0} def
/LC7 {1 0.3 0} def
/LC8 {0.5 0.5 0.5} def
% Default Line Types
/LTw {PL [] 1 setgray} def
/LTb {BL [] LCb DL} def
/LTa {AL [1 udl mul 2 udl mul] 0 setdash LCa setrgbcolor} def
/LT0 {PL [] LC0 DL} def
/LT1 {PL [4 dl1 2 dl2] LC1 DL} def
/LT2 {PL [2 dl1 3 dl2] LC2 DL} def
/LT3 {PL [1 dl1 1.5 dl2] LC3 DL} def
/LT4 {PL [6 dl1 2 dl2 1 dl1 2 dl2] LC4 DL} def
/LT5 {PL [3 dl1 3 dl2 1 dl1 3 dl2] LC5 DL} def
/LT6 {PL [2 dl1 2 dl2 2 dl1 6 dl2] LC6 DL} def
/LT7 {PL [1 dl1 2 dl2 6 dl1 2 dl2 1 dl1 2 dl2] LC7 DL} def
/LT8 {PL [2 dl1 2 dl2 2 dl1 2 dl2 2 dl1 2 dl2 2 dl1 4 dl2] LC8 DL} def
/Pnt {stroke [] 0 setdash gsave 1 setlinecap M 0 0 V stroke grestore} def
/Dia {stroke [] 0 setdash 2 copy vpt add M
  hpt neg vpt neg V hpt vpt neg V
  hpt vpt V hpt neg vpt V closepath stroke
  Pnt} def
/Pls {stroke [] 0 setdash vpt sub M 0 vpt2 V
  currentpoint stroke M
  hpt neg vpt neg R hpt2 0 V stroke
 } def
/Box {stroke [] 0 setdash 2 copy exch hpt sub exch vpt add M
  0 vpt2 neg V hpt2 0 V 0 vpt2 V
  hpt2 neg 0 V closepath stroke
  Pnt} def
/Crs {stroke [] 0 setdash exch hpt sub exch vpt add M
  hpt2 vpt2 neg V currentpoint stroke M
  hpt2 neg 0 R hpt2 vpt2 V stroke} def
/TriU {stroke [] 0 setdash 2 copy vpt 1.12 mul add M
  hpt neg vpt -1.62 mul V
  hpt 2 mul 0 V
  hpt neg vpt 1.62 mul V closepath stroke
  Pnt} def
/Star {2 copy Pls Crs} def
/BoxF {stroke [] 0 setdash exch hpt sub exch vpt add M
  0 vpt2 neg V hpt2 0 V 0 vpt2 V
  hpt2 neg 0 V closepath fill} def
/TriUF {stroke [] 0 setdash vpt 1.12 mul add M
  hpt neg vpt -1.62 mul V
  hpt 2 mul 0 V
  hpt neg vpt 1.62 mul V closepath fill} def
/TriD {stroke [] 0 setdash 2 copy vpt 1.12 mul sub M
  hpt neg vpt 1.62 mul V
  hpt 2 mul 0 V
  hpt neg vpt -1.62 mul V closepath stroke
  Pnt} def
/TriDF {stroke [] 0 setdash vpt 1.12 mul sub M
  hpt neg vpt 1.62 mul V
  hpt 2 mul 0 V
  hpt neg vpt -1.62 mul V closepath fill} def
/DiaF {stroke [] 0 setdash vpt add M
  hpt neg vpt neg V hpt vpt neg V
  hpt vpt V hpt neg vpt V closepath fill} def
/Pent {stroke [] 0 setdash 2 copy gsave
  translate 0 hpt M 4 {72 rotate 0 hpt L} repeat
  closepath stroke grestore Pnt} def
/PentF {stroke [] 0 setdash gsave
  translate 0 hpt M 4 {72 rotate 0 hpt L} repeat
  closepath fill grestore} def
/Circle {stroke [] 0 setdash 2 copy
  hpt 0 360 arc stroke Pnt} def
/CircleF {stroke [] 0 setdash hpt 0 360 arc fill} def
/C0 {BL [] 0 setdash 2 copy moveto vpt 90 450 arc} bind def
/C1 {BL [] 0 setdash 2 copy moveto
	2 copy vpt 0 90 arc closepath fill
	vpt 0 360 arc closepath} bind def
/C2 {BL [] 0 setdash 2 copy moveto
	2 copy vpt 90 180 arc closepath fill
	vpt 0 360 arc closepath} bind def
/C3 {BL [] 0 setdash 2 copy moveto
	2 copy vpt 0 180 arc closepath fill
	vpt 0 360 arc closepath} bind def
/C4 {BL [] 0 setdash 2 copy moveto
	2 copy vpt 180 270 arc closepath fill
	vpt 0 360 arc closepath} bind def
/C5 {BL [] 0 setdash 2 copy moveto
	2 copy vpt 0 90 arc
	2 copy moveto
	2 copy vpt 180 270 arc closepath fill
	vpt 0 360 arc} bind def
/C6 {BL [] 0 setdash 2 copy moveto
	2 copy vpt 90 270 arc closepath fill
	vpt 0 360 arc closepath} bind def
/C7 {BL [] 0 setdash 2 copy moveto
	2 copy vpt 0 270 arc closepath fill
	vpt 0 360 arc closepath} bind def
/C8 {BL [] 0 setdash 2 copy moveto
	2 copy vpt 270 360 arc closepath fill
	vpt 0 360 arc closepath} bind def
/C9 {BL [] 0 setdash 2 copy moveto
	2 copy vpt 270 450 arc closepath fill
	vpt 0 360 arc closepath} bind def
/C10 {BL [] 0 setdash 2 copy 2 copy moveto vpt 270 360 arc closepath fill
	2 copy moveto
	2 copy vpt 90 180 arc closepath fill
	vpt 0 360 arc closepath} bind def
/C11 {BL [] 0 setdash 2 copy moveto
	2 copy vpt 0 180 arc closepath fill
	2 copy moveto
	2 copy vpt 270 360 arc closepath fill
	vpt 0 360 arc closepath} bind def
/C12 {BL [] 0 setdash 2 copy moveto
	2 copy vpt 180 360 arc closepath fill
	vpt 0 360 arc closepath} bind def
/C13 {BL [] 0 setdash 2 copy moveto
	2 copy vpt 0 90 arc closepath fill
	2 copy moveto
	2 copy vpt 180 360 arc closepath fill
	vpt 0 360 arc closepath} bind def
/C14 {BL [] 0 setdash 2 copy moveto
	2 copy vpt 90 360 arc closepath fill
	vpt 0 360 arc} bind def
/C15 {BL [] 0 setdash 2 copy vpt 0 360 arc closepath fill
	vpt 0 360 arc closepath} bind def
/Rec {newpath 4 2 roll moveto 1 index 0 rlineto 0 exch rlineto
	neg 0 rlineto closepath} bind def
/Square {dup Rec} bind def
/Bsquare {vpt sub exch vpt sub exch vpt2 Square} bind def
/S0 {BL [] 0 setdash 2 copy moveto 0 vpt rlineto BL Bsquare} bind def
/S1 {BL [] 0 setdash 2 copy vpt Square fill Bsquare} bind def
/S2 {BL [] 0 setdash 2 copy exch vpt sub exch vpt Square fill Bsquare} bind def
/S3 {BL [] 0 setdash 2 copy exch vpt sub exch vpt2 vpt Rec fill Bsquare} bind def
/S4 {BL [] 0 setdash 2 copy exch vpt sub exch vpt sub vpt Square fill Bsquare} bind def
/S5 {BL [] 0 setdash 2 copy 2 copy vpt Square fill
	exch vpt sub exch vpt sub vpt Square fill Bsquare} bind def
/S6 {BL [] 0 setdash 2 copy exch vpt sub exch vpt sub vpt vpt2 Rec fill Bsquare} bind def
/S7 {BL [] 0 setdash 2 copy exch vpt sub exch vpt sub vpt vpt2 Rec fill
	2 copy vpt Square fill Bsquare} bind def
/S8 {BL [] 0 setdash 2 copy vpt sub vpt Square fill Bsquare} bind def
/S9 {BL [] 0 setdash 2 copy vpt sub vpt vpt2 Rec fill Bsquare} bind def
/S10 {BL [] 0 setdash 2 copy vpt sub vpt Square fill 2 copy exch vpt sub exch vpt Square fill
	Bsquare} bind def
/S11 {BL [] 0 setdash 2 copy vpt sub vpt Square fill 2 copy exch vpt sub exch vpt2 vpt Rec fill
	Bsquare} bind def
/S12 {BL [] 0 setdash 2 copy exch vpt sub exch vpt sub vpt2 vpt Rec fill Bsquare} bind def
/S13 {BL [] 0 setdash 2 copy exch vpt sub exch vpt sub vpt2 vpt Rec fill
	2 copy vpt Square fill Bsquare} bind def
/S14 {BL [] 0 setdash 2 copy exch vpt sub exch vpt sub vpt2 vpt Rec fill
	2 copy exch vpt sub exch vpt Square fill Bsquare} bind def
/S15 {BL [] 0 setdash 2 copy Bsquare fill Bsquare} bind def
/D0 {gsave translate 45 rotate 0 0 S0 stroke grestore} bind def
/D1 {gsave translate 45 rotate 0 0 S1 stroke grestore} bind def
/D2 {gsave translate 45 rotate 0 0 S2 stroke grestore} bind def
/D3 {gsave translate 45 rotate 0 0 S3 stroke grestore} bind def
/D4 {gsave translate 45 rotate 0 0 S4 stroke grestore} bind def
/D5 {gsave translate 45 rotate 0 0 S5 stroke grestore} bind def
/D6 {gsave translate 45 rotate 0 0 S6 stroke grestore} bind def
/D7 {gsave translate 45 rotate 0 0 S7 stroke grestore} bind def
/D8 {gsave translate 45 rotate 0 0 S8 stroke grestore} bind def
/D9 {gsave translate 45 rotate 0 0 S9 stroke grestore} bind def
/D10 {gsave translate 45 rotate 0 0 S10 stroke grestore} bind def
/D11 {gsave translate 45 rotate 0 0 S11 stroke grestore} bind def
/D12 {gsave translate 45 rotate 0 0 S12 stroke grestore} bind def
/D13 {gsave translate 45 rotate 0 0 S13 stroke grestore} bind def
/D14 {gsave translate 45 rotate 0 0 S14 stroke grestore} bind def
/D15 {gsave translate 45 rotate 0 0 S15 stroke grestore} bind def
/DiaE {stroke [] 0 setdash vpt add M
  hpt neg vpt neg V hpt vpt neg V
  hpt vpt V hpt neg vpt V closepath stroke} def
/BoxE {stroke [] 0 setdash exch hpt sub exch vpt add M
  0 vpt2 neg V hpt2 0 V 0 vpt2 V
  hpt2 neg 0 V closepath stroke} def
/TriUE {stroke [] 0 setdash vpt 1.12 mul add M
  hpt neg vpt -1.62 mul V
  hpt 2 mul 0 V
  hpt neg vpt 1.62 mul V closepath stroke} def
/TriDE {stroke [] 0 setdash vpt 1.12 mul sub M
  hpt neg vpt 1.62 mul V
  hpt 2 mul 0 V
  hpt neg vpt -1.62 mul V closepath stroke} def
/PentE {stroke [] 0 setdash gsave
  translate 0 hpt M 4 {72 rotate 0 hpt L} repeat
  closepath stroke grestore} def
/CircE {stroke [] 0 setdash 
  hpt 0 360 arc stroke} def
/Opaque {gsave closepath 1 setgray fill grestore 0 setgray closepath} def
/DiaW {stroke [] 0 setdash vpt add M
  hpt neg vpt neg V hpt vpt neg V
  hpt vpt V hpt neg vpt V Opaque stroke} def
/BoxW {stroke [] 0 setdash exch hpt sub exch vpt add M
  0 vpt2 neg V hpt2 0 V 0 vpt2 V
  hpt2 neg 0 V Opaque stroke} def
/TriUW {stroke [] 0 setdash vpt 1.12 mul add M
  hpt neg vpt -1.62 mul V
  hpt 2 mul 0 V
  hpt neg vpt 1.62 mul V Opaque stroke} def
/TriDW {stroke [] 0 setdash vpt 1.12 mul sub M
  hpt neg vpt 1.62 mul V
  hpt 2 mul 0 V
  hpt neg vpt -1.62 mul V Opaque stroke} def
/PentW {stroke [] 0 setdash gsave
  translate 0 hpt M 4 {72 rotate 0 hpt L} repeat
  Opaque stroke grestore} def
/CircW {stroke [] 0 setdash 
  hpt 0 360 arc Opaque stroke} def
/BoxFill {gsave Rec 1 setgray fill grestore} def
/Density {
  /Fillden exch def
  currentrgbcolor
  /ColB exch def /ColG exch def /ColR exch def
  /ColR ColR Fillden mul Fillden sub 1 add def
  /ColG ColG Fillden mul Fillden sub 1 add def
  /ColB ColB Fillden mul Fillden sub 1 add def
  ColR ColG ColB setrgbcolor} def
/BoxColFill {gsave Rec PolyFill} def
/PolyFill {gsave Density fill grestore grestore} def
/h {rlineto rlineto rlineto gsave closepath fill grestore} bind def
%
% PostScript Level 1 Pattern Fill routine for rectangles
% Usage: x y w h s a XX PatternFill
%	x,y = lower left corner of box to be filled
%	w,h = width and height of box
%	  a = angle in degrees between lines and x-axis
%	 XX = 0/1 for no/yes cross-hatch
%
/PatternFill {gsave /PFa [ 9 2 roll ] def
  PFa 0 get PFa 2 get 2 div add PFa 1 get PFa 3 get 2 div add translate
  PFa 2 get -2 div PFa 3 get -2 div PFa 2 get PFa 3 get Rec
  gsave 1 setgray fill grestore clip
  currentlinewidth 0.5 mul setlinewidth
  /PFs PFa 2 get dup mul PFa 3 get dup mul add sqrt def
  0 0 M PFa 5 get rotate PFs -2 div dup translate
  0 1 PFs PFa 4 get div 1 add floor cvi
	{PFa 4 get mul 0 M 0 PFs V} for
  0 PFa 6 get ne {
	0 1 PFs PFa 4 get div 1 add floor cvi
	{PFa 4 get mul 0 2 1 roll M PFs 0 V} for
 } if
  stroke grestore} def
%
/languagelevel where
 {pop languagelevel} {1} ifelse
 2 lt
	{/InterpretLevel1 true def}
	{/InterpretLevel1 Level1 def}
 ifelse
%
% PostScript level 2 pattern fill definitions
%
/Level2PatternFill {
/Tile8x8 {/PaintType 2 /PatternType 1 /TilingType 1 /BBox [0 0 8 8] /XStep 8 /YStep 8}
	bind def
/KeepColor {currentrgbcolor [/Pattern /DeviceRGB] setcolorspace} bind def
<< Tile8x8
 /PaintProc {0.5 setlinewidth pop 0 0 M 8 8 L 0 8 M 8 0 L stroke} 
>> matrix makepattern
/Pat1 exch def
<< Tile8x8
 /PaintProc {0.5 setlinewidth pop 0 0 M 8 8 L 0 8 M 8 0 L stroke
	0 4 M 4 8 L 8 4 L 4 0 L 0 4 L stroke}
>> matrix makepattern
/Pat2 exch def
<< Tile8x8
 /PaintProc {0.5 setlinewidth pop 0 0 M 0 8 L
	8 8 L 8 0 L 0 0 L fill}
>> matrix makepattern
/Pat3 exch def
<< Tile8x8
 /PaintProc {0.5 setlinewidth pop -4 8 M 8 -4 L
	0 12 M 12 0 L stroke}
>> matrix makepattern
/Pat4 exch def
<< Tile8x8
 /PaintProc {0.5 setlinewidth pop -4 0 M 8 12 L
	0 -4 M 12 8 L stroke}
>> matrix makepattern
/Pat5 exch def
<< Tile8x8
 /PaintProc {0.5 setlinewidth pop -2 8 M 4 -4 L
	0 12 M 8 -4 L 4 12 M 10 0 L stroke}
>> matrix makepattern
/Pat6 exch def
<< Tile8x8
 /PaintProc {0.5 setlinewidth pop -2 0 M 4 12 L
	0 -4 M 8 12 L 4 -4 M 10 8 L stroke}
>> matrix makepattern
/Pat7 exch def
<< Tile8x8
 /PaintProc {0.5 setlinewidth pop 8 -2 M -4 4 L
	12 0 M -4 8 L 12 4 M 0 10 L stroke}
>> matrix makepattern
/Pat8 exch def
<< Tile8x8
 /PaintProc {0.5 setlinewidth pop 0 -2 M 12 4 L
	-4 0 M 12 8 L -4 4 M 8 10 L stroke}
>> matrix makepattern
/Pat9 exch def
/Pattern1 {PatternBgnd KeepColor Pat1 setpattern} bind def
/Pattern2 {PatternBgnd KeepColor Pat2 setpattern} bind def
/Pattern3 {PatternBgnd KeepColor Pat3 setpattern} bind def
/Pattern4 {PatternBgnd KeepColor Landscape {Pat5} {Pat4} ifelse setpattern} bind def
/Pattern5 {PatternBgnd KeepColor Landscape {Pat4} {Pat5} ifelse setpattern} bind def
/Pattern6 {PatternBgnd KeepColor Landscape {Pat9} {Pat6} ifelse setpattern} bind def
/Pattern7 {PatternBgnd KeepColor Landscape {Pat8} {Pat7} ifelse setpattern} bind def
} def
%
%
%End of PostScript Level 2 code
%
/PatternBgnd {
  TransparentPatterns {} {gsave 1 setgray fill grestore} ifelse
} def
%
% Substitute for Level 2 pattern fill codes with
% grayscale if Level 2 support is not selected.
%
/Level1PatternFill {
/Pattern1 {0.250 Density} bind def
/Pattern2 {0.500 Density} bind def
/Pattern3 {0.750 Density} bind def
/Pattern4 {0.125 Density} bind def
/Pattern5 {0.375 Density} bind def
/Pattern6 {0.625 Density} bind def
/Pattern7 {0.875 Density} bind def
} def
%
% Now test for support of Level 2 code
%
Level1 {Level1PatternFill} {Level2PatternFill} ifelse
%
/Symbol-Oblique /Symbol findfont [1 0 .167 1 0 0] makefont
dup length dict begin {1 index /FID eq {pop pop} {def} ifelse} forall
currentdict end definefont pop
/MFshow {
   { dup 5 get 3 ge
     { 5 get 3 eq {gsave} {grestore} ifelse }
     {dup dup 0 get findfont exch 1 get scalefont setfont
     [ currentpoint ] exch dup 2 get 0 exch R dup 5 get 2 ne {dup dup 6
     get exch 4 get {Gshow} {stringwidth pop 0 R} ifelse }if dup 5 get 0 eq
     {dup 3 get {2 get neg 0 exch R pop} {pop aload pop M} ifelse} {dup 5
     get 1 eq {dup 2 get exch dup 3 get exch 6 get stringwidth pop -2 div
     dup 0 R} {dup 6 get stringwidth pop -2 div 0 R 6 get
     show 2 index {aload pop M neg 3 -1 roll neg R pop pop} {pop pop pop
     pop aload pop M} ifelse }ifelse }ifelse }
     ifelse }
   forall} def
/Gswidth {dup type /stringtype eq {stringwidth} {pop (n) stringwidth} ifelse} def
/MFwidth {0 exch { dup 5 get 3 ge { 5 get 3 eq { 0 } { pop } ifelse }
 {dup 3 get{dup dup 0 get findfont exch 1 get scalefont setfont
     6 get Gswidth pop add} {pop} ifelse} ifelse} forall} def
/MLshow { currentpoint stroke M
  0 exch R
  Blacktext {gsave 0 setgray MFshow grestore} {MFshow} ifelse } bind def
/MRshow { currentpoint stroke M
  exch dup MFwidth neg 3 -1 roll R
  Blacktext {gsave 0 setgray MFshow grestore} {MFshow} ifelse } bind def
/MCshow { currentpoint stroke M
  exch dup MFwidth -2 div 3 -1 roll R
  Blacktext {gsave 0 setgray MFshow grestore} {MFshow} ifelse } bind def
/XYsave    { [( ) 1 2 true false 3 ()] } bind def
/XYrestore { [( ) 1 2 true false 4 ()] } bind def
end
%%EndProlog
gnudict begin
gsave
doclip
50 50 translate
0.050 0.050 scale
0 setgray
newpath
(Helvetica) findfont 220 scalefont setfont
1.000 UL
LTb
2232 11091 M
63 0 V
5947 0 R
-63 0 V
stroke
2100 11091 M
[ [(Helvetica) 220.0 0.0 true true 0 (-1)]
] -73.3 MRshow
1.000 UL
LTb
2232 11966 M
63 0 V
5947 0 R
-63 0 V
stroke
2100 11966 M
[ [(Helvetica) 220.0 0.0 true true 0 ( 0)]
] -73.3 MRshow
1.000 UL
LTb
2232 12840 M
63 0 V
5947 0 R
-63 0 V
stroke
2100 12840 M
[ [(Helvetica) 220.0 0.0 true true 0 ( 1)]
] -73.3 MRshow
1.000 UL
LTb
2525 11004 M
0 63 V
0 3390 R
0 -63 V
stroke
2525 10784 M
[ [(Helvetica) 220.0 0.0 true true 0 ( 120)]
] -73.3 MCshow
1.000 UL
LTb
3112 11004 M
0 63 V
0 3390 R
0 -63 V
stroke
3112 10784 M
[ [(Helvetica) 220.0 0.0 true true 0 ( 160)]
] -73.3 MCshow
1.000 UL
LTb
3698 11004 M
0 63 V
0 3390 R
0 -63 V
stroke
3698 10784 M
[ [(Helvetica) 220.0 0.0 true true 0 ( 200)]
] -73.3 MCshow
1.000 UL
LTb
5164 11004 M
0 63 V
0 3390 R
0 -63 V
stroke
5164 10784 M
[ [(Helvetica) 220.0 0.0 true true 0 ( 300)]
] -73.3 MCshow
1.000 UL
LTb
8095 11004 M
0 63 V
0 3390 R
0 -63 V
stroke
8095 10784 M
[ [(Helvetica) 220.0 0.0 true true 0 ( 500)]
] -73.3 MCshow
1.000 UL
LTb
1.000 UL
LTb
2232 14457 N
0 -3453 V
6010 0 V
0 3453 V
-6010 0 V
Z stroke
LCb setrgbcolor
1594 12730 M
currentpoint gsave translate -270 rotate 0 0 moveto
[ [(Helvetica) 220.0 0.0 true true 0 (Correlation with VBF)]
] -73.3 MCshow
grestore
LTb
LCb setrgbcolor
5237 10454 M
[ [(Helvetica) 220.0 0.0 true true 0 (M)]
[(Helvetica) 176.0 -66.0 true true 0 (H)]
[(Helvetica) 220.0 0.0 true true 0 ( \( GeV \))]
] -51.3 MCshow
LTb
5237 14787 M
[ [(Helvetica) 220.0 0.0 true true 0 (W)]
[(Symbol) 220.0 0.0 true true 0 (g)]
] -73.3 MCshow
1.000 UP
5718 14112 M
[ [(Times-Roman) 220.0 0.0 true true 0 (LHC HIGGS XS WG 2011)]
] -73.3 MLshow
1.000 UL
LTb
% Begin plot #1
3.000 UL
LT0
LCb setrgbcolor
4344 14284 M
[ [(Helvetica) 220.0 0.0 true true 0 (NNPDF2.1)]
] -73.3 MRshow
LT0
4476 14284 M
591 0 V
2525 12438 M
587 -9 V
586 -18 V
1466 -35 V
2931 -61 V
% End plot #1
% Begin plot #2
stroke
LT1
LCb setrgbcolor
4344 14064 M
[ [(Helvetica) 220.0 0.0 true true 0 (CT10)]
] -73.3 MRshow
LT1
4476 14064 M
591 0 V
2525 12254 M
587 -70 V
586 -79 V
1466 -113 V
2931 -96 V
% End plot #2
% Begin plot #3
stroke
LT2
LCb setrgbcolor
4344 13844 M
[ [(Helvetica) 220.0 0.0 true true 0 (MSTW08)]
] -73.3 MRshow
LT2
4476 13844 M
591 0 V
2525 12630 M
587 -26 V
586 -18 V
1466 -26 V
2931 -44 V
% End plot #3
% Begin plot #4
stroke
LT0
LCa setrgbcolor
LCb setrgbcolor
4344 13624 M
[ [(Helvetica) 220.0 0.0 true true 0 (PDF4LHC Average)]
] -73.3 MRshow
LT0
LCa setrgbcolor
4476 13624 M
591 0 V
2525 12441 M
587 -35 V
586 -38 V
1466 -59 V
2931 -67 V
% End plot #4
% Begin plot #5
stroke
LT4
LC4 setrgbcolor
LCb setrgbcolor
4344 13404 M
[ [(Helvetica) 220.0 0.0 true true 0 (HERAPDF1.5)]
] -73.3 MRshow
LT4
LC4 setrgbcolor
4476 13404 M
591 0 V
2525 11773 M
587 -26 V
586 -17 V
1466 -18 V
2931 -26 V
% End plot #5
% Begin plot #6
stroke
LT5
LC7 setrgbcolor
LCb setrgbcolor
4344 13184 M
[ [(Helvetica) 220.0 0.0 true true 0 (GJR08)]
] -73.3 MRshow
LT5
LC7 setrgbcolor
4476 13184 M
591 0 V
2525 12018 M
587 131 V
586 26 V
1466 9 V
2931 175 V
% End plot #6
% Begin plot #7
stroke
LT1
LC8 setrgbcolor
LCb setrgbcolor
4344 12964 M
[ [(Helvetica) 220.0 0.0 true true 0 (ABKM09)]
] -73.3 MRshow
LT1
LC8 setrgbcolor
4476 12964 M
591 0 V
2525 12202 M
587 -123 V
586 -52 V
1466 -158 V
2931 -69 V
% End plot #7
% Begin plot #8
stroke
1.000 UL
LT3
LCa setrgbcolor
2232 11091 M
61 0 V
60 0 V
61 0 V
61 0 V
61 0 V
60 0 V
61 0 V
61 0 V
60 0 V
61 0 V
61 0 V
60 0 V
61 0 V
61 0 V
61 0 V
60 0 V
61 0 V
61 0 V
60 0 V
61 0 V
61 0 V
61 0 V
60 0 V
61 0 V
61 0 V
60 0 V
61 0 V
61 0 V
61 0 V
60 0 V
61 0 V
61 0 V
60 0 V
61 0 V
61 0 V
60 0 V
61 0 V
61 0 V
61 0 V
60 0 V
61 0 V
61 0 V
60 0 V
61 0 V
61 0 V
61 0 V
60 0 V
61 0 V
61 0 V
60 0 V
61 0 V
61 0 V
60 0 V
61 0 V
61 0 V
61 0 V
60 0 V
61 0 V
61 0 V
60 0 V
61 0 V
61 0 V
61 0 V
60 0 V
61 0 V
61 0 V
60 0 V
61 0 V
61 0 V
60 0 V
61 0 V
61 0 V
61 0 V
60 0 V
61 0 V
61 0 V
60 0 V
61 0 V
61 0 V
61 0 V
60 0 V
61 0 V
61 0 V
60 0 V
61 0 V
61 0 V
61 0 V
60 0 V
61 0 V
61 0 V
60 0 V
61 0 V
61 0 V
60 0 V
61 0 V
61 0 V
61 0 V
60 0 V
61 0 V
% End plot #8
% Begin plot #9
stroke
LT3
LCa setrgbcolor
2232 12840 M
61 0 V
60 0 V
61 0 V
61 0 V
61 0 V
60 0 V
61 0 V
61 0 V
60 0 V
61 0 V
61 0 V
60 0 V
61 0 V
61 0 V
61 0 V
60 0 V
61 0 V
61 0 V
60 0 V
61 0 V
61 0 V
61 0 V
60 0 V
61 0 V
61 0 V
60 0 V
61 0 V
61 0 V
61 0 V
60 0 V
61 0 V
61 0 V
60 0 V
61 0 V
61 0 V
60 0 V
61 0 V
61 0 V
61 0 V
60 0 V
61 0 V
61 0 V
60 0 V
61 0 V
61 0 V
61 0 V
60 0 V
61 0 V
61 0 V
60 0 V
61 0 V
61 0 V
60 0 V
61 0 V
61 0 V
61 0 V
60 0 V
61 0 V
61 0 V
60 0 V
61 0 V
61 0 V
61 0 V
60 0 V
61 0 V
61 0 V
60 0 V
61 0 V
61 0 V
60 0 V
61 0 V
61 0 V
61 0 V
60 0 V
61 0 V
61 0 V
60 0 V
61 0 V
61 0 V
61 0 V
60 0 V
61 0 V
61 0 V
60 0 V
61 0 V
61 0 V
61 0 V
60 0 V
61 0 V
61 0 V
60 0 V
61 0 V
61 0 V
60 0 V
61 0 V
61 0 V
61 0 V
60 0 V
61 0 V
% End plot #9
stroke
LTb
2232 14457 N
0 -3453 V
6010 0 V
0 3453 V
-6010 0 V
Z stroke
1.000 UP
1.000 UL
LTb
1.000 UL
LTb
9432 11091 M
63 0 V
5946 0 R
-63 0 V
stroke
9300 11091 M
[ [(Helvetica) 220.0 0.0 true true 0 (-1)]
] -73.3 MRshow
1.000 UL
LTb
9432 11966 M
63 0 V
5946 0 R
-63 0 V
stroke
9300 11966 M
[ [(Helvetica) 220.0 0.0 true true 0 ( 0)]
] -73.3 MRshow
1.000 UL
LTb
9432 12840 M
63 0 V
5946 0 R
-63 0 V
stroke
9300 12840 M
[ [(Helvetica) 220.0 0.0 true true 0 ( 1)]
] -73.3 MRshow
1.000 UL
LTb
9725 11004 M
0 63 V
0 3390 R
0 -63 V
stroke
9725 10784 M
[ [(Helvetica) 220.0 0.0 true true 0 ( 120)]
] -73.3 MCshow
1.000 UL
LTb
10311 11004 M
0 63 V
0 3390 R
0 -63 V
stroke
10311 10784 M
[ [(Helvetica) 220.0 0.0 true true 0 ( 160)]
] -73.3 MCshow
1.000 UL
LTb
10898 11004 M
0 63 V
0 3390 R
0 -63 V
stroke
10898 10784 M
[ [(Helvetica) 220.0 0.0 true true 0 ( 200)]
] -73.3 MCshow
1.000 UL
LTb
12363 11004 M
0 63 V
0 3390 R
0 -63 V
stroke
12363 10784 M
[ [(Helvetica) 220.0 0.0 true true 0 ( 300)]
] -73.3 MCshow
1.000 UL
LTb
15294 11004 M
0 63 V
0 3390 R
0 -63 V
stroke
15294 10784 M
[ [(Helvetica) 220.0 0.0 true true 0 ( 500)]
] -73.3 MCshow
1.000 UL
LTb
1.000 UL
LTb
9432 14457 N
0 -3453 V
6009 0 V
0 3453 V
-6009 0 V
Z stroke
LCb setrgbcolor
8794 12730 M
currentpoint gsave translate -270 rotate 0 0 moveto
[ [(Helvetica) 220.0 0.0 true true 0 ( )]
] -73.3 MCshow
grestore
LTb
LCb setrgbcolor
12436 10454 M
[ [(Helvetica) 220.0 0.0 true true 0 (M)]
[(Helvetica) 176.0 -66.0 true true 0 (H)]
[(Helvetica) 220.0 0.0 true true 0 ( \( GeV \))]
] -51.3 MCshow
LTb
12436 14787 M
[ [(Helvetica) 220.0 0.0 true true 0 (Wbb)]
] -73.3 MCshow
1.000 UP
12917 14112 M
[ [(Times-Roman) 220.0 0.0 true true 0 (LHC HIGGS XS WG 2011)]
] -73.3 MLshow
1.000 UL
LTb
% Begin plot #1
3.000 UL
LT0
LCb setrgbcolor
11544 14284 M
[ [(Helvetica) 220.0 0.0 true true 0 (NNPDF2.1)]
] -73.3 MRshow
LT0
11676 14284 M
591 0 V
9725 12350 M
586 0 V
587 -113 V
1465 -35 V
2931 70 V
% End plot #1
% Begin plot #2
stroke
LT1
LCb setrgbcolor
11544 14064 M
[ [(Helvetica) 220.0 0.0 true true 0 (CT10)]
] -73.3 MRshow
LT1
11676 14064 M
591 0 V
9725 12508 M
586 -27 V
587 -35 V
1465 -78 V
2931 -88 V
% End plot #2
% Begin plot #3
stroke
LT2
LCb setrgbcolor
11544 13844 M
[ [(Helvetica) 220.0 0.0 true true 0 (MSTW08)]
] -73.3 MRshow
LT2
11676 13844 M
591 0 V
9725 12639 M
586 -9 V
587 -9 V
1465 -43 V
2931 -44 V
% End plot #3
% Begin plot #4
stroke
LT0
LCa setrgbcolor
LCb setrgbcolor
11544 13624 M
[ [(Helvetica) 220.0 0.0 true true 0 (PDF4LHC Average)]
] -73.3 MRshow
LT0
LCa setrgbcolor
11676 13624 M
591 0 V
9725 12499 M
586 -12 V
587 -52 V
1465 -53 V
2931 -20 V
% End plot #4
% Begin plot #5
stroke
LT4
LC4 setrgbcolor
LCb setrgbcolor
11544 13404 M
[ [(Helvetica) 220.0 0.0 true true 0 (HERAPDF1.5)]
] -73.3 MRshow
LT4
LC4 setrgbcolor
11676 13404 M
591 0 V
9725 12586 M
586 0 V
587 0 V
1465 0 V
2931 0 V
% End plot #5
% Begin plot #6
stroke
LT5
LC7 setrgbcolor
LCb setrgbcolor
11544 13184 M
[ [(Helvetica) 220.0 0.0 true true 0 (GJR08)]
] -73.3 MRshow
LT5
LC7 setrgbcolor
11676 13184 M
591 0 V
9725 12289 M
586 -131 V
587 105 V
1465 -158 V
2931 -148 V
% End plot #6
% Begin plot #7
stroke
LT1
LC8 setrgbcolor
LCb setrgbcolor
11544 12964 M
[ [(Helvetica) 220.0 0.0 true true 0 (ABKM09)]
] -73.3 MRshow
LT1
LC8 setrgbcolor
11676 12964 M
591 0 V
9725 12359 M
586 -61 V
587 -35 V
1465 -123 V
2931 -96 V
% End plot #7
% Begin plot #8
stroke
1.000 UL
LT3
LCa setrgbcolor
9432 11091 M
61 0 V
60 0 V
61 0 V
61 0 V
60 0 V
61 0 V
61 0 V
61 0 V
60 0 V
61 0 V
61 0 V
60 0 V
61 0 V
61 0 V
60 0 V
61 0 V
61 0 V
61 0 V
60 0 V
61 0 V
61 0 V
60 0 V
61 0 V
61 0 V
60 0 V
61 0 V
61 0 V
61 0 V
60 0 V
61 0 V
61 0 V
60 0 V
61 0 V
61 0 V
60 0 V
61 0 V
61 0 V
60 0 V
61 0 V
61 0 V
61 0 V
60 0 V
61 0 V
61 0 V
60 0 V
61 0 V
61 0 V
60 0 V
61 0 V
61 0 V
61 0 V
60 0 V
61 0 V
61 0 V
60 0 V
61 0 V
61 0 V
60 0 V
61 0 V
61 0 V
61 0 V
60 0 V
61 0 V
61 0 V
60 0 V
61 0 V
61 0 V
60 0 V
61 0 V
61 0 V
60 0 V
61 0 V
61 0 V
61 0 V
60 0 V
61 0 V
61 0 V
60 0 V
61 0 V
61 0 V
60 0 V
61 0 V
61 0 V
61 0 V
60 0 V
61 0 V
61 0 V
60 0 V
61 0 V
61 0 V
60 0 V
61 0 V
61 0 V
61 0 V
60 0 V
61 0 V
61 0 V
60 0 V
61 0 V
% End plot #8
% Begin plot #9
stroke
LT3
LCa setrgbcolor
9432 12840 M
61 0 V
60 0 V
61 0 V
61 0 V
60 0 V
61 0 V
61 0 V
61 0 V
60 0 V
61 0 V
61 0 V
60 0 V
61 0 V
61 0 V
60 0 V
61 0 V
61 0 V
61 0 V
60 0 V
61 0 V
61 0 V
60 0 V
61 0 V
61 0 V
60 0 V
61 0 V
61 0 V
61 0 V
60 0 V
61 0 V
61 0 V
60 0 V
61 0 V
61 0 V
60 0 V
61 0 V
61 0 V
60 0 V
61 0 V
61 0 V
61 0 V
60 0 V
61 0 V
61 0 V
60 0 V
61 0 V
61 0 V
60 0 V
61 0 V
61 0 V
61 0 V
60 0 V
61 0 V
61 0 V
60 0 V
61 0 V
61 0 V
60 0 V
61 0 V
61 0 V
61 0 V
60 0 V
61 0 V
61 0 V
60 0 V
61 0 V
61 0 V
60 0 V
61 0 V
61 0 V
60 0 V
61 0 V
61 0 V
61 0 V
60 0 V
61 0 V
61 0 V
60 0 V
61 0 V
61 0 V
60 0 V
61 0 V
61 0 V
61 0 V
60 0 V
61 0 V
61 0 V
60 0 V
61 0 V
61 0 V
60 0 V
61 0 V
61 0 V
61 0 V
60 0 V
61 0 V
61 0 V
60 0 V
61 0 V
% End plot #9
stroke
LTb
9432 14457 N
0 -3453 V
6009 0 V
0 3453 V
-6009 0 V
Z stroke
1.000 UP
1.000 UL
LTb
1.000 UL
LTb
2232 6051 M
63 0 V
5947 0 R
-63 0 V
stroke
2100 6051 M
[ [(Helvetica) 220.0 0.0 true true 0 (-1)]
] -73.3 MRshow
1.000 UL
LTb
2232 6926 M
63 0 V
5947 0 R
-63 0 V
stroke
2100 6926 M
[ [(Helvetica) 220.0 0.0 true true 0 ( 0)]
] -73.3 MRshow
1.000 UL
LTb
2232 7800 M
63 0 V
5947 0 R
-63 0 V
stroke
2100 7800 M
[ [(Helvetica) 220.0 0.0 true true 0 ( 1)]
] -73.3 MRshow
1.000 UL
LTb
2525 5964 M
0 63 V
0 3391 R
0 -63 V
stroke
2525 5744 M
[ [(Helvetica) 220.0 0.0 true true 0 ( 120)]
] -73.3 MCshow
1.000 UL
LTb
3112 5964 M
0 63 V
0 3391 R
0 -63 V
stroke
3112 5744 M
[ [(Helvetica) 220.0 0.0 true true 0 ( 160)]
] -73.3 MCshow
1.000 UL
LTb
3698 5964 M
0 63 V
0 3391 R
0 -63 V
stroke
3698 5744 M
[ [(Helvetica) 220.0 0.0 true true 0 ( 200)]
] -73.3 MCshow
1.000 UL
LTb
5164 5964 M
0 63 V
0 3391 R
0 -63 V
stroke
5164 5744 M
[ [(Helvetica) 220.0 0.0 true true 0 ( 300)]
] -73.3 MCshow
1.000 UL
LTb
8095 5964 M
0 63 V
0 3391 R
0 -63 V
stroke
8095 5744 M
[ [(Helvetica) 220.0 0.0 true true 0 ( 500)]
] -73.3 MCshow
1.000 UL
LTb
1.000 UL
LTb
2232 9418 N
0 -3454 V
6010 0 V
0 3454 V
-6010 0 V
Z stroke
LCb setrgbcolor
1594 7691 M
currentpoint gsave translate -270 rotate 0 0 moveto
[ [(Helvetica) 220.0 0.0 true true 0 (Correlation with VBF)]
] -73.3 MCshow
grestore
LTb
LCb setrgbcolor
5237 5414 M
[ [(Helvetica) 220.0 0.0 true true 0 (M)]
[(Helvetica) 176.0 -66.0 true true 0 (H)]
[(Helvetica) 220.0 0.0 true true 0 ( \( GeV \))]
] -51.3 MCshow
LTb
5237 9748 M
[ [(Helvetica) 220.0 0.0 true true 0 (tt)]
] -73.3 MCshow
1.000 UP
5718 9073 M
[ [(Times-Roman) 220.0 0.0 true true 0 (LHC HIGGS XS WG 2011)]
] -73.3 MLshow
1.000 UL
LTb
% Begin plot #1
3.000 UL
LT0
LCb setrgbcolor
4344 9245 M
[ [(Helvetica) 220.0 0.0 true true 0 (NNPDF2.1)]
] -73.3 MRshow
LT0
4476 9245 M
591 0 V
2525 6366 M
587 35 V
586 26 V
1466 27 V
2931 26 V
% End plot #1
% Begin plot #2
stroke
LT1
LCb setrgbcolor
4344 9025 M
[ [(Helvetica) 220.0 0.0 true true 0 (CT10)]
] -73.3 MRshow
LT1
4476 9025 M
591 0 V
2525 6838 M
587 62 V
586 43 V
1466 62 V
2931 8 V
% End plot #2
% Begin plot #3
stroke
LT2
LCb setrgbcolor
4344 8805 M
[ [(Helvetica) 220.0 0.0 true true 0 (MSTW08)]
] -73.3 MRshow
LT2
4476 8805 M
591 0 V
2525 6305 M
587 70 V
586 -35 V
1466 35 V
2931 26 V
% End plot #3
% Begin plot #4
stroke
LT0
LCa setrgbcolor
LCb setrgbcolor
4344 8585 M
[ [(Helvetica) 220.0 0.0 true true 0 (PDF4LHC Average)]
] -73.3 MRshow
LT0
LCa setrgbcolor
4476 8585 M
591 0 V
2525 6503 M
587 56 V
586 11 V
1466 41 V
2931 20 V
% End plot #4
% Begin plot #5
stroke
LT4
LC4 setrgbcolor
LCb setrgbcolor
4344 8365 M
[ [(Helvetica) 220.0 0.0 true true 0 (HERAPDF1.5)]
] -73.3 MRshow
LT4
LC4 setrgbcolor
4476 8365 M
591 0 V
2525 6130 M
587 9 V
586 9 V
1466 8 V
2931 9 V
% End plot #5
% Begin plot #6
stroke
LT5
LC7 setrgbcolor
LCb setrgbcolor
4344 8145 M
[ [(Helvetica) 220.0 0.0 true true 0 (GJR08)]
] -73.3 MRshow
LT5
LC7 setrgbcolor
4476 8145 M
591 0 V
2525 7179 M
587 -131 V
586 88 V
5164 6926 L
8095 6786 L
% End plot #6
% Begin plot #7
stroke
LT1
LC8 setrgbcolor
LCb setrgbcolor
4344 7925 M
[ [(Helvetica) 220.0 0.0 true true 0 (ABKM09)]
] -73.3 MRshow
LT1
LC8 setrgbcolor
4476 7925 M
591 0 V
2525 6550 M
587 70 V
586 0 V
1466 105 V
2931 0 V
% End plot #7
% Begin plot #8
stroke
1.000 UL
LT3
LCa setrgbcolor
2232 6051 M
61 0 V
60 0 V
61 0 V
61 0 V
61 0 V
60 0 V
61 0 V
61 0 V
60 0 V
61 0 V
61 0 V
60 0 V
61 0 V
61 0 V
61 0 V
60 0 V
61 0 V
61 0 V
60 0 V
61 0 V
61 0 V
61 0 V
60 0 V
61 0 V
61 0 V
60 0 V
61 0 V
61 0 V
61 0 V
60 0 V
61 0 V
61 0 V
60 0 V
61 0 V
61 0 V
60 0 V
61 0 V
61 0 V
61 0 V
60 0 V
61 0 V
61 0 V
60 0 V
61 0 V
61 0 V
61 0 V
60 0 V
61 0 V
61 0 V
60 0 V
61 0 V
61 0 V
60 0 V
61 0 V
61 0 V
61 0 V
60 0 V
61 0 V
61 0 V
60 0 V
61 0 V
61 0 V
61 0 V
60 0 V
61 0 V
61 0 V
60 0 V
61 0 V
61 0 V
60 0 V
61 0 V
61 0 V
61 0 V
60 0 V
61 0 V
61 0 V
60 0 V
61 0 V
61 0 V
61 0 V
60 0 V
61 0 V
61 0 V
60 0 V
61 0 V
61 0 V
61 0 V
60 0 V
61 0 V
61 0 V
60 0 V
61 0 V
61 0 V
60 0 V
61 0 V
61 0 V
61 0 V
60 0 V
61 0 V
% End plot #8
% Begin plot #9
stroke
LT3
LCa setrgbcolor
2232 7800 M
61 0 V
60 0 V
61 0 V
61 0 V
61 0 V
60 0 V
61 0 V
61 0 V
60 0 V
61 0 V
61 0 V
60 0 V
61 0 V
61 0 V
61 0 V
60 0 V
61 0 V
61 0 V
60 0 V
61 0 V
61 0 V
61 0 V
60 0 V
61 0 V
61 0 V
60 0 V
61 0 V
61 0 V
61 0 V
60 0 V
61 0 V
61 0 V
60 0 V
61 0 V
61 0 V
60 0 V
61 0 V
61 0 V
61 0 V
60 0 V
61 0 V
61 0 V
60 0 V
61 0 V
61 0 V
61 0 V
60 0 V
61 0 V
61 0 V
60 0 V
61 0 V
61 0 V
60 0 V
61 0 V
61 0 V
61 0 V
60 0 V
61 0 V
61 0 V
60 0 V
61 0 V
61 0 V
61 0 V
60 0 V
61 0 V
61 0 V
60 0 V
61 0 V
61 0 V
60 0 V
61 0 V
61 0 V
61 0 V
60 0 V
61 0 V
61 0 V
60 0 V
61 0 V
61 0 V
61 0 V
60 0 V
61 0 V
61 0 V
60 0 V
61 0 V
61 0 V
61 0 V
60 0 V
61 0 V
61 0 V
60 0 V
61 0 V
61 0 V
60 0 V
61 0 V
61 0 V
61 0 V
60 0 V
61 0 V
% End plot #9
stroke
LTb
2232 9418 N
0 -3454 V
6010 0 V
0 3454 V
-6010 0 V
Z stroke
1.000 UP
1.000 UL
LTb
1.000 UL
LTb
9432 6051 M
63 0 V
5946 0 R
-63 0 V
stroke
9300 6051 M
[ [(Helvetica) 220.0 0.0 true true 0 (-1)]
] -73.3 MRshow
1.000 UL
LTb
9432 6926 M
63 0 V
5946 0 R
-63 0 V
stroke
9300 6926 M
[ [(Helvetica) 220.0 0.0 true true 0 ( 0)]
] -73.3 MRshow
1.000 UL
LTb
9432 7800 M
63 0 V
5946 0 R
-63 0 V
stroke
9300 7800 M
[ [(Helvetica) 220.0 0.0 true true 0 ( 1)]
] -73.3 MRshow
1.000 UL
LTb
9725 5964 M
0 63 V
0 3391 R
0 -63 V
stroke
9725 5744 M
[ [(Helvetica) 220.0 0.0 true true 0 ( 120)]
] -73.3 MCshow
1.000 UL
LTb
10311 5964 M
0 63 V
0 3391 R
0 -63 V
stroke
10311 5744 M
[ [(Helvetica) 220.0 0.0 true true 0 ( 160)]
] -73.3 MCshow
1.000 UL
LTb
10898 5964 M
0 63 V
0 3391 R
0 -63 V
stroke
10898 5744 M
[ [(Helvetica) 220.0 0.0 true true 0 ( 200)]
] -73.3 MCshow
1.000 UL
LTb
12363 5964 M
0 63 V
0 3391 R
0 -63 V
stroke
12363 5744 M
[ [(Helvetica) 220.0 0.0 true true 0 ( 300)]
] -73.3 MCshow
1.000 UL
LTb
15294 5964 M
0 63 V
0 3391 R
0 -63 V
stroke
15294 5744 M
[ [(Helvetica) 220.0 0.0 true true 0 ( 500)]
] -73.3 MCshow
1.000 UL
LTb
1.000 UL
LTb
9432 9418 N
0 -3454 V
6009 0 V
0 3454 V
-6009 0 V
Z stroke
LCb setrgbcolor
8794 7691 M
currentpoint gsave translate -270 rotate 0 0 moveto
[ [(Helvetica) 220.0 0.0 true true 0 ( )]
] -73.3 MCshow
grestore
LTb
LCb setrgbcolor
12436 5414 M
[ [(Helvetica) 220.0 0.0 true true 0 (M)]
[(Helvetica) 176.0 -66.0 true true 0 (H)]
[(Helvetica) 220.0 0.0 true true 0 ( \( GeV \))]
] -51.3 MCshow
LTb
12436 9748 M
[ [(Helvetica) 220.0 0.0 true true 0 (tb)]
] -73.3 MCshow
1.000 UP
12917 9073 M
[ [(Times-Roman) 220.0 0.0 true true 0 (LHC HIGGS XS WG 2011)]
] -73.3 MLshow
1.000 UL
LTb
% Begin plot #1
3.000 UL
LT0
LCb setrgbcolor
11544 9245 M
[ [(Helvetica) 220.0 0.0 true true 0 (NNPDF2.1)]
] -73.3 MRshow
LT0
11676 9245 M
591 0 V
9725 7144 M
586 0 V
587 -8 V
1465 -18 V
2931 -35 V
% End plot #1
% Begin plot #2
stroke
LT1
LCb setrgbcolor
11544 9025 M
[ [(Helvetica) 220.0 0.0 true true 0 (CT10)]
] -73.3 MRshow
LT1
11676 9025 M
591 0 V
9725 7494 M
586 -43 V
587 -44 V
1465 -96 V
2931 -132 V
% End plot #2
% Begin plot #3
stroke
LT2
LCb setrgbcolor
11544 8805 M
[ [(Helvetica) 220.0 0.0 true true 0 (MSTW08)]
] -73.3 MRshow
LT2
11676 8805 M
591 0 V
9725 7704 M
586 -9 V
587 -8 V
1465 -27 V
2931 -35 V
% End plot #3
% Begin plot #4
stroke
LT0
LCa setrgbcolor
LCb setrgbcolor
11544 8585 M
[ [(Helvetica) 220.0 0.0 true true 0 (PDF4LHC Average)]
] -73.3 MRshow
LT0
LCa setrgbcolor
11676 8585 M
591 0 V
9725 7448 M
586 -18 V
587 -20 V
1465 -47 V
2931 -67 V
% End plot #4
% Begin plot #5
stroke
LT4
LC4 setrgbcolor
LCb setrgbcolor
11544 8365 M
[ [(Helvetica) 220.0 0.0 true true 0 (HERAPDF1.5)]
] -73.3 MRshow
LT4
LC4 setrgbcolor
11676 8365 M
591 0 V
9725 7608 M
586 0 V
587 0 V
1465 0 V
2931 -18 V
% End plot #5
% Begin plot #6
stroke
LT5
LC7 setrgbcolor
LCb setrgbcolor
11544 8145 M
[ [(Helvetica) 220.0 0.0 true true 0 (GJR08)]
] -73.3 MRshow
LT5
LC7 setrgbcolor
11676 8145 M
591 0 V
9725 6795 M
586 61 V
587 9 V
1465 -175 V
2931 -53 V
% End plot #6
% Begin plot #7
stroke
LT1
LC8 setrgbcolor
LCb setrgbcolor
11544 7925 M
[ [(Helvetica) 220.0 0.0 true true 0 (ABKM09)]
] -73.3 MRshow
LT1
LC8 setrgbcolor
11676 7925 M
591 0 V
9725 7284 M
586 -61 V
587 -35 V
1465 -96 V
2931 -61 V
% End plot #7
% Begin plot #8
stroke
1.000 UL
LT3
LCa setrgbcolor
9432 6051 M
61 0 V
60 0 V
61 0 V
61 0 V
60 0 V
61 0 V
61 0 V
61 0 V
60 0 V
61 0 V
61 0 V
60 0 V
61 0 V
61 0 V
60 0 V
61 0 V
61 0 V
61 0 V
60 0 V
61 0 V
61 0 V
60 0 V
61 0 V
61 0 V
60 0 V
61 0 V
61 0 V
61 0 V
60 0 V
61 0 V
61 0 V
60 0 V
61 0 V
61 0 V
60 0 V
61 0 V
61 0 V
60 0 V
61 0 V
61 0 V
61 0 V
60 0 V
61 0 V
61 0 V
60 0 V
61 0 V
61 0 V
60 0 V
61 0 V
61 0 V
61 0 V
60 0 V
61 0 V
61 0 V
60 0 V
61 0 V
61 0 V
60 0 V
61 0 V
61 0 V
61 0 V
60 0 V
61 0 V
61 0 V
60 0 V
61 0 V
61 0 V
60 0 V
61 0 V
61 0 V
60 0 V
61 0 V
61 0 V
61 0 V
60 0 V
61 0 V
61 0 V
60 0 V
61 0 V
61 0 V
60 0 V
61 0 V
61 0 V
61 0 V
60 0 V
61 0 V
61 0 V
60 0 V
61 0 V
61 0 V
60 0 V
61 0 V
61 0 V
61 0 V
60 0 V
61 0 V
61 0 V
60 0 V
61 0 V
% End plot #8
% Begin plot #9
stroke
LT3
LCa setrgbcolor
9432 7800 M
61 0 V
60 0 V
61 0 V
61 0 V
60 0 V
61 0 V
61 0 V
61 0 V
60 0 V
61 0 V
61 0 V
60 0 V
61 0 V
61 0 V
60 0 V
61 0 V
61 0 V
61 0 V
60 0 V
61 0 V
61 0 V
60 0 V
61 0 V
61 0 V
60 0 V
61 0 V
61 0 V
61 0 V
60 0 V
61 0 V
61 0 V
60 0 V
61 0 V
61 0 V
60 0 V
61 0 V
61 0 V
60 0 V
61 0 V
61 0 V
61 0 V
60 0 V
61 0 V
61 0 V
60 0 V
61 0 V
61 0 V
60 0 V
61 0 V
61 0 V
61 0 V
60 0 V
61 0 V
61 0 V
60 0 V
61 0 V
61 0 V
60 0 V
61 0 V
61 0 V
61 0 V
60 0 V
61 0 V
61 0 V
60 0 V
61 0 V
61 0 V
60 0 V
61 0 V
61 0 V
60 0 V
61 0 V
61 0 V
61 0 V
60 0 V
61 0 V
61 0 V
60 0 V
61 0 V
61 0 V
60 0 V
61 0 V
61 0 V
61 0 V
60 0 V
61 0 V
61 0 V
60 0 V
61 0 V
61 0 V
60 0 V
61 0 V
61 0 V
61 0 V
60 0 V
61 0 V
61 0 V
60 0 V
61 0 V
% End plot #9
stroke
LTb
9432 9418 N
0 -3454 V
6009 0 V
0 3454 V
-6009 0 V
Z stroke
1.000 UP
1.000 UL
LTb
1.000 UL
LTb
5832 1011 M
63 0 V
5947 0 R
-63 0 V
stroke
5700 1011 M
[ [(Helvetica) 220.0 0.0 true true 0 (-1)]
] -73.3 MRshow
1.000 UL
LTb
5832 1886 M
63 0 V
5947 0 R
-63 0 V
stroke
5700 1886 M
[ [(Helvetica) 220.0 0.0 true true 0 ( 0)]
] -73.3 MRshow
1.000 UL
LTb
5832 2761 M
63 0 V
5947 0 R
-63 0 V
stroke
5700 2761 M
[ [(Helvetica) 220.0 0.0 true true 0 ( 1)]
] -73.3 MRshow
1.000 UL
LTb
6125 924 M
0 63 V
0 3392 R
0 -63 V
stroke
6125 704 M
[ [(Helvetica) 220.0 0.0 true true 0 ( 120)]
] -73.3 MCshow
1.000 UL
LTb
6712 924 M
0 63 V
0 3392 R
0 -63 V
stroke
6712 704 M
[ [(Helvetica) 220.0 0.0 true true 0 ( 160)]
] -73.3 MCshow
1.000 UL
LTb
7298 924 M
0 63 V
0 3392 R
0 -63 V
stroke
7298 704 M
[ [(Helvetica) 220.0 0.0 true true 0 ( 200)]
] -73.3 MCshow
1.000 UL
LTb
8764 924 M
0 63 V
0 3392 R
0 -63 V
stroke
8764 704 M
[ [(Helvetica) 220.0 0.0 true true 0 ( 300)]
] -73.3 MCshow
1.000 UL
LTb
11695 924 M
0 63 V
0 3392 R
0 -63 V
stroke
11695 704 M
[ [(Helvetica) 220.0 0.0 true true 0 ( 500)]
] -73.3 MCshow
1.000 UL
LTb
1.000 UL
LTb
5832 4379 N
0 -3455 V
6010 0 V
0 3455 V
-6010 0 V
Z stroke
LCb setrgbcolor
5194 2651 M
currentpoint gsave translate -270 rotate 0 0 moveto
[ [(Helvetica) 220.0 0.0 true true 0 (Correlation with VBF)]
] -73.3 MCshow
grestore
LTb
LCb setrgbcolor
8837 374 M
[ [(Helvetica) 220.0 0.0 true true 0 (M)]
[(Helvetica) 176.0 -66.0 true true 0 (H)]
[(Helvetica) 220.0 0.0 true true 0 ( \( GeV \))]
] -51.3 MCshow
LTb
8837 4709 M
[ [(Helvetica) 220.0 0.0 true true 0 (t\(-> b\)q)]
] -73.3 MCshow
1.000 UP
9318 4034 M
[ [(Times-Roman) 220.0 0.0 true true 0 (LHC HIGGS XS WG 2011)]
] -73.3 MLshow
1.000 UL
LTb
% Begin plot #1
3.000 UL
LT0
LCb setrgbcolor
7944 4206 M
[ [(Helvetica) 220.0 0.0 true true 0 (NNPDF2.1)]
] -73.3 MRshow
LT0
8076 4206 M
591 0 V
6125 1921 M
587 9 V
586 0 V
1466 -18 V
2931 -17 V
% End plot #1
% Begin plot #2
stroke
LT1
LCb setrgbcolor
7944 3986 M
[ [(Helvetica) 220.0 0.0 true true 0 (CT10)]
] -73.3 MRshow
LT1
8076 3986 M
591 0 V
6125 1667 M
587 -35 V
586 -26 V
1466 -61 V
2931 -79 V
% End plot #2
% Begin plot #3
stroke
LT2
LCb setrgbcolor
7944 3766 M
[ [(Helvetica) 220.0 0.0 true true 0 (MSTW08)]
] -73.3 MRshow
LT2
8076 3766 M
591 0 V
6125 1834 M
587 0 V
586 -9 V
1466 -18 V
2931 -52 V
% End plot #3
% Begin plot #4
stroke
LT0
LCa setrgbcolor
LCb setrgbcolor
7944 3546 M
[ [(Helvetica) 220.0 0.0 true true 0 (PDF4LHC Average)]
] -73.3 MRshow
LT0
LCa setrgbcolor
8076 3546 M
591 0 V
6125 1807 M
587 -8 V
586 -12 V
1466 -32 V
2931 -50 V
% End plot #4
% Begin plot #5
stroke
LT4
LC4 setrgbcolor
LCb setrgbcolor
7944 3326 M
[ [(Helvetica) 220.0 0.0 true true 0 (HERAPDF1.5)]
] -73.3 MRshow
LT4
LC4 setrgbcolor
8076 3326 M
591 0 V
6125 1781 M
587 9 V
586 0 V
1466 0 V
2931 0 V
% End plot #5
% Begin plot #6
stroke
LT5
LC7 setrgbcolor
LCb setrgbcolor
7944 3106 M
[ [(Helvetica) 220.0 0.0 true true 0 (GJR08)]
] -73.3 MRshow
LT5
LC7 setrgbcolor
8076 3106 M
591 0 V
6125 1877 M
587 -175 V
586 123 V
8764 1580 L
2931 -157 V
% End plot #6
% Begin plot #7
stroke
LT1
LC8 setrgbcolor
LCb setrgbcolor
7944 2886 M
[ [(Helvetica) 220.0 0.0 true true 0 (ABKM09)]
] -73.3 MRshow
LT1
LC8 setrgbcolor
8076 2886 M
591 0 V
6125 1851 M
587 -17 V
586 -35 V
1466 -27 V
2931 -52 V
% End plot #7
% Begin plot #8
stroke
1.000 UL
LT3
LCa setrgbcolor
5832 1011 M
61 0 V
60 0 V
61 0 V
61 0 V
61 0 V
60 0 V
61 0 V
61 0 V
60 0 V
61 0 V
61 0 V
60 0 V
61 0 V
61 0 V
61 0 V
60 0 V
61 0 V
61 0 V
60 0 V
61 0 V
61 0 V
61 0 V
60 0 V
61 0 V
61 0 V
60 0 V
61 0 V
61 0 V
61 0 V
60 0 V
61 0 V
61 0 V
60 0 V
61 0 V
61 0 V
60 0 V
61 0 V
61 0 V
61 0 V
60 0 V
61 0 V
61 0 V
60 0 V
61 0 V
61 0 V
61 0 V
60 0 V
61 0 V
61 0 V
60 0 V
61 0 V
61 0 V
60 0 V
61 0 V
61 0 V
61 0 V
60 0 V
61 0 V
61 0 V
60 0 V
61 0 V
61 0 V
61 0 V
60 0 V
61 0 V
61 0 V
60 0 V
61 0 V
61 0 V
60 0 V
61 0 V
61 0 V
61 0 V
60 0 V
61 0 V
61 0 V
60 0 V
61 0 V
61 0 V
61 0 V
60 0 V
61 0 V
61 0 V
60 0 V
61 0 V
61 0 V
61 0 V
60 0 V
61 0 V
61 0 V
60 0 V
61 0 V
61 0 V
60 0 V
61 0 V
61 0 V
61 0 V
60 0 V
61 0 V
% End plot #8
% Begin plot #9
stroke
LT3
LCa setrgbcolor
5832 2761 M
61 0 V
60 0 V
61 0 V
61 0 V
61 0 V
60 0 V
61 0 V
61 0 V
60 0 V
61 0 V
61 0 V
60 0 V
61 0 V
61 0 V
61 0 V
60 0 V
61 0 V
61 0 V
60 0 V
61 0 V
61 0 V
61 0 V
60 0 V
61 0 V
61 0 V
60 0 V
61 0 V
61 0 V
61 0 V
60 0 V
61 0 V
61 0 V
60 0 V
61 0 V
61 0 V
60 0 V
61 0 V
61 0 V
61 0 V
60 0 V
61 0 V
61 0 V
60 0 V
61 0 V
61 0 V
61 0 V
60 0 V
61 0 V
61 0 V
60 0 V
61 0 V
61 0 V
60 0 V
61 0 V
61 0 V
61 0 V
60 0 V
61 0 V
61 0 V
60 0 V
61 0 V
61 0 V
61 0 V
60 0 V
61 0 V
61 0 V
60 0 V
61 0 V
61 0 V
60 0 V
61 0 V
61 0 V
61 0 V
60 0 V
61 0 V
61 0 V
60 0 V
61 0 V
61 0 V
61 0 V
60 0 V
61 0 V
61 0 V
60 0 V
61 0 V
61 0 V
61 0 V
60 0 V
61 0 V
61 0 V
60 0 V
61 0 V
61 0 V
60 0 V
61 0 V
61 0 V
61 0 V
60 0 V
61 0 V
% End plot #9
stroke
LTb
5832 4379 N
0 -3455 V
6010 0 V
0 3455 V
-6010 0 V
Z stroke
1.000 UP
1.000 UL
LTb
stroke
grestore
end
showpage
%%Trailer
%%DocumentFonts: Times-Roman Symbol Helvetica
