%!PS-Adobe-2.0 EPSF-2.0
%%BoundingBox:  0 0 567 539
%%Title: compare.out/figures/dy_H.eps: 
%%Creator: ROOT Version 5.18/00b
%%CreationDate: Sun Nov 13 22:41:16 2011
%%EndComments
%%BeginProlog
80 dict begin
/s {stroke} def /l {lineto} def /m {moveto} def /t {translate} def
/sw {stringwidth} def /r {rotate} def /rl {roll}  def /R {repeat} def
/d {rlineto} def /rm {rmoveto} def /gr {grestore} def /f {eofill} def
/c {setrgbcolor} def /black {0 setgray} def /sd {setdash} def
/cl {closepath} def /sf {scalefont setfont} def /lw {setlinewidth} def
/box {m dup 0 exch d exch 0 d 0 exch neg d cl} def
/NC{systemdict begin initclip end}def/C{NC box clip newpath}def
/bl {box s} def /bf {box f} def /Y { 0 exch d} def /X { 0 d} def 
/mp {newpath /y exch def /x exch def} def
/side {[w .77 mul w .23 mul] .385 w mul sd w 0 l currentpoint t -144 r} def
/mr {mp x y w2 0 360 arc} def /m24 {mr s} def /m20 {mr f} def
/mb {mp x y w2 add m w2 neg 0 d 0 w neg d w 0 d 0 w d cl} def
/mt {mp x y w2 add m w2 neg w neg d w 0 d cl} def
/m21 {mb f} def /m25 {mb s} def /m22 {mt f} def /m26{mt s} def
/m23 {mp x y w2 sub m w2 w d w neg 0 d cl f} def
/m27 {mp x y w2 add m w3 neg w2 neg d w3 w2 neg d w3 w2 d cl s} def
/m28 {mp x w2 sub y w2 sub w3 add m w3 0 d  0 w3 neg d w3 0 d 0 w3 d w3 0 d  0 w3 d w3 neg 0 d 0 w3 d w3 neg 0 d
 0 w3 neg d w3 neg 0 d cl s } def
/m29 {mp gsave x w2 sub y w2 add w3 sub m currentpoint t
 4 {side} repeat cl fill gr} def
/m30 {mp gsave x w2 sub y w2 add w3 sub m currentpoint t
 4 {side} repeat cl s gr} def
/m31 {mp x y w2 sub m 0 w d x w2 sub y m w 0 d x w2 sub y w2 add m w w neg d x w2 sub y w2
 sub m w w d s} def
/m2 {mp x y w2 sub m 0 w d x w2 sub y m w 0 d s} def
/m5 {mp x w2 sub y w2 sub m w w d x w2 sub y w2 add m w w neg d s} def
/reencdict 24 dict def /ReEncode {reencdict begin /nco&na exch def
/nfnam exch def /basefontname exch def /basefontdict basefontname findfont def
/newfont basefontdict maxlength dict def basefontdict {exch dup /FID ne
{dup /Encoding eq {exch dup length array copy newfont 3 1 roll put} {exch 
newfont 3 1 roll put} ifelse} {pop pop} ifelse } forall newfont
/FontName nfnam put nco&na aload pop nco&na length 2 idiv {newfont
/Encoding get 3 1 roll put} repeat nfnam newfont definefont pop end } def
/accvec [ 176 /agrave 181 /Agrave 190 /acircumflex 192 /Acircumflex
201 /adieresis 204 /Adieresis 209 /ccedilla 210 /Ccedilla 211 /eacute
212 /Eacute 213 /egrave 214 /Egrave 215 /ecircumflex 216 /Ecircumflex
217 /edieresis 218 /Edieresis 219 /icircumflex 220 /Icircumflex
221 /idieresis 222 /Idieresis 223 /ntilde 224 /Ntilde 226 /ocircumflex
228 /Ocircumflex 230 /Odieresis 231 /ucircumflex 236 /Ucircumflex
237 /udieresis 238 /Udieresis 239 /aring 240 /odieresis 242 /Aring 243 /ydieresis
244 /Ydieresis 246 /aacute 247 /Aacute 252 /ugrave 253 /Ugrave
127 /atilde 128 /Atilde 129 /oacute 130 /Oacute 131 /iacute
132 /Iacute 133 /igrave 134 /Igrave 135 /otilde 136 /Otilde
137 /uacute 138 /Uacute] def
/Times-Roman /Times-Roman accvec ReEncode
/Times-Italic /Times-Italic accvec ReEncode
/Times-Bold /Times-Bold accvec ReEncode
/Times-BoldItalic /Times-BoldItalic accvec ReEncode
/Helvetica /Helvetica accvec ReEncode
/Helvetica-Oblique /Helvetica-Oblique accvec ReEncode
/Helvetica-Bold /Helvetica-Bold accvec ReEncode
/Helvetica-BoldOblique /Helvetica-BoldOblique  accvec ReEncode
/Courier /Courier accvec ReEncode
/Courier-Oblique /Courier-Oblique accvec ReEncode
/Courier-Bold /Courier-Bold accvec ReEncode
/Courier-BoldOblique /Courier-BoldOblique accvec ReEncode
/oshow {gsave [] 0 sd true charpath stroke gr} def
/stwn { /fs exch def /fn exch def /text exch def fn findfont fs sf
 text sw pop xs add /xs exch def} def
/stwb { /fs exch def /fn exch def /nbas exch def /textf exch deftextf length /tlen exch def nbas tlen gt {/nbas tlendef} iffn findfont fs sf textf dup length nbas sub nbas getinterval sw
pop neg xs add /xs exch def} def
/accspe [ 65 /plusminus  66 /bar  67 /existential  68 /universal 
69 /exclam  70 /numbersign 71 /greater  72 /question  73 /integral 
74 /colon  75 /semicolon  76 /less  77 /bracketleft  78 /bracketright
79 /greaterequal 80 /braceleft 81 /braceright 82 /radical
83 /spade 84 /heart 85 /diamond 86 /club 87 /lessequal
88 /multiply 89 /percent 90 /infinity 48 /circlemultiply 49 /circleplus
50 /emptyset  51 /lozenge 52 /bullet 53 /arrowright 54 /arrowup
55 /arrowleft 56 /arrowdown 57 /arrowboth 48 /degree 44 /comma 43 /plus 45 /angle 42 /angleleft 47 /divide 61 /notequal 40 /equivalence 41 /second 97 /approxequal 98 /congruent 99 /perpendicular 100 /partialdiff 101 /florin 102 /intersection
 103 /union 104 /propersuperset 105 /reflexsuperset 106 /notsubset 107 /propersubset 108 /reflexsubset 109 /element 110 /notelement 111 /gradient 112 /logicaland 113 /logicalor 114 /arrowdblboth 115 /arrowdblleft 116 /arrowdblup 117 /arrowdblright
 118 /arrowdbldown 119 /ampersand 120 /omega1 121 /similar 122 /aleph ] def
/Symbol /Special accspe ReEncode
%%EndProlog
%%BeginSetup
%%EndSetup
newpath  gsave  .25 .25 scale  gsave  0 0 t black[  ] 0 sd 0 lw 1 1 1 c black 3 lw 0.999 0.999 0.999 c black 1814 1726 227 216 bl 0.999 0.999 0.999 c black 1814 1726 227 216 bl 0 lw 227 216 m 1814 X s 227 216 m 1726 Y s 6 lw 281 1787 m 88 X s
 gsave  2268 2158 0 0 C 393 1765 t 0 r /Helvetica findfont 50.2921 sf 0 0 m (LO - MSSM) show NC gr  0.999 0.999 0.999 c black 227 216 m 272 X 4 Y 91 X 48 Y 90 X 171 Y 91 X 328 Y 91 X 427 Y 90 X 400 Y 91 X 238 Y 91 X -1 Y 91 X -237 Y 90 X -400 Y 91 X
 -427 Y 91 X -329 Y 90 X -170 Y 91 X -48 Y 91 X -4 Y 272 X s 0 1 0 c[ 4 8] 0 sd 9 lw 281 1718 m 88 X s black
 gsave  2268 2158 0 0 C 393 1696 t 0 r /Helvetica findfont 50.2921 sf 0 0 m (NLO - MSSM) show NC gr  0 1 0 c 0.999 0.999 0.999 c black 0 1 0 c 227 216 m 272 X 4 Y 91 X 45 Y 90 X 153 Y 91 X 303 Y 91 X 392 Y 90 X 358 Y 91 X 213 Y 91 X -2 Y 91 X -196 Y
 90 X -372 Y 91 X -389 Y 91 X -303 Y 90 X -157 Y 91 X -45 Y 91 X -4 Y 272 X s 1 0 1 c[ 20 12 4 12] 0 sd 281 1649 m 88 X s black
 gsave  2268 2158 0 0 C 882 1618 t 0 r /Helvetica findfont 36.5761 sf 0 0 m (A) show NC gr 
 gsave  2268 2158 0 0 C 393 1641 t 0 r /Helvetica findfont 50.2921 sf 0 0 m (NLO - rescaled SM, S) show NC gr  1 0 1 c 0.999 0.999 0.999 c black 1 0 1 c 227 216 m 272 X 4 Y 91 X 45 Y 90 X 157 Y 91 X 305 Y 91 X 397 Y 90 X 359 Y 91 X 223 Y 182 X -208
 Y 90 X -381 Y 91 X -389 Y 91 X -304 Y 90 X -160 Y 91 X -44 Y 91 X -4 Y 272 X s 1 0 0 c[ 12 12] 0 sd 281 1580 m 88 X s black
 gsave  2268 2158 0 0 C 882 1550 t 0 r /Helvetica findfont 36.5761 sf 0 0 m (Z) show NC gr 
 gsave  2268 2158 0 0 C 393 1573 t 0 r /Helvetica findfont 50.2921 sf 0 0 m (NLO - rescaled SM, S) show NC gr  1 0 0 c 0.999 0.999 0.999 c black 1 0 0 c 227 216 m 272 X 4 Y 91 X 45 Y 90 X 158 Y 91 X 307 Y 91 X 399 Y 90 X 361 Y 91 X 225 Y 91 X -1 Y
 91 X -209 Y 90 X -383 Y 91 X -391 Y 91 X -306 Y 90 X -160 Y 91 X -45 Y 91 X -4 Y 272 X s black[  ] 0 sd 0 lw 227 216 m 1726 Y s
 gsave  2268 2158 0 0 C 105 1843 t 90 r /Helvetica findfont 68.5801 sf 0 0 m (\(fb\)) show NC gr 
 gsave  2268 2158 0 0 C 73 1811 t 90 r /Helvetica findfont 45.7201 sf 0 0 m (H) show NC gr 
 gsave  2268 2158 0 0 C 105 1715 t 90 r /Helvetica findfont 68.5801 sf 0 0 m (/dy) show NC gr 
 gsave  2268 2158 0 0 C 105 1673 t 90 r /Symbol findfont 68.5801 sf 0 0 m (s) show NC gr 
 gsave  2268 2158 0 0 C 105 1618 t 90 r /Helvetica findfont 68.5801 sf 0 0 m (d ) show NC gr  281 216 m -54 X s 254 250 m -27 X s 254 285 m -27 X s 254 319 m -27 X s 254 354 m -27 X s 281 388 m -54 X s 254 423 m -27 X s 254 457 m -27 X s 254 492 m
 -27 X s 254 527 m -27 X s 281 561 m -54 X s 254 596 m -27 X s 254 630 m -27 X s 254 665 m -27 X s 254 699 m -27 X s 281 734 m -54 X s 254 768 m -27 X s 254 803 m -27 X s 254 837 m -27 X s 254 872 m -27 X s 281 906 m -54 X s 254 941 m -27 X s 254
 975 m -27 X s 254 1010 m -27 X s 254 1044 m -27 X s 281 1079 m -54 X s 254 1114 m -27 X s 254 1148 m -27 X s 254 1183 m -27 X s 254 1217 m -27 X s 281 1252 m -54 X s 254 1286 m -27 X s 254 1321 m -27 X s 254 1355 m -27 X s 254 1390 m -27 X s 281
 1424 m -54 X s 254 1459 m -27 X s 254 1493 m -27 X s 254 1528 m -27 X s 254 1562 m -27 X s 281 1597 m -54 X s 254 1631 m -27 X s 254 1666 m -27 X s 254 1700 m -27 X s 254 1735 m -27 X s 281 1770 m -54 X s 254 1804 m -27 X s 254 1839 m -27 X s 254
 1873 m -27 X s 254 1908 m -27 X s 281 1942 m -54 X s
 gsave  2268 2158 0 0 C 183 201 t 0 r /Helvetica findfont 41.1481 sf 0 0 m (0) show NC gr 
 gsave  2268 2158 0 0 C 160 370 t 0 r /Helvetica findfont 41.1481 sf 0 0 m (10) show NC gr 
 gsave  2268 2158 0 0 C 160 544 t 0 r /Helvetica findfont 41.1481 sf 0 0 m (20) show NC gr 
 gsave  2268 2158 0 0 C 160 718 t 0 r /Helvetica findfont 41.1481 sf 0 0 m (30) show NC gr 
 gsave  2268 2158 0 0 C 160 892 t 0 r /Helvetica findfont 41.1481 sf 0 0 m (40) show NC gr 
 gsave  2268 2158 0 0 C 160 1061 t 0 r /Helvetica findfont 41.1481 sf 0 0 m (50) show NC gr 
 gsave  2268 2158 0 0 C 160 1234 t 0 r /Helvetica findfont 41.1481 sf 0 0 m (60) show NC gr 
 gsave  2268 2158 0 0 C 160 1408 t 0 r /Helvetica findfont 41.1481 sf 0 0 m (70) show NC gr 
 gsave  2268 2158 0 0 C 160 1582 t 0 r /Helvetica findfont 41.1481 sf 0 0 m (80) show NC gr 
 gsave  2268 2158 0 0 C 160 1756 t 0 r /Helvetica findfont 41.1481 sf 0 0 m (90) show NC gr 
 gsave  2268 2158 0 0 C 137 1925 t 0 r /Helvetica findfont 41.1481 sf 0 0 m (100) show NC gr  2041 216 m 1726 Y s 1987 216 m 54 X s 2014 250 m 27 X s 2014 285 m 27 X s 2014 319 m 27 X s 2014 354 m 27 X s 1987 388 m 54 X s 2014 423 m 27 X s 2014 457
 m 27 X s 2014 492 m 27 X s 2014 527 m 27 X s 1987 561 m 54 X s 2014 596 m 27 X s 2014 630 m 27 X s 2014 665 m 27 X s 2014 699 m 27 X s 1987 734 m 54 X s 2014 768 m 27 X s 2014 803 m 27 X s 2014 837 m 27 X s 2014 872 m 27 X s 1987 906 m 54 X s 2014
 941 m 27 X s 2014 975 m 27 X s 2014 1010 m 27 X s 2014 1044 m 27 X s 1987 1079 m 54 X s 2014 1114 m 27 X s 2014 1148 m 27 X s 2014 1183 m 27 X s 2014 1217 m 27 X s 1987 1252 m 54 X s 2014 1286 m 27 X s 2014 1321 m 27 X s 2014 1355 m 27 X s 2014
 1390 m 27 X s 1987 1424 m 54 X s 2014 1459 m 27 X s 2014 1493 m 27 X s 2014 1528 m 27 X s 2014 1562 m 27 X s 1987 1597 m 54 X s 2014 1631 m 27 X s 2014 1666 m 27 X s 2014 1700 m 27 X s 2014 1735 m 27 X s 1987 1770 m 54 X s 2014 1804 m 27 X s 2014
 1839 m 27 X s 2014 1873 m 27 X s 2014 1908 m 27 X s 1987 1942 m 54 X s 227 1942 m 1814 X s 227 1890 m 52 Y s 263 1916 m 26 Y s 299 1916 m 26 Y s 336 1916 m 26 Y s 372 1916 m 26 Y s 408 1890 m 52 Y s 444 1916 m 26 Y s 481 1916 m 26 Y s 517 1916 m 26
 Y s 553 1916 m 26 Y s 590 1890 m 52 Y s 626 1916 m 26 Y s 662 1916 m 26 Y s 698 1916 m 26 Y s 735 1916 m 26 Y s 771 1890 m 52 Y s 807 1916 m 26 Y s 844 1916 m 26 Y s 880 1916 m 26 Y s 916 1916 m 26 Y s 952 1890 m 52 Y s 989 1916 m 26 Y s 1025 1916
 m 26 Y s 1061 1916 m 26 Y s 1098 1916 m 26 Y s 1134 1890 m 52 Y s 1170 1916 m 26 Y s 1206 1916 m 26 Y s 1243 1916 m 26 Y s 1279 1916 m 26 Y s 1315 1890 m 52 Y s 1352 1916 m 26 Y s 1388 1916 m 26 Y s 1424 1916 m 26 Y s 1460 1916 m 26 Y s 1497 1890 m
 52 Y s 1533 1916 m 26 Y s 1569 1916 m 26 Y s 1606 1916 m 26 Y s 1642 1916 m 26 Y s 1678 1890 m 52 Y s 1714 1916 m 26 Y s 1751 1916 m 26 Y s 1787 1916 m 26 Y s 1823 1916 m 26 Y s 1860 1890 m 52 Y s 1896 1916 m 26 Y s 1932 1916 m 26 Y s 1968 1916 m
 26 Y s 2005 1916 m 26 Y s 2041 1890 m 52 Y s 227 216 m 1814 X s
 gsave  2268 2158 0 0 C 2003 73 t 0 r /Helvetica findfont 54.8641 sf 0 0 m (H) show NC gr 
 gsave  2268 2158 0 0 C 1961 46 t 0 r /Helvetica findfont 82.2962 sf 0 0 m (y) show NC gr  227 268 m -52 Y s 263 242 m -26 Y s 299 242 m -26 Y s 336 242 m -26 Y s 372 242 m -26 Y s 408 268 m -52 Y s 444 242 m -26 Y s 481 242 m -26 Y s 517 242 m -26
 Y s 553 242 m -26 Y s 590 268 m -52 Y s 626 242 m -26 Y s 662 242 m -26 Y s 698 242 m -26 Y s 735 242 m -26 Y s 771 268 m -52 Y s 807 242 m -26 Y s 844 242 m -26 Y s 880 242 m -26 Y s 916 242 m -26 Y s 952 268 m -52 Y s 989 242 m -26 Y s 1025 242 m
 -26 Y s 1061 242 m -26 Y s 1098 242 m -26 Y s 1134 268 m -52 Y s 1170 242 m -26 Y s 1206 242 m -26 Y s 1243 242 m -26 Y s 1279 242 m -26 Y s 1315 268 m -52 Y s 1352 242 m -26 Y s 1388 242 m -26 Y s 1424 242 m -26 Y s 1460 242 m -26 Y s 1497 268 m
 -52 Y s 1533 242 m -26 Y s 1569 242 m -26 Y s 1606 242 m -26 Y s 1642 242 m -26 Y s 1678 268 m -52 Y s 1714 242 m -26 Y s 1751 242 m -26 Y s 1787 242 m -26 Y s 1823 242 m -26 Y s 1860 268 m -52 Y s 1896 242 m -26 Y s 1932 242 m -26 Y s 1968 242 m
 -26 Y s 2005 242 m -26 Y s 2041 268 m -52 Y s
 gsave  2268 2158 0 0 C 206 169 t 0 r /Helvetica findfont 41.1481 sf 0 0 m (-5) show NC gr 
 gsave  2268 2158 0 0 C 389 169 t 0 r /Helvetica findfont 41.1481 sf 0 0 m (-4) show NC gr 
 gsave  2268 2158 0 0 C 567 169 t 0 r /Helvetica findfont 41.1481 sf 0 0 m (-3) show NC gr 
 gsave  2268 2158 0 0 C 750 169 t 0 r /Helvetica findfont 41.1481 sf 0 0 m (-2) show NC gr 
 gsave  2268 2158 0 0 C 933 169 t 0 r /Helvetica findfont 41.1481 sf 0 0 m (-1) show NC gr 
 gsave  2268 2158 0 0 C 1120 169 t 0 r /Helvetica findfont 41.1481 sf 0 0 m (0) show NC gr 
 gsave  2268 2158 0 0 C 1303 169 t 0 r /Helvetica findfont 41.1481 sf 0 0 m (1) show NC gr 
 gsave  2268 2158 0 0 C 1481 169 t 0 r /Helvetica findfont 41.1481 sf 0 0 m (2) show NC gr 
 gsave  2268 2158 0 0 C 1664 169 t 0 r /Helvetica findfont 41.1481 sf 0 0 m (3) show NC gr 
 gsave  2268 2158 0 0 C 1843 169 t 0 r /Helvetica findfont 41.1481 sf 0 0 m (4) show NC gr 
 gsave  2268 2158 0 0 C 2025 169 t 0 r /Helvetica findfont 41.1481 sf 0 0 m (5) show NC gr 
 gr  gr 
showpage
end
%%EOF
