%!PS-Adobe-1.0
%%Creator: Unified Graphics System
%%Pages: (atend)
%%DocumentFonts: Helvetica
%%BoundingBox:   78   72  546  394
%%EndComments
/Sw{setlinewidth}def
/Sg{setgray}def
/Sd{setdash}def
/P {newpath
    moveto
0 0 rlineto
    stroke}def
/M {moveto}def
/D {lineto}def
/N {newpath}def
/S {stroke}def
/T {/Helvetica findfont
    exch
    scalefont
    setfont}def
/R {rotate}def
/W {show}def
/F {fill}def
/X {gsave}def
/Y {grestore}def
%%EndProlog
%%Page: 1 1
0.12000 0.12000 scale
1 setlinecap
1 setlinejoin
10 Sw
0.00 0.00 0.00 setrgbcolor
[] 0 Sd
N
2591 739 M
2591 639 D
S
N
2595 739 M
2595 639 D
S
N
2595 724 M
2605 734 D
2614 739 D
2624 739 D
2638 734 D
2648 724 D
2652 710 D
2652 700 D
2648 686 D
2638 677 D
2624 672 D
2614 672 D
2605 677 D
2595 686 D
S
N
2624 739 M
2633 734 D
2643 724 D
2648 710 D
2648 700 D
2643 686 D
2633 677 D
2624 672 D
S
N
2576 739 M
2595 739 D
S
N
2576 639 M
2610 639 D
S
N
2702 700 M
2702 634 D
S
N
2705 700 M
2705 634 D
S
N
2683 700 M
2679 681 D
2679 700 D
2727 700 D
2727 681 D
2724 700 D
S
N
2692 634 M
2714 634 D
S
N
2689 815 M
2689 748 D
S
N
2692 815 M
2692 748 D
S
N
2730 815 M
2730 748 D
S
N
2733 815 M
2733 748 D
S
N
2679 815 M
2702 815 D
S
N
2721 815 M
2743 815 D
S
N
2692 783 M
2730 783 D
S
N
2679 748 M
2702 748 D
S
N
2721 748 M
2743 748 D
S
N
2884 791 M
2874 781 D
2865 767 D
2855 748 D
2851 724 D
2851 705 D
2855 681 D
2865 662 D
2874 648 D
2884 639 D
S
N
2874 781 M
2865 762 D
2860 748 D
2855 724 D
2855 705 D
2860 681 D
2865 667 D
2874 648 D
S
N
2979 758 M
2984 743 D
2984 772 D
2979 758 D
2970 767 D
2955 772 D
2946 772 D
2932 767 D
2922 758 D
2917 748 D
2913 734 D
2913 710 D
2917 696 D
2922 686 D
2932 677 D
2946 672 D
2955 672 D
2970 677 D
2979 686 D
S
N
2946 772 M
2936 767 D
2927 758 D
2922 748 D
2917 734 D
2917 710 D
2922 696 D
2927 686 D
2936 677 D
2946 672 D
S
N
2979 710 M
2979 672 D
S
N
2984 710 M
2984 672 D
S
N
2965 710 M
2998 710 D
S
N
3027 710 M
3084 710 D
3084 720 D
3079 729 D
3074 734 D
3065 739 D
3050 739 D
3036 734 D
3027 724 D
3022 710 D
3022 700 D
3027 686 D
3036 677 D
3050 672 D
3060 672 D
3074 677 D
3084 686 D
S
N
3079 710 M
3079 724 D
3074 734 D
S
N
3050 739 M
3041 734 D
3031 724 D
3027 710 D
3027 700 D
3031 686 D
3041 677 D
3050 672 D
S
N
3112 772 M
3146 672 D
S
N
3117 772 M
3146 686 D
S
N
3179 772 M
3146 672 D
S
N
3103 772 M
3131 772 D
S
N
3160 772 M
3188 772 D
S
N
3207 791 M
3217 781 D
3227 767 D
3236 748 D
3241 724 D
3241 705 D
3236 681 D
3227 662 D
3217 648 D
3207 639 D
S
N
3217 781 M
3227 762 D
3231 748 D
3236 724 D
3236 705 D
3231 681 D
3227 667 D
3217 648 D
S
N
727 1393 M
827 1393 D
S
N
727 1398 M
827 1398 D
S
N
774 1393 M
765 1384 D
760 1374 D
760 1365 D
765 1350 D
774 1341 D
788 1336 D
798 1336 D
812 1341 D
822 1350 D
827 1365 D
827 1374 D
822 1384 D
812 1393 D
S
N
760 1365 M
765 1355 D
774 1345 D
788 1341 D
798 1341 D
812 1345 D
822 1355 D
827 1365 D
S
N
727 1379 M
727 1398 D
S
N
827 1393 M
827 1412 D
S
N
760 1512 M
760 1464 D
765 1450 D
779 1441 D
793 1436 D
807 1436 D
817 1441 D
822 1445 D
827 1455 D
827 1464 D
822 1479 D
807 1488 D
793 1493 D
779 1493 D
769 1488 D
765 1483 D
760 1474 D
S
N
760 1464 M
765 1455 D
779 1445 D
793 1441 D
812 1441 D
822 1445 D
S
N
827 1464 M
822 1474 D
807 1483 D
793 1488 D
774 1488 D
765 1483 D
S
N
765 1483 M
765 1512 D
S
N
708 1617 M
860 1531 D
S
N
727 1698 M
827 1698 D
S
N
727 1702 M
827 1702 D
S
N
774 1698 M
765 1688 D
760 1679 D
760 1669 D
765 1655 D
774 1645 D
788 1640 D
798 1640 D
812 1645 D
822 1655 D
827 1669 D
827 1679 D
822 1688 D
812 1698 D
S
N
760 1669 M
765 1659 D
774 1650 D
788 1645 D
798 1645 D
812 1650 D
822 1659 D
827 1669 D
S
N
727 1683 M
727 1702 D
S
N
827 1698 M
827 1717 D
S
N
760 1750 M
860 1750 D
S
N
760 1755 M
860 1755 D
S
N
774 1755 M
765 1764 D
760 1774 D
760 1783 D
765 1797 D
774 1807 D
788 1812 D
798 1812 D
812 1807 D
822 1797 D
827 1783 D
827 1774 D
822 1764 D
812 1755 D
S
N
760 1783 M
765 1793 D
774 1802 D
788 1807 D
798 1807 D
812 1802 D
822 1793 D
827 1783 D
S
N
760 1736 M
760 1755 D
S
N
860 1736 M
860 1769 D
S
N
798 1861 M
865 1861 D
S
N
798 1864 M
865 1864 D
S
N
798 1842 M
817 1839 D
798 1839 D
798 1886 D
817 1886 D
798 1883 D
S
N
865 1851 M
865 1874 D
S
N
684 1848 M
750 1848 D
S
N
684 1851 M
750 1851 D
S
N
684 1889 M
750 1889 D
S
N
684 1893 M
750 1893 D
S
N
684 1839 M
684 1861 D
S
N
684 1880 M
684 1902 D
S
N
715 1851 M
715 1889 D
S
N
750 1839 M
750 1861 D
S
N
750 1880 M
750 1902 D
S
N
708 2043 M
717 2034 D
731 2024 D
750 2015 D
774 2010 D
793 2010 D
817 2015 D
836 2024 D
850 2034 D
860 2043 D
S
N
717 2034 M
736 2024 D
750 2019 D
774 2015 D
793 2015 D
817 2019 D
831 2024 D
850 2034 D
S
N
760 2081 M
860 2081 D
S
N
760 2086 M
860 2086 D
S
N
774 2086 M
765 2096 D
760 2105 D
760 2115 D
765 2129 D
774 2138 D
788 2143 D
798 2143 D
812 2138 D
822 2129 D
827 2115 D
827 2105 D
822 2096 D
812 2086 D
S
N
760 2115 M
765 2124 D
774 2134 D
788 2138 D
798 2138 D
812 2134 D
822 2124 D
827 2115 D
S
N
760 2067 M
760 2086 D
S
N
860 2067 M
860 2100 D
S
N
727 2181 M
827 2181 D
S
N
727 2186 M
827 2186 D
S
N
774 2186 M
765 2196 D
760 2205 D
760 2215 D
765 2229 D
774 2238 D
788 2243 D
798 2243 D
812 2238 D
822 2229 D
827 2215 D
827 2205 D
822 2196 D
812 2186 D
S
N
760 2215 M
765 2224 D
774 2234 D
788 2238 D
798 2238 D
812 2234 D
822 2224 D
827 2215 D
S
N
727 2167 M
727 2186 D
S
N
708 2352 M
860 2267 D
S
N
741 2443 M
755 2448 D
727 2448 D
741 2443 D
731 2433 D
727 2419 D
727 2410 D
731 2395 D
741 2386 D
750 2381 D
765 2376 D
788 2376 D
803 2381 D
812 2386 D
822 2395 D
827 2410 D
827 2419 D
822 2433 D
812 2443 D
S
N
727 2410 M
731 2400 D
741 2391 D
750 2386 D
765 2381 D
788 2381 D
803 2386 D
812 2391 D
822 2400 D
827 2410 D
S
N
788 2443 M
827 2443 D
S
N
788 2448 M
827 2448 D
S
N
788 2429 M
788 2462 D
S
N
788 2490 M
788 2548 D
779 2548 D
769 2543 D
765 2538 D
760 2529 D
760 2514 D
765 2500 D
774 2490 D
788 2486 D
798 2486 D
812 2490 D
822 2500 D
827 2514 D
827 2524 D
822 2538 D
812 2548 D
S
N
788 2543 M
774 2543 D
765 2538 D
S
N
760 2514 M
765 2505 D
774 2495 D
788 2490 D
798 2490 D
812 2495 D
822 2505 D
827 2514 D
S
N
727 2576 M
827 2609 D
S
N
727 2581 M
812 2609 D
S
N
727 2643 M
827 2609 D
S
N
727 2567 M
727 2595 D
S
N
727 2624 M
727 2652 D
S
N
708 2671 M
717 2681 D
731 2690 D
750 2700 D
774 2705 D
793 2705 D
817 2700 D
836 2690 D
850 2681 D
860 2671 D
S
N
717 2681 M
736 2690 D
750 2695 D
774 2700 D
793 2700 D
817 2695 D
831 2690 D
850 2681 D
S
N
1414 3262 M
1414 1051 D
S
N
1414 1051 M
4413 1051 D
S
N
4413 1051 M
4413 3262 D
S
N
4413 3262 M
1414 3262 D
S
N
1414 1051 M
4413 1051 D
S
N
1414 1051 M
1414 1103 D
S
N
1564 1068 M
1564 1051 D
S
N
1714 1051 M
1714 1068 D
S
N
1864 1068 M
1864 1051 D
S
N
2014 1051 M
2014 1068 D
S
N
2164 1103 M
2164 1051 D
S
N
2314 1051 M
2314 1068 D
S
N
2464 1068 M
2464 1051 D
S
N
2613 1051 M
2613 1068 D
S
N
2763 1068 M
2763 1051 D
S
N
2913 1051 M
2913 1103 D
S
N
3063 1068 M
3063 1051 D
S
N
3213 1051 M
3213 1068 D
S
N
3363 1068 M
3363 1051 D
S
N
3513 1051 M
3513 1068 D
S
N
3663 1103 M
3663 1051 D
S
N
3813 1051 M
3813 1068 D
S
N
3963 1068 M
3963 1051 D
S
N
4113 1051 M
4113 1068 D
S
N
4263 1068 M
4263 1051 D
S
N
4413 1051 M
4413 1103 D
S
N
1410 965 M
1397 961 D
1388 948 D
1384 926 D
1384 913 D
1388 892 D
1397 879 D
1410 874 D
1418 874 D
1431 879 D
1440 892 D
1444 913 D
1444 926 D
1440 948 D
1431 961 D
1418 965 D
1410 965 D
S
N
1410 965 M
1401 961 D
1397 957 D
1392 948 D
1388 926 D
1388 913 D
1392 892 D
1397 883 D
1401 879 D
1410 874 D
S
N
1418 874 M
1427 879 D
1431 883 D
1436 892 D
1440 913 D
1440 926 D
1436 948 D
1431 957 D
1427 961 D
1418 965 D
S
N
2099 965 M
2090 922 D
S
N
2090 922 M
2099 931 D
2112 935 D
2125 935 D
2138 931 D
2146 922 D
2151 909 D
2151 900 D
2146 887 D
2138 879 D
2125 874 D
2112 874 D
2099 879 D
2094 883 D
2090 892 D
2090 896 D
2094 900 D
2099 896 D
2094 892 D
S
N
2125 935 M
2133 931 D
2142 922 D
2146 909 D
2146 900 D
2142 887 D
2133 879 D
2125 874 D
S
N
2099 965 M
2142 965 D
S
N
2099 961 M
2120 961 D
2142 965 D
S
N
2203 965 M
2190 961 D
2181 948 D
2177 926 D
2177 913 D
2181 892 D
2190 879 D
2203 874 D
2211 874 D
2224 879 D
2233 892 D
2237 913 D
2237 926 D
2233 948 D
2224 961 D
2211 965 D
2203 965 D
S
N
2203 965 M
2194 961 D
2190 957 D
2185 948 D
2181 926 D
2181 913 D
2185 892 D
2190 883 D
2194 879 D
2203 874 D
S
N
2211 874 M
2220 879 D
2224 883 D
2229 892 D
2233 913 D
2233 926 D
2229 948 D
2224 957 D
2220 961 D
2211 965 D
S
N
2810 948 M
2818 952 D
2831 965 D
2831 874 D
S
N
2827 961 M
2827 874 D
S
N
2810 874 M
2848 874 D
S
N
2909 965 M
2896 961 D
2887 948 D
2883 926 D
2883 913 D
2887 892 D
2896 879 D
2909 874 D
2918 874 D
2931 879 D
2939 892 D
2944 913 D
2944 926 D
2939 948 D
2931 961 D
2918 965 D
2909 965 D
S
N
2909 965 M
2900 961 D
2896 957 D
2892 948 D
2887 926 D
2887 913 D
2892 892 D
2896 883 D
2900 879 D
2909 874 D
S
N
2918 874 M
2926 879 D
2931 883 D
2935 892 D
2939 913 D
2939 926 D
2935 948 D
2931 957 D
2926 961 D
2918 965 D
S
N
2995 965 M
2982 961 D
2974 948 D
2970 926 D
2970 913 D
2974 892 D
2982 879 D
2995 874 D
3004 874 D
3017 879 D
3026 892 D
3030 913 D
3030 926 D
3026 948 D
3017 961 D
3004 965 D
2995 965 D
S
N
2995 965 M
2987 961 D
2982 957 D
2978 948 D
2974 926 D
2974 913 D
2978 892 D
2982 883 D
2987 879 D
2995 874 D
S
N
3004 874 M
3013 879 D
3017 883 D
3021 892 D
3026 913 D
3026 926 D
3021 948 D
3017 957 D
3013 961 D
3004 965 D
S
N
3559 948 M
3568 952 D
3581 965 D
3581 874 D
S
N
3576 961 M
3576 874 D
S
N
3559 874 M
3598 874 D
S
N
3641 965 M
3633 922 D
S
N
3633 922 M
3641 931 D
3654 935 D
3667 935 D
3680 931 D
3689 922 D
3693 909 D
3693 900 D
3689 887 D
3680 879 D
3667 874 D
3654 874 D
3641 879 D
3637 883 D
3633 892 D
3633 896 D
3637 900 D
3641 896 D
3637 892 D
S
N
3667 935 M
3676 931 D
3685 922 D
3689 909 D
3689 900 D
3685 887 D
3676 879 D
3667 874 D
S
N
3641 965 M
3685 965 D
S
N
3641 961 M
3663 961 D
3685 965 D
S
N
3745 965 M
3732 961 D
3723 948 D
3719 926 D
3719 913 D
3723 892 D
3732 879 D
3745 874 D
3754 874 D
3767 879 D
3775 892 D
3780 913 D
3780 926 D
3775 948 D
3767 961 D
3754 965 D
3745 965 D
S
N
3745 965 M
3736 961 D
3732 957 D
3728 948 D
3723 926 D
3723 913 D
3728 892 D
3732 883 D
3736 879 D
3745 874 D
S
N
3754 874 M
3762 879 D
3767 883 D
3771 892 D
3775 913 D
3775 926 D
3771 948 D
3767 957 D
3762 961 D
3754 965 D
S
N
4300 948 M
4304 944 D
4300 939 D
4296 944 D
4296 948 D
4300 957 D
4304 961 D
4317 965 D
4335 965 D
4348 961 D
4352 957 D
4356 948 D
4356 939 D
4352 931 D
4339 922 D
4317 913 D
4309 909 D
4300 900 D
4296 887 D
4296 874 D
S
N
4335 965 M
4343 961 D
4348 957 D
4352 948 D
4352 939 D
4348 931 D
4335 922 D
4317 913 D
S
N
4296 883 M
4300 887 D
4309 887 D
4330 879 D
4343 879 D
4352 883 D
4356 887 D
S
N
4309 887 M
4330 874 D
4348 874 D
4352 879 D
4356 887 D
4356 896 D
S
N
4408 965 M
4395 961 D
4387 948 D
4382 926 D
4382 913 D
4387 892 D
4395 879 D
4408 874 D
4417 874 D
4430 879 D
4438 892 D
4443 913 D
4443 926 D
4438 948 D
4430 961 D
4417 965 D
4408 965 D
S
N
4408 965 M
4400 961 D
4395 957 D
4391 948 D
4387 926 D
4387 913 D
4391 892 D
4395 883 D
4400 879 D
4408 874 D
S
N
4417 874 M
4425 879 D
4430 883 D
4434 892 D
4438 913 D
4438 926 D
4434 948 D
4430 957 D
4425 961 D
4417 965 D
S
N
4495 965 M
4482 961 D
4473 948 D
4469 926 D
4469 913 D
4473 892 D
4482 879 D
4495 874 D
4503 874 D
4516 879 D
4525 892 D
4529 913 D
4529 926 D
4525 948 D
4516 961 D
4503 965 D
4495 965 D
S
N
4495 965 M
4486 961 D
4482 957 D
4477 948 D
4473 926 D
4473 913 D
4477 892 D
4482 883 D
4486 879 D
4495 874 D
S
N
4503 874 M
4512 879 D
4516 883 D
4521 892 D
4525 913 D
4525 926 D
4521 948 D
4516 957 D
4512 961 D
4503 965 D
S
N
1414 3211 M
1414 3262 D
S
N
1564 3262 M
1564 3245 D
S
N
1714 3245 M
1714 3262 D
S
N
1864 3262 M
1864 3245 D
S
N
2014 3245 M
2014 3262 D
S
N
2164 3262 M
2164 3211 D
S
N
2314 3245 M
2314 3262 D
S
N
2464 3262 M
2464 3245 D
S
N
2613 3245 M
2613 3262 D
S
N
2763 3262 M
2763 3245 D
S
N
2913 3211 M
2913 3262 D
S
N
3063 3262 M
3063 3245 D
S
N
3213 3245 M
3213 3262 D
S
N
3363 3262 M
3363 3245 D
S
N
3513 3245 M
3513 3262 D
S
N
3663 3262 M
3663 3211 D
S
N
3813 3245 M
3813 3262 D
S
N
3963 3262 M
3963 3245 D
S
N
4113 3245 M
4113 3262 D
S
N
4263 3262 M
4263 3245 D
S
N
4413 3211 M
4413 3262 D
S
N
1414 1051 M
1414 3262 D
S
N
1414 1051 M
1431 1051 D
S
N
1466 1130 M
1414 1130 D
S
N
1414 1195 M
1431 1195 D
S
N
1431 1250 M
1414 1250 D
S
N
1414 1297 M
1431 1297 D
S
N
1431 1339 M
1414 1339 D
S
N
1414 1377 M
1466 1377 D
S
N
1431 1624 M
1414 1624 D
S
N
1414 1768 M
1431 1768 D
S
N
1431 1870 M
1414 1870 D
S
N
1414 1950 M
1466 1950 D
S
N
1431 2015 M
1414 2015 D
S
N
1414 2069 M
1431 2069 D
S
N
1431 2117 M
1414 2117 D
S
N
1414 2159 M
1431 2159 D
S
N
1466 2196 M
1414 2196 D
S
N
1414 2443 M
1431 2443 D
S
N
1431 2587 M
1414 2587 D
S
N
1414 2690 M
1431 2690 D
S
N
1466 2769 M
1414 2769 D
S
N
1414 2834 M
1431 2834 D
S
N
1431 2889 M
1414 2889 D
S
N
1414 2936 M
1431 2936 D
S
N
1431 2978 M
1414 2978 D
S
N
1414 3016 M
1466 3016 D
S
N
1012 1169 M
999 1165 D
990 1152 D
986 1130 D
986 1117 D
990 1096 D
999 1083 D
1012 1078 D
1021 1078 D
1033 1083 D
1042 1096 D
1046 1117 D
1046 1130 D
1042 1152 D
1033 1165 D
1021 1169 D
1012 1169 D
S
N
1012 1169 M
1003 1165 D
999 1161 D
995 1152 D
990 1130 D
990 1117 D
995 1096 D
999 1087 D
1003 1083 D
1012 1078 D
S
N
1021 1078 M
1029 1083 D
1033 1087 D
1038 1096 D
1042 1117 D
1042 1130 D
1038 1152 D
1033 1161 D
1029 1165 D
1021 1169 D
S
N
1081 1087 M
1077 1083 D
1081 1078 D
1085 1083 D
1081 1087 D
S
N
1142 1169 M
1129 1165 D
1120 1152 D
1116 1130 D
1116 1117 D
1120 1096 D
1129 1083 D
1142 1078 D
1150 1078 D
1163 1083 D
1172 1096 D
1176 1117 D
1176 1130 D
1172 1152 D
1163 1165 D
1150 1169 D
1142 1169 D
S
N
1142 1169 M
1133 1165 D
1129 1161 D
1124 1152 D
1120 1130 D
1120 1117 D
1124 1096 D
1129 1087 D
1133 1083 D
1142 1078 D
S
N
1150 1078 M
1159 1083 D
1163 1087 D
1168 1096 D
1172 1117 D
1172 1130 D
1168 1152 D
1163 1161 D
1159 1165 D
1150 1169 D
S
N
1228 1169 M
1215 1165 D
1206 1152 D
1202 1130 D
1202 1117 D
1206 1096 D
1215 1083 D
1228 1078 D
1237 1078 D
1250 1083 D
1258 1096 D
1263 1117 D
1263 1130 D
1258 1152 D
1250 1165 D
1237 1169 D
1228 1169 D
S
N
1228 1169 M
1219 1165 D
1215 1161 D
1211 1152 D
1206 1130 D
1206 1117 D
1211 1096 D
1215 1087 D
1219 1083 D
1228 1078 D
S
N
1237 1078 M
1245 1083 D
1250 1087 D
1254 1096 D
1258 1117 D
1258 1130 D
1254 1152 D
1250 1161 D
1245 1165 D
1237 1169 D
S
N
1297 1169 M
1289 1126 D
S
N
1289 1126 M
1297 1135 D
1310 1139 D
1323 1139 D
1336 1135 D
1345 1126 D
1349 1113 D
1349 1104 D
1345 1091 D
1336 1083 D
1323 1078 D
1310 1078 D
1297 1083 D
1293 1087 D
1289 1096 D
1289 1100 D
1293 1104 D
1297 1100 D
1293 1096 D
S
N
1323 1139 M
1332 1135 D
1341 1126 D
1345 1113 D
1345 1104 D
1341 1091 D
1332 1083 D
1323 1078 D
S
N
1297 1169 M
1341 1169 D
S
N
1297 1165 M
1319 1165 D
1341 1169 D
S
N
1012 1416 M
999 1412 D
990 1399 D
986 1377 D
986 1364 D
990 1342 D
999 1329 D
1012 1325 D
1021 1325 D
1033 1329 D
1042 1342 D
1046 1364 D
1046 1377 D
1042 1399 D
1033 1412 D
1021 1416 D
1012 1416 D
S
N
1012 1416 M
1003 1412 D
999 1407 D
995 1399 D
990 1377 D
990 1364 D
995 1342 D
999 1334 D
1003 1329 D
1012 1325 D
S
N
1021 1325 M
1029 1329 D
1033 1334 D
1038 1342 D
1042 1364 D
1042 1377 D
1038 1399 D
1033 1407 D
1029 1412 D
1021 1416 D
S
N
1081 1334 M
1077 1329 D
1081 1325 D
1085 1329 D
1081 1334 D
S
N
1142 1416 M
1129 1412 D
1120 1399 D
1116 1377 D
1116 1364 D
1120 1342 D
1129 1329 D
1142 1325 D
1150 1325 D
1163 1329 D
1172 1342 D
1176 1364 D
1176 1377 D
1172 1399 D
1163 1412 D
1150 1416 D
1142 1416 D
S
N
1142 1416 M
1133 1412 D
1129 1407 D
1124 1399 D
1120 1377 D
1120 1364 D
1124 1342 D
1129 1334 D
1133 1329 D
1142 1325 D
S
N
1150 1325 M
1159 1329 D
1163 1334 D
1168 1342 D
1172 1364 D
1172 1377 D
1168 1399 D
1163 1407 D
1159 1412 D
1150 1416 D
S
N
1215 1399 M
1224 1403 D
1237 1416 D
1237 1325 D
S
N
1232 1412 M
1232 1325 D
S
N
1215 1325 M
1254 1325 D
S
N
1315 1416 M
1302 1412 D
1293 1399 D
1289 1377 D
1289 1364 D
1293 1342 D
1302 1329 D
1315 1325 D
1323 1325 D
1336 1329 D
1345 1342 D
1349 1364 D
1349 1377 D
1345 1399 D
1336 1412 D
1323 1416 D
1315 1416 D
S
N
1315 1416 M
1306 1412 D
1302 1407 D
1297 1399 D
1293 1377 D
1293 1364 D
1297 1342 D
1302 1334 D
1306 1329 D
1315 1325 D
S
N
1323 1325 M
1332 1329 D
1336 1334 D
1341 1342 D
1345 1364 D
1345 1377 D
1341 1399 D
1336 1407 D
1332 1412 D
1323 1416 D
S
N
1012 1989 M
999 1984 D
990 1971 D
986 1950 D
986 1937 D
990 1915 D
999 1902 D
1012 1898 D
1021 1898 D
1033 1902 D
1042 1915 D
1046 1937 D
1046 1950 D
1042 1971 D
1033 1984 D
1021 1989 D
1012 1989 D
S
N
1012 1989 M
1003 1984 D
999 1980 D
995 1971 D
990 1950 D
990 1937 D
995 1915 D
999 1906 D
1003 1902 D
1012 1898 D
S
N
1021 1898 M
1029 1902 D
1033 1906 D
1038 1915 D
1042 1937 D
1042 1950 D
1038 1971 D
1033 1980 D
1029 1984 D
1021 1989 D
S
N
1081 1906 M
1077 1902 D
1081 1898 D
1085 1902 D
1081 1906 D
S
N
1142 1989 M
1129 1984 D
1120 1971 D
1116 1950 D
1116 1937 D
1120 1915 D
1129 1902 D
1142 1898 D
1150 1898 D
1163 1902 D
1172 1915 D
1176 1937 D
1176 1950 D
1172 1971 D
1163 1984 D
1150 1989 D
1142 1989 D
S
N
1142 1989 M
1133 1984 D
1129 1980 D
1124 1971 D
1120 1950 D
1120 1937 D
1124 1915 D
1129 1906 D
1133 1902 D
1142 1898 D
S
N
1150 1898 M
1159 1902 D
1163 1906 D
1168 1915 D
1172 1937 D
1172 1950 D
1168 1971 D
1163 1980 D
1159 1984 D
1150 1989 D
S
N
1211 1989 M
1202 1945 D
S
N
1202 1945 M
1211 1954 D
1224 1958 D
1237 1958 D
1250 1954 D
1258 1945 D
1263 1932 D
1263 1924 D
1258 1911 D
1250 1902 D
1237 1898 D
1224 1898 D
1211 1902 D
1206 1906 D
1202 1915 D
1202 1919 D
1206 1924 D
1211 1919 D
1206 1915 D
S
N
1237 1958 M
1245 1954 D
1254 1945 D
1258 1932 D
1258 1924 D
1254 1911 D
1245 1902 D
1237 1898 D
S
N
1211 1989 M
1254 1989 D
S
N
1211 1984 M
1232 1984 D
1254 1989 D
S
N
1315 1989 M
1302 1984 D
1293 1971 D
1289 1950 D
1289 1937 D
1293 1915 D
1302 1902 D
1315 1898 D
1323 1898 D
1336 1902 D
1345 1915 D
1349 1937 D
1349 1950 D
1345 1971 D
1336 1984 D
1323 1989 D
1315 1989 D
S
N
1315 1989 M
1306 1984 D
1302 1980 D
1297 1971 D
1293 1950 D
1293 1937 D
1297 1915 D
1302 1906 D
1306 1902 D
1315 1898 D
S
N
1323 1898 M
1332 1902 D
1336 1906 D
1341 1915 D
1345 1937 D
1345 1950 D
1341 1971 D
1336 1980 D
1332 1984 D
1323 1989 D
S
N
1012 2235 M
999 2231 D
990 2218 D
986 2196 D
986 2183 D
990 2162 D
999 2149 D
1012 2144 D
1021 2144 D
1033 2149 D
1042 2162 D
1046 2183 D
1046 2196 D
1042 2218 D
1033 2231 D
1021 2235 D
1012 2235 D
S
N
1012 2235 M
1003 2231 D
999 2227 D
995 2218 D
990 2196 D
990 2183 D
995 2162 D
999 2153 D
1003 2149 D
1012 2144 D
S
N
1021 2144 M
1029 2149 D
1033 2153 D
1038 2162 D
1042 2183 D
1042 2196 D
1038 2218 D
1033 2227 D
1029 2231 D
1021 2235 D
S
N
1081 2153 M
1077 2149 D
1081 2144 D
1085 2149 D
1081 2153 D
S
N
1129 2218 M
1137 2222 D
1150 2235 D
1150 2144 D
S
N
1146 2231 M
1146 2144 D
S
N
1129 2144 M
1168 2144 D
S
N
1228 2235 M
1215 2231 D
1206 2218 D
1202 2196 D
1202 2183 D
1206 2162 D
1215 2149 D
1228 2144 D
1237 2144 D
1250 2149 D
1258 2162 D
1263 2183 D
1263 2196 D
1258 2218 D
1250 2231 D
1237 2235 D
1228 2235 D
S
N
1228 2235 M
1219 2231 D
1215 2227 D
1211 2218 D
1206 2196 D
1206 2183 D
1211 2162 D
1215 2153 D
1219 2149 D
1228 2144 D
S
N
1237 2144 M
1245 2149 D
1250 2153 D
1254 2162 D
1258 2183 D
1258 2196 D
1254 2218 D
1250 2227 D
1245 2231 D
1237 2235 D
S
N
1315 2235 M
1302 2231 D
1293 2218 D
1289 2196 D
1289 2183 D
1293 2162 D
1302 2149 D
1315 2144 D
1323 2144 D
1336 2149 D
1345 2162 D
1349 2183 D
1349 2196 D
1345 2218 D
1336 2231 D
1323 2235 D
1315 2235 D
S
N
1315 2235 M
1306 2231 D
1302 2227 D
1297 2218 D
1293 2196 D
1293 2183 D
1297 2162 D
1302 2153 D
1306 2149 D
1315 2144 D
S
N
1323 2144 M
1332 2149 D
1336 2153 D
1341 2162 D
1345 2183 D
1345 2196 D
1341 2218 D
1336 2227 D
1332 2231 D
1323 2235 D
S
N
1012 2808 M
999 2804 D
990 2791 D
986 2769 D
986 2756 D
990 2735 D
999 2722 D
1012 2717 D
1021 2717 D
1033 2722 D
1042 2735 D
1046 2756 D
1046 2769 D
1042 2791 D
1033 2804 D
1021 2808 D
1012 2808 D
S
N
1012 2808 M
1003 2804 D
999 2799 D
995 2791 D
990 2769 D
990 2756 D
995 2735 D
999 2726 D
1003 2722 D
1012 2717 D
S
N
1021 2717 M
1029 2722 D
1033 2726 D
1038 2735 D
1042 2756 D
1042 2769 D
1038 2791 D
1033 2799 D
1029 2804 D
1021 2808 D
S
N
1081 2726 M
1077 2722 D
1081 2717 D
1085 2722 D
1081 2726 D
S
N
1124 2808 M
1116 2765 D
S
N
1116 2765 M
1124 2773 D
1137 2778 D
1150 2778 D
1163 2773 D
1172 2765 D
1176 2752 D
1176 2743 D
1172 2730 D
1163 2722 D
1150 2717 D
1137 2717 D
1124 2722 D
1120 2726 D
1116 2735 D
1116 2739 D
1120 2743 D
1124 2739 D
1120 2735 D
S
N
1150 2778 M
1159 2773 D
1168 2765 D
1172 2752 D
1172 2743 D
1168 2730 D
1159 2722 D
1150 2717 D
S
N
1124 2808 M
1168 2808 D
S
N
1124 2804 M
1146 2804 D
1168 2808 D
S
N
1228 2808 M
1215 2804 D
1206 2791 D
1202 2769 D
1202 2756 D
1206 2735 D
1215 2722 D
1228 2717 D
1237 2717 D
1250 2722 D
1258 2735 D
1263 2756 D
1263 2769 D
1258 2791 D
1250 2804 D
1237 2808 D
1228 2808 D
S
N
1228 2808 M
1219 2804 D
1215 2799 D
1211 2791 D
1206 2769 D
1206 2756 D
1211 2735 D
1215 2726 D
1219 2722 D
1228 2717 D
S
N
1237 2717 M
1245 2722 D
1250 2726 D
1254 2735 D
1258 2756 D
1258 2769 D
1254 2791 D
1250 2799 D
1245 2804 D
1237 2808 D
S
N
1315 2808 M
1302 2804 D
1293 2791 D
1289 2769 D
1289 2756 D
1293 2735 D
1302 2722 D
1315 2717 D
1323 2717 D
1336 2722 D
1345 2735 D
1349 2756 D
1349 2769 D
1345 2791 D
1336 2804 D
1323 2808 D
1315 2808 D
S
N
1315 2808 M
1306 2804 D
1302 2799 D
1297 2791 D
1293 2769 D
1293 2756 D
1297 2735 D
1302 2726 D
1306 2722 D
1315 2717 D
S
N
1323 2717 M
1332 2722 D
1336 2726 D
1341 2735 D
1345 2756 D
1345 2769 D
1341 2791 D
1336 2799 D
1332 2804 D
1323 2808 D
S
N
999 3037 M
1008 3042 D
1021 3055 D
1021 2964 D
S
N
1016 3050 M
1016 2964 D
S
N
999 2964 M
1038 2964 D
S
N
1081 2973 M
1077 2968 D
1081 2964 D
1085 2968 D
1081 2973 D
S
N
1142 3055 M
1129 3050 D
1120 3037 D
1116 3016 D
1116 3003 D
1120 2981 D
1129 2968 D
1142 2964 D
1150 2964 D
1163 2968 D
1172 2981 D
1176 3003 D
1176 3016 D
1172 3037 D
1163 3050 D
1150 3055 D
1142 3055 D
S
N
1142 3055 M
1133 3050 D
1129 3046 D
1124 3037 D
1120 3016 D
1120 3003 D
1124 2981 D
1129 2973 D
1133 2968 D
1142 2964 D
S
N
1150 2964 M
1159 2968 D
1163 2973 D
1168 2981 D
1172 3003 D
1172 3016 D
1168 3037 D
1163 3046 D
1159 3050 D
1150 3055 D
S
N
1228 3055 M
1215 3050 D
1206 3037 D
1202 3016 D
1202 3003 D
1206 2981 D
1215 2968 D
1228 2964 D
1237 2964 D
1250 2968 D
1258 2981 D
1263 3003 D
1263 3016 D
1258 3037 D
1250 3050 D
1237 3055 D
1228 3055 D
S
N
1228 3055 M
1219 3050 D
1215 3046 D
1211 3037 D
1206 3016 D
1206 3003 D
1211 2981 D
1215 2973 D
1219 2968 D
1228 2964 D
S
N
1237 2964 M
1245 2968 D
1250 2973 D
1254 2981 D
1258 3003 D
1258 3016 D
1254 3037 D
1250 3046 D
1245 3050 D
1237 3055 D
S
N
1315 3055 M
1302 3050 D
1293 3037 D
1289 3016 D
1289 3003 D
1293 2981 D
1302 2968 D
1315 2964 D
1323 2964 D
1336 2968 D
1345 2981 D
1349 3003 D
1349 3016 D
1345 3037 D
1336 3050 D
1323 3055 D
1315 3055 D
S
N
1315 3055 M
1306 3050 D
1302 3046 D
1297 3037 D
1293 3016 D
1293 3003 D
1297 2981 D
1302 2973 D
1306 2968 D
1315 2964 D
S
N
1323 2964 M
1332 2968 D
1336 2973 D
1341 2981 D
1345 3003 D
1345 3016 D
1341 3037 D
1336 3046 D
1332 3050 D
1323 3055 D
S
N
4413 1051 M
4413 3262 D
S
N
4395 1051 M
4413 1051 D
S
N
4413 1130 M
4361 1130 D
S
N
4395 1195 M
4413 1195 D
S
N
4413 1250 M
4395 1250 D
S
N
4395 1297 M
4413 1297 D
S
N
4413 1339 M
4395 1339 D
S
N
4361 1377 M
4413 1377 D
S
N
4413 1624 M
4395 1624 D
S
N
4395 1768 M
4413 1768 D
S
N
4413 1870 M
4395 1870 D
S
N
4361 1950 M
4413 1950 D
S
N
4413 2015 M
4395 2015 D
S
N
4395 2069 M
4413 2069 D
S
N
4413 2117 M
4395 2117 D
S
N
4395 2159 M
4413 2159 D
S
N
4413 2196 M
4361 2196 D
S
N
4395 2443 M
4413 2443 D
S
N
4413 2587 M
4395 2587 D
S
N
4395 2690 M
4413 2690 D
S
N
4413 2769 M
4361 2769 D
S
N
4395 2834 M
4413 2834 D
S
N
4413 2889 M
4395 2889 D
S
N
4395 2936 M
4413 2936 D
S
N
4413 2978 M
4395 2978 D
S
N
4361 3016 M
4413 3016 D
S
N
2880 3059 M
2880 2959 D
S
N
2885 3059 M
2885 2959 D
S
N
2866 3059 M
2899 3059 D
S
N
2866 2959 M
2937 2959 D
2937 2987 D
2932 2959 D
S
N
2966 3059 M
2966 2959 D
S
N
2970 3059 M
2970 2959 D
S
N
3027 3059 M
3027 2959 D
S
N
3032 3059 M
3032 2959 D
S
N
2951 3059 M
2985 3059 D
S
N
3013 3059 M
3047 3059 D
S
N
2970 3011 M
3027 3011 D
S
N
2951 2959 M
2985 2959 D
S
N
3013 2959 M
3047 2959 D
S
N
3137 3044 M
3142 3030 D
3142 3059 D
3137 3044 D
3127 3054 D
3113 3059 D
3104 3059 D
3089 3054 D
3080 3044 D
3075 3035 D
3070 3021 D
3070 2997 D
3075 2982 D
3080 2973 D
3089 2963 D
3104 2959 D
3113 2959 D
3127 2963 D
3137 2973 D
3142 2982 D
S
N
3104 3059 M
3094 3054 D
3085 3044 D
3080 3035 D
3075 3021 D
3075 2997 D
3080 2982 D
3085 2973 D
3094 2963 D
3104 2959 D
S
N
3180 2959 M
3175 2963 D
3180 2968 D
3184 2963 D
3184 2954 D
3180 2944 D
3175 2940 D
S
N
3308 3040 M
3318 3044 D
3332 3059 D
3332 2959 D
S
N
3327 3054 M
3327 2959 D
S
N
3308 2959 M
3351 2959 D
S
N
3432 3049 M
3432 2959 D
S
N
3437 3059 M
3437 2959 D
S
N
3437 3059 M
3384 2987 D
3460 2987 D
S
N
3418 2959 M
3451 2959 D
S
N
3589 3059 M
3589 2959 D
S
N
3594 3059 M
3594 2959 D
S
N
3560 3059 M
3556 3030 D
3556 3059 D
3627 3059 D
3627 3030 D
3622 3059 D
S
N
3575 2959 M
3608 2959 D
S
N
3655 2997 M
3713 2997 D
3713 3006 D
3708 3016 D
3703 3021 D
3694 3025 D
3679 3025 D
3665 3021 D
3655 3011 D
3651 2997 D
3651 2987 D
3655 2973 D
3665 2963 D
3679 2959 D
3689 2959 D
3703 2963 D
3713 2973 D
S
N
3708 2997 M
3708 3011 D
3703 3021 D
S
N
3679 3025 M
3670 3021 D
3660 3011 D
3655 2997 D
3655 2987 D
3660 2973 D
3670 2963 D
3679 2959 D
S
N
3741 3059 M
3774 2959 D
S
N
3746 3059 M
3774 2973 D
S
N
3808 3059 M
3774 2959 D
S
N
3732 3059 M
3760 3059 D
S
N
3789 3059 M
3817 3059 D
S
N
2880 2797 M
2880 2730 D
S
N
2885 2797 M
2885 2730 D
S
N
2885 2783 M
2894 2792 D
2909 2797 D
2918 2797 D
2932 2792 D
2937 2783 D
2937 2730 D
S
N
2918 2797 M
2928 2792 D
2932 2783 D
2932 2730 D
S
N
2937 2783 M
2947 2792 D
2961 2797 D
2970 2797 D
2985 2792 D
2989 2783 D
2989 2730 D
S
N
2970 2797 M
2980 2792 D
2985 2783 D
2985 2730 D
S
N
2866 2797 M
2885 2797 D
S
N
2866 2730 M
2899 2730 D
S
N
2918 2730 M
2951 2730 D
S
N
2970 2730 M
3004 2730 D
S
N
3035 2759 M
3035 2692 D
S
N
3039 2759 M
3039 2692 D
S
N
3077 2759 M
3077 2692 D
S
N
3080 2759 M
3080 2692 D
S
N
3026 2759 M
3048 2759 D
S
N
3067 2759 M
3089 2759 D
S
N
3039 2727 M
3077 2727 D
S
N
3026 2692 M
3048 2692 D
S
N
3067 2692 M
3089 2692 D
S
N
3121 2787 M
3207 2787 D
S
N
3121 2759 M
3207 2759 D
S
N
3254 2811 M
3264 2816 D
3278 2830 D
3278 2730 D
S
N
3273 2825 M
3273 2730 D
S
N
3254 2730 M
3297 2730 D
S
N
3340 2811 M
3345 2806 D
3340 2802 D
3335 2806 D
3335 2811 D
3340 2821 D
3345 2825 D
3359 2830 D
3378 2830 D
3392 2825 D
3397 2821 D
3402 2811 D
3402 2802 D
3397 2792 D
3383 2783 D
3359 2773 D
3349 2768 D
3340 2759 D
3335 2745 D
3335 2730 D
S
N
3378 2830 M
3387 2825 D
3392 2821 D
3397 2811 D
3397 2802 D
3392 2792 D
3378 2783 D
3359 2773 D
S
N
3335 2740 M
3340 2745 D
3349 2745 D
3373 2735 D
3387 2735 D
3397 2740 D
3402 2745 D
S
N
3349 2745 M
3373 2730 D
3392 2730 D
3397 2735 D
3402 2745 D
3402 2754 D
S
N
3459 2830 M
3445 2825 D
3435 2811 D
3430 2787 D
3430 2773 D
3435 2749 D
3445 2735 D
3459 2730 D
3468 2730 D
3483 2735 D
3492 2749 D
3497 2773 D
3497 2787 D
3492 2811 D
3483 2825 D
3468 2830 D
3459 2830 D
S
N
3459 2830 M
3449 2825 D
3445 2821 D
3440 2811 D
3435 2787 D
3435 2773 D
3440 2749 D
3445 2740 D
3449 2735 D
3459 2730 D
S
N
3468 2730 M
3478 2735 D
3483 2740 D
3487 2749 D
3492 2773 D
3492 2787 D
3487 2811 D
3483 2821 D
3478 2825 D
3468 2830 D
S
N
3668 2816 M
3673 2802 D
3673 2830 D
3668 2816 D
3659 2825 D
3644 2830 D
3635 2830 D
3621 2825 D
3611 2816 D
3606 2806 D
3602 2792 D
3602 2768 D
3606 2754 D
3611 2745 D
3621 2735 D
3635 2730 D
3644 2730 D
3659 2735 D
3668 2745 D
S
N
3635 2830 M
3625 2825 D
3616 2816 D
3611 2806 D
3606 2792 D
3606 2768 D
3611 2754 D
3616 2745 D
3625 2735 D
3635 2730 D
S
N
3668 2768 M
3668 2730 D
S
N
3673 2768 M
3673 2730 D
S
N
3654 2768 M
3687 2768 D
S
N
3716 2768 M
3773 2768 D
3773 2778 D
3768 2787 D
3763 2792 D
3754 2797 D
3740 2797 D
3725 2792 D
3716 2783 D
3711 2768 D
3711 2759 D
3716 2745 D
3725 2735 D
3740 2730 D
3749 2730 D
3763 2735 D
3773 2745 D
S
N
3768 2768 M
3768 2783 D
3763 2792 D
S
N
3740 2797 M
3730 2792 D
3720 2783 D
3716 2768 D
3716 2759 D
3720 2745 D
3730 2735 D
3740 2730 D
S
N
3801 2830 M
3835 2730 D
S
N
3806 2830 M
3835 2745 D
S
N
3868 2830 M
3835 2730 D
S
N
3792 2830 M
3820 2830 D
S
N
3849 2830 M
3877 2830 D
S
N
2632 2551 M
2637 2565 D
2637 2537 D
2632 2551 D
2623 2560 D
2609 2565 D
2594 2565 D
2580 2560 D
2571 2551 D
2571 2541 D
2575 2532 D
2580 2527 D
2590 2522 D
2618 2513 D
2628 2508 D
2637 2499 D
S
N
2571 2541 M
2580 2532 D
2590 2527 D
2618 2518 D
2628 2513 D
2632 2508 D
2637 2499 D
2637 2480 D
2628 2470 D
2613 2465 D
2599 2465 D
2585 2470 D
2575 2480 D
2571 2494 D
2571 2465 D
2575 2480 D
S
N
2694 2532 M
2680 2527 D
2671 2518 D
2666 2503 D
2666 2494 D
2671 2480 D
2680 2470 D
2694 2465 D
2704 2465 D
2718 2470 D
2728 2480 D
2732 2494 D
2732 2503 D
2728 2518 D
2718 2527 D
2704 2532 D
2694 2532 D
S
N
2694 2532 M
2685 2527 D
2675 2518 D
2671 2503 D
2671 2494 D
2675 2480 D
2685 2470 D
2694 2465 D
S
N
2704 2465 M
2713 2470 D
2723 2480 D
2728 2494 D
2728 2503 D
2723 2518 D
2713 2527 D
2704 2532 D
S
N
2770 2565 M
2770 2465 D
S
N
2775 2565 M
2775 2465 D
S
N
2756 2565 M
2775 2565 D
S
N
2756 2465 M
2789 2465 D
S
N
2823 2565 M
2818 2560 D
2823 2556 D
2828 2560 D
2823 2565 D
S
N
2823 2532 M
2823 2465 D
S
N
2828 2532 M
2828 2465 D
S
N
2809 2532 M
2828 2532 D
S
N
2809 2465 M
2842 2465 D
S
N
2923 2565 M
2923 2465 D
S
N
2927 2565 M
2927 2465 D
S
N
2923 2518 M
2913 2527 D
2904 2532 D
2894 2532 D
2880 2527 D
2870 2518 D
2866 2503 D
2866 2494 D
2870 2480 D
2880 2470 D
2894 2465 D
2904 2465 D
2913 2470 D
2923 2480 D
S
N
2894 2532 M
2885 2527 D
2875 2518 D
2870 2503 D
2870 2494 D
2875 2480 D
2885 2470 D
2894 2465 D
S
N
2908 2565 M
2927 2565 D
S
N
2923 2465 M
2942 2465 D
S
N
2975 2532 M
2970 2527 D
2975 2522 D
2980 2527 D
2975 2532 D
S
N
2975 2475 M
2970 2470 D
2975 2465 D
2980 2470 D
2975 2475 D
S
N
3151 2551 M
3156 2565 D
3156 2537 D
3151 2551 D
3142 2560 D
3127 2565 D
3113 2565 D
3099 2560 D
3089 2551 D
3089 2541 D
3094 2532 D
3099 2527 D
3108 2522 D
3137 2513 D
3146 2508 D
3156 2499 D
S
N
3089 2541 M
3099 2532 D
3108 2527 D
3137 2518 D
3146 2513 D
3151 2508 D
3156 2499 D
3156 2480 D
3146 2470 D
3132 2465 D
3118 2465 D
3103 2470 D
3094 2480 D
3089 2494 D
3089 2465 D
3094 2480 D
S
N
3194 2565 M
3194 2465 D
S
N
3199 2565 M
3199 2465 D
S
N
3199 2518 M
3208 2527 D
3222 2532 D
3232 2532 D
3246 2527 D
3251 2518 D
3251 2465 D
S
N
3232 2532 M
3241 2527 D
3246 2518 D
3246 2465 D
S
N
3180 2565 M
3199 2565 D
S
N
3180 2465 M
3213 2465 D
S
N
3232 2465 M
3265 2465 D
S
N
3318 2532 M
3303 2527 D
3294 2518 D
3289 2503 D
3289 2494 D
3294 2480 D
3303 2470 D
3318 2465 D
3327 2465 D
3341 2470 D
3351 2480 D
3356 2494 D
3356 2503 D
3351 2518 D
3341 2527 D
3327 2532 D
3318 2532 D
S
N
3318 2532 M
3308 2527 D
3299 2518 D
3294 2503 D
3294 2494 D
3299 2480 D
3308 2470 D
3318 2465 D
S
N
3327 2465 M
3337 2470 D
3346 2480 D
3351 2494 D
3351 2503 D
3346 2518 D
3337 2527 D
3327 2532 D
S
N
3389 2532 M
3408 2465 D
S
N
3394 2532 M
3408 2480 D
S
N
3427 2532 M
3408 2465 D
S
N
3427 2532 M
3446 2465 D
S
N
3432 2532 M
3446 2480 D
S
N
3465 2532 M
3446 2465 D
S
N
3375 2532 M
3408 2532 D
S
N
3451 2532 M
3479 2532 D
S
N
3503 2503 M
3560 2503 D
3560 2513 D
3555 2522 D
3551 2527 D
3541 2532 D
3527 2532 D
3513 2527 D
3503 2518 D
3498 2503 D
3498 2494 D
3503 2480 D
3513 2470 D
3527 2465 D
3536 2465 D
3551 2470 D
3560 2480 D
S
N
3555 2503 M
3555 2518 D
3551 2527 D
S
N
3527 2532 M
3517 2527 D
3508 2518 D
3503 2503 D
3503 2494 D
3508 2480 D
3517 2470 D
3527 2465 D
S
N
3598 2532 M
3598 2465 D
S
N
3603 2532 M
3603 2465 D
S
N
3603 2503 M
3608 2518 D
3617 2527 D
3627 2532 D
3641 2532 D
3646 2527 D
3646 2522 D
3641 2518 D
3636 2522 D
3641 2527 D
S
N
3584 2532 M
3603 2532 D
S
N
3584 2465 M
3617 2465 D
S
N
3755 2522 M
3755 2518 D
3750 2518 D
3750 2522 D
3755 2527 D
3765 2532 D
3784 2532 D
3793 2527 D
3798 2522 D
3803 2513 D
3803 2480 D
3808 2470 D
3812 2465 D
S
N
3798 2522 M
3798 2480 D
3803 2470 D
3812 2465 D
3817 2465 D
S
N
3798 2513 M
3793 2508 D
3765 2503 D
3750 2499 D
3746 2489 D
3746 2480 D
3750 2470 D
3765 2465 D
3779 2465 D
3789 2470 D
3798 2480 D
S
N
3765 2503 M
3755 2499 D
3750 2489 D
3750 2480 D
3755 2470 D
3765 2465 D
S
N
3850 2565 M
3850 2465 D
S
N
3855 2565 M
3855 2465 D
S
N
3836 2565 M
3855 2565 D
S
N
3836 2465 M
3869 2465 D
S
N
3917 2532 M
3907 2527 D
3903 2522 D
3898 2513 D
3898 2503 D
3903 2494 D
3907 2489 D
3917 2484 D
3927 2484 D
3936 2489 D
3941 2494 D
3946 2503 D
3946 2513 D
3941 2522 D
3936 2527 D
3927 2532 D
3917 2532 D
S
N
3907 2527 M
3903 2518 D
3903 2499 D
3907 2489 D
S
N
3936 2489 M
3941 2499 D
3941 2518 D
3936 2527 D
S
N
3941 2522 M
3946 2527 D
3955 2532 D
3955 2527 D
3946 2527 D
S
N
3903 2494 M
3898 2489 D
3893 2480 D
3893 2475 D
3898 2465 D
3912 2461 D
3936 2461 D
3950 2456 D
3955 2451 D
S
N
3893 2475 M
3898 2470 D
3912 2465 D
3936 2465 D
3950 2461 D
3955 2451 D
3955 2446 D
3950 2437 D
3936 2432 D
3907 2432 D
3893 2437 D
3888 2446 D
3888 2451 D
3893 2461 D
3907 2465 D
S
N
3993 2475 M
3988 2470 D
3993 2465 D
3998 2470 D
3993 2475 D
S
0.00 1.00 0.00 setrgbcolor
N
2580 2337 M
2580 2237 D
S
N
2585 2337 M
2585 2237 D
S
N
2566 2337 M
2613 2337 D
2628 2332 D
2637 2323 D
2642 2313 D
2647 2299 D
2647 2275 D
2642 2261 D
2637 2251 D
2628 2242 D
2613 2237 D
2566 2237 D
S
N
2613 2337 M
2623 2332 D
2632 2323 D
2637 2313 D
2642 2299 D
2642 2275 D
2637 2261 D
2632 2251 D
2623 2242 D
2613 2237 D
S
N
2685 2294 M
2685 2289 D
2680 2289 D
2680 2294 D
2685 2299 D
2694 2304 D
2713 2304 D
2723 2299 D
2728 2294 D
2732 2285 D
2732 2251 D
2737 2242 D
2742 2237 D
S
N
2728 2294 M
2728 2251 D
2732 2242 D
2742 2237 D
2747 2237 D
S
N
2728 2285 M
2723 2280 D
2694 2275 D
2680 2270 D
2675 2261 D
2675 2251 D
2680 2242 D
2694 2237 D
2709 2237 D
2718 2242 D
2728 2251 D
S
N
2694 2275 M
2685 2270 D
2680 2261 D
2680 2251 D
2685 2242 D
2694 2237 D
S
N
2818 2294 M
2823 2304 D
2823 2285 D
2818 2294 D
2813 2299 D
2804 2304 D
2785 2304 D
2775 2299 D
2770 2294 D
2770 2285 D
2775 2280 D
2785 2275 D
2809 2266 D
2818 2261 D
2823 2256 D
S
N
2770 2289 M
2775 2285 D
2785 2280 D
2809 2270 D
2818 2266 D
2823 2261 D
2823 2246 D
2818 2242 D
2809 2237 D
2789 2237 D
2780 2242 D
2775 2246 D
2770 2256 D
2770 2237 D
2775 2246 D
S
N
2861 2337 M
2861 2237 D
S
N
2866 2337 M
2866 2237 D
S
N
2866 2289 M
2875 2299 D
2889 2304 D
2899 2304 D
2913 2299 D
2918 2289 D
2918 2237 D
S
N
2899 2304 M
2908 2299 D
2913 2289 D
2913 2237 D
S
N
2847 2337 M
2866 2337 D
S
N
2847 2237 M
2880 2237 D
S
N
2899 2237 M
2932 2237 D
S
N
2961 2275 M
3018 2275 D
3018 2285 D
3013 2294 D
3008 2299 D
2999 2304 D
2985 2304 D
2970 2299 D
2961 2289 D
2956 2275 D
2956 2266 D
2961 2251 D
2970 2242 D
2985 2237 D
2994 2237 D
3008 2242 D
3018 2251 D
S
N
3013 2275 M
3013 2289 D
3008 2299 D
S
N
2985 2304 M
2975 2299 D
2966 2289 D
2961 2275 D
2961 2266 D
2966 2251 D
2975 2242 D
2985 2237 D
S
N
3094 2294 M
3099 2304 D
3099 2285 D
3094 2294 D
3089 2299 D
3080 2304 D
3061 2304 D
3051 2299 D
3046 2294 D
3046 2285 D
3051 2280 D
3061 2275 D
3084 2266 D
3094 2261 D
3099 2256 D
S
N
3046 2289 M
3051 2285 D
3061 2280 D
3084 2270 D
3094 2266 D
3099 2261 D
3099 2246 D
3094 2242 D
3084 2237 D
3065 2237 D
3056 2242 D
3051 2246 D
3046 2256 D
3046 2237 D
3051 2246 D
S
N
3137 2304 M
3132 2299 D
3137 2294 D
3142 2299 D
3137 2304 D
S
N
3137 2246 M
3132 2242 D
3137 2237 D
3142 2242 D
3137 2246 D
S
N
3260 2337 M
3260 2237 D
S
N
3265 2337 M
3265 2237 D
S
N
3294 2308 M
3294 2270 D
S
N
3246 2337 M
3322 2337 D
3322 2308 D
3318 2337 D
S
N
3265 2289 M
3294 2289 D
S
N
3246 2237 M
3280 2237 D
S
N
3356 2337 M
3351 2332 D
3356 2327 D
3360 2332 D
3356 2337 D
S
N
3356 2304 M
3356 2237 D
S
N
3360 2304 M
3360 2237 D
S
N
3341 2304 M
3360 2304 D
S
N
3341 2237 M
3375 2237 D
S
N
3403 2304 M
3456 2237 D
S
N
3408 2304 M
3460 2237 D
S
N
3460 2304 M
3403 2237 D
S
N
3394 2304 M
3422 2304 D
S
N
3441 2304 M
3470 2304 D
S
N
3394 2237 M
3422 2237 D
S
N
3441 2237 M
3470 2237 D
S
N
3498 2275 M
3555 2275 D
3555 2285 D
3551 2294 D
3546 2299 D
3536 2304 D
3522 2304 D
3508 2299 D
3498 2289 D
3494 2275 D
3494 2266 D
3498 2251 D
3508 2242 D
3522 2237 D
3532 2237 D
3546 2242 D
3555 2251 D
S
N
3551 2275 M
3551 2289 D
3546 2299 D
S
N
3522 2304 M
3513 2299 D
3503 2289 D
3498 2275 D
3498 2266 D
3503 2251 D
3513 2242 D
3522 2237 D
S
N
3641 2337 M
3641 2237 D
S
N
3646 2337 M
3646 2237 D
S
N
3641 2289 M
3632 2299 D
3622 2304 D
3613 2304 D
3598 2299 D
3589 2289 D
3584 2275 D
3584 2266 D
3589 2251 D
3598 2242 D
3613 2237 D
3622 2237 D
3632 2242 D
3641 2251 D
S
N
3613 2304 M
3603 2299 D
3594 2289 D
3589 2275 D
3589 2266 D
3594 2251 D
3603 2242 D
3613 2237 D
S
N
3627 2337 M
3646 2337 D
S
N
3641 2237 M
3660 2237 D
S
N
3793 2337 M
3779 2332 D
3770 2323 D
3765 2313 D
3760 2294 D
3760 2280 D
3765 2261 D
3770 2251 D
3779 2242 D
3793 2237 D
3803 2237 D
3817 2242 D
3827 2251 D
3831 2261 D
3836 2280 D
3836 2294 D
3831 2313 D
3827 2323 D
3817 2332 D
3803 2337 D
3793 2337 D
S
N
3793 2337 M
3784 2332 D
3774 2323 D
3770 2313 D
3765 2294 D
3765 2280 D
3770 2261 D
3774 2251 D
3784 2242 D
3793 2237 D
S
N
3803 2237 M
3812 2242 D
3822 2251 D
3827 2261 D
3831 2280 D
3831 2294 D
3827 2313 D
3822 2323 D
3812 2332 D
3803 2337 D
S
N
3874 2304 M
3874 2237 D
S
N
3879 2304 M
3879 2237 D
S
N
3879 2275 M
3884 2289 D
3893 2299 D
3903 2304 D
3917 2304 D
3922 2299 D
3922 2294 D
3917 2289 D
3912 2294 D
3917 2299 D
S
N
3860 2304 M
3879 2304 D
S
N
3860 2237 M
3893 2237 D
S
N
4003 2337 M
4003 2237 D
S
N
4007 2337 M
4007 2237 D
S
N
4003 2289 M
3993 2299 D
3984 2304 D
3974 2304 D
3960 2299 D
3950 2289 D
3946 2275 D
3946 2266 D
3950 2251 D
3960 2242 D
3974 2237 D
3984 2237 D
3993 2242 D
4003 2251 D
S
N
3974 2304 M
3965 2299 D
3955 2289 D
3950 2275 D
3950 2266 D
3955 2251 D
3965 2242 D
3974 2237 D
S
N
3988 2337 M
4007 2337 D
S
N
4003 2237 M
4022 2237 D
S
N
4050 2275 M
4107 2275 D
4107 2285 D
4103 2294 D
4098 2299 D
4088 2304 D
4074 2304 D
4060 2299 D
4050 2289 D
4045 2275 D
4045 2266 D
4050 2251 D
4060 2242 D
4074 2237 D
4084 2237 D
4098 2242 D
4107 2251 D
S
N
4103 2275 M
4103 2289 D
4098 2299 D
S
N
4074 2304 M
4064 2299 D
4055 2289 D
4050 2275 D
4050 2266 D
4055 2251 D
4064 2242 D
4074 2237 D
S
N
4145 2304 M
4145 2237 D
S
N
4150 2304 M
4150 2237 D
S
N
4150 2275 M
4155 2289 D
4164 2299 D
4174 2304 D
4188 2304 D
4193 2299 D
4193 2294 D
4188 2289 D
4183 2294 D
4188 2299 D
S
N
4131 2304 M
4150 2304 D
S
N
4131 2237 M
4164 2237 D
S
[39] 0 Sd
N
1541 3262 M
1564 3162 D
1624 2988 D
1684 2854 D
1744 2748 D
1804 2657 D
1864 2579 D
1924 2510 D
1984 2446 D
2044 2389 D
2104 2332 D
2164 2286 D
2224 2240 D
2284 2196 D
2344 2153 D
2404 2113 D
2464 2075 D
2524 2031 D
2583 2000 D
2643 1958 D
2703 1927 D
2763 1892 D
2823 1864 D
2883 1833 D
2943 1801 D
3003 1769 D
3063 1748 D
3123 1709 D
3183 1689 D
3243 1663 D
3303 1632 D
3363 1604 D
3423 1575 D
3483 1558 D
3543 1527 D
3603 1505 D
3663 1483 D
3723 1459 D
3783 1432 D
3843 1413 D
3903 1382 D
3963 1361 D
4023 1340 D
4083 1325 D
4143 1296 D
4203 1275 D
4263 1254 D
4323 1236 D
4383 1213 D
4413 1202 D
S
0.00 0.00 0.00 setrgbcolor
[] 0 Sd
N
1444 2225 M
1504 2568 D
1564 2638 D
1624 2628 D
1684 2601 D
1744 2558 D
1804 2515 D
1864 2470 D
1924 2428 D
1984 2389 D
2044 2342 D
2104 2302 D
2164 2270 D
2224 2224 D
2284 2189 D
2344 2151 D
2404 2121 D
2464 2087 D
2524 2054 D
2583 2010 D
2643 1971 D
2703 1950 D
2763 1916 D
2823 1885 D
2883 1854 D
2943 1824 D
3003 1786 D
3063 1757 D
3123 1739 D
3183 1709 D
3243 1675 D
3303 1642 D
3363 1611 D
3423 1583 D
3483 1565 D
3543 1540 D
3603 1507 D
3663 1490 D
3723 1460 D
3783 1438 D
3843 1412 D
3903 1366 D
3963 1373 D
4023 1356 D
4083 1321 D
4143 1283 D
4203 1285 D
4263 1262 D
4323 1232 D
4383 1212 D
4413 1201 D
S
showpage
%%Trailer
%%Pages: 1
%%BoundingBox:
