%!PS-Adobe-1.0
%%Creator: Unified Graphics System
%%Pages: (atend)
%%DocumentFonts: Courier
%%BoundingBox:  102  226  481  563
%%EndComments
/Sw{setlinewidth}def
/Sg{setgray}def
/Sd{setdash}def
/P {newpath
    moveto
0 0 rlineto
    stroke}def
/M {moveto}def
/D {lineto}def
/N {newpath}def
/S {stroke}def
/T {/Courier findfont
    exch
    scalefont
    setfont}def
/R {rotate}def
/W {show}def
/F {fill}def
/X {gsave}def
/Y {grestore}def
%%EndProlog
%%Page: 1 1
0.24000 0.24000 scale
1 setlinecap
1 setlinejoin
4 Sw
0 0 0 setrgbcolor
[] 0 Sd
N
1048 2259 M
1048 2227 D
S
N
1049 2259 M
1049 2227 D
S
N
1049 2254 M
1052 2257 D
1056 2259 D
1059 2259 D
1063 2257 D
1066 2254 D
1068 2249 D
1068 2246 D
1066 2242 D
1063 2239 D
1059 2237 D
1056 2237 D
1052 2239 D
1049 2242 D
S
N
1059 2259 M
1062 2257 D
1065 2254 D
1066 2249 D
1066 2246 D
1065 2242 D
1062 2239 D
1059 2237 D
S
N
1043 2259 M
1049 2259 D
S
N
1043 2227 M
1054 2227 D
S
N
1080 2259 M
1080 2227 D
S
N
1081 2259 M
1081 2227 D
S
N
1081 2254 M
1084 2257 D
1087 2259 D
1090 2259 D
1095 2257 D
1098 2254 D
1099 2249 D
1099 2246 D
1098 2242 D
1095 2239 D
1090 2237 D
1087 2237 D
1084 2239 D
1081 2242 D
S
N
1090 2259 M
1093 2257 D
1096 2254 D
1098 2249 D
1098 2246 D
1096 2242 D
1093 2239 D
1090 2237 D
S
N
1075 2259 M
1081 2259 D
S
N
1075 2227 M
1086 2227 D
S
N
1157 2254 M
1161 2251 D
1157 2248 D
S
N
1152 2259 M
1160 2251 D
1152 2243 D
S
N
1134 2251 M
1160 2251 D
S
N
1206 2269 M
1196 2237 D
S
N
1206 2269 M
1217 2237 D
S
N
1206 2265 M
1216 2237 D
S
N
1199 2246 M
1212 2246 D
S
N
1193 2237 M
1202 2237 D
S
N
1211 2237 M
1220 2237 D
S
N
1229 2269 M
1229 2243 D
1231 2239 D
1234 2237 D
1237 2237 D
1240 2239 D
1241 2242 D
S
N
1231 2269 M
1231 2243 D
1232 2239 D
1234 2237 D
S
N
1225 2259 M
1237 2259 D
S
N
1252 2269 M
1252 2243 D
1253 2239 D
1256 2237 D
1259 2237 D
1262 2239 D
1264 2242 D
S
N
1253 2269 M
1253 2243 D
1255 2239 D
1256 2237 D
S
N
1247 2259 M
1259 2259 D
S
N
1243 2278 M
1276 2278 D
S
N
1377 2259 M
1362 2259 D
1357 2257 D
1354 2252 D
1353 2248 D
1353 2243 D
1354 2240 D
1356 2239 D
1359 2237 D
1362 2237 D
1366 2239 D
1369 2243 D
1371 2248 D
1371 2252 D
1369 2256 D
1368 2257 D
1365 2259 D
S
N
1362 2259 M
1359 2257 D
1356 2252 D
1354 2248 D
1354 2242 D
1356 2239 D
S
N
1362 2237 M
1365 2239 D
1368 2243 D
1369 2248 D
1369 2254 D
1368 2257 D
S
N
1368 2257 M
1377 2257 D
S
N
1410 2275 M
1410 2227 D
S
N
1412 2275 M
1412 2227 D
S
N
1410 2275 M
1421 2275 D
S
N
1410 2227 M
1421 2227 D
S
N
1433 2259 M
1433 2227 D
S
N
1434 2259 M
1434 2227 D
S
N
1434 2254 M
1437 2257 D
1440 2259 D
1443 2259 D
1448 2257 D
1451 2254 D
1452 2249 D
1452 2246 D
1451 2242 D
1448 2239 D
1443 2237 D
1440 2237 D
1437 2239 D
1434 2242 D
S
N
1443 2259 M
1446 2257 D
1449 2254 D
1451 2249 D
1451 2246 D
1449 2242 D
1446 2239 D
1443 2237 D
S
N
1428 2259 M
1434 2259 D
S
N
1428 2227 M
1439 2227 D
S
N
1465 2269 M
1465 2237 D
S
N
1466 2269 M
1466 2237 D
S
N
1466 2254 M
1469 2257 D
1472 2259 D
1475 2259 D
1480 2257 D
1483 2254 D
1484 2249 D
1484 2246 D
1483 2242 D
1480 2239 D
1475 2237 D
1472 2237 D
1469 2239 D
1466 2242 D
S
N
1475 2259 M
1478 2257 D
1481 2254 D
1483 2249 D
1483 2246 D
1481 2242 D
1478 2239 D
1475 2237 D
S
N
1460 2269 M
1466 2269 D
S
N
1502 2275 M
1502 2227 D
S
N
1504 2275 M
1504 2227 D
S
N
1493 2275 M
1504 2275 D
S
N
1493 2227 M
1504 2227 D
S
N
1566 2256 M
1566 2254 D
1564 2254 D
1564 2256 D
1566 2257 D
1569 2259 D
1575 2259 D
1578 2257 D
1579 2256 D
1581 2252 D
1581 2242 D
1582 2239 D
1584 2237 D
S
N
1579 2256 M
1579 2242 D
1581 2239 D
1584 2237 D
1585 2237 D
S
N
1579 2252 M
1578 2251 D
1569 2249 D
1564 2248 D
1563 2245 D
1563 2242 D
1564 2239 D
1569 2237 D
1573 2237 D
1576 2239 D
1579 2242 D
S
N
1569 2249 M
1566 2248 D
1564 2245 D
1564 2242 D
1566 2239 D
1569 2237 D
S
N
1596 2269 M
1596 2243 D
1597 2239 D
1600 2237 D
1603 2237 D
1606 2239 D
1608 2242 D
S
N
1597 2269 M
1597 2243 D
1599 2239 D
1600 2237 D
S
N
1591 2259 M
1603 2259 D
S
N
1643 2269 M
1643 2237 D
S
N
1644 2269 M
1644 2237 D
S
N
1638 2269 M
1649 2269 D
S
N
1638 2237 M
1661 2237 D
1661 2246 D
1659 2237 D
S
N
1670 2269 M
1670 2237 D
S
N
1671 2269 M
1671 2237 D
S
N
1689 2269 M
1689 2237 D
S
N
1691 2269 M
1691 2237 D
S
N
1665 2269 M
1676 2269 D
S
N
1685 2269 M
1695 2269 D
S
N
1671 2254 M
1689 2254 D
S
N
1665 2237 M
1676 2237 D
S
N
1685 2237 M
1695 2237 D
S
N
1724 2265 M
1726 2260 D
1726 2269 D
1724 2265 D
1721 2268 D
1717 2269 D
1714 2269 D
1709 2268 D
1706 2265 D
1705 2262 D
1703 2257 D
1703 2249 D
1705 2245 D
1706 2242 D
1709 2239 D
1714 2237 D
1717 2237 D
1721 2239 D
1724 2242 D
1726 2245 D
S
N
1714 2269 M
1711 2268 D
1708 2265 D
1706 2262 D
1705 2257 D
1705 2249 D
1706 2245 D
1708 2242 D
1711 2239 D
1714 2237 D
S
N
1759 2269 M
1759 2260 D
S
N
1759 2263 M
1760 2266 D
1763 2269 D
1766 2269 D
1774 2265 D
1777 2265 D
1779 2266 D
1780 2269 D
S
N
1760 2266 M
1763 2268 D
1766 2268 D
1774 2265 D
S
N
1780 2269 M
1780 2265 D
1779 2260 D
1772 2252 D
1771 2249 D
1769 2245 D
1769 2237 D
S
N
1779 2260 M
1771 2252 D
1769 2249 D
1768 2245 D
1768 2237 D
S
N
1822 2269 M
1822 2237 D
S
N
1824 2269 M
1824 2237 D
S
N
1813 2269 M
1812 2260 D
1812 2269 D
1834 2269 D
1834 2260 D
1833 2269 D
S
N
1818 2237 M
1828 2237 D
S
N
1843 2249 M
1862 2249 D
1862 2252 D
1860 2255 D
1859 2257 D
1855 2259 D
1851 2259 D
1846 2257 D
1843 2254 D
1842 2249 D
1842 2246 D
1843 2242 D
1846 2239 D
1851 2237 D
1854 2237 D
1859 2239 D
1862 2242 D
S
N
1860 2249 M
1860 2254 D
1859 2257 D
S
N
1851 2259 M
1848 2257 D
1845 2254 D
1843 2249 D
1843 2246 D
1845 2242 D
1848 2239 D
1851 2237 D
S
N
1871 2269 M
1881 2237 D
S
N
1872 2269 M
1881 2242 D
S
N
1892 2269 M
1881 2237 D
S
N
1868 2269 M
1877 2269 D
S
N
1886 2269 M
1895 2269 D
S
3 Sw
N
1455 2186 M
1455 2185 D
1453 2185 D
1453 2186 D
1455 2188 D
1458 2189 D
1464 2189 D
1467 2188 D
1468 2186 D
1470 2183 D
1470 2173 D
1471 2170 D
1473 2168 D
S
N
1468 2186 M
1468 2173 D
1470 2170 D
1473 2168 D
1474 2168 D
S
N
1468 2183 M
1467 2182 D
1458 2180 D
1453 2179 D
1452 2176 D
1452 2173 D
1453 2170 D
1458 2168 D
1462 2168 D
1465 2170 D
1468 2173 D
S
N
1458 2180 M
1455 2179 D
1453 2176 D
1453 2173 D
1455 2170 D
1458 2168 D
S
N
1485 2200 M
1485 2168 D
S
N
1486 2200 M
1495 2173 D
S
N
1485 2200 M
1495 2168 D
S
N
1506 2200 M
1495 2168 D
S
N
1506 2200 M
1506 2168 D
S
N
1508 2200 M
1508 2168 D
S
N
1480 2200 M
1486 2200 D
S
N
1506 2200 M
1512 2200 D
S
N
1480 2168 M
1489 2168 D
S
N
1502 2168 M
1512 2168 D
S
N
1541 2195 M
1542 2191 D
1542 2200 D
1541 2195 D
1538 2198 D
1533 2200 D
1530 2200 D
1526 2198 D
1523 2195 D
1521 2192 D
1520 2188 D
1520 2180 D
1521 2176 D
1523 2173 D
1526 2170 D
1530 2168 D
1533 2168 D
1538 2170 D
1541 2173 D
1542 2176 D
S
N
1530 2200 M
1527 2198 D
1524 2195 D
1523 2192 D
1521 2188 D
1521 2180 D
1523 2176 D
1524 2173 D
1527 2170 D
1530 2168 D
S
N
1574 2188 M
1572 2191 D
1569 2192 D
1565 2192 D
1562 2191 D
1560 2189 D
1559 2185 D
1559 2180 D
1560 2177 D
1563 2176 D
1568 2176 D
1571 2177 D
1572 2180 D
S
N
1565 2192 M
1562 2189 D
1560 2185 D
1560 2180 D
1562 2177 D
1563 2176 D
S
N
1574 2192 M
1572 2180 D
1572 2177 D
1575 2176 D
1579 2176 D
1582 2179 D
1583 2183 D
1583 2186 D
1582 2191 D
1580 2194 D
1577 2197 D
1574 2198 D
1569 2200 D
1565 2200 D
1560 2198 D
1557 2197 D
1554 2194 D
1553 2191 D
1551 2186 D
1551 2182 D
1553 2177 D
1554 2174 D
1557 2171 D
1560 2170 D
1565 2168 D
1569 2168 D
1574 2170 D
1577 2171 D
1579 2173 D
S
N
1575 2192 M
1574 2180 D
1574 2177 D
1575 2176 D
S
N
1595 2200 M
1595 2168 D
S
N
1597 2200 M
1615 2171 D
S
N
1597 2197 M
1615 2168 D
S
N
1615 2200 M
1615 2168 D
S
N
1591 2200 M
1597 2200 D
S
N
1610 2200 M
1619 2200 D
S
N
1591 2168 M
1600 2168 D
S
N
1630 2200 M
1630 2168 D
S
N
1631 2200 M
1631 2168 D
S
N
1625 2200 M
1636 2200 D
S
N
1625 2168 M
1648 2168 D
1648 2177 D
1646 2168 D
S
N
1665 2200 M
1660 2198 D
1657 2195 D
1655 2192 D
1654 2186 D
1654 2182 D
1655 2176 D
1657 2173 D
1660 2170 D
1665 2168 D
1668 2168 D
1672 2170 D
1675 2173 D
1677 2176 D
1678 2182 D
1678 2186 D
1677 2192 D
1675 2195 D
1672 2198 D
1668 2200 D
1665 2200 D
S
N
1665 2200 M
1662 2198 D
1659 2195 D
1657 2192 D
1655 2186 D
1655 2182 D
1657 2176 D
1659 2173 D
1662 2170 D
1665 2168 D
S
N
1668 2168 M
1671 2170 D
1674 2173 D
1675 2176 D
1677 2182 D
1677 2186 D
1675 2192 D
1674 2195 D
1671 2198 D
1668 2200 D
S
N
1702 2195 M
1702 2168 D
S
N
1689 2182 M
1716 2182 D
S
N
1729 2200 M
1729 2168 D
S
N
1731 2200 M
1731 2168 D
S
N
1731 2185 M
1734 2188 D
1738 2189 D
1742 2189 D
1746 2188 D
1748 2185 D
1748 2168 D
S
N
1742 2189 M
1745 2188 D
1746 2185 D
1746 2168 D
S
N
1725 2200 M
1731 2200 D
S
N
1725 2168 M
1735 2168 D
S
N
1742 2168 M
1752 2168 D
S
N
1761 2180 M
1779 2180 D
1779 2183 D
1778 2186 D
1776 2188 D
1773 2189 D
1769 2189 D
1764 2188 D
1761 2185 D
1760 2180 D
1760 2177 D
1761 2173 D
1764 2170 D
1769 2168 D
1772 2168 D
1776 2170 D
1779 2173 D
S
N
1778 2180 M
1778 2185 D
1776 2188 D
S
N
1769 2189 M
1766 2188 D
1763 2185 D
1761 2180 D
1761 2177 D
1763 2173 D
1766 2170 D
1769 2168 D
S
N
1791 2189 M
1791 2168 D
S
N
1793 2189 M
1793 2168 D
S
N
1793 2180 M
1794 2185 D
1797 2188 D
1800 2189 D
1805 2189 D
1806 2188 D
1806 2186 D
1805 2185 D
1803 2186 D
1805 2188 D
S
N
1787 2189 M
1793 2189 D
S
N
1787 2168 M
1797 2168 D
S
N
1815 2189 M
1822 2168 D
S
N
1817 2189 M
1822 2173 D
S
N
1828 2189 M
1822 2168 D
S
N
1828 2189 M
1834 2168 D
S
N
1829 2189 M
1834 2173 D
S
N
1840 2189 M
1834 2168 D
S
N
1811 2189 M
1822 2189 D
S
N
1835 2189 M
1844 2189 D
S
N
1853 2200 M
1852 2198 D
1853 2197 D
1855 2198 D
1853 2200 D
S
N
1853 2189 M
1853 2168 D
S
N
1855 2189 M
1855 2168 D
S
N
1849 2189 M
1855 2189 D
S
N
1849 2168 M
1859 2168 D
S
N
1874 2189 M
1871 2188 D
1870 2186 D
1868 2183 D
1868 2180 D
1870 2177 D
1871 2176 D
1874 2174 D
1877 2174 D
1880 2176 D
1882 2177 D
1883 2180 D
1883 2183 D
1882 2186 D
1880 2188 D
1877 2189 D
1874 2189 D
S
N
1871 2188 M
1870 2185 D
1870 2179 D
1871 2176 D
S
N
1880 2176 M
1882 2179 D
1882 2185 D
1880 2188 D
S
N
1882 2186 M
1883 2188 D
1886 2189 D
1886 2188 D
1883 2188 D
S
N
1870 2177 M
1868 2176 D
1867 2173 D
1867 2171 D
1868 2168 D
1873 2167 D
1880 2167 D
1885 2165 D
1886 2164 D
S
N
1867 2171 M
1868 2170 D
1873 2168 D
1880 2168 D
1885 2167 D
1886 2164 D
1886 2162 D
1885 2159 D
1880 2158 D
1871 2158 D
1867 2159 D
1865 2162 D
1865 2164 D
1867 2167 D
1871 2168 D
S
N
1455 2131 M
1455 2099 D
S
N
1456 2131 M
1456 2099 D
S
N
1450 2131 M
1468 2131 D
1473 2129 D
1474 2128 D
1476 2125 D
1476 2120 D
1474 2117 D
1473 2116 D
1468 2114 D
1456 2114 D
S
N
1468 2131 M
1471 2129 D
1473 2128 D
1474 2125 D
1474 2120 D
1473 2117 D
1471 2116 D
1468 2114 D
S
N
1450 2099 M
1461 2099 D
S
N
1495 2131 M
1491 2129 D
1488 2126 D
1486 2123 D
1485 2117 D
1485 2113 D
1486 2107 D
1488 2104 D
1491 2100 D
1495 2099 D
1499 2099 D
1503 2100 D
1506 2104 D
1508 2107 D
1509 2113 D
1509 2117 D
1508 2123 D
1506 2126 D
1503 2129 D
1499 2131 D
1495 2131 D
S
N
1495 2131 M
1492 2129 D
1489 2126 D
1488 2123 D
1486 2117 D
1486 2113 D
1488 2107 D
1489 2104 D
1492 2100 D
1495 2099 D
S
N
1499 2099 M
1502 2100 D
1505 2104 D
1506 2107 D
1508 2113 D
1508 2117 D
1506 2123 D
1505 2126 D
1502 2129 D
1499 2131 D
S
N
1520 2131 M
1526 2099 D
S
N
1521 2131 M
1526 2107 D
S
N
1532 2131 M
1526 2099 D
S
N
1532 2131 M
1538 2099 D
S
N
1533 2131 M
1538 2107 D
S
N
1544 2131 M
1538 2099 D
S
N
1515 2131 M
1526 2131 D
S
N
1539 2131 M
1548 2131 D
S
N
1557 2131 M
1557 2099 D
S
N
1559 2131 M
1559 2099 D
S
N
1577 2131 M
1577 2099 D
S
N
1579 2131 M
1579 2099 D
S
N
1553 2131 M
1563 2131 D
S
N
1572 2131 M
1583 2131 D
S
N
1559 2116 M
1577 2116 D
S
N
1553 2099 M
1563 2099 D
S
N
1572 2099 M
1583 2099 D
S
N
1594 2131 M
1594 2099 D
S
N
1595 2131 M
1595 2099 D
S
N
1604 2122 M
1604 2110 D
S
N
1589 2131 M
1613 2131 D
1613 2122 D
1612 2131 D
S
N
1595 2116 M
1604 2116 D
S
N
1589 2099 M
1613 2099 D
1613 2108 D
1612 2099 D
S
N
1625 2131 M
1625 2099 D
S
N
1627 2131 M
1627 2099 D
S
N
1621 2131 M
1631 2131 D
S
N
1621 2099 M
1643 2099 D
1643 2108 D
1642 2099 D
S
N
1665 2126 M
1665 2099 D
S
N
1651 2113 M
1678 2113 D
S
N
1692 2131 M
1692 2099 D
S
N
1693 2131 M
1693 2099 D
S
N
1693 2116 M
1696 2119 D
1701 2120 D
1704 2120 D
1708 2119 D
1710 2116 D
1710 2099 D
S
N
1704 2120 M
1707 2119 D
1708 2116 D
1708 2099 D
S
N
1687 2131 M
1693 2131 D
S
N
1687 2099 M
1698 2099 D
S
N
1704 2099 M
1714 2099 D
S
N
1723 2111 M
1742 2111 D
1742 2114 D
1740 2117 D
1738 2119 D
1735 2120 D
1731 2120 D
1726 2119 D
1723 2116 D
1722 2111 D
1722 2108 D
1723 2104 D
1726 2100 D
1731 2099 D
1734 2099 D
1738 2100 D
1742 2104 D
S
N
1740 2111 M
1740 2116 D
1738 2119 D
S
N
1731 2120 M
1728 2119 D
1725 2116 D
1723 2111 D
1723 2108 D
1725 2104 D
1728 2100 D
1731 2099 D
S
N
1754 2120 M
1754 2099 D
S
N
1755 2120 M
1755 2099 D
S
N
1755 2111 M
1757 2116 D
1760 2119 D
1763 2120 D
1767 2120 D
1769 2119 D
1769 2117 D
1767 2116 D
1766 2117 D
1767 2119 D
S
N
1749 2120 M
1755 2120 D
S
N
1749 2099 M
1760 2099 D
S
N
1778 2120 M
1784 2099 D
S
N
1779 2120 M
1784 2104 D
S
N
1790 2120 M
1784 2099 D
S
N
1790 2120 M
1796 2099 D
S
N
1791 2120 M
1796 2104 D
S
N
1802 2120 M
1796 2099 D
S
N
1773 2120 M
1784 2120 D
S
N
1797 2120 M
1806 2120 D
S
N
1815 2131 M
1814 2129 D
1815 2128 D
1817 2129 D
1815 2131 D
S
N
1815 2120 M
1815 2099 D
S
N
1817 2120 M
1817 2099 D
S
N
1811 2120 M
1817 2120 D
S
N
1811 2099 M
1822 2099 D
S
N
1837 2120 M
1834 2119 D
1832 2117 D
1831 2114 D
1831 2111 D
1832 2108 D
1834 2107 D
1837 2105 D
1840 2105 D
1843 2107 D
1844 2108 D
1846 2111 D
1846 2114 D
1844 2117 D
1843 2119 D
1840 2120 D
1837 2120 D
S
N
1834 2119 M
1832 2116 D
1832 2110 D
1834 2107 D
S
N
1843 2107 M
1844 2110 D
1844 2116 D
1843 2119 D
S
N
1844 2117 M
1846 2119 D
1849 2120 D
1849 2119 D
1846 2119 D
S
N
1832 2108 M
1831 2107 D
1829 2104 D
1829 2102 D
1831 2099 D
1835 2097 D
1843 2097 D
1847 2096 D
1849 2094 D
S
N
1829 2102 M
1831 2100 D
1835 2099 D
1843 2099 D
1847 2097 D
1849 2094 D
1849 2093 D
1847 2090 D
1843 2088 D
1834 2088 D
1829 2090 D
1828 2093 D
1828 2094 D
1829 2097 D
1834 2099 D
S
1 Sw
N
1986 2034 M
2003 2034 D
S
N
1986 2034 M
2003 2034 D
S
N
1986 2031 M
1986 2037 D
S
N
2003 2031 M
2003 2043 D
1998 2043 D
2003 2042 D
S
N
1986 2048 M
2003 2048 D
S
N
1986 2049 M
2003 2049 D
S
N
1986 2058 M
2003 2058 D
S
N
1986 2059 M
2003 2059 D
S
N
1986 2046 M
1986 2051 D
S
N
1986 2056 M
1986 2062 D
S
N
1994 2049 M
1994 2058 D
S
N
2003 2046 M
2003 2051 D
S
N
2003 2056 M
2003 2062 D
S
N
1988 2077 M
1991 2078 D
1986 2078 D
1988 2077 D
1987 2075 D
1986 2073 D
1986 2071 D
1987 2069 D
1988 2067 D
1990 2066 D
1992 2066 D
1996 2066 D
1999 2066 D
2000 2067 D
2002 2069 D
2003 2071 D
2003 2073 D
2002 2075 D
2000 2077 D
1999 2078 D
S
N
1986 2071 M
1987 2070 D
1988 2068 D
1990 2067 D
1992 2066 D
1996 2066 D
1999 2067 D
2000 2068 D
2002 2070 D
2003 2071 D
S
N
1986 2097 M
2003 2097 D
S
N
1986 2097 M
2003 2097 D
S
N
1986 2107 M
2003 2107 D
S
N
1986 2108 M
2003 2108 D
S
N
1986 2094 M
1986 2100 D
S
N
1986 2105 M
1986 2110 D
S
N
1994 2097 M
1994 2107 D
S
N
2003 2094 M
2003 2100 D
S
N
2003 2105 M
2003 2110 D
S
N
1986 2116 M
2003 2116 D
S
N
1986 2117 M
2003 2117 D
S
N
1986 2113 M
1986 2119 D
S
N
2003 2113 M
2003 2119 D
S
N
1988 2134 M
1991 2135 D
1986 2135 D
1988 2134 D
1987 2132 D
1986 2130 D
1986 2129 D
1987 2126 D
1988 2125 D
1990 2124 D
1992 2123 D
1996 2123 D
1999 2124 D
2000 2125 D
2002 2126 D
2003 2129 D
2003 2130 D
2002 2132 D
2000 2134 D
S
N
1986 2129 M
1987 2127 D
1988 2125 D
1990 2125 D
1992 2124 D
1996 2124 D
1999 2125 D
2000 2125 D
2002 2127 D
2003 2129 D
S
N
1996 2134 M
2003 2134 D
S
N
1996 2135 M
2003 2135 D
S
N
1996 2132 M
1996 2137 D
S
N
1988 2152 M
1991 2153 D
1986 2153 D
1988 2152 D
1987 2151 D
1986 2148 D
1986 2147 D
1987 2144 D
1988 2143 D
1990 2142 D
1992 2141 D
1996 2141 D
1999 2142 D
2000 2143 D
2002 2144 D
2003 2147 D
2003 2148 D
2002 2151 D
2000 2152 D
S
N
1986 2147 M
1987 2145 D
1988 2144 D
1990 2143 D
1992 2142 D
1996 2142 D
1999 2143 D
2000 2144 D
2002 2145 D
2003 2147 D
S
N
1996 2152 M
2003 2152 D
S
N
1996 2153 M
2003 2153 D
S
N
1996 2150 M
1996 2156 D
S
N
1988 2170 M
1986 2171 D
1991 2171 D
1988 2170 D
1987 2168 D
1986 2166 D
1986 2164 D
1987 2161 D
1988 2160 D
1990 2160 D
1991 2160 D
1992 2161 D
1993 2163 D
1995 2168 D
1995 2169 D
1997 2171 D
S
N
1990 2160 M
1991 2161 D
1992 2163 D
1994 2168 D
1995 2169 D
1995 2170 D
1997 2171 D
2000 2171 D
2002 2169 D
2003 2167 D
2003 2164 D
2002 2162 D
2000 2160 D
1998 2160 D
2003 2160 D
2000 2160 D
S
N
1986 2188 M
2003 2199 D
S
N
1986 2189 M
2003 2199 D
S
N
1986 2199 M
2003 2188 D
S
N
1986 2187 M
1986 2191 D
S
N
1986 2196 M
1986 2201 D
S
N
2003 2187 M
2003 2191 D
S
N
2003 2196 M
2003 2201 D
S
N
1988 2215 M
1986 2215 D
1991 2215 D
1988 2215 D
1987 2213 D
1986 2211 D
1986 2208 D
1987 2206 D
1988 2204 D
1990 2204 D
1991 2205 D
1992 2206 D
1993 2207 D
1995 2212 D
1995 2214 D
1997 2215 D
S
N
1990 2204 M
1991 2206 D
1992 2207 D
1994 2212 D
1995 2214 D
1995 2215 D
1997 2215 D
2000 2215 D
2002 2214 D
2003 2211 D
2003 2209 D
2002 2207 D
2000 2205 D
1998 2204 D
2003 2204 D
2000 2205 D
S
N
1986 2234 M
2003 2237 D
S
N
1986 2234 M
1999 2237 D
S
N
1986 2240 M
2003 2237 D
S
N
1986 2240 M
2003 2243 D
S
N
1986 2241 M
1999 2243 D
S
N
1986 2246 M
2003 2243 D
S
N
1986 2231 M
1986 2237 D
S
N
1986 2244 M
1986 2249 D
S
N
1988 2263 M
1991 2264 D
1986 2264 D
1988 2263 D
1987 2262 D
1986 2259 D
1986 2258 D
1987 2255 D
1988 2254 D
1990 2253 D
1992 2252 D
1996 2252 D
1999 2253 D
2000 2254 D
2002 2255 D
2003 2258 D
2003 2259 D
2002 2262 D
2000 2263 D
S
N
1986 2258 M
1987 2256 D
1988 2254 D
1990 2254 D
1992 2253 D
1996 2253 D
1999 2254 D
2000 2254 D
2002 2256 D
2003 2258 D
S
N
1996 2263 M
2003 2263 D
S
N
1996 2264 M
2003 2264 D
S
N
1996 2261 M
1996 2266 D
S
N
1989 2284 M
1990 2285 D
1991 2284 D
1990 2283 D
1989 2283 D
1987 2284 D
1987 2285 D
1986 2287 D
1986 2290 D
1987 2293 D
1987 2293 D
1989 2294 D
1991 2294 D
1992 2293 D
1994 2291 D
1995 2287 D
1996 2285 D
1998 2284 D
2000 2283 D
2003 2283 D
S
N
1986 2290 M
1987 2292 D
1987 2293 D
1989 2293 D
1991 2293 D
1992 2293 D
1994 2290 D
1995 2287 D
S
N
2001 2283 M
2000 2284 D
2000 2285 D
2002 2289 D
2002 2292 D
2001 2293 D
2000 2294 D
S
N
2000 2285 M
2003 2289 D
2003 2293 D
2002 2293 D
2000 2294 D
1999 2294 D
S
N
1986 2304 M
1987 2301 D
1989 2300 D
1993 2299 D
1995 2299 D
1999 2300 D
2002 2301 D
2003 2304 D
2003 2305 D
2002 2308 D
1999 2309 D
1995 2310 D
1993 2310 D
1989 2309 D
1987 2308 D
1986 2305 D
1986 2304 D
S
N
1986 2304 M
1987 2302 D
1987 2301 D
1989 2301 D
1993 2300 D
1995 2300 D
1999 2301 D
2001 2301 D
2002 2302 D
2003 2304 D
S
N
2003 2305 M
2002 2307 D
2001 2308 D
1999 2309 D
1995 2309 D
1993 2309 D
1989 2309 D
1987 2308 D
1987 2307 D
1986 2305 D
S
N
1989 2317 M
1988 2319 D
1986 2321 D
2003 2321 D
S
N
1987 2321 M
2003 2321 D
S
N
2003 2317 M
2003 2325 D
S
N
1989 2333 M
1988 2335 D
1986 2337 D
2003 2337 D
S
N
1987 2336 M
2003 2336 D
S
N
2003 2333 M
2003 2340 D
S
4 Sw
N
583 2342 M
583 1520 D
S
N
583 1520 M
1967 1520 D
S
N
1967 1520 M
1967 2342 D
S
N
1967 2342 M
583 2342 D
S
N
583 1520 M
583 1551 D
S
N
929 1551 M
929 1520 D
S
N
1275 1520 M
1275 1551 D
S
N
1621 1551 M
1621 1520 D
S
N
1967 1520 M
1967 1551 D
S
N
583 2342 M
1967 2342 D
S
N
583 2311 M
583 2342 D
S
N
929 2342 M
929 2311 D
S
N
1275 2311 M
1275 2342 D
S
N
1621 2342 M
1621 2311 D
S
N
1967 2311 M
1967 2342 D
S
N
583 1520 M
583 2342 D
S
N
583 1611 M
614 1611 D
S
N
593 1672 M
583 1672 D
S
N
583 1716 M
593 1716 D
S
N
614 1750 M
583 1750 D
S
N
583 1777 M
593 1777 D
S
N
593 1801 M
583 1801 D
S
N
583 1821 M
593 1821 D
S
N
593 1839 M
583 1839 D
S
N
583 1855 M
614 1855 D
S
N
614 1959 M
583 1959 D
S
N
583 2021 M
593 2021 D
S
N
593 2064 M
583 2064 D
S
N
583 2098 M
614 2098 D
S
N
593 2126 M
583 2126 D
S
N
583 2149 M
593 2149 D
S
N
593 2169 M
583 2169 D
S
N
583 2187 M
593 2187 D
S
N
614 2203 M
583 2203 D
S
N
583 2308 M
614 2308 D
S
N
442 1624 M
438 1623 D
435 1618 D
433 1611 D
433 1606 D
435 1599 D
438 1594 D
442 1593 D
445 1593 D
450 1594 D
453 1599 D
454 1606 D
454 1611 D
453 1618 D
450 1623 D
445 1624 D
442 1624 D
S
N
442 1624 M
439 1623 D
438 1621 D
436 1618 D
435 1611 D
435 1606 D
436 1599 D
438 1596 D
439 1594 D
442 1593 D
S
N
445 1593 M
448 1594 D
450 1596 D
451 1599 D
453 1606 D
453 1611 D
451 1618 D
450 1621 D
448 1623 D
445 1624 D
S
N
466 1596 M
465 1594 D
466 1593 D
468 1594 D
466 1596 D
S
N
488 1624 M
483 1623 D
480 1618 D
478 1611 D
478 1606 D
480 1599 D
483 1594 D
488 1593 D
491 1593 D
495 1594 D
498 1599 D
500 1606 D
500 1611 D
498 1618 D
495 1623 D
491 1624 D
488 1624 D
S
N
488 1624 M
484 1623 D
483 1621 D
481 1618 D
480 1611 D
480 1606 D
481 1599 D
483 1596 D
484 1594 D
488 1593 D
S
N
491 1593 M
494 1594 D
495 1596 D
497 1599 D
498 1606 D
498 1611 D
497 1618 D
495 1621 D
494 1623 D
491 1624 D
S
N
518 1624 M
513 1623 D
510 1618 D
509 1611 D
509 1606 D
510 1599 D
513 1594 D
518 1593 D
521 1593 D
525 1594 D
528 1599 D
530 1606 D
530 1611 D
528 1618 D
525 1623 D
521 1624 D
518 1624 D
S
N
518 1624 M
515 1623 D
513 1621 D
512 1618 D
510 1611 D
510 1606 D
512 1599 D
513 1596 D
515 1594 D
518 1593 D
S
N
521 1593 M
524 1594 D
525 1596 D
527 1599 D
528 1606 D
528 1611 D
527 1618 D
525 1621 D
524 1623 D
521 1624 D
S
N
540 1618 M
542 1617 D
540 1615 D
539 1617 D
539 1618 D
540 1621 D
542 1623 D
546 1624 D
552 1624 D
557 1623 D
558 1621 D
560 1618 D
560 1615 D
558 1612 D
554 1609 D
546 1606 D
543 1605 D
540 1602 D
539 1597 D
539 1593 D
S
N
552 1624 M
555 1623 D
557 1621 D
558 1618 D
558 1615 D
557 1612 D
552 1609 D
546 1606 D
S
N
539 1596 M
540 1597 D
543 1597 D
551 1594 D
555 1594 D
558 1596 D
560 1597 D
S
N
543 1597 M
551 1593 D
557 1593 D
558 1594 D
560 1597 D
560 1600 D
S
N
442 1763 M
438 1762 D
435 1757 D
433 1750 D
433 1745 D
435 1737 D
438 1733 D
442 1731 D
445 1731 D
450 1733 D
453 1737 D
454 1745 D
454 1750 D
453 1757 D
450 1762 D
445 1763 D
442 1763 D
S
N
442 1763 M
439 1762 D
438 1760 D
436 1757 D
435 1750 D
435 1745 D
436 1737 D
438 1734 D
439 1733 D
442 1731 D
S
N
445 1731 M
448 1733 D
450 1734 D
451 1737 D
453 1745 D
453 1750 D
451 1757 D
450 1760 D
448 1762 D
445 1763 D
S
N
466 1734 M
465 1733 D
466 1731 D
468 1733 D
466 1734 D
S
N
488 1763 M
483 1762 D
480 1757 D
478 1750 D
478 1745 D
480 1737 D
483 1733 D
488 1731 D
491 1731 D
495 1733 D
498 1737 D
500 1745 D
500 1750 D
498 1757 D
495 1762 D
491 1763 D
488 1763 D
S
N
488 1763 M
484 1762 D
483 1760 D
481 1757 D
480 1750 D
480 1745 D
481 1737 D
483 1734 D
484 1733 D
488 1731 D
S
N
491 1731 M
494 1733 D
495 1734 D
497 1737 D
498 1745 D
498 1750 D
497 1757 D
495 1760 D
494 1762 D
491 1763 D
S
N
518 1763 M
513 1762 D
510 1757 D
509 1750 D
509 1745 D
510 1737 D
513 1733 D
518 1731 D
521 1731 D
525 1733 D
528 1737 D
530 1745 D
530 1750 D
528 1757 D
525 1762 D
521 1763 D
518 1763 D
S
N
518 1763 M
515 1762 D
513 1760 D
512 1757 D
510 1750 D
510 1745 D
512 1737 D
513 1734 D
515 1733 D
518 1731 D
S
N
521 1731 M
524 1733 D
525 1734 D
527 1737 D
528 1745 D
528 1750 D
527 1757 D
525 1760 D
524 1762 D
521 1763 D
S
N
542 1763 M
539 1748 D
S
N
539 1748 M
542 1751 D
546 1753 D
551 1753 D
555 1751 D
558 1748 D
560 1744 D
560 1740 D
558 1736 D
555 1733 D
551 1731 D
546 1731 D
542 1733 D
540 1734 D
539 1737 D
539 1739 D
540 1740 D
542 1739 D
540 1737 D
S
N
551 1753 M
554 1751 D
557 1748 D
558 1744 D
558 1740 D
557 1736 D
554 1733 D
551 1731 D
S
N
542 1763 M
557 1763 D
S
N
542 1762 M
549 1762 D
557 1763 D
S
N
442 1868 M
438 1867 D
435 1862 D
433 1855 D
433 1850 D
435 1842 D
438 1838 D
442 1836 D
445 1836 D
450 1838 D
453 1842 D
454 1850 D
454 1855 D
453 1862 D
450 1867 D
445 1868 D
442 1868 D
S
N
442 1868 M
439 1867 D
438 1865 D
436 1862 D
435 1855 D
435 1850 D
436 1842 D
438 1839 D
439 1838 D
442 1836 D
S
N
445 1836 M
448 1838 D
450 1839 D
451 1842 D
453 1850 D
453 1855 D
451 1862 D
450 1865 D
448 1867 D
445 1868 D
S
N
466 1839 M
465 1838 D
466 1836 D
468 1838 D
466 1839 D
S
N
488 1868 M
483 1867 D
480 1862 D
478 1855 D
478 1850 D
480 1842 D
483 1838 D
488 1836 D
491 1836 D
495 1838 D
498 1842 D
500 1850 D
500 1855 D
498 1862 D
495 1867 D
491 1868 D
488 1868 D
S
N
488 1868 M
484 1867 D
483 1865 D
481 1862 D
480 1855 D
480 1850 D
481 1842 D
483 1839 D
484 1838 D
488 1836 D
S
N
491 1836 M
494 1838 D
495 1839 D
497 1842 D
498 1850 D
498 1855 D
497 1862 D
495 1865 D
494 1867 D
491 1868 D
S
N
513 1862 M
516 1864 D
521 1868 D
521 1836 D
S
N
519 1867 M
519 1836 D
S
N
513 1836 M
527 1836 D
S
N
548 1868 M
543 1867 D
540 1862 D
539 1855 D
539 1850 D
540 1842 D
543 1838 D
548 1836 D
551 1836 D
555 1838 D
558 1842 D
560 1850 D
560 1855 D
558 1862 D
555 1867 D
551 1868 D
548 1868 D
S
N
548 1868 M
545 1867 D
543 1865 D
542 1862 D
540 1855 D
540 1850 D
542 1842 D
543 1839 D
545 1838 D
548 1836 D
S
N
551 1836 M
554 1838 D
555 1839 D
557 1842 D
558 1850 D
558 1855 D
557 1862 D
555 1865 D
554 1867 D
551 1868 D
S
N
442 1973 M
438 1972 D
435 1967 D
433 1959 D
433 1955 D
435 1947 D
438 1943 D
442 1941 D
445 1941 D
450 1943 D
453 1947 D
454 1955 D
454 1959 D
453 1967 D
450 1972 D
445 1973 D
442 1973 D
S
N
442 1973 M
439 1972 D
438 1970 D
436 1967 D
435 1959 D
435 1955 D
436 1947 D
438 1944 D
439 1943 D
442 1941 D
S
N
445 1941 M
448 1943 D
450 1944 D
451 1947 D
453 1955 D
453 1959 D
451 1967 D
450 1970 D
448 1972 D
445 1973 D
S
N
466 1944 M
465 1943 D
466 1941 D
468 1943 D
466 1944 D
S
N
488 1973 M
483 1972 D
480 1967 D
478 1959 D
478 1955 D
480 1947 D
483 1943 D
488 1941 D
491 1941 D
495 1943 D
498 1947 D
500 1955 D
500 1959 D
498 1967 D
495 1972 D
491 1973 D
488 1973 D
S
N
488 1973 M
484 1972 D
483 1970 D
481 1967 D
480 1959 D
480 1955 D
481 1947 D
483 1944 D
484 1943 D
488 1941 D
S
N
491 1941 M
494 1943 D
495 1944 D
497 1947 D
498 1955 D
498 1959 D
497 1967 D
495 1970 D
494 1972 D
491 1973 D
S
N
510 1967 M
512 1966 D
510 1964 D
509 1966 D
509 1967 D
510 1970 D
512 1972 D
516 1973 D
522 1973 D
527 1972 D
528 1970 D
530 1967 D
530 1964 D
528 1961 D
524 1958 D
516 1955 D
513 1953 D
510 1950 D
509 1946 D
509 1941 D
S
N
522 1973 M
525 1972 D
527 1970 D
528 1967 D
528 1964 D
527 1961 D
522 1958 D
516 1955 D
S
N
509 1944 M
510 1946 D
513 1946 D
521 1943 D
525 1943 D
528 1944 D
530 1946 D
S
N
513 1946 M
521 1941 D
527 1941 D
528 1943 D
530 1946 D
530 1949 D
S
N
548 1973 M
543 1972 D
540 1967 D
539 1959 D
539 1955 D
540 1947 D
543 1943 D
548 1941 D
551 1941 D
555 1943 D
558 1947 D
560 1955 D
560 1959 D
558 1967 D
555 1972 D
551 1973 D
548 1973 D
S
N
548 1973 M
545 1972 D
543 1970 D
542 1967 D
540 1959 D
540 1955 D
542 1947 D
543 1944 D
545 1943 D
548 1941 D
S
N
551 1941 M
554 1943 D
555 1944 D
557 1947 D
558 1955 D
558 1959 D
557 1967 D
555 1970 D
554 1972 D
551 1973 D
S
N
442 2112 M
438 2110 D
435 2106 D
433 2098 D
433 2094 D
435 2086 D
438 2082 D
442 2080 D
445 2080 D
450 2082 D
453 2086 D
454 2094 D
454 2098 D
453 2106 D
450 2110 D
445 2112 D
442 2112 D
S
N
442 2112 M
439 2110 D
438 2109 D
436 2106 D
435 2098 D
435 2094 D
436 2086 D
438 2083 D
439 2082 D
442 2080 D
S
N
445 2080 M
448 2082 D
450 2083 D
451 2086 D
453 2094 D
453 2098 D
451 2106 D
450 2109 D
448 2110 D
445 2112 D
S
N
466 2083 M
465 2082 D
466 2080 D
468 2082 D
466 2083 D
S
N
488 2112 M
483 2110 D
480 2106 D
478 2098 D
478 2094 D
480 2086 D
483 2082 D
488 2080 D
491 2080 D
495 2082 D
498 2086 D
500 2094 D
500 2098 D
498 2106 D
495 2110 D
491 2112 D
488 2112 D
S
N
488 2112 M
484 2110 D
483 2109 D
481 2106 D
480 2098 D
480 2094 D
481 2086 D
483 2083 D
484 2082 D
488 2080 D
S
N
491 2080 M
494 2082 D
495 2083 D
497 2086 D
498 2094 D
498 2098 D
497 2106 D
495 2109 D
494 2110 D
491 2112 D
S
N
512 2112 M
509 2097 D
S
N
509 2097 M
512 2100 D
516 2101 D
521 2101 D
525 2100 D
528 2097 D
530 2092 D
530 2089 D
528 2085 D
525 2082 D
521 2080 D
516 2080 D
512 2082 D
510 2083 D
509 2086 D
509 2088 D
510 2089 D
512 2088 D
510 2086 D
S
N
521 2101 M
524 2100 D
527 2097 D
528 2092 D
528 2089 D
527 2085 D
524 2082 D
521 2080 D
S
N
512 2112 M
527 2112 D
S
N
512 2110 M
519 2110 D
527 2112 D
S
N
548 2112 M
543 2110 D
540 2106 D
539 2098 D
539 2094 D
540 2086 D
543 2082 D
548 2080 D
551 2080 D
555 2082 D
558 2086 D
560 2094 D
560 2098 D
558 2106 D
555 2110 D
551 2112 D
548 2112 D
S
N
548 2112 M
545 2110 D
543 2109 D
542 2106 D
540 2098 D
540 2094 D
542 2086 D
543 2083 D
545 2082 D
548 2080 D
S
N
551 2080 M
554 2082 D
555 2083 D
557 2086 D
558 2094 D
558 2098 D
557 2106 D
555 2109 D
554 2110 D
551 2112 D
S
N
442 2217 M
438 2215 D
435 2211 D
433 2203 D
433 2199 D
435 2191 D
438 2187 D
442 2185 D
445 2185 D
450 2187 D
453 2191 D
454 2199 D
454 2203 D
453 2211 D
450 2215 D
445 2217 D
442 2217 D
S
N
442 2217 M
439 2215 D
438 2214 D
436 2211 D
435 2203 D
435 2199 D
436 2191 D
438 2188 D
439 2187 D
442 2185 D
S
N
445 2185 M
448 2187 D
450 2188 D
451 2191 D
453 2199 D
453 2203 D
451 2211 D
450 2214 D
448 2215 D
445 2217 D
S
N
466 2188 M
465 2187 D
466 2185 D
468 2187 D
466 2188 D
S
N
483 2211 M
486 2212 D
491 2217 D
491 2185 D
S
N
489 2215 M
489 2185 D
S
N
483 2185 M
497 2185 D
S
N
518 2217 M
513 2215 D
510 2211 D
509 2203 D
509 2199 D
510 2191 D
513 2187 D
518 2185 D
521 2185 D
525 2187 D
528 2191 D
530 2199 D
530 2203 D
528 2211 D
525 2215 D
521 2217 D
518 2217 D
S
N
518 2217 M
515 2215 D
513 2214 D
512 2211 D
510 2203 D
510 2199 D
512 2191 D
513 2188 D
515 2187 D
518 2185 D
S
N
521 2185 M
524 2187 D
525 2188 D
527 2191 D
528 2199 D
528 2203 D
527 2211 D
525 2214 D
524 2215 D
521 2217 D
S
N
548 2217 M
543 2215 D
540 2211 D
539 2203 D
539 2199 D
540 2191 D
543 2187 D
548 2185 D
551 2185 D
555 2187 D
558 2191 D
560 2199 D
560 2203 D
558 2211 D
555 2215 D
551 2217 D
548 2217 D
S
N
548 2217 M
545 2215 D
543 2214 D
542 2211 D
540 2203 D
540 2199 D
542 2191 D
543 2188 D
545 2187 D
548 2185 D
S
N
551 2185 M
554 2187 D
555 2188 D
557 2191 D
558 2199 D
558 2203 D
557 2211 D
555 2214 D
554 2215 D
551 2217 D
S
N
442 2322 M
438 2320 D
435 2316 D
433 2308 D
433 2304 D
435 2296 D
438 2292 D
442 2290 D
445 2290 D
450 2292 D
453 2296 D
454 2304 D
454 2308 D
453 2316 D
450 2320 D
445 2322 D
442 2322 D
S
N
442 2322 M
439 2320 D
438 2319 D
436 2316 D
435 2308 D
435 2304 D
436 2296 D
438 2293 D
439 2292 D
442 2290 D
S
N
445 2290 M
448 2292 D
450 2293 D
451 2296 D
453 2304 D
453 2308 D
451 2316 D
450 2319 D
448 2320 D
445 2322 D
S
N
466 2293 M
465 2292 D
466 2290 D
468 2292 D
466 2293 D
S
N
480 2316 M
481 2314 D
480 2313 D
478 2314 D
478 2316 D
480 2319 D
481 2320 D
486 2322 D
492 2322 D
497 2320 D
498 2319 D
500 2316 D
500 2313 D
498 2310 D
494 2307 D
486 2304 D
483 2302 D
480 2299 D
478 2295 D
478 2290 D
S
N
492 2322 M
495 2320 D
497 2319 D
498 2316 D
498 2313 D
497 2310 D
492 2307 D
486 2304 D
S
N
478 2293 M
480 2295 D
483 2295 D
491 2292 D
495 2292 D
498 2293 D
500 2295 D
S
N
483 2295 M
491 2290 D
497 2290 D
498 2292 D
500 2295 D
500 2298 D
S
N
518 2322 M
513 2320 D
510 2316 D
509 2308 D
509 2304 D
510 2296 D
513 2292 D
518 2290 D
521 2290 D
525 2292 D
528 2296 D
530 2304 D
530 2308 D
528 2316 D
525 2320 D
521 2322 D
518 2322 D
S
N
518 2322 M
515 2320 D
513 2319 D
512 2316 D
510 2308 D
510 2304 D
512 2296 D
513 2293 D
515 2292 D
518 2290 D
S
N
521 2290 M
524 2292 D
525 2293 D
527 2296 D
528 2304 D
528 2308 D
527 2316 D
525 2319 D
524 2320 D
521 2322 D
S
N
548 2322 M
543 2320 D
540 2316 D
539 2308 D
539 2304 D
540 2296 D
543 2292 D
548 2290 D
551 2290 D
555 2292 D
558 2296 D
560 2304 D
560 2308 D
558 2316 D
555 2320 D
551 2322 D
548 2322 D
S
N
548 2322 M
545 2320 D
543 2319 D
542 2316 D
540 2308 D
540 2304 D
542 2296 D
543 2293 D
545 2292 D
548 2290 D
S
N
551 2290 M
554 2292 D
555 2293 D
557 2296 D
558 2304 D
558 2308 D
557 2316 D
555 2319 D
554 2320 D
551 2322 D
S
N
1967 1520 M
1967 2342 D
S
N
1936 1611 M
1967 1611 D
S
N
1967 1672 M
1957 1672 D
S
N
1957 1716 M
1967 1716 D
S
N
1967 1750 M
1936 1750 D
S
N
1957 1777 M
1967 1777 D
S
N
1967 1801 M
1957 1801 D
S
N
1957 1821 M
1967 1821 D
S
N
1967 1839 M
1957 1839 D
S
N
1936 1855 M
1967 1855 D
S
N
1967 1959 M
1936 1959 D
S
N
1957 2021 M
1967 2021 D
S
N
1967 2064 M
1957 2064 D
S
N
1936 2098 M
1967 2098 D
S
N
1967 2126 M
1957 2126 D
S
N
1957 2149 M
1967 2149 D
S
N
1967 2169 M
1957 2169 D
S
N
1957 2187 M
1967 2187 D
S
N
1967 2203 M
1936 2203 D
S
N
1936 2308 M
1967 2308 D
S
N
1327 2186 M
1431 2186 D
S
583 1520 P
N
583 1520 M
583 2031 D
929 2031 D
929 1815 D
1275 1815 D
1275 2021 D
1621 2021 D
1621 1599 D
1967 1599 D
S
0 0 1 setrgbcolor
N
1327 2117 M
1339 2117 D
S
N
1351 2117 M
1363 2117 D
S
N
1375 2117 M
1387 2117 D
S
N
1400 2117 M
1412 2117 D
S
N
1424 2117 M
1431 2117 D
S
583 1520 P
N
583 1520 M
583 1532 D
S
N
583 1544 M
583 1557 D
S
N
583 1569 M
583 1581 D
S
N
583 1593 M
583 1605 D
S
N
583 1617 M
583 1629 D
S
N
583 1641 M
583 1653 D
S
N
583 1666 M
583 1678 D
S
N
583 1690 M
583 1702 D
S
N
583 1714 M
583 1726 D
S
N
583 1738 M
583 1750 D
S
N
583 1762 M
583 1775 D
S
N
583 1787 M
583 1799 D
S
N
583 1811 M
583 1823 D
S
N
583 1835 M
583 1847 D
S
N
583 1859 M
583 1871 D
S
N
583 1884 M
583 1896 D
S
N
583 1908 M
583 1920 D
S
N
583 1932 M
583 1944 D
S
N
583 1956 M
583 1968 D
S
N
583 1980 M
583 1993 D
S
N
583 2005 M
583 2017 D
S
N
583 2029 M
583 2031 D
593 2031 D
S
N
605 2031 M
618 2031 D
S
N
630 2031 M
642 2031 D
S
N
654 2031 M
666 2031 D
S
N
678 2031 M
690 2031 D
S
N
702 2031 M
714 2031 D
S
N
727 2031 M
739 2031 D
S
N
751 2031 M
763 2031 D
S
N
775 2031 M
787 2031 D
S
N
799 2031 M
811 2031 D
S
N
823 2031 M
836 2031 D
S
N
848 2031 M
860 2031 D
S
N
872 2031 M
884 2031 D
S
N
896 2031 M
908 2031 D
S
N
920 2031 M
929 2031 D
929 2027 D
S
N
929 2015 M
929 2003 D
S
N
929 1991 M
929 1979 D
S
N
929 1967 M
929 1955 D
S
N
929 1942 M
929 1930 D
S
N
929 1918 M
929 1906 D
S
N
929 1894 M
929 1882 D
S
N
929 1870 M
929 1858 D
S
N
929 1846 M
929 1833 D
S
N
929 1821 M
929 1809 D
S
N
941 1809 M
953 1809 D
S
N
965 1809 M
977 1809 D
S
N
989 1809 M
1001 1809 D
S
N
1014 1809 M
1026 1809 D
S
N
1038 1809 M
1050 1809 D
S
N
1062 1809 M
1074 1809 D
S
N
1086 1809 M
1098 1809 D
S
N
1110 1809 M
1123 1809 D
S
N
1135 1809 M
1147 1809 D
S
N
1159 1809 M
1171 1809 D
S
N
1183 1809 M
1195 1809 D
S
N
1207 1809 M
1219 1809 D
S
N
1232 1809 M
1244 1809 D
S
N
1256 1809 M
1268 1809 D
S
N
1275 1814 M
1275 1826 D
S
N
1275 1838 M
1275 1850 D
S
N
1275 1862 M
1275 1875 D
S
N
1275 1887 M
1275 1899 D
S
N
1275 1911 M
1275 1923 D
S
N
1275 1935 M
1275 1947 D
S
N
1275 1959 M
1275 1971 D
S
N
1275 1984 M
1275 1996 D
S
N
1275 2008 M
1275 2020 D
S
N
1287 2020 M
1299 2020 D
S
N
1311 2020 M
1323 2020 D
S
N
1335 2020 M
1347 2020 D
S
N
1359 2020 M
1371 2020 D
S
N
1384 2020 M
1396 2020 D
S
N
1408 2020 M
1420 2020 D
S
N
1432 2020 M
1444 2020 D
S
N
1456 2020 M
1468 2020 D
S
N
1480 2020 M
1492 2020 D
S
N
1505 2020 M
1517 2020 D
S
N
1529 2020 M
1541 2020 D
S
N
1553 2020 M
1565 2020 D
S
N
1577 2020 M
1589 2020 D
S
N
1601 2020 M
1614 2020 D
S
N
1621 2016 M
1621 2004 D
S
N
1621 1991 M
1621 1979 D
S
N
1621 1967 M
1621 1955 D
S
N
1621 1943 M
1621 1931 D
S
N
1621 1919 M
1621 1907 D
S
N
1621 1895 M
1621 1882 D
S
N
1621 1870 M
1621 1858 D
S
N
1621 1846 M
1621 1834 D
S
N
1621 1822 M
1621 1810 D
S
N
1621 1798 M
1621 1786 D
S
N
1621 1773 M
1621 1761 D
S
N
1621 1749 M
1621 1737 D
S
N
1621 1725 M
1621 1713 D
S
N
1621 1701 M
1621 1689 D
S
N
1621 1677 M
1621 1664 D
S
N
1621 1652 M
1621 1640 D
S
N
1621 1628 M
1621 1616 D
S
N
1621 1604 M
1621 1594 D
1624 1594 D
S
N
1636 1594 M
1648 1594 D
S
N
1660 1594 M
1672 1594 D
S
N
1684 1594 M
1696 1594 D
S
N
1708 1594 M
1720 1594 D
S
N
1733 1594 M
1745 1594 D
S
N
1757 1594 M
1769 1594 D
S
N
1781 1594 M
1793 1594 D
S
N
1805 1594 M
1817 1594 D
S
N
1829 1594 M
1842 1594 D
S
N
1854 1594 M
1866 1594 D
S
N
1878 1594 M
1890 1594 D
S
N
1902 1594 M
1914 1594 D
S
N
1926 1594 M
1938 1594 D
S
N
1951 1594 M
1963 1594 D
S
3 Sw
0 0 0 setrgbcolor
N
833 1477 M
833 1476 D
832 1476 D
832 1477 D
833 1478 D
836 1480 D
841 1480 D
844 1478 D
845 1477 D
847 1474 D
847 1465 D
848 1462 D
849 1461 D
S
N
845 1477 M
845 1465 D
847 1462 D
849 1461 D
851 1461 D
S
N
845 1474 M
844 1473 D
836 1472 D
832 1470 D
830 1467 D
830 1465 D
832 1462 D
836 1461 D
840 1461 D
843 1462 D
845 1465 D
S
N
836 1472 M
833 1470 D
832 1467 D
832 1465 D
833 1462 D
836 1461 D
S
N
860 1489 M
860 1461 D
S
N
862 1489 M
870 1465 D
S
N
860 1489 M
870 1461 D
S
N
879 1489 M
870 1461 D
S
N
879 1489 M
879 1461 D
S
N
881 1489 M
881 1461 D
S
N
856 1489 M
862 1489 D
S
N
879 1489 M
885 1489 D
S
N
856 1461 M
864 1461 D
S
N
875 1461 M
885 1461 D
S
N
911 1485 M
912 1481 D
912 1489 D
911 1485 D
908 1488 D
904 1489 D
901 1489 D
897 1488 D
895 1485 D
893 1482 D
892 1478 D
892 1472 D
893 1467 D
895 1465 D
897 1462 D
901 1461 D
904 1461 D
908 1462 D
911 1465 D
912 1467 D
S
N
901 1489 M
899 1488 D
896 1485 D
895 1482 D
893 1478 D
893 1472 D
895 1467 D
896 1465 D
899 1462 D
901 1461 D
S
N
941 1478 M
940 1481 D
937 1482 D
933 1482 D
930 1481 D
929 1480 D
927 1476 D
927 1472 D
929 1469 D
931 1467 D
936 1467 D
938 1469 D
940 1472 D
S
N
933 1482 M
930 1480 D
929 1476 D
929 1472 D
930 1469 D
931 1467 D
S
N
941 1482 M
940 1472 D
940 1469 D
942 1467 D
945 1467 D
948 1470 D
949 1474 D
949 1477 D
948 1481 D
947 1484 D
944 1487 D
941 1488 D
937 1489 D
933 1489 D
929 1488 D
926 1487 D
923 1484 D
922 1481 D
921 1477 D
921 1473 D
922 1469 D
923 1466 D
926 1463 D
929 1462 D
933 1461 D
937 1461 D
941 1462 D
944 1463 D
945 1465 D
S
N
942 1482 M
941 1472 D
941 1469 D
942 1467 D
S
N
960 1489 M
960 1461 D
S
N
962 1489 M
978 1463 D
S
N
962 1487 M
978 1461 D
S
N
978 1489 M
978 1461 D
S
N
956 1489 M
962 1489 D
S
N
974 1489 M
982 1489 D
S
N
956 1461 M
964 1461 D
S
N
992 1489 M
992 1461 D
S
N
993 1489 M
993 1461 D
S
N
988 1489 M
997 1489 D
S
N
988 1461 M
1008 1461 D
1008 1469 D
1007 1461 D
S
N
1023 1489 M
1019 1488 D
1016 1485 D
1015 1482 D
1014 1477 D
1014 1473 D
1015 1467 D
1016 1465 D
1019 1462 D
1023 1461 D
1026 1461 D
1030 1462 D
1033 1465 D
1034 1467 D
1035 1473 D
1035 1477 D
1034 1482 D
1033 1485 D
1030 1488 D
1026 1489 D
1023 1489 D
S
N
1023 1489 M
1020 1488 D
1018 1485 D
1016 1482 D
1015 1477 D
1015 1473 D
1016 1467 D
1018 1465 D
1020 1462 D
1023 1461 D
S
N
1026 1461 M
1029 1462 D
1031 1465 D
1033 1467 D
1034 1473 D
1034 1477 D
1033 1482 D
1031 1485 D
1029 1488 D
1026 1489 D
S
N
1046 1480 M
1045 1478 D
1046 1477 D
1048 1478 D
1046 1480 D
S
N
1046 1463 M
1045 1462 D
1046 1461 D
1048 1462 D
1046 1463 D
S
N
1093 1477 M
1094 1480 D
1094 1474 D
1093 1477 D
1092 1478 D
1089 1480 D
1083 1480 D
1081 1478 D
1079 1477 D
1079 1474 D
1081 1473 D
1083 1472 D
1090 1469 D
1093 1467 D
1094 1466 D
S
N
1079 1476 M
1081 1474 D
1083 1473 D
1090 1470 D
1093 1469 D
1094 1467 D
1094 1463 D
1093 1462 D
1090 1461 D
1085 1461 D
1082 1462 D
1081 1463 D
1079 1466 D
1079 1461 D
1081 1463 D
S
N
1119 1476 M
1118 1474 D
1119 1473 D
1120 1474 D
1120 1476 D
1118 1478 D
1115 1480 D
1111 1480 D
1107 1478 D
1104 1476 D
1103 1472 D
1103 1469 D
1104 1465 D
1107 1462 D
1111 1461 D
1114 1461 D
1118 1462 D
1120 1465 D
S
N
1111 1480 M
1108 1478 D
1105 1476 D
1104 1472 D
1104 1469 D
1105 1465 D
1108 1462 D
1111 1461 D
S
N
1131 1477 M
1131 1476 D
1130 1476 D
1130 1477 D
1131 1478 D
1134 1480 D
1140 1480 D
1142 1478 D
1144 1477 D
1145 1474 D
1145 1465 D
1146 1462 D
1148 1461 D
S
N
1144 1477 M
1144 1465 D
1145 1462 D
1148 1461 D
1149 1461 D
S
N
1144 1474 M
1142 1473 D
1134 1472 D
1130 1470 D
1129 1467 D
1129 1465 D
1130 1462 D
1134 1461 D
1138 1461 D
1141 1462 D
1144 1465 D
S
N
1134 1472 M
1131 1470 D
1130 1467 D
1130 1465 D
1131 1462 D
1134 1461 D
S
N
1159 1489 M
1159 1461 D
S
N
1160 1489 M
1160 1461 D
S
N
1155 1489 M
1160 1489 D
S
N
1155 1461 M
1164 1461 D
S
N
1172 1472 M
1189 1472 D
1189 1474 D
1187 1477 D
1186 1478 D
1183 1480 D
1179 1480 D
1175 1478 D
1172 1476 D
1171 1472 D
1171 1469 D
1172 1465 D
1175 1462 D
1179 1461 D
1182 1461 D
1186 1462 D
1189 1465 D
S
N
1187 1472 M
1187 1476 D
1186 1478 D
S
N
1179 1480 M
1176 1478 D
1174 1476 D
1172 1472 D
1172 1469 D
1174 1465 D
1176 1462 D
1179 1461 D
S
N
1222 1480 M
1222 1465 D
1223 1462 D
1227 1461 D
1230 1461 D
1234 1462 D
1237 1465 D
S
N
1223 1480 M
1223 1465 D
1224 1462 D
1227 1461 D
S
N
1237 1480 M
1237 1461 D
S
N
1238 1480 M
1238 1461 D
S
N
1218 1480 M
1223 1480 D
S
N
1233 1480 M
1238 1480 D
S
N
1237 1461 M
1242 1461 D
S
N
1252 1480 M
1252 1461 D
S
N
1253 1480 M
1253 1461 D
S
N
1253 1476 M
1256 1478 D
1260 1480 D
1263 1480 D
1267 1478 D
1268 1476 D
1268 1461 D
S
N
1263 1480 M
1265 1478 D
1267 1476 D
1267 1461 D
S
N
1248 1480 M
1253 1480 D
S
N
1248 1461 M
1257 1461 D
S
N
1263 1461 M
1272 1461 D
S
N
1296 1476 M
1294 1474 D
1296 1473 D
1297 1474 D
1297 1476 D
1294 1478 D
1291 1480 D
1287 1480 D
1283 1478 D
1281 1476 D
1279 1472 D
1279 1469 D
1281 1465 D
1283 1462 D
1287 1461 D
1290 1461 D
1294 1462 D
1297 1465 D
S
N
1287 1480 M
1285 1478 D
1282 1476 D
1281 1472 D
1281 1469 D
1282 1465 D
1285 1462 D
1287 1461 D
S
N
1308 1463 M
1307 1462 D
1308 1461 D
1309 1462 D
1308 1463 D
S
N
833 1304 M
833 1303 D
832 1303 D
832 1304 D
833 1305 D
836 1307 D
841 1307 D
844 1305 D
845 1304 D
847 1301 D
847 1292 D
848 1289 D
849 1288 D
S
N
845 1304 M
845 1292 D
847 1289 D
849 1288 D
851 1288 D
S
N
845 1301 M
844 1300 D
836 1299 D
832 1297 D
830 1294 D
830 1292 D
832 1289 D
836 1288 D
840 1288 D
843 1289 D
845 1292 D
S
N
836 1299 M
833 1297 D
832 1294 D
832 1292 D
833 1289 D
836 1288 D
S
N
860 1316 M
860 1288 D
S
N
862 1316 M
870 1292 D
S
N
860 1316 M
870 1288 D
S
N
879 1316 M
870 1288 D
S
N
879 1316 M
879 1288 D
S
N
881 1316 M
881 1288 D
S
N
856 1316 M
862 1316 D
S
N
879 1316 M
885 1316 D
S
N
856 1288 M
864 1288 D
S
N
875 1288 M
885 1288 D
S
N
911 1312 M
912 1308 D
912 1316 D
911 1312 D
908 1315 D
904 1316 D
901 1316 D
897 1315 D
895 1312 D
893 1309 D
892 1305 D
892 1299 D
893 1294 D
895 1292 D
897 1289 D
901 1288 D
904 1288 D
908 1289 D
911 1292 D
912 1294 D
S
N
901 1316 M
899 1315 D
896 1312 D
895 1309 D
893 1305 D
893 1299 D
895 1294 D
896 1292 D
899 1289 D
901 1288 D
S
N
941 1305 M
940 1308 D
937 1309 D
933 1309 D
930 1308 D
929 1307 D
927 1303 D
927 1299 D
929 1296 D
931 1294 D
936 1294 D
938 1296 D
940 1299 D
S
N
933 1309 M
930 1307 D
929 1303 D
929 1299 D
930 1296 D
931 1294 D
S
N
941 1309 M
940 1299 D
940 1296 D
942 1294 D
945 1294 D
948 1297 D
949 1301 D
949 1304 D
948 1308 D
947 1311 D
944 1314 D
941 1315 D
937 1316 D
933 1316 D
929 1315 D
926 1314 D
923 1311 D
922 1308 D
921 1304 D
921 1300 D
922 1296 D
923 1293 D
926 1290 D
929 1289 D
933 1288 D
937 1288 D
941 1289 D
944 1290 D
945 1292 D
S
N
942 1309 M
941 1299 D
941 1296 D
942 1294 D
S
N
960 1316 M
960 1288 D
S
N
962 1316 M
978 1290 D
S
N
962 1314 M
978 1288 D
S
N
978 1316 M
978 1288 D
S
N
956 1316 M
962 1316 D
S
N
974 1316 M
982 1316 D
S
N
956 1288 M
964 1288 D
S
N
992 1316 M
992 1288 D
S
N
993 1316 M
993 1288 D
S
N
988 1316 M
997 1316 D
S
N
988 1288 M
1008 1288 D
1008 1296 D
1007 1288 D
S
N
1023 1316 M
1019 1315 D
1016 1312 D
1015 1309 D
1014 1304 D
1014 1300 D
1015 1294 D
1016 1292 D
1019 1289 D
1023 1288 D
1026 1288 D
1030 1289 D
1033 1292 D
1034 1294 D
1035 1300 D
1035 1304 D
1034 1309 D
1033 1312 D
1030 1315 D
1026 1316 D
1023 1316 D
S
N
1023 1316 M
1020 1315 D
1018 1312 D
1016 1309 D
1015 1304 D
1015 1300 D
1016 1294 D
1018 1292 D
1020 1289 D
1023 1288 D
S
N
1026 1288 M
1029 1289 D
1031 1292 D
1033 1294 D
1034 1300 D
1034 1304 D
1033 1309 D
1031 1312 D
1029 1315 D
1026 1316 D
S
N
1046 1307 M
1045 1305 D
1046 1304 D
1048 1305 D
1046 1307 D
S
N
1046 1290 M
1045 1289 D
1046 1288 D
1048 1289 D
1046 1290 D
S
N
1082 1307 M
1082 1278 D
S
N
1083 1307 M
1083 1278 D
S
N
1083 1303 M
1086 1305 D
1089 1307 D
1092 1307 D
1096 1305 D
1098 1303 D
1100 1299 D
1100 1296 D
1098 1292 D
1096 1289 D
1092 1288 D
1089 1288 D
1086 1289 D
1083 1292 D
S
N
1092 1307 M
1094 1305 D
1097 1303 D
1098 1299 D
1098 1296 D
1097 1292 D
1094 1289 D
1092 1288 D
S
N
1078 1307 M
1083 1307 D
S
N
1078 1278 M
1088 1278 D
S
N
1124 1316 M
1124 1288 D
S
N
1126 1316 M
1126 1288 D
S
N
1124 1303 M
1122 1305 D
1119 1307 D
1116 1307 D
1112 1305 D
1109 1303 D
1108 1299 D
1108 1296 D
1109 1292 D
1112 1289 D
1116 1288 D
1119 1288 D
1122 1289 D
1124 1292 D
S
N
1116 1307 M
1114 1305 D
1111 1303 D
1109 1299 D
1109 1296 D
1111 1292 D
1114 1289 D
1116 1288 D
S
N
1120 1316 M
1126 1316 D
S
N
1124 1288 M
1130 1288 D
S
N
1146 1315 M
1145 1314 D
1146 1312 D
1148 1314 D
1148 1315 D
1146 1316 D
1144 1316 D
1141 1315 D
1140 1312 D
1140 1288 D
S
N
1144 1316 M
1142 1315 D
1141 1312 D
1141 1288 D
S
N
1135 1307 M
1146 1307 D
S
N
1135 1288 M
1145 1288 D
S
N
1179 1307 M
1179 1292 D
1181 1289 D
1185 1288 D
1187 1288 D
1192 1289 D
1194 1292 D
S
N
1181 1307 M
1181 1292 D
1182 1289 D
1185 1288 D
S
N
1194 1307 M
1194 1288 D
S
N
1196 1307 M
1196 1288 D
S
N
1175 1307 M
1181 1307 D
S
N
1190 1307 M
1196 1307 D
S
N
1194 1288 M
1200 1288 D
S
N
1209 1307 M
1209 1288 D
S
N
1211 1307 M
1211 1288 D
S
N
1211 1303 M
1213 1305 D
1218 1307 D
1220 1307 D
1224 1305 D
1226 1303 D
1226 1288 D
S
N
1220 1307 M
1223 1305 D
1224 1303 D
1224 1288 D
S
N
1205 1307 M
1211 1307 D
S
N
1205 1288 M
1215 1288 D
S
N
1220 1288 M
1230 1288 D
S
N
1253 1303 M
1252 1301 D
1253 1300 D
1254 1301 D
1254 1303 D
1252 1305 D
1249 1307 D
1245 1307 D
1241 1305 D
1238 1303 D
1237 1299 D
1237 1296 D
1238 1292 D
1241 1289 D
1245 1288 D
1248 1288 D
1252 1289 D
1254 1292 D
S
N
1245 1307 M
1242 1305 D
1239 1303 D
1238 1299 D
1238 1296 D
1239 1292 D
1242 1289 D
1245 1288 D
S
N
1265 1290 M
1264 1289 D
1265 1288 D
1267 1289 D
1265 1290 D
S
4 Sw
N
583 1520 M
583 1261 D
S
N
583 1261 M
1967 1261 D
S
N
1967 1261 M
1967 1520 D
S
N
1967 1520 M
583 1520 D
S
N
583 1261 M
1967 1261 D
S
N
583 1261 M
583 1276 D
S
N
929 1276 M
929 1261 D
S
N
1275 1261 M
1275 1276 D
S
N
1621 1276 M
1621 1261 D
S
N
1967 1261 M
1967 1276 D
S
N
583 1520 M
1967 1520 D
S
N
583 1505 M
583 1520 D
S
N
929 1520 M
929 1505 D
S
N
1275 1505 M
1275 1520 D
S
N
1621 1520 M
1621 1505 D
S
N
1967 1505 M
1967 1520 D
S
N
583 1261 M
583 1520 D
S
N
583 1261 M
588 1261 D
S
N
588 1273 M
583 1273 D
S
N
583 1285 M
599 1285 D
S
N
588 1297 M
583 1297 D
S
N
583 1309 M
588 1309 D
S
N
588 1321 M
583 1321 D
S
N
583 1333 M
588 1333 D
S
N
599 1345 M
583 1345 D
S
N
583 1357 M
588 1357 D
S
N
588 1369 M
583 1369 D
S
N
583 1381 M
588 1381 D
S
N
588 1394 M
583 1394 D
S
N
583 1406 M
599 1406 D
S
N
588 1418 M
583 1418 D
S
N
583 1430 M
588 1430 D
S
N
588 1442 M
583 1442 D
S
N
583 1454 M
588 1454 D
S
N
599 1466 M
583 1466 D
S
N
583 1478 M
588 1478 D
S
N
588 1490 M
583 1490 D
S
N
583 1502 M
588 1502 D
S
N
588 1514 M
583 1514 D
S
N
503 1298 M
498 1297 D
495 1292 D
494 1285 D
494 1280 D
495 1273 D
498 1268 D
503 1267 D
506 1267 D
510 1268 D
513 1273 D
515 1280 D
515 1285 D
513 1292 D
510 1297 D
506 1298 D
503 1298 D
S
N
503 1298 M
500 1297 D
498 1295 D
497 1292 D
495 1285 D
495 1280 D
497 1273 D
498 1270 D
500 1268 D
503 1267 D
S
N
506 1267 M
509 1268 D
510 1270 D
512 1273 D
513 1280 D
513 1285 D
512 1292 D
510 1295 D
509 1297 D
506 1298 D
S
N
527 1270 M
525 1268 D
527 1267 D
528 1268 D
527 1270 D
S
N
547 1298 M
542 1297 D
541 1294 D
541 1289 D
542 1286 D
547 1285 D
553 1285 D
557 1286 D
559 1289 D
559 1294 D
557 1297 D
553 1298 D
547 1298 D
S
N
547 1298 M
544 1297 D
542 1294 D
542 1289 D
544 1286 D
547 1285 D
S
N
553 1285 M
556 1286 D
557 1289 D
557 1294 D
556 1297 D
553 1298 D
S
N
547 1285 M
542 1283 D
541 1282 D
539 1279 D
539 1273 D
541 1270 D
542 1268 D
547 1267 D
553 1267 D
557 1268 D
559 1270 D
560 1273 D
560 1279 D
559 1282 D
557 1283 D
553 1285 D
S
N
547 1285 M
544 1283 D
542 1282 D
541 1279 D
541 1273 D
542 1270 D
544 1268 D
547 1267 D
S
N
553 1267 M
556 1268 D
557 1270 D
559 1273 D
559 1279 D
557 1282 D
556 1283 D
553 1285 D
S
N
503 1359 M
498 1357 D
495 1353 D
494 1345 D
494 1341 D
495 1333 D
498 1329 D
503 1327 D
506 1327 D
510 1329 D
513 1333 D
515 1341 D
515 1345 D
513 1353 D
510 1357 D
506 1359 D
503 1359 D
S
N
503 1359 M
500 1357 D
498 1356 D
497 1353 D
495 1345 D
495 1341 D
497 1333 D
498 1330 D
500 1329 D
503 1327 D
S
N
506 1327 M
509 1329 D
510 1330 D
512 1333 D
513 1341 D
513 1345 D
512 1353 D
510 1356 D
509 1357 D
506 1359 D
S
N
527 1330 M
525 1329 D
527 1327 D
528 1329 D
527 1330 D
S
N
559 1348 M
557 1344 D
554 1341 D
550 1339 D
548 1339 D
544 1341 D
541 1344 D
539 1348 D
539 1350 D
541 1354 D
544 1357 D
548 1359 D
551 1359 D
556 1357 D
559 1354 D
560 1350 D
560 1341 D
559 1335 D
557 1332 D
554 1329 D
550 1327 D
545 1327 D
542 1329 D
541 1332 D
541 1333 D
542 1335 D
544 1333 D
542 1332 D
S
N
548 1339 M
545 1341 D
542 1344 D
541 1348 D
541 1350 D
542 1354 D
545 1357 D
548 1359 D
S
N
551 1359 M
554 1357 D
557 1354 D
559 1350 D
559 1341 D
557 1335 D
556 1332 D
553 1329 D
550 1327 D
S
N
498 1413 M
501 1415 D
506 1419 D
506 1387 D
S
N
504 1418 M
504 1387 D
S
N
498 1387 M
512 1387 D
S
N
527 1390 M
525 1389 D
527 1387 D
528 1389 D
527 1390 D
S
N
548 1419 M
544 1418 D
541 1413 D
539 1406 D
539 1401 D
541 1394 D
544 1389 D
548 1387 D
551 1387 D
556 1389 D
559 1394 D
560 1401 D
560 1406 D
559 1413 D
556 1418 D
551 1419 D
548 1419 D
S
N
548 1419 M
545 1418 D
544 1416 D
542 1413 D
541 1406 D
541 1401 D
542 1394 D
544 1390 D
545 1389 D
548 1387 D
S
N
551 1387 M
554 1389 D
556 1390 D
557 1394 D
559 1401 D
559 1406 D
557 1413 D
556 1416 D
554 1418 D
551 1419 D
S
N
498 1473 M
501 1475 D
506 1480 D
506 1448 D
S
N
504 1478 M
504 1448 D
S
N
498 1448 M
512 1448 D
S
N
527 1451 M
525 1449 D
527 1448 D
528 1449 D
527 1451 D
S
N
544 1473 M
547 1475 D
551 1480 D
551 1448 D
S
N
550 1478 M
550 1448 D
S
N
544 1448 M
557 1448 D
S
N
1967 1261 M
1967 1520 D
S
N
1962 1261 M
1967 1261 D
S
N
1967 1273 M
1962 1273 D
S
N
1951 1285 M
1967 1285 D
S
N
1967 1297 M
1962 1297 D
S
N
1962 1309 M
1967 1309 D
S
N
1967 1321 M
1962 1321 D
S
N
1962 1333 M
1967 1333 D
S
N
1967 1345 M
1951 1345 D
S
N
1962 1357 M
1967 1357 D
S
N
1967 1369 M
1962 1369 D
S
N
1962 1381 M
1967 1381 D
S
N
1967 1394 M
1962 1394 D
S
N
1951 1406 M
1967 1406 D
S
N
1967 1418 M
1962 1418 D
S
N
1962 1430 M
1967 1430 D
S
N
1967 1442 M
1962 1442 D
S
N
1962 1454 M
1967 1454 D
S
N
1967 1466 M
1951 1466 D
S
N
1962 1478 M
1967 1478 D
S
N
1967 1490 M
1962 1490 D
S
N
1962 1502 M
1967 1502 D
S
N
1967 1514 M
1962 1514 D
S
N
583 1261 M
583 1435 D
929 1435 D
929 1442 D
1275 1442 D
1275 1435 D
1621 1435 D
1621 1437 D
1967 1437 D
S
N
583 1261 M
583 1370 D
929 1370 D
929 1365 D
1275 1365 D
1275 1370 D
1621 1370 D
1621 1369 D
1967 1369 D
S
N
721 1304 M
808 1304 D
S
0 0 1 setrgbcolor
N
583 1261 M
583 1273 D
S
N
583 1285 M
583 1297 D
S
N
583 1309 M
583 1321 D
S
N
583 1333 M
583 1346 D
S
N
583 1358 M
583 1370 D
S
N
583 1382 M
583 1394 D
S
N
583 1406 M
583 1418 D
S
N
583 1430 M
583 1442 D
S
N
593 1445 M
605 1445 D
S
N
617 1445 M
629 1445 D
S
N
641 1445 M
653 1445 D
S
N
666 1445 M
678 1445 D
S
N
690 1445 M
702 1445 D
S
N
714 1445 M
726 1445 D
S
N
738 1445 M
750 1445 D
S
N
762 1445 M
775 1445 D
S
N
787 1445 M
799 1445 D
S
N
811 1445 M
823 1445 D
S
N
835 1445 M
847 1445 D
S
N
859 1445 M
871 1445 D
S
N
884 1445 M
896 1445 D
S
N
908 1445 M
920 1445 D
S
N
929 1448 M
929 1452 D
937 1452 D
S
N
949 1452 M
961 1452 D
S
N
973 1452 M
985 1452 D
S
N
997 1452 M
1010 1452 D
S
N
1022 1452 M
1034 1452 D
S
N
1046 1452 M
1058 1452 D
S
N
1070 1452 M
1082 1452 D
S
N
1094 1452 M
1106 1452 D
S
N
1119 1452 M
1131 1452 D
S
N
1143 1452 M
1155 1452 D
S
N
1167 1452 M
1179 1452 D
S
N
1191 1452 M
1203 1452 D
S
N
1215 1452 M
1228 1452 D
S
N
1240 1452 M
1252 1452 D
S
N
1264 1452 M
1275 1452 D
1275 1451 D
S
N
1282 1446 M
1294 1446 D
S
N
1306 1446 M
1318 1446 D
S
N
1331 1446 M
1343 1446 D
S
N
1355 1446 M
1367 1446 D
S
N
1379 1446 M
1391 1446 D
S
N
1403 1446 M
1415 1446 D
S
N
1427 1446 M
1440 1446 D
S
N
1452 1446 M
1464 1446 D
S
N
1476 1446 M
1488 1446 D
S
N
1500 1446 M
1512 1446 D
S
N
1524 1446 M
1536 1446 D
S
N
1549 1446 M
1561 1446 D
S
N
1573 1446 M
1585 1446 D
S
N
1597 1446 M
1609 1446 D
S
N
1621 1446 M
1621 1447 D
1632 1447 D
S
N
1644 1447 M
1656 1447 D
S
N
1668 1447 M
1680 1447 D
S
N
1692 1447 M
1704 1447 D
S
N
1717 1447 M
1729 1447 D
S
N
1741 1447 M
1753 1447 D
S
N
1765 1447 M
1777 1447 D
S
N
1789 1447 M
1801 1447 D
S
N
1813 1447 M
1826 1447 D
S
N
1838 1447 M
1850 1447 D
S
N
1862 1447 M
1874 1447 D
S
N
1886 1447 M
1898 1447 D
S
N
1910 1447 M
1922 1447 D
S
N
1935 1447 M
1947 1447 D
S
N
1959 1447 M
1967 1447 D
S
N
583 1261 M
583 1273 D
S
N
583 1285 M
583 1297 D
S
N
583 1309 M
583 1321 D
S
N
585 1332 M
597 1332 D
S
N
609 1332 M
621 1332 D
S
N
633 1332 M
645 1332 D
S
N
658 1332 M
670 1332 D
S
N
682 1332 M
694 1332 D
S
N
706 1332 M
718 1332 D
S
N
730 1332 M
742 1332 D
S
N
754 1332 M
767 1332 D
S
N
779 1332 M
791 1332 D
S
N
803 1332 M
815 1332 D
S
N
827 1332 M
839 1332 D
S
N
851 1332 M
863 1332 D
S
N
876 1332 M
888 1332 D
S
N
900 1332 M
912 1332 D
S
N
924 1332 M
929 1332 D
929 1327 D
932 1327 D
S
N
944 1327 M
956 1327 D
S
N
968 1327 M
980 1327 D
S
N
992 1327 M
1004 1327 D
S
N
1017 1327 M
1029 1327 D
S
N
1041 1327 M
1053 1327 D
S
N
1065 1327 M
1077 1327 D
S
N
1089 1327 M
1101 1327 D
S
N
1113 1327 M
1126 1327 D
S
N
1138 1327 M
1150 1327 D
S
N
1162 1327 M
1174 1327 D
S
N
1186 1327 M
1198 1327 D
S
N
1210 1327 M
1222 1327 D
S
N
1235 1327 M
1247 1327 D
S
N
1259 1327 M
1271 1327 D
S
N
1279 1331 M
1291 1331 D
S
N
1303 1331 M
1316 1331 D
S
N
1328 1331 M
1340 1331 D
S
N
1352 1331 M
1364 1331 D
S
N
1376 1331 M
1388 1331 D
S
N
1400 1331 M
1412 1331 D
S
N
1425 1331 M
1437 1331 D
S
N
1449 1331 M
1461 1331 D
S
N
1473 1331 M
1485 1331 D
S
N
1497 1331 M
1509 1331 D
S
N
1521 1331 M
1534 1331 D
S
N
1546 1331 M
1558 1331 D
S
N
1570 1331 M
1582 1331 D
S
N
1594 1331 M
1606 1331 D
S
N
1618 1331 M
1621 1331 D
1621 1330 D
1630 1330 D
S
N
1642 1330 M
1654 1330 D
S
N
1666 1330 M
1678 1330 D
S
N
1690 1330 M
1702 1330 D
S
N
1714 1330 M
1726 1330 D
S
N
1739 1330 M
1751 1330 D
S
N
1763 1330 M
1775 1330 D
S
N
1787 1330 M
1799 1330 D
S
N
1811 1330 M
1823 1330 D
S
N
1835 1330 M
1848 1330 D
S
N
1860 1330 M
1872 1330 D
S
N
1884 1330 M
1896 1330 D
S
N
1908 1330 M
1920 1330 D
S
N
1932 1330 M
1944 1330 D
S
N
1957 1330 M
1967 1330 D
S
N
721 1477 M
734 1477 D
S
N
746 1477 M
758 1477 D
S
N
770 1477 M
782 1477 D
S
N
794 1477 M
806 1477 D
S
3 Sw
0 0 0 setrgbcolor
N
833 1230 M
833 1201 D
S
N
834 1230 M
834 1201 D
S
N
829 1230 M
845 1230 D
849 1228 D
851 1227 D
852 1224 D
852 1220 D
851 1217 D
849 1216 D
845 1215 D
834 1215 D
S
N
845 1230 M
848 1228 D
849 1227 D
851 1224 D
851 1220 D
849 1217 D
848 1216 D
845 1215 D
S
N
829 1201 M
838 1201 D
S
N
870 1230 M
866 1228 D
863 1226 D
862 1223 D
860 1217 D
860 1213 D
862 1208 D
863 1205 D
866 1202 D
870 1201 D
873 1201 D
877 1202 D
879 1205 D
881 1208 D
882 1213 D
882 1217 D
881 1223 D
879 1226 D
877 1228 D
873 1230 D
870 1230 D
S
N
870 1230 M
867 1228 D
864 1226 D
863 1223 D
862 1217 D
862 1213 D
863 1208 D
864 1205 D
867 1202 D
870 1201 D
S
N
873 1201 M
875 1202 D
878 1205 D
879 1208 D
881 1213 D
881 1217 D
879 1223 D
878 1226 D
875 1228 D
873 1230 D
S
N
892 1230 M
897 1201 D
S
N
893 1230 M
897 1208 D
S
N
903 1230 M
897 1201 D
S
N
903 1230 M
908 1201 D
S
N
904 1230 M
908 1208 D
S
N
914 1230 M
908 1201 D
S
N
888 1230 M
897 1230 D
S
N
910 1230 M
918 1230 D
S
N
926 1230 M
926 1201 D
S
N
927 1230 M
927 1201 D
S
N
944 1230 M
944 1201 D
S
N
945 1230 M
945 1201 D
S
N
922 1230 M
931 1230 D
S
N
940 1230 M
949 1230 D
S
N
927 1216 M
944 1216 D
S
N
922 1201 M
931 1201 D
S
N
940 1201 M
949 1201 D
S
N
959 1230 M
959 1201 D
S
N
960 1230 M
960 1201 D
S
N
968 1222 M
968 1211 D
S
N
955 1230 M
977 1230 D
977 1222 D
975 1230 D
S
N
960 1216 M
968 1216 D
S
N
955 1201 M
977 1201 D
977 1209 D
975 1201 D
S
N
988 1230 M
988 1201 D
S
N
989 1230 M
989 1201 D
S
N
983 1230 M
993 1230 D
S
N
983 1201 M
1004 1201 D
1004 1209 D
1003 1201 D
S
N
1012 1220 M
1011 1219 D
1012 1217 D
1014 1219 D
1012 1220 D
S
N
1012 1204 M
1011 1202 D
1012 1201 D
1014 1202 D
1012 1204 D
S
N
1048 1220 M
1048 1191 D
S
N
1049 1220 M
1049 1191 D
S
N
1049 1216 M
1052 1219 D
1055 1220 D
1057 1220 D
1061 1219 D
1064 1216 D
1066 1212 D
1066 1209 D
1064 1205 D
1061 1202 D
1057 1201 D
1055 1201 D
1052 1202 D
1049 1205 D
S
N
1057 1220 M
1060 1219 D
1063 1216 D
1064 1212 D
1064 1209 D
1063 1205 D
1060 1202 D
1057 1201 D
S
N
1044 1220 M
1049 1220 D
S
N
1044 1191 M
1053 1191 D
S
N
1075 1220 M
1083 1201 D
S
N
1077 1220 M
1083 1204 D
S
N
1092 1220 M
1083 1201 D
1081 1196 D
1078 1193 D
1075 1191 D
1074 1191 D
1072 1193 D
1074 1194 D
1075 1193 D
S
N
1072 1220 M
1081 1220 D
S
N
1086 1220 M
1094 1220 D
S
N
1103 1230 M
1103 1207 D
1104 1202 D
1107 1201 D
1109 1201 D
1112 1202 D
1114 1205 D
S
N
1104 1230 M
1104 1207 D
1105 1202 D
1107 1201 D
S
N
1098 1220 M
1109 1220 D
S
N
1123 1230 M
1123 1201 D
S
N
1124 1230 M
1124 1201 D
S
N
1124 1216 M
1127 1219 D
1131 1220 D
1134 1220 D
1138 1219 D
1140 1216 D
1140 1201 D
S
N
1134 1220 M
1137 1219 D
1138 1216 D
1138 1201 D
S
N
1119 1230 M
1124 1230 D
S
N
1119 1201 M
1129 1201 D
S
N
1134 1201 M
1144 1201 D
S
N
1153 1230 M
1152 1228 D
1153 1227 D
1155 1228 D
1153 1230 D
S
N
1153 1220 M
1153 1201 D
S
N
1155 1220 M
1155 1201 D
S
N
1149 1220 M
1155 1220 D
S
N
1149 1201 M
1159 1201 D
S
N
1168 1217 M
1168 1216 D
1167 1216 D
1167 1217 D
1168 1219 D
1171 1220 D
1176 1220 D
1179 1219 D
1181 1217 D
1182 1215 D
1182 1205 D
1183 1202 D
1185 1201 D
S
N
1181 1217 M
1181 1205 D
1182 1202 D
1185 1201 D
1186 1201 D
S
N
1181 1215 M
1179 1213 D
1171 1212 D
1167 1211 D
1166 1208 D
1166 1205 D
1167 1202 D
1171 1201 D
1175 1201 D
1178 1202 D
1181 1205 D
S
N
1171 1212 M
1168 1211 D
1167 1208 D
1167 1205 D
1168 1202 D
1171 1201 D
S
N
1216 1235 M
1192 1191 D
S
N
1226 1230 M
1226 1201 D
S
N
1227 1230 M
1227 1201 D
S
N
1227 1216 M
1230 1219 D
1234 1220 D
1237 1220 D
1241 1219 D
1242 1216 D
1242 1201 D
S
N
1237 1220 M
1239 1219 D
1241 1216 D
1241 1201 D
S
N
1222 1230 M
1227 1230 D
S
N
1222 1201 M
1231 1201 D
S
N
1237 1201 M
1246 1201 D
S
N
1254 1212 M
1271 1212 D
1271 1215 D
1270 1217 D
1268 1219 D
1265 1220 D
1261 1220 D
1257 1219 D
1254 1216 D
1253 1212 D
1253 1209 D
1254 1205 D
1257 1202 D
1261 1201 D
1264 1201 D
1268 1202 D
1271 1205 D
S
N
1270 1212 M
1270 1216 D
1268 1219 D
S
N
1261 1220 M
1259 1219 D
1256 1216 D
1254 1212 D
1254 1209 D
1256 1205 D
1259 1202 D
1261 1201 D
S
N
1282 1220 M
1282 1201 D
S
N
1283 1220 M
1283 1201 D
S
N
1283 1212 M
1285 1216 D
1287 1219 D
1290 1220 D
1294 1220 D
1296 1219 D
1296 1217 D
1294 1216 D
1293 1217 D
1294 1219 D
S
N
1278 1220 M
1283 1220 D
S
N
1278 1201 M
1287 1201 D
S
N
1304 1220 M
1309 1201 D
S
N
1305 1220 M
1309 1205 D
S
N
1315 1220 M
1309 1201 D
S
N
1315 1220 M
1320 1201 D
S
N
1316 1220 M
1320 1205 D
S
N
1326 1220 M
1320 1201 D
S
N
1300 1220 M
1309 1220 D
S
N
1322 1220 M
1330 1220 D
S
N
1338 1230 M
1337 1228 D
1338 1227 D
1339 1228 D
1338 1230 D
S
N
1338 1220 M
1338 1201 D
S
N
1339 1220 M
1339 1201 D
S
N
1334 1220 M
1339 1220 D
S
N
1334 1201 M
1343 1201 D
S
N
1357 1220 M
1354 1219 D
1353 1217 D
1352 1215 D
1352 1212 D
1353 1209 D
1354 1208 D
1357 1207 D
1360 1207 D
1363 1208 D
1364 1209 D
1365 1212 D
1365 1215 D
1364 1217 D
1363 1219 D
1360 1220 D
1357 1220 D
S
N
1354 1219 M
1353 1216 D
1353 1211 D
1354 1208 D
S
N
1363 1208 M
1364 1211 D
1364 1216 D
1363 1219 D
S
N
1364 1217 M
1365 1219 D
1368 1220 D
1368 1219 D
1365 1219 D
S
N
1353 1209 M
1352 1208 D
1350 1205 D
1350 1204 D
1352 1201 D
1356 1200 D
1363 1200 D
1367 1198 D
1368 1197 D
S
N
1350 1204 M
1352 1202 D
1356 1201 D
1363 1201 D
1367 1200 D
1368 1197 D
1368 1196 D
1367 1193 D
1363 1191 D
1354 1191 D
1350 1193 D
1349 1196 D
1349 1197 D
1350 1200 D
1354 1201 D
S
N
833 1057 M
833 1028 D
S
N
834 1057 M
834 1028 D
S
N
829 1057 M
845 1057 D
849 1055 D
851 1054 D
852 1051 D
852 1047 D
851 1044 D
849 1043 D
845 1042 D
834 1042 D
S
N
845 1057 M
848 1055 D
849 1054 D
851 1051 D
851 1047 D
849 1044 D
848 1043 D
845 1042 D
S
N
829 1028 M
838 1028 D
S
N
870 1057 M
866 1055 D
863 1053 D
862 1050 D
860 1044 D
860 1040 D
862 1035 D
863 1032 D
866 1029 D
870 1028 D
873 1028 D
877 1029 D
879 1032 D
881 1035 D
882 1040 D
882 1044 D
881 1050 D
879 1053 D
877 1055 D
873 1057 D
870 1057 D
S
N
870 1057 M
867 1055 D
864 1053 D
863 1050 D
862 1044 D
862 1040 D
863 1035 D
864 1032 D
867 1029 D
870 1028 D
S
N
873 1028 M
875 1029 D
878 1032 D
879 1035 D
881 1040 D
881 1044 D
879 1050 D
878 1053 D
875 1055 D
873 1057 D
S
N
892 1057 M
897 1028 D
S
N
893 1057 M
897 1035 D
S
N
903 1057 M
897 1028 D
S
N
903 1057 M
908 1028 D
S
N
904 1057 M
908 1035 D
S
N
914 1057 M
908 1028 D
S
N
888 1057 M
897 1057 D
S
N
910 1057 M
918 1057 D
S
N
926 1057 M
926 1028 D
S
N
927 1057 M
927 1028 D
S
N
944 1057 M
944 1028 D
S
N
945 1057 M
945 1028 D
S
N
922 1057 M
931 1057 D
S
N
940 1057 M
949 1057 D
S
N
927 1043 M
944 1043 D
S
N
922 1028 M
931 1028 D
S
N
940 1028 M
949 1028 D
S
N
959 1057 M
959 1028 D
S
N
960 1057 M
960 1028 D
S
N
968 1049 M
968 1038 D
S
N
955 1057 M
977 1057 D
977 1049 D
975 1057 D
S
N
960 1043 M
968 1043 D
S
N
955 1028 M
977 1028 D
977 1036 D
975 1028 D
S
N
988 1057 M
988 1028 D
S
N
989 1057 M
989 1028 D
S
N
983 1057 M
993 1057 D
S
N
983 1028 M
1004 1028 D
1004 1036 D
1003 1028 D
S
N
1033 1062 M
1008 1018 D
S
N
1042 1044 M
1042 1043 D
1041 1043 D
1041 1044 D
1042 1046 D
1045 1047 D
1051 1047 D
1053 1046 D
1055 1044 D
1056 1042 D
1056 1032 D
1057 1029 D
1059 1028 D
S
N
1055 1044 M
1055 1032 D
1056 1029 D
1059 1028 D
1060 1028 D
S
N
1055 1042 M
1053 1040 D
1045 1039 D
1041 1038 D
1040 1035 D
1040 1032 D
1041 1029 D
1045 1028 D
1049 1028 D
1052 1029 D
1055 1032 D
S
N
1045 1039 M
1042 1038 D
1041 1035 D
1041 1032 D
1042 1029 D
1045 1028 D
S
N
1070 1057 M
1070 1028 D
S
N
1071 1057 M
1079 1032 D
S
N
1070 1057 M
1079 1028 D
S
N
1089 1057 M
1079 1028 D
S
N
1089 1057 M
1089 1028 D
S
N
1090 1057 M
1090 1028 D
S
N
1066 1057 M
1071 1057 D
S
N
1089 1057 M
1094 1057 D
S
N
1066 1028 M
1074 1028 D
S
N
1085 1028 M
1094 1028 D
S
N
1120 1053 M
1122 1049 D
1122 1057 D
1120 1053 D
1118 1055 D
1114 1057 D
1111 1057 D
1107 1055 D
1104 1053 D
1103 1050 D
1101 1046 D
1101 1039 D
1103 1035 D
1104 1032 D
1107 1029 D
1111 1028 D
1114 1028 D
1118 1029 D
1120 1032 D
1122 1035 D
S
N
1111 1057 M
1108 1055 D
1105 1053 D
1104 1050 D
1103 1046 D
1103 1039 D
1104 1035 D
1105 1032 D
1108 1029 D
1111 1028 D
S
N
1150 1046 M
1149 1049 D
1146 1050 D
1142 1050 D
1140 1049 D
1138 1047 D
1137 1043 D
1137 1039 D
1138 1036 D
1141 1035 D
1145 1035 D
1148 1036 D
1149 1039 D
S
N
1142 1050 M
1140 1047 D
1138 1043 D
1138 1039 D
1140 1036 D
1141 1035 D
S
N
1150 1050 M
1149 1039 D
1149 1036 D
1152 1035 D
1155 1035 D
1157 1038 D
1159 1042 D
1159 1044 D
1157 1049 D
1156 1051 D
1153 1054 D
1150 1055 D
1146 1057 D
1142 1057 D
1138 1055 D
1135 1054 D
1133 1051 D
1131 1049 D
1130 1044 D
1130 1040 D
1131 1036 D
1133 1034 D
1135 1031 D
1138 1029 D
1142 1028 D
1146 1028 D
1150 1029 D
1153 1031 D
1155 1032 D
S
N
1152 1050 M
1150 1039 D
1150 1036 D
1152 1035 D
S
N
1170 1057 M
1170 1028 D
S
N
1171 1057 M
1187 1031 D
S
N
1171 1054 M
1187 1028 D
S
N
1187 1057 M
1187 1028 D
S
N
1166 1057 M
1171 1057 D
S
N
1183 1057 M
1192 1057 D
S
N
1166 1028 M
1174 1028 D
S
N
1201 1057 M
1201 1028 D
S
N
1202 1057 M
1202 1028 D
S
N
1197 1057 M
1207 1057 D
S
N
1197 1028 M
1218 1028 D
1218 1036 D
1216 1028 D
S
N
1233 1057 M
1228 1055 D
1226 1053 D
1224 1050 D
1223 1044 D
1223 1040 D
1224 1035 D
1226 1032 D
1228 1029 D
1233 1028 D
1235 1028 D
1239 1029 D
1242 1032 D
1244 1035 D
1245 1040 D
1245 1044 D
1244 1050 D
1242 1053 D
1239 1055 D
1235 1057 D
1233 1057 D
S
N
1233 1057 M
1230 1055 D
1227 1053 D
1226 1050 D
1224 1044 D
1224 1040 D
1226 1035 D
1227 1032 D
1230 1029 D
1233 1028 D
S
N
1235 1028 M
1238 1029 D
1241 1032 D
1242 1035 D
1244 1040 D
1244 1044 D
1242 1050 D
1241 1053 D
1238 1055 D
1235 1057 D
S
4 Sw
N
659 970 M
659 949 D
S
N
660 970 M
660 949 D
S
N
660 965 M
663 968 D
668 970 D
671 970 D
676 968 D
677 965 D
677 949 D
S
N
671 970 M
674 968 D
676 965 D
676 949 D
S
N
654 970 M
660 970 D
S
N
654 949 M
665 949 D
S
N
671 949 M
682 949 D
S
N
698 970 M
694 968 D
691 965 D
689 961 D
689 958 D
691 953 D
694 950 D
698 949 D
701 949 D
706 950 D
709 953 D
710 958 D
710 961 D
709 965 D
706 968 D
701 970 D
698 970 D
S
N
698 970 M
695 968 D
692 965 D
691 961 D
691 958 D
692 953 D
695 950 D
698 949 D
S
N
701 949 M
704 950 D
707 953 D
709 958 D
709 961 D
707 965 D
704 968 D
701 970 D
S
N
762 965 M
760 964 D
762 962 D
763 964 D
763 965 D
760 968 D
757 970 D
753 970 D
748 968 D
745 965 D
743 961 D
743 958 D
745 953 D
748 950 D
753 949 D
756 949 D
760 950 D
763 953 D
S
N
753 970 M
749 968 D
746 965 D
745 961 D
745 958 D
746 953 D
749 950 D
753 949 D
S
N
775 970 M
775 953 D
777 950 D
781 949 D
784 949 D
789 950 D
792 953 D
S
N
777 970 M
777 953 D
778 950 D
781 949 D
S
N
792 970 M
792 949 D
S
N
793 970 M
793 949 D
S
N
771 970 M
777 970 D
S
N
787 970 M
793 970 D
S
N
792 949 M
798 949 D
S
N
808 980 M
808 955 D
810 950 D
813 949 D
816 949 D
819 950 D
820 953 D
S
N
810 980 M
810 955 D
811 950 D
813 949 D
S
N
804 970 M
816 970 D
S
N
843 967 M
845 970 D
845 964 D
843 967 D
842 968 D
839 970 D
833 970 D
829 968 D
828 967 D
828 964 D
829 962 D
833 961 D
840 958 D
843 956 D
845 955 D
S
N
828 965 M
829 964 D
833 962 D
840 959 D
843 958 D
845 956 D
845 952 D
843 950 D
840 949 D
834 949 D
831 950 D
829 952 D
828 955 D
828 949 D
829 952 D
S
N
1055 965 M
1053 964 D
1055 962 D
1056 964 D
1056 965 D
1053 968 D
1050 970 D
1046 970 D
1041 968 D
1038 965 D
1037 961 D
1037 958 D
1038 953 D
1041 950 D
1046 949 D
1049 949 D
1053 950 D
1056 953 D
S
N
1046 970 M
1043 968 D
1040 965 D
1038 961 D
1038 958 D
1040 953 D
1043 950 D
1046 949 D
S
N
1068 970 M
1068 953 D
1070 950 D
1074 949 D
1077 949 D
1082 950 D
1085 953 D
S
N
1070 970 M
1070 953 D
1071 950 D
1074 949 D
S
N
1085 970 M
1085 949 D
S
N
1086 970 M
1086 949 D
S
N
1064 970 M
1070 970 D
S
N
1080 970 M
1086 970 D
S
N
1085 949 M
1091 949 D
S
N
1101 980 M
1101 955 D
1103 950 D
1106 949 D
1109 949 D
1112 950 D
1113 953 D
S
N
1103 980 M
1103 955 D
1104 950 D
1106 949 D
S
N
1097 970 M
1109 970 D
S
N
1136 967 M
1138 970 D
1138 964 D
1136 967 D
1135 968 D
1132 970 D
1126 970 D
1123 968 D
1121 967 D
1121 964 D
1123 962 D
1126 961 D
1133 958 D
1136 956 D
1138 955 D
S
N
1121 965 M
1123 964 D
1126 962 D
1133 959 D
1136 958 D
1138 956 D
1138 952 D
1136 950 D
1133 949 D
1127 949 D
1124 950 D
1123 952 D
1121 955 D
1121 949 D
1123 952 D
S
N
1175 974 M
1178 976 D
1183 980 D
1183 949 D
S
N
1181 979 M
1181 949 D
S
N
1175 949 M
1189 949 D
S
N
1401 965 M
1399 964 D
1401 962 D
1402 964 D
1402 965 D
1399 968 D
1396 970 D
1392 970 D
1387 968 D
1384 965 D
1383 961 D
1383 958 D
1384 953 D
1387 950 D
1392 949 D
1395 949 D
1399 950 D
1402 953 D
S
N
1392 970 M
1389 968 D
1386 965 D
1384 961 D
1384 958 D
1386 953 D
1389 950 D
1392 949 D
S
N
1414 970 M
1414 953 D
1416 950 D
1420 949 D
1423 949 D
1428 950 D
1431 953 D
S
N
1416 970 M
1416 953 D
1417 950 D
1420 949 D
S
N
1431 970 M
1431 949 D
S
N
1432 970 M
1432 949 D
S
N
1410 970 M
1416 970 D
S
N
1426 970 M
1432 970 D
S
N
1431 949 M
1437 949 D
S
N
1447 980 M
1447 955 D
1449 950 D
1452 949 D
1455 949 D
1458 950 D
1459 953 D
S
N
1449 980 M
1449 955 D
1450 950 D
1452 949 D
S
N
1443 970 M
1455 970 D
S
N
1482 967 M
1484 970 D
1484 964 D
1482 967 D
1481 968 D
1478 970 D
1472 970 D
1469 968 D
1467 967 D
1467 964 D
1469 962 D
1472 961 D
1479 958 D
1482 956 D
1484 955 D
S
N
1467 965 M
1469 964 D
1472 962 D
1479 959 D
1482 958 D
1484 956 D
1484 952 D
1482 950 D
1479 949 D
1473 949 D
1470 950 D
1469 952 D
1467 955 D
1467 949 D
1469 952 D
S
N
1518 974 M
1520 973 D
1518 971 D
1517 973 D
1517 974 D
1518 977 D
1520 979 D
1524 980 D
1530 980 D
1535 979 D
1536 977 D
1538 974 D
1538 971 D
1536 968 D
1532 965 D
1524 962 D
1521 961 D
1518 958 D
1517 953 D
1517 949 D
S
N
1530 980 M
1533 979 D
1535 977 D
1536 974 D
1536 971 D
1535 968 D
1530 965 D
1524 962 D
S
N
1517 952 M
1518 953 D
1521 953 D
1529 950 D
1533 950 D
1536 952 D
1538 953 D
S
N
1521 953 M
1529 949 D
1535 949 D
1536 950 D
1538 953 D
1538 956 D
S
N
1747 965 M
1745 964 D
1747 962 D
1748 964 D
1748 965 D
1745 968 D
1742 970 D
1738 970 D
1733 968 D
1730 965 D
1729 961 D
1729 958 D
1730 953 D
1733 950 D
1738 949 D
1741 949 D
1745 950 D
1748 953 D
S
N
1738 970 M
1735 968 D
1732 965 D
1730 961 D
1730 958 D
1732 953 D
1735 950 D
1738 949 D
S
N
1760 970 M
1760 953 D
1762 950 D
1766 949 D
1769 949 D
1774 950 D
1777 953 D
S
N
1762 970 M
1762 953 D
1763 950 D
1766 949 D
S
N
1777 970 M
1777 949 D
S
N
1778 970 M
1778 949 D
S
N
1756 970 M
1762 970 D
S
N
1772 970 M
1778 970 D
S
N
1777 949 M
1783 949 D
S
N
1793 980 M
1793 955 D
1795 950 D
1798 949 D
1801 949 D
1804 950 D
1805 953 D
S
N
1795 980 M
1795 955 D
1796 950 D
1798 949 D
S
N
1789 970 M
1801 970 D
S
N
1828 967 M
1830 970 D
1830 964 D
1828 967 D
1827 968 D
1824 970 D
1818 970 D
1815 968 D
1813 967 D
1813 964 D
1815 962 D
1818 961 D
1825 958 D
1828 956 D
1830 955 D
S
N
1813 965 M
1815 964 D
1818 962 D
1825 959 D
1828 958 D
1830 956 D
1830 952 D
1828 950 D
1825 949 D
1819 949 D
1816 950 D
1815 952 D
1813 955 D
1813 949 D
1815 952 D
S
N
1864 974 M
1866 973 D
1864 971 D
1863 973 D
1863 974 D
1864 977 D
1866 979 D
1870 980 D
1876 980 D
1881 979 D
1882 976 D
1882 971 D
1881 968 D
1876 967 D
1872 967 D
S
N
1876 980 M
1879 979 D
1881 976 D
1881 971 D
1879 968 D
1876 967 D
S
N
1876 967 M
1879 965 D
1882 962 D
1884 959 D
1884 955 D
1882 952 D
1881 950 D
1876 949 D
1870 949 D
1866 950 D
1864 952 D
1863 955 D
1863 956 D
1864 958 D
1866 956 D
1864 955 D
S
N
1881 964 M
1882 959 D
1882 955 D
1881 952 D
1879 950 D
1876 949 D
S
N
583 1261 M
583 1001 D
S
N
583 1001 M
1967 1001 D
S
N
1967 1001 M
1967 1261 D
S
N
1967 1261 M
583 1261 D
S
N
583 1001 M
583 1017 D
S
N
929 1017 M
929 1001 D
S
N
1275 1001 M
1275 1017 D
S
N
1621 1017 M
1621 1001 D
S
N
1967 1001 M
1967 1017 D
S
N
583 1261 M
1967 1261 D
S
N
583 1245 M
583 1261 D
S
N
929 1261 M
929 1245 D
S
N
1275 1245 M
1275 1261 D
S
N
1621 1261 M
1621 1245 D
S
N
1967 1245 M
1967 1261 D
S
N
583 1001 M
583 1261 D
S
N
583 1006 M
588 1006 D
S
N
588 1022 M
583 1022 D
S
N
583 1038 M
588 1038 D
S
N
599 1053 M
583 1053 D
S
N
583 1069 M
588 1069 D
S
N
588 1084 M
583 1084 D
S
N
583 1100 M
588 1100 D
S
N
588 1115 M
583 1115 D
S
N
583 1131 M
599 1131 D
S
N
588 1147 M
583 1147 D
S
N
583 1162 M
588 1162 D
S
N
588 1178 M
583 1178 D
S
N
583 1193 M
588 1193 D
S
N
599 1209 M
583 1209 D
S
N
583 1224 M
588 1224 D
S
N
588 1240 M
583 1240 D
S
N
583 1256 M
588 1256 D
S
N
503 1067 M
498 1065 D
495 1061 D
494 1053 D
494 1049 D
495 1041 D
498 1037 D
503 1035 D
506 1035 D
510 1037 D
513 1041 D
515 1049 D
515 1053 D
513 1061 D
510 1065 D
506 1067 D
503 1067 D
S
N
503 1067 M
500 1065 D
498 1064 D
497 1061 D
495 1053 D
495 1049 D
497 1041 D
498 1038 D
500 1037 D
503 1035 D
S
N
506 1035 M
509 1037 D
510 1038 D
512 1041 D
513 1049 D
513 1053 D
512 1061 D
510 1064 D
509 1065 D
506 1067 D
S
N
527 1038 M
525 1037 D
527 1035 D
528 1037 D
527 1038 D
S
N
547 1067 M
542 1065 D
541 1062 D
541 1058 D
542 1055 D
547 1053 D
553 1053 D
557 1055 D
559 1058 D
559 1062 D
557 1065 D
553 1067 D
547 1067 D
S
N
547 1067 M
544 1065 D
542 1062 D
542 1058 D
544 1055 D
547 1053 D
S
N
553 1053 M
556 1055 D
557 1058 D
557 1062 D
556 1065 D
553 1067 D
S
N
547 1053 M
542 1052 D
541 1050 D
539 1047 D
539 1041 D
541 1038 D
542 1037 D
547 1035 D
553 1035 D
557 1037 D
559 1038 D
560 1041 D
560 1047 D
559 1050 D
557 1052 D
553 1053 D
S
N
547 1053 M
544 1052 D
542 1050 D
541 1047 D
541 1041 D
542 1038 D
544 1037 D
547 1035 D
S
N
553 1035 M
556 1037 D
557 1038 D
559 1041 D
559 1047 D
557 1050 D
556 1052 D
553 1053 D
S
N
498 1139 M
501 1140 D
506 1145 D
506 1113 D
S
N
504 1143 M
504 1113 D
S
N
498 1113 M
512 1113 D
S
N
527 1116 M
525 1114 D
527 1113 D
528 1114 D
527 1116 D
S
N
548 1145 M
544 1143 D
541 1139 D
539 1131 D
539 1126 D
541 1119 D
544 1114 D
548 1113 D
551 1113 D
556 1114 D
559 1119 D
560 1126 D
560 1131 D
559 1139 D
556 1143 D
551 1145 D
548 1145 D
S
N
548 1145 M
545 1143 D
544 1142 D
542 1139 D
541 1131 D
541 1126 D
542 1119 D
544 1116 D
545 1114 D
548 1113 D
S
N
551 1113 M
554 1114 D
556 1116 D
557 1119 D
559 1126 D
559 1131 D
557 1139 D
556 1142 D
554 1143 D
551 1145 D
S
N
498 1216 M
501 1218 D
506 1222 D
506 1191 D
S
N
504 1221 M
504 1191 D
S
N
498 1191 M
512 1191 D
S
N
527 1194 M
525 1192 D
527 1191 D
528 1192 D
527 1194 D
S
N
541 1216 M
542 1215 D
541 1213 D
539 1215 D
539 1216 D
541 1219 D
542 1221 D
547 1222 D
553 1222 D
557 1221 D
559 1219 D
560 1216 D
560 1213 D
559 1210 D
554 1207 D
547 1204 D
544 1203 D
541 1200 D
539 1195 D
539 1191 D
S
N
553 1222 M
556 1221 D
557 1219 D
559 1216 D
559 1213 D
557 1210 D
553 1207 D
547 1204 D
S
N
539 1194 M
541 1195 D
544 1195 D
551 1192 D
556 1192 D
559 1194 D
560 1195 D
S
N
544 1195 M
551 1191 D
557 1191 D
559 1192 D
560 1195 D
560 1198 D
S
N
1967 1001 M
1967 1261 D
S
N
1962 1006 M
1967 1006 D
S
N
1967 1022 M
1962 1022 D
S
N
1962 1038 M
1967 1038 D
S
N
1967 1053 M
1951 1053 D
S
N
1962 1069 M
1967 1069 D
S
N
1967 1084 M
1962 1084 D
S
N
1962 1100 M
1967 1100 D
S
N
1967 1115 M
1962 1115 D
S
N
1951 1131 M
1967 1131 D
S
N
1967 1147 M
1962 1147 D
S
N
1962 1162 M
1967 1162 D
S
N
1967 1178 M
1962 1178 D
S
N
1962 1193 M
1967 1193 D
S
N
1967 1209 M
1951 1209 D
S
N
1962 1224 M
1967 1224 D
S
N
1967 1240 M
1962 1240 D
S
N
1962 1256 M
1967 1256 D
S
N
583 1001 M
583 1131 D
929 1131 D
929 1147 D
1275 1147 D
1275 1129 D
1621 1129 D
1621 1131 D
1967 1131 D
S
N
721 1217 M
808 1217 D
S
0 0 1 setrgbcolor
N
583 1001 M
583 1013 D
S
N
583 1025 M
583 1038 D
S
N
583 1050 M
583 1062 D
S
N
583 1074 M
583 1086 D
S
N
583 1098 M
583 1110 D
S
N
583 1122 M
583 1131 D
586 1131 D
S
N
598 1131 M
611 1131 D
S
N
623 1131 M
635 1131 D
S
N
647 1131 M
659 1131 D
S
N
671 1131 M
683 1131 D
S
N
695 1131 M
707 1131 D
S
N
720 1131 M
732 1131 D
S
N
744 1131 M
756 1131 D
S
N
768 1131 M
780 1131 D
S
N
792 1131 M
804 1131 D
S
N
816 1131 M
829 1131 D
S
N
841 1131 M
853 1131 D
S
N
865 1131 M
877 1131 D
S
N
889 1131 M
901 1131 D
S
N
913 1131 M
925 1131 D
S
N
929 1123 M
929 1115 D
934 1115 D
S
N
946 1115 M
958 1115 D
S
N
970 1115 M
982 1115 D
S
N
994 1115 M
1006 1115 D
S
N
1018 1115 M
1031 1115 D
S
N
1043 1115 M
1055 1115 D
S
N
1067 1115 M
1079 1115 D
S
N
1091 1115 M
1103 1115 D
S
N
1115 1115 M
1127 1115 D
S
N
1140 1115 M
1152 1115 D
S
N
1164 1115 M
1176 1115 D
S
N
1188 1115 M
1200 1115 D
S
N
1212 1115 M
1224 1115 D
S
N
1236 1115 M
1248 1115 D
S
N
1261 1115 M
1273 1115 D
S
N
1275 1125 M
1275 1130 D
1282 1130 D
S
N
1294 1130 M
1306 1130 D
S
N
1319 1130 M
1331 1130 D
S
N
1343 1130 M
1355 1130 D
S
N
1367 1130 M
1379 1130 D
S
N
1391 1130 M
1403 1130 D
S
N
1415 1130 M
1428 1130 D
S
N
1440 1130 M
1452 1130 D
S
N
1464 1130 M
1476 1130 D
S
N
1488 1130 M
1500 1130 D
S
N
1512 1130 M
1524 1130 D
S
N
1536 1130 M
1549 1130 D
S
N
1561 1130 M
1573 1130 D
S
N
1585 1130 M
1597 1130 D
S
N
1609 1130 M
1621 1130 D
1621 1130 D
S
N
1623 1120 M
1635 1120 D
S
N
1648 1120 M
1660 1120 D
S
N
1672 1120 M
1684 1120 D
S
N
1696 1120 M
1708 1120 D
S
N
1720 1120 M
1732 1120 D
S
N
1744 1120 M
1757 1120 D
S
N
1769 1120 M
1781 1120 D
S
N
1793 1120 M
1805 1120 D
S
N
1817 1120 M
1829 1120 D
S
N
1841 1120 M
1853 1120 D
S
N
1866 1120 M
1878 1120 D
S
N
1890 1120 M
1902 1120 D
S
N
1914 1120 M
1926 1120 D
S
N
1938 1120 M
1950 1120 D
S
N
1962 1120 M
1967 1120 D
S
N
721 1044 M
734 1044 D
S
N
746 1044 M
758 1044 D
S
N
770 1044 M
782 1044 D
S
N
794 1044 M
806 1044 D
S
showpage
%%Trailer
%%Pages: 1
%%BoundingBox: 102 226 482 563
