%!PS-Adobe-3.0 EPSF-3.0
%%BoundingBox: (atend)
%%LanguageLevel: 2
%%Creator: Grace-5.1.22
%%CreationDate: Tue Dec 20 08:49:47 2011
%%DocumentData: Clean8Bit
%%Orientation: Portrait
%%Title: /home/pcl302a/heinemey/plot/grace/2011/lhc-higgs-charged/dGammatHpb_01.grace
%%For: heinemey
%%DocumentNeededResources: (atend)
%%EndComments
%%BeginProlog
/m {moveto} def
/l {lineto} def
/s {stroke} def
/n {newpath} def
/c {closepath} def
/RL {rlineto} def
/SLW {setlinewidth} def
/GS {gsave} def
/GR {grestore} def
/SC {setcolor} def
/SGRY {setgray} def
/SRGB {setrgbcolor} def
/SD {setdash} def
/SLC {setlinecap} def
/SLJ {setlinejoin} def
/SCS {setcolorspace} def
/FFSF {findfont setfont} def
/CC {concat} def
/PXL {n m 0 0 RL s} def
/Color0 {1.0000 1.0000 1.0000} def
/Color1 {0.0000 0.0000 0.0000} def
/Color2 {1.0000 0.0000 0.0000} def
/Color3 {0.0000 1.0000 0.0000} def
/Color4 {0.0000 0.0000 1.0000} def
/Color5 {1.0000 1.0000 0.0000} def
/Color6 {0.7373 0.5608 0.5608} def
/Color7 {0.8627 0.8627 0.8627} def
/Color8 {0.5804 0.0000 0.8275} def
/Color9 {0.0000 1.0000 1.0000} def
/Color10 {1.0000 0.0000 1.0000} def
/Color11 {1.0000 0.6471 0.0000} def
/Color12 {0.4471 0.1294 0.7373} def
/Color13 {0.4039 0.0275 0.2824} def
/Color14 {0.2510 0.8784 0.8157} def
/Color15 {0.0000 0.5451 0.0000} def
/Color16 {0.7529 0.7529 0.7529} def
/Color17 {0.5059 0.5059 0.5059} def
/Color18 {0.2588 0.2588 0.2588} def
/PTRN {
 /pat_bits exch def 
 <<
  /PaintType 2
  /PatternType 1 /TilingType 1
  /BBox[0 0 16 16]
  /XStep 16 /YStep 16
  /PaintProc {
   pop
   16 16 true [-1 0 0 -1 16 16] pat_bits imagemask
  }
 >>
 [0.0016 0 0 0.0016 0 0]
 makepattern
} def
/Pattern0 {<0000000000000000000000000000000000000000000000000000000000000000> PTRN} bind def
/Pattern1 {<ffffffffffffffffffffffffffffffffffffffffffffffffffffffffffffffff> PTRN} bind def
/Pattern2 {<eeeeffffbbbbffffeeeeffffbbbbffffeeeeffffbbbbffffeeeeffffbbbbffff> PTRN} bind def
/Pattern3 {<eeeebbbbeeeebbbbeeeebbbbeeeebbbbeeeebbbbeeeebbbbeeeebbbbeeeebbbb> PTRN} bind def
/Pattern4 {<5555aaaa5555aaaa5555aaaa5555aaaa5555aaaa5555aaaa5555aaaa5555aaaa> PTRN} bind def
/Pattern5 {<1111444411114444111144441111444411114444111144441111444411114444> PTRN} bind def
/Pattern6 {<1111000044440000111100004444000011110000444400001111000044440000> PTRN} bind def
/Pattern7 {<1010000000000000010100000000000010100000000000000101000000000000> PTRN} bind def
/Pattern8 {<0000000000000000000000000000000000000000000000000000000000000000> PTRN} bind def
/Pattern9 {<1e1e0f0f8787c3c3e1e1f0f078783c3c1e1e0f0f8787c3c3e1e1f0f078783c3c> PTRN} bind def
/Pattern10 {<7878f0f0e1e1c3c387870f0f1e1e3c3c7878f0f0e1e1c3c387870f0f1e1e3c3c> PTRN} bind def
/Pattern11 {<3333333333333333333333333333333333333333333333333333333333333333> PTRN} bind def
/Pattern12 {<ffffffff00000000ffffffff00000000ffffffff00000000ffffffff00000000> PTRN} bind def
/Pattern13 {<8181424224241818181824244242818181814242242418181818242442428181> PTRN} bind def
/Pattern14 {<8080404020201010080804040202010180804040202010100808040402020101> PTRN} bind def
/Pattern15 {<0101020204040808101020204040808001010202040408081010202040408080> PTRN} bind def
/Pattern16 {<2222222222222222222222222222222222222222222222222222222222222222> PTRN} bind def
/Pattern17 {<0000ffff000000000000ffff000000000000ffff000000000000ffff00000000> PTRN} bind def
/Pattern18 {<2222ffff222222222222ffff222222222222ffff222222222222ffff22222222> PTRN} bind def
/Pattern19 {<ffffffff33333333ffffffff33333333ffffffff33333333ffffffff33333333> PTRN} bind def
/Pattern20 {<0f0f0f0f0f0f0f0ff0f0f0f0f0f0f0f00f0f0f0f0f0f0f0ff0f0f0f0f0f0f0f0> PTRN} bind def
/Pattern21 {<ff00ff00ff00ff00ff00ff00ff00ff0000ff00ff00ff00ff00ff00ff00ff00ff> PTRN} bind def
/Pattern22 {<8001800180018001800180018001ffffffff8001800180018001800180018001> PTRN} bind def
/Pattern23 {<c003c003c003c003c003c003ffffffffffffffffc003c003c003c003c003c003> PTRN} bind def
/Pattern24 {<040404040404ffff404040404040ffff040404040404ffff404040404040ffff> PTRN} bind def
/Pattern25 {<180018001800180018001800ffffffff001800180018001800180018ffffffff> PTRN} bind def
/Pattern26 {<1111b8b87c7c3a3a1111a3a3c7c78b8b1111b8b87c7c3a3a1111a3a3c7c78b8b> PTRN} bind def
/Pattern27 {<101010102828c7c70101010182827c7c101010102828c7c70101010182827c7c> PTRN} bind def
/Pattern28 {<1c1c121211112121c1c12121111112121c1c121211112121c1c1212111111212> PTRN} bind def
/Pattern29 {<3e3e414180808080e3e31414080808083e3e414180808080e3e3141408080808> PTRN} bind def
/Pattern30 {<4848888884848383848488884848383848488888848483838484888848483838> PTRN} bind def
/Pattern31 {<03030404080808080c0c12122121c0c003030404080808080c0c12122121c0c0> PTRN} bind def
/ellipsedict 8 dict def
ellipsedict /mtrx matrix put
/EARC {
 ellipsedict begin
  /endangle exch def
  /startangle exch def
  /yrad exch def
  /xrad exch def
  /y exch def
  /x exch def
  /savematrix mtrx currentmatrix def
  x y translate
  xrad yrad scale
  0 0 1 startangle endangle arc
  savematrix setmatrix
 end
} def
/TL {
  /kcomp exch def
  /linewidth exch def
  /offset exch def
  GS
  0 offset rmoveto
  linewidth SLW
  dup stringwidth exch kcomp add exch RL s
  GR
} def
/KINIT
{
 /kvector exch def
 /kid 0 def
} def
/KPROC
{
 pop pop
 kvector kid get
 0 rmoveto
 /kid 1 kid add def
} def
/DefEncoding [
 /.notdef
 /.notdef
 /.notdef
 /.notdef
 /.notdef
 /.notdef
 /.notdef
 /.notdef
 /.notdef
 /.notdef
 /.notdef
 /.notdef
 /.notdef
 /.notdef
 /.notdef
 /.notdef
 /.notdef
 /.notdef
 /.notdef
 /.notdef
 /.notdef
 /.notdef
 /.notdef
 /.notdef
 /.notdef
 /.notdef
 /.notdef
 /.notdef
 /.notdef
 /.notdef
 /.notdef
 /.notdef
 /space
 /exclam
 /quotedbl
 /numbersign
 /dollar
 /percent
 /ampersand
 /quoteright
 /parenleft
 /parenright
 /asterisk
 /plus
 /comma
 /hyphen
 /period
 /slash
 /zero
 /one
 /two
 /three
 /four
 /five
 /six
 /seven
 /eight
 /nine
 /colon
 /semicolon
 /less
 /equal
 /greater
 /question
 /at
 /A
 /B
 /C
 /D
 /E
 /F
 /G
 /H
 /I
 /J
 /K
 /L
 /M
 /N
 /O
 /P
 /Q
 /R
 /S
 /T
 /U
 /V
 /W
 /X
 /Y
 /Z
 /bracketleft
 /backslash
 /bracketright
 /asciicircum
 /underscore
 /grave
 /a
 /b
 /c
 /d
 /e
 /f
 /g
 /h
 /i
 /j
 /k
 /l
 /m
 /n
 /o
 /p
 /q
 /r
 /s
 /t
 /u
 /v
 /w
 /x
 /y
 /z
 /braceleft
 /bar
 /braceright
 /asciitilde
 /.notdef
 /.notdef
 /.notdef
 /.notdef
 /.notdef
 /.notdef
 /.notdef
 /.notdef
 /.notdef
 /.notdef
 /.notdef
 /.notdef
 /.notdef
 /.notdef
 /.notdef
 /.notdef
 /.notdef
 /.notdef
 /.notdef
 /.notdef
 /.notdef
 /.notdef
 /.notdef
 /.notdef
 /.notdef
 /.notdef
 /.notdef
 /.notdef
 /.notdef
 /.notdef
 /.notdef
 /.notdef
 /.notdef
 /space
 /exclamdown
 /cent
 /sterling
 /currency
 /yen
 /brokenbar
 /section
 /dieresis
 /copyright
 /ordfeminine
 /guillemotleft
 /logicalnot
 /hyphen
 /registered
 /macron
 /degree
 /plusminus
 /twosuperior
 /threesuperior
 /acute
 /mu
 /paragraph
 /periodcentered
 /cedilla
 /onesuperior
 /ordmasculine
 /guillemotright
 /onequarter
 /onehalf
 /threequarters
 /questiondown
 /Agrave
 /Aacute
 /Acircumflex
 /Atilde
 /Adieresis
 /Aring
 /AE
 /Ccedilla
 /Egrave
 /Eacute
 /Ecircumflex
 /Edieresis
 /Igrave
 /Iacute
 /Icircumflex
 /Idieresis
 /Eth
 /Ntilde
 /Ograve
 /Oacute
 /Ocircumflex
 /Otilde
 /Odieresis
 /multiply
 /Oslash
 /Ugrave
 /Uacute
 /Ucircumflex
 /Udieresis
 /Yacute
 /Thorn
 /germandbls
 /agrave
 /aacute
 /acircumflex
 /atilde
 /adieresis
 /aring
 /ae
 /ccedilla
 /egrave
 /eacute
 /ecircumflex
 /edieresis
 /igrave
 /iacute
 /icircumflex
 /idieresis
 /eth
 /ntilde
 /ograve
 /oacute
 /ocircumflex
 /otilde
 /odieresis
 /divide
 /oslash
 /ugrave
 /uacute
 /ucircumflex
 /udieresis
 /yacute
 /thorn
 /ydieresis
] def
%%EndProlog
%%BeginSetup
%%EndSetup
612.00 612.00 scale
[/DeviceRGB] SCS
Color2 SC
[] 0 SD
0.0045 SLW
0 SLC
0 SLJ
n
0.1500 0.5367 m
0.2704 0.5646 l
0.3408 0.5957 l
0.3908 0.6226 l
0.4296 0.6434 l
0.4613 0.6590 l
0.4880 0.6705 l
0.5112 0.6791 l
0.5317 0.6855 l
0.5500 0.6905 l
0.5666 0.6944 l
0.5817 0.6975 l
0.5956 0.7000 l
0.6085 0.7020 l
0.6204 0.7037 l
0.6316 0.7051 l
0.6422 0.7062 l
0.6521 0.7072 l
0.6615 0.7081 l
0.6704 0.7088 l
0.6789 0.7094 l
0.6870 0.7100 l
0.6947 0.7105 l
0.7021 0.7109 l
0.7092 0.7113 l
0.7160 0.7116 l
0.7225 0.7119 l
0.7289 0.7122 l
0.7350 0.7124 l
0.7408 0.7126 l
0.7465 0.7128 l
0.7521 0.7130 l
0.7574 0.7132 l
0.7626 0.7133 l
0.7676 0.7135 l
0.7725 0.7136 l
0.7773 0.7137 l
0.7819 0.7138 l
0.7864 0.7139 l
0.7908 0.7140 l
0.7951 0.7141 l
0.7993 0.7142 l
0.8034 0.7142 l
0.8074 0.7143 l
0.8113 0.7144 l
0.8151 0.7144 l
0.8188 0.7145 l
0.8225 0.7145 l
0.8261 0.7146 l
0.8296 0.7146 l
0.8330 0.7147 l
0.8364 0.7147 l
0.8397 0.7148 l
0.8430 0.7148 l
0.8461 0.7148 l
0.8493 0.7149 l
0.8523 0.7149 l
0.8554 0.7149 l
0.8583 0.7150 l
0.8613 0.7150 l
s
[/DeviceRGB] SCS
Color3 SC
n
0.1500 0.5252 m
0.2704 0.5257 l
0.3408 0.5265 l
0.3908 0.5274 l
0.4296 0.5284 l
0.4613 0.5293 l
0.4880 0.5302 l
0.5112 0.5309 l
0.5317 0.5316 l
0.5500 0.5321 l
0.5666 0.5326 l
0.5817 0.5331 l
0.5956 0.5334 l
0.6085 0.5337 l
0.6204 0.5340 l
0.6316 0.5342 l
0.6422 0.5344 l
0.6521 0.5346 l
0.6615 0.5347 l
0.6704 0.5349 l
0.6789 0.5350 l
0.6870 0.5351 l
0.6947 0.5352 l
0.7021 0.5353 l
0.7092 0.5353 l
0.7160 0.5354 l
0.7225 0.5355 l
0.7289 0.5355 l
0.7350 0.5356 l
0.7408 0.5356 l
0.7465 0.5356 l
0.7521 0.5357 l
0.7574 0.5357 l
0.7626 0.5358 l
0.7676 0.5358 l
0.7725 0.5358 l
0.7773 0.5358 l
0.7819 0.5359 l
0.7864 0.5359 l
0.7908 0.5359 l
0.7951 0.5359 l
0.7993 0.5359 l
0.8034 0.5359 l
0.8074 0.5360 l
0.8113 0.5360 l
0.8151 0.5360 l
0.8188 0.5360 l
0.8225 0.5360 l
0.8261 0.5360 l
0.8296 0.5360 l
0.8330 0.5360 l
0.8364 0.5361 l
0.8397 0.5361 l
0.8430 0.5361 l
0.8461 0.5361 l
0.8493 0.5361 l
0.8523 0.5361 l
0.8554 0.5361 l
0.8583 0.5361 l
0.8613 0.5361 l
s
[/DeviceRGB] SCS
Color4 SC
n
0.1500 0.5249 m
0.2704 0.5247 l
0.3408 0.5243 l
0.3908 0.5238 l
0.4296 0.5233 l
0.4613 0.5228 l
0.4880 0.5223 l
0.5112 0.5218 l
0.5317 0.5214 l
0.5500 0.5210 l
0.5666 0.5206 l
0.5817 0.5203 l
0.5956 0.5201 l
0.6085 0.5198 l
0.6204 0.5196 l
0.6316 0.5194 l
0.6422 0.5192 l
0.6521 0.5191 l
0.6615 0.5190 l
0.6704 0.5188 l
0.6789 0.5187 l
0.6870 0.5187 l
0.6947 0.5186 l
0.7021 0.5185 l
0.7092 0.5184 l
0.7160 0.5184 l
0.7225 0.5183 l
0.7289 0.5183 l
0.7350 0.5182 l
0.7408 0.5182 l
0.7465 0.5181 l
0.7521 0.5181 l
0.7574 0.5181 l
0.7626 0.5180 l
0.7676 0.5180 l
0.7725 0.5180 l
0.7773 0.5180 l
0.7819 0.5179 l
0.7864 0.5179 l
0.7908 0.5179 l
0.7951 0.5179 l
0.7993 0.5179 l
0.8034 0.5179 l
0.8074 0.5178 l
0.8113 0.5178 l
0.8151 0.5178 l
0.8188 0.5178 l
0.8225 0.5178 l
0.8261 0.5178 l
0.8296 0.5178 l
0.8330 0.5178 l
0.8364 0.5178 l
0.8397 0.5177 l
0.8430 0.5177 l
0.8461 0.5177 l
0.8493 0.5177 l
0.8523 0.5177 l
0.8554 0.5177 l
0.8583 0.5177 l
0.8613 0.5177 l
s
[/DeviceRGB] SCS
Color1 SC
n
0.1500 0.5248 m
0.2704 0.5244 l
0.3408 0.5237 l
0.3908 0.5228 l
0.4296 0.5218 l
0.4613 0.5207 l
0.4880 0.5195 l
0.5112 0.5184 l
0.5317 0.5173 l
0.5500 0.5163 l
0.5666 0.5154 l
0.5817 0.5145 l
0.5956 0.5137 l
0.6085 0.5130 l
0.6204 0.5124 l
0.6316 0.5118 l
0.6422 0.5113 l
0.6521 0.5108 l
0.6615 0.5104 l
0.6704 0.5100 l
0.6789 0.5096 l
0.6870 0.5093 l
0.6947 0.5090 l
0.7021 0.5088 l
0.7092 0.5085 l
0.7160 0.5083 l
0.7225 0.5081 l
0.7289 0.5079 l
0.7350 0.5078 l
0.7408 0.5076 l
0.7465 0.5075 l
0.7521 0.5074 l
0.7574 0.5072 l
0.7626 0.5071 l
0.7676 0.5070 l
0.7725 0.5069 l
0.7773 0.5068 l
0.7819 0.5068 l
0.7864 0.5067 l
0.7908 0.5066 l
0.7951 0.5066 l
0.7993 0.5065 l
0.8034 0.5064 l
0.8074 0.5064 l
0.8113 0.5063 l
0.8151 0.5063 l
0.8188 0.5062 l
0.8225 0.5062 l
0.8261 0.5061 l
0.8296 0.5061 l
0.8330 0.5061 l
0.8364 0.5060 l
0.8397 0.5060 l
0.8430 0.5060 l
0.8461 0.5059 l
0.8493 0.5059 l
0.8523 0.5059 l
0.8554 0.5059 l
0.8583 0.5058 l
0.8613 0.5058 l
s
[/DeviceRGB] SCS
Color2 SC
[0.0045 0.0135 ] 0 SD
0.0045 SLW
n
0.1500 0.5134 m
0.2704 0.4865 l
0.3408 0.4575 l
0.3908 0.4334 l
0.4296 0.4152 l
0.4613 0.4020 l
0.4880 0.3924 l
0.5112 0.3853 l
0.5317 0.3800 l
0.5500 0.3760 l
0.5666 0.3728 l
0.5817 0.3703 l
0.5956 0.3683 l
0.6085 0.3667 l
0.6204 0.3654 l
0.6316 0.3643 l
0.6422 0.3634 l
0.6521 0.3626 l
0.6615 0.3619 l
0.6704 0.3613 l
0.6789 0.3608 l
0.6870 0.3604 l
0.6947 0.3600 l
0.7021 0.3597 l
0.7092 0.3594 l
0.7160 0.3591 l
0.7225 0.3589 l
0.7289 0.3587 l
0.7350 0.3585 l
0.7408 0.3583 l
0.7465 0.3581 l
0.7521 0.3580 l
0.7574 0.3579 l
0.7626 0.3578 l
0.7676 0.3576 l
0.7725 0.3575 l
0.7773 0.3575 l
0.7819 0.3574 l
0.7864 0.3573 l
0.7908 0.3572 l
0.7951 0.3572 l
0.7993 0.3571 l
0.8034 0.3570 l
0.8074 0.3570 l
0.8113 0.3569 l
0.8151 0.3569 l
0.8188 0.3568 l
0.8225 0.3568 l
0.8261 0.3567 l
0.8296 0.3567 l
0.8330 0.3567 l
0.8364 0.3566 l
0.8397 0.3566 l
0.8430 0.3566 l
0.8461 0.3566 l
0.8493 0.3565 l
0.8523 0.3565 l
0.8554 0.3565 l
0.8583 0.3565 l
0.8613 0.3564 l
s
[/DeviceRGB] SCS
Color3 SC
n
0.1500 0.5248 m
0.2704 0.5243 l
0.3408 0.5235 l
0.3908 0.5226 l
0.4296 0.5216 l
0.4613 0.5207 l
0.4880 0.5198 l
0.5112 0.5191 l
0.5317 0.5184 l
0.5500 0.5179 l
0.5666 0.5174 l
0.5817 0.5170 l
0.5956 0.5166 l
0.6085 0.5163 l
0.6204 0.5161 l
0.6316 0.5158 l
0.6422 0.5157 l
0.6521 0.5155 l
0.6615 0.5153 l
0.6704 0.5152 l
0.6789 0.5151 l
0.6870 0.5150 l
0.6947 0.5149 l
0.7021 0.5148 l
0.7092 0.5147 l
0.7160 0.5147 l
0.7225 0.5146 l
0.7289 0.5146 l
0.7350 0.5145 l
0.7408 0.5145 l
0.7465 0.5144 l
0.7521 0.5144 l
0.7574 0.5144 l
0.7626 0.5143 l
0.7676 0.5143 l
0.7725 0.5143 l
0.7773 0.5142 l
0.7819 0.5142 l
0.7864 0.5142 l
0.7908 0.5142 l
0.7951 0.5142 l
0.7993 0.5141 l
0.8034 0.5141 l
0.8074 0.5141 l
0.8113 0.5141 l
0.8151 0.5141 l
0.8188 0.5141 l
0.8225 0.5141 l
0.8261 0.5141 l
0.8296 0.5140 l
0.8330 0.5140 l
0.8364 0.5140 l
0.8397 0.5140 l
0.8430 0.5140 l
0.8461 0.5140 l
0.8493 0.5140 l
0.8523 0.5140 l
0.8554 0.5140 l
0.8583 0.5140 l
0.8613 0.5140 l
s
[/DeviceRGB] SCS
Color4 SC
n
0.1500 0.5251 m
0.2704 0.5253 l
0.3408 0.5257 l
0.3908 0.5262 l
0.4296 0.5267 l
0.4613 0.5272 l
0.4880 0.5277 l
0.5112 0.5282 l
0.5317 0.5286 l
0.5500 0.5290 l
0.5666 0.5294 l
0.5817 0.5297 l
0.5956 0.5300 l
0.6085 0.5302 l
0.6204 0.5304 l
0.6316 0.5306 l
0.6422 0.5308 l
0.6521 0.5309 l
0.6615 0.5311 l
0.6704 0.5312 l
0.6789 0.5313 l
0.6870 0.5314 l
0.6947 0.5315 l
0.7021 0.5315 l
0.7092 0.5316 l
0.7160 0.5317 l
0.7225 0.5317 l
0.7289 0.5318 l
0.7350 0.5318 l
0.7408 0.5319 l
0.7465 0.5319 l
0.7521 0.5319 l
0.7574 0.5320 l
0.7626 0.5320 l
0.7676 0.5320 l
0.7725 0.5320 l
0.7773 0.5321 l
0.7819 0.5321 l
0.7864 0.5321 l
0.7908 0.5321 l
0.7951 0.5321 l
0.7993 0.5322 l
0.8034 0.5322 l
0.8074 0.5322 l
0.8113 0.5322 l
0.8151 0.5322 l
0.8188 0.5322 l
0.8225 0.5322 l
0.8261 0.5323 l
0.8296 0.5323 l
0.8330 0.5323 l
0.8364 0.5323 l
0.8397 0.5323 l
0.8430 0.5323 l
0.8461 0.5323 l
0.8493 0.5323 l
0.8523 0.5323 l
0.8554 0.5323 l
0.8583 0.5323 l
0.8613 0.5323 l
s
[/DeviceRGB] SCS
Color1 SC
n
0.1500 0.5252 m
0.2704 0.5256 l
0.3408 0.5263 l
0.3908 0.5272 l
0.4296 0.5282 l
0.4613 0.5293 l
0.4880 0.5305 l
0.5112 0.5316 l
0.5317 0.5327 l
0.5500 0.5337 l
0.5666 0.5347 l
0.5817 0.5355 l
0.5956 0.5363 l
0.6085 0.5371 l
0.6204 0.5377 l
0.6316 0.5383 l
0.6422 0.5389 l
0.6521 0.5393 l
0.6615 0.5398 l
0.6704 0.5402 l
0.6789 0.5405 l
0.6870 0.5408 l
0.6947 0.5411 l
0.7021 0.5414 l
0.7092 0.5416 l
0.7160 0.5419 l
0.7225 0.5421 l
0.7289 0.5423 l
0.7350 0.5424 l
0.7408 0.5426 l
0.7465 0.5427 l
0.7521 0.5429 l
0.7574 0.5430 l
0.7626 0.5431 l
0.7676 0.5432 l
0.7725 0.5433 l
0.7773 0.5434 l
0.7819 0.5435 l
0.7864 0.5435 l
0.7908 0.5436 l
0.7951 0.5437 l
0.7993 0.5437 l
0.8034 0.5438 l
0.8074 0.5439 l
0.8113 0.5439 l
0.8151 0.5440 l
0.8188 0.5440 l
0.8225 0.5441 l
0.8261 0.5441 l
0.8296 0.5441 l
0.8330 0.5442 l
0.8364 0.5442 l
0.8397 0.5442 l
0.8430 0.5443 l
0.8461 0.5443 l
0.8493 0.5443 l
0.8523 0.5444 l
0.8554 0.5444 l
0.8583 0.5444 l
0.8613 0.5444 l
s
[] 0 SD
0.0015 SLW
n
0.2704 0.1500 m
0.2704 0.1600 l
s
n
0.2704 0.9000 m
0.2704 0.8900 l
s
n
0.3408 0.1500 m
0.3408 0.1600 l
s
n
0.3408 0.9000 m
0.3408 0.8900 l
s
n
0.3908 0.1500 m
0.3908 0.1600 l
s
n
0.3908 0.9000 m
0.3908 0.8900 l
s
n
0.4296 0.1500 m
0.4296 0.1600 l
s
n
0.4296 0.9000 m
0.4296 0.8900 l
s
n
0.4613 0.1500 m
0.4613 0.1600 l
s
n
0.4613 0.9000 m
0.4613 0.8900 l
s
n
0.4880 0.1500 m
0.4880 0.1600 l
s
n
0.4880 0.9000 m
0.4880 0.8900 l
s
n
0.5112 0.1500 m
0.5112 0.1600 l
s
n
0.5112 0.9000 m
0.5112 0.8900 l
s
n
0.5317 0.1500 m
0.5317 0.1600 l
s
n
0.5317 0.9000 m
0.5317 0.8900 l
s
n
0.5500 0.1500 m
0.5500 0.1600 l
s
n
0.5500 0.9000 m
0.5500 0.8900 l
s
n
0.6704 0.1500 m
0.6704 0.1600 l
s
n
0.6704 0.9000 m
0.6704 0.8900 l
s
n
0.7408 0.1500 m
0.7408 0.1600 l
s
n
0.7408 0.9000 m
0.7408 0.8900 l
s
n
0.7908 0.1500 m
0.7908 0.1600 l
s
n
0.7908 0.9000 m
0.7908 0.8900 l
s
n
0.8296 0.1500 m
0.8296 0.1600 l
s
n
0.8296 0.9000 m
0.8296 0.8900 l
s
n
0.8613 0.1500 m
0.8613 0.1600 l
s
n
0.8613 0.9000 m
0.8613 0.8900 l
s
n
0.8880 0.1500 m
0.8880 0.1600 l
s
n
0.8880 0.9000 m
0.8880 0.8900 l
s
n
0.9112 0.1500 m
0.9112 0.1600 l
s
n
0.9112 0.9000 m
0.9112 0.8900 l
s
n
0.9317 0.1500 m
0.9317 0.1600 l
s
n
0.9317 0.9000 m
0.9317 0.8900 l
s
n
0.9500 0.1500 m
0.9500 0.1600 l
s
n
0.9500 0.9000 m
0.9500 0.8900 l
s
n
0.1500 0.1500 m
0.1500 0.1700 l
s
n
0.1500 0.9000 m
0.1500 0.8800 l
s
n
0.5500 0.1500 m
0.5500 0.1700 l
s
n
0.5500 0.9000 m
0.5500 0.8800 l
s
n
0.9500 0.1500 m
0.9500 0.1700 l
s
n
0.9500 0.9000 m
0.9500 0.8800 l
s
/Helvetica findfont
dup length dict begin
 {1 index /FID ne {def} {pop pop} ifelse} forall
 /Encoding DefEncoding def
 currentdict
end
/Font4 exch definefont pop
/Font4 FFSF
0.1451 0.1200 m
GS
[0.0280 0.0000 0.0000 0.0280 0 0] CC
(1) show
GR
/Font4 FFSF
0.5351 0.1200 m
GS
[0.0280 0.0000 0.0000 0.0280 0 0] CC
(10) show
GR
/Font4 FFSF
0.9275 0.1200 m
GS
[0.0280 0.0000 0.0000 0.0280 0 0] CC
(100) show
GR
/Font4 FFSF
0.5180 0.0845 m
GS
[0.0336 0.0000 0.0000 0.0336 0 0] CC
(tan) show
GR
/Symbol findfont
/Font12 exch definefont pop
/Font12 FFSF
0.5647 0.0845 m
GS
[0.0336 0.0000 0.0000 0.0336 0 0] CC
(b) show
GR
n
0.1500 0.1650 m
0.1600 0.1650 l
s
n
0.9500 0.1650 m
0.9400 0.1650 l
s
n
0.1500 0.1800 m
0.1600 0.1800 l
s
n
0.9500 0.1800 m
0.9400 0.1800 l
s
n
0.1500 0.1950 m
0.1600 0.1950 l
s
n
0.9500 0.1950 m
0.9400 0.1950 l
s
n
0.1500 0.2100 m
0.1600 0.2100 l
s
n
0.9500 0.2100 m
0.9400 0.2100 l
s
n
0.1500 0.2400 m
0.1600 0.2400 l
s
n
0.9500 0.2400 m
0.9400 0.2400 l
s
n
0.1500 0.2550 m
0.1600 0.2550 l
s
n
0.9500 0.2550 m
0.9400 0.2550 l
s
n
0.1500 0.2700 m
0.1600 0.2700 l
s
n
0.9500 0.2700 m
0.9400 0.2700 l
s
n
0.1500 0.2850 m
0.1600 0.2850 l
s
n
0.9500 0.2850 m
0.9400 0.2850 l
s
n
0.1500 0.3150 m
0.1600 0.3150 l
s
n
0.9500 0.3150 m
0.9400 0.3150 l
s
n
0.1500 0.3300 m
0.1600 0.3300 l
s
n
0.9500 0.3300 m
0.9400 0.3300 l
s
n
0.1500 0.3450 m
0.1600 0.3450 l
s
n
0.9500 0.3450 m
0.9400 0.3450 l
s
n
0.1500 0.3600 m
0.1600 0.3600 l
s
n
0.9500 0.3600 m
0.9400 0.3600 l
s
n
0.1500 0.3900 m
0.1600 0.3900 l
s
n
0.9500 0.3900 m
0.9400 0.3900 l
s
n
0.1500 0.4050 m
0.1600 0.4050 l
s
n
0.9500 0.4050 m
0.9400 0.4050 l
s
n
0.1500 0.4200 m
0.1600 0.4200 l
s
n
0.9500 0.4200 m
0.9400 0.4200 l
s
n
0.1500 0.4350 m
0.1600 0.4350 l
s
n
0.9500 0.4350 m
0.9400 0.4350 l
s
n
0.1500 0.4650 m
0.1600 0.4650 l
s
n
0.9500 0.4650 m
0.9400 0.4650 l
s
n
0.1500 0.4800 m
0.1600 0.4800 l
s
n
0.9500 0.4800 m
0.9400 0.4800 l
s
n
0.1500 0.4950 m
0.1600 0.4950 l
s
n
0.9500 0.4950 m
0.9400 0.4950 l
s
n
0.1500 0.5100 m
0.1600 0.5100 l
s
n
0.9500 0.5100 m
0.9400 0.5100 l
s
n
0.1500 0.5400 m
0.1600 0.5400 l
s
n
0.9500 0.5400 m
0.9400 0.5400 l
s
n
0.1500 0.5550 m
0.1600 0.5550 l
s
n
0.9500 0.5550 m
0.9400 0.5550 l
s
n
0.1500 0.5700 m
0.1600 0.5700 l
s
n
0.9500 0.5700 m
0.9400 0.5700 l
s
n
0.1500 0.5850 m
0.1600 0.5850 l
s
n
0.9500 0.5850 m
0.9400 0.5850 l
s
n
0.1500 0.6150 m
0.1600 0.6150 l
s
n
0.9500 0.6150 m
0.9400 0.6150 l
s
n
0.1500 0.6300 m
0.1600 0.6300 l
s
n
0.9500 0.6300 m
0.9400 0.6300 l
s
n
0.1500 0.6450 m
0.1600 0.6450 l
s
n
0.9500 0.6450 m
0.9400 0.6450 l
s
n
0.1500 0.6600 m
0.1600 0.6600 l
s
n
0.9500 0.6600 m
0.9400 0.6600 l
s
n
0.1500 0.6900 m
0.1600 0.6900 l
s
n
0.9500 0.6900 m
0.9400 0.6900 l
s
n
0.1500 0.7050 m
0.1600 0.7050 l
s
n
0.9500 0.7050 m
0.9400 0.7050 l
s
n
0.1500 0.7200 m
0.1600 0.7200 l
s
n
0.9500 0.7200 m
0.9400 0.7200 l
s
n
0.1500 0.7350 m
0.1600 0.7350 l
s
n
0.9500 0.7350 m
0.9400 0.7350 l
s
n
0.1500 0.7650 m
0.1600 0.7650 l
s
n
0.9500 0.7650 m
0.9400 0.7650 l
s
n
0.1500 0.7800 m
0.1600 0.7800 l
s
n
0.9500 0.7800 m
0.9400 0.7800 l
s
n
0.1500 0.7950 m
0.1600 0.7950 l
s
n
0.9500 0.7950 m
0.9400 0.7950 l
s
n
0.1500 0.8100 m
0.1600 0.8100 l
s
n
0.9500 0.8100 m
0.9400 0.8100 l
s
n
0.1500 0.8400 m
0.1600 0.8400 l
s
n
0.9500 0.8400 m
0.9400 0.8400 l
s
n
0.1500 0.8550 m
0.1600 0.8550 l
s
n
0.9500 0.8550 m
0.9400 0.8550 l
s
n
0.1500 0.8700 m
0.1600 0.8700 l
s
n
0.9500 0.8700 m
0.9400 0.8700 l
s
n
0.1500 0.8850 m
0.1600 0.8850 l
s
n
0.9500 0.8850 m
0.9400 0.8850 l
s
n
0.1500 0.1500 m
0.1700 0.1500 l
s
n
0.9500 0.1500 m
0.9300 0.1500 l
s
n
0.1500 0.2250 m
0.1700 0.2250 l
s
n
0.9500 0.2250 m
0.9300 0.2250 l
s
n
0.1500 0.3000 m
0.1700 0.3000 l
s
n
0.9500 0.3000 m
0.9300 0.3000 l
s
n
0.1500 0.3750 m
0.1700 0.3750 l
s
n
0.9500 0.3750 m
0.9300 0.3750 l
s
n
0.1500 0.4500 m
0.1700 0.4500 l
s
n
0.9500 0.4500 m
0.9300 0.4500 l
s
n
0.1500 0.5250 m
0.1700 0.5250 l
s
n
0.9500 0.5250 m
0.9300 0.5250 l
s
n
0.1500 0.6000 m
0.1700 0.6000 l
s
n
0.9500 0.6000 m
0.9300 0.6000 l
s
n
0.1500 0.6750 m
0.1700 0.6750 l
s
n
0.9500 0.6750 m
0.9300 0.6750 l
s
n
0.1500 0.7500 m
0.1700 0.7500 l
s
n
0.9500 0.7500 m
0.9300 0.7500 l
s
n
0.1500 0.8250 m
0.1700 0.8250 l
s
n
0.9500 0.8250 m
0.9300 0.8250 l
s
n
0.1500 0.9000 m
0.1700 0.9000 l
s
n
0.9500 0.9000 m
0.9300 0.9000 l
s
/Font4 FFSF
0.0929 0.1404 m
GS
[0.0280 0.0000 0.0000 0.0280 0 0] CC
(-0.5) show
GR
/Font4 FFSF
0.0929 0.2154 m
GS
[0.0280 0.0000 0.0000 0.0280 0 0] CC
(-0.4) show
GR
/Font4 FFSF
0.0933 0.2904 m
GS
[0.0280 0.0000 0.0000 0.0280 0 0] CC
(-0.3) show
GR
/Font4 FFSF
0.0929 0.3654 m
GS
[0.0280 0.0000 0.0000 0.0280 0 0] CC
(-0.2) show
GR
/Font4 FFSF
0.0976 0.4404 m
GS
[0.0280 0.0000 0.0000 0.0280 0 0] CC
(-0.1) show
GR
/Font4 FFSF
0.1024 0.5154 m
GS
[0.0280 0.0000 0.0000 0.0280 0 0] CC
(0.0) show
GR
/Font4 FFSF
0.1067 0.5904 m
GS
[0.0280 0.0000 0.0000 0.0280 0 0] CC
(0.1) show
GR
/Font4 FFSF
0.1020 0.6654 m
GS
[0.0280 0.0000 0.0000 0.0280 0 0] CC
(0.2) show
GR
/Font4 FFSF
0.1024 0.7404 m
GS
[0.0280 0.0000 0.0000 0.0280 0 0] CC
(0.3) show
GR
/Font4 FFSF
0.1020 0.8154 m
GS
[0.0280 0.0000 0.0000 0.0280 0 0] CC
(0.4) show
GR
/Font4 FFSF
0.1020 0.8904 m
GS
[0.0280 0.0000 0.0000 0.0280 0 0] CC
(0.5) show
GR
/Font12 FFSF
0.0759 0.4389 m
GS
[0.0000 0.0336 -0.0336 0.0000 0 0] CC
(dG) show
GR
/Font4 FFSF
0.0759 0.4758 m
GS
[0.0000 0.0336 -0.0336 0.0000 0 0] CC
(\(t -> H) show
GR
/Font4 FFSF
0.0557 0.5699 m
GS
[0.0000 0.0238 -0.0238 0.0000 0 0] CC
(+) show
GR
/Font4 FFSF
0.0759 0.5836 m
GS
[0.0000 0.0336 -0.0336 0.0000 0 0] CC
(b\)) show
GR
n
0.1500 0.1500 m
0.1500 0.9000 l
0.9500 0.9000 l
0.9500 0.1500 l
0.1500 0.1500 l
c
s
/Font4 FFSF
0.3073 0.8624 m
GS
[0.0238 0.0000 0.0000 0.0238 0 0] CC
(m) show
GR
/Font4 FFSF
0.3273 0.8528 m
GS
[0.0168 0.0000 0.0000 0.0168 0 0] CC
(t) show
GR
/Font4 FFSF
0.3320 0.8624 m
GS
[0.0238 0.0000 0.0000 0.0238 0 0] CC
(\(m) show
GR
/Font4 FFSF
0.3598 0.8528 m
GS
[0.0168 0.0000 0.0000 0.0168 0 0] CC
(t) show
GR
/Font4 FFSF
0.3645 0.8624 m
GS
[0.0238 0.0000 0.0000 0.0238 0 0] CC
(\) = 166.8 GeV, m) show
GR
/Font4 FFSF
0.5465 0.8528 m
GS
[0.0168 0.0000 0.0000 0.0168 0 0] CC
(b) show
GR
/Font4 FFSF
0.5559 0.8624 m
GS
[0.0238 0.0000 0.0000 0.0238 0 0] CC
(\(m) show
GR
/Font4 FFSF
0.5837 0.8528 m
GS
[0.0168 0.0000 0.0000 0.0168 0 0] CC
(t) show
GR
/Font4 FFSF
0.5884 0.8624 m
GS
[0.0238 0.0000 0.0000 0.0238 0 0] CC
(\) = 2.31 GeV) show
GR
/Font12 FFSF
0.3073 0.8156 m
GS
[0.0238 0.0000 0.0000 0.0238 0 0] CC
(D) show
GR
/Font4 FFSF
0.3218 0.8061 m
GS
[0.0168 0.0000 0.0000 0.0168 0 0] CC
(b) show
GR
/Font4 FFSF
0.3312 0.8156 m
GS
[0.0238 0.0000 0.0000 0.0238 0 0] CC
( = -0.8) show
GR
[/DeviceRGB] SCS
Color2 SC
[] 0 SD
0.0045 SLW
n
0.2123 0.8191 m
0.2923 0.8191 l
s
/Font12 FFSF
[/DeviceRGB] SCS
Color1 SC
0.3073 0.7688 m
GS
[0.0238 0.0000 0.0000 0.0238 0 0] CC
(D) show
GR
/Font4 FFSF
0.3218 0.7593 m
GS
[0.0168 0.0000 0.0000 0.0168 0 0] CC
(b) show
GR
/Font4 FFSF
0.3312 0.7688 m
GS
[0.0238 0.0000 0.0000 0.0238 0 0] CC
( = -0.2) show
GR
[/DeviceRGB] SCS
Color3 SC
n
0.2123 0.7723 m
0.2923 0.7723 l
s
/Font12 FFSF
[/DeviceRGB] SCS
Color1 SC
0.3073 0.7220 m
GS
[0.0238 0.0000 0.0000 0.0238 0 0] CC
(D) show
GR
/Font4 FFSF
0.3218 0.7125 m
GS
[0.0168 0.0000 0.0000 0.0168 0 0] CC
(b) show
GR
/Font4 FFSF
0.3312 0.7220 m
GS
[0.0238 0.0000 0.0000 0.0238 0 0] CC
( = +0.2) show
GR
[/DeviceRGB] SCS
Color4 SC
n
0.2123 0.7255 m
0.2923 0.7255 l
s
/Font12 FFSF
[/DeviceRGB] SCS
Color1 SC
0.3073 0.6753 m
GS
[0.0238 0.0000 0.0000 0.0238 0 0] CC
(D) show
GR
/Font4 FFSF
0.3218 0.6657 m
GS
[0.0168 0.0000 0.0000 0.0168 0 0] CC
(b) show
GR
/Font4 FFSF
0.3312 0.6753 m
GS
[0.0238 0.0000 0.0000 0.0238 0 0] CC
( = +0.8) show
GR
n
0.2123 0.6787 m
0.2923 0.6787 l
s
/Font4 FFSF
0.9700 0.7000 m
GS
[0.0000 0.0168 -0.0168 0.0000 0 0] CC
(LHC Higgs XS WG 2011) show
GR
%%Trailer
%%BoundingBox: 26 46 597 559
%%DocumentNeededResources: font Helvetica
%%+ font Symbol
%%EOF
