%!PS-Adobe-1.0
%%Creator: Unified Graphics System
%%Pages: (atend)
%%DocumentFonts: Helvetica
%%BoundingBox:   78   74  496  420
%%EndComments
/Sw{setlinewidth}def
/Sg{setgray}def
/Sd{setdash}def
/P {newpath
    moveto
0 0 rlineto
    stroke}def
/M {moveto}def
/D {lineto}def
/N {newpath}def
/S {stroke}def
/T {/Helvetica findfont
    exch
    scalefont
    setfont}def
/R {rotate}def
/W {show}def
/F {fill}def
/X {gsave}def
/Y {grestore}def
%%EndProlog
%%Page: 1 1
0.12000 0.12000 scale
1 setlinecap
1 setlinejoin
12 Sw
0.00 0.00 0.00 setrgbcolor
[] 0 Sd
N
1339 3414 M
1339 992 D
S
N
1339 992 M
4107 992 D
S
N
4107 992 M
4107 3414 D
S
N
4107 3414 M
1339 3414 D
S
N
1339 992 M
4107 992 D
S
N
1339 992 M
1339 1017 D
S
N
1515 1000 M
1515 992 D
S
N
1690 992 M
1690 1000 D
S
N
1866 1000 M
1866 992 D
S
N
2042 992 M
2042 1000 D
S
N
2218 1017 M
2218 992 D
S
N
2393 992 M
2393 1000 D
S
N
2569 1000 M
2569 992 D
S
N
2745 992 M
2745 1000 D
S
N
2921 1000 M
2921 992 D
S
N
3096 992 M
3096 1017 D
S
N
3272 1000 M
3272 992 D
S
N
3448 992 M
3448 1000 D
S
N
3624 1000 M
3624 992 D
S
N
3799 992 M
3799 1000 D
S
N
3975 1017 M
3975 992 D
S
N
1336 935 M
1327 932 D
1322 923 D
1319 909 D
1319 900 D
1322 886 D
1327 877 D
1336 874 D
1342 874 D
1351 877 D
1356 886 D
1359 900 D
1359 909 D
1356 923 D
1351 932 D
1342 935 D
1336 935 D
S
N
1336 935 M
1330 932 D
1327 929 D
1325 923 D
1322 909 D
1322 900 D
1325 886 D
1327 880 D
1330 877 D
1336 874 D
S
N
1342 874 M
1348 877 D
1351 880 D
1353 886 D
1356 900 D
1356 909 D
1353 923 D
1351 929 D
1348 932 D
1342 935 D
S
N
2206 923 M
2212 926 D
2221 935 D
2221 874 D
S
N
2218 932 M
2218 874 D
S
N
2206 874 M
2232 874 D
S
N
3079 923 M
3082 920 D
3079 918 D
3076 920 D
3076 923 D
3079 929 D
3082 932 D
3091 935 D
3102 935 D
3111 932 D
3114 929 D
3117 923 D
3117 918 D
3114 912 D
3105 906 D
3091 900 D
3085 897 D
3079 892 D
3076 883 D
3076 874 D
S
N
3102 935 M
3108 932 D
3111 929 D
3114 923 D
3114 918 D
3111 912 D
3102 906 D
3091 900 D
S
N
3076 880 M
3079 883 D
3085 883 D
3099 877 D
3108 877 D
3114 880 D
3117 883 D
S
N
3085 883 M
3099 874 D
3111 874 D
3114 877 D
3117 883 D
3117 889 D
S
N
3958 923 M
3961 920 D
3958 918 D
3955 920 D
3955 923 D
3958 929 D
3961 932 D
3969 935 D
3981 935 D
3990 932 D
3992 926 D
3992 918 D
3990 912 D
3981 909 D
3972 909 D
S
N
3981 935 M
3987 932 D
3990 926 D
3990 918 D
3987 912 D
3981 909 D
S
N
3981 909 M
3987 906 D
3992 900 D
3995 895 D
3995 886 D
3992 880 D
3990 877 D
3981 874 D
3969 874 D
3961 877 D
3958 880 D
3955 886 D
3955 889 D
3958 892 D
3961 889 D
3958 886 D
S
N
3990 903 M
3992 895 D
3992 886 D
3990 880 D
3987 877 D
3981 874 D
S
N
1339 992 M
1339 3414 D
S
N
1339 992 M
1364 992 D
S
N
1347 1174 M
1339 1174 D
S
N
1339 1281 M
1347 1281 D
S
N
1347 1357 M
1339 1357 D
S
N
1339 1415 M
1347 1415 D
S
N
1347 1463 M
1339 1463 D
S
N
1339 1504 M
1347 1504 D
S
N
1347 1539 M
1339 1539 D
S
N
1339 1570 M
1347 1570 D
S
N
1364 1598 M
1339 1598 D
S
N
1339 1780 M
1347 1780 D
S
N
1347 1886 M
1339 1886 D
S
N
1339 1962 M
1347 1962 D
S
N
1347 2021 M
1339 2021 D
S
N
1339 2069 M
1347 2069 D
S
N
1347 2109 M
1339 2109 D
S
N
1339 2144 M
1347 2144 D
S
N
1347 2175 M
1339 2175 D
S
N
1339 2203 M
1364 2203 D
S
N
1347 2385 M
1339 2385 D
S
N
1339 2492 M
1347 2492 D
S
N
1347 2568 M
1339 2568 D
S
N
1339 2626 M
1347 2626 D
S
N
1347 2674 M
1339 2674 D
S
N
1339 2715 M
1347 2715 D
S
N
1347 2750 M
1339 2750 D
S
N
1339 2781 M
1347 2781 D
S
N
1364 2809 M
1339 2809 D
S
N
1339 2991 M
1347 2991 D
S
N
1347 3097 M
1339 3097 D
S
N
1339 3173 M
1347 3173 D
S
N
1347 3232 M
1339 3232 D
S
N
1339 3280 M
1347 3280 D
S
N
1347 3320 M
1339 3320 D
S
N
1339 3355 M
1347 3355 D
S
N
1347 3386 M
1339 3386 D
S
N
1339 3414 M
1364 3414 D
S
N
1028 1006 M
1033 1009 D
1042 1018 D
1042 957 D
S
N
1039 1015 M
1039 957 D
S
N
1028 957 M
1054 957 D
S
N
1094 1018 M
1085 1015 D
1079 1006 D
1077 992 D
1077 983 D
1079 969 D
1085 960 D
1094 957 D
1100 957 D
1108 960 D
1114 969 D
1117 983 D
1117 992 D
1114 1006 D
1108 1015 D
1100 1018 D
1094 1018 D
S
N
1094 1018 M
1088 1015 D
1085 1012 D
1082 1006 D
1079 992 D
1079 983 D
1082 969 D
1085 963 D
1088 960 D
1094 957 D
S
N
1100 957 M
1105 960 D
1108 963 D
1111 969 D
1114 983 D
1114 992 D
1111 1006 D
1108 1012 D
1105 1015 D
1100 1018 D
S
N
1137 1018 M
1189 1018 D
S
N
1212 1041 M
1215 1038 D
1212 1035 D
1209 1038 D
1209 1041 D
1212 1047 D
1215 1050 D
1224 1053 D
1235 1053 D
1244 1050 D
1247 1047 D
1250 1041 D
1250 1035 D
1247 1029 D
1238 1024 D
1224 1018 D
1218 1015 D
1212 1009 D
1209 1001 D
1209 992 D
S
N
1235 1053 M
1241 1050 D
1244 1047 D
1247 1041 D
1247 1035 D
1244 1029 D
1235 1024 D
1224 1018 D
S
N
1209 998 M
1212 1001 D
1218 1001 D
1232 995 D
1241 995 D
1247 998 D
1250 1001 D
S
N
1218 1001 M
1232 992 D
1244 992 D
1247 995 D
1250 1001 D
1250 1006 D
S
N
1028 1612 M
1033 1615 D
1042 1623 D
1042 1563 D
S
N
1039 1621 M
1039 1563 D
S
N
1028 1563 M
1054 1563 D
S
N
1094 1623 M
1085 1621 D
1079 1612 D
1077 1598 D
1077 1589 D
1079 1574 D
1085 1566 D
1094 1563 D
1100 1563 D
1108 1566 D
1114 1574 D
1117 1589 D
1117 1598 D
1114 1612 D
1108 1621 D
1100 1623 D
1094 1623 D
S
N
1094 1623 M
1088 1621 D
1085 1618 D
1082 1612 D
1079 1598 D
1079 1589 D
1082 1574 D
1085 1569 D
1088 1566 D
1094 1563 D
S
N
1100 1563 M
1105 1566 D
1108 1569 D
1111 1574 D
1114 1589 D
1114 1598 D
1111 1612 D
1108 1618 D
1105 1621 D
1100 1623 D
S
N
1137 1623 M
1189 1623 D
S
N
1218 1647 M
1224 1649 D
1232 1658 D
1232 1598 D
S
N
1229 1655 M
1229 1598 D
S
N
1218 1598 M
1244 1598 D
S
N
1103 2217 M
1108 2220 D
1117 2229 D
1117 2168 D
S
N
1114 2226 M
1114 2168 D
S
N
1103 2168 M
1129 2168 D
S
N
1169 2229 M
1160 2226 D
1154 2217 D
1152 2203 D
1152 2194 D
1154 2180 D
1160 2171 D
1169 2168 D
1175 2168 D
1183 2171 D
1189 2180 D
1192 2194 D
1192 2203 D
1189 2217 D
1183 2226 D
1175 2229 D
1169 2229 D
S
N
1169 2229 M
1163 2226 D
1160 2223 D
1157 2217 D
1154 2203 D
1154 2194 D
1157 2180 D
1160 2174 D
1163 2171 D
1169 2168 D
S
N
1175 2168 M
1180 2171 D
1183 2174 D
1186 2180 D
1189 2194 D
1189 2203 D
1186 2217 D
1183 2223 D
1180 2226 D
1175 2229 D
S
N
1227 2264 M
1218 2261 D
1212 2252 D
1209 2238 D
1209 2229 D
1212 2215 D
1218 2206 D
1227 2203 D
1232 2203 D
1241 2206 D
1247 2215 D
1250 2229 D
1250 2238 D
1247 2252 D
1241 2261 D
1232 2264 D
1227 2264 D
S
N
1227 2264 M
1221 2261 D
1218 2258 D
1215 2252 D
1212 2238 D
1212 2229 D
1215 2215 D
1218 2209 D
1221 2206 D
1227 2203 D
S
N
1232 2203 M
1238 2206 D
1241 2209 D
1244 2215 D
1247 2229 D
1247 2238 D
1244 2252 D
1241 2258 D
1238 2261 D
1232 2264 D
S
N
1103 2823 M
1108 2826 D
1117 2834 D
1117 2774 D
S
N
1114 2832 M
1114 2774 D
S
N
1103 2774 M
1129 2774 D
S
N
1169 2834 M
1160 2832 D
1154 2823 D
1152 2809 D
1152 2800 D
1154 2785 D
1160 2777 D
1169 2774 D
1175 2774 D
1183 2777 D
1189 2785 D
1192 2800 D
1192 2809 D
1189 2823 D
1183 2832 D
1175 2834 D
1169 2834 D
S
N
1169 2834 M
1163 2832 D
1160 2829 D
1157 2823 D
1154 2809 D
1154 2800 D
1157 2785 D
1160 2780 D
1163 2777 D
1169 2774 D
S
N
1175 2774 M
1180 2777 D
1183 2780 D
1186 2785 D
1189 2800 D
1189 2809 D
1186 2823 D
1183 2829 D
1180 2832 D
1175 2834 D
S
N
1218 2858 M
1224 2860 D
1232 2869 D
1232 2809 D
S
N
1229 2866 M
1229 2809 D
S
N
1218 2809 M
1244 2809 D
S
N
1103 3428 M
1108 3431 D
1117 3440 D
1117 3379 D
S
N
1114 3437 M
1114 3379 D
S
N
1103 3379 M
1129 3379 D
S
N
1169 3440 M
1160 3437 D
1154 3428 D
1152 3414 D
1152 3405 D
1154 3391 D
1160 3382 D
1169 3379 D
1175 3379 D
1183 3382 D
1189 3391 D
1192 3405 D
1192 3414 D
1189 3428 D
1183 3437 D
1175 3440 D
1169 3440 D
S
N
1169 3440 M
1163 3437 D
1160 3434 D
1157 3428 D
1154 3414 D
1154 3405 D
1157 3391 D
1160 3385 D
1163 3382 D
1169 3379 D
S
N
1175 3379 M
1180 3382 D
1183 3385 D
1186 3391 D
1189 3405 D
1189 3414 D
1186 3428 D
1183 3434 D
1180 3437 D
1175 3440 D
S
N
1212 3463 M
1215 3460 D
1212 3457 D
1209 3460 D
1209 3463 D
1212 3469 D
1215 3472 D
1224 3475 D
1235 3475 D
1244 3472 D
1247 3469 D
1250 3463 D
1250 3457 D
1247 3451 D
1238 3446 D
1224 3440 D
1218 3437 D
1212 3431 D
1209 3423 D
1209 3414 D
S
N
1235 3475 M
1241 3472 D
1244 3469 D
1247 3463 D
1247 3457 D
1244 3451 D
1235 3446 D
1224 3440 D
S
N
1209 3420 M
1212 3423 D
1218 3423 D
1232 3417 D
1241 3417 D
1247 3420 D
1250 3423 D
S
N
1218 3423 M
1232 3414 D
1244 3414 D
1247 3417 D
1250 3423 D
1250 3428 D
S
N
4082 992 M
4107 992 D
S
N
4107 1174 M
4099 1174 D
S
N
4099 1281 M
4107 1281 D
S
N
4107 1357 M
4099 1357 D
S
N
4099 1415 M
4107 1415 D
S
N
4107 1463 M
4099 1463 D
S
N
4099 1504 M
4107 1504 D
S
N
4107 1539 M
4099 1539 D
S
N
4099 1570 M
4107 1570 D
S
N
4107 1598 M
4082 1598 D
S
N
4099 1780 M
4107 1780 D
S
N
4107 1886 M
4099 1886 D
S
N
4099 1962 M
4107 1962 D
S
N
4107 2021 M
4099 2021 D
S
N
4099 2069 M
4107 2069 D
S
N
4107 2109 M
4099 2109 D
S
N
4099 2144 M
4107 2144 D
S
N
4107 2175 M
4099 2175 D
S
N
4082 2203 M
4107 2203 D
S
N
4107 2385 M
4099 2385 D
S
N
4099 2492 M
4107 2492 D
S
N
4107 2568 M
4099 2568 D
S
N
4099 2626 M
4107 2626 D
S
N
4107 2674 M
4099 2674 D
S
N
4099 2715 M
4107 2715 D
S
N
4107 2750 M
4099 2750 D
S
N
4099 2781 M
4107 2781 D
S
N
4107 2809 M
4082 2809 D
S
N
4099 2991 M
4107 2991 D
S
N
4107 3097 M
4099 3097 D
S
N
4099 3173 M
4107 3173 D
S
N
4107 3232 M
4099 3232 D
S
N
4099 3280 M
4107 3280 D
S
N
4107 3320 M
4099 3320 D
S
N
4099 3355 M
4107 3355 D
S
N
4107 3386 M
4099 3386 D
S
N
4082 3414 M
4107 3414 D
S
8 Sw
0.00 0.00 1.00 setrgbcolor
1339 992 P
N
1339 1468 M
1477 1468 D
1477 1476 D
1616 1476 D
1616 1491 D
1754 1491 D
1754 1518 D
1893 1518 D
1893 1548 D
2031 1548 D
2031 1591 D
2169 1591 D
2169 1640 D
2308 1640 D
2308 1698 D
2446 1698 D
2446 1756 D
2585 1756 D
2585 1821 D
2723 1821 D
2723 1892 D
2861 1892 D
2861 1964 D
3000 1964 D
3000 2044 D
3138 2044 D
3138 2126 D
3277 2126 D
3277 2217 D
3415 2217 D
3415 2317 D
3553 2317 D
3553 2428 D
3692 2428 D
3692 2555 D
3830 2555 D
3830 2701 D
3969 2701 D
3969 2937 D
4107 2937 D
4107 992 D
4107 992 D
S
N
1443 1468 M
1374 1468 D
S
N
1408 1468 M
1408 1468 D
S
N
1443 1468 M
1374 1468 D
S
N
1581 1477 M
1512 1477 D
S
N
1547 1477 M
1547 1476 D
S
N
1581 1476 M
1512 1476 D
S
N
1720 1491 M
1650 1491 D
S
N
1685 1491 M
1685 1491 D
S
N
1720 1491 M
1650 1491 D
S
N
1858 1518 M
1789 1518 D
S
N
1823 1518 M
1823 1518 D
S
N
1858 1518 M
1789 1518 D
S
N
1996 1548 M
1927 1548 D
S
N
1962 1548 M
1962 1548 D
S
N
1996 1548 M
1927 1548 D
S
N
2135 1591 M
2066 1591 D
S
N
2100 1591 M
2100 1591 D
S
N
2135 1591 M
2066 1591 D
S
N
2273 1640 M
2204 1640 D
S
N
2239 1640 M
2239 1640 D
S
N
2273 1640 M
2204 1640 D
S
N
2412 1698 M
2342 1698 D
S
N
2377 1698 M
2377 1698 D
S
N
2412 1698 M
2342 1698 D
S
N
2550 1756 M
2481 1756 D
S
N
2515 1756 M
2515 1756 D
S
N
2550 1756 M
2481 1756 D
S
N
2688 1821 M
2619 1821 D
S
N
2654 1821 M
2654 1821 D
S
N
2688 1821 M
2619 1821 D
S
N
2827 1892 M
2758 1892 D
S
N
2792 1892 M
2792 1892 D
S
N
2827 1892 M
2758 1892 D
S
N
2965 1964 M
2896 1964 D
S
N
2931 1964 M
2931 1964 D
S
N
2965 1964 M
2896 1964 D
S
N
3104 2044 M
3034 2044 D
S
N
3069 2044 M
3069 2044 D
S
N
3104 2044 M
3034 2044 D
S
N
3242 2126 M
3173 2126 D
S
N
3207 2126 M
3207 2126 D
S
N
3242 2126 M
3173 2126 D
S
N
3380 2217 M
3311 2217 D
S
N
3346 2217 M
3346 2217 D
S
N
3380 2217 M
3311 2217 D
S
N
3519 2317 M
3450 2317 D
S
N
3484 2317 M
3484 2317 D
S
N
3519 2317 M
3450 2317 D
S
N
3657 2428 M
3588 2428 D
S
N
3623 2428 M
3623 2428 D
S
N
3657 2428 M
3588 2428 D
S
N
3796 2555 M
3726 2555 D
S
N
3761 2555 M
3761 2555 D
S
N
3796 2555 M
3726 2555 D
S
N
3934 2701 M
3865 2701 D
S
N
3899 2701 M
3899 2701 D
S
N
3934 2701 M
3865 2701 D
S
N
4072 2937 M
4003 2937 D
S
4038 2937 P
N
4072 2937 M
4003 2937 D
S
0.00 0.00 0.00 setrgbcolor
1339 992 P
[39] 0 Sd
N
1339 1181 M
1477 1181 D
1477 1194 D
1616 1194 D
1616 1211 D
1754 1211 D
1754 1239 D
1893 1239 D
1893 1275 D
2031 1275 D
2031 1327 D
2169 1327 D
2169 1379 D
2308 1379 D
2308 1445 D
2446 1445 D
2446 1510 D
2585 1510 D
2585 1580 D
2723 1580 D
2723 1655 D
2861 1655 D
2861 1736 D
3000 1736 D
3000 1820 D
3138 1820 D
3138 1911 D
3277 1911 D
3277 2011 D
3415 2011 D
3415 2123 D
3553 2123 D
3553 2253 D
3692 2253 D
3692 2414 D
3830 2414 D
3830 2625 D
3969 2625 D
3969 2893 D
4107 2893 D
4107 992 D
4107 992 D
S
0.00 0.00 1.00 setrgbcolor
[] 0 Sd
N
1515 3232 M
1778 3232 D
S
0.00 0.00 0.00 setrgbcolor
[39] 0 Sd
N
1515 3049 M
1778 3049 D
S
[] 0 Sd
N
1841 3264 M
1841 3188 D
S
N
1845 3264 M
1888 3196 D
S
N
1845 3257 M
1888 3188 D
S
N
1888 3264 M
1888 3188 D
S
N
1830 3264 M
1845 3264 D
S
N
1877 3264 M
1899 3264 D
S
N
1830 3188 M
1852 3188 D
S
N
1924 3264 M
1924 3188 D
S
N
1928 3264 M
1971 3196 D
S
N
1928 3257 M
1971 3188 D
S
N
1971 3264 M
1971 3188 D
S
N
1913 3264 M
1928 3264 D
S
N
1960 3264 M
1982 3264 D
S
N
1913 3188 M
1935 3188 D
S
N
2007 3264 M
2007 3188 D
S
N
2010 3264 M
2010 3188 D
S
N
1996 3264 M
2021 3264 D
S
N
1996 3188 M
2050 3188 D
2050 3210 D
2046 3188 D
S
N
2090 3264 M
2079 3261 D
2072 3253 D
2068 3246 D
2064 3232 D
2064 3221 D
2068 3206 D
2072 3199 D
2079 3192 D
2090 3188 D
2097 3188 D
2108 3192 D
2115 3199 D
2119 3206 D
2122 3221 D
2122 3232 D
2119 3246 D
2115 3253 D
2108 3261 D
2097 3264 D
2090 3264 D
S
N
2090 3264 M
2082 3261 D
2075 3253 D
2072 3246 D
2068 3232 D
2068 3221 D
2072 3206 D
2075 3199 D
2082 3192 D
2090 3188 D
S
N
2097 3188 M
2104 3192 D
2111 3199 D
2115 3206 D
2119 3221 D
2119 3232 D
2115 3246 D
2111 3253 D
2104 3261 D
2097 3264 D
S
N
1841 3082 M
1841 3006 D
S
N
1845 3082 M
1888 3013 D
S
N
1845 3075 M
1888 3006 D
S
N
1888 3082 M
1888 3006 D
S
N
1830 3082 M
1845 3082 D
S
N
1877 3082 M
1899 3082 D
S
N
1830 3006 M
1852 3006 D
S
N
1924 3082 M
1924 3006 D
S
N
1928 3082 M
1928 3006 D
S
N
1913 3082 M
1938 3082 D
S
N
1913 3006 M
1967 3006 D
1967 3028 D
1964 3006 D
S
N
2007 3082 M
1996 3078 D
1989 3071 D
1985 3064 D
1982 3049 D
1982 3039 D
1985 3024 D
1989 3017 D
1996 3010 D
2007 3006 D
2014 3006 D
2025 3010 D
2032 3017 D
2036 3024 D
2039 3039 D
2039 3049 D
2036 3064 D
2032 3071 D
2025 3078 D
2014 3082 D
2007 3082 D
S
N
2007 3082 M
2000 3078 D
1992 3071 D
1989 3064 D
1985 3049 D
1985 3039 D
1989 3024 D
1992 3017 D
2000 3010 D
2007 3006 D
S
N
2014 3006 M
2021 3010 D
2028 3017 D
2032 3024 D
2036 3039 D
2036 3049 D
2032 3064 D
2028 3071 D
2021 3078 D
2014 3082 D
S
N
2411 2830 M
2415 2819 D
2415 2841 D
2411 2830 D
2404 2837 D
2393 2841 D
2386 2841 D
2375 2837 D
2368 2830 D
2365 2823 D
2361 2812 D
2361 2794 D
2365 2783 D
2368 2776 D
2375 2769 D
2386 2765 D
2393 2765 D
2404 2769 D
2411 2776 D
2415 2783 D
S
N
2386 2841 M
2379 2837 D
2372 2830 D
2368 2823 D
2365 2812 D
2365 2794 D
2368 2783 D
2372 2776 D
2379 2769 D
2386 2765 D
S
N
2444 2841 M
2444 2765 D
S
N
2448 2841 M
2469 2776 D
S
N
2444 2841 M
2469 2765 D
S
N
2494 2841 M
2469 2765 D
S
N
2494 2841 M
2494 2765 D
S
N
2498 2841 M
2498 2765 D
S
N
2433 2841 M
2448 2841 D
S
N
2494 2841 M
2509 2841 D
S
N
2433 2765 M
2455 2765 D
S
N
2484 2765 M
2509 2765 D
S
N
2574 2830 M
2577 2841 D
2577 2819 D
2574 2830 D
2566 2837 D
2556 2841 D
2545 2841 D
2534 2837 D
2527 2830 D
2527 2823 D
2530 2816 D
2534 2812 D
2541 2809 D
2563 2801 D
2570 2798 D
2577 2790 D
S
N
2527 2823 M
2534 2816 D
2541 2812 D
2563 2805 D
2570 2801 D
2574 2798 D
2577 2790 D
2577 2776 D
2570 2769 D
2559 2765 D
2548 2765 D
2538 2769 D
2530 2776 D
2527 2787 D
2527 2765 D
2530 2776 D
S
N
2657 2841 M
2657 2819 D
S
N
2657 2827 M
2660 2834 D
2667 2841 D
2675 2841 D
2693 2830 D
2700 2830 D
2703 2834 D
2707 2841 D
S
N
2660 2834 M
2667 2837 D
2675 2837 D
2693 2830 D
S
N
2707 2841 M
2707 2830 D
2703 2819 D
2689 2801 D
2685 2794 D
2682 2783 D
2682 2765 D
S
N
2703 2819 M
2685 2801 D
2682 2794 D
2678 2783 D
2678 2765 D
S
N
2808 2841 M
2808 2765 D
S
N
2812 2841 M
2812 2765 D
S
N
2786 2841 M
2783 2819 D
2783 2841 D
2837 2841 D
2837 2819 D
2833 2841 D
S
N
2797 2765 M
2822 2765 D
S
N
2858 2794 M
2902 2794 D
2902 2801 D
2898 2809 D
2894 2812 D
2887 2816 D
2876 2816 D
2866 2812 D
2858 2805 D
2855 2794 D
2855 2787 D
2858 2776 D
2866 2769 D
2876 2765 D
2884 2765 D
2894 2769 D
2902 2776 D
S
N
2898 2794 M
2898 2805 D
2894 2812 D
S
N
2876 2816 M
2869 2812 D
2862 2805 D
2858 2794 D
2858 2787 D
2862 2776 D
2869 2769 D
2876 2765 D
S
N
2923 2841 M
2949 2765 D
S
N
2927 2841 M
2949 2776 D
S
N
2974 2841 M
2949 2765 D
S
N
2916 2841 M
2938 2841 D
S
N
2959 2841 M
2981 2841 D
S
1.00 0.00 0.00 setrgbcolor
N
2359 3253 M
2363 3249 D
2359 3245 D
2355 3249 D
2355 3253 D
2359 3262 D
2363 3266 D
2376 3271 D
2393 3271 D
2406 3266 D
2411 3262 D
2415 3253 D
2415 3245 D
2411 3236 D
2398 3227 D
2376 3219 D
2368 3214 D
2359 3206 D
2355 3193 D
2355 3180 D
S
N
2393 3271 M
2402 3266 D
2406 3262 D
2411 3253 D
2411 3245 D
2406 3236 D
2393 3227 D
2376 3219 D
S
N
2355 3188 M
2359 3193 D
2368 3193 D
2389 3184 D
2402 3184 D
2411 3188 D
2415 3193 D
S
N
2368 3193 M
2389 3180 D
2406 3180 D
2411 3184 D
2415 3193 D
2415 3201 D
S
N
2432 3227 M
2441 3236 D
2450 3240 D
2458 3240 D
2467 3236 D
2471 3232 D
2476 3219 D
2476 3201 D
2471 3184 D
2458 3150 D
S
N
2437 3232 M
2445 3236 D
2463 3236 D
2471 3232 D
S
N
2506 3240 M
2502 3227 D
2497 3219 D
2476 3188 D
2463 3167 D
2454 3150 D
S
N
2502 3240 M
2497 3227 D
2493 3219 D
2476 3188 D
S
N
2536 3271 M
2536 3180 D
S
N
2541 3271 M
2592 3188 D
S
N
2541 3262 M
2592 3180 D
S
N
2592 3271 M
2592 3180 D
S
N
2523 3271 M
2541 3271 D
S
N
2579 3271 M
2605 3271 D
S
N
2523 3180 M
2549 3180 D
S
N
2636 3271 M
2636 3180 D
S
N
2640 3271 M
2692 3188 D
S
N
2640 3262 M
2692 3180 D
S
N
2692 3271 M
2692 3180 D
S
N
2623 3271 M
2640 3271 D
S
N
2679 3271 M
2705 3271 D
S
N
2623 3180 M
2649 3180 D
S
N
2735 3271 M
2735 3180 D
S
N
2739 3271 M
2739 3180 D
S
N
2722 3271 M
2752 3271 D
S
N
2722 3180 M
2787 3180 D
2787 3206 D
2783 3180 D
S
N
2835 3271 M
2822 3266 D
2813 3258 D
2809 3249 D
2804 3232 D
2804 3219 D
2809 3201 D
2813 3193 D
2822 3184 D
2835 3180 D
2843 3180 D
2856 3184 D
2865 3193 D
2869 3201 D
2874 3219 D
2874 3232 D
2869 3249 D
2865 3258 D
2856 3266 D
2843 3271 D
2835 3271 D
S
N
2835 3271 M
2826 3266 D
2817 3258 D
2813 3249 D
2809 3232 D
2809 3219 D
2813 3201 D
2817 3193 D
2826 3184 D
2835 3180 D
S
N
2843 3180 M
2852 3184 D
2861 3193 D
2865 3201 D
2869 3219 D
2869 3232 D
2865 3249 D
2861 3258 D
2852 3266 D
2843 3271 D
S
0.00 0.00 0.00 setrgbcolor
N
2375 3057 M
2354 2981 D
S
N
2379 3057 M
2357 2981 D
S
N
2375 3046 M
2372 3024 D
2372 3013 D
2379 3006 D
2386 3006 D
2393 3010 D
2401 3017 D
2408 3028 D
S
N
2415 3057 M
2404 3017 D
2404 3010 D
2408 3006 D
2419 3006 D
2426 3013 D
2430 3021 D
S
N
2419 3057 M
2408 3017 D
2408 3010 D
2411 3006 D
S
N
2450 3028 M
2450 2977 D
S
N
2452 3028 M
2452 2977 D
S
N
2443 3028 M
2472 3028 D
2479 3025 D
2481 3023 D
2484 3018 D
2484 3013 D
2481 3009 D
2479 3006 D
2472 3004 D
2452 3004 D
S
N
2472 3028 M
2476 3025 D
2479 3023 D
2481 3018 D
2481 3013 D
2479 3009 D
2476 3006 D
2472 3004 D
S
N
2443 2977 M
2460 2977 D
S
N
2464 3004 M
2469 3001 D
2472 2999 D
2479 2982 D
2481 2980 D
2484 2980 D
2486 2982 D
S
N
2469 3001 M
2472 2997 D
2476 2980 D
2479 2977 D
2484 2977 D
2486 2982 D
2486 2985 D
S
N
2510 3049 M
2575 3049 D
S
N
2510 3028 M
2575 3028 D
S
N
2615 3057 M
2593 2981 D
S
N
2618 3057 M
2597 2981 D
S
N
2615 3046 M
2611 3024 D
2611 3013 D
2618 3006 D
2625 3006 D
2633 3010 D
2640 3017 D
2647 3028 D
S
N
2654 3057 M
2643 3017 D
2643 3010 D
2647 3006 D
2658 3006 D
2665 3013 D
2669 3021 D
S
N
2658 3057 M
2647 3017 D
2647 3010 D
2651 3006 D
S
N
2689 3028 M
2689 2977 D
S
N
2691 3028 M
2691 2977 D
S
N
2706 3013 M
2706 2994 D
S
N
2682 3028 M
2720 3028 D
2720 3013 D
2718 3028 D
S
N
2691 3004 M
2706 3004 D
S
N
2682 2977 M
2699 2977 D
S
N
2744 3049 M
2809 3049 D
S
N
2744 3028 M
2809 3028 D
S
N
2842 3082 M
2842 3006 D
S
N
2845 3082 M
2867 3017 D
S
N
2842 3082 M
2867 3006 D
S
N
2892 3082 M
2867 3006 D
S
N
2892 3082 M
2892 3006 D
S
N
2896 3082 M
2896 3006 D
S
N
2831 3082 M
2845 3082 D
S
N
2892 3082 M
2906 3082 D
S
N
2831 3006 M
2852 3006 D
S
N
2881 3006 M
2906 3006 D
S
N
2921 3004 M
2926 3009 D
2930 3011 D
2935 3011 D
2940 3009 D
2943 3006 D
2945 2999 D
2945 2989 D
2943 2980 D
2935 2961 D
S
N
2923 3006 M
2928 3009 D
2938 3009 D
2943 3006 D
S
N
2962 3011 M
2959 3004 D
2957 2999 D
2945 2982 D
2938 2970 D
2933 2961 D
S
N
2959 3011 M
2957 3004 D
2955 2999 D
2945 2982 D
S
N
2969 3004 M
2974 3009 D
2979 3011 D
2983 3011 D
2988 3009 D
2991 3006 D
2993 2999 D
2993 2989 D
2991 2980 D
2983 2961 D
S
N
2971 3006 M
2976 3009 D
2986 3009 D
2991 3006 D
S
N
3010 3011 M
3007 3004 D
3005 2999 D
2993 2982 D
2986 2970 D
2981 2961 D
S
N
3007 3011 M
3005 3004 D
3003 2999 D
2993 2982 D
S
N
701 1820 M
777 1820 D
S
N
701 1824 M
777 1824 D
S
N
737 1820 M
730 1813 D
726 1806 D
726 1799 D
730 1788 D
737 1781 D
748 1777 D
755 1777 D
766 1781 D
773 1788 D
777 1799 D
777 1806 D
773 1813 D
766 1820 D
S
N
726 1799 M
730 1792 D
737 1784 D
748 1781 D
755 1781 D
766 1784 D
773 1792 D
777 1799 D
S
N
701 1810 M
701 1824 D
S
N
777 1820 M
777 1835 D
S
N
726 1910 M
726 1874 D
730 1864 D
741 1856 D
752 1853 D
762 1853 D
770 1856 D
773 1860 D
777 1867 D
777 1874 D
773 1885 D
762 1892 D
752 1896 D
741 1896 D
734 1892 D
730 1889 D
726 1882 D
S
N
726 1874 M
730 1867 D
741 1860 D
752 1856 D
766 1856 D
773 1860 D
S
N
777 1874 M
773 1882 D
762 1889 D
752 1892 D
737 1892 D
730 1889 D
S
N
730 1889 M
730 1910 D
S
N
687 1990 M
802 1925 D
S
N
701 2051 M
777 2051 D
S
N
701 2055 M
777 2055 D
S
N
737 2051 M
730 2044 D
726 2037 D
726 2029 D
730 2019 D
737 2011 D
748 2008 D
755 2008 D
766 2011 D
773 2019 D
777 2029 D
777 2037 D
773 2044 D
766 2051 D
S
N
726 2029 M
730 2022 D
737 2015 D
748 2011 D
755 2011 D
766 2015 D
773 2022 D
777 2029 D
S
N
701 2040 M
701 2055 D
S
N
777 2051 M
777 2065 D
S
N
701 2109 M
777 2080 D
S
N
701 2109 M
777 2138 D
S
N
712 2109 M
777 2134 D
S
N
773 2083 M
773 2134 D
S
N
777 2080 M
777 2138 D
S
N
701 2195 M
802 2174 D
S
N
701 2199 M
802 2170 D
S
N
726 2181 M
730 2166 D
737 2159 D
748 2156 D
759 2156 D
766 2159 D
773 2166 D
777 2177 D
777 2188 D
773 2202 D
766 2210 D
755 2213 D
744 2213 D
737 2210 D
730 2202 D
726 2192 D
726 2181 D
S
N
726 2181 M
730 2170 D
737 2163 D
748 2159 D
759 2159 D
766 2163 D
773 2170 D
777 2177 D
S
N
777 2188 M
773 2199 D
766 2206 D
755 2210 D
744 2210 D
737 2206 D
730 2199 D
726 2192 D
S
N
779 2231 M
774 2236 D
772 2241 D
772 2246 D
774 2250 D
777 2253 D
784 2255 D
794 2255 D
803 2253 D
822 2246 D
S
N
777 2234 M
774 2238 D
774 2248 D
777 2253 D
S
N
772 2272 M
779 2270 D
784 2267 D
801 2255 D
813 2248 D
822 2243 D
S
N
772 2270 M
779 2267 D
784 2265 D
801 2255 D
S
N
779 2279 M
774 2284 D
772 2289 D
772 2294 D
774 2299 D
777 2301 D
784 2303 D
794 2303 D
803 2301 D
822 2294 D
S
N
777 2282 M
774 2286 D
774 2296 D
777 2301 D
S
N
772 2320 M
779 2318 D
784 2315 D
801 2303 D
813 2296 D
822 2291 D
S
N
772 2318 M
779 2315 D
784 2313 D
801 2303 D
S
N
687 2427 M
694 2420 D
705 2413 D
719 2405 D
737 2402 D
752 2402 D
770 2405 D
784 2413 D
795 2420 D
802 2427 D
S
N
694 2420 M
708 2413 D
719 2409 D
737 2405 D
752 2405 D
770 2409 D
780 2413 D
795 2420 D
S
N
726 2456 M
802 2456 D
S
N
726 2459 M
802 2459 D
S
N
737 2459 M
730 2467 D
726 2474 D
726 2481 D
730 2492 D
737 2499 D
748 2503 D
755 2503 D
766 2499 D
773 2492 D
777 2481 D
777 2474 D
773 2467 D
766 2459 D
S
N
726 2481 M
730 2488 D
737 2496 D
748 2499 D
755 2499 D
766 2496 D
773 2488 D
777 2481 D
S
N
726 2445 M
726 2459 D
S
N
802 2445 M
802 2470 D
S
N
701 2532 M
777 2532 D
S
N
701 2535 M
777 2535 D
S
N
737 2535 M
730 2542 D
726 2550 D
726 2557 D
730 2568 D
737 2575 D
748 2578 D
755 2578 D
766 2575 D
773 2568 D
777 2557 D
777 2550 D
773 2542 D
766 2535 D
S
N
726 2557 M
730 2564 D
737 2571 D
748 2575 D
755 2575 D
766 2571 D
773 2564 D
777 2557 D
S
N
701 2521 M
701 2535 D
S
N
687 2600 M
694 2607 D
705 2614 D
719 2622 D
737 2625 D
752 2625 D
770 2622 D
784 2614 D
795 2607 D
802 2600 D
S
N
694 2607 M
708 2614 D
719 2618 D
737 2622 D
752 2622 D
770 2618 D
780 2614 D
795 2607 D
S
N
2649 789 M
2615 701 D
S
N
2649 789 M
2682 701 D
S
N
2649 776 M
2678 701 D
S
N
2619 705 M
2678 705 D
S
N
2615 701 M
2682 701 D
S
N
2749 789 M
2724 672 D
S
N
2753 789 M
2720 672 D
S
N
2732 759 M
2716 755 D
2707 747 D
2703 734 D
2703 722 D
2707 713 D
2716 705 D
2728 701 D
2741 701 D
2757 705 D
2766 713 D
2770 726 D
2770 739 D
2766 747 D
2757 755 D
2745 759 D
2732 759 D
S
N
2732 759 M
2720 755 D
2711 747 D
2707 734 D
2707 722 D
2711 713 D
2720 705 D
2728 701 D
S
N
2741 701 M
2753 705 D
2762 713 D
2766 726 D
2766 739 D
2762 747 D
2753 755 D
2745 759 D
S
N
2791 698 M
2796 704 D
2802 706 D
2808 706 D
2813 704 D
2816 701 D
2819 693 D
2819 681 D
2816 670 D
2808 648 D
S
N
2794 701 M
2799 704 D
2810 704 D
2816 701 D
S
N
2838 706 M
2835 698 D
2833 693 D
2819 673 D
2810 659 D
2805 648 D
S
N
2835 706 M
2833 698 D
2830 693 D
2819 673 D
S
N
2847 698 M
2852 704 D
2858 706 D
2863 706 D
2869 704 D
2872 701 D
2874 693 D
2874 681 D
2872 670 D
2863 648 D
S
N
2849 701 M
2855 704 D
2866 704 D
2872 701 D
S
N
2894 706 M
2891 698 D
2888 693 D
2874 673 D
2866 659 D
2861 648 D
S
N
2891 706 M
2888 698 D
2886 693 D
2874 673 D
S
showpage
%%Trailer
%%Pages: 1
%%BoundingBox:
