%!PS-Adobe-2.0 EPSF-2.0
%%BoundingBox:  0 0 567 544
%%Title: plots_spline/YRHXS2_gghtb_1.eps: ratio of shapes NLO- LHC 7 TeV
%%Creator: ROOT Version 5.28/00f
%%CreationDate: Mon Dec 19 23:53:20 2011
%%EndComments
%%BeginProlog
80 dict begin
/s {stroke} def /l {lineto} def /m {moveto} def /t {translate} def
/r {rotate} def /rl {roll}  def /R {repeat} def
/d {rlineto} def /rm {rmoveto} def /gr {grestore} def /f {eofill} def
/c {setrgbcolor} def /black {0 setgray} def /sd {setdash} def
/cl {closepath} def /sf {scalefont setfont} def /lw {setlinewidth} def
/box {m dup 0 exch d exch 0 d 0 exch neg d cl} def
/NC{systemdict begin initclip end}def/C{NC box clip newpath}def
/bl {box s} def /bf {box f} def /Y { 0 exch d} def /X { 0 d} def 
/K {{pop pop 0 moveto} exch kshow} bind def
/ita {/ang 15 def gsave [1 0 ang dup sin exch cos div 1 0 0] concat} def 
/mp {newpath /y exch def /x exch def} def
/side {[w .77 mul w .23 mul] .385 w mul sd w 0 l currentpoint t -144 r} def
/mr {mp x y w2 0 360 arc} def /m24 {mr s} def /m20 {mr f} def
/mb {mp x y w2 add m w2 neg 0 d 0 w neg d w 0 d 0 w d cl} def
/mt {mp x y w2 add m w2 neg w neg d w 0 d cl} def
/m21 {mb f} def /m25 {mb s} def /m22 {mt f} def /m26{mt s} def
/m23 {mp x y w2 sub m w2 w d w neg 0 d cl f} def
/m27 {mp x y w2 add m w3 neg w2 neg d w3 w2 neg d w3 w2 d cl s} def
/m28 {mp x w2 sub y w2 sub w3 add m w3 0 d  0 w3 neg d w3 0 d 0 w3 d w3 0 d  0 w3 d w3 neg 0 d 0 w3 d w3 neg 0 d 0 w3 neg d w3 neg 0 d cl s } def
/m29 {mp gsave x w2 sub y w2 add w3 sub m currentpoint t 4 {side} repeat cl fill gr} def
/m30 {mp gsave x w2 sub y w2 add w3 sub m currentpoint t 4 {side} repeat cl s gr} def
/m31 {mp x y w2 sub m 0 w d x w2 sub y m w 0 d x w2 sub y w2 add m w w neg d x w2 sub y w2 sub m w w d s} def
/m32 {mp x y w2 sub m w2 w d w neg 0 d cl s} def
/m33 {mp x y w2 add m w3 neg w2 neg d w3 w2 neg d w3 w2 d cl f} def
/m34 {mp x w2 sub y w2 sub w3 add m w3 0 d  0 w3 neg d w3 0 d 0 w3 d w3 0 d  0 w3 d w3 neg 0 d 0 w3 d w3 neg 0 d 0 w3 neg d w3 neg 0 d cl f } def
/m2 {mp x y w2 sub m 0 w d x w2 sub y m w 0 d s} def
/m5 {mp x w2 sub y w2 sub m w w d x w2 sub y w2 add m w w neg d s} def
/reEncode {exch findfont dup length dict begin {1 index /FID eq  {pop pop} {def} ifelse } forall /Encoding exch def currentdict end dup /FontName get exch definefont pop } def [/Times-Bold /Times-Italic /Times-BoldItalic /Helvetica /Helvetica-Oblique
 /Helvetica-Bold /Helvetica-BoldOblique /Courier /Courier-Oblique /Courier-Bold /Courier-BoldOblique /Times-Roman /AvantGarde-Book /AvantGarde-BookOblique /AvantGarde-Demi /AvantGarde-DemiOblique /Bookman-Demi /Bookman-DemiItalic /Bookman-Light
 /Bookman-LightItalic /Helvetica-Narrow /Helvetica-Narrow-Bold /Helvetica-Narrow-BoldOblique /Helvetica-Narrow-Oblique /NewCenturySchlbk-Roman /NewCenturySchlbk-Bold /NewCenturySchlbk-BoldItalic /NewCenturySchlbk-Italic /Palatino-Bold
 /Palatino-BoldItalic /Palatino-Italic /Palatino-Roman ] {ISOLatin1Encoding reEncode } forall%%EndProlog
%%BeginSetup
%%EndSetup
newpath  gsave  .25 .25 scale  gsave  0 0 t black[  ] 0 sd 3 lw 1 1 1 c 2268 2176 0 0 bf black 1 1 1 c 1791 1720 363 348 bf black 1791 1720 363 348 bl 363 348 m 1791 X s 363 2068 m 1791 X s 363 348 m 1720 Y s[ 4 8] 0 sd 2154 348 m -1791 X s 2154 635
 m -1791 X s 2154 921 m -1791 X s 2154 1208 m -1791 X s 2154 1494 m -1791 X s 2154 1781 m -1791 X s 2154 2068 m -1791 X s 2154 348 m -1791 X s 2154 2068 m -1791 X s[  ] 0 sd 2154 348 m 1720 Y s 6 lw 1 1 1 c black 363 348 m 1791 X s 3 lw 363 348 m
 1791 X s
 gsave  2268 2176 0 0 C 1868.2 87.5126 t 0 r /Helvetica findfont 102.732 sf 0 0 m ( [GeV]) show NC gr 
 gsave  2268 2176 0 0 C 1822.54 121.757 t 0 r /Helvetica findfont 68.4881 sf 0 0 m (H) show NC gr 
 gsave  2268 2176 0 0 C 1822.54 38.0489 t 0 r /Helvetica findfont 68.4881 sf 0 0 m (T) show NC gr 
 gsave  2268 2176 0 0 C 1769.28 87.5126 t 0 r /Helvetica findfont 102.732 sf 0 0 m (p) show NC gr  363 400 m -52 Y s 423 374 m -26 Y s 482 374 m -26 Y s 542 374 m -26 Y s 602 374 m -26 Y s 661 400 m -52 Y s 721 374 m -26 Y s 781 374 m -26 Y s 841 374
 m -26 Y s 900 374 m -26 Y s 960 400 m -52 Y s 1020 374 m -26 Y s 1079 374 m -26 Y s 1139 374 m -26 Y s 1199 374 m -26 Y s 1259 400 m -52 Y s 1318 374 m -26 Y s 1378 374 m -26 Y s 1438 374 m -26 Y s 1497 374 m -26 Y s 1557 400 m -52 Y s 1617 374 m
 -26 Y s 1677 374 m -26 Y s 1736 374 m -26 Y s 1796 374 m -26 Y s 1856 400 m -52 Y s 1915 374 m -26 Y s 1975 374 m -26 Y s 2035 374 m -26 Y s 2095 374 m -26 Y s 2154 400 m -52 Y s
 gsave  2268 2176 0 0 C 334.831 251.123 t 0 r /Helvetica findfont 102.732 sf 0 0 m (0) show NC gr 
 gsave  2268 2176 0 0 C 601.173 251.123 t 0 r /Helvetica findfont 102.732 sf 0 0 m (50) show NC gr 
 gsave  2268 2176 0 0 C 875.125 251.123 t 0 r /Helvetica findfont 102.732 sf 0 0 m (100) show NC gr 
 gsave  2268 2176 0 0 C 1171.91 251.123 t 0 r /Helvetica findfont 102.732 sf 0 0 m (150) show NC gr 
 gsave  2268 2176 0 0 C 1472.49 251.123 t 0 r /Helvetica findfont 102.732 sf 0 0 m (200) show NC gr 
 gsave  2268 2176 0 0 C 1769.28 251.123 t 0 r /Helvetica findfont 102.732 sf 0 0 m (250) show NC gr 
 gsave  2268 2176 0 0 C 2069.86 251.123 t 0 r /Helvetica findfont 102.732 sf 0 0 m (300) show NC gr  363 2068 m 1791 X s 363 2016 m 52 Y s 423 2042 m 26 Y s 482 2042 m 26 Y s 542 2042 m 26 Y s 602 2042 m 26 Y s 661 2016 m 52 Y s 721 2042 m 26 Y s 781
 2042 m 26 Y s 841 2042 m 26 Y s 900 2042 m 26 Y s 960 2016 m 52 Y s 1020 2042 m 26 Y s 1079 2042 m 26 Y s 1139 2042 m 26 Y s 1199 2042 m 26 Y s 1259 2016 m 52 Y s 1318 2042 m 26 Y s 1378 2042 m 26 Y s 1438 2042 m 26 Y s 1497 2042 m 26 Y s 1557 2016
 m 52 Y s 1617 2042 m 26 Y s 1677 2042 m 26 Y s 1736 2042 m 26 Y s 1796 2042 m 26 Y s 1856 2016 m 52 Y s 1915 2042 m 26 Y s 1975 2042 m 26 Y s 2035 2042 m 26 Y s 2095 2042 m 26 Y s 2154 2016 m 52 Y s 363 348 m 1720 Y s
 gsave  2268 2176 0 0 C 144.586 1993.76 t 90 r /Helvetica findfont 102.732 sf 0 0 m (R) show NC gr  417 348 m -54 X s 390 406 m -27 X s 390 463 m -27 X s 390 520 m -27 X s 390 577 m -27 X s 417 635 m -54 X s 390 692 m -27 X s 390 749 m -27 X s 390
 807 m -27 X s 390 864 m -27 X s 417 921 m -54 X s 390 979 m -27 X s 390 1036 m -27 X s 390 1093 m -27 X s 390 1151 m -27 X s 417 1208 m -54 X s 390 1265 m -27 X s 390 1323 m -27 X s 390 1380 m -27 X s 390 1437 m -27 X s 417 1494 m -54 X s 390 1552 m
 -27 X s 390 1609 m -27 X s 390 1666 m -27 X s 390 1724 m -27 X s 417 1781 m -54 X s 390 1838 m -27 X s 390 1896 m -27 X s 390 1953 m -27 X s 390 2010 m -27 X s 417 2068 m -54 X s 417 348 m -54 X s 417 2068 m -54 X s
 gsave  2268 2176 0 0 C 152.196 312.001 t 0 r /Helvetica findfont 102.732 sf 0 0 m (0.85) show NC gr 
 gsave  2268 2176 0 0 C 209.269 597.368 t 0 r /Helvetica findfont 102.732 sf 0 0 m (0.9) show NC gr 
 gsave  2268 2176 0 0 C 152.196 886.54 t 0 r /Helvetica findfont 102.732 sf 0 0 m (0.95) show NC gr 
 gsave  2268 2176 0 0 C 308.196 1168.1 t 0 r /Helvetica findfont 102.732 sf 0 0 m (1) show NC gr 
 gsave  2268 2176 0 0 C 152.196 1457.27 t 0 r /Helvetica findfont 102.732 sf 0 0 m (1.05) show NC gr 
 gsave  2268 2176 0 0 C 224.489 1742.64 t 0 r /Helvetica findfont 102.732 sf 0 0 m (1.1) show NC gr 
 gsave  2268 2176 0 0 C 152.196 2031.81 t 0 r /Helvetica findfont 102.732 sf 0 0 m (1.15) show NC gr  2154 348 m 1720 Y s 2101 348 m 53 X s 2127 406 m 27 X s 2127 463 m 27 X s 2127 520 m 27 X s 2127 577 m 27 X s 2101 635 m 53 X s 2127 692 m 27 X s
 2127 749 m 27 X s 2127 807 m 27 X s 2127 864 m 27 X s 2101 921 m 53 X s 2127 979 m 27 X s 2127 1036 m 27 X s 2127 1093 m 27 X s 2127 1151 m 27 X s 2101 1208 m 53 X s 2127 1265 m 27 X s 2127 1323 m 27 X s 2127 1380 m 27 X s 2127 1437 m 27 X s 2101
 1494 m 53 X s 2127 1552 m 27 X s 2127 1609 m 27 X s 2127 1666 m 27 X s 2127 1724 m 27 X s 2101 1781 m 53 X s 2127 1838 m 27 X s 2127 1896 m 27 X s 2127 1953 m 27 X s 2127 2010 m 27 X s 2101 2068 m 53 X s 2101 348 m 53 X s 2101 2068 m 53 X s 12 lw
 378 1208 m 1761 X s 1 0 0 c black 1 0 0 c 363 1294 m 30 -130 d 31 -51 d 30 9 d 30 53 d 31 78 d 30 88 d 30 79 d 31 63 d 30 48 d 30 36 d 31 25 d 30 18 d 31 13 d 30 10 d 30 7 d 31 4 d 30 3 d 30 X 31 -1 d 30 -3 d 30 -5 d 31 -6 d 30 -7 d 31 -8 d 30 -7 d
 30 -8 d 31 -6 d 30 -8 d 30 -10 d 31 -13 d 30 -19 d 30 -26 d 31 -34 d 30 -44 d 31 -51 d 30 -58 d 30 -61 d 31 -63 d 30 -64 d 30 -63 d 31 -61 d 30 -62 d 31 -63 d 30 -65 d 30 -70 d 31 -74 d 30 -81 d 30 -84 d 31 -87 d 30 -86 d -1 Y s 0 1 0 c[ 4 8] 0 sd
 black 0 1 0 c 363 1617 m 30 -275 d 31 -157 d 30 -63 d 30 5 d 31 48 d 30 66 d 30 60 d 31 42 d 30 26 d 30 15 d 31 7 d 30 2 d 31 2 d 30 4 d 30 6 d 31 8 d 30 8 d 30 8 d 31 7 d 30 4 d 30 2 d 31 -1 d 30 -3 d 31 -6 d 30 -10 d 30 -12 d 31 -14 d 30 -18 d 30
 -22 d 31 -27 d 30 -31 d 30 -37 d 31 -43 d 30 -50 d 31 -55 d 30 -58 d 30 -62 d 31 -63 d 30 -63 d 30 -62 d 31 -62 d 30 -62 d 31 -63 d 30 -66 d 30 -68 d 31 -72 d 25 -64 d s 0 0 1 c[  12 12 ] 0 sd black 0 0 1 c 363 1522 m 30 -24 d 31 -20 d 30 -17 d 30
 -15 d 31 -16 d 30 -16 d 30 -20 d 31 -23 d 30 -26 d 30 -30 d 31 -33 d 30 -36 d 31 -40 d 30 -43 d 30 -46 d 31 -48 d 30 -50 d 30 -53 d 31 -53 d 30 -55 d 30 -56 d 31 -57 d 30 -58 d 31 -59 d 30 -60 d 30 -62 d 31 -64 d 30 -65 d 13 -29 d s black
 gsave  2268 2176 0 0 C 2199.23 1548.59 t 90 r /Helvetica-BoldOblique findfont 41.8538 sf 0 0 m 
 449 429 407 384 373 341 303 291 264 237 226 199 167 136 124 95 84 54 25
(LHC HIGGS XS WG 2011) K NC gr 
 gsave  2268 2176 0 0 C 407.124 654.442 t 0 r /Helvetica findfont 79.9028 sf 0 0 m 
 866 807 744 717 654 608 549 527 504 482 459 437 414 391 337 292 251 230 185 162 104 45
(LHC 7 TeV       NLO\255QCD) K NC gr 
 gsave  2268 2176 0 0 C 407.124 544.1 t 0 r /Helvetica findfont 79.9028 sf 0 0 m (ratio of normalized distributions) show NC gr 
 gsave  2268 2176 0 0 C 407.124 437.563 t 0 r /Helvetica findfont 79.9028 sf 0 0 m 
 1387 1346 1319 1274 1228 1183 1160 1138 1093 1052 1034 1011 971 926 903 882 837 809 787 760 692 647 624 602 556 511 464 418 373 350 328 305 265 219 179 134 106 59
(R=\(exact top+bottom\)/\(effective theory\)) K NC gr [  ] 0 sd 3 lw 1 1 1 c 521 501 1633 1567 bf black 1633 1567 m 521 X s 2154 1567 m 501 Y s 2154 2068 m -521 X s 1633 2068 m -501 Y s
 gsave  2268 2176 0 0 C 1841.57 1967.13 t 0 r /Helvetica findfont 64.6832 sf 0 0 m (=125 GeV) show NC gr 
 gsave  2268 2176 0 0 C 1811.13 1951.91 t 0 r /Helvetica findfont 41.8538 sf 0 0 m (H) show NC gr 
 gsave  2268 2176 0 0 C 1761.67 1967.13 t 0 r /Helvetica findfont 64.6832 sf 0 0 m (M) show NC gr  1 0 0 c 12 lw 1652 1984 m 92 X s black
 gsave  2268 2176 0 0 C 1841.57 1799.71 t 0 r /Helvetica findfont 64.6832 sf 0 0 m (=165 GeV) show NC gr 
 gsave  2268 2176 0 0 C 1811.13 1784.5 t 0 r /Helvetica findfont 41.8538 sf 0 0 m (H) show NC gr 
 gsave  2268 2176 0 0 C 1761.67 1799.71 t 0 r /Helvetica findfont 64.6832 sf 0 0 m (M) show NC gr  0 1 0 c[ 20 12 4 12 4 12 4 12] 0 sd 1652 1817 m 92 X s black
 gsave  2268 2176 0 0 C 1841.57 1632.3 t 0 r /Helvetica findfont 64.6832 sf 0 0 m (=500 GeV) show NC gr 
 gsave  2268 2176 0 0 C 1811.13 1617.08 t 0 r /Helvetica findfont 41.8538 sf 0 0 m (H) show NC gr 
 gsave  2268 2176 0 0 C 1761.67 1632.3 t 0 r /Helvetica findfont 64.6832 sf 0 0 m (M) show NC gr  0 0 1 c[ 4 8] 0 sd 1652 1650 m 92 X s
 gr  gr showpage
end
%%EOF
