%!PS-Adobe-3.0 EPSF-3.0
%%BoundingBox: (atend)
%%LanguageLevel: 2
%%Creator: Grace-5.1.22
%%CreationDate: Mon Dec 19 07:41:06 2011
%%DocumentData: Clean8Bit
%%Orientation: Portrait
%%Title: dsdR_tH_perc_err_band.agr
%%For: laura
%%DocumentNeededResources: (atend)
%%EndComments
%%BeginProlog
/m {moveto} def
/l {lineto} def
/s {stroke} def
/n {newpath} def
/c {closepath} def
/RL {rlineto} def
/SLW {setlinewidth} def
/GS {gsave} def
/GR {grestore} def
/SC {setcolor} def
/SGRY {setgray} def
/SRGB {setrgbcolor} def
/SD {setdash} def
/SLC {setlinecap} def
/SLJ {setlinejoin} def
/SCS {setcolorspace} def
/FFSF {findfont setfont} def
/CC {concat} def
/PXL {n m 0 0 RL s} def
/Color0 {1.0000 1.0000 1.0000} def
/Color1 {0.0000 0.0000 0.0000} def
/Color2 {1.0000 0.0000 0.0000} def
/Color3 {0.0000 1.0000 0.0000} def
/Color4 {0.0000 0.0000 1.0000} def
/Color5 {1.0000 1.0000 0.0000} def
/Color6 {0.7373 0.5608 0.5608} def
/Color7 {0.8627 0.8627 0.8627} def
/Color8 {0.5804 0.0000 0.8275} def
/Color9 {0.0000 1.0000 1.0000} def
/Color10 {1.0000 0.0000 1.0000} def
/Color11 {1.0000 0.6471 0.0000} def
/Color12 {0.4471 0.1294 0.7373} def
/Color13 {0.4039 0.0275 0.2824} def
/Color14 {0.2510 0.8784 0.8157} def
/Color15 {0.0000 0.5451 0.0000} def
/Color16 {0.7529 0.7529 0.7529} def
/Color17 {0.5059 0.5059 0.5059} def
/Color18 {0.2588 0.2588 0.2588} def
/PTRN {
 /pat_bits exch def 
 <<
  /PaintType 2
  /PatternType 1 /TilingType 1
  /BBox[0 0 16 16]
  /XStep 16 /YStep 16
  /PaintProc {
   pop
   16 16 true [-1 0 0 -1 16 16] pat_bits imagemask
  }
 >>
 [0.0016 0 0 0.0016 0 0]
 makepattern
} def
/Pattern0 {<0000000000000000000000000000000000000000000000000000000000000000> PTRN} bind def
/Pattern1 {<ffffffffffffffffffffffffffffffffffffffffffffffffffffffffffffffff> PTRN} bind def
/Pattern2 {<eeeeffffbbbbffffeeeeffffbbbbffffeeeeffffbbbbffffeeeeffffbbbbffff> PTRN} bind def
/Pattern3 {<eeeebbbbeeeebbbbeeeebbbbeeeebbbbeeeebbbbeeeebbbbeeeebbbbeeeebbbb> PTRN} bind def
/Pattern4 {<5555aaaa5555aaaa5555aaaa5555aaaa5555aaaa5555aaaa5555aaaa5555aaaa> PTRN} bind def
/Pattern5 {<1111444411114444111144441111444411114444111144441111444411114444> PTRN} bind def
/Pattern6 {<1111000044440000111100004444000011110000444400001111000044440000> PTRN} bind def
/Pattern7 {<1010000000000000010100000000000010100000000000000101000000000000> PTRN} bind def
/Pattern8 {<0000000000000000000000000000000000000000000000000000000000000000> PTRN} bind def
/Pattern9 {<1e1e0f0f8787c3c3e1e1f0f078783c3c1e1e0f0f8787c3c3e1e1f0f078783c3c> PTRN} bind def
/Pattern10 {<7878f0f0e1e1c3c387870f0f1e1e3c3c7878f0f0e1e1c3c387870f0f1e1e3c3c> PTRN} bind def
/Pattern11 {<3333333333333333333333333333333333333333333333333333333333333333> PTRN} bind def
/Pattern12 {<ffffffff00000000ffffffff00000000ffffffff00000000ffffffff00000000> PTRN} bind def
/Pattern13 {<8181424224241818181824244242818181814242242418181818242442428181> PTRN} bind def
/Pattern14 {<8080404020201010080804040202010180804040202010100808040402020101> PTRN} bind def
/Pattern15 {<0101020204040808101020204040808001010202040408081010202040408080> PTRN} bind def
/Pattern16 {<2222222222222222222222222222222222222222222222222222222222222222> PTRN} bind def
/Pattern17 {<0000ffff000000000000ffff000000000000ffff000000000000ffff00000000> PTRN} bind def
/Pattern18 {<2222ffff222222222222ffff222222222222ffff222222222222ffff22222222> PTRN} bind def
/Pattern19 {<ffffffff33333333ffffffff33333333ffffffff33333333ffffffff33333333> PTRN} bind def
/Pattern20 {<0f0f0f0f0f0f0f0ff0f0f0f0f0f0f0f00f0f0f0f0f0f0f0ff0f0f0f0f0f0f0f0> PTRN} bind def
/Pattern21 {<ff00ff00ff00ff00ff00ff00ff00ff0000ff00ff00ff00ff00ff00ff00ff00ff> PTRN} bind def
/Pattern22 {<8001800180018001800180018001ffffffff8001800180018001800180018001> PTRN} bind def
/Pattern23 {<c003c003c003c003c003c003ffffffffffffffffc003c003c003c003c003c003> PTRN} bind def
/Pattern24 {<040404040404ffff404040404040ffff040404040404ffff404040404040ffff> PTRN} bind def
/Pattern25 {<180018001800180018001800ffffffff001800180018001800180018ffffffff> PTRN} bind def
/Pattern26 {<1111b8b87c7c3a3a1111a3a3c7c78b8b1111b8b87c7c3a3a1111a3a3c7c78b8b> PTRN} bind def
/Pattern27 {<101010102828c7c70101010182827c7c101010102828c7c70101010182827c7c> PTRN} bind def
/Pattern28 {<1c1c121211112121c1c12121111112121c1c121211112121c1c1212111111212> PTRN} bind def
/Pattern29 {<3e3e414180808080e3e31414080808083e3e414180808080e3e3141408080808> PTRN} bind def
/Pattern30 {<4848888884848383848488884848383848488888848483838484888848483838> PTRN} bind def
/Pattern31 {<03030404080808080c0c12122121c0c003030404080808080c0c12122121c0c0> PTRN} bind def
/ellipsedict 8 dict def
ellipsedict /mtrx matrix put
/EARC {
 ellipsedict begin
  /endangle exch def
  /startangle exch def
  /yrad exch def
  /xrad exch def
  /y exch def
  /x exch def
  /savematrix mtrx currentmatrix def
  x y translate
  xrad yrad scale
  0 0 1 startangle endangle arc
  savematrix setmatrix
 end
} def
/TL {
  /kcomp exch def
  /linewidth exch def
  /offset exch def
  GS
  0 offset rmoveto
  linewidth SLW
  dup stringwidth exch kcomp add exch RL s
  GR
} def
/KINIT
{
 /kvector exch def
 /kid 0 def
} def
/KPROC
{
 pop pop
 kvector kid get
 0 rmoveto
 /kid 1 kid add def
} def
/DefEncoding [
 /.notdef
 /.notdef
 /.notdef
 /.notdef
 /.notdef
 /.notdef
 /.notdef
 /.notdef
 /.notdef
 /.notdef
 /.notdef
 /.notdef
 /.notdef
 /.notdef
 /.notdef
 /.notdef
 /.notdef
 /.notdef
 /.notdef
 /.notdef
 /.notdef
 /.notdef
 /.notdef
 /.notdef
 /.notdef
 /.notdef
 /.notdef
 /.notdef
 /.notdef
 /.notdef
 /.notdef
 /.notdef
 /space
 /exclam
 /quotedbl
 /numbersign
 /dollar
 /percent
 /ampersand
 /quoteright
 /parenleft
 /parenright
 /asterisk
 /plus
 /comma
 /hyphen
 /period
 /slash
 /zero
 /one
 /two
 /three
 /four
 /five
 /six
 /seven
 /eight
 /nine
 /colon
 /semicolon
 /less
 /equal
 /greater
 /question
 /at
 /A
 /B
 /C
 /D
 /E
 /F
 /G
 /H
 /I
 /J
 /K
 /L
 /M
 /N
 /O
 /P
 /Q
 /R
 /S
 /T
 /U
 /V
 /W
 /X
 /Y
 /Z
 /bracketleft
 /backslash
 /bracketright
 /asciicircum
 /underscore
 /grave
 /a
 /b
 /c
 /d
 /e
 /f
 /g
 /h
 /i
 /j
 /k
 /l
 /m
 /n
 /o
 /p
 /q
 /r
 /s
 /t
 /u
 /v
 /w
 /x
 /y
 /z
 /braceleft
 /bar
 /braceright
 /asciitilde
 /.notdef
 /.notdef
 /.notdef
 /.notdef
 /.notdef
 /.notdef
 /.notdef
 /.notdef
 /.notdef
 /.notdef
 /.notdef
 /.notdef
 /.notdef
 /.notdef
 /.notdef
 /.notdef
 /.notdef
 /.notdef
 /.notdef
 /.notdef
 /.notdef
 /.notdef
 /.notdef
 /.notdef
 /.notdef
 /.notdef
 /.notdef
 /.notdef
 /.notdef
 /.notdef
 /.notdef
 /.notdef
 /.notdef
 /space
 /exclamdown
 /cent
 /sterling
 /currency
 /yen
 /brokenbar
 /section
 /dieresis
 /copyright
 /ordfeminine
 /guillemotleft
 /logicalnot
 /hyphen
 /registered
 /macron
 /degree
 /plusminus
 /twosuperior
 /threesuperior
 /acute
 /mu
 /paragraph
 /periodcentered
 /cedilla
 /onesuperior
 /ordmasculine
 /guillemotright
 /onequarter
 /onehalf
 /threequarters
 /questiondown
 /Agrave
 /Aacute
 /Acircumflex
 /Atilde
 /Adieresis
 /Aring
 /AE
 /Ccedilla
 /Egrave
 /Eacute
 /Ecircumflex
 /Edieresis
 /Igrave
 /Iacute
 /Icircumflex
 /Idieresis
 /Eth
 /Ntilde
 /Ograve
 /Oacute
 /Ocircumflex
 /Otilde
 /Odieresis
 /multiply
 /Oslash
 /Ugrave
 /Uacute
 /Ucircumflex
 /Udieresis
 /Yacute
 /Thorn
 /germandbls
 /agrave
 /aacute
 /acircumflex
 /atilde
 /adieresis
 /aring
 /ae
 /ccedilla
 /egrave
 /eacute
 /ecircumflex
 /edieresis
 /igrave
 /iacute
 /icircumflex
 /idieresis
 /eth
 /ntilde
 /ograve
 /oacute
 /ocircumflex
 /otilde
 /odieresis
 /divide
 /oslash
 /ugrave
 /uacute
 /ucircumflex
 /udieresis
 /yacute
 /thorn
 /ydieresis
] def
%%EndProlog
%%BeginSetup
%%EndSetup
612.00 612.00 scale
n
0.0000 0.0000 m
0.0000 1.0000 l
1.2941 1.0000 l
1.2941 0.0000 l
c
[/DeviceRGB] SCS
Color0 SC
fill
[/DeviceRGB] SCS
Color2 SC
[] 0 SD
0.0030 SLW
0 SLC
0 SLJ
n
0.1500 0.4244 m
0.1500 0.4369 l
0.1700 0.4369 l
0.1700 0.4215 l
0.1900 0.4215 l
0.1900 0.4193 l
0.2100 0.4193 l
0.2100 0.4233 l
0.2300 0.4233 l
0.2300 0.4395 l
0.2500 0.4395 l
0.2500 0.4256 l
0.2700 0.4256 l
0.2700 0.4293 l
0.2900 0.4293 l
0.2900 0.4232 l
0.3100 0.4232 l
0.3100 0.4296 l
0.3300 0.4296 l
0.3300 0.4330 l
0.3500 0.4330 l
0.3500 0.4324 l
0.3700 0.4324 l
0.3700 0.4320 l
0.3900 0.4320 l
0.3900 0.4273 l
0.4100 0.4273 l
0.4100 0.4294 l
0.4300 0.4294 l
0.4300 0.4376 l
0.4500 0.4376 l
0.4500 0.4292 l
0.4700 0.4292 l
0.4700 0.4437 l
0.4900 0.4437 l
0.4900 0.4286 l
0.5100 0.4286 l
0.5100 0.4341 l
0.5300 0.4341 l
0.5300 0.4317 l
0.5500 0.4317 l
0.5500 0.4242 l
0.5700 0.4242 l
0.5700 0.4410 l
0.5900 0.4410 l
0.5900 0.4270 l
0.6100 0.4270 l
0.6100 0.4259 l
0.6300 0.4259 l
0.6300 0.4412 l
0.6500 0.4412 l
0.6500 0.4335 l
0.6700 0.4335 l
0.6700 0.4332 l
0.6900 0.4332 l
0.6900 0.4344 l
0.7100 0.4344 l
0.7100 0.4277 l
0.7300 0.4277 l
0.7300 0.4438 l
0.7500 0.4438 l
0.7500 0.4326 l
0.7700 0.4326 l
0.7700 0.4318 l
0.7900 0.4318 l
0.7900 0.4223 l
0.8100 0.4223 l
0.8100 0.4494 l
0.8300 0.4494 l
0.8300 0.4257 l
0.8500 0.4257 l
0.8500 0.4245 l
0.8700 0.4245 l
0.8700 0.4375 l
0.8900 0.4375 l
0.8900 0.4624 l
0.9100 0.4624 l
0.9100 0.4019 l
0.9300 0.4019 l
0.9300 0.4086 l
0.9500 0.4086 l
0.9500 0.4341 l
0.9700 0.4341 l
0.9700 0.4311 l
0.9900 0.4311 l
0.9900 0.4221 l
1.0100 0.4221 l
1.0100 0.3912 l
1.0300 0.3912 l
1.0300 0.3900 l
1.0500 0.3900 l
1.0500 0.4984 l
1.0700 0.4984 l
1.0700 0.3780 l
1.0900 0.3780 l
1.0900 0.4440 l
1.1100 0.4440 l
1.1100 0.4177 l
1.1300 0.4177 l
1.1300 0.4004 l
1.1500 0.4004 l
1.1500 0.3880 l
1.1501 0.3880 l
s
n
0.1500 0.5216 m
0.1500 0.4545 l
0.1700 0.4545 l
0.1700 0.4668 l
0.1900 0.4668 l
0.1900 0.4688 l
0.2100 0.4688 l
0.2100 0.4561 l
0.2300 0.4561 l
0.2300 0.5001 l
0.2500 0.5001 l
0.2500 0.4641 l
0.2700 0.4641 l
0.2700 0.4598 l
0.2900 0.4598 l
0.2900 0.4541 l
0.3100 0.4541 l
0.3100 0.5000 l
0.3300 0.5000 l
0.3300 0.4370 l
0.3500 0.4370 l
0.3500 0.4802 l
0.3700 0.4802 l
0.3700 0.4629 l
0.3900 0.4629 l
0.3900 0.4492 l
0.4100 0.4492 l
0.4100 0.4812 l
0.4300 0.4812 l
0.4300 0.4661 l
0.4500 0.4661 l
0.4500 0.4558 l
0.4700 0.4558 l
0.4700 0.4886 l
0.4900 0.4886 l
0.4900 0.4409 l
0.5100 0.4409 l
0.5100 0.4571 l
0.5300 0.4571 l
0.5300 0.4651 l
0.5500 0.4651 l
0.5500 0.4638 l
0.5700 0.4638 l
0.5700 0.4654 l
0.5900 0.4654 l
0.5900 0.4607 l
0.6100 0.4607 l
0.6100 0.4683 l
0.6300 0.4683 l
0.6300 0.4540 l
0.6500 0.4540 l
0.6500 0.4414 l
0.6700 0.4414 l
0.6700 0.4559 l
0.6900 0.4559 l
0.6900 0.4509 l
0.7100 0.4509 l
0.7100 0.4430 l
0.7300 0.4430 l
0.7300 0.4570 l
0.7500 0.4570 l
0.7500 0.4522 l
0.7700 0.4522 l
0.7700 0.4572 l
0.7900 0.4572 l
0.7900 0.4591 l
0.8100 0.4591 l
0.8100 0.4840 l
0.8300 0.4840 l
0.8300 0.4371 l
0.8500 0.4371 l
0.8500 0.4543 l
0.8700 0.4543 l
0.8700 0.4527 l
0.8900 0.4527 l
0.8900 0.4938 l
0.9100 0.4938 l
0.9100 0.4038 l
0.9300 0.4038 l
0.9300 0.4879 l
0.9500 0.4879 l
0.9500 0.4744 l
0.9700 0.4744 l
0.9700 0.4327 l
0.9900 0.4327 l
0.9900 0.4259 l
1.0100 0.4259 l
1.0100 0.5311 l
1.0300 0.5311 l
1.0300 0.4197 l
1.0500 0.4197 l
1.0500 0.5606 l
1.0700 0.5606 l
1.0700 0.6120 l
1.0900 0.6120 l
1.0900 0.4558 l
1.1100 0.4558 l
1.1100 0.4937 l
1.1300 0.4937 l
1.1300 0.5061 l
1.1500 0.5061 l
1.1500 0.5960 l
1.1501 0.5960 l
s
[/DeviceRGB] SCS
Color4 SC
n
0.1500 0.3379 m
0.1500 0.3785 l
0.1700 0.3785 l
0.1700 0.3965 l
0.1900 0.3965 l
0.1900 0.3741 l
0.2100 0.3741 l
0.2100 0.3922 l
0.2300 0.3922 l
0.2300 0.4073 l
0.2500 0.4073 l
0.2500 0.4016 l
0.2700 0.4016 l
0.2700 0.4086 l
0.2900 0.4086 l
0.2900 0.3966 l
0.3100 0.3966 l
0.3100 0.3933 l
0.3300 0.3933 l
0.3300 0.4064 l
0.3500 0.4064 l
0.3500 0.4105 l
0.3700 0.4105 l
0.3700 0.4123 l
0.3900 0.4123 l
0.3900 0.4021 l
0.4100 0.4021 l
0.4100 0.3963 l
0.4300 0.3963 l
0.4300 0.4141 l
0.4500 0.4141 l
0.4500 0.3924 l
0.4700 0.3924 l
0.4700 0.4174 l
0.4900 0.4174 l
0.4900 0.4090 l
0.5100 0.4090 l
0.5100 0.4143 l
0.5300 0.4143 l
0.5300 0.3996 l
0.5500 0.3996 l
0.5500 0.3975 l
0.5700 0.3975 l
0.5700 0.4275 l
0.5900 0.4275 l
0.5900 0.3908 l
0.6100 0.3908 l
0.6100 0.4030 l
0.6300 0.4030 l
0.6300 0.4284 l
0.6500 0.4284 l
0.6500 0.4191 l
0.6700 0.4191 l
0.6700 0.4199 l
0.6900 0.4199 l
0.6900 0.4171 l
0.7100 0.4171 l
0.7100 0.4043 l
0.7300 0.4043 l
0.7300 0.4270 l
0.7500 0.4270 l
0.7500 0.4057 l
0.7700 0.4057 l
0.7700 0.4006 l
0.7900 0.4006 l
0.7900 0.3992 l
0.8100 0.3992 l
0.8100 0.4161 l
0.8300 0.4161 l
0.8300 0.4045 l
0.8500 0.4045 l
0.8500 0.3718 l
0.8700 0.3718 l
0.8700 0.3835 l
0.8900 0.3835 l
0.8900 0.3789 l
0.9100 0.3789 l
0.9100 0.3416 l
0.9300 0.3416 l
0.9300 0.3127 l
0.9500 0.3127 l
0.9500 0.3646 l
0.9700 0.3646 l
0.9700 0.3427 l
0.9900 0.3427 l
0.9900 0.3469 l
1.0100 0.3469 l
1.0100 0.2597 l
1.0300 0.2597 l
1.0300 0.2560 l
1.0500 0.2560 l
1.0500 0.3036 l
1.0700 0.3036 l
1.0700 0.2787 l
1.0900 0.2787 l
1.0900 0.3189 l
1.1100 0.3189 l
1.1100 0.2890 l
1.1300 0.2890 l
1.1300 0.2182 l
1.1500 0.2182 l
1.1500 0.1565 l
1.1501 0.1565 l
s
n
0.1500 0.6191 m
0.1500 0.5141 l
0.1700 0.5141 l
0.1700 0.4888 l
0.1900 0.4888 l
0.1900 0.5165 l
0.2100 0.5165 l
0.2100 0.4799 l
0.2300 0.4799 l
0.2300 0.5489 l
0.2500 0.5489 l
0.2500 0.4878 l
0.2700 0.4878 l
0.2700 0.4803 l
0.2900 0.4803 l
0.2900 0.4792 l
0.3100 0.4792 l
0.3100 0.5490 l
0.3300 0.5490 l
0.3300 0.4896 l
0.3500 0.4896 l
0.3500 0.5079 l
0.3700 0.5079 l
0.3700 0.4867 l
0.3900 0.4867 l
0.3900 0.4734 l
0.4100 0.4734 l
0.4100 0.5258 l
0.4300 0.5258 l
0.4300 0.4921 l
0.4500 0.4921 l
0.4500 0.4920 l
0.4700 0.4920 l
0.4700 0.5233 l
0.4900 0.5233 l
0.4900 0.4744 l
0.5100 0.4744 l
0.5100 0.4782 l
0.5300 0.4782 l
0.5300 0.5006 l
0.5500 0.5006 l
0.5500 0.4881 l
0.5700 0.4881 l
0.5700 0.4842 l
0.5900 0.4842 l
0.5900 0.4986 l
0.6100 0.4986 l
0.6100 0.4912 l
0.6300 0.4912 l
0.6300 0.4701 l
0.6500 0.4701 l
0.6500 0.4716 l
0.6700 0.4716 l
0.6700 0.4736 l
0.6900 0.4736 l
0.6900 0.4664 l
0.7100 0.4664 l
0.7100 0.4768 l
0.7300 0.4768 l
0.7300 0.4809 l
0.7500 0.4809 l
0.7500 0.4775 l
0.7700 0.4775 l
0.7700 0.4886 l
0.7900 0.4886 l
0.7900 0.4803 l
0.8100 0.4803 l
0.8100 0.5272 l
0.8300 0.5272 l
0.8300 0.4828 l
0.8500 0.4828 l
0.8500 0.4916 l
0.8700 0.4916 l
0.8700 0.5104 l
0.8900 0.5104 l
0.8900 0.5559 l
0.9100 0.5559 l
0.9100 0.5430 l
0.9300 0.5430 l
0.9300 0.5783 l
0.9500 0.5783 l
0.9500 0.5426 l
0.9700 0.5426 l
0.9700 0.5519 l
0.9900 0.5519 l
0.9900 0.5488 l
1.0100 0.5488 l
1.0100 0.6588 l
1.0300 0.6588 l
1.0300 0.6024 l
1.0500 0.6024 l
1.0500 0.6795 l
1.0700 0.6795 l
1.0700 0.7496 l
1.0900 0.7496 l
1.0900 0.5806 l
1.1100 0.5806 l
1.1100 0.6196 l
1.1300 0.6196 l
1.1300 0.7185 l
1.1500 0.7185 l
1.1500 0.8355 l
1.1501 0.8355 l
s
[/DeviceRGB] SCS
Color1 SC
[] 0 SD
0.0015 SLW
n
0.1500 0.1500 m
1.1500 0.1500 l
s
n
0.1500 0.8500 m
1.1500 0.8500 l
s
[] 0 SD
0.0030 SLW
n
0.2500 0.1500 m
0.2500 0.1600 l
s
n
0.2500 0.8500 m
0.2500 0.8400 l
s
n
0.4500 0.1500 m
0.4500 0.1600 l
s
n
0.4500 0.8500 m
0.4500 0.8400 l
s
n
0.6500 0.1500 m
0.6500 0.1600 l
s
n
0.6500 0.8500 m
0.6500 0.8400 l
s
n
0.8500 0.1500 m
0.8500 0.1600 l
s
n
0.8500 0.8500 m
0.8500 0.8400 l
s
n
1.0500 0.1500 m
1.0500 0.1600 l
s
n
1.0500 0.8500 m
1.0500 0.8400 l
s
n
0.1500 0.1500 m
0.1500 0.1700 l
s
n
0.1500 0.8500 m
0.1500 0.8300 l
s
n
0.3500 0.1500 m
0.3500 0.1700 l
s
n
0.3500 0.8500 m
0.3500 0.8300 l
s
n
0.5500 0.1500 m
0.5500 0.1700 l
s
n
0.5500 0.8500 m
0.5500 0.8300 l
s
n
0.7500 0.1500 m
0.7500 0.1700 l
s
n
0.7500 0.8500 m
0.7500 0.8300 l
s
n
0.9500 0.1500 m
0.9500 0.1700 l
s
n
0.9500 0.8500 m
0.9500 0.8300 l
s
n
1.1500 0.1500 m
1.1500 0.1700 l
s
n
1.1500 0.8500 m
1.1500 0.8300 l
s
/Times-Roman findfont
dup length dict begin
 {1 index /FID ne {def} {pop pop} ifelse} forall
 /Encoding DefEncoding def
 currentdict
end
/Font0 exch definefont pop
/Font0 FFSF
0.1418 0.1169 m
GS
[0.0344 0.0000 0.0000 0.0344 0 0] CC
(0) show
GR
/Font0 FFSF
0.3431 0.1169 m
GS
[0.0344 0.0000 0.0000 0.0344 0 0] CC
(1) show
GR
/Font0 FFSF
0.5418 0.1169 m
GS
[0.0344 0.0000 0.0000 0.0344 0 0] CC
(2) show
GR
/Font0 FFSF
0.7425 0.1169 m
GS
[0.0344 0.0000 0.0000 0.0344 0 0] CC
(3) show
GR
/Font0 FFSF
0.9420 0.1169 m
GS
[0.0344 0.0000 0.0000 0.0344 0 0] CC
(4) show
GR
/Font0 FFSF
1.1425 0.1165 m
GS
[0.0344 0.0000 0.0000 0.0344 0 0] CC
(5) show
GR
/Font0 FFSF
0.6063 0.0829 m
GS
[0.0344 0.0000 0.0000 0.0344 0 0] CC
(R\(t,H\)) show
GR
[] 0 SD
0.0015 SLW
n
0.1500 0.1500 m
0.1500 0.8500 l
s
n
1.1500 0.1500 m
1.1500 0.8500 l
s
n
0.1500 0.1500 m
0.1600 0.1500 l
s
n
1.1500 0.1500 m
1.1400 0.1500 l
s
n
0.1500 0.3500 m
0.1600 0.3500 l
s
n
1.1500 0.3500 m
1.1400 0.3500 l
s
n
0.1500 0.5500 m
0.1600 0.5500 l
s
n
1.1500 0.5500 m
1.1400 0.5500 l
s
n
0.1500 0.7500 m
0.1600 0.7500 l
s
n
1.1500 0.7500 m
1.1400 0.7500 l
s
n
0.1500 0.2500 m
0.1700 0.2500 l
s
n
1.1500 0.2500 m
1.1300 0.2500 l
s
n
0.1500 0.4500 m
0.1700 0.4500 l
s
n
1.1500 0.4500 m
1.1300 0.4500 l
s
n
0.1500 0.6500 m
0.1700 0.6500 l
s
n
1.1500 0.6500 m
1.1300 0.6500 l
s
n
0.1500 0.8500 m
0.1700 0.8500 l
s
n
1.1500 0.8500 m
1.1300 0.8500 l
s
/Font0 FFSF
0.1235 0.2386 m
GS
[0.0344 0.0000 0.0000 0.0344 0 0] CC
(0) show
GR
/Font0 FFSF
0.1263 0.4384 m
GS
[0.0344 0.0000 0.0000 0.0344 0 0] CC
(1) show
GR
/Font0 FFSF
0.1235 0.6384 m
GS
[0.0344 0.0000 0.0000 0.0344 0 0] CC
(2) show
GR
/Font0 FFSF
0.1251 0.8386 m
GS
[0.0344 0.0000 0.0000 0.0344 0 0] CC
(3) show
GR
/Font0 FFSF
0.1073 0.3755 m
GS
[0.0000 0.0344 -0.0344 0.0000 0 0] CC
(\(d) show
GR
/Symbol findfont
/Font12 exch definefont pop
/Font12 FFSF
0.1073 0.4041 m
GS
[0.0000 0.0344 -0.0344 0.0000 0 0] CC
(s) show
GR
/Font0 FFSF
0.1073 0.4249 m
GS
[0.0000 0.0344 -0.0344 0.0000 0 0] CC
(/dR\(t,H\)\)/C.V.) show
GR
/Font0 FFSF
1.1892 0.5475 m
GS
[0.0000 0.0280 -0.0280 0.0000 0 0] CC
(LHC HIGGS XS WG 2011) show
GR
[] 0 SD
0.0030 SLW
n
0.1500 0.1500 m
0.1500 0.8500 l
1.1500 0.8500 l
1.1500 0.1500 l
0.1500 0.1500 l
c
s
n
0.7100 0.7900 m
0.7100 0.7129 l
1.0072 0.7129 l
1.0072 0.7900 l
c
[/DeviceRGB] SCS
Color0 SC
fill
[/DeviceRGB] SCS
Color1 SC
[] 0 SD
0.0015 SLW
n
0.7100 0.7900 m
0.7100 0.7129 l
1.0072 0.7129 l
1.0072 0.7900 l
0.7100 0.7900 l
c
s
/Font0 FFSF
0.7815 0.7569 m
GS
[0.0339 0.0000 0.0000 0.0339 0 0] CC
(error from scale) show
GR
[/DeviceRGB] SCS
Color2 SC
[] 0 SD
0.0030 SLW
n
0.7215 0.7682 m
0.7615 0.7682 l
s
/Font0 FFSF
[/DeviceRGB] SCS
Color1 SC
0.7815 0.7233 m
GS
[0.0339 0.0000 0.0000 0.0339 0 0] CC
(total error) show
GR
[/DeviceRGB] SCS
Color4 SC
n
0.7215 0.7347 m
0.7615 0.7347 l
s
/Font0 FFSF
[/DeviceRGB] SCS
Color1 SC
0.4436 0.2623 m
GS
[0.0339 0.0000 0.0000 0.0339 0 0] CC
(LHC with 7 TeV) show
GR
%%Trailer
%%BoundingBox: 50 45 730 529
%%DocumentNeededResources: font Times-Roman
%%+ font Symbol
%%EOF
