%!PS-Adobe-2.0 EPSF-2.0
%%BoundingBox:  0 0 567 384
%%Title: mZ1.eps: mZ1
%%Creator: ROOT Version 5.27/06b
%%CreationDate: Mon Dec 12 11:24:48 2011
%%EndComments
%%BeginProlog
80 dict begin
/s {stroke} def /l {lineto} def /m {moveto} def /t {translate} def
/r {rotate} def /rl {roll}  def /R {repeat} def
/d {rlineto} def /rm {rmoveto} def /gr {grestore} def /f {eofill} def
/c {setrgbcolor} def /black {0 setgray} def /sd {setdash} def
/cl {closepath} def /sf {scalefont setfont} def /lw {setlinewidth} def
/box {m dup 0 exch d exch 0 d 0 exch neg d cl} def
/NC{systemdict begin initclip end}def/C{NC box clip newpath}def
/bl {box s} def /bf {box f} def /Y { 0 exch d} def /X { 0 d} def 
/K {{pop pop 0 moveto} exch kshow} bind def
/ita {/ang 15 def gsave [1 0 ang dup sin exch cos div 1 0 0] concat} def 
/mp {newpath /y exch def /x exch def} def
/side {[w .77 mul w .23 mul] .385 w mul sd w 0 l currentpoint t -144 r} def
/mr {mp x y w2 0 360 arc} def /m24 {mr s} def /m20 {mr f} def
/mb {mp x y w2 add m w2 neg 0 d 0 w neg d w 0 d 0 w d cl} def
/mt {mp x y w2 add m w2 neg w neg d w 0 d cl} def
/m21 {mb f} def /m25 {mb s} def /m22 {mt f} def /m26{mt s} def
/m23 {mp x y w2 sub m w2 w d w neg 0 d cl f} def
/m27 {mp x y w2 add m w3 neg w2 neg d w3 w2 neg d w3 w2 d cl s} def
/m28 {mp x w2 sub y w2 sub w3 add m w3 0 d  0 w3 neg d w3 0 d 0 w3 d w3 0 d  0 w3 d w3 neg 0 d 0 w3 d w3 neg 0 d 0 w3 neg d w3 neg 0 d cl s } def
/m29 {mp gsave x w2 sub y w2 add w3 sub m currentpoint t 4 {side} repeat cl fill gr} def
/m30 {mp gsave x w2 sub y w2 add w3 sub m currentpoint t 4 {side} repeat cl s gr} def
/m31 {mp x y w2 sub m 0 w d x w2 sub y m w 0 d x w2 sub y w2 add m w w neg d x w2 sub y w2 sub m w w d s} def
/m32 {mp x y w2 sub m w2 w d w neg 0 d cl s} def
/m33 {mp x y w2 add m w3 neg w2 neg d w3 w2 neg d w3 w2 d cl f} def
/m34 {mp x w2 sub y w2 sub w3 add m w3 0 d  0 w3 neg d w3 0 d 0 w3 d w3 0 d  0 w3 d w3 neg 0 d 0 w3 d w3 neg 0 d 0 w3 neg d w3 neg 0 d cl f } def
/m2 {mp x y w2 sub m 0 w d x w2 sub y m w 0 d s} def
/m5 {mp x w2 sub y w2 sub m w w d x w2 sub y w2 add m w w neg d s} def
/reEncode {exch findfont dup length dict begin {1 index /FID eq  {pop pop} {def} ifelse } forall /Encoding exch def currentdict end dup /FontName get exch definefont pop } def [/Times-Bold /Times-Italic /Times-BoldItalic /Helvetica /Helvetica-Oblique
 /Helvetica-Bold /Helvetica-BoldOblique /Courier /Courier-Oblique /Courier-Bold /Courier-BoldOblique /Times-Roman /AvantGarde-Book /AvantGarde-BookOblique /AvantGarde-Demi /AvantGarde-DemiOblique /Bookman-Demi /Bookman-DemiItalic /Bookman-Light
 /Bookman-LightItalic /Helvetica-Narrow /Helvetica-Narrow-Bold /Helvetica-Narrow-BoldOblique /Helvetica-Narrow-Oblique /NewCenturySchlbk-Roman /NewCenturySchlbk-Bold /NewCenturySchlbk-BoldItalic /NewCenturySchlbk-Italic /Palatino-Bold
 /Palatino-BoldItalic /Palatino-Italic /Palatino-Roman ] {ISOLatin1Encoding reEncode } forall%%EndProlog
%%BeginSetup
%%EndSetup
newpath  gsave  .25 .25 scale  gsave  0 0 t black[  ] 0 sd 3 lw 1 1 1 c 2268 1538 0 0 bf black 1 1 1 c 1791 1215 363 246 bf black 1791 1215 363 246 bl 1 0 0 c 6 lw 1 1 1 c black 1 0 0 c 540 246 m 216 Y s 540 488 m 437 Y s 3 lw black /w 31 def /w2 {w
 2 div} def /w3 {w 3 div} def 540 475 m20 6 lw 1 0 0 c 582 246 m 212 Y s 582 484 m 446 Y s 3 lw black 582 471 m20 6 lw 1 0 0 c 602 246 m 232 Y s 602 505 m 462 Y s 3 lw black 602 492 m20 6 lw 1 0 0 c 686 246 m 31 Y s 686 303 m 660 Y s 3 lw black 686
 290 m20 6 lw 1 0 0 c 707 246 m 341 Y s 707 613 m 364 Y s 3 lw black 707 600 m20 6 lw 1 0 0 c 727 246 m 273 Y s 727 545 m 439 Y s 3 lw black 727 532 m20 6 lw 1 0 0 c 748 246 m 181 Y s 748 453 m 527 Y s 3 lw black 748 440 m20 6 lw 1 0 0 c 769 246 m
 404 Y s 769 676 m 332 Y s 3 lw black 769 663 m20 6 lw 1 0 0 c 790 246 m 412 Y s 790 684 m 306 Y s 3 lw black 790 671 m20 6 lw 1 0 0 c 811 246 m 496 Y s 811 768 m 223 Y s 3 lw black 811 755 m20 6 lw 1 0 0 c 832 246 m 426 Y s 832 698 m 290 Y s 3 lw
 black 832 685 m20 6 lw 1 0 0 c 894 246 m 361 Y s 894 633 m 375 Y s 3 lw black 894 620 m20 6 lw 1 0 0 c 936 246 m 277 Y s 936 549 m 451 Y s 3 lw black 936 536 m20 6 lw 1 0 0 c 957 246 m 410 Y s 957 682 m 327 Y s 3 lw black 957 669 m20 6 lw 1 0 0 c
 998 246 m 484 Y s 998 756 m 252 Y s 3 lw black 998 743 m20 6 lw 1 0 0 c 1019 246 m 512 Y s 1019 784 m 235 Y s 3 lw black 1019 771 m20 6 lw 1 0 0 c 1040 246 m 406 Y s 1040 678 m 331 Y s 3 lw black 1040 665 m20 6 lw 1 0 0 c 1061 246 m 504 Y s 1061 776
 m 244 Y s 3 lw black 1061 763 m20 6 lw 1 0 0 c 1102 246 m 441 Y s 1102 713 m 312 Y s 3 lw black 1102 700 m20 6 lw 1 0 0 c 1144 246 m 483 Y s 1144 755 m 286 Y s 3 lw black 1144 742 m20 6 lw 1 0 0 c 1165 246 m 533 Y s 1165 805 m 237 Y s 3 lw black
 1165 792 m20 6 lw 1 0 0 c 1186 246 m 569 Y s 1186 841 m 204 Y s 3 lw black 1186 828 m20 6 lw 1 0 0 c 1227 246 m 506 Y s 1227 778 m 264 Y s 3 lw black 1227 765 m20 6 lw 1 0 0 c 1248 246 m 591 Y s 1248 863 m 192 Y s 3 lw black 1248 850 m20 6 lw 1 0 0
 c 1269 246 m 544 Y s 1269 816 m 243 Y s 3 lw black 1269 803 m20 6 lw 1 0 0 c 1290 246 m 619 Y s 1290 891 m 173 Y s 3 lw black 1290 878 m20 6 lw 1 0 0 c 1331 246 m 583 Y s 1331 855 m 224 Y s 3 lw black 1331 842 m20 6 lw 1 0 0 c 1373 246 m 637 Y s
 1373 910 m 181 Y s 3 lw black 1373 896 m20 6 lw 1 0 0 c 1394 246 m 638 Y s 1394 910 m 189 Y s 3 lw black 1394 897 m20 6 lw 1 0 0 c 1415 246 m 642 Y s 1415 914 m 202 Y s 3 lw black 1415 901 m20 6 lw 1 0 0 c 1436 246 m 503 Y s 1436 775 m 346 Y s 3 lw
 black 1436 762 m20 6 lw 1 0 0 c 1456 246 m 692 Y s 1456 964 m 191 Y s 3 lw black 1456 951 m20 6 lw 1 0 0 c 1498 246 m 747 Y s 1498 1019 m 172 Y s 3 lw black 1498 1006 m20 6 lw 1 0 0 c 1519 246 m 786 Y s 1519 1058 m 120 Y s 3 lw black 1519 1045 m20 6
 lw 1 0 0 c 1540 246 m 794 Y s 1540 1066 m 103 Y s 3 lw black 1540 1053 m20 6 lw 1 0 0 c 1561 246 m 883 Y s 1561 1155 m 34 Y s 3 lw black 1561 1142 m20 6 lw 1 0 0 c 1581 1150 m 26 Y s 1581 1202 m 11 Y s 3 lw black 1581 1189 m20 6 lw 3 lw 1602 1298
 m20 6 lw 3 lw 1623 1408 m20 6 lw 3 lw 1644 1420 m20 6 lw 3 lw 1665 1363 m20 6 lw 3 lw 1686 1317 m20 6 lw 3 lw 1706 1280 m20 6 lw 3 lw 1727 1252 m20 6 lw 3 lw 1748 1228 m20 6 lw 3 lw 1769 1205 m20 6 lw 1 0 0 c 1790 1175 m 4 Y s 1790 1205 m s 3 lw
 black 1790 1192 m20 6 lw 1 0 0 c 1811 1154 m 10 Y s 1811 1190 m 3 Y s 3 lw black 1811 1177 m20 6 lw 1 0 0 c 1831 1127 m 15 Y s 1831 1168 m 6 Y s 3 lw black 1831 1155 m20 6 lw 1 0 0 c 1852 1078 m 43 Y s 1852 1147 m 16 Y s 3 lw black 1852 1134 m20 6
 lw 1 0 0 c 1873 1110 m 23 Y s 1873 1159 m 10 Y s 3 lw black 1873 1146 m20 6 lw 1 0 0 c 1894 1095 m 27 Y s 1894 1148 m 11 Y s 3 lw black 1894 1135 m20 6 lw 1 0 0 c 1915 1043 m 60 Y s 1915 1129 m 20 Y s 3 lw black 1915 1116 m20 6 lw 1 0 0 c 1936 1007
 m 85 Y s 1936 1118 m 23 Y s 3 lw black 1936 1105 m20 6 lw 1 0 0 c 1956 950 m 131 Y s 1956 1107 m 28 Y s 3 lw black 1956 1094 m20 6 lw 1 0 0 c 1977 995 m 84 Y s 1977 1105 m 23 Y s 3 lw black 1977 1092 m20 6 lw 1 0 0 c 1998 246 m 814 Y s 1998 1086 m
 39 Y s 3 lw black 1998 1073 m20 6 lw 3 lw 2019 1027 m20 6 lw 3 lw 2040 1056 m20 6 lw 3 lw 2061 1055 m20 6 lw 3 lw 2081 1058 m20 6 lw 3 lw 2102 1057 m20 6 lw 3 lw 2123 1035 m20 6 lw 3 lw 2144 1039 m20 6 lw 1 0 0 c 1 1 1 c black 1 0 0 c 363 246 m 166
 X 229 Y 21 X -229 Y 21 X 225 Y 21 X 21 Y 21 X -246 Y 62 X 44 Y 21 X 310 Y 21 X -68 Y 21 X -92 Y 21 X 223 Y 20 X 8 Y 21 X 84 Y 21 X -70 Y 21 X -439 Y 42 X 374 Y 20 X -374 Y 21 X 290 Y 21 X 133 Y 21 X -423 Y 21 X 497 Y 21 X 28 Y 20 X -106 Y 21 X 98 Y
 21 X -517 Y 21 X 454 Y 21 X -454 Y 21 X 496 Y 20 X 50 Y 21 X 36 Y 21 X -582 Y 21 X 519 Y 21 X 85 Y 21 X -47 Y 20 X 75 Y 21 X -632 Y 21 X 596 Y 21 X -596 Y 21 X 650 Y 21 X 1 Y 20 X 4 Y 21 X -139 Y 21 X 189 Y 21 X -705 Y 21 X 760 Y 21 X 39 Y 20 X 8 Y
 21 X 89 Y 21 X 47 Y 21 X 109 Y 21 X 110 Y 21 X 12 Y 20 X -57 Y 21 X -46 Y 21 X -37 Y 21 X -28 Y 21 X -24 Y 21 X -23 Y 20 X -13 Y 21 X -15 Y 21 X -22 Y 21 X -21 Y 21 X 12 Y 21 X -11 Y 20 X -19 Y 21 X -11 Y 21 X -11 Y 21 X -2 Y 21 X -19 Y 21 X -46 Y
 20 X 29 Y 21 X -1 Y 21 X 3 Y 21 X -1 Y 21 X -22 Y 20 X 4 Y 21 X s black 3 lw 363 246 m 1791 X s
 gsave  2268 1538 0 0 C 1515.25 84.625 t 0 r /Helvetica findfont 71.6807 sf 0 0 m (larger Z mass [GeV]) show NC gr  363 283 m -37 Y s 432 264 m -18 Y s 502 264 m -18 Y s 571 264 m -18 Y s 641 283 m -37 Y s 710 264 m -18 Y s 779 264 m -18 Y s 849 264
 m -18 Y s 918 283 m -37 Y s 988 264 m -18 Y s 1057 264 m -18 Y s 1127 264 m -18 Y s 1196 283 m -37 Y s 1266 264 m -18 Y s 1335 264 m -18 Y s 1404 264 m -18 Y s 1474 283 m -37 Y s 1543 264 m -18 Y s 1613 264 m -18 Y s 1682 264 m -18 Y s 1752 283 m
 -37 Y s 1821 264 m -18 Y s 1890 264 m -18 Y s 1960 264 m -18 Y s 2029 283 m -37 Y s 2029 283 m -37 Y s 2099 264 m -18 Y s
 gsave  2268 1538 0 0 C 342.25 179.125 t 0 r /Helvetica findfont 71.6807 sf 0 0 m (0) show NC gr 
 gsave  2268 1538 0 0 C 599.688 179.125 t 0 r /Helvetica findfont 71.6807 sf 0 0 m (20) show NC gr 
 gsave  2268 1538 0 0 C 876.625 179.125 t 0 r /Helvetica findfont 71.6807 sf 0 0 m (40) show NC gr 
 gsave  2268 1538 0 0 C 1156.81 179.125 t 0 r /Helvetica findfont 71.6807 sf 0 0 m (60) show NC gr 
 gsave  2268 1538 0 0 C 1433.75 179.125 t 0 r /Helvetica findfont 71.6807 sf 0 0 m (80) show NC gr 
 gsave  2268 1538 0 0 C 1691.19 179.125 t 0 r /Helvetica findfont 71.6807 sf 0 0 m (100) show NC gr 
 gsave  2268 1538 0 0 C 1968.12 179.125 t 0 r /Helvetica findfont 71.6807 sf 0 0 m (120) show NC gr  363 1461 m 1791 X s 363 1425 m 36 Y s 432 1443 m 18 Y s 502 1443 m 18 Y s 571 1443 m 18 Y s 641 1425 m 36 Y s 710 1443 m 18 Y s 779 1443 m 18 Y s 849
 1443 m 18 Y s 918 1425 m 36 Y s 988 1443 m 18 Y s 1057 1443 m 18 Y s 1127 1443 m 18 Y s 1196 1425 m 36 Y s 1266 1443 m 18 Y s 1335 1443 m 18 Y s 1404 1443 m 18 Y s 1474 1425 m 36 Y s 1543 1443 m 18 Y s 1613 1443 m 18 Y s 1682 1443 m 18 Y s 1752 1425
 m 36 Y s 1821 1443 m 18 Y s 1890 1443 m 18 Y s 1960 1443 m 18 Y s 2029 1425 m 36 Y s 2029 1425 m 36 Y s 2099 1443 m 18 Y s 363 246 m 1215 Y s
 gsave  2268 1538 0 0 C 172.875 755.812 t 90 r /Helvetica findfont 71.6807 sf 0 0 m (arbitrary normalization) show NC gr  390 249 m -27 X s 390 267 m -27 X s 390 281 m -27 X s 390 293 m -27 X s 390 302 m -27 X s 390 311 m -27 X s 390 318 m -27 X s
 417 325 m -54 X s
 gsave  2268 1538 0 0 C 300 325.75 t 0 r /Helvetica findfont 48.8732 sf 0 0 m (\2558) show NC gr 
 gsave  2268 1538 0 0 C 221.75 293.188 t 0 r /Helvetica findfont 71.6807 sf 0 0 m (10) show NC gr  390 369 m -27 X s 390 395 m -27 X s 390 413 m -27 X s 390 427 m -27 X s 390 438 m -27 X s 390 448 m -27 X s 390 457 m -27 X s 390 464 m -27 X s 417 471
 m -54 X s
 gsave  2268 1538 0 0 C 300 469.125 t 0 r /Helvetica findfont 48.8732 sf 0 0 m (\2557) show NC gr 
 gsave  2268 1538 0 0 C 221.75 439.75 t 0 r /Helvetica findfont 71.6807 sf 0 0 m (10) show NC gr  390 515 m -27 X s 390 540 m -27 X s 390 558 m -27 X s 390 572 m -27 X s 390 584 m -27 X s 390 594 m -27 X s 390 602 m -27 X s 390 610 m -27 X s 417 616
 m -54 X s
 gsave  2268 1538 0 0 C 300 619 t 0 r /Helvetica findfont 48.8732 sf 0 0 m (\2556) show NC gr 
 gsave  2268 1538 0 0 C 221.75 586.375 t 0 r /Helvetica findfont 71.6807 sf 0 0 m (10) show NC gr  390 660 m -27 X s 390 686 m -27 X s 390 704 m -27 X s 390 718 m -27 X s 390 730 m -27 X s 390 739 m -27 X s 390 748 m -27 X s 390 755 m -27 X s 417 762
 m -54 X s
 gsave  2268 1538 0 0 C 300 762.312 t 0 r /Helvetica findfont 48.8732 sf 0 0 m (\2555) show NC gr 
 gsave  2268 1538 0 0 C 221.75 729.75 t 0 r /Helvetica findfont 71.6807 sf 0 0 m (10) show NC gr  390 806 m -27 X s 390 831 m -27 X s 390 850 m -27 X s 390 864 m -27 X s 390 875 m -27 X s 390 885 m -27 X s 390 893 m -27 X s 390 901 m -27 X s 417 908
 m -54 X s
 gsave  2268 1538 0 0 C 300 905.688 t 0 r /Helvetica findfont 48.8732 sf 0 0 m (\2554) show NC gr 
 gsave  2268 1538 0 0 C 221.75 876.375 t 0 r /Helvetica findfont 71.6807 sf 0 0 m (10) show NC gr  390 951 m -27 X s 390 977 m -27 X s 390 995 m -27 X s 390 1009 m -27 X s 390 1021 m -27 X s 390 1031 m -27 X s 390 1039 m -27 X s 390 1047 m -27 X s
 417 1053 m -54 X s
 gsave  2268 1538 0 0 C 300 1055.56 t 0 r /Helvetica findfont 48.8732 sf 0 0 m (\2553) show NC gr 
 gsave  2268 1538 0 0 C 221.75 1023 t 0 r /Helvetica findfont 71.6807 sf 0 0 m (10) show NC gr  390 1097 m -27 X s 390 1123 m -27 X s 390 1141 m -27 X s 390 1155 m -27 X s 390 1167 m -27 X s 390 1176 m -27 X s 390 1185 m -27 X s 390 1192 m -27 X s
 417 1199 m -54 X s
 gsave  2268 1538 0 0 C 300 1195.69 t 0 r /Helvetica findfont 48.8732 sf 0 0 m (\2552) show NC gr 
 gsave  2268 1538 0 0 C 221.75 1166.38 t 0 r /Helvetica findfont 71.6807 sf 0 0 m (10) show NC gr  390 1243 m -27 X s 390 1268 m -27 X s 390 1287 m -27 X s 390 1301 m -27 X s 390 1312 m -27 X s 390 1322 m -27 X s 390 1330 m -27 X s 390 1338 m -27 X s
 417 1345 m -54 X s
 gsave  2268 1538 0 0 C 306.5 1342.31 t 0 r /Helvetica findfont 48.8732 sf 0 0 m (\2551) show NC gr 
 gsave  2268 1538 0 0 C 228.312 1313 t 0 r /Helvetica findfont 71.6807 sf 0 0 m (10) show NC gr  390 1388 m -27 X s 390 1414 m -27 X s 390 1432 m -27 X s 390 1446 m -27 X s 390 1458 m -27 X s 2154 246 m 1215 Y s 2127 249 m 27 X s 2127 267 m 27 X s
 2127 281 m 27 X s 2127 293 m 27 X s 2127 302 m 27 X s 2127 311 m 27 X s 2127 318 m 27 X s 2101 325 m 53 X s 2127 369 m 27 X s 2127 395 m 27 X s 2127 413 m 27 X s 2127 427 m 27 X s 2127 438 m 27 X s 2127 448 m 27 X s 2127 457 m 27 X s 2127 464 m 27 X
 s 2101 471 m 53 X s 2127 515 m 27 X s 2127 540 m 27 X s 2127 558 m 27 X s 2127 572 m 27 X s 2127 584 m 27 X s 2127 594 m 27 X s 2127 602 m 27 X s 2127 610 m 27 X s 2101 616 m 53 X s 2127 660 m 27 X s 2127 686 m 27 X s 2127 704 m 27 X s 2127 718 m 27
 X s 2127 730 m 27 X s 2127 739 m 27 X s 2127 748 m 27 X s 2127 755 m 27 X s 2101 762 m 53 X s 2127 806 m 27 X s 2127 831 m 27 X s 2127 850 m 27 X s 2127 864 m 27 X s 2127 875 m 27 X s 2127 885 m 27 X s 2127 893 m 27 X s 2127 901 m 27 X s 2101 908 m
 53 X s 2127 951 m 27 X s 2127 977 m 27 X s 2127 995 m 27 X s 2127 1009 m 27 X s 2127 1021 m 27 X s 2127 1031 m 27 X s 2127 1039 m 27 X s 2127 1047 m 27 X s 2101 1053 m 53 X s 2127 1097 m 27 X s 2127 1123 m 27 X s 2127 1141 m 27 X s 2127 1155 m 27 X
 s 2127 1167 m 27 X s 2127 1176 m 27 X s 2127 1185 m 27 X s 2127 1192 m 27 X s 2101 1199 m 53 X s 2127 1243 m 27 X s 2127 1268 m 27 X s 2127 1287 m 27 X s 2127 1301 m 27 X s 2127 1312 m 27 X s 2127 1322 m 27 X s 2127 1330 m 27 X s 2127 1338 m 27 X s
 2101 1345 m 53 X s 2127 1388 m 27 X s 2127 1414 m 27 X s 2127 1432 m 27 X s 2127 1446 m 27 X s 2127 1458 m 27 X s 6 lw 1 1 1 c black 363 246 m 21 X 448 Y 20 X 123 Y 21 X 22 Y 21 X 12 Y 21 X 14 Y 21 X 21 Y 21 X -21 Y 20 X 4 Y 21 X 35 Y 21 X -4 Y 21 X
 24 Y 21 X -41 Y 21 X 28 Y 20 X 8 Y 42 X 3 Y 21 X 11 Y 21 X -14 Y 21 X -17 Y 20 X 28 Y 21 X -10 Y 21 X -7 Y 21 X 24 Y 21 X -22 Y 21 X 9 Y 20 X 5 Y 21 X 8 Y 21 X -12 Y 21 X -12 Y 21 X 14 Y 21 X -12 Y 20 X 23 Y 21 X -25 Y 21 X 6 Y 21 X -17 Y 21 X 5 Y
 21 X 6 Y 20 X -9 Y 21 X 11 Y 21 X -8 Y 42 X 4 Y 21 X 2 Y 20 X 4 Y 21 X -28 Y 21 X 22 Y 21 X 18 Y 21 X 1 Y 21 X 4 Y 41 X 14 Y 21 X 32 Y 21 X 31 Y 21 X 16 Y 21 X 26 Y 20 X 42 Y 21 X 47 Y 21 X 63 Y 21 X 93 Y 21 X 110 Y 21 X 12 Y 20 X -57 Y 21 X -49 Y
 21 X -37 Y 21 X -28 Y 21 X -26 Y 21 X -17 Y 20 X -20 Y 21 X -13 Y 21 X -14 Y 21 X -11 Y 21 X -14 Y 21 X -12 Y 20 X -7 Y 21 X -10 Y 21 X -13 Y 21 X -3 Y 21 X -14 Y 21 X -3 Y 20 X -9 Y 21 X -8 Y 21 X -1 Y 21 X -10 Y 21 X -8 Y 20 X 6 Y 21 X s 0 0 1 c[ 
 12 12 ] 0 sd 1 1 1 c black 0 0 1 c 363 246 m 21 X 451 Y 20 X 123 Y 21 X 18 Y 21 X 15 Y 21 X 14 Y 21 X 23 Y 21 X -23 Y 20 X 4 Y 21 X 35 Y 21 X -4 Y 21 X 24 Y 21 X -42 Y 21 X 30 Y 20 X 8 Y 21 X -2 Y 21 X 5 Y 21 X 11 Y 21 X -15 Y 21 X -15 Y 20 X 27 Y
 21 X -9 Y 21 X -8 Y 21 X 23 Y 21 X -21 Y 21 X 7 Y 20 X 7 Y 21 X 8 Y 21 X -12 Y 21 X -14 Y 21 X 16 Y 21 X -13 Y 20 X 25 Y 21 X -26 Y 21 X 6 Y 21 X -17 Y 21 X 3 Y 21 X 8 Y 20 X -8 Y 21 X 7 Y 21 X -5 Y 42 X 4 Y 21 X -2 Y 20 X 7 Y 21 X -28 Y 21 X 22 Y
 21 X 18 Y 21 X 1 Y 21 X 5 Y 20 X -1 Y 21 X 15 Y 21 X 30 Y 21 X 32 Y 21 X 14 Y 21 X 27 Y 20 X 42 Y 21 X 46 Y 21 X 63 Y 21 X 93 Y 21 X 110 Y 21 X 12 Y 20 X -57 Y 21 X -49 Y 21 X -37 Y 21 X -28 Y 21 X -26 Y 21 X -18 Y 20 X -19 Y 21 X -13 Y 21 X -14 Y
 21 X -11 Y 21 X -14 Y 21 X -12 Y 20 X -7 Y 21 X -10 Y 21 X -14 Y 21 X -2 Y 21 X -14 Y 21 X -4 Y 20 X -9 Y 21 X -6 Y 21 X -2 Y 21 X -9 Y 21 X -9 Y 20 X 6 Y 21 X s black
 gsave  2268 1538 0 0 C 2199.44 1124 t 90 r /Helvetica-BoldOblique findfont 29.3239 sf 0 0 m 
 317 303 287 271 263 240 213 205 186 167 159 140 118 95 87 67 59 38 17
(LHC HIGGS XS WG 2011) K NC gr 
 gr  gr showpage
end
%%EOF
