%!PS-Adobe-2.0 EPSF-2.0
%%BoundingBox:  0 0 567 384
%%Title: /home/dimicco/HiggsScan/compare_MCNLO_MCFM/mll.eps: canvas_mll_common
%%Creator: ROOT Version 5.26/00
%%CreationDate: Fri Dec  9 15:00:49 2011
%%EndComments
%%BeginProlog
80 dict begin
/s {stroke} def /l {lineto} def /m {moveto} def /t {translate} def
/sw {stringwidth} def /r {rotate} def /rl {roll}  def /R {repeat} def
/d {rlineto} def /rm {rmoveto} def /gr {grestore} def /f {eofill} def
/c {setrgbcolor} def /black {0 setgray} def /sd {setdash} def
/cl {closepath} def /sf {scalefont setfont} def /lw {setlinewidth} def
/box {m dup 0 exch d exch 0 d 0 exch neg d cl} def
/NC{systemdict begin initclip end}def/C{NC box clip newpath}def
/bl {box s} def /bf {box f} def /Y { 0 exch d} def /X { 0 d} def 
/mp {newpath /y exch def /x exch def} def
/side {[w .77 mul w .23 mul] .385 w mul sd w 0 l currentpoint t -144 r} def
/mr {mp x y w2 0 360 arc} def /m24 {mr s} def /m20 {mr f} def
/mb {mp x y w2 add m w2 neg 0 d 0 w neg d w 0 d 0 w d cl} def
/mt {mp x y w2 add m w2 neg w neg d w 0 d cl} def
/m21 {mb f} def /m25 {mb s} def /m22 {mt f} def /m26{mt s} def
/m23 {mp x y w2 sub m w2 w d w neg 0 d cl f} def
/m27 {mp x y w2 add m w3 neg w2 neg d w3 w2 neg d w3 w2 d cl s} def
/m28 {mp x w2 sub y w2 sub w3 add m w3 0 d  0 w3 neg d w3 0 d 0 w3 d w3 0 d  0 w3 d w3 neg 0 d 0 w3 d w3 neg 0 d
 0 w3 neg d w3 neg 0 d cl s } def
/m29 {mp gsave x w2 sub y w2 add w3 sub m currentpoint t
 4 {side} repeat cl fill gr} def
/m30 {mp gsave x w2 sub y w2 add w3 sub m currentpoint t
 4 {side} repeat cl s gr} def
/m31 {mp x y w2 sub m 0 w d x w2 sub y m w 0 d x w2 sub y w2 add m w w neg d x w2 sub y w2
 sub m w w d s} def
/m2 {mp x y w2 sub m 0 w d x w2 sub y m w 0 d s} def
/m5 {mp x w2 sub y w2 sub m w w d x w2 sub y w2 add m w w neg d s} def
/reEncode {exch findfont dup length dict begin {1 index /FID eq  {pop pop} {def} ifelse } forall /Encoding exch def currentdict end dup /FontName get exch definefont pop } def [/Times-Bold /Times-Italic /Times-BoldItalic /Helvetica
 /Helvetica-Oblique /Helvetica-Bold /Helvetica-BoldOblique /Courier /Courier-Oblique /Courier-Bold /Courier-BoldOblique /Times-Roman /AvantGarde-Book /AvantGarde-BookOblique /AvantGarde-Demi /AvantGarde-DemiOblique /Bookman-Demi
 /Bookman-DemiItalic /Bookman-Light /Bookman-LightItalic /Helvetica-Narrow /Helvetica-Narrow-Bold /Helvetica-Narrow-BoldOblique /Helvetica-Narrow-Oblique /NewCenturySchlbk-Roman /NewCenturySchlbk-Bold
 /NewCenturySchlbk-BoldItalic /NewCenturySchlbk-Italic /Palatino-Bold /Palatino-BoldItalic /Palatino-Italic /Palatino-Roman ] {ISOLatin1Encoding reEncode } forall
/oshow {gsave [] 0 sd true charpath stroke gr} def
/stwn { /fs exch def /fn exch def /text exch def fn findfont fs sf
 text sw pop xs add /xs exch def} def
/stwb { /fs exch def /fn exch def /nbas exch def /textf exch deftextf length /tlen exch def nbas tlen gt {/nbas tlendef} iffn findfont fs sf textf dup length nbas sub nbas getinterval sw
pop neg xs add /xs exch def} def
%%EndProlog
%%BeginSetup
%%EndSetup
newpath  gsave  .25 .25 scale  gsave  0 0 t black[  ] 0 sd 3 lw 1 1 1 c 2268 1538 0 0 bf black 1 1 1 c 1791 1215 363 246 bf black 1791 1215 363 246 bl 1 1 1 c 1791 1215 363 246 bf black 1791 1215 363 246 bl 1 0 0 c 6 lw 1 1 1 c 1 0 0 c 3 lw /w 29
 def /w2 {w 2 div} def /w3 {w 3 div} def 372 282 m20 6 lw 390 345 m 1 Y s 390 372 m 1 Y s 3 lw 390 359 m20 6 lw 408 365 m 3 Y s 408 395 m 3 Y s 3 lw 408 381 m20 6 lw 426 465 m 9 Y s 426 500 m 8 Y s 3 lw 426 487 m20 6 lw 443 488 m 11 Y s 443 525 m 11
 Y s 3 lw 443 512 m20 6 lw 461 555 m 14 Y s 461 595 m 13 Y s 3 lw 461 582 m20 6 lw 479 615 m 17 Y s 479 658 m 16 Y s 3 lw 479 645 m20 6 lw 497 742 m 19 Y s 497 787 m 19 Y s 3 lw 497 774 m20 6 lw 515 736 m 19 Y s 515 781 m 20 Y s 3 lw 515 768 m20 6
 lw 533 776 m 21 Y s 533 823 m 21 Y s 3 lw 533 810 m20 6 lw 551 785 m 23 Y s 551 834 m 22 Y s 3 lw 551 821 m20 6 lw 569 901 m 24 Y s 569 951 m 24 Y s 3 lw 569 938 m20 6 lw 587 904 m 26 Y s 587 956 m 25 Y s 3 lw 587 943 m20 6 lw 605 997 m 27 Y s 605
 1051 m 27 Y s 3 lw 605 1037 m20 6 lw 623 1006 m 30 Y s 623 1063 m 30 Y s 3 lw 623 1050 m20 6 lw 641 1078 m 31 Y s 641 1135 m 30 Y s 3 lw 641 1122 m20 6 lw 658 1035 m 30 Y s 658 1091 m 30 Y s 3 lw 658 1078 m20 6 lw 676 1096 m 31 Y s 676 1153 m 31 Y
 s 3 lw 676 1140 m20 6 lw 694 1112 m 31 Y s 694 1169 m 32 Y s 3 lw 694 1156 m20 6 lw 712 1146 m 32 Y s 712 1204 m 32 Y s 3 lw 712 1191 m20 6 lw 730 1200 m 32 Y s 730 1258 m 33 Y s 3 lw 730 1245 m20 6 lw 748 1205 m 35 Y s 748 1266 m 34 Y s 3 lw 748
 1253 m20 6 lw 766 1231 m 33 Y s 766 1290 m 33 Y s 3 lw 766 1277 m20 6 lw 784 1241 m 35 Y s 784 1302 m 34 Y s 3 lw 784 1289 m20 6 lw 802 1219 m 34 Y s 802 1279 m 34 Y s 3 lw 802 1266 m20 6 lw 820 1250 m 35 Y s 820 1311 m 35 Y s 3 lw 820 1298 m20 6
 lw 838 1229 m 35 Y s 838 1290 m 35 Y s 3 lw 838 1277 m20 6 lw 855 1303 m 34 Y s 855 1363 m 35 Y s 3 lw 855 1350 m20 6 lw 873 1307 m 35 Y s 873 1368 m 35 Y s 3 lw 873 1355 m20 6 lw 891 1173 m 32 Y s 891 1231 m 32 Y s 3 lw 891 1218 m20 6 lw 909 1222
 m 34 Y s 909 1282 m 34 Y s 3 lw 909 1269 m20 6 lw 927 1288 m 34 Y s 927 1348 m 34 Y s 3 lw 927 1335 m20 6 lw 945 1233 m 34 Y s 945 1293 m 33 Y s 3 lw 945 1280 m20 6 lw 963 1190 m 33 Y s 963 1249 m 33 Y s 3 lw 963 1236 m20 6 lw 981 1169 m 33 Y s 981
 1228 m 33 Y s 3 lw 981 1215 m20 6 lw 999 1191 m 32 Y s 999 1249 m 32 Y s 3 lw 999 1236 m20 6 lw 1017 1126 m 31 Y s 1017 1183 m 31 Y s 3 lw 1017 1170 m20 6 lw 1035 1142 m 31 Y s 1035 1199 m 32 Y s 3 lw 1035 1186 m20 6 lw 1053 1097 m 31 Y s 1053 1154
 m 32 Y s 3 lw 1053 1141 m20 6 lw 1070 1100 m 30 Y s 1070 1156 m 29 Y s 3 lw 1070 1143 m20 6 lw 1088 1067 m 28 Y s 1088 1121 m 29 Y s 3 lw 1088 1108 m20 6 lw 1106 1064 m 28 Y s 1106 1118 m 29 Y s 3 lw 1106 1105 m20 6 lw 1124 1019 m 28 Y s 1124 1073
 m 28 Y s 3 lw 1124 1060 m20 6 lw 1142 994 m 27 Y s 1142 1048 m 27 Y s 3 lw 1142 1034 m20 6 lw 1160 944 m 28 Y s 1160 998 m 27 Y s 3 lw 1160 985 m20 6 lw 1178 1012 m 26 Y s 1178 1064 m 26 Y s 3 lw 1178 1051 m20 6 lw 1196 1015 m 26 Y s 1196 1067 m 26
 Y s 3 lw 1196 1054 m20 6 lw 1214 951 m 25 Y s 1214 1002 m 26 Y s 3 lw 1214 989 m20 6 lw 1232 854 m 23 Y s 1232 903 m 23 Y s 3 lw 1232 890 m20 6 lw 1250 924 m 25 Y s 1250 975 m 25 Y s 3 lw 1250 962 m20 6 lw 1268 935 m 25 Y s 1268 986 m 25 Y s 3 lw
 1268 973 m20 6 lw 1285 867 m 24 Y s 1285 917 m 23 Y s 3 lw 1285 904 m20 6 lw 1303 843 m 22 Y s 1303 891 m 22 Y s 3 lw 1303 878 m20 6 lw 1321 847 m 22 Y s 1321 896 m 22 Y s 3 lw 1321 883 m20 6 lw 1339 796 m 21 Y s 1339 843 m 20 Y s 3 lw 1339 830 m20
 6 lw 1357 803 m 21 Y s 1357 850 m 22 Y s 3 lw 1357 837 m20 6 lw 1375 754 m 21 Y s 1375 801 m 20 Y s 3 lw 1375 788 m20 6 lw 1393 714 m 20 Y s 1393 760 m 20 Y s 3 lw 1393 747 m20 6 lw 1411 703 m 19 Y s 1411 748 m 19 Y s 3 lw 1411 735 m20 6 lw 1429
 713 m 18 Y s 1429 757 m 18 Y s 3 lw 1429 744 m20 6 lw 1447 713 m 18 Y s 1447 757 m 19 Y s 3 lw 1447 744 m20 6 lw 1465 700 m 19 Y s 1465 745 m 19 Y s 3 lw 1465 732 m20 6 lw 1483 722 m 18 Y s 1483 766 m 18 Y s 3 lw 1483 753 m20 6 lw 1500 639 m 17 Y s
 1500 682 m 17 Y s 3 lw 1500 669 m20 6 lw 1518 657 m 17 Y s 1518 700 m 17 Y s 3 lw 1518 687 m20 6 lw 1536 634 m 16 Y s 1536 676 m 16 Y s 3 lw 1536 663 m20 6 lw 1554 638 m 16 Y s 1554 680 m 17 Y s 3 lw 1554 667 m20 6 lw 1572 602 m 15 Y s 1572 643 m
 15 Y s 3 lw 1572 630 m20 6 lw 1590 614 m 15 Y s 1590 655 m 15 Y s 3 lw 1590 642 m20 6 lw 1608 556 m 14 Y s 1608 596 m 14 Y s 3 lw 1608 583 m20 6 lw 1626 548 m 13 Y s 1626 587 m 13 Y s 3 lw 1626 574 m20 6 lw 1644 546 m 14 Y s 1644 586 m 13 Y s 3 lw
 1644 573 m20 6 lw 1662 582 m 14 Y s 1662 622 m 14 Y s 3 lw 1662 609 m20 6 lw 1680 493 m 11 Y s 1680 530 m 11 Y s 3 lw 1680 517 m20 6 lw 1697 509 m 11 Y s 1697 546 m 12 Y s 3 lw 1697 533 m20 6 lw 1715 482 m 10 Y s 1715 518 m 10 Y s 3 lw 1715 505 m20
 6 lw 1733 539 m 12 Y s 1733 577 m 11 Y s 3 lw 1733 564 m20 6 lw 1751 521 m 11 Y s 1751 559 m 11 Y s 3 lw 1751 545 m20 6 lw 1769 467 m 10 Y s 1769 503 m 10 Y s 3 lw 1769 490 m20 6 lw 1787 475 m 11 Y s 1787 512 m 10 Y s 3 lw 1787 499 m20 6 lw 1805
 501 m 10 Y s 1805 537 m 11 Y s 3 lw 1805 524 m20 6 lw 1823 486 m 10 Y s 1823 522 m 10 Y s 3 lw 1823 509 m20 6 lw 1841 468 m 10 Y s 1841 504 m 10 Y s 3 lw 1841 491 m20 6 lw 1859 496 m 9 Y s 1859 531 m 10 Y s 3 lw 1859 518 m20 6 lw 1877 485 m 8 Y s
 1877 519 m 9 Y s 3 lw 1877 506 m20 6 lw 1895 417 m 6 Y s 1895 449 m 5 Y s 3 lw 1895 436 m20 6 lw 1912 461 m 8 Y s 1912 495 m 9 Y s 3 lw 1912 482 m20 6 lw 1930 412 m 6 Y s 1930 444 m 6 Y s 3 lw 1930 431 m20 6 lw 1948 429 m 7 Y s 1948 462 m 7 Y s 3
 lw 1948 449 m20 6 lw 1966 416 m 7 Y s 1966 449 m 6 Y s 3 lw 1966 436 m20 6 lw 1984 393 m 7 Y s 1984 426 m 7 Y s 3 lw 1984 413 m20 6 lw 2002 429 m 7 Y s 2002 462 m 7 Y s 3 lw 2002 449 m20 6 lw 2020 399 m 6 Y s 2020 431 m 5 Y s 3 lw 2020 418 m20 6 lw
 2038 408 m 6 Y s 2038 440 m 5 Y s 3 lw 2038 427 m20 6 lw 2056 417 m 6 Y s 2056 449 m 5 Y s 3 lw 2056 436 m20 6 lw 2074 377 m 3 Y s 2074 407 m 3 Y s 3 lw 2074 394 m20 6 lw 2092 367 m 4 Y s 2092 398 m 4 Y s 3 lw 2092 384 m20 6 lw 2110 390 m 6 Y s
 2110 422 m 5 Y s 3 lw 2110 409 m20 6 lw 2127 392 m 5 Y s 2127 423 m 5 Y s 3 lw 2127 410 m20 6 lw 2145 393 m 4 Y s 2145 423 m 4 Y s 3 lw 2145 410 m20 6 lw black 3 lw 363 246 m 1791 X s
 gsave  2268 1538 0 0 C 1955 117 t 0 r /Helvetica findfont 71.6807 sf 0 0 m ( [GeV]) show NC gr 
 gsave  2268 1538 0 0 C 1935 98 t 0 r /Helvetica findfont 48.8732 sf 0 0 m (ll) show NC gr 
 gsave  2268 1538 0 0 C 1880 117 t 0 r /Helvetica findfont 71.6807 sf 0 0 m (m) show NC gr  363 283 m -37 Y s 408 264 m -18 Y s 452 264 m -18 Y s 497 264 m -18 Y s 542 283 m -37 Y s 587 264 m -18 Y s 632 264 m -18 Y s 676 264 m -18 Y s 721 283 m -37
 Y s 766 264 m -18 Y s 811 264 m -18 Y s 855 264 m -18 Y s 900 283 m -37 Y s 945 264 m -18 Y s 990 264 m -18 Y s 1035 264 m -18 Y s 1079 283 m -37 Y s 1124 264 m -18 Y s 1169 264 m -18 Y s 1214 264 m -18 Y s 1259 283 m -37 Y s 1303 264 m -18 Y s
 1348 264 m -18 Y s 1393 264 m -18 Y s 1438 283 m -37 Y s 1483 264 m -18 Y s 1527 264 m -18 Y s 1572 264 m -18 Y s 1617 283 m -37 Y s 1662 264 m -18 Y s 1706 264 m -18 Y s 1751 264 m -18 Y s 1796 283 m -37 Y s 1841 264 m -18 Y s 1886 264 m -18 Y s
 1930 264 m -18 Y s 1975 283 m -37 Y s 2020 264 m -18 Y s 2065 264 m -18 Y s 2110 264 m -18 Y s 2154 283 m -37 Y s
 gsave  2268 1538 0 0 C 342 179 t 0 r /Helvetica findfont 71.6807 sf 0 0 m (0) show NC gr 
 gsave  2268 1538 0 0 C 502 179 t 0 r /Helvetica findfont 71.6807 sf 0 0 m (20) show NC gr 
 gsave  2268 1538 0 0 C 681 179 t 0 r /Helvetica findfont 71.6807 sf 0 0 m (40) show NC gr 
 gsave  2268 1538 0 0 C 860 179 t 0 r /Helvetica findfont 71.6807 sf 0 0 m (60) show NC gr 
 gsave  2268 1538 0 0 C 1039 179 t 0 r /Helvetica findfont 71.6807 sf 0 0 m (80) show NC gr 
 gsave  2268 1538 0 0 C 1199 179 t 0 r /Helvetica findfont 71.6807 sf 0 0 m (100) show NC gr 
 gsave  2268 1538 0 0 C 1378 179 t 0 r /Helvetica findfont 71.6807 sf 0 0 m (120) show NC gr 
 gsave  2268 1538 0 0 C 1557 179 t 0 r /Helvetica findfont 71.6807 sf 0 0 m (140) show NC gr 
 gsave  2268 1538 0 0 C 1737 179 t 0 r /Helvetica findfont 71.6807 sf 0 0 m (160) show NC gr 
 gsave  2268 1538 0 0 C 1916 179 t 0 r /Helvetica findfont 71.6807 sf 0 0 m (180) show NC gr 
 gsave  2268 1538 0 0 C 2095 179 t 0 r /Helvetica findfont 71.6807 sf 0 0 m (200) show NC gr  363 1461 m 1791 X s 363 1425 m 36 Y s 408 1443 m 18 Y s 452 1443 m 18 Y s 497 1443 m 18 Y s 542 1425 m 36 Y s 587 1443 m 18 Y s 632 1443 m 18 Y s 676 1443
 m 18 Y s 721 1425 m 36 Y s 766 1443 m 18 Y s 811 1443 m 18 Y s 855 1443 m 18 Y s 900 1425 m 36 Y s 945 1443 m 18 Y s 990 1443 m 18 Y s 1035 1443 m 18 Y s 1079 1425 m 36 Y s 1124 1443 m 18 Y s 1169 1443 m 18 Y s 1214 1443 m 18 Y s 1259 1425 m 36 Y s
 1303 1443 m 18 Y s 1348 1443 m 18 Y s 1393 1443 m 18 Y s 1438 1425 m 36 Y s 1483 1443 m 18 Y s 1527 1443 m 18 Y s 1572 1443 m 18 Y s 1617 1425 m 36 Y s 1662 1443 m 18 Y s 1706 1443 m 18 Y s 1751 1443 m 18 Y s 1796 1425 m 36 Y s 1841 1443 m 18 Y s
 1886 1443 m 18 Y s 1930 1443 m 18 Y s 1975 1425 m 36 Y s 2020 1443 m 18 Y s 2065 1443 m 18 Y s 2110 1443 m 18 Y s 2154 1425 m 36 Y s 363 246 m 1215 Y s
 gsave  2268 1538 0 0 C 143 1030 t 90 r /Helvetica findfont 71.6807 sf 0 0 m (arbitrary units) show NC gr  417 246 m -54 X s 390 274 m -27 X s 390 302 m -27 X s 390 330 m -27 X s 417 358 m -54 X s 390 387 m -27 X s 390 415 m -27 X s 390 443 m -27 X
 s 417 471 m -54 X s 390 499 m -27 X s 390 527 m -27 X s 390 555 m -27 X s 417 583 m -54 X s 390 611 m -27 X s 390 639 m -27 X s 390 667 m -27 X s 417 695 m -54 X s 390 724 m -27 X s 390 752 m -27 X s 390 780 m -27 X s 417 808 m -54 X s 390 836 m
 -27 X s 390 864 m -27 X s 390 892 m -27 X s 417 920 m -54 X s 390 948 m -27 X s 390 976 m -27 X s 390 1004 m -27 X s 417 1033 m -54 X s 390 1061 m -27 X s 390 1089 m -27 X s 390 1117 m -27 X s 417 1145 m -54 X s 390 1173 m -27 X s 390 1201 m -27 X
 s 390 1229 m -27 X s 417 1257 m -54 X s 390 1285 m -27 X s 390 1313 m -27 X s 390 1342 m -27 X s 417 1370 m -54 X s 417 1370 m -54 X s 390 1398 m -27 X s 390 1426 m -27 X s 390 1454 m -27 X s
 gsave  2268 1538 0 0 C 310 222 t 0 r /Helvetica findfont 71.6807 sf 0 0 m (0) show NC gr 
 gsave  2268 1538 0 0 C 173 336 t 0 r /Helvetica findfont 71.6807 sf 0 0 m (0.002) show NC gr 
 gsave  2268 1538 0 0 C 173 446 t 0 r /Helvetica findfont 71.6807 sf 0 0 m (0.004) show NC gr 
 gsave  2268 1538 0 0 C 169 557 t 0 r /Helvetica findfont 71.6807 sf 0 0 m (0.006) show NC gr 
 gsave  2268 1538 0 0 C 169 671 t 0 r /Helvetica findfont 71.6807 sf 0 0 m (0.008) show NC gr 
 gsave  2268 1538 0 0 C 222 782 t 0 r /Helvetica findfont 71.6807 sf 0 0 m (0.01) show NC gr 
 gsave  2268 1538 0 0 C 173 896 t 0 r /Helvetica findfont 71.6807 sf 0 0 m (0.012) show NC gr 
 gsave  2268 1538 0 0 C 173 1007 t 0 r /Helvetica findfont 71.6807 sf 0 0 m (0.014) show NC gr 
 gsave  2268 1538 0 0 C 169 1121 t 0 r /Helvetica findfont 71.6807 sf 0 0 m (0.016) show NC gr 
 gsave  2268 1538 0 0 C 169 1232 t 0 r /Helvetica findfont 71.6807 sf 0 0 m (0.018) show NC gr 
 gsave  2268 1538 0 0 C 212 1346 t 0 r /Helvetica findfont 71.6807 sf 0 0 m (0.02) show NC gr  2154 246 m 1215 Y s 2101 246 m 53 X s 2127 274 m 27 X s 2127 302 m 27 X s 2127 330 m 27 X s 2101 358 m 53 X s 2127 387 m 27 X s 2127 415 m 27 X s 2127 443
 m 27 X s 2101 471 m 53 X s 2127 499 m 27 X s 2127 527 m 27 X s 2127 555 m 27 X s 2101 583 m 53 X s 2127 611 m 27 X s 2127 639 m 27 X s 2127 667 m 27 X s 2101 695 m 53 X s 2127 724 m 27 X s 2127 752 m 27 X s 2127 780 m 27 X s 2101 808 m 53 X s 2127
 836 m 27 X s 2127 864 m 27 X s 2127 892 m 27 X s 2101 920 m 53 X s 2127 948 m 27 X s 2127 976 m 27 X s 2127 1004 m 27 X s 2101 1033 m 53 X s 2127 1061 m 27 X s 2127 1089 m 27 X s 2127 1117 m 27 X s 2101 1145 m 53 X s 2127 1173 m 27 X s 2127 1201 m
 27 X s 2127 1229 m 27 X s 2101 1257 m 53 X s 2127 1285 m 27 X s 2127 1313 m 27 X s 2127 1342 m 27 X s 2101 1370 m 53 X s 2101 1370 m 53 X s 2127 1398 m 27 X s 2127 1426 m 27 X s 2127 1454 m 27 X s 0 0 1 c 6 lw 1 1 1 c black 0 0 1 c 363 281 m 18 X
 62 Y 18 X 64 Y 18 X 66 Y 17 X 63 Y 18 X 49 Y 18 X 52 Y 18 X 66 Y 18 X 56 Y 18 X 48 Y 18 X 73 Y 18 X 46 Y 18 X 20 Y 18 X 52 Y 18 X 46 Y 18 X 49 Y 17 X 32 Y 18 X 19 Y 18 X 25 Y 18 X 49 Y 18 X 5 Y 18 X 23 Y 18 X 3 Y 18 X 11 Y 18 X 17 Y 18 X 6 Y 18 X
 10 Y 18 X 10 Y 17 X -20 Y 18 X -4 Y 18 X 10 Y 18 X -32 Y 18 X -5 Y 18 X -20 Y 18 X -3 Y 18 X -4 Y 18 X -31 Y 18 X -7 Y 18 X -39 Y 18 X -11 Y 17 X -20 Y 18 X -22 Y 18 X -8 Y 18 X -22 Y 18 X -35 Y 18 X -15 Y 18 X -20 Y 18 X -24 Y 18 X -25 Y 18 X -9 Y
 18 X -19 Y 17 X -17 Y 18 X -22 Y 18 X -16 Y 18 X -23 Y 18 X -15 Y 18 X -15 Y 18 X -18 Y 18 X -15 Y 18 X -21 Y 18 X -13 Y 18 X -15 Y 18 X -25 Y 17 X -5 Y 18 X -14 Y 18 X -15 Y 18 X -14 Y 18 X -17 Y 18 X -9 Y 18 X -9 Y 18 X -13 Y 18 X -15 Y 18 X -2 Y
 18 X -13 Y 18 X -15 Y 17 X -9 Y 18 X -11 Y 18 X -10 Y 18 X -4 Y 18 X -11 Y 18 X -6 Y 18 X -9 Y 18 X -13 Y 18 X -11 Y 18 X -3 Y 18 X -6 Y 18 X -4 Y 17 X -7 Y 18 X -8 Y 18 X -6 Y 18 X -4 Y 18 X -10 Y 36 X -9 Y 18 X -6 Y 18 X -3 Y 18 X -7 Y 18 X -3 Y
 18 X -7 Y 17 X -4 Y 18 X s 1 1 1 c 0 lw 707 228 606 358 bf 3 lw 626 358 m -13 Y 700 X 222 Y -13 X -209 Y f 0 lw 606 358 m 228 Y 707 X -228 Y -707 X cl s black
 gsave  2268 1538 0 0 C 782 499 t 0 r /Helvetica findfont 87.9718 sf 0 0 m (MCFM) show NC gr  1 1 1 c 3 lw 633 490 m 123 X 79 Y -123 X f 0 lw 0 0 1 c 6 lw 633 529 m 123 X s black 3 lw 694 529 m20 6 lw
 gsave  2268 1538 0 0 C 782 391 t 0 r /Helvetica findfont 87.9718 sf 0 0 m (MC@NLO) show NC gr  1 1 1 c 3 lw 633 376 m 123 X 79 Y -123 X f 6 lw 1 0 0 c 633 415 m 123 X s 3 lw 694 415 m20 6 lw black
 gsave  2268 1538 0 0 C 2222 1118 t 90 r /Helvetica-BoldOblique findfont 29.3239 sf 0 0 m (LHC HIGGS XS WG 2011) show NC gr 
 gr  gr 
showpage
end
%%EOF
