%!PS-Adobe-2.0 EPSF-2.0
%%BoundingBox:  0 0 567 362
%%Title: Results/m120/POWHEG.mjjmaxpt-mstw2008.eps: VBF - HAWK
%%Creator: ROOT Version 5.28/00c
%%CreationDate: Fri Nov 25 16:20:20 2011
%%EndComments
%%BeginProlog
80 dict begin
/s {stroke} def /l {lineto} def /m {moveto} def /t {translate} def
/r {rotate} def /rl {roll}  def /R {repeat} def
/d {rlineto} def /rm {rmoveto} def /gr {grestore} def /f {eofill} def
/c {setrgbcolor} def /black {0 setgray} def /sd {setdash} def
/cl {closepath} def /sf {scalefont setfont} def /lw {setlinewidth} def
/box {m dup 0 exch d exch 0 d 0 exch neg d cl} def
/NC{systemdict begin initclip end}def/C{NC box clip newpath}def
/bl {box s} def /bf {box f} def /Y { 0 exch d} def /X { 0 d} def 
/K {{pop pop 0 moveto} exch kshow} bind def
/ita {/ang 15 def gsave [1 0 ang dup sin exch cos div 1 0 0] concat} def 
/mp {newpath /y exch def /x exch def} def
/side {[w .77 mul w .23 mul] .385 w mul sd w 0 l currentpoint t -144 r} def
/mr {mp x y w2 0 360 arc} def /m24 {mr s} def /m20 {mr f} def
/mb {mp x y w2 add m w2 neg 0 d 0 w neg d w 0 d 0 w d cl} def
/mt {mp x y w2 add m w2 neg w neg d w 0 d cl} def
/m21 {mb f} def /m25 {mb s} def /m22 {mt f} def /m26{mt s} def
/m23 {mp x y w2 sub m w2 w d w neg 0 d cl f} def
/m27 {mp x y w2 add m w3 neg w2 neg d w3 w2 neg d w3 w2 d cl s} def
/m28 {mp x w2 sub y w2 sub w3 add m w3 0 d  0 w3 neg d w3 0 d 0 w3 d w3 0 d  0 w3 d w3 neg 0 d 0 w3 d w3 neg 0 d 0 w3 neg d w3 neg 0 d cl s } def
/m29 {mp gsave x w2 sub y w2 add w3 sub m currentpoint t 4 {side} repeat cl fill gr} def
/m30 {mp gsave x w2 sub y w2 add w3 sub m currentpoint t 4 {side} repeat cl s gr} def
/m31 {mp x y w2 sub m 0 w d x w2 sub y m w 0 d x w2 sub y w2 add m w w neg d x w2 sub y w2 sub m w w d s} def
/m32 {mp x y w2 sub m w2 w d w neg 0 d cl s} def
/m33 {mp x y w2 add m w3 neg w2 neg d w3 w2 neg d w3 w2 d cl f} def
/m34 {mp x w2 sub y w2 sub w3 add m w3 0 d  0 w3 neg d w3 0 d 0 w3 d w3 0 d  0 w3 d w3 neg 0 d 0 w3 d w3 neg 0 d 0 w3 neg d w3 neg 0 d cl f } def
/m2 {mp x y w2 sub m 0 w d x w2 sub y m w 0 d s} def
/m5 {mp x w2 sub y w2 sub m w w d x w2 sub y w2 add m w w neg d s} def
/reEncode {exch findfont dup length dict begin {1 index /FID eq  {pop pop} {def} ifelse } forall /Encoding exch def currentdict end dup /FontName get exch definefont pop } def [/Times-Bold /Times-Italic /Times-BoldItalic /Helvetica /Helvetica-Oblique
 /Helvetica-Bold /Helvetica-BoldOblique /Courier /Courier-Oblique /Courier-Bold /Courier-BoldOblique /Times-Roman /AvantGarde-Book /AvantGarde-BookOblique /AvantGarde-Demi /AvantGarde-DemiOblique /Bookman-Demi /Bookman-DemiItalic /Bookman-Light
 /Bookman-LightItalic /Helvetica-Narrow /Helvetica-Narrow-Bold /Helvetica-Narrow-BoldOblique /Helvetica-Narrow-Oblique /NewCenturySchlbk-Roman /NewCenturySchlbk-Bold /NewCenturySchlbk-BoldItalic /NewCenturySchlbk-Italic /Palatino-Bold
 /Palatino-BoldItalic /Palatino-Italic /Palatino-Roman ] {ISOLatin1Encoding reEncode } forall%%EndProlog
%%BeginSetup
%%EndSetup
newpath  gsave  .25 .25 scale  gsave  0 0 t black[  ] 0 sd 3 lw 1 1 1 c 2268 1448 0 0 bf black 1 1 1 c 1814 1158 227 145 bf black 1814 1158 227 145 bl 1 1 1 c 1814 1158 227 145 bf black 1814 1158 227 145 bl 0.8 0 0 c[  12 12 ] 0 sd 6 lw 1 1 1 c black
 0.8 0 0 c 227 1167 m 139 X -247 Y 140 X -213 Y 139 X -161 Y 140 X -119 Y 140 X -79 Y 139 X -60 Y 140 X -45 Y 139 X -32 Y 140 X -21 Y 139 X -17 Y 140 X -9 Y 139 X -6 Y 140 X s black[  ] 0 sd 3 lw 227 145 m 1814 X s
 gsave  2268 1448 0 0 C 1870.36 32.9021 t 0 r /Helvetica findfont 60.7424 sf 0 0 m ( [GeV]) show NC gr 
 gsave  2268 1448 0 0 C 1850.11 15.1856 t 0 r /Helvetica findfont 40.4949 sf 0 0 m (jj) show NC gr 
 gsave  2268 1448 0 0 C 1802.02 32.9021 t 0 r /Helvetica findfont 60.7424 sf 0 0 m (m) show NC gr  227 180 m -35 Y s 275 162 m -17 Y s 322 162 m -17 Y s 370 162 m -17 Y s 418 180 m -35 Y s 465 162 m -17 Y s 513 162 m -17 Y s 561 162 m -17 Y s 609 180
 m -35 Y s 656 162 m -17 Y s 704 162 m -17 Y s 752 162 m -17 Y s 800 180 m -35 Y s 847 162 m -17 Y s 895 162 m -17 Y s 943 162 m -17 Y s 991 180 m -35 Y s 1038 162 m -17 Y s 1086 162 m -17 Y s 1134 162 m -17 Y s 1182 180 m -35 Y s 1229 162 m -17 Y s
 1277 162 m -17 Y s 1325 162 m -17 Y s 1373 180 m -35 Y s 1420 162 m -17 Y s 1468 162 m -17 Y s 1516 162 m -17 Y s 1564 180 m -35 Y s 1611 162 m -17 Y s 1659 162 m -17 Y s 1707 162 m -17 Y s 1754 180 m -35 Y s 1802 162 m -17 Y s 1850 162 m -17 Y s
 1898 162 m -17 Y s 1945 180 m -35 Y s 1945 180 m -35 Y s 1993 162 m -17 Y s
 gsave  2268 1448 0 0 C 179.696 93.6445 t 0 r /Helvetica findfont 53.1496 sf 0 0 m (600) show NC gr 
 gsave  2268 1448 0 0 C 372.047 93.6445 t 0 r /Helvetica findfont 53.1496 sf 0 0 m (800) show NC gr 
 gsave  2268 1448 0 0 C 549.213 93.6445 t 0 r /Helvetica findfont 53.1496 sf 0 0 m (1000) show NC gr 
 gsave  2268 1448 0 0 C 739.033 93.6445 t 0 r /Helvetica findfont 53.1496 sf 0 0 m (1200) show NC gr 
 gsave  2268 1448 0 0 C 931.384 93.6445 t 0 r /Helvetica findfont 53.1496 sf 0 0 m (1400) show NC gr 
 gsave  2268 1448 0 0 C 1121.2 93.6445 t 0 r /Helvetica findfont 53.1496 sf 0 0 m (1600) show NC gr 
 gsave  2268 1448 0 0 C 1313.55 93.6445 t 0 r /Helvetica findfont 53.1496 sf 0 0 m (1800) show NC gr 
 gsave  2268 1448 0 0 C 1503.37 93.6445 t 0 r /Helvetica findfont 53.1496 sf 0 0 m (2000) show NC gr 
 gsave  2268 1448 0 0 C 1695.73 93.6445 t 0 r /Helvetica findfont 53.1496 sf 0 0 m (2200) show NC gr 
 gsave  2268 1448 0 0 C 1885.55 93.6445 t 0 r /Helvetica findfont 53.1496 sf 0 0 m (2400) show NC gr  227 145 m 1158 Y s
 gsave  2268 1448 0 0 C 118.954 1065.52 t 90 r /Helvetica findfont 60.7424 sf 0 0 m ( [fb/GeV]) show NC gr 
 gsave  2268 1448 0 0 C 141.732 1045.28 t 90 r /Helvetica findfont 40.4949 sf 0 0 m (jj) show NC gr 
 gsave  2268 1448 0 0 C 118.954 946.569 t 90 r /Helvetica findfont 60.7424 sf 0 0 m (/dm) show NC gr 
 gsave  2268 1448 0 0 C 118.954 908.605 t 90 r /Symbol findfont 60.7424 sf 0 0 m (s) show NC gr 
 gsave  2268 1448 0 0 C 118.954 878.234 t 90 r /Helvetica findfont 60.7424 sf 0 0 m (d) show NC gr  281 145 m -54 X s 254 187 m -27 X s 254 229 m -27 X s 254 271 m -27 X s 254 313 m -27 X s 281 355 m -54 X s 254 397 m -27 X s 254 440 m -27 X s 254
 482 m -27 X s 254 524 m -27 X s 281 566 m -54 X s 254 608 m -27 X s 254 650 m -27 X s 254 692 m -27 X s 254 734 m -27 X s 281 776 m -54 X s 254 819 m -27 X s 254 861 m -27 X s 254 903 m -27 X s 254 945 m -27 X s 281 987 m -54 X s 254 1029 m -27 X s
 254 1071 m -27 X s 254 1113 m -27 X s 254 1156 m -27 X s 281 1198 m -54 X s 281 1198 m -54 X s 254 1240 m -27 X s 254 1282 m -27 X s
 gsave  2268 1448 0 0 C 187.289 126.547 t 0 r /Helvetica findfont 53.1496 sf 0 0 m (0) show NC gr 
 gsave  2268 1448 0 0 C 149.325 336.614 t 0 r /Helvetica findfont 53.1496 sf 0 0 m (0.1) show NC gr 
 gsave  2268 1448 0 0 C 141.732 546.682 t 0 r /Helvetica findfont 53.1496 sf 0 0 m (0.2) show NC gr 
 gsave  2268 1448 0 0 C 141.732 756.749 t 0 r /Helvetica findfont 53.1496 sf 0 0 m (0.3) show NC gr 
 gsave  2268 1448 0 0 C 141.732 966.817 t 0 r /Helvetica findfont 53.1496 sf 0 0 m (0.4) show NC gr 
 gsave  2268 1448 0 0 C 141.732 1179.42 t 0 r /Helvetica findfont 53.1496 sf 0 0 m (0.5) show NC gr  0.4 0.4 0.8 c 6 lw 1 1 1 c black 0.4 0.4 0.8 c 227 1195 m 139 X -234 Y 140 X -215 Y 139 X -159 Y 140 X -128 Y 140 X -83 Y 139 X -70 Y 140 X -57 Y 139
 X -21 Y 140 X -33 Y 139 X -15 Y 140 X -15 Y 139 X -1 Y 140 X s 0 0.8 0 c[ 20 12 4 12] 0 sd 1 1 1 c black 0 0.8 0 c 227 1156 m 139 X -241 Y 140 X -220 Y 139 X -151 Y 140 X -116 Y 140 X -79 Y 139 X -59 Y 140 X -46 Y 139 X -35 Y 140 X -19 Y 139 X -16 Y
 140 X -10 Y 139 X -6 Y 140 X s black
 gsave  2268 1448 0 0 C 2095.61 820.023 t 90 r /Helvetica-BoldOblique findfont 40.4949 sf 0 0 m 
 447 428 405 383 371 340 302 290 263 236 225 198 166 135 124 94 83 54 25
(LHC HIGGS XS WG 2011) K NC gr 
 gsave  2268 1448 0 0 C 1546.4 1214.85 t 0 r /Helvetica findfont 43.0259 sf 0 0 m (POWHEG NLO) show NC gr  0.4 0.4 0.8 c[  ] 0 sd 1389 1231 m 131 X s black
 gsave  2268 1448 0 0 C 1546.4 1126.27 t 0 r /Helvetica findfont 43.0259 sf 0 0 m (POWHEG + PYTHIA) show NC gr  0.8 0 0 c[  12 12 ] 0 sd 1389 1144 m 131 X s black
 gsave  2268 1448 0 0 C 1546.4 1040.21 t 0 r /Helvetica findfont 43.0259 sf 0 0 m 
 383 372 332 302 273 243 231 206 194 161 132 102 62 29
(POWHEG + HERWIG) K NC gr  0 0.8 0 c[ 20 12 4 12] 0 sd 1389 1057 m 131 X s
 gr  gr showpage
end
%%EOF
