%!PS-Adobe-2.0 EPSF-2.0
%%BoundingBox:  0 0 567 310
%%Title: /home/shiki/Desktop/MCFM/YR/CUT3/CUT3_CT10vsMSTW_LHC.eps: Higgs Cross Section
%%Creator: ROOT Version 5.28/00
%%CreationDate: Tue Nov 22 18:42:31 2011
%%EndComments
%%BeginProlog
80 dict begin
/s {stroke} def /l {lineto} def /m {moveto} def /t {translate} def
/r {rotate} def /rl {roll}  def /R {repeat} def
/d {rlineto} def /rm {rmoveto} def /gr {grestore} def /f {eofill} def
/c {setrgbcolor} def /black {0 setgray} def /sd {setdash} def
/cl {closepath} def /sf {scalefont setfont} def /lw {setlinewidth} def
/box {m dup 0 exch d exch 0 d 0 exch neg d cl} def
/NC{systemdict begin initclip end}def/C{NC box clip newpath}def
/bl {box s} def /bf {box f} def /Y { 0 exch d} def /X { 0 d} def 
/K {{pop pop 0 moveto} exch kshow} bind def
/ita {/ang 15 def gsave [1 0 ang dup sin exch cos div 1 0 0] concat} def 
/mp {newpath /y exch def /x exch def} def
/side {[w .77 mul w .23 mul] .385 w mul sd w 0 l currentpoint t -144 r} def
/mr {mp x y w2 0 360 arc} def /m24 {mr s} def /m20 {mr f} def
/mb {mp x y w2 add m w2 neg 0 d 0 w neg d w 0 d 0 w d cl} def
/mt {mp x y w2 add m w2 neg w neg d w 0 d cl} def
/m21 {mb f} def /m25 {mb s} def /m22 {mt f} def /m26{mt s} def
/m23 {mp x y w2 sub m w2 w d w neg 0 d cl f} def
/m27 {mp x y w2 add m w3 neg w2 neg d w3 w2 neg d w3 w2 d cl s} def
/m28 {mp x w2 sub y w2 sub w3 add m w3 0 d  0 w3 neg d w3 0 d 0 w3 d w3 0 d  0 w3 d w3 neg 0 d 0 w3 d w3 neg 0 d 0 w3 neg d w3 neg 0 d cl s } def
/m29 {mp gsave x w2 sub y w2 add w3 sub m currentpoint t 4 {side} repeat cl fill gr} def
/m30 {mp gsave x w2 sub y w2 add w3 sub m currentpoint t 4 {side} repeat cl s gr} def
/m31 {mp x y w2 sub m 0 w d x w2 sub y m w 0 d x w2 sub y w2 add m w w neg d x w2 sub y w2 sub m w w d s} def
/m32 {mp x y w2 sub m w2 w d w neg 0 d cl s} def
/m33 {mp x y w2 add m w3 neg w2 neg d w3 w2 neg d w3 w2 d cl f} def
/m34 {mp x w2 sub y w2 sub w3 add m w3 0 d  0 w3 neg d w3 0 d 0 w3 d w3 0 d  0 w3 d w3 neg 0 d 0 w3 d w3 neg 0 d 0 w3 neg d w3 neg 0 d cl f } def
/m2 {mp x y w2 sub m 0 w d x w2 sub y m w 0 d s} def
/m5 {mp x w2 sub y w2 sub m w w d x w2 sub y w2 add m w w neg d s} def
/reEncode {exch findfont dup length dict begin {1 index /FID eq  {pop pop} {def} ifelse } forall /Encoding exch def currentdict end dup /FontName get exch definefont pop } def [/Times-Bold /Times-Italic /Times-BoldItalic /Helvetica /Helvetica-Oblique
 /Helvetica-Bold /Helvetica-BoldOblique /Courier /Courier-Oblique /Courier-Bold /Courier-BoldOblique /Times-Roman /AvantGarde-Book /AvantGarde-BookOblique /AvantGarde-Demi /AvantGarde-DemiOblique /Bookman-Demi /Bookman-DemiItalic /Bookman-Light
 /Bookman-LightItalic /Helvetica-Narrow /Helvetica-Narrow-Bold /Helvetica-Narrow-BoldOblique /Helvetica-Narrow-Oblique /NewCenturySchlbk-Roman /NewCenturySchlbk-Bold /NewCenturySchlbk-BoldItalic /NewCenturySchlbk-Italic /Palatino-Bold
 /Palatino-BoldItalic /Palatino-Italic /Palatino-Roman ] {ISOLatin1Encoding reEncode } forall%%EndProlog
%%BeginSetup
%%EndSetup
newpath  gsave  .25 .25 scale  gsave  0 0 t black[  ] 0 sd 3 lw 1 1 1 c 2268 1239 0 0 bf black 1 1 1 c 1088 1214 23 12 bf black 1 1 1 c 860 959 197 207 bf black 860 959 197 207 bl 1 1 1 c 860 959 197 207 bf black 860 959 197 207 bl 6 lw 1 1 1 c black
 197 207 m 860 X s 3 lw 197 207 m 860 X s
 gsave  1088 1214 23 12 C 942.688 103.062 t 0 r /Helvetica findfont 40.9078 sf 0 0 m ( [GeV]) show NC gr 
 gsave  1088 1214 23 12 C 923.125 92.375 t 0 r /Helvetica findfont 26.679 sf 0 0 m (4l) show NC gr 
 gsave  1088 1214 23 12 C 891.125 103.062 t 0 r /Helvetica findfont 40.9078 sf 0 0 m (M) show NC gr  197 235 m -28 Y s 216 221 m -14 Y s 235 221 m -14 Y s 254 221 m -14 Y s 273 221 m -14 Y s 292 235 m -28 Y s 311 221 m -14 Y s 331 221 m -14 Y s 350
 221 m -14 Y s 369 221 m -14 Y s 388 235 m -28 Y s 407 221 m -14 Y s 426 221 m -14 Y s 445 221 m -14 Y s 464 221 m -14 Y s 483 235 m -28 Y s 503 221 m -14 Y s 522 221 m -14 Y s 541 221 m -14 Y s 560 221 m -14 Y s 579 235 m -28 Y s 598 221 m -14 Y s
 617 221 m -14 Y s 636 221 m -14 Y s 655 221 m -14 Y s 675 235 m -28 Y s 694 221 m -14 Y s 713 221 m -14 Y s 732 221 m -14 Y s 751 221 m -14 Y s 770 235 m -28 Y s 789 221 m -14 Y s 808 221 m -14 Y s 827 221 m -14 Y s 847 221 m -14 Y s 866 235 m -28 Y
 s 885 221 m -14 Y s 904 221 m -14 Y s 923 221 m -14 Y s 942 221 m -14 Y s 961 235 m -28 Y s 980 221 m -14 Y s 999 221 m -14 Y s 1019 221 m -14 Y s 1038 221 m -14 Y s 1057 235 m -28 Y s
 gsave  1088 1214 23 12 C 162.5 161.688 t 0 r /Helvetica findfont 40.9078 sf 0 0 m (150) show NC gr 
 gsave  1088 1214 23 12 C 258.438 161.688 t 0 r /Helvetica findfont 40.9078 sf 0 0 m (200) show NC gr 
 gsave  1088 1214 23 12 C 354.438 161.688 t 0 r /Helvetica findfont 40.9078 sf 0 0 m (250) show NC gr 
 gsave  1088 1214 23 12 C 450.375 161.688 t 0 r /Helvetica findfont 40.9078 sf 0 0 m (300) show NC gr 
 gsave  1088 1214 23 12 C 544.562 161.688 t 0 r /Helvetica findfont 40.9078 sf 0 0 m (350) show NC gr 
 gsave  1088 1214 23 12 C 640.562 161.688 t 0 r /Helvetica findfont 40.9078 sf 0 0 m (400) show NC gr 
 gsave  1088 1214 23 12 C 736.5 161.688 t 0 r /Helvetica findfont 40.9078 sf 0 0 m (450) show NC gr 
 gsave  1088 1214 23 12 C 832.5 161.688 t 0 r /Helvetica findfont 40.9078 sf 0 0 m (500) show NC gr 
 gsave  1088 1214 23 12 C 926.688 161.688 t 0 r /Helvetica findfont 40.9078 sf 0 0 m (550) show NC gr 
 gsave  1088 1214 23 12 C 1022.62 161.688 t 0 r /Helvetica findfont 40.9078 sf 0 0 m (600) show NC gr  197 1166 m 860 X s 197 1137 m 29 Y s 216 1151 m 15 Y s 235 1151 m 15 Y s 254 1151 m 15 Y s 273 1151 m 15 Y s 292 1137 m 29 Y s 311 1151 m 15 Y s
 331 1151 m 15 Y s 350 1151 m 15 Y s 369 1151 m 15 Y s 388 1137 m 29 Y s 407 1151 m 15 Y s 426 1151 m 15 Y s 445 1151 m 15 Y s 464 1151 m 15 Y s 483 1137 m 29 Y s 503 1151 m 15 Y s 522 1151 m 15 Y s 541 1151 m 15 Y s 560 1151 m 15 Y s 579 1137 m 29 Y
 s 598 1151 m 15 Y s 617 1151 m 15 Y s 636 1151 m 15 Y s 655 1151 m 15 Y s 675 1137 m 29 Y s 694 1151 m 15 Y s 713 1151 m 15 Y s 732 1151 m 15 Y s 751 1151 m 15 Y s 770 1137 m 29 Y s 789 1151 m 15 Y s 808 1151 m 15 Y s 827 1151 m 15 Y s 847 1151 m 15
 Y s 866 1137 m 29 Y s 885 1151 m 15 Y s 904 1151 m 15 Y s 923 1151 m 15 Y s 942 1151 m 15 Y s 961 1137 m 29 Y s 980 1151 m 15 Y s 999 1151 m 15 Y s 1019 1151 m 15 Y s 1038 1151 m 15 Y s 1057 1137 m 29 Y s 197 207 m 959 Y s
 gsave  1088 1214 23 12 C 102.062 1140.88 t 90 r /Helvetica findfont 40.9078 sf 0 0 m ( \)) show NC gr 
 gsave  1088 1214 23 12 C 82.5 1123.06 t 90 r /Helvetica findfont 26.679 sf 0 0 m (\2551) show NC gr 
 gsave  1088 1214 23 12 C 102.062 490.438 t 90 r /Helvetica findfont 40.9078 sf 0 0 m (Events/10GeV \( Normalized to 1 fb) show NC gr  210 207 m -13 X s 210 230 m -13 X s 210 249 m -13 X s 210 266 m -13 X s 210 281 m -13 X s 223 294 m -26 X s
 gsave  1088 1214 23 12 C 164.25 295 t 0 r /Helvetica findfont 26.679 sf 0 0 m (\2552) show NC gr 
 gsave  1088 1214 23 12 C 119.812 275.438 t 0 r /Helvetica findfont 40.9078 sf 0 0 m (10) show NC gr  210 382 m -13 X s 210 433 m -13 X s 210 469 m -13 X s 210 497 m -13 X s 210 520 m -13 X s 210 540 m -13 X s 210 556 m -13 X s 210 571 m -13 X s 223
 585 m -26 X s
 gsave  1088 1214 23 12 C 167.812 584.688 t 0 r /Helvetica findfont 26.679 sf 0 0 m (\2551) show NC gr 
 gsave  1088 1214 23 12 C 123.375 565.125 t 0 r /Helvetica findfont 40.9078 sf 0 0 m (10) show NC gr  210 672 m -13 X s 210 723 m -13 X s 210 760 m -13 X s 210 788 m -13 X s 210 811 m -13 X s 210 830 m -13 X s 210 847 m -13 X s 210 862 m -13 X s 223
 875 m -26 X s
 gsave  1088 1214 23 12 C 188.688 857.938 t 0 r  -22 0 t /Helvetica findfont 40.9078 sf 0 0 m (1) show NC gr  210 963 m -13 X s 210 1014 m -13 X s 210 1050 m -13 X s 210 1078 m -13 X s 210 1101 m -13 X s 210 1121 m -13 X s 210 1137 m -13 X s 210 1152
 m -13 X s 223 1166 m -26 X s
 gsave  1088 1214 23 12 C 188.688 1148.44 t 0 r  -45 0 t /Helvetica findfont 40.9078 sf 0 0 m (10) show NC gr  1057 207 m 959 Y s 1044 207 m 13 X s 1044 230 m 13 X s 1044 249 m 13 X s 1044 266 m 13 X s 1044 281 m 13 X s 1031 294 m 26 X s 1044 382 m
 13 X s 1044 433 m 13 X s 1044 469 m 13 X s 1044 497 m 13 X s 1044 520 m 13 X s 1044 540 m 13 X s 1044 556 m 13 X s 1044 571 m 13 X s 1031 585 m 26 X s 1044 672 m 13 X s 1044 723 m 13 X s 1044 760 m 13 X s 1044 788 m 13 X s 1044 811 m 13 X s 1044 830
 m 13 X s 1044 847 m 13 X s 1044 862 m 13 X s 1031 875 m 26 X s 1044 963 m 13 X s 1044 1014 m 13 X s 1044 1050 m 13 X s 1044 1078 m 13 X s 1044 1101 m 13 X s 1044 1121 m 13 X s 1044 1137 m 13 X s 1044 1152 m 13 X s 1031 1166 m 26 X s 6 lw 1 1 1 c 0 0
 1 c 3 lw /w 14 def /w2 {w 2 div} def /w3 {w 3 div} def 206 293 226 456 245 596 264 832 283 903 302 903 321 891 340 873 359 854 378 838 397 818 417 798 436 779 455 765 474 745 493 731 512 715 531 697 550 681 569 668 589 655 608 638 627 625 646 615
 665 600 684 585 703 574 722 561 741 553 761 541 780 529 799 517 818 500 837 497 856 489 875 462 894 466 913 454 933 445 952 433 971 416 990 402 1009 408 1028 389 1047 390 45 { m24} R 6 lw black 1 1 1 c 0.35 0.83 0.33 c 3 lw 226 375 245 507 264 738
 283 808 302 810 321 797 340 782 359 762 378 744 397 726 417 708 436 689 455 672 474 655 493 637 512 626 531 608 550 591 569 576 589 563 608 546 627 528 646 518 665 507 684 496 703 481 722 474 741 455 761 443 780 426 799 416 818 414 837 399 856 389
 875 383 894 369 913 365 933 352 952 337 971 332 990 317 1009 312 1028 309 1047 289 44 { m26} R 6 lw black 1 1 1 c 1 0 1 c 3 lw 226 377 245 513 264 745 283 814 302 817 321 806 340 788 359 767 378 750 397 732 417 713 436 695 455 677 474 659 493 643
 512 630 531 610 550 597 569 586 589 564 608 553 627 538 646 521 665 510 684 494 703 487 722 476 741 461 761 456 780 431 799 425 818 419 837 405 856 394 875 382 894 373 913 357 933 345 952 342 971 326 990 325 1009 305 1028 295 1047 297 44 { m22} R 6
 lw black 1 1 1 c 1 0 0 c 3 lw 206 290 226 453 245 593 264 829 283 901 302 900 321 889 340 871 359 852 378 836 397 815 417 795 436 776 455 763 474 743 493 728 512 712 531 694 550 678 569 665 589 653 608 636 627 623 646 613 665 597 684 582 703 571 722
 558 741 550 761 538 780 526 799 515 818 498 837 494 856 486 875 459 894 463 913 451 933 442 952 431 971 414 990 399 1009 405 1028 387 1047 387 45 { m20} R 6 lw black
 gsave  1088 1214 23 12 C 324.188 1082.19 t 0 r /Helvetica findfont 51.5794 sf 0 0 m 
 139 111 85 72 44 30
(= 7 TeV) K NC gr 
 gsave  1088 1214 23 12 C 299.312 1082.19 t 0 r /Helvetica findfont 51.5794 sf 0 0 m (s) show NC gr  265 1111 m 23 -30 d s 0 lw 288 1081 m 5 44 d s 293 1125 m 30 X s
 gsave  1088 1214 23 12 C 1100.81 813.938 t 90 r /Helvetica-BoldOblique findfont 30.2362 sf 0 0 m 
 336 321 304 287 279 255 226 218 198 177 169 148 125 101 93 71 62 40 18
(LHC HIGGS XS WG 2011) K NC gr  3 lw 1 1 1 c 430 244 533 794 bf black 544 794 m -7 Y 426 X 240 Y -7 X -233 Y f 533 794 m 244 Y 430 X -244 Y -430 X cl s
 gsave  1088 1214 23 12 C 811.188 1009.38 t 0 r /Helvetica findfont 23.1218 sf 0 0 m (<120GeV) show NC gr 
 gsave  1088 1214 23 12 C 795.188 1000.44 t 0 r /Helvetica findfont 14.2288 sf 0 0 m (Z2) show NC gr 
 gsave  1088 1214 23 12 C 757.812 1009.38 t 0 r /Helvetica findfont 23.1218 sf 0 0 m ( , M) show NC gr 
 gsave  1088 1214 23 12 C 743.625 1002.25 t 0 r /Helvetica findfont 14.2288 sf 0 0 m (Z1) show NC gr 
 gsave  1088 1214 23 12 C 640.562 1009.38 t 0 r /Helvetica findfont 23.1218 sf 0 0 m (60GeV<M) show NC gr  0.999 0.999 0.999 c black
 gsave  1088 1214 23 12 C 640.562 956.062 t 0 r /Helvetica findfont 23.1218 sf 0 0 m (MSTW POWHEG 2e2mu) show NC gr  0 0 1 c 587 965 m24 black
 gsave  1088 1214 23 12 C 640.562 908.062 t 0 r /Helvetica findfont 23.1218 sf 0 0 m (CT10 POWHEG 2e2mu) show NC gr  1 0 0 c 587 916 m20 black
 gsave  1088 1214 23 12 C 640.562 860.062 t 0 r /Helvetica findfont 23.1218 sf 0 0 m (MSTW POWHEG 4e) show NC gr  0.35 0.83 0.33 c 587 867 m26 black
 gsave  1088 1214 23 12 C 640.562 810.375 t 0 r /Helvetica findfont 23.1218 sf 0 0 m (CT10 POWHEG 4e) show NC gr  1 0 1 c 587 819 m22 black 1 1 1 c 1088 1214 1157 12 bf black 1 1 1 c 860 959 1331 207 bf black 860 959 1331 207 bl 1 1 1 c 860 959 1331
 207 bf black 860 959 1331 207 bl 6 lw 1 1 1 c black 1331 207 m 860 X s 3 lw 1331 207 m 860 X s
 gsave  1088 1214 1157 12 C 2075.75 103.5 t 0 r /Helvetica findfont 40.9078 sf 0 0 m ( [GeV]) show NC gr 
 gsave  1088 1214 1157 12 C 2056.19 92.8125 t 0 r /Helvetica findfont 26.679 sf 0 0 m (4l) show NC gr 
 gsave  1088 1214 1157 12 C 2024.19 103.5 t 0 r /Helvetica findfont 40.9078 sf 0 0 m (M) show NC gr  1331 235 m -28 Y s 1350 221 m -14 Y s 1369 221 m -14 Y s 1388 221 m -14 Y s 1407 221 m -14 Y s 1426 235 m -28 Y s 1445 221 m -14 Y s 1464 221 m -14 Y
 s 1484 221 m -14 Y s 1503 221 m -14 Y s 1522 235 m -28 Y s 1541 221 m -14 Y s 1560 221 m -14 Y s 1579 221 m -14 Y s 1598 221 m -14 Y s 1617 235 m -28 Y s 1636 221 m -14 Y s 1656 221 m -14 Y s 1675 221 m -14 Y s 1694 221 m -14 Y s 1713 235 m -28 Y s
 1732 221 m -14 Y s 1751 221 m -14 Y s 1770 221 m -14 Y s 1789 221 m -14 Y s 1808 235 m -28 Y s 1828 221 m -14 Y s 1847 221 m -14 Y s 1866 221 m -14 Y s 1885 221 m -14 Y s 1904 235 m -28 Y s 1923 221 m -14 Y s 1942 221 m -14 Y s 1961 221 m -14 Y s
 1980 221 m -14 Y s 2000 235 m -28 Y s 2019 221 m -14 Y s 2038 221 m -14 Y s 2057 221 m -14 Y s 2076 221 m -14 Y s 2095 235 m -28 Y s 2114 221 m -14 Y s 2133 221 m -14 Y s 2152 221 m -14 Y s 2172 221 m -14 Y s 2191 235 m -28 Y s
 gsave  1088 1214 1157 12 C 1295.5 162.125 t 0 r /Helvetica findfont 40.9078 sf 0 0 m (150) show NC gr 
 gsave  1088 1214 1157 12 C 1391.5 162.125 t 0 r /Helvetica findfont 40.9078 sf 0 0 m (200) show NC gr 
 gsave  1088 1214 1157 12 C 1487.5 162.125 t 0 r /Helvetica findfont 40.9078 sf 0 0 m (250) show NC gr 
 gsave  1088 1214 1157 12 C 1583.44 162.125 t 0 r /Helvetica findfont 40.9078 sf 0 0 m (300) show NC gr 
 gsave  1088 1214 1157 12 C 1677.62 162.125 t 0 r /Helvetica findfont 40.9078 sf 0 0 m (350) show NC gr 
 gsave  1088 1214 1157 12 C 1773.62 162.125 t 0 r /Helvetica findfont 40.9078 sf 0 0 m (400) show NC gr 
 gsave  1088 1214 1157 12 C 1869.56 162.125 t 0 r /Helvetica findfont 40.9078 sf 0 0 m (450) show NC gr 
 gsave  1088 1214 1157 12 C 1965.56 162.125 t 0 r /Helvetica findfont 40.9078 sf 0 0 m (500) show NC gr 
 gsave  1088 1214 1157 12 C 2059.75 162.125 t 0 r /Helvetica findfont 40.9078 sf 0 0 m (550) show NC gr 
 gsave  1088 1214 1157 12 C 2155.69 162.125 t 0 r /Helvetica findfont 40.9078 sf 0 0 m (600) show NC gr  1331 1166 m 860 X s 1331 1137 m 29 Y s 1350 1151 m 15 Y s 1369 1151 m 15 Y s 1388 1151 m 15 Y s 1407 1151 m 15 Y s 1426 1137 m 29 Y s 1445 1151 m
 15 Y s 1464 1151 m 15 Y s 1484 1151 m 15 Y s 1503 1151 m 15 Y s 1522 1137 m 29 Y s 1541 1151 m 15 Y s 1560 1151 m 15 Y s 1579 1151 m 15 Y s 1598 1151 m 15 Y s 1617 1137 m 29 Y s 1636 1151 m 15 Y s 1656 1151 m 15 Y s 1675 1151 m 15 Y s 1694 1151 m 15
 Y s 1713 1137 m 29 Y s 1732 1151 m 15 Y s 1751 1151 m 15 Y s 1770 1151 m 15 Y s 1789 1151 m 15 Y s 1808 1137 m 29 Y s 1828 1151 m 15 Y s 1847 1151 m 15 Y s 1866 1151 m 15 Y s 1885 1151 m 15 Y s 1904 1137 m 29 Y s 1923 1151 m 15 Y s 1942 1151 m 15 Y
 s 1961 1151 m 15 Y s 1980 1151 m 15 Y s 2000 1137 m 29 Y s 2019 1151 m 15 Y s 2038 1151 m 15 Y s 2057 1151 m 15 Y s 2076 1151 m 15 Y s 2095 1137 m 29 Y s 2114 1151 m 15 Y s 2133 1151 m 15 Y s 2152 1151 m 15 Y s 2172 1151 m 15 Y s 2191 1137 m 29 Y s
 1331 207 m 959 Y s
 gsave  1088 1214 1157 12 C 1240.44 1086.25 t 90 r /Helvetica findfont 26.679 sf 0 0 m (2e2mu) show NC gr 
 gsave  1088 1214 1157 12 C 1228 1061.38 t 90 r /Symbol findfont 40.9078 sf 0 0 m (s) show NC gr 
 gsave  1088 1214 1157 12 C 1228 1048.94 t 90 r /Helvetica findfont 40.9078 sf 0 0 m (/) show NC gr 
 gsave  1088 1214 1157 12 C 1240.44 1018.69 t 90 r /Helvetica findfont 26.679 sf 0 0 m (4e) show NC gr 
 gsave  1088 1214 1157 12 C 1228 993.812 t 90 r /Symbol findfont 40.9078 sf 0 0 m (s) show NC gr 
 gsave  1088 1214 1157 12 C 1228 888.938 t 90 r /Helvetica findfont 40.9078 sf 0 0 m (Ratio ) show NC gr  1356 207 m -25 X s 1344 234 m -13 X s 1344 261 m -13 X s 1344 289 m -13 X s 1344 316 m -13 X s 1356 344 m -25 X s 1344 371 m -13 X s 1344 398 m
 -13 X s 1344 426 m -13 X s 1344 453 m -13 X s 1356 481 m -25 X s 1344 508 m -13 X s 1344 535 m -13 X s 1344 563 m -13 X s 1344 590 m -13 X s 1356 618 m -25 X s 1344 645 m -13 X s 1344 672 m -13 X s 1344 700 m -13 X s 1344 727 m -13 X s 1356 755 m
 -25 X s 1344 782 m -13 X s 1344 809 m -13 X s 1344 837 m -13 X s 1344 864 m -13 X s 1356 892 m -25 X s 1344 919 m -13 X s 1344 946 m -13 X s 1344 974 m -13 X s 1344 1001 m -13 X s 1356 1029 m -25 X s 1344 1056 m -13 X s 1344 1083 m -13 X s 1344 1111
 m -13 X s 1344 1138 m -13 X s 1356 1166 m -25 X s 1356 1166 m -25 X s
 gsave  1088 1214 1157 12 C 1302.62 192.375 t 0 r /Helvetica findfont 40.9078 sf 0 0 m (0) show NC gr 
 gsave  1088 1214 1157 12 C 1274.19 329.125 t 0 r /Helvetica findfont 40.9078 sf 0 0 m (0.1) show NC gr 
 gsave  1088 1214 1157 12 C 1268.88 466 t 0 r /Helvetica findfont 40.9078 sf 0 0 m (0.2) show NC gr 
 gsave  1088 1214 1157 12 C 1268.88 602.812 t 0 r /Helvetica findfont 40.9078 sf 0 0 m (0.3) show NC gr 
 gsave  1088 1214 1157 12 C 1268.88 739.688 t 0 r /Helvetica findfont 40.9078 sf 0 0 m (0.4) show NC gr 
 gsave  1088 1214 1157 12 C 1267.12 876.5 t 0 r /Helvetica findfont 40.9078 sf 0 0 m (0.5) show NC gr 
 gsave  1088 1214 1157 12 C 1268.88 1013.38 t 0 r /Helvetica findfont 40.9078 sf 0 0 m (0.6) show NC gr 
 gsave  1088 1214 1157 12 C 1268.88 1150.19 t 0 r /Helvetica findfont 40.9078 sf 0 0 m (0.7) show NC gr  2191 207 m 959 Y s 2165 207 m 26 X s 2178 234 m 13 X s 2178 261 m 13 X s 2178 289 m 13 X s 2178 316 m 13 X s 2165 344 m 26 X s 2178 371 m 13 X s
 2178 398 m 13 X s 2178 426 m 13 X s 2178 453 m 13 X s 2165 481 m 26 X s 2178 508 m 13 X s 2178 535 m 13 X s 2178 563 m 13 X s 2178 590 m 13 X s 2165 618 m 26 X s 2178 645 m 13 X s 2178 672 m 13 X s 2178 700 m 13 X s 2178 727 m 13 X s 2165 755 m 26 X
 s 2178 782 m 13 X s 2178 809 m 13 X s 2178 837 m 13 X s 2178 864 m 13 X s 2165 892 m 26 X s 2178 919 m 13 X s 2178 946 m 13 X s 2178 974 m 13 X s 2178 1001 m 13 X s 2165 1029 m 26 X s 2178 1056 m 13 X s 2178 1083 m 13 X s 2178 1111 m 13 X s 2178
 1138 m 13 X s 2165 1166 m 26 X s 2165 1166 m 26 X s 6 lw 1 1 1 c 0 0 1 c 3 lw 1340 862 1359 927 1378 889 1398 859 1417 851 1436 864 1455 857 1474 868 1493 863 1512 857 1531 865 1550 875 1570 878 1589 863 1608 874 1627 856 1646 880 1665 885 1684 879
 1703 868 1722 864 1742 866 1761 842 1780 842 1799 864 1818 887 1837 862 1856 897 1875 834 1894 834 1914 816 1933 821 1952 897 1971 841 1990 827 2009 941 2028 844 2047 884 2066 861 2086 847 2105 906 2124 908 2143 846 2162 930 2181 824 45 { m24} R 6
 lw black 1 1 1 c 1 0 0 c 3 lw 1340 868 1359 958 1378 931 1398 912 1417 894 1436 915 1455 917 1474 919 1493 909 1512 902 1531 915 1550 918 1570 923 1589 903 1608 911 1627 902 1646 916 1665 909 1684 928 1703 939 1722 886 1742 918 1761 907 1780 870
 1799 893 1818 886 1837 910 1856 925 1875 879 1894 919 1914 850 1933 882 1952 941 1971 886 1990 866 2009 951 2028 878 2047 858 2066 841 2086 883 2105 889 2124 966 2143 827 2162 870 2181 877 45 { m20} R 6 lw 9 lw 0.95 0.95 0.95 c black 1 0 0 c 1335
 892 m 421 X s 1756 892 m 422 X s 2178 892 m 8 X s black
 gsave  1088 1214 1157 12 C 1478.56 1082.69 t 0 r /Helvetica findfont 51.5794 sf 0 0 m 
 139 110 85 72 44 30
(= 7 TeV) K NC gr 
 gsave  1088 1214 1157 12 C 1453.69 1082.69 t 0 r /Helvetica findfont 51.5794 sf 0 0 m (s) show NC gr  6 lw 1420 1111 m 23 -30 d s 0 lw 1443 1081 m 5 44 d s 1448 1125 m 31 X s
 gsave  1088 1214 1157 12 C 2233.88 814.312 t 90 r /Helvetica-BoldOblique findfont 30.2362 sf 0 0 m 
 336 321 304 287 279 255 226 218 198 177 169 148 125 101 93 71 62 40 18
(LHC HIGGS XS WG 2011) K NC gr  3 lw 1 1 1 c 521 127 1516 627 bf black 1527 627 m -7 Y 517 X 123 Y -7 X -116 Y f 1516 627 m 127 Y 521 X -127 Y -521 X cl s
 gsave  1088 1214 1157 12 C 1645.62 714.812 t 0 r /Helvetica findfont 19.5646 sf 0 0 m (MSTW POWHEG 4e / POWHEG 2e2mu) show NC gr  0 0 1 c 1581 722 m24 black
 gsave  1088 1214 1157 12 C 1645.62 650.812 t 0 r /Helvetica findfont 19.5646 sf 0 0 m (CT10 POWHEG 4e / POWHEG 2e2mu) show NC gr  1 0 0 c 1581 659 m20
 gr  gr showpage
end
%%EOF
