%!PS-Adobe-2.0 EPSF-2.0
%%BoundingBox:  0 0 567 310
%%Title: /home/shiki/lhchiggsstyle-v2/pdf+alphas1.eps: Higgs Cross Section
%%Creator: ROOT Version 5.28/00
%%CreationDate: Tue Nov 22 15:45:43 2011
%%EndComments
%%BeginProlog
80 dict begin
/s {stroke} def /l {lineto} def /m {moveto} def /t {translate} def
/r {rotate} def /rl {roll}  def /R {repeat} def
/d {rlineto} def /rm {rmoveto} def /gr {grestore} def /f {eofill} def
/c {setrgbcolor} def /black {0 setgray} def /sd {setdash} def
/cl {closepath} def /sf {scalefont setfont} def /lw {setlinewidth} def
/box {m dup 0 exch d exch 0 d 0 exch neg d cl} def
/NC{systemdict begin initclip end}def/C{NC box clip newpath}def
/bl {box s} def /bf {box f} def /Y { 0 exch d} def /X { 0 d} def 
/K {{pop pop 0 moveto} exch kshow} bind def
/ita {/ang 15 def gsave [1 0 ang dup sin exch cos div 1 0 0] concat} def 
/mp {newpath /y exch def /x exch def} def
/side {[w .77 mul w .23 mul] .385 w mul sd w 0 l currentpoint t -144 r} def
/mr {mp x y w2 0 360 arc} def /m24 {mr s} def /m20 {mr f} def
/mb {mp x y w2 add m w2 neg 0 d 0 w neg d w 0 d 0 w d cl} def
/mt {mp x y w2 add m w2 neg w neg d w 0 d cl} def
/m21 {mb f} def /m25 {mb s} def /m22 {mt f} def /m26{mt s} def
/m23 {mp x y w2 sub m w2 w d w neg 0 d cl f} def
/m27 {mp x y w2 add m w3 neg w2 neg d w3 w2 neg d w3 w2 d cl s} def
/m28 {mp x w2 sub y w2 sub w3 add m w3 0 d  0 w3 neg d w3 0 d 0 w3 d w3 0 d  0 w3 d w3 neg 0 d 0 w3 d w3 neg 0 d 0 w3 neg d w3 neg 0 d cl s } def
/m29 {mp gsave x w2 sub y w2 add w3 sub m currentpoint t 4 {side} repeat cl fill gr} def
/m30 {mp gsave x w2 sub y w2 add w3 sub m currentpoint t 4 {side} repeat cl s gr} def
/m31 {mp x y w2 sub m 0 w d x w2 sub y m w 0 d x w2 sub y w2 add m w w neg d x w2 sub y w2 sub m w w d s} def
/m32 {mp x y w2 sub m w2 w d w neg 0 d cl s} def
/m33 {mp x y w2 add m w3 neg w2 neg d w3 w2 neg d w3 w2 d cl f} def
/m34 {mp x w2 sub y w2 sub w3 add m w3 0 d  0 w3 neg d w3 0 d 0 w3 d w3 0 d  0 w3 d w3 neg 0 d 0 w3 d w3 neg 0 d 0 w3 neg d w3 neg 0 d cl f } def
/m2 {mp x y w2 sub m 0 w d x w2 sub y m w 0 d s} def
/m5 {mp x w2 sub y w2 sub m w w d x w2 sub y w2 add m w w neg d s} def
/reEncode {exch findfont dup length dict begin {1 index /FID eq  {pop pop} {def} ifelse } forall /Encoding exch def currentdict end dup /FontName get exch definefont pop } def [/Times-Bold /Times-Italic /Times-BoldItalic /Helvetica /Helvetica-Oblique
 /Helvetica-Bold /Helvetica-BoldOblique /Courier /Courier-Oblique /Courier-Bold /Courier-BoldOblique /Times-Roman /AvantGarde-Book /AvantGarde-BookOblique /AvantGarde-Demi /AvantGarde-DemiOblique /Bookman-Demi /Bookman-DemiItalic /Bookman-Light
 /Bookman-LightItalic /Helvetica-Narrow /Helvetica-Narrow-Bold /Helvetica-Narrow-BoldOblique /Helvetica-Narrow-Oblique /NewCenturySchlbk-Roman /NewCenturySchlbk-Bold /NewCenturySchlbk-BoldItalic /NewCenturySchlbk-Italic /Palatino-Bold
 /Palatino-BoldItalic /Palatino-Italic /Palatino-Roman ] {ISOLatin1Encoding reEncode } forall%%EndProlog
%%BeginSetup
%%EndSetup
newpath  gsave  .25 .25 scale  gsave  0 0 t black[  ] 0 sd 3 lw 1 1 1 c 2268 1239 0 0 bf black 1 1 1 c 1088 1214 23 12 bf black 1 1 1 c 860 959 197 207 bf black 860 959 197 207 bl 1 1 1 c 860 959 197 207 bf black 860 959 197 207 bl 6 lw 1 1 1 c black
 197 207 m 860 X s 3 lw 197 207 m 860 X s
 gsave  1088 1214 23 12 C 942.062 104.312 t 0 r /Helvetica findfont 40.9078 sf 0 0 m ( [GeV]) show NC gr 
 gsave  1088 1214 23 12 C 922.5 93.6875 t 0 r /Helvetica findfont 26.679 sf 0 0 m (4l) show NC gr 
 gsave  1088 1214 23 12 C 890.5 104.312 t 0 r /Helvetica findfont 40.9078 sf 0 0 m (M) show NC gr  197 235 m -28 Y s 214 221 m -14 Y s 231 221 m -14 Y s 248 221 m -14 Y s 266 221 m -14 Y s 283 235 m -28 Y s 300 221 m -14 Y s 317 221 m -14 Y s 334 221
 m -14 Y s 352 221 m -14 Y s 369 235 m -28 Y s 386 221 m -14 Y s 403 221 m -14 Y s 420 221 m -14 Y s 438 221 m -14 Y s 455 235 m -28 Y s 472 221 m -14 Y s 489 221 m -14 Y s 506 221 m -14 Y s 524 221 m -14 Y s 541 235 m -28 Y s 558 221 m -14 Y s 575
 221 m -14 Y s 592 221 m -14 Y s 610 221 m -14 Y s 627 235 m -28 Y s 644 221 m -14 Y s 661 221 m -14 Y s 678 221 m -14 Y s 696 221 m -14 Y s 713 235 m -28 Y s 730 221 m -14 Y s 747 221 m -14 Y s 764 221 m -14 Y s 782 221 m -14 Y s 799 235 m -28 Y s
 816 221 m -14 Y s 833 221 m -14 Y s 850 221 m -14 Y s 868 221 m -14 Y s 885 235 m -28 Y s 902 221 m -14 Y s 919 221 m -14 Y s 936 221 m -14 Y s 954 221 m -14 Y s 971 235 m -28 Y s 988 221 m -14 Y s 1005 221 m -14 Y s 1022 221 m -14 Y s 1040 221 m
 -14 Y s 1057 235 m -28 Y s
 gsave  1088 1214 23 12 C 161.875 163 t 0 r /Helvetica findfont 40.9078 sf 0 0 m (100) show NC gr 
 gsave  1088 1214 23 12 C 248.938 163 t 0 r /Helvetica findfont 40.9078 sf 0 0 m (150) show NC gr 
 gsave  1088 1214 23 12 C 334.25 163 t 0 r /Helvetica findfont 40.9078 sf 0 0 m (200) show NC gr 
 gsave  1088 1214 23 12 C 419.562 163 t 0 r /Helvetica findfont 40.9078 sf 0 0 m (250) show NC gr 
 gsave  1088 1214 23 12 C 506.625 163 t 0 r /Helvetica findfont 40.9078 sf 0 0 m (300) show NC gr 
 gsave  1088 1214 23 12 C 591.938 163 t 0 r /Helvetica findfont 40.9078 sf 0 0 m (350) show NC gr 
 gsave  1088 1214 23 12 C 679 163 t 0 r /Helvetica findfont 40.9078 sf 0 0 m (400) show NC gr 
 gsave  1088 1214 23 12 C 764.312 163 t 0 r /Helvetica findfont 40.9078 sf 0 0 m (450) show NC gr 
 gsave  1088 1214 23 12 C 849.625 163 t 0 r /Helvetica findfont 40.9078 sf 0 0 m (500) show NC gr 
 gsave  1088 1214 23 12 C 936.75 163 t 0 r /Helvetica findfont 40.9078 sf 0 0 m (550) show NC gr 
 gsave  1088 1214 23 12 C 1022 163 t 0 r /Helvetica findfont 40.9078 sf 0 0 m (600) show NC gr  197 1166 m 860 X s 197 1137 m 29 Y s 214 1151 m 15 Y s 231 1151 m 15 Y s 248 1151 m 15 Y s 266 1151 m 15 Y s 283 1137 m 29 Y s 300 1151 m 15 Y s 317 1151
 m 15 Y s 334 1151 m 15 Y s 352 1151 m 15 Y s 369 1137 m 29 Y s 386 1151 m 15 Y s 403 1151 m 15 Y s 420 1151 m 15 Y s 438 1151 m 15 Y s 455 1137 m 29 Y s 472 1151 m 15 Y s 489 1151 m 15 Y s 506 1151 m 15 Y s 524 1151 m 15 Y s 541 1137 m 29 Y s 558
 1151 m 15 Y s 575 1151 m 15 Y s 592 1151 m 15 Y s 610 1151 m 15 Y s 627 1137 m 29 Y s 644 1151 m 15 Y s 661 1151 m 15 Y s 678 1151 m 15 Y s 696 1151 m 15 Y s 713 1137 m 29 Y s 730 1151 m 15 Y s 747 1151 m 15 Y s 764 1151 m 15 Y s 782 1151 m 15 Y s
 799 1137 m 29 Y s 816 1151 m 15 Y s 833 1151 m 15 Y s 850 1151 m 15 Y s 868 1151 m 15 Y s 885 1137 m 29 Y s 902 1151 m 15 Y s 919 1151 m 15 Y s 936 1151 m 15 Y s 954 1151 m 15 Y s 971 1137 m 29 Y s 988 1151 m 15 Y s 1005 1151 m 15 Y s 1022 1151 m 15
 Y s 1040 1151 m 15 Y s 1057 1137 m 29 Y s 197 207 m 959 Y s
 gsave  1088 1214 23 12 C 96.125 1056.94 t 90 r /Helvetica findfont 40.9078 sf 0 0 m (\(NLO\)) show NC gr 
 gsave  1088 1214 23 12 C 106.75 1012.5 t 90 r /Helvetica findfont 26.679 sf 0 0 m (env) show NC gr 
 gsave  1088 1214 23 12 C 96.125 991.125 t 90 r /Symbol findfont 40.9078 sf 0 0 m (d) show NC gr 
 gsave  1088 1214 23 12 C 96.125 923.625 t 90 r /Helvetica findfont 40.9078 sf 0 0 m (1 + ) show NC gr  223 237 m -26 X s 210 267 m -13 X s 210 297 m -13 X s 210 326 m -13 X s 210 356 m -13 X s 223 386 m -26 X s 210 416 m -13 X s 210 446 m -13 X s
 210 476 m -13 X s 210 506 m -13 X s 223 536 m -26 X s 210 566 m -13 X s 210 596 m -13 X s 210 626 m -13 X s 210 656 m -13 X s 223 686 m -26 X s 210 716 m -13 X s 210 746 m -13 X s 210 776 m -13 X s 210 806 m -13 X s 223 836 m -26 X s 210 866 m -13 X
 s 210 896 m -13 X s 210 926 m -13 X s 210 956 m -13 X s 223 986 m -26 X s 210 1016 m -13 X s 210 1046 m -13 X s 210 1076 m -13 X s 210 1106 m -13 X s 223 1136 m -26 X s 223 237 m -26 X s 210 207 m -13 X s 223 1136 m -26 X s
 gsave  1088 1214 23 12 C 135.188 223.375 t 0 r /Helvetica findfont 40.9078 sf 0 0 m (0.7) show NC gr 
 gsave  1088 1214 23 12 C 135.188 372.688 t 0 r /Helvetica findfont 40.9078 sf 0 0 m (0.8) show NC gr 
 gsave  1088 1214 23 12 C 135.188 522 t 0 r /Helvetica findfont 40.9078 sf 0 0 m (0.9) show NC gr 
 gsave  1088 1214 23 12 C 174.312 673.062 t 0 r /Helvetica findfont 40.9078 sf 0 0 m (1) show NC gr 
 gsave  1088 1214 23 12 C 140.562 822.312 t 0 r /Helvetica findfont 40.9078 sf 0 0 m (1.1) show NC gr 
 gsave  1088 1214 23 12 C 135.188 971.625 t 0 r /Helvetica findfont 40.9078 sf 0 0 m (1.2) show NC gr 
 gsave  1088 1214 23 12 C 135.188 1122.69 t 0 r /Helvetica findfont 40.9078 sf 0 0 m (1.3) show NC gr  1057 207 m 959 Y s 1031 237 m 26 X s 1044 267 m 13 X s 1044 297 m 13 X s 1044 326 m 13 X s 1044 356 m 13 X s 1031 386 m 26 X s 1044 416 m 13 X s
 1044 446 m 13 X s 1044 476 m 13 X s 1044 506 m 13 X s 1031 536 m 26 X s 1044 566 m 13 X s 1044 596 m 13 X s 1044 626 m 13 X s 1044 656 m 13 X s 1031 686 m 26 X s 1044 716 m 13 X s 1044 746 m 13 X s 1044 776 m 13 X s 1044 806 m 13 X s 1031 836 m 26 X
 s 1044 866 m 13 X s 1044 896 m 13 X s 1044 926 m 13 X s 1044 956 m 13 X s 1031 986 m 26 X s 1044 1016 m 13 X s 1044 1046 m 13 X s 1044 1076 m 13 X s 1044 1106 m 13 X s 1031 1136 m 26 X s 1031 237 m 26 X s 1044 207 m 13 X s 1031 1136 m 26 X s 6 lw 1
 1 1 c 0 0 1 c 3 lw /w 21 def /w2 {w 2 div} def /w3 {w 3 div} def 283 755 455 783 627 756 799 784 971 803 5 { m22} R 6 lw black 1 1 1 c 0 0 1 c 3 lw 283 617 455 589 627 617 799 589 971 569 5 { m22} R 6 lw black 1 1 1 c 1 0 1 c 3 lw /w 14 def /w2 {w 2
 div} def /w3 {w 3 div} def 283 717 455 667 627 660 799 716 971 650 5 { m24} R 6 lw black 1 1 1 c 0 1 1 c 3 lw 283 704 455 734 627 726 799 727 971 706 5 { m24} R 6 lw black 1 1 1 c 0.4 0.4 0.4 c 3 lw 283 684 455 627 627 652 799 680 971 643 5 { m24} R
 6 lw 1 0 0 c 0.95 0.95 0.95 c black 1 0 0 c 201 737 m 9 1 d 8 1 d 9 2 d 9 1 d 8 1 d 9 1 d 8 1 d 9 1 d 9 2 d 8 1 d 9 1 d 8 1 d 9 1 d 9 1 d 8 1 d 9 1 d 8 1 d 9 1 d 9 1 d 8 1 d 9 1 d 8 1 d 9 1 d 9 1 d 8 X 9 1 d 8 1 d 9 1 d 9 1 d 8 1 d 9 1 d 8 X 9 1 d 9
 1 d 8 1 d 9 1 d 8 X 9 1 d 9 1 d 8 1 d 9 1 d 8 X 9 1 d 9 1 d 8 1 d 9 X 8 1 d 9 1 d 8 X s 622 782 m 9 1 d 9 1 d 8 1 d 9 X 8 1 d 9 1 d 9 X 8 1 d 9 1 d 8 X 9 1 d 9 1 d 8 X 9 1 d 8 1 d 9 X 9 1 d 8 1 d 9 X 8 1 d 9 X 9 1 d 8 1 d 9 X 8 1 d 9 1 d 9 X 8 1 d 9
 X 8 1 d 9 1 d 9 X 8 1 d 9 X 8 1 d 9 X 9 1 d 8 1 d 9 X 8 1 d 9 X 9 1 d 8 X 9 1 d 8 1 d 9 X 9 1 d 8 X 9 1 d s 1044 813 m 8 X s 0.95 0.95 0.95 c black 1 0 0 c 201 637 m 9 -1 d 8 -1 d 9 -1 d 9 -2 d 8 -1 d 9 -1 d 8 -1 d 9 -1 d 9 -1 d 8 -1 d 9 -1 d 8 -1 d
 9 -1 d 9 -1 d 8 -1 d 9 -1 d 8 -1 d 9 -1 d 9 X 8 -1 d 9 -1 d 8 -1 d 9 -1 d 9 -1 d 8 X 9 -1 d 8 -1 d 9 -1 d 9 -1 d 8 X 9 -1 d 8 -1 d 9 -1 d 9 X 8 -1 d 9 -1 d 8 X 9 -1 d 9 -1 d 8 -1 d 9 X 8 -1 d 9 -1 d 9 X 8 -1 d 9 X 8 -1 d 9 -1 d 8 X s 622 596 m 9 -1
 d 9 -1 d 8 X 9 -1 d 8 X 9 -1 d 9 -1 d 8 X 9 -1 d 8 X 9 -1 d 9 -1 d 8 X 9 -1 d 8 X 9 -1 d 9 X 8 -1 d 9 -1 d 8 X 9 -1 d 9 X 8 -1 d 9 X 8 -1 d 9 X 9 -1 d 8 X 9 -1 d 8 X 9 -1 d 9 X 8 -1 d 9 X 8 -1 d 9 X 9 -1 d 8 X 9 -1 d 8 X 9 -1 d 9 X 8 -1 d 9 X 8 -1 d
 9 X 9 -1 d 8 X 9 -1 d s 1044 569 m 8 X s black
 gsave  1088 1214 23 12 C 291.625 1083.56 t 0 r /Helvetica findfont 51.5794 sf 0 0 m 
 139 110 85 72 44 30
(= 7 TeV) K NC gr 
 gsave  1088 1214 23 12 C 266.688 1083.56 t 0 r /Helvetica findfont 51.5794 sf 0 0 m (s) show NC gr  233 1111 m 23 -30 d s 0 lw 256 1081 m 5 44 d s 261 1125 m 30 X s
 gsave  1088 1214 23 12 C 1100.25 815.188 t 90 r /Helvetica-BoldOblique findfont 30.2362 sf 0 0 m 
 336 321 304 287 279 255 226 218 198 177 169 148 125 101 93 71 62 40 18
(LHC HIGGS XS WG 2011) K NC gr 
 gsave  1088 1214 23 12 C 494.188 257.188 t 0 r /Helvetica findfont 51.5794 sf 0 0 m ( Uncertainty) show NC gr 
 gsave  1088 1214 23 12 C 478.188 235.812 t 0 r /Helvetica findfont 33.7934 sf 0 0 m (s) show NC gr 
 gsave  1088 1214 23 12 C 240.062 257.188 t 0 r /Helvetica findfont 51.5794 sf 0 0 m (Pdf+Alpha) show NC gr  3 lw 1 1 1 c 497 182 507 931 bf black 517 931 m -7 Y 494 X 178 Y -7 X -171 Y f 507 931 m 182 Y 497 X -182 Y -497 X cl s
 gsave  1088 1214 23 12 C 631.062 1074.69 t 0 r /Helvetica findfont 24.9004 sf 0 0 m (CT10 central value / Mid\255point) show NC gr  1 0 1 c 569 1082 m24 black
 gsave  1088 1214 23 12 C 631.062 1014.25 t 0 r /Helvetica findfont 24.9004 sf 0 0 m (MSTW central value / Mid\255point) show NC gr  0 1 1 c 569 1022 m24 black
 gsave  1088 1214 23 12 C 631.062 953.812 t 0 r /Helvetica findfont 24.9004 sf 0 0 m (NNPDF central value / Mid\255point) show NC gr  0.4 0.4 0.4 c 569 961 m24 black 1 1 1 c 1088 1214 1157 12 bf black 1 1 1 c 860 959 1331 207 bf black 860 959 1331
 207 bl 1 1 1 c 860 959 1331 207 bf black 860 959 1331 207 bl 6 lw 1 1 1 c black 1331 207 m 860 X s 3 lw 1331 207 m 860 X s
 gsave  1088 1214 1157 12 C 2076.06 104.312 t 0 r /Helvetica findfont 40.9078 sf 0 0 m ( [GeV]) show NC gr 
 gsave  1088 1214 1157 12 C 2056.5 93.6875 t 0 r /Helvetica findfont 26.679 sf 0 0 m (4l) show NC gr 
 gsave  1088 1214 1157 12 C 2024.5 104.312 t 0 r /Helvetica findfont 40.9078 sf 0 0 m (M) show NC gr  1331 235 m -28 Y s 1348 221 m -14 Y s 1365 221 m -14 Y s 1382 221 m -14 Y s 1399 221 m -14 Y s 1417 235 m -28 Y s 1434 221 m -14 Y s 1451 221 m -14
 Y s 1468 221 m -14 Y s 1485 221 m -14 Y s 1503 235 m -28 Y s 1520 221 m -14 Y s 1537 221 m -14 Y s 1554 221 m -14 Y s 1571 221 m -14 Y s 1589 235 m -28 Y s 1606 221 m -14 Y s 1623 221 m -14 Y s 1640 221 m -14 Y s 1657 221 m -14 Y s 1675 235 m -28 Y
 s 1692 221 m -14 Y s 1709 221 m -14 Y s 1726 221 m -14 Y s 1743 221 m -14 Y s 1761 235 m -28 Y s 1778 221 m -14 Y s 1795 221 m -14 Y s 1812 221 m -14 Y s 1829 221 m -14 Y s 1847 235 m -28 Y s 1864 221 m -14 Y s 1881 221 m -14 Y s 1898 221 m -14 Y s
 1915 221 m -14 Y s 1933 235 m -28 Y s 1950 221 m -14 Y s 1967 221 m -14 Y s 1984 221 m -14 Y s 2001 221 m -14 Y s 2019 235 m -28 Y s 2036 221 m -14 Y s 2053 221 m -14 Y s 2070 221 m -14 Y s 2087 221 m -14 Y s 2105 235 m -28 Y s 2122 221 m -14 Y s
 2139 221 m -14 Y s 2156 221 m -14 Y s 2173 221 m -14 Y s 2191 235 m -28 Y s
 gsave  1088 1214 1157 12 C 1295.88 163 t 0 r /Helvetica findfont 40.9078 sf 0 0 m (100) show NC gr 
 gsave  1088 1214 1157 12 C 1382.94 163 t 0 r /Helvetica findfont 40.9078 sf 0 0 m (150) show NC gr 
 gsave  1088 1214 1157 12 C 1468.25 163 t 0 r /Helvetica findfont 40.9078 sf 0 0 m (200) show NC gr 
 gsave  1088 1214 1157 12 C 1553.56 163 t 0 r /Helvetica findfont 40.9078 sf 0 0 m (250) show NC gr 
 gsave  1088 1214 1157 12 C 1640.62 163 t 0 r /Helvetica findfont 40.9078 sf 0 0 m (300) show NC gr 
 gsave  1088 1214 1157 12 C 1725.94 163 t 0 r /Helvetica findfont 40.9078 sf 0 0 m (350) show NC gr 
 gsave  1088 1214 1157 12 C 1813 163 t 0 r /Helvetica findfont 40.9078 sf 0 0 m (400) show NC gr 
 gsave  1088 1214 1157 12 C 1898.31 163 t 0 r /Helvetica findfont 40.9078 sf 0 0 m (450) show NC gr 
 gsave  1088 1214 1157 12 C 1983.62 163 t 0 r /Helvetica findfont 40.9078 sf 0 0 m (500) show NC gr 
 gsave  1088 1214 1157 12 C 2070.69 163 t 0 r /Helvetica findfont 40.9078 sf 0 0 m (550) show NC gr 
 gsave  1088 1214 1157 12 C 2156 163 t 0 r /Helvetica findfont 40.9078 sf 0 0 m (600) show NC gr  1331 1166 m 860 X s 1331 1137 m 29 Y s 1348 1151 m 15 Y s 1365 1151 m 15 Y s 1382 1151 m 15 Y s 1399 1151 m 15 Y s 1417 1137 m 29 Y s 1434 1151 m 15 Y s
 1451 1151 m 15 Y s 1468 1151 m 15 Y s 1485 1151 m 15 Y s 1503 1137 m 29 Y s 1520 1151 m 15 Y s 1537 1151 m 15 Y s 1554 1151 m 15 Y s 1571 1151 m 15 Y s 1589 1137 m 29 Y s 1606 1151 m 15 Y s 1623 1151 m 15 Y s 1640 1151 m 15 Y s 1657 1151 m 15 Y s
 1675 1137 m 29 Y s 1692 1151 m 15 Y s 1709 1151 m 15 Y s 1726 1151 m 15 Y s 1743 1151 m 15 Y s 1761 1137 m 29 Y s 1778 1151 m 15 Y s 1795 1151 m 15 Y s 1812 1151 m 15 Y s 1829 1151 m 15 Y s 1847 1137 m 29 Y s 1864 1151 m 15 Y s 1881 1151 m 15 Y s
 1898 1151 m 15 Y s 1915 1151 m 15 Y s 1933 1137 m 29 Y s 1950 1151 m 15 Y s 1967 1151 m 15 Y s 1984 1151 m 15 Y s 2001 1151 m 15 Y s 2019 1137 m 29 Y s 2036 1151 m 15 Y s 2053 1151 m 15 Y s 2070 1151 m 15 Y s 2087 1151 m 15 Y s 2105 1137 m 29 Y s
 2122 1151 m 15 Y s 2139 1151 m 15 Y s 2156 1151 m 15 Y s 2173 1151 m 15 Y s 2191 1137 m 29 Y s 1331 207 m 959 Y s
 gsave  1088 1214 1157 12 C 1230.12 1094.25 t 90 r /Helvetica findfont 40.9078 sf 0 0 m (\(gg\)) show NC gr 
 gsave  1088 1214 1157 12 C 1240.75 1049.81 t 90 r /Helvetica findfont 26.679 sf 0 0 m (env) show NC gr 
 gsave  1088 1214 1157 12 C 1230.12 1028.5 t 90 r /Symbol findfont 40.9078 sf 0 0 m (d) show NC gr 
 gsave  1088 1214 1157 12 C 1230.12 960.938 t 90 r /Helvetica findfont 40.9078 sf 0 0 m (1 + ) show NC gr  1356 237 m -25 X s 1344 267 m -13 X s 1344 297 m -13 X s 1344 326 m -13 X s 1344 356 m -13 X s 1356 386 m -25 X s 1344 416 m -13 X s 1344 446 m
 -13 X s 1344 476 m -13 X s 1344 506 m -13 X s 1356 536 m -25 X s 1344 566 m -13 X s 1344 596 m -13 X s 1344 626 m -13 X s 1344 656 m -13 X s 1356 686 m -25 X s 1344 716 m -13 X s 1344 746 m -13 X s 1344 776 m -13 X s 1344 806 m -13 X s 1356 836 m
 -25 X s 1344 866 m -13 X s 1344 896 m -13 X s 1344 926 m -13 X s 1344 956 m -13 X s 1356 986 m -25 X s 1344 1016 m -13 X s 1344 1046 m -13 X s 1344 1076 m -13 X s 1344 1106 m -13 X s 1356 1136 m -25 X s 1356 237 m -25 X s 1344 207 m -13 X s 1356
 1136 m -25 X s
 gsave  1088 1214 1157 12 C 1269.19 223.375 t 0 r /Helvetica findfont 40.9078 sf 0 0 m (0.7) show NC gr 
 gsave  1088 1214 1157 12 C 1269.19 372.688 t 0 r /Helvetica findfont 40.9078 sf 0 0 m (0.8) show NC gr 
 gsave  1088 1214 1157 12 C 1269.19 522 t 0 r /Helvetica findfont 40.9078 sf 0 0 m (0.9) show NC gr 
 gsave  1088 1214 1157 12 C 1308.31 673.062 t 0 r /Helvetica findfont 40.9078 sf 0 0 m (1) show NC gr 
 gsave  1088 1214 1157 12 C 1274.5 822.312 t 0 r /Helvetica findfont 40.9078 sf 0 0 m (1.1) show NC gr 
 gsave  1088 1214 1157 12 C 1269.19 971.625 t 0 r /Helvetica findfont 40.9078 sf 0 0 m (1.2) show NC gr 
 gsave  1088 1214 1157 12 C 1269.19 1122.69 t 0 r /Helvetica findfont 40.9078 sf 0 0 m (1.3) show NC gr  2191 207 m 959 Y s 2165 237 m 26 X s 2178 267 m 13 X s 2178 297 m 13 X s 2178 326 m 13 X s 2178 356 m 13 X s 2165 386 m 26 X s 2178 416 m 13 X s
 2178 446 m 13 X s 2178 476 m 13 X s 2178 506 m 13 X s 2165 536 m 26 X s 2178 566 m 13 X s 2178 596 m 13 X s 2178 626 m 13 X s 2178 656 m 13 X s 2165 686 m 26 X s 2178 716 m 13 X s 2178 746 m 13 X s 2178 776 m 13 X s 2178 806 m 13 X s 2165 836 m 26 X
 s 2178 866 m 13 X s 2178 896 m 13 X s 2178 926 m 13 X s 2178 956 m 13 X s 2165 986 m 26 X s 2178 1016 m 13 X s 2178 1046 m 13 X s 2178 1076 m 13 X s 2178 1106 m 13 X s 2165 1136 m 26 X s 2165 237 m 26 X s 2178 207 m 13 X s 2165 1136 m 26 X s 6 lw 1
 1 1 c 0 1 0 c 3 lw /w 21 def /w2 {w 2 div} def /w3 {w 3 div} def 1417 790 1589 845 1761 862 1933 825 2105 897 5 { m22} R 6 lw black 1 1 1 c 0 1 0 c 3 lw 1417 582 1589 527 1761 510 1933 547 2105 475 5 { m22} R 6 lw black 1 1 1 c 1 0 1 c 3 lw /w 14
 def /w2 {w 2 div} def /w3 {w 3 div} def 1417 622 1589 650 1761 649 1933 604 2105 646 5 { m24} R 6 lw black 1 1 1 c 0 1 1 c 3 lw 1417 667 1589 767 1761 756 1933 717 2105 752 5 { m24} R 6 lw black 1 1 1 c 0.4 0.4 0.4 c 3 lw 1417 747 1589 801 1761 817
 1933 775 2105 822 5 { m24} R 6 lw 1 0 0 c 0.95 0.95 0.95 c black 1 0 0 c 1335 770 m 9 3 d 8 3 d 9 3 d 8 2 d 9 3 d 9 2 d 8 3 d 9 2 d 8 2 d 9 3 d 9 2 d 8 2 d 9 2 d 8 2 d 9 2 d 9 2 d 8 2 d 9 2 d 8 2 d 9 2 d 9 2 d 8 2 d 9 2 d 8 1 d 9 2 d 9 2 d 8 2 d 9 1
 d 8 2 d 9 2 d 9 1 d 8 2 d 9 2 d 8 1 d 9 2 d 9 1 d 8 2 d 9 1 d 8 2 d 9 1 d 9 2 d 8 1 d 9 2 d 8 1 d 9 2 d 9 1 d 8 2 d 9 1 d 8 1 d s 1756 862 m 9 2 d 9 1 d 8 1 d 9 2 d 8 1 d 9 1 d 9 2 d 8 1 d 9 1 d 8 2 d 9 1 d 9 1 d 8 2 d 9 1 d 8 1 d 9 1 d 9 2 d 8 1 d
 9 1 d 8 1 d 9 1 d 9 2 d 8 1 d 9 1 d 8 1 d 9 1 d 9 1 d 8 2 d 9 1 d 8 1 d 9 1 d 9 1 d 8 1 d 9 1 d 8 2 d 9 1 d 9 1 d 8 1 d 9 1 d 8 1 d 9 1 d 9 1 d 8 1 d 9 1 d 8 1 d 9 2 d 9 1 d 8 1 d 9 1 d s 2178 921 m 8 1 d s 0.95 0.95 0.95 c black 1 0 0 c 1335 606 m
 9 -2 d 8 -3 d 9 -2 d 8 -2 d 9 -3 d 9 -2 d 8 -2 d 9 -2 d 8 -2 d 9 -2 d 9 -2 d 8 -2 d 9 -2 d 8 -1 d 9 -2 d 9 -2 d 8 -1 d 9 -2 d 8 -2 d 9 -1 d 9 -2 d 8 -2 d 9 -1 d 8 -2 d 9 -1 d 9 -2 d 8 -1 d 9 -1 d 8 -2 d 9 -1 d 9 -2 d 8 -1 d 9 -1 d 8 -2 d 9 -1 d 9 -1
 d 8 -1 d 9 -2 d 8 -1 d 9 -1 d 9 -1 d 8 -2 d 9 -1 d 8 -1 d 9 -1 d 9 -1 d 8 -1 d 9 -1 d 8 -2 d s 1756 528 m 9 -1 d 9 -1 d 8 -1 d 9 -1 d 8 -1 d 9 -1 d 9 -1 d 8 -1 d 9 -1 d 8 -1 d 9 -1 d 9 -1 d 8 -1 d 9 -1 d 8 -1 d 9 -1 d 9 -1 d 8 -1 d 9 -1 d 8 -1 d 9
 -1 d 9 -1 d 8 -1 d 9 -1 d 8 -1 d 9 X 9 -1 d 8 -1 d 9 -1 d 8 -1 d 9 -1 d 9 -1 d 8 -1 d 9 X 8 -1 d 9 -1 d 9 -1 d 8 -1 d 9 -1 d 8 X 9 -1 d 9 -1 d 8 -1 d 9 -1 d 8 -1 d 9 X 9 -1 d 8 -1 d 9 -1 d s 2178 483 m 8 X s black
 gsave  1088 1214 1157 12 C 1425.56 1083.56 t 0 r /Helvetica findfont 51.5794 sf 0 0 m 
 139 111 85 72 44 30
(= 7 TeV) K NC gr 
 gsave  1088 1214 1157 12 C 1400.69 1083.56 t 0 r /Helvetica findfont 51.5794 sf 0 0 m (s) show NC gr  1367 1111 m 23 -30 d s 0 lw 1390 1081 m 5 44 d s 1395 1125 m 30 X s
 gsave  1088 1214 1157 12 C 2234.25 815.188 t 90 r /Helvetica-BoldOblique findfont 30.2362 sf 0 0 m 
 336 321 304 287 279 255 226 218 198 177 169 148 125 101 93 71 62 40 18
(LHC HIGGS XS WG 2011) K NC gr 
 gsave  1088 1214 1157 12 C 1628.19 257.188 t 0 r /Helvetica findfont 51.5794 sf 0 0 m ( Uncertainty) show NC gr 
 gsave  1088 1214 1157 12 C 1612.19 235.812 t 0 r /Helvetica findfont 33.7934 sf 0 0 m (s) show NC gr 
 gsave  1088 1214 1157 12 C 1374.06 257.188 t 0 r /Helvetica findfont 51.5794 sf 0 0 m (Pdf+Alpha) show NC gr  3 lw 1 1 1 c 493 181 1649 940 bf black 1660 940 m -7 Y 489 X 178 Y -7 X -171 Y f 1649 940 m 181 Y 493 X -181 Y -493 X cl s
 gsave  1088 1214 1157 12 C 1772.12 1083.56 t 0 r /Helvetica findfont 24.9004 sf 0 0 m (CT10 central value/ Mid\255point) show NC gr  1 0 1 c 1711 1091 m24 black
 gsave  1088 1214 1157 12 C 1772.12 1023.12 t 0 r /Helvetica findfont 24.9004 sf 0 0 m (MSTW central value/ Mid\255point) show NC gr  0 1 1 c 1711 1031 m24 black
 gsave  1088 1214 1157 12 C 1772.12 962.688 t 0 r /Helvetica findfont 24.9004 sf 0 0 m (NNPDF central value/ Mid\255point) show NC gr  0.4 0.4 0.4 c 1711 970 m24
 gr  gr showpage
end
%%EOF
