%!PS-Adobe-2.0 EPSF-2.0
%%BoundingBox:  0 0 567 539
%%Title: compare.out/figures/dphi_jj.eps: 
%%Creator: ROOT Version 5.18/00b
%%CreationDate: Sun Nov 13 22:41:16 2011
%%EndComments
%%BeginProlog
80 dict begin
/s {stroke} def /l {lineto} def /m {moveto} def /t {translate} def
/sw {stringwidth} def /r {rotate} def /rl {roll}  def /R {repeat} def
/d {rlineto} def /rm {rmoveto} def /gr {grestore} def /f {eofill} def
/c {setrgbcolor} def /black {0 setgray} def /sd {setdash} def
/cl {closepath} def /sf {scalefont setfont} def /lw {setlinewidth} def
/box {m dup 0 exch d exch 0 d 0 exch neg d cl} def
/NC{systemdict begin initclip end}def/C{NC box clip newpath}def
/bl {box s} def /bf {box f} def /Y { 0 exch d} def /X { 0 d} def 
/mp {newpath /y exch def /x exch def} def
/side {[w .77 mul w .23 mul] .385 w mul sd w 0 l currentpoint t -144 r} def
/mr {mp x y w2 0 360 arc} def /m24 {mr s} def /m20 {mr f} def
/mb {mp x y w2 add m w2 neg 0 d 0 w neg d w 0 d 0 w d cl} def
/mt {mp x y w2 add m w2 neg w neg d w 0 d cl} def
/m21 {mb f} def /m25 {mb s} def /m22 {mt f} def /m26{mt s} def
/m23 {mp x y w2 sub m w2 w d w neg 0 d cl f} def
/m27 {mp x y w2 add m w3 neg w2 neg d w3 w2 neg d w3 w2 d cl s} def
/m28 {mp x w2 sub y w2 sub w3 add m w3 0 d  0 w3 neg d w3 0 d 0 w3 d w3 0 d  0 w3 d w3 neg 0 d 0 w3 d w3 neg 0 d
 0 w3 neg d w3 neg 0 d cl s } def
/m29 {mp gsave x w2 sub y w2 add w3 sub m currentpoint t
 4 {side} repeat cl fill gr} def
/m30 {mp gsave x w2 sub y w2 add w3 sub m currentpoint t
 4 {side} repeat cl s gr} def
/m31 {mp x y w2 sub m 0 w d x w2 sub y m w 0 d x w2 sub y w2 add m w w neg d x w2 sub y w2
 sub m w w d s} def
/m2 {mp x y w2 sub m 0 w d x w2 sub y m w 0 d s} def
/m5 {mp x w2 sub y w2 sub m w w d x w2 sub y w2 add m w w neg d s} def
/reencdict 24 dict def /ReEncode {reencdict begin /nco&na exch def
/nfnam exch def /basefontname exch def /basefontdict basefontname findfont def
/newfont basefontdict maxlength dict def basefontdict {exch dup /FID ne
{dup /Encoding eq {exch dup length array copy newfont 3 1 roll put} {exch 
newfont 3 1 roll put} ifelse} {pop pop} ifelse } forall newfont
/FontName nfnam put nco&na aload pop nco&na length 2 idiv {newfont
/Encoding get 3 1 roll put} repeat nfnam newfont definefont pop end } def
/accvec [ 176 /agrave 181 /Agrave 190 /acircumflex 192 /Acircumflex
201 /adieresis 204 /Adieresis 209 /ccedilla 210 /Ccedilla 211 /eacute
212 /Eacute 213 /egrave 214 /Egrave 215 /ecircumflex 216 /Ecircumflex
217 /edieresis 218 /Edieresis 219 /icircumflex 220 /Icircumflex
221 /idieresis 222 /Idieresis 223 /ntilde 224 /Ntilde 226 /ocircumflex
228 /Ocircumflex 230 /Odieresis 231 /ucircumflex 236 /Ucircumflex
237 /udieresis 238 /Udieresis 239 /aring 240 /odieresis 242 /Aring 243 /ydieresis
244 /Ydieresis 246 /aacute 247 /Aacute 252 /ugrave 253 /Ugrave
127 /atilde 128 /Atilde 129 /oacute 130 /Oacute 131 /iacute
132 /Iacute 133 /igrave 134 /Igrave 135 /otilde 136 /Otilde
137 /uacute 138 /Uacute] def
/Times-Roman /Times-Roman accvec ReEncode
/Times-Italic /Times-Italic accvec ReEncode
/Times-Bold /Times-Bold accvec ReEncode
/Times-BoldItalic /Times-BoldItalic accvec ReEncode
/Helvetica /Helvetica accvec ReEncode
/Helvetica-Oblique /Helvetica-Oblique accvec ReEncode
/Helvetica-Bold /Helvetica-Bold accvec ReEncode
/Helvetica-BoldOblique /Helvetica-BoldOblique  accvec ReEncode
/Courier /Courier accvec ReEncode
/Courier-Oblique /Courier-Oblique accvec ReEncode
/Courier-Bold /Courier-Bold accvec ReEncode
/Courier-BoldOblique /Courier-BoldOblique accvec ReEncode
/oshow {gsave [] 0 sd true charpath stroke gr} def
/stwn { /fs exch def /fn exch def /text exch def fn findfont fs sf
 text sw pop xs add /xs exch def} def
/stwb { /fs exch def /fn exch def /nbas exch def /textf exch deftextf length /tlen exch def nbas tlen gt {/nbas tlendef} iffn findfont fs sf textf dup length nbas sub nbas getinterval sw
pop neg xs add /xs exch def} def
/accspe [ 65 /plusminus  66 /bar  67 /existential  68 /universal 
69 /exclam  70 /numbersign 71 /greater  72 /question  73 /integral 
74 /colon  75 /semicolon  76 /less  77 /bracketleft  78 /bracketright
79 /greaterequal 80 /braceleft 81 /braceright 82 /radical
83 /spade 84 /heart 85 /diamond 86 /club 87 /lessequal
88 /multiply 89 /percent 90 /infinity 48 /circlemultiply 49 /circleplus
50 /emptyset  51 /lozenge 52 /bullet 53 /arrowright 54 /arrowup
55 /arrowleft 56 /arrowdown 57 /arrowboth 48 /degree 44 /comma 43 /plus 45 /angle 42 /angleleft 47 /divide 61 /notequal 40 /equivalence 41 /second 97 /approxequal 98 /congruent 99 /perpendicular 100 /partialdiff 101 /florin 102 /intersection
 103 /union 104 /propersuperset 105 /reflexsuperset 106 /notsubset 107 /propersubset 108 /reflexsubset 109 /element 110 /notelement 111 /gradient 112 /logicaland 113 /logicalor 114 /arrowdblboth 115 /arrowdblleft 116 /arrowdblup 117 /arrowdblright
 118 /arrowdbldown 119 /ampersand 120 /omega1 121 /similar 122 /aleph ] def
/Symbol /Special accspe ReEncode
%%EndProlog
%%BeginSetup
%%EndSetup
newpath  gsave  .25 .25 scale  gsave  0 0 t black[  ] 0 sd 0 lw 1 1 1 c black 3 lw 0.999 0.999 0.999 c black 1814 1726 227 216 bl 0.999 0.999 0.999 c black 1814 1726 227 216 bl 0 lw 227 216 m 1814 X s 227 216 m 1726 Y s 6 lw 517 1787 m 183 X s
 gsave  2268 2158 0 0 C 745 1765 t 0 r /Helvetica findfont 54.8641 sf 0 0 m (LO - MSSM) show NC gr  0.999 0.999 0.999 c black 227 554 m 90 X 8 Y 91 X 25 Y 91 X 28 Y 91 X 39 Y 90 X 55 Y 91 X 56 Y 91 X 74 Y 90 X 78 Y 91 X 92 Y 91 X 105 Y 91 X 105 Y 90
 X 100 Y 91 X 123 Y 91 X 109 Y 90 X 104 Y 91 X 102 Y 91 X 72 Y 91 X 56 Y 90 X -1303 Y 91 X s 0 1 0 c[ 4 8] 0 sd 9 lw 517 1718 m 183 X s black
 gsave  2268 2158 0 0 C 745 1696 t 0 r /Helvetica findfont 54.8641 sf 0 0 m (NLO - MSSM) show NC gr  0 1 0 c 0.999 0.999 0.999 c black 0 1 0 c 227 336 m 90 X -5 Y 91 X -22 Y 91 X 86 Y 181 X 67 Y 91 X 57 Y 91 X 100 Y 90 X 55 Y 91 X 59 Y 91 X 26 Y 91
 X 211 Y 90 X 71 Y 91 X 188 Y 91 X 132 Y 90 X -60 Y 91 X 239 Y 91 X 63 Y 91 X 34 Y 90 X -1214 Y 91 X s 1 0 1 c[ 20 12 4 12] 0 sd 517 1649 m 183 X s black
 gsave  2268 2158 0 0 C 1280 1618 t 0 r /Helvetica findfont 36.5761 sf 0 0 m (A) show NC gr 
 gsave  2268 2158 0 0 C 745 1641 t 0 r /Helvetica findfont 54.8641 sf 0 0 m (NLO - rescaled SM, S) show NC gr  1 0 1 c 0.999 0.999 0.999 c black 1 0 1 c 227 353 m 90 X -26 Y 91 X 48 Y 91 X 37 Y 91 X 2 Y 90 X 85 Y 91 X 50 Y 91 X 114 Y 90 X 66 Y 91 X
 70 Y 91 X 83 Y 91 X 137 Y 90 X 43 Y 91 X 164 Y 91 X 155 Y 90 X 29 Y 91 X 184 Y 91 X 21 Y 91 X 54 Y 90 X -1250 Y 91 X s 1 0 0 c[ 12 12] 0 sd 517 1580 m 183 X s black
 gsave  2268 2158 0 0 C 1280 1550 t 0 r /Helvetica findfont 36.5761 sf 0 0 m (Z) show NC gr 
 gsave  2268 2158 0 0 C 745 1573 t 0 r /Helvetica findfont 54.8641 sf 0 0 m (NLO - rescaled SM, S) show NC gr  1 0 0 c 0.999 0.999 0.999 c black 1 0 0 c 227 364 m 90 X -26 Y 91 X 49 Y 91 X 36 Y 91 X 2 Y 90 X 86 Y 91 X 50 Y 91 X 115 Y 90 X 66 Y 91 X
 71 Y 91 X 84 Y 91 X 137 Y 90 X 44 Y 91 X 164 Y 91 X 156 Y 90 X 30 Y 91 X 185 Y 91 X 21 Y 91 X 54 Y 90 X -1258 Y 91 X s black[  ] 0 sd 0 lw 227 216 m 1726 Y s
 gsave  2268 2158 0 0 C 69 1843 t 90 r /Helvetica findfont 68.5801 sf 0 0 m (\(fb\)) show NC gr 
 gsave  2268 2158 0 0 C 110 1820 t 90 r /Helvetica findfont 45.7201 sf 0 0 m (jj) show NC gr 
 gsave  2268 2158 0 0 C 69 1783 t 90 r /Symbol findfont 68.5801 sf 0 0 m (f) show NC gr 
 gsave  2268 2158 0 0 C 69 1765 t 90 r /Helvetica findfont 68.5801 sf 0 0 m ( ) show NC gr 
 gsave  2268 2158 0 0 C 69 1719 t 90 r /Symbol findfont 68.5801 sf 0 0 m (D) show NC gr 
 gsave  2268 2158 0 0 C 69 1660 t 90 r /Helvetica findfont 68.5801 sf 0 0 m (/d) show NC gr 
 gsave  2268 2158 0 0 C 69 1618 t 90 r /Symbol findfont 68.5801 sf 0 0 m (s) show NC gr 
 gsave  2268 2158 0 0 C 69 1582 t 90 r /Helvetica findfont 68.5801 sf 0 0 m (d) show NC gr  281 216 m -54 X s 254 280 m -27 X s 254 344 m -27 X s 254 408 m -27 X s 254 472 m -27 X s 281 536 m -54 X s 254 599 m -27 X s 254 663 m -27 X s 254 727 m -27
 X s 254 791 m -27 X s 281 855 m -54 X s 254 919 m -27 X s 254 983 m -27 X s 254 1047 m -27 X s 254 1111 m -27 X s 281 1175 m -54 X s 254 1239 m -27 X s 254 1303 m -27 X s 254 1367 m -27 X s 254 1431 m -27 X s 281 1495 m -54 X s 254 1559 m -27 X s
 254 1622 m -27 X s 254 1686 m -27 X s 254 1750 m -27 X s 281 1814 m -54 X s 281 1814 m -54 X s 254 1878 m -27 X s 254 1942 m -27 X s
 gsave  2268 2158 0 0 C 160 201 t 0 r /Helvetica findfont 41.1481 sf 0 0 m (30) show NC gr 
 gsave  2268 2158 0 0 C 160 521 t 0 r /Helvetica findfont 41.1481 sf 0 0 m (35) show NC gr 
 gsave  2268 2158 0 0 C 160 841 t 0 r /Helvetica findfont 41.1481 sf 0 0 m (40) show NC gr 
 gsave  2268 2158 0 0 C 160 1157 t 0 r /Helvetica findfont 41.1481 sf 0 0 m (45) show NC gr 
 gsave  2268 2158 0 0 C 160 1477 t 0 r /Helvetica findfont 41.1481 sf 0 0 m (50) show NC gr 
 gsave  2268 2158 0 0 C 160 1797 t 0 r /Helvetica findfont 41.1481 sf 0 0 m (55) show NC gr  2041 216 m 1726 Y s 1987 216 m 54 X s 2014 280 m 27 X s 2014 344 m 27 X s 2014 408 m 27 X s 2014 472 m 27 X s 1987 536 m 54 X s 2014 599 m 27 X s 2014 663 m
 27 X s 2014 727 m 27 X s 2014 791 m 27 X s 1987 855 m 54 X s 2014 919 m 27 X s 2014 983 m 27 X s 2014 1047 m 27 X s 2014 1111 m 27 X s 1987 1175 m 54 X s 2014 1239 m 27 X s 2014 1303 m 27 X s 2014 1367 m 27 X s 2014 1431 m 27 X s 1987 1495 m 54 X s
 2014 1559 m 27 X s 2014 1622 m 27 X s 2014 1686 m 27 X s 2014 1750 m 27 X s 1987 1814 m 54 X s 1987 1814 m 54 X s 2014 1878 m 27 X s 2014 1942 m 27 X s 227 1942 m 1814 X s 227 1890 m 52 Y s 283 1916 m 26 Y s 340 1916 m 26 Y s 397 1916 m 26 Y s 454
 1916 m 26 Y s 510 1890 m 52 Y s 567 1916 m 26 Y s 624 1916 m 26 Y s 680 1916 m 26 Y s 737 1916 m 26 Y s 794 1890 m 52 Y s 850 1916 m 26 Y s 907 1916 m 26 Y s 964 1916 m 26 Y s 1020 1916 m 26 Y s 1077 1890 m 52 Y s 1134 1916 m 26 Y s 1191 1916 m 26
 Y s 1247 1916 m 26 Y s 1304 1916 m 26 Y s 1361 1890 m 52 Y s 1417 1916 m 26 Y s 1474 1916 m 26 Y s 1531 1916 m 26 Y s 1587 1916 m 26 Y s 1644 1890 m 52 Y s 1701 1916 m 26 Y s 1757 1916 m 26 Y s 1814 1916 m 26 Y s 1871 1916 m 26 Y s 1928 1890 m 52 Y
 s 1928 1890 m 52 Y s 1984 1916 m 26 Y s 2041 1916 m 26 Y s 227 216 m 1814 X s
 gsave  2268 2158 0 0 C 2012 37 t 0 r /Helvetica findfont 54.8641 sf 0 0 m (jj) show NC gr 
 gsave  2268 2158 0 0 C 1971 78 t 0 r /Symbol findfont 82.2962 sf 0 0 m (f) show NC gr 
 gsave  2268 2158 0 0 C 1948 78 t 0 r /Helvetica findfont 82.2962 sf 0 0 m ( ) show NC gr 
 gsave  2268 2158 0 0 C 1897 78 t 0 r /Symbol findfont 82.2962 sf 0 0 m (D) show NC gr  227 268 m -52 Y s 283 242 m -26 Y s 340 242 m -26 Y s 397 242 m -26 Y s 454 242 m -26 Y s 510 268 m -52 Y s 567 242 m -26 Y s 624 242 m -26 Y s 680 242 m -26 Y s
 737 242 m -26 Y s 794 268 m -52 Y s 850 242 m -26 Y s 907 242 m -26 Y s 964 242 m -26 Y s 1020 242 m -26 Y s 1077 268 m -52 Y s 1134 242 m -26 Y s 1191 242 m -26 Y s 1247 242 m -26 Y s 1304 242 m -26 Y s 1361 268 m -52 Y s 1417 242 m -26 Y s 1474
 242 m -26 Y s 1531 242 m -26 Y s 1587 242 m -26 Y s 1644 268 m -52 Y s 1701 242 m -26 Y s 1757 242 m -26 Y s 1814 242 m -26 Y s 1871 242 m -26 Y s 1928 268 m -52 Y s 1928 268 m -52 Y s 1984 242 m -26 Y s 2041 242 m -26 Y s
 gsave  2268 2158 0 0 C 210 169 t 0 r /Helvetica findfont 41.1481 sf 0 0 m (0) show NC gr 
 gsave  2268 2158 0 0 C 475 169 t 0 r /Helvetica findfont 41.1481 sf 0 0 m (0.5) show NC gr 
 gsave  2268 2158 0 0 C 782 169 t 0 r /Helvetica findfont 41.1481 sf 0 0 m (1) show NC gr 
 gsave  2268 2158 0 0 C 1042 169 t 0 r /Helvetica findfont 41.1481 sf 0 0 m (1.5) show NC gr 
 gsave  2268 2158 0 0 C 1344 169 t 0 r /Helvetica findfont 41.1481 sf 0 0 m (2) show NC gr 
 gsave  2268 2158 0 0 C 1609 169 t 0 r /Helvetica findfont 41.1481 sf 0 0 m (2.5) show NC gr 
 gsave  2268 2158 0 0 C 1911 169 t 0 r /Helvetica findfont 41.1481 sf 0 0 m (3) show NC gr 
 gr  gr 
showpage
end
%%EOF
