%!PS-Adobe-3.0 EPSF-3.0
%%BoundingBox: (atend)
%%LanguageLevel: 2
%%Creator: Grace-5.1.22
%%CreationDate: Mon Dec 19 07:24:11 2011
%%DocumentData: Clean8Bit
%%Orientation: Portrait
%%Title: dsdpt_H_err_band.agr
%%For: laura
%%DocumentNeededResources: (atend)
%%EndComments
%%BeginProlog
/m {moveto} def
/l {lineto} def
/s {stroke} def
/n {newpath} def
/c {closepath} def
/RL {rlineto} def
/SLW {setlinewidth} def
/GS {gsave} def
/GR {grestore} def
/SC {setcolor} def
/SGRY {setgray} def
/SRGB {setrgbcolor} def
/SD {setdash} def
/SLC {setlinecap} def
/SLJ {setlinejoin} def
/SCS {setcolorspace} def
/FFSF {findfont setfont} def
/CC {concat} def
/PXL {n m 0 0 RL s} def
/Color0 {1.0000 1.0000 1.0000} def
/Color1 {0.0000 0.0000 0.0000} def
/Color2 {1.0000 0.0000 0.0000} def
/Color3 {0.0000 1.0000 0.0000} def
/Color4 {0.0000 0.0000 1.0000} def
/Color5 {1.0000 1.0000 0.0000} def
/Color6 {0.7373 0.5608 0.5608} def
/Color7 {0.8627 0.8627 0.8627} def
/Color8 {0.5804 0.0000 0.8275} def
/Color9 {0.0000 1.0000 1.0000} def
/Color10 {1.0000 0.0000 1.0000} def
/Color11 {1.0000 0.6471 0.0000} def
/Color12 {0.4471 0.1294 0.7373} def
/Color13 {0.4039 0.0275 0.2824} def
/Color14 {0.2510 0.8784 0.8157} def
/Color15 {0.0000 0.5451 0.0000} def
/Color16 {0.7529 0.7529 0.7529} def
/Color17 {0.5059 0.5059 0.5059} def
/Color18 {0.2588 0.2588 0.2588} def
/PTRN {
 /pat_bits exch def 
 <<
  /PaintType 2
  /PatternType 1 /TilingType 1
  /BBox[0 0 16 16]
  /XStep 16 /YStep 16
  /PaintProc {
   pop
   16 16 true [-1 0 0 -1 16 16] pat_bits imagemask
  }
 >>
 [0.0016 0 0 0.0016 0 0]
 makepattern
} def
/Pattern0 {<0000000000000000000000000000000000000000000000000000000000000000> PTRN} bind def
/Pattern1 {<ffffffffffffffffffffffffffffffffffffffffffffffffffffffffffffffff> PTRN} bind def
/Pattern2 {<eeeeffffbbbbffffeeeeffffbbbbffffeeeeffffbbbbffffeeeeffffbbbbffff> PTRN} bind def
/Pattern3 {<eeeebbbbeeeebbbbeeeebbbbeeeebbbbeeeebbbbeeeebbbbeeeebbbbeeeebbbb> PTRN} bind def
/Pattern4 {<5555aaaa5555aaaa5555aaaa5555aaaa5555aaaa5555aaaa5555aaaa5555aaaa> PTRN} bind def
/Pattern5 {<1111444411114444111144441111444411114444111144441111444411114444> PTRN} bind def
/Pattern6 {<1111000044440000111100004444000011110000444400001111000044440000> PTRN} bind def
/Pattern7 {<1010000000000000010100000000000010100000000000000101000000000000> PTRN} bind def
/Pattern8 {<0000000000000000000000000000000000000000000000000000000000000000> PTRN} bind def
/Pattern9 {<1e1e0f0f8787c3c3e1e1f0f078783c3c1e1e0f0f8787c3c3e1e1f0f078783c3c> PTRN} bind def
/Pattern10 {<7878f0f0e1e1c3c387870f0f1e1e3c3c7878f0f0e1e1c3c387870f0f1e1e3c3c> PTRN} bind def
/Pattern11 {<3333333333333333333333333333333333333333333333333333333333333333> PTRN} bind def
/Pattern12 {<ffffffff00000000ffffffff00000000ffffffff00000000ffffffff00000000> PTRN} bind def
/Pattern13 {<8181424224241818181824244242818181814242242418181818242442428181> PTRN} bind def
/Pattern14 {<8080404020201010080804040202010180804040202010100808040402020101> PTRN} bind def
/Pattern15 {<0101020204040808101020204040808001010202040408081010202040408080> PTRN} bind def
/Pattern16 {<2222222222222222222222222222222222222222222222222222222222222222> PTRN} bind def
/Pattern17 {<0000ffff000000000000ffff000000000000ffff000000000000ffff00000000> PTRN} bind def
/Pattern18 {<2222ffff222222222222ffff222222222222ffff222222222222ffff22222222> PTRN} bind def
/Pattern19 {<ffffffff33333333ffffffff33333333ffffffff33333333ffffffff33333333> PTRN} bind def
/Pattern20 {<0f0f0f0f0f0f0f0ff0f0f0f0f0f0f0f00f0f0f0f0f0f0f0ff0f0f0f0f0f0f0f0> PTRN} bind def
/Pattern21 {<ff00ff00ff00ff00ff00ff00ff00ff0000ff00ff00ff00ff00ff00ff00ff00ff> PTRN} bind def
/Pattern22 {<8001800180018001800180018001ffffffff8001800180018001800180018001> PTRN} bind def
/Pattern23 {<c003c003c003c003c003c003ffffffffffffffffc003c003c003c003c003c003> PTRN} bind def
/Pattern24 {<040404040404ffff404040404040ffff040404040404ffff404040404040ffff> PTRN} bind def
/Pattern25 {<180018001800180018001800ffffffff001800180018001800180018ffffffff> PTRN} bind def
/Pattern26 {<1111b8b87c7c3a3a1111a3a3c7c78b8b1111b8b87c7c3a3a1111a3a3c7c78b8b> PTRN} bind def
/Pattern27 {<101010102828c7c70101010182827c7c101010102828c7c70101010182827c7c> PTRN} bind def
/Pattern28 {<1c1c121211112121c1c12121111112121c1c121211112121c1c1212111111212> PTRN} bind def
/Pattern29 {<3e3e414180808080e3e31414080808083e3e414180808080e3e3141408080808> PTRN} bind def
/Pattern30 {<4848888884848383848488884848383848488888848483838484888848483838> PTRN} bind def
/Pattern31 {<03030404080808080c0c12122121c0c003030404080808080c0c12122121c0c0> PTRN} bind def
/ellipsedict 8 dict def
ellipsedict /mtrx matrix put
/EARC {
 ellipsedict begin
  /endangle exch def
  /startangle exch def
  /yrad exch def
  /xrad exch def
  /y exch def
  /x exch def
  /savematrix mtrx currentmatrix def
  x y translate
  xrad yrad scale
  0 0 1 startangle endangle arc
  savematrix setmatrix
 end
} def
/TL {
  /kcomp exch def
  /linewidth exch def
  /offset exch def
  GS
  0 offset rmoveto
  linewidth SLW
  dup stringwidth exch kcomp add exch RL s
  GR
} def
/KINIT
{
 /kvector exch def
 /kid 0 def
} def
/KPROC
{
 pop pop
 kvector kid get
 0 rmoveto
 /kid 1 kid add def
} def
/DefEncoding [
 /.notdef
 /.notdef
 /.notdef
 /.notdef
 /.notdef
 /.notdef
 /.notdef
 /.notdef
 /.notdef
 /.notdef
 /.notdef
 /.notdef
 /.notdef
 /.notdef
 /.notdef
 /.notdef
 /.notdef
 /.notdef
 /.notdef
 /.notdef
 /.notdef
 /.notdef
 /.notdef
 /.notdef
 /.notdef
 /.notdef
 /.notdef
 /.notdef
 /.notdef
 /.notdef
 /.notdef
 /.notdef
 /space
 /exclam
 /quotedbl
 /numbersign
 /dollar
 /percent
 /ampersand
 /quoteright
 /parenleft
 /parenright
 /asterisk
 /plus
 /comma
 /hyphen
 /period
 /slash
 /zero
 /one
 /two
 /three
 /four
 /five
 /six
 /seven
 /eight
 /nine
 /colon
 /semicolon
 /less
 /equal
 /greater
 /question
 /at
 /A
 /B
 /C
 /D
 /E
 /F
 /G
 /H
 /I
 /J
 /K
 /L
 /M
 /N
 /O
 /P
 /Q
 /R
 /S
 /T
 /U
 /V
 /W
 /X
 /Y
 /Z
 /bracketleft
 /backslash
 /bracketright
 /asciicircum
 /underscore
 /grave
 /a
 /b
 /c
 /d
 /e
 /f
 /g
 /h
 /i
 /j
 /k
 /l
 /m
 /n
 /o
 /p
 /q
 /r
 /s
 /t
 /u
 /v
 /w
 /x
 /y
 /z
 /braceleft
 /bar
 /braceright
 /asciitilde
 /.notdef
 /.notdef
 /.notdef
 /.notdef
 /.notdef
 /.notdef
 /.notdef
 /.notdef
 /.notdef
 /.notdef
 /.notdef
 /.notdef
 /.notdef
 /.notdef
 /.notdef
 /.notdef
 /.notdef
 /.notdef
 /.notdef
 /.notdef
 /.notdef
 /.notdef
 /.notdef
 /.notdef
 /.notdef
 /.notdef
 /.notdef
 /.notdef
 /.notdef
 /.notdef
 /.notdef
 /.notdef
 /.notdef
 /space
 /exclamdown
 /cent
 /sterling
 /currency
 /yen
 /brokenbar
 /section
 /dieresis
 /copyright
 /ordfeminine
 /guillemotleft
 /logicalnot
 /hyphen
 /registered
 /macron
 /degree
 /plusminus
 /twosuperior
 /threesuperior
 /acute
 /mu
 /paragraph
 /periodcentered
 /cedilla
 /onesuperior
 /ordmasculine
 /guillemotright
 /onequarter
 /onehalf
 /threequarters
 /questiondown
 /Agrave
 /Aacute
 /Acircumflex
 /Atilde
 /Adieresis
 /Aring
 /AE
 /Ccedilla
 /Egrave
 /Eacute
 /Ecircumflex
 /Edieresis
 /Igrave
 /Iacute
 /Icircumflex
 /Idieresis
 /Eth
 /Ntilde
 /Ograve
 /Oacute
 /Ocircumflex
 /Otilde
 /Odieresis
 /multiply
 /Oslash
 /Ugrave
 /Uacute
 /Ucircumflex
 /Udieresis
 /Yacute
 /Thorn
 /germandbls
 /agrave
 /aacute
 /acircumflex
 /atilde
 /adieresis
 /aring
 /ae
 /ccedilla
 /egrave
 /eacute
 /ecircumflex
 /edieresis
 /igrave
 /iacute
 /icircumflex
 /idieresis
 /eth
 /ntilde
 /ograve
 /oacute
 /ocircumflex
 /otilde
 /odieresis
 /divide
 /oslash
 /ugrave
 /uacute
 /ucircumflex
 /udieresis
 /yacute
 /thorn
 /ydieresis
] def
%%EndProlog
%%BeginSetup
%%EndSetup
612.00 612.00 scale
n
0.0000 0.0000 m
0.0000 1.0000 l
1.2941 1.0000 l
1.2941 0.0000 l
c
[/DeviceRGB] SCS
Color0 SC
fill
[/DeviceRGB] SCS
Color1 SC
[] 0 SD
0.0030 SLW
0 SLC
0 SLJ
n
0.1500 0.5418 m
0.1500 0.6507 l
0.1750 0.6507 l
0.1750 0.7004 l
0.2000 0.7004 l
0.2000 0.7327 l
0.2250 0.7327 l
0.2250 0.7507 l
0.2500 0.7507 l
0.2500 0.7684 l
0.2750 0.7684 l
0.2750 0.7718 l
0.3000 0.7718 l
0.3000 0.7828 l
0.3250 0.7828 l
0.3250 0.7824 l
0.3500 0.7824 l
0.3500 0.7773 l
0.3750 0.7773 l
0.3750 0.7833 l
0.4000 0.7833 l
0.4000 0.7871 l
0.4250 0.7871 l
0.4250 0.7805 l
0.4500 0.7805 l
0.4500 0.7624 l
0.4750 0.7624 l
0.4750 0.7618 l
0.5000 0.7618 l
0.5000 0.7559 l
0.5250 0.7559 l
0.5250 0.7541 l
0.5500 0.7541 l
0.5500 0.7369 l
0.5750 0.7369 l
0.5750 0.7342 l
0.6000 0.7342 l
0.6000 0.7256 l
0.6250 0.7256 l
0.6250 0.7131 l
0.6500 0.7131 l
0.6500 0.7003 l
0.6750 0.7003 l
0.6750 0.6996 l
0.7000 0.6996 l
0.7000 0.6826 l
0.7250 0.6826 l
0.7250 0.6711 l
0.7500 0.6711 l
0.7500 0.6622 l
0.7750 0.6622 l
0.7750 0.6384 l
0.8000 0.6384 l
0.8000 0.6325 l
0.8250 0.6325 l
0.8250 0.6307 l
0.8500 0.6307 l
0.8500 0.6180 l
0.8750 0.6180 l
0.8750 0.5988 l
0.9000 0.5988 l
0.9000 0.5787 l
0.9250 0.5787 l
0.9250 0.5624 l
0.9500 0.5624 l
0.9500 0.5553 l
0.9750 0.5553 l
0.9750 0.5337 l
1.0000 0.5337 l
1.0000 0.5319 l
1.0250 0.5319 l
1.0250 0.5277 l
1.0500 0.5277 l
1.0500 0.5057 l
1.0750 0.5057 l
1.0750 0.5083 l
1.1000 0.5083 l
1.1000 0.5047 l
1.1250 0.5047 l
1.1250 0.4641 l
1.1500 0.4641 l
1.1500 0.4558 l
1.1501 0.4558 l
s
[/DeviceRGB] SCS
Color2 SC
n
0.1500 0.5340 m
0.1500 0.6446 l
0.1750 0.6446 l
0.1750 0.6908 l
0.2000 0.6908 l
0.2000 0.7241 l
0.2250 0.7241 l
0.2250 0.7433 l
0.2500 0.7433 l
0.2500 0.7551 l
0.2750 0.7551 l
0.2750 0.7614 l
0.3000 0.7614 l
0.3000 0.7710 l
0.3250 0.7710 l
0.3250 0.7739 l
0.3500 0.7739 l
0.3500 0.7698 l
0.3750 0.7698 l
0.3750 0.7730 l
0.4000 0.7730 l
0.4000 0.7750 l
0.4250 0.7750 l
0.4250 0.7670 l
0.4500 0.7670 l
0.4500 0.7540 l
0.4750 0.7540 l
0.4750 0.7565 l
0.5000 0.7565 l
0.5000 0.7481 l
0.5250 0.7481 l
0.5250 0.7394 l
0.5500 0.7394 l
0.5500 0.7334 l
0.5750 0.7334 l
0.5750 0.7223 l
0.6000 0.7223 l
0.6000 0.7172 l
0.6250 0.7172 l
0.6250 0.7052 l
0.6500 0.7052 l
0.6500 0.6937 l
0.6750 0.6937 l
0.6750 0.6831 l
0.7000 0.6831 l
0.7000 0.6772 l
0.7250 0.6772 l
0.7250 0.6619 l
0.7500 0.6619 l
0.7500 0.6528 l
0.7750 0.6528 l
0.7750 0.6295 l
0.8000 0.6295 l
0.8000 0.6302 l
0.8250 0.6302 l
0.8250 0.6187 l
0.8500 0.6187 l
0.8500 0.6031 l
0.8750 0.6031 l
0.8750 0.5751 l
0.9000 0.5751 l
0.9000 0.5604 l
0.9250 0.5604 l
0.9250 0.5544 l
0.9500 0.5544 l
0.9500 0.5273 l
0.9750 0.5273 l
0.9750 0.5225 l
1.0000 0.5225 l
1.0000 0.5208 l
1.0250 0.5208 l
1.0250 0.5061 l
1.0500 0.5061 l
1.0500 0.5094 l
1.0750 0.5094 l
1.0750 0.4878 l
1.1000 0.4878 l
1.1000 0.4689 l
1.1250 0.4689 l
1.1250 0.4436 l
1.1500 0.4436 l
1.1500 0.4314 l
1.1501 0.4314 l
s
n
0.1500 0.5509 m
0.1500 0.6586 l
0.1750 0.6586 l
0.1750 0.7062 l
0.2000 0.7062 l
0.2000 0.7392 l
0.2250 0.7392 l
0.2250 0.7587 l
0.2500 0.7587 l
0.2500 0.7728 l
0.2750 0.7728 l
0.2750 0.7819 l
0.3000 0.7819 l
0.3000 0.7888 l
0.3250 0.7888 l
0.3250 0.7844 l
0.3500 0.7844 l
0.3500 0.7868 l
0.3750 0.7868 l
0.3750 0.7926 l
0.4000 0.7926 l
0.4000 0.7983 l
0.4250 0.7983 l
0.4250 0.7857 l
0.4500 0.7857 l
0.4500 0.7632 l
0.4750 0.7632 l
0.4750 0.7664 l
0.5000 0.7664 l
0.5000 0.7582 l
0.5250 0.7582 l
0.5250 0.7599 l
0.5500 0.7599 l
0.5500 0.7423 l
0.5750 0.7423 l
0.5750 0.7343 l
0.6000 0.7343 l
0.6000 0.7283 l
0.6250 0.7283 l
0.6250 0.7209 l
0.6500 0.7209 l
0.6500 0.7054 l
0.6750 0.7054 l
0.6750 0.6904 l
0.7000 0.6904 l
0.7000 0.6971 l
0.7250 0.6971 l
0.7250 0.6763 l
0.7500 0.6763 l
0.7500 0.6567 l
0.7750 0.6567 l
0.7750 0.6446 l
0.8000 0.6446 l
0.8000 0.6387 l
0.8250 0.6387 l
0.8250 0.6299 l
0.8500 0.6299 l
0.8500 0.6228 l
0.8750 0.6228 l
0.8750 0.5957 l
0.9000 0.5957 l
0.9000 0.5783 l
0.9250 0.5783 l
0.9250 0.5633 l
0.9500 0.5633 l
0.9500 0.5538 l
0.9750 0.5538 l
0.9750 0.5360 l
1.0000 0.5360 l
1.0000 0.5337 l
1.0250 0.5337 l
1.0250 0.5386 l
1.0500 0.5386 l
1.0500 0.5136 l
1.0750 0.5136 l
1.0750 0.5015 l
1.1000 0.5015 l
1.1000 0.4930 l
1.1250 0.4930 l
1.1250 0.4949 l
1.1500 0.4949 l
1.1500 0.4675 l
1.1501 0.4675 l
s
[/DeviceRGB] SCS
Color4 SC
n
0.1500 0.5155 m
0.1500 0.6331 l
0.1750 0.6331 l
0.1750 0.6805 l
0.2000 0.6805 l
0.2000 0.7141 l
0.2250 0.7141 l
0.2250 0.7299 l
0.2500 0.7299 l
0.2500 0.7410 l
0.2750 0.7410 l
0.2750 0.7482 l
0.3000 0.7482 l
0.3000 0.7585 l
0.3250 0.7585 l
0.3250 0.7609 l
0.3500 0.7609 l
0.3500 0.7558 l
0.3750 0.7558 l
0.3750 0.7582 l
0.4000 0.7582 l
0.4000 0.7610 l
0.4250 0.7610 l
0.4250 0.7490 l
0.4500 0.7490 l
0.4500 0.7386 l
0.4750 0.7386 l
0.4750 0.7449 l
0.5000 0.7449 l
0.5000 0.7328 l
0.5250 0.7328 l
0.5250 0.7089 l
0.5500 0.7089 l
0.5500 0.7117 l
0.5750 0.7117 l
0.5750 0.7000 l
0.6000 0.7000 l
0.6000 0.7006 l
0.6250 0.7006 l
0.6250 0.6868 l
0.6500 0.6868 l
0.6500 0.6708 l
0.6750 0.6708 l
0.6750 0.6612 l
0.7000 0.6612 l
0.7000 0.6526 l
0.7250 0.6526 l
0.7250 0.6348 l
0.7500 0.6348 l
0.7500 0.6300 l
0.7750 0.6300 l
0.7750 0.6011 l
0.8000 0.6011 l
0.8000 0.6048 l
0.8250 0.6048 l
0.8250 0.5878 l
0.8500 0.5878 l
0.8500 0.5539 l
0.8750 0.5539 l
0.8750 0.5295 l
0.9000 0.5295 l
0.9000 0.5153 l
0.9250 0.5153 l
0.9250 0.5085 l
0.9500 0.5085 l
0.9500 0.4790 l
0.9750 0.4790 l
0.9750 0.4478 l
1.0000 0.4478 l
1.0000 0.4716 l
1.0250 0.4716 l
1.0250 0.3968 l
1.0500 0.3968 l
1.0500 0.4196 l
1.0750 0.4196 l
1.0750 0.4192 l
1.1000 0.4192 l
1.1000 0.2959 l
1.1250 0.2959 l
1.1250 0.1499 l
s
n
1.1500 0.1499 m
1.1500 0.2192 l
1.1501 0.2192 l
s
n
0.1500 0.5658 m
0.1500 0.6681 l
0.1750 0.6681 l
0.1750 0.7140 l
0.2000 0.7140 l
0.2000 0.7481 l
0.2250 0.7481 l
0.2250 0.7695 l
0.2500 0.7695 l
0.2500 0.7822 l
0.2750 0.7822 l
0.2750 0.7928 l
0.3000 0.7928 l
0.3000 0.7976 l
0.3250 0.7976 l
0.3250 0.7948 l
0.3500 0.7948 l
0.3500 0.7981 l
0.3750 0.7981 l
0.3750 0.8045 l
0.4000 0.8045 l
0.4000 0.8104 l
0.4250 0.8104 l
0.4250 0.7974 l
0.4500 0.7974 l
0.4500 0.7759 l
0.4750 0.7759 l
0.4750 0.7777 l
0.5000 0.7777 l
0.5000 0.7699 l
0.5250 0.7699 l
0.5250 0.7827 l
0.5500 0.7827 l
0.5500 0.7571 l
0.5750 0.7571 l
0.5750 0.7559 l
0.6000 0.7559 l
0.6000 0.7421 l
0.6250 0.7421 l
0.6250 0.7402 l
0.6500 0.7402 l
0.6500 0.7258 l
0.6750 0.7258 l
0.6750 0.7196 l
0.7000 0.7196 l
0.7000 0.7185 l
0.7250 0.7185 l
0.7250 0.6994 l
0.7500 0.6994 l
0.7500 0.6835 l
0.7750 0.6835 l
0.7750 0.6636 l
0.8000 0.6636 l
0.8000 0.6613 l
0.8250 0.6613 l
0.8250 0.6599 l
0.8500 0.6599 l
0.8500 0.6487 l
0.8750 0.6487 l
0.8750 0.6298 l
0.9000 0.6298 l
0.9000 0.6078 l
0.9250 0.6078 l
0.9250 0.5963 l
0.9500 0.5963 l
0.9500 0.5820 l
0.9750 0.5820 l
0.9750 0.5758 l
1.0000 0.5758 l
1.0000 0.5720 l
1.0250 0.5720 l
1.0250 0.5799 l
1.0500 0.5799 l
1.0500 0.5515 l
1.0750 0.5515 l
1.0750 0.5446 l
1.1000 0.5446 l
1.1000 0.5594 l
1.1250 0.5594 l
1.1250 0.5525 l
1.1500 0.5525 l
1.1500 0.5286 l
1.1501 0.5286 l
s
[/DeviceRGB] SCS
Color1 SC
n
0.1500 0.1500 m
1.1500 0.1500 l
s
n
0.1500 0.8500 m
1.1500 0.8500 l
s
n
0.2750 0.1500 m
0.2750 0.1600 l
s
n
0.2750 0.8500 m
0.2750 0.8400 l
s
n
0.5250 0.1500 m
0.5250 0.1600 l
s
n
0.5250 0.8500 m
0.5250 0.8400 l
s
n
0.7750 0.1500 m
0.7750 0.1600 l
s
n
0.7750 0.8500 m
0.7750 0.8400 l
s
n
1.0250 0.1500 m
1.0250 0.1600 l
s
n
1.0250 0.8500 m
1.0250 0.8400 l
s
n
0.1500 0.1500 m
0.1500 0.1700 l
s
n
0.1500 0.8500 m
0.1500 0.8300 l
s
n
0.4000 0.1500 m
0.4000 0.1700 l
s
n
0.4000 0.8500 m
0.4000 0.8300 l
s
n
0.6500 0.1500 m
0.6500 0.1700 l
s
n
0.6500 0.8500 m
0.6500 0.8300 l
s
n
0.9000 0.1500 m
0.9000 0.1700 l
s
n
0.9000 0.8500 m
0.9000 0.8300 l
s
n
1.1500 0.1500 m
1.1500 0.1700 l
s
n
1.1500 0.8500 m
1.1500 0.8300 l
s
/Times-Roman findfont
dup length dict begin
 {1 index /FID ne {def} {pop pop} ifelse} forall
 /Encoding DefEncoding def
 currentdict
end
/Font0 exch definefont pop
/Font0 FFSF
0.1433 0.1212 m
GS
[0.0280 0.0000 0.0000 0.0280 0 0] CC
(0) show
GR
/Font0 FFSF
0.3794 0.1212 m
GS
[0.0280 0.0000 0.0000 0.0280 0 0] CC
(100) show
GR
/Font0 FFSF
0.6294 0.1212 m
GS
[0.0280 0.0000 0.0000 0.0280 0 0] CC
(200) show
GR
/Font0 FFSF
0.8794 0.1212 m
GS
[0.0280 0.0000 0.0000 0.0280 0 0] CC
(300) show
GR
/Font0 FFSF
1.1294 0.1212 m
GS
[0.0280 0.0000 0.0000 0.0280 0 0] CC
(400) show
GR
/Font0 FFSF
0.5782 0.0740 m
GS
[0.0344 0.0000 0.0000 0.0344 0 0] CC
(p) show
GR
/Font0 FFSF
0.5955 0.0603 m
GS
[0.0244 0.0000 0.0000 0.0244 0 0] CC
(T) show
GR
/Font0 FFSF
0.6104 0.0947 m
GS
[0.0244 0.0000 0.0000 0.0244 0 0] CC
(H) show
GR
/Font0 FFSF
0.6280 0.0740 m
GS
[0.0344 0.0000 0.0000 0.0344 0 0] CC
( [GeV]) show
GR
[] 0 SD
0.0015 SLW
n
0.1500 0.1500 m
0.1500 0.8500 l
s
n
1.1500 0.1500 m
1.1500 0.8500 l
s
[] 0 SD
0.0030 SLW
n
0.1500 0.1500 m
0.1600 0.1500 l
s
n
1.1500 0.1500 m
1.1400 0.1500 l
s
n
0.1500 0.1629 m
0.1600 0.1629 l
s
n
1.1500 0.1629 m
1.1400 0.1629 l
s
n
0.1500 0.1742 m
0.1600 0.1742 l
s
n
1.1500 0.1742 m
1.1400 0.1742 l
s
n
0.1500 0.1844 m
0.1600 0.1844 l
s
n
1.1500 0.1844 m
1.1400 0.1844 l
s
n
0.1500 0.2512 m
0.1600 0.2512 l
s
n
1.1500 0.2512 m
1.1400 0.2512 l
s
n
0.1500 0.2902 m
0.1600 0.2902 l
s
n
1.1500 0.2902 m
1.1400 0.2902 l
s
n
0.1500 0.3180 m
0.1600 0.3180 l
s
n
1.1500 0.3180 m
1.1400 0.3180 l
s
n
0.1500 0.3395 m
0.1600 0.3395 l
s
n
1.1500 0.3395 m
1.1400 0.3395 l
s
n
0.1500 0.3570 m
0.1600 0.3570 l
s
n
1.1500 0.3570 m
1.1400 0.3570 l
s
n
0.1500 0.3719 m
0.1600 0.3719 l
s
n
1.1500 0.3719 m
1.1400 0.3719 l
s
n
0.1500 0.3847 m
0.1600 0.3847 l
s
n
1.1500 0.3847 m
1.1400 0.3847 l
s
n
0.1500 0.3961 m
0.1600 0.3961 l
s
n
1.1500 0.3961 m
1.1400 0.3961 l
s
n
0.1500 0.4062 m
0.1600 0.4062 l
s
n
1.1500 0.4062 m
1.1400 0.4062 l
s
n
0.1500 0.4730 m
0.1600 0.4730 l
s
n
1.1500 0.4730 m
1.1400 0.4730 l
s
n
0.1500 0.5121 m
0.1600 0.5121 l
s
n
1.1500 0.5121 m
1.1400 0.5121 l
s
n
0.1500 0.5398 m
0.1600 0.5398 l
s
n
1.1500 0.5398 m
1.1400 0.5398 l
s
n
0.1500 0.5613 m
0.1600 0.5613 l
s
n
1.1500 0.5613 m
1.1400 0.5613 l
s
n
0.1500 0.5789 m
0.1600 0.5789 l
s
n
1.1500 0.5789 m
1.1400 0.5789 l
s
n
0.1500 0.5938 m
0.1600 0.5938 l
s
n
1.1500 0.5938 m
1.1400 0.5938 l
s
n
0.1500 0.6066 m
0.1600 0.6066 l
s
n
1.1500 0.6066 m
1.1400 0.6066 l
s
n
0.1500 0.6180 m
0.1600 0.6180 l
s
n
1.1500 0.6180 m
1.1400 0.6180 l
s
n
0.1500 0.6281 m
0.1600 0.6281 l
s
n
1.1500 0.6281 m
1.1400 0.6281 l
s
n
0.1500 0.6949 m
0.1600 0.6949 l
s
n
1.1500 0.6949 m
1.1400 0.6949 l
s
n
0.1500 0.7340 m
0.1600 0.7340 l
s
n
1.1500 0.7340 m
1.1400 0.7340 l
s
n
0.1500 0.7617 m
0.1600 0.7617 l
s
n
1.1500 0.7617 m
1.1400 0.7617 l
s
n
0.1500 0.7832 m
0.1600 0.7832 l
s
n
1.1500 0.7832 m
1.1400 0.7832 l
s
n
0.1500 0.8008 m
0.1600 0.8008 l
s
n
1.1500 0.8008 m
1.1400 0.8008 l
s
n
0.1500 0.8156 m
0.1600 0.8156 l
s
n
1.1500 0.8156 m
1.1400 0.8156 l
s
n
0.1500 0.8285 m
0.1600 0.8285 l
s
n
1.1500 0.8285 m
1.1400 0.8285 l
s
n
0.1500 0.8398 m
0.1600 0.8398 l
s
n
1.1500 0.8398 m
1.1400 0.8398 l
s
n
0.1500 0.8500 m
0.1600 0.8500 l
s
n
1.1500 0.8500 m
1.1400 0.8500 l
s
n
0.1500 0.1844 m
0.1700 0.1844 l
s
n
1.1500 0.1844 m
1.1300 0.1844 l
s
n
0.1500 0.4062 m
0.1700 0.4062 l
s
n
1.1500 0.4062 m
1.1300 0.4062 l
s
n
0.1500 0.6281 m
0.1700 0.6281 l
s
n
1.1500 0.6281 m
1.1300 0.6281 l
s
n
0.1500 0.8500 m
0.1700 0.8500 l
s
n
1.1500 0.8500 m
1.1300 0.8500 l
s
/Font0 FFSF
0.0773 0.1750 m
GS
[0.0280 0.0000 0.0000 0.0280 0 0] CC
(1e-06) show
GR
/Font0 FFSF
0.0780 0.3968 m
GS
[0.0280 0.0000 0.0000 0.0280 0 0] CC
(1e-05) show
GR
/Font0 FFSF
0.0659 0.6189 m
GS
[0.0280 0.0000 0.0000 0.0280 0 0] CC
(0.0001) show
GR
/Font0 FFSF
0.0800 0.8408 m
GS
[0.0280 0.0000 0.0000 0.0280 0 0] CC
(0.001) show
GR
/Font0 FFSF
0.0421 0.3739 m
GS
[0.0000 0.0344 -0.0344 0.0000 0 0] CC
(d) show
GR
/Symbol findfont
/Font12 exch definefont pop
/Font12 FFSF
0.0421 0.3912 m
GS
[0.0000 0.0344 -0.0344 0.0000 0 0] CC
(s) show
GR
/Font0 FFSF
0.0421 0.4120 m
GS
[0.0000 0.0344 -0.0344 0.0000 0 0] CC
(/dp) show
GR
/Font0 FFSF
0.0559 0.4559 m
GS
[0.0000 0.0244 -0.0244 0.0000 0 0] CC
(T) show
GR
/Font0 FFSF
0.0214 0.4708 m
GS
[0.0000 0.0244 -0.0244 0.0000 0 0] CC
(H) show
GR
/Font0 FFSF
0.0421 0.4884 m
GS
[0.0000 0.0344 -0.0344 0.0000 0 0] CC
( [pb/GeV]) show
GR
/Font0 FFSF
1.1892 0.5475 m
GS
[0.0000 0.0280 -0.0280 0.0000 0 0] CC
(LHC HIGGS XS WG 2011) show
GR
n
0.1500 0.1500 m
0.1500 0.8500 l
1.1500 0.8500 l
1.1500 0.1500 l
0.1500 0.1500 l
c
s
/Font0 FFSF
0.3333 0.5162 m
GS
[0.0325 0.0000 0.0000 0.0325 0 0] CC
(LHC at 7 TeV) show
GR
n
0.2750 0.3395 m
0.2750 0.2265 l
0.5792 0.2265 l
0.5792 0.3395 l
c
[/DeviceRGB] SCS
Color0 SC
fill
[/DeviceRGB] SCS
Color1 SC
n
0.2750 0.3395 m
0.2750 0.2265 l
0.5792 0.2265 l
0.5792 0.3395 l
0.2750 0.3395 l
c
s
/Font0 FFSF
0.3465 0.3055 m
GS
[0.0350 0.0000 0.0000 0.0350 0 0] CC
(central value) show
GR
n
0.2865 0.3173 m
0.3265 0.3173 l
s
/Font0 FFSF
0.3465 0.2712 m
GS
[0.0350 0.0000 0.0000 0.0350 0 0] CC
(error from scale) show
GR
[/DeviceRGB] SCS
Color2 SC
n
0.2865 0.2830 m
0.3265 0.2830 l
s
/Font0 FFSF
[/DeviceRGB] SCS
Color1 SC
0.3465 0.2369 m
GS
[0.0350 0.0000 0.0000 0.0350 0 0] CC
(total error) show
GR
[/DeviceRGB] SCS
Color4 SC
n
0.2865 0.2487 m
0.3265 0.2487 l
s
%%Trailer
%%BoundingBox: 2 35 730 528
%%DocumentNeededResources: font Times-Roman
%%+ font Symbol
%%EOF
