%!PS-Adobe-2.0 EPSF-2.0
%%BoundingBox:  0 0 567 544
%%Title: xsecvspt_mh120_nlo_29Nov2011.eps: Higgs Cross Section
%%Creator: ROOT Version 5.30/02
%%CreationDate: Tue Nov 29 14:32:18 2011
%%EndComments
%%BeginProlog
80 dict begin
/s {stroke} def /l {lineto} def /m {moveto} def /t {translate} def
/r {rotate} def /rl {roll}  def /R {repeat} def
/d {rlineto} def /rm {rmoveto} def /gr {grestore} def /f {eofill} def
/c {setrgbcolor} def /black {0 setgray} def /sd {setdash} def
/cl {closepath} def /sf {scalefont setfont} def /lw {setlinewidth} def
/box {m dup 0 exch d exch 0 d 0 exch neg d cl} def
/NC{systemdict begin initclip end}def/C{NC box clip newpath}def
/bl {box s} def /bf {box f} def /Y { 0 exch d} def /X { 0 d} def 
/K {{pop pop 0 moveto} exch kshow} bind def
/ita {/ang 15 def gsave [1 0 ang dup sin exch cos div 1 0 0] concat} def 
/mp {newpath /y exch def /x exch def} def
/side {[w .77 mul w .23 mul] .385 w mul sd w 0 l currentpoint t -144 r} def
/mr {mp x y w2 0 360 arc} def /m24 {mr s} def /m20 {mr f} def
/mb {mp x y w2 add m w2 neg 0 d 0 w neg d w 0 d 0 w d cl} def
/mt {mp x y w2 add m w2 neg w neg d w 0 d cl} def
/m21 {mb f} def /m25 {mb s} def /m22 {mt f} def /m26{mt s} def
/m23 {mp x y w2 sub m w2 w d w neg 0 d cl f} def
/m27 {mp x y w2 add m w3 neg w2 neg d w3 w2 neg d w3 w2 d cl s} def
/m28 {mp x w2 sub y w2 sub w3 add m w3 0 d  0 w3 neg d w3 0 d 0 w3 d w3 0 d  0 w3 d w3 neg 0 d 0 w3 d w3 neg 0 d 0 w3 neg d w3 neg 0 d cl s } def
/m29 {mp gsave x w2 sub y w2 add w3 sub m currentpoint t 4 {side} repeat cl fill gr} def
/m30 {mp gsave x w2 sub y w2 add w3 sub m currentpoint t 4 {side} repeat cl s gr} def
/m31 {mp x y w2 sub m 0 w d x w2 sub y m w 0 d x w2 sub y w2 add m w w neg d x w2 sub y w2 sub m w w d s} def
/m32 {mp x y w2 sub m w2 w d w neg 0 d cl s} def
/m33 {mp x y w2 add m w3 neg w2 neg d w3 w2 neg d w3 w2 d cl f} def
/m34 {mp x w2 sub y w2 sub w3 add m w3 0 d  0 w3 neg d w3 0 d 0 w3 d w3 0 d  0 w3 d w3 neg 0 d 0 w3 d w3 neg 0 d 0 w3 neg d w3 neg 0 d cl f } def
/m2 {mp x y w2 sub m 0 w d x w2 sub y m w 0 d s} def
/m5 {mp x w2 sub y w2 sub m w w d x w2 sub y w2 add m w w neg d s} def
/reEncode {exch findfont dup length dict begin {1 index /FID eq  {pop pop} {def} ifelse } forall /Encoding exch def currentdict end dup /FontName get exch definefont pop } def [/Times-Bold /Times-Italic /Times-BoldItalic /Helvetica /Helvetica-Oblique
 /Helvetica-Bold /Helvetica-BoldOblique /Courier /Courier-Oblique /Courier-Bold /Courier-BoldOblique /Times-Roman /AvantGarde-Book /AvantGarde-BookOblique /AvantGarde-Demi /AvantGarde-DemiOblique /Bookman-Demi /Bookman-DemiItalic /Bookman-Light
 /Bookman-LightItalic /Helvetica-Narrow /Helvetica-Narrow-Bold /Helvetica-Narrow-BoldOblique /Helvetica-Narrow-Oblique /NewCenturySchlbk-Roman /NewCenturySchlbk-Bold /NewCenturySchlbk-BoldItalic /NewCenturySchlbk-Italic /Palatino-Bold
 /Palatino-BoldItalic /Palatino-Italic /Palatino-Roman ] {ISOLatin1Encoding reEncode } forall%%EndProlog
%%BeginSetup
%%EndSetup
newpath  gsave  .25 .25 scale  gsave  0 0 t black[  ] 0 sd 3 lw 1 1 1 c 2268 2176 0 0 bf black 1 1 1 c 1791 1720 363 348 bf black 1791 1720 363 348 bl 1 1 1 c 1791 1720 363 348 bf black 1791 1720 363 348 bl 363 348 m 1791 X s
 gsave  2268 2176 0 0 C 1894.84 98.9272 t 0 r /Helvetica findfont 102.732 sf 0 0 m ([GeV]) show NC gr 
 gsave  2268 2176 0 0 C 1693.18 45.6587 t 0 r /Helvetica findfont 68.4881 sf 0 0 m 
 162 143 105 72 53 34
(T, veto) K NC gr 
 gsave  2268 2176 0 0 C 1639.91 98.9272 t 0 r /Helvetica findfont 102.732 sf 0 0 m (p) show NC gr  444 400 m -52 Y s 485 374 m -26 Y s 526 374 m -26 Y s 566 374 m -26 Y s 607 374 m -26 Y s 648 400 m -52 Y s 689 374 m -26 Y s 729 374 m -26 Y s 770 374
 m -26 Y s 811 374 m -26 Y s 851 400 m -52 Y s 892 374 m -26 Y s 933 374 m -26 Y s 974 374 m -26 Y s 1014 374 m -26 Y s 1055 400 m -52 Y s 1096 374 m -26 Y s 1136 374 m -26 Y s 1177 374 m -26 Y s 1218 374 m -26 Y s 1259 400 m -52 Y s 1299 374 m -26 Y
 s 1340 374 m -26 Y s 1381 374 m -26 Y s 1421 374 m -26 Y s 1462 400 m -52 Y s 1503 374 m -26 Y s 1544 374 m -26 Y s 1584 374 m -26 Y s 1625 374 m -26 Y s 1666 400 m -52 Y s 1706 374 m -26 Y s 1747 374 m -26 Y s 1788 374 m -26 Y s 1829 374 m -26 Y s
 1869 400 m -52 Y s 1910 374 m -26 Y s 1951 374 m -26 Y s 1991 374 m -26 Y s 2032 374 m -26 Y s 2073 400 m -52 Y s 444 400 m -52 Y s 404 374 m -26 Y s 2073 400 m -52 Y s 2114 374 m -26 Y s 2154 374 m -26 Y s
 gsave  2268 2176 0 0 C 384.294 251.123 t 0 r /Helvetica findfont 102.732 sf 0 0 m (20) show NC gr 
 gsave  2268 2176 0 0 C 589.758 251.123 t 0 r /Helvetica findfont 102.732 sf 0 0 m (30) show NC gr 
 gsave  2268 2176 0 0 C 791.418 251.123 t 0 r /Helvetica findfont 102.732 sf 0 0 m (40) show NC gr 
 gsave  2268 2176 0 0 C 996.882 251.123 t 0 r /Helvetica findfont 102.732 sf 0 0 m (50) show NC gr 
 gsave  2268 2176 0 0 C 1198.54 251.123 t 0 r /Helvetica findfont 102.732 sf 0 0 m (60) show NC gr 
 gsave  2268 2176 0 0 C 1404.01 251.123 t 0 r /Helvetica findfont 102.732 sf 0 0 m (70) show NC gr 
 gsave  2268 2176 0 0 C 1605.67 251.123 t 0 r /Helvetica findfont 102.732 sf 0 0 m (80) show NC gr 
 gsave  2268 2176 0 0 C 1811.13 251.123 t 0 r /Helvetica findfont 102.732 sf 0 0 m (90) show NC gr 
 gsave  2268 2176 0 0 C 1986.15 251.123 t 0 r /Helvetica findfont 102.732 sf 0 0 m (100) show NC gr  363 2068 m 1791 X s 444 2016 m 52 Y s 485 2042 m 26 Y s 526 2042 m 26 Y s 566 2042 m 26 Y s 607 2042 m 26 Y s 648 2016 m 52 Y s 689 2042 m 26 Y s 729
 2042 m 26 Y s 770 2042 m 26 Y s 811 2042 m 26 Y s 851 2016 m 52 Y s 892 2042 m 26 Y s 933 2042 m 26 Y s 974 2042 m 26 Y s 1014 2042 m 26 Y s 1055 2016 m 52 Y s 1096 2042 m 26 Y s 1136 2042 m 26 Y s 1177 2042 m 26 Y s 1218 2042 m 26 Y s 1259 2016 m
 52 Y s 1299 2042 m 26 Y s 1340 2042 m 26 Y s 1381 2042 m 26 Y s 1421 2042 m 26 Y s 1462 2016 m 52 Y s 1503 2042 m 26 Y s 1544 2042 m 26 Y s 1584 2042 m 26 Y s 1625 2042 m 26 Y s 1666 2016 m 52 Y s 1706 2042 m 26 Y s 1747 2042 m 26 Y s 1788 2042 m 26
 Y s 1829 2042 m 26 Y s 1869 2016 m 52 Y s 1910 2042 m 26 Y s 1951 2042 m 26 Y s 1991 2042 m 26 Y s 2032 2042 m 26 Y s 2073 2016 m 52 Y s 444 2016 m 52 Y s 404 2042 m 26 Y s 2073 2016 m 52 Y s 2114 2042 m 26 Y s 2154 2042 m 26 Y s 363 348 m 1720 Y s
 gsave  2268 2176 0 0 C 133.171 818.052 t 90 r /Helvetica findfont 102.732 sf 0 0 m (Cross\255section after veto [fb]) show NC gr  417 568 m -54 X s 390 612 m -27 X s 390 657 m -27 X s 390 701 m -27 X s 390 746 m -27 X s 417 790 m -54 X s 390 834 m
 -27 X s 390 879 m -27 X s 390 923 m -27 X s 390 967 m -27 X s 417 1012 m -54 X s 390 1056 m -27 X s 390 1101 m -27 X s 390 1145 m -27 X s 390 1189 m -27 X s 417 1234 m -54 X s 390 1278 m -27 X s 390 1322 m -27 X s 390 1367 m -27 X s 390 1411 m -27 X
 s 417 1456 m -54 X s 390 1500 m -27 X s 390 1544 m -27 X s 390 1589 m -27 X s 390 1633 m -27 X s 417 1677 m -54 X s 390 1722 m -27 X s 390 1766 m -27 X s 390 1811 m -27 X s 390 1855 m -27 X s 417 1899 m -54 X s 417 568 m -54 X s 390 524 m -27 X s
 390 479 m -27 X s 390 435 m -27 X s 390 391 m -27 X s 417 1899 m -54 X s 390 1944 m -27 X s 390 1988 m -27 X s 390 2032 m -27 X s
 gsave  2268 2176 0 0 C 182.635 532.685 t 0 r /Helvetica findfont 102.732 sf 0 0 m (255) show NC gr 
 gsave  2268 2176 0 0 C 182.635 753.369 t 0 r /Helvetica findfont 102.732 sf 0 0 m (260) show NC gr 
 gsave  2268 2176 0 0 C 182.635 974.053 t 0 r /Helvetica findfont 102.732 sf 0 0 m (265) show NC gr 
 gsave  2268 2176 0 0 C 182.635 1198.54 t 0 r /Helvetica findfont 102.732 sf 0 0 m (270) show NC gr 
 gsave  2268 2176 0 0 C 182.635 1419.23 t 0 r /Helvetica findfont 102.732 sf 0 0 m (275) show NC gr 
 gsave  2268 2176 0 0 C 182.635 1639.91 t 0 r /Helvetica findfont 102.732 sf 0 0 m (280) show NC gr 
 gsave  2268 2176 0 0 C 182.635 1864.4 t 0 r /Helvetica findfont 102.732 sf 0 0 m (285) show NC gr  2154 348 m 1720 Y s 2101 568 m 53 X s 2127 612 m 27 X s 2127 657 m 27 X s 2127 701 m 27 X s 2127 746 m 27 X s 2101 790 m 53 X s 2127 834 m 27 X s 2127
 879 m 27 X s 2127 923 m 27 X s 2127 967 m 27 X s 2101 1012 m 53 X s 2127 1056 m 27 X s 2127 1101 m 27 X s 2127 1145 m 27 X s 2127 1189 m 27 X s 2101 1234 m 53 X s 2127 1278 m 27 X s 2127 1322 m 27 X s 2127 1367 m 27 X s 2127 1411 m 27 X s 2101 1456
 m 53 X s 2127 1500 m 27 X s 2127 1544 m 27 X s 2127 1589 m 27 X s 2127 1633 m 27 X s 2101 1677 m 53 X s 2127 1722 m 27 X s 2127 1766 m 27 X s 2127 1811 m 27 X s 2127 1855 m 27 X s 2101 1899 m 53 X s 2101 568 m 53 X s 2127 524 m 27 X s 2127 479 m 27
 X s 2127 435 m 27 X s 2127 391 m 27 X s 2101 1899 m 53 X s 2127 1944 m 27 X s 2127 1988 m 27 X s 2127 2032 m 27 X s 6 lw 444 863 m 24 70 d 21 58 d 20 56 d 21 51 d 16 40 d 24 56 d 21 46 d 19 39 d 15 30 d 16 28 d 7 11 d 13 20 d 16 20 d 73 76 d 57 63 d
 24 24 d 20 18 d 27 22 d 29 20 d 30 18 d 16 9 d 27 12 d 33 12 d 42 12 d 38 9 d 46 8 d 120 15 d 150 21 d 53 5 d 204 11 d 203 17 d 117 6 d 87 2 d s 3 lw /w 37 def /w2 {w 2 div} def /w3 {w 3 div} def 444 863 546 1138 648 1348 750 1464 851 1569 953 1638
 1055 1674 1259 1706 1462 1732 1666 1743 1869 1760 2073 1768 12 { m20} R 6 lw 1 0 0 c black 1 0 0 c 444 951 m 16 39 d 18 43 d 18 40 d 18 39 d 18 36 d 14 27 d 16 28 d 18 30 d 19 30 d 19 28 d 21 28 d 9 11 d 16 20 d 19 19 d 19 19 d 48 42 d 34 29 d 27 22
 d 26 19 d 14 10 d 29 17 d 27 15 d 27 12 d 19 8 d 22 7 d 80 16 d 98 20 d 70 12 d 36 5 d 66 8 d 137 13 d 119 9 d 85 4 d 203 3 d 204 3 d s 3 lw 444 951 546 1175 648 1330 750 1430 851 1510 953 1562 1055 1585 1259 1622 1462 1643 1666 1656 1869 1659 2073
 1662 12 { m21} R 6 lw 0 0 1 c black 0 0 1 c 444 426 m 16 63 d 18 68 d 18 66 d 18 62 d 18 58 d 14 42 d 16 45 d 18 47 d 20 50 d 25 59 d 23 49 d 26 55 d 25 47 d 19 34 d 19 30 d 13 19 d 17 22 d 22 23 d 62 54 d 62 57 d 27 22 d 13 9 d 27 17 d 31 15 d 44
 20 d 67 28 d 53 20 d 52 16 d 32 8 d 47 9 d 156 16 d 151 19 d 53 5 d 60 1 d 143 -2 d 204 -3 d s 3 lw 444 426 546 785 648 1035 750 1220 851 1319 953 1407 1055 1459 1259 1531 1462 1556 1666 1580 1869 1579 2073 1576 12 { m22} R 6 lw 1 0 0 c[  12 12 ] 0
 sd black 1 0 0 c 444 987 m 16 48 d 18 53 d 18 51 d 18 48 d 18 44 d 14 34 d 16 35 d 18 38 d 19 37 d 19 35 d 21 35 d 9 14 d 16 24 d 19 24 d 19 23 d 48 52 d 34 37 d 27 27 d 26 24 d 14 12 d 29 22 d 27 18 d 27 15 d 19 10 d 22 8 d 80 20 d 99 25 d 69 15 d
 36 7 d 66 10 d 137 15 d 120 11 d 84 6 d 203 3 d 204 4 d s[  ] 0 sd 3 lw 444 987 546 1265 648 1459 750 1582 851 1682 953 1747 1055 1775 1259 1822 1462 1847 1666 1864 1869 1867 2073 1871 12 { m23} R[  12 12 ] 0 sd 6 lw 0 0 1 c black 0 0 1 c 444 1062 m
 16 50 d 18 56 d 18 53 d 18 50 d 18 46 d 14 34 d 16 36 d 18 38 d 20 40 d 25 47 d 23 39 d 26 44 d 25 38 d 19 28 d 19 24 d 13 15 d 17 18 d 22 19 d 62 43 d 62 45 d 27 18 d 13 8 d 27 13 d 31 13 d 44 15 d 67 23 d 53 16 d 52 13 d 32 6 d 47 8 d 156 12 d 151
 16 d 53 3 d 60 2 d 143 -2 d 204 -2 d s[  ] 0 sd 3 lw 444 1062 546 1351 648 1551 750 1700 851 1780 953 1851 1055 1892 1259 1950 1462 1970 1666 1989 1869 1989 2073 1987 12 { m24} R[  12 12 ] 0 sd 6 lw 1 1 1 c[  ] 0 sd 3 lw 884 871 1134 435 bf black
 gsave  2268 2176 0 0 C 1354.54 1190.93 t 0 r /Helvetica findfont 79.9028 sf 0 0 m 
 444 399 380 335 286 264 245 200 173 150 104 59
(Central Value) K NC gr  6 lw 1167 1219 m 155 X s 3 lw 1244 1219 m20 6 lw
 gsave  2268 2176 0 0 C 1951.91 1012.1 t 0 r /Helvetica findfont 53.2685 sf 0 0 m (W) show NC gr 
 gsave  2268 2176 0 0 C 1776.89 1034.93 t 0 r /Helvetica findfont 79.9028 sf 0 0 m (=2 M) show NC gr 
 gsave  2268 2176 0 0 C 1738.84 993.077 t 0 r /Helvetica findfont 53.2685 sf 0 0 m (R) show NC gr 
 gsave  2268 2176 0 0 C 1693.18 1034.93 t 0 r /Symbol findfont 79.9028 sf 0 0 m (m) show NC gr 
 gsave  2268 2176 0 0 C 1658.93 1034.93 t 0 r /Helvetica findfont 79.9028 sf 0 0 m (, ) show NC gr 
 gsave  2268 2176 0 0 C 1605.67 1012.1 t 0 r /Helvetica findfont 53.2685 sf 0 0 m (W) show NC gr 
 gsave  2268 2176 0 0 C 1430.64 1034.93 t 0 r /Helvetica findfont 79.9028 sf 0 0 m (=2 M) show NC gr 
 gsave  2268 2176 0 0 C 1400.2 993.077 t 0 r /Helvetica findfont 53.2685 sf 0 0 m (F) show NC gr 
 gsave  2268 2176 0 0 C 1354.54 1034.93 t 0 r /Symbol findfont 79.9028 sf 0 0 m (m) show NC gr  1 0 0 c 1167 1045 m 155 X s 3 lw 1244 1045 m21 6 lw black
 gsave  2268 2176 0 0 C 1944.3 859.906 t 0 r /Helvetica findfont 79.9028 sf 0 0 m (/2) show NC gr 
 gsave  2268 2176 0 0 C 1891.03 837.077 t 0 r /Helvetica findfont 53.2685 sf 0 0 m (W) show NC gr 
 gsave  2268 2176 0 0 C 1780.69 859.906 t 0 r /Helvetica findfont 79.9028 sf 0 0 m (=M) show NC gr 
 gsave  2268 2176 0 0 C 1742.64 818.052 t 0 r /Helvetica findfont 53.2685 sf 0 0 m (R) show NC gr 
 gsave  2268 2176 0 0 C 1696.98 859.906 t 0 r /Symbol findfont 79.9028 sf 0 0 m (m) show NC gr 
 gsave  2268 2176 0 0 C 1594.25 859.906 t 0 r /Helvetica findfont 79.9028 sf 0 0 m (/2, ) show NC gr 
 gsave  2268 2176 0 0 C 1540.98 837.077 t 0 r /Helvetica findfont 53.2685 sf 0 0 m (W) show NC gr 
 gsave  2268 2176 0 0 C 1430.64 859.906 t 0 r /Helvetica findfont 79.9028 sf 0 0 m (=M) show NC gr 
 gsave  2268 2176 0 0 C 1400.2 818.052 t 0 r /Helvetica findfont 53.2685 sf 0 0 m (F) show NC gr 
 gsave  2268 2176 0 0 C 1354.54 859.906 t 0 r /Symbol findfont 79.9028 sf 0 0 m (m) show NC gr  0 0 1 c 1167 871 m 155 X s 3 lw 1244 871 m22 6 lw black
 gsave  2268 2176 0 0 C 1940.5 688.686 t 0 r /Helvetica findfont 79.9028 sf 0 0 m (/2) show NC gr 
 gsave  2268 2176 0 0 C 1887.23 665.856 t 0 r /Helvetica findfont 53.2685 sf 0 0 m (W) show NC gr 
 gsave  2268 2176 0 0 C 1776.89 688.686 t 0 r /Helvetica findfont 79.9028 sf 0 0 m (=M) show NC gr 
 gsave  2268 2176 0 0 C 1738.84 646.832 t 0 r /Helvetica findfont 53.2685 sf 0 0 m (R) show NC gr 
 gsave  2268 2176 0 0 C 1693.18 688.686 t 0 r /Symbol findfont 79.9028 sf 0 0 m (m) show NC gr 
 gsave  2268 2176 0 0 C 1658.93 688.686 t 0 r /Helvetica findfont 79.9028 sf 0 0 m (, ) show NC gr 
 gsave  2268 2176 0 0 C 1605.67 665.856 t 0 r /Helvetica findfont 53.2685 sf 0 0 m (W) show NC gr 
 gsave  2268 2176 0 0 C 1430.64 688.686 t 0 r /Helvetica findfont 79.9028 sf 0 0 m (=2 M) show NC gr 
 gsave  2268 2176 0 0 C 1400.2 646.832 t 0 r /Helvetica findfont 53.2685 sf 0 0 m (F) show NC gr 
 gsave  2268 2176 0 0 C 1354.54 688.686 t 0 r /Symbol findfont 79.9028 sf 0 0 m (m) show NC gr  1 0 0 c[  12 12 ] 0 sd 1167 696 m 155 X s[  ] 0 sd 3 lw 1244 696 m23[  12 12 ] 0 sd 6 lw black
 gsave  2268 2176 0 0 C 1955.72 490.831 t 0 r /Helvetica findfont 53.2685 sf 0 0 m (W) show NC gr 
 gsave  2268 2176 0 0 C 1780.69 513.661 t 0 r /Helvetica findfont 79.9028 sf 0 0 m (=2 M) show NC gr 
 gsave  2268 2176 0 0 C 1742.64 471.807 t 0 r /Helvetica findfont 53.2685 sf 0 0 m (R) show NC gr 
 gsave  2268 2176 0 0 C 1696.98 513.661 t 0 r /Symbol findfont 79.9028 sf 0 0 m (m) show NC gr 
 gsave  2268 2176 0 0 C 1594.25 513.661 t 0 r /Helvetica findfont 79.9028 sf 0 0 m (/2, ) show NC gr 
 gsave  2268 2176 0 0 C 1540.98 490.831 t 0 r /Helvetica findfont 53.2685 sf 0 0 m (W) show NC gr 
 gsave  2268 2176 0 0 C 1430.64 513.661 t 0 r /Helvetica findfont 79.9028 sf 0 0 m (=M) show NC gr 
 gsave  2268 2176 0 0 C 1400.2 471.807 t 0 r /Helvetica findfont 53.2685 sf 0 0 m (F) show NC gr 
 gsave  2268 2176 0 0 C 1354.54 513.661 t 0 r /Symbol findfont 79.9028 sf 0 0 m (m) show NC gr  0 0 1 c 1167 522 m 155 X s[  ] 0 sd 3 lw 1244 522 m24[  12 12 ] 0 sd 6 lw black
 gsave  2268 2176 0 0 C 2222.06 1579.03 t 90 r /Helvetica-BoldOblique findfont 41.8538 sf 0 0 m 
 449 429 407 384 373 341 303 291 264 237 226 199 167 136 124 95 84 54 25
(LHC HIGGS XS WG 2011) K NC gr 
 gr  gr showpage
end
%%EOF
