%!PS-Adobe-1.0
%%Creator: Unified Graphics System
%%Pages: (atend)
%%DocumentFonts: Courier
%%BoundingBox:   88  205  481  563
%%EndComments
/Sw{setlinewidth}def
/Sg{setgray}def
/Sd{setdash}def
/P {newpath
    moveto
0 0 rlineto
    stroke}def
/M {moveto}def
/D {lineto}def
/N {newpath}def
/S {stroke}def
/T {/Courier findfont
    exch
    scalefont
    setfont}def
/R {rotate}def
/W {show}def
/F {fill}def
/X {gsave}def
/Y {grestore}def
%%EndProlog
%%Page: 1 1
0.24000 0.24000 scale
1 setlinecap
1 setlinejoin
4 Sw
0 0 0 setrgbcolor
[] 0 Sd
N
859 2259 M
859 2227 D
S
N
860 2259 M
860 2227 D
S
N
860 2254 M
863 2257 D
866 2259 D
869 2259 D
874 2257 D
877 2254 D
878 2249 D
878 2246 D
877 2242 D
874 2239 D
869 2237 D
866 2237 D
863 2239 D
860 2242 D
S
N
869 2259 M
872 2257 D
875 2254 D
877 2249 D
877 2246 D
875 2242 D
872 2239 D
869 2237 D
S
N
854 2259 M
860 2259 D
S
N
854 2227 M
865 2227 D
S
N
890 2259 M
890 2227 D
S
N
892 2259 M
892 2227 D
S
N
892 2254 M
895 2257 D
898 2259 D
901 2259 D
906 2257 D
909 2254 D
910 2249 D
910 2246 D
909 2242 D
906 2239 D
901 2237 D
898 2237 D
895 2239 D
892 2242 D
S
N
901 2259 M
904 2257 D
907 2254 D
909 2249 D
909 2246 D
907 2242 D
904 2239 D
901 2237 D
S
N
886 2259 M
892 2259 D
S
N
886 2227 M
896 2227 D
S
N
967 2254 M
972 2251 D
967 2248 D
S
N
963 2259 M
970 2251 D
963 2243 D
S
N
945 2251 M
970 2251 D
S
N
1010 2269 M
1010 2237 D
S
N
1011 2269 M
1011 2237 D
S
N
1029 2269 M
1029 2237 D
S
N
1031 2269 M
1031 2237 D
S
N
1005 2269 M
1016 2269 D
S
N
1025 2269 M
1035 2269 D
S
N
1011 2254 M
1029 2254 D
S
N
1005 2237 M
1016 2237 D
S
N
1025 2237 M
1035 2237 D
S
N
1046 2269 M
1046 2243 D
1047 2239 D
1050 2237 D
1053 2237 D
1056 2239 D
1058 2242 D
S
N
1047 2269 M
1047 2243 D
1049 2239 D
1050 2237 D
S
N
1041 2259 M
1053 2259 D
S
N
1069 2269 M
1069 2243 D
1070 2239 D
1073 2237 D
1076 2237 D
1079 2239 D
1081 2242 D
S
N
1070 2269 M
1070 2243 D
1072 2239 D
1073 2237 D
S
N
1064 2259 M
1076 2259 D
S
N
1059 2278 M
1093 2278 D
S
N
1188 2269 M
1188 2237 D
S
N
1189 2269 M
1189 2237 D
S
N
1188 2254 M
1185 2257 D
1182 2259 D
1179 2259 D
1174 2257 D
1171 2254 D
1170 2249 D
1170 2246 D
1171 2242 D
1174 2239 D
1179 2237 D
1182 2237 D
1185 2239 D
1188 2242 D
S
N
1179 2259 M
1176 2257 D
1173 2254 D
1171 2249 D
1171 2246 D
1173 2242 D
1176 2239 D
1179 2237 D
S
N
1183 2269 M
1189 2269 D
S
N
1188 2237 M
1194 2237 D
S
N
1226 2259 M
1210 2259 D
1206 2257 D
1203 2252 D
1201 2248 D
1201 2243 D
1203 2240 D
1204 2239 D
1207 2237 D
1210 2237 D
1215 2239 D
1218 2243 D
1219 2248 D
1219 2252 D
1218 2256 D
1216 2257 D
1213 2259 D
S
N
1210 2259 M
1207 2257 D
1204 2252 D
1203 2248 D
1203 2242 D
1204 2239 D
S
N
1210 2237 M
1213 2239 D
1216 2243 D
1218 2248 D
1218 2254 D
1216 2257 D
S
N
1216 2257 M
1226 2257 D
S
N
1259 2275 M
1232 2227 D
S
N
1284 2269 M
1284 2237 D
S
N
1286 2269 M
1286 2237 D
S
N
1284 2254 M
1281 2257 D
1278 2259 D
1275 2259 D
1271 2257 D
1268 2254 D
1266 2249 D
1266 2246 D
1268 2242 D
1271 2239 D
1275 2237 D
1278 2237 D
1281 2239 D
1284 2242 D
S
N
1275 2259 M
1272 2257 D
1269 2254 D
1268 2249 D
1268 2246 D
1269 2242 D
1272 2239 D
1275 2237 D
S
N
1280 2269 M
1286 2269 D
S
N
1284 2237 M
1290 2237 D
S
N
1301 2269 M
1301 2237 D
S
N
1303 2269 M
1312 2242 D
S
N
1301 2269 M
1312 2237 D
S
N
1322 2269 M
1312 2237 D
S
N
1322 2269 M
1322 2237 D
S
N
1324 2269 M
1324 2237 D
S
N
1296 2269 M
1303 2269 D
S
N
1322 2269 M
1328 2269 D
S
N
1296 2237 M
1306 2237 D
S
N
1318 2237 M
1328 2237 D
S
N
1338 2246 M
1338 2225 D
S
N
1339 2246 M
1339 2225 D
S
N
1335 2246 M
1347 2246 D
1350 2245 D
1351 2244 D
1352 2242 D
1352 2240 D
1351 2238 D
1350 2237 D
1347 2236 D
S
N
1347 2246 M
1349 2245 D
1350 2244 D
1351 2242 D
1351 2240 D
1350 2238 D
1349 2237 D
1347 2236 D
S
N
1339 2236 M
1347 2236 D
1350 2235 D
1351 2234 D
1352 2232 D
1352 2229 D
1351 2227 D
1350 2226 D
1347 2225 D
1335 2225 D
S
N
1347 2236 M
1349 2235 D
1350 2234 D
1351 2232 D
1351 2229 D
1350 2227 D
1349 2226 D
1347 2225 D
S
N
1360 2246 M
1360 2225 D
S
N
1361 2246 M
1361 2225 D
S
N
1357 2246 M
1369 2246 D
1372 2245 D
1373 2244 D
1374 2242 D
1374 2240 D
1373 2238 D
1372 2237 D
1369 2236 D
S
N
1369 2246 M
1371 2245 D
1372 2244 D
1373 2242 D
1373 2240 D
1372 2238 D
1371 2237 D
1369 2236 D
S
N
1361 2236 M
1369 2236 D
1372 2235 D
1373 2234 D
1374 2232 D
1374 2229 D
1373 2227 D
1372 2226 D
1369 2225 D
1357 2225 D
S
N
1369 2236 M
1371 2235 D
1372 2234 D
1373 2232 D
1373 2229 D
1372 2227 D
1371 2226 D
1369 2225 D
S
N
1410 2275 M
1410 2227 D
S
N
1411 2275 M
1411 2227 D
S
N
1410 2275 M
1420 2275 D
S
N
1410 2227 M
1420 2227 D
S
N
1432 2259 M
1432 2227 D
S
N
1434 2259 M
1434 2227 D
S
N
1434 2254 M
1437 2257 D
1440 2259 D
1443 2259 D
1447 2257 D
1450 2254 D
1452 2249 D
1452 2246 D
1450 2242 D
1447 2239 D
1443 2237 D
1440 2237 D
1437 2239 D
1434 2242 D
S
N
1443 2259 M
1446 2257 D
1449 2254 D
1450 2249 D
1450 2246 D
1449 2242 D
1446 2239 D
1443 2237 D
S
N
1428 2259 M
1434 2259 D
S
N
1428 2227 M
1438 2227 D
S
N
1464 2269 M
1464 2237 D
S
N
1466 2269 M
1466 2237 D
S
N
1466 2254 M
1469 2257 D
1472 2259 D
1475 2259 D
1479 2257 D
1482 2254 D
1484 2249 D
1484 2246 D
1482 2242 D
1479 2239 D
1475 2237 D
1472 2237 D
1469 2239 D
1466 2242 D
S
N
1475 2259 M
1478 2257 D
1481 2254 D
1482 2249 D
1482 2246 D
1481 2242 D
1478 2239 D
1475 2237 D
S
N
1459 2269 M
1466 2269 D
S
N
1502 2275 M
1502 2227 D
S
N
1503 2275 M
1503 2227 D
S
N
1493 2275 M
1503 2275 D
S
N
1493 2227 M
1503 2227 D
S
N
1565 2255 M
1565 2254 D
1564 2254 D
1564 2255 D
1565 2257 D
1568 2259 D
1574 2259 D
1577 2257 D
1579 2255 D
1580 2252 D
1580 2242 D
1582 2239 D
1583 2237 D
S
N
1579 2255 M
1579 2242 D
1580 2239 D
1583 2237 D
1585 2237 D
S
N
1579 2252 M
1577 2251 D
1568 2249 D
1564 2248 D
1562 2245 D
1562 2242 D
1564 2239 D
1568 2237 D
1573 2237 D
1576 2239 D
1579 2242 D
S
N
1568 2249 M
1565 2248 D
1564 2245 D
1564 2242 D
1565 2239 D
1568 2237 D
S
N
1595 2269 M
1595 2243 D
1597 2239 D
1600 2237 D
1603 2237 D
1606 2239 D
1607 2242 D
S
N
1597 2269 M
1597 2243 D
1598 2239 D
1600 2237 D
S
N
1591 2259 M
1603 2259 D
S
N
1642 2269 M
1642 2237 D
S
N
1644 2269 M
1644 2237 D
S
N
1638 2269 M
1648 2269 D
S
N
1638 2237 M
1660 2237 D
1660 2246 D
1659 2237 D
S
N
1669 2269 M
1669 2237 D
S
N
1671 2269 M
1671 2237 D
S
N
1689 2269 M
1689 2237 D
S
N
1690 2269 M
1690 2237 D
S
N
1665 2269 M
1675 2269 D
S
N
1684 2269 M
1695 2269 D
S
N
1671 2254 M
1689 2254 D
S
N
1665 2237 M
1675 2237 D
S
N
1684 2237 M
1695 2237 D
S
N
1724 2265 M
1725 2260 D
1725 2269 D
1724 2265 D
1721 2268 D
1716 2269 D
1713 2269 D
1709 2268 D
1706 2265 D
1704 2262 D
1702 2257 D
1702 2249 D
1704 2245 D
1706 2242 D
1709 2239 D
1713 2237 D
1716 2237 D
1721 2239 D
1724 2242 D
1725 2245 D
S
N
1713 2269 M
1710 2268 D
1707 2265 D
1706 2262 D
1704 2257 D
1704 2249 D
1706 2245 D
1707 2242 D
1710 2239 D
1713 2237 D
S
N
1758 2269 M
1758 2260 D
S
N
1758 2263 M
1760 2266 D
1763 2269 D
1766 2269 D
1773 2265 D
1776 2265 D
1778 2266 D
1779 2269 D
S
N
1760 2266 M
1763 2268 D
1766 2268 D
1773 2265 D
S
N
1779 2269 M
1779 2265 D
1778 2260 D
1772 2252 D
1770 2249 D
1769 2245 D
1769 2237 D
S
N
1778 2260 M
1770 2252 D
1769 2249 D
1767 2245 D
1767 2237 D
S
N
1822 2269 M
1822 2237 D
S
N
1823 2269 M
1823 2237 D
S
N
1813 2269 M
1811 2260 D
1811 2269 D
1834 2269 D
1834 2260 D
1832 2269 D
S
N
1817 2237 M
1828 2237 D
S
N
1843 2249 M
1861 2249 D
1861 2252 D
1859 2255 D
1858 2257 D
1855 2259 D
1850 2259 D
1846 2257 D
1843 2254 D
1841 2249 D
1841 2246 D
1843 2242 D
1846 2239 D
1850 2237 D
1853 2237 D
1858 2239 D
1861 2242 D
S
N
1859 2249 M
1859 2254 D
1858 2257 D
S
N
1850 2259 M
1847 2257 D
1844 2254 D
1843 2249 D
1843 2246 D
1844 2242 D
1847 2239 D
1850 2237 D
S
N
1870 2269 M
1881 2237 D
S
N
1872 2269 M
1881 2242 D
S
N
1891 2269 M
1881 2237 D
S
N
1867 2269 M
1876 2269 D
S
N
1885 2269 M
1894 2269 D
S
3 Sw
N
1455 2186 M
1455 2185 D
1453 2185 D
1453 2186 D
1455 2188 D
1458 2189 D
1464 2189 D
1467 2188 D
1468 2186 D
1470 2183 D
1470 2173 D
1471 2170 D
1473 2168 D
S
N
1468 2186 M
1468 2173 D
1470 2170 D
1473 2168 D
1474 2168 D
S
N
1468 2183 M
1467 2182 D
1458 2180 D
1453 2179 D
1452 2176 D
1452 2173 D
1453 2170 D
1458 2168 D
1462 2168 D
1465 2170 D
1468 2173 D
S
N
1458 2180 M
1455 2179 D
1453 2176 D
1453 2173 D
1455 2170 D
1458 2168 D
S
N
1485 2200 M
1485 2168 D
S
N
1486 2200 M
1495 2173 D
S
N
1485 2200 M
1495 2168 D
S
N
1506 2200 M
1495 2168 D
S
N
1506 2200 M
1506 2168 D
S
N
1508 2200 M
1508 2168 D
S
N
1480 2200 M
1486 2200 D
S
N
1506 2200 M
1512 2200 D
S
N
1480 2168 M
1489 2168 D
S
N
1502 2168 M
1512 2168 D
S
N
1541 2195 M
1542 2191 D
1542 2200 D
1541 2195 D
1538 2198 D
1533 2200 D
1530 2200 D
1526 2198 D
1523 2195 D
1521 2192 D
1520 2188 D
1520 2180 D
1521 2176 D
1523 2173 D
1526 2170 D
1530 2168 D
1533 2168 D
1538 2170 D
1541 2173 D
1542 2176 D
S
N
1530 2200 M
1527 2198 D
1524 2195 D
1523 2192 D
1521 2188 D
1521 2180 D
1523 2176 D
1524 2173 D
1527 2170 D
1530 2168 D
S
N
1574 2188 M
1572 2191 D
1569 2192 D
1565 2192 D
1562 2191 D
1560 2189 D
1559 2185 D
1559 2180 D
1560 2177 D
1563 2176 D
1568 2176 D
1571 2177 D
1572 2180 D
S
N
1565 2192 M
1562 2189 D
1560 2185 D
1560 2180 D
1562 2177 D
1563 2176 D
S
N
1574 2192 M
1572 2180 D
1572 2177 D
1575 2176 D
1579 2176 D
1582 2179 D
1583 2183 D
1583 2186 D
1582 2191 D
1580 2194 D
1577 2197 D
1574 2198 D
1569 2200 D
1565 2200 D
1560 2198 D
1557 2197 D
1554 2194 D
1553 2191 D
1551 2186 D
1551 2182 D
1553 2177 D
1554 2174 D
1557 2171 D
1560 2170 D
1565 2168 D
1569 2168 D
1574 2170 D
1577 2171 D
1579 2173 D
S
N
1575 2192 M
1574 2180 D
1574 2177 D
1575 2176 D
S
N
1595 2200 M
1595 2168 D
S
N
1597 2200 M
1615 2171 D
S
N
1597 2197 M
1615 2168 D
S
N
1615 2200 M
1615 2168 D
S
N
1591 2200 M
1597 2200 D
S
N
1610 2200 M
1619 2200 D
S
N
1591 2168 M
1600 2168 D
S
N
1630 2200 M
1630 2168 D
S
N
1631 2200 M
1631 2168 D
S
N
1625 2200 M
1636 2200 D
S
N
1625 2168 M
1648 2168 D
1648 2177 D
1646 2168 D
S
N
1665 2200 M
1660 2198 D
1657 2195 D
1655 2192 D
1654 2186 D
1654 2182 D
1655 2176 D
1657 2173 D
1660 2170 D
1665 2168 D
1668 2168 D
1672 2170 D
1675 2173 D
1677 2176 D
1678 2182 D
1678 2186 D
1677 2192 D
1675 2195 D
1672 2198 D
1668 2200 D
1665 2200 D
S
N
1665 2200 M
1662 2198 D
1659 2195 D
1657 2192 D
1655 2186 D
1655 2182 D
1657 2176 D
1659 2173 D
1662 2170 D
1665 2168 D
S
N
1668 2168 M
1671 2170 D
1674 2173 D
1675 2176 D
1677 2182 D
1677 2186 D
1675 2192 D
1674 2195 D
1671 2198 D
1668 2200 D
S
N
1702 2195 M
1702 2168 D
S
N
1689 2182 M
1716 2182 D
S
N
1729 2200 M
1729 2168 D
S
N
1731 2200 M
1731 2168 D
S
N
1731 2185 M
1734 2188 D
1738 2189 D
1742 2189 D
1746 2188 D
1748 2185 D
1748 2168 D
S
N
1742 2189 M
1745 2188 D
1746 2185 D
1746 2168 D
S
N
1725 2200 M
1731 2200 D
S
N
1725 2168 M
1735 2168 D
S
N
1742 2168 M
1752 2168 D
S
N
1761 2180 M
1779 2180 D
1779 2183 D
1778 2186 D
1776 2188 D
1773 2189 D
1769 2189 D
1764 2188 D
1761 2185 D
1760 2180 D
1760 2177 D
1761 2173 D
1764 2170 D
1769 2168 D
1772 2168 D
1776 2170 D
1779 2173 D
S
N
1778 2180 M
1778 2185 D
1776 2188 D
S
N
1769 2189 M
1766 2188 D
1763 2185 D
1761 2180 D
1761 2177 D
1763 2173 D
1766 2170 D
1769 2168 D
S
N
1791 2189 M
1791 2168 D
S
N
1793 2189 M
1793 2168 D
S
N
1793 2180 M
1794 2185 D
1797 2188 D
1800 2189 D
1805 2189 D
1806 2188 D
1806 2186 D
1805 2185 D
1803 2186 D
1805 2188 D
S
N
1787 2189 M
1793 2189 D
S
N
1787 2168 M
1797 2168 D
S
N
1815 2189 M
1822 2168 D
S
N
1817 2189 M
1822 2173 D
S
N
1828 2189 M
1822 2168 D
S
N
1828 2189 M
1834 2168 D
S
N
1829 2189 M
1834 2173 D
S
N
1840 2189 M
1834 2168 D
S
N
1811 2189 M
1822 2189 D
S
N
1835 2189 M
1844 2189 D
S
N
1853 2200 M
1852 2198 D
1853 2197 D
1855 2198 D
1853 2200 D
S
N
1853 2189 M
1853 2168 D
S
N
1855 2189 M
1855 2168 D
S
N
1849 2189 M
1855 2189 D
S
N
1849 2168 M
1859 2168 D
S
N
1874 2189 M
1871 2188 D
1870 2186 D
1868 2183 D
1868 2180 D
1870 2177 D
1871 2176 D
1874 2174 D
1877 2174 D
1880 2176 D
1882 2177 D
1883 2180 D
1883 2183 D
1882 2186 D
1880 2188 D
1877 2189 D
1874 2189 D
S
N
1871 2188 M
1870 2185 D
1870 2179 D
1871 2176 D
S
N
1880 2176 M
1882 2179 D
1882 2185 D
1880 2188 D
S
N
1882 2186 M
1883 2188 D
1886 2189 D
1886 2188 D
1883 2188 D
S
N
1870 2177 M
1868 2176 D
1867 2173 D
1867 2171 D
1868 2168 D
1873 2167 D
1880 2167 D
1885 2165 D
1886 2164 D
S
N
1867 2171 M
1868 2170 D
1873 2168 D
1880 2168 D
1885 2167 D
1886 2164 D
1886 2162 D
1885 2159 D
1880 2158 D
1871 2158 D
1867 2159 D
1865 2162 D
1865 2164 D
1867 2167 D
1871 2168 D
S
N
1455 2131 M
1455 2099 D
S
N
1456 2131 M
1456 2099 D
S
N
1450 2131 M
1468 2131 D
1473 2129 D
1474 2128 D
1476 2125 D
1476 2120 D
1474 2117 D
1473 2116 D
1468 2114 D
1456 2114 D
S
N
1468 2131 M
1471 2129 D
1473 2128 D
1474 2125 D
1474 2120 D
1473 2117 D
1471 2116 D
1468 2114 D
S
N
1450 2099 M
1461 2099 D
S
N
1495 2131 M
1491 2129 D
1488 2126 D
1486 2123 D
1485 2117 D
1485 2113 D
1486 2107 D
1488 2104 D
1491 2100 D
1495 2099 D
1499 2099 D
1503 2100 D
1506 2104 D
1508 2107 D
1509 2113 D
1509 2117 D
1508 2123 D
1506 2126 D
1503 2129 D
1499 2131 D
1495 2131 D
S
N
1495 2131 M
1492 2129 D
1489 2126 D
1488 2123 D
1486 2117 D
1486 2113 D
1488 2107 D
1489 2104 D
1492 2100 D
1495 2099 D
S
N
1499 2099 M
1502 2100 D
1505 2104 D
1506 2107 D
1508 2113 D
1508 2117 D
1506 2123 D
1505 2126 D
1502 2129 D
1499 2131 D
S
N
1520 2131 M
1526 2099 D
S
N
1521 2131 M
1526 2107 D
S
N
1532 2131 M
1526 2099 D
S
N
1532 2131 M
1538 2099 D
S
N
1533 2131 M
1538 2107 D
S
N
1544 2131 M
1538 2099 D
S
N
1515 2131 M
1526 2131 D
S
N
1539 2131 M
1548 2131 D
S
N
1557 2131 M
1557 2099 D
S
N
1559 2131 M
1559 2099 D
S
N
1577 2131 M
1577 2099 D
S
N
1579 2131 M
1579 2099 D
S
N
1553 2131 M
1563 2131 D
S
N
1572 2131 M
1583 2131 D
S
N
1559 2116 M
1577 2116 D
S
N
1553 2099 M
1563 2099 D
S
N
1572 2099 M
1583 2099 D
S
N
1594 2131 M
1594 2099 D
S
N
1595 2131 M
1595 2099 D
S
N
1604 2122 M
1604 2110 D
S
N
1589 2131 M
1613 2131 D
1613 2122 D
1612 2131 D
S
N
1595 2116 M
1604 2116 D
S
N
1589 2099 M
1613 2099 D
1613 2108 D
1612 2099 D
S
N
1625 2131 M
1625 2099 D
S
N
1627 2131 M
1627 2099 D
S
N
1621 2131 M
1631 2131 D
S
N
1621 2099 M
1643 2099 D
1643 2108 D
1642 2099 D
S
N
1665 2126 M
1665 2099 D
S
N
1651 2113 M
1678 2113 D
S
N
1692 2131 M
1692 2099 D
S
N
1693 2131 M
1693 2099 D
S
N
1693 2116 M
1696 2119 D
1701 2120 D
1704 2120 D
1708 2119 D
1710 2116 D
1710 2099 D
S
N
1704 2120 M
1707 2119 D
1708 2116 D
1708 2099 D
S
N
1687 2131 M
1693 2131 D
S
N
1687 2099 M
1698 2099 D
S
N
1704 2099 M
1714 2099 D
S
N
1723 2111 M
1742 2111 D
1742 2114 D
1740 2117 D
1738 2119 D
1735 2120 D
1731 2120 D
1726 2119 D
1723 2116 D
1722 2111 D
1722 2108 D
1723 2104 D
1726 2100 D
1731 2099 D
1734 2099 D
1738 2100 D
1742 2104 D
S
N
1740 2111 M
1740 2116 D
1738 2119 D
S
N
1731 2120 M
1728 2119 D
1725 2116 D
1723 2111 D
1723 2108 D
1725 2104 D
1728 2100 D
1731 2099 D
S
N
1754 2120 M
1754 2099 D
S
N
1755 2120 M
1755 2099 D
S
N
1755 2111 M
1757 2116 D
1760 2119 D
1763 2120 D
1767 2120 D
1769 2119 D
1769 2117 D
1767 2116 D
1766 2117 D
1767 2119 D
S
N
1749 2120 M
1755 2120 D
S
N
1749 2099 M
1760 2099 D
S
N
1778 2120 M
1784 2099 D
S
N
1779 2120 M
1784 2104 D
S
N
1790 2120 M
1784 2099 D
S
N
1790 2120 M
1796 2099 D
S
N
1791 2120 M
1796 2104 D
S
N
1802 2120 M
1796 2099 D
S
N
1773 2120 M
1784 2120 D
S
N
1797 2120 M
1806 2120 D
S
N
1815 2131 M
1814 2129 D
1815 2128 D
1817 2129 D
1815 2131 D
S
N
1815 2120 M
1815 2099 D
S
N
1817 2120 M
1817 2099 D
S
N
1811 2120 M
1817 2120 D
S
N
1811 2099 M
1822 2099 D
S
N
1837 2120 M
1834 2119 D
1832 2117 D
1831 2114 D
1831 2111 D
1832 2108 D
1834 2107 D
1837 2105 D
1840 2105 D
1843 2107 D
1844 2108 D
1846 2111 D
1846 2114 D
1844 2117 D
1843 2119 D
1840 2120 D
1837 2120 D
S
N
1834 2119 M
1832 2116 D
1832 2110 D
1834 2107 D
S
N
1843 2107 M
1844 2110 D
1844 2116 D
1843 2119 D
S
N
1844 2117 M
1846 2119 D
1849 2120 D
1849 2119 D
1846 2119 D
S
N
1832 2108 M
1831 2107 D
1829 2104 D
1829 2102 D
1831 2099 D
1835 2097 D
1843 2097 D
1847 2096 D
1849 2094 D
S
N
1829 2102 M
1831 2100 D
1835 2099 D
1843 2099 D
1847 2097 D
1849 2094 D
1849 2093 D
1847 2090 D
1843 2088 D
1834 2088 D
1829 2090 D
1828 2093 D
1828 2094 D
1829 2097 D
1834 2099 D
S
1 Sw
N
1986 2034 M
2003 2034 D
S
N
1986 2034 M
2003 2034 D
S
N
1986 2031 M
1986 2037 D
S
N
2003 2031 M
2003 2043 D
1998 2043 D
2003 2042 D
S
N
1986 2048 M
2003 2048 D
S
N
1986 2049 M
2003 2049 D
S
N
1986 2058 M
2003 2058 D
S
N
1986 2059 M
2003 2059 D
S
N
1986 2046 M
1986 2051 D
S
N
1986 2056 M
1986 2062 D
S
N
1994 2049 M
1994 2058 D
S
N
2003 2046 M
2003 2051 D
S
N
2003 2056 M
2003 2062 D
S
N
1988 2077 M
1991 2078 D
1986 2078 D
1988 2077 D
1987 2075 D
1986 2073 D
1986 2071 D
1987 2069 D
1988 2067 D
1990 2066 D
1992 2066 D
1996 2066 D
1999 2066 D
2000 2067 D
2002 2069 D
2003 2071 D
2003 2073 D
2002 2075 D
2000 2077 D
1999 2078 D
S
N
1986 2071 M
1987 2070 D
1988 2068 D
1990 2067 D
1992 2066 D
1996 2066 D
1999 2067 D
2000 2068 D
2002 2070 D
2003 2071 D
S
N
1986 2097 M
2003 2097 D
S
N
1986 2097 M
2003 2097 D
S
N
1986 2107 M
2003 2107 D
S
N
1986 2108 M
2003 2108 D
S
N
1986 2094 M
1986 2100 D
S
N
1986 2105 M
1986 2110 D
S
N
1994 2097 M
1994 2107 D
S
N
2003 2094 M
2003 2100 D
S
N
2003 2105 M
2003 2110 D
S
N
1986 2116 M
2003 2116 D
S
N
1986 2117 M
2003 2117 D
S
N
1986 2113 M
1986 2119 D
S
N
2003 2113 M
2003 2119 D
S
N
1988 2134 M
1991 2135 D
1986 2135 D
1988 2134 D
1987 2132 D
1986 2130 D
1986 2129 D
1987 2126 D
1988 2125 D
1990 2124 D
1992 2123 D
1996 2123 D
1999 2124 D
2000 2125 D
2002 2126 D
2003 2129 D
2003 2130 D
2002 2132 D
2000 2134 D
S
N
1986 2129 M
1987 2127 D
1988 2125 D
1990 2125 D
1992 2124 D
1996 2124 D
1999 2125 D
2000 2125 D
2002 2127 D
2003 2129 D
S
N
1996 2134 M
2003 2134 D
S
N
1996 2135 M
2003 2135 D
S
N
1996 2132 M
1996 2137 D
S
N
1988 2152 M
1991 2153 D
1986 2153 D
1988 2152 D
1987 2151 D
1986 2148 D
1986 2147 D
1987 2144 D
1988 2143 D
1990 2142 D
1992 2141 D
1996 2141 D
1999 2142 D
2000 2143 D
2002 2144 D
2003 2147 D
2003 2148 D
2002 2151 D
2000 2152 D
S
N
1986 2147 M
1987 2145 D
1988 2144 D
1990 2143 D
1992 2142 D
1996 2142 D
1999 2143 D
2000 2144 D
2002 2145 D
2003 2147 D
S
N
1996 2152 M
2003 2152 D
S
N
1996 2153 M
2003 2153 D
S
N
1996 2150 M
1996 2156 D
S
N
1988 2170 M
1986 2171 D
1991 2171 D
1988 2170 D
1987 2168 D
1986 2166 D
1986 2164 D
1987 2161 D
1988 2160 D
1990 2160 D
1991 2160 D
1992 2161 D
1993 2163 D
1995 2168 D
1995 2169 D
1997 2171 D
S
N
1990 2160 M
1991 2161 D
1992 2163 D
1994 2168 D
1995 2169 D
1995 2170 D
1997 2171 D
2000 2171 D
2002 2169 D
2003 2167 D
2003 2164 D
2002 2162 D
2000 2160 D
1998 2160 D
2003 2160 D
2000 2160 D
S
N
1986 2188 M
2003 2199 D
S
N
1986 2189 M
2003 2199 D
S
N
1986 2199 M
2003 2188 D
S
N
1986 2187 M
1986 2191 D
S
N
1986 2196 M
1986 2201 D
S
N
2003 2187 M
2003 2191 D
S
N
2003 2196 M
2003 2201 D
S
N
1988 2215 M
1986 2215 D
1991 2215 D
1988 2215 D
1987 2213 D
1986 2211 D
1986 2208 D
1987 2206 D
1988 2204 D
1990 2204 D
1991 2205 D
1992 2206 D
1993 2207 D
1995 2212 D
1995 2214 D
1997 2215 D
S
N
1990 2204 M
1991 2206 D
1992 2207 D
1994 2212 D
1995 2214 D
1995 2215 D
1997 2215 D
2000 2215 D
2002 2214 D
2003 2211 D
2003 2209 D
2002 2207 D
2000 2205 D
1998 2204 D
2003 2204 D
2000 2205 D
S
N
1986 2234 M
2003 2237 D
S
N
1986 2234 M
1999 2237 D
S
N
1986 2240 M
2003 2237 D
S
N
1986 2240 M
2003 2243 D
S
N
1986 2241 M
1999 2243 D
S
N
1986 2246 M
2003 2243 D
S
N
1986 2231 M
1986 2237 D
S
N
1986 2244 M
1986 2249 D
S
N
1988 2263 M
1991 2264 D
1986 2264 D
1988 2263 D
1987 2262 D
1986 2259 D
1986 2258 D
1987 2255 D
1988 2254 D
1990 2253 D
1992 2252 D
1996 2252 D
1999 2253 D
2000 2254 D
2002 2255 D
2003 2258 D
2003 2259 D
2002 2262 D
2000 2263 D
S
N
1986 2258 M
1987 2256 D
1988 2254 D
1990 2254 D
1992 2253 D
1996 2253 D
1999 2254 D
2000 2254 D
2002 2256 D
2003 2258 D
S
N
1996 2263 M
2003 2263 D
S
N
1996 2264 M
2003 2264 D
S
N
1996 2261 M
1996 2266 D
S
N
1989 2284 M
1990 2285 D
1991 2284 D
1990 2283 D
1989 2283 D
1987 2284 D
1987 2285 D
1986 2287 D
1986 2290 D
1987 2293 D
1987 2293 D
1989 2294 D
1991 2294 D
1992 2293 D
1994 2291 D
1995 2287 D
1996 2285 D
1998 2284 D
2000 2283 D
2003 2283 D
S
N
1986 2290 M
1987 2292 D
1987 2293 D
1989 2293 D
1991 2293 D
1992 2293 D
1994 2290 D
1995 2287 D
S
N
2001 2283 M
2000 2284 D
2000 2285 D
2002 2289 D
2002 2292 D
2001 2293 D
2000 2294 D
S
N
2000 2285 M
2003 2289 D
2003 2293 D
2002 2293 D
2000 2294 D
1999 2294 D
S
N
1986 2304 M
1987 2301 D
1989 2300 D
1993 2299 D
1995 2299 D
1999 2300 D
2002 2301 D
2003 2304 D
2003 2305 D
2002 2308 D
1999 2309 D
1995 2310 D
1993 2310 D
1989 2309 D
1987 2308 D
1986 2305 D
1986 2304 D
S
N
1986 2304 M
1987 2302 D
1987 2301 D
1989 2301 D
1993 2300 D
1995 2300 D
1999 2301 D
2001 2301 D
2002 2302 D
2003 2304 D
S
N
2003 2305 M
2002 2307 D
2001 2308 D
1999 2309 D
1995 2309 D
1993 2309 D
1989 2309 D
1987 2308 D
1987 2307 D
1986 2305 D
S
N
1989 2317 M
1988 2319 D
1986 2321 D
2003 2321 D
S
N
1987 2321 M
2003 2321 D
S
N
2003 2317 M
2003 2325 D
S
N
1989 2333 M
1988 2335 D
1986 2337 D
2003 2337 D
S
N
1987 2336 M
2003 2336 D
S
N
2003 2333 M
2003 2340 D
S
4 Sw
N
583 2342 M
583 1520 D
S
N
583 1520 M
1967 1520 D
S
N
1967 1520 M
1967 2342 D
S
N
1967 2342 M
583 2342 D
S
N
583 1520 M
1967 1520 D
S
N
583 1520 M
583 1551 D
S
N
656 1531 M
656 1520 D
S
N
729 1520 M
729 1531 D
S
N
802 1531 M
802 1520 D
S
N
874 1520 M
874 1531 D
S
N
947 1551 M
947 1520 D
S
N
1020 1520 M
1020 1531 D
S
N
1093 1531 M
1093 1520 D
S
N
1166 1520 M
1166 1531 D
S
N
1239 1531 M
1239 1520 D
S
N
1311 1520 M
1311 1551 D
S
N
1384 1531 M
1384 1520 D
S
N
1457 1520 M
1457 1531 D
S
N
1530 1531 M
1530 1520 D
S
N
1603 1520 M
1603 1531 D
S
N
1676 1551 M
1676 1520 D
S
N
1748 1520 M
1748 1531 D
S
N
1821 1531 M
1821 1520 D
S
N
1894 1520 M
1894 1531 D
S
N
1967 1531 M
1967 1520 D
S
N
583 2342 M
1967 2342 D
S
N
583 2311 M
583 2342 D
S
N
656 2342 M
656 2332 D
S
N
729 2332 M
729 2342 D
S
N
802 2342 M
802 2332 D
S
N
874 2332 M
874 2342 D
S
N
947 2342 M
947 2311 D
S
N
1020 2332 M
1020 2342 D
S
N
1093 2342 M
1093 2332 D
S
N
1166 2332 M
1166 2342 D
S
N
1239 2342 M
1239 2332 D
S
N
1311 2311 M
1311 2342 D
S
N
1384 2342 M
1384 2332 D
S
N
1457 2332 M
1457 2342 D
S
N
1530 2342 M
1530 2332 D
S
N
1603 2332 M
1603 2342 D
S
N
1676 2342 M
1676 2311 D
S
N
1748 2332 M
1748 2342 D
S
N
1821 2342 M
1821 2332 D
S
N
1894 2332 M
1894 2342 D
S
N
1967 2342 M
1967 2332 D
S
N
583 1520 M
583 2342 D
S
N
583 1532 M
593 1532 D
S
N
593 1579 M
583 1579 D
S
N
583 1616 M
614 1616 D
S
N
593 1646 M
583 1646 D
S
N
583 1672 M
593 1672 D
S
N
593 1694 M
583 1694 D
S
N
583 1714 M
593 1714 D
S
N
614 1731 M
583 1731 D
S
N
583 1846 M
614 1846 D
S
N
593 1913 M
583 1913 D
S
N
583 1961 M
593 1961 D
S
N
614 1998 M
583 1998 D
S
N
583 2028 M
593 2028 D
S
N
593 2053 M
583 2053 D
S
N
583 2075 M
593 2075 D
S
N
593 2095 M
583 2095 D
S
N
583 2112 M
614 2112 D
S
N
614 2227 M
583 2227 D
S
N
583 2294 M
593 2294 D
S
N
593 2342 M
583 2342 D
S
N
382 1630 M
377 1628 D
374 1624 D
373 1616 D
373 1612 D
374 1604 D
377 1600 D
382 1598 D
385 1598 D
389 1600 D
392 1604 D
394 1612 D
394 1616 D
392 1624 D
389 1628 D
385 1630 D
382 1630 D
S
N
382 1630 M
379 1628 D
377 1627 D
376 1624 D
374 1616 D
374 1612 D
376 1604 D
377 1601 D
379 1600 D
382 1598 D
S
N
385 1598 M
388 1600 D
389 1601 D
391 1604 D
392 1612 D
392 1616 D
391 1624 D
389 1627 D
388 1628 D
385 1630 D
S
N
406 1601 M
404 1600 D
406 1598 D
407 1600 D
406 1601 D
S
N
427 1630 M
422 1628 D
419 1624 D
418 1616 D
418 1612 D
419 1604 D
422 1600 D
427 1598 D
430 1598 D
435 1600 D
438 1604 D
439 1612 D
439 1616 D
438 1624 D
435 1628 D
430 1630 D
427 1630 D
S
N
427 1630 M
424 1628 D
422 1627 D
421 1624 D
419 1616 D
419 1612 D
421 1604 D
422 1601 D
424 1600 D
427 1598 D
S
N
430 1598 M
433 1600 D
435 1601 D
436 1604 D
438 1612 D
438 1616 D
436 1624 D
435 1627 D
433 1628 D
430 1630 D
S
N
457 1630 M
453 1628 D
450 1624 D
448 1616 D
448 1612 D
450 1604 D
453 1600 D
457 1598 D
460 1598 D
465 1600 D
468 1604 D
469 1612 D
469 1616 D
468 1624 D
465 1628 D
460 1630 D
457 1630 D
S
N
457 1630 M
454 1628 D
453 1627 D
451 1624 D
450 1616 D
450 1612 D
451 1604 D
453 1601 D
454 1600 D
457 1598 D
S
N
460 1598 M
463 1600 D
465 1601 D
466 1604 D
468 1612 D
468 1616 D
466 1624 D
465 1627 D
463 1628 D
460 1630 D
S
N
487 1630 M
483 1628 D
480 1624 D
478 1616 D
478 1612 D
480 1604 D
483 1600 D
487 1598 D
490 1598 D
495 1600 D
498 1604 D
499 1612 D
499 1616 D
498 1624 D
495 1628 D
490 1630 D
487 1630 D
S
N
487 1630 M
484 1628 D
483 1627 D
481 1624 D
480 1616 D
480 1612 D
481 1604 D
483 1601 D
484 1600 D
487 1598 D
S
N
490 1598 M
493 1600 D
495 1601 D
496 1604 D
498 1612 D
498 1616 D
496 1624 D
495 1627 D
493 1628 D
490 1630 D
S
N
518 1630 M
513 1628 D
510 1624 D
508 1616 D
508 1612 D
510 1604 D
513 1600 D
518 1598 D
521 1598 D
525 1600 D
528 1604 D
530 1612 D
530 1616 D
528 1624 D
525 1628 D
521 1630 D
518 1630 D
S
N
518 1630 M
515 1628 D
513 1627 D
511 1624 D
510 1616 D
510 1612 D
511 1604 D
513 1601 D
515 1600 D
518 1598 D
S
N
521 1598 M
524 1600 D
525 1601 D
527 1604 D
528 1612 D
528 1616 D
527 1624 D
525 1627 D
524 1628 D
521 1630 D
S
N
542 1630 M
539 1615 D
S
N
539 1615 M
542 1618 D
546 1619 D
551 1619 D
555 1618 D
558 1615 D
560 1610 D
560 1607 D
558 1603 D
555 1600 D
551 1598 D
546 1598 D
542 1600 D
540 1601 D
539 1604 D
539 1606 D
540 1607 D
542 1606 D
540 1604 D
S
N
551 1619 M
554 1618 D
557 1615 D
558 1610 D
558 1607 D
557 1603 D
554 1600 D
551 1598 D
S
N
542 1630 M
557 1630 D
S
N
542 1628 M
549 1628 D
557 1630 D
S
N
382 1745 M
377 1743 D
374 1739 D
373 1731 D
373 1727 D
374 1719 D
377 1714 D
382 1713 D
385 1713 D
389 1714 D
392 1719 D
394 1727 D
394 1731 D
392 1739 D
389 1743 D
385 1745 D
382 1745 D
S
N
382 1745 M
379 1743 D
377 1742 D
376 1739 D
374 1731 D
374 1727 D
376 1719 D
377 1716 D
379 1714 D
382 1713 D
S
N
385 1713 M
388 1714 D
389 1716 D
391 1719 D
392 1727 D
392 1731 D
391 1739 D
389 1742 D
388 1743 D
385 1745 D
S
N
406 1716 M
404 1714 D
406 1713 D
407 1714 D
406 1716 D
S
N
427 1745 M
422 1743 D
419 1739 D
418 1731 D
418 1727 D
419 1719 D
422 1714 D
427 1713 D
430 1713 D
435 1714 D
438 1719 D
439 1727 D
439 1731 D
438 1739 D
435 1743 D
430 1745 D
427 1745 D
S
N
427 1745 M
424 1743 D
422 1742 D
421 1739 D
419 1731 D
419 1727 D
421 1719 D
422 1716 D
424 1714 D
427 1713 D
S
N
430 1713 M
433 1714 D
435 1716 D
436 1719 D
438 1727 D
438 1731 D
436 1739 D
435 1742 D
433 1743 D
430 1745 D
S
N
457 1745 M
453 1743 D
450 1739 D
448 1731 D
448 1727 D
450 1719 D
453 1714 D
457 1713 D
460 1713 D
465 1714 D
468 1719 D
469 1727 D
469 1731 D
468 1739 D
465 1743 D
460 1745 D
457 1745 D
S
N
457 1745 M
454 1743 D
453 1742 D
451 1739 D
450 1731 D
450 1727 D
451 1719 D
453 1716 D
454 1714 D
457 1713 D
S
N
460 1713 M
463 1714 D
465 1716 D
466 1719 D
468 1727 D
468 1731 D
466 1739 D
465 1742 D
463 1743 D
460 1745 D
S
N
487 1745 M
483 1743 D
480 1739 D
478 1731 D
478 1727 D
480 1719 D
483 1714 D
487 1713 D
490 1713 D
495 1714 D
498 1719 D
499 1727 D
499 1731 D
498 1739 D
495 1743 D
490 1745 D
487 1745 D
S
N
487 1745 M
484 1743 D
483 1742 D
481 1739 D
480 1731 D
480 1727 D
481 1719 D
483 1716 D
484 1714 D
487 1713 D
S
N
490 1713 M
493 1714 D
495 1716 D
496 1719 D
498 1727 D
498 1731 D
496 1739 D
495 1742 D
493 1743 D
490 1745 D
S
N
513 1739 M
516 1740 D
521 1745 D
521 1713 D
S
N
519 1743 M
519 1713 D
S
N
513 1713 M
527 1713 D
S
N
548 1745 M
543 1743 D
540 1739 D
539 1731 D
539 1727 D
540 1719 D
543 1714 D
548 1713 D
551 1713 D
555 1714 D
558 1719 D
560 1727 D
560 1731 D
558 1739 D
555 1743 D
551 1745 D
548 1745 D
S
N
548 1745 M
545 1743 D
543 1742 D
542 1739 D
540 1731 D
540 1727 D
542 1719 D
543 1716 D
545 1714 D
548 1713 D
S
N
551 1713 M
554 1714 D
555 1716 D
557 1719 D
558 1727 D
558 1731 D
557 1739 D
555 1742 D
554 1743 D
551 1745 D
S
N
382 1859 M
377 1858 D
374 1853 D
373 1846 D
373 1841 D
374 1834 D
377 1829 D
382 1828 D
385 1828 D
389 1829 D
392 1834 D
394 1841 D
394 1846 D
392 1853 D
389 1858 D
385 1859 D
382 1859 D
S
N
382 1859 M
379 1858 D
377 1856 D
376 1853 D
374 1846 D
374 1841 D
376 1834 D
377 1831 D
379 1829 D
382 1828 D
S
N
385 1828 M
388 1829 D
389 1831 D
391 1834 D
392 1841 D
392 1846 D
391 1853 D
389 1856 D
388 1858 D
385 1859 D
S
N
406 1831 M
404 1829 D
406 1828 D
407 1829 D
406 1831 D
S
N
427 1859 M
422 1858 D
419 1853 D
418 1846 D
418 1841 D
419 1834 D
422 1829 D
427 1828 D
430 1828 D
435 1829 D
438 1834 D
439 1841 D
439 1846 D
438 1853 D
435 1858 D
430 1859 D
427 1859 D
S
N
427 1859 M
424 1858 D
422 1856 D
421 1853 D
419 1846 D
419 1841 D
421 1834 D
422 1831 D
424 1829 D
427 1828 D
S
N
430 1828 M
433 1829 D
435 1831 D
436 1834 D
438 1841 D
438 1846 D
436 1853 D
435 1856 D
433 1858 D
430 1859 D
S
N
457 1859 M
453 1858 D
450 1853 D
448 1846 D
448 1841 D
450 1834 D
453 1829 D
457 1828 D
460 1828 D
465 1829 D
468 1834 D
469 1841 D
469 1846 D
468 1853 D
465 1858 D
460 1859 D
457 1859 D
S
N
457 1859 M
454 1858 D
453 1856 D
451 1853 D
450 1846 D
450 1841 D
451 1834 D
453 1831 D
454 1829 D
457 1828 D
S
N
460 1828 M
463 1829 D
465 1831 D
466 1834 D
468 1841 D
468 1846 D
466 1853 D
465 1856 D
463 1858 D
460 1859 D
S
N
487 1859 M
483 1858 D
480 1853 D
478 1846 D
478 1841 D
480 1834 D
483 1829 D
487 1828 D
490 1828 D
495 1829 D
498 1834 D
499 1841 D
499 1846 D
498 1853 D
495 1858 D
490 1859 D
487 1859 D
S
N
487 1859 M
484 1858 D
483 1856 D
481 1853 D
480 1846 D
480 1841 D
481 1834 D
483 1831 D
484 1829 D
487 1828 D
S
N
490 1828 M
493 1829 D
495 1831 D
496 1834 D
498 1841 D
498 1846 D
496 1853 D
495 1856 D
493 1858 D
490 1859 D
S
N
510 1853 M
511 1852 D
510 1850 D
508 1852 D
508 1853 D
510 1856 D
511 1858 D
516 1859 D
522 1859 D
527 1858 D
528 1856 D
530 1853 D
530 1850 D
528 1847 D
524 1844 D
516 1841 D
513 1840 D
510 1837 D
508 1832 D
508 1828 D
S
N
522 1859 M
525 1858 D
527 1856 D
528 1853 D
528 1850 D
527 1847 D
522 1844 D
516 1841 D
S
N
508 1831 M
510 1832 D
513 1832 D
521 1829 D
525 1829 D
528 1831 D
530 1832 D
S
N
513 1832 M
521 1828 D
527 1828 D
528 1829 D
530 1832 D
530 1835 D
S
N
548 1859 M
543 1858 D
540 1853 D
539 1846 D
539 1841 D
540 1834 D
543 1829 D
548 1828 D
551 1828 D
555 1829 D
558 1834 D
560 1841 D
560 1846 D
558 1853 D
555 1858 D
551 1859 D
548 1859 D
S
N
548 1859 M
545 1858 D
543 1856 D
542 1853 D
540 1846 D
540 1841 D
542 1834 D
543 1831 D
545 1829 D
548 1828 D
S
N
551 1828 M
554 1829 D
555 1831 D
557 1834 D
558 1841 D
558 1846 D
557 1853 D
555 1856 D
554 1858 D
551 1859 D
S
N
382 2011 M
377 2010 D
374 2005 D
373 1998 D
373 1993 D
374 1986 D
377 1981 D
382 1980 D
385 1980 D
389 1981 D
392 1986 D
394 1993 D
394 1998 D
392 2005 D
389 2010 D
385 2011 D
382 2011 D
S
N
382 2011 M
379 2010 D
377 2008 D
376 2005 D
374 1998 D
374 1993 D
376 1986 D
377 1983 D
379 1981 D
382 1980 D
S
N
385 1980 M
388 1981 D
389 1983 D
391 1986 D
392 1993 D
392 1998 D
391 2005 D
389 2008 D
388 2010 D
385 2011 D
S
N
406 1983 M
404 1981 D
406 1980 D
407 1981 D
406 1983 D
S
N
427 2011 M
422 2010 D
419 2005 D
418 1998 D
418 1993 D
419 1986 D
422 1981 D
427 1980 D
430 1980 D
435 1981 D
438 1986 D
439 1993 D
439 1998 D
438 2005 D
435 2010 D
430 2011 D
427 2011 D
S
N
427 2011 M
424 2010 D
422 2008 D
421 2005 D
419 1998 D
419 1993 D
421 1986 D
422 1983 D
424 1981 D
427 1980 D
S
N
430 1980 M
433 1981 D
435 1983 D
436 1986 D
438 1993 D
438 1998 D
436 2005 D
435 2008 D
433 2010 D
430 2011 D
S
N
457 2011 M
453 2010 D
450 2005 D
448 1998 D
448 1993 D
450 1986 D
453 1981 D
457 1980 D
460 1980 D
465 1981 D
468 1986 D
469 1993 D
469 1998 D
468 2005 D
465 2010 D
460 2011 D
457 2011 D
S
N
457 2011 M
454 2010 D
453 2008 D
451 2005 D
450 1998 D
450 1993 D
451 1986 D
453 1983 D
454 1981 D
457 1980 D
S
N
460 1980 M
463 1981 D
465 1983 D
466 1986 D
468 1993 D
468 1998 D
466 2005 D
465 2008 D
463 2010 D
460 2011 D
S
N
487 2011 M
483 2010 D
480 2005 D
478 1998 D
478 1993 D
480 1986 D
483 1981 D
487 1980 D
490 1980 D
495 1981 D
498 1986 D
499 1993 D
499 1998 D
498 2005 D
495 2010 D
490 2011 D
487 2011 D
S
N
487 2011 M
484 2010 D
483 2008 D
481 2005 D
480 1998 D
480 1993 D
481 1986 D
483 1983 D
484 1981 D
487 1980 D
S
N
490 1980 M
493 1981 D
495 1983 D
496 1986 D
498 1993 D
498 1998 D
496 2005 D
495 2008 D
493 2010 D
490 2011 D
S
N
511 2011 M
508 1996 D
S
N
508 1996 M
511 1999 D
516 2001 D
521 2001 D
525 1999 D
528 1996 D
530 1992 D
530 1989 D
528 1984 D
525 1981 D
521 1980 D
516 1980 D
511 1981 D
510 1983 D
508 1986 D
508 1987 D
510 1989 D
511 1987 D
510 1986 D
S
N
521 2001 M
524 1999 D
527 1996 D
528 1992 D
528 1989 D
527 1984 D
524 1981 D
521 1980 D
S
N
511 2011 M
527 2011 D
S
N
511 2010 M
519 2010 D
527 2011 D
S
N
548 2011 M
543 2010 D
540 2005 D
539 1998 D
539 1993 D
540 1986 D
543 1981 D
548 1980 D
551 1980 D
555 1981 D
558 1986 D
560 1993 D
560 1998 D
558 2005 D
555 2010 D
551 2011 D
548 2011 D
S
N
548 2011 M
545 2010 D
543 2008 D
542 2005 D
540 1998 D
540 1993 D
542 1986 D
543 1983 D
545 1981 D
548 1980 D
S
N
551 1980 M
554 1981 D
555 1983 D
557 1986 D
558 1993 D
558 1998 D
557 2005 D
555 2008 D
554 2010 D
551 2011 D
S
N
382 2126 M
377 2124 D
374 2120 D
373 2112 D
373 2108 D
374 2100 D
377 2096 D
382 2094 D
385 2094 D
389 2096 D
392 2100 D
394 2108 D
394 2112 D
392 2120 D
389 2124 D
385 2126 D
382 2126 D
S
N
382 2126 M
379 2124 D
377 2123 D
376 2120 D
374 2112 D
374 2108 D
376 2100 D
377 2097 D
379 2096 D
382 2094 D
S
N
385 2094 M
388 2096 D
389 2097 D
391 2100 D
392 2108 D
392 2112 D
391 2120 D
389 2123 D
388 2124 D
385 2126 D
S
N
406 2097 M
404 2096 D
406 2094 D
407 2096 D
406 2097 D
S
N
427 2126 M
422 2124 D
419 2120 D
418 2112 D
418 2108 D
419 2100 D
422 2096 D
427 2094 D
430 2094 D
435 2096 D
438 2100 D
439 2108 D
439 2112 D
438 2120 D
435 2124 D
430 2126 D
427 2126 D
S
N
427 2126 M
424 2124 D
422 2123 D
421 2120 D
419 2112 D
419 2108 D
421 2100 D
422 2097 D
424 2096 D
427 2094 D
S
N
430 2094 M
433 2096 D
435 2097 D
436 2100 D
438 2108 D
438 2112 D
436 2120 D
435 2123 D
433 2124 D
430 2126 D
S
N
457 2126 M
453 2124 D
450 2120 D
448 2112 D
448 2108 D
450 2100 D
453 2096 D
457 2094 D
460 2094 D
465 2096 D
468 2100 D
469 2108 D
469 2112 D
468 2120 D
465 2124 D
460 2126 D
457 2126 D
S
N
457 2126 M
454 2124 D
453 2123 D
451 2120 D
450 2112 D
450 2108 D
451 2100 D
453 2097 D
454 2096 D
457 2094 D
S
N
460 2094 M
463 2096 D
465 2097 D
466 2100 D
468 2108 D
468 2112 D
466 2120 D
465 2123 D
463 2124 D
460 2126 D
S
N
483 2120 M
486 2121 D
490 2126 D
490 2094 D
S
N
489 2124 M
489 2094 D
S
N
483 2094 M
496 2094 D
S
N
518 2126 M
513 2124 D
510 2120 D
508 2112 D
508 2108 D
510 2100 D
513 2096 D
518 2094 D
521 2094 D
525 2096 D
528 2100 D
530 2108 D
530 2112 D
528 2120 D
525 2124 D
521 2126 D
518 2126 D
S
N
518 2126 M
515 2124 D
513 2123 D
511 2120 D
510 2112 D
510 2108 D
511 2100 D
513 2097 D
515 2096 D
518 2094 D
S
N
521 2094 M
524 2096 D
525 2097 D
527 2100 D
528 2108 D
528 2112 D
527 2120 D
525 2123 D
524 2124 D
521 2126 D
S
N
548 2126 M
543 2124 D
540 2120 D
539 2112 D
539 2108 D
540 2100 D
543 2096 D
548 2094 D
551 2094 D
555 2096 D
558 2100 D
560 2108 D
560 2112 D
558 2120 D
555 2124 D
551 2126 D
548 2126 D
S
N
548 2126 M
545 2124 D
543 2123 D
542 2120 D
540 2112 D
540 2108 D
542 2100 D
543 2097 D
545 2096 D
548 2094 D
S
N
551 2094 M
554 2096 D
555 2097 D
557 2100 D
558 2108 D
558 2112 D
557 2120 D
555 2123 D
554 2124 D
551 2126 D
S
N
382 2241 M
377 2239 D
374 2235 D
373 2227 D
373 2223 D
374 2215 D
377 2211 D
382 2209 D
385 2209 D
389 2211 D
392 2215 D
394 2223 D
394 2227 D
392 2235 D
389 2239 D
385 2241 D
382 2241 D
S
N
382 2241 M
379 2239 D
377 2238 D
376 2235 D
374 2227 D
374 2223 D
376 2215 D
377 2212 D
379 2211 D
382 2209 D
S
N
385 2209 M
388 2211 D
389 2212 D
391 2215 D
392 2223 D
392 2227 D
391 2235 D
389 2238 D
388 2239 D
385 2241 D
S
N
406 2212 M
404 2211 D
406 2209 D
407 2211 D
406 2212 D
S
N
427 2241 M
422 2239 D
419 2235 D
418 2227 D
418 2223 D
419 2215 D
422 2211 D
427 2209 D
430 2209 D
435 2211 D
438 2215 D
439 2223 D
439 2227 D
438 2235 D
435 2239 D
430 2241 D
427 2241 D
S
N
427 2241 M
424 2239 D
422 2238 D
421 2235 D
419 2227 D
419 2223 D
421 2215 D
422 2212 D
424 2211 D
427 2209 D
S
N
430 2209 M
433 2211 D
435 2212 D
436 2215 D
438 2223 D
438 2227 D
436 2235 D
435 2238 D
433 2239 D
430 2241 D
S
N
457 2241 M
453 2239 D
450 2235 D
448 2227 D
448 2223 D
450 2215 D
453 2211 D
457 2209 D
460 2209 D
465 2211 D
468 2215 D
469 2223 D
469 2227 D
468 2235 D
465 2239 D
460 2241 D
457 2241 D
S
N
457 2241 M
454 2239 D
453 2238 D
451 2235 D
450 2227 D
450 2223 D
451 2215 D
453 2212 D
454 2211 D
457 2209 D
S
N
460 2209 M
463 2211 D
465 2212 D
466 2215 D
468 2223 D
468 2227 D
466 2235 D
465 2238 D
463 2239 D
460 2241 D
S
N
480 2235 M
481 2233 D
480 2232 D
478 2233 D
478 2235 D
480 2238 D
481 2239 D
486 2241 D
492 2241 D
496 2239 D
498 2238 D
499 2235 D
499 2232 D
498 2229 D
493 2226 D
486 2223 D
483 2221 D
480 2218 D
478 2214 D
478 2209 D
S
N
492 2241 M
495 2239 D
496 2238 D
498 2235 D
498 2232 D
496 2229 D
492 2226 D
486 2223 D
S
N
478 2212 M
480 2214 D
483 2214 D
490 2211 D
495 2211 D
498 2212 D
499 2214 D
S
N
483 2214 M
490 2209 D
496 2209 D
498 2211 D
499 2214 D
499 2217 D
S
N
518 2241 M
513 2239 D
510 2235 D
508 2227 D
508 2223 D
510 2215 D
513 2211 D
518 2209 D
521 2209 D
525 2211 D
528 2215 D
530 2223 D
530 2227 D
528 2235 D
525 2239 D
521 2241 D
518 2241 D
S
N
518 2241 M
515 2239 D
513 2238 D
511 2235 D
510 2227 D
510 2223 D
511 2215 D
513 2212 D
515 2211 D
518 2209 D
S
N
521 2209 M
524 2211 D
525 2212 D
527 2215 D
528 2223 D
528 2227 D
527 2235 D
525 2238 D
524 2239 D
521 2241 D
S
N
548 2241 M
543 2239 D
540 2235 D
539 2227 D
539 2223 D
540 2215 D
543 2211 D
548 2209 D
551 2209 D
555 2211 D
558 2215 D
560 2223 D
560 2227 D
558 2235 D
555 2239 D
551 2241 D
548 2241 D
S
N
548 2241 M
545 2239 D
543 2238 D
542 2235 D
540 2227 D
540 2223 D
542 2215 D
543 2212 D
545 2211 D
548 2209 D
S
N
551 2209 M
554 2211 D
555 2212 D
557 2215 D
558 2223 D
558 2227 D
557 2235 D
555 2238 D
554 2239 D
551 2241 D
S
N
1967 1520 M
1967 2342 D
S
N
1957 1532 M
1967 1532 D
S
N
1967 1579 M
1957 1579 D
S
N
1936 1616 M
1967 1616 D
S
N
1967 1646 M
1957 1646 D
S
N
1957 1672 M
1967 1672 D
S
N
1967 1694 M
1957 1694 D
S
N
1957 1714 M
1967 1714 D
S
N
1967 1731 M
1936 1731 D
S
N
1936 1846 M
1967 1846 D
S
N
1967 1913 M
1957 1913 D
S
N
1957 1961 M
1967 1961 D
S
N
1967 1998 M
1936 1998 D
S
N
1957 2028 M
1967 2028 D
S
N
1967 2053 M
1957 2053 D
S
N
1957 2075 M
1967 2075 D
S
N
1967 2095 M
1957 2095 D
S
N
1936 2112 M
1967 2112 D
S
N
1967 2227 M
1936 2227 D
S
N
1957 2294 M
1967 2294 D
S
N
1967 2342 M
1957 2342 D
S
N
1327 2186 M
1431 2186 D
S
583 1520 P
N
583 1520 M
583 1520 D
S
N
656 1520 M
656 1595 D
670 1595 D
670 1701 D
685 1701 D
685 1728 D
700 1728 D
700 1755 D
714 1755 D
714 1774 D
729 1774 D
729 1785 D
743 1785 D
743 1799 D
758 1799 D
758 1814 D
772 1814 D
772 1832 D
787 1832 D
787 1838 D
802 1838 D
802 1847 D
816 1847 D
816 1860 D
831 1860 D
831 1868 D
845 1868 D
845 1875 D
860 1875 D
860 1885 D
874 1885 D
874 1891 D
889 1891 D
889 1904 D
904 1904 D
904 1912 D
918 1912 D
918 1920 D
933 1920 D
933 1926 D
947 1926 D
947 1932 D
962 1932 D
962 1944 D
976 1944 D
976 1951 D
991 1951 D
991 1958 D
1005 1958 D
1005 1967 D
1020 1967 D
1020 1974 D
1035 1974 D
1035 1983 D
1049 1983 D
1049 1993 D
1064 1993 D
1064 1999 D
1078 1999 D
1078 2009 D
1093 2009 D
1093 2012 D
1107 2012 D
1107 2023 D
1122 2023 D
1122 2029 D
1137 2029 D
1137 2040 D
1151 2040 D
1151 2048 D
1166 2048 D
1166 2055 D
1180 2055 D
1180 2062 D
1195 2062 D
1195 2068 D
1209 2068 D
1209 2075 D
1224 2075 D
1224 2080 D
1239 2080 D
1239 2085 D
1253 2085 D
1253 2089 D
1268 2089 D
1268 2090 D
1282 2090 D
1282 2090 D
1297 2090 D
1297 2087 D
1311 2087 D
1311 2083 D
1326 2083 D
1326 2076 D
1341 2076 D
1341 2070 D
1355 2070 D
1355 2059 D
1370 2059 D
1370 2044 D
1384 2044 D
1384 2037 D
1399 2037 D
1399 2029 D
1413 2029 D
1413 2025 D
1428 2025 D
1428 2019 D
1443 2019 D
1443 2023 D
1457 2023 D
1457 2019 D
1472 2019 D
1472 2017 D
1486 2017 D
1486 2015 D
1501 2015 D
1501 2015 D
1515 2015 D
1515 2012 D
1530 2012 D
1530 2010 D
1545 2010 D
1545 2010 D
1559 2010 D
1559 2007 D
1559 2007 D
1559 2007 D
1574 2007 D
1574 2003 D
1588 2003 D
1588 2002 D
1603 2002 D
1603 1999 D
1617 1999 D
1617 1995 D
1632 1995 D
1632 1992 D
1646 1992 D
1646 1989 D
1661 1989 D
1661 1985 D
1676 1985 D
1676 1983 D
1690 1983 D
1690 1980 D
1705 1980 D
1705 1978 D
1719 1978 D
1719 1971 D
1734 1971 D
1734 1968 D
1748 1968 D
1748 1964 D
1763 1964 D
1763 1959 D
1778 1959 D
1778 1957 D
1792 1957 D
1792 1954 D
1807 1954 D
1807 1949 D
1821 1949 D
1821 1946 D
1836 1946 D
1836 1940 D
1850 1940 D
1850 1935 D
1865 1935 D
1865 1932 D
1880 1932 D
1880 1927 D
1894 1927 D
1894 1924 D
1909 1924 D
1909 1920 D
1923 1920 D
1923 1913 D
1938 1913 D
1938 1911 D
1952 1911 D
1952 1909 D
1967 1909 D
S
0 0 1 setrgbcolor
N
1327 2117 M
1339 2117 D
S
N
1351 2117 M
1363 2117 D
S
N
1375 2117 M
1387 2117 D
S
N
1400 2117 M
1412 2117 D
S
N
1424 2117 M
1431 2117 D
S
583 1520 P
N
583 1520 M
583 1520 D
S
N
656 1520 M
656 1532 D
S
N
656 1544 M
656 1556 D
S
N
656 1569 M
656 1581 D
S
N
656 1593 M
656 1598 D
663 1598 D
S
N
670 1602 M
670 1615 D
S
N
670 1627 M
670 1639 D
S
N
670 1651 M
670 1663 D
S
N
670 1675 M
670 1687 D
S
N
670 1699 M
670 1711 D
S
N
676 1718 M
685 1718 D
685 1721 D
S
N
685 1733 M
685 1741 D
689 1741 D
S
N
700 1743 M
700 1755 D
S
N
701 1765 M
713 1765 D
S
N
714 1777 M
714 1783 D
720 1783 D
S
N
729 1786 M
729 1798 D
S
N
739 1800 M
743 1800 D
743 1808 D
S
N
749 1815 M
758 1815 D
758 1818 D
S
N
765 1823 M
772 1823 D
772 1827 D
S
N
772 1840 M
772 1842 D
782 1842 D
S
N
789 1847 M
801 1847 D
S
N
802 1859 M
802 1859 D
814 1859 D
S
N
817 1868 M
829 1868 D
S
N
834 1874 M
845 1874 D
845 1876 D
S
N
848 1885 M
860 1885 D
860 1885 D
S
N
861 1896 M
873 1896 D
S
N
876 1906 M
888 1906 D
S
N
893 1913 M
904 1913 D
904 1914 D
S
N
912 1918 M
918 1918 D
918 1924 D
S
N
925 1930 M
933 1930 D
933 1934 D
S
N
938 1940 M
947 1940 D
947 1943 D
S
N
958 1944 M
962 1944 D
962 1951 D
964 1951 D
S
N
976 1951 M
976 1951 D
976 1962 D
977 1962 D
S
N
989 1962 M
991 1962 D
991 1971 D
992 1971 D
S
N
1004 1971 M
1005 1971 D
1005 1974 D
1013 1974 D
S
N
1020 1979 M
1020 1984 D
1027 1984 D
S
N
1035 1989 M
1035 1991 D
1045 1991 D
S
N
1049 1999 M
1049 1999 D
1061 1999 D
S
N
1065 2007 M
1077 2007 D
S
N
1080 2016 M
1092 2016 D
S
N
1097 2024 M
1107 2024 D
1107 2025 D
S
N
1112 2033 M
1122 2033 D
1122 2035 D
S
N
1130 2039 M
1137 2039 D
1137 2045 D
S
N
1149 2045 M
1151 2045 D
1151 2054 D
S
N
1160 2058 M
1166 2058 D
1166 2062 D
1167 2062 D
S
N
1179 2062 M
1180 2062 D
1180 2072 D
1182 2072 D
S
N
1194 2072 M
1195 2072 D
1195 2075 D
1203 2075 D
S
N
1210 2080 M
1222 2080 D
S
N
1225 2089 M
1237 2089 D
S
N
1247 2092 M
1253 2092 D
1253 2096 D
1255 2096 D
S
N
1267 2096 M
1268 2096 D
1268 2098 D
1277 2098 D
S
N
1288 2098 M
1297 2098 D
1297 2095 D
1297 2095 D
S
N
1309 2095 M
1311 2095 D
1311 2091 D
1318 2091 D
S
N
1326 2087 M
1326 2085 D
1337 2085 D
S
N
1341 2078 M
1353 2078 D
S
N
1355 2068 M
1355 2064 D
1364 2064 D
S
N
1370 2058 M
1370 2053 D
1376 2053 D
S
N
1384 2048 M
1384 2041 D
1389 2041 D
S
N
1399 2039 M
1399 2036 D
1408 2036 D
S
N
1415 2030 M
1427 2030 D
S
N
1435 2027 M
1443 2027 D
1443 2025 D
1446 2025 D
S
N
1458 2025 M
1470 2025 D
S
N
1481 2024 M
1486 2024 D
1486 2022 D
1491 2022 D
S
N
1501 2020 M
1501 2018 D
1511 2018 D
S
N
1519 2013 M
1530 2013 D
1530 2012 D
S
N
1540 2010 M
1545 2010 D
1545 2009 D
1551 2009 D
S
N
1563 2009 M
1574 2009 D
1574 2008 D
S
N
1582 2004 M
1588 2004 D
1588 2004 D
1594 2004 D
S
N
1603 2001 M
1603 1998 D
1612 1998 D
S
N
1621 1995 M
1632 1995 D
1632 1995 D
1632 1995 D
S
N
1644 1995 M
1646 1995 D
1646 1993 D
1653 1993 D
S
N
1661 1988 M
1661 1985 D
1670 1985 D
S
N
1680 1982 M
1690 1982 D
1690 1981 D
S
N
1700 1979 M
1705 1979 D
1705 1977 D
1711 1977 D
S
N
1719 1974 M
1719 1970 D
1728 1970 D
S
N
1738 1968 M
1748 1968 D
1748 1967 D
S
N
1760 1966 M
1763 1966 D
1763 1957 D
1763 1957 D
S
N
1775 1957 M
1778 1957 D
1778 1954 D
1784 1954 D
S
N
1795 1952 M
1807 1952 D
1807 1952 D
S
N
1812 1946 M
1821 1946 D
1821 1942 D
S
N
1831 1940 M
1836 1940 D
1836 1940 D
1843 1940 D
S
N
1850 1935 M
1850 1933 D
1860 1933 D
S
N
1869 1930 M
1880 1930 D
1880 1928 D
S
N
1887 1923 M
1894 1923 D
1894 1921 D
1897 1921 D
S
N
1909 1921 M
1909 1916 D
1915 1916 D
S
N
1924 1912 M
1936 1912 D
S
N
1942 1906 M
1952 1906 D
1952 1905 D
1953 1905 D
S
N
1965 1905 M
1967 1905 D
S
3 Sw
0 0 0 setrgbcolor
N
833 1477 M
833 1476 D
832 1476 D
832 1477 D
833 1478 D
836 1480 D
841 1480 D
844 1478 D
845 1477 D
847 1474 D
847 1465 D
848 1462 D
849 1461 D
S
N
845 1477 M
845 1465 D
847 1462 D
849 1461 D
851 1461 D
S
N
845 1474 M
844 1473 D
836 1472 D
832 1470 D
830 1467 D
830 1465 D
832 1462 D
836 1461 D
840 1461 D
843 1462 D
845 1465 D
S
N
836 1472 M
833 1470 D
832 1467 D
832 1465 D
833 1462 D
836 1461 D
S
N
860 1489 M
860 1461 D
S
N
862 1489 M
870 1465 D
S
N
860 1489 M
870 1461 D
S
N
879 1489 M
870 1461 D
S
N
879 1489 M
879 1461 D
S
N
881 1489 M
881 1461 D
S
N
856 1489 M
862 1489 D
S
N
879 1489 M
885 1489 D
S
N
856 1461 M
864 1461 D
S
N
875 1461 M
885 1461 D
S
N
911 1485 M
912 1481 D
912 1489 D
911 1485 D
908 1488 D
904 1489 D
901 1489 D
897 1488 D
895 1485 D
893 1482 D
892 1478 D
892 1472 D
893 1467 D
895 1465 D
897 1462 D
901 1461 D
904 1461 D
908 1462 D
911 1465 D
912 1467 D
S
N
901 1489 M
899 1488 D
896 1485 D
895 1482 D
893 1478 D
893 1472 D
895 1467 D
896 1465 D
899 1462 D
901 1461 D
S
N
941 1478 M
940 1481 D
937 1482 D
933 1482 D
930 1481 D
929 1480 D
927 1476 D
927 1472 D
929 1469 D
931 1467 D
936 1467 D
938 1469 D
940 1472 D
S
N
933 1482 M
930 1480 D
929 1476 D
929 1472 D
930 1469 D
931 1467 D
S
N
941 1482 M
940 1472 D
940 1469 D
942 1467 D
945 1467 D
948 1470 D
949 1474 D
949 1477 D
948 1481 D
947 1484 D
944 1487 D
941 1488 D
937 1489 D
933 1489 D
929 1488 D
926 1487 D
923 1484 D
922 1481 D
921 1477 D
921 1473 D
922 1469 D
923 1466 D
926 1463 D
929 1462 D
933 1461 D
937 1461 D
941 1462 D
944 1463 D
945 1465 D
S
N
942 1482 M
941 1472 D
941 1469 D
942 1467 D
S
N
960 1489 M
960 1461 D
S
N
962 1489 M
978 1463 D
S
N
962 1487 M
978 1461 D
S
N
978 1489 M
978 1461 D
S
N
956 1489 M
962 1489 D
S
N
974 1489 M
982 1489 D
S
N
956 1461 M
964 1461 D
S
N
992 1489 M
992 1461 D
S
N
993 1489 M
993 1461 D
S
N
988 1489 M
997 1489 D
S
N
988 1461 M
1008 1461 D
1008 1469 D
1007 1461 D
S
N
1023 1489 M
1019 1488 D
1016 1485 D
1015 1482 D
1014 1477 D
1014 1473 D
1015 1467 D
1016 1465 D
1019 1462 D
1023 1461 D
1026 1461 D
1030 1462 D
1033 1465 D
1034 1467 D
1035 1473 D
1035 1477 D
1034 1482 D
1033 1485 D
1030 1488 D
1026 1489 D
1023 1489 D
S
N
1023 1489 M
1020 1488 D
1018 1485 D
1016 1482 D
1015 1477 D
1015 1473 D
1016 1467 D
1018 1465 D
1020 1462 D
1023 1461 D
S
N
1026 1461 M
1029 1462 D
1031 1465 D
1033 1467 D
1034 1473 D
1034 1477 D
1033 1482 D
1031 1485 D
1029 1488 D
1026 1489 D
S
N
1046 1480 M
1045 1478 D
1046 1477 D
1048 1478 D
1046 1480 D
S
N
1046 1463 M
1045 1462 D
1046 1461 D
1048 1462 D
1046 1463 D
S
N
1093 1477 M
1094 1480 D
1094 1474 D
1093 1477 D
1092 1478 D
1089 1480 D
1083 1480 D
1081 1478 D
1079 1477 D
1079 1474 D
1081 1473 D
1083 1472 D
1090 1469 D
1093 1467 D
1094 1466 D
S
N
1079 1476 M
1081 1474 D
1083 1473 D
1090 1470 D
1093 1469 D
1094 1467 D
1094 1463 D
1093 1462 D
1090 1461 D
1085 1461 D
1082 1462 D
1081 1463 D
1079 1466 D
1079 1461 D
1081 1463 D
S
N
1119 1476 M
1118 1474 D
1119 1473 D
1120 1474 D
1120 1476 D
1118 1478 D
1115 1480 D
1111 1480 D
1107 1478 D
1104 1476 D
1103 1472 D
1103 1469 D
1104 1465 D
1107 1462 D
1111 1461 D
1114 1461 D
1118 1462 D
1120 1465 D
S
N
1111 1480 M
1108 1478 D
1105 1476 D
1104 1472 D
1104 1469 D
1105 1465 D
1108 1462 D
1111 1461 D
S
N
1131 1477 M
1131 1476 D
1130 1476 D
1130 1477 D
1131 1478 D
1134 1480 D
1140 1480 D
1142 1478 D
1144 1477 D
1145 1474 D
1145 1465 D
1146 1462 D
1148 1461 D
S
N
1144 1477 M
1144 1465 D
1145 1462 D
1148 1461 D
1149 1461 D
S
N
1144 1474 M
1142 1473 D
1134 1472 D
1130 1470 D
1129 1467 D
1129 1465 D
1130 1462 D
1134 1461 D
1138 1461 D
1141 1462 D
1144 1465 D
S
N
1134 1472 M
1131 1470 D
1130 1467 D
1130 1465 D
1131 1462 D
1134 1461 D
S
N
1159 1489 M
1159 1461 D
S
N
1160 1489 M
1160 1461 D
S
N
1155 1489 M
1160 1489 D
S
N
1155 1461 M
1164 1461 D
S
N
1172 1472 M
1189 1472 D
1189 1474 D
1187 1477 D
1186 1478 D
1183 1480 D
1179 1480 D
1175 1478 D
1172 1476 D
1171 1472 D
1171 1469 D
1172 1465 D
1175 1462 D
1179 1461 D
1182 1461 D
1186 1462 D
1189 1465 D
S
N
1187 1472 M
1187 1476 D
1186 1478 D
S
N
1179 1480 M
1176 1478 D
1174 1476 D
1172 1472 D
1172 1469 D
1174 1465 D
1176 1462 D
1179 1461 D
S
N
1222 1480 M
1222 1465 D
1223 1462 D
1227 1461 D
1230 1461 D
1234 1462 D
1237 1465 D
S
N
1223 1480 M
1223 1465 D
1224 1462 D
1227 1461 D
S
N
1237 1480 M
1237 1461 D
S
N
1238 1480 M
1238 1461 D
S
N
1218 1480 M
1223 1480 D
S
N
1233 1480 M
1238 1480 D
S
N
1237 1461 M
1242 1461 D
S
N
1252 1480 M
1252 1461 D
S
N
1253 1480 M
1253 1461 D
S
N
1253 1476 M
1256 1478 D
1260 1480 D
1263 1480 D
1267 1478 D
1268 1476 D
1268 1461 D
S
N
1263 1480 M
1265 1478 D
1267 1476 D
1267 1461 D
S
N
1248 1480 M
1253 1480 D
S
N
1248 1461 M
1257 1461 D
S
N
1263 1461 M
1272 1461 D
S
N
1296 1476 M
1294 1474 D
1296 1473 D
1297 1474 D
1297 1476 D
1294 1478 D
1291 1480 D
1287 1480 D
1283 1478 D
1281 1476 D
1279 1472 D
1279 1469 D
1281 1465 D
1283 1462 D
1287 1461 D
1290 1461 D
1294 1462 D
1297 1465 D
S
N
1287 1480 M
1285 1478 D
1282 1476 D
1281 1472 D
1281 1469 D
1282 1465 D
1285 1462 D
1287 1461 D
S
N
1308 1463 M
1307 1462 D
1308 1461 D
1309 1462 D
1308 1463 D
S
N
833 1304 M
833 1303 D
832 1303 D
832 1304 D
833 1305 D
836 1307 D
841 1307 D
844 1305 D
845 1304 D
847 1301 D
847 1292 D
848 1289 D
849 1288 D
S
N
845 1304 M
845 1292 D
847 1289 D
849 1288 D
851 1288 D
S
N
845 1301 M
844 1300 D
836 1299 D
832 1297 D
830 1294 D
830 1292 D
832 1289 D
836 1288 D
840 1288 D
843 1289 D
845 1292 D
S
N
836 1299 M
833 1297 D
832 1294 D
832 1292 D
833 1289 D
836 1288 D
S
N
860 1316 M
860 1288 D
S
N
862 1316 M
870 1292 D
S
N
860 1316 M
870 1288 D
S
N
879 1316 M
870 1288 D
S
N
879 1316 M
879 1288 D
S
N
881 1316 M
881 1288 D
S
N
856 1316 M
862 1316 D
S
N
879 1316 M
885 1316 D
S
N
856 1288 M
864 1288 D
S
N
875 1288 M
885 1288 D
S
N
911 1312 M
912 1308 D
912 1316 D
911 1312 D
908 1315 D
904 1316 D
901 1316 D
897 1315 D
895 1312 D
893 1309 D
892 1305 D
892 1299 D
893 1294 D
895 1292 D
897 1289 D
901 1288 D
904 1288 D
908 1289 D
911 1292 D
912 1294 D
S
N
901 1316 M
899 1315 D
896 1312 D
895 1309 D
893 1305 D
893 1299 D
895 1294 D
896 1292 D
899 1289 D
901 1288 D
S
N
941 1305 M
940 1308 D
937 1309 D
933 1309 D
930 1308 D
929 1307 D
927 1303 D
927 1299 D
929 1296 D
931 1294 D
936 1294 D
938 1296 D
940 1299 D
S
N
933 1309 M
930 1307 D
929 1303 D
929 1299 D
930 1296 D
931 1294 D
S
N
941 1309 M
940 1299 D
940 1296 D
942 1294 D
945 1294 D
948 1297 D
949 1301 D
949 1304 D
948 1308 D
947 1311 D
944 1314 D
941 1315 D
937 1316 D
933 1316 D
929 1315 D
926 1314 D
923 1311 D
922 1308 D
921 1304 D
921 1300 D
922 1296 D
923 1293 D
926 1290 D
929 1289 D
933 1288 D
937 1288 D
941 1289 D
944 1290 D
945 1292 D
S
N
942 1309 M
941 1299 D
941 1296 D
942 1294 D
S
N
960 1316 M
960 1288 D
S
N
962 1316 M
978 1290 D
S
N
962 1314 M
978 1288 D
S
N
978 1316 M
978 1288 D
S
N
956 1316 M
962 1316 D
S
N
974 1316 M
982 1316 D
S
N
956 1288 M
964 1288 D
S
N
992 1316 M
992 1288 D
S
N
993 1316 M
993 1288 D
S
N
988 1316 M
997 1316 D
S
N
988 1288 M
1008 1288 D
1008 1296 D
1007 1288 D
S
N
1023 1316 M
1019 1315 D
1016 1312 D
1015 1309 D
1014 1304 D
1014 1300 D
1015 1294 D
1016 1292 D
1019 1289 D
1023 1288 D
1026 1288 D
1030 1289 D
1033 1292 D
1034 1294 D
1035 1300 D
1035 1304 D
1034 1309 D
1033 1312 D
1030 1315 D
1026 1316 D
1023 1316 D
S
N
1023 1316 M
1020 1315 D
1018 1312 D
1016 1309 D
1015 1304 D
1015 1300 D
1016 1294 D
1018 1292 D
1020 1289 D
1023 1288 D
S
N
1026 1288 M
1029 1289 D
1031 1292 D
1033 1294 D
1034 1300 D
1034 1304 D
1033 1309 D
1031 1312 D
1029 1315 D
1026 1316 D
S
N
1046 1307 M
1045 1305 D
1046 1304 D
1048 1305 D
1046 1307 D
S
N
1046 1290 M
1045 1289 D
1046 1288 D
1048 1289 D
1046 1290 D
S
N
1082 1307 M
1082 1278 D
S
N
1083 1307 M
1083 1278 D
S
N
1083 1303 M
1086 1305 D
1089 1307 D
1092 1307 D
1096 1305 D
1098 1303 D
1100 1299 D
1100 1296 D
1098 1292 D
1096 1289 D
1092 1288 D
1089 1288 D
1086 1289 D
1083 1292 D
S
N
1092 1307 M
1094 1305 D
1097 1303 D
1098 1299 D
1098 1296 D
1097 1292 D
1094 1289 D
1092 1288 D
S
N
1078 1307 M
1083 1307 D
S
N
1078 1278 M
1088 1278 D
S
N
1124 1316 M
1124 1288 D
S
N
1126 1316 M
1126 1288 D
S
N
1124 1303 M
1122 1305 D
1119 1307 D
1116 1307 D
1112 1305 D
1109 1303 D
1108 1299 D
1108 1296 D
1109 1292 D
1112 1289 D
1116 1288 D
1119 1288 D
1122 1289 D
1124 1292 D
S
N
1116 1307 M
1114 1305 D
1111 1303 D
1109 1299 D
1109 1296 D
1111 1292 D
1114 1289 D
1116 1288 D
S
N
1120 1316 M
1126 1316 D
S
N
1124 1288 M
1130 1288 D
S
N
1146 1315 M
1145 1314 D
1146 1312 D
1148 1314 D
1148 1315 D
1146 1316 D
1144 1316 D
1141 1315 D
1140 1312 D
1140 1288 D
S
N
1144 1316 M
1142 1315 D
1141 1312 D
1141 1288 D
S
N
1135 1307 M
1146 1307 D
S
N
1135 1288 M
1145 1288 D
S
N
1179 1307 M
1179 1292 D
1181 1289 D
1185 1288 D
1187 1288 D
1192 1289 D
1194 1292 D
S
N
1181 1307 M
1181 1292 D
1182 1289 D
1185 1288 D
S
N
1194 1307 M
1194 1288 D
S
N
1196 1307 M
1196 1288 D
S
N
1175 1307 M
1181 1307 D
S
N
1190 1307 M
1196 1307 D
S
N
1194 1288 M
1200 1288 D
S
N
1209 1307 M
1209 1288 D
S
N
1211 1307 M
1211 1288 D
S
N
1211 1303 M
1213 1305 D
1218 1307 D
1220 1307 D
1224 1305 D
1226 1303 D
1226 1288 D
S
N
1220 1307 M
1223 1305 D
1224 1303 D
1224 1288 D
S
N
1205 1307 M
1211 1307 D
S
N
1205 1288 M
1215 1288 D
S
N
1220 1288 M
1230 1288 D
S
N
1253 1303 M
1252 1301 D
1253 1300 D
1254 1301 D
1254 1303 D
1252 1305 D
1249 1307 D
1245 1307 D
1241 1305 D
1238 1303 D
1237 1299 D
1237 1296 D
1238 1292 D
1241 1289 D
1245 1288 D
1248 1288 D
1252 1289 D
1254 1292 D
S
N
1245 1307 M
1242 1305 D
1239 1303 D
1238 1299 D
1238 1296 D
1239 1292 D
1242 1289 D
1245 1288 D
S
N
1265 1290 M
1264 1289 D
1265 1288 D
1267 1289 D
1265 1290 D
S
4 Sw
N
583 1520 M
583 1261 D
S
N
583 1261 M
1967 1261 D
S
N
1967 1261 M
1967 1520 D
S
N
1967 1520 M
583 1520 D
S
N
583 1261 M
1967 1261 D
S
N
583 1261 M
583 1276 D
S
N
656 1266 M
656 1261 D
S
N
729 1261 M
729 1266 D
S
N
802 1266 M
802 1261 D
S
N
874 1261 M
874 1266 D
S
N
947 1276 M
947 1261 D
S
N
1020 1261 M
1020 1266 D
S
N
1093 1266 M
1093 1261 D
S
N
1166 1261 M
1166 1266 D
S
N
1239 1266 M
1239 1261 D
S
N
1311 1261 M
1311 1276 D
S
N
1384 1266 M
1384 1261 D
S
N
1457 1261 M
1457 1266 D
S
N
1530 1266 M
1530 1261 D
S
N
1603 1261 M
1603 1266 D
S
N
1676 1276 M
1676 1261 D
S
N
1748 1261 M
1748 1266 D
S
N
1821 1266 M
1821 1261 D
S
N
1894 1261 M
1894 1266 D
S
N
1967 1266 M
1967 1261 D
S
N
583 1520 M
1967 1520 D
S
N
583 1505 M
583 1520 D
S
N
656 1520 M
656 1515 D
S
N
729 1515 M
729 1520 D
S
N
802 1520 M
802 1515 D
S
N
874 1515 M
874 1520 D
S
N
947 1520 M
947 1505 D
S
N
1020 1515 M
1020 1520 D
S
N
1093 1520 M
1093 1515 D
S
N
1166 1515 M
1166 1520 D
S
N
1239 1520 M
1239 1515 D
S
N
1311 1505 M
1311 1520 D
S
N
1384 1520 M
1384 1515 D
S
N
1457 1515 M
1457 1520 D
S
N
1530 1520 M
1530 1515 D
S
N
1603 1515 M
1603 1520 D
S
N
1676 1520 M
1676 1505 D
S
N
1748 1515 M
1748 1520 D
S
N
1821 1520 M
1821 1515 D
S
N
1894 1515 M
1894 1520 D
S
N
1967 1520 M
1967 1515 D
S
N
583 1261 M
583 1520 D
S
N
583 1261 M
588 1261 D
S
N
588 1273 M
583 1273 D
S
N
583 1285 M
599 1285 D
S
N
588 1297 M
583 1297 D
S
N
583 1309 M
588 1309 D
S
N
588 1321 M
583 1321 D
S
N
583 1333 M
588 1333 D
S
N
599 1345 M
583 1345 D
S
N
583 1357 M
588 1357 D
S
N
588 1369 M
583 1369 D
S
N
583 1381 M
588 1381 D
S
N
588 1394 M
583 1394 D
S
N
583 1406 M
599 1406 D
S
N
588 1418 M
583 1418 D
S
N
583 1430 M
588 1430 D
S
N
588 1442 M
583 1442 D
S
N
583 1454 M
588 1454 D
S
N
599 1466 M
583 1466 D
S
N
583 1478 M
588 1478 D
S
N
588 1490 M
583 1490 D
S
N
583 1502 M
588 1502 D
S
N
588 1514 M
583 1514 D
S
N
503 1298 M
498 1297 D
495 1292 D
494 1285 D
494 1280 D
495 1273 D
498 1268 D
503 1267 D
506 1267 D
510 1268 D
513 1273 D
515 1280 D
515 1285 D
513 1292 D
510 1297 D
506 1298 D
503 1298 D
S
N
503 1298 M
500 1297 D
498 1295 D
497 1292 D
495 1285 D
495 1280 D
497 1273 D
498 1270 D
500 1268 D
503 1267 D
S
N
506 1267 M
509 1268 D
510 1270 D
512 1273 D
513 1280 D
513 1285 D
512 1292 D
510 1295 D
509 1297 D
506 1298 D
S
N
527 1270 M
525 1268 D
527 1267 D
528 1268 D
527 1270 D
S
N
547 1298 M
542 1297 D
541 1294 D
541 1289 D
542 1286 D
547 1285 D
553 1285 D
557 1286 D
559 1289 D
559 1294 D
557 1297 D
553 1298 D
547 1298 D
S
N
547 1298 M
544 1297 D
542 1294 D
542 1289 D
544 1286 D
547 1285 D
S
N
553 1285 M
556 1286 D
557 1289 D
557 1294 D
556 1297 D
553 1298 D
S
N
547 1285 M
542 1283 D
541 1282 D
539 1279 D
539 1273 D
541 1270 D
542 1268 D
547 1267 D
553 1267 D
557 1268 D
559 1270 D
560 1273 D
560 1279 D
559 1282 D
557 1283 D
553 1285 D
S
N
547 1285 M
544 1283 D
542 1282 D
541 1279 D
541 1273 D
542 1270 D
544 1268 D
547 1267 D
S
N
553 1267 M
556 1268 D
557 1270 D
559 1273 D
559 1279 D
557 1282 D
556 1283 D
553 1285 D
S
N
503 1359 M
498 1357 D
495 1353 D
494 1345 D
494 1341 D
495 1333 D
498 1329 D
503 1327 D
506 1327 D
510 1329 D
513 1333 D
515 1341 D
515 1345 D
513 1353 D
510 1357 D
506 1359 D
503 1359 D
S
N
503 1359 M
500 1357 D
498 1356 D
497 1353 D
495 1345 D
495 1341 D
497 1333 D
498 1330 D
500 1329 D
503 1327 D
S
N
506 1327 M
509 1329 D
510 1330 D
512 1333 D
513 1341 D
513 1345 D
512 1353 D
510 1356 D
509 1357 D
506 1359 D
S
N
527 1330 M
525 1329 D
527 1327 D
528 1329 D
527 1330 D
S
N
559 1348 M
557 1344 D
554 1341 D
550 1339 D
548 1339 D
544 1341 D
541 1344 D
539 1348 D
539 1350 D
541 1354 D
544 1357 D
548 1359 D
551 1359 D
556 1357 D
559 1354 D
560 1350 D
560 1341 D
559 1335 D
557 1332 D
554 1329 D
550 1327 D
545 1327 D
542 1329 D
541 1332 D
541 1333 D
542 1335 D
544 1333 D
542 1332 D
S
N
548 1339 M
545 1341 D
542 1344 D
541 1348 D
541 1350 D
542 1354 D
545 1357 D
548 1359 D
S
N
551 1359 M
554 1357 D
557 1354 D
559 1350 D
559 1341 D
557 1335 D
556 1332 D
553 1329 D
550 1327 D
S
N
498 1413 M
501 1415 D
506 1419 D
506 1387 D
S
N
504 1418 M
504 1387 D
S
N
498 1387 M
512 1387 D
S
N
527 1390 M
525 1389 D
527 1387 D
528 1389 D
527 1390 D
S
N
548 1419 M
544 1418 D
541 1413 D
539 1406 D
539 1401 D
541 1394 D
544 1389 D
548 1387 D
551 1387 D
556 1389 D
559 1394 D
560 1401 D
560 1406 D
559 1413 D
556 1418 D
551 1419 D
548 1419 D
S
N
548 1419 M
545 1418 D
544 1416 D
542 1413 D
541 1406 D
541 1401 D
542 1394 D
544 1390 D
545 1389 D
548 1387 D
S
N
551 1387 M
554 1389 D
556 1390 D
557 1394 D
559 1401 D
559 1406 D
557 1413 D
556 1416 D
554 1418 D
551 1419 D
S
N
498 1473 M
501 1475 D
506 1480 D
506 1448 D
S
N
504 1478 M
504 1448 D
S
N
498 1448 M
512 1448 D
S
N
527 1451 M
525 1449 D
527 1448 D
528 1449 D
527 1451 D
S
N
544 1473 M
547 1475 D
551 1480 D
551 1448 D
S
N
550 1478 M
550 1448 D
S
N
544 1448 M
557 1448 D
S
N
1967 1261 M
1967 1520 D
S
N
1962 1261 M
1967 1261 D
S
N
1967 1273 M
1962 1273 D
S
N
1951 1285 M
1967 1285 D
S
N
1967 1297 M
1962 1297 D
S
N
1962 1309 M
1967 1309 D
S
N
1967 1321 M
1962 1321 D
S
N
1962 1333 M
1967 1333 D
S
N
1967 1345 M
1951 1345 D
S
N
1962 1357 M
1967 1357 D
S
N
1967 1369 M
1962 1369 D
S
N
1962 1381 M
1967 1381 D
S
N
1967 1394 M
1962 1394 D
S
N
1951 1406 M
1967 1406 D
S
N
1967 1418 M
1962 1418 D
S
N
1962 1430 M
1967 1430 D
S
N
1967 1442 M
1962 1442 D
S
N
1962 1454 M
1967 1454 D
S
N
1967 1466 M
1951 1466 D
S
N
1962 1478 M
1967 1478 D
S
N
1967 1490 M
1962 1490 D
S
N
1962 1502 M
1967 1502 D
S
N
1967 1514 M
1962 1514 D
S
N
656 1261 M
656 1423 D
670 1423 D
670 1422 D
685 1422 D
685 1422 D
700 1422 D
700 1422 D
714 1422 D
714 1422 D
729 1422 D
729 1422 D
743 1422 D
743 1422 D
758 1422 D
758 1421 D
772 1421 D
772 1421 D
787 1421 D
787 1422 D
802 1422 D
802 1422 D
816 1422 D
816 1421 D
831 1421 D
831 1422 D
845 1422 D
845 1422 D
860 1422 D
860 1422 D
874 1422 D
874 1422 D
S
N
874 1422 M
889 1422 D
889 1422 D
904 1422 D
904 1422 D
918 1422 D
918 1422 D
933 1422 D
933 1422 D
947 1422 D
947 1422 D
962 1422 D
962 1422 D
976 1422 D
976 1422 D
991 1422 D
991 1422 D
1005 1422 D
1005 1422 D
1020 1422 D
1020 1422 D
1035 1422 D
1035 1422 D
1049 1422 D
1049 1422 D
1064 1422 D
1064 1422 D
1078 1422 D
1078 1422 D
1093 1422 D
1093 1422 D
1107 1422 D
1107 1422 D
1122 1422 D
1122 1422 D
1137 1422 D
1137 1422 D
1151 1422 D
1151 1422 D
1166 1422 D
1166 1422 D
1180 1422 D
1180 1422 D
1195 1422 D
1195 1422 D
1209 1422 D
1209 1422 D
1224 1422 D
1224 1422 D
1239 1422 D
1239 1422 D
1253 1422 D
1253 1422 D
1268 1422 D
1268 1422 D
1282 1422 D
1282 1422 D
1297 1422 D
1297 1422 D
1311 1422 D
1311 1422 D
1326 1422 D
1326 1422 D
1341 1422 D
1341 1422 D
1355 1422 D
1355 1422 D
1370 1422 D
1370 1422 D
1384 1422 D
1384 1422 D
1399 1422 D
1399 1422 D
1413 1422 D
1413 1422 D
1428 1422 D
1428 1421 D
1443 1421 D
1443 1422 D
1457 1422 D
1457 1422 D
1472 1422 D
1472 1422 D
1486 1422 D
1486 1422 D
1501 1422 D
1501 1422 D
1515 1422 D
1515 1422 D
1530 1422 D
1530 1422 D
1545 1422 D
1545 1422 D
1559 1422 D
1559 1422 D
1559 1422 D
1559 1422 D
1574 1422 D
1574 1423 D
1588 1423 D
1588 1422 D
1603 1422 D
1603 1422 D
1617 1422 D
1617 1422 D
1632 1422 D
1632 1423 D
1646 1423 D
1646 1422 D
1661 1422 D
1661 1423 D
1676 1423 D
1676 1423 D
1690 1423 D
1690 1423 D
1705 1423 D
1705 1423 D
1719 1423 D
1719 1423 D
1734 1423 D
1734 1423 D
1748 1423 D
1748 1423 D
1763 1423 D
1763 1423 D
1778 1423 D
1778 1423 D
1792 1423 D
1792 1424 D
1807 1424 D
1807 1424 D
1821 1424 D
1821 1423 D
1836 1423 D
1836 1423 D
1850 1423 D
1850 1424 D
1865 1424 D
1865 1424 D
1880 1424 D
1880 1424 D
1894 1424 D
1894 1424 D
1909 1424 D
1909 1424 D
1923 1424 D
1923 1424 D
1938 1424 D
1938 1424 D
1952 1424 D
1952 1425 D
1967 1425 D
S
N
656 1261 M
656 1385 D
670 1385 D
670 1387 D
685 1387 D
685 1387 D
700 1387 D
700 1386 D
714 1386 D
714 1386 D
729 1386 D
729 1386 D
743 1386 D
743 1387 D
758 1387 D
758 1387 D
772 1387 D
772 1387 D
787 1387 D
787 1386 D
802 1386 D
802 1386 D
816 1386 D
816 1387 D
831 1387 D
831 1387 D
845 1387 D
845 1387 D
860 1387 D
860 1386 D
874 1386 D
874 1387 D
889 1387 D
889 1386 D
904 1386 D
904 1386 D
918 1386 D
918 1387 D
933 1387 D
933 1387 D
947 1387 D
947 1387 D
962 1387 D
962 1387 D
976 1387 D
976 1387 D
991 1387 D
991 1387 D
1005 1387 D
1005 1387 D
1020 1387 D
1020 1387 D
1035 1387 D
1035 1387 D
1049 1387 D
1049 1387 D
1064 1387 D
1064 1386 D
1078 1386 D
1078 1387 D
1093 1387 D
1093 1387 D
1107 1387 D
1107 1387 D
1122 1387 D
1122 1387 D
1137 1387 D
1137 1387 D
1151 1387 D
1151 1387 D
1166 1387 D
1166 1387 D
1180 1387 D
1180 1387 D
1195 1387 D
1195 1386 D
1209 1386 D
1209 1387 D
1224 1387 D
1224 1387 D
1239 1387 D
1239 1387 D
1253 1387 D
1253 1387 D
1268 1387 D
1268 1387 D
1282 1387 D
1282 1387 D
1297 1387 D
1297 1387 D
1311 1387 D
1311 1387 D
1326 1387 D
1326 1387 D
1341 1387 D
1341 1387 D
1355 1387 D
1355 1387 D
1370 1387 D
1370 1387 D
1384 1387 D
1384 1387 D
1399 1387 D
1399 1387 D
1413 1387 D
1413 1387 D
1428 1387 D
1428 1387 D
1443 1387 D
1443 1387 D
1457 1387 D
1457 1387 D
1472 1387 D
1472 1387 D
1486 1387 D
1486 1387 D
1501 1387 D
1501 1387 D
1515 1387 D
1515 1387 D
1530 1387 D
1530 1387 D
1545 1387 D
1545 1386 D
1559 1386 D
1559 1386 D
1559 1386 D
1559 1386 D
1574 1386 D
1574 1386 D
1588 1386 D
1588 1386 D
1603 1386 D
1603 1386 D
1617 1386 D
1617 1386 D
1632 1386 D
1632 1386 D
1646 1386 D
1646 1386 D
1661 1386 D
1661 1386 D
1676 1386 D
1676 1386 D
1690 1386 D
1690 1386 D
1705 1386 D
1705 1386 D
1719 1386 D
1719 1386 D
1734 1386 D
1734 1386 D
1748 1386 D
1748 1386 D
1763 1386 D
1763 1385 D
1778 1385 D
1778 1385 D
1792 1385 D
1792 1385 D
1807 1385 D
1807 1385 D
1821 1385 D
1821 1385 D
1836 1385 D
1836 1385 D
1850 1385 D
1850 1385 D
1865 1385 D
1865 1385 D
1880 1385 D
1880 1385 D
1894 1385 D
1894 1385 D
1909 1385 D
1909 1385 D
1923 1385 D
1923 1385 D
1938 1385 D
1938 1385 D
1952 1385 D
1952 1384 D
1967 1384 D
S
N
721 1304 M
808 1304 D
S
0 0 1 setrgbcolor
N
656 1261 M
656 1273 D
S
N
656 1285 M
656 1297 D
S
N
656 1309 M
656 1321 D
S
N
656 1333 M
656 1346 D
S
N
656 1358 M
656 1370 D
S
N
656 1382 M
656 1394 D
S
N
656 1406 M
656 1418 D
S
N
656 1430 M
656 1442 D
S
N
659 1451 M
670 1451 D
670 1450 D
S
N
670 1438 M
670 1430 D
675 1430 D
S
N
685 1428 M
685 1419 D
688 1419 D
S
N
700 1420 M
700 1432 D
S
N
700 1444 M
700 1446 D
710 1446 D
S
N
714 1437 M
714 1430 D
719 1430 D
S
N
729 1428 M
729 1425 D
738 1425 D
S
N
743 1432 M
743 1433 D
754 1433 D
S
N
758 1441 M
758 1449 D
762 1449 D
S
N
772 1447 M
772 1435 D
S
N
778 1428 M
787 1428 D
787 1431 D
S
N
794 1436 M
802 1436 D
802 1432 D
S
N
809 1428 M
816 1428 D
816 1423 D
817 1423 D
S
N
829 1423 M
831 1423 D
831 1430 D
834 1430 D
S
N
845 1431 M
845 1431 D
857 1431 D
S
N
869 1431 M
874 1431 D
874 1431 D
881 1431 D
S
N
889 1427 M
889 1425 D
899 1425 D
S
N
905 1430 M
917 1430 D
S
N
928 1429 M
933 1429 D
933 1431 D
937 1431 D
S
N
947 1429 M
947 1425 D
955 1425 D
S
N
964 1428 M
976 1428 D
976 1428 D
S
N
986 1430 M
991 1430 D
991 1425 D
993 1425 D
S
N
1005 1425 M
1005 1425 D
1005 1432 D
1011 1432 D
S
N
1022 1433 M
1034 1433 D
S
N
1041 1428 M
1049 1428 D
1049 1429 D
1052 1429 D
S
N
1064 1429 M
1064 1434 D
1071 1434 D
S
N
1078 1430 M
1078 1425 D
1086 1425 D
S
N
1098 1425 M
1107 1425 D
1107 1424 D
1108 1424 D
S
N
1121 1424 M
1122 1424 D
1122 1421 D
1130 1421 D
S
N
1141 1422 M
1151 1422 D
1151 1424 D
S
N
1154 1433 M
1166 1433 D
1166 1433 D
S
N
1168 1423 M
1180 1423 D
S
N
1192 1423 M
1195 1423 D
1195 1423 D
1204 1423 D
S
N
1214 1425 M
1224 1425 D
1224 1426 D
1225 1426 D
S
N
1237 1426 M
1239 1426 D
1239 1422 D
1245 1422 D
S
N
1254 1424 M
1266 1424 D
S
N
1277 1423 M
1282 1423 D
1282 1422 D
1288 1422 D
S
N
1297 1425 M
1297 1426 D
1309 1426 D
S
N
1318 1424 M
1326 1424 D
1326 1422 D
1328 1422 D
S
N
1341 1422 M
1341 1422 D
1353 1422 D
S
N
1362 1425 M
1370 1425 D
1370 1422 D
1371 1422 D
S
N
1383 1422 M
1384 1422 D
1384 1422 D
1394 1422 D
S
N
1406 1422 M
1413 1422 D
1413 1419 D
1415 1419 D
S
N
1427 1419 M
1428 1419 D
1428 1421 D
1438 1421 D
S
N
1449 1420 M
1457 1420 D
1457 1423 D
1459 1423 D
S
N
1471 1423 M
1472 1423 D
1472 1419 D
1480 1419 D
S
N
1488 1423 M
1501 1423 D
S
N
1512 1424 M
1515 1424 D
1515 1419 D
1519 1419 D
S
N
1530 1420 M
1530 1420 D
1542 1420 D
S
N
1551 1423 M
1559 1423 D
1559 1427 D
1559 1427 D
1559 1427 D
1560 1427 D
S
N
1572 1427 M
1574 1427 D
1574 1422 D
1579 1422 D
S
N
1588 1419 M
1601 1419 D
S
N
1609 1423 M
1617 1423 D
1617 1421 D
1619 1421 D
S
N
1631 1421 M
1632 1421 D
1632 1421 D
1643 1421 D
S
N
1650 1426 M
1661 1426 D
1661 1424 D
S
N
1671 1422 M
1676 1422 D
1676 1420 D
1681 1420 D
S
N
1691 1423 M
1703 1423 D
S
N
1714 1425 M
1719 1425 D
1719 1423 D
1724 1423 D
S
N
1734 1421 M
1734 1420 D
1746 1420 D
S
N
1756 1419 M
1763 1419 D
1763 1424 D
S
N
1771 1428 M
1778 1428 D
1778 1424 D
1779 1424 D
S
N
1791 1424 M
1792 1424 D
1792 1423 D
1802 1423 D
S
N
1812 1421 M
1821 1421 D
1821 1424 D
S
N
1831 1427 M
1836 1427 D
1836 1424 D
1839 1424 D
S
N
1850 1423 M
1850 1418 D
1858 1418 D
S
N
1865 1423 M
1877 1423 D
S
N
1888 1422 M
1894 1422 D
1894 1422 D
1900 1422 D
S
N
1912 1423 M
1923 1423 D
1923 1423 D
1924 1423 D
S
N
1936 1423 M
1938 1423 D
1938 1420 D
1945 1420 D
S
N
1955 1422 M
1967 1422 D
S
N
656 1261 M
656 1273 D
S
N
656 1285 M
656 1297 D
S
N
656 1309 M
656 1321 D
S
N
656 1333 M
656 1338 D
664 1338 D
S
N
670 1343 M
670 1351 D
675 1351 D
S
N
685 1353 M
685 1355 D
695 1355 D
S
N
700 1347 M
700 1341 D
705 1341 D
S
N
714 1344 M
714 1348 D
723 1348 D
S
N
732 1351 M
743 1351 D
743 1351 D
S
N
752 1347 M
758 1347 D
758 1341 D
S
N
768 1340 M
772 1340 D
772 1348 D
S
N
783 1349 M
787 1349 D
787 1345 D
792 1345 D
S
N
802 1347 M
802 1349 D
812 1349 D
S
N
818 1355 M
830 1355 D
S
N
836 1348 M
845 1348 D
845 1347 D
847 1347 D
S
N
859 1347 M
860 1347 D
860 1348 D
871 1348 D
S
N
883 1347 M
889 1347 D
889 1350 D
892 1350 D
S
N
904 1350 M
904 1348 D
914 1348 D
S
N
925 1349 M
933 1349 D
933 1347 D
936 1347 D
S
N
947 1348 M
947 1350 D
957 1350 D
S
N
967 1349 M
976 1349 D
976 1348 D
978 1348 D
S
N
990 1348 M
991 1348 D
991 1350 D
1001 1350 D
S
N
1010 1347 M
1020 1347 D
1020 1347 D
1022 1347 D
S
N
1034 1347 M
1035 1347 D
1035 1349 D
1043 1349 D
S
N
1055 1348 M
1064 1348 D
1064 1346 D
1064 1346 D
S
N
1077 1346 M
1078 1346 D
1078 1351 D
1084 1351 D
S
N
1096 1351 M
1107 1351 D
1107 1351 D
1108 1351 D
S
N
1120 1351 M
1122 1351 D
1122 1354 D
1129 1354 D
S
N
1140 1352 M
1151 1352 D
1151 1351 D
S
N
1158 1346 M
1166 1346 D
1166 1351 D
S
N
1177 1351 M
1180 1351 D
1180 1352 D
1189 1352 D
S
N
1200 1354 M
1209 1354 D
1209 1351 D
S
N
1220 1350 M
1224 1350 D
1224 1350 D
1232 1350 D
S
N
1241 1353 M
1253 1353 D
1253 1353 D
S
N
1263 1351 M
1268 1351 D
1268 1352 D
1274 1352 D
S
N
1285 1353 M
1297 1353 D
1297 1352 D
S
N
1308 1351 M
1311 1351 D
1311 1352 D
1318 1352 D
S
N
1330 1353 M
1341 1353 D
1341 1353 D
1342 1353 D
S
N
1354 1353 M
1355 1353 D
1355 1350 D
1363 1350 D
S
N
1370 1356 M
1370 1357 D
1381 1357 D
S
N
1388 1353 M
1399 1353 D
1399 1354 D
1399 1354 D
S
N
1411 1354 M
1413 1354 D
1413 1356 D
1422 1356 D
S
N
1434 1355 M
1443 1355 D
1443 1354 D
1444 1354 D
S
N
1456 1354 M
1457 1354 D
1457 1352 D
1466 1352 D
S
N
1475 1355 M
1486 1355 D
1486 1354 D
1486 1354 D
S
N
1499 1354 M
1501 1354 D
1501 1351 D
1508 1351 D
S
N
1516 1355 M
1528 1355 D
S
N
1539 1354 M
1545 1354 D
1545 1351 D
1547 1351 D
S
N
1559 1350 M
1559 1349 D
1559 1349 D
1559 1349 D
1570 1349 D
S
N
1579 1352 M
1588 1352 D
1588 1355 D
S
N
1599 1356 M
1603 1356 D
1603 1352 D
1607 1352 D
S
N
1619 1352 M
1631 1352 D
S
N
1642 1354 M
1646 1354 D
1646 1352 D
1652 1352 D
S
N
1664 1352 M
1676 1352 D
1676 1353 D
S
N
1687 1354 M
1690 1354 D
1690 1351 D
1695 1351 D
S
N
1707 1351 M
1719 1351 D
S
N
1730 1352 M
1734 1352 D
1734 1356 D
1738 1356 D
S
N
1750 1357 M
1762 1357 D
S
N
1766 1349 M
1778 1349 D
1778 1349 D
S
N
1787 1352 M
1792 1352 D
1792 1354 D
1797 1354 D
S
N
1809 1353 M
1821 1353 D
S
N
1830 1350 M
1836 1350 D
1836 1351 D
1841 1351 D
S
N
1850 1354 M
1850 1356 D
1860 1356 D
S
N
1868 1351 M
1880 1351 D
1880 1351 D
S
N
1891 1352 M
1894 1352 D
1894 1352 D
1902 1352 D
S
N
1913 1353 M
1923 1353 D
1923 1352 D
1925 1352 D
S
N
1937 1352 M
1938 1352 D
1938 1354 D
1947 1354 D
S
N
1956 1352 M
1967 1352 D
S
N
721 1477 M
734 1477 D
S
N
746 1477 M
758 1477 D
S
N
770 1477 M
782 1477 D
S
N
794 1477 M
806 1477 D
S
3 Sw
0 0 0 setrgbcolor
N
833 1230 M
833 1201 D
S
N
834 1230 M
834 1201 D
S
N
829 1230 M
845 1230 D
849 1228 D
851 1227 D
852 1224 D
852 1220 D
851 1217 D
849 1216 D
845 1215 D
834 1215 D
S
N
845 1230 M
848 1228 D
849 1227 D
851 1224 D
851 1220 D
849 1217 D
848 1216 D
845 1215 D
S
N
829 1201 M
838 1201 D
S
N
870 1230 M
866 1228 D
863 1226 D
862 1223 D
860 1217 D
860 1213 D
862 1208 D
863 1205 D
866 1202 D
870 1201 D
873 1201 D
877 1202 D
879 1205 D
881 1208 D
882 1213 D
882 1217 D
881 1223 D
879 1226 D
877 1228 D
873 1230 D
870 1230 D
S
N
870 1230 M
867 1228 D
864 1226 D
863 1223 D
862 1217 D
862 1213 D
863 1208 D
864 1205 D
867 1202 D
870 1201 D
S
N
873 1201 M
875 1202 D
878 1205 D
879 1208 D
881 1213 D
881 1217 D
879 1223 D
878 1226 D
875 1228 D
873 1230 D
S
N
892 1230 M
897 1201 D
S
N
893 1230 M
897 1208 D
S
N
903 1230 M
897 1201 D
S
N
903 1230 M
908 1201 D
S
N
904 1230 M
908 1208 D
S
N
914 1230 M
908 1201 D
S
N
888 1230 M
897 1230 D
S
N
910 1230 M
918 1230 D
S
N
926 1230 M
926 1201 D
S
N
927 1230 M
927 1201 D
S
N
944 1230 M
944 1201 D
S
N
945 1230 M
945 1201 D
S
N
922 1230 M
931 1230 D
S
N
940 1230 M
949 1230 D
S
N
927 1216 M
944 1216 D
S
N
922 1201 M
931 1201 D
S
N
940 1201 M
949 1201 D
S
N
959 1230 M
959 1201 D
S
N
960 1230 M
960 1201 D
S
N
968 1222 M
968 1211 D
S
N
955 1230 M
977 1230 D
977 1222 D
975 1230 D
S
N
960 1216 M
968 1216 D
S
N
955 1201 M
977 1201 D
977 1209 D
975 1201 D
S
N
988 1230 M
988 1201 D
S
N
989 1230 M
989 1201 D
S
N
983 1230 M
993 1230 D
S
N
983 1201 M
1004 1201 D
1004 1209 D
1003 1201 D
S
N
1012 1220 M
1011 1219 D
1012 1217 D
1014 1219 D
1012 1220 D
S
N
1012 1204 M
1011 1202 D
1012 1201 D
1014 1202 D
1012 1204 D
S
N
1048 1220 M
1048 1191 D
S
N
1049 1220 M
1049 1191 D
S
N
1049 1216 M
1052 1219 D
1055 1220 D
1057 1220 D
1061 1219 D
1064 1216 D
1066 1212 D
1066 1209 D
1064 1205 D
1061 1202 D
1057 1201 D
1055 1201 D
1052 1202 D
1049 1205 D
S
N
1057 1220 M
1060 1219 D
1063 1216 D
1064 1212 D
1064 1209 D
1063 1205 D
1060 1202 D
1057 1201 D
S
N
1044 1220 M
1049 1220 D
S
N
1044 1191 M
1053 1191 D
S
N
1075 1220 M
1083 1201 D
S
N
1077 1220 M
1083 1204 D
S
N
1092 1220 M
1083 1201 D
1081 1196 D
1078 1193 D
1075 1191 D
1074 1191 D
1072 1193 D
1074 1194 D
1075 1193 D
S
N
1072 1220 M
1081 1220 D
S
N
1086 1220 M
1094 1220 D
S
N
1103 1230 M
1103 1207 D
1104 1202 D
1107 1201 D
1109 1201 D
1112 1202 D
1114 1205 D
S
N
1104 1230 M
1104 1207 D
1105 1202 D
1107 1201 D
S
N
1098 1220 M
1109 1220 D
S
N
1123 1230 M
1123 1201 D
S
N
1124 1230 M
1124 1201 D
S
N
1124 1216 M
1127 1219 D
1131 1220 D
1134 1220 D
1138 1219 D
1140 1216 D
1140 1201 D
S
N
1134 1220 M
1137 1219 D
1138 1216 D
1138 1201 D
S
N
1119 1230 M
1124 1230 D
S
N
1119 1201 M
1129 1201 D
S
N
1134 1201 M
1144 1201 D
S
N
1153 1230 M
1152 1228 D
1153 1227 D
1155 1228 D
1153 1230 D
S
N
1153 1220 M
1153 1201 D
S
N
1155 1220 M
1155 1201 D
S
N
1149 1220 M
1155 1220 D
S
N
1149 1201 M
1159 1201 D
S
N
1168 1217 M
1168 1216 D
1167 1216 D
1167 1217 D
1168 1219 D
1171 1220 D
1176 1220 D
1179 1219 D
1181 1217 D
1182 1215 D
1182 1205 D
1183 1202 D
1185 1201 D
S
N
1181 1217 M
1181 1205 D
1182 1202 D
1185 1201 D
1186 1201 D
S
N
1181 1215 M
1179 1213 D
1171 1212 D
1167 1211 D
1166 1208 D
1166 1205 D
1167 1202 D
1171 1201 D
1175 1201 D
1178 1202 D
1181 1205 D
S
N
1171 1212 M
1168 1211 D
1167 1208 D
1167 1205 D
1168 1202 D
1171 1201 D
S
N
1216 1235 M
1192 1191 D
S
N
1226 1230 M
1226 1201 D
S
N
1227 1230 M
1227 1201 D
S
N
1227 1216 M
1230 1219 D
1234 1220 D
1237 1220 D
1241 1219 D
1242 1216 D
1242 1201 D
S
N
1237 1220 M
1239 1219 D
1241 1216 D
1241 1201 D
S
N
1222 1230 M
1227 1230 D
S
N
1222 1201 M
1231 1201 D
S
N
1237 1201 M
1246 1201 D
S
N
1254 1212 M
1271 1212 D
1271 1215 D
1270 1217 D
1268 1219 D
1265 1220 D
1261 1220 D
1257 1219 D
1254 1216 D
1253 1212 D
1253 1209 D
1254 1205 D
1257 1202 D
1261 1201 D
1264 1201 D
1268 1202 D
1271 1205 D
S
N
1270 1212 M
1270 1216 D
1268 1219 D
S
N
1261 1220 M
1259 1219 D
1256 1216 D
1254 1212 D
1254 1209 D
1256 1205 D
1259 1202 D
1261 1201 D
S
N
1282 1220 M
1282 1201 D
S
N
1283 1220 M
1283 1201 D
S
N
1283 1212 M
1285 1216 D
1287 1219 D
1290 1220 D
1294 1220 D
1296 1219 D
1296 1217 D
1294 1216 D
1293 1217 D
1294 1219 D
S
N
1278 1220 M
1283 1220 D
S
N
1278 1201 M
1287 1201 D
S
N
1304 1220 M
1309 1201 D
S
N
1305 1220 M
1309 1205 D
S
N
1315 1220 M
1309 1201 D
S
N
1315 1220 M
1320 1201 D
S
N
1316 1220 M
1320 1205 D
S
N
1326 1220 M
1320 1201 D
S
N
1300 1220 M
1309 1220 D
S
N
1322 1220 M
1330 1220 D
S
N
1338 1230 M
1337 1228 D
1338 1227 D
1339 1228 D
1338 1230 D
S
N
1338 1220 M
1338 1201 D
S
N
1339 1220 M
1339 1201 D
S
N
1334 1220 M
1339 1220 D
S
N
1334 1201 M
1343 1201 D
S
N
1357 1220 M
1354 1219 D
1353 1217 D
1352 1215 D
1352 1212 D
1353 1209 D
1354 1208 D
1357 1207 D
1360 1207 D
1363 1208 D
1364 1209 D
1365 1212 D
1365 1215 D
1364 1217 D
1363 1219 D
1360 1220 D
1357 1220 D
S
N
1354 1219 M
1353 1216 D
1353 1211 D
1354 1208 D
S
N
1363 1208 M
1364 1211 D
1364 1216 D
1363 1219 D
S
N
1364 1217 M
1365 1219 D
1368 1220 D
1368 1219 D
1365 1219 D
S
N
1353 1209 M
1352 1208 D
1350 1205 D
1350 1204 D
1352 1201 D
1356 1200 D
1363 1200 D
1367 1198 D
1368 1197 D
S
N
1350 1204 M
1352 1202 D
1356 1201 D
1363 1201 D
1367 1200 D
1368 1197 D
1368 1196 D
1367 1193 D
1363 1191 D
1354 1191 D
1350 1193 D
1349 1196 D
1349 1197 D
1350 1200 D
1354 1201 D
S
N
833 1057 M
833 1028 D
S
N
834 1057 M
834 1028 D
S
N
829 1057 M
845 1057 D
849 1055 D
851 1054 D
852 1051 D
852 1047 D
851 1044 D
849 1043 D
845 1042 D
834 1042 D
S
N
845 1057 M
848 1055 D
849 1054 D
851 1051 D
851 1047 D
849 1044 D
848 1043 D
845 1042 D
S
N
829 1028 M
838 1028 D
S
N
870 1057 M
866 1055 D
863 1053 D
862 1050 D
860 1044 D
860 1040 D
862 1035 D
863 1032 D
866 1029 D
870 1028 D
873 1028 D
877 1029 D
879 1032 D
881 1035 D
882 1040 D
882 1044 D
881 1050 D
879 1053 D
877 1055 D
873 1057 D
870 1057 D
S
N
870 1057 M
867 1055 D
864 1053 D
863 1050 D
862 1044 D
862 1040 D
863 1035 D
864 1032 D
867 1029 D
870 1028 D
S
N
873 1028 M
875 1029 D
878 1032 D
879 1035 D
881 1040 D
881 1044 D
879 1050 D
878 1053 D
875 1055 D
873 1057 D
S
N
892 1057 M
897 1028 D
S
N
893 1057 M
897 1035 D
S
N
903 1057 M
897 1028 D
S
N
903 1057 M
908 1028 D
S
N
904 1057 M
908 1035 D
S
N
914 1057 M
908 1028 D
S
N
888 1057 M
897 1057 D
S
N
910 1057 M
918 1057 D
S
N
926 1057 M
926 1028 D
S
N
927 1057 M
927 1028 D
S
N
944 1057 M
944 1028 D
S
N
945 1057 M
945 1028 D
S
N
922 1057 M
931 1057 D
S
N
940 1057 M
949 1057 D
S
N
927 1043 M
944 1043 D
S
N
922 1028 M
931 1028 D
S
N
940 1028 M
949 1028 D
S
N
959 1057 M
959 1028 D
S
N
960 1057 M
960 1028 D
S
N
968 1049 M
968 1038 D
S
N
955 1057 M
977 1057 D
977 1049 D
975 1057 D
S
N
960 1043 M
968 1043 D
S
N
955 1028 M
977 1028 D
977 1036 D
975 1028 D
S
N
988 1057 M
988 1028 D
S
N
989 1057 M
989 1028 D
S
N
983 1057 M
993 1057 D
S
N
983 1028 M
1004 1028 D
1004 1036 D
1003 1028 D
S
N
1033 1062 M
1008 1018 D
S
N
1042 1044 M
1042 1043 D
1041 1043 D
1041 1044 D
1042 1046 D
1045 1047 D
1051 1047 D
1053 1046 D
1055 1044 D
1056 1042 D
1056 1032 D
1057 1029 D
1059 1028 D
S
N
1055 1044 M
1055 1032 D
1056 1029 D
1059 1028 D
1060 1028 D
S
N
1055 1042 M
1053 1040 D
1045 1039 D
1041 1038 D
1040 1035 D
1040 1032 D
1041 1029 D
1045 1028 D
1049 1028 D
1052 1029 D
1055 1032 D
S
N
1045 1039 M
1042 1038 D
1041 1035 D
1041 1032 D
1042 1029 D
1045 1028 D
S
N
1070 1057 M
1070 1028 D
S
N
1071 1057 M
1079 1032 D
S
N
1070 1057 M
1079 1028 D
S
N
1089 1057 M
1079 1028 D
S
N
1089 1057 M
1089 1028 D
S
N
1090 1057 M
1090 1028 D
S
N
1066 1057 M
1071 1057 D
S
N
1089 1057 M
1094 1057 D
S
N
1066 1028 M
1074 1028 D
S
N
1085 1028 M
1094 1028 D
S
N
1120 1053 M
1122 1049 D
1122 1057 D
1120 1053 D
1118 1055 D
1114 1057 D
1111 1057 D
1107 1055 D
1104 1053 D
1103 1050 D
1101 1046 D
1101 1039 D
1103 1035 D
1104 1032 D
1107 1029 D
1111 1028 D
1114 1028 D
1118 1029 D
1120 1032 D
1122 1035 D
S
N
1111 1057 M
1108 1055 D
1105 1053 D
1104 1050 D
1103 1046 D
1103 1039 D
1104 1035 D
1105 1032 D
1108 1029 D
1111 1028 D
S
N
1150 1046 M
1149 1049 D
1146 1050 D
1142 1050 D
1140 1049 D
1138 1047 D
1137 1043 D
1137 1039 D
1138 1036 D
1141 1035 D
1145 1035 D
1148 1036 D
1149 1039 D
S
N
1142 1050 M
1140 1047 D
1138 1043 D
1138 1039 D
1140 1036 D
1141 1035 D
S
N
1150 1050 M
1149 1039 D
1149 1036 D
1152 1035 D
1155 1035 D
1157 1038 D
1159 1042 D
1159 1044 D
1157 1049 D
1156 1051 D
1153 1054 D
1150 1055 D
1146 1057 D
1142 1057 D
1138 1055 D
1135 1054 D
1133 1051 D
1131 1049 D
1130 1044 D
1130 1040 D
1131 1036 D
1133 1034 D
1135 1031 D
1138 1029 D
1142 1028 D
1146 1028 D
1150 1029 D
1153 1031 D
1155 1032 D
S
N
1152 1050 M
1150 1039 D
1150 1036 D
1152 1035 D
S
N
1170 1057 M
1170 1028 D
S
N
1171 1057 M
1187 1031 D
S
N
1171 1054 M
1187 1028 D
S
N
1187 1057 M
1187 1028 D
S
N
1166 1057 M
1171 1057 D
S
N
1183 1057 M
1192 1057 D
S
N
1166 1028 M
1174 1028 D
S
N
1201 1057 M
1201 1028 D
S
N
1202 1057 M
1202 1028 D
S
N
1197 1057 M
1207 1057 D
S
N
1197 1028 M
1218 1028 D
1218 1036 D
1216 1028 D
S
N
1233 1057 M
1228 1055 D
1226 1053 D
1224 1050 D
1223 1044 D
1223 1040 D
1224 1035 D
1226 1032 D
1228 1029 D
1233 1028 D
1235 1028 D
1239 1029 D
1242 1032 D
1244 1035 D
1245 1040 D
1245 1044 D
1244 1050 D
1242 1053 D
1239 1055 D
1235 1057 D
1233 1057 D
S
N
1233 1057 M
1230 1055 D
1227 1053 D
1226 1050 D
1224 1044 D
1224 1040 D
1226 1035 D
1227 1032 D
1230 1029 D
1233 1028 D
S
N
1235 1028 M
1238 1029 D
1241 1032 D
1242 1035 D
1244 1040 D
1244 1044 D
1242 1050 D
1241 1053 D
1238 1055 D
1235 1057 D
S
4 Sw
N
1730 906 M
1730 874 D
S
N
1731 906 M
1740 879 D
S
N
1730 906 M
1740 874 D
S
N
1751 906 M
1740 874 D
S
N
1751 906 M
1751 874 D
S
N
1752 906 M
1752 874 D
S
N
1725 906 M
1731 906 D
S
N
1751 906 M
1757 906 D
S
N
1725 874 M
1734 874 D
S
N
1746 874 M
1757 874 D
S
N
1767 883 M
1767 862 D
S
N
1768 883 M
1768 862 D
S
N
1764 883 M
1776 883 D
1779 882 D
1780 881 D
1781 879 D
1781 877 D
1780 875 D
1779 874 D
1776 873 D
S
N
1776 883 M
1778 882 D
1779 881 D
1780 879 D
1780 877 D
1779 875 D
1778 874 D
1776 873 D
S
N
1768 873 M
1776 873 D
1779 872 D
1780 871 D
1781 869 D
1781 866 D
1780 864 D
1779 863 D
1776 862 D
1764 862 D
S
N
1776 873 M
1778 872 D
1779 871 D
1780 869 D
1780 866 D
1779 864 D
1778 863 D
1776 862 D
S
N
1789 883 M
1789 862 D
S
N
1790 883 M
1790 862 D
S
N
1786 883 M
1798 883 D
1801 882 D
1802 881 D
1803 879 D
1803 877 D
1802 875 D
1801 874 D
1798 873 D
S
N
1798 883 M
1800 882 D
1801 881 D
1802 879 D
1802 877 D
1801 875 D
1800 874 D
1798 873 D
S
N
1790 873 M
1798 873 D
1801 872 D
1802 871 D
1803 869 D
1803 866 D
1802 864 D
1801 863 D
1798 862 D
1786 862 D
S
N
1798 873 M
1800 872 D
1801 871 D
1802 869 D
1802 866 D
1801 864 D
1800 863 D
1798 862 D
S
N
1838 912 M
1838 864 D
S
N
1840 912 M
1840 864 D
S
N
1838 912 M
1849 912 D
S
N
1838 864 M
1849 864 D
S
N
1879 901 M
1881 897 D
1881 906 D
1879 901 D
1876 904 D
1871 906 D
1868 906 D
1864 904 D
1861 901 D
1859 898 D
1858 894 D
1858 886 D
1859 882 D
1861 879 D
1864 876 D
1868 874 D
1871 874 D
1876 876 D
1879 879 D
S
N
1868 906 M
1865 904 D
1862 901 D
1861 898 D
1859 894 D
1859 886 D
1861 882 D
1862 879 D
1865 876 D
1868 874 D
S
N
1879 886 M
1879 874 D
S
N
1881 886 M
1881 874 D
S
N
1874 886 M
1885 886 D
S
N
1894 886 M
1912 886 D
1912 889 D
1911 892 D
1909 894 D
1906 895 D
1902 895 D
1897 894 D
1894 891 D
1893 886 D
1893 883 D
1894 879 D
1897 876 D
1902 874 D
1905 874 D
1909 876 D
1912 879 D
S
N
1911 886 M
1911 891 D
1909 894 D
S
N
1902 895 M
1899 894 D
1896 891 D
1894 886 D
1894 883 D
1896 879 D
1899 876 D
1902 874 D
S
N
1921 906 M
1932 874 D
S
N
1923 906 M
1932 879 D
S
N
1942 906 M
1932 874 D
S
N
1918 906 M
1927 906 D
S
N
1936 906 M
1945 906 D
S
N
1961 912 M
1961 864 D
S
N
1962 912 M
1962 864 D
S
N
1951 912 M
1962 912 D
S
N
1951 864 M
1962 864 D
S
N
583 1261 M
583 1001 D
S
N
583 1001 M
1967 1001 D
S
N
1967 1001 M
1967 1261 D
S
N
1967 1261 M
583 1261 D
S
N
583 1001 M
583 1017 D
S
N
656 1006 M
656 1001 D
S
N
729 1001 M
729 1006 D
S
N
802 1006 M
802 1001 D
S
N
874 1001 M
874 1006 D
S
N
947 1017 M
947 1001 D
S
N
1020 1001 M
1020 1006 D
S
N
1093 1006 M
1093 1001 D
S
N
1166 1001 M
1166 1006 D
S
N
1239 1006 M
1239 1001 D
S
N
1311 1001 M
1311 1017 D
S
N
1384 1006 M
1384 1001 D
S
N
1457 1001 M
1457 1006 D
S
N
1530 1006 M
1530 1001 D
S
N
1603 1001 M
1603 1006 D
S
N
1676 1017 M
1676 1001 D
S
N
1748 1001 M
1748 1006 D
S
N
1821 1006 M
1821 1001 D
S
N
1894 1001 M
1894 1006 D
S
N
1967 1006 M
1967 1001 D
S
N
581 971 M
577 970 D
574 965 D
572 958 D
572 953 D
574 946 D
577 941 D
581 940 D
585 940 D
589 941 D
592 946 D
594 953 D
594 958 D
592 965 D
589 970 D
585 971 D
581 971 D
S
N
581 971 M
578 970 D
577 968 D
575 965 D
574 958 D
574 953 D
575 946 D
577 943 D
578 941 D
581 940 D
S
N
585 940 M
588 941 D
589 943 D
591 946 D
592 953 D
592 958 D
591 965 D
589 968 D
588 970 D
585 971 D
S
N
925 971 M
922 956 D
S
N
922 956 M
925 959 D
929 961 D
934 961 D
938 959 D
941 956 D
943 952 D
943 949 D
941 944 D
938 941 D
934 940 D
929 940 D
925 941 D
923 943 D
922 946 D
922 947 D
923 949 D
925 947 D
923 946 D
S
N
934 961 M
937 959 D
940 956 D
941 952 D
941 949 D
940 944 D
937 941 D
934 940 D
S
N
925 971 M
940 971 D
S
N
925 970 M
932 970 D
940 971 D
S
N
961 971 M
956 970 D
953 965 D
952 958 D
952 953 D
953 946 D
956 941 D
961 940 D
964 940 D
968 941 D
971 946 D
973 953 D
973 958 D
971 965 D
968 970 D
964 971 D
961 971 D
S
N
961 971 M
958 970 D
956 968 D
955 965 D
953 958 D
953 953 D
955 946 D
956 943 D
958 941 D
961 940 D
S
N
964 940 M
967 941 D
968 943 D
970 946 D
971 953 D
971 958 D
970 965 D
968 968 D
967 970 D
964 971 D
S
N
1275 965 M
1278 967 D
1283 971 D
1283 940 D
S
N
1281 970 M
1281 940 D
S
N
1275 940 M
1289 940 D
S
N
1310 971 M
1305 970 D
1302 965 D
1301 958 D
1301 953 D
1302 946 D
1305 941 D
1310 940 D
1313 940 D
1317 941 D
1320 946 D
1322 953 D
1322 958 D
1320 965 D
1317 970 D
1313 971 D
1310 971 D
S
N
1310 971 M
1307 970 D
1305 968 D
1304 965 D
1302 958 D
1302 953 D
1304 946 D
1305 943 D
1307 941 D
1310 940 D
S
N
1313 940 M
1316 941 D
1317 943 D
1319 946 D
1320 953 D
1320 958 D
1319 965 D
1317 968 D
1316 970 D
1313 971 D
S
N
1340 971 M
1335 970 D
1332 965 D
1331 958 D
1331 953 D
1332 946 D
1335 941 D
1340 940 D
1343 940 D
1348 941 D
1351 946 D
1352 953 D
1352 958 D
1351 965 D
1348 970 D
1343 971 D
1340 971 D
S
N
1340 971 M
1337 970 D
1335 968 D
1334 965 D
1332 958 D
1332 953 D
1334 946 D
1335 943 D
1337 941 D
1340 940 D
S
N
1343 940 M
1346 941 D
1348 943 D
1349 946 D
1351 953 D
1351 958 D
1349 965 D
1348 968 D
1346 970 D
1343 971 D
S
N
1639 965 M
1642 967 D
1647 971 D
1647 940 D
S
N
1645 970 M
1645 940 D
S
N
1639 940 M
1653 940 D
S
N
1668 971 M
1665 956 D
S
N
1665 956 M
1668 959 D
1673 961 D
1677 961 D
1682 959 D
1685 956 D
1686 952 D
1686 949 D
1685 944 D
1682 941 D
1677 940 D
1673 940 D
1668 941 D
1666 943 D
1665 946 D
1665 947 D
1666 949 D
1668 947 D
1666 946 D
S
N
1677 961 M
1680 959 D
1683 956 D
1685 952 D
1685 949 D
1683 944 D
1680 941 D
1677 940 D
S
N
1668 971 M
1683 971 D
S
N
1668 970 M
1676 970 D
1683 971 D
S
N
1704 971 M
1700 970 D
1697 965 D
1695 958 D
1695 953 D
1697 946 D
1700 941 D
1704 940 D
1707 940 D
1712 941 D
1715 946 D
1716 953 D
1716 958 D
1715 965 D
1712 970 D
1707 971 D
1704 971 D
S
N
1704 971 M
1701 970 D
1700 968 D
1698 965 D
1697 958 D
1697 953 D
1698 946 D
1700 943 D
1701 941 D
1704 940 D
S
N
1707 940 M
1710 941 D
1712 943 D
1713 946 D
1715 953 D
1715 958 D
1713 965 D
1712 968 D
1710 970 D
1707 971 D
S
N
583 1261 M
1967 1261 D
S
N
583 1245 M
583 1261 D
S
N
656 1261 M
656 1256 D
S
N
729 1256 M
729 1261 D
S
N
802 1261 M
802 1256 D
S
N
874 1256 M
874 1261 D
S
N
947 1261 M
947 1245 D
S
N
1020 1256 M
1020 1261 D
S
N
1093 1261 M
1093 1256 D
S
N
1166 1256 M
1166 1261 D
S
N
1239 1261 M
1239 1256 D
S
N
1311 1245 M
1311 1261 D
S
N
1384 1261 M
1384 1256 D
S
N
1457 1256 M
1457 1261 D
S
N
1530 1261 M
1530 1256 D
S
N
1603 1256 M
1603 1261 D
S
N
1676 1261 M
1676 1245 D
S
N
1748 1256 M
1748 1261 D
S
N
1821 1261 M
1821 1256 D
S
N
1894 1256 M
1894 1261 D
S
N
1967 1261 M
1967 1256 D
S
N
583 1001 M
583 1261 D
S
N
583 1006 M
588 1006 D
S
N
588 1022 M
583 1022 D
S
N
583 1038 M
588 1038 D
S
N
599 1053 M
583 1053 D
S
N
583 1069 M
588 1069 D
S
N
588 1084 M
583 1084 D
S
N
583 1100 M
588 1100 D
S
N
588 1115 M
583 1115 D
S
N
583 1131 M
599 1131 D
S
N
588 1147 M
583 1147 D
S
N
583 1162 M
588 1162 D
S
N
588 1178 M
583 1178 D
S
N
583 1193 M
588 1193 D
S
N
599 1209 M
583 1209 D
S
N
583 1224 M
588 1224 D
S
N
588 1240 M
583 1240 D
S
N
583 1256 M
588 1256 D
S
N
503 1067 M
498 1065 D
495 1061 D
494 1053 D
494 1049 D
495 1041 D
498 1037 D
503 1035 D
506 1035 D
510 1037 D
513 1041 D
515 1049 D
515 1053 D
513 1061 D
510 1065 D
506 1067 D
503 1067 D
S
N
503 1067 M
500 1065 D
498 1064 D
497 1061 D
495 1053 D
495 1049 D
497 1041 D
498 1038 D
500 1037 D
503 1035 D
S
N
506 1035 M
509 1037 D
510 1038 D
512 1041 D
513 1049 D
513 1053 D
512 1061 D
510 1064 D
509 1065 D
506 1067 D
S
N
527 1038 M
525 1037 D
527 1035 D
528 1037 D
527 1038 D
S
N
547 1067 M
542 1065 D
541 1062 D
541 1058 D
542 1055 D
547 1053 D
553 1053 D
557 1055 D
559 1058 D
559 1062 D
557 1065 D
553 1067 D
547 1067 D
S
N
547 1067 M
544 1065 D
542 1062 D
542 1058 D
544 1055 D
547 1053 D
S
N
553 1053 M
556 1055 D
557 1058 D
557 1062 D
556 1065 D
553 1067 D
S
N
547 1053 M
542 1052 D
541 1050 D
539 1047 D
539 1041 D
541 1038 D
542 1037 D
547 1035 D
553 1035 D
557 1037 D
559 1038 D
560 1041 D
560 1047 D
559 1050 D
557 1052 D
553 1053 D
S
N
547 1053 M
544 1052 D
542 1050 D
541 1047 D
541 1041 D
542 1038 D
544 1037 D
547 1035 D
S
N
553 1035 M
556 1037 D
557 1038 D
559 1041 D
559 1047 D
557 1050 D
556 1052 D
553 1053 D
S
N
498 1139 M
501 1140 D
506 1145 D
506 1113 D
S
N
504 1143 M
504 1113 D
S
N
498 1113 M
512 1113 D
S
N
527 1116 M
525 1114 D
527 1113 D
528 1114 D
527 1116 D
S
N
548 1145 M
544 1143 D
541 1139 D
539 1131 D
539 1126 D
541 1119 D
544 1114 D
548 1113 D
551 1113 D
556 1114 D
559 1119 D
560 1126 D
560 1131 D
559 1139 D
556 1143 D
551 1145 D
548 1145 D
S
N
548 1145 M
545 1143 D
544 1142 D
542 1139 D
541 1131 D
541 1126 D
542 1119 D
544 1116 D
545 1114 D
548 1113 D
S
N
551 1113 M
554 1114 D
556 1116 D
557 1119 D
559 1126 D
559 1131 D
557 1139 D
556 1142 D
554 1143 D
551 1145 D
S
N
498 1216 M
501 1218 D
506 1222 D
506 1191 D
S
N
504 1221 M
504 1191 D
S
N
498 1191 M
512 1191 D
S
N
527 1194 M
525 1192 D
527 1191 D
528 1192 D
527 1194 D
S
N
541 1216 M
542 1215 D
541 1213 D
539 1215 D
539 1216 D
541 1219 D
542 1221 D
547 1222 D
553 1222 D
557 1221 D
559 1219 D
560 1216 D
560 1213 D
559 1210 D
554 1207 D
547 1204 D
544 1203 D
541 1200 D
539 1195 D
539 1191 D
S
N
553 1222 M
556 1221 D
557 1219 D
559 1216 D
559 1213 D
557 1210 D
553 1207 D
547 1204 D
S
N
539 1194 M
541 1195 D
544 1195 D
551 1192 D
556 1192 D
559 1194 D
560 1195 D
S
N
544 1195 M
551 1191 D
557 1191 D
559 1192 D
560 1195 D
560 1198 D
S
N
1967 1001 M
1967 1261 D
S
N
1962 1006 M
1967 1006 D
S
N
1967 1022 M
1962 1022 D
S
N
1962 1038 M
1967 1038 D
S
N
1967 1053 M
1951 1053 D
S
N
1962 1069 M
1967 1069 D
S
N
1967 1084 M
1962 1084 D
S
N
1962 1100 M
1967 1100 D
S
N
1967 1115 M
1962 1115 D
S
N
1951 1131 M
1967 1131 D
S
N
1967 1147 M
1962 1147 D
S
N
1962 1162 M
1967 1162 D
S
N
1967 1178 M
1962 1178 D
S
N
1962 1193 M
1967 1193 D
S
N
1967 1209 M
1951 1209 D
S
N
1962 1224 M
1967 1224 D
S
N
1967 1240 M
1962 1240 D
S
N
1962 1256 M
1967 1256 D
S
N
656 1001 M
656 1101 D
670 1101 D
670 1113 D
685 1113 D
685 1118 D
700 1118 D
700 1113 D
714 1113 D
714 1102 D
729 1102 D
729 1110 D
743 1110 D
743 1111 D
758 1111 D
758 1125 D
772 1125 D
772 1106 D
787 1106 D
787 1105 D
802 1105 D
802 1114 D
816 1114 D
816 1119 D
831 1119 D
831 1118 D
845 1118 D
845 1118 D
860 1118 D
860 1115 D
874 1115 D
874 1111 D
889 1111 D
889 1114 D
904 1114 D
904 1121 D
918 1121 D
918 1112 D
933 1112 D
933 1105 D
947 1105 D
947 1113 D
962 1113 D
962 1114 D
976 1114 D
976 1101 D
991 1101 D
991 1096 D
1005 1096 D
1005 1107 D
1020 1107 D
1020 1102 D
1035 1102 D
1035 1110 D
1049 1110 D
1049 1111 D
1064 1111 D
1064 1102 D
1078 1102 D
1078 1096 D
1093 1096 D
1093 1097 D
1107 1097 D
1107 1096 D
1122 1096 D
1122 1102 D
1137 1102 D
1137 1107 D
1151 1107 D
1151 1101 D
1166 1101 D
1166 1108 D
1180 1108 D
1180 1106 D
1195 1106 D
1195 1116 D
1209 1116 D
1209 1120 D
1224 1120 D
1224 1114 D
1239 1114 D
1239 1128 D
1253 1128 D
1253 1125 D
1268 1125 D
1268 1131 D
1282 1131 D
1282 1133 D
1297 1133 D
1297 1147 D
1311 1147 D
1311 1137 D
1326 1137 D
1326 1129 D
1341 1129 D
1341 1129 D
1355 1129 D
1355 1134 D
1370 1134 D
1370 1134 D
1384 1134 D
1384 1123 D
1399 1123 D
1399 1117 D
1413 1117 D
1413 1121 D
1428 1121 D
1428 1124 D
1443 1124 D
1443 1128 D
1457 1128 D
1457 1118 D
1472 1118 D
1472 1124 D
1486 1124 D
1486 1121 D
1501 1121 D
1501 1126 D
1515 1126 D
1515 1122 D
1530 1122 D
1530 1137 D
1545 1137 D
1545 1136 D
1559 1136 D
1559 1133 D
1559 1133 D
1559 1133 D
1574 1133 D
1574 1141 D
1588 1141 D
1588 1127 D
1603 1127 D
1603 1141 D
1617 1141 D
1617 1129 D
1632 1129 D
1632 1128 D
1646 1128 D
1646 1121 D
1661 1121 D
1661 1137 D
1676 1137 D
1676 1132 D
1690 1132 D
1690 1137 D
1705 1137 D
1705 1131 D
1719 1131 D
1719 1134 D
1734 1134 D
1734 1148 D
1748 1148 D
1748 1132 D
1763 1132 D
1763 1157 D
1778 1157 D
1778 1145 D
1792 1145 D
1792 1143 D
1807 1143 D
1807 1139 D
1821 1139 D
1821 1145 D
1836 1145 D
1836 1144 D
1850 1144 D
1850 1135 D
1865 1135 D
1865 1140 D
1880 1140 D
1880 1144 D
1894 1144 D
1894 1140 D
1909 1140 D
1909 1146 D
1923 1146 D
1923 1145 D
1938 1145 D
1938 1149 D
1952 1149 D
1952 1145 D
1967 1145 D
S
N
721 1217 M
808 1217 D
S
0 0 1 setrgbcolor
N
656 1001 M
656 1013 D
S
N
656 1025 M
656 1038 D
S
N
656 1050 M
656 1062 D
S
N
656 1074 M
656 1086 D
S
N
656 1098 M
656 1110 D
S
N
656 1122 M
656 1134 D
S
N
665 1137 M
670 1137 D
670 1144 D
S
N
670 1156 M
670 1168 D
S
N
677 1174 M
685 1174 D
685 1170 D
S
N
689 1162 M
700 1162 D
700 1160 D
S
N
708 1157 M
714 1157 D
714 1154 D
717 1154 D
S
N
729 1154 M
729 1167 D
S
N
740 1167 M
743 1167 D
743 1171 D
749 1171 D
S
N
758 1167 M
758 1155 D
S
N
768 1153 M
772 1153 D
772 1156 D
778 1156 D
S
N
787 1153 M
800 1153 D
S
N
805 1160 M
816 1160 D
816 1159 D
S
N
819 1150 M
831 1150 D
831 1149 D
S
N
839 1146 M
845 1146 D
845 1152 D
S
N
854 1156 M
860 1156 D
860 1159 D
862 1159 D
S
N
874 1159 M
874 1168 D
878 1168 D
S
N
889 1167 M
889 1155 D
S
N
899 1152 M
904 1152 D
904 1145 D
904 1145 D
S
N
916 1145 M
918 1145 D
918 1155 D
919 1155 D
S
N
931 1155 M
933 1155 D
933 1165 D
933 1165 D
S
N
945 1165 M
947 1165 D
947 1162 D
954 1162 D
S
N
962 1157 M
962 1147 D
964 1147 D
S
N
976 1147 M
976 1147 D
976 1158 D
978 1158 D
S
N
990 1158 M
991 1158 D
991 1163 D
997 1163 D
S
N
1005 1159 M
1005 1147 D
S
N
1017 1146 M
1020 1146 D
1020 1156 D
S
N
1032 1156 M
1035 1156 D
1035 1149 D
1037 1149 D
S
N
1049 1149 M
1049 1149 D
1049 1146 D
1058 1146 D
S
N
1064 1152 M
1064 1152 D
1076 1152 D
S
N
1084 1149 M
1093 1149 D
1093 1153 D
S
N
1098 1160 M
1107 1160 D
1107 1157 D
S
N
1118 1155 M
1122 1155 D
1122 1155 D
1129 1155 D
S
N
1137 1150 M
1137 1143 D
1142 1143 D
S
N
1151 1146 M
1151 1154 D
1155 1154 D
S
N
1166 1152 M
1166 1149 D
1175 1149 D
S
N
1181 1156 M
1193 1156 D
S
N
1196 1147 M
1208 1147 D
S
N
1216 1143 M
1224 1143 D
1224 1147 D
S
N
1230 1153 M
1239 1153 D
1239 1149 D
S
N
1249 1148 M
1253 1148 D
1253 1148 D
1261 1148 D
S
N
1271 1150 M
1282 1150 D
1282 1151 D
S
N
1294 1151 M
1297 1151 D
1297 1149 D
1304 1149 D
S
N
1315 1150 M
1326 1150 D
1326 1152 D
S
N
1337 1153 M
1341 1153 D
1341 1150 D
1346 1150 D
S
N
1355 1147 M
1355 1143 D
1364 1143 D
S
N
1370 1149 M
1370 1152 D
1379 1152 D
S
N
1384 1146 M
1384 1142 D
1392 1142 D
S
N
1401 1146 M
1413 1146 D
S
N
1422 1143 M
1428 1143 D
1428 1149 D
S
N
1440 1149 M
1443 1149 D
1443 1140 D
S
N
1452 1137 M
1457 1137 D
1457 1143 D
S
N
1468 1144 M
1472 1144 D
1472 1147 D
1477 1147 D
S
N
1487 1149 M
1499 1149 D
S
N
1501 1139 M
1501 1137 D
1512 1137 D
S
N
1520 1134 M
1530 1134 D
1530 1132 D
1530 1132 D
S
N
1542 1132 M
1545 1132 D
1545 1128 D
1551 1128 D
S
N
1559 1132 M
1559 1136 D
1559 1136 D
1559 1136 D
1567 1136 D
S
N
1576 1132 M
1588 1132 D
S
N
1598 1135 M
1603 1135 D
1603 1129 D
1604 1129 D
S
N
1616 1129 M
1617 1129 D
1617 1129 D
1628 1129 D
S
N
1632 1137 M
1632 1140 D
1641 1140 D
S
N
1653 1141 M
1661 1141 D
1661 1137 D
S
N
1666 1130 M
1676 1130 D
1676 1129 D
1677 1129 D
S
N
1689 1129 M
1690 1129 D
1690 1128 D
1700 1128 D
S
N
1711 1129 M
1719 1129 D
1719 1130 D
1722 1130 D
S
N
1734 1131 M
1746 1131 D
S
N
1753 1135 M
1763 1135 D
1763 1133 D
S
N
1769 1127 M
1778 1127 D
1778 1123 D
1778 1123 D
S
N
1790 1123 M
1792 1123 D
1792 1128 D
1797 1128 D
S
N
1807 1126 M
1807 1122 D
1815 1122 D
S
N
1822 1118 M
1835 1118 D
S
N
1836 1128 M
1836 1129 D
1847 1129 D
S
N
1856 1125 M
1865 1125 D
1865 1127 D
1866 1127 D
S
N
1878 1127 M
1880 1127 D
1880 1123 D
1886 1123 D
S
N
1896 1125 M
1908 1125 D
S
N
1916 1121 M
1923 1121 D
1923 1125 D
S
N
1932 1129 M
1938 1129 D
1938 1122 D
S
N
1947 1119 M
1952 1119 D
1952 1120 D
1958 1120 D
S
N
721 1044 M
734 1044 D
S
N
746 1044 M
758 1044 D
S
N
770 1044 M
782 1044 D
S
N
794 1044 M
806 1044 D
S
showpage
%%Trailer
%%Pages: 1
%%BoundingBox: 88 205 482 563
