%!PS-Adobe-2.0 EPSF-2.0
%%BoundingBox:  0 0 567 547
%%Title: /home/shiki/Desktop/MCFM/YR/CUT3/CUT3_MCFM_POWHEG_LHC.eps: Higgs Cross Section
%%Creator: ROOT Version 5.28/00
%%CreationDate: Tue Nov 22 18:49:34 2011
%%EndComments
%%BeginProlog
80 dict begin
/s {stroke} def /l {lineto} def /m {moveto} def /t {translate} def
/r {rotate} def /rl {roll}  def /R {repeat} def
/d {rlineto} def /rm {rmoveto} def /gr {grestore} def /f {eofill} def
/c {setrgbcolor} def /black {0 setgray} def /sd {setdash} def
/cl {closepath} def /sf {scalefont setfont} def /lw {setlinewidth} def
/box {m dup 0 exch d exch 0 d 0 exch neg d cl} def
/NC{systemdict begin initclip end}def/C{NC box clip newpath}def
/bl {box s} def /bf {box f} def /Y { 0 exch d} def /X { 0 d} def 
/K {{pop pop 0 moveto} exch kshow} bind def
/ita {/ang 15 def gsave [1 0 ang dup sin exch cos div 1 0 0] concat} def 
/mp {newpath /y exch def /x exch def} def
/side {[w .77 mul w .23 mul] .385 w mul sd w 0 l currentpoint t -144 r} def
/mr {mp x y w2 0 360 arc} def /m24 {mr s} def /m20 {mr f} def
/mb {mp x y w2 add m w2 neg 0 d 0 w neg d w 0 d 0 w d cl} def
/mt {mp x y w2 add m w2 neg w neg d w 0 d cl} def
/m21 {mb f} def /m25 {mb s} def /m22 {mt f} def /m26{mt s} def
/m23 {mp x y w2 sub m w2 w d w neg 0 d cl f} def
/m27 {mp x y w2 add m w3 neg w2 neg d w3 w2 neg d w3 w2 d cl s} def
/m28 {mp x w2 sub y w2 sub w3 add m w3 0 d  0 w3 neg d w3 0 d 0 w3 d w3 0 d  0 w3 d w3 neg 0 d 0 w3 d w3 neg 0 d 0 w3 neg d w3 neg 0 d cl s } def
/m29 {mp gsave x w2 sub y w2 add w3 sub m currentpoint t 4 {side} repeat cl fill gr} def
/m30 {mp gsave x w2 sub y w2 add w3 sub m currentpoint t 4 {side} repeat cl s gr} def
/m31 {mp x y w2 sub m 0 w d x w2 sub y m w 0 d x w2 sub y w2 add m w w neg d x w2 sub y w2 sub m w w d s} def
/m32 {mp x y w2 sub m w2 w d w neg 0 d cl s} def
/m33 {mp x y w2 add m w3 neg w2 neg d w3 w2 neg d w3 w2 d cl f} def
/m34 {mp x w2 sub y w2 sub w3 add m w3 0 d  0 w3 neg d w3 0 d 0 w3 d w3 0 d  0 w3 d w3 neg 0 d 0 w3 d w3 neg 0 d 0 w3 neg d w3 neg 0 d cl f } def
/m2 {mp x y w2 sub m 0 w d x w2 sub y m w 0 d s} def
/m5 {mp x w2 sub y w2 sub m w w d x w2 sub y w2 add m w w neg d s} def
/reEncode {exch findfont dup length dict begin {1 index /FID eq  {pop pop} {def} ifelse } forall /Encoding exch def currentdict end dup /FontName get exch definefont pop } def [/Times-Bold /Times-Italic /Times-BoldItalic /Helvetica /Helvetica-Oblique
 /Helvetica-Bold /Helvetica-BoldOblique /Courier /Courier-Oblique /Courier-Bold /Courier-BoldOblique /Times-Roman /AvantGarde-Book /AvantGarde-BookOblique /AvantGarde-Demi /AvantGarde-DemiOblique /Bookman-Demi /Bookman-DemiItalic /Bookman-Light
 /Bookman-LightItalic /Helvetica-Narrow /Helvetica-Narrow-Bold /Helvetica-Narrow-BoldOblique /Helvetica-Narrow-Oblique /NewCenturySchlbk-Roman /NewCenturySchlbk-Bold /NewCenturySchlbk-BoldItalic /NewCenturySchlbk-Italic /Palatino-Bold
 /Palatino-BoldItalic /Palatino-Italic /Palatino-Roman ] {ISOLatin1Encoding reEncode } forall%%EndProlog
%%BeginSetup
%%EndSetup
newpath  gsave  .25 .25 scale  gsave  0 0 t black[  ] 0 sd 3 lw 1 1 1 c 2268 2190 0 0 bf black 1 1 1 c 1791 1730 363 350 bf black 1791 1730 363 350 bl 1 1 1 c 1791 1730 363 350 bf black 1791 1730 363 350 bl 6 lw 1 1 1 c black 363 350 m 1791 X s 3 lw
 363 350 m 1791 X s
 gsave  2268 2190 0 0 C 1926.88 162.938 t 0 r /Helvetica findfont 81.4553 sf 0 0 m ( [GeV]) show NC gr 
 gsave  2268 2190 0 0 C 1884.5 136.875 t 0 r /Helvetica findfont 55.3896 sf 0 0 m (4l) show NC gr 
 gsave  2268 2190 0 0 C 1822.56 162.938 t 0 r /Helvetica findfont 81.4553 sf 0 0 m (M) show NC gr  363 402 m -52 Y s 403 376 m -26 Y s 442 376 m -26 Y s 482 376 m -26 Y s 522 376 m -26 Y s 562 402 m -52 Y s 602 376 m -26 Y s 642 376 m -26 Y s 681 376
 m -26 Y s 721 376 m -26 Y s 761 402 m -52 Y s 801 376 m -26 Y s 841 376 m -26 Y s 880 376 m -26 Y s 920 376 m -26 Y s 960 402 m -52 Y s 1000 376 m -26 Y s 1040 376 m -26 Y s 1079 376 m -26 Y s 1119 376 m -26 Y s 1159 402 m -52 Y s 1199 376 m -26 Y s
 1239 376 m -26 Y s 1278 376 m -26 Y s 1318 376 m -26 Y s 1358 402 m -52 Y s 1398 376 m -26 Y s 1438 376 m -26 Y s 1478 376 m -26 Y s 1517 376 m -26 Y s 1557 402 m -52 Y s 1597 376 m -26 Y s 1637 376 m -26 Y s 1677 376 m -26 Y s 1716 376 m -26 Y s
 1756 402 m -52 Y s 1796 376 m -26 Y s 1836 376 m -26 Y s 1876 376 m -26 Y s 1915 376 m -26 Y s 1955 402 m -52 Y s 1995 376 m -26 Y s 2035 376 m -26 Y s 2075 376 m -26 Y s 2115 376 m -26 Y s 2154 402 m -52 Y s
 gsave  2268 2190 0 0 C 294.5 270.438 t 0 r /Helvetica findfont 81.4553 sf 0 0 m (150) show NC gr 
 gsave  2268 2190 0 0 C 493.25 270.438 t 0 r /Helvetica findfont 81.4553 sf 0 0 m (200) show NC gr 
 gsave  2268 2190 0 0 C 692 270.438 t 0 r /Helvetica findfont 81.4553 sf 0 0 m (250) show NC gr 
 gsave  2268 2190 0 0 C 890.75 270.438 t 0 r /Helvetica findfont 81.4553 sf 0 0 m (300) show NC gr 
 gsave  2268 2190 0 0 C 1089.5 270.438 t 0 r /Helvetica findfont 81.4553 sf 0 0 m (350) show NC gr 
 gsave  2268 2190 0 0 C 1288.25 270.438 t 0 r /Helvetica findfont 81.4553 sf 0 0 m (400) show NC gr 
 gsave  2268 2190 0 0 C 1487 270.438 t 0 r /Helvetica findfont 81.4553 sf 0 0 m (450) show NC gr 
 gsave  2268 2190 0 0 C 1689 270.438 t 0 r /Helvetica findfont 81.4553 sf 0 0 m (500) show NC gr 
 gsave  2268 2190 0 0 C 1887.75 270.438 t 0 r /Helvetica findfont 81.4553 sf 0 0 m (550) show NC gr 
 gsave  2268 2190 0 0 C 2086.5 270.438 t 0 r /Helvetica findfont 81.4553 sf 0 0 m (600) show NC gr  363 2080 m 1791 X s 363 2028 m 52 Y s 403 2054 m 26 Y s 442 2054 m 26 Y s 482 2054 m 26 Y s 522 2054 m 26 Y s 562 2028 m 52 Y s 602 2054 m 26 Y s 642
 2054 m 26 Y s 681 2054 m 26 Y s 721 2054 m 26 Y s 761 2028 m 52 Y s 801 2054 m 26 Y s 841 2054 m 26 Y s 880 2054 m 26 Y s 920 2054 m 26 Y s 960 2028 m 52 Y s 1000 2054 m 26 Y s 1040 2054 m 26 Y s 1079 2054 m 26 Y s 1119 2054 m 26 Y s 1159 2028 m 52
 Y s 1199 2054 m 26 Y s 1239 2054 m 26 Y s 1278 2054 m 26 Y s 1318 2054 m 26 Y s 1358 2028 m 52 Y s 1398 2054 m 26 Y s 1438 2054 m 26 Y s 1478 2054 m 26 Y s 1517 2054 m 26 Y s 1557 2028 m 52 Y s 1597 2054 m 26 Y s 1637 2054 m 26 Y s 1677 2054 m 26 Y
 s 1716 2054 m 26 Y s 1756 2028 m 52 Y s 1796 2054 m 26 Y s 1836 2054 m 26 Y s 1876 2054 m 26 Y s 1915 2054 m 26 Y s 1955 2028 m 52 Y s 1995 2054 m 26 Y s 2035 2054 m 26 Y s 2075 2054 m 26 Y s 2115 2054 m 26 Y s 2154 2028 m 52 Y s 363 350 m 1730 Y s
 gsave  2268 2190 0 0 C 164.188 2033.06 t 90 r /Helvetica findfont 81.4553 sf 0 0 m ( \)) show NC gr 
 gsave  2268 2190 0 0 C 125.062 1997.25 t 90 r /Helvetica findfont 55.3896 sf 0 0 m (\2551) show NC gr 
 gsave  2268 2190 0 0 C 164.188 736.375 t 90 r /Helvetica findfont 81.4553 sf 0 0 m (Events/10GeV \( Normalized to 1 fb) show NC gr  390 350 m -27 X s 390 396 m -27 X s 390 435 m -27 X s 390 468 m -27 X s 390 498 m -27 X s 417 524 m -54 X s
 gsave  2268 2190 0 0 C 294.5 521.312 t 0 r /Helvetica findfont 55.3896 sf 0 0 m (\2552) show NC gr 
 gsave  2268 2190 0 0 C 206.5 485.5 t 0 r /Helvetica findfont 81.4553 sf 0 0 m (10) show NC gr  390 697 m -27 X s 390 799 m -27 X s 390 871 m -27 X s 390 927 m -27 X s 390 973 m -27 X s 390 1011 m -27 X s 390 1045 m -27 X s 390 1074 m -27 X s 417
 1100 m -54 X s
 gsave  2268 2190 0 0 C 304.25 1098.06 t 0 r /Helvetica findfont 55.3896 sf 0 0 m (\2551) show NC gr 
 gsave  2268 2190 0 0 C 216.312 1062.19 t 0 r /Helvetica findfont 81.4553 sf 0 0 m (10) show NC gr  390 1274 m -27 X s 390 1376 m -27 X s 390 1448 m -27 X s 390 1503 m -27 X s 390 1549 m -27 X s 390 1588 m -27 X s 390 1621 m -27 X s 390 1651 m -27 X
 s 417 1677 m -54 X s
 gsave  2268 2190 0 0 C 345.5 1643.12 t 0 r  -45 0 t /Helvetica findfont 81.4553 sf 0 0 m (1) show NC gr  390 1851 m -27 X s 390 1952 m -27 X s 390 2024 m -27 X s 2154 350 m 1730 Y s 2127 350 m 27 X s 2127 396 m 27 X s 2127 435 m 27 X s 2127 468 m 27
 X s 2127 498 m 27 X s 2101 524 m 53 X s 2127 697 m 27 X s 2127 799 m 27 X s 2127 871 m 27 X s 2127 927 m 27 X s 2127 973 m 27 X s 2127 1011 m 27 X s 2127 1045 m 27 X s 2127 1074 m 27 X s 2101 1100 m 53 X s 2127 1274 m 27 X s 2127 1376 m 27 X s 2127
 1448 m 27 X s 2127 1503 m 27 X s 2127 1549 m 27 X s 2127 1588 m 27 X s 2127 1621 m 27 X s 2127 1651 m 27 X s 2101 1677 m 53 X s 2127 1851 m 27 X s 2127 1952 m 27 X s 2127 2024 m 27 X s 6 lw 1 1 1 c 0 0 1 c 3 lw /w 26 def /w2 {w 2 div} def /w3 {w 3
 div} def 383 522 423 845 462 1122 502 1591 542 1733 582 1732 622 1709 661 1674 701 1636 741 1604 781 1564 821 1524 860 1486 900 1459 940 1420 980 1391 1020 1360 1060 1324 1099 1291 1139 1266 1179 1241 1219 1207 1259 1181 1298 1162 1338 1131 1378
 1101 1418 1080 1458 1053 1497 1038 1537 1014 1577 989 1617 967 1657 933 1697 926 1736 911 1776 857 1816 865 1856 841 1896 823 1935 801 1975 767 2015 738 2055 750 2095 713 2134 714 45 { m24} R 6 lw black 1 1 1 c 0.35 0.83 0.33 c 3 lw 383 501 423 818
 462 1118 502 1599 542 1733 582 1788 622 1715 661 1678 701 1626 741 1611 781 1574 821 1530 860 1501 900 1471 940 1436 980 1410 1020 1371 1060 1347 1099 1313 1139 1286 1179 1257 1219 1222 1259 1220 1298 1171 1338 1148 1378 1123 1418 1102 1458 1078
 1497 1052 1537 1025 1577 1005 1617 979 1657 965 1697 927 1736 931 1776 896 1816 868 1856 848 1896 827 1935 860 1975 804 2015 805 2055 768 2095 722 2134 714 45 { m24} R 6 lw black 1 1 1 c 1 0 0 c 3 lw 383 447 423 858 462 1141 502 1597 542 1730 582
 1734 622 1711 661 1676 701 1638 741 1601 781 1563 821 1524 860 1489 900 1458 940 1425 980 1385 1020 1363 1060 1326 1099 1298 1139 1256 1179 1242 1219 1212 1259 1174 1298 1143 1338 1120 1378 1096 1418 1083 1458 1050 1497 1024 1537 1002 1577 974 1617
 961 1657 931 1697 878 1736 868 1776 866 1816 841 1856 814 1896 787 1935 773 1975 761 2015 738 2055 720 2095 698 2134 691 45 { m20} R 6 lw black 1 1 1 c 1 0 1 c 3 lw 383 445 423 829 462 1127 502 1595 542 1731 582 1776 622 1710 661 1676 701 1627 741
 1604 781 1572 821 1524 860 1496 900 1464 940 1433 980 1399 1020 1368 1060 1342 1099 1305 1139 1276 1179 1248 1219 1222 1259 1211 1298 1165 1338 1139 1378 1117 1418 1101 1458 1074 1497 1034 1537 1041 1577 994 1617 977 1657 951 1697 927 1736 918 1776
 880 1816 859 1856 840 1896 818 1935 836 1975 790 2015 794 2055 745 2095 725 2134 700 45 { m22} R 6 lw black
 gsave  2268 2190 0 0 C 669.188 1928.81 t 0 r /Helvetica findfont 101.005 sf 0 0 m 
 280 223 171 145 88 60
(= 7 TeV) K NC gr 
 gsave  2268 2190 0 0 C 620.312 1928.81 t 0 r /Helvetica findfont 101.005 sf 0 0 m (s) show NC gr  554 1984 m 46 -58 d s 0 lw 600 1926 m 9 88 d s 609 2014 m 59 X s
 gsave  2268 2190 0 0 C 2246.19 1358.69 t 90 r /Helvetica-BoldOblique findfont 61.9061 sf 0 0 m 
 677 647 613 579 562 514 456 439 398 357 341 300 252 204 187 143 126 82 37
(LHC HIGGS XS WG 2011) K NC gr  3 lw 1 1 1 c 889 460 1144 1430 bf black 1163 1430 m -13 Y 883 X 453 Y -13 X -440 Y f 1144 1430 m 460 Y 889 X -460 Y -889 X cl s
 gsave  2268 2190 0 0 C 1679.25 1834.31 t 0 r /Helvetica findfont 42.3568 sf 0 0 m (<120GeV) show NC gr 
 gsave  2268 2190 0 0 C 1649.88 1818.06 t 0 r /Helvetica findfont 26.0657 sf 0 0 m (Z2) show NC gr 
 gsave  2268 2190 0 0 C 1581.5 1834.31 t 0 r /Helvetica findfont 42.3568 sf 0 0 m ( , M) show NC gr 
 gsave  2268 2190 0 0 C 1555.44 1821.31 t 0 r /Helvetica findfont 26.0657 sf 0 0 m (Z1) show NC gr 
 gsave  2268 2190 0 0 C 1366.44 1834.31 t 0 r /Helvetica findfont 42.3568 sf 0 0 m (60GeV<M) show NC gr  0.999 0.999 0.999 c black
 gsave  2268 2190 0 0 C 1366.44 1736.62 t 0 r /Helvetica findfont 42.3568 sf 0 0 m (MSTW POWHEG 2e2mu) show NC gr  0 0 1 c 1255 1752 m24 black
 gsave  2268 2190 0 0 C 1366.44 1645.38 t 0 r /Helvetica findfont 42.3568 sf 0 0 m (MSTW MCFM 2e2mu) show NC gr  0.35 0.83 0.33 c 1255 1660 m24 black
 gsave  2268 2190 0 0 C 1366.44 1554.19 t 0 r /Helvetica findfont 42.3568 sf 0 0 m (CT10 POWHEG 2e2mu) show NC gr  1 0 0 c 1255 1568 m20 black
 gsave  2268 2190 0 0 C 1366.44 1462.94 t 0 r /Helvetica findfont 42.3568 sf 0 0 m (CT10 MCFM 2e2mu) show NC gr  1 0 1 c 1255 1476 m22
 gr  gr showpage
end
%%EOF
