%!PS-Adobe-3.0 EPSF-3.0
%%BoundingBox: (atend)
%%LanguageLevel: 2
%%Creator: Grace-5.1.22
%%CreationDate: Mon Dec 19 07:25:46 2011
%%DocumentData: Clean8Bit
%%Orientation: Portrait
%%Title: dsdpt_H_perc_err_band.agr
%%For: laura
%%DocumentNeededResources: (atend)
%%EndComments
%%BeginProlog
/m {moveto} def
/l {lineto} def
/s {stroke} def
/n {newpath} def
/c {closepath} def
/RL {rlineto} def
/SLW {setlinewidth} def
/GS {gsave} def
/GR {grestore} def
/SC {setcolor} def
/SGRY {setgray} def
/SRGB {setrgbcolor} def
/SD {setdash} def
/SLC {setlinecap} def
/SLJ {setlinejoin} def
/SCS {setcolorspace} def
/FFSF {findfont setfont} def
/CC {concat} def
/PXL {n m 0 0 RL s} def
/Color0 {1.0000 1.0000 1.0000} def
/Color1 {0.0000 0.0000 0.0000} def
/Color2 {1.0000 0.0000 0.0000} def
/Color3 {0.0000 1.0000 0.0000} def
/Color4 {0.0000 0.0000 1.0000} def
/Color5 {1.0000 1.0000 0.0000} def
/Color6 {0.7373 0.5608 0.5608} def
/Color7 {0.8627 0.8627 0.8627} def
/Color8 {0.5804 0.0000 0.8275} def
/Color9 {0.0000 1.0000 1.0000} def
/Color10 {1.0000 0.0000 1.0000} def
/Color11 {1.0000 0.6471 0.0000} def
/Color12 {0.4471 0.1294 0.7373} def
/Color13 {0.4039 0.0275 0.2824} def
/Color14 {0.2510 0.8784 0.8157} def
/Color15 {0.0000 0.5451 0.0000} def
/Color16 {0.7529 0.7529 0.7529} def
/Color17 {0.5059 0.5059 0.5059} def
/Color18 {0.2588 0.2588 0.2588} def
/PTRN {
 /pat_bits exch def 
 <<
  /PaintType 2
  /PatternType 1 /TilingType 1
  /BBox[0 0 16 16]
  /XStep 16 /YStep 16
  /PaintProc {
   pop
   16 16 true [-1 0 0 -1 16 16] pat_bits imagemask
  }
 >>
 [0.0016 0 0 0.0016 0 0]
 makepattern
} def
/Pattern0 {<0000000000000000000000000000000000000000000000000000000000000000> PTRN} bind def
/Pattern1 {<ffffffffffffffffffffffffffffffffffffffffffffffffffffffffffffffff> PTRN} bind def
/Pattern2 {<eeeeffffbbbbffffeeeeffffbbbbffffeeeeffffbbbbffffeeeeffffbbbbffff> PTRN} bind def
/Pattern3 {<eeeebbbbeeeebbbbeeeebbbbeeeebbbbeeeebbbbeeeebbbbeeeebbbbeeeebbbb> PTRN} bind def
/Pattern4 {<5555aaaa5555aaaa5555aaaa5555aaaa5555aaaa5555aaaa5555aaaa5555aaaa> PTRN} bind def
/Pattern5 {<1111444411114444111144441111444411114444111144441111444411114444> PTRN} bind def
/Pattern6 {<1111000044440000111100004444000011110000444400001111000044440000> PTRN} bind def
/Pattern7 {<1010000000000000010100000000000010100000000000000101000000000000> PTRN} bind def
/Pattern8 {<0000000000000000000000000000000000000000000000000000000000000000> PTRN} bind def
/Pattern9 {<1e1e0f0f8787c3c3e1e1f0f078783c3c1e1e0f0f8787c3c3e1e1f0f078783c3c> PTRN} bind def
/Pattern10 {<7878f0f0e1e1c3c387870f0f1e1e3c3c7878f0f0e1e1c3c387870f0f1e1e3c3c> PTRN} bind def
/Pattern11 {<3333333333333333333333333333333333333333333333333333333333333333> PTRN} bind def
/Pattern12 {<ffffffff00000000ffffffff00000000ffffffff00000000ffffffff00000000> PTRN} bind def
/Pattern13 {<8181424224241818181824244242818181814242242418181818242442428181> PTRN} bind def
/Pattern14 {<8080404020201010080804040202010180804040202010100808040402020101> PTRN} bind def
/Pattern15 {<0101020204040808101020204040808001010202040408081010202040408080> PTRN} bind def
/Pattern16 {<2222222222222222222222222222222222222222222222222222222222222222> PTRN} bind def
/Pattern17 {<0000ffff000000000000ffff000000000000ffff000000000000ffff00000000> PTRN} bind def
/Pattern18 {<2222ffff222222222222ffff222222222222ffff222222222222ffff22222222> PTRN} bind def
/Pattern19 {<ffffffff33333333ffffffff33333333ffffffff33333333ffffffff33333333> PTRN} bind def
/Pattern20 {<0f0f0f0f0f0f0f0ff0f0f0f0f0f0f0f00f0f0f0f0f0f0f0ff0f0f0f0f0f0f0f0> PTRN} bind def
/Pattern21 {<ff00ff00ff00ff00ff00ff00ff00ff0000ff00ff00ff00ff00ff00ff00ff00ff> PTRN} bind def
/Pattern22 {<8001800180018001800180018001ffffffff8001800180018001800180018001> PTRN} bind def
/Pattern23 {<c003c003c003c003c003c003ffffffffffffffffc003c003c003c003c003c003> PTRN} bind def
/Pattern24 {<040404040404ffff404040404040ffff040404040404ffff404040404040ffff> PTRN} bind def
/Pattern25 {<180018001800180018001800ffffffff001800180018001800180018ffffffff> PTRN} bind def
/Pattern26 {<1111b8b87c7c3a3a1111a3a3c7c78b8b1111b8b87c7c3a3a1111a3a3c7c78b8b> PTRN} bind def
/Pattern27 {<101010102828c7c70101010182827c7c101010102828c7c70101010182827c7c> PTRN} bind def
/Pattern28 {<1c1c121211112121c1c12121111112121c1c121211112121c1c1212111111212> PTRN} bind def
/Pattern29 {<3e3e414180808080e3e31414080808083e3e414180808080e3e3141408080808> PTRN} bind def
/Pattern30 {<4848888884848383848488884848383848488888848483838484888848483838> PTRN} bind def
/Pattern31 {<03030404080808080c0c12122121c0c003030404080808080c0c12122121c0c0> PTRN} bind def
/ellipsedict 8 dict def
ellipsedict /mtrx matrix put
/EARC {
 ellipsedict begin
  /endangle exch def
  /startangle exch def
  /yrad exch def
  /xrad exch def
  /y exch def
  /x exch def
  /savematrix mtrx currentmatrix def
  x y translate
  xrad yrad scale
  0 0 1 startangle endangle arc
  savematrix setmatrix
 end
} def
/TL {
  /kcomp exch def
  /linewidth exch def
  /offset exch def
  GS
  0 offset rmoveto
  linewidth SLW
  dup stringwidth exch kcomp add exch RL s
  GR
} def
/KINIT
{
 /kvector exch def
 /kid 0 def
} def
/KPROC
{
 pop pop
 kvector kid get
 0 rmoveto
 /kid 1 kid add def
} def
/DefEncoding [
 /.notdef
 /.notdef
 /.notdef
 /.notdef
 /.notdef
 /.notdef
 /.notdef
 /.notdef
 /.notdef
 /.notdef
 /.notdef
 /.notdef
 /.notdef
 /.notdef
 /.notdef
 /.notdef
 /.notdef
 /.notdef
 /.notdef
 /.notdef
 /.notdef
 /.notdef
 /.notdef
 /.notdef
 /.notdef
 /.notdef
 /.notdef
 /.notdef
 /.notdef
 /.notdef
 /.notdef
 /.notdef
 /space
 /exclam
 /quotedbl
 /numbersign
 /dollar
 /percent
 /ampersand
 /quoteright
 /parenleft
 /parenright
 /asterisk
 /plus
 /comma
 /hyphen
 /period
 /slash
 /zero
 /one
 /two
 /three
 /four
 /five
 /six
 /seven
 /eight
 /nine
 /colon
 /semicolon
 /less
 /equal
 /greater
 /question
 /at
 /A
 /B
 /C
 /D
 /E
 /F
 /G
 /H
 /I
 /J
 /K
 /L
 /M
 /N
 /O
 /P
 /Q
 /R
 /S
 /T
 /U
 /V
 /W
 /X
 /Y
 /Z
 /bracketleft
 /backslash
 /bracketright
 /asciicircum
 /underscore
 /grave
 /a
 /b
 /c
 /d
 /e
 /f
 /g
 /h
 /i
 /j
 /k
 /l
 /m
 /n
 /o
 /p
 /q
 /r
 /s
 /t
 /u
 /v
 /w
 /x
 /y
 /z
 /braceleft
 /bar
 /braceright
 /asciitilde
 /.notdef
 /.notdef
 /.notdef
 /.notdef
 /.notdef
 /.notdef
 /.notdef
 /.notdef
 /.notdef
 /.notdef
 /.notdef
 /.notdef
 /.notdef
 /.notdef
 /.notdef
 /.notdef
 /.notdef
 /.notdef
 /.notdef
 /.notdef
 /.notdef
 /.notdef
 /.notdef
 /.notdef
 /.notdef
 /.notdef
 /.notdef
 /.notdef
 /.notdef
 /.notdef
 /.notdef
 /.notdef
 /.notdef
 /space
 /exclamdown
 /cent
 /sterling
 /currency
 /yen
 /brokenbar
 /section
 /dieresis
 /copyright
 /ordfeminine
 /guillemotleft
 /logicalnot
 /hyphen
 /registered
 /macron
 /degree
 /plusminus
 /twosuperior
 /threesuperior
 /acute
 /mu
 /paragraph
 /periodcentered
 /cedilla
 /onesuperior
 /ordmasculine
 /guillemotright
 /onequarter
 /onehalf
 /threequarters
 /questiondown
 /Agrave
 /Aacute
 /Acircumflex
 /Atilde
 /Adieresis
 /Aring
 /AE
 /Ccedilla
 /Egrave
 /Eacute
 /Ecircumflex
 /Edieresis
 /Igrave
 /Iacute
 /Icircumflex
 /Idieresis
 /Eth
 /Ntilde
 /Ograve
 /Oacute
 /Ocircumflex
 /Otilde
 /Odieresis
 /multiply
 /Oslash
 /Ugrave
 /Uacute
 /Ucircumflex
 /Udieresis
 /Yacute
 /Thorn
 /germandbls
 /agrave
 /aacute
 /acircumflex
 /atilde
 /adieresis
 /aring
 /ae
 /ccedilla
 /egrave
 /eacute
 /ecircumflex
 /edieresis
 /igrave
 /iacute
 /icircumflex
 /idieresis
 /eth
 /ntilde
 /ograve
 /oacute
 /ocircumflex
 /otilde
 /odieresis
 /divide
 /oslash
 /ugrave
 /uacute
 /ucircumflex
 /udieresis
 /yacute
 /thorn
 /ydieresis
] def
%%EndProlog
%%BeginSetup
%%EndSetup
612.00 612.00 scale
n
0.0000 0.0000 m
0.0000 1.0000 l
1.2941 1.0000 l
1.2941 0.0000 l
c
[/DeviceRGB] SCS
Color0 SC
fill
[/DeviceRGB] SCS
Color2 SC
[] 0 SD
0.0030 SLW
0 SLC
0 SLJ
n
0.1500 0.4368 m
0.1500 0.4270 l
0.1750 0.4270 l
0.1750 0.4366 l
0.2000 0.4366 l
0.2000 0.4426 l
0.2250 0.4426 l
0.2250 0.4362 l
0.2500 0.4362 l
0.2500 0.4366 l
0.2750 0.4366 l
0.2750 0.4471 l
0.3000 0.4471 l
0.3000 0.4292 l
0.3250 0.4292 l
0.3250 0.4334 l
0.3500 0.4334 l
0.3500 0.4448 l
0.3750 0.4448 l
0.3750 0.4405 l
0.4000 0.4405 l
0.4000 0.4333 l
0.4250 0.4333 l
0.4250 0.4359 l
0.4500 0.4359 l
0.4500 0.4397 l
0.4750 0.4397 l
0.4750 0.4350 l
0.5000 0.4350 l
0.5000 0.4399 l
0.5250 0.4399 l
0.5250 0.4366 l
0.5500 0.4366 l
0.5500 0.4514 l
0.5750 0.4514 l
0.5750 0.4309 l
0.6000 0.4309 l
0.6000 0.4362 l
0.6250 0.4362 l
0.6250 0.4444 l
0.6500 0.4444 l
0.6500 0.4184 l
0.6750 0.4184 l
0.6750 0.4533 l
0.7000 0.4533 l
0.7000 0.4299 l
0.7250 0.4299 l
0.7250 0.4276 l
0.7500 0.4276 l
0.7500 0.4547 l
0.7750 0.4547 l
0.7750 0.4327 l
0.8000 0.4327 l
0.8000 0.4278 l
0.8250 0.4278 l
0.8250 0.4242 l
0.8500 0.4242 l
0.8500 0.4294 l
0.8750 0.4294 l
0.8750 0.4317 l
0.9000 0.4317 l
0.9000 0.4264 l
0.9250 0.4264 l
0.9250 0.3943 l
0.9500 0.3943 l
0.9500 0.4590 l
0.9750 0.4590 l
0.9750 0.4008 l
1.0000 0.4008 l
1.0000 0.4771 l
1.0250 0.4771 l
1.0250 0.4525 l
1.0500 0.4525 l
1.0500 0.4130 l
1.0750 0.4130 l
1.0750 0.4078 l
1.1000 0.4078 l
1.1000 0.4102 l
1.1250 0.4102 l
1.1250 0.4448 l
1.1500 0.4448 l
1.1500 0.3645 l
1.1501 0.3645 l
s
n
0.1500 0.4965 m
0.1500 0.4788 l
0.1750 0.4788 l
0.1750 0.4564 l
0.2000 0.4564 l
0.2000 0.4789 l
0.2250 0.4789 l
0.2250 0.4701 l
0.2500 0.4701 l
0.2500 0.4755 l
0.2750 0.4755 l
0.2750 0.4767 l
0.3000 0.4767 l
0.3000 0.4753 l
0.3250 0.4753 l
0.3250 0.4802 l
0.3500 0.4802 l
0.3500 0.4826 l
0.3750 0.4826 l
0.3750 0.4808 l
0.4000 0.4808 l
0.4000 0.4634 l
0.4250 0.4634 l
0.4250 0.4737 l
0.4500 0.4737 l
0.4500 0.4763 l
0.4750 0.4763 l
0.4750 0.4845 l
0.5000 0.4845 l
0.5000 0.4705 l
0.5250 0.4705 l
0.5250 0.4664 l
0.5500 0.4664 l
0.5500 0.4731 l
0.5750 0.4731 l
0.5750 0.4610 l
0.6000 0.4610 l
0.6000 0.4827 l
0.6250 0.4827 l
0.6250 0.4783 l
0.6500 0.4783 l
0.6500 0.4547 l
0.6750 0.4547 l
0.6750 0.4719 l
0.7000 0.4719 l
0.7000 0.4559 l
0.7250 0.4559 l
0.7250 0.4721 l
0.7500 0.4721 l
0.7500 0.4921 l
0.7750 0.4921 l
0.7750 0.4676 l
0.8000 0.4676 l
0.8000 0.4686 l
0.8250 0.4686 l
0.8250 0.4786 l
0.8500 0.4786 l
0.8500 0.4605 l
0.8750 0.4605 l
0.8750 0.4873 l
0.9000 0.4873 l
0.9000 0.4448 l
0.9250 0.4448 l
0.9250 0.4205 l
0.9500 0.4205 l
0.9500 0.4654 l
0.9750 0.4654 l
0.9750 0.4660 l
1.0000 0.4660 l
1.0000 0.4891 l
1.0250 0.4891 l
1.0250 0.4821 l
1.0500 0.4821 l
1.0500 0.4650 l
1.0750 0.4650 l
1.0750 0.4756 l
1.1000 0.4756 l
1.1000 0.4271 l
1.1250 0.4271 l
1.1250 0.5079 l
1.1500 0.5079 l
1.1500 0.4845 l
1.1501 0.4845 l
s
[/DeviceRGB] SCS
Color4 SC
n
0.1500 0.3769 m
0.1500 0.3803 l
0.1750 0.3803 l
0.1750 0.4133 l
0.2000 0.4133 l
0.2000 0.4151 l
0.2250 0.4151 l
0.2250 0.4050 l
0.2500 0.4050 l
0.2500 0.4079 l
0.2750 0.4079 l
0.2750 0.4248 l
0.3000 0.4248 l
0.3000 0.3931 l
0.3250 0.3931 l
0.3250 0.3933 l
0.3500 0.3933 l
0.3500 0.4013 l
0.3750 0.4013 l
0.3750 0.4097 l
0.4000 0.4097 l
0.4000 0.4042 l
0.4250 0.4042 l
0.4250 0.3975 l
0.4500 0.3975 l
0.4500 0.4052 l
0.4750 0.4052 l
0.4750 0.3930 l
0.5000 0.3930 l
0.5000 0.4033 l
0.5250 0.4033 l
0.5250 0.4023 l
0.5500 0.4023 l
0.5500 0.4177 l
0.5750 0.4177 l
0.5750 0.3994 l
0.6000 0.3994 l
0.6000 0.3938 l
0.6250 0.3938 l
0.6250 0.4017 l
0.6500 0.4017 l
0.6500 0.3497 l
0.6750 0.3497 l
0.6750 0.4059 l
0.7000 0.4059 l
0.7000 0.3780 l
0.7250 0.3780 l
0.7250 0.3549 l
0.7500 0.3549 l
0.7500 0.3848 l
0.7750 0.3848 l
0.7750 0.3459 l
0.8000 0.3459 l
0.8000 0.3646 l
0.8250 0.3646 l
0.8250 0.3549 l
0.8500 0.3549 l
0.8500 0.3699 l
0.8750 0.3699 l
0.8750 0.3691 l
0.9000 0.3691 l
0.9000 0.3416 l
0.9250 0.3416 l
0.9250 0.3283 l
0.9500 0.3283 l
0.9500 0.3729 l
0.9750 0.3729 l
0.9750 0.2817 l
1.0000 0.2817 l
1.0000 0.2691 l
1.0250 0.2691 l
1.0250 0.3245 l
1.0500 0.3245 l
1.0500 0.3188 l
1.0750 0.3188 l
1.0750 0.2918 l
1.1000 0.2918 l
1.1000 0.3398 l
1.1250 0.3398 l
1.1250 0.2661 l
1.1500 0.2661 l
1.1500 0.2429 l
1.1501 0.2429 l
s
n
0.1500 0.5578 m
0.1500 0.5209 l
0.1750 0.5209 l
0.1750 0.4901 l
0.2000 0.4901 l
0.2000 0.5137 l
0.2250 0.5137 l
0.2250 0.5005 l
0.2500 0.5005 l
0.2500 0.5101 l
0.2750 0.5101 l
0.2750 0.5150 l
0.3000 0.5150 l
0.3000 0.5081 l
0.3250 0.5081 l
0.3250 0.5229 l
0.3500 0.5229 l
0.3500 0.5289 l
0.3750 0.5289 l
0.3750 0.5149 l
0.4000 0.5149 l
0.4000 0.4956 l
0.4250 0.4956 l
0.4250 0.5206 l
0.4500 0.5206 l
0.4500 0.5350 l
0.4750 0.5350 l
0.4750 0.5252 l
0.5000 0.5252 l
0.5000 0.5074 l
0.5250 0.5074 l
0.5250 0.4995 l
0.5500 0.4995 l
0.5500 0.5089 l
0.5750 0.5089 l
0.5750 0.5090 l
0.6000 0.5090 l
0.6000 0.5277 l
0.6250 0.5277 l
0.6250 0.5358 l
0.6500 0.5358 l
0.6500 0.5295 l
0.6750 0.5295 l
0.6750 0.5120 l
0.7000 0.5120 l
0.7000 0.5219 l
0.7250 0.5219 l
0.7250 0.5755 l
0.7500 0.5755 l
0.7500 0.5513 l
0.7750 0.5513 l
0.7750 0.5716 l
0.8000 0.5716 l
0.8000 0.5304 l
0.8250 0.5304 l
0.8250 0.5522 l
0.8500 0.5522 l
0.8500 0.5473 l
0.8750 0.5473 l
0.8750 0.5732 l
0.9000 0.5732 l
0.9000 0.5506 l
0.9250 0.5506 l
0.9250 0.5629 l
0.9500 0.5629 l
0.9500 0.5653 l
0.9750 0.5653 l
0.9750 0.5745 l
1.0000 0.5745 l
1.0000 0.6537 l
1.0250 0.6537 l
1.0250 0.5968 l
1.0500 0.5968 l
1.0500 0.6218 l
1.0750 0.6218 l
1.0750 0.6266 l
1.1000 0.6266 l
1.1000 0.5562 l
1.1250 0.5562 l
1.1250 0.6928 l
1.1500 0.6928 l
1.1500 0.6435 l
1.1501 0.6435 l
s
[/DeviceRGB] SCS
Color1 SC
[] 0 SD
0.0015 SLW
n
0.1500 0.1500 m
1.1500 0.1500 l
s
n
0.1500 0.8500 m
1.1500 0.8500 l
s
[] 0 SD
0.0030 SLW
n
0.2750 0.1500 m
0.2750 0.1600 l
s
n
0.2750 0.8500 m
0.2750 0.8400 l
s
n
0.5250 0.1500 m
0.5250 0.1600 l
s
n
0.5250 0.8500 m
0.5250 0.8400 l
s
n
0.7750 0.1500 m
0.7750 0.1600 l
s
n
0.7750 0.8500 m
0.7750 0.8400 l
s
n
1.0250 0.1500 m
1.0250 0.1600 l
s
n
1.0250 0.8500 m
1.0250 0.8400 l
s
n
0.1500 0.1500 m
0.1500 0.1700 l
s
n
0.1500 0.8500 m
0.1500 0.8300 l
s
n
0.4000 0.1500 m
0.4000 0.1700 l
s
n
0.4000 0.8500 m
0.4000 0.8300 l
s
n
0.6500 0.1500 m
0.6500 0.1700 l
s
n
0.6500 0.8500 m
0.6500 0.8300 l
s
n
0.9000 0.1500 m
0.9000 0.1700 l
s
n
0.9000 0.8500 m
0.9000 0.8300 l
s
n
1.1500 0.1500 m
1.1500 0.1700 l
s
n
1.1500 0.8500 m
1.1500 0.8300 l
s
/Times-Roman findfont
dup length dict begin
 {1 index /FID ne {def} {pop pop} ifelse} forall
 /Encoding DefEncoding def
 currentdict
end
/Font0 exch definefont pop
/Font0 FFSF
0.1418 0.1169 m
GS
[0.0344 0.0000 0.0000 0.0344 0 0] CC
(0) show
GR
/Font0 FFSF
0.3745 0.1169 m
GS
[0.0344 0.0000 0.0000 0.0344 0 0] CC
(100) show
GR
/Font0 FFSF
0.6245 0.1169 m
GS
[0.0344 0.0000 0.0000 0.0344 0 0] CC
(200) show
GR
/Font0 FFSF
0.8745 0.1169 m
GS
[0.0344 0.0000 0.0000 0.0344 0 0] CC
(300) show
GR
/Font0 FFSF
1.1245 0.1169 m
GS
[0.0344 0.0000 0.0000 0.0344 0 0] CC
(400) show
GR
/Font0 FFSF
0.5782 0.0697 m
GS
[0.0344 0.0000 0.0000 0.0344 0 0] CC
(p) show
GR
/Font0 FFSF
0.5955 0.0560 m
GS
[0.0244 0.0000 0.0000 0.0244 0 0] CC
(T) show
GR
/Font0 FFSF
0.6104 0.0904 m
GS
[0.0244 0.0000 0.0000 0.0244 0 0] CC
(H) show
GR
/Font0 FFSF
0.6280 0.0697 m
GS
[0.0344 0.0000 0.0000 0.0344 0 0] CC
( [GeV]) show
GR
[] 0 SD
0.0015 SLW
n
0.1500 0.1500 m
0.1500 0.8500 l
s
n
1.1500 0.1500 m
1.1500 0.8500 l
s
[] 0 SD
0.0030 SLW
n
0.1500 0.2667 m
0.1600 0.2667 l
s
n
1.1500 0.2667 m
1.1400 0.2667 l
s
n
0.1500 0.3963 m
0.1600 0.3963 l
s
n
1.1500 0.3963 m
1.1400 0.3963 l
s
n
0.1500 0.5259 m
0.1600 0.5259 l
s
n
1.1500 0.5259 m
1.1400 0.5259 l
s
n
0.1500 0.6556 m
0.1600 0.6556 l
s
n
1.1500 0.6556 m
1.1400 0.6556 l
s
n
0.1500 0.7852 m
0.1600 0.7852 l
s
n
1.1500 0.7852 m
1.1400 0.7852 l
s
n
0.1500 0.2019 m
0.1700 0.2019 l
s
n
1.1500 0.2019 m
1.1300 0.2019 l
s
n
0.1500 0.3315 m
0.1700 0.3315 l
s
n
1.1500 0.3315 m
1.1300 0.3315 l
s
n
0.1500 0.4611 m
0.1700 0.4611 l
s
n
1.1500 0.4611 m
1.1300 0.4611 l
s
n
0.1500 0.5907 m
0.1700 0.5907 l
s
n
1.1500 0.5907 m
1.1300 0.5907 l
s
n
0.1500 0.7204 m
0.1700 0.7204 l
s
n
1.1500 0.7204 m
1.1300 0.7204 l
s
n
0.1500 0.8500 m
0.1700 0.8500 l
s
n
1.1500 0.8500 m
1.1300 0.8500 l
s
/Font0 FFSF
0.1235 0.1905 m
GS
[0.0344 0.0000 0.0000 0.0344 0 0] CC
(0) show
GR
/Font0 FFSF
0.0992 0.3199 m
GS
[0.0344 0.0000 0.0000 0.0344 0 0] CC
(0.5) show
GR
/Font0 FFSF
0.1263 0.4495 m
GS
[0.0344 0.0000 0.0000 0.0344 0 0] CC
(1) show
GR
/Font0 FFSF
0.0992 0.5792 m
GS
[0.0344 0.0000 0.0000 0.0344 0 0] CC
(1.5) show
GR
/Font0 FFSF
0.1235 0.7088 m
GS
[0.0344 0.0000 0.0000 0.0344 0 0] CC
(2) show
GR
/Font0 FFSF
0.0992 0.8384 m
GS
[0.0344 0.0000 0.0000 0.0344 0 0] CC
(2.5) show
GR
/Font0 FFSF
0.0754 0.4057 m
GS
[0.0000 0.0344 -0.0344 0.0000 0 0] CC
(\(d/dp) show
GR
/Font0 FFSF
0.0892 0.4782 m
GS
[0.0000 0.0244 -0.0244 0.0000 0 0] CC
(T) show
GR
/Font0 FFSF
0.0548 0.4931 m
GS
[0.0000 0.0244 -0.0244 0.0000 0 0] CC
(H) show
GR
/Font0 FFSF
0.0754 0.5108 m
GS
[0.0000 0.0344 -0.0344 0.0000 0 0] CC
(\)/C.V.) show
GR
/Font0 FFSF
1.1892 0.5475 m
GS
[0.0000 0.0280 -0.0280 0.0000 0 0] CC
(LHC HIGGS XS WG 2011) show
GR
n
0.1500 0.1500 m
0.1500 0.8500 l
1.1500 0.8500 l
1.1500 0.1500 l
0.1500 0.1500 l
c
s
n
0.7500 0.7981 m
0.7500 0.7211 l
1.0472 0.7211 l
1.0472 0.7981 l
c
[/DeviceRGB] SCS
Color0 SC
fill
[/DeviceRGB] SCS
Color1 SC
[] 0 SD
0.0015 SLW
n
0.7500 0.7981 m
0.7500 0.7211 l
1.0472 0.7211 l
1.0472 0.7981 l
0.7500 0.7981 l
c
s
/Font0 FFSF
0.8215 0.7650 m
GS
[0.0339 0.0000 0.0000 0.0339 0 0] CC
(error from scale) show
GR
[/DeviceRGB] SCS
Color2 SC
[] 0 SD
0.0030 SLW
n
0.7615 0.7764 m
0.8015 0.7764 l
s
/Font0 FFSF
[/DeviceRGB] SCS
Color1 SC
0.8215 0.7315 m
GS
[0.0339 0.0000 0.0000 0.0339 0 0] CC
(total error) show
GR
[/DeviceRGB] SCS
Color4 SC
n
0.7615 0.7429 m
0.8015 0.7429 l
s
/Font0 FFSF
[/DeviceRGB] SCS
Color1 SC
0.2659 0.6471 m
GS
[0.0353 0.0000 0.0000 0.0353 0 0] CC
(LHC at 7 TeV) show
GR
%%Trailer
%%BoundingBox: 22 33 730 529
%%DocumentNeededResources: font Times-Roman
%%EOF
