%!PS-Adobe-2.0 EPSF-2.0
%%BoundingBox:  0 0 567 488
%%Title: Results/m120-600-pth-mstw2008.eps: VBF - HAWK
%%Creator: ROOT Version 5.28/00c
%%CreationDate: Wed Nov 30 09:19:01 2011
%%EndComments
%%BeginProlog
80 dict begin
/s {stroke} def /l {lineto} def /m {moveto} def /t {translate} def
/r {rotate} def /rl {roll}  def /R {repeat} def
/d {rlineto} def /rm {rmoveto} def /gr {grestore} def /f {eofill} def
/c {setrgbcolor} def /black {0 setgray} def /sd {setdash} def
/cl {closepath} def /sf {scalefont setfont} def /lw {setlinewidth} def
/box {m dup 0 exch d exch 0 d 0 exch neg d cl} def
/NC{systemdict begin initclip end}def/C{NC box clip newpath}def
/bl {box s} def /bf {box f} def /Y { 0 exch d} def /X { 0 d} def 
/K {{pop pop 0 moveto} exch kshow} bind def
/ita {/ang 15 def gsave [1 0 ang dup sin exch cos div 1 0 0] concat} def 
/mp {newpath /y exch def /x exch def} def
/side {[w .77 mul w .23 mul] .385 w mul sd w 0 l currentpoint t -144 r} def
/mr {mp x y w2 0 360 arc} def /m24 {mr s} def /m20 {mr f} def
/mb {mp x y w2 add m w2 neg 0 d 0 w neg d w 0 d 0 w d cl} def
/mt {mp x y w2 add m w2 neg w neg d w 0 d cl} def
/m21 {mb f} def /m25 {mb s} def /m22 {mt f} def /m26{mt s} def
/m23 {mp x y w2 sub m w2 w d w neg 0 d cl f} def
/m27 {mp x y w2 add m w3 neg w2 neg d w3 w2 neg d w3 w2 d cl s} def
/m28 {mp x w2 sub y w2 sub w3 add m w3 0 d  0 w3 neg d w3 0 d 0 w3 d w3 0 d  0 w3 d w3 neg 0 d 0 w3 d w3 neg 0 d 0 w3 neg d w3 neg 0 d cl s } def
/m29 {mp gsave x w2 sub y w2 add w3 sub m currentpoint t 4 {side} repeat cl fill gr} def
/m30 {mp gsave x w2 sub y w2 add w3 sub m currentpoint t 4 {side} repeat cl s gr} def
/m31 {mp x y w2 sub m 0 w d x w2 sub y m w 0 d x w2 sub y w2 add m w w neg d x w2 sub y w2 sub m w w d s} def
/m32 {mp x y w2 sub m w2 w d w neg 0 d cl s} def
/m33 {mp x y w2 add m w3 neg w2 neg d w3 w2 neg d w3 w2 d cl f} def
/m34 {mp x w2 sub y w2 sub w3 add m w3 0 d  0 w3 neg d w3 0 d 0 w3 d w3 0 d  0 w3 d w3 neg 0 d 0 w3 d w3 neg 0 d 0 w3 neg d w3 neg 0 d cl f } def
/m2 {mp x y w2 sub m 0 w d x w2 sub y m w 0 d s} def
/m5 {mp x w2 sub y w2 sub m w w d x w2 sub y w2 add m w w neg d s} def
/reEncode {exch findfont dup length dict begin {1 index /FID eq  {pop pop} {def} ifelse } forall /Encoding exch def currentdict end dup /FontName get exch definefont pop } def [/Times-Bold /Times-Italic /Times-BoldItalic /Helvetica /Helvetica-Oblique
 /Helvetica-Bold /Helvetica-BoldOblique /Courier /Courier-Oblique /Courier-Bold /Courier-BoldOblique /Times-Roman /AvantGarde-Book /AvantGarde-BookOblique /AvantGarde-Demi /AvantGarde-DemiOblique /Bookman-Demi /Bookman-DemiItalic /Bookman-Light
 /Bookman-LightItalic /Helvetica-Narrow /Helvetica-Narrow-Bold /Helvetica-Narrow-BoldOblique /Helvetica-Narrow-Oblique /NewCenturySchlbk-Roman /NewCenturySchlbk-Bold /NewCenturySchlbk-BoldItalic /NewCenturySchlbk-Italic /Palatino-Bold
 /Palatino-BoldItalic /Palatino-Italic /Palatino-Roman ] {ISOLatin1Encoding reEncode } forall%%EndProlog
%%BeginSetup
%%EndSetup
newpath  gsave  .25 .25 scale  gsave  0 0 t black[  ] 0 sd 3 lw 1 1 1 c 2268 1954 0 0 bf black 1 1 1 c 2177 1329 45 586 bf black 1 1 1 c 1677 1063 328 719 bf black 1677 1063 328 719 bl 1 1 1 c 1677 1063 328 719 bf black 1677 1063 328 719 bl 0.8 0 0
 c[  12 12 ] 0 sd 6 lw 1 1 1 c black 0.8 0 0 c 328 1563 m 84 X 108 Y 84 X 33 Y 84 X -4 Y 84 X -28 Y 83 X -44 Y 84 X -55 Y 84 X -60 Y 84 X -66 Y 84 X -68 Y 84 X -67 Y 83 X -61 Y 84 X -70 Y 84 X -53 Y 84 X -52 Y 84 X -49 Y 83 X -75 Y 84 X -43 Y 84 X
 -45 Y 84 X -61 Y 84 X s black[  ] 0 sd 3 lw 328 719 m 1677 X s
 gsave  2177 1329 45 586 C 1834.93 617.548 t 0 r /Helvetica findfont 60.8537 sf 0 0 m ( [GeV]) show NC gr 
 gsave  2177 1329 45 586 C 1781.78 584.646 t 0 r /Helvetica findfont 40.5691 sf 0 0 m (TH) show NC gr 
 gsave  2177 1329 45 586 C 1748.88 617.548 t 0 r /Helvetica findfont 60.8537 sf 0 0 m (p) show NC gr  328 750 m -31 Y s 362 734 m -15 Y s 395 734 m -15 Y s 429 734 m -15 Y s 462 734 m -15 Y s 496 750 m -31 Y s 530 734 m -15 Y s 563 734 m -15 Y s 597
 734 m -15 Y s 630 734 m -15 Y s 664 750 m -31 Y s 697 734 m -15 Y s 731 734 m -15 Y s 764 734 m -15 Y s 798 734 m -15 Y s 831 750 m -31 Y s 865 734 m -15 Y s 898 734 m -15 Y s 932 734 m -15 Y s 965 734 m -15 Y s 999 750 m -31 Y s 1032 734 m -15 Y s
 1066 734 m -15 Y s 1099 734 m -15 Y s 1133 734 m -15 Y s 1167 750 m -31 Y s 1200 734 m -15 Y s 1234 734 m -15 Y s 1267 734 m -15 Y s 1301 734 m -15 Y s 1334 750 m -31 Y s 1368 734 m -15 Y s 1401 734 m -15 Y s 1435 734 m -15 Y s 1468 734 m -15 Y s
 1502 750 m -31 Y s 1535 734 m -15 Y s 1569 734 m -15 Y s 1602 734 m -15 Y s 1636 734 m -15 Y s 1669 750 m -31 Y s 1703 734 m -15 Y s 1736 734 m -15 Y s 1770 734 m -15 Y s 1804 734 m -15 Y s 1837 750 m -31 Y s 1871 734 m -15 Y s 1904 734 m -15 Y s
 1938 734 m -15 Y s 1971 734 m -15 Y s 2005 750 m -31 Y s
 gsave  2177 1329 45 586 C 313.836 675.759 t 0 r /Helvetica findfont 45.6403 sf 0 0 m (0) show NC gr 
 gsave  2177 1329 45 586 C 468.223 675.759 t 0 r /Helvetica findfont 45.6403 sf 0 0 m (50) show NC gr 
 gsave  2177 1329 45 586 C 625.141 675.759 t 0 r /Helvetica findfont 45.6403 sf 0 0 m (100) show NC gr 
 gsave  2177 1329 45 586 C 792.182 675.759 t 0 r /Helvetica findfont 45.6403 sf 0 0 m (150) show NC gr 
 gsave  2177 1329 45 586 C 959.224 675.759 t 0 r /Helvetica findfont 45.6403 sf 0 0 m (200) show NC gr 
 gsave  2177 1329 45 586 C 1126.27 675.759 t 0 r /Helvetica findfont 45.6403 sf 0 0 m (250) show NC gr 
 gsave  2177 1329 45 586 C 1295.84 675.759 t 0 r /Helvetica findfont 45.6403 sf 0 0 m (300) show NC gr 
 gsave  2177 1329 45 586 C 1462.88 675.759 t 0 r /Helvetica findfont 45.6403 sf 0 0 m (350) show NC gr 
 gsave  2177 1329 45 586 C 1629.92 675.759 t 0 r /Helvetica findfont 45.6403 sf 0 0 m (400) show NC gr 
 gsave  2177 1329 45 586 C 1796.96 675.759 t 0 r /Helvetica findfont 45.6403 sf 0 0 m (450) show NC gr 
 gsave  2177 1329 45 586 C 1966.54 675.759 t 0 r /Helvetica findfont 45.6403 sf 0 0 m (500) show NC gr  328 719 m 1063 Y s
 gsave  2177 1329 45 586 C 217.66 1546.4 t 90 r /Helvetica findfont 60.8537 sf 0 0 m ( [fb/GeV]) show NC gr 
 gsave  2177 1329 45 586 C 250.562 1493.25 t 90 r /Helvetica findfont 40.5691 sf 0 0 m (TH) show NC gr 
 gsave  2177 1329 45 586 C 217.66 1409.73 t 90 r /Helvetica findfont 60.8537 sf 0 0 m (/dp) show NC gr 
 gsave  2177 1329 45 586 C 217.66 1371.77 t 90 r /Symbol findfont 60.8537 sf 0 0 m (s) show NC gr 
 gsave  2177 1329 45 586 C 217.66 1341.39 t 90 r /Helvetica findfont 60.8537 sf 0 0 m (d) show NC gr  354 728 m -26 X s 354 744 m -26 X s 354 759 m -26 X s 381 771 m -53 X s
 gsave  2177 1329 45 586 C 280.934 771.935 t 0 r /Helvetica findfont 30.4268 sf 0 0 m (\2553) show NC gr 
 gsave  2177 1329 45 586 C 230.315 751.687 t 0 r /Helvetica findfont 45.6403 sf 0 0 m (10) show NC gr  354 855 m -26 X s 354 905 m -26 X s 354 940 m -26 X s 354 967 m -26 X s 354 989 m -26 X s 354 1008 m -26 X s 354 1024 m -26 X s 354 1038 m -26 X s
 381 1051 m -53 X s
 gsave  2177 1329 45 586 C 280.934 1050.34 t 0 r /Helvetica findfont 30.4268 sf 0 0 m (\2552) show NC gr 
 gsave  2177 1329 45 586 C 230.315 1032.62 t 0 r /Helvetica findfont 45.6403 sf 0 0 m (10) show NC gr  354 1135 m -26 X s 354 1184 m -26 X s 354 1219 m -26 X s 354 1246 m -26 X s 354 1268 m -26 X s 354 1287 m -26 X s 354 1303 m -26 X s 354 1318 m -26
 X s 381 1330 m -53 X s
 gsave  2177 1329 45 586 C 285.996 1328.74 t 0 r /Helvetica findfont 30.4268 sf 0 0 m (\2551) show NC gr 
 gsave  2177 1329 45 586 C 235.377 1311.02 t 0 r /Helvetica findfont 45.6403 sf 0 0 m (10) show NC gr  354 1414 m -26 X s 354 1464 m -26 X s 354 1499 m -26 X s 354 1526 m -26 X s 354 1548 m -26 X s 354 1567 m -26 X s 354 1583 m -26 X s 354 1597 m -26
 X s 381 1610 m -53 X s
 gsave  2177 1329 45 586 C 311.177 1591.59 t 0 r  -24 0 t /Helvetica findfont 45.6403 sf 0 0 m (1) show NC gr  354 1694 m -26 X s 354 1743 m -26 X s 354 1778 m -26 X s 0.4 0.4 0.8 c 6 lw 1 1 1 c black 0.4 0.4 0.8 c 328 1555 m 84 X 109 Y 84 X 33 Y 84
 X -7 Y 84 X -29 Y 83 X -44 Y 84 X -56 Y 84 X -62 Y 84 X -68 Y 84 X -64 Y 84 X -69 Y 83 X -67 Y 84 X -63 Y 84 X -61 Y 84 X -59 Y 84 X -55 Y 83 X -65 Y 84 X -56 Y 84 X -27 Y 84 X -62 Y 84 X s 0 0.8 0 c[ 20 12 4 12] 0 sd 1 1 1 c black 0 0.8 0 c 328
 1564 m 84 X 108 Y 84 X 33 Y 84 X -6 Y 84 X -28 Y 83 X -43 Y 84 X -54 Y 84 X -62 Y 84 X -66 Y 84 X -64 Y 84 X -67 Y 83 X -62 Y 84 X -61 Y 84 X -63 Y 84 X -56 Y 84 X -51 Y 83 X -60 Y 84 X -49 Y 84 X -40 Y 84 X -59 Y 84 X s 0.2 0 0.4 c[ 20 20] 0 sd 1 1
 1 c black 0.2 0 0.4 c 328 1553 m 84 X 107 Y 84 X 33 Y 84 X -3 Y 84 X -32 Y 83 X -44 Y 84 X -55 Y 84 X -62 Y 84 X -69 Y 84 X -66 Y 84 X -68 Y 83 X -67 Y 84 X -57 Y 84 X -62 Y 84 X -57 Y 84 X -64 Y 83 X -49 Y 84 X -42 Y 84 X -81 Y 84 X -42 Y 84 X s
 0.8 0 0 c[  12 12 ] 0 sd 1 1 1 c black 0.8 0 0 c 328 1227 m 84 X 107 Y 84 X 40 Y 84 X -2 Y 84 X -24 Y 83 X -39 Y 84 X -43 Y 84 X -50 Y 84 X -51 Y 84 X -56 Y 84 X -47 Y 83 X -59 Y 84 X -40 Y 84 X -55 Y 84 X -59 Y 84 X -30 Y 83 X -50 Y 84 X -50 Y 252
 X s 0.4 0.4 0.8 c[  ] 0 sd 1 1 1 c black 0.4 0.4 0.8 c 328 1258 m 84 X 109 Y 84 X 39 Y 84 X -3 Y 84 X -24 Y 83 X -39 Y 84 X -45 Y 84 X -52 Y 84 X -54 Y 84 X -53 Y 84 X -55 Y 83 X -57 Y 84 X -48 Y 84 X -56 Y 84 X -49 Y 84 X -68 Y 83 X -24 Y 84 X -57
 Y 84 X -3 Y 168 X s 0 0.8 0 c[ 20 12 4 12] 0 sd 1 1 1 c black 0 0.8 0 c 328 1255 m 84 X 111 Y 84 X 37 Y 84 X -3 Y 84 X -23 Y 83 X -40 Y 84 X -45 Y 84 X -52 Y 84 X -53 Y 84 X -53 Y 84 X -53 Y 83 X -56 Y 84 X -47 Y 84 X -54 Y 84 X -47 Y 84 X -64 Y 83
 X -25 Y 84 X -53 Y 84 X -16 Y 168 X s 0.2 0 0.4 c[ 20 20] 0 sd 1 1 1 c black 0.2 0 0.4 c 328 1235 m 84 X 108 Y 84 X 38 Y 84 X 1 Y 84 X -26 Y 83 X -38 Y 84 X -45 Y 84 X -52 Y 84 X -52 Y 84 X -55 Y 84 X -50 Y 83 X -55 Y 84 X -50 Y 84 X -51 Y 84 X -44
 Y 84 X -52 Y 83 X -42 Y 84 X -51 Y 252 X s black
 gsave  2177 1329 45 586 C 2057.65 1338.86 t 90 r /Helvetica-BoldOblique findfont 38.0336 sf 0 0 m 
 410 392 371 351 340 311 276 266 241 216 206 181 152 123 113 86 76 49 22
(LHC HIGGS XS WG 2011) K NC gr 
 gsave  2177 1329 45 586 C 1650.17 1705.85 t 0 r /Helvetica findfont 30.4268 sf 0 0 m 
 239 229 212 191 182 154 135 126 118 97 88 68 40 22
(HAWK w/ EW Corr) K NC gr  0.4 0.4 0.8 c[  ] 0 sd 1544 1717 m 88 X s black
 gsave  2177 1329 45 586 C 1650.17 1629.92 t 0 r /Helvetica findfont 30.4268 sf 0 0 m (POWHEG) show NC gr  0.8 0 0 c[  12 12 ] 0 sd 1544 1641 m 88 X s black
 gsave  2177 1329 45 586 C 1650.17 1553.99 t 0 r /Helvetica findfont 30.4268 sf 0 0 m 
 255 245 228 207 198 170 151 142 126 117 96 88 68 40 21
(HAWK w/o EW Corr) K NC gr  0 0.8 0 c[ 20 12 4 12] 0 sd 1544 1564 m 88 X s black
 gsave  2177 1329 45 586 C 1650.17 1475.53 t 0 r /Helvetica findfont 30.4268 sf 0 0 m (VBFNLO w/ EW Corr) show NC gr  0.2 0 0.4 c[ 20 20] 0 sd 1544 1488 m 88 X s black[  ] 0 sd 3 lw 1 1 1 c black 1 1 1 c 1677 300 328 231 bf black 1677 300 328 231 bl
 1 1 1 c 1677 300 328 231 bf black 1677 300 328 231 bl 328 231 m 1677 X s
 gsave  2177 547 45 39 C 1834.93 129.078 t 0 r /Helvetica findfont 60.7874 sf 0 0 m ( [GeV]) show NC gr 
 gsave  2177 547 45 39 C 1781.78 96.1755 t 0 r /Helvetica findfont 40.5249 sf 0 0 m (TH) show NC gr 
 gsave  2177 547 45 39 C 1748.88 129.078 t 0 r /Helvetica findfont 60.7874 sf 0 0 m (p) show NC gr  328 243 m -12 Y s 362 237 m -6 Y s 395 237 m -6 Y s 429 237 m -6 Y s 462 237 m -6 Y s 496 243 m -12 Y s 530 237 m -6 Y s 563 237 m -6 Y s 597 237 m -6
 Y s 630 237 m -6 Y s 664 243 m -12 Y s 697 237 m -6 Y s 731 237 m -6 Y s 764 237 m -6 Y s 798 237 m -6 Y s 831 243 m -12 Y s 865 237 m -6 Y s 898 237 m -6 Y s 932 237 m -6 Y s 965 237 m -6 Y s 999 243 m -12 Y s 1032 237 m -6 Y s 1066 237 m -6 Y s
 1099 237 m -6 Y s 1133 237 m -6 Y s 1167 243 m -12 Y s 1200 237 m -6 Y s 1234 237 m -6 Y s 1267 237 m -6 Y s 1301 237 m -6 Y s 1334 243 m -12 Y s 1368 237 m -6 Y s 1401 237 m -6 Y s 1435 237 m -6 Y s 1468 237 m -6 Y s 1502 243 m -12 Y s 1535 237 m
 -6 Y s 1569 237 m -6 Y s 1602 237 m -6 Y s 1636 237 m -6 Y s 1669 243 m -12 Y s 1703 237 m -6 Y s 1736 237 m -6 Y s 1770 237 m -6 Y s 1804 237 m -6 Y s 1837 243 m -12 Y s 1871 237 m -6 Y s 1904 237 m -6 Y s 1938 237 m -6 Y s 1971 237 m -6 Y s 2005
 243 m -12 Y s
 gsave  2177 547 45 39 C 313.836 189.82 t 0 r /Helvetica findfont 45.5906 sf 0 0 m (0) show NC gr 
 gsave  2177 547 45 39 C 468.223 189.82 t 0 r /Helvetica findfont 45.5906 sf 0 0 m (50) show NC gr 
 gsave  2177 547 45 39 C 625.141 189.82 t 0 r /Helvetica findfont 45.5906 sf 0 0 m (100) show NC gr 
 gsave  2177 547 45 39 C 792.182 189.82 t 0 r /Helvetica findfont 45.5906 sf 0 0 m (150) show NC gr 
 gsave  2177 547 45 39 C 959.224 189.82 t 0 r /Helvetica findfont 45.5906 sf 0 0 m (200) show NC gr 
 gsave  2177 547 45 39 C 1126.27 189.82 t 0 r /Helvetica findfont 45.5906 sf 0 0 m (250) show NC gr 
 gsave  2177 547 45 39 C 1295.84 189.82 t 0 r /Helvetica findfont 45.5906 sf 0 0 m (300) show NC gr 
 gsave  2177 547 45 39 C 1462.88 189.82 t 0 r /Helvetica findfont 45.5906 sf 0 0 m (350) show NC gr 
 gsave  2177 547 45 39 C 1629.92 189.82 t 0 r /Helvetica findfont 45.5906 sf 0 0 m (400) show NC gr 
 gsave  2177 547 45 39 C 1796.96 189.82 t 0 r /Helvetica findfont 45.5906 sf 0 0 m (450) show NC gr 
 gsave  2177 547 45 39 C 1966.54 189.82 t 0 r /Helvetica findfont 45.5906 sf 0 0 m (500) show NC gr  328 231 m 300 Y s
 gsave  2177 547 45 39 C 222.722 430.259 t 90 r /Helvetica findfont 60.7874 sf 0 0 m ( [%]) show NC gr 
 gsave  2177 547 45 39 C 245.501 364.454 t 90 r /Helvetica findfont 40.5249 sf 0 0 m (EW) show NC gr 
 gsave  2177 547 45 39 C 222.722 334.083 t 90 r /Symbol findfont 60.7874 sf 0 0 m (d) show NC gr  364 231 m -36 X s 346 248 m -18 X s 346 265 m -18 X s 346 282 m -18 X s 346 299 m -18 X s 364 317 m -36 X s 346 334 m -18 X s 346 351 m -18 X s 346 368
 m -18 X s 346 385 m -18 X s 364 402 m -36 X s 346 420 m -18 X s 346 437 m -18 X s 346 454 m -18 X s 346 471 m -18 X s 364 488 m -36 X s 364 488 m -36 X s 346 506 m -18 X s 346 523 m -18 X s
 gsave  2177 547 45 39 C 250.562 215.129 t 0 r /Helvetica findfont 45.5906 sf 0 0 m (\25530) show NC gr 
 gsave  2177 547 45 39 C 250.562 301.181 t 0 r /Helvetica findfont 45.5906 sf 0 0 m (\25520) show NC gr 
 gsave  2177 547 45 39 C 250.562 387.233 t 0 r /Helvetica findfont 45.5906 sf 0 0 m (\25510) show NC gr 
 gsave  2177 547 45 39 C 291.057 470.754 t 0 r /Helvetica findfont 45.5906 sf 0 0 m (0) show NC gr  370 434 m -42 X s 328 429 m 10 Y s 370 434 m 42 X s 412 429 m 10 Y s 370 434 m 1 Y s 365 435 m 10 X s 370 434 m -2 Y s 365 432 m 10 X s 454 433 m -42
 X s 412 428 m 10 Y s 454 433 m 42 X s 496 428 m 10 Y s 454 433 m 1 Y s 449 434 m 10 X s 454 433 m -1 Y s 449 432 m 10 X s 538 428 m -42 X s 496 422 m 11 Y s 538 428 m 42 X s 580 422 m 11 Y s 538 428 m 1 Y s 533 429 m 10 X s 538 428 m -1 Y s 533 427
 m 10 X s 622 424 m -42 X s 580 419 m 10 Y s 622 424 m 42 X s 664 419 m 10 Y s 622 424 m 1 Y s 617 425 m 10 X s 622 424 m -1 Y s 617 423 m 10 X s 706 418 m -42 X s 664 413 m 10 Y s 706 418 m 41 X s 747 413 m 10 Y s 706 418 m 1 Y s 700 419 m 11 X s
 706 418 m -1 Y s 700 417 m 11 X s 789 414 m -42 X s 747 409 m 10 Y s 789 414 m 42 X s 831 409 m 10 Y s 789 414 m 1 Y s 784 415 m 10 X s 789 414 m -1 Y s 784 413 m 10 X s 873 406 m -42 X s 831 401 m 10 Y s 873 406 m 42 X s 915 401 m 10 Y s 873 406 m
 1 Y s 868 407 m 10 X s 873 406 m -1 Y s 868 405 m 10 X s 957 399 m -42 X s 915 394 m 10 Y s 957 399 m 42 X s 999 394 m 10 Y s 957 399 m 1 Y s 952 400 m 10 X s 957 399 m -2 Y s 952 397 m 10 X s 1041 391 m -42 X s 999 386 m 10 Y s 1041 391 m 42 X s
 1083 386 m 10 Y s 1041 391 m 2 Y s 1036 393 m 10 X s 1041 391 m -3 Y s 1036 388 m 10 X s 1125 387 m -42 X s 1083 382 m 10 Y s 1125 387 m 42 X s 1167 382 m 10 Y s 1125 387 m 3 Y s 1120 390 m 10 X s 1125 387 m -3 Y s 1120 384 m 10 X s 1208 372 m -41 X
 s 1167 367 m 10 Y s 1208 372 m 42 X s 1250 367 m 10 Y s 1208 372 m 4 Y s 1203 376 m 10 X s 1208 372 m -4 Y s 1203 368 m 10 X s 1292 351 m -42 X s 1250 346 m 10 Y s 1292 351 m 42 X s 1334 346 m 10 Y s 1292 351 m 6 Y s 1287 357 m 10 X s 1292 351 m -6
 Y s 1287 345 m 10 X s 1376 341 m -42 X s 1334 336 m 10 Y s 1376 341 m 42 X s 1418 336 m 10 Y s 1376 341 m 7 Y s 1371 348 m 10 X s 1376 341 m -8 Y s 1371 333 m 10 X s 1460 340 m -42 X s 1418 335 m 10 Y s 1460 340 m 42 X s 1502 335 m 10 Y s 1460 340 m
 10 Y s 1455 350 m 10 X s 1460 340 m -11 Y s 1455 329 m 10 X s 1544 320 m -42 X s 1502 315 m 10 Y s 1544 320 m 42 X s 1586 315 m 10 Y s 1544 320 m 14 Y s 1539 334 m 10 X s 1544 320 m -13 Y s 1539 307 m 10 X s 1627 304 m -41 X s 1586 299 m 10 Y s 1627
 304 m 42 X s 1669 299 m 10 Y s 1627 304 m 16 Y s 1622 320 m 11 X s 1627 304 m -16 Y s 1622 288 m 11 X s 1711 279 m -42 X s 1669 274 m 10 Y s 1711 279 m 42 X s 1753 274 m 10 Y s 1711 279 m 24 Y s 1706 303 m 10 X s 1711 279 m -24 Y s 1706 255 m 10 X s
 1795 238 m -42 X s 1753 233 m 10 Y s 1795 238 m 42 X s 1837 233 m 10 Y s 1795 238 m 30 Y s 1790 268 m 10 X s 1795 238 m -7 Y s 1790 231 m 10 X s 1879 309 m -42 X s 1837 304 m 10 Y s 1879 309 m 42 X s 1921 304 m 10 Y s 1879 309 m 29 Y s 1874 338 m 10
 X s 1879 309 m -29 Y s 1874 280 m 10 X s 1963 290 m -42 X s 1921 285 m 10 Y s 1963 290 m 42 X s 2005 285 m 10 Y s 1963 290 m 35 Y s 1958 325 m 10 X s 1963 290 m -35 Y s 1958 255 m 10 X s 0.4 0.4 0.4 c black /w 4 def /w2 {w 2 div} def /w3 {w 3 div}
 def 370 434 454 433 538 428 622 424 706 418 789 414 873 406 957 399 1041 391 1125 387 1208 372 1292 351 1376 341 1460 340 1544 320 1627 304 1711 279 1795 238 1879 309 1963 290 20 { m21} R 0.4 0.4 0.4 c black 0.4 0.4 0.4 c
 gsave  2177 547 45 39 C 447.975 377.109 t 0 r /Helvetica findfont 40.5249 sf 0 0 m ( = 120 GeV) show NC gr  black 0.4 0.4 0.4 c
 gsave  2177 547 45 39 C 427.728 366.985 t 0 r /Helvetica findfont 27.8609 sf 0 0 m (H) show NC gr  black 0.4 0.4 0.4 c
 gsave  2177 547 45 39 C 394.826 377.109 t 0 r /Helvetica findfont 40.5249 sf 0 0 m (M) show NC gr  0.6 0 0 c 370 508 m -42 X s 328 503 m 10 Y s 370 508 m 42 X s 412 503 m 10 Y s 370 508 m 2 Y s 365 510 m 10 X s 370 508 m -2 Y s 365 506 m 10 X s 454
 508 m -42 X s 412 503 m 10 Y s 454 508 m 42 X s 496 503 m 10 Y s 454 508 m 1 Y s 449 509 m 10 X s 454 508 m -1 Y s 449 507 m 10 X s 538 510 m -42 X s 496 505 m 10 Y s 538 510 m 42 X s 580 505 m 10 Y s 538 510 m 1 Y s 533 511 m 10 X s 538 510 m -1 Y
 s 533 509 m 10 X s 622 510 m -42 X s 580 505 m 10 Y s 622 510 m 42 X s 664 505 m 10 Y s 622 510 m 1 Y s 617 511 m 10 X s 622 510 m -2 Y s 617 508 m 10 X s 706 511 m -42 X s 664 506 m 10 Y s 706 511 m 41 X s 747 506 m 10 Y s 706 511 m 1 Y s 700 512 m
 11 X s 706 511 m -1 Y s 700 510 m 11 X s 789 513 m -42 X s 747 508 m 10 Y s 789 513 m 42 X s 831 508 m 10 Y s 789 513 m 1 Y s 784 514 m 10 X s 789 513 m -2 Y s 784 511 m 10 X s 873 515 m -42 X s 831 510 m 10 Y s 873 515 m 42 X s 915 510 m 10 Y s 873
 515 m 4 Y s 868 519 m 10 X s 873 515 m -3 Y s 868 512 m 10 X s 957 510 m -42 X s 915 505 m 10 Y s 957 510 m 42 X s 999 505 m 10 Y s 957 510 m 2 Y s 952 512 m 10 X s 957 510 m -2 Y s 952 508 m 10 X s 1041 506 m -42 X s 999 501 m 10 Y s 1041 506 m 42
 X s 1083 501 m 10 Y s 1041 506 m 1 Y s 1036 507 m 10 X s 1041 506 m -2 Y s 1036 504 m 10 X s 1125 499 m -42 X s 1083 494 m 10 Y s 1125 499 m 42 X s 1167 494 m 10 Y s 1125 499 m 2 Y s 1120 501 m 10 X s 1125 499 m -2 Y s 1120 497 m 10 X s 1208 493 m
 -41 X s 1167 488 m 10 Y s 1208 493 m 42 X s 1250 488 m 10 Y s 1208 493 m 2 Y s 1203 495 m 10 X s 1208 493 m -2 Y s 1203 491 m 10 X s 1292 479 m -42 X s 1250 474 m 10 Y s 1292 479 m 42 X s 1334 474 m 10 Y s 1292 479 m 1 Y s 1287 480 m 10 X s 1292 479
 m -2 Y s 1287 477 m 10 X s 1376 471 m -42 X s 1334 466 m 10 Y s 1376 471 m 42 X s 1418 466 m 10 Y s 1376 471 m 2 Y s 1371 473 m 10 X s 1376 471 m -2 Y s 1371 469 m 10 X s 1460 456 m -42 X s 1418 451 m 10 Y s 1460 456 m 42 X s 1502 451 m 10 Y s 1460
 456 m 2 Y s 1455 458 m 10 X s 1460 456 m -3 Y s 1455 453 m 10 X s 1544 445 m -42 X s 1502 440 m 10 Y s 1544 445 m 42 X s 1586 440 m 10 Y s 1544 445 m 4 Y s 1539 449 m 10 X s 1544 445 m -3 Y s 1539 442 m 10 X s 1627 434 m -41 X s 1586 429 m 10 Y s
 1627 434 m 42 X s 1669 429 m 10 Y s 1627 434 m 10 Y s 1622 444 m 11 X s 1627 434 m -10 Y s 1622 424 m 11 X s 1711 430 m -42 X s 1669 425 m 10 Y s 1711 430 m 42 X s 1753 425 m 10 Y s 1711 430 m 7 Y s 1706 437 m 10 X s 1711 430 m -6 Y s 1706 424 m 10
 X s 1795 401 m -42 X s 1753 396 m 10 Y s 1795 401 m 42 X s 1837 396 m 10 Y s 1795 401 m 9 Y s 1790 410 m 10 X s 1795 401 m -10 Y s 1790 391 m 10 X s 1879 399 m -42 X s 1837 394 m 10 Y s 1879 399 m 42 X s 1921 394 m 10 Y s 1879 399 m 12 Y s 1874 411
 m 10 X s 1879 399 m -12 Y s 1874 387 m 10 X s 1963 404 m -42 X s 1921 399 m 10 Y s 1963 404 m 42 X s 2005 399 m 10 Y s 1963 404 m 12 Y s 1958 416 m 10 X s 1963 404 m -12 Y s 1958 392 m 10 X s black 370 508 454 508 538 510 622 510 706 511 789 513 873
 515 957 510 1041 506 1125 499 1208 493 1292 479 1376 471 1460 456 1544 445 1627 434 1711 430 1795 401 1879 399 1963 404 20 { m22} R 0.6 0 0 c black 0.6 0 0 c
 gsave  2177 547 45 39 C 447.975 455.568 t 0 r /Helvetica findfont 40.5249 sf 0 0 m ( = 600 GeV) show NC gr  black 0.6 0 0 c
 gsave  2177 547 45 39 C 427.728 445.444 t 0 r /Helvetica findfont 27.8609 sf 0 0 m (H) show NC gr  black 0.6 0 0 c
 gsave  2177 547 45 39 C 394.826 455.568 t 0 r /Helvetica findfont 40.5249 sf 0 0 m (M) show NC gr 
 gr  gr showpage
end
%%EOF
