%!PS-Adobe-2.0 EPSF-2.0
%%BoundingBox:  0 0 567 384
%%Title: Higgs_pT.eps: ptH
%%Creator: ROOT Version 5.27/06b
%%CreationDate: Fri Dec  9 12:45:13 2011
%%EndComments
%%BeginProlog
80 dict begin
/s {stroke} def /l {lineto} def /m {moveto} def /t {translate} def
/r {rotate} def /rl {roll}  def /R {repeat} def
/d {rlineto} def /rm {rmoveto} def /gr {grestore} def /f {eofill} def
/c {setrgbcolor} def /black {0 setgray} def /sd {setdash} def
/cl {closepath} def /sf {scalefont setfont} def /lw {setlinewidth} def
/box {m dup 0 exch d exch 0 d 0 exch neg d cl} def
/NC{systemdict begin initclip end}def/C{NC box clip newpath}def
/bl {box s} def /bf {box f} def /Y { 0 exch d} def /X { 0 d} def 
/K {{pop pop 0 moveto} exch kshow} bind def
/ita {/ang 15 def gsave [1 0 ang dup sin exch cos div 1 0 0] concat} def 
/mp {newpath /y exch def /x exch def} def
/side {[w .77 mul w .23 mul] .385 w mul sd w 0 l currentpoint t -144 r} def
/mr {mp x y w2 0 360 arc} def /m24 {mr s} def /m20 {mr f} def
/mb {mp x y w2 add m w2 neg 0 d 0 w neg d w 0 d 0 w d cl} def
/mt {mp x y w2 add m w2 neg w neg d w 0 d cl} def
/m21 {mb f} def /m25 {mb s} def /m22 {mt f} def /m26{mt s} def
/m23 {mp x y w2 sub m w2 w d w neg 0 d cl f} def
/m27 {mp x y w2 add m w3 neg w2 neg d w3 w2 neg d w3 w2 d cl s} def
/m28 {mp x w2 sub y w2 sub w3 add m w3 0 d  0 w3 neg d w3 0 d 0 w3 d w3 0 d  0 w3 d w3 neg 0 d 0 w3 d w3 neg 0 d 0 w3 neg d w3 neg 0 d cl s } def
/m29 {mp gsave x w2 sub y w2 add w3 sub m currentpoint t 4 {side} repeat cl fill gr} def
/m30 {mp gsave x w2 sub y w2 add w3 sub m currentpoint t 4 {side} repeat cl s gr} def
/m31 {mp x y w2 sub m 0 w d x w2 sub y m w 0 d x w2 sub y w2 add m w w neg d x w2 sub y w2 sub m w w d s} def
/m32 {mp x y w2 sub m w2 w d w neg 0 d cl s} def
/m33 {mp x y w2 add m w3 neg w2 neg d w3 w2 neg d w3 w2 d cl f} def
/m34 {mp x w2 sub y w2 sub w3 add m w3 0 d  0 w3 neg d w3 0 d 0 w3 d w3 0 d  0 w3 d w3 neg 0 d 0 w3 d w3 neg 0 d 0 w3 neg d w3 neg 0 d cl f } def
/m2 {mp x y w2 sub m 0 w d x w2 sub y m w 0 d s} def
/m5 {mp x w2 sub y w2 sub m w w d x w2 sub y w2 add m w w neg d s} def
/reEncode {exch findfont dup length dict begin {1 index /FID eq  {pop pop} {def} ifelse } forall /Encoding exch def currentdict end dup /FontName get exch definefont pop } def [/Times-Bold /Times-Italic /Times-BoldItalic /Helvetica /Helvetica-Oblique
 /Helvetica-Bold /Helvetica-BoldOblique /Courier /Courier-Oblique /Courier-Bold /Courier-BoldOblique /Times-Roman /AvantGarde-Book /AvantGarde-BookOblique /AvantGarde-Demi /AvantGarde-DemiOblique /Bookman-Demi /Bookman-DemiItalic /Bookman-Light
 /Bookman-LightItalic /Helvetica-Narrow /Helvetica-Narrow-Bold /Helvetica-Narrow-BoldOblique /Helvetica-Narrow-Oblique /NewCenturySchlbk-Roman /NewCenturySchlbk-Bold /NewCenturySchlbk-BoldItalic /NewCenturySchlbk-Italic /Palatino-Bold
 /Palatino-BoldItalic /Palatino-Italic /Palatino-Roman ] {ISOLatin1Encoding reEncode } forall%%EndProlog
%%BeginSetup
%%EndSetup
newpath  gsave  .25 .25 scale  gsave  0 0 t black[  ] 0 sd 3 lw 1 1 1 c 2268 1538 0 0 bf black 1 1 1 c 1791 1215 363 246 bf black 1791 1215 363 246 bl 1 0 0 c 6 lw 1 1 1 c black 3 lw /w 31 def /w2 {w 2 div} def /w3 {w 3 div} def 381 1369 m20 6 lw 3
 lw 417 1392 m20 6 lw 3 lw 452 1316 m20 6 lw 3 lw 488 1263 m20 6 lw 3 lw 524 1217 m20 6 lw 3 lw 560 1179 m20 6 lw 3 lw 596 1143 m20 6 lw 3 lw 632 1112 m20 6 lw 3 lw 667 1076 m20 6 lw 3 lw 703 1055 m20 6 lw 3 lw 739 1025 m20 6 lw 3 lw 775 1002 m20 6
 lw 3 lw 811 977 m20 6 lw 3 lw 847 949 m20 6 lw 3 lw 882 931 m20 6 lw 3 lw 918 908 m20 6 lw 3 lw 954 888 m20 6 lw 3 lw 990 861 m20 6 lw 3 lw 1026 837 m20 6 lw 3 lw 1062 832 m20 6 lw 3 lw 1097 809 m20 6 lw 3 lw 1133 788 m20 6 lw 3 lw 1169 773 m20 6 lw
 3 lw 1205 746 m20 6 lw 3 lw 1241 746 m20 6 lw 3 lw 1276 719 m20 6 lw 3 lw 1312 704 m20 6 lw 3 lw 1348 685 m20 6 lw 3 lw 1384 675 m20 6 lw 3 lw 1420 651 m20 6 lw 3 lw 1456 645 m20 6 lw 1 0 0 c 1491 603 m 1 Y s 3 lw black 1491 617 m20 6 lw 3 lw 1527
 608 m20 6 lw 3 lw 1563 597 m20 6 lw 1 0 0 c 1599 561 m 23 Y s 1599 610 m 14 Y s 3 lw black 1599 597 m20 6 lw 1 0 0 c 1635 490 m 47 Y s 1635 563 m 26 Y s 3 lw black 1635 550 m20 6 lw 3 lw 1671 557 m20 6 lw 3 lw 1706 536 m20 6 lw 3 lw 1742 521 m20 6
 lw 3 lw 1778 522 m20 6 lw 1 0 0 c 1814 421 m 34 Y s 1814 481 m 20 Y s 3 lw black 1814 468 m20 6 lw 1 0 0 c 1850 440 m 37 Y s 1850 503 m 22 Y s 3 lw black 1850 490 m20 6 lw 1 0 0 c 1886 482 m 12 Y s 1886 520 m 8 Y s 3 lw black 1886 507 m20 6 lw 1 0 0
 c 1921 434 m 2 Y s 3 lw black 1921 449 m20 6 lw 3 lw 1957 456 m20 6 lw 3 lw 1993 433 m20 6 lw 3 lw 2029 431 m20 6 lw 1 0 0 c 2065 414 m 28 Y s 2065 468 m 16 Y s 3 lw black 2065 455 m20 6 lw 1 0 0 c 2101 246 m 61 Y s 2101 333 m 66 Y s 3 lw black 2101
 320 m20 6 lw 3 lw 2136 400 m20 6 lw 1 0 0 c 1 1 1 c black 1 0 0 c 363 1369 m 36 X 23 Y 35 X -76 Y 36 X -53 Y 36 X -46 Y 36 X -38 Y 36 X -36 Y 36 X -31 Y 35 X -36 Y 36 X -21 Y 36 X -30 Y 36 X -23 Y 36 X -25 Y 36 X -28 Y 35 X -18 Y 36 X -23 Y 36 X -20
 Y 36 X -27 Y 36 X -24 Y 36 X -5 Y 35 X -23 Y 36 X -21 Y 36 X -15 Y 36 X -27 Y 72 X -27 Y 35 X -15 Y 36 X -19 Y 36 X -10 Y 36 X -24 Y 36 X -6 Y 36 X -28 Y 35 X -9 Y 36 X -11 Y 72 X -47 Y 36 X 7 Y 36 X -21 Y 35 X -15 Y 36 X 1 Y 36 X -54 Y 36 X 22 Y 36
 X 17 Y 36 X -58 Y 35 X 7 Y 36 X -23 Y 36 X -2 Y 36 X 24 Y 36 X -135 Y 36 X 80 Y 35 X s black 3 lw 363 246 m 1791 X s
 gsave  2268 1538 0 0 C 1955.06 98.1875 t 0 r /Helvetica findfont 71.6807 sf 0 0 m ( [GeV]) show NC gr 
 gsave  2268 1538 0 0 C 1925.75 59.0625 t 0 r /Helvetica findfont 48.8732 sf 0 0 m (T) show NC gr 
 gsave  2268 1538 0 0 C 1684.62 98.1875 t 0 r /Helvetica findfont 71.6807 sf 0 0 m (Higgs p) show NC gr  363 283 m -37 Y s 399 264 m -18 Y s 434 264 m -18 Y s 470 264 m -18 Y s 506 264 m -18 Y s 542 283 m -37 Y s 578 264 m -18 Y s 614 264 m -18 Y s
 649 264 m -18 Y s 685 264 m -18 Y s 721 283 m -37 Y s 757 264 m -18 Y s 793 264 m -18 Y s 829 264 m -18 Y s 864 264 m -18 Y s 900 283 m -37 Y s 936 264 m -18 Y s 972 264 m -18 Y s 1008 264 m -18 Y s 1044 264 m -18 Y s 1079 283 m -37 Y s 1115 264 m
 -18 Y s 1151 264 m -18 Y s 1187 264 m -18 Y s 1223 264 m -18 Y s 1259 283 m -37 Y s 1294 264 m -18 Y s 1330 264 m -18 Y s 1366 264 m -18 Y s 1402 264 m -18 Y s 1438 283 m -37 Y s 1474 264 m -18 Y s 1509 264 m -18 Y s 1545 264 m -18 Y s 1581 264 m
 -18 Y s 1617 283 m -37 Y s 1653 264 m -18 Y s 1689 264 m -18 Y s 1724 264 m -18 Y s 1760 264 m -18 Y s 1796 283 m -37 Y s 1832 264 m -18 Y s 1868 264 m -18 Y s 1904 264 m -18 Y s 1939 264 m -18 Y s 1975 283 m -37 Y s 2011 264 m -18 Y s 2047 264 m
 -18 Y s 2083 264 m -18 Y s 2119 264 m -18 Y s 2154 283 m -37 Y s
 gsave  2268 1538 0 0 C 342.25 179.625 t 0 r /Helvetica findfont 71.6807 sf 0 0 m (0) show NC gr 
 gsave  2268 1538 0 0 C 501.938 179.625 t 0 r /Helvetica findfont 71.6807 sf 0 0 m (50) show NC gr 
 gsave  2268 1538 0 0 C 661.562 179.625 t 0 r /Helvetica findfont 71.6807 sf 0 0 m (100) show NC gr 
 gsave  2268 1538 0 0 C 840.75 179.625 t 0 r /Helvetica findfont 71.6807 sf 0 0 m (150) show NC gr 
 gsave  2268 1538 0 0 C 1020 179.625 t 0 r /Helvetica findfont 71.6807 sf 0 0 m (200) show NC gr 
 gsave  2268 1538 0 0 C 1199.19 179.625 t 0 r /Helvetica findfont 71.6807 sf 0 0 m (250) show NC gr 
 gsave  2268 1538 0 0 C 1378.38 179.625 t 0 r /Helvetica findfont 71.6807 sf 0 0 m (300) show NC gr 
 gsave  2268 1538 0 0 C 1557.56 179.625 t 0 r /Helvetica findfont 71.6807 sf 0 0 m (350) show NC gr 
 gsave  2268 1538 0 0 C 1736.81 179.625 t 0 r /Helvetica findfont 71.6807 sf 0 0 m (400) show NC gr 
 gsave  2268 1538 0 0 C 1916 179.625 t 0 r /Helvetica findfont 71.6807 sf 0 0 m (450) show NC gr 
 gsave  2268 1538 0 0 C 2095.19 179.625 t 0 r /Helvetica findfont 71.6807 sf 0 0 m (500) show NC gr  363 1461 m 1791 X s 363 1425 m 36 Y s 399 1443 m 18 Y s 434 1443 m 18 Y s 470 1443 m 18 Y s 506 1443 m 18 Y s 542 1425 m 36 Y s 578 1443 m 18 Y s 614
 1443 m 18 Y s 649 1443 m 18 Y s 685 1443 m 18 Y s 721 1425 m 36 Y s 757 1443 m 18 Y s 793 1443 m 18 Y s 829 1443 m 18 Y s 864 1443 m 18 Y s 900 1425 m 36 Y s 936 1443 m 18 Y s 972 1443 m 18 Y s 1008 1443 m 18 Y s 1044 1443 m 18 Y s 1079 1425 m 36 Y
 s 1115 1443 m 18 Y s 1151 1443 m 18 Y s 1187 1443 m 18 Y s 1223 1443 m 18 Y s 1259 1425 m 36 Y s 1294 1443 m 18 Y s 1330 1443 m 18 Y s 1366 1443 m 18 Y s 1402 1443 m 18 Y s 1438 1425 m 36 Y s 1474 1443 m 18 Y s 1509 1443 m 18 Y s 1545 1443 m 18 Y s
 1581 1443 m 18 Y s 1617 1425 m 36 Y s 1653 1443 m 18 Y s 1689 1443 m 18 Y s 1724 1443 m 18 Y s 1760 1443 m 18 Y s 1796 1425 m 36 Y s 1832 1443 m 18 Y s 1868 1443 m 18 Y s 1904 1443 m 18 Y s 1939 1443 m 18 Y s 1975 1425 m 36 Y s 2011 1443 m 18 Y s
 2047 1443 m 18 Y s 2083 1443 m 18 Y s 2119 1443 m 18 Y s 2154 1425 m 36 Y s 363 246 m 1215 Y s
 gsave  2268 1538 0 0 C 172.875 756.312 t 90 r /Helvetica findfont 71.6807 sf 0 0 m (arbitrary normalization) show NC gr  390 255 m -27 X s 390 269 m -27 X s 390 281 m -27 X s 417 293 m -54 X s
 gsave  2268 1538 0 0 C 300 293.688 t 0 r /Helvetica findfont 48.8732 sf 0 0 m (\2555) show NC gr 
 gsave  2268 1538 0 0 C 221.75 261.062 t 0 r /Helvetica findfont 71.6807 sf 0 0 m (10) show NC gr  390 367 m -27 X s 390 410 m -27 X s 390 441 m -27 X s 390 465 m -27 X s 390 484 m -27 X s 390 500 m -27 X s 390 515 m -27 X s 390 527 m -27 X s 417 538
 m -54 X s
 gsave  2268 1538 0 0 C 300 538.062 t 0 r /Helvetica findfont 48.8732 sf 0 0 m (\2554) show NC gr 
 gsave  2268 1538 0 0 C 221.75 508.688 t 0 r /Helvetica findfont 71.6807 sf 0 0 m (10) show NC gr  390 612 m -27 X s 390 656 m -27 X s 390 686 m -27 X s 390 710 m -27 X s 390 730 m -27 X s 390 746 m -27 X s 390 760 m -27 X s 390 773 m -27 X s 417 784
 m -54 X s
 gsave  2268 1538 0 0 C 300 785.688 t 0 r /Helvetica findfont 48.8732 sf 0 0 m (\2553) show NC gr 
 gsave  2268 1538 0 0 C 221.75 753.062 t 0 r /Helvetica findfont 71.6807 sf 0 0 m (10) show NC gr  390 858 m -27 X s 390 902 m -27 X s 390 932 m -27 X s 390 956 m -27 X s 390 976 m -27 X s 390 992 m -27 X s 390 1006 m -27 X s 390 1019 m -27 X s 417
 1030 m -54 X s
 gsave  2268 1538 0 0 C 300 1030 t 0 r /Helvetica findfont 48.8732 sf 0 0 m (\2552) show NC gr 
 gsave  2268 1538 0 0 C 221.75 1000.69 t 0 r /Helvetica findfont 71.6807 sf 0 0 m (10) show NC gr  390 1104 m -27 X s 390 1147 m -27 X s 390 1178 m -27 X s 390 1202 m -27 X s 390 1221 m -27 X s 390 1238 m -27 X s 390 1252 m -27 X s 390 1265 m -27 X s
 417 1276 m -54 X s
 gsave  2268 1538 0 0 C 306.5 1274.38 t 0 r /Helvetica findfont 48.8732 sf 0 0 m (\2551) show NC gr 
 gsave  2268 1538 0 0 C 228.312 1245.06 t 0 r /Helvetica findfont 71.6807 sf 0 0 m (10) show NC gr  390 1350 m -27 X s 390 1393 m -27 X s 390 1424 m -27 X s 390 1448 m -27 X s 2154 246 m 1215 Y s 2127 255 m 27 X s 2127 269 m 27 X s 2127 281 m 27 X s
 2101 293 m 53 X s 2127 367 m 27 X s 2127 410 m 27 X s 2127 441 m 27 X s 2127 465 m 27 X s 2127 484 m 27 X s 2127 500 m 27 X s 2127 515 m 27 X s 2127 527 m 27 X s 2101 538 m 53 X s 2127 612 m 27 X s 2127 656 m 27 X s 2127 686 m 27 X s 2127 710 m 27 X
 s 2127 730 m 27 X s 2127 746 m 27 X s 2127 760 m 27 X s 2127 773 m 27 X s 2101 784 m 53 X s 2127 858 m 27 X s 2127 902 m 27 X s 2127 932 m 27 X s 2127 956 m 27 X s 2127 976 m 27 X s 2127 992 m 27 X s 2127 1006 m 27 X s 2127 1019 m 27 X s 2101 1030 m
 53 X s 2127 1104 m 27 X s 2127 1147 m 27 X s 2127 1178 m 27 X s 2127 1202 m 27 X s 2127 1221 m 27 X s 2127 1238 m 27 X s 2127 1252 m 27 X s 2127 1265 m 27 X s 2101 1276 m 53 X s 2127 1350 m 27 X s 2127 1393 m 27 X s 2127 1424 m 27 X s 2127 1448 m 27
 X s 6 lw 1 1 1 c black 363 1324 m 36 X 37 Y 35 X -35 Y 36 X -39 Y 36 X -36 Y 36 X -32 Y 36 X -30 Y 36 X -30 Y 35 X -27 Y 36 X -25 Y 36 X -30 Y 36 X -21 Y 36 X -28 Y 36 X -26 Y 35 X -16 Y 36 X -22 Y 36 X -19 Y 36 X -26 Y 36 X -16 Y 36 X -11 Y 35 X
 -22 Y 36 X -21 Y 36 X -16 Y 36 X -21 Y 36 X -31 Y 71 X -10 Y 36 X -28 Y 36 X -26 Y 36 X -12 Y 36 X 7 Y 36 X -19 Y 35 X -20 Y 36 X -24 Y 36 X -18 Y 36 X 5 Y 36 X -21 Y 36 X -19 Y 35 X 6 Y 36 X -46 Y 36 X 22 Y 36 X -28 Y 36 X -54 Y 36 X 66 Y 35 X -34
 Y 36 X -22 Y 36 X 18 Y 36 X -52 Y 36 X 39 Y 36 X -79 Y 35 X s 0 0 1 c[  12 12 ] 0 sd 1 1 1 c black 0 0 1 c 363 1345 m 36 X 33 Y 35 X -44 Y 36 X -47 Y 36 X -45 Y 36 X -40 Y 36 X -36 Y 36 X -38 Y 35 X -33 Y 36 X -31 Y 36 X -34 Y 36 X -25 Y 36 X -31 Y
 36 X -29 Y 35 X -18 Y 36 X -23 Y 36 X -20 Y 36 X -27 Y 36 X -15 Y 36 X -10 Y 35 X -22 Y 36 X -21 Y 36 X -15 Y 36 X -20 Y 36 X -30 Y 71 X -11 Y 36 X -29 Y 36 X -26 Y 36 X -14 Y 36 X 7 Y 36 X -19 Y 35 X -21 Y 36 X -25 Y 36 X -19 Y 36 X 4 Y 36 X -21 Y
 36 X -20 Y 35 X 5 Y 36 X -47 Y 36 X 21 Y 36 X -29 Y 36 X -54 Y 36 X 64 Y 35 X -34 Y 36 X -23 Y 36 X 17 Y 36 X -52 Y 36 X 37 Y 36 X -79 Y 35 X s black
 gsave  2268 1538 0 0 C 2199.44 1124.5 t 90 r /Helvetica-BoldOblique findfont 29.3239 sf 0 0 m 
 317 303 287 271 263 240 213 205 186 167 159 140 118 95 87 67 59 38 17
(LHC HIGGS XS WG 2011) K NC gr 
 gr  gr showpage
end
%%EOF
