%!PS-Adobe-2.0 EPSF-2.0
%%BoundingBox:  0 0 567 463
%%Title: : c1
%%Creator: ROOT Version 5.28/00f
%%CreationDate: Mon Nov 21 11:26:06 2011
%%EndComments
%%BeginProlog
80 dict begin
/s {stroke} def /l {lineto} def /m {moveto} def /t {translate} def
/r {rotate} def /rl {roll}  def /R {repeat} def
/d {rlineto} def /rm {rmoveto} def /gr {grestore} def /f {eofill} def
/c {setrgbcolor} def /black {0 setgray} def /sd {setdash} def
/cl {closepath} def /sf {scalefont setfont} def /lw {setlinewidth} def
/box {m dup 0 exch d exch 0 d 0 exch neg d cl} def
/NC{systemdict begin initclip end}def/C{NC box clip newpath}def
/bl {box s} def /bf {box f} def /Y { 0 exch d} def /X { 0 d} def 
/K {{pop pop 0 moveto} exch kshow} bind def
/ita {/ang 15 def gsave [1 0 ang dup sin exch cos div 1 0 0] concat} def 
/mp {newpath /y exch def /x exch def} def
/side {[w .77 mul w .23 mul] .385 w mul sd w 0 l currentpoint t -144 r} def
/mr {mp x y w2 0 360 arc} def /m24 {mr s} def /m20 {mr f} def
/mb {mp x y w2 add m w2 neg 0 d 0 w neg d w 0 d 0 w d cl} def
/mt {mp x y w2 add m w2 neg w neg d w 0 d cl} def
/m21 {mb f} def /m25 {mb s} def /m22 {mt f} def /m26{mt s} def
/m23 {mp x y w2 sub m w2 w d w neg 0 d cl f} def
/m27 {mp x y w2 add m w3 neg w2 neg d w3 w2 neg d w3 w2 d cl s} def
/m28 {mp x w2 sub y w2 sub w3 add m w3 0 d  0 w3 neg d w3 0 d 0 w3 d w3 0 d  0 w3 d w3 neg 0 d 0 w3 d w3 neg 0 d 0 w3 neg d w3 neg 0 d cl s } def
/m29 {mp gsave x w2 sub y w2 add w3 sub m currentpoint t 4 {side} repeat cl fill gr} def
/m30 {mp gsave x w2 sub y w2 add w3 sub m currentpoint t 4 {side} repeat cl s gr} def
/m31 {mp x y w2 sub m 0 w d x w2 sub y m w 0 d x w2 sub y w2 add m w w neg d x w2 sub y w2 sub m w w d s} def
/m32 {mp x y w2 sub m w2 w d w neg 0 d cl s} def
/m33 {mp x y w2 add m w3 neg w2 neg d w3 w2 neg d w3 w2 d cl f} def
/m34 {mp x w2 sub y w2 sub w3 add m w3 0 d  0 w3 neg d w3 0 d 0 w3 d w3 0 d  0 w3 d w3 neg 0 d 0 w3 d w3 neg 0 d 0 w3 neg d w3 neg 0 d cl f } def
/m2 {mp x y w2 sub m 0 w d x w2 sub y m w 0 d s} def
/m5 {mp x w2 sub y w2 sub m w w d x w2 sub y w2 add m w w neg d s} def
/reEncode {exch findfont dup length dict begin {1 index /FID eq  {pop pop} {def} ifelse } forall /Encoding exch def currentdict end dup /FontName get exch definefont pop } def [/Times-Bold /Times-Italic /Times-BoldItalic /Helvetica /Helvetica-Oblique
 /Helvetica-Bold /Helvetica-BoldOblique /Courier /Courier-Oblique /Courier-Bold /Courier-BoldOblique /Times-Roman /AvantGarde-Book /AvantGarde-BookOblique /AvantGarde-Demi /AvantGarde-DemiOblique /Bookman-Demi /Bookman-DemiItalic /Bookman-Light
 /Bookman-LightItalic /Helvetica-Narrow /Helvetica-Narrow-Bold /Helvetica-Narrow-BoldOblique /Helvetica-Narrow-Oblique /NewCenturySchlbk-Roman /NewCenturySchlbk-Bold /NewCenturySchlbk-BoldItalic /NewCenturySchlbk-Italic /Palatino-Bold
 /Palatino-BoldItalic /Palatino-Italic /Palatino-Roman ] {ISOLatin1Encoding reEncode } forall%%EndProlog
%%BeginSetup
%%EndSetup
newpath  gsave  .25 .25 scale  gsave  0 0 t black[  ] 0 sd 3 lw 1 1 1 c 2268 1852 0 0 bf black 1 1 1 c 1814 1482 227 185 bf black 1814 1482 227 185 bl 1 1 1 c 1814 1482 227 185 bf black 1814 1482 227 185 bl 1 1 1 c black 227 185 m 324 X 1303 Y 21 X
 92 Y 20 X -100 Y 19 X -52 Y 17 X -34 Y 17 X -27 Y 17 X -38 Y 15 X -20 Y 15 X -27 Y 15 X -30 Y 13 X -19 Y 14 X -10 Y 12 X -29 Y 13 X -15 Y 12 X -34 Y 11 X -29 Y 12 X -35 Y 11 X -23 Y 10 X -30 Y 11 X -15 Y 10 X -23 Y 9 X -41 Y 10 X -24 Y 9 X -29 Y 9 X
 12 Y 9 X -44 Y 8 X -12 Y 9 X 19 Y 8 X -35 Y 8 X -22 Y 8 X 12 Y 8 X -51 Y 7 X 22 Y 8 X -22 Y 7 X 16 Y 7 X -23 Y 7 X 32 Y 7 X -36 Y 6 X -29 Y 7 X -15 Y 7 X 28 Y 6 X -23 Y 6 X -55 Y 6 X 55 Y 6 X -21 Y 6 X 21 Y 6 X -99 Y 6 X 44 Y 6 X -44 Y 5 X 59 Y 6 X
 -59 Y 5 X 52 Y 5 X -42 Y 6 X 27 Y 5 X -17 Y 5 X 17 Y 5 X 35 Y 5 X -156 Y 5 X 84 Y 5 X -104 Y 5 X 69 Y 4 X 24 Y 5 X 31 Y 4 X -85 Y 10 X 54 Y 4 X -73 Y 4 X 62 Y 5 X -13 Y 8 X -14 Y 4 X -80 Y 4 X 64 Y 5 X -19 Y 4 X -75 Y 4 X 75 Y 4 X -75 Y 3 X 30 Y 4 X
 -30 Y 4 X 148 Y 4 X -148 Y 4 X 75 Y 3 X 35 Y 4 X 14 Y 7 X -69 Y 11 X -55 Y 3 X 75 Y 11 X -114 Y 3 X 69 Y 3 X -30 Y 3 X -94 Y 4 X 94 Y 3 X -39 Y 9 X -55 Y 4 X 94 Y 3 X -94 Y 3 X 55 Y 6 X 69 Y 3 X 25 Y 3 X -94 Y 3 X -55 Y 3 X -188 Y 2 X 282 Y 3 X -94
 Y 3 X 55 Y 3 X 114 Y 3 X -114 Y 5 X -55 Y 6 X -94 Y 2 X 94 Y 3 X -94 Y 5 X 94 Y 3 X -94 Y 3 X 94 Y 5 X 169 Y 2 X -263 Y 3 X 94 Y 2 X -188 Y 3 X 243 Y 2 X -55 Y 5 X -94 Y 3 X 149 Y 2 X -149 Y 7 X 188 Y 7 X -94 Y 7 X -94 Y 2 X 94 Y 5 X -188 Y 4 X 188
 Y 3 X 55 Y 2 X -243 Y 2 X 188 Y 2 X 124 Y 2 X -312 Y 2 X 188 Y 2 X -94 Y 5 X -94 Y 2 X 94 Y 2 X -94 Y 2 X 243 Y 2 X 39 Y 2 X -282 Y 2 X 94 Y 4 X 149 Y 2 X -55 Y 2 X -94 Y 2 X -94 Y 4 X 94 Y 2 X -94 Y 2 X 94 Y 2 X -94 Y 2 X 188 Y 1 X -188 Y 2 X 94 Y
 8 X 94 Y 2 X -94 Y 3 X 149 Y 4 X -243 Y 4 X 94 Y 7 X -94 Y 1 X 94 Y 2 X -94 Y 2 X 94 Y 2 X -94 Y 1 X 94 Y 2 X -94 Y 3 X 94 Y 2 X -94 Y 2 X 94 Y 10 X -94 Y 1 X 94 Y 2 X 149 Y 1 X -243 Y 4 X 94 Y 1 X -94 Y 3 X 94 Y 2 X 94 Y 1 X -94 Y 2 X -94 Y 5 X 188
 Y 1 X -188 Y 3 X 94 Y 2 X -94 Y 1 X 94 Y 2 X -94 Y 1 X 188 Y 2 X -94 Y 3 X -94 Y 5 X 243 Y 2 X -243 Y 1 X 94 Y 2 X -94 Y 1 X 94 Y 2 X -94 Y 7 X 94 Y 1 X -94 Y 1 X 243 Y 2 X -149 Y 1 X -94 Y 15 X 94 Y 1 X -94 Y 11 X 94 Y 1 X -94 Y 5 X 282 Y 1 X -282
 Y 6 X 94 Y 2 X -94 Y 3 X 94 Y 1 X -94 Y 6 X 94 Y 3 X -94 Y 17 X 94 Y 1 X -94 Y 2 X 94 Y 1 X -94 Y 2 X 94 Y 1 X -94 Y 20 X 243 Y 1 X -243 Y 14 X 94 Y 1 X -94 Y 12 X 94 Y 1 X -94 Y 22 X 94 Y 1 X -94 Y 29 X 94 Y 1 X -94 Y 32 X 94 Y 1 X -94 Y 60 X 94 Y
 -94 Y 209 X s 227 185 m 1814 X s
 gsave  2268 1852 0 0 C 1891.8 45.8433 t 0 r /Helvetica-Bold findfont 70.2931 sf 0 0 m (| \(%\)) show NC gr 
 gsave  2268 1852 0 0 C 1855.13 45.8433 t 0 r /Symbol findfont 70.2931 sf 0 0 m (d) show NC gr 
 gsave  2268 1852 0 0 C 1839.85 45.8433 t 0 r /Helvetica-Bold findfont 70.2931 sf 0 0 m (|) show NC gr  227 207 m -22 Y s 276 207 m -22 Y s 319 207 m -22 Y s 357 230 m -45 Y s
 gsave  2268 1852 0 0 C 357.182 90.7515 t 0 r  -19 0 t /Helvetica-Bold findfont 70.2931 sf 0 0 m (1) show NC gr  611 207 m -22 Y s 759 207 m -22 Y s 864 207 m -22 Y s 946 207 m -22 Y s 1012 207 m -22 Y s 1069 207 m -22 Y s 1117 207 m -22 Y s 1161 207
 m -22 Y s 1199 230 m -45 Y s
 gsave  2268 1852 0 0 C 1199.06 90.7515 t 0 r  -38 0 t /Helvetica-Bold findfont 70.2931 sf 0 0 m (10) show NC gr  1452 207 m -22 Y s 1601 207 m -22 Y s 1706 207 m -22 Y s 1788 207 m -22 Y s 1854 207 m -22 Y s 1911 207 m -22 Y s 1959 207 m -22 Y s
 2002 207 m -22 Y s 2041 230 m -45 Y s
 gsave  2268 1852 0 0 C 2062.95 125.305 t 0 r /Helvetica-Bold findfont 45.8433 sf 0 0 m (2) show NC gr 
 gsave  2268 1852 0 0 C 1986.54 91.6867 t 0 r /Helvetica-Bold findfont 70.2931 sf 0 0 m (10) show NC gr  227 1667 m 1814 X s 227 1645 m 22 Y s 276 1645 m 22 Y s 319 1645 m 22 Y s 357 1622 m 45 Y s 611 1645 m 22 Y s 759 1645 m 22 Y s 864 1645 m 22 Y s
 946 1645 m 22 Y s 1012 1645 m 22 Y s 1069 1645 m 22 Y s 1117 1645 m 22 Y s 1161 1645 m 22 Y s 1199 1622 m 45 Y s 1452 1645 m 22 Y s 1601 1645 m 22 Y s 1706 1645 m 22 Y s 1788 1645 m 22 Y s 1854 1645 m 22 Y s 1911 1645 m 22 Y s 1959 1645 m 22 Y s
 2002 1645 m 22 Y s 2041 1622 m 45 Y s 227 185 m 1482 Y s
 gsave  2268 1852 0 0 C 103.912 1057.45 t 90 r /Helvetica-Bold findfont 70.2931 sf 0 0 m (Number of events ) show NC gr  254 185 m -27 X s 254 210 m -27 X s 254 231 m -27 X s 254 249 m -27 X s 254 265 m -27 X s 281 279 m -54 X s
 gsave  2268 1852 0 0 C 208.176 249.705 t 0 r  -38 0 t /Helvetica-Bold findfont 70.2931 sf 0 0 m (1) show NC gr  254 373 m -27 X s 254 428 m -27 X s 254 467 m -27 X s 254 497 m -27 X s 254 522 m -27 X s 254 542 m -27 X s 254 561 m -27 X s 254 577 m
 -27 X s 281 591 m -54 X s
 gsave  2268 1852 0 0 C 208.176 561.425 t 0 r  -76 0 t /Helvetica-Bold findfont 70.2931 sf 0 0 m (10) show NC gr  254 685 m -27 X s 254 739 m -27 X s 254 778 m -27 X s 254 809 m -27 X s 254 833 m -27 X s 254 854 m -27 X s 254 872 m -27 X s 254 888 m
 -27 X s 281 902 m -54 X s
 gsave  2268 1852 0 0 C 183.373 904.642 t 0 r /Helvetica-Bold findfont 45.8433 sf 0 0 m (2) show NC gr 
 gsave  2268 1852 0 0 C 106.968 871.023 t 0 r /Helvetica-Bold findfont 70.2931 sf 0 0 m (10) show NC gr  254 996 m -27 X s 254 1051 m -27 X s 254 1090 m -27 X s 254 1120 m -27 X s 254 1145 m -27 X s 254 1166 m -27 X s 254 1184 m -27 X s 254 1200 m
 -27 X s 281 1214 m -54 X s
 gsave  2268 1852 0 0 C 183.373 1219.43 t 0 r /Helvetica-Bold findfont 45.8433 sf 0 0 m (3) show NC gr 
 gsave  2268 1852 0 0 C 106.968 1182.76 t 0 r /Helvetica-Bold findfont 70.2931 sf 0 0 m (10) show NC gr  254 1308 m -27 X s 254 1363 m -27 X s 254 1402 m -27 X s 254 1432 m -27 X s 254 1457 m -27 X s 254 1478 m -27 X s 254 1496 m -27 X s 254 1512 m
 -27 X s 281 1526 m -54 X s
 gsave  2268 1852 0 0 C 183.373 1528.11 t 0 r /Helvetica-Bold findfont 45.8433 sf 0 0 m (4) show NC gr 
 gsave  2268 1852 0 0 C 106.968 1494.49 t 0 r /Helvetica-Bold findfont 70.2931 sf 0 0 m (10) show NC gr  254 1620 m -27 X s 2041 185 m 1482 Y s 2014 185 m 27 X s 2014 210 m 27 X s 2014 231 m 27 X s 2014 249 m 27 X s 2014 265 m 27 X s 1987 279 m 54 X
 s 2014 373 m 27 X s 2014 428 m 27 X s 2014 467 m 27 X s 2014 497 m 27 X s 2014 522 m 27 X s 2014 542 m 27 X s 2014 561 m 27 X s 2014 577 m 27 X s 1987 591 m 54 X s 2014 685 m 27 X s 2014 739 m 27 X s 2014 778 m 27 X s 2014 809 m 27 X s 2014 833 m 27
 X s 2014 854 m 27 X s 2014 872 m 27 X s 2014 888 m 27 X s 1987 902 m 54 X s 2014 996 m 27 X s 2014 1051 m 27 X s 2014 1090 m 27 X s 2014 1120 m 27 X s 2014 1145 m 27 X s 2014 1166 m 27 X s 2014 1184 m 27 X s 2014 1200 m 27 X s 1987 1214 m 54 X s
 2014 1308 m 27 X s 2014 1363 m 27 X s 2014 1402 m 27 X s 2014 1432 m 27 X s 2014 1457 m 27 X s 2014 1478 m 27 X s 2014 1496 m 27 X s 2014 1512 m 27 X s 1987 1526 m 54 X s 2014 1620 m 27 X s
 gr  gr showpage
end
%%EOF
