%!PS-Adobe-2.0 EPSF-2.0
%%BoundingBox:  0 0 567 539
%%Title: compare.out/figures/dpT_j1.eps: 
%%Creator: ROOT Version 5.18/00b
%%CreationDate: Mon Nov 14 00:04:39 2011
%%EndComments
%%BeginProlog
80 dict begin
/s {stroke} def /l {lineto} def /m {moveto} def /t {translate} def
/sw {stringwidth} def /r {rotate} def /rl {roll}  def /R {repeat} def
/d {rlineto} def /rm {rmoveto} def /gr {grestore} def /f {eofill} def
/c {setrgbcolor} def /black {0 setgray} def /sd {setdash} def
/cl {closepath} def /sf {scalefont setfont} def /lw {setlinewidth} def
/box {m dup 0 exch d exch 0 d 0 exch neg d cl} def
/NC{systemdict begin initclip end}def/C{NC box clip newpath}def
/bl {box s} def /bf {box f} def /Y { 0 exch d} def /X { 0 d} def 
/mp {newpath /y exch def /x exch def} def
/side {[w .77 mul w .23 mul] .385 w mul sd w 0 l currentpoint t -144 r} def
/mr {mp x y w2 0 360 arc} def /m24 {mr s} def /m20 {mr f} def
/mb {mp x y w2 add m w2 neg 0 d 0 w neg d w 0 d 0 w d cl} def
/mt {mp x y w2 add m w2 neg w neg d w 0 d cl} def
/m21 {mb f} def /m25 {mb s} def /m22 {mt f} def /m26{mt s} def
/m23 {mp x y w2 sub m w2 w d w neg 0 d cl f} def
/m27 {mp x y w2 add m w3 neg w2 neg d w3 w2 neg d w3 w2 d cl s} def
/m28 {mp x w2 sub y w2 sub w3 add m w3 0 d  0 w3 neg d w3 0 d 0 w3 d w3 0 d  0 w3 d w3 neg 0 d 0 w3 d w3 neg 0 d
 0 w3 neg d w3 neg 0 d cl s } def
/m29 {mp gsave x w2 sub y w2 add w3 sub m currentpoint t
 4 {side} repeat cl fill gr} def
/m30 {mp gsave x w2 sub y w2 add w3 sub m currentpoint t
 4 {side} repeat cl s gr} def
/m31 {mp x y w2 sub m 0 w d x w2 sub y m w 0 d x w2 sub y w2 add m w w neg d x w2 sub y w2
 sub m w w d s} def
/m2 {mp x y w2 sub m 0 w d x w2 sub y m w 0 d s} def
/m5 {mp x w2 sub y w2 sub m w w d x w2 sub y w2 add m w w neg d s} def
/reencdict 24 dict def /ReEncode {reencdict begin /nco&na exch def
/nfnam exch def /basefontname exch def /basefontdict basefontname findfont def
/newfont basefontdict maxlength dict def basefontdict {exch dup /FID ne
{dup /Encoding eq {exch dup length array copy newfont 3 1 roll put} {exch 
newfont 3 1 roll put} ifelse} {pop pop} ifelse } forall newfont
/FontName nfnam put nco&na aload pop nco&na length 2 idiv {newfont
/Encoding get 3 1 roll put} repeat nfnam newfont definefont pop end } def
/accvec [ 176 /agrave 181 /Agrave 190 /acircumflex 192 /Acircumflex
201 /adieresis 204 /Adieresis 209 /ccedilla 210 /Ccedilla 211 /eacute
212 /Eacute 213 /egrave 214 /Egrave 215 /ecircumflex 216 /Ecircumflex
217 /edieresis 218 /Edieresis 219 /icircumflex 220 /Icircumflex
221 /idieresis 222 /Idieresis 223 /ntilde 224 /Ntilde 226 /ocircumflex
228 /Ocircumflex 230 /Odieresis 231 /ucircumflex 236 /Ucircumflex
237 /udieresis 238 /Udieresis 239 /aring 240 /odieresis 242 /Aring 243 /ydieresis
244 /Ydieresis 246 /aacute 247 /Aacute 252 /ugrave 253 /Ugrave
127 /atilde 128 /Atilde 129 /oacute 130 /Oacute 131 /iacute
132 /Iacute 133 /igrave 134 /Igrave 135 /otilde 136 /Otilde
137 /uacute 138 /Uacute] def
/Times-Roman /Times-Roman accvec ReEncode
/Times-Italic /Times-Italic accvec ReEncode
/Times-Bold /Times-Bold accvec ReEncode
/Times-BoldItalic /Times-BoldItalic accvec ReEncode
/Helvetica /Helvetica accvec ReEncode
/Helvetica-Oblique /Helvetica-Oblique accvec ReEncode
/Helvetica-Bold /Helvetica-Bold accvec ReEncode
/Helvetica-BoldOblique /Helvetica-BoldOblique  accvec ReEncode
/Courier /Courier accvec ReEncode
/Courier-Oblique /Courier-Oblique accvec ReEncode
/Courier-Bold /Courier-Bold accvec ReEncode
/Courier-BoldOblique /Courier-BoldOblique accvec ReEncode
/oshow {gsave [] 0 sd true charpath stroke gr} def
/stwn { /fs exch def /fn exch def /text exch def fn findfont fs sf
 text sw pop xs add /xs exch def} def
/stwb { /fs exch def /fn exch def /nbas exch def /textf exch deftextf length /tlen exch def nbas tlen gt {/nbas tlendef} iffn findfont fs sf textf dup length nbas sub nbas getinterval sw
pop neg xs add /xs exch def} def
/accspe [ 65 /plusminus  66 /bar  67 /existential  68 /universal 
69 /exclam  70 /numbersign 71 /greater  72 /question  73 /integral 
74 /colon  75 /semicolon  76 /less  77 /bracketleft  78 /bracketright
79 /greaterequal 80 /braceleft 81 /braceright 82 /radical
83 /spade 84 /heart 85 /diamond 86 /club 87 /lessequal
88 /multiply 89 /percent 90 /infinity 48 /circlemultiply 49 /circleplus
50 /emptyset  51 /lozenge 52 /bullet 53 /arrowright 54 /arrowup
55 /arrowleft 56 /arrowdown 57 /arrowboth 48 /degree 44 /comma 43 /plus 45 /angle 42 /angleleft 47 /divide 61 /notequal 40 /equivalence 41 /second 97 /approxequal 98 /congruent 99 /perpendicular 100 /partialdiff 101 /florin 102 /intersection
 103 /union 104 /propersuperset 105 /reflexsuperset 106 /notsubset 107 /propersubset 108 /reflexsubset 109 /element 110 /notelement 111 /gradient 112 /logicaland 113 /logicalor 114 /arrowdblboth 115 /arrowdblleft 116 /arrowdblup 117 /arrowdblright
 118 /arrowdbldown 119 /ampersand 120 /omega1 121 /similar 122 /aleph ] def
/Symbol /Special accspe ReEncode
%%EndProlog
%%BeginSetup
%%EndSetup
newpath  gsave  .25 .25 scale  gsave  0 0 t black[  ] 0 sd 0 lw 1 1 1 c black 3 lw 0.999 0.999 0.999 c black 1814 1726 227 216 bl 0.999 0.999 0.999 c black 1814 1726 227 216 bl 0 lw 227 216 m 1814 X s 227 216 m 1726 Y s 6 lw 862 1787 m 236 X s
 gsave  2268 2158 0 0 C 1212 1756 t 0 r /Helvetica findfont 68.5801 sf 0 0 m (LO - MSSM) show NC gr  0.999 0.999 0.999 c black 227 216 m 90 X 366 Y 91 X 900 Y 91 X 367 Y 91 X -182 Y 90 X -409 Y 91 X -360 Y 91 X -249 Y 90 X -159 Y 91 X -100 Y 91 X
 -62 Y 91 X -39 Y 90 X -25 Y 91 X -16 Y 91 X -10 Y 90 X -7 Y 91 X -4 Y 91 X -4 Y 91 X -2 Y 90 X -1 Y 91 X s 0 1 0 c[ 4 8] 0 sd 9 lw 862 1718 m 236 X s black
 gsave  2268 2158 0 0 C 1212 1687 t 0 r /Helvetica findfont 68.5801 sf 0 0 m (NLO - MSSM) show NC gr  0 1 0 c 0.999 0.999 0.999 c black 0 1 0 c 227 216 m 90 X 282 Y 91 X 399 Y 91 X -85 Y 91 X -215 Y 90 X -187 Y 91 X -114 Y 91 X -56 Y 90 X -24 Y 1089
 X s 1 0 1 c[ 20 12 4 12] 0 sd 862 1649 m 236 X s black
 gsave  2268 2158 0 0 C 1879 1605 t 0 r /Helvetica findfont 45.7201 sf 0 0 m (A) show NC gr 
 gsave  2268 2158 0 0 C 1212 1641 t 0 r /Helvetica findfont 68.5801 sf 0 0 m (NLO - rescaled SM, S) show NC gr  1 0 1 c 0.999 0.999 0.999 c black 1 0 1 c 227 216 m 90 X 453 Y 91 X 946 Y 91 X 220 Y 91 X -266 Y 90 X -439 Y 91 X -336 Y 91 X -233 Y 90 X
 -151 Y 91 X -75 Y 91 X -39 Y 91 X -29 Y 90 X -19 Y 91 X -11 Y 91 X -8 Y 90 X -3 Y 91 X -4 Y 91 X -2 Y 91 X -2 Y 181 X s 1 0 0 c[ 12 12] 0 sd 862 1580 m 236 X s black
 gsave  2268 2158 0 0 C 1879 1536 t 0 r /Helvetica findfont 45.7201 sf 0 0 m (Z) show NC gr 
 gsave  2268 2158 0 0 C 1212 1573 t 0 r /Helvetica findfont 68.5801 sf 0 0 m (NLO - rescaled SM, S) show NC gr  1 0 0 c 0.999 0.999 0.999 c black 1 0 0 c 227 216 m 90 X 446 Y 91 X 930 Y 91 X 216 Y 91 X -261 Y 90 X -432 Y 91 X -331 Y 91 X -228 Y 90 X
 -149 Y 91 X -74 Y 91 X -38 Y 91 X -29 Y 90 X -19 Y 91 X -10 Y 91 X -8 Y 90 X -3 Y 91 X -4 Y 91 X -2 Y 91 X -2 Y 181 X s black[  ] 0 sd 0 lw 227 216 m 1726 Y s
 gsave  2268 2158 0 0 C 105 1687 t 90 r /Helvetica findfont 68.5801 sf 0 0 m (\(fb/GeV\)) show NC gr 
 gsave  2268 2158 0 0 C 146 1660 t 90 r /Helvetica findfont 45.7201 sf 0 0 m (T) show NC gr 
 gsave  2268 2158 0 0 C 78 1673 t 90 r /Helvetica findfont 32.0041 sf 0 0 m (1) show NC gr 
 gsave  2268 2158 0 0 C 50 1660 t 90 r /Helvetica findfont 45.7201 sf 0 0 m (j) show NC gr 
 gsave  2268 2158 0 0 C 105 1559 t 90 r /Helvetica findfont 68.5801 sf 0 0 m (/dp) show NC gr 
 gsave  2268 2158 0 0 C 105 1518 t 90 r /Symbol findfont 68.5801 sf 0 0 m (s) show NC gr 
 gsave  2268 2158 0 0 C 105 1463 t 90 r /Helvetica findfont 68.5801 sf 0 0 m (d ) show NC gr  281 216 m -54 X s 254 255 m -27 X s 254 294 m -27 X s 254 334 m -27 X s 281 373 m -54 X s 254 412 m -27 X s 254 451 m -27 X s 254 490 m -27 X s 281 530 m
 -54 X s 254 569 m -27 X s 254 608 m -27 X s 254 647 m -27 X s 281 687 m -54 X s 254 726 m -27 X s 254 765 m -27 X s 254 804 m -27 X s 281 844 m -54 X s 254 883 m -27 X s 254 922 m -27 X s 254 961 m -27 X s 281 1001 m -54 X s 254 1040 m -27 X s 254
 1079 m -27 X s 254 1118 m -27 X s 281 1157 m -54 X s 254 1197 m -27 X s 254 1236 m -27 X s 254 1275 m -27 X s 281 1314 m -54 X s 254 1354 m -27 X s 254 1393 m -27 X s 254 1432 m -27 X s 281 1471 m -54 X s 254 1511 m -27 X s 254 1550 m -27 X s 254
 1589 m -27 X s 281 1628 m -54 X s 254 1668 m -27 X s 254 1707 m -27 X s 254 1746 m -27 X s 281 1785 m -54 X s 254 1824 m -27 X s 254 1864 m -27 X s 254 1903 m -27 X s 281 1942 m -54 X s
 gsave  2268 2158 0 0 C 183 201 t 0 r /Helvetica findfont 41.1481 sf 0 0 m (0) show NC gr 
 gsave  2268 2158 0 0 C 101 357 t 0 r /Helvetica findfont 41.1481 sf 0 0 m (0.002) show NC gr 
 gsave  2268 2158 0 0 C 101 512 t 0 r /Helvetica findfont 41.1481 sf 0 0 m (0.004) show NC gr 
 gsave  2268 2158 0 0 C 101 672 t 0 r /Helvetica findfont 41.1481 sf 0 0 m (0.006) show NC gr 
 gsave  2268 2158 0 0 C 101 828 t 0 r /Helvetica findfont 41.1481 sf 0 0 m (0.008) show NC gr 
 gsave  2268 2158 0 0 C 133 983 t 0 r /Helvetica findfont 41.1481 sf 0 0 m (0.01) show NC gr 
 gsave  2268 2158 0 0 C 101 1143 t 0 r /Helvetica findfont 41.1481 sf 0 0 m (0.012) show NC gr 
 gsave  2268 2158 0 0 C 101 1298 t 0 r /Helvetica findfont 41.1481 sf 0 0 m (0.014) show NC gr 
 gsave  2268 2158 0 0 C 101 1454 t 0 r /Helvetica findfont 41.1481 sf 0 0 m (0.016) show NC gr 
 gsave  2268 2158 0 0 C 101 1614 t 0 r /Helvetica findfont 41.1481 sf 0 0 m (0.018) show NC gr 
 gsave  2268 2158 0 0 C 123 1769 t 0 r /Helvetica findfont 41.1481 sf 0 0 m (0.02) show NC gr 
 gsave  2268 2158 0 0 C 101 1925 t 0 r /Helvetica findfont 41.1481 sf 0 0 m (0.022) show NC gr  2041 216 m 1726 Y s 1987 216 m 54 X s 2014 255 m 27 X s 2014 294 m 27 X s 2014 334 m 27 X s 1987 373 m 54 X s 2014 412 m 27 X s 2014 451 m 27 X s 2014
 490 m 27 X s 1987 530 m 54 X s 2014 569 m 27 X s 2014 608 m 27 X s 2014 647 m 27 X s 1987 687 m 54 X s 2014 726 m 27 X s 2014 765 m 27 X s 2014 804 m 27 X s 1987 844 m 54 X s 2014 883 m 27 X s 2014 922 m 27 X s 2014 961 m 27 X s 1987 1001 m 54 X s
 2014 1040 m 27 X s 2014 1079 m 27 X s 2014 1118 m 27 X s 1987 1157 m 54 X s 2014 1197 m 27 X s 2014 1236 m 27 X s 2014 1275 m 27 X s 1987 1314 m 54 X s 2014 1354 m 27 X s 2014 1393 m 27 X s 2014 1432 m 27 X s 1987 1471 m 54 X s 2014 1511 m 27 X s
 2014 1550 m 27 X s 2014 1589 m 27 X s 1987 1628 m 54 X s 2014 1668 m 27 X s 2014 1707 m 27 X s 2014 1746 m 27 X s 1987 1785 m 54 X s 2014 1824 m 27 X s 2014 1864 m 27 X s 2014 1903 m 27 X s 1987 1942 m 54 X s 227 1942 m 1814 X s 227 1890 m 52 Y s
 272 1916 m 26 Y s 317 1916 m 26 Y s 363 1916 m 26 Y s 408 1916 m 26 Y s 454 1890 m 52 Y s 499 1916 m 26 Y s 544 1916 m 26 Y s 590 1916 m 26 Y s 635 1916 m 26 Y s 680 1890 m 52 Y s 726 1916 m 26 Y s 771 1916 m 26 Y s 816 1916 m 26 Y s 862 1916 m 26
 Y s 907 1890 m 52 Y s 952 1916 m 26 Y s 998 1916 m 26 Y s 1043 1916 m 26 Y s 1089 1916 m 26 Y s 1134 1890 m 52 Y s 1179 1916 m 26 Y s 1225 1916 m 26 Y s 1270 1916 m 26 Y s 1315 1916 m 26 Y s 1361 1890 m 52 Y s 1406 1916 m 26 Y s 1451 1916 m 26 Y s
 1497 1916 m 26 Y s 1542 1916 m 26 Y s 1587 1890 m 52 Y s 1633 1916 m 26 Y s 1678 1916 m 26 Y s 1723 1916 m 26 Y s 1769 1916 m 26 Y s 1814 1890 m 52 Y s 1860 1916 m 26 Y s 1905 1916 m 26 Y s 1950 1916 m 26 Y s 1996 1916 m 26 Y s 2041 1890 m 52 Y s
 227 216 m 1814 X s
 gsave  2268 2158 0 0 C 1824 41 t 0 r /Helvetica findfont 82.2962 sf 0 0 m (\(GeV\)) show NC gr 
 gsave  2268 2158 0 0 C 1788 0 t 0 r /Helvetica findfont 54.8641 sf 0 0 m (T) show NC gr 
 gsave  2268 2158 0 0 C 1801 69 t 0 r /Helvetica findfont 36.5761 sf 0 0 m (1) show NC gr 
 gsave  2268 2158 0 0 C 1788 101 t 0 r /Helvetica findfont 54.8641 sf 0 0 m (j) show NC gr 
 gsave  2268 2158 0 0 C 1742 41 t 0 r /Helvetica findfont 82.2962 sf 0 0 m (p) show NC gr  227 268 m -52 Y s 272 242 m -26 Y s 317 242 m -26 Y s 363 242 m -26 Y s 408 242 m -26 Y s 454 268 m -52 Y s 499 242 m -26 Y s 544 242 m -26 Y s 590 242 m -26
 Y s 635 242 m -26 Y s 680 268 m -52 Y s 726 242 m -26 Y s 771 242 m -26 Y s 816 242 m -26 Y s 862 242 m -26 Y s 907 268 m -52 Y s 952 242 m -26 Y s 998 242 m -26 Y s 1043 242 m -26 Y s 1089 242 m -26 Y s 1134 268 m -52 Y s 1179 242 m -26 Y s 1225
 242 m -26 Y s 1270 242 m -26 Y s 1315 242 m -26 Y s 1361 268 m -52 Y s 1406 242 m -26 Y s 1451 242 m -26 Y s 1497 242 m -26 Y s 1542 242 m -26 Y s 1587 268 m -52 Y s 1633 242 m -26 Y s 1678 242 m -26 Y s 1723 242 m -26 Y s 1769 242 m -26 Y s 1814
 268 m -52 Y s 1860 242 m -26 Y s 1905 242 m -26 Y s 1950 242 m -26 Y s 1996 242 m -26 Y s 2041 268 m -52 Y s
 gsave  2268 2158 0 0 C 210 169 t 0 r /Helvetica findfont 41.1481 sf 0 0 m (0) show NC gr 
 gsave  2268 2158 0 0 C 430 169 t 0 r /Helvetica findfont 41.1481 sf 0 0 m (50) show NC gr 
 gsave  2268 2158 0 0 C 640 169 t 0 r /Helvetica findfont 41.1481 sf 0 0 m (100) show NC gr 
 gsave  2268 2158 0 0 C 869 169 t 0 r /Helvetica findfont 41.1481 sf 0 0 m (150) show NC gr 
 gsave  2268 2158 0 0 C 1097 169 t 0 r /Helvetica findfont 41.1481 sf 0 0 m (200) show NC gr 
 gsave  2268 2158 0 0 C 1321 169 t 0 r /Helvetica findfont 41.1481 sf 0 0 m (250) show NC gr 
 gsave  2268 2158 0 0 C 1550 169 t 0 r /Helvetica findfont 41.1481 sf 0 0 m (300) show NC gr 
 gsave  2268 2158 0 0 C 1774 169 t 0 r /Helvetica findfont 41.1481 sf 0 0 m (350) show NC gr 
 gsave  2268 2158 0 0 C 2003 169 t 0 r /Helvetica findfont 41.1481 sf 0 0 m (400) show NC gr 
 gr  gr 
showpage
end
%%EOF
