%!PS-Adobe-2.0 EPSF-2.0
%%BoundingBox:  0 0 567 384
%%Title: yH.eps: yH
%%Creator: ROOT Version 5.27/06b
%%CreationDate: Fri Dec  9 13:48:19 2011
%%EndComments
%%BeginProlog
80 dict begin
/s {stroke} def /l {lineto} def /m {moveto} def /t {translate} def
/r {rotate} def /rl {roll}  def /R {repeat} def
/d {rlineto} def /rm {rmoveto} def /gr {grestore} def /f {eofill} def
/c {setrgbcolor} def /black {0 setgray} def /sd {setdash} def
/cl {closepath} def /sf {scalefont setfont} def /lw {setlinewidth} def
/box {m dup 0 exch d exch 0 d 0 exch neg d cl} def
/NC{systemdict begin initclip end}def/C{NC box clip newpath}def
/bl {box s} def /bf {box f} def /Y { 0 exch d} def /X { 0 d} def 
/K {{pop pop 0 moveto} exch kshow} bind def
/ita {/ang 15 def gsave [1 0 ang dup sin exch cos div 1 0 0] concat} def 
/mp {newpath /y exch def /x exch def} def
/side {[w .77 mul w .23 mul] .385 w mul sd w 0 l currentpoint t -144 r} def
/mr {mp x y w2 0 360 arc} def /m24 {mr s} def /m20 {mr f} def
/mb {mp x y w2 add m w2 neg 0 d 0 w neg d w 0 d 0 w d cl} def
/mt {mp x y w2 add m w2 neg w neg d w 0 d cl} def
/m21 {mb f} def /m25 {mb s} def /m22 {mt f} def /m26{mt s} def
/m23 {mp x y w2 sub m w2 w d w neg 0 d cl f} def
/m27 {mp x y w2 add m w3 neg w2 neg d w3 w2 neg d w3 w2 d cl s} def
/m28 {mp x w2 sub y w2 sub w3 add m w3 0 d  0 w3 neg d w3 0 d 0 w3 d w3 0 d  0 w3 d w3 neg 0 d 0 w3 d w3 neg 0 d 0 w3 neg d w3 neg 0 d cl s } def
/m29 {mp gsave x w2 sub y w2 add w3 sub m currentpoint t 4 {side} repeat cl fill gr} def
/m30 {mp gsave x w2 sub y w2 add w3 sub m currentpoint t 4 {side} repeat cl s gr} def
/m31 {mp x y w2 sub m 0 w d x w2 sub y m w 0 d x w2 sub y w2 add m w w neg d x w2 sub y w2 sub m w w d s} def
/m32 {mp x y w2 sub m w2 w d w neg 0 d cl s} def
/m33 {mp x y w2 add m w3 neg w2 neg d w3 w2 neg d w3 w2 d cl f} def
/m34 {mp x w2 sub y w2 sub w3 add m w3 0 d  0 w3 neg d w3 0 d 0 w3 d w3 0 d  0 w3 d w3 neg 0 d 0 w3 d w3 neg 0 d 0 w3 neg d w3 neg 0 d cl f } def
/m2 {mp x y w2 sub m 0 w d x w2 sub y m w 0 d s} def
/m5 {mp x w2 sub y w2 sub m w w d x w2 sub y w2 add m w w neg d s} def
/reEncode {exch findfont dup length dict begin {1 index /FID eq  {pop pop} {def} ifelse } forall /Encoding exch def currentdict end dup /FontName get exch definefont pop } def [/Times-Bold /Times-Italic /Times-BoldItalic /Helvetica /Helvetica-Oblique
 /Helvetica-Bold /Helvetica-BoldOblique /Courier /Courier-Oblique /Courier-Bold /Courier-BoldOblique /Times-Roman /AvantGarde-Book /AvantGarde-BookOblique /AvantGarde-Demi /AvantGarde-DemiOblique /Bookman-Demi /Bookman-DemiItalic /Bookman-Light
 /Bookman-LightItalic /Helvetica-Narrow /Helvetica-Narrow-Bold /Helvetica-Narrow-BoldOblique /Helvetica-Narrow-Oblique /NewCenturySchlbk-Roman /NewCenturySchlbk-Bold /NewCenturySchlbk-BoldItalic /NewCenturySchlbk-Italic /Palatino-Bold
 /Palatino-BoldItalic /Palatino-Italic /Palatino-Roman ] {ISOLatin1Encoding reEncode } forall%%EndProlog
%%BeginSetup
%%EndSetup
newpath  gsave  .25 .25 scale  gsave  0 0 t black[  ] 0 sd 3 lw 1 1 1 c 2268 1538 0 0 bf black 1 1 1 c 1791 1215 363 246 bf black 1791 1215 363 246 bl 1 0 0 c 6 lw 1 1 1 c black 1 0 0 c 423 1338 m 20 Y s 423 1384 m 19 Y s 3 lw black /w 31 def /w2 {w
 2 div} def /w3 {w 3 div} def 423 1371 m20 6 lw 1 0 0 c 542 1298 m 18 Y s 542 1342 m 17 Y s 3 lw black 542 1329 m20 6 lw 1 0 0 c 661 1160 m 14 Y s 661 1200 m 14 Y s 3 lw black 661 1187 m20 6 lw 1 0 0 c 781 981 m 13 Y s 781 1020 m 14 Y s 3 lw black
 781 1007 m20 6 lw 1 0 0 c 900 790 m 9 Y s 900 825 m 10 Y s 3 lw black 900 812 m20 6 lw 1 0 0 c 1020 595 m 10 Y s 1020 631 m 10 Y s 3 lw black 1020 618 m20 6 lw 1 0 0 c 1139 430 m 6 Y s 1139 462 m 7 Y s 3 lw black 1139 449 m20 6 lw 3 lw 1259 364 m20
 6 lw 3 lw 1378 315 m20 6 lw 3 lw 1497 303 m20 6 lw 3 lw 1617 301 m20 6 lw 1 0 0 c 1 1 1 c black 1 0 0 c 363 1371 m 119 X -42 Y 120 X -142 Y 119 X -180 Y 120 X -195 Y 119 X -194 Y 119 X -169 Y 120 X -85 Y 119 X -49 Y 120 X -12 Y 119 X -2 Y 597 X s
 black 3 lw 363 246 m 1791 X s
 gsave  2268 1538 0 0 C 1717.25 87.6875 t 0 r /Helvetica findfont 71.6807 sf 0 0 m (Higgs rapidity) show NC gr  363 283 m -37 Y s 411 264 m -18 Y s 458 264 m -18 Y s 506 264 m -18 Y s 554 264 m -18 Y s 602 283 m -37 Y s 649 264 m -18 Y s 697 264 m
 -18 Y s 745 264 m -18 Y s 793 264 m -18 Y s 841 283 m -37 Y s 888 264 m -18 Y s 936 264 m -18 Y s 984 264 m -18 Y s 1032 264 m -18 Y s 1079 283 m -37 Y s 1127 264 m -18 Y s 1175 264 m -18 Y s 1223 264 m -18 Y s 1271 264 m -18 Y s 1318 283 m -37 Y s
 1366 264 m -18 Y s 1414 264 m -18 Y s 1462 264 m -18 Y s 1509 264 m -18 Y s 1557 283 m -37 Y s 1605 264 m -18 Y s 1653 264 m -18 Y s 1700 264 m -18 Y s 1748 264 m -18 Y s 1796 283 m -37 Y s 1844 264 m -18 Y s 1892 264 m -18 Y s 1939 264 m -18 Y s
 1987 264 m -18 Y s 2035 283 m -37 Y s 2035 283 m -37 Y s 2083 264 m -18 Y s 2130 264 m -18 Y s
 gsave  2268 1538 0 0 C 342.25 178.938 t 0 r /Helvetica findfont 71.6807 sf 0 0 m (0) show NC gr 
 gsave  2268 1538 0 0 C 550.812 178.938 t 0 r /Helvetica findfont 71.6807 sf 0 0 m (0.5) show NC gr 
 gsave  2268 1538 0 0 C 821.25 178.938 t 0 r /Helvetica findfont 71.6807 sf 0 0 m (1) show NC gr 
 gsave  2268 1538 0 0 C 1029.75 178.938 t 0 r /Helvetica findfont 71.6807 sf 0 0 m (1.5) show NC gr 
 gsave  2268 1538 0 0 C 1296.94 178.938 t 0 r /Helvetica findfont 71.6807 sf 0 0 m (2) show NC gr 
 gsave  2268 1538 0 0 C 1505.44 178.938 t 0 r /Helvetica findfont 71.6807 sf 0 0 m (2.5) show NC gr 
 gsave  2268 1538 0 0 C 1775.88 178.938 t 0 r /Helvetica findfont 71.6807 sf 0 0 m (3) show NC gr 
 gsave  2268 1538 0 0 C 1984.44 178.938 t 0 r /Helvetica findfont 71.6807 sf 0 0 m (3.5) show NC gr  363 1461 m 1791 X s 363 1425 m 36 Y s 411 1443 m 18 Y s 458 1443 m 18 Y s 506 1443 m 18 Y s 554 1443 m 18 Y s 602 1425 m 36 Y s 649 1443 m 18 Y s 697
 1443 m 18 Y s 745 1443 m 18 Y s 793 1443 m 18 Y s 841 1425 m 36 Y s 888 1443 m 18 Y s 936 1443 m 18 Y s 984 1443 m 18 Y s 1032 1443 m 18 Y s 1079 1425 m 36 Y s 1127 1443 m 18 Y s 1175 1443 m 18 Y s 1223 1443 m 18 Y s 1271 1443 m 18 Y s 1318 1425 m
 36 Y s 1366 1443 m 18 Y s 1414 1443 m 18 Y s 1462 1443 m 18 Y s 1509 1443 m 18 Y s 1557 1425 m 36 Y s 1605 1443 m 18 Y s 1653 1443 m 18 Y s 1700 1443 m 18 Y s 1748 1443 m 18 Y s 1796 1425 m 36 Y s 1844 1443 m 18 Y s 1892 1443 m 18 Y s 1939 1443 m 18
 Y s 1987 1443 m 18 Y s 2035 1425 m 36 Y s 2035 1425 m 36 Y s 2083 1443 m 18 Y s 2130 1443 m 18 Y s 363 246 m 1215 Y s
 gsave  2268 1538 0 0 C 172.875 755.562 t 90 r /Helvetica findfont 71.6807 sf 0 0 m (arbitrary normalization) show NC gr  417 301 m -54 X s 390 349 m -27 X s 390 396 m -27 X s 390 444 m -27 X s 390 491 m -27 X s 417 538 m -54 X s 390 586 m -27 X s
 390 633 m -27 X s 390 681 m -27 X s 390 728 m -27 X s 417 775 m -54 X s 390 823 m -27 X s 390 870 m -27 X s 390 918 m -27 X s 390 965 m -27 X s 417 1013 m -54 X s 390 1060 m -27 X s 390 1107 m -27 X s 390 1155 m -27 X s 390 1202 m -27 X s 417 1250 m
 -54 X s 417 301 m -54 X s 390 254 m -27 X s 417 1250 m -54 X s 390 1297 m -27 X s 390 1344 m -27 X s 390 1392 m -27 X s 390 1439 m -27 X s
 gsave  2268 1538 0 0 C 309.75 276.688 t 0 r /Helvetica findfont 71.6807 sf 0 0 m (0) show NC gr 
 gsave  2268 1538 0 0 C 212 514.438 t 0 r /Helvetica findfont 71.6807 sf 0 0 m (0.05) show NC gr 
 gsave  2268 1538 0 0 C 260.875 752.312 t 0 r /Helvetica findfont 71.6807 sf 0 0 m (0.1) show NC gr 
 gsave  2268 1538 0 0 C 212 986.875 t 0 r /Helvetica findfont 71.6807 sf 0 0 m (0.15) show NC gr 
 gsave  2268 1538 0 0 C 251.125 1224.75 t 0 r /Helvetica findfont 71.6807 sf 0 0 m (0.2) show NC gr  2154 246 m 1215 Y s 2101 301 m 53 X s 2127 349 m 27 X s 2127 396 m 27 X s 2127 444 m 27 X s 2127 491 m 27 X s 2101 538 m 53 X s 2127 586 m 27 X s
 2127 633 m 27 X s 2127 681 m 27 X s 2127 728 m 27 X s 2101 775 m 53 X s 2127 823 m 27 X s 2127 870 m 27 X s 2127 918 m 27 X s 2127 965 m 27 X s 2101 1013 m 53 X s 2127 1060 m 27 X s 2127 1107 m 27 X s 2127 1155 m 27 X s 2127 1202 m 27 X s 2101 1250
 m 53 X s 2101 301 m 53 X s 2127 254 m 27 X s 2101 1250 m 53 X s 2127 1297 m 27 X s 2127 1344 m 27 X s 2127 1392 m 27 X s 2127 1439 m 27 X s 6 lw 1 1 1 c black 363 1334 m 119 X -64 Y 120 X -110 Y 119 X -166 Y 120 X -176 Y 119 X -178 Y 119 X -143 Y
 120 X -102 Y 119 X -62 Y 120 X -23 Y 119 X -6 Y 120 X -1 Y 119 X -1 Y 358 X s 0 0 1 c[  12 12 ] 0 sd 1 1 1 c black 0 0 1 c 363 1326 m 119 X -61 Y 120 X -108 Y 119 X -163 Y 120 X -174 Y 119 X -175 Y 119 X -144 Y 120 X -103 Y 119 X -64 Y 120 X -24 Y
 119 X -6 Y 120 X -1 Y 119 X -1 Y 358 X s black
 gsave  2268 1538 0 0 C 2199.44 1123.75 t 90 r /Helvetica-BoldOblique findfont 29.3239 sf 0 0 m 
 317 303 287 271 263 240 213 205 186 167 159 140 118 95 87 67 59 38 17
(LHC HIGGS XS WG 2011) K NC gr 
 gr  gr showpage
end
%%EOF
