%!PS-Adobe-2.0 EPSF-2.0
%%BoundingBox:  0 0 567 384
%%Title: plots/GenHiggsPt_Powheg_v_Pythia.150GeV.gg.cut2.eps: c1
%%Creator: ROOT Version 5.28/00b
%%CreationDate: Sun Dec  4 23:59:33 2011
%%EndComments
%%BeginProlog
80 dict begin
/s {stroke} def /l {lineto} def /m {moveto} def /t {translate} def
/r {rotate} def /rl {roll}  def /R {repeat} def
/d {rlineto} def /rm {rmoveto} def /gr {grestore} def /f {eofill} def
/c {setrgbcolor} def /black {0 setgray} def /sd {setdash} def
/cl {closepath} def /sf {scalefont setfont} def /lw {setlinewidth} def
/box {m dup 0 exch d exch 0 d 0 exch neg d cl} def
/NC{systemdict begin initclip end}def/C{NC box clip newpath}def
/bl {box s} def /bf {box f} def /Y { 0 exch d} def /X { 0 d} def 
/K {{pop pop 0 moveto} exch kshow} bind def
/ita {/ang 15 def gsave [1 0 ang dup sin exch cos div 1 0 0] concat} def 
/mp {newpath /y exch def /x exch def} def
/side {[w .77 mul w .23 mul] .385 w mul sd w 0 l currentpoint t -144 r} def
/mr {mp x y w2 0 360 arc} def /m24 {mr s} def /m20 {mr f} def
/mb {mp x y w2 add m w2 neg 0 d 0 w neg d w 0 d 0 w d cl} def
/mt {mp x y w2 add m w2 neg w neg d w 0 d cl} def
/m21 {mb f} def /m25 {mb s} def /m22 {mt f} def /m26{mt s} def
/m23 {mp x y w2 sub m w2 w d w neg 0 d cl f} def
/m27 {mp x y w2 add m w3 neg w2 neg d w3 w2 neg d w3 w2 d cl s} def
/m28 {mp x w2 sub y w2 sub w3 add m w3 0 d  0 w3 neg d w3 0 d 0 w3 d w3 0 d  0 w3 d w3 neg 0 d 0 w3 d w3 neg 0 d 0 w3 neg d w3 neg 0 d cl s } def
/m29 {mp gsave x w2 sub y w2 add w3 sub m currentpoint t 4 {side} repeat cl fill gr} def
/m30 {mp gsave x w2 sub y w2 add w3 sub m currentpoint t 4 {side} repeat cl s gr} def
/m31 {mp x y w2 sub m 0 w d x w2 sub y m w 0 d x w2 sub y w2 add m w w neg d x w2 sub y w2 sub m w w d s} def
/m32 {mp x y w2 sub m w2 w d w neg 0 d cl s} def
/m33 {mp x y w2 add m w3 neg w2 neg d w3 w2 neg d w3 w2 d cl f} def
/m34 {mp x w2 sub y w2 sub w3 add m w3 0 d  0 w3 neg d w3 0 d 0 w3 d w3 0 d  0 w3 d w3 neg 0 d 0 w3 d w3 neg 0 d 0 w3 neg d w3 neg 0 d cl f } def
/m2 {mp x y w2 sub m 0 w d x w2 sub y m w 0 d s} def
/m5 {mp x w2 sub y w2 sub m w w d x w2 sub y w2 add m w w neg d s} def
/reEncode {exch findfont dup length dict begin {1 index /FID eq  {pop pop} {def} ifelse } forall /Encoding exch def currentdict end dup /FontName get exch definefont pop } def [/Times-Bold /Times-Italic /Times-BoldItalic /Helvetica /Helvetica-Oblique
 /Helvetica-Bold /Helvetica-BoldOblique /Courier /Courier-Oblique /Courier-Bold /Courier-BoldOblique /Times-Roman /AvantGarde-Book /AvantGarde-BookOblique /AvantGarde-Demi /AvantGarde-DemiOblique /Bookman-Demi /Bookman-DemiItalic /Bookman-Light
 /Bookman-LightItalic /Helvetica-Narrow /Helvetica-Narrow-Bold /Helvetica-Narrow-BoldOblique /Helvetica-Narrow-Oblique /NewCenturySchlbk-Roman /NewCenturySchlbk-Bold /NewCenturySchlbk-BoldItalic /NewCenturySchlbk-Italic /Palatino-Bold
 /Palatino-BoldItalic /Palatino-Italic /Palatino-Roman ] {ISOLatin1Encoding reEncode } forall%%EndProlog
%%BeginSetup
%%EndSetup
newpath  gsave  .25 .25 scale  gsave  0 0 t black[  ] 0 sd 3 lw 1 1 1 c 2268 1538 0 0 bf black 1 1 1 c 1791 1215 363 246 bf black 1791 1215 363 246 bl 6 lw 1 1 1 c black 363 710 m 15 X 693 Y 15 X -2 Y 15 X -111 Y 15 X -153 Y 14 X -125 Y 15 X -103 Y
 15 X -162 Y 15 X -39 Y 15 X -67 Y 15 X -74 Y 15 X -28 Y 15 X -50 Y 15 X -26 Y 15 X -24 Y 15 X -37 Y 15 X -1 Y 15 X -20 Y 15 X -15 Y 14 X -18 Y 15 X -6 Y 15 X -18 Y 15 X -7 Y 15 X -7 Y 15 X -2 Y 15 X -25 Y 15 X 3 Y 15 X 5 Y 30 X -8 Y 15 X -3 Y 15 X
 -12 Y 29 X 5 Y 15 X -9 Y 15 X -2 Y 15 X -9 Y 15 X 7 Y 15 X 1 Y 15 X -6 Y 15 X 3 Y 15 X -3 Y 15 X 4 Y 15 X -3 Y 15 X -1 Y 30 X 2 Y 15 X -3 Y 14 X -2 Y 45 X -1 Y 15 X 4 Y 15 X 1 Y 15 X -4 Y 15 X -4 Y 30 X 1 Y 15 X 1 Y 15 X -2 Y 15 X 1 Y 15 X 1 Y 14 X
 -3 Y 15 X 1 Y 15 X 1 Y 15 X -3 Y 15 X 3 Y 15 X -2 Y 15 X 1 Y 90 X -2 Y 15 X 2 Y 14 X -1 Y 15 X -1 Y 15 X 1 Y 30 X 1 Y 15 X -2 Y 45 X 1 Y 15 X -1 Y 15 X 1 Y 15 X -1 Y 15 X 1 Y 15 X -1 Y 14 X 1 Y 15 X -1 Y 30 X 1 Y 15 X -1 Y 90 X 1 Y 15 X -1 Y 164 X 1
 Y 15 X -1 Y 104 X s 3 lw 363 246 m 1791 X s
 gsave  2268 1538 0 0 C 1518.5 114.062 t 0 r /Helvetica findfont 71.6807 sf 0 0 m (Gen Higgs pT \(GeV\)) show NC gr  363 283 m -37 Y s 423 264 m -18 Y s 482 264 m -18 Y s 542 264 m -18 Y s 602 264 m -18 Y s 661 283 m -37 Y s 721 264 m -18 Y s 781 264
 m -18 Y s 841 264 m -18 Y s 900 264 m -18 Y s 960 283 m -37 Y s 1020 264 m -18 Y s 1079 264 m -18 Y s 1139 264 m -18 Y s 1199 264 m -18 Y s 1259 283 m -37 Y s 1318 264 m -18 Y s 1378 264 m -18 Y s 1438 264 m -18 Y s 1497 264 m -18 Y s 1557 283 m -37
 Y s 1617 264 m -18 Y s 1677 264 m -18 Y s 1736 264 m -18 Y s 1796 264 m -18 Y s 1856 283 m -37 Y s 1915 264 m -18 Y s 1975 264 m -18 Y s 2035 264 m -18 Y s 2095 264 m -18 Y s 2154 283 m -37 Y s
 gsave  2268 1538 0 0 C 342.25 179.188 t 0 r /Helvetica findfont 71.6807 sf 0 0 m (0) show NC gr 
 gsave  2268 1538 0 0 C 602.938 179.188 t 0 r /Helvetica findfont 71.6807 sf 0 0 m (100) show NC gr 
 gsave  2268 1538 0 0 C 899.438 179.188 t 0 r /Helvetica findfont 71.6807 sf 0 0 m (200) show NC gr 
 gsave  2268 1538 0 0 C 1199.19 179.188 t 0 r /Helvetica findfont 71.6807 sf 0 0 m (300) show NC gr 
 gsave  2268 1538 0 0 C 1495.69 179.188 t 0 r /Helvetica findfont 71.6807 sf 0 0 m (400) show NC gr 
 gsave  2268 1538 0 0 C 1795.44 179.188 t 0 r /Helvetica findfont 71.6807 sf 0 0 m (500) show NC gr 
 gsave  2268 1538 0 0 C 2095.19 179.188 t 0 r /Helvetica findfont 71.6807 sf 0 0 m (600) show NC gr  363 1461 m 1791 X s 363 1425 m 36 Y s 423 1443 m 18 Y s 482 1443 m 18 Y s 542 1443 m 18 Y s 602 1443 m 18 Y s 661 1425 m 36 Y s 721 1443 m 18 Y s 781
 1443 m 18 Y s 841 1443 m 18 Y s 900 1443 m 18 Y s 960 1425 m 36 Y s 1020 1443 m 18 Y s 1079 1443 m 18 Y s 1139 1443 m 18 Y s 1199 1443 m 18 Y s 1259 1425 m 36 Y s 1318 1443 m 18 Y s 1378 1443 m 18 Y s 1438 1443 m 18 Y s 1497 1443 m 18 Y s 1557 1425
 m 36 Y s 1617 1443 m 18 Y s 1677 1443 m 18 Y s 1736 1443 m 18 Y s 1796 1443 m 18 Y s 1856 1425 m 36 Y s 1915 1443 m 18 Y s 1975 1443 m 18 Y s 2035 1443 m 18 Y s 2095 1443 m 18 Y s 2154 1425 m 36 Y s 363 246 m 1215 Y s
 gsave  2268 1538 0 0 C 127.312 697.188 t 90 r /Helvetica findfont 71.6807 sf 0 0 m (arbitrary units) show NC gr  417 246 m -54 X s 390 298 m -27 X s 390 350 m -27 X s 390 402 m -27 X s 417 454 m -54 X s 390 505 m -27 X s 390 557 m -27 X
 s 390 609 m -27 X s 417 661 m -54 X s 390 713 m -27 X s 390 765 m -27 X s 390 817 m -27 X s 417 868 m -54 X s 390 920 m -27 X s 390 972 m -27 X s 390 1024 m -27 X s 417 1076 m -54 X s 390 1128 m -27 X s 390 1180 m -27 X s 390 1231 m -27 X s 417 1283
 m -54 X s 417 1283 m -54 X s 390 1335 m -27 X s 390 1387 m -27 X s 390 1439 m -27 X s
 gsave  2268 1538 0 0 C 309.75 221.562 t 0 r /Helvetica findfont 71.6807 sf 0 0 m (0) show NC gr 
 gsave  2268 1538 0 0 C 212 430 t 0 r /Helvetica findfont 71.6807 sf 0 0 m (0.02) show NC gr 
 gsave  2268 1538 0 0 C 212 635.312 t 0 r /Helvetica findfont 71.6807 sf 0 0 m (0.04) show NC gr 
 gsave  2268 1538 0 0 C 212 843.812 t 0 r /Helvetica findfont 71.6807 sf 0 0 m (0.06) show NC gr 
 gsave  2268 1538 0 0 C 212 1052.38 t 0 r /Helvetica findfont 71.6807 sf 0 0 m (0.08) show NC gr 
 gsave  2268 1538 0 0 C 260.875 1257.62 t 0 r /Helvetica findfont 71.6807 sf 0 0 m (0.1) show NC gr  2154 246 m 1215 Y s 2101 246 m 53 X s 2127 298 m 27 X s 2127 350 m 27 X s 2127 402 m 27 X s 2101 454 m 53 X s 2127 505 m 27 X s 2127 557 m 27 X s
 2127 609 m 27 X s 2101 661 m 53 X s 2127 713 m 27 X s 2127 765 m 27 X s 2127 817 m 27 X s 2101 868 m 53 X s 2127 920 m 27 X s 2127 972 m 27 X s 2127 1024 m 27 X s 2101 1076 m 53 X s 2127 1128 m 27 X s 2127 1180 m 27 X s 2127 1231 m 27 X s 2101 1283
 m 53 X s 2101 1283 m 53 X s 2127 1335 m 27 X s 2127 1387 m 27 X s 2127 1439 m 27 X s 1 0 0 c 6 lw 1 1 1 c black 1 0 0 c 363 710 m 15 X 577 Y 15 X 128 Y 15 X -136 Y 15 X -149 Y 14 X -129 Y 15 X -137 Y 15 X -97 Y 15 X -66 Y 15 X -77 Y 15 X -26 Y 15 X
 -67 Y 15 X -33 Y 15 X -35 Y 15 X -18 Y 15 X -21 Y 15 X -37 Y 15 X -3 Y 15 X -26 Y 14 X -6 Y 15 X -17 Y 30 X -8 Y 15 X -4 Y 15 X -21 Y 15 X -2 Y 15 X -8 Y 15 X -2 Y 30 X -4 Y 15 X -1 Y 15 X -10 Y 15 X 5 Y 14 X -9 Y 15 X 1 Y 15 X -4 Y 30 X -3 Y 15 X
 -3 Y 15 X -1 Y 15 X -1 Y 15 X 2 Y 15 X -3 Y 15 X -1 Y 15 X 1 Y 15 X -1 Y 15 X -3 Y 15 X -4 Y 14 X 5 Y 15 X -2 Y 45 X -1 Y 15 X -2 Y 15 X -1 Y 15 X 1 Y 30 X -1 Y 30 X -1 Y 30 X -2 Y 14 X 2 Y 45 X -1 Y 15 X -1 Y 15 X 1 Y 15 X -1 Y 90 X -1 Y 15 X 2 Y
 14 X -1 Y 30 X 1 Y 15 X -1 Y 105 X -1 Y 15 X 1 Y 104 X -1 Y 15 X 1 Y 15 X -1 Y 30 X 1 Y 30 X -1 Y 15 X 1 Y 30 X -1 Y 89 X 1 Y 30 X -1 Y 30 X 1 Y 15 X -1 Y 15 X 1 Y 15 X -1 Y 44 X 1 Y 15 X s black
 gsave  2268 1538 0 0 C 1798.69 1313 t 0 r /Helvetica findfont 52.1314 sf 0 0 m ( H\(150GeV\)) show NC gr 
 gsave  2268 1538 0 0 C 1746.56 1313 t 0 r /Helvetica findfont 52.1314 sf 0 0 m ( to ) show NC gr 
 gsave  2268 1538 0 0 C 1472.88 1313 t 0 r /Helvetica findfont 52.1314 sf 0 0 m ( Powheg gg) show NC gr  1281 1326 m 159 X s
 gsave  2268 1538 0 0 C 1798.69 1195.69 t 0 r /Helvetica findfont 52.1314 sf 0 0 m ( H\(150GeV\)) show NC gr 
 gsave  2268 1538 0 0 C 1746.56 1195.69 t 0 r /Helvetica findfont 52.1314 sf 0 0 m ( to ) show NC gr 
 gsave  2268 1538 0 0 C 1472.88 1195.69 t 0 r /Helvetica findfont 52.1314 sf 0 0 m ( Pythia    gg) show NC gr  1 0 0 c 1281 1211 m 159 X s black
 gsave  2268 1538 0 0 C 2222.25 1117.5 t 90 r /Helvetica-BoldOblique findfont 29.3239 sf 0 0 m 
 317 303 287 271 263 240 213 205 186 167 159 140 118 95 87 67 59 38 17
(LHC HIGGS XS WG 2011) K NC gr 
 gr  gr showpage
end
%%EOF
