%!PS-Adobe-2.0 EPSF-2.0
%%BoundingBox:  0 0 567 362
%%Title: Results/m120/POWHEG.njet-mstw2008.eps: VBF - HAWK
%%Creator: ROOT Version 5.28/00c
%%CreationDate: Fri Nov 25 16:16:32 2011
%%EndComments
%%BeginProlog
80 dict begin
/s {stroke} def /l {lineto} def /m {moveto} def /t {translate} def
/r {rotate} def /rl {roll}  def /R {repeat} def
/d {rlineto} def /rm {rmoveto} def /gr {grestore} def /f {eofill} def
/c {setrgbcolor} def /black {0 setgray} def /sd {setdash} def
/cl {closepath} def /sf {scalefont setfont} def /lw {setlinewidth} def
/box {m dup 0 exch d exch 0 d 0 exch neg d cl} def
/NC{systemdict begin initclip end}def/C{NC box clip newpath}def
/bl {box s} def /bf {box f} def /Y { 0 exch d} def /X { 0 d} def 
/K {{pop pop 0 moveto} exch kshow} bind def
/ita {/ang 15 def gsave [1 0 ang dup sin exch cos div 1 0 0] concat} def 
/mp {newpath /y exch def /x exch def} def
/side {[w .77 mul w .23 mul] .385 w mul sd w 0 l currentpoint t -144 r} def
/mr {mp x y w2 0 360 arc} def /m24 {mr s} def /m20 {mr f} def
/mb {mp x y w2 add m w2 neg 0 d 0 w neg d w 0 d 0 w d cl} def
/mt {mp x y w2 add m w2 neg w neg d w 0 d cl} def
/m21 {mb f} def /m25 {mb s} def /m22 {mt f} def /m26{mt s} def
/m23 {mp x y w2 sub m w2 w d w neg 0 d cl f} def
/m27 {mp x y w2 add m w3 neg w2 neg d w3 w2 neg d w3 w2 d cl s} def
/m28 {mp x w2 sub y w2 sub w3 add m w3 0 d  0 w3 neg d w3 0 d 0 w3 d w3 0 d  0 w3 d w3 neg 0 d 0 w3 d w3 neg 0 d 0 w3 neg d w3 neg 0 d cl s } def
/m29 {mp gsave x w2 sub y w2 add w3 sub m currentpoint t 4 {side} repeat cl fill gr} def
/m30 {mp gsave x w2 sub y w2 add w3 sub m currentpoint t 4 {side} repeat cl s gr} def
/m31 {mp x y w2 sub m 0 w d x w2 sub y m w 0 d x w2 sub y w2 add m w w neg d x w2 sub y w2 sub m w w d s} def
/m32 {mp x y w2 sub m w2 w d w neg 0 d cl s} def
/m33 {mp x y w2 add m w3 neg w2 neg d w3 w2 neg d w3 w2 d cl f} def
/m34 {mp x w2 sub y w2 sub w3 add m w3 0 d  0 w3 neg d w3 0 d 0 w3 d w3 0 d  0 w3 d w3 neg 0 d 0 w3 d w3 neg 0 d 0 w3 neg d w3 neg 0 d cl f } def
/m2 {mp x y w2 sub m 0 w d x w2 sub y m w 0 d s} def
/m5 {mp x w2 sub y w2 sub m w w d x w2 sub y w2 add m w w neg d s} def
/reEncode {exch findfont dup length dict begin {1 index /FID eq  {pop pop} {def} ifelse } forall /Encoding exch def currentdict end dup /FontName get exch definefont pop } def [/Times-Bold /Times-Italic /Times-BoldItalic /Helvetica /Helvetica-Oblique
 /Helvetica-Bold /Helvetica-BoldOblique /Courier /Courier-Oblique /Courier-Bold /Courier-BoldOblique /Times-Roman /AvantGarde-Book /AvantGarde-BookOblique /AvantGarde-Demi /AvantGarde-DemiOblique /Bookman-Demi /Bookman-DemiItalic /Bookman-Light
 /Bookman-LightItalic /Helvetica-Narrow /Helvetica-Narrow-Bold /Helvetica-Narrow-BoldOblique /Helvetica-Narrow-Oblique /NewCenturySchlbk-Roman /NewCenturySchlbk-Bold /NewCenturySchlbk-BoldItalic /NewCenturySchlbk-Italic /Palatino-Bold
 /Palatino-BoldItalic /Palatino-Italic /Palatino-Roman ] {ISOLatin1Encoding reEncode } forall%%EndProlog
%%BeginSetup
%%EndSetup
newpath  gsave  .25 .25 scale  gsave  0 0 t black[  ] 0 sd 3 lw 1 1 1 c 2268 1448 0 0 bf black 1 1 1 c 1814 1158 227 145 bf black 1814 1158 227 145 bl 1 1 1 c 1814 1158 227 145 bf black 1814 1158 227 145 bl 0.8 0 0 c[  12 12 ] 0 sd 6 lw 1 1 1 c black
 0.8 0 0 c 227 1242 m 363 X -233 Y 362 X -170 Y 363 X -191 Y 363 X -185 Y 363 X s black[  ] 0 sd 3 lw 227 145 m 1814 X s
 gsave  2268 1448 0 0 C 1913.39 25.3093 t 0 r /Helvetica findfont 60.7424 sf 0 0 m (njets) show NC gr  227 180 m -35 Y s 263 162 m -17 Y s 299 162 m -17 Y s 336 162 m -17 Y s 372 162 m -17 Y s 408 180 m -35 Y s 444 162 m -17 Y s 481 162 m -17 Y s 517
 162 m -17 Y s 553 162 m -17 Y s 590 180 m -35 Y s 626 162 m -17 Y s 662 162 m -17 Y s 698 162 m -17 Y s 735 162 m -17 Y s 771 180 m -35 Y s 807 162 m -17 Y s 844 162 m -17 Y s 880 162 m -17 Y s 916 162 m -17 Y s 952 180 m -35 Y s 989 162 m -17 Y s
 1025 162 m -17 Y s 1061 162 m -17 Y s 1098 162 m -17 Y s 1134 180 m -35 Y s 1170 162 m -17 Y s 1206 162 m -17 Y s 1243 162 m -17 Y s 1279 162 m -17 Y s 1315 180 m -35 Y s 1352 162 m -17 Y s 1388 162 m -17 Y s 1424 162 m -17 Y s 1460 162 m -17 Y s
 1497 180 m -35 Y s 1533 162 m -17 Y s 1569 162 m -17 Y s 1606 162 m -17 Y s 1642 162 m -17 Y s 1678 180 m -35 Y s 1714 162 m -17 Y s 1751 162 m -17 Y s 1787 162 m -17 Y s 1823 162 m -17 Y s 1860 180 m -35 Y s 1896 162 m -17 Y s 1932 162 m -17 Y s
 1968 162 m -17 Y s 2005 162 m -17 Y s 2041 180 m -35 Y s
 gsave  2268 1448 0 0 C 187.289 93.6445 t 0 r /Helvetica findfont 53.1496 sf 0 0 m (1.5) show NC gr 
 gsave  2268 1448 0 0 C 392.295 93.6445 t 0 r /Helvetica findfont 53.1496 sf 0 0 m (2) show NC gr 
 gsave  2268 1448 0 0 C 549.213 93.6445 t 0 r /Helvetica findfont 53.1496 sf 0 0 m (2.5) show NC gr 
 gsave  2268 1448 0 0 C 754.218 93.6445 t 0 r /Helvetica findfont 53.1496 sf 0 0 m (3) show NC gr 
 gsave  2268 1448 0 0 C 913.667 93.6445 t 0 r /Helvetica findfont 53.1496 sf 0 0 m (3.5) show NC gr 
 gsave  2268 1448 0 0 C 1118.67 93.6445 t 0 r /Helvetica findfont 53.1496 sf 0 0 m (4) show NC gr 
 gsave  2268 1448 0 0 C 1275.59 93.6445 t 0 r /Helvetica findfont 53.1496 sf 0 0 m (4.5) show NC gr 
 gsave  2268 1448 0 0 C 1480.6 93.6445 t 0 r /Helvetica findfont 53.1496 sf 0 0 m (5) show NC gr 
 gsave  2268 1448 0 0 C 1640.05 93.6445 t 0 r /Helvetica findfont 53.1496 sf 0 0 m (5.5) show NC gr 
 gsave  2268 1448 0 0 C 1842.52 93.6445 t 0 r /Helvetica findfont 53.1496 sf 0 0 m (6) show NC gr 
 gsave  2268 1448 0 0 C 2001.97 93.6445 t 0 r /Helvetica findfont 53.1496 sf 0 0 m (6.5) show NC gr  227 145 m 1158 Y s
 gsave  2268 1448 0 0 C 126.547 1035.15 t 90 r /Helvetica findfont 60.7424 sf 0 0 m (\(njets\) [fb]) show NC gr 
 gsave  2268 1448 0 0 C 126.547 997.188 t 90 r /Symbol findfont 60.7424 sf 0 0 m (s) show NC gr  281 145 m -54 X s
 gsave  2268 1448 0 0 C 177.165 144.263 t 0 r /Helvetica findfont 35.4331 sf 0 0 m (\2552) show NC gr 
 gsave  2268 1448 0 0 C 118.954 121.485 t 0 r /Helvetica findfont 53.1496 sf 0 0 m (10) show NC gr  254 221 m -27 X s 254 265 m -27 X s 254 296 m -27 X s 254 321 m -27 X s 254 341 m -27 X s 254 357 m -27 X s 254 372 m -27 X s 254 385 m -27 X s 281
 396 m -54 X s
 gsave  2268 1448 0 0 C 182.227 394.826 t 0 r /Helvetica findfont 35.4331 sf 0 0 m (\2551) show NC gr 
 gsave  2268 1448 0 0 C 124.016 372.047 t 0 r /Helvetica findfont 53.1496 sf 0 0 m (10) show NC gr  254 472 m -27 X s 254 517 m -27 X s 254 548 m -27 X s 254 572 m -27 X s 254 592 m -27 X s 254 609 m -27 X s 254 624 m -27 X s 254 637 m -27 X s 281
 648 m -54 X s
 gsave  2268 1448 0 0 C 208.176 625.818 t 0 r  -29 0 t /Helvetica findfont 53.1496 sf 0 0 m (1) show NC gr  254 724 m -27 X s 254 768 m -27 X s 254 800 m -27 X s 254 824 m -27 X s 254 844 m -27 X s 254 861 m -27 X s 254 875 m -27 X s 254 888 m -27 X
 s 281 900 m -54 X s
 gsave  2268 1448 0 0 C 208.176 877.478 t 0 r  -60 0 t /Helvetica findfont 53.1496 sf 0 0 m (10) show NC gr  254 976 m -27 X s 254 1020 m -27 X s 254 1051 m -27 X s 254 1076 m -27 X s 254 1096 m -27 X s 254 1112 m -27 X s 254 1127 m -27 X s 254 1140
 m -27 X s 281 1151 m -54 X s
 gsave  2268 1448 0 0 C 187.289 1149.04 t 0 r /Helvetica findfont 35.4331 sf 0 0 m (2) show NC gr 
 gsave  2268 1448 0 0 C 129.078 1126.27 t 0 r /Helvetica findfont 53.1496 sf 0 0 m (10) show NC gr  254 1227 m -27 X s 254 1271 m -27 X s 254 1303 m -27 X s 0.4 0.4 0.8 c 6 lw 1 1 1 c black 0.4 0.4 0.8 c 227 1248 m 363 X -197 Y 362 X -906 Y 1089 X s
 0 0.8 0 c[ 20 12 4 12] 0 sd 1 1 1 c black 0 0.8 0 c 227 1242 m 363 X -230 Y 362 X -266 Y 363 X -253 Y 363 X -316 Y 363 X s black
 gsave  2268 1448 0 0 C 2095.61 820.023 t 90 r /Helvetica-BoldOblique findfont 40.4949 sf 0 0 m 
 447 428 405 383 371 340 302 290 263 236 225 198 166 135 124 95 83 54 25
(LHC HIGGS XS WG 2011) K NC gr 
 gsave  2268 1448 0 0 C 1546.4 1214.85 t 0 r /Helvetica findfont 43.0259 sf 0 0 m (POWHEG NLO) show NC gr  0.4 0.4 0.8 c[  ] 0 sd 1389 1231 m 131 X s black
 gsave  2268 1448 0 0 C 1546.4 1126.27 t 0 r /Helvetica findfont 43.0259 sf 0 0 m (POWHEG + PYTHIA) show NC gr  0.8 0 0 c[  12 12 ] 0 sd 1389 1144 m 131 X s black
 gsave  2268 1448 0 0 C 1546.4 1040.21 t 0 r /Helvetica findfont 43.0259 sf 0 0 m 
 384 372 332 302 273 243 231 206 194 161 132 102 62 29
(POWHEG + HERWIG) K NC gr  0 0.8 0 c[ 20 12 4 12] 0 sd 1389 1057 m 131 X s
 gr  gr showpage
end
%%EOF
