%!PS-Adobe-2.0 EPSF-1.2
%%Title: ptmax_H_antikt-log-LHC7-145-mstw8nn-NNLO-hwg.eps
%%Creator: gnuplot 4.4 patchlevel 3
%%CreationDate: Mon Nov 14 18:08:53 2011
%%For:banfi banfi
%%Pages: 1
%%DocumentFonts: Helvetica Symbol
%%BoundingBox: 55 48 362 291
%%EndProlog
%%Page 1 1
/gnudict 256 dict def
gnudict begin
%
% The following true/false flags may be edited by hand if desired.
% The unit line width and grayscale image gamma correction may also be changed.
%
/Color true def
/Blacktext false def
/Solid true def
/Dashlength 1 def
/Landscape false def
/Level1 false def
/Rounded false def
/ClipToBoundingBox false def
/TransparentPatterns false def
/gnulinewidth 5.000 def
/userlinewidth gnulinewidth def
/Gamma 1.0 def
%
/vshift -80 def
/dl1 {
  10.0 Dashlength mul mul
  Rounded { currentlinewidth 0.75 mul sub dup 0 le { pop 0.01 } if } if
} def
/dl2 {
  10.0 Dashlength mul mul
  Rounded { currentlinewidth 0.75 mul add } if
} def
/hpt_ 31.5 def
/vpt_ 31.5 def
/hpt hpt_ def
/vpt vpt_ def
Level1 {} {
/SDict 10 dict def
systemdict /pdfmark known not {
  userdict /pdfmark systemdict /cleartomark get put
} if
SDict begin [
  /Title (ptmax_H_antikt-log-LHC7-145-mstw8nn-NNLO-hwg.eps)
  /Subject (gnuplot plot)
  /Creator (gnuplot 4.4 patchlevel 3)
  /Author (banfi)
%  /Producer (gnuplot)
%  /Keywords ()
  /CreationDate (Mon Nov 14 18:08:53 2011)
  /DOCINFO pdfmark
end
} ifelse
/doclip {
  ClipToBoundingBox {
    newpath 50 50 moveto 410 50 lineto 410 302 lineto 50 302 lineto closepath
    clip
  } if
} def
%
% Gnuplot Prolog Version 4.4 (August 2010)
%
%/SuppressPDFMark true def
%
/M {moveto} bind def
/L {lineto} bind def
/R {rmoveto} bind def
/V {rlineto} bind def
/N {newpath moveto} bind def
/Z {closepath} bind def
/C {setrgbcolor} bind def
/f {rlineto fill} bind def
/g {setgray} bind def
/Gshow {show} def   % May be redefined later in the file to support UTF-8
/vpt2 vpt 2 mul def
/hpt2 hpt 2 mul def
/Lshow {currentpoint stroke M 0 vshift R 
	Blacktext {gsave 0 setgray show grestore} {show} ifelse} def
/Rshow {currentpoint stroke M dup stringwidth pop neg vshift R
	Blacktext {gsave 0 setgray show grestore} {show} ifelse} def
/Cshow {currentpoint stroke M dup stringwidth pop -2 div vshift R 
	Blacktext {gsave 0 setgray show grestore} {show} ifelse} def
/UP {dup vpt_ mul /vpt exch def hpt_ mul /hpt exch def
  /hpt2 hpt 2 mul def /vpt2 vpt 2 mul def} def
/DL {Color {setrgbcolor Solid {pop []} if 0 setdash}
 {pop pop pop 0 setgray Solid {pop []} if 0 setdash} ifelse} def
/BL {stroke userlinewidth 2 mul setlinewidth
	Rounded {1 setlinejoin 1 setlinecap} if} def
/AL {stroke userlinewidth 2 div setlinewidth
	Rounded {1 setlinejoin 1 setlinecap} if} def
/UL {dup gnulinewidth mul /userlinewidth exch def
	dup 1 lt {pop 1} if 10 mul /udl exch def} def
/PL {stroke userlinewidth setlinewidth
	Rounded {1 setlinejoin 1 setlinecap} if} def
3.8 setmiterlimit
% Default Line colors
/LCw {1 1 1} def
/LCb {0 0 0} def
/LCa {0 0 0} def
/LC0 {1 0 0} def
/LC1 {0 1 0} def
/LC2 {0 0 1} def
/LC3 {1 0 1} def
/LC4 {0 1 1} def
/LC5 {1 1 0} def
/LC6 {0 0 0} def
/LC7 {1 0.3 0} def
/LC8 {0.5 0.5 0.5} def
% Default Line Types
/LTw {PL [] 1 setgray} def
/LTb {BL [] LCb DL} def
/LTa {AL [1 udl mul 2 udl mul] 0 setdash LCa setrgbcolor} def
/LT0 {PL [] LC0 DL} def
/LT1 {PL [4 dl1 2 dl2] LC1 DL} def
/LT2 {PL [2 dl1 3 dl2] LC2 DL} def
/LT3 {PL [1 dl1 1.5 dl2] LC3 DL} def
/LT4 {PL [6 dl1 2 dl2 1 dl1 2 dl2] LC4 DL} def
/LT5 {PL [3 dl1 3 dl2 1 dl1 3 dl2] LC5 DL} def
/LT6 {PL [2 dl1 2 dl2 2 dl1 6 dl2] LC6 DL} def
/LT7 {PL [1 dl1 2 dl2 6 dl1 2 dl2 1 dl1 2 dl2] LC7 DL} def
/LT8 {PL [2 dl1 2 dl2 2 dl1 2 dl2 2 dl1 2 dl2 2 dl1 4 dl2] LC8 DL} def
/Pnt {stroke [] 0 setdash gsave 1 setlinecap M 0 0 V stroke grestore} def
/Dia {stroke [] 0 setdash 2 copy vpt add M
  hpt neg vpt neg V hpt vpt neg V
  hpt vpt V hpt neg vpt V closepath stroke
  Pnt} def
/Pls {stroke [] 0 setdash vpt sub M 0 vpt2 V
  currentpoint stroke M
  hpt neg vpt neg R hpt2 0 V stroke
 } def
/Box {stroke [] 0 setdash 2 copy exch hpt sub exch vpt add M
  0 vpt2 neg V hpt2 0 V 0 vpt2 V
  hpt2 neg 0 V closepath stroke
  Pnt} def
/Crs {stroke [] 0 setdash exch hpt sub exch vpt add M
  hpt2 vpt2 neg V currentpoint stroke M
  hpt2 neg 0 R hpt2 vpt2 V stroke} def
/TriU {stroke [] 0 setdash 2 copy vpt 1.12 mul add M
  hpt neg vpt -1.62 mul V
  hpt 2 mul 0 V
  hpt neg vpt 1.62 mul V closepath stroke
  Pnt} def
/Star {2 copy Pls Crs} def
/BoxF {stroke [] 0 setdash exch hpt sub exch vpt add M
  0 vpt2 neg V hpt2 0 V 0 vpt2 V
  hpt2 neg 0 V closepath fill} def
/TriUF {stroke [] 0 setdash vpt 1.12 mul add M
  hpt neg vpt -1.62 mul V
  hpt 2 mul 0 V
  hpt neg vpt 1.62 mul V closepath fill} def
/TriD {stroke [] 0 setdash 2 copy vpt 1.12 mul sub M
  hpt neg vpt 1.62 mul V
  hpt 2 mul 0 V
  hpt neg vpt -1.62 mul V closepath stroke
  Pnt} def
/TriDF {stroke [] 0 setdash vpt 1.12 mul sub M
  hpt neg vpt 1.62 mul V
  hpt 2 mul 0 V
  hpt neg vpt -1.62 mul V closepath fill} def
/DiaF {stroke [] 0 setdash vpt add M
  hpt neg vpt neg V hpt vpt neg V
  hpt vpt V hpt neg vpt V closepath fill} def
/Pent {stroke [] 0 setdash 2 copy gsave
  translate 0 hpt M 4 {72 rotate 0 hpt L} repeat
  closepath stroke grestore Pnt} def
/PentF {stroke [] 0 setdash gsave
  translate 0 hpt M 4 {72 rotate 0 hpt L} repeat
  closepath fill grestore} def
/Circle {stroke [] 0 setdash 2 copy
  hpt 0 360 arc stroke Pnt} def
/CircleF {stroke [] 0 setdash hpt 0 360 arc fill} def
/C0 {BL [] 0 setdash 2 copy moveto vpt 90 450 arc} bind def
/C1 {BL [] 0 setdash 2 copy moveto
	2 copy vpt 0 90 arc closepath fill
	vpt 0 360 arc closepath} bind def
/C2 {BL [] 0 setdash 2 copy moveto
	2 copy vpt 90 180 arc closepath fill
	vpt 0 360 arc closepath} bind def
/C3 {BL [] 0 setdash 2 copy moveto
	2 copy vpt 0 180 arc closepath fill
	vpt 0 360 arc closepath} bind def
/C4 {BL [] 0 setdash 2 copy moveto
	2 copy vpt 180 270 arc closepath fill
	vpt 0 360 arc closepath} bind def
/C5 {BL [] 0 setdash 2 copy moveto
	2 copy vpt 0 90 arc
	2 copy moveto
	2 copy vpt 180 270 arc closepath fill
	vpt 0 360 arc} bind def
/C6 {BL [] 0 setdash 2 copy moveto
	2 copy vpt 90 270 arc closepath fill
	vpt 0 360 arc closepath} bind def
/C7 {BL [] 0 setdash 2 copy moveto
	2 copy vpt 0 270 arc closepath fill
	vpt 0 360 arc closepath} bind def
/C8 {BL [] 0 setdash 2 copy moveto
	2 copy vpt 270 360 arc closepath fill
	vpt 0 360 arc closepath} bind def
/C9 {BL [] 0 setdash 2 copy moveto
	2 copy vpt 270 450 arc closepath fill
	vpt 0 360 arc closepath} bind def
/C10 {BL [] 0 setdash 2 copy 2 copy moveto vpt 270 360 arc closepath fill
	2 copy moveto
	2 copy vpt 90 180 arc closepath fill
	vpt 0 360 arc closepath} bind def
/C11 {BL [] 0 setdash 2 copy moveto
	2 copy vpt 0 180 arc closepath fill
	2 copy moveto
	2 copy vpt 270 360 arc closepath fill
	vpt 0 360 arc closepath} bind def
/C12 {BL [] 0 setdash 2 copy moveto
	2 copy vpt 180 360 arc closepath fill
	vpt 0 360 arc closepath} bind def
/C13 {BL [] 0 setdash 2 copy moveto
	2 copy vpt 0 90 arc closepath fill
	2 copy moveto
	2 copy vpt 180 360 arc closepath fill
	vpt 0 360 arc closepath} bind def
/C14 {BL [] 0 setdash 2 copy moveto
	2 copy vpt 90 360 arc closepath fill
	vpt 0 360 arc} bind def
/C15 {BL [] 0 setdash 2 copy vpt 0 360 arc closepath fill
	vpt 0 360 arc closepath} bind def
/Rec {newpath 4 2 roll moveto 1 index 0 rlineto 0 exch rlineto
	neg 0 rlineto closepath} bind def
/Square {dup Rec} bind def
/Bsquare {vpt sub exch vpt sub exch vpt2 Square} bind def
/S0 {BL [] 0 setdash 2 copy moveto 0 vpt rlineto BL Bsquare} bind def
/S1 {BL [] 0 setdash 2 copy vpt Square fill Bsquare} bind def
/S2 {BL [] 0 setdash 2 copy exch vpt sub exch vpt Square fill Bsquare} bind def
/S3 {BL [] 0 setdash 2 copy exch vpt sub exch vpt2 vpt Rec fill Bsquare} bind def
/S4 {BL [] 0 setdash 2 copy exch vpt sub exch vpt sub vpt Square fill Bsquare} bind def
/S5 {BL [] 0 setdash 2 copy 2 copy vpt Square fill
	exch vpt sub exch vpt sub vpt Square fill Bsquare} bind def
/S6 {BL [] 0 setdash 2 copy exch vpt sub exch vpt sub vpt vpt2 Rec fill Bsquare} bind def
/S7 {BL [] 0 setdash 2 copy exch vpt sub exch vpt sub vpt vpt2 Rec fill
	2 copy vpt Square fill Bsquare} bind def
/S8 {BL [] 0 setdash 2 copy vpt sub vpt Square fill Bsquare} bind def
/S9 {BL [] 0 setdash 2 copy vpt sub vpt vpt2 Rec fill Bsquare} bind def
/S10 {BL [] 0 setdash 2 copy vpt sub vpt Square fill 2 copy exch vpt sub exch vpt Square fill
	Bsquare} bind def
/S11 {BL [] 0 setdash 2 copy vpt sub vpt Square fill 2 copy exch vpt sub exch vpt2 vpt Rec fill
	Bsquare} bind def
/S12 {BL [] 0 setdash 2 copy exch vpt sub exch vpt sub vpt2 vpt Rec fill Bsquare} bind def
/S13 {BL [] 0 setdash 2 copy exch vpt sub exch vpt sub vpt2 vpt Rec fill
	2 copy vpt Square fill Bsquare} bind def
/S14 {BL [] 0 setdash 2 copy exch vpt sub exch vpt sub vpt2 vpt Rec fill
	2 copy exch vpt sub exch vpt Square fill Bsquare} bind def
/S15 {BL [] 0 setdash 2 copy Bsquare fill Bsquare} bind def
/D0 {gsave translate 45 rotate 0 0 S0 stroke grestore} bind def
/D1 {gsave translate 45 rotate 0 0 S1 stroke grestore} bind def
/D2 {gsave translate 45 rotate 0 0 S2 stroke grestore} bind def
/D3 {gsave translate 45 rotate 0 0 S3 stroke grestore} bind def
/D4 {gsave translate 45 rotate 0 0 S4 stroke grestore} bind def
/D5 {gsave translate 45 rotate 0 0 S5 stroke grestore} bind def
/D6 {gsave translate 45 rotate 0 0 S6 stroke grestore} bind def
/D7 {gsave translate 45 rotate 0 0 S7 stroke grestore} bind def
/D8 {gsave translate 45 rotate 0 0 S8 stroke grestore} bind def
/D9 {gsave translate 45 rotate 0 0 S9 stroke grestore} bind def
/D10 {gsave translate 45 rotate 0 0 S10 stroke grestore} bind def
/D11 {gsave translate 45 rotate 0 0 S11 stroke grestore} bind def
/D12 {gsave translate 45 rotate 0 0 S12 stroke grestore} bind def
/D13 {gsave translate 45 rotate 0 0 S13 stroke grestore} bind def
/D14 {gsave translate 45 rotate 0 0 S14 stroke grestore} bind def
/D15 {gsave translate 45 rotate 0 0 S15 stroke grestore} bind def
/DiaE {stroke [] 0 setdash vpt add M
  hpt neg vpt neg V hpt vpt neg V
  hpt vpt V hpt neg vpt V closepath stroke} def
/BoxE {stroke [] 0 setdash exch hpt sub exch vpt add M
  0 vpt2 neg V hpt2 0 V 0 vpt2 V
  hpt2 neg 0 V closepath stroke} def
/TriUE {stroke [] 0 setdash vpt 1.12 mul add M
  hpt neg vpt -1.62 mul V
  hpt 2 mul 0 V
  hpt neg vpt 1.62 mul V closepath stroke} def
/TriDE {stroke [] 0 setdash vpt 1.12 mul sub M
  hpt neg vpt 1.62 mul V
  hpt 2 mul 0 V
  hpt neg vpt -1.62 mul V closepath stroke} def
/PentE {stroke [] 0 setdash gsave
  translate 0 hpt M 4 {72 rotate 0 hpt L} repeat
  closepath stroke grestore} def
/CircE {stroke [] 0 setdash 
  hpt 0 360 arc stroke} def
/Opaque {gsave closepath 1 setgray fill grestore 0 setgray closepath} def
/DiaW {stroke [] 0 setdash vpt add M
  hpt neg vpt neg V hpt vpt neg V
  hpt vpt V hpt neg vpt V Opaque stroke} def
/BoxW {stroke [] 0 setdash exch hpt sub exch vpt add M
  0 vpt2 neg V hpt2 0 V 0 vpt2 V
  hpt2 neg 0 V Opaque stroke} def
/TriUW {stroke [] 0 setdash vpt 1.12 mul add M
  hpt neg vpt -1.62 mul V
  hpt 2 mul 0 V
  hpt neg vpt 1.62 mul V Opaque stroke} def
/TriDW {stroke [] 0 setdash vpt 1.12 mul sub M
  hpt neg vpt 1.62 mul V
  hpt 2 mul 0 V
  hpt neg vpt -1.62 mul V Opaque stroke} def
/PentW {stroke [] 0 setdash gsave
  translate 0 hpt M 4 {72 rotate 0 hpt L} repeat
  Opaque stroke grestore} def
/CircW {stroke [] 0 setdash 
  hpt 0 360 arc Opaque stroke} def
/BoxFill {gsave Rec 1 setgray fill grestore} def
/Density {
  /Fillden exch def
  currentrgbcolor
  /ColB exch def /ColG exch def /ColR exch def
  /ColR ColR Fillden mul Fillden sub 1 add def
  /ColG ColG Fillden mul Fillden sub 1 add def
  /ColB ColB Fillden mul Fillden sub 1 add def
  ColR ColG ColB setrgbcolor} def
/BoxColFill {gsave Rec PolyFill} def
/PolyFill {gsave Density fill grestore grestore} def
/h {rlineto rlineto rlineto gsave closepath fill grestore} bind def
%
% PostScript Level 1 Pattern Fill routine for rectangles
% Usage: x y w h s a XX PatternFill
%	x,y = lower left corner of box to be filled
%	w,h = width and height of box
%	  a = angle in degrees between lines and x-axis
%	 XX = 0/1 for no/yes cross-hatch
%
/PatternFill {gsave /PFa [ 9 2 roll ] def
  PFa 0 get PFa 2 get 2 div add PFa 1 get PFa 3 get 2 div add translate
  PFa 2 get -2 div PFa 3 get -2 div PFa 2 get PFa 3 get Rec
  gsave 1 setgray fill grestore clip
  currentlinewidth 0.5 mul setlinewidth
  /PFs PFa 2 get dup mul PFa 3 get dup mul add sqrt def
  0 0 M PFa 5 get rotate PFs -2 div dup translate
  0 1 PFs PFa 4 get div 1 add floor cvi
	{PFa 4 get mul 0 M 0 PFs V} for
  0 PFa 6 get ne {
	0 1 PFs PFa 4 get div 1 add floor cvi
	{PFa 4 get mul 0 2 1 roll M PFs 0 V} for
 } if
  stroke grestore} def
%
/languagelevel where
 {pop languagelevel} {1} ifelse
 2 lt
	{/InterpretLevel1 true def}
	{/InterpretLevel1 Level1 def}
 ifelse
%
% PostScript level 2 pattern fill definitions
%
/Level2PatternFill {
/Tile8x8 {/PaintType 2 /PatternType 1 /TilingType 1 /BBox [0 0 8 8] /XStep 8 /YStep 8}
	bind def
/KeepColor {currentrgbcolor [/Pattern /DeviceRGB] setcolorspace} bind def
<< Tile8x8
 /PaintProc {0.5 setlinewidth pop 0 0 M 8 8 L 0 8 M 8 0 L stroke} 
>> matrix makepattern
/Pat1 exch def
<< Tile8x8
 /PaintProc {0.5 setlinewidth pop 0 0 M 8 8 L 0 8 M 8 0 L stroke
	0 4 M 4 8 L 8 4 L 4 0 L 0 4 L stroke}
>> matrix makepattern
/Pat2 exch def
<< Tile8x8
 /PaintProc {0.5 setlinewidth pop 0 0 M 0 8 L
	8 8 L 8 0 L 0 0 L fill}
>> matrix makepattern
/Pat3 exch def
<< Tile8x8
 /PaintProc {0.5 setlinewidth pop -4 8 M 8 -4 L
	0 12 M 12 0 L stroke}
>> matrix makepattern
/Pat4 exch def
<< Tile8x8
 /PaintProc {0.5 setlinewidth pop -4 0 M 8 12 L
	0 -4 M 12 8 L stroke}
>> matrix makepattern
/Pat5 exch def
<< Tile8x8
 /PaintProc {0.5 setlinewidth pop -2 8 M 4 -4 L
	0 12 M 8 -4 L 4 12 M 10 0 L stroke}
>> matrix makepattern
/Pat6 exch def
<< Tile8x8
 /PaintProc {0.5 setlinewidth pop -2 0 M 4 12 L
	0 -4 M 8 12 L 4 -4 M 10 8 L stroke}
>> matrix makepattern
/Pat7 exch def
<< Tile8x8
 /PaintProc {0.5 setlinewidth pop 8 -2 M -4 4 L
	12 0 M -4 8 L 12 4 M 0 10 L stroke}
>> matrix makepattern
/Pat8 exch def
<< Tile8x8
 /PaintProc {0.5 setlinewidth pop 0 -2 M 12 4 L
	-4 0 M 12 8 L -4 4 M 8 10 L stroke}
>> matrix makepattern
/Pat9 exch def
/Pattern1 {PatternBgnd KeepColor Pat1 setpattern} bind def
/Pattern2 {PatternBgnd KeepColor Pat2 setpattern} bind def
/Pattern3 {PatternBgnd KeepColor Pat3 setpattern} bind def
/Pattern4 {PatternBgnd KeepColor Landscape {Pat5} {Pat4} ifelse setpattern} bind def
/Pattern5 {PatternBgnd KeepColor Landscape {Pat4} {Pat5} ifelse setpattern} bind def
/Pattern6 {PatternBgnd KeepColor Landscape {Pat9} {Pat6} ifelse setpattern} bind def
/Pattern7 {PatternBgnd KeepColor Landscape {Pat8} {Pat7} ifelse setpattern} bind def
} def
%
%
%End of PostScript Level 2 code
%
/PatternBgnd {
  TransparentPatterns {} {gsave 1 setgray fill grestore} ifelse
} def
%
% Substitute for Level 2 pattern fill codes with
% grayscale if Level 2 support is not selected.
%
/Level1PatternFill {
/Pattern1 {0.250 Density} bind def
/Pattern2 {0.500 Density} bind def
/Pattern3 {0.750 Density} bind def
/Pattern4 {0.125 Density} bind def
/Pattern5 {0.375 Density} bind def
/Pattern6 {0.625 Density} bind def
/Pattern7 {0.875 Density} bind def
} def
%
% Now test for support of Level 2 code
%
Level1 {Level1PatternFill} {Level2PatternFill} ifelse
%
/Symbol-Oblique /Symbol findfont [1 0 .167 1 0 0] makefont
dup length dict begin {1 index /FID eq {pop pop} {def} ifelse} forall
currentdict end definefont pop
/MFshow {
   { dup 5 get 3 ge
     { 5 get 3 eq {gsave} {grestore} ifelse }
     {dup dup 0 get findfont exch 1 get scalefont setfont
     [ currentpoint ] exch dup 2 get 0 exch R dup 5 get 2 ne {dup dup 6
     get exch 4 get {Gshow} {stringwidth pop 0 R} ifelse }if dup 5 get 0 eq
     {dup 3 get {2 get neg 0 exch R pop} {pop aload pop M} ifelse} {dup 5
     get 1 eq {dup 2 get exch dup 3 get exch 6 get stringwidth pop -2 div
     dup 0 R} {dup 6 get stringwidth pop -2 div 0 R 6 get
     show 2 index {aload pop M neg 3 -1 roll neg R pop pop} {pop pop pop
     pop aload pop M} ifelse }ifelse }ifelse }
     ifelse }
   forall} def
/Gswidth {dup type /stringtype eq {stringwidth} {pop (n) stringwidth} ifelse} def
/MFwidth {0 exch { dup 5 get 3 ge { 5 get 3 eq { 0 } { pop } ifelse }
 {dup 3 get{dup dup 0 get findfont exch 1 get scalefont setfont
     6 get Gswidth pop add} {pop} ifelse} ifelse} forall} def
/MLshow { currentpoint stroke M
  0 exch R
  Blacktext {gsave 0 setgray MFshow grestore} {MFshow} ifelse } bind def
/MRshow { currentpoint stroke M
  exch dup MFwidth neg 3 -1 roll R
  Blacktext {gsave 0 setgray MFshow grestore} {MFshow} ifelse } bind def
/MCshow { currentpoint stroke M
  exch dup MFwidth -2 div 3 -1 roll R
  Blacktext {gsave 0 setgray MFshow grestore} {MFshow} ifelse } bind def
/XYsave    { [( ) 1 2 true false 3 ()] } bind def
/XYrestore { [( ) 1 2 true false 4 ()] } bind def
end
gnudict begin
gsave
doclip
50 50 translate
0.050 0.050 scale
0 setgray
newpath
(Helvetica) findfont 240 scalefont setfont
1.000 UL
LTb
1122 4799 N
0 -4079 V
5099 0 V
0 4079 V
-5099 0 V
Z stroke
LCb setrgbcolor
282 2759 M
currentpoint gsave translate -270 rotate 0 0 moveto
[ [(Helvetica) 240.0 0.0 true true 0 (f)]
[(Helvetica) 192.0 -72.0 true true 0 (0)]
[(Helvetica) 240.0 0.0 true true 0 (\(p)]
XYsave
[(Helvetica) 192.0 -72.0 true true 0 (T)]
XYrestore
[(Helvetica) 192.0 120.0 true true 0 (cut)]
[(Helvetica) 240.0 0.0 true true 0 (\))]
] -80.0 MCshow
grestore
LTb
LCb setrgbcolor
3671 120 M
[ [(Helvetica) 240.0 0.0 true true 0 (p)]
XYsave
[(Helvetica) 192.0 -72.0 true true 0 (T)]
XYrestore
[(Helvetica) 192.0 120.0 true true 0 (cut)]
[(Helvetica) 240.0 0.0 true true 0 ( / M)]
[(Helvetica) 192.0 -72.0 true true 0 (H)]
] -80.0 MCshow
LTb
1.000 UP
6017 3657 M
[ [(Helvetica) 192.0 0.0 true true 0 (LHC, 7 TeV)]
] -80.0 MRshow
6017 3371 M
[ [(Helvetica) 192.0 0.0 true true 0 (HNNLO + MCFM)]
] -80.0 MRshow
6017 3086 M
[ [(Helvetica) 192.0 0.0 true true 0 (M)]
[(Helvetica) 153.6 -57.6 true true 0 (H)]
[(Helvetica) 192.0 0.0 true true 0 (/4 )]
[(Symbol) 192.0 0.0 true true 0 (\243 m)]
[(Helvetica) 153.6 -57.6 true true 0 (R)]
[(Helvetica) 192.0 0.0 true true 0 (, )]
[(Symbol) 192.0 0.0 true true 0 (m)]
[(Helvetica) 153.6 -57.6 true true 0 (F)]
[(Helvetica) 192.0 0.0 true true 0 ( )]
[(Symbol) 192.0 0.0 true true 0 (\243)]
[(Helvetica) 192.0 0.0 true true 0 ( M)]
[(Helvetica) 153.6 -57.6 true true 0 (H)]
] -60.8 MRshow
6017 2800 M
[ [(Helvetica) 192.0 0.0 true true 0 (1/2 )]
[(Symbol) 192.0 0.0 true true 0 (\243 m)]
[(Helvetica) 153.6 -57.6 true true 0 (R)]
[(Helvetica) 192.0 0.0 true true 0 ( / )]
[(Symbol) 192.0 0.0 true true 0 (m)]
[(Helvetica) 153.6 -57.6 true true 0 (F)]
[(Helvetica) 192.0 0.0 true true 0 ( )]
[(Symbol) 192.0 0.0 true true 0 (\243)]
[(Helvetica) 192.0 0.0 true true 0 ( 2)]
] -60.8 MRshow
1.000 UL
LTb
% Begin plot #1
1.000 UL
LT2
1122 1215 M
69 -95 V
83 -87 V
83 -62 V
83 -39 V
83 -17 V
84 3 V
83 22 V
83 40 V
83 55 V
83 70 V
83 82 V
84 79 V
83 51 V
83 47 V
83 38 V
83 56 V
84 71 V
83 86 V
83 102 V
83 117 V
83 127 V
83 135 V
84 137 V
83 139 V
83 139 V
83 138 V
83 138 V
84 136 V
83 132 V
83 129 V
83 124 V
83 120 V
83 113 V
84 108 V
83 102 V
83 96 V
83 89 V
83 82 V
84 75 V
83 66 V
83 60 V
83 51 V
83 43 V
83 36 V
84 30 V
83 25 V
83 21 V
83 15 V
83 11 V
84 9 V
83 7 V
83 6 V
83 4 V
83 3 V
83 2 V
84 1 V
83 1 V
83 0 V
83 1 V
83 0 V
84 0 V
39 0 V
% End plot #1
% Begin plot #2
1122 4637 M
69 -471 V
83 -503 V
83 -451 V
83 -406 V
83 -356 V
84 -308 V
83 -251 V
83 -195 V
83 -147 V
83 -102 V
83 -65 V
84 -33 V
83 33 V
83 109 V
83 114 V
83 117 V
84 122 V
83 124 V
83 130 V
83 132 V
83 133 V
83 134 V
84 130 V
83 128 V
83 123 V
83 121 V
83 117 V
84 114 V
83 110 V
83 106 V
83 101 V
83 97 V
83 91 V
84 85 V
83 80 V
83 75 V
83 68 V
83 63 V
84 56 V
83 51 V
83 46 V
stroke 4518 4259 M
83 40 V
83 35 V
83 30 V
84 25 V
83 21 V
83 18 V
83 14 V
83 14 V
84 11 V
83 7 V
83 4 V
83 3 V
83 2 V
83 1 V
84 1 V
83 0 V
83 1 V
83 0 V
83 0 V
84 0 V
39 -1 V
% End plot #2
% Begin plot #3
stroke
LCb setrgbcolor
5150 1683 M
[ [(Helvetica) 240.0 0.0 true true 0 (scheme \(a\))]
] -80.0 MRshow
LT2
5294 1593 639 180 80 -45 0 PatternFill
5294 1593 N
639 0 V
0 180 V
-639 0 V
0 -180 V
Z stroke
LT2
gsave 1122 1215 N 0 3422 V 69 -471 V 0 -3046 V /TransparentPatterns true def
 Pattern5 fill grestore
gsave 1191 1120 N 0 3046 V 83 -503 V 0 -2630 V /TransparentPatterns true def
 Pattern5 fill grestore
gsave 1274 1033 N 0 2630 V 83 -451 V 0 -2241 V /TransparentPatterns true def
 Pattern5 fill grestore
gsave 1357 971 N 0 2241 V 83 -406 V 0 -1874 V /TransparentPatterns true def
 Pattern5 fill grestore
gsave 1440 932 N 0 1874 V 83 -356 V 0 -1535 V /TransparentPatterns true def
 Pattern5 fill grestore
gsave 1523 915 N 0 1535 V 84 -308 V 0 -1224 V /TransparentPatterns true def
 Pattern5 fill grestore
gsave 1607 918 N 0 1224 V 83 -251 V 0 -951 V /TransparentPatterns true def
 Pattern5 fill grestore
gsave 1690 940 N 0 951 V 83 -195 V 0 -716 V /TransparentPatterns true def
 Pattern5 fill grestore
gsave 1773 980 N 0 716 V 83 -147 V 0 -514 V /TransparentPatterns true def
 Pattern5 fill grestore
gsave 1856 1035 N 0 514 V 83 -102 V 0 -342 V /TransparentPatterns true def
 Pattern5 fill grestore
gsave 1939 1105 N 0 342 V 83 -65 V 0 -195 V /TransparentPatterns true def
 Pattern5 fill grestore
gsave 2022 1187 N 0 195 V 84 -33 V 0 -83 V /TransparentPatterns true def
 Pattern5 fill grestore
gsave 2106 1266 N 0 83 V 83 33 V 0 -65 V /TransparentPatterns true def
 Pattern5 fill grestore
gsave 2189 1317 N 0 65 V 83 109 V 0 -127 V /TransparentPatterns true def
 Pattern5 fill grestore
gsave 2272 1364 N 0 127 V 83 114 V 0 -203 V /TransparentPatterns true def
 Pattern5 fill grestore
gsave 2355 1402 N 0 203 V 83 117 V 0 -264 V /TransparentPatterns true def
 Pattern5 fill grestore
gsave 2438 1458 N 0 264 V 84 122 V 0 -315 V /TransparentPatterns true def
 Pattern5 fill grestore
gsave 2522 1529 N 0 315 V 83 124 V 0 -353 V /TransparentPatterns true def
 Pattern5 fill grestore
gsave 2605 1615 N 0 353 V 83 130 V 0 -381 V /TransparentPatterns true def
 Pattern5 fill grestore
gsave 2688 1717 N 0 381 V 83 132 V 0 -396 V /TransparentPatterns true def
 Pattern5 fill grestore
gsave 2771 1834 N 0 396 V 83 133 V 0 -402 V /TransparentPatterns true def
 Pattern5 fill grestore
gsave 2854 1961 N 0 402 V 83 134 V 0 -401 V /TransparentPatterns true def
 Pattern5 fill grestore
gsave 2937 2096 N 0 401 V 84 130 V 0 -394 V /TransparentPatterns true def
 Pattern5 fill grestore
gsave 3021 2233 N 0 394 V 83 128 V 0 -383 V /TransparentPatterns true def
 Pattern5 fill grestore
gsave 3104 2372 N 0 383 V 83 123 V 0 -367 V /TransparentPatterns true def
 Pattern5 fill grestore
gsave 3187 2511 N 0 367 V 83 121 V 0 -350 V /TransparentPatterns true def
 Pattern5 fill grestore
gsave 3270 2649 N 0 350 V 83 117 V 0 -329 V /TransparentPatterns true def
 Pattern5 fill grestore
gsave 3353 2787 N 0 329 V 84 114 V 0 -307 V /TransparentPatterns true def
 Pattern5 fill grestore
gsave 3437 2923 N 0 307 V 83 110 V 0 -285 V /TransparentPatterns true def
 Pattern5 fill grestore
gsave 3520 3055 N 0 285 V 83 106 V 0 -262 V /TransparentPatterns true def
 Pattern5 fill grestore
gsave 3603 3184 N 0 262 V 83 101 V 0 -239 V /TransparentPatterns true def
 Pattern5 fill grestore
gsave 3686 3308 N 0 239 V 83 97 V 0 -216 V /TransparentPatterns true def
 Pattern5 fill grestore
gsave 3769 3428 N 0 216 V 83 91 V 0 -194 V /TransparentPatterns true def
 Pattern5 fill grestore
gsave 3852 3541 N 0 194 V 84 85 V 0 -171 V /TransparentPatterns true def
 Pattern5 fill grestore
gsave 3936 3649 N 0 171 V 83 80 V 0 -149 V /TransparentPatterns true def
 Pattern5 fill grestore
gsave 4019 3751 N 0 149 V 83 75 V 0 -128 V /TransparentPatterns true def
 Pattern5 fill grestore
gsave 4102 3847 N 0 128 V 83 68 V 0 -107 V /TransparentPatterns true def
 Pattern5 fill grestore
gsave 4185 3936 N 0 107 V 83 63 V 0 -88 V /TransparentPatterns true def
 Pattern5 fill grestore
gsave 4268 4018 N 0 88 V 84 56 V 0 -69 V /TransparentPatterns true def
 Pattern5 fill grestore
gsave 4352 4093 N 0 69 V 83 51 V 0 -54 V /TransparentPatterns true def
 Pattern5 fill grestore
gsave 4435 4159 N 0 54 V 83 46 V 0 -40 V /TransparentPatterns true def
 Pattern5 fill grestore
gsave 4518 4219 N 0 40 V 83 40 V 0 -29 V /TransparentPatterns true def
 Pattern5 fill grestore
gsave 4601 4270 N 0 29 V 83 35 V 0 -21 V /TransparentPatterns true def
 Pattern5 fill grestore
gsave 4684 4313 N 0 21 V 83 30 V 0 -15 V /TransparentPatterns true def
 Pattern5 fill grestore
gsave 4767 4349 N 0 15 V 84 25 V 0 -10 V /TransparentPatterns true def
 Pattern5 fill grestore
gsave 4851 4379 N 0 10 V 83 21 V 0 -6 V /TransparentPatterns true def
 Pattern5 fill grestore
gsave 4934 4404 N 0 6 V 83 18 V 0 -3 V /TransparentPatterns true def
 Pattern5 fill grestore
gsave 5017 4425 N 0 3 V 83 14 V 0 -2 V /TransparentPatterns true def
 Pattern5 fill grestore
gsave 5100 4440 N 0 2 V 83 14 V 0 -5 V /TransparentPatterns true def
 Pattern5 fill grestore
gsave 5183 4451 N 0 5 V 84 11 V 0 -7 V /TransparentPatterns true def
 Pattern5 fill grestore
gsave 5267 4460 N 0 7 V 83 7 V 0 -7 V /TransparentPatterns true def
 Pattern5 fill grestore
gsave 5350 4467 N 0 7 V 83 4 V 0 -5 V /TransparentPatterns true def
 Pattern5 fill grestore
gsave 5433 4473 N 0 5 V 83 3 V 0 -4 V /TransparentPatterns true def
 Pattern5 fill grestore
gsave 5516 4477 N 0 4 V 83 2 V 0 -3 V /TransparentPatterns true def
 Pattern5 fill grestore
gsave 5599 4480 N 0 3 V 83 1 V 0 -2 V /TransparentPatterns true def
 Pattern5 fill grestore
gsave 5682 4482 N 0 2 V 84 1 V 0 -2 V /TransparentPatterns true def
 Pattern5 fill grestore
gsave 5766 4483 N 0 2 V 83 0 V 0 -1 V /TransparentPatterns true def
 Pattern5 fill grestore
gsave 5849 4484 N 0 1 V 83 1 V 0 -2 V /TransparentPatterns true def
 Pattern5 fill grestore
gsave 5932 4484 N 0 2 V 83 0 V 0 -1 V /TransparentPatterns true def
 Pattern5 fill grestore
gsave 6015 4485 N 0 1 V 83 0 V 0 -1 V /TransparentPatterns true def
 Pattern5 fill grestore
gsave 6098 4485 N 0 1 V 84 0 V 0 -1 V /TransparentPatterns true def
 Pattern5 fill grestore
gsave 6182 4485 N 0 1 V 39 -1 V 0 0 V /TransparentPatterns true def
 Pattern5 fill grestore
% End plot #3
% Begin plot #4
1.000 UL
LT0
2396 720 M
42 80 V
84 161 V
83 167 V
83 172 V
83 176 V
83 177 V
83 164 V
84 162 V
83 160 V
83 158 V
83 156 V
83 155 V
84 153 V
83 150 V
83 145 V
83 138 V
83 131 V
83 124 V
84 117 V
83 111 V
83 103 V
83 97 V
83 88 V
84 79 V
83 71 V
83 63 V
83 55 V
83 49 V
83 41 V
84 34 V
83 28 V
83 23 V
83 19 V
83 15 V
84 11 V
83 9 V
83 7 V
83 5 V
83 4 V
83 3 V
84 1 V
83 1 V
83 1 V
83 0 V
83 1 V
84 0 V
39 0 V
% End plot #4
% Begin plot #5
1122 4649 M
69 -508 V
83 -544 V
83 -488 V
83 -438 V
83 -385 V
84 -332 V
83 -271 V
83 -211 V
83 -158 V
83 -111 V
83 -70 V
84 -36 V
83 -5 V
83 22 V
83 41 V
83 60 V
84 77 V
83 93 V
83 111 V
83 126 V
83 137 V
83 146 V
84 148 V
83 150 V
83 150 V
83 149 V
83 157 V
84 152 V
83 147 V
83 141 V
83 135 V
83 128 V
83 122 V
84 114 V
83 107 V
83 99 V
83 91 V
83 86 V
84 80 V
83 72 V
83 64 V
83 56 V
83 46 V
83 40 V
84 32 V
83 27 V
83 22 V
83 19 V
83 15 V
84 11 V
83 8 V
83 5 V
83 3 V
83 2 V
83 1 V
84 1 V
stroke 5766 4485 M
83 0 V
83 1 V
83 0 V
83 0 V
84 0 V
39 -1 V
% End plot #5
% Begin plot #6
stroke
LCb setrgbcolor
5150 1323 M
[ [(Helvetica) 240.0 0.0 true true 0 (scheme \(b\))]
] -80.0 MRshow
LT0
5294 1233 639 180 80 -45 1 PatternFill
5294 1233 N
639 0 V
0 180 V
-639 0 V
0 -180 V
Z stroke
LT0
gsave 1122 720 N 0 3929 V 69 -508 V 0 -3421 V /TransparentPatterns true def
 Pattern1 fill grestore
gsave 1191 720 N 0 3421 V 83 -544 V 0 -2877 V /TransparentPatterns true def
 Pattern1 fill grestore
gsave 1274 720 N 0 2877 V 83 -488 V 0 -2389 V /TransparentPatterns true def
 Pattern1 fill grestore
gsave 1357 720 N 0 2389 V 83 -438 V 0 -1951 V /TransparentPatterns true def
 Pattern1 fill grestore
gsave 1440 720 N 0 1951 V 83 -385 V 0 -1566 V /TransparentPatterns true def
 Pattern1 fill grestore
gsave 1523 720 N 0 1566 V 84 -332 V 0 -1234 V /TransparentPatterns true def
 Pattern1 fill grestore
gsave 1607 720 N 0 1234 V 83 -271 V 0 -963 V /TransparentPatterns true def
 Pattern1 fill grestore
gsave 1690 720 N 0 963 V 83 -211 V 0 -752 V /TransparentPatterns true def
 Pattern1 fill grestore
gsave 1773 720 N 0 752 V 83 -158 V 0 -594 V /TransparentPatterns true def
 Pattern1 fill grestore
gsave 1856 720 N 0 594 V 83 -111 V 0 -483 V /TransparentPatterns true def
 Pattern1 fill grestore
gsave 1939 720 N 0 483 V 83 -70 V 0 -413 V /TransparentPatterns true def
 Pattern1 fill grestore
gsave 2022 720 N 0 413 V 84 -36 V 0 -377 V /TransparentPatterns true def
 Pattern1 fill grestore
gsave 2106 720 N 0 377 V 83 -5 V 0 -372 V /TransparentPatterns true def
 Pattern1 fill grestore
gsave 2189 720 N 0 372 V 83 22 V 0 -394 V /TransparentPatterns true def
 Pattern1 fill grestore
gsave 2272 720 N 0 394 V 83 41 V 0 -435 V /TransparentPatterns true def
 Pattern1 fill grestore
gsave 2355 720 N 0 435 V 83 60 V 0 -415 V -42 -80 V /TransparentPatterns true def
 Pattern1 fill grestore
gsave 2438 800 N 0 415 V 84 77 V 0 -331 V /TransparentPatterns true def
 Pattern1 fill grestore
gsave 2522 961 N 0 331 V 83 93 V 0 -257 V /TransparentPatterns true def
 Pattern1 fill grestore
gsave 2605 1128 N 0 257 V 83 111 V 0 -196 V /TransparentPatterns true def
 Pattern1 fill grestore
gsave 2688 1300 N 0 196 V 83 126 V 0 -146 V /TransparentPatterns true def
 Pattern1 fill grestore
gsave 2771 1476 N 0 146 V 83 137 V 0 -106 V /TransparentPatterns true def
 Pattern1 fill grestore
gsave 2854 1653 N 0 106 V 83 146 V 0 -88 V /TransparentPatterns true def
 Pattern1 fill grestore
gsave 2937 1817 N 0 88 V 84 148 V 0 -74 V /TransparentPatterns true def
 Pattern1 fill grestore
gsave 3021 1979 N 0 74 V 83 150 V 0 -64 V /TransparentPatterns true def
 Pattern1 fill grestore
gsave 3104 2139 N 0 64 V 83 150 V 0 -56 V /TransparentPatterns true def
 Pattern1 fill grestore
gsave 3187 2297 N 0 56 V 83 149 V 0 -49 V /TransparentPatterns true def
 Pattern1 fill grestore
gsave 3270 2453 N 0 49 V 83 157 V 0 -51 V /TransparentPatterns true def
 Pattern1 fill grestore
gsave 3353 2608 N 0 51 V 84 152 V 0 -50 V /TransparentPatterns true def
 Pattern1 fill grestore
gsave 3437 2761 N 0 50 V 83 147 V 0 -47 V /TransparentPatterns true def
 Pattern1 fill grestore
gsave 3520 2911 N 0 47 V 83 141 V 0 -43 V /TransparentPatterns true def
 Pattern1 fill grestore
gsave 3603 3056 N 0 43 V 83 135 V 0 -40 V /TransparentPatterns true def
 Pattern1 fill grestore
gsave 3686 3194 N 0 40 V 83 128 V 0 -37 V /TransparentPatterns true def
 Pattern1 fill grestore
gsave 3769 3325 N 0 37 V 83 122 V 0 -35 V /TransparentPatterns true def
 Pattern1 fill grestore
gsave 3852 3449 N 0 35 V 84 114 V 0 -32 V /TransparentPatterns true def
 Pattern1 fill grestore
gsave 3936 3566 N 0 32 V 83 107 V 0 -28 V /TransparentPatterns true def
 Pattern1 fill grestore
gsave 4019 3677 N 0 28 V 83 99 V 0 -24 V /TransparentPatterns true def
 Pattern1 fill grestore
gsave 4102 3780 N 0 24 V 83 91 V 0 -18 V /TransparentPatterns true def
 Pattern1 fill grestore
gsave 4185 3877 N 0 18 V 83 86 V 0 -16 V /TransparentPatterns true def
 Pattern1 fill grestore
gsave 4268 3965 N 0 16 V 84 80 V 0 -17 V /TransparentPatterns true def
 Pattern1 fill grestore
gsave 4352 4044 N 0 17 V 83 72 V 0 -18 V /TransparentPatterns true def
 Pattern1 fill grestore
gsave 4435 4115 N 0 18 V 83 64 V 0 -19 V /TransparentPatterns true def
 Pattern1 fill grestore
gsave 4518 4178 N 0 19 V 83 56 V 0 -20 V /TransparentPatterns true def
 Pattern1 fill grestore
gsave 4601 4233 N 0 20 V 83 46 V 0 -17 V /TransparentPatterns true def
 Pattern1 fill grestore
gsave 4684 4282 N 0 17 V 83 40 V 0 -16 V /TransparentPatterns true def
 Pattern1 fill grestore
gsave 4767 4323 N 0 16 V 84 32 V 0 -14 V /TransparentPatterns true def
 Pattern1 fill grestore
gsave 4851 4357 N 0 14 V 83 27 V 0 -13 V /TransparentPatterns true def
 Pattern1 fill grestore
gsave 4934 4385 N 0 13 V 83 22 V 0 -12 V /TransparentPatterns true def
 Pattern1 fill grestore
gsave 5017 4408 N 0 12 V 83 19 V 0 -12 V /TransparentPatterns true def
 Pattern1 fill grestore
gsave 5100 4427 N 0 12 V 83 15 V 0 -12 V /TransparentPatterns true def
 Pattern1 fill grestore
gsave 5183 4442 N 0 12 V 84 11 V 0 -12 V /TransparentPatterns true def
 Pattern1 fill grestore
gsave 5267 4453 N 0 12 V 83 8 V 0 -11 V /TransparentPatterns true def
 Pattern1 fill grestore
gsave 5350 4462 N 0 11 V 83 5 V 0 -9 V /TransparentPatterns true def
 Pattern1 fill grestore
gsave 5433 4469 N 0 9 V 83 3 V 0 -7 V /TransparentPatterns true def
 Pattern1 fill grestore
gsave 5516 4474 N 0 7 V 83 2 V 0 -5 V /TransparentPatterns true def
 Pattern1 fill grestore
gsave 5599 4478 N 0 5 V 83 1 V 0 -3 V /TransparentPatterns true def
 Pattern1 fill grestore
gsave 5682 4481 N 0 3 V 84 1 V 0 -3 V /TransparentPatterns true def
 Pattern1 fill grestore
gsave 5766 4482 N 0 3 V 83 0 V 0 -2 V /TransparentPatterns true def
 Pattern1 fill grestore
gsave 5849 4483 N 0 2 V 83 1 V 0 -2 V /TransparentPatterns true def
 Pattern1 fill grestore
gsave 5932 4484 N 0 2 V 83 0 V 0 -2 V /TransparentPatterns true def
 Pattern1 fill grestore
gsave 6015 4484 N 0 2 V 83 0 V 0 -1 V /TransparentPatterns true def
 Pattern1 fill grestore
gsave 6098 4485 N 0 1 V 84 0 V 0 -1 V /TransparentPatterns true def
 Pattern1 fill grestore
gsave 6182 4485 N 0 1 V 39 -1 V 0 0 V /TransparentPatterns true def
 Pattern1 fill grestore
% End plot #6
% Begin plot #7
1.000 UL
LT1
1583 4799 M
24 -157 V
83 -482 V
83 -414 V
83 -349 V
83 -291 V
83 -237 V
84 -188 V
83 -145 V
83 -108 V
83 -78 V
83 -50 V
84 -24 V
83 2 V
83 31 V
83 54 V
83 74 V
83 89 V
84 93 V
83 99 V
83 101 V
83 105 V
83 109 V
84 112 V
83 113 V
83 113 V
83 110 V
83 107 V
83 103 V
84 98 V
83 92 V
83 85 V
83 78 V
83 71 V
84 63 V
83 56 V
83 49 V
83 43 V
83 35 V
83 30 V
84 25 V
83 20 V
83 15 V
83 11 V
83 8 V
84 6 V
83 5 V
83 3 V
83 2 V
83 1 V
83 0 V
84 0 V
83 0 V
83 -1 V
83 0 V
83 0 V
84 -1 V
39 0 V
% End plot #7
% Begin plot #8
2451 4799 M
71 -240 V
83 -234 V
83 -179 V
83 -130 V
83 -89 V
83 -55 V
84 -34 V
83 -15 V
83 1 V
83 15 V
83 29 V
84 38 V
83 46 V
83 51 V
83 53 V
83 55 V
83 55 V
84 54 V
83 53 V
83 51 V
83 47 V
83 43 V
84 38 V
83 32 V
83 25 V
83 19 V
83 12 V
83 5 V
84 1 V
83 -1 V
83 -2 V
83 -2 V
83 -3 V
84 -4 V
83 -6 V
83 -7 V
83 -7 V
83 -7 V
83 -5 V
84 -4 V
83 -3 V
83 -3 V
83 -2 V
83 -1 V
84 -2 V
39 0 V
stroke 6221 4487 M
% End plot #8
% Begin plot #9
stroke
LCb setrgbcolor
5150 963 M
[ [(Helvetica) 240.0 0.0 true true 0 (scheme \(c\))]
] -80.0 MRshow
LT1
5294 873 639 180 40 30 0 PatternFill
5294 873 N
639 0 V
0 180 V
-639 0 V
0 -180 V
Z stroke
LT1
gsave 1523 4799 N 0 0 V 84 0 V 0 -157 V -24 157 V /TransparentPatterns true def
 Pattern6 fill grestore
gsave 1607 4642 N 0 157 V 83 0 V 0 -639 V /TransparentPatterns true def
 Pattern6 fill grestore
gsave 1690 4160 N 0 639 V 83 0 V 0 -1053 V /TransparentPatterns true def
 Pattern6 fill grestore
gsave 1773 3746 N 0 1053 V 83 0 V 0 -1402 V /TransparentPatterns true def
 Pattern6 fill grestore
gsave 1856 3397 N 0 1402 V 83 0 V 0 -1693 V /TransparentPatterns true def
 Pattern6 fill grestore
gsave 1939 3106 N 0 1693 V 83 0 V 0 -1930 V /TransparentPatterns true def
 Pattern6 fill grestore
gsave 2022 2869 N 0 1930 V 84 0 V 0 -2118 V /TransparentPatterns true def
 Pattern6 fill grestore
gsave 2106 2681 N 0 2118 V 83 0 V 0 -2263 V /TransparentPatterns true def
 Pattern6 fill grestore
gsave 2189 2536 N 0 2263 V 83 0 V 0 -2371 V /TransparentPatterns true def
 Pattern6 fill grestore
gsave 2272 2428 N 0 2371 V 83 0 V 0 -2449 V /TransparentPatterns true def
 Pattern6 fill grestore
gsave 2355 2350 N 0 2449 V 83 0 V 0 -2499 V /TransparentPatterns true def
 Pattern6 fill grestore
gsave 2438 2300 N 0 2499 V 13 0 V 71 -240 V 0 -2283 V /TransparentPatterns true def
 Pattern6 fill grestore
gsave 2522 2276 N 0 2283 V 83 -234 V 0 -2047 V /TransparentPatterns true def
 Pattern6 fill grestore
gsave 2605 2278 N 0 2047 V 83 -179 V 0 -1837 V /TransparentPatterns true def
 Pattern6 fill grestore
gsave 2688 2309 N 0 1837 V 83 -130 V 0 -1653 V /TransparentPatterns true def
 Pattern6 fill grestore
gsave 2771 2363 N 0 1653 V 83 -89 V 0 -1490 V /TransparentPatterns true def
 Pattern6 fill grestore
gsave 2854 2437 N 0 1490 V 83 -55 V 0 -1346 V /TransparentPatterns true def
 Pattern6 fill grestore
gsave 2937 2526 N 0 1346 V 84 -34 V 0 -1219 V /TransparentPatterns true def
 Pattern6 fill grestore
gsave 3021 2619 N 0 1219 V 83 -15 V 0 -1105 V /TransparentPatterns true def
 Pattern6 fill grestore
gsave 3104 2718 N 0 1105 V 83 1 V 0 -1005 V /TransparentPatterns true def
 Pattern6 fill grestore
gsave 3187 2819 N 0 1005 V 83 15 V 0 -915 V /TransparentPatterns true def
 Pattern6 fill grestore
gsave 3270 2924 N 0 915 V 83 29 V 0 -835 V /TransparentPatterns true def
 Pattern6 fill grestore
gsave 3353 3033 N 0 835 V 84 38 V 0 -761 V /TransparentPatterns true def
 Pattern6 fill grestore
gsave 3437 3145 N 0 761 V 83 46 V 0 -694 V /TransparentPatterns true def
 Pattern6 fill grestore
gsave 3520 3258 N 0 694 V 83 51 V 0 -632 V /TransparentPatterns true def
 Pattern6 fill grestore
gsave 3603 3371 N 0 632 V 83 53 V 0 -575 V /TransparentPatterns true def
 Pattern6 fill grestore
gsave 3686 3481 N 0 575 V 83 55 V 0 -523 V /TransparentPatterns true def
 Pattern6 fill grestore
gsave 3769 3588 N 0 523 V 83 55 V 0 -475 V /TransparentPatterns true def
 Pattern6 fill grestore
gsave 3852 3691 N 0 475 V 84 54 V 0 -431 V /TransparentPatterns true def
 Pattern6 fill grestore
gsave 3936 3789 N 0 431 V 83 53 V 0 -392 V /TransparentPatterns true def
 Pattern6 fill grestore
gsave 4019 3881 N 0 392 V 83 51 V 0 -358 V /TransparentPatterns true def
 Pattern6 fill grestore
gsave 4102 3966 N 0 358 V 83 47 V 0 -327 V /TransparentPatterns true def
 Pattern6 fill grestore
gsave 4185 4044 N 0 327 V 83 43 V 0 -299 V /TransparentPatterns true def
 Pattern6 fill grestore
gsave 4268 4115 N 0 299 V 84 38 V 0 -274 V /TransparentPatterns true def
 Pattern6 fill grestore
gsave 4352 4178 N 0 274 V 83 32 V 0 -250 V /TransparentPatterns true def
 Pattern6 fill grestore
gsave 4435 4234 N 0 250 V 83 25 V 0 -226 V /TransparentPatterns true def
 Pattern6 fill grestore
gsave 4518 4283 N 0 226 V 83 19 V 0 -202 V /TransparentPatterns true def
 Pattern6 fill grestore
gsave 4601 4326 N 0 202 V 83 12 V 0 -179 V /TransparentPatterns true def
 Pattern6 fill grestore
gsave 4684 4361 N 0 179 V 83 5 V 0 -154 V /TransparentPatterns true def
 Pattern6 fill grestore
gsave 4767 4391 N 0 154 V 84 1 V 0 -130 V /TransparentPatterns true def
 Pattern6 fill grestore
gsave 4851 4416 N 0 130 V 83 -1 V 0 -109 V /TransparentPatterns true def
 Pattern6 fill grestore
gsave 4934 4436 N 0 109 V 83 -2 V 0 -92 V /TransparentPatterns true def
 Pattern6 fill grestore
gsave 5017 4451 N 0 92 V 83 -2 V 0 -79 V /TransparentPatterns true def
 Pattern6 fill grestore
gsave 5100 4462 N 0 79 V 83 -3 V 0 -68 V /TransparentPatterns true def
 Pattern6 fill grestore
gsave 5183 4470 N 0 68 V 84 -4 V 0 -58 V /TransparentPatterns true def
 Pattern6 fill grestore
gsave 5267 4476 N 0 58 V 83 -6 V 0 -47 V /TransparentPatterns true def
 Pattern6 fill grestore
gsave 5350 4481 N 0 47 V 83 -7 V 0 -37 V /TransparentPatterns true def
 Pattern6 fill grestore
gsave 5433 4484 N 0 37 V 83 -7 V 0 -28 V /TransparentPatterns true def
 Pattern6 fill grestore
gsave 5516 4486 N 0 28 V 83 -7 V 0 -20 V /TransparentPatterns true def
 Pattern6 fill grestore
gsave 5599 4487 N 0 20 V 83 -5 V 0 -15 V /TransparentPatterns true def
 Pattern6 fill grestore
gsave 5682 4487 N 0 15 V 84 -4 V 0 -11 V /TransparentPatterns true def
 Pattern6 fill grestore
gsave 5766 4487 N 0 11 V 83 -3 V 0 -8 V /TransparentPatterns true def
 Pattern6 fill grestore
gsave 5849 4487 N 0 8 V 83 -3 V 0 -6 V /TransparentPatterns true def
 Pattern6 fill grestore
gsave 5932 4486 N 0 6 V 83 -2 V 0 -4 V /TransparentPatterns true def
 Pattern6 fill grestore
gsave 6015 4486 N 0 4 V 83 -1 V 0 -3 V /TransparentPatterns true def
 Pattern6 fill grestore
gsave 6098 4486 N 0 3 V 84 -2 V 0 -2 V /TransparentPatterns true def
 Pattern6 fill grestore
gsave 6182 4485 N 0 2 V 39 0 V 0 -2 V /TransparentPatterns true def
 Pattern6 fill grestore
% End plot #9
1.000 UL
LTb
1.000 UL
LTa
1122 720 M
5099 0 V
stroke
LTb
1122 720 M
63 0 V
5036 0 R
-63 0 V
stroke
978 720 M
[ [(Helvetica) 240.0 0.0 true true 0 (-0.2)]
] -80.0 MRshow
1.000 UL
LTb
1122 1034 M
31 0 V
5068 0 R
-31 0 V
stroke
LTa
1122 1348 M
2588 0 V
2367 0 R
144 0 V
stroke
LTb
1122 1348 M
63 0 V
5036 0 R
-63 0 V
stroke
978 1348 M
[ [(Helvetica) 240.0 0.0 true true 0 ( 0)]
] -80.0 MRshow
1.000 UL
LTb
1122 1661 M
31 0 V
5068 0 R
-31 0 V
stroke
LTa
1122 1975 M
5099 0 V
stroke
LTb
1122 1975 M
63 0 V
5036 0 R
-63 0 V
stroke
978 1975 M
[ [(Helvetica) 240.0 0.0 true true 0 ( 0.2)]
] -80.0 MRshow
1.000 UL
LTb
1122 2289 M
31 0 V
5068 0 R
-31 0 V
stroke
LTa
1122 2603 M
5099 0 V
stroke
LTb
1122 2603 M
63 0 V
5036 0 R
-63 0 V
stroke
978 2603 M
[ [(Helvetica) 240.0 0.0 true true 0 ( 0.4)]
] -80.0 MRshow
1.000 UL
LTb
1122 2916 M
31 0 V
5068 0 R
-31 0 V
stroke
LTa
1122 3230 M
5099 0 V
stroke
LTb
1122 3230 M
63 0 V
5036 0 R
-63 0 V
stroke
978 3230 M
[ [(Helvetica) 240.0 0.0 true true 0 ( 0.6)]
] -80.0 MRshow
1.000 UL
LTb
1122 3544 M
31 0 V
5068 0 R
-31 0 V
stroke
LTa
1122 3858 M
5099 0 V
stroke
LTb
1122 3858 M
63 0 V
5036 0 R
-63 0 V
stroke
978 3858 M
[ [(Helvetica) 240.0 0.0 true true 0 ( 0.8)]
] -80.0 MRshow
1.000 UL
LTb
1122 4171 M
31 0 V
5068 0 R
-31 0 V
stroke
LTa
1122 4485 M
5099 0 V
stroke
LTb
1122 4485 M
63 0 V
5036 0 R
-63 0 V
stroke
978 4485 M
[ [(Helvetica) 240.0 0.0 true true 0 ( 1)]
] -80.0 MRshow
1.000 UL
LTb
1122 4799 M
31 0 V
5068 0 R
-31 0 V
stroke
LTa
1122 720 M
0 4079 V
stroke
LTb
1122 720 M
0 63 V
0 4016 R
0 -63 V
stroke
1122 480 M
[ [(Helvetica) 240.0 0.0 true true 0 ( 0.01)]
] -80.0 MCshow
1.000 UL
LTb
1691 720 M
0 31 V
0 4048 R
0 -31 V
2023 720 M
0 31 V
0 4048 R
0 -31 V
2259 720 M
0 31 V
0 4048 R
0 -31 V
2443 720 M
0 31 V
0 4048 R
0 -31 V
2592 720 M
0 31 V
0 4048 R
0 -31 V
2719 720 M
0 31 V
0 4048 R
0 -31 V
2828 720 M
0 31 V
0 4048 R
0 -31 V
2925 720 M
0 31 V
0 4048 R
0 -31 V
stroke
LTa
3011 720 M
0 4079 V
stroke
LTb
3011 720 M
0 63 V
0 4016 R
0 -63 V
stroke
3011 480 M
[ [(Helvetica) 240.0 0.0 true true 0 ( 0.1)]
] -80.0 MCshow
1.000 UL
LTb
3580 720 M
0 31 V
0 4048 R
0 -31 V
3913 720 M
0 31 V
0 4048 R
0 -31 V
4149 720 M
0 31 V
0 4048 R
0 -31 V
4332 720 M
0 31 V
0 4048 R
0 -31 V
4481 720 M
0 31 V
0 4048 R
0 -31 V
4608 720 M
0 31 V
0 4048 R
0 -31 V
4717 720 M
0 31 V
0 4048 R
0 -31 V
4814 720 M
0 31 V
0 4048 R
0 -31 V
stroke
LTa
4900 720 M
0 63 V
0 1080 R
0 2936 V
stroke
LTb
4900 720 M
0 63 V
0 4016 R
0 -63 V
stroke
4900 480 M
[ [(Helvetica) 240.0 0.0 true true 0 ( 1)]
] -80.0 MCshow
1.000 UL
LTb
5469 720 M
0 31 V
0 4048 R
0 -31 V
5802 720 M
0 31 V
0 4048 R
0 -31 V
6038 720 M
0 31 V
0 4048 R
0 -31 V
6221 720 M
0 31 V
0 4048 R
0 -31 V
stroke
1122 4799 N
0 -4079 V
5099 0 V
0 4079 V
-5099 0 V
Z stroke
1.000 UP
4.000 UL
LT7
3580 720 M
0 4079 V
stroke
1.000 UL
LTb
stroke
grestore
end
showpage
%%EOF
