%!PS-Adobe-2.0 EPSF-2.0
%%BoundingBox:  0 0 567 341
%%Title: /home/qliphy/Downloads/MCFM/Bin/plot0/h700/mw.eps: 
%%Creator: ROOT Version 5.32/00
%%CreationDate: Thu Jun 13 17:01:24 2013
%%EndComments
%%BeginProlog
80 dict begin
/s {stroke} def /l {lineto} def /m {moveto} def /t {translate} def
/r {rotate} def /rl {roll}  def /R {repeat} def
/d {rlineto} def /rm {rmoveto} def /gr {grestore} def /f {eofill} def
/c {setrgbcolor} def /black {0 setgray} def /sd {setdash} def
/cl {closepath} def /sf {scalefont setfont} def /lw {setlinewidth} def
/box {m dup 0 exch d exch 0 d 0 exch neg d cl} def
/NC{systemdict begin initclip end}def/C{NC box clip newpath}def
/bl {box s} def /bf {box f} def /Y { 0 exch d} def /X { 0 d} def 
/K {{pop pop 0 moveto} exch kshow} bind def
/ita {/ang 15 def gsave [1 0 ang dup sin exch cos div 1 0 0] concat} def 
/mp {newpath /y exch def /x exch def} def
/side {[w .77 mul w .23 mul] .385 w mul sd w 0 l currentpoint t -144 r} def
/mr {mp x y w2 0 360 arc} def /m24 {mr s} def /m20 {mr f} def
/mb {mp x y w2 add m w2 neg 0 d 0 w neg d w 0 d 0 w d cl} def
/mt {mp x y w2 add m w2 neg w neg d w 0 d cl} def
/m21 {mb f} def /m25 {mb s} def /m22 {mt f} def /m26{mt s} def
/m23 {mp x y w2 sub m w2 w d w neg 0 d cl f} def
/m27 {mp x y w2 add m w3 neg w2 neg d w3 w2 neg d w3 w2 d cl s} def
/m28 {mp x w2 sub y w2 sub w3 add m w3 0 d  0 w3 neg d w3 0 d 0 w3 d w3 0 d  0 w3 d w3 neg 0 d 0 w3 d w3 neg 0 d 0 w3 neg d w3 neg 0 d cl s } def
/m29 {mp gsave x w2 sub y w2 add w3 sub m currentpoint t 4 {side} repeat cl fill gr} def
/m30 {mp gsave x w2 sub y w2 add w3 sub m currentpoint t 4 {side} repeat cl s gr} def
/m31 {mp x y w2 sub m 0 w d x w2 sub y m w 0 d x w2 sub y w2 add m w w neg d x w2 sub y w2 sub m w w d s} def
/m32 {mp x y w2 sub m w2 w d w neg 0 d cl s} def
/m33 {mp x y w2 add m w3 neg w2 neg d w3 w2 neg d w3 w2 d cl f} def
/m34 {mp x w2 sub y w2 sub w3 add m w3 0 d  0 w3 neg d w3 0 d 0 w3 d w3 0 d  0 w3 d w3 neg 0 d 0 w3 d w3 neg 0 d 0 w3 neg d w3 neg 0 d cl f } def
/m2 {mp x y w2 sub m 0 w d x w2 sub y m w 0 d s} def
/m5 {mp x w2 sub y w2 sub m w w d x w2 sub y w2 add m w w neg d s} def
/reEncode {exch findfont dup length dict begin {1 index /FID eq  {pop pop} {def} ifelse } forall /Encoding exch def currentdict end dup /FontName get exch definefont pop } def [/Times-Bold /Times-Italic /Times-BoldItalic /Helvetica /Helvetica-Oblique
 /Helvetica-Bold /Helvetica-BoldOblique /Courier /Courier-Oblique /Courier-Bold /Courier-BoldOblique /Times-Roman /AvantGarde-Book /AvantGarde-BookOblique /AvantGarde-Demi /AvantGarde-DemiOblique /Bookman-Demi /Bookman-DemiItalic /Bookman-Light
 /Bookman-LightItalic /Helvetica-Narrow /Helvetica-Narrow-Bold /Helvetica-Narrow-BoldOblique /Helvetica-Narrow-Oblique /NewCenturySchlbk-Roman /NewCenturySchlbk-Bold /NewCenturySchlbk-BoldItalic /NewCenturySchlbk-Italic /Palatino-Bold
 /Palatino-BoldItalic /Palatino-Italic /Palatino-Roman ] {ISOLatin1Encoding reEncode } forall%%EndProlog
%%BeginSetup
%%EndSetup
newpath  gsave  .25 .25 scale  gsave  0 0 t black[  ] 0 sd 3 lw 1 1 1 c 2268 1364 0 0 bf black 1 1 1 c 1791 1078 363 218 bf black 1791 1078 363 218 bl 1 1 1 c 1791 1078 363 218 bf black 1791 1078 363 218 bl 363 218 m 1791 X s[ 4 8] 0 sd 425 1296 m
 -1078 Y s 672 1296 m -1078 Y s 919 1296 m -1078 Y s 1166 1296 m -1078 Y s 1413 1296 m -1078 Y s 1660 1296 m -1078 Y s 1907 1296 m -1078 Y s 2154 1296 m -1078 Y s 425 1296 m -1078 Y s[  ] 0 sd 363 1296 m 1791 X s 363 218 m 1078 Y s[ 4 8] 0 sd 2154
 420 m -1791 X s 2154 688 m -1791 X s 2154 956 m -1791 X s 2154 1225 m -1791 X s[  ] 0 sd 2154 218 m 1078 Y s 1 0 0 c 6 lw 1 1 1 c black 1 0 0 c 363 325 m 62 X 70 Y 61 X 12 Y 62 X 25 Y 62 X 39 Y 62 X 30 Y 61 X 36 Y 62 X 26 Y 62 X 49 Y 62 X 68 Y 62 X
 78 Y 61 X 121 Y 62 X 281 Y 62 X 61 Y 62 X -314 Y 61 X -135 Y 62 X -87 Y 62 X -59 Y 62 X -64 Y 62 X -12 Y 61 X -52 Y 62 X -22 Y 62 X -29 Y 62 X -39 Y 61 X -11 Y 62 X -11 Y 62 X -11 Y 62 X -50 Y 62 X -26 Y 61 X s black 3 lw 363 218 m 1791 X s
 gsave  2268 1364 0 0 C 1929.57 82.1498 t 0 r /Helvetica findfont 76.4184 sf 0 0 m ( \(GeV\)) show NC gr 
 gsave  2268 1364 0 0 C 1879.89 59.2243 t 0 r /Helvetica findfont 51.5824 sf 0 0 m (W) show NC gr 
 gsave  2268 1364 0 0 C 1820.67 82.1498 t 0 r /Helvetica findfont 76.4184 sf 0 0 m (M) show NC gr  425 251 m -33 Y s 486 234 m -16 Y s 548 234 m -16 Y s 610 234 m -16 Y s 672 251 m -33 Y s 733 234 m -16 Y s 795 234 m -16 Y s 857 234 m -16 Y s 919 251
 m -33 Y s 981 234 m -16 Y s 1042 234 m -16 Y s 1104 234 m -16 Y s 1166 251 m -33 Y s 1228 234 m -16 Y s 1289 234 m -16 Y s 1351 234 m -16 Y s 1413 251 m -33 Y s 1475 234 m -16 Y s 1537 234 m -16 Y s 1598 234 m -16 Y s 1660 251 m -33 Y s 1722 234 m
 -16 Y s 1784 234 m -16 Y s 1845 234 m -16 Y s 1907 251 m -33 Y s 1969 234 m -16 Y s 2031 234 m -16 Y s 2093 234 m -16 Y s 2154 251 m -33 Y s 425 251 m -33 Y s
 gsave  2268 1364 0 0 C 395.465 168.121 t 0 r /Helvetica findfont 51.5824 sf 0 0 m (20) show NC gr 
 gsave  2268 1364 0 0 C 641.915 168.121 t 0 r /Helvetica findfont 51.5824 sf 0 0 m (40) show NC gr 
 gsave  2268 1364 0 0 C 888.364 168.121 t 0 r /Helvetica findfont 51.5824 sf 0 0 m (60) show NC gr 
 gsave  2268 1364 0 0 C 1136.72 168.121 t 0 r /Helvetica findfont 51.5824 sf 0 0 m (80) show NC gr 
 gsave  2268 1364 0 0 C 1369.8 168.121 t 0 r /Helvetica findfont 51.5824 sf 0 0 m (100) show NC gr 
 gsave  2268 1364 0 0 C 1616.25 168.121 t 0 r /Helvetica findfont 51.5824 sf 0 0 m (120) show NC gr 
 gsave  2268 1364 0 0 C 1864.61 168.121 t 0 r /Helvetica findfont 51.5824 sf 0 0 m (140) show NC gr 
 gsave  2268 1364 0 0 C 2111.06 168.121 t 0 r /Helvetica findfont 51.5824 sf 0 0 m (160) show NC gr  363 1296 m 1791 X s 425 1264 m 32 Y s 486 1280 m 16 Y s 548 1280 m 16 Y s 610 1280 m 16 Y s 672 1264 m 32 Y s 733 1280 m 16 Y s 795 1280 m 16 Y s 857
 1280 m 16 Y s 919 1264 m 32 Y s 981 1280 m 16 Y s 1042 1280 m 16 Y s 1104 1280 m 16 Y s 1166 1264 m 32 Y s 1228 1280 m 16 Y s 1289 1280 m 16 Y s 1351 1280 m 16 Y s 1413 1264 m 32 Y s 1475 1280 m 16 Y s 1537 1280 m 16 Y s 1598 1280 m 16 Y s 1660 1264
 m 32 Y s 1722 1280 m 16 Y s 1784 1280 m 16 Y s 1845 1280 m 16 Y s 1907 1264 m 32 Y s 1969 1280 m 16 Y s 2031 1280 m 16 Y s 2093 1280 m 16 Y s 2154 1264 m 32 Y s 425 1264 m 32 Y s 363 218 m 1078 Y s
 gsave  2268 1364 0 0 C 204.419 1018.28 t 90 r /Helvetica findfont 76.4184 sf 0 0 m ( \(pb/bin\)) show NC gr 
 gsave  2268 1364 0 0 C 229.255 968.603 t 90 r /Helvetica findfont 51.5824 sf 0 0 m (W) show NC gr 
 gsave  2268 1364 0 0 C 204.419 846.334 t 90 r /Helvetica findfont 76.4184 sf 0 0 m (/dM) show NC gr 
 gsave  2268 1364 0 0 C 204.419 800.483 t 90 r /Symbol findfont 76.4184 sf 0 0 m (s) show NC gr 
 gsave  2268 1364 0 0 C 204.419 762.274 t 90 r /Helvetica findfont 76.4184 sf 0 0 m (d) show NC gr  390 232 m -27 X s 390 280 m -27 X s 390 313 m -27 X s 390 339 m -27 X s 390 360 m -27 X s 390 378 m -27 X s 390 394 m -27 X s 390 408 m -27 X s 417
 420 m -54 X s
 gsave  2268 1364 0 0 C 313.316 418.391 t 0 r /Helvetica findfont 34.3883 sf 0 0 m (\2554) show NC gr 
 gsave  2268 1364 0 0 C 257.912 395.465 t 0 r /Helvetica findfont 51.5824 sf 0 0 m (10) show NC gr  390 501 m -27 X s 390 548 m -27 X s 390 581 m -27 X s 390 607 m -27 X s 390 629 m -27 X s 390 647 m -27 X s 390 662 m -27 X s 390 676 m -27 X s 417
 688 m -54 X s
 gsave  2268 1364 0 0 C 313.316 689.676 t 0 r /Helvetica findfont 34.3883 sf 0 0 m (\2553) show NC gr 
 gsave  2268 1364 0 0 C 257.912 664.84 t 0 r /Helvetica findfont 51.5824 sf 0 0 m (10) show NC gr  390 769 m -27 X s 390 816 m -27 X s 390 850 m -27 X s 390 876 m -27 X s 390 897 m -27 X s 390 915 m -27 X s 390 930 m -27 X s 390 944 m -27 X s 417 956
 m -54 X s
 gsave  2268 1364 0 0 C 313.316 955.23 t 0 r /Helvetica findfont 34.3883 sf 0 0 m (\2552) show NC gr 
 gsave  2268 1364 0 0 C 257.912 932.305 t 0 r /Helvetica findfont 51.5824 sf 0 0 m (10) show NC gr  390 1037 m -27 X s 390 1084 m -27 X s 390 1118 m -27 X s 390 1144 m -27 X s 390 1165 m -27 X s 390 1183 m -27 X s 390 1199 m -27 X s 390 1212 m -27 X
 s 417 1225 m -54 X s
 gsave  2268 1364 0 0 C 319.047 1224.61 t 0 r /Helvetica findfont 34.3883 sf 0 0 m (\2551) show NC gr 
 gsave  2268 1364 0 0 C 263.644 1201.68 t 0 r /Helvetica findfont 51.5824 sf 0 0 m (10) show NC gr  2154 218 m 1078 Y s 2127 232 m 27 X s 2127 280 m 27 X s 2127 313 m 27 X s 2127 339 m 27 X s 2127 360 m 27 X s 2127 378 m 27 X s 2127 394 m 27 X s 2127
 408 m 27 X s 2101 420 m 53 X s 2127 501 m 27 X s 2127 548 m 27 X s 2127 581 m 27 X s 2127 607 m 27 X s 2127 629 m 27 X s 2127 647 m 27 X s 2127 662 m 27 X s 2127 676 m 27 X s 2101 688 m 53 X s 2127 769 m 27 X s 2127 816 m 27 X s 2127 850 m 27 X s
 2127 876 m 27 X s 2127 897 m 27 X s 2127 915 m 27 X s 2127 930 m 27 X s 2127 944 m 27 X s 2101 956 m 53 X s 2127 1037 m 27 X s 2127 1084 m 27 X s 2127 1118 m 27 X s 2127 1144 m 27 X s 2127 1165 m 27 X s 2127 1183 m 27 X s 2127 1199 m 27 X s 2127
 1212 m 27 X s 2101 1225 m 53 X s 1 1 0 c black 1 1 0 c 363 302 m 31 1 d 61 71 d 62 17 d 62 53 d 62 20 d 62 18 d 61 51 d 62 50 d 62 47 d 62 53 d 61 77 d 62 122 d 62 280 d 62 61 d 62 -315 d 61 -137 d 62 -81 d 62 -65 d 62 -33 d 61 -54 d 62 -21 d 62 -37
 d 62 -44 d 62 -17 d 61 -23 d 62 -31 d 62 22 d 62 -62 d 61 -3 d 31 1 d -22 Y -31 -1 d -61 3 d -62 56 d -62 -16 d -62 28 d -61 26 d -62 18 d -62 39 d -62 39 d -62 25 d -61 50 d -62 34 d -62 66 d -62 80 d -61 137 d -62 315 d -62 -61 d -62 -279 d -62
 -123 d -61 -76 d -62 -55 d -62 -49 d -62 -47 d -61 -50 d -62 -21 d -62 -18 d -62 -46 d -62 -27 d -61 -64 d -31 -2 d f 1 0 0 c 6 lw 1 1 1 c black 1 0 0 c 363 325 m 62 X 70 Y 61 X 12 Y 62 X 25 Y 62 X 39 Y 62 X 30 Y 61 X 36 Y 62 X 26 Y 62 X 49 Y 62 X
 68 Y 62 X 78 Y 61 X 121 Y 62 X 281 Y 62 X 61 Y 62 X -314 Y 61 X -135 Y 62 X -87 Y 62 X -59 Y 62 X -64 Y 62 X -12 Y 61 X -52 Y 62 X -22 Y 62 X -29 Y 62 X -39 Y 61 X -11 Y 62 X -11 Y 62 X -11 Y 62 X -50 Y 62 X -26 Y 61 X s 0 0 1 c 1 1 1 c black 0 0 1
 c 363 263 m 62 X 55 Y 61 X 39 Y 62 X 38 Y 62 X 15 Y 62 X 26 Y 61 X 49 Y 62 X 42 Y 62 X 52 Y 62 X 56 Y 62 X 76 Y 61 X 124 Y 62 X 277 Y 62 X 62 Y 62 X -315 Y 61 X -137 Y 62 X -79 Y 62 X -66 Y 62 X -37 Y 62 X -44 Y 61 X -30 Y 62 X -43 Y 62 X -30 Y 62 X
 -21 Y 61 X -29 Y 62 X -24 Y 62 X 6 Y 62 X -46 Y 62 X -3 Y 61 X s black 3 lw 1 1 1 c 826 302 1293 955 bf black 1293 955 m 826 X s 2119 955 m 302 Y s 2119 1257 m -826 X s 1293 1257 m -302 Y s
 gsave  2268 1364 0 0 C 1499.71 1195.95 t 0 r /Times-Bold findfont 40.1197 sf 0 0 m (\(1+R2\)*\(MCFM S700\): Uncertainty) show NC gr  1 1 0 c 1324 1172 m 145 X 70 Y -145 X f black 1324 1242 m 145 X s 1324 1172 m 145 X s 1469 1172 m 70 Y s 1324 1172 m
 70 Y s
 gsave  2268 1364 0 0 C 1499.71 1094.69 t 0 r /Times-Bold findfont 40.1197 sf 0 0 m (MCFM \(S+I\)700) show NC gr  1 0 0 c 6 lw 1324 1106 m 145 X s black
 gsave  2268 1364 0 0 C 1499.71 991.529 t 0 r /Times-Bold findfont 40.1197 sf 0 0 m (MCFM S700) show NC gr  0 0 1 c 1324 1006 m 145 X s black
 gsave  2268 1364 0 0 C 2221.87 989.619 t 90 r /Helvetica-BoldOblique findfont 24.836 sf 0 0 m (LHC HIGGS XS WG 2013) show NC gr 
 gr  gr showpage
end
%%EOF
