%!PS-Adobe-2.0 EPSF-2.0
%%BoundingBox:  0 0 567 544
%%Title: HWW_900_ptll_NNLO_cut_YR3.eps: HWW 900Gev ptll NNLO with cuts
%%Creator: ROOT Version 5.34/05
%%CreationDate: Fri Jun 14 04:49:36 2013
%%EndComments
%%BeginProlog
80 dict begin
/s {stroke} def /l {lineto} def /m {moveto} def /t {translate} def
/r {rotate} def /rl {roll}  def /R {repeat} def
/d {rlineto} def /rm {rmoveto} def /gr {grestore} def /f {eofill} def
/c {setrgbcolor} def /black {0 setgray} def /sd {setdash} def
/cl {closepath} def /sf {scalefont setfont} def /lw {setlinewidth} def
/box {m dup 0 exch d exch 0 d 0 exch neg d cl} def
/NC{systemdict begin initclip end}def/C{NC box clip newpath}def
/bl {box s} def /bf {box f} def /Y { 0 exch d} def /X { 0 d} def 
/K {{pop pop 0 moveto} exch kshow} bind def
/ita {/ang 15 def gsave [1 0 ang dup sin exch cos div 1 0 0] concat} def 
/mp {newpath /y exch def /x exch def} def
/side {[w .77 mul w .23 mul] .385 w mul sd w 0 l currentpoint t -144 r} def
/mr {mp x y w2 0 360 arc} def /m24 {mr s} def /m20 {mr f} def
/mb {mp x y w2 add m w2 neg 0 d 0 w neg d w 0 d 0 w d cl} def
/mt {mp x y w2 add m w2 neg w neg d w 0 d cl} def
/m21 {mb f} def /m25 {mb s} def /m22 {mt f} def /m26{mt s} def
/m23 {mp x y w2 sub m w2 w d w neg 0 d cl f} def
/m27 {mp x y w2 add m w3 neg w2 neg d w3 w2 neg d w3 w2 d cl s} def
/m28 {mp x w2 sub y w2 sub w3 add m w3 0 d  0 w3 neg d w3 0 d 0 w3 d w3 0 d  0 w3 d w3 neg 0 d 0 w3 d w3 neg 0 d 0 w3 neg d w3 neg 0 d cl s } def
/m29 {mp gsave x w2 sub y w2 add w3 sub m currentpoint t 4 {side} repeat cl fill gr} def
/m30 {mp gsave x w2 sub y w2 add w3 sub m currentpoint t 4 {side} repeat cl s gr} def
/m31 {mp x y w2 sub m 0 w d x w2 sub y m w 0 d x w2 sub y w2 add m w w neg d x w2 sub y w2 sub m w w d s} def
/m32 {mp x y w2 sub m w2 w d w neg 0 d cl s} def
/m33 {mp x y w2 add m w3 neg w2 neg d w3 w2 neg d w3 w2 d cl f} def
/m34 {mp x w2 sub y w2 sub w3 add m w3 0 d  0 w3 neg d w3 0 d 0 w3 d w3 0 d  0 w3 d w3 neg 0 d 0 w3 d w3 neg 0 d 0 w3 neg d w3 neg 0 d cl f } def
/m2 {mp x y w2 sub m 0 w d x w2 sub y m w 0 d s} def
/m5 {mp x w2 sub y w2 sub m w w d x w2 sub y w2 add m w w neg d s} def
/reEncode {exch findfont dup length dict begin {1 index /FID eq  {pop pop} {def} ifelse } forall /Encoding exch def currentdict end dup /FontName get exch definefont pop } def [/Times-Bold /Times-Italic /Times-BoldItalic /Helvetica /Helvetica-Oblique
 /Helvetica-Bold /Helvetica-BoldOblique /Courier /Courier-Oblique /Courier-Bold /Courier-BoldOblique /Times-Roman /AvantGarde-Book /AvantGarde-BookOblique /AvantGarde-Demi /AvantGarde-DemiOblique /Bookman-Demi /Bookman-DemiItalic /Bookman-Light
 /Bookman-LightItalic /Helvetica-Narrow /Helvetica-Narrow-Bold /Helvetica-Narrow-BoldOblique /Helvetica-Narrow-Oblique /NewCenturySchlbk-Roman /NewCenturySchlbk-Bold /NewCenturySchlbk-BoldItalic /NewCenturySchlbk-Italic /Palatino-Bold
 /Palatino-BoldItalic /Palatino-Italic /Palatino-Roman ] {ISOLatin1Encoding reEncode } forall
%%EndProlog
%%BeginSetup
%%EndSetup
newpath  gsave  .25 .25 scale  gsave  0 0 t black[  ] 0 sd 3 lw 1 1 1 c 2268 2177 0 0 bf black 1 1 1 c 2222 2133 23 22 bf black 1 1 1 c 1778 1706 245 235 bf black 1778 1706 245 235 bl 0.8 0 0.8 c 1 1 1 c 1 0 1 c 0.8 0 0.8 c 245 235 m 195 X 1060 Y 18
 X 403 Y 18 X 66 Y 18 X 38 Y 18 X 31 Y 17 X 27 Y 18 X -17 Y 18 X -18 Y 18 X -111 Y 17 X -206 Y 18 X -141 Y 18 X -113 Y 18 X -96 Y 18 X -86 Y 17 X -58 Y 18 X -69 Y 18 X -53 Y 18 X -43 Y 18 X -50 Y 17 X -37 Y 18 X -34 Y 18 X -38 Y 18 X -33 Y 17 X -27 Y
 18 X -29 Y 18 X -26 Y 18 X -21 Y 18 X -24 Y 17 X -20 Y 18 X -21 Y 18 X -16 Y 18 X -17 Y 17 X -14 Y 18 X -16 Y 18 X -14 Y 18 X -12 Y 18 X -12 Y 17 X -12 Y 18 X -9 Y 18 X -10 Y 18 X -9 Y 17 X -8 Y 18 X -7 Y 18 X -7 Y 18 X -8 Y 18 X -6 Y 17 X -5 Y 18 X
 -6 Y 18 X -5 Y 18 X -3 Y 17 X -7 Y 18 X -3 Y 18 X -5 Y 18 X -3 Y 18 X -3 Y 17 X -3 Y 18 X -3 Y 18 X -2 Y 18 X -2 Y 17 X -3 Y 18 X -2 Y 18 X -1 Y 18 X -3 Y 18 X -1 Y 17 X -2 Y 18 X -1 Y 18 X -2 Y 35 X -2 Y 18 X -1 Y 36 X -1 Y 18 X -1 Y 17 X -1 Y 36 X
 -1 Y 35 X -1 Y 36 X -1 Y 53 X -1 Y 71 X -1 Y 54 X s black 245 235 m 1778 X s
 gsave  2222 2133 23 22 C 1990.42 68.3734 t 0 r /Helvetica findfont 45.6261 sf 0 0 m (ll) show NC gr 
 gsave  2222 2133 23 22 C 1990.42 129.15 t 0 r /Helvetica findfont 45.6261 sf 0 0 m (T) show NC gr 
 gsave  2222 2133 23 22 C 1952.44 106.359 t 0 r /Helvetica findfont 68.4392 sf 0 0 m (p) show NC gr  245 286 m -51 Y s 289 261 m -26 Y s 334 261 m -26 Y s 378 261 m -26 Y s 423 261 m -26 Y s 467 286 m -51 Y s 512 261 m -26 Y s 556 261 m -26 Y s 600
 261 m -26 Y s 645 261 m -26 Y s 689 286 m -51 Y s 734 261 m -26 Y s 778 261 m -26 Y s 823 261 m -26 Y s 867 261 m -26 Y s 912 286 m -51 Y s 956 261 m -26 Y s 1001 261 m -26 Y s 1045 261 m -26 Y s 1089 261 m -26 Y s 1134 286 m -51 Y s 1178 261 m -26
 Y s 1223 261 m -26 Y s 1267 261 m -26 Y s 1312 261 m -26 Y s 1356 286 m -51 Y s 1401 261 m -26 Y s 1445 261 m -26 Y s 1489 261 m -26 Y s 1534 261 m -26 Y s 1578 286 m -51 Y s 1623 261 m -26 Y s 1667 261 m -26 Y s 1712 261 m -26 Y s 1756 261 m -26 Y
 s 1801 286 m -51 Y s 1845 261 m -26 Y s 1889 261 m -26 Y s 1934 261 m -26 Y s 1978 261 m -26 Y s 2023 286 m -51 Y s
 gsave  2222 2133 23 22 C 224.113 167.135 t 0 r /Helvetica findfont 68.4392 sf 0 0 m (0) show NC gr 
 gsave  2222 2133 23 22 C 425.434 167.135 t 0 r /Helvetica findfont 68.4392 sf 0 0 m (50) show NC gr 
 gsave  2222 2133 23 22 C 630.554 167.135 t 0 r /Helvetica findfont 68.4392 sf 0 0 m (100) show NC gr 
 gsave  2222 2133 23 22 C 850.869 167.135 t 0 r /Helvetica findfont 68.4392 sf 0 0 m (150) show NC gr 
 gsave  2222 2133 23 22 C 1074.98 167.135 t 0 r /Helvetica findfont 68.4392 sf 0 0 m (200) show NC gr 
 gsave  2222 2133 23 22 C 1299.09 167.135 t 0 r /Helvetica findfont 68.4392 sf 0 0 m (250) show NC gr 
 gsave  2222 2133 23 22 C 1519.41 167.135 t 0 r /Helvetica findfont 68.4392 sf 0 0 m (300) show NC gr 
 gsave  2222 2133 23 22 C 1743.52 167.135 t 0 r /Helvetica findfont 68.4392 sf 0 0 m (350) show NC gr 
 gsave  2222 2133 23 22 C 1963.83 167.135 t 0 r /Helvetica findfont 68.4392 sf 0 0 m (400) show NC gr  245 235 m 1706 Y s
 gsave  2222 2133 23 22 C 113.956 1162.35 t 90 r /Helvetica findfont 45.6261 sf 0 0 m (ll) show NC gr 
 gsave  2222 2133 23 22 C 45.5822 1162.35 t 90 r /Helvetica findfont 45.6261 sf 0 0 m (T) show NC gr 
 gsave  2222 2133 23 22 C 79.7689 1063.59 t 90 r /Helvetica findfont 68.4392 sf 0 0 m (/dp) show NC gr 
 gsave  2222 2133 23 22 C 79.7689 1021.8 t 90 r /Symbol findfont 68.4392 sf 0 0 m (s) show NC gr 
 gsave  2222 2133 23 22 C 79.7689 987.615 t 90 r /Helvetica findfont 68.4392 sf 0 0 m (d) show NC gr  298 235 m -53 X s 272 289 m -27 X s 272 344 m -27 X s 272 398 m -27 X s 298 453 m -53 X s 272 507 m -27 X s 272 561 m -27 X s 272 616 m -27 X s 298
 670 m -53 X s 272 724 m -27 X s 272 779 m -27 X s 272 833 m -27 X s 298 888 m -53 X s 272 942 m -27 X s 272 996 m -27 X s 272 1051 m -27 X s 298 1105 m -53 X s 272 1159 m -27 X s 272 1214 m -27 X s 272 1268 m -27 X s 298 1323 m -53 X s 272 1377 m
 -27 X s 272 1431 m -27 X s 272 1486 m -27 X s 298 1540 m -53 X s 272 1594 m -27 X s 272 1649 m -27 X s 272 1703 m -27 X s 298 1757 m -53 X s 298 1757 m -53 X s 272 1812 m -27 X s 272 1866 m -27 X s 272 1921 m -27 X s
 gsave  2222 2133 23 22 C 208.919 220.314 t 0 r /Helvetica findfont 38.0218 sf 0 0 m (0) show NC gr 
 gsave  2222 2133 23 22 C 136.747 440.628 t 0 r /Helvetica findfont 38.0218 sf 0 0 m (0.002) show NC gr 
 gsave  2222 2133 23 22 C 136.747 657.144 t 0 r /Helvetica findfont 38.0218 sf 0 0 m (0.004) show NC gr 
 gsave  2222 2133 23 22 C 136.747 873.66 t 0 r /Helvetica findfont 38.0218 sf 0 0 m (0.006) show NC gr 
 gsave  2222 2133 23 22 C 136.747 1090.18 t 0 r /Helvetica findfont 38.0218 sf 0 0 m (0.008) show NC gr 
 gsave  2222 2133 23 22 C 163.336 1310.49 t 0 r /Helvetica findfont 38.0218 sf 0 0 m (0.01) show NC gr 
 gsave  2222 2133 23 22 C 136.747 1527.01 t 0 r /Helvetica findfont 38.0218 sf 0 0 m (0.012) show NC gr 
 gsave  2222 2133 23 22 C 136.747 1743.52 t 0 r /Helvetica findfont 38.0218 sf 0 0 m (0.014) show NC gr  0.8 0 0.8 c 1 0 1 c /w 2 def /w2 {w 2 div} def /w3 {w 3 div} def 254 235 m20 272 235 m20 289 235 m20 307 235 m20 325 235 m20 343 235 m20 360 235
 m20 378 235 m20 396 235 m20 414 235 m20 432 235 m20 449 1295 m20 467 1698 m20 485 1764 m20 503 1802 m20 520 1833 m20 538 1860 m20 556 1843 m20 574 1825 m20 592 1714 m20 609 1508 m20 627 1367 m20 645 1254 m20 663 1158 m20 680 1072 m20 698 1014 m20
 716 945 m20 734 892 m20 752 849 m20 769 799 m20 787 762 m20 805 728 m20 823 690 m20 841 657 m20 858 630 m20 876 601 m20 894 575 m20 912 554 m20 929 530 m20 947 510 m20 965 489 m20 983 473 m20 1001 456 m20 1018 442 m20 1036 426 m20 1054 412 m20 1072
 400 m20 1089 388 m20 1107 376 m20 1125 367 m20 1143 357 m20 1161 348 m20 1178 340 m20 1196 333 m20 1214 326 m20 1232 318 m20 1249 312 m20 1267 307 m20 1285 301 m20 1303 296 m20 1321 293 m20 1338 286 m20 1356 283 m20 1374 278 m20 1392 275 m20 1409
 272 m20 1427 269 m20 1445 266 m20 1463 264 m20 1481 262 m20 1498 259 m20 1516 257 m20 1534 256 m20 1552 253 m20 1569 252 m20 1587 250 m20 1605 249 m20 1623 247 m20 1641 247 m20 1658 245 m20 1676 244 m20 1694 244 m20 1712 243 m20 1729 242 m20 1747
 241 m20 1765 241 m20 1783 240 m20 1801 240 m20 1818 239 m20 1836 239 m20 1854 238 m20 1872 238 m20 1889 238 m20 1907 237 m20 1925 237 m20 1943 237 m20 1961 237 m20 1978 236 m20 1996 236 m20 2014 236 m20 0.8 0 0.8 c black 0.8 0 0.8 c 1 lw <<
 /PatternType 1 /PaintType 2 /TilingType 1 /BBox [ 0 0 100 100 ] /XStep 100 /YStep 100 /PaintProc { begin gsave 0 0 m 100 100 l 0 100 m 100 0 l s gr end } >> [ 0.24 0 0 0.24 0 0 ] makepattern /P13 exch def /cs {[/Pattern /DeviceRGB] setcolorspace}
 def /FA {f [/DeviceRGB] setcolorspace} def cs 0.8 0 0.8 P13 setcolor 254 235 m 178 X 17 1067 d 18 404 d 18 67 d 18 38 d 17 30 d 18 28 d 18 -17 d 18 -18 d 18 -111 d 17 -207 d 18 -143 d 18 -113 d 18 -97 d 17 -86 d 18 -58 d 18 -71 d 18 -52 d 18 -44 d
 17 -50 d 18 -37 d 18 -34 d 18 -39 d 18 -33 d 17 -27 d 18 -29 d 18 -26 d 18 -21 d 17 -24 d 18 -20 d 18 -22 d 18 -16 d 18 -16 d 17 -15 d 18 -15 d 18 -15 d 18 -12 d 17 -12 d 18 -12 d 18 -9 d 18 -10 d 18 -9 d 17 -8 d 18 -8 d 18 -6 d 18 -8 d 17 -7 d 18
 -5 d 18 -5 d 18 -5 d 18 -4 d 17 -6 d 18 -4 d 18 -4 d 18 -3 d 17 -4 d 18 -3 d 18 -2 d 18 -3 d 18 -2 d 17 -3 d 18 -2 d 18 -1 d 18 -2 d 17 -2 d 18 -2 d 18 -1 d 18 -1 d 18 -1 d 17 -2 d 18 X 18 -1 d 18 -1 d 17 -1 d 18 -1 d 18 X 18 -1 d 18 X 17 -1 d 18 X
 18 -1 d 35 X 18 -1 d 54 X 17 -1 d 36 X -36 X -17 1 d -54 X -18 1 d -35 X -18 1 d -35 X -18 1 d -18 1 d -18 X -18 1 d -17 1 d -18 1 d -18 X -18 1 d -17 1 d -18 1 d -18 2 d -18 1 d -18 2 d -17 1 d -18 2 d -18 2 d -18 2 d -17 3 d -18 2 d -18 2 d -18 3
 d -18 3 d -17 3 d -18 3 d -18 4 d -18 4 d -17 6 d -18 4 d -18 5 d -18 5 d -18 5 d -17 7 d -18 7 d -18 7 d -18 7 d -17 8 d -18 9 d -18 10 d -18 9 d -18 12 d -17 12 d -18 12 d -18 14 d -18 16 d -17 14 d -18 16 d -18 16 d -18 21 d -18 21 d -17 23 d -18
 21 d -18 26 d -18 29 d -17 26 d -18 33 d -18 38 d -18 34 d -18 37 d -17 50 d -18 42 d -18 53 d -18 69 d -18 58 d -17 85 d -18 96 d -18 111 d -18 141 d -17 204 d -18 111 d -18 18 d -18 17 d -18 -27 d -17 -31 d -18 -37 d -18 -67 d -18 -401 d -17 -1053
 d -178 X FA 3 lw 0.8 0.8 0 c 1 1 1 c 1 1 0 c 0.8 0.8 0 c 245 235 m 195 X 709 Y 18 X 275 Y 18 X 49 Y 18 X 30 Y 18 X 25 Y 17 X 21 Y 18 X -11 Y 18 X -11 Y 18 X -78 Y 17 X -147 Y 18 X -99 Y 18 X -74 Y 18 X -61 Y 18 X -54 Y 17 X -37 Y 18 X -42 Y 18 X -33
 Y 18 X -29 Y 18 X -31 Y 17 X -24 Y 18 X -21 Y 18 X -25 Y 18 X -22 Y 17 X -18 Y 18 X -18 Y 18 X -18 Y 18 X -14 Y 18 X -16 Y 17 X -14 Y 18 X -15 Y 18 X -11 Y 18 X -12 Y 17 X -9 Y 18 X -12 Y 18 X -10 Y 18 X -9 Y 18 X -8 Y 17 X -10 Y 18 X -5 Y 18 X -9 Y
 18 X -6 Y 17 X -6 Y 18 X -6 Y 18 X -6 Y 18 X -5 Y 18 X -5 Y 17 X -5 Y 18 X -4 Y 18 X -4 Y 18 X -3 Y 17 X -5 Y 18 X -3 Y 18 X -4 Y 18 X -3 Y 18 X -2 Y 17 X -3 Y 18 X -2 Y 18 X -2 Y 18 X -2 Y 17 X -3 Y 18 X -2 Y 18 X -1 Y 18 X -2 Y 18 X -1 Y 17 X -1 Y
 18 X -2 Y 18 X -2 Y 35 X -2 Y 36 X -1 Y 18 X -1 Y 18 X -1 Y 17 X -1 Y 36 X -1 Y 35 X -1 Y 36 X -1 Y 36 X -1 Y 71 X -1 Y 71 X s 1 1 0 c 254 235 m20 272 235 m20 289 235 m20 307 235 m20 325 235 m20 343 235 m20 360 235 m20 378 235 m20 396 235 m20 414
 235 m20 432 235 m20 449 944 m20 467 1219 m20 485 1268 m20 503 1298 m20 520 1323 m20 538 1344 m20 556 1333 m20 574 1322 m20 592 1244 m20 609 1097 m20 627 998 m20 645 924 m20 663 863 m20 680 809 m20 698 772 m20 716 730 m20 734 697 m20 752 668 m20 769
 637 m20 787 613 m20 805 592 m20 823 567 m20 841 545 m20 858 527 m20 876 509 m20 894 491 m20 912 477 m20 929 461 m20 947 447 m20 965 432 m20 983 421 m20 1001 409 m20 1018 400 m20 1036 388 m20 1054 378 m20 1072 369 m20 1089 361 m20 1107 351 m20 1125
 346 m20 1143 337 m20 1161 331 m20 1178 325 m20 1196 319 m20 1214 313 m20 1232 308 m20 1249 303 m20 1267 298 m20 1285 294 m20 1303 290 m20 1321 287 m20 1338 282 m20 1356 279 m20 1374 275 m20 1392 272 m20 1409 270 m20 1427 267 m20 1445 265 m20 1463
 263 m20 1481 261 m20 1498 258 m20 1516 256 m20 1534 255 m20 1552 253 m20 1569 252 m20 1587 251 m20 1605 249 m20 1623 247 m20 1641 247 m20 1658 245 m20 1676 245 m20 1694 244 m20 1712 243 m20 1729 242 m20 1747 241 m20 1765 241 m20 1783 240 m20 1801
 240 m20 1818 239 m20 1836 239 m20 1854 238 m20 1872 238 m20 1889 237 m20 1907 237 m20 1925 237 m20 1943 237 m20 1961 236 m20 1978 236 m20 1996 236 m20 2014 236 m20 0.8 0.8 0 c black 0.8 0.8 0 c cs 0.8 0.8 0 P13 setcolor 254 235 m 178 X 17 713 d 18
 277 d 18 49 d 18 30 d 17 25 d 18 21 d 18 -11 d 18 -11 d 18 -79 d 17 -147 d 18 -100 d 18 -74 d 18 -62 d 17 -54 d 18 -37 d 18 -42 d 18 -34 d 18 -28 d 17 -32 d 18 -24 d 18 -21 d 18 -25 d 18 -23 d 17 -17 d 18 -19 d 18 -17 d 18 -15 d 17 -16 d 18 -14 d 18
 -15 d 18 -11 d 18 -12 d 17 -9 d 18 -12 d 18 -10 d 18 -9 d 17 -9 d 18 -9 d 18 -6 d 18 -8 d 18 -7 d 17 -6 d 18 -5 d 18 -6 d 18 -6 d 17 -5 d 18 -4 d 18 -5 d 18 -4 d 18 -3 d 17 -5 d 18 -3 d 18 -4 d 18 -2 d 17 -3 d 18 -3 d 18 -2 d 18 -2 d 18 -2 d 17 -2 d
 18 -3 d 18 -1 d 18 -2 d 17 -1 d 18 -1 d 18 -2 d 18 -1 d 18 -1 d 17 -1 d 18 -1 d 18 -1 d 18 -1 d 17 -1 d 18 X 18 -1 d 18 -1 d 18 X 17 -1 d 18 X 18 -1 d 35 X 18 -1 d 54 X 17 -1 d 36 X -53 X -18 1 d -54 X -17 1 d -18 X -18 1 d -35 X -18 1 d -18 1 d -18
 X -18 1 d -17 1 d -18 1 d -18 1 d -18 X -17 2 d -18 X -18 2 d -18 1 d -18 1 d -17 2 d -18 2 d -18 1 d -18 2 d -17 3 d -18 1 d -18 3 d -18 2 d -18 2 d -17 3 d -18 3 d -18 3 d -18 3 d -17 6 d -18 2 d -18 4 d -18 5 d -18 4 d -17 5 d -18 6 d -18 6 d -18
 5 d -17 6 d -18 6 d -18 9 d -18 5 d -18 10 d -17 8 d -18 9 d -18 10 d -18 12 d -17 9 d -18 12 d -18 11 d -18 14 d -18 15 d -17 16 d -18 14 d -18 17 d -18 18 d -17 18 d -18 22 d -18 25 d -18 21 d -18 24 d -17 31 d -18 29 d -18 33 d -18 42 d -18 36 d
 -17 54 d -18 61 d -18 73 d -18 98 d -17 146 d -18 78 d -18 11 d -18 11 d -18 -21 d -17 -25 d -18 -29 d -18 -49 d -18 -275 d -17 -704 d -178 X FA black 1 1 1 c black 245 235 m 195 X 844 Y 18 X 320 Y 18 X 52 Y 18 X 31 Y 18 X 25 Y 17 X 21 Y 18 X -11 Y
 18 X -16 Y 18 X -84 Y 17 X -159 Y 18 X -109 Y 18 X -86 Y 18 X -74 Y 18 X -67 Y 17 X -45 Y 18 X -54 Y 18 X -41 Y 18 X -35 Y 18 X -39 Y 17 X -30 Y 18 X -26 Y 18 X -31 Y 18 X -26 Y 17 X -22 Y 18 X -23 Y 18 X -21 Y 18 X -17 Y 18 X -19 Y 17 X -17 Y 18 X
 -17 Y 18 X -13 Y 18 X -14 Y 17 X -12 Y 18 X -13 Y 18 X -12 Y 18 X -10 Y 18 X -10 Y 17 X -11 Y 18 X -7 Y 18 X -9 Y 18 X -8 Y 17 X -6 Y 18 X -7 Y 18 X -6 Y 18 X -7 Y 18 X -5 Y 17 X -5 Y 18 X -5 Y 18 X -4 Y 18 X -4 Y 17 X -5 Y 18 X -4 Y 18 X -4 Y 18 X
 -3 Y 18 X -2 Y 17 X -3 Y 18 X -3 Y 18 X -2 Y 18 X -2 Y 17 X -3 Y 18 X -2 Y 18 X -1 Y 18 X -2 Y 18 X -2 Y 17 X -1 Y 18 X -2 Y 18 X -1 Y 18 X -1 Y 17 X -1 Y 18 X -1 Y 18 X -1 Y 18 X -1 Y 18 X -1 Y 17 X -1 Y 36 X -1 Y 18 X -1 Y 53 X -1 Y 36 X -1 Y 53 X
 -1 Y 71 X -1 Y 18 X s 254 235 m20 272 235 m20 289 235 m20 307 235 m20 325 235 m20 343 235 m20 360 235 m20 378 235 m20 396 235 m20 414 235 m20 432 235 m20 449 1079 m20 467 1399 m20 485 1451 m20 503 1482 m20 520 1507 m20 538 1528 m20 556 1517 m20 574
 1501 m20 592 1417 m20 609 1258 m20 627 1149 m20 645 1063 m20 663 989 m20 680 922 m20 698 877 m20 716 823 m20 734 782 m20 752 747 m20 769 708 m20 787 678 m20 805 652 m20 823 621 m20 841 595 m20 858 573 m20 876 550 m20 894 529 m20 912 512 m20 929 493
 m20 947 476 m20 965 459 m20 983 446 m20 1001 432 m20 1018 420 m20 1036 407 m20 1054 395 m20 1072 385 m20 1089 375 m20 1107 364 m20 1125 357 m20 1143 348 m20 1161 340 m20 1178 334 m20 1196 327 m20 1214 321 m20 1232 314 m20 1249 309 m20 1267 304 m20
 1285 299 m20 1303 295 m20 1321 291 m20 1338 286 m20 1356 282 m20 1374 278 m20 1392 275 m20 1409 273 m20 1427 270 m20 1445 267 m20 1463 265 m20 1481 263 m20 1498 260 m20 1516 258 m20 1534 257 m20 1552 255 m20 1569 253 m20 1587 252 m20 1605 250 m20
 1623 249 m20 1641 248 m20 1658 247 m20 1676 246 m20 1694 245 m20 1712 244 m20 1729 243 m20 1747 242 m20 1765 242 m20 1783 241 m20 1801 240 m20 1818 240 m20 1836 240 m20 1854 239 m20 1872 239 m20 1889 238 m20 1907 238 m20 1925 238 m20 1943 237 m20
 1961 237 m20 1978 237 m20 1996 237 m20 2014 236 m20 cs 0 0 0 P13 setcolor 254 235 m 178 X 17 849 d 18 321 d 18 52 d 18 32 d 17 24 d 18 21 d 18 -11 d 18 -15 d 18 -85 d 17 -159 d 18 -110 d 18 -87 d 18 -75 d 17 -66 d 18 -46 d 18 -54 d 18 -41 d 18 -35 d
 17 -39 d 18 -30 d 18 -27 d 18 -31 d 18 -26 d 17 -22 d 18 -23 d 18 -21 d 18 -17 d 17 -20 d 18 -16 d 18 -18 d 18 -13 d 18 -14 d 17 -11 d 18 -14 d 18 -12 d 18 -10 d 17 -10 d 18 -11 d 18 -7 d 18 -9 d 18 -8 d 17 -7 d 18 -6 d 18 -6 d 18 -7 d 17 -6 d 18 -4
 d 18 -5 d 18 -5 d 18 -3 d 17 -6 d 18 -3 d 18 -4 d 18 -3 d 17 -3 d 18 -3 d 18 -2 d 18 -3 d 18 -2 d 17 -2 d 18 -3 d 18 -1 d 18 -2 d 17 -2 d 18 -1 d 18 -1 d 18 -2 d 18 -1 d 17 -1 d 18 -1 d 18 -1 d 18 -1 d 17 -1 d 18 X 18 -1 d 18 -1 d 18 X 17 -1 d 18 X
 18 -1 d 18 X 17 -1 d 36 X 18 -1 d 71 X -1 Y -18 1 d -53 X -18 1 d -36 X -17 1 d -36 X -18 1 d -17 X -18 1 d -18 1 d -18 X -18 1 d -17 1 d -18 1 d -18 1 d -18 X -17 2 d -18 1 d -18 1 d -18 2 d -18 1 d -17 1 d -18 3 d -18 1 d -18 2 d -17 3 d -18 2 d
 -18 2 d -18 2 d -18 3 d -17 3 d -18 3 d -18 4 d -18 3 d -17 6 d -18 3 d -18 5 d -18 5 d -18 4 d -17 6 d -18 6 d -18 7 d -18 6 d -17 7 d -18 7 d -18 10 d -18 7 d -18 10 d -17 10 d -18 10 d -18 12 d -18 13 d -17 12 d -18 14 d -18 13 d -18 17 d -18 16
 d -17 20 d -18 17 d -18 21 d -18 22 d -17 22 d -18 26 d -18 31 d -18 26 d -18 30 d -17 39 d -18 34 d -18 41 d -18 53 d -18 45 d -17 67 d -18 74 d -18 85 d -18 109 d -17 157 d -18 85 d -18 15 d -18 11 d -18 -21 d -17 -24 d -18 -31 d -18 -52 d -18
 -319 d -17 -839 d -178 X FA 0.8 0 0 c 1 1 1 c 1 0 0 c 0.8 0 0 c 245 235 m 195 X 157 Y 18 X 59 Y 18 X 8 Y 18 X 8 Y 18 X 4 Y 17 X 3 Y 36 X -4 Y 18 X -11 Y 17 X -22 Y 18 X -15 Y 18 X -12 Y 18 X -11 Y 18 X -11 Y 17 X -7 Y 18 X -8 Y 18 X -7 Y 18 X -6 Y
 18 X -7 Y 17 X -5 Y 18 X -5 Y 18 X -6 Y 18 X -5 Y 17 X -5 Y 18 X -4 Y 18 X -5 Y 18 X -4 Y 18 X -4 Y 17 X -3 Y 18 X -4 Y 18 X -3 Y 18 X -4 Y 17 X -2 Y 18 X -4 Y 18 X -3 Y 18 X -2 Y 18 X -3 Y 17 X -2 Y 18 X -2 Y 18 X -3 Y 18 X -2 Y 17 X -2 Y 18 X -2 Y
 18 X -2 Y 18 X -2 Y 18 X -2 Y 17 X -1 Y 18 X -1 Y 18 X -2 Y 18 X -1 Y 17 X -2 Y 18 X -1 Y 18 X -1 Y 18 X -2 Y 35 X -1 Y 18 X -1 Y 18 X -1 Y 18 X -1 Y 17 X -1 Y 18 X -1 Y 36 X -1 Y 18 X -1 Y 35 X -1 Y 36 X -1 Y 35 X -1 Y 36 X -1 Y 53 X -1 Y 53 X -1 Y
 107 X -1 Y 107 X s 1 0 0 c 254 235 m20 272 235 m20 289 235 m20 307 235 m20 325 235 m20 343 235 m20 360 235 m20 378 235 m20 396 235 m20 414 235 m20 432 235 m20 449 392 m20 467 451 m20 485 459 m20 503 467 m20 520 471 m20 538 474 m20 556 474 m20 574
 470 m20 592 459 m20 609 437 m20 627 422 m20 645 410 m20 663 399 m20 680 388 m20 698 381 m20 716 373 m20 734 366 m20 752 360 m20 769 353 m20 787 348 m20 805 343 m20 823 337 m20 841 332 m20 858 327 m20 876 323 m20 894 318 m20 912 314 m20 929 310 m20
 947 307 m20 965 303 m20 983 300 m20 1001 296 m20 1018 294 m20 1036 290 m20 1054 287 m20 1072 285 m20 1089 282 m20 1107 280 m20 1125 278 m20 1143 275 m20 1161 273 m20 1178 271 m20 1196 269 m20 1214 267 m20 1232 265 m20 1249 263 m20 1267 262 m20 1285
 261 m20 1303 259 m20 1321 258 m20 1338 256 m20 1356 255 m20 1374 254 m20 1392 252 m20 1409 252 m20 1427 251 m20 1445 250 m20 1463 249 m20 1481 248 m20 1498 247 m20 1516 246 m20 1534 246 m20 1552 245 m20 1569 244 m20 1587 244 m20 1605 243 m20 1623
 243 m20 1641 242 m20 1658 242 m20 1676 241 m20 1694 241 m20 1712 240 m20 1729 240 m20 1747 240 m20 1765 239 m20 1783 239 m20 1801 239 m20 1818 238 m20 1836 238 m20 1854 238 m20 1872 238 m20 1889 238 m20 1907 238 m20 1925 237 m20 1943 237 m20 1961
 237 m20 1978 237 m20 1996 237 m20 2014 237 m20 0.8 0 0 c black 0.8 0 0 c cs 0.8 0 0 P13 setcolor 254 235 m 178 X 17 158 d 18 59 d 18 8 d 18 7 d 17 5 d 18 3 d 18 X 18 -4 d 18 -11 d 17 -22 d 18 -16 d 18 -11 d 18 -12 d 17 -10 d 18 -7 d 18 -8 d 18 -7 d
 18 -7 d 17 -6 d 18 -6 d 18 -5 d 18 -6 d 18 -5 d 17 -4 d 18 -5 d 18 -4 d 18 -4 d 17 -4 d 18 -4 d 18 -4 d 18 -3 d 18 -3 d 17 -3 d 18 -3 d 18 -3 d 18 -3 d 17 -2 d 18 -3 d 18 -2 d 18 -3 d 18 -2 d 17 -2 d 18 -2 d 18 -2 d 18 -2 d 17 -1 d 18 -1 d 18 -2 d
 18 -2 d 18 -1 d 17 -1 d 18 -2 d 18 -1 d 18 -1 d 17 -1 d 18 -1 d 18 -1 d 18 -1 d 18 -1 d 17 -1 d 18 -1 d 18 X 18 -1 d 17 -1 d 18 X 18 -1 d 18 X 18 -1 d 17 X 18 -1 d 18 X 18 -1 d 35 X 18 -1 d 53 X 18 -1 d 71 X 18 -1 d 89 X -107 X -18 1 d -71 X -17 1 d
 -36 X -18 1 d -35 X -18 1 d -18 X -18 1 d -17 X -18 1 d -18 X -18 1 d -18 X -17 1 d -18 1 d -18 X -18 1 d -17 1 d -18 1 d -18 X -18 2 d -18 1 d -17 X -18 1 d -18 2 d -18 1 d -17 1 d -18 2 d -18 1 d -18 2 d -18 1 d -17 2 d -18 2 d -18 2 d -18 2 d -17
 2 d -18 2 d -18 2 d -18 2 d -18 3 d -17 2 d -18 3 d -18 3 d -18 4 d -17 2 d -18 4 d -18 3 d -18 3 d -18 4 d -17 4 d -18 4 d -18 4 d -18 5 d -17 4 d -18 5 d -18 6 d -18 5 d -18 6 d -17 6 d -18 7 d -18 7 d -18 8 d -18 7 d -17 10 d -18 11 d -18 12 d
 -18 16 d -17 21 d -18 11 d -18 5 d -18 -1 d -18 -3 d -17 -4 d -18 -8 d -18 -8 d -18 -59 d -17 -156 d -178 X FA black 1 1 1 c 556 639 1578 1302 bf black 1578 1302 m 556 X s 2134 1302 m 639 Y s 2134 1941 m -556 X s 1578 1941 m -639 Y s
 gsave  2222 2133 23 22 C 1716.93 1827.09 t 0 r /Helvetica findfont 95.0544 sf 0 0 m (No Int) show NC gr  0.8 0 0 c 1599 1861 m 97 X s black
 gsave  2222 2133 23 22 C 1716.93 1663.75 t 0 r /Helvetica findfont 95.0544 sf 0 0 m (Add) show NC gr  0.8 0.8 0 c 1599 1702 m 97 X s black
 gsave  2222 2133 23 22 C 1716.93 1504.21 t 0 r /Helvetica findfont 95.0544 sf 0 0 m (Mult) show NC gr  0.8 0 0.8 c 1599 1542 m 97 X s black
 gsave  2222 2133 23 22 C 1716.93 1344.68 t 0 r /Helvetica findfont 95.0544 sf 0 0 m (Central) show NC gr  1599 1382 m 97 X s
 gsave  2222 2133 23 22 C 2199.34 1568.79 t 90 r /Helvetica-BoldOblique findfont 38.0218 sf 0 0 m (LHC HIGGS XS WG 2013) show NC gr 
 gr  gr showpage
end
%%EOF
