%!PS-Adobe-2.0 EPSF-2.0
%%BoundingBox:  0 0 567 384
%%Title: /home/carrazza/Desktop/yrplots/gg_8tev_default_as_rel.eps: c1_n2
%%Creator: ROOT Version 5.34/07
%%CreationDate: Thu Jun  6 16:51:25 2013
%%EndComments
%%BeginProlog
80 dict begin
/s {stroke} def /l {lineto} def /m {moveto} def /t {translate} def
/r {rotate} def /rl {roll}  def /R {repeat} def
/d {rlineto} def /rm {rmoveto} def /gr {grestore} def /f {eofill} def
/c {setrgbcolor} def /black {0 setgray} def /sd {setdash} def
/cl {closepath} def /sf {scalefont setfont} def /lw {setlinewidth} def
/box {m dup 0 exch d exch 0 d 0 exch neg d cl} def
/NC{systemdict begin initclip end}def/C{NC box clip newpath}def
/bl {box s} def /bf {box f} def /Y { 0 exch d} def /X { 0 d} def 
/K {{pop pop 0 moveto} exch kshow} bind def
/ita {/ang 15 def gsave [1 0 ang dup sin exch cos div 1 0 0] concat} def 
/mp {newpath /y exch def /x exch def} def
/side {[w .77 mul w .23 mul] .385 w mul sd w 0 l currentpoint t -144 r} def
/mr {mp x y w2 0 360 arc} def /m24 {mr s} def /m20 {mr f} def
/mb {mp x y w2 add m w2 neg 0 d 0 w neg d w 0 d 0 w d cl} def
/mt {mp x y w2 add m w2 neg w neg d w 0 d cl} def
/m21 {mb f} def /m25 {mb s} def /m22 {mt f} def /m26{mt s} def
/m23 {mp x y w2 sub m w2 w d w neg 0 d cl f} def
/m27 {mp x y w2 add m w3 neg w2 neg d w3 w2 neg d w3 w2 d cl s} def
/m28 {mp x w2 sub y w2 sub w3 add m w3 0 d  0 w3 neg d w3 0 d 0 w3 d w3 0 d  0 w3 d w3 neg 0 d 0 w3 d w3 neg 0 d 0 w3 neg d w3 neg 0 d cl s } def
/m29 {mp gsave x w2 sub y w2 add w3 sub m currentpoint t 4 {side} repeat cl fill gr} def
/m30 {mp gsave x w2 sub y w2 add w3 sub m currentpoint t 4 {side} repeat cl s gr} def
/m31 {mp x y w2 sub m 0 w d x w2 sub y m w 0 d x w2 sub y w2 add m w w neg d x w2 sub y w2 sub m w w d s} def
/m32 {mp x y w2 sub m w2 w d w neg 0 d cl s} def
/m33 {mp x y w2 add m w3 neg w2 neg d w3 w2 neg d w3 w2 d cl f} def
/m34 {mp x w2 sub y w2 sub w3 add m w3 0 d  0 w3 neg d w3 0 d 0 w3 d w3 0 d  0 w3 d w3 neg 0 d 0 w3 d w3 neg 0 d 0 w3 neg d w3 neg 0 d cl f } def
/m2 {mp x y w2 sub m 0 w d x w2 sub y m w 0 d s} def
/m5 {mp x w2 sub y w2 sub m w w d x w2 sub y w2 add m w w neg d s} def
/reEncode {exch findfont dup length dict begin {1 index /FID eq  {pop pop} {def} ifelse } forall /Encoding exch def currentdict end dup /FontName get exch definefont pop } def [/Times-Bold /Times-Italic /Times-BoldItalic /Helvetica /Helvetica-Oblique
 /Helvetica-Bold /Helvetica-BoldOblique /Courier /Courier-Oblique /Courier-Bold /Courier-BoldOblique /Times-Roman /AvantGarde-Book /AvantGarde-BookOblique /AvantGarde-Demi /AvantGarde-DemiOblique /Bookman-Demi /Bookman-DemiItalic /Bookman-Light
 /Bookman-LightItalic /Helvetica-Narrow /Helvetica-Narrow-Bold /Helvetica-Narrow-BoldOblique /Helvetica-Narrow-Oblique /NewCenturySchlbk-Roman /NewCenturySchlbk-Bold /NewCenturySchlbk-BoldItalic /NewCenturySchlbk-Italic /Palatino-Bold
 /Palatino-BoldItalic /Palatino-Italic /Palatino-Roman ] {ISOLatin1Encoding reEncode } forall
%%EndProlog
%%BeginSetup
%%EndSetup
newpath  gsave  .25 .25 scale  gsave  0 0 t black[  ] 0 sd 3 lw 1 1 1 c 2268 1538 0 0 bf black 1 1 1 c 1814 1230 227 154 bf black 1814 1230 227 154 bl 1 1 1 c 1814 1230 227 154 bf black 1814 1230 227 154 bl 227 154 m 1814 X s
 gsave  2268 1538 0 0 C 1143.63 16.2911 t 0 r /Helvetica findfont 48.8732 sf 0 0 m (X) show NC gr 
 gsave  2268 1538 0 0 C 1088.24 35.8403 t 0 r /Helvetica findfont 71.6807 sf 0 0 m (M) show NC gr  437 172 m -18 Y s 559 172 m -18 Y s 647 172 m -18 Y s 714 172 m -18 Y s 769 172 m -18 Y s 816 172 m -18 Y s 856 172 m -18 Y s 892 172 m -18 Y s 924 191
 m -37 Y s
 gsave  2268 1538 0 0 C 948.14 91.23 t 0 r /Helvetica findfont 48.8732 sf 0 0 m (2) show NC gr 
 gsave  2268 1538 0 0 C 869.943 58.6478 t 0 r /Helvetica findfont 71.6807 sf 0 0 m (10) show NC gr  1134 172 m -18 Y s 1257 172 m -18 Y s 1344 172 m -18 Y s 1411 172 m -18 Y s 1467 172 m -18 Y s 1513 172 m -18 Y s 1554 172 m -18 Y s 1589 172 m -18 Y
 s 1621 191 m -37 Y s
 gsave  2268 1538 0 0 C 1645.4 94.4882 t 0 r /Helvetica findfont 48.8732 sf 0 0 m (3) show NC gr 
 gsave  2268 1538 0 0 C 1567.2 58.6478 t 0 r /Helvetica findfont 71.6807 sf 0 0 m (10) show NC gr  1831 172 m -18 Y s 1954 172 m -18 Y s 2041 172 m -18 Y s 227 1384 m 1814 X s 437 1366 m 18 Y s 559 1366 m 18 Y s 647 1366 m 18 Y s 714 1366 m 18 Y s
 769 1366 m 18 Y s 816 1366 m 18 Y s 856 1366 m 18 Y s 892 1366 m 18 Y s 924 1347 m 37 Y s 1134 1366 m 18 Y s 1257 1366 m 18 Y s 1344 1366 m 18 Y s 1411 1366 m 18 Y s 1467 1366 m 18 Y s 1513 1366 m 18 Y s 1554 1366 m 18 Y s 1589 1366 m 18 Y s 1621
 1347 m 37 Y s 1831 1366 m 18 Y s 1954 1366 m 18 Y s 2041 1366 m 18 Y s 227 154 m 1230 Y s
 gsave  2268 1538 0 0 C 61.9061 364.92 t 90 r /Helvetica findfont 71.6807 sf 0 0 m (Gluon \255 Gluon Luminosity) show NC gr  281 154 m -54 X s 254 195 m -27 X s 254 236 m -27 X s 254 277 m -27 X s 254 318 m -27 X s 281 359 m -54 X s 254 400 m -27 X s
 254 441 m -27 X s 254 482 m -27 X s 254 523 m -27 X s 281 564 m -54 X s 254 605 m -27 X s 254 646 m -27 X s 254 687 m -27 X s 254 728 m -27 X s 281 769 m -54 X s 254 810 m -27 X s 254 851 m -27 X s 254 892 m -27 X s 254 933 m -27 X s 281 974 m -54 X
 s 254 1015 m -27 X s 254 1056 m -27 X s 254 1097 m -27 X s 254 1138 m -27 X s 281 1179 m -54 X s 254 1220 m -27 X s 254 1261 m -27 X s 254 1302 m -27 X s 254 1343 m -27 X s 281 1384 m -54 X s 281 154 m -54 X s 281 1384 m -54 X s
 gsave  2268 1538 0 0 C 94.4882 130.329 t 0 r /Helvetica findfont 71.6807 sf 0 0 m (\2550.3) show NC gr 
 gsave  2268 1538 0 0 C 94.4882 335.596 t 0 r /Helvetica findfont 71.6807 sf 0 0 m (\2550.2) show NC gr 
 gsave  2268 1538 0 0 C 104.263 540.863 t 0 r /Helvetica findfont 71.6807 sf 0 0 m (\2550.1) show NC gr 
 gsave  2268 1538 0 0 C 175.944 742.873 t 0 r /Helvetica findfont 71.6807 sf 0 0 m (0) show NC gr 
 gsave  2268 1538 0 0 C 130.329 948.14 t 0 r /Helvetica findfont 71.6807 sf 0 0 m (0.1) show NC gr 
 gsave  2268 1538 0 0 C 117.296 1153.41 t 0 r /Helvetica findfont 71.6807 sf 0 0 m (0.2) show NC gr 
 gsave  2268 1538 0 0 C 117.296 1358.67 t 0 r /Helvetica findfont 71.6807 sf 0 0 m (0.3) show NC gr  2041 154 m 1230 Y s 1987 154 m 54 X s 2014 195 m 27 X s 2014 236 m 27 X s 2014 277 m 27 X s 2014 318 m 27 X s 1987 359 m 54 X s 2014 400 m 27 X s
 2014 441 m 27 X s 2014 482 m 27 X s 2014 523 m 27 X s 1987 564 m 54 X s 2014 605 m 27 X s 2014 646 m 27 X s 2014 687 m 27 X s 2014 728 m 27 X s 1987 769 m 54 X s 2014 810 m 27 X s 2014 851 m 27 X s 2014 892 m 27 X s 2014 933 m 27 X s 1987 974 m 54 X
 s 2014 1015 m 27 X s 2014 1056 m 27 X s 2014 1097 m 27 X s 2014 1138 m 27 X s 1987 1179 m 54 X s 2014 1220 m 27 X s 2014 1261 m 27 X s 2014 1302 m 27 X s 2014 1343 m 27 X s 1987 1384 m 54 X s 1987 154 m 54 X s 1987 1384 m 54 X s 0 0.6 0 c[ 12 12] 0
 sd 6 lw 0 1 0 c black 0 0.6 0 c 227 908 m 67 -48 d 66 -28 d 67 -15 d 67 -9 d 67 -7 d 67 -4 d 66 -2 d 67 -4 d 67 -1 d 133 X 67 2 d 67 4 d 67 4 d 67 7 d 66 9 d 67 13 d 67 16 d 67 20 d 67 26 d 66 33 d 67 41 d 67 57 d 67 85 d 67 142 d 34 135 d s black 0
 0.6 0 c 227 630 m 67 48 d 66 27 d 67 16 d 67 9 d 67 7 d 67 4 d 66 2 d 67 4 d 67 1 d 67 X 66 -1 d 67 -2 d 67 -3 d 67 -5 d 67 -6 d 66 -10 d 67 -12 d 67 -16 d 67 -21 d 67 -25 d 66 -33 d 67 -41 d 67 -57 d 67 -86 d 67 -142 d 34 -134 d s 1 0 0 c[ 12 16 4
 16] 0 sd black 1 0 0 c 227 916 m 67 -23 d 66 -16 d 67 -12 d 67 -10 d 67 -9 d 67 -7 d 66 -8 d 67 -6 d 67 -6 d 67 -6 d 66 -4 d 67 -3 d 67 1 d 67 4 d 67 9 d 66 13 d 67 18 d 67 22 d 67 29 d 67 37 d 66 47 d 67 61 d 67 83 d 67 115 d 56 139 d s black 1 0 0
 c 227 622 m 67 23 d 66 16 d 67 12 d 67 10 d 67 9 d 67 7 d 66 7 d 67 7 d 67 6 d 67 6 d 66 4 d 67 3 d 67 -1 d 67 -4 d 67 -9 d 66 -13 d 67 -18 d 67 -22 d 67 -29 d 67 -37 d 66 -47 d 67 -62 d 67 -82 d 67 -115 d 56 -139 d s 0 0 1 c[ 20 20] 0 sd black 0 0
 1 c 227 886 m 67 -27 d 66 -15 d 67 -11 d 67 -7 d 67 -6 d 67 -5 d 66 -4 d 67 -4 d 67 -3 d 67 -2 d 66 X 67 1 d 67 4 d 67 5 d 67 8 d 66 9 d 67 12 d 67 13 d 67 15 d 67 18 d 66 22 d 67 26 d 67 34 d 67 46 d 67 63 d 66 93 d 67 138 d 11 31 d s black 0 0 1 c
 227 652 m 67 26 d 66 16 d 67 10 d 67 8 d 67 6 d 67 5 d 66 4 d 67 4 d 67 3 d 67 2 d 66 X 67 -1 d 67 -4 d 67 -6 d 67 -7 d 66 -10 d 67 -11 d 67 -13 d 67 -15 d 67 -18 d 66 -22 d 67 -26 d 67 -34 d 67 -46 d 67 -64 d 66 -92 d 67 -139 d 11 -30 d s black[  ]
 0 sd 3 lw 1 1 1 c 839 323 295 1015 bf black 295 1015 m 839 X s 1134 1015 m 323 Y s 1134 1338 m -839 X s 295 1338 m -323 Y s
 gsave  2268 1538 0 0 C 501.765 1264.19 t 0 r /Helvetica findfont 55.3896 sf 0 0 m (NNPDF2.3 NNLO) show NC gr  0 0.6 0 c[ 12 12] 0 sd 6 lw 326 1284 m 147 X s black
 gsave  2268 1538 0 0 C 501.765 1156.67 t 0 r /Helvetica findfont 55.3896 sf 0 0 m (CT10 NNLO) show NC gr  1 0 0 c[ 12 16 4 16] 0 sd 326 1176 m 147 X s black
 gsave  2268 1538 0 0 C 501.765 1049.14 t 0 r /Helvetica findfont 55.3896 sf 0 0 m (MSTW2008 NNLO) show NC gr  0 0 1 c[ 20 20] 0 sd 326 1069 m 147 X s 1 1 1 c black
 gsave  2268 1538 0 0 C 1629.11 1466.2 t 0 r /Helvetica findfont 65.1643 sf 0 0 m ( = 0.118) show NC gr 
 gsave  2268 1538 0 0 C 1606.3 1449.9 t 0 r /Helvetica findfont 42.3568 sf 0 0 m (s) show NC gr 
 gsave  2268 1538 0 0 C 1563.94 1466.2 t 0 r /Symbol findfont 65.1643 sf 0 0 m (a) show NC gr 
 gsave  2268 1538 0 0 C 400.76 1466.2 t 0 r /Helvetica findfont 65.1643 sf 0 0 m (LHC 8 TeV \255 Relative PDF uncertainty \255 ) show NC gr 
 gsave  2268 1538 0 0 C 2166.71 847.135 t 90 r /Helvetica-BoldOblique findfont 45.615 sf 0 0 m (LHC HIGGS XS WG 2013) show NC gr 
 gr  gr showpage
end
%%EOF
