%!PS-Adobe-2.0 EPSF-2.0
%%BoundingBox:  0 0 567 639
%%Title: PlotsForYR3/HResPowhegOthersInclusive_qT0to200_125_lin.eps: Canvas
%%Creator: ROOT Version 5.28/00c
%%CreationDate: Wed Mar 13 15:30:15 2013
%%EndComments
%%BeginProlog
80 dict begin
/s {stroke} def /l {lineto} def /m {moveto} def /t {translate} def
/r {rotate} def /rl {roll}  def /R {repeat} def
/d {rlineto} def /rm {rmoveto} def /gr {grestore} def /f {eofill} def
/c {setrgbcolor} def /black {0 setgray} def /sd {setdash} def
/cl {closepath} def /sf {scalefont setfont} def /lw {setlinewidth} def
/box {m dup 0 exch d exch 0 d 0 exch neg d cl} def
/NC{systemdict begin initclip end}def/C{NC box clip newpath}def
/bl {box s} def /bf {box f} def /Y { 0 exch d} def /X { 0 d} def 
/K {{pop pop 0 moveto} exch kshow} bind def
/ita {/ang 15 def gsave [1 0 ang dup sin exch cos div 1 0 0] concat} def 
/mp {newpath /y exch def /x exch def} def
/side {[w .77 mul w .23 mul] .385 w mul sd w 0 l currentpoint t -144 r} def
/mr {mp x y w2 0 360 arc} def /m24 {mr s} def /m20 {mr f} def
/mb {mp x y w2 add m w2 neg 0 d 0 w neg d w 0 d 0 w d cl} def
/mt {mp x y w2 add m w2 neg w neg d w 0 d cl} def
/m21 {mb f} def /m25 {mb s} def /m22 {mt f} def /m26{mt s} def
/m23 {mp x y w2 sub m w2 w d w neg 0 d cl f} def
/m27 {mp x y w2 add m w3 neg w2 neg d w3 w2 neg d w3 w2 d cl s} def
/m28 {mp x w2 sub y w2 sub w3 add m w3 0 d  0 w3 neg d w3 0 d 0 w3 d w3 0 d  0 w3 d w3 neg 0 d 0 w3 d w3 neg 0 d 0 w3 neg d w3 neg 0 d cl s } def
/m29 {mp gsave x w2 sub y w2 add w3 sub m currentpoint t 4 {side} repeat cl fill gr} def
/m30 {mp gsave x w2 sub y w2 add w3 sub m currentpoint t 4 {side} repeat cl s gr} def
/m31 {mp x y w2 sub m 0 w d x w2 sub y m w 0 d x w2 sub y w2 add m w w neg d x w2 sub y w2 sub m w w d s} def
/m32 {mp x y w2 sub m w2 w d w neg 0 d cl s} def
/m33 {mp x y w2 add m w3 neg w2 neg d w3 w2 neg d w3 w2 d cl f} def
/m34 {mp x w2 sub y w2 sub w3 add m w3 0 d  0 w3 neg d w3 0 d 0 w3 d w3 0 d  0 w3 d w3 neg 0 d 0 w3 d w3 neg 0 d 0 w3 neg d w3 neg 0 d cl f } def
/m2 {mp x y w2 sub m 0 w d x w2 sub y m w 0 d s} def
/m5 {mp x w2 sub y w2 sub m w w d x w2 sub y w2 add m w w neg d s} def
/reEncode {exch findfont dup length dict begin {1 index /FID eq  {pop pop} {def} ifelse } forall /Encoding exch def currentdict end dup /FontName get exch definefont pop } def [/Times-Bold /Times-Italic /Times-BoldItalic /Helvetica /Helvetica-Oblique
 /Helvetica-Bold /Helvetica-BoldOblique /Courier /Courier-Oblique /Courier-Bold /Courier-BoldOblique /Times-Roman /AvantGarde-Book /AvantGarde-BookOblique /AvantGarde-Demi /AvantGarde-DemiOblique /Bookman-Demi /Bookman-DemiItalic /Bookman-Light
 /Bookman-LightItalic /Helvetica-Narrow /Helvetica-Narrow-Bold /Helvetica-Narrow-BoldOblique /Helvetica-Narrow-Oblique /NewCenturySchlbk-Roman /NewCenturySchlbk-Bold /NewCenturySchlbk-BoldItalic /NewCenturySchlbk-Italic /Palatino-Bold
 /Palatino-BoldItalic /Palatino-Italic /Palatino-Roman ] {ISOLatin1Encoding reEncode } forall%%EndProlog
%%BeginSetup
%%EndSetup
newpath  gsave  .25 .25 scale  gsave  0 0 t black[  ] 0 sd 3 lw 1 1 1 c 2268 2557 0 0 bf black 1 1 1 c 2268 2557 0 0 bf black 1 1 1 c 1791 1790 363 639 bf black 1791 1790 363 639 bl 6 lw 1 1 1 c black 363 639 m 1791 X s 3 lw 363 639 m 1791 X s
 gsave  2268 2557 0 0 C 1841.57 441.368 t 0 r /Helvetica findfont 106.537 sf 0 0 m ( \(GeV\)) show NC gr 
 gsave  2268 2557 0 0 C 1795.91 388.099 t 0 r /Helvetica findfont 72.293 sf 0 0 m (T) show NC gr 
 gsave  2268 2557 0 0 C 1438.25 441.368 t 0 r /Helvetica findfont 106.537 sf 0 0 m (Higgs p) show NC gr  363 700 m -61 Y s 408 670 m -31 Y s 452 670 m -31 Y s 497 670 m -31 Y s 542 700 m -61 Y s 587 670 m -31 Y s 632 670 m -31 Y s 676 670 m -31 Y s
 721 700 m -61 Y s 766 670 m -31 Y s 811 670 m -31 Y s 855 670 m -31 Y s 900 700 m -61 Y s 945 670 m -31 Y s 990 670 m -31 Y s 1035 670 m -31 Y s 1079 700 m -61 Y s 1124 670 m -31 Y s 1169 670 m -31 Y s 1214 670 m -31 Y s 1259 700 m -61 Y s 1303 670
 m -31 Y s 1348 670 m -31 Y s 1393 670 m -31 Y s 1438 700 m -61 Y s 1483 670 m -31 Y s 1527 670 m -31 Y s 1572 670 m -31 Y s 1617 700 m -61 Y s 1662 670 m -31 Y s 1706 670 m -31 Y s 1751 670 m -31 Y s 1796 700 m -61 Y s 1841 670 m -31 Y s 1886 670 m
 -31 Y s 1930 670 m -31 Y s 1975 700 m -61 Y s 2020 670 m -31 Y s 2065 670 m -31 Y s 2110 670 m -31 Y s 2154 700 m -61 Y s
 gsave  2268 2557 0 0 C 331.026 525.075 t 0 r /Helvetica findfont 106.537 sf 0 0 m (0) show NC gr 
 gsave  2268 2557 0 0 C 483.221 525.075 t 0 r /Helvetica findfont 106.537 sf 0 0 m (20) show NC gr 
 gsave  2268 2557 0 0 C 662.051 525.075 t 0 r /Helvetica findfont 106.537 sf 0 0 m (40) show NC gr 
 gsave  2268 2557 0 0 C 840.881 525.075 t 0 r /Helvetica findfont 106.537 sf 0 0 m (60) show NC gr 
 gsave  2268 2557 0 0 C 1019.71 525.075 t 0 r /Helvetica findfont 106.537 sf 0 0 m (80) show NC gr 
 gsave  2268 2557 0 0 C 1168.1 525.075 t 0 r /Helvetica findfont 106.537 sf 0 0 m (100) show NC gr 
 gsave  2268 2557 0 0 C 1346.93 525.075 t 0 r /Helvetica findfont 106.537 sf 0 0 m (120) show NC gr 
 gsave  2268 2557 0 0 C 1525.76 525.075 t 0 r /Helvetica findfont 106.537 sf 0 0 m (140) show NC gr 
 gsave  2268 2557 0 0 C 1708.4 525.075 t 0 r /Helvetica findfont 106.537 sf 0 0 m (160) show NC gr 
 gsave  2268 2557 0 0 C 1887.23 525.075 t 0 r /Helvetica findfont 106.537 sf 0 0 m (180) show NC gr 
 gsave  2268 2557 0 0 C 2066.06 525.075 t 0 r /Helvetica findfont 106.537 sf 0 0 m (200) show NC gr  363 2429 m 1791 X s 363 2368 m 61 Y s 408 2399 m 30 Y s 452 2399 m 30 Y s 497 2399 m 30 Y s 542 2368 m 61 Y s 587 2399 m 30 Y s 632 2399 m 30 Y s 676
 2399 m 30 Y s 721 2368 m 61 Y s 766 2399 m 30 Y s 811 2399 m 30 Y s 855 2399 m 30 Y s 900 2368 m 61 Y s 945 2399 m 30 Y s 990 2399 m 30 Y s 1035 2399 m 30 Y s 1079 2368 m 61 Y s 1124 2399 m 30 Y s 1169 2399 m 30 Y s 1214 2399 m 30 Y s 1259 2368 m 61
 Y s 1303 2399 m 30 Y s 1348 2399 m 30 Y s 1393 2399 m 30 Y s 1438 2368 m 61 Y s 1483 2399 m 30 Y s 1527 2399 m 30 Y s 1572 2399 m 30 Y s 1617 2368 m 61 Y s 1662 2399 m 30 Y s 1706 2399 m 30 Y s 1751 2399 m 30 Y s 1796 2368 m 61 Y s 1841 2399 m 30 Y
 s 1886 2399 m 30 Y s 1930 2399 m 30 Y s 1975 2368 m 61 Y s 2020 2399 m 30 Y s 2065 2399 m 30 Y s 2110 2399 m 30 Y s 2154 2368 m 61 Y s 363 639 m 1790 Y s
 gsave  2268 2557 0 0 C 194.05 2001.37 t 90 r /Helvetica findfont 106.537 sf 0 0 m ( \(fb/GeV\)) show NC gr 
 gsave  2268 2557 0 0 C 247.318 1955.72 t 90 r /Helvetica findfont 72.293 sf 0 0 m (T) show NC gr 
 gsave  2268 2557 0 0 C 194.05 1811.13 t 90 r /Helvetica findfont 106.537 sf 0 0 m (/dp) show NC gr 
 gsave  2268 2557 0 0 C 194.05 1746.45 t 90 r /Symbol findfont 106.537 sf 0 0 m (s) show NC gr 
 gsave  2268 2557 0 0 C 194.05 1693.18 t 90 r /Helvetica findfont 106.537 sf 0 0 m (d) show NC gr  410 893 m -47 X s 387 957 m -24 X s 387 1021 m -24 X s 387 1085 m -24 X s 410 1149 m -47 X s 387 1212 m -24 X s 387 1276 m -24 X s 387 1340 m -24 X s
 410 1404 m -47 X s 387 1468 m -24 X s 387 1531 m -24 X s 387 1595 m -24 X s 410 1659 m -47 X s 387 1723 m -24 X s 387 1787 m -24 X s 387 1851 m -24 X s 410 1914 m -47 X s 387 1978 m -24 X s 387 2042 m -24 X s 387 2106 m -24 X s 410 2170 m -47 X s
 387 2234 m -24 X s 387 2297 m -24 X s 387 2361 m -24 X s 410 2425 m -47 X s 410 893 m -47 X s 387 829 m -24 X s 387 766 m -24 X s 387 702 m -24 X s 410 2425 m -47 X s
 gsave  2268 2557 0 0 C 205.464 852.296 t 0 r /Helvetica findfont 106.537 sf 0 0 m (0.2) show NC gr 
 gsave  2268 2557 0 0 C 205.464 1107.22 t 0 r /Helvetica findfont 106.537 sf 0 0 m (0.4) show NC gr 
 gsave  2268 2557 0 0 C 205.464 1362.15 t 0 r /Helvetica findfont 106.537 sf 0 0 m (0.6) show NC gr 
 gsave  2268 2557 0 0 C 205.464 1620.88 t 0 r /Helvetica findfont 106.537 sf 0 0 m (0.8) show NC gr 
 gsave  2268 2557 0 0 C 308.196 1875.81 t 0 r /Helvetica findfont 106.537 sf 0 0 m (1) show NC gr 
 gsave  2268 2557 0 0 C 205.464 2130.74 t 0 r /Helvetica findfont 106.537 sf 0 0 m (1.2) show NC gr 
 gsave  2268 2557 0 0 C 205.464 2385.67 t 0 r /Helvetica findfont 106.537 sf 0 0 m (1.4) show NC gr  2154 639 m 1790 Y s 2107 893 m 47 X s 2131 957 m 23 X s 2131 1021 m 23 X s 2131 1085 m 23 X s 2107 1149 m 47 X s 2131 1212 m 23 X s 2131 1276 m 23 X
 s 2131 1340 m 23 X s 2107 1404 m 47 X s 2131 1468 m 23 X s 2131 1531 m 23 X s 2131 1595 m 23 X s 2107 1659 m 47 X s 2131 1723 m 23 X s 2131 1787 m 23 X s 2131 1851 m 23 X s 2107 1914 m 47 X s 2131 1978 m 23 X s 2131 2042 m 23 X s 2131 2106 m 23 X s
 2107 2170 m 47 X s 2131 2234 m 23 X s 2131 2297 m 23 X s 2131 2361 m 23 X s 2107 2425 m 47 X s 2107 893 m 47 X s 2131 829 m 23 X s 2131 766 m 23 X s 2131 702 m 23 X s 2107 2425 m 47 X s 6 lw 1 0 0 c black 3 lw 1 0 0 c 1 lw << /PatternType 1
 /PaintType 2 /TilingType 1 /BBox [ 0 0 100 100 ] /XStep 100 /YStep 100 /PaintProc { begin gsave 0 100 m 100 0 l s gr end } >> [ 0.24 0 0 0.24 0 0 ] makepattern /P05 exch def /cs {[/Pattern /DeviceRGB] setcolorspace} def /FA {f [/DeviceRGB]
 setcolorspace} def cs 1 0 0 P05 setcolor 363 639 m 18 X 580 Y 18 X 311 Y 18 X 283 Y 17 X -41 Y 18 X 154 Y 18 X -55 Y 18 X -90 Y 18 X -42 Y 18 X -100 Y 18 X -89 Y 18 X -59 Y 18 X -50 Y 18 X -71 Y 18 X -71 Y 18 X -31 Y 17 X -55 Y 18 X -37 Y 18 X -60 Y
 18 X -35 Y 18 X -25 Y 18 X -74 Y 18 X 8 Y 18 X -38 Y 18 X -3 Y 18 X -33 Y 18 X -11 Y 18 X -33 Y 17 X -23 Y 18 X -3 Y 18 X -3 Y 18 X -17 Y 18 X -28 Y 18 X -5 Y 18 X -19 Y 18 X -13 Y 18 X -1 Y 18 X -10 Y 18 X 4 Y 18 X -9 Y 17 X -17 Y 18 X -3 Y 18 X 4
 Y 18 X -4 Y 18 X -10 Y 18 X -4 Y 18 X -29 Y 18 X 21 Y 18 X -3 Y 18 X -5 Y 18 X -1 Y 17 X -4 Y 18 X -6 Y 18 X -3 Y 36 X -1 Y 18 X -3 Y 18 X -5 Y 18 X -6 Y 18 X 7 Y 18 X -9 Y 18 X -1 Y 18 X 2 Y 35 X -2 Y 18 X -1 Y 36 X -1 Y 18 X -2 Y 18 X -3 Y 18 X 1
 Y 18 X -2 Y 18 X 3 Y 18 X -3 Y 35 X -1 Y 36 X -1 Y 18 X -2 Y 18 X 1 Y 18 X -2 Y 18 X 2 Y 18 X -1 Y 18 X -1 Y 18 X -2 Y 18 X 1 Y 35 X -9 Y 18 X 7 Y 54 X -1 Y 18 X 1 Y 18 X -2 Y 18 X -2 Y 18 X 2 Y 36 X -1 Y 18 X 1 Y 35 X 1 Y -18 X 2 Y -53 X 2 Y -18 X
 -1 Y -18 X 4 Y -18 X -3 Y -18 X 1 Y -18 X -1 Y -18 X 2 Y -18 X 10 Y -18 X -10 Y -35 X 1 Y -18 X -1 Y -18 X 3 Y -36 X 4 Y -18 X -2 Y -18 X 1 Y -18 X -1 Y -18 X 1 Y -18 X 6 Y -18 X -5 Y -18 X 3 Y -17 X 1 Y -54 X 2 Y -18 X -1 Y -18 X 8 Y -18 X -5 Y -18
 X 4 Y -36 X 3 Y -18 X -2 Y -18 X 8 Y -35 X -1 Y -18 X 2 Y -18 X 14 Y -18 X -9 Y -36 X 8 Y -18 X -4 Y -18 X 9 Y -18 X 9 Y -18 X -6 Y -18 X 12 Y -17 X -4 Y -18 X 10 Y -36 X 5 Y -18 X 13 Y -18 X 5 Y -18 X 2 Y -18 X 1 Y -18 X 18 Y -18 X -14 Y -18 X 39 Y
 -17 X -13 Y -18 X 2 Y -18 X 14 Y -18 X 21 Y -18 X 36 Y -18 X -29 Y -18 X 35 Y -18 X 2 Y -18 X 9 Y -18 X 11 Y -18 X 27 Y -18 X 23 Y -35 X 33 Y -18 X 39 Y -18 X 2 Y -18 X 33 Y -18 X 21 Y -18 X 33 Y -18 X 79 Y -18 X 8 Y -18 X 31 Y -18 X 45 Y -18 X 60 Y
 -17 X 81 Y -18 X 28 Y -18 X 72 Y -18 X 39 Y -18 X 104 Y -18 X 90 Y -18 X 57 Y -18 X 83 Y -18 X 71 Y -18 X 118 Y -18 X -21 Y -18 X -88 Y -17 X -121 Y -18 X -333 Y -18 X -610 Y -18 X FA 6 lw 1 0 0 c 1 1 1 c 1 0 0 c 372 639 m 44 Y s 372 698 m 88 Y s
 363 690 m 1 X s 379 690 m 2 X s 3 lw /w 21 def /w2 {w 2 div} def /w3 {w 3 div} def 372 690 m20 6 lw 390 1326 m 46 Y s 390 1387 m 46 Y s 381 1379 m 1 X s 397 1379 m 2 X s 3 lw 390 1379 m20 6 lw 408 1654 m 49 Y s 408 1718 m 49 Y s 399 1711 m 1 X s 415
 1711 m 2 X s 3 lw 408 1711 m20 6 lw 426 1793 m 54 Y s 426 1862 m 53 Y s 417 1854 m 1 X s 433 1854 m 1 X s 3 lw 426 1854 m20 6 lw 443 1927 m 36 Y s 443 1978 m 35 Y s 434 1970 m 2 X s 451 1970 m 1 X s 3 lw 443 1970 m20 6 lw 461 1940 m 34 Y s 461 1989
 m 34 Y s 452 1981 m 2 X s 469 1981 m 1 X s 3 lw 461 1981 m20 6 lw 479 1881 m 24 Y s 479 1920 m 24 Y s 470 1913 m 2 X s 487 1913 m 1 X s 3 lw 479 1913 m20 6 lw 497 1831 m 26 Y s 497 1873 m 27 Y s 488 1865 m 2 X s 505 1865 m 1 X s 3 lw 497 1865 m20 6
 lw 515 1727 m 29 Y s 515 1771 m 28 Y s 506 1763 m 2 X s 523 1763 m 1 X s 3 lw 515 1763 m20 6 lw 533 1670 m 27 Y s 533 1712 m 27 Y s 524 1705 m 1 X s 541 1705 m 1 X s 3 lw 533 1705 m20 6 lw 551 1540 m 30 Y s 551 1585 m 30 Y s 542 1577 m 1 X s 559
 1577 m 1 X s 3 lw 551 1577 m20 6 lw 569 1496 m 27 Y s 569 1538 m 28 Y s 560 1531 m 1 X s 576 1531 m 2 X s 3 lw 569 1531 m20 6 lw 587 1434 m 26 Y s 587 1475 m 25 Y s 578 1467 m 1 X s 594 1467 m 2 X s 3 lw 587 1467 m20 6 lw 605 1364 m 22 Y s 605 1401
 m 23 Y s 596 1394 m 1 X s 612 1394 m 2 X s 3 lw 605 1394 m20 6 lw 623 1320 m 24 Y s 623 1359 m 23 Y s 614 1351 m 1 X s 630 1351 m 2 X s 3 lw 623 1351 m20 6 lw 641 1244 m 21 Y s 641 1281 m 21 Y s 632 1273 m 1 X s 648 1273 m 1 X s 3 lw 641 1273 m20 6
 lw 658 1212 m 24 Y s 658 1251 m 23 Y s 649 1243 m 2 X s 666 1243 m 1 X s 3 lw 658 1243 m20 6 lw 676 1164 m 19 Y s 676 1198 m 19 Y s 667 1190 m 2 X s 684 1190 m 1 X s 3 lw 676 1190 m20 6 lw 694 1123 m 19 Y s 694 1157 m 19 Y s 685 1150 m 2 X s 702
 1150 m 1 X s 3 lw 694 1150 m20 6 lw 712 1091 m 19 Y s 712 1126 m 19 Y s 703 1118 m 2 X s 720 1118 m 1 X s 3 lw 712 1118 m20 6 lw 730 1056 m 18 Y s 730 1090 m 18 Y s 721 1082 m 1 X s 738 1082 m 1 X s 3 lw 730 1082 m20 6 lw 748 997 m 16 Y s 748 1028 m
 16 Y s 739 1021 m 1 X s 756 1021 m 1 X s 3 lw 748 1021 m20 6 lw 766 981 m 14 Y s 766 1011 m 14 Y s 757 1003 m 1 X s 774 1003 m 1 X s 3 lw 766 1003 m20 6 lw 784 956 m 16 Y s 784 987 m 16 Y s 775 979 m 1 X s 791 979 m 2 X s 3 lw 784 979 m20 6 lw 802
 946 m 15 Y s 802 976 m 15 Y s 793 968 m 1 X s 809 968 m 2 X s 3 lw 802 968 m20 6 lw 820 907 m 14 Y s 820 936 m 14 Y s 811 929 m 1 X s 827 929 m 2 X s 3 lw 820 929 m20 6 lw 838 905 m 15 Y s 838 935 m 15 Y s 829 927 m 1 X s 845 927 m 2 X s 3 lw 838
 927 m20 6 lw 855 880 m 13 Y s 855 909 m 13 Y s 847 901 m 1 X s 863 901 m 1 X s 3 lw 855 901 m20 6 lw 873 843 m 12 Y s 873 870 m 12 Y s 864 863 m 2 X s 881 863 m 1 X s 3 lw 873 863 m20 6 lw 891 844 m 11 Y s 891 870 m 11 Y s 882 863 m 2 X s 899 863 m
 1 X s 3 lw 891 863 m20 6 lw 909 835 m 11 Y s 909 861 m 11 Y s 900 853 m 2 X s 917 853 m 1 X s 3 lw 909 853 m20 6 lw 927 822 m 12 Y s 927 850 m 12 Y s 918 842 m 2 X s 935 842 m 1 X s 3 lw 927 842 m20 6 lw 945 800 m 8 Y s 945 823 m 7 Y s 936 815 m 1 X
 s 953 815 m 1 X s 3 lw 945 815 m20 6 lw 963 795 m 10 Y s 963 820 m 11 Y s 954 813 m 1 X s 971 813 m 1 X s 3 lw 963 813 m20 6 lw 981 789 m 8 Y s 981 812 m 8 Y s 972 804 m 1 X s 989 804 m 1 X s 3 lw 981 804 m20 6 lw 999 764 m 10 Y s 999 789 m 10 Y s
 990 781 m 1 X s 1006 781 m 2 X s 3 lw 999 781 m20 6 lw 1017 745 m 9 Y s 1017 769 m 10 Y s 1008 762 m 1 X s 1024 762 m 2 X s 3 lw 1017 762 m20 6 lw 1035 752 m 9 Y s 1035 776 m 9 Y s 1026 769 m 1 X s 1042 769 m 2 X s 3 lw 1035 769 m20 6 lw 1053 753 m
 7 Y s 1053 775 m 8 Y s 1044 768 m 1 X s 1060 768 m 2 X s 3 lw 1053 768 m20 6 lw 1070 737 m 8 Y s 1070 761 m 8 Y s 1062 753 m 1 X s 1078 753 m 1 X s 3 lw 1070 753 m20 6 lw 1088 734 m 8 Y s 1088 757 m 8 Y s 1079 750 m 2 X s 1096 750 m 1 X s 3 lw 1088
 750 m20 6 lw 1106 719 m 4 Y s 1106 738 m 4 Y s 1097 730 m 2 X s 1114 730 m 1 X s 3 lw 1106 730 m20 6 lw 1124 728 m 6 Y s 1124 749 m 6 Y s 1115 742 m 2 X s 1132 742 m 1 X s 3 lw 1124 742 m20 6 lw 1142 720 m 6 Y s 1142 741 m 7 Y s 1133 734 m 2 X s
 1150 734 m 1 X s 3 lw 1142 734 m20 6 lw 1160 709 m 6 Y s 1160 731 m 6 Y s 1151 723 m 1 X s 1168 723 m 1 X s 3 lw 1160 723 m20 6 lw 1178 712 m 4 Y s 1178 732 m 4 Y s 1169 724 m 1 X s 1186 724 m 1 X s 3 lw 1178 724 m20 6 lw 1196 710 m 4 Y s 1196 730 m
 4 Y s 1187 722 m 1 X s 1203 722 m 2 X s 3 lw 1196 722 m20 6 lw 1214 693 m 3 Y s 1214 711 m 3 Y s 1205 703 m 1 X s 1221 703 m 2 X s 3 lw 1214 703 m20 6 lw 1232 702 m 3 Y s 1232 720 m 3 Y s 1223 712 m 1 X s 1239 712 m 2 X s 3 lw 1232 712 m20 6 lw 1250
 696 m 3 Y s 1250 714 m 2 Y s 1241 706 m 1 X s 1257 706 m 2 X s 3 lw 1250 706 m20 6 lw 1268 691 m s 1268 706 m 1 Y s 1259 699 m 1 X s 1275 699 m 1 X s 3 lw 1268 699 m20 6 lw 1276 697 m 2 X s 1293 697 m 1 X s 3 lw 1285 697 m20 6 lw 1294 690 m 2 X s
 1311 690 m 1 X s 3 lw 1303 690 m20 6 lw 1312 693 m 2 X s 1329 693 m 1 X s 3 lw 1321 693 m20 6 lw 1330 684 m 2 X s 1347 684 m 1 X s 3 lw 1339 684 m20 6 lw 1348 684 m 2 X s 1365 684 m 1 X s 3 lw 1357 684 m20 6 lw 1375 671 m s 1375 686 m 1 Y s 1366 679
 m 1 X s 1383 679 m 1 X s 3 lw 1375 679 m20 6 lw 1393 675 m 1 Y s 1393 691 m 1 Y s 1384 683 m 1 X s 1401 683 m 1 X s 3 lw 1393 683 m20 6 lw 1402 677 m 1 X s 1418 677 m 2 X s 3 lw 1411 677 m20 6 lw 1420 678 m 1 X s 1436 678 m 2 X s 3 lw 1429 678 m20 6
 lw 1438 671 m 1 X s 1454 671 m 2 X s 3 lw 1447 671 m20 6 lw 1456 672 m 1 X s 1472 672 m 2 X s 3 lw 1465 672 m20 6 lw 1474 673 m 1 X s 1490 673 m 1 X s 3 lw 1483 673 m20 6 lw 1491 669 m 2 X s 1508 669 m 1 X s 3 lw 1500 669 m20 6 lw 1509 667 m 2 X s
 1526 667 m 1 X s 3 lw 1518 667 m20 6 lw 1527 668 m 2 X s 1544 668 m 1 X s 3 lw 1536 668 m20 6 lw 1545 666 m 2 X s 1562 666 m 1 X s 3 lw 1554 666 m20 6 lw 1563 663 m 1 X s 1580 663 m 1 X s 3 lw 1572 663 m20 6 lw 1581 667 m 1 X s 1598 667 m 1 X s 3 lw
 1590 667 m20 6 lw 1599 662 m 1 X s 1616 662 m 1 X s 3 lw 1608 662 m20 6 lw 1617 660 m 1 X s 1633 660 m 2 X s 3 lw 1626 660 m20 6 lw 1635 660 m 1 X s 1651 660 m 2 X s 3 lw 1644 660 m20 6 lw 1653 659 m 1 X s 1669 659 m 2 X s 3 lw 1662 659 m20 6 lw
 1671 659 m 1 X s 1687 659 m 2 X s 3 lw 1680 659 m20 6 lw 1689 658 m 1 X s 1705 658 m 1 X s 3 lw 1697 658 m20 6 lw 1706 658 m 2 X s 1723 658 m 1 X s 3 lw 1715 658 m20 6 lw 1724 655 m 2 X s 1741 655 m 1 X s 3 lw 1733 655 m20 6 lw 1742 656 m 2 X s 1759
 656 m 1 X s 3 lw 1751 656 m20 6 lw 1760 654 m 2 X s 1777 654 m 1 X s 3 lw 1769 654 m20 6 lw 1778 655 m 1 X s 1795 655 m 1 X s 3 lw 1787 655 m20 6 lw 1796 655 m 1 X s 1813 655 m 1 X s 3 lw 1805 655 m20 6 lw 1814 653 m 1 X s 1831 653 m 1 X s 3 lw 1823
 653 m20 6 lw 1832 653 m 1 X s 1848 653 m 2 X s 3 lw 1841 653 m20 6 lw 1850 653 m 1 X s 1866 653 m 2 X s 3 lw 1859 653 m20 6 lw 1868 652 m 1 X s 1884 652 m 2 X s 3 lw 1877 652 m20 6 lw 1886 651 m 1 X s 1902 651 m 2 X s 3 lw 1895 651 m20 6 lw 1904 649
 m 1 X s 1920 649 m 1 X s 3 lw 1912 649 m20 6 lw 1921 652 m 2 X s 1938 652 m 1 X s 3 lw 1930 652 m20 6 lw 1939 650 m 2 X s 1956 650 m 1 X s 3 lw 1948 650 m20 6 lw 1957 650 m 2 X s 1974 650 m 1 X s 3 lw 1966 650 m20 6 lw 1975 647 m 2 X s 1992 647 m 1
 X s 3 lw 1984 647 m20 6 lw 1993 648 m 1 X s 2010 648 m 1 X s 3 lw 2002 648 m20 6 lw 2011 649 m 1 X s 2028 649 m 1 X s 3 lw 2020 649 m20 6 lw 2029 646 m 1 X s 2045 646 m 2 X s 3 lw 2038 646 m20 6 lw 2047 648 m 1 X s 2063 648 m 2 X s 3 lw 2056 648 m20
 6 lw 2065 648 m 1 X s 2081 648 m 2 X s 3 lw 2074 648 m20 6 lw 2083 648 m 1 X s 2099 648 m 2 X s 3 lw 2092 648 m20 6 lw 2101 644 m 1 X s 2117 644 m 2 X s 3 lw 2110 644 m20 6 lw 2119 647 m 1 X s 2135 647 m 1 X s 3 lw 2127 647 m20 6 lw 2136 646 m 2 X s
 2153 646 m 1 X s 3 lw 2145 646 m20 6 lw black 3 lw 1 lw << /PatternType 1 /PaintType 2 /TilingType 1 /BBox [ 0 0 100 100 ] /XStep 100 /YStep 100 /PaintProc { begin gsave 0 0 m 100 100 l s gr end } >> [ 0.24 0 0 0.24 0 0 ] makepattern /P04 exch def
 cs 0 0 0 P04 setcolor 363 837 m 18 X 364 Y 18 X 329 Y 18 X 221 Y 17 X 115 Y 18 X -1 Y 18 X -40 Y 18 X -21 Y 18 X -82 Y 18 X -61 Y 18 X -91 Y 18 X -67 Y 18 X -52 Y 18 X -64 Y 18 X -64 Y 18 X -59 Y 17 X -27 Y 18 X -56 Y 18 X -27 Y 18 X -30 Y 18 X -59
 Y 18 X -24 Y 18 X -18 Y 18 X -38 Y 18 X -18 Y 18 X -33 Y 18 X -8 Y 18 X -12 Y 17 X -28 Y 18 X -22 Y 18 X -7 Y 18 X -22 Y 18 X -5 Y 18 X -19 Y 18 X -11 Y 18 X -4 Y 18 X -15 Y 18 X -3 Y 18 X -14 Y 18 X -2 Y 17 X -12 Y 18 X -8 Y 18 X -3 Y 18 X -9 Y 18
 X -3 Y 18 X -3 Y 18 X -4 Y 18 X -9 Y 18 X -4 Y 18 X 1 Y 18 X -7 Y 17 X -6 Y 36 X -2 Y 18 X -4 Y 36 X -5 Y 18 X -2 Y 18 X -1 Y 18 X -3 Y 18 X -1 Y 18 X -3 Y 18 X -4 Y 17 X 3 Y 18 X -4 Y 18 X -5 Y 18 X 2 Y 18 X -3 Y 18 X -1 Y 18 X -2 Y 18 X 2 Y 18 X
 -2 Y 18 X -1 Y 36 X -4 Y 17 X 1 Y 18 X -2 Y 18 X -1 Y 18 X 1 Y 36 X -4 Y 18 X 1 Y 36 X -1 Y 18 X -1 Y 18 X -2 Y 18 X 1 Y 17 X 1 Y 18 X -1 Y 54 X -3 Y 18 X 1 Y 54 X -1 Y 18 X -1 Y 71 X 3 Y -18 X 1 Y -17 X 1 Y -18 X -1 Y -18 X 1 Y -18 X -1 Y -18 X 4 Y
 -18 X -3 Y -18 X 1 Y -18 X 2 Y -18 X -2 Y -18 X 3 Y -18 X 2 Y -18 X -1 Y -17 X 2 Y -36 X -2 Y -18 X 2 Y -36 X 1 Y -18 X 2 Y -18 X 1 Y -36 X 3 Y -18 X 1 Y -18 X 1 Y -35 X 1 Y -18 X 2 Y -18 X 2 Y -18 X -1 Y -54 X 2 Y -18 X 6 Y -36 X 3 Y -35 X 2 Y -18
 X 1 Y -18 X 3 Y -18 X 3 Y -36 X 10 Y -36 X 3 Y -18 X -1 Y -18 X 6 Y -18 X 3 Y -18 X 2 Y -17 X 5 Y -18 X 2 Y -18 X 5 Y -18 X 5 Y -18 X 5 Y -18 X 7 Y -18 X 7 Y -18 X 5 Y -18 X 5 Y -18 X 14 Y -18 X 5 Y -17 X -6 Y -18 X 20 Y -18 X 5 Y -18 X 12 Y -18 X
 11 Y -18 X 16 Y -18 X 4 Y -18 X 18 Y -18 X 15 Y -18 X 21 Y -18 X 22 Y -18 X 11 Y -17 X 25 Y -18 X 11 Y -18 X 21 Y -18 X 35 Y -18 X 24 Y -18 X 28 Y -18 X 35 Y -18 X 42 Y -18 X 44 Y -18 X 21 Y -18 X 40 Y -18 X 52 Y -17 X 39 Y -18 X 82 Y -18 X 72 Y -18
 X 59 Y -18 X 65 Y -18 X 72 Y -18 X 81 Y -18 X 62 Y -18 X 66 Y -18 X 13 Y -18 X 2 Y -18 X -126 Y -17 X -242 Y -18 X -296 Y -18 X -363 Y -18 X FA 6 lw black 1 1 1 c black 363 845 m 1 X s 379 845 m 2 X s 3 lw 372 845 m20 6 lw 390 1227 m 5 Y s 390 1247
 m 5 Y s 381 1239 m 1 X s 397 1239 m 2 X s 3 lw 390 1239 m20 6 lw 408 1515 m 7 Y s 408 1538 m 7 Y s 399 1530 m 1 X s 415 1530 m 2 X s 3 lw 408 1530 m20 6 lw 426 1767 m 9 Y s 426 1792 m 9 Y s 417 1784 m 1 X s 433 1784 m 1 X s 3 lw 426 1784 m20 6 lw
 443 1865 m 10 Y s 443 1890 m 10 Y s 434 1882 m 2 X s 451 1882 m 1 X s 3 lw 443 1882 m20 6 lw 461 1898 m 10 Y s 461 1923 m 10 Y s 452 1915 m 2 X s 469 1915 m 1 X s 3 lw 461 1915 m20 6 lw 479 1845 m 10 Y s 479 1870 m 10 Y s 470 1863 m 2 X s 487 1863 m
 1 X s 3 lw 479 1863 m20 6 lw 497 1818 m 10 Y s 497 1843 m 10 Y s 488 1836 m 2 X s 505 1836 m 1 X s 3 lw 497 1836 m20 6 lw 515 1724 m 9 Y s 515 1748 m 9 Y s 506 1740 m 2 X s 523 1740 m 1 X s 3 lw 515 1740 m20 6 lw 533 1645 m 8 Y s 533 1668 m 8 Y s
 524 1661 m 1 X s 541 1661 m 1 X s 3 lw 533 1661 m20 6 lw 551 1595 m 8 Y s 551 1618 m 8 Y s 542 1610 m 1 X s 559 1610 m 1 X s 3 lw 551 1610 m20 6 lw 569 1533 m 7 Y s 569 1555 m 8 Y s 560 1548 m 1 X s 576 1548 m 2 X s 3 lw 569 1548 m20 6 lw 587 1441 m
 7 Y s 587 1463 m 6 Y s 578 1455 m 1 X s 594 1455 m 2 X s 3 lw 587 1455 m20 6 lw 605 1411 m 6 Y s 605 1432 m 7 Y s 596 1425 m 1 X s 612 1425 m 2 X s 3 lw 605 1425 m20 6 lw 623 1321 m 5 Y s 623 1342 m 5 Y s 614 1334 m 1 X s 630 1334 m 2 X s 3 lw 623
 1334 m20 6 lw 641 1291 m 5 Y s 641 1311 m 5 Y s 632 1304 m 1 X s 648 1304 m 1 X s 3 lw 641 1304 m20 6 lw 658 1227 m 5 Y s 658 1247 m 4 Y s 649 1239 m 2 X s 666 1239 m 1 X s 3 lw 658 1239 m20 6 lw 676 1180 m 4 Y s 676 1200 m 4 Y s 667 1192 m 2 X s
 684 1192 m 1 X s 3 lw 676 1192 m20 6 lw 694 1152 m 4 Y s 694 1171 m 4 Y s 685 1164 m 2 X s 702 1164 m 1 X s 3 lw 694 1164 m20 6 lw 712 1113 m 3 Y s 712 1131 m 4 Y s 703 1124 m 2 X s 720 1124 m 1 X s 3 lw 712 1124 m20 6 lw 730 1055 m 2 Y s 730 1072 m
 3 Y s 721 1065 m 1 X s 738 1065 m 1 X s 3 lw 730 1065 m20 6 lw 748 1058 m 3 Y s 748 1076 m 3 Y s 739 1069 m 1 X s 756 1069 m 1 X s 3 lw 748 1069 m20 6 lw 766 1019 m 2 Y s 766 1036 m 3 Y s 757 1029 m 1 X s 774 1029 m 1 X s 3 lw 766 1029 m20 6 lw 784
 993 m 2 Y s 784 1010 m 2 Y s 775 1003 m 1 X s 791 1003 m 2 X s 3 lw 784 1003 m20 6 lw 802 964 m 1 Y s 802 980 m 2 Y s 793 973 m 1 X s 809 973 m 2 X s 3 lw 802 973 m20 6 lw 820 946 m 1 Y s 820 962 m 1 Y s 811 955 m 1 X s 827 955 m 2 X s 3 lw 820 955
 m20 6 lw 838 927 m 1 Y s 838 943 m 1 Y s 829 935 m 1 X s 845 935 m 2 X s 3 lw 838 935 m20 6 lw 855 906 m 1 Y s 855 922 m 1 Y s 847 914 m 1 X s 863 914 m 1 X s 3 lw 855 914 m20 6 lw 873 890 m s 873 905 m 1 Y s 864 898 m 2 X s 881 898 m 1 X s 3 lw 873
 898 m20 6 lw 882 870 m 2 X s 899 870 m 1 X s 3 lw 891 870 m20 6 lw 900 872 m 2 X s 917 872 m 1 X s 3 lw 909 872 m20 6 lw 918 835 m 2 X s 935 835 m 1 X s 3 lw 927 835 m20 6 lw 936 834 m 1 X s 953 834 m 1 X s 3 lw 945 834 m20 6 lw 954 833 m 1 X s 971
 833 m 1 X s 3 lw 963 833 m20 6 lw 972 810 m 1 X s 989 810 m 1 X s 3 lw 981 810 m20 6 lw 990 803 m 1 X s 1006 803 m 2 X s 3 lw 999 803 m20 6 lw 1008 792 m 1 X s 1024 792 m 2 X s 3 lw 1017 792 m20 6 lw 1026 785 m 1 X s 1042 785 m 2 X s 3 lw 1035 785
 m20 6 lw 1044 765 m 1 X s 1060 765 m 2 X s 3 lw 1053 765 m20 6 lw 1062 767 m 1 X s 1078 767 m 1 X s 3 lw 1070 767 m20 6 lw 1079 764 m 2 X s 1096 764 m 1 X s 3 lw 1088 764 m20 6 lw 1097 750 m 2 X s 1114 750 m 1 X s 3 lw 1106 750 m20 6 lw 1115 741 m 2
 X s 1132 741 m 1 X s 3 lw 1124 741 m20 6 lw 1133 739 m 2 X s 1150 739 m 1 X s 3 lw 1142 739 m20 6 lw 1151 727 m 1 X s 1168 727 m 1 X s 3 lw 1160 727 m20 6 lw 1169 729 m 1 X s 1186 729 m 1 X s 3 lw 1178 729 m20 6 lw 1187 722 m 1 X s 1203 722 m 2 X s
 3 lw 1196 722 m20 6 lw 1205 724 m 1 X s 1221 724 m 2 X s 3 lw 1214 724 m20 6 lw 1223 717 m 1 X s 1239 717 m 2 X s 3 lw 1232 717 m20 6 lw 1241 709 m 1 X s 1257 709 m 2 X s 3 lw 1250 709 m20 6 lw 1259 707 m 1 X s 1275 707 m 1 X s 3 lw 1268 707 m20 6
 lw 1276 702 m 2 X s 1293 702 m 1 X s 3 lw 1285 702 m20 6 lw 1294 697 m 2 X s 1311 697 m 1 X s 3 lw 1303 697 m20 6 lw 1312 693 m 2 X s 1329 693 m 1 X s 3 lw 1321 693 m20 6 lw 1330 689 m 2 X s 1347 689 m 1 X s 3 lw 1339 689 m20 6 lw 1348 692 m 2 X s
 1365 692 m 1 X s 3 lw 1357 692 m20 6 lw 1366 691 m 1 X s 1383 691 m 1 X s 3 lw 1375 691 m20 6 lw 1384 682 m 1 X s 1401 682 m 1 X s 3 lw 1393 682 m20 6 lw 1402 683 m 1 X s 1418 683 m 2 X s 3 lw 1411 683 m20 6 lw 1420 678 m 1 X s 1436 678 m 2 X s 3 lw
 1429 678 m20 6 lw 1438 683 m 1 X s 1454 683 m 2 X s 3 lw 1447 683 m20 6 lw 1456 675 m 1 X s 1472 675 m 2 X s 3 lw 1465 675 m20 6 lw 1474 672 m 1 X s 1490 672 m 1 X s 3 lw 1483 672 m20 6 lw 1491 673 m 2 X s 1508 673 m 1 X s 3 lw 1500 673 m20 6 lw
 1509 675 m 2 X s 1526 675 m 1 X s 3 lw 1518 675 m20 6 lw 1527 666 m 2 X s 1544 666 m 1 X s 3 lw 1536 666 m20 6 lw 1545 666 m 2 X s 1562 666 m 1 X s 3 lw 1554 666 m20 6 lw 1563 668 m 1 X s 1580 668 m 1 X s 3 lw 1572 668 m20 6 lw 1581 668 m 1 X s 1598
 668 m 1 X s 3 lw 1590 668 m20 6 lw 1599 666 m 1 X s 1616 666 m 1 X s 3 lw 1608 666 m20 6 lw 1617 666 m 1 X s 1633 666 m 2 X s 3 lw 1626 666 m20 6 lw 1635 664 m 1 X s 1651 664 m 2 X s 3 lw 1644 664 m20 6 lw 1653 660 m 1 X s 1669 660 m 2 X s 3 lw 1662
 660 m20 6 lw 1671 661 m 1 X s 1687 661 m 2 X s 3 lw 1680 661 m20 6 lw 1689 663 m 1 X s 1705 663 m 1 X s 3 lw 1697 663 m20 6 lw 1706 658 m 2 X s 1723 658 m 1 X s 3 lw 1715 658 m20 6 lw 1724 661 m 2 X s 1741 661 m 1 X s 3 lw 1733 661 m20 6 lw 1742 660
 m 2 X s 1759 660 m 1 X s 3 lw 1751 660 m20 6 lw 1760 660 m 2 X s 1777 660 m 1 X s 3 lw 1769 660 m20 6 lw 1778 655 m 1 X s 1795 655 m 1 X s 3 lw 1787 655 m20 6 lw 1796 650 m 1 X s 1813 650 m 1 X s 3 lw 1805 650 m20 6 lw 1814 654 m 1 X s 1831 654 m 1
 X s 3 lw 1823 654 m20 6 lw 1832 653 m 1 X s 1848 653 m 2 X s 3 lw 1841 653 m20 6 lw 1850 650 m 1 X s 1866 650 m 2 X s 3 lw 1859 650 m20 6 lw 1868 650 m 1 X s 1884 650 m 2 X s 3 lw 1877 650 m20 6 lw 1886 647 m 1 X s 1902 647 m 2 X s 3 lw 1895 647 m20
 6 lw 1904 648 m 1 X s 1920 648 m 1 X s 3 lw 1912 648 m20 6 lw 1921 649 m 2 X s 1938 649 m 1 X s 3 lw 1930 649 m20 6 lw 1939 649 m 2 X s 1956 649 m 1 X s 3 lw 1948 649 m20 6 lw 1957 648 m 2 X s 1974 648 m 1 X s 3 lw 1966 648 m20 6 lw 1975 651 m 2 X s
 1992 651 m 1 X s 3 lw 1984 651 m20 6 lw 1993 649 m 1 X s 2010 649 m 1 X s 3 lw 2002 649 m20 6 lw 2011 649 m 1 X s 2028 649 m 1 X s 3 lw 2020 649 m20 6 lw 2029 648 m 1 X s 2045 648 m 2 X s 3 lw 2038 648 m20 6 lw 2047 648 m 1 X s 2063 648 m 2 X s 3 lw
 2056 648 m20 6 lw 2065 647 m 1 X s 2081 647 m 2 X s 3 lw 2074 647 m20 6 lw 2083 647 m 1 X s 2099 647 m 2 X s 3 lw 2092 647 m20 6 lw 2101 644 m 1 X s 2117 644 m 2 X s 3 lw 2110 644 m20 6 lw 2119 645 m 1 X s 2135 645 m 1 X s 3 lw 2127 645 m20 6 lw
 2136 646 m 2 X s 2153 646 m 1 X s 3 lw 2145 646 m20 6 lw 1 0.8 0 c 1 1 1 c 1 0.8 0 c 363 842 m 1 X s 379 842 m 2 X s 3 lw 372 842 m20 6 lw 381 1216 m 1 X s 397 1216 m 2 X s 3 lw 390 1216 m20 6 lw 399 1492 m 1 X s 415 1492 m 2 X s 3 lw 408 1492 m20 6
 lw 417 1662 m 1 X s 433 1662 m 1 X s 3 lw 426 1662 m20 6 lw 434 1748 m 2 X s 451 1748 m 1 X s 3 lw 443 1748 m20 6 lw 452 1782 m 2 X s 469 1782 m 1 X s 3 lw 461 1782 m20 6 lw 470 1769 m 2 X s 487 1769 m 1 X s 3 lw 479 1769 m20 6 lw 488 1734 m 2 X s
 505 1734 m 1 X s 3 lw 497 1734 m20 6 lw 506 1682 m 2 X s 523 1682 m 1 X s 3 lw 515 1682 m20 6 lw 524 1647 m 1 X s 541 1647 m 1 X s 3 lw 533 1647 m20 6 lw 542 1591 m 1 X s 559 1591 m 1 X s 3 lw 551 1591 m20 6 lw 560 1519 m 1 X s 576 1519 m 2 X s 3 lw
 569 1519 m20 6 lw 578 1471 m 1 X s 594 1471 m 2 X s 3 lw 587 1471 m20 6 lw 596 1425 m 1 X s 612 1425 m 2 X s 3 lw 605 1425 m20 6 lw 614 1382 m 1 X s 630 1382 m 2 X s 3 lw 623 1382 m20 6 lw 632 1322 m 1 X s 648 1322 m 1 X s 3 lw 641 1322 m20 6 lw 649
 1289 m 2 X s 666 1289 m 1 X s 3 lw 658 1289 m20 6 lw 667 1243 m 2 X s 684 1243 m 1 X s 3 lw 676 1243 m20 6 lw 685 1194 m 2 X s 702 1194 m 1 X s 3 lw 694 1194 m20 6 lw 703 1167 m 2 X s 720 1167 m 1 X s 3 lw 712 1167 m20 6 lw 721 1131 m 1 X s 738 1131
 m 1 X s 3 lw 730 1131 m20 6 lw 739 1096 m 1 X s 756 1096 m 1 X s 3 lw 748 1096 m20 6 lw 757 1072 m 1 X s 774 1072 m 1 X s 3 lw 766 1072 m20 6 lw 775 1039 m 1 X s 791 1039 m 2 X s 3 lw 784 1039 m20 6 lw 793 1016 m 1 X s 809 1016 m 2 X s 3 lw 802 1016
 m20 6 lw 811 986 m 1 X s 827 986 m 2 X s 3 lw 820 986 m20 6 lw 829 959 m 1 X s 845 959 m 2 X s 3 lw 838 959 m20 6 lw 847 932 m 1 X s 863 932 m 1 X s 3 lw 855 932 m20 6 lw 864 911 m 2 X s 881 911 m 1 X s 3 lw 873 911 m20 6 lw 882 893 m 2 X s 899 893
 m 1 X s 3 lw 891 893 m20 6 lw 900 870 m 2 X s 917 870 m 1 X s 3 lw 909 870 m20 6 lw 918 859 m 2 X s 935 859 m 1 X s 3 lw 927 859 m20 6 lw 936 849 m 1 X s 953 849 m 1 X s 3 lw 945 849 m20 6 lw 954 831 m 1 X s 971 831 m 1 X s 3 lw 963 831 m20 6 lw 972
 813 m 1 X s 989 813 m 1 X s 3 lw 981 813 m20 6 lw 990 809 m 1 X s 1006 809 m 2 X s 3 lw 999 809 m20 6 lw 1008 790 m 1 X s 1024 790 m 2 X s 3 lw 1017 790 m20 6 lw 1026 793 m 1 X s 1042 793 m 2 X s 3 lw 1035 793 m20 6 lw 1044 775 m 1 X s 1060 775 m 2
 X s 3 lw 1053 775 m20 6 lw 1062 766 m 1 X s 1078 766 m 1 X s 3 lw 1070 766 m20 6 lw 1079 758 m 2 X s 1096 758 m 1 X s 3 lw 1088 758 m20 6 lw 1097 756 m 2 X s 1114 756 m 1 X s 3 lw 1106 756 m20 6 lw 1115 749 m 2 X s 1132 749 m 1 X s 3 lw 1124 749 m20
 6 lw 1133 748 m 2 X s 1150 748 m 1 X s 3 lw 1142 748 m20 6 lw 1151 741 m 1 X s 1168 741 m 1 X s 3 lw 1160 741 m20 6 lw 1169 732 m 1 X s 1186 732 m 1 X s 3 lw 1178 732 m20 6 lw 1187 726 m 1 X s 1203 726 m 2 X s 3 lw 1196 726 m20 6 lw 1205 721 m 1 X s
 1221 721 m 2 X s 3 lw 1214 721 m20 6 lw 1223 719 m 1 X s 1239 719 m 2 X s 3 lw 1232 719 m20 6 lw 1241 715 m 1 X s 1257 715 m 2 X s 3 lw 1250 715 m20 6 lw 1259 707 m 1 X s 1275 707 m 1 X s 3 lw 1268 707 m20 6 lw 1276 705 m 2 X s 1293 705 m 1 X s 3 lw
 1285 705 m20 6 lw 1294 703 m 2 X s 1311 703 m 1 X s 3 lw 1303 703 m20 6 lw 1312 701 m 2 X s 1329 701 m 1 X s 3 lw 1321 701 m20 6 lw 1330 697 m 2 X s 1347 697 m 1 X s 3 lw 1339 697 m20 6 lw 1348 694 m 2 X s 1365 694 m 1 X s 3 lw 1357 694 m20 6 lw
 1366 695 m 1 X s 1383 695 m 1 X s 3 lw 1375 695 m20 6 lw 1384 683 m 1 X s 1401 683 m 1 X s 3 lw 1393 683 m20 6 lw 1402 687 m 1 X s 1418 687 m 2 X s 3 lw 1411 687 m20 6 lw 1420 685 m 1 X s 1436 685 m 2 X s 3 lw 1429 685 m20 6 lw 1438 684 m 1 X s 1454
 684 m 2 X s 3 lw 1447 684 m20 6 lw 1456 678 m 1 X s 1472 678 m 2 X s 3 lw 1465 678 m20 6 lw 1474 677 m 1 X s 1490 677 m 1 X s 3 lw 1483 677 m20 6 lw 1491 676 m 2 X s 1508 676 m 1 X s 3 lw 1500 676 m20 6 lw 1509 678 m 2 X s 1526 678 m 1 X s 3 lw 1518
 678 m20 6 lw 1527 673 m 2 X s 1544 673 m 1 X s 3 lw 1536 673 m20 6 lw 1545 670 m 2 X s 1562 670 m 1 X s 3 lw 1554 670 m20 6 lw 1563 671 m 1 X s 1580 671 m 1 X s 3 lw 1572 671 m20 6 lw 1581 669 m 1 X s 1598 669 m 1 X s 3 lw 1590 669 m20 6 lw 1599 664
 m 1 X s 1616 664 m 1 X s 3 lw 1608 664 m20 6 lw 1617 667 m 1 X s 1633 667 m 2 X s 3 lw 1626 667 m20 6 lw 1635 663 m 1 X s 1651 663 m 2 X s 3 lw 1644 663 m20 6 lw 1653 664 m 1 X s 1669 664 m 2 X s 3 lw 1662 664 m20 6 lw 1671 664 m 1 X s 1687 664 m 2
 X s 3 lw 1680 664 m20 6 lw 1689 659 m 1 X s 1705 659 m 1 X s 3 lw 1697 659 m20 6 lw 1706 661 m 2 X s 1723 661 m 1 X s 3 lw 1715 661 m20 6 lw 1724 659 m 2 X s 1741 659 m 1 X s 3 lw 1733 659 m20 6 lw 1742 658 m 2 X s 1759 658 m 1 X s 3 lw 1751 658 m20
 6 lw 1760 659 m 2 X s 1777 659 m 1 X s 3 lw 1769 659 m20 6 lw 1778 660 m 1 X s 1795 660 m 1 X s 3 lw 1787 660 m20 6 lw 1796 653 m 1 X s 1813 653 m 1 X s 3 lw 1805 653 m20 6 lw 1814 659 m 1 X s 1831 659 m 1 X s 3 lw 1823 659 m20 6 lw 1832 654 m 1 X s
 1848 654 m 2 X s 3 lw 1841 654 m20 6 lw 1850 654 m 1 X s 1866 654 m 2 X s 3 lw 1859 654 m20 6 lw 1868 653 m 1 X s 1884 653 m 2 X s 3 lw 1877 653 m20 6 lw 1886 654 m 1 X s 1902 654 m 2 X s 3 lw 1895 654 m20 6 lw 1904 653 m 1 X s 1920 653 m 1 X s 3 lw
 1912 653 m20 6 lw 1921 651 m 2 X s 1938 651 m 1 X s 3 lw 1930 651 m20 6 lw 1939 652 m 2 X s 1956 652 m 1 X s 3 lw 1948 652 m20 6 lw 1957 652 m 2 X s 1974 652 m 1 X s 3 lw 1966 652 m20 6 lw 1975 651 m 2 X s 1992 651 m 1 X s 3 lw 1984 651 m20 6 lw
 1993 647 m 1 X s 2010 647 m 1 X s 3 lw 2002 647 m20 6 lw 2011 649 m 1 X s 2028 649 m 1 X s 3 lw 2020 649 m20 6 lw 2029 647 m 1 X s 2045 647 m 2 X s 3 lw 2038 647 m20 6 lw 2047 650 m 1 X s 2063 650 m 2 X s 3 lw 2056 650 m20 6 lw 2065 649 m 1 X s 2081
 649 m 2 X s 3 lw 2074 649 m20 6 lw 2083 648 m 1 X s 2099 648 m 2 X s 3 lw 2092 648 m20 6 lw 2101 649 m 1 X s 2117 649 m 2 X s 3 lw 2110 649 m20 6 lw 2119 648 m 1 X s 2135 648 m 1 X s 3 lw 2127 648 m20 6 lw 2136 648 m 2 X s 2153 648 m 1 X s 3 lw 2145
 648 m20 6 lw 0.35 0.83 0.33 c 1 1 1 c 0.35 0.83 0.33 c 363 944 m 1 X s 379 944 m 2 X s 3 lw 372 944 m20 6 lw 381 1469 m 1 X s 397 1469 m 2 X s 3 lw 390 1469 m20 6 lw 399 1808 m 1 X s 415 1808 m 2 X s 3 lw 408 1808 m20 6 lw 417 1972 m 1 X s 433 1972
 m 1 X s 3 lw 426 1972 m20 6 lw 434 1997 m 2 X s 451 1997 m 1 X s 3 lw 443 1997 m20 6 lw 452 1959 m 2 X s 469 1959 m 1 X s 3 lw 461 1959 m20 6 lw 470 1906 m 2 X s 487 1906 m 1 X s 3 lw 479 1906 m20 6 lw 488 1819 m 2 X s 505 1819 m 1 X s 3 lw 497 1819
 m20 6 lw 506 1737 m 2 X s 523 1737 m 1 X s 3 lw 515 1737 m20 6 lw 524 1659 m 1 X s 541 1659 m 1 X s 3 lw 533 1659 m20 6 lw 542 1584 m 1 X s 559 1584 m 1 X s 3 lw 551 1584 m20 6 lw 560 1509 m 1 X s 576 1509 m 2 X s 3 lw 569 1509 m20 6 lw 578 1432 m 1
 X s 594 1432 m 2 X s 3 lw 587 1432 m20 6 lw 596 1368 m 1 X s 612 1368 m 2 X s 3 lw 605 1368 m20 6 lw 614 1306 m 1 X s 630 1306 m 2 X s 3 lw 623 1306 m20 6 lw 632 1247 m 1 X s 648 1247 m 1 X s 3 lw 641 1247 m20 6 lw 649 1195 m 2 X s 666 1195 m 1 X s
 3 lw 658 1195 m20 6 lw 667 1152 m 2 X s 684 1152 m 1 X s 3 lw 676 1152 m20 6 lw 685 1104 m 2 X s 702 1104 m 1 X s 3 lw 694 1104 m20 6 lw 703 1077 m 2 X s 720 1077 m 1 X s 3 lw 712 1077 m20 6 lw 721 1044 m 1 X s 738 1044 m 1 X s 3 lw 730 1044 m20 6
 lw 739 1007 m 1 X s 756 1007 m 1 X s 3 lw 748 1007 m20 6 lw 757 987 m 1 X s 774 987 m 1 X s 3 lw 766 987 m20 6 lw 775 960 m 1 X s 791 960 m 2 X s 3 lw 784 960 m20 6 lw 793 938 m 1 X s 809 938 m 2 X s 3 lw 802 938 m20 6 lw 811 919 m 1 X s 827 919 m 2
 X s 3 lw 820 919 m20 6 lw 829 902 m 1 X s 845 902 m 2 X s 3 lw 838 902 m20 6 lw 847 882 m 1 X s 863 882 m 1 X s 3 lw 855 882 m20 6 lw 864 866 m 2 X s 881 866 m 1 X s 3 lw 873 866 m20 6 lw 882 851 m 2 X s 899 851 m 1 X s 3 lw 891 851 m20 6 lw 900 842
 m 2 X s 917 842 m 1 X s 3 lw 909 842 m20 6 lw 918 827 m 2 X s 935 827 m 1 X s 3 lw 927 827 m20 6 lw 936 816 m 1 X s 953 816 m 1 X s 3 lw 945 816 m20 6 lw 954 804 m 1 X s 971 804 m 1 X s 3 lw 963 804 m20 6 lw 972 794 m 1 X s 989 794 m 1 X s 3 lw 981
 794 m20 6 lw 990 789 m 1 X s 1006 789 m 2 X s 3 lw 999 789 m20 6 lw 1008 779 m 1 X s 1024 779 m 2 X s 3 lw 1017 779 m20 6 lw 1026 770 m 1 X s 1042 770 m 2 X s 3 lw 1035 770 m20 6 lw 1044 762 m 1 X s 1060 762 m 2 X s 3 lw 1053 762 m20 6 lw 1062 755 m
 1 X s 1078 755 m 1 X s 3 lw 1070 755 m20 6 lw 1079 750 m 2 X s 1096 750 m 1 X s 3 lw 1088 750 m20 6 lw 1097 745 m 2 X s 1114 745 m 1 X s 3 lw 1106 745 m20 6 lw 1115 737 m 2 X s 1132 737 m 1 X s 3 lw 1124 737 m20 6 lw 1133 733 m 2 X s 1150 733 m 1 X
 s 3 lw 1142 733 m20 6 lw 1151 727 m 1 X s 1168 727 m 1 X s 3 lw 1160 727 m20 6 lw 1169 722 m 1 X s 1186 722 m 1 X s 3 lw 1178 722 m20 6 lw 1187 720 m 1 X s 1203 720 m 2 X s 3 lw 1196 720 m20 6 lw 1205 714 m 1 X s 1221 714 m 2 X s 3 lw 1214 714 m20 6
 lw 1223 713 m 1 X s 1239 713 m 2 X s 3 lw 1232 713 m20 6 lw 1241 708 m 1 X s 1257 708 m 2 X s 3 lw 1250 708 m20 6 lw 1259 703 m 1 X s 1275 703 m 1 X s 3 lw 1268 703 m20 6 lw 1276 701 m 2 X s 1293 701 m 1 X s 3 lw 1285 701 m20 6 lw 1294 698 m 2 X s
 1311 698 m 1 X s 3 lw 1303 698 m20 6 lw 1312 696 m 2 X s 1329 696 m 1 X s 3 lw 1321 696 m20 6 lw 1330 693 m 2 X s 1347 693 m 1 X s 3 lw 1339 693 m20 6 lw 1348 689 m 2 X s 1365 689 m 1 X s 3 lw 1357 689 m20 6 lw 1366 688 m 1 X s 1383 688 m 1 X s 3 lw
 1375 688 m20 6 lw 1384 686 m 1 X s 1401 686 m 1 X s 3 lw 1393 686 m20 6 lw 1402 683 m 1 X s 1418 683 m 2 X s 3 lw 1411 683 m20 6 lw 1420 681 m 1 X s 1436 681 m 2 X s 3 lw 1429 681 m20 6 lw 1438 679 m 1 X s 1454 679 m 2 X s 3 lw 1447 679 m20 6 lw
 1456 678 m 1 X s 1472 678 m 2 X s 3 lw 1465 678 m20 6 lw 1474 676 m 1 X s 1490 676 m 1 X s 3 lw 1483 676 m20 6 lw 1491 674 m 2 X s 1508 674 m 1 X s 3 lw 1500 674 m20 6 lw 1509 673 m 2 X s 1526 673 m 1 X s 3 lw 1518 673 m20 6 lw 1527 671 m 2 X s 1544
 671 m 1 X s 3 lw 1536 671 m20 6 lw 1545 668 m 2 X s 1562 668 m 1 X s 3 lw 1554 668 m20 6 lw 1563 667 m 1 X s 1580 667 m 1 X s 3 lw 1572 667 m20 6 lw 1581 666 m 1 X s 1598 666 m 1 X s 3 lw 1590 666 m20 6 lw 1599 665 m 1 X s 1616 665 m 1 X s 3 lw 1608
 665 m20 6 lw 1617 665 m 1 X s 1633 665 m 2 X s 3 lw 1626 665 m20 6 lw 1635 664 m 1 X s 1651 664 m 2 X s 3 lw 1644 664 m20 6 lw 1653 662 m 1 X s 1669 662 m 2 X s 3 lw 1662 662 m20 6 lw 1671 661 m 1 X s 1687 661 m 2 X s 3 lw 1680 661 m20 6 lw 1689 659
 m 1 X s 1705 659 m 1 X s 3 lw 1697 659 m20 6 lw 1706 659 m 2 X s 1723 659 m 1 X s 3 lw 1715 659 m20 6 lw 1724 658 m 2 X s 1741 658 m 1 X s 3 lw 1733 658 m20 6 lw 1742 657 m 2 X s 1759 657 m 1 X s 3 lw 1751 657 m20 6 lw 1760 657 m 2 X s 1777 657 m 1
 X s 3 lw 1769 657 m20 6 lw 1778 656 m 1 X s 1795 656 m 1 X s 3 lw 1787 656 m20 6 lw 1796 655 m 1 X s 1813 655 m 1 X s 3 lw 1805 655 m20 6 lw 1814 655 m 1 X s 1831 655 m 1 X s 3 lw 1823 655 m20 6 lw 1832 654 m 1 X s 1848 654 m 2 X s 3 lw 1841 654 m20
 6 lw 1850 653 m 1 X s 1866 653 m 2 X s 3 lw 1859 653 m20 6 lw 1868 652 m 1 X s 1884 652 m 2 X s 3 lw 1877 652 m20 6 lw 1886 652 m 1 X s 1902 652 m 2 X s 3 lw 1895 652 m20 6 lw 1904 651 m 1 X s 1920 651 m 1 X s 3 lw 1912 651 m20 6 lw 1921 651 m 2 X s
 1938 651 m 1 X s 3 lw 1930 651 m20 6 lw 1939 651 m 2 X s 1956 651 m 1 X s 3 lw 1948 651 m20 6 lw 1957 650 m 2 X s 1974 650 m 1 X s 3 lw 1966 650 m20 6 lw 1975 649 m 2 X s 1992 649 m 1 X s 3 lw 1984 649 m20 6 lw 1993 649 m 1 X s 2010 649 m 1 X s 3 lw
 2002 649 m20 6 lw 2011 649 m 1 X s 2028 649 m 1 X s 3 lw 2020 649 m20 6 lw 2029 648 m 1 X s 2045 648 m 2 X s 3 lw 2038 648 m20 6 lw 2047 648 m 1 X s 2063 648 m 2 X s 3 lw 2056 648 m20 6 lw 2065 647 m 1 X s 2081 647 m 2 X s 3 lw 2074 647 m20 6 lw
 2083 647 m 1 X s 2099 647 m 2 X s 3 lw 2092 647 m20 6 lw 2101 647 m 1 X s 2117 647 m 2 X s 3 lw 2110 647 m20 6 lw 2119 646 m 1 X s 2135 646 m 1 X s 3 lw 2127 646 m20 6 lw 2136 647 m 2 X s 2153 647 m 1 X s 3 lw 2145 647 m20 6 lw 0 0 1 c 1 1 1 c 0 0 1
 c 363 871 m 1 X s 379 871 m 2 X s 3 lw 372 871 m20 6 lw 381 952 m 1 X s 397 952 m 2 X s 3 lw 390 952 m20 6 lw 399 1454 m 1 X s 415 1454 m 2 X s 3 lw 408 1454 m20 6 lw 417 1666 m 1 X s 433 1666 m 1 X s 3 lw 426 1666 m20 6 lw 443 2009 m s 443 2025 m s
 434 2017 m 2 X s 451 2017 m 1 X s 3 lw 443 2017 m20 6 lw 461 1949 m 2 Y s 461 1966 m 1 Y s 452 1958 m 2 X s 469 1958 m 1 X s 3 lw 461 1958 m20 6 lw 479 1863 m 2 Y s 479 1880 m 2 Y s 470 1873 m 2 X s 487 1873 m 1 X s 3 lw 479 1873 m20 6 lw 497 1866 m
 3 Y s 497 1884 m 3 Y s 488 1876 m 2 X s 505 1876 m 1 X s 3 lw 497 1876 m20 6 lw 515 1735 m 2 Y s 515 1752 m 2 Y s 506 1745 m 2 X s 523 1745 m 1 X s 3 lw 515 1745 m20 6 lw 533 1650 m 1 Y s 533 1666 m 1 Y s 524 1658 m 1 X s 541 1658 m 1 X s 3 lw 533
 1658 m20 6 lw 542 1583 m 1 X s 559 1583 m 1 X s 3 lw 551 1583 m20 6 lw 560 1505 m 1 X s 576 1505 m 2 X s 3 lw 569 1505 m20 6 lw 578 1505 m 1 X s 594 1505 m 2 X s 3 lw 587 1505 m20 6 lw 596 1381 m 1 X s 612 1381 m 2 X s 3 lw 605 1381 m20 6 lw 614
 1344 m 1 X s 630 1344 m 2 X s 3 lw 623 1344 m20 6 lw 632 1298 m 1 X s 648 1298 m 1 X s 3 lw 641 1298 m20 6 lw 649 1261 m 2 X s 666 1261 m 1 X s 3 lw 658 1261 m20 6 lw 667 1218 m 2 X s 684 1218 m 1 X s 3 lw 676 1218 m20 6 lw 685 1164 m 2 X s 702 1164
 m 1 X s 3 lw 694 1164 m20 6 lw 703 1132 m 2 X s 720 1132 m 1 X s 3 lw 712 1132 m20 6 lw 721 1090 m 1 X s 738 1090 m 1 X s 3 lw 730 1090 m20 6 lw 739 1042 m 1 X s 756 1042 m 1 X s 3 lw 748 1042 m20 6 lw 757 1026 m 1 X s 774 1026 m 1 X s 3 lw 766 1026
 m20 6 lw 775 987 m 1 X s 791 987 m 2 X s 3 lw 784 987 m20 6 lw 793 919 m 1 X s 809 919 m 2 X s 3 lw 802 919 m20 6 lw 811 963 m 1 X s 827 963 m 2 X s 3 lw 820 963 m20 6 lw 829 912 m 1 X s 845 912 m 2 X s 3 lw 838 912 m20 6 lw 847 913 m 1 X s 863 913
 m 1 X s 3 lw 855 913 m20 6 lw 864 890 m 2 X s 881 890 m 1 X s 3 lw 873 890 m20 6 lw 882 879 m 2 X s 899 879 m 1 X s 3 lw 891 879 m20 6 lw 900 875 m 2 X s 917 875 m 1 X s 3 lw 909 875 m20 6 lw 918 852 m 2 X s 935 852 m 1 X s 3 lw 927 852 m20 6 lw 936
 833 m 1 X s 953 833 m 1 X s 3 lw 945 833 m20 6 lw 954 839 m 1 X s 971 839 m 1 X s 3 lw 963 839 m20 6 lw 972 812 m 1 X s 989 812 m 1 X s 3 lw 981 812 m20 6 lw 990 817 m 1 X s 1006 817 m 2 X s 3 lw 999 817 m20 6 lw 1008 789 m 1 X s 1024 789 m 2 X s 3
 lw 1017 789 m20 6 lw 1026 796 m 1 X s 1042 796 m 2 X s 3 lw 1035 796 m20 6 lw 1044 791 m 1 X s 1060 791 m 2 X s 3 lw 1053 791 m20 6 lw 1062 769 m 1 X s 1078 769 m 1 X s 3 lw 1070 769 m20 6 lw 1079 769 m 2 X s 1096 769 m 1 X s 3 lw 1088 769 m20 6 lw
 1097 765 m 2 X s 1114 765 m 1 X s 3 lw 1106 765 m20 6 lw 1115 753 m 2 X s 1132 753 m 1 X s 3 lw 1124 753 m20 6 lw 1133 742 m 2 X s 1150 742 m 1 X s 3 lw 1142 742 m20 6 lw 1151 734 m 1 X s 1168 734 m 1 X s 3 lw 1160 734 m20 6 lw 1169 731 m 1 X s 1186
 731 m 1 X s 3 lw 1178 731 m20 6 lw 1187 722 m 1 X s 1203 722 m 2 X s 3 lw 1196 722 m20 6 lw 1205 715 m 1 X s 1221 715 m 2 X s 3 lw 1214 715 m20 6 lw 1223 704 m 1 X s 1239 704 m 2 X s 3 lw 1232 704 m20 6 lw 1241 717 m 1 X s 1257 717 m 2 X s 3 lw 1250
 717 m20 6 lw 1259 714 m 1 X s 1275 714 m 1 X s 3 lw 1268 714 m20 6 lw 1276 704 m 2 X s 1293 704 m 1 X s 3 lw 1285 704 m20 6 lw 1294 712 m 2 X s 1311 712 m 1 X s 3 lw 1303 712 m20 6 lw 1312 706 m 2 X s 1329 706 m 1 X s 3 lw 1321 706 m20 6 lw 1330 696
 m 2 X s 1347 696 m 1 X s 3 lw 1339 696 m20 6 lw 1348 707 m 2 X s 1365 707 m 1 X s 3 lw 1357 707 m20 6 lw 1366 686 m 1 X s 1383 686 m 1 X s 3 lw 1375 686 m20 6 lw 1384 688 m 1 X s 1401 688 m 1 X s 3 lw 1393 688 m20 6 lw 1402 686 m 1 X s 1418 686 m 2
 X s 3 lw 1411 686 m20 6 lw 1420 679 m 1 X s 1436 679 m 2 X s 3 lw 1429 679 m20 6 lw 1438 682 m 1 X s 1454 682 m 2 X s 3 lw 1447 682 m20 6 lw 1456 686 m 1 X s 1472 686 m 2 X s 3 lw 1465 686 m20 6 lw 1474 679 m 1 X s 1490 679 m 1 X s 3 lw 1483 679 m20
 6 lw 1491 675 m 2 X s 1508 675 m 1 X s 3 lw 1500 675 m20 6 lw 1509 681 m 2 X s 1526 681 m 1 X s 3 lw 1518 681 m20 6 lw 1527 678 m 2 X s 1544 678 m 1 X s 3 lw 1536 678 m20 6 lw 1545 671 m 2 X s 1562 671 m 1 X s 3 lw 1554 671 m20 6 lw 1563 672 m 1 X s
 1580 672 m 1 X s 3 lw 1572 672 m20 6 lw 1581 669 m 1 X s 1598 669 m 1 X s 3 lw 1590 669 m20 6 lw 1599 664 m 1 X s 1616 664 m 1 X s 3 lw 1608 664 m20 6 lw 1617 666 m 1 X s 1633 666 m 2 X s 3 lw 1626 666 m20 6 lw 1635 669 m 1 X s 1651 669 m 2 X s 3 lw
 1644 669 m20 6 lw 1653 671 m 1 X s 1669 671 m 2 X s 3 lw 1662 671 m20 6 lw 1671 664 m 1 X s 1687 664 m 2 X s 3 lw 1680 664 m20 6 lw 1689 665 m 1 X s 1705 665 m 1 X s 3 lw 1697 665 m20 6 lw 1706 657 m 2 X s 1723 657 m 1 X s 3 lw 1715 657 m20 6 lw
 1724 659 m 2 X s 1741 659 m 1 X s 3 lw 1733 659 m20 6 lw 1742 660 m 2 X s 1759 660 m 1 X s 3 lw 1751 660 m20 6 lw 1760 659 m 2 X s 1777 659 m 1 X s 3 lw 1769 659 m20 6 lw 1778 655 m 1 X s 1795 655 m 1 X s 3 lw 1787 655 m20 6 lw 1796 657 m 1 X s 1813
 657 m 1 X s 3 lw 1805 657 m20 6 lw 1814 657 m 1 X s 1831 657 m 1 X s 3 lw 1823 657 m20 6 lw 1832 656 m 1 X s 1848 656 m 2 X s 3 lw 1841 656 m20 6 lw 1850 655 m 1 X s 1866 655 m 2 X s 3 lw 1859 655 m20 6 lw 1868 652 m 1 X s 1884 652 m 2 X s 3 lw 1877
 652 m20 6 lw 1886 654 m 1 X s 1902 654 m 2 X s 3 lw 1895 654 m20 6 lw 1904 649 m 1 X s 1920 649 m 1 X s 3 lw 1912 649 m20 6 lw 1921 650 m 2 X s 1938 650 m 1 X s 3 lw 1930 650 m20 6 lw 1939 652 m 2 X s 1956 652 m 1 X s 3 lw 1948 652 m20 6 lw 1957 652
 m 2 X s 1974 652 m 1 X s 3 lw 1966 652 m20 6 lw 1975 650 m 2 X s 1992 650 m 1 X s 3 lw 1984 650 m20 6 lw 1993 650 m 1 X s 2010 650 m 1 X s 3 lw 2002 650 m20 6 lw 2011 647 m 1 X s 2028 647 m 1 X s 3 lw 2020 647 m20 6 lw 2029 648 m 1 X s 2045 648 m 2
 X s 3 lw 2038 648 m20 6 lw 2047 649 m 1 X s 2063 649 m 2 X s 3 lw 2056 649 m20 6 lw 2065 651 m 1 X s 2081 651 m 2 X s 3 lw 2074 651 m20 6 lw 2083 649 m 1 X s 2099 649 m 2 X s 3 lw 2092 649 m20 6 lw 2101 646 m 1 X s 2117 646 m 2 X s 3 lw 2110 646 m20
 6 lw 2119 646 m 1 X s 2135 646 m 1 X s 3 lw 2127 646 m20 6 lw 2136 647 m 2 X s 2153 647 m 1 X s 3 lw 2145 647 m20 6 lw black
 gsave  2268 2557 0 0 C 2222.06 1856.79 t 90 r /Helvetica-BoldOblique findfont 41.8538 sf 0 0 m (LHC HIGGS XS WG 2013) show NC gr  3 lw 1 1 1 c 839 639 1247 1662 bf black 1270 1662 m -15 Y 832 X 631 Y -16 X -616 Y f 1247 1662 m 639 Y 839 X -639 Y
 -839 X cl s
 gsave  2268 2557 0 0 C 1632.3 2237.28 t 0 r /Helvetica-Bold findfont 60.8783 sf 0 0 m (=125 GeV) show NC gr 
 gsave  2268 2557 0 0 C 1605.67 2206.84 t 0 r /Helvetica-Bold findfont 38.0489 sf 0 0 m (H) show NC gr 
 gsave  2268 2557 0 0 C 1331.71 2237.28 t 0 r /Helvetica-Bold findfont 60.8783 sf 0 0 m 
 216 200 183 149 116 84 68 35
(=8 TeV, m) K NC gr 
 gsave  2268 2557 0 0 C 1297.47 2237.28 t 0 r /Helvetica-Bold findfont 60.8783 sf 0 0 m (s) show NC gr  6 lw 1259 2272 m 23 -39 d s 0 lw 1282 2233 m 8 54 d s 1290 2287 m 42 X s
 gsave  2268 2557 0 0 C 1453.47 2119.33 t 0 r /Helvetica findfont 60.8783 sf 0 0 m (HRes) show NC gr  1 0 0 c 6 lw 1279 2141 m 147 X s black
 gsave  2268 2557 0 0 C 1453.47 2012.79 t 0 r /Helvetica findfont 60.8783 sf 0 0 m (POWHEG) show NC gr  1279 2035 m 147 X s
 gsave  2268 2557 0 0 C 1453.47 1910.06 t 0 r /Helvetica findfont 60.8783 sf 0 0 m (Madgraph) show NC gr  0.35 0.83 0.33 c 1279 1928 m 147 X s black
 gsave  2268 2557 0 0 C 1453.47 1799.71 t 0 r /Helvetica findfont 60.8783 sf 0 0 m (aMCatNLO) show NC gr  1 0.8 0 c 1279 1822 m 147 X s black
 gsave  2268 2557 0 0 C 1453.47 1696.98 t 0 r /Helvetica findfont 60.8783 sf 0 0 m (Sherpa+NLO) show NC gr  0 0 1 c 1279 1715 m 147 X s black 3 lw 1 1 1 c 2268 614 0 0 bf black 1 1 1 c 1791 369 363 245 bf black 1791 369 363 245 bl 363 245 m 1791 X s[
 4 8] 0 sd 363 614 m -369 Y s 542 614 m -369 Y s 721 614 m -369 Y s 900 614 m -369 Y s 1079 614 m -369 Y s 1259 614 m -369 Y s 1438 614 m -369 Y s 1617 614 m -369 Y s 1796 614 m -369 Y s 1975 614 m -369 Y s 2154 614 m -369 Y s[  ] 0 sd 363 614 m 1791
 X s 363 245 m 369 Y s[ 4 8] 0 sd 2154 270 m -1791 X s 2154 319 m -1791 X s 2154 368 m -1791 X s 2154 417 m -1791 X s 2154 466 m -1791 X s 2154 515 m -1791 X s 2154 565 m -1791 X s 2154 614 m -1791 X s 2154 270 m -1791 X s[  ] 0 sd 2154 245 m 369 Y s
 1 0 0 c 6 lw 390 403 m 15 Y s 390 433 m 15 Y s 381 425 m 1 X s 397 425 m 2 X s 3 lw 390 425 m20 6 lw 408 402 m 8 Y s 408 425 m 9 Y s 399 418 m 1 X s 415 418 m 2 X s 3 lw 408 418 m20 6 lw 426 370 m 6 Y s 426 391 m 6 Y s 417 383 m 1 X s 433 383 m 1 X
 s 3 lw 426 383 m20 6 lw 443 376 m 2 Y s 443 393 m 2 Y s 434 386 m 2 X s 451 386 m 1 X s 3 lw 443 386 m20 6 lw 461 372 m 1 Y s 461 388 m 2 Y s 452 381 m 2 X s 469 381 m 1 X s 3 lw 461 381 m20 6 lw 470 378 m 2 X s 487 378 m 1 X s 3 lw 479 378 m20 6 lw
 497 366 m 1 Y s 497 382 m s 488 374 m 2 X s 505 374 m 1 X s 3 lw 497 374 m20 6 lw 515 365 m 1 Y s 515 381 m 1 Y s 506 373 m 2 X s 523 373 m 1 X s 3 lw 515 373 m20 6 lw 533 370 m 1 Y s 533 386 m 2 Y s 524 379 m 1 X s 541 379 m 1 X s 3 lw 533 379 m20
 6 lw 551 350 m 2 Y s 551 368 m 2 Y s 542 360 m 1 X s 559 360 m 1 X s 3 lw 551 360 m20 6 lw 569 353 m 3 Y s 569 371 m 3 Y s 560 364 m 1 X s 576 364 m 2 X s 3 lw 569 364 m20 6 lw 587 361 m 3 Y s 587 379 m 4 Y s 578 372 m 1 X s 594 372 m 2 X s 3 lw 587
 372 m20 6 lw 605 348 m 3 Y s 605 366 m 3 Y s 596 358 m 1 X s 612 358 m 2 X s 3 lw 605 358 m20 6 lw 623 362 m 5 Y s 623 382 m 4 Y s 614 374 m 1 X s 630 374 m 2 X s 3 lw 623 374 m20 6 lw 641 345 m 4 Y s 641 364 m 4 Y s 632 357 m 1 X s 648 357 m 1 X s
 3 lw 641 357 m20 6 lw 658 356 m 6 Y s 658 377 m 6 Y s 649 370 m 2 X s 666 370 m 1 X s 3 lw 658 370 m20 6 lw 676 355 m 5 Y s 676 375 m 5 Y s 667 367 m 2 X s 684 367 m 1 X s 3 lw 676 367 m20 6 lw 694 348 m 6 Y s 694 369 m 6 Y s 685 362 m 2 X s 702 362
 m 1 X s 3 lw 694 362 m20 6 lw 712 351 m 7 Y s 712 373 m 7 Y s 703 365 m 2 X s 720 365 m 1 X s 3 lw 712 365 m20 6 lw 730 362 m 8 Y s 730 386 m 8 Y s 721 378 m 1 X s 738 378 m 1 X s 3 lw 730 378 m20 6 lw 748 326 m 7 Y s 748 348 m 7 Y s 739 341 m 1 X s
 756 341 m 1 X s 3 lw 748 341 m20 6 lw 766 337 m 7 Y s 766 360 m 7 Y s 757 352 m 1 X s 774 352 m 1 X s 3 lw 766 352 m20 6 lw 784 336 m 9 Y s 784 360 m 9 Y s 775 352 m 1 X s 791 352 m 2 X s 3 lw 784 352 m20 6 lw 802 347 m 10 Y s 802 372 m 11 Y s 793
 365 m 1 X s 809 365 m 2 X s 3 lw 802 365 m20 6 lw 820 330 m 10 Y s 820 356 m 10 Y s 811 348 m 1 X s 827 348 m 2 X s 3 lw 820 348 m20 6 lw 838 342 m 12 Y s 838 369 m 12 Y s 829 362 m 1 X s 845 362 m 2 X s 3 lw 838 362 m20 6 lw 855 337 m 12 Y s 855
 364 m 12 Y s 847 356 m 1 X s 863 356 m 1 X s 3 lw 855 356 m20 6 lw 873 316 m 12 Y s 873 343 m 12 Y s 864 335 m 2 X s 881 335 m 1 X s 3 lw 873 335 m20 6 lw 891 340 m 13 Y s 891 368 m 13 Y s 882 360 m 2 X s 899 360 m 1 X s 3 lw 891 360 m20 6 lw 909
 328 m 13 Y s 909 356 m 14 Y s 900 349 m 2 X s 917 349 m 1 X s 3 lw 909 349 m20 6 lw 927 350 m 19 Y s 927 384 m 19 Y s 918 377 m 2 X s 935 377 m 1 X s 3 lw 927 377 m20 6 lw 945 324 m 12 Y s 945 352 m 12 Y s 936 344 m 1 X s 953 344 m 1 X s 3 lw 945
 344 m20 6 lw 963 319 m 16 Y s 963 351 m 16 Y s 954 343 m 1 X s 971 343 m 1 X s 3 lw 963 343 m20 6 lw 981 336 m 16 Y s 981 368 m 16 Y s 972 360 m 1 X s 989 360 m 1 X s 3 lw 981 360 m20 6 lw 999 309 m 20 Y s 999 344 m 20 Y s 990 337 m 1 X s 1006 337 m
 2 X s 3 lw 999 337 m20 6 lw 1017 291 m 21 Y s 1017 328 m 21 Y s 1008 320 m 1 X s 1024 320 m 2 X s 3 lw 1017 320 m20 6 lw 1035 312 m 21 Y s 1035 348 m 22 Y s 1026 341 m 1 X s 1042 341 m 2 X s 3 lw 1035 341 m20 6 lw 1053 343 m 23 Y s 1053 381 m 23 Y s
 1044 374 m 1 X s 1060 374 m 2 X s 3 lw 1053 374 m20 6 lw 1070 310 m 24 Y s 1070 350 m 24 Y s 1062 342 m 1 X s 1078 342 m 1 X s 3 lw 1070 342 m20 6 lw 1088 309 m 24 Y s 1088 348 m 24 Y s 1079 341 m 2 X s 1096 341 m 1 X s 3 lw 1088 341 m20 6 lw 1106
 298 m 19 Y s 1106 332 m 19 Y s 1097 325 m 2 X s 1114 325 m 1 X s 3 lw 1106 325 m20 6 lw 1124 335 m 26 Y s 1124 376 m 26 Y s 1115 369 m 2 X s 1132 369 m 1 X s 3 lw 1124 369 m20 6 lw 1142 318 m 28 Y s 1142 362 m 28 Y s 1133 354 m 2 X s 1150 354 m 1 X
 s 3 lw 1142 354 m20 6 lw 1160 317 m 34 Y s 1160 366 m 33 Y s 1151 358 m 1 X s 1168 358 m 1 X s 3 lw 1160 358 m20 6 lw 1178 321 m 27 Y s 1178 363 m 27 Y s 1169 356 m 1 X s 1186 356 m 1 X s 3 lw 1178 356 m20 6 lw 1196 331 m 31 Y s 1196 377 m 31 Y s
 1187 369 m 1 X s 1203 369 m 2 X s 3 lw 1196 369 m20 6 lw 1214 278 m 24 Y s 1214 317 m 24 Y s 1205 309 m 1 X s 1221 309 m 2 X s 3 lw 1214 309 m20 6 lw 1232 318 m 27 Y s 1232 360 m 27 Y s 1223 353 m 1 X s 1239 353 m 2 X s 3 lw 1232 353 m20 6 lw 1250
 322 m 29 Y s 1250 366 m 30 Y s 1241 359 m 1 X s 1257 359 m 2 X s 3 lw 1250 359 m20 6 lw 1268 310 m 23 Y s 1268 348 m 24 Y s 1259 341 m 1 X s 1275 341 m 1 X s 3 lw 1268 341 m20 6 lw 1285 318 m 24 Y s 1285 357 m 24 Y s 1276 349 m 2 X s 1293 349 m 1 X
 s 3 lw 1285 349 m20 6 lw 1303 309 m 23 Y s 1303 347 m 22 Y s 1294 339 m 2 X s 1311 339 m 1 X s 3 lw 1303 339 m20 6 lw 1321 337 m 24 Y s 1321 376 m 24 Y s 1312 369 m 2 X s 1329 369 m 1 X s 3 lw 1321 369 m20 6 lw 1339 309 m 24 Y s 1339 349 m 24 Y s
 1330 341 m 2 X s 1347 341 m 1 X s 3 lw 1339 341 m20 6 lw 1357 304 m 20 Y s 1357 340 m 20 Y s 1348 332 m 2 X s 1365 332 m 1 X s 3 lw 1357 332 m20 6 lw 1375 272 m 33 Y s 1375 320 m 33 Y s 1366 313 m 1 X s 1383 313 m 1 X s 3 lw 1375 313 m20 6 lw 1393
 326 m 43 Y s 1393 384 m 43 Y s 1384 376 m 1 X s 1401 376 m 1 X s 3 lw 1393 376 m20 6 lw 1411 308 m 23 Y s 1411 346 m 23 Y s 1402 339 m 1 X s 1418 339 m 2 X s 3 lw 1411 339 m20 6 lw 1429 341 m 16 Y s 1429 372 m 16 Y s 1420 365 m 1 X s 1436 365 m 2 X
 s 3 lw 1429 365 m20 6 lw 1447 280 m 16 Y s 1447 311 m 16 Y s 1438 303 m 1 X s 1454 303 m 2 X s 3 lw 1447 303 m20 6 lw 1465 324 m 19 Y s 1465 358 m 20 Y s 1456 351 m 1 X s 1472 351 m 2 X s 3 lw 1465 351 m20 6 lw 1483 340 m 22 Y s 1483 377 m 23 Y s
 1474 370 m 1 X s 1490 370 m 1 X s 3 lw 1483 370 m20 6 lw 1500 310 m 20 Y s 1500 345 m 20 Y s 1491 338 m 2 X s 1508 338 m 1 X s 3 lw 1500 338 m20 6 lw 1518 291 m 15 Y s 1518 321 m 15 Y s 1509 313 m 2 X s 1526 313 m 1 X s 3 lw 1518 313 m20 6 lw 1536
 347 m 27 Y s 1536 389 m 27 Y s 1527 382 m 2 X s 1544 382 m 1 X s 3 lw 1536 382 m20 6 lw 1554 342 m 23 Y s 1554 380 m 23 Y s 1545 372 m 2 X s 1562 372 m 1 X s 3 lw 1554 372 m20 6 lw 1572 298 m 20 Y s 1572 333 m 20 Y s 1563 325 m 1 X s 1580 325 m 1 X
 s 3 lw 1572 325 m20 6 lw 1590 329 m 22 Y s 1590 366 m 22 Y s 1581 359 m 1 X s 1598 359 m 1 X s 3 lw 1590 359 m20 6 lw 1608 311 m 18 Y s 1608 344 m 18 Y s 1599 337 m 1 X s 1616 337 m 1 X s 3 lw 1608 337 m20 6 lw 1626 298 m 16 Y s 1626 329 m 17 Y s
 1617 322 m 1 X s 1633 322 m 2 X s 3 lw 1626 322 m20 6 lw 1644 307 m 23 Y s 1644 345 m 23 Y s 1635 337 m 1 X s 1651 337 m 2 X s 3 lw 1644 337 m20 6 lw 1662 320 m 25 Y s 1662 360 m 26 Y s 1653 353 m 1 X s 1669 353 m 2 X s 3 lw 1662 353 m20 6 lw 1680
 317 m 20 Y s 1680 352 m 19 Y s 1671 344 m 1 X s 1687 344 m 2 X s 3 lw 1680 344 m20 6 lw 1697 296 m 13 Y s 1697 324 m 13 Y s 1689 317 m 1 X s 1705 317 m 1 X s 3 lw 1697 317 m20 6 lw 1715 337 m 26 Y s 1715 378 m 26 Y s 1706 370 m 2 X s 1723 370 m 1 X
 s 3 lw 1715 370 m20 6 lw 1733 284 m 14 Y s 1733 313 m 14 Y s 1724 305 m 2 X s 1741 305 m 1 X s 3 lw 1733 305 m20 6 lw 1751 301 m 18 Y s 1751 334 m 18 Y s 1742 326 m 2 X s 1759 326 m 1 X s 3 lw 1751 326 m20 6 lw 1769 275 m 15 Y s 1769 305 m 15 Y s
 1760 297 m 2 X s 1777 297 m 1 X s 3 lw 1769 297 m20 6 lw 1787 344 m 28 Y s 1787 387 m 28 Y s 1778 380 m 1 X s 1795 380 m 1 X s 3 lw 1787 380 m20 6 lw 1805 412 m 49 Y s 1805 476 m 49 Y s 1796 469 m 1 X s 1813 469 m 1 X s 3 lw 1805 469 m20 6 lw 1823
 314 m 25 Y s 1823 354 m 25 Y s 1814 346 m 1 X s 1831 346 m 1 X s 3 lw 1823 346 m20 6 lw 1841 322 m 33 Y s 1841 370 m 33 Y s 1832 362 m 1 X s 1848 362 m 2 X s 3 lw 1841 362 m20 6 lw 1859 361 m 42 Y s 1859 418 m 41 Y s 1850 410 m 1 X s 1866 410 m 2 X
 s 3 lw 1859 410 m20 6 lw 1877 357 m 37 Y s 1877 409 m 37 Y s 1868 401 m 1 X s 1884 401 m 2 X s 3 lw 1877 401 m20 6 lw 1895 408 m 55 Y s 1895 479 m 55 Y s 1886 471 m 1 X s 1902 471 m 2 X s 3 lw 1895 471 m20 6 lw 1912 324 m 47 Y s 1912 387 m 47 Y s
 1904 379 m 1 X s 1920 379 m 1 X s 3 lw 1912 379 m20 6 lw 1930 382 m 52 Y s 1930 449 m 52 Y s 1921 441 m 2 X s 1938 441 m 1 X s 3 lw 1930 441 m20 6 lw 1948 351 m 35 Y s 1948 401 m 35 Y s 1939 393 m 2 X s 1956 393 m 1 X s 3 lw 1948 393 m20 6 lw 1966
 370 m 45 Y s 1966 430 m 46 Y s 1957 423 m 2 X s 1974 423 m 1 X s 3 lw 1966 423 m20 6 lw 1984 261 m 21 Y s 1984 297 m 22 Y s 1975 290 m 2 X s 1992 290 m 1 X s 3 lw 1984 290 m20 6 lw 2002 305 m 45 Y s 2002 365 m 45 Y s 1993 357 m 1 X s 2010 357 m 1 X
 s 3 lw 2002 357 m20 6 lw 2020 313 m 58 Y s 2020 386 m 58 Y s 2011 379 m 1 X s 2028 379 m 1 X s 3 lw 2020 379 m20 6 lw 2038 277 m 27 Y s 2038 320 m 27 Y s 2029 312 m 1 X s 2045 312 m 2 X s 3 lw 2038 312 m20 6 lw 2056 315 m 34 Y s 2056 365 m 34 Y s
 2047 357 m 1 X s 2063 357 m 2 X s 3 lw 2056 357 m20 6 lw 2074 337 m 46 Y s 2074 398 m 45 Y s 2065 390 m 1 X s 2081 390 m 2 X s 3 lw 2074 390 m20 6 lw 2092 338 m 57 Y s 2092 410 m 57 Y s 2083 403 m 1 X s 2099 403 m 2 X s 3 lw 2092 403 m20 6 lw 2110
 296 m 78 Y s 2110 389 m 78 Y s 2101 382 m 1 X s 2117 382 m 2 X s 3 lw 2110 382 m20 6 lw 2127 368 m 56 Y s 2127 439 m 57 Y s 2119 432 m 1 X s 2135 432 m 1 X s 3 lw 2127 432 m20 6 lw 2145 327 m 45 Y s 2145 387 m 45 Y s 2136 379 m 2 X s 2153 379 m 1 X
 s 3 lw 2145 379 m20 6 lw black 3 lw 363 245 m 1791 X s
 gsave  2268 614 0 0 C 1944.3 91.3174 t 0 r /Helvetica-Bold findfont 72.4187 sf 0 0 m ( \(GeV\)) show NC gr 
 gsave  2268 614 0 0 C 1913.86 57.0734 t 0 r /Helvetica-Bold findfont 45.7381 sf 0 0 m (T) show NC gr 
 gsave  2268 614 0 0 C 1651.32 91.3174 t 0 r /Helvetica-Bold findfont 72.4187 sf 0 0 m (Higgs p) show NC gr  363 260 m -15 Y s 408 253 m -8 Y s 452 253 m -8 Y s 497 253 m -8 Y s 542 260 m -15 Y s 587 253 m -8 Y s 632 253 m -8 Y s 676 253 m -8 Y s 721
 260 m -15 Y s 766 253 m -8 Y s 811 253 m -8 Y s 855 253 m -8 Y s 900 260 m -15 Y s 945 253 m -8 Y s 990 253 m -8 Y s 1035 253 m -8 Y s 1079 260 m -15 Y s 1124 253 m -8 Y s 1169 253 m -8 Y s 1214 253 m -8 Y s 1259 260 m -15 Y s 1303 253 m -8 Y s 1348
 253 m -8 Y s 1393 253 m -8 Y s 1438 260 m -15 Y s 1483 253 m -8 Y s 1527 253 m -8 Y s 1572 253 m -8 Y s 1617 260 m -15 Y s 1662 253 m -8 Y s 1706 253 m -8 Y s 1751 253 m -8 Y s 1796 260 m -15 Y s 1841 253 m -8 Y s 1886 253 m -8 Y s 1930 253 m -8 Y s
 1975 260 m -15 Y s 2020 253 m -8 Y s 2065 253 m -8 Y s 2110 253 m -8 Y s 2154 260 m -15 Y s
 gsave  2268 614 0 0 C 342.44 182.635 t 0 r /Helvetica-Bold findfont 72.4187 sf 0 0 m (0) show NC gr 
 gsave  2268 614 0 0 C 498.441 182.635 t 0 r /Helvetica-Bold findfont 72.4187 sf 0 0 m (20) show NC gr 
 gsave  2268 614 0 0 C 677.271 182.635 t 0 r /Helvetica-Bold findfont 72.4187 sf 0 0 m (40) show NC gr 
 gsave  2268 614 0 0 C 856.101 182.635 t 0 r /Helvetica-Bold findfont 72.4187 sf 0 0 m (60) show NC gr 
 gsave  2268 614 0 0 C 1034.93 182.635 t 0 r /Helvetica-Bold findfont 72.4187 sf 0 0 m (80) show NC gr 
 gsave  2268 614 0 0 C 1194.74 182.635 t 0 r /Helvetica-Bold findfont 72.4187 sf 0 0 m (100) show NC gr 
 gsave  2268 614 0 0 C 1373.57 182.635 t 0 r /Helvetica-Bold findfont 72.4187 sf 0 0 m (120) show NC gr 
 gsave  2268 614 0 0 C 1552.4 182.635 t 0 r /Helvetica-Bold findfont 72.4187 sf 0 0 m (140) show NC gr 
 gsave  2268 614 0 0 C 1735.03 182.635 t 0 r /Helvetica-Bold findfont 72.4187 sf 0 0 m (160) show NC gr 
 gsave  2268 614 0 0 C 1913.86 182.635 t 0 r /Helvetica-Bold findfont 72.4187 sf 0 0 m (180) show NC gr 
 gsave  2268 614 0 0 C 2092.69 182.635 t 0 r /Helvetica-Bold findfont 72.4187 sf 0 0 m (200) show NC gr  363 614 m 1791 X s 363 599 m 15 Y s 408 606 m 8 Y s 452 606 m 8 Y s 497 606 m 8 Y s 542 599 m 15 Y s 587 606 m 8 Y s 632 606 m 8 Y s 676 606 m 8
 Y s 721 599 m 15 Y s 766 606 m 8 Y s 811 606 m 8 Y s 855 606 m 8 Y s 900 599 m 15 Y s 945 606 m 8 Y s 990 606 m 8 Y s 1035 606 m 8 Y s 1079 599 m 15 Y s 1124 606 m 8 Y s 1169 606 m 8 Y s 1214 606 m 8 Y s 1259 599 m 15 Y s 1303 606 m 8 Y s 1348 606 m
 8 Y s 1393 606 m 8 Y s 1438 599 m 15 Y s 1483 606 m 8 Y s 1527 606 m 8 Y s 1572 606 m 8 Y s 1617 599 m 15 Y s 1662 606 m 8 Y s 1706 606 m 8 Y s 1751 606 m 8 Y s 1796 599 m 15 Y s 1841 606 m 8 Y s 1886 606 m 8 Y s 1930 606 m 8 Y s 1975 599 m 15 Y s
 2020 606 m 8 Y s 2065 606 m 8 Y s 2110 606 m 8 Y s 2154 599 m 15 Y s 363 245 m 369 Y s
 gsave  2268 614 0 0 C 228.294 53.2685 t 90 r /Helvetica-Bold findfont 72.4187 sf 0 0 m (Ratio to Powheg) show NC gr  404 270 m -41 X s 383 282 m -20 X s 383 295 m -20 X s 383 307 m -20 X s 404 319 m -41 X s 383 331 m -20 X s 383 344 m -20 X s 383
 356 m -20 X s 404 368 m -41 X s 383 380 m -20 X s 383 393 m -20 X s 383 405 m -20 X s 404 417 m -41 X s 383 430 m -20 X s 383 442 m -20 X s 383 454 m -20 X s 404 466 m -41 X s 383 479 m -20 X s 383 491 m -20 X s 383 503 m -20 X s 404 515 m -41 X s
 383 528 m -20 X s 383 540 m -20 X s 383 552 m -20 X s 404 565 m -41 X s 383 577 m -20 X s 383 589 m -20 X s 383 601 m -20 X s 404 614 m -41 X s 404 270 m -41 X s 383 258 m -20 X s 383 245 m -20 X s
 gsave  2268 614 0 0 C 292.977 254.928 t 0 r /Helvetica-Bold findfont 41.9266 sf 0 0 m (0.6) show NC gr 
 gsave  2268 614 0 0 C 292.977 304.391 t 0 r /Helvetica-Bold findfont 41.9266 sf 0 0 m (0.8) show NC gr 
 gsave  2268 614 0 0 C 331.026 350.05 t 0 r /Helvetica-Bold findfont 41.9266 sf 0 0 m (1) show NC gr 
 gsave  2268 614 0 0 C 292.977 399.514 t 0 r /Helvetica-Bold findfont 41.9266 sf 0 0 m (1.2) show NC gr 
 gsave  2268 614 0 0 C 289.172 448.977 t 0 r /Helvetica-Bold findfont 41.9266 sf 0 0 m (1.4) show NC gr 
 gsave  2268 614 0 0 C 292.977 502.246 t 0 r /Helvetica-Bold findfont 41.9266 sf 0 0 m (1.6) show NC gr 
 gsave  2268 614 0 0 C 292.977 551.71 t 0 r /Helvetica-Bold findfont 41.9266 sf 0 0 m (1.8) show NC gr 
 gsave  2268 614 0 0 C 327.221 597.368 t 0 r /Helvetica-Bold findfont 41.9266 sf 0 0 m (2) show NC gr  2154 245 m 369 Y s 2114 270 m 40 X s 2134 282 m 20 X s 2134 295 m 20 X s 2134 307 m 20 X s 2114 319 m 40 X s 2134 331 m 20 X s 2134 344 m 20 X s
 2134 356 m 20 X s 2114 368 m 40 X s 2134 380 m 20 X s 2134 393 m 20 X s 2134 405 m 20 X s 2114 417 m 40 X s 2134 430 m 20 X s 2134 442 m 20 X s 2134 454 m 20 X s 2114 466 m 40 X s 2134 479 m 20 X s 2134 491 m 20 X s 2134 503 m 20 X s 2114 515 m 40 X
 s 2134 528 m 20 X s 2134 540 m 20 X s 2134 552 m 20 X s 2114 565 m 40 X s 2134 577 m 20 X s 2134 589 m 20 X s 2134 601 m 20 X s 2114 614 m 40 X s 2114 270 m 40 X s 2134 258 m 20 X s 2134 245 m 20 X s 1 0.8 0 c 6 lw 1 1 1 c 1 0.8 0 c 372 356 m 1 Y s
 372 372 m 1 Y s 363 365 m 1 X s 379 365 m 2 X s 3 lw 372 365 m20 6 lw 381 359 m 1 X s 397 359 m 2 X s 3 lw 390 359 m20 6 lw 399 358 m 1 X s 415 358 m 2 X s 3 lw 408 358 m20 6 lw 417 342 m 1 X s 433 342 m 1 X s 3 lw 426 342 m20 6 lw 434 342 m 2 X s
 451 342 m 1 X s 3 lw 443 342 m20 6 lw 452 343 m 2 X s 469 343 m 1 X s 3 lw 461 343 m20 6 lw 470 349 m 2 X s 487 349 m 1 X s 3 lw 479 349 m20 6 lw 488 347 m 2 X s 505 347 m 1 X s 3 lw 497 347 m20 6 lw 506 355 m 2 X s 523 355 m 1 X s 3 lw 515 355 m20
 6 lw 524 365 m 1 X s 541 365 m 1 X s 3 lw 533 365 m20 6 lw 542 363 m 1 X s 559 363 m 1 X s 3 lw 551 363 m20 6 lw 560 360 m 1 X s 576 360 m 2 X s 3 lw 569 360 m20 6 lw 578 373 m 1 X s 594 373 m 2 X s 3 lw 587 373 m20 6 lw 596 368 m 1 X s 612 368 m 2
 X s 3 lw 605 368 m20 6 lw 614 385 m 1 X s 630 385 m 2 X s 3 lw 623 385 m20 6 lw 632 375 m 1 X s 648 375 m 1 X s 3 lw 641 375 m20 6 lw 649 389 m 2 X s 666 389 m 1 X s 3 lw 658 389 m20 6 lw 667 391 m 2 X s 684 391 m 1 X s 3 lw 676 391 m20 6 lw 685 382
 m 2 X s 702 382 m 1 X s 3 lw 694 382 m20 6 lw 703 390 m 2 X s 720 390 m 1 X s 3 lw 712 390 m20 6 lw 721 406 m 1 X s 738 406 m 1 X s 3 lw 730 406 m20 6 lw 739 384 m 1 X s 756 384 m 1 X s 3 lw 748 384 m20 6 lw 757 395 m 1 X s 774 395 m 1 X s 3 lw 766
 395 m20 6 lw 775 393 m 1 X s 791 393 m 2 X s 3 lw 784 393 m20 6 lw 802 392 m 1 Y s 802 408 m s 793 400 m 1 X s 809 400 m 2 X s 3 lw 802 400 m20 6 lw 820 385 m s 820 400 m s 811 392 m 1 X s 827 392 m 2 X s 3 lw 820 392 m20 6 lw 838 380 m s 838 396 m
 s 829 388 m 1 X s 845 388 m 2 X s 3 lw 838 388 m20 6 lw 855 376 m 1 Y s 855 392 m s 847 384 m 1 X s 863 384 m 1 X s 3 lw 855 384 m20 6 lw 873 372 m 1 Y s 873 388 m 1 Y s 864 381 m 2 X s 881 381 m 1 X s 3 lw 873 381 m20 6 lw 891 383 m 1 Y s 891 399 m
 2 Y s 882 392 m 2 X s 899 392 m 1 X s 3 lw 891 392 m20 6 lw 909 358 m 1 Y s 909 374 m 1 Y s 900 366 m 2 X s 917 366 m 1 X s 3 lw 909 366 m20 6 lw 927 388 m 2 Y s 927 405 m 3 Y s 918 398 m 2 X s 935 398 m 1 X s 3 lw 927 398 m20 6 lw 945 376 m 2 Y s
 945 394 m 2 Y s 936 386 m 1 X s 953 386 m 1 X s 3 lw 945 386 m20 6 lw 963 357 m 1 Y s 963 373 m 2 Y s 954 366 m 1 X s 971 366 m 1 X s 3 lw 963 366 m20 6 lw 981 362 m 2 Y s 981 380 m 2 Y s 972 372 m 1 X s 989 372 m 1 X s 3 lw 981 372 m20 6 lw 999 367
 m 3 Y s 999 385 m 2 Y s 990 377 m 1 X s 1006 377 m 2 X s 3 lw 999 377 m20 6 lw 1017 354 m 3 Y s 1017 372 m 3 Y s 1008 364 m 1 X s 1024 364 m 2 X s 3 lw 1017 364 m20 6 lw 1035 370 m 4 Y s 1035 389 m 4 Y s 1026 382 m 1 X s 1042 382 m 2 X s 3 lw 1035
 382 m20 6 lw 1053 376 m 4 Y s 1053 396 m 4 Y s 1044 388 m 1 X s 1060 388 m 2 X s 3 lw 1053 388 m20 6 lw 1070 356 m 4 Y s 1070 375 m 4 Y s 1062 367 m 1 X s 1078 367 m 1 X s 3 lw 1070 367 m20 6 lw 1088 346 m 3 Y s 1088 365 m 3 Y s 1079 357 m 2 X s
 1096 357 m 1 X s 3 lw 1088 357 m20 6 lw 1106 368 m 5 Y s 1106 388 m 5 Y s 1097 380 m 2 X s 1114 380 m 1 X s 3 lw 1106 380 m20 6 lw 1124 373 m 6 Y s 1124 394 m 6 Y s 1115 387 m 2 X s 1132 387 m 1 X s 3 lw 1124 387 m20 6 lw 1142 376 m 6 Y s 1142 397 m
 7 Y s 1133 390 m 2 X s 1150 390 m 1 X s 3 lw 1142 390 m20 6 lw 1160 391 m 8 Y s 1160 415 m 8 Y s 1151 407 m 1 X s 1168 407 m 1 X s 3 lw 1160 407 m20 6 lw 1178 362 m 7 Y s 1178 384 m 6 Y s 1169 376 m 1 X s 1186 376 m 1 X s 3 lw 1178 376 m20 6 lw 1196
 365 m 7 Y s 1196 387 m 7 Y s 1187 379 m 1 X s 1203 379 m 2 X s 3 lw 1196 379 m20 6 lw 1214 346 m 6 Y s 1214 367 m 6 Y s 1205 359 m 1 X s 1221 359 m 2 X s 3 lw 1214 359 m20 6 lw 1232 357 m 7 Y s 1232 380 m 7 Y s 1223 372 m 1 X s 1239 372 m 2 X s 3 lw
 1232 372 m20 6 lw 1250 374 m 9 Y s 1250 398 m 9 Y s 1241 391 m 1 X s 1257 391 m 2 X s 3 lw 1250 391 m20 6 lw 1268 354 m 8 Y s 1268 377 m 8 Y s 1259 369 m 1 X s 1275 369 m 1 X s 3 lw 1268 369 m20 6 lw 1285 363 m 9 Y s 1285 387 m 9 Y s 1276 380 m 2 X
 s 1293 380 m 1 X s 3 lw 1285 380 m20 6 lw 1303 373 m 11 Y s 1303 399 m 10 Y s 1294 391 m 2 X s 1311 391 m 1 X s 3 lw 1303 391 m20 6 lw 1321 384 m 12 Y s 1321 412 m 12 Y s 1312 404 m 2 X s 1329 404 m 1 X s 3 lw 1321 404 m20 6 lw 1339 383 m 12 Y s
 1339 411 m 12 Y s 1330 403 m 2 X s 1347 403 m 1 X s 3 lw 1339 403 m20 6 lw 1357 358 m 11 Y s 1357 384 m 10 Y s 1348 376 m 2 X s 1365 376 m 1 X s 3 lw 1357 376 m20 6 lw 1375 368 m 12 Y s 1375 395 m 11 Y s 1366 387 m 1 X s 1383 387 m 1 X s 3 lw 1375
 387 m20 6 lw 1393 357 m 12 Y s 1393 384 m 13 Y s 1384 377 m 1 X s 1401 377 m 1 X s 3 lw 1393 377 m20 6 lw 1411 374 m 14 Y s 1411 403 m 14 Y s 1402 395 m 1 X s 1418 395 m 2 X s 3 lw 1411 395 m20 6 lw 1429 382 m 16 Y s 1429 413 m 16 Y s 1420 405 m 1 X
 s 1436 405 m 2 X s 3 lw 1429 405 m20 6 lw 1447 350 m 12 Y s 1447 377 m 12 Y s 1438 370 m 1 X s 1454 370 m 2 X s 3 lw 1447 370 m20 6 lw 1465 368 m 15 Y s 1465 398 m 16 Y s 1456 391 m 1 X s 1472 391 m 2 X s 3 lw 1465 391 m20 6 lw 1483 376 m 17 Y s
 1483 408 m 17 Y s 1474 400 m 1 X s 1490 400 m 1 X s 3 lw 1483 400 m20 6 lw 1500 364 m 16 Y s 1500 395 m 16 Y s 1491 387 m 2 X s 1508 387 m 1 X s 3 lw 1500 387 m20 6 lw 1518 361 m 15 Y s 1518 391 m 15 Y s 1509 383 m 2 X s 1526 383 m 1 X s 3 lw 1518
 383 m20 6 lw 1536 402 m 22 Y s 1536 439 m 23 Y s 1527 432 m 2 X s 1544 432 m 1 X s 3 lw 1536 432 m20 6 lw 1554 375 m 20 Y s 1554 410 m 20 Y s 1545 403 m 2 X s 1562 403 m 1 X s 3 lw 1554 403 m20 6 lw 1572 370 m 18 Y s 1572 403 m 19 Y s 1563 396 m 1 X
 s 1580 396 m 1 X s 3 lw 1572 396 m20 6 lw 1590 353 m 17 Y s 1590 385 m 17 Y s 1581 378 m 1 X s 1598 378 m 1 X s 3 lw 1590 378 m20 6 lw 1608 331 m 16 Y s 1608 362 m 15 Y s 1599 354 m 1 X s 1616 354 m 1 X s 3 lw 1608 354 m20 6 lw 1626 351 m 18 Y s
 1626 384 m 18 Y s 1617 377 m 1 X s 1633 377 m 2 X s 3 lw 1626 377 m20 6 lw 1644 338 m 17 Y s 1644 371 m 17 Y s 1635 363 m 1 X s 1651 363 m 2 X s 3 lw 1644 363 m20 6 lw 1662 377 m 24 Y s 1662 416 m 24 Y s 1653 409 m 1 X s 1669 409 m 2 X s 3 lw 1662
 409 m20 6 lw 1680 368 m 23 Y s 1680 406 m 23 Y s 1671 398 m 1 X s 1687 398 m 2 X s 3 lw 1680 398 m20 6 lw 1697 309 m 14 Y s 1697 339 m 14 Y s 1689 331 m 1 X s 1705 331 m 1 X s 3 lw 1697 331 m20 6 lw 1715 373 m 25 Y s 1715 414 m 25 Y s 1706 406 m 2 X
 s 1723 406 m 1 X s 3 lw 1715 406 m20 6 lw 1733 319 m 17 Y s 1733 351 m 16 Y s 1724 343 m 2 X s 1741 343 m 1 X s 3 lw 1733 343 m20 6 lw 1751 320 m 18 Y s 1751 353 m 17 Y s 1742 345 m 2 X s 1759 345 m 1 X s 3 lw 1751 345 m20 6 lw 1769 334 m 19 Y s
 1769 368 m 19 Y s 1760 360 m 2 X s 1777 360 m 1 X s 3 lw 1769 360 m20 6 lw 1787 409 m 34 Y s 1787 458 m 34 Y s 1778 451 m 1 X s 1795 451 m 1 X s 3 lw 1787 451 m20 6 lw 1805 398 m 41 Y s 1805 454 m 41 Y s 1796 447 m 1 X s 1813 447 m 1 X s 3 lw 1805
 447 m20 6 lw 1823 395 m 32 Y s 1823 443 m 32 Y s 1814 435 m 1 X s 1831 435 m 1 X s 3 lw 1823 435 m20 6 lw 1841 356 m 29 Y s 1841 400 m 29 Y s 1832 393 m 1 X s 1848 393 m 2 X s 3 lw 1841 393 m20 6 lw 1859 385 m 37 Y s 1859 437 m 38 Y s 1850 430 m 1 X
 s 1866 430 m 2 X s 3 lw 1859 430 m20 6 lw 1877 384 m 38 Y s 1877 437 m 39 Y s 1868 430 m 1 X s 1884 430 m 2 X s 3 lw 1877 430 m20 6 lw 1895 474 m 64 Y s 1895 553 m 61 Y s 1886 545 m 1 X s 1902 545 m 2 X s 3 lw 1895 545 m20 6 lw 1912 414 m 48 Y s
 1912 478 m 48 Y s 1904 470 m 1 X s 1920 470 m 1 X s 3 lw 1912 470 m20 6 lw 1930 374 m 39 Y s 1930 428 m 39 Y s 1921 420 m 2 X s 1938 420 m 1 X s 3 lw 1930 420 m20 6 lw 1948 383 m 41 Y s 1948 439 m 40 Y s 1939 431 m 2 X s 1956 431 m 1 X s 3 lw 1948
 431 m20 6 lw 1966 417 m 52 Y s 1966 484 m 52 Y s 1957 476 m 2 X s 1974 476 m 1 X s 3 lw 1966 476 m20 6 lw 1984 328 m 27 Y s 1984 370 m 27 Y s 1975 363 m 2 X s 1992 363 m 1 X s 3 lw 1984 363 m20 6 lw 2002 298 m 25 Y s 2002 338 m 25 Y s 1993 331 m 1 X
 s 2010 331 m 1 X s 3 lw 2002 331 m20 6 lw 2020 325 m 30 Y s 2020 370 m 30 Y s 2011 363 m 1 X s 2028 363 m 1 X s 3 lw 2020 363 m20 6 lw 2038 305 m 27 Y s 2038 348 m 27 Y s 2029 340 m 1 X s 2045 340 m 2 X s 3 lw 2038 340 m20 6 lw 2056 353 m 37 Y s
 2056 405 m 37 Y s 2047 397 m 1 X s 2063 397 m 2 X s 3 lw 2056 397 m20 6 lw 2074 366 m 43 Y s 2074 424 m 43 Y s 2065 416 m 1 X s 2081 416 m 2 X s 3 lw 2074 416 m20 6 lw 2092 348 m 41 Y s 2092 404 m 40 Y s 2083 396 m 1 X s 2099 396 m 2 X s 3 lw 2092
 396 m20 6 lw 2110 478 m 86 Y s 2110 579 m 35 Y s 2101 571 m 1 X s 2117 571 m 2 X s 3 lw 2110 571 m20 6 lw 2127 426 m 66 Y s 2127 508 m 66 Y s 2119 500 m 1 X s 2135 500 m 1 X s 3 lw 2127 500 m20 6 lw 2145 397 m 57 Y s 2145 469 m 56 Y s 2136 461 m 2 X
 s 2153 461 m 1 X s 3 lw 2145 461 m20 6 lw 0.35 0.83 0.33 c 1 1 1 c 0.35 0.83 0.33 c 372 473 m 5 Y s 372 494 m 5 Y s 363 486 m 1 X s 379 486 m 2 X s 3 lw 372 486 m20 6 lw 381 462 m 1 X s 397 462 m 2 X s 3 lw 390 462 m20 6 lw 399 445 m 1 X s 415 445 m
 2 X s 3 lw 408 445 m20 6 lw 417 408 m 1 X s 433 408 m 1 X s 3 lw 426 408 m20 6 lw 434 391 m 2 X s 451 391 m 1 X s 3 lw 443 391 m20 6 lw 452 377 m 2 X s 469 377 m 1 X s 3 lw 461 377 m20 6 lw 470 377 m 2 X s 487 377 m 1 X s 3 lw 479 377 m20 6 lw 488
 365 m 2 X s 505 365 m 1 X s 3 lw 497 365 m20 6 lw 506 368 m 2 X s 523 368 m 1 X s 3 lw 515 368 m20 6 lw 524 368 m 1 X s 541 368 m 1 X s 3 lw 533 368 m20 6 lw 542 362 m 1 X s 559 362 m 1 X s 3 lw 551 362 m20 6 lw 560 358 m 1 X s 576 358 m 2 X s 3 lw
 569 358 m20 6 lw 578 361 m 1 X s 594 361 m 2 X s 3 lw 587 361 m20 6 lw 596 351 m 1 X s 612 351 m 2 X s 3 lw 605 351 m20 6 lw 614 358 m 1 X s 630 358 m 2 X s 3 lw 623 358 m20 6 lw 632 347 m 1 X s 648 347 m 1 X s 3 lw 641 347 m20 6 lw 649 350 m 2 X s
 666 350 m 1 X s 3 lw 658 350 m20 6 lw 667 350 m 2 X s 684 350 m 1 X s 3 lw 676 350 m20 6 lw 685 340 m 2 X s 702 340 m 1 X s 3 lw 694 340 m20 6 lw 703 345 m 2 X s 720 345 m 1 X s 3 lw 712 345 m20 6 lw 721 356 m 1 X s 738 356 m 1 X s 3 lw 730 356 m20
 6 lw 739 333 m 1 X s 756 333 m 1 X s 3 lw 748 333 m20 6 lw 757 342 m 1 X s 774 342 m 1 X s 3 lw 766 342 m20 6 lw 775 340 m 1 X s 791 340 m 2 X s 3 lw 784 340 m20 6 lw 793 343 m 1 X s 809 343 m 2 X s 3 lw 802 343 m20 6 lw 811 341 m 1 X s 827 341 m 2
 X s 3 lw 820 341 m20 6 lw 829 341 m 1 X s 845 341 m 2 X s 3 lw 838 341 m20 6 lw 847 339 m 1 X s 863 339 m 1 X s 3 lw 855 339 m20 6 lw 864 338 m 2 X s 881 338 m 1 X s 3 lw 873 338 m20 6 lw 882 348 m 2 X s 899 348 m 1 X s 3 lw 891 348 m20 6 lw 900 336
 m 2 X s 917 336 m 1 X s 3 lw 909 336 m20 6 lw 927 350 m 1 Y s 927 366 m 1 Y s 918 359 m 2 X s 935 359 m 1 X s 3 lw 927 359 m20 6 lw 945 338 m s 945 353 m 1 Y s 936 346 m 1 X s 953 346 m 1 X s 3 lw 945 346 m20 6 lw 963 324 m s 963 339 m s 954 331 m 1
 X s 971 331 m 1 X s 3 lw 963 331 m20 6 lw 981 336 m 1 Y s 981 352 m 2 Y s 972 345 m 1 X s 989 345 m 1 X s 3 lw 981 345 m20 6 lw 999 338 m 2 Y s 999 355 m 1 Y s 990 347 m 1 X s 1006 347 m 2 X s 3 lw 999 347 m20 6 lw 1017 338 m 2 Y s 1017 355 m 2 Y s
 1008 348 m 1 X s 1024 348 m 2 X s 3 lw 1017 348 m20 6 lw 1035 333 m 2 Y s 1035 350 m 2 Y s 1026 342 m 1 X s 1042 342 m 2 X s 3 lw 1035 342 m20 6 lw 1053 350 m 4 Y s 1053 369 m 3 Y s 1044 361 m 1 X s 1060 361 m 2 X s 3 lw 1053 361 m20 6 lw 1070 336 m
 3 Y s 1070 354 m 2 Y s 1062 346 m 1 X s 1078 346 m 1 X s 3 lw 1070 346 m20 6 lw 1088 330 m 3 Y s 1088 348 m 2 Y s 1079 340 m 2 X s 1096 340 m 1 X s 3 lw 1088 340 m20 6 lw 1106 345 m 4 Y s 1106 364 m 4 Y s 1097 357 m 2 X s 1114 357 m 1 X s 3 lw 1106
 357 m20 6 lw 1124 345 m 4 Y s 1124 365 m 4 Y s 1115 357 m 2 X s 1132 357 m 1 X s 3 lw 1124 357 m20 6 lw 1142 340 m 4 Y s 1142 359 m 4 Y s 1133 352 m 2 X s 1150 352 m 1 X s 3 lw 1142 352 m20 6 lw 1160 357 m 5 Y s 1160 378 m 5 Y s 1151 370 m 1 X s
 1168 370 m 1 X s 3 lw 1160 370 m20 6 lw 1178 339 m 5 Y s 1178 359 m 5 Y s 1169 351 m 1 X s 1186 351 m 1 X s 3 lw 1178 351 m20 6 lw 1196 350 m 6 Y s 1196 371 m 6 Y s 1187 364 m 1 X s 1203 364 m 2 X s 3 lw 1196 364 m20 6 lw 1214 328 m 5 Y s 1214 348 m
 4 Y s 1205 340 m 1 X s 1221 340 m 2 X s 3 lw 1214 340 m20 6 lw 1232 341 m 5 Y s 1232 361 m 6 Y s 1223 354 m 1 X s 1239 354 m 2 X s 3 lw 1232 354 m20 6 lw 1250 351 m 7 Y s 1250 373 m 7 Y s 1241 365 m 1 X s 1257 365 m 2 X s 3 lw 1250 365 m20 6 lw 1268
 341 m 6 Y s 1268 363 m 6 Y s 1259 355 m 1 X s 1275 355 m 1 X s 3 lw 1268 355 m20 6 lw 1285 348 m 8 Y s 1285 371 m 8 Y s 1276 364 m 2 X s 1293 364 m 1 X s 3 lw 1285 364 m20 6 lw 1303 357 m 9 Y s 1303 381 m 9 Y s 1294 373 m 2 X s 1311 373 m 1 X s 3 lw
 1303 373 m20 6 lw 1321 364 m 10 Y s 1321 389 m 10 Y s 1312 381 m 2 X s 1329 381 m 1 X s 3 lw 1321 381 m20 6 lw 1339 367 m 11 Y s 1339 393 m 11 Y s 1330 386 m 2 X s 1347 386 m 1 X s 3 lw 1339 386 m20 6 lw 1357 338 m 9 Y s 1357 362 m 8 Y s 1348 354 m
 2 X s 1365 354 m 1 X s 3 lw 1357 354 m20 6 lw 1375 339 m 9 Y s 1375 363 m 8 Y s 1366 355 m 1 X s 1383 355 m 1 X s 3 lw 1375 355 m20 6 lw 1393 369 m 13 Y s 1393 397 m 13 Y s 1384 389 m 1 X s 1401 389 m 1 X s 3 lw 1393 389 m20 6 lw 1411 352 m 11 Y s
 1411 379 m 11 Y s 1402 371 m 1 X s 1418 371 m 2 X s 3 lw 1411 371 m20 6 lw 1429 364 m 14 Y s 1429 393 m 13 Y s 1420 385 m 1 X s 1436 385 m 2 X s 3 lw 1429 385 m20 6 lw 1447 326 m 9 Y s 1447 350 m 9 Y s 1438 342 m 1 X s 1454 342 m 2 X s 3 lw 1447 342
 m20 6 lw 1465 365 m 14 Y s 1465 395 m 14 Y s 1456 387 m 1 X s 1472 387 m 2 X s 3 lw 1465 387 m20 6 lw 1483 373 m 16 Y s 1483 404 m 16 Y s 1474 396 m 1 X s 1490 396 m 1 X s 3 lw 1483 396 m20 6 lw 1500 349 m 13 Y s 1500 377 m 14 Y s 1491 370 m 2 X s
 1508 370 m 1 X s 3 lw 1500 370 m20 6 lw 1518 335 m 11 Y s 1518 362 m 11 Y s 1509 354 m 2 X s 1526 354 m 1 X s 3 lw 1518 354 m20 6 lw 1536 381 m 19 Y s 1536 416 m 19 Y s 1527 408 m 2 X s 1544 408 m 1 X s 3 lw 1536 408 m20 6 lw 1554 363 m 18 Y s 1554
 396 m 18 Y s 1545 389 m 2 X s 1562 389 m 1 X s 3 lw 1554 389 m20 6 lw 1572 339 m 15 Y s 1572 369 m 14 Y s 1563 361 m 1 X s 1580 361 m 1 X s 3 lw 1572 361 m20 6 lw 1590 331 m 14 Y s 1590 360 m 14 Y s 1581 352 m 1 X s 1598 352 m 1 X s 3 lw 1590 352
 m20 6 lw 1608 343 m 16 Y s 1608 374 m 16 Y s 1599 367 m 1 X s 1616 367 m 1 X s 3 lw 1608 367 m20 6 lw 1626 340 m 15 Y s 1626 371 m 15 Y s 1617 363 m 1 X s 1633 363 m 2 X s 3 lw 1626 363 m20 6 lw 1644 346 m 18 Y s 1644 379 m 17 Y s 1635 371 m 1 X s
 1651 371 m 2 X s 3 lw 1644 371 m20 6 lw 1662 361 m 21 Y s 1662 398 m 20 Y s 1653 390 m 1 X s 1669 390 m 2 X s 3 lw 1662 390 m20 6 lw 1680 340 m 18 Y s 1680 373 m 19 Y s 1671 366 m 1 X s 1687 366 m 2 X s 3 lw 1680 366 m20 6 lw 1697 311 m 14 Y s 1697
 340 m 14 Y s 1689 332 m 1 X s 1705 332 m 1 X s 3 lw 1697 332 m20 6 lw 1715 359 m 23 Y s 1715 397 m 23 Y s 1706 389 m 2 X s 1723 389 m 1 X s 3 lw 1715 389 m20 6 lw 1733 306 m 14 Y s 1733 336 m 14 Y s 1724 328 m 2 X s 1741 328 m 1 X s 3 lw 1733 328
 m20 6 lw 1751 314 m 16 Y s 1751 345 m 16 Y s 1742 338 m 2 X s 1759 338 m 1 X s 3 lw 1751 338 m20 6 lw 1769 308 m 15 Y s 1769 338 m 15 Y s 1760 331 m 2 X s 1777 331 m 1 X s 3 lw 1769 331 m20 6 lw 1787 354 m 26 Y s 1787 395 m 25 Y s 1778 387 m 1 X s
 1795 387 m 1 X s 3 lw 1787 387 m20 6 lw 1805 435 m 46 Y s 1805 496 m 46 Y s 1796 488 m 1 X s 1813 488 m 1 X s 3 lw 1805 488 m20 6 lw 1823 349 m 25 Y s 1823 389 m 25 Y s 1814 382 m 1 X s 1831 382 m 1 X s 3 lw 1823 382 m20 6 lw 1841 347 m 26 Y s 1841
 388 m 27 Y s 1832 381 m 1 X s 1848 381 m 2 X s 3 lw 1841 381 m20 6 lw 1859 371 m 34 Y s 1859 420 m 34 Y s 1850 413 m 1 X s 1866 413 m 2 X s 3 lw 1859 413 m20 6 lw 1877 376 m 36 Y s 1877 427 m 36 Y s 1868 420 m 1 X s 1884 420 m 2 X s 3 lw 1877 420
 m20 6 lw 1895 439 m 56 Y s 1895 510 m 56 Y s 1886 502 m 1 X s 1902 502 m 2 X s 3 lw 1895 502 m20 6 lw 1912 377 m 41 Y s 1912 433 m 40 Y s 1904 425 m 1 X s 1920 425 m 1 X s 3 lw 1912 425 m20 6 lw 1930 377 m 38 Y s 1930 430 m 39 Y s 1921 423 m 2 X s
 1938 423 m 1 X s 3 lw 1930 423 m20 6 lw 1948 369 m 37 Y s 1948 421 m 37 Y s 1939 414 m 2 X s 1956 414 m 1 X s 3 lw 1948 414 m20 6 lw 1966 373 m 41 Y s 1966 430 m 41 Y s 1957 422 m 2 X s 1974 422 m 1 X s 3 lw 1966 422 m20 6 lw 1984 304 m 22 Y s 1984
 342 m 22 Y s 1975 334 m 2 X s 1992 334 m 1 X s 3 lw 1984 334 m20 6 lw 2002 332 m 30 Y s 2002 378 m 30 Y s 1993 370 m 1 X s 2010 370 m 1 X s 3 lw 2002 370 m20 6 lw 2020 328 m 30 Y s 2020 373 m 30 Y s 2011 365 m 1 X s 2028 365 m 1 X s 3 lw 2020 365
 m20 6 lw 2038 325 m 31 Y s 2038 371 m 30 Y s 2029 363 m 1 X s 2045 363 m 2 X s 3 lw 2038 363 m20 6 lw 2056 320 m 29 Y s 2056 364 m 29 Y s 2047 357 m 1 X s 2063 357 m 2 X s 3 lw 2056 357 m20 6 lw 2074 331 m 35 Y s 2074 381 m 35 Y s 2065 374 m 1 X s
 2081 374 m 2 X s 3 lw 2074 374 m20 6 lw 2092 341 m 38 Y s 2092 394 m 37 Y s 2083 386 m 1 X s 2099 386 m 2 X s 3 lw 2092 386 m20 6 lw 2110 416 m 68 Y s 2110 499 m 67 Y s 2101 491 m 1 X s 2117 491 m 2 X s 3 lw 2110 491 m20 6 lw 2127 356 m 48 Y s 2127
 419 m 48 Y s 2119 411 m 1 X s 2135 411 m 1 X s 3 lw 2127 411 m20 6 lw 2145 358 m 45 Y s 2145 419 m 45 Y s 2136 411 m 2 X s 2153 411 m 1 X s 3 lw 2145 411 m20 6 lw 0 0 1 c 1 1 1 c 0 0 1 c 372 389 m 2 Y s 372 406 m 2 Y s 363 399 m 1 X s 379 399 m 2 X
 s 3 lw 372 399 m20 6 lw 381 251 m 1 X s 397 251 m 2 X s 3 lw 390 251 m20 6 lw 399 347 m 1 X s 415 347 m 2 X s 3 lw 408 347 m20 6 lw 417 343 m 1 X s 433 343 m 1 X s 3 lw 426 343 m20 6 lw 434 395 m 2 X s 451 395 m 1 X s 3 lw 443 395 m20 6 lw 452 376 m
 2 X s 469 376 m 1 X s 3 lw 461 376 m20 6 lw 470 370 m 2 X s 487 370 m 1 X s 3 lw 479 370 m20 6 lw 488 377 m 2 X s 505 377 m 1 X s 3 lw 497 377 m20 6 lw 506 369 m 2 X s 523 369 m 1 X s 3 lw 515 369 m20 6 lw 524 368 m 1 X s 541 368 m 1 X s 3 lw 533
 368 m20 6 lw 542 361 m 1 X s 559 361 m 1 X s 3 lw 551 361 m20 6 lw 560 357 m 1 X s 576 357 m 2 X s 3 lw 569 357 m20 6 lw 578 383 m 1 X s 594 383 m 2 X s 3 lw 587 383 m20 6 lw 596 354 m 1 X s 612 354 m 2 X s 3 lw 605 354 m20 6 lw 614 372 m 1 X s 630
 372 m 2 X s 3 lw 623 372 m20 6 lw 632 366 m 1 X s 648 366 m 1 X s 3 lw 641 366 m20 6 lw 649 377 m 2 X s 666 377 m 1 X s 3 lw 658 377 m20 6 lw 667 380 m 2 X s 684 380 m 1 X s 3 lw 676 380 m20 6 lw 685 368 m 2 X s 702 368 m 1 X s 3 lw 694 368 m20 6 lw
 703 372 m 2 X s 720 372 m 1 X s 3 lw 712 372 m20 6 lw 721 383 m 1 X s 738 383 m 1 X s 3 lw 730 383 m20 6 lw 739 353 m 1 X s 756 353 m 1 X s 3 lw 748 353 m20 6 lw 757 366 m 1 X s 774 366 m 1 X s 3 lw 766 366 m20 6 lw 775 358 m 1 X s 791 358 m 2 X s 3
 lw 784 358 m20 6 lw 793 329 m 1 X s 809 329 m 2 X s 3 lw 802 329 m20 6 lw 811 375 m 1 X s 827 375 m 2 X s 3 lw 820 375 m20 6 lw 829 349 m 1 X s 845 349 m 2 X s 3 lw 838 349 m20 6 lw 855 359 m s 855 374 m s 847 367 m 1 X s 863 367 m 1 X s 3 lw 855
 367 m20 6 lw 873 353 m 1 Y s 873 369 m s 864 361 m 2 X s 881 361 m 1 X s 3 lw 873 361 m20 6 lw 891 368 m 2 Y s 891 385 m 1 Y s 882 377 m 2 X s 899 377 m 1 X s 3 lw 891 377 m20 6 lw 909 363 m 1 Y s 909 379 m 1 Y s 900 371 m 2 X s 917 371 m 1 X s 3 lw
 909 371 m20 6 lw 927 380 m 2 Y s 927 397 m 2 Y s 918 390 m 2 X s 935 390 m 1 X s 3 lw 927 390 m20 6 lw 945 357 m 1 Y s 945 373 m 2 Y s 936 366 m 1 X s 953 366 m 1 X s 3 lw 945 366 m20 6 lw 963 367 m 2 Y s 963 384 m 2 Y s 954 376 m 1 X s 971 376 m 1
 X s 3 lw 963 376 m20 6 lw 981 361 m 3 Y s 981 379 m 2 Y s 972 371 m 1 X s 989 371 m 1 X s 3 lw 981 371 m20 6 lw 999 378 m 3 Y s 999 397 m 3 Y s 990 389 m 1 X s 1006 389 m 2 X s 3 lw 999 389 m20 6 lw 1017 354 m 2 Y s 1017 372 m 2 Y s 1008 364 m 1 X s
 1024 364 m 2 X s 3 lw 1017 364 m20 6 lw 1035 376 m 4 Y s 1035 395 m 4 Y s 1026 387 m 1 X s 1042 387 m 2 X s 3 lw 1035 387 m20 6 lw 1053 404 m 6 Y s 1053 425 m 6 Y s 1044 418 m 1 X s 1060 418 m 2 X s 3 lw 1053 418 m20 6 lw 1070 361 m 4 Y s 1070 380 m
 4 Y s 1062 372 m 1 X s 1078 372 m 1 X s 3 lw 1070 372 m20 6 lw 1088 366 m 5 Y s 1088 386 m 4 Y s 1079 378 m 2 X s 1096 378 m 1 X s 3 lw 1088 378 m20 6 lw 1106 386 m 6 Y s 1106 407 m 6 Y s 1097 400 m 2 X s 1114 400 m 1 X s 3 lw 1106 400 m20 6 lw 1124
 382 m 6 Y s 1124 403 m 7 Y s 1115 396 m 2 X s 1132 396 m 1 X s 3 lw 1124 396 m20 6 lw 1142 362 m 5 Y s 1142 382 m 6 Y s 1133 375 m 2 X s 1150 375 m 1 X s 3 lw 1142 375 m20 6 lw 1160 374 m 7 Y s 1160 396 m 7 Y s 1151 388 m 1 X s 1168 388 m 1 X s 3 lw
 1160 388 m20 6 lw 1178 361 m 6 Y s 1178 382 m 6 Y s 1169 374 m 1 X s 1186 374 m 1 X s 3 lw 1178 374 m20 6 lw 1196 356 m 6 Y s 1196 378 m 6 Y s 1187 370 m 1 X s 1203 370 m 2 X s 3 lw 1196 370 m20 6 lw 1214 332 m 4 Y s 1214 352 m 4 Y s 1205 344 m 1 X
 s 1221 344 m 2 X s 3 lw 1214 344 m20 6 lw 1232 314 m 4 Y s 1232 333 m 5 Y s 1223 326 m 1 X s 1239 326 m 2 X s 3 lw 1232 326 m20 6 lw 1250 381 m 9 Y s 1250 405 m 9 Y s 1241 397 m 1 X s 1257 397 m 2 X s 3 lw 1250 397 m20 6 lw 1268 379 m 10 Y s 1268
 404 m 9 Y s 1259 396 m 1 X s 1275 396 m 1 X s 3 lw 1268 396 m20 6 lw 1285 359 m 8 Y s 1285 382 m 9 Y s 1276 375 m 2 X s 1293 375 m 1 X s 3 lw 1285 375 m20 6 lw 1303 411 m 13 Y s 1303 440 m 13 Y s 1294 432 m 2 X s 1311 432 m 1 X s 3 lw 1303 432 m20 6
 lw 1321 407 m 13 Y s 1321 436 m 13 Y s 1312 428 m 2 X s 1329 428 m 1 X s 3 lw 1321 428 m20 6 lw 1339 380 m 12 Y s 1339 407 m 13 Y s 1330 400 m 2 X s 1347 400 m 1 X s 3 lw 1339 400 m20 6 lw 1357 413 m 15 Y s 1357 443 m 14 Y s 1348 435 m 2 X s 1365
 435 m 1 X s 3 lw 1357 435 m20 6 lw 1375 333 m 8 Y s 1375 356 m 9 Y s 1366 349 m 1 X s 1383 349 m 1 X s 3 lw 1375 349 m20 6 lw 1393 380 m 14 Y s 1393 410 m 14 Y s 1384 402 m 1 X s 1401 402 m 1 X s 3 lw 1393 402 m20 6 lw 1411 367 m 13 Y s 1411 395 m
 13 Y s 1402 388 m 1 X s 1418 388 m 2 X s 3 lw 1411 388 m20 6 lw 1429 354 m 12 Y s 1429 381 m 13 Y s 1420 374 m 1 X s 1436 374 m 2 X s 3 lw 1429 374 m20 6 lw 1447 342 m 10 Y s 1447 367 m 11 Y s 1438 360 m 1 X s 1454 360 m 2 X s 3 lw 1447 360 m20 6 lw
 1465 415 m 19 Y s 1465 450 m 19 Y s 1456 442 m 1 X s 1472 442 m 2 X s 3 lw 1465 442 m20 6 lw 1483 391 m 18 Y s 1483 424 m 18 Y s 1474 417 m 1 X s 1490 417 m 1 X s 3 lw 1483 417 m20 6 lw 1500 356 m 14 Y s 1500 385 m 14 Y s 1491 378 m 2 X s 1508 378 m
 1 X s 3 lw 1500 378 m20 6 lw 1518 380 m 16 Y s 1518 412 m 16 Y s 1509 404 m 2 X s 1526 404 m 1 X s 3 lw 1518 404 m20 6 lw 1536 436 m 26 Y s 1536 477 m 26 Y s 1527 469 m 2 X s 1544 469 m 1 X s 3 lw 1536 469 m20 6 lw 1554 383 m 20 Y s 1554 418 m 20 Y
 s 1545 410 m 2 X s 1562 410 m 1 X s 3 lw 1554 410 m20 6 lw 1572 372 m 18 Y s 1572 405 m 18 Y s 1563 398 m 1 X s 1580 398 m 1 X s 3 lw 1572 398 m20 6 lw 1590 352 m 15 Y s 1590 383 m 16 Y s 1581 375 m 1 X s 1598 375 m 1 X s 3 lw 1590 375 m20 6 lw 1608
 333 m 15 Y s 1608 364 m 15 Y s 1599 356 m 1 X s 1616 356 m 1 X s 3 lw 1608 356 m20 6 lw 1626 349 m 16 Y s 1626 380 m 17 Y s 1617 373 m 1 X s 1633 373 m 2 X s 3 lw 1626 373 m20 6 lw 1644 392 m 23 Y s 1644 430 m 22 Y s 1635 422 m 1 X s 1651 422 m 2 X
 s 3 lw 1644 422 m20 6 lw 1662 443 m 31 Y s 1662 489 m 31 Y s 1653 482 m 1 X s 1669 482 m 2 X s 3 lw 1662 482 m20 6 lw 1680 376 m 23 Y s 1680 414 m 23 Y s 1671 407 m 1 X s 1687 407 m 2 X s 3 lw 1680 407 m20 6 lw 1697 361 m 19 Y s 1697 395 m 20 Y s
 1689 388 m 1 X s 1705 388 m 1 X s 3 lw 1697 388 m20 6 lw 1715 337 m 20 Y s 1715 372 m 20 Y s 1706 365 m 2 X s 1723 365 m 1 X s 3 lw 1715 365 m20 6 lw 1733 315 m 15 Y s 1733 346 m 15 Y s 1724 338 m 2 X s 1741 338 m 1 X s 3 lw 1733 338 m20 6 lw 1751
 343 m 19 Y s 1751 377 m 20 Y s 1742 370 m 2 X s 1759 370 m 1 X s 3 lw 1751 370 m20 6 lw 1769 328 m 18 Y s 1769 361 m 17 Y s 1760 353 m 2 X s 1777 353 m 1 X s 3 lw 1769 353 m20 6 lw 1787 345 m 25 Y s 1787 385 m 24 Y s 1778 377 m 1 X s 1795 377 m 1 X
 s 3 lw 1787 377 m20 6 lw 1805 458 m 50 Y s 1805 523 m 50 Y s 1796 516 m 1 X s 1813 516 m 1 X s 3 lw 1805 516 m20 6 lw 1823 378 m 29 Y s 1823 422 m 30 Y s 1814 415 m 1 X s 1831 415 m 1 X s 3 lw 1823 415 m20 6 lw 1841 377 m 31 Y s 1841 424 m 31 Y s
 1832 416 m 1 X s 1848 416 m 2 X s 3 lw 1841 416 m20 6 lw 1859 414 m 41 Y s 1859 470 m 41 Y s 1850 463 m 1 X s 1866 463 m 2 X s 3 lw 1859 463 m20 6 lw 1877 376 m 36 Y s 1877 427 m 36 Y s 1868 419 m 1 X s 1884 419 m 2 X s 3 lw 1877 419 m20 6 lw 1895
 475 m 64 Y s 1895 554 m 60 Y s 1886 546 m 1 X s 1902 546 m 2 X s 3 lw 1895 546 m20 6 lw 1912 352 m 36 Y s 1912 403 m 35 Y s 1904 395 m 1 X s 1920 395 m 1 X s 3 lw 1912 395 m20 6 lw 1930 349 m 33 Y s 1930 397 m 34 Y s 1921 390 m 2 X s 1938 390 m 1 X
 s 3 lw 1930 390 m20 6 lw 1948 390 m 40 Y s 1948 445 m 41 Y s 1939 438 m 2 X s 1956 438 m 1 X s 3 lw 1948 438 m20 6 lw 1966 422 m 51 Y s 1966 488 m 51 Y s 1957 480 m 2 X s 1974 480 m 1 X s 3 lw 1966 480 m20 6 lw 1984 319 m 25 Y s 1984 359 m 24 Y s
 1975 351 m 2 X s 1992 351 m 1 X s 3 lw 1984 351 m20 6 lw 2002 346 m 33 Y s 2002 394 m 33 Y s 1993 386 m 1 X s 2010 386 m 1 X s 3 lw 2002 386 m20 6 lw 2020 292 m 23 Y s 2020 331 m 23 Y s 2011 323 m 1 X s 2028 323 m 1 X s 3 lw 2020 323 m20 6 lw 2038
 320 m 29 Y s 2038 364 m 29 Y s 2029 357 m 1 X s 2045 357 m 2 X s 3 lw 2038 357 m20 6 lw 2056 337 m 33 Y s 2056 385 m 32 Y s 2047 377 m 1 X s 2063 377 m 2 X s 3 lw 2056 377 m20 6 lw 2074 412 m 51 Y s 2074 478 m 51 Y s 2065 470 m 1 X s 2081 470 m 2 X
 s 3 lw 2074 470 m20 6 lw 2092 387 m 47 Y s 2092 449 m 47 Y s 2083 441 m 1 X s 2099 441 m 2 X s 3 lw 2092 441 m20 6 lw 2110 376 m 57 Y s 2110 448 m 58 Y s 2101 441 m 1 X s 2117 441 m 2 X s 3 lw 2110 441 m20 6 lw 2127 369 m 51 Y s 2127 436 m 51 Y s
 2119 428 m 1 X s 2135 428 m 1 X s 3 lw 2127 428 m20 6 lw 2145 364 m 46 Y s 2145 426 m 46 Y s 2136 418 m 2 X s 2153 418 m 1 X s 3 lw 2145 418 m20 6 lw black 363 368 m 1791 X s
 gr  gr showpage
end
%%EOF
