%!PS-Adobe-2.0 EPSF-2.0
%%BoundingBox:  0 0 567 384
%%Title: /home/carrazza/Desktop/yrplots/qq_8tev_as_0118_b.eps: c1_n4
%%Creator: ROOT Version 5.34/07
%%CreationDate: Thu Jun  6 16:57:13 2013
%%EndComments
%%BeginProlog
80 dict begin
/s {stroke} def /l {lineto} def /m {moveto} def /t {translate} def
/r {rotate} def /rl {roll}  def /R {repeat} def
/d {rlineto} def /rm {rmoveto} def /gr {grestore} def /f {eofill} def
/c {setrgbcolor} def /black {0 setgray} def /sd {setdash} def
/cl {closepath} def /sf {scalefont setfont} def /lw {setlinewidth} def
/box {m dup 0 exch d exch 0 d 0 exch neg d cl} def
/NC{systemdict begin initclip end}def/C{NC box clip newpath}def
/bl {box s} def /bf {box f} def /Y { 0 exch d} def /X { 0 d} def 
/K {{pop pop 0 moveto} exch kshow} bind def
/ita {/ang 15 def gsave [1 0 ang dup sin exch cos div 1 0 0] concat} def 
/mp {newpath /y exch def /x exch def} def
/side {[w .77 mul w .23 mul] .385 w mul sd w 0 l currentpoint t -144 r} def
/mr {mp x y w2 0 360 arc} def /m24 {mr s} def /m20 {mr f} def
/mb {mp x y w2 add m w2 neg 0 d 0 w neg d w 0 d 0 w d cl} def
/mt {mp x y w2 add m w2 neg w neg d w 0 d cl} def
/m21 {mb f} def /m25 {mb s} def /m22 {mt f} def /m26{mt s} def
/m23 {mp x y w2 sub m w2 w d w neg 0 d cl f} def
/m27 {mp x y w2 add m w3 neg w2 neg d w3 w2 neg d w3 w2 d cl s} def
/m28 {mp x w2 sub y w2 sub w3 add m w3 0 d  0 w3 neg d w3 0 d 0 w3 d w3 0 d  0 w3 d w3 neg 0 d 0 w3 d w3 neg 0 d 0 w3 neg d w3 neg 0 d cl s } def
/m29 {mp gsave x w2 sub y w2 add w3 sub m currentpoint t 4 {side} repeat cl fill gr} def
/m30 {mp gsave x w2 sub y w2 add w3 sub m currentpoint t 4 {side} repeat cl s gr} def
/m31 {mp x y w2 sub m 0 w d x w2 sub y m w 0 d x w2 sub y w2 add m w w neg d x w2 sub y w2 sub m w w d s} def
/m32 {mp x y w2 sub m w2 w d w neg 0 d cl s} def
/m33 {mp x y w2 add m w3 neg w2 neg d w3 w2 neg d w3 w2 d cl f} def
/m34 {mp x w2 sub y w2 sub w3 add m w3 0 d  0 w3 neg d w3 0 d 0 w3 d w3 0 d  0 w3 d w3 neg 0 d 0 w3 d w3 neg 0 d 0 w3 neg d w3 neg 0 d cl f } def
/m2 {mp x y w2 sub m 0 w d x w2 sub y m w 0 d s} def
/m5 {mp x w2 sub y w2 sub m w w d x w2 sub y w2 add m w w neg d s} def
/reEncode {exch findfont dup length dict begin {1 index /FID eq  {pop pop} {def} ifelse } forall /Encoding exch def currentdict end dup /FontName get exch definefont pop } def [/Times-Bold /Times-Italic /Times-BoldItalic /Helvetica /Helvetica-Oblique
 /Helvetica-Bold /Helvetica-BoldOblique /Courier /Courier-Oblique /Courier-Bold /Courier-BoldOblique /Times-Roman /AvantGarde-Book /AvantGarde-BookOblique /AvantGarde-Demi /AvantGarde-DemiOblique /Bookman-Demi /Bookman-DemiItalic /Bookman-Light
 /Bookman-LightItalic /Helvetica-Narrow /Helvetica-Narrow-Bold /Helvetica-Narrow-BoldOblique /Helvetica-Narrow-Oblique /NewCenturySchlbk-Roman /NewCenturySchlbk-Bold /NewCenturySchlbk-BoldItalic /NewCenturySchlbk-Italic /Palatino-Bold
 /Palatino-BoldItalic /Palatino-Italic /Palatino-Roman ] {ISOLatin1Encoding reEncode } forall
%%EndProlog
%%BeginSetup
%%EndSetup
newpath  gsave  .25 .25 scale  gsave  0 0 t black[  ] 0 sd 3 lw 1 1 1 c 2268 1538 0 0 bf black 1 1 1 c 1815 1229 225 156 bf black 1815 1229 225 156 bl 1 1 1 c 1815 1229 225 156 bf black 1815 1229 225 156 bl 225 156 m 1815 X s
 gsave  2268 1538 0 0 C 1140.37 19.5493 t 0 r /Helvetica findfont 48.8732 sf 0 0 m (X) show NC gr 
 gsave  2268 1538 0 0 C 1084.99 39.0986 t 0 r /Helvetica findfont 71.6807 sf 0 0 m (M) show NC gr  435 175 m -19 Y s 558 175 m -19 Y s 645 175 m -19 Y s 712 175 m -19 Y s 768 175 m -19 Y s 814 175 m -19 Y s 855 175 m -19 Y s 890 175 m -19 Y s 922 193
 m -37 Y s
 gsave  2268 1538 0 0 C 948.14 94.4882 t 0 r /Helvetica findfont 48.8732 sf 0 0 m (2) show NC gr 
 gsave  2268 1538 0 0 C 869.943 61.9061 t 0 r /Helvetica findfont 71.6807 sf 0 0 m (10) show NC gr  1132 175 m -19 Y s 1255 175 m -19 Y s 1342 175 m -19 Y s 1410 175 m -19 Y s 1465 175 m -19 Y s 1512 175 m -19 Y s 1552 175 m -19 Y s 1588 175 m -19 Y
 s 1620 193 m -37 Y s
 gsave  2268 1538 0 0 C 1645.4 97.7464 t 0 r /Helvetica findfont 48.8732 sf 0 0 m (3) show NC gr 
 gsave  2268 1538 0 0 C 1567.2 61.9061 t 0 r /Helvetica findfont 71.6807 sf 0 0 m (10) show NC gr  1830 175 m -19 Y s 1953 175 m -19 Y s 2040 175 m -19 Y s 225 1385 m 1815 X s 435 1366 m 19 Y s 558 1366 m 19 Y s 645 1366 m 19 Y s 712 1366 m 19 Y s
 768 1366 m 19 Y s 814 1366 m 19 Y s 855 1366 m 19 Y s 890 1366 m 19 Y s 922 1348 m 37 Y s 1132 1366 m 19 Y s 1255 1366 m 19 Y s 1342 1366 m 19 Y s 1410 1366 m 19 Y s 1465 1366 m 19 Y s 1512 1366 m 19 Y s 1552 1366 m 19 Y s 1588 1366 m 19 Y s 1620
 1348 m 37 Y s 1830 1366 m 19 Y s 1953 1366 m 19 Y s 2040 1366 m 19 Y s 225 156 m 1229 Y s
 gsave  2268 1538 0 0 C 61.9061 309.53 t 90 r /Helvetica findfont 71.6807 sf 0 0 m (Quark \255 Antiquark Luminosity) show NC gr  279 156 m -54 X s 252 181 m -27 X s 252 206 m -27 X s 252 230 m -27 X s 252 255 m -27 X s 279 279 m -54 X s 252 304 m -27
 X s 252 328 m -27 X s 252 353 m -27 X s 252 377 m -27 X s 279 402 m -54 X s 252 427 m -27 X s 252 451 m -27 X s 252 476 m -27 X s 252 500 m -27 X s 279 525 m -54 X s 252 549 m -27 X s 252 574 m -27 X s 252 599 m -27 X s 252 623 m -27 X s 279 648 m
 -54 X s 252 672 m -27 X s 252 697 m -27 X s 252 721 m -27 X s 252 746 m -27 X s 279 771 m -54 X s 252 795 m -27 X s 252 820 m -27 X s 252 844 m -27 X s 252 869 m -27 X s 279 893 m -54 X s 252 918 m -27 X s 252 943 m -27 X s 252 967 m -27 X s 252 992
 m -27 X s 279 1016 m -54 X s 252 1041 m -27 X s 252 1065 m -27 X s 252 1090 m -27 X s 252 1115 m -27 X s 279 1139 m -54 X s 252 1164 m -27 X s 252 1188 m -27 X s 252 1213 m -27 X s 252 1237 m -27 X s 279 1262 m -54 X s 252 1286 m -27 X s 252 1311 m
 -27 X s 252 1336 m -27 X s 252 1360 m -27 X s 279 1385 m -54 X s
 gsave  2268 1538 0 0 C 114.037 130.329 t 0 r /Helvetica findfont 71.6807 sf 0 0 m (0.8) show NC gr 
 gsave  2268 1538 0 0 C 74.9389 254.141 t 0 r /Helvetica findfont 71.6807 sf 0 0 m (0.85) show NC gr 
 gsave  2268 1538 0 0 C 114.037 377.953 t 0 r /Helvetica findfont 71.6807 sf 0 0 m (0.9) show NC gr 
 gsave  2268 1538 0 0 C 74.9389 501.765 t 0 r /Helvetica findfont 71.6807 sf 0 0 m (0.95) show NC gr 
 gsave  2268 1538 0 0 C 185.718 619.061 t 0 r /Helvetica findfont 71.6807 sf 0 0 m (1) show NC gr 
 gsave  2268 1538 0 0 C 74.9389 746.131 t 0 r /Helvetica findfont 71.6807 sf 0 0 m (1.05) show NC gr 
 gsave  2268 1538 0 0 C 127.07 866.685 t 0 r /Helvetica findfont 71.6807 sf 0 0 m (1.1) show NC gr 
 gsave  2268 1538 0 0 C 74.9389 990.497 t 0 r /Helvetica findfont 71.6807 sf 0 0 m (1.15) show NC gr 
 gsave  2268 1538 0 0 C 114.037 1111.05 t 0 r /Helvetica findfont 71.6807 sf 0 0 m (1.2) show NC gr 
 gsave  2268 1538 0 0 C 74.9389 1238.12 t 0 r /Helvetica findfont 71.6807 sf 0 0 m (1.25) show NC gr 
 gsave  2268 1538 0 0 C 114.037 1358.67 t 0 r /Helvetica findfont 71.6807 sf 0 0 m (1.3) show NC gr  2040 156 m 1229 Y s 1985 156 m 55 X s 2012 181 m 28 X s 2012 206 m 28 X s 2012 230 m 28 X s 2012 255 m 28 X s 1985 279 m 55 X s 2012 304 m 28 X s
 2012 328 m 28 X s 2012 353 m 28 X s 2012 377 m 28 X s 1985 402 m 55 X s 2012 427 m 28 X s 2012 451 m 28 X s 2012 476 m 28 X s 2012 500 m 28 X s 1985 525 m 55 X s 2012 549 m 28 X s 2012 574 m 28 X s 2012 599 m 28 X s 2012 623 m 28 X s 1985 648 m 55 X
 s 2012 672 m 28 X s 2012 697 m 28 X s 2012 721 m 28 X s 2012 746 m 28 X s 1985 771 m 55 X s 2012 795 m 28 X s 2012 820 m 28 X s 2012 844 m 28 X s 2012 869 m 28 X s 1985 893 m 55 X s 2012 918 m 28 X s 2012 943 m 28 X s 2012 967 m 28 X s 2012 992 m 28
 X s 1985 1016 m 55 X s 2012 1041 m 28 X s 2012 1065 m 28 X s 2012 1090 m 28 X s 2012 1115 m 28 X s 1985 1139 m 55 X s 2012 1164 m 28 X s 2012 1188 m 28 X s 2012 1213 m 28 X s 2012 1237 m 28 X s 1985 1262 m 55 X s 2012 1286 m 28 X s 2012 1311 m 28 X
 s 2012 1336 m 28 X s 2012 1360 m 28 X s 1985 1385 m 55 X s 0 0.6 0 c[ 12 12] 0 sd 6 lw 0 1 0 c black 0 0.6 0 c 0 1 0 c black[  ] 0 sd 3 lw 0 1 0 c 225 937 m 67 -97 d 66 -63 d 67 -41 d 67 -26 d 67 -15 d 67 -8 d 67 -4 d 66 -2 d 67 -2 d 67 X 67 -1 d 67
 X 66 1 d 67 X 67 1 d 67 X 67 2 d 66 3 d 67 5 d 67 7 d 67 9 d 67 13 d 67 19 d 66 34 d 67 85 d 67 341 d 7 187 d 71 X -1229 Y -90 X -55 282 d -67 86 d -66 34 d -67 18 d -67 13 d -67 10 d -67 7 d -67 5 d -66 3 d -67 1 d -67 1 d -67 X -67 1 d -200 X -67
 -1 d -67 -1 d -66 -3 d -67 -4 d -67 -8 d -67 -15 d -67 -26 d -67 -41 d -66 -63 d -67 -97 d f[ 12 12] 0 sd 6 lw 0 0.6 0 c black 0 0.6 0 c 225 648 m 1815 X s[  ] 0 sd black 0 0.6 0 c 225 937 m 67 -97 d 66 -63 d 67 -41 d 67 -26 d 67 -15 d 67 -8 d 67 -4
 d 66 -2 d 67 -2 d 67 X 67 -1 d 67 X 66 1 d 67 X 67 1 d 67 X 67 2 d 66 3 d 67 5 d 67 7 d 67 9 d 67 13 d 67 19 d 66 34 d 67 85 d 67 341 d 7 187 d s black 0 0.6 0 c 225 358 m 67 97 d 66 63 d 67 41 d 67 26 d 67 15 d 67 8 d 67 4 d 66 3 d 67 1 d 67 1 d
 200 X 67 -1 d 67 X 67 -1 d 67 -1 d 66 -3 d 67 -5 d 67 -7 d 67 -10 d 67 -13 d 67 -18 d 66 -34 d 67 -86 d 55 -282 d s 0.8 0 1 c[ 12 12] 0 sd black 0.8 0 1 c 225 780 m 67 34 d 66 13 d 67 2 d 67 -3 d 67 -6 d 67 -7 d 67 -6 d 66 -5 d 67 -4 d 67 -3 d 67 -1
 d 133 X 67 -3 d 67 -1 d 67 -4 d 67 -8 d 66 -13 d 67 -20 d 67 -31 d 67 -50 d 67 -79 d 67 -123 d 66 -185 d 32 -121 d s black[  ] 0 sd 3 lw 0.8 0 1 c 1 lw << /PatternType 1 /PaintType 2 /TilingType 1 /BBox [ 0 0 100 100 ] /XStep 100 /YStep 100
 /PaintProc { begin gsave 0 100 m 100 0 l s gr end } >> [ 0.24 0 0 0.24 0 0 ] makepattern /P05 exch def /cs {[/Pattern /DeviceRGB] setcolorspace} def /FA {f [/DeviceRGB] setcolorspace} def cs 0.8 0 1 P05 setcolor 225 837 m 67 31 d 66 10 d 67 -1 d 67
 -6 d 67 -9 d 67 -9 d 67 -8 d 66 -8 d 67 -5 d 67 -4 d 67 -3 d 67 -1 d 66 -1 d 67 -4 d 67 X 67 -2 d 67 -2 d 66 -2 d 67 -3 d 67 -10 d 67 -25 d 67 -53 d 67 -101 d 66 -170 d 67 -255 d 9 -40 d -93 X -49 146 d -67 146 d -67 105 d -67 75 d -67 53 d -67 36 d
 -66 24 d -67 14 d -67 7 d -67 X -67 3 d -66 -1 d -67 -1 d -67 X -67 1 d -67 2 d -66 3 d -67 4 d -67 5 d -67 3 d -67 1 d -67 -5 d -66 -17 d -67 -37 d FA[ 12 12] 0 sd 6 lw 0.8 0 1 c[  ] 0 sd black 0.8 0 1 c 225 837 m 67 31 d 66 10 d 67 -1 d 67 -6 d 67
 -9 d 67 -9 d 67 -8 d 66 -8 d 67 -5 d 67 -4 d 67 -3 d 67 -1 d 66 -1 d 67 -4 d 67 X 67 -2 d 67 -2 d 66 -2 d 67 -3 d 67 -10 d 67 -25 d 67 -53 d 67 -101 d 66 -170 d 67 -255 d 9 -40 d s black 0.8 0 1 c 225 723 m 67 37 d 66 17 d 67 5 d 67 -1 d 67 -3 d 67
 -5 d 67 -4 d 66 -3 d 67 -2 d 67 -1 d 67 X 67 1 d 66 1 d 67 -3 d 67 X 67 -7 d 67 -14 d 66 -24 d 67 -36 d 67 -53 d 67 -75 d 67 -105 d 67 -146 d 49 -146 d s 0 0.8 0.8 c[ 12 12] 0 sd black 0 0.8 0.8 c 225 601 m 67 60 d 66 34 d 67 16 d 67 7 d 67 X 67 -4
 d 67 -3 d 66 -4 d 67 -3 d 67 -1 d 67 1 d 67 1 d 66 4 d 67 -1 d 67 4 d 67 X 67 -4 d 66 -8 d 67 -13 d 67 -19 d 67 -29 d 67 -41 d 67 -58 d 66 -77 d 67 -98 d 67 -113 d 35 -96 d s black[  ] 0 sd 3 lw 0 0.8 0.8 c 1 lw << /PatternType 1 /PaintType 2
 /TilingType 1 /BBox [ 0 0 100 100 ] /XStep 100 /YStep 100 /PaintProc { begin gsave 0 0 m 100 100 l s gr end } >> [ 0.24 0 0 0.24 0 0 ] makepattern /P04 exch def cs 0 0.8 0.8 P04 setcolor 225 1025 m 67 -67 d 66 -52 d 67 -42 d 67 -29 d 67 -21 d 67 -16
 d 67 -11 d 66 -9 d 67 -6 d 67 -3 d 67 -1 d 67 2 d 66 5 d 67 2 d 67 8 d 67 5 d 67 5 d 66 5 d 67 6 d 67 8 d 67 14 d 67 20 d 67 30 d 66 45 d 67 70 d 67 123 d 67 130 d 8 -1090 d -260 X -15 46 d -67 146 d -67 102 d -67 71 d -67 48 d -67 32 d -66 20 d -67
 13 d -67 6 d -67 X -67 3 d -66 -2 d -67 -2 d -67 -2 d -67 -1 d -67 X -66 -1 d -67 -4 d -67 -10 d -67 -21 d -67 -43 d -67 -73 d -66 -120 d -67 -187 d FA[ 12 12] 0 sd 6 lw 0 0.8 0.8 c[  ] 0 sd black 0 0.8 0.8 c 225 1025 m 67 -67 d 66 -52 d 67 -42 d 67
 -29 d 67 -21 d 67 -16 d 67 -11 d 66 -9 d 67 -6 d 67 -3 d 67 -1 d 67 2 d 66 5 d 67 2 d 67 8 d 67 5 d 67 5 d 66 5 d 67 6 d 67 8 d 67 14 d 67 20 d 67 30 d 66 45 d 67 70 d 67 123 d 67 130 d 11 -240 d s black 0 0.8 0.8 c 225 177 m 67 187 d 66 120 d 67 73
 d 67 43 d 67 21 d 67 10 d 67 4 d 66 1 d 67 X 67 1 d 67 2 d 67 2 d 66 2 d 67 -3 d 67 X 67 -6 d 67 -13 d 66 -20 d 67 -32 d 67 -48 d 67 -71 d 67 -102 d 67 -146 d 15 -46 d s black 3 lw 1 1 1 c 839 323 295 1015 bf black 295 1015 m 839 X s 1134 1015 m 323
 Y s 1134 1338 m -839 X s 295 1338 m -323 Y s
 gsave  2268 1538 0 0 C 501.765 1267.44 t 0 r /Helvetica findfont 48.8732 sf 0 0 m (NNPDF2.3 NNLO) show NC gr  0 1 0 c 326 1246 m 147 X 76 Y -147 X f 0 0.6 0 c[ 12 12] 0 sd 6 lw 326 1284 m 147 X s black
 gsave  2268 1538 0 0 C 501.765 1159.92 t 0 r /Helvetica findfont 48.8732 sf 0 0 m (ABM11 NNLO) show NC gr  0.8 0 1 c[  ] 0 sd 3 lw cs 0.8 0 1 P05 setcolor 326 1139 m 147 X 75 Y -147 X FA[ 12 12] 0 sd 6 lw 0.8 0 1 c 326 1176 m 147 X s black
 gsave  2268 1538 0 0 C 501.765 1052.4 t 0 r /Helvetica findfont 48.8732 sf 0 0 m (HERAPDF1.5 NNLO) show NC gr  0 0.8 0.8 c[  ] 0 sd 3 lw cs 0 0.8 0.8 P04 setcolor 326 1031 m 147 X 76 Y -147 X FA[ 12 12] 0 sd 6 lw 0 0.8 0.8 c 326 1069 m 147 X s 1 1 1
 c black
 gsave  2268 1538 0 0 C 1619.33 1466.2 t 0 r /Helvetica findfont 61.9061 sf 0 0 m ( = 0.118) show NC gr 
 gsave  2268 1538 0 0 C 1596.52 1449.9 t 0 r /Helvetica findfont 42.3568 sf 0 0 m (s) show NC gr 
 gsave  2268 1538 0 0 C 1557.43 1466.2 t 0 r /Symbol findfont 61.9061 sf 0 0 m (a) show NC gr 
 gsave  2268 1538 0 0 C 420.31 1466.2 t 0 r /Helvetica findfont 61.9061 sf 0 0 m (LHC 8 TeV \255 Ratio to NNPDF2.3 NNLO \255 ) show NC gr 
 gsave  2268 1538 0 0 C 2166.71 847.135 t 90 r /Helvetica-BoldOblique findfont 45.615 sf 0 0 m (LHC HIGGS XS WG 2013) show NC gr 
 gr  gr showpage
end
%%EOF
