%!PS-Adobe-2.0 EPSF-2.0
%%BoundingBox:  0 0 567 544
%%Title: HWW_600_MWW_NNLO_cut_YR3.eps: HWW 600Gev MWW NNLO with cuts
%%Creator: ROOT Version 5.34/05
%%CreationDate: Fri Jun 14 04:56:10 2013
%%EndComments
%%BeginProlog
80 dict begin
/s {stroke} def /l {lineto} def /m {moveto} def /t {translate} def
/r {rotate} def /rl {roll}  def /R {repeat} def
/d {rlineto} def /rm {rmoveto} def /gr {grestore} def /f {eofill} def
/c {setrgbcolor} def /black {0 setgray} def /sd {setdash} def
/cl {closepath} def /sf {scalefont setfont} def /lw {setlinewidth} def
/box {m dup 0 exch d exch 0 d 0 exch neg d cl} def
/NC{systemdict begin initclip end}def/C{NC box clip newpath}def
/bl {box s} def /bf {box f} def /Y { 0 exch d} def /X { 0 d} def 
/K {{pop pop 0 moveto} exch kshow} bind def
/ita {/ang 15 def gsave [1 0 ang dup sin exch cos div 1 0 0] concat} def 
/mp {newpath /y exch def /x exch def} def
/side {[w .77 mul w .23 mul] .385 w mul sd w 0 l currentpoint t -144 r} def
/mr {mp x y w2 0 360 arc} def /m24 {mr s} def /m20 {mr f} def
/mb {mp x y w2 add m w2 neg 0 d 0 w neg d w 0 d 0 w d cl} def
/mt {mp x y w2 add m w2 neg w neg d w 0 d cl} def
/m21 {mb f} def /m25 {mb s} def /m22 {mt f} def /m26{mt s} def
/m23 {mp x y w2 sub m w2 w d w neg 0 d cl f} def
/m27 {mp x y w2 add m w3 neg w2 neg d w3 w2 neg d w3 w2 d cl s} def
/m28 {mp x w2 sub y w2 sub w3 add m w3 0 d  0 w3 neg d w3 0 d 0 w3 d w3 0 d  0 w3 d w3 neg 0 d 0 w3 d w3 neg 0 d 0 w3 neg d w3 neg 0 d cl s } def
/m29 {mp gsave x w2 sub y w2 add w3 sub m currentpoint t 4 {side} repeat cl fill gr} def
/m30 {mp gsave x w2 sub y w2 add w3 sub m currentpoint t 4 {side} repeat cl s gr} def
/m31 {mp x y w2 sub m 0 w d x w2 sub y m w 0 d x w2 sub y w2 add m w w neg d x w2 sub y w2 sub m w w d s} def
/m32 {mp x y w2 sub m w2 w d w neg 0 d cl s} def
/m33 {mp x y w2 add m w3 neg w2 neg d w3 w2 neg d w3 w2 d cl f} def
/m34 {mp x w2 sub y w2 sub w3 add m w3 0 d  0 w3 neg d w3 0 d 0 w3 d w3 0 d  0 w3 d w3 neg 0 d 0 w3 d w3 neg 0 d 0 w3 neg d w3 neg 0 d cl f } def
/m2 {mp x y w2 sub m 0 w d x w2 sub y m w 0 d s} def
/m5 {mp x w2 sub y w2 sub m w w d x w2 sub y w2 add m w w neg d s} def
/reEncode {exch findfont dup length dict begin {1 index /FID eq  {pop pop} {def} ifelse } forall /Encoding exch def currentdict end dup /FontName get exch definefont pop } def [/Times-Bold /Times-Italic /Times-BoldItalic /Helvetica /Helvetica-Oblique
 /Helvetica-Bold /Helvetica-BoldOblique /Courier /Courier-Oblique /Courier-Bold /Courier-BoldOblique /Times-Roman /AvantGarde-Book /AvantGarde-BookOblique /AvantGarde-Demi /AvantGarde-DemiOblique /Bookman-Demi /Bookman-DemiItalic /Bookman-Light
 /Bookman-LightItalic /Helvetica-Narrow /Helvetica-Narrow-Bold /Helvetica-Narrow-BoldOblique /Helvetica-Narrow-Oblique /NewCenturySchlbk-Roman /NewCenturySchlbk-Bold /NewCenturySchlbk-BoldItalic /NewCenturySchlbk-Italic /Palatino-Bold
 /Palatino-BoldItalic /Palatino-Italic /Palatino-Roman ] {ISOLatin1Encoding reEncode } forall
%%EndProlog
%%BeginSetup
%%EndSetup
newpath  gsave  .25 .25 scale  gsave  0 0 t black[  ] 0 sd 3 lw 1 1 1 c 2268 2177 0 0 bf black 1 1 1 c 2222 2133 23 22 bf black 1 1 1 c 1778 1706 245 235 bf black 1778 1706 245 235 bl 0.8 0 0.8 c 1 1 1 c 1 0 1 c 0.8 0 0.8 c 245 322 m 373 X 73 Y 4 X
 10 Y 3 X -4 Y 4 X 2 Y 3 X -6 Y 4 X -11 Y 4 X 1 Y 3 X -4 Y 4 X 11 Y 3 X 7 Y 4 X -4 Y 3 X 2 Y 4 X -4 Y 3 X -5 Y 8 X -3 Y 3 X 6 Y 4 X 2 Y 3 X -7 Y 4 X -5 Y 3 X 16 Y 4 X -14 Y 3 X 9 Y 4 X -3 Y 4 X -1 Y 3 X 7 Y 4 X -10 Y 3 X 3 Y 4 X 1 Y 3 X -5 Y 4 X 5 Y
 3 X 3 Y 4 X -6 Y 4 X 4 Y 3 X -5 Y 4 X 2 Y 3 X 2 Y 4 X 2 Y 3 X 3 Y 4 X -8 Y 4 X 11 Y 3 X -2 Y 4 X 2 Y 3 X 5 Y 4 X -1 Y 3 X 1 Y 4 X -6 Y 7 X 3 Y 4 X 9 Y 3 X 1 Y 4 X -1 Y 3 X 2 Y 4 X 1 Y 3 X 6 Y 4 X 4 Y 3 X -9 Y 8 X 9 Y 3 X -3 Y 4 X 6 Y 3 X -1 Y 4 X 10
 Y 7 X -5 Y 3 X 13 Y 4 X -1 Y 4 X 9 Y 3 X 13 Y 4 X -3 Y 3 X 13 Y 4 X -2 Y 3 X 8 Y 4 X 3 Y 3 X 16 Y 4 X 6 Y 4 X -10 Y 3 X 16 Y 4 X 14 Y 3 X -3 Y 4 X 20 Y 3 X -2 Y 4 X 4 Y 3 X -8 Y 4 X 19 Y 4 X -4 Y 3 X 31 Y 4 X -5 Y 3 X 2 Y 7 X -4 Y 4 X 13 Y 3 X 8 Y 4
 X 5 Y 4 X 9 Y 3 X -2 Y 4 X 4 Y 3 X -1 Y 4 X 26 Y 3 X -5 Y 4 X 8 Y 3 X 4 Y 4 X 2 Y 4 X 14 Y 7 X -1 Y 3 X 10 Y 4 X 28 Y 3 X 4 Y 4 X 10 Y 3 X -14 Y 4 X 10 Y 4 X -3 Y 3 X 18 Y 4 X 4 Y 3 X 4 Y 4 X 16 Y 7 X 17 Y 3 X 10 Y 4 X 7 Y 4 X -3 Y 3 X 8 Y 4 X 4 Y 3
 X 16 Y 4 X 3 Y 3 X 14 Y 4 X 9 Y 3 X 7 Y 4 X 11 Y 4 X 18 Y 3 X 2 Y 4 X 2 Y 3 X 16 Y 4 X 5 Y 3 X 14 Y 4 X 5 Y 3 X 12 Y 4 X 4 Y 4 X 18 Y 3 X 13 Y 4 X 10 Y 3 X 18 Y 4 X 4 Y 3 X 18 Y 4 X 9 Y 3 X 29 Y 4 X 10 Y 4 X 18 Y 3 X 5 Y 4 X 25 Y 3 X 14 Y 4 X 5 Y 3
 X 28 Y 4 X 20 Y 3 X 4 Y 4 X 27 Y 4 X 26 Y 3 X 17 Y 4 X 19 Y 3 X 14 Y 4 X 15 Y 3 X 35 Y 4 X 17 Y 3 X 20 Y 4 X 22 Y 4 X 16 Y 3 X 25 Y 4 X 44 Y 3 X 11 Y 4 X 30 Y 3 X 13 Y 4 X 16 Y 3 X 44 Y 4 X 16 Y 4 X 16 Y 3 X 30 Y 4 X 20 Y 3 X 20 Y 4 X 43 Y 3 X 17 Y
 4 X 21 Y 3 X 25 Y 4 X 13 Y 4 X -2 Y 3 X 20 Y 4 X 6 Y 3 X 10 Y 4 X 4 Y 3 X 15 Y 4 X -11 Y 3 X 5 Y 4 X -5 Y 4 X -2 Y 3 X -39 Y 4 X -15 Y 3 X -11 Y 4 X -15 Y 3 X -13 Y 4 X -37 Y 3 X -18 Y 4 X -64 Y 4 X -12 Y 3 X -31 Y 4 X -56 Y 3 X -31 Y 4 X -40 Y 3 X
 -43 Y 4 X -53 Y 3 X -29 Y 4 X -31 Y 4 X -46 Y 3 X -22 Y 4 X -36 Y 3 X -62 Y 4 X -28 Y 3 X -33 Y 4 X -30 Y 3 X -34 Y 4 X -49 Y 4 X -11 Y 3 X -42 Y 4 X -36 Y 3 X -22 Y 4 X -12 Y 3 X -33 Y 4 X -34 Y 3 X -15 Y 4 X -21 Y 4 X -20 Y 3 X -16 Y 4 X -19 Y 3 X
 -14 Y 4 X -23 Y 3 X -18 Y 4 X -11 Y 3 X -16 Y 4 X -25 Y 4 X -3 Y 3 X -14 Y 4 X -12 Y 3 X -9 Y 4 X -11 Y 3 X -16 Y 4 X -6 Y 3 X -7 Y 4 X -5 Y 4 X -12 Y 3 X -9 Y 4 X -16 Y 3 X 2 Y 4 X -9 Y 3 X -11 Y 4 X -5 Y 3 X -1 Y 4 X -6 Y 4 X -8 Y 3 X -1 Y 4 X -1
 Y 3 X -9 Y 4 X -8 Y 3 X -4 Y 4 X -1 Y 3 X -3 Y 4 X -2 Y 4 X -3 Y 3 X -7 Y 7 X -9 Y 4 X 1 Y 3 X -2 Y 4 X -2 Y 7 X -4 Y 4 X -3 Y 3 X -6 Y 4 X -1 Y 3 X -1 Y 4 X -2 Y 3 X -1 Y 4 X -4 Y 3 X 3 Y 4 X -4 Y 4 X -4 Y 10 X -2 Y 4 X -1 Y 3 X -1 Y 4 X -1 Y 7 X
 -2 Y 4 X -1 Y 3 X -2 Y 4 X 1 Y 3 X -3 Y 7 X -1 Y 4 X -2 Y 7 X -1 Y 4 X 1 Y 3 X -3 Y 7 X 1 Y 4 X -1 Y 7 X -2 Y 3 X 1 Y 4 X -2 Y 7 X 1 Y 4 X -3 Y 3 X 1 Y 4 X -1 Y 7 X 1 Y 7 X -3 Y 7 X -1 Y 4 X 1 Y 7 X -1 Y 10 X 2 Y 4 X -3 Y 18 X 1 Y 3 X -2 Y 4 X -2 Y
 7 X 2 Y 4 X 1 Y 7 X -1 Y 3 X -2 Y 4 X 1 Y 21 X 1 Y 4 X -1 Y 3 X -1 Y 7 X 2 Y 4 X -1 Y 11 X -1 Y 7 X 1 Y 3 X -2 Y 4 X 2 Y 3 X -2 Y 4 X 1 Y 7 X 1 Y 7 X -2 Y 4 X 1 Y 3 X 1 Y 11 X -2 Y 11 X 1 Y 3 X -1 Y 7 X 1 Y 4 X -1 Y 3 X 1 Y 7 X -1 Y 4 X 3 Y 4 X -1 Y
 7 X -2 Y 3 X -1 Y 4 X 3 Y 3 X -1 Y 4 X -1 Y 7 X -2 Y 4 X 3 Y 7 X 1 Y 7 X s black 245 235 m 1778 X s
 gsave  2222 2133 23 22 C 1933.45 79.7689 t 0 r /Helvetica findfont 45.6261 sf 0 0 m (WW) show NC gr 
 gsave  2222 2133 23 22 C 1880.27 98.7615 t 0 r /Helvetica findfont 68.4392 sf 0 0 m (M) show NC gr  245 286 m -51 Y s 280 261 m -26 Y s 316 261 m -26 Y s 352 261 m -26 Y s 387 261 m -26 Y s 423 286 m -51 Y s 458 261 m -26 Y s 494 261 m -26 Y s 529
 261 m -26 Y s 565 261 m -26 Y s 600 286 m -51 Y s 636 261 m -26 Y s 672 261 m -26 Y s 707 261 m -26 Y s 743 261 m -26 Y s 778 286 m -51 Y s 814 261 m -26 Y s 849 261 m -26 Y s 885 261 m -26 Y s 921 261 m -26 Y s 956 286 m -51 Y s 992 261 m -26 Y s
 1027 261 m -26 Y s 1063 261 m -26 Y s 1098 261 m -26 Y s 1134 286 m -51 Y s 1169 261 m -26 Y s 1205 261 m -26 Y s 1241 261 m -26 Y s 1276 261 m -26 Y s 1312 286 m -51 Y s 1347 261 m -26 Y s 1383 261 m -26 Y s 1418 261 m -26 Y s 1454 261 m -26 Y s
 1489 286 m -51 Y s 1525 261 m -26 Y s 1561 261 m -26 Y s 1596 261 m -26 Y s 1632 261 m -26 Y s 1667 286 m -51 Y s 1703 261 m -26 Y s 1738 261 m -26 Y s 1774 261 m -26 Y s 1809 261 m -26 Y s 1845 286 m -51 Y s 1881 261 m -26 Y s 1916 261 m -26 Y s
 1952 261 m -26 Y s 1987 261 m -26 Y s 2023 286 m -51 Y s
 gsave  2222 2133 23 22 C 224.113 167.135 t 0 r /Helvetica findfont 68.4392 sf 0 0 m (0) show NC gr 
 gsave  2222 2133 23 22 C 364.658 167.135 t 0 r /Helvetica findfont 68.4392 sf 0 0 m (100) show NC gr 
 gsave  2222 2133 23 22 C 543.188 167.135 t 0 r /Helvetica findfont 68.4392 sf 0 0 m (200) show NC gr 
 gsave  2222 2133 23 22 C 717.92 167.135 t 0 r /Helvetica findfont 68.4392 sf 0 0 m (300) show NC gr 
 gsave  2222 2133 23 22 C 896.451 167.135 t 0 r /Helvetica findfont 68.4392 sf 0 0 m (400) show NC gr 
 gsave  2222 2133 23 22 C 1074.98 167.135 t 0 r /Helvetica findfont 68.4392 sf 0 0 m (500) show NC gr 
 gsave  2222 2133 23 22 C 1253.51 167.135 t 0 r /Helvetica findfont 68.4392 sf 0 0 m (600) show NC gr 
 gsave  2222 2133 23 22 C 1432.04 167.135 t 0 r /Helvetica findfont 68.4392 sf 0 0 m (700) show NC gr 
 gsave  2222 2133 23 22 C 1606.77 167.135 t 0 r /Helvetica findfont 68.4392 sf 0 0 m (800) show NC gr 
 gsave  2222 2133 23 22 C 1785.3 167.135 t 0 r /Helvetica findfont 68.4392 sf 0 0 m (900) show NC gr 
 gsave  2222 2133 23 22 C 1944.84 167.135 t 0 r /Helvetica findfont 68.4392 sf 0 0 m (1000) show NC gr  245 235 m 1706 Y s
 gsave  2222 2133 23 22 C 102.56 1143.35 t 90 r /Helvetica findfont 45.6261 sf 0 0 m (WW) show NC gr 
 gsave  2222 2133 23 22 C 75.9704 1029.4 t 90 r /Helvetica findfont 68.4392 sf 0 0 m (/dM) show NC gr 
 gsave  2222 2133 23 22 C 75.9704 987.615 t 90 r /Symbol findfont 68.4392 sf 0 0 m (s) show NC gr 
 gsave  2222 2133 23 22 C 75.9704 953.429 t 90 r /Helvetica findfont 68.4392 sf 0 0 m (d) show NC gr  298 322 m -53 X s 272 364 m -27 X s 272 406 m -27 X s 272 448 m -27 X s 298 491 m -53 X s 272 533 m -27 X s 272 575 m -27 X s 272 618 m -27 X s 298
 660 m -53 X s 272 702 m -27 X s 272 745 m -27 X s 272 787 m -27 X s 298 829 m -53 X s 272 872 m -27 X s 272 914 m -27 X s 272 956 m -27 X s 298 999 m -53 X s 272 1041 m -27 X s 272 1083 m -27 X s 272 1125 m -27 X s 298 1168 m -53 X s 272 1210 m -27
 X s 272 1252 m -27 X s 272 1295 m -27 X s 298 1337 m -53 X s 272 1379 m -27 X s 272 1422 m -27 X s 272 1464 m -27 X s 298 1506 m -53 X s 272 1549 m -27 X s 272 1591 m -27 X s 272 1633 m -27 X s 298 1676 m -53 X s 272 1718 m -27 X s 272 1760 m -27 X
 s 272 1803 m -27 X s 298 1845 m -53 X s 298 322 m -53 X s 272 279 m -27 X s 272 237 m -27 X s 298 1845 m -53 X s 272 1887 m -27 X s 272 1929 m -27 X s
 gsave  2222 2133 23 22 C 208.919 307.68 t 0 r /Helvetica findfont 38.0218 sf 0 0 m (0) show NC gr 
 gsave  2222 2133 23 22 C 136.747 478.614 t 0 r /Helvetica findfont 38.0218 sf 0 0 m (0.002) show NC gr 
 gsave  2222 2133 23 22 C 136.747 645.748 t 0 r /Helvetica findfont 38.0218 sf 0 0 m (0.004) show NC gr 
 gsave  2222 2133 23 22 C 136.747 816.682 t 0 r /Helvetica findfont 38.0218 sf 0 0 m (0.006) show NC gr 
 gsave  2222 2133 23 22 C 136.747 983.817 t 0 r /Helvetica findfont 38.0218 sf 0 0 m (0.008) show NC gr 
 gsave  2222 2133 23 22 C 163.336 1154.75 t 0 r /Helvetica findfont 38.0218 sf 0 0 m (0.01) show NC gr 
 gsave  2222 2133 23 22 C 136.747 1321.89 t 0 r /Helvetica findfont 38.0218 sf 0 0 m (0.012) show NC gr 
 gsave  2222 2133 23 22 C 136.747 1492.82 t 0 r /Helvetica findfont 38.0218 sf 0 0 m (0.014) show NC gr 
 gsave  2222 2133 23 22 C 136.747 1663.75 t 0 r /Helvetica findfont 38.0218 sf 0 0 m (0.016) show NC gr 
 gsave  2222 2133 23 22 C 136.747 1830.89 t 0 r /Helvetica findfont 38.0218 sf 0 0 m (0.018) show NC gr  0.8 0 0.8 c 1 0 1 c /w 2 def /w2 {w 2 div} def /w3 {w 3 div} def 247 322 m20 250 322 m20 254 322 m20 257 322 m20 261 322 m20 264 322 m20 268 322
 m20 272 322 m20 275 322 m20 279 322 m20 282 322 m20 286 322 m20 289 322 m20 293 322 m20 296 322 m20 300 322 m20 304 322 m20 307 322 m20 311 322 m20 314 322 m20 318 322 m20 321 322 m20 325 322 m20 328 322 m20 332 322 m20 336 322 m20 339 322 m20 343
 322 m20 346 322 m20 350 322 m20 353 322 m20 357 322 m20 360 322 m20 364 322 m20 368 322 m20 371 322 m20 375 322 m20 378 322 m20 382 322 m20 385 322 m20 389 322 m20 392 322 m20 396 322 m20 400 322 m20 403 322 m20 407 322 m20 410 322 m20 414 322 m20
 417 322 m20 421 322 m20 424 322 m20 428 322 m20 432 322 m20 435 322 m20 439 322 m20 442 322 m20 446 322 m20 449 322 m20 453 322 m20 456 322 m20 460 322 m20 464 322 m20 467 322 m20 471 322 m20 474 322 m20 478 322 m20 481 322 m20 485 322 m20 488 322
 m20 492 322 m20 496 322 m20 499 322 m20 503 322 m20 506 322 m20 510 322 m20 513 322 m20 517 322 m20 520 322 m20 524 322 m20 528 322 m20 531 322 m20 535 322 m20 538 322 m20 542 322 m20 545 322 m20 549 322 m20 552 322 m20 556 322 m20 560 322 m20 563
 322 m20 567 322 m20 570 322 m20 574 322 m20 577 322 m20 581 322 m20 584 322 m20 588 322 m20 592 322 m20 595 322 m20 599 322 m20 602 322 m20 606 322 m20 609 322 m20 613 322 m20 616 322 m20 620 395 m20 624 405 m20 627 401 m20 631 403 m20 634 397 m20
 638 386 m20 641 387 m20 645 383 m20 648 394 m20 652 401 m20 656 397 m20 659 399 m20 663 395 m20 666 390 m20 670 390 m20 673 387 m20 677 393 m20 680 395 m20 684 388 m20 688 383 m20 691 399 m20 695 385 m20 698 394 m20 702 391 m20 705 390 m20 709 397
 m20 712 387 m20 716 390 m20 720 391 m20 723 386 m20 727 391 m20 730 394 m20 734 388 m20 737 392 m20 741 387 m20 745 389 m20 748 391 m20 752 393 m20 755 396 m20 759 388 m20 762 399 m20 766 397 m20 769 399 m20 773 404 m20 777 403 m20 780 404 m20 784
 398 m20 787 398 m20 791 401 m20 794 410 m20 798 411 m20 801 410 m20 805 412 m20 809 413 m20 812 419 m20 816 423 m20 819 414 m20 823 414 m20 826 423 m20 830 420 m20 833 426 m20 837 425 m20 841 435 m20 844 435 m20 848 430 m20 851 443 m20 855 442 m20
 858 451 m20 862 464 m20 865 461 m20 869 474 m20 873 472 m20 876 480 m20 880 483 m20 883 499 m20 887 505 m20 890 495 m20 894 511 m20 897 525 m20 901 522 m20 905 542 m20 908 540 m20 912 544 m20 915 536 m20 919 555 m20 922 551 m20 926 582 m20 929 577
 m20 933 579 m20 937 579 m20 940 575 m20 944 588 m20 947 596 m20 951 601 m20 954 610 m20 958 608 m20 961 612 m20 965 611 m20 969 637 m20 972 632 m20 976 640 m20 979 644 m20 983 646 m20 986 660 m20 990 660 m20 993 659 m20 997 669 m20 1001 697 m20 1004
 701 m20 1008 711 m20 1011 697 m20 1015 707 m20 1018 704 m20 1022 722 m20 1025 726 m20 1029 730 m20 1033 746 m20 1036 746 m20 1040 763 m20 1043 773 m20 1047 780 m20 1050 777 m20 1054 785 m20 1057 789 m20 1061 805 m20 1065 808 m20 1068 822 m20 1072
 831 m20 1075 838 m20 1079 849 m20 1082 867 m20 1086 869 m20 1089 871 m20 1093 887 m20 1097 892 m20 1100 906 m20 1104 911 m20 1107 923 m20 1111 927 m20 1114 945 m20 1118 958 m20 1121 968 m20 1125 986 m20 1129 990 m20 1132 1008 m20 1136 1017 m20 1139
 1046 m20 1143 1056 m20 1146 1074 m20 1150 1079 m20 1153 1104 m20 1157 1118 m20 1161 1123 m20 1164 1151 m20 1168 1171 m20 1171 1175 m20 1175 1202 m20 1178 1228 m20 1182 1245 m20 1185 1264 m20 1189 1278 m20 1193 1293 m20 1196 1328 m20 1200 1345 m20
 1203 1365 m20 1207 1387 m20 1210 1403 m20 1214 1428 m20 1217 1472 m20 1221 1483 m20 1225 1513 m20 1228 1526 m20 1232 1542 m20 1235 1586 m20 1239 1602 m20 1242 1618 m20 1246 1648 m20 1249 1668 m20 1253 1688 m20 1257 1731 m20 1260 1748 m20 1264 1769
 m20 1267 1794 m20 1271 1807 m20 1274 1805 m20 1278 1825 m20 1281 1831 m20 1285 1841 m20 1289 1845 m20 1292 1860 m20 1296 1849 m20 1299 1854 m20 1303 1849 m20 1306 1847 m20 1310 1808 m20 1313 1793 m20 1317 1782 m20 1321 1767 m20 1324 1754 m20 1328
 1717 m20 1331 1699 m20 1335 1635 m20 1338 1623 m20 1342 1592 m20 1345 1536 m20 1349 1505 m20 1353 1465 m20 1356 1422 m20 1360 1369 m20 1363 1340 m20 1367 1309 m20 1370 1263 m20 1374 1241 m20 1377 1205 m20 1381 1143 m20 1385 1115 m20 1388 1082 m20
 1392 1052 m20 1395 1018 m20 1399 969 m20 1402 958 m20 1406 916 m20 1409 880 m20 1413 858 m20 1417 846 m20 1420 813 m20 1424 779 m20 1427 764 m20 1431 743 m20 1434 723 m20 1438 707 m20 1441 688 m20 1445 674 m20 1449 651 m20 1452 633 m20 1456 622 m20
 1459 606 m20 1463 581 m20 1466 578 m20 1470 564 m20 1473 552 m20 1477 543 m20 1481 532 m20 1484 516 m20 1488 510 m20 1491 503 m20 1495 498 m20 1498 486 m20 1502 477 m20 1505 461 m20 1509 463 m20 1513 454 m20 1516 443 m20 1520 438 m20 1523 437 m20
 1527 431 m20 1530 423 m20 1534 422 m20 1537 421 m20 1541 412 m20 1545 404 m20 1548 400 m20 1552 399 m20 1555 396 m20 1559 394 m20 1562 391 m20 1566 384 m20 1569 384 m20 1573 375 m20 1577 376 m20 1580 374 m20 1584 372 m20 1587 372 m20 1591 368 m20
 1594 365 m20 1598 359 m20 1601 358 m20 1605 357 m20 1609 355 m20 1612 354 m20 1616 350 m20 1619 353 m20 1623 349 m20 1626 345 m20 1630 345 m20 1633 345 m20 1637 343 m20 1641 342 m20 1644 341 m20 1648 340 m20 1651 340 m20 1655 338 m20 1658 337 m20
 1662 335 m20 1665 336 m20 1669 333 m20 1673 333 m20 1676 332 m20 1680 330 m20 1683 330 m20 1687 329 m20 1690 330 m20 1694 327 m20 1697 327 m20 1701 328 m20 1705 327 m20 1708 327 m20 1712 325 m20 1715 326 m20 1719 324 m20 1722 324 m20 1726 325 m20
 1729 322 m20 1733 323 m20 1737 322 m20 1740 322 m20 1744 323 m20 1747 323 m20 1751 320 m20 1754 320 m20 1758 319 m20 1761 320 m20 1765 320 m20 1769 319 m20 1772 319 m20 1776 319 m20 1779 321 m20 1783 318 m20 1786 318 m20 1790 318 m20 1793 318 m20
 1797 318 m20 1801 319 m20 1804 317 m20 1808 315 m20 1811 315 m20 1815 317 m20 1818 318 m20 1822 318 m20 1825 317 m20 1829 315 m20 1833 316 m20 1836 316 m20 1840 316 m20 1843 316 m20 1847 316 m20 1850 316 m20 1854 317 m20 1857 316 m20 1861 315 m20
 1865 315 m20 1868 317 m20 1872 316 m20 1875 316 m20 1879 316 m20 1882 315 m20 1886 315 m20 1889 316 m20 1893 314 m20 1897 316 m20 1900 314 m20 1904 315 m20 1907 315 m20 1911 316 m20 1914 316 m20 1918 314 m20 1921 315 m20 1925 316 m20 1929 316 m20
 1932 316 m20 1936 314 m20 1939 314 m20 1943 314 m20 1946 315 m20 1950 314 m20 1953 314 m20 1957 315 m20 1961 314 m20 1964 315 m20 1968 315 m20 1971 314 m20 1975 317 m20 1978 316 m20 1982 316 m20 1985 314 m20 1989 313 m20 1993 316 m20 1996 315 m20
 2000 314 m20 2003 314 m20 2007 312 m20 2010 315 m20 2014 315 m20 2017 316 m20 2021 316 m20 0.8 0 0.8 c black 0.8 0 0.8 c 1 lw << /PatternType 1 /PaintType 2 /TilingType 1 /BBox [ 0 0 100 100 ] /XStep 100 /YStep 100 /PaintProc { begin gsave 0 0 m 100
 100 l 0 100 m 100 0 l s gr end } >> [ 0.24 0 0 0.24 0 0 ] makepattern /P13 exch def /cs {[/Pattern /DeviceRGB] setcolorspace} def /FA {f [/DeviceRGB] setcolorspace} def cs 0.8 0 0.8 P13 setcolor 247 322 m 369 X 4 81 d 4 9 d 3 -4 d 4 2 d 3 -5 d 4 -12
 d 3 1 d 4 -5 d 3 12 d 4 8 d 4 -6 d 3 3 d 4 -4 d 3 -6 d 4 X 3 -3 d 4 7 d 3 2 d 4 -8 d 4 -5 d 3 16 d 4 -14 d 3 9 d 4 -3 d 3 -2 d 4 9 d 3 -12 d 4 3 d 4 2 d 3 -5 d 4 5 d 3 3 d 4 -6 d 3 4 d 4 -5 d 4 1 d 3 2 d 4 3 d 3 2 d 4 -7 d 3 10 d 4 -2 d 3 2 d 4 5 d
 4 -1 d 3 2 d 4 -6 d 3 -1 d 4 3 d 3 10 d 4 1 d 3 -1 d 4 2 d 4 1 d 3 6 d 4 4 d 3 -9 d 4 X 3 9 d 4 -3 d 3 6 d 4 X 4 10 d 3 -1 d 4 -5 d 3 13 d 4 -1 d 3 10 d 4 13 d 3 -4 d 4 14 d 4 -2 d 3 8 d 4 3 d 3 17 d 4 5 d 3 -10 d 4 17 d 3 14 d 4 -3 d 4 20 d 3 -2 d
 4 5 d 3 -8 d 4 19 d 3 -4 d 4 32 d 3 -6 d 4 3 d 4 X 3 -5 d 4 14 d 3 6 d 4 3 d 3 9 d 4 -1 d 3 4 d 4 -2 d 4 27 d 3 -5 d 4 9 d 3 4 d 4 2 d 3 14 d 4 X 3 -1 d 4 10 d 4 28 d 3 5 d 4 9 d 3 -14 d 4 10 d 3 -4 d 4 19 d 3 3 d 4 5 d 4 16 d 3 X 4 17 d 3 10 d 4 8
 d 3 -4 d 4 8 d 3 4 d 4 16 d 4 3 d 3 14 d 4 9 d 3 7 d 4 11 d 3 18 d 4 2 d 3 2 d 4 17 d 4 4 d 3 14 d 4 5 d 3 12 d 4 4 d 3 19 d 4 13 d 3 10 d 4 17 d 4 4 d 3 19 d 4 8 d 3 30 d 4 10 d 3 18 d 4 5 d 3 24 d 4 14 d 4 5 d 3 29 d 4 20 d 3 4 d 4 27 d 3 26 d 4
 17 d 3 19 d 4 14 d 4 15 d 3 35 d 4 17 d 3 20 d 4 22 d 3 16 d 4 26 d 3 44 d 4 10 d 4 30 d 3 13 d 4 17 d 3 44 d 4 16 d 3 16 d 4 30 d 3 20 d 4 20 d 4 43 d 3 16 d 4 21 d 3 25 d 4 14 d 3 -2 d 4 20 d 3 5 d 4 11 d 4 3 d 3 16 d 4 -11 d 3 4 d 4 -4 d 3 -3 d 4
 -39 d 3 -15 d 4 -12 d 4 -14 d 3 -14 d 4 -36 d 3 -19 d 4 -64 d 3 -12 d 4 -31 d 3 -57 d 4 -30 d 4 -40 d 3 -44 d 4 -53 d 3 -29 d 4 -31 d 3 -47 d 4 -21 d 3 -37 d 4 -62 d 4 -28 d 3 -34 d 4 -29 d 3 -35 d 4 -49 d 3 -11 d 4 -42 d 3 -36 d 4 -22 d 4 -13 d 3
 -33 d 4 -34 d 3 -15 d 4 -21 d 3 -21 d 4 -15 d 3 -19 d 4 -15 d 4 -23 d 3 -18 d 4 -11 d 3 -16 d 4 -25 d 3 -3 d 4 -15 d 3 -11 d 4 -10 d 4 -10 d 3 -17 d 4 -5 d 3 -8 d 4 -4 d 3 -13 d 4 -10 d 3 -15 d 4 2 d 4 -9 d 3 -12 d 4 -5 d 3 X 4 -6 d 3 -8 d 4 -1 d 3
 -2 d 4 -8 d 4 -9 d 3 -3 d 4 -1 d 3 -4 d 4 -2 d 3 -3 d 4 -7 d 3 X 4 -9 d 4 1 d 3 -2 d 4 -2 d 3 X 4 -4 d 3 -4 d 4 -5 d 3 -1 d 4 -1 d 4 -2 d 3 -1 d 4 -4 d 3 2 d 4 -3 d 3 -5 d 7 X 4 -1 d 4 -2 d 3 -1 d 7 X 4 -3 d 3 X 4 -2 d 3 X 4 -3 d 4 1 d 3 -2 d 4 -2 d
 3 X 4 -1 d 3 1 d 4 -2 d 3 -1 d 4 1 d 4 -1 d 3 X 4 -2 d 3 1 d 4 -2 d 3 X 4 1 d 3 -3 d 4 1 d 4 -1 d 3 X 4 1 d 3 X 4 -3 d 3 X 4 -1 d 3 1 d 4 X 4 -1 d 3 X 4 1 d 3 1 d 4 -3 d 3 1 d 4 -1 d 3 1 d 4 -1 d 4 1 d 3 -2 d 4 -1 d 3 X 4 1 d 3 1 d 4 X 3 -1 d 4 -2 d
 4 1 d 7 X 3 1 d 4 X 3 -1 d 4 2 d 3 -2 d 4 -1 d 4 X 3 2 d 4 -1 d 7 X 3 -1 d 4 1 d 3 X 4 -1 d 4 1 d 3 -2 d 4 2 d 10 X 4 -2 d 3 1 d 4 2 d 4 -1 d 3 X 4 -1 d 17 X 4 1 d 4 -1 d 10 X 4 2 d 3 -1 d 4 X 3 -2 d 4 X 4 2 d 3 -1 d 4 -1 d 3 1 d 4 -2 d 3 2 d 4 1 d
 3 1 d 4 X -1 Y -4 X -3 -1 d -4 -1 d -3 -2 d -4 2 d -3 -1 d -4 2 d -3 X -4 -2 d -4 1 d -3 1 d -4 1 d -3 X -4 -2 d -10 X -4 1 d -4 -1 d -17 X -4 2 d -7 X -4 -1 d -3 -2 d -4 2 d -10 X -4 -1 d -3 1 d -4 -1 d -4 2 d -3 -1 d -14 X -4 1 d -3 -1 d -4 X -4 1
 d -3 1 d -4 -1 d -17 X -4 -1 d -4 2 d -3 1 d -4 X -3 -1 d -4 -2 d -3 X -4 2 d -3 2 d -4 -2 d -4 1 d -10 X -4 3 d -3 -2 d -7 X -4 1 d -4 X -3 -1 d -4 1 d -3 X -4 3 d -3 X -4 -1 d -3 X -4 1 d -4 -1 d -3 3 d -4 -1 d -3 X -4 1 d -3 X -4 2 d -3 X -4 1 d
 -4 -1 d -3 X -4 2 d -3 X -4 1 d -3 X -4 1 d -3 2 d -4 X -4 3 d -3 -1 d -4 2 d -3 1 d -4 2 d -7 X -3 1 d -4 2 d -4 1 d -3 X -4 1 d -3 4 d -4 3 d -3 -3 d -4 4 d -3 1 d -4 2 d -4 2 d -3 X -4 6 d -3 4 d -4 3 d -3 1 d -4 1 d -3 2 d -4 -1 d -4 9 d -3 X -4
 7 d -3 2 d -4 3 d -3 3 d -4 1 d -3 4 d -4 8 d -4 8 d -3 2 d -4 1 d -3 7 d -4 7 d -3 X -4 5 d -3 12 d -4 9 d -4 -2 d -3 15 d -4 9 d -3 12 d -4 5 d -3 7 d -4 6 d -3 16 d -4 10 d -4 9 d -3 12 d -4 14 d -3 3 d -4 25 d -3 16 d -4 11 d -3 17 d -4 24 d -4
 14 d -3 18 d -4 16 d -3 21 d -4 20 d -3 15 d -4 33 d -3 33 d -4 13 d -4 22 d -3 35 d -4 43 d -3 10 d -4 48 d -3 35 d -4 29 d -3 33 d -4 29 d -4 60 d -3 37 d -4 22 d -3 46 d -4 30 d -3 29 d -4 53 d -3 43 d -4 40 d -4 30 d -3 56 d -4 31 d -3 12 d -4
 63 d -3 19 d -4 36 d -3 13 d -4 15 d -4 11 d -3 15 d -4 38 d -3 3 d -4 4 d -3 -4 d -4 11 d -3 -16 d -4 -3 d -4 -11 d -3 -5 d -4 -20 d -3 2 d -4 -14 d -3 -25 d -4 -21 d -3 -16 d -4 -44 d -4 -19 d -3 -20 d -4 -30 d -3 -16 d -4 -16 d -3 -44 d -4 -16 d
 -3 -13 d -4 -31 d -4 -10 d -3 -44 d -4 -26 d -3 -15 d -4 -23 d -3 -19 d -4 -17 d -3 -35 d -4 -15 d -4 -13 d -3 -20 d -4 -18 d -3 -25 d -4 -26 d -3 -5 d -4 -19 d -3 -29 d -4 -5 d -4 -14 d -3 -24 d -4 -5 d -3 -19 d -4 -9 d -3 -30 d -4 -8 d -3 -19 d -4
 -4 d -4 -17 d -3 -10 d -4 -13 d -3 -18 d -4 -5 d -3 -11 d -4 -5 d -3 -14 d -4 -5 d -4 -16 d -3 -2 d -4 -2 d -3 -18 d -4 -11 d -3 -7 d -4 -9 d -3 -14 d -4 -3 d -4 -16 d -3 -4 d -4 -7 d -3 2 d -4 -7 d -3 -10 d -4 -17 d -3 X -4 -15 d -4 -5 d -3 -3 d -4
 -19 d -3 4 d -4 -11 d -3 13 d -4 -9 d -3 -5 d -4 -27 d -4 -10 d -3 1 d -4 -1 d -3 -13 d -4 -1 d -3 -4 d -4 -8 d -3 6 d -4 -26 d -4 1 d -3 -4 d -4 2 d -3 -9 d -4 -7 d -3 -10 d -4 -13 d -3 4 d -4 X -4 -2 d -3 5 d -4 -30 d -3 4 d -4 -18 d -3 7 d -4 -4
 d -3 2 d -4 -19 d -4 2 d -3 -13 d -4 -16 d -3 10 d -4 -6 d -3 -16 d -4 -2 d -3 -7 d -4 1 d -4 -13 d -3 4 d -4 -13 d -3 -9 d -4 X -3 -12 d -4 5 d -3 X -4 -10 d -4 1 d -3 -6 d -4 3 d -3 -9 d -4 1 d -3 8 d -4 -5 d -3 -4 d -4 -2 d -4 -2 d -3 1 d -4 -1 d
 -3 -9 d -4 -2 d -3 X -4 5 d -3 -1 d -4 1 d -4 -5 d -3 -2 d -4 2 d -3 -10 d -4 7 d -3 -2 d -4 -3 d -3 -2 d -4 -1 d -4 5 d -3 -4 d -4 5 d -3 -2 d -4 -5 d -3 5 d -4 -1 d -4 -4 d -3 10 d -4 -7 d -3 1 d -4 3 d -3 -9 d -4 13 d -3 -14 d -4 4 d -4 7 d -3 -2
 d -4 -6 d -3 2 d -4 X -3 5 d -4 4 d -3 -2 d -4 3 d -4 -6 d -3 -10 d -4 3 d -3 -1 d -4 11 d -3 5 d -4 -2 d -3 4 d -4 -9 d -4 -66 d -369 X FA 3 lw 0.8 0.8 0 c 1 1 1 c 1 1 0 c 0.8 0.8 0 c 245 322 m 267 X 1 Y 7 X -1 Y 3 X 3 Y 4 X 3 Y 3 X 5 Y 4 X 6 Y 3 X
 4 Y 4 X 5 Y 4 X 3 Y 3 X 4 Y 4 X -1 Y 3 X 4 Y 4 X -1 Y 3 X -5 Y 4 X 7 Y 3 X -2 Y 4 X 2 Y 4 X 3 Y 3 X 3 Y 4 X -6 Y 3 X 2 Y 4 X -5 Y 3 X 6 Y 4 X -3 Y 3 X -1 Y 4 X 1 Y 4 X 1 Y 3 X -4 Y 4 X 1 Y 3 X 2 Y 4 X 5 Y 3 X -2 Y 4 X 1 Y 3 X -3 Y 4 X -6 Y 4 X 1 Y 3
 X -2 Y 4 X 5 Y 3 X 4 Y 4 X -2 Y 3 X 1 Y 4 X -2 Y 3 X -3 Y 4 X 1 Y 4 X -2 Y 3 X 3 Y 4 X 2 Y 3 X -4 Y 4 X -3 Y 3 X 9 Y 4 X -8 Y 3 X 5 Y 4 X -1 Y 4 X -1 Y 3 X 4 Y 4 X -5 Y 3 X 2 Y 7 X -2 Y 4 X 3 Y 7 X -2 Y 4 X 2 Y 3 X -2 Y 7 X 1 Y 4 X 2 Y 3 X 1 Y 4 X
 -4 Y 4 X 6 Y 3 X -1 Y 4 X 1 Y 3 X 3 Y 4 X -1 Y 3 X 1 Y 4 X -3 Y 7 X 2 Y 4 X 5 Y 3 X 1 Y 4 X -1 Y 3 X 2 Y 4 X 1 Y 3 X 2 Y 4 X 3 Y 3 X -4 Y 4 X -1 Y 4 X 6 Y 3 X -1 Y 4 X 2 Y 3 X 1 Y 4 X 5 Y 3 X 1 Y 4 X -2 Y 3 X 7 Y 8 X 5 Y 3 X 8 Y 4 X -1 Y 3 X 7 Y 7 X
 4 Y 4 X 2 Y 3 X 10 Y 4 X 3 Y 4 X -5 Y 3 X 10 Y 4 X 7 Y 7 X 11 Y 3 X 1 Y 4 X 1 Y 3 X -4 Y 4 X 12 Y 4 X -2 Y 3 X 16 Y 4 X -1 Y 3 X 1 Y 4 X 2 Y 3 X -4 Y 4 X 8 Y 3 X 6 Y 4 X 3 Y 4 X 7 Y 3 X -1 Y 4 X 3 Y 3 X -1 Y 4 X 16 Y 3 X -2 Y 4 X 5 Y 3 X 4 Y 4 X 1 Y
 4 X 10 Y 3 X 1 Y 7 X 6 Y 4 X 18 Y 3 X 4 Y 4 X 6 Y 3 X -6 Y 4 X 4 Y 7 X 11 Y 4 X 6 Y 3 X 3 Y 4 X 10 Y 3 X 1 Y 4 X 12 Y 3 X 9 Y 4 X 3 Y 4 X 3 Y 3 X 4 Y 4 X 5 Y 3 X 7 Y 4 X 7 Y 3 X 7 Y 4 X 10 Y 3 X 6 Y 4 X 8 Y 4 X 15 Y 3 X 2 Y 4 X 2 Y 3 X 14 Y 4 X 3 Y
 3 X 14 Y 4 X 2 Y 3 X 9 Y 4 X 7 Y 4 X 15 Y 3 X 10 Y 4 X 12 Y 3 X 16 Y 7 X 17 Y 4 X 11 Y 3 X 20 Y 4 X 9 Y 4 X 18 Y 3 X 6 Y 4 X 17 Y 3 X 17 Y 4 X 9 Y 3 X 19 Y 4 X 17 Y 3 X 16 Y 4 X 16 Y 4 X 16 Y 3 X 25 Y 4 X 13 Y 3 X 17 Y 4 X 19 Y 3 X 25 Y 4 X 28 Y 3 X
 14 Y 4 X 23 Y 4 X 18 Y 3 X 22 Y 4 X 38 Y 3 X 18 Y 4 X 31 Y 3 X 15 Y 4 X 19 Y 3 X 43 Y 4 X 21 Y 4 X 28 Y 3 X 26 Y 4 X 21 Y 3 X 26 Y 4 X 38 Y 3 X 21 Y 4 X 26 Y 3 X 33 Y 4 X 22 Y 4 X 17 Y 3 X 15 Y 4 X 18 Y 3 X 14 Y 4 X 13 Y 3 X 25 Y 4 X -1 Y 3 X 11 Y 4
 X 1 Y 4 X 11 Y 3 X -16 Y 4 X -4 Y 3 X -2 Y 4 X -10 Y 3 X -8 Y 4 X -23 Y 3 X -12 Y 4 X -44 Y 4 X -2 Y 3 X -22 Y 4 X -41 Y 3 X -24 Y 4 X -39 Y 3 X -30 Y 4 X -40 Y 3 X -29 Y 4 X -22 Y 4 X -43 Y 3 X -24 Y 4 X -32 Y 3 X -45 Y 4 X -28 Y 3 X -37 Y 4 X -31
 Y 3 X -29 Y 4 X -40 Y 4 X -12 Y 3 X -34 Y 4 X -37 Y 3 X -21 Y 4 X -21 Y 3 X -28 Y 4 X -34 Y 3 X -16 Y 4 X -17 Y 4 X -24 Y 3 X -22 Y 4 X -11 Y 3 X -22 Y 4 X -24 Y 3 X -18 Y 4 X -13 Y 3 X -12 Y 4 X -30 Y 4 X -2 Y 3 X -10 Y 4 X -17 Y 3 X -9 Y 4 X -12 Y
 3 X -11 Y 4 X -13 Y 3 X -5 Y 4 X -14 Y 4 X -12 Y 3 X -8 Y 4 X -15 Y 3 X -8 Y 4 X -3 Y 3 X -9 Y 4 X -7 Y 3 X -3 Y 4 X -15 Y 4 X -8 Y 3 X -3 Y 4 X -1 Y 3 X -6 Y 4 X -10 Y 3 X -6 Y 4 X -3 Y 3 X -5 Y 4 X -2 Y 4 X -5 Y 3 X -7 Y 4 X -1 Y 3 X -6 Y 7 X -8 Y
 4 X -3 Y 3 X -2 Y 4 X -2 Y 4 X -8 Y 3 X -3 Y 4 X -1 Y 3 X -3 Y 4 X -3 Y 3 X -1 Y 4 X -4 Y 3 X -1 Y 4 X -5 Y 4 X -3 Y 3 X -5 Y 4 X 4 Y 3 X -2 Y 4 X -4 Y 3 X -1 Y 4 X -4 Y 7 X -2 Y 4 X -2 Y 3 X -1 Y 4 X -1 Y 3 X -4 Y 4 X -4 Y 3 X 1 Y 4 X -1 Y 7 X -3 Y
 4 X -1 Y 3 X -1 Y 4 X -2 Y 7 X -2 Y 3 X -3 Y 4 X 2 Y 3 X -2 Y 4 X -3 Y 4 X -2 Y 3 X 2 Y 7 X -1 Y 4 X -1 Y 7 X -1 Y 3 X -2 Y 4 X -3 Y 4 X 1 Y 3 X -3 Y 4 X 2 Y 3 X 1 Y 4 X -2 Y 3 X -1 Y 4 X -2 Y 3 X 1 Y 4 X -1 Y 7 X -2 Y 4 X -1 Y 7 X 1 Y 3 X -2 Y 4 X
 -2 Y 3 X 1 Y 15 X -1 Y 3 X -1 Y 7 X -1 Y 4 X -2 Y 3 X 1 Y 4 X -1 Y 14 X -1 Y 7 X -1 Y 4 X 1 Y 3 X -1 Y 15 X -1 Y 3 X -3 Y 4 X 1 Y 3 X -1 Y 11 X 1 Y 7 X -1 Y 4 X 1 Y 7 X -1 Y 10 X -2 Y 4 X 1 Y 4 X -1 Y 7 X -1 Y 3 X 2 Y 4 X -2 Y 3 X 1 Y 7 X -2 Y 8 X 2
 Y 3 X -2 Y 4 X 1 Y 3 X -1 Y 7 X -1 Y 4 X 1 Y 3 X -1 Y 11 X 1 Y 7 X -1 Y 4 X s 1 1 0 c 247 322 m20 250 322 m20 254 322 m20 257 322 m20 261 322 m20 264 322 m20 268 322 m20 272 322 m20 275 322 m20 279 322 m20 282 322 m20 286 322 m20 289 322 m20 293 322
 m20 296 322 m20 300 322 m20 304 322 m20 307 322 m20 311 322 m20 314 322 m20 318 322 m20 321 322 m20 325 322 m20 328 322 m20 332 322 m20 336 322 m20 339 322 m20 343 322 m20 346 322 m20 350 322 m20 353 322 m20 357 322 m20 360 322 m20 364 322 m20 368
 322 m20 371 322 m20 375 322 m20 378 322 m20 382 322 m20 385 322 m20 389 322 m20 392 322 m20 396 322 m20 400 322 m20 403 322 m20 407 322 m20 410 322 m20 414 322 m20 417 322 m20 421 322 m20 424 322 m20 428 322 m20 432 322 m20 435 322 m20 439 322 m20
 442 322 m20 446 322 m20 449 322 m20 453 322 m20 456 322 m20 460 322 m20 464 322 m20 467 322 m20 471 322 m20 474 322 m20 478 322 m20 481 322 m20 485 322 m20 488 322 m20 492 322 m20 496 322 m20 499 322 m20 503 322 m20 506 322 m20 510 322 m20 513 323
 m20 517 323 m20 520 322 m20 524 325 m20 528 328 m20 531 333 m20 535 339 m20 538 343 m20 542 348 m20 545 351 m20 549 355 m20 552 354 m20 556 358 m20 560 357 m20 563 352 m20 567 359 m20 570 357 m20 574 359 m20 577 362 m20 581 365 m20 584 359 m20 588
 361 m20 592 356 m20 595 362 m20 599 359 m20 602 358 m20 606 359 m20 609 360 m20 613 356 m20 616 357 m20 620 359 m20 624 364 m20 627 362 m20 631 363 m20 634 360 m20 638 354 m20 641 355 m20 645 353 m20 648 358 m20 652 362 m20 656 360 m20 659 361 m20
 663 359 m20 666 356 m20 670 357 m20 673 355 m20 677 358 m20 680 360 m20 684 356 m20 688 353 m20 691 362 m20 695 354 m20 698 359 m20 702 358 m20 705 357 m20 709 361 m20 712 356 m20 716 358 m20 720 358 m20 723 356 m20 727 359 m20 730 359 m20 734 357
 m20 737 359 m20 741 357 m20 745 357 m20 748 358 m20 752 360 m20 755 361 m20 759 357 m20 762 363 m20 766 362 m20 769 363 m20 773 366 m20 777 365 m20 780 366 m20 784 363 m20 787 363 m20 791 365 m20 794 370 m20 798 371 m20 801 370 m20 805 372 m20 809
 373 m20 812 375 m20 816 378 m20 819 374 m20 823 373 m20 826 379 m20 830 378 m20 833 380 m20 837 381 m20 841 386 m20 844 387 m20 848 385 m20 851 392 m20 855 392 m20 858 397 m20 862 405 m20 865 404 m20 869 411 m20 873 411 m20 876 415 m20 880 417 m20
 883 427 m20 887 430 m20 890 425 m20 894 435 m20 897 442 m20 901 442 m20 905 453 m20 908 454 m20 912 455 m20 915 451 m20 919 463 m20 922 461 m20 926 477 m20 929 476 m20 933 477 m20 937 479 m20 940 475 m20 944 483 m20 947 489 m20 951 492 m20 954 499
 m20 958 498 m20 961 501 m20 965 500 m20 969 516 m20 972 514 m20 976 519 m20 979 523 m20 983 524 m20 986 534 m20 990 535 m20 993 535 m20 997 541 m20 1001 559 m20 1004 563 m20 1008 569 m20 1011 563 m20 1015 567 m20 1018 567 m20 1022 578 m20 1025 584
 m20 1029 587 m20 1033 597 m20 1036 598 m20 1040 610 m20 1043 619 m20 1047 622 m20 1050 625 m20 1054 629 m20 1057 634 m20 1061 641 m20 1065 648 m20 1068 655 m20 1072 665 m20 1075 671 m20 1079 679 m20 1082 694 m20 1086 696 m20 1089 698 m20 1093 712
 m20 1097 715 m20 1100 729 m20 1104 731 m20 1107 740 m20 1111 747 m20 1114 762 m20 1118 772 m20 1121 784 m20 1125 800 m20 1129 800 m20 1132 817 m20 1136 828 m20 1139 848 m20 1143 857 m20 1146 875 m20 1150 881 m20 1153 898 m20 1157 915 m20 1161 924
 m20 1164 943 m20 1168 960 m20 1171 976 m20 1175 992 m20 1178 1008 m20 1182 1033 m20 1185 1046 m20 1189 1063 m20 1193 1082 m20 1196 1107 m20 1200 1135 m20 1203 1149 m20 1207 1172 m20 1210 1190 m20 1214 1212 m20 1217 1250 m20 1221 1268 m20 1225 1299
 m20 1228 1314 m20 1232 1333 m20 1235 1376 m20 1239 1397 m20 1242 1425 m20 1246 1451 m20 1249 1472 m20 1253 1498 m20 1257 1536 m20 1260 1557 m20 1264 1583 m20 1267 1616 m20 1271 1638 m20 1274 1655 m20 1278 1670 m20 1281 1688 m20 1285 1702 m20 1289
 1715 m20 1292 1740 m20 1296 1739 m20 1299 1750 m20 1303 1751 m20 1306 1762 m20 1310 1746 m20 1313 1742 m20 1317 1740 m20 1321 1730 m20 1324 1722 m20 1328 1699 m20 1331 1687 m20 1335 1643 m20 1338 1641 m20 1342 1619 m20 1345 1578 m20 1349 1554 m20
 1353 1515 m20 1356 1485 m20 1360 1445 m20 1363 1416 m20 1367 1394 m20 1370 1351 m20 1374 1327 m20 1377 1295 m20 1381 1250 m20 1385 1222 m20 1388 1185 m20 1392 1154 m20 1395 1125 m20 1399 1085 m20 1402 1073 m20 1406 1039 m20 1409 1002 m20 1413 981
 m20 1417 960 m20 1420 932 m20 1424 898 m20 1427 882 m20 1431 865 m20 1434 841 m20 1438 819 m20 1441 808 m20 1445 786 m20 1449 762 m20 1452 744 m20 1456 731 m20 1459 719 m20 1463 689 m20 1466 687 m20 1470 677 m20 1473 660 m20 1477 651 m20 1481 639
 m20 1484 628 m20 1488 615 m20 1491 610 m20 1495 596 m20 1498 584 m20 1502 576 m20 1505 561 m20 1509 553 m20 1513 550 m20 1516 541 m20 1520 534 m20 1523 531 m20 1527 516 m20 1530 508 m20 1534 505 m20 1537 504 m20 1541 498 m20 1545 488 m20 1548 482
 m20 1552 479 m20 1555 474 m20 1559 472 m20 1562 467 m20 1566 460 m20 1569 459 m20 1573 453 m20 1577 453 m20 1580 445 m20 1584 442 m20 1587 440 m20 1591 438 m20 1594 430 m20 1598 427 m20 1601 426 m20 1605 423 m20 1609 420 m20 1612 419 m20 1616 415
 m20 1619 414 m20 1623 409 m20 1626 406 m20 1630 401 m20 1633 405 m20 1637 403 m20 1641 399 m20 1644 398 m20 1648 394 m20 1651 394 m20 1655 392 m20 1658 390 m20 1662 389 m20 1665 388 m20 1669 384 m20 1673 380 m20 1676 381 m20 1680 380 m20 1683 380
 m20 1687 377 m20 1690 376 m20 1694 375 m20 1697 373 m20 1701 373 m20 1705 371 m20 1708 368 m20 1712 370 m20 1715 368 m20 1719 365 m20 1722 363 m20 1726 365 m20 1729 365 m20 1733 364 m20 1737 363 m20 1740 363 m20 1744 362 m20 1747 360 m20 1751 357
 m20 1754 358 m20 1758 355 m20 1761 357 m20 1765 358 m20 1769 356 m20 1772 355 m20 1776 353 m20 1779 354 m20 1783 353 m20 1786 353 m20 1790 351 m20 1793 350 m20 1797 350 m20 1801 351 m20 1804 349 m20 1808 347 m20 1811 348 m20 1815 348 m20 1818 348
 m20 1822 348 m20 1825 347 m20 1829 346 m20 1833 346 m20 1836 345 m20 1840 343 m20 1843 344 m20 1847 343 m20 1850 343 m20 1854 343 m20 1857 343 m20 1861 342 m20 1865 342 m20 1868 341 m20 1872 342 m20 1875 341 m20 1879 341 m20 1882 341 m20 1886 341
 m20 1889 340 m20 1893 337 m20 1897 338 m20 1900 337 m20 1904 337 m20 1907 337 m20 1911 338 m20 1914 338 m20 1918 337 m20 1921 338 m20 1925 338 m20 1929 337 m20 1932 337 m20 1936 337 m20 1939 335 m20 1943 336 m20 1946 335 m20 1950 335 m20 1953 334
 m20 1957 336 m20 1961 334 m20 1964 335 m20 1968 335 m20 1971 333 m20 1975 333 m20 1978 335 m20 1982 333 m20 1985 334 m20 1989 333 m20 1993 333 m20 1996 332 m20 2000 333 m20 2003 332 m20 2007 332 m20 2010 332 m20 2014 333 m20 2017 333 m20 2021 332
 m20 0.8 0.8 0 c black 0.8 0.8 0 c cs 0.8 0.8 0 P13 setcolor 247 322 m 263 X 3 1 d 4 1 d 3 -1 d 4 3 d 4 3 d 3 6 d 4 7 d 3 4 d 4 5 d 3 3 d 4 5 d 3 -2 d 4 5 d 4 -1 d 3 -5 d 4 7 d 3 -2 d 4 2 d 3 4 d 4 2 d 3 -6 d 4 2 d 4 -5 d 3 6 d 4 -3 d 3 -1 d 4 1 d 3
 1 d 4 -4 d 3 X 4 3 d 4 5 d 3 -2 d 4 1 d 3 -3 d 4 -6 d 3 X 4 -2 d 3 6 d 4 4 d 4 -2 d 3 1 d 4 -2 d 3 -3 d 4 X 3 -2 d 4 4 d 3 1 d 4 -4 d 4 -3 d 3 9 d 4 -8 d 3 5 d 4 -1 d 3 -1 d 4 4 d 3 -5 d 4 2 d 4 X 3 -2 d 4 3 d 3 1 d 4 -3 d 3 2 d 4 -3 d 4 1 d 3 1 d 4
 2 d 3 1 d 4 -4 d 3 6 d 4 -1 d 3 1 d 4 3 d 4 -1 d 3 2 d 4 -4 d 3 X 4 2 d 3 5 d 4 1 d 3 X 4 1 d 4 1 d 3 3 d 4 3 d 3 -5 d 4 X 3 5 d 4 -1 d 3 3 d 4 X 4 6 d 3 X 4 -2 d 3 8 d 4 -1 d 3 6 d 4 8 d 3 -2 d 4 9 d 4 -1 d 3 5 d 4 2 d 3 9 d 4 3 d 3 -4 d 4 9 d 3 8
 d 4 X 4 11 d 3 1 d 4 1 d 3 -3 d 4 11 d 3 -2 d 4 17 d 3 -1 d 4 1 d 4 1 d 3 -4 d 4 9 d 3 5 d 4 2 d 3 7 d 4 -2 d 3 3 d 4 X 4 17 d 3 -3 d 4 6 d 3 4 d 4 1 d 3 10 d 4 1 d 3 X 4 7 d 4 17 d 3 5 d 4 5 d 3 -6 d 4 4 d 3 X 4 11 d 3 6 d 4 3 d 4 10 d 3 1 d 4 12 d
 3 9 d 4 4 d 3 2 d 4 5 d 3 4 d 4 8 d 4 6 d 3 7 d 4 11 d 3 5 d 4 9 d 3 15 d 4 2 d 3 1 d 4 14 d 4 4 d 3 13 d 4 3 d 3 9 d 4 7 d 3 15 d 4 10 d 3 12 d 4 16 d 4 X 3 17 d 4 11 d 3 21 d 4 9 d 3 17 d 4 7 d 3 17 d 4 17 d 4 8 d 3 19 d 4 18 d 3 16 d 4 16 d 3 16
 d 4 25 d 3 13 d 4 17 d 4 19 d 3 25 d 4 28 d 3 14 d 4 23 d 3 18 d 4 22 d 3 39 d 4 17 d 4 32 d 3 15 d 4 19 d 3 43 d 4 21 d 3 28 d 4 26 d 3 21 d 4 26 d 4 39 d 3 20 d 4 27 d 3 33 d 4 21 d 3 18 d 4 14 d 3 19 d 4 14 d 4 12 d 3 26 d 4 -1 d 3 10 d 4 1 d 3
 11 d 4 -15 d 3 -4 d 4 -3 d 4 -9 d 3 -8 d 4 -23 d 3 -13 d 4 -44 d 3 -2 d 4 -22 d 3 -41 d 4 -24 d 4 -40 d 3 -30 d 4 -40 d 3 -28 d 4 -22 d 3 -44 d 4 -24 d 3 -32 d 4 -46 d 4 -27 d 3 -37 d 4 -31 d 3 -30 d 4 -40 d 3 -12 d 4 -34 d 3 -37 d 4 -22 d 4 -21 d 3
 -28 d 4 -34 d 3 -16 d 4 -17 d 3 -24 d 4 -23 d 3 -11 d 4 -21 d 4 -24 d 3 -19 d 4 -12 d 3 -13 d 4 -30 d 3 -2 d 4 -10 d 3 -18 d 4 -9 d 4 -11 d 3 -12 d 4 -13 d 3 -5 d 4 -13 d 3 -12 d 4 -8 d 3 -16 d 4 -8 d 4 -3 d 3 -9 d 4 -7 d 3 -3 d 4 -15 d 3 -9 d 4 -2
 d 3 -2 d 4 -5 d 4 -11 d 3 -5 d 4 -3 d 3 -6 d 4 -1 d 3 -5 d 4 -7 d 3 -2 d 4 -6 d 4 X 3 -8 d 4 -3 d 3 -2 d 4 -2 d 3 -8 d 4 -3 d 3 -1 d 4 -3 d 4 -3 d 3 -1 d 4 -4 d 3 -2 d 4 -4 d 3 -3 d 4 -5 d 3 3 d 4 -2 d 4 -3 d 3 -1 d 4 -4 d 3 X 4 -2 d 3 -3 d 4 X 3 -2
 d 4 -4 d 4 -4 d 3 2 d 4 -2 d 3 1 d 4 -3 d 3 -2 d 4 -1 d 3 -2 d 4 X 4 -2 d 3 -3 d 4 3 d 3 -2 d 4 -4 d 3 -1 d 4 1 d 3 X 4 -1 d 4 -1 d 3 X 4 -1 d 3 -2 d 4 -3 d 3 1 d 4 -2 d 3 1 d 4 1 d 4 -2 d 3 -1 d 4 -2 d 3 1 d 4 -2 d 3 1 d 4 -2 d 3 -1 d 4 X 4 1 d 3
 -2 d 4 -3 d 3 2 d 11 X 3 -2 d 8 X 3 -1 d 4 -2 d 3 1 d 4 -1 d 10 X 4 -1 d 4 X 3 -1 d 4 1 d 3 -1 d 11 X 3 -1 d 4 -3 d 4 1 d 3 -2 d 4 1 d 3 -1 d 4 2 d 3 X 4 -1 d 3 1 d 4 X 4 -1 d 3 -1 d 4 1 d 3 -2 d 4 X 3 -1 d 4 1 d 3 -1 d 4 1 d 4 -1 d 3 1 d 4 X 3 -2 d
 4 X 3 1 d 4 -1 d 3 1 d 4 -2 d 4 1 d 3 -1 d 21 X 4 -1 d -1 Y -4 1 d -3 X -4 -1 d -3 X -4 1 d -14 X -4 1 d -3 -1 d -4 2 d -3 -1 d -4 X -3 1 d -4 1 d -3 -1 d -4 1 d -4 -1 d -3 1 d -4 -1 d -3 1 d -4 X -3 1 d -7 X -4 1 d -4 1 d -3 -2 d -4 1 d -3 X -4 -1
 d -3 1 d -4 -1 d -3 1 d -4 -1 d -4 3 d -3 1 d -11 X -3 1 d -4 -1 d -3 1 d -4 X -4 1 d -7 X -3 1 d -4 X -3 -1 d -4 2 d -3 1 d -4 1 d -4 X -3 1 d -4 1 d -3 -1 d -4 X -3 -1 d -4 2 d -3 2 d -4 -1 d -4 X -3 1 d -4 2 d -3 X -4 1 d -3 -1 d -4 2 d -3 1 d -4
 2 d -4 -1 d -3 -2 d -4 3 d -3 -1 d -4 3 d -3 2 d -4 1 d -3 X -4 1 d -4 X -3 1 d -4 -2 d -3 2 d -4 3 d -3 2 d -4 -2 d -3 3 d -4 1 d -4 1 d -3 1 d -4 2 d -3 1 d -4 3 d -3 X -4 1 d -3 -2 d -4 4 d -4 4 d -3 2 d -4 X -3 3 d -4 2 d -3 -1 d -4 5 d -3 X -4
 4 d -4 2 d -3 -3 d -4 4 d -3 4 d -4 4 d -3 2 d -4 3 d -3 2 d -4 2 d -4 3 d -3 1 d -4 3 d -3 8 d -4 2 d -3 2 d -4 3 d -3 8 d -4 X -4 6 d -3 1 d -4 7 d -3 5 d -4 2 d -3 5 d -4 3 d -3 5 d -4 11 d -4 5 d -3 2 d -4 2 d -3 9 d -4 14 d -3 3 d -4 7 d -3 9 d
 -4 3 d -4 8 d -3 15 d -4 8 d -3 12 d -4 13 d -3 6 d -4 12 d -3 11 d -4 12 d -4 9 d -3 17 d -4 10 d -3 2 d -4 30 d -3 12 d -4 12 d -3 19 d -4 24 d -4 21 d -3 11 d -4 22 d -3 24 d -4 17 d -3 16 d -4 34 d -3 28 d -4 20 d -4 22 d -3 36 d -4 34 d -3 12 d
 -4 40 d -3 29 d -4 31 d -3 37 d -4 27 d -4 45 d -3 32 d -4 24 d -3 43 d -4 22 d -3 28 d -4 40 d -3 30 d -4 39 d -4 24 d -3 41 d -4 22 d -3 2 d -4 43 d -3 13 d -4 23 d -3 8 d -4 9 d -4 3 d -3 3 d -4 16 d -3 -11 d -4 -1 d -3 -10 d -4 X -3 -25 d -4 -12
 d -4 -14 d -3 -19 d -4 -14 d -3 -18 d -4 -21 d -3 -33 d -4 -27 d -3 -20 d -4 -39 d -4 -25 d -3 -21 d -4 -26 d -3 -28 d -4 -21 d -3 -43 d -4 -18 d -3 -15 d -4 -32 d -4 -18 d -3 -38 d -4 -22 d -3 -18 d -4 -23 d -3 -13 d -4 -29 d -3 -24 d -4 -19 d -4
 -17 d -3 -13 d -4 -25 d -3 -16 d -4 -16 d -3 -16 d -4 -17 d -3 -19 d -4 -8 d -4 -17 d -3 -17 d -4 -6 d -3 -18 d -4 -9 d -3 -20 d -4 -11 d -3 -17 d -4 X -4 -16 d -3 -12 d -4 -10 d -3 -15 d -4 -7 d -3 -8 d -4 -3 d -3 -13 d -4 -4 d -4 -14 d -3 -2 d -4
 -2 d -3 -14 d -4 -9 d -3 -5 d -4 -11 d -3 -6 d -4 -7 d -4 -8 d -3 -4 d -4 -5 d -3 -2 d -4 -4 d -3 -9 d -4 -12 d -3 X -4 -10 d -4 -3 d -3 -6 d -4 -11 d -3 X -4 -4 d -3 6 d -4 -6 d -3 -5 d -4 -17 d -4 -6 d -3 X -4 -1 d -3 -10 d -4 -1 d -3 -4 d -4 -5 d
 -3 3 d -4 -15 d -4 X -3 -3 d -4 2 d -3 -7 d -4 -5 d -3 -7 d -4 -8 d -3 4 d -4 -2 d -4 -1 d -3 1 d -4 -16 d -3 2 d -4 -11 d -3 3 d -4 -1 d -3 X -4 -11 d -4 X -3 -7 d -4 -9 d -3 4 d -4 -3 d -3 -9 d -4 -2 d -3 -4 d -4 X -4 -7 d -3 1 d -4 -7 d -3 -6 d
 -4 X -3 -7 d -4 2 d -3 X -4 -6 d -4 X -3 -3 d -4 1 d -3 -5 d -4 1 d -3 3 d -4 -2 d -3 -3 d -4 X -4 -2 d -3 1 d -4 -1 d -3 -5 d -4 -2 d -3 1 d -4 2 d -3 -1 d -4 1 d -4 -3 d -7 X -3 -6 d -4 5 d -3 -2 d -4 -1 d -3 -2 d -4 X -4 2 d -3 -2 d -4 2 d -3 X
 -4 -3 d -3 2 d -4 X -4 -2 d -3 5 d -4 -4 d -3 X -4 2 d -3 -5 d -4 7 d -3 -7 d -4 2 d -4 3 d -3 -1 d -4 -3 d -3 1 d -4 X -3 3 d -4 2 d -3 -1 d -4 1 d -4 -3 d -3 -5 d -4 1 d -3 X -4 6 d -3 2 d -4 -1 d -3 2 d -4 -5 d -4 -2 d -3 X -4 3 d -3 -2 d -4 X -3
 1 d -4 3 d -3 -6 d -4 5 d -4 -2 d -3 5 d -4 -2 d -3 -3 d -4 -3 d -3 3 d -4 -6 d -3 4 d -4 X -4 -3 d -3 1 d -4 -4 d -3 -3 d -4 -4 d -3 -3 d -4 -6 d -3 -4 d -4 -3 d -4 -2 d -3 1 d -4 -1 d -266 X FA black 1 1 1 c black 245 322 m 373 X 52 Y 4 X 7 Y 3 X
 -3 Y 4 X 1 Y 3 X -4 Y 4 X -8 Y 4 X 1 Y 3 X -3 Y 4 X 8 Y 3 X 5 Y 4 X -3 Y 3 X 2 Y 4 X -3 Y 3 X -4 Y 8 X -2 Y 3 X 5 Y 4 X 1 Y 3 X -5 Y 4 X -3 Y 3 X 11 Y 4 X -10 Y 3 X 7 Y 4 X -3 Y 7 X 5 Y 4 X -8 Y 3 X 3 Y 4 X 1 Y 3 X -4 Y 4 X 4 Y 3 X 2 Y 4 X -4 Y 4 X
 3 Y 3 X -4 Y 4 X 1 Y 3 X 2 Y 4 X 1 Y 3 X 3 Y 4 X -6 Y 4 X 8 Y 3 X -1 Y 4 X 1 Y 3 X 4 Y 4 X -1 Y 3 X 1 Y 4 X -4 Y 7 X 2 Y 4 X 7 Y 3 X 1 Y 4 X -1 Y 3 X 1 Y 4 X 2 Y 3 X 3 Y 4 X 4 Y 3 X -6 Y 4 X -1 Y 4 X 7 Y 3 X -2 Y 4 X 4 Y 7 X 8 Y 7 X -3 Y 3 X 9 Y 4 X
 -1 Y 4 X 8 Y 3 X 10 Y 4 X -2 Y 3 X 9 Y 7 X 5 Y 4 X 3 Y 3 X 12 Y 4 X 4 Y 4 X -7 Y 3 X 12 Y 4 X 11 Y 3 X -1 Y 4 X 14 Y 3 X -1 Y 4 X 3 Y 3 X -5 Y 4 X 14 Y 4 X -3 Y 3 X 23 Y 4 X -3 Y 3 X 1 Y 4 X 1 Y 3 X -4 Y 4 X 11 Y 3 X 6 Y 4 X 4 Y 4 X 8 Y 3 X -1 Y 4 X
 3 Y 3 X -1 Y 4 X 20 Y 3 X -3 Y 4 X 6 Y 3 X 4 Y 4 X 2 Y 4 X 11 Y 3 X 1 Y 7 X 7 Y 4 X 22 Y 3 X 4 Y 4 X 8 Y 3 X -10 Y 4 X 7 Y 4 X -2 Y 3 X 14 Y 4 X 6 Y 3 X 3 Y 4 X 13 Y 7 X 14 Y 3 X 9 Y 4 X 5 Y 7 X 7 Y 4 X 4 Y 3 X 11 Y 4 X 5 Y 3 X 9 Y 4 X 11 Y 3 X 6 Y
 4 X 9 Y 4 X 16 Y 3 X 2 Y 4 X 2 Y 3 X 15 Y 4 X 4 Y 3 X 14 Y 4 X 3 Y 3 X 10 Y 4 X 6 Y 4 X 16 Y 3 X 12 Y 4 X 11 Y 3 X 16 Y 4 X 2 Y 3 X 18 Y 4 X 10 Y 3 X 24 Y 4 X 9 Y 4 X 18 Y 3 X 6 Y 4 X 20 Y 3 X 15 Y 4 X 7 Y 3 X 23 Y 4 X 19 Y 3 X 11 Y 4 X 20 Y 4 X 20
 Y 3 X 22 Y 4 X 15 Y 3 X 16 Y 4 X 18 Y 3 X 28 Y 4 X 24 Y 3 X 16 Y 4 X 23 Y 4 X 17 Y 3 X 23 Y 4 X 41 Y 3 X 15 Y 4 X 31 Y 3 X 14 Y 4 X 18 Y 3 X 43 Y 4 X 19 Y 4 X 23 Y 3 X 28 Y 4 X 20 Y 3 X 24 Y 4 X 40 Y 3 X 19 Y 4 X 24 Y 3 X 30 Y 4 X 18 Y 4 X 10 Y 3 X
 16 Y 4 X 14 Y 3 X 12 Y 4 X 9 Y 3 X 21 Y 4 X -5 Y 3 X 8 Y 4 X -1 Y 4 X 5 Y 3 X -25 Y 4 X -8 Y 3 X -6 Y 4 X -12 Y 3 X -10 Y 4 X -28 Y 3 X -15 Y 4 X -52 Y 4 X -6 Y 3 X -26 Y 4 X -47 Y 3 X -27 Y 4 X -39 Y 3 X -36 Y 4 X -45 Y 3 X -29 Y 4 X -25 Y 4 X -45
 Y 3 X -23 Y 4 X -34 Y 3 X -51 Y 4 X -28 Y 3 X -36 Y 4 X -30 Y 3 X -32 Y 4 X -43 Y 4 X -12 Y 3 X -37 Y 4 X -36 Y 3 X -22 Y 4 X -18 Y 3 X -30 Y 4 X -33 Y 3 X -16 Y 4 X -19 Y 4 X -22 Y 3 X -20 Y 4 X -14 Y 3 X -19 Y 4 X -23 Y 3 X -18 Y 4 X -12 Y 3 X -14
 Y 4 X -28 Y 4 X -2 Y 3 X -12 Y 4 X -15 Y 3 X -9 Y 4 X -11 Y 3 X -14 Y 4 X -9 Y 3 X -7 Y 4 X -9 Y 4 X -13 Y 3 X -8 Y 4 X -15 Y 3 X -4 Y 4 X -6 Y 3 X -10 Y 4 X -6 Y 3 X -2 Y 4 X -11 Y 4 X -8 Y 3 X -2 Y 4 X -2 Y 3 X -6 Y 4 X -10 Y 3 X -5 Y 4 X -2 Y 3 X
 -4 Y 4 X -3 Y 4 X -3 Y 3 X -7 Y 4 X -1 Y 3 X -7 Y 7 X -5 Y 4 X -3 Y 3 X -2 Y 4 X -2 Y 4 X -7 Y 3 X -3 Y 4 X -1 Y 3 X -3 Y 4 X -2 Y 3 X -1 Y 4 X -4 Y 7 X -4 Y 4 X -4 Y 3 X -2 Y 4 X 1 Y 3 X -1 Y 4 X -3 Y 3 X -1 Y 4 X -3 Y 3 X 1 Y 4 X -3 Y 4 X -1 Y 3 X
 -1 Y 4 X -1 Y 3 X -4 Y 4 X -2 Y 7 X -1 Y 7 X -2 Y 4 X -1 Y 3 X -1 Y 4 X -1 Y 7 X -2 Y 3 X -1 Y 7 X -1 Y 4 X -2 Y 4 X -1 Y 3 X 1 Y 4 X -1 Y 7 X -1 Y 3 X -1 Y 4 X 1 Y 3 X -2 Y 4 X -3 Y 4 X 1 Y 3 X -2 Y 4 X 1 Y 3 X 1 Y 4 X -2 Y 7 X -1 Y 3 X 1 Y 4 X -2
 Y 7 X -1 Y 7 X -1 Y 4 X 1 Y 3 X -2 Y 4 X -2 Y 3 X 1 Y 4 X 1 Y 11 X -1 Y 3 X -1 Y 7 X -1 Y 4 X -1 Y 3 X 1 Y 8 X -1 Y 3 X 1 Y 7 X -2 Y 7 X 1 Y 7 X -1 Y 15 X -1 Y 3 X -2 Y 4 X 1 Y 3 X -1 Y 4 X 1 Y 3 X -1 Y 4 X 1 Y 7 X -1 Y 4 X 1 Y 3 X 1 Y 4 X -1 Y 7 X
 -1 Y 3 X -1 Y 15 X -1 Y 3 X 2 Y 4 X -2 Y 3 X 1 Y 7 X -1 Y 4 X 1 Y 7 X -1 Y 7 X -1 Y 4 X 1 Y 3 X -1 Y 11 X -1 Y 4 X 1 Y 3 X 1 Y 11 X s 247 322 m20 250 322 m20 254 322 m20 257 322 m20 261 322 m20 264 322 m20 268 322 m20 272 322 m20 275 322 m20 279 322
 m20 282 322 m20 286 322 m20 289 322 m20 293 322 m20 296 322 m20 300 322 m20 304 322 m20 307 322 m20 311 322 m20 314 322 m20 318 322 m20 321 322 m20 325 322 m20 328 322 m20 332 322 m20 336 322 m20 339 322 m20 343 322 m20 346 322 m20 350 322 m20 353
 322 m20 357 322 m20 360 322 m20 364 322 m20 368 322 m20 371 322 m20 375 322 m20 378 322 m20 382 322 m20 385 322 m20 389 322 m20 392 322 m20 396 322 m20 400 322 m20 403 322 m20 407 322 m20 410 322 m20 414 322 m20 417 322 m20 421 322 m20 424 322 m20
 428 322 m20 432 322 m20 435 322 m20 439 322 m20 442 322 m20 446 322 m20 449 322 m20 453 322 m20 456 322 m20 460 322 m20 464 322 m20 467 322 m20 471 322 m20 474 322 m20 478 322 m20 481 322 m20 485 322 m20 488 322 m20 492 322 m20 496 322 m20 499 322
 m20 503 322 m20 506 322 m20 510 322 m20 513 322 m20 517 322 m20 520 322 m20 524 322 m20 528 322 m20 531 322 m20 535 322 m20 538 322 m20 542 322 m20 545 322 m20 549 322 m20 552 322 m20 556 322 m20 560 322 m20 563 322 m20 567 322 m20 570 322 m20 574
 322 m20 577 322 m20 581 322 m20 584 322 m20 588 322 m20 592 322 m20 595 322 m20 599 322 m20 602 322 m20 606 322 m20 609 322 m20 613 322 m20 616 322 m20 620 374 m20 624 381 m20 627 378 m20 631 379 m20 634 375 m20 638 367 m20 641 368 m20 645 365 m20
 648 373 m20 652 378 m20 656 375 m20 659 377 m20 663 374 m20 666 370 m20 670 370 m20 673 368 m20 677 373 m20 680 374 m20 684 369 m20 688 366 m20 691 377 m20 695 367 m20 698 374 m20 702 371 m20 705 371 m20 709 376 m20 712 368 m20 716 371 m20 720 372
 m20 723 368 m20 727 372 m20 730 374 m20 734 370 m20 737 373 m20 741 369 m20 745 370 m20 748 372 m20 752 373 m20 755 376 m20 759 370 m20 762 378 m20 766 377 m20 769 378 m20 773 382 m20 777 381 m20 780 382 m20 784 378 m20 787 378 m20 791 380 m20 794
 387 m20 798 388 m20 801 387 m20 805 388 m20 809 390 m20 812 393 m20 816 397 m20 819 391 m20 823 390 m20 826 397 m20 830 395 m20 833 399 m20 837 399 m20 841 407 m20 844 407 m20 848 404 m20 851 413 m20 855 412 m20 858 420 m20 862 430 m20 865 428 m20
 869 437 m20 873 437 m20 876 442 m20 880 445 m20 883 457 m20 887 461 m20 890 454 m20 894 466 m20 897 477 m20 901 476 m20 905 490 m20 908 489 m20 912 492 m20 915 487 m20 919 501 m20 922 498 m20 926 521 m20 929 518 m20 933 519 m20 937 520 m20 940 516
 m20 944 527 m20 947 533 m20 951 537 m20 954 545 m20 958 544 m20 961 547 m20 965 546 m20 969 566 m20 972 563 m20 976 569 m20 979 573 m20 983 575 m20 986 586 m20 990 587 m20 993 587 m20 997 594 m20 1001 616 m20 1004 620 m20 1008 628 m20 1011 618 m20
 1015 625 m20 1018 623 m20 1022 637 m20 1025 643 m20 1029 646 m20 1033 659 m20 1036 659 m20 1040 673 m20 1043 682 m20 1047 687 m20 1050 687 m20 1054 694 m20 1057 698 m20 1061 709 m20 1065 714 m20 1068 723 m20 1072 734 m20 1075 740 m20 1079 749 m20
 1082 765 m20 1086 767 m20 1089 769 m20 1093 784 m20 1097 788 m20 1100 802 m20 1104 805 m20 1107 815 m20 1111 821 m20 1114 837 m20 1118 849 m20 1121 860 m20 1125 876 m20 1129 878 m20 1132 896 m20 1136 906 m20 1139 930 m20 1143 939 m20 1146 957 m20
 1150 963 m20 1153 983 m20 1157 998 m20 1161 1005 m20 1164 1028 m20 1168 1047 m20 1171 1058 m20 1175 1078 m20 1178 1098 m20 1182 1120 m20 1185 1135 m20 1189 1151 m20 1193 1169 m20 1196 1197 m20 1200 1221 m20 1203 1237 m20 1207 1260 m20 1210 1277 m20
 1214 1300 m20 1217 1341 m20 1221 1356 m20 1225 1387 m20 1228 1401 m20 1232 1419 m20 1235 1462 m20 1239 1481 m20 1242 1504 m20 1246 1532 m20 1249 1552 m20 1253 1576 m20 1257 1616 m20 1260 1635 m20 1264 1659 m20 1267 1689 m20 1271 1707 m20 1274 1717
 m20 1278 1733 m20 1281 1747 m20 1285 1759 m20 1289 1768 m20 1292 1789 m20 1296 1784 m20 1299 1792 m20 1303 1791 m20 1306 1796 m20 1310 1771 m20 1313 1763 m20 1317 1757 m20 1321 1745 m20 1324 1735 m20 1328 1707 m20 1331 1692 m20 1335 1640 m20 1338
 1634 m20 1342 1608 m20 1345 1561 m20 1349 1534 m20 1353 1495 m20 1356 1459 m20 1360 1414 m20 1363 1385 m20 1367 1360 m20 1370 1315 m20 1374 1292 m20 1377 1258 m20 1381 1207 m20 1385 1179 m20 1388 1143 m20 1392 1113 m20 1395 1081 m20 1399 1038 m20
 1402 1026 m20 1406 989 m20 1409 953 m20 1413 931 m20 1417 913 m20 1420 883 m20 1424 850 m20 1427 834 m20 1431 815 m20 1434 793 m20 1438 773 m20 1441 759 m20 1445 740 m20 1449 717 m20 1452 699 m20 1456 687 m20 1459 673 m20 1463 645 m20 1466 643 m20
 1470 631 m20 1473 616 m20 1477 607 m20 1481 596 m20 1484 582 m20 1488 573 m20 1491 566 m20 1495 557 m20 1498 544 m20 1502 536 m20 1505 521 m20 1509 517 m20 1513 511 m20 1516 501 m20 1520 495 m20 1523 493 m20 1527 482 m20 1530 474 m20 1534 472 m20
 1537 470 m20 1541 464 m20 1545 454 m20 1548 449 m20 1552 447 m20 1555 443 m20 1559 440 m20 1562 437 m20 1566 430 m20 1569 429 m20 1573 422 m20 1577 422 m20 1580 417 m20 1584 414 m20 1587 412 m20 1591 410 m20 1594 403 m20 1598 400 m20 1601 399 m20
 1605 396 m20 1609 394 m20 1612 393 m20 1616 389 m20 1619 389 m20 1623 385 m20 1626 381 m20 1630 379 m20 1633 380 m20 1637 379 m20 1641 376 m20 1644 375 m20 1648 372 m20 1651 373 m20 1655 370 m20 1658 369 m20 1662 368 m20 1665 367 m20 1669 363 m20
 1673 361 m20 1676 361 m20 1680 360 m20 1683 360 m20 1687 358 m20 1690 357 m20 1694 356 m20 1697 355 m20 1701 355 m20 1705 353 m20 1708 352 m20 1712 352 m20 1715 351 m20 1719 349 m20 1722 348 m20 1726 349 m20 1729 348 m20 1733 348 m20 1737 347 m20
 1740 346 m20 1744 347 m20 1747 345 m20 1751 342 m20 1754 343 m20 1758 341 m20 1761 342 m20 1765 343 m20 1769 341 m20 1772 341 m20 1776 340 m20 1779 341 m20 1783 339 m20 1786 339 m20 1790 338 m20 1793 338 m20 1797 337 m20 1801 338 m20 1804 336 m20
 1808 334 m20 1811 335 m20 1815 336 m20 1818 336 m20 1822 336 m20 1825 335 m20 1829 334 m20 1833 334 m20 1836 333 m20 1840 332 m20 1843 333 m20 1847 333 m20 1850 332 m20 1854 333 m20 1857 333 m20 1861 331 m20 1865 331 m20 1868 332 m20 1872 332 m20
 1875 331 m20 1879 331 m20 1882 331 m20 1886 331 m20 1889 330 m20 1893 328 m20 1897 329 m20 1900 328 m20 1904 329 m20 1907 328 m20 1911 329 m20 1914 329 m20 1918 328 m20 1921 329 m20 1925 330 m20 1929 329 m20 1932 329 m20 1936 328 m20 1939 327 m20
 1943 327 m20 1946 327 m20 1950 327 m20 1953 326 m20 1957 328 m20 1961 326 m20 1964 327 m20 1968 327 m20 1971 326 m20 1975 327 m20 1978 327 m20 1982 326 m20 1985 326 m20 1989 325 m20 1993 326 m20 1996 325 m20 2000 325 m20 2003 325 m20 2007 324 m20
 2010 325 m20 2014 326 m20 2017 326 m20 2021 326 m20 cs 0 0 0 P13 setcolor 247 322 m 369 X 4 58 d 4 6 d 3 -3 d 4 2 d 3 -4 d 4 -9 d 3 1 d 4 -3 d 3 8 d 4 5 d 4 -3 d 3 2 d 4 -3 d 3 -4 d 4 X 3 -3 d 4 5 d 3 2 d 4 -5 d 4 -4 d 3 11 d 4 -10 d 3 7 d 4 -3 d 3
 X 4 5 d 3 -7 d 4 2 d 4 1 d 3 -4 d 4 4 d 3 2 d 4 -4 d 3 3 d 4 -4 d 4 1 d 3 2 d 4 2 d 3 2 d 4 -6 d 3 8 d 4 -2 d 3 2 d 4 4 d 4 -1 d 3 1 d 4 -4 d 3 -1 d 4 3 d 3 7 d 4 1 d 3 -1 d 4 2 d 4 1 d 3 4 d 4 3 d 3 -6 d 4 -1 d 3 8 d 4 -2 d 3 4 d 4 X 4 7 d 3 1 d 4
 -4 d 3 10 d 4 -1 d 3 8 d 4 10 d 3 -3 d 4 11 d 4 -1 d 3 6 d 4 2 d 3 13 d 4 4 d 3 -7 d 4 12 d 3 11 d 4 -1 d 4 15 d 3 -1 d 4 3 d 3 -6 d 4 15 d 3 -3 d 4 23 d 3 -3 d 4 2 d 4 1 d 3 -4 d 4 10 d 3 6 d 4 2 d 3 8 d 4 -2 d 3 4 d 4 -1 d 4 21 d 3 -4 d 4 7 d 3 4
 d 4 2 d 3 11 d 4 1 d 3 X 4 8 d 4 21 d 3 5 d 4 7 d 3 -10 d 4 7 d 3 -2 d 4 15 d 3 5 d 4 3 d 4 13 d 3 X 4 14 d 3 10 d 4 5 d 3 X 4 6 d 3 4 d 4 11 d 4 5 d 3 10 d 4 10 d 3 6 d 4 10 d 3 16 d 4 2 d 3 2 d 4 15 d 4 4 d 3 13 d 4 4 d 3 10 d 4 6 d 3 16 d 4 11 d
 3 11 d 4 17 d 4 2 d 3 18 d 4 10 d 3 24 d 4 9 d 3 18 d 4 6 d 3 20 d 4 16 d 4 6 d 3 24 d 4 18 d 3 11 d 4 21 d 3 20 d 4 22 d 3 15 d 4 16 d 4 17 d 3 29 d 4 24 d 3 16 d 4 23 d 3 17 d 4 24 d 3 40 d 4 15 d 4 31 d 3 14 d 4 18 d 3 44 d 4 18 d 3 23 d 4 29 d 3
 20 d 4 23 d 4 41 d 3 19 d 4 24 d 3 30 d 4 18 d 3 10 d 4 16 d 3 14 d 4 12 d 4 9 d 3 21 d 4 -5 d 3 8 d 4 -1 d 3 5 d 4 -25 d 3 -8 d 4 -7 d 4 -11 d 3 -10 d 4 -29 d 3 -15 d 4 -52 d 3 -6 d 4 -26 d 3 -48 d 4 -26 d 4 -40 d 3 -36 d 4 -45 d 3 -29 d 4 -25 d 3
 -45 d 4 -23 d 3 -34 d 4 -52 d 4 -28 d 3 -36 d 4 -30 d 3 -32 d 4 -44 d 3 -11 d 4 -38 d 3 -36 d 4 -22 d 4 -18 d 3 -30 d 4 -34 d 3 -16 d 4 -18 d 3 -23 d 4 -19 d 3 -15 d 4 -18 d 4 -24 d 3 -19 d 4 -11 d 3 -14 d 4 -29 d 3 -2 d 4 -12 d 3 -15 d 4 -9 d 4 -11
 d 3 -14 d 4 -9 d 3 -7 d 4 -9 d 3 -13 d 4 -8 d 3 -16 d 4 -4 d 4 -5 d 3 -10 d 4 -7 d 3 -2 d 4 -11 d 3 -8 d 4 -2 d 3 -2 d 4 -6 d 4 -10 d 3 -5 d 4 -2 d 3 -5 d 4 -2 d 3 -4 d 4 -7 d 3 X 4 -8 d 4 1 d 3 -6 d 4 -3 d 3 -1 d 4 -3 d 3 -6 d 4 -4 d 3 -1 d 4 -2 d
 4 -3 d 3 -1 d 4 -4 d 3 X 4 -4 d 3 -3 d 4 -3 d 3 2 d 4 -2 d 4 -3 d 3 -1 d 4 -3 d 3 1 d 4 -3 d 3 -1 d 4 -1 d 3 -1 d 4 -4 d 4 -2 d 3 X 4 -1 d 3 X 4 -2 d 3 -1 d 4 -1 d 3 -2 d 4 1 d 4 -2 d 3 -2 d 4 1 d 3 -1 d 4 -2 d 3 -1 d 4 1 d 3 -2 d 8 X 3 -1 d 4 X 3
 -1 d 4 -3 d 3 1 d 4 -2 d 3 1 d 4 1 d 4 -2 d 3 -1 d 4 -1 d 3 1 d 4 -2 d 3 1 d 4 -2 d 3 X 4 -1 d 4 2 d 3 -2 d 4 -2 d 3 1 d 4 X 3 1 d 4 X 3 -2 d 4 -1 d 7 X 4 -1 d 3 1 d 4 -1 d 3 X 4 1 d 3 -1 d 4 -1 d 11 X 3 -1 d 4 1 d 3 -1 d 7 X 4 -3 d 4 2 d 3 -2 d 4 1
 d 3 X 4 1 d 3 X 4 -2 d 3 2 d 4 X 4 -1 d 7 X 3 -2 d 4 1 d 3 -1 d 7 X 4 1 d 4 -1 d 3 1 d 4 -1 d 3 -1 d 4 1 d 3 1 d 4 -2 d 3 X 4 -1 d 4 2 d 3 -1 d 4 X 3 -1 d 4 X 3 1 d 4 X 3 1 d 4 -1 d -1 Y -4 1 d -3 X -4 -1 d -3 -1 d -4 1 d -7 X -3 1 d -4 -1 d -4 1 d
 -3 X -4 1 d -3 X -4 -1 d -3 1 d -4 X -3 -1 d -4 1 d -4 -1 d -3 1 d -11 X -3 1 d -7 X -4 1 d -4 X -3 -1 d -4 1 d -3 X -4 -1 d -3 X -4 -1 d -3 2 d -4 -1 d -4 2 d -7 X -3 1 d -18 X -4 1 d -3 1 d -4 -1 d -3 X -4 1 d -3 -1 d -4 1 d -3 1 d -8 X -3 2 d -4
 X -3 -1 d -4 X -3 -1 d -4 2 d -3 2 d -4 -2 d -4 1 d -3 X -4 2 d -3 -1 d -4 2 d -3 -1 d -4 1 d -3 1 d -4 1 d -4 X -3 -2 d -4 2 d -3 -1 d -4 4 d -3 1 d -7 X -4 1 d -4 X -3 1 d -4 -1 d -3 1 d -4 2 d -3 1 d -4 X -3 1 d -4 2 d -4 X -3 1 d -4 1 d -3 1 d
 -4 2 d -3 X -4 1 d -3 X -4 2 d -4 4 d -3 X -4 2 d -3 1 d -4 3 d -3 -1 d -4 3 d -3 1 d -4 3 d -4 1 d -3 -2 d -4 3 d -3 4 d -4 4 d -3 X -4 3 d -3 2 d -4 2 d -4 2 d -3 1 d -4 4 d -3 6 d -4 3 d -3 1 d -4 3 d -3 5 d -4 X -4 7 d -3 1 d -4 7 d -3 4 d -4 2
 d -3 4 d -4 2 d -3 5 d -4 9 d -4 7 d -3 1 d -4 2 d -3 8 d -4 12 d -3 2 d -4 6 d -3 9 d -4 6 d -4 4 d -3 15 d -4 9 d -3 12 d -4 9 d -3 7 d -4 9 d -3 14 d -4 11 d -4 9 d -3 15 d -4 11 d -3 3 d -4 28 d -3 13 d -4 12 d -3 18 d -4 23 d -4 19 d -3 14 d -4
 20 d -3 22 d -4 18 d -3 16 d -4 34 d -3 29 d -4 18 d -4 22 d -3 36 d -4 37 d -3 11 d -4 44 d -3 31 d -4 30 d -3 35 d -4 28 d -4 52 d -3 34 d -4 23 d -3 44 d -4 25 d -3 29 d -4 45 d -3 35 d -4 40 d -4 26 d -3 47 d -4 25 d -3 7 d -4 51 d -3 15 d -4 29
 d -3 10 d -4 11 d -4 6 d -3 9 d -4 25 d -3 -6 d -4 1 d -3 -8 d -4 5 d -3 -21 d -4 -9 d -4 -13 d -3 -13 d -4 -16 d -3 -10 d -4 -18 d -3 -30 d -4 -24 d -3 -19 d -4 -40 d -4 -23 d -3 -21 d -4 -28 d -3 -23 d -4 -18 d -3 -44 d -4 -17 d -3 -15 d -4 -31 d
 -4 -14 d -3 -41 d -4 -23 d -3 -17 d -4 -23 d -3 -16 d -4 -24 d -3 -28 d -4 -18 d -4 -15 d -3 -16 d -4 -22 d -3 -19 d -4 -21 d -3 -11 d -4 -18 d -3 -23 d -4 -7 d -4 -16 d -3 -20 d -4 -5 d -3 -18 d -4 -9 d -3 -24 d -4 -10 d -3 -18 d -4 -2 d -4 -16 d
 -3 -11 d -4 -12 d -3 -16 d -4 -6 d -3 -9 d -4 -4 d -3 -14 d -4 -4 d -4 -14 d -3 -2 d -4 -2 d -3 -17 d -4 -9 d -3 -6 d -4 -10 d -3 -9 d -4 -6 d -4 -11 d -3 -4 d -4 -6 d -3 X -4 -5 d -3 -10 d -4 -14 d -3 1 d -4 -13 d -4 -3 d -3 -6 d -4 -14 d -3 2 d -4
 -7 d -3 9 d -4 -7 d -3 -5 d -4 -21 d -4 -8 d -3 1 d -4 -1 d -3 -12 d -4 -1 d -3 -4 d -4 -6 d -3 4 d -4 -20 d -4 1 d -3 -3 d -4 1 d -3 -7 d -4 -6 d -3 -8 d -4 -10 d -3 4 d -4 -1 d -4 -2 d -3 3 d -4 -22 d -3 3 d -4 -14 d -3 5 d -4 -2 d -3 X -4 -14 d
 -4 1 d -3 -10 d -4 -12 d -3 7 d -4 -4 d -3 -12 d -4 -2 d -3 -5 d -4 X -4 -9 d -3 2 d -4 -10 d -3 -7 d -4 X -3 -9 d -4 3 d -3 X -4 -7 d -4 X -3 -4 d -4 1 d -3 -6 d -4 X -3 6 d -4 -4 d -3 -3 d -4 -1 d -4 -2 d -3 1 d -4 -1 d -3 -6 d -4 -2 d -3 X -4 4 d
 -3 -1 d -4 1 d -4 -4 d -3 -1 d -4 1 d -3 -8 d -4 6 d -3 -3 d -4 -1 d -3 -2 d -4 X -4 3 d -3 -3 d -4 3 d -3 -1 d -4 -4 d -3 4 d -4 -1 d -4 -3 d -3 7 d -4 -5 d -3 1 d -4 2 d -3 -6 d -4 9 d -3 -10 d -4 3 d -4 5 d -3 -2 d -4 -4 d -3 2 d -4 -1 d -3 4 d
 -4 3 d -3 -2 d -4 3 d -4 -5 d -3 -7 d -4 2 d -3 X -4 7 d -3 4 d -4 -2 d -3 3 d -4 -6 d -4 -47 d -369 X FA 0.8 0 0 c 1 1 1 c 1 0 0 c 0.8 0 0 c 245 322 m 427 X 1 Y 42 X 1 Y 4 X -1 Y 7 X 1 Y 3 X -1 Y 8 X 1 Y 25 X 1 Y 32 X 1 Y 3 X 1 Y 4 X -1 Y 3 X 1 Y
 14 X 1 Y 4 X -1 Y 4 X 1 Y 10 X 1 Y 4 X 1 Y 10 X 1 Y 8 X 1 Y 3 X 1 Y 7 X 1 Y 4 X 1 Y 7 X 1 Y 3 X 1 Y 4 X 1 Y 7 X 2 Y 7 X 1 Y 4 X 2 Y 3 X 1 Y 4 X -1 Y 3 X 1 Y 4 X 2 Y 7 X 2 Y 4 X 1 Y 7 X 2 Y 3 X -2 Y 4 X 2 Y 3 X 2 Y 4 X 1 Y 4 X 2 Y 7 X 1 Y 7 X 3 Y 7 X
 2 Y 3 X 2 Y 8 X 3 Y 3 X 1 Y 4 X 1 Y 3 X 1 Y 4 X 4 Y 3 X 2 Y 4 X 1 Y 3 X 1 Y 4 X -1 Y 4 X 2 Y 3 X 2 Y 4 X 4 Y 3 X 1 Y 4 X 2 Y 3 X 1 Y 4 X 3 Y 3 X 4 Y 4 X 1 Y 4 X 3 Y 3 X 1 Y 4 X 2 Y 7 X 5 Y 7 X 6 Y 3 X 2 Y 4 X 3 Y 4 X 5 Y 3 X 1 Y 4 X 1 Y 3 X 6 Y 4 X
 1 Y 3 X 6 Y 7 X 3 Y 4 X 4 Y 4 X 6 Y 3 X 4 Y 4 X 6 Y 3 X 7 Y 4 X -2 Y 3 X 8 Y 4 X 6 Y 3 X 5 Y 4 X 4 Y 4 X 8 Y 3 X 4 Y 4 X 5 Y 3 X 9 Y 4 X 5 Y 3 X 5 Y 4 X 7 Y 3 X 12 Y 4 X 3 Y 4 X 4 Y 3 X 14 Y 4 X 3 Y 3 X 9 Y 4 X 11 Y 3 X 7 Y 4 X 18 Y 3 X 3 Y 4 X 11 Y
 4 X 9 Y 3 X 9 Y 4 X 15 Y 3 X 11 Y 4 X 15 Y 3 X 7 Y 4 X 10 Y 3 X 19 Y 4 X 11 Y 4 X 17 Y 3 X 11 Y 4 X 9 Y 3 X 14 Y 4 X 15 Y 3 X 11 Y 4 X 14 Y 3 X 18 Y 4 X 12 Y 4 X 15 Y 3 X 4 Y 4 X 14 Y 3 X 7 Y 4 X 8 Y 3 X 15 Y 4 X 3 Y 3 X 7 Y 4 X 2 Y 4 X 9 Y 3 X 1 Y
 4 X 2 Y 3 X 2 Y 4 X -3 Y 3 X -2 Y 4 X -6 Y 3 X -4 Y 4 X -13 Y 4 X 2 Y 3 X -6 Y 4 X -14 Y 3 X -8 Y 4 X -18 Y 3 X -9 Y 4 X -13 Y 3 X -13 Y 4 X -7 Y 4 X -19 Y 3 X -12 Y 4 X -13 Y 3 X -14 Y 4 X -13 Y 3 X -18 Y 4 X -15 Y 3 X -11 Y 4 X -15 Y 4 X -6 Y 3 X
 -13 Y 4 X -16 Y 3 X -10 Y 4 X -12 Y 3 X -11 Y 4 X -15 Y 3 X -8 Y 4 X -7 Y 4 X -12 Y 3 X -12 Y 4 X -2 Y 3 X -13 Y 4 X -10 Y 3 X -9 Y 4 X -6 Y 3 X -4 Y 4 X -15 Y 4 X -1 Y 3 X -3 Y 4 X -10 Y 3 X -4 Y 4 X -6 Y 3 X -3 Y 4 X -8 Y 3 X -2 Y 4 X -9 Y 4 X -5
 Y 3 X -3 Y 4 X -7 Y 3 X -7 Y 7 X -2 Y 4 X -4 Y 3 X -3 Y 4 X -9 Y 4 X -4 Y 3 X -2 Y 7 X -2 Y 4 X -5 Y 3 X -3 Y 4 X -2 Y 3 X -3 Y 4 X -1 Y 4 X -3 Y 3 X -3 Y 4 X -1 Y 3 X -2 Y 7 X -6 Y 4 X -2 Y 3 X -1 Y 8 X -5 Y 3 X -1 Y 7 X -2 Y 4 X -2 Y 3 X -1 Y 4 X
 -1 Y 3 X -2 Y 4 X -2 Y 4 X -1 Y 3 X -4 Y 4 X 3 Y 3 X -1 Y 4 X -3 Y 7 X -3 Y 7 X -1 Y 4 X -1 Y 7 X -2 Y 3 X -2 Y 4 X -3 Y 3 X 2 Y 4 X -1 Y 7 X -1 Y 4 X -2 Y 7 X -1 Y 7 X -1 Y 3 X -2 Y 4 X 2 Y 3 X -2 Y 4 X -2 Y 4 X -1 Y 7 X 1 Y 3 X -1 Y 11 X -1 Y 3 X
 -1 Y 4 X -2 Y 4 X 1 Y 3 X -2 Y 4 X 1 Y 3 X 1 Y 4 X -1 Y 3 X -1 Y 4 X -2 Y 14 X -1 Y 4 X -1 Y 7 X 1 Y 3 X -1 Y 4 X -1 Y 3 X 1 Y 4 X -1 Y 11 X -1 Y 10 X -1 Y 4 X -1 Y 21 X -1 Y 14 X -1 Y 15 X -1 Y 3 X -1 Y 14 X -1 Y 4 X 1 Y 11 X 1 Y 3 X -1 Y 7 X -1 Y
 4 X 1 Y 3 X -1 Y 8 X -1 Y 3 X 1 Y 4 X -1 Y 17 X -1 Y 8 X 1 Y 3 X -1 Y 4 X 1 Y 3 X -1 Y 7 X -1 Y 4 X 1 Y 3 X -1 Y 4 X 1 Y 4 X -1 Y 14 X s 1 0 0 c 247 322 m20 250 322 m20 254 322 m20 257 322 m20 261 322 m20 264 322 m20 268 322 m20 272 322 m20 275 322
 m20 279 322 m20 282 322 m20 286 322 m20 289 322 m20 293 322 m20 296 322 m20 300 322 m20 304 322 m20 307 322 m20 311 322 m20 314 322 m20 318 322 m20 321 322 m20 325 322 m20 328 322 m20 332 322 m20 336 322 m20 339 322 m20 343 322 m20 346 322 m20 350
 322 m20 353 322 m20 357 322 m20 360 322 m20 364 322 m20 368 322 m20 371 322 m20 375 322 m20 378 322 m20 382 322 m20 385 322 m20 389 322 m20 392 322 m20 396 322 m20 400 322 m20 403 322 m20 407 322 m20 410 322 m20 414 322 m20 417 322 m20 421 322 m20
 424 322 m20 428 322 m20 432 322 m20 435 322 m20 439 322 m20 442 322 m20 446 322 m20 449 322 m20 453 322 m20 456 322 m20 460 322 m20 464 322 m20 467 322 m20 471 322 m20 474 322 m20 478 322 m20 481 322 m20 485 322 m20 488 322 m20 492 322 m20 496 322
 m20 499 322 m20 503 322 m20 506 322 m20 510 322 m20 513 322 m20 517 322 m20 520 322 m20 524 322 m20 528 322 m20 531 322 m20 535 322 m20 538 322 m20 542 322 m20 545 322 m20 549 322 m20 552 322 m20 556 322 m20 560 322 m20 563 322 m20 567 322 m20 570
 322 m20 574 322 m20 577 322 m20 581 322 m20 584 322 m20 588 322 m20 592 322 m20 595 322 m20 599 322 m20 602 322 m20 606 322 m20 609 322 m20 613 322 m20 616 322 m20 620 322 m20 624 322 m20 627 322 m20 631 322 m20 634 322 m20 638 322 m20 641 322 m20
 645 322 m20 648 322 m20 652 322 m20 656 322 m20 659 322 m20 663 322 m20 666 322 m20 670 322 m20 673 323 m20 677 323 m20 680 323 m20 684 323 m20 688 323 m20 691 323 m20 695 323 m20 698 323 m20 702 323 m20 705 323 m20 709 323 m20 712 323 m20 716 324
 m20 720 323 m20 723 323 m20 727 324 m20 730 323 m20 734 323 m20 737 324 m20 741 324 m20 745 324 m20 748 324 m20 752 324 m20 755 324 m20 759 324 m20 762 325 m20 766 325 m20 769 325 m20 773 325 m20 777 325 m20 780 325 m20 784 325 m20 787 325 m20 791
 325 m20 794 326 m20 798 327 m20 801 326 m20 805 327 m20 809 327 m20 812 327 m20 816 327 m20 819 328 m20 823 327 m20 826 328 m20 830 328 m20 833 328 m20 837 329 m20 841 330 m20 844 330 m20 848 330 m20 851 331 m20 855 331 m20 858 332 m20 862 333 m20
 865 333 m20 869 334 m20 873 335 m20 876 335 m20 880 336 m20 883 337 m20 887 338 m20 890 338 m20 894 340 m20 897 340 m20 901 341 m20 905 343 m20 908 344 m20 912 343 m20 915 344 m20 919 346 m20 922 346 m20 926 348 m20 929 349 m20 933 349 m20 937 351
 m20 940 349 m20 944 351 m20 947 353 m20 951 354 m20 954 356 m20 958 356 m20 961 357 m20 965 357 m20 969 360 m20 972 360 m20 976 362 m20 979 364 m20 983 364 m20 986 367 m20 990 368 m20 993 369 m20 997 370 m20 1001 374 m20 1004 376 m20 1008 377 m20
 1011 378 m20 1015 377 m20 1018 379 m20 1022 381 m20 1025 385 m20 1029 386 m20 1033 388 m20 1036 389 m20 1040 392 m20 1043 396 m20 1047 397 m20 1050 400 m20 1054 401 m20 1057 403 m20 1061 403 m20 1065 408 m20 1068 408 m20 1072 414 m20 1075 416 m20
 1079 419 m20 1082 424 m20 1086 425 m20 1089 426 m20 1093 432 m20 1097 433 m20 1100 439 m20 1104 439 m20 1107 442 m20 1111 446 m20 1114 452 m20 1118 456 m20 1121 462 m20 1125 469 m20 1129 467 m20 1132 475 m20 1136 481 m20 1139 486 m20 1143 490 m20
 1146 498 m20 1150 502 m20 1153 507 m20 1157 516 m20 1161 521 m20 1164 526 m20 1168 533 m20 1171 545 m20 1175 548 m20 1178 552 m20 1182 566 m20 1185 569 m20 1189 578 m20 1193 589 m20 1196 596 m20 1200 614 m20 1203 617 m20 1207 628 m20 1210 637 m20
 1214 646 m20 1217 661 m20 1221 672 m20 1225 687 m20 1228 694 m20 1232 704 m20 1235 723 m20 1239 734 m20 1242 751 m20 1246 762 m20 1249 771 m20 1253 785 m20 1257 800 m20 1260 811 m20 1264 825 m20 1267 843 m20 1271 855 m20 1274 870 m20 1278 874 m20
 1281 888 m20 1285 895 m20 1289 903 m20 1292 918 m20 1296 921 m20 1299 928 m20 1303 930 m20 1306 939 m20 1310 940 m20 1313 942 m20 1317 944 m20 1321 941 m20 1324 939 m20 1328 933 m20 1331 929 m20 1335 916 m20 1338 918 m20 1342 912 m20 1345 898 m20
 1349 890 m20 1353 872 m20 1356 863 m20 1360 850 m20 1363 837 m20 1367 830 m20 1370 811 m20 1374 799 m20 1377 786 m20 1381 772 m20 1385 759 m20 1388 741 m20 1392 726 m20 1395 715 m20 1399 700 m20 1402 694 m20 1406 681 m20 1409 665 m20 1413 655 m20
 1417 643 m20 1420 632 m20 1424 617 m20 1427 609 m20 1431 602 m20 1434 590 m20 1438 578 m20 1441 576 m20 1445 563 m20 1449 553 m20 1452 544 m20 1456 538 m20 1459 534 m20 1463 519 m20 1466 518 m20 1470 515 m20 1473 505 m20 1477 501 m20 1481 495 m20
 1484 492 m20 1488 484 m20 1491 482 m20 1495 473 m20 1498 468 m20 1502 465 m20 1505 458 m20 1509 451 m20 1513 451 m20 1516 449 m20 1520 445 m20 1523 442 m20 1527 433 m20 1530 429 m20 1534 427 m20 1537 427 m20 1541 425 m20 1545 420 m20 1548 417 m20
 1552 415 m20 1555 412 m20 1559 411 m20 1562 408 m20 1566 405 m20 1569 404 m20 1573 402 m20 1577 402 m20 1580 396 m20 1584 394 m20 1587 393 m20 1591 393 m20 1594 388 m20 1598 387 m20 1601 387 m20 1605 385 m20 1609 383 m20 1612 382 m20 1616 381 m20
 1619 379 m20 1623 377 m20 1626 376 m20 1630 372 m20 1633 375 m20 1637 374 m20 1641 371 m20 1644 371 m20 1648 368 m20 1651 368 m20 1655 367 m20 1658 366 m20 1662 366 m20 1665 364 m20 1669 362 m20 1673 359 m20 1676 361 m20 1680 360 m20 1683 360 m20
 1687 359 m20 1690 357 m20 1694 357 m20 1697 356 m20 1701 356 m20 1705 355 m20 1708 353 m20 1712 355 m20 1715 353 m20 1719 351 m20 1722 350 m20 1726 350 m20 1729 351 m20 1733 350 m20 1737 350 m20 1740 350 m20 1744 349 m20 1747 348 m20 1751 346 m20
 1754 347 m20 1758 345 m20 1761 346 m20 1765 347 m20 1769 346 m20 1772 345 m20 1776 343 m20 1779 343 m20 1783 343 m20 1786 343 m20 1790 342 m20 1793 341 m20 1797 341 m20 1801 342 m20 1804 341 m20 1808 340 m20 1811 341 m20 1815 340 m20 1818 340 m20
 1822 340 m20 1825 339 m20 1829 339 m20 1833 339 m20 1836 338 m20 1840 337 m20 1843 337 m20 1847 337 m20 1850 337 m20 1854 337 m20 1857 337 m20 1861 336 m20 1865 336 m20 1868 336 m20 1872 336 m20 1875 335 m20 1879 335 m20 1882 335 m20 1886 335 m20
 1889 334 m20 1893 333 m20 1897 333 m20 1900 333 m20 1904 333 m20 1907 332 m20 1911 333 m20 1914 333 m20 1918 333 m20 1921 334 m20 1925 333 m20 1929 333 m20 1932 332 m20 1936 333 m20 1939 332 m20 1943 332 m20 1946 331 m20 1950 332 m20 1953 331 m20
 1957 331 m20 1961 331 m20 1964 331 m20 1968 331 m20 1971 330 m20 1975 330 m20 1978 331 m20 1982 330 m20 1985 331 m20 1989 330 m20 1993 330 m20 1996 329 m20 2000 330 m20 2003 329 m20 2007 330 m20 2010 329 m20 2014 329 m20 2017 329 m20 2021 329 m20
 0.8 0 0 c black 0.8 0 0 c cs 0.8 0 0 P13 setcolor 247 322 m 405 X 4 1 d 7 X 3 -1 d 4 1 d 42 X 4 1 d 4 -1 d 3 X 4 1 d 25 X 3 1 d 4 -1 d 3 1 d 7 X 4 1 d 4 -1 d 3 1 d 4 X 3 -1 d 4 1 d 3 X 4 1 d 14 X 4 1 d 7 X 3 1 d 11 X 4 1 d 3 X 4 1 d 3 X 4 1 d 3 X 4
 1 d 3 X 4 2 d 4 X 3 1 d 4 1 d 3 1 d 4 X 3 1 d 4 1 d 3 1 d 4 1 d 4 2 d 3 1 d 4 -1 d 3 1 d 4 2 d 3 X 4 2 d 3 1 d 4 X 4 2 d 3 -2 d 4 2 d 3 2 d 4 1 d 3 2 d 4 -1 d 3 1 d 4 1 d 4 3 d 3 X 4 2 d 3 2 d 4 X 3 3 d 4 1 d 3 1 d 4 1 d 4 4 d 3 2 d 4 2 d 7 X 3 1 d
 4 2 d 3 4 d 4 1 d 4 3 d 3 X 4 4 d 3 3 d 4 1 d 3 3 d 4 1 d 3 2 d 4 1 d 4 5 d 3 X 4 5 d 3 2 d 4 3 d 3 6 d 4 1 d 3 X 4 6 d 4 1 d 3 7 d 4 X 3 3 d 4 4 d 3 6 d 4 3 d 3 7 d 4 7 d 4 -2 d 3 7 d 4 7 d 3 5 d 4 4 d 3 8 d 4 4 d 3 5 d 4 9 d 4 5 d 3 5 d 4 7 d 3 12
 d 4 3 d 3 4 d 4 14 d 3 3 d 4 10 d 4 10 d 3 7 d 4 18 d 3 4 d 4 11 d 3 9 d 4 9 d 3 15 d 4 11 d 4 15 d 3 7 d 4 10 d 3 19 d 4 11 d 3 17 d 4 11 d 3 9 d 4 14 d 4 16 d 3 10 d 4 14 d 3 18 d 4 13 d 3 15 d 4 4 d 3 13 d 4 8 d 4 8 d 3 15 d 4 3 d 3 7 d 4 2 d 3 9
 d 4 1 d 3 2 d 4 1 d 4 -2 d 3 -3 d 4 -6 d 3 -4 d 4 -12 d 3 2 d 4 -7 d 3 -13 d 4 -8 d 4 -18 d 3 -9 d 4 -14 d 3 -13 d 4 -7 d 3 -18 d 4 -12 d 3 -13 d 4 -15 d 4 -13 d 3 -18 d 4 -15 d 3 -11 d 4 -15 d 3 -7 d 4 -12 d 3 -16 d 4 -10 d 4 -12 d 3 -11 d 4 -16 d
 3 -8 d 4 -6 d 3 -12 d 4 -13 d 3 -2 d 4 -12 d 4 -11 d 3 -9 d 4 -6 d 3 -4 d 4 -15 d 3 -1 d 4 -3 d 3 -10 d 4 -4 d 4 -6 d 3 -3 d 4 -8 d 3 -2 d 4 -9 d 3 -5 d 4 -3 d 3 -7 d 4 -7 d 4 X 3 -3 d 4 -4 d 3 -2 d 4 -9 d 3 -4 d 4 -2 d 3 -1 d 4 -1 d 4 -6 d 3 -3 d 4
 -2 d 3 -3 d 4 -1 d 3 -3 d 4 -3 d 3 -1 d 4 -1 d 4 -1 d 3 -5 d 4 -2 d 3 -2 d 4 X 3 -5 d 4 X 3 -1 d 4 -2 d 4 -1 d 3 -1 d 4 -2 d 3 -2 d 4 -2 d 3 -1 d 4 -4 d 3 3 d 4 -1 d 4 -3 d 3 X 4 -3 d 3 X 4 -1 d 3 -1 d 4 X 3 -2 d 4 -2 d 4 -3 d 3 2 d 4 -1 d 3 X 4 -1
 d 3 -2 d 4 X 3 -1 d 4 -1 d 4 X 3 -2 d 4 2 d 3 -2 d 4 -2 d 3 -1 d 4 X 3 1 d 4 -1 d 7 X 4 -1 d 3 -2 d 4 -1 d 3 X 4 -1 d 3 1 d 4 X 4 -1 d 3 -1 d 4 -1 d 10 X 4 -1 d 3 -1 d 8 X 3 -1 d 4 -1 d 3 1 d 11 X 3 -1 d 4 X 4 -1 d 3 X 4 -2 d 3 1 d 4 -1 d 7 X 3 1 d
 4 -1 d 4 X 3 -1 d 4 1 d 3 -1 d 11 X 3 -1 d 4 -1 d 4 X 3 -1 d 7 X 4 1 d 14 X 4 -1 d 3 X 4 1 d 3 -2 d 11 X 3 -1 d 4 1 d 4 -1 d 3 1 d 4 X 3 -1 d 4 -1 d 3 1 d 4 -1 d 3 1 d 4 -1 d 28 X 4 -1 d -1 Y -4 1 d -28 X -4 1 d -3 -1 d -4 1 d -3 -1 d -4 1 d -3 1 d
 -4 X -3 -1 d -4 1 d -4 -1 d -3 1 d -11 X -3 1 d -11 X -4 1 d -3 -1 d -4 1 d -3 X -4 -1 d -7 X -3 1 d -4 -1 d -4 2 d -3 1 d -11 X -3 1 d -4 -1 d -3 1 d -18 X -4 1 d -3 -1 d -4 2 d -3 X -4 1 d -7 X -4 1 d -7 X -3 -1 d -4 1 d -3 1 d -8 X -3 1 d -4 1 d
 -7 X -3 -1 d -4 2 d -3 1 d -4 1 d -4 -1 d -3 X -4 1 d -3 -1 d -4 2 d -3 1 d -4 1 d -3 X -4 1 d -7 X -4 -1 d -3 1 d -4 2 d -3 2 d -4 -2 d -3 2 d -4 1 d -4 X -3 1 d -4 1 d -3 1 d -4 1 d -3 X -4 1 d -3 -2 d -4 3 d -4 2 d -3 2 d -4 X -3 1 d -4 1 d -3 X
 -4 3 d -3 X -4 3 d -4 1 d -3 -3 d -4 4 d -3 1 d -4 2 d -3 2 d -4 1 d -3 1 d -4 2 d -4 1 d -3 1 d -4 X -3 5 d -4 1 d -3 1 d -4 2 d -3 5 d -4 1 d -4 2 d -3 1 d -4 3 d -3 3 d -4 X -3 3 d -4 2 d -3 3 d -4 6 d -4 1 d -3 1 d -4 2 d -3 4 d -4 9 d -3 2 d -4
 4 d -3 3 d -4 -1 d -4 7 d -3 7 d -4 3 d -3 5 d -4 9 d -3 2 d -4 8 d -3 3 d -4 6 d -4 4 d -3 10 d -4 3 d -3 X -4 15 d -3 5 d -4 6 d -3 8 d -4 11 d -4 12 d -3 3 d -4 12 d -3 12 d -4 6 d -3 8 d -4 15 d -3 11 d -4 12 d -4 10 d -3 17 d -4 12 d -3 6 d -4
 15 d -3 11 d -4 15 d -3 18 d -4 12 d -4 15 d -3 13 d -4 12 d -3 18 d -4 8 d -3 12 d -4 14 d -3 9 d -4 18 d -4 8 d -3 13 d -4 7 d -3 -3 d -4 13 d -3 4 d -4 6 d -3 2 d -4 3 d -4 -1 d -3 -3 d -4 X -3 -10 d -4 -2 d -3 -6 d -4 -3 d -3 -15 d -4 -9 d -4 -7
 d -3 -13 d -4 -4 d -3 -15 d -4 -13 d -3 -18 d -4 -13 d -3 -11 d -4 -16 d -4 -13 d -3 -9 d -4 -11 d -3 -17 d -4 -11 d -3 -19 d -4 -10 d -3 -7 d -4 -15 d -4 -11 d -3 -15 d -4 -8 d -3 -9 d -4 -11 d -3 -4 d -4 -18 d -3 -7 d -4 -10 d -4 -9 d -3 -3 d -4
 -15 d -3 -4 d -4 -2 d -3 -12 d -4 -7 d -3 -5 d -4 -5 d -4 -9 d -3 -5 d -4 -4 d -3 -8 d -4 -3 d -3 -6 d -4 -6 d -3 -8 d -4 2 d -4 -7 d -3 -6 d -4 -4 d -3 -5 d -4 -4 d -3 -3 d -4 -1 d -3 -6 d -4 -1 d -4 -6 d -3 X -4 -1 d -3 -6 d -4 -3 d -3 -2 d -4 -5
 d -3 X -4 -5 d -4 X -3 -2 d -4 -2 d -3 -3 d -4 X -3 -4 d -4 -3 d -3 -1 d -4 -3 d -4 X -3 -5 d -4 -2 d -3 -1 d -7 X -4 -1 d -3 -2 d -4 -4 d -4 -1 d -3 -1 d -4 -1 d -3 -3 d -4 X -3 -2 d -4 -2 d -3 1 d -4 -3 d -4 -1 d -3 -1 d -4 1 d -3 -3 d -4 -1 d -3
 -2 d -4 -2 d -3 2 d -4 -2 d -4 X -3 -1 d -4 -2 d -3 1 d -4 -3 d -7 X -3 -1 d -4 -1 d -4 -1 d -3 -1 d -4 -2 d -3 X -4 -1 d -3 -1 d -4 X -3 -1 d -4 X -4 -2 d -3 X -4 -1 d -3 X -4 -1 d -3 X -4 -1 d -3 X -4 -1 d -11 X -3 -1 d -14 X -4 -1 d -11 X -3 -1 d
 -29 X -3 -1 d -22 X -3 -1 d -57 X -4 -1 d -426 X FA black 1 1 1 c 556 639 1578 1302 bf black 1578 1302 m 556 X s 2134 1302 m 639 Y s 2134 1941 m -556 X s 1578 1941 m -639 Y s
 gsave  2222 2133 23 22 C 1716.93 1827.09 t 0 r /Helvetica findfont 95.0544 sf 0 0 m (No Int) show NC gr  0.8 0 0 c 1599 1861 m 97 X s black
 gsave  2222 2133 23 22 C 1716.93 1663.75 t 0 r /Helvetica findfont 95.0544 sf 0 0 m (Add) show NC gr  0.8 0.8 0 c 1599 1702 m 97 X s black
 gsave  2222 2133 23 22 C 1716.93 1504.21 t 0 r /Helvetica findfont 95.0544 sf 0 0 m (Mult) show NC gr  0.8 0 0.8 c 1599 1542 m 97 X s black
 gsave  2222 2133 23 22 C 1716.93 1344.68 t 0 r /Helvetica findfont 95.0544 sf 0 0 m (Central) show NC gr  1599 1382 m 97 X s
 gsave  2222 2133 23 22 C 2199.34 1568.79 t 90 r /Helvetica-BoldOblique findfont 38.0218 sf 0 0 m (LHC HIGGS XS WG 2013) show NC gr 
 gr  gr showpage
end
%%EOF
