%!PS-Adobe-2.0 EPSF-2.0
%%BoundingBox:  0 0 567 407
%%Title: mHvar.eps: Higgs Cross Section
%%Creator: ROOT Version 5.34/04
%%CreationDate: Thu Mar 28 15:14:22 2013
%%EndComments
%%BeginProlog
80 dict begin
/s {stroke} def /l {lineto} def /m {moveto} def /t {translate} def
/r {rotate} def /rl {roll}  def /R {repeat} def
/d {rlineto} def /rm {rmoveto} def /gr {grestore} def /f {eofill} def
/c {setrgbcolor} def /black {0 setgray} def /sd {setdash} def
/cl {closepath} def /sf {scalefont setfont} def /lw {setlinewidth} def
/box {m dup 0 exch d exch 0 d 0 exch neg d cl} def
/NC{systemdict begin initclip end}def/C{NC box clip newpath}def
/bl {box s} def /bf {box f} def /Y { 0 exch d} def /X { 0 d} def 
/K {{pop pop 0 moveto} exch kshow} bind def
/ita {/ang 15 def gsave [1 0 ang dup sin exch cos div 1 0 0] concat} def 
/mp {newpath /y exch def /x exch def} def
/side {[w .77 mul w .23 mul] .385 w mul sd w 0 l currentpoint t -144 r} def
/mr {mp x y w2 0 360 arc} def /m24 {mr s} def /m20 {mr f} def
/mb {mp x y w2 add m w2 neg 0 d 0 w neg d w 0 d 0 w d cl} def
/mt {mp x y w2 add m w2 neg w neg d w 0 d cl} def
/m21 {mb f} def /m25 {mb s} def /m22 {mt f} def /m26{mt s} def
/m23 {mp x y w2 sub m w2 w d w neg 0 d cl f} def
/m27 {mp x y w2 add m w3 neg w2 neg d w3 w2 neg d w3 w2 d cl s} def
/m28 {mp x w2 sub y w2 sub w3 add m w3 0 d  0 w3 neg d w3 0 d 0 w3 d w3 0 d  0 w3 d w3 neg 0 d 0 w3 d w3 neg 0 d 0 w3 neg d w3 neg 0 d cl s } def
/m29 {mp gsave x w2 sub y w2 add w3 sub m currentpoint t 4 {side} repeat cl fill gr} def
/m30 {mp gsave x w2 sub y w2 add w3 sub m currentpoint t 4 {side} repeat cl s gr} def
/m31 {mp x y w2 sub m 0 w d x w2 sub y m w 0 d x w2 sub y w2 add m w w neg d x w2 sub y w2 sub m w w d s} def
/m32 {mp x y w2 sub m w2 w d w neg 0 d cl s} def
/m33 {mp x y w2 add m w3 neg w2 neg d w3 w2 neg d w3 w2 d cl f} def
/m34 {mp x w2 sub y w2 sub w3 add m w3 0 d  0 w3 neg d w3 0 d 0 w3 d w3 0 d  0 w3 d w3 neg 0 d 0 w3 d w3 neg 0 d 0 w3 neg d w3 neg 0 d cl f } def
/m2 {mp x y w2 sub m 0 w d x w2 sub y m w 0 d s} def
/m5 {mp x w2 sub y w2 sub m w w d x w2 sub y w2 add m w w neg d s} def
/reEncode {exch findfont dup length dict begin {1 index /FID eq  {pop pop} {def} ifelse } forall /Encoding exch def currentdict end dup /FontName get exch definefont pop } def [/Times-Bold /Times-Italic /Times-BoldItalic /Helvetica /Helvetica-Oblique
 /Helvetica-Bold /Helvetica-BoldOblique /Courier /Courier-Oblique /Courier-Bold /Courier-BoldOblique /Times-Roman /AvantGarde-Book /AvantGarde-BookOblique /AvantGarde-Demi /AvantGarde-DemiOblique /Bookman-Demi /Bookman-DemiItalic /Bookman-Light
 /Bookman-LightItalic /Helvetica-Narrow /Helvetica-Narrow-Bold /Helvetica-Narrow-BoldOblique /Helvetica-Narrow-Oblique /NewCenturySchlbk-Roman /NewCenturySchlbk-Bold /NewCenturySchlbk-BoldItalic /NewCenturySchlbk-Italic /Palatino-Bold
 /Palatino-BoldItalic /Palatino-Italic /Palatino-Roman ] {ISOLatin1Encoding reEncode } forall
%%EndProlog
%%BeginSetup
%%EndSetup
newpath  gsave  .25 .25 scale  gsave  0 0 t black[  ] 0 sd 3 lw 1 1 1 c 2268 1630 0 0 bf black 1 1 1 c 1791 1287 363 261 bf black 1791 1287 363 261 bl 1 0 1 c 6 lw 1 1 1 c 1 0 1 c 363 272 m 20 X 23 Y 20 X 302 Y 20 X 501 Y 20 X 161 Y 20 X 57 Y 21 X -9
 Y 20 X -41 Y 20 X -47 Y 20 X -63 Y 20 X -57 Y 20 X -63 Y 20 X -45 Y 21 X -60 Y 20 X -52 Y 20 X -51 Y 20 X -45 Y 20 X -37 Y 20 X -34 Y 20 X -40 Y 20 X -17 Y 21 X -48 Y 20 X -18 Y 20 X -26 Y 20 X -17 Y 20 X -18 Y 20 X -26 Y 20 X -22 Y 20 X -10 Y 21 X
 -17 Y 20 X -9 Y 20 X -16 Y 20 X -13 Y 20 X -16 Y 20 X -7 Y 20 X -11 Y 20 X -3 Y 21 X -11 Y 20 X -5 Y 20 X -6 Y 20 X -5 Y 20 X -8 Y 20 X -2 Y 20 X -3 Y 21 X -7 Y 20 X -7 Y 20 X -1 Y 20 X -6 Y 20 X -4 Y 20 X -5 Y 20 X -3 Y 20 X -3 Y 21 X 1 Y 20 X -3 Y
 20 X -4 Y 20 X -1 Y 20 X -2 Y 20 X -2 Y 20 X -4 Y 20 X 1 Y 21 X -1 Y 20 X -2 Y 20 X -3 Y 20 X 2 Y 20 X -3 Y 20 X 1 Y 20 X -3 Y 20 X -1 Y 21 X -2 Y 20 X -2 Y 20 X 1 Y 20 X -1 Y 20 X 1 Y 20 X -4 Y 20 X -1 Y 41 X -2 Y 20 X 1 Y 40 X 1 Y 20 X -1 Y 40 X
 -2 Y 41 X 1 Y 40 X -1 Y 20 X -1 Y 40 X s black 3 lw 363 261 m 1791 X s
 gsave  2268 1630 0 0 C 1940.09 59.8267 t 0 r /Helvetica findfont 76.92 sf 0 0 m ( [GeV]) show NC gr 
 gsave  2268 1630 0 0 C 1843.23 37.0356 t 0 r /Helvetica findfont 51.28 sf 0 0 m (WW) show NC gr 
 gsave  2268 1630 0 0 C 1783.41 59.8267 t 0 r /Helvetica findfont 76.92 sf 0 0 m (m) show NC gr  477 299 m -38 Y s 561 280 m -19 Y s 645 280 m -19 Y s 729 280 m -19 Y s 812 299 m -38 Y s 896 280 m -19 Y s 980 280 m -19 Y s 1064 280 m -19 Y s 1148 299
 m -38 Y s 1232 280 m -19 Y s 1316 280 m -19 Y s 1399 280 m -19 Y s 1483 299 m -38 Y s 1567 280 m -19 Y s 1651 280 m -19 Y s 1735 280 m -19 Y s 1819 299 m -38 Y s 1903 280 m -19 Y s 1987 280 m -19 Y s 2070 280 m -19 Y s 2154 299 m -38 Y s 477 299 m
 -38 Y s 393 280 m -19 Y s
 gsave  2268 1630 0 0 C 413.089 188.027 t 0 r /Helvetica findfont 76.92 sf 0 0 m (200) show NC gr 
 gsave  2268 1630 0 0 C 749.258 188.027 t 0 r /Helvetica findfont 76.92 sf 0 0 m (400) show NC gr 
 gsave  2268 1630 0 0 C 1082.58 188.027 t 0 r /Helvetica findfont 76.92 sf 0 0 m (600) show NC gr 
 gsave  2268 1630 0 0 C 1418.75 188.027 t 0 r /Helvetica findfont 76.92 sf 0 0 m (800) show NC gr 
 gsave  2268 1630 0 0 C 1732.13 188.027 t 0 r /Helvetica findfont 76.92 sf 0 0 m (1000) show NC gr 
 gsave  2268 1630 0 0 C 2068.29 188.027 t 0 r /Helvetica findfont 76.92 sf 0 0 m (1200) show NC gr  363 1548 m 1791 X s 477 1509 m 39 Y s 561 1529 m 19 Y s 645 1529 m 19 Y s 729 1529 m 19 Y s 812 1509 m 39 Y s 896 1529 m 19 Y s 980 1529 m 19 Y s 1064
 1529 m 19 Y s 1148 1509 m 39 Y s 1232 1529 m 19 Y s 1316 1529 m 19 Y s 1399 1529 m 19 Y s 1483 1509 m 39 Y s 1567 1529 m 19 Y s 1651 1529 m 19 Y s 1735 1529 m 19 Y s 1819 1509 m 39 Y s 1903 1529 m 19 Y s 1987 1529 m 19 Y s 2070 1529 m 19 Y s 2154
 1509 m 39 Y s 477 1509 m 39 Y s 393 1529 m 19 Y s 363 261 m 1287 Y s
 gsave  2268 1630 0 0 C 71.2223 1250.66 t 90 r /Helvetica findfont 76.92 sf 0 0 m ( [fb/GeV]) show NC gr 
 gsave  2268 1630 0 0 C 99.7112 1153.8 t 90 r /Helvetica findfont 51.28 sf 0 0 m (WW) show NC gr 
 gsave  2268 1630 0 0 C 71.2223 1025.6 t 90 r /Helvetica findfont 76.92 sf 0 0 m (/dm) show NC gr 
 gsave  2268 1630 0 0 C 71.2223 980.018 t 90 r /Symbol findfont 76.92 sf 0 0 m (s) show NC gr 
 gsave  2268 1630 0 0 C 71.2223 940.134 t 90 r /Helvetica findfont 76.92 sf 0 0 m (d) show NC gr  417 261 m -54 X s 390 304 m -27 X s 390 347 m -27 X s 390 389 m -27 X s 390 432 m -27 X s 417 475 m -54 X s 390 518 m -27 X s 390 561 m -27 X s 390 604
 m -27 X s 390 647 m -27 X s 417 690 m -54 X s 390 733 m -27 X s 390 776 m -27 X s 390 819 m -27 X s 390 861 m -27 X s 417 904 m -54 X s 390 947 m -27 X s 390 990 m -27 X s 390 1033 m -27 X s 390 1076 m -27 X s 417 1119 m -54 X s 390 1162 m -27 X s
 390 1205 m -27 X s 390 1248 m -27 X s 390 1291 m -27 X s 417 1334 m -54 X s 390 1376 m -27 X s 390 1419 m -27 X s 390 1462 m -27 X s 390 1505 m -27 X s 417 1548 m -54 X s
 gsave  2268 1630 0 0 C 310.529 233.609 t 0 r /Helvetica findfont 76.92 sf 0 0 m (0) show NC gr 
 gsave  2268 1630 0 0 C 116.804 447.276 t 0 r /Helvetica findfont 76.92 sf 0 0 m (0.0005) show NC gr 
 gsave  2268 1630 0 0 C 173.782 663.791 t 0 r /Helvetica findfont 76.92 sf 0 0 m (0.001) show NC gr 
 gsave  2268 1630 0 0 C 116.804 877.458 t 0 r /Helvetica findfont 76.92 sf 0 0 m (0.0015) show NC gr 
 gsave  2268 1630 0 0 C 159.538 1091.12 t 0 r /Helvetica findfont 76.92 sf 0 0 m (0.002) show NC gr 
 gsave  2268 1630 0 0 C 116.804 1307.64 t 0 r /Helvetica findfont 76.92 sf 0 0 m (0.0025) show NC gr 
 gsave  2268 1630 0 0 C 159.538 1521.31 t 0 r /Helvetica findfont 76.92 sf 0 0 m (0.003) show NC gr  2154 261 m 1287 Y s 2101 261 m 53 X s 2127 304 m 27 X s 2127 347 m 27 X s 2127 389 m 27 X s 2127 432 m 27 X s 2101 475 m 53 X s 2127 518 m 27 X s
 2127 561 m 27 X s 2127 604 m 27 X s 2127 647 m 27 X s 2101 690 m 53 X s 2127 733 m 27 X s 2127 776 m 27 X s 2127 819 m 27 X s 2127 861 m 27 X s 2101 904 m 53 X s 2127 947 m 27 X s 2127 990 m 27 X s 2127 1033 m 27 X s 2127 1076 m 27 X s 2101 1119 m
 53 X s 2127 1162 m 27 X s 2127 1205 m 27 X s 2127 1248 m 27 X s 2127 1291 m 27 X s 2101 1334 m 53 X s 2127 1376 m 27 X s 2127 1419 m 27 X s 2127 1462 m 27 X s 2127 1505 m 27 X s 2101 1548 m 53 X s 0 0 1 c 6 lw 1 1 1 c 0 0 1 c 363 274 m 20 X 21 Y 20
 X 302 Y 20 X 449 Y 20 X 221 Y 20 X 35 Y 21 X -16 Y 20 X -34 Y 20 X -40 Y 20 X -31 Y 20 X -58 Y 20 X -100 Y 20 X -76 Y 21 X -17 Y 20 X -47 Y 20 X -50 Y 20 X -41 Y 20 X -50 Y 20 X -29 Y 20 X -22 Y 20 X -34 Y 21 X -44 Y 20 X -34 Y 20 X -18 Y 20 X -17 Y
 20 X -15 Y 20 X -30 Y 20 X -11 Y 20 X -15 Y 21 X -25 Y 20 X -6 Y 20 X -10 Y 20 X -8 Y 20 X -13 Y 20 X -12 Y 20 X -29 Y 20 X 9 Y 21 X -10 Y 20 X -13 Y 20 X -2 Y 20 X -9 Y 20 X -6 Y 40 X -7 Y 21 X 6 Y 20 X -19 Y 20 X 5 Y 20 X -1 Y 20 X -13 Y 20 X -7 Y
 20 X 2 Y 20 X -1 Y 21 X 2 Y 20 X -6 Y 20 X -6 Y 20 X 2 Y 20 X -5 Y 20 X -1 Y 20 X -1 Y 20 X -5 Y 21 X -1 Y 20 X 1 Y 20 X -2 Y 20 X 3 Y 20 X -2 Y 20 X -7 Y 20 X 1 Y 20 X -1 Y 21 X -1 Y 20 X 1 Y 20 X -2 Y 20 X -3 Y 20 X 1 Y 20 X 1 Y 20 X 1 Y 21 X -4 Y
 20 X -1 Y 20 X 1 Y 20 X -1 Y 20 X -1 Y 60 X -1 Y 41 X -2 Y 40 X 7 Y 20 X -2 Y 20 X -4 Y 20 X s 0.35 0.83 0.33 c 1 1 1 c 0.35 0.83 0.33 c 363 272 m 20 X 28 Y 20 X 315 Y 20 X 545 Y 20 X 180 Y 20 X 51 Y 21 X -15 Y 20 X -30 Y 20 X -64 Y 20 X -59 Y 20 X
 -56 Y 20 X -51 Y 20 X -69 Y 21 X -62 Y 20 X -42 Y 20 X -43 Y 20 X -48 Y 20 X -40 Y 20 X -42 Y 20 X -28 Y 20 X -27 Y 21 X -29 Y 20 X -17 Y 20 X -17 Y 20 X -17 Y 20 X -12 Y 20 X -9 Y 20 X -19 Y 20 X 12 Y 21 X 3 Y 20 X 4 Y 20 X 23 Y 20 X 15 Y 20 X 35 Y
 20 X 45 Y 20 X 49 Y 20 X 68 Y 21 X 58 Y 20 X 26 Y 20 X -24 Y 20 X -52 Y 20 X -83 Y 20 X -100 Y 20 X -76 Y 21 X -62 Y 20 X -49 Y 20 X -38 Y 20 X -27 Y 20 X -31 Y 20 X -14 Y 20 X -16 Y 20 X -8 Y 21 X -12 Y 20 X -10 Y 20 X -8 Y 20 X -3 Y 20 X -6 Y 20 X
 -2 Y 20 X -7 Y 20 X -3 Y 21 X -4 Y 20 X -5 Y 20 X -24 Y 20 X 11 Y 20 X 10 Y 20 X -5 Y 20 X -1 Y 20 X -1 Y 21 X -2 Y 20 X -1 Y 20 X -1 Y 20 X -3 Y 60 X -2 Y 41 X -1 Y 40 X -2 Y 20 X -1 Y 60 X -2 Y 21 X 1 Y 20 X -1 Y 20 X -1 Y 20 X -1 Y 20 X 1 Y 20 X
 -1 Y 20 X s 1 0 0 c 1 1 1 c 1 0 0 c 363 273 m 20 X 25 Y 20 X 331 Y 20 X 533 Y 20 X 204 Y 20 X 27 Y 21 X -17 Y 20 X -48 Y 20 X -45 Y 20 X -73 Y 20 X -42 Y 20 X -93 Y 20 X -66 Y 21 X -38 Y 20 X -48 Y 20 X -46 Y 20 X -42 Y 20 X -46 Y 20 X -34 Y 20 X
 -39 Y 20 X -22 Y 21 X -27 Y 20 X -26 Y 20 X -26 Y 20 X -27 Y 20 X -19 Y 20 X -31 Y 20 X -6 Y 20 X -17 Y 21 X -15 Y 20 X -15 Y 20 X -11 Y 20 X -8 Y 20 X -13 Y 20 X -2 Y 20 X -16 Y 20 X -2 Y 21 X -8 Y 20 X -4 Y 40 X -7 Y 20 X -3 Y 20 X 6 Y 20 X -2 Y
 21 X -6 Y 20 X 5 Y 20 X -3 Y 20 X -4 Y 20 X 7 Y 20 X 1 Y 20 X 2 Y 20 X 2 Y 61 X 5 Y 20 X -10 Y 20 X -1 Y 20 X -10 Y 20 X -12 Y 20 X -8 Y 21 X -8 Y 20 X -9 Y 20 X -8 Y 20 X -10 Y 20 X -14 Y 20 X -9 Y 20 X -2 Y 20 X -4 Y 21 X -7 Y 20 X -5 Y 20 X -7 Y
 20 X -20 Y 20 X 15 Y 20 X -4 Y 20 X -3 Y 21 X -1 Y 20 X -2 Y 20 X -3 Y 20 X -1 Y 20 X -4 Y 40 X -1 Y 20 X -1 Y 21 X -2 Y 60 X -3 Y 40 X -1 Y 20 X s black 3 lw 1 1 1 c 522 277 1587 1222 bf black
 gsave  2268 1630 0 0 C 1780.56 1452.93 t 0 r /Helvetica-Bold findfont 54.1289 sf 0 0 m (=800 GeV) show NC gr 
 gsave  2268 1630 0 0 C 1757.77 1435.84 t 0 r /Helvetica-Bold findfont 34.1867 sf 0 0 m (H) show NC gr 
 gsave  2268 1630 0 0 C 1715.03 1452.93 t 0 r /Helvetica-Bold findfont 54.1289 sf 0 0 m (M) show NC gr  1 0 0 c 6 lw 1607 1465 m 91 X s black
 gsave  2268 1630 0 0 C 1780.56 1381.71 t 0 r /Helvetica-Bold findfont 54.1289 sf 0 0 m (=600 GeV) show NC gr 
 gsave  2268 1630 0 0 C 1757.77 1364.62 t 0 r /Helvetica-Bold findfont 34.1867 sf 0 0 m (H) show NC gr 
 gsave  2268 1630 0 0 C 1715.03 1381.71 t 0 r /Helvetica-Bold findfont 54.1289 sf 0 0 m (M) show NC gr  0.35 0.83 0.33 c 1607 1395 m 91 X s black
 gsave  2268 1630 0 0 C 1780.56 1313.34 t 0 r /Helvetica-Bold findfont 54.1289 sf 0 0 m (=126 GeV) show NC gr 
 gsave  2268 1630 0 0 C 1757.77 1296.24 t 0 r /Helvetica-Bold findfont 34.1867 sf 0 0 m (H) show NC gr 
 gsave  2268 1630 0 0 C 1715.03 1313.34 t 0 r /Helvetica-Bold findfont 54.1289 sf 0 0 m (M) show NC gr  0 0 1 c 1607 1326 m 91 X s black
 gsave  2268 1630 0 0 C 1780.56 1244.96 t 0 r /Helvetica-Bold findfont 54.1289 sf 0 0 m (=100 GeV) show NC gr 
 gsave  2268 1630 0 0 C 1757.77 1227.87 t 0 r /Helvetica-Bold findfont 34.1867 sf 0 0 m (H) show NC gr 
 gsave  2268 1630 0 0 C 1715.03 1244.96 t 0 r /Helvetica-Bold findfont 54.1289 sf 0 0 m (M) show NC gr  1 0 1 c 1607 1257 m 91 X s black
 gsave  2268 1630 0 0 C 2222.13 1182.29 t 90 r /Helvetica-BoldOblique findfont 31.3378 sf 0 0 m (LHC HIGGS XS WG 2013) show NC gr 
 gr  gr showpage
end
%%EOF
