%!PS-Adobe-2.0 EPSF-2.0
%%BoundingBox:  0 0 567 384
%%Title: plots/SF_CutSR_1jet_MT.eps: c1
%%Creator: ROOT Version 5.30/00
%%CreationDate: Tue Apr  2 16:05:22 2013
%%EndComments
%%BeginProlog
80 dict begin
/s {stroke} def /l {lineto} def /m {moveto} def /t {translate} def
/r {rotate} def /rl {roll}  def /R {repeat} def
/d {rlineto} def /rm {rmoveto} def /gr {grestore} def /f {eofill} def
/c {setrgbcolor} def /black {0 setgray} def /sd {setdash} def
/cl {closepath} def /sf {scalefont setfont} def /lw {setlinewidth} def
/box {m dup 0 exch d exch 0 d 0 exch neg d cl} def
/NC{systemdict begin initclip end}def/C{NC box clip newpath}def
/bl {box s} def /bf {box f} def /Y { 0 exch d} def /X { 0 d} def 
/K {{pop pop 0 moveto} exch kshow} bind def
/ita {/ang 15 def gsave [1 0 ang dup sin exch cos div 1 0 0] concat} def 
/mp {newpath /y exch def /x exch def} def
/side {[w .77 mul w .23 mul] .385 w mul sd w 0 l currentpoint t -144 r} def
/mr {mp x y w2 0 360 arc} def /m24 {mr s} def /m20 {mr f} def
/mb {mp x y w2 add m w2 neg 0 d 0 w neg d w 0 d 0 w d cl} def
/mt {mp x y w2 add m w2 neg w neg d w 0 d cl} def
/m21 {mb f} def /m25 {mb s} def /m22 {mt f} def /m26{mt s} def
/m23 {mp x y w2 sub m w2 w d w neg 0 d cl f} def
/m27 {mp x y w2 add m w3 neg w2 neg d w3 w2 neg d w3 w2 d cl s} def
/m28 {mp x w2 sub y w2 sub w3 add m w3 0 d  0 w3 neg d w3 0 d 0 w3 d w3 0 d  0 w3 d w3 neg 0 d 0 w3 d w3 neg 0 d 0 w3 neg d w3 neg 0 d cl s } def
/m29 {mp gsave x w2 sub y w2 add w3 sub m currentpoint t 4 {side} repeat cl fill gr} def
/m30 {mp gsave x w2 sub y w2 add w3 sub m currentpoint t 4 {side} repeat cl s gr} def
/m31 {mp x y w2 sub m 0 w d x w2 sub y m w 0 d x w2 sub y w2 add m w w neg d x w2 sub y w2 sub m w w d s} def
/m32 {mp x y w2 sub m w2 w d w neg 0 d cl s} def
/m33 {mp x y w2 add m w3 neg w2 neg d w3 w2 neg d w3 w2 d cl f} def
/m34 {mp x w2 sub y w2 sub w3 add m w3 0 d  0 w3 neg d w3 0 d 0 w3 d w3 0 d  0 w3 d w3 neg 0 d 0 w3 d w3 neg 0 d 0 w3 neg d w3 neg 0 d cl f } def
/m2 {mp x y w2 sub m 0 w d x w2 sub y m w 0 d s} def
/m5 {mp x w2 sub y w2 sub m w w d x w2 sub y w2 add m w w neg d s} def
/reEncode {exch findfont dup length dict begin {1 index /FID eq  {pop pop} {def} ifelse } forall /Encoding exch def currentdict end dup /FontName get exch definefont pop } def [/Times-Bold /Times-Italic /Times-BoldItalic /Helvetica /Helvetica-Oblique
 /Helvetica-Bold /Helvetica-BoldOblique /Courier /Courier-Oblique /Courier-Bold /Courier-BoldOblique /Times-Roman /AvantGarde-Book /AvantGarde-BookOblique /AvantGarde-Demi /AvantGarde-DemiOblique /Bookman-Demi /Bookman-DemiItalic /Bookman-Light
 /Bookman-LightItalic /Helvetica-Narrow /Helvetica-Narrow-Bold /Helvetica-Narrow-BoldOblique /Helvetica-Narrow-Oblique /NewCenturySchlbk-Roman /NewCenturySchlbk-Bold /NewCenturySchlbk-BoldItalic /NewCenturySchlbk-Italic /Palatino-Bold
 /Palatino-BoldItalic /Palatino-Italic /Palatino-Roman ] {ISOLatin1Encoding reEncode } forall%%EndProlog
%%BeginSetup
%%EndSetup
newpath  gsave  .25 .25 scale  gsave  0 0 t black[  ] 0 sd 3 lw 1 1 1 c 2268 1538 0 0 bf black 1 1 1 c 2268 923 0 615 bf black 1 1 1 c 1701 831 340 615 bf black 1701 831 340 615 bl 1 1 1 c black 340 726 m 122 X 32 Y 121 X 90 Y 122 X 153 Y 121 X 171 Y
 122 X 139 Y 121 X 54 Y 122 X -34 Y 121 X -98 Y 122 X -171 Y 121 X -187 Y 121 X -113 Y 122 X -59 Y 121 X -34 Y 122 X s 340 615 m 1701 X s
 gsave  2268 923 0 615 C 1915.83 488.732 t 0 r /Helvetica-Bold findfont 42.3867 sf 0 0 m ( [GeV]) show NC gr 
 gsave  2268 923 0 615 C 1896.28 472.441 t 0 r /Helvetica-Bold findfont 29.3446 sf 0 0 m (T) show NC gr 
 gsave  2268 923 0 615 C 1857.18 488.732 t 0 r /Helvetica-BoldOblique findfont 42.3867 sf 0 0 m (m) show NC gr  462 636 m -21 Y s 522 626 m -11 Y s 583 626 m -11 Y s 644 626 m -11 Y s 705 636 m -21 Y s 765 626 m -11 Y s 826 626 m -11 Y s 887 626 m
 -11 Y s 948 636 m -21 Y s 1008 626 m -11 Y s 1069 626 m -11 Y s 1130 626 m -11 Y s 1191 636 m -21 Y s 1251 626 m -11 Y s 1312 626 m -11 Y s 1373 626 m -11 Y s 1434 636 m -21 Y s 1494 626 m -11 Y s 1555 626 m -11 Y s 1616 626 m -11 Y s 1676 636 m -21
 Y s 1737 626 m -11 Y s 1798 626 m -11 Y s 1859 626 m -11 Y s 1919 636 m -21 Y s 462 636 m -21 Y s 401 626 m -11 Y s 1919 636 m -21 Y s 1980 626 m -11 Y s
 gsave  2268 923 0 615 C 436.601 576.704 t 0 r /Helvetica-Bold findfont 42.3867 sf 0 0 m (80) show NC gr 
 gsave  2268 923 0 615 C 667.934 576.704 t 0 r /Helvetica-Bold findfont 42.3867 sf 0 0 m (100) show NC gr 
 gsave  2268 923 0 615 C 909.042 576.704 t 0 r /Helvetica-Bold findfont 42.3867 sf 0 0 m (120) show NC gr 
 gsave  2268 923 0 615 C 1153.41 576.704 t 0 r /Helvetica-Bold findfont 42.3867 sf 0 0 m (140) show NC gr 
 gsave  2268 923 0 615 C 1394.52 576.704 t 0 r /Helvetica-Bold findfont 42.3867 sf 0 0 m (160) show NC gr 
 gsave  2268 923 0 615 C 1638.88 576.704 t 0 r /Helvetica-Bold findfont 42.3867 sf 0 0 m (180) show NC gr 
 gsave  2268 923 0 615 C 1883.25 576.704 t 0 r /Helvetica-Bold findfont 42.3867 sf 0 0 m (200) show NC gr  340 615 m 831 Y s
 gsave  2268 923 0 615 C 188.976 1000.27 t 90 r /Helvetica-Bold findfont 42.3867 sf 0 0 m (Normalised to integral) show NC gr  401 615 m -61 X s 371 643 m -31 X s 371 671 m -31 X s 371 698 m -31 X s 401 726 m -61 X s 371 754 m -31 X s 371 781 m -31 X
 s 371 809 m -31 X s 401 837 m -61 X s 371 864 m -31 X s 371 892 m -31 X s 371 920 m -31 X s 401 947 m -61 X s 371 975 m -31 X s 371 1003 m -31 X s 371 1030 m -31 X s 401 1058 m -61 X s 371 1086 m -31 X s 371 1113 m -31 X s 371 1141 m -31 X s 401
 1169 m -61 X s 371 1196 m -31 X s 371 1224 m -31 X s 371 1252 m -31 X s 401 1279 m -61 X s 371 1307 m -31 X s 371 1335 m -31 X s 371 1363 m -31 X s 401 1390 m -61 X s 401 1390 m -61 X s 371 1418 m -31 X s 371 1446 m -31 X s
 gsave  2268 1455 0 0 C 2122.23 880.27 t 90 r /Helvetica-BoldOblique findfont 41.8538 sf 0 0 m (LHC HIGGS XS WG 2013) show NC gr  0.2 0.2 0.2 c black 0.2 0.2 0.2 c
 gsave  2268 923 0 615 C 303.014 599.511 t 0 r /Helvetica-Bold findfont 42.3867 sf 0 0 m (0) show NC gr 
 gsave  2268 923 0 615 C 244.366 710.291 t 0 r /Helvetica-Bold findfont 42.3867 sf 0 0 m (0.02) show NC gr 
 gsave  2268 923 0 615 C 241.108 821.07 t 0 r /Helvetica-Bold findfont 42.3867 sf 0 0 m (0.04) show NC gr 
 gsave  2268 923 0 615 C 244.366 931.849 t 0 r /Helvetica-Bold findfont 42.3867 sf 0 0 m (0.06) show NC gr 
 gsave  2268 923 0 615 C 244.366 1042.63 t 0 r /Helvetica-Bold findfont 42.3867 sf 0 0 m (0.08) show NC gr 
 gsave  2268 923 0 615 C 273.69 1153.41 t 0 r /Helvetica-Bold findfont 42.3867 sf 0 0 m (0.1) show NC gr 
 gsave  2268 923 0 615 C 244.366 1264.19 t 0 r /Helvetica-Bold findfont 42.3867 sf 0 0 m (0.12) show NC gr 
 gsave  2268 923 0 615 C 241.108 1374.97 t 0 r /Helvetica-Bold findfont 42.3867 sf 0 0 m (0.14) show NC gr  1 1 0 c 1 1 1 c black 1 1 0 c 340 723 m 122 X 32 Y 121 X 92 Y 122 X 154 Y 121 X 174 Y 122 X 141 Y 121 X 54 Y 122 X -35 Y 121 X -100 Y 122 X
 -173 Y 121 X -188 Y 121 X -113 Y 122 X -59 Y 121 X -33 Y 122 X s 0 0 1 c 1 1 1 c black 0 0 1 c 340 729 m 122 X 32 Y 121 X 89 Y 122 X 151 Y 121 X 168 Y 122 X 137 Y 121 X 54 Y 122 X -33 Y 121 X -96 Y 122 X -169 Y 121 X -186 Y 121 X -113 Y 122 X -59 Y
 121 X -34 Y 122 X s 0 1 1 c 1 1 1 c black 0 1 1 c 340 726 m 122 X 32 Y 121 X 90 Y 122 X 153 Y 121 X 171 Y 122 X 139 Y 121 X 54 Y 122 X -34 Y 121 X -98 Y 122 X -171 Y 121 X -187 Y 121 X -113 Y 122 X -59 Y 121 X -33 Y 122 X s 0 1 0 c 1 1 1 c black 0 1
 0 c 340 729 m 122 X 32 Y 121 X 90 Y 122 X 150 Y 121 X 168 Y 122 X 137 Y 121 X 53 Y 122 X -32 Y 121 X -96 Y 122 X -169 Y 121 X -186 Y 121 X -113 Y 122 X -59 Y 121 X -34 Y 122 X s 1 0 1 c 1 1 1 c black 1 0 1 c 340 723 m 122 X 33 Y 121 X 91 Y 122 X 154
 Y 121 X 174 Y 122 X 141 Y 121 X 54 Y 122 X -34 Y 121 X -101 Y 122 X -173 Y 121 X -188 Y 121 X -113 Y 122 X -59 Y 121 X -33 Y 122 X s 1 0 0 c 1 1 1 c black 1 0 0 c 340 726 m 122 X 32 Y 121 X 90 Y 122 X 153 Y 121 X 171 Y 122 X 140 Y 121 X 53 Y 122 X
 -33 Y 121 X -98 Y 122 X -172 Y 121 X -187 Y 121 X -113 Y 122 X -59 Y 121 X -34 Y 122 X s black 1 1 1 c black 340 726 m 122 X 32 Y 121 X 90 Y 122 X 153 Y 121 X 171 Y 122 X 139 Y 121 X 54 Y 122 X -34 Y 121 X -98 Y 122 X -171 Y 121 X -187 Y 121 X -113
 Y 122 X -59 Y 121 X -34 Y 122 X s 1 1 1 c 2268 615 0 0 bf black 1 1 1 c 1701 486 340 129 bf black 1701 486 340 129 bl 1 1 1 c black 401 367 m 5 Y s 401 372 m 6 Y s 340 372 m 61 X s 401 372 m 61 X s /w 2 def /w2 {w 2 div} def /w3 {w 3 div} def 401
 372 m20 522 365 m 7 Y s 522 372 m 7 Y s 462 372 m 60 X s 522 372 m 61 X s 522 372 m20 644 365 m 7 Y s 644 372 m 8 Y s 583 372 m 61 X s 644 372 m 61 X s 644 372 m20 765 368 m 4 Y s 765 372 m 5 Y s 705 372 m 60 X s 765 372 m 61 X s 765 372 m20 887 367
 m 5 Y s 887 372 m 5 Y s 826 372 m 61 X s 887 372 m 61 X s 887 372 m20 1008 369 m 3 Y s 1008 372 m 3 Y s 948 372 m 60 X s 1008 372 m 61 X s 1008 372 m20 1130 369 m 3 Y s 1130 372 m 3 Y s 1069 372 m 61 X s 1130 372 m 61 X s 1130 372 m20 1251 370 m 2 Y
 s 1251 372 m 3 Y s 1191 372 m 60 X s 1251 372 m 61 X s 1251 372 m20 1373 369 m 3 Y s 1373 372 m 3 Y s 1312 372 m 61 X s 1373 372 m 61 X s 1373 372 m20 1494 369 m 3 Y s 1494 372 m 3 Y s 1434 372 m 60 X s 1494 372 m 61 X s 1494 372 m20 1616 368 m 4 Y
 s 1616 372 m 4 Y s 1555 372 m 61 X s 1616 372 m 60 X s 1616 372 m20 1737 366 m 6 Y s 1737 372 m 7 Y s 1676 372 m 61 X s 1737 372 m 61 X s 1737 372 m20 1859 366 m 6 Y s 1859 372 m 6 Y s 1798 372 m 61 X s 1859 372 m 60 X s 1859 372 m20 1980 360 m 12 Y
 s 1980 372 m 13 Y s 1919 372 m 61 X s 1980 372 m 61 X s 1980 372 m20 340 129 m 1701 X s
 gsave  2268 615 0 0 C 1915.83 42.3568 t 0 r /Helvetica-Bold findfont 42.537 sf 0 0 m ( [GeV]) show NC gr 
 gsave  2268 615 0 0 C 1896.28 26.0657 t 0 r /Helvetica-Bold findfont 29.4487 sf 0 0 m (T) show NC gr 
 gsave  2268 615 0 0 C 1857.18 42.3568 t 0 r /Helvetica-BoldOblique findfont 42.537 sf 0 0 m (m) show NC gr  462 143 m -14 Y s 522 136 m -7 Y s 583 136 m -7 Y s 644 136 m -7 Y s 705 143 m -14 Y s 765 136 m -7 Y s 826 136 m -7 Y s 887 136 m -7 Y s 948
 143 m -14 Y s 1008 136 m -7 Y s 1069 136 m -7 Y s 1130 136 m -7 Y s 1191 143 m -14 Y s 1251 136 m -7 Y s 1312 136 m -7 Y s 1373 136 m -7 Y s 1434 143 m -14 Y s 1494 136 m -7 Y s 1555 136 m -7 Y s 1616 136 m -7 Y s 1676 143 m -14 Y s 1737 136 m -7 Y
 s 1798 136 m -7 Y s 1859 136 m -7 Y s 1919 143 m -14 Y s 462 143 m -14 Y s 401 136 m -7 Y s 1919 143 m -14 Y s 1980 136 m -7 Y s
 gsave  2268 615 0 0 C 436.601 91.23 t 0 r /Helvetica-Bold findfont 42.537 sf 0 0 m (80) show NC gr 
 gsave  2268 615 0 0 C 667.934 91.23 t 0 r /Helvetica-Bold findfont 42.537 sf 0 0 m (100) show NC gr 
 gsave  2268 615 0 0 C 909.042 91.23 t 0 r /Helvetica-Bold findfont 42.537 sf 0 0 m (120) show NC gr 
 gsave  2268 615 0 0 C 1153.41 91.23 t 0 r /Helvetica-Bold findfont 42.537 sf 0 0 m (140) show NC gr 
 gsave  2268 615 0 0 C 1394.52 91.23 t 0 r /Helvetica-Bold findfont 42.537 sf 0 0 m (160) show NC gr 
 gsave  2268 615 0 0 C 1638.88 91.23 t 0 r /Helvetica-Bold findfont 42.537 sf 0 0 m (180) show NC gr 
 gsave  2268 615 0 0 C 1883.25 91.23 t 0 r /Helvetica-Bold findfont 42.537 sf 0 0 m (200) show NC gr  340 129 m 486 Y s
 gsave  2268 615 0 0 C 192.235 322.563 t 90 r /Helvetica-Bold findfont 42.537 sf 0 0 m (Ratio) show NC gr  394 129 m -54 X s 367 141 m -27 X s 367 153 m -27 X s 367 166 m -27 X s 394 178 m -54 X s 367 190 m -27 X s 367 202 m -27 X s 367 214 m -27 X s
 394 226 m -54 X s 367 239 m -27 X s 367 251 m -27 X s 367 263 m -27 X s 394 275 m -54 X s 367 287 m -27 X s 367 299 m -27 X s 367 311 m -27 X s 394 324 m -54 X s 367 336 m -27 X s 367 348 m -27 X s 367 360 m -27 X s 394 372 m -54 X s 367 384 m -27 X
 s 367 396 m -27 X s 367 409 m -27 X s 394 421 m -54 X s 367 433 m -27 X s 367 445 m -27 X s 367 457 m -27 X s 394 469 m -54 X s 367 482 m -27 X s 367 494 m -27 X s 367 506 m -27 X s 394 518 m -54 X s 367 530 m -27 X s 367 542 m -27 X s 367 554 m -27
 X s 394 567 m -54 X s 367 579 m -27 X s 367 591 m -27 X s 367 603 m -27 X s 394 615 m -54 X s
 gsave  2268 615 0 0 C 267.173 114.037 t 0 r /Helvetica-Bold findfont 42.537 sf 0 0 m (0.9) show NC gr 
 gsave  2268 615 0 0 C 244.366 162.911 t 0 r /Helvetica-Bold findfont 42.537 sf 0 0 m (0.92) show NC gr 
 gsave  2268 615 0 0 C 241.108 211.784 t 0 r /Helvetica-Bold findfont 42.537 sf 0 0 m (0.94) show NC gr 
 gsave  2268 615 0 0 C 244.366 260.657 t 0 r /Helvetica-Bold findfont 42.537 sf 0 0 m (0.96) show NC gr 
 gsave  2268 615 0 0 C 244.366 309.53 t 0 r /Helvetica-Bold findfont 42.537 sf 0 0 m (0.98) show NC gr 
 gsave  2268 615 0 0 C 306.272 355.145 t 0 r /Helvetica-Bold findfont 42.537 sf 0 0 m (1) show NC gr 
 gsave  2268 615 0 0 C 244.366 407.277 t 0 r /Helvetica-Bold findfont 42.537 sf 0 0 m (1.02) show NC gr 
 gsave  2268 615 0 0 C 241.108 456.15 t 0 r /Helvetica-Bold findfont 42.537 sf 0 0 m (1.04) show NC gr 
 gsave  2268 615 0 0 C 244.366 501.765 t 0 r /Helvetica-Bold findfont 42.537 sf 0 0 m (1.06) show NC gr 
 gsave  2268 615 0 0 C 244.366 550.638 t 0 r /Helvetica-Bold findfont 42.537 sf 0 0 m (1.08) show NC gr 
 gsave  2268 615 0 0 C 273.69 596.253 t 0 r /Helvetica-Bold findfont 42.537 sf 0 0 m (1.1) show NC gr  1 1 0 c 1 1 1 c black 1 1 0 c 401 191 m 125 Y s 401 316 m 125 Y s 340 316 m 61 X s 401 316 m 61 X s black 401 316 m20 1 1 0 c 522 203 m 126 Y s 522
 329 m 126 Y s 462 329 m 60 X s 522 329 m 61 X s black 522 329 m20 1 1 0 c 644 236 m 127 Y s 644 363 m 128 Y s 583 363 m 61 X s 644 363 m 61 X s black 644 363 m20 1 1 0 c 765 244 m 128 Y s 765 372 m 128 Y s 705 372 m 60 X s 765 372 m 61 X s black 765
 372 m20 1 1 0 c 887 257 m 129 Y s 887 386 m 129 Y s 826 386 m 61 X s 887 386 m 61 X s black 887 386 m20 1 1 0 c 1008 260 m 128 Y s 1008 388 m 129 Y s 948 388 m 60 X s 1008 388 m 61 X s black 1008 388 m20 1 1 0 c 1130 259 m 129 Y s 1130 388 m 128 Y s
 1069 388 m 61 X s 1130 388 m 61 X s black 1130 388 m20 1 1 0 c 1251 255 m 129 Y s 1251 384 m 129 Y s 1191 384 m 60 X s 1251 384 m 61 X s black 1251 384 m20 1 1 0 c 1373 251 m 128 Y s 1373 379 m 128 Y s 1312 379 m 61 X s 1373 379 m 61 X s black 1373
 379 m20 1 1 0 c 1494 245 m 128 Y s 1494 373 m 128 Y s 1434 373 m 60 X s 1494 373 m 61 X s black 1494 373 m20 1 1 0 c 1616 236 m 127 Y s 1616 363 m 127 Y s 1555 363 m 61 X s 1616 363 m 60 X s black 1616 363 m20 1 1 0 c 1737 229 m 127 Y s 1737 356 m
 127 Y s 1676 356 m 61 X s 1737 356 m 61 X s black 1737 356 m20 1 1 0 c 1859 222 m 127 Y s 1859 349 m 127 Y s 1798 349 m 61 X s 1859 349 m 60 X s black 1859 349 m20 1 1 0 c 1980 207 m 126 Y s 1980 333 m 127 Y s 1919 333 m 61 X s 1980 333 m 61 X s
 black 1980 333 m20 0 0 1 c 1 1 1 c black 0 0 1 c 401 430 m 6 Y s 401 436 m 6 Y s 340 436 m 61 X s 401 436 m 61 X s black 401 436 m20 0 0 1 c 522 416 m 6 Y s 522 422 m 7 Y s 462 422 m 60 X s 522 422 m 61 X s black 522 422 m20 0 0 1 c 644 384 m 8 Y s
 644 392 m 7 Y s 583 392 m 61 X s 644 392 m 61 X s black 644 392 m20 0 0 1 c 765 366 m 4 Y s 765 370 m 4 Y s 705 370 m 60 X s 765 370 m 61 X s black 765 370 m20 0 0 1 c 887 353 m 5 Y s 887 358 m 4 Y s 826 358 m 61 X s 887 358 m 61 X s black 887 358
 m20 0 0 1 c 1008 351 m 3 Y s 1008 354 m 3 Y s 948 354 m 60 X s 1008 354 m 61 X s black 1008 354 m20 0 0 1 c 1130 352 m 3 Y s 1130 355 m 3 Y s 1069 355 m 61 X s 1130 355 m 61 X s black 1130 355 m20 0 0 1 c 1251 356 m 2 Y s 1251 358 m 3 Y s 1191 358 m
 60 X s 1251 358 m 61 X s black 1251 358 m20 0 0 1 c 1373 359 m 3 Y s 1373 362 m 3 Y s 1312 362 m 61 X s 1373 362 m 61 X s black 1373 362 m20 0 0 1 c 1494 370 m 3 Y s 1494 373 m 3 Y s 1434 373 m 60 X s 1494 373 m 61 X s black 1494 373 m20 0 0 1 c
 1616 377 m 4 Y s 1616 381 m 5 Y s 1555 381 m 61 X s 1616 381 m 60 X s black 1616 381 m20 0 0 1 c 1737 382 m 5 Y s 1737 387 m 6 Y s 1676 387 m 61 X s 1737 387 m 61 X s black 1737 387 m20 0 0 1 c 1859 393 m 7 Y s 1859 400 m 6 Y s 1798 400 m 61 X s
 1859 400 m 60 X s black 1859 400 m20 0 0 1 c 1980 390 m 12 Y s 1980 402 m 12 Y s 1919 402 m 61 X s 1980 402 m 61 X s black 1980 402 m20 0 1 0 c 1 1 1 c black 0 1 0 c 401 431 m 6 Y s 401 437 m 6 Y s 340 437 m 61 X s 401 437 m 61 X s black 401 437 m20
 0 1 0 c 522 417 m 7 Y s 522 424 m 7 Y s 462 424 m 60 X s 522 424 m 61 X s black 522 424 m20 0 1 0 c 644 389 m 7 Y s 644 396 m 7 Y s 583 396 m 61 X s 644 396 m 61 X s black 644 396 m20 0 1 0 c 765 364 m 5 Y s 765 369 m 5 Y s 705 369 m 60 X s 765 369
 m 61 X s black 765 369 m20 0 1 0 c 887 353 m 6 Y s 887 359 m 6 Y s 826 359 m 61 X s 887 359 m 61 X s black 887 359 m20 0 1 0 c 1008 349 m 4 Y s 1008 353 m 5 Y s 948 353 m 60 X s 1008 353 m 61 X s black 1008 353 m20 0 1 0 c 1130 349 m 4 Y s 1130 353
 m 5 Y s 1069 353 m 61 X s 1130 353 m 61 X s black 1130 353 m20 0 1 0 c 1251 352 m 5 Y s 1251 357 m 4 Y s 1191 357 m 60 X s 1251 357 m 61 X s black 1251 357 m20 0 1 0 c 1373 358 m 5 Y s 1373 363 m 4 Y s 1312 363 m 61 X s 1373 363 m 61 X s black 1373
 363 m20 0 1 0 c 1494 365 m 4 Y s 1494 369 m 4 Y s 1434 369 m 60 X s 1494 369 m 61 X s black 1494 369 m20 0 1 0 c 1616 375 m 6 Y s 1616 381 m 6 Y s 1555 381 m 61 X s 1616 381 m 60 X s black 1616 381 m20 0 1 0 c 1737 381 m 7 Y s 1737 388 m 8 Y s 1676
 388 m 61 X s 1737 388 m 61 X s black 1737 388 m20 0 1 0 c 1859 398 m 8 Y s 1859 406 m 7 Y s 1798 406 m 61 X s 1859 406 m 60 X s black 1859 406 m20 0 1 0 c 1980 395 m 12 Y s 1980 407 m 12 Y s 1919 407 m 61 X s 1980 407 m 61 X s black 1980 407 m20 0 1
 1 c 1 1 1 c black 0 1 1 c 401 208 m 166 Y s 401 374 m 167 Y s 340 374 m 61 X s 401 374 m 61 X s black 401 374 m20 0 1 1 c 522 206 m 166 Y s 522 372 m 166 Y s 462 372 m 60 X s 522 372 m 61 X s black 522 372 m20 0 1 1 c 644 207 m 167 Y s 644 374 m 166
 Y s 583 374 m 61 X s 644 374 m 61 X s black 644 374 m20 0 1 1 c 765 205 m 166 Y s 765 371 m 166 Y s 705 371 m 60 X s 765 371 m 61 X s black 765 371 m20 0 1 1 c 887 206 m 166 Y s 887 372 m 166 Y s 826 372 m 61 X s 887 372 m 61 X s black 887 372 m20 0
 1 1 c 1008 204 m 166 Y s 1008 370 m 167 Y s 948 370 m 60 X s 1008 370 m 61 X s black 1008 370 m20 0 1 1 c 1130 204 m 166 Y s 1130 370 m 166 Y s 1069 370 m 61 X s 1130 370 m 61 X s black 1130 370 m20 0 1 1 c 1251 206 m 166 Y s 1251 372 m 166 Y s 1191
 372 m 60 X s 1251 372 m 61 X s black 1251 372 m20 0 1 1 c 1373 205 m 167 Y s 1373 372 m 166 Y s 1312 372 m 61 X s 1373 372 m 61 X s black 1373 372 m20 0 1 1 c 1494 203 m 167 Y s 1494 370 m 166 Y s 1434 370 m 60 X s 1494 370 m 61 X s black 1494 370
 m20 0 1 1 c 1616 207 m 167 Y s 1616 374 m 167 Y s 1555 374 m 61 X s 1616 374 m 60 X s black 1616 374 m20 0 1 1 c 1737 210 m 167 Y s 1737 377 m 167 Y s 1676 377 m 61 X s 1737 377 m 61 X s black 1737 377 m20 0 1 1 c 1859 206 m 167 Y s 1859 373 m 167 Y
 s 1798 373 m 61 X s 1859 373 m 60 X s black 1859 373 m20 0 1 1 c 1980 213 m 168 Y s 1980 381 m 169 Y s 1919 381 m 61 X s 1980 381 m 61 X s black 1980 381 m20 1 1 1 c black 401 367 m 5 Y s 401 372 m 6 Y s 340 372 m 61 X s 401 372 m 61 X s 401 372 m20
 522 365 m 7 Y s 522 372 m 7 Y s 462 372 m 60 X s 522 372 m 61 X s 522 372 m20 644 365 m 7 Y s 644 372 m 8 Y s 583 372 m 61 X s 644 372 m 61 X s 644 372 m20 765 368 m 4 Y s 765 372 m 5 Y s 705 372 m 60 X s 765 372 m 61 X s 765 372 m20 887 367 m 5 Y s
 887 372 m 5 Y s 826 372 m 61 X s 887 372 m 61 X s 887 372 m20 1008 369 m 3 Y s 1008 372 m 3 Y s 948 372 m 60 X s 1008 372 m 61 X s 1008 372 m20 1130 369 m 3 Y s 1130 372 m 3 Y s 1069 372 m 61 X s 1130 372 m 61 X s 1130 372 m20 1251 370 m 2 Y s 1251
 372 m 3 Y s 1191 372 m 60 X s 1251 372 m 61 X s 1251 372 m20 1373 369 m 3 Y s 1373 372 m 3 Y s 1312 372 m 61 X s 1373 372 m 61 X s 1373 372 m20 1494 369 m 3 Y s 1494 372 m 3 Y s 1434 372 m 60 X s 1494 372 m 61 X s 1494 372 m20 1616 368 m 4 Y s 1616
 372 m 4 Y s 1555 372 m 61 X s 1616 372 m 60 X s 1616 372 m20 1737 366 m 6 Y s 1737 372 m 7 Y s 1676 372 m 61 X s 1737 372 m 61 X s 1737 372 m20 1859 366 m 6 Y s 1859 372 m 6 Y s 1798 372 m 61 X s 1859 372 m 60 X s 1859 372 m20 1980 360 m 12 Y s 1980
 372 m 13 Y s 1919 372 m 61 X s 1980 372 m 61 X s 1980 372 m20 1 0 1 c 1 1 1 c black 1 0 1 c 401 308 m 6 Y s 401 314 m 5 Y s 340 314 m 61 X s 401 314 m 61 X s black 401 314 m20 1 0 1 c 522 322 m 7 Y s 522 329 m 7 Y s 462 329 m 60 X s 522 329 m 61 X s
 black 522 329 m20 1 0 1 c 644 352 m 7 Y s 644 359 m 8 Y s 583 359 m 61 X s 644 359 m 61 X s black 644 359 m20 1 0 1 c 765 366 m 4 Y s 765 370 m 4 Y s 705 370 m 60 X s 765 370 m 61 X s black 765 370 m20 1 0 1 c 887 382 m 5 Y s 887 387 m 5 Y s 826 387
 m 61 X s 887 387 m 61 X s black 887 387 m20 1 0 1 c 1008 385 m 3 Y s 1008 388 m 4 Y s 948 388 m 60 X s 1008 388 m 61 X s black 1008 388 m20 1 0 1 c 1130 386 m 2 Y s 1130 388 m 3 Y s 1069 388 m 61 X s 1130 388 m 61 X s black 1130 388 m20 1 0 1 c 1251
 384 m 3 Y s 1251 387 m 3 Y s 1191 387 m 60 X s 1251 387 m 61 X s black 1251 387 m20 1 0 1 c 1373 377 m 3 Y s 1373 380 m 3 Y s 1312 380 m 61 X s 1373 380 m 61 X s black 1373 380 m20 1 0 1 c 1494 370 m 3 Y s 1494 373 m 3 Y s 1434 373 m 60 X s 1494 373
 m 61 X s black 1494 373 m20 1 0 1 c 1616 362 m 4 Y s 1616 366 m 4 Y s 1555 366 m 61 X s 1616 366 m 60 X s black 1616 366 m20 1 0 1 c 1737 346 m 6 Y s 1737 352 m 5 Y s 1676 352 m 61 X s 1737 352 m 61 X s black 1737 352 m20 1 0 1 c 1859 337 m 7 Y s
 1859 344 m 6 Y s 1798 344 m 61 X s 1859 344 m 60 X s black 1859 344 m20 1 0 1 c 1980 321 m 12 Y s 1980 333 m 12 Y s 1919 333 m 61 X s 1980 333 m 61 X s black 1980 333 m20 1 0 0 c 1 1 1 c black 1 0 0 c 401 364 m 5 Y s 401 369 m 6 Y s 340 369 m 61 X s
 401 369 m 61 X s black 401 369 m20 1 0 0 c 522 363 m 7 Y s 522 370 m 6 Y s 462 370 m 60 X s 522 370 m 61 X s black 522 370 m20 1 0 0 c 644 362 m 7 Y s 644 369 m 7 Y s 583 369 m 61 X s 644 369 m 61 X s black 644 369 m20 1 0 0 c 765 367 m 4 Y s 765
 371 m 4 Y s 705 371 m 60 X s 765 371 m 61 X s black 765 371 m20 1 0 0 c 887 367 m 5 Y s 887 372 m 5 Y s 826 372 m 61 X s 887 372 m 61 X s black 887 372 m20 1 0 0 c 1008 369 m 4 Y s 1008 373 m 3 Y s 948 373 m 60 X s 1008 373 m 61 X s black 1008 373
 m20 1 0 0 c 1130 370 m 3 Y s 1130 373 m 3 Y s 1069 373 m 61 X s 1130 373 m 61 X s black 1130 373 m20 1 0 0 c 1251 372 m 3 Y s 1251 375 m 3 Y s 1191 375 m 60 X s 1251 375 m 61 X s black 1251 375 m20 1 0 0 c 1373 371 m 3 Y s 1373 374 m 3 Y s 1312 374
 m 61 X s 1373 374 m 61 X s black 1373 374 m20 1 0 0 c 1494 370 m 3 Y s 1494 373 m 3 Y s 1434 373 m 60 X s 1494 373 m 61 X s black 1494 373 m20 1 0 0 c 1616 369 m 4 Y s 1616 373 m 4 Y s 1555 373 m 61 X s 1616 373 m 60 X s black 1616 373 m20 1 0 0 c
 1737 365 m 6 Y s 1737 371 m 6 Y s 1676 371 m 61 X s 1737 371 m 61 X s black 1737 371 m20 1 0 0 c 1859 362 m 8 Y s 1859 370 m 7 Y s 1798 370 m 61 X s 1859 370 m 60 X s black 1859 370 m20 1 0 0 c 1980 351 m 12 Y s 1980 363 m 12 Y s 1919 363 m 61 X s
 1980 363 m 61 X s black 1980 363 m20 1 1 1 c black 401 367 m 5 Y s 401 372 m 6 Y s 340 372 m 61 X s 401 372 m 61 X s 401 372 m20 522 365 m 7 Y s 522 372 m 7 Y s 462 372 m 60 X s 522 372 m 61 X s 522 372 m20 644 365 m 7 Y s 644 372 m 8 Y s 583 372 m
 61 X s 644 372 m 61 X s 644 372 m20 765 368 m 4 Y s 765 372 m 5 Y s 705 372 m 60 X s 765 372 m 61 X s 765 372 m20 887 367 m 5 Y s 887 372 m 5 Y s 826 372 m 61 X s 887 372 m 61 X s 887 372 m20 1008 369 m 3 Y s 1008 372 m 3 Y s 948 372 m 60 X s 1008
 372 m 61 X s 1008 372 m20 1130 369 m 3 Y s 1130 372 m 3 Y s 1069 372 m 61 X s 1130 372 m 61 X s 1130 372 m20 1251 370 m 2 Y s 1251 372 m 3 Y s 1191 372 m 60 X s 1251 372 m 61 X s 1251 372 m20 1373 369 m 3 Y s 1373 372 m 3 Y s 1312 372 m 61 X s 1373
 372 m 61 X s 1373 372 m20 1494 369 m 3 Y s 1494 372 m 3 Y s 1434 372 m 60 X s 1494 372 m 61 X s 1494 372 m20 1616 368 m 4 Y s 1616 372 m 4 Y s 1555 372 m 61 X s 1616 372 m 60 X s 1616 372 m20 1737 366 m 6 Y s 1737 372 m 7 Y s 1676 372 m 61 X s 1737
 372 m 61 X s 1737 372 m20 1859 366 m 6 Y s 1859 372 m 6 Y s 1798 372 m 61 X s 1859 372 m 60 X s 1859 372 m20 1980 360 m 12 Y s 1980 372 m 13 Y s 1919 372 m 61 X s 1980 372 m 61 X s 1980 372 m20
 gsave  2268 1538 0 0 C 1671.46 1462.94 t 0 r /Helvetica-Bold findfont 42.3568 sf 0 0 m (SF:CutSR_1jet/MT) show NC gr  1 1 1 c 409 430 1587 923 bf black
 gsave  2268 1538 0 0 C 1844.15 1316.32 t 0 r /Helvetica-Bold findfont 42.3568 sf 0 0 m (=2) show NC gr 
 gsave  2268 1538 0 0 C 1824.6 1293.51 t 0 r /Helvetica-Bold findfont 29.3239 sf 0 0 m (F) show NC gr 
 gsave  2268 1538 0 0 C 1801.79 1316.32 t 0 r /Symbol findfont 42.3568 sf 0 0 m (x) show NC gr 
 gsave  2268 1538 0 0 C 1733.37 1316.32 t 0 r /Helvetica-Bold findfont 42.3568 sf 0 0 m (=2, ) show NC gr 
 gsave  2268 1538 0 0 C 1710.56 1293.51 t 0 r /Helvetica-Bold findfont 29.3239 sf 0 0 m (R) show NC gr 
 gsave  2268 1538 0 0 C 1687.75 1316.32 t 0 r /Symbol findfont 42.3568 sf 0 0 m (x) show NC gr  1 1 1 c 1603 1301 m 71 X 43 Y -71 X f 1 1 0 c 1603 1323 m 71 X s black 1638 1323 m20
 gsave  2268 1538 0 0 C 1879.99 1257.67 t 0 r /Helvetica-Bold findfont 42.3568 sf 0 0 m (=1/2) show NC gr 
 gsave  2268 1538 0 0 C 1860.44 1234.86 t 0 r /Helvetica-Bold findfont 29.3239 sf 0 0 m (F) show NC gr 
 gsave  2268 1538 0 0 C 1837.63 1257.67 t 0 r /Symbol findfont 42.3568 sf 0 0 m (x) show NC gr 
 gsave  2268 1538 0 0 C 1733.37 1257.67 t 0 r /Helvetica-Bold findfont 42.3568 sf 0 0 m (=1/2, ) show NC gr 
 gsave  2268 1538 0 0 C 1710.56 1234.86 t 0 r /Helvetica-Bold findfont 29.3239 sf 0 0 m (R) show NC gr 
 gsave  2268 1538 0 0 C 1687.75 1257.67 t 0 r /Symbol findfont 42.3568 sf 0 0 m (x) show NC gr  1 1 1 c 1603 1240 m 71 X 43 Y -71 X f 0 0 1 c 1603 1261 m 71 X s black 1638 1261 m20
 gsave  2268 1538 0 0 C 1844.15 1195.76 t 0 r /Helvetica-Bold findfont 42.3568 sf 0 0 m (=1) show NC gr 
 gsave  2268 1538 0 0 C 1824.6 1172.96 t 0 r /Helvetica-Bold findfont 29.3239 sf 0 0 m (F) show NC gr 
 gsave  2268 1538 0 0 C 1801.79 1195.76 t 0 r /Symbol findfont 42.3568 sf 0 0 m (x) show NC gr 
 gsave  2268 1538 0 0 C 1733.37 1195.76 t 0 r /Helvetica-Bold findfont 42.3568 sf 0 0 m (=2, ) show NC gr 
 gsave  2268 1538 0 0 C 1710.56 1172.96 t 0 r /Helvetica-Bold findfont 29.3239 sf 0 0 m (R) show NC gr 
 gsave  2268 1538 0 0 C 1687.75 1195.76 t 0 r /Symbol findfont 42.3568 sf 0 0 m (x) show NC gr  1 1 1 c 1603 1178 m 71 X 43 Y -71 X f 0 1 1 c 1603 1200 m 71 X s black 1638 1200 m20
 gsave  2268 1538 0 0 C 1844.15 1133.86 t 0 r /Helvetica-Bold findfont 42.3568 sf 0 0 m (=1/2) show NC gr 
 gsave  2268 1538 0 0 C 1824.6 1111.05 t 0 r /Helvetica-Bold findfont 29.3239 sf 0 0 m (F) show NC gr 
 gsave  2268 1538 0 0 C 1801.79 1133.86 t 0 r /Symbol findfont 42.3568 sf 0 0 m (x) show NC gr 
 gsave  2268 1538 0 0 C 1733.37 1133.86 t 0 r /Helvetica-Bold findfont 42.3568 sf 0 0 m (=1, ) show NC gr 
 gsave  2268 1538 0 0 C 1710.56 1111.05 t 0 r /Helvetica-Bold findfont 29.3239 sf 0 0 m (R) show NC gr 
 gsave  2268 1538 0 0 C 1687.75 1133.86 t 0 r /Symbol findfont 42.3568 sf 0 0 m (x) show NC gr  1 1 1 c 1603 1116 m 71 X 44 Y -71 X f 0 1 0 c 1603 1138 m 71 X s black 1638 1138 m20
 gsave  2268 1538 0 0 C 1844.15 1071.95 t 0 r /Helvetica-Bold findfont 42.3568 sf 0 0 m (=1) show NC gr 
 gsave  2268 1538 0 0 C 1824.6 1049.14 t 0 r /Helvetica-Bold findfont 29.3239 sf 0 0 m (F) show NC gr 
 gsave  2268 1538 0 0 C 1801.79 1071.95 t 0 r /Symbol findfont 42.3568 sf 0 0 m (x) show NC gr 
 gsave  2268 1538 0 0 C 1733.37 1071.95 t 0 r /Helvetica-Bold findfont 42.3568 sf 0 0 m (=1, ) show NC gr 
 gsave  2268 1538 0 0 C 1710.56 1049.14 t 0 r /Helvetica-Bold findfont 29.3239 sf 0 0 m (R) show NC gr 
 gsave  2268 1538 0 0 C 1687.75 1071.95 t 0 r /Symbol findfont 42.3568 sf 0 0 m (x) show NC gr  1 1 1 c 1603 1055 m 71 X 43 Y -71 X f black 1603 1077 m 71 X s 1638 1077 m20
 gsave  2268 1538 0 0 C 1844.15 1010.05 t 0 r /Helvetica-Bold findfont 42.3568 sf 0 0 m (=2) show NC gr 
 gsave  2268 1538 0 0 C 1824.6 987.239 t 0 r /Helvetica-Bold findfont 29.3239 sf 0 0 m (F) show NC gr 
 gsave  2268 1538 0 0 C 1801.79 1010.05 t 0 r /Symbol findfont 42.3568 sf 0 0 m (x) show NC gr 
 gsave  2268 1538 0 0 C 1733.37 1010.05 t 0 r /Helvetica-Bold findfont 42.3568 sf 0 0 m (=1, ) show NC gr 
 gsave  2268 1538 0 0 C 1710.56 987.239 t 0 r /Helvetica-Bold findfont 29.3239 sf 0 0 m (R) show NC gr 
 gsave  2268 1538 0 0 C 1687.75 1010.05 t 0 r /Symbol findfont 42.3568 sf 0 0 m (x) show NC gr  1 1 1 c 1603 993 m 71 X 44 Y -71 X f 1 0 1 c 1603 1015 m 71 X s black 1638 1015 m20
 gsave  2268 1538 0 0 C 1879.99 948.14 t 0 r /Helvetica-Bold findfont 42.3568 sf 0 0 m (=1) show NC gr 
 gsave  2268 1538 0 0 C 1860.44 925.333 t 0 r /Helvetica-Bold findfont 29.3239 sf 0 0 m (F) show NC gr 
 gsave  2268 1538 0 0 C 1837.63 948.14 t 0 r /Symbol findfont 42.3568 sf 0 0 m (x) show NC gr 
 gsave  2268 1538 0 0 C 1733.37 948.14 t 0 r /Helvetica-Bold findfont 42.3568 sf 0 0 m (=1/2, ) show NC gr 
 gsave  2268 1538 0 0 C 1710.56 925.333 t 0 r /Helvetica-Bold findfont 29.3239 sf 0 0 m (R) show NC gr 
 gsave  2268 1538 0 0 C 1687.75 948.14 t 0 r /Symbol findfont 42.3568 sf 0 0 m (x) show NC gr  1 1 1 c 1603 932 m 71 X 43 Y -71 X f 1 0 0 c 1603 953 m 71 X s black 1638 953 m20
 gr  gr showpage
end
%%EOF
