%!PS-Adobe-2.0 EPSF-2.0
%%BoundingBox:  0 0 567 544
%%Title: HWW_600_met_rel_NNLO_cut_YR3.eps: HWW 600Gev MET rel NNLO with cuts
%%Creator: ROOT Version 5.34/05
%%CreationDate: Fri Jun 14 04:56:10 2013
%%EndComments
%%BeginProlog
80 dict begin
/s {stroke} def /l {lineto} def /m {moveto} def /t {translate} def
/r {rotate} def /rl {roll}  def /R {repeat} def
/d {rlineto} def /rm {rmoveto} def /gr {grestore} def /f {eofill} def
/c {setrgbcolor} def /black {0 setgray} def /sd {setdash} def
/cl {closepath} def /sf {scalefont setfont} def /lw {setlinewidth} def
/box {m dup 0 exch d exch 0 d 0 exch neg d cl} def
/NC{systemdict begin initclip end}def/C{NC box clip newpath}def
/bl {box s} def /bf {box f} def /Y { 0 exch d} def /X { 0 d} def 
/K {{pop pop 0 moveto} exch kshow} bind def
/ita {/ang 15 def gsave [1 0 ang dup sin exch cos div 1 0 0] concat} def 
/mp {newpath /y exch def /x exch def} def
/side {[w .77 mul w .23 mul] .385 w mul sd w 0 l currentpoint t -144 r} def
/mr {mp x y w2 0 360 arc} def /m24 {mr s} def /m20 {mr f} def
/mb {mp x y w2 add m w2 neg 0 d 0 w neg d w 0 d 0 w d cl} def
/mt {mp x y w2 add m w2 neg w neg d w 0 d cl} def
/m21 {mb f} def /m25 {mb s} def /m22 {mt f} def /m26{mt s} def
/m23 {mp x y w2 sub m w2 w d w neg 0 d cl f} def
/m27 {mp x y w2 add m w3 neg w2 neg d w3 w2 neg d w3 w2 d cl s} def
/m28 {mp x w2 sub y w2 sub w3 add m w3 0 d  0 w3 neg d w3 0 d 0 w3 d w3 0 d  0 w3 d w3 neg 0 d 0 w3 d w3 neg 0 d 0 w3 neg d w3 neg 0 d cl s } def
/m29 {mp gsave x w2 sub y w2 add w3 sub m currentpoint t 4 {side} repeat cl fill gr} def
/m30 {mp gsave x w2 sub y w2 add w3 sub m currentpoint t 4 {side} repeat cl s gr} def
/m31 {mp x y w2 sub m 0 w d x w2 sub y m w 0 d x w2 sub y w2 add m w w neg d x w2 sub y w2 sub m w w d s} def
/m32 {mp x y w2 sub m w2 w d w neg 0 d cl s} def
/m33 {mp x y w2 add m w3 neg w2 neg d w3 w2 neg d w3 w2 d cl f} def
/m34 {mp x w2 sub y w2 sub w3 add m w3 0 d  0 w3 neg d w3 0 d 0 w3 d w3 0 d  0 w3 d w3 neg 0 d 0 w3 d w3 neg 0 d 0 w3 neg d w3 neg 0 d cl f } def
/m2 {mp x y w2 sub m 0 w d x w2 sub y m w 0 d s} def
/m5 {mp x w2 sub y w2 sub m w w d x w2 sub y w2 add m w w neg d s} def
/reEncode {exch findfont dup length dict begin {1 index /FID eq  {pop pop} {def} ifelse } forall /Encoding exch def currentdict end dup /FontName get exch definefont pop } def [/Times-Bold /Times-Italic /Times-BoldItalic /Helvetica /Helvetica-Oblique
 /Helvetica-Bold /Helvetica-BoldOblique /Courier /Courier-Oblique /Courier-Bold /Courier-BoldOblique /Times-Roman /AvantGarde-Book /AvantGarde-BookOblique /AvantGarde-Demi /AvantGarde-DemiOblique /Bookman-Demi /Bookman-DemiItalic /Bookman-Light
 /Bookman-LightItalic /Helvetica-Narrow /Helvetica-Narrow-Bold /Helvetica-Narrow-BoldOblique /Helvetica-Narrow-Oblique /NewCenturySchlbk-Roman /NewCenturySchlbk-Bold /NewCenturySchlbk-BoldItalic /NewCenturySchlbk-Italic /Palatino-Bold
 /Palatino-BoldItalic /Palatino-Italic /Palatino-Roman ] {ISOLatin1Encoding reEncode } forall
%%EndProlog
%%BeginSetup
%%EndSetup
newpath  gsave  .25 .25 scale  gsave  0 0 t black[  ] 0 sd 3 lw 1 1 1 c 2268 2177 0 0 bf black 1 1 1 c 2222 2133 23 22 bf black 1 1 1 c 1778 1706 245 235 bf black 1778 1706 245 235 bl 0.8 0 0.8 c 1 1 1 c 1 0 1 c 0.8 0 0.8 c 245 854 m 18 X 2 Y 17 X 14
 Y 18 X -6 Y 18 X 12 Y 18 X 13 Y 18 X 18 Y 17 X 13 Y 18 X 24 Y 18 X 26 Y 18 X 27 Y 17 X 14 Y 18 X 35 Y 18 X 21 Y 18 X 4 Y 18 X 25 Y 17 X 30 Y 18 X 14 Y 18 X 38 Y 18 X 46 Y 17 X 55 Y 18 X 73 Y 18 X 296 Y 18 X 208 Y 18 X 2 Y 17 X 2 Y 18 X -4 Y 18 X -10
 Y 18 X -12 Y 18 X -14 Y 17 X -6 Y 18 X 5 Y 18 X -17 Y 18 X -13 Y 17 X -29 Y 18 X -53 Y 18 X -14 Y 18 X -62 Y 18 X -46 Y 17 X -88 Y 18 X -144 Y 18 X -132 Y 18 X -86 Y 17 X -83 Y 18 X -64 Y 18 X -75 Y 18 X -63 Y 18 X -41 Y 17 X -67 Y 18 X -35 Y 18 X
 -35 Y 18 X -45 Y 17 X -32 Y 18 X -27 Y 18 X -32 Y 18 X -22 Y 18 X -21 Y 17 X -28 Y 18 X -22 Y 18 X -12 Y 18 X -20 Y 17 X -11 Y 18 X -12 Y 18 X -15 Y 18 X -14 Y 18 X -10 Y 17 X -8 Y 18 X -9 Y 18 X -6 Y 18 X -12 Y 17 X -4 Y 18 X -7 Y 18 X -5 Y 18 X -4
 Y 18 X -4 Y 17 X -6 Y 18 X -3 Y 18 X -5 Y 18 X -4 Y 17 X -3 Y 18 X -2 Y 18 X -2 Y 18 X -3 Y 18 X -3 Y 17 X -1 Y 18 X -3 Y 18 X -1 Y 18 X -1 Y 17 X -2 Y 18 X -1 Y 18 X -2 Y 18 X -1 Y 18 X -1 Y 17 X -1 Y 18 X -1 Y 18 X -1 Y 35 X -1 Y 18 X -1 Y 36 X s
 black 245 235 m 1778 X s
 gsave  2222 2133 23 22 C 1925.85 75.9704 t 0 r /Helvetica findfont 45.6261 sf 0 0 m (T,rel) show NC gr 
 gsave  2222 2133 23 22 C 1925.85 129.15 t 0 r /Helvetica findfont 45.6261 sf 0 0 m (miss) show NC gr 
 gsave  2222 2133 23 22 C 1880.27 94.963 t 0 r /Helvetica findfont 68.4392 sf 0 0 m (E) show NC gr  245 286 m -51 Y s 289 261 m -26 Y s 334 261 m -26 Y s 378 261 m -26 Y s 423 286 m -51 Y s 467 261 m -26 Y s 512 261 m -26 Y s 556 261 m -26 Y s 600
 286 m -51 Y s 645 261 m -26 Y s 689 261 m -26 Y s 734 261 m -26 Y s 778 286 m -51 Y s 823 261 m -26 Y s 867 261 m -26 Y s 912 261 m -26 Y s 956 286 m -51 Y s 1001 261 m -26 Y s 1045 261 m -26 Y s 1089 261 m -26 Y s 1134 286 m -51 Y s 1178 261 m -26
 Y s 1223 261 m -26 Y s 1267 261 m -26 Y s 1312 286 m -51 Y s 1356 261 m -26 Y s 1401 261 m -26 Y s 1445 261 m -26 Y s 1489 286 m -51 Y s 1534 261 m -26 Y s 1578 261 m -26 Y s 1623 261 m -26 Y s 1667 286 m -51 Y s 1712 261 m -26 Y s 1756 261 m -26 Y
 s 1801 261 m -26 Y s 1845 286 m -51 Y s 1889 261 m -26 Y s 1934 261 m -26 Y s 1978 261 m -26 Y s 2023 286 m -51 Y s
 gsave  2222 2133 23 22 C 224.113 167.135 t 0 r /Helvetica findfont 68.4392 sf 0 0 m (0) show NC gr 
 gsave  2222 2133 23 22 C 383.651 167.135 t 0 r /Helvetica findfont 68.4392 sf 0 0 m (20) show NC gr 
 gsave  2222 2133 23 22 C 562.181 167.135 t 0 r /Helvetica findfont 68.4392 sf 0 0 m (40) show NC gr 
 gsave  2222 2133 23 22 C 736.913 167.135 t 0 r /Helvetica findfont 68.4392 sf 0 0 m (60) show NC gr 
 gsave  2222 2133 23 22 C 915.443 167.135 t 0 r /Helvetica findfont 68.4392 sf 0 0 m (80) show NC gr 
 gsave  2222 2133 23 22 C 1074.98 167.135 t 0 r /Helvetica findfont 68.4392 sf 0 0 m (100) show NC gr 
 gsave  2222 2133 23 22 C 1253.51 167.135 t 0 r /Helvetica findfont 68.4392 sf 0 0 m (120) show NC gr 
 gsave  2222 2133 23 22 C 1432.04 167.135 t 0 r /Helvetica findfont 68.4392 sf 0 0 m (140) show NC gr 
 gsave  2222 2133 23 22 C 1606.77 167.135 t 0 r /Helvetica findfont 68.4392 sf 0 0 m (160) show NC gr 
 gsave  2222 2133 23 22 C 1785.3 167.135 t 0 r /Helvetica findfont 68.4392 sf 0 0 m (180) show NC gr 
 gsave  2222 2133 23 22 C 1963.83 167.135 t 0 r /Helvetica findfont 68.4392 sf 0 0 m (200) show NC gr  245 235 m 1706 Y s
 gsave  2222 2133 23 22 C 106.359 1135.76 t 90 r /Helvetica findfont 45.6261 sf 0 0 m (T,rel) show NC gr 
 gsave  2222 2133 23 22 C 45.5822 1135.76 t 90 r /Helvetica findfont 45.6261 sf 0 0 m (miss) show NC gr 
 gsave  2222 2133 23 22 C 83.5674 1029.4 t 90 r /Helvetica findfont 68.4392 sf 0 0 m (/dE) show NC gr 
 gsave  2222 2133 23 22 C 83.5674 987.615 t 90 r /Symbol findfont 68.4392 sf 0 0 m (s) show NC gr 
 gsave  2222 2133 23 22 C 79.7689 953.429 t 90 r /Helvetica findfont 68.4392 sf 0 0 m (d) show NC gr  298 235 m -53 X s 272 272 m -27 X s 272 309 m -27 X s 272 345 m -27 X s 272 382 m -27 X s 298 419 m -53 X s 272 455 m -27 X s 272 492 m -27 X s 272
 529 m -27 X s 272 566 m -27 X s 298 602 m -53 X s 272 639 m -27 X s 272 676 m -27 X s 272 713 m -27 X s 272 749 m -27 X s 298 786 m -53 X s 272 823 m -27 X s 272 860 m -27 X s 272 896 m -27 X s 272 933 m -27 X s 298 970 m -53 X s 272 1007 m -27 X s
 272 1043 m -27 X s 272 1080 m -27 X s 272 1117 m -27 X s 298 1154 m -53 X s 272 1190 m -27 X s 272 1227 m -27 X s 272 1264 m -27 X s 272 1300 m -27 X s 298 1337 m -53 X s 272 1374 m -27 X s 272 1411 m -27 X s 272 1447 m -27 X s 272 1484 m -27 X s
 298 1521 m -53 X s 272 1558 m -27 X s 272 1594 m -27 X s 272 1631 m -27 X s 272 1668 m -27 X s 298 1705 m -53 X s 272 1741 m -27 X s 272 1778 m -27 X s 272 1815 m -27 X s 272 1852 m -27 X s 298 1888 m -53 X s 298 1888 m -53 X s 272 1925 m -27 X s
 gsave  2222 2133 23 22 C 208.919 220.314 t 0 r /Helvetica findfont 38.0218 sf 0 0 m (0) show NC gr 
 gsave  2222 2133 23 22 C 136.747 406.442 t 0 r /Helvetica findfont 38.0218 sf 0 0 m (0.005) show NC gr 
 gsave  2222 2133 23 22 C 163.336 588.771 t 0 r /Helvetica findfont 38.0218 sf 0 0 m (0.01) show NC gr 
 gsave  2222 2133 23 22 C 136.747 771.1 t 0 r /Helvetica findfont 38.0218 sf 0 0 m (0.015) show NC gr 
 gsave  2222 2133 23 22 C 155.739 957.227 t 0 r /Helvetica findfont 38.0218 sf 0 0 m (0.02) show NC gr 
 gsave  2222 2133 23 22 C 136.747 1139.56 t 0 r /Helvetica findfont 38.0218 sf 0 0 m (0.025) show NC gr 
 gsave  2222 2133 23 22 C 159.538 1325.68 t 0 r /Helvetica findfont 38.0218 sf 0 0 m (0.03) show NC gr 
 gsave  2222 2133 23 22 C 136.747 1508.01 t 0 r /Helvetica findfont 38.0218 sf 0 0 m (0.035) show NC gr 
 gsave  2222 2133 23 22 C 155.739 1690.34 t 0 r /Helvetica findfont 38.0218 sf 0 0 m (0.04) show NC gr 
 gsave  2222 2133 23 22 C 136.747 1876.47 t 0 r /Helvetica findfont 38.0218 sf 0 0 m (0.045) show NC gr  0.8 0 0.8 c 1 0 1 c /w 2 def /w2 {w 2 div} def /w3 {w 3 div} def 254 854 m20 272 856 m20 289 870 m20 307 864 m20 325 876 m20 343 889 m20 360 907
 m20 378 920 m20 396 944 m20 414 970 m20 432 997 m20 449 1011 m20 467 1046 m20 485 1067 m20 503 1071 m20 520 1096 m20 538 1126 m20 556 1140 m20 574 1178 m20 592 1224 m20 609 1279 m20 627 1352 m20 645 1648 m20 663 1856 m20 680 1858 m20 698 1860 m20
 716 1856 m20 734 1846 m20 752 1834 m20 769 1820 m20 787 1814 m20 805 1819 m20 823 1802 m20 841 1789 m20 858 1760 m20 876 1707 m20 894 1693 m20 912 1631 m20 929 1585 m20 947 1497 m20 965 1353 m20 983 1221 m20 1001 1135 m20 1018 1052 m20 1036 988 m20
 1054 913 m20 1072 850 m20 1089 809 m20 1107 742 m20 1125 707 m20 1143 672 m20 1161 627 m20 1178 595 m20 1196 568 m20 1214 536 m20 1232 514 m20 1249 493 m20 1267 465 m20 1285 443 m20 1303 431 m20 1321 411 m20 1338 400 m20 1356 388 m20 1374 373 m20
 1392 359 m20 1409 349 m20 1427 341 m20 1445 332 m20 1463 326 m20 1481 314 m20 1498 310 m20 1516 303 m20 1534 298 m20 1552 294 m20 1569 290 m20 1587 284 m20 1605 281 m20 1623 276 m20 1641 272 m20 1658 269 m20 1676 267 m20 1694 265 m20 1712 262 m20
 1729 259 m20 1747 258 m20 1765 255 m20 1783 254 m20 1801 253 m20 1818 251 m20 1836 250 m20 1854 248 m20 1872 247 m20 1889 246 m20 1907 245 m20 1925 244 m20 1943 243 m20 1961 243 m20 1978 242 m20 1996 241 m20 2014 241 m20 0.8 0 0.8 c black 0.8 0 0.8
 c 1 lw << /PatternType 1 /PaintType 2 /TilingType 1 /BBox [ 0 0 100 100 ] /XStep 100 /YStep 100 /PaintProc { begin gsave 0 0 m 100 100 l 0 100 m 100 0 l s gr end } >> [ 0.24 0 0 0.24 0 0 ] makepattern /P13 exch def /cs {[/Pattern /DeviceRGB]
 setcolorspace} def /FA {f [/DeviceRGB] setcolorspace} def cs 0.8 0 0.8 P13 setcolor 254 858 m 18 2 d 17 15 d 18 -6 d 18 12 d 18 13 d 17 18 d 18 13 d 18 24 d 18 26 d 18 27 d 17 14 d 18 36 d 18 20 d 18 5 d 17 25 d 18 29 d 18 14 d 18 39 d 18 46 d 17 55
 d 18 74 d 18 297 d 18 209 d 17 2 d 18 2 d 18 -4 d 18 -10 d 18 -12 d 17 -14 d 18 -6 d 18 6 d 18 -17 d 18 -13 d 17 -29 d 18 -54 d 18 -14 d 18 -62 d 17 -46 d 18 -88 d 18 -145 d 18 -133 d 18 -87 d 17 -82 d 18 -66 d 18 -75 d 18 -63 d 17 -41 d 18 -67 d 18
 -36 d 18 -35 d 18 -45 d 17 -32 d 18 -28 d 18 -32 d 18 -22 d 17 -21 d 18 -29 d 18 -21 d 18 -13 d 18 -20 d 17 -12 d 18 -11 d 18 -15 d 18 -14 d 17 -11 d 18 -8 d 18 -9 d 18 -6 d 18 -12 d 17 -4 d 18 -7 d 18 -5 d 18 -4 d 17 -5 d 18 -5 d 18 -3 d 18 -6 d 18
 -3 d 17 -3 d 18 -2 d 18 -3 d 18 -3 d 17 -2 d 18 -2 d 18 -2 d 18 -2 d 18 -1 d 17 -2 d 18 -1 d 18 -2 d 18 -1 d 17 -1 d 18 X 18 -1 d 18 -2 d 18 X 17 -1 d 18 -1 d 18 X -18 X -18 1 d -17 X -18 1 d -18 1 d -18 1 d -18 1 d -17 1 d -18 1 d -18 1 d -18 2 d
 -17 1 d -18 1 d -18 2 d -18 2 d -18 2 d -17 2 d -18 3 d -18 3 d -18 2 d -17 3 d -18 3 d -18 5 d -18 3 d -18 6 d -17 4 d -18 4 d -18 5 d -18 7 d -17 4 d -18 11 d -18 7 d -18 9 d -18 7 d -17 11 d -18 14 d -18 14 d -18 12 d -17 11 d -18 19 d -18 13 d
 -18 21 d -18 29 d -17 21 d -18 21 d -18 32 d -18 27 d -17 31 d -18 45 d -18 35 d -18 35 d -18 66 d -17 41 d -18 63 d -18 74 d -18 64 d -17 82 d -18 86 d -18 131 d -18 143 d -18 88 d -17 46 d -18 62 d -18 14 d -18 53 d -17 29 d -18 13 d -18 17 d -18
 -5 d -18 6 d -17 14 d -18 12 d -18 10 d -18 4 d -18 -2 d -17 -1 d -18 -208 d -18 -294 d -18 -73 d -17 -55 d -18 -46 d -18 -38 d -18 -14 d -18 -29 d -17 -25 d -18 -5 d -18 -20 d -18 -35 d -17 -14 d -18 -27 d -18 -26 d -18 -24 d -18 -13 d -17 -18 d
 -18 -12 d -18 -12 d -18 5 d -17 -14 d -18 -2 d FA 3 lw 0.8 0.8 0 c 1 1 1 c 1 1 0 c 0.8 0.8 0 c 245 829 m 18 X 3 Y 17 X 11 Y 18 X -5 Y 18 X 13 Y 18 X 12 Y 18 X 18 Y 17 X 13 Y 18 X 23 Y 18 X 22 Y 18 X 24 Y 17 X 15 Y 18 X 29 Y 18 X 14 Y 18 X 8 Y 18 X
 21 Y 17 X 24 Y 18 X 13 Y 18 X 34 Y 18 X 38 Y 17 X 50 Y 18 X 59 Y 18 X 255 Y 18 X 176 Y 18 X -1 Y 17 X -3 Y 18 X -2 Y 18 X -11 Y 18 X -6 Y 18 X -12 Y 17 X -11 Y 18 X -4 Y 18 X -14 Y 18 X -8 Y 17 X -29 Y 18 X -44 Y 18 X -16 Y 18 X -58 Y 18 X -45 Y 17
 X -81 Y 18 X -120 Y 18 X -115 Y 18 X -76 Y 17 X -74 Y 18 X -61 Y 18 X -63 Y 18 X -54 Y 18 X -39 Y 17 X -55 Y 18 X -33 Y 18 X -32 Y 18 X -39 Y 17 X -29 Y 18 X -25 Y 18 X -27 Y 18 X -20 Y 18 X -19 Y 17 X -26 Y 18 X -19 Y 18 X -11 Y 18 X -17 Y 17 X -12
 Y 18 X -10 Y 18 X -14 Y 18 X -13 Y 18 X -9 Y 17 X -7 Y 18 X -8 Y 18 X -6 Y 18 X -10 Y 17 X -5 Y 18 X -6 Y 18 X -4 Y 18 X -4 Y 18 X -4 Y 17 X -5 Y 18 X -4 Y 18 X -4 Y 18 X -3 Y 17 X -3 Y 18 X -2 Y 18 X -3 Y 18 X -2 Y 18 X -3 Y 17 X -1 Y 18 X -3 Y 18
 X -1 Y 18 X -1 Y 17 X -2 Y 18 X -1 Y 18 X -2 Y 18 X -1 Y 18 X -1 Y 35 X -1 Y 18 X -2 Y 35 X -1 Y 36 X -1 Y 18 X s 1 1 0 c 254 829 m20 272 832 m20 289 843 m20 307 838 m20 325 851 m20 343 863 m20 360 881 m20 378 894 m20 396 917 m20 414 939 m20 432 963
 m20 449 978 m20 467 1007 m20 485 1021 m20 503 1029 m20 520 1050 m20 538 1074 m20 556 1087 m20 574 1121 m20 592 1159 m20 609 1209 m20 627 1268 m20 645 1523 m20 663 1699 m20 680 1698 m20 698 1695 m20 716 1693 m20 734 1682 m20 752 1676 m20 769 1664 m20
 787 1653 m20 805 1649 m20 823 1635 m20 841 1627 m20 858 1598 m20 876 1554 m20 894 1538 m20 912 1480 m20 929 1435 m20 947 1354 m20 965 1234 m20 983 1119 m20 1001 1043 m20 1018 969 m20 1036 908 m20 1054 845 m20 1072 791 m20 1089 752 m20 1107 697 m20
 1125 664 m20 1143 632 m20 1161 593 m20 1178 564 m20 1196 539 m20 1214 512 m20 1232 492 m20 1249 473 m20 1267 447 m20 1285 428 m20 1303 417 m20 1321 400 m20 1338 388 m20 1356 378 m20 1374 364 m20 1392 351 m20 1409 342 m20 1427 335 m20 1445 327 m20
 1463 321 m20 1481 311 m20 1498 306 m20 1516 300 m20 1534 296 m20 1552 292 m20 1569 288 m20 1587 283 m20 1605 279 m20 1623 275 m20 1641 272 m20 1658 269 m20 1676 267 m20 1694 264 m20 1712 262 m20 1729 259 m20 1747 258 m20 1765 255 m20 1783 254 m20
 1801 253 m20 1818 251 m20 1836 250 m20 1854 248 m20 1872 247 m20 1889 246 m20 1907 246 m20 1925 245 m20 1943 243 m20 1961 243 m20 1978 242 m20 1996 242 m20 2014 241 m20 0.8 0.8 0 c black 0.8 0.8 0 c cs 0.8 0.8 0 P13 setcolor 254 833 m 18 3 d 17 11 d
 18 -5 d 18 13 d 18 12 d 17 18 d 18 13 d 18 23 d 18 22 d 18 24 d 17 15 d 18 30 d 18 14 d 18 8 d 17 21 d 18 24 d 18 13 d 18 34 d 18 38 d 17 50 d 18 59 d 18 256 d 18 177 d 17 -1 d 18 -3 d 18 -2 d 18 -12 d 18 -5 d 17 -12 d 18 -11 d 18 -4 d 18 -14 d 18
 -8 d 17 -28 d 18 -45 d 18 -16 d 18 -58 d 17 -45 d 18 -82 d 18 -120 d 18 -116 d 18 -76 d 17 -74 d 18 -61 d 18 -64 d 18 -54 d 17 -39 d 18 -56 d 18 -33 d 18 -31 d 18 -40 d 17 -29 d 18 -26 d 18 -26 d 18 -21 d 17 -19 d 18 -26 d 18 -19 d 18 -11 d 18 -18 d
 17 -11 d 18 -11 d 18 -13 d 18 -13 d 17 -9 d 18 -8 d 18 -8 d 18 -6 d 18 -10 d 17 -5 d 18 -6 d 18 -4 d 18 -4 d 17 -5 d 18 -5 d 18 -3 d 18 -5 d 18 -3 d 17 -2 d 18 -3 d 18 -2 d 18 -3 d 17 -2 d 18 -2 d 18 -2 d 18 -2 d 18 -1 d 17 -1 d 18 -2 d 18 -1 d 18
 -1 d 17 -1 d 18 -1 d 18 -1 d 18 -1 d 18 -1 d 17 X 18 -1 d 18 -1 d -18 X -18 1 d -17 1 d -18 X -18 1 d -18 1 d -18 1 d -17 1 d -18 1 d -18 2 d -18 1 d -17 1 d -18 1 d -18 2 d -18 2 d -18 2 d -17 2 d -18 3 d -18 2 d -18 2 d -17 3 d -18 3 d -18 4 d -18
 4 d -18 5 d -17 4 d -18 4 d -18 5 d -18 5 d -17 5 d -18 10 d -18 6 d -18 8 d -18 7 d -17 9 d -18 13 d -18 13 d -18 11 d -17 11 d -18 17 d -18 11 d -18 19 d -18 25 d -17 19 d -18 21 d -18 26 d -18 25 d -17 29 d -18 39 d -18 32 d -18 33 d -18 54 d -17
 39 d -18 53 d -18 64 d -18 61 d -17 73 d -18 75 d -18 115 d -18 119 d -18 81 d -17 45 d -18 58 d -18 16 d -18 44 d -17 29 d -18 8 d -18 14 d -18 4 d -18 11 d -17 12 d -18 6 d -18 11 d -18 2 d -18 3 d -17 1 d -18 -175 d -18 -255 d -18 -58 d -17 -50 d
 -18 -38 d -18 -33 d -18 -14 d -18 -24 d -17 -20 d -18 -8 d -18 -14 d -18 -30 d -17 -14 d -18 -24 d -18 -22 d -18 -24 d -18 -12 d -17 -18 d -18 -12 d -18 -13 d -18 5 d -17 -11 d -18 -3 d FA black 1 1 1 c black 245 844 m 18 X 2 Y 17 X 13 Y 18 X -5 Y
 18 X 12 Y 18 X 12 Y 18 X 19 Y 17 X 13 Y 18 X 23 Y 18 X 24 Y 18 X 25 Y 17 X 14 Y 18 X 33 Y 18 X 16 Y 18 X 6 Y 18 X 23 Y 17 X 26 Y 18 X 14 Y 18 X 36 Y 18 X 41 Y 17 X 52 Y 18 X 65 Y 18 X 269 Y 18 X 186 Y 18 X -1 Y 17 X -2 Y 18 X -3 Y 18 X -11 Y 18 X
 -12 Y 18 X -13 Y 17 X -7 Y 36 X -16 Y 18 X -14 Y 17 X -29 Y 18 X -46 Y 18 X -16 Y 18 X -57 Y 18 X -45 Y 17 X -83 Y 18 X -129 Y 18 X -119 Y 18 X -78 Y 17 X -76 Y 18 X -63 Y 18 X -68 Y 18 X -58 Y 18 X -39 Y 17 X -61 Y 18 X -34 Y 18 X -33 Y 18 X -41 Y
 17 X -30 Y 18 X -27 Y 18 X -29 Y 18 X -21 Y 18 X -20 Y 17 X -27 Y 18 X -20 Y 18 X -11 Y 18 X -19 Y 17 X -11 Y 18 X -11 Y 18 X -14 Y 18 X -14 Y 18 X -9 Y 17 X -8 Y 18 X -8 Y 18 X -7 Y 18 X -10 Y 17 X -5 Y 18 X -6 Y 18 X -5 Y 18 X -4 Y 18 X -4 Y 17 X
 -5 Y 18 X -4 Y 18 X -5 Y 18 X -3 Y 17 X -3 Y 18 X -2 Y 18 X -2 Y 18 X -3 Y 18 X -3 Y 17 X -1 Y 18 X -3 Y 18 X -1 Y 18 X -1 Y 17 X -2 Y 18 X -1 Y 18 X -1 Y 18 X -2 Y 18 X -1 Y 35 X -1 Y 18 X -2 Y 35 X -1 Y 18 X -1 Y 36 X s 254 844 m20 272 846 m20 289
 859 m20 307 854 m20 325 866 m20 343 878 m20 360 897 m20 378 910 m20 396 933 m20 414 957 m20 432 982 m20 449 996 m20 467 1029 m20 485 1045 m20 503 1051 m20 520 1074 m20 538 1100 m20 556 1114 m20 574 1150 m20 592 1191 m20 609 1243 m20 627 1308 m20 645
 1577 m20 663 1763 m20 680 1762 m20 698 1760 m20 716 1757 m20 734 1746 m20 752 1734 m20 769 1721 m20 787 1714 m20 805 1714 m20 823 1698 m20 841 1684 m20 858 1655 m20 876 1609 m20 894 1593 m20 912 1536 m20 929 1491 m20 947 1408 m20 965 1279 m20 983
 1160 m20 1001 1082 m20 1018 1006 m20 1036 943 m20 1054 875 m20 1072 817 m20 1089 778 m20 1107 717 m20 1125 683 m20 1143 650 m20 1161 609 m20 1178 579 m20 1196 552 m20 1214 523 m20 1232 502 m20 1249 482 m20 1267 455 m20 1285 435 m20 1303 424 m20 1321
 405 m20 1338 394 m20 1356 383 m20 1374 369 m20 1392 355 m20 1409 346 m20 1427 338 m20 1445 330 m20 1463 323 m20 1481 313 m20 1498 308 m20 1516 302 m20 1534 297 m20 1552 293 m20 1569 289 m20 1587 284 m20 1605 280 m20 1623 275 m20 1641 272 m20 1658
 269 m20 1676 267 m20 1694 265 m20 1712 262 m20 1729 259 m20 1747 258 m20 1765 255 m20 1783 254 m20 1801 253 m20 1818 251 m20 1836 250 m20 1854 249 m20 1872 247 m20 1889 246 m20 1907 246 m20 1925 245 m20 1943 243 m20 1961 243 m20 1978 242 m20 1996
 241 m20 2014 241 m20 cs 0 0 0 P13 setcolor 254 848 m 18 3 d 17 12 d 18 -5 d 18 12 d 18 13 d 17 18 d 18 13 d 18 24 d 18 24 d 18 25 d 17 14 d 18 32 d 18 17 d 18 6 d 17 23 d 18 26 d 18 14 d 18 37 d 18 40 d 17 52 d 18 66 d 18 269 d 18 187 d 17 -1 d 18
 -2 d 18 -3 d 18 -11 d 18 -12 d 17 -12 d 18 -8 d 18 X 18 -15 d 18 -15 d 17 -28 d 18 -46 d 18 -17 d 18 -56 d 17 -46 d 18 -83 d 18 -130 d 18 -119 d 18 -79 d 17 -76 d 18 -63 d 18 -69 d 18 -58 d 17 -39 d 18 -61 d 18 -34 d 18 -33 d 18 -42 d 17 -31 d 18
 -26 d 18 -29 d 18 -21 d 17 -20 d 18 -28 d 18 -20 d 18 -11 d 18 -19 d 17 -11 d 18 -12 d 18 -14 d 18 -13 d 17 -10 d 18 -8 d 18 -8 d 18 -6 d 18 -11 d 17 -5 d 18 -6 d 18 -5 d 18 -4 d 17 -4 d 18 -6 d 18 -3 d 18 -5 d 18 -3 d 17 -3 d 18 -2 d 18 -3 d 18 -3
 d 17 -2 d 18 -1 d 18 -3 d 18 -2 d 18 -1 d 17 -1 d 18 -2 d 18 -1 d 18 -1 d 17 -1 d 18 -1 d 18 -1 d 18 -1 d 18 -1 d 17 X 18 -1 d 18 -1 d -18 X -18 1 d -17 1 d -18 X -18 1 d -18 1 d -18 1 d -17 1 d -18 1 d -18 2 d -18 1 d -17 1 d -18 2 d -18 1 d -18 3
 d -18 1 d -17 2 d -18 3 d -18 3 d -18 2 d -17 3 d -18 3 d -18 4 d -18 4 d -18 5 d -17 4 d -18 4 d -18 5 d -18 6 d -17 5 d -18 10 d -18 7 d -18 8 d -18 7 d -17 10 d -18 13 d -18 14 d -18 11 d -17 11 d -18 19 d -18 11 d -18 20 d -18 27 d -17 20 d -18
 21 d -18 29 d -18 26 d -17 30 d -18 41 d -18 33 d -18 34 d -18 59 d -17 40 d -18 57 d -18 68 d -18 62 d -17 76 d -18 78 d -18 118 d -18 129 d -18 82 d -17 46 d -18 56 d -18 17 d -18 45 d -17 29 d -18 14 d -18 16 d -18 X -18 8 d -17 12 d -18 12 d -18
 11 d -18 3 d -18 2 d -17 1 d -18 -185 d -18 -268 d -18 -65 d -17 -51 d -18 -41 d -18 -36 d -18 -14 d -18 -26 d -17 -22 d -18 -7 d -18 -16 d -18 -32 d -17 -14 d -18 -26 d -18 -23 d -18 -24 d -18 -13 d -17 -18 d -18 -12 d -18 -13 d -18 6 d -17 -13 d
 -18 -3 d FA 0.8 0 0 c 1 1 1 c 1 0 0 c 0.8 0 0 c 245 495 m 18 X 3 Y 17 X 4 Y 18 X -2 Y 18 X 6 Y 18 X 4 Y 18 X 9 Y 17 X 6 Y 18 X 9 Y 18 X 10 Y 18 X 9 Y 17 X 6 Y 18 X 12 Y 18 X 3 Y 18 X 5 Y 18 X 8 Y 17 X 8 Y 18 X 6 Y 18 X 14 Y 18 X 13 Y 17 X 19 Y 18 X
 22 Y 18 X 92 Y 18 X 62 Y 18 X -3 Y 17 X -5 Y 36 X -7 Y 18 X -4 Y 18 X -5 Y 17 X -4 Y 18 X -6 Y 18 X -6 Y 18 X -7 Y 17 X -13 Y 18 X -13 Y 18 X -9 Y 18 X -20 Y 18 X -20 Y 17 X -31 Y 18 X -44 Y 18 X -39 Y 18 X -28 Y 17 X -27 Y 18 X -26 Y 18 X -24 Y 18
 X -20 Y 18 X -17 Y 17 X -20 Y 18 X -14 Y 18 X -12 Y 18 X -15 Y 17 X -13 Y 18 X -10 Y 18 X -10 Y 18 X -9 Y 18 X -8 Y 17 X -10 Y 18 X -7 Y 18 X -5 Y 18 X -7 Y 17 X -5 Y 18 X -4 Y 18 X -6 Y 18 X -5 Y 18 X -4 Y 17 X -3 Y 18 X -3 Y 18 X -3 Y 18 X -4 Y 17
 X -2 Y 18 X -3 Y 18 X -1 Y 18 X -2 Y 18 X -2 Y 17 X -2 Y 18 X -1 Y 18 X -2 Y 18 X -2 Y 17 X -1 Y 18 X -1 Y 18 X -1 Y 18 X -1 Y 18 X -1 Y 35 X -2 Y 36 X -1 Y 35 X -1 Y 18 X -1 Y 36 X -1 Y 53 X -1 Y 53 X -1 Y 36 X s 1 0 0 c 254 495 m20 272 498 m20 289
 502 m20 307 500 m20 325 506 m20 343 510 m20 360 519 m20 378 525 m20 396 534 m20 414 544 m20 432 553 m20 449 559 m20 467 571 m20 485 574 m20 503 579 m20 520 587 m20 538 595 m20 556 601 m20 574 615 m20 592 628 m20 609 647 m20 627 669 m20 645 761 m20
 663 823 m20 680 820 m20 698 815 m20 716 815 m20 734 808 m20 752 804 m20 769 799 m20 787 795 m20 805 789 m20 823 783 m20 841 776 m20 858 763 m20 876 750 m20 894 741 m20 912 721 m20 929 701 m20 947 670 m20 965 626 m20 983 587 m20 1001 559 m20 1018 532
 m20 1036 506 m20 1054 482 m20 1072 462 m20 1089 445 m20 1107 425 m20 1125 411 m20 1143 399 m20 1161 384 m20 1178 371 m20 1196 361 m20 1214 351 m20 1232 342 m20 1249 334 m20 1267 324 m20 1285 317 m20 1303 312 m20 1321 305 m20 1338 300 m20 1356 296
 m20 1374 290 m20 1392 285 m20 1409 281 m20 1427 278 m20 1445 275 m20 1463 272 m20 1481 268 m20 1498 266 m20 1516 263 m20 1534 262 m20 1552 260 m20 1569 258 m20 1587 256 m20 1605 255 m20 1623 253 m20 1641 251 m20 1658 250 m20 1676 249 m20 1694 248
 m20 1712 247 m20 1729 246 m20 1747 246 m20 1765 244 m20 1783 244 m20 1801 243 m20 1818 243 m20 1836 242 m20 1854 241 m20 1872 241 m20 1889 240 m20 1907 240 m20 1925 240 m20 1943 239 m20 1961 239 m20 1978 239 m20 1996 238 m20 2014 238 m20 0.8 0 0 c
 black 0.8 0 0 c cs 0.8 0 0 P13 setcolor 254 497 m 18 2 d 17 5 d 18 -2 d 18 6 d 18 4 d 17 9 d 18 5 d 18 10 d 18 9 d 18 10 d 17 5 d 18 13 d 18 3 d 18 4 d 17 9 d 18 8 d 18 6 d 18 14 d 18 13 d 17 19 d 18 22 d 18 93 d 18 62 d 17 -4 d 18 -5 d 18 X 18 -6 d
 18 -5 d 17 -5 d 18 -4 d 18 -5 d 18 -6 d 18 -8 d 17 -12 d 18 -14 d 18 -9 d 18 -20 d 17 -20 d 18 -31 d 18 -44 d 18 -39 d 18 -28 d 17 -27 d 18 -26 d 18 -25 d 18 -20 d 17 -16 d 18 -20 d 18 -15 d 18 -12 d 18 -15 d 17 -12 d 18 -11 d 18 -10 d 18 -9 d 17 -8
 d 18 -10 d 18 -8 d 18 -4 d 18 -7 d 17 -5 d 18 -4 d 18 -6 d 18 -6 d 17 -3 d 18 -3 d 18 -4 d 18 -2 d 18 -5 d 17 -2 d 18 -2 d 18 -2 d 18 -2 d 17 -2 d 18 -2 d 18 -1 d 18 -2 d 18 -1 d 17 -2 d 18 -1 d 18 X 18 -2 d 17 -1 d 18 X 18 -1 d 18 -1 d 18 -1 d 17 X
 18 -1 d 18 X 18 -1 d 17 -1 d 36 X 18 -1 d 35 X 18 -1 d 18 X -18 X -18 1 d -35 X -18 1 d -36 X -17 1 d -18 X -18 1 d -18 X -17 1 d -18 1 d -18 X -18 1 d -18 1 d -17 1 d -18 1 d -18 1 d -18 1 d -17 1 d -18 1 d -18 2 d -18 2 d -18 2 d -17 2 d -18 1 d
 -18 2 d -18 3 d -17 1 d -18 5 d -18 3 d -18 3 d -18 3 d -17 3 d -18 5 d -18 6 d -18 4 d -17 5 d -18 7 d -18 5 d -18 7 d -18 11 d -17 7 d -18 9 d -18 10 d -18 10 d -17 13 d -18 15 d -18 12 d -18 14 d -18 20 d -17 16 d -18 20 d -18 24 d -18 26 d -17
 27 d -18 28 d -18 39 d -18 44 d -18 31 d -17 20 d -18 19 d -18 9 d -18 14 d -17 12 d -18 8 d -18 6 d -18 5 d -18 4 d -17 5 d -18 5 d -18 6 d -18 X -18 5 d -17 4 d -18 -62 d -18 -92 d -18 -22 d -17 -19 d -18 -13 d -18 -14 d -18 -6 d -18 -8 d -17 -8 d
 -18 -4 d -18 -4 d -18 -12 d -17 -6 d -18 -9 d -18 -9 d -18 -10 d -18 -5 d -17 -9 d -18 -5 d -18 -6 d -18 2 d -17 -4 d -18 -2 d FA black 1 1 1 c 556 639 1578 1302 bf black 1578 1302 m 556 X s 2134 1302 m 639 Y s 2134 1941 m -556 X s 1578 1941 m -639
 Y s
 gsave  2222 2133 23 22 C 1716.93 1827.09 t 0 r /Helvetica findfont 95.0544 sf 0 0 m (No Int) show NC gr  0.8 0 0 c 1599 1861 m 97 X s black
 gsave  2222 2133 23 22 C 1716.93 1663.75 t 0 r /Helvetica findfont 95.0544 sf 0 0 m (Add) show NC gr  0.8 0.8 0 c 1599 1702 m 97 X s black
 gsave  2222 2133 23 22 C 1716.93 1504.21 t 0 r /Helvetica findfont 95.0544 sf 0 0 m (Mult) show NC gr  0.8 0 0.8 c 1599 1542 m 97 X s black
 gsave  2222 2133 23 22 C 1716.93 1344.68 t 0 r /Helvetica findfont 95.0544 sf 0 0 m (Central) show NC gr  1599 1382 m 97 X s
 gsave  2222 2133 23 22 C 2199.34 1568.79 t 90 r /Helvetica-BoldOblique findfont 38.0218 sf 0 0 m (LHC HIGGS XS WG 2013) show NC gr 
 gr  gr showpage
end
%%EOF
