%!PS-Adobe-2.0 EPSF-2.0
%%BoundingBox:  0 0 567 639
%%Title: PlotsForYR3/HResPowhegOthersInclusive_qT0to50_125_lin.eps: Canvas
%%Creator: ROOT Version 5.28/00c
%%CreationDate: Wed Mar 13 15:29:35 2013
%%EndComments
%%BeginProlog
80 dict begin
/s {stroke} def /l {lineto} def /m {moveto} def /t {translate} def
/r {rotate} def /rl {roll}  def /R {repeat} def
/d {rlineto} def /rm {rmoveto} def /gr {grestore} def /f {eofill} def
/c {setrgbcolor} def /black {0 setgray} def /sd {setdash} def
/cl {closepath} def /sf {scalefont setfont} def /lw {setlinewidth} def
/box {m dup 0 exch d exch 0 d 0 exch neg d cl} def
/NC{systemdict begin initclip end}def/C{NC box clip newpath}def
/bl {box s} def /bf {box f} def /Y { 0 exch d} def /X { 0 d} def 
/K {{pop pop 0 moveto} exch kshow} bind def
/ita {/ang 15 def gsave [1 0 ang dup sin exch cos div 1 0 0] concat} def 
/mp {newpath /y exch def /x exch def} def
/side {[w .77 mul w .23 mul] .385 w mul sd w 0 l currentpoint t -144 r} def
/mr {mp x y w2 0 360 arc} def /m24 {mr s} def /m20 {mr f} def
/mb {mp x y w2 add m w2 neg 0 d 0 w neg d w 0 d 0 w d cl} def
/mt {mp x y w2 add m w2 neg w neg d w 0 d cl} def
/m21 {mb f} def /m25 {mb s} def /m22 {mt f} def /m26{mt s} def
/m23 {mp x y w2 sub m w2 w d w neg 0 d cl f} def
/m27 {mp x y w2 add m w3 neg w2 neg d w3 w2 neg d w3 w2 d cl s} def
/m28 {mp x w2 sub y w2 sub w3 add m w3 0 d  0 w3 neg d w3 0 d 0 w3 d w3 0 d  0 w3 d w3 neg 0 d 0 w3 d w3 neg 0 d 0 w3 neg d w3 neg 0 d cl s } def
/m29 {mp gsave x w2 sub y w2 add w3 sub m currentpoint t 4 {side} repeat cl fill gr} def
/m30 {mp gsave x w2 sub y w2 add w3 sub m currentpoint t 4 {side} repeat cl s gr} def
/m31 {mp x y w2 sub m 0 w d x w2 sub y m w 0 d x w2 sub y w2 add m w w neg d x w2 sub y w2 sub m w w d s} def
/m32 {mp x y w2 sub m w2 w d w neg 0 d cl s} def
/m33 {mp x y w2 add m w3 neg w2 neg d w3 w2 neg d w3 w2 d cl f} def
/m34 {mp x w2 sub y w2 sub w3 add m w3 0 d  0 w3 neg d w3 0 d 0 w3 d w3 0 d  0 w3 d w3 neg 0 d 0 w3 d w3 neg 0 d 0 w3 neg d w3 neg 0 d cl f } def
/m2 {mp x y w2 sub m 0 w d x w2 sub y m w 0 d s} def
/m5 {mp x w2 sub y w2 sub m w w d x w2 sub y w2 add m w w neg d s} def
/reEncode {exch findfont dup length dict begin {1 index /FID eq  {pop pop} {def} ifelse } forall /Encoding exch def currentdict end dup /FontName get exch definefont pop } def [/Times-Bold /Times-Italic /Times-BoldItalic /Helvetica /Helvetica-Oblique
 /Helvetica-Bold /Helvetica-BoldOblique /Courier /Courier-Oblique /Courier-Bold /Courier-BoldOblique /Times-Roman /AvantGarde-Book /AvantGarde-BookOblique /AvantGarde-Demi /AvantGarde-DemiOblique /Bookman-Demi /Bookman-DemiItalic /Bookman-Light
 /Bookman-LightItalic /Helvetica-Narrow /Helvetica-Narrow-Bold /Helvetica-Narrow-BoldOblique /Helvetica-Narrow-Oblique /NewCenturySchlbk-Roman /NewCenturySchlbk-Bold /NewCenturySchlbk-BoldItalic /NewCenturySchlbk-Italic /Palatino-Bold
 /Palatino-BoldItalic /Palatino-Italic /Palatino-Roman ] {ISOLatin1Encoding reEncode } forall%%EndProlog
%%BeginSetup
%%EndSetup
newpath  gsave  .25 .25 scale  gsave  0 0 t black[  ] 0 sd 3 lw 1 1 1 c 2268 2557 0 0 bf black 1 1 1 c 2268 2557 0 0 bf black 1 1 1 c 1791 1790 363 639 bf black 1791 1790 363 639 bl 6 lw 1 1 1 c black 363 639 m 1791 X s 3 lw 363 639 m 1791 X s
 gsave  2268 2557 0 0 C 1841.57 441.368 t 0 r /Helvetica findfont 106.537 sf 0 0 m ( \(GeV\)) show NC gr 
 gsave  2268 2557 0 0 C 1795.91 388.099 t 0 r /Helvetica findfont 72.293 sf 0 0 m (T) show NC gr 
 gsave  2268 2557 0 0 C 1438.25 441.368 t 0 r /Helvetica findfont 106.537 sf 0 0 m (Higgs p) show NC gr  363 700 m -61 Y s 432 670 m -31 Y s 501 670 m -31 Y s 570 670 m -31 Y s 638 670 m -31 Y s 707 700 m -61 Y s 776 670 m -31 Y s 845 670 m -31 Y s
 914 670 m -31 Y s 983 670 m -31 Y s 1052 700 m -61 Y s 1121 670 m -31 Y s 1190 670 m -31 Y s 1259 670 m -31 Y s 1327 670 m -31 Y s 1396 700 m -61 Y s 1465 670 m -31 Y s 1534 670 m -31 Y s 1603 670 m -31 Y s 1672 670 m -31 Y s 1741 700 m -61 Y s 1810
 670 m -31 Y s 1879 670 m -31 Y s 1948 670 m -31 Y s 2017 670 m -31 Y s 2085 700 m -61 Y s 2085 700 m -61 Y s
 gsave  2268 2557 0 0 C 331.026 525.075 t 0 r /Helvetica findfont 106.537 sf 0 0 m (0) show NC gr 
 gsave  2268 2557 0 0 C 646.832 525.075 t 0 r /Helvetica findfont 106.537 sf 0 0 m (10) show NC gr 
 gsave  2268 2557 0 0 C 993.077 525.075 t 0 r /Helvetica findfont 106.537 sf 0 0 m (20) show NC gr 
 gsave  2268 2557 0 0 C 1335.52 525.075 t 0 r /Helvetica findfont 106.537 sf 0 0 m (30) show NC gr 
 gsave  2268 2557 0 0 C 1681.76 525.075 t 0 r /Helvetica findfont 106.537 sf 0 0 m (40) show NC gr 
 gsave  2268 2557 0 0 C 2028.01 525.075 t 0 r /Helvetica findfont 106.537 sf 0 0 m (50) show NC gr  363 2429 m 1791 X s 363 2368 m 61 Y s 432 2399 m 30 Y s 501 2399 m 30 Y s 570 2399 m 30 Y s 638 2399 m 30 Y s 707 2368 m 61 Y s 776 2399 m 30 Y s 845
 2399 m 30 Y s 914 2399 m 30 Y s 983 2399 m 30 Y s 1052 2368 m 61 Y s 1121 2399 m 30 Y s 1190 2399 m 30 Y s 1259 2399 m 30 Y s 1327 2399 m 30 Y s 1396 2368 m 61 Y s 1465 2399 m 30 Y s 1534 2399 m 30 Y s 1603 2399 m 30 Y s 1672 2399 m 30 Y s 1741 2368
 m 61 Y s 1810 2399 m 30 Y s 1879 2399 m 30 Y s 1948 2399 m 30 Y s 2017 2399 m 30 Y s 2085 2368 m 61 Y s 2085 2368 m 61 Y s 363 639 m 1790 Y s
 gsave  2268 2557 0 0 C 194.05 2001.37 t 90 r /Helvetica findfont 106.537 sf 0 0 m ( \(fb/GeV\)) show NC gr 
 gsave  2268 2557 0 0 C 247.318 1955.72 t 90 r /Helvetica findfont 72.293 sf 0 0 m (T) show NC gr 
 gsave  2268 2557 0 0 C 194.05 1811.13 t 90 r /Helvetica findfont 106.537 sf 0 0 m (/dp) show NC gr 
 gsave  2268 2557 0 0 C 194.05 1746.45 t 90 r /Symbol findfont 106.537 sf 0 0 m (s) show NC gr 
 gsave  2268 2557 0 0 C 194.05 1693.18 t 90 r /Helvetica findfont 106.537 sf 0 0 m (d) show NC gr  410 893 m -47 X s 387 957 m -24 X s 387 1021 m -24 X s 387 1085 m -24 X s 410 1149 m -47 X s 387 1212 m -24 X s 387 1276 m -24 X s 387 1340 m -24 X s
 410 1404 m -47 X s 387 1468 m -24 X s 387 1531 m -24 X s 387 1595 m -24 X s 410 1659 m -47 X s 387 1723 m -24 X s 387 1787 m -24 X s 387 1851 m -24 X s 410 1914 m -47 X s 387 1978 m -24 X s 387 2042 m -24 X s 387 2106 m -24 X s 410 2170 m -47 X s
 387 2234 m -24 X s 387 2297 m -24 X s 387 2361 m -24 X s 410 2425 m -47 X s 410 893 m -47 X s 387 829 m -24 X s 387 766 m -24 X s 387 702 m -24 X s 410 2425 m -47 X s
 gsave  2268 2557 0 0 C 205.464 852.296 t 0 r /Helvetica findfont 106.537 sf 0 0 m (0.2) show NC gr 
 gsave  2268 2557 0 0 C 205.464 1107.22 t 0 r /Helvetica findfont 106.537 sf 0 0 m (0.4) show NC gr 
 gsave  2268 2557 0 0 C 205.464 1362.15 t 0 r /Helvetica findfont 106.537 sf 0 0 m (0.6) show NC gr 
 gsave  2268 2557 0 0 C 205.464 1620.88 t 0 r /Helvetica findfont 106.537 sf 0 0 m (0.8) show NC gr 
 gsave  2268 2557 0 0 C 308.196 1875.81 t 0 r /Helvetica findfont 106.537 sf 0 0 m (1) show NC gr 
 gsave  2268 2557 0 0 C 205.464 2130.74 t 0 r /Helvetica findfont 106.537 sf 0 0 m (1.2) show NC gr 
 gsave  2268 2557 0 0 C 205.464 2385.67 t 0 r /Helvetica findfont 106.537 sf 0 0 m (1.4) show NC gr  2154 639 m 1790 Y s 2107 893 m 47 X s 2131 957 m 23 X s 2131 1021 m 23 X s 2131 1085 m 23 X s 2107 1149 m 47 X s 2131 1212 m 23 X s 2131 1276 m 23 X
 s 2131 1340 m 23 X s 2107 1404 m 47 X s 2131 1468 m 23 X s 2131 1531 m 23 X s 2131 1595 m 23 X s 2107 1659 m 47 X s 2131 1723 m 23 X s 2131 1787 m 23 X s 2131 1851 m 23 X s 2107 1914 m 47 X s 2131 1978 m 23 X s 2131 2042 m 23 X s 2131 2106 m 23 X s
 2107 2170 m 47 X s 2131 2234 m 23 X s 2131 2297 m 23 X s 2131 2361 m 23 X s 2107 2425 m 47 X s 2107 893 m 47 X s 2131 829 m 23 X s 2131 766 m 23 X s 2131 702 m 23 X s 2107 2425 m 47 X s 6 lw 1 0 0 c black 3 lw 1 0 0 c 1 lw << /PatternType 1
 /PaintType 2 /TilingType 1 /BBox [ 0 0 100 100 ] /XStep 100 /YStep 100 /PaintProc { begin gsave 0 100 m 100 0 l s gr end } >> [ 0.24 0 0 0.24 0 0 ] makepattern /P05 exch def /cs {[/Pattern /DeviceRGB] setcolorspace} def /FA {f [/DeviceRGB]
 setcolorspace} def cs 1 0 0 P05 setcolor 363 639 m 69 X 580 Y 69 X 311 Y 69 X 283 Y 68 X -41 Y 69 X 154 Y 69 X -55 Y 69 X -90 Y 69 X -42 Y 69 X -100 Y 69 X -89 Y 69 X -59 Y 69 X -50 Y 69 X -71 Y 68 X -71 Y 69 X -31 Y 69 X -55 Y 69 X -37 Y 69 X -60 Y
 69 X -35 Y 69 X -25 Y 69 X -74 Y 69 X 8 Y 69 X -38 Y 69 X -3 Y 68 X -33 Y 69 X -11 Y 55 Y -69 X 39 Y -68 X 2 Y -69 X 33 Y -69 X 21 Y -69 X 33 Y -69 X 79 Y -69 X 8 Y -69 X 31 Y -69 X 45 Y -69 X 60 Y -69 X 81 Y -69 X 28 Y -68 X 72 Y -69 X 39 Y -69 X
 104 Y -69 X 90 Y -69 X 57 Y -69 X 83 Y -69 X 71 Y -69 X 118 Y -69 X -21 Y -69 X -88 Y -68 X -121 Y -69 X -333 Y -69 X -610 Y -69 X FA 6 lw 1 0 0 c 1 1 1 c 1 0 0 c 397 639 m 44 Y s 397 698 m 88 Y s 363 690 m 27 X s 405 690 m 27 X s 3 lw /w 21 def /w2
 {w 2 div} def /w3 {w 3 div} def 397 690 m20 6 lw 466 1326 m 46 Y s 466 1387 m 46 Y s 432 1379 m 27 X s 474 1379 m 27 X s 3 lw 466 1379 m20 6 lw 535 1654 m 49 Y s 535 1718 m 49 Y s 501 1711 m 26 X s 543 1711 m 27 X s 3 lw 535 1711 m20 6 lw 604 1793 m
 54 Y s 604 1862 m 53 Y s 570 1854 m 26 X s 612 1854 m 26 X s 3 lw 604 1854 m20 6 lw 673 1927 m 36 Y s 673 1978 m 35 Y s 638 1970 m 27 X s 681 1970 m 26 X s 3 lw 673 1970 m20 6 lw 742 1940 m 34 Y s 742 1989 m 34 Y s 707 1981 m 27 X s 749 1981 m 27 X
 s 3 lw 742 1981 m20 6 lw 811 1881 m 24 Y s 811 1920 m 24 Y s 776 1913 m 27 X s 818 1913 m 27 X s 3 lw 811 1913 m20 6 lw 880 1831 m 26 Y s 880 1873 m 27 Y s 845 1865 m 27 X s 887 1865 m 27 X s 3 lw 880 1865 m20 6 lw 949 1727 m 29 Y s 949 1771 m 28 Y
 s 914 1763 m 27 X s 956 1763 m 27 X s 3 lw 949 1763 m20 6 lw 1017 1670 m 27 Y s 1017 1712 m 27 Y s 983 1705 m 27 X s 1025 1705 m 27 X s 3 lw 1017 1705 m20 6 lw 1086 1540 m 30 Y s 1086 1585 m 30 Y s 1052 1577 m 27 X s 1094 1577 m 27 X s 3 lw 1086
 1577 m20 6 lw 1155 1496 m 27 Y s 1155 1538 m 28 Y s 1121 1531 m 27 X s 1163 1531 m 27 X s 3 lw 1155 1531 m20 6 lw 1224 1434 m 26 Y s 1224 1475 m 25 Y s 1190 1467 m 27 X s 1232 1467 m 27 X s 3 lw 1224 1467 m20 6 lw 1293 1364 m 22 Y s 1293 1401 m 23 Y
 s 1259 1394 m 26 X s 1301 1394 m 26 X s 3 lw 1293 1394 m20 6 lw 1362 1320 m 24 Y s 1362 1359 m 23 Y s 1327 1351 m 27 X s 1370 1351 m 26 X s 3 lw 1362 1351 m20 6 lw 1431 1244 m 21 Y s 1431 1281 m 21 Y s 1396 1273 m 27 X s 1438 1273 m 27 X s 3 lw 1431
 1273 m20 6 lw 1500 1212 m 24 Y s 1500 1251 m 23 Y s 1465 1243 m 27 X s 1507 1243 m 27 X s 3 lw 1500 1243 m20 6 lw 1569 1164 m 19 Y s 1569 1198 m 19 Y s 1534 1190 m 27 X s 1576 1190 m 27 X s 3 lw 1569 1190 m20 6 lw 1638 1123 m 19 Y s 1638 1157 m 19 Y
 s 1603 1150 m 27 X s 1645 1150 m 27 X s 3 lw 1638 1150 m20 6 lw 1706 1091 m 19 Y s 1706 1126 m 19 Y s 1672 1118 m 27 X s 1714 1118 m 27 X s 3 lw 1706 1118 m20 6 lw 1775 1056 m 18 Y s 1775 1090 m 18 Y s 1741 1082 m 27 X s 1783 1082 m 27 X s 3 lw 1775
 1082 m20 6 lw 1844 997 m 16 Y s 1844 1028 m 16 Y s 1810 1021 m 27 X s 1852 1021 m 27 X s 3 lw 1844 1021 m20 6 lw 1913 981 m 14 Y s 1913 1011 m 14 Y s 1879 1003 m 27 X s 1921 1003 m 27 X s 3 lw 1913 1003 m20 6 lw 1982 956 m 16 Y s 1982 987 m 16 Y s
 1948 979 m 26 X s 1990 979 m 27 X s 3 lw 1982 979 m20 6 lw 2051 946 m 15 Y s 2051 976 m 15 Y s 2017 968 m 26 X s 2059 968 m 26 X s 3 lw 2051 968 m20 6 lw 2120 907 m 14 Y s 2120 936 m 14 Y s 2085 929 m 27 X s 2127 929 m 27 X s 3 lw 2120 929 m20 6 lw
 black 3 lw 1 lw << /PatternType 1 /PaintType 2 /TilingType 1 /BBox [ 0 0 100 100 ] /XStep 100 /YStep 100 /PaintProc { begin gsave 0 0 m 100 100 l s gr end } >> [ 0.24 0 0 0.24 0 0 ] makepattern /P04 exch def cs 0 0 0 P04 setcolor 363 837 m 69 X 364
 Y 69 X 329 Y 69 X 221 Y 68 X 115 Y 69 X -1 Y 69 X -40 Y 69 X -21 Y 69 X -82 Y 69 X -61 Y 69 X -91 Y 69 X -67 Y 69 X -52 Y 69 X -64 Y 68 X -64 Y 69 X -59 Y 69 X -27 Y 69 X -56 Y 69 X -27 Y 69 X -30 Y 69 X -59 Y 69 X -24 Y 69 X -18 Y 69 X -38 Y 69 X
 -18 Y 68 X -33 Y 69 X -8 Y 36 Y -69 X 21 Y -68 X 35 Y -69 X 24 Y -69 X 28 Y -69 X 35 Y -69 X 42 Y -69 X 44 Y -69 X 21 Y -69 X 40 Y -69 X 52 Y -69 X 39 Y -69 X 82 Y -68 X 72 Y -69 X 59 Y -69 X 65 Y -69 X 72 Y -69 X 81 Y -69 X 62 Y -69 X 66 Y -69 X 13
 Y -69 X 2 Y -69 X -126 Y -68 X -242 Y -69 X -296 Y -69 X -363 Y -69 X FA 6 lw black 1 1 1 c black 363 845 m 27 X s 405 845 m 27 X s 3 lw 397 845 m20 6 lw 466 1227 m 5 Y s 466 1247 m 5 Y s 432 1239 m 27 X s 474 1239 m 27 X s 3 lw 466 1239 m20 6 lw
 535 1515 m 7 Y s 535 1538 m 7 Y s 501 1530 m 26 X s 543 1530 m 27 X s 3 lw 535 1530 m20 6 lw 604 1767 m 9 Y s 604 1792 m 9 Y s 570 1784 m 26 X s 612 1784 m 26 X s 3 lw 604 1784 m20 6 lw 673 1865 m 10 Y s 673 1890 m 10 Y s 638 1882 m 27 X s 681 1882
 m 26 X s 3 lw 673 1882 m20 6 lw 742 1898 m 10 Y s 742 1923 m 10 Y s 707 1915 m 27 X s 749 1915 m 27 X s 3 lw 742 1915 m20 6 lw 811 1845 m 10 Y s 811 1870 m 10 Y s 776 1863 m 27 X s 818 1863 m 27 X s 3 lw 811 1863 m20 6 lw 880 1818 m 10 Y s 880 1843
 m 10 Y s 845 1836 m 27 X s 887 1836 m 27 X s 3 lw 880 1836 m20 6 lw 949 1724 m 9 Y s 949 1748 m 9 Y s 914 1740 m 27 X s 956 1740 m 27 X s 3 lw 949 1740 m20 6 lw 1017 1645 m 8 Y s 1017 1668 m 8 Y s 983 1661 m 27 X s 1025 1661 m 27 X s 3 lw 1017 1661
 m20 6 lw 1086 1595 m 8 Y s 1086 1618 m 8 Y s 1052 1610 m 27 X s 1094 1610 m 27 X s 3 lw 1086 1610 m20 6 lw 1155 1533 m 7 Y s 1155 1555 m 8 Y s 1121 1548 m 27 X s 1163 1548 m 27 X s 3 lw 1155 1548 m20 6 lw 1224 1441 m 7 Y s 1224 1463 m 6 Y s 1190
 1455 m 27 X s 1232 1455 m 27 X s 3 lw 1224 1455 m20 6 lw 1293 1411 m 6 Y s 1293 1432 m 7 Y s 1259 1425 m 26 X s 1301 1425 m 26 X s 3 lw 1293 1425 m20 6 lw 1362 1321 m 5 Y s 1362 1342 m 5 Y s 1327 1334 m 27 X s 1370 1334 m 26 X s 3 lw 1362 1334 m20 6
 lw 1431 1291 m 5 Y s 1431 1311 m 5 Y s 1396 1304 m 27 X s 1438 1304 m 27 X s 3 lw 1431 1304 m20 6 lw 1500 1227 m 5 Y s 1500 1247 m 4 Y s 1465 1239 m 27 X s 1507 1239 m 27 X s 3 lw 1500 1239 m20 6 lw 1569 1180 m 4 Y s 1569 1200 m 4 Y s 1534 1192 m 27
 X s 1576 1192 m 27 X s 3 lw 1569 1192 m20 6 lw 1638 1152 m 4 Y s 1638 1171 m 4 Y s 1603 1164 m 27 X s 1645 1164 m 27 X s 3 lw 1638 1164 m20 6 lw 1706 1113 m 3 Y s 1706 1131 m 4 Y s 1672 1124 m 27 X s 1714 1124 m 27 X s 3 lw 1706 1124 m20 6 lw 1775
 1055 m 2 Y s 1775 1072 m 3 Y s 1741 1065 m 27 X s 1783 1065 m 27 X s 3 lw 1775 1065 m20 6 lw 1844 1058 m 3 Y s 1844 1076 m 3 Y s 1810 1069 m 27 X s 1852 1069 m 27 X s 3 lw 1844 1069 m20 6 lw 1913 1019 m 2 Y s 1913 1036 m 3 Y s 1879 1029 m 27 X s
 1921 1029 m 27 X s 3 lw 1913 1029 m20 6 lw 1982 993 m 2 Y s 1982 1010 m 2 Y s 1948 1003 m 26 X s 1990 1003 m 27 X s 3 lw 1982 1003 m20 6 lw 2051 964 m 1 Y s 2051 980 m 2 Y s 2017 973 m 26 X s 2059 973 m 26 X s 3 lw 2051 973 m20 6 lw 2120 946 m 1 Y s
 2120 962 m 1 Y s 2085 955 m 27 X s 2127 955 m 27 X s 3 lw 2120 955 m20 6 lw 1 0.8 0 c 1 1 1 c 1 0.8 0 c 363 842 m 27 X s 405 842 m 27 X s 3 lw 397 842 m20 6 lw 432 1216 m 27 X s 474 1216 m 27 X s 3 lw 466 1216 m20 6 lw 501 1492 m 26 X s 543 1492 m
 27 X s 3 lw 535 1492 m20 6 lw 570 1662 m 26 X s 612 1662 m 26 X s 3 lw 604 1662 m20 6 lw 638 1748 m 27 X s 681 1748 m 26 X s 3 lw 673 1748 m20 6 lw 707 1782 m 27 X s 749 1782 m 27 X s 3 lw 742 1782 m20 6 lw 776 1769 m 27 X s 818 1769 m 27 X s 3 lw
 811 1769 m20 6 lw 845 1734 m 27 X s 887 1734 m 27 X s 3 lw 880 1734 m20 6 lw 914 1682 m 27 X s 956 1682 m 27 X s 3 lw 949 1682 m20 6 lw 983 1647 m 27 X s 1025 1647 m 27 X s 3 lw 1017 1647 m20 6 lw 1052 1591 m 27 X s 1094 1591 m 27 X s 3 lw 1086 1591
 m20 6 lw 1121 1519 m 27 X s 1163 1519 m 27 X s 3 lw 1155 1519 m20 6 lw 1190 1471 m 27 X s 1232 1471 m 27 X s 3 lw 1224 1471 m20 6 lw 1259 1425 m 26 X s 1301 1425 m 26 X s 3 lw 1293 1425 m20 6 lw 1327 1382 m 27 X s 1370 1382 m 26 X s 3 lw 1362 1382
 m20 6 lw 1396 1322 m 27 X s 1438 1322 m 27 X s 3 lw 1431 1322 m20 6 lw 1465 1289 m 27 X s 1507 1289 m 27 X s 3 lw 1500 1289 m20 6 lw 1534 1243 m 27 X s 1576 1243 m 27 X s 3 lw 1569 1243 m20 6 lw 1603 1194 m 27 X s 1645 1194 m 27 X s 3 lw 1638 1194
 m20 6 lw 1672 1167 m 27 X s 1714 1167 m 27 X s 3 lw 1706 1167 m20 6 lw 1741 1131 m 27 X s 1783 1131 m 27 X s 3 lw 1775 1131 m20 6 lw 1810 1096 m 27 X s 1852 1096 m 27 X s 3 lw 1844 1096 m20 6 lw 1879 1072 m 27 X s 1921 1072 m 27 X s 3 lw 1913 1072
 m20 6 lw 1948 1039 m 26 X s 1990 1039 m 27 X s 3 lw 1982 1039 m20 6 lw 2017 1016 m 26 X s 2059 1016 m 26 X s 3 lw 2051 1016 m20 6 lw 2085 986 m 27 X s 2127 986 m 27 X s 3 lw 2120 986 m20 6 lw 0.35 0.83 0.33 c 1 1 1 c 0.35 0.83 0.33 c 363 944 m 27 X
 s 405 944 m 27 X s 3 lw 397 944 m20 6 lw 432 1469 m 27 X s 474 1469 m 27 X s 3 lw 466 1469 m20 6 lw 501 1808 m 26 X s 543 1808 m 27 X s 3 lw 535 1808 m20 6 lw 570 1972 m 26 X s 612 1972 m 26 X s 3 lw 604 1972 m20 6 lw 638 1997 m 27 X s 681 1997 m 26
 X s 3 lw 673 1997 m20 6 lw 707 1959 m 27 X s 749 1959 m 27 X s 3 lw 742 1959 m20 6 lw 776 1906 m 27 X s 818 1906 m 27 X s 3 lw 811 1906 m20 6 lw 845 1819 m 27 X s 887 1819 m 27 X s 3 lw 880 1819 m20 6 lw 914 1737 m 27 X s 956 1737 m 27 X s 3 lw 949
 1737 m20 6 lw 983 1659 m 27 X s 1025 1659 m 27 X s 3 lw 1017 1659 m20 6 lw 1052 1584 m 27 X s 1094 1584 m 27 X s 3 lw 1086 1584 m20 6 lw 1121 1509 m 27 X s 1163 1509 m 27 X s 3 lw 1155 1509 m20 6 lw 1190 1432 m 27 X s 1232 1432 m 27 X s 3 lw 1224
 1432 m20 6 lw 1259 1368 m 26 X s 1301 1368 m 26 X s 3 lw 1293 1368 m20 6 lw 1327 1306 m 27 X s 1370 1306 m 26 X s 3 lw 1362 1306 m20 6 lw 1396 1247 m 27 X s 1438 1247 m 27 X s 3 lw 1431 1247 m20 6 lw 1465 1195 m 27 X s 1507 1195 m 27 X s 3 lw 1500
 1195 m20 6 lw 1534 1152 m 27 X s 1576 1152 m 27 X s 3 lw 1569 1152 m20 6 lw 1603 1104 m 27 X s 1645 1104 m 27 X s 3 lw 1638 1104 m20 6 lw 1672 1077 m 27 X s 1714 1077 m 27 X s 3 lw 1706 1077 m20 6 lw 1741 1044 m 27 X s 1783 1044 m 27 X s 3 lw 1775
 1044 m20 6 lw 1810 1007 m 27 X s 1852 1007 m 27 X s 3 lw 1844 1007 m20 6 lw 1879 987 m 27 X s 1921 987 m 27 X s 3 lw 1913 987 m20 6 lw 1948 960 m 26 X s 1990 960 m 27 X s 3 lw 1982 960 m20 6 lw 2017 938 m 26 X s 2059 938 m 26 X s 3 lw 2051 938 m20 6
 lw 2085 919 m 27 X s 2127 919 m 27 X s 3 lw 2120 919 m20 6 lw 0 0 1 c 1 1 1 c 0 0 1 c 363 871 m 27 X s 405 871 m 27 X s 3 lw 397 871 m20 6 lw 432 952 m 27 X s 474 952 m 27 X s 3 lw 466 952 m20 6 lw 501 1454 m 26 X s 543 1454 m 27 X s 3 lw 535 1454
 m20 6 lw 570 1666 m 26 X s 612 1666 m 26 X s 3 lw 604 1666 m20 6 lw 673 2009 m s 673 2025 m s 638 2017 m 27 X s 681 2017 m 26 X s 3 lw 673 2017 m20 6 lw 742 1949 m 2 Y s 742 1966 m 1 Y s 707 1958 m 27 X s 749 1958 m 27 X s 3 lw 742 1958 m20 6 lw 811
 1863 m 2 Y s 811 1880 m 2 Y s 776 1873 m 27 X s 818 1873 m 27 X s 3 lw 811 1873 m20 6 lw 880 1866 m 3 Y s 880 1884 m 3 Y s 845 1876 m 27 X s 887 1876 m 27 X s 3 lw 880 1876 m20 6 lw 949 1735 m 2 Y s 949 1752 m 2 Y s 914 1745 m 27 X s 956 1745 m 27 X
 s 3 lw 949 1745 m20 6 lw 1017 1650 m 1 Y s 1017 1666 m 1 Y s 983 1658 m 27 X s 1025 1658 m 27 X s 3 lw 1017 1658 m20 6 lw 1052 1583 m 27 X s 1094 1583 m 27 X s 3 lw 1086 1583 m20 6 lw 1121 1505 m 27 X s 1163 1505 m 27 X s 3 lw 1155 1505 m20 6 lw
 1190 1505 m 27 X s 1232 1505 m 27 X s 3 lw 1224 1505 m20 6 lw 1259 1381 m 26 X s 1301 1381 m 26 X s 3 lw 1293 1381 m20 6 lw 1327 1344 m 27 X s 1370 1344 m 26 X s 3 lw 1362 1344 m20 6 lw 1396 1298 m 27 X s 1438 1298 m 27 X s 3 lw 1431 1298 m20 6 lw
 1465 1261 m 27 X s 1507 1261 m 27 X s 3 lw 1500 1261 m20 6 lw 1534 1218 m 27 X s 1576 1218 m 27 X s 3 lw 1569 1218 m20 6 lw 1603 1164 m 27 X s 1645 1164 m 27 X s 3 lw 1638 1164 m20 6 lw 1672 1132 m 27 X s 1714 1132 m 27 X s 3 lw 1706 1132 m20 6 lw
 1741 1090 m 27 X s 1783 1090 m 27 X s 3 lw 1775 1090 m20 6 lw 1810 1042 m 27 X s 1852 1042 m 27 X s 3 lw 1844 1042 m20 6 lw 1879 1026 m 27 X s 1921 1026 m 27 X s 3 lw 1913 1026 m20 6 lw 1948 987 m 26 X s 1990 987 m 27 X s 3 lw 1982 987 m20 6 lw 2017
 919 m 26 X s 2059 919 m 26 X s 3 lw 2051 919 m20 6 lw 2085 963 m 27 X s 2127 963 m 27 X s 3 lw 2120 963 m20 6 lw black
 gsave  2268 2557 0 0 C 2222.06 1856.79 t 90 r /Helvetica-BoldOblique findfont 41.8538 sf 0 0 m (LHC HIGGS XS WG 2013) show NC gr  3 lw 1 1 1 c 839 639 1247 1662 bf black 1270 1662 m -15 Y 832 X 631 Y -16 X -616 Y f 1247 1662 m 639 Y 839 X -639 Y
 -839 X cl s
 gsave  2268 2557 0 0 C 1632.3 2237.28 t 0 r /Helvetica-Bold findfont 60.8783 sf 0 0 m (=125 GeV) show NC gr 
 gsave  2268 2557 0 0 C 1605.67 2206.84 t 0 r /Helvetica-Bold findfont 38.0489 sf 0 0 m (H) show NC gr 
 gsave  2268 2557 0 0 C 1331.71 2237.28 t 0 r /Helvetica-Bold findfont 60.8783 sf 0 0 m 
 216 200 183 149 116 84 68 35
(=8 TeV, m) K NC gr 
 gsave  2268 2557 0 0 C 1297.47 2237.28 t 0 r /Helvetica-Bold findfont 60.8783 sf 0 0 m (s) show NC gr  6 lw 1259 2272 m 23 -39 d s 0 lw 1282 2233 m 8 54 d s 1290 2287 m 42 X s
 gsave  2268 2557 0 0 C 1453.47 2119.33 t 0 r /Helvetica findfont 60.8783 sf 0 0 m (HRes) show NC gr  1 0 0 c 6 lw 1279 2141 m 147 X s black
 gsave  2268 2557 0 0 C 1453.47 2012.79 t 0 r /Helvetica findfont 60.8783 sf 0 0 m (POWHEG) show NC gr  1279 2035 m 147 X s
 gsave  2268 2557 0 0 C 1453.47 1910.06 t 0 r /Helvetica findfont 60.8783 sf 0 0 m (Madgraph) show NC gr  0.35 0.83 0.33 c 1279 1928 m 147 X s black
 gsave  2268 2557 0 0 C 1453.47 1799.71 t 0 r /Helvetica findfont 60.8783 sf 0 0 m (aMCatNLO) show NC gr  1 0.8 0 c 1279 1822 m 147 X s black
 gsave  2268 2557 0 0 C 1453.47 1696.98 t 0 r /Helvetica findfont 60.8783 sf 0 0 m (Sherpa+NLO) show NC gr  0 0 1 c 1279 1715 m 147 X s black 3 lw 1 1 1 c 2268 614 0 0 bf black 1 1 1 c 1791 369 363 245 bf black 1791 369 363 245 bl 363 245 m 1791 X s[
 4 8] 0 sd 363 614 m -369 Y s 707 614 m -369 Y s 1052 614 m -369 Y s 1396 614 m -369 Y s 1741 614 m -369 Y s 2085 614 m -369 Y s 2085 614 m -369 Y s[  ] 0 sd 363 614 m 1791 X s 363 245 m 369 Y s[ 4 8] 0 sd 2154 270 m -1791 X s 2154 319 m -1791 X s
 2154 368 m -1791 X s 2154 417 m -1791 X s 2154 466 m -1791 X s 2154 515 m -1791 X s 2154 565 m -1791 X s 2154 614 m -1791 X s 2154 270 m -1791 X s[  ] 0 sd 2154 245 m 369 Y s 1 0 0 c 6 lw 466 403 m 15 Y s 466 433 m 15 Y s 432 425 m 27 X s 474 425 m
 27 X s 3 lw 466 425 m20 6 lw 535 402 m 8 Y s 535 425 m 9 Y s 501 418 m 26 X s 543 418 m 27 X s 3 lw 535 418 m20 6 lw 604 370 m 6 Y s 604 391 m 6 Y s 570 383 m 26 X s 612 383 m 26 X s 3 lw 604 383 m20 6 lw 673 376 m 2 Y s 673 393 m 2 Y s 638 386 m 27
 X s 681 386 m 26 X s 3 lw 673 386 m20 6 lw 742 372 m 1 Y s 742 388 m 2 Y s 707 381 m 27 X s 749 381 m 27 X s 3 lw 742 381 m20 6 lw 776 378 m 27 X s 818 378 m 27 X s 3 lw 811 378 m20 6 lw 880 366 m 1 Y s 880 382 m s 845 374 m 27 X s 887 374 m 27 X s
 3 lw 880 374 m20 6 lw 949 365 m 1 Y s 949 381 m 1 Y s 914 373 m 27 X s 956 373 m 27 X s 3 lw 949 373 m20 6 lw 1017 370 m 1 Y s 1017 386 m 2 Y s 983 379 m 27 X s 1025 379 m 27 X s 3 lw 1017 379 m20 6 lw 1086 350 m 2 Y s 1086 368 m 2 Y s 1052 360 m 27
 X s 1094 360 m 27 X s 3 lw 1086 360 m20 6 lw 1155 353 m 3 Y s 1155 371 m 3 Y s 1121 364 m 27 X s 1163 364 m 27 X s 3 lw 1155 364 m20 6 lw 1224 361 m 3 Y s 1224 379 m 4 Y s 1190 372 m 27 X s 1232 372 m 27 X s 3 lw 1224 372 m20 6 lw 1293 348 m 3 Y s
 1293 366 m 3 Y s 1259 358 m 26 X s 1301 358 m 26 X s 3 lw 1293 358 m20 6 lw 1362 362 m 5 Y s 1362 382 m 4 Y s 1327 374 m 27 X s 1370 374 m 26 X s 3 lw 1362 374 m20 6 lw 1431 345 m 4 Y s 1431 364 m 4 Y s 1396 357 m 27 X s 1438 357 m 27 X s 3 lw 1431
 357 m20 6 lw 1500 356 m 6 Y s 1500 377 m 6 Y s 1465 370 m 27 X s 1507 370 m 27 X s 3 lw 1500 370 m20 6 lw 1569 355 m 5 Y s 1569 375 m 5 Y s 1534 367 m 27 X s 1576 367 m 27 X s 3 lw 1569 367 m20 6 lw 1638 348 m 6 Y s 1638 369 m 6 Y s 1603 362 m 27 X
 s 1645 362 m 27 X s 3 lw 1638 362 m20 6 lw 1706 351 m 7 Y s 1706 373 m 7 Y s 1672 365 m 27 X s 1714 365 m 27 X s 3 lw 1706 365 m20 6 lw 1775 362 m 8 Y s 1775 386 m 8 Y s 1741 378 m 27 X s 1783 378 m 27 X s 3 lw 1775 378 m20 6 lw 1844 326 m 7 Y s
 1844 348 m 7 Y s 1810 341 m 27 X s 1852 341 m 27 X s 3 lw 1844 341 m20 6 lw 1913 337 m 7 Y s 1913 360 m 7 Y s 1879 352 m 27 X s 1921 352 m 27 X s 3 lw 1913 352 m20 6 lw 1982 336 m 9 Y s 1982 360 m 9 Y s 1948 352 m 26 X s 1990 352 m 27 X s 3 lw 1982
 352 m20 6 lw 2051 347 m 10 Y s 2051 372 m 11 Y s 2017 365 m 26 X s 2059 365 m 26 X s 3 lw 2051 365 m20 6 lw 2120 330 m 10 Y s 2120 356 m 10 Y s 2085 348 m 27 X s 2127 348 m 27 X s 3 lw 2120 348 m20 6 lw black 3 lw 363 245 m 1791 X s
 gsave  2268 614 0 0 C 1944.3 91.3174 t 0 r /Helvetica-Bold findfont 72.4187 sf 0 0 m ( \(GeV\)) show NC gr 
 gsave  2268 614 0 0 C 1913.86 57.0734 t 0 r /Helvetica-Bold findfont 45.7381 sf 0 0 m (T) show NC gr 
 gsave  2268 614 0 0 C 1651.32 91.3174 t 0 r /Helvetica-Bold findfont 72.4187 sf 0 0 m (Higgs p) show NC gr  363 260 m -15 Y s 432 253 m -8 Y s 501 253 m -8 Y s 570 253 m -8 Y s 638 253 m -8 Y s 707 260 m -15 Y s 776 253 m -8 Y s 845 253 m -8 Y s 914
 253 m -8 Y s 983 253 m -8 Y s 1052 260 m -15 Y s 1121 253 m -8 Y s 1190 253 m -8 Y s 1259 253 m -8 Y s 1327 253 m -8 Y s 1396 260 m -15 Y s 1465 253 m -8 Y s 1534 253 m -8 Y s 1603 253 m -8 Y s 1672 253 m -8 Y s 1741 260 m -15 Y s 1810 253 m -8 Y s
 1879 253 m -8 Y s 1948 253 m -8 Y s 2017 253 m -8 Y s 2085 260 m -15 Y s 2085 260 m -15 Y s
 gsave  2268 614 0 0 C 342.44 182.635 t 0 r /Helvetica-Bold findfont 72.4187 sf 0 0 m (0) show NC gr 
 gsave  2268 614 0 0 C 662.051 182.635 t 0 r /Helvetica-Bold findfont 72.4187 sf 0 0 m (10) show NC gr 
 gsave  2268 614 0 0 C 1008.3 182.635 t 0 r /Helvetica-Bold findfont 72.4187 sf 0 0 m (20) show NC gr 
 gsave  2268 614 0 0 C 1350.74 182.635 t 0 r /Helvetica-Bold findfont 72.4187 sf 0 0 m (30) show NC gr 
 gsave  2268 614 0 0 C 1696.98 182.635 t 0 r /Helvetica-Bold findfont 72.4187 sf 0 0 m (40) show NC gr 
 gsave  2268 614 0 0 C 2043.23 182.635 t 0 r /Helvetica-Bold findfont 72.4187 sf 0 0 m (50) show NC gr  363 614 m 1791 X s 363 599 m 15 Y s 432 606 m 8 Y s 501 606 m 8 Y s 570 606 m 8 Y s 638 606 m 8 Y s 707 599 m 15 Y s 776 606 m 8 Y s 845 606 m 8 Y
 s 914 606 m 8 Y s 983 606 m 8 Y s 1052 599 m 15 Y s 1121 606 m 8 Y s 1190 606 m 8 Y s 1259 606 m 8 Y s 1327 606 m 8 Y s 1396 599 m 15 Y s 1465 606 m 8 Y s 1534 606 m 8 Y s 1603 606 m 8 Y s 1672 606 m 8 Y s 1741 599 m 15 Y s 1810 606 m 8 Y s 1879 606
 m 8 Y s 1948 606 m 8 Y s 2017 606 m 8 Y s 2085 599 m 15 Y s 2085 599 m 15 Y s 363 245 m 369 Y s
 gsave  2268 614 0 0 C 228.294 53.2685 t 90 r /Helvetica-Bold findfont 72.4187 sf 0 0 m (Ratio to Powheg) show NC gr  404 270 m -41 X s 383 282 m -20 X s 383 295 m -20 X s 383 307 m -20 X s 404 319 m -41 X s 383 331 m -20 X s 383 344 m -20 X s 383
 356 m -20 X s 404 368 m -41 X s 383 380 m -20 X s 383 393 m -20 X s 383 405 m -20 X s 404 417 m -41 X s 383 430 m -20 X s 383 442 m -20 X s 383 454 m -20 X s 404 466 m -41 X s 383 479 m -20 X s 383 491 m -20 X s 383 503 m -20 X s 404 515 m -41 X s
 383 528 m -20 X s 383 540 m -20 X s 383 552 m -20 X s 404 565 m -41 X s 383 577 m -20 X s 383 589 m -20 X s 383 601 m -20 X s 404 614 m -41 X s 404 270 m -41 X s 383 258 m -20 X s 383 245 m -20 X s
 gsave  2268 614 0 0 C 292.977 254.928 t 0 r /Helvetica-Bold findfont 41.9266 sf 0 0 m (0.6) show NC gr 
 gsave  2268 614 0 0 C 292.977 304.391 t 0 r /Helvetica-Bold findfont 41.9266 sf 0 0 m (0.8) show NC gr 
 gsave  2268 614 0 0 C 331.026 350.05 t 0 r /Helvetica-Bold findfont 41.9266 sf 0 0 m (1) show NC gr 
 gsave  2268 614 0 0 C 292.977 399.514 t 0 r /Helvetica-Bold findfont 41.9266 sf 0 0 m (1.2) show NC gr 
 gsave  2268 614 0 0 C 289.172 448.977 t 0 r /Helvetica-Bold findfont 41.9266 sf 0 0 m (1.4) show NC gr 
 gsave  2268 614 0 0 C 292.977 502.246 t 0 r /Helvetica-Bold findfont 41.9266 sf 0 0 m (1.6) show NC gr 
 gsave  2268 614 0 0 C 292.977 551.71 t 0 r /Helvetica-Bold findfont 41.9266 sf 0 0 m (1.8) show NC gr 
 gsave  2268 614 0 0 C 327.221 597.368 t 0 r /Helvetica-Bold findfont 41.9266 sf 0 0 m (2) show NC gr  2154 245 m 369 Y s 2114 270 m 40 X s 2134 282 m 20 X s 2134 295 m 20 X s 2134 307 m 20 X s 2114 319 m 40 X s 2134 331 m 20 X s 2134 344 m 20 X s
 2134 356 m 20 X s 2114 368 m 40 X s 2134 380 m 20 X s 2134 393 m 20 X s 2134 405 m 20 X s 2114 417 m 40 X s 2134 430 m 20 X s 2134 442 m 20 X s 2134 454 m 20 X s 2114 466 m 40 X s 2134 479 m 20 X s 2134 491 m 20 X s 2134 503 m 20 X s 2114 515 m 40 X
 s 2134 528 m 20 X s 2134 540 m 20 X s 2134 552 m 20 X s 2114 565 m 40 X s 2134 577 m 20 X s 2134 589 m 20 X s 2134 601 m 20 X s 2114 614 m 40 X s 2114 270 m 40 X s 2134 258 m 20 X s 2134 245 m 20 X s 1 0.8 0 c 6 lw 1 1 1 c 1 0.8 0 c 397 356 m 1 Y s
 397 372 m 1 Y s 363 365 m 27 X s 405 365 m 27 X s 3 lw 397 365 m20 6 lw 432 359 m 27 X s 474 359 m 27 X s 3 lw 466 359 m20 6 lw 501 358 m 26 X s 543 358 m 27 X s 3 lw 535 358 m20 6 lw 570 342 m 26 X s 612 342 m 26 X s 3 lw 604 342 m20 6 lw 638 342 m
 27 X s 681 342 m 26 X s 3 lw 673 342 m20 6 lw 707 343 m 27 X s 749 343 m 27 X s 3 lw 742 343 m20 6 lw 776 349 m 27 X s 818 349 m 27 X s 3 lw 811 349 m20 6 lw 845 347 m 27 X s 887 347 m 27 X s 3 lw 880 347 m20 6 lw 914 355 m 27 X s 956 355 m 27 X s 3
 lw 949 355 m20 6 lw 983 365 m 27 X s 1025 365 m 27 X s 3 lw 1017 365 m20 6 lw 1052 363 m 27 X s 1094 363 m 27 X s 3 lw 1086 363 m20 6 lw 1121 360 m 27 X s 1163 360 m 27 X s 3 lw 1155 360 m20 6 lw 1190 373 m 27 X s 1232 373 m 27 X s 3 lw 1224 373 m20
 6 lw 1259 368 m 26 X s 1301 368 m 26 X s 3 lw 1293 368 m20 6 lw 1327 385 m 27 X s 1370 385 m 26 X s 3 lw 1362 385 m20 6 lw 1396 375 m 27 X s 1438 375 m 27 X s 3 lw 1431 375 m20 6 lw 1465 389 m 27 X s 1507 389 m 27 X s 3 lw 1500 389 m20 6 lw 1534 391
 m 27 X s 1576 391 m 27 X s 3 lw 1569 391 m20 6 lw 1603 382 m 27 X s 1645 382 m 27 X s 3 lw 1638 382 m20 6 lw 1672 390 m 27 X s 1714 390 m 27 X s 3 lw 1706 390 m20 6 lw 1741 406 m 27 X s 1783 406 m 27 X s 3 lw 1775 406 m20 6 lw 1810 384 m 27 X s 1852
 384 m 27 X s 3 lw 1844 384 m20 6 lw 1879 395 m 27 X s 1921 395 m 27 X s 3 lw 1913 395 m20 6 lw 1948 393 m 26 X s 1990 393 m 27 X s 3 lw 1982 393 m20 6 lw 2051 392 m 1 Y s 2051 408 m s 2017 400 m 26 X s 2059 400 m 26 X s 3 lw 2051 400 m20 6 lw 2120
 385 m s 2120 400 m s 2085 392 m 27 X s 2127 392 m 27 X s 3 lw 2120 392 m20 6 lw 0.35 0.83 0.33 c 1 1 1 c 0.35 0.83 0.33 c 397 473 m 5 Y s 397 494 m 5 Y s 363 486 m 27 X s 405 486 m 27 X s 3 lw 397 486 m20 6 lw 432 462 m 27 X s 474 462 m 27 X s 3 lw
 466 462 m20 6 lw 501 445 m 26 X s 543 445 m 27 X s 3 lw 535 445 m20 6 lw 570 408 m 26 X s 612 408 m 26 X s 3 lw 604 408 m20 6 lw 638 391 m 27 X s 681 391 m 26 X s 3 lw 673 391 m20 6 lw 707 377 m 27 X s 749 377 m 27 X s 3 lw 742 377 m20 6 lw 776 377
 m 27 X s 818 377 m 27 X s 3 lw 811 377 m20 6 lw 845 365 m 27 X s 887 365 m 27 X s 3 lw 880 365 m20 6 lw 914 368 m 27 X s 956 368 m 27 X s 3 lw 949 368 m20 6 lw 983 368 m 27 X s 1025 368 m 27 X s 3 lw 1017 368 m20 6 lw 1052 362 m 27 X s 1094 362 m 27
 X s 3 lw 1086 362 m20 6 lw 1121 358 m 27 X s 1163 358 m 27 X s 3 lw 1155 358 m20 6 lw 1190 361 m 27 X s 1232 361 m 27 X s 3 lw 1224 361 m20 6 lw 1259 351 m 26 X s 1301 351 m 26 X s 3 lw 1293 351 m20 6 lw 1327 358 m 27 X s 1370 358 m 26 X s 3 lw 1362
 358 m20 6 lw 1396 347 m 27 X s 1438 347 m 27 X s 3 lw 1431 347 m20 6 lw 1465 350 m 27 X s 1507 350 m 27 X s 3 lw 1500 350 m20 6 lw 1534 350 m 27 X s 1576 350 m 27 X s 3 lw 1569 350 m20 6 lw 1603 340 m 27 X s 1645 340 m 27 X s 3 lw 1638 340 m20 6 lw
 1672 345 m 27 X s 1714 345 m 27 X s 3 lw 1706 345 m20 6 lw 1741 356 m 27 X s 1783 356 m 27 X s 3 lw 1775 356 m20 6 lw 1810 333 m 27 X s 1852 333 m 27 X s 3 lw 1844 333 m20 6 lw 1879 342 m 27 X s 1921 342 m 27 X s 3 lw 1913 342 m20 6 lw 1948 340 m 26
 X s 1990 340 m 27 X s 3 lw 1982 340 m20 6 lw 2017 343 m 26 X s 2059 343 m 26 X s 3 lw 2051 343 m20 6 lw 2085 341 m 27 X s 2127 341 m 27 X s 3 lw 2120 341 m20 6 lw 0 0 1 c 1 1 1 c 0 0 1 c 397 389 m 2 Y s 397 406 m 2 Y s 363 399 m 27 X s 405 399 m 27
 X s 3 lw 397 399 m20 6 lw 432 251 m 27 X s 474 251 m 27 X s 3 lw 466 251 m20 6 lw 501 347 m 26 X s 543 347 m 27 X s 3 lw 535 347 m20 6 lw 570 343 m 26 X s 612 343 m 26 X s 3 lw 604 343 m20 6 lw 638 395 m 27 X s 681 395 m 26 X s 3 lw 673 395 m20 6 lw
 707 376 m 27 X s 749 376 m 27 X s 3 lw 742 376 m20 6 lw 776 370 m 27 X s 818 370 m 27 X s 3 lw 811 370 m20 6 lw 845 377 m 27 X s 887 377 m 27 X s 3 lw 880 377 m20 6 lw 914 369 m 27 X s 956 369 m 27 X s 3 lw 949 369 m20 6 lw 983 368 m 27 X s 1025 368
 m 27 X s 3 lw 1017 368 m20 6 lw 1052 361 m 27 X s 1094 361 m 27 X s 3 lw 1086 361 m20 6 lw 1121 357 m 27 X s 1163 357 m 27 X s 3 lw 1155 357 m20 6 lw 1190 383 m 27 X s 1232 383 m 27 X s 3 lw 1224 383 m20 6 lw 1259 354 m 26 X s 1301 354 m 26 X s 3 lw
 1293 354 m20 6 lw 1327 372 m 27 X s 1370 372 m 26 X s 3 lw 1362 372 m20 6 lw 1396 366 m 27 X s 1438 366 m 27 X s 3 lw 1431 366 m20 6 lw 1465 377 m 27 X s 1507 377 m 27 X s 3 lw 1500 377 m20 6 lw 1534 380 m 27 X s 1576 380 m 27 X s 3 lw 1569 380 m20
 6 lw 1603 368 m 27 X s 1645 368 m 27 X s 3 lw 1638 368 m20 6 lw 1672 372 m 27 X s 1714 372 m 27 X s 3 lw 1706 372 m20 6 lw 1741 383 m 27 X s 1783 383 m 27 X s 3 lw 1775 383 m20 6 lw 1810 353 m 27 X s 1852 353 m 27 X s 3 lw 1844 353 m20 6 lw 1879 366
 m 27 X s 1921 366 m 27 X s 3 lw 1913 366 m20 6 lw 1948 358 m 26 X s 1990 358 m 27 X s 3 lw 1982 358 m20 6 lw 2017 329 m 26 X s 2059 329 m 26 X s 3 lw 2051 329 m20 6 lw 2085 375 m 27 X s 2127 375 m 27 X s 3 lw 2120 375 m20 6 lw black 363 368 m 1722 X
 s
 gr  gr showpage
end
%%EOF
