%!PS-Adobe-3.0 EPSF-3.0
%%BoundingBox: (atend)
%%LanguageLevel: 2
%%Creator: Grace-5.1.22
%%CreationDate: Tue Mar 26 12:46:39 2013
%%DocumentData: Clean8Bit
%%Orientation: Portrait
%%Title: /home/pcl302a/heinemey/plot/grace/2012/lhc-higgs-br/mhmaxup_tb10_BR-A0.grace
%%For: heinemey
%%DocumentNeededResources: (atend)
%%EndComments
%%BeginProlog
/m {moveto} def
/l {lineto} def
/s {stroke} def
/n {newpath} def
/c {closepath} def
/RL {rlineto} def
/SLW {setlinewidth} def
/GS {gsave} def
/GR {grestore} def
/SC {setcolor} def
/SGRY {setgray} def
/SRGB {setrgbcolor} def
/SD {setdash} def
/SLC {setlinecap} def
/SLJ {setlinejoin} def
/SCS {setcolorspace} def
/FFSF {findfont setfont} def
/CC {concat} def
/PXL {n m 0 0 RL s} def
/Color0 {1.0000 1.0000 1.0000} def
/Color1 {0.0000 0.0000 0.0000} def
/Color2 {1.0000 0.0000 0.0000} def
/Color3 {0.0000 1.0000 0.0000} def
/Color4 {0.0000 0.0000 1.0000} def
/Color5 {1.0000 1.0000 0.0000} def
/Color6 {0.7373 0.5608 0.5608} def
/Color7 {0.8627 0.8627 0.8627} def
/Color8 {0.5804 0.0000 0.8275} def
/Color9 {0.0000 1.0000 1.0000} def
/Color10 {1.0000 0.0000 1.0000} def
/Color11 {1.0000 0.6471 0.0000} def
/Color12 {0.4471 0.1294 0.7373} def
/Color13 {0.4039 0.0275 0.2824} def
/Color14 {0.2510 0.8784 0.8157} def
/Color15 {0.0000 0.5451 0.0000} def
/Color16 {0.7529 0.7529 0.7529} def
/Color17 {0.5059 0.5059 0.5059} def
/Color18 {0.2588 0.2588 0.2588} def
/PTRN {
 /pat_bits exch def 
 <<
  /PaintType 2
  /PatternType 1 /TilingType 1
  /BBox[0 0 16 16]
  /XStep 16 /YStep 16
  /PaintProc {
   pop
   16 16 true [-1 0 0 -1 16 16] pat_bits imagemask
  }
 >>
 [0.0016 0 0 0.0016 0 0]
 makepattern
} def
/Pattern0 {<0000000000000000000000000000000000000000000000000000000000000000> PTRN} bind def
/Pattern1 {<ffffffffffffffffffffffffffffffffffffffffffffffffffffffffffffffff> PTRN} bind def
/Pattern2 {<eeeeffffbbbbffffeeeeffffbbbbffffeeeeffffbbbbffffeeeeffffbbbbffff> PTRN} bind def
/Pattern3 {<eeeebbbbeeeebbbbeeeebbbbeeeebbbbeeeebbbbeeeebbbbeeeebbbbeeeebbbb> PTRN} bind def
/Pattern4 {<5555aaaa5555aaaa5555aaaa5555aaaa5555aaaa5555aaaa5555aaaa5555aaaa> PTRN} bind def
/Pattern5 {<1111444411114444111144441111444411114444111144441111444411114444> PTRN} bind def
/Pattern6 {<1111000044440000111100004444000011110000444400001111000044440000> PTRN} bind def
/Pattern7 {<1010000000000000010100000000000010100000000000000101000000000000> PTRN} bind def
/Pattern8 {<0000000000000000000000000000000000000000000000000000000000000000> PTRN} bind def
/Pattern9 {<1e1e0f0f8787c3c3e1e1f0f078783c3c1e1e0f0f8787c3c3e1e1f0f078783c3c> PTRN} bind def
/Pattern10 {<7878f0f0e1e1c3c387870f0f1e1e3c3c7878f0f0e1e1c3c387870f0f1e1e3c3c> PTRN} bind def
/Pattern11 {<3333333333333333333333333333333333333333333333333333333333333333> PTRN} bind def
/Pattern12 {<ffffffff00000000ffffffff00000000ffffffff00000000ffffffff00000000> PTRN} bind def
/Pattern13 {<8181424224241818181824244242818181814242242418181818242442428181> PTRN} bind def
/Pattern14 {<8080404020201010080804040202010180804040202010100808040402020101> PTRN} bind def
/Pattern15 {<0101020204040808101020204040808001010202040408081010202040408080> PTRN} bind def
/Pattern16 {<2222222222222222222222222222222222222222222222222222222222222222> PTRN} bind def
/Pattern17 {<0000ffff000000000000ffff000000000000ffff000000000000ffff00000000> PTRN} bind def
/Pattern18 {<2222ffff222222222222ffff222222222222ffff222222222222ffff22222222> PTRN} bind def
/Pattern19 {<ffffffff33333333ffffffff33333333ffffffff33333333ffffffff33333333> PTRN} bind def
/Pattern20 {<0f0f0f0f0f0f0f0ff0f0f0f0f0f0f0f00f0f0f0f0f0f0f0ff0f0f0f0f0f0f0f0> PTRN} bind def
/Pattern21 {<ff00ff00ff00ff00ff00ff00ff00ff0000ff00ff00ff00ff00ff00ff00ff00ff> PTRN} bind def
/Pattern22 {<8001800180018001800180018001ffffffff8001800180018001800180018001> PTRN} bind def
/Pattern23 {<c003c003c003c003c003c003ffffffffffffffffc003c003c003c003c003c003> PTRN} bind def
/Pattern24 {<040404040404ffff404040404040ffff040404040404ffff404040404040ffff> PTRN} bind def
/Pattern25 {<180018001800180018001800ffffffff001800180018001800180018ffffffff> PTRN} bind def
/Pattern26 {<1111b8b87c7c3a3a1111a3a3c7c78b8b1111b8b87c7c3a3a1111a3a3c7c78b8b> PTRN} bind def
/Pattern27 {<101010102828c7c70101010182827c7c101010102828c7c70101010182827c7c> PTRN} bind def
/Pattern28 {<1c1c121211112121c1c12121111112121c1c121211112121c1c1212111111212> PTRN} bind def
/Pattern29 {<3e3e414180808080e3e31414080808083e3e414180808080e3e3141408080808> PTRN} bind def
/Pattern30 {<4848888884848383848488884848383848488888848483838484888848483838> PTRN} bind def
/Pattern31 {<03030404080808080c0c12122121c0c003030404080808080c0c12122121c0c0> PTRN} bind def
/ellipsedict 8 dict def
ellipsedict /mtrx matrix put
/EARC {
 ellipsedict begin
  /endangle exch def
  /startangle exch def
  /yrad exch def
  /xrad exch def
  /y exch def
  /x exch def
  /savematrix mtrx currentmatrix def
  x y translate
  xrad yrad scale
  0 0 1 startangle endangle arc
  savematrix setmatrix
 end
} def
/TL {
  /kcomp exch def
  /linewidth exch def
  /offset exch def
  GS
  0 offset rmoveto
  linewidth SLW
  dup stringwidth exch kcomp add exch RL s
  GR
} def
/KINIT
{
 /kvector exch def
 /kid 0 def
} def
/KPROC
{
 pop pop
 kvector kid get
 0 rmoveto
 /kid 1 kid add def
} def
/DefEncoding [
 /.notdef
 /.notdef
 /.notdef
 /.notdef
 /.notdef
 /.notdef
 /.notdef
 /.notdef
 /.notdef
 /.notdef
 /.notdef
 /.notdef
 /.notdef
 /.notdef
 /.notdef
 /.notdef
 /.notdef
 /.notdef
 /.notdef
 /.notdef
 /.notdef
 /.notdef
 /.notdef
 /.notdef
 /.notdef
 /.notdef
 /.notdef
 /.notdef
 /.notdef
 /.notdef
 /.notdef
 /.notdef
 /space
 /exclam
 /quotedbl
 /numbersign
 /dollar
 /percent
 /ampersand
 /quoteright
 /parenleft
 /parenright
 /asterisk
 /plus
 /comma
 /hyphen
 /period
 /slash
 /zero
 /one
 /two
 /three
 /four
 /five
 /six
 /seven
 /eight
 /nine
 /colon
 /semicolon
 /less
 /equal
 /greater
 /question
 /at
 /A
 /B
 /C
 /D
 /E
 /F
 /G
 /H
 /I
 /J
 /K
 /L
 /M
 /N
 /O
 /P
 /Q
 /R
 /S
 /T
 /U
 /V
 /W
 /X
 /Y
 /Z
 /bracketleft
 /backslash
 /bracketright
 /asciicircum
 /underscore
 /grave
 /a
 /b
 /c
 /d
 /e
 /f
 /g
 /h
 /i
 /j
 /k
 /l
 /m
 /n
 /o
 /p
 /q
 /r
 /s
 /t
 /u
 /v
 /w
 /x
 /y
 /z
 /braceleft
 /bar
 /braceright
 /asciitilde
 /.notdef
 /.notdef
 /.notdef
 /.notdef
 /.notdef
 /.notdef
 /.notdef
 /.notdef
 /.notdef
 /.notdef
 /.notdef
 /.notdef
 /.notdef
 /.notdef
 /.notdef
 /.notdef
 /.notdef
 /.notdef
 /.notdef
 /.notdef
 /.notdef
 /.notdef
 /.notdef
 /.notdef
 /.notdef
 /.notdef
 /.notdef
 /.notdef
 /.notdef
 /.notdef
 /.notdef
 /.notdef
 /.notdef
 /space
 /exclamdown
 /cent
 /sterling
 /currency
 /yen
 /brokenbar
 /section
 /dieresis
 /copyright
 /ordfeminine
 /guillemotleft
 /logicalnot
 /hyphen
 /registered
 /macron
 /degree
 /plusminus
 /twosuperior
 /threesuperior
 /acute
 /mu
 /paragraph
 /periodcentered
 /cedilla
 /onesuperior
 /ordmasculine
 /guillemotright
 /onequarter
 /onehalf
 /threequarters
 /questiondown
 /Agrave
 /Aacute
 /Acircumflex
 /Atilde
 /Adieresis
 /Aring
 /AE
 /Ccedilla
 /Egrave
 /Eacute
 /Ecircumflex
 /Edieresis
 /Igrave
 /Iacute
 /Icircumflex
 /Idieresis
 /Eth
 /Ntilde
 /Ograve
 /Oacute
 /Ocircumflex
 /Otilde
 /Odieresis
 /multiply
 /Oslash
 /Ugrave
 /Uacute
 /Ucircumflex
 /Udieresis
 /Yacute
 /Thorn
 /germandbls
 /agrave
 /aacute
 /acircumflex
 /atilde
 /adieresis
 /aring
 /ae
 /ccedilla
 /egrave
 /eacute
 /ecircumflex
 /edieresis
 /igrave
 /iacute
 /icircumflex
 /idieresis
 /eth
 /ntilde
 /ograve
 /oacute
 /ocircumflex
 /otilde
 /odieresis
 /divide
 /oslash
 /ugrave
 /uacute
 /ucircumflex
 /udieresis
 /yacute
 /thorn
 /ydieresis
] def
%%EndProlog
%%BeginSetup
%%EndSetup
612.00 612.00 scale
[/DeviceRGB] SCS
Color2 SC
[] 0 SD
0.0045 SLW
0 SLC
0 SLJ
n
0.5070 0.1499 m
0.5076 0.1526 l
0.5092 0.1594 l
0.5108 0.1662 l
0.5124 0.1731 l
0.5139 0.1801 l
0.5155 0.1872 l
0.5171 0.1945 l
0.5186 0.2018 l
0.5202 0.2093 l
0.5218 0.2169 l
0.5233 0.2248 l
0.5249 0.2328 l
0.5265 0.2411 l
0.5280 0.2496 l
0.5296 0.2585 l
0.5312 0.2677 l
0.5327 0.2773 l
0.5343 0.2875 l
0.5359 0.2982 l
0.5375 0.3097 l
0.5390 0.3221 l
0.5406 0.3357 l
0.5422 0.3509 l
0.5437 0.3684 l
0.5453 0.3892 l
0.5469 0.4216 l
0.5484 0.4616 l
0.5502 0.5077 l
0.5516 0.5457 l
0.5531 0.5838 l
0.5547 0.6136 l
0.5563 0.6318 l
0.5578 0.6349 l
0.5594 0.6376 l
0.5610 0.6399 l
0.5625 0.6419 l
0.5641 0.6437 l
0.5657 0.6453 l
0.5673 0.6467 l
0.5688 0.6481 l
0.5704 0.6493 l
0.5720 0.6504 l
0.5735 0.6515 l
0.5751 0.6525 l
0.5767 0.6534 l
0.5782 0.6542 l
0.5798 0.6550 l
0.5814 0.6557 l
0.5829 0.6564 l
0.5845 0.6571 l
0.5861 0.6577 l
0.5876 0.6583 l
0.5892 0.6589 l
0.5908 0.6594 l
0.5924 0.6599 l
0.5939 0.6604 l
0.5955 0.6609 l
0.5971 0.6613 l
0.5986 0.6617 l
0.6002 0.6621 l
0.6018 0.6625 l
0.6033 0.6629 l
0.6049 0.6633 l
0.6065 0.6636 l
0.6080 0.6639 l
0.6096 0.6642 l
0.6112 0.6645 l
0.6127 0.6648 l
0.6143 0.6651 l
0.6159 0.6654 l
0.6175 0.6656 l
0.6190 0.6659 l
0.6206 0.6661 l
0.6222 0.6663 l
0.6237 0.6665 l
0.6253 0.6668 l
0.6269 0.6670 l
0.6284 0.6672 l
0.6300 0.6674 l
0.6316 0.6675 l
0.6331 0.6677 l
0.6347 0.6679 l
0.6363 0.6681 l
0.6378 0.6682 l
0.6394 0.6684 l
0.6410 0.6685 l
0.6425 0.6687 l
0.6441 0.6688 l
0.6457 0.6690 l
0.6473 0.6691 l
0.6488 0.6692 l
0.6504 0.6693 l
0.6520 0.6695 l
0.6535 0.6696 l
0.6551 0.6697 l
0.6567 0.6698 l
0.6582 0.6699 l
0.6598 0.6700 l
0.6614 0.6700 l
0.6629 0.6701 l
0.6645 0.6702 l
0.6661 0.6701 l
0.6676 0.6700 l
0.6692 0.6700 l
0.6708 0.6700 l
0.6724 0.6700 l
0.6739 0.6700 l
0.6755 0.6700 l
0.6771 0.6700 l
0.6786 0.6700 l
0.6802 0.6700 l
0.6818 0.6699 l
0.6833 0.6699 l
0.6849 0.6699 l
0.6865 0.6699 l
0.6880 0.6699 l
0.6896 0.6698 l
0.6912 0.6698 l
0.6927 0.6698 l
0.6943 0.6698 l
0.6959 0.6697 l
0.6975 0.6697 l
0.6990 0.6697 l
0.7006 0.6696 l
0.7022 0.6696 l
0.7037 0.6695 l
0.7053 0.6695 l
0.7069 0.6695 l
0.7084 0.6694 l
0.7100 0.6694 l
0.7116 0.6693 l
0.7131 0.6693 l
0.7147 0.6692 l
0.7163 0.6692 l
0.7178 0.6691 l
0.7194 0.6691 l
0.7210 0.6690 l
0.7225 0.6690 l
0.7241 0.6689 l
0.7257 0.6689 l
0.7273 0.6688 l
0.7288 0.6688 l
0.7304 0.6687 l
0.7320 0.6687 l
0.7335 0.6686 l
0.7351 0.6685 l
0.7367 0.6685 l
0.7382 0.6684 l
0.7398 0.6684 l
0.7414 0.6683 l
0.7429 0.6683 l
0.7445 0.6682 l
0.7461 0.6681 l
0.7476 0.6681 l
0.7492 0.6680 l
0.7508 0.6679 l
0.7524 0.6679 l
0.7539 0.6678 l
0.7555 0.6678 l
0.7571 0.6677 l
0.7586 0.6676 l
0.7602 0.6676 l
0.7618 0.6675 l
0.7633 0.6674 l
0.7649 0.6673 l
0.7665 0.6673 l
0.7680 0.6672 l
0.7696 0.6671 l
0.7712 0.6670 l
0.7727 0.6669 l
0.7743 0.6669 l
0.7759 0.6668 l
0.7775 0.6667 l
0.7790 0.6666 l
0.7806 0.6665 l
0.7822 0.6664 l
0.7837 0.6664 l
0.7853 0.6663 l
0.7869 0.6662 l
0.7884 0.6661 l
0.7900 0.6660 l
0.7916 0.6659 l
0.7931 0.6658 l
0.7947 0.6657 l
0.7963 0.6657 l
0.7978 0.6656 l
0.7994 0.6655 l
0.8010 0.6654 l
0.8025 0.6653 l
0.8041 0.6652 l
0.8057 0.6651 l
0.8073 0.6650 l
0.8088 0.6649 l
0.8104 0.6649 l
0.8120 0.6648 l
0.8135 0.6647 l
0.8151 0.6646 l
0.8167 0.6645 l
0.8182 0.6644 l
0.8198 0.6643 l
0.8214 0.6642 l
0.8229 0.6641 l
0.8245 0.6640 l
0.8261 0.6640 l
0.8276 0.6639 l
0.8292 0.6638 l
0.8308 0.6637 l
0.8324 0.6636 l
0.8339 0.6635 l
0.8355 0.6634 l
0.8371 0.6633 l
0.8386 0.6632 l
0.8402 0.6632 l
0.8418 0.6631 l
0.8433 0.6630 l
0.8449 0.6629 l
0.8465 0.6628 l
0.8480 0.6627 l
0.8496 0.6626 l
0.8512 0.6626 l
0.8527 0.6613 l
0.8543 0.6605 l
0.8559 0.6598 l
0.8575 0.6593 l
0.8590 0.6589 l
0.8606 0.6584 l
0.8622 0.6581 l
0.8637 0.6577 l
0.8653 0.6574 l
0.8669 0.6570 l
0.8684 0.6567 l
0.8700 0.6565 l
0.8716 0.6562 l
0.8731 0.6559 l
0.8747 0.6556 l
0.8763 0.6554 l
0.8778 0.6551 l
0.8794 0.6549 l
0.8810 0.6547 l
0.8825 0.6544 l
0.8841 0.6542 l
0.8857 0.6540 l
0.8873 0.6538 l
0.8888 0.6536 l
0.8904 0.6533 l
0.8920 0.6531 l
0.8935 0.6529 l
0.8951 0.6528 l
0.8967 0.6526 l
0.8982 0.6524 l
0.8998 0.6522 l
0.9014 0.6520 l
0.9029 0.6518 l
0.9045 0.6516 l
0.9061 0.6515 l
0.9076 0.6513 l
0.9092 0.6511 l
0.9108 0.6510 l
0.9124 0.6508 l
0.9139 0.6506 l
0.9155 0.6505 l
0.9171 0.6503 l
0.9186 0.6501 l
0.9202 0.6500 l
0.9218 0.6498 l
0.9233 0.6497 l
0.9249 0.6495 l
0.9265 0.6494 l
0.9280 0.6492 l
0.9296 0.6491 l
0.9312 0.6489 l
0.9327 0.6488 l
0.9343 0.6486 l
0.9359 0.6485 l
0.9375 0.6484 l
0.9390 0.6482 l
0.9406 0.6481 l
0.9422 0.6480 l
0.9437 0.6478 l
0.9453 0.6477 l
0.9469 0.6476 l
0.9484 0.6474 l
0.9500 0.6473 l
s
[/DeviceRGB] SCS
Color3 SC
n
0.1500 0.8913 m
0.1516 0.8913 l
0.1531 0.8913 l
0.1547 0.8912 l
0.1563 0.8912 l
0.1578 0.8912 l
0.1594 0.8912 l
0.1610 0.8912 l
0.1625 0.8912 l
0.1641 0.8911 l
0.1657 0.8911 l
0.1673 0.8911 l
0.1688 0.8911 l
0.1704 0.8911 l
0.1720 0.8911 l
0.1735 0.8911 l
0.1751 0.8911 l
0.1767 0.8910 l
0.1782 0.8910 l
0.1798 0.8910 l
0.1814 0.8910 l
0.1829 0.8910 l
0.1845 0.8910 l
0.1861 0.8910 l
0.1876 0.8909 l
0.1892 0.8909 l
0.1908 0.8909 l
0.1924 0.8909 l
0.1939 0.8909 l
0.1955 0.8909 l
0.1971 0.8909 l
0.1986 0.8909 l
0.2002 0.8908 l
0.2018 0.8908 l
0.2033 0.8908 l
0.2049 0.8908 l
0.2065 0.8908 l
0.2080 0.8908 l
0.2096 0.8908 l
0.2112 0.8908 l
0.2127 0.8908 l
0.2143 0.8907 l
0.2159 0.8907 l
0.2175 0.8907 l
0.2190 0.8907 l
0.2206 0.8907 l
0.2222 0.8907 l
0.2237 0.8907 l
0.2253 0.8907 l
0.2269 0.8907 l
0.2284 0.8906 l
0.2300 0.8906 l
0.2316 0.8906 l
0.2331 0.8906 l
0.2347 0.8906 l
0.2363 0.8906 l
0.2378 0.8906 l
0.2394 0.8906 l
0.2410 0.8906 l
0.2425 0.8906 l
0.2441 0.8905 l
0.2457 0.8905 l
0.2473 0.8905 l
0.2488 0.8905 l
0.2504 0.8905 l
0.2520 0.8905 l
0.2535 0.8905 l
0.2551 0.8905 l
0.2567 0.8905 l
0.2582 0.8905 l
0.2598 0.8905 l
0.2614 0.8904 l
0.2629 0.8904 l
0.2645 0.8904 l
0.2661 0.8904 l
0.2676 0.8904 l
0.2692 0.8904 l
0.2708 0.8904 l
0.2724 0.8904 l
0.2739 0.8904 l
0.2755 0.8904 l
0.2771 0.8904 l
0.2786 0.8903 l
0.2802 0.8892 l
0.2818 0.8882 l
0.2833 0.8876 l
0.2849 0.8871 l
0.2865 0.8867 l
0.2880 0.8863 l
0.2896 0.8859 l
0.2912 0.8856 l
0.2927 0.8853 l
0.2943 0.8851 l
0.2959 0.8848 l
0.2975 0.8846 l
0.2990 0.8843 l
0.3006 0.8841 l
0.3022 0.8839 l
0.3037 0.8837 l
0.3053 0.8835 l
0.3069 0.8834 l
0.3084 0.8832 l
0.3100 0.8830 l
0.3116 0.8829 l
0.3131 0.8827 l
0.3147 0.8825 l
0.3163 0.8824 l
0.3178 0.8823 l
0.3194 0.8821 l
0.3210 0.8820 l
0.3225 0.8819 l
0.3241 0.8817 l
0.3257 0.8816 l
0.3273 0.8815 l
0.3288 0.8814 l
0.3304 0.8812 l
0.3320 0.8811 l
0.3335 0.8810 l
0.3351 0.8809 l
0.3367 0.8808 l
0.3382 0.8807 l
0.3398 0.8806 l
0.3414 0.8805 l
0.3429 0.8804 l
0.3445 0.8803 l
0.3461 0.8802 l
0.3476 0.8801 l
0.3492 0.8800 l
0.3508 0.8799 l
0.3524 0.8799 l
0.3539 0.8798 l
0.3555 0.8797 l
0.3571 0.8796 l
0.3586 0.8795 l
0.3602 0.8794 l
0.3618 0.8793 l
0.3633 0.8792 l
0.3649 0.8792 l
0.3665 0.8791 l
0.3680 0.8790 l
0.3696 0.8789 l
0.3712 0.8788 l
0.3727 0.8788 l
0.3743 0.8787 l
0.3759 0.8786 l
0.3775 0.8785 l
0.3790 0.8766 l
0.3806 0.8744 l
0.3822 0.8731 l
0.3837 0.8721 l
0.3853 0.8712 l
0.3869 0.8704 l
0.3884 0.8697 l
0.3900 0.8690 l
0.3916 0.8684 l
0.3931 0.8678 l
0.3947 0.8673 l
0.3963 0.8668 l
0.3978 0.8663 l
0.3994 0.8659 l
0.4010 0.8654 l
0.4025 0.8650 l
0.4041 0.8646 l
0.4057 0.8642 l
0.4073 0.8638 l
0.4088 0.8635 l
0.4104 0.8631 l
0.4120 0.8628 l
0.4135 0.8624 l
0.4151 0.8621 l
0.4167 0.8618 l
0.4182 0.8615 l
0.4198 0.8612 l
0.4214 0.8609 l
0.4229 0.8606 l
0.4245 0.8603 l
0.4261 0.8601 l
0.4276 0.8598 l
0.4292 0.8595 l
0.4308 0.8593 l
0.4324 0.8590 l
0.4339 0.8588 l
0.4355 0.8586 l
0.4371 0.8583 l
0.4386 0.8581 l
0.4402 0.8579 l
0.4418 0.8577 l
0.4433 0.8574 l
0.4449 0.8572 l
0.4465 0.8570 l
0.4480 0.8568 l
0.4496 0.8566 l
0.4512 0.8564 l
0.4527 0.8562 l
0.4543 0.8560 l
0.4559 0.8558 l
0.4575 0.8557 l
0.4590 0.8555 l
0.4606 0.8553 l
0.4622 0.8476 l
0.4637 0.8436 l
0.4653 0.8407 l
0.4669 0.8384 l
0.4684 0.8365 l
0.4700 0.8348 l
0.4716 0.8332 l
0.4731 0.8318 l
0.4747 0.8305 l
0.4763 0.8293 l
0.4778 0.8278 l
0.4794 0.8259 l
0.4810 0.8245 l
0.4825 0.8233 l
0.4841 0.8221 l
0.4857 0.8210 l
0.4873 0.8200 l
0.4888 0.8190 l
0.4904 0.8181 l
0.4920 0.8172 l
0.4935 0.8164 l
0.4951 0.8156 l
0.4967 0.8148 l
0.4982 0.8140 l
0.4998 0.8133 l
0.5014 0.8126 l
0.5029 0.8119 l
0.5045 0.8113 l
0.5061 0.8106 l
0.5076 0.8100 l
0.5092 0.8094 l
0.5108 0.8088 l
0.5124 0.8083 l
0.5139 0.8077 l
0.5155 0.8072 l
0.5171 0.8066 l
0.5186 0.8061 l
0.5202 0.8056 l
0.5218 0.8051 l
0.5233 0.8046 l
0.5249 0.8042 l
0.5265 0.8037 l
0.5280 0.8032 l
0.5296 0.8028 l
0.5312 0.8024 l
0.5327 0.8019 l
0.5343 0.8015 l
0.5359 0.8011 l
0.5375 0.8007 l
0.5390 0.8003 l
0.5406 0.7999 l
0.5422 0.7995 l
0.5437 0.7991 l
0.5453 0.7987 l
0.5469 0.7982 l
0.5484 0.7977 l
0.5502 0.7955 l
0.5516 0.7944 l
0.5531 0.7932 l
0.5547 0.7919 l
0.5563 0.7909 l
0.5578 0.7903 l
0.5594 0.7898 l
0.5610 0.7893 l
0.5625 0.7888 l
0.5641 0.7883 l
0.5657 0.7879 l
0.5673 0.7874 l
0.5688 0.7870 l
0.5704 0.7866 l
0.5720 0.7862 l
0.5735 0.7858 l
0.5751 0.7855 l
0.5767 0.7851 l
0.5782 0.7847 l
0.5798 0.7844 l
0.5814 0.7840 l
0.5829 0.7837 l
0.5845 0.7834 l
0.5861 0.7830 l
0.5876 0.7827 l
0.5892 0.7824 l
0.5908 0.7821 l
0.5924 0.7818 l
0.5939 0.7815 l
0.5955 0.7812 l
0.5971 0.7809 l
0.5986 0.7806 l
0.6002 0.7803 l
0.6018 0.7801 l
0.6033 0.7798 l
0.6049 0.7795 l
0.6065 0.7793 l
0.6080 0.7790 l
0.6096 0.7788 l
0.6112 0.7785 l
0.6127 0.7783 l
0.6143 0.7780 l
0.6159 0.7778 l
0.6175 0.7775 l
0.6190 0.7773 l
0.6206 0.7771 l
0.6222 0.7768 l
0.6237 0.7766 l
0.6253 0.7764 l
0.6269 0.7761 l
0.6284 0.7759 l
0.6300 0.7757 l
0.6316 0.7755 l
0.6331 0.7753 l
0.6347 0.7751 l
0.6363 0.7749 l
0.6378 0.7747 l
0.6394 0.7745 l
0.6410 0.7743 l
0.6425 0.7741 l
0.6441 0.7739 l
0.6457 0.7737 l
0.6473 0.7735 l
0.6488 0.7733 l
0.6504 0.7731 l
0.6520 0.7729 l
0.6535 0.7727 l
0.6551 0.7726 l
0.6567 0.7724 l
0.6582 0.7722 l
0.6598 0.7720 l
0.6614 0.7718 l
0.6629 0.7716 l
0.6645 0.7714 l
0.6661 0.7710 l
0.6676 0.7707 l
0.6692 0.7705 l
0.6708 0.7702 l
0.6724 0.7699 l
0.6739 0.7697 l
0.6755 0.7695 l
0.6771 0.7692 l
0.6786 0.7690 l
0.6802 0.7687 l
0.6818 0.7685 l
0.6833 0.7683 l
0.6849 0.7680 l
0.6865 0.7678 l
0.6880 0.7676 l
0.6896 0.7673 l
0.6912 0.7671 l
0.6927 0.7669 l
0.6943 0.7667 l
0.6959 0.7664 l
0.6975 0.7662 l
0.6990 0.7660 l
0.7006 0.7658 l
0.7022 0.7655 l
0.7037 0.7653 l
0.7053 0.7651 l
0.7069 0.7649 l
0.7084 0.7647 l
0.7100 0.7645 l
0.7116 0.7642 l
0.7131 0.7640 l
0.7147 0.7638 l
0.7163 0.7636 l
0.7178 0.7634 l
0.7194 0.7632 l
0.7210 0.7630 l
0.7225 0.7628 l
0.7241 0.7626 l
0.7257 0.7624 l
0.7273 0.7622 l
0.7288 0.7620 l
0.7304 0.7618 l
0.7320 0.7616 l
0.7335 0.7614 l
0.7351 0.7612 l
0.7367 0.7610 l
0.7382 0.7608 l
0.7398 0.7606 l
0.7414 0.7604 l
0.7429 0.7602 l
0.7445 0.7600 l
0.7461 0.7598 l
0.7476 0.7596 l
0.7492 0.7594 l
0.7508 0.7592 l
0.7524 0.7591 l
0.7539 0.7589 l
0.7555 0.7587 l
0.7571 0.7585 l
0.7586 0.7583 l
0.7602 0.7581 l
0.7618 0.7580 l
0.7633 0.7578 l
0.7649 0.7576 l
0.7665 0.7574 l
0.7680 0.7572 l
0.7696 0.7570 l
0.7712 0.7568 l
0.7727 0.7566 l
0.7743 0.7564 l
0.7759 0.7563 l
0.7775 0.7561 l
0.7790 0.7559 l
0.7806 0.7557 l
0.7822 0.7555 l
0.7837 0.7553 l
0.7853 0.7551 l
0.7869 0.7550 l
0.7884 0.7548 l
0.7900 0.7546 l
0.7916 0.7544 l
0.7931 0.7542 l
0.7947 0.7541 l
0.7963 0.7539 l
0.7978 0.7537 l
0.7994 0.7535 l
0.8010 0.7533 l
0.8025 0.7532 l
0.8041 0.7530 l
0.8057 0.7528 l
0.8073 0.7526 l
0.8088 0.7525 l
0.8104 0.7523 l
0.8120 0.7521 l
0.8135 0.7519 l
0.8151 0.7518 l
0.8167 0.7516 l
0.8182 0.7514 l
0.8198 0.7513 l
0.8214 0.7511 l
0.8229 0.7509 l
0.8245 0.7508 l
0.8261 0.7506 l
0.8276 0.7504 l
0.8292 0.7503 l
0.8308 0.7501 l
0.8324 0.7499 l
0.8339 0.7498 l
0.8355 0.7496 l
0.8371 0.7495 l
0.8386 0.7493 l
0.8402 0.7491 l
0.8418 0.7490 l
0.8433 0.7488 l
0.8449 0.7487 l
0.8465 0.7485 l
0.8480 0.7484 l
0.8496 0.7482 l
0.8512 0.7481 l
0.8527 0.7467 l
0.8543 0.7458 l
0.8559 0.7451 l
0.8575 0.7446 l
0.8590 0.7440 l
0.8606 0.7436 l
0.8622 0.7431 l
0.8637 0.7427 l
0.8653 0.7423 l
0.8669 0.7419 l
0.8684 0.7415 l
0.8700 0.7412 l
0.8716 0.7409 l
0.8731 0.7405 l
0.8747 0.7402 l
0.8763 0.7399 l
0.8778 0.7396 l
0.8794 0.7393 l
0.8810 0.7390 l
0.8825 0.7387 l
0.8841 0.7384 l
0.8857 0.7381 l
0.8873 0.7379 l
0.8888 0.7376 l
0.8904 0.7373 l
0.8920 0.7371 l
0.8935 0.7368 l
0.8951 0.7366 l
0.8967 0.7363 l
0.8982 0.7361 l
0.8998 0.7359 l
0.9014 0.7356 l
0.9029 0.7354 l
0.9045 0.7352 l
0.9061 0.7349 l
0.9076 0.7347 l
0.9092 0.7345 l
0.9108 0.7343 l
0.9124 0.7341 l
0.9139 0.7339 l
0.9155 0.7336 l
0.9171 0.7334 l
0.9186 0.7332 l
0.9202 0.7330 l
0.9218 0.7328 l
0.9233 0.7326 l
0.9249 0.7324 l
0.9265 0.7322 l
0.9280 0.7320 l
0.9296 0.7318 l
0.9312 0.7316 l
0.9327 0.7315 l
0.9343 0.7313 l
0.9359 0.7311 l
0.9375 0.7309 l
0.9390 0.7307 l
0.9406 0.7305 l
0.9422 0.7304 l
0.9437 0.7302 l
0.9453 0.7300 l
0.9469 0.7298 l
0.9484 0.7297 l
0.9500 0.7295 l
s
[/DeviceRGB] SCS
Color4 SC
n
0.1500 0.7114 m
0.1516 0.7115 l
0.1531 0.7117 l
0.1547 0.7119 l
0.1563 0.7120 l
0.1578 0.7122 l
0.1594 0.7123 l
0.1610 0.7125 l
0.1625 0.7127 l
0.1641 0.7128 l
0.1657 0.7130 l
0.1673 0.7131 l
0.1688 0.7132 l
0.1704 0.7134 l
0.1720 0.7135 l
0.1735 0.7137 l
0.1751 0.7138 l
0.1767 0.7140 l
0.1782 0.7141 l
0.1798 0.7142 l
0.1814 0.7144 l
0.1829 0.7145 l
0.1845 0.7146 l
0.1861 0.7147 l
0.1876 0.7149 l
0.1892 0.7150 l
0.1908 0.7151 l
0.1924 0.7152 l
0.1939 0.7154 l
0.1955 0.7155 l
0.1971 0.7156 l
0.1986 0.7157 l
0.2002 0.7158 l
0.2018 0.7160 l
0.2033 0.7161 l
0.2049 0.7162 l
0.2065 0.7163 l
0.2080 0.7164 l
0.2096 0.7165 l
0.2112 0.7166 l
0.2127 0.7167 l
0.2143 0.7168 l
0.2159 0.7169 l
0.2175 0.7170 l
0.2190 0.7171 l
0.2206 0.7172 l
0.2222 0.7173 l
0.2237 0.7174 l
0.2253 0.7175 l
0.2269 0.7176 l
0.2284 0.7177 l
0.2300 0.7178 l
0.2316 0.7179 l
0.2331 0.7180 l
0.2347 0.7181 l
0.2363 0.7182 l
0.2378 0.7183 l
0.2394 0.7184 l
0.2410 0.7185 l
0.2425 0.7186 l
0.2441 0.7187 l
0.2457 0.7188 l
0.2473 0.7188 l
0.2488 0.7189 l
0.2504 0.7190 l
0.2520 0.7191 l
0.2535 0.7192 l
0.2551 0.7193 l
0.2567 0.7194 l
0.2582 0.7194 l
0.2598 0.7195 l
0.2614 0.7196 l
0.2629 0.7197 l
0.2645 0.7198 l
0.2661 0.7198 l
0.2676 0.7199 l
0.2692 0.7200 l
0.2708 0.7201 l
0.2724 0.7201 l
0.2739 0.7202 l
0.2755 0.7203 l
0.2771 0.7204 l
0.2786 0.7205 l
0.2802 0.7194 l
0.2818 0.7185 l
0.2833 0.7180 l
0.2849 0.7175 l
0.2865 0.7172 l
0.2880 0.7169 l
0.2896 0.7167 l
0.2912 0.7164 l
0.2927 0.7162 l
0.2943 0.7160 l
0.2959 0.7159 l
0.2975 0.7157 l
0.2990 0.7156 l
0.3006 0.7154 l
0.3022 0.7153 l
0.3037 0.7152 l
0.3053 0.7151 l
0.3069 0.7150 l
0.3084 0.7149 l
0.3100 0.7148 l
0.3116 0.7147 l
0.3131 0.7146 l
0.3147 0.7146 l
0.3163 0.7145 l
0.3178 0.7144 l
0.3194 0.7144 l
0.3210 0.7143 l
0.3225 0.7143 l
0.3241 0.7142 l
0.3257 0.7142 l
0.3273 0.7141 l
0.3288 0.7141 l
0.3304 0.7140 l
0.3320 0.7140 l
0.3335 0.7139 l
0.3351 0.7139 l
0.3367 0.7139 l
0.3382 0.7138 l
0.3398 0.7138 l
0.3414 0.7138 l
0.3429 0.7137 l
0.3445 0.7137 l
0.3461 0.7137 l
0.3476 0.7137 l
0.3492 0.7136 l
0.3508 0.7136 l
0.3524 0.7136 l
0.3539 0.7136 l
0.3555 0.7136 l
0.3571 0.7135 l
0.3586 0.7135 l
0.3602 0.7135 l
0.3618 0.7135 l
0.3633 0.7135 l
0.3649 0.7134 l
0.3665 0.7134 l
0.3680 0.7134 l
0.3696 0.7134 l
0.3712 0.7134 l
0.3727 0.7133 l
0.3743 0.7133 l
0.3759 0.7133 l
0.3775 0.7133 l
0.3790 0.7114 l
0.3806 0.7094 l
0.3822 0.7081 l
0.3837 0.7071 l
0.3853 0.7063 l
0.3869 0.7055 l
0.3884 0.7049 l
0.3900 0.7043 l
0.3916 0.7037 l
0.3931 0.7032 l
0.3947 0.7027 l
0.3963 0.7023 l
0.3978 0.7019 l
0.3994 0.7015 l
0.4010 0.7011 l
0.4025 0.7007 l
0.4041 0.7004 l
0.4057 0.7000 l
0.4073 0.6997 l
0.4088 0.6994 l
0.4104 0.6991 l
0.4120 0.6988 l
0.4135 0.6985 l
0.4151 0.6983 l
0.4167 0.6980 l
0.4182 0.6978 l
0.4198 0.6975 l
0.4214 0.6973 l
0.4229 0.6971 l
0.4245 0.6968 l
0.4261 0.6966 l
0.4276 0.6964 l
0.4292 0.6962 l
0.4308 0.6960 l
0.4324 0.6958 l
0.4339 0.6956 l
0.4355 0.6954 l
0.4371 0.6953 l
0.4386 0.6951 l
0.4402 0.6949 l
0.4418 0.6947 l
0.4433 0.6946 l
0.4449 0.6944 l
0.4465 0.6942 l
0.4480 0.6941 l
0.4496 0.6939 l
0.4512 0.6938 l
0.4527 0.6937 l
0.4543 0.6935 l
0.4559 0.6934 l
0.4575 0.6932 l
0.4590 0.6931 l
0.4606 0.6930 l
0.4622 0.6854 l
0.4637 0.6814 l
0.4653 0.6786 l
0.4669 0.6763 l
0.4684 0.6744 l
0.4700 0.6728 l
0.4716 0.6713 l
0.4731 0.6699 l
0.4747 0.6686 l
0.4763 0.6675 l
0.4778 0.6660 l
0.4794 0.6642 l
0.4810 0.6628 l
0.4825 0.6616 l
0.4841 0.6605 l
0.4857 0.6594 l
0.4873 0.6585 l
0.4888 0.6575 l
0.4904 0.6567 l
0.4920 0.6558 l
0.4935 0.6550 l
0.4951 0.6543 l
0.4967 0.6535 l
0.4982 0.6528 l
0.4998 0.6522 l
0.5014 0.6515 l
0.5029 0.6509 l
0.5045 0.6503 l
0.5061 0.6497 l
0.5076 0.6491 l
0.5092 0.6485 l
0.5108 0.6480 l
0.5124 0.6474 l
0.5139 0.6469 l
0.5155 0.6464 l
0.5171 0.6459 l
0.5186 0.6455 l
0.5202 0.6450 l
0.5218 0.6445 l
0.5233 0.6441 l
0.5249 0.6437 l
0.5265 0.6432 l
0.5280 0.6428 l
0.5296 0.6424 l
0.5312 0.6420 l
0.5327 0.6416 l
0.5343 0.6412 l
0.5359 0.6409 l
0.5375 0.6405 l
0.5390 0.6401 l
0.5406 0.6398 l
0.5422 0.6394 l
0.5437 0.6391 l
0.5453 0.6387 l
0.5469 0.6383 l
0.5484 0.6378 l
0.5502 0.6356 l
0.5516 0.6346 l
0.5531 0.6334 l
0.5547 0.6322 l
0.5563 0.6311 l
0.5578 0.6306 l
0.5594 0.6301 l
0.5610 0.6296 l
0.5625 0.6292 l
0.5641 0.6288 l
0.5657 0.6284 l
0.5673 0.6280 l
0.5688 0.6276 l
0.5704 0.6272 l
0.5720 0.6269 l
0.5735 0.6265 l
0.5751 0.6262 l
0.5767 0.6258 l
0.5782 0.6255 l
0.5798 0.6252 l
0.5814 0.6249 l
0.5829 0.6246 l
0.5845 0.6243 l
0.5861 0.6240 l
0.5876 0.6237 l
0.5892 0.6234 l
0.5908 0.6232 l
0.5924 0.6229 l
0.5939 0.6226 l
0.5955 0.6224 l
0.5971 0.6221 l
0.5986 0.6219 l
0.6002 0.6216 l
0.6018 0.6214 l
0.6033 0.6211 l
0.6049 0.6209 l
0.6065 0.6207 l
0.6080 0.6204 l
0.6096 0.6202 l
0.6112 0.6200 l
0.6127 0.6198 l
0.6143 0.6196 l
0.6159 0.6194 l
0.6175 0.6192 l
0.6190 0.6190 l
0.6206 0.6188 l
0.6222 0.6186 l
0.6237 0.6184 l
0.6253 0.6182 l
0.6269 0.6180 l
0.6284 0.6178 l
0.6300 0.6176 l
0.6316 0.6174 l
0.6331 0.6172 l
0.6347 0.6171 l
0.6363 0.6169 l
0.6378 0.6167 l
0.6394 0.6165 l
0.6410 0.6164 l
0.6425 0.6162 l
0.6441 0.6160 l
0.6457 0.6159 l
0.6473 0.6157 l
0.6488 0.6156 l
0.6504 0.6154 l
0.6520 0.6152 l
0.6535 0.6151 l
0.6551 0.6149 l
0.6567 0.6148 l
0.6582 0.6146 l
0.6598 0.6145 l
0.6614 0.6143 l
0.6629 0.6141 l
0.6645 0.6139 l
0.6661 0.6136 l
0.6676 0.6134 l
0.6692 0.6131 l
0.6708 0.6129 l
0.6724 0.6127 l
0.6739 0.6125 l
0.6755 0.6122 l
0.6771 0.6120 l
0.6786 0.6118 l
0.6802 0.6116 l
0.6818 0.6114 l
0.6833 0.6112 l
0.6849 0.6110 l
0.6865 0.6108 l
0.6880 0.6106 l
0.6896 0.6104 l
0.6912 0.6102 l
0.6927 0.6100 l
0.6943 0.6098 l
0.6959 0.6096 l
0.6975 0.6094 l
0.6990 0.6092 l
0.7006 0.6090 l
0.7022 0.6088 l
0.7037 0.6086 l
0.7053 0.6084 l
0.7069 0.6082 l
0.7084 0.6080 l
0.7100 0.6079 l
0.7116 0.6077 l
0.7131 0.6075 l
0.7147 0.6073 l
0.7163 0.6071 l
0.7178 0.6069 l
0.7194 0.6068 l
0.7210 0.6066 l
0.7225 0.6064 l
0.7241 0.6062 l
0.7257 0.6060 l
0.7273 0.6059 l
0.7288 0.6057 l
0.7304 0.6055 l
0.7320 0.6053 l
0.7335 0.6052 l
0.7351 0.6050 l
0.7367 0.6048 l
0.7382 0.6047 l
0.7398 0.6045 l
0.7414 0.6043 l
0.7429 0.6042 l
0.7445 0.6040 l
0.7461 0.6038 l
0.7476 0.6037 l
0.7492 0.6035 l
0.7508 0.6033 l
0.7524 0.6032 l
0.7539 0.6030 l
0.7555 0.6029 l
0.7571 0.6027 l
0.7586 0.6026 l
0.7602 0.6024 l
0.7618 0.6022 l
0.7633 0.6021 l
0.7649 0.6019 l
0.7665 0.6017 l
0.7680 0.6016 l
0.7696 0.6014 l
0.7712 0.6013 l
0.7727 0.6011 l
0.7743 0.6009 l
0.7759 0.6008 l
0.7775 0.6006 l
0.7790 0.6005 l
0.7806 0.6003 l
0.7822 0.6001 l
0.7837 0.6000 l
0.7853 0.5998 l
0.7869 0.5997 l
0.7884 0.5995 l
0.7900 0.5993 l
0.7916 0.5992 l
0.7931 0.5990 l
0.7947 0.5989 l
0.7963 0.5987 l
0.7978 0.5986 l
0.7994 0.5984 l
0.8010 0.5982 l
0.8025 0.5981 l
0.8041 0.5979 l
0.8057 0.5978 l
0.8073 0.5976 l
0.8088 0.5975 l
0.8104 0.5973 l
0.8120 0.5972 l
0.8135 0.5970 l
0.8151 0.5969 l
0.8167 0.5967 l
0.8182 0.5966 l
0.8198 0.5965 l
0.8214 0.5963 l
0.8229 0.5962 l
0.8245 0.5960 l
0.8261 0.5959 l
0.8276 0.5957 l
0.8292 0.5956 l
0.8308 0.5955 l
0.8324 0.5953 l
0.8339 0.5952 l
0.8355 0.5950 l
0.8371 0.5949 l
0.8386 0.5948 l
0.8402 0.5946 l
0.8418 0.5945 l
0.8433 0.5944 l
0.8449 0.5942 l
0.8465 0.5941 l
0.8480 0.5940 l
0.8496 0.5938 l
0.8512 0.5937 l
0.8527 0.5924 l
0.8543 0.5915 l
0.8559 0.5909 l
0.8575 0.5903 l
0.8590 0.5898 l
0.8606 0.5894 l
0.8622 0.5889 l
0.8637 0.5885 l
0.8653 0.5882 l
0.8669 0.5878 l
0.8684 0.5875 l
0.8700 0.5871 l
0.8716 0.5868 l
0.8731 0.5865 l
0.8747 0.5862 l
0.8763 0.5859 l
0.8778 0.5856 l
0.8794 0.5853 l
0.8810 0.5851 l
0.8825 0.5848 l
0.8841 0.5845 l
0.8857 0.5843 l
0.8873 0.5840 l
0.8888 0.5838 l
0.8904 0.5836 l
0.8920 0.5833 l
0.8935 0.5831 l
0.8951 0.5829 l
0.8967 0.5826 l
0.8982 0.5824 l
0.8998 0.5822 l
0.9014 0.5820 l
0.9029 0.5818 l
0.9045 0.5816 l
0.9061 0.5814 l
0.9076 0.5811 l
0.9092 0.5809 l
0.9108 0.5808 l
0.9124 0.5806 l
0.9139 0.5804 l
0.9155 0.5802 l
0.9171 0.5800 l
0.9186 0.5798 l
0.9202 0.5796 l
0.9218 0.5794 l
0.9233 0.5793 l
0.9249 0.5791 l
0.9265 0.5789 l
0.9280 0.5787 l
0.9296 0.5786 l
0.9312 0.5784 l
0.9327 0.5782 l
0.9343 0.5780 l
0.9359 0.5779 l
0.9375 0.5777 l
0.9390 0.5776 l
0.9406 0.5774 l
0.9422 0.5772 l
0.9437 0.5771 l
0.9453 0.5769 l
0.9469 0.5768 l
0.9484 0.5766 l
0.9500 0.5765 l
s
[/DeviceRGB] SCS
Color5 SC
n
0.1500 0.2509 m
0.1516 0.2511 l
0.1531 0.2513 l
0.1547 0.2514 l
0.1563 0.2516 l
0.1578 0.2517 l
0.1594 0.2519 l
0.1610 0.2521 l
0.1625 0.2522 l
0.1641 0.2524 l
0.1657 0.2525 l
0.1673 0.2527 l
0.1688 0.2528 l
0.1704 0.2529 l
0.1720 0.2531 l
0.1735 0.2532 l
0.1751 0.2534 l
0.1767 0.2535 l
0.1782 0.2536 l
0.1798 0.2538 l
0.1814 0.2539 l
0.1829 0.2540 l
0.1845 0.2542 l
0.1861 0.2543 l
0.1876 0.2544 l
0.1892 0.2545 l
0.1908 0.2547 l
0.1924 0.2548 l
0.1939 0.2549 l
0.1955 0.2550 l
0.1971 0.2551 l
0.1986 0.2553 l
0.2002 0.2554 l
0.2018 0.2555 l
0.2033 0.2556 l
0.2049 0.2557 l
0.2065 0.2558 l
0.2080 0.2559 l
0.2096 0.2560 l
0.2112 0.2562 l
0.2127 0.2563 l
0.2143 0.2564 l
0.2159 0.2565 l
0.2175 0.2566 l
0.2190 0.2567 l
0.2206 0.2568 l
0.2222 0.2569 l
0.2237 0.2570 l
0.2253 0.2571 l
0.2269 0.2572 l
0.2284 0.2573 l
0.2300 0.2574 l
0.2316 0.2575 l
0.2331 0.2576 l
0.2347 0.2577 l
0.2363 0.2577 l
0.2378 0.2578 l
0.2394 0.2579 l
0.2410 0.2580 l
0.2425 0.2581 l
0.2441 0.2582 l
0.2457 0.2583 l
0.2473 0.2584 l
0.2488 0.2585 l
0.2504 0.2585 l
0.2520 0.2586 l
0.2535 0.2587 l
0.2551 0.2588 l
0.2567 0.2589 l
0.2582 0.2590 l
0.2598 0.2591 l
0.2614 0.2591 l
0.2629 0.2592 l
0.2645 0.2593 l
0.2661 0.2594 l
0.2676 0.2595 l
0.2692 0.2595 l
0.2708 0.2596 l
0.2724 0.2597 l
0.2739 0.2598 l
0.2755 0.2598 l
0.2771 0.2599 l
0.2786 0.2600 l
0.2802 0.2589 l
0.2818 0.2580 l
0.2833 0.2575 l
0.2849 0.2571 l
0.2865 0.2567 l
0.2880 0.2564 l
0.2896 0.2562 l
0.2912 0.2560 l
0.2927 0.2558 l
0.2943 0.2556 l
0.2959 0.2554 l
0.2975 0.2552 l
0.2990 0.2551 l
0.3006 0.2550 l
0.3022 0.2549 l
0.3037 0.2547 l
0.3053 0.2546 l
0.3069 0.2545 l
0.3084 0.2544 l
0.3100 0.2543 l
0.3116 0.2543 l
0.3131 0.2542 l
0.3147 0.2541 l
0.3163 0.2540 l
0.3178 0.2540 l
0.3194 0.2539 l
0.3210 0.2539 l
0.3225 0.2538 l
0.3241 0.2537 l
0.3257 0.2537 l
0.3273 0.2536 l
0.3288 0.2536 l
0.3304 0.2536 l
0.3320 0.2535 l
0.3335 0.2535 l
0.3351 0.2534 l
0.3367 0.2534 l
0.3382 0.2534 l
0.3398 0.2533 l
0.3414 0.2533 l
0.3429 0.2533 l
0.3445 0.2533 l
0.3461 0.2532 l
0.3476 0.2532 l
0.3492 0.2532 l
0.3508 0.2532 l
0.3524 0.2532 l
0.3539 0.2531 l
0.3555 0.2531 l
0.3571 0.2531 l
0.3586 0.2531 l
0.3602 0.2531 l
0.3618 0.2530 l
0.3633 0.2530 l
0.3649 0.2530 l
0.3665 0.2530 l
0.3680 0.2530 l
0.3696 0.2529 l
0.3712 0.2529 l
0.3727 0.2529 l
0.3743 0.2529 l
0.3759 0.2529 l
0.3775 0.2529 l
0.3790 0.2510 l
0.3806 0.2489 l
0.3822 0.2476 l
0.3837 0.2467 l
0.3853 0.2458 l
0.3869 0.2451 l
0.3884 0.2444 l
0.3900 0.2438 l
0.3916 0.2433 l
0.3931 0.2428 l
0.3947 0.2423 l
0.3963 0.2419 l
0.3978 0.2414 l
0.3994 0.2410 l
0.4010 0.2407 l
0.4025 0.2403 l
0.4041 0.2399 l
0.4057 0.2396 l
0.4073 0.2393 l
0.4088 0.2390 l
0.4104 0.2387 l
0.4120 0.2384 l
0.4135 0.2381 l
0.4151 0.2379 l
0.4167 0.2376 l
0.4182 0.2373 l
0.4198 0.2371 l
0.4214 0.2369 l
0.4229 0.2366 l
0.4245 0.2364 l
0.4261 0.2362 l
0.4276 0.2360 l
0.4292 0.2358 l
0.4308 0.2356 l
0.4324 0.2354 l
0.4339 0.2352 l
0.4355 0.2350 l
0.4371 0.2348 l
0.4386 0.2347 l
0.4402 0.2345 l
0.4418 0.2343 l
0.4433 0.2342 l
0.4449 0.2340 l
0.4465 0.2338 l
0.4480 0.2337 l
0.4496 0.2335 l
0.4512 0.2334 l
0.4527 0.2332 l
0.4543 0.2331 l
0.4559 0.2330 l
0.4575 0.2328 l
0.4590 0.2327 l
0.4606 0.2326 l
0.4622 0.2250 l
0.4637 0.2210 l
0.4653 0.2182 l
0.4669 0.2159 l
0.4684 0.2140 l
0.4700 0.2124 l
0.4716 0.2109 l
0.4731 0.2095 l
0.4747 0.2083 l
0.4763 0.2071 l
0.4778 0.2056 l
0.4794 0.2038 l
0.4810 0.2024 l
0.4825 0.2012 l
0.4841 0.2001 l
0.4857 0.1991 l
0.4873 0.1981 l
0.4888 0.1972 l
0.4904 0.1963 l
0.4920 0.1955 l
0.4935 0.1947 l
0.4951 0.1939 l
0.4967 0.1932 l
0.4982 0.1925 l
0.4998 0.1918 l
0.5014 0.1911 l
0.5029 0.1905 l
0.5045 0.1899 l
0.5061 0.1893 l
0.5076 0.1887 l
0.5092 0.1881 l
0.5108 0.1876 l
0.5124 0.1871 l
0.5139 0.1866 l
0.5155 0.1860 l
0.5171 0.1856 l
0.5186 0.1851 l
0.5202 0.1846 l
0.5218 0.1842 l
0.5233 0.1837 l
0.5249 0.1833 l
0.5265 0.1829 l
0.5280 0.1824 l
0.5296 0.1820 l
0.5312 0.1816 l
0.5327 0.1813 l
0.5343 0.1809 l
0.5359 0.1805 l
0.5375 0.1801 l
0.5390 0.1798 l
0.5406 0.1794 l
0.5422 0.1790 l
0.5437 0.1787 l
0.5453 0.1783 l
0.5469 0.1779 l
0.5484 0.1775 l
0.5502 0.1752 l
0.5516 0.1742 l
0.5531 0.1730 l
0.5547 0.1718 l
0.5563 0.1708 l
0.5578 0.1702 l
0.5594 0.1697 l
0.5610 0.1693 l
0.5625 0.1688 l
0.5641 0.1684 l
0.5657 0.1680 l
0.5673 0.1676 l
0.5688 0.1672 l
0.5704 0.1668 l
0.5720 0.1665 l
0.5735 0.1661 l
0.5751 0.1658 l
0.5767 0.1655 l
0.5782 0.1651 l
0.5798 0.1648 l
0.5814 0.1645 l
0.5829 0.1642 l
0.5845 0.1639 l
0.5861 0.1636 l
0.5876 0.1633 l
0.5892 0.1631 l
0.5908 0.1628 l
0.5924 0.1625 l
0.5939 0.1623 l
0.5955 0.1620 l
0.5971 0.1617 l
0.5986 0.1615 l
0.6002 0.1612 l
0.6018 0.1610 l
0.6033 0.1608 l
0.6049 0.1605 l
0.6065 0.1603 l
0.6080 0.1601 l
0.6096 0.1599 l
0.6112 0.1596 l
0.6127 0.1594 l
0.6143 0.1592 l
0.6159 0.1590 l
0.6175 0.1588 l
0.6190 0.1586 l
0.6206 0.1584 l
0.6222 0.1582 l
0.6237 0.1580 l
0.6253 0.1578 l
0.6269 0.1576 l
0.6284 0.1574 l
0.6300 0.1572 l
0.6316 0.1571 l
0.6331 0.1569 l
0.6347 0.1567 l
0.6363 0.1565 l
0.6378 0.1564 l
0.6394 0.1562 l
0.6410 0.1560 l
0.6425 0.1558 l
0.6441 0.1557 l
0.6457 0.1555 l
0.6473 0.1554 l
0.6488 0.1552 l
0.6504 0.1550 l
0.6520 0.1549 l
0.6535 0.1547 l
0.6551 0.1546 l
0.6567 0.1544 l
0.6582 0.1543 l
0.6598 0.1541 l
0.6614 0.1539 l
0.6629 0.1538 l
0.6645 0.1536 l
0.6661 0.1532 l
0.6676 0.1530 l
0.6692 0.1528 l
0.6708 0.1525 l
0.6724 0.1523 l
0.6739 0.1521 l
0.6755 0.1519 l
0.6771 0.1517 l
0.6786 0.1515 l
0.6802 0.1513 l
0.6818 0.1510 l
0.6833 0.1508 l
0.6849 0.1506 l
0.6865 0.1504 l
0.6880 0.1502 l
0.6896 0.1500 l
0.6906 0.1499 l
s
[/DeviceRGB] SCS
Color1 SC
[] 0 SD
0.0015 SLW
n
0.1971 0.1500 m
0.1971 0.1600 l
s
n
0.1971 0.9000 m
0.1971 0.8900 l
s
n
0.2284 0.1500 m
0.2284 0.1600 l
s
n
0.2284 0.9000 m
0.2284 0.8900 l
s
n
0.2598 0.1500 m
0.2598 0.1600 l
s
n
0.2598 0.9000 m
0.2598 0.8900 l
s
n
0.2912 0.1500 m
0.2912 0.1600 l
s
n
0.2912 0.9000 m
0.2912 0.8900 l
s
n
0.3539 0.1500 m
0.3539 0.1600 l
s
n
0.3539 0.9000 m
0.3539 0.8900 l
s
n
0.3853 0.1500 m
0.3853 0.1600 l
s
n
0.3853 0.9000 m
0.3853 0.8900 l
s
n
0.4167 0.1500 m
0.4167 0.1600 l
s
n
0.4167 0.9000 m
0.4167 0.8900 l
s
n
0.4480 0.1500 m
0.4480 0.1600 l
s
n
0.4480 0.9000 m
0.4480 0.8900 l
s
n
0.5108 0.1500 m
0.5108 0.1600 l
s
n
0.5108 0.9000 m
0.5108 0.8900 l
s
n
0.5422 0.1500 m
0.5422 0.1600 l
s
n
0.5422 0.9000 m
0.5422 0.8900 l
s
n
0.5735 0.1500 m
0.5735 0.1600 l
s
n
0.5735 0.9000 m
0.5735 0.8900 l
s
n
0.6049 0.1500 m
0.6049 0.1600 l
s
n
0.6049 0.9000 m
0.6049 0.8900 l
s
n
0.6676 0.1500 m
0.6676 0.1600 l
s
n
0.6676 0.9000 m
0.6676 0.8900 l
s
n
0.6990 0.1500 m
0.6990 0.1600 l
s
n
0.6990 0.9000 m
0.6990 0.8900 l
s
n
0.7304 0.1500 m
0.7304 0.1600 l
s
n
0.7304 0.9000 m
0.7304 0.8900 l
s
n
0.7618 0.1500 m
0.7618 0.1600 l
s
n
0.7618 0.9000 m
0.7618 0.8900 l
s
n
0.8245 0.1500 m
0.8245 0.1600 l
s
n
0.8245 0.9000 m
0.8245 0.8900 l
s
n
0.8559 0.1500 m
0.8559 0.1600 l
s
n
0.8559 0.9000 m
0.8559 0.8900 l
s
n
0.8873 0.1500 m
0.8873 0.1600 l
s
n
0.8873 0.9000 m
0.8873 0.8900 l
s
n
0.9186 0.1500 m
0.9186 0.1600 l
s
n
0.9186 0.9000 m
0.9186 0.8900 l
s
n
0.1657 0.1500 m
0.1657 0.1700 l
s
n
0.1657 0.9000 m
0.1657 0.8800 l
s
n
0.3225 0.1500 m
0.3225 0.1700 l
s
n
0.3225 0.9000 m
0.3225 0.8800 l
s
n
0.4794 0.1500 m
0.4794 0.1700 l
s
n
0.4794 0.9000 m
0.4794 0.8800 l
s
n
0.6363 0.1500 m
0.6363 0.1700 l
s
n
0.6363 0.9000 m
0.6363 0.8800 l
s
n
0.7931 0.1500 m
0.7931 0.1700 l
s
n
0.7931 0.9000 m
0.7931 0.8800 l
s
n
0.9500 0.1500 m
0.9500 0.1700 l
s
n
0.9500 0.9000 m
0.9500 0.8800 l
s
/Helvetica findfont
dup length dict begin
 {1 index /FID ne {def} {pop pop} ifelse} forall
 /Encoding DefEncoding def
 currentdict
end
/Font4 exch definefont pop
/Font4 FFSF
0.1431 0.1200 m
GS
[0.0280 0.0000 0.0000 0.0280 0 0] CC
(100) show
GR
/Font4 FFSF
0.3000 0.1200 m
GS
[0.0280 0.0000 0.0000 0.0280 0 0] CC
(200) show
GR
/Font4 FFSF
0.4569 0.1200 m
GS
[0.0280 0.0000 0.0000 0.0280 0 0] CC
(300) show
GR
/Font4 FFSF
0.6137 0.1200 m
GS
[0.0280 0.0000 0.0000 0.0280 0 0] CC
(400) show
GR
/Font4 FFSF
0.7706 0.1200 m
GS
[0.0280 0.0000 0.0000 0.0280 0 0] CC
(500) show
GR
/Font4 FFSF
0.9275 0.1200 m
GS
[0.0280 0.0000 0.0000 0.0280 0 0] CC
(600) show
GR
/Font4 FFSF
0.4818 0.0845 m
GS
[0.0336 0.0000 0.0000 0.0336 0 0] CC
(M) show
GR
/Font4 FFSF
0.5096 0.0711 m
GS
[0.0238 0.0000 0.0000 0.0238 0 0] CC
(A) show
GR
/Font4 FFSF
0.5253 0.0845 m
GS
[0.0336 0.0000 0.0000 0.0336 0 0] CC
( [GeV]) show
GR
n
0.1500 0.2064 m
0.1600 0.2064 l
s
n
0.9500 0.2064 m
0.9400 0.2064 l
s
n
0.1500 0.2395 m
0.1600 0.2395 l
s
n
0.9500 0.2395 m
0.9400 0.2395 l
s
n
0.1500 0.2629 m
0.1600 0.2629 l
s
n
0.9500 0.2629 m
0.9400 0.2629 l
s
n
0.1500 0.2811 m
0.1600 0.2811 l
s
n
0.9500 0.2811 m
0.9400 0.2811 l
s
n
0.1500 0.2959 m
0.1600 0.2959 l
s
n
0.9500 0.2959 m
0.9400 0.2959 l
s
n
0.1500 0.3085 m
0.1600 0.3085 l
s
n
0.9500 0.3085 m
0.9400 0.3085 l
s
n
0.1500 0.3193 m
0.1600 0.3193 l
s
n
0.9500 0.3193 m
0.9400 0.3193 l
s
n
0.1500 0.3289 m
0.1600 0.3289 l
s
n
0.9500 0.3289 m
0.9400 0.3289 l
s
n
0.1500 0.3375 m
0.1600 0.3375 l
s
n
0.9500 0.3375 m
0.9400 0.3375 l
s
n
0.1500 0.3939 m
0.1600 0.3939 l
s
n
0.9500 0.3939 m
0.9400 0.3939 l
s
n
0.1500 0.4270 m
0.1600 0.4270 l
s
n
0.9500 0.4270 m
0.9400 0.4270 l
s
n
0.1500 0.4504 m
0.1600 0.4504 l
s
n
0.9500 0.4504 m
0.9400 0.4504 l
s
n
0.1500 0.4686 m
0.1600 0.4686 l
s
n
0.9500 0.4686 m
0.9400 0.4686 l
s
n
0.1500 0.4834 m
0.1600 0.4834 l
s
n
0.9500 0.4834 m
0.9400 0.4834 l
s
n
0.1500 0.4960 m
0.1600 0.4960 l
s
n
0.9500 0.4960 m
0.9400 0.4960 l
s
n
0.1500 0.5068 m
0.1600 0.5068 l
s
n
0.9500 0.5068 m
0.9400 0.5068 l
s
n
0.1500 0.5164 m
0.1600 0.5164 l
s
n
0.9500 0.5164 m
0.9400 0.5164 l
s
n
0.1500 0.5250 m
0.1600 0.5250 l
s
n
0.9500 0.5250 m
0.9400 0.5250 l
s
n
0.1500 0.5814 m
0.1600 0.5814 l
s
n
0.9500 0.5814 m
0.9400 0.5814 l
s
n
0.1500 0.6145 m
0.1600 0.6145 l
s
n
0.9500 0.6145 m
0.9400 0.6145 l
s
n
0.1500 0.6379 m
0.1600 0.6379 l
s
n
0.9500 0.6379 m
0.9400 0.6379 l
s
n
0.1500 0.6561 m
0.1600 0.6561 l
s
n
0.9500 0.6561 m
0.9400 0.6561 l
s
n
0.1500 0.6709 m
0.1600 0.6709 l
s
n
0.9500 0.6709 m
0.9400 0.6709 l
s
n
0.1500 0.6835 m
0.1600 0.6835 l
s
n
0.9500 0.6835 m
0.9400 0.6835 l
s
n
0.1500 0.6943 m
0.1600 0.6943 l
s
n
0.9500 0.6943 m
0.9400 0.6943 l
s
n
0.1500 0.7039 m
0.1600 0.7039 l
s
n
0.9500 0.7039 m
0.9400 0.7039 l
s
n
0.1500 0.7125 m
0.1600 0.7125 l
s
n
0.9500 0.7125 m
0.9400 0.7125 l
s
n
0.1500 0.7689 m
0.1600 0.7689 l
s
n
0.9500 0.7689 m
0.9400 0.7689 l
s
n
0.1500 0.8020 m
0.1600 0.8020 l
s
n
0.9500 0.8020 m
0.9400 0.8020 l
s
n
0.1500 0.8254 m
0.1600 0.8254 l
s
n
0.9500 0.8254 m
0.9400 0.8254 l
s
n
0.1500 0.8436 m
0.1600 0.8436 l
s
n
0.9500 0.8436 m
0.9400 0.8436 l
s
n
0.1500 0.8584 m
0.1600 0.8584 l
s
n
0.9500 0.8584 m
0.9400 0.8584 l
s
n
0.1500 0.8710 m
0.1600 0.8710 l
s
n
0.9500 0.8710 m
0.9400 0.8710 l
s
n
0.1500 0.8818 m
0.1600 0.8818 l
s
n
0.9500 0.8818 m
0.9400 0.8818 l
s
n
0.1500 0.8914 m
0.1600 0.8914 l
s
n
0.9500 0.8914 m
0.9400 0.8914 l
s
n
0.1500 0.9000 m
0.1600 0.9000 l
s
n
0.9500 0.9000 m
0.9400 0.9000 l
s
n
0.1500 0.1500 m
0.1700 0.1500 l
s
n
0.9500 0.1500 m
0.9300 0.1500 l
s
n
0.1500 0.3375 m
0.1700 0.3375 l
s
n
0.9500 0.3375 m
0.9300 0.3375 l
s
n
0.1500 0.5250 m
0.1700 0.5250 l
s
n
0.9500 0.5250 m
0.9300 0.5250 l
s
n
0.1500 0.7125 m
0.1700 0.7125 l
s
n
0.9500 0.7125 m
0.9300 0.7125 l
s
n
0.1500 0.9000 m
0.1700 0.9000 l
s
n
0.9500 0.9000 m
0.9300 0.9000 l
s
/Font4 FFSF
0.0922 0.1349 m
GS
[0.0280 0.0000 0.0000 0.0280 0 0] CC
(10) show
GR
/Font4 FFSF
0.1231 0.1517 m
GS
[0.0198 0.0000 0.0000 0.0198 0 0] CC
(-4) show
GR
/Font4 FFSF
0.0922 0.3224 m
GS
[0.0280 0.0000 0.0000 0.0280 0 0] CC
(10) show
GR
/Font4 FFSF
0.1231 0.3392 m
GS
[0.0198 0.0000 0.0000 0.0198 0 0] CC
(-3) show
GR
/Font4 FFSF
0.0922 0.5099 m
GS
[0.0280 0.0000 0.0000 0.0280 0 0] CC
(10) show
GR
/Font4 FFSF
0.1231 0.5267 m
GS
[0.0198 0.0000 0.0000 0.0198 0 0] CC
(-2) show
GR
/Font4 FFSF
0.0957 0.6974 m
GS
[0.0280 0.0000 0.0000 0.0280 0 0] CC
(10) show
GR
/Font4 FFSF
0.1267 0.7142 m
GS
[0.0198 0.0000 0.0000 0.0198 0 0] CC
(-1) show
GR
/Font4 FFSF
0.0988 0.8849 m
GS
[0.0280 0.0000 0.0000 0.0280 0 0] CC
(10) show
GR
/Font4 FFSF
0.1298 0.9017 m
GS
[0.0198 0.0000 0.0000 0.0198 0 0] CC
(0) show
GR
/Font4 FFSF
0.0751 0.4805 m
GS
[0.0000 0.0336 -0.0336 0.0000 0 0] CC
(BR\(A\)) show
GR
n
0.1500 0.1500 m
0.1500 0.9000 l
0.9500 0.9000 l
0.9500 0.1500 l
0.1500 0.1500 l
c
s
n
0.7000 0.5500 m
0.7000 0.3449 l
0.9143 0.3449 l
0.9143 0.5500 l
c
[/DeviceRGB] SCS
Color0 SC
fill
[/DeviceRGB] SCS
Color1 SC
n
0.7000 0.5500 m
0.7000 0.3449 l
0.9143 0.3449 l
0.9143 0.5500 l
0.7000 0.5500 l
c
s
/Font4 FFSF
0.7862 0.4935 m
GS
[0.0224 0.0000 0.0000 0.0224 0 0] CC
(BR\(A -> tt\)) show
GR
[/DeviceRGB] SCS
Color2 SC
[] 0 SD
0.0045 SLW
n
0.7122 0.4994 m
0.7722 0.4994 l
s
/Font4 FFSF
[/DeviceRGB] SCS
Color1 SC
0.7862 0.4524 m
GS
[0.0224 0.0000 0.0000 0.0224 0 0] CC
(BR\(A -> bb\)) show
GR
[/DeviceRGB] SCS
Color3 SC
n
0.7122 0.4582 m
0.7722 0.4582 l
s
/Font4 FFSF
[/DeviceRGB] SCS
Color1 SC
0.7862 0.4112 m
GS
[0.0224 0.0000 0.0000 0.0224 0 0] CC
(BR\(A -> ) show
GR
/Symbol findfont
/Font12 exch definefont pop
/Font12 FFSF
0.8729 0.4112 m
GS
[0.0224 0.0000 0.0000 0.0224 0 0] CC
(tt) show
GR
/Font4 FFSF
0.8925 0.4112 m
GS
[0.0224 0.0000 0.0000 0.0224 0 0] CC
(\)) show
GR
[/DeviceRGB] SCS
Color4 SC
n
0.7122 0.4171 m
0.7722 0.4171 l
s
/Font4 FFSF
[/DeviceRGB] SCS
Color1 SC
0.7862 0.3700 m
GS
[0.0224 0.0000 0.0000 0.0224 0 0] CC
(BR\(A -> ) show
GR
/Font12 FFSF
0.8729 0.3700 m
GS
[0.0224 0.0000 0.0000 0.0224 0 0] CC
(mm) show
GR
/Font4 FFSF
0.8988 0.3700 m
GS
[0.0224 0.0000 0.0000 0.0224 0 0] CC
(\)) show
GR
[/DeviceRGB] SCS
Color5 SC
n
0.7122 0.3757 m
0.7722 0.3757 l
s
/Font4 FFSF
[/DeviceRGB] SCS
Color1 SC
0.9700 0.7000 m
GS
[0.0000 0.0168 -0.0168 0.0000 0 0] CC
(LHC Higgs XS WG 2013) show
GR
/Font4 FFSF
0.7150 0.5250 m
GS
[0.0224 0.0000 0.0000 0.0224 0 0] CC
(m) show
GR
/Font4 FFSF
0.7338 0.5160 m
GS
[0.0158 0.0000 0.0000 0.0158 0 0] CC
(h) show
GR
/Font4 FFSF
0.7425 0.5384 m
GS
[0.0158 0.0000 0.0000 0.0158 0 0] CC
(max) show
GR
/Font4 FFSF
0.7723 0.5250 m
GS
[0.0224 0.0000 0.0000 0.0224 0 0] CC
(, tan) show
GR
/Font12 FFSF
0.8158 0.5250 m
GS
[0.0224 0.0000 0.0000 0.0224 0 0] CC
(b) show
GR
/Font4 FFSF
0.8279 0.5250 m
GS
[0.0224 0.0000 0.0000 0.0224 0 0] CC
( = 10) show
GR
%%Trailer
%%BoundingBox: 30 42 597 562
%%DocumentNeededResources: font Helvetica
%%+ font Symbol
%%EOF
