%!PS-Adobe-3.0 EPSF-3.0
%%BoundingBox: (atend)
%%LanguageLevel: 2
%%Creator: Grace-5.1.22
%%CreationDate: Mon Jun  3 12:27:24 2013
%%DocumentData: Clean8Bit
%%Orientation: Portrait
%%Title: /home/pcl321b/heinemey/plot/grace/2012/lhc-higgs-br/mhmodp_tb10_BR-HH.grace
%%For: heinemey
%%DocumentNeededResources: (atend)
%%EndComments
%%BeginProlog
/m {moveto} def
/l {lineto} def
/s {stroke} def
/n {newpath} def
/c {closepath} def
/RL {rlineto} def
/SLW {setlinewidth} def
/GS {gsave} def
/GR {grestore} def
/SC {setcolor} def
/SGRY {setgray} def
/SRGB {setrgbcolor} def
/SD {setdash} def
/SLC {setlinecap} def
/SLJ {setlinejoin} def
/SCS {setcolorspace} def
/FFSF {findfont setfont} def
/CC {concat} def
/PXL {n m 0 0 RL s} def
/Color0 {1.0000 1.0000 1.0000} def
/Color1 {0.0000 0.0000 0.0000} def
/Color2 {1.0000 0.0000 0.0000} def
/Color3 {0.0000 1.0000 0.0000} def
/Color4 {0.0000 0.0000 1.0000} def
/Color5 {1.0000 1.0000 0.0000} def
/Color6 {0.7373 0.5608 0.5608} def
/Color7 {0.8627 0.8627 0.8627} def
/Color8 {0.5804 0.0000 0.8275} def
/Color9 {0.0000 1.0000 1.0000} def
/Color10 {1.0000 0.0000 1.0000} def
/Color11 {1.0000 0.6471 0.0000} def
/Color12 {0.4471 0.1294 0.7373} def
/Color13 {0.4039 0.0275 0.2824} def
/Color14 {0.2510 0.8784 0.8157} def
/Color15 {0.0000 0.5451 0.0000} def
/Color16 {0.7529 0.7529 0.7529} def
/Color17 {0.5059 0.5059 0.5059} def
/Color18 {0.2588 0.2588 0.2588} def
/PTRN {
 /pat_bits exch def 
 <<
  /PaintType 2
  /PatternType 1 /TilingType 1
  /BBox[0 0 16 16]
  /XStep 16 /YStep 16
  /PaintProc {
   pop
   16 16 true [-1 0 0 -1 16 16] pat_bits imagemask
  }
 >>
 [0.0016 0 0 0.0016 0 0]
 makepattern
} def
/Pattern0 {<0000000000000000000000000000000000000000000000000000000000000000> PTRN} bind def
/Pattern1 {<ffffffffffffffffffffffffffffffffffffffffffffffffffffffffffffffff> PTRN} bind def
/Pattern2 {<eeeeffffbbbbffffeeeeffffbbbbffffeeeeffffbbbbffffeeeeffffbbbbffff> PTRN} bind def
/Pattern3 {<eeeebbbbeeeebbbbeeeebbbbeeeebbbbeeeebbbbeeeebbbbeeeebbbbeeeebbbb> PTRN} bind def
/Pattern4 {<5555aaaa5555aaaa5555aaaa5555aaaa5555aaaa5555aaaa5555aaaa5555aaaa> PTRN} bind def
/Pattern5 {<1111444411114444111144441111444411114444111144441111444411114444> PTRN} bind def
/Pattern6 {<1111000044440000111100004444000011110000444400001111000044440000> PTRN} bind def
/Pattern7 {<1010000000000000010100000000000010100000000000000101000000000000> PTRN} bind def
/Pattern8 {<0000000000000000000000000000000000000000000000000000000000000000> PTRN} bind def
/Pattern9 {<1e1e0f0f8787c3c3e1e1f0f078783c3c1e1e0f0f8787c3c3e1e1f0f078783c3c> PTRN} bind def
/Pattern10 {<7878f0f0e1e1c3c387870f0f1e1e3c3c7878f0f0e1e1c3c387870f0f1e1e3c3c> PTRN} bind def
/Pattern11 {<3333333333333333333333333333333333333333333333333333333333333333> PTRN} bind def
/Pattern12 {<ffffffff00000000ffffffff00000000ffffffff00000000ffffffff00000000> PTRN} bind def
/Pattern13 {<8181424224241818181824244242818181814242242418181818242442428181> PTRN} bind def
/Pattern14 {<8080404020201010080804040202010180804040202010100808040402020101> PTRN} bind def
/Pattern15 {<0101020204040808101020204040808001010202040408081010202040408080> PTRN} bind def
/Pattern16 {<2222222222222222222222222222222222222222222222222222222222222222> PTRN} bind def
/Pattern17 {<0000ffff000000000000ffff000000000000ffff000000000000ffff00000000> PTRN} bind def
/Pattern18 {<2222ffff222222222222ffff222222222222ffff222222222222ffff22222222> PTRN} bind def
/Pattern19 {<ffffffff33333333ffffffff33333333ffffffff33333333ffffffff33333333> PTRN} bind def
/Pattern20 {<0f0f0f0f0f0f0f0ff0f0f0f0f0f0f0f00f0f0f0f0f0f0f0ff0f0f0f0f0f0f0f0> PTRN} bind def
/Pattern21 {<ff00ff00ff00ff00ff00ff00ff00ff0000ff00ff00ff00ff00ff00ff00ff00ff> PTRN} bind def
/Pattern22 {<8001800180018001800180018001ffffffff8001800180018001800180018001> PTRN} bind def
/Pattern23 {<c003c003c003c003c003c003ffffffffffffffffc003c003c003c003c003c003> PTRN} bind def
/Pattern24 {<040404040404ffff404040404040ffff040404040404ffff404040404040ffff> PTRN} bind def
/Pattern25 {<180018001800180018001800ffffffff001800180018001800180018ffffffff> PTRN} bind def
/Pattern26 {<1111b8b87c7c3a3a1111a3a3c7c78b8b1111b8b87c7c3a3a1111a3a3c7c78b8b> PTRN} bind def
/Pattern27 {<101010102828c7c70101010182827c7c101010102828c7c70101010182827c7c> PTRN} bind def
/Pattern28 {<1c1c121211112121c1c12121111112121c1c121211112121c1c1212111111212> PTRN} bind def
/Pattern29 {<3e3e414180808080e3e31414080808083e3e414180808080e3e3141408080808> PTRN} bind def
/Pattern30 {<4848888884848383848488884848383848488888848483838484888848483838> PTRN} bind def
/Pattern31 {<03030404080808080c0c12122121c0c003030404080808080c0c12122121c0c0> PTRN} bind def
/ellipsedict 8 dict def
ellipsedict /mtrx matrix put
/EARC {
 ellipsedict begin
  /endangle exch def
  /startangle exch def
  /yrad exch def
  /xrad exch def
  /y exch def
  /x exch def
  /savematrix mtrx currentmatrix def
  x y translate
  xrad yrad scale
  0 0 1 startangle endangle arc
  savematrix setmatrix
 end
} def
/TL {
  /kcomp exch def
  /linewidth exch def
  /offset exch def
  GS
  0 offset rmoveto
  linewidth SLW
  dup stringwidth exch kcomp add exch RL s
  GR
} def
/KINIT
{
 /kvector exch def
 /kid 0 def
} def
/KPROC
{
 pop pop
 kvector kid get
 0 rmoveto
 /kid 1 kid add def
} def
/DefEncoding [
 /.notdef
 /.notdef
 /.notdef
 /.notdef
 /.notdef
 /.notdef
 /.notdef
 /.notdef
 /.notdef
 /.notdef
 /.notdef
 /.notdef
 /.notdef
 /.notdef
 /.notdef
 /.notdef
 /.notdef
 /.notdef
 /.notdef
 /.notdef
 /.notdef
 /.notdef
 /.notdef
 /.notdef
 /.notdef
 /.notdef
 /.notdef
 /.notdef
 /.notdef
 /.notdef
 /.notdef
 /.notdef
 /space
 /exclam
 /quotedbl
 /numbersign
 /dollar
 /percent
 /ampersand
 /quoteright
 /parenleft
 /parenright
 /asterisk
 /plus
 /comma
 /hyphen
 /period
 /slash
 /zero
 /one
 /two
 /three
 /four
 /five
 /six
 /seven
 /eight
 /nine
 /colon
 /semicolon
 /less
 /equal
 /greater
 /question
 /at
 /A
 /B
 /C
 /D
 /E
 /F
 /G
 /H
 /I
 /J
 /K
 /L
 /M
 /N
 /O
 /P
 /Q
 /R
 /S
 /T
 /U
 /V
 /W
 /X
 /Y
 /Z
 /bracketleft
 /backslash
 /bracketright
 /asciicircum
 /underscore
 /grave
 /a
 /b
 /c
 /d
 /e
 /f
 /g
 /h
 /i
 /j
 /k
 /l
 /m
 /n
 /o
 /p
 /q
 /r
 /s
 /t
 /u
 /v
 /w
 /x
 /y
 /z
 /braceleft
 /bar
 /braceright
 /asciitilde
 /.notdef
 /.notdef
 /.notdef
 /.notdef
 /.notdef
 /.notdef
 /.notdef
 /.notdef
 /.notdef
 /.notdef
 /.notdef
 /.notdef
 /.notdef
 /.notdef
 /.notdef
 /.notdef
 /.notdef
 /.notdef
 /.notdef
 /.notdef
 /.notdef
 /.notdef
 /.notdef
 /.notdef
 /.notdef
 /.notdef
 /.notdef
 /.notdef
 /.notdef
 /.notdef
 /.notdef
 /.notdef
 /.notdef
 /space
 /exclamdown
 /cent
 /sterling
 /currency
 /yen
 /brokenbar
 /section
 /dieresis
 /copyright
 /ordfeminine
 /guillemotleft
 /logicalnot
 /hyphen
 /registered
 /macron
 /degree
 /plusminus
 /twosuperior
 /threesuperior
 /acute
 /mu
 /paragraph
 /periodcentered
 /cedilla
 /onesuperior
 /ordmasculine
 /guillemotright
 /onequarter
 /onehalf
 /threequarters
 /questiondown
 /Agrave
 /Aacute
 /Acircumflex
 /Atilde
 /Adieresis
 /Aring
 /AE
 /Ccedilla
 /Egrave
 /Eacute
 /Ecircumflex
 /Edieresis
 /Igrave
 /Iacute
 /Icircumflex
 /Idieresis
 /Eth
 /Ntilde
 /Ograve
 /Oacute
 /Ocircumflex
 /Otilde
 /Odieresis
 /multiply
 /Oslash
 /Ugrave
 /Uacute
 /Ucircumflex
 /Udieresis
 /Yacute
 /Thorn
 /germandbls
 /agrave
 /aacute
 /acircumflex
 /atilde
 /adieresis
 /aring
 /ae
 /ccedilla
 /egrave
 /eacute
 /ecircumflex
 /edieresis
 /igrave
 /iacute
 /icircumflex
 /idieresis
 /eth
 /ntilde
 /ograve
 /oacute
 /ocircumflex
 /otilde
 /odieresis
 /divide
 /oslash
 /ugrave
 /uacute
 /ucircumflex
 /udieresis
 /yacute
 /thorn
 /ydieresis
] def
%%EndProlog
%%BeginSetup
%%EndSetup
612.00 612.00 scale
[/DeviceRGB] SCS
Color2 SC
[] 0 SD
0.0045 SLW
0 SLC
0 SLJ
n
0.5207 0.1499 m
0.5218 0.1535 l
0.5233 0.1588 l
0.5249 0.1642 l
0.5265 0.1697 l
0.5280 0.1753 l
0.5296 0.1810 l
0.5312 0.1869 l
0.5327 0.1929 l
0.5343 0.1992 l
0.5359 0.2057 l
0.5375 0.2124 l
0.5390 0.2196 l
0.5406 0.2273 l
0.5422 0.2356 l
0.5437 0.2449 l
0.5453 0.2591 l
0.5469 0.2788 l
0.5484 0.3022 l
0.5502 0.3306 l
0.5516 0.3548 l
0.5531 0.3813 l
0.5547 0.4062 l
0.5563 0.4283 l
0.5578 0.4462 l
0.5594 0.4610 l
0.5610 0.4737 l
0.5625 0.4848 l
0.5641 0.4946 l
0.5657 0.5034 l
0.5673 0.5114 l
0.5688 0.5187 l
0.5704 0.5248 l
0.5720 0.5305 l
0.5735 0.5360 l
0.5751 0.5411 l
0.5767 0.5458 l
0.5782 0.5503 l
0.5798 0.5545 l
0.5814 0.5585 l
0.5829 0.5622 l
0.5845 0.5658 l
0.5861 0.5691 l
0.5876 0.5723 l
0.5892 0.5754 l
0.5908 0.5783 l
0.5924 0.5810 l
0.5939 0.5837 l
0.5955 0.5862 l
0.5971 0.5886 l
0.5986 0.5909 l
0.6002 0.5931 l
0.6018 0.5952 l
0.6033 0.5973 l
0.6049 0.5993 l
0.6065 0.6012 l
0.6080 0.6030 l
0.6096 0.6047 l
0.6112 0.6064 l
0.6127 0.6081 l
0.6143 0.6097 l
0.6159 0.6112 l
0.6175 0.6127 l
0.6190 0.6141 l
0.6206 0.6155 l
0.6222 0.6168 l
0.6237 0.6181 l
0.6253 0.6194 l
0.6269 0.6206 l
0.6284 0.6218 l
0.6300 0.6230 l
0.6316 0.6241 l
0.6331 0.6252 l
0.6347 0.6263 l
0.6363 0.6273 l
0.6378 0.6283 l
0.6394 0.6293 l
0.6410 0.6303 l
0.6425 0.6312 l
0.6441 0.6321 l
0.6457 0.6330 l
0.6473 0.6339 l
0.6488 0.6348 l
0.6504 0.6357 l
0.6520 0.6367 l
0.6535 0.6377 l
0.6551 0.6392 l
0.6567 0.6349 l
0.6582 0.6327 l
0.6598 0.6317 l
0.6614 0.6310 l
0.6629 0.6305 l
0.6645 0.6302 l
0.6661 0.6300 l
0.6676 0.6298 l
0.6692 0.6297 l
0.6708 0.6296 l
0.6724 0.6296 l
0.6739 0.6296 l
0.6755 0.6296 l
0.6771 0.6296 l
0.6786 0.6297 l
0.6802 0.6297 l
0.6818 0.6298 l
0.6833 0.6299 l
0.6849 0.6300 l
0.6865 0.6301 l
0.6880 0.6302 l
0.6896 0.6303 l
0.6912 0.6304 l
0.6927 0.6305 l
0.6943 0.6307 l
0.6959 0.6308 l
0.6975 0.6309 l
0.6990 0.6310 l
0.7006 0.6312 l
0.7022 0.6313 l
0.7037 0.6314 l
0.7053 0.6315 l
0.7069 0.6317 l
0.7084 0.6318 l
0.7100 0.6319 l
0.7116 0.6320 l
0.7131 0.6322 l
0.7147 0.6323 l
0.7163 0.6324 l
0.7178 0.6325 l
0.7194 0.6327 l
0.7210 0.6328 l
0.7225 0.6329 l
0.7241 0.6330 l
0.7257 0.6332 l
0.7273 0.6333 l
0.7288 0.6334 l
0.7304 0.6335 l
0.7320 0.6336 l
0.7335 0.6337 l
0.7351 0.6339 l
0.7367 0.6340 l
0.7382 0.6341 l
0.7398 0.6342 l
0.7414 0.6343 l
0.7429 0.6344 l
0.7445 0.6346 l
0.7461 0.6347 l
0.7476 0.6348 l
0.7492 0.6349 l
0.7508 0.6350 l
0.7524 0.6352 l
0.7539 0.6354 l
0.7555 0.6356 l
0.7571 0.6360 l
0.7586 0.6355 l
0.7602 0.6345 l
0.7618 0.6342 l
0.7633 0.6339 l
0.7649 0.6337 l
0.7665 0.6335 l
0.7680 0.6333 l
0.7696 0.6332 l
0.7712 0.6331 l
0.7727 0.6330 l
0.7743 0.6329 l
0.7759 0.6328 l
0.7775 0.6327 l
0.7790 0.6327 l
0.7806 0.6326 l
0.7822 0.6325 l
0.7837 0.6325 l
0.7853 0.6324 l
0.7869 0.6324 l
0.7884 0.6324 l
0.7900 0.6323 l
0.7916 0.6323 l
0.7931 0.6322 l
0.7947 0.6322 l
0.7963 0.6322 l
0.7978 0.6322 l
0.7994 0.6321 l
0.8010 0.6321 l
0.8025 0.6321 l
0.8041 0.6321 l
0.8057 0.6320 l
0.8073 0.6320 l
0.8088 0.6320 l
0.8104 0.6320 l
0.8120 0.6320 l
0.8135 0.6320 l
0.8151 0.6319 l
0.8167 0.6319 l
0.8182 0.6319 l
0.8198 0.6319 l
0.8214 0.6319 l
0.8229 0.6319 l
0.8245 0.6319 l
0.8261 0.6319 l
0.8276 0.6319 l
0.8292 0.6318 l
0.8308 0.6318 l
0.8324 0.6318 l
0.8339 0.6318 l
0.8355 0.6318 l
0.8371 0.6318 l
0.8386 0.6318 l
0.8402 0.6318 l
0.8418 0.6318 l
0.8433 0.6318 l
0.8449 0.6318 l
0.8465 0.6318 l
0.8480 0.6317 l
0.8496 0.6317 l
0.8512 0.6388 l
0.8527 0.6388 l
0.8543 0.6388 l
0.8559 0.6388 l
0.8575 0.6389 l
0.8590 0.6389 l
0.8606 0.6389 l
0.8622 0.6389 l
0.8637 0.6389 l
0.8653 0.6390 l
0.8669 0.6390 l
0.8684 0.6390 l
0.8700 0.6390 l
0.8716 0.6390 l
0.8731 0.6390 l
0.8747 0.6390 l
0.8763 0.6390 l
0.8778 0.6390 l
0.8794 0.6391 l
0.8810 0.6391 l
0.8825 0.6391 l
0.8841 0.6391 l
0.8857 0.6391 l
0.8873 0.6391 l
0.8888 0.6391 l
0.8904 0.6391 l
0.8920 0.6391 l
0.8935 0.6391 l
0.8951 0.6391 l
0.8967 0.6391 l
0.8982 0.6391 l
0.8998 0.6391 l
0.9014 0.6391 l
0.9029 0.6391 l
0.9045 0.6391 l
0.9061 0.6391 l
0.9076 0.6391 l
0.9092 0.6391 l
0.9108 0.6391 l
0.9124 0.6391 l
0.9139 0.6391 l
0.9155 0.6391 l
0.9171 0.6391 l
0.9186 0.6391 l
0.9202 0.6391 l
0.9218 0.6391 l
0.9233 0.6391 l
0.9249 0.6391 l
0.9265 0.6391 l
0.9280 0.6391 l
0.9296 0.6391 l
0.9312 0.6391 l
0.9327 0.6391 l
0.9343 0.6390 l
0.9359 0.6390 l
0.9375 0.6390 l
0.9390 0.6390 l
0.9406 0.6390 l
0.9422 0.6390 l
0.9437 0.6390 l
0.9453 0.6390 l
0.9469 0.6390 l
0.9484 0.6390 l
0.9500 0.6390 l
s
[/DeviceRGB] SCS
Color3 SC
n
0.1500 0.8782 m
0.1516 0.8789 l
0.1531 0.8795 l
0.1547 0.8801 l
0.1563 0.8807 l
0.1578 0.8812 l
0.1594 0.8818 l
0.1610 0.8823 l
0.1625 0.8828 l
0.1641 0.8832 l
0.1657 0.8837 l
0.1673 0.8841 l
0.1688 0.8846 l
0.1704 0.8850 l
0.1720 0.8853 l
0.1735 0.8857 l
0.1751 0.8860 l
0.1767 0.8864 l
0.1782 0.8867 l
0.1798 0.8869 l
0.1814 0.8872 l
0.1829 0.8875 l
0.1845 0.8877 l
0.1861 0.8879 l
0.1876 0.8881 l
0.1892 0.8883 l
0.1908 0.8885 l
0.1924 0.8887 l
0.1939 0.8888 l
0.1955 0.8890 l
0.1971 0.8891 l
0.1986 0.8892 l
0.2002 0.8893 l
0.2018 0.8894 l
0.2033 0.8895 l
0.2049 0.8896 l
0.2065 0.8896 l
0.2080 0.8897 l
0.2096 0.8897 l
0.2112 0.8898 l
0.2127 0.8898 l
0.2143 0.8898 l
0.2159 0.8899 l
0.2175 0.8899 l
0.2190 0.8899 l
0.2206 0.8899 l
0.2222 0.8899 l
0.2237 0.8899 l
0.2253 0.8899 l
0.2269 0.8900 l
0.2284 0.8899 l
0.2300 0.8899 l
0.2316 0.8899 l
0.2331 0.8899 l
0.2347 0.8899 l
0.2363 0.8899 l
0.2378 0.8899 l
0.2394 0.8898 l
0.2410 0.8898 l
0.2425 0.8898 l
0.2441 0.8897 l
0.2457 0.8897 l
0.2473 0.8896 l
0.2488 0.8896 l
0.2504 0.8895 l
0.2520 0.8894 l
0.2535 0.8893 l
0.2551 0.8892 l
0.2567 0.8885 l
0.2582 0.8881 l
0.2598 0.8878 l
0.2614 0.8875 l
0.2629 0.8873 l
0.2645 0.8872 l
0.2661 0.8870 l
0.2676 0.8870 l
0.2692 0.8869 l
0.2708 0.8868 l
0.2724 0.8868 l
0.2739 0.8868 l
0.2755 0.8868 l
0.2771 0.8868 l
0.2786 0.8868 l
0.2802 0.8867 l
0.2818 0.8867 l
0.2833 0.8867 l
0.2849 0.8866 l
0.2865 0.8866 l
0.2880 0.8865 l
0.2896 0.8865 l
0.2912 0.8864 l
0.2927 0.8863 l
0.2943 0.8862 l
0.2959 0.8861 l
0.2975 0.8860 l
0.2990 0.8860 l
0.3006 0.8859 l
0.3022 0.8858 l
0.3037 0.8857 l
0.3053 0.8857 l
0.3069 0.8856 l
0.3084 0.8856 l
0.3100 0.8855 l
0.3116 0.8855 l
0.3131 0.8854 l
0.3147 0.8854 l
0.3163 0.8853 l
0.3178 0.8853 l
0.3194 0.8852 l
0.3210 0.8852 l
0.3225 0.8851 l
0.3241 0.8851 l
0.3257 0.8851 l
0.3273 0.8850 l
0.3288 0.8850 l
0.3304 0.8849 l
0.3320 0.8849 l
0.3335 0.8848 l
0.3351 0.8848 l
0.3367 0.8847 l
0.3382 0.8847 l
0.3398 0.8846 l
0.3414 0.8846 l
0.3429 0.8846 l
0.3445 0.8845 l
0.3461 0.8845 l
0.3476 0.8844 l
0.3492 0.8844 l
0.3508 0.8843 l
0.3524 0.8843 l
0.3539 0.8842 l
0.3555 0.8842 l
0.3571 0.8841 l
0.3586 0.8841 l
0.3602 0.8840 l
0.3618 0.8840 l
0.3633 0.8839 l
0.3649 0.8839 l
0.3665 0.8838 l
0.3680 0.8838 l
0.3696 0.8837 l
0.3712 0.8837 l
0.3727 0.8836 l
0.3743 0.8836 l
0.3759 0.8835 l
0.3775 0.8835 l
0.3790 0.8834 l
0.3806 0.8833 l
0.3822 0.8832 l
0.3837 0.8831 l
0.3853 0.8829 l
0.3869 0.8828 l
0.3884 0.8827 l
0.3900 0.8825 l
0.3916 0.8824 l
0.3931 0.8822 l
0.3947 0.8821 l
0.3963 0.8819 l
0.3978 0.8806 l
0.3994 0.8799 l
0.4010 0.8793 l
0.4025 0.8789 l
0.4041 0.8784 l
0.4057 0.8781 l
0.4073 0.8777 l
0.4088 0.8774 l
0.4104 0.8771 l
0.4120 0.8768 l
0.4135 0.8765 l
0.4151 0.8762 l
0.4167 0.8760 l
0.4182 0.8757 l
0.4198 0.8755 l
0.4214 0.8753 l
0.4229 0.8750 l
0.4245 0.8748 l
0.4261 0.8746 l
0.4276 0.8744 l
0.4292 0.8742 l
0.4308 0.8740 l
0.4324 0.8738 l
0.4339 0.8736 l
0.4355 0.8734 l
0.4371 0.8732 l
0.4386 0.8730 l
0.4402 0.8728 l
0.4418 0.8727 l
0.4433 0.8725 l
0.4449 0.8723 l
0.4465 0.8721 l
0.4480 0.8720 l
0.4496 0.8718 l
0.4512 0.8716 l
0.4527 0.8715 l
0.4543 0.8713 l
0.4559 0.8711 l
0.4575 0.8710 l
0.4590 0.8708 l
0.4606 0.8706 l
0.4622 0.8704 l
0.4637 0.8701 l
0.4653 0.8698 l
0.4669 0.8695 l
0.4684 0.8692 l
0.4700 0.8690 l
0.4716 0.8669 l
0.4731 0.8657 l
0.4747 0.8648 l
0.4763 0.8639 l
0.4778 0.8631 l
0.4794 0.8624 l
0.4810 0.8617 l
0.4825 0.8610 l
0.4841 0.8603 l
0.4857 0.8596 l
0.4873 0.8590 l
0.4888 0.8583 l
0.4904 0.8577 l
0.4920 0.8570 l
0.4935 0.8564 l
0.4951 0.8558 l
0.4967 0.8552 l
0.4982 0.8546 l
0.4998 0.8540 l
0.5014 0.8535 l
0.5029 0.8529 l
0.5045 0.8523 l
0.5061 0.8517 l
0.5076 0.8512 l
0.5092 0.8506 l
0.5108 0.8501 l
0.5124 0.8495 l
0.5139 0.8490 l
0.5155 0.8485 l
0.5171 0.8479 l
0.5186 0.8474 l
0.5202 0.8469 l
0.5218 0.8464 l
0.5233 0.8459 l
0.5249 0.8454 l
0.5265 0.8449 l
0.5280 0.8444 l
0.5296 0.8439 l
0.5312 0.8434 l
0.5327 0.8429 l
0.5343 0.8424 l
0.5359 0.8420 l
0.5375 0.8415 l
0.5390 0.8410 l
0.5406 0.8406 l
0.5422 0.8401 l
0.5437 0.8397 l
0.5453 0.8392 l
0.5469 0.8388 l
0.5484 0.8383 l
0.5502 0.8378 l
0.5516 0.8373 l
0.5531 0.8368 l
0.5547 0.8363 l
0.5563 0.8358 l
0.5578 0.8352 l
0.5594 0.8347 l
0.5610 0.8342 l
0.5625 0.8337 l
0.5641 0.8332 l
0.5657 0.8327 l
0.5673 0.8322 l
0.5688 0.8317 l
0.5704 0.8308 l
0.5720 0.8298 l
0.5735 0.8291 l
0.5751 0.8284 l
0.5767 0.8277 l
0.5782 0.8271 l
0.5798 0.8265 l
0.5814 0.8259 l
0.5829 0.8253 l
0.5845 0.8248 l
0.5861 0.8242 l
0.5876 0.8237 l
0.5892 0.8232 l
0.5908 0.8226 l
0.5924 0.8221 l
0.5939 0.8216 l
0.5955 0.8211 l
0.5971 0.8206 l
0.5986 0.8201 l
0.6002 0.8197 l
0.6018 0.8192 l
0.6033 0.8187 l
0.6049 0.8183 l
0.6065 0.8178 l
0.6080 0.8174 l
0.6096 0.8169 l
0.6112 0.8165 l
0.6127 0.8161 l
0.6143 0.8156 l
0.6159 0.8152 l
0.6175 0.8148 l
0.6190 0.8144 l
0.6206 0.8140 l
0.6222 0.8136 l
0.6237 0.8132 l
0.6253 0.8128 l
0.6269 0.8124 l
0.6284 0.8120 l
0.6300 0.8117 l
0.6316 0.8113 l
0.6331 0.8109 l
0.6347 0.8106 l
0.6363 0.8102 l
0.6378 0.8099 l
0.6394 0.8095 l
0.6410 0.8092 l
0.6425 0.8089 l
0.6441 0.8086 l
0.6457 0.8083 l
0.6473 0.8080 l
0.6488 0.8077 l
0.6504 0.8075 l
0.6520 0.8073 l
0.6535 0.8073 l
0.6551 0.8078 l
0.6567 0.8025 l
0.6582 0.7992 l
0.6598 0.7972 l
0.6614 0.7955 l
0.6629 0.7940 l
0.6645 0.7927 l
0.6661 0.7916 l
0.6676 0.7905 l
0.6692 0.7895 l
0.6708 0.7885 l
0.6724 0.7876 l
0.6739 0.7867 l
0.6755 0.7859 l
0.6771 0.7851 l
0.6786 0.7843 l
0.6802 0.7836 l
0.6818 0.7829 l
0.6833 0.7822 l
0.6849 0.7815 l
0.6865 0.7808 l
0.6880 0.7802 l
0.6896 0.7796 l
0.6912 0.7790 l
0.6927 0.7784 l
0.6943 0.7778 l
0.6959 0.7773 l
0.6975 0.7767 l
0.6990 0.7762 l
0.7006 0.7757 l
0.7022 0.7751 l
0.7037 0.7746 l
0.7053 0.7741 l
0.7069 0.7737 l
0.7084 0.7732 l
0.7100 0.7727 l
0.7116 0.7723 l
0.7131 0.7718 l
0.7147 0.7714 l
0.7163 0.7709 l
0.7178 0.7705 l
0.7194 0.7701 l
0.7210 0.7697 l
0.7225 0.7693 l
0.7241 0.7689 l
0.7257 0.7685 l
0.7273 0.7681 l
0.7288 0.7677 l
0.7304 0.7673 l
0.7320 0.7670 l
0.7335 0.7666 l
0.7351 0.7662 l
0.7367 0.7659 l
0.7382 0.7655 l
0.7398 0.7652 l
0.7414 0.7649 l
0.7429 0.7645 l
0.7445 0.7642 l
0.7461 0.7639 l
0.7476 0.7636 l
0.7492 0.7633 l
0.7508 0.7630 l
0.7524 0.7627 l
0.7539 0.7625 l
0.7555 0.7623 l
0.7571 0.7623 l
0.7586 0.7615 l
0.7602 0.7601 l
0.7618 0.7594 l
0.7633 0.7587 l
0.7649 0.7581 l
0.7665 0.7576 l
0.7680 0.7570 l
0.7696 0.7566 l
0.7712 0.7561 l
0.7727 0.7556 l
0.7743 0.7552 l
0.7759 0.7547 l
0.7775 0.7543 l
0.7790 0.7539 l
0.7806 0.7535 l
0.7822 0.7531 l
0.7837 0.7528 l
0.7853 0.7524 l
0.7869 0.7520 l
0.7884 0.7517 l
0.7900 0.7513 l
0.7916 0.7510 l
0.7931 0.7506 l
0.7947 0.7503 l
0.7963 0.7500 l
0.7978 0.7496 l
0.7994 0.7493 l
0.8010 0.7490 l
0.8025 0.7487 l
0.8041 0.7484 l
0.8057 0.7481 l
0.8073 0.7478 l
0.8088 0.7475 l
0.8104 0.7472 l
0.8120 0.7469 l
0.8135 0.7467 l
0.8151 0.7464 l
0.8167 0.7461 l
0.8182 0.7458 l
0.8198 0.7456 l
0.8214 0.7453 l
0.8229 0.7450 l
0.8245 0.7448 l
0.8261 0.7445 l
0.8276 0.7443 l
0.8292 0.7440 l
0.8308 0.7438 l
0.8324 0.7435 l
0.8339 0.7433 l
0.8355 0.7430 l
0.8371 0.7428 l
0.8386 0.7426 l
0.8402 0.7423 l
0.8418 0.7421 l
0.8433 0.7419 l
0.8449 0.7416 l
0.8465 0.7414 l
0.8480 0.7412 l
0.8496 0.7410 l
0.8512 0.7478 l
0.8527 0.7476 l
0.8543 0.7474 l
0.8559 0.7472 l
0.8575 0.7471 l
0.8590 0.7469 l
0.8606 0.7467 l
0.8622 0.7465 l
0.8637 0.7463 l
0.8653 0.7462 l
0.8669 0.7460 l
0.8684 0.7458 l
0.8700 0.7456 l
0.8716 0.7455 l
0.8731 0.7453 l
0.8747 0.7451 l
0.8763 0.7449 l
0.8778 0.7448 l
0.8794 0.7446 l
0.8810 0.7444 l
0.8825 0.7443 l
0.8841 0.7441 l
0.8857 0.7439 l
0.8873 0.7438 l
0.8888 0.7436 l
0.8904 0.7434 l
0.8920 0.7433 l
0.8935 0.7431 l
0.8951 0.7430 l
0.8967 0.7428 l
0.8982 0.7426 l
0.8998 0.7425 l
0.9014 0.7423 l
0.9029 0.7422 l
0.9045 0.7420 l
0.9061 0.7419 l
0.9076 0.7417 l
0.9092 0.7415 l
0.9108 0.7414 l
0.9124 0.7412 l
0.9139 0.7411 l
0.9155 0.7409 l
0.9171 0.7408 l
0.9186 0.7406 l
0.9202 0.7405 l
0.9218 0.7404 l
0.9233 0.7402 l
0.9249 0.7401 l
0.9265 0.7399 l
0.9280 0.7398 l
0.9296 0.7396 l
0.9312 0.7395 l
0.9327 0.7394 l
0.9343 0.7392 l
0.9359 0.7391 l
0.9375 0.7389 l
0.9390 0.7388 l
0.9406 0.7387 l
0.9422 0.7385 l
0.9437 0.7384 l
0.9453 0.7383 l
0.9469 0.7381 l
0.9484 0.7380 l
0.9500 0.7379 l
s
[/DeviceRGB] SCS
Color4 SC
n
0.1500 0.7035 m
0.1516 0.7041 l
0.1531 0.7046 l
0.1547 0.7052 l
0.1563 0.7057 l
0.1578 0.7062 l
0.1594 0.7066 l
0.1610 0.7071 l
0.1625 0.7075 l
0.1641 0.7079 l
0.1657 0.7083 l
0.1673 0.7087 l
0.1688 0.7091 l
0.1704 0.7095 l
0.1720 0.7098 l
0.1735 0.7101 l
0.1751 0.7104 l
0.1767 0.7107 l
0.1782 0.7110 l
0.1798 0.7113 l
0.1814 0.7116 l
0.1829 0.7118 l
0.1845 0.7121 l
0.1861 0.7123 l
0.1876 0.7126 l
0.1892 0.7128 l
0.1908 0.7130 l
0.1924 0.7133 l
0.1939 0.7135 l
0.1955 0.7137 l
0.1971 0.7139 l
0.1986 0.7141 l
0.2002 0.7143 l
0.2018 0.7145 l
0.2033 0.7147 l
0.2049 0.7149 l
0.2065 0.7151 l
0.2080 0.7153 l
0.2096 0.7155 l
0.2112 0.7156 l
0.2127 0.7158 l
0.2143 0.7159 l
0.2159 0.7161 l
0.2175 0.7162 l
0.2190 0.7164 l
0.2206 0.7165 l
0.2222 0.7166 l
0.2237 0.7167 l
0.2253 0.7169 l
0.2269 0.7170 l
0.2284 0.7171 l
0.2300 0.7172 l
0.2316 0.7172 l
0.2331 0.7173 l
0.2347 0.7174 l
0.2363 0.7175 l
0.2378 0.7176 l
0.2394 0.7176 l
0.2410 0.7177 l
0.2425 0.7177 l
0.2441 0.7178 l
0.2457 0.7178 l
0.2473 0.7178 l
0.2488 0.7179 l
0.2504 0.7179 l
0.2520 0.7179 l
0.2535 0.7179 l
0.2551 0.7178 l
0.2567 0.7172 l
0.2582 0.7169 l
0.2598 0.7166 l
0.2614 0.7165 l
0.2629 0.7163 l
0.2645 0.7163 l
0.2661 0.7162 l
0.2676 0.7162 l
0.2692 0.7162 l
0.2708 0.7162 l
0.2724 0.7163 l
0.2739 0.7163 l
0.2755 0.7164 l
0.2771 0.7165 l
0.2786 0.7165 l
0.2802 0.7166 l
0.2818 0.7166 l
0.2833 0.7163 l
0.2849 0.7168 l
0.2865 0.7169 l
0.2880 0.7169 l
0.2896 0.7169 l
0.2912 0.7169 l
0.2927 0.7169 l
0.2943 0.7169 l
0.2959 0.7169 l
0.2975 0.7168 l
0.2990 0.7168 l
0.3006 0.7168 l
0.3022 0.7168 l
0.3037 0.7168 l
0.3053 0.7168 l
0.3069 0.7169 l
0.3084 0.7169 l
0.3100 0.7169 l
0.3116 0.7169 l
0.3131 0.7169 l
0.3147 0.7170 l
0.3163 0.7170 l
0.3178 0.7170 l
0.3194 0.7170 l
0.3210 0.7171 l
0.3225 0.7171 l
0.3241 0.7171 l
0.3257 0.7171 l
0.3273 0.7172 l
0.3288 0.7172 l
0.3304 0.7172 l
0.3320 0.7172 l
0.3335 0.7173 l
0.3351 0.7173 l
0.3367 0.7173 l
0.3382 0.7173 l
0.3398 0.7173 l
0.3414 0.7174 l
0.3429 0.7174 l
0.3445 0.7174 l
0.3461 0.7174 l
0.3476 0.7174 l
0.3492 0.7174 l
0.3508 0.7175 l
0.3524 0.7175 l
0.3539 0.7175 l
0.3555 0.7175 l
0.3571 0.7175 l
0.3586 0.7175 l
0.3602 0.7175 l
0.3618 0.7175 l
0.3633 0.7176 l
0.3649 0.7176 l
0.3665 0.7176 l
0.3680 0.7176 l
0.3696 0.7176 l
0.3712 0.7176 l
0.3727 0.7176 l
0.3743 0.7176 l
0.3759 0.7176 l
0.3775 0.7176 l
0.3790 0.7176 l
0.3806 0.7175 l
0.3822 0.7175 l
0.3837 0.7174 l
0.3853 0.7174 l
0.3869 0.7173 l
0.3884 0.7172 l
0.3900 0.7171 l
0.3916 0.7170 l
0.3931 0.7169 l
0.3947 0.7169 l
0.3963 0.7168 l
0.3978 0.7154 l
0.3994 0.7148 l
0.4010 0.7143 l
0.4025 0.7139 l
0.4041 0.7135 l
0.4057 0.7132 l
0.4073 0.7129 l
0.4088 0.7126 l
0.4104 0.7124 l
0.4120 0.7121 l
0.4135 0.7119 l
0.4151 0.7117 l
0.4167 0.7115 l
0.4182 0.7113 l
0.4198 0.7111 l
0.4214 0.7109 l
0.4229 0.7107 l
0.4245 0.7106 l
0.4261 0.7104 l
0.4276 0.7102 l
0.4292 0.7101 l
0.4308 0.7099 l
0.4324 0.7098 l
0.4339 0.7096 l
0.4355 0.7095 l
0.4371 0.7093 l
0.4386 0.7092 l
0.4402 0.7090 l
0.4418 0.7089 l
0.4433 0.7088 l
0.4449 0.7086 l
0.4465 0.7085 l
0.4480 0.7084 l
0.4496 0.7082 l
0.4512 0.7081 l
0.4527 0.7080 l
0.4543 0.7079 l
0.4559 0.7078 l
0.4575 0.7076 l
0.4590 0.7075 l
0.4606 0.7073 l
0.4622 0.7071 l
0.4637 0.7069 l
0.4653 0.7066 l
0.4669 0.7063 l
0.4684 0.7060 l
0.4700 0.7054 l
0.4716 0.7040 l
0.4731 0.7029 l
0.4747 0.7020 l
0.4763 0.7012 l
0.4778 0.7004 l
0.4794 0.6997 l
0.4810 0.6991 l
0.4825 0.6984 l
0.4841 0.6978 l
0.4857 0.6971 l
0.4873 0.6965 l
0.4888 0.6959 l
0.4904 0.6953 l
0.4920 0.6947 l
0.4935 0.6942 l
0.4951 0.6936 l
0.4967 0.6930 l
0.4982 0.6925 l
0.4998 0.6919 l
0.5014 0.6914 l
0.5029 0.6909 l
0.5045 0.6903 l
0.5061 0.6898 l
0.5076 0.6893 l
0.5092 0.6888 l
0.5108 0.6883 l
0.5124 0.6878 l
0.5139 0.6873 l
0.5155 0.6868 l
0.5171 0.6863 l
0.5186 0.6858 l
0.5202 0.6853 l
0.5218 0.6849 l
0.5233 0.6844 l
0.5249 0.6839 l
0.5265 0.6835 l
0.5280 0.6830 l
0.5296 0.6826 l
0.5312 0.6821 l
0.5327 0.6817 l
0.5343 0.6812 l
0.5359 0.6808 l
0.5375 0.6804 l
0.5390 0.6799 l
0.5406 0.6795 l
0.5422 0.6791 l
0.5437 0.6787 l
0.5453 0.6782 l
0.5469 0.6778 l
0.5484 0.6774 l
0.5502 0.6769 l
0.5516 0.6765 l
0.5531 0.6760 l
0.5547 0.6755 l
0.5563 0.6751 l
0.5578 0.6746 l
0.5594 0.6741 l
0.5610 0.6736 l
0.5625 0.6731 l
0.5641 0.6726 l
0.5657 0.6721 l
0.5673 0.6716 l
0.5688 0.6711 l
0.5704 0.6705 l
0.5720 0.6696 l
0.5735 0.6688 l
0.5751 0.6682 l
0.5767 0.6676 l
0.5782 0.6670 l
0.5798 0.6664 l
0.5814 0.6658 l
0.5829 0.6653 l
0.5845 0.6648 l
0.5861 0.6642 l
0.5876 0.6637 l
0.5892 0.6632 l
0.5908 0.6627 l
0.5924 0.6623 l
0.5939 0.6618 l
0.5955 0.6613 l
0.5971 0.6608 l
0.5986 0.6604 l
0.6002 0.6599 l
0.6018 0.6595 l
0.6033 0.6591 l
0.6049 0.6586 l
0.6065 0.6582 l
0.6080 0.6578 l
0.6096 0.6574 l
0.6112 0.6570 l
0.6127 0.6565 l
0.6143 0.6561 l
0.6159 0.6558 l
0.6175 0.6554 l
0.6190 0.6550 l
0.6206 0.6546 l
0.6222 0.6542 l
0.6237 0.6538 l
0.6253 0.6535 l
0.6269 0.6531 l
0.6284 0.6527 l
0.6300 0.6524 l
0.6316 0.6520 l
0.6331 0.6517 l
0.6347 0.6513 l
0.6363 0.6510 l
0.6378 0.6506 l
0.6394 0.6503 l
0.6410 0.6500 l
0.6425 0.6496 l
0.6441 0.6493 l
0.6457 0.6489 l
0.6473 0.6486 l
0.6488 0.6483 l
0.6504 0.6479 l
0.6520 0.6475 l
0.6535 0.6471 l
0.6551 0.6463 l
0.6567 0.6441 l
0.6582 0.6410 l
0.6598 0.6390 l
0.6614 0.6374 l
0.6629 0.6360 l
0.6645 0.6347 l
0.6661 0.6336 l
0.6676 0.6325 l
0.6692 0.6315 l
0.6708 0.6306 l
0.6724 0.6297 l
0.6739 0.6289 l
0.6755 0.6281 l
0.6771 0.6273 l
0.6786 0.6266 l
0.6802 0.6258 l
0.6818 0.6252 l
0.6833 0.6245 l
0.6849 0.6239 l
0.6865 0.6232 l
0.6880 0.6226 l
0.6896 0.6220 l
0.6912 0.6215 l
0.6927 0.6209 l
0.6943 0.6204 l
0.6959 0.6198 l
0.6975 0.6193 l
0.6990 0.6188 l
0.7006 0.6183 l
0.7022 0.6178 l
0.7037 0.6173 l
0.7053 0.6169 l
0.7069 0.6164 l
0.7084 0.6160 l
0.7100 0.6155 l
0.7116 0.6151 l
0.7131 0.6147 l
0.7147 0.6143 l
0.7163 0.6139 l
0.7178 0.6134 l
0.7194 0.6131 l
0.7210 0.6127 l
0.7225 0.6123 l
0.7241 0.6119 l
0.7257 0.6115 l
0.7273 0.6112 l
0.7288 0.6108 l
0.7304 0.6105 l
0.7320 0.6101 l
0.7335 0.6098 l
0.7351 0.6094 l
0.7367 0.6091 l
0.7382 0.6088 l
0.7398 0.6084 l
0.7414 0.6081 l
0.7429 0.6078 l
0.7445 0.6075 l
0.7461 0.6072 l
0.7476 0.6069 l
0.7492 0.6066 l
0.7508 0.6063 l
0.7524 0.6059 l
0.7539 0.6056 l
0.7555 0.6053 l
0.7571 0.6050 l
0.7586 0.6052 l
0.7602 0.6040 l
0.7618 0.6033 l
0.7633 0.6026 l
0.7649 0.6021 l
0.7665 0.6016 l
0.7680 0.6011 l
0.7696 0.6006 l
0.7712 0.6002 l
0.7727 0.5997 l
0.7743 0.5993 l
0.7759 0.5989 l
0.7775 0.5985 l
0.7790 0.5981 l
0.7806 0.5978 l
0.7822 0.5974 l
0.7837 0.5971 l
0.7853 0.5967 l
0.7869 0.5964 l
0.7884 0.5960 l
0.7900 0.5957 l
0.7916 0.5954 l
0.7931 0.5951 l
0.7947 0.5948 l
0.7963 0.5945 l
0.7978 0.5942 l
0.7994 0.5939 l
0.8010 0.5936 l
0.8025 0.5933 l
0.8041 0.5930 l
0.8057 0.5928 l
0.8073 0.5925 l
0.8088 0.5922 l
0.8104 0.5919 l
0.8120 0.5917 l
0.8135 0.5914 l
0.8151 0.5912 l
0.8167 0.5909 l
0.8182 0.5907 l
0.8198 0.5904 l
0.8214 0.5902 l
0.8229 0.5900 l
0.8245 0.5897 l
0.8261 0.5895 l
0.8276 0.5893 l
0.8292 0.5890 l
0.8308 0.5888 l
0.8324 0.5886 l
0.8339 0.5884 l
0.8355 0.5881 l
0.8371 0.5879 l
0.8386 0.5877 l
0.8402 0.5875 l
0.8418 0.5873 l
0.8433 0.5871 l
0.8449 0.5869 l
0.8465 0.5867 l
0.8480 0.5865 l
0.8496 0.5863 l
0.8512 0.5931 l
0.8527 0.5930 l
0.8543 0.5928 l
0.8559 0.5926 l
0.8575 0.5925 l
0.8590 0.5923 l
0.8606 0.5922 l
0.8622 0.5920 l
0.8637 0.5919 l
0.8653 0.5917 l
0.8669 0.5915 l
0.8684 0.5914 l
0.8700 0.5912 l
0.8716 0.5911 l
0.8731 0.5909 l
0.8747 0.5908 l
0.8763 0.5906 l
0.8778 0.5905 l
0.8794 0.5904 l
0.8810 0.5902 l
0.8825 0.5901 l
0.8841 0.5899 l
0.8857 0.5898 l
0.8873 0.5896 l
0.8888 0.5895 l
0.8904 0.5894 l
0.8920 0.5892 l
0.8935 0.5891 l
0.8951 0.5889 l
0.8967 0.5888 l
0.8982 0.5887 l
0.8998 0.5885 l
0.9014 0.5884 l
0.9029 0.5883 l
0.9045 0.5881 l
0.9061 0.5880 l
0.9076 0.5879 l
0.9092 0.5877 l
0.9108 0.5876 l
0.9124 0.5875 l
0.9139 0.5873 l
0.9155 0.5872 l
0.9171 0.5871 l
0.9186 0.5870 l
0.9202 0.5868 l
0.9218 0.5867 l
0.9233 0.5866 l
0.9249 0.5865 l
0.9265 0.5864 l
0.9280 0.5862 l
0.9296 0.5861 l
0.9312 0.5860 l
0.9327 0.5859 l
0.9343 0.5858 l
0.9359 0.5856 l
0.9375 0.5855 l
0.9390 0.5854 l
0.9406 0.5853 l
0.9422 0.5852 l
0.9437 0.5851 l
0.9453 0.5849 l
0.9469 0.5848 l
0.9484 0.5847 l
0.9500 0.5846 l
s
[/DeviceRGB] SCS
Color5 SC
n
0.1500 0.2434 m
0.1516 0.2440 l
0.1531 0.2445 l
0.1547 0.2450 l
0.1563 0.2455 l
0.1578 0.2460 l
0.1594 0.2465 l
0.1610 0.2469 l
0.1625 0.2474 l
0.1641 0.2478 l
0.1657 0.2482 l
0.1673 0.2485 l
0.1688 0.2489 l
0.1704 0.2493 l
0.1720 0.2496 l
0.1735 0.2499 l
0.1751 0.2502 l
0.1767 0.2505 l
0.1782 0.2508 l
0.1798 0.2511 l
0.1814 0.2513 l
0.1829 0.2516 l
0.1845 0.2518 l
0.1861 0.2521 l
0.1876 0.2523 l
0.1892 0.2525 l
0.1908 0.2527 l
0.1924 0.2530 l
0.1939 0.2532 l
0.1955 0.2534 l
0.1971 0.2536 l
0.1986 0.2538 l
0.2002 0.2540 l
0.2018 0.2542 l
0.2033 0.2544 l
0.2049 0.2546 l
0.2065 0.2547 l
0.2080 0.2549 l
0.2096 0.2551 l
0.2112 0.2553 l
0.2127 0.2554 l
0.2143 0.2556 l
0.2159 0.2557 l
0.2175 0.2559 l
0.2190 0.2560 l
0.2206 0.2561 l
0.2222 0.2562 l
0.2237 0.2564 l
0.2253 0.2565 l
0.2269 0.2566 l
0.2284 0.2567 l
0.2300 0.2568 l
0.2316 0.2569 l
0.2331 0.2569 l
0.2347 0.2570 l
0.2363 0.2571 l
0.2378 0.2572 l
0.2394 0.2572 l
0.2410 0.2573 l
0.2425 0.2573 l
0.2441 0.2574 l
0.2457 0.2574 l
0.2473 0.2574 l
0.2488 0.2575 l
0.2504 0.2575 l
0.2520 0.2575 l
0.2535 0.2574 l
0.2551 0.2574 l
0.2567 0.2568 l
0.2582 0.2565 l
0.2598 0.2562 l
0.2614 0.2560 l
0.2629 0.2559 l
0.2645 0.2558 l
0.2661 0.2558 l
0.2676 0.2558 l
0.2692 0.2558 l
0.2708 0.2558 l
0.2724 0.2559 l
0.2739 0.2559 l
0.2755 0.2560 l
0.2771 0.2560 l
0.2786 0.2561 l
0.2802 0.2561 l
0.2818 0.2561 l
0.2833 0.2559 l
0.2849 0.2564 l
0.2865 0.2564 l
0.2880 0.2564 l
0.2896 0.2564 l
0.2912 0.2564 l
0.2927 0.2564 l
0.2943 0.2564 l
0.2959 0.2564 l
0.2975 0.2564 l
0.2990 0.2564 l
0.3006 0.2564 l
0.3022 0.2564 l
0.3037 0.2564 l
0.3053 0.2564 l
0.3069 0.2564 l
0.3084 0.2564 l
0.3100 0.2565 l
0.3116 0.2565 l
0.3131 0.2565 l
0.3147 0.2565 l
0.3163 0.2566 l
0.3178 0.2566 l
0.3194 0.2566 l
0.3210 0.2566 l
0.3225 0.2567 l
0.3241 0.2567 l
0.3257 0.2567 l
0.3273 0.2567 l
0.3288 0.2568 l
0.3304 0.2568 l
0.3320 0.2568 l
0.3335 0.2568 l
0.3351 0.2568 l
0.3367 0.2569 l
0.3382 0.2569 l
0.3398 0.2569 l
0.3414 0.2569 l
0.3429 0.2569 l
0.3445 0.2570 l
0.3461 0.2570 l
0.3476 0.2570 l
0.3492 0.2570 l
0.3508 0.2570 l
0.3524 0.2570 l
0.3539 0.2570 l
0.3555 0.2571 l
0.3571 0.2571 l
0.3586 0.2571 l
0.3602 0.2571 l
0.3618 0.2571 l
0.3633 0.2571 l
0.3649 0.2571 l
0.3665 0.2571 l
0.3680 0.2571 l
0.3696 0.2572 l
0.3712 0.2572 l
0.3727 0.2572 l
0.3743 0.2572 l
0.3759 0.2572 l
0.3775 0.2572 l
0.3790 0.2571 l
0.3806 0.2571 l
0.3822 0.2571 l
0.3837 0.2570 l
0.3853 0.2569 l
0.3869 0.2569 l
0.3884 0.2568 l
0.3900 0.2567 l
0.3916 0.2566 l
0.3931 0.2565 l
0.3947 0.2564 l
0.3963 0.2563 l
0.3978 0.2550 l
0.3994 0.2544 l
0.4010 0.2539 l
0.4025 0.2535 l
0.4041 0.2531 l
0.4057 0.2528 l
0.4073 0.2525 l
0.4088 0.2522 l
0.4104 0.2519 l
0.4120 0.2517 l
0.4135 0.2515 l
0.4151 0.2513 l
0.4167 0.2511 l
0.4182 0.2509 l
0.4198 0.2507 l
0.4214 0.2505 l
0.4229 0.2503 l
0.4245 0.2501 l
0.4261 0.2500 l
0.4276 0.2498 l
0.4292 0.2496 l
0.4308 0.2495 l
0.4324 0.2493 l
0.4339 0.2492 l
0.4355 0.2490 l
0.4371 0.2489 l
0.4386 0.2488 l
0.4402 0.2486 l
0.4418 0.2485 l
0.4433 0.2483 l
0.4449 0.2482 l
0.4465 0.2481 l
0.4480 0.2480 l
0.4496 0.2478 l
0.4512 0.2477 l
0.4527 0.2476 l
0.4543 0.2475 l
0.4559 0.2473 l
0.4575 0.2472 l
0.4590 0.2471 l
0.4606 0.2469 l
0.4622 0.2467 l
0.4637 0.2465 l
0.4653 0.2462 l
0.4669 0.2459 l
0.4684 0.2455 l
0.4700 0.2450 l
0.4716 0.2436 l
0.4731 0.2425 l
0.4747 0.2416 l
0.4763 0.2408 l
0.4778 0.2400 l
0.4794 0.2393 l
0.4810 0.2387 l
0.4825 0.2380 l
0.4841 0.2374 l
0.4857 0.2367 l
0.4873 0.2361 l
0.4888 0.2355 l
0.4904 0.2349 l
0.4920 0.2344 l
0.4935 0.2338 l
0.4951 0.2332 l
0.4967 0.2327 l
0.4982 0.2321 l
0.4998 0.2316 l
0.5014 0.2310 l
0.5029 0.2305 l
0.5045 0.2300 l
0.5061 0.2294 l
0.5076 0.2289 l
0.5092 0.2284 l
0.5108 0.2279 l
0.5124 0.2274 l
0.5139 0.2269 l
0.5155 0.2264 l
0.5171 0.2259 l
0.5186 0.2254 l
0.5202 0.2250 l
0.5218 0.2245 l
0.5233 0.2240 l
0.5249 0.2235 l
0.5265 0.2231 l
0.5280 0.2226 l
0.5296 0.2222 l
0.5312 0.2217 l
0.5327 0.2213 l
0.5343 0.2208 l
0.5359 0.2204 l
0.5375 0.2200 l
0.5390 0.2196 l
0.5406 0.2191 l
0.5422 0.2187 l
0.5437 0.2183 l
0.5453 0.2179 l
0.5469 0.2175 l
0.5484 0.2170 l
0.5502 0.2166 l
0.5516 0.2161 l
0.5531 0.2157 l
0.5547 0.2152 l
0.5563 0.2147 l
0.5578 0.2142 l
0.5594 0.2137 l
0.5610 0.2132 l
0.5625 0.2127 l
0.5641 0.2122 l
0.5657 0.2118 l
0.5673 0.2113 l
0.5688 0.2108 l
0.5704 0.2101 l
0.5720 0.2092 l
0.5735 0.2085 l
0.5751 0.2078 l
0.5767 0.2072 l
0.5782 0.2066 l
0.5798 0.2060 l
0.5814 0.2055 l
0.5829 0.2049 l
0.5845 0.2044 l
0.5861 0.2039 l
0.5876 0.2034 l
0.5892 0.2029 l
0.5908 0.2024 l
0.5924 0.2019 l
0.5939 0.2014 l
0.5955 0.2010 l
0.5971 0.2005 l
0.5986 0.2000 l
0.6002 0.1996 l
0.6018 0.1992 l
0.6033 0.1987 l
0.6049 0.1983 l
0.6065 0.1979 l
0.6080 0.1974 l
0.6096 0.1970 l
0.6112 0.1966 l
0.6127 0.1962 l
0.6143 0.1958 l
0.6159 0.1954 l
0.6175 0.1950 l
0.6190 0.1946 l
0.6206 0.1943 l
0.6222 0.1939 l
0.6237 0.1935 l
0.6253 0.1931 l
0.6269 0.1928 l
0.6284 0.1924 l
0.6300 0.1921 l
0.6316 0.1917 l
0.6331 0.1914 l
0.6347 0.1910 l
0.6363 0.1907 l
0.6378 0.1903 l
0.6394 0.1900 l
0.6410 0.1896 l
0.6425 0.1893 l
0.6441 0.1890 l
0.6457 0.1886 l
0.6473 0.1883 l
0.6488 0.1880 l
0.6504 0.1876 l
0.6520 0.1872 l
0.6535 0.1868 l
0.6551 0.1860 l
0.6567 0.1839 l
0.6582 0.1808 l
0.6598 0.1787 l
0.6614 0.1771 l
0.6629 0.1757 l
0.6645 0.1744 l
0.6661 0.1733 l
0.6676 0.1722 l
0.6692 0.1712 l
0.6708 0.1703 l
0.6724 0.1694 l
0.6739 0.1686 l
0.6755 0.1678 l
0.6771 0.1670 l
0.6786 0.1663 l
0.6802 0.1656 l
0.6818 0.1649 l
0.6833 0.1642 l
0.6849 0.1636 l
0.6865 0.1629 l
0.6880 0.1623 l
0.6896 0.1618 l
0.6912 0.1612 l
0.6927 0.1606 l
0.6943 0.1601 l
0.6959 0.1595 l
0.6975 0.1590 l
0.6990 0.1585 l
0.7006 0.1580 l
0.7022 0.1575 l
0.7037 0.1571 l
0.7053 0.1566 l
0.7069 0.1561 l
0.7084 0.1557 l
0.7100 0.1553 l
0.7116 0.1548 l
0.7131 0.1544 l
0.7147 0.1540 l
0.7163 0.1536 l
0.7178 0.1532 l
0.7194 0.1528 l
0.7210 0.1524 l
0.7225 0.1520 l
0.7241 0.1516 l
0.7257 0.1513 l
0.7273 0.1509 l
0.7288 0.1505 l
0.7304 0.1502 l
0.7316 0.1499 l
s
[/DeviceRGB] SCS
Color6 SC
n
0.1500 0.6998 m
0.1516 0.6959 l
0.1531 0.6919 l
0.1547 0.6879 l
0.1563 0.6837 l
0.1578 0.6795 l
0.1594 0.6751 l
0.1610 0.6707 l
0.1625 0.6662 l
0.1641 0.6616 l
0.1657 0.6568 l
0.1673 0.6520 l
0.1688 0.6471 l
0.1704 0.6421 l
0.1720 0.6370 l
0.1735 0.6318 l
0.1751 0.6265 l
0.1767 0.6212 l
0.1782 0.6157 l
0.1798 0.6102 l
0.1814 0.6046 l
0.1829 0.5989 l
0.1845 0.5932 l
0.1861 0.5874 l
0.1876 0.5816 l
0.1892 0.5758 l
0.1908 0.5699 l
0.1924 0.5641 l
0.1939 0.5583 l
0.1955 0.5525 l
0.1971 0.5468 l
0.1986 0.5412 l
0.2002 0.5357 l
0.2018 0.5304 l
0.2033 0.5252 l
0.2049 0.5201 l
0.2065 0.5153 l
0.2080 0.5107 l
0.2096 0.5064 l
0.2112 0.5023 l
0.2127 0.4986 l
0.2143 0.4951 l
0.2159 0.4920 l
0.2175 0.4892 l
0.2190 0.4868 l
0.2206 0.4847 l
0.2222 0.4830 l
0.2237 0.4817 l
0.2253 0.4808 l
0.2269 0.4803 l
0.2284 0.4803 l
0.2300 0.4806 l
0.2316 0.4814 l
0.2331 0.4826 l
0.2347 0.4843 l
0.2363 0.4865 l
0.2378 0.4891 l
0.2394 0.4921 l
0.2410 0.4957 l
0.2425 0.4998 l
0.2441 0.5044 l
0.2457 0.5095 l
0.2473 0.5151 l
0.2488 0.5212 l
0.2504 0.5279 l
0.2520 0.5352 l
0.2535 0.5430 l
0.2551 0.5514 l
0.2567 0.5901 l
0.2582 0.6054 l
0.2598 0.6160 l
0.2614 0.6234 l
0.2629 0.6288 l
0.2645 0.6327 l
0.2661 0.6354 l
0.2676 0.6374 l
0.2692 0.6388 l
0.2708 0.6397 l
0.2724 0.6402 l
0.2739 0.6404 l
0.2755 0.6403 l
0.2771 0.6401 l
0.2786 0.6396 l
0.2802 0.6390 l
0.2818 0.6383 l
0.2833 0.6371 l
0.2849 0.6366 l
0.2865 0.6358 l
0.2880 0.6348 l
0.2896 0.6339 l
0.2912 0.6328 l
0.2927 0.6318 l
0.2943 0.6307 l
0.2959 0.6295 l
0.2975 0.6284 l
0.2990 0.6273 l
0.3006 0.6261 l
0.3022 0.6250 l
0.3037 0.6238 l
0.3053 0.6227 l
0.3069 0.6215 l
0.3084 0.6204 l
0.3100 0.6192 l
0.3116 0.6181 l
0.3131 0.6170 l
0.3147 0.6159 l
0.3163 0.6148 l
0.3178 0.6136 l
0.3194 0.6125 l
0.3210 0.6115 l
0.3225 0.6104 l
0.3241 0.6093 l
0.3257 0.6082 l
0.3273 0.6071 l
0.3288 0.6061 l
0.3304 0.6050 l
0.3320 0.6040 l
0.3335 0.6029 l
0.3351 0.6019 l
0.3367 0.6008 l
0.3382 0.5998 l
0.3398 0.5988 l
0.3414 0.5978 l
0.3429 0.5968 l
0.3445 0.5958 l
0.3461 0.5948 l
0.3476 0.5938 l
0.3492 0.5929 l
0.3508 0.5919 l
0.3524 0.5909 l
0.3539 0.5900 l
0.3555 0.5890 l
0.3571 0.5881 l
0.3586 0.5871 l
0.3602 0.5862 l
0.3618 0.5853 l
0.3633 0.5843 l
0.3649 0.5834 l
0.3665 0.5825 l
0.3680 0.5816 l
0.3696 0.5807 l
0.3712 0.5798 l
0.3727 0.5789 l
0.3743 0.5781 l
0.3759 0.5772 l
0.3775 0.5763 l
0.3790 0.5754 l
0.3806 0.5745 l
0.3822 0.5736 l
0.3837 0.5727 l
0.3853 0.5717 l
0.3869 0.5708 l
0.3884 0.5699 l
0.3900 0.5690 l
0.3916 0.5681 l
0.3931 0.5671 l
0.3947 0.5662 l
0.3963 0.5653 l
0.3978 0.5632 l
0.3994 0.5617 l
0.4010 0.5604 l
0.4025 0.5592 l
0.4041 0.5580 l
0.4057 0.5569 l
0.4073 0.5558 l
0.4088 0.5547 l
0.4104 0.5537 l
0.4120 0.5526 l
0.4135 0.5516 l
0.4151 0.5506 l
0.4167 0.5496 l
0.4182 0.5486 l
0.4198 0.5477 l
0.4214 0.5467 l
0.4229 0.5458 l
0.4245 0.5448 l
0.4261 0.5439 l
0.4276 0.5429 l
0.4292 0.5420 l
0.4308 0.5411 l
0.4324 0.5402 l
0.4339 0.5393 l
0.4355 0.5384 l
0.4371 0.5375 l
0.4386 0.5366 l
0.4402 0.5357 l
0.4418 0.5348 l
0.4433 0.5339 l
0.4449 0.5330 l
0.4465 0.5321 l
0.4480 0.5313 l
0.4496 0.5304 l
0.4512 0.5295 l
0.4527 0.5286 l
0.4543 0.5278 l
0.4559 0.5269 l
0.4575 0.5260 l
0.4590 0.5251 l
0.4606 0.5242 l
0.4622 0.5232 l
0.4637 0.5223 l
0.4653 0.5212 l
0.4669 0.5202 l
0.4684 0.5190 l
0.4700 0.5176 l
0.4716 0.5153 l
0.4731 0.5135 l
0.4747 0.5120 l
0.4763 0.5105 l
0.4778 0.5091 l
0.4794 0.5077 l
0.4810 0.5063 l
0.4825 0.5050 l
0.4841 0.5037 l
0.4857 0.5024 l
0.4873 0.5011 l
0.4888 0.4998 l
0.4904 0.4985 l
0.4920 0.4972 l
0.4935 0.4960 l
0.4951 0.4947 l
0.4967 0.4934 l
0.4982 0.4922 l
0.4998 0.4909 l
0.5014 0.4897 l
0.5029 0.4885 l
0.5045 0.4872 l
0.5061 0.4860 l
0.5076 0.4848 l
0.5092 0.4835 l
0.5108 0.4823 l
0.5124 0.4811 l
0.5139 0.4798 l
0.5155 0.4786 l
0.5171 0.4774 l
0.5186 0.4762 l
0.5202 0.4749 l
0.5218 0.4737 l
0.5233 0.4725 l
0.5249 0.4712 l
0.5265 0.4700 l
0.5280 0.4687 l
0.5296 0.4675 l
0.5312 0.4662 l
0.5327 0.4649 l
0.5343 0.4636 l
0.5359 0.4623 l
0.5375 0.4610 l
0.5390 0.4598 l
0.5406 0.4585 l
0.5422 0.4572 l
0.5437 0.4560 l
0.5453 0.4547 l
0.5469 0.4534 l
0.5484 0.4522 l
0.5502 0.4507 l
0.5516 0.4495 l
0.5531 0.4482 l
0.5547 0.4469 l
0.5563 0.4455 l
0.5578 0.4442 l
0.5594 0.4428 l
0.5610 0.4414 l
0.5625 0.4401 l
0.5641 0.4387 l
0.5657 0.4373 l
0.5673 0.4359 l
0.5688 0.4344 l
0.5704 0.4324 l
0.5720 0.4308 l
0.5735 0.4293 l
0.5751 0.4278 l
0.5767 0.4264 l
0.5782 0.4250 l
0.5798 0.4236 l
0.5814 0.4222 l
0.5829 0.4208 l
0.5845 0.4195 l
0.5861 0.4181 l
0.5876 0.4168 l
0.5892 0.4155 l
0.5908 0.4142 l
0.5924 0.4128 l
0.5939 0.4115 l
0.5955 0.4102 l
0.5971 0.4089 l
0.5986 0.4076 l
0.6002 0.4063 l
0.6018 0.4050 l
0.6033 0.4037 l
0.6049 0.4025 l
0.6065 0.4012 l
0.6080 0.3999 l
0.6096 0.3986 l
0.6112 0.3973 l
0.6127 0.3960 l
0.6143 0.3947 l
0.6159 0.3934 l
0.6175 0.3921 l
0.6190 0.3908 l
0.6206 0.3895 l
0.6222 0.3882 l
0.6237 0.3869 l
0.6253 0.3856 l
0.6269 0.3842 l
0.6284 0.3829 l
0.6300 0.3816 l
0.6316 0.3802 l
0.6331 0.3788 l
0.6347 0.3774 l
0.6363 0.3760 l
0.6378 0.3746 l
0.6394 0.3731 l
0.6410 0.3717 l
0.6425 0.3702 l
0.6441 0.3686 l
0.6457 0.3670 l
0.6473 0.3653 l
0.6488 0.3636 l
0.6504 0.3617 l
0.6520 0.3597 l
0.6535 0.3573 l
0.6551 0.3541 l
0.6567 0.3457 l
0.6582 0.3434 l
0.6598 0.3412 l
0.6614 0.3391 l
0.6629 0.3373 l
0.6645 0.3356 l
0.6661 0.3339 l
0.6676 0.3324 l
0.6692 0.3309 l
0.6708 0.3295 l
0.6724 0.3281 l
0.6739 0.3267 l
0.6755 0.3254 l
0.6771 0.3242 l
0.6786 0.3229 l
0.6802 0.3217 l
0.6818 0.3206 l
0.6833 0.3194 l
0.6849 0.3183 l
0.6865 0.3172 l
0.6880 0.3161 l
0.6896 0.3150 l
0.6912 0.3140 l
0.6927 0.3130 l
0.6943 0.3120 l
0.6959 0.3110 l
0.6975 0.3100 l
0.6990 0.3090 l
0.7006 0.3081 l
0.7022 0.3072 l
0.7037 0.3062 l
0.7053 0.3053 l
0.7069 0.3044 l
0.7084 0.3036 l
0.7100 0.3027 l
0.7116 0.3018 l
0.7131 0.3010 l
0.7147 0.3001 l
0.7163 0.2993 l
0.7178 0.2985 l
0.7194 0.2977 l
0.7210 0.2969 l
0.7225 0.2961 l
0.7241 0.2953 l
0.7257 0.2945 l
0.7273 0.2937 l
0.7288 0.2930 l
0.7304 0.2922 l
0.7320 0.2915 l
0.7335 0.2907 l
0.7351 0.2900 l
0.7367 0.2892 l
0.7382 0.2885 l
0.7398 0.2878 l
0.7414 0.2870 l
0.7429 0.2863 l
0.7445 0.2855 l
0.7461 0.2848 l
0.7476 0.2840 l
0.7492 0.2833 l
0.7508 0.2825 l
0.7524 0.2816 l
0.7539 0.2807 l
0.7555 0.2797 l
0.7571 0.2784 l
0.7586 0.2738 l
0.7602 0.2759 l
0.7618 0.2756 l
0.7633 0.2752 l
0.7649 0.2748 l
0.7665 0.2745 l
0.7680 0.2741 l
0.7696 0.2737 l
0.7712 0.2734 l
0.7727 0.2730 l
0.7743 0.2727 l
0.7759 0.2724 l
0.7775 0.2721 l
0.7790 0.2718 l
0.7806 0.2716 l
0.7822 0.2713 l
0.7837 0.2711 l
0.7853 0.2708 l
0.7869 0.2706 l
0.7884 0.2704 l
0.7900 0.2702 l
0.7916 0.2700 l
0.7931 0.2698 l
0.7947 0.2696 l
0.7963 0.2695 l
0.7978 0.2693 l
0.7994 0.2692 l
0.8010 0.2690 l
0.8025 0.2689 l
0.8041 0.2688 l
0.8057 0.2687 l
0.8073 0.2686 l
0.8088 0.2685 l
0.8104 0.2684 l
0.8120 0.2683 l
0.8135 0.2683 l
0.8151 0.2682 l
0.8167 0.2682 l
0.8182 0.2681 l
0.8198 0.2681 l
0.8214 0.2681 l
0.8229 0.2681 l
0.8245 0.2680 l
0.8261 0.2680 l
0.8276 0.2681 l
0.8292 0.2681 l
0.8308 0.2681 l
0.8324 0.2681 l
0.8339 0.2682 l
0.8355 0.2682 l
0.8371 0.2683 l
0.8386 0.2683 l
0.8402 0.2684 l
0.8418 0.2685 l
0.8433 0.2685 l
0.8449 0.2686 l
0.8465 0.2687 l
0.8480 0.2689 l
0.8496 0.2690 l
0.8512 0.2762 l
0.8527 0.2764 l
0.8543 0.2766 l
0.8559 0.2767 l
0.8575 0.2769 l
0.8590 0.2770 l
0.8606 0.2772 l
0.8622 0.2773 l
0.8637 0.2775 l
0.8653 0.2776 l
0.8669 0.2778 l
0.8684 0.2779 l
0.8700 0.2781 l
0.8716 0.2782 l
0.8731 0.2783 l
0.8747 0.2785 l
0.8763 0.2786 l
0.8778 0.2787 l
0.8794 0.2789 l
0.8810 0.2790 l
0.8825 0.2791 l
0.8841 0.2793 l
0.8857 0.2794 l
0.8873 0.2795 l
0.8888 0.2797 l
0.8904 0.2798 l
0.8920 0.2799 l
0.8935 0.2800 l
0.8951 0.2802 l
0.8967 0.2803 l
0.8982 0.2804 l
0.8998 0.2806 l
0.9014 0.2807 l
0.9029 0.2808 l
0.9045 0.2809 l
0.9061 0.2811 l
0.9076 0.2812 l
0.9092 0.2813 l
0.9108 0.2815 l
0.9124 0.2816 l
0.9139 0.2817 l
0.9155 0.2818 l
0.9171 0.2820 l
0.9186 0.2821 l
0.9202 0.2822 l
0.9218 0.2823 l
0.9233 0.2825 l
0.9249 0.2826 l
0.9265 0.2827 l
0.9280 0.2829 l
0.9296 0.2830 l
0.9312 0.2831 l
0.9327 0.2832 l
0.9343 0.2834 l
0.9359 0.2835 l
0.9375 0.2836 l
0.9390 0.2837 l
0.9406 0.2839 l
0.9422 0.2840 l
0.9437 0.2841 l
0.9453 0.2843 l
0.9469 0.2844 l
0.9484 0.2845 l
0.9500 0.2846 l
s
[/DeviceRGB] SCS
Color1 SC
[] 0 SD
0.0015 SLW
n
0.1971 0.1500 m
0.1971 0.1600 l
s
n
0.1971 0.9000 m
0.1971 0.8900 l
s
n
0.2284 0.1500 m
0.2284 0.1600 l
s
n
0.2284 0.9000 m
0.2284 0.8900 l
s
n
0.2598 0.1500 m
0.2598 0.1600 l
s
n
0.2598 0.9000 m
0.2598 0.8900 l
s
n
0.2912 0.1500 m
0.2912 0.1600 l
s
n
0.2912 0.9000 m
0.2912 0.8900 l
s
n
0.3539 0.1500 m
0.3539 0.1600 l
s
n
0.3539 0.9000 m
0.3539 0.8900 l
s
n
0.3853 0.1500 m
0.3853 0.1600 l
s
n
0.3853 0.9000 m
0.3853 0.8900 l
s
n
0.4167 0.1500 m
0.4167 0.1600 l
s
n
0.4167 0.9000 m
0.4167 0.8900 l
s
n
0.4480 0.1500 m
0.4480 0.1600 l
s
n
0.4480 0.9000 m
0.4480 0.8900 l
s
n
0.5108 0.1500 m
0.5108 0.1600 l
s
n
0.5108 0.9000 m
0.5108 0.8900 l
s
n
0.5422 0.1500 m
0.5422 0.1600 l
s
n
0.5422 0.9000 m
0.5422 0.8900 l
s
n
0.5735 0.1500 m
0.5735 0.1600 l
s
n
0.5735 0.9000 m
0.5735 0.8900 l
s
n
0.6049 0.1500 m
0.6049 0.1600 l
s
n
0.6049 0.9000 m
0.6049 0.8900 l
s
n
0.6676 0.1500 m
0.6676 0.1600 l
s
n
0.6676 0.9000 m
0.6676 0.8900 l
s
n
0.6990 0.1500 m
0.6990 0.1600 l
s
n
0.6990 0.9000 m
0.6990 0.8900 l
s
n
0.7304 0.1500 m
0.7304 0.1600 l
s
n
0.7304 0.9000 m
0.7304 0.8900 l
s
n
0.7618 0.1500 m
0.7618 0.1600 l
s
n
0.7618 0.9000 m
0.7618 0.8900 l
s
n
0.8245 0.1500 m
0.8245 0.1600 l
s
n
0.8245 0.9000 m
0.8245 0.8900 l
s
n
0.8559 0.1500 m
0.8559 0.1600 l
s
n
0.8559 0.9000 m
0.8559 0.8900 l
s
n
0.8873 0.1500 m
0.8873 0.1600 l
s
n
0.8873 0.9000 m
0.8873 0.8900 l
s
n
0.9186 0.1500 m
0.9186 0.1600 l
s
n
0.9186 0.9000 m
0.9186 0.8900 l
s
n
0.1657 0.1500 m
0.1657 0.1700 l
s
n
0.1657 0.9000 m
0.1657 0.8800 l
s
n
0.3225 0.1500 m
0.3225 0.1700 l
s
n
0.3225 0.9000 m
0.3225 0.8800 l
s
n
0.4794 0.1500 m
0.4794 0.1700 l
s
n
0.4794 0.9000 m
0.4794 0.8800 l
s
n
0.6363 0.1500 m
0.6363 0.1700 l
s
n
0.6363 0.9000 m
0.6363 0.8800 l
s
n
0.7931 0.1500 m
0.7931 0.1700 l
s
n
0.7931 0.9000 m
0.7931 0.8800 l
s
n
0.9500 0.1500 m
0.9500 0.1700 l
s
n
0.9500 0.9000 m
0.9500 0.8800 l
s
/Helvetica findfont
dup length dict begin
 {1 index /FID ne {def} {pop pop} ifelse} forall
 /Encoding DefEncoding def
 currentdict
end
/Font4 exch definefont pop
/Font4 FFSF
0.1431 0.1200 m
GS
[0.0280 0.0000 0.0000 0.0280 0 0] CC
(100) show
GR
/Font4 FFSF
0.3000 0.1200 m
GS
[0.0280 0.0000 0.0000 0.0280 0 0] CC
(200) show
GR
/Font4 FFSF
0.4569 0.1200 m
GS
[0.0280 0.0000 0.0000 0.0280 0 0] CC
(300) show
GR
/Font4 FFSF
0.6137 0.1200 m
GS
[0.0280 0.0000 0.0000 0.0280 0 0] CC
(400) show
GR
/Font4 FFSF
0.7706 0.1200 m
GS
[0.0280 0.0000 0.0000 0.0280 0 0] CC
(500) show
GR
/Font4 FFSF
0.9275 0.1200 m
GS
[0.0280 0.0000 0.0000 0.0280 0 0] CC
(600) show
GR
/Font4 FFSF
0.4818 0.0845 m
GS
[0.0336 0.0000 0.0000 0.0336 0 0] CC
(M) show
GR
/Font4 FFSF
0.5096 0.0711 m
GS
[0.0238 0.0000 0.0000 0.0238 0 0] CC
(A) show
GR
/Font4 FFSF
0.5253 0.0845 m
GS
[0.0336 0.0000 0.0000 0.0336 0 0] CC
( [GeV]) show
GR
n
0.1500 0.2064 m
0.1600 0.2064 l
s
n
0.9500 0.2064 m
0.9400 0.2064 l
s
n
0.1500 0.2395 m
0.1600 0.2395 l
s
n
0.9500 0.2395 m
0.9400 0.2395 l
s
n
0.1500 0.2629 m
0.1600 0.2629 l
s
n
0.9500 0.2629 m
0.9400 0.2629 l
s
n
0.1500 0.2811 m
0.1600 0.2811 l
s
n
0.9500 0.2811 m
0.9400 0.2811 l
s
n
0.1500 0.2959 m
0.1600 0.2959 l
s
n
0.9500 0.2959 m
0.9400 0.2959 l
s
n
0.1500 0.3085 m
0.1600 0.3085 l
s
n
0.9500 0.3085 m
0.9400 0.3085 l
s
n
0.1500 0.3193 m
0.1600 0.3193 l
s
n
0.9500 0.3193 m
0.9400 0.3193 l
s
n
0.1500 0.3289 m
0.1600 0.3289 l
s
n
0.9500 0.3289 m
0.9400 0.3289 l
s
n
0.1500 0.3375 m
0.1600 0.3375 l
s
n
0.9500 0.3375 m
0.9400 0.3375 l
s
n
0.1500 0.3939 m
0.1600 0.3939 l
s
n
0.9500 0.3939 m
0.9400 0.3939 l
s
n
0.1500 0.4270 m
0.1600 0.4270 l
s
n
0.9500 0.4270 m
0.9400 0.4270 l
s
n
0.1500 0.4504 m
0.1600 0.4504 l
s
n
0.9500 0.4504 m
0.9400 0.4504 l
s
n
0.1500 0.4686 m
0.1600 0.4686 l
s
n
0.9500 0.4686 m
0.9400 0.4686 l
s
n
0.1500 0.4834 m
0.1600 0.4834 l
s
n
0.9500 0.4834 m
0.9400 0.4834 l
s
n
0.1500 0.4960 m
0.1600 0.4960 l
s
n
0.9500 0.4960 m
0.9400 0.4960 l
s
n
0.1500 0.5068 m
0.1600 0.5068 l
s
n
0.9500 0.5068 m
0.9400 0.5068 l
s
n
0.1500 0.5164 m
0.1600 0.5164 l
s
n
0.9500 0.5164 m
0.9400 0.5164 l
s
n
0.1500 0.5250 m
0.1600 0.5250 l
s
n
0.9500 0.5250 m
0.9400 0.5250 l
s
n
0.1500 0.5814 m
0.1600 0.5814 l
s
n
0.9500 0.5814 m
0.9400 0.5814 l
s
n
0.1500 0.6145 m
0.1600 0.6145 l
s
n
0.9500 0.6145 m
0.9400 0.6145 l
s
n
0.1500 0.6379 m
0.1600 0.6379 l
s
n
0.9500 0.6379 m
0.9400 0.6379 l
s
n
0.1500 0.6561 m
0.1600 0.6561 l
s
n
0.9500 0.6561 m
0.9400 0.6561 l
s
n
0.1500 0.6709 m
0.1600 0.6709 l
s
n
0.9500 0.6709 m
0.9400 0.6709 l
s
n
0.1500 0.6835 m
0.1600 0.6835 l
s
n
0.9500 0.6835 m
0.9400 0.6835 l
s
n
0.1500 0.6943 m
0.1600 0.6943 l
s
n
0.9500 0.6943 m
0.9400 0.6943 l
s
n
0.1500 0.7039 m
0.1600 0.7039 l
s
n
0.9500 0.7039 m
0.9400 0.7039 l
s
n
0.1500 0.7125 m
0.1600 0.7125 l
s
n
0.9500 0.7125 m
0.9400 0.7125 l
s
n
0.1500 0.7689 m
0.1600 0.7689 l
s
n
0.9500 0.7689 m
0.9400 0.7689 l
s
n
0.1500 0.8020 m
0.1600 0.8020 l
s
n
0.9500 0.8020 m
0.9400 0.8020 l
s
n
0.1500 0.8254 m
0.1600 0.8254 l
s
n
0.9500 0.8254 m
0.9400 0.8254 l
s
n
0.1500 0.8436 m
0.1600 0.8436 l
s
n
0.9500 0.8436 m
0.9400 0.8436 l
s
n
0.1500 0.8584 m
0.1600 0.8584 l
s
n
0.9500 0.8584 m
0.9400 0.8584 l
s
n
0.1500 0.8710 m
0.1600 0.8710 l
s
n
0.9500 0.8710 m
0.9400 0.8710 l
s
n
0.1500 0.8818 m
0.1600 0.8818 l
s
n
0.9500 0.8818 m
0.9400 0.8818 l
s
n
0.1500 0.8914 m
0.1600 0.8914 l
s
n
0.9500 0.8914 m
0.9400 0.8914 l
s
n
0.1500 0.9000 m
0.1600 0.9000 l
s
n
0.9500 0.9000 m
0.9400 0.9000 l
s
n
0.1500 0.1500 m
0.1700 0.1500 l
s
n
0.9500 0.1500 m
0.9300 0.1500 l
s
n
0.1500 0.3375 m
0.1700 0.3375 l
s
n
0.9500 0.3375 m
0.9300 0.3375 l
s
n
0.1500 0.5250 m
0.1700 0.5250 l
s
n
0.9500 0.5250 m
0.9300 0.5250 l
s
n
0.1500 0.7125 m
0.1700 0.7125 l
s
n
0.9500 0.7125 m
0.9300 0.7125 l
s
n
0.1500 0.9000 m
0.1700 0.9000 l
s
n
0.9500 0.9000 m
0.9300 0.9000 l
s
/Font4 FFSF
0.0922 0.1349 m
GS
[0.0280 0.0000 0.0000 0.0280 0 0] CC
(10) show
GR
/Font4 FFSF
0.1231 0.1517 m
GS
[0.0198 0.0000 0.0000 0.0198 0 0] CC
(-4) show
GR
/Font4 FFSF
0.0922 0.3224 m
GS
[0.0280 0.0000 0.0000 0.0280 0 0] CC
(10) show
GR
/Font4 FFSF
0.1231 0.3392 m
GS
[0.0198 0.0000 0.0000 0.0198 0 0] CC
(-3) show
GR
/Font4 FFSF
0.0922 0.5099 m
GS
[0.0280 0.0000 0.0000 0.0280 0 0] CC
(10) show
GR
/Font4 FFSF
0.1231 0.5267 m
GS
[0.0198 0.0000 0.0000 0.0198 0 0] CC
(-2) show
GR
/Font4 FFSF
0.0957 0.6974 m
GS
[0.0280 0.0000 0.0000 0.0280 0 0] CC
(10) show
GR
/Font4 FFSF
0.1267 0.7142 m
GS
[0.0198 0.0000 0.0000 0.0198 0 0] CC
(-1) show
GR
/Font4 FFSF
0.0988 0.8849 m
GS
[0.0280 0.0000 0.0000 0.0280 0 0] CC
(10) show
GR
/Font4 FFSF
0.1298 0.9017 m
GS
[0.0198 0.0000 0.0000 0.0198 0 0] CC
(0) show
GR
/Font4 FFSF
0.0751 0.4797 m
GS
[0.0000 0.0336 -0.0336 0.0000 0 0] CC
(BR\(H\)) show
GR
n
0.1500 0.1500 m
0.1500 0.9000 l
0.9500 0.9000 l
0.9500 0.1500 l
0.1500 0.1500 l
c
s
n
0.7000 0.5500 m
0.7000 0.3037 l
0.9319 0.3037 l
0.9319 0.5500 l
c
[/DeviceRGB] SCS
Color0 SC
fill
[/DeviceRGB] SCS
Color1 SC
n
0.7000 0.5500 m
0.7000 0.3037 l
0.9319 0.3037 l
0.9319 0.5500 l
0.7000 0.5500 l
c
s
/Font4 FFSF
0.7862 0.4935 m
GS
[0.0224 0.0000 0.0000 0.0224 0 0] CC
(BR\(H -> tt\)) show
GR
[/DeviceRGB] SCS
Color2 SC
[] 0 SD
0.0045 SLW
n
0.7122 0.4994 m
0.7722 0.4994 l
s
/Font4 FFSF
[/DeviceRGB] SCS
Color1 SC
0.7862 0.4524 m
GS
[0.0224 0.0000 0.0000 0.0224 0 0] CC
(BR\(H -> bb\)) show
GR
[/DeviceRGB] SCS
Color3 SC
n
0.7122 0.4582 m
0.7722 0.4582 l
s
/Font4 FFSF
[/DeviceRGB] SCS
Color1 SC
0.7862 0.4112 m
GS
[0.0224 0.0000 0.0000 0.0224 0 0] CC
(BR\(H -> ) show
GR
/Symbol findfont
/Font12 exch definefont pop
/Font12 FFSF
0.8741 0.4112 m
GS
[0.0224 0.0000 0.0000 0.0224 0 0] CC
(tt) show
GR
/Font4 FFSF
0.8937 0.4112 m
GS
[0.0224 0.0000 0.0000 0.0224 0 0] CC
(\)) show
GR
[/DeviceRGB] SCS
Color4 SC
n
0.7122 0.4171 m
0.7722 0.4171 l
s
/Font4 FFSF
[/DeviceRGB] SCS
Color1 SC
0.7862 0.3700 m
GS
[0.0224 0.0000 0.0000 0.0224 0 0] CC
(BR\(H -> ) show
GR
/Font12 FFSF
0.8741 0.3700 m
GS
[0.0224 0.0000 0.0000 0.0224 0 0] CC
(mm) show
GR
/Font4 FFSF
0.9000 0.3700 m
GS
[0.0224 0.0000 0.0000 0.0224 0 0] CC
(\)) show
GR
[/DeviceRGB] SCS
Color5 SC
n
0.7122 0.3757 m
0.7722 0.3757 l
s
/Font4 FFSF
[/DeviceRGB] SCS
Color1 SC
0.7862 0.3284 m
GS
[0.0224 0.0000 0.0000 0.0224 0 0] CC
(BR\(H -> WW\)) show
GR
[/DeviceRGB] SCS
Color6 SC
n
0.7122 0.3343 m
0.7722 0.3343 l
s
/Font4 FFSF
[/DeviceRGB] SCS
Color1 SC
0.9700 0.7000 m
GS
[0.0000 0.0168 -0.0168 0.0000 0 0] CC
(LHC Higgs XS WG 2013) show
GR
/Font4 FFSF
0.7150 0.5250 m
GS
[0.0224 0.0000 0.0000 0.0224 0 0] CC
(m) show
GR
/Font4 FFSF
0.7338 0.5160 m
GS
[0.0158 0.0000 0.0000 0.0158 0 0] CC
(h) show
GR
/Font4 FFSF
0.7425 0.5384 m
GS
[0.0158 0.0000 0.0000 0.0158 0 0] CC
(mod+) show
GR
/Font4 FFSF
0.7825 0.5250 m
GS
[0.0224 0.0000 0.0000 0.0224 0 0] CC
(, tan) show
GR
/Font12 FFSF
0.8260 0.5250 m
GS
[0.0224 0.0000 0.0000 0.0224 0 0] CC
(b) show
GR
/Font4 FFSF
0.8381 0.5250 m
GS
[0.0224 0.0000 0.0000 0.0224 0 0] CC
( = 10) show
GR
%%Trailer
%%BoundingBox: 30 42 597 562
%%DocumentNeededResources: font Helvetica
%%+ font Symbol
%%EOF
