%!PS-Adobe-2.0 EPSF-2.0
%%BoundingBox:  0 0 567 547
%%Title: mww_allp_m1000.eps: Compare
%%Creator: ROOT Version 5.32/02
%%CreationDate: Thu Mar 28 14:57:57 2013
%%EndComments
%%BeginProlog
80 dict begin
/s {stroke} def /l {lineto} def /m {moveto} def /t {translate} def
/r {rotate} def /rl {roll}  def /R {repeat} def
/d {rlineto} def /rm {rmoveto} def /gr {grestore} def /f {eofill} def
/c {setrgbcolor} def /black {0 setgray} def /sd {setdash} def
/cl {closepath} def /sf {scalefont setfont} def /lw {setlinewidth} def
/box {m dup 0 exch d exch 0 d 0 exch neg d cl} def
/NC{systemdict begin initclip end}def/C{NC box clip newpath}def
/bl {box s} def /bf {box f} def /Y { 0 exch d} def /X { 0 d} def 
/K {{pop pop 0 moveto} exch kshow} bind def
/ita {/ang 15 def gsave [1 0 ang dup sin exch cos div 1 0 0] concat} def 
/mp {newpath /y exch def /x exch def} def
/side {[w .77 mul w .23 mul] .385 w mul sd w 0 l currentpoint t -144 r} def
/mr {mp x y w2 0 360 arc} def /m24 {mr s} def /m20 {mr f} def
/mb {mp x y w2 add m w2 neg 0 d 0 w neg d w 0 d 0 w d cl} def
/mt {mp x y w2 add m w2 neg w neg d w 0 d cl} def
/m21 {mb f} def /m25 {mb s} def /m22 {mt f} def /m26{mt s} def
/m23 {mp x y w2 sub m w2 w d w neg 0 d cl f} def
/m27 {mp x y w2 add m w3 neg w2 neg d w3 w2 neg d w3 w2 d cl s} def
/m28 {mp x w2 sub y w2 sub w3 add m w3 0 d  0 w3 neg d w3 0 d 0 w3 d w3 0 d  0 w3 d w3 neg 0 d 0 w3 d w3 neg 0 d 0 w3 neg d w3 neg 0 d cl s } def
/m29 {mp gsave x w2 sub y w2 add w3 sub m currentpoint t 4 {side} repeat cl fill gr} def
/m30 {mp gsave x w2 sub y w2 add w3 sub m currentpoint t 4 {side} repeat cl s gr} def
/m31 {mp x y w2 sub m 0 w d x w2 sub y m w 0 d x w2 sub y w2 add m w w neg d x w2 sub y w2 sub m w w d s} def
/m32 {mp x y w2 sub m w2 w d w neg 0 d cl s} def
/m33 {mp x y w2 add m w3 neg w2 neg d w3 w2 neg d w3 w2 d cl f} def
/m34 {mp x w2 sub y w2 sub w3 add m w3 0 d  0 w3 neg d w3 0 d 0 w3 d w3 0 d  0 w3 d w3 neg 0 d 0 w3 d w3 neg 0 d 0 w3 neg d w3 neg 0 d cl f } def
/m2 {mp x y w2 sub m 0 w d x w2 sub y m w 0 d s} def
/m5 {mp x w2 sub y w2 sub m w w d x w2 sub y w2 add m w w neg d s} def
/reEncode {exch findfont dup length dict begin {1 index /FID eq  {pop pop} {def} ifelse } forall /Encoding exch def currentdict end dup /FontName get exch definefont pop } def [/Times-Bold /Times-Italic /Times-BoldItalic /Helvetica /Helvetica-Oblique
 /Helvetica-Bold /Helvetica-BoldOblique /Courier /Courier-Oblique /Courier-Bold /Courier-BoldOblique /Times-Roman /AvantGarde-Book /AvantGarde-BookOblique /AvantGarde-Demi /AvantGarde-DemiOblique /Bookman-Demi /Bookman-DemiItalic /Bookman-Light
 /Bookman-LightItalic /Helvetica-Narrow /Helvetica-Narrow-Bold /Helvetica-Narrow-BoldOblique /Helvetica-Narrow-Oblique /NewCenturySchlbk-Roman /NewCenturySchlbk-Bold /NewCenturySchlbk-BoldItalic /NewCenturySchlbk-Italic /Palatino-Bold
 /Palatino-BoldItalic /Palatino-Italic /Palatino-Roman ] {ISOLatin1Encoding reEncode } forall%%EndProlog
%%BeginSetup
%%EndSetup
newpath  gsave  .25 .25 scale  gsave  0 0 t black[  ] 0 sd 3 lw 1 1 1 c 2268 2190 0 0 bf black 1 1 1 c 2222 1511 23 657 bf black 1 1 1 c 1756 1405 378 687 bf black 1756 1405 378 687 bl 0 1 0 c 6 lw 1 1 1 c black 0 1 0 c 378 1986 m 176 X -184 Y 175 X
 -158 Y 176 X -138 Y 176 X -135 Y 175 X -115 Y 176 X -117 Y 175 X -107 Y 176 X -98 Y 175 X -131 Y 176 X s black 3 lw 378 687 m 1756 X s 378 723 m -36 Y s 422 705 m -18 Y s 466 705 m -18 Y s 510 705 m -18 Y s 554 723 m -36 Y s 598 705 m -18 Y s 642
 705 m -18 Y s 685 705 m -18 Y s 729 723 m -36 Y s 773 705 m -18 Y s 817 705 m -18 Y s 861 705 m -18 Y s 905 723 m -36 Y s 949 705 m -18 Y s 993 705 m -18 Y s 1037 705 m -18 Y s 1081 723 m -36 Y s 1124 705 m -18 Y s 1168 705 m -18 Y s 1212 705 m -18
 Y s 1256 723 m -36 Y s 1300 705 m -18 Y s 1344 705 m -18 Y s 1388 705 m -18 Y s 1432 723 m -36 Y s 1476 705 m -18 Y s 1519 705 m -18 Y s 1563 705 m -18 Y s 1607 723 m -36 Y s 1651 705 m -18 Y s 1695 705 m -18 Y s 1739 705 m -18 Y s 1783 723 m -36 Y
 s 1827 705 m -18 Y s 1871 705 m -18 Y s 1914 705 m -18 Y s 1958 723 m -36 Y s 2002 705 m -18 Y s 2046 705 m -18 Y s 2090 705 m -18 Y s 2134 723 m -36 Y s 378 2092 m 1756 X s 378 2056 m 36 Y s 422 2074 m 18 Y s 466 2074 m 18 Y s 510 2074 m 18 Y s 554
 2056 m 36 Y s 598 2074 m 18 Y s 642 2074 m 18 Y s 685 2074 m 18 Y s 729 2056 m 36 Y s 773 2074 m 18 Y s 817 2074 m 18 Y s 861 2074 m 18 Y s 905 2056 m 36 Y s 949 2074 m 18 Y s 993 2074 m 18 Y s 1037 2074 m 18 Y s 1081 2056 m 36 Y s 1124 2074 m 18 Y
 s 1168 2074 m 18 Y s 1212 2074 m 18 Y s 1256 2056 m 36 Y s 1300 2074 m 18 Y s 1344 2074 m 18 Y s 1388 2074 m 18 Y s 1432 2056 m 36 Y s 1476 2074 m 18 Y s 1519 2074 m 18 Y s 1563 2074 m 18 Y s 1607 2056 m 36 Y s 1651 2074 m 18 Y s 1695 2074 m 18 Y s
 1739 2074 m 18 Y s 1783 2056 m 36 Y s 1827 2074 m 18 Y s 1871 2074 m 18 Y s 1914 2074 m 18 Y s 1958 2056 m 36 Y s 2002 2074 m 18 Y s 2046 2074 m 18 Y s 2090 2074 m 18 Y s 2134 2056 m 36 Y s 378 687 m 1405 Y s
 gsave  2222 1511 23 657 C 267.173 1808.31 t 90 r /Helvetica findfont 48.945 sf 0 0 m (/dM [pb/GeV]) show NC gr 
 gsave  2222 1511 23 657 C 267.173 1778.98 t 90 r /Symbol findfont 48.945 sf 0 0 m (s) show NC gr 
 gsave  2222 1511 23 657 C 267.173 1752.92 t 90 r /Helvetica findfont 48.945 sf 0 0 m (d) show NC gr  409 801 m -31 X s 409 869 m -31 X s 409 917 m -31 X s 409 954 m -31 X s 409 984 m -31 X s 409 1010 m -31 X s 409 1032 m -31 X s 409 1052 m -31 X s
 440 1069 m -62 X s
 gsave  2222 1511 23 657 C 329.08 1071.95 t 0 r /Helvetica findfont 32.63 sf 0 0 m (\2559) show NC gr 
 gsave  2222 1511 23 657 C 276.948 1049.14 t 0 r /Helvetica findfont 48.945 sf 0 0 m (10) show NC gr  409 1185 m -31 X s 409 1252 m -31 X s 409 1300 m -31 X s 409 1337 m -31 X s 409 1368 m -31 X s 409 1393 m -31 X s 409 1416 m -31 X s 409 1435 m -31
 X s 440 1453 m -62 X s
 gsave  2222 1511 23 657 C 329.08 1453.16 t 0 r /Helvetica findfont 32.63 sf 0 0 m (\2558) show NC gr 
 gsave  2222 1511 23 657 C 276.948 1430.36 t 0 r /Helvetica findfont 48.945 sf 0 0 m (10) show NC gr  409 1568 m -31 X s 409 1636 m -31 X s 409 1684 m -31 X s 409 1721 m -31 X s 409 1751 m -31 X s 409 1777 m -31 X s 409 1799 m -31 X s 409 1819 m -31
 X s 440 1836 m -62 X s
 gsave  2222 1511 23 657 C 329.08 1834.37 t 0 r /Helvetica findfont 32.63 sf 0 0 m (\2557) show NC gr 
 gsave  2222 1511 23 657 C 276.948 1814.82 t 0 r /Helvetica findfont 48.945 sf 0 0 m (10) show NC gr  409 1952 m -31 X s 409 2019 m -31 X s 409 2067 m -31 X s 2134 687 m 1405 Y s 2103 801 m 31 X s 2103 869 m 31 X s 2103 917 m 31 X s 2103 954 m 31 X s
 2103 984 m 31 X s 2103 1010 m 31 X s 2103 1032 m 31 X s 2103 1052 m 31 X s 2072 1069 m 62 X s 2103 1185 m 31 X s 2103 1252 m 31 X s 2103 1300 m 31 X s 2103 1337 m 31 X s 2103 1368 m 31 X s 2103 1393 m 31 X s 2103 1416 m 31 X s 2103 1435 m 31 X s
 2072 1453 m 62 X s 2103 1568 m 31 X s 2103 1636 m 31 X s 2103 1684 m 31 X s 2103 1721 m 31 X s 2103 1751 m 31 X s 2103 1777 m 31 X s 2103 1799 m 31 X s 2103 1819 m 31 X s 2072 1836 m 62 X s 2103 1952 m 31 X s 2103 2019 m 31 X s 2103 2067 m 31 X s 1
 0 0 c[ 4 8] 0 sd 6 lw 1 1 1 c black 1 0 0 c 378 1976 m 176 X -183 Y 175 X -157 Y 176 X -122 Y 176 X -119 Y 175 X -104 Y 176 X -112 Y 175 X -94 Y 176 X -91 Y 175 X -134 Y 176 X s 0 0 1 c[ 20 20] 0 sd 1 1 1 c black 0 0 1 c 378 1976 m 176 X -183 Y 175
 X -159 Y 176 X -143 Y 176 X -137 Y 175 X -114 Y 176 X -115 Y 175 X -107 Y 176 X -97 Y 175 X -129 Y 176 X s black[  ] 0 sd 3 lw 0.95 0.95 0.95 c 444 302 1534 1684 bf black 1534 1684 m 444 X s 1978 1684 m 302 Y s 1978 1986 m -444 X s 1534 1986 m -302
 Y s
 gsave  2222 1511 23 657 C 1642.14 1922.35 t 0 r /Helvetica-Bold findfont 42.419 sf 0 0 m (Fixed width) show NC gr  0 1 0 c 6 lw 1551 1936 m 77 X s black
 gsave  2222 1511 23 657 C 1642.14 1824.6 t 0 r /Helvetica-Bold findfont 42.419 sf 0 0 m (Naive prop.) show NC gr  1 0 0 c[ 4 8] 0 sd 1551 1835 m 77 X s black
 gsave  2222 1511 23 657 C 1642.14 1720.34 t 0 r /Helvetica-Bold findfont 42.419 sf 0 0 m 
 290 276 254 231 208 183 171 148 126 114 100 78 55 41 27
(Effective descr.) K NC gr  0 0 1 c[ 20 20] 0 sd 1551 1735 m 77 X s black
 gsave  2222 1511 23 657 C 2199.29 1752.92 t 90 r /Helvetica-BoldOblique findfont 29.367 sf 0 0 m (LHC HIGGS XS WG 2013) show NC gr [  ] 0 sd 3 lw 1 1 1 c 2222 635 23 22 bf black 1 1 1 c 1756 514 378 130 bf black 1756 514 378 130 bl 1 1 1 c 1756 514
 378 130 bf black 1756 514 378 130 bl 1 0 0 c[ 4 8] 0 sd 6 lw 1 1 1 c black 1 0 0 c 378 188 m 176 X 4 Y 175 X 5 Y 176 X 81 Y 176 X 99 Y 175 X 68 Y 176 X 42 Y 175 X 86 Y 176 X 50 Y 175 X -11 Y 176 X s black[  ] 0 sd 3 lw 378 130 m 1756 X s
 gsave  2222 635 23 22 C 1834.37 39.0986 t 0 r /Helvetica findfont 45.8219 sf 0 0 m ( M\(WW\) [GeV]) show NC gr  378 145 m -15 Y s 422 137 m -7 Y s 466 137 m -7 Y s 510 137 m -7 Y s 554 145 m -15 Y s 598 137 m -7 Y s 642 137 m -7 Y s 685 137 m -7 Y s
 729 145 m -15 Y s 773 137 m -7 Y s 817 137 m -7 Y s 861 137 m -7 Y s 905 145 m -15 Y s 949 137 m -7 Y s 993 137 m -7 Y s 1037 137 m -7 Y s 1081 145 m -15 Y s 1124 137 m -7 Y s 1168 137 m -7 Y s 1212 137 m -7 Y s 1256 145 m -15 Y s 1300 137 m -7 Y s
 1344 137 m -7 Y s 1388 137 m -7 Y s 1432 145 m -15 Y s 1476 137 m -7 Y s 1519 137 m -7 Y s 1563 137 m -7 Y s 1607 145 m -15 Y s 1651 137 m -7 Y s 1695 137 m -7 Y s 1739 137 m -7 Y s 1783 145 m -15 Y s 1827 137 m -7 Y s 1871 137 m -7 Y s 1914 137 m
 -7 Y s 1958 145 m -15 Y s 2002 137 m -7 Y s 2046 137 m -7 Y s 2090 137 m -7 Y s 2134 145 m -15 Y s
 gsave  2222 635 23 22 C 325.821 91.23 t 0 r /Helvetica findfont 45.8219 sf 0 0 m (1000) show NC gr 
 gsave  2222 635 23 22 C 498.507 91.23 t 0 r /Helvetica findfont 45.8219 sf 0 0 m (1200) show NC gr 
 gsave  2222 635 23 22 C 674.45 91.23 t 0 r /Helvetica findfont 45.8219 sf 0 0 m (1400) show NC gr 
 gsave  2222 635 23 22 C 850.394 91.23 t 0 r /Helvetica findfont 45.8219 sf 0 0 m (1600) show NC gr 
 gsave  2222 635 23 22 C 1026.34 91.23 t 0 r /Helvetica findfont 45.8219 sf 0 0 m (1800) show NC gr 
 gsave  2222 635 23 22 C 1202.28 91.23 t 0 r /Helvetica findfont 45.8219 sf 0 0 m (2000) show NC gr 
 gsave  2222 635 23 22 C 1378.22 91.23 t 0 r /Helvetica findfont 45.8219 sf 0 0 m (2200) show NC gr 
 gsave  2222 635 23 22 C 1554.17 91.23 t 0 r /Helvetica findfont 45.8219 sf 0 0 m (2400) show NC gr 
 gsave  2222 635 23 22 C 1730.11 91.23 t 0 r /Helvetica findfont 45.8219 sf 0 0 m (2600) show NC gr 
 gsave  2222 635 23 22 C 1906.05 91.23 t 0 r /Helvetica findfont 45.8219 sf 0 0 m (2800) show NC gr 
 gsave  2222 635 23 22 C 2078.74 91.23 t 0 r /Helvetica findfont 45.8219 sf 0 0 m (3000) show NC gr  378 644 m 1756 X s 378 629 m 15 Y s 422 637 m 7 Y s 466 637 m 7 Y s 510 637 m 7 Y s 554 629 m 15 Y s 598 637 m 7 Y s 642 637 m 7 Y s 685 637 m 7 Y s
 729 629 m 15 Y s 773 637 m 7 Y s 817 637 m 7 Y s 861 637 m 7 Y s 905 629 m 15 Y s 949 637 m 7 Y s 993 637 m 7 Y s 1037 637 m 7 Y s 1081 629 m 15 Y s 1124 637 m 7 Y s 1168 637 m 7 Y s 1212 637 m 7 Y s 1256 629 m 15 Y s 1300 637 m 7 Y s 1344 637 m 7 Y
 s 1388 637 m 7 Y s 1432 629 m 15 Y s 1476 637 m 7 Y s 1519 637 m 7 Y s 1563 637 m 7 Y s 1607 629 m 15 Y s 1651 637 m 7 Y s 1695 637 m 7 Y s 1739 637 m 7 Y s 1783 629 m 15 Y s 1827 637 m 7 Y s 1871 637 m 7 Y s 1914 637 m 7 Y s 1958 629 m 15 Y s 2002
 637 m 7 Y s 2046 637 m 7 Y s 2090 637 m 7 Y s 2134 629 m 15 Y s 378 130 m 514 Y s 432 148 m -54 X s 405 166 m -27 X s 405 184 m -27 X s 405 202 m -27 X s 405 220 m -27 X s 432 238 m -54 X s 405 256 m -27 X s 405 274 m -27 X s 405 292 m -27 X s 405
 310 m -27 X s 432 328 m -54 X s 405 346 m -27 X s 405 364 m -27 X s 405 382 m -27 X s 405 400 m -27 X s 432 418 m -54 X s 405 436 m -27 X s 405 454 m -27 X s 405 472 m -27 X s 405 490 m -27 X s 432 508 m -54 X s 405 526 m -27 X s 405 544 m -27 X s
 405 562 m -27 X s 405 580 m -27 X s 432 598 m -54 X s 432 148 m -54 X s 405 130 m -27 X s 432 598 m -54 X s 405 616 m -27 X s 405 634 m -27 X s
 gsave  2222 635 23 22 C 293.239 130.329 t 0 r /Helvetica findfont 45.8219 sf 0 0 m (\2550.1) show NC gr 
 gsave  2222 635 23 22 C 338.854 221.559 t 0 r /Helvetica findfont 45.8219 sf 0 0 m (0) show NC gr 
 gsave  2222 635 23 22 C 309.53 309.53 t 0 r /Helvetica findfont 45.8219 sf 0 0 m (0.1) show NC gr 
 gsave  2222 635 23 22 C 303.014 400.76 t 0 r /Helvetica findfont 45.8219 sf 0 0 m (0.2) show NC gr 
 gsave  2222 635 23 22 C 303.014 488.732 t 0 r /Helvetica findfont 45.8219 sf 0 0 m (0.3) show NC gr 
 gsave  2222 635 23 22 C 303.014 579.962 t 0 r /Helvetica findfont 45.8219 sf 0 0 m (0.4) show NC gr  2134 130 m 514 Y s 2080 148 m 54 X s 2107 166 m 27 X s 2107 184 m 27 X s 2107 202 m 27 X s 2107 220 m 27 X s 2080 238 m 54 X s 2107 256 m 27 X s
 2107 274 m 27 X s 2107 292 m 27 X s 2107 310 m 27 X s 2080 328 m 54 X s 2107 346 m 27 X s 2107 364 m 27 X s 2107 382 m 27 X s 2107 400 m 27 X s 2080 418 m 54 X s 2107 436 m 27 X s 2107 454 m 27 X s 2107 472 m 27 X s 2107 490 m 27 X s 2080 508 m 54 X
 s 2107 526 m 27 X s 2107 544 m 27 X s 2107 562 m 27 X s 2107 580 m 27 X s 2080 598 m 54 X s 2080 148 m 54 X s 2107 130 m 27 X s 2080 598 m 54 X s 2107 616 m 27 X s 2107 634 m 27 X s 0 0 1 c[ 20 20] 0 sd 6 lw 1 1 1 c black 0 0 1 c 378 186 m 176 X 1 Y
 175 X 1 Y 176 X -29 Y 176 X -6 Y 175 X 3 Y 176 X 10 Y 175 X 1 Y 176 X 4 Y 175 X 11 Y 176 X s black[  12 12 ] 0 sd 0.95 0.95 0.95 c black 387 238 m 860 X s 1247 238 m 861 X s 2108 238 m 17 X s 1 1 1 c black
 gsave  2222 635 23 22 C 707.032 491.99 t 0 r /Helvetica findfont 72.0058 sf 0 0 m ([O\255O\(fixw\)]/O\(fixw\)) show NC gr 
 gr  gr showpage
end
%%EOF
