%!PS-Adobe-2.0 EPSF-2.0
%%BoundingBox:  0 0 567 544
%%Title: HWW_900_Mll_NNLO_cut_YR3.eps: HWW 900Gev Mll NNLO with cuts
%%Creator: ROOT Version 5.34/05
%%CreationDate: Fri Jun 14 04:49:36 2013
%%EndComments
%%BeginProlog
80 dict begin
/s {stroke} def /l {lineto} def /m {moveto} def /t {translate} def
/r {rotate} def /rl {roll}  def /R {repeat} def
/d {rlineto} def /rm {rmoveto} def /gr {grestore} def /f {eofill} def
/c {setrgbcolor} def /black {0 setgray} def /sd {setdash} def
/cl {closepath} def /sf {scalefont setfont} def /lw {setlinewidth} def
/box {m dup 0 exch d exch 0 d 0 exch neg d cl} def
/NC{systemdict begin initclip end}def/C{NC box clip newpath}def
/bl {box s} def /bf {box f} def /Y { 0 exch d} def /X { 0 d} def 
/K {{pop pop 0 moveto} exch kshow} bind def
/ita {/ang 15 def gsave [1 0 ang dup sin exch cos div 1 0 0] concat} def 
/mp {newpath /y exch def /x exch def} def
/side {[w .77 mul w .23 mul] .385 w mul sd w 0 l currentpoint t -144 r} def
/mr {mp x y w2 0 360 arc} def /m24 {mr s} def /m20 {mr f} def
/mb {mp x y w2 add m w2 neg 0 d 0 w neg d w 0 d 0 w d cl} def
/mt {mp x y w2 add m w2 neg w neg d w 0 d cl} def
/m21 {mb f} def /m25 {mb s} def /m22 {mt f} def /m26{mt s} def
/m23 {mp x y w2 sub m w2 w d w neg 0 d cl f} def
/m27 {mp x y w2 add m w3 neg w2 neg d w3 w2 neg d w3 w2 d cl s} def
/m28 {mp x w2 sub y w2 sub w3 add m w3 0 d  0 w3 neg d w3 0 d 0 w3 d w3 0 d  0 w3 d w3 neg 0 d 0 w3 d w3 neg 0 d 0 w3 neg d w3 neg 0 d cl s } def
/m29 {mp gsave x w2 sub y w2 add w3 sub m currentpoint t 4 {side} repeat cl fill gr} def
/m30 {mp gsave x w2 sub y w2 add w3 sub m currentpoint t 4 {side} repeat cl s gr} def
/m31 {mp x y w2 sub m 0 w d x w2 sub y m w 0 d x w2 sub y w2 add m w w neg d x w2 sub y w2 sub m w w d s} def
/m32 {mp x y w2 sub m w2 w d w neg 0 d cl s} def
/m33 {mp x y w2 add m w3 neg w2 neg d w3 w2 neg d w3 w2 d cl f} def
/m34 {mp x w2 sub y w2 sub w3 add m w3 0 d  0 w3 neg d w3 0 d 0 w3 d w3 0 d  0 w3 d w3 neg 0 d 0 w3 d w3 neg 0 d 0 w3 neg d w3 neg 0 d cl f } def
/m2 {mp x y w2 sub m 0 w d x w2 sub y m w 0 d s} def
/m5 {mp x w2 sub y w2 sub m w w d x w2 sub y w2 add m w w neg d s} def
/reEncode {exch findfont dup length dict begin {1 index /FID eq  {pop pop} {def} ifelse } forall /Encoding exch def currentdict end dup /FontName get exch definefont pop } def [/Times-Bold /Times-Italic /Times-BoldItalic /Helvetica /Helvetica-Oblique
 /Helvetica-Bold /Helvetica-BoldOblique /Courier /Courier-Oblique /Courier-Bold /Courier-BoldOblique /Times-Roman /AvantGarde-Book /AvantGarde-BookOblique /AvantGarde-Demi /AvantGarde-DemiOblique /Bookman-Demi /Bookman-DemiItalic /Bookman-Light
 /Bookman-LightItalic /Helvetica-Narrow /Helvetica-Narrow-Bold /Helvetica-Narrow-BoldOblique /Helvetica-Narrow-Oblique /NewCenturySchlbk-Roman /NewCenturySchlbk-Bold /NewCenturySchlbk-BoldItalic /NewCenturySchlbk-Italic /Palatino-Bold
 /Palatino-BoldItalic /Palatino-Italic /Palatino-Roman ] {ISOLatin1Encoding reEncode } forall
%%EndProlog
%%BeginSetup
%%EndSetup
newpath  gsave  .25 .25 scale  gsave  0 0 t black[  ] 0 sd 3 lw 1 1 1 c 2268 2177 0 0 bf black 1 1 1 c 2222 2133 23 22 bf black 1 1 1 c 1778 1706 245 235 bf black 1778 1706 245 235 bl 0.8 0 0.8 c 1 1 1 c 1 0 1 c 0.8 0 0.8 c 245 239 m 4 X 2 Y 5 X 9 Y
 4 X 2 Y 5 X -6 Y 4 X 24 Y 5 X 8 Y 4 X -4 Y 4 X 31 Y 5 X -7 Y 4 X -9 Y 5 X 30 Y 4 X -17 Y 5 X 20 Y 4 X 13 Y 5 X 20 Y 4 X -2 Y 4 X 12 Y 5 X -15 Y 4 X 30 Y 5 X 45 Y 4 X -16 Y 5 X 24 Y 4 X 24 Y 5 X 4 Y 4 X -15 Y 4 X 46 Y 5 X 27 Y 4 X 12 Y 5 X 22 Y 4 X
 10 Y 5 X 22 Y 4 X 8 Y 5 X 86 Y 4 X -26 Y 4 X 65 Y 5 X -29 Y 4 X 36 Y 5 X 27 Y 4 X 63 Y 5 X -11 Y 4 X 26 Y 5 X 10 Y 4 X 51 Y 4 X -1 Y 5 X 33 Y 4 X 61 Y 5 X 39 Y 4 X 38 Y 5 X -43 Y 4 X 9 Y 5 X 90 Y 4 X 67 Y 4 X -64 Y 5 X 24 Y 4 X 58 Y 5 X -25 Y 4 X 24
 Y 5 X 78 Y 4 X -5 Y 5 X 33 Y 8 X 84 Y 5 X -58 Y 4 X 42 Y 5 X 50 Y 4 X 30 Y 5 X 28 Y 4 X -43 Y 5 X 60 Y 4 X -28 Y 4 X 4 Y 5 X 39 Y 4 X 11 Y 5 X 1 Y 4 X 26 Y 5 X 88 Y 4 X -38 Y 5 X -7 Y 4 X 15 Y 4 X 40 Y 5 X -42 Y 4 X 29 Y 5 X 11 Y 4 X 41 Y 5 X -4 Y 4
 X 25 Y 5 X -14 Y 4 X -36 Y 4 X 76 Y 5 X 12 Y 4 X -18 Y 5 X -17 Y 4 X 56 Y 5 X 15 Y 4 X -39 Y 5 X 85 Y 4 X -86 Y 4 X 49 Y 5 X -15 Y 4 X 20 Y 9 X -27 Y 5 X 69 Y 4 X -63 Y 5 X 60 Y 4 X -30 Y 4 X 16 Y 5 X -14 Y 9 X 49 Y 4 X -59 Y 5 X 54 Y 4 X -52 Y 5 X
 25 Y 4 X 33 Y 5 X -55 Y 4 X 4 Y 4 X -28 Y 5 X 15 Y 4 X -4 Y 5 X -37 Y 4 X 55 Y 5 X -18 Y 4 X 48 Y 5 X -56 Y 4 X 20 Y 4 X 12 Y 5 X -35 Y 4 X -51 Y 5 X 46 Y 4 X -2 Y 5 X -13 Y 4 X -1 Y 5 X -13 Y 4 X 6 Y 4 X -19 Y 5 X -20 Y 4 X -7 Y 9 X 12 Y 5 X -14 Y
 4 X -8 Y 5 X -2 Y 4 X -31 Y 4 X 24 Y 5 X -29 Y 4 X 20 Y 5 X -47 Y 4 X 8 Y 5 X -23 Y 4 X 11 Y 5 X -13 Y 4 X -42 Y 4 X 15 Y 5 X -4 Y 4 X -24 Y 5 X -42 Y 4 X 17 Y 5 X 10 Y 4 X 15 Y 5 X -44 Y 4 X 7 Y 4 X -15 Y 5 X -19 Y 4 X 37 Y 5 X -38 Y 4 X -27 Y 5 X
 4 Y 4 X -12 Y 5 X 6 Y 4 X -13 Y 4 X -5 Y 5 X -34 Y 4 X -25 Y 5 X -4 Y 4 X 23 Y 5 X 15 Y 4 X -15 Y 5 X -40 Y 4 X 8 Y 4 X -29 Y 5 X 9 Y 4 X -47 Y 5 X 9 Y 4 X -18 Y 5 X 16 Y 4 X -31 Y 5 X -10 Y 4 X -19 Y 4 X 16 Y 5 X -6 Y 4 X -22 Y 5 X -24 Y 4 X 16 Y 5
 X 5 Y 4 X -13 Y 5 X -20 Y 4 X -24 Y 4 X -11 Y 9 X -11 Y 5 X 6 Y 4 X -16 Y 5 X -14 Y 4 X -19 Y 5 X -11 Y 4 X -3 Y 4 X -16 Y 5 X 8 Y 4 X -11 Y 5 X -22 Y 4 X -6 Y 5 X -16 Y 9 X 3 Y 4 X -31 Y 4 X 9 Y 5 X -12 Y 4 X -6 Y 5 X -7 Y 4 X -9 Y 5 X -18 Y 4 X 5
 Y 5 X -24 Y 4 X -9 Y 4 X -3 Y 5 X 2 Y 4 X -23 Y 5 X 5 Y 4 X -13 Y 5 X -17 Y 4 X 5 Y 5 X -27 Y 4 X 6 Y 4 X -18 Y 5 X 4 Y 4 X -11 Y 5 X -1 Y 4 X -23 Y 5 X 9 Y 4 X -10 Y 5 X -20 Y 4 X 13 Y 9 X -21 Y 4 X -15 Y 5 X -3 Y 4 X -1 Y 5 X -22 Y 4 X 4 Y 5 X -23
 Y 4 X 9 Y 4 X -21 Y 9 X 17 Y 5 X -28 Y 4 X -7 Y 5 X -1 Y 4 X -18 Y 5 X 7 Y 4 X -2 Y 4 X -25 Y 5 X -10 Y 4 X 3 Y 5 X -1 Y 4 X -11 Y 5 X 3 Y 4 X 1 Y 5 X -11 Y 4 X -25 Y 4 X 2 Y 5 X -8 Y 4 X -3 Y 9 X -8 Y 5 X -7 Y 4 X -10 Y 5 X 11 Y 4 X -24 Y 4 X 5 Y 5
 X -2 Y 4 X -12 Y 5 X -5 Y 4 X -8 Y 5 X 2 Y 4 X -14 Y 5 X -2 Y 4 X -6 Y 4 X -3 Y 5 X 5 Y 4 X -17 Y 5 X -9 Y 4 X 1 Y 5 X -1 Y 4 X -4 Y 5 X -10 Y 4 X -1 Y 4 X -3 Y 5 X -4 Y 4 X -4 Y 5 X -8 Y 4 X -6 Y 5 X -3 Y 4 X -6 Y 5 X 5 Y 4 X -11 Y 4 X -2 Y 5 X -1
 Y 4 X -3 Y 5 X -10 Y 4 X -4 Y 5 X -3 Y 4 X 4 Y 5 X -5 Y 4 X -4 Y 4 X -7 Y 5 X -2 Y 4 X -6 Y 9 X -10 Y 5 X 1 Y 4 X -2 Y 5 X -2 Y 4 X -8 Y 4 X 1 Y 5 X -5 Y 4 X -5 Y 5 X 3 Y 4 X -5 Y 5 X -3 Y 4 X -2 Y 5 X 2 Y 4 X -10 Y 9 X -7 Y 4 X 2 Y 5 X -1 Y 9 X -5
 Y 4 X -5 Y 5 X -1 Y 4 X -1 Y 4 X -3 Y 5 X -5 Y 4 X -2 Y 5 X -2 Y 4 X -3 Y 5 X -1 Y 4 X -3 Y 5 X 1 Y 4 X -2 Y 4 X -2 Y 5 X -6 Y 4 X 1 Y 5 X -3 Y 4 X 3 Y 5 X -4 Y 4 X -2 Y 5 X -3 Y 4 X 1 Y 4 X -4 Y 5 X -1 Y 4 X -1 Y 5 X -4 Y 4 X 2 Y 5 X -3 Y 4 X 1 Y 5
 X -2 Y 4 X -3 Y 4 X -2 Y 9 X -2 Y 5 X -2 Y 4 X -2 Y 14 X -3 Y 8 X -3 Y 9 X -1 Y 9 X -1 Y 5 X -3 Y 9 X 1 Y 4 X -3 Y 4 X -1 Y 9 X -2 Y 9 X -1 Y 5 X -1 Y 4 X -1 Y 5 X -2 Y 4 X 1 Y 4 X -1 Y 5 X -1 Y 9 X s black 245 235 m 1778 X s
 gsave  2222 2133 23 22 C 2001.82 79.7689 t 0 r /Helvetica findfont 45.6261 sf 0 0 m (ll) show NC gr 
 gsave  2222 2133 23 22 C 1948.64 98.7615 t 0 r /Helvetica findfont 68.4392 sf 0 0 m (M) show NC gr  245 286 m -51 Y s 289 261 m -26 Y s 334 261 m -26 Y s 378 261 m -26 Y s 423 261 m -26 Y s 467 286 m -51 Y s 512 261 m -26 Y s 556 261 m -26 Y s 600
 261 m -26 Y s 645 261 m -26 Y s 689 286 m -51 Y s 734 261 m -26 Y s 778 261 m -26 Y s 823 261 m -26 Y s 867 261 m -26 Y s 912 286 m -51 Y s 956 261 m -26 Y s 1001 261 m -26 Y s 1045 261 m -26 Y s 1089 261 m -26 Y s 1134 286 m -51 Y s 1178 261 m -26
 Y s 1223 261 m -26 Y s 1267 261 m -26 Y s 1312 261 m -26 Y s 1356 286 m -51 Y s 1401 261 m -26 Y s 1445 261 m -26 Y s 1489 261 m -26 Y s 1534 261 m -26 Y s 1578 286 m -51 Y s 1623 261 m -26 Y s 1667 261 m -26 Y s 1712 261 m -26 Y s 1756 261 m -26 Y
 s 1801 286 m -51 Y s 1845 261 m -26 Y s 1889 261 m -26 Y s 1934 261 m -26 Y s 1978 261 m -26 Y s 2023 286 m -51 Y s
 gsave  2222 2133 23 22 C 224.113 167.135 t 0 r /Helvetica findfont 68.4392 sf 0 0 m (0) show NC gr 
 gsave  2222 2133 23 22 C 406.442 167.135 t 0 r /Helvetica findfont 68.4392 sf 0 0 m (100) show NC gr 
 gsave  2222 2133 23 22 C 630.554 167.135 t 0 r /Helvetica findfont 68.4392 sf 0 0 m (200) show NC gr 
 gsave  2222 2133 23 22 C 850.869 167.135 t 0 r /Helvetica findfont 68.4392 sf 0 0 m (300) show NC gr 
 gsave  2222 2133 23 22 C 1074.98 167.135 t 0 r /Helvetica findfont 68.4392 sf 0 0 m (400) show NC gr 
 gsave  2222 2133 23 22 C 1299.09 167.135 t 0 r /Helvetica findfont 68.4392 sf 0 0 m (500) show NC gr 
 gsave  2222 2133 23 22 C 1519.41 167.135 t 0 r /Helvetica findfont 68.4392 sf 0 0 m (600) show NC gr 
 gsave  2222 2133 23 22 C 1743.52 167.135 t 0 r /Helvetica findfont 68.4392 sf 0 0 m (700) show NC gr 
 gsave  2222 2133 23 22 C 1963.83 167.135 t 0 r /Helvetica findfont 68.4392 sf 0 0 m (800) show NC gr  245 235 m 1706 Y s
 gsave  2222 2133 23 22 C 102.56 1177.54 t 90 r /Helvetica findfont 45.6261 sf 0 0 m (ll) show NC gr 
 gsave  2222 2133 23 22 C 75.9704 1063.59 t 90 r /Helvetica findfont 68.4392 sf 0 0 m (/dM) show NC gr 
 gsave  2222 2133 23 22 C 75.9704 1021.8 t 90 r /Symbol findfont 68.4392 sf 0 0 m (s) show NC gr 
 gsave  2222 2133 23 22 C 75.9704 987.615 t 90 r /Helvetica findfont 68.4392 sf 0 0 m (d) show NC gr  298 235 m -53 X s 272 287 m -27 X s 272 339 m -27 X s 272 390 m -27 X s 298 442 m -53 X s 272 494 m -27 X s 272 545 m -27 X s 272 597 m -27 X s 298
 649 m -53 X s 272 701 m -27 X s 272 752 m -27 X s 272 804 m -27 X s 298 856 m -53 X s 272 907 m -27 X s 272 959 m -27 X s 272 1011 m -27 X s 298 1063 m -53 X s 272 1114 m -27 X s 272 1166 m -27 X s 272 1218 m -27 X s 298 1270 m -53 X s 272 1321 m
 -27 X s 272 1373 m -27 X s 272 1425 m -27 X s 298 1476 m -53 X s 272 1528 m -27 X s 272 1580 m -27 X s 272 1632 m -27 X s 298 1683 m -53 X s 272 1735 m -27 X s 272 1787 m -27 X s 272 1839 m -27 X s 298 1890 m -53 X s 298 1890 m -53 X s
 gsave  2222 2133 23 22 C 208.919 220.314 t 0 r /Helvetica findfont 38.0218 sf 0 0 m (0) show NC gr 
 gsave  2222 2133 23 22 C 113.956 429.233 t 0 r /Helvetica findfont 38.0218 sf 0 0 m (0.0002) show NC gr 
 gsave  2222 2133 23 22 C 113.956 634.353 t 0 r /Helvetica findfont 38.0218 sf 0 0 m (0.0004) show NC gr 
 gsave  2222 2133 23 22 C 113.956 843.271 t 0 r /Helvetica findfont 38.0218 sf 0 0 m (0.0006) show NC gr 
 gsave  2222 2133 23 22 C 113.956 1048.39 t 0 r /Helvetica findfont 38.0218 sf 0 0 m (0.0008) show NC gr 
 gsave  2222 2133 23 22 C 144.344 1257.31 t 0 r /Helvetica findfont 38.0218 sf 0 0 m (0.001) show NC gr 
 gsave  2222 2133 23 22 C 113.956 1462.43 t 0 r /Helvetica findfont 38.0218 sf 0 0 m (0.0012) show NC gr 
 gsave  2222 2133 23 22 C 113.956 1671.35 t 0 r /Helvetica findfont 38.0218 sf 0 0 m (0.0014) show NC gr 
 gsave  2222 2133 23 22 C 113.956 1876.47 t 0 r /Helvetica findfont 38.0218 sf 0 0 m (0.0016) show NC gr  0.8 0 0.8 c 1 0 1 c /w 2 def /w2 {w 2 div} def /w3 {w 3 div} def 247 239 m20 252 241 m20 256 250 m20 260 252 m20 265 246 m20 269 270 m20 274 278
 m20 278 274 m20 283 305 m20 287 298 m20 292 289 m20 296 319 m20 300 302 m20 305 322 m20 309 335 m20 314 355 m20 318 353 m20 323 365 m20 327 350 m20 332 380 m20 336 425 m20 340 409 m20 345 433 m20 349 457 m20 354 461 m20 358 446 m20 363 492 m20 367
 519 m20 372 531 m20 376 553 m20 380 563 m20 385 585 m20 389 593 m20 394 679 m20 398 653 m20 403 718 m20 407 689 m20 412 725 m20 416 752 m20 420 815 m20 425 804 m20 429 830 m20 434 840 m20 438 891 m20 443 890 m20 447 923 m20 452 984 m20 456 1023 m20
 460 1061 m20 465 1018 m20 469 1027 m20 474 1117 m20 478 1184 m20 483 1120 m20 487 1144 m20 492 1202 m20 496 1177 m20 500 1201 m20 505 1279 m20 509 1274 m20 514 1307 m20 518 1307 m20 523 1391 m20 527 1333 m20 532 1375 m20 536 1425 m20 540 1455 m20
 545 1483 m20 549 1440 m20 554 1500 m20 558 1472 m20 563 1476 m20 567 1515 m20 572 1526 m20 576 1527 m20 580 1553 m20 585 1641 m20 589 1603 m20 594 1596 m20 598 1611 m20 603 1651 m20 607 1609 m20 612 1638 m20 616 1649 m20 620 1690 m20 625 1686 m20
 629 1711 m20 634 1697 m20 638 1661 m20 643 1737 m20 647 1749 m20 652 1731 m20 656 1714 m20 660 1770 m20 665 1785 m20 669 1746 m20 674 1831 m20 678 1745 m20 683 1794 m20 687 1779 m20 692 1799 m20 696 1799 m20 700 1772 m20 705 1841 m20 709 1778 m20
 714 1838 m20 718 1808 m20 723 1824 m20 727 1810 m20 732 1810 m20 736 1859 m20 741 1800 m20 745 1854 m20 749 1802 m20 754 1827 m20 758 1860 m20 763 1805 m20 767 1809 m20 772 1781 m20 776 1796 m20 781 1792 m20 785 1755 m20 789 1810 m20 794 1792 m20
 798 1840 m20 803 1784 m20 807 1804 m20 812 1816 m20 816 1781 m20 821 1730 m20 825 1776 m20 829 1774 m20 834 1761 m20 838 1760 m20 843 1747 m20 847 1753 m20 852 1734 m20 856 1714 m20 861 1707 m20 865 1707 m20 869 1719 m20 874 1705 m20 878 1697 m20
 883 1695 m20 887 1664 m20 892 1688 m20 896 1659 m20 901 1679 m20 905 1632 m20 909 1640 m20 914 1617 m20 918 1628 m20 923 1615 m20 927 1573 m20 932 1588 m20 936 1584 m20 941 1560 m20 945 1518 m20 949 1535 m20 954 1545 m20 958 1560 m20 963 1516 m20
 967 1523 m20 972 1508 m20 976 1489 m20 981 1526 m20 985 1488 m20 989 1461 m20 994 1465 m20 998 1453 m20 1003 1459 m20 1007 1446 m20 1012 1441 m20 1016 1407 m20 1021 1382 m20 1025 1378 m20 1029 1401 m20 1034 1416 m20 1038 1401 m20 1043 1361 m20 1047
 1369 m20 1052 1340 m20 1056 1349 m20 1061 1302 m20 1065 1311 m20 1069 1293 m20 1074 1309 m20 1078 1278 m20 1083 1268 m20 1087 1249 m20 1092 1265 m20 1096 1259 m20 1101 1237 m20 1105 1213 m20 1109 1229 m20 1114 1234 m20 1118 1221 m20 1123 1201 m20
 1127 1177 m20 1132 1166 m20 1136 1166 m20 1141 1155 m20 1145 1161 m20 1149 1145 m20 1154 1131 m20 1158 1112 m20 1163 1101 m20 1167 1098 m20 1172 1082 m20 1176 1090 m20 1181 1079 m20 1185 1057 m20 1189 1051 m20 1194 1035 m20 1198 1035 m20 1203 1038
 m20 1207 1007 m20 1212 1016 m20 1216 1004 m20 1221 998 m20 1225 991 m20 1229 982 m20 1234 964 m20 1238 969 m20 1243 945 m20 1247 936 m20 1252 933 m20 1256 935 m20 1261 912 m20 1265 917 m20 1269 904 m20 1274 887 m20 1278 892 m20 1283 865 m20 1287 871
 m20 1292 853 m20 1296 857 m20 1301 846 m20 1305 845 m20 1309 822 m20 1314 831 m20 1318 821 m20 1323 801 m20 1327 814 m20 1332 814 m20 1336 793 m20 1341 778 m20 1345 775 m20 1349 774 m20 1354 752 m20 1358 756 m20 1363 733 m20 1367 742 m20 1372 721
 m20 1376 721 m20 1381 738 m20 1385 710 m20 1389 703 m20 1394 702 m20 1398 684 m20 1403 691 m20 1407 689 m20 1412 664 m20 1416 654 m20 1421 657 m20 1425 656 m20 1429 645 m20 1434 648 m20 1438 649 m20 1443 638 m20 1447 613 m20 1452 615 m20 1456 607
 m20 1461 604 m20 1465 604 m20 1469 596 m20 1474 589 m20 1478 579 m20 1483 590 m20 1487 566 m20 1492 571 m20 1496 569 m20 1501 557 m20 1505 552 m20 1509 544 m20 1514 546 m20 1518 532 m20 1523 530 m20 1527 524 m20 1532 521 m20 1536 526 m20 1541 509
 m20 1545 500 m20 1549 501 m20 1554 500 m20 1558 496 m20 1563 486 m20 1567 485 m20 1572 482 m20 1576 478 m20 1581 474 m20 1585 466 m20 1589 460 m20 1594 457 m20 1598 451 m20 1603 456 m20 1607 445 m20 1612 443 m20 1616 442 m20 1621 439 m20 1625 429
 m20 1629 425 m20 1634 422 m20 1638 426 m20 1643 421 m20 1647 417 m20 1652 410 m20 1656 408 m20 1661 402 m20 1665 402 m20 1669 392 m20 1674 393 m20 1678 391 m20 1683 389 m20 1687 381 m20 1692 382 m20 1696 377 m20 1701 372 m20 1705 375 m20 1709 370
 m20 1714 367 m20 1718 365 m20 1723 367 m20 1727 357 m20 1732 357 m20 1736 350 m20 1741 352 m20 1745 351 m20 1749 351 m20 1754 346 m20 1758 341 m20 1763 340 m20 1767 339 m20 1772 336 m20 1776 331 m20 1781 329 m20 1785 327 m20 1789 324 m20 1794 323
 m20 1798 320 m20 1803 321 m20 1807 319 m20 1812 317 m20 1816 311 m20 1821 312 m20 1825 309 m20 1829 312 m20 1834 308 m20 1838 306 m20 1843 303 m20 1847 304 m20 1852 300 m20 1856 299 m20 1861 298 m20 1865 294 m20 1869 296 m20 1874 293 m20 1878 294
 m20 1883 292 m20 1887 289 m20 1892 287 m20 1896 287 m20 1901 285 m20 1905 283 m20 1909 281 m20 1914 281 m20 1918 281 m20 1923 278 m20 1927 278 m20 1932 275 m20 1936 275 m20 1941 274 m20 1945 274 m20 1949 273 m20 1954 270 m20 1958 270 m20 1963 271
 m20 1967 268 m20 1972 267 m20 1976 267 m20 1981 265 m20 1985 265 m20 1989 264 m20 1994 263 m20 1998 262 m20 2003 260 m20 2007 261 m20 2012 260 m20 2016 259 m20 2021 259 m20 0.8 0 0.8 c black 0.8 0 0.8 c 1 lw << /PatternType 1 /PaintType 2
 /TilingType 1 /BBox [ 0 0 100 100 ] /XStep 100 /YStep 100 /PaintProc { begin gsave 0 0 m 100 100 l 0 100 m 100 0 l s gr end } >> [ 0.24 0 0 0.24 0 0 ] makepattern /P13 exch def /cs {[/Pattern /DeviceRGB] setcolorspace} def /FA {f [/DeviceRGB]
 setcolorspace} def cs 0.8 0 0.8 P13 setcolor 247 241 m 5 3 d 4 10 d 4 3 d 5 -8 d 4 28 d 5 9 d 4 -6 d 5 36 d 4 -9 d 5 -8 d 4 31 d 4 -18 d 5 21 d 4 14 d 5 22 d 4 -2 d 5 12 d 4 -16 d 5 31 d 4 49 d 4 -17 d 5 25 d 4 24 d 5 5 d 4 -18 d 5 50 d 4 28 d 5 12
 d 4 23 d 4 11 d 5 21 d 4 7 d 5 90 d 4 -27 d 5 67 d 4 -32 d 5 38 d 4 28 d 4 65 d 5 -13 d 4 26 d 5 9 d 4 53 d 5 -2 d 4 32 d 5 63 d 4 40 d 4 39 d 5 -45 d 4 7 d 5 94 d 4 67 d 5 -66 d 4 24 d 5 58 d 4 -25 d 4 24 d 5 79 d 4 -4 d 5 32 d 4 -1 d 5 85 d 4 -60
 d 5 43 d 4 50 d 4 31 d 5 29 d 4 -45 d 5 61 d 4 -29 d 5 2 d 4 40 d 5 11 d 4 1 d 4 26 d 5 90 d 4 -38 d 5 -9 d 4 15 d 5 41 d 4 -43 d 5 28 d 4 11 d 4 42 d 5 -5 d 4 25 d 5 -14 d 4 -36 d 5 77 d 4 11 d 5 -17 d 4 -18 d 4 56 d 5 15 d 4 -40 d 5 86 d 4 -87 d 5
 50 d 4 -17 d 5 21 d 4 -1 d 4 -27 d 5 70 d 4 -64 d 5 61 d 4 -30 d 5 15 d 4 -14 d 5 X 4 49 d 5 -60 d 4 54 d 4 -51 d 5 24 d 4 33 d 5 -56 d 4 5 d 5 -29 d 4 15 d 5 -4 d 4 -38 d 4 55 d 5 -18 d 4 49 d 5 -57 d 4 21 d 5 11 d 4 -34 d 5 -53 d 4 47 d 4 -2 d 5
 -14 d 4 -1 d 5 -13 d 4 6 d 5 -19 d 4 -20 d 5 -8 d 4 X 4 13 d 5 -15 d 4 -8 d 5 -2 d 4 -31 d 5 24 d 4 -30 d 5 21 d 4 -48 d 4 8 d 5 -23 d 4 11 d 5 -13 d 4 -43 d 5 15 d 4 -4 d 5 -24 d 4 -43 d 4 18 d 5 10 d 4 14 d 5 -44 d 4 7 d 5 -15 d 4 -19 d 5 37 d 4
 -39 d 4 -27 d 5 4 d 4 -12 d 5 6 d 4 -13 d 5 -5 d 4 -34 d 5 -25 d 4 -5 d 4 23 d 5 15 d 4 -14 d 5 -41 d 4 9 d 5 -30 d 4 9 d 5 -47 d 4 8 d 4 -18 d 5 16 d 4 -31 d 5 -10 d 4 -19 d 5 16 d 4 -6 d 5 -22 d 4 -25 d 4 17 d 5 4 d 4 -12 d 5 -21 d 4 -24 d 5 -11 d
 4 X 5 -11 d 4 5 d 4 -15 d 5 -15 d 4 -18 d 5 -11 d 4 -4 d 5 -16 d 4 8 d 5 -11 d 4 -23 d 4 -6 d 5 -15 d 4 -1 d 5 3 d 4 -30 d 5 8 d 4 -11 d 5 -6 d 4 -8 d 4 -9 d 5 -18 d 4 5 d 5 -25 d 4 -8 d 5 -3 d 4 2 d 5 -24 d 4 5 d 4 -13 d 5 -17 d 4 5 d 5 -27 d 4 5 d
 5 -18 d 4 4 d 5 -11 d 4 -1 d 4 -22 d 5 8 d 4 -10 d 5 -19 d 4 12 d 5 X 4 -21 d 5 -15 d 4 -3 d 4 -1 d 5 -23 d 4 5 d 5 -24 d 4 9 d 5 -21 d 4 1 d 5 17 d 4 -29 d 4 -7 d 5 -1 d 4 -18 d 5 7 d 4 -2 d 5 -25 d 4 -10 d 5 3 d 4 -1 d 4 -11 d 5 2 d 4 2 d 5 -11 d
 4 -25 d 5 1 d 4 -7 d 5 -4 d 4 1 d 4 -9 d 5 -7 d 4 -10 d 5 11 d 4 -24 d 5 4 d 4 -1 d 5 -13 d 4 -4 d 4 -8 d 5 2 d 4 -14 d 5 -3 d 4 -6 d 5 -3 d 4 5 d 5 -17 d 4 -9 d 4 1 d 5 -1 d 4 -4 d 5 -10 d 4 -2 d 5 -3 d 4 -3 d 5 -5 d 4 -7 d 4 -6 d 5 -4 d 4 -6 d 5 5
 d 4 -11 d 5 -1 d 4 -2 d 5 -2 d 4 -11 d 4 -4 d 5 -3 d 4 4 d 5 -5 d 4 -4 d 5 -7 d 4 -2 d 5 -6 d 4 X 4 -11 d 5 2 d 4 -2 d 5 -2 d 4 -8 d 5 X 4 -4 d 5 -5 d 4 2 d 4 -4 d 5 -4 d 4 -2 d 5 2 d 4 -10 d 5 X 4 -7 d 5 2 d 4 -1 d 4 X 5 -5 d 4 -5 d 5 -1 d 4 -1 d 5
 -3 d 4 -5 d 5 -3 d 4 -1 d 4 -3 d 5 -1 d 4 -3 d 5 1 d 4 -3 d 5 -1 d 4 -7 d 5 2 d 4 -3 d 4 3 d 5 -4 d 4 -2 d 5 -3 d 4 1 d 5 -4 d 4 -2 d 5 X 4 -5 d 4 2 d 5 -2 d 4 X 5 -2 d 4 -3 d 5 -2 d 4 X 5 -2 d 4 -2 d 4 -2 d 9 X 5 -3 d 4 X 5 -3 d 4 X 5 -1 d 4 X 4 -1
 d 5 -3 d 4 X 5 1 d 4 -3 d 5 -1 d 4 X 5 -2 d 4 X 4 -2 d 5 X 4 -1 d 5 -2 d 4 1 d 5 -2 d 4 X 5 -1 d -1 Y -5 X -4 1 d -5 1 d -4 -1 d -5 2 d -4 1 d -5 1 d -4 1 d -4 1 d -5 1 d -4 X -5 1 d -4 3 d -5 -1 d -4 X -5 4 d -4 1 d -4 -1 d -5 1 d -4 X -5 3 d -4 X
 -5 3 d -9 X -4 2 d -4 2 d -5 2 d -4 X -5 1 d -4 4 d -5 1 d -4 X -5 3 d -4 -2 d -4 4 d -5 1 d -4 1 d -5 4 d -4 -1 d -5 3 d -4 2 d -5 3 d -4 -2 d -4 2 d -5 -1 d -4 6 d -5 2 d -4 2 d -5 X -4 3 d -5 X -4 3 d -4 2 d -5 2 d -4 5 d -5 3 d -4 1 d -5 1 d -4
 5 d -5 5 d -4 X -4 1 d -5 -2 d -4 7 d -5 X -4 10 d -5 -2 d -4 2 d -5 3 d -4 4 d -4 -2 d -5 5 d -4 4 d -5 X -4 8 d -5 1 d -4 3 d -5 -2 d -4 10 d -4 X -5 6 d -4 3 d -5 6 d -4 4 d -5 5 d -4 -4 d -5 3 d -4 4 d -4 10 d -5 3 d -4 1 d -5 1 d -4 11 d -5 -4
 d -4 5 d -5 4 d -4 5 d -4 8 d -5 4 d -4 4 d -5 3 d -4 1 d -5 10 d -4 4 d -5 1 d -4 -1 d -4 9 d -5 17 d -4 -5 d -5 3 d -4 5 d -5 3 d -4 14 d -5 -2 d -4 8 d -4 4 d -5 12 d -4 2 d -5 -5 d -4 24 d -5 -11 d -4 11 d -5 6 d -4 8 d -4 X -5 3 d -4 8 d -5 -2
 d -4 25 d -5 11 d -4 -2 d -5 -2 d -4 11 d -4 1 d -5 -4 d -4 11 d -5 24 d -4 2 d -5 -7 d -4 18 d -5 1 d -4 7 d -4 28 d -5 -17 d -4 -1 d -5 21 d -4 -9 d -5 24 d -4 -5 d -5 22 d -4 1 d -4 3 d -5 15 d -4 21 d -5 X -4 -13 d -5 19 d -4 10 d -5 -8 d -4 22
 d -4 1 d -5 11 d -4 -4 d -5 18 d -4 -6 d -5 27 d -4 -5 d -5 16 d -4 13 d -4 -5 d -5 24 d -4 -2 d -5 3 d -4 8 d -5 24 d -4 -5 d -5 18 d -4 9 d -4 7 d -5 6 d -4 12 d -5 -9 d -4 30 d -5 -3 d -4 1 d -5 15 d -4 6 d -4 22 d -5 11 d -4 -8 d -5 16 d -4 3 d
 -5 11 d -4 18 d -5 15 d -4 15 d -4 -6 d -5 11 d -4 X -5 11 d -4 24 d -5 20 d -4 12 d -5 -4 d -4 -17 d -4 24 d -5 22 d -4 6 d -5 -16 d -4 19 d -5 10 d -4 30 d -5 -16 d -4 18 d -4 -8 d -5 46 d -4 -9 d -5 29 d -4 -9 d -5 41 d -4 14 d -5 -15 d -4 -23 d
 -4 5 d -5 25 d -4 33 d -5 5 d -4 13 d -5 -6 d -4 11 d -5 -4 d -4 27 d -4 38 d -5 -37 d -4 19 d -5 14 d -4 -7 d -5 44 d -4 -15 d -5 -9 d -4 -17 d -4 42 d -5 23 d -4 4 d -5 -15 d -4 42 d -5 12 d -4 -10 d -5 22 d -4 -8 d -4 47 d -5 -20 d -4 28 d -5 -23
 d -4 30 d -5 2 d -4 7 d -5 15 d -4 -13 d -4 X -5 8 d -4 19 d -5 19 d -4 -5 d -5 11 d -4 1 d -5 13 d -4 2 d -4 -46 d -5 51 d -4 34 d -5 -11 d -4 -21 d -5 56 d -4 -48 d -5 18 d -4 -55 d -4 37 d -5 3 d -4 -14 d -5 28 d -4 -5 d -5 55 d -4 -33 d -5 -25 d
 -4 51 d -4 -53 d -5 58 d -4 -48 d -5 -1 d -4 14 d -5 -16 d -4 29 d -5 -59 d -4 61 d -5 -67 d -4 26 d -4 X -5 -20 d -4 15 d -5 -48 d -4 83 d -5 -84 d -4 39 d -5 -15 d -4 -55 d -4 16 d -5 17 d -4 -11 d -5 -75 d -4 34 d -5 15 d -4 -26 d -5 4 d -4 -41 d
 -4 -11 d -5 -28 d -4 41 d -5 -40 d -4 -14 d -5 5 d -4 38 d -5 -87 d -4 -26 d -4 -1 d -5 -11 d -4 -39 d -5 -4 d -4 26 d -5 -59 d -4 42 d -5 -29 d -4 -29 d -4 -49 d -5 -42 d -4 56 d -5 -83 d -4 1 d -5 -34 d -4 4 d -5 -75 d -4 -24 d -4 23 d -5 -56 d -4
 -25 d -5 62 d -4 -66 d -5 -87 d -4 -10 d -5 40 d -4 -38 d -4 -36 d -5 -60 d -4 -33 d -5 -1 d -4 -50 d -5 -10 d -4 -27 d -5 11 d -4 -61 d -4 -26 d -5 -34 d -4 24 d -5 -62 d -4 24 d -5 -81 d -4 -9 d -5 -23 d -4 -10 d -4 -20 d -5 -11 d -4 -28 d -5 -41
 d -4 12 d -5 -3 d -4 -23 d -5 -23 d -4 13 d -4 -41 d -5 -28 d -4 14 d -5 -12 d -4 2 d -5 -18 d -4 -12 d -5 -19 d -4 16 d -4 -28 d -5 8 d -4 6 d -5 -27 d -4 4 d -5 -8 d -4 -20 d -5 4 d -4 -1 d -4 -8 d -5 -1 d FA 3 lw 0.8 0.8 0 c 1 1 1 c 1 1 0 c 0.8
 0.8 0 c 245 243 m 4 X 13 Y 5 X 29 Y 4 X -17 Y 5 X 14 Y 4 X 25 Y 5 X 25 Y 4 X 7 Y 4 X 32 Y 5 X -10 Y 4 X 13 Y 5 X -11 Y 4 X 17 Y 5 X 26 Y 4 X 3 Y 5 X -3 Y 4 X 29 Y 4 X 3 Y 5 X -25 Y 4 X 27 Y 5 X 22 Y 4 X -12 Y 5 X 32 Y 4 X 9 Y 5 X -20 Y 4 X 8 Y 4 X
 19 Y 5 X -3 Y 4 X -7 Y 5 X 29 Y 4 X 5 Y 5 X -27 Y 4 X 13 Y 5 X 57 Y 4 X -27 Y 4 X 42 Y 5 X -25 Y 4 X 12 Y 5 X 14 Y 4 X 37 Y 5 X -24 Y 4 X 18 Y 5 X 22 Y 4 X 5 Y 4 X -11 Y 5 X 36 Y 4 X 15 Y 5 X 23 Y 4 X 14 Y 5 X -26 Y 4 X 25 Y 5 X 25 Y 4 X 39 Y 4 X
 -36 Y 5 X 11 Y 4 X 36 Y 5 X -15 Y 4 X 13 Y 5 X 41 Y 4 X 1 Y 5 X 20 Y 4 X -2 Y 4 X 48 Y 5 X -29 Y 4 X 23 Y 5 X 27 Y 4 X 18 Y 5 X 17 Y 4 X -19 Y 5 X 32 Y 4 X -14 Y 4 X 7 Y 5 X 23 Y 4 X 7 Y 5 X 3 Y 4 X 15 Y 5 X 49 Y 4 X -18 Y 9 X 10 Y 4 X 22 Y 5 X -20
 Y 4 X 16 Y 5 X 9 Y 4 X 27 Y 5 X -1 Y 4 X 16 Y 5 X -7 Y 4 X -17 Y 4 X 43 Y 5 X 9 Y 4 X -8 Y 5 X -7 Y 4 X 33 Y 5 X 10 Y 4 X -19 Y 5 X 50 Y 4 X -47 Y 4 X 27 Y 5 X -4 Y 4 X 13 Y 5 X 4 Y 4 X -14 Y 5 X 36 Y 4 X -29 Y 5 X 32 Y 4 X -12 Y 4 X 11 Y 5 X -7 Y 4
 X 3 Y 5 X 30 Y 4 X -29 Y 5 X 31 Y 4 X -33 Y 5 X 21 Y 4 X 22 Y 5 X -31 Y 4 X 3 Y 4 X -15 Y 5 X 11 Y 4 X 2 Y 5 X -20 Y 4 X 32 Y 5 X -9 Y 4 X 31 Y 5 X -31 Y 4 X 12 Y 4 X 12 Y 5 X -21 Y 4 X -27 Y 5 X 27 Y 4 X 1 Y 5 X -5 Y 4 X -1 Y 5 X -3 Y 4 X 6 Y 4 X
 -11 Y 5 X -11 Y 4 X -2 Y 5 X 2 Y 4 X 9 Y 5 X -12 Y 4 X 1 Y 5 X 4 Y 4 X -17 Y 4 X 15 Y 5 X -16 Y 4 X 11 Y 5 X -27 Y 4 X 9 Y 5 X -12 Y 4 X 6 Y 5 X -6 Y 4 X -22 Y 4 X 9 Y 9 X -11 Y 5 X -24 Y 4 X 8 Y 5 X 6 Y 4 X 12 Y 5 X -25 Y 4 X 4 Y 4 X -7 Y 5 X -11 Y
 4 X 23 Y 5 X -19 Y 4 X -14 Y 5 X 5 Y 4 X -9 Y 5 X 5 Y 4 X -7 Y 4 X -3 Y 5 X -23 Y 4 X -14 Y 5 X -1 Y 4 X 22 Y 5 X 8 Y 4 X -6 Y 5 X -27 Y 4 X 10 Y 4 X -22 Y 5 X 9 Y 4 X -31 Y 5 X 4 Y 4 X -9 Y 5 X 12 Y 4 X -18 Y 5 X -5 Y 4 X -15 Y 4 X 16 Y 5 X -4 Y 4
 X -13 Y 5 X -14 Y 4 X 11 Y 5 X 3 Y 4 X -9 Y 5 X -11 Y 4 X -17 Y 4 X -6 Y 5 X -1 Y 4 X -5 Y 5 X 9 Y 4 X -10 Y 5 X -14 Y 4 X -12 Y 5 X -4 Y 4 X -2 Y 4 X -16 Y 5 X 12 Y 4 X -6 Y 5 X -18 Y 9 X -8 Y 4 X -5 Y 5 X 11 Y 4 X -26 Y 4 X 9 Y 5 X -11 Y 4 X -1 Y
 5 X -3 Y 4 X -6 Y 5 X -13 Y 4 X 3 Y 5 X -17 Y 4 X -3 Y 4 X -3 Y 5 X 1 Y 4 X -15 Y 5 X 3 Y 4 X -10 Y 5 X -7 Y 9 X -18 Y 4 X 7 Y 4 X -17 Y 5 X 7 Y 4 X -11 Y 5 X 2 Y 4 X -16 Y 5 X 11 Y 4 X -10 Y 5 X -17 Y 4 X 15 Y 4 X -2 Y 5 X -13 Y 4 X -15 Y 5 X -3 Y
 4 X 1 Y 5 X -15 Y 4 X 4 Y 5 X -22 Y 4 X 13 Y 4 X -18 Y 5 X -1 Y 4 X 16 Y 5 X -24 Y 4 X -2 Y 5 X -3 Y 4 X -13 Y 5 X 7 Y 4 X -2 Y 4 X -21 Y 5 X -5 Y 4 X 2 Y 9 X -10 Y 5 X 3 Y 4 X 4 Y 5 X -12 Y 4 X -21 Y 4 X 2 Y 5 X -7 Y 4 X -2 Y 5 X 5 Y 4 X -6 Y 5 X
 -6 Y 4 X -9 Y 5 X 9 Y 4 X -19 Y 4 X 7 Y 5 X -5 Y 4 X -12 Y 5 X 1 Y 4 X -9 Y 5 X -1 Y 4 X -9 Y 5 X -3 Y 4 X -3 Y 4 X -4 Y 5 X 9 Y 4 X -15 Y 5 X -11 Y 4 X 1 Y 5 X -2 Y 4 X 1 Y 5 X -9 Y 4 X -5 Y 4 X 1 Y 5 X -3 Y 4 X -2 Y 5 X -9 Y 4 X -6 Y 5 X -3 Y 4 X
 -3 Y 5 X 5 Y 4 X -11 Y 9 X -3 Y 4 X -2 Y 5 X -9 Y 4 X -4 Y 5 X -4 Y 4 X 7 Y 5 X -5 Y 4 X -5 Y 4 X -5 Y 5 X -3 Y 4 X -3 Y 5 X -2 Y 4 X -11 Y 5 X 5 Y 4 X -3 Y 5 X -3 Y 4 X -8 Y 4 X 1 Y 5 X -5 Y 4 X -4 Y 5 X 3 Y 4 X -3 Y 5 X -5 Y 4 X -1 Y 5 X 3 Y 4 X
 -11 Y 4 X 1 Y 5 X -7 Y 4 X 1 Y 5 X 2 Y 4 X -2 Y 5 X -5 Y 4 X -3 Y 5 X 1 Y 4 X -3 Y 4 X -4 Y 5 X -5 Y 4 X -5 Y 9 X -4 Y 5 X 2 Y 4 X -6 Y 5 X 1 Y 4 X -1 Y 4 X -4 Y 5 X -4 Y 4 X 1 Y 5 X -3 Y 4 X 6 Y 5 X -5 Y 4 X -3 Y 5 X -5 Y 4 X 1 Y 4 X -5 Y 5 X 2 Y 4
 X -3 Y 5 X -3 Y 4 X 2 Y 5 X -2 Y 4 X -2 Y 5 X -1 Y 4 X -4 Y 4 X -1 Y 5 X -1 Y 4 X -1 Y 5 X -3 Y 4 X -1 Y 5 X -1 Y 4 X -1 Y 5 X -3 Y 4 X 1 Y 4 X -6 Y 5 X 2 Y 4 X -1 Y 5 X 2 Y 4 X -1 Y 5 X -7 Y 4 X 1 Y 5 X 2 Y 4 X -3 Y 4 X -1 Y 5 X -1 Y 9 X -3 Y 9 X
 -2 Y 4 X -1 Y 5 X -3 Y 4 X 3 Y 4 X -3 Y 9 X -2 Y 5 X s 1 1 0 c 247 243 m20 252 256 m20 256 285 m20 260 268 m20 265 282 m20 269 307 m20 274 332 m20 278 339 m20 283 371 m20 287 361 m20 292 374 m20 296 363 m20 300 380 m20 305 406 m20 309 409 m20 314
 406 m20 318 435 m20 323 438 m20 327 413 m20 332 440 m20 336 462 m20 340 450 m20 345 482 m20 349 491 m20 354 471 m20 358 479 m20 363 498 m20 367 495 m20 372 488 m20 376 517 m20 380 522 m20 385 495 m20 389 508 m20 394 565 m20 398 538 m20 403 580 m20
 407 555 m20 412 567 m20 416 581 m20 420 618 m20 425 594 m20 429 612 m20 434 634 m20 438 639 m20 443 628 m20 447 664 m20 452 679 m20 456 702 m20 460 716 m20 465 690 m20 469 715 m20 474 740 m20 478 779 m20 483 743 m20 487 754 m20 492 790 m20 496 775
 m20 500 788 m20 505 829 m20 509 830 m20 514 850 m20 518 848 m20 523 896 m20 527 867 m20 532 890 m20 536 917 m20 540 935 m20 545 952 m20 549 933 m20 554 965 m20 558 951 m20 563 958 m20 567 981 m20 572 988 m20 576 991 m20 580 1006 m20 585 1055 m20 589
 1037 m20 594 1037 m20 598 1047 m20 603 1069 m20 607 1049 m20 612 1065 m20 616 1074 m20 620 1101 m20 625 1100 m20 629 1116 m20 634 1109 m20 638 1092 m20 643 1135 m20 647 1144 m20 652 1136 m20 656 1129 m20 660 1162 m20 665 1172 m20 669 1153 m20 674
 1203 m20 678 1156 m20 683 1183 m20 687 1179 m20 692 1192 m20 696 1196 m20 700 1182 m20 705 1218 m20 709 1189 m20 714 1221 m20 718 1209 m20 723 1220 m20 727 1213 m20 732 1216 m20 736 1246 m20 741 1217 m20 745 1248 m20 749 1215 m20 754 1236 m20 758
 1258 m20 763 1227 m20 767 1230 m20 772 1215 m20 776 1226 m20 781 1228 m20 785 1208 m20 789 1240 m20 794 1231 m20 798 1262 m20 803 1231 m20 807 1243 m20 812 1255 m20 816 1234 m20 821 1207 m20 825 1234 m20 829 1235 m20 834 1230 m20 838 1229 m20 843
 1226 m20 847 1232 m20 852 1221 m20 856 1210 m20 861 1208 m20 865 1210 m20 869 1219 m20 874 1207 m20 878 1208 m20 883 1212 m20 887 1195 m20 892 1210 m20 896 1194 m20 901 1205 m20 905 1178 m20 909 1187 m20 914 1175 m20 918 1181 m20 923 1175 m20 927
 1153 m20 932 1162 m20 936 1162 m20 941 1151 m20 945 1127 m20 949 1135 m20 954 1141 m20 958 1153 m20 963 1128 m20 967 1132 m20 972 1125 m20 976 1114 m20 981 1137 m20 985 1118 m20 989 1104 m20 994 1109 m20 998 1100 m20 1003 1105 m20 1007 1098 m20 1012
 1095 m20 1016 1072 m20 1021 1058 m20 1025 1057 m20 1029 1079 m20 1034 1087 m20 1038 1081 m20 1043 1054 m20 1047 1064 m20 1052 1042 m20 1056 1051 m20 1061 1020 m20 1065 1024 m20 1069 1015 m20 1074 1027 m20 1078 1009 m20 1083 1004 m20 1087 989 m20
 1092 1005 m20 1096 1001 m20 1101 988 m20 1105 974 m20 1109 985 m20 1114 988 m20 1118 979 m20 1123 968 m20 1127 951 m20 1132 945 m20 1136 944 m20 1141 939 m20 1145 948 m20 1149 938 m20 1154 924 m20 1158 912 m20 1163 908 m20 1167 906 m20 1172 890 m20
 1176 902 m20 1181 896 m20 1185 878 m20 1189 878 m20 1194 870 m20 1198 865 m20 1203 876 m20 1207 850 m20 1212 859 m20 1216 848 m20 1221 847 m20 1225 844 m20 1229 838 m20 1234 825 m20 1238 828 m20 1243 811 m20 1247 808 m20 1252 805 m20 1256 806 m20
 1261 791 m20 1265 794 m20 1269 784 m20 1274 777 m20 1278 777 m20 1283 759 m20 1287 766 m20 1292 749 m20 1296 756 m20 1301 745 m20 1305 747 m20 1309 731 m20 1314 742 m20 1318 732 m20 1323 715 m20 1327 730 m20 1332 728 m20 1336 715 m20 1341 700 m20
 1345 697 m20 1349 698 m20 1354 683 m20 1358 687 m20 1363 665 m20 1367 678 m20 1372 660 m20 1376 659 m20 1381 675 m20 1385 651 m20 1389 649 m20 1394 646 m20 1398 633 m20 1403 640 m20 1407 638 m20 1412 617 m20 1416 612 m20 1421 614 m20 1425 614 m20
 1429 604 m20 1434 607 m20 1438 611 m20 1443 599 m20 1447 578 m20 1452 580 m20 1456 573 m20 1461 571 m20 1465 576 m20 1469 570 m20 1474 564 m20 1478 555 m20 1483 564 m20 1487 545 m20 1492 552 m20 1496 547 m20 1501 535 m20 1505 536 m20 1509 527 m20
 1514 526 m20 1518 517 m20 1523 514 m20 1527 511 m20 1532 507 m20 1536 516 m20 1541 501 m20 1545 490 m20 1549 491 m20 1554 489 m20 1558 490 m20 1563 481 m20 1567 476 m20 1572 477 m20 1576 474 m20 1581 472 m20 1585 463 m20 1589 457 m20 1594 454 m20
 1598 451 m20 1603 456 m20 1607 445 m20 1612 445 m20 1616 442 m20 1621 440 m20 1625 431 m20 1629 427 m20 1634 423 m20 1638 430 m20 1643 425 m20 1647 420 m20 1652 415 m20 1656 412 m20 1661 409 m20 1665 407 m20 1669 396 m20 1674 401 m20 1678 398 m20
 1683 395 m20 1687 387 m20 1692 388 m20 1696 383 m20 1701 379 m20 1705 382 m20 1709 379 m20 1714 374 m20 1718 373 m20 1723 376 m20 1727 365 m20 1732 366 m20 1736 359 m20 1741 360 m20 1745 362 m20 1749 360 m20 1754 355 m20 1758 352 m20 1763 353 m20
 1767 350 m20 1772 346 m20 1776 341 m20 1781 336 m20 1785 336 m20 1789 332 m20 1794 334 m20 1798 328 m20 1803 329 m20 1807 328 m20 1812 324 m20 1816 320 m20 1821 321 m20 1825 318 m20 1829 324 m20 1834 319 m20 1838 316 m20 1843 311 m20 1847 312 m20
 1852 307 m20 1856 309 m20 1861 306 m20 1865 303 m20 1869 305 m20 1874 303 m20 1878 301 m20 1883 300 m20 1887 296 m20 1892 295 m20 1896 294 m20 1901 293 m20 1905 290 m20 1909 289 m20 1914 288 m20 1918 287 m20 1923 284 m20 1927 285 m20 1932 279 m20
 1936 281 m20 1941 280 m20 1945 282 m20 1949 281 m20 1954 274 m20 1958 275 m20 1963 277 m20 1967 274 m20 1972 273 m20 1976 272 m20 1981 272 m20 1985 269 m20 1989 269 m20 1994 267 m20 1998 266 m20 2003 263 m20 2007 266 m20 2012 263 m20 2016 263 m20
 2021 261 m20 0.8 0.8 0 c black 0.8 0.8 0 c cs 0.8 0.8 0 P13 setcolor 247 247 m 5 14 d 4 33 d 4 -19 d 5 16 d 4 27 d 5 26 d 4 8 d 5 34 d 4 -11 d 5 14 d 4 -13 d 4 20 d 5 26 d 4 4 d 5 -5 d 4 32 d 5 3 d 4 -27 d 5 28 d 4 23 d 4 -13 d 5 34 d 4 9 d 5 -22 d
 4 9 d 5 20 d 4 -4 d 5 -8 d 4 31 d 4 5 d 5 -30 d 4 13 d 5 59 d 4 -28 d 5 44 d 4 -26 d 5 11 d 4 13 d 4 39 d 5 -25 d 4 18 d 5 22 d 4 4 d 5 -13 d 4 38 d 5 14 d 4 25 d 4 13 d 5 -27 d 4 25 d 5 26 d 4 39 d 5 -37 d 4 10 d 5 37 d 4 -16 d 4 13 d 5 42 d 4 1 d
 5 19 d 4 -2 d 5 49 d 4 -30 d 5 23 d 4 28 d 4 18 d 5 17 d 4 -20 d 5 32 d 4 -14 d 5 7 d 4 23 d 5 7 d 4 3 d 4 15 d 5 50 d 4 -19 d 5 X 4 10 d 5 22 d 4 -20 d 5 16 d 4 9 d 4 27 d 5 -1 d 4 16 d 5 -7 d 4 -17 d 5 43 d 4 9 d 5 -8 d 4 -7 d 4 33 d 5 9 d 4 -18 d
 5 50 d 4 -48 d 5 28 d 4 -5 d 5 14 d 4 3 d 4 -15 d 5 38 d 4 -29 d 5 31 d 4 -12 d 5 11 d 4 -7 d 5 3 d 4 30 d 5 -30 d 4 31 d 4 -32 d 5 21 d 4 22 d 5 -32 d 4 4 d 5 -16 d 4 12 d 5 1 d 4 -20 d 4 32 d 5 -9 d 4 31 d 5 -31 d 4 12 d 5 12 d 4 -21 d 5 -27 d 4
 27 d 4 X 5 -5 d 4 X 5 -4 d 4 6 d 5 -11 d 4 -11 d 5 -2 d 4 2 d 4 9 d 5 -12 d 4 X 5 5 d 4 -17 d 5 15 d 4 -17 d 5 11 d 4 -27 d 4 10 d 5 -12 d 4 6 d 5 -7 d 4 -22 d 5 9 d 4 X 5 -11 d 4 -24 d 4 8 d 5 6 d 4 12 d 5 -26 d 4 4 d 5 -7 d 4 -11 d 5 24 d 4 -19 d
 4 -14 d 5 4 d 4 -9 d 5 6 d 4 -8 d 5 -3 d 4 -23 d 5 -14 d 4 -1 d 4 22 d 5 8 d 4 -6 d 5 -27 d 4 10 d 5 -23 d 4 10 d 5 -32 d 4 5 d 4 -10 d 5 13 d 4 -19 d 5 -5 d 4 -15 d 5 17 d 4 -5 d 5 -12 d 4 -15 d 4 11 d 5 3 d 4 -9 d 5 -11 d 4 -17 d 5 -6 d 4 -1 d 5
 -5 d 4 9 d 4 -11 d 5 -14 d 4 -11 d 5 -4 d 4 -2 d 5 -16 d 4 11 d 5 -5 d 4 -18 d 4 X 5 -9 d 4 -5 d 5 11 d 4 -26 d 5 9 d 4 -11 d 5 -1 d 4 -3 d 4 -6 d 5 -13 d 4 3 d 5 -17 d 4 -3 d 5 -3 d 4 X 5 -15 d 4 4 d 4 -11 d 5 -7 d 4 1 d 5 -19 d 4 7 d 5 -17 d 4 8 d
 5 -12 d 4 2 d 4 -16 d 5 11 d 4 -10 d 5 -17 d 4 15 d 5 -2 d 4 -13 d 5 -15 d 4 -3 d 4 X 5 -15 d 4 5 d 5 -22 d 4 13 d 5 -19 d 4 -1 d 5 17 d 4 -24 d 4 -3 d 5 -3 d 4 -12 d 5 6 d 4 -2 d 5 -21 d 4 -5 d 5 2 d 4 X 4 -10 d 5 3 d 4 4 d 5 -12 d 4 -21 d 5 2 d 4
 -7 d 5 -2 d 4 5 d 4 -6 d 5 -6 d 4 -9 d 5 8 d 4 -19 d 5 7 d 4 -5 d 5 -11 d 4 X 4 -9 d 5 -1 d 4 -9 d 5 -3 d 4 -3 d 5 -4 d 4 9 d 5 -15 d 4 -11 d 4 1 d 5 -2 d 4 1 d 5 -9 d 4 -6 d 5 2 d 4 -3 d 5 -2 d 4 -9 d 4 -7 d 5 -2 d 4 -3 d 5 5 d 4 -11 d 5 X 4 -3 d 5
 -2 d 4 -10 d 4 -4 d 5 -4 d 4 7 d 5 -5 d 4 -5 d 5 -5 d 4 -3 d 5 -3 d 4 -2 d 4 -11 d 5 5 d 4 -3 d 5 -3 d 4 -8 d 5 1 d 4 -5 d 5 -4 d 4 3 d 4 -3 d 5 -5 d 4 -1 d 5 3 d 4 -11 d 5 X 4 -6 d 5 X 4 3 d 4 -3 d 5 -5 d 4 -3 d 5 1 d 4 -2 d 5 -5 d 4 -4 d 5 -5 d 4
 -1 d 4 -3 d 5 1 d 4 -6 d 5 1 d 4 X 5 -5 d 4 -4 d 5 1 d 4 -3 d 4 6 d 5 -5 d 4 -2 d 5 -6 d 4 1 d 5 -5 d 4 2 d 5 -3 d 4 -4 d 4 3 d 5 -2 d 4 -2 d 5 -1 d 4 -4 d 5 -1 d 4 -1 d 5 -1 d 4 -3 d 4 -1 d 5 -1 d 4 -2 d 5 -2 d 4 X 5 -5 d 4 1 d 5 X 4 2 d 4 -1 d 5
 -7 d 4 1 d 5 2 d 4 -3 d 5 -2 d 4 -1 d 5 X 4 -2 d 4 -1 d 5 -1 d 4 -1 d 5 -4 d 4 3 d 5 -3 d 4 X 5 -1 d -3 Y -5 2 d -4 -1 d -5 3 d -4 -2 d -5 3 d -4 1 d -5 2 d -4 X -4 2 d -5 1 d -4 X -5 2 d -4 3 d -5 -2 d -4 -1 d -5 6 d -4 2 d -4 -2 d -5 X -4 -1 d -5
 5 d -4 X -5 2 d -4 1 d -5 1 d -4 1 d -4 4 d -5 1 d -4 X -5 1 d -4 4 d -5 1 d -4 2 d -5 2 d -4 -2 d -4 3 d -5 3 d -4 -2 d -5 5 d -4 -1 d -5 5 d -4 3 d -5 5 d -4 -6 d -4 3 d -5 -2 d -4 4 d -5 5 d -4 1 d -5 -1 d -4 5 d -5 -1 d -4 4 d -4 X -5 5 d -4 4 d
 -5 5 d -4 2 d -5 -1 d -4 3 d -5 5 d -4 2 d -4 -2 d -5 X -4 6 d -5 X -4 10 d -5 -3 d -4 2 d -5 4 d -4 3 d -4 -3 d -5 4 d -4 5 d -5 -1 d -4 8 d -5 3 d -4 2 d -5 -4 d -4 11 d -4 2 d -5 3 d -4 3 d -5 5 d -4 5 d -5 4 d -4 -7 d -5 4 d -4 4 d -4 10 d -5 2
 d -4 2 d -5 1 d -4 11 d -5 -6 d -4 4 d -5 2 d -4 6 d -4 10 d -5 1 d -4 3 d -5 -1 d -4 5 d -5 9 d -4 -1 d -5 1 d -4 X -4 11 d -5 14 d -4 -8 d -5 4 d -4 3 d -5 3 d -4 8 d -5 2 d -4 8 d -4 X -5 11 d -4 5 d -5 -7 d -4 19 d -5 -9 d -4 9 d -5 6 d -4 6 d
 -4 -5 d -5 3 d -4 6 d -5 -2 d -4 21 d -5 12 d -4 -4 d -5 -3 d -4 10 d -4 X -5 -2 d -4 5 d -5 20 d -4 2 d -5 -6 d -4 12 d -5 4 d -4 2 d -4 24 d -5 -17 d -4 1 d -5 18 d -4 -12 d -5 22 d -4 -5 d -5 15 d -4 X -4 2 d -5 15 d -4 13 d -5 2 d -4 -15 d -5 17
 d -4 9 d -5 -10 d -4 16 d -4 -2 d -5 11 d -4 -8 d -5 17 d -4 -7 d -5 19 d -4 -1 d -5 7 d -4 11 d -4 -4 d -5 15 d -4 -1 d -5 4 d -4 2 d -5 17 d -4 -3 d -5 13 d -4 6 d -4 3 d -5 1 d -4 11 d -5 -9 d -4 25 d -5 -10 d -4 5 d -5 8 d -4 X -4 18 d -5 5 d -4
 -11 d -5 16 d -4 2 d -5 3 d -4 12 d -5 14 d -4 10 d -4 -9 d -5 5 d -4 2 d -5 5 d -4 17 d -5 11 d -4 9 d -5 -4 d -4 -10 d -4 14 d -5 12 d -4 5 d -5 -17 d -4 16 d -5 4 d -4 18 d -5 -12 d -4 10 d -4 -5 d -5 31 d -4 -9 d -5 22 d -4 -10 d -5 27 d -4 6 d
 -5 -8 d -4 -22 d -4 1 d -5 14 d -4 23 d -5 3 d -4 7 d -5 -6 d -4 9 d -5 -4 d -4 14 d -4 18 d -5 -23 d -4 11 d -5 7 d -4 -4 d -5 25 d -4 -12 d -5 -6 d -4 -8 d -4 24 d -5 11 d -4 -1 d -5 -8 d -4 22 d -5 6 d -4 -6 d -5 12 d -4 -10 d -4 27 d -5 -11 d -4
 17 d -5 -16 d -4 17 d -5 -4 d -4 -1 d -5 12 d -4 -9 d -4 -2 d -5 2 d -4 10 d -5 11 d -4 -5 d -5 3 d -4 X -5 5 d -4 X -4 -27 d -5 26 d -4 21 d -5 -12 d -4 -12 d -5 31 d -4 -31 d -5 9 d -4 -32 d -4 20 d -5 -2 d -4 -12 d -5 16 d -4 -4 d -5 32 d -4 -22
 d -5 -21 d -4 32 d -4 -31 d -5 29 d -4 -29 d -5 -4 d -4 7 d -5 -11 d -4 12 d -5 -32 d -4 29 d -5 -36 d -4 14 d -4 -4 d -5 -14 d -4 5 d -5 -27 d -4 46 d -5 -49 d -4 18 d -5 -10 d -4 -32 d -4 6 d -5 8 d -4 -10 d -5 -41 d -4 16 d -5 7 d -4 -16 d -5 1 d
 -4 -26 d -4 -10 d -5 -15 d -4 19 d -5 -22 d -4 -10 d -5 -1 d -4 19 d -5 -49 d -4 -15 d -4 -3 d -5 -6 d -4 -24 d -5 -8 d -4 14 d -5 -32 d -4 19 d -5 -18 d -4 -16 d -4 -28 d -5 -22 d -4 27 d -5 -46 d -4 1 d -5 -20 d -4 -1 d -5 -40 d -4 -14 d -4 15 d
 -5 -36 d -4 -10 d -5 34 d -4 -38 d -5 -25 d -4 -25 d -5 25 d -4 -14 d -4 -22 d -5 -16 d -4 -35 d -5 10 d -4 -6 d -5 -21 d -4 -19 d -5 23 d -4 -36 d -4 -13 d -5 -13 d -4 24 d -5 -41 d -4 25 d -5 -54 d -4 -13 d -5 24 d -4 -6 d -4 -26 d -5 6 d -4 2 d
 -5 -18 d -4 -7 d -5 18 d -4 -10 d -5 -29 d -4 11 d -4 -21 d -5 -26 d -4 23 d -5 -3 d -4 -26 d -5 2 d -4 -4 d -5 -24 d -4 -16 d -4 10 d -5 -13 d -4 10 d -5 -30 d -4 -7 d -5 -22 d -4 -25 d -5 -11 d -4 14 d -4 -25 d -5 -10 d FA black 1 1 1 c black 245
 238 m 4 X 1 Y 5 X 7 Y 4 X 1 Y 5 X -4 Y 4 X 17 Y 5 X 6 Y 4 X -4 Y 4 X 23 Y 5 X -6 Y 4 X -5 Y 5 X 20 Y 4 X -11 Y 5 X 14 Y 4 X 9 Y 5 X 14 Y 4 X -1 Y 4 X 8 Y 5 X -10 Y 4 X 21 Y 5 X 32 Y 4 X -10 Y 5 X 17 Y 4 X 17 Y 5 X 3 Y 4 X -11 Y 4 X 33 Y 5 X 20 Y 4 X
 9 Y 5 X 15 Y 4 X 8 Y 5 X 16 Y 4 X 7 Y 5 X 61 Y 4 X -17 Y 4 X 46 Y 5 X -19 Y 4 X 26 Y 5 X 20 Y 4 X 46 Y 5 X -8 Y 4 X 20 Y 5 X 8 Y 4 X 38 Y 9 X 25 Y 4 X 45 Y 5 X 28 Y 4 X 29 Y 5 X -30 Y 4 X 8 Y 5 X 65 Y 4 X 49 Y 4 X -45 Y 5 X 20 Y 4 X 42 Y 5 X -16 Y 4
 X 19 Y 5 X 56 Y 4 X -2 Y 5 X 25 Y 4 X 2 Y 4 X 61 Y 5 X -40 Y 4 X 31 Y 5 X 38 Y 4 X 23 Y 5 X 22 Y 4 X -30 Y 5 X 45 Y 4 X -19 Y 4 X 5 Y 5 X 30 Y 4 X 10 Y 5 X 1 Y 4 X 20 Y 5 X 65 Y 4 X -26 Y 5 X -3 Y 4 X 12 Y 4 X 30 Y 5 X -29 Y 4 X 20 Y 5 X 10 Y 4 X 33
 Y 5 X -2 Y 4 X 20 Y 5 X -10 Y 4 X -25 Y 4 X 57 Y 5 X 10 Y 4 X -12 Y 5 X -11 Y 4 X 42 Y 5 X 12 Y 4 X -27 Y 5 X 64 Y 4 X -62 Y 4 X 36 Y 5 X -9 Y 4 X 16 Y 5 X 2 Y 4 X -19 Y 5 X 50 Y 4 X -43 Y 5 X 43 Y 4 X -19 Y 4 X 13 Y 5 X -10 Y 4 X 2 Y 5 X 37 Y 4 X
 -41 Y 5 X 40 Y 4 X -39 Y 5 X 22 Y 4 X 26 Y 5 X -41 Y 4 X 4 Y 4 X -20 Y 5 X 12 Y 4 X -1 Y 5 X -26 Y 4 X 41 Y 5 X -13 Y 4 X 38 Y 5 X -41 Y 4 X 16 Y 4 X 12 Y 5 X -27 Y 4 X -37 Y 5 X 35 Y 9 X -9 Y 4 X -1 Y 5 X -7 Y 4 X 6 Y 4 X -14 Y 5 X -14 Y 4 X -4 Y 5
 X 1 Y 4 X 10 Y 5 X -13 Y 4 X -3 Y 5 X 2 Y 4 X -23 Y 4 X 19 Y 5 X -21 Y 4 X 14 Y 5 X -35 Y 4 X 9 Y 5 X -16 Y 4 X 8 Y 5 X -9 Y 4 X -31 Y 4 X 11 Y 5 X -1 Y 4 X -16 Y 5 X -31 Y 4 X 11 Y 5 X 8 Y 4 X 14 Y 5 X -34 Y 4 X 6 Y 4 X -10 Y 5 X -15 Y 4 X 29 Y 5 X
 -26 Y 4 X -19 Y 5 X 4 Y 4 X -10 Y 5 X 6 Y 4 X -10 Y 4 X -3 Y 5 X -28 Y 4 X -19 Y 5 X -2 Y 4 X 22 Y 5 X 11 Y 4 X -9 Y 5 X -33 Y 4 X 10 Y 4 X -25 Y 5 X 9 Y 4 X -38 Y 5 X 7 Y 4 X -14 Y 5 X 15 Y 4 X -24 Y 5 X -7 Y 4 X -17 Y 4 X 16 Y 5 X -5 Y 4 X -15 Y 5
 X -19 Y 4 X 13 Y 5 X 5 Y 4 X -12 Y 5 X -14 Y 4 X -20 Y 4 X -8 Y 9 X -8 Y 5 X 7 Y 4 X -11 Y 5 X -15 Y 4 X -14 Y 5 X -7 Y 4 X -2 Y 4 X -16 Y 5 X 10 Y 4 X -8 Y 5 X -19 Y 4 X -3 Y 5 X -11 Y 4 X -3 Y 5 X 7 Y 4 X -27 Y 4 X 9 Y 5 X -11 Y 4 X -4 Y 5 X -5 Y
 4 X -6 Y 5 X -16 Y 4 X 4 Y 5 X -19 Y 4 X -5 Y 4 X -4 Y 5 X 2 Y 4 X -18 Y 5 X 3 Y 4 X -12 Y 5 X -10 Y 4 X 3 Y 5 X -23 Y 4 X 7 Y 4 X -17 Y 5 X 5 Y 4 X -10 Y 9 X -18 Y 5 X 9 Y 4 X -10 Y 5 X -17 Y 4 X 13 Y 9 X -17 Y 4 X -14 Y 5 X -3 Y 9 X -18 Y 4 X 4 Y
 5 X -22 Y 4 X 11 Y 4 X -20 Y 9 X 17 Y 5 X -26 Y 4 X -5 Y 5 X -1 Y 4 X -15 Y 5 X 7 Y 4 X -2 Y 4 X -23 Y 5 X -7 Y 4 X 3 Y 9 X -11 Y 5 X 3 Y 4 X 3 Y 5 X -12 Y 4 X -23 Y 4 X 3 Y 5 X -8 Y 4 X -3 Y 5 X 4 Y 4 X -7 Y 5 X -7 Y 4 X -9 Y 5 X 10 Y 4 X -22 Y 4 X
 7 Y 5 X -4 Y 4 X -12 Y 5 X -2 Y 4 X -7 Y 9 X -11 Y 5 X -3 Y 4 X -5 Y 4 X -2 Y 5 X 6 Y 4 X -16 Y 5 X -10 Y 4 X 1 Y 5 X -1 Y 4 X -1 Y 5 X -10 Y 4 X -3 Y 4 X -1 Y 5 X -3 Y 4 X -3 Y 5 X -8 Y 4 X -6 Y 5 X -3 Y 4 X -5 Y 5 X 5 Y 4 X -10 Y 4 X -1 Y 5 X -3 Y
 4 X -2 Y 5 X -10 Y 4 X -4 Y 5 X -3 Y 4 X 5 Y 5 X -4 Y 4 X -5 Y 4 X -6 Y 5 X -2 Y 4 X -5 Y 5 X -1 Y 4 X -11 Y 5 X 4 Y 4 X -3 Y 5 X -2 Y 4 X -8 Y 9 X -3 Y 4 X -6 Y 5 X 3 Y 4 X -4 Y 5 X -4 Y 4 X -1 Y 5 X 3 Y 4 X -11 Y 9 X -6 Y 4 X 1 Y 5 X 1 Y 4 X -2 Y
 5 X -5 Y 4 X -4 Y 9 X -2 Y 4 X -3 Y 5 X -6 Y 4 X -3 Y 5 X -1 Y 4 X -2 Y 5 X -1 Y 4 X -4 Y 5 X 1 Y 4 X -2 Y 4 X -3 Y 5 X -6 Y 4 X 2 Y 5 X -3 Y 4 X 4 Y 5 X -4 Y 4 X -2 Y 5 X -5 Y 4 X 2 Y 4 X -5 Y 9 X -2 Y 5 X -4 Y 4 X 3 Y 5 X -3 Y 4 X -1 Y 5 X -1 Y 4
 X -4 Y 4 X -1 Y 9 X -2 Y 5 X -3 Y 4 X -2 Y 14 X -3 Y 4 X 1 Y 4 X -5 Y 5 X 1 Y 4 X -1 Y 5 X 1 Y 4 X -1 Y 5 X -5 Y 9 X 1 Y 4 X -3 Y 4 X -1 Y 5 X -1 Y 9 X -2 Y 4 X -1 Y 5 X -1 Y 4 X -1 Y 5 X -2 Y 4 X 1 Y 4 X -2 Y 9 X -1 Y 5 X s 247 238 m20 252 239 m20
 256 246 m20 260 247 m20 265 243 m20 269 260 m20 274 266 m20 278 262 m20 283 285 m20 287 279 m20 292 274 m20 296 294 m20 300 283 m20 305 297 m20 309 306 m20 314 320 m20 318 319 m20 323 327 m20 327 317 m20 332 338 m20 336 370 m20 340 360 m20 345 377
 m20 349 394 m20 354 397 m20 358 386 m20 363 419 m20 367 439 m20 372 448 m20 376 463 m20 380 471 m20 385 487 m20 389 494 m20 394 555 m20 398 538 m20 403 584 m20 407 565 m20 412 591 m20 416 611 m20 420 657 m20 425 649 m20 429 669 m20 434 677 m20 438
 715 m20 443 715 m20 447 740 m20 452 785 m20 456 813 m20 460 842 m20 465 812 m20 469 820 m20 474 885 m20 478 934 m20 483 889 m20 487 909 m20 492 951 m20 496 935 m20 500 954 m20 505 1010 m20 509 1008 m20 514 1033 m20 518 1035 m20 523 1096 m20 527 1056
 m20 532 1087 m20 536 1125 m20 540 1148 m20 545 1170 m20 549 1140 m20 554 1185 m20 558 1166 m20 563 1171 m20 567 1201 m20 572 1211 m20 576 1212 m20 580 1232 m20 585 1297 m20 589 1271 m20 594 1268 m20 598 1280 m20 603 1310 m20 607 1281 m20 612 1301
 m20 616 1311 m20 620 1344 m20 625 1342 m20 629 1362 m20 634 1352 m20 638 1327 m20 643 1384 m20 647 1394 m20 652 1382 m20 656 1371 m20 660 1413 m20 665 1425 m20 669 1398 m20 674 1462 m20 678 1400 m20 683 1436 m20 687 1427 m20 692 1443 m20 696 1445
 m20 700 1426 m20 705 1476 m20 709 1433 m20 714 1476 m20 718 1457 m20 723 1470 m20 727 1460 m20 732 1462 m20 736 1499 m20 741 1458 m20 745 1498 m20 749 1459 m20 754 1481 m20 758 1507 m20 763 1466 m20 767 1470 m20 772 1450 m20 776 1462 m20 781 1461
 m20 785 1435 m20 789 1476 m20 794 1463 m20 798 1501 m20 803 1460 m20 807 1476 m20 812 1488 m20 816 1461 m20 821 1424 m20 825 1459 m20 829 1459 m20 834 1450 m20 838 1449 m20 843 1442 m20 847 1448 m20 852 1434 m20 856 1420 m20 861 1416 m20 865 1417
 m20 869 1427 m20 874 1414 m20 878 1411 m20 883 1413 m20 887 1390 m20 892 1409 m20 896 1388 m20 901 1402 m20 905 1367 m20 909 1376 m20 914 1360 m20 918 1368 m20 923 1359 m20 927 1328 m20 932 1339 m20 936 1338 m20 941 1322 m20 945 1291 m20 949 1302
 m20 954 1310 m20 958 1324 m20 963 1290 m20 967 1296 m20 972 1286 m20 976 1271 m20 981 1300 m20 985 1274 m20 989 1255 m20 994 1259 m20 998 1249 m20 1003 1255 m20 1007 1245 m20 1012 1242 m20 1016 1214 m20 1021 1195 m20 1025 1193 m20 1029 1215 m20 1034
 1226 m20 1038 1217 m20 1043 1184 m20 1047 1194 m20 1052 1169 m20 1056 1178 m20 1061 1140 m20 1065 1147 m20 1069 1133 m20 1074 1148 m20 1078 1124 m20 1083 1117 m20 1087 1100 m20 1092 1116 m20 1096 1111 m20 1101 1096 m20 1105 1077 m20 1109 1090 m20
 1114 1095 m20 1118 1083 m20 1123 1069 m20 1127 1049 m20 1132 1041 m20 1136 1041 m20 1141 1033 m20 1145 1040 m20 1149 1029 m20 1154 1014 m20 1158 1000 m20 1163 993 m20 1167 991 m20 1172 975 m20 1176 985 m20 1181 977 m20 1185 958 m20 1189 955 m20 1194
 944 m20 1198 941 m20 1203 948 m20 1207 921 m20 1212 930 m20 1216 919 m20 1221 915 m20 1225 910 m20 1229 904 m20 1234 888 m20 1238 892 m20 1243 873 m20 1247 868 m20 1252 864 m20 1256 866 m20 1261 848 m20 1265 851 m20 1269 839 m20 1274 829 m20 1278
 832 m20 1283 809 m20 1287 816 m20 1292 799 m20 1296 804 m20 1301 794 m20 1305 794 m20 1309 776 m20 1314 785 m20 1318 775 m20 1323 758 m20 1327 771 m20 1332 771 m20 1336 754 m20 1341 740 m20 1345 737 m20 1349 737 m20 1354 719 m20 1358 723 m20 1363
 701 m20 1367 712 m20 1372 692 m20 1376 692 m20 1381 709 m20 1385 683 m20 1389 678 m20 1394 677 m20 1398 662 m20 1403 669 m20 1407 667 m20 1412 644 m20 1416 637 m20 1421 640 m20 1425 640 m20 1429 629 m20 1434 632 m20 1438 635 m20 1443 623 m20 1447
 600 m20 1452 603 m20 1456 595 m20 1461 592 m20 1465 596 m20 1469 589 m20 1474 582 m20 1478 573 m20 1483 583 m20 1487 561 m20 1492 568 m20 1496 564 m20 1501 552 m20 1505 550 m20 1509 543 m20 1514 543 m20 1518 532 m20 1523 529 m20 1527 524 m20 1532
 522 m20 1536 528 m20 1541 512 m20 1545 502 m20 1549 503 m20 1554 502 m20 1558 501 m20 1563 491 m20 1567 488 m20 1572 487 m20 1576 484 m20 1581 481 m20 1585 473 m20 1589 467 m20 1594 464 m20 1598 459 m20 1603 464 m20 1607 454 m20 1612 453 m20 1616
 450 m20 1621 448 m20 1625 438 m20 1629 434 m20 1634 431 m20 1638 436 m20 1643 432 m20 1647 427 m20 1652 421 m20 1656 419 m20 1661 414 m20 1665 413 m20 1669 402 m20 1674 406 m20 1678 403 m20 1683 401 m20 1687 393 m20 1692 393 m20 1696 390 m20 1701
 384 m20 1705 387 m20 1709 383 m20 1714 379 m20 1718 378 m20 1723 381 m20 1727 370 m20 1732 370 m20 1736 364 m20 1741 365 m20 1745 366 m20 1749 364 m20 1754 359 m20 1758 355 m20 1763 355 m20 1767 353 m20 1772 350 m20 1776 344 m20 1781 341 m20 1785
 340 m20 1789 338 m20 1794 337 m20 1798 333 m20 1803 334 m20 1807 332 m20 1812 329 m20 1816 323 m20 1821 325 m20 1825 322 m20 1829 326 m20 1834 322 m20 1838 320 m20 1843 315 m20 1847 317 m20 1852 312 m20 1856 312 m20 1861 310 m20 1865 306 m20 1869
 309 m20 1874 306 m20 1878 305 m20 1883 304 m20 1887 300 m20 1892 299 m20 1896 299 m20 1901 297 m20 1905 294 m20 1909 292 m20 1914 292 m20 1918 292 m20 1923 289 m20 1927 290 m20 1932 285 m20 1936 286 m20 1941 285 m20 1945 286 m20 1949 285 m20 1954
 280 m20 1958 280 m20 1963 281 m20 1967 278 m20 1972 277 m20 1976 276 m20 1981 276 m20 1985 274 m20 1989 273 m20 1994 272 m20 1998 271 m20 2003 269 m20 2007 270 m20 2012 268 m20 2016 268 m20 2021 267 m20 cs 0 0 0 P13 setcolor 247 239 m 5 2 d 4 7 d 4
 2 d 5 -5 d 4 20 d 5 6 d 4 -4 d 5 26 d 4 -7 d 5 -6 d 4 22 d 4 -12 d 5 14 d 4 11 d 5 15 d 4 -1 d 5 8 d 4 -11 d 5 22 d 4 36 d 4 -13 d 5 18 d 4 18 d 5 4 d 4 -13 d 5 35 d 4 20 d 5 9 d 4 17 d 4 8 d 5 16 d 4 6 d 5 64 d 4 -18 d 5 48 d 4 -22 d 5 28 d 4 20 d
 4 47 d 5 -8 d 4 19 d 5 8 d 4 39 d 5 -1 d 4 25 d 5 46 d 4 29 d 4 30 d 5 -32 d 4 6 d 5 68 d 4 50 d 5 -46 d 4 18 d 5 43 d 4 -16 d 4 19 d 5 57 d 4 -1 d 5 24 d 4 1 d 5 63 d 4 -42 d 5 32 d 4 38 d 4 24 d 5 22 d 4 -32 d 5 46 d 4 -20 d 5 5 d 4 30 d 5 9 d 4 2
 d 4 20 d 5 66 d 4 -26 d 5 -4 d 4 12 d 5 30 d 4 -30 d 5 21 d 4 10 d 4 33 d 5 -2 d 4 19 d 5 -9 d 4 -26 d 5 57 d 4 10 d 5 -11 d 4 -12 d 4 43 d 5 11 d 4 -27 d 5 65 d 4 -64 d 5 37 d 4 -10 d 5 17 d 4 2 d 4 -20 d 5 51 d 4 -44 d 5 44 d 4 -19 d 5 12 d 4 -10
 d 5 2 d 4 38 d 5 -43 d 4 41 d 4 -40 d 5 22 d 4 27 d 5 -42 d 4 4 d 5 -20 d 4 12 d 5 -1 d 4 -27 d 4 42 d 5 -13 d 4 38 d 5 -42 d 4 16 d 5 12 d 4 -27 d 5 -37 d 4 35 d 4 X 5 -9 d 4 -1 d 5 -7 d 4 6 d 5 -15 d 4 -14 d 5 -4 d 4 1 d 4 10 d 5 -13 d 4 -3 d 5 2
 d 4 -23 d 5 19 d 4 -22 d 5 15 d 4 -36 d 4 9 d 5 -16 d 4 8 d 5 -10 d 4 -30 d 5 11 d 4 -2 d 5 -16 d 4 -31 d 4 12 d 5 7 d 4 14 d 5 -34 d 4 6 d 5 -10 d 4 -15 d 5 29 d 4 -27 d 4 -19 d 5 4 d 4 -10 d 5 6 d 4 -10 d 5 -3 d 4 -28 d 5 -19 d 4 -3 d 4 23 d 5 11
 d 4 -9 d 5 -33 d 4 9 d 5 -25 d 4 10 d 5 -39 d 4 7 d 4 -13 d 5 14 d 4 -24 d 5 -7 d 4 -17 d 5 16 d 4 -5 d 5 -16 d 4 -19 d 4 14 d 5 4 d 4 -11 d 5 -15 d 4 -20 d 5 -8 d 4 X 5 -8 d 4 7 d 4 -11 d 5 -15 d 4 -15 d 5 -7 d 4 -2 d 5 -15 d 4 9 d 5 -8 d 4 -19 d 4
 -3 d 5 -11 d 4 -3 d 5 7 d 4 -27 d 5 9 d 4 -11 d 5 -4 d 4 -5 d 4 -6 d 5 -17 d 4 5 d 5 -20 d 4 -5 d 5 -4 d 4 2 d 5 -18 d 4 4 d 4 -13 d 5 -10 d 4 3 d 5 -23 d 4 7 d 5 -17 d 4 5 d 5 -10 d 4 X 4 -19 d 5 10 d 4 -10 d 5 -18 d 4 13 d 5 X 4 -17 d 5 -14 d 4 -3
 d 4 X 5 -18 d 4 4 d 5 -22 d 4 11 d 5 -21 d 4 1 d 5 17 d 4 -26 d 4 -5 d 5 -2 d 4 -14 d 5 6 d 4 -1 d 5 -23 d 4 -8 d 5 3 d 4 X 4 -10 d 5 3 d 4 2 d 5 -12 d 4 -23 d 5 3 d 4 -8 d 5 -3 d 4 4 d 4 -8 d 5 -6 d 4 -10 d 5 11 d 4 -22 d 5 6 d 4 -3 d 5 -13 d 4 -1
 d 4 -8 d 5 X 4 -11 d 5 -3 d 4 -5 d 5 -2 d 4 6 d 5 -16 d 4 -10 d 4 1 d 5 -1 d 4 -1 d 5 -11 d 4 -2 d 5 -1 d 4 -3 d 5 -3 d 4 -8 d 4 -7 d 5 -3 d 4 -4 d 5 5 d 4 -11 d 5 -1 d 4 -2 d 5 -3 d 4 -9 d 4 -5 d 5 -3 d 4 5 d 5 -4 d 4 -5 d 5 -6 d 4 -2 d 5 -5 d 4 -1
 d 4 -11 d 5 3 d 4 -2 d 5 -2 d 4 -8 d 5 X 4 -3 d 5 -6 d 4 2 d 4 -3 d 5 -4 d 4 -1 d 5 2 d 4 -10 d 5 -1 d 4 -6 d 5 1 d 4 1 d 4 -2 d 5 -5 d 4 -4 d 5 1 d 4 -3 d 5 -2 d 4 -7 d 5 -3 d 4 -1 d 4 -2 d 5 -1 d 4 -4 d 5 1 d 4 -2 d 5 -3 d 4 -6 d 5 2 d 4 -3 d 4 4
 d 5 -4 d 4 -2 d 5 -5 d 4 2 d 5 -5 d 4 X 5 -2 d 4 -4 d 4 2 d 5 -2 d 4 -1 d 5 -1 d 4 -4 d 5 -1 d 4 -1 d 5 -2 d 4 -2 d 4 -2 d 5 -1 d 4 X 5 -2 d 4 X 5 -5 d 4 1 d 5 -1 d 4 1 d 4 -1 d 5 -5 d 4 X 5 1 d 4 -2 d 5 -2 d 4 -1 d 5 X 4 -2 d 4 -1 d 5 -1 d 4 -1 d 5
 -2 d 4 1 d 5 -2 d 4 X 5 -2 d -1 Y -5 1 d -4 X -5 2 d -4 -1 d -5 2 d -4 X -5 2 d -4 1 d -4 1 d -5 1 d -4 1 d -5 1 d -4 3 d -5 -1 d -4 -1 d -5 6 d -4 1 d -4 -2 d -5 1 d -4 X -5 4 d -4 X -5 3 d -4 -1 d -5 1 d -4 2 d -4 3 d -5 1 d -4 1 d -5 1 d -4 4 d
 -5 1 d -4 1 d -5 2 d -4 -2 d -4 4 d -5 2 d -4 -1 d -5 5 d -4 -1 d -5 4 d -4 2 d -5 4 d -4 -4 d -4 3 d -5 -2 d -4 6 d -5 3 d -4 2 d -5 -1 d -4 4 d -5 X -4 3 d -4 1 d -5 3 d -4 6 d -5 3 d -4 2 d -5 X -4 4 d -5 4 d -4 2 d -4 -1 d -5 X -4 5 d -5 1 d -4
 10 d -5 -2 d -4 1 d -5 4 d -4 3 d -4 -3 d -5 6 d -4 4 d -5 -1 d -4 8 d -5 3 d -4 2 d -5 -4 d -4 11 d -4 1 d -5 5 d -4 2 d -5 6 d -4 5 d -5 3 d -4 -4 d -5 3 d -4 4 d -4 10 d -5 2 d -4 3 d -5 X -4 11 d -5 -5 d -4 4 d -5 3 d -4 6 d -4 9 d -5 3 d -4 3 d
 -5 X -4 3 d -5 10 d -4 1 d -5 1 d -4 -1 d -4 10 d -5 16 d -4 -7 d -5 3 d -4 5 d -5 2 d -4 12 d -5 -1 d -4 8 d -4 1 d -5 13 d -4 3 d -5 -6 d -4 22 d -5 -11 d -4 10 d -5 6 d -4 7 d -4 -3 d -5 2 d -4 8 d -5 -3 d -4 23 d -5 11 d -4 -2 d -5 -3 d -4 11 d
 -4 X -5 -3 d -4 7 d -5 23 d -4 1 d -5 -6 d -4 14 d -5 2 d -4 4 d -4 26 d -5 -17 d -4 X -5 20 d -4 -11 d -5 22 d -4 -4 d -5 18 d -4 -1 d -4 4 d -5 14 d -4 16 d -5 X -4 -13 d -5 18 d -4 10 d -5 -10 d -4 18 d -4 X -5 10 d -4 -5 d -5 17 d -4 -7 d -5 23
 d -4 -3 d -5 10 d -4 12 d -4 -4 d -5 19 d -4 -3 d -5 4 d -4 5 d -5 20 d -4 -5 d -5 16 d -4 6 d -4 6 d -5 3 d -4 11 d -5 -9 d -4 27 d -5 -7 d -4 3 d -5 11 d -4 2 d -4 20 d -5 7 d -4 -9 d -5 15 d -4 2 d -5 7 d -4 14 d -5 15 d -4 11 d -4 -7 d -5 8 d -4
 X -5 8 d -4 20 d -5 14 d -4 11 d -5 -4 d -4 -14 d -4 19 d -5 16 d -4 5 d -5 -16 d -4 16 d -5 7 d -4 23 d -5 -14 d -4 13 d -4 -6 d -5 38 d -4 -10 d -5 25 d -4 -9 d -5 32 d -4 9 d -5 -10 d -4 -23 d -4 2 d -5 19 d -4 27 d -5 4 d -4 9 d -5 -6 d -4 10 d
 -5 -4 d -4 19 d -4 26 d -5 -28 d -4 14 d -5 10 d -4 -5 d -5 32 d -4 -13 d -5 -8 d -4 -11 d -4 31 d -5 16 d -4 1 d -5 -11 d -4 30 d -5 9 d -4 -8 d -5 16 d -4 -9 d -4 35 d -5 -14 d -4 21 d -5 -19 d -4 22 d -5 -2 d -4 3 d -5 13 d -4 -10 d -4 -1 d -5 4
 d -4 14 d -5 14 d -4 -6 d -5 7 d -4 X -5 9 d -4 X -4 -34 d -5 36 d -4 26 d -5 -12 d -4 -15 d -5 41 d -4 -38 d -5 13 d -4 -42 d -4 27 d -5 X -4 -12 d -5 20 d -4 -4 d -5 41 d -4 -27 d -5 -22 d -4 40 d -4 -40 d -5 40 d -4 -36 d -5 -3 d -4 9 d -5 -12 d
 -4 19 d -5 -43 d -4 42 d -5 -49 d -4 19 d -4 -3 d -5 -16 d -4 9 d -5 -36 d -4 61 d -5 -63 d -4 27 d -5 -13 d -4 -41 d -4 10 d -5 12 d -4 -10 d -5 -56 d -4 24 d -5 10 d -4 -19 d -5 1 d -4 -32 d -4 -10 d -5 -21 d -4 28 d -5 -29 d -4 -12 d -5 2 d -4 27
 d -5 -65 d -4 -20 d -4 -1 d -5 -9 d -4 -30 d -5 -7 d -4 19 d -5 -45 d -4 30 d -5 -22 d -4 -23 d -4 -37 d -5 -32 d -4 39 d -5 -60 d -4 -1 d -5 -26 d -4 1 d -5 -54 d -4 -19 d -4 15 d -5 -41 d -4 -20 d -5 43 d -4 -48 d -5 -63 d -4 -9 d -5 28 d -4 -28 d
 -4 -27 d -5 -45 d -4 -24 d -5 -2 d -4 -36 d -5 -9 d -4 -20 d -5 7 d -4 -44 d -4 -20 d -5 -25 d -4 17 d -5 -44 d -4 16 d -5 -58 d -4 -7 d -5 -17 d -4 -8 d -4 -14 d -5 -9 d -4 -19 d -5 -30 d -4 9 d -5 -3 d -4 -16 d -5 -17 d -4 9 d -4 -29 d -5 -20 d -4
 9 d -5 -8 d -4 1 d -5 -12 d -4 -9 d -5 -13 d -4 11 d -4 -20 d -5 6 d -4 4 d -5 -19 d -4 2 d -5 -5 d -4 -15 d -5 4 d -4 -1 d -4 -6 d -5 -1 d FA 0.8 0 0 c 1 1 1 c 1 0 0 c 0.8 0 0 c 245 235 m 31 X 1 Y 40 X 1 Y 13 X 1 Y 14 X 1 Y 9 X 1 Y 8 X 1 Y 9 X 1 Y
 5 X 1 Y 4 X 1 Y 5 X 1 Y 4 X 2 Y 5 X 2 Y 4 X 1 Y 4 X 1 Y 5 X 2 Y 4 X 1 Y 5 X 2 Y 4 X 3 Y 5 X 1 Y 4 X 2 Y 5 X 2 Y 4 X 3 Y 4 X 1 Y 5 X 4 Y 4 X 3 Y 5 X 2 Y 4 X 4 Y 9 X 3 Y 5 X 3 Y 4 X 4 Y 9 X 4 Y 4 X 3 Y 5 X 2 Y 4 X 4 Y 5 X 2 Y 4 X 3 Y 5 X 4 Y 4 X 3 Y 4
 X 4 Y 5 X 1 Y 4 X 3 Y 5 X 5 Y 4 X 3 Y 5 X 3 Y 9 X 6 Y 8 X 6 Y 5 X 3 Y 4 X 3 Y 5 X 1 Y 4 X 2 Y 5 X 7 Y 4 X -1 Y 5 X 4 Y 4 X 3 Y 4 X 3 Y 9 X 1 Y 5 X 5 Y 4 X 6 Y 5 X 2 Y 4 X 3 Y 13 X 5 Y 5 X 3 Y 4 X 2 Y 5 X 1 Y 4 X 5 Y 5 X 3 Y 9 X 7 Y 4 X -4 Y 4 X 4 Y
 5 X 2 Y 4 X 3 Y 5 X 5 Y 4 X -2 Y 5 X 3 Y 4 X 1 Y 5 X 4 Y 4 X 2 Y 4 X 1 Y 5 X 1 Y 4 X 3 Y 5 X 6 Y 4 X -2 Y 5 X 5 Y 4 X -5 Y 5 X 7 Y 4 X 5 Y 5 X -4 Y 4 X 1 Y 4 X -1 Y 5 X 3 Y 4 X 3 Y 5 X -2 Y 4 X 6 Y 5 X -1 Y 4 X 6 Y 5 X -3 Y 4 X 3 Y 4 X 5 Y 5 X -5 Y
 4 X -1 Y 5 X 5 Y 4 X 2 Y 9 X -1 Y 5 X 3 Y 4 X 2 Y 4 X -1 Y 5 X -1 Y 4 X 1 Y 5 X 2 Y 4 X 2 Y 5 X -3 Y 4 X 2 Y 5 X 4 Y 4 X -2 Y 4 X 3 Y 5 X -2 Y 4 X 2 Y 5 X -3 Y 4 X 3 Y 14 X -1 Y 4 X -2 Y 4 X 1 Y 5 X 2 Y 9 X -3 Y 9 X 3 Y 4 X 3 Y 5 X -4 Y 8 X 1 Y 5 X
 -3 Y 4 X 6 Y 5 X -2 Y 4 X -1 Y 5 X 2 Y 4 X -3 Y 5 X 2 Y 4 X -1 Y 4 X 2 Y 5 X -7 Y 4 X -2 Y 9 X 9 Y 5 X 1 Y 9 X -6 Y 4 X 4 Y 4 X -7 Y 5 X 5 Y 4 X -9 Y 5 X 2 Y 4 X -2 Y 5 X 5 Y 4 X -5 Y 9 X -5 Y 4 X 6 Y 5 X -1 Y 4 X -1 Y 5 X -4 Y 4 X 4 Y 5 X 2 Y 4 X
 -4 Y 5 X -2 Y 4 X -4 Y 4 X -1 Y 5 X 1 Y 9 X 1 Y 9 X -5 Y 4 X -3 Y 5 X -1 Y 4 X 1 Y 4 X -4 Y 5 X 3 Y 9 X -5 Y 4 X 1 Y 5 X -2 Y 4 X -2 Y 5 X 5 Y 4 X -8 Y 4 X 3 Y 5 X -2 Y 9 X -1 Y 4 X -1 Y 5 X -5 Y 4 X 2 Y 5 X -4 Y 4 X 1 Y 4 X -4 Y 5 X 3 Y 4 X -4 Y 9
 X -4 Y 9 X 2 Y 5 X -8 Y 4 X 4 Y 4 X -5 Y 5 X 2 Y 4 X -1 Y 5 X -1 Y 4 X -4 Y 5 X 4 Y 4 X -4 Y 5 X -5 Y 4 X 4 Y 4 X 2 Y 5 X -5 Y 4 X -3 Y 5 X -2 Y 4 X 1 Y 5 X -5 Y 4 X 2 Y 5 X -7 Y 4 X 5 Y 4 X -9 Y 5 X 2 Y 4 X 7 Y 5 X -9 Y 4 X -1 Y 9 X -3 Y 5 X 3 Y 4
 X -1 Y 4 X -8 Y 5 X -1 Y 4 X 1 Y 5 X 1 Y 4 X -3 Y 5 X 1 Y 4 X 1 Y 5 X -5 Y 4 X -7 Y 4 X 1 Y 5 X -3 Y 9 X 3 Y 4 X -3 Y 5 X -2 Y 4 X -3 Y 5 X 5 Y 4 X -8 Y 4 X 3 Y 5 X -1 Y 4 X -5 Y 9 X -2 Y 5 X 1 Y 4 X -4 Y 5 X -1 Y 4 X -2 Y 9 X 3 Y 4 X -6 Y 5 X -4 Y
 4 X 1 Y 5 X -1 Y 4 X 1 Y 5 X -4 Y 4 X -1 Y 4 X 1 Y 5 X -1 Y 4 X -1 Y 5 X -2 Y 4 X -3 Y 5 X -1 Y 4 X -1 Y 5 X 2 Y 4 X -4 Y 9 X -1 Y 4 X -1 Y 5 X -3 Y 4 X -2 Y 14 X 1 Y 4 X -2 Y 4 X -4 Y 5 X 1 Y 4 X -4 Y 5 X 2 Y 4 X -5 Y 5 X 1 Y 4 X 1 Y 5 X -2 Y 4 X
 -3 Y 9 X 1 Y 4 X -5 Y 5 X 1 Y 9 X -2 Y 4 X 1 Y 5 X 1 Y 4 X -5 Y 4 X -1 Y 9 X -1 Y 5 X 1 Y 4 X -2 Y 5 X -1 Y 4 X -2 Y 5 X 1 Y 4 X -2 Y 9 X -4 Y 9 X -1 Y 4 X 1 Y 5 X -3 Y 4 X -1 Y 5 X 2 Y 4 X -1 Y 4 X -1 Y 5 X -4 Y 4 X 2 Y 5 X -1 Y 4 X 1 Y 5 X -2 Y 9
 X -2 Y 4 X 1 Y 4 X -3 Y 14 X -2 Y 4 X 1 Y 5 X -1 Y 4 X -1 Y 5 X 1 Y 4 X -3 Y 13 X -1 Y 9 X -2 Y 9 X 1 Y 5 X -1 Y 8 X -2 Y 9 X -2 Y 5 X 1 Y 9 X -2 Y 13 X -1 Y 9 X -2 Y 13 X -1 Y 5 X -1 Y 13 X -1 Y 13 X -1 Y 5 X s 1 0 0 c 247 235 m20 252 235 m20 256
 235 m20 260 235 m20 265 235 m20 269 235 m20 274 235 m20 278 236 m20 283 236 m20 287 236 m20 292 236 m20 296 236 m20 300 236 m20 305 236 m20 309 236 m20 314 236 m20 318 237 m20 323 237 m20 327 237 m20 332 238 m20 336 238 m20 340 238 m20 345 239 m20
 349 239 m20 354 240 m20 358 240 m20 363 241 m20 367 241 m20 372 242 m20 376 243 m20 380 244 m20 385 245 m20 389 247 m20 394 249 m20 398 250 m20 403 251 m20 407 253 m20 412 254 m20 416 256 m20 420 259 m20 425 260 m20 429 262 m20 434 264 m20 438 267
 m20 443 268 m20 447 272 m20 452 275 m20 456 277 m20 460 281 m20 465 281 m20 469 284 m20 474 287 m20 478 291 m20 483 291 m20 487 295 m20 492 298 m20 496 300 m20 500 304 m20 505 306 m20 509 309 m20 514 313 m20 518 316 m20 523 320 m20 527 321 m20 532
 324 m20 536 329 m20 540 332 m20 545 335 m20 549 335 m20 554 341 m20 558 341 m20 563 347 m20 567 350 m20 572 353 m20 576 354 m20 580 356 m20 585 363 m20 589 362 m20 594 366 m20 598 369 m20 603 372 m20 607 372 m20 612 373 m20 616 378 m20 620 384 m20
 625 386 m20 629 389 m20 634 389 m20 638 389 m20 643 394 m20 647 397 m20 652 399 m20 656 400 m20 660 405 m20 665 408 m20 669 408 m20 674 415 m20 678 411 m20 683 415 m20 687 417 m20 692 420 m20 696 425 m20 700 423 m20 705 426 m20 709 427 m20 714 431
 m20 718 433 m20 723 434 m20 727 435 m20 732 438 m20 736 444 m20 741 442 m20 745 447 m20 749 442 m20 754 449 m20 758 454 m20 763 450 m20 767 451 m20 772 450 m20 776 453 m20 781 456 m20 785 454 m20 789 460 m20 794 459 m20 798 465 m20 803 462 m20 807
 465 m20 812 470 m20 816 465 m20 821 464 m20 825 469 m20 829 471 m20 834 471 m20 838 470 m20 843 473 m20 847 475 m20 852 474 m20 856 473 m20 861 474 m20 865 476 m20 869 478 m20 874 475 m20 878 477 m20 883 481 m20 887 479 m20 892 482 m20 896 480 m20
 901 482 m20 905 479 m20 909 482 m20 914 482 m20 918 482 m20 923 481 m20 927 479 m20 932 480 m20 936 482 m20 941 482 m20 945 479 m20 949 479 m20 954 482 m20 958 485 m20 963 481 m20 967 481 m20 972 482 m20 976 479 m20 981 485 m20 985 483 m20 989 482
 m20 994 484 m20 998 481 m20 1003 483 m20 1007 482 m20 1012 484 m20 1016 477 m20 1021 475 m20 1025 475 m20 1029 484 m20 1034 485 m20 1038 485 m20 1043 479 m20 1047 483 m20 1052 476 m20 1056 481 m20 1061 472 m20 1065 474 m20 1069 472 m20 1074 477 m20
 1078 472 m20 1083 472 m20 1087 467 m20 1092 473 m20 1096 472 m20 1101 471 m20 1105 467 m20 1109 471 m20 1114 473 m20 1118 469 m20 1123 467 m20 1127 463 m20 1132 462 m20 1136 463 m20 1141 463 m20 1145 464 m20 1149 464 m20 1154 459 m20 1158 456 m20
 1163 455 m20 1167 456 m20 1172 452 m20 1176 455 m20 1181 455 m20 1185 450 m20 1189 451 m20 1194 449 m20 1198 447 m20 1203 452 m20 1207 444 m20 1212 447 m20 1216 445 m20 1221 445 m20 1225 444 m20 1229 443 m20 1234 438 m20 1238 440 m20 1243 436 m20
 1247 437 m20 1252 433 m20 1256 436 m20 1261 432 m20 1265 432 m20 1269 428 m20 1274 428 m20 1278 430 m20 1283 422 m20 1287 426 m20 1292 421 m20 1296 423 m20 1301 422 m20 1305 421 m20 1309 417 m20 1314 421 m20 1318 417 m20 1323 412 m20 1327 416 m20
 1332 418 m20 1336 413 m20 1341 410 m20 1345 408 m20 1349 409 m20 1354 404 m20 1358 406 m20 1363 399 m20 1367 404 m20 1372 395 m20 1376 397 m20 1381 404 m20 1385 395 m20 1389 394 m20 1394 394 m20 1398 391 m20 1403 394 m20 1407 393 m20 1412 385 m20
 1416 384 m20 1421 385 m20 1425 386 m20 1429 383 m20 1434 384 m20 1438 385 m20 1443 380 m20 1447 373 m20 1452 374 m20 1456 371 m20 1461 371 m20 1465 374 m20 1469 371 m20 1474 369 m20 1478 366 m20 1483 371 m20 1487 363 m20 1492 366 m20 1496 365 m20
 1501 360 m20 1505 360 m20 1509 358 m20 1514 359 m20 1518 355 m20 1523 354 m20 1527 352 m20 1532 352 m20 1536 355 m20 1541 349 m20 1545 345 m20 1549 346 m20 1554 345 m20 1558 346 m20 1563 342 m20 1567 341 m20 1572 342 m20 1576 341 m20 1581 340 m20
 1585 338 m20 1589 335 m20 1594 334 m20 1598 333 m20 1603 335 m20 1607 331 m20 1612 331 m20 1616 330 m20 1621 329 m20 1625 326 m20 1629 324 m20 1634 324 m20 1638 324 m20 1643 325 m20 1647 323 m20 1652 319 m20 1656 320 m20 1661 316 m20 1665 318 m20
 1669 313 m20 1674 314 m20 1678 315 m20 1683 313 m20 1687 310 m20 1692 310 m20 1696 311 m20 1701 306 m20 1705 307 m20 1709 307 m20 1714 305 m20 1718 306 m20 1723 307 m20 1727 302 m20 1732 301 m20 1736 301 m20 1741 300 m20 1745 301 m20 1749 299 m20
 1754 298 m20 1758 296 m20 1763 297 m20 1767 295 m20 1772 295 m20 1776 291 m20 1781 291 m20 1785 290 m20 1789 291 m20 1794 288 m20 1798 287 m20 1803 289 m20 1807 288 m20 1812 287 m20 1816 283 m20 1821 285 m20 1825 284 m20 1829 285 m20 1834 283 m20
 1838 283 m20 1843 281 m20 1847 282 m20 1852 279 m20 1856 279 m20 1861 279 m20 1865 277 m20 1869 278 m20 1874 277 m20 1878 276 m20 1883 277 m20 1887 274 m20 1892 274 m20 1896 274 m20 1901 273 m20 1905 273 m20 1909 271 m20 1914 271 m20 1918 272 m20
 1923 271 m20 1927 271 m20 1932 269 m20 1936 269 m20 1941 267 m20 1945 268 m20 1949 268 m20 1954 266 m20 1958 266 m20 1963 266 m20 1967 265 m20 1972 265 m20 1976 263 m20 1981 263 m20 1985 263 m20 1989 262 m20 1994 261 m20 1998 261 m20 2003 261 m20
 2007 260 m20 2012 260 m20 2016 260 m20 2021 259 m20 0.8 0 0 c black 0.8 0 0 c cs 0.8 0 0 P13 setcolor 247 235 m 27 X 4 1 d 31 X 5 1 d 13 X 5 1 d 8 X 5 1 d 4 1 d 9 X 5 1 d 4 1 d 5 1 d 4 X 4 1 d 5 1 d 4 2 d 5 2 d 4 1 d 5 1 d 4 2 d 5 2 d 4 1 d 4 3 d 5
 1 d 4 3 d 5 2 d 4 2 d 5 2 d 4 3 d 5 3 d 4 3 d 4 4 d 5 -1 d 4 3 d 5 4 d 4 4 d 5 X 4 4 d 5 3 d 4 2 d 4 4 d 5 2 d 4 3 d 5 4 d 4 3 d 5 4 d 4 1 d 5 3 d 4 5 d 4 3 d 5 4 d 4 -1 d 5 6 d 4 1 d 5 5 d 4 3 d 5 3 d 4 1 d 4 3 d 5 6 d 4 X 5 4 d 4 3 d 5 2 d 4 1 d 5
 1 d 4 5 d 4 6 d 5 1 d 4 3 d 5 X 4 1 d 5 5 d 4 3 d 5 1 d 4 1 d 4 6 d 5 3 d 4 X 5 7 d 4 -4 d 5 4 d 4 2 d 5 3 d 4 5 d 4 -2 d 5 3 d 4 X 5 5 d 4 2 d 5 1 d 4 1 d 5 3 d 4 6 d 5 -2 d 4 5 d 4 -5 d 5 7 d 4 5 d 5 -3 d 4 X 5 -1 d 4 3 d 5 3 d 4 -2 d 4 6 d 5 -1 d
 4 7 d 5 -4 d 4 3 d 5 6 d 4 -6 d 5 -1 d 4 5 d 4 2 d 5 X 4 -1 d 5 3 d 4 3 d 5 -2 d 4 X 5 1 d 4 1 d 4 2 d 5 -3 d 4 2 d 5 5 d 4 -3 d 5 3 d 4 -1 d 5 1 d 4 -3 d 4 3 d 14 X 4 -2 d 5 X 4 3 d 5 X 4 -4 d 4 1 d 5 2 d 4 4 d 5 -5 d 4 1 d 5 X 4 -2 d 5 5 d 4 -1 d
 4 -1 d 5 1 d 4 -3 d 5 3 d 4 -1 d 5 1 d 4 -6 d 5 -3 d 4 X 4 9 d 5 1 d 4 X 5 -6 d 4 5 d 5 -8 d 4 5 d 5 -9 d 4 3 d 4 -2 d 5 4 d 4 -4 d 5 X 4 -5 d 5 5 d 4 -1 d 5 X 4 -4 d 4 3 d 5 2 d 4 -4 d 5 -1 d 4 -4 d 5 -2 d 4 2 d 5 -1 d 4 1 d 4 X 5 -5 d 4 -3 d 5 -1
 d 4 2 d 5 -5 d 4 3 d 5 X 4 -5 d 4 1 d 5 -1 d 4 -2 d 5 4 d 4 -8 d 5 4 d 4 -3 d 5 X 4 -1 d 4 -1 d 5 -5 d 4 2 d 5 -4 d 4 1 d 5 -4 d 4 4 d 5 -4 d 4 X 4 -5 d 5 1 d 4 1 d 5 -7 d 4 3 d 5 -5 d 4 2 d 5 -1 d 4 -1 d 4 -4 d 5 4 d 4 -4 d 5 -5 d 4 4 d 5 2 d 4 -5
 d 5 -3 d 4 -2 d 4 1 d 5 -5 d 4 2 d 5 -7 d 4 5 d 5 -9 d 4 2 d 5 7 d 4 -9 d 4 -1 d 5 X 4 -3 d 5 3 d 4 -1 d 5 -8 d 4 -1 d 5 1 d 4 1 d 4 -3 d 5 1 d 4 1 d 5 -5 d 4 -7 d 5 1 d 4 -3 d 5 X 4 3 d 4 -3 d 5 -2 d 4 -3 d 5 5 d 4 -8 d 5 3 d 4 -1 d 5 -6 d 4 1 d 4
 -2 d 5 1 d 4 -4 d 5 -2 d 4 -2 d 5 1 d 4 3 d 5 -6 d 4 -4 d 4 1 d 5 -1 d 4 1 d 5 -5 d 13 X 5 -1 d 4 -3 d 4 -3 d 5 X 4 -2 d 5 2 d 4 -3 d 5 X 4 -2 d 5 -1 d 4 -3 d 4 -2 d 9 X 5 1 d 4 -2 d 5 -3 d 4 X 5 -3 d 4 1 d 4 -5 d 5 1 d 4 1 d 5 -2 d 4 -3 d 5 X 4 1 d
 5 -4 d 8 X 5 -2 d 4 1 d 5 1 d 4 -5 d 5 -1 d 4 X 5 -1 d 4 1 d 4 -2 d 5 -1 d 4 -2 d 5 1 d 4 -2 d 5 X 4 -4 d 5 X 4 -1 d 4 1 d 5 -2 d 4 -2 d 5 2 d 4 -1 d 5 -1 d 4 -4 d 5 2 d 4 -1 d 4 X 5 -1 d 4 X 5 -2 d 4 1 d 5 -3 d 9 X 4 -2 d 4 1 d 5 -1 d 4 -1 d 5 1 d
 4 -3 d 9 X 5 -1 d 4 X 4 -2 d 5 -1 d 4 2 d 5 -1 d 4 -1 d 5 -1 d 4 X 5 -2 d 4 1 d 4 X 5 -2 d 9 X 4 -1 d 5 X 4 -2 d 9 X 4 -1 d 5 -1 d 4 -1 d 5 1 d 4 -1 d 9 X 5 -1 d -2 Y -5 1 d -4 X -5 1 d -13 X -5 1 d -4 1 d -9 X -4 2 d -5 X -4 1 d -9 X -5 2 d -4 X -4
 -1 d -5 2 d -4 X -5 2 d -4 X -5 1 d -4 -1 d -5 X -4 2 d -4 X -5 1 d -9 X -4 3 d -9 X -5 1 d -4 -1 d -4 2 d -5 X -4 1 d -5 2 d -4 -1 d -5 2 d -4 X -5 2 d -4 -1 d -4 1 d -5 -2 d -4 4 d -5 1 d -4 1 d -5 -2 d -4 1 d -5 3 d -4 -1 d -4 1 d -5 X -4 4 d -5
 X -4 2 d -5 -1 d -4 2 d -5 1 d -4 2 d -4 -2 d -5 1 d -4 1 d -5 1 d -4 5 d -5 -1 d -4 -1 d -5 2 d -4 X -4 -1 d -5 4 d -9 X -4 3 d -5 1 d -4 X -5 -1 d -4 5 d -4 -2 d -5 4 d -4 -1 d -5 3 d -4 2 d -5 X -4 -1 d -5 X -4 2 d -4 3 d -5 1 d -4 2 d -5 X -4 3
 d -5 -2 d -4 2 d -5 X -4 3 d -4 3 d -5 1 d -13 X -5 4 d -13 X -4 3 d -5 6 d -4 -2 d -5 -1 d -4 2 d -5 1 d -4 4 d -5 X -4 1 d -4 X -5 5 d -4 1 d -5 -3 d -4 9 d -5 -6 d -4 3 d -5 2 d -4 3 d -4 -3 d -5 X -4 3 d -5 -1 d -4 7 d -5 5 d -4 -1 d -5 -1 d -4
 3 d -4 -1 d -5 -1 d -4 1 d -5 8 d -4 1 d -5 -3 d -4 3 d -5 X -4 1 d -4 9 d -5 -7 d -4 -2 d -5 9 d -4 -5 d -5 7 d -4 -2 d -5 5 d -4 -1 d -4 2 d -5 3 d -4 4 d -5 -1 d -4 -4 d -5 5 d -4 4 d -5 -4 d -4 4 d -4 1 d -5 1 d -4 -2 d -5 5 d -4 -4 d -5 7 d -4
 -1 d -5 -1 d -4 5 d -4 X -5 4 d -4 -3 d -5 3 d -4 X -5 4 d -4 -2 d -5 5 d -4 1 d -9 X -4 3 d -5 -4 d -4 8 d -5 -4 d -4 2 d -5 1 d -4 -1 d -4 6 d -5 X -4 -4 d -5 5 d -4 -2 d -5 1 d -4 3 d -5 5 d -4 1 d -4 -1 d -5 X -4 -2 d -5 2 d -4 4 d -5 1 d -4 4 d
 -5 -2 d -4 -3 d -4 4 d -5 1 d -4 1 d -5 -6 d -4 5 d -5 X -4 5 d -5 -5 d -4 2 d -4 -3 d -5 9 d -4 -5 d -5 8 d -4 -5 d -5 6 d -4 X -5 -1 d -4 -9 d -4 X -5 3 d -4 6 d -5 -1 d -4 1 d -5 -3 d -4 3 d -5 -1 d -4 1 d -4 1 d -5 -5 d -4 2 d -5 X -4 -1 d -5 5
 d -4 -4 d -5 -2 d -4 -1 d -4 4 d -5 X -4 -3 d -5 X -4 2 d -9 X -5 1 d -4 -4 d -4 3 d -5 -1 d -4 1 d -5 -3 d -4 3 d -5 -5 d -4 -1 d -5 3 d -4 -2 d -4 -2 d -5 -1 d -4 1 d -5 1 d -4 -2 d -5 -3 d -4 1 d -5 X -4 -2 d -4 -6 d -5 1 d -4 6 d -5 -5 d -4 -3 d
 -5 3 d -4 -6 d -5 1 d -4 -6 d -4 1 d -5 -2 d -4 -3 d -5 1 d -4 -1 d -5 4 d -4 -5 d -5 -8 d -4 6 d -4 -5 d -5 2 d -4 -6 d -5 -3 d -4 -1 d -5 -1 d -4 -2 d -5 -4 d -4 -1 d -5 -2 d -4 1 d -4 -5 d -5 -3 d -4 -2 d -5 -4 d -4 4 d -5 -7 d -4 X -5 -3 d -4 -5
 d -4 -1 d -5 -1 d -4 -4 d -5 -4 d -4 -1 d -5 X -4 -3 d -5 -2 d -4 -5 d -4 -5 d -5 -1 d -4 -1 d -5 -3 d -4 -2 d -5 -4 d -4 X -5 -6 d -4 -3 d -4 X -5 -4 d -4 -3 d -5 -5 d -4 -1 d -5 -5 d -4 X -5 -3 d -4 -3 d -4 -5 d -5 -3 d -4 -1 d -5 -4 d -4 -3 d -5
 -4 d -4 -3 d -5 -2 d -4 -4 d -4 -2 d -5 -3 d -4 -4 d -5 1 d -4 -5 d -5 -3 d -4 -3 d -5 X -4 -4 d -4 -2 d -5 -3 d -4 -3 d -5 -2 d -4 -2 d -5 -2 d -4 -3 d -5 -1 d -4 -3 d -4 -1 d -5 -2 d -4 -1 d -5 -2 d -4 -1 d -5 -2 d -4 -1 d -5 -1 d -4 -1 d -4 -1 d
 -5 -1 d -4 X -5 -1 d -4 X -5 -1 d -4 X -5 -1 d -4 X -4 -1 d -14 X -4 -1 d -31 X -5 -1 d -31 X FA black 1 1 1 c 556 639 1578 1302 bf black 1578 1302 m 556 X s 2134 1302 m 639 Y s 2134 1941 m -556 X s 1578 1941 m -639 Y s
 gsave  2222 2133 23 22 C 1716.93 1827.09 t 0 r /Helvetica findfont 95.0544 sf 0 0 m (No Int) show NC gr  0.8 0 0 c 1599 1861 m 97 X s black
 gsave  2222 2133 23 22 C 1716.93 1663.75 t 0 r /Helvetica findfont 95.0544 sf 0 0 m (Add) show NC gr  0.8 0.8 0 c 1599 1702 m 97 X s black
 gsave  2222 2133 23 22 C 1716.93 1504.21 t 0 r /Helvetica findfont 95.0544 sf 0 0 m (Mult) show NC gr  0.8 0 0.8 c 1599 1542 m 97 X s black
 gsave  2222 2133 23 22 C 1716.93 1344.68 t 0 r /Helvetica findfont 95.0544 sf 0 0 m (Central) show NC gr  1599 1382 m 97 X s
 gsave  2222 2133 23 22 C 2199.34 1568.79 t 90 r /Helvetica-BoldOblique findfont 38.0218 sf 0 0 m (LHC HIGGS XS WG 2013) show NC gr 
 gr  gr showpage
end
%%EOF
