%!PS-Adobe-2.0 EPSF-2.0
%%BoundingBox:  0 0 567 544
%%Title: HWW_600_MWW_reweighting_cut_YR3.eps: HWW 600Gev MWW reweighting for interference with cuts
%%Creator: ROOT Version 5.34/05
%%CreationDate: Fri Jun 14 04:56:11 2013
%%EndComments
%%BeginProlog
80 dict begin
/s {stroke} def /l {lineto} def /m {moveto} def /t {translate} def
/r {rotate} def /rl {roll}  def /R {repeat} def
/d {rlineto} def /rm {rmoveto} def /gr {grestore} def /f {eofill} def
/c {setrgbcolor} def /black {0 setgray} def /sd {setdash} def
/cl {closepath} def /sf {scalefont setfont} def /lw {setlinewidth} def
/box {m dup 0 exch d exch 0 d 0 exch neg d cl} def
/NC{systemdict begin initclip end}def/C{NC box clip newpath}def
/bl {box s} def /bf {box f} def /Y { 0 exch d} def /X { 0 d} def 
/K {{pop pop 0 moveto} exch kshow} bind def
/ita {/ang 15 def gsave [1 0 ang dup sin exch cos div 1 0 0] concat} def 
/mp {newpath /y exch def /x exch def} def
/side {[w .77 mul w .23 mul] .385 w mul sd w 0 l currentpoint t -144 r} def
/mr {mp x y w2 0 360 arc} def /m24 {mr s} def /m20 {mr f} def
/mb {mp x y w2 add m w2 neg 0 d 0 w neg d w 0 d 0 w d cl} def
/mt {mp x y w2 add m w2 neg w neg d w 0 d cl} def
/m21 {mb f} def /m25 {mb s} def /m22 {mt f} def /m26{mt s} def
/m23 {mp x y w2 sub m w2 w d w neg 0 d cl f} def
/m27 {mp x y w2 add m w3 neg w2 neg d w3 w2 neg d w3 w2 d cl s} def
/m28 {mp x w2 sub y w2 sub w3 add m w3 0 d  0 w3 neg d w3 0 d 0 w3 d w3 0 d  0 w3 d w3 neg 0 d 0 w3 d w3 neg 0 d 0 w3 neg d w3 neg 0 d cl s } def
/m29 {mp gsave x w2 sub y w2 add w3 sub m currentpoint t 4 {side} repeat cl fill gr} def
/m30 {mp gsave x w2 sub y w2 add w3 sub m currentpoint t 4 {side} repeat cl s gr} def
/m31 {mp x y w2 sub m 0 w d x w2 sub y m w 0 d x w2 sub y w2 add m w w neg d x w2 sub y w2 sub m w w d s} def
/m32 {mp x y w2 sub m w2 w d w neg 0 d cl s} def
/m33 {mp x y w2 add m w3 neg w2 neg d w3 w2 neg d w3 w2 d cl f} def
/m34 {mp x w2 sub y w2 sub w3 add m w3 0 d  0 w3 neg d w3 0 d 0 w3 d w3 0 d  0 w3 d w3 neg 0 d 0 w3 d w3 neg 0 d 0 w3 neg d w3 neg 0 d cl f } def
/m2 {mp x y w2 sub m 0 w d x w2 sub y m w 0 d s} def
/m5 {mp x w2 sub y w2 sub m w w d x w2 sub y w2 add m w w neg d s} def
/reEncode {exch findfont dup length dict begin {1 index /FID eq  {pop pop} {def} ifelse } forall /Encoding exch def currentdict end dup /FontName get exch definefont pop } def [/Times-Bold /Times-Italic /Times-BoldItalic /Helvetica /Helvetica-Oblique
 /Helvetica-Bold /Helvetica-BoldOblique /Courier /Courier-Oblique /Courier-Bold /Courier-BoldOblique /Times-Roman /AvantGarde-Book /AvantGarde-BookOblique /AvantGarde-Demi /AvantGarde-DemiOblique /Bookman-Demi /Bookman-DemiItalic /Bookman-Light
 /Bookman-LightItalic /Helvetica-Narrow /Helvetica-Narrow-Bold /Helvetica-Narrow-BoldOblique /Helvetica-Narrow-Oblique /NewCenturySchlbk-Roman /NewCenturySchlbk-Bold /NewCenturySchlbk-BoldItalic /NewCenturySchlbk-Italic /Palatino-Bold
 /Palatino-BoldItalic /Palatino-Italic /Palatino-Roman ] {ISOLatin1Encoding reEncode } forall
%%EndProlog
%%BeginSetup
%%EndSetup
newpath  gsave  .25 .25 scale  gsave  0 0 t black[  ] 0 sd 3 lw 1 1 1 c 2268 2177 0 0 bf black 1 1 1 c 2268 1568 0 609 bf black 1 1 1 c 1814 1411 227 609 bf black 1814 1411 227 609 bl 0 0 1 c 1 1 1 c 0 0 1 c 227 680 m 254 X 1 Y 3 X -1 Y 8 X 1 Y 3 X 1
 Y 11 X 2 Y 4 X 2 Y 3 X 3 Y 4 X 9 Y 4 X 15 Y 3 X 6 Y 4 X 9 Y 4 X 7 Y 3 X 4 Y 4 X 1 Y 3 X 9 Y 4 X 3 Y 7 X 1 Y 4 X 10 Y 4 X -9 Y 3 X 13 Y 7 X -10 Y 4 X 2 Y 4 X 2 Y 3 X 4 Y 4 X 4 Y 4 X -5 Y 3 X 2 Y 4 X -1 Y 3 X 3 Y 4 X -2 Y 4 X 4 Y 3 X -3 Y 4 X 1 Y 4 X
 2 Y 3 X 2 Y 4 X -4 Y 7 X 5 Y 4 X 1 Y 3 X -2 Y 4 X 2 Y 4 X 1 Y 3 X -5 Y 4 X -3 Y 4 X 5 Y 3 X -2 Y 4 X 1 Y 3 X 3 Y 4 X -3 Y 4 X 2 Y 3 X 1 Y 4 X -4 Y 4 X 2 Y 3 X 1 Y 7 X 4 Y 4 X -2 Y 11 X -1 Y 4 X -2 Y 3 X 5 Y 4 X -1 Y 3 X -1 Y 11 X 2 Y 11 X -3 Y 4 X 7
 Y 7 X 1 Y 7 X 2 Y 4 X 9 Y 4 X -7 Y 3 X 2 Y 4 X -4 Y 4 X 6 Y 3 X 2 Y 4 X 1 Y 3 X 4 Y 4 X 1 Y 4 X -3 Y 3 X 6 Y 8 X -3 Y 3 X 10 Y 4 X -6 Y 3 X 7 Y 4 X 3 Y 4 X -1 Y 3 X 12 Y 4 X -9 Y 4 X 12 Y 3 X 4 Y 4 X 5 Y 3 X 15 Y 4 X -2 Y 4 X 5 Y 3 X -1 Y 4 X 11 Y 4
 X 5 Y 3 X 4 Y 4 X 12 Y 4 X -1 Y 3 X 16 Y 4 X -3 Y 3 X 9 Y 4 X 10 Y 4 X -4 Y 3 X 7 Y 4 X 3 Y 4 X 5 Y 3 X 6 Y 4 X 11 Y 3 X -8 Y 4 X 13 Y 4 X 3 Y 3 X 5 Y 4 X 5 Y 4 X 2 Y 3 X 6 Y 4 X 8 Y 3 X -2 Y 4 X 3 Y 4 X 7 Y 3 X 19 Y 4 X -11 Y 4 X 5 Y 3 X 5 Y 4 X 4
 Y 3 X 6 Y 4 X 5 Y 7 X 12 Y 4 X 13 Y 4 X 3 Y 3 X 1 Y 4 X -3 Y 3 X 14 Y 4 X -11 Y 4 X 25 Y 3 X -10 Y 4 X 10 Y 4 X 9 Y 3 X 10 Y 4 X -7 Y 4 X 17 Y 3 X 8 Y 4 X -1 Y 3 X 9 Y 4 X -4 Y 4 X 22 Y 7 X 5 Y 4 X 11 Y 3 X 4 Y 4 X 13 Y 3 X 5 Y 4 X 4 Y 4 X 17 Y 3 X
 5 Y 4 X 2 Y 4 X 13 Y 3 X -5 Y 4 X 22 Y 3 X -1 Y 4 X 10 Y 4 X 16 Y 3 X 10 Y 4 X -3 Y 4 X 15 Y 3 X 16 Y 4 X 4 Y 3 X 23 Y 4 X 8 Y 4 X 20 Y 3 X 9 Y 4 X 7 Y 4 X 19 Y 3 X 6 Y 4 X 17 Y 4 X 10 Y 3 X 6 Y 4 X 23 Y 3 X 20 Y 4 X 1 Y 4 X 31 Y 3 X 6 Y 4 X 12 Y 4
 X 28 Y 3 X 13 Y 4 X 14 Y 3 X 18 Y 4 X 20 Y 4 X 20 Y 3 X 15 Y 4 X 28 Y 4 X 11 Y 3 X 15 Y 4 X 31 Y 3 X 23 Y 4 X 8 Y 4 X 18 Y 3 X 22 Y 4 X 13 Y 4 X 13 Y 3 X 29 Y 4 X 12 Y 3 X 33 Y 4 X -2 Y 4 X 16 Y 3 X 1 Y 4 X 16 Y 4 X -3 Y 3 X 3 Y 4 X 22 Y 4 X -4 Y 3
 X -9 Y 4 X -3 Y 3 X 1 Y 4 X -2 Y 4 X -33 Y 3 X -17 Y 4 X -15 Y 4 X -12 Y 3 X -19 Y 4 X -35 Y 3 X -16 Y 4 X -41 Y 4 X -25 Y 3 X -25 Y 4 X -38 Y 4 X -24 Y 3 X -43 Y 4 X -35 Y 3 X -35 Y 4 X -30 Y 4 X -22 Y 3 X -34 Y 4 X -27 Y 4 X -26 Y 3 X -46 Y 4 X
 -28 Y 3 X -33 Y 4 X -19 Y 4 X -37 Y 3 X -35 Y 4 X -8 Y 4 X -35 Y 3 X -20 Y 4 X -13 Y 3 X -18 Y 4 X -24 Y 4 X -26 Y 3 X -14 Y 4 X -17 Y 4 X -16 Y 3 X -12 Y 4 X -30 Y 4 X -3 Y 3 X -12 Y 4 X -12 Y 3 X -17 Y 4 X -9 Y 4 X -20 Y 3 X -5 Y 4 X -9 Y 4 X -7 Y
 3 X -12 Y 4 X -9 Y 3 X -13 Y 4 X -3 Y 4 X -6 Y 3 X -3 Y 4 X -11 Y 4 X -5 Y 3 X -9 Y 4 X -3 Y 3 X -2 Y 4 X -11 Y 4 X -4 Y 3 X -2 Y 4 X -2 Y 4 X -5 Y 3 X -3 Y 4 X -2 Y 3 X -7 Y 4 X -6 Y 4 X -2 Y 3 X -2 Y 4 X -3 Y 4 X -2 Y 3 X 1 Y 4 X -7 Y 4 X 2 Y 3 X
 -11 Y 4 X 1 Y 3 X -1 Y 4 X -1 Y 7 X -4 Y 4 X 1 Y 4 X -5 Y 3 X -2 Y 7 X -2 Y 4 X -1 Y 4 X -3 Y 3 X 3 Y 4 X -3 Y 4 X -5 Y 3 X 1 Y 4 X -1 Y 7 X -2 Y 11 X -1 Y 4 X -2 Y 7 X -1 Y 7 X -2 Y 7 X -1 Y 4 X -1 Y 4 X 1 Y 3 X -1 Y 4 X -1 Y 4 X -1 Y 18 X -2 Y 3 X
 1 Y 8 X -1 Y 7 X -2 Y 7 X 1 Y 4 X -2 Y 3 X 2 Y 4 X -1 Y 4 X -1 Y 7 X -1 Y 3 X 1 Y 11 X -1 Y 8 X 2 Y 3 X -3 Y 4 X 1 Y 3 X -1 Y 4 X 2 Y 4 X -2 Y 3 X 2 Y 4 X -2 Y 4 X -1 Y 7 X 2 Y 7 X -1 Y 4 X 1 Y 3 X -2 Y 8 X 1 Y 3 X -1 Y 15 X 2 Y 3 X -1 Y 4 X -1 Y 7
 X 1 Y 4 X -1 Y 4 X 1 Y 3 X -1 Y 7 X 1 Y 8 X -2 Y 3 X 1 Y 18 X 1 Y 4 X -2 Y 4 X 1 Y 3 X 1 Y 4 X -1 Y 22 X -1 Y 7 X 1 Y 4 X -1 Y 3 X 1 Y 11 X 1 Y 4 X 1 Y 3 X -2 Y 8 X -1 Y 3 X 2 Y 4 X -1 Y 4 X -1 Y 3 X 1 Y 4 X -2 Y 3 X 2 Y 4 X 1 Y 11 X s black 227 609
 m 1814 X s 227 647 m -38 Y s 263 628 m -19 Y s 299 628 m -19 Y s 336 628 m -19 Y s 372 628 m -19 Y s 408 647 m -38 Y s 444 628 m -19 Y s 481 628 m -19 Y s 517 628 m -19 Y s 553 628 m -19 Y s 590 647 m -38 Y s 626 628 m -19 Y s 662 628 m -19 Y s 698
 628 m -19 Y s 735 628 m -19 Y s 771 647 m -38 Y s 807 628 m -19 Y s 844 628 m -19 Y s 880 628 m -19 Y s 916 628 m -19 Y s 952 647 m -38 Y s 989 628 m -19 Y s 1025 628 m -19 Y s 1061 628 m -19 Y s 1098 628 m -19 Y s 1134 647 m -38 Y s 1170 628 m -19
 Y s 1206 628 m -19 Y s 1243 628 m -19 Y s 1279 628 m -19 Y s 1315 647 m -38 Y s 1352 628 m -19 Y s 1388 628 m -19 Y s 1424 628 m -19 Y s 1460 628 m -19 Y s 1497 647 m -38 Y s 1533 628 m -19 Y s 1569 628 m -19 Y s 1606 628 m -19 Y s 1642 628 m -19 Y
 s 1678 647 m -38 Y s 1714 628 m -19 Y s 1751 628 m -19 Y s 1787 628 m -19 Y s 1823 628 m -19 Y s 1860 647 m -38 Y s 1896 628 m -19 Y s 1932 628 m -19 Y s 1968 628 m -19 Y s 2005 628 m -19 Y s 2041 647 m -38 Y s
 gsave  2268 1568 0 609 C 208.919 558.382 t 0 r /Helvetica findfont 49.4479 sf 0 0 m (0) show NC gr 
 gsave  2268 1568 0 609 C 364.658 558.382 t 0 r /Helvetica findfont 49.4479 sf 0 0 m (100) show NC gr 
 gsave  2268 1568 0 609 C 546.987 558.382 t 0 r /Helvetica findfont 49.4479 sf 0 0 m (200) show NC gr 
 gsave  2268 1568 0 609 C 725.517 558.382 t 0 r /Helvetica findfont 49.4479 sf 0 0 m (300) show NC gr 
 gsave  2268 1568 0 609 C 907.846 558.382 t 0 r /Helvetica findfont 49.4479 sf 0 0 m (400) show NC gr 
 gsave  2268 1568 0 609 C 1090.18 558.382 t 0 r /Helvetica findfont 49.4479 sf 0 0 m (500) show NC gr 
 gsave  2268 1568 0 609 C 1272.5 558.382 t 0 r /Helvetica findfont 49.4479 sf 0 0 m (600) show NC gr 
 gsave  2268 1568 0 609 C 1454.83 558.382 t 0 r /Helvetica findfont 49.4479 sf 0 0 m (700) show NC gr 
 gsave  2268 1568 0 609 C 1633.36 558.382 t 0 r /Helvetica findfont 49.4479 sf 0 0 m (800) show NC gr 
 gsave  2268 1568 0 609 C 1815.69 558.382 t 0 r /Helvetica findfont 49.4479 sf 0 0 m (900) show NC gr 
 gsave  2268 1568 0 609 C 1982.83 558.382 t 0 r /Helvetica findfont 49.4479 sf 0 0 m (1000) show NC gr  227 609 m 1411 Y s
 gsave  2268 1568 0 609 C 64.5748 1356.07 t 90 r /Helvetica findfont 34.2332 sf 0 0 m (WW) show NC gr 
 gsave  2268 1568 0 609 C 45.5822 1272.5 t 90 r /Helvetica findfont 49.4479 sf 0 0 m (/dM) show NC gr 
 gsave  2268 1568 0 609 C 45.5822 1242.12 t 90 r /Symbol findfont 49.4479 sf 0 0 m (s) show NC gr 
 gsave  2268 1568 0 609 C 45.5822 1215.53 t 90 r /Helvetica findfont 49.4479 sf 0 0 m (d) show NC gr  288 680 m -61 X s 257 711 m -30 X s 257 743 m -30 X s 257 774 m -30 X s 257 805 m -30 X s 288 837 m -61 X s 257 868 m -30 X s 257 899 m -30 X s 257
 930 m -30 X s 257 962 m -30 X s 288 993 m -61 X s 257 1024 m -30 X s 257 1056 m -30 X s 257 1087 m -30 X s 257 1118 m -30 X s 288 1150 m -61 X s 257 1181 m -30 X s 257 1212 m -30 X s 257 1244 m -30 X s 257 1275 m -30 X s 288 1306 m -61 X s 257 1338
 m -30 X s 257 1369 m -30 X s 257 1400 m -30 X s 257 1432 m -30 X s 288 1463 m -61 X s 257 1494 m -30 X s 257 1526 m -30 X s 257 1557 m -30 X s 257 1588 m -30 X s 288 1620 m -61 X s 257 1651 m -30 X s 257 1682 m -30 X s 257 1714 m -30 X s 257 1745 m
 -30 X s 288 1776 m -61 X s 257 1808 m -30 X s 257 1839 m -30 X s 257 1870 m -30 X s 257 1902 m -30 X s 288 1933 m -61 X s 288 680 m -61 X s 257 649 m -30 X s 257 617 m -30 X s 288 1933 m -61 X s 257 1964 m -30 X s 257 1996 m -30 X s
 gsave  2268 1568 0 609 C 186.127 660.943 t 0 r /Helvetica findfont 49.4479 sf 0 0 m (0) show NC gr 
 gsave  2268 1568 0 609 C 98.7615 820.48 t 0 r /Helvetica findfont 49.4479 sf 0 0 m (0.001) show NC gr 
 gsave  2268 1568 0 609 C 91.1645 976.22 t 0 r /Helvetica findfont 49.4479 sf 0 0 m (0.002) show NC gr 
 gsave  2268 1568 0 609 C 91.1645 1131.96 t 0 r /Helvetica findfont 49.4479 sf 0 0 m (0.003) show NC gr 
 gsave  2268 1568 0 609 C 87.366 1287.7 t 0 r /Helvetica findfont 49.4479 sf 0 0 m (0.004) show NC gr 
 gsave  2268 1568 0 609 C 91.1645 1447.24 t 0 r /Helvetica findfont 49.4479 sf 0 0 m (0.005) show NC gr 
 gsave  2268 1568 0 609 C 91.1645 1602.98 t 0 r /Helvetica findfont 49.4479 sf 0 0 m (0.006) show NC gr 
 gsave  2268 1568 0 609 C 87.366 1758.71 t 0 r /Helvetica findfont 49.4479 sf 0 0 m (0.007) show NC gr 
 gsave  2268 1568 0 609 C 91.1645 1914.45 t 0 r /Helvetica findfont 49.4479 sf 0 0 m (0.008) show NC gr  0 0 1 c /w 2 def /w2 {w 2 div} def /w3 {w 3 div} def 229 680 m20 232 680 m20 236 680 m20 239 680 m20 243 680 m20 247 680 m20 250 680 m20 254 680
 m20 258 680 m20 261 680 m20 265 680 m20 268 680 m20 272 680 m20 276 680 m20 279 680 m20 283 680 m20 287 680 m20 290 680 m20 294 680 m20 298 680 m20 301 680 m20 305 680 m20 308 680 m20 312 680 m20 316 680 m20 319 680 m20 323 680 m20 327 680 m20 330
 680 m20 334 680 m20 337 680 m20 341 680 m20 345 680 m20 348 680 m20 352 680 m20 356 680 m20 359 680 m20 363 680 m20 366 680 m20 370 680 m20 374 680 m20 377 680 m20 381 680 m20 385 680 m20 388 680 m20 392 680 m20 395 680 m20 399 680 m20 403 680 m20
 406 680 m20 410 680 m20 414 680 m20 417 680 m20 421 680 m20 425 680 m20 428 680 m20 432 680 m20 435 680 m20 439 680 m20 443 680 m20 446 680 m20 450 680 m20 454 680 m20 457 680 m20 461 680 m20 464 680 m20 468 680 m20 472 680 m20 475 680 m20 479 680
 m20 483 681 m20 486 680 m20 490 680 m20 493 681 m20 497 682 m20 501 682 m20 504 682 m20 508 684 m20 512 686 m20 515 689 m20 519 698 m20 522 713 m20 526 719 m20 530 728 m20 533 735 m20 537 739 m20 541 740 m20 544 749 m20 548 752 m20 552 752 m20 555
 753 m20 559 763 m20 562 754 m20 566 767 m20 570 767 m20 573 757 m20 577 759 m20 581 761 m20 584 765 m20 588 769 m20 591 764 m20 595 766 m20 599 765 m20 602 768 m20 606 766 m20 610 770 m20 613 767 m20 617 768 m20 620 770 m20 624 772 m20 628 768 m20
 631 768 m20 635 773 m20 639 774 m20 642 772 m20 646 774 m20 649 775 m20 653 770 m20 657 767 m20 660 772 m20 664 770 m20 668 771 m20 671 774 m20 675 771 m20 679 773 m20 682 774 m20 686 770 m20 689 772 m20 693 773 m20 697 773 m20 700 777 m20 704 775
 m20 708 775 m20 711 775 m20 715 774 m20 718 772 m20 722 777 m20 726 776 m20 729 775 m20 733 775 m20 737 775 m20 740 777 m20 744 777 m20 747 777 m20 751 774 m20 755 781 m20 758 781 m20 762 782 m20 766 782 m20 769 784 m20 773 793 m20 776 786 m20 780
 788 m20 784 784 m20 787 790 m20 791 792 m20 795 793 m20 798 797 m20 802 798 m20 805 795 m20 809 801 m20 813 801 m20 816 798 m20 820 808 m20 824 802 m20 827 809 m20 831 812 m20 835 811 m20 838 823 m20 842 814 m20 845 826 m20 849 830 m20 853 835 m20
 856 850 m20 860 848 m20 864 853 m20 867 852 m20 871 863 m20 874 868 m20 878 872 m20 882 884 m20 885 883 m20 889 899 m20 893 896 m20 896 905 m20 900 915 m20 903 911 m20 907 918 m20 911 921 m20 914 926 m20 918 932 m20 922 943 m20 925 935 m20 929 948
 m20 932 951 m20 936 956 m20 940 961 m20 943 963 m20 947 969 m20 951 977 m20 954 975 m20 958 978 m20 962 985 m20 965 1004 m20 969 993 m20 972 998 m20 976 1003 m20 980 1007 m20 983 1013 m20 987 1018 m20 991 1018 m20 994 1030 m20 998 1043 m20 1001 1046
 m20 1005 1047 m20 1009 1044 m20 1012 1058 m20 1016 1047 m20 1020 1072 m20 1023 1062 m20 1027 1072 m20 1030 1081 m20 1034 1091 m20 1038 1084 m20 1041 1101 m20 1045 1109 m20 1049 1108 m20 1052 1117 m20 1056 1113 m20 1059 1135 m20 1063 1135 m20 1067
 1140 m20 1070 1151 m20 1074 1155 m20 1078 1168 m20 1081 1173 m20 1085 1177 m20 1089 1194 m20 1092 1199 m20 1096 1201 m20 1099 1214 m20 1103 1209 m20 1107 1231 m20 1110 1230 m20 1114 1240 m20 1118 1256 m20 1121 1266 m20 1125 1263 m20 1128 1278 m20
 1132 1294 m20 1136 1298 m20 1139 1321 m20 1143 1329 m20 1147 1349 m20 1150 1358 m20 1154 1365 m20 1157 1384 m20 1161 1390 m20 1165 1407 m20 1168 1417 m20 1172 1423 m20 1176 1446 m20 1179 1466 m20 1183 1467 m20 1186 1498 m20 1190 1504 m20 1194 1516
 m20 1197 1544 m20 1201 1557 m20 1205 1571 m20 1208 1589 m20 1212 1609 m20 1215 1629 m20 1219 1644 m20 1223 1672 m20 1226 1683 m20 1230 1698 m20 1234 1729 m20 1237 1752 m20 1241 1760 m20 1245 1778 m20 1248 1800 m20 1252 1813 m20 1255 1826 m20 1259
 1855 m20 1263 1867 m20 1266 1900 m20 1270 1898 m20 1274 1914 m20 1277 1915 m20 1281 1931 m20 1284 1928 m20 1288 1931 m20 1292 1953 m20 1295 1949 m20 1299 1940 m20 1303 1937 m20 1306 1938 m20 1310 1936 m20 1313 1903 m20 1317 1886 m20 1321 1871 m20
 1324 1859 m20 1328 1840 m20 1332 1805 m20 1335 1789 m20 1339 1748 m20 1342 1723 m20 1346 1698 m20 1350 1660 m20 1353 1636 m20 1357 1593 m20 1361 1558 m20 1364 1523 m20 1368 1493 m20 1372 1471 m20 1375 1437 m20 1379 1410 m20 1382 1384 m20 1386 1338
 m20 1390 1310 m20 1393 1277 m20 1397 1258 m20 1401 1221 m20 1404 1186 m20 1408 1178 m20 1411 1143 m20 1415 1123 m20 1419 1110 m20 1422 1092 m20 1426 1068 m20 1430 1042 m20 1433 1028 m20 1437 1011 m20 1440 995 m20 1444 983 m20 1448 953 m20 1451 950
 m20 1455 938 m20 1459 926 m20 1462 909 m20 1466 900 m20 1469 880 m20 1473 875 m20 1477 866 m20 1480 859 m20 1484 847 m20 1488 838 m20 1491 825 m20 1495 822 m20 1499 816 m20 1502 813 m20 1506 802 m20 1509 797 m20 1513 788 m20 1517 785 m20 1520 783
 m20 1524 772 m20 1528 768 m20 1531 766 m20 1535 764 m20 1538 759 m20 1542 756 m20 1546 754 m20 1549 747 m20 1553 741 m20 1557 739 m20 1560 737 m20 1564 734 m20 1567 732 m20 1571 733 m20 1575 726 m20 1578 728 m20 1582 717 m20 1586 718 m20 1589 717
 m20 1593 716 m20 1596 716 m20 1600 712 m20 1604 713 m20 1607 708 m20 1611 706 m20 1615 706 m20 1618 704 m20 1622 703 m20 1625 700 m20 1629 703 m20 1633 700 m20 1636 695 m20 1640 696 m20 1644 695 m20 1647 695 m20 1651 693 m20 1655 693 m20 1658 693
 m20 1662 692 m20 1665 690 m20 1669 690 m20 1673 689 m20 1676 689 m20 1680 687 m20 1684 687 m20 1687 686 m20 1691 685 m20 1694 686 m20 1698 685 m20 1702 684 m20 1705 683 m20 1709 683 m20 1713 683 m20 1716 683 m20 1720 683 m20 1723 681 m20 1727 682
 m20 1731 682 m20 1734 681 m20 1738 681 m20 1742 679 m20 1745 679 m20 1749 680 m20 1752 678 m20 1756 680 m20 1760 679 m20 1763 678 m20 1767 678 m20 1771 677 m20 1774 678 m20 1778 678 m20 1782 678 m20 1785 677 m20 1789 677 m20 1792 679 m20 1796 676
 m20 1800 677 m20 1803 676 m20 1807 678 m20 1811 676 m20 1814 678 m20 1818 676 m20 1821 675 m20 1825 675 m20 1829 677 m20 1832 677 m20 1836 676 m20 1840 677 m20 1843 675 m20 1847 675 m20 1850 676 m20 1854 675 m20 1858 675 m20 1861 675 m20 1865 675
 m20 1869 677 m20 1872 676 m20 1876 675 m20 1879 675 m20 1883 676 m20 1887 675 m20 1890 676 m20 1894 675 m20 1898 675 m20 1901 676 m20 1905 676 m20 1909 674 m20 1912 675 m20 1916 675 m20 1919 675 m20 1923 675 m20 1927 675 m20 1930 676 m20 1934 674
 m20 1938 675 m20 1941 676 m20 1945 675 m20 1948 675 m20 1952 675 m20 1956 675 m20 1959 675 m20 1963 675 m20 1967 674 m20 1970 674 m20 1974 675 m20 1977 674 m20 1981 675 m20 1985 675 m20 1988 675 m20 1992 676 m20 1996 677 m20 1999 675 m20 2003 675
 m20 2006 674 m20 2010 676 m20 2014 675 m20 2017 674 m20 2021 675 m20 2025 673 m20 2028 675 m20 2032 676 m20 2036 676 m20 2039 676 m20 black 0 0 1 c 1 lw << /PatternType 1 /PaintType 2 /TilingType 1 /BBox [ 0 0 100 100 ] /XStep 100 /YStep 100
 /PaintProc { begin gsave 0 0 m 100 100 l 0 100 m 100 0 l s gr end } >> [ 0.24 0 0 0.24 0 0 ] makepattern /P13 exch def /cs {[/Pattern /DeviceRGB] setcolorspace} def /FA {f [/DeviceRGB] setcolorspace} def cs 0 0 1 P13 setcolor 229 680 m 250 X 4 1 d 7
 X 3 1 d 8 X 3 1 d 4 1 d 4 2 d 3 4 d 4 9 d 3 16 d 4 6 d 4 9 d 3 8 d 4 4 d 4 X 3 10 d 4 3 d 4 X 3 1 d 4 10 d 3 -9 d 4 13 d 4 1 d 3 -10 d 4 2 d 4 2 d 3 3 d 4 3 d 3 -5 d 4 2 d 4 -1 d 3 3 d 4 -2 d 4 4 d 3 -2 d 4 1 d 3 2 d 4 2 d 4 -5 d 3 X 4 6 d 4 X 3 -1
 d 4 2 d 3 1 d 4 -5 d 4 -3 d 3 5 d 4 -3 d 4 2 d 3 3 d 4 -4 d 4 3 d 3 1 d 4 -5 d 3 3 d 4 1 d 4 -1 d 3 5 d 4 -2 d 4 X 3 -1 d 4 -1 d 3 -2 d 4 6 d 4 -1 d 3 -1 d 8 X 3 2 d 7 X 4 -3 d 4 7 d 3 -1 d 4 2 d 4 X 3 2 d 4 9 d 3 -7 d 4 2 d 4 -4 d 3 6 d 4 2 d 4 1 d
 3 4 d 4 1 d 3 -3 d 4 6 d 4 X 3 -3 d 4 11 d 4 -7 d 3 7 d 4 4 d 4 -2 d 3 13 d 4 -9 d 3 11 d 4 4 d 4 5 d 3 15 d 4 -1 d 4 4 d 3 X 4 11 d 3 4 d 4 5 d 4 12 d 3 -1 d 4 16 d 4 -3 d 3 10 d 4 10 d 3 -5 d 4 7 d 4 4 d 3 4 d 4 6 d 4 11 d 3 -8 d 4 13 d 3 3 d 4 6
 d 4 5 d 3 2 d 4 6 d 4 8 d 3 -2 d 4 3 d 4 6 d 3 20 d 4 -11 d 3 5 d 4 5 d 4 4 d 3 5 d 4 6 d 4 X 3 11 d 4 14 d 3 3 d 4 2 d 4 -4 d 3 14 d 4 -11 d 4 26 d 3 -10 d 4 9 d 3 9 d 4 10 d 4 -7 d 3 17 d 4 8 d 4 -1 d 3 9 d 4 -3 d 3 22 d 4 -1 d 4 6 d 3 10 d 4 5 d
 4 13 d 3 5 d 4 4 d 4 16 d 3 5 d 4 3 d 3 12 d 4 -4 d 4 22 d 3 -1 d 4 10 d 4 16 d 3 11 d 4 -4 d 3 15 d 4 16 d 4 4 d 3 24 d 4 8 d 4 19 d 3 10 d 4 6 d 3 19 d 4 6 d 4 18 d 3 9 d 4 6 d 4 23 d 3 21 d 4 1 d 3 32 d 4 5 d 4 12 d 3 28 d 4 13 d 4 15 d 3 18 d 4
 20 d 3 20 d 4 14 d 4 29 d 3 11 d 4 15 d 4 31 d 3 23 d 4 8 d 4 18 d 3 22 d 4 13 d 3 13 d 4 29 d 4 13 d 3 32 d 4 -2 d 4 17 d 3 1 d 4 16 d 3 -3 d 4 3 d 4 21 d 3 -4 d 4 -8 d 4 -3 d 3 1 d 4 -3 d 3 -33 d 4 -16 d 4 -16 d 3 -11 d 4 -19 d 4 -36 d 3 -16 d 4
 -41 d 3 -25 d 4 -25 d 4 -38 d 3 -25 d 4 -43 d 4 -35 d 3 -35 d 4 -30 d 4 -22 d 3 -34 d 4 -27 d 3 -26 d 4 -47 d 4 -28 d 3 -33 d 4 -19 d 4 -38 d 3 -35 d 4 -8 d 3 -35 d 4 -20 d 4 -13 d 3 -18 d 4 -25 d 4 -25 d 3 -14 d 4 -17 d 3 -17 d 4 -12 d 4 -30 d 3 -3
 d 4 -12 d 4 -12 d 3 -18 d 4 -8 d 3 -21 d 4 -4 d 4 -10 d 3 -7 d 4 -12 d 4 -9 d 3 -13 d 4 -3 d 4 -6 d 3 -4 d 4 -11 d 3 -5 d 4 -9 d 4 -2 d 3 -3 d 4 -10 d 4 -5 d 3 -2 d 4 -2 d 3 -5 d 4 -3 d 4 -2 d 3 -7 d 4 -7 d 4 -1 d 3 -2 d 4 -3 d 3 -2 d 4 1 d 4 -7 d 3
 1 d 4 -10 d 4 1 d 3 -1 d 4 -1 d 3 -1 d 4 -3 d 4 1 d 3 -5 d 4 -2 d 4 X 3 -3 d 4 -1 d 3 -3 d 4 3 d 4 -3 d 3 -5 d 4 2 d 4 -2 d 3 1 d 4 -3 d 7 X 4 -1 d 3 -2 d 4 -1 d 4 -1 d 3 1 d 4 -2 d 4 X 3 -2 d 4 X 3 1 d 4 -1 d 4 -1 d 3 -1 d 15 X 3 -2 d 4 1 d 4 -1 d
 7 X 4 -2 d 3 X 4 1 d 3 -2 d 4 2 d 4 -1 d 3 -1 d 4 X 4 -1 d 3 1 d 4 -1 d 11 X 3 1 d 4 -2 d 7 X 4 1 d 4 -1 d 3 1 d 4 -1 d 3 -1 d 4 -1 d 4 3 d 3 -1 d 8 X 3 -1 d 22 X 4 1 d 3 X 4 -1 d 3 X 4 1 d 4 -1 d 18 X 4 -2 d 3 1 d 4 X 3 1 d 11 X 4 -1 d 4 1 d 10 X 4
 -1 d 4 1 d 7 X 4 -1 d 3 X 4 1 d 3 -1 d 4 1 d 4 -1 d 3 1 d 4 1 d 4 X 3 -1 d 4 -1 d 3 X 4 1 d 4 X 3 -1 d 4 1 d 4 -2 d 3 2 d 4 1 d 4 X 3 -1 d -1 Y -3 1 d -4 X -4 -1 d -3 -2 d -4 1 d -4 X -3 1 d -4 X -4 -2 d -3 1 d -4 X -3 2 d -4 X -4 -2 d -3 X -4 1 d
 -4 -1 d -3 X -4 -1 d -3 1 d -4 X -4 1 d -3 -1 d -4 X -4 1 d -7 X -3 -1 d -4 -1 d -4 2 d -3 -1 d -4 X -4 1 d -3 -1 d -4 X -3 -1 d -4 2 d -15 X -3 -1 d -4 1 d -4 X -3 -1 d -4 2 d -3 X -4 -1 d -18 X -4 -1 d -3 2 d -4 -1 d -4 1 d -3 X -4 -2 d -4 X -3 1
 d -4 2 d -3 -1 d -4 1 d -4 -2 d -3 1 d -4 X -4 2 d -3 -2 d -4 X -3 1 d -4 X -4 1 d -3 -1 d -4 X -4 1 d -3 1 d -4 X -4 -1 d -3 1 d -4 -1 d -3 X -4 2 d -4 X -3 1 d -4 X -4 -1 d -3 2 d -11 X -4 1 d -3 X -4 1 d -4 1 d -3 -1 d -4 1 d -3 1 d -4 X -4 2 d
 -3 X -4 1 d -4 X -3 2 d -4 1 d -7 X -4 2 d -3 -1 d -4 2 d -4 -1 d -3 4 d -4 3 d -4 -2 d -3 3 d -4 X -3 3 d -4 X -4 2 d -3 4 d -4 X -4 3 d -3 X -4 1 d -3 1 d -4 X -4 10 d -3 -2 d -4 7 d -4 -1 d -3 2 d -4 4 d -3 1 d -4 2 d -4 6 d -3 7 d -4 2 d -4 2 d
 -3 5 d -4 3 d -3 1 d -4 5 d -4 10 d -3 3 d -4 2 d -4 9 d -3 5 d -4 11 d -3 3 d -4 7 d -4 2 d -3 12 d -4 9 d -4 13 d -3 7 d -4 9 d -4 4 d -3 21 d -4 8 d -3 17 d -4 12 d -4 12 d -3 3 d -4 29 d -4 13 d -3 16 d -4 17 d -3 13 d -4 26 d -4 24 d -3 18 d -4
 13 d -4 20 d -3 34 d -4 8 d -3 35 d -4 37 d -4 19 d -3 33 d -4 28 d -4 46 d -3 25 d -4 27 d -3 34 d -4 22 d -4 30 d -3 35 d -4 35 d -4 42 d -3 25 d -4 38 d -4 24 d -3 25 d -4 41 d -3 16 d -4 35 d -4 19 d -3 11 d -4 16 d -4 16 d -3 33 d -4 2 d -3 X
 -4 3 d -4 8 d -3 4 d -4 -21 d -4 -3 d -3 3 d -4 -16 d -3 -2 d -4 -16 d -4 2 d -3 -32 d -4 -13 d -4 -28 d -3 -13 d -4 -13 d -3 -22 d -4 -18 d -4 -8 d -3 -23 d -4 -31 d -4 -14 d -3 -12 d -4 -28 d -4 -14 d -3 -20 d -4 -20 d -3 -18 d -4 -14 d -4 -14 d
 -3 -27 d -4 -12 d -4 -6 d -3 -31 d -4 -1 d -3 -20 d -4 -23 d -4 -6 d -3 -10 d -4 -17 d -4 -6 d -3 -19 d -4 -6 d -3 -10 d -4 -19 d -4 -8 d -3 -23 d -4 -4 d -4 -16 d -3 -15 d -4 3 d -3 -10 d -4 -16 d -4 -10 d -3 1 d -4 -22 d -4 5 d -3 -13 d -4 -2 d -3
 -5 d -4 -16 d -4 -4 d -3 -5 d -4 -14 d -4 -4 d -3 -10 d -4 -6 d -4 1 d -3 -22 d -4 4 d -3 -10 d -4 1 d -4 -8 d -3 -17 d -4 7 d -4 -9 d -3 -9 d -4 -10 d -3 10 d -4 -25 d -4 11 d -3 -14 d -4 3 d -4 -1 d -3 -3 d -4 -13 d -3 -12 d -4 X -4 -5 d -3 -6 d
 -4 -4 d -4 -4 d -3 -5 d -4 11 d -3 -20 d -4 -6 d -4 -4 d -3 2 d -4 -7 d -4 -6 d -3 -2 d -4 -5 d -4 -6 d -3 -3 d -4 -12 d -3 7 d -4 -10 d -4 -6 d -3 -5 d -4 -3 d -4 -7 d -3 4 d -4 -10 d -3 -9 d -4 2 d -4 -15 d -3 1 d -4 -12 d -4 -4 d -3 -4 d -4 -11 d
 -3 X -4 -4 d -4 1 d -3 -15 d -4 -5 d -4 -4 d -3 -11 d -4 9 d -3 -13 d -4 2 d -4 -4 d -3 -6 d -4 6 d -4 -10 d -3 3 d -4 X -4 -7 d -3 4 d -4 -2 d -3 -3 d -4 -1 d -4 -2 d -3 -5 d -4 3 d -4 -2 d -3 7 d -4 -9 d -3 -2 d -4 X -4 -1 d -3 X -4 -7 d -4 3 d -7
 X -3 -2 d -4 1 d -4 -1 d -3 1 d -4 1 d -4 -5 d -3 2 d -4 1 d -7 X -4 2 d -3 -4 d -8 X -3 -3 d -4 4 d -3 -1 d -4 -2 d -4 4 d -3 -3 d -4 -2 d -4 2 d -3 -4 d -4 2 d -4 5 d -3 X -4 -3 d -3 2 d -4 -1 d -4 -5 d -3 X -4 5 d -4 -3 d -3 -2 d -4 X -3 2 d -4
 -3 d -4 2 d -3 -3 d -4 1 d -4 -2 d -3 4 d -4 -4 d -3 -4 d -4 -2 d -4 -2 d -3 10 d -4 -1 d -4 -13 d -3 9 d -4 -10 d -7 X -4 -3 d -3 -9 d -4 -1 d -4 -3 d -3 -7 d -4 -9 d -4 -5 d -3 -15 d -4 -9 d -3 -3 d -4 -2 d -4 -1 d -3 X -4 -1 d -4 X -3 -1 d -261 X
 FA 3 lw 0.8 0 0 c 1 0 0 c 0.8 0 0 c 227 680 m 341 X 1 Y 11 X -1 Y 3 X 1 Y 62 X 1 Y 11 X -1 Y 4 X 1 Y 21 X 1 Y 4 X -1 Y 4 X 1 Y 18 X 1 Y 3 X -1 Y 8 X 1 Y 25 X 1 Y 11 X 1 Y 11 X 1 Y 3 X -1 Y 4 X 1 Y 15 X 1 Y 3 X 1 Y 11 X 1 Y 7 X 1 Y 11 X 1 Y 7 X 1 Y 8
 X 2 Y 3 X 1 Y 8 X 1 Y 3 X 1 Y 4 X 1 Y 3 X 1 Y 4 X 1 Y 4 X 3 Y 7 X 2 Y 4 X 1 Y 3 X 2 Y 4 X 1 Y 4 X 1 Y 3 X 2 Y 4 X 2 Y 3 X 2 Y 4 X 2 Y 4 X 3 Y 3 X -2 Y 4 X 2 Y 4 X 4 Y 3 X -1 Y 4 X 3 Y 3 X 3 Y 8 X 3 Y 3 X -3 Y 4 X 3 Y 4 X 4 Y 3 X 2 Y 4 X 4 Y 3 X -1 Y
 4 X 2 Y 4 X 1 Y 3 X 6 Y 4 X -1 Y 4 X 3 Y 3 X 4 Y 4 X 1 Y 3 X 6 Y 4 X 1 Y 4 X 2 Y 3 X 2 Y 4 X 7 Y 4 X 4 Y 3 X 2 Y 4 X 1 Y 3 X -1 Y 4 X 2 Y 4 X 4 Y 3 X 8 Y 4 X 1 Y 4 X 5 Y 3 X 1 Y 4 X 7 Y 4 X 7 Y 3 X 1 Y 4 X 6 Y 3 X 2 Y 4 X 4 Y 7 X 9 Y 8 X 11 Y 3 X 3
 Y 4 X 5 Y 3 X 11 Y 4 X 2 Y 4 X 1 Y 3 X 10 Y 4 X 3 Y 4 X 11 Y 3 X 1 Y 4 X 5 Y 3 X 8 Y 4 X 10 Y 4 X 7 Y 3 X 11 Y 4 X 14 Y 4 X -4 Y 3 X 14 Y 4 X 12 Y 3 X 10 Y 4 X 7 Y 4 X 15 Y 3 X 7 Y 4 X 9 Y 4 X 16 Y 3 X 10 Y 4 X 9 Y 4 X 13 Y 3 X 22 Y 4 X 6 Y 3 X 7 Y
 4 X 26 Y 4 X 6 Y 3 X 17 Y 4 X 20 Y 4 X 12 Y 3 X 34 Y 4 X 6 Y 3 X 21 Y 4 X 16 Y 4 X 16 Y 3 X 29 Y 4 X 20 Y 4 X 27 Y 3 X 14 Y 4 X 18 Y 3 X 34 Y 4 X 21 Y 4 X 32 Y 3 X 20 Y 4 X 17 Y 4 X 25 Y 3 X 29 Y 4 X 20 Y 3 X 26 Y 4 X 32 Y 4 X 23 Y 3 X 28 Y 4 X 8 Y
 4 X 25 Y 3 X 13 Y 4 X 16 Y 4 X 27 Y 3 X 6 Y 4 X 12 Y 3 X 4 Y 4 X 18 Y 4 X 1 Y 3 X 4 Y 4 X 2 Y 4 X -5 Y 3 X -4 Y 4 X -11 Y 3 X -7 Y 4 X -24 Y 4 X 4 Y 3 X -12 Y 4 X -25 Y 4 X -15 Y 3 X -33 Y 4 X -17 Y 3 X -24 Y 4 X -24 Y 4 X -14 Y 3 X -33 Y 4 X -23 Y
 4 X -24 Y 3 X -27 Y 4 X -23 Y 3 X -34 Y 4 X -27 Y 4 X -21 Y 3 X -28 Y 4 X -12 Y 4 X -22 Y 3 X -31 Y 4 X -17 Y 3 X -23 Y 4 X -20 Y 4 X -29 Y 3 X -15 Y 4 X -12 Y 4 X -22 Y 3 X -22 Y 4 X -5 Y 4 X -23 Y 3 X -19 Y 4 X -16 Y 3 X -11 Y 4 X -9 Y 4 X -28 Y 7
 X -6 Y 4 X -18 Y 3 X -8 Y 4 X -10 Y 3 X -7 Y 4 X -15 Y 4 X -3 Y 3 X -17 Y 4 X -9 Y 4 X -6 Y 3 X -13 Y 4 X -12 Y 7 X -5 Y 4 X -7 Y 3 X -4 Y 4 X -17 Y 4 X -8 Y 3 X -3 Y 4 X -2 Y 3 X -2 Y 4 X -10 Y 4 X -6 Y 3 X -4 Y 4 X -5 Y 4 X -1 Y 3 X -6 Y 4 X -6 Y
 4 X -2 Y 3 X -3 Y 4 X -1 Y 3 X -10 Y 4 X -3 Y 4 X -3 Y 3 X -1 Y 4 X -9 Y 7 X -2 Y 4 X -3 Y 3 X -3 Y 4 X -1 Y 4 X -3 Y 3 X -4 Y 4 X -4 Y 4 X -2 Y 3 X -6 Y 4 X 4 Y 3 X -2 Y 4 X -4 Y 7 X -6 Y 8 X -2 Y 3 X -3 Y 4 X 1 Y 3 X -3 Y 4 X -4 Y 4 X -5 Y 3 X 3 Y
 4 X -1 Y 7 X -3 Y 4 X -3 Y 7 X -2 Y 4 X -1 Y 3 X -2 Y 4 X -3 Y 4 X 3 Y 3 X -3 Y 4 X -3 Y 4 X -3 Y 3 X 1 Y 4 X 2 Y 3 X -2 Y 4 X -1 Y 7 X -2 Y 4 X -2 Y 4 X -3 Y 3 X 1 Y 4 X -2 Y 3 X 1 Y 4 X 1 Y 4 X -2 Y 3 X -1 Y 4 X -3 Y 14 X -2 Y 4 X -1 Y 4 X -1 Y 3
 X 1 Y 4 X -2 Y 4 X -1 Y 3 X 1 Y 11 X -1 Y 4 X -1 Y 7 X -1 Y 4 X -1 Y 3 X -3 Y 4 X 1 Y 4 X -1 Y 14 X -1 Y 7 X -1 Y 4 X 1 Y 4 X -1 Y 7 X -1 Y 7 X -1 Y 4 X -3 Y 3 X 1 Y 4 X -1 Y 7 X -1 Y 4 X 2 Y 3 X -1 Y 8 X 1 Y 3 X -1 Y 4 X -1 Y 7 X 1 Y 4 X -2 Y 7 X
 -1 Y 7 X -1 Y 4 X 1 Y 4 X -1 Y 3 X 1 Y 8 X -2 Y 3 X -1 Y 4 X 2 Y 3 X -2 Y 4 X 2 Y 4 X -2 Y 7 X -1 Y 4 X 1 Y 10 X -1 Y 11 X -1 Y 4 X s 1 0 0 c 229 680 m20 232 680 m20 236 680 m20 239 680 m20 243 680 m20 247 680 m20 250 680 m20 254 680 m20 258 680 m20
 261 680 m20 265 680 m20 268 680 m20 272 680 m20 276 680 m20 279 680 m20 283 680 m20 287 680 m20 290 680 m20 294 680 m20 298 680 m20 301 680 m20 305 680 m20 308 680 m20 312 680 m20 316 680 m20 319 680 m20 323 680 m20 327 680 m20 330 680 m20 334 680
 m20 337 680 m20 341 680 m20 345 680 m20 348 680 m20 352 680 m20 356 680 m20 359 680 m20 363 680 m20 366 680 m20 370 680 m20 374 680 m20 377 680 m20 381 680 m20 385 680 m20 388 680 m20 392 680 m20 395 680 m20 399 680 m20 403 680 m20 406 680 m20 410
 680 m20 414 680 m20 417 680 m20 421 680 m20 425 680 m20 428 680 m20 432 680 m20 435 680 m20 439 680 m20 443 680 m20 446 680 m20 450 680 m20 454 680 m20 457 680 m20 461 680 m20 464 680 m20 468 680 m20 472 680 m20 475 680 m20 479 680 m20 483 680 m20
 486 680 m20 490 680 m20 493 680 m20 497 680 m20 501 680 m20 504 680 m20 508 680 m20 512 680 m20 515 680 m20 519 680 m20 522 680 m20 526 680 m20 530 680 m20 533 680 m20 537 680 m20 541 680 m20 544 680 m20 548 680 m20 552 680 m20 555 680 m20 559 680
 m20 562 680 m20 566 680 m20 570 681 m20 573 681 m20 577 681 m20 581 680 m20 584 681 m20 588 681 m20 591 681 m20 595 681 m20 599 681 m20 602 681 m20 606 681 m20 610 681 m20 613 681 m20 617 681 m20 620 681 m20 624 681 m20 628 681 m20 631 681 m20 635
 681 m20 639 681 m20 642 681 m20 646 682 m20 649 682 m20 653 682 m20 657 681 m20 660 682 m20 664 682 m20 668 682 m20 671 682 m20 675 682 m20 679 682 m20 682 683 m20 686 682 m20 689 683 m20 693 683 m20 697 683 m20 700 683 m20 704 683 m20 708 684 m20
 711 683 m20 715 683 m20 718 684 m20 722 684 m20 726 684 m20 729 684 m20 733 684 m20 737 684 m20 740 684 m20 744 685 m20 747 685 m20 751 685 m20 755 686 m20 758 686 m20 762 686 m20 766 687 m20 769 686 m20 773 687 m20 776 687 m20 780 687 m20 784 687
 m20 787 688 m20 791 689 m20 795 689 m20 798 689 m20 802 690 m20 805 690 m20 809 691 m20 813 691 m20 816 691 m20 820 692 m20 824 692 m20 827 693 m20 831 693 m20 835 695 m20 838 696 m20 842 696 m20 845 697 m20 849 698 m20 853 699 m20 856 700 m20 860
 701 m20 864 704 m20 867 704 m20 871 706 m20 874 707 m20 878 709 m20 882 710 m20 885 711 m20 889 713 m20 893 715 m20 896 717 m20 900 719 m20 903 722 m20 907 720 m20 911 722 m20 914 726 m20 918 725 m20 922 728 m20 925 731 m20 929 731 m20 932 734 m20
 936 731 m20 940 734 m20 943 738 m20 947 740 m20 951 744 m20 954 743 m20 958 745 m20 962 746 m20 965 752 m20 969 751 m20 972 754 m20 976 758 m20 980 759 m20 983 765 m20 987 766 m20 991 768 m20 994 770 m20 998 777 m20 1001 781 m20 1005 783 m20 1009
 784 m20 1012 783 m20 1016 785 m20 1020 789 m20 1023 797 m20 1027 798 m20 1030 803 m20 1034 804 m20 1038 811 m20 1041 818 m20 1045 819 m20 1049 825 m20 1052 827 m20 1056 831 m20 1059 831 m20 1063 840 m20 1067 840 m20 1070 851 m20 1074 854 m20 1078
 859 m20 1081 870 m20 1085 872 m20 1089 873 m20 1092 883 m20 1096 886 m20 1099 897 m20 1103 898 m20 1107 903 m20 1110 911 m20 1114 921 m20 1118 928 m20 1121 939 m20 1125 953 m20 1128 949 m20 1132 963 m20 1136 975 m20 1139 985 m20 1143 992 m20 1147
 1007 m20 1150 1014 m20 1154 1023 m20 1157 1039 m20 1161 1049 m20 1165 1058 m20 1168 1071 m20 1172 1093 m20 1176 1099 m20 1179 1106 m20 1183 1132 m20 1186 1138 m20 1190 1155 m20 1194 1175 m20 1197 1187 m20 1201 1221 m20 1205 1227 m20 1208 1248 m20
 1212 1264 m20 1215 1280 m20 1219 1309 m20 1223 1329 m20 1226 1356 m20 1230 1370 m20 1234 1388 m20 1237 1422 m20 1241 1443 m20 1245 1475 m20 1248 1495 m20 1252 1512 m20 1255 1537 m20 1259 1566 m20 1263 1586 m20 1266 1612 m20 1270 1644 m20 1274 1667
 m20 1277 1695 m20 1281 1703 m20 1284 1728 m20 1288 1741 m20 1292 1757 m20 1295 1784 m20 1299 1790 m20 1303 1802 m20 1306 1806 m20 1310 1824 m20 1313 1825 m20 1317 1829 m20 1321 1831 m20 1324 1826 m20 1328 1822 m20 1332 1811 m20 1335 1804 m20 1339
 1780 m20 1342 1784 m20 1346 1772 m20 1350 1747 m20 1353 1732 m20 1357 1699 m20 1361 1682 m20 1364 1658 m20 1368 1634 m20 1372 1620 m20 1375 1587 m20 1379 1564 m20 1382 1540 m20 1386 1513 m20 1390 1490 m20 1393 1456 m20 1397 1429 m20 1401 1408 m20
 1404 1380 m20 1408 1368 m20 1411 1346 m20 1415 1315 m20 1419 1298 m20 1422 1275 m20 1426 1255 m20 1430 1226 m20 1433 1211 m20 1437 1199 m20 1440 1177 m20 1444 1155 m20 1448 1150 m20 1451 1127 m20 1455 1108 m20 1459 1092 m20 1462 1081 m20 1466 1072
 m20 1469 1044 m20 1473 1044 m20 1477 1038 m20 1480 1020 m20 1484 1012 m20 1488 1002 m20 1491 995 m20 1495 980 m20 1499 977 m20 1502 960 m20 1506 951 m20 1509 945 m20 1513 932 m20 1517 920 m20 1520 920 m20 1524 915 m20 1528 908 m20 1531 904 m20 1535
 887 m20 1538 879 m20 1542 876 m20 1546 874 m20 1549 872 m20 1553 862 m20 1557 856 m20 1560 852 m20 1564 847 m20 1567 846 m20 1571 840 m20 1575 834 m20 1578 832 m20 1582 829 m20 1586 828 m20 1589 818 m20 1593 815 m20 1596 812 m20 1600 811 m20 1604
 802 m20 1607 802 m20 1611 800 m20 1615 797 m20 1618 794 m20 1622 793 m20 1625 790 m20 1629 786 m20 1633 782 m20 1636 780 m20 1640 774 m20 1644 778 m20 1647 776 m20 1651 772 m20 1655 772 m20 1658 766 m20 1662 766 m20 1665 764 m20 1669 761 m20 1673
 762 m20 1676 759 m20 1680 755 m20 1684 750 m20 1687 753 m20 1691 752 m20 1694 752 m20 1698 749 m20 1702 746 m20 1705 746 m20 1709 744 m20 1713 743 m20 1716 741 m20 1720 738 m20 1723 741 m20 1727 738 m20 1731 735 m20 1734 732 m20 1738 733 m20 1742
 735 m20 1745 733 m20 1749 732 m20 1752 732 m20 1756 730 m20 1760 728 m20 1763 725 m20 1767 726 m20 1771 724 m20 1774 725 m20 1778 726 m20 1782 724 m20 1785 723 m20 1789 720 m20 1792 720 m20 1796 720 m20 1800 720 m20 1803 718 m20 1807 717 m20 1811
 716 m20 1814 717 m20 1818 715 m20 1821 714 m20 1825 715 m20 1829 715 m20 1832 715 m20 1836 714 m20 1840 713 m20 1843 713 m20 1847 712 m20 1850 711 m20 1854 708 m20 1858 709 m20 1861 708 m20 1865 708 m20 1869 708 m20 1872 708 m20 1876 707 m20 1879
 707 m20 1883 706 m20 1887 707 m20 1890 706 m20 1894 706 m20 1898 705 m20 1901 705 m20 1905 704 m20 1909 701 m20 1912 702 m20 1916 701 m20 1919 701 m20 1923 700 m20 1927 702 m20 1930 701 m20 1934 701 m20 1938 702 m20 1941 701 m20 1945 700 m20 1948
 700 m20 1952 701 m20 1956 699 m20 1959 699 m20 1963 698 m20 1967 698 m20 1970 697 m20 1974 698 m20 1977 697 m20 1981 698 m20 1985 698 m20 1988 696 m20 1992 695 m20 1996 697 m20 1999 695 m20 2003 697 m20 2006 695 m20 2010 695 m20 2014 694 m20 2017
 695 m20 2021 695 m20 2025 695 m20 2028 694 m20 2032 694 m20 2036 694 m20 2039 693 m20 0.8 0 0 c black 0.8 0 0 c cs 0.8 0 0 P13 setcolor 229 680 m 337 X 4 1 d 7 X 4 -1 d 3 1 d 55 X 3 1 d 37 X 3 1 d 4 -1 d 3 1 d 15 X 4 1 d 3 -1 d 4 1 d 11 X 3 1 d 4 X
 4 -1 d 3 1 d 4 X 3 1 d 4 -1 d 4 1 d 3 1 d 22 X 4 1 d 3 1 d 4 1 d 4 -1 d 3 1 d 4 1 d 3 -1 d 4 2 d 7 X 4 1 d 7 X 4 1 d 4 2 d 3 X 4 1 d 3 1 d 4 1 d 4 1 d 3 1 d 4 1 d 4 3 d 3 X 4 2 d 3 1 d 4 2 d 4 1 d 3 1 d 4 3 d 4 1 d 3 2 d 4 3 d 3 3 d 4 -2 d 4 1 d 3 5
 d 4 -1 d 4 3 d 3 3 d 4 X 3 3 d 4 -4 d 4 4 d 3 4 d 4 1 d 4 5 d 3 -2 d 4 2 d 4 2 d 3 5 d 4 X 3 3 d 4 4 d 4 1 d 3 6 d 4 1 d 4 2 d 3 2 d 4 7 d 3 4 d 4 2 d 4 1 d 3 -1 d 4 2 d 4 4 d 3 9 d 4 1 d 3 5 d 4 1 d 4 6 d 3 7 d 4 1 d 4 6 d 3 3 d 4 3 d 3 1 d 4 9 d 4
 X 3 10 d 4 4 d 4 5 d 3 11 d 4 2 d 4 1 d 3 10 d 4 3 d 3 11 d 4 1 d 4 5 d 3 8 d 4 11 d 4 6 d 3 12 d 4 13 d 3 -3 d 4 14 d 4 12 d 3 10 d 4 7 d 4 15 d 3 7 d 4 9 d 3 16 d 4 10 d 4 9 d 3 13 d 4 22 d 4 6 d 3 7 d 4 27 d 3 5 d 4 18 d 4 19 d 3 13 d 4 33 d 4 7
 d 3 21 d 4 16 d 3 16 d 4 29 d 4 20 d 3 28 d 4 13 d 4 18 d 3 35 d 4 21 d 4 32 d 3 19 d 4 18 d 3 25 d 4 29 d 4 20 d 3 26 d 4 33 d 4 23 d 3 28 d 4 7 d 3 26 d 4 13 d 4 15 d 3 28 d 4 6 d 4 12 d 3 4 d 4 18 d 3 1 d 4 4 d 4 2 d 3 -5 d 4 -4 d 4 -11 d 3 -7 d
 4 -24 d 3 4 d 4 -12 d 4 -25 d 3 -15 d 4 -34 d 4 -16 d 3 -25 d 4 -24 d 4 -13 d 3 -34 d 4 -22 d 3 -25 d 4 -27 d 4 -23 d 3 -34 d 4 -27 d 4 -22 d 3 -28 d 4 -11 d 3 -23 d 4 -31 d 4 -17 d 3 -23 d 4 -20 d 4 -29 d 3 -15 d 4 -12 d 3 -22 d 4 -23 d 4 -5 d 3
 -22 d 4 -20 d 4 -16 d 3 -11 d 4 -9 d 3 -28 d 4 X 4 -6 d 3 -18 d 4 -8 d 4 -11 d 3 -6 d 4 -15 d 4 -4 d 3 -16 d 4 -9 d 3 -7 d 4 -12 d 4 -13 d 3 X 4 -5 d 4 -7 d 3 -4 d 4 -18 d 3 -7 d 4 -3 d 4 -2 d 3 -2 d 4 -11 d 4 -5 d 3 -4 d 4 -6 d 3 -1 d 4 -5 d 4 -6 d
 3 -2 d 4 -3 d 4 -1 d 3 -10 d 4 -4 d 3 -2 d 4 -1 d 4 -9 d 3 -1 d 4 -1 d 4 -4 d 3 -2 d 4 -2 d 3 -3 d 4 -4 d 4 -3 d 3 -3 d 4 -6 d 4 4 d 3 -2 d 4 -4 d 4 -1 d 3 -5 d 4 X 3 -2 d 4 -3 d 4 X 3 -2 d 4 -4 d 4 -6 d 3 3 d 7 X 4 -3 d 4 -3 d 3 -1 d 4 -2 d 4 X 3
 -2 d 4 -4 d 3 4 d 4 -3 d 4 -4 d 3 -2 d 4 1 d 4 1 d 3 -1 d 4 -1 d 3 X 4 -2 d 4 -2 d 3 -3 d 4 1 d 4 -3 d 3 2 d 4 1 d 4 -2 d 3 -2 d 4 -3 d 11 X 3 -2 d 4 -1 d 7 X 4 -2 d 3 -1 d 4 1 d 7 X 4 -1 d 4 -1 d 3 X 4 -1 d 3 -1 d 4 -3 d 4 1 d 3 -1 d 8 X 3 1 d 4 -1
 d 3 X 4 -2 d 4 2 d 3 -2 d 11 X 4 -2 d 4 -3 d 3 1 d 4 -1 d 3 X 4 -1 d 4 2 d 3 X 4 -1 d 4 1 d 3 -1 d 4 -1 d 3 X 4 1 d 4 -2 d 3 X 4 -1 d 4 X 3 -1 d 4 1 d 3 -1 d 4 1 d 4 X 3 -2 d 4 -1 d 4 2 d 3 -2 d 4 2 d 3 -2 d 4 X 4 -1 d 3 1 d 4 -1 d 4 1 d 3 -1 d 8 X
 3 -1 d -2 Y -3 1 d -8 X -3 1 d -8 X -3 -1 d -4 1 d -4 X -3 2 d -4 -2 d -3 2 d -4 -2 d -4 1 d -3 2 d -4 X -4 -1 d -3 1 d -4 -1 d -3 1 d -4 X -4 1 d -3 X -4 2 d -4 -1 d -3 X -4 1 d -3 1 d -4 -1 d -7 X -4 -1 d -4 1 d -3 X -4 1 d -3 -1 d -4 3 d -4 1 d
 -11 X -3 2 d -4 -1 d -4 1 d -3 X -4 1 d -11 X -3 1 d -4 -1 d -4 3 d -3 1 d -4 1 d -3 X -4 1 d -7 X -4 1 d -4 -1 d -3 1 d -4 2 d -3 -1 d -4 X -4 2 d -3 2 d -11 X -4 3 d -3 1 d -4 2 d -4 -1 d -3 -2 d -4 3 d -4 -1 d -3 3 d -4 2 d -4 2 d -3 X -4 1 d -3
 1 d -4 -1 d -4 -1 d -3 2 d -4 4 d -4 3 d -3 -4 d -4 3 d -3 2 d -4 1 d -4 2 d -3 1 d -4 2 d -4 3 d -3 X -4 1 d -3 -3 d -4 6 d -4 3 d -3 3 d -4 X -4 3 d -3 1 d -4 X -3 6 d -4 X -4 4 d -3 2 d -4 -4 d -4 6 d -3 2 d -4 4 d -4 4 d -3 2 d -4 2 d -3 3 d -4
 3 d -4 2 d -3 X -4 9 d -4 1 d -3 2 d -4 4 d -3 10 d -4 1 d -4 3 d -3 2 d -4 5 d -4 6 d -3 1 d -4 6 d -3 3 d -4 6 d -4 10 d -3 2 d -4 2 d -4 3 d -3 8 d -4 17 d -3 4 d -4 7 d -4 5 d -3 X -4 12 d -4 13 d -3 6 d -4 9 d -3 16 d -4 4 d -4 14 d -3 7 d -4
 11 d -4 7 d -3 18 d -4 6 d -4 1 d -3 27 d -4 9 d -3 10 d -4 16 d -4 20 d -3 23 d -4 4 d -4 23 d -3 22 d -4 11 d -3 15 d -4 29 d -4 20 d -3 22 d -4 18 d -4 31 d -3 22 d -4 12 d -3 27 d -4 21 d -4 28 d -3 33 d -4 23 d -4 27 d -3 24 d -4 22 d -3 34 d
 -4 14 d -4 23 d -3 25 d -4 16 d -4 34 d -3 15 d -4 24 d -4 12 d -3 -3 d -4 23 d -3 7 d -4 11 d -4 4 d -3 5 d -4 -2 d -4 -4 d -3 -1 d -4 -18 d -3 -4 d -4 -12 d -4 -5 d -3 -28 d -4 -16 d -4 -13 d -3 -25 d -4 -7 d -3 -28 d -4 -23 d -4 -33 d -3 -26 d -4
 -19 d -4 -29 d -3 -25 d -4 -17 d -3 -20 d -4 -31 d -4 -21 d -3 -35 d -4 -17 d -4 -14 d -3 -28 d -4 -19 d -4 -29 d -3 -16 d -4 -16 d -3 -21 d -4 -6 d -4 -33 d -3 -13 d -4 -19 d -4 -17 d -3 -6 d -4 -26 d -3 -8 d -4 -5 d -4 -22 d -3 -13 d -4 -9 d -4
 -10 d -3 -16 d -4 -9 d -3 -7 d -4 -14 d -4 -7 d -3 -10 d -4 -12 d -4 -14 d -3 3 d -4 -13 d -3 -11 d -4 -7 d -4 -10 d -3 -8 d -4 -5 d -4 -1 d -3 -11 d -4 -2 d -3 -11 d -4 -1 d -4 -2 d -3 -10 d -4 -5 d -4 -4 d -3 -10 d -4 X -4 -9 d -3 -1 d -4 -3 d -3
 -3 d -4 -6 d -4 -1 d -3 -6 d -4 -7 d -4 -1 d -3 -5 d -4 -1 d -3 -8 d -4 -4 d -4 -2 d -3 1 d -4 -1 d -4 -2 d -3 -4 d -4 -7 d -3 -3 d -4 -1 d -4 -1 d -3 -6 d -4 -1 d -4 -3 d -3 -3 d -4 X -3 -5 d -4 -1 d -4 -2 d -3 1 d -4 -4 d -4 -3 d -3 -4 d -4 -3 d
 -4 3 d -3 -3 d -4 X -3 -3 d -4 -2 d -4 X -3 -4 d -4 -1 d -4 1 d -3 -2 d -4 -3 d -3 -1 d -4 -2 d -4 -3 d -3 -1 d -4 -1 d -4 -1 d -3 -2 d -4 -1 d -3 X -4 -3 d -4 X -3 -2 d -4 -1 d -4 -1 d -3 -1 d -4 X -3 -1 d -4 -2 d -11 X -4 -2 d -7 X -4 -1 d -7 X -3
 -1 d -4 1 d -4 -1 d -3 -1 d -4 -1 d -11 X -3 1 d -4 -1 d -7 X -4 -2 d -4 1 d -3 -1 d -15 X -3 -1 d -4 X -4 1 d -3 -1 d -7 X -4 -1 d -4 1 d -3 X -4 -1 d -7 X -4 1 d -3 -1 d -15 X -4 -1 d -7 X -4 1 d -3 X -4 -1 d -58 X -3 -1 d -4 1 d -4 -1 d -344 X FA
 0 0.4 0 c 1 1 1 c 0.35 0.83 0.33 c 0 0.4 0 c 227 680 m 261 X 1 Y 11 X 1 Y 4 X 1 Y 3 X -1 Y 4 X 4 Y 3 X 5 Y 4 X 10 Y 4 X 12 Y 3 X 6 Y 4 X 10 Y 4 X 5 Y 3 X 8 Y 4 X -2 Y 3 X 7 Y 4 X -1 Y 4 X -8 Y 3 X 12 Y 4 X -4 Y 4 X 4 Y 3 X 6 Y 4 X 4 Y 3 X -10 Y 4 X
 3 Y 4 X -9 Y 3 X 12 Y 4 X -6 Y 4 X -2 Y 3 X 1 Y 4 X 4 Y 3 X -8 Y 4 X 1 Y 4 X 3 Y 3 X 8 Y 4 X -4 Y 4 X 2 Y 3 X -5 Y 4 X -10 Y 4 X 1 Y 3 X -4 Y 4 X 10 Y 3 X 6 Y 4 X -4 Y 4 X 3 Y 3 X -4 Y 4 X -5 Y 7 X -3 Y 4 X 6 Y 3 X 2 Y 4 X -7 Y 4 X -4 Y 3 X 14 Y 4 X
 -13 Y 4 X 9 Y 3 X -3 Y 4 X -1 Y 3 X 7 Y 4 X -10 Y 4 X 3 Y 3 X 1 Y 4 X -4 Y 4 X 4 Y 3 X 2 Y 4 X -4 Y 3 X 3 Y 4 X -4 Y 4 X 1 Y 3 X 2 Y 4 X 2 Y 4 X 2 Y 3 X -7 Y 4 X 10 Y 4 X -2 Y 3 X 2 Y 4 X 4 Y 3 X -1 Y 4 X 2 Y 4 X -5 Y 3 X -1 Y 4 X 3 Y 4 X 9 Y 7 X -1
 Y 3 X 2 Y 4 X 1 Y 4 X 5 Y 3 X 4 Y 4 X -8 Y 7 X 8 Y 4 X -2 Y 3 X 5 Y 8 X 9 Y 7 X -4 Y 4 X 12 Y 3 X -1 Y 4 X 10 Y 3 X 13 Y 4 X -4 Y 4 X 13 Y 3 X -2 Y 4 X 7 Y 4 X 2 Y 3 X 15 Y 4 X 5 Y 4 X -10 Y 3 X 15 Y 4 X 13 Y 3 X -2 Y 4 X 17 Y 4 X -2 Y 3 X 4 Y 4 X
 -8 Y 4 X 17 Y 3 X -4 Y 4 X 28 Y 3 X -5 Y 4 X 2 Y 7 X -5 Y 4 X 12 Y 4 X 7 Y 3 X 4 Y 4 X 8 Y 3 X -2 Y 4 X 4 Y 4 X -2 Y 3 X 23 Y 4 X -5 Y 4 X 7 Y 3 X 3 Y 4 X 2 Y 3 X 11 Y 4 X 1 Y 4 X -2 Y 3 X 9 Y 4 X 24 Y 4 X 4 Y 3 X 8 Y 4 X -13 Y 3 X 9 Y 4 X -4 Y 4 X
 17 Y 3 X 3 Y 4 X 3 Y 4 X 13 Y 3 X -1 Y 4 X 15 Y 4 X 8 Y 3 X 6 Y 4 X -3 Y 3 X 6 Y 4 X 4 Y 4 X 13 Y 3 X 3 Y 4 X 12 Y 4 X 8 Y 3 X 6 Y 4 X 10 Y 3 X 16 Y 4 X 1 Y 4 X 2 Y 3 X 13 Y 4 X 4 Y 4 X 12 Y 3 X 3 Y 4 X 9 Y 3 X 4 Y 4 X 15 Y 4 X 11 Y 3 X 8 Y 4 X 15 Y
 4 X 3 Y 3 X 16 Y 4 X 7 Y 3 X 25 Y 4 X 8 Y 4 X 15 Y 3 X 3 Y 4 X 20 Y 4 X 11 Y 3 X 4 Y 4 X 23 Y 4 X 17 Y 3 X 2 Y 4 X 22 Y 3 X 22 Y 4 X 14 Y 4 X 16 Y 3 X 12 Y 4 X 12 Y 4 X 30 Y 3 X 14 Y 4 X 17 Y 3 X 19 Y 4 X 13 Y 4 X 21 Y 3 X 37 Y 4 X 8 Y 4 X 25 Y 3 X
 11 Y 4 X 13 Y 3 X 36 Y 4 X 12 Y 4 X 13 Y 3 X 24 Y 4 X 16 Y 4 X 16 Y 3 X 35 Y 4 X 13 Y 3 X 17 Y 4 X 21 Y 4 X 11 Y 3 X -3 Y 4 X 17 Y 4 X 3 Y 3 X 8 Y 4 X 2 Y 4 X 12 Y 3 X -10 Y 4 X 3 Y 3 X -5 Y 4 X -3 Y 4 X -34 Y 3 X -14 Y 4 X -10 Y 4 X -13 Y 3 X -13 Y
 4 X -31 Y 3 X -16 Y 4 X -54 Y 4 X -10 Y 3 X -26 Y 4 X -47 Y 4 X -26 Y 3 X -34 Y 4 X -36 Y 3 X -45 Y 4 X -24 Y 4 X -26 Y 3 X -39 Y 4 X -18 Y 4 X -31 Y 3 X -51 Y 4 X -24 Y 3 X -28 Y 4 X -24 Y 4 X -29 Y 3 X -40 Y 4 X -9 Y 4 X -35 Y 3 X -29 Y 4 X -19 Y
 3 X -10 Y 4 X -27 Y 4 X -28 Y 3 X -13 Y 4 X -17 Y 4 X -17 Y 3 X -13 Y 4 X -16 Y 4 X -11 Y 3 X -19 Y 4 X -15 Y 3 X -9 Y 4 X -13 Y 4 X -20 Y 3 X -3 Y 4 X -12 Y 4 X -9 Y 3 X -8 Y 4 X -8 Y 3 X -14 Y 4 X -4 Y 4 X -6 Y 3 X -4 Y 4 X -10 Y 4 X -8 Y 3 X -12
 Y 4 X 1 Y 3 X -7 Y 4 X -9 Y 4 X -4 Y 3 X -1 Y 4 X -5 Y 4 X -6 Y 3 X -1 Y 4 X -1 Y 3 X -7 Y 4 X -7 Y 4 X -3 Y 7 X -3 Y 4 X -2 Y 3 X -2 Y 4 X -6 Y 7 X -7 Y 4 X 1 Y 3 X -2 Y 4 X -1 Y 4 X -1 Y 3 X -2 Y 4 X -3 Y 4 X -5 Y 7 X -1 Y 3 X -2 Y 4 X -1 Y 4 X -3
 Y 3 X 2 Y 4 X -3 Y 4 X -3 Y 10 X -1 Y 4 X -1 Y 4 X -1 Y 3 X -1 Y 8 X -1 Y 3 X -1 Y 4 X -1 Y 7 X -2 Y 7 X -1 Y 4 X -2 Y 4 X 1 Y 3 X -2 Y 4 X 1 Y 4 X -2 Y 7 X 1 Y 3 X -1 Y 8 X -2 Y 3 X 1 Y 4 X -1 Y 7 X 1 Y 4 X -3 Y 3 X 1 Y 8 X -1 Y 3 X 1 Y 8 X -2 Y 7
 X -1 Y 3 X 1 Y 8 X -1 Y 11 X 1 Y 3 X -2 Y 4 X 1 Y 3 X -1 Y 4 X 1 Y 4 X -1 Y 3 X 1 Y 4 X -1 Y 4 X -2 Y 7 X 2 Y 11 X -1 Y 3 X -1 Y 4 X 1 Y 22 X 1 Y 3 X -1 Y 4 X -1 Y 7 X 1 Y 15 X -1 Y 3 X 1 Y 8 X -1 Y 3 X 1 Y 4 X -2 Y 4 X 2 Y 14 X -2 Y 4 X 1 Y 3 X 1 Y
 11 X -1 Y 22 X 1 Y 4 X -1 Y 14 X 2 Y 4 X -1 Y 7 X -1 Y 4 X -1 Y 3 X 2 Y 4 X -1 Y 11 X -1 Y 3 X 1 Y 4 X 1 Y 11 X s 0.35 0.83 0.33 c 229 680 m20 232 680 m20 236 680 m20 239 680 m20 243 680 m20 247 680 m20 250 680 m20 254 680 m20 258 680 m20 261 680
 m20 265 680 m20 268 680 m20 272 680 m20 276 680 m20 279 680 m20 283 680 m20 287 680 m20 290 680 m20 294 680 m20 298 680 m20 301 680 m20 305 680 m20 308 680 m20 312 680 m20 316 680 m20 319 680 m20 323 680 m20 327 680 m20 330 680 m20 334 680 m20 337
 680 m20 341 680 m20 345 680 m20 348 680 m20 352 680 m20 356 680 m20 359 680 m20 363 680 m20 366 680 m20 370 680 m20 374 680 m20 377 680 m20 381 680 m20 385 680 m20 388 680 m20 392 680 m20 395 680 m20 399 680 m20 403 680 m20 406 680 m20 410 680 m20
 414 680 m20 417 680 m20 421 680 m20 425 680 m20 428 680 m20 432 680 m20 435 680 m20 439 680 m20 443 680 m20 446 680 m20 450 680 m20 454 680 m20 457 680 m20 461 680 m20 464 680 m20 468 680 m20 472 680 m20 475 680 m20 479 680 m20 483 680 m20 486 680
 m20 490 681 m20 493 681 m20 497 681 m20 501 682 m20 504 683 m20 508 682 m20 512 686 m20 515 691 m20 519 701 m20 522 713 m20 526 719 m20 530 729 m20 533 734 m20 537 742 m20 541 740 m20 544 747 m20 548 746 m20 552 738 m20 555 750 m20 559 746 m20 562
 750 m20 566 756 m20 570 760 m20 573 750 m20 577 753 m20 581 744 m20 584 756 m20 588 750 m20 591 748 m20 595 749 m20 599 753 m20 602 745 m20 606 746 m20 610 749 m20 613 757 m20 617 753 m20 620 755 m20 624 750 m20 628 740 m20 631 741 m20 635 737 m20
 639 747 m20 642 753 m20 646 749 m20 649 752 m20 653 748 m20 657 743 m20 660 743 m20 664 740 m20 668 746 m20 671 748 m20 675 741 m20 679 737 m20 682 751 m20 686 738 m20 689 747 m20 693 744 m20 697 743 m20 700 750 m20 704 740 m20 708 743 m20 711 744
 m20 715 740 m20 718 744 m20 722 746 m20 726 742 m20 729 745 m20 733 741 m20 737 742 m20 740 744 m20 744 746 m20 747 748 m20 751 741 m20 755 751 m20 758 749 m20 762 751 m20 766 755 m20 769 754 m20 773 756 m20 776 751 m20 780 750 m20 784 753 m20 787
 762 m20 791 762 m20 795 761 m20 798 763 m20 802 764 m20 805 769 m20 809 773 m20 813 765 m20 816 765 m20 820 773 m20 824 771 m20 827 776 m20 831 776 m20 835 785 m20 838 785 m20 842 781 m20 845 793 m20 849 792 m20 853 802 m20 856 815 m20 860 811 m20
 864 824 m20 867 822 m20 871 829 m20 874 831 m20 878 846 m20 882 851 m20 885 841 m20 889 856 m20 893 869 m20 896 867 m20 900 884 m20 903 882 m20 907 886 m20 911 878 m20 914 895 m20 918 891 m20 922 919 m20 925 914 m20 929 916 m20 932 916 m20 936 911
 m20 940 923 m20 943 930 m20 947 934 m20 951 942 m20 954 940 m20 958 944 m20 962 942 m20 965 965 m20 969 960 m20 972 967 m20 976 970 m20 980 972 m20 983 983 m20 987 984 m20 991 982 m20 994 991 m20 998 1015 m20 1001 1019 m20 1005 1027 m20 1009 1014
 m20 1012 1023 m20 1016 1019 m20 1020 1036 m20 1023 1039 m20 1027 1042 m20 1030 1055 m20 1034 1054 m20 1038 1069 m20 1041 1077 m20 1045 1083 m20 1049 1080 m20 1052 1086 m20 1056 1090 m20 1059 1103 m20 1063 1106 m20 1067 1118 m20 1070 1126 m20 1074
 1132 m20 1078 1142 m20 1081 1158 m20 1085 1159 m20 1089 1161 m20 1092 1174 m20 1096 1178 m20 1099 1190 m20 1103 1193 m20 1107 1202 m20 1110 1206 m20 1114 1221 m20 1118 1232 m20 1121 1240 m20 1125 1255 m20 1128 1258 m20 1132 1274 m20 1136 1281 m20
 1139 1306 m20 1143 1314 m20 1147 1329 m20 1150 1332 m20 1154 1352 m20 1157 1363 m20 1161 1367 m20 1165 1390 m20 1168 1407 m20 1172 1409 m20 1176 1431 m20 1179 1453 m20 1183 1467 m20 1186 1483 m20 1190 1495 m20 1194 1507 m20 1197 1537 m20 1201 1551
 m20 1205 1568 m20 1208 1587 m20 1212 1600 m20 1215 1621 m20 1219 1658 m20 1223 1666 m20 1226 1691 m20 1230 1702 m20 1234 1715 m20 1237 1751 m20 1241 1763 m20 1245 1776 m20 1248 1800 m20 1252 1816 m20 1255 1832 m20 1259 1867 m20 1263 1880 m20 1266
 1897 m20 1270 1918 m20 1274 1929 m20 1277 1926 m20 1281 1943 m20 1284 1946 m20 1288 1954 m20 1292 1956 m20 1295 1968 m20 1299 1958 m20 1303 1961 m20 1306 1956 m20 1310 1953 m20 1313 1919 m20 1317 1905 m20 1321 1895 m20 1324 1882 m20 1328 1869 m20
 1332 1838 m20 1335 1822 m20 1339 1768 m20 1342 1758 m20 1346 1732 m20 1350 1685 m20 1353 1659 m20 1357 1625 m20 1361 1589 m20 1364 1544 m20 1368 1520 m20 1372 1494 m20 1375 1455 m20 1379 1437 m20 1382 1406 m20 1386 1355 m20 1390 1331 m20 1393 1303
 m20 1397 1279 m20 1401 1250 m20 1404 1210 m20 1408 1201 m20 1411 1166 m20 1415 1137 m20 1419 1118 m20 1422 1108 m20 1426 1081 m20 1430 1053 m20 1433 1040 m20 1437 1023 m20 1440 1006 m20 1444 993 m20 1448 977 m20 1451 966 m20 1455 947 m20 1459 932
 m20 1462 923 m20 1466 910 m20 1469 890 m20 1473 887 m20 1477 875 m20 1480 866 m20 1484 858 m20 1488 850 m20 1491 836 m20 1495 832 m20 1499 826 m20 1502 822 m20 1506 812 m20 1509 804 m20 1513 792 m20 1517 793 m20 1520 786 m20 1524 777 m20 1528 773
 m20 1531 772 m20 1535 767 m20 1538 761 m20 1542 760 m20 1546 759 m20 1549 752 m20 1553 745 m20 1557 742 m20 1560 742 m20 1564 739 m20 1567 737 m20 1571 735 m20 1575 729 m20 1578 729 m20 1582 722 m20 1586 723 m20 1589 721 m20 1593 720 m20 1596 719
 m20 1600 717 m20 1604 714 m20 1607 709 m20 1611 709 m20 1615 708 m20 1618 706 m20 1622 705 m20 1625 702 m20 1629 704 m20 1633 701 m20 1636 698 m20 1640 698 m20 1644 698 m20 1647 697 m20 1651 696 m20 1655 695 m20 1658 694 m20 1662 694 m20 1665 693
 m20 1669 692 m20 1673 691 m20 1676 691 m20 1680 689 m20 1684 689 m20 1687 688 m20 1691 686 m20 1694 687 m20 1698 685 m20 1702 686 m20 1705 684 m20 1709 684 m20 1713 685 m20 1716 684 m20 1720 684 m20 1723 682 m20 1727 683 m20 1731 682 m20 1734 682
 m20 1738 683 m20 1742 680 m20 1745 681 m20 1749 681 m20 1752 680 m20 1756 681 m20 1760 681 m20 1763 679 m20 1767 679 m20 1771 678 m20 1774 679 m20 1778 679 m20 1782 678 m20 1785 678 m20 1789 678 m20 1792 679 m20 1796 677 m20 1800 678 m20 1803 677
 m20 1807 678 m20 1811 677 m20 1814 678 m20 1818 677 m20 1821 675 m20 1825 675 m20 1829 677 m20 1832 677 m20 1836 677 m20 1840 676 m20 1843 675 m20 1847 676 m20 1850 676 m20 1854 676 m20 1858 676 m20 1861 676 m20 1865 676 m20 1869 677 m20 1872 676
 m20 1876 675 m20 1879 675 m20 1883 676 m20 1887 676 m20 1890 676 m20 1894 676 m20 1898 675 m20 1901 676 m20 1905 676 m20 1909 675 m20 1912 676 m20 1916 674 m20 1919 676 m20 1923 676 m20 1927 676 m20 1930 676 m20 1934 674 m20 1938 675 m20 1941 676
 m20 1945 676 m20 1948 676 m20 1952 675 m20 1956 675 m20 1959 675 m20 1963 675 m20 1967 675 m20 1970 675 m20 1974 676 m20 1977 675 m20 1981 675 m20 1985 675 m20 1988 675 m20 1992 677 m20 1996 676 m20 1999 676 m20 2003 675 m20 2006 674 m20 2010 676
 m20 2014 675 m20 2017 675 m20 2021 675 m20 2025 674 m20 2028 675 m20 2032 676 m20 2036 676 m20 2039 676 m20 0 0.4 0 c black 0 0.4 0 c cs 0 0.4 0 P13 setcolor 229 680 m 257 X 4 1 d 7 X 4 2 d 3 1 d 4 -2 d 4 6 d 3 5 d 4 11 d 3 14 d 4 7 d 4 10 d 3 6 d 4
 8 d 4 -3 d 3 9 d 4 -1 d 4 -9 d 3 13 d 4 -4 d 3 3 d 4 7 d 4 5 d 3 -12 d 4 4 d 4 -10 d 3 13 d 4 -7 d 3 -2 d 4 2 d 4 3 d 3 -8 d 4 X 4 4 d 3 8 d 4 -4 d 3 2 d 4 -5 d 4 -11 d 3 1 d 4 -4 d 4 10 d 3 7 d 4 -4 d 3 2 d 4 -4 d 4 -5 d 3 X 4 -4 d 4 7 d 3 2 d 4 -7
 d 4 -5 d 3 15 d 4 -13 d 3 9 d 4 -4 d 4 -1 d 3 8 d 4 -11 d 4 3 d 3 2 d 4 -5 d 3 5 d 4 2 d 4 -5 d 3 3 d 4 -5 d 4 2 d 3 2 d 4 2 d 3 2 d 4 -7 d 4 10 d 3 -2 d 4 2 d 4 4 d 3 X 4 1 d 3 -5 d 4 -1 d 4 3 d 3 9 d 8 X 3 2 d 4 1 d 3 5 d 4 4 d 4 -8 d 3 -1 d 4 9 d
 4 -2 d 3 5 d 4 -1 d 4 10 d 3 X 4 -4 d 3 12 d 4 -1 d 4 10 d 3 13 d 4 -3 d 4 12 d 3 -1 d 4 7 d 3 2 d 4 16 d 4 4 d 3 -10 d 4 16 d 4 13 d 3 -3 d 4 18 d 3 -2 d 4 4 d 4 -8 d 3 17 d 4 -3 d 4 28 d 3 -5 d 4 2 d 3 -1 d 4 -4 d 4 12 d 3 5 d 4 3 d 4 8 d 3 -2 d 4
 3 d 4 -2 d 3 24 d 4 -4 d 3 7 d 4 3 d 4 2 d 3 12 d 4 X 4 -2 d 3 9 d 4 25 d 3 3 d 4 8 d 4 -13 d 3 9 d 4 -4 d 4 17 d 3 2 d 4 4 d 3 13 d 4 -1 d 4 15 d 3 8 d 4 6 d 4 -3 d 3 6 d 4 3 d 3 14 d 4 3 d 4 12 d 3 8 d 4 6 d 4 10 d 3 16 d 4 1 d 4 2 d 3 13 d 4 4 d
 3 12 d 4 4 d 4 9 d 3 3 d 4 15 d 4 11 d 3 8 d 4 15 d 3 3 d 4 16 d 4 7 d 3 25 d 4 8 d 4 15 d 3 4 d 4 20 d 3 11 d 4 3 d 4 24 d 3 16 d 4 2 d 4 23 d 3 21 d 4 14 d 3 17 d 4 11 d 4 13 d 3 30 d 4 14 d 4 17 d 3 19 d 4 12 d 3 22 d 4 37 d 4 8 d 3 25 d 4 11 d 4
 13 d 3 36 d 4 12 d 4 13 d 3 24 d 4 16 d 3 16 d 4 35 d 4 13 d 3 17 d 4 21 d 4 11 d 3 -3 d 4 17 d 3 3 d 4 8 d 4 2 d 3 12 d 4 -10 d 4 3 d 3 -5 d 4 -4 d 3 -33 d 4 -14 d 4 -11 d 3 -13 d 4 -12 d 4 -32 d 3 -16 d 4 -54 d 3 -10 d 4 -27 d 4 -47 d 3 -26 d 4
 -33 d 4 -37 d 3 -45 d 4 -25 d 4 -25 d 3 -39 d 4 -19 d 3 -31 d 4 -51 d 4 -24 d 3 -28 d 4 -25 d 4 -29 d 3 -40 d 4 -9 d 3 -35 d 4 -30 d 4 -18 d 3 -11 d 4 -27 d 4 -28 d 3 -12 d 4 -18 d 3 -17 d 4 -13 d 4 -16 d 3 -12 d 4 -19 d 4 -14 d 3 -9 d 4 -13 d 3 -21
 d 4 -3 d 4 -11 d 3 -10 d 4 -8 d 4 -8 d 3 -14 d 4 -5 d 4 -6 d 3 -3 d 4 -11 d 3 -7 d 4 -13 d 4 2 d 3 -7 d 4 -10 d 4 -4 d 3 -1 d 4 -5 d 3 -6 d 4 -1 d 4 -1 d 3 -7 d 4 -7 d 4 -3 d 3 X 4 -3 d 3 -2 d 4 -2 d 4 -6 d 3 X 4 -7 d 4 1 d 3 -2 d 4 -1 d 3 -1 d 4 -3
 d 4 -3 d 3 -4 d 4 -1 d 4 -1 d 3 -1 d 4 -1 d 3 -3 d 4 2 d 4 -3 d 3 -3 d 4 -1 d 4 X 3 -1 d 4 -1 d 4 -1 d 7 X 3 -2 d 4 -1 d 4 -1 d 3 X 4 -2 d 4 X 3 -1 d 4 -1 d 3 X 4 -1 d 4 X 3 -1 d 4 -1 d 4 1 d 3 -1 d 4 X 3 -2 d 4 1 d 4 -1 d 3 X 4 1 d 4 -3 d 3 1 d 4 X
 3 -1 d 4 1 d 4 X 3 -2 d 4 X 4 -1 d 3 1 d 4 X 4 -1 d 7 X 3 1 d 4 -1 d 4 X 3 -1 d 4 1 d 4 -1 d 3 1 d 4 -1 d 3 -1 d 4 X 4 1 d 11 X 3 -2 d 4 1 d 18 X 4 1 d 3 -1 d 4 -1 d 3 X 4 1 d 22 X 4 -1 d 3 1 d 4 -1 d 3 1 d 11 X 4 -1 d 4 1 d 10 X 4 -1 d 18 X 4 1 d 3
 -1 d 11 X 4 2 d 4 -1 d 3 X 4 -1 d 3 X 4 1 d 4 X 3 -1 d 4 X 4 -1 d 3 2 d 8 X 3 1 d -1 Y -7 X -4 -1 d -3 -2 d -4 2 d -4 -1 d -3 1 d -4 1 d -4 -2 d -3 X -4 1 d -3 1 d -4 X -4 -1 d -7 X -4 -1 d -3 1 d -4 -1 d -3 1 d -15 X -4 1 d -7 X -3 -1 d -4 -1 d -4
 1 d -11 X -3 -1 d -4 2 d -3 -1 d -4 1 d -4 -1 d -7 X -4 1 d -7 X -4 -1 d -3 X -4 1 d -3 1 d -4 -1 d -18 X -4 -1 d -3 1 d -4 1 d -7 X -4 -2 d -4 X -3 2 d -4 1 d -3 -1 d -4 1 d -4 -1 d -3 1 d -4 -1 d -4 2 d -3 -1 d -7 X -4 1 d -4 X -3 -1 d -4 1 d -4 X
 -3 2 d -4 X -4 -1 d -3 1 d -4 X -3 -1 d -4 3 d -4 -1 d -3 X -4 1 d -4 -1 d -3 2 d -4 X -3 1 d -4 -1 d -4 X -3 2 d -4 -1 d -4 1 d -3 X -4 1 d -3 2 d -4 -1 d -4 3 d -3 -1 d -4 2 d -4 X -3 2 d -4 X -3 1 d -4 X -4 1 d -3 1 d -4 X -4 1 d -3 3 d -4 3 d -4
 -2 d -3 3 d -4 1 d -3 1 d -4 1 d -4 1 d -3 4 d -4 3 d -4 3 d -3 X -4 2 d -3 1 d -4 -1 d -4 7 d -3 X -4 6 d -4 2 d -3 2 d -4 3 d -3 X -4 3 d -4 7 d -3 7 d -4 1 d -4 1 d -3 6 d -4 5 d -3 X -4 4 d -4 10 d -3 7 d -4 -2 d -4 13 d -3 7 d -4 10 d -3 4 d -4
 6 d -4 5 d -3 13 d -4 8 d -4 8 d -3 9 d -4 12 d -4 3 d -3 20 d -4 13 d -3 9 d -4 14 d -4 19 d -3 11 d -4 16 d -4 13 d -3 17 d -4 17 d -3 12 d -4 28 d -4 27 d -3 11 d -4 18 d -4 29 d -3 35 d -4 8 d -3 41 d -4 28 d -4 25 d -3 28 d -4 24 d -4 50 d -3
 31 d -4 18 d -3 39 d -4 25 d -4 25 d -3 44 d -4 36 d -4 34 d -3 25 d -4 47 d -4 26 d -3 11 d -4 53 d -3 16 d -4 31 d -4 12 d -3 13 d -4 11 d -4 14 d -3 33 d -4 3 d -3 5 d -4 -3 d -4 10 d -3 -12 d -4 -2 d -4 -8 d -3 -4 d -4 -16 d -3 2 d -4 -11 d -4
 -20 d -3 -17 d -4 -13 d -4 -35 d -3 -16 d -4 -16 d -3 -24 d -4 -13 d -4 -12 d -3 -36 d -4 -13 d -4 -11 d -3 -25 d -4 -8 d -4 -37 d -3 -21 d -4 -13 d -3 -19 d -4 -17 d -4 -14 d -3 -30 d -4 -12 d -4 -11 d -3 -17 d -4 -14 d -3 -21 d -4 -22 d -4 -3 d -3
 -16 d -4 -24 d -4 -3 d -3 -11 d -4 -20 d -3 -4 d -4 -15 d -4 -7 d -3 -25 d -4 -7 d -4 -16 d -3 -3 d -4 -15 d -3 -8 d -4 -11 d -4 -15 d -3 -4 d -4 -9 d -4 -4 d -3 -11 d -4 -4 d -3 -14 d -4 -1 d -4 -2 d -3 -16 d -4 -9 d -4 -6 d -3 -8 d -4 -12 d -4 -3
 d -3 -13 d -4 -4 d -3 -6 d -4 3 d -4 -6 d -3 -8 d -4 -15 d -4 2 d -3 -14 d -4 -3 d -3 -3 d -4 -16 d -4 3 d -3 -9 d -4 12 d -4 -8 d -3 -3 d -4 -24 d -3 -9 d -4 2 d -4 -1 d -3 -11 d -4 -1 d -4 -4 d -3 -6 d -4 5 d -3 -23 d -4 2 d -4 -3 d -3 1 d -4 -8 d
 -4 -5 d -3 -9 d -4 -12 d -4 5 d -3 X -4 -2 d -3 5 d -4 -27 d -4 4 d -3 -16 d -4 7 d -4 -4 d -3 2 d -4 -17 d -3 2 d -4 -12 d -4 -14 d -3 9 d -4 -5 d -4 -14 d -3 -3 d -4 -6 d -3 1 d -4 -12 d -4 4 d -3 -13 d -4 -10 d -4 1 d -3 -12 d -4 4 d -3 X -4 -9 d
 -4 1 d -3 -6 d -4 2 d -4 -8 d -3 1 d -4 7 d -4 -4 d -3 -4 d -4 -1 d -3 -2 d -4 1 d -4 -1 d -3 -8 d -4 -3 d -4 1 d -3 4 d -4 -1 d -3 1 d -4 -4 d -4 -2 d -3 2 d -4 -10 d -4 7 d -3 -2 d -4 -2 d -3 -2 d -4 -1 d -4 4 d -3 -4 d -4 5 d -4 -2 d -3 -4 d -4 4
 d -3 -1 d -4 -3 d -4 9 d -3 -6 d -4 X -4 4 d -3 -9 d -4 12 d -3 -13 d -4 4 d -4 6 d -3 -2 d -4 -5 d -4 2 d -3 X -4 5 d -4 3 d -3 -2 d -4 3 d -3 -6 d -4 -9 d -4 3 d -3 -1 d -4 11 d -4 4 d -3 -2 d -4 4 d -3 -8 d -4 -3 d -4 -1 d -3 7 d -4 -4 d -4 -1 d
 -3 3 d -4 6 d -3 -13 d -4 10 d -4 -4 d -3 10 d -4 -5 d -4 -5 d -3 -4 d -4 3 d -3 -11 d -4 9 d -4 X -3 -6 d -4 1 d -4 -6 d -3 -5 d -4 -9 d -4 -5 d -3 -12 d -4 -8 d -3 -5 d -4 -3 d -4 1 d -3 -1 d -4 X -4 -1 d -264 X FA black 1 1 1 c 567 470 1587 1550
 bf black 1587 1550 m 567 X s 2154 1550 m 470 Y s 2154 2020 m -567 X s 1587 2020 m -470 Y s
 gsave  2268 1568 0 609 C 1728.33 1918.25 t 0 r /Helvetica findfont 72.27 sf 0 0 m (No Int) show NC gr  0.8 0 0 c 1609 1941 m 99 X s black
 gsave  2268 1568 0 609 C 1728.33 1758.71 t 0 r /Helvetica findfont 72.27 sf 0 0 m (With Int) show NC gr  0 0 1 c 1609 1785 m 99 X s black
 gsave  2268 1568 0 609 C 1728.33 1610.57 t 0 r /Helvetica findfont 72.27 sf 0 0 m (Reweighted) show NC gr  0 0.4 0 c 1609 1628 m 99 X s black
 gsave  2268 1568 0 609 C 2222.13 1747.32 t 90 r /Helvetica-BoldOblique findfont 30.4295 sf 0 0 m (LHC HIGGS XS WG 2013) show NC gr  1 1 1 c 2268 609 0 0 bf black 1 1 1 c 1814 457 227 152 bf black 1814 457 227 152 bl 1 1 1 c black 227 152 m 181 X 6 Y
 4 X 451 Y 3 X -457 Y 4 X 457 Y 7 X -376 Y 4 X 372 Y 4 X -231 Y 3 X -132 Y 4 X 19 Y 3 X 348 Y 11 X -79 Y 4 X -289 Y 4 X 368 Y 3 X -257 Y 4 X 214 Y 3 X -227 Y 4 X 270 Y 7 X -49 Y 4 X -236 Y 4 X 171 Y 3 X 2 Y 4 X -116 Y 4 X -42 Y 3 X 270 Y 4 X -229 Y 3
 X -46 Y 4 X 17 Y 4 X 30 Y 3 X -2 Y 4 X -2 Y 4 X 7 Y 3 X -14 Y 4 X 11 Y 3 X 9 Y 4 X 9 Y 4 X 38 Y 3 X -46 Y 4 X 49 Y 4 X -46 Y 3 X 20 Y 4 X -14 Y 3 X 6 Y 4 X -6 Y 4 X 44 Y 3 X -37 Y 4 X 35 Y 4 X -7 Y 3 X 3 Y 4 X -17 Y 3 X 40 Y 4 X -9 Y 4 X -2 Y 3 X
 -40 Y 4 X 17 Y 4 X -2 Y 3 X 27 Y 4 X 35 Y 4 X -5 Y 3 X 45 Y 4 X -54 Y 3 X -35 Y 4 X 25 Y 4 X -7 Y 3 X -2 Y 4 X 15 Y 4 X 17 Y 3 X 7 Y 4 X -25 Y 3 X 1 Y 4 X 20 Y 4 X 36 Y 3 X -70 Y 4 X 48 Y 4 X -36 Y 3 X 19 Y 4 X 2 Y 3 X -18 Y 4 X 43 Y 4 X -18 Y 3 X
 -6 Y 4 X 20 Y 4 X -32 Y 3 X 10 Y 4 X 22 Y 3 X -22 Y 4 X 25 Y 4 X -9 Y 3 X -2 Y 4 X -12 Y 4 X -13 Y 3 X 27 Y 4 X -24 Y 4 X 5 Y 3 X -3 Y 4 X -21 Y 3 X 11 Y 4 X 22 Y 4 X 1 Y 3 X 10 Y 4 X -23 Y 4 X -19 Y 3 X 2 Y 4 X 5 Y 3 X 3 Y 4 X -1 Y 4 X -25 Y 3 X 2
 Y 4 X 28 Y 4 X -5 Y 3 X -4 Y 4 X -8 Y 3 X -1 Y 4 X 10 Y 4 X -31 Y 3 X 27 Y 4 X -8 Y 4 X -8 Y 3 X 9 Y 4 X -13 Y 3 X -4 Y 4 X 5 Y 4 X -18 Y 3 X 2 Y 4 X 5 Y 4 X 2 Y 3 X -20 Y 4 X 9 Y 4 X 15 Y 3 X -4 Y 4 X -22 Y 3 X 14 Y 4 X -12 Y 4 X -3 Y 3 X 3 Y 4 X
 14 Y 4 X -16 Y 3 X 11 Y 4 X -21 Y 3 X -3 Y 4 X 11 Y 4 X 3 Y 3 X 10 Y 4 X -9 Y 4 X -4 Y 3 X 1 Y 4 X -2 Y 11 X 7 Y 3 X -6 Y 4 X -4 Y 4 X -2 Y 3 X 1 Y 4 X 1 Y 3 X -5 Y 4 X 4 Y 4 X 1 Y 3 X 1 Y 4 X -9 Y 4 X -1 Y 3 X -4 Y 4 X 7 Y 3 X 2 Y 4 X -5 Y 4 X 5 Y
 3 X -8 Y 4 X 4 Y 4 X -3 Y 3 X 6 Y 4 X -13 Y 4 X 4 Y 3 X 1 Y 4 X 2 Y 3 X 1 Y 4 X -4 Y 4 X 4 Y 3 X -2 Y 4 X -3 Y 7 X -1 Y 4 X 2 Y 3 X -6 Y 4 X 2 Y 4 X 7 Y 3 X -5 Y 4 X -1 Y 4 X 1 Y 3 X -4 Y 4 X 5 Y 3 X -2 Y 4 X -2 Y 4 X 2 Y 3 X 1 Y 4 X -8 Y 4 X 5 Y 7
 X -1 Y 3 X -1 Y 8 X 1 Y 3 X 2 Y 4 X -5 Y 4 X 3 Y 3 X 1 Y 4 X -3 Y 4 X -2 Y 3 X 1 Y 11 X -4 Y 4 X 4 Y 3 X -1 Y 4 X -1 Y 7 X -1 Y 7 X -1 Y 4 X 2 Y 7 X -5 Y 4 X 4 Y 4 X -3 Y 3 X 1 Y 4 X 4 Y 3 X -3 Y 4 X -1 Y 4 X 1 Y 7 X -1 Y 7 X -1 Y 4 X -1 Y 3 X 3 Y 4
 X -4 Y 4 X 1 Y 3 X 1 Y 8 X -1 Y 3 X -1 Y 4 X 3 Y 4 X -3 Y 3 X 1 Y 4 X -1 Y 3 X 1 Y 11 X -1 Y 4 X -1 Y 4 X 1 Y 3 X -2 Y 4 X -1 Y 7 X 3 Y 4 X -4 Y 3 X 1 Y 4 X 1 Y 7 X -2 Y 7 X 2 Y 4 X -1 Y 7 X 1 Y 4 X -2 Y 4 X 1 Y 3 X 1 Y 4 X -1 Y 3 X -3 Y 4 X 2 Y 4 X
 -4 Y 3 X 2 Y 8 X -1 Y 3 X 4 Y 4 X 3 Y 3 X -5 Y 4 X 2 Y 7 X -1 Y 15 X -11 Y 4 X 7 Y 3 X 4 Y 4 X 2 Y 3 X -8 Y 4 X 4 Y 4 X -1 Y 3 X -2 Y 4 X 2 Y 4 X 2 Y 3 X -6 Y 4 X -1 Y 3 X -1 Y 4 X 3 Y 4 X -1 Y 7 X -2 Y 4 X 3 Y 3 X 5 Y 4 X -8 Y 3 X 9 Y 4 X -2 Y 4 X
 -2 Y 3 X -4 Y 4 X 7 Y 4 X 3 Y 3 X -5 Y 4 X -2 Y 3 X -3 Y 8 X 4 Y 3 X -3 Y 4 X -4 Y 4 X -2 Y 3 X 13 Y 4 X -7 Y 4 X 7 Y 3 X -17 Y 4 X -1 Y 3 X 1 Y 4 X 3 Y 4 X 2 Y 3 X -7 Y 4 X 22 Y 4 X -3 Y 3 X -13 Y 4 X 10 Y 3 X -10 Y 4 X 2 Y 4 X -1 Y 3 X 7 Y 4 X -7
 Y 4 X -16 Y 3 X 18 Y 4 X -23 Y 3 X 24 Y 4 X -18 Y 4 X 13 Y 3 X -1 Y 4 X -12 Y 4 X -3 Y 3 X -12 Y 4 X 7 Y 3 X -1 Y 4 X -6 Y 4 X -6 Y 3 X -1 Y 4 X 12 Y 4 X 24 Y 3 X -7 Y 4 X -44 Y 4 X 7 Y 3 X -1 Y 4 X -6 Y 3 X 12 Y 4 X 9 Y 4 X -47 Y 3 X 30 Y 4 X 21 Y
 4 X -59 Y 3 X -11 Y 4 X -112 Y 7 X 80 Y 4 X -80 Y 3 X 35 Y 4 X -35 Y 4 X 257 Y 3 X 200 Y 4 X -100 Y 3 X 3 Y 4 X 97 Y 4 X -151 Y 3 X 66 Y 4 X 80 Y 4 X -72 Y 3 X -40 Y 4 X -14 Y 3 X 4 Y 4 X -104 Y 4 X 48 Y 3 X 2 Y 4 X -6 Y 4 X -7 Y 3 X 5 Y 4 X -47 Y 4
 X 42 Y 3 X 68 Y 4 X -104 Y 3 X 10 Y 4 X 20 Y 4 X -32 Y 3 X 49 Y 4 X 8 Y 4 X 9 Y 3 X -35 Y 4 X -5 Y 3 X -34 Y 4 X 25 Y 4 X -28 Y 3 X 42 Y 4 X 12 Y 4 X -40 Y 3 X 23 Y 4 X -15 Y 3 X -20 Y 4 X 24 Y 4 X 48 Y 3 X -1 Y 4 X -66 Y 4 X 12 Y 3 X 24 Y 4 X 14 Y
 3 X -55 Y 4 X 32 Y 7 X 5 Y 4 X 3 Y 4 X 10 Y 3 X -37 Y 4 X 1 Y 3 X -15 Y 4 X 30 Y 4 X -1 Y 3 X 14 Y 4 X 5 Y 4 X -11 Y 3 X -25 Y 4 X 23 Y 4 X -29 Y 3 X 23 Y 4 X -44 Y 3 X 71 Y 4 X -34 Y 4 X 10 Y 3 X -20 Y 4 X 9 Y 7 X -17 Y 4 X 20 Y 3 X -8 Y 4 X -29 Y
 4 X 23 Y 3 X 32 Y 4 X s 227 152 m 1814 X s
 gsave  2268 609 0 0 C 1967.63 26.5896 t 0 r /Helvetica findfont 38.0897 sf 0 0 m (WW) show NC gr 
 gsave  2268 609 0 0 C 1922.05 41.7837 t 0 r /Helvetica findfont 57.1345 sf 0 0 m (M) show NC gr  227 167 m -15 Y s 263 160 m -8 Y s 299 160 m -8 Y s 336 160 m -8 Y s 372 160 m -8 Y s 408 167 m -15 Y s 444 160 m -8 Y s 481 160 m -8 Y s 517 160 m -8 Y
 s 553 160 m -8 Y s 590 167 m -15 Y s 626 160 m -8 Y s 662 160 m -8 Y s 698 160 m -8 Y s 735 160 m -8 Y s 771 167 m -15 Y s 807 160 m -8 Y s 844 160 m -8 Y s 880 160 m -8 Y s 916 160 m -8 Y s 952 167 m -15 Y s 989 160 m -8 Y s 1025 160 m -8 Y s 1061
 160 m -8 Y s 1098 160 m -8 Y s 1134 167 m -15 Y s 1170 160 m -8 Y s 1206 160 m -8 Y s 1243 160 m -8 Y s 1279 160 m -8 Y s 1315 167 m -15 Y s 1352 160 m -8 Y s 1388 160 m -8 Y s 1424 160 m -8 Y s 1460 160 m -8 Y s 1497 167 m -15 Y s 1533 160 m -8 Y s
 1569 160 m -8 Y s 1606 160 m -8 Y s 1642 160 m -8 Y s 1678 167 m -15 Y s 1714 160 m -8 Y s 1751 160 m -8 Y s 1787 160 m -8 Y s 1823 160 m -8 Y s 1860 167 m -15 Y s 1896 160 m -8 Y s 1932 160 m -8 Y s 1968 160 m -8 Y s 2005 160 m -8 Y s 2041 167 m
 -15 Y s
 gsave  2268 609 0 0 C 208.919 113.956 t 0 r /Helvetica findfont 45.7076 sf 0 0 m (0) show NC gr 
 gsave  2268 609 0 0 C 368.456 113.956 t 0 r /Helvetica findfont 45.7076 sf 0 0 m (100) show NC gr 
 gsave  2268 609 0 0 C 550.785 113.956 t 0 r /Helvetica findfont 45.7076 sf 0 0 m (200) show NC gr 
 gsave  2268 609 0 0 C 729.316 113.956 t 0 r /Helvetica findfont 45.7076 sf 0 0 m (300) show NC gr 
 gsave  2268 609 0 0 C 911.645 113.956 t 0 r /Helvetica findfont 45.7076 sf 0 0 m (400) show NC gr 
 gsave  2268 609 0 0 C 1093.97 113.956 t 0 r /Helvetica findfont 45.7076 sf 0 0 m (500) show NC gr 
 gsave  2268 609 0 0 C 1276.3 113.956 t 0 r /Helvetica findfont 45.7076 sf 0 0 m (600) show NC gr 
 gsave  2268 609 0 0 C 1458.63 113.956 t 0 r /Helvetica findfont 45.7076 sf 0 0 m (700) show NC gr 
 gsave  2268 609 0 0 C 1637.16 113.956 t 0 r /Helvetica findfont 45.7076 sf 0 0 m (800) show NC gr 
 gsave  2268 609 0 0 C 1819.49 113.956 t 0 r /Helvetica findfont 45.7076 sf 0 0 m (900) show NC gr 
 gsave  2268 609 0 0 C 1986.63 113.956 t 0 r /Helvetica findfont 45.7076 sf 0 0 m (1000) show NC gr  227 152 m 457 Y s
 gsave  2268 609 0 0 C 91.1645 170.933 t 90 r /Helvetica findfont 45.7076 sf 0 0 m (\(S+I\)/\(Reweighted S\)) show NC gr  278 152 m -51 X s 252 164 m -25 X s 252 175 m -25 X s 252 187 m -25 X s 278 198 m -51 X s 252 209 m -25 X s 252 221 m -25 X s
 252 232 m -25 X s 278 244 m -51 X s 252 255 m -25 X s 252 267 m -25 X s 252 278 m -25 X s 278 289 m -51 X s 252 301 m -25 X s 252 312 m -25 X s 252 324 m -25 X s 278 335 m -51 X s 252 347 m -25 X s 252 358 m -25 X s 252 369 m -25 X s 278 381 m -51 X
 s 252 392 m -25 X s 252 404 m -25 X s 252 415 m -25 X s 278 427 m -51 X s 252 438 m -25 X s 252 449 m -25 X s 252 461 m -25 X s 278 472 m -51 X s 252 484 m -25 X s 252 495 m -25 X s 252 507 m -25 X s 278 518 m -51 X s 252 529 m -25 X s 252 541 m -25
 X s 252 552 m -25 X s 278 564 m -51 X s 252 575 m -25 X s 252 587 m -25 X s 252 598 m -25 X s 278 609 m -51 X s
 gsave  2268 609 0 0 C 186.127 136.747 t 0 r /Helvetica findfont 45.7076 sf 0 0 m (0) show NC gr 
 gsave  2268 609 0 0 C 148.142 182.329 t 0 r /Helvetica findfont 45.7076 sf 0 0 m (0.2) show NC gr 
 gsave  2268 609 0 0 C 148.142 227.911 t 0 r /Helvetica findfont 45.7076 sf 0 0 m (0.4) show NC gr 
 gsave  2268 609 0 0 C 148.142 273.493 t 0 r /Helvetica findfont 45.7076 sf 0 0 m (0.6) show NC gr 
 gsave  2268 609 0 0 C 148.142 319.076 t 0 r /Helvetica findfont 45.7076 sf 0 0 m (0.8) show NC gr 
 gsave  2268 609 0 0 C 193.725 364.658 t 0 r /Helvetica findfont 45.7076 sf 0 0 m (1) show NC gr 
 gsave  2268 609 0 0 C 148.142 410.24 t 0 r /Helvetica findfont 45.7076 sf 0 0 m (1.2) show NC gr 
 gsave  2268 609 0 0 C 148.142 455.822 t 0 r /Helvetica findfont 45.7076 sf 0 0 m (1.4) show NC gr 
 gsave  2268 609 0 0 C 148.142 501.405 t 0 r /Helvetica findfont 45.7076 sf 0 0 m (1.6) show NC gr 
 gsave  2268 609 0 0 C 148.142 546.987 t 0 r /Helvetica findfont 45.7076 sf 0 0 m (1.8) show NC gr 
 gsave  2268 609 0 0 C 186.127 592.569 t 0 r /Helvetica findfont 45.7076 sf 0 0 m (2) show NC gr  229 152 m20 232 152 m20 236 152 m20 239 152 m20 243 152 m20 247 152 m20 250 152 m20 254 152 m20 258 152 m20 261 152 m20 265 152 m20 268 152 m20 272 152
 m20 276 152 m20 279 152 m20 283 152 m20 287 152 m20 290 152 m20 294 152 m20 298 152 m20 301 152 m20 305 152 m20 308 152 m20 312 152 m20 316 152 m20 319 152 m20 323 152 m20 327 152 m20 330 152 m20 334 152 m20 337 152 m20 341 152 m20 345 152 m20 348
 152 m20 352 152 m20 356 152 m20 359 152 m20 363 152 m20 366 152 m20 370 152 m20 374 152 m20 377 152 m20 381 152 m20 385 152 m20 388 152 m20 392 152 m20 395 152 m20 399 152 m20 403 152 m20 406 152 m20 410 158 m20 417 152 m20 428 233 m20 432 605 m20
 435 374 m20 439 242 m20 443 261 m20 457 530 m20 461 241 m20 468 352 m20 472 566 m20 475 339 m20 486 560 m20 490 324 m20 493 495 m20 497 497 m20 501 381 m20 504 339 m20 512 380 m20 515 334 m20 519 351 m20 522 381 m20 526 379 m20 530 377 m20 533 384
 m20 537 370 m20 541 381 m20 544 390 m20 548 399 m20 552 437 m20 555 391 m20 559 440 m20 562 394 m20 566 414 m20 570 400 m20 573 406 m20 577 400 m20 581 444 m20 584 407 m20 588 442 m20 591 435 m20 595 438 m20 599 421 m20 602 461 m20 606 452 m20 610
 450 m20 613 410 m20 617 427 m20 620 425 m20 624 452 m20 628 487 m20 631 482 m20 635 527 m20 639 473 m20 642 438 m20 646 463 m20 649 456 m20 653 454 m20 657 469 m20 660 486 m20 664 493 m20 668 468 m20 671 469 m20 675 489 m20 679 525 m20 682 455 m20
 686 503 m20 689 467 m20 693 486 m20 697 488 m20 700 470 m20 704 513 m20 708 495 m20 711 489 m20 715 509 m20 718 477 m20 722 487 m20 726 509 m20 729 487 m20 733 512 m20 737 503 m20 740 501 m20 744 489 m20 747 476 m20 751 503 m20 755 479 m20 758 484
 m20 762 481 m20 766 460 m20 769 471 m20 773 493 m20 776 494 m20 780 504 m20 784 481 m20 787 462 m20 791 464 m20 795 469 m20 798 472 m20 802 471 m20 805 446 m20 809 448 m20 813 476 m20 816 471 m20 820 467 m20 824 459 m20 827 458 m20 831 468 m20 835
 437 m20 838 464 m20 842 456 m20 845 448 m20 849 457 m20 853 444 m20 856 440 m20 860 445 m20 864 427 m20 867 429 m20 871 434 m20 874 436 m20 878 416 m20 882 425 m20 885 440 m20 889 436 m20 893 414 m20 896 428 m20 900 416 m20 903 413 m20 907 416 m20
 911 430 m20 914 414 m20 918 425 m20 922 404 m20 925 401 m20 929 412 m20 932 415 m20 936 425 m20 940 416 m20 943 412 m20 947 413 m20 951 411 m20 954 411 m20 958 411 m20 962 418 m20 965 412 m20 969 408 m20 972 406 m20 976 407 m20 980 408 m20 983 403
 m20 987 407 m20 991 408 m20 994 409 m20 998 400 m20 1001 399 m20 1005 395 m20 1009 402 m20 1012 404 m20 1016 399 m20 1020 404 m20 1023 396 m20 1027 400 m20 1030 397 m20 1034 403 m20 1038 390 m20 1041 394 m20 1045 395 m20 1049 397 m20 1052 398 m20
 1056 394 m20 1059 398 m20 1063 396 m20 1067 393 m20 1070 393 m20 1074 392 m20 1078 394 m20 1081 388 m20 1085 390 m20 1089 397 m20 1092 392 m20 1096 391 m20 1099 392 m20 1103 388 m20 1107 393 m20 1110 391 m20 1114 389 m20 1118 391 m20 1121 392 m20
 1125 384 m20 1128 389 m20 1132 389 m20 1136 388 m20 1139 387 m20 1143 387 m20 1147 388 m20 1150 390 m20 1154 385 m20 1157 388 m20 1161 389 m20 1165 386 m20 1168 384 m20 1172 385 m20 1176 385 m20 1179 385 m20 1183 381 m20 1186 385 m20 1190 384 m20
 1194 383 m20 1197 383 m20 1201 382 m20 1205 382 m20 1208 381 m20 1212 383 m20 1215 383 m20 1219 378 m20 1223 382 m20 1226 379 m20 1230 380 m20 1234 384 m20 1237 381 m20 1241 380 m20 1245 381 m20 1248 381 m20 1252 380 m20 1255 380 m20 1259 379 m20
 1263 378 m20 1266 381 m20 1270 377 m20 1274 378 m20 1277 379 m20 1281 379 m20 1284 378 m20 1288 377 m20 1292 380 m20 1295 377 m20 1299 378 m20 1303 377 m20 1306 378 m20 1310 378 m20 1313 378 m20 1317 377 m20 1321 376 m20 1324 377 m20 1328 375 m20
 1332 374 m20 1335 374 m20 1339 377 m20 1342 373 m20 1346 374 m20 1350 375 m20 1353 375 m20 1357 373 m20 1361 373 m20 1364 375 m20 1368 374 m20 1372 374 m20 1375 375 m20 1379 373 m20 1382 374 m20 1386 375 m20 1390 374 m20 1393 371 m20 1397 373 m20
 1401 369 m20 1404 371 m20 1408 371 m20 1411 370 m20 1415 374 m20 1419 377 m20 1422 372 m20 1426 374 m20 1430 374 m20 1433 373 m20 1437 373 m20 1440 373 m20 1444 373 m20 1448 362 m20 1451 369 m20 1455 373 m20 1459 375 m20 1462 367 m20 1466 371 m20
 1469 370 m20 1473 368 m20 1477 370 m20 1480 372 m20 1484 366 m20 1488 365 m20 1491 364 m20 1495 367 m20 1499 366 m20 1502 366 m20 1506 364 m20 1509 367 m20 1513 372 m20 1517 364 m20 1520 373 m20 1524 371 m20 1528 369 m20 1531 365 m20 1535 372 m20
 1538 375 m20 1542 370 m20 1546 368 m20 1549 365 m20 1553 365 m20 1557 369 m20 1560 366 m20 1564 362 m20 1567 360 m20 1571 373 m20 1575 366 m20 1578 373 m20 1582 356 m20 1586 355 m20 1589 356 m20 1593 359 m20 1596 361 m20 1600 354 m20 1604 376 m20
 1607 373 m20 1611 360 m20 1615 370 m20 1618 360 m20 1622 362 m20 1625 361 m20 1629 368 m20 1633 361 m20 1636 345 m20 1640 363 m20 1644 340 m20 1647 364 m20 1651 346 m20 1655 359 m20 1658 358 m20 1662 346 m20 1665 343 m20 1669 331 m20 1673 338 m20
 1676 337 m20 1680 331 m20 1684 325 m20 1687 324 m20 1691 336 m20 1694 360 m20 1698 353 m20 1702 309 m20 1705 316 m20 1709 315 m20 1713 309 m20 1716 321 m20 1720 330 m20 1723 283 m20 1727 313 m20 1731 334 m20 1734 275 m20 1738 264 m20 1749 232 m20
 1756 187 m20 1763 409 m20 1771 509 m20 1774 512 m20 1782 458 m20 1785 524 m20 1789 604 m20 1792 532 m20 1796 492 m20 1800 478 m20 1803 482 m20 1807 378 m20 1811 426 m20 1814 428 m20 1818 422 m20 1821 415 m20 1825 420 m20 1829 373 m20 1832 415 m20
 1836 483 m20 1840 379 m20 1843 389 m20 1847 409 m20 1850 377 m20 1854 426 m20 1858 434 m20 1861 443 m20 1865 408 m20 1869 403 m20 1872 369 m20 1876 394 m20 1879 366 m20 1883 408 m20 1887 420 m20 1890 380 m20 1894 403 m20 1898 388 m20 1901 368 m20
 1905 392 m20 1909 440 m20 1912 439 m20 1916 373 m20 1919 385 m20 1923 409 m20 1927 423 m20 1930 368 m20 1934 400 m20 1938 400 m20 1941 405 m20 1945 408 m20 1948 418 m20 1952 381 m20 1956 382 m20 1959 367 m20 1963 397 m20 1967 396 m20 1970 410 m20
 1974 415 m20 1977 404 m20 1981 379 m20 1985 402 m20 1988 373 m20 1992 396 m20 1996 352 m20 1999 423 m20 2003 389 m20 2006 399 m20 2010 379 m20 2014 388 m20 2017 388 m20 2021 371 m20 2025 391 m20 2028 383 m20 2032 354 m20 2036 377 m20 2039 409 m20 cs
 0 0 0 P13 setcolor 229 152 m 177 X 4 12 d 4 445 d 3 -457 d 4 457 d 4 X 3 -330 d 4 330 d 3 -150 d 4 -133 d 4 -31 d 3 314 d 11 X 4 -329 d 3 329 d 4 -172 d 4 172 d 3 -193 d 4 193 d 7 X 4 -236 d 3 236 d 4 -26 d 4 -79 d 3 -101 d 4 206 d 4 -163 d 3 -76 d
 4 17 d 3 28 d 4 -4 d 4 -3 d 3 5 d 4 -14 d 4 10 d 3 11 d 4 9 d 4 46 d 3 -55 d 4 58 d 3 -55 d 4 21 d 4 -15 d 3 6 d 4 -7 d 4 52 d 3 -47 d 4 39 d 3 -5 d 4 3 d 4 -21 d 3 45 d 4 -11 d 4 -1 d 3 -47 d 4 19 d 3 -3 d 4 31 d 4 42 d 3 -6 d 4 48 d 4 -61 d 3 -38
 d 4 26 d 3 -9 d 4 X 4 18 d 3 17 d 4 6 d 4 -28 d 3 1 d 4 22 d 4 41 d 3 -80 d 4 55 d 3 -42 d 4 23 d 4 1 d 3 -20 d 4 49 d 4 -24 d 3 -5 d 4 23 d 3 -36 d 4 10 d 4 25 d 3 -25 d 4 27 d 4 -9 d 3 -3 d 4 -13 d 3 -16 d 4 32 d 4 -30 d 3 7 d 4 -4 d 4 -24 d 3 13
 d 4 24 d 3 1 d 4 11 d 4 -26 d 3 -21 d 4 1 d 4 8 d 3 1 d 4 -1 d 3 -26 d 4 1 d 4 30 d 3 -5 d 4 -5 d 4 -8 d 3 -3 d 4 11 d 4 -34 d 3 29 d 4 -9 d 3 -9 d 4 9 d 4 -15 d 3 -4 d 4 5 d 4 -19 d 3 2 d 4 5 d 3 1 d 4 -20 d 4 9 d 3 15 d 4 -4 d 4 -23 d 3 15 d 4 -14
 d 3 -2 d 4 3 d 4 14 d 3 -17 d 4 11 d 4 -22 d 3 -2 d 4 11 d 3 3 d 4 10 d 4 -9 d 3 -7 d 4 X 4 -2 d 7 X 4 7 d 3 -6 d 4 -4 d 3 -2 d 4 1 d 4 2 d 3 -6 d 4 4 d 4 1 d 3 1 d 4 -10 d 3 X 4 -5 d 4 7 d 3 2 d 4 -5 d 4 5 d 3 -8 d 4 3 d 3 -3 d 4 7 d 4 -14 d 3 5 d
 4 1 d 4 1 d 3 1 d 4 -4 d 3 4 d 4 -2 d 4 -4 d 3 1 d 4 -1 d 4 2 d 3 -6 d 4 1 d 4 7 d 3 -4 d 4 -1 d 3 X 4 -4 d 4 6 d 3 -2 d 4 -3 d 4 2 d 3 1 d 4 -8 d 3 5 d 4 X 4 -2 d 3 -1 d 4 X 4 1 d 3 3 d 4 -5 d 3 2 d 4 1 d 4 -3 d 3 -2 d 4 1 d 7 X 4 -4 d 3 4 d 4 -2 d
 4 X 3 -1 d 8 X 3 -1 d 4 2 d 3 X 4 -6 d 4 5 d 3 -3 d 4 1 d 4 4 d 3 -4 d 4 X 4 1 d 3 -1 d 4 X 3 -1 d 4 -1 d 4 X 3 3 d 4 -5 d 4 1 d 3 1 d 4 X 3 -1 d 4 -1 d 4 3 d 3 -3 d 4 1 d 4 -1 d 3 1 d 7 X 4 -1 d 4 -1 d 3 1 d 4 -2 d 4 X 3 -1 d 4 3 d 3 -3 d 4 X 4 2 d
 3 X 4 -3 d 4 X 3 3 d 4 -2 d 4 1 d 3 1 d 4 -3 d 3 2 d 4 1 d 4 -2 d 3 -2 d 4 2 d 4 -4 d 3 2 d 4 X 3 -1 d 4 4 d 4 3 d 3 -4 d 4 1 d 4 1 d 3 -1 d 11 X 4 -11 d 3 6 d 4 5 d 4 2 d 3 -8 d 4 4 d 3 -1 d 4 -2 d 4 2 d 3 3 d 4 -6 d 4 -2 d 3 X 4 3 d 4 -1 d 3 X 4
 -2 d 3 4 d 4 5 d 4 -8 d 3 10 d 4 -2 d 4 -2 d 3 -4 d 4 7 d 3 3 d 4 -5 d 4 -2 d 3 -3 d 4 X 4 5 d 3 -4 d 4 -2 d 3 -2 d 4 13 d 4 -7 d 3 8 d 4 -17 d 4 -1 d 3 1 d 4 4 d 3 1 d 4 -7 d 4 24 d 3 -3 d 4 -13 d 4 10 d 3 -10 d 4 3 d 3 -1 d 4 7 d 4 -6 d 3 -16 d 4
 18 d 4 -23 d 3 25 d 4 -19 d 4 15 d 3 X 4 -14 d 3 -1 d 4 -12 d 4 9 d 3 -1 d 4 -3 d 4 -9 d 3 3 d 4 16 d 3 25 d 4 -2 d 4 -49 d 3 11 d 4 9 d 4 -7 d 3 22 d 4 7 d 3 -12 d 4 3 d 4 51 d 3 -56 d 4 -30 d 4 -183 d 3 40 d 4 274 d -314 Y 7 X 184 Y 4 -140 d 3 338
 d 4 75 d 11 X 4 -49 d 3 49 d 7 X 4 -52 d 4 -14 d 3 1 d 4 -89 d 4 23 d 3 24 d 4 -29 d 3 -18 d 4 2 d 4 -33 d 3 52 d 4 68 d 4 -120 d 3 6 d 4 16 d 3 -32 d 4 54 d 4 10 d 3 9 d 4 -40 d 4 8 d 3 -48 d 4 22 d 3 -31 d 4 55 d 4 7 d 3 -41 d 4 21 d 4 -17 d 3 -21
 d 4 27 d 4 48 d 3 3 d 4 -76 d 3 16 d 4 28 d 4 15 d 3 -61 d 4 30 d 4 2 d 3 8 d 4 7 d 3 8 d 4 -45 d 4 5 d 3 -17 d 4 32 d 4 -3 d 3 14 d 4 10 d 3 -15 d 4 -25 d 4 22 d 3 -30 d 4 30 d 4 -50 d 3 76 d 4 -39 d 3 10 d 4 -17 d 4 10 d 3 -4 d 4 -17 d 4 17 d 3 -4
 d 4 -31 d 4 28 d 3 34 d -77 Y -3 -30 d -4 -19 d -4 27 d -3 12 d -4 -22 d -4 17 d -3 -6 d -4 -7 d -4 22 d -3 -8 d -4 29 d -3 -66 d -4 37 d -4 -17 d -3 30 d -4 -24 d -4 24 d -3 7 d -4 1 d -3 -16 d -4 -1 d -4 -26 d -3 13 d -4 2 d -4 29 d -3 -12 d -4 1
 d -3 -3 d -4 3 d -4 -33 d -3 49 d -4 -13 d -4 -20 d -3 -9 d -4 55 d -3 6 d -4 -47 d -4 -22 d -3 19 d -4 13 d -4 -24 d -3 39 d -4 -17 d -4 -30 d -3 24 d -4 -27 d -3 20 d -4 18 d -4 29 d -3 -7 d -4 -8 d -4 -43 d -3 31 d -4 -23 d -3 -14 d -4 89 d -4
 -68 d -3 -32 d -4 60 d -4 -8 d -3 -4 d -4 -17 d -3 19 d -4 -72 d -4 119 d -3 -6 d -4 13 d -4 -130 d -3 196 d -4 -66 d -3 -71 d -4 123 d -4 -137 d -3 62 d -4 75 d -4 -196 d -3 -131 d -18 X -4 41 d -4 -7 d -3 61 d -4 8 d -4 -55 d -3 81 d -4 -10 d -3
 -3 d -4 4 d -4 11 d -3 -1 d -4 37 d -4 13 d -3 -22 d -4 -10 d -3 5 d -4 5 d -4 8 d -3 1 d -4 -5 d -4 11 d -3 5 d -4 10 d -3 3 d -4 -12 d -4 18 d -3 -23 d -4 22 d -4 -17 d -3 17 d -4 7 d -4 -7 d -3 2 d -4 -2 d -3 9 d -4 -9 d -4 13 d -3 4 d -4 -21 d
 -4 6 d -3 -1 d -4 -3 d -3 -1 d -4 1 d -4 17 d -3 -7 d -4 7 d -4 -12 d -3 2 d -4 5 d -3 4 d -4 -5 d -4 1 d -3 3 d -4 2 d -4 5 d -3 -3 d -4 -6 d -3 4 d -4 2 d -4 2 d -3 -9 d -4 8 d -4 -4 d -3 -3 d -4 2 d -3 X -4 1 d -4 -2 d -3 X -4 1 d -4 7 d -3 -3 d
 -4 -2 d -4 2 d -3 2 d -4 -4 d -3 8 d -4 -2 d -4 -4 d -3 -6 d -4 11 d -11 X -3 1 d -4 -1 d -4 -1 d -3 5 d -4 -3 d -4 -4 d -3 1 d -4 X -3 -2 d -4 4 d -4 -1 d -3 2 d -4 1 d -4 X -3 -2 d -4 3 d -3 -1 d -4 -1 d -4 2 d -3 -2 d -4 X -4 2 d -3 X -4 -2 d -4
 X -3 4 d -4 -3 d -3 X -4 1 d -4 2 d -3 -1 d -4 1 d -4 1 d -7 X -3 -1 d -4 1 d -4 -1 d -3 3 d -4 -3 d -4 1 d -3 1 d -4 X -3 -1 d -4 -1 d -4 4 d -3 -3 d -4 X -4 1 d -3 1 d -4 X -3 1 d -4 -1 d -4 1 d -3 3 d -4 -4 d -4 -1 d -3 3 d -4 -5 d -4 5 d -3 1 d
 -4 -2 d -3 X -4 1 d -7 X -4 1 d -4 1 d -3 -4 d -4 4 d -7 X -4 -1 d -3 2 d -4 2 d -4 -1 d -3 -2 d -4 5 d -3 -3 d -4 -1 d -4 X -3 1 d -4 1 d -4 X -3 -4 d -4 7 d -3 -1 d -4 -2 d -4 2 d -3 2 d -4 -5 d -4 3 d -3 X -4 1 d -3 4 d -4 -7 d -4 -1 d -3 5 d -4
 -1 d -4 1 d -3 -1 d -4 3 d -4 2 d -3 -4 d -4 4 d -3 -1 d -4 -2 d -4 -1 d -3 -5 d -4 13 d -4 -6 d -3 3 d -4 -3 d -3 8 d -4 -6 d -4 5 d -3 -2 d -4 -8 d -4 5 d -3 X -4 9 d -3 -1 d -4 -1 d -4 -4 d -3 5 d -4 -1 d -4 -1 d -3 2 d -4 5 d -3 5 d -4 -7 d -4 1
 d -3 -1 d -4 2 d -4 -3 d -3 3 d -4 8 d -4 -10 d -3 -3 d -4 -10 d -3 2 d -4 20 d -4 -10 d -3 15 d -4 -13 d -4 -3 d -3 2 d -4 12 d -3 -14 d -4 21 d -4 3 d -3 -13 d -4 -9 d -4 18 d -3 -2 d -4 -5 d -3 -2 d -4 17 d -4 -4 d -3 2 d -4 12 d -4 -9 d -3 7 d
 -4 7 d -3 -26 d -4 29 d -4 -10 d -3 1 d -4 8 d -4 2 d -3 5 d -4 -26 d -4 -3 d -3 24 d -4 1 d -3 -4 d -4 -4 d -4 -3 d -3 17 d -4 22 d -4 -10 d -3 -1 d -4 -20 d -3 -9 d -4 17 d -4 4 d -3 -5 d -4 19 d -4 -22 d -3 10 d -4 11 d -3 1 d -4 9 d -4 -23 d -3
 19 d -4 -20 d -4 -9 d -3 29 d -4 -18 d -3 7 d -4 13 d -4 -39 d -3 17 d -4 -3 d -4 -16 d -3 30 d -4 -40 d -3 61 d -4 -33 d -4 -18 d -3 X -4 22 d -4 -8 d -3 -17 d -4 -11 d -4 3 d -3 6 d -4 -24 d -3 30 d -4 47 d -4 -41 d -3 5 d -4 -28 d -4 -25 d -3 1 d
 -4 -14 d -3 34 d -4 1 d -4 8 d -3 -36 d -4 13 d -4 -1 d -3 7 d -4 -30 d -3 26 d -4 -36 d -4 7 d -3 -6 d -4 11 d -4 -18 d -3 37 d -4 -41 d -3 38 d -4 -30 d -4 -9 d -3 -6 d -4 -12 d -4 13 d -3 -9 d -4 1 d -4 X -3 -33 d -4 -16 d -3 16 d -4 231 d -4
 -271 d -3 -17 d -4 153 d -4 -73 d -3 -62 d -4 170 d -2 164 d -6 X -3 -347 d -3 210 d -4 -205 d -4 125 d -3 -190 d -4 119 d -3 35 d -4 -86 d -4 12 d -3 -55 d -4 -69 d -4 130 d -3 27 d -4 -129 d -3 87 d -4 -38 d -4 -83 d -188 X FA
 gr  gr showpage
end
%%EOF
