%!PS-Adobe-3.0 EPSF-3.0
%%BoundingBox: (atend)
%%LanguageLevel: 2
%%Creator: Grace-5.1.22
%%CreationDate: Wed Mar 27 23:09:35 2013
%%DocumentData: Clean8Bit
%%Orientation: Portrait
%%Title: /Users/spmartin/tex/papers/hint2/summary/smearedLO_1.7_narrow.agr
%%For: spmartin
%%DocumentNeededResources: (atend)
%%EndComments
%%BeginProlog
/m {moveto} def
/l {lineto} def
/s {stroke} def
/n {newpath} def
/c {closepath} def
/RL {rlineto} def
/SLW {setlinewidth} def
/GS {gsave} def
/GR {grestore} def
/SC {setcolor} def
/SGRY {setgray} def
/SRGB {setrgbcolor} def
/SD {setdash} def
/SLC {setlinecap} def
/SLJ {setlinejoin} def
/SCS {setcolorspace} def
/FFSF {findfont setfont} def
/CC {concat} def
/PXL {n m 0 0 RL s} def
/Color0 {1.0000 1.0000 1.0000} def
/Color1 {0.0000 0.0000 0.0000} def
/Color2 {1.0000 0.0000 0.0000} def
/Color3 {0.0000 1.0000 0.0000} def
/Color4 {0.0000 0.0000 1.0000} def
/Color5 {1.0000 1.0000 0.0000} def
/Color6 {0.7373 0.5608 0.5608} def
/Color7 {0.8627 0.8627 0.8627} def
/Color8 {0.5804 0.0000 0.8275} def
/Color9 {0.0000 1.0000 1.0000} def
/Color10 {1.0000 0.0000 1.0000} def
/Color11 {1.0000 0.6471 0.0000} def
/Color12 {0.4471 0.1294 0.7373} def
/Color13 {0.4039 0.0275 0.2824} def
/Color14 {0.2510 0.8784 0.8157} def
/Color15 {0.0000 0.5451 0.0000} def
/Color16 {0.7529 0.7529 0.7529} def
/Color17 {0.5059 0.5059 0.5059} def
/Color18 {0.2588 0.2588 0.2588} def
/Color19 {0.7529 0.8863 0.7529} def
/Color20 {0.5059 0.7725 0.5059} def
/Color21 {0.2588 0.6588 0.2588} def
/Color22 {0.7529 0.7529 1.0000} def
/Color23 {0.5059 0.5059 1.0000} def
/Color24 {0.2588 0.2588 1.0000} def
/Color25 {1.0000 0.7529 0.7529} def
/Color26 {1.0000 0.5059 0.5059} def
/Color27 {1.0000 0.2588 0.2588} def
/PTRN {
 /pat_bits exch def 
 <<
  /PaintType 2
  /PatternType 1 /TilingType 1
  /BBox[0 0 16 16]
  /XStep 16 /YStep 16
  /PaintProc {
   pop
   16 16 true [-1 0 0 -1 16 16] pat_bits imagemask
  }
 >>
 [0.0016 0 0 0.0016 0 0]
 makepattern
} def
/Pattern0 {<0000000000000000000000000000000000000000000000000000000000000000> PTRN} bind def
/Pattern1 {<ffffffffffffffffffffffffffffffffffffffffffffffffffffffffffffffff> PTRN} bind def
/Pattern2 {<eeeeffffbbbbffffeeeeffffbbbbffffeeeeffffbbbbffffeeeeffffbbbbffff> PTRN} bind def
/Pattern3 {<eeeebbbbeeeebbbbeeeebbbbeeeebbbbeeeebbbbeeeebbbbeeeebbbbeeeebbbb> PTRN} bind def
/Pattern4 {<5555aaaa5555aaaa5555aaaa5555aaaa5555aaaa5555aaaa5555aaaa5555aaaa> PTRN} bind def
/Pattern5 {<1111444411114444111144441111444411114444111144441111444411114444> PTRN} bind def
/Pattern6 {<1111000044440000111100004444000011110000444400001111000044440000> PTRN} bind def
/Pattern7 {<1010000000000000010100000000000010100000000000000101000000000000> PTRN} bind def
/Pattern8 {<0000000000000000000000000000000000000000000000000000000000000000> PTRN} bind def
/Pattern9 {<1e1e0f0f8787c3c3e1e1f0f078783c3c1e1e0f0f8787c3c3e1e1f0f078783c3c> PTRN} bind def
/Pattern10 {<7878f0f0e1e1c3c387870f0f1e1e3c3c7878f0f0e1e1c3c387870f0f1e1e3c3c> PTRN} bind def
/Pattern11 {<3333333333333333333333333333333333333333333333333333333333333333> PTRN} bind def
/Pattern12 {<ffffffff00000000ffffffff00000000ffffffff00000000ffffffff00000000> PTRN} bind def
/Pattern13 {<8181424224241818181824244242818181814242242418181818242442428181> PTRN} bind def
/Pattern14 {<8080404020201010080804040202010180804040202010100808040402020101> PTRN} bind def
/Pattern15 {<0101020204040808101020204040808001010202040408081010202040408080> PTRN} bind def
/Pattern16 {<2222222222222222222222222222222222222222222222222222222222222222> PTRN} bind def
/Pattern17 {<0000ffff000000000000ffff000000000000ffff000000000000ffff00000000> PTRN} bind def
/Pattern18 {<2222ffff222222222222ffff222222222222ffff222222222222ffff22222222> PTRN} bind def
/Pattern19 {<ffffffff33333333ffffffff33333333ffffffff33333333ffffffff33333333> PTRN} bind def
/Pattern20 {<0f0f0f0f0f0f0f0ff0f0f0f0f0f0f0f00f0f0f0f0f0f0f0ff0f0f0f0f0f0f0f0> PTRN} bind def
/Pattern21 {<ff00ff00ff00ff00ff00ff00ff00ff0000ff00ff00ff00ff00ff00ff00ff00ff> PTRN} bind def
/Pattern22 {<8001800180018001800180018001ffffffff8001800180018001800180018001> PTRN} bind def
/Pattern23 {<c003c003c003c003c003c003ffffffffffffffffc003c003c003c003c003c003> PTRN} bind def
/Pattern24 {<040404040404ffff404040404040ffff040404040404ffff404040404040ffff> PTRN} bind def
/Pattern25 {<180018001800180018001800ffffffff001800180018001800180018ffffffff> PTRN} bind def
/Pattern26 {<1111b8b87c7c3a3a1111a3a3c7c78b8b1111b8b87c7c3a3a1111a3a3c7c78b8b> PTRN} bind def
/Pattern27 {<101010102828c7c70101010182827c7c101010102828c7c70101010182827c7c> PTRN} bind def
/Pattern28 {<1c1c121211112121c1c12121111112121c1c121211112121c1c1212111111212> PTRN} bind def
/Pattern29 {<3e3e414180808080e3e31414080808083e3e414180808080e3e3141408080808> PTRN} bind def
/Pattern30 {<4848888884848383848488884848383848488888848483838484888848483838> PTRN} bind def
/Pattern31 {<03030404080808080c0c12122121c0c003030404080808080c0c12122121c0c0> PTRN} bind def
/ellipsedict 8 dict def
ellipsedict /mtrx matrix put
/EARC {
 ellipsedict begin
  /endangle exch def
  /startangle exch def
  /yrad exch def
  /xrad exch def
  /y exch def
  /x exch def
  /savematrix mtrx currentmatrix def
  x y translate
  xrad yrad scale
  0 0 1 startangle endangle arc
  savematrix setmatrix
 end
} def
/TL {
  /kcomp exch def
  /linewidth exch def
  /offset exch def
  GS
  0 offset rmoveto
  linewidth SLW
  dup stringwidth exch kcomp add exch RL s
  GR
} def
/KINIT
{
 /kvector exch def
 /kid 0 def
} def
/KPROC
{
 pop pop
 kvector kid get
 0 rmoveto
 /kid 1 kid add def
} def
/DefEncoding [
 /.notdef
 /.notdef
 /.notdef
 /.notdef
 /.notdef
 /.notdef
 /.notdef
 /.notdef
 /.notdef
 /.notdef
 /.notdef
 /.notdef
 /.notdef
 /.notdef
 /.notdef
 /.notdef
 /.notdef
 /.notdef
 /.notdef
 /.notdef
 /.notdef
 /.notdef
 /.notdef
 /.notdef
 /.notdef
 /.notdef
 /.notdef
 /.notdef
 /.notdef
 /.notdef
 /.notdef
 /.notdef
 /space
 /exclam
 /quotedbl
 /numbersign
 /dollar
 /percent
 /ampersand
 /quoteright
 /parenleft
 /parenright
 /asterisk
 /plus
 /comma
 /hyphen
 /period
 /slash
 /zero
 /one
 /two
 /three
 /four
 /five
 /six
 /seven
 /eight
 /nine
 /colon
 /semicolon
 /less
 /equal
 /greater
 /question
 /at
 /A
 /B
 /C
 /D
 /E
 /F
 /G
 /H
 /I
 /J
 /K
 /L
 /M
 /N
 /O
 /P
 /Q
 /R
 /S
 /T
 /U
 /V
 /W
 /X
 /Y
 /Z
 /bracketleft
 /backslash
 /bracketright
 /asciicircum
 /underscore
 /grave
 /a
 /b
 /c
 /d
 /e
 /f
 /g
 /h
 /i
 /j
 /k
 /l
 /m
 /n
 /o
 /p
 /q
 /r
 /s
 /t
 /u
 /v
 /w
 /x
 /y
 /z
 /braceleft
 /bar
 /braceright
 /asciitilde
 /.notdef
 /.notdef
 /.notdef
 /.notdef
 /.notdef
 /.notdef
 /.notdef
 /.notdef
 /.notdef
 /.notdef
 /.notdef
 /.notdef
 /.notdef
 /.notdef
 /.notdef
 /.notdef
 /.notdef
 /.notdef
 /.notdef
 /.notdef
 /.notdef
 /.notdef
 /.notdef
 /.notdef
 /.notdef
 /.notdef
 /.notdef
 /.notdef
 /.notdef
 /.notdef
 /.notdef
 /.notdef
 /.notdef
 /space
 /exclamdown
 /cent
 /sterling
 /currency
 /yen
 /brokenbar
 /section
 /dieresis
 /copyright
 /ordfeminine
 /guillemotleft
 /logicalnot
 /hyphen
 /registered
 /macron
 /degree
 /plusminus
 /twosuperior
 /threesuperior
 /acute
 /mu
 /paragraph
 /periodcentered
 /cedilla
 /onesuperior
 /ordmasculine
 /guillemotright
 /onequarter
 /onehalf
 /threequarters
 /questiondown
 /Agrave
 /Aacute
 /Acircumflex
 /Atilde
 /Adieresis
 /Aring
 /AE
 /Ccedilla
 /Egrave
 /Eacute
 /Ecircumflex
 /Edieresis
 /Igrave
 /Iacute
 /Icircumflex
 /Idieresis
 /Eth
 /Ntilde
 /Ograve
 /Oacute
 /Ocircumflex
 /Otilde
 /Odieresis
 /multiply
 /Oslash
 /Ugrave
 /Uacute
 /Ucircumflex
 /Udieresis
 /Yacute
 /Thorn
 /germandbls
 /agrave
 /aacute
 /acircumflex
 /atilde
 /adieresis
 /aring
 /ae
 /ccedilla
 /egrave
 /eacute
 /ecircumflex
 /edieresis
 /igrave
 /iacute
 /icircumflex
 /idieresis
 /eth
 /ntilde
 /ograve
 /oacute
 /ocircumflex
 /otilde
 /odieresis
 /divide
 /oslash
 /ugrave
 /uacute
 /ucircumflex
 /udieresis
 /yacute
 /thorn
 /ydieresis
] def
%%EndProlog
%%BeginSetup
%%EndSetup
618.96 618.96 scale
n
0.0000 0.0000 m
0.0000 1.0000 l
1.0597 1.0000 l
1.0597 0.0000 l
c
[/DeviceRGB] SCS
Color0 SC
eofill
[/DeviceRGB] SCS
Color4 SC
[] 0 SD
0.0045 SLW
0 SLC
0 SLJ
n
0.1619 0.2821 m
0.1620 0.2822 l
0.1749 0.2971 l
0.1878 0.3132 l
0.2007 0.3305 l
0.2136 0.3489 l
0.2265 0.3686 l
0.2394 0.3893 l
0.2523 0.4112 l
0.2652 0.4341 l
0.2780 0.4580 l
0.2909 0.4828 l
0.3038 0.5084 l
0.3167 0.5347 l
0.3296 0.5616 l
0.3425 0.5888 l
0.3554 0.6163 l
0.3683 0.6438 l
0.3812 0.6712 l
0.3941 0.6983 l
0.4070 0.7247 l
0.4199 0.7504 l
0.4328 0.7751 l
0.4457 0.7986 l
0.4586 0.8207 l
0.4715 0.8412 l
0.4843 0.8598 l
0.4972 0.8763 l
0.5101 0.8907 l
0.5230 0.9028 l
0.5359 0.9124 l
0.5488 0.9194 l
0.5617 0.9238 l
0.5746 0.9255 l
0.5875 0.9245 l
0.6004 0.9207 l
0.6133 0.9142 l
0.6262 0.9051 l
0.6391 0.8934 l
0.6520 0.8793 l
0.6649 0.8629 l
0.6778 0.8443 l
0.6907 0.8238 l
0.7035 0.8014 l
0.7164 0.7775 l
0.7293 0.7523 l
0.7422 0.7258 l
0.7551 0.6985 l
0.7680 0.6704 l
0.7809 0.6419 l
0.7938 0.6131 l
0.8067 0.5842 l
0.8196 0.5555 l
0.8325 0.5271 l
0.8454 0.4992 l
0.8583 0.4719 l
0.8712 0.4455 l
0.8841 0.4199 l
0.8970 0.3954 l
0.9098 0.3719 l
0.9227 0.3496 l
0.9356 0.3285 l
0.9485 0.3087 l
0.9614 0.2901 l
0.9743 0.2727 l
0.9872 0.2567 l
1.0001 0.2418 l
1.0130 0.2282 l
1.0131 0.2281 l
s
[/DeviceRGB] SCS
Color1 SC
[] 0 SD
0.0015 SLW
n
1.0131 0.1350 m
0.1619 0.1350 l
s
[/DeviceRGB] SCS
Color2 SC
[] 0 SD
0.0030 SLW
n
0.1619 0.2552 m
0.1620 0.2553 l
0.1749 0.2696 l
0.1878 0.2851 l
0.2007 0.3017 l
0.2136 0.3196 l
0.2265 0.3387 l
0.2394 0.3590 l
0.2523 0.3805 l
0.2652 0.4031 l
0.2780 0.4268 l
0.2909 0.4515 l
0.3038 0.4771 l
0.3167 0.5035 l
0.3296 0.5305 l
0.3425 0.5581 l
0.3554 0.5860 l
0.3683 0.6141 l
0.3812 0.6423 l
0.3941 0.6702 l
0.4070 0.6977 l
0.4199 0.7246 l
0.4328 0.7506 l
0.4457 0.7756 l
0.4586 0.7992 l
0.4715 0.8214 l
0.4843 0.8419 l
0.4972 0.8605 l
0.5101 0.8769 l
0.5230 0.8912 l
0.5359 0.9030 l
0.5488 0.9124 l
0.5617 0.9191 l
0.5746 0.9232 l
0.5875 0.9246 l
0.6004 0.9232 l
0.6133 0.9192 l
0.6262 0.9124 l
0.6391 0.9031 l
0.6520 0.8912 l
0.6649 0.8770 l
0.6778 0.8605 l
0.6907 0.8419 l
0.7035 0.8215 l
0.7164 0.7993 l
0.7293 0.7756 l
0.7422 0.7507 l
0.7551 0.7246 l
0.7680 0.6977 l
0.7809 0.6702 l
0.7938 0.6423 l
0.8067 0.6142 l
0.8196 0.5861 l
0.8325 0.5581 l
0.8454 0.5306 l
0.8583 0.5035 l
0.8712 0.4771 l
0.8841 0.4515 l
0.8970 0.4269 l
0.9098 0.4032 l
0.9227 0.3806 l
0.9356 0.3591 l
0.9485 0.3388 l
0.9614 0.3197 l
0.9743 0.3018 l
0.9872 0.2851 l
1.0001 0.2696 l
1.0130 0.2554 l
1.0131 0.2553 l
s
[/DeviceRGB] SCS
Color1 SC
[] 0 SD
0.0015 SLW
n
0.1620 0.1350 m
1.0130 0.1350 l
s
n
0.1620 0.9740 m
1.0130 0.9740 l
s
[] 0 SD
0.0030 SLW
n
0.1620 0.1350 m
0.1620 0.1450 l
s
n
0.1620 0.9740 m
0.1620 0.9640 l
s
n
0.1749 0.1350 m
0.1749 0.1450 l
s
n
0.1749 0.9740 m
0.1749 0.9640 l
s
n
0.1878 0.1350 m
0.1878 0.1450 l
s
n
0.1878 0.9740 m
0.1878 0.9640 l
s
n
0.2136 0.1350 m
0.2136 0.1450 l
s
n
0.2136 0.9740 m
0.2136 0.9640 l
s
n
0.2265 0.1350 m
0.2265 0.1450 l
s
n
0.2265 0.9740 m
0.2265 0.9640 l
s
n
0.2394 0.1350 m
0.2394 0.1450 l
s
n
0.2394 0.9740 m
0.2394 0.9640 l
s
n
0.2523 0.1350 m
0.2523 0.1450 l
s
n
0.2523 0.9740 m
0.2523 0.9640 l
s
n
0.2652 0.1350 m
0.2652 0.1450 l
s
n
0.2652 0.9740 m
0.2652 0.9640 l
s
n
0.2780 0.1350 m
0.2780 0.1450 l
s
n
0.2780 0.9740 m
0.2780 0.9640 l
s
n
0.2909 0.1350 m
0.2909 0.1450 l
s
n
0.2909 0.9740 m
0.2909 0.9640 l
s
n
0.3038 0.1350 m
0.3038 0.1450 l
s
n
0.3038 0.9740 m
0.3038 0.9640 l
s
n
0.3167 0.1350 m
0.3167 0.1450 l
s
n
0.3167 0.9740 m
0.3167 0.9640 l
s
n
0.3425 0.1350 m
0.3425 0.1450 l
s
n
0.3425 0.9740 m
0.3425 0.9640 l
s
n
0.3554 0.1350 m
0.3554 0.1450 l
s
n
0.3554 0.9740 m
0.3554 0.9640 l
s
n
0.3683 0.1350 m
0.3683 0.1450 l
s
n
0.3683 0.9740 m
0.3683 0.9640 l
s
n
0.3812 0.1350 m
0.3812 0.1450 l
s
n
0.3812 0.9740 m
0.3812 0.9640 l
s
n
0.3941 0.1350 m
0.3941 0.1450 l
s
n
0.3941 0.9740 m
0.3941 0.9640 l
s
n
0.4070 0.1350 m
0.4070 0.1450 l
s
n
0.4070 0.9740 m
0.4070 0.9640 l
s
n
0.4199 0.1350 m
0.4199 0.1450 l
s
n
0.4199 0.9740 m
0.4199 0.9640 l
s
n
0.4328 0.1350 m
0.4328 0.1450 l
s
n
0.4328 0.9740 m
0.4328 0.9640 l
s
n
0.4457 0.1350 m
0.4457 0.1450 l
s
n
0.4457 0.9740 m
0.4457 0.9640 l
s
n
0.4715 0.1350 m
0.4715 0.1450 l
s
n
0.4715 0.9740 m
0.4715 0.9640 l
s
n
0.4843 0.1350 m
0.4843 0.1450 l
s
n
0.4843 0.9740 m
0.4843 0.9640 l
s
n
0.4972 0.1350 m
0.4972 0.1450 l
s
n
0.4972 0.9740 m
0.4972 0.9640 l
s
n
0.5101 0.1350 m
0.5101 0.1450 l
s
n
0.5101 0.9740 m
0.5101 0.9640 l
s
n
0.5230 0.1350 m
0.5230 0.1450 l
s
n
0.5230 0.9740 m
0.5230 0.9640 l
s
n
0.5359 0.1350 m
0.5359 0.1450 l
s
n
0.5359 0.9740 m
0.5359 0.9640 l
s
n
0.5488 0.1350 m
0.5488 0.1450 l
s
n
0.5488 0.9740 m
0.5488 0.9640 l
s
n
0.5617 0.1350 m
0.5617 0.1450 l
s
n
0.5617 0.9740 m
0.5617 0.9640 l
s
n
0.5746 0.1350 m
0.5746 0.1450 l
s
n
0.5746 0.9740 m
0.5746 0.9640 l
s
n
0.6004 0.1350 m
0.6004 0.1450 l
s
n
0.6004 0.9740 m
0.6004 0.9640 l
s
n
0.6133 0.1350 m
0.6133 0.1450 l
s
n
0.6133 0.9740 m
0.6133 0.9640 l
s
n
0.6262 0.1350 m
0.6262 0.1450 l
s
n
0.6262 0.9740 m
0.6262 0.9640 l
s
n
0.6391 0.1350 m
0.6391 0.1450 l
s
n
0.6391 0.9740 m
0.6391 0.9640 l
s
n
0.6520 0.1350 m
0.6520 0.1450 l
s
n
0.6520 0.9740 m
0.6520 0.9640 l
s
n
0.6649 0.1350 m
0.6649 0.1450 l
s
n
0.6649 0.9740 m
0.6649 0.9640 l
s
n
0.6778 0.1350 m
0.6778 0.1450 l
s
n
0.6778 0.9740 m
0.6778 0.9640 l
s
n
0.6907 0.1350 m
0.6907 0.1450 l
s
n
0.6907 0.9740 m
0.6907 0.9640 l
s
n
0.7035 0.1350 m
0.7035 0.1450 l
s
n
0.7035 0.9740 m
0.7035 0.9640 l
s
n
0.7293 0.1350 m
0.7293 0.1450 l
s
n
0.7293 0.9740 m
0.7293 0.9640 l
s
n
0.7422 0.1350 m
0.7422 0.1450 l
s
n
0.7422 0.9740 m
0.7422 0.9640 l
s
n
0.7551 0.1350 m
0.7551 0.1450 l
s
n
0.7551 0.9740 m
0.7551 0.9640 l
s
n
0.7680 0.1350 m
0.7680 0.1450 l
s
n
0.7680 0.9740 m
0.7680 0.9640 l
s
n
0.7809 0.1350 m
0.7809 0.1450 l
s
n
0.7809 0.9740 m
0.7809 0.9640 l
s
n
0.7938 0.1350 m
0.7938 0.1450 l
s
n
0.7938 0.9740 m
0.7938 0.9640 l
s
n
0.8067 0.1350 m
0.8067 0.1450 l
s
n
0.8067 0.9740 m
0.8067 0.9640 l
s
n
0.8196 0.1350 m
0.8196 0.1450 l
s
n
0.8196 0.9740 m
0.8196 0.9640 l
s
n
0.8325 0.1350 m
0.8325 0.1450 l
s
n
0.8325 0.9740 m
0.8325 0.9640 l
s
n
0.8583 0.1350 m
0.8583 0.1450 l
s
n
0.8583 0.9740 m
0.8583 0.9640 l
s
n
0.8712 0.1350 m
0.8712 0.1450 l
s
n
0.8712 0.9740 m
0.8712 0.9640 l
s
n
0.8841 0.1350 m
0.8841 0.1450 l
s
n
0.8841 0.9740 m
0.8841 0.9640 l
s
n
0.8970 0.1350 m
0.8970 0.1450 l
s
n
0.8970 0.9740 m
0.8970 0.9640 l
s
n
0.9098 0.1350 m
0.9098 0.1450 l
s
n
0.9098 0.9740 m
0.9098 0.9640 l
s
n
0.9227 0.1350 m
0.9227 0.1450 l
s
n
0.9227 0.9740 m
0.9227 0.9640 l
s
n
0.9356 0.1350 m
0.9356 0.1450 l
s
n
0.9356 0.9740 m
0.9356 0.9640 l
s
n
0.9485 0.1350 m
0.9485 0.1450 l
s
n
0.9485 0.9740 m
0.9485 0.9640 l
s
n
0.9614 0.1350 m
0.9614 0.1450 l
s
n
0.9614 0.9740 m
0.9614 0.9640 l
s
n
0.9872 0.1350 m
0.9872 0.1450 l
s
n
0.9872 0.9740 m
0.9872 0.9640 l
s
n
1.0001 0.1350 m
1.0001 0.1450 l
s
n
1.0001 0.9740 m
1.0001 0.9640 l
s
n
1.0130 0.1350 m
1.0130 0.1450 l
s
n
1.0130 0.9740 m
1.0130 0.9640 l
s
n
0.2007 0.1350 m
0.2007 0.1634 l
s
n
0.2007 0.9740 m
0.2007 0.9456 l
s
n
0.3296 0.1350 m
0.3296 0.1634 l
s
n
0.3296 0.9740 m
0.3296 0.9456 l
s
n
0.4586 0.1350 m
0.4586 0.1634 l
s
n
0.4586 0.9740 m
0.4586 0.9456 l
s
n
0.5875 0.1350 m
0.5875 0.1634 l
s
n
0.5875 0.9740 m
0.5875 0.9456 l
s
n
0.7164 0.1350 m
0.7164 0.1634 l
s
n
0.7164 0.9740 m
0.7164 0.9456 l
s
n
0.8454 0.1350 m
0.8454 0.1634 l
s
n
0.8454 0.9740 m
0.8454 0.9456 l
s
n
0.9743 0.1350 m
0.9743 0.1634 l
s
n
0.9743 0.9740 m
0.9743 0.9456 l
s
/Helvetica findfont
dup length dict begin
 {1 index /FID ne {def} {pop pop} ifelse} forall
 /Encoding DefEncoding def
 currentdict
end
/Font4 exch definefont pop
/Font4 FFSF
0.1584 0.0882 m
GS
[0.0518 0.0000 0.0000 0.0518 0 0] CC
(122) show
GR
/Font4 FFSF
0.2876 0.0882 m
GS
[0.0518 0.0000 0.0000 0.0518 0 0] CC
(123) show
GR
/Font4 FFSF
0.4163 0.0882 m
GS
[0.0518 0.0000 0.0000 0.0518 0 0] CC
(124) show
GR
/Font4 FFSF
0.5452 0.0882 m
GS
[0.0518 0.0000 0.0000 0.0518 0 0] CC
(125) show
GR
/Font4 FFSF
0.6742 0.0882 m
GS
[0.0518 0.0000 0.0000 0.0518 0 0] CC
(126) show
GR
/Font4 FFSF
0.8031 0.0882 m
GS
[0.0518 0.0000 0.0000 0.0518 0 0] CC
(127) show
GR
/Font4 FFSF
0.9321 0.0882 m
GS
[0.0518 0.0000 0.0000 0.0518 0 0] CC
(128) show
GR
/Font4 FFSF
0.4595 0.0343 m
GS
[0.0574 0.0000 0.0000 0.0574 0 0] CC
(M) show
GR
/Symbol findfont
/Font12 exch definefont pop
/Font12 FFSF
0.5072 0.0114 m
GS
[0.0406 0.0000 0.0000 0.0406 0 0] CC
(gg) show
GR
/Font4 FFSF
0.5406 0.0343 m
GS
[0.0574 0.0000 0.0000 0.0574 0 0] CC
(  [GeV]) show
GR
[] 0 SD
0.0015 SLW
n
0.1620 0.1350 m
0.1620 0.9740 l
s
n
1.0130 0.1350 m
1.0130 0.9740 l
s
[] 0 SD
0.0030 SLW
n
0.1620 0.1686 m
0.1720 0.1686 l
s
n
1.0130 0.1686 m
1.0030 0.1686 l
s
n
0.1620 0.2021 m
0.1720 0.2021 l
s
n
1.0130 0.2021 m
1.0030 0.2021 l
s
n
0.1620 0.2357 m
0.1720 0.2357 l
s
n
1.0130 0.2357 m
1.0030 0.2357 l
s
n
0.1620 0.2692 m
0.1720 0.2692 l
s
n
1.0130 0.2692 m
1.0030 0.2692 l
s
n
0.1620 0.3364 m
0.1720 0.3364 l
s
n
1.0130 0.3364 m
1.0030 0.3364 l
s
n
0.1620 0.3699 m
0.1720 0.3699 l
s
n
1.0130 0.3699 m
1.0030 0.3699 l
s
n
0.1620 0.4035 m
0.1720 0.4035 l
s
n
1.0130 0.4035 m
1.0030 0.4035 l
s
n
0.1620 0.4370 m
0.1720 0.4370 l
s
n
1.0130 0.4370 m
1.0030 0.4370 l
s
n
0.1620 0.5042 m
0.1720 0.5042 l
s
n
1.0130 0.5042 m
1.0030 0.5042 l
s
n
0.1620 0.5377 m
0.1720 0.5377 l
s
n
1.0130 0.5377 m
1.0030 0.5377 l
s
n
0.1620 0.5713 m
0.1720 0.5713 l
s
n
1.0130 0.5713 m
1.0030 0.5713 l
s
n
0.1620 0.6048 m
0.1720 0.6048 l
s
n
1.0130 0.6048 m
1.0030 0.6048 l
s
n
0.1620 0.6720 m
0.1720 0.6720 l
s
n
1.0130 0.6720 m
1.0030 0.6720 l
s
n
0.1620 0.7055 m
0.1720 0.7055 l
s
n
1.0130 0.7055 m
1.0030 0.7055 l
s
n
0.1620 0.7391 m
0.1720 0.7391 l
s
n
1.0130 0.7391 m
1.0030 0.7391 l
s
n
0.1620 0.7726 m
0.1720 0.7726 l
s
n
1.0130 0.7726 m
1.0030 0.7726 l
s
n
0.1620 0.8398 m
0.1720 0.8398 l
s
n
1.0130 0.8398 m
1.0030 0.8398 l
s
n
0.1620 0.8733 m
0.1720 0.8733 l
s
n
1.0130 0.8733 m
1.0030 0.8733 l
s
n
0.1620 0.9069 m
0.1720 0.9069 l
s
n
1.0130 0.9069 m
1.0030 0.9069 l
s
n
0.1620 0.9404 m
0.1720 0.9404 l
s
n
1.0130 0.9404 m
1.0030 0.9404 l
s
n
0.1620 0.1350 m
0.1820 0.1350 l
s
n
1.0130 0.1350 m
0.9930 0.1350 l
s
n
0.1620 0.3028 m
0.1820 0.3028 l
s
n
1.0130 0.3028 m
0.9930 0.3028 l
s
n
0.1620 0.4706 m
0.1820 0.4706 l
s
n
1.0130 0.4706 m
0.9930 0.4706 l
s
n
0.1620 0.6384 m
0.1820 0.6384 l
s
n
1.0130 0.6384 m
0.9930 0.6384 l
s
n
0.1620 0.8062 m
0.1820 0.8062 l
s
n
1.0130 0.8062 m
0.9930 0.8062 l
s
n
0.1620 0.9740 m
0.1820 0.9740 l
s
n
1.0130 0.9740 m
0.9930 0.9740 l
s
/Font4 FFSF
0.0826 0.1172 m
GS
[0.0518 0.0000 0.0000 0.0518 0 0] CC
(0.0) show
GR
/Font4 FFSF
0.0822 0.2850 m
GS
[0.0518 0.0000 0.0000 0.0518 0 0] CC
(0.5) show
GR
/Font4 FFSF
0.0826 0.4528 m
GS
[0.0518 0.0000 0.0000 0.0518 0 0] CC
(1.0) show
GR
/Font4 FFSF
0.0822 0.6206 m
GS
[0.0518 0.0000 0.0000 0.0518 0 0] CC
(1.5) show
GR
/Font4 FFSF
0.0826 0.7884 m
GS
[0.0518 0.0000 0.0000 0.0518 0 0] CC
(2.0) show
GR
/Font4 FFSF
0.0822 0.9562 m
GS
[0.0518 0.0000 0.0000 0.0518 0 0] CC
(2.5) show
GR
/Font4 FFSF
0.0429 0.3469 m
GS
[0.0000 0.0529 -0.0529 0.0000 0 0] CC
(d) show
GR
/Font12 FFSF
0.0429 0.3763 m
GS
[0.0000 0.0529 -0.0529 0.0000 0 0] CC
(s) show
GR
/Font4 FFSF
0.0429 0.4081 m
GS
[0.0000 0.0529 -0.0529 0.0000 0 0] CC
(/dM) show
GR
/Font12 FFSF
0.0641 0.4965 m
GS
[0.0000 0.0374 -0.0374 0.0000 0 0] CC
(gg) show
GR
/Font4 FFSF
0.0429 0.5272 m
GS
[0.0000 0.0529 -0.0529 0.0000 0 0] CC
(   [fb/GeV]) show
GR
n
0.1620 0.1350 m
0.1620 0.9740 l
1.0130 0.9740 l
1.0130 0.1350 l
0.1620 0.1350 l
c
s
n
0.5500 0.3500 m
0.5500 0.2731 l
0.8816 0.2731 l
0.8816 0.3500 l
c
[/DeviceRGB] SCS
Color0 SC
eofill
[/DeviceRGB] SCS
Color1 SC
[] 0 SD
0.0015 SLW
n
0.5500 0.3500 m
0.5500 0.2731 l
0.8816 0.2731 l
0.8816 0.3500 l
0.5500 0.3500 l
c
s
/Font4 FFSF
0.6623 0.3171 m
GS
[0.0308 0.0000 0.0000 0.0308 0 0] CC
(No interference) show
GR
[/DeviceRGB] SCS
Color2 SC
[] 0 SD
0.0030 SLW
n
0.5623 0.3282 m
0.6422 0.3282 l
s
/Font4 FFSF
[/DeviceRGB] SCS
Color1 SC
0.6623 0.2839 m
GS
[0.0308 0.0000 0.0000 0.0308 0 0] CC
(Total) show
GR
[/DeviceRGB] SCS
Color4 SC
[] 0 SD
0.0045 SLW
n
0.5623 0.2947 m
0.6422 0.2947 l
s
/Font12 FFSF
[/DeviceRGB] SCS
Color1 SC
0.1913 0.9150 m
GS
[0.0381 0.0000 0.0000 0.0381 0 0] CC
(s) show
GR
/Font4 FFSF
0.2141 0.8998 m
GS
[0.0269 0.0000 0.0000 0.0269 0 0] CC
(MR) show
GR
/Font4 FFSF
0.2560 0.9150 m
GS
[0.0381 0.0000 0.0000 0.0381 0 0] CC
( = 1.7 GeV) show
GR
/Font4 FFSF
0.1925 0.8638 m
GS
[0.0381 0.0000 0.0000 0.0381 0 0] CC
(p) show
GR
/Font4 FFSF
0.2138 0.8485 m
GS
[0.0269 0.0000 0.0000 0.0269 0 0] CC
(T) show
GR
/Font4 FFSF
0.2301 0.8638 m
GS
[0.0381 0.0000 0.0000 0.0381 0 0] CC
(\() show
GR
/Font12 FFSF
0.2429 0.8638 m
GS
[0.0381 0.0000 0.0000 0.0381 0 0] CC
(g) show
GR
/Font4 FFSF
0.2584 0.8638 m
GS
[0.0381 0.0000 0.0000 0.0381 0 0] CC
(\) > 40 GeV) show
GR
/Font4 FFSF
0.1913 0.8100 m
GS
[0.0381 0.0000 0.0000 0.0381 0 0] CC
(|) show
GR
/Font12 FFSF
0.2013 0.8100 m
GS
[0.0381 0.0000 0.0000 0.0381 0 0] CC
(h) show
GR
/Font12 FFSF
0.2242 0.7948 m
GS
[0.0269 0.0000 0.0000 0.0269 0 0] CC
(g) show
GR
/Font4 FFSF
0.2355 0.8100 m
GS
[0.0381 0.0000 0.0000 0.0381 0 0] CC
(| < 2.5) show
GR
/Font4 FFSF
0.1925 0.7562 m
GS
[0.0381 0.0000 0.0000 0.0381 0 0] CC
(8 TeV LHC) show
GR
/Font4 FFSF
1.0530 0.4885 m
GS
[-0.0006 0.0367 -0.0367 -0.0006 0 0] CC
(LHC HIGGS XS WG 2013) show
GR
%%Trailer
%%BoundingBox: 1 0 653 616
%%DocumentNeededResources: font Helvetica
%%+ font Symbol
%%EOF
