%!PS-Adobe-2.0 EPSF-2.0
%%BoundingBox:  0 0 567 384
%%Title: h8vbf-as0117.eps: multigraph
%%Creator: ROOT Version 5.34/00
%%CreationDate: Fri Jun  7 12:16:44 2013
%%EndComments
%%BeginProlog
80 dict begin
/s {stroke} def /l {lineto} def /m {moveto} def /t {translate} def
/r {rotate} def /rl {roll}  def /R {repeat} def
/d {rlineto} def /rm {rmoveto} def /gr {grestore} def /f {eofill} def
/c {setrgbcolor} def /black {0 setgray} def /sd {setdash} def
/cl {closepath} def /sf {scalefont setfont} def /lw {setlinewidth} def
/box {m dup 0 exch d exch 0 d 0 exch neg d cl} def
/NC{systemdict begin initclip end}def/C{NC box clip newpath}def
/bl {box s} def /bf {box f} def /Y { 0 exch d} def /X { 0 d} def 
/K {{pop pop 0 moveto} exch kshow} bind def
/ita {/ang 15 def gsave [1 0 ang dup sin exch cos div 1 0 0] concat} def 
/mp {newpath /y exch def /x exch def} def
/side {[w .77 mul w .23 mul] .385 w mul sd w 0 l currentpoint t -144 r} def
/mr {mp x y w2 0 360 arc} def /m24 {mr s} def /m20 {mr f} def
/mb {mp x y w2 add m w2 neg 0 d 0 w neg d w 0 d 0 w d cl} def
/mt {mp x y w2 add m w2 neg w neg d w 0 d cl} def
/m21 {mb f} def /m25 {mb s} def /m22 {mt f} def /m26{mt s} def
/m23 {mp x y w2 sub m w2 w d w neg 0 d cl f} def
/m27 {mp x y w2 add m w3 neg w2 neg d w3 w2 neg d w3 w2 d cl s} def
/m28 {mp x w2 sub y w2 sub w3 add m w3 0 d  0 w3 neg d w3 0 d 0 w3 d w3 0 d  0 w3 d w3 neg 0 d 0 w3 d w3 neg 0 d 0 w3 neg d w3 neg 0 d cl s } def
/m29 {mp gsave x w2 sub y w2 add w3 sub m currentpoint t 4 {side} repeat cl fill gr} def
/m30 {mp gsave x w2 sub y w2 add w3 sub m currentpoint t 4 {side} repeat cl s gr} def
/m31 {mp x y w2 sub m 0 w d x w2 sub y m w 0 d x w2 sub y w2 add m w w neg d x w2 sub y w2 sub m w w d s} def
/m32 {mp x y w2 sub m w2 w d w neg 0 d cl s} def
/m33 {mp x y w2 add m w3 neg w2 neg d w3 w2 neg d w3 w2 d cl f} def
/m34 {mp x w2 sub y w2 sub w3 add m w3 0 d  0 w3 neg d w3 0 d 0 w3 d w3 0 d  0 w3 d w3 neg 0 d 0 w3 d w3 neg 0 d 0 w3 neg d w3 neg 0 d cl f } def
/m2 {mp x y w2 sub m 0 w d x w2 sub y m w 0 d s} def
/m5 {mp x w2 sub y w2 sub m w w d x w2 sub y w2 add m w w neg d s} def
/reEncode {exch findfont dup length dict begin {1 index /FID eq  {pop pop} {def} ifelse } forall /Encoding exch def currentdict end dup /FontName get exch definefont pop } def [/Times-Bold /Times-Italic /Times-BoldItalic /Helvetica /Helvetica-Oblique
 /Helvetica-Bold /Helvetica-BoldOblique /Courier /Courier-Oblique /Courier-Bold /Courier-BoldOblique /Times-Roman /AvantGarde-Book /AvantGarde-BookOblique /AvantGarde-Demi /AvantGarde-DemiOblique /Bookman-Demi /Bookman-DemiItalic /Bookman-Light
 /Bookman-LightItalic /Helvetica-Narrow /Helvetica-Narrow-Bold /Helvetica-Narrow-BoldOblique /Helvetica-Narrow-Oblique /NewCenturySchlbk-Roman /NewCenturySchlbk-Bold /NewCenturySchlbk-BoldItalic /NewCenturySchlbk-Italic /Palatino-Bold
 /Palatino-BoldItalic /Palatino-Italic /Palatino-Roman ] {ISOLatin1Encoding reEncode } forall
%%EndProlog
%%BeginSetup
%%EndSetup
newpath  gsave  .25 .25 scale  gsave  0 0 t black[  ] 0 sd 3 lw 1 1 1 c 2268 1538 0 0 bf black 1 1 1 c 1814 1230 227 154 bf black 1814 1230 227 154 bl 1 1 1 c 1814 1230 227 154 bf black 1814 1230 227 154 bl 227 154 m 1814 X s 227 1384 m 1814 X s 227
 154 m 1230 Y s[ 4 8] 0 sd 2041 154 m -1814 X s 2041 359 m -1814 X s 2041 564 m -1814 X s 2041 769 m -1814 X s 2041 974 m -1814 X s 2041 1179 m -1814 X s 2041 1384 m -1814 X s[  ] 0 sd 2041 154 m 1230 Y s 227 154 m 1814 X s 227 1384 m 1814 X s 227
 154 m 1230 Y s
 gsave  2268 1538 0 0 C 58.6478 674.45 t 90 r /Helvetica findfont 71.6807 sf 0 0 m (\(H\) [pb]) show NC gr 
 gsave  2268 1538 0 0 C 55.3896 632.093 t 90 r /Symbol findfont 71.6807 sf 0 0 m (s) show NC gr  281 154 m -54 X s 254 195 m -27 X s 254 236 m -27 X s 254 277 m -27 X s 254 318 m -27 X s 281 359 m -54 X s 254 400 m -27 X s 254 441 m -27 X s 254 482 m
 -27 X s 254 523 m -27 X s 281 564 m -54 X s 254 605 m -27 X s 254 646 m -27 X s 254 687 m -27 X s 254 728 m -27 X s 281 769 m -54 X s 254 810 m -27 X s 254 851 m -27 X s 254 892 m -27 X s 254 933 m -27 X s 281 974 m -54 X s 254 1015 m -27 X s 254
 1056 m -27 X s 254 1097 m -27 X s 254 1138 m -27 X s 281 1179 m -54 X s 254 1220 m -27 X s 254 1261 m -27 X s 254 1302 m -27 X s 254 1343 m -27 X s 281 1384 m -54 X s
 gsave  2268 1538 0 0 C 117.296 130.329 t 0 r /Helvetica findfont 71.6807 sf 0 0 m (1.5) show NC gr 
 gsave  2268 1538 0 0 C 78.1971 335.596 t 0 r /Helvetica findfont 71.6807 sf 0 0 m (1.55) show NC gr 
 gsave  2268 1538 0 0 C 117.296 540.863 t 0 r /Helvetica findfont 71.6807 sf 0 0 m (1.6) show NC gr 
 gsave  2268 1538 0 0 C 78.1971 742.873 t 0 r /Helvetica findfont 71.6807 sf 0 0 m (1.65) show NC gr 
 gsave  2268 1538 0 0 C 117.296 944.882 t 0 r /Helvetica findfont 71.6807 sf 0 0 m (1.7) show NC gr 
 gsave  2268 1538 0 0 C 78.1971 1153.41 t 0 r /Helvetica findfont 71.6807 sf 0 0 m (1.75) show NC gr 
 gsave  2268 1538 0 0 C 117.296 1358.67 t 0 r /Helvetica findfont 71.6807 sf 0 0 m (1.8) show NC gr  2041 154 m 1230 Y s 1987 154 m 54 X s 2014 195 m 27 X s 2014 236 m 27 X s 2014 277 m 27 X s 2014 318 m 27 X s 1987 359 m 54 X s 2014 400 m 27 X s
 2014 441 m 27 X s 2014 482 m 27 X s 2014 523 m 27 X s 1987 564 m 54 X s 2014 605 m 27 X s 2014 646 m 27 X s 2014 687 m 27 X s 2014 728 m 27 X s 1987 769 m 54 X s 2014 810 m 27 X s 2014 851 m 27 X s 2014 892 m 27 X s 2014 933 m 27 X s 1987 974 m 54 X
 s 2014 1015 m 27 X s 2014 1056 m 27 X s 2014 1097 m 27 X s 2014 1138 m 27 X s 1987 1179 m 54 X s 2014 1220 m 27 X s 2014 1261 m 27 X s 2014 1302 m 27 X s 2014 1343 m 27 X s 1987 1384 m 54 X s 1 0 0 c 6 lw 408 730 m 59 Y s 402 789 m 13 X s 408 685 m
 -60 Y s 402 625 m 13 X s black 1 0 0 c 3 lw /w 47 def /w2 {w 2 div} def /w3 {w 3 div} def 408 707 m20 6 lw 0 0 1 c 771 812 m 96 Y s 765 908 m 13 X s 771 767 m -96 Y s 765 671 m 13 X s black 0 0 1 c 3 lw 771 789 m21 6 lw black 1134 919 m 100 Y s 1127
 1019 m 13 X s 1134 873 m -100 Y s 1127 773 m 13 X s 3 lw 1134 896 m22 6 lw 0.4 0.4 0.4 c 1497 1112 m 59 Y s 1490 1171 m 13 X s 1497 1066 m -59 Y s 1490 1007 m 13 X s black 0.4 0.4 0.4 c 3 lw 1497 1089 m23 6 lw 0 1 0 c 1860 866 m 186 Y s 1853 1052 m
 13 X s 1860 820 m -186 Y s 1853 634 m 13 X s black 0 1 0 c 3 lw 1860 843 m24 6 lw 1 1 1 c black
 gsave  2268 1538 0 0 C 1159.92 1469.45 t 0 r /Helvetica findfont 55.3896 sf 0 0 m 
 667 635 623 607 576 564 533 517 499 467 439 408 377 361 327 287 249 234 215 200 169 137 110 95 64 48 16
( = 0.117 \255 PDF uncertainties) K NC gr 
 gsave  2268 1538 0 0 C 1137.12 1446.65 t 0 r /Helvetica findfont 35.8403 sf 0 0 m (S) show NC gr 
 gsave  2268 1538 0 0 C 1101.28 1469.45 t 0 r /Symbol findfont 55.3896 sf 0 0 m (a) show NC gr 
 gsave  2268 1538 0 0 C 420.31 1469.45 t 0 r /Helvetica findfont 55.3896 sf 0 0 m 
 675 656 641 597 566 526 485 428 394 357 319 304 285 270 232 201 173 159 127 112 71 31
(LHC 8 TeV \255 VBF@NNLO \255 ) K NC gr 
 gsave  2268 1538 0 0 C 592.995 534.347 t 0 r /Helvetica findfont 55.3896 sf 0 0 m (NNPDF2.3) show NC gr  1 0 0 c 301 557 m 242 X s 3 lw 422 557 m20 6 lw black
 gsave  2268 1538 0 0 C 592.995 449.633 t 0 r /Helvetica findfont 55.3896 sf 0 0 m (MSTW08) show NC gr  0 0 1 c 301 471 m 242 X s 3 lw 422 471 m21 6 lw black
 gsave  2268 1538 0 0 C 592.995 361.662 t 0 r /Helvetica findfont 55.3896 sf 0 0 m (CT10) show NC gr  301 384 m 242 X s 3 lw 422 384 m22 6 lw
 gsave  2268 1538 0 0 C 592.995 276.948 t 0 r /Helvetica findfont 55.3896 sf 0 0 m 
 145 119 73 37
(ABM11) K NC gr  0.4 0.4 0.4 c 301 298 m 242 X s 3 lw 422 298 m23 6 lw black
 gsave  2268 1538 0 0 C 592.995 192.235 t 0 r /Helvetica findfont 55.3896 sf 0 0 m (HERAPDF1.5) show NC gr  0 1 0 c 301 212 m 242 X s 3 lw 422 212 m24 6 lw black
 gsave  2268 1538 0 0 C 2166.71 847.135 t 90 r /Helvetica-BoldOblique findfont 45.615 sf 0 0 m (LHC HIGGS XS WG 2013) show NC gr 
 gr  gr showpage
end
%%EOF
