%!PS-Adobe-2.0 EPSF-2.0
%%BoundingBox:  0 0 567 544
%%Title: HWW_900_met_rel_reweighting_cut_YR3.eps: HWW 900Gev MET rel reweighting for interference with cuts
%%Creator: ROOT Version 5.34/05
%%CreationDate: Fri Jun 14 04:49:37 2013
%%EndComments
%%BeginProlog
80 dict begin
/s {stroke} def /l {lineto} def /m {moveto} def /t {translate} def
/r {rotate} def /rl {roll}  def /R {repeat} def
/d {rlineto} def /rm {rmoveto} def /gr {grestore} def /f {eofill} def
/c {setrgbcolor} def /black {0 setgray} def /sd {setdash} def
/cl {closepath} def /sf {scalefont setfont} def /lw {setlinewidth} def
/box {m dup 0 exch d exch 0 d 0 exch neg d cl} def
/NC{systemdict begin initclip end}def/C{NC box clip newpath}def
/bl {box s} def /bf {box f} def /Y { 0 exch d} def /X { 0 d} def 
/K {{pop pop 0 moveto} exch kshow} bind def
/ita {/ang 15 def gsave [1 0 ang dup sin exch cos div 1 0 0] concat} def 
/mp {newpath /y exch def /x exch def} def
/side {[w .77 mul w .23 mul] .385 w mul sd w 0 l currentpoint t -144 r} def
/mr {mp x y w2 0 360 arc} def /m24 {mr s} def /m20 {mr f} def
/mb {mp x y w2 add m w2 neg 0 d 0 w neg d w 0 d 0 w d cl} def
/mt {mp x y w2 add m w2 neg w neg d w 0 d cl} def
/m21 {mb f} def /m25 {mb s} def /m22 {mt f} def /m26{mt s} def
/m23 {mp x y w2 sub m w2 w d w neg 0 d cl f} def
/m27 {mp x y w2 add m w3 neg w2 neg d w3 w2 neg d w3 w2 d cl s} def
/m28 {mp x w2 sub y w2 sub w3 add m w3 0 d  0 w3 neg d w3 0 d 0 w3 d w3 0 d  0 w3 d w3 neg 0 d 0 w3 d w3 neg 0 d 0 w3 neg d w3 neg 0 d cl s } def
/m29 {mp gsave x w2 sub y w2 add w3 sub m currentpoint t 4 {side} repeat cl fill gr} def
/m30 {mp gsave x w2 sub y w2 add w3 sub m currentpoint t 4 {side} repeat cl s gr} def
/m31 {mp x y w2 sub m 0 w d x w2 sub y m w 0 d x w2 sub y w2 add m w w neg d x w2 sub y w2 sub m w w d s} def
/m32 {mp x y w2 sub m w2 w d w neg 0 d cl s} def
/m33 {mp x y w2 add m w3 neg w2 neg d w3 w2 neg d w3 w2 d cl f} def
/m34 {mp x w2 sub y w2 sub w3 add m w3 0 d  0 w3 neg d w3 0 d 0 w3 d w3 0 d  0 w3 d w3 neg 0 d 0 w3 d w3 neg 0 d 0 w3 neg d w3 neg 0 d cl f } def
/m2 {mp x y w2 sub m 0 w d x w2 sub y m w 0 d s} def
/m5 {mp x w2 sub y w2 sub m w w d x w2 sub y w2 add m w w neg d s} def
/reEncode {exch findfont dup length dict begin {1 index /FID eq  {pop pop} {def} ifelse } forall /Encoding exch def currentdict end dup /FontName get exch definefont pop } def [/Times-Bold /Times-Italic /Times-BoldItalic /Helvetica /Helvetica-Oblique
 /Helvetica-Bold /Helvetica-BoldOblique /Courier /Courier-Oblique /Courier-Bold /Courier-BoldOblique /Times-Roman /AvantGarde-Book /AvantGarde-BookOblique /AvantGarde-Demi /AvantGarde-DemiOblique /Bookman-Demi /Bookman-DemiItalic /Bookman-Light
 /Bookman-LightItalic /Helvetica-Narrow /Helvetica-Narrow-Bold /Helvetica-Narrow-BoldOblique /Helvetica-Narrow-Oblique /NewCenturySchlbk-Roman /NewCenturySchlbk-Bold /NewCenturySchlbk-BoldItalic /NewCenturySchlbk-Italic /Palatino-Bold
 /Palatino-BoldItalic /Palatino-Italic /Palatino-Roman ] {ISOLatin1Encoding reEncode } forall
%%EndProlog
%%BeginSetup
%%EndSetup
newpath  gsave  .25 .25 scale  gsave  0 0 t black[  ] 0 sd 3 lw 1 1 1 c 2268 2177 0 0 bf black 1 1 1 c 2268 1568 0 609 bf black 1 1 1 c 1814 1411 227 609 bf black 1814 1411 227 609 bl 0 0 1 c 1 1 1 c 0 0 1 c 227 1103 m 18 X 3 Y 18 X 9 Y 18 X -7 Y 18
 X 19 Y 18 X 6 Y 19 X 17 Y 18 X 8 Y 18 X 22 Y 18 X 8 Y 18 X 3 Y 18 X 21 Y 18 X 14 Y 19 X -2 Y 18 X 9 Y 18 X 10 Y 18 X 11 Y 18 X 18 Y 18 X 10 Y 18 X 21 Y 19 X 27 Y 18 X 46 Y 18 X 224 Y 18 X 178 Y 18 X 30 Y 18 X 11 Y 18 X 26 Y 19 X 14 Y 18 X 22 Y 18 X
 17 Y 18 X 16 Y 18 X 16 Y 18 X 11 Y 18 X 12 Y 19 X -9 Y 18 X -9 Y 18 X -8 Y 18 X -44 Y 18 X -44 Y 18 X -112 Y 18 X -139 Y 19 X -113 Y 18 X -97 Y 18 X -85 Y 18 X -68 Y 18 X -66 Y 18 X -52 Y 18 X -45 Y 19 X -42 Y 18 X -36 Y 18 X -35 Y 18 X -29 Y 18 X
 -28 Y 18 X -28 Y 18 X -19 Y 19 X -24 Y 18 X -18 Y 18 X -15 Y 18 X -19 Y 18 X -13 Y 18 X -9 Y 18 X -15 Y 19 X -8 Y 18 X -12 Y 18 X -8 Y 18 X -9 Y 18 X -6 Y 18 X -6 Y 18 X -5 Y 19 X -8 Y 18 X -7 Y 18 X -3 Y 18 X -4 Y 18 X -2 Y 18 X -5 Y 18 X -3 Y 19 X
 -2 Y 18 X -4 Y 18 X -3 Y 18 X -1 Y 18 X -3 Y 18 X -2 Y 37 X -3 Y 18 X -1 Y 18 X -2 Y 18 X -2 Y 18 X -1 Y 18 X 1 Y 18 X -2 Y 19 X -1 Y 18 X -1 Y 36 X -2 Y 36 X -1 Y 37 X -1 Y 54 X s black 227 609 m 1814 X s 227 647 m -38 Y s 272 628 m -19 Y s 317 628
 m -19 Y s 363 628 m -19 Y s 408 647 m -38 Y s 454 628 m -19 Y s 499 628 m -19 Y s 544 628 m -19 Y s 590 647 m -38 Y s 635 628 m -19 Y s 680 628 m -19 Y s 726 628 m -19 Y s 771 647 m -38 Y s 816 628 m -19 Y s 862 628 m -19 Y s 907 628 m -19 Y s 952
 647 m -38 Y s 998 628 m -19 Y s 1043 628 m -19 Y s 1089 628 m -19 Y s 1134 647 m -38 Y s 1179 628 m -19 Y s 1225 628 m -19 Y s 1270 628 m -19 Y s 1315 647 m -38 Y s 1361 628 m -19 Y s 1406 628 m -19 Y s 1451 628 m -19 Y s 1497 647 m -38 Y s 1542 628
 m -19 Y s 1587 628 m -19 Y s 1633 628 m -19 Y s 1678 647 m -38 Y s 1723 628 m -19 Y s 1769 628 m -19 Y s 1814 628 m -19 Y s 1860 647 m -38 Y s 1905 628 m -19 Y s 1950 628 m -19 Y s 1996 628 m -19 Y s 2041 647 m -38 Y s
 gsave  2268 1568 0 609 C 208.919 558.382 t 0 r /Helvetica findfont 49.4479 sf 0 0 m (0) show NC gr 
 gsave  2268 1568 0 609 C 379.852 558.382 t 0 r /Helvetica findfont 49.4479 sf 0 0 m (20) show NC gr 
 gsave  2268 1568 0 609 C 562.181 558.382 t 0 r /Helvetica findfont 49.4479 sf 0 0 m (40) show NC gr 
 gsave  2268 1568 0 609 C 740.711 558.382 t 0 r /Helvetica findfont 49.4479 sf 0 0 m (60) show NC gr 
 gsave  2268 1568 0 609 C 923.04 558.382 t 0 r /Helvetica findfont 49.4479 sf 0 0 m (80) show NC gr 
 gsave  2268 1568 0 609 C 1090.18 558.382 t 0 r /Helvetica findfont 49.4479 sf 0 0 m (100) show NC gr 
 gsave  2268 1568 0 609 C 1272.5 558.382 t 0 r /Helvetica findfont 49.4479 sf 0 0 m (120) show NC gr 
 gsave  2268 1568 0 609 C 1454.83 558.382 t 0 r /Helvetica findfont 49.4479 sf 0 0 m (140) show NC gr 
 gsave  2268 1568 0 609 C 1633.36 558.382 t 0 r /Helvetica findfont 49.4479 sf 0 0 m (160) show NC gr 
 gsave  2268 1568 0 609 C 1815.69 558.382 t 0 r /Helvetica findfont 49.4479 sf 0 0 m (180) show NC gr 
 gsave  2268 1568 0 609 C 1998.02 558.382 t 0 r /Helvetica findfont 49.4479 sf 0 0 m (200) show NC gr  227 609 m 1411 Y s
 gsave  2268 1568 0 609 C 68.3734 1348.47 t 90 r /Helvetica findfont 34.2332 sf 0 0 m (T,rel) show NC gr 
 gsave  2268 1568 0 609 C 22.7911 1348.47 t 90 r /Helvetica findfont 34.2332 sf 0 0 m (miss) show NC gr 
 gsave  2268 1568 0 609 C 49.3808 1272.5 t 90 r /Helvetica findfont 49.4479 sf 0 0 m (/dE) show NC gr 
 gsave  2268 1568 0 609 C 49.3808 1242.12 t 90 r /Symbol findfont 49.4479 sf 0 0 m (s) show NC gr 
 gsave  2268 1568 0 609 C 49.3808 1215.53 t 90 r /Helvetica findfont 49.4479 sf 0 0 m (d) show NC gr  288 609 m -61 X s 257 645 m -30 X s 257 680 m -30 X s 257 715 m -30 X s 257 750 m -30 X s 288 785 m -61 X s 257 821 m -30 X s 257 856 m -30 X s 257
 891 m -30 X s 257 926 m -30 X s 288 961 m -61 X s 257 997 m -30 X s 257 1032 m -30 X s 257 1067 m -30 X s 257 1102 m -30 X s 288 1138 m -61 X s 257 1173 m -30 X s 257 1208 m -30 X s 257 1243 m -30 X s 257 1278 m -30 X s 288 1314 m -61 X s 257 1349 m
 -30 X s 257 1384 m -30 X s 257 1419 m -30 X s 257 1454 m -30 X s 288 1490 m -61 X s 257 1525 m -30 X s 257 1560 m -30 X s 257 1595 m -30 X s 257 1630 m -30 X s 288 1666 m -61 X s 257 1701 m -30 X s 257 1736 m -30 X s 257 1771 m -30 X s 257 1806 m
 -30 X s 288 1842 m -61 X s 257 1877 m -30 X s 257 1912 m -30 X s 257 1947 m -30 X s 257 1982 m -30 X s 288 2018 m -61 X s 288 2018 m -61 X s
 gsave  2268 1568 0 609 C 186.127 592.569 t 0 r /Helvetica findfont 49.4479 sf 0 0 m (0) show NC gr 
 gsave  2268 1568 0 609 C 60.7763 767.301 t 0 r /Helvetica findfont 49.4479 sf 0 0 m (0.0005) show NC gr 
 gsave  2268 1568 0 609 C 98.7615 945.832 t 0 r /Helvetica findfont 49.4479 sf 0 0 m (0.001) show NC gr 
 gsave  2268 1568 0 609 C 60.7763 1120.56 t 0 r /Helvetica findfont 49.4479 sf 0 0 m (0.0015) show NC gr 
 gsave  2268 1568 0 609 C 91.1645 1295.3 t 0 r /Helvetica findfont 49.4479 sf 0 0 m (0.002) show NC gr 
 gsave  2268 1568 0 609 C 60.7763 1473.83 t 0 r /Helvetica findfont 49.4479 sf 0 0 m (0.0025) show NC gr 
 gsave  2268 1568 0 609 C 91.1645 1648.56 t 0 r /Helvetica findfont 49.4479 sf 0 0 m (0.003) show NC gr 
 gsave  2268 1568 0 609 C 60.7763 1823.29 t 0 r /Helvetica findfont 49.4479 sf 0 0 m (0.0035) show NC gr 
 gsave  2268 1568 0 609 C 87.366 2001.82 t 0 r /Helvetica findfont 49.4479 sf 0 0 m (0.004) show NC gr  0 0 1 c /w 2 def /w2 {w 2 div} def /w3 {w 3 div} def 236 1103 m20 254 1106 m20 272 1115 m20 290 1108 m20 308 1127 m20 327 1133 m20 345 1150 m20
 363 1158 m20 381 1180 m20 399 1188 m20 417 1191 m20 435 1212 m20 454 1226 m20 472 1224 m20 490 1233 m20 508 1243 m20 526 1254 m20 544 1272 m20 562 1282 m20 581 1303 m20 599 1330 m20 617 1376 m20 635 1600 m20 653 1778 m20 671 1808 m20 689 1819 m20
 708 1845 m20 726 1859 m20 744 1881 m20 762 1898 m20 780 1914 m20 798 1930 m20 816 1941 m20 835 1953 m20 853 1944 m20 871 1935 m20 889 1927 m20 907 1883 m20 925 1839 m20 943 1727 m20 962 1588 m20 980 1475 m20 998 1378 m20 1016 1293 m20 1034 1225 m20
 1052 1159 m20 1070 1107 m20 1089 1062 m20 1107 1020 m20 1125 984 m20 1143 949 m20 1161 920 m20 1179 892 m20 1197 864 m20 1215 845 m20 1234 821 m20 1252 803 m20 1270 788 m20 1288 769 m20 1306 756 m20 1324 747 m20 1342 732 m20 1361 724 m20 1379 712
 m20 1397 704 m20 1415 695 m20 1433 689 m20 1451 683 m20 1469 678 m20 1488 670 m20 1506 663 m20 1524 660 m20 1542 656 m20 1560 654 m20 1578 649 m20 1596 646 m20 1615 644 m20 1633 640 m20 1651 637 m20 1669 636 m20 1687 633 m20 1705 631 m20 1723 631
 m20 1742 628 m20 1760 627 m20 1778 625 m20 1796 623 m20 1814 622 m20 1832 623 m20 1850 621 m20 1869 620 m20 1887 619 m20 1905 619 m20 1923 617 m20 1941 617 m20 1959 616 m20 1977 616 m20 1996 615 m20 2014 615 m20 2032 615 m20 black 0 0 1 c 1 lw <<
 /PatternType 1 /PaintType 2 /TilingType 1 /BBox [ 0 0 100 100 ] /XStep 100 /YStep 100 /PaintProc { begin gsave 0 0 m 100 100 l 0 100 m 100 0 l s gr end } >> [ 0.24 0 0 0.24 0 0 ] makepattern /P13 exch def /cs {[/Pattern /DeviceRGB] setcolorspace}
 def /FA {f [/DeviceRGB] setcolorspace} def cs 0 0 1 P13 setcolor 236 1107 m 18 3 d 18 9 d 18 -8 d 18 20 d 19 5 d 18 18 d 18 8 d 18 22 d 18 8 d 18 3 d 18 21 d 19 14 d 18 -2 d 18 9 d 18 10 d 18 11 d 18 19 d 18 9 d 19 21 d 18 27 d 18 47 d 18 224 d 18
 178 d 18 30 d 18 11 d 19 26 d 18 15 d 18 22 d 18 17 d 18 16 d 18 16 d 18 11 d 19 12 d 18 -9 d 18 -8 d 18 -9 d 18 -43 d 18 -45 d 18 -112 d 19 -140 d 18 -113 d 18 -98 d 18 -85 d 18 -68 d 18 -67 d 18 -52 d 19 -45 d 18 -42 d 18 -36 d 18 -35 d 18 -29 d
 18 -29 d 18 -28 d 18 -19 d 19 -24 d 18 -18 d 18 -15 d 18 -19 d 18 -13 d 18 -9 d 18 -15 d 19 -9 d 18 -12 d 18 -8 d 18 -8 d 18 -7 d 18 -6 d 18 -5 d 19 -8 d 18 -7 d 18 -3 d 18 -4 d 18 -3 d 18 -4 d 18 -3 d 19 -3 d 18 -3 d 18 -3 d 18 -1 d 18 -3 d 18 -2 d
 18 -1 d 19 -3 d 18 X 18 -2 d 18 -2 d 18 -2 d 18 1 d 18 -1 d 19 -2 d 18 -1 d 18 X 18 -2 d 18 X 18 -1 d 18 X 19 -1 d 36 X -36 X -19 1 d -18 X -18 1 d -18 X -18 1 d -18 1 d -18 1 d -19 1 d -18 1 d -18 -1 d -18 2 d -18 2 d -18 2 d -18 1 d -19 2 d -18 1
 d -18 2 d -18 3 d -18 1 d -18 3 d -18 3 d -19 2 d -18 3 d -18 5 d -18 3 d -18 3 d -18 3 d -18 7 d -19 8 d -18 5 d -18 6 d -18 6 d -18 9 d -18 8 d -18 11 d -19 9 d -18 14 d -18 9 d -18 14 d -18 18 d -18 15 d -18 18 d -19 23 d -18 19 d -18 28 d -18 28
 d -18 29 d -18 35 d -18 35 d -18 43 d -19 44 d -18 52 d -18 66 d -18 67 d -18 85 d -18 97 d -18 112 d -19 139 d -18 112 d -18 44 d -18 44 d -18 8 d -18 8 d -18 10 d -19 -12 d -18 -11 d -18 -16 d -18 -16 d -18 -17 d -18 -22 d -18 -14 d -19 -26 d -18
 -11 d -18 -30 d -18 -177 d -18 -223 d -18 -46 d -18 -27 d -19 -21 d -18 -10 d -18 -18 d -18 -11 d -18 -10 d -18 -9 d -18 2 d -19 -14 d -18 -21 d -18 -3 d -18 -8 d -18 -22 d -18 -7 d -18 -18 d -19 -5 d -18 -20 d -18 7 d -18 -8 d -18 -3 d FA 3 lw 0.8
 0 0 c 1 0 0 c 0.8 0 0 c 227 881 m 18 X 4 Y 18 X 1 Y 18 X 5 Y 18 X 2 Y 18 X 8 Y 19 X 4 Y 18 X 7 Y 18 X 7 Y 18 X 4 Y 18 X 2 Y 18 X 8 Y 18 X 2 Y 19 X 2 Y 18 X -1 Y 18 X 6 Y 18 X 3 Y 18 X 4 Y 18 X 6 Y 18 X 8 Y 19 X 6 Y 18 X 16 Y 18 X 53 Y 18 X 30 Y 18 X
 -7 Y 18 X 1 Y 18 X -5 Y 19 X -10 Y 18 X -2 Y 18 X -6 Y 18 X -4 Y 18 X -6 Y 18 X -6 Y 18 X -5 Y 19 X -11 Y 18 X -10 Y 18 X -11 Y 18 X -12 Y 18 X -17 Y 18 X -18 Y 18 X -31 Y 19 X -26 Y 18 X -21 Y 18 X -18 Y 18 X -19 Y 18 X -19 Y 18 X -13 Y 18 X -14 Y
 19 X -13 Y 18 X -13 Y 18 X -10 Y 18 X -11 Y 18 X -9 Y 18 X -10 Y 18 X -7 Y 19 X -7 Y 18 X -6 Y 18 X -6 Y 18 X -6 Y 18 X -6 Y 18 X -4 Y 18 X -4 Y 19 X -5 Y 18 X -2 Y 18 X -5 Y 18 X -3 Y 18 X -4 Y 18 X -2 Y 18 X -3 Y 19 X -2 Y 18 X -2 Y 18 X -2 Y 18 X
 -2 Y 18 X -1 Y 18 X -2 Y 18 X -1 Y 19 X -2 Y 18 X -1 Y 18 X -1 Y 18 X -1 Y 18 X -1 Y 18 X -1 Y 18 X -1 Y 19 X -1 Y 36 X -1 Y 18 X -1 Y 18 X -1 Y 36 X -1 Y 37 X -1 Y 54 X -1 Y 36 X -1 Y 73 X s 1 0 0 c 236 881 m20 254 885 m20 272 886 m20 290 891 m20
 308 893 m20 327 901 m20 345 905 m20 363 912 m20 381 919 m20 399 923 m20 417 925 m20 435 933 m20 454 935 m20 472 937 m20 490 936 m20 508 942 m20 526 945 m20 544 949 m20 562 955 m20 581 963 m20 599 969 m20 617 985 m20 635 1038 m20 653 1068 m20 671
 1061 m20 689 1062 m20 708 1057 m20 726 1047 m20 744 1045 m20 762 1039 m20 780 1035 m20 798 1029 m20 816 1023 m20 835 1018 m20 853 1007 m20 871 997 m20 889 986 m20 907 974 m20 925 957 m20 943 939 m20 962 908 m20 980 882 m20 998 861 m20 1016 843 m20
 1034 824 m20 1052 805 m20 1070 792 m20 1089 778 m20 1107 765 m20 1125 752 m20 1143 742 m20 1161 731 m20 1179 722 m20 1197 712 m20 1215 705 m20 1234 698 m20 1252 692 m20 1270 686 m20 1288 680 m20 1306 674 m20 1324 670 m20 1342 666 m20 1361 661 m20
 1379 659 m20 1397 654 m20 1415 651 m20 1433 647 m20 1451 645 m20 1469 642 m20 1488 640 m20 1506 638 m20 1524 636 m20 1542 634 m20 1560 633 m20 1578 631 m20 1596 630 m20 1615 628 m20 1633 627 m20 1651 626 m20 1669 625 m20 1687 624 m20 1705 623 m20
 1723 622 m20 1742 621 m20 1760 621 m20 1778 620 m20 1796 619 m20 1814 618 m20 1832 618 m20 1850 617 m20 1869 617 m20 1887 616 m20 1905 616 m20 1923 616 m20 1941 615 m20 1959 615 m20 1977 614 m20 1996 614 m20 2014 614 m20 2032 614 m20 0.8 0 0 c black
 0.8 0 0 c cs 0.8 0 0 P13 setcolor 236 883 m 18 3 d 18 2 d 18 4 d 18 2 d 19 9 d 18 4 d 18 7 d 18 7 d 18 4 d 18 1 d 18 9 d 19 1 d 18 3 d 18 -2 d 18 7 d 18 3 d 18 3 d 18 7 d 19 8 d 18 6 d 18 15 d 18 54 d 18 30 d 18 -7 d 18 1 d 19 -5 d 18 -10 d 18 -2 d
 18 -6 d 18 -5 d 18 -5 d 18 -6 d 19 -5 d 18 -12 d 18 -10 d 18 -11 d 18 -11 d 18 -18 d 18 -17 d 19 -31 d 18 -27 d 18 -20 d 18 -19 d 18 -19 d 18 -19 d 18 -13 d 19 -14 d 18 -13 d 18 -14 d 18 -9 d 18 -11 d 18 -10 d 18 -9 d 18 -7 d 19 -7 d 18 -6 d 18 -6 d
 18 -7 d 18 -5 d 18 -5 d 18 -4 d 19 -4 d 18 -3 d 18 -4 d 18 -4 d 18 -3 d 18 -3 d 18 -2 d 19 -2 d 18 -2 d 18 -2 d 18 -2 d 18 -2 d 18 -1 d 18 -2 d 19 -2 d 18 -1 d 18 -1 d 18 -1 d 18 -1 d 18 -1 d 18 -1 d 19 -1 d 18 X 18 -1 d 18 -1 d 18 X 18 -1 d 18 -1 d
 37 X 18 -1 d 18 X 18 -1 d 36 X 19 -1 d 36 X -1 Y -18 1 d -37 X -18 1 d -36 X -18 1 d -18 X -18 1 d -19 X -18 1 d -18 X -18 1 d -18 X -18 1 d -18 1 d -19 1 d -18 1 d -18 X -18 2 d -18 1 d -18 1 d -18 1 d -19 1 d -18 2 d -18 1 d -18 2 d -18 2 d -18 2
 d -18 2 d -19 2 d -18 2 d -18 3 d -18 3 d -18 4 d -18 4 d -18 3 d -19 4 d -18 4 d -18 4 d -18 6 d -18 6 d -18 6 d -18 6 d -19 8 d -18 6 d -18 10 d -18 9 d -18 11 d -18 10 d -18 13 d -18 13 d -19 14 d -18 13 d -18 19 d -18 18 d -18 19 d -18 20 d -18
 27 d -19 31 d -18 17 d -18 17 d -18 12 d -18 11 d -18 10 d -18 11 d -19 5 d -18 6 d -18 6 d -18 4 d -18 6 d -18 2 d -18 11 d -19 4 d -18 -1 d -18 8 d -18 -31 d -18 -53 d -18 -15 d -18 -7 d -19 -8 d -18 -6 d -18 -4 d -18 -3 d -18 -6 d -18 1 d -18 -2
 d -19 -1 d -18 -9 d -18 -1 d -18 -4 d -18 -7 d -18 -7 d -18 -4 d -19 -9 d -18 -2 d -18 -4 d -18 -2 d -18 -3 d FA 0 0.4 0 c 1 1 1 c 0.35 0.83 0.33 c 0 0.4 0 c 227 1096 m 18 X 3 Y 18 X 9 Y 18 X -2 Y 18 X 7 Y 18 X 15 Y 19 X 13 Y 18 X 12 Y 18 X 14 Y 18
 X 16 Y 18 X 10 Y 18 X 15 Y 18 X 14 Y 19 X 12 Y 36 X 15 Y 18 X 19 Y 18 X 9 Y 18 X 21 Y 18 X 31 Y 19 X 32 Y 18 X 51 Y 18 X 228 Y 18 X 153 Y 18 X 19 Y 18 X 13 Y 18 X 3 Y 19 X -3 Y 18 X -5 Y 18 X -17 Y 18 X -11 Y 18 X 43 Y 18 X -20 Y 18 X 1 Y 19 X -30 Y
 18 X -45 Y 18 X 8 Y 18 X -47 Y 18 X -67 Y 18 X -43 Y 18 X -150 Y 19 X -98 Y 18 X -71 Y 18 X -77 Y 18 X -49 Y 18 X -56 Y 18 X -38 Y 18 X -36 Y 19 X -40 Y 18 X -37 Y 18 X -25 Y 18 X -26 Y 18 X -29 Y 18 X -19 Y 18 X -19 Y 19 X -16 Y 18 X -17 Y 18 X -15
 Y 18 X -14 Y 18 X -12 Y 18 X -13 Y 18 X -10 Y 19 X -9 Y 18 X -6 Y 18 X -10 Y 18 X -7 Y 18 X -7 Y 18 X -8 Y 18 X -5 Y 19 X -5 Y 18 X -4 Y 18 X -4 Y 18 X -4 Y 18 X -3 Y 18 X -3 Y 18 X -3 Y 19 X -4 Y 18 X -2 Y 18 X -2 Y 18 X -2 Y 18 X -4 Y 18 X -1 Y 18
 X -1 Y 19 X -2 Y 18 X -2 Y 18 X -1 Y 18 X -1 Y 18 X -1 Y 18 X -1 Y 18 X -2 Y 37 X -1 Y 18 X -1 Y 36 X -1 Y 18 X -1 Y 18 X -1 Y 55 X -1 Y 18 X s 0.35 0.83 0.33 c 236 1096 m20 254 1099 m20 272 1108 m20 290 1106 m20 308 1113 m20 327 1128 m20 345 1141
 m20 363 1153 m20 381 1167 m20 399 1183 m20 417 1193 m20 435 1208 m20 454 1222 m20 472 1234 m20 490 1234 m20 508 1249 m20 526 1268 m20 544 1277 m20 562 1298 m20 581 1329 m20 599 1361 m20 617 1412 m20 635 1640 m20 653 1793 m20 671 1812 m20 689 1825
 m20 708 1828 m20 726 1825 m20 744 1820 m20 762 1803 m20 780 1792 m20 798 1835 m20 816 1815 m20 835 1816 m20 853 1786 m20 871 1741 m20 889 1749 m20 907 1702 m20 925 1635 m20 943 1592 m20 962 1442 m20 980 1344 m20 998 1273 m20 1016 1196 m20 1034 1147
 m20 1052 1091 m20 1070 1053 m20 1089 1017 m20 1107 977 m20 1125 940 m20 1143 915 m20 1161 889 m20 1179 860 m20 1197 841 m20 1215 822 m20 1234 806 m20 1252 789 m20 1270 774 m20 1288 760 m20 1306 748 m20 1324 735 m20 1342 725 m20 1361 716 m20 1379 710
 m20 1397 700 m20 1415 693 m20 1433 686 m20 1451 678 m20 1469 673 m20 1488 668 m20 1506 664 m20 1524 660 m20 1542 656 m20 1560 653 m20 1578 650 m20 1596 647 m20 1615 643 m20 1633 641 m20 1651 639 m20 1669 637 m20 1687 633 m20 1705 632 m20 1723 631
 m20 1742 629 m20 1760 627 m20 1778 626 m20 1796 625 m20 1814 624 m20 1832 623 m20 1850 621 m20 1869 621 m20 1887 620 m20 1905 619 m20 1923 619 m20 1941 618 m20 1959 617 m20 1977 616 m20 1996 616 m20 2014 616 m20 2032 615 m20 0 0.4 0 c black 0 0.4 0
 c cs 0 0.4 0 P13 setcolor 236 1100 m 18 3 d 18 9 d 18 -2 d 18 7 d 19 15 d 18 14 d 18 12 d 18 13 d 18 16 d 18 10 d 18 15 d 19 15 d 18 11 d 18 X 18 16 d 18 19 d 18 9 d 18 21 d 19 31 d 18 32 d 18 51 d 18 231 d 18 154 d 18 20 d 18 13 d 19 4 d 18 -3 d 18
 -4 d 18 -18 d 18 -11 d 18 45 d 18 -21 d 19 2 d 18 -30 d 18 -46 d 18 8 d 18 -46 d 18 -68 d 18 -44 d 19 -151 d 18 -100 d 18 -71 d 18 -79 d 18 -49 d 18 -56 d 18 -39 d 19 -37 d 18 -40 d 18 -37 d 18 -25 d 18 -27 d 18 -29 d 18 -19 d 18 -19 d 19 -17 d 18
 -17 d 18 -15 d 18 -14 d 18 -12 d 18 -14 d 18 -9 d 19 -10 d 18 -6 d 18 -10 d 18 -7 d 18 -7 d 18 -8 d 18 -5 d 19 -5 d 18 -4 d 18 -4 d 18 -4 d 18 -4 d 18 -2 d 18 -3 d 19 -4 d 18 -3 d 18 -2 d 18 -1 d 18 -4 d 18 -1 d 18 -2 d 19 -2 d 18 -1 d 18 -1 d 18 -2
 d 18 X 18 -2 d 18 -1 d 19 -1 d 18 -1 d 18 -1 d 18 X 18 -1 d 18 -1 d 18 X 19 -1 d 18 X 18 -1 d -18 1 d -37 X -18 1 d -18 1 d -18 X -18 1 d -18 1 d -18 X -19 1 d -18 1 d -18 2 d -18 1 d -18 1 d -18 1 d -18 2 d -19 1 d -18 2 d -18 1 d -18 4 d -18 1 d
 -18 2 d -18 3 d -19 3 d -18 3 d -18 3 d -18 4 d -18 3 d -18 4 d -18 4 d -19 5 d -18 5 d -18 8 d -18 6 d -18 7 d -18 10 d -18 6 d -19 9 d -18 10 d -18 13 d -18 12 d -18 14 d -18 14 d -18 17 d -19 17 d -18 18 d -18 20 d -18 27 d -18 26 d -18 25 d -18
 37 d -18 39 d -19 36 d -18 38 d -18 55 d -18 48 d -18 76 d -18 70 d -18 97 d -19 148 d -18 43 d -18 67 d -18 47 d -18 -8 d -18 44 d -18 30 d -19 X -18 20 d -18 -42 d -18 11 d -18 17 d -18 5 d -18 4 d -19 -4 d -18 -12 d -18 -19 d -18 -152 d -18 -225
 d -18 -51 d -18 -31 d -19 -31 d -18 -21 d -18 -9 d -18 -19 d -18 -15 d -18 X -18 -11 d -19 -15 d -18 -15 d -18 -10 d -18 -15 d -18 -14 d -18 -12 d -18 -13 d -19 -15 d -18 -7 d -18 2 d -18 -9 d -18 -3 d FA black 1 1 1 c 567 470 1587 1550 bf black
 1587 1550 m 567 X s 2154 1550 m 470 Y s 2154 2020 m -567 X s 1587 2020 m -470 Y s
 gsave  2268 1568 0 609 C 1728.33 1918.25 t 0 r /Helvetica findfont 72.27 sf 0 0 m (No Int) show NC gr  0.8 0 0 c 1609 1941 m 99 X s black
 gsave  2268 1568 0 609 C 1728.33 1758.71 t 0 r /Helvetica findfont 72.27 sf 0 0 m (With Int) show NC gr  0 0 1 c 1609 1785 m 99 X s black
 gsave  2268 1568 0 609 C 1728.33 1610.57 t 0 r /Helvetica findfont 72.27 sf 0 0 m (Reweighted) show NC gr  0 0.4 0 c 1609 1628 m 99 X s black
 gsave  2268 1568 0 609 C 2222.13 1747.32 t 90 r /Helvetica-BoldOblique findfont 30.4295 sf 0 0 m (LHC HIGGS XS WG 2013) show NC gr  1 1 1 c 2268 609 0 0 bf black 1 1 1 c 1814 457 227 152 bf black 1814 457 227 152 bl 1 1 1 c black 227 385 m 18 X -1 Y
 36 X -2 Y 18 X 5 Y 18 X -4 Y 19 X 2 Y 18 X -2 Y 18 X 3 Y 18 X -3 Y 18 X -3 Y 18 X 2 Y 37 X -5 Y 18 X 4 Y 18 X -2 Y 18 X -3 Y 18 X 3 Y 18 X -4 Y 18 X -2 Y 19 X -1 Y 18 X -1 Y 18 X 1 Y 18 X 6 Y 18 X 2 Y 36 X 4 Y 19 X 3 Y 18 X 5 Y 18 X 7 Y 18 X 5 Y 18
 X -5 Y 18 X 6 Y 18 X 2 Y 19 X 5 Y 18 X 8 Y 18 X -3 Y 18 X 2 Y 18 X 7 Y 18 X -14 Y 18 X 9 Y 19 X 1 Y 18 X -5 Y 18 X 2 Y 18 X -5 Y 18 X -1 Y 18 X -5 Y 18 X -2 Y 19 X 1 Y 18 X 4 Y 18 X -5 Y 36 X 3 Y 18 X -6 Y 18 X 2 Y 19 X -6 Y 36 X 1 Y 18 X -4 Y 18 X
 -1 Y 18 X 8 Y 18 X -8 Y 19 X 2 Y 18 X -11 Y 18 X 6 Y 18 X -4 Y 18 X 3 Y 18 X 8 Y 18 X 2 Y 19 X -13 Y 18 X -13 Y 18 X 6 Y 36 X 6 Y 18 X -10 Y 18 X -1 Y 19 X 8 Y 18 X -6 Y 18 X -5 Y 18 X -1 Y 18 X 7 Y 18 X -10 Y 18 X 15 Y 19 X -15 Y 18 X 7 Y 18 X -8 Y
 18 X -10 Y 18 X -14 Y 18 X 38 Y 18 X -7 Y 19 X -5 Y 18 X -14 Y 18 X 15 Y 18 X -26 Y 18 X 12 Y 18 X -11 Y 18 X 19 Y 19 X -20 Y 18 X 11 Y 18 X 11 Y 18 X s 227 152 m 1814 X s
 gsave  2268 609 0 0 C 1960.04 18.9926 t 0 r /Helvetica findfont 38.0897 sf 0 0 m (T,rel) show NC gr 
 gsave  2268 609 0 0 C 1960.04 68.3734 t 0 r /Helvetica findfont 38.0897 sf 0 0 m (miss) show NC gr 
 gsave  2268 609 0 0 C 1922.05 37.9852 t 0 r /Helvetica findfont 57.1345 sf 0 0 m (E) show NC gr  227 167 m -15 Y s 272 160 m -8 Y s 317 160 m -8 Y s 363 160 m -8 Y s 408 167 m -15 Y s 454 160 m -8 Y s 499 160 m -8 Y s 544 160 m -8 Y s 590 167 m -15
 Y s 635 160 m -8 Y s 680 160 m -8 Y s 726 160 m -8 Y s 771 167 m -15 Y s 816 160 m -8 Y s 862 160 m -8 Y s 907 160 m -8 Y s 952 167 m -15 Y s 998 160 m -8 Y s 1043 160 m -8 Y s 1089 160 m -8 Y s 1134 167 m -15 Y s 1179 160 m -8 Y s 1225 160 m -8 Y s
 1270 160 m -8 Y s 1315 167 m -15 Y s 1361 160 m -8 Y s 1406 160 m -8 Y s 1451 160 m -8 Y s 1497 167 m -15 Y s 1542 160 m -8 Y s 1587 160 m -8 Y s 1633 160 m -8 Y s 1678 167 m -15 Y s 1723 160 m -8 Y s 1769 160 m -8 Y s 1814 160 m -8 Y s 1860 167 m
 -15 Y s 1905 160 m -8 Y s 1950 160 m -8 Y s 1996 160 m -8 Y s 2041 167 m -15 Y s
 gsave  2268 609 0 0 C 208.919 113.956 t 0 r /Helvetica findfont 45.7076 sf 0 0 m (0) show NC gr 
 gsave  2268 609 0 0 C 379.852 113.956 t 0 r /Helvetica findfont 45.7076 sf 0 0 m (20) show NC gr 
 gsave  2268 609 0 0 C 562.181 113.956 t 0 r /Helvetica findfont 45.7076 sf 0 0 m (40) show NC gr 
 gsave  2268 609 0 0 C 740.711 113.956 t 0 r /Helvetica findfont 45.7076 sf 0 0 m (60) show NC gr 
 gsave  2268 609 0 0 C 923.04 113.956 t 0 r /Helvetica findfont 45.7076 sf 0 0 m (80) show NC gr 
 gsave  2268 609 0 0 C 1093.97 113.956 t 0 r /Helvetica findfont 45.7076 sf 0 0 m (100) show NC gr 
 gsave  2268 609 0 0 C 1276.3 113.956 t 0 r /Helvetica findfont 45.7076 sf 0 0 m (120) show NC gr 
 gsave  2268 609 0 0 C 1458.63 113.956 t 0 r /Helvetica findfont 45.7076 sf 0 0 m (140) show NC gr 
 gsave  2268 609 0 0 C 1637.16 113.956 t 0 r /Helvetica findfont 45.7076 sf 0 0 m (160) show NC gr 
 gsave  2268 609 0 0 C 1819.49 113.956 t 0 r /Helvetica findfont 45.7076 sf 0 0 m (180) show NC gr 
 gsave  2268 609 0 0 C 2001.82 113.956 t 0 r /Helvetica findfont 45.7076 sf 0 0 m (200) show NC gr  227 152 m 457 Y s
 gsave  2268 609 0 0 C 91.1645 170.933 t 90 r /Helvetica findfont 45.7076 sf 0 0 m (\(S+I\)/\(Reweighted S\)) show NC gr  278 152 m -51 X s 252 164 m -25 X s 252 175 m -25 X s 252 187 m -25 X s 278 198 m -51 X s 252 209 m -25 X s 252 221 m -25 X s
 252 232 m -25 X s 278 244 m -51 X s 252 255 m -25 X s 252 267 m -25 X s 252 278 m -25 X s 278 289 m -51 X s 252 301 m -25 X s 252 312 m -25 X s 252 324 m -25 X s 278 335 m -51 X s 252 347 m -25 X s 252 358 m -25 X s 252 369 m -25 X s 278 381 m -51 X
 s 252 392 m -25 X s 252 404 m -25 X s 252 415 m -25 X s 278 427 m -51 X s 252 438 m -25 X s 252 449 m -25 X s 252 461 m -25 X s 278 472 m -51 X s 252 484 m -25 X s 252 495 m -25 X s 252 507 m -25 X s 278 518 m -51 X s 252 529 m -25 X s 252 541 m -25
 X s 252 552 m -25 X s 278 564 m -51 X s 252 575 m -25 X s 252 587 m -25 X s 252 598 m -25 X s 278 609 m -51 X s
 gsave  2268 609 0 0 C 186.127 136.747 t 0 r /Helvetica findfont 45.7076 sf 0 0 m (0) show NC gr 
 gsave  2268 609 0 0 C 148.142 182.329 t 0 r /Helvetica findfont 45.7076 sf 0 0 m (0.2) show NC gr 
 gsave  2268 609 0 0 C 148.142 227.911 t 0 r /Helvetica findfont 45.7076 sf 0 0 m (0.4) show NC gr 
 gsave  2268 609 0 0 C 148.142 273.493 t 0 r /Helvetica findfont 45.7076 sf 0 0 m (0.6) show NC gr 
 gsave  2268 609 0 0 C 148.142 319.076 t 0 r /Helvetica findfont 45.7076 sf 0 0 m (0.8) show NC gr 
 gsave  2268 609 0 0 C 193.725 364.658 t 0 r /Helvetica findfont 45.7076 sf 0 0 m (1) show NC gr 
 gsave  2268 609 0 0 C 148.142 410.24 t 0 r /Helvetica findfont 45.7076 sf 0 0 m (1.2) show NC gr 
 gsave  2268 609 0 0 C 148.142 455.822 t 0 r /Helvetica findfont 45.7076 sf 0 0 m (1.4) show NC gr 
 gsave  2268 609 0 0 C 148.142 501.405 t 0 r /Helvetica findfont 45.7076 sf 0 0 m (1.6) show NC gr 
 gsave  2268 609 0 0 C 148.142 546.987 t 0 r /Helvetica findfont 45.7076 sf 0 0 m (1.8) show NC gr 
 gsave  2268 609 0 0 C 186.127 592.569 t 0 r /Helvetica findfont 45.7076 sf 0 0 m (2) show NC gr  236 385 m20 254 384 m20 272 384 m20 290 382 m20 308 387 m20 327 383 m20 345 385 m20 363 383 m20 381 386 m20 399 383 m20 417 380 m20 435 382 m20 454 382
 m20 472 377 m20 490 381 m20 508 379 m20 526 376 m20 544 379 m20 562 375 m20 581 373 m20 599 372 m20 617 371 m20 635 372 m20 653 378 m20 671 380 m20 689 380 m20 708 384 m20 726 387 m20 744 392 m20 762 399 m20 780 404 m20 798 399 m20 816 405 m20 835
 407 m20 853 412 m20 871 420 m20 889 417 m20 907 419 m20 925 426 m20 943 412 m20 962 421 m20 980 422 m20 998 417 m20 1016 419 m20 1034 414 m20 1052 413 m20 1070 408 m20 1089 406 m20 1107 407 m20 1125 411 m20 1143 406 m20 1161 406 m20 1179 409 m20
 1197 403 m20 1215 405 m20 1234 399 m20 1252 399 m20 1270 400 m20 1288 396 m20 1306 395 m20 1324 403 m20 1342 395 m20 1361 397 m20 1379 386 m20 1397 392 m20 1415 388 m20 1433 391 m20 1451 399 m20 1469 401 m20 1488 388 m20 1506 375 m20 1524 381 m20
 1542 381 m20 1560 387 m20 1578 377 m20 1596 376 m20 1615 384 m20 1633 378 m20 1651 373 m20 1669 372 m20 1687 379 m20 1705 369 m20 1723 384 m20 1742 369 m20 1760 376 m20 1778 368 m20 1796 358 m20 1814 344 m20 1832 382 m20 1850 375 m20 1869 370 m20
 1887 356 m20 1905 371 m20 1923 345 m20 1941 357 m20 1959 346 m20 1977 365 m20 1996 345 m20 2014 356 m20 2032 367 m20 cs 0 0 0 P13 setcolor 236 387 m 36 X 18 -3 d 18 6 d 19 -5 d 18 2 d 18 -2 d 18 4 d 18 -4 d 18 -2 d 18 2 d 19 X 18 -5 d 18 3 d 18 -2 d
 18 -3 d 18 4 d 18 -4 d 19 -3 d 18 -1 d 18 -1 d 18 1 d 18 6 d 18 2 d 18 X 19 4 d 18 4 d 18 5 d 18 7 d 18 5 d 18 -6 d 18 6 d 19 3 d 18 5 d 18 8 d 18 -3 d 18 2 d 18 8 d 18 -14 d 19 8 d 18 1 d 18 -5 d 18 2 d 18 -5 d 18 -1 d 18 -4 d 19 -2 d 18 1 d 18 4 d
 18 -5 d 18 X 18 3 d 18 -6 d 18 2 d 19 -6 d 18 X 18 1 d 18 -4 d 18 -1 d 18 9 d 18 -8 d 19 2 d 18 -12 d 18 7 d 18 -4 d 18 3 d 18 8 d 18 2 d 19 -13 d 18 -13 d 18 6 d 18 X 18 6 d 18 -9 d 18 -1 d 19 8 d 18 -5 d 18 -6 d 18 -1 d 18 7 d 18 -9 d 18 15 d 19
 -15 d 18 7 d 18 -7 d 18 -11 d 18 -13 d 18 39 d 18 -8 d 19 -5 d 18 -14 d 18 16 d 18 -27 d 18 13 d 18 -11 d 18 19 d 19 -19 d 18 11 d 18 11 d -21 Y -18 -10 d -18 -11 d -19 20 d -18 -19 d -18 12 d -18 -12 d -18 26 d -18 -14 d -18 13 d -19 6 d -18 6 d
 -18 -36 d -18 13 d -18 11 d -18 7 d -18 -6 d -19 15 d -18 -15 d -18 10 d -18 -6 d -18 X -18 6 d -18 6 d -19 -8 d -18 2 d -18 9 d -18 -6 d -18 X -18 -5 d -18 12 d -19 13 d -18 -2 d -18 -7 d -18 -2 d -18 3 d -18 -6 d -18 12 d -19 -2 d -18 8 d -18 -9 d
 -18 1 d -18 5 d -18 -1 d -18 X -19 6 d -18 -1 d -18 5 d -18 -2 d -18 X -18 5 d -18 -4 d -18 -1 d -19 2 d -18 4 d -18 2 d -18 4 d -18 -2 d -18 5 d -18 -1 d -19 -8 d -18 14 d -18 -8 d -18 -2 d -18 4 d -18 -8 d -18 -5 d -19 -2 d -18 -6 d -18 6 d -18 -5
 d -18 -7 d -18 -5 d -18 -3 d -19 -4 d -18 X -18 -2 d -18 -6 d -18 -1 d -18 1 d -18 1 d -19 2 d -18 4 d -18 -3 d -18 3 d -18 2 d -18 -4 d -18 5 d -19 X -18 -2 d -18 3 d -18 3 d -18 -4 d -18 2 d -18 -2 d -19 5 d -18 -6 d -18 3 d -36 X FA
 gr  gr showpage
end
%%EOF
