%!PS-Adobe-2.0 EPSF-2.0
%%BoundingBox:  0 0 567 341
%%Title: /home/qliphy/Downloads/MCFM/Bin/plot0/h700/mww.eps: 
%%Creator: ROOT Version 5.32/00
%%CreationDate: Thu Jun 13 16:59:00 2013
%%EndComments
%%BeginProlog
80 dict begin
/s {stroke} def /l {lineto} def /m {moveto} def /t {translate} def
/r {rotate} def /rl {roll}  def /R {repeat} def
/d {rlineto} def /rm {rmoveto} def /gr {grestore} def /f {eofill} def
/c {setrgbcolor} def /black {0 setgray} def /sd {setdash} def
/cl {closepath} def /sf {scalefont setfont} def /lw {setlinewidth} def
/box {m dup 0 exch d exch 0 d 0 exch neg d cl} def
/NC{systemdict begin initclip end}def/C{NC box clip newpath}def
/bl {box s} def /bf {box f} def /Y { 0 exch d} def /X { 0 d} def 
/K {{pop pop 0 moveto} exch kshow} bind def
/ita {/ang 15 def gsave [1 0 ang dup sin exch cos div 1 0 0] concat} def 
/mp {newpath /y exch def /x exch def} def
/side {[w .77 mul w .23 mul] .385 w mul sd w 0 l currentpoint t -144 r} def
/mr {mp x y w2 0 360 arc} def /m24 {mr s} def /m20 {mr f} def
/mb {mp x y w2 add m w2 neg 0 d 0 w neg d w 0 d 0 w d cl} def
/mt {mp x y w2 add m w2 neg w neg d w 0 d cl} def
/m21 {mb f} def /m25 {mb s} def /m22 {mt f} def /m26{mt s} def
/m23 {mp x y w2 sub m w2 w d w neg 0 d cl f} def
/m27 {mp x y w2 add m w3 neg w2 neg d w3 w2 neg d w3 w2 d cl s} def
/m28 {mp x w2 sub y w2 sub w3 add m w3 0 d  0 w3 neg d w3 0 d 0 w3 d w3 0 d  0 w3 d w3 neg 0 d 0 w3 d w3 neg 0 d 0 w3 neg d w3 neg 0 d cl s } def
/m29 {mp gsave x w2 sub y w2 add w3 sub m currentpoint t 4 {side} repeat cl fill gr} def
/m30 {mp gsave x w2 sub y w2 add w3 sub m currentpoint t 4 {side} repeat cl s gr} def
/m31 {mp x y w2 sub m 0 w d x w2 sub y m w 0 d x w2 sub y w2 add m w w neg d x w2 sub y w2 sub m w w d s} def
/m32 {mp x y w2 sub m w2 w d w neg 0 d cl s} def
/m33 {mp x y w2 add m w3 neg w2 neg d w3 w2 neg d w3 w2 d cl f} def
/m34 {mp x w2 sub y w2 sub w3 add m w3 0 d  0 w3 neg d w3 0 d 0 w3 d w3 0 d  0 w3 d w3 neg 0 d 0 w3 d w3 neg 0 d 0 w3 neg d w3 neg 0 d cl f } def
/m2 {mp x y w2 sub m 0 w d x w2 sub y m w 0 d s} def
/m5 {mp x w2 sub y w2 sub m w w d x w2 sub y w2 add m w w neg d s} def
/reEncode {exch findfont dup length dict begin {1 index /FID eq  {pop pop} {def} ifelse } forall /Encoding exch def currentdict end dup /FontName get exch definefont pop } def [/Times-Bold /Times-Italic /Times-BoldItalic /Helvetica /Helvetica-Oblique
 /Helvetica-Bold /Helvetica-BoldOblique /Courier /Courier-Oblique /Courier-Bold /Courier-BoldOblique /Times-Roman /AvantGarde-Book /AvantGarde-BookOblique /AvantGarde-Demi /AvantGarde-DemiOblique /Bookman-Demi /Bookman-DemiItalic /Bookman-Light
 /Bookman-LightItalic /Helvetica-Narrow /Helvetica-Narrow-Bold /Helvetica-Narrow-BoldOblique /Helvetica-Narrow-Oblique /NewCenturySchlbk-Roman /NewCenturySchlbk-Bold /NewCenturySchlbk-BoldItalic /NewCenturySchlbk-Italic /Palatino-Bold
 /Palatino-BoldItalic /Palatino-Italic /Palatino-Roman ] {ISOLatin1Encoding reEncode } forall%%EndProlog
%%BeginSetup
%%EndSetup
newpath  gsave  .25 .25 scale  gsave  0 0 t black[  ] 0 sd 3 lw 1 1 1 c 2268 1364 0 0 bf black 1 1 1 c 1792 1077 361 220 bf black 1792 1077 361 220 bl 1 1 1 c 1792 1077 361 220 bf black 1792 1077 361 220 bl 361 220 m 1792 X s[ 4 8] 0 sd 585 1297 m
 -1077 Y s 834 1297 m -1077 Y s 1083 1297 m -1077 Y s 1332 1297 m -1077 Y s 1581 1297 m -1077 Y s 1830 1297 m -1077 Y s 2078 1297 m -1077 Y s 585 1297 m -1077 Y s 2078 1297 m -1077 Y s[  ] 0 sd 361 1297 m 1792 X s 361 220 m 1077 Y s[ 4 8] 0 sd 2153
 220 m -1792 X s 2153 382 m -1792 X s 2153 545 m -1792 X s 2153 708 m -1792 X s 2153 871 m -1792 X s 2153 1034 m -1792 X s 2153 1196 m -1792 X s 2153 1196 m -1792 X s[  ] 0 sd 2153 220 m 1077 Y s 1 0 0 c 6 lw 1 1 1 c black 1 0 0 c 361 252 m 50 X 14 Y
 25 X -7 Y 25 X 1 Y 25 X -2 Y 24 X 16 Y 25 X 2 Y 25 X 5 Y 25 X 11 Y 25 X 5 Y 25 X 10 Y 25 X 29 Y 25 X 10 Y 25 X 42 Y 24 X 22 Y 25 X 59 Y 25 X 6 Y 25 X 25 Y 25 X 35 Y 25 X 26 Y 25 X 26 Y 25 X 11 Y 25 X 59 Y 24 X -3 Y 25 X 1 Y 25 X 36 Y 25 X 15 Y 25 X
 40 Y 25 X 9 Y 25 X 15 Y 25 X 39 Y 25 X 33 Y 24 X -12 Y 25 X 59 Y 25 X 31 Y 25 X 52 Y 25 X 12 Y 25 X 21 Y 25 X 57 Y 25 X 23 Y 25 X 30 Y 24 X 37 Y 25 X 31 Y 25 X 51 Y 25 X -60 Y 25 X 72 Y 25 X -40 Y 25 X -29 Y 25 X -51 Y 25 X -80 Y 24 X -79 Y 25 X -80
 Y 25 X -102 Y 25 X -72 Y 25 X -69 Y 25 X -102 Y 25 X -29 Y 25 X -42 Y 25 X -55 Y 24 X -27 Y 25 X -35 Y 25 X -29 Y 25 X -14 Y 25 X -21 Y 25 X -8 Y 25 X -18 Y 25 X -5 Y 25 X -10 Y 24 X -8 Y 25 X -3 Y 25 X -9 Y 25 X s black 3 lw 361 220 m 1792 X s
 gsave  2268 1364 0 0 C 1929.57 84.0603 t 0 r /Helvetica findfont 76.4184 sf 0 0 m ( \(GeV\)) show NC gr 
 gsave  2268 1364 0 0 C 1832.13 61.1347 t 0 r /Helvetica findfont 51.5824 sf 0 0 m (WW) show NC gr 
 gsave  2268 1364 0 0 C 1772.91 84.0603 t 0 r /Helvetica findfont 76.4184 sf 0 0 m (M) show NC gr  585 252 m -32 Y s 635 236 m -16 Y s 685 236 m -16 Y s 734 236 m -16 Y s 784 236 m -16 Y s 834 252 m -32 Y s 884 236 m -16 Y s 934 236 m -16 Y s 983 236
 m -16 Y s 1033 236 m -16 Y s 1083 252 m -32 Y s 1133 236 m -16 Y s 1182 236 m -16 Y s 1232 236 m -16 Y s 1282 236 m -16 Y s 1332 252 m -32 Y s 1382 236 m -16 Y s 1431 236 m -16 Y s 1481 236 m -16 Y s 1531 236 m -16 Y s 1581 252 m -32 Y s 1630 236 m
 -16 Y s 1680 236 m -16 Y s 1730 236 m -16 Y s 1780 236 m -16 Y s 1830 252 m -32 Y s 1879 236 m -16 Y s 1929 236 m -16 Y s 1979 236 m -16 Y s 2029 236 m -16 Y s 2078 252 m -32 Y s 585 252 m -32 Y s 535 236 m -16 Y s 486 236 m -16 Y s 436 236 m -16 Y
 s 386 236 m -16 Y s 2078 252 m -32 Y s 2128 236 m -16 Y s
 gsave  2268 1364 0 0 C 542.571 170.031 t 0 r /Helvetica findfont 51.5824 sf 0 0 m (300) show NC gr 
 gsave  2268 1364 0 0 C 790.931 170.031 t 0 r /Helvetica findfont 51.5824 sf 0 0 m (400) show NC gr 
 gsave  2268 1364 0 0 C 1039.29 170.031 t 0 r /Helvetica findfont 51.5824 sf 0 0 m (500) show NC gr 
 gsave  2268 1364 0 0 C 1289.56 170.031 t 0 r /Helvetica findfont 51.5824 sf 0 0 m (600) show NC gr 
 gsave  2268 1364 0 0 C 1537.92 170.031 t 0 r /Helvetica findfont 51.5824 sf 0 0 m (700) show NC gr 
 gsave  2268 1364 0 0 C 1786.28 170.031 t 0 r /Helvetica findfont 51.5824 sf 0 0 m (800) show NC gr 
 gsave  2268 1364 0 0 C 2034.64 170.031 t 0 r /Helvetica findfont 51.5824 sf 0 0 m (900) show NC gr  361 1297 m 1792 X s 585 1265 m 32 Y s 635 1281 m 16 Y s 685 1281 m 16 Y s 734 1281 m 16 Y s 784 1281 m 16 Y s 834 1265 m 32 Y s 884 1281 m 16 Y s 934
 1281 m 16 Y s 983 1281 m 16 Y s 1033 1281 m 16 Y s 1083 1265 m 32 Y s 1133 1281 m 16 Y s 1182 1281 m 16 Y s 1232 1281 m 16 Y s 1282 1281 m 16 Y s 1332 1265 m 32 Y s 1382 1281 m 16 Y s 1431 1281 m 16 Y s 1481 1281 m 16 Y s 1531 1281 m 16 Y s 1581
 1265 m 32 Y s 1630 1281 m 16 Y s 1680 1281 m 16 Y s 1730 1281 m 16 Y s 1780 1281 m 16 Y s 1830 1265 m 32 Y s 1879 1281 m 16 Y s 1929 1281 m 16 Y s 1979 1281 m 16 Y s 2029 1281 m 16 Y s 2078 1265 m 32 Y s 585 1265 m 32 Y s 535 1281 m 16 Y s 486 1281
 m 16 Y s 436 1281 m 16 Y s 386 1281 m 16 Y s 2078 1265 m 32 Y s 2128 1281 m 16 Y s 361 220 m 1077 Y s
 gsave  2268 1364 0 0 C 202.509 1018.28 t 90 r /Helvetica findfont 76.4184 sf 0 0 m ( \(pb/bin\)) show NC gr 
 gsave  2268 1364 0 0 C 227.345 920.842 t 90 r /Helvetica findfont 51.5824 sf 0 0 m (WW) show NC gr 
 gsave  2268 1364 0 0 C 202.509 798.572 t 90 r /Helvetica findfont 76.4184 sf 0 0 m (/dM) show NC gr 
 gsave  2268 1364 0 0 C 202.509 752.721 t 90 r /Symbol findfont 76.4184 sf 0 0 m (s) show NC gr 
 gsave  2268 1364 0 0 C 202.509 714.512 t 90 r /Helvetica findfont 76.4184 sf 0 0 m (d) show NC gr  415 220 m -54 X s 388 252 m -27 X s 388 285 m -27 X s 388 317 m -27 X s 388 350 m -27 X s 415 382 m -54 X s 388 415 m -27 X s 388 448 m -27 X s 388
 480 m -27 X s 388 513 m -27 X s 415 545 m -54 X s 388 578 m -27 X s 388 610 m -27 X s 388 643 m -27 X s 388 676 m -27 X s 415 708 m -54 X s 388 741 m -27 X s 388 773 m -27 X s 388 806 m -27 X s 388 838 m -27 X s 415 871 m -54 X s 388 903 m -27 X s
 388 936 m -27 X s 388 969 m -27 X s 388 1001 m -27 X s 415 1034 m -54 X s 388 1066 m -27 X s 388 1099 m -27 X s 388 1131 m -27 X s 388 1164 m -27 X s 415 1196 m -54 X s 415 1196 m -54 X s 388 1229 m -27 X s 388 1262 m -27 X s 388 1294 m -27 X s
 gsave  2268 1364 0 0 C 328.599 204.419 t 0 r /Helvetica findfont 38.2092 sf 0 0 m (0) show NC gr 
 gsave  2268 1364 0 0 C 259.823 368.719 t 0 r /Helvetica findfont 38.2092 sf 0 0 m (0.001) show NC gr 
 gsave  2268 1364 0 0 C 256.002 531.108 t 0 r /Helvetica findfont 38.2092 sf 0 0 m (0.002) show NC gr 
 gsave  2268 1364 0 0 C 254.091 693.497 t 0 r /Helvetica findfont 38.2092 sf 0 0 m (0.003) show NC gr 
 gsave  2268 1364 0 0 C 254.091 855.886 t 0 r /Helvetica findfont 38.2092 sf 0 0 m (0.004) show NC gr 
 gsave  2268 1364 0 0 C 254.091 1020.19 t 0 r /Helvetica findfont 38.2092 sf 0 0 m (0.005) show NC gr 
 gsave  2268 1364 0 0 C 254.091 1182.58 t 0 r /Helvetica findfont 38.2092 sf 0 0 m (0.006) show NC gr  2153 220 m 1077 Y s 2099 220 m 54 X s 2126 252 m 27 X s 2126 285 m 27 X s 2126 317 m 27 X s 2126 350 m 27 X s 2099 382 m 54 X s 2126 415 m 27 X s
 2126 448 m 27 X s 2126 480 m 27 X s 2126 513 m 27 X s 2099 545 m 54 X s 2126 578 m 27 X s 2126 610 m 27 X s 2126 643 m 27 X s 2126 676 m 27 X s 2099 708 m 54 X s 2126 741 m 27 X s 2126 773 m 27 X s 2126 806 m 27 X s 2126 838 m 27 X s 2099 871 m 54 X
 s 2126 903 m 27 X s 2126 936 m 27 X s 2126 969 m 27 X s 2126 1001 m 27 X s 2099 1034 m 54 X s 2126 1066 m 27 X s 2126 1099 m 27 X s 2126 1131 m 27 X s 2126 1164 m 27 X s 2099 1196 m 54 X s 2099 1196 m 54 X s 2126 1229 m 27 X s 2126 1262 m 27 X s
 2126 1294 m 27 X s 1 1 0 c black 1 1 0 c 361 239 m 13 20 d 24 12 d 25 2 d 25 4 d 25 6 d 25 -5 d 25 8 d 25 3 d 25 10 d 25 16 d 24 5 d 25 5 d 25 21 d 25 17 d 25 34 d 25 36 d 25 44 d 25 23 d 25 28 d 24 25 d 25 36 d 25 16 d 25 3 d 25 50 d 25 17 d 25 -9
 d 25 38 d 25 13 d 24 43 d 25 13 d 25 23 d 25 15 d 25 28 d 25 -1 d 25 58 d 25 11 d 25 69 d 24 X 25 33 d 25 44 d 25 21 d 25 39 d 25 39 d 25 24 d 25 48 d 25 -45 d 24 65 d 25 -43 d 25 -27 d 25 -57 d 25 -72 d 25 -56 d 25 -78 d 25 -80 d 25 -55 d 24 -62 d
 25 -67 d 25 -48 d 25 -49 d 25 -50 d 25 -31 d 25 -32 d 25 -12 d 25 -40 d 24 -24 d 25 -15 d 25 -17 d 25 -15 d 25 -9 d 25 -10 d 25 -9 d 25 -20 d 12 -23 d -18 Y -12 5 d -25 9 d -25 2 d -25 7 d -25 9 d -25 9 d -25 14 d -25 12 d -24 19 d -25 66 d -25 -21
 d -25 33 d -25 28 d -25 51 d -25 42 d -25 36 d -25 97 d -24 64 d -25 46 d -25 128 d -25 92 d -25 57 d -25 40 d -25 27 d -25 -2 d -25 16 d -24 -56 d -25 -2 d -25 -57 d -25 -36 d -25 -49 d -25 -41 d -25 -39 d -25 -32 d -25 -39 d -24 -14 d -25 -49 d
 -25 -16 d -25 -42 d -25 -14 d -25 -24 d -25 -13 d -25 -18 d -25 -17 d -24 -26 d -25 -14 d -25 -19 d -25 -4 d -25 -14 d -25 -28 d -25 -3 d -25 -13 d -25 -21 d -24 -15 d -25 -15 d -25 -17 d -25 -24 d -25 -20 d -25 -20 d -25 -11 d -25 -11 d -25 -4 d
 -24 -4 d -25 -8 d -25 -6 d -25 -2 d -25 -4 d -25 2 d -25 -3 d -25 -2 d -25 -1 d -24 -7 d -13 -9 d f 1 0 0 c 6 lw 1 1 1 c black 1 0 0 c 361 252 m 50 X 14 Y 25 X -7 Y 25 X 1 Y 25 X -2 Y 24 X 16 Y 25 X 2 Y 25 X 5 Y 25 X 11 Y 25 X 5 Y 25 X 10 Y 25 X 29
 Y 25 X 10 Y 25 X 42 Y 24 X 22 Y 25 X 59 Y 25 X 6 Y 25 X 25 Y 25 X 35 Y 25 X 26 Y 25 X 26 Y 25 X 11 Y 25 X 59 Y 24 X -3 Y 25 X 1 Y 25 X 36 Y 25 X 15 Y 25 X 40 Y 25 X 9 Y 25 X 15 Y 25 X 39 Y 25 X 33 Y 24 X -12 Y 25 X 59 Y 25 X 31 Y 25 X 52 Y 25 X 12 Y
 25 X 21 Y 25 X 57 Y 25 X 23 Y 25 X 30 Y 24 X 37 Y 25 X 31 Y 25 X 51 Y 25 X -60 Y 25 X 72 Y 25 X -40 Y 25 X -29 Y 25 X -51 Y 25 X -80 Y 24 X -79 Y 25 X -80 Y 25 X -102 Y 25 X -72 Y 25 X -69 Y 25 X -102 Y 25 X -29 Y 25 X -42 Y 25 X -55 Y 24 X -27 Y 25
 X -35 Y 25 X -29 Y 25 X -14 Y 25 X -21 Y 25 X -8 Y 25 X -18 Y 25 X -5 Y 25 X -10 Y 24 X -8 Y 25 X -3 Y 25 X -9 Y 25 X s 0 0 1 c 1 1 1 c black 0 0 1 c 361 220 m 50 X 1 Y 75 X 1 Y 49 X 1 Y 25 X 2 Y 25 X 2 Y 25 X 1 Y 25 X 3 Y 25 X 2 Y 25 X 2 Y 25 X 5 Y
 24 X 7 Y 25 X 4 Y 25 X 12 Y 25 X 4 Y 25 X 8 Y 25 X 8 Y 25 X 12 Y 25 X 5 Y 25 X 11 Y 24 X 11 Y 25 X 17 Y 25 X 2 Y 25 X 17 Y 25 X 14 Y 25 X 20 Y 25 X 16 Y 25 X 14 Y 25 X 21 Y 24 X 26 Y 25 X 31 Y 25 X 21 Y 25 X 33 Y 25 X 26 Y 25 X 45 Y 25 X 25 Y 25 X
 54 Y 25 X 44 Y 24 X 58 Y 25 X 46 Y 25 X 65 Y 25 X 41 Y 25 X 49 Y 25 X 6 Y 25 X 25 Y 25 X -3 Y 25 X -17 Y 24 X -17 Y 25 X -67 Y 25 X -45 Y 25 X -63 Y 25 X -60 Y 25 X -46 Y 25 X -58 Y 25 X -53 Y 25 X -51 Y 24 X -34 Y 25 X -31 Y 25 X -36 Y 25 X -21 Y
 25 X -29 Y 25 X -17 Y 25 X -19 Y 25 X -19 Y 25 X -10 Y 24 X -13 Y 25 X -13 Y 25 X -27 Y 25 X s black 3 lw 1 1 1 c 858 256 420 1020 bf black 420 1020 m 858 X s 1278 1020 m 256 Y s 1278 1276 m -858 X s 420 1276 m -256 Y s
 gsave  2268 1364 0 0 C 634.273 1222.69 t 0 r /Times-Bold findfont 40.1197 sf 0 0 m (\(1+R2\)*\(MCFM S700\): Uncertainty) show NC gr  1 1 0 c 452 1204 m 151 X 59 Y -151 X f black 452 1263 m 151 X s 452 1204 m 151 X s 603 1204 m 59 Y s 452 1204 m 59 Y
 s
 gsave  2268 1364 0 0 C 634.273 1136.72 t 0 r /Times-Bold findfont 40.1197 sf 0 0 m (MCFM \(S+I\)700) show NC gr  1 0 0 c 6 lw 452 1148 m 151 X s black
 gsave  2268 1364 0 0 C 634.273 1048.84 t 0 r /Times-Bold findfont 40.1197 sf 0 0 m (MCFM S700) show NC gr  0 0 1 c 452 1063 m 151 X s black
 gsave  2268 1364 0 0 C 2221.87 989.619 t 90 r /Helvetica-BoldOblique findfont 24.836 sf 0 0 m (LHC HIGGS XS WG 2013) show NC gr 
 gr  gr showpage
end
%%EOF
