%!PS-Adobe-2.0 EPSF-2.0
%%BoundingBox:  0 0 567 552
%%Title: /Volumes/DanisWork/mac-Work/Work/Higgs-Joint/VBF/YR3/Plots/Results/jvetoy.eps: VBF
%%Creator: ROOT Version 5.24/00
%%CreationDate: Tue Mar 19 11:11:28 2013
%%EndComments
%%BeginProlog
80 dict begin
/s {stroke} def /l {lineto} def /m {moveto} def /t {translate} def
/sw {stringwidth} def /r {rotate} def /rl {roll}  def /R {repeat} def
/d {rlineto} def /rm {rmoveto} def /gr {grestore} def /f {eofill} def
/c {setrgbcolor} def /black {0 setgray} def /sd {setdash} def
/cl {closepath} def /sf {scalefont setfont} def /lw {setlinewidth} def
/box {m dup 0 exch d exch 0 d 0 exch neg d cl} def
/NC{systemdict begin initclip end}def/C{NC box clip newpath}def
/bl {box s} def /bf {box f} def /Y { 0 exch d} def /X { 0 d} def 
/mp {newpath /y exch def /x exch def} def
/side {[w .77 mul w .23 mul] .385 w mul sd w 0 l currentpoint t -144 r} def
/mr {mp x y w2 0 360 arc} def /m24 {mr s} def /m20 {mr f} def
/mb {mp x y w2 add m w2 neg 0 d 0 w neg d w 0 d 0 w d cl} def
/mt {mp x y w2 add m w2 neg w neg d w 0 d cl} def
/m21 {mb f} def /m25 {mb s} def /m22 {mt f} def /m26{mt s} def
/m23 {mp x y w2 sub m w2 w d w neg 0 d cl f} def
/m27 {mp x y w2 add m w3 neg w2 neg d w3 w2 neg d w3 w2 d cl s} def
/m28 {mp x w2 sub y w2 sub w3 add m w3 0 d  0 w3 neg d w3 0 d 0 w3 d w3 0 d  0 w3 d w3 neg 0 d 0 w3 d w3 neg 0 d
 0 w3 neg d w3 neg 0 d cl s } def
/m29 {mp gsave x w2 sub y w2 add w3 sub m currentpoint t
 4 {side} repeat cl fill gr} def
/m30 {mp gsave x w2 sub y w2 add w3 sub m currentpoint t
 4 {side} repeat cl s gr} def
/m31 {mp x y w2 sub m 0 w d x w2 sub y m w 0 d x w2 sub y w2 add m w w neg d x w2 sub y w2
 sub m w w d s} def
/m2 {mp x y w2 sub m 0 w d x w2 sub y m w 0 d s} def
/m5 {mp x w2 sub y w2 sub m w w d x w2 sub y w2 add m w w neg d s} def
/reEncode {exch findfont dup length dict begin {1 index /FID eq  {pop pop} {def} ifelse } forall /Encoding exch def currentdict end dup /FontName get exch definefont pop } def [/Times-Bold /Times-Italic /Times-BoldItalic /Helvetica
 /Helvetica-Oblique /Helvetica-Bold /Helvetica-BoldOblique /Courier /Courier-Oblique /Courier-Bold /Courier-BoldOblique /Times-Roman /AvantGarde-Book /AvantGarde-BookOblique /AvantGarde-Demi /AvantGarde-DemiOblique /Bookman-Demi
 /Bookman-DemiItalic /Bookman-Light /Bookman-LightItalic /Helvetica-Narrow /Helvetica-Narrow-Bold /Helvetica-Narrow-BoldOblique /Helvetica-Narrow-Oblique /NewCenturySchlbk-Roman /NewCenturySchlbk-Bold
 /NewCenturySchlbk-BoldItalic /NewCenturySchlbk-Italic /Palatino-Bold /Palatino-BoldItalic /Palatino-Italic /Palatino-Roman ] {ISOLatin1Encoding reEncode } forall
/oshow {gsave [] 0 sd true charpath stroke gr} def
/stwn { /fs exch def /fn exch def /text exch def fn findfont fs sf
 text sw pop xs add /xs exch def} def
/stwb { /fs exch def /fn exch def /nbas exch def /textf exch deftextf length /tlen exch def nbas tlen gt {/nbas tlendef} iffn findfont fs sf textf dup length nbas sub nbas getinterval sw
pop neg xs add /xs exch def} def
%%EndProlog
%%BeginSetup
%%EndSetup
newpath  gsave  .25 .25 scale  gsave  0 0 t black[  ] 0 sd 3 lw 1 1 1 c 2268 2207 0 0 bf black 1 1 1 c 2177 949 45 1214 bf black 1 1 1 c 1677 759 328 1309 bf black 1677 759 328 1309 bl 1 1 1 c 1677 759 328 1309 bf black 1677 759 328 1309 bl 0.8 0 0
 c[  12 12 ] 0 sd 6 lw 1 1 1 c black 0.8 0 0 c 328 1309 m 202 X 67 Y 33 X 249 Y 34 X 91 Y 33 X 101 Y 34 X 73 Y 33 X 33 Y 34 X 44 Y 33 X 17 Y 34 X 22 Y 33 X -5 Y 34 X 3 Y 33 X -4 Y 34 X -15 Y 33 X -21 Y 34 X -16 Y 33 X -37 Y 34 X -33 Y 33 X -4 Y 34 X
 -40 Y 34 X -12 Y 33 X 28 Y 34 X 37 Y 33 X 23 Y 34 X 25 Y 33 X 38 Y 34 X 16 Y 33 X 11 Y 34 X 5 Y 67 X -4 Y 33 X -12 Y 34 X -40 Y 33 X -17 Y 34 X -53 Y 33 X -76 Y 34 X -118 Y 33 X -120 Y 34 X -256 Y 235 X s black[  ] 0 sd 3 lw 328 1309 m 1677 X s 328
 1331 m -22 Y s 398 1320 m -11 Y s 468 1320 m -11 Y s 538 1320 m -11 Y s 608 1331 m -22 Y s 678 1320 m -11 Y s 747 1320 m -11 Y s 817 1320 m -11 Y s 887 1331 m -22 Y s 957 1320 m -11 Y s 1027 1320 m -11 Y s 1097 1320 m -11 Y s 1167 1331 m -22 Y s
 1236 1320 m -11 Y s 1306 1320 m -11 Y s 1376 1320 m -11 Y s 1446 1331 m -22 Y s 1516 1320 m -11 Y s 1586 1320 m -11 Y s 1655 1320 m -11 Y s 1725 1331 m -22 Y s 1795 1320 m -11 Y s 1865 1320 m -11 Y s 1935 1320 m -11 Y s 2005 1331 m -22 Y s
 gsave  2177 949 45 1214 C 324 1303 t 0 r /Helvetica findfont 2.53743 sf 0 0 m (\2556) show NC gr 
 gsave  2177 949 45 1214 C 605 1303 t 0 r /Helvetica findfont 2.53743 sf 0 0 m (\2554) show NC gr 
 gsave  2177 949 45 1214 C 883 1303 t 0 r /Helvetica findfont 2.53743 sf 0 0 m (\2552) show NC gr 
 gsave  2177 949 45 1214 C 1162 1303 t 0 r /Helvetica findfont 2.53743 sf 0 0 m (0) show NC gr 
 gsave  2177 949 45 1214 C 1443 1303 t 0 r /Helvetica findfont 2.53743 sf 0 0 m (2) show NC gr 
 gsave  2177 949 45 1214 C 1721 1303 t 0 r /Helvetica findfont 2.53743 sf 0 0 m (4) show NC gr 
 gsave  2177 949 45 1214 C 2002 1303 t 0 r /Helvetica findfont 2.53743 sf 0 0 m (6) show NC gr  328 1309 m 759 Y s
 gsave  2177 949 45 1214 C 220 1931 t 90 r /Helvetica findfont 43.1363 sf 0 0 m ([pb/bin]) show NC gr  354 1338 m -26 X s 354 1377 m -26 X s 354 1405 m -26 X s 354 1427 m -26 X s 354 1444 m -26 X s 354 1459 m -26 X s 354 1472 m -26 X s 354 1484 m
 -26 X s 381 1494 m -53 X s
 gsave  2177 949 45 1214 C 286 1496 t 0 r /Helvetica findfont 30.4492 sf 0 0 m (\2555) show NC gr 
 gsave  2177 949 45 1214 C 235 1476 t 0 r /Helvetica findfont 45.6737 sf 0 0 m (10) show NC gr  354 1561 m -26 X s 354 1601 m -26 X s 354 1629 m -26 X s 354 1650 m -26 X s 354 1668 m -26 X s 354 1683 m -26 X s 354 1696 m -26 X s 354 1708 m -26 X s
 381 1718 m -53 X s
 gsave  2177 949 45 1214 C 286 1716 t 0 r /Helvetica findfont 30.4492 sf 0 0 m (\2554) show NC gr 
 gsave  2177 949 45 1214 C 235 1698 t 0 r /Helvetica findfont 45.6737 sf 0 0 m (10) show NC gr  354 1785 m -26 X s 354 1824 m -26 X s 354 1852 m -26 X s 354 1874 m -26 X s 354 1892 m -26 X s 354 1907 m -26 X s 354 1920 m -26 X s 354 1931 m -26 X s
 381 1941 m -53 X s
 gsave  2177 949 45 1214 C 286 1944 t 0 r /Helvetica findfont 30.4492 sf 0 0 m (\2553) show NC gr 
 gsave  2177 949 45 1214 C 235 1924 t 0 r /Helvetica findfont 45.6737 sf 0 0 m (10) show NC gr  354 2009 m -26 X s 354 2048 m -26 X s 6 lw 1 1 1 c black 328 1309 m 202 X 62 Y 33 X 67 Y 34 X 233 Y 33 X 110 Y 34 X 84 Y 33 X 40 Y 34 X 24 Y 33 X 28 Y 34
 X 24 Y 33 X 6 Y 34 X -1 Y 33 X -2 Y 34 X -18 Y 33 X -9 Y 34 X -19 Y 33 X -22 Y 34 X -15 Y 33 X -28 Y 34 X 15 Y 34 X -12 Y 33 X 6 Y 34 X 13 Y 33 X 36 Y 34 X 1 Y 33 X 10 Y 34 X 22 Y 33 X -2 Y 34 X 5 Y 33 X 15 Y 34 X -3 Y 33 X -19 Y 34 X -27 Y 33 X
 -35 Y 34 X -72 Y 33 X -48 Y 34 X -90 Y 33 X -182 Y 34 X -68 Y 34 X -129 Y 201 X s 0.2 0.2 0.8 c[ 20 12 4 12] 0 sd 1 1 1 c black 0.2 0.2 0.8 c 328 1309 m 202 X 276 Y 33 X 87 Y 34 X 122 Y 33 X 61 Y 34 X 57 Y 33 X 30 Y 34 X 35 Y 33 X 12 Y 34 X 8 Y 33
 X -1 Y 34 X -10 Y 33 X -17 Y 34 X -9 Y 33 X -16 Y 34 X -24 Y 33 X -4 Y 34 X -30 Y 33 X 9 Y 34 X 13 Y 34 X -8 Y 33 X 4 Y 34 X 17 Y 33 X 13 Y 34 X 22 Y 33 X 16 Y 34 X 17 Y 33 X 4 Y 34 X -14 Y 33 X 7 Y 34 X -18 Y 33 X -35 Y 34 X -36 Y 33 X -50 Y 34 X
 -65 Y 33 X -94 Y 34 X -160 Y 33 X -219 Y 269 X s black
 gsave  2177 949 45 1214 C 731 1379 t 0 r /Helvetica findfont 53.286 sf 0 0 m (VBF Higgs \(125 GeV\) @ LHC 8 TeV) show NC gr 
 gsave  2177 949 45 1214 C 2048 1767 t 90 r /Helvetica-BoldOblique findfont 25.3743 sf 0 0 m (LHC HIGGS XS WG 2013) show NC gr  1 1 1 c[  ] 0 sd 3 lw 501 207 1134 1468 bf black
 gsave  2177 949 45 1214 C 1258 1632 t 0 r /Helvetica findfont 38.0615 sf 0 0 m (aMC@NLO+HW6) show NC gr  1 1 1 c 1153 1617 m 87 X 48 Y -87 X f black 6 lw 1153 1641 m 87 X s 3 lw /w 29 def /w2 {w 2 div} def /w3 {w 3 div} def 1196 1641 m20 6 lw
 gsave  2177 949 45 1214 C 1258 1562 t 0 r /Helvetica findfont 38.0615 sf 0 0 m (aMC@NLO+PY6) show NC gr  1 1 1 c 3 lw 1153 1547 m 87 X 49 Y -87 X f 6 lw 0.8 0 0 c[  12 12 ] 0 sd 1153 1572 m 87 X s black[  ] 0 sd 3 lw 1196 1572 m20[  12 12 ] 0 sd 6
 lw
 gsave  2177 949 45 1214 C 1258 1493 t 0 r /Helvetica findfont 38.0615 sf 0 0 m (aMC@NLO+HWPP) show NC gr  1 1 1 c[  ] 0 sd 3 lw 1153 1478 m 87 X 49 Y -87 X f[  12 12 ] 0 sd 6 lw 0.2 0.2 0.8 c[ 20 12 4 12] 0 sd 1153 1503 m 87 X s black[  ] 0 sd 3 lw
 1196 1503 m20[ 20 12 4 12] 0 sd 6 lw[  ] 0 sd 3 lw 1 1 1 c black 1 1 1 c 1677 240 328 1062 bf black 1677 240 328 1062 bl 1 1 1 c 1677 240 328 1062 bf black 1677 240 328 1062 bl 328 1062 m 1677 X s 328 1086 m -24 Y s 398 1074 m -12 Y s 468 1074 m
 -12 Y s 538 1074 m -12 Y s 608 1086 m -24 Y s 678 1074 m -12 Y s 747 1074 m -12 Y s 817 1074 m -12 Y s 887 1086 m -24 Y s 957 1074 m -12 Y s 1027 1074 m -12 Y s 1097 1074 m -12 Y s 1167 1086 m -24 Y s 1236 1074 m -12 Y s 1306 1074 m -12 Y s 1376
 1074 m -12 Y s 1446 1086 m -24 Y s 1516 1074 m -12 Y s 1586 1074 m -12 Y s 1655 1074 m -12 Y s 1725 1086 m -24 Y s 1795 1074 m -12 Y s 1865 1074 m -12 Y s 1935 1074 m -12 Y s 2005 1086 m -24 Y s
 gsave  2177 243 45 1059 C 306 1022 t 0 r /Helvetica findfont 45.998 sf 0 0 m (\2556) show NC gr 
 gsave  2177 243 45 1059 C 587 1022 t 0 r /Helvetica findfont 45.998 sf 0 0 m (\2554) show NC gr 
 gsave  2177 243 45 1059 C 866 1022 t 0 r /Helvetica findfont 45.998 sf 0 0 m (\2552) show NC gr 
 gsave  2177 243 45 1059 C 1152 1022 t 0 r /Helvetica findfont 45.998 sf 0 0 m (0) show NC gr 
 gsave  2177 243 45 1059 C 1433 1022 t 0 r /Helvetica findfont 45.998 sf 0 0 m (2) show NC gr 
 gsave  2177 243 45 1059 C 1711 1022 t 0 r /Helvetica findfont 45.998 sf 0 0 m (4) show NC gr 
 gsave  2177 243 45 1059 C 1992 1022 t 0 r /Helvetica findfont 45.998 sf 0 0 m (6) show NC gr  328 1062 m 240 Y s 393 1102 m -65 X s 361 1122 m -33 X s 361 1142 m -33 X s 361 1162 m -33 X s 393 1182 m -65 X s 361 1202 m -33 X s 361 1222 m -33 X s
 361 1242 m -33 X s 393 1262 m -65 X s 393 1102 m -65 X s 361 1082 m -33 X s 361 1062 m -33 X s 393 1262 m -65 X s 361 1282 m -33 X s
 gsave  2177 243 45 1059 C 253 1086 t 0 r /Helvetica findfont 45.998 sf 0 0 m (0.8) show NC gr 
 gsave  2177 243 45 1059 C 299 1164 t 0 r /Helvetica findfont 45.998 sf 0 0 m (1) show NC gr 
 gsave  2177 243 45 1059 C 253 1245 t 0 r /Helvetica findfont 45.998 sf 0 0 m (1.2) show NC gr 
 gsave  2177 243 45 1059 C 370 1111 t 0 r /Helvetica findfont 35.7762 sf 0 0 m (aMC@NLO \255 Ratio over aMC@NLO+HW6) show NC gr  0.8 0 0 c[  12 12 ] 0 sd 6 lw 1 1 1 c black 0.8 0 0 c 328 1062 m 202 X 141 Y 33 X 99 Y s 664 1302 m -2 Y s 664 1300 m 33
 X -34 Y 34 X 36 Y s 798 1302 m -5 Y s 798 1297 m 33 X -57 Y 34 X 24 Y 33 X -9 Y 34 X 11 Y 33 X -55 Y 34 X 16 Y 33 X -63 Y 34 X -64 Y 33 X 84 Y 34 X -122 Y 67 X 7 Y 34 X 80 Y 33 X -44 Y 34 X 90 Y 33 X 107 Y s 1368 1302 m -1 Y s 1368 1301 m 33 X 1 Y
 s 1468 1302 m -15 Y s 1468 1287 m 34 X -4 Y 33 X 19 Y s 1569 1302 m -46 Y s 1569 1256 m 33 X 46 Y s 1669 1302 m -3 Y s 1669 1299 m 34 X -128 Y 33 X 131 Y s 1770 1302 m -120 Y s 1770 1182 m 34 X -120 Y 201 X s black[  ] 0 sd 1 1 1 c black 328 1062 m
 202 X 120 Y 1274 X -120 Y 201 X s 0.2 0.2 0.8 c[ 20 12 4 12] 0 sd 1 1 1 c black 0.2 0.2 0.8 c 328 1062 m 202 X 120 Y 33 X 120 Y s 597 1302 m -117 Y s 597 1185 m 33 X 54 Y 34 X -94 Y 33 X 67 Y 34 X 26 Y 33 X 35 Y 34 X -57 Y 33 X 7 Y 34 X 2 Y 33 X
 -36 Y 34 X 5 Y 33 X -1 Y 34 X 15 Y 33 X -6 Y 34 X 47 Y 33 X -11 Y 34 X -25 Y 34 X 89 Y s 1200 1302 m -37 Y s 1200 1265 m 34 X -45 Y 33 X -77 Y 34 X 50 Y 33 X 49 Y 34 X -24 Y 33 X 84 Y s 1468 1302 m -133 Y s 1468 1169 m 34 X 43 Y 33 X 7 Y 34 X -35 Y
 33 X -9 Y 34 X 104 Y 33 X -82 Y 34 X -12 Y 33 X 101 Y 34 X -104 Y 34 X -120 Y 201 X s black[  ] 0 sd 3 lw 1 1 1 c black 1 1 1 c 1677 262 328 797 bf black 1677 262 328 797 bl 1 1 1 c 1677 262 328 797 bf black 1677 262 328 797 bl 328 797 m 1677 X s
 328 824 m -27 Y s 398 810 m -13 Y s 468 810 m -13 Y s 538 810 m -13 Y s 608 824 m -27 Y s 678 810 m -13 Y s 747 810 m -13 Y s 817 810 m -13 Y s 887 824 m -27 Y s 957 810 m -13 Y s 1027 810 m -13 Y s 1097 810 m -13 Y s 1167 824 m -27 Y s 1236 810 m
 -13 Y s 1306 810 m -13 Y s 1376 810 m -13 Y s 1446 824 m -27 Y s 1516 810 m -13 Y s 1586 810 m -13 Y s 1655 810 m -13 Y s 1725 824 m -27 Y s 1795 810 m -13 Y s 1865 810 m -13 Y s 1935 810 m -13 Y s 2005 824 m -27 Y s
 gsave  2177 264 45 795 C 306 759 t 0 r /Helvetica findfont 45.8372 sf 0 0 m (\2556) show NC gr 
 gsave  2177 264 45 795 C 587 759 t 0 r /Helvetica findfont 45.8372 sf 0 0 m (\2554) show NC gr 
 gsave  2177 264 45 795 C 866 759 t 0 r /Helvetica findfont 45.8372 sf 0 0 m (\2552) show NC gr 
 gsave  2177 264 45 795 C 1152 759 t 0 r /Helvetica findfont 45.8372 sf 0 0 m (0) show NC gr 
 gsave  2177 264 45 795 C 1433 759 t 0 r /Helvetica findfont 45.8372 sf 0 0 m (2) show NC gr 
 gsave  2177 264 45 795 C 1711 759 t 0 r /Helvetica findfont 45.8372 sf 0 0 m (4) show NC gr 
 gsave  2177 264 45 795 C 1992 759 t 0 r /Helvetica findfont 45.8372 sf 0 0 m (6) show NC gr  328 797 m 262 Y s 393 841 m -65 X s 361 863 m -33 X s 361 885 m -33 X s 361 906 m -33 X s 393 928 m -65 X s 361 950 m -33 X s 361 972 m -33 X s 361 994 m
 -33 X s 393 1016 m -65 X s 393 841 m -65 X s 361 819 m -33 X s 361 797 m -33 X s 393 1016 m -65 X s 361 1037 m -33 X s
 gsave  2177 264 45 795 C 253 825 t 0 r /Helvetica findfont 45.8372 sf 0 0 m (0.8) show NC gr 
 gsave  2177 264 45 795 C 299 911 t 0 r /Helvetica findfont 45.8372 sf 0 0 m (1) show NC gr 
 gsave  2177 264 45 795 C 253 1000 t 0 r /Helvetica findfont 45.8372 sf 0 0 m (1.2) show NC gr 
 gsave  2177 264 45 795 C 370 982 t 0 r /Helvetica findfont 35.6511 sf 0 0 m (POWHEG \255 Ratio over aMC@NLO+HW6) show NC gr  0.8 0 0 c[  12 12 ] 0 sd 6 lw 1 1 1 c black 0.8 0 0 c 328 797 m 202 X 131 Y 67 X -131 Y 134 X 5 Y 33 X 11 Y 34 X -2 Y 33 X
 -14 Y 34 X 97 Y 33 X -17 Y 34 X 131 Y 33 X 9 Y 34 X -27 Y 33 X 69 Y s 1066 1059 m -5 Y s 1066 1054 m 33 X 5 Y s 1133 1059 m -38 Y s 1133 1021 m 34 X -21 Y 33 X 59 Y s 1234 1059 m -13 Y s 1234 1046 m 33 X -68 Y 34 X 81 Y s 1334 1059 m -1 Y s 1334
 1058 m 34 X -27 Y 33 X 14 Y 34 X -113 Y 33 X -36 Y 34 X -99 Y 268 X 131 Y 34 X -131 Y 201 X s black[  ] 0 sd 1 1 1 c black 328 797 m 202 X 131 Y 67 X -131 Y 234 X 30 Y 34 X 28 Y 33 X -31 Y 34 X 52 Y 33 X 11 Y 34 X 19 Y 33 X 56 Y 34 X -65 Y 33 X 91
 Y 34 X -95 Y 34 X 78 Y 33 X -133 Y 34 X 185 Y 33 X -89 Y 34 X -4 Y 33 X 29 Y 34 X -90 Y 33 X 36 Y 34 X -4 Y 33 X -98 Y 34 X -6 Y 134 X 116 Y 33 X -116 Y 34 X 17 Y 33 X 245 Y s 1770 1059 m -131 Y s 1770 928 m 34 X -131 Y 201 X s 0.2 0.2 0.8 c[
 20 12 4 12] 0 sd 1 1 1 c black 0.2 0.2 0.8 c 328 797 m 202 X 131 Y 33 X 131 Y s 597 1059 m -262 Y s 597 797 m 134 X 31 Y 33 X -4 Y 34 X -6 Y 33 X -9 Y 34 X 36 Y 33 X 12 Y 34 X 16 Y 33 X 8 Y 34 X -4 Y 33 X 70 Y 34 X -35 Y 33 X 86 Y 34 X -56 Y 34 X
 -28 Y 33 X 52 Y 34 X 9 Y 33 X -74 Y 34 X 28 Y 33 X -43 Y 34 X -37 Y 33 X 82 Y 34 X -36 Y 33 X -78 Y 34 X -5 Y 33 X -15 Y 101 X 36 Y 33 X -36 Y 67 X 42 Y 34 X 89 Y 34 X -131 Y 201 X s black[ 20 20] 0 sd 3 lw 328 928 m 1677 X s[  ] 0 sd 1 1 1 c black
 1 1 1 c 1677 248 328 547 bf black 1677 248 328 547 bl 1 1 1 c 1677 248 328 547 bf black 1677 248 328 547 bl 328 547 m 1677 X s
 gsave  2177 354 45 441 C 1858 458 t 0 r /Helvetica findfont 45.7272 sf 0 0 m (j veto y) show NC gr  328 569 m -22 Y s 398 558 m -11 Y s 468 558 m -11 Y s 538 558 m -11 Y s 608 569 m -22 Y s 678 558 m -11 Y s 747 558 m -11 Y s 817 558 m -11 Y s 887
 569 m -22 Y s 957 558 m -11 Y s 1027 558 m -11 Y s 1097 558 m -11 Y s 1167 569 m -22 Y s 1236 558 m -11 Y s 1306 558 m -11 Y s 1376 558 m -11 Y s 1446 569 m -22 Y s 1516 558 m -11 Y s 1586 558 m -11 Y s 1655 558 m -11 Y s 1725 569 m -22 Y s 1795
 558 m -11 Y s 1865 558 m -11 Y s 1935 558 m -11 Y s 2005 569 m -22 Y s
 gsave  2177 354 45 441 C 306 504 t 0 r /Helvetica findfont 45.7272 sf 0 0 m (\2556) show NC gr 
 gsave  2177 354 45 441 C 587 504 t 0 r /Helvetica findfont 45.7272 sf 0 0 m (\2554) show NC gr 
 gsave  2177 354 45 441 C 866 504 t 0 r /Helvetica findfont 45.7272 sf 0 0 m (\2552) show NC gr 
 gsave  2177 354 45 441 C 1152 504 t 0 r /Helvetica findfont 45.7272 sf 0 0 m (0) show NC gr 
 gsave  2177 354 45 441 C 1433 504 t 0 r /Helvetica findfont 45.7272 sf 0 0 m (2) show NC gr 
 gsave  2177 354 45 441 C 1711 504 t 0 r /Helvetica findfont 45.7272 sf 0 0 m (4) show NC gr 
 gsave  2177 354 45 441 C 1992 504 t 0 r /Helvetica findfont 45.7272 sf 0 0 m (6) show NC gr  328 547 m 248 Y s 374 589 m -46 X s 351 609 m -23 X s 351 630 m -23 X s 351 650 m -23 X s 374 671 m -46 X s 351 692 m -23 X s 351 712 m -23 X s 351 733 m
 -23 X s 374 753 m -46 X s 374 589 m -46 X s 351 568 m -23 X s 351 547 m -23 X s 374 753 m -46 X s 351 774 m -23 X s
 gsave  2177 354 45 441 C 253 572 t 0 r /Helvetica findfont 45.7272 sf 0 0 m (0.8) show NC gr 
 gsave  2177 354 45 441 C 299 656 t 0 r /Helvetica findfont 45.7272 sf 0 0 m (1) show NC gr 
 gsave  2177 354 45 441 C 253 737 t 0 r /Helvetica findfont 45.7272 sf 0 0 m (1.2) show NC gr  0.8 0 0 c
 gsave  2177 354 45 441 C 370 721 t 0 r /Helvetica findfont 40.6464 sf 0 0 m (Scale uncert) show NC gr  black
 gsave  2177 354 45 441 C 370 602 t 0 r /Helvetica findfont 40.6464 sf 0 0 m (PDF uncert) show NC gr  0.8 0 0 c[  12 12 ] 0 sd 6 lw 1 1 1 c black 0.8 0 0 c 328 547 m 202 X 248 Y s 597 795 m -4 Y s 597 791 m 33 X -29 Y 34 X -9 Y 33 X 6 Y 34 X -26 Y
 33 X -32 Y 34 X 51 Y 33 X -16 Y 34 X -7 Y 33 X 11 Y 34 X -10 Y 33 X 10 Y 34 X -11 Y 33 X -18 Y 67 X 12 Y 34 X 2 Y 34 X -19 Y 33 X 28 Y 34 X -39 Y 33 X 43 Y 34 X -13 Y 33 X 7 Y 34 X -13 Y 33 X 17 Y 34 X 4 Y 33 X 4 Y 67 X 13 Y 34 X -3 Y 33 X -7 Y 34
 X 7 Y 33 X -24 Y 34 X 47 Y 33 X -15 Y 34 X 33 Y s 1804 795 m -248 Y s 1804 547 m 201 X s 1 1 1 c black 0.8 0 0 c 328 547 m 202 X 26 Y 33 X 10 Y 34 X 4 Y 33 X 16 Y 34 X 6 Y 33 X -3 Y 34 X 17 Y 33 X 21 Y 34 X -33 Y 33 X 10 Y 34 X 5 Y 33 X -7 Y 34 X 6
 Y 33 X -6 Y 34 X 7 Y 33 X 12 Y 34 X 1 Y 33 X -10 Y 34 X -3 Y 34 X 15 Y 33 X -17 Y 34 X 26 Y 33 X -30 Y 34 X 10 Y 33 X -6 Y 34 X 12 Y 33 X -15 Y 34 X -2 Y 33 X -3 Y 34 X -1 Y 33 X -8 Y 34 X 4 Y 33 X 4 Y 34 X -7 Y 33 X 16 Y 34 X -30 Y 33 X 10 Y 34 X
 -47 Y 34 X -10 Y 201 X s black[ 12 16 4 16] 0 sd 1 1 1 c black 328 547 m 202 X 109 Y 33 X -3 Y 34 X 4 Y 33 X 3 Y 34 X 2 Y 33 X 1 Y 34 X -1 Y 33 X -20 Y 34 X 21 Y 67 X 1 Y 134 X 1 Y 33 X -1 Y 67 X 1 Y 34 X -1 Y 67 X 1 Y 67 X -1 Y 34 X 1 Y 67 X -19 Y
 33 X 17 Y 134 X -1 Y 101 X -1 Y 33 X 1 Y 34 X 1 Y 33 X -12 Y 34 X -1 Y 34 X -103 Y 201 X s 1 1 1 c black 328 547 m 202 X 142 Y 33 X 1 Y 34 X -3 Y 33 X -3 Y 34 X -2 Y 67 X 1 Y 33 X 19 Y 34 X -20 Y 134 X -2 Y 235 X 1 Y 33 X -1 Y 34 X -1 Y 33 X 1 Y 34
 X -1 Y 33 X 1 Y 34 X 20 Y 33 X -19 Y 67 X 2 Y 34 X -1 Y 33 X -1 Y 34 X 2 Y 167 X 13 Y 34 X -3 Y 34 X -146 Y 201 X s[ 20 20] 0 sd 3 lw 328 671 m 1677 X s
 gr  gr 
showpage
end
%%EOF
