%!PS-Adobe-3.0 EPSF-3.0
%%BoundingBox: (atend)
%%LanguageLevel: 2
%%Creator: Grace-5.1.22
%%CreationDate: Mon Jun  3 12:37:02 2013
%%DocumentData: Clean8Bit
%%Orientation: Portrait
%%Title: /home/pcl321b/heinemey/plot/grace/2012/lhc-higgs-br/lightstop_tb10_BR-HH.grace
%%For: heinemey
%%DocumentNeededResources: (atend)
%%EndComments
%%BeginProlog
/m {moveto} def
/l {lineto} def
/s {stroke} def
/n {newpath} def
/c {closepath} def
/RL {rlineto} def
/SLW {setlinewidth} def
/GS {gsave} def
/GR {grestore} def
/SC {setcolor} def
/SGRY {setgray} def
/SRGB {setrgbcolor} def
/SD {setdash} def
/SLC {setlinecap} def
/SLJ {setlinejoin} def
/SCS {setcolorspace} def
/FFSF {findfont setfont} def
/CC {concat} def
/PXL {n m 0 0 RL s} def
/Color0 {1.0000 1.0000 1.0000} def
/Color1 {0.0000 0.0000 0.0000} def
/Color2 {1.0000 0.0000 0.0000} def
/Color3 {0.0000 1.0000 0.0000} def
/Color4 {0.0000 0.0000 1.0000} def
/Color5 {1.0000 1.0000 0.0000} def
/Color6 {0.7373 0.5608 0.5608} def
/Color7 {0.8627 0.8627 0.8627} def
/Color8 {0.5804 0.0000 0.8275} def
/Color9 {0.0000 1.0000 1.0000} def
/Color10 {1.0000 0.0000 1.0000} def
/Color11 {1.0000 0.6471 0.0000} def
/Color12 {0.4471 0.1294 0.7373} def
/Color13 {0.4039 0.0275 0.2824} def
/Color14 {0.2510 0.8784 0.8157} def
/Color15 {0.0000 0.5451 0.0000} def
/Color16 {0.7529 0.7529 0.7529} def
/Color17 {0.5059 0.5059 0.5059} def
/Color18 {0.2588 0.2588 0.2588} def
/PTRN {
 /pat_bits exch def 
 <<
  /PaintType 2
  /PatternType 1 /TilingType 1
  /BBox[0 0 16 16]
  /XStep 16 /YStep 16
  /PaintProc {
   pop
   16 16 true [-1 0 0 -1 16 16] pat_bits imagemask
  }
 >>
 [0.0016 0 0 0.0016 0 0]
 makepattern
} def
/Pattern0 {<0000000000000000000000000000000000000000000000000000000000000000> PTRN} bind def
/Pattern1 {<ffffffffffffffffffffffffffffffffffffffffffffffffffffffffffffffff> PTRN} bind def
/Pattern2 {<eeeeffffbbbbffffeeeeffffbbbbffffeeeeffffbbbbffffeeeeffffbbbbffff> PTRN} bind def
/Pattern3 {<eeeebbbbeeeebbbbeeeebbbbeeeebbbbeeeebbbbeeeebbbbeeeebbbbeeeebbbb> PTRN} bind def
/Pattern4 {<5555aaaa5555aaaa5555aaaa5555aaaa5555aaaa5555aaaa5555aaaa5555aaaa> PTRN} bind def
/Pattern5 {<1111444411114444111144441111444411114444111144441111444411114444> PTRN} bind def
/Pattern6 {<1111000044440000111100004444000011110000444400001111000044440000> PTRN} bind def
/Pattern7 {<1010000000000000010100000000000010100000000000000101000000000000> PTRN} bind def
/Pattern8 {<0000000000000000000000000000000000000000000000000000000000000000> PTRN} bind def
/Pattern9 {<1e1e0f0f8787c3c3e1e1f0f078783c3c1e1e0f0f8787c3c3e1e1f0f078783c3c> PTRN} bind def
/Pattern10 {<7878f0f0e1e1c3c387870f0f1e1e3c3c7878f0f0e1e1c3c387870f0f1e1e3c3c> PTRN} bind def
/Pattern11 {<3333333333333333333333333333333333333333333333333333333333333333> PTRN} bind def
/Pattern12 {<ffffffff00000000ffffffff00000000ffffffff00000000ffffffff00000000> PTRN} bind def
/Pattern13 {<8181424224241818181824244242818181814242242418181818242442428181> PTRN} bind def
/Pattern14 {<8080404020201010080804040202010180804040202010100808040402020101> PTRN} bind def
/Pattern15 {<0101020204040808101020204040808001010202040408081010202040408080> PTRN} bind def
/Pattern16 {<2222222222222222222222222222222222222222222222222222222222222222> PTRN} bind def
/Pattern17 {<0000ffff000000000000ffff000000000000ffff000000000000ffff00000000> PTRN} bind def
/Pattern18 {<2222ffff222222222222ffff222222222222ffff222222222222ffff22222222> PTRN} bind def
/Pattern19 {<ffffffff33333333ffffffff33333333ffffffff33333333ffffffff33333333> PTRN} bind def
/Pattern20 {<0f0f0f0f0f0f0f0ff0f0f0f0f0f0f0f00f0f0f0f0f0f0f0ff0f0f0f0f0f0f0f0> PTRN} bind def
/Pattern21 {<ff00ff00ff00ff00ff00ff00ff00ff0000ff00ff00ff00ff00ff00ff00ff00ff> PTRN} bind def
/Pattern22 {<8001800180018001800180018001ffffffff8001800180018001800180018001> PTRN} bind def
/Pattern23 {<c003c003c003c003c003c003ffffffffffffffffc003c003c003c003c003c003> PTRN} bind def
/Pattern24 {<040404040404ffff404040404040ffff040404040404ffff404040404040ffff> PTRN} bind def
/Pattern25 {<180018001800180018001800ffffffff001800180018001800180018ffffffff> PTRN} bind def
/Pattern26 {<1111b8b87c7c3a3a1111a3a3c7c78b8b1111b8b87c7c3a3a1111a3a3c7c78b8b> PTRN} bind def
/Pattern27 {<101010102828c7c70101010182827c7c101010102828c7c70101010182827c7c> PTRN} bind def
/Pattern28 {<1c1c121211112121c1c12121111112121c1c121211112121c1c1212111111212> PTRN} bind def
/Pattern29 {<3e3e414180808080e3e31414080808083e3e414180808080e3e3141408080808> PTRN} bind def
/Pattern30 {<4848888884848383848488884848383848488888848483838484888848483838> PTRN} bind def
/Pattern31 {<03030404080808080c0c12122121c0c003030404080808080c0c12122121c0c0> PTRN} bind def
/ellipsedict 8 dict def
ellipsedict /mtrx matrix put
/EARC {
 ellipsedict begin
  /endangle exch def
  /startangle exch def
  /yrad exch def
  /xrad exch def
  /y exch def
  /x exch def
  /savematrix mtrx currentmatrix def
  x y translate
  xrad yrad scale
  0 0 1 startangle endangle arc
  savematrix setmatrix
 end
} def
/TL {
  /kcomp exch def
  /linewidth exch def
  /offset exch def
  GS
  0 offset rmoveto
  linewidth SLW
  dup stringwidth exch kcomp add exch RL s
  GR
} def
/KINIT
{
 /kvector exch def
 /kid 0 def
} def
/KPROC
{
 pop pop
 kvector kid get
 0 rmoveto
 /kid 1 kid add def
} def
/DefEncoding [
 /.notdef
 /.notdef
 /.notdef
 /.notdef
 /.notdef
 /.notdef
 /.notdef
 /.notdef
 /.notdef
 /.notdef
 /.notdef
 /.notdef
 /.notdef
 /.notdef
 /.notdef
 /.notdef
 /.notdef
 /.notdef
 /.notdef
 /.notdef
 /.notdef
 /.notdef
 /.notdef
 /.notdef
 /.notdef
 /.notdef
 /.notdef
 /.notdef
 /.notdef
 /.notdef
 /.notdef
 /.notdef
 /space
 /exclam
 /quotedbl
 /numbersign
 /dollar
 /percent
 /ampersand
 /quoteright
 /parenleft
 /parenright
 /asterisk
 /plus
 /comma
 /hyphen
 /period
 /slash
 /zero
 /one
 /two
 /three
 /four
 /five
 /six
 /seven
 /eight
 /nine
 /colon
 /semicolon
 /less
 /equal
 /greater
 /question
 /at
 /A
 /B
 /C
 /D
 /E
 /F
 /G
 /H
 /I
 /J
 /K
 /L
 /M
 /N
 /O
 /P
 /Q
 /R
 /S
 /T
 /U
 /V
 /W
 /X
 /Y
 /Z
 /bracketleft
 /backslash
 /bracketright
 /asciicircum
 /underscore
 /grave
 /a
 /b
 /c
 /d
 /e
 /f
 /g
 /h
 /i
 /j
 /k
 /l
 /m
 /n
 /o
 /p
 /q
 /r
 /s
 /t
 /u
 /v
 /w
 /x
 /y
 /z
 /braceleft
 /bar
 /braceright
 /asciitilde
 /.notdef
 /.notdef
 /.notdef
 /.notdef
 /.notdef
 /.notdef
 /.notdef
 /.notdef
 /.notdef
 /.notdef
 /.notdef
 /.notdef
 /.notdef
 /.notdef
 /.notdef
 /.notdef
 /.notdef
 /.notdef
 /.notdef
 /.notdef
 /.notdef
 /.notdef
 /.notdef
 /.notdef
 /.notdef
 /.notdef
 /.notdef
 /.notdef
 /.notdef
 /.notdef
 /.notdef
 /.notdef
 /.notdef
 /space
 /exclamdown
 /cent
 /sterling
 /currency
 /yen
 /brokenbar
 /section
 /dieresis
 /copyright
 /ordfeminine
 /guillemotleft
 /logicalnot
 /hyphen
 /registered
 /macron
 /degree
 /plusminus
 /twosuperior
 /threesuperior
 /acute
 /mu
 /paragraph
 /periodcentered
 /cedilla
 /onesuperior
 /ordmasculine
 /guillemotright
 /onequarter
 /onehalf
 /threequarters
 /questiondown
 /Agrave
 /Aacute
 /Acircumflex
 /Atilde
 /Adieresis
 /Aring
 /AE
 /Ccedilla
 /Egrave
 /Eacute
 /Ecircumflex
 /Edieresis
 /Igrave
 /Iacute
 /Icircumflex
 /Idieresis
 /Eth
 /Ntilde
 /Ograve
 /Oacute
 /Ocircumflex
 /Otilde
 /Odieresis
 /multiply
 /Oslash
 /Ugrave
 /Uacute
 /Ucircumflex
 /Udieresis
 /Yacute
 /Thorn
 /germandbls
 /agrave
 /aacute
 /acircumflex
 /atilde
 /adieresis
 /aring
 /ae
 /ccedilla
 /egrave
 /eacute
 /ecircumflex
 /edieresis
 /igrave
 /iacute
 /icircumflex
 /idieresis
 /eth
 /ntilde
 /ograve
 /oacute
 /ocircumflex
 /otilde
 /odieresis
 /divide
 /oslash
 /ugrave
 /uacute
 /ucircumflex
 /udieresis
 /yacute
 /thorn
 /ydieresis
] def
%%EndProlog
%%BeginSetup
%%EndSetup
612.00 612.00 scale
[/DeviceRGB] SCS
Color2 SC
[] 0 SD
0.0045 SLW
0 SLC
0 SLJ
n
0.5093 0.1499 m
0.5108 0.1553 l
0.5124 0.1610 l
0.5139 0.1667 l
0.5155 0.1725 l
0.5171 0.1782 l
0.5186 0.1839 l
0.5202 0.1897 l
0.5218 0.1955 l
0.5233 0.2013 l
0.5249 0.2072 l
0.5265 0.2132 l
0.5280 0.2192 l
0.5296 0.2254 l
0.5312 0.2317 l
0.5327 0.2381 l
0.5343 0.2447 l
0.5359 0.2514 l
0.5375 0.2585 l
0.5390 0.2658 l
0.5406 0.2735 l
0.5422 0.2818 l
0.5437 0.2907 l
0.5453 0.3006 l
0.5469 0.3162 l
0.5484 0.3369 l
0.5502 0.3638 l
0.5516 0.3878 l
0.5531 0.4151 l
0.5547 0.4420 l
0.5563 0.4671 l
0.5578 0.4892 l
0.5594 0.5069 l
0.5610 0.5217 l
0.5625 0.5345 l
0.5641 0.5457 l
0.5657 0.5557 l
0.5673 0.5647 l
0.5688 0.5728 l
0.5704 0.5803 l
0.5720 0.5872 l
0.5735 0.5935 l
0.5751 0.5994 l
0.5767 0.6049 l
0.5782 0.6100 l
0.5798 0.6149 l
0.5814 0.6194 l
0.5829 0.6237 l
0.5845 0.6278 l
0.5861 0.6316 l
0.5876 0.6353 l
0.5892 0.6388 l
0.5908 0.6421 l
0.5924 0.6453 l
0.5939 0.6483 l
0.5955 0.6512 l
0.5971 0.6540 l
0.5986 0.6567 l
0.6002 0.6592 l
0.6018 0.6617 l
0.6033 0.6641 l
0.6049 0.6663 l
0.6065 0.6685 l
0.6080 0.6707 l
0.6096 0.6727 l
0.6112 0.6747 l
0.6127 0.6766 l
0.6143 0.6785 l
0.6159 0.6803 l
0.6175 0.6820 l
0.6190 0.6837 l
0.6206 0.6853 l
0.6222 0.6869 l
0.6237 0.6885 l
0.6253 0.6899 l
0.6269 0.6914 l
0.6284 0.6928 l
0.6300 0.6942 l
0.6316 0.6955 l
0.6331 0.6968 l
0.6347 0.6981 l
0.6363 0.6993 l
0.6378 0.7005 l
0.6394 0.7017 l
0.6410 0.7028 l
0.6425 0.7040 l
0.6441 0.7050 l
0.6457 0.7061 l
0.6473 0.7071 l
0.6488 0.7082 l
0.6504 0.7091 l
0.6520 0.7101 l
0.6535 0.7111 l
0.6551 0.7120 l
0.6567 0.7129 l
0.6582 0.7138 l
0.6598 0.7146 l
0.6614 0.7155 l
0.6629 0.7163 l
0.6645 0.7171 l
0.6661 0.7179 l
0.6676 0.7187 l
0.6692 0.7194 l
0.6708 0.7202 l
0.6724 0.7209 l
0.6739 0.7216 l
0.6755 0.7223 l
0.6771 0.7230 l
0.6786 0.7237 l
0.6802 0.7244 l
0.6818 0.7250 l
0.6833 0.7257 l
0.6849 0.7263 l
0.6865 0.7269 l
0.6880 0.7275 l
0.6896 0.7281 l
0.6912 0.7287 l
0.6927 0.7293 l
0.6943 0.7298 l
0.6959 0.7304 l
0.6975 0.7309 l
0.6990 0.7315 l
0.7006 0.7320 l
0.7022 0.7325 l
0.7037 0.7330 l
0.7053 0.7335 l
0.7069 0.7340 l
0.7084 0.7345 l
0.7100 0.7350 l
0.7116 0.7354 l
0.7131 0.7359 l
0.7147 0.7363 l
0.7163 0.7368 l
0.7178 0.7372 l
0.7194 0.7376 l
0.7210 0.7381 l
0.7225 0.7385 l
0.7241 0.7389 l
0.7257 0.7393 l
0.7273 0.7397 l
0.7288 0.7401 l
0.7304 0.7404 l
0.7320 0.7408 l
0.7335 0.7412 l
0.7351 0.7415 l
0.7367 0.7418 l
0.7382 0.7422 l
0.7398 0.7425 l
0.7414 0.7428 l
0.7429 0.7431 l
0.7445 0.7434 l
0.7461 0.7437 l
0.7476 0.7440 l
0.7492 0.7443 l
0.7508 0.7446 l
0.7524 0.7449 l
0.7539 0.7452 l
0.7555 0.7454 l
0.7571 0.7457 l
0.7586 0.7460 l
0.7602 0.7462 l
0.7618 0.7465 l
0.7633 0.7467 l
0.7649 0.7470 l
0.7665 0.7472 l
0.7680 0.7474 l
0.7696 0.7477 l
0.7712 0.7479 l
0.7727 0.7481 l
0.7743 0.7483 l
0.7759 0.7486 l
0.7775 0.7488 l
0.7790 0.7490 l
0.7806 0.7492 l
0.7822 0.7494 l
0.7837 0.7496 l
0.7853 0.7498 l
0.7869 0.7500 l
0.7884 0.7502 l
0.7900 0.7504 l
0.7916 0.7506 l
0.7931 0.7507 l
0.7947 0.7509 l
0.7963 0.7511 l
0.7978 0.7513 l
0.7994 0.7515 l
0.8010 0.7516 l
0.8025 0.7518 l
0.8041 0.7520 l
0.8057 0.7521 l
0.8073 0.7523 l
0.8088 0.7524 l
0.8104 0.7526 l
0.8120 0.7528 l
0.8135 0.7529 l
0.8151 0.7531 l
0.8167 0.7532 l
0.8182 0.7534 l
0.8198 0.7536 l
0.8214 0.7528 l
0.8229 0.7521 l
0.8245 0.7516 l
0.8261 0.7514 l
0.8276 0.7511 l
0.8292 0.7509 l
0.8308 0.7508 l
0.8324 0.7506 l
0.8339 0.7505 l
0.8355 0.7504 l
0.8371 0.7503 l
0.8386 0.7502 l
0.8402 0.7502 l
0.8418 0.7501 l
0.8433 0.7500 l
0.8449 0.7500 l
0.8465 0.7499 l
0.8480 0.7499 l
0.8496 0.7499 l
0.8512 0.7498 l
0.8527 0.7498 l
0.8543 0.7498 l
0.8559 0.7497 l
0.8575 0.7497 l
0.8590 0.7497 l
0.8606 0.7497 l
0.8622 0.7496 l
0.8637 0.7496 l
0.8653 0.7496 l
0.8669 0.7496 l
0.8684 0.7496 l
0.8700 0.7496 l
0.8716 0.7496 l
0.8731 0.7496 l
0.8747 0.7495 l
0.8763 0.7495 l
0.8778 0.7495 l
0.8794 0.7495 l
0.8810 0.7495 l
0.8825 0.7495 l
0.8841 0.7495 l
0.8857 0.7495 l
0.8873 0.7495 l
0.8888 0.7495 l
0.8904 0.7495 l
0.8920 0.7495 l
0.8935 0.7495 l
0.8951 0.7495 l
0.8967 0.7495 l
0.8982 0.7495 l
0.8998 0.7495 l
0.9014 0.7495 l
0.9029 0.7495 l
0.9045 0.7495 l
0.9061 0.7495 l
0.9076 0.7495 l
0.9092 0.7495 l
0.9108 0.7495 l
0.9124 0.7495 l
0.9139 0.7495 l
0.9155 0.7495 l
0.9171 0.7495 l
0.9186 0.7495 l
0.9202 0.7495 l
0.9218 0.7495 l
0.9233 0.7495 l
0.9249 0.7495 l
0.9265 0.7495 l
0.9280 0.7495 l
0.9296 0.7494 l
0.9312 0.7494 l
0.9327 0.7493 l
0.9343 0.7493 l
0.9359 0.7492 l
0.9375 0.7491 l
0.9390 0.7491 l
0.9406 0.7490 l
0.9422 0.7489 l
0.9437 0.7488 l
0.9453 0.7487 l
0.9469 0.7486 l
0.9484 0.7485 l
0.9500 0.7484 l
s
[/DeviceRGB] SCS
Color3 SC
n
0.1500 0.8757 m
0.1516 0.8764 l
0.1531 0.8772 l
0.1547 0.8778 l
0.1563 0.8785 l
0.1578 0.8791 l
0.1594 0.8797 l
0.1610 0.8803 l
0.1625 0.8809 l
0.1641 0.8814 l
0.1657 0.8819 l
0.1673 0.8824 l
0.1688 0.8828 l
0.1704 0.8832 l
0.1720 0.8836 l
0.1735 0.8840 l
0.1751 0.8844 l
0.1767 0.8847 l
0.1782 0.8850 l
0.1798 0.8853 l
0.1814 0.8856 l
0.1829 0.8858 l
0.1845 0.8861 l
0.1861 0.8863 l
0.1876 0.8865 l
0.1892 0.8867 l
0.1908 0.8868 l
0.1924 0.8870 l
0.1939 0.8871 l
0.1955 0.8872 l
0.1971 0.8873 l
0.1986 0.8874 l
0.2002 0.8875 l
0.2018 0.8876 l
0.2033 0.8877 l
0.2049 0.8877 l
0.2065 0.8878 l
0.2080 0.8878 l
0.2096 0.8879 l
0.2112 0.8879 l
0.2127 0.8880 l
0.2143 0.8880 l
0.2159 0.8880 l
0.2175 0.8881 l
0.2190 0.8881 l
0.2206 0.8881 l
0.2222 0.8881 l
0.2237 0.8881 l
0.2253 0.8881 l
0.2269 0.8882 l
0.2284 0.8882 l
0.2300 0.8882 l
0.2316 0.8882 l
0.2331 0.8882 l
0.2347 0.8882 l
0.2363 0.8882 l
0.2378 0.8881 l
0.2394 0.8881 l
0.2410 0.8881 l
0.2425 0.8881 l
0.2441 0.8881 l
0.2457 0.8880 l
0.2473 0.8880 l
0.2488 0.8880 l
0.2504 0.8879 l
0.2520 0.8879 l
0.2535 0.8878 l
0.2551 0.8877 l
0.2567 0.8877 l
0.2582 0.8876 l
0.2598 0.8870 l
0.2614 0.8866 l
0.2629 0.8864 l
0.2645 0.8861 l
0.2661 0.8860 l
0.2676 0.8858 l
0.2692 0.8857 l
0.2708 0.8857 l
0.2724 0.8856 l
0.2739 0.8856 l
0.2755 0.8855 l
0.2771 0.8855 l
0.2786 0.8855 l
0.2802 0.8855 l
0.2818 0.8855 l
0.2833 0.8855 l
0.2849 0.8855 l
0.2865 0.8855 l
0.2880 0.8855 l
0.2896 0.8855 l
0.2912 0.8855 l
0.2927 0.8855 l
0.2943 0.8855 l
0.2959 0.8854 l
0.2975 0.8854 l
0.2990 0.8854 l
0.3006 0.8853 l
0.3022 0.8853 l
0.3037 0.8853 l
0.3053 0.8853 l
0.3069 0.8853 l
0.3084 0.8853 l
0.3100 0.8853 l
0.3116 0.8853 l
0.3131 0.8853 l
0.3147 0.8854 l
0.3163 0.8854 l
0.3178 0.8854 l
0.3194 0.8854 l
0.3210 0.8854 l
0.3225 0.8855 l
0.3241 0.8855 l
0.3257 0.8855 l
0.3273 0.8855 l
0.3288 0.8856 l
0.3304 0.8856 l
0.3320 0.8856 l
0.3335 0.8856 l
0.3351 0.8857 l
0.3367 0.8857 l
0.3382 0.8857 l
0.3398 0.8857 l
0.3414 0.8857 l
0.3429 0.8858 l
0.3445 0.8858 l
0.3461 0.8858 l
0.3476 0.8858 l
0.3492 0.8858 l
0.3508 0.8859 l
0.3524 0.8859 l
0.3539 0.8859 l
0.3555 0.8859 l
0.3571 0.8859 l
0.3586 0.8860 l
0.3602 0.8860 l
0.3618 0.8860 l
0.3633 0.8860 l
0.3649 0.8860 l
0.3665 0.8860 l
0.3680 0.8861 l
0.3696 0.8861 l
0.3712 0.8861 l
0.3727 0.8861 l
0.3743 0.8861 l
0.3759 0.8861 l
0.3775 0.8861 l
0.3790 0.8862 l
0.3806 0.8862 l
0.3822 0.8862 l
0.3837 0.8862 l
0.3853 0.8862 l
0.3869 0.8862 l
0.3884 0.8862 l
0.3900 0.8858 l
0.3916 0.8845 l
0.3931 0.8839 l
0.3947 0.8835 l
0.3963 0.8831 l
0.3978 0.8828 l
0.3994 0.8826 l
0.4010 0.8823 l
0.4025 0.8821 l
0.4041 0.8820 l
0.4057 0.8818 l
0.4073 0.8817 l
0.4088 0.8816 l
0.4104 0.8815 l
0.4120 0.8814 l
0.4135 0.8813 l
0.4151 0.8812 l
0.4167 0.8811 l
0.4182 0.8811 l
0.4198 0.8810 l
0.4214 0.8809 l
0.4229 0.8809 l
0.4245 0.8809 l
0.4261 0.8808 l
0.4276 0.8808 l
0.4292 0.8808 l
0.4308 0.8807 l
0.4324 0.8807 l
0.4339 0.8807 l
0.4355 0.8807 l
0.4371 0.8807 l
0.4386 0.8806 l
0.4402 0.8806 l
0.4418 0.8806 l
0.4433 0.8806 l
0.4449 0.8806 l
0.4465 0.8806 l
0.4480 0.8806 l
0.4496 0.8806 l
0.4512 0.8806 l
0.4527 0.8806 l
0.4543 0.8806 l
0.4559 0.8806 l
0.4575 0.8806 l
0.4590 0.8807 l
0.4606 0.8807 l
0.4622 0.8807 l
0.4637 0.8807 l
0.4653 0.8807 l
0.4669 0.8807 l
0.4684 0.8807 l
0.4700 0.8807 l
0.4716 0.8808 l
0.4731 0.8808 l
0.4747 0.8808 l
0.4763 0.8808 l
0.4778 0.8808 l
0.4794 0.8808 l
0.4810 0.8809 l
0.4825 0.8809 l
0.4841 0.8809 l
0.4857 0.8809 l
0.4873 0.8809 l
0.4888 0.8810 l
0.4904 0.8810 l
0.4920 0.8810 l
0.4935 0.8810 l
0.4951 0.8810 l
0.4967 0.8811 l
0.4982 0.8811 l
0.4998 0.8811 l
0.5014 0.8811 l
0.5029 0.8811 l
0.5045 0.8812 l
0.5061 0.8812 l
0.5076 0.8812 l
0.5092 0.8812 l
0.5108 0.8812 l
0.5124 0.8813 l
0.5139 0.8813 l
0.5155 0.8813 l
0.5171 0.8813 l
0.5186 0.8813 l
0.5202 0.8814 l
0.5218 0.8814 l
0.5233 0.8814 l
0.5249 0.8814 l
0.5265 0.8814 l
0.5280 0.8814 l
0.5296 0.8815 l
0.5312 0.8815 l
0.5327 0.8815 l
0.5343 0.8815 l
0.5359 0.8815 l
0.5375 0.8815 l
0.5390 0.8815 l
0.5406 0.8815 l
0.5422 0.8815 l
0.5437 0.8815 l
0.5453 0.8816 l
0.5469 0.8816 l
0.5484 0.8815 l
0.5502 0.8815 l
0.5516 0.8814 l
0.5531 0.8813 l
0.5547 0.8812 l
0.5563 0.8810 l
0.5578 0.8808 l
0.5594 0.8806 l
0.5610 0.8804 l
0.5625 0.8802 l
0.5641 0.8800 l
0.5657 0.8798 l
0.5673 0.8795 l
0.5688 0.8793 l
0.5704 0.8791 l
0.5720 0.8789 l
0.5735 0.8786 l
0.5751 0.8784 l
0.5767 0.8782 l
0.5782 0.8779 l
0.5798 0.8777 l
0.5814 0.8775 l
0.5829 0.8772 l
0.5845 0.8770 l
0.5861 0.8768 l
0.5876 0.8765 l
0.5892 0.8763 l
0.5908 0.8761 l
0.5924 0.8758 l
0.5939 0.8756 l
0.5955 0.8754 l
0.5971 0.8751 l
0.5986 0.8749 l
0.6002 0.8747 l
0.6018 0.8745 l
0.6033 0.8742 l
0.6049 0.8740 l
0.6065 0.8738 l
0.6080 0.8736 l
0.6096 0.8734 l
0.6112 0.8732 l
0.6127 0.8729 l
0.6143 0.8727 l
0.6159 0.8725 l
0.6175 0.8723 l
0.6190 0.8721 l
0.6206 0.8719 l
0.6222 0.8717 l
0.6237 0.8715 l
0.6253 0.8713 l
0.6269 0.8711 l
0.6284 0.8709 l
0.6300 0.8707 l
0.6316 0.8705 l
0.6331 0.8703 l
0.6347 0.8701 l
0.6363 0.8699 l
0.6378 0.8697 l
0.6394 0.8695 l
0.6410 0.8693 l
0.6425 0.8692 l
0.6441 0.8690 l
0.6457 0.8688 l
0.6473 0.8686 l
0.6488 0.8684 l
0.6504 0.8683 l
0.6520 0.8681 l
0.6535 0.8679 l
0.6551 0.8677 l
0.6567 0.8676 l
0.6582 0.8674 l
0.6598 0.8672 l
0.6614 0.8671 l
0.6629 0.8669 l
0.6645 0.8667 l
0.6661 0.8666 l
0.6676 0.8664 l
0.6692 0.8662 l
0.6708 0.8661 l
0.6724 0.8659 l
0.6739 0.8658 l
0.6755 0.8656 l
0.6771 0.8655 l
0.6786 0.8653 l
0.6802 0.8652 l
0.6818 0.8650 l
0.6833 0.8649 l
0.6849 0.8647 l
0.6865 0.8646 l
0.6880 0.8644 l
0.6896 0.8643 l
0.6912 0.8642 l
0.6927 0.8640 l
0.6943 0.8639 l
0.6959 0.8637 l
0.6975 0.8636 l
0.6990 0.8635 l
0.7006 0.8633 l
0.7022 0.8632 l
0.7037 0.8631 l
0.7053 0.8629 l
0.7069 0.8628 l
0.7084 0.8627 l
0.7100 0.8626 l
0.7116 0.8624 l
0.7131 0.8623 l
0.7147 0.8622 l
0.7163 0.8621 l
0.7178 0.8620 l
0.7194 0.8618 l
0.7210 0.8617 l
0.7225 0.8616 l
0.7241 0.8615 l
0.7257 0.8614 l
0.7273 0.8612 l
0.7288 0.8611 l
0.7304 0.8610 l
0.7320 0.8608 l
0.7335 0.8607 l
0.7351 0.8606 l
0.7367 0.8604 l
0.7382 0.8603 l
0.7398 0.8602 l
0.7414 0.8600 l
0.7429 0.8599 l
0.7445 0.8597 l
0.7461 0.8596 l
0.7476 0.8595 l
0.7492 0.8593 l
0.7508 0.8592 l
0.7524 0.8591 l
0.7539 0.8589 l
0.7555 0.8588 l
0.7571 0.8587 l
0.7586 0.8585 l
0.7602 0.8584 l
0.7618 0.8582 l
0.7633 0.8581 l
0.7649 0.8580 l
0.7665 0.8578 l
0.7680 0.8577 l
0.7696 0.8576 l
0.7712 0.8574 l
0.7727 0.8573 l
0.7743 0.8572 l
0.7759 0.8570 l
0.7775 0.8569 l
0.7790 0.8568 l
0.7806 0.8567 l
0.7822 0.8565 l
0.7837 0.8564 l
0.7853 0.8563 l
0.7869 0.8561 l
0.7884 0.8560 l
0.7900 0.8559 l
0.7916 0.8558 l
0.7931 0.8556 l
0.7947 0.8555 l
0.7963 0.8554 l
0.7978 0.8553 l
0.7994 0.8551 l
0.8010 0.8550 l
0.8025 0.8549 l
0.8041 0.8548 l
0.8057 0.8547 l
0.8073 0.8545 l
0.8088 0.8544 l
0.8104 0.8543 l
0.8120 0.8542 l
0.8135 0.8541 l
0.8151 0.8540 l
0.8167 0.8538 l
0.8182 0.8537 l
0.8198 0.8537 l
0.8214 0.8526 l
0.8229 0.8517 l
0.8245 0.8510 l
0.8261 0.8505 l
0.8276 0.8500 l
0.8292 0.8495 l
0.8308 0.8491 l
0.8324 0.8488 l
0.8339 0.8484 l
0.8355 0.8481 l
0.8371 0.8477 l
0.8386 0.8474 l
0.8402 0.8471 l
0.8418 0.8468 l
0.8433 0.8466 l
0.8449 0.8463 l
0.8465 0.8460 l
0.8480 0.8458 l
0.8496 0.8455 l
0.8512 0.8452 l
0.8527 0.8450 l
0.8543 0.8448 l
0.8559 0.8445 l
0.8575 0.8443 l
0.8590 0.8441 l
0.8606 0.8438 l
0.8622 0.8436 l
0.8637 0.8434 l
0.8653 0.8432 l
0.8669 0.8430 l
0.8684 0.8428 l
0.8700 0.8426 l
0.8716 0.8424 l
0.8731 0.8422 l
0.8747 0.8420 l
0.8763 0.8418 l
0.8778 0.8416 l
0.8794 0.8414 l
0.8810 0.8412 l
0.8825 0.8410 l
0.8841 0.8408 l
0.8857 0.8407 l
0.8873 0.8405 l
0.8888 0.8403 l
0.8904 0.8401 l
0.8920 0.8400 l
0.8935 0.8398 l
0.8951 0.8396 l
0.8967 0.8395 l
0.8982 0.8393 l
0.8998 0.8391 l
0.9014 0.8390 l
0.9029 0.8388 l
0.9045 0.8387 l
0.9061 0.8385 l
0.9076 0.8383 l
0.9092 0.8382 l
0.9108 0.8380 l
0.9124 0.8379 l
0.9139 0.8377 l
0.9155 0.8376 l
0.9171 0.8374 l
0.9186 0.8373 l
0.9202 0.8371 l
0.9218 0.8370 l
0.9233 0.8369 l
0.9249 0.8367 l
0.9265 0.8365 l
0.9280 0.8364 l
0.9296 0.8362 l
0.9312 0.8360 l
0.9327 0.8358 l
0.9343 0.8356 l
0.9359 0.8354 l
0.9375 0.8352 l
0.9390 0.8350 l
0.9406 0.8348 l
0.9422 0.8346 l
0.9437 0.8343 l
0.9453 0.8341 l
0.9469 0.8339 l
0.9484 0.8337 l
0.9500 0.8335 l
s
[/DeviceRGB] SCS
Color4 SC
n
0.1500 0.7182 m
0.1516 0.7187 l
0.1531 0.7192 l
0.1547 0.7197 l
0.1563 0.7202 l
0.1578 0.7207 l
0.1594 0.7211 l
0.1610 0.7216 l
0.1625 0.7220 l
0.1641 0.7224 l
0.1657 0.7228 l
0.1673 0.7231 l
0.1688 0.7235 l
0.1704 0.7239 l
0.1720 0.7242 l
0.1735 0.7245 l
0.1751 0.7249 l
0.1767 0.7252 l
0.1782 0.7255 l
0.1798 0.7258 l
0.1814 0.7261 l
0.1829 0.7265 l
0.1845 0.7268 l
0.1861 0.7271 l
0.1876 0.7274 l
0.1892 0.7277 l
0.1908 0.7280 l
0.1924 0.7283 l
0.1939 0.7285 l
0.1955 0.7288 l
0.1971 0.7291 l
0.1986 0.7294 l
0.2002 0.7296 l
0.2018 0.7298 l
0.2033 0.7300 l
0.2049 0.7302 l
0.2065 0.7304 l
0.2080 0.7306 l
0.2096 0.7307 l
0.2112 0.7309 l
0.2127 0.7310 l
0.2143 0.7311 l
0.2159 0.7312 l
0.2175 0.7312 l
0.2190 0.7313 l
0.2206 0.7314 l
0.2222 0.7314 l
0.2237 0.7315 l
0.2253 0.7315 l
0.2269 0.7316 l
0.2284 0.7316 l
0.2300 0.7316 l
0.2316 0.7317 l
0.2331 0.7317 l
0.2347 0.7317 l
0.2363 0.7318 l
0.2378 0.7318 l
0.2394 0.7318 l
0.2410 0.7319 l
0.2425 0.7319 l
0.2441 0.7319 l
0.2457 0.7319 l
0.2473 0.7319 l
0.2488 0.7319 l
0.2504 0.7319 l
0.2520 0.7319 l
0.2535 0.7319 l
0.2551 0.7319 l
0.2567 0.7319 l
0.2582 0.7318 l
0.2598 0.7313 l
0.2614 0.7311 l
0.2629 0.7308 l
0.2645 0.7307 l
0.2661 0.7306 l
0.2676 0.7305 l
0.2692 0.7304 l
0.2708 0.7304 l
0.2724 0.7304 l
0.2739 0.7304 l
0.2755 0.7305 l
0.2771 0.7305 l
0.2786 0.7306 l
0.2802 0.7306 l
0.2818 0.7307 l
0.2833 0.7308 l
0.2849 0.7308 l
0.2865 0.7310 l
0.2880 0.7311 l
0.2896 0.7312 l
0.2912 0.7312 l
0.2927 0.7313 l
0.2943 0.7313 l
0.2959 0.7314 l
0.2975 0.7314 l
0.2990 0.7314 l
0.3006 0.7315 l
0.3022 0.7315 l
0.3037 0.7316 l
0.3053 0.7316 l
0.3069 0.7317 l
0.3084 0.7318 l
0.3100 0.7319 l
0.3116 0.7319 l
0.3131 0.7320 l
0.3147 0.7321 l
0.3163 0.7322 l
0.3178 0.7323 l
0.3194 0.7324 l
0.3210 0.7325 l
0.3225 0.7326 l
0.3241 0.7326 l
0.3257 0.7327 l
0.3273 0.7328 l
0.3288 0.7329 l
0.3304 0.7330 l
0.3320 0.7331 l
0.3335 0.7332 l
0.3351 0.7333 l
0.3367 0.7334 l
0.3382 0.7334 l
0.3398 0.7335 l
0.3414 0.7336 l
0.3429 0.7337 l
0.3445 0.7338 l
0.3461 0.7339 l
0.3476 0.7340 l
0.3492 0.7340 l
0.3508 0.7341 l
0.3524 0.7342 l
0.3539 0.7343 l
0.3555 0.7344 l
0.3571 0.7344 l
0.3586 0.7345 l
0.3602 0.7346 l
0.3618 0.7347 l
0.3633 0.7347 l
0.3649 0.7348 l
0.3665 0.7349 l
0.3680 0.7350 l
0.3696 0.7350 l
0.3712 0.7351 l
0.3727 0.7352 l
0.3743 0.7353 l
0.3759 0.7353 l
0.3775 0.7354 l
0.3790 0.7355 l
0.3806 0.7356 l
0.3822 0.7356 l
0.3837 0.7357 l
0.3853 0.7358 l
0.3869 0.7358 l
0.3884 0.7359 l
0.3900 0.7355 l
0.3916 0.7343 l
0.3931 0.7338 l
0.3947 0.7334 l
0.3963 0.7331 l
0.3978 0.7328 l
0.3994 0.7326 l
0.4010 0.7324 l
0.4025 0.7323 l
0.4041 0.7322 l
0.4057 0.7321 l
0.4073 0.7320 l
0.4088 0.7319 l
0.4104 0.7319 l
0.4120 0.7318 l
0.4135 0.7318 l
0.4151 0.7318 l
0.4167 0.7318 l
0.4182 0.7317 l
0.4198 0.7317 l
0.4214 0.7317 l
0.4229 0.7317 l
0.4245 0.7317 l
0.4261 0.7318 l
0.4276 0.7318 l
0.4292 0.7318 l
0.4308 0.7318 l
0.4324 0.7319 l
0.4339 0.7319 l
0.4355 0.7319 l
0.4371 0.7319 l
0.4386 0.7320 l
0.4402 0.7320 l
0.4418 0.7321 l
0.4433 0.7321 l
0.4449 0.7322 l
0.4465 0.7322 l
0.4480 0.7322 l
0.4496 0.7323 l
0.4512 0.7323 l
0.4527 0.7324 l
0.4543 0.7325 l
0.4559 0.7325 l
0.4575 0.7326 l
0.4590 0.7326 l
0.4606 0.7327 l
0.4622 0.7327 l
0.4637 0.7328 l
0.4653 0.7328 l
0.4669 0.7329 l
0.4684 0.7330 l
0.4700 0.7330 l
0.4716 0.7331 l
0.4731 0.7331 l
0.4747 0.7332 l
0.4763 0.7333 l
0.4778 0.7333 l
0.4794 0.7334 l
0.4810 0.7334 l
0.4825 0.7335 l
0.4841 0.7336 l
0.4857 0.7336 l
0.4873 0.7337 l
0.4888 0.7338 l
0.4904 0.7338 l
0.4920 0.7339 l
0.4935 0.7339 l
0.4951 0.7340 l
0.4967 0.7341 l
0.4982 0.7341 l
0.4998 0.7342 l
0.5014 0.7342 l
0.5029 0.7343 l
0.5045 0.7344 l
0.5061 0.7344 l
0.5076 0.7345 l
0.5092 0.7346 l
0.5108 0.7346 l
0.5124 0.7347 l
0.5139 0.7347 l
0.5155 0.7348 l
0.5171 0.7349 l
0.5186 0.7349 l
0.5202 0.7350 l
0.5218 0.7350 l
0.5233 0.7351 l
0.5249 0.7351 l
0.5265 0.7352 l
0.5280 0.7353 l
0.5296 0.7353 l
0.5312 0.7354 l
0.5327 0.7354 l
0.5343 0.7355 l
0.5359 0.7355 l
0.5375 0.7356 l
0.5390 0.7356 l
0.5406 0.7356 l
0.5422 0.7357 l
0.5437 0.7357 l
0.5453 0.7358 l
0.5469 0.7358 l
0.5484 0.7358 l
0.5502 0.7359 l
0.5516 0.7358 l
0.5531 0.7357 l
0.5547 0.7356 l
0.5563 0.7355 l
0.5578 0.7354 l
0.5594 0.7352 l
0.5610 0.7350 l
0.5625 0.7348 l
0.5641 0.7347 l
0.5657 0.7345 l
0.5673 0.7343 l
0.5688 0.7341 l
0.5704 0.7339 l
0.5720 0.7337 l
0.5735 0.7335 l
0.5751 0.7333 l
0.5767 0.7331 l
0.5782 0.7329 l
0.5798 0.7327 l
0.5814 0.7325 l
0.5829 0.7323 l
0.5845 0.7321 l
0.5861 0.7319 l
0.5876 0.7317 l
0.5892 0.7315 l
0.5908 0.7313 l
0.5924 0.7311 l
0.5939 0.7310 l
0.5955 0.7308 l
0.5971 0.7306 l
0.5986 0.7304 l
0.6002 0.7302 l
0.6018 0.7300 l
0.6033 0.7298 l
0.6049 0.7296 l
0.6065 0.7294 l
0.6080 0.7292 l
0.6096 0.7290 l
0.6112 0.7289 l
0.6127 0.7287 l
0.6143 0.7285 l
0.6159 0.7283 l
0.6175 0.7281 l
0.6190 0.7280 l
0.6206 0.7278 l
0.6222 0.7276 l
0.6237 0.7274 l
0.6253 0.7273 l
0.6269 0.7271 l
0.6284 0.7269 l
0.6300 0.7268 l
0.6316 0.7266 l
0.6331 0.7264 l
0.6347 0.7263 l
0.6363 0.7261 l
0.6378 0.7260 l
0.6394 0.7258 l
0.6410 0.7256 l
0.6425 0.7255 l
0.6441 0.7253 l
0.6457 0.7252 l
0.6473 0.7250 l
0.6488 0.7249 l
0.6504 0.7247 l
0.6520 0.7246 l
0.6535 0.7245 l
0.6551 0.7243 l
0.6567 0.7242 l
0.6582 0.7240 l
0.6598 0.7239 l
0.6614 0.7238 l
0.6629 0.7236 l
0.6645 0.7235 l
0.6661 0.7233 l
0.6676 0.7232 l
0.6692 0.7231 l
0.6708 0.7230 l
0.6724 0.7228 l
0.6739 0.7227 l
0.6755 0.7226 l
0.6771 0.7225 l
0.6786 0.7223 l
0.6802 0.7222 l
0.6818 0.7221 l
0.6833 0.7220 l
0.6849 0.7219 l
0.6865 0.7217 l
0.6880 0.7216 l
0.6896 0.7215 l
0.6912 0.7214 l
0.6927 0.7213 l
0.6943 0.7212 l
0.6959 0.7211 l
0.6975 0.7209 l
0.6990 0.7208 l
0.7006 0.7207 l
0.7022 0.7206 l
0.7037 0.7205 l
0.7053 0.7204 l
0.7069 0.7203 l
0.7084 0.7202 l
0.7100 0.7201 l
0.7116 0.7200 l
0.7131 0.7199 l
0.7147 0.7198 l
0.7163 0.7197 l
0.7178 0.7196 l
0.7194 0.7195 l
0.7210 0.7194 l
0.7225 0.7193 l
0.7241 0.7192 l
0.7257 0.7192 l
0.7273 0.7190 l
0.7288 0.7189 l
0.7304 0.7188 l
0.7320 0.7187 l
0.7335 0.7186 l
0.7351 0.7185 l
0.7367 0.7184 l
0.7382 0.7183 l
0.7398 0.7182 l
0.7414 0.7181 l
0.7429 0.7180 l
0.7445 0.7178 l
0.7461 0.7177 l
0.7476 0.7176 l
0.7492 0.7175 l
0.7508 0.7174 l
0.7524 0.7173 l
0.7539 0.7172 l
0.7555 0.7171 l
0.7571 0.7169 l
0.7586 0.7168 l
0.7602 0.7167 l
0.7618 0.7166 l
0.7633 0.7165 l
0.7649 0.7164 l
0.7665 0.7163 l
0.7680 0.7162 l
0.7696 0.7160 l
0.7712 0.7159 l
0.7727 0.7158 l
0.7743 0.7157 l
0.7759 0.7156 l
0.7775 0.7155 l
0.7790 0.7154 l
0.7806 0.7153 l
0.7822 0.7152 l
0.7837 0.7151 l
0.7853 0.7150 l
0.7869 0.7149 l
0.7884 0.7147 l
0.7900 0.7146 l
0.7916 0.7145 l
0.7931 0.7144 l
0.7947 0.7143 l
0.7963 0.7142 l
0.7978 0.7141 l
0.7994 0.7140 l
0.8010 0.7139 l
0.8025 0.7138 l
0.8041 0.7137 l
0.8057 0.7136 l
0.8073 0.7135 l
0.8088 0.7134 l
0.8104 0.7133 l
0.8120 0.7132 l
0.8135 0.7131 l
0.8151 0.7129 l
0.8167 0.7128 l
0.8182 0.7127 l
0.8198 0.7125 l
0.8214 0.7119 l
0.8229 0.7109 l
0.8245 0.7103 l
0.8261 0.7098 l
0.8276 0.7093 l
0.8292 0.7089 l
0.8308 0.7085 l
0.8324 0.7082 l
0.8339 0.7078 l
0.8355 0.7075 l
0.8371 0.7072 l
0.8386 0.7069 l
0.8402 0.7067 l
0.8418 0.7064 l
0.8433 0.7061 l
0.8449 0.7059 l
0.8465 0.7056 l
0.8480 0.7054 l
0.8496 0.7051 l
0.8512 0.7049 l
0.8527 0.7047 l
0.8543 0.7044 l
0.8559 0.7042 l
0.8575 0.7040 l
0.8590 0.7038 l
0.8606 0.7036 l
0.8622 0.7034 l
0.8637 0.7032 l
0.8653 0.7030 l
0.8669 0.7028 l
0.8684 0.7026 l
0.8700 0.7024 l
0.8716 0.7023 l
0.8731 0.7021 l
0.8747 0.7019 l
0.8763 0.7017 l
0.8778 0.7015 l
0.8794 0.7014 l
0.8810 0.7012 l
0.8825 0.7010 l
0.8841 0.7009 l
0.8857 0.7007 l
0.8873 0.7006 l
0.8888 0.7004 l
0.8904 0.7002 l
0.8920 0.7001 l
0.8935 0.6999 l
0.8951 0.6998 l
0.8967 0.6996 l
0.8982 0.6995 l
0.8998 0.6993 l
0.9014 0.6992 l
0.9029 0.6990 l
0.9045 0.6989 l
0.9061 0.6987 l
0.9076 0.6986 l
0.9092 0.6985 l
0.9108 0.6983 l
0.9124 0.6982 l
0.9139 0.6981 l
0.9155 0.6979 l
0.9171 0.6978 l
0.9186 0.6976 l
0.9202 0.6975 l
0.9218 0.6974 l
0.9233 0.6972 l
0.9249 0.6971 l
0.9265 0.6969 l
0.9280 0.6968 l
0.9296 0.6966 l
0.9312 0.6964 l
0.9327 0.6963 l
0.9343 0.6961 l
0.9359 0.6959 l
0.9375 0.6957 l
0.9390 0.6955 l
0.9406 0.6953 l
0.9422 0.6951 l
0.9437 0.6949 l
0.9453 0.6947 l
0.9469 0.6945 l
0.9484 0.6943 l
0.9500 0.6941 l
s
[/DeviceRGB] SCS
Color5 SC
n
0.1500 0.2587 m
0.1516 0.2592 l
0.1531 0.2597 l
0.1547 0.2602 l
0.1563 0.2606 l
0.1578 0.2611 l
0.1594 0.2615 l
0.1610 0.2619 l
0.1625 0.2623 l
0.1641 0.2627 l
0.1657 0.2631 l
0.1673 0.2635 l
0.1688 0.2638 l
0.1704 0.2642 l
0.1720 0.2645 l
0.1735 0.2648 l
0.1751 0.2651 l
0.1767 0.2654 l
0.1782 0.2657 l
0.1798 0.2660 l
0.1814 0.2663 l
0.1829 0.2666 l
0.1845 0.2669 l
0.1861 0.2672 l
0.1876 0.2675 l
0.1892 0.2678 l
0.1908 0.2681 l
0.1924 0.2684 l
0.1939 0.2687 l
0.1955 0.2689 l
0.1971 0.2692 l
0.1986 0.2694 l
0.2002 0.2697 l
0.2018 0.2699 l
0.2033 0.2701 l
0.2049 0.2703 l
0.2065 0.2705 l
0.2080 0.2706 l
0.2096 0.2708 l
0.2112 0.2709 l
0.2127 0.2710 l
0.2143 0.2711 l
0.2159 0.2712 l
0.2175 0.2713 l
0.2190 0.2713 l
0.2206 0.2714 l
0.2222 0.2714 l
0.2237 0.2715 l
0.2253 0.2715 l
0.2269 0.2715 l
0.2284 0.2716 l
0.2300 0.2716 l
0.2316 0.2716 l
0.2331 0.2717 l
0.2347 0.2717 l
0.2363 0.2717 l
0.2378 0.2718 l
0.2394 0.2718 l
0.2410 0.2718 l
0.2425 0.2718 l
0.2441 0.2719 l
0.2457 0.2719 l
0.2473 0.2719 l
0.2488 0.2719 l
0.2504 0.2719 l
0.2520 0.2719 l
0.2535 0.2719 l
0.2551 0.2719 l
0.2567 0.2718 l
0.2582 0.2718 l
0.2598 0.2713 l
0.2614 0.2710 l
0.2629 0.2708 l
0.2645 0.2706 l
0.2661 0.2705 l
0.2676 0.2704 l
0.2692 0.2704 l
0.2708 0.2704 l
0.2724 0.2704 l
0.2739 0.2704 l
0.2755 0.2704 l
0.2771 0.2705 l
0.2786 0.2705 l
0.2802 0.2706 l
0.2818 0.2706 l
0.2833 0.2707 l
0.2849 0.2707 l
0.2865 0.2709 l
0.2880 0.2710 l
0.2896 0.2711 l
0.2912 0.2711 l
0.2927 0.2712 l
0.2943 0.2712 l
0.2959 0.2713 l
0.2975 0.2713 l
0.2990 0.2714 l
0.3006 0.2714 l
0.3022 0.2715 l
0.3037 0.2715 l
0.3053 0.2716 l
0.3069 0.2716 l
0.3084 0.2717 l
0.3100 0.2718 l
0.3116 0.2719 l
0.3131 0.2719 l
0.3147 0.2720 l
0.3163 0.2721 l
0.3178 0.2722 l
0.3194 0.2723 l
0.3210 0.2724 l
0.3225 0.2725 l
0.3241 0.2726 l
0.3257 0.2726 l
0.3273 0.2727 l
0.3288 0.2728 l
0.3304 0.2729 l
0.3320 0.2730 l
0.3335 0.2731 l
0.3351 0.2732 l
0.3367 0.2733 l
0.3382 0.2734 l
0.3398 0.2734 l
0.3414 0.2735 l
0.3429 0.2736 l
0.3445 0.2737 l
0.3461 0.2738 l
0.3476 0.2739 l
0.3492 0.2739 l
0.3508 0.2740 l
0.3524 0.2741 l
0.3539 0.2742 l
0.3555 0.2743 l
0.3571 0.2743 l
0.3586 0.2744 l
0.3602 0.2745 l
0.3618 0.2746 l
0.3633 0.2746 l
0.3649 0.2747 l
0.3665 0.2748 l
0.3680 0.2749 l
0.3696 0.2749 l
0.3712 0.2750 l
0.3727 0.2751 l
0.3743 0.2752 l
0.3759 0.2752 l
0.3775 0.2753 l
0.3790 0.2754 l
0.3806 0.2755 l
0.3822 0.2755 l
0.3837 0.2756 l
0.3853 0.2757 l
0.3869 0.2757 l
0.3884 0.2758 l
0.3900 0.2754 l
0.3916 0.2742 l
0.3931 0.2736 l
0.3947 0.2733 l
0.3963 0.2730 l
0.3978 0.2727 l
0.3994 0.2725 l
0.4010 0.2723 l
0.4025 0.2722 l
0.4041 0.2721 l
0.4057 0.2720 l
0.4073 0.2719 l
0.4088 0.2718 l
0.4104 0.2718 l
0.4120 0.2717 l
0.4135 0.2717 l
0.4151 0.2717 l
0.4167 0.2717 l
0.4182 0.2716 l
0.4198 0.2716 l
0.4214 0.2716 l
0.4229 0.2716 l
0.4245 0.2716 l
0.4261 0.2717 l
0.4276 0.2717 l
0.4292 0.2717 l
0.4308 0.2717 l
0.4324 0.2717 l
0.4339 0.2718 l
0.4355 0.2718 l
0.4371 0.2718 l
0.4386 0.2719 l
0.4402 0.2719 l
0.4418 0.2720 l
0.4433 0.2720 l
0.4449 0.2721 l
0.4465 0.2721 l
0.4480 0.2721 l
0.4496 0.2722 l
0.4512 0.2722 l
0.4527 0.2723 l
0.4543 0.2723 l
0.4559 0.2724 l
0.4575 0.2725 l
0.4590 0.2725 l
0.4606 0.2726 l
0.4622 0.2726 l
0.4637 0.2727 l
0.4653 0.2727 l
0.4669 0.2728 l
0.4684 0.2729 l
0.4700 0.2729 l
0.4716 0.2730 l
0.4731 0.2730 l
0.4747 0.2731 l
0.4763 0.2732 l
0.4778 0.2732 l
0.4794 0.2733 l
0.4810 0.2733 l
0.4825 0.2734 l
0.4841 0.2735 l
0.4857 0.2735 l
0.4873 0.2736 l
0.4888 0.2736 l
0.4904 0.2737 l
0.4920 0.2738 l
0.4935 0.2738 l
0.4951 0.2739 l
0.4967 0.2740 l
0.4982 0.2740 l
0.4998 0.2741 l
0.5014 0.2741 l
0.5029 0.2742 l
0.5045 0.2743 l
0.5061 0.2743 l
0.5076 0.2744 l
0.5092 0.2745 l
0.5108 0.2745 l
0.5124 0.2746 l
0.5139 0.2746 l
0.5155 0.2747 l
0.5171 0.2748 l
0.5186 0.2748 l
0.5202 0.2749 l
0.5218 0.2749 l
0.5233 0.2750 l
0.5249 0.2750 l
0.5265 0.2751 l
0.5280 0.2752 l
0.5296 0.2752 l
0.5312 0.2753 l
0.5327 0.2753 l
0.5343 0.2754 l
0.5359 0.2754 l
0.5375 0.2755 l
0.5390 0.2755 l
0.5406 0.2755 l
0.5422 0.2756 l
0.5437 0.2756 l
0.5453 0.2757 l
0.5469 0.2757 l
0.5484 0.2757 l
0.5502 0.2758 l
0.5516 0.2757 l
0.5531 0.2757 l
0.5547 0.2755 l
0.5563 0.2754 l
0.5578 0.2753 l
0.5594 0.2751 l
0.5610 0.2749 l
0.5625 0.2748 l
0.5641 0.2746 l
0.5657 0.2744 l
0.5673 0.2742 l
0.5688 0.2740 l
0.5704 0.2738 l
0.5720 0.2736 l
0.5735 0.2734 l
0.5751 0.2732 l
0.5767 0.2730 l
0.5782 0.2728 l
0.5798 0.2726 l
0.5814 0.2724 l
0.5829 0.2722 l
0.5845 0.2720 l
0.5861 0.2718 l
0.5876 0.2716 l
0.5892 0.2715 l
0.5908 0.2713 l
0.5924 0.2711 l
0.5939 0.2709 l
0.5955 0.2707 l
0.5971 0.2705 l
0.5986 0.2703 l
0.6002 0.2701 l
0.6018 0.2699 l
0.6033 0.2697 l
0.6049 0.2695 l
0.6065 0.2693 l
0.6080 0.2691 l
0.6096 0.2690 l
0.6112 0.2688 l
0.6127 0.2686 l
0.6143 0.2684 l
0.6159 0.2682 l
0.6175 0.2681 l
0.6190 0.2679 l
0.6206 0.2677 l
0.6222 0.2675 l
0.6237 0.2674 l
0.6253 0.2672 l
0.6269 0.2670 l
0.6284 0.2669 l
0.6300 0.2667 l
0.6316 0.2665 l
0.6331 0.2664 l
0.6347 0.2662 l
0.6363 0.2660 l
0.6378 0.2659 l
0.6394 0.2657 l
0.6410 0.2656 l
0.6425 0.2654 l
0.6441 0.2653 l
0.6457 0.2651 l
0.6473 0.2650 l
0.6488 0.2648 l
0.6504 0.2647 l
0.6520 0.2645 l
0.6535 0.2644 l
0.6551 0.2642 l
0.6567 0.2641 l
0.6582 0.2639 l
0.6598 0.2638 l
0.6614 0.2637 l
0.6629 0.2635 l
0.6645 0.2634 l
0.6661 0.2633 l
0.6676 0.2631 l
0.6692 0.2630 l
0.6708 0.2629 l
0.6724 0.2628 l
0.6739 0.2626 l
0.6755 0.2625 l
0.6771 0.2624 l
0.6786 0.2623 l
0.6802 0.2621 l
0.6818 0.2620 l
0.6833 0.2619 l
0.6849 0.2618 l
0.6865 0.2617 l
0.6880 0.2615 l
0.6896 0.2614 l
0.6912 0.2613 l
0.6927 0.2612 l
0.6943 0.2611 l
0.6959 0.2610 l
0.6975 0.2609 l
0.6990 0.2608 l
0.7006 0.2607 l
0.7022 0.2606 l
0.7037 0.2605 l
0.7053 0.2603 l
0.7069 0.2602 l
0.7084 0.2601 l
0.7100 0.2600 l
0.7116 0.2599 l
0.7131 0.2598 l
0.7147 0.2598 l
0.7163 0.2597 l
0.7178 0.2596 l
0.7194 0.2595 l
0.7210 0.2594 l
0.7225 0.2593 l
0.7241 0.2592 l
0.7257 0.2591 l
0.7273 0.2590 l
0.7288 0.2589 l
0.7304 0.2588 l
0.7320 0.2587 l
0.7335 0.2586 l
0.7351 0.2585 l
0.7367 0.2583 l
0.7382 0.2582 l
0.7398 0.2581 l
0.7414 0.2580 l
0.7429 0.2579 l
0.7445 0.2578 l
0.7461 0.2577 l
0.7476 0.2576 l
0.7492 0.2574 l
0.7508 0.2573 l
0.7524 0.2572 l
0.7539 0.2571 l
0.7555 0.2570 l
0.7571 0.2569 l
0.7586 0.2568 l
0.7602 0.2567 l
0.7618 0.2566 l
0.7633 0.2564 l
0.7649 0.2563 l
0.7665 0.2562 l
0.7680 0.2561 l
0.7696 0.2560 l
0.7712 0.2559 l
0.7727 0.2558 l
0.7743 0.2557 l
0.7759 0.2556 l
0.7775 0.2555 l
0.7790 0.2553 l
0.7806 0.2552 l
0.7822 0.2551 l
0.7837 0.2550 l
0.7853 0.2549 l
0.7869 0.2548 l
0.7884 0.2547 l
0.7900 0.2546 l
0.7916 0.2545 l
0.7931 0.2544 l
0.7947 0.2543 l
0.7963 0.2542 l
0.7978 0.2541 l
0.7994 0.2540 l
0.8010 0.2539 l
0.8025 0.2538 l
0.8041 0.2537 l
0.8057 0.2536 l
0.8073 0.2534 l
0.8088 0.2533 l
0.8104 0.2532 l
0.8120 0.2531 l
0.8135 0.2530 l
0.8151 0.2529 l
0.8167 0.2528 l
0.8182 0.2526 l
0.8198 0.2524 l
0.8214 0.2519 l
0.8229 0.2509 l
0.8245 0.2503 l
0.8261 0.2498 l
0.8276 0.2493 l
0.8292 0.2489 l
0.8308 0.2485 l
0.8324 0.2482 l
0.8339 0.2478 l
0.8355 0.2475 l
0.8371 0.2472 l
0.8386 0.2469 l
0.8402 0.2466 l
0.8418 0.2464 l
0.8433 0.2461 l
0.8449 0.2458 l
0.8465 0.2456 l
0.8480 0.2453 l
0.8496 0.2451 l
0.8512 0.2449 l
0.8527 0.2447 l
0.8543 0.2444 l
0.8559 0.2442 l
0.8575 0.2440 l
0.8590 0.2438 l
0.8606 0.2436 l
0.8622 0.2434 l
0.8637 0.2432 l
0.8653 0.2430 l
0.8669 0.2428 l
0.8684 0.2426 l
0.8700 0.2424 l
0.8716 0.2422 l
0.8731 0.2421 l
0.8747 0.2419 l
0.8763 0.2417 l
0.8778 0.2415 l
0.8794 0.2414 l
0.8810 0.2412 l
0.8825 0.2410 l
0.8841 0.2409 l
0.8857 0.2407 l
0.8873 0.2405 l
0.8888 0.2404 l
0.8904 0.2402 l
0.8920 0.2401 l
0.8935 0.2399 l
0.8951 0.2398 l
0.8967 0.2396 l
0.8982 0.2395 l
0.8998 0.2393 l
0.9014 0.2392 l
0.9029 0.2390 l
0.9045 0.2389 l
0.9061 0.2387 l
0.9076 0.2386 l
0.9092 0.2385 l
0.9108 0.2383 l
0.9124 0.2382 l
0.9139 0.2381 l
0.9155 0.2379 l
0.9171 0.2378 l
0.9186 0.2377 l
0.9202 0.2375 l
0.9218 0.2374 l
0.9233 0.2372 l
0.9249 0.2371 l
0.9265 0.2370 l
0.9280 0.2368 l
0.9296 0.2366 l
0.9312 0.2365 l
0.9327 0.2363 l
0.9343 0.2361 l
0.9359 0.2359 l
0.9375 0.2357 l
0.9390 0.2355 l
0.9406 0.2353 l
0.9422 0.2351 l
0.9437 0.2349 l
0.9453 0.2347 l
0.9469 0.2345 l
0.9484 0.2343 l
0.9500 0.2341 l
s
[/DeviceRGB] SCS
Color6 SC
n
0.1500 0.6992 m
0.1516 0.6950 l
0.1531 0.6906 l
0.1547 0.6862 l
0.1563 0.6817 l
0.1578 0.6771 l
0.1594 0.6723 l
0.1610 0.6675 l
0.1625 0.6626 l
0.1641 0.6576 l
0.1657 0.6524 l
0.1673 0.6472 l
0.1688 0.6418 l
0.1704 0.6364 l
0.1720 0.6309 l
0.1735 0.6252 l
0.1751 0.6195 l
0.1767 0.6136 l
0.1782 0.6077 l
0.1798 0.6017 l
0.1814 0.5956 l
0.1829 0.5894 l
0.1845 0.5832 l
0.1861 0.5769 l
0.1876 0.5706 l
0.1892 0.5642 l
0.1908 0.5579 l
0.1924 0.5515 l
0.1939 0.5452 l
0.1955 0.5389 l
0.1971 0.5326 l
0.1986 0.5265 l
0.2002 0.5205 l
0.2018 0.5146 l
0.2033 0.5089 l
0.2049 0.5034 l
0.2065 0.4981 l
0.2080 0.4930 l
0.2096 0.4882 l
0.2112 0.4837 l
0.2127 0.4795 l
0.2143 0.4757 l
0.2159 0.4721 l
0.2175 0.4689 l
0.2190 0.4661 l
0.2206 0.4636 l
0.2222 0.4615 l
0.2237 0.4598 l
0.2253 0.4585 l
0.2269 0.4576 l
0.2284 0.4571 l
0.2300 0.4570 l
0.2316 0.4574 l
0.2331 0.4581 l
0.2347 0.4593 l
0.2363 0.4609 l
0.2378 0.4630 l
0.2394 0.4656 l
0.2410 0.4686 l
0.2425 0.4720 l
0.2441 0.4760 l
0.2457 0.4805 l
0.2473 0.4854 l
0.2488 0.4909 l
0.2504 0.4969 l
0.2520 0.5035 l
0.2535 0.5106 l
0.2551 0.5182 l
0.2567 0.5264 l
0.2582 0.5353 l
0.2598 0.5743 l
0.2614 0.5902 l
0.2629 0.6012 l
0.2645 0.6089 l
0.2661 0.6144 l
0.2676 0.6184 l
0.2692 0.6212 l
0.2708 0.6233 l
0.2724 0.6247 l
0.2739 0.6256 l
0.2755 0.6261 l
0.2771 0.6263 l
0.2786 0.6262 l
0.2802 0.6260 l
0.2818 0.6255 l
0.2833 0.6249 l
0.2849 0.6241 l
0.2865 0.6233 l
0.2880 0.6225 l
0.2896 0.6217 l
0.2912 0.6208 l
0.2927 0.6198 l
0.2943 0.6188 l
0.2959 0.6177 l
0.2975 0.6166 l
0.2990 0.6155 l
0.3006 0.6144 l
0.3022 0.6132 l
0.3037 0.6121 l
0.3053 0.6109 l
0.3069 0.6098 l
0.3084 0.6086 l
0.3100 0.6074 l
0.3116 0.6063 l
0.3131 0.6051 l
0.3147 0.6040 l
0.3163 0.6028 l
0.3178 0.6017 l
0.3194 0.6006 l
0.3210 0.5994 l
0.3225 0.5983 l
0.3241 0.5971 l
0.3257 0.5960 l
0.3273 0.5949 l
0.3288 0.5938 l
0.3304 0.5926 l
0.3320 0.5915 l
0.3335 0.5904 l
0.3351 0.5893 l
0.3367 0.5882 l
0.3382 0.5871 l
0.3398 0.5860 l
0.3414 0.5849 l
0.3429 0.5839 l
0.3445 0.5828 l
0.3461 0.5817 l
0.3476 0.5806 l
0.3492 0.5796 l
0.3508 0.5785 l
0.3524 0.5775 l
0.3539 0.5764 l
0.3555 0.5753 l
0.3571 0.5743 l
0.3586 0.5733 l
0.3602 0.5722 l
0.3618 0.5712 l
0.3633 0.5702 l
0.3649 0.5691 l
0.3665 0.5681 l
0.3680 0.5671 l
0.3696 0.5661 l
0.3712 0.5650 l
0.3727 0.5640 l
0.3743 0.5630 l
0.3759 0.5620 l
0.3775 0.5610 l
0.3790 0.5600 l
0.3806 0.5590 l
0.3822 0.5580 l
0.3837 0.5570 l
0.3853 0.5560 l
0.3869 0.5550 l
0.3884 0.5540 l
0.3900 0.5526 l
0.3916 0.5503 l
0.3931 0.5487 l
0.3947 0.5473 l
0.3963 0.5459 l
0.3978 0.5446 l
0.3994 0.5434 l
0.4010 0.5422 l
0.4025 0.5410 l
0.4041 0.5398 l
0.4057 0.5387 l
0.4073 0.5376 l
0.4088 0.5365 l
0.4104 0.5354 l
0.4120 0.5343 l
0.4135 0.5332 l
0.4151 0.5322 l
0.4167 0.5311 l
0.4182 0.5301 l
0.4198 0.5290 l
0.4214 0.5280 l
0.4229 0.5270 l
0.4245 0.5260 l
0.4261 0.5249 l
0.4276 0.5239 l
0.4292 0.5229 l
0.4308 0.5219 l
0.4324 0.5209 l
0.4339 0.5199 l
0.4355 0.5189 l
0.4371 0.5179 l
0.4386 0.5169 l
0.4402 0.5159 l
0.4418 0.5149 l
0.4433 0.5139 l
0.4449 0.5130 l
0.4465 0.5120 l
0.4480 0.5110 l
0.4496 0.5100 l
0.4512 0.5090 l
0.4527 0.5080 l
0.4543 0.5070 l
0.4559 0.5060 l
0.4575 0.5050 l
0.4590 0.5040 l
0.4606 0.5030 l
0.4622 0.5021 l
0.4637 0.5011 l
0.4653 0.5001 l
0.4669 0.4991 l
0.4684 0.4981 l
0.4700 0.4971 l
0.4716 0.4961 l
0.4731 0.4950 l
0.4747 0.4940 l
0.4763 0.4930 l
0.4778 0.4920 l
0.4794 0.4910 l
0.4810 0.4900 l
0.4825 0.4889 l
0.4841 0.4879 l
0.4857 0.4869 l
0.4873 0.4859 l
0.4888 0.4848 l
0.4904 0.4838 l
0.4920 0.4827 l
0.4935 0.4817 l
0.4951 0.4806 l
0.4967 0.4796 l
0.4982 0.4785 l
0.4998 0.4774 l
0.5014 0.4763 l
0.5029 0.4753 l
0.5045 0.4742 l
0.5061 0.4731 l
0.5076 0.4720 l
0.5092 0.4709 l
0.5108 0.4698 l
0.5124 0.4686 l
0.5139 0.4675 l
0.5155 0.4664 l
0.5171 0.4652 l
0.5186 0.4641 l
0.5202 0.4629 l
0.5218 0.4617 l
0.5233 0.4605 l
0.5249 0.4593 l
0.5265 0.4581 l
0.5280 0.4568 l
0.5296 0.4556 l
0.5312 0.4543 l
0.5327 0.4530 l
0.5343 0.4516 l
0.5359 0.4503 l
0.5375 0.4490 l
0.5390 0.4476 l
0.5406 0.4463 l
0.5422 0.4449 l
0.5437 0.4436 l
0.5453 0.4422 l
0.5469 0.4408 l
0.5484 0.4394 l
0.5502 0.4379 l
0.5516 0.4366 l
0.5531 0.4351 l
0.5547 0.4336 l
0.5563 0.4320 l
0.5578 0.4304 l
0.5594 0.4288 l
0.5610 0.4272 l
0.5625 0.4256 l
0.5641 0.4239 l
0.5657 0.4223 l
0.5673 0.4207 l
0.5688 0.4190 l
0.5704 0.4174 l
0.5720 0.4157 l
0.5735 0.4140 l
0.5751 0.4123 l
0.5767 0.4106 l
0.5782 0.4090 l
0.5798 0.4073 l
0.5814 0.4056 l
0.5829 0.4038 l
0.5845 0.4021 l
0.5861 0.4004 l
0.5876 0.3987 l
0.5892 0.3970 l
0.5908 0.3952 l
0.5924 0.3935 l
0.5939 0.3917 l
0.5955 0.3900 l
0.5971 0.3882 l
0.5986 0.3865 l
0.6002 0.3847 l
0.6018 0.3829 l
0.6033 0.3811 l
0.6049 0.3794 l
0.6065 0.3776 l
0.6080 0.3758 l
0.6096 0.3740 l
0.6112 0.3721 l
0.6127 0.3703 l
0.6143 0.3685 l
0.6159 0.3667 l
0.6175 0.3648 l
0.6190 0.3630 l
0.6206 0.3612 l
0.6222 0.3593 l
0.6237 0.3574 l
0.6253 0.3556 l
0.6269 0.3537 l
0.6284 0.3518 l
0.6300 0.3499 l
0.6316 0.3480 l
0.6331 0.3461 l
0.6347 0.3442 l
0.6363 0.3423 l
0.6378 0.3403 l
0.6394 0.3384 l
0.6410 0.3365 l
0.6425 0.3345 l
0.6441 0.3326 l
0.6457 0.3306 l
0.6473 0.3286 l
0.6488 0.3266 l
0.6504 0.3246 l
0.6520 0.3226 l
0.6535 0.3206 l
0.6551 0.3186 l
0.6567 0.3166 l
0.6582 0.3146 l
0.6598 0.3125 l
0.6614 0.3105 l
0.6629 0.3084 l
0.6645 0.3064 l
0.6661 0.3043 l
0.6676 0.3022 l
0.6692 0.3001 l
0.6708 0.2981 l
0.6724 0.2960 l
0.6739 0.2939 l
0.6755 0.2917 l
0.6771 0.2896 l
0.6786 0.2875 l
0.6802 0.2854 l
0.6818 0.2832 l
0.6833 0.2811 l
0.6849 0.2790 l
0.6865 0.2768 l
0.6880 0.2747 l
0.6896 0.2725 l
0.6912 0.2704 l
0.6927 0.2682 l
0.6943 0.2661 l
0.6959 0.2639 l
0.6975 0.2618 l
0.6990 0.2596 l
0.7006 0.2575 l
0.7022 0.2553 l
0.7037 0.2532 l
0.7053 0.2511 l
0.7069 0.2490 l
0.7084 0.2469 l
0.7100 0.2448 l
0.7116 0.2427 l
0.7131 0.2406 l
0.7147 0.2386 l
0.7163 0.2366 l
0.7178 0.2346 l
0.7194 0.2326 l
0.7210 0.2307 l
0.7225 0.2287 l
0.7241 0.2269 l
0.7257 0.2250 l
0.7273 0.2232 l
0.7288 0.2214 l
0.7304 0.2196 l
0.7320 0.2179 l
0.7335 0.2162 l
0.7351 0.2146 l
0.7367 0.2130 l
0.7382 0.2115 l
0.7398 0.2100 l
0.7414 0.2086 l
0.7429 0.2072 l
0.7445 0.2059 l
0.7461 0.2047 l
0.7476 0.2035 l
0.7492 0.2024 l
0.7508 0.2014 l
0.7524 0.2005 l
0.7539 0.1996 l
0.7555 0.1988 l
0.7571 0.1981 l
0.7586 0.1975 l
0.7602 0.1970 l
0.7618 0.1966 l
0.7633 0.1962 l
0.7649 0.1960 l
0.7665 0.1958 l
0.7680 0.1958 l
0.7696 0.1958 l
0.7712 0.1959 l
0.7727 0.1962 l
0.7743 0.1965 l
0.7759 0.1969 l
0.7775 0.1973 l
0.7790 0.1979 l
0.7806 0.1986 l
0.7822 0.1993 l
0.7837 0.2001 l
0.7853 0.2010 l
0.7869 0.2020 l
0.7884 0.2031 l
0.7900 0.2042 l
0.7916 0.2054 l
0.7931 0.2066 l
0.7947 0.2079 l
0.7963 0.2093 l
0.7978 0.2107 l
0.7994 0.2122 l
0.8010 0.2137 l
0.8025 0.2153 l
0.8041 0.2169 l
0.8057 0.2186 l
0.8073 0.2203 l
0.8088 0.2220 l
0.8104 0.2238 l
0.8120 0.2256 l
0.8135 0.2275 l
0.8151 0.2294 l
0.8167 0.2313 l
0.8182 0.2333 l
0.8198 0.2352 l
0.8214 0.2391 l
0.8229 0.2409 l
0.8245 0.2428 l
0.8261 0.2447 l
0.8276 0.2466 l
0.8292 0.2484 l
0.8308 0.2503 l
0.8324 0.2521 l
0.8339 0.2539 l
0.8355 0.2557 l
0.8371 0.2575 l
0.8386 0.2593 l
0.8402 0.2610 l
0.8418 0.2628 l
0.8433 0.2646 l
0.8449 0.2663 l
0.8465 0.2680 l
0.8480 0.2698 l
0.8496 0.2715 l
0.8512 0.2732 l
0.8527 0.2749 l
0.8543 0.2766 l
0.8559 0.2783 l
0.8575 0.2799 l
0.8590 0.2816 l
0.8606 0.2832 l
0.8622 0.2849 l
0.8637 0.2865 l
0.8653 0.2881 l
0.8669 0.2898 l
0.8684 0.2914 l
0.8700 0.2930 l
0.8716 0.2946 l
0.8731 0.2961 l
0.8747 0.2977 l
0.8763 0.2993 l
0.8778 0.3008 l
0.8794 0.3024 l
0.8810 0.3039 l
0.8825 0.3055 l
0.8841 0.3070 l
0.8857 0.3085 l
0.8873 0.3100 l
0.8888 0.3115 l
0.8904 0.3130 l
0.8920 0.3145 l
0.8935 0.3160 l
0.8951 0.3175 l
0.8967 0.3189 l
0.8982 0.3204 l
0.8998 0.3219 l
0.9014 0.3233 l
0.9029 0.3247 l
0.9045 0.3262 l
0.9061 0.3276 l
0.9076 0.3290 l
0.9092 0.3304 l
0.9108 0.3319 l
0.9124 0.3333 l
0.9139 0.3347 l
0.9155 0.3361 l
0.9171 0.3375 l
0.9186 0.3388 l
0.9202 0.3402 l
0.9218 0.3416 l
0.9233 0.3430 l
0.9249 0.3443 l
0.9265 0.3456 l
0.9280 0.3468 l
0.9296 0.3481 l
0.9312 0.3493 l
0.9327 0.3505 l
0.9343 0.3517 l
0.9359 0.3529 l
0.9375 0.3541 l
0.9390 0.3553 l
0.9406 0.3565 l
0.9422 0.3577 l
0.9437 0.3588 l
0.9453 0.3600 l
0.9469 0.3612 l
0.9484 0.3624 l
0.9500 0.3635 l
s
[/DeviceRGB] SCS
Color1 SC
[] 0 SD
0.0015 SLW
n
0.1971 0.1500 m
0.1971 0.1600 l
s
n
0.1971 0.9000 m
0.1971 0.8900 l
s
n
0.2284 0.1500 m
0.2284 0.1600 l
s
n
0.2284 0.9000 m
0.2284 0.8900 l
s
n
0.2598 0.1500 m
0.2598 0.1600 l
s
n
0.2598 0.9000 m
0.2598 0.8900 l
s
n
0.2912 0.1500 m
0.2912 0.1600 l
s
n
0.2912 0.9000 m
0.2912 0.8900 l
s
n
0.3539 0.1500 m
0.3539 0.1600 l
s
n
0.3539 0.9000 m
0.3539 0.8900 l
s
n
0.3853 0.1500 m
0.3853 0.1600 l
s
n
0.3853 0.9000 m
0.3853 0.8900 l
s
n
0.4167 0.1500 m
0.4167 0.1600 l
s
n
0.4167 0.9000 m
0.4167 0.8900 l
s
n
0.4480 0.1500 m
0.4480 0.1600 l
s
n
0.4480 0.9000 m
0.4480 0.8900 l
s
n
0.5108 0.1500 m
0.5108 0.1600 l
s
n
0.5108 0.9000 m
0.5108 0.8900 l
s
n
0.5422 0.1500 m
0.5422 0.1600 l
s
n
0.5422 0.9000 m
0.5422 0.8900 l
s
n
0.5735 0.1500 m
0.5735 0.1600 l
s
n
0.5735 0.9000 m
0.5735 0.8900 l
s
n
0.6049 0.1500 m
0.6049 0.1600 l
s
n
0.6049 0.9000 m
0.6049 0.8900 l
s
n
0.6676 0.1500 m
0.6676 0.1600 l
s
n
0.6676 0.9000 m
0.6676 0.8900 l
s
n
0.6990 0.1500 m
0.6990 0.1600 l
s
n
0.6990 0.9000 m
0.6990 0.8900 l
s
n
0.7304 0.1500 m
0.7304 0.1600 l
s
n
0.7304 0.9000 m
0.7304 0.8900 l
s
n
0.7618 0.1500 m
0.7618 0.1600 l
s
n
0.7618 0.9000 m
0.7618 0.8900 l
s
n
0.8245 0.1500 m
0.8245 0.1600 l
s
n
0.8245 0.9000 m
0.8245 0.8900 l
s
n
0.8559 0.1500 m
0.8559 0.1600 l
s
n
0.8559 0.9000 m
0.8559 0.8900 l
s
n
0.8873 0.1500 m
0.8873 0.1600 l
s
n
0.8873 0.9000 m
0.8873 0.8900 l
s
n
0.9186 0.1500 m
0.9186 0.1600 l
s
n
0.9186 0.9000 m
0.9186 0.8900 l
s
n
0.1657 0.1500 m
0.1657 0.1700 l
s
n
0.1657 0.9000 m
0.1657 0.8800 l
s
n
0.3225 0.1500 m
0.3225 0.1700 l
s
n
0.3225 0.9000 m
0.3225 0.8800 l
s
n
0.4794 0.1500 m
0.4794 0.1700 l
s
n
0.4794 0.9000 m
0.4794 0.8800 l
s
n
0.6363 0.1500 m
0.6363 0.1700 l
s
n
0.6363 0.9000 m
0.6363 0.8800 l
s
n
0.7931 0.1500 m
0.7931 0.1700 l
s
n
0.7931 0.9000 m
0.7931 0.8800 l
s
n
0.9500 0.1500 m
0.9500 0.1700 l
s
n
0.9500 0.9000 m
0.9500 0.8800 l
s
/Helvetica findfont
dup length dict begin
 {1 index /FID ne {def} {pop pop} ifelse} forall
 /Encoding DefEncoding def
 currentdict
end
/Font4 exch definefont pop
/Font4 FFSF
0.1431 0.1200 m
GS
[0.0280 0.0000 0.0000 0.0280 0 0] CC
(100) show
GR
/Font4 FFSF
0.3000 0.1200 m
GS
[0.0280 0.0000 0.0000 0.0280 0 0] CC
(200) show
GR
/Font4 FFSF
0.4569 0.1200 m
GS
[0.0280 0.0000 0.0000 0.0280 0 0] CC
(300) show
GR
/Font4 FFSF
0.6137 0.1200 m
GS
[0.0280 0.0000 0.0000 0.0280 0 0] CC
(400) show
GR
/Font4 FFSF
0.7706 0.1200 m
GS
[0.0280 0.0000 0.0000 0.0280 0 0] CC
(500) show
GR
/Font4 FFSF
0.9275 0.1200 m
GS
[0.0280 0.0000 0.0000 0.0280 0 0] CC
(600) show
GR
/Font4 FFSF
0.4818 0.0845 m
GS
[0.0336 0.0000 0.0000 0.0336 0 0] CC
(M) show
GR
/Font4 FFSF
0.5096 0.0711 m
GS
[0.0238 0.0000 0.0000 0.0238 0 0] CC
(A) show
GR
/Font4 FFSF
0.5253 0.0845 m
GS
[0.0336 0.0000 0.0000 0.0336 0 0] CC
( [GeV]) show
GR
n
0.1500 0.2064 m
0.1600 0.2064 l
s
n
0.9500 0.2064 m
0.9400 0.2064 l
s
n
0.1500 0.2395 m
0.1600 0.2395 l
s
n
0.9500 0.2395 m
0.9400 0.2395 l
s
n
0.1500 0.2629 m
0.1600 0.2629 l
s
n
0.9500 0.2629 m
0.9400 0.2629 l
s
n
0.1500 0.2811 m
0.1600 0.2811 l
s
n
0.9500 0.2811 m
0.9400 0.2811 l
s
n
0.1500 0.2959 m
0.1600 0.2959 l
s
n
0.9500 0.2959 m
0.9400 0.2959 l
s
n
0.1500 0.3085 m
0.1600 0.3085 l
s
n
0.9500 0.3085 m
0.9400 0.3085 l
s
n
0.1500 0.3193 m
0.1600 0.3193 l
s
n
0.9500 0.3193 m
0.9400 0.3193 l
s
n
0.1500 0.3289 m
0.1600 0.3289 l
s
n
0.9500 0.3289 m
0.9400 0.3289 l
s
n
0.1500 0.3375 m
0.1600 0.3375 l
s
n
0.9500 0.3375 m
0.9400 0.3375 l
s
n
0.1500 0.3939 m
0.1600 0.3939 l
s
n
0.9500 0.3939 m
0.9400 0.3939 l
s
n
0.1500 0.4270 m
0.1600 0.4270 l
s
n
0.9500 0.4270 m
0.9400 0.4270 l
s
n
0.1500 0.4504 m
0.1600 0.4504 l
s
n
0.9500 0.4504 m
0.9400 0.4504 l
s
n
0.1500 0.4686 m
0.1600 0.4686 l
s
n
0.9500 0.4686 m
0.9400 0.4686 l
s
n
0.1500 0.4834 m
0.1600 0.4834 l
s
n
0.9500 0.4834 m
0.9400 0.4834 l
s
n
0.1500 0.4960 m
0.1600 0.4960 l
s
n
0.9500 0.4960 m
0.9400 0.4960 l
s
n
0.1500 0.5068 m
0.1600 0.5068 l
s
n
0.9500 0.5068 m
0.9400 0.5068 l
s
n
0.1500 0.5164 m
0.1600 0.5164 l
s
n
0.9500 0.5164 m
0.9400 0.5164 l
s
n
0.1500 0.5250 m
0.1600 0.5250 l
s
n
0.9500 0.5250 m
0.9400 0.5250 l
s
n
0.1500 0.5814 m
0.1600 0.5814 l
s
n
0.9500 0.5814 m
0.9400 0.5814 l
s
n
0.1500 0.6145 m
0.1600 0.6145 l
s
n
0.9500 0.6145 m
0.9400 0.6145 l
s
n
0.1500 0.6379 m
0.1600 0.6379 l
s
n
0.9500 0.6379 m
0.9400 0.6379 l
s
n
0.1500 0.6561 m
0.1600 0.6561 l
s
n
0.9500 0.6561 m
0.9400 0.6561 l
s
n
0.1500 0.6709 m
0.1600 0.6709 l
s
n
0.9500 0.6709 m
0.9400 0.6709 l
s
n
0.1500 0.6835 m
0.1600 0.6835 l
s
n
0.9500 0.6835 m
0.9400 0.6835 l
s
n
0.1500 0.6943 m
0.1600 0.6943 l
s
n
0.9500 0.6943 m
0.9400 0.6943 l
s
n
0.1500 0.7039 m
0.1600 0.7039 l
s
n
0.9500 0.7039 m
0.9400 0.7039 l
s
n
0.1500 0.7125 m
0.1600 0.7125 l
s
n
0.9500 0.7125 m
0.9400 0.7125 l
s
n
0.1500 0.7689 m
0.1600 0.7689 l
s
n
0.9500 0.7689 m
0.9400 0.7689 l
s
n
0.1500 0.8020 m
0.1600 0.8020 l
s
n
0.9500 0.8020 m
0.9400 0.8020 l
s
n
0.1500 0.8254 m
0.1600 0.8254 l
s
n
0.9500 0.8254 m
0.9400 0.8254 l
s
n
0.1500 0.8436 m
0.1600 0.8436 l
s
n
0.9500 0.8436 m
0.9400 0.8436 l
s
n
0.1500 0.8584 m
0.1600 0.8584 l
s
n
0.9500 0.8584 m
0.9400 0.8584 l
s
n
0.1500 0.8710 m
0.1600 0.8710 l
s
n
0.9500 0.8710 m
0.9400 0.8710 l
s
n
0.1500 0.8818 m
0.1600 0.8818 l
s
n
0.9500 0.8818 m
0.9400 0.8818 l
s
n
0.1500 0.8914 m
0.1600 0.8914 l
s
n
0.9500 0.8914 m
0.9400 0.8914 l
s
n
0.1500 0.9000 m
0.1600 0.9000 l
s
n
0.9500 0.9000 m
0.9400 0.9000 l
s
n
0.1500 0.1500 m
0.1700 0.1500 l
s
n
0.9500 0.1500 m
0.9300 0.1500 l
s
n
0.1500 0.3375 m
0.1700 0.3375 l
s
n
0.9500 0.3375 m
0.9300 0.3375 l
s
n
0.1500 0.5250 m
0.1700 0.5250 l
s
n
0.9500 0.5250 m
0.9300 0.5250 l
s
n
0.1500 0.7125 m
0.1700 0.7125 l
s
n
0.9500 0.7125 m
0.9300 0.7125 l
s
n
0.1500 0.9000 m
0.1700 0.9000 l
s
n
0.9500 0.9000 m
0.9300 0.9000 l
s
/Font4 FFSF
0.0922 0.1349 m
GS
[0.0280 0.0000 0.0000 0.0280 0 0] CC
(10) show
GR
/Font4 FFSF
0.1231 0.1517 m
GS
[0.0198 0.0000 0.0000 0.0198 0 0] CC
(-4) show
GR
/Font4 FFSF
0.0922 0.3224 m
GS
[0.0280 0.0000 0.0000 0.0280 0 0] CC
(10) show
GR
/Font4 FFSF
0.1231 0.3392 m
GS
[0.0198 0.0000 0.0000 0.0198 0 0] CC
(-3) show
GR
/Font4 FFSF
0.0922 0.5099 m
GS
[0.0280 0.0000 0.0000 0.0280 0 0] CC
(10) show
GR
/Font4 FFSF
0.1231 0.5267 m
GS
[0.0198 0.0000 0.0000 0.0198 0 0] CC
(-2) show
GR
/Font4 FFSF
0.0957 0.6974 m
GS
[0.0280 0.0000 0.0000 0.0280 0 0] CC
(10) show
GR
/Font4 FFSF
0.1267 0.7142 m
GS
[0.0198 0.0000 0.0000 0.0198 0 0] CC
(-1) show
GR
/Font4 FFSF
0.0988 0.8849 m
GS
[0.0280 0.0000 0.0000 0.0280 0 0] CC
(10) show
GR
/Font4 FFSF
0.1298 0.9017 m
GS
[0.0198 0.0000 0.0000 0.0198 0 0] CC
(0) show
GR
/Font4 FFSF
0.0751 0.4797 m
GS
[0.0000 0.0336 -0.0336 0.0000 0 0] CC
(BR\(H\)) show
GR
n
0.1500 0.1500 m
0.1500 0.9000 l
0.9500 0.9000 l
0.9500 0.1500 l
0.1500 0.1500 l
c
s
n
0.7000 0.5500 m
0.7000 0.3037 l
0.9319 0.3037 l
0.9319 0.5500 l
c
[/DeviceRGB] SCS
Color0 SC
fill
[/DeviceRGB] SCS
Color1 SC
n
0.7000 0.5500 m
0.7000 0.3037 l
0.9319 0.3037 l
0.9319 0.5500 l
0.7000 0.5500 l
c
s
/Font4 FFSF
0.7862 0.4935 m
GS
[0.0224 0.0000 0.0000 0.0224 0 0] CC
(BR\(H -> tt\)) show
GR
[/DeviceRGB] SCS
Color2 SC
[] 0 SD
0.0045 SLW
n
0.7122 0.4994 m
0.7722 0.4994 l
s
/Font4 FFSF
[/DeviceRGB] SCS
Color1 SC
0.7862 0.4524 m
GS
[0.0224 0.0000 0.0000 0.0224 0 0] CC
(BR\(H -> bb\)) show
GR
[/DeviceRGB] SCS
Color3 SC
n
0.7122 0.4582 m
0.7722 0.4582 l
s
/Font4 FFSF
[/DeviceRGB] SCS
Color1 SC
0.7862 0.4112 m
GS
[0.0224 0.0000 0.0000 0.0224 0 0] CC
(BR\(H -> ) show
GR
/Symbol findfont
/Font12 exch definefont pop
/Font12 FFSF
0.8741 0.4112 m
GS
[0.0224 0.0000 0.0000 0.0224 0 0] CC
(tt) show
GR
/Font4 FFSF
0.8937 0.4112 m
GS
[0.0224 0.0000 0.0000 0.0224 0 0] CC
(\)) show
GR
[/DeviceRGB] SCS
Color4 SC
n
0.7122 0.4171 m
0.7722 0.4171 l
s
/Font4 FFSF
[/DeviceRGB] SCS
Color1 SC
0.7862 0.3700 m
GS
[0.0224 0.0000 0.0000 0.0224 0 0] CC
(BR\(H -> ) show
GR
/Font12 FFSF
0.8741 0.3700 m
GS
[0.0224 0.0000 0.0000 0.0224 0 0] CC
(mm) show
GR
/Font4 FFSF
0.9000 0.3700 m
GS
[0.0224 0.0000 0.0000 0.0224 0 0] CC
(\)) show
GR
[/DeviceRGB] SCS
Color5 SC
n
0.7122 0.3757 m
0.7722 0.3757 l
s
/Font4 FFSF
[/DeviceRGB] SCS
Color1 SC
0.7862 0.3284 m
GS
[0.0224 0.0000 0.0000 0.0224 0 0] CC
(BR\(H -> WW\)) show
GR
[/DeviceRGB] SCS
Color6 SC
n
0.7122 0.3343 m
0.7722 0.3343 l
s
/Font4 FFSF
[/DeviceRGB] SCS
Color1 SC
0.9700 0.7000 m
GS
[0.0000 0.0168 -0.0168 0.0000 0 0] CC
(LHC Higgs XS WG 2013) show
GR
/Font4 FFSF
0.7150 0.5250 m
GS
[0.0224 0.0000 0.0000 0.0224 0 0] CC
(light stop, tan) show
GR
/Font12 FFSF
0.8483 0.5250 m
GS
[0.0224 0.0000 0.0000 0.0224 0 0] CC
(b) show
GR
/Font4 FFSF
0.8605 0.5250 m
GS
[0.0224 0.0000 0.0000 0.0224 0 0] CC
( = 10) show
GR
%%Trailer
%%BoundingBox: 30 42 597 562
%%DocumentNeededResources: font Helvetica
%%+ font Symbol
%%EOF
