%!PS-Adobe-2.0 EPSF-2.0
%%BoundingBox: 81 198 457 390
%%HiResBoundingBox: 81.500000 198.500000 457.000000 389.500000
%...................................
%%Creator: GPL Ghostscript 870 (pswrite)
%%CreationDate: 2013/02/14 17:37:28
%%DocumentData: Clean7Bit
%%LanguageLevel: 2
%%EndComments
% EPSF created by ps2eps 1.64
%%BeginProlog
save
countdictstack
mark
newpath
/showpage {} def
/setpagedevice {pop} def
%%EndProlog
%%Page 1 1
%%BeginProlog
% This copyright applies to everything between here and the %%EndProlog:
% Copyright (C) 2009 Artifex Software, Inc.  All rights reserved.
%%BeginResource: procset GS_pswrite_2_0_1001 1.001 0
/GS_pswrite_2_0_1001 80 dict dup begin
/PageSize 2 array def/setpagesize{ PageSize aload pop 3 index eq exch
4 index eq and{ pop pop pop}{ PageSize dup  1
5 -1 roll put 0 4 -1 roll put dup null eq {false} {dup where} ifelse{ exch get exec}
{ pop/setpagedevice where
{ pop 1 dict dup /PageSize PageSize put setpagedevice}
{ /setpage where{ pop PageSize aload pop pageparams 3 {exch pop} repeat
setpage}if}ifelse}ifelse}ifelse} bind def
/!{bind def}bind def/#{load def}!/N/counttomark #
/rG{3{3 -1 roll 255 div}repeat setrgbcolor}!/G{255 div setgray}!/K{0 G}!
/r6{dup 3 -1 roll rG}!/r5{dup 3 1 roll rG}!/r3{dup rG}!
/w/setlinewidth #/J/setlinecap #
/j/setlinejoin #/M/setmiterlimit #/d/setdash #/i/setflat #
/m/moveto #/l/lineto #/c/rcurveto #
/p{N 2 idiv{N -2 roll rlineto}repeat}!
/P{N 0 gt{N -2 roll moveto p}if}!
/h{p closepath}!/H{P closepath}!
/lx{0 rlineto}!/ly{0 exch rlineto}!/v{0 0 6 2 roll c}!/y{2 copy c}!
/re{4 -2 roll m exch dup lx exch ly neg lx h}!
/^{3 index neg 3 index neg}!
/f{P fill}!/f*{P eofill}!/s{H stroke}!/S{P stroke}!
/q/gsave #/Q/grestore #/rf{re fill}!
/Y{P clip newpath}!/Y*{P eoclip newpath}!/rY{re Y}!
/|={pop exch 4 1 roll 1 array astore cvx 3 array astore cvx exch 1 index def exec}!
/|{exch string readstring |=}!
/+{dup type/nametype eq{2 index 7 add -3 bitshift 2 index mul}if}!
/@/currentfile #/${+ @ |}!
/B{{2 copy string{readstring pop}aload pop 4 array astore cvx
3 1 roll}repeat pop pop true}!
/Ix{[1 0 0 1 11 -2 roll exch neg exch neg]exch}!
/,{true exch Ix imagemask}!/If{false exch Ix imagemask}!/I{exch Ix image}!
/Ic{exch Ix false 3 colorimage}!
/F{/Columns counttomark 3 add -2 roll/Rows exch/K -1/BlackIs1 true>>
/CCITTFaxDecode filter}!/FX{<</EndOfBlock false F}!
/X{/ASCII85Decode filter}!/@X{@ X}!/&2{2 index 2 index}!
/@F{@ &2<<F}!/@C{@X &2 FX}!
/$X{+ @X |}!/&4{4 index 4 index}!/$F{+ @ &4<<F |}!/$C{+ @X &4 FX |}!
/IC{3 1 roll 10 dict begin 1{/ImageType/Interpolate/Decode/DataSource
/ImageMatrix/BitsPerComponent/Height/Width}{exch def}forall
currentdict end image}!
/~{@ read {pop} if}!
end def
%%EndResource
/pagesave null def
%%EndProlog
%%Page: 1 1
%%PageBoundingBox: 0 0 612 792
%%BeginPageSetup
GS_pswrite_2_0_1001 begin
612 792 /letter setpagesize
/pagesave save store 197 dict begin
0.1 0.1 scale
%%EndPageSetup
gsave mark
Q q
0 0 6120 7920 re
Y
4.8 w
1 J
1 j
K
2306.4 5863.2 -9.6 -12 -9.6 -14.4 -12 -21.6 -4.8 -26.4 0 -19.2 4.8 -26.4 12 -21.6 
9.6 -14.4 9.6 -9.6 P
2296.8 5851.2 -9.6 -19.2 -4.8 -16.8 -7.2 -26.4 0 -19.2 7.2 -26.4 4.8 -14.4 9.6 -21.6 P
2515.2 5841.6 0 -108 P
2520 5841.6 0 -108 P
2582.4 5841.6 0 -108 P
2587.2 5841.6 0 -108 P
2500.8 5841.6 36 0 P
2568 5841.6 36 0 P
2520 5788.8 62.4 0 P
2500.8 5733.6 36 0 P
2568 5733.6 36 0 P
2640 5841.6 -4.8 -4.8 4.8 -4.8 ^ ^ P
2640 5805.6 0 -72 P
2644.8 5805.6 0 -72 P
2625.6 5805.6 19.2 0 P
2625.6 5733.6 36 0 P
2712 5805.6 -9.6 -4.8 -4.8 -4.8 -4.8 -12 0 -9.6 4.8 -9.6 4.8 -4.8 9.6 -7.2 
12 0 9.6 7.2 4.8 4.8 4.8 9.6 0 9.6 -4.8 12 -4.8 4.8 -9.6 4.8 
-12 0 P
2702.4 5800.8 -4.8 -12 0 -19.2 4.8 -9.6 P
2733.6 5760 4.8 9.6 0 19.2 -4.8 12 P
2738.4 5796 4.8 4.8 12 4.8 0 -4.8 -12 0 P
2697.6 5764.8 -4.8 -4.8 -4.8 -12 0 -4.8 4.8 -9.6 14.4 -4.8 26.4 0 16.8 -7.2 
4.8 -4.8 P
2688 5743.2 4.8 -4.8 14.4 -4.8 26.4 0 16.8 -4.8 4.8 -12 0 -4.8 -4.8 -9.6 
-16.8 -4.8 -31.2 0 -14.4 4.8 -7.2 9.6 0 4.8 7.2 12 14.4 4.8 P
2812.8 5805.6 -12 -4.8 -4.8 -4.8 -4.8 -12 0 -9.6 4.8 -9.6 4.8 -4.8 12 -7.2 
9.6 0 9.6 7.2 4.8 4.8 7.2 9.6 0 9.6 -7.2 12 -4.8 4.8 -9.6 4.8 
-9.6 0 P
2800.8 5800.8 -4.8 -12 0 -19.2 4.8 -9.6 P
2832 5760 4.8 9.6 0 19.2 -4.8 12 S
2836.8 5796 7.2 4.8 9.6 4.8 0 -4.8 -9.6 0 P
2796 5764.8 -4.8 -4.8 -4.8 -12 0 -4.8 4.8 -9.6 14.4 -4.8 26.4 0 16.8 -7.2 
4.8 -4.8 P
2786.4 5743.2 4.8 -4.8 14.4 -4.8 26.4 0 16.8 -4.8 4.8 -12 0 -4.8 -4.8 -9.6 
-16.8 -4.8 -31.2 0 -14.4 4.8 -4.8 9.6 0 4.8 4.8 12 14.4 4.8 P
2937.6 5796 4.8 9.6 0 -21.6 -4.8 12 -7.2 4.8 -9.6 4.8 -21.6 0 -9.6 -4.8 
-4.8 -4.8 0 -12 4.8 -4.8 9.6 -4.8 26.4 -9.6 12 -4.8 4.8 -7.2 P
2884.8 5788.8 4.8 -4.8 9.6 -4.8 26.4 -9.6 12 -4.8 4.8 -4.8 0 -16.8 -4.8 -4.8 
-12 -4.8 -19.2 0 -12 4.8 -4.8 4.8 -4.8 9.6 0 -19.2 4.8 9.6 P
3062.4 5805.6 28.8 -72 P
3067.2 5805.6 24 -62.4 P
3122.4 5805.6 -31.2 -72 -9.6 -21.6 -9.6 -9.6 -9.6 -4.8 -7.2 0 -4.8 4.8 4.8 4.8 
7.2 -4.8 P
3050.4 5805.6 31.2 0 P
3103.2 5805.6 31.2 0 P
3736.8 5805.6 31.2 -72 P
3741.6 5805.6 26.4 -62.4 P
3799.2 5805.6 -31.2 -72 P
3727.2 5805.6 31.2 0 P
3777.6 5805.6 31.2 0 P
3840 5841.6 0 -108 P
3847.2 5841.6 0 -108 P
3847.2 5788.8 9.6 12 9.6 4.8 12 0 14.4 -4.8 9.6 -12 4.8 -14.4 0 -9.6 
-4.8 -16.8 -9.6 -9.6 -14.4 -4.8 -12 0 -9.6 4.8 -9.6 9.6 P
3878.4 5805.6 9.6 -4.8 9.6 -12 4.8 -14.4 0 -9.6 -4.8 -16.8 -9.6 -9.6 -9.6 -4.8 P
3825.6 5841.6 21.6 0 P
3976.8 5836.8 -7.2 -4.8 7.2 -4.8 4.8 4.8 0 4.8 -4.8 4.8 -12 0 -9.6 -4.8 
-4.8 -9.6 0 -93.6 P
3964.8 5841.6 -4.8 -4.8 -4.8 -9.6 0 -93.6 S
3933.6 5805.6 43.2 0 P
3933.6 5733.6 36 0 P
4070.4 5788.8 -7.2 -4.8 7.2 -4.8 4.8 4.8 0 4.8 -12 12 -9.6 4.8 -14.4 0 
-16.8 -4.8 -9.6 -12 -4.8 -14.4 0 -9.6 4.8 -16.8 9.6 -9.6 16.8 -4.8 9.6 0 
14.4 4.8 12 9.6 P
4039.2 5805.6 -12 -4.8 -9.6 -12 -4.8 -14.4 0 -9.6 4.8 -16.8 9.6 -9.6 12 -4.8 P
4116 5805.6 0 -57.6 4.8 -9.6 16.8 -4.8 9.6 0 16.8 4.8 9.6 9.6 P
4120.8 5805.6 0 -57.6 4.8 -9.6 12 -4.8 P
4173.6 5805.6 0 -72 P
4178.4 5805.6 0 -72 P
4101.6 5805.6 19.2 0 P
4156.8 5805.6 21.6 0 P
4173.6 5733.6 21.6 0 P
4231.2 5841.6 0 -88.8 4.8 -14.4 9.6 -4.8 12 0 9.6 4.8 4.8 9.6 P
4236 5841.6 0 -88.8 4.8 -14.4 4.8 -4.8 P
4214.4 5805.6 43.2 0 P
4351.2 5796 4.8 9.6 0 -21.6 -4.8 12 -7.2 4.8 -9.6 4.8 -21.6 0 -9.6 -4.8 
-4.8 -4.8 0 -12 4.8 -4.8 9.6 -4.8 26.4 -9.6 12 -4.8 4.8 -7.2 P
4298.4 5788.8 4.8 -4.8 9.6 -4.8 26.4 -9.6 12 -4.8 4.8 -4.8 0 -16.8 -4.8 -4.8 
-12 -4.8 -19.2 0 -12 4.8 -4.8 4.8 -4.8 9.6 0 -19.2 4.8 9.6 P
1190.4 3544.8 4154.4 0 0 2076 ^ H
2020.8 3544.8 0 705.6 168 0 0 501.6 165.6 0 0 252 165.6 0 0 177.6 
165.6 0 0 88.8 165.6 0 0 79.2 168 0 0 36 165.6 0 0 12 
165.6 0 ^ 165.6 0 0 -40.8 165.6 0 0 -69.6 168 0 0 -117.6 
165.6 0 0 -153.6 165.6 0 0 -264 165.6 0 0 -780 168 0 0 -415.2 S
1190.4 3544.8 0 124.8 P
1329.6 3585.6 0 -40.8 P
1468.8 3544.8 0 40.8 P
1605.6 3585.6 0 -40.8 P
1744.8 3544.8 0 40.8 P
1884 3669.6 0 -124.8 P
2020.8 3544.8 0 40.8 P
2160 3585.6 0 -40.8 P
2299.2 3544.8 0 40.8 P
2436 3585.6 0 -40.8 P
2575.2 3544.8 0 124.8 P
2714.4 3585.6 0 -40.8 P
2853.6 3544.8 0 40.8 P
2990.4 3585.6 0 -40.8 P
3129.6 3544.8 0 40.8 P
3266.4 3669.6 0 -124.8 P
3405.6 3544.8 0 40.8 P
3544.8 3585.6 0 -40.8 P
3681.6 3544.8 0 40.8 P
3820.8 3585.6 0 -40.8 P
3960 3544.8 0 124.8 P
4099.2 3585.6 0 -40.8 P
4236 3544.8 0 40.8 P
4375.2 3585.6 0 -40.8 P
4514.4 3544.8 0 40.8 P
4651.2 3669.6 0 -124.8 P
4790.4 3544.8 0 40.8 P
4929.6 3585.6 0 -40.8 P
5066.4 3544.8 0 40.8 P
5205.6 3585.6 0 -40.8 P
5344.8 3544.8 0 124.8 P
1190.4 5496 0 124.8 P
1329.6 5620.8 0 -40.8 P
1468.8 5580 0 40.8 P
1605.6 5620.8 0 -40.8 P
1744.8 5580 0 40.8 P
1884 5620.8 0 -124.8 P
2020.8 5580 0 40.8 P
2160 5620.8 0 -40.8 P
2299.2 5580 0 40.8 P
2436 5620.8 0 -40.8 P
2575.2 5496 0 124.8 P
2714.4 5620.8 0 -40.8 P
2853.6 5580 0 40.8 P
2990.4 5620.8 0 -40.8 P
3129.6 5580 0 40.8 P
3266.4 5620.8 0 -124.8 P
3405.6 5580 0 40.8 P
3544.8 5620.8 0 -40.8 P
3681.6 5580 0 40.8 P
3820.8 5620.8 0 -40.8 P
3960 5496 0 124.8 P
4099.2 5620.8 0 -40.8 P
4236 5580 0 40.8 P
4375.2 5620.8 0 -40.8 P
4514.4 5580 0 40.8 P
4651.2 5620.8 0 -124.8 P
4790.4 5580 0 40.8 P
4929.6 5620.8 0 -40.8 P
5066.4 5580 0 40.8 P
5205.6 5620.8 0 -40.8 P
5344.8 5496 0 124.8 P
1190.4 3544.8 43.2 0 P
1233.6 3616.8 -43.2 0 S
1190.4 3669.6 43.2 0 P
1233.6 3710.4 -43.2 0 P
1190.4 3744 43.2 0 P
1233.6 3770.4 -43.2 0 P
1190.4 3794.4 43.2 0 P
1233.6 3816 -43.2 0 P
1190.4 3835.2 124.8 0 P
1233.6 3960 -43.2 0 P
1190.4 4032 43.2 0 P
1233.6 4084.8 -43.2 0 P
1190.4 4125.6 43.2 0 P
1233.6 4159.2 -43.2 0 P
1190.4 4185.6 43.2 0 P
1233.6 4209.6 -43.2 0 P
1190.4 4231.2 43.2 0 P
1315.2 4250.4 -124.8 0 P
1190.4 4375.2 43.2 0 P
1233.6 4447.2 -43.2 0 P
1190.4 4500 43.2 0 P
1233.6 4540.8 -43.2 0 P
1190.4 4574.4 43.2 0 P
1233.6 4600.8 -43.2 0 P
1190.4 4624.8 43.2 0 P
1233.6 4646.4 -43.2 0 P
1190.4 4665.6 124.8 0 P
1233.6 4790.4 -43.2 0 P
1190.4 4862.4 43.2 0 P
1233.6 4915.2 -43.2 0 P
1190.4 4956 43.2 0 P
1233.6 4989.6 -43.2 0 P
1190.4 5016 43.2 0 P
1233.6 5040 -43.2 0 P
1190.4 5061.6 43.2 0 P
1315.2 5080.8 -124.8 0 P
1190.4 5205.6 43.2 0 P
1233.6 5277.6 -43.2 0 P
1190.4 5330.4 43.2 0 P
1233.6 5371.2 -43.2 0 P
1190.4 5404.8 43.2 0 P
1233.6 5431.2 -43.2 0 P
1190.4 5455.2 43.2 0 P
1233.6 5476.8 -43.2 0 P
1190.4 5496 124.8 0 P
1233.6 5620.8 -43.2 0 P
818.4 3852 7.2 4.8 9.6 9.6 0 -72 P
832.8 3861.6 0 -67.2 P
818.4 3794.4 31.2 0 P
897.6 3866.4 -9.6 -4.8 -7.2 -9.6 -4.8 -16.8 0 -9.6 4.8 -19.2 7.2 -9.6 9.6 -2.4 
7.2 0 9.6 2.4 7.2 9.6 4.8 19.2 0 9.6 -4.8 16.8 -7.2 9.6 -9.6 4.8 
-7.2 0 -7.2 -4.8 -2.4 -2.4 -4.8 -7.2 -2.4 -16.8 0 -9.6 2.4 -19.2 4.8 -7.2 
2.4 -2.4 7.2 -2.4 P
904.8 3794.4 7.2 2.4 2.4 2.4 4.8 7.2 2.4 19.2 0 9.6 -2.4 16.8 -4.8 7.2 
-2.4 2.4 -7.2 4.8 S
950.4 3866.4 62.4 0 P
1044 3907.2 -7.2 -33.6 7.2 7.2 9.6 2.4 9.6 0 12 -2.4 7.2 -7.2 2.4 -12 
0 -4.8 -2.4 -12 -7.2 -7.2 -12 -2.4 -9.6 0 -9.6 2.4 -4.8 4.8 -2.4 7.2 
0 2.4 2.4 4.8 4.8 -4.8 -4.8 -2.4 P
1063.2 3883.2 7.2 -2.4 7.2 -7.2 4.8 -12 0 -4.8 -4.8 -12 -7.2 -7.2 -7.2 -2.4 P
1044 3907.2 33.6 0 P
1044 3904.8 16.8 0 16.8 2.4 P
818.4 4267.2 7.2 4.8 9.6 9.6 0 -72 P
832.8 4276.8 0 -67.2 P
818.4 4209.6 31.2 0 P
897.6 4281.6 -9.6 -4.8 -7.2 -9.6 -4.8 -16.8 0 -9.6 4.8 -19.2 7.2 -9.6 9.6 -2.4 
7.2 0 9.6 2.4 7.2 9.6 4.8 19.2 0 9.6 -4.8 16.8 -7.2 9.6 -9.6 4.8 
-7.2 0 -7.2 -4.8 -2.4 -2.4 -4.8 -7.2 -2.4 -16.8 0 -9.6 2.4 -19.2 4.8 -7.2 
2.4 -2.4 7.2 -2.4 P
904.8 4209.6 7.2 2.4 2.4 2.4 4.8 7.2 2.4 19.2 0 9.6 -2.4 16.8 -4.8 7.2 
-2.4 2.4 -7.2 4.8 P
950.4 4281.6 62.4 0 P
1068 4315.2 0 -64.8 P
1070.4 4322.4 0 -72 P
1070.4 4322.4 -38.4 -50.4 55.2 0 P
1056 4250.4 26.4 0 P
818.4 4682.4 7.2 4.8 9.6 9.6 0 -72 S
832.8 4692 0 -67.2 P
818.4 4624.8 31.2 0 P
897.6 4696.8 -9.6 -4.8 -7.2 -9.6 -4.8 -16.8 0 -9.6 4.8 -19.2 7.2 -9.6 9.6 -2.4 
7.2 0 9.6 2.4 7.2 9.6 4.8 19.2 0 9.6 -4.8 16.8 -7.2 9.6 -9.6 4.8 
-7.2 0 -7.2 -4.8 -2.4 -2.4 -4.8 -7.2 -2.4 -16.8 0 -9.6 2.4 -19.2 4.8 -7.2 
2.4 -2.4 7.2 -2.4 P
904.8 4624.8 7.2 2.4 2.4 2.4 4.8 7.2 2.4 19.2 0 9.6 -2.4 16.8 -4.8 7.2 
-2.4 2.4 -7.2 4.8 P
950.4 4696.8 62.4 0 P
1039.2 4723.2 4.8 -2.4 -4.8 -2.4 -2.4 2.4 0 2.4 2.4 7.2 4.8 4.8 9.6 2.4 
14.4 0 9.6 -2.4 4.8 -7.2 0 -9.6 -4.8 -7.2 -9.6 -4.8 -12 0 P
1068 4737.6 7.2 -2.4 2.4 -7.2 0 -9.6 -2.4 -7.2 -7.2 -4.8 7.2 -2.4 7.2 -7.2 
2.4 -7.2 0 -9.6 -2.4 -7.2 -4.8 -4.8 -9.6 -2.4 -14.4 0 -9.6 2.4 -4.8 4.8 
-2.4 7.2 0 2.4 2.4 4.8 4.8 -4.8 -4.8 -2.4 P
1077.6 4699.2 4.8 -9.6 0 -9.6 -4.8 -7.2 -2.4 -4.8 -7.2 -2.4 P
818.4 5097.6 7.2 4.8 9.6 9.6 0 -72 P
832.8 5107.2 0 -67.2 P
818.4 5040 31.2 0 P
897.6 5112 -9.6 -4.8 -7.2 -9.6 -4.8 -16.8 0 -9.6 4.8 -19.2 7.2 -9.6 9.6 -2.4 
7.2 0 9.6 2.4 7.2 9.6 4.8 19.2 0 9.6 -4.8 16.8 -7.2 9.6 -9.6 4.8 
-7.2 0 -7.2 -4.8 -2.4 -2.4 -4.8 -7.2 -2.4 -16.8 0 -9.6 2.4 -19.2 4.8 -7.2 
2.4 -2.4 7.2 -2.4 P
904.8 5040 7.2 2.4 2.4 2.4 4.8 7.2 2.4 19.2 0 9.6 -2.4 16.8 -4.8 7.2 
-2.4 2.4 -7.2 4.8 S
950.4 5112 62.4 0 P
1039.2 5138.4 4.8 -2.4 -4.8 -2.4 -2.4 2.4 0 2.4 2.4 7.2 4.8 4.8 9.6 2.4 
14.4 0 9.6 -2.4 4.8 -4.8 2.4 -7.2 0 -4.8 -2.4 -7.2 -12 -7.2 -16.8 -7.2 
-14.4 -9.6 -2.4 -12 0 -9.6 P
1068 5152.8 7.2 -2.4 2.4 -4.8 4.8 -7.2 0 -4.8 -4.8 -7.2 -9.6 -7.2 -14.4 -7.2 P
1036.8 5088 2.4 2.4 7.2 0 16.8 -7.2 12 0 7.2 4.8 2.4 2.4 P
1046.4 5090.4 16.8 -9.6 14.4 0 4.8 2.4 2.4 7.2 0 7.2 P
818.4 5512.8 7.2 4.8 9.6 9.6 0 -72 P
832.8 5522.4 0 -67.2 P
818.4 5455.2 31.2 0 P
897.6 5527.2 -9.6 -4.8 -7.2 -9.6 -4.8 -16.8 0 -9.6 4.8 -19.2 7.2 -9.6 9.6 -2.4 
7.2 0 9.6 2.4 7.2 9.6 4.8 19.2 0 9.6 -4.8 16.8 -7.2 9.6 -9.6 4.8 
-7.2 0 -7.2 -4.8 -2.4 -2.4 -4.8 -7.2 -2.4 -16.8 0 -9.6 2.4 -19.2 4.8 -7.2 
2.4 -2.4 7.2 -2.4 P
904.8 5455.2 7.2 2.4 2.4 2.4 4.8 7.2 2.4 19.2 0 9.6 -2.4 16.8 -4.8 7.2 
-2.4 2.4 -7.2 4.8 P
950.4 5527.2 62.4 0 P
1046.4 5553.6 7.2 4.8 9.6 9.6 0 -72 P
1060.8 5565.6 0 -69.6 P
1046.4 5496 31.2 0 P
5301.6 3544.8 43.2 0 P
5344.8 3616.8 -43.2 0 P
5301.6 3669.6 43.2 0 P
5344.8 3710.4 -43.2 0 P
5301.6 3744 43.2 0 P
5344.8 3770.4 -43.2 0 P
5301.6 3794.4 43.2 0 P
5344.8 3816 -43.2 0 P
5220 3835.2 124.8 0 P
5344.8 3960 -43.2 0 P
5301.6 4032 43.2 0 P
5344.8 4084.8 -43.2 0 P
5301.6 4125.6 43.2 0 P
5344.8 4159.2 -43.2 0 P
5301.6 4185.6 43.2 0 P
5344.8 4209.6 -43.2 0 S
5301.6 4231.2 43.2 0 P
5344.8 4250.4 -124.8 0 P
5301.6 4375.2 43.2 0 P
5344.8 4447.2 -43.2 0 P
5301.6 4500 43.2 0 P
5344.8 4540.8 -43.2 0 P
5301.6 4574.4 43.2 0 P
5344.8 4600.8 -43.2 0 P
5301.6 4624.8 43.2 0 P
5344.8 4646.4 -43.2 0 P
5220 4665.6 124.8 0 P
5344.8 4790.4 -43.2 0 P
5301.6 4862.4 43.2 0 P
5344.8 4915.2 -43.2 0 P
5301.6 4956 43.2 0 P
5344.8 4989.6 -43.2 0 P
5301.6 5016 43.2 0 P
5344.8 5040 -43.2 0 P
5301.6 5061.6 43.2 0 P
5344.8 5080.8 -124.8 0 P
5301.6 5205.6 43.2 0 P
5344.8 5277.6 -43.2 0 P
5301.6 5330.4 43.2 0 P
5344.8 5371.2 -43.2 0 P
5301.6 5404.8 43.2 0 P
5344.8 5431.2 -43.2 0 P
5301.6 5455.2 43.2 0 P
5344.8 5476.8 -43.2 0 P
5220 5496 124.8 0 P
5344.8 5620.8 -43.2 0 S
255 0 r3
1855.2 3544.8 0 240 165.6 0 0 602.4 168 0 0 331.2 165.6 0 0 232.8 
165.6 0 0 201.6 165.6 0 0 112.8 165.6 0 0 67.2 168 0 0 43.2 
165.6 0 0 7.2 165.6 0 0 -14.4 165.6 0 0 -38.4 165.6 0 0 -72 
168 0 0 -112.8 165.6 0 0 -134.4 165.6 0 0 -302.4 165.6 0 0 -422.4 
168 0 0 -741.6 S
K
2791.2 2080.8 0 -72 P
2796 2080.8 0 -72 P
2836.8 2080.8 0 -72 P
2839.2 2080.8 0 -72 P
2781.6 2080.8 24 0 P
2827.2 2080.8 24 0 P
2796 2047.2 40.8 0 P
2781.6 2008.8 24 0 P
2827.2 2008.8 24 0 P
2875.2 2080.8 -4.8 -2.4 4.8 -4.8 2.4 4.8 -2.4 2.4 P
2875.2 2056.8 0 -48 P
2877.6 2056.8 0 -48 P
2865.6 2056.8 12 0 P
2865.6 2008.8 24 0 P
2923.2 2056.8 -7.2 -2.4 -2.4 -4.8 -4.8 -7.2 0 -7.2 4.8 -4.8 2.4 -4.8 7.2 -2.4 
7.2 0 7.2 2.4 2.4 4.8 4.8 4.8 0 7.2 -4.8 7.2 -2.4 4.8 -7.2 2.4 
-7.2 0 P
2916 2054.4 -2.4 -7.2 0 -14.4 2.4 -7.2 P
2937.6 2025.6 2.4 7.2 0 14.4 -2.4 7.2 P
2940 2049.6 4.8 4.8 7.2 2.4 0 -2.4 -7.2 0 P
2913.6 2030.4 -4.8 -4.8 -2.4 -7.2 0 -2.4 2.4 -7.2 12 -4.8 16.8 0 9.6 -2.4 
4.8 -2.4 P
2906.4 2016 2.4 -4.8 12 -2.4 16.8 0 9.6 -4.8 4.8 -4.8 0 -4.8 -4.8 -7.2 
-9.6 -2.4 -21.6 0 -9.6 2.4 -4.8 7.2 0 4.8 4.8 4.8 9.6 4.8 P
2990.4 2056.8 -7.2 -2.4 -4.8 -4.8 -2.4 -7.2 0 -7.2 2.4 -4.8 4.8 -4.8 7.2 -2.4 
4.8 0 7.2 2.4 4.8 4.8 2.4 4.8 0 7.2 -2.4 7.2 -4.8 4.8 -7.2 2.4 
-4.8 0 P
2983.2 2054.4 -4.8 -7.2 0 -14.4 4.8 -7.2 P
3002.4 2025.6 4.8 7.2 0 14.4 -4.8 7.2 P
3007.2 2049.6 2.4 4.8 7.2 2.4 0 -2.4 -7.2 0 P
2978.4 2030.4 -2.4 -4.8 -4.8 -7.2 0 -2.4 4.8 -7.2 9.6 -4.8 16.8 0 12 -2.4 
2.4 -2.4 P
2971.2 2016 4.8 -4.8 9.6 -2.4 16.8 0 12 -4.8 2.4 -4.8 0 -4.8 -2.4 -7.2 
-12 -2.4 -19.2 0 -12 2.4 -2.4 7.2 0 4.8 2.4 4.8 12 4.8 S
3072 2049.6 4.8 7.2 0 -14.4 -4.8 7.2 -2.4 4.8 -7.2 2.4 -14.4 0 -7.2 -2.4 
-2.4 -4.8 0 -7.2 2.4 -2.4 7.2 -4.8 16.8 -4.8 7.2 -4.8 4.8 -2.4 P
3038.4 2047.2 2.4 -4.8 7.2 -2.4 16.8 -7.2 7.2 -2.4 4.8 -4.8 0 -9.6 -4.8 -4.8 
-7.2 -2.4 -12 0 -7.2 2.4 -4.8 4.8 -2.4 7.2 0 -14.4 2.4 7.2 P
3156 2056.8 21.6 -48 P
3158.4 2056.8 19.2 -40.8 P
3196.8 2056.8 -19.2 -48 -7.2 -14.4 -7.2 -7.2 -7.2 -2.4 -4.8 0 -2.4 2.4 2.4 4.8 
4.8 -4.8 P
3148.8 2056.8 21.6 0 P
3182.4 2056.8 21.6 0 P
1190.4 2299.2 4154.4 0 0 1245.6 ^ H
1190.4 2920.8 21.6 0 P
1233.6 2920.8 19.2 0 P
1274.4 2920.8 21.6 0 P
1315.2 2920.8 21.6 0 P
1358.4 2920.8 19.2 0 P
1399.2 2920.8 21.6 0 P
1440 2920.8 21.6 0 P
1483.2 2920.8 19.2 0 P
1524 2920.8 21.6 0 P
1564.8 2920.8 21.6 0 P
1608 2920.8 19.2 0 P
1648.8 2920.8 19.2 0 P
1689.6 2920.8 21.6 0 P
1730.4 2920.8 21.6 0 P
1773.6 2920.8 19.2 0 P
1814.4 2920.8 21.6 0 P
1855.2 2920.8 21.6 0 P
1898.4 2920.8 19.2 0 P
1939.2 2920.8 21.6 0 P
1980 2920.8 21.6 0 P
2020.8 2923.2 0 19.2 P
2020.8 2964 0 19.2 P
2020.8 3004.8 0 21.6 P
2020.8 3045.6 0 21.6 P
2020.8 3088.8 0 19.2 P
2042.4 3110.4 19.2 0 P
2083.2 3110.4 21.6 0 P
2124 3110.4 21.6 0 P
2167.2 3110.4 19.2 0 P
2188.8 3088.8 0 -19.2 P
2188.8 3048 0 -21.6 P
2188.8 3007.2 0 -21.6 P
2188.8 2966.4 0 -21.6 P
2188.8 2923.2 0 -19.2 P
2188.8 2882.4 0 -21.6 P
2188.8 2841.6 0 -21.6 P
2188.8 2798.4 19.2 0 P
2229.6 2798.4 19.2 0 S
2270.4 2798.4 19.2 0 P
2311.2 2798.4 21.6 0 P
2352 2798.4 2.4 0 0 19.2 P
2354.4 2839.2 0 12 7.2 0 P
2380.8 2851.2 21.6 0 P
2424 2851.2 19.2 0 P
2464.8 2851.2 21.6 0 P
2505.6 2851.2 14.4 0 0 -4.8 P
2520 2824.8 0 -9.6 12 0 P
2553.6 2815.2 19.2 0 P
2594.4 2815.2 21.6 0 P
2635.2 2815.2 21.6 0 P
2678.4 2815.2 7.2 0 0 14.4 P
2685.6 2848.8 0 21.6 P
2685.6 2889.6 0 21.6 P
2685.6 2932.8 0 9.6 12 0 P
2719.2 2942.4 19.2 0 P
2760 2942.4 19.2 0 P
2800.8 2942.4 21.6 0 P
2841.6 2942.4 9.6 0 0 -12 P
2851.2 2911.2 0 -9.6 12 0 P
2884.8 2901.6 21.6 0 P
2925.6 2901.6 21.6 0 P
2968.8 2901.6 19.2 0 P
3009.6 2901.6 9.6 0 0 12 P
3028.8 2923.2 21.6 0 P
3069.6 2923.2 21.6 0 P
3110.4 2923.2 21.6 0 P
3153.6 2923.2 19.2 0 P
3189.6 2918.4 19.2 0 P
3230.4 2918.4 21.6 0 P
3271.2 2918.4 21.6 0 P
3312 2918.4 21.6 0 P
3350.4 2920.8 21.6 0 P
3393.6 2920.8 19.2 0 P
3434.4 2920.8 21.6 0 P
3475.2 2920.8 21.6 0 P
3516 2920.8 0 19.2 2.4 0 P
3540 2940 21.6 0 P
3580.8 2940 21.6 0 P
3624 2940 19.2 0 P
3664.8 2940 16.8 0 0 -2.4 P
3698.4 2932.8 21.6 0 P
3741.6 2932.8 19.2 0 P
3782.4 2932.8 19.2 0 P
3823.2 2932.8 21.6 0 P
3859.2 2937.6 21.6 0 P
3902.4 2937.6 19.2 0 P
3943.2 2937.6 19.2 0 P
3984 2937.6 21.6 0 P
4015.2 2928 0 -21.6 P
4015.2 2884.8 0 -16.8 4.8 0 P
4039.2 2868 21.6 0 P
4082.4 2868 19.2 0 P
4123.2 2868 19.2 0 P
4164 2868 16.8 0 0 -2.4 P
4180.8 2844 0 -21.6 P
4192.8 2815.2 21.6 0 S
4236 2815.2 19.2 0 P
4276.8 2815.2 21.6 0 P
4317.6 2815.2 21.6 0 P
4346.4 2827.2 0 21.6 P
4346.4 2870.4 0 19.2 P
4346.4 2911.2 0 21.6 P
4346.4 2952 0 21.6 P
4346.4 2995.2 0 19.2 P
4346.4 3036 0 21.6 P
4346.4 3076.8 0 21.6 P
4346.4 3120 0 19.2 P
4346.4 3160.8 0 19.2 P
4346.4 3201.6 0 21.6 P
4346.4 3242.4 0 21.6 P
4346.4 3285.6 0 19.2 P
4346.4 3326.4 0 21.6 P
4346.4 3367.2 0 21.6 P
4346.4 3410.4 0 19.2 P
4346.4 3451.2 0 21.6 P
4346.4 3492 0 21.6 P
4346.4 3535.2 0 9.6 P
4514.4 3544.8 0 -9.6 P
4514.4 3513.6 0 -19.2 P
4514.4 3472.8 0 -21.6 P
4514.4 3432 0 -21.6 P
4514.4 3388.8 0 -19.2 P
4514.4 3348 0 -21.6 P
4514.4 3307.2 0 -21.6 P
4514.4 3264 0 -19.2 P
4514.4 3223.2 0 -21.6 P
4514.4 3182.4 0 -21.6 P
4514.4 3139.2 0 -19.2 P
4514.4 3098.4 0 -19.2 P
4514.4 3057.6 0 -21.6 P
4514.4 3016.8 0 -21.6 P
4514.4 2973.6 0 -19.2 P
4514.4 2932.8 0 -12 9.6 0 P
4543.2 2920.8 21.6 0 P
4586.4 2920.8 19.2 0 P
4627.2 2920.8 21.6 0 P
4668 2920.8 21.6 0 P
4711.2 2920.8 19.2 0 P
4752 2920.8 19.2 0 P
4792.8 2920.8 21.6 0 P
4833.6 2920.8 21.6 0 P
4876.8 2920.8 19.2 0 P
4917.6 2920.8 21.6 0 P
4958.4 2920.8 21.6 0 P
5001.6 2920.8 19.2 0 P
5042.4 2920.8 21.6 0 P
5083.2 2920.8 21.6 0 P
5126.4 2920.8 19.2 0 P
5167.2 2920.8 19.2 0 P
5208 2920.8 21.6 0 P
5248.8 2920.8 21.6 0 P
5292 2920.8 19.2 0 P
5332.8 2920.8 12 0 P
5344.8 2299.2 0 0 P
1190.4 2299.2 0 124.8 P
1329.6 2340 0 -40.8 P
1468.8 2299.2 0 40.8 P
1605.6 2340 0 -40.8 P
1744.8 2299.2 0 40.8 P
1884 2424 0 -124.8 S
2020.8 2299.2 0 40.8 P
2160 2340 0 -40.8 P
2299.2 2299.2 0 40.8 S
2436 2340 0 -40.8 P
2575.2 2299.2 0 124.8 P
2714.4 2340 0 -40.8 P
2853.6 2299.2 0 40.8 P
2990.4 2340 0 -40.8 P
3129.6 2299.2 0 40.8 P
3266.4 2424 0 -124.8 P
3405.6 2299.2 0 40.8 P
3544.8 2340 0 -40.8 P
3681.6 2299.2 0 40.8 P
3820.8 2340 0 -40.8 P
3960 2299.2 0 124.8 P
4099.2 2340 0 -40.8 P
4236 2299.2 0 40.8 P
4375.2 2340 0 -40.8 P
4514.4 2299.2 0 40.8 P
4651.2 2424 0 -124.8 P
4790.4 2299.2 0 40.8 P
4929.6 2340 0 -40.8 P
5066.4 2299.2 0 40.8 P
5205.6 2340 0 -40.8 P
5344.8 2299.2 0 124.8 P
1125.6 2188.8 62.4 0 P
1255.2 2220 -4.8 -2.4 4.8 -4.8 2.4 4.8 0 2.4 -2.4 7.2 -7.2 2.4 -12 0 
-9.6 -2.4 -7.2 -7.2 -7.2 -21.6 0 -19.2 4.8 -12 7.2 -4.8 9.6 -4.8 7.2 0 
9.6 4.8 7.2 4.8 2.4 12 0 2.4 -2.4 12 -7.2 4.8 -9.6 4.8 -4.8 0 
-9.6 -4.8 -7.2 -4.8 -2.4 -12 P
1236 2229.6 -7.2 -2.4 -9.6 -14.4 -2.4 -14.4 0 -19.2 2.4 -12 14.4 -9.6 P
1240.8 2157.6 14.4 9.6 2.4 12 0 2.4 -2.4 12 -14.4 9.6 P
1816.8 2188.8 62.4 0 P
1936.8 2224.8 0 -67.2 P
1939.2 2229.6 0 -72 P
1939.2 2229.6 -38.4 -50.4 55.2 0 P
1924.8 2157.6 24 0 P
2510.4 2188.8 62.4 0 P
2599.2 2217.6 4.8 -4.8 -4.8 -2.4 -2.4 2.4 0 4.8 2.4 7.2 4.8 2.4 9.6 2.4 
14.4 0 9.6 -2.4 4.8 -2.4 2.4 -7.2 0 -7.2 -2.4 -7.2 -12 -7.2 -16.8 -7.2 
-7.2 -2.4 -7.2 -7.2 -2.4 -12 0 -9.6 P
2628 2229.6 7.2 -2.4 2.4 -2.4 4.8 -7.2 0 -7.2 -4.8 -7.2 -9.6 -7.2 -14.4 -7.2 P
2596.8 2164.8 2.4 2.4 7.2 0 16.8 -4.8 12 0 7.2 2.4 2.4 2.4 S
2606.4 2167.2 16.8 -9.6 14.4 0 4.8 4.8 2.4 4.8 0 7.2 P
3264 2229.6 -9.6 -2.4 -7.2 -9.6 -4.8 -19.2 0 -9.6 4.8 -16.8 7.2 -9.6 9.6 -4.8 
7.2 0 9.6 4.8 7.2 9.6 4.8 16.8 0 9.6 -4.8 19.2 -7.2 9.6 -9.6 2.4 
-7.2 0 -7.2 -2.4 -2.4 -2.4 -4.8 -7.2 -2.4 -19.2 0 -9.6 2.4 -16.8 4.8 -7.2 
2.4 -2.4 7.2 -4.8 P
3271.2 2157.6 7.2 4.8 2.4 2.4 4.8 7.2 2.4 16.8 0 9.6 -2.4 19.2 -4.8 7.2 
-2.4 2.4 -7.2 2.4 P
3938.4 2217.6 4.8 -4.8 -4.8 -2.4 -2.4 2.4 0 4.8 2.4 7.2 4.8 2.4 9.6 2.4 
14.4 0 9.6 -2.4 2.4 -2.4 4.8 -7.2 0 -7.2 -4.8 -7.2 -9.6 -7.2 -16.8 -7.2 
-7.2 -2.4 -7.2 -7.2 -2.4 -12 0 -9.6 P
3967.2 2229.6 7.2 -2.4 2.4 -2.4 2.4 -7.2 0 -7.2 -2.4 -7.2 -9.6 -7.2 -14.4 -7.2 P
3936 2164.8 2.4 2.4 7.2 0 16.8 -4.8 12 0 9.6 4.8 P
3945.6 2167.2 16.8 -9.6 14.4 0 2.4 4.8 4.8 4.8 0 7.2 P
4658.4 2224.8 0 -67.2 P
4660.8 2229.6 0 -72 P
4660.8 2229.6 -36 -50.4 55.2 0 P
4648.8 2157.6 24 0 P
5361.6 2220 -4.8 -2.4 4.8 -4.8 2.4 4.8 0 2.4 -2.4 7.2 -7.2 2.4 -12 0 
-9.6 -2.4 -7.2 -7.2 -7.2 -21.6 0 -19.2 4.8 -12 7.2 -4.8 9.6 -4.8 7.2 0 
9.6 4.8 7.2 4.8 4.8 12 0 2.4 -4.8 12 -7.2 4.8 -9.6 4.8 -4.8 0 
-9.6 -4.8 -7.2 -4.8 -2.4 -12 P
5342.4 2229.6 -4.8 -2.4 -7.2 -7.2 -4.8 -7.2 -2.4 -14.4 0 -19.2 2.4 -12 14.4 -9.6 P
5347.2 2157.6 14.4 9.6 2.4 12 0 2.4 -2.4 12 -14.4 9.6 S
1190.4 3420 0 124.8 P
1329.6 3544.8 0 -40.8 P
1468.8 3504 0 40.8 P
1605.6 3544.8 0 -40.8 P
1744.8 3504 0 40.8 P
1884 3544.8 0 -124.8 P
2020.8 3504 0 40.8 P
2160 3544.8 0 -40.8 P
2299.2 3504 0 40.8 P
2436 3544.8 0 -40.8 P
2575.2 3420 0 124.8 P
2714.4 3544.8 0 -40.8 P
2853.6 3504 0 40.8 P
2990.4 3544.8 0 -40.8 P
3129.6 3504 0 40.8 P
3266.4 3544.8 0 -124.8 P
3405.6 3504 0 40.8 P
3544.8 3544.8 0 -40.8 P
3681.6 3504 0 40.8 P
3820.8 3544.8 0 -40.8 P
3960 3420 0 124.8 P
4099.2 3544.8 0 -40.8 P
4236 3504 0 40.8 P
4375.2 3544.8 0 -40.8 P
4514.4 3504 0 40.8 P
4651.2 3544.8 0 -124.8 P
4790.4 3504 0 40.8 P
4929.6 3544.8 0 -40.8 P
5066.4 3504 0 40.8 P
5205.6 3544.8 0 -40.8 P
5344.8 3420 0 124.8 P
1190.4 2299.2 124.8 0 P
1233.6 2335.2 -43.2 0 P
1190.4 2368.8 43.2 0 P
1233.6 2400 -43.2 0 P
1190.4 2433.6 43.2 0 P
1315.2 2462.4 -124.8 0 P
1190.4 2493.6 43.2 0 P
1233.6 2520 -43.2 0 P
1190.4 2548.8 43.2 0 P
1233.6 2575.2 -43.2 0 P
1190.4 2601.6 124.8 0 P
1233.6 2628 -43.2 0 P
1190.4 2652 43.2 0 P
1233.6 2676 -43.2 0 P
1190.4 2697.6 43.2 0 P
1315.2 2721.6 -124.8 0 P
1190.4 2743.2 43.2 0 P
1233.6 2764.8 -43.2 0 P
1190.4 2786.4 43.2 0 P
1233.6 2808 -43.2 0 P
1190.4 2827.2 124.8 0 P
1233.6 2846.4 -43.2 0 P
1190.4 2865.6 43.2 0 P
1233.6 2884.8 -43.2 0 P
1190.4 2904 43.2 0 P
1315.2 2920.8 -124.8 0 P
1190.4 3086.4 43.2 0 P
1233.6 3223.2 -43.2 0 P
1190.4 3343.2 43.2 0 P
1233.6 3451.2 -43.2 0 P
1190.4 3544.8 124.8 0 P
1008 2330.4 -9.6 -2.4 -7.2 -12 -4.8 -16.8 0 -9.6 4.8 -19.2 7.2 -9.6 9.6 -2.4 
7.2 0 9.6 2.4 7.2 9.6 4.8 19.2 0 9.6 -4.8 16.8 -7.2 12 -9.6 2.4 
-7.2 0 S
1008 2330.4 -7.2 -2.4 -2.4 -4.8 -4.8 -7.2 -2.4 -16.8 0 -9.6 2.4 -19.2 4.8 -4.8 
2.4 -4.8 7.2 -2.4 P
1015.2 2258.4 7.2 2.4 2.4 4.8 4.8 4.8 2.4 19.2 0 9.6 -2.4 16.8 -4.8 7.2 
-2.4 4.8 -7.2 2.4 P
1063.2 2265.6 -2.4 -4.8 2.4 -2.4 4.8 2.4 -4.8 4.8 P
1099.2 2330.4 -7.2 -33.6 7.2 4.8 9.6 4.8 9.6 0 12 -4.8 7.2 -4.8 2.4 -12 
0 -7.2 -2.4 -9.6 -7.2 -7.2 -12 -2.4 -9.6 0 -9.6 2.4 -4.8 4.8 -2.4 4.8 
0 4.8 2.4 2.4 4.8 -2.4 -4.8 -4.8 P
1118.4 2306.4 14.4 -9.6 4.8 -12 0 -7.2 -4.8 -9.6 -7.2 -7.2 -7.2 -2.4 P
1099.2 2330.4 33.6 0 P
1099.2 2328 16.8 0 16.8 2.4 P
1008 2632.8 -9.6 -2.4 -7.2 -12 -4.8 -16.8 0 -9.6 4.8 -19.2 7.2 -9.6 9.6 -2.4 
7.2 0 9.6 2.4 7.2 9.6 4.8 19.2 0 9.6 -4.8 16.8 -7.2 12 -9.6 2.4 
-7.2 0 -7.2 -2.4 -2.4 -4.8 -4.8 -7.2 -2.4 -16.8 0 -9.6 2.4 -19.2 4.8 -4.8 
2.4 -4.8 7.2 -2.4 P
1015.2 2560.8 7.2 2.4 2.4 4.8 4.8 4.8 2.4 19.2 0 9.6 -2.4 16.8 -4.8 7.2 
-2.4 4.8 -7.2 2.4 P
1063.2 2568 -2.4 -4.8 2.4 -2.4 4.8 2.4 -4.8 4.8 P
1092 2632.8 0 -21.6 P
1092 2618.4 2.4 7.2 7.2 7.2 7.2 0 16.8 -9.6 7.2 0 4.8 2.4 2.4 7.2 P
1094.4 2625.6 7.2 4.8 7.2 0 16.8 -7.2 P
1140 2632.8 0 -9.6 -2.4 -12 -14.4 -16.8 -4.8 -7.2 -2.4 -9.6 0 -16.8 P
1137.6 2611.2 -19.2 -16.8 -2.4 -7.2 -4.8 -9.6 0 -16.8 P
998.4 2940 7.2 2.4 9.6 9.6 0 -72 S
1012.8 2949.6 0 -69.6 P
998.4 2880 31.2 0 P
1063.2 2887.2 -2.4 -2.4 2.4 -4.8 4.8 4.8 -4.8 2.4 P
1111.2 2952 -9.6 -2.4 -7.2 -9.6 -2.4 -16.8 0 -12 2.4 -16.8 7.2 -9.6 9.6 -4.8 
7.2 0 12 4.8 7.2 9.6 2.4 16.8 0 12 -2.4 16.8 -7.2 9.6 -12 2.4 
-7.2 0 -9.6 -4.8 -2.4 -7.2 -4.8 -16.8 0 -12 4.8 -16.8 2.4 -7.2 4.8 -2.4 
4.8 -4.8 P
1118.4 2880 7.2 4.8 4.8 2.4 2.4 7.2 4.8 16.8 0 12 -4.8 16.8 -2.4 7.2 
-4.8 2.4 -7.2 2.4 P
991.2 3561.6 2.4 -2.4 -2.4 -4.8 -4.8 4.8 0 2.4 4.8 7.2 2.4 4.8 12 2.4 
12 0 12 -2.4 2.4 -4.8 4.8 -7.2 0 -7.2 -4.8 -7.2 -9.6 -4.8 -16.8 -7.2 
-7.2 -4.8 -7.2 -7.2 -4.8 -9.6 0 -9.6 P
1017.6 3576 7.2 -2.4 4.8 -4.8 2.4 -7.2 0 -7.2 -2.4 -7.2 -12 -4.8 -12 -7.2 P
986.4 3511.2 4.8 2.4 7.2 0 16.8 -7.2 9.6 0 7.2 4.8 4.8 2.4 P
998.4 3513.6 16.8 -9.6 14.4 0 2.4 2.4 4.8 7.2 0 7.2 P
1063.2 3511.2 -2.4 -4.8 2.4 -2.4 4.8 2.4 -4.8 4.8 P
1111.2 3576 -9.6 -2.4 -7.2 -12 -2.4 -16.8 0 -9.6 2.4 -19.2 7.2 -9.6 9.6 -2.4 
7.2 0 12 2.4 7.2 9.6 2.4 19.2 0 9.6 -2.4 16.8 -7.2 12 -12 2.4 
-7.2 0 -4.8 -2.4 -4.8 -4.8 -2.4 -7.2 -4.8 -16.8 0 -9.6 4.8 -19.2 2.4 -4.8 
4.8 -4.8 4.8 -2.4 P
1118.4 3504 7.2 2.4 4.8 4.8 2.4 4.8 4.8 19.2 0 9.6 -4.8 16.8 -2.4 7.2 
-4.8 4.8 -7.2 2.4 P
5220 2299.2 124.8 0 S
5344.8 2335.2 -43.2 0 P
5301.6 2368.8 43.2 0 P
5344.8 2400 -43.2 0 P
5301.6 2433.6 43.2 0 P
5344.8 2462.4 -124.8 0 P
5301.6 2493.6 43.2 0 P
5344.8 2520 -43.2 0 P
5301.6 2548.8 43.2 0 P
5344.8 2575.2 -43.2 0 P
5220 2601.6 124.8 0 P
5344.8 2628 -43.2 0 P
5301.6 2652 43.2 0 P
5344.8 2676 -43.2 0 P
5301.6 2697.6 43.2 0 P
5344.8 2721.6 -124.8 0 P
5301.6 2743.2 43.2 0 P
5344.8 2764.8 -43.2 0 P
5301.6 2786.4 43.2 0 P
5344.8 2808 -43.2 0 P
5220 2827.2 124.8 0 P
5344.8 2846.4 -43.2 0 P
5301.6 2865.6 43.2 0 P
5344.8 2884.8 -43.2 0 P
5301.6 2904 43.2 0 P
5344.8 2920.8 -124.8 0 P
5301.6 3086.4 43.2 0 P
5344.8 3223.2 -43.2 0 P
5301.6 3343.2 43.2 0 P
5344.8 3451.2 -43.2 0 P
5220 3544.8 124.8 0 S
255 0 r3
1190.4 2920.8 21.6 0 P
1233.6 2920.8 19.2 0 P
1274.4 2920.8 21.6 0 P
1315.2 2920.8 21.6 0 P
1358.4 2920.8 19.2 0 P
1399.2 2920.8 21.6 0 P
1440 2920.8 21.6 0 P
1483.2 2920.8 19.2 0 P
1524 2920.8 21.6 0 P
1564.8 2920.8 21.6 0 P
1608 2920.8 19.2 0 P
1648.8 2920.8 19.2 0 P
1689.6 2920.8 21.6 0 P
1730.4 2920.8 21.6 0 P
1773.6 2920.8 19.2 0 P
1814.4 2920.8 21.6 0 P
1855.2 2920.8 21.6 0 P
1898.4 2920.8 19.2 0 P
1939.2 2920.8 21.6 0 P
1980 2920.8 21.6 0 P
2020.8 2920.8 0 -19.2 P
2020.8 2880 0 -19.2 P
2020.8 2839.2 0 -21.6 P
2020.8 2798.4 0 -21.6 P
2020.8 2755.2 0 -19.2 P
2020.8 2714.4 0 -21.6 P
2020.8 2673.6 0 -21.6 P
2020.8 2630.4 0 -19.2 P
2020.8 2589.6 0 -21.6 P
2020.8 2548.8 0 -21.6 P
2023.2 2508 21.6 0 P
2066.4 2508 19.2 0 P
2107.2 2508 19.2 0 P
2148 2508 21.6 0 P
2188.8 2510.4 0 21.6 P
2188.8 2551.2 0 21.6 P
2188.8 2594.4 0 19.2 P
2188.8 2635.2 0 19.2 P
2188.8 2676 0 21.6 P
2188.8 2716.8 0 21.6 P
2188.8 2760 0 19.2 P
2188.8 2800.8 0 21.6 P
2188.8 2841.6 0 21.6 P
2188.8 2884.8 0 19.2 P
2188.8 2923.2 21.6 0 P
2232 2923.2 19.2 0 P
2272.8 2923.2 19.2 0 P
2313.6 2923.2 21.6 0 P
2354.4 2925.6 0 21.6 P
2354.4 2966.4 0 21.6 P
2354.4 3009.6 0 19.2 P
2354.4 3050.4 0 19.2 P
2354.4 3091.2 0 7.2 14.4 0 P
2390.4 3098.4 19.2 0 P
2431.2 3098.4 21.6 0 P
2472 3098.4 21.6 0 P
2515.2 3098.4 4.8 0 0 -14.4 P
2520 3062.4 0 -21.6 P
2520 3021.6 0 -21.6 P
2520 2978.4 0 -19.2 P
2524.8 2942.4 21.6 0 P
2568 2942.4 19.2 0 P
2608.8 2942.4 21.6 0 S
2649.6 2942.4 21.6 0 P
2685.6 2949.6 0 4.8 14.4 0 P
2721.6 2954.4 21.6 0 P
2762.4 2954.4 21.6 0 P
2805.6 2954.4 19.2 0 P
2846.4 2954.4 4.8 0 0 9.6 7.2 0 P
2880 2964 19.2 0 P
2920.8 2964 21.6 0 P
2961.6 2964 21.6 0 P
3002.4 2964 16.8 0 0 -4.8 P
3036 2956.8 21.6 0 P
3079.2 2956.8 19.2 0 P
3120 2956.8 21.6 0 P
3160.8 2956.8 21.6 0 P
3184.8 2973.6 0 2.4 19.2 0 P
3225.6 2976 19.2 0 P
3266.4 2976 19.2 0 P
3307.2 2976 21.6 0 P
3348 2976 2.4 0 0 -4.8 14.4 0 P
3386.4 2971.2 19.2 0 P
3427.2 2971.2 21.6 0 P
3468 2971.2 21.6 0 P
3511.2 2971.2 4.8 0 0 14.4 P
3523.2 3000 21.6 0 P
3566.4 3000 19.2 0 P
3607.2 3000 19.2 0 P
3648 3000 21.6 0 P
3681.6 2992.8 0 -9.6 12 0 P
3715.2 2983.2 19.2 0 P
3756 2983.2 21.6 0 P
3796.8 2983.2 21.6 0 P
3840 2983.2 9.6 0 0 9.6 P
3854.4 3007.2 21.6 0 P
3897.6 3007.2 19.2 0 P
3938.4 3007.2 21.6 0 P
3979.2 3007.2 21.6 0 P
4015.2 3002.4 0 -21.6 P
4015.2 2959.2 0 -19.2 P
4015.2 2918.4 0 -21.6 P
4015.2 2877.6 0 -21.6 P
4015.2 2834.4 0 -19.2 P
4017.6 2796 21.6 0 P
4060.8 2796 19.2 0 P
4101.6 2796 21.6 0 P
4142.4 2796 21.6 0 P
4180.8 2800.8 0 19.2 P
4180.8 2841.6 0 21.6 P
4180.8 2882.4 0 21.6 P
4180.8 2925.6 0 19.2 P
4180.8 2966.4 0 21.6 P
4200 2990.4 19.2 0 P
4240.8 2990.4 21.6 0 P
4281.6 2990.4 21.6 0 P
4324.8 2990.4 19.2 0 P
4346.4 3007.2 0 4.8 19.2 0 P
4384.8 3012 21.6 0 P
4428 3012 19.2 0 P
4468.8 3012 21.6 0 P
4509.6 3012 4.8 0 0 -19.2 S
4514.4 2973.6 0 -21.6 P
4514.4 2930.4 0 -9.6 9.6 0 P
4545.6 2920.8 21.6 0 P
4586.4 2920.8 21.6 0 P
4629.6 2920.8 19.2 0 P
4670.4 2920.8 21.6 0 P
4711.2 2920.8 21.6 0 P
4754.4 2920.8 19.2 0 P
4795.2 2920.8 19.2 0 P
4836 2920.8 21.6 0 P
4876.8 2920.8 21.6 0 P
4920 2920.8 19.2 0 P
4960.8 2920.8 21.6 0 P
5001.6 2920.8 21.6 0 P
5044.8 2920.8 19.2 0 P
5085.6 2920.8 21.6 0 P
5126.4 2920.8 21.6 0 P
5169.6 2920.8 19.2 0 P
5210.4 2920.8 19.2 0 P
5251.2 2920.8 21.6 0 P
5292 2920.8 21.6 0 P
5335.2 2920.8 9.6 0 P
5344.8 2299.2 0 0 S
cleartomark end end pagesave restore
 showpage
%%PageTrailer
%%Trailer
%%Pages: 1
%%Trailer
cleartomark
countdictstack
exch sub { end } repeat
restore
%%EOF
