%!PS-Adobe-2.0 EPSF-2.0
%%BoundingBox:  0 0 567 384
%%Title: plots/DF_CutSR2_1jet_MT.eps: c1
%%Creator: ROOT Version 5.30/00
%%CreationDate: Tue Apr  2 16:05:20 2013
%%EndComments
%%BeginProlog
80 dict begin
/s {stroke} def /l {lineto} def /m {moveto} def /t {translate} def
/r {rotate} def /rl {roll}  def /R {repeat} def
/d {rlineto} def /rm {rmoveto} def /gr {grestore} def /f {eofill} def
/c {setrgbcolor} def /black {0 setgray} def /sd {setdash} def
/cl {closepath} def /sf {scalefont setfont} def /lw {setlinewidth} def
/box {m dup 0 exch d exch 0 d 0 exch neg d cl} def
/NC{systemdict begin initclip end}def/C{NC box clip newpath}def
/bl {box s} def /bf {box f} def /Y { 0 exch d} def /X { 0 d} def 
/K {{pop pop 0 moveto} exch kshow} bind def
/ita {/ang 15 def gsave [1 0 ang dup sin exch cos div 1 0 0] concat} def 
/mp {newpath /y exch def /x exch def} def
/side {[w .77 mul w .23 mul] .385 w mul sd w 0 l currentpoint t -144 r} def
/mr {mp x y w2 0 360 arc} def /m24 {mr s} def /m20 {mr f} def
/mb {mp x y w2 add m w2 neg 0 d 0 w neg d w 0 d 0 w d cl} def
/mt {mp x y w2 add m w2 neg w neg d w 0 d cl} def
/m21 {mb f} def /m25 {mb s} def /m22 {mt f} def /m26{mt s} def
/m23 {mp x y w2 sub m w2 w d w neg 0 d cl f} def
/m27 {mp x y w2 add m w3 neg w2 neg d w3 w2 neg d w3 w2 d cl s} def
/m28 {mp x w2 sub y w2 sub w3 add m w3 0 d  0 w3 neg d w3 0 d 0 w3 d w3 0 d  0 w3 d w3 neg 0 d 0 w3 d w3 neg 0 d 0 w3 neg d w3 neg 0 d cl s } def
/m29 {mp gsave x w2 sub y w2 add w3 sub m currentpoint t 4 {side} repeat cl fill gr} def
/m30 {mp gsave x w2 sub y w2 add w3 sub m currentpoint t 4 {side} repeat cl s gr} def
/m31 {mp x y w2 sub m 0 w d x w2 sub y m w 0 d x w2 sub y w2 add m w w neg d x w2 sub y w2 sub m w w d s} def
/m32 {mp x y w2 sub m w2 w d w neg 0 d cl s} def
/m33 {mp x y w2 add m w3 neg w2 neg d w3 w2 neg d w3 w2 d cl f} def
/m34 {mp x w2 sub y w2 sub w3 add m w3 0 d  0 w3 neg d w3 0 d 0 w3 d w3 0 d  0 w3 d w3 neg 0 d 0 w3 d w3 neg 0 d 0 w3 neg d w3 neg 0 d cl f } def
/m2 {mp x y w2 sub m 0 w d x w2 sub y m w 0 d s} def
/m5 {mp x w2 sub y w2 sub m w w d x w2 sub y w2 add m w w neg d s} def
/reEncode {exch findfont dup length dict begin {1 index /FID eq  {pop pop} {def} ifelse } forall /Encoding exch def currentdict end dup /FontName get exch definefont pop } def [/Times-Bold /Times-Italic /Times-BoldItalic /Helvetica /Helvetica-Oblique
 /Helvetica-Bold /Helvetica-BoldOblique /Courier /Courier-Oblique /Courier-Bold /Courier-BoldOblique /Times-Roman /AvantGarde-Book /AvantGarde-BookOblique /AvantGarde-Demi /AvantGarde-DemiOblique /Bookman-Demi /Bookman-DemiItalic /Bookman-Light
 /Bookman-LightItalic /Helvetica-Narrow /Helvetica-Narrow-Bold /Helvetica-Narrow-BoldOblique /Helvetica-Narrow-Oblique /NewCenturySchlbk-Roman /NewCenturySchlbk-Bold /NewCenturySchlbk-BoldItalic /NewCenturySchlbk-Italic /Palatino-Bold
 /Palatino-BoldItalic /Palatino-Italic /Palatino-Roman ] {ISOLatin1Encoding reEncode } forall%%EndProlog
%%BeginSetup
%%EndSetup
newpath  gsave  .25 .25 scale  gsave  0 0 t black[  ] 0 sd 3 lw 1 1 1 c 2268 1538 0 0 bf black 1 1 1 c 2268 923 0 615 bf black 1 1 1 c 1701 831 340 615 bf black 1701 831 340 615 bl 1 1 1 c black 340 853 m 122 X 125 Y 121 X 149 Y 122 X 113 Y 121 X 82
 Y 122 X 45 Y 121 X -2 Y 122 X -49 Y 121 X -92 Y 122 X -145 Y 121 X -185 Y 121 X -122 Y 122 X -63 Y 121 X -35 Y 122 X s 340 615 m 1701 X s
 gsave  2268 923 0 615 C 1915.83 488.732 t 0 r /Helvetica-Bold findfont 42.3867 sf 0 0 m ( [GeV]) show NC gr 
 gsave  2268 923 0 615 C 1896.28 472.441 t 0 r /Helvetica-Bold findfont 29.3446 sf 0 0 m (T) show NC gr 
 gsave  2268 923 0 615 C 1857.18 488.732 t 0 r /Helvetica-BoldOblique findfont 42.3867 sf 0 0 m (m) show NC gr  462 636 m -21 Y s 522 626 m -11 Y s 583 626 m -11 Y s 644 626 m -11 Y s 705 636 m -21 Y s 765 626 m -11 Y s 826 626 m -11 Y s 887 626 m
 -11 Y s 948 636 m -21 Y s 1008 626 m -11 Y s 1069 626 m -11 Y s 1130 626 m -11 Y s 1191 636 m -21 Y s 1251 626 m -11 Y s 1312 626 m -11 Y s 1373 626 m -11 Y s 1434 636 m -21 Y s 1494 626 m -11 Y s 1555 626 m -11 Y s 1616 626 m -11 Y s 1676 636 m -21
 Y s 1737 626 m -11 Y s 1798 626 m -11 Y s 1859 626 m -11 Y s 1919 636 m -21 Y s 462 636 m -21 Y s 401 626 m -11 Y s 1919 636 m -21 Y s 1980 626 m -11 Y s
 gsave  2268 923 0 615 C 436.601 576.704 t 0 r /Helvetica-Bold findfont 42.3867 sf 0 0 m (80) show NC gr 
 gsave  2268 923 0 615 C 667.934 576.704 t 0 r /Helvetica-Bold findfont 42.3867 sf 0 0 m (100) show NC gr 
 gsave  2268 923 0 615 C 909.042 576.704 t 0 r /Helvetica-Bold findfont 42.3867 sf 0 0 m (120) show NC gr 
 gsave  2268 923 0 615 C 1153.41 576.704 t 0 r /Helvetica-Bold findfont 42.3867 sf 0 0 m (140) show NC gr 
 gsave  2268 923 0 615 C 1394.52 576.704 t 0 r /Helvetica-Bold findfont 42.3867 sf 0 0 m (160) show NC gr 
 gsave  2268 923 0 615 C 1638.88 576.704 t 0 r /Helvetica-Bold findfont 42.3867 sf 0 0 m (180) show NC gr 
 gsave  2268 923 0 615 C 1883.25 576.704 t 0 r /Helvetica-Bold findfont 42.3867 sf 0 0 m (200) show NC gr  340 615 m 831 Y s
 gsave  2268 923 0 615 C 188.976 1000.27 t 90 r /Helvetica-Bold findfont 42.3867 sf 0 0 m (Normalised to integral) show NC gr  401 615 m -61 X s 371 649 m -31 X s 371 683 m -31 X s 371 717 m -31 X s 401 750 m -61 X s 371 784 m -31 X s 371 818 m -31 X
 s 371 852 m -31 X s 401 886 m -61 X s 371 919 m -31 X s 371 953 m -31 X s 371 987 m -31 X s 401 1021 m -61 X s 371 1055 m -31 X s 371 1089 m -31 X s 371 1122 m -31 X s 401 1156 m -61 X s 371 1190 m -31 X s 371 1224 m -31 X s 371 1258 m -31 X s 401
 1291 m -61 X s 371 1325 m -31 X s 371 1359 m -31 X s 371 1393 m -31 X s 401 1427 m -61 X s 401 1427 m -61 X s
 gsave  2268 923 0 615 C 303.014 599.511 t 0 r /Helvetica-Bold findfont 42.3867 sf 0 0 m (0) show NC gr 
 gsave  2268 923 0 615 C 244.366 736.356 t 0 r /Helvetica-Bold findfont 42.3867 sf 0 0 m (0.02) show NC gr 
 gsave  2268 923 0 615 C 241.108 869.943 t 0 r /Helvetica-Bold findfont 42.3867 sf 0 0 m (0.04) show NC gr 
 gsave  2268 923 0 615 C 244.366 1006.79 t 0 r /Helvetica-Bold findfont 42.3867 sf 0 0 m (0.06) show NC gr 
 gsave  2268 923 0 615 C 244.366 1140.37 t 0 r /Helvetica-Bold findfont 42.3867 sf 0 0 m (0.08) show NC gr 
 gsave  2268 923 0 615 C 273.69 1277.22 t 0 r /Helvetica-Bold findfont 42.3867 sf 0 0 m (0.1) show NC gr 
 gsave  2268 923 0 615 C 244.366 1410.81 t 0 r /Helvetica-Bold findfont 42.3867 sf 0 0 m (0.12) show NC gr  1 1 0 c 1 1 1 c black 1 1 0 c 340 851 m 122 X 126 Y 121 X 153 Y 122 X 112 Y 121 X 84 Y 122 X 44 Y 121 X -1 Y 122 X -51 Y 121 X -94 Y 122 X
 -146 Y 121 X -185 Y 121 X -122 Y 122 X -63 Y 121 X -36 Y 122 X s 0 0 1 c 1 1 1 c black 0 0 1 c 340 856 m 122 X 123 Y 121 X 147 Y 122 X 112 Y 121 X 80 Y 122 X 45 Y 121 X -1 Y 122 X -48 Y 121 X -92 Y 122 X -142 Y 121 X -184 Y 121 X -123 Y 122 X -63 Y
 121 X -36 Y 122 X s 0 1 1 c 1 1 1 c black 0 1 1 c 340 854 m 122 X 125 Y 121 X 148 Y 122 X 113 Y 121 X 82 Y 122 X 44 Y 121 X -1 Y 122 X -49 Y 121 X -93 Y 122 X -145 Y 121 X -184 Y 121 X -122 Y 122 X -63 Y 121 X -35 Y 122 X s 0 1 0 c 1 1 1 c black 0 1
 0 c 340 856 m 122 X 123 Y 121 X 148 Y 122 X 110 Y 121 X 81 Y 122 X 45 Y 121 X -2 Y 122 X -47 Y 121 X -91 Y 122 X -144 Y 121 X -183 Y 121 X -123 Y 122 X -63 Y 121 X -36 Y 122 X s 1 0 1 c 1 1 1 c black 1 0 1 c 340 851 m 122 X 126 Y 121 X 152 Y 122 X
 113 Y 121 X 84 Y 122 X 44 Y 121 X -1 Y 122 X -50 Y 121 X -94 Y 122 X -147 Y 121 X -185 Y 121 X -122 Y 122 X -63 Y 121 X -35 Y 122 X s 1 0 0 c 1 1 1 c black 1 0 0 c 340 853 m 122 X 125 Y 121 X 149 Y 122 X 114 Y 121 X 81 Y 122 X 45 Y 121 X -1 Y 122 X
 -49 Y 121 X -93 Y 122 X -145 Y 121 X -185 Y 121 X -122 Y 122 X -63 Y 121 X -36 Y 122 X s black 1 1 1 c black 340 853 m 122 X 125 Y 121 X 149 Y 122 X 113 Y 121 X 82 Y 122 X 45 Y 121 X -2 Y 122 X -49 Y 121 X -92 Y 122 X -145 Y 121 X -185 Y 121 X -122
 Y 122 X -63 Y 121 X -35 Y 122 X s 1 1 1 c 2268 615 0 0 bf black 1 1 1 c 1701 486 340 129 bf black 1701 486 340 129 bl 1 1 1 c black 401 367 m 5 Y s 401 372 m 6 Y s 340 372 m 61 X s 401 372 m 61 X s /w 2 def /w2 {w 2 div} def /w3 {w 3 div} def 401
 372 m20 522 368 m 4 Y s 522 372 m 5 Y s 462 372 m 60 X s 522 372 m 61 X s 522 372 m20 644 365 m 7 Y s 644 372 m 7 Y s 583 372 m 61 X s 644 372 m 61 X s 644 372 m20 765 368 m 4 Y s 765 372 m 5 Y s 705 372 m 60 X s 765 372 m 61 X s 765 372 m20 887 367
 m 5 Y s 887 372 m 5 Y s 826 372 m 61 X s 887 372 m 61 X s 887 372 m20 1008 369 m 3 Y s 1008 372 m 3 Y s 948 372 m 60 X s 1008 372 m 61 X s 1008 372 m20 1130 369 m 3 Y s 1130 372 m 3 Y s 1069 372 m 61 X s 1130 372 m 61 X s 1130 372 m20 1251 370 m 2 Y
 s 1251 372 m 3 Y s 1191 372 m 60 X s 1251 372 m 61 X s 1251 372 m20 1373 368 m 4 Y s 1373 372 m 4 Y s 1312 372 m 61 X s 1373 372 m 61 X s 1373 372 m20 1494 369 m 3 Y s 1494 372 m 3 Y s 1434 372 m 60 X s 1494 372 m 61 X s 1494 372 m20 1616 368 m 4 Y
 s 1616 372 m 4 Y s 1555 372 m 61 X s 1616 372 m 60 X s 1616 372 m20 1737 365 m 7 Y s 1737 372 m 7 Y s 1676 372 m 61 X s 1737 372 m 61 X s 1737 372 m20 1859 366 m 6 Y s 1859 372 m 7 Y s 1798 372 m 61 X s 1859 372 m 60 X s 1859 372 m20 1980 361 m 11 Y
 s 1980 372 m 12 Y s 1919 372 m 61 X s 1980 372 m 61 X s 1980 372 m20 340 129 m 1701 X s
 gsave  2268 615 0 0 C 1915.83 42.3568 t 0 r /Helvetica-Bold findfont 42.537 sf 0 0 m ( [GeV]) show NC gr 
 gsave  2268 615 0 0 C 1896.28 26.0657 t 0 r /Helvetica-Bold findfont 29.4487 sf 0 0 m (T) show NC gr 
 gsave  2268 615 0 0 C 1857.18 42.3568 t 0 r /Helvetica-BoldOblique findfont 42.537 sf 0 0 m (m) show NC gr  462 143 m -14 Y s 522 136 m -7 Y s 583 136 m -7 Y s 644 136 m -7 Y s 705 143 m -14 Y s 765 136 m -7 Y s 826 136 m -7 Y s 887 136 m -7 Y s 948
 143 m -14 Y s 1008 136 m -7 Y s 1069 136 m -7 Y s 1130 136 m -7 Y s 1191 143 m -14 Y s 1251 136 m -7 Y s 1312 136 m -7 Y s 1373 136 m -7 Y s 1434 143 m -14 Y s 1494 136 m -7 Y s 1555 136 m -7 Y s 1616 136 m -7 Y s 1676 143 m -14 Y s 1737 136 m -7 Y
 s 1798 136 m -7 Y s 1859 136 m -7 Y s 1919 143 m -14 Y s 462 143 m -14 Y s 401 136 m -7 Y s 1919 143 m -14 Y s 1980 136 m -7 Y s
 gsave  2268 1455 0 0 C 2122.23 880.27 t 90 r /Helvetica-BoldOblique findfont 41.8538 sf 0 0 m (LHC HIGGS XS WG 2013) show NC gr  0.2 0.2 0.2 c black 0.2 0.2 0.2 c
 gsave  2268 615 0 0 C 436.601 91.23 t 0 r /Helvetica-Bold findfont 42.537 sf 0 0 m (80) show NC gr 
 gsave  2268 615 0 0 C 667.934 91.23 t 0 r /Helvetica-Bold findfont 42.537 sf 0 0 m (100) show NC gr 
 gsave  2268 615 0 0 C 909.042 91.23 t 0 r /Helvetica-Bold findfont 42.537 sf 0 0 m (120) show NC gr 
 gsave  2268 615 0 0 C 1153.41 91.23 t 0 r /Helvetica-Bold findfont 42.537 sf 0 0 m (140) show NC gr 
 gsave  2268 615 0 0 C 1394.52 91.23 t 0 r /Helvetica-Bold findfont 42.537 sf 0 0 m (160) show NC gr 
 gsave  2268 615 0 0 C 1638.88 91.23 t 0 r /Helvetica-Bold findfont 42.537 sf 0 0 m (180) show NC gr 
 gsave  2268 615 0 0 C 1883.25 91.23 t 0 r /Helvetica-Bold findfont 42.537 sf 0 0 m (200) show NC gr  340 129 m 486 Y s
 gsave  2268 615 0 0 C 192.235 322.563 t 90 r /Helvetica-Bold findfont 42.537 sf 0 0 m (Ratio) show NC gr  394 129 m -54 X s 367 141 m -27 X s 367 153 m -27 X s 367 166 m -27 X s 394 178 m -54 X s 367 190 m -27 X s 367 202 m -27 X s 367 214 m -27 X s
 394 226 m -54 X s 367 239 m -27 X s 367 251 m -27 X s 367 263 m -27 X s 394 275 m -54 X s 367 287 m -27 X s 367 299 m -27 X s 367 311 m -27 X s 394 324 m -54 X s 367 336 m -27 X s 367 348 m -27 X s 367 360 m -27 X s 394 372 m -54 X s 367 384 m -27 X
 s 367 396 m -27 X s 367 409 m -27 X s 394 421 m -54 X s 367 433 m -27 X s 367 445 m -27 X s 367 457 m -27 X s 394 469 m -54 X s 367 482 m -27 X s 367 494 m -27 X s 367 506 m -27 X s 394 518 m -54 X s 367 530 m -27 X s 367 542 m -27 X s 367 554 m -27
 X s 394 567 m -54 X s 367 579 m -27 X s 367 591 m -27 X s 367 603 m -27 X s 394 615 m -54 X s
 gsave  2268 615 0 0 C 267.173 114.037 t 0 r /Helvetica-Bold findfont 42.537 sf 0 0 m (0.9) show NC gr 
 gsave  2268 615 0 0 C 244.366 162.911 t 0 r /Helvetica-Bold findfont 42.537 sf 0 0 m (0.92) show NC gr 
 gsave  2268 615 0 0 C 241.108 211.784 t 0 r /Helvetica-Bold findfont 42.537 sf 0 0 m (0.94) show NC gr 
 gsave  2268 615 0 0 C 244.366 260.657 t 0 r /Helvetica-Bold findfont 42.537 sf 0 0 m (0.96) show NC gr 
 gsave  2268 615 0 0 C 244.366 309.53 t 0 r /Helvetica-Bold findfont 42.537 sf 0 0 m (0.98) show NC gr 
 gsave  2268 615 0 0 C 306.272 355.145 t 0 r /Helvetica-Bold findfont 42.537 sf 0 0 m (1) show NC gr 
 gsave  2268 615 0 0 C 244.366 407.277 t 0 r /Helvetica-Bold findfont 42.537 sf 0 0 m (1.02) show NC gr 
 gsave  2268 615 0 0 C 241.108 456.15 t 0 r /Helvetica-Bold findfont 42.537 sf 0 0 m (1.04) show NC gr 
 gsave  2268 615 0 0 C 244.366 501.765 t 0 r /Helvetica-Bold findfont 42.537 sf 0 0 m (1.06) show NC gr 
 gsave  2268 615 0 0 C 244.366 550.638 t 0 r /Helvetica-Bold findfont 42.537 sf 0 0 m (1.08) show NC gr 
 gsave  2268 615 0 0 C 273.69 596.253 t 0 r /Helvetica-Bold findfont 42.537 sf 0 0 m (1.1) show NC gr  1 1 0 c 1 1 1 c black 1 1 0 c 401 224 m 127 Y s 401 351 m 127 Y s 340 351 m 61 X s 401 351 m 61 X s black 401 351 m20 1 1 0 c 522 237 m 128 Y s 522
 365 m 127 Y s 462 365 m 60 X s 522 365 m 61 X s black 522 365 m20 1 1 0 c 644 257 m 129 Y s 644 386 m 129 Y s 583 386 m 61 X s 644 386 m 61 X s black 644 386 m20 1 1 0 c 765 249 m 128 Y s 765 377 m 129 Y s 705 377 m 60 X s 765 377 m 61 X s black 765
 377 m20 1 1 0 c 887 256 m 129 Y s 887 385 m 129 Y s 826 385 m 61 X s 887 385 m 61 X s black 887 385 m20 1 1 0 c 1008 253 m 129 Y s 1008 382 m 128 Y s 948 382 m 60 X s 1008 382 m 61 X s black 1008 382 m20 1 1 0 c 1130 254 m 129 Y s 1130 383 m 128 Y s
 1069 383 m 61 X s 1130 383 m 61 X s black 1130 383 m20 1 1 0 c 1251 251 m 129 Y s 1251 380 m 128 Y s 1191 380 m 60 X s 1251 380 m 61 X s black 1251 380 m20 1 1 0 c 1373 247 m 128 Y s 1373 375 m 128 Y s 1312 375 m 61 X s 1373 375 m 61 X s black 1373
 375 m20 1 1 0 c 1494 243 m 127 Y s 1494 370 m 128 Y s 1434 370 m 60 X s 1494 370 m 61 X s black 1494 370 m20 1 1 0 c 1616 234 m 127 Y s 1616 361 m 128 Y s 1555 361 m 61 X s 1616 361 m 60 X s black 1616 361 m20 1 1 0 c 1737 227 m 127 Y s 1737 354 m
 127 Y s 1676 354 m 61 X s 1737 354 m 61 X s black 1737 354 m20 1 1 0 c 1859 217 m 127 Y s 1859 344 m 126 Y s 1798 344 m 61 X s 1859 344 m 60 X s black 1859 344 m20 1 1 0 c 1980 202 m 126 Y s 1980 328 m 126 Y s 1919 328 m 61 X s 1980 328 m 61 X s
 black 1980 328 m20 0 0 1 c 1 1 1 c black 0 0 1 c 401 389 m 6 Y s 401 395 m 6 Y s 340 395 m 61 X s 401 395 m 61 X s black 401 395 m20 0 0 1 c 522 375 m 5 Y s 522 380 m 4 Y s 462 380 m 60 X s 522 380 m 61 X s black 522 380 m20 0 0 1 c 644 362 m 6 Y s
 644 368 m 7 Y s 583 368 m 61 X s 644 368 m 61 X s black 644 368 m20 0 0 1 c 765 357 m 4 Y s 765 361 m 5 Y s 705 361 m 60 X s 765 361 m 61 X s black 765 361 m20 0 0 1 c 887 352 m 5 Y s 887 357 m 4 Y s 826 357 m 61 X s 887 357 m 61 X s black 887 357
 m20 0 0 1 c 1008 357 m 3 Y s 1008 360 m 3 Y s 948 360 m 60 X s 1008 360 m 61 X s black 1008 360 m20 0 0 1 c 1130 357 m 4 Y s 1130 361 m 4 Y s 1069 361 m 61 X s 1130 361 m 61 X s black 1130 361 m20 0 0 1 c 1251 361 m 3 Y s 1251 364 m 3 Y s 1191 364 m
 60 X s 1251 364 m 61 X s black 1251 364 m20 0 0 1 c 1373 363 m 4 Y s 1373 367 m 3 Y s 1312 367 m 61 X s 1373 367 m 61 X s black 1373 367 m20 0 0 1 c 1494 375 m 3 Y s 1494 378 m 3 Y s 1434 378 m 60 X s 1494 378 m 61 X s black 1494 378 m20 0 0 1 c
 1616 383 m 4 Y s 1616 387 m 5 Y s 1555 387 m 61 X s 1616 387 m 60 X s black 1616 387 m20 0 0 1 c 1737 385 m 7 Y s 1737 392 m 7 Y s 1676 392 m 61 X s 1737 392 m 61 X s black 1737 392 m20 0 0 1 c 1859 399 m 7 Y s 1859 406 m 7 Y s 1798 406 m 61 X s
 1859 406 m 60 X s black 1859 406 m20 0 0 1 c 1980 396 m 11 Y s 1980 407 m 12 Y s 1919 407 m 61 X s 1980 407 m 61 X s black 1980 407 m20 0 1 0 c 1 1 1 c black 0 1 0 c 401 391 m 7 Y s 401 398 m 7 Y s 340 398 m 61 X s 401 398 m 61 X s black 401 398 m20
 0 1 0 c 522 373 m 5 Y s 522 378 m 6 Y s 462 378 m 60 X s 522 378 m 61 X s black 522 378 m20 0 1 0 c 644 362 m 7 Y s 644 369 m 8 Y s 583 369 m 61 X s 644 369 m 61 X s black 644 369 m20 0 1 0 c 765 354 m 5 Y s 765 359 m 6 Y s 705 359 m 60 X s 765 359
 m 61 X s black 765 359 m20 0 1 0 c 887 354 m 5 Y s 887 359 m 6 Y s 826 359 m 61 X s 887 359 m 61 X s black 887 359 m20 0 1 0 c 1008 355 m 4 Y s 1008 359 m 4 Y s 948 359 m 60 X s 1008 359 m 61 X s black 1008 359 m20 0 1 0 c 1130 355 m 4 Y s 1130 359
 m 5 Y s 1069 359 m 61 X s 1130 359 m 61 X s black 1130 359 m20 0 1 0 c 1251 359 m 4 Y s 1251 363 m 4 Y s 1191 363 m 60 X s 1251 363 m 61 X s black 1251 363 m20 0 1 0 c 1373 362 m 5 Y s 1373 367 m 5 Y s 1312 367 m 61 X s 1373 367 m 61 X s black 1373
 367 m20 0 1 0 c 1494 369 m 4 Y s 1494 373 m 5 Y s 1434 373 m 60 X s 1494 373 m 61 X s black 1494 373 m20 0 1 0 c 1616 382 m 6 Y s 1616 388 m 6 Y s 1555 388 m 61 X s 1616 388 m 60 X s black 1616 388 m20 0 1 0 c 1737 385 m 8 Y s 1737 393 m 7 Y s 1676
 393 m 61 X s 1737 393 m 61 X s black 1737 393 m20 0 1 0 c 1859 403 m 9 Y s 1859 412 m 9 Y s 1798 412 m 61 X s 1859 412 m 60 X s black 1859 412 m20 0 1 0 c 1980 400 m 12 Y s 1980 412 m 11 Y s 1919 412 m 61 X s 1980 412 m 61 X s black 1980 412 m20 0 1
 1 c 1 1 1 c black 0 1 1 c 401 209 m 166 Y s 401 375 m 167 Y s 340 375 m 61 X s 401 375 m 61 X s black 401 375 m20 0 1 1 c 522 208 m 167 Y s 522 375 m 166 Y s 462 375 m 60 X s 522 375 m 61 X s black 522 375 m20 0 1 1 c 644 206 m 166 Y s 644 372 m 166
 Y s 583 372 m 61 X s 644 372 m 61 X s black 644 372 m20 0 1 1 c 765 204 m 166 Y s 765 370 m 166 Y s 705 370 m 60 X s 765 370 m 61 X s black 765 370 m20 0 1 1 c 887 205 m 167 Y s 887 372 m 166 Y s 826 372 m 61 X s 887 372 m 61 X s black 887 372 m20 0
 1 1 c 1008 203 m 166 Y s 1008 369 m 166 Y s 948 369 m 60 X s 1008 369 m 61 X s black 1008 369 m20 0 1 1 c 1130 204 m 166 Y s 1130 370 m 166 Y s 1069 370 m 61 X s 1130 370 m 61 X s black 1130 370 m20 0 1 1 c 1251 207 m 166 Y s 1251 373 m 167 Y s 1191
 373 m 60 X s 1251 373 m 61 X s black 1251 373 m20 0 1 1 c 1373 205 m 166 Y s 1373 371 m 166 Y s 1312 371 m 61 X s 1373 371 m 61 X s black 1373 371 m20 0 1 1 c 1494 205 m 166 Y s 1494 371 m 166 Y s 1434 371 m 60 X s 1494 371 m 61 X s black 1494 371
 m20 0 1 1 c 1616 209 m 167 Y s 1616 376 m 167 Y s 1555 376 m 61 X s 1616 376 m 60 X s black 1616 376 m20 0 1 1 c 1737 211 m 167 Y s 1737 378 m 167 Y s 1676 378 m 61 X s 1737 378 m 61 X s black 1737 378 m20 0 1 1 c 1859 205 m 166 Y s 1859 371 m 167 Y
 s 1798 371 m 61 X s 1859 371 m 60 X s black 1859 371 m20 0 1 1 c 1980 216 m 168 Y s 1980 384 m 168 Y s 1919 384 m 61 X s 1980 384 m 61 X s black 1980 384 m20 1 1 1 c black 401 367 m 5 Y s 401 372 m 6 Y s 340 372 m 61 X s 401 372 m 61 X s 401 372 m20
 522 368 m 4 Y s 522 372 m 5 Y s 462 372 m 60 X s 522 372 m 61 X s 522 372 m20 644 365 m 7 Y s 644 372 m 7 Y s 583 372 m 61 X s 644 372 m 61 X s 644 372 m20 765 368 m 4 Y s 765 372 m 5 Y s 705 372 m 60 X s 765 372 m 61 X s 765 372 m20 887 367 m 5 Y s
 887 372 m 5 Y s 826 372 m 61 X s 887 372 m 61 X s 887 372 m20 1008 369 m 3 Y s 1008 372 m 3 Y s 948 372 m 60 X s 1008 372 m 61 X s 1008 372 m20 1130 369 m 3 Y s 1130 372 m 3 Y s 1069 372 m 61 X s 1130 372 m 61 X s 1130 372 m20 1251 370 m 2 Y s 1251
 372 m 3 Y s 1191 372 m 60 X s 1251 372 m 61 X s 1251 372 m20 1373 368 m 4 Y s 1373 372 m 4 Y s 1312 372 m 61 X s 1373 372 m 61 X s 1373 372 m20 1494 369 m 3 Y s 1494 372 m 3 Y s 1434 372 m 60 X s 1494 372 m 61 X s 1494 372 m20 1616 368 m 4 Y s 1616
 372 m 4 Y s 1555 372 m 61 X s 1616 372 m 60 X s 1616 372 m20 1737 365 m 7 Y s 1737 372 m 7 Y s 1676 372 m 61 X s 1737 372 m 61 X s 1737 372 m20 1859 366 m 6 Y s 1859 372 m 7 Y s 1798 372 m 61 X s 1859 372 m 60 X s 1859 372 m20 1980 361 m 11 Y s 1980
 372 m 12 Y s 1919 372 m 61 X s 1980 372 m 61 X s 1980 372 m20 1 0 1 c 1 1 1 c black 1 0 1 c 401 342 m 6 Y s 401 348 m 6 Y s 340 348 m 61 X s 401 348 m 61 X s black 401 348 m20 1 0 1 c 522 360 m 5 Y s 522 365 m 5 Y s 462 365 m 60 X s 522 365 m 61 X s
 black 522 365 m20 1 0 1 c 644 374 m 7 Y s 644 381 m 7 Y s 583 381 m 61 X s 644 381 m 61 X s black 644 381 m20 1 0 1 c 765 374 m 5 Y s 765 379 m 4 Y s 705 379 m 60 X s 765 379 m 61 X s black 765 379 m20 1 0 1 c 887 381 m 5 Y s 887 386 m 5 Y s 826 386
 m 61 X s 887 386 m 61 X s black 887 386 m20 1 0 1 c 1008 379 m 3 Y s 1008 382 m 3 Y s 948 382 m 60 X s 1008 382 m 61 X s black 1008 382 m20 1 0 1 c 1130 381 m 4 Y s 1130 385 m 3 Y s 1069 385 m 61 X s 1130 385 m 61 X s black 1130 385 m20 1 0 1 c 1251
 379 m 2 Y s 1251 381 m 3 Y s 1191 381 m 60 X s 1251 381 m 61 X s black 1251 381 m20 1 0 1 c 1373 373 m 4 Y s 1373 377 m 3 Y s 1312 377 m 61 X s 1373 377 m 61 X s black 1373 377 m20 1 0 1 c 1494 367 m 3 Y s 1494 370 m 3 Y s 1434 370 m 60 X s 1494 370
 m 61 X s black 1494 370 m20 1 0 1 c 1616 360 m 4 Y s 1616 364 m 4 Y s 1555 364 m 61 X s 1616 364 m 60 X s black 1616 364 m20 1 0 1 c 1737 345 m 6 Y s 1737 351 m 6 Y s 1676 351 m 61 X s 1737 351 m 61 X s black 1737 351 m20 1 0 1 c 1859 328 m 8 Y s
 1859 336 m 8 Y s 1798 336 m 61 X s 1859 336 m 60 X s black 1859 336 m20 1 0 1 c 1980 319 m 11 Y s 1980 330 m 11 Y s 1919 330 m 61 X s 1980 330 m 61 X s black 1980 330 m20 1 0 0 c 1 1 1 c black 1 0 0 c 401 366 m 5 Y s 401 371 m 5 Y s 340 371 m 61 X s
 401 371 m 61 X s black 401 371 m20 1 0 0 c 522 365 m 5 Y s 522 370 m 5 Y s 462 370 m 60 X s 522 370 m 61 X s black 522 370 m20 1 0 0 c 644 365 m 6 Y s 644 371 m 6 Y s 583 371 m 61 X s 644 371 m 61 X s black 644 371 m20 1 0 0 c 765 369 m 4 Y s 765
 373 m 5 Y s 705 373 m 60 X s 765 373 m 61 X s black 765 373 m20 1 0 0 c 887 369 m 5 Y s 887 374 m 4 Y s 826 374 m 61 X s 887 374 m 61 X s black 887 374 m20 1 0 0 c 1008 368 m 3 Y s 1008 371 m 3 Y s 948 371 m 60 X s 1008 371 m 61 X s black 1008 371
 m20 1 0 0 c 1130 370 m 3 Y s 1130 373 m 3 Y s 1069 373 m 61 X s 1130 373 m 61 X s black 1130 373 m20 1 0 0 c 1251 372 m 2 Y s 1251 374 m 3 Y s 1191 374 m 60 X s 1251 374 m 61 X s black 1251 374 m20 1 0 0 c 1373 369 m 4 Y s 1373 373 m 4 Y s 1312 373
 m 61 X s 1373 373 m 61 X s black 1373 373 m20 1 0 0 c 1494 371 m 3 Y s 1494 374 m 3 Y s 1434 374 m 60 X s 1494 374 m 61 X s black 1494 374 m20 1 0 0 c 1616 370 m 4 Y s 1616 374 m 4 Y s 1555 374 m 61 X s 1616 374 m 60 X s black 1616 374 m20 1 0 0 c
 1737 365 m 8 Y s 1737 373 m 7 Y s 1676 373 m 61 X s 1737 373 m 61 X s black 1737 373 m20 1 0 0 c 1859 359 m 8 Y s 1859 367 m 7 Y s 1798 367 m 61 X s 1859 367 m 60 X s black 1859 367 m20 1 0 0 c 1980 355 m 11 Y s 1980 366 m 10 Y s 1919 366 m 61 X s
 1980 366 m 61 X s black 1980 366 m20 1 1 1 c black 401 367 m 5 Y s 401 372 m 6 Y s 340 372 m 61 X s 401 372 m 61 X s 401 372 m20 522 368 m 4 Y s 522 372 m 5 Y s 462 372 m 60 X s 522 372 m 61 X s 522 372 m20 644 365 m 7 Y s 644 372 m 7 Y s 583 372 m
 61 X s 644 372 m 61 X s 644 372 m20 765 368 m 4 Y s 765 372 m 5 Y s 705 372 m 60 X s 765 372 m 61 X s 765 372 m20 887 367 m 5 Y s 887 372 m 5 Y s 826 372 m 61 X s 887 372 m 61 X s 887 372 m20 1008 369 m 3 Y s 1008 372 m 3 Y s 948 372 m 60 X s 1008
 372 m 61 X s 1008 372 m20 1130 369 m 3 Y s 1130 372 m 3 Y s 1069 372 m 61 X s 1130 372 m 61 X s 1130 372 m20 1251 370 m 2 Y s 1251 372 m 3 Y s 1191 372 m 60 X s 1251 372 m 61 X s 1251 372 m20 1373 368 m 4 Y s 1373 372 m 4 Y s 1312 372 m 61 X s 1373
 372 m 61 X s 1373 372 m20 1494 369 m 3 Y s 1494 372 m 3 Y s 1434 372 m 60 X s 1494 372 m 61 X s 1494 372 m20 1616 368 m 4 Y s 1616 372 m 4 Y s 1555 372 m 61 X s 1616 372 m 60 X s 1616 372 m20 1737 365 m 7 Y s 1737 372 m 7 Y s 1676 372 m 61 X s 1737
 372 m 61 X s 1737 372 m20 1859 366 m 6 Y s 1859 372 m 7 Y s 1798 372 m 61 X s 1859 372 m 60 X s 1859 372 m20 1980 361 m 11 Y s 1980 372 m 12 Y s 1919 372 m 61 X s 1980 372 m 61 X s 1980 372 m20
 gsave  2268 1538 0 0 C 1645.4 1462.94 t 0 r /Helvetica-Bold findfont 42.3568 sf 0 0 m (DF:CutSR2_1jet/MT) show NC gr  1 1 1 c 409 430 1587 923 bf black
 gsave  2268 1538 0 0 C 1844.15 1316.32 t 0 r /Helvetica-Bold findfont 42.3568 sf 0 0 m (=2) show NC gr 
 gsave  2268 1538 0 0 C 1824.6 1293.51 t 0 r /Helvetica-Bold findfont 29.3239 sf 0 0 m (F) show NC gr 
 gsave  2268 1538 0 0 C 1801.79 1316.32 t 0 r /Symbol findfont 42.3568 sf 0 0 m (x) show NC gr 
 gsave  2268 1538 0 0 C 1733.37 1316.32 t 0 r /Helvetica-Bold findfont 42.3568 sf 0 0 m (=2, ) show NC gr 
 gsave  2268 1538 0 0 C 1710.56 1293.51 t 0 r /Helvetica-Bold findfont 29.3239 sf 0 0 m (R) show NC gr 
 gsave  2268 1538 0 0 C 1687.75 1316.32 t 0 r /Symbol findfont 42.3568 sf 0 0 m (x) show NC gr  1 1 1 c 1603 1301 m 71 X 43 Y -71 X f 1 1 0 c 1603 1323 m 71 X s black 1638 1323 m20
 gsave  2268 1538 0 0 C 1879.99 1257.67 t 0 r /Helvetica-Bold findfont 42.3568 sf 0 0 m (=1/2) show NC gr 
 gsave  2268 1538 0 0 C 1860.44 1234.86 t 0 r /Helvetica-Bold findfont 29.3239 sf 0 0 m (F) show NC gr 
 gsave  2268 1538 0 0 C 1837.63 1257.67 t 0 r /Symbol findfont 42.3568 sf 0 0 m (x) show NC gr 
 gsave  2268 1538 0 0 C 1733.37 1257.67 t 0 r /Helvetica-Bold findfont 42.3568 sf 0 0 m (=1/2, ) show NC gr 
 gsave  2268 1538 0 0 C 1710.56 1234.86 t 0 r /Helvetica-Bold findfont 29.3239 sf 0 0 m (R) show NC gr 
 gsave  2268 1538 0 0 C 1687.75 1257.67 t 0 r /Symbol findfont 42.3568 sf 0 0 m (x) show NC gr  1 1 1 c 1603 1240 m 71 X 43 Y -71 X f 0 0 1 c 1603 1261 m 71 X s black 1638 1261 m20
 gsave  2268 1538 0 0 C 1844.15 1195.76 t 0 r /Helvetica-Bold findfont 42.3568 sf 0 0 m (=1) show NC gr 
 gsave  2268 1538 0 0 C 1824.6 1172.96 t 0 r /Helvetica-Bold findfont 29.3239 sf 0 0 m (F) show NC gr 
 gsave  2268 1538 0 0 C 1801.79 1195.76 t 0 r /Symbol findfont 42.3568 sf 0 0 m (x) show NC gr 
 gsave  2268 1538 0 0 C 1733.37 1195.76 t 0 r /Helvetica-Bold findfont 42.3568 sf 0 0 m (=2, ) show NC gr 
 gsave  2268 1538 0 0 C 1710.56 1172.96 t 0 r /Helvetica-Bold findfont 29.3239 sf 0 0 m (R) show NC gr 
 gsave  2268 1538 0 0 C 1687.75 1195.76 t 0 r /Symbol findfont 42.3568 sf 0 0 m (x) show NC gr  1 1 1 c 1603 1178 m 71 X 43 Y -71 X f 0 1 1 c 1603 1200 m 71 X s black 1638 1200 m20
 gsave  2268 1538 0 0 C 1844.15 1133.86 t 0 r /Helvetica-Bold findfont 42.3568 sf 0 0 m (=1/2) show NC gr 
 gsave  2268 1538 0 0 C 1824.6 1111.05 t 0 r /Helvetica-Bold findfont 29.3239 sf 0 0 m (F) show NC gr 
 gsave  2268 1538 0 0 C 1801.79 1133.86 t 0 r /Symbol findfont 42.3568 sf 0 0 m (x) show NC gr 
 gsave  2268 1538 0 0 C 1733.37 1133.86 t 0 r /Helvetica-Bold findfont 42.3568 sf 0 0 m (=1, ) show NC gr 
 gsave  2268 1538 0 0 C 1710.56 1111.05 t 0 r /Helvetica-Bold findfont 29.3239 sf 0 0 m (R) show NC gr 
 gsave  2268 1538 0 0 C 1687.75 1133.86 t 0 r /Symbol findfont 42.3568 sf 0 0 m (x) show NC gr  1 1 1 c 1603 1116 m 71 X 44 Y -71 X f 0 1 0 c 1603 1138 m 71 X s black 1638 1138 m20
 gsave  2268 1538 0 0 C 1844.15 1071.95 t 0 r /Helvetica-Bold findfont 42.3568 sf 0 0 m (=1) show NC gr 
 gsave  2268 1538 0 0 C 1824.6 1049.14 t 0 r /Helvetica-Bold findfont 29.3239 sf 0 0 m (F) show NC gr 
 gsave  2268 1538 0 0 C 1801.79 1071.95 t 0 r /Symbol findfont 42.3568 sf 0 0 m (x) show NC gr 
 gsave  2268 1538 0 0 C 1733.37 1071.95 t 0 r /Helvetica-Bold findfont 42.3568 sf 0 0 m (=1, ) show NC gr 
 gsave  2268 1538 0 0 C 1710.56 1049.14 t 0 r /Helvetica-Bold findfont 29.3239 sf 0 0 m (R) show NC gr 
 gsave  2268 1538 0 0 C 1687.75 1071.95 t 0 r /Symbol findfont 42.3568 sf 0 0 m (x) show NC gr  1 1 1 c 1603 1055 m 71 X 43 Y -71 X f black 1603 1077 m 71 X s 1638 1077 m20
 gsave  2268 1538 0 0 C 1844.15 1010.05 t 0 r /Helvetica-Bold findfont 42.3568 sf 0 0 m (=2) show NC gr 
 gsave  2268 1538 0 0 C 1824.6 987.239 t 0 r /Helvetica-Bold findfont 29.3239 sf 0 0 m (F) show NC gr 
 gsave  2268 1538 0 0 C 1801.79 1010.05 t 0 r /Symbol findfont 42.3568 sf 0 0 m (x) show NC gr 
 gsave  2268 1538 0 0 C 1733.37 1010.05 t 0 r /Helvetica-Bold findfont 42.3568 sf 0 0 m (=1, ) show NC gr 
 gsave  2268 1538 0 0 C 1710.56 987.239 t 0 r /Helvetica-Bold findfont 29.3239 sf 0 0 m (R) show NC gr 
 gsave  2268 1538 0 0 C 1687.75 1010.05 t 0 r /Symbol findfont 42.3568 sf 0 0 m (x) show NC gr  1 1 1 c 1603 993 m 71 X 44 Y -71 X f 1 0 1 c 1603 1015 m 71 X s black 1638 1015 m20
 gsave  2268 1538 0 0 C 1879.99 948.14 t 0 r /Helvetica-Bold findfont 42.3568 sf 0 0 m (=1) show NC gr 
 gsave  2268 1538 0 0 C 1860.44 925.333 t 0 r /Helvetica-Bold findfont 29.3239 sf 0 0 m (F) show NC gr 
 gsave  2268 1538 0 0 C 1837.63 948.14 t 0 r /Symbol findfont 42.3568 sf 0 0 m (x) show NC gr 
 gsave  2268 1538 0 0 C 1733.37 948.14 t 0 r /Helvetica-Bold findfont 42.3568 sf 0 0 m (=1/2, ) show NC gr 
 gsave  2268 1538 0 0 C 1710.56 925.333 t 0 r /Helvetica-Bold findfont 29.3239 sf 0 0 m (R) show NC gr 
 gsave  2268 1538 0 0 C 1687.75 948.14 t 0 r /Symbol findfont 42.3568 sf 0 0 m (x) show NC gr  1 1 1 c 1603 932 m 71 X 43 Y -71 X f 1 0 0 c 1603 953 m 71 X s black 1638 953 m20
 gr  gr showpage
end
%%EOF
