%!PS-Adobe-3.0 EPSF-3.0 
%%Pages: 0
%%Creator: Sun Microsystems, Inc.
%%BoundingBox: 20 320 550 780
%%Title: none
%%CreationDate: none
%%LanguageLevel: 2
%%EndComments
%%BeginProlog
%%BeginResource: procset SDRes-Prolog 1.0 0
/b4_inc_state save def
/dict_count countdictstack def
/op_count count 1 sub def
userdict begin
0 setgray 0 setlinecap 1 setlinewidth 0 setlinejoin 10 setmiterlimit[] 0 setdash newpath
/languagelevel where {pop languagelevel 1 ne {false setstrokeadjust false setoverprint} if} if
/bdef {bind def} bind def
/c {setrgbcolor} bdef
/l {neg lineto} bdef
/rl {neg rlineto} bdef
/lc {setlinecap} bdef
/lj {setlinejoin} bdef
/lw {setlinewidth} bdef
/ml {setmiterlimit} bdef
/ld {setdash} bdef
/m {neg moveto} bdef
/ct {6 2 roll neg 6 2 roll neg 6 2 roll neg curveto} bdef
/r {rotate} bdef
/t {neg translate} bdef
/s {scale} bdef
/sw {show} bdef
/gs {gsave} bdef
/gr {grestore} bdef
/f {findfont dup length dict begin
{1 index /FID ne {def} {pop pop} ifelse} forall /Encoding ISOLatin1Encoding def
currentdict end /NFont exch definefont pop /NFont findfont} bdef
/p {closepath} bdef
/sf {scalefont setfont} bdef
/ef {eofill}bdef
/pc {closepath stroke}bdef
/ps {stroke}bdef
/pum {matrix currentmatrix}bdef
/pom {setmatrix}bdef
/bs {/aString exch def /nXOfs exch def /nWidth exch def currentpoint nXOfs 0 rmoveto pum nWidth aString stringwidth pop div 1 scale aString show pom moveto} bdef
%%EndResource
%%EndProlog
%%BeginSetup
%%EndSetup
%%Page: 1 1
%%BeginPageSetup
%%EndPageSetup
pum
0.02834 0.02834 s 
0 -27940 t
/tm matrix currentmatrix def
gs
0 0 m 21589 0 l 21589 27939 l 0 27939 l 0 0 l eoclip newpath
gs
0 0 m 21589 0 l 21589 27939 l 0 27939 l 0 0 l eoclip newpath
51 lw 1 lj 0.003 0.003 0.003 c 4051 12970 m  9385 9287 l  ps
52 lw 6994 10750 m  5633 9891 l  ps
5246 9647 m  5628 10113 l  5831 9791 l  5246 9647 l  p ef
51 lw 9148 4787 m  11177 13650 l  ps
15138 555 m  17169 9418 l  ps
11227 13615 m  17196 9449 l  ps
10719 8282 m  16053 4599 l  ps
5669 8809 m  9581 6117 l  ps
52 lw 10010 8882 m  10098 8382 l  ps
10187 7881 m  10275 7381 l  ps
10363 6881 m  10451 6381 l  ps
10540 5880 m  10628 5380 l  ps
51 lw 9397 12364 m  10020 8826 l  ps
52 lw 9423 6223 m  9839 5932 l  ps
10255 5640 m  10672 5349 l  ps
13040 6491 m  12691 4135 l  ps
12624 3683 m  12519 4276 l  12896 4220 l  12624 3683 l  p ef
13059 6751 m  13409 9108 l  ps
13476 9560 m  13581 8967 l  13204 9023 l  13476 9560 l  p ef
10120 8745 m  10783 8292 l  ps
11161 8034 m  10582 8199 l  10797 8514 l  11161 8034 l  p ef
9953 8889 m  9290 9342 l  ps
8912 9600 m  9491 9435 l  9276 9120 l  8912 9600 l  p ef
7187 10852 m  8548 11709 l  ps
8935 11953 m  8553 11487 l  8350 11810 l  8935 11953 l  p ef
1.000 1.000 1.000 c 13771 6198 m  13793 6236 l  13812 6276 l  13830 6318 l 
13847 6360 l  13862 6403 l  13874 6448 l  13884 6494 l  13893 6541 l  13899 6588 l 
13904 6635 l  13907 6684 l  13907 6731 l  13906 6780 l  13902 6828 l  13897 6877 l 
13889 6925 l  13880 6972 l  13869 7020 l  13855 7066 l  13840 7112 l  13823 7158 l 
13804 7202 l  13784 7245 l  13761 7287 l  13737 7328 l  13712 7367 l  13685 7405 l 
13656 7441 l  13627 7476 l  13596 7508 l  13563 7539 l  13530 7568 l  13530 7568 l 
13563 7539 l  13596 7508 l  13627 7476 l  13656 7441 l  13685 7405 l  13712 7367 l 
13737 7328 l  13761 7287 l  13784 7245 l  13804 7202 l  13823 7158 l  13840 7112 l 
13855 7066 l  13869 7020 l  13880 6972 l  13889 6925 l  13897 6877 l  13902 6828 l 
13906 6780 l  13907 6731 l  13907 6684 l  13904 6635 l  13899 6588 l  13893 6541 l 
13884 6494 l  13874 6448 l  13862 6403 l  13847 6360 l  13830 6318 l  13812 6276 l 
13793 6236 l  13771 6198 l  13771 6198 l  p ef
51 lw 0.003 0.003 0.003 c 13771 6198 m  13793 6236 l  13812 6276 l  13830 6318 l 
13847 6360 l  13862 6403 l  13874 6448 l  13884 6494 l  13893 6541 l  13899 6588 l 
13904 6635 l  13907 6684 l  13907 6731 l  13906 6780 l  13902 6828 l  13897 6877 l 
13889 6925 l  13880 6972 l  13869 7020 l  13855 7066 l  13840 7112 l  13823 7158 l 
13804 7202 l  13784 7245 l  13761 7287 l  13737 7328 l  13712 7367 l  13685 7405 l 
13656 7441 l  13627 7476 l  13596 7508 l  13563 7539 l  13530 7568 l  13530 7568 l 
13563 7539 l  13596 7508 l  13627 7476 l  13656 7441 l  13685 7405 l  13712 7367 l 
13737 7328 l  13761 7287 l  13784 7245 l  13804 7202 l  13823 7158 l  13840 7112 l 
13855 7066 l  13869 7020 l  13880 6972 l  13889 6925 l  13897 6877 l  13902 6828 l 
13906 6780 l  13907 6731 l  13907 6684 l  13904 6635 l  13899 6588 l  13893 6541 l 
13884 6494 l  13874 6448 l  13862 6403 l  13847 6360 l  13830 6318 l  13812 6276 l 
13793 6236 l  13771 6198 l  13771 6198 l  pc

1.000 1.000 1.000 c 9455 12421 m  9509 12525 l  9567 12627 l  9630 12725 l 
9699 12820 l  9772 12911 l  9851 12998 l  9934 13081 l  10021 13159 l 
10112 13233 l  10207 13302 l  10305 13366 l  10406 13425 l  10510 13478 l 
10618 13525 l  10727 13567 l  10838 13603 l  10951 13634 l  11066 13658 l 
11182 13676 l  11182 13676 l  11066 13658 l  10951 13634 l  10838 13603 l 
10727 13567 l  10618 13525 l  10510 13478 l  10406 13425 l  10305 13366 l 
10207 13302 l  10112 13233 l  10021 13159 l  9934 13081 l  9851 12998 l 
9772 12911 l  9699 12820 l  9630 12725 l  9567 12627 l  9509 12525 l  9455 12421 l 
9455 12421 l  p ef
0.003 0.003 0.003 c 9455 12421 m  9509 12525 l  9567 12627 l  9630 12725 l 
9699 12820 l  9772 12911 l  9851 12998 l  9934 13081 l  10021 13159 l 
10112 13233 l  10207 13302 l  10305 13366 l  10406 13425 l  10510 13478 l 
10618 13525 l  10727 13567 l  10838 13603 l  10951 13634 l  11066 13658 l 
11182 13676 l  11182 13676 l  11066 13658 l  10951 13634 l  10838 13603 l 
10727 13567 l  10618 13525 l  10510 13478 l  10406 13425 l  10305 13366 l 
10207 13302 l  10112 13233 l  10021 13159 l  9934 13081 l  9851 12998 l 
9772 12911 l  9699 12820 l  9630 12725 l  9567 12627 l  9509 12525 l  9455 12421 l 
9455 12421 l  pc

1 lw 13746 7422 m  13529 7592 l  ps
13245 7813 m  13692 7654 l  13507 7418 l  13245 7813 l  p ef
7464 11808 m  7637 11593 l  ps
7863 11313 m  7464 11569 l  7697 11757 l  7863 11313 l  p ef

pum
5800 13038 t
0.003 0.003 1.000 c 545 -431 m  201 -431 l  204 -371 210 -315 220 -264 ct 248 -121 303 -49 384 -49 ct 
492 -49 545 -176 545 -431 ct p
198 -470 m  544 -470 l  543 -531 537 -590 526 -647 ct 496 -797 442 -872 362 -872 ct 
256 -872 202 -738 198 -470 ct p
333 10 m  269 10 215 -22 170 -84 ct 136 -134 112 -194 99 -265 ct 71 -408 81 -548 130 -687 ct 
186 -850 281 -931 412 -931 ct 474 -931 528 -899 572 -836 ct 606 -787 630 -728 643 -658 ct 
671 -513 662 -371 615 -234 ct 560 -71 466 10 333 10 ct p ef
pom

pum
14043 7688 t
545 -431 m  201 -431 l  204 -371 210 -315 220 -264 ct 248 -121 303 -49 384 -49 ct 
492 -49 545 -176 545 -431 ct p
198 -470 m  544 -470 l  543 -531 537 -590 526 -647 ct 496 -797 442 -872 362 -872 ct 
256 -872 202 -738 198 -470 ct p
333 10 m  269 10 215 -22 170 -84 ct 136 -134 112 -194 99 -265 ct 71 -408 81 -548 130 -687 ct 
186 -850 281 -931 412 -931 ct 474 -931 528 -899 572 -836 ct 606 -787 630 -728 643 -658 ct 
671 -513 662 -371 615 -234 ct 560 -71 466 10 333 10 ct p ef
pom

pum
9048 14443 t
559 -715 m  557 -255 l  639 -261 700 -290 740 -340 ct 780 -392 792 -458 775 -539 ct 
754 -646 682 -704 559 -715 ct p
418 -255 m  421 -715 l  240 -691 167 -593 201 -420 ct 222 -315 294 -260 418 -255 ct 
p
418 -206 m  213 -206 95 -285 64 -442 ct 45 -544 75 -625 154 -685 ct 223 -738 312 -764 421 -764 ct 
422 -813 420 -853 414 -885 ct 409 -909 374 -921 309 -921 ct 308 -960 l  679 -960 l 
680 -921 l  623 -916 588 -902 574 -879 ct 563 -863 558 -824 558 -764 ct 764 -764 882 -686 913 -531 ct 
932 -429 902 -348 822 -288 ct 751 -233 662 -206 556 -206 ct 554 -155 556 -112 563 -77 ct 
567 -52 603 -39 670 -39 ct 675 -39 l  674 0 l  304 0 l  304 -39 l  358 -45 392 -59 405 -83 ct 
416 -100 420 -141 418 -206 ct p ef
pom

pum
6583 10264 t
1.000 0.003 0.003 c 284 -764 m  284 -500 l  735 -500 l  735 -764 l  735 -814 732 -847 726 -863 ct 
721 -875 711 -885 696 -894 ct 676 -906 654 -911 632 -911 ct 598 -911 l  598 -931 l 
1009 -931 l  1009 -911 l  975 -911 l  953 -911 931 -906 911 -895 ct 896 -887 886 -875 880 -860 ct 
875 -844 872 -812 872 -764 ct 872 -167 l  872 -117 875 -84 881 -68 ct 886 -56 896 -46 910 -37 ct 
931 -25 953 -20 975 -20 ct 1009 -20 l  1009 0 l  598 0 l  598 -20 l  632 -20 l 
671 -20 699 -31 717 -55 ct 729 -71 735 -108 735 -167 ct 735 -451 l  284 -451 l 
284 -167 l  284 -117 287 -84 293 -68 ct 298 -56 308 -46 323 -37 ct 343 -25 364 -20 387 -20 ct 
421 -20 l  421 0 l  10 0 l  10 -20 l  44 -20 l  83 -20 112 -31 130 -55 ct 
141 -71 147 -108 147 -167 ct 147 -764 l  147 -814 144 -847 138 -863 ct 133 -875 123 -885 109 -894 ct 
88 -906 66 -911 44 -911 ct 10 -911 l  10 -931 l  421 -931 l  421 -911 l  387 -911 l 
364 -911 343 -906 323 -895 ct 308 -887 298 -875 293 -860 ct 287 -844 284 -812 284 -764 ct 
p ef
pom

pum
14655 7902 t
0.003 0.003 1.000 c 366 0 m  57 0 l  57 -44 l  181 -44 l  181 -401 l  57 -375 l 
57 -410 l  243 -467 l  243 -44 l  366 -44 l  366 0 l  p ef
pom

pum
6400 13317 t
313 0 m  53 0 l  53 -53 l  78 -102 116 -151 166 -201 ct 194 -228 l  232 -266 251 -304 251 -342 ct 
251 -366 244 -385 230 -401 ct 216 -416 196 -423 171 -423 ct 161 -423 151 -422 141 -421 ct 
131 -419 121 -416 110 -412 ct 99 -408 85 -401 66 -391 ct 66 -444 l  104 -460 141 -467 178 -467 ct 
209 -467 235 -462 254 -451 ct 274 -440 290 -425 301 -407 ct 312 -388 318 -367 318 -343 ct 
318 -321 312 -299 301 -279 ct 291 -258 270 -233 240 -205 ct 214 -180 l  199 -167 186 -153 174 -139 ct 
163 -125 153 -111 145 -98 ct 137 -85 131 -70 127 -53 ct 313 -53 l  313 0 l  p ef
pom
1.000 1.000 1.000 c 6108 11523 m  6136 11564 l  6167 11603 l  6198 11640 l 
6231 11675 l  6267 11709 l  6304 11741 l  6343 11771 l  6383 11799 l  6425 11824 l 
6468 11848 l  6511 11870 l  6557 11889 l  6603 11906 l  6649 11920 l  6697 11932 l 
6745 11942 l  6793 11948 l  6842 11953 l  6891 11955 l  6940 11955 l  6989 11951 l 
7038 11946 l  7086 11938 l  7134 11928 l  7181 11915 l  7227 11899 l  7273 11881 l 
7317 11861 l  7361 11840 l  7404 11815 l  7445 11788 l  7484 11759 l  7523 11729 l 
7559 11696 l  7594 11662 l  7627 11626 l  7658 11588 l  7687 11548 l  7714 11507 l 
7739 11465 l  7762 11422 l  7782 11377 l  7782 11377 l  7762 11422 l  7739 11465 l 
7714 11507 l  7687 11548 l  7658 11588 l  7627 11626 l  7594 11662 l  7559 11696 l 
7523 11729 l  7484 11759 l  7445 11788 l  7404 11815 l  7361 11840 l  7317 11861 l 
7273 11881 l  7227 11899 l  7181 11915 l  7134 11928 l  7086 11938 l  7038 11946 l 
6989 11951 l  6940 11955 l  6891 11955 l  6842 11953 l  6793 11948 l  6745 11942 l 
6697 11932 l  6649 11920 l  6603 11906 l  6557 11889 l  6511 11870 l  6468 11848 l 
6425 11824 l  6383 11799 l  6343 11771 l  6304 11741 l  6267 11709 l  6231 11675 l 
6198 11640 l  6167 11603 l  6136 11564 l  6108 11523 l  6108 11523 l  p ef
51 lw 0.003 0.003 0.003 c 6108 11523 m  6136 11564 l  6167 11603 l  6198 11640 l 
6231 11675 l  6267 11709 l  6304 11741 l  6343 11771 l  6383 11799 l  6425 11824 l 
6468 11848 l  6511 11870 l  6557 11889 l  6603 11906 l  6649 11920 l  6697 11932 l 
6745 11942 l  6793 11948 l  6842 11953 l  6891 11955 l  6940 11955 l  6989 11951 l 
7038 11946 l  7086 11938 l  7134 11928 l  7181 11915 l  7227 11899 l  7273 11881 l 
7317 11861 l  7361 11840 l  7404 11815 l  7445 11788 l  7484 11759 l  7523 11729 l 
7559 11696 l  7594 11662 l  7627 11626 l  7658 11588 l  7687 11548 l  7714 11507 l 
7739 11465 l  7762 11422 l  7782 11377 l  7782 11377 l  7762 11422 l  7739 11465 l 
7714 11507 l  7687 11548 l  7658 11588 l  7627 11626 l  7594 11662 l  7559 11696 l 
7523 11729 l  7484 11759 l  7445 11788 l  7404 11815 l  7361 11840 l  7317 11861 l 
7273 11881 l  7227 11899 l  7181 11915 l  7134 11928 l  7086 11938 l  7038 11946 l 
6989 11951 l  6940 11955 l  6891 11955 l  6842 11953 l  6793 11948 l  6745 11942 l 
6697 11932 l  6649 11920 l  6603 11906 l  6557 11889 l  6511 11870 l  6468 11848 l 
6425 11824 l  6383 11799 l  6343 11771 l  6304 11741 l  6267 11709 l  6231 11675 l 
6198 11640 l  6167 11603 l  6136 11564 l  6108 11523 l  6108 11523 l  pc

1.000 0.003 0.003 c 7172 10957 m  7143 10977 7114 10988 7079 10991 ct 7044 10994 7014 10988 6982 10973 ct 
6950 10959 6926 10939 6906 10910 ct 6886 10881 6876 10852 6873 10817 ct 6869 10782 6875 10752 6890 10720 ct 
6904 10688 6924 10665 6953 10645 ct 6982 10625 7011 10614 7046 10611 ct 7081 10608 7111 10613 7143 10628 ct 
7175 10643 7198 10663 7218 10692 ct 7238 10720 7249 10749 7252 10784 ct 7255 10819 7250 10850 7235 10881 ct 
7220 10913 7200 10937 7172 10957 ct 7172 10957 l  p ef
0.003 0.003 0.003 c 7172 10957 m  7143 10977 7114 10988 7079 10991 ct 7044 10994 7014 10988 6982 10973 ct 
6950 10959 6926 10939 6906 10910 ct 6886 10881 6876 10852 6873 10817 ct 6869 10782 6875 10752 6890 10720 ct 
6904 10688 6924 10665 6953 10645 ct 6982 10625 7011 10614 7046 10611 ct 7081 10608 7111 10613 7143 10628 ct 
7175 10643 7198 10663 7218 10692 ct 7238 10720 7249 10749 7252 10784 ct 7255 10819 7250 10850 7235 10881 ct 
7220 10913 7200 10937 7172 10957 ct 7172 10957 l  pc
0.003 0.503 0.003 c 13160 6830 m  13131 6850 13102 6861 13067 6864 ct 13032 6867 13002 6861 12970 6846 ct 
12938 6832 12914 6812 12894 6783 ct 12874 6754 12864 6725 12861 6690 ct 12857 6655 12863 6625 12878 6593 ct 
12892 6561 12912 6538 12941 6518 ct 12970 6498 12999 6487 13034 6484 ct 13069 6481 13099 6486 13131 6501 ct 
13163 6516 13186 6536 13206 6565 ct 13226 6593 13237 6622 13240 6657 ct 13243 6692 13238 6723 13223 6754 ct 
13208 6786 13188 6810 13160 6830 ct 13160 6830 l  p ef
0.003 0.003 0.003 c 13160 6830 m  13131 6850 13102 6861 13067 6864 ct 13032 6867 13002 6861 12970 6846 ct 
12938 6832 12914 6812 12894 6783 ct 12874 6754 12864 6725 12861 6690 ct 12857 6655 12863 6625 12878 6593 ct 
12892 6561 12912 6538 12941 6518 ct 12970 6498 12999 6487 13034 6484 ct 13069 6481 13099 6486 13131 6501 ct 
13163 6516 13186 6536 13206 6565 ct 13226 6593 13237 6622 13240 6657 ct 13243 6692 13238 6723 13223 6754 ct 
13208 6786 13188 6810 13160 6830 ct 13160 6830 l  pc
0.003 0.503 0.003 c 10140 8966 m  10111 8986 10082 8997 10047 9000 ct 10012 9003 9982 8997 9950 8982 ct 
9918 8968 9894 8948 9874 8919 ct 9854 8890 9844 8861 9841 8826 ct 9837 8791 9843 8761 9858 8729 ct 
9872 8697 9892 8674 9921 8654 ct 9950 8634 9979 8623 10014 8620 ct 10049 8617 10079 8622 10111 8637 ct 
10143 8652 10166 8672 10186 8701 ct 10206 8729 10217 8758 10220 8793 ct 10223 8828 10218 8859 10203 8890 ct 
10188 8922 10168 8946 10140 8966 ct 10140 8966 l  p ef
0.003 0.003 0.003 c 10140 8966 m  10111 8986 10082 8997 10047 9000 ct 10012 9003 9982 8997 9950 8982 ct 
9918 8968 9894 8948 9874 8919 ct 9854 8890 9844 8861 9841 8826 ct 9837 8791 9843 8761 9858 8729 ct 
9872 8697 9892 8674 9921 8654 ct 9950 8634 9979 8623 10014 8620 ct 10049 8617 10079 8622 10111 8637 ct 
10143 8652 10166 8672 10186 8701 ct 10206 8729 10217 8758 10220 8793 ct 10223 8828 10218 8859 10203 8890 ct 
10188 8922 10168 8946 10140 8966 ct 10140 8966 l  pc

pum
11689 6662 t
0.003 0.503 0.003 c 127 -931 m  820 -931 l  195 -49 l  582 -49 l  641 -49 686 -62 718 -88 ct 
749 -114 776 -167 800 -246 ct 823 -242 l  779 0 l  10 0 l  10 -22 l  620 -882 l 
317 -882 l  267 -882 231 -876 208 -866 ct 186 -855 168 -839 157 -819 ct 145 -798 134 -760 124 -704 ct 
98 -704 l  127 -931 l  p ef
pom

pum
8004 8513 t
127 -931 m  820 -931 l  195 -49 l  582 -49 l  641 -49 686 -62 718 -88 ct 
749 -114 776 -167 800 -246 ct 823 -242 l  779 0 l  10 0 l  10 -22 l  620 -882 l 
317 -882 l  267 -882 231 -876 208 -866 ct 186 -855 168 -839 157 -819 ct 145 -798 134 -760 124 -704 ct 
98 -704 l  127 -931 l  p ef
pom

pum
13771 3253 t
376 0 m  298 0 l  298 -251 l  47 -251 l  47 -329 l  298 -329 l  298 -580 l 
376 -580 l  376 -329 l  627 -329 l  627 -251 l  376 -251 l  376 0 l  p ef
pom

pum
11850 10468 t
371 -646 m  548 -696 637 -780 637 -900 ct 637 -960 610 -990 556 -990 ct 481 -990 420 -875 371 -646 ct 
p
537 -315 m  563 -306 l  492 -95 398 10 281 10 ct 205 10 167 -37 167 -131 ct 
167 -202 176 -283 195 -374 ct 252 -613 l  176 -620 110 -646 52 -690 ct 73 -712 l 
123 -671 184 -647 255 -639 ct 266 -735 297 -819 347 -891 ct 407 -976 481 -1019 568 -1019 ct 
660 -1019 705 -976 705 -889 ct 705 -766 593 -675 369 -617 ct 310 -374 l  286 -277 274 -194 274 -127 ct 
274 -75 293 -49 331 -49 ct 374 -49 417 -84 461 -153 ct 491 -201 517 -255 537 -315 ct 
p ef
pom

pum
12655 9810 t
470 -343 m  88 -343 l  88 -431 l  470 -431 l  470 -343 l  p ef
pom
1.000 1.000 1.000 c 13840 7505 m  13811 7525 13785 7540 13757 7552 ct 13729 7565 13707 7572 13687 7573 ct 
13666 7575 13654 7572 13647 7562 ct 13641 7552 13642 7540 13650 7521 ct 13659 7503 13672 7485 13694 7462 ct 
13715 7440 13738 7421 13767 7401 ct 13796 7381 13822 7366 13850 7353 ct 13878 7340 13900 7334 13920 7332 ct 
13941 7330 13953 7334 13960 7343 ct 13966 7353 13965 7366 13957 7384 ct 13948 7402 13935 7421 13913 7443 ct 
13892 7465 13869 7485 13840 7505 ct 13840 7505 l  p ef

103 lw 0.503 0.300 0.101 c 1803 8814 m  9256 8814 l  ps
9804 8814 m  9119 8586 l  9119 9043 l  9804 8814 l  p ef
17290 8776 m  16782 8776 l  ps
16274 8776 m  15766 8776 l  ps
15258 8776 m  14750 8776 l  ps
14242 8776 m  13734 8776 l  ps
13226 8776 m  12718 8776 l  ps
12210 8776 m  11702 8776 l  ps
11194 8776 m  10853 8776 l  ps
10305 8776 m  10991 9005 l  10991 8548 l  10305 8776 l  p ef
1.000 1.000 1.000 c 11598 8768 m  11609 8719 l  11617 8669 l  11623 8619 l 
11626 8569 l  11626 8519 l  11624 8468 l  11618 8418 l  11610 8369 l  11600 8319 l 
11587 8270 l  11571 8223 l  11553 8176 l  11533 8129 l  11509 8085 l  11484 8041 l 
11456 7999 l  11427 7958 l  11396 7919 l  11362 7882 l  11362 7882 l  11396 7919 l 
11427 7958 l  11456 7999 l  11484 8041 l  11509 8085 l  11533 8129 l  11553 8176 l 
11571 8223 l  11587 8270 l  11600 8319 l  11610 8369 l  11618 8418 l  11624 8468 l 
11626 8519 l  11626 8569 l  11623 8619 l  11617 8669 l  11609 8719 l  11598 8768 l 
11598 8768 l  p ef
51 lw 0.003 0.003 0.003 c 11598 8768 m  11609 8719 l  11617 8669 l  11623 8619 l 
11626 8569 l  11626 8519 l  11624 8468 l  11618 8418 l  11610 8369 l  11600 8319 l 
11587 8270 l  11571 8223 l  11553 8176 l  11533 8129 l  11509 8085 l  11484 8041 l 
11456 7999 l  11427 7958 l  11396 7919 l  11362 7882 l  11362 7882 l  11396 7919 l 
11427 7958 l  11456 7999 l  11484 8041 l  11509 8085 l  11533 8129 l  11553 8176 l 
11571 8223 l  11587 8270 l  11600 8319 l  11610 8369 l  11618 8418 l  11624 8468 l 
11626 8519 l  11626 8569 l  11623 8619 l  11617 8669 l  11609 8719 l  11598 8768 l 
11598 8768 l  pc

11320 7874 m  11460 8327 l  11704 8152 l  11320 7874 l  p ef

pum
11829 8570 t
0.003 0.003 1.000 c 545 -431 m  201 -431 l  204 -371 210 -315 220 -264 ct 248 -121 303 -49 384 -49 ct 
492 -49 545 -176 545 -431 ct p
198 -470 m  544 -470 l  543 -531 537 -590 526 -647 ct 496 -797 442 -872 362 -872 ct 
256 -872 202 -738 198 -470 ct p
333 10 m  269 10 215 -22 170 -84 ct 136 -134 112 -194 99 -265 ct 71 -408 81 -548 130 -687 ct 
186 -850 281 -931 412 -931 ct 474 -931 528 -899 572 -836 ct 606 -787 630 -728 643 -658 ct 
671 -513 662 -371 615 -234 ct 560 -71 466 10 333 10 ct p ef
pom

pum
12401 8098 t
379 -612 m  547 -696 l  580 -596 l  400 -558 l  400 -565 l  400 -581 393 -596 379 -612 ct 
p
396 -542 m  519 -406 l  432 -342 l  342 -502 l  365 -509 383 -522 396 -542 ct 
p
324 -502 m  235 -342 l  148 -406 l  270 -542 l  284 -522 302 -509 324 -502 ct 
p
267 -564 m  267 -558 l  86 -596 l  120 -696 l  287 -612 l  273 -596 267 -581 267 -564 ct 
p
298 -625 m  282 -815 l  384 -815 l  368 -625 l  355 -632 343 -635 333 -635 ct 
323 -635 311 -632 298 -625 ct p ef
pom
0.003 0.003 0.003 c 9144 4735 m  15113 569 l  ps
3456 16510 m  9425 12344 l  ps
102 lw 0.503 0.300 0.101 c 17265 8790 m  18408 8790 l  ps
51 lw 0.003 0.003 0.003 c 16110 4545 m  18371 8787 l  ps
1.000 1.000 1.000 c 17198 9410 m  17246 9424 l  17294 9436 l  17343 9445 l 
17391 9452 l  17441 9457 l  17491 9458 l  17540 9457 l  17590 9454 l  17639 9447 l 
17688 9439 l  17736 9427 l  17784 9414 l  17831 9398 l  17877 9379 l  17922 9359 l 
17966 9335 l  18008 9309 l  18049 9282 l  18089 9252 l  18127 9220 l  18163 9186 l 
18197 9150 l  18231 9113 l  18261 9074 l  18290 9034 l  18317 8992 l  18341 8949 l 
18363 8904 l  18383 8859 l  18383 8859 l  18363 8904 l  18341 8949 l  18317 8992 l 
18290 9034 l  18261 9074 l  18231 9113 l  18197 9150 l  18163 9186 l  18127 9220 l 
18089 9252 l  18049 9282 l  18008 9309 l  17966 9335 l  17922 9359 l  17877 9379 l 
17831 9398 l  17784 9414 l  17736 9427 l  17688 9439 l  17639 9447 l  17590 9454 l 
17540 9457 l  17491 9458 l  17441 9457 l  17391 9452 l  17343 9445 l  17294 9436 l 
17246 9424 l  17198 9410 l  17198 9410 l  p ef
0.003 0.003 0.003 c 17198 9410 m  17246 9424 l  17294 9436 l  17343 9445 l 
17391 9452 l  17441 9457 l  17491 9458 l  17540 9457 l  17590 9454 l  17639 9447 l 
17688 9439 l  17736 9427 l  17784 9414 l  17831 9398 l  17877 9379 l  17922 9359 l 
17966 9335 l  18008 9309 l  18049 9282 l  18089 9252 l  18127 9220 l  18163 9186 l 
18197 9150 l  18231 9113 l  18261 9074 l  18290 9034 l  18317 8992 l  18341 8949 l 
18363 8904 l  18383 8859 l  18383 8859 l  18363 8904 l  18341 8949 l  18317 8992 l 
18290 9034 l  18261 9074 l  18231 9113 l  18197 9150 l  18163 9186 l  18127 9220 l 
18089 9252 l  18049 9282 l  18008 9309 l  17966 9335 l  17922 9359 l  17877 9379 l 
17831 9398 l  17784 9414 l  17736 9427 l  17688 9439 l  17639 9447 l  17590 9454 l 
17540 9457 l  17491 9458 l  17441 9457 l  17391 9452 l  17343 9445 l  17294 9436 l 
17246 9424 l  17198 9410 l  17198 9410 l  pc

9347 12294 m  9492 12746 l  9734 12568 l  9347 12294 l  p ef
1.000 1.000 1.000 c 17424 9077 m  17395 9097 17369 9112 17341 9124 ct 17313 9137 17291 9144 17271 9145 ct 
17250 9147 17238 9144 17231 9134 ct 17225 9124 17226 9112 17234 9093 ct 17243 9075 17256 9057 17278 9034 ct 
17299 9012 17322 8993 17351 8973 ct 17380 8953 17406 8938 17434 8925 ct 17462 8912 17484 8906 17504 8904 ct 
17525 8902 17537 8906 17544 8915 ct 17550 8925 17549 8938 17541 8956 ct 17532 8974 17519 8993 17497 9015 ct 
17476 9037 17453 9057 17424 9077 ct 17424 9077 l  p ef


pum
17468 10873 t
0.003 0.003 1.000 c 559 -715 m  557 -255 l  639 -261 700 -290 740 -340 ct 780 -392 792 -458 775 -539 ct 
754 -646 682 -704 559 -715 ct p
418 -255 m  421 -715 l  240 -691 167 -593 201 -420 ct 222 -315 294 -260 418 -255 ct 
p
418 -206 m  213 -206 95 -285 64 -442 ct 45 -544 75 -625 154 -685 ct 223 -738 312 -764 421 -764 ct 
422 -813 420 -853 414 -885 ct 409 -909 374 -921 309 -921 ct 308 -960 l  679 -960 l 
680 -921 l  623 -916 588 -902 574 -879 ct 563 -863 558 -824 558 -764 ct 764 -764 882 -686 913 -531 ct 
932 -429 902 -348 822 -288 ct 751 -233 662 -206 556 -206 ct 554 -155 556 -112 563 -77 ct 
567 -52 603 -39 670 -39 ct 675 -39 l  674 0 l  304 0 l  304 -39 l  358 -45 392 -59 405 -83 ct 
416 -100 420 -141 418 -206 ct p ef
pom

pum
18230 11142 t
366 0 m  57 0 l  57 -44 l  181 -44 l  181 -401 l  57 -375 l  57 -410 l 
243 -467 l  243 -44 l  366 -44 l  366 0 l  p ef
pom
1 lw 0.003 0.003 0.003 c 17630 9414 m  17624 9414 l  ps
17264 9414 m  17714 9564 l  17714 9264 l  17264 9414 l  p ef
51 lw 1770 8793 m  4031 13035 l  ps
52 lw 4010 13083 m  4098 12583 l  ps
4187 12082 m  4275 11582 l  ps
4363 11082 m  4451 10582 l  ps
4540 10081 m  4628 9581 l  ps
4625 9532 m  5041 9241 l  ps
5457 8949 m  5874 8658 l  ps
51 lw 3398 16564 m  4021 13026 l  ps

pum
13050 4169 t
0.003 0.503 0.003 c 371 -646 m  548 -696 637 -780 637 -900 ct 637 -960 610 -990 556 -990 ct 
481 -990 420 -875 371 -646 ct p
537 -315 m  563 -306 l  492 -95 398 10 281 10 ct 205 10 167 -37 167 -131 ct 
167 -202 176 -283 195 -374 ct 252 -613 l  176 -620 110 -646 52 -690 ct 73 -712 l 
123 -671 184 -647 255 -639 ct 266 -735 297 -819 347 -891 ct 407 -976 481 -1019 568 -1019 ct 
660 -1019 705 -976 705 -889 ct 705 -766 593 -675 369 -617 ct 310 -374 l  286 -277 274 -194 274 -127 ct 
274 -75 293 -49 331 -49 ct 374 -49 417 -84 461 -153 ct 491 -201 517 -255 537 -315 ct 
p ef
pom
1.000 1.000 1.000 c 15567 9059 m  15538 9079 15512 9094 15484 9106 ct 15456 9119 15434 9126 15414 9127 ct 
15393 9129 15381 9126 15374 9116 ct 15368 9106 15369 9094 15377 9075 ct 15386 9057 15399 9039 15421 9016 ct 
15442 8994 15465 8975 15494 8955 ct 15523 8935 15549 8920 15577 8907 ct 15605 8894 15627 8888 15647 8886 ct 
15668 8884 15680 8888 15687 8897 ct 15693 8907 15692 8920 15684 8938 ct 15675 8956 15662 8975 15640 8997 ct 
15619 9019 15596 9039 15567 9059 ct 15567 9059 l  p ef


pum
14333 10029 t
pom
pum
14684 10029 t
0.503 0.300 0.101 c 572 -657 m  598 -657 l  598 157 l  598 202 600 231 606 244 ct 
611 256 619 266 630 273 ct 641 281 663 284 696 284 ct 696 304 l  382 304 l  382 284 l 
395 284 l  419 284 438 280 451 272 ct 460 266 467 256 472 242 ct 477 227 480 199 480 157 ct 
480 -111 l  439 -60 404 -26 373 -8 ct 343 10 311 20 279 20 ct 219 20 166 -8 119 -65 ct 
72 -121 49 -196 49 -290 ct 49 -398 80 -486 141 -554 ct 202 -622 276 -657 363 -657 ct 
388 -657 411 -653 433 -645 ct 454 -638 473 -627 490 -612 ct 519 -625 546 -640 572 -657 ct 
p
480 -154 m  480 -454 l  480 -489 476 -516 467 -536 ct 459 -556 443 -573 421 -587 ct 
399 -601 374 -608 346 -608 ct 297 -608 255 -585 219 -541 ct 184 -497 167 -430 167 -341 ct 
167 -255 185 -190 220 -145 ct 256 -101 300 -78 350 -78 ct 376 -78 400 -84 422 -96 ct 
444 -108 464 -127 480 -154 ct p ef
pom

pum
14616 8902 t
725 245 m  725 304 l  -10 304 l  -10 245 l  725 245 l  p ef
pom
1.000 1.000 1.000 c 15742 9059 m  15713 9079 15687 9094 15659 9106 ct 15631 9119 15609 9126 15589 9127 ct 
15568 9129 15556 9126 15549 9116 ct 15543 9106 15544 9094 15552 9075 ct 15561 9057 15574 9039 15596 9016 ct 
15617 8994 15640 8975 15669 8955 ct 15698 8935 15724 8920 15752 8907 ct 15780 8894 15802 8888 15822 8886 ct 
15843 8884 15855 8888 15862 8897 ct 15868 8907 15867 8920 15859 8938 ct 15850 8956 15837 8975 15815 8997 ct 
15794 9019 15771 9039 15742 9059 ct 15742 9059 l  p ef


pum
8766 8224 t
0.003 0.503 0.003 c 323 -712 m  322 -744 316 -775 307 -806 ct 293 -852 286 -884 286 -902 ct 
286 -928 292 -947 302 -960 ct 313 -973 326 -980 342 -980 ct 355 -980 367 -973 377 -960 ct 
387 -947 392 -929 392 -905 ct 392 -883 386 -853 375 -816 ct 363 -779 355 -745 353 -713 ct 
377 -729 399 -749 418 -772 ct 448 -808 470 -831 484 -839 ct 499 -848 513 -852 528 -852 ct 
542 -852 554 -847 564 -837 ct 573 -826 578 -814 578 -800 ct 578 -783 571 -768 557 -754 ct 
544 -741 508 -727 450 -714 ct 416 -706 388 -697 365 -687 ct 388 -675 416 -665 449 -658 ct 
502 -648 537 -636 553 -620 ct 570 -605 578 -589 578 -571 ct 578 -557 573 -545 563 -535 ct 
553 -524 542 -519 529 -519 ct 516 -519 501 -524 485 -534 ct 469 -543 448 -565 420 -598 ct 
402 -621 380 -642 353 -662 ct 354 -636 359 -607 368 -576 ct 384 -521 392 -483 392 -462 ct 
392 -442 387 -426 377 -412 ct 366 -399 355 -392 343 -392 ct 327 -392 312 -399 299 -413 ct 
290 -424 286 -440 286 -463 ct 286 -486 290 -514 299 -545 ct 309 -577 314 -598 317 -610 ct 
319 -622 321 -639 323 -662 ct 298 -644 277 -624 258 -602 ct 227 -564 203 -540 187 -530 ct 
176 -523 164 -519 152 -519 ct 137 -519 124 -525 114 -535 ct 103 -546 98 -557 98 -570 ct 
98 -582 102 -594 111 -607 ct 120 -619 134 -630 152 -638 ct 163 -643 190 -651 231 -660 ct 
258 -666 284 -675 309 -686 ct 286 -699 258 -708 226 -715 ct 173 -727 140 -738 127 -748 ct 
108 -763 98 -781 98 -803 ct 98 -815 103 -827 113 -837 ct 123 -847 134 -852 147 -852 ct 
162 -852 177 -848 193 -838 ct 209 -828 229 -809 252 -780 ct 275 -751 299 -728 323 -712 ct 
p ef
pom
1.000 1.000 1.000 c 4089 7289 m  4060 7309 4034 7324 4006 7336 ct 3978 7349 3956 7356 3936 7357 ct 
3915 7359 3903 7356 3896 7346 ct 3890 7336 3891 7324 3899 7305 ct 3908 7287 3921 7269 3943 7246 ct 
3964 7224 3987 7205 4016 7185 ct 4045 7165 4071 7150 4099 7137 ct 4127 7124 4149 7118 4169 7116 ct 
4190 7114 4202 7118 4209 7127 ct 4215 7137 4214 7150 4206 7168 ct 4197 7186 4184 7205 4162 7227 ct 
4141 7249 4118 7269 4089 7289 ct 4089 7289 l  p ef


pum
2655 8259 t
pom
pum
3006 8259 t
0.503 0.300 0.101 c 572 -657 m  598 -657 l  598 157 l  598 202 600 231 606 244 ct 
611 256 619 266 630 273 ct 641 281 663 284 696 284 ct 696 304 l  382 304 l  382 284 l 
395 284 l  419 284 438 280 451 272 ct 460 266 467 256 472 242 ct 477 227 480 199 480 157 ct 
480 -111 l  439 -60 404 -26 373 -8 ct 343 10 311 20 279 20 ct 219 20 166 -8 119 -65 ct 
72 -121 49 -196 49 -290 ct 49 -398 80 -486 141 -554 ct 202 -622 276 -657 363 -657 ct 
388 -657 411 -653 433 -645 ct 454 -638 473 -627 490 -612 ct 519 -625 546 -640 572 -657 ct 
p
480 -154 m  480 -454 l  480 -489 476 -516 467 -536 ct 459 -556 443 -573 421 -587 ct 
399 -601 374 -608 346 -608 ct 297 -608 255 -585 219 -541 ct 184 -497 167 -430 167 -341 ct 
167 -255 185 -190 220 -145 ct 256 -101 300 -78 350 -78 ct 376 -78 400 -84 422 -96 ct 
444 -108 464 -127 480 -154 ct p ef
pom

pum
4895 11399 t
1.000 0.003 0.003 c 225 -980 m  225 -528 l  285 -614 350 -657 419 -657 ct 483 -657 538 -629 586 -573 ct 
633 -517 657 -440 657 -343 ct 657 -230 620 -139 546 -70 ct 483 -10 412 20 334 20 ct 
297 20 260 13 223 0 ct 185 -13 147 -33 108 -59 ct 108 -715 l  108 -788 106 -833 103 -850 ct 
100 -866 95 -878 88 -884 ct 81 -890 73 -893 63 -893 ct 51 -893 36 -889 19 -882 ct 
10 -901 l  195 -980 l  225 -980 l  p
225 -484 m  225 -100 l  248 -77 272 -59 297 -47 ct 321 -35 346 -29 372 -29 ct 
413 -29 451 -53 486 -99 ct 521 -146 539 -214 539 -303 ct 539 -385 521 -448 486 -492 ct 
451 -536 411 -559 366 -559 ct 342 -559 318 -552 294 -540 ct 276 -530 253 -512 225 -484 ct 
p ef
pom

pum
8705 11642 t
225 -980 m  225 -528 l  285 -614 350 -657 419 -657 ct 483 -657 538 -629 586 -573 ct 
633 -517 657 -440 657 -343 ct 657 -230 620 -139 546 -70 ct 483 -10 412 20 334 20 ct 
297 20 260 13 223 0 ct 185 -13 147 -33 108 -59 ct 108 -715 l  108 -788 106 -833 103 -850 ct 
100 -866 95 -878 88 -884 ct 81 -890 73 -893 63 -893 ct 51 -893 36 -889 19 -882 ct 
10 -901 l  195 -980 l  225 -980 l  p
225 -484 m  225 -100 l  248 -77 272 -59 297 -47 ct 321 -35 346 -29 372 -29 ct 
413 -29 451 -53 486 -99 ct 521 -146 539 -214 539 -303 ct 539 -385 521 -448 486 -492 ct 
451 -536 411 -559 366 -559 ct 342 -559 318 -552 294 -540 ct 276 -530 253 -512 225 -484 ct 
p ef
pom

pum
4830 10037 t
725 245 m  725 304 l  -10 304 l  -10 245 l  725 245 l  p ef
pom
gr
gs
0 0 m 21589 0 l 21589 27939 l 0 27939 l 0 0 l eoclip newpath
gr
gr
0 27940 t 
pom
count op_count sub {pop} repeat countdictstack dict_count sub {end} repeat b4_inc_state restore
%%PageTrailer
%%Trailer
%%EOF
