%!PS-Adobe-1.0
%%Creator: Unified Graphics System
%%Pages: (atend)
%%DocumentFonts: Helvetica
%%BoundingBox:   50  236  464  565
%%EndComments
/Sw{setlinewidth}def
/Sg{setgray}def
/Sd{setdash}def
/P {newpath
    moveto
0 0 rlineto
    stroke}def
/M {moveto}def
/D {lineto}def
/N {newpath}def
/S {stroke}def
/T {/Helvetica findfont
    exch
    scalefont
    setfont}def
/R {rotate}def
/W {show}def
/F {fill}def
/X {gsave}def
/Y {grestore}def
%%EndProlog
%%Page: 1 1
0.12000 0.12000 scale
1 setlinecap
1 setlinejoin
6 Sw
0.00 0.00 0.00 setrgbcolor
[] 0 Sd
N
785 4685 M
785 2262 D
S
N
785 2262 M
3762 2262 D
S
N
3762 2262 M
3762 4685 D
S
N
3762 4685 M
785 4685 D
S
N
785 2262 M
785 2366 D
S
N
904 2296 M
904 2262 D
S
N
1023 2262 M
1023 2296 D
S
N
1142 2296 M
1142 2262 D
S
N
1261 2262 M
1261 2296 D
S
N
1380 2366 M
1380 2262 D
S
N
1499 2262 M
1499 2296 D
S
N
1618 2296 M
1618 2262 D
S
N
1737 2262 M
1737 2296 D
S
N
1856 2296 M
1856 2262 D
S
N
1975 2262 M
1975 2366 D
S
N
2094 2296 M
2094 2262 D
S
N
2214 2262 M
2214 2296 D
S
N
2333 2296 M
2333 2262 D
S
N
2452 2262 M
2452 2296 D
S
N
2571 2366 M
2571 2262 D
S
N
2690 2262 M
2690 2296 D
S
N
2809 2296 M
2809 2262 D
S
N
2928 2262 M
2928 2296 D
S
N
3047 2296 M
3047 2262 D
S
N
3166 2262 M
3166 2366 D
S
N
3285 2296 M
3285 2262 D
S
N
3404 2262 M
3404 2296 D
S
N
3523 2296 M
3523 2262 D
S
N
3642 2262 M
3642 2296 D
S
N
738 2193 M
741 2190 D
738 2187 D
736 2190 D
736 2193 D
738 2199 D
741 2202 D
750 2205 D
762 2205 D
770 2202 D
773 2199 D
776 2193 D
776 2187 D
773 2182 D
764 2176 D
750 2170 D
744 2167 D
738 2161 D
736 2153 D
736 2144 D
S
N
762 2205 M
767 2202 D
770 2199 D
773 2193 D
773 2187 D
770 2182 D
762 2176 D
750 2170 D
S
N
736 2150 M
738 2153 D
744 2153 D
759 2147 D
767 2147 D
773 2150 D
776 2153 D
S
N
744 2153 M
759 2144 D
770 2144 D
773 2147 D
776 2153 D
776 2158 D
S
N
811 2205 M
802 2202 D
796 2193 D
793 2179 D
793 2170 D
796 2156 D
802 2147 D
811 2144 D
816 2144 D
825 2147 D
831 2156 D
834 2170 D
834 2179 D
831 2193 D
825 2202 D
816 2205 D
811 2205 D
S
N
811 2205 M
805 2202 D
802 2199 D
799 2193 D
796 2179 D
796 2170 D
799 2156 D
802 2150 D
805 2147 D
811 2144 D
S
N
816 2144 M
822 2147 D
825 2150 D
828 2156 D
831 2170 D
831 2179 D
828 2193 D
825 2199 D
822 2202 D
816 2205 D
S
N
1357 2199 M
1357 2144 D
S
N
1360 2205 M
1360 2144 D
S
N
1360 2205 M
1328 2161 D
1374 2161 D
S
N
1348 2144 M
1368 2144 D
S
N
1406 2205 M
1397 2202 D
1392 2193 D
1389 2179 D
1389 2170 D
1392 2156 D
1397 2147 D
1406 2144 D
1412 2144 D
1420 2147 D
1426 2156 D
1429 2170 D
1429 2179 D
1426 2193 D
1420 2202 D
1412 2205 D
1406 2205 D
S
N
1406 2205 M
1400 2202 D
1397 2199 D
1394 2193 D
1392 2179 D
1392 2170 D
1394 2156 D
1397 2150 D
1400 2147 D
1406 2144 D
S
N
1412 2144 M
1418 2147 D
1420 2150 D
1423 2156 D
1426 2170 D
1426 2179 D
1423 2193 D
1420 2199 D
1418 2202 D
1412 2205 D
S
N
1961 2196 M
1958 2193 D
1961 2190 D
1964 2193 D
1964 2196 D
1961 2202 D
1955 2205 D
1947 2205 D
1938 2202 D
1932 2196 D
1929 2190 D
1926 2179 D
1926 2161 D
1929 2153 D
1935 2147 D
1944 2144 D
1949 2144 D
1958 2147 D
1964 2153 D
1967 2161 D
1967 2164 D
1964 2173 D
1958 2179 D
1949 2182 D
1947 2182 D
1938 2179 D
1932 2173 D
1929 2164 D
S
N
1947 2205 M
1941 2202 D
1935 2196 D
1932 2190 D
1929 2179 D
1929 2161 D
1932 2153 D
1938 2147 D
1944 2144 D
S
N
1949 2144 M
1955 2147 D
1961 2153 D
1964 2161 D
1964 2164 D
1961 2173 D
1955 2179 D
1949 2182 D
S
N
2001 2205 M
1993 2202 D
1987 2193 D
1984 2179 D
1984 2170 D
1987 2156 D
1993 2147 D
2001 2144 D
2007 2144 D
2016 2147 D
2022 2156 D
2024 2170 D
2024 2179 D
2022 2193 D
2016 2202 D
2007 2205 D
2001 2205 D
S
N
2001 2205 M
1996 2202 D
1993 2199 D
1990 2193 D
1987 2179 D
1987 2170 D
1990 2156 D
1993 2150 D
1996 2147 D
2001 2144 D
S
N
2007 2144 M
2013 2147 D
2016 2150 D
2019 2156 D
2022 2170 D
2022 2179 D
2019 2193 D
2016 2199 D
2013 2202 D
2007 2205 D
S
N
2536 2205 M
2527 2202 D
2525 2196 D
2525 2187 D
2527 2182 D
2536 2179 D
2548 2179 D
2556 2182 D
2559 2187 D
2559 2196 D
2556 2202 D
2548 2205 D
2536 2205 D
S
N
2536 2205 M
2530 2202 D
2527 2196 D
2527 2187 D
2530 2182 D
2536 2179 D
S
N
2548 2179 M
2553 2182 D
2556 2187 D
2556 2196 D
2553 2202 D
2548 2205 D
S
N
2536 2179 M
2527 2176 D
2525 2173 D
2522 2167 D
2522 2156 D
2525 2150 D
2527 2147 D
2536 2144 D
2548 2144 D
2556 2147 D
2559 2150 D
2562 2156 D
2562 2167 D
2559 2173 D
2556 2176 D
2548 2179 D
S
N
2536 2179 M
2530 2176 D
2527 2173 D
2525 2167 D
2525 2156 D
2527 2150 D
2530 2147 D
2536 2144 D
S
N
2548 2144 M
2553 2147 D
2556 2150 D
2559 2156 D
2559 2167 D
2556 2173 D
2553 2176 D
2548 2179 D
S
N
2597 2205 M
2588 2202 D
2582 2193 D
2579 2179 D
2579 2170 D
2582 2156 D
2588 2147 D
2597 2144 D
2603 2144 D
2611 2147 D
2617 2156 D
2620 2170 D
2620 2179 D
2617 2193 D
2611 2202 D
2603 2205 D
2597 2205 D
S
N
2597 2205 M
2591 2202 D
2588 2199 D
2585 2193 D
2582 2179 D
2582 2170 D
2585 2156 D
2588 2150 D
2591 2147 D
2597 2144 D
S
N
2603 2144 M
2608 2147 D
2611 2150 D
2614 2156 D
2617 2170 D
2617 2179 D
2614 2193 D
2611 2199 D
2608 2202 D
2603 2205 D
S
N
3097 2193 M
3103 2196 D
3111 2205 D
3111 2144 D
S
N
3108 2202 M
3108 2144 D
S
N
3097 2144 M
3123 2144 D
S
N
3163 2205 M
3155 2202 D
3149 2193 D
3146 2179 D
3146 2170 D
3149 2156 D
3155 2147 D
3163 2144 D
3169 2144 D
3178 2147 D
3184 2156 D
3186 2170 D
3186 2179 D
3184 2193 D
3178 2202 D
3169 2205 D
3163 2205 D
S
N
3163 2205 M
3158 2202 D
3155 2199 D
3152 2193 D
3149 2179 D
3149 2170 D
3152 2156 D
3155 2150 D
3158 2147 D
3163 2144 D
S
N
3169 2144 M
3175 2147 D
3178 2150 D
3181 2156 D
3184 2170 D
3184 2179 D
3181 2193 D
3178 2199 D
3175 2202 D
3169 2205 D
S
N
3221 2205 M
3212 2202 D
3207 2193 D
3204 2179 D
3204 2170 D
3207 2156 D
3212 2147 D
3221 2144 D
3227 2144 D
3236 2147 D
3241 2156 D
3244 2170 D
3244 2179 D
3241 2193 D
3236 2202 D
3227 2205 D
3221 2205 D
S
N
3221 2205 M
3215 2202 D
3212 2199 D
3210 2193 D
3207 2179 D
3207 2170 D
3210 2156 D
3212 2150 D
3215 2147 D
3221 2144 D
S
N
3227 2144 M
3233 2147 D
3236 2150 D
3238 2156 D
3241 2170 D
3241 2179 D
3238 2193 D
3236 2199 D
3233 2202 D
3227 2205 D
S
N
3692 2193 M
3698 2196 D
3707 2205 D
3707 2144 D
S
N
3704 2202 M
3704 2144 D
S
N
3692 2144 M
3718 2144 D
S
N
3744 2193 M
3747 2190 D
3744 2187 D
3741 2190 D
3741 2193 D
3744 2199 D
3747 2202 D
3756 2205 D
3767 2205 D
3776 2202 D
3779 2199 D
3782 2193 D
3782 2187 D
3779 2182 D
3770 2176 D
3756 2170 D
3750 2167 D
3744 2161 D
3741 2153 D
3741 2144 D
S
N
3767 2205 M
3773 2202 D
3776 2199 D
3779 2193 D
3779 2187 D
3776 2182 D
3767 2176 D
3756 2170 D
S
N
3741 2150 M
3744 2153 D
3750 2153 D
3764 2147 D
3773 2147 D
3779 2150 D
3782 2153 D
S
N
3750 2153 M
3764 2144 D
3776 2144 D
3779 2147 D
3782 2153 D
3782 2158 D
S
N
3816 2205 M
3808 2202 D
3802 2193 D
3799 2179 D
3799 2170 D
3802 2156 D
3808 2147 D
3816 2144 D
3822 2144 D
3831 2147 D
3837 2156 D
3840 2170 D
3840 2179 D
3837 2193 D
3831 2202 D
3822 2205 D
3816 2205 D
S
N
3816 2205 M
3811 2202 D
3808 2199 D
3805 2193 D
3802 2179 D
3802 2170 D
3805 2156 D
3808 2150 D
3811 2147 D
3816 2144 D
S
N
3822 2144 M
3828 2147 D
3831 2150 D
3834 2156 D
3837 2170 D
3837 2179 D
3834 2193 D
3831 2199 D
3828 2202 D
3822 2205 D
S
N
785 4685 M
3762 4685 D
S
N
785 4581 M
785 4685 D
S
N
904 4685 M
904 4650 D
S
N
1023 4650 M
1023 4685 D
S
N
1142 4685 M
1142 4650 D
S
N
1261 4650 M
1261 4685 D
S
N
1380 4685 M
1380 4581 D
S
N
1499 4650 M
1499 4685 D
S
N
1618 4685 M
1618 4650 D
S
N
1737 4650 M
1737 4685 D
S
N
1856 4685 M
1856 4650 D
S
N
1975 4581 M
1975 4685 D
S
N
2094 4685 M
2094 4650 D
S
N
2214 4650 M
2214 4685 D
S
N
2333 4685 M
2333 4650 D
S
N
2452 4650 M
2452 4685 D
S
N
2571 4685 M
2571 4581 D
S
N
2690 4650 M
2690 4685 D
S
N
2809 4685 M
2809 4650 D
S
N
2928 4650 M
2928 4685 D
S
N
3047 4685 M
3047 4650 D
S
N
3166 4581 M
3166 4685 D
S
N
3285 4685 M
3285 4650 D
S
N
3404 4650 M
3404 4685 D
S
N
3523 4685 M
3523 4650 D
S
N
3642 4650 M
3642 4685 D
S
N
785 2262 M
785 4685 D
S
N
819 2377 M
785 2377 D
S
N
785 2493 M
819 2493 D
S
N
819 2608 M
785 2608 D
S
N
785 2723 M
888 2723 D
S
N
819 2839 M
785 2839 D
S
N
785 2954 M
819 2954 D
S
N
819 3069 M
785 3069 D
S
N
785 3185 M
819 3185 D
S
N
888 3300 M
785 3300 D
S
N
785 3416 M
819 3416 D
S
N
819 3531 M
785 3531 D
S
N
785 3646 M
819 3646 D
S
N
819 3762 M
785 3762 D
S
N
785 3877 M
888 3877 D
S
N
819 3993 M
785 3993 D
S
N
785 4108 M
819 4108 D
S
N
819 4223 M
785 4223 D
S
N
785 4339 M
819 4339 D
S
N
888 4454 M
785 4454 D
S
N
785 4569 M
819 4569 D
S
N
819 4685 M
785 4685 D
S
N
632 2749 M
623 2746 D
617 2738 D
614 2723 D
614 2715 D
617 2700 D
623 2692 D
632 2689 D
637 2689 D
646 2692 D
652 2700 D
655 2715 D
655 2723 D
652 2738 D
646 2746 D
637 2749 D
632 2749 D
S
N
632 2749 M
626 2746 D
623 2744 D
620 2738 D
617 2723 D
617 2715 D
620 2700 D
623 2694 D
626 2692 D
632 2689 D
S
N
637 2689 M
643 2692 D
646 2694 D
649 2700 D
652 2715 D
652 2723 D
649 2738 D
646 2744 D
643 2746 D
637 2749 D
S
N
678 2694 M
675 2692 D
678 2689 D
681 2692 D
678 2694 D
S
N
718 2749 M
710 2746 D
704 2738 D
701 2723 D
701 2715 D
704 2700 D
710 2692 D
718 2689 D
724 2689 D
733 2692 D
739 2700 D
741 2715 D
741 2723 D
739 2738 D
733 2746 D
724 2749 D
718 2749 D
S
N
718 2749 M
713 2746 D
710 2744 D
707 2738 D
704 2723 D
704 2715 D
707 2700 D
710 2694 D
713 2692 D
718 2689 D
S
N
724 2689 M
730 2692 D
733 2694 D
736 2700 D
739 2715 D
739 2723 D
736 2738 D
733 2744 D
730 2746 D
724 2749 D
S
N
632 3326 M
623 3323 D
617 3315 D
614 3300 D
614 3292 D
617 3277 D
623 3268 D
632 3266 D
637 3266 D
646 3268 D
652 3277 D
655 3292 D
655 3300 D
652 3315 D
646 3323 D
637 3326 D
632 3326 D
S
N
632 3326 M
626 3323 D
623 3320 D
620 3315 D
617 3300 D
617 3292 D
620 3277 D
623 3271 D
626 3268 D
632 3266 D
S
N
637 3266 M
643 3268 D
646 3271 D
649 3277 D
652 3292 D
652 3300 D
649 3315 D
646 3320 D
643 3323 D
637 3326 D
S
N
678 3271 M
675 3268 D
678 3266 D
681 3268 D
678 3271 D
S
N
707 3326 M
701 3297 D
S
N
701 3297 M
707 3303 D
715 3306 D
724 3306 D
733 3303 D
739 3297 D
741 3289 D
741 3283 D
739 3274 D
733 3268 D
724 3266 D
715 3266 D
707 3268 D
704 3271 D
701 3277 D
701 3280 D
704 3283 D
707 3280 D
704 3277 D
S
N
724 3306 M
730 3303 D
736 3297 D
739 3289 D
739 3283 D
736 3274 D
730 3268 D
724 3266 D
S
N
707 3326 M
736 3326 D
S
N
707 3323 M
721 3323 D
736 3326 D
S
N
623 3892 M
629 3894 D
637 3903 D
637 3843 D
S
N
635 3900 M
635 3843 D
S
N
623 3843 M
649 3843 D
S
N
678 3848 M
675 3845 D
678 3843 D
681 3845 D
678 3848 D
S
N
718 3903 M
710 3900 D
704 3892 D
701 3877 D
701 3868 D
704 3854 D
710 3845 D
718 3843 D
724 3843 D
733 3845 D
739 3854 D
741 3868 D
741 3877 D
739 3892 D
733 3900 D
724 3903 D
718 3903 D
S
N
718 3903 M
713 3900 D
710 3897 D
707 3892 D
704 3877 D
704 3868 D
707 3854 D
710 3848 D
713 3845 D
718 3843 D
S
N
724 3843 M
730 3845 D
733 3848 D
736 3854 D
739 3868 D
739 3877 D
736 3892 D
733 3897 D
730 3900 D
724 3903 D
S
N
623 4469 M
629 4471 D
637 4480 D
637 4419 D
S
N
635 4477 M
635 4419 D
S
N
623 4419 M
649 4419 D
S
N
678 4425 M
675 4422 D
678 4419 D
681 4422 D
678 4425 D
S
N
707 4480 M
701 4451 D
S
N
701 4451 M
707 4457 D
715 4460 D
724 4460 D
733 4457 D
739 4451 D
741 4443 D
741 4437 D
739 4428 D
733 4422 D
724 4419 D
715 4419 D
707 4422 D
704 4425 D
701 4431 D
701 4434 D
704 4437 D
707 4434 D
704 4431 D
S
N
724 4460 M
730 4457 D
736 4451 D
739 4443 D
739 4437 D
736 4428 D
730 4422 D
724 4419 D
S
N
707 4480 M
736 4480 D
S
N
707 4477 M
721 4477 D
736 4480 D
S
N
3762 2377 M
3727 2377 D
S
N
3727 2493 M
3762 2493 D
S
N
3762 2608 M
3727 2608 D
S
N
3658 2723 M
3762 2723 D
S
N
3762 2839 M
3727 2839 D
S
N
3727 2954 M
3762 2954 D
S
N
3762 3069 M
3727 3069 D
S
N
3727 3185 M
3762 3185 D
S
N
3762 3300 M
3658 3300 D
S
N
3727 3416 M
3762 3416 D
S
N
3762 3531 M
3727 3531 D
S
N
3727 3646 M
3762 3646 D
S
N
3762 3762 M
3727 3762 D
S
N
3658 3877 M
3762 3877 D
S
N
3762 3993 M
3727 3993 D
S
N
3727 4108 M
3762 4108 D
S
N
3762 4223 M
3727 4223 D
S
N
3727 4339 M
3762 4339 D
S
N
3762 4454 M
3658 4454 D
S
N
3727 4569 M
3762 4569 D
S
N
3762 4685 M
3727 4685 D
S
N
2019 2060 M
2019 1999 D
S
N
2022 2060 M
2022 1999 D
S
N
2022 2051 M
2027 2057 D
2033 2060 D
2039 2060 D
2048 2057 D
2053 2051 D
2056 2043 D
2056 2037 D
2053 2028 D
2048 2022 D
2039 2019 D
2033 2019 D
2027 2022 D
2022 2028 D
S
N
2039 2060 M
2045 2057 D
2050 2051 D
2053 2043 D
2053 2037 D
2050 2028 D
2045 2022 D
2039 2019 D
S
N
2010 2060 M
2022 2060 D
S
N
2010 1999 M
2030 1999 D
S
N
2086 2037 M
2086 1996 D
S
N
2088 2037 M
2088 1996 D
S
N
2075 2037 M
2073 2025 D
2073 2037 D
2102 2037 D
2102 2025 D
2100 2037 D
S
N
2080 1996 M
2094 1996 D
S
N
2115 2023 M
2115 1996 D
S
N
2117 2023 M
2117 1996 D
S
N
2117 2018 M
2121 2021 D
2127 2023 D
2130 2023 D
2136 2021 D
2138 2018 D
2138 1996 D
S
N
2130 2023 M
2134 2021 D
2136 2018 D
2136 1996 D
S
N
2138 2018 M
2142 2021 D
2148 2023 D
2152 2023 D
2157 2021 D
2159 2018 D
2159 1996 D
S
N
2152 2023 M
2155 2021 D
2157 2018 D
2157 1996 D
S
N
2109 2023 M
2117 2023 D
S
N
2109 1996 M
2123 1996 D
S
N
2130 1996 M
2144 1996 D
S
N
2152 1996 M
2165 1996 D
S
N
2179 2037 M
2177 2035 D
2179 2033 D
2180 2035 D
2179 2037 D
S
N
2179 2023 M
2179 1996 D
S
N
2180 2023 M
2180 1996 D
S
N
2173 2023 M
2180 2023 D
S
N
2173 1996 M
2186 1996 D
S
N
2200 2023 M
2200 1996 D
S
N
2202 2023 M
2202 1996 D
S
N
2202 2018 M
2205 2021 D
2211 2023 D
2215 2023 D
2221 2021 D
2223 2018 D
2223 1996 D
S
N
2215 2023 M
2219 2021 D
2221 2018 D
2221 1996 D
S
N
2194 2023 M
2202 2023 D
S
N
2194 1996 M
2207 1996 D
S
N
2215 1996 M
2229 1996 D
S
N
2314 2092 M
2308 2086 D
2303 2077 D
2297 2066 D
2294 2051 D
2294 2040 D
2297 2025 D
2303 2014 D
2308 2005 D
2314 1999 D
S
N
2308 2086 M
2303 2074 D
2300 2066 D
2297 2051 D
2297 2040 D
2300 2025 D
2303 2017 D
2308 2005 D
S
N
2372 2071 M
2375 2063 D
2375 2080 D
2372 2071 D
2366 2077 D
2358 2080 D
2352 2080 D
2343 2077 D
2337 2071 D
2334 2066 D
2332 2057 D
2332 2043 D
2334 2034 D
2337 2028 D
2343 2022 D
2352 2019 D
2358 2019 D
2366 2022 D
2372 2028 D
S
N
2352 2080 M
2346 2077 D
2340 2071 D
2337 2066 D
2334 2057 D
2334 2043 D
2337 2034 D
2340 2028 D
2346 2022 D
2352 2019 D
S
N
2372 2043 M
2372 2019 D
S
N
2375 2043 M
2375 2019 D
S
N
2363 2043 M
2384 2043 D
S
N
2401 2043 M
2435 2043 D
2435 2048 D
2433 2054 D
2430 2057 D
2424 2060 D
2415 2060 D
2407 2057 D
2401 2051 D
2398 2043 D
2398 2037 D
2401 2028 D
2407 2022 D
2415 2019 D
2421 2019 D
2430 2022 D
2435 2028 D
S
N
2433 2043 M
2433 2051 D
2430 2057 D
S
N
2415 2060 M
2410 2057 D
2404 2051 D
2401 2043 D
2401 2037 D
2404 2028 D
2410 2022 D
2415 2019 D
S
N
2453 2080 M
2473 2019 D
S
N
2456 2080 M
2473 2028 D
S
N
2493 2080 M
2473 2019 D
S
N
2447 2080 M
2464 2080 D
S
N
2482 2080 M
2499 2080 D
S
N
2511 2092 M
2516 2086 D
2522 2077 D
2528 2066 D
2531 2051 D
2531 2040 D
2528 2025 D
2522 2014 D
2516 2005 D
2511 1999 D
S
N
2516 2086 M
2522 2074 D
2525 2066 D
2528 2051 D
2528 2040 D
2525 2025 D
2522 2017 D
2516 2005 D
S
N
461 3424 M
522 3424 D
S
N
461 3427 M
522 3427 D
S
N
490 3424 M
484 3419 D
481 3413 D
481 3407 D
484 3398 D
490 3393 D
498 3390 D
504 3390 D
513 3393 D
519 3398 D
522 3407 D
522 3413 D
519 3419 D
513 3424 D
S
N
481 3407 M
484 3401 D
490 3395 D
498 3393 D
504 3393 D
513 3395 D
519 3401 D
522 3407 D
S
N
461 3416 M
461 3427 D
S
N
522 3424 M
522 3436 D
S
N
481 3496 M
481 3468 D
484 3459 D
493 3453 D
501 3450 D
510 3450 D
516 3453 D
519 3456 D
522 3462 D
522 3468 D
519 3476 D
510 3482 D
501 3485 D
493 3485 D
487 3482 D
484 3479 D
481 3473 D
S
N
481 3468 M
484 3462 D
493 3456 D
501 3453 D
513 3453 D
519 3456 D
S
N
522 3468 M
519 3473 D
510 3479 D
501 3482 D
490 3482 D
484 3479 D
S
N
484 3479 M
484 3496 D
S
N
449 3560 M
542 3508 D
S
N
461 3609 M
522 3609 D
S
N
461 3612 M
522 3612 D
S
N
490 3609 M
484 3603 D
481 3598 D
481 3592 D
484 3583 D
490 3577 D
498 3574 D
504 3574 D
513 3577 D
519 3583 D
522 3592 D
522 3598 D
519 3603 D
513 3609 D
S
N
481 3592 M
484 3586 D
490 3580 D
498 3577 D
504 3577 D
513 3580 D
519 3586 D
522 3592 D
S
N
461 3600 M
461 3612 D
S
N
522 3609 M
522 3621 D
S
N
481 3641 M
542 3641 D
S
N
481 3644 M
542 3644 D
S
N
490 3644 M
484 3650 D
481 3655 D
481 3661 D
484 3670 D
490 3675 D
498 3678 D
504 3678 D
513 3675 D
519 3670 D
522 3661 D
522 3655 D
519 3650 D
513 3644 D
S
N
481 3661 M
484 3667 D
490 3673 D
498 3675 D
504 3675 D
513 3673 D
519 3667 D
522 3661 D
S
N
481 3632 M
481 3644 D
S
N
542 3632 M
542 3652 D
S
N
504 3708 M
545 3708 D
S
N
504 3710 M
545 3710 D
S
N
504 3697 M
516 3695 D
504 3695 D
504 3724 D
516 3724 D
504 3722 D
S
N
545 3702 M
545 3716 D
S
N
449 3809 M
455 3804 D
464 3798 D
475 3792 D
490 3789 D
501 3789 D
516 3792 D
527 3798 D
536 3804 D
542 3809 D
S
N
455 3804 M
467 3798 D
475 3795 D
490 3792 D
501 3792 D
516 3795 D
524 3798 D
536 3804 D
S
N
464 3847 M
467 3844 D
470 3847 D
467 3850 D
464 3850 D
461 3847 D
461 3841 D
464 3835 D
470 3832 D
522 3832 D
S
N
461 3841 M
464 3838 D
470 3835 D
522 3835 D
S
N
481 3824 M
481 3847 D
S
N
522 3824 M
522 3844 D
S
N
461 3870 M
522 3870 D
S
N
461 3873 M
522 3873 D
S
N
490 3873 M
484 3879 D
481 3884 D
481 3890 D
484 3899 D
490 3905 D
498 3907 D
504 3907 D
513 3905 D
519 3899 D
522 3890 D
522 3884 D
519 3879 D
513 3873 D
S
N
481 3890 M
484 3896 D
490 3902 D
498 3905 D
504 3905 D
513 3902 D
519 3896 D
522 3890 D
S
N
461 3861 M
461 3873 D
S
N
449 3974 M
542 3922 D
S
N
470 4029 M
478 4032 D
461 4032 D
470 4029 D
464 4023 D
461 4014 D
461 4009 D
464 4000 D
470 3994 D
475 3991 D
484 3988 D
498 3988 D
507 3991 D
513 3994 D
519 4000 D
522 4009 D
522 4014 D
519 4023 D
513 4029 D
S
N
461 4009 M
464 4003 D
470 3997 D
475 3994 D
484 3991 D
498 3991 D
507 3994 D
513 3997 D
519 4003 D
522 4009 D
S
N
498 4029 M
522 4029 D
S
N
498 4032 M
522 4032 D
S
N
498 4020 M
498 4040 D
S
N
498 4058 M
498 4092 D
493 4092 D
487 4089 D
484 4086 D
481 4081 D
481 4072 D
484 4063 D
490 4058 D
498 4055 D
504 4055 D
513 4058 D
519 4063 D
522 4072 D
522 4078 D
519 4086 D
513 4092 D
S
N
498 4089 M
490 4089 D
484 4086 D
S
N
481 4072 M
484 4066 D
490 4060 D
498 4058 D
504 4058 D
513 4060 D
519 4066 D
522 4072 D
S
N
461 4110 M
522 4130 D
S
N
461 4112 M
513 4130 D
S
N
461 4150 M
522 4130 D
S
N
461 4104 M
461 4121 D
S
N
461 4138 M
461 4156 D
S
N
449 4167 M
455 4173 D
464 4179 D
475 4185 D
490 4188 D
501 4188 D
516 4185 D
527 4179 D
536 4173 D
542 4167 D
S
N
455 4173 M
467 4179 D
475 4182 D
490 4185 D
501 4185 D
516 4182 D
524 4179 D
536 4173 D
S
N
2491 3710 M
2491 3649 D
S
N
2494 3710 M
2494 3649 D
S
N
2494 3701 M
2500 3707 D
2505 3710 D
2511 3710 D
2520 3707 D
2526 3701 D
2529 3693 D
2529 3687 D
2526 3678 D
2520 3672 D
2511 3669 D
2505 3669 D
2500 3672 D
2494 3678 D
S
N
2511 3710 M
2517 3707 D
2523 3701 D
2526 3693 D
2526 3687 D
2523 3678 D
2517 3672 D
2511 3669 D
S
N
2482 3710 M
2494 3710 D
S
N
2482 3649 M
2503 3649 D
S
N
2552 3710 M
2552 3649 D
S
N
2555 3710 M
2555 3649 D
S
N
2555 3701 M
2560 3707 D
2566 3710 D
2572 3710 D
2581 3707 D
2586 3701 D
2589 3693 D
2589 3687 D
2586 3678 D
2581 3672 D
2572 3669 D
2566 3669 D
2560 3672 D
2555 3678 D
S
N
2572 3710 M
2578 3707 D
2583 3701 D
2586 3693 D
2586 3687 D
2583 3678 D
2578 3672 D
2572 3669 D
S
N
2543 3710 M
2555 3710 D
S
N
2543 3649 M
2563 3649 D
S
N
2653 3701 M
2661 3695 D
2653 3690 D
S
N
2644 3710 M
2658 3695 D
2644 3681 D
S
N
2609 3695 M
2658 3695 D
S
N
2687 3730 M
2687 3669 D
S
N
2690 3730 M
2690 3669 D
S
N
2725 3730 M
2725 3669 D
S
N
2728 3730 M
2728 3669 D
S
N
2679 3730 M
2699 3730 D
S
N
2716 3730 M
2736 3730 D
S
N
2690 3701 M
2725 3701 D
S
N
2679 3669 M
2699 3669 D
S
N
2716 3669 M
2736 3669 D
S
N
2780 3721 M
2780 3669 D
S
N
2754 3695 M
2806 3695 D
S
N
2826 3730 M
2864 3669 D
S
N
2829 3730 M
2866 3669 D
S
N
2866 3730 M
2826 3669 D
S
N
2820 3730 M
2838 3730 D
S
N
2855 3730 M
2872 3730 D
S
N
2820 3669 M
2838 3669 D
S
N
2855 3669 M
2872 3669 D
S
N
2930 3701 M
2939 3695 D
2930 3690 D
S
N
2921 3710 M
2936 3695 D
2921 3681 D
S
N
2887 3695 M
2936 3695 D
S
N
2953 3701 M
2959 3707 D
2965 3710 D
2970 3710 D
2976 3707 D
2979 3704 D
2982 3695 D
2982 3684 D
2979 3672 D
2970 3649 D
S
N
2956 3704 M
2962 3707 D
2973 3707 D
2979 3704 D
S
N
3002 3710 M
2999 3701 D
2996 3695 D
2982 3675 D
2973 3661 D
2967 3649 D
S
N
2999 3710 M
2996 3701 D
2993 3695 D
2982 3675 D
S
N
3011 3701 M
3017 3707 D
3022 3710 D
3028 3710 D
3034 3707 D
3037 3704 D
3040 3695 D
3040 3684 D
3037 3672 D
3028 3649 D
S
N
3014 3704 M
3019 3707 D
3031 3707 D
3037 3704 D
S
N
3060 3710 M
3057 3701 D
3054 3695 D
3040 3675 D
3031 3661 D
3025 3649 D
S
N
3057 3710 M
3054 3701 D
3051 3695 D
3040 3675 D
S
N
3103 3721 M
3103 3669 D
S
N
3077 3695 M
3129 3695 D
S
N
3149 3730 M
3187 3669 D
S
N
3152 3730 M
3190 3669 D
S
N
3190 3730 M
3149 3669 D
S
N
3144 3730 M
3161 3730 D
S
N
3178 3730 M
3196 3730 D
S
N
3144 3669 M
3161 3669 D
S
N
3178 3669 M
3196 3669 D
S
N
2485 3560 M
2497 3560 D
2514 3525 D
S
N
2494 3560 M
2514 3519 D
2540 3597 D
S
N
2578 3554 M
2581 3560 D
2581 3548 D
2578 3554 D
2575 3557 D
2569 3560 D
2557 3560 D
2552 3557 D
2549 3554 D
2549 3548 D
2552 3545 D
2557 3543 D
2572 3537 D
2578 3534 D
2581 3531 D
S
N
2549 3551 M
2552 3548 D
2557 3545 D
2572 3540 D
2578 3537 D
2581 3534 D
2581 3525 D
2578 3522 D
2572 3519 D
2560 3519 D
2555 3522 D
2552 3525 D
2549 3531 D
2549 3519 D
2552 3525 D
S
N
2601 3554 M
2653 3554 D
S
N
2601 3537 M
2653 3537 D
S
N
2687 3580 M
2679 3577 D
2676 3571 D
2676 3563 D
2679 3557 D
2687 3554 D
2699 3554 D
2708 3557 D
2710 3563 D
2710 3571 D
2708 3577 D
2699 3580 D
2687 3580 D
S
N
2687 3580 M
2682 3577 D
2679 3571 D
2679 3563 D
2682 3557 D
2687 3554 D
S
N
2699 3554 M
2705 3557 D
2708 3563 D
2708 3571 D
2705 3577 D
2699 3580 D
S
N
2687 3554 M
2679 3551 D
2676 3548 D
2673 3543 D
2673 3531 D
2676 3525 D
2679 3522 D
2687 3519 D
2699 3519 D
2708 3522 D
2710 3525 D
2713 3531 D
2713 3543 D
2710 3548 D
2708 3551 D
2699 3554 D
S
N
2687 3554 M
2682 3551 D
2679 3548 D
2676 3543 D
2676 3531 D
2679 3525 D
2682 3522 D
2687 3519 D
S
N
2699 3519 M
2705 3522 D
2708 3525 D
2710 3531 D
2710 3543 D
2708 3548 D
2705 3551 D
2699 3554 D
S
N
2794 3580 M
2794 3519 D
S
N
2797 3580 M
2797 3519 D
S
N
2777 3580 M
2774 3563 D
2774 3580 D
2817 3580 D
2817 3563 D
2814 3580 D
S
N
2786 3519 M
2806 3519 D
S
N
2835 3543 M
2869 3543 D
2869 3548 D
2866 3554 D
2864 3557 D
2858 3560 D
2849 3560 D
2840 3557 D
2835 3551 D
2832 3543 D
2832 3537 D
2835 3528 D
2840 3522 D
2849 3519 D
2855 3519 D
2864 3522 D
2869 3528 D
S
N
2866 3543 M
2866 3551 D
2864 3557 D
S
N
2849 3560 M
2843 3557 D
2838 3551 D
2835 3543 D
2835 3537 D
2838 3528 D
2843 3522 D
2849 3519 D
S
N
2887 3580 M
2907 3519 D
S
N
2889 3580 M
2907 3528 D
S
N
2927 3580 M
2907 3519 D
S
N
2881 3580 M
2898 3580 D
S
N
2915 3580 M
2933 3580 D
S
N
2950 3519 M
2947 3522 D
2950 3525 D
2953 3522 D
2953 3517 D
2950 3511 D
2947 3508 D
S
N
3025 3580 M
3025 3519 D
S
N
3028 3580 M
3045 3528 D
S
N
3025 3580 M
3045 3519 D
S
N
3066 3580 M
3045 3519 D
S
N
3066 3580 M
3066 3519 D
S
N
3069 3580 M
3069 3519 D
S
N
3017 3580 M
3028 3580 D
S
N
3066 3580 M
3077 3580 D
S
N
3017 3519 M
3034 3519 D
S
N
3057 3519 M
3077 3519 D
S
N
3129 3571 M
3132 3580 D
3132 3563 D
3129 3571 D
3123 3577 D
3115 3580 D
3106 3580 D
3097 3577 D
3092 3571 D
3092 3566 D
3095 3560 D
3097 3557 D
3103 3554 D
3120 3548 D
3126 3545 D
3132 3540 D
S
N
3092 3566 M
3097 3560 D
3103 3557 D
3120 3551 D
3126 3548 D
3129 3545 D
3132 3540 D
3132 3528 D
3126 3522 D
3118 3519 D
3109 3519 D
3100 3522 D
3095 3528 D
3092 3537 D
3092 3519 D
3095 3528 D
S
N
3167 3580 M
3167 3519 D
S
N
3170 3580 M
3170 3519 D
S
N
3149 3580 M
3146 3563 D
3146 3580 D
3190 3580 D
3190 3563 D
3187 3580 D
S
N
3158 3519 M
3178 3519 D
S
N
3207 3580 M
3219 3519 D
S
N
3210 3580 M
3219 3534 D
S
N
3230 3580 M
3219 3519 D
S
N
3230 3580 M
3242 3519 D
S
N
3233 3580 M
3242 3534 D
S
N
3253 3580 M
3242 3519 D
S
N
3198 3580 M
3219 3580 D
S
N
3245 3580 M
3262 3580 D
S
N
3276 3569 M
3279 3566 D
3276 3563 D
3274 3566 D
3274 3569 D
3276 3574 D
3279 3577 D
3288 3580 D
3300 3580 D
3308 3577 D
3311 3574 D
3314 3569 D
3314 3563 D
3311 3557 D
3302 3551 D
3288 3545 D
3282 3543 D
3276 3537 D
3274 3528 D
3274 3519 D
S
N
3300 3580 M
3305 3577 D
3308 3574 D
3311 3569 D
3311 3563 D
3308 3557 D
3300 3551 D
3288 3545 D
S
N
3274 3525 M
3276 3528 D
3282 3528 D
3297 3522 D
3305 3522 D
3311 3525 D
3314 3528 D
S
N
3282 3528 M
3297 3519 D
3308 3519 D
3311 3522 D
3314 3528 D
3314 3534 D
S
N
3349 3580 M
3340 3577 D
3334 3569 D
3331 3554 D
3331 3545 D
3334 3531 D
3340 3522 D
3349 3519 D
3354 3519 D
3363 3522 D
3369 3531 D
3372 3545 D
3372 3554 D
3369 3569 D
3363 3577 D
3354 3580 D
3349 3580 D
S
N
3349 3580 M
3343 3577 D
3340 3574 D
3337 3569 D
3334 3554 D
3334 3545 D
3337 3531 D
3340 3525 D
3343 3522 D
3349 3519 D
S
N
3354 3519 M
3360 3522 D
3363 3525 D
3366 3531 D
3369 3545 D
3369 3554 D
3366 3569 D
3363 3574 D
3360 3577 D
3354 3580 D
S
N
3406 3580 M
3398 3577 D
3392 3569 D
3389 3554 D
3389 3545 D
3392 3531 D
3398 3522 D
3406 3519 D
3412 3519 D
3421 3522 D
3427 3531 D
3429 3545 D
3429 3554 D
3427 3569 D
3421 3577 D
3412 3580 D
3406 3580 D
S
N
3406 3580 M
3401 3577 D
3398 3574 D
3395 3569 D
3392 3554 D
3392 3545 D
3395 3531 D
3398 3525 D
3401 3522 D
3406 3519 D
S
N
3412 3519 M
3418 3522 D
3421 3525 D
3424 3531 D
3427 3545 D
3427 3554 D
3424 3569 D
3421 3574 D
3418 3577 D
3412 3580 D
S
N
3461 3580 M
3453 3577 D
3450 3571 D
3450 3563 D
3453 3557 D
3461 3554 D
3473 3554 D
3481 3557 D
3484 3563 D
3484 3571 D
3481 3577 D
3473 3580 D
3461 3580 D
S
N
3461 3580 M
3455 3577 D
3453 3571 D
3453 3563 D
3455 3557 D
3461 3554 D
S
N
3473 3554 M
3479 3557 D
3481 3563 D
3481 3571 D
3479 3577 D
3473 3580 D
S
N
3461 3554 M
3453 3551 D
3450 3548 D
3447 3543 D
3447 3531 D
3450 3525 D
3453 3522 D
3461 3519 D
3473 3519 D
3481 3522 D
3484 3525 D
3487 3531 D
3487 3543 D
3484 3548 D
3481 3551 D
3473 3554 D
S
N
3461 3554 M
3455 3551 D
3453 3548 D
3450 3543 D
3450 3531 D
3453 3525 D
3455 3522 D
3461 3519 D
S
N
3473 3519 M
3479 3522 D
3481 3525 D
3484 3531 D
3484 3543 D
3481 3548 D
3479 3551 D
3473 3554 D
S
N
2497 3421 M
2479 3361 D
S
N
2500 3421 M
2482 3361 D
S
N
2497 3413 M
2494 3395 D
2494 3387 D
2500 3381 D
2505 3381 D
2511 3384 D
2517 3390 D
2523 3398 D
S
N
2529 3421 M
2520 3390 D
2520 3384 D
2523 3381 D
2531 3381 D
2537 3387 D
2540 3393 D
S
N
2531 3421 M
2523 3390 D
2523 3384 D
2526 3381 D
S
N
2556 3398 M
2556 3358 D
S
N
2558 3398 M
2558 3358 D
S
N
2570 3387 M
2570 3371 D
S
N
2551 3398 M
2581 3398 D
2581 3387 D
2580 3398 D
S
N
2558 3379 M
2570 3379 D
S
N
2551 3358 M
2564 3358 D
S
N
2601 3416 M
2653 3416 D
S
N
2601 3398 M
2653 3398 D
S
N
2684 3421 M
2667 3361 D
S
N
2687 3421 M
2670 3361 D
S
N
2684 3413 M
2682 3395 D
2682 3387 D
2687 3381 D
2693 3381 D
2699 3384 D
2705 3390 D
2710 3398 D
S
N
2716 3421 M
2708 3390 D
2708 3384 D
2710 3381 D
2719 3381 D
2725 3387 D
2728 3393 D
S
N
2719 3421 M
2710 3390 D
2710 3384 D
2713 3381 D
S
N
2744 3398 M
2744 3358 D
S
N
2746 3398 M
2746 3358 D
S
N
2738 3398 M
2761 3398 D
2767 3396 D
2769 3394 D
2771 3391 D
2771 3387 D
2769 3383 D
2767 3381 D
2761 3379 D
2746 3379 D
S
N
2761 3398 M
2765 3396 D
2767 3394 D
2769 3391 D
2769 3387 D
2767 3383 D
2765 3381 D
2761 3379 D
S
N
2738 3358 M
2752 3358 D
S
N
2756 3379 M
2760 3377 D
2761 3375 D
2767 3362 D
2769 3360 D
2771 3360 D
2773 3362 D
S
N
2760 3377 M
2761 3373 D
2765 3360 D
2767 3358 D
2771 3358 D
2773 3362 D
2773 3364 D
S
N
2792 3416 M
2844 3416 D
S
N
2792 3398 M
2844 3398 D
S
N
2867 3430 M
2870 3427 D
2867 3424 D
2864 3427 D
2864 3430 D
2867 3436 D
2870 3439 D
2879 3442 D
2890 3442 D
2899 3439 D
2902 3436 D
2905 3430 D
2905 3424 D
2902 3419 D
2893 3413 D
2879 3407 D
2873 3404 D
2867 3398 D
2864 3390 D
2864 3381 D
S
N
2890 3442 M
2896 3439 D
2899 3436 D
2902 3430 D
2902 3424 D
2899 3419 D
2890 3413 D
2879 3407 D
S
N
2864 3387 M
2867 3390 D
2873 3390 D
2888 3384 D
2896 3384 D
2902 3387 D
2905 3390 D
S
N
2873 3390 M
2888 3381 D
2899 3381 D
2902 3384 D
2905 3390 D
2905 3395 D
S
N
2942 3442 M
2934 3439 D
2928 3433 D
2925 3427 D
2922 3416 D
2922 3407 D
2925 3395 D
2928 3390 D
2934 3384 D
2942 3381 D
2948 3381 D
2957 3384 D
2963 3390 D
2966 3395 D
2968 3407 D
2968 3416 D
2966 3427 D
2963 3433 D
2957 3439 D
2948 3442 D
2942 3442 D
S
N
2942 3442 M
2937 3439 D
2931 3433 D
2928 3427 D
2925 3416 D
2925 3407 D
2928 3395 D
2931 3390 D
2937 3384 D
2942 3381 D
S
N
2948 3381 M
2954 3384 D
2960 3390 D
2963 3395 D
2966 3407 D
2966 3416 D
2963 3427 D
2960 3433 D
2954 3439 D
2948 3442 D
S
N
2934 3387 M
2934 3390 D
2937 3395 D
2942 3398 D
2945 3398 D
2951 3395 D
2954 3390 D
2957 3369 D
2960 3367 D
2966 3367 D
2968 3372 D
2968 3375 D
S
N
2954 3390 M
2957 3378 D
2960 3372 D
2963 3369 D
2966 3369 D
2968 3372 D
S
N
2989 3416 M
3041 3416 D
S
N
2989 3398 M
3041 3398 D
S
N
3067 3421 M
3067 3381 D
S
N
3069 3421 M
3069 3381 D
S
N
3069 3413 M
3075 3419 D
3084 3421 D
3090 3421 D
3098 3419 D
3101 3413 D
3101 3381 D
S
N
3090 3421 M
3095 3419 D
3098 3413 D
3098 3381 D
S
N
3101 3413 M
3107 3419 D
3116 3421 D
3121 3421 D
3130 3419 D
3133 3413 D
3133 3381 D
S
N
3121 3421 M
3127 3419 D
3130 3413 D
3130 3381 D
S
N
3058 3421 M
3069 3421 D
S
N
3058 3381 M
3078 3381 D
S
N
3090 3381 M
3110 3381 D
S
N
3121 3381 M
3142 3381 D
S
N
3161 3398 M
3161 3358 D
S
N
3163 3398 M
3163 3358 D
S
N
3186 3398 M
3186 3358 D
S
N
3188 3398 M
3188 3358 D
S
N
3155 3398 M
3169 3398 D
S
N
3180 3398 M
3194 3398 D
S
N
3163 3379 M
3186 3379 D
S
N
3155 3358 M
3169 3358 D
S
N
3180 3358 M
3194 3358 D
S
N
3213 3416 M
3265 3416 D
S
N
3213 3398 M
3265 3398 D
S
N
3294 3430 M
3300 3433 D
3308 3442 D
3308 3381 D
S
N
3305 3439 M
3305 3381 D
S
N
3294 3381 M
3320 3381 D
S
N
3346 3430 M
3349 3427 D
3346 3424 D
3343 3427 D
3343 3430 D
3346 3436 D
3349 3439 D
3357 3442 D
3369 3442 D
3377 3439 D
3380 3436 D
3383 3430 D
3383 3424 D
3380 3419 D
3372 3413 D
3357 3407 D
3351 3404 D
3346 3398 D
3343 3390 D
3343 3381 D
S
N
3369 3442 M
3375 3439 D
3377 3436 D
3380 3430 D
3380 3424 D
3377 3419 D
3369 3413 D
3357 3407 D
S
N
3343 3387 M
3346 3390 D
3351 3390 D
3366 3384 D
3375 3384 D
3380 3387 D
3383 3390 D
S
N
3351 3390 M
3366 3381 D
3377 3381 D
3380 3384 D
3383 3390 D
3383 3395 D
S
N
3406 3442 M
3401 3413 D
S
N
3401 3413 M
3406 3419 D
3415 3421 D
3424 3421 D
3432 3419 D
3438 3413 D
3441 3404 D
3441 3398 D
3438 3390 D
3432 3384 D
3424 3381 D
3415 3381 D
3406 3384 D
3403 3387 D
3401 3393 D
3401 3395 D
3403 3398 D
3406 3395 D
3403 3393 D
S
N
3424 3421 M
3429 3419 D
3435 3413 D
3438 3404 D
3438 3398 D
3435 3390 D
3429 3384 D
3424 3381 D
S
N
3406 3442 M
3435 3442 D
S
N
3406 3439 M
3421 3439 D
3435 3442 D
S
N
3545 3433 M
3548 3424 D
3548 3442 D
3545 3433 D
3539 3439 D
3531 3442 D
3525 3442 D
3516 3439 D
3510 3433 D
3507 3427 D
3505 3419 D
3505 3404 D
3507 3395 D
3510 3390 D
3516 3384 D
3525 3381 D
3531 3381 D
3539 3384 D
3545 3390 D
S
N
3525 3442 M
3519 3439 D
3513 3433 D
3510 3427 D
3507 3419 D
3507 3404 D
3510 3395 D
3513 3390 D
3519 3384 D
3525 3381 D
S
N
3545 3404 M
3545 3381 D
S
N
3548 3404 M
3548 3381 D
S
N
3536 3404 M
3557 3404 D
S
N
3574 3404 M
3608 3404 D
3608 3410 D
3606 3416 D
3603 3419 D
3597 3421 D
3588 3421 D
3580 3419 D
3574 3413 D
3571 3404 D
3571 3398 D
3574 3390 D
3580 3384 D
3588 3381 D
3594 3381 D
3603 3384 D
3608 3390 D
S
N
3606 3404 M
3606 3413 D
3603 3419 D
S
N
3588 3421 M
3582 3419 D
3577 3413 D
3574 3404 D
3574 3398 D
3577 3390 D
3582 3384 D
3588 3381 D
S
N
3626 3442 M
3646 3381 D
S
N
3629 3442 M
3646 3390 D
S
N
3666 3442 M
3646 3381 D
S
N
3620 3442 M
3637 3442 D
S
N
3655 3442 M
3672 3442 D
S
1.00 0.00 0.00 setrgbcolor
N
785 2723 M
904 2723 D
904 2795 D
963 2795 D
963 2889 D
1023 2889 D
1023 2923 D
1082 2923 D
1082 2964 D
1142 2964 D
1142 3014 D
1201 3014 D
1201 3073 D
1261 3073 D
1261 3141 D
1320 3141 D
1320 3223 D
1380 3223 D
1380 3296 D
1440 3296 D
1440 3360 D
1499 3360 D
1499 3427 D
1559 3427 D
1559 3500 D
1618 3500 D
1618 3578 D
1678 3578 D
1678 3659 D
1737 3659 D
1737 3737 D
1797 3737 D
1797 3807 D
1856 3807 D
1856 3840 D
1916 3840 D
1916 3794 D
1975 3794 D
1975 3572 D
2035 3572 D
2035 2970 D
2094 2970 D
2094 2795 D
2154 2795 D
2154 2766 D
2214 2766 D
2214 2753 D
2273 2753 D
2273 2746 D
2333 2746 D
2333 2741 D
2392 2741 D
2392 2738 D
2452 2738 D
2452 2736 D
2511 2736 D
2511 2734 D
2571 2734 D
2571 2733 D
2630 2733 D
2630 2731 D
2690 2731 D
2690 2731 D
2749 2731 D
2749 2730 D
2809 2730 D
2809 2729 D
2868 2729 D
2868 2729 D
2928 2729 D
2928 2728 D
2988 2728 D
2988 2728 D
3047 2728 D
3047 2727 D
3107 2727 D
3107 2727 D
3166 2727 D
3166 2727 D
3226 2727 D
3226 2726 D
3285 2726 D
3285 2726 D
3345 2726 D
3345 2726 D
3404 2726 D
3404 2726 D
3464 2726 D
3464 2726 D
3523 2726 D
3523 2725 D
3583 2725 D
3583 2725 D
3642 2725 D
3642 2725 D
3702 2725 D
3702 2725 D
3762 2725 D
3762 2725 D
3762 2725 D
S
3762 2723 P
N
2571 4108 M
2868 4108 D
S
N
2997 4134 M
2997 4073 D
S
N
3000 4134 M
3035 4079 D
S
N
3000 4128 M
3035 4073 D
S
N
3035 4134 M
3035 4073 D
S
N
2988 4134 M
3000 4134 D
S
N
3026 4134 M
3043 4134 D
S
N
2988 4073 M
3006 4073 D
S
N
3064 4134 M
3064 4073 D
S
N
3066 4134 M
3066 4073 D
S
N
3055 4134 M
3075 4134 D
S
N
3055 4073 M
3098 4073 D
3098 4091 D
3095 4073 D
S
N
3115 4134 M
3115 4073 D
S
N
3118 4134 M
3118 4073 D
S
N
3107 4134 M
3127 4134 D
S
N
3107 4073 M
3150 4073 D
3150 4091 D
3147 4073 D
S
N
3191 4125 M
3191 4073 D
S
N
3165 4099 M
3217 4099 D
S
N
3243 4134 M
3243 4073 D
S
N
3245 4134 M
3280 4079 D
S
N
3245 4128 M
3280 4073 D
S
N
3280 4134 M
3280 4073 D
S
N
3234 4134 M
3245 4134 D
S
N
3271 4134 M
3289 4134 D
S
N
3234 4073 M
3251 4073 D
S
N
3309 4134 M
3309 4073 D
S
N
3312 4134 M
3312 4073 D
S
N
3300 4134 M
3320 4134 D
S
N
3300 4073 M
3344 4073 D
3344 4091 D
3341 4073 D
S
N
3375 4134 M
3367 4131 D
3361 4125 D
3358 4119 D
3355 4108 D
3355 4099 D
3358 4088 D
3361 4082 D
3367 4076 D
3375 4073 D
3381 4073 D
3390 4076 D
3396 4082 D
3398 4088 D
3401 4099 D
3401 4108 D
3398 4119 D
3396 4125 D
3390 4131 D
3381 4134 D
3375 4134 D
S
N
3375 4134 M
3370 4131 D
3364 4125 D
3361 4119 D
3358 4108 D
3358 4099 D
3361 4088 D
3364 4082 D
3370 4076 D
3375 4073 D
S
N
3381 4073 M
3387 4076 D
3393 4082 D
3396 4088 D
3398 4099 D
3398 4108 D
3396 4119 D
3393 4125 D
3387 4131 D
3381 4134 D
S
0.00 0.00 1.00 setrgbcolor
N
968 2828 M
899 2828 D
S
N
933 2828 M
933 2824 D
S
N
968 2824 M
899 2824 D
S
N
1028 2959 M
958 2959 D
S
N
993 2959 M
993 2953 D
S
N
1028 2953 M
958 2953 D
S
N
1087 3010 M
1018 3010 D
S
N
1053 3010 M
1053 3004 D
S
N
1087 3004 M
1018 3004 D
S
N
1147 3059 M
1077 3059 D
S
N
1112 3059 M
1112 3052 D
S
N
1147 3052 M
1077 3052 D
S
N
1206 3126 M
1137 3126 D
S
N
1172 3126 M
1172 3118 D
S
N
1206 3118 M
1137 3118 D
S
N
1266 3202 M
1197 3202 D
S
N
1231 3202 M
1231 3194 D
S
N
1266 3194 M
1197 3194 D
S
N
1325 3278 M
1256 3278 D
S
N
1291 3278 M
1291 3270 D
S
N
1325 3270 M
1256 3270 D
S
N
1385 3384 M
1316 3384 D
S
N
1350 3384 M
1350 3373 D
S
N
1385 3373 M
1316 3373 D
S
N
1444 3457 M
1375 3457 D
S
N
1410 3457 M
1410 3445 D
S
N
1444 3445 M
1375 3445 D
S
N
1504 3543 M
1435 3543 D
S
N
1469 3543 M
1469 3530 D
S
N
1504 3530 M
1435 3530 D
S
N
1563 3613 M
1494 3613 D
S
N
1529 3613 M
1529 3601 D
S
N
1563 3601 M
1494 3601 D
S
N
1623 3701 M
1554 3701 D
S
N
1588 3701 M
1588 3688 D
S
N
1623 3688 M
1554 3688 D
S
N
1683 3799 M
1613 3799 D
S
N
1648 3799 M
1648 3783 D
S
N
1683 3783 M
1613 3783 D
S
N
1742 3878 M
1673 3878 D
S
N
1707 3878 M
1707 3861 D
S
N
1742 3861 M
1673 3861 D
S
N
1802 3974 M
1732 3974 D
S
N
1767 3974 M
1767 3958 D
S
N
1802 3958 M
1732 3958 D
S
N
1861 4042 M
1792 4042 D
S
N
1827 4042 M
1827 4023 D
S
N
1861 4023 M
1792 4023 D
S
N
1921 4038 M
1851 4038 D
S
N
1886 4038 M
1886 4017 D
S
N
1921 4017 M
1851 4017 D
S
N
1980 3982 M
1911 3982 D
S
N
1946 3982 M
1946 3961 D
S
N
1980 3961 M
1911 3961 D
S
N
2040 3732 M
1971 3732 D
S
N
2005 3732 M
2005 3702 D
S
N
2040 3702 M
1971 3702 D
S
N
2099 3016 M
2030 3016 D
S
N
2065 3016 M
2065 2995 D
S
N
2099 2995 M
2030 2995 D
S
N
2159 2834 M
2090 2834 D
S
N
2124 2834 M
2124 2831 D
S
N
2159 2831 M
2090 2831 D
S
N
2218 2793 M
2149 2793 D
S
N
2184 2793 M
2184 2790 D
S
N
2218 2790 M
2149 2790 D
S
N
2278 2775 M
2209 2775 D
S
N
2243 2775 M
2243 2772 D
S
N
2278 2772 M
2209 2772 D
S
N
2337 2764 M
2268 2764 D
S
N
2303 2764 M
2303 2761 D
S
N
2337 2761 M
2268 2761 D
S
N
2397 2756 M
2328 2756 D
S
N
2362 2756 M
2362 2754 D
S
N
2397 2754 M
2328 2754 D
S
N
2457 2750 M
2387 2750 D
S
N
2422 2750 M
2422 2749 D
S
N
2457 2749 M
2387 2749 D
S
N
2516 2746 M
2447 2746 D
S
N
2481 2746 M
2481 2744 D
S
N
2516 2744 M
2447 2744 D
S
N
2576 2742 M
2506 2742 D
S
N
2541 2742 M
2541 2741 D
S
N
2576 2741 M
2506 2741 D
S
N
2635 2740 M
2566 2740 D
S
N
2601 2740 M
2601 2739 D
S
N
2635 2739 M
2566 2739 D
S
N
2695 2737 M
2625 2737 D
S
N
2660 2737 M
2660 2737 D
S
N
2695 2737 M
2625 2737 D
S
N
2754 2736 M
2685 2736 D
S
N
2720 2736 M
2720 2736 D
S
N
2754 2736 M
2685 2736 D
S
N
2814 2735 M
2745 2735 D
S
N
2779 2735 M
2779 2734 D
S
N
2814 2734 M
2745 2734 D
S
N
2873 2733 M
2804 2733 D
S
N
2839 2733 M
2839 2733 D
S
N
2873 2733 M
2804 2733 D
S
N
2933 2732 M
2864 2732 D
S
N
2898 2732 M
2898 2732 D
S
N
2933 2732 M
2864 2732 D
S
N
2992 2731 M
2923 2731 D
S
N
2958 2731 M
2958 2731 D
S
N
2992 2731 M
2923 2731 D
S
N
3052 2731 M
2983 2731 D
S
N
3017 2731 M
3017 2730 D
S
N
3052 2730 M
2983 2730 D
S
N
3111 2730 M
3042 2730 D
S
N
3077 2730 M
3077 2730 D
S
N
3111 2730 M
3042 2730 D
S
N
3171 2729 M
3102 2729 D
S
N
3136 2729 M
3136 2729 D
S
N
3171 2729 M
3102 2729 D
S
N
3231 2729 M
3161 2729 D
S
N
3196 2729 M
3196 2728 D
S
N
3231 2728 M
3161 2728 D
S
N
3290 2729 M
3221 2729 D
S
N
3255 2729 M
3255 2728 D
S
N
3290 2728 M
3221 2728 D
S
N
3350 2728 M
3280 2728 D
S
N
3315 2728 M
3315 2727 D
S
N
3350 2727 M
3280 2727 D
S
N
3409 2728 M
3340 2728 D
S
N
3375 2728 M
3375 2727 D
S
N
3409 2727 M
3340 2727 D
S
N
3469 2727 M
3399 2727 D
S
N
3434 2727 M
3434 2727 D
S
N
3469 2727 M
3399 2727 D
S
N
3528 2727 M
3459 2727 D
S
N
3494 2727 M
3494 2727 D
S
N
3528 2727 M
3459 2727 D
S
N
3588 2726 M
3519 2726 D
S
N
3553 2726 M
3553 2726 D
S
N
3588 2726 M
3519 2726 D
S
N
3647 2726 M
3578 2726 D
S
N
3613 2726 M
3613 2726 D
S
N
3647 2726 M
3578 2726 D
S
N
3707 2726 M
3638 2726 D
S
N
3672 2726 M
3672 2726 D
S
N
3707 2726 M
3638 2726 D
S
N
3762 2726 M
3697 2726 D
S
N
3732 2726 M
3732 2726 D
S
N
3762 2726 M
3697 2726 D
S
N
3762 2726 M
3757 2726 D
S
N
3762 2725 M
3757 2725 D
S
N
2754 4373 M
2685 4373 D
S
N
2720 4373 M
2720 4304 D
S
N
2754 4304 M
2685 4304 D
S
N
2997 4365 M
2997 4304 D
S
N
3000 4365 M
3035 4310 D
S
N
3000 4359 M
3035 4304 D
S
N
3035 4365 M
3035 4304 D
S
N
2988 4365 M
3000 4365 D
S
N
3026 4365 M
3043 4365 D
S
N
2988 4304 M
3006 4304 D
S
N
3064 4365 M
3064 4304 D
S
N
3066 4365 M
3101 4310 D
S
N
3066 4359 M
3101 4304 D
S
N
3101 4365 M
3101 4304 D
S
N
3055 4365 M
3066 4365 D
S
N
3092 4365 M
3110 4365 D
S
N
3055 4304 M
3072 4304 D
S
N
3130 4365 M
3130 4304 D
S
N
3133 4365 M
3133 4304 D
S
N
3121 4365 M
3141 4365 D
S
N
3121 4304 M
3165 4304 D
3165 4321 D
3162 4304 D
S
N
3182 4365 M
3182 4304 D
S
N
3185 4365 M
3185 4304 D
S
N
3173 4365 M
3193 4365 D
S
N
3173 4304 M
3217 4304 D
3217 4321 D
3214 4304 D
S
N
3257 4356 M
3257 4304 D
S
N
3231 4330 M
3283 4330 D
S
N
3309 4365 M
3309 4304 D
S
N
3312 4365 M
3346 4310 D
S
N
3312 4359 M
3346 4304 D
S
N
3346 4365 M
3346 4304 D
S
N
3300 4365 M
3312 4365 D
S
N
3338 4365 M
3355 4365 D
S
N
3300 4304 M
3318 4304 D
S
N
3375 4365 M
3375 4304 D
S
N
3378 4365 M
3413 4310 D
S
N
3378 4359 M
3413 4304 D
S
N
3413 4365 M
3413 4304 D
S
N
3367 4365 M
3378 4365 D
S
N
3404 4365 M
3422 4365 D
S
N
3367 4304 M
3384 4304 D
S
N
3442 4365 M
3442 4304 D
S
N
3445 4365 M
3445 4304 D
S
N
3433 4365 M
3453 4365 D
S
N
3433 4304 M
3476 4304 D
3476 4321 D
3474 4304 D
S
N
3508 4365 M
3500 4362 D
3494 4356 D
3491 4350 D
3488 4339 D
3488 4330 D
3491 4318 D
3494 4313 D
3500 4307 D
3508 4304 D
3514 4304 D
3523 4307 D
3528 4313 D
3531 4318 D
3534 4330 D
3534 4339 D
3531 4350 D
3528 4356 D
3523 4362 D
3514 4365 D
3508 4365 D
S
N
3508 4365 M
3502 4362 D
3497 4356 D
3494 4350 D
3491 4339 D
3491 4330 D
3494 4318 D
3497 4313 D
3502 4307 D
3508 4304 D
S
N
3514 4304 M
3520 4307 D
3526 4313 D
3528 4318 D
3531 4330 D
3531 4339 D
3528 4350 D
3526 4356 D
3520 4362 D
3514 4365 D
S
0.00 0.00 0.00 setrgbcolor
[6 30] 0 Sd
N
785 2723 M
904 2723 D
904 2814 D
963 2814 D
963 2930 D
1023 2930 D
1023 2976 D
1082 2976 D
1082 3025 D
1142 3025 D
1142 3093 D
1201 3093 D
1201 3182 D
1261 3182 D
1261 3300 D
1320 3300 D
1320 3281 D
1380 3281 D
1380 3423 D
1440 3423 D
1440 3498 D
1499 3498 D
1499 3572 D
1559 3572 D
1559 3673 D
1618 3673 D
1618 3764 D
1678 3764 D
1678 3871 D
1737 3871 D
1737 3992 D
1797 3992 D
1797 4132 D
1856 4132 D
1856 4238 D
1916 4238 D
1916 4239 D
1975 4239 D
1975 2904 D
2035 2904 D
2035 3627 D
2094 3627 D
2094 2817 D
2154 2817 D
2154 2786 D
2214 2786 D
2214 2769 D
2273 2769 D
2273 2760 D
2333 2760 D
2333 2754 D
2392 2754 D
2392 2748 D
2452 2748 D
2452 2745 D
2511 2745 D
2511 2742 D
2571 2742 D
2571 2739 D
2630 2739 D
2630 2737 D
2690 2737 D
2690 2736 D
2749 2736 D
2749 2734 D
2809 2734 D
2809 2733 D
2868 2733 D
2868 2732 D
2928 2732 D
2928 2731 D
2988 2731 D
2988 2731 D
3047 2731 D
3047 2730 D
3107 2730 D
3107 2729 D
3166 2729 D
3166 2729 D
3226 2729 D
3226 2728 D
3285 2728 D
3285 2728 D
3345 2728 D
3345 2727 D
3404 2727 D
3404 2727 D
3464 2727 D
3464 2727 D
3523 2727 D
3523 2726 D
3583 2726 D
3583 2726 D
3642 2726 D
3642 2726 D
3702 2726 D
3702 2726 D
3762 2726 D
3762 2726 D
3762 2726 D
S
[] 0 Sd
3762 2723 P
[6 30] 0 Sd
N
2571 3877 M
2868 3877 D
S
[] 0 Sd
N
2997 3903 M
2997 3843 D
S
N
3000 3903 M
3035 3848 D
S
N
3000 3897 M
3035 3843 D
S
N
3035 3903 M
3035 3843 D
S
N
2988 3903 M
3000 3903 D
S
N
3026 3903 M
3043 3903 D
S
N
2988 3843 M
3006 3843 D
S
N
3064 3903 M
3064 3843 D
S
N
3066 3903 M
3101 3848 D
S
N
3066 3897 M
3101 3843 D
S
N
3101 3903 M
3101 3843 D
S
N
3055 3903 M
3066 3903 D
S
N
3092 3903 M
3110 3903 D
S
N
3055 3843 M
3072 3843 D
S
N
3130 3903 M
3130 3843 D
S
N
3133 3903 M
3133 3843 D
S
N
3121 3903 M
3141 3903 D
S
N
3121 3843 M
3165 3843 D
3165 3860 D
3162 3843 D
S
N
3196 3903 M
3188 3900 D
3182 3894 D
3179 3889 D
3176 3877 D
3176 3868 D
3179 3857 D
3182 3851 D
3188 3845 D
3196 3843 D
3202 3843 D
3211 3845 D
3217 3851 D
3219 3857 D
3222 3868 D
3222 3877 D
3219 3889 D
3217 3894 D
3211 3900 D
3202 3903 D
3196 3903 D
S
N
3196 3903 M
3191 3900 D
3185 3894 D
3182 3889 D
3179 3877 D
3179 3868 D
3182 3857 D
3185 3851 D
3191 3845 D
3196 3843 D
S
N
3202 3843 M
3208 3845 D
3214 3851 D
3217 3857 D
3219 3868 D
3219 3877 D
3217 3889 D
3214 3894 D
3208 3900 D
3202 3903 D
S
N
785 4685 M
785 2262 D
S
N
785 2262 M
3762 2262 D
S
N
3762 2262 M
3762 4685 D
S
N
3762 4685 M
785 4685 D
S
N
785 2262 M
785 2366 D
S
N
904 2296 M
904 2262 D
S
N
1023 2262 M
1023 2296 D
S
N
1142 2296 M
1142 2262 D
S
N
1261 2262 M
1261 2296 D
S
N
1380 2366 M
1380 2262 D
S
N
1499 2262 M
1499 2296 D
S
N
1618 2296 M
1618 2262 D
S
N
1737 2262 M
1737 2296 D
S
N
1856 2296 M
1856 2262 D
S
N
1975 2262 M
1975 2366 D
S
N
2094 2296 M
2094 2262 D
S
N
2214 2262 M
2214 2296 D
S
N
2333 2296 M
2333 2262 D
S
N
2452 2262 M
2452 2296 D
S
N
2571 2366 M
2571 2262 D
S
N
2690 2262 M
2690 2296 D
S
N
2809 2296 M
2809 2262 D
S
N
2928 2262 M
2928 2296 D
S
N
3047 2296 M
3047 2262 D
S
N
3166 2262 M
3166 2366 D
S
N
3285 2296 M
3285 2262 D
S
N
3404 2262 M
3404 2296 D
S
N
3523 2296 M
3523 2262 D
S
N
3642 2262 M
3642 2296 D
S
N
738 2193 M
741 2190 D
738 2187 D
736 2190 D
736 2193 D
738 2199 D
741 2202 D
750 2205 D
762 2205 D
770 2202 D
773 2199 D
776 2193 D
776 2187 D
773 2182 D
764 2176 D
750 2170 D
744 2167 D
738 2161 D
736 2153 D
736 2144 D
S
N
762 2205 M
767 2202 D
770 2199 D
773 2193 D
773 2187 D
770 2182 D
762 2176 D
750 2170 D
S
N
736 2150 M
738 2153 D
744 2153 D
759 2147 D
767 2147 D
773 2150 D
776 2153 D
S
N
744 2153 M
759 2144 D
770 2144 D
773 2147 D
776 2153 D
776 2158 D
S
N
811 2205 M
802 2202 D
796 2193 D
793 2179 D
793 2170 D
796 2156 D
802 2147 D
811 2144 D
816 2144 D
825 2147 D
831 2156 D
834 2170 D
834 2179 D
831 2193 D
825 2202 D
816 2205 D
811 2205 D
S
N
811 2205 M
805 2202 D
802 2199 D
799 2193 D
796 2179 D
796 2170 D
799 2156 D
802 2150 D
805 2147 D
811 2144 D
S
N
816 2144 M
822 2147 D
825 2150 D
828 2156 D
831 2170 D
831 2179 D
828 2193 D
825 2199 D
822 2202 D
816 2205 D
S
N
1357 2199 M
1357 2144 D
S
N
1360 2205 M
1360 2144 D
S
N
1360 2205 M
1328 2161 D
1374 2161 D
S
N
1348 2144 M
1368 2144 D
S
N
1406 2205 M
1397 2202 D
1392 2193 D
1389 2179 D
1389 2170 D
1392 2156 D
1397 2147 D
1406 2144 D
1412 2144 D
1420 2147 D
1426 2156 D
1429 2170 D
1429 2179 D
1426 2193 D
1420 2202 D
1412 2205 D
1406 2205 D
S
N
1406 2205 M
1400 2202 D
1397 2199 D
1394 2193 D
1392 2179 D
1392 2170 D
1394 2156 D
1397 2150 D
1400 2147 D
1406 2144 D
S
N
1412 2144 M
1418 2147 D
1420 2150 D
1423 2156 D
1426 2170 D
1426 2179 D
1423 2193 D
1420 2199 D
1418 2202 D
1412 2205 D
S
N
1961 2196 M
1958 2193 D
1961 2190 D
1964 2193 D
1964 2196 D
1961 2202 D
1955 2205 D
1947 2205 D
1938 2202 D
1932 2196 D
1929 2190 D
1926 2179 D
1926 2161 D
1929 2153 D
1935 2147 D
1944 2144 D
1949 2144 D
1958 2147 D
1964 2153 D
1967 2161 D
1967 2164 D
1964 2173 D
1958 2179 D
1949 2182 D
1947 2182 D
1938 2179 D
1932 2173 D
1929 2164 D
S
N
1947 2205 M
1941 2202 D
1935 2196 D
1932 2190 D
1929 2179 D
1929 2161 D
1932 2153 D
1938 2147 D
1944 2144 D
S
N
1949 2144 M
1955 2147 D
1961 2153 D
1964 2161 D
1964 2164 D
1961 2173 D
1955 2179 D
1949 2182 D
S
N
2001 2205 M
1993 2202 D
1987 2193 D
1984 2179 D
1984 2170 D
1987 2156 D
1993 2147 D
2001 2144 D
2007 2144 D
2016 2147 D
2022 2156 D
2024 2170 D
2024 2179 D
2022 2193 D
2016 2202 D
2007 2205 D
2001 2205 D
S
N
2001 2205 M
1996 2202 D
1993 2199 D
1990 2193 D
1987 2179 D
1987 2170 D
1990 2156 D
1993 2150 D
1996 2147 D
2001 2144 D
S
N
2007 2144 M
2013 2147 D
2016 2150 D
2019 2156 D
2022 2170 D
2022 2179 D
2019 2193 D
2016 2199 D
2013 2202 D
2007 2205 D
S
N
2536 2205 M
2527 2202 D
2525 2196 D
2525 2187 D
2527 2182 D
2536 2179 D
2548 2179 D
2556 2182 D
2559 2187 D
2559 2196 D
2556 2202 D
2548 2205 D
2536 2205 D
S
N
2536 2205 M
2530 2202 D
2527 2196 D
2527 2187 D
2530 2182 D
2536 2179 D
S
N
2548 2179 M
2553 2182 D
2556 2187 D
2556 2196 D
2553 2202 D
2548 2205 D
S
N
2536 2179 M
2527 2176 D
2525 2173 D
2522 2167 D
2522 2156 D
2525 2150 D
2527 2147 D
2536 2144 D
2548 2144 D
2556 2147 D
2559 2150 D
2562 2156 D
2562 2167 D
2559 2173 D
2556 2176 D
2548 2179 D
S
N
2536 2179 M
2530 2176 D
2527 2173 D
2525 2167 D
2525 2156 D
2527 2150 D
2530 2147 D
2536 2144 D
S
N
2548 2144 M
2553 2147 D
2556 2150 D
2559 2156 D
2559 2167 D
2556 2173 D
2553 2176 D
2548 2179 D
S
N
2597 2205 M
2588 2202 D
2582 2193 D
2579 2179 D
2579 2170 D
2582 2156 D
2588 2147 D
2597 2144 D
2603 2144 D
2611 2147 D
2617 2156 D
2620 2170 D
2620 2179 D
2617 2193 D
2611 2202 D
2603 2205 D
2597 2205 D
S
N
2597 2205 M
2591 2202 D
2588 2199 D
2585 2193 D
2582 2179 D
2582 2170 D
2585 2156 D
2588 2150 D
2591 2147 D
2597 2144 D
S
N
2603 2144 M
2608 2147 D
2611 2150 D
2614 2156 D
2617 2170 D
2617 2179 D
2614 2193 D
2611 2199 D
2608 2202 D
2603 2205 D
S
N
3097 2193 M
3103 2196 D
3111 2205 D
3111 2144 D
S
N
3108 2202 M
3108 2144 D
S
N
3097 2144 M
3123 2144 D
S
N
3163 2205 M
3155 2202 D
3149 2193 D
3146 2179 D
3146 2170 D
3149 2156 D
3155 2147 D
3163 2144 D
3169 2144 D
3178 2147 D
3184 2156 D
3186 2170 D
3186 2179 D
3184 2193 D
3178 2202 D
3169 2205 D
3163 2205 D
S
N
3163 2205 M
3158 2202 D
3155 2199 D
3152 2193 D
3149 2179 D
3149 2170 D
3152 2156 D
3155 2150 D
3158 2147 D
3163 2144 D
S
N
3169 2144 M
3175 2147 D
3178 2150 D
3181 2156 D
3184 2170 D
3184 2179 D
3181 2193 D
3178 2199 D
3175 2202 D
3169 2205 D
S
N
3221 2205 M
3212 2202 D
3207 2193 D
3204 2179 D
3204 2170 D
3207 2156 D
3212 2147 D
3221 2144 D
3227 2144 D
3236 2147 D
3241 2156 D
3244 2170 D
3244 2179 D
3241 2193 D
3236 2202 D
3227 2205 D
3221 2205 D
S
N
3221 2205 M
3215 2202 D
3212 2199 D
3210 2193 D
3207 2179 D
3207 2170 D
3210 2156 D
3212 2150 D
3215 2147 D
3221 2144 D
S
N
3227 2144 M
3233 2147 D
3236 2150 D
3238 2156 D
3241 2170 D
3241 2179 D
3238 2193 D
3236 2199 D
3233 2202 D
3227 2205 D
S
N
3692 2193 M
3698 2196 D
3707 2205 D
3707 2144 D
S
N
3704 2202 M
3704 2144 D
S
N
3692 2144 M
3718 2144 D
S
N
3744 2193 M
3747 2190 D
3744 2187 D
3741 2190 D
3741 2193 D
3744 2199 D
3747 2202 D
3756 2205 D
3767 2205 D
3776 2202 D
3779 2199 D
3782 2193 D
3782 2187 D
3779 2182 D
3770 2176 D
3756 2170 D
3750 2167 D
3744 2161 D
3741 2153 D
3741 2144 D
S
N
3767 2205 M
3773 2202 D
3776 2199 D
3779 2193 D
3779 2187 D
3776 2182 D
3767 2176 D
3756 2170 D
S
N
3741 2150 M
3744 2153 D
3750 2153 D
3764 2147 D
3773 2147 D
3779 2150 D
3782 2153 D
S
N
3750 2153 M
3764 2144 D
3776 2144 D
3779 2147 D
3782 2153 D
3782 2158 D
S
N
3816 2205 M
3808 2202 D
3802 2193 D
3799 2179 D
3799 2170 D
3802 2156 D
3808 2147 D
3816 2144 D
3822 2144 D
3831 2147 D
3837 2156 D
3840 2170 D
3840 2179 D
3837 2193 D
3831 2202 D
3822 2205 D
3816 2205 D
S
N
3816 2205 M
3811 2202 D
3808 2199 D
3805 2193 D
3802 2179 D
3802 2170 D
3805 2156 D
3808 2150 D
3811 2147 D
3816 2144 D
S
N
3822 2144 M
3828 2147 D
3831 2150 D
3834 2156 D
3837 2170 D
3837 2179 D
3834 2193 D
3831 2199 D
3828 2202 D
3822 2205 D
S
N
785 4685 M
3762 4685 D
S
N
785 4581 M
785 4685 D
S
N
904 4685 M
904 4650 D
S
N
1023 4650 M
1023 4685 D
S
N
1142 4685 M
1142 4650 D
S
N
1261 4650 M
1261 4685 D
S
N
1380 4685 M
1380 4581 D
S
N
1499 4650 M
1499 4685 D
S
N
1618 4685 M
1618 4650 D
S
N
1737 4650 M
1737 4685 D
S
N
1856 4685 M
1856 4650 D
S
N
1975 4581 M
1975 4685 D
S
N
2094 4685 M
2094 4650 D
S
N
2214 4650 M
2214 4685 D
S
N
2333 4685 M
2333 4650 D
S
N
2452 4650 M
2452 4685 D
S
N
2571 4685 M
2571 4581 D
S
N
2690 4650 M
2690 4685 D
S
N
2809 4685 M
2809 4650 D
S
N
2928 4650 M
2928 4685 D
S
N
3047 4685 M
3047 4650 D
S
N
3166 4581 M
3166 4685 D
S
N
3285 4685 M
3285 4650 D
S
N
3404 4650 M
3404 4685 D
S
N
3523 4685 M
3523 4650 D
S
N
3642 4650 M
3642 4685 D
S
N
785 2262 M
785 4685 D
S
N
819 2377 M
785 2377 D
S
N
785 2493 M
819 2493 D
S
N
819 2608 M
785 2608 D
S
N
785 2723 M
888 2723 D
S
N
819 2839 M
785 2839 D
S
N
785 2954 M
819 2954 D
S
N
819 3069 M
785 3069 D
S
N
785 3185 M
819 3185 D
S
N
888 3300 M
785 3300 D
S
N
785 3416 M
819 3416 D
S
N
819 3531 M
785 3531 D
S
N
785 3646 M
819 3646 D
S
N
819 3762 M
785 3762 D
S
N
785 3877 M
888 3877 D
S
N
819 3993 M
785 3993 D
S
N
785 4108 M
819 4108 D
S
N
819 4223 M
785 4223 D
S
N
785 4339 M
819 4339 D
S
N
888 4454 M
785 4454 D
S
N
785 4569 M
819 4569 D
S
N
819 4685 M
785 4685 D
S
N
632 2749 M
623 2746 D
617 2738 D
614 2723 D
614 2715 D
617 2700 D
623 2692 D
632 2689 D
637 2689 D
646 2692 D
652 2700 D
655 2715 D
655 2723 D
652 2738 D
646 2746 D
637 2749 D
632 2749 D
S
N
632 2749 M
626 2746 D
623 2744 D
620 2738 D
617 2723 D
617 2715 D
620 2700 D
623 2694 D
626 2692 D
632 2689 D
S
N
637 2689 M
643 2692 D
646 2694 D
649 2700 D
652 2715 D
652 2723 D
649 2738 D
646 2744 D
643 2746 D
637 2749 D
S
N
678 2694 M
675 2692 D
678 2689 D
681 2692 D
678 2694 D
S
N
718 2749 M
710 2746 D
704 2738 D
701 2723 D
701 2715 D
704 2700 D
710 2692 D
718 2689 D
724 2689 D
733 2692 D
739 2700 D
741 2715 D
741 2723 D
739 2738 D
733 2746 D
724 2749 D
718 2749 D
S
N
718 2749 M
713 2746 D
710 2744 D
707 2738 D
704 2723 D
704 2715 D
707 2700 D
710 2694 D
713 2692 D
718 2689 D
S
N
724 2689 M
730 2692 D
733 2694 D
736 2700 D
739 2715 D
739 2723 D
736 2738 D
733 2744 D
730 2746 D
724 2749 D
S
N
632 3326 M
623 3323 D
617 3315 D
614 3300 D
614 3292 D
617 3277 D
623 3268 D
632 3266 D
637 3266 D
646 3268 D
652 3277 D
655 3292 D
655 3300 D
652 3315 D
646 3323 D
637 3326 D
632 3326 D
S
N
632 3326 M
626 3323 D
623 3320 D
620 3315 D
617 3300 D
617 3292 D
620 3277 D
623 3271 D
626 3268 D
632 3266 D
S
N
637 3266 M
643 3268 D
646 3271 D
649 3277 D
652 3292 D
652 3300 D
649 3315 D
646 3320 D
643 3323 D
637 3326 D
S
N
678 3271 M
675 3268 D
678 3266 D
681 3268 D
678 3271 D
S
N
707 3326 M
701 3297 D
S
N
701 3297 M
707 3303 D
715 3306 D
724 3306 D
733 3303 D
739 3297 D
741 3289 D
741 3283 D
739 3274 D
733 3268 D
724 3266 D
715 3266 D
707 3268 D
704 3271 D
701 3277 D
701 3280 D
704 3283 D
707 3280 D
704 3277 D
S
N
724 3306 M
730 3303 D
736 3297 D
739 3289 D
739 3283 D
736 3274 D
730 3268 D
724 3266 D
S
N
707 3326 M
736 3326 D
S
N
707 3323 M
721 3323 D
736 3326 D
S
N
623 3892 M
629 3894 D
637 3903 D
637 3843 D
S
N
635 3900 M
635 3843 D
S
N
623 3843 M
649 3843 D
S
N
678 3848 M
675 3845 D
678 3843 D
681 3845 D
678 3848 D
S
N
718 3903 M
710 3900 D
704 3892 D
701 3877 D
701 3868 D
704 3854 D
710 3845 D
718 3843 D
724 3843 D
733 3845 D
739 3854 D
741 3868 D
741 3877 D
739 3892 D
733 3900 D
724 3903 D
718 3903 D
S
N
718 3903 M
713 3900 D
710 3897 D
707 3892 D
704 3877 D
704 3868 D
707 3854 D
710 3848 D
713 3845 D
718 3843 D
S
N
724 3843 M
730 3845 D
733 3848 D
736 3854 D
739 3868 D
739 3877 D
736 3892 D
733 3897 D
730 3900 D
724 3903 D
S
N
623 4469 M
629 4471 D
637 4480 D
637 4419 D
S
N
635 4477 M
635 4419 D
S
N
623 4419 M
649 4419 D
S
N
678 4425 M
675 4422 D
678 4419 D
681 4422 D
678 4425 D
S
N
707 4480 M
701 4451 D
S
N
701 4451 M
707 4457 D
715 4460 D
724 4460 D
733 4457 D
739 4451 D
741 4443 D
741 4437 D
739 4428 D
733 4422 D
724 4419 D
715 4419 D
707 4422 D
704 4425 D
701 4431 D
701 4434 D
704 4437 D
707 4434 D
704 4431 D
S
N
724 4460 M
730 4457 D
736 4451 D
739 4443 D
739 4437 D
736 4428 D
730 4422 D
724 4419 D
S
N
707 4480 M
736 4480 D
S
N
707 4477 M
721 4477 D
736 4480 D
S
N
3762 2377 M
3727 2377 D
S
N
3727 2493 M
3762 2493 D
S
N
3762 2608 M
3727 2608 D
S
N
3658 2723 M
3762 2723 D
S
N
3762 2839 M
3727 2839 D
S
N
3727 2954 M
3762 2954 D
S
N
3762 3069 M
3727 3069 D
S
N
3727 3185 M
3762 3185 D
S
N
3762 3300 M
3658 3300 D
S
N
3727 3416 M
3762 3416 D
S
N
3762 3531 M
3727 3531 D
S
N
3727 3646 M
3762 3646 D
S
N
3762 3762 M
3727 3762 D
S
N
3658 3877 M
3762 3877 D
S
N
3762 3993 M
3727 3993 D
S
N
3727 4108 M
3762 4108 D
S
N
3762 4223 M
3727 4223 D
S
N
3727 4339 M
3762 4339 D
S
N
3762 4454 M
3658 4454 D
S
N
3727 4569 M
3762 4569 D
S
N
3762 4685 M
3727 4685 D
S
showpage
%%Trailer
%%Pages: 1
%%BoundingBox: 50 236 464 565
