%!PS-Adobe-2.0 EPSF-2.0
%%BoundingBox:  0 0 567 341
%%Title: /home/qliphy/Downloads/MCFM/Bin/plot0/h700/philj.eps: 
%%Creator: ROOT Version 5.32/00
%%CreationDate: Thu Jun 13 17:07:34 2013
%%EndComments
%%BeginProlog
80 dict begin
/s {stroke} def /l {lineto} def /m {moveto} def /t {translate} def
/r {rotate} def /rl {roll}  def /R {repeat} def
/d {rlineto} def /rm {rmoveto} def /gr {grestore} def /f {eofill} def
/c {setrgbcolor} def /black {0 setgray} def /sd {setdash} def
/cl {closepath} def /sf {scalefont setfont} def /lw {setlinewidth} def
/box {m dup 0 exch d exch 0 d 0 exch neg d cl} def
/NC{systemdict begin initclip end}def/C{NC box clip newpath}def
/bl {box s} def /bf {box f} def /Y { 0 exch d} def /X { 0 d} def 
/K {{pop pop 0 moveto} exch kshow} bind def
/ita {/ang 15 def gsave [1 0 ang dup sin exch cos div 1 0 0] concat} def 
/mp {newpath /y exch def /x exch def} def
/side {[w .77 mul w .23 mul] .385 w mul sd w 0 l currentpoint t -144 r} def
/mr {mp x y w2 0 360 arc} def /m24 {mr s} def /m20 {mr f} def
/mb {mp x y w2 add m w2 neg 0 d 0 w neg d w 0 d 0 w d cl} def
/mt {mp x y w2 add m w2 neg w neg d w 0 d cl} def
/m21 {mb f} def /m25 {mb s} def /m22 {mt f} def /m26{mt s} def
/m23 {mp x y w2 sub m w2 w d w neg 0 d cl f} def
/m27 {mp x y w2 add m w3 neg w2 neg d w3 w2 neg d w3 w2 d cl s} def
/m28 {mp x w2 sub y w2 sub w3 add m w3 0 d  0 w3 neg d w3 0 d 0 w3 d w3 0 d  0 w3 d w3 neg 0 d 0 w3 d w3 neg 0 d 0 w3 neg d w3 neg 0 d cl s } def
/m29 {mp gsave x w2 sub y w2 add w3 sub m currentpoint t 4 {side} repeat cl fill gr} def
/m30 {mp gsave x w2 sub y w2 add w3 sub m currentpoint t 4 {side} repeat cl s gr} def
/m31 {mp x y w2 sub m 0 w d x w2 sub y m w 0 d x w2 sub y w2 add m w w neg d x w2 sub y w2 sub m w w d s} def
/m32 {mp x y w2 sub m w2 w d w neg 0 d cl s} def
/m33 {mp x y w2 add m w3 neg w2 neg d w3 w2 neg d w3 w2 d cl f} def
/m34 {mp x w2 sub y w2 sub w3 add m w3 0 d  0 w3 neg d w3 0 d 0 w3 d w3 0 d  0 w3 d w3 neg 0 d 0 w3 d w3 neg 0 d 0 w3 neg d w3 neg 0 d cl f } def
/m2 {mp x y w2 sub m 0 w d x w2 sub y m w 0 d s} def
/m5 {mp x w2 sub y w2 sub m w w d x w2 sub y w2 add m w w neg d s} def
/reEncode {exch findfont dup length dict begin {1 index /FID eq  {pop pop} {def} ifelse } forall /Encoding exch def currentdict end dup /FontName get exch definefont pop } def [/Times-Bold /Times-Italic /Times-BoldItalic /Helvetica /Helvetica-Oblique
 /Helvetica-Bold /Helvetica-BoldOblique /Courier /Courier-Oblique /Courier-Bold /Courier-BoldOblique /Times-Roman /AvantGarde-Book /AvantGarde-BookOblique /AvantGarde-Demi /AvantGarde-DemiOblique /Bookman-Demi /Bookman-DemiItalic /Bookman-Light
 /Bookman-LightItalic /Helvetica-Narrow /Helvetica-Narrow-Bold /Helvetica-Narrow-BoldOblique /Helvetica-Narrow-Oblique /NewCenturySchlbk-Roman /NewCenturySchlbk-Bold /NewCenturySchlbk-BoldItalic /NewCenturySchlbk-Italic /Palatino-Bold
 /Palatino-BoldItalic /Palatino-Italic /Palatino-Roman ] {ISOLatin1Encoding reEncode } forall%%EndProlog
%%BeginSetup
%%EndSetup
newpath  gsave  .25 .25 scale  gsave  0 0 t black[  ] 0 sd 3 lw 1 1 1 c 2268 1364 0 0 bf black 1 1 1 c 1791 1078 363 218 bf black 1791 1078 363 218 bl 1 1 1 c 1791 1078 363 218 bf black 1791 1078 363 218 bl 363 218 m 1791 X s[ 4 8] 0 sd 363 1296 m
 -1078 Y s 647 1296 m -1078 Y s 932 1296 m -1078 Y s 1216 1296 m -1078 Y s 1500 1296 m -1078 Y s 1785 1296 m -1078 Y s 2069 1296 m -1078 Y s 2069 1296 m -1078 Y s[  ] 0 sd 363 1296 m 1791 X s 363 218 m 1078 Y s[ 4 8] 0 sd 2154 249 m -1791 X s 2154
 291 m -1791 X s 2154 323 m -1791 X s 2154 349 m -1791 X s 2154 371 m -1791 X s 2154 390 m -1791 X s 2154 407 m -1791 X s 2154 422 m -1791 X s 2154 521 m -1791 X s 2154 579 m -1791 X s 2154 620 m -1791 X s 2154 652 m -1791 X s 2154 678 m -1791 X s
 2154 700 m -1791 X s 2154 719 m -1791 X s 2154 736 m -1791 X s 2154 751 m -1791 X s 2154 851 m -1791 X s 2154 909 m -1791 X s 2154 950 m -1791 X s 2154 982 m -1791 X s 2154 1008 m -1791 X s 2154 1030 m -1791 X s 2154 1049 m -1791 X s 2154 1066 m
 -1791 X s 2154 1081 m -1791 X s 2154 1180 m -1791 X s 2154 1238 m -1791 X s 2154 1279 m -1791 X s[  ] 0 sd 2154 218 m 1078 Y s 1 0 0 c 6 lw 1 1 1 c black 1 0 0 c 363 317 m 45 X 45 Y 44 X 3 Y 45 X 28 Y 45 X -69 Y 45 X 51 Y 45 X 5 Y 44 X 26 Y 45 X 31
 Y 45 X -19 Y 45 X 34 Y 44 X -20 Y 45 X 34 Y 45 X 20 Y 45 X 2 Y 45 X 44 Y 44 X 40 Y 45 X 32 Y 45 X 11 Y 45 X 41 Y 45 X 12 Y 44 X 54 Y 45 X 34 Y 45 X 47 Y 45 X 30 Y 45 X 46 Y 44 X 38 Y 45 X 36 Y 45 X 38 Y 45 X 42 Y 44 X 39 Y 45 X 37 Y 45 X 36 Y 45 X
 30 Y 45 X 24 Y 44 X 5 Y 45 X -20 Y 45 X -62 Y 45 X -98 Y 45 X -194 Y 44 X s black 3 lw 363 218 m 1791 X s
 gsave  2268 1364 0 0 C 2132.07 99.3439 t 0 r /Helvetica findfont 76.4184 sf 0 0 m ( ) show NC gr 
 gsave  2268 1364 0 0 C 2111.06 59.2243 t 0 r /Helvetica findfont 51.5824 sf 0 0 m (lj) show NC gr 
 gsave  2268 1364 0 0 C 2072.85 99.3439 t 0 r /Symbol findfont 76.4184 sf 0 0 m (f) show NC gr  363 251 m -33 Y s 420 234 m -16 Y s 477 234 m -16 Y s 533 234 m -16 Y s 590 234 m -16 Y s 647 251 m -33 Y s 704 234 m -16 Y s 761 234 m -16 Y s 818 234 m
 -16 Y s 875 234 m -16 Y s 932 251 m -33 Y s 988 234 m -16 Y s 1045 234 m -16 Y s 1102 234 m -16 Y s 1159 234 m -16 Y s 1216 251 m -33 Y s 1273 234 m -16 Y s 1330 234 m -16 Y s 1387 234 m -16 Y s 1443 234 m -16 Y s 1500 251 m -33 Y s 1557 234 m -16 Y
 s 1614 234 m -16 Y s 1671 234 m -16 Y s 1728 234 m -16 Y s 1785 251 m -33 Y s 1842 234 m -16 Y s 1898 234 m -16 Y s 1955 234 m -16 Y s 2012 234 m -16 Y s 2069 251 m -33 Y s 2069 251 m -33 Y s 2126 234 m -16 Y s
 gsave  2268 1364 0 0 C 343.883 158.568 t 0 r /Helvetica findfont 63.0452 sf 0 0 m (0) show NC gr 
 gsave  2268 1364 0 0 C 601.795 158.568 t 0 r /Helvetica findfont 63.0452 sf 0 0 m (0.5) show NC gr 
 gsave  2268 1364 0 0 C 917.021 158.568 t 0 r /Helvetica findfont 63.0452 sf 0 0 m (1) show NC gr 
 gsave  2268 1364 0 0 C 1171.11 158.568 t 0 r /Helvetica findfont 63.0452 sf 0 0 m (1.5) show NC gr 
 gsave  2268 1364 0 0 C 1482.52 158.568 t 0 r /Helvetica findfont 63.0452 sf 0 0 m (2) show NC gr 
 gsave  2268 1364 0 0 C 1740.43 158.568 t 0 r /Helvetica findfont 63.0452 sf 0 0 m (2.5) show NC gr 
 gsave  2268 1364 0 0 C 2049.92 158.568 t 0 r /Helvetica findfont 63.0452 sf 0 0 m (3) show NC gr  363 1296 m 1791 X s 363 1264 m 32 Y s 420 1280 m 16 Y s 477 1280 m 16 Y s 533 1280 m 16 Y s 590 1280 m 16 Y s 647 1264 m 32 Y s 704 1280 m 16 Y s 761
 1280 m 16 Y s 818 1280 m 16 Y s 875 1280 m 16 Y s 932 1264 m 32 Y s 988 1280 m 16 Y s 1045 1280 m 16 Y s 1102 1280 m 16 Y s 1159 1280 m 16 Y s 1216 1264 m 32 Y s 1273 1280 m 16 Y s 1330 1280 m 16 Y s 1387 1280 m 16 Y s 1443 1280 m 16 Y s 1500 1264 m
 32 Y s 1557 1280 m 16 Y s 1614 1280 m 16 Y s 1671 1280 m 16 Y s 1728 1280 m 16 Y s 1785 1264 m 32 Y s 1842 1280 m 16 Y s 1898 1280 m 16 Y s 1955 1280 m 16 Y s 2012 1280 m 16 Y s 2069 1264 m 32 Y s 2069 1264 m 32 Y s 2126 1280 m 16 Y s 363 218 m 1078
 Y s
 gsave  2268 1364 0 0 C 191.046 1018.28 t 90 r /Helvetica findfont 76.4184 sf 0 0 m ( \(pb/bin\)) show NC gr 
 gsave  2268 1364 0 0 C 231.166 997.26 t 90 r /Helvetica findfont 51.5824 sf 0 0 m (lj) show NC gr 
 gsave  2268 1364 0 0 C 191.046 959.051 t 90 r /Symbol findfont 76.4184 sf 0 0 m (f) show NC gr 
 gsave  2268 1364 0 0 C 191.046 899.827 t 90 r /Helvetica findfont 76.4184 sf 0 0 m (/d) show NC gr 
 gsave  2268 1364 0 0 C 191.046 853.976 t 90 r /Symbol findfont 76.4184 sf 0 0 m (s) show NC gr 
 gsave  2268 1364 0 0 C 191.046 815.767 t 90 r /Helvetica findfont 76.4184 sf 0 0 m (d) show NC gr  390 249 m -27 X s 390 291 m -27 X s 390 323 m -27 X s 390 349 m -27 X s 390 371 m -27 X s 390 390 m -27 X s 390 407 m -27 X s 417 422 m -54 X s
 gsave  2268 1364 0 0 C 305.674 420.301 t 0 r /Helvetica findfont 42.0301 sf 0 0 m (\2554) show NC gr 
 gsave  2268 1364 0 0 C 236.897 393.555 t 0 r /Helvetica findfont 63.0452 sf 0 0 m (10) show NC gr  390 521 m -27 X s 390 579 m -27 X s 390 620 m -27 X s 390 652 m -27 X s 390 678 m -27 X s 390 700 m -27 X s 390 719 m -27 X s 390 736 m -27 X s 417
 751 m -54 X s
 gsave  2268 1364 0 0 C 305.674 752.721 t 0 r /Helvetica findfont 42.0301 sf 0 0 m (\2553) show NC gr 
 gsave  2268 1364 0 0 C 236.897 724.065 t 0 r /Helvetica findfont 63.0452 sf 0 0 m (10) show NC gr  390 851 m -27 X s 390 909 m -27 X s 390 950 m -27 X s 390 982 m -27 X s 390 1008 m -27 X s 390 1030 m -27 X s 390 1049 m -27 X s 390 1066 m -27 X s
 417 1081 m -54 X s
 gsave  2268 1364 0 0 C 305.674 1079.41 t 0 r /Helvetica findfont 42.0301 sf 0 0 m (\2552) show NC gr 
 gsave  2268 1364 0 0 C 236.897 1052.66 t 0 r /Helvetica findfont 63.0452 sf 0 0 m (10) show NC gr  390 1180 m -27 X s 390 1238 m -27 X s 390 1279 m -27 X s 2154 218 m 1078 Y s 2127 249 m 27 X s 2127 291 m 27 X s 2127 323 m 27 X s 2127 349 m 27 X s
 2127 371 m 27 X s 2127 390 m 27 X s 2127 407 m 27 X s 2101 422 m 53 X s 2127 521 m 27 X s 2127 579 m 27 X s 2127 620 m 27 X s 2127 652 m 27 X s 2127 678 m 27 X s 2127 700 m 27 X s 2127 719 m 27 X s 2127 736 m 27 X s 2101 751 m 53 X s 2127 851 m 27 X
 s 2127 909 m 27 X s 2127 950 m 27 X s 2127 982 m 27 X s 2127 1008 m 27 X s 2127 1030 m 27 X s 2127 1049 m 27 X s 2127 1066 m 27 X s 2101 1081 m 53 X s 2127 1180 m 27 X s 2127 1238 m 27 X s 2127 1279 m 27 X s 1 1 0 c black 1 1 0 c 376 218 m 9 57 d 45
 -36 d 45 18 d 45 21 d 44 39 d 45 -47 d 45 70 d 45 25 d 45 -19 d 44 98 d 45 -49 d 45 54 d 45 5 d 44 -14 d 45 67 d 45 22 d 45 38 d 45 20 d 44 63 d 45 -12 d 45 63 d 45 31 d 45 35 d 44 28 d 45 41 d 45 45 d 45 42 d 44 36 d 45 43 d 45 39 d 45 36 d 45 37 d
 44 33 d 45 30 d 45 20 d 45 11 d 45 -23 d 44 -63 d 45 -94 d -9 Y -45 93 d -44 61 d -45 15 d -45 -16 d -45 -26 d -45 -33 d -44 -37 d -45 -40 d -45 -40 d -45 -43 d -45 -44 d -44 -39 d -45 -45 d -45 -45 d -45 -43 d -44 -30 d -45 -38 d -45 -32 d -45 -61
 d -45 3 d -44 -56 d -45 -23 d -45 -38 d -45 -26 d -45 -59 d -44 8 d -45 -8 d -45 -55 d -45 40 d -44 -92 d -45 25 d -45 -28 d -35 -49 d -25 X -30 27 d -37 -27 d f 1 0 0 c 6 lw 1 1 1 c black 1 0 0 c 363 317 m 45 X 45 Y 44 X 3 Y 45 X 28 Y 45 X -69 Y 45
 X 51 Y 45 X 5 Y 44 X 26 Y 45 X 31 Y 45 X -19 Y 45 X 34 Y 44 X -20 Y 45 X 34 Y 45 X 20 Y 45 X 2 Y 45 X 44 Y 44 X 40 Y 45 X 32 Y 45 X 11 Y 45 X 41 Y 45 X 12 Y 44 X 54 Y 45 X 34 Y 45 X 47 Y 45 X 30 Y 45 X 46 Y 44 X 38 Y 45 X 36 Y 45 X 38 Y 45 X 42 Y 44
 X 39 Y 45 X 37 Y 45 X 36 Y 45 X 30 Y 45 X 24 Y 44 X 5 Y 45 X -20 Y 45 X -62 Y 45 X -98 Y 45 X -194 Y 44 X s 0 0 1 c 1 1 1 c black 0 0 1 c 363 218 m 492 X 17 Y 45 X 20 Y 45 X 17 Y 45 X 29 Y 45 X 40 Y 44 X 41 Y 45 X 32 Y 45 X 28 Y 45 X 33 Y 45 X 50 Y
 44 X 39 Y 45 X 47 Y 45 X 38 Y 45 X 48 Y 45 X 44 Y 44 X 51 Y 45 X 48 Y 45 X 47 Y 45 X 50 Y 44 X 47 Y 45 X 46 Y 45 X 43 Y 45 X 40 Y 45 X 32 Y 44 X 23 Y 45 X -9 Y 45 X -58 Y 45 X -92 Y 45 X -201 Y 44 X s black 3 lw 1 1 1 c 917 323 439 886 bf black 439
 886 m 917 X s 1356 886 m 323 Y s 1356 1209 m -917 X s 439 1209 m -323 Y s
 gsave  2268 1364 0 0 C 668.661 1144.37 t 0 r /Times-Bold findfont 40.1197 sf 0 0 m (\(1+R2\)*\(MCFM S700\): Uncertainty) show NC gr  1 1 0 c 474 1118 m 160 X 75 Y -160 X f black 474 1193 m 160 X s 474 1118 m 160 X s 634 1118 m 75 Y s 474 1118 m 75 Y
 s
 gsave  2268 1364 0 0 C 668.661 1037.38 t 0 r /Times-Bold findfont 40.1197 sf 0 0 m (MCFM \(S+I\)700) show NC gr  1 0 0 c 6 lw 474 1048 m 160 X s black
 gsave  2268 1364 0 0 C 668.661 926.573 t 0 r /Times-Bold findfont 40.1197 sf 0 0 m (MCFM S700) show NC gr  0 0 1 c 474 940 m 160 X s black
 gsave  2268 1364 0 0 C 2221.87 989.619 t 90 r /Helvetica-BoldOblique findfont 24.836 sf 0 0 m (LHC HIGGS XS WG 2013) show NC gr 
 gr  gr showpage
end
%%EOF
