%!PS-Adobe-2.0 EPSF-2.0
%%BoundingBox:  0 0 567 544
%%Title: HWW_400_Mt_reweighting_cut_YR3.eps: HWW 400Gev Mt reweighting for interference with cuts
%%Creator: ROOT Version 5.34/05
%%CreationDate: Fri Jun 14 02:56:50 2013
%%EndComments
%%BeginProlog
80 dict begin
/s {stroke} def /l {lineto} def /m {moveto} def /t {translate} def
/r {rotate} def /rl {roll}  def /R {repeat} def
/d {rlineto} def /rm {rmoveto} def /gr {grestore} def /f {eofill} def
/c {setrgbcolor} def /black {0 setgray} def /sd {setdash} def
/cl {closepath} def /sf {scalefont setfont} def /lw {setlinewidth} def
/box {m dup 0 exch d exch 0 d 0 exch neg d cl} def
/NC{systemdict begin initclip end}def/C{NC box clip newpath}def
/bl {box s} def /bf {box f} def /Y { 0 exch d} def /X { 0 d} def 
/K {{pop pop 0 moveto} exch kshow} bind def
/ita {/ang 15 def gsave [1 0 ang dup sin exch cos div 1 0 0] concat} def 
/mp {newpath /y exch def /x exch def} def
/side {[w .77 mul w .23 mul] .385 w mul sd w 0 l currentpoint t -144 r} def
/mr {mp x y w2 0 360 arc} def /m24 {mr s} def /m20 {mr f} def
/mb {mp x y w2 add m w2 neg 0 d 0 w neg d w 0 d 0 w d cl} def
/mt {mp x y w2 add m w2 neg w neg d w 0 d cl} def
/m21 {mb f} def /m25 {mb s} def /m22 {mt f} def /m26{mt s} def
/m23 {mp x y w2 sub m w2 w d w neg 0 d cl f} def
/m27 {mp x y w2 add m w3 neg w2 neg d w3 w2 neg d w3 w2 d cl s} def
/m28 {mp x w2 sub y w2 sub w3 add m w3 0 d  0 w3 neg d w3 0 d 0 w3 d w3 0 d  0 w3 d w3 neg 0 d 0 w3 d w3 neg 0 d 0 w3 neg d w3 neg 0 d cl s } def
/m29 {mp gsave x w2 sub y w2 add w3 sub m currentpoint t 4 {side} repeat cl fill gr} def
/m30 {mp gsave x w2 sub y w2 add w3 sub m currentpoint t 4 {side} repeat cl s gr} def
/m31 {mp x y w2 sub m 0 w d x w2 sub y m w 0 d x w2 sub y w2 add m w w neg d x w2 sub y w2 sub m w w d s} def
/m32 {mp x y w2 sub m w2 w d w neg 0 d cl s} def
/m33 {mp x y w2 add m w3 neg w2 neg d w3 w2 neg d w3 w2 d cl f} def
/m34 {mp x w2 sub y w2 sub w3 add m w3 0 d  0 w3 neg d w3 0 d 0 w3 d w3 0 d  0 w3 d w3 neg 0 d 0 w3 d w3 neg 0 d 0 w3 neg d w3 neg 0 d cl f } def
/m2 {mp x y w2 sub m 0 w d x w2 sub y m w 0 d s} def
/m5 {mp x w2 sub y w2 sub m w w d x w2 sub y w2 add m w w neg d s} def
/reEncode {exch findfont dup length dict begin {1 index /FID eq  {pop pop} {def} ifelse } forall /Encoding exch def currentdict end dup /FontName get exch definefont pop } def [/Times-Bold /Times-Italic /Times-BoldItalic /Helvetica /Helvetica-Oblique
 /Helvetica-Bold /Helvetica-BoldOblique /Courier /Courier-Oblique /Courier-Bold /Courier-BoldOblique /Times-Roman /AvantGarde-Book /AvantGarde-BookOblique /AvantGarde-Demi /AvantGarde-DemiOblique /Bookman-Demi /Bookman-DemiItalic /Bookman-Light
 /Bookman-LightItalic /Helvetica-Narrow /Helvetica-Narrow-Bold /Helvetica-Narrow-BoldOblique /Helvetica-Narrow-Oblique /NewCenturySchlbk-Roman /NewCenturySchlbk-Bold /NewCenturySchlbk-BoldItalic /NewCenturySchlbk-Italic /Palatino-Bold
 /Palatino-BoldItalic /Palatino-Italic /Palatino-Roman ] {ISOLatin1Encoding reEncode } forall
%%EndProlog
%%BeginSetup
%%EndSetup
newpath  gsave  .25 .25 scale  gsave  0 0 t black[  ] 0 sd 3 lw 1 1 1 c 2268 2177 0 0 bf black 1 1 1 c 2268 1568 0 609 bf black 1 1 1 c 1814 1411 227 609 bf black 1814 1411 227 609 bl 0 0 1 c 1 1 1 c 0 0 1 c 227 682 m 167 X 3 Y 7 X 8 Y 7 X 9 Y 7 X 9
 Y 8 X 12 Y 7 X 14 Y 7 X 19 Y 7 X 18 Y 8 X 22 Y 7 X 26 Y 7 X 26 Y 7 X 31 Y 8 X 32 Y 7 X 28 Y 7 X 36 Y 8 X 42 Y 7 X 30 Y 7 X 40 Y 7 X 40 Y 8 X 45 Y 7 X 33 Y 7 X 32 Y 7 X 44 Y 8 X 51 Y 7 X 29 Y 7 X 43 Y 7 X 37 Y 8 X 37 Y 7 X 44 Y 7 X 37 Y 7 X 27 Y 8 X
 53 Y 7 X 32 Y 7 X 35 Y 7 X 34 Y 8 X 45 Y 7 X 9 Y 7 X 36 Y 7 X 26 Y 8 X 19 Y 7 X 22 Y 7 X 25 Y 7 X 11 Y 8 X 13 Y 7 X 1 Y 7 X -3 Y 7 X 9 Y 8 X -7 Y 7 X -3 Y 7 X -11 Y 8 X 11 Y 7 X -22 Y 7 X -20 Y 7 X -20 Y 8 X -28 Y 7 X -33 Y 7 X -30 Y 7 X -49 Y 8 X
 -47 Y 7 X -39 Y 7 X -46 Y 7 X -45 Y 8 X -61 Y 7 X -43 Y 7 X -64 Y 7 X -54 Y 8 X -58 Y 7 X -69 Y 7 X -55 Y 7 X -60 Y 8 X -52 Y 7 X -59 Y 7 X -56 Y 7 X -47 Y 8 X -48 Y 7 X -38 Y 7 X -32 Y 7 X -23 Y 8 X -20 Y 7 X -11 Y 7 X -10 Y 7 X -8 Y 8 X -6 Y 7 X
 -3 Y 7 X -5 Y 15 X -1 Y 7 X -3 Y 15 X -2 Y 7 X -1 Y 7 X 2 Y 7 X -2 Y 22 X 1 Y 7 X -2 Y 15 X 1 Y 7 X -1 Y 7 X 1 Y 8 X -2 Y 7 X 1 Y 7 X 1 Y 7 X -1 Y 8 X 1 Y 29 X 1 Y 7 X -1 Y 7 X 1 Y 7 X -1 Y 15 X 2 Y 7 X -1 Y 15 X 1 Y 21 X 1 Y 8 X -1 Y 7 X 1 Y 15 X
 -1 Y 7 X 1 Y 7 X -1 Y 7 X 2 Y 8 X -1 Y 29 X 1 Y 7 X -1 Y 7 X 1 Y 7 X -1 Y 8 X 1 Y 65 X 1 Y 14 X -1 Y 15 X 1 Y 160 X 1 Y 7 X -1 Y 14 X 1 Y 385 X s black 227 609 m 1814 X s 227 647 m -38 Y s 263 628 m -19 Y s 299 628 m -19 Y s 336 628 m -19 Y s 372
 628 m -19 Y s 408 647 m -38 Y s 444 628 m -19 Y s 481 628 m -19 Y s 517 628 m -19 Y s 553 628 m -19 Y s 590 647 m -38 Y s 626 628 m -19 Y s 662 628 m -19 Y s 698 628 m -19 Y s 735 628 m -19 Y s 771 647 m -38 Y s 807 628 m -19 Y s 844 628 m -19 Y s
 880 628 m -19 Y s 916 628 m -19 Y s 952 647 m -38 Y s 989 628 m -19 Y s 1025 628 m -19 Y s 1061 628 m -19 Y s 1098 628 m -19 Y s 1134 647 m -38 Y s 1170 628 m -19 Y s 1206 628 m -19 Y s 1243 628 m -19 Y s 1279 628 m -19 Y s 1315 647 m -38 Y s 1352
 628 m -19 Y s 1388 628 m -19 Y s 1424 628 m -19 Y s 1460 628 m -19 Y s 1497 647 m -38 Y s 1533 628 m -19 Y s 1569 628 m -19 Y s 1606 628 m -19 Y s 1642 628 m -19 Y s 1678 647 m -38 Y s 1714 628 m -19 Y s 1751 628 m -19 Y s 1787 628 m -19 Y s 1823
 628 m -19 Y s 1860 647 m -38 Y s 1896 628 m -19 Y s 1932 628 m -19 Y s 1968 628 m -19 Y s 2005 628 m -19 Y s 2041 647 m -38 Y s
 gsave  2268 1568 0 609 C 208.919 558.382 t 0 r /Helvetica findfont 49.4479 sf 0 0 m (0) show NC gr 
 gsave  2268 1568 0 609 C 364.658 558.382 t 0 r /Helvetica findfont 49.4479 sf 0 0 m (100) show NC gr 
 gsave  2268 1568 0 609 C 546.987 558.382 t 0 r /Helvetica findfont 49.4479 sf 0 0 m (200) show NC gr 
 gsave  2268 1568 0 609 C 725.517 558.382 t 0 r /Helvetica findfont 49.4479 sf 0 0 m (300) show NC gr 
 gsave  2268 1568 0 609 C 907.846 558.382 t 0 r /Helvetica findfont 49.4479 sf 0 0 m (400) show NC gr 
 gsave  2268 1568 0 609 C 1090.18 558.382 t 0 r /Helvetica findfont 49.4479 sf 0 0 m (500) show NC gr 
 gsave  2268 1568 0 609 C 1272.5 558.382 t 0 r /Helvetica findfont 49.4479 sf 0 0 m (600) show NC gr 
 gsave  2268 1568 0 609 C 1454.83 558.382 t 0 r /Helvetica findfont 49.4479 sf 0 0 m (700) show NC gr 
 gsave  2268 1568 0 609 C 1633.36 558.382 t 0 r /Helvetica findfont 49.4479 sf 0 0 m (800) show NC gr 
 gsave  2268 1568 0 609 C 1815.69 558.382 t 0 r /Helvetica findfont 49.4479 sf 0 0 m (900) show NC gr 
 gsave  2268 1568 0 609 C 1982.83 558.382 t 0 r /Helvetica findfont 49.4479 sf 0 0 m (1000) show NC gr  227 609 m 1411 Y s
 gsave  2268 1568 0 609 C 64.5748 1378.86 t 90 r /Helvetica findfont 34.2332 sf 0 0 m (T) show NC gr 
 gsave  2268 1568 0 609 C 45.5822 1295.3 t 90 r /Helvetica findfont 49.4479 sf 0 0 m (/dM) show NC gr 
 gsave  2268 1568 0 609 C 45.5822 1264.91 t 90 r /Symbol findfont 49.4479 sf 0 0 m (s) show NC gr 
 gsave  2268 1568 0 609 C 45.5822 1238.32 t 90 r /Helvetica findfont 49.4479 sf 0 0 m (d) show NC gr  288 682 m -61 X s 257 714 m -30 X s 257 747 m -30 X s 257 780 m -30 X s 257 812 m -30 X s 288 845 m -61 X s 257 878 m -30 X s 257 910 m -30 X s 257
 943 m -30 X s 257 975 m -30 X s 288 1008 m -61 X s 257 1041 m -30 X s 257 1073 m -30 X s 257 1106 m -30 X s 257 1139 m -30 X s 288 1171 m -61 X s 257 1204 m -30 X s 257 1237 m -30 X s 257 1269 m -30 X s 257 1302 m -30 X s 288 1335 m -61 X s 257 1367
 m -30 X s 257 1400 m -30 X s 257 1433 m -30 X s 257 1465 m -30 X s 288 1498 m -61 X s 257 1531 m -30 X s 257 1563 m -30 X s 257 1596 m -30 X s 257 1628 m -30 X s 288 1661 m -61 X s 257 1694 m -30 X s 257 1726 m -30 X s 257 1759 m -30 X s 257 1792 m
 -30 X s 288 1824 m -61 X s 257 1857 m -30 X s 257 1890 m -30 X s 257 1922 m -30 X s 257 1955 m -30 X s 288 1988 m -61 X s 288 682 m -61 X s 257 649 m -30 X s 257 616 m -30 X s 288 1988 m -61 X s
 gsave  2268 1568 0 609 C 186.127 664.741 t 0 r /Helvetica findfont 49.4479 sf 0 0 m (0) show NC gr 
 gsave  2268 1568 0 609 C 125.351 828.077 t 0 r /Helvetica findfont 49.4479 sf 0 0 m (0.01) show NC gr 
 gsave  2268 1568 0 609 C 117.754 991.414 t 0 r /Helvetica findfont 49.4479 sf 0 0 m (0.02) show NC gr 
 gsave  2268 1568 0 609 C 117.754 1154.75 t 0 r /Helvetica findfont 49.4479 sf 0 0 m (0.03) show NC gr 
 gsave  2268 1568 0 609 C 117.754 1318.09 t 0 r /Helvetica findfont 49.4479 sf 0 0 m (0.04) show NC gr 
 gsave  2268 1568 0 609 C 117.754 1481.42 t 0 r /Helvetica findfont 49.4479 sf 0 0 m (0.05) show NC gr 
 gsave  2268 1568 0 609 C 117.754 1644.76 t 0 r /Helvetica findfont 49.4479 sf 0 0 m (0.06) show NC gr 
 gsave  2268 1568 0 609 C 117.754 1808.1 t 0 r /Helvetica findfont 49.4479 sf 0 0 m (0.07) show NC gr 
 gsave  2268 1568 0 609 C 117.754 1971.43 t 0 r /Helvetica findfont 49.4479 sf 0 0 m (0.08) show NC gr  0 0 1 c /w 2 def /w2 {w 2 div} def /w3 {w 3 div} def 230 682 m20 238 682 m20 245 682 m20 252 682 m20 259 682 m20 267 682 m20 274 682 m20 281 682
 m20 288 682 m20 296 682 m20 303 682 m20 310 682 m20 317 682 m20 325 682 m20 332 682 m20 339 682 m20 347 682 m20 354 682 m20 361 682 m20 368 682 m20 376 682 m20 383 682 m20 390 682 m20 397 685 m20 405 693 m20 412 702 m20 419 711 m20 426 723 m20 434
 737 m20 441 756 m20 448 774 m20 455 796 m20 463 822 m20 470 848 m20 477 879 m20 484 911 m20 492 939 m20 499 975 m20 506 1017 m20 513 1047 m20 521 1087 m20 528 1127 m20 535 1172 m20 542 1205 m20 550 1237 m20 557 1281 m20 564 1332 m20 571 1361 m20 579
 1404 m20 586 1441 m20 593 1478 m20 600 1522 m20 608 1559 m20 615 1586 m20 622 1639 m20 630 1671 m20 637 1706 m20 644 1740 m20 651 1785 m20 659 1794 m20 666 1830 m20 673 1856 m20 680 1875 m20 688 1897 m20 695 1922 m20 702 1933 m20 709 1946 m20 717
 1947 m20 724 1944 m20 731 1953 m20 738 1946 m20 746 1943 m20 753 1932 m20 760 1943 m20 767 1921 m20 775 1901 m20 782 1881 m20 789 1853 m20 796 1820 m20 804 1790 m20 811 1741 m20 818 1694 m20 825 1655 m20 833 1609 m20 840 1564 m20 847 1503 m20 854
 1460 m20 862 1396 m20 869 1342 m20 876 1284 m20 884 1215 m20 891 1160 m20 898 1100 m20 905 1048 m20 913 989 m20 920 933 m20 927 886 m20 934 838 m20 942 800 m20 949 768 m20 956 745 m20 963 725 m20 971 714 m20 978 704 m20 985 696 m20 992 690 m20 1000
 687 m20 1007 682 m20 1014 682 m20 1021 681 m20 1029 678 m20 1036 678 m20 1043 676 m20 1050 675 m20 1058 677 m20 1065 675 m20 1072 675 m20 1079 675 m20 1087 676 m20 1094 674 m20 1101 674 m20 1108 675 m20 1116 674 m20 1123 675 m20 1130 673 m20 1137
 674 m20 1145 675 m20 1152 674 m20 1159 675 m20 1167 675 m20 1174 675 m20 1181 675 m20 1188 676 m20 1196 675 m20 1203 676 m20 1210 675 m20 1217 675 m20 1225 677 m20 1232 676 m20 1239 676 m20 1246 677 m20 1254 677 m20 1261 677 m20 1268 678 m20 1275
 677 m20 1283 678 m20 1290 678 m20 1297 677 m20 1304 678 m20 1312 677 m20 1319 679 m20 1326 678 m20 1333 678 m20 1341 678 m20 1348 678 m20 1355 679 m20 1362 678 m20 1370 679 m20 1377 678 m20 1384 679 m20 1391 679 m20 1399 679 m20 1406 679 m20 1413
 679 m20 1420 679 m20 1428 679 m20 1435 679 m20 1442 679 m20 1450 680 m20 1457 680 m20 1464 679 m20 1471 679 m20 1479 680 m20 1486 680 m20 1493 680 m20 1500 680 m20 1508 680 m20 1515 680 m20 1522 680 m20 1529 680 m20 1537 680 m20 1544 680 m20 1551
 680 m20 1558 680 m20 1566 680 m20 1573 680 m20 1580 680 m20 1587 680 m20 1595 680 m20 1602 680 m20 1609 680 m20 1616 680 m20 1624 680 m20 1631 680 m20 1638 681 m20 1645 680 m20 1653 680 m20 1660 681 m20 1667 681 m20 1674 681 m20 1682 681 m20 1689
 681 m20 1696 681 m20 1704 681 m20 1711 681 m20 1718 681 m20 1725 681 m20 1733 681 m20 1740 681 m20 1747 681 m20 1754 681 m20 1762 681 m20 1769 681 m20 1776 681 m20 1783 681 m20 1791 681 m20 1798 681 m20 1805 681 m20 1812 681 m20 1820 681 m20 1827
 681 m20 1834 681 m20 1841 681 m20 1849 681 m20 1856 681 m20 1863 681 m20 1870 681 m20 1878 681 m20 1885 681 m20 1892 681 m20 1899 681 m20 1907 681 m20 1914 681 m20 1921 681 m20 1928 681 m20 1936 681 m20 1943 681 m20 1950 681 m20 1957 681 m20 1965
 681 m20 1972 681 m20 1979 681 m20 1987 681 m20 1994 681 m20 2001 681 m20 2008 681 m20 2016 681 m20 2023 681 m20 2030 681 m20 2037 681 m20 black 0 0 1 c 1 lw << /PatternType 1 /PaintType 2 /TilingType 1 /BBox [ 0 0 100 100 ] /XStep 100 /YStep 100
 /PaintProc { begin gsave 0 0 m 100 100 l 0 100 m 100 0 l s gr end } >> [ 0.24 0 0 0.24 0 0 ] makepattern /P13 exch def /cs {[/Pattern /DeviceRGB] setcolorspace} def /FA {f [/DeviceRGB] setcolorspace} def cs 0 0 1 P13 setcolor 230 682 m 160 X 7 4 d 8
 8 d 7 8 d 7 10 d 7 12 d 8 14 d 7 19 d 7 19 d 7 22 d 8 26 d 7 26 d 7 32 d 7 31 d 8 29 d 7 36 d 7 42 d 7 30 d 8 41 d 7 40 d 7 45 d 7 33 d 8 32 d 7 45 d 7 50 d 7 30 d 8 43 d 7 37 d 7 38 d 7 44 d 8 37 d 7 26 d 7 54 d 8 32 d 7 36 d 7 34 d 7 45 d 8 9 d 7
 35 d 7 27 d 7 19 d 8 22 d 7 25 d 7 11 d 7 13 d 8 1 d 7 -3 d 7 9 d 7 -7 d 8 -3 d 7 -11 d 7 10 d 7 -21 d 8 -20 d 7 -20 d 7 -29 d 7 -33 d 8 -30 d 7 -49 d 7 -47 d 7 -40 d 8 -46 d 7 -45 d 7 -61 d 7 -44 d 8 -64 d 7 -54 d 7 -58 d 8 -69 d 7 -56 d 7 -60 d 7
 -53 d 8 -59 d 7 -56 d 7 -48 d 7 -48 d 8 -37 d 7 -33 d 7 -23 d 7 -19 d 8 -12 d 7 -10 d 7 -8 d 7 -6 d 8 -3 d 7 -5 d 7 X 7 -1 d 8 -3 d 7 X 7 -2 d 7 -1 d 8 1 d 7 -2 d 7 1 d 7 -1 d 8 1 d 7 -1 d 14 X 8 -1 d 7 2 d 7 -2 d 7 1 d 8 1 d 7 -1 d 7 X 8 1 d 50 X 8
 1 d 7 X 7 -1 d 7 2 d 8 -1 d 7 X 7 1 d 7 -1 d 8 1 d 29 X 7 1 d 7 X 7 -1 d 8 X 7 1 d 80 X 7 1 d 7 -1 d 8 1 d 14 X 7 -1 d 8 1 d 101 X 7 1 d 8 -1 d 7 1 d 7 -1 d 15 X 7 1 d 363 X 7 1 d 7 -1 d 29 X -290 X -7 -1 d -7 1 d -22 X -7 -1 d -8 1 d -7 X -7 -1 d
 -8 1 d -7 -1 d -7 1 d -7 -1 d -124 X -7 -1 d -7 1 d -7 -1 d -8 1 d -21 X -8 -1 d -65 X -7 -1 d -8 1 d -7 X -7 -1 d -7 1 d -8 -1 d -43 X -7 -1 d -29 X -8 -1 d -7 1 d -22 X -7 -2 d -7 1 d -7 X -8 -1 d -50 X -8 -1 d -7 -1 d -7 1 d -8 -1 d -7 X -7 1 d
 -7 -1 d -8 1 d -7 -1 d -7 1 d -7 1 d -8 -1 d -7 1 d -7 -1 d -7 2 d -8 -2 d -7 1 d -7 2 d -7 1 d -8 2 d -7 1 d -7 X -7 5 d -8 3 d -7 6 d -7 8 d -7 10 d -8 11 d -7 19 d -7 24 d -7 32 d -8 37 d -7 48 d -7 47 d -7 56 d -8 58 d -7 53 d -7 59 d -7 55 d -8
 69 d -7 57 d -7 54 d -8 64 d -7 42 d -7 62 d -7 44 d -8 45 d -7 40 d -7 46 d -7 49 d -8 30 d -7 33 d -7 28 d -7 20 d -8 20 d -7 21 d -7 -10 d -7 10 d -8 4 d -7 6 d -7 -9 d -7 3 d -8 -1 d -7 -13 d -7 -10 d -7 -26 d -8 -22 d -7 -19 d -7 -26 d -7 -35 d
 -8 -9 d -7 -45 d -7 -34 d -7 -35 d -8 -32 d -7 -53 d -7 -26 d -8 -37 d -7 -44 d -7 -37 d -7 -37 d -8 -43 d -7 -29 d -7 -50 d -7 -45 d -8 -31 d -7 -33 d -7 -45 d -7 -40 d -8 -39 d -7 -30 d -7 -42 d -7 -36 d -8 -28 d -7 -31 d -7 -31 d -7 -26 d -8 -25
 d -7 -23 d -7 -17 d -7 -19 d -8 -14 d -7 -12 d -7 -9 d -7 -9 d -8 -7 d -7 -3 d -160 X FA 3 lw 0.8 0 0 c 1 0 0 c 0.8 0 0 c 227 682 m 167 X 1 Y 7 X 3 Y 7 X 5 Y 7 X 6 Y 8 X 6 Y 7 X 10 Y 7 X 12 Y 7 X 15 Y 8 X 16 Y 7 X 16 Y 7 X 22 Y 7 X 25 Y 8 X 24 Y 7 X
 25 Y 7 X 30 Y 8 X 27 Y 7 X 36 Y 7 X 31 Y 7 X 34 Y 8 X 37 Y 7 X 37 Y 7 X 38 Y 7 X 32 Y 8 X 49 Y 7 X 37 Y 7 X 46 Y 7 X 43 Y 8 X 29 Y 7 X 44 Y 7 X 47 Y 7 X 25 Y 8 X 57 Y 7 X 30 Y 7 X 26 Y 7 X 58 Y 8 X 22 Y 7 X 41 Y 7 X 35 Y 7 X 28 Y 8 X 28 Y 7 X 26 Y 7
 X 23 Y 7 X 30 Y 8 X 4 Y 7 X 21 Y 7 X 13 Y 7 X 2 Y 8 X 1 Y 7 X 9 Y 7 X -16 Y 8 X 8 Y 7 X -12 Y 7 X -5 Y 7 X -9 Y 8 X -8 Y 7 X -27 Y 7 X -35 Y 7 X -25 Y 8 X -37 Y 7 X -39 Y 7 X -41 Y 7 X -55 Y 8 X -24 Y 7 X -65 Y 7 X -43 Y 7 X -48 Y 8 X -59 Y 7 X -58
 Y 7 X -59 Y 7 X -55 Y 8 X -55 Y 7 X -61 Y 7 X -48 Y 7 X -51 Y 8 X -49 Y 7 X -47 Y 7 X -34 Y 7 X -30 Y 8 X -28 Y 7 X -17 Y 7 X -21 Y 7 X -10 Y 8 X -8 Y 7 X -12 Y 7 X -7 Y 7 X -5 Y 8 X -6 Y 7 X -5 Y 7 X -7 Y 15 X -3 Y 7 X -6 Y 7 X -1 Y 8 X -4 Y 7 X -1
 Y 7 X -4 Y 15 X -2 Y 7 X -1 Y 7 X -2 Y 7 X -1 Y 8 X -2 Y 7 X -1 Y 7 X -2 Y 15 X -2 Y 14 X -1 Y 7 X -1 Y 15 X -1 Y 14 X -1 Y 8 X -2 Y 21 X -1 Y 15 X -2 Y 7 X 1 Y 7 X -1 Y 8 X -1 Y 7 X 1 Y 7 X -1 Y 8 X 1 Y 7 X -1 Y 14 X -1 Y 8 X 1 Y 7 X -1 Y 22 X -1 Y
 21 X -1 Y 8 X 1 Y 14 X -1 Y 29 X -1 Y 51 X -1 Y 7 X 1 Y 7 X -1 Y 8 X 1 Y 7 X -1 Y 51 X -1 Y 7 X 1 Y 22 X -1 Y 14 X 1 Y 8 X -1 Y 145 X -1 Y 7 X 1 Y 14 X -1 Y 15 X 1 Y 7 X -1 Y 247 X s 1 0 0 c 230 682 m20 238 682 m20 245 682 m20 252 682 m20 259 682
 m20 267 682 m20 274 682 m20 281 682 m20 288 682 m20 296 682 m20 303 682 m20 310 682 m20 317 682 m20 325 682 m20 332 682 m20 339 682 m20 347 682 m20 354 682 m20 361 682 m20 368 682 m20 376 682 m20 383 682 m20 390 682 m20 397 683 m20 405 686 m20 412
 691 m20 419 697 m20 426 703 m20 434 713 m20 441 725 m20 448 740 m20 455 756 m20 463 772 m20 470 794 m20 477 819 m20 484 843 m20 492 868 m20 499 898 m20 506 925 m20 513 961 m20 521 992 m20 528 1026 m20 535 1063 m20 542 1100 m20 550 1138 m20 557 1170
 m20 564 1219 m20 571 1256 m20 579 1302 m20 586 1345 m20 593 1374 m20 600 1418 m20 608 1465 m20 615 1490 m20 622 1547 m20 630 1577 m20 637 1603 m20 644 1661 m20 651 1683 m20 659 1724 m20 666 1759 m20 673 1787 m20 680 1815 m20 688 1841 m20 695 1864
 m20 702 1894 m20 709 1898 m20 717 1919 m20 724 1932 m20 731 1934 m20 738 1935 m20 746 1944 m20 753 1928 m20 760 1936 m20 767 1924 m20 775 1919 m20 782 1910 m20 789 1902 m20 796 1875 m20 804 1840 m20 811 1815 m20 818 1778 m20 825 1739 m20 833 1698
 m20 840 1643 m20 847 1619 m20 854 1554 m20 862 1511 m20 869 1463 m20 876 1404 m20 884 1346 m20 891 1287 m20 898 1232 m20 905 1177 m20 913 1116 m20 920 1068 m20 927 1017 m20 934 968 m20 942 921 m20 949 887 m20 956 857 m20 963 829 m20 971 812 m20 978
 791 m20 985 781 m20 992 773 m20 1000 761 m20 1007 754 m20 1014 749 m20 1021 743 m20 1029 738 m20 1036 731 m20 1043 731 m20 1050 728 m20 1058 722 m20 1065 721 m20 1072 717 m20 1079 716 m20 1087 712 m20 1094 712 m20 1101 710 m20 1108 709 m20 1116 707
 m20 1123 706 m20 1130 704 m20 1137 703 m20 1145 701 m20 1152 701 m20 1159 699 m20 1167 699 m20 1174 698 m20 1181 697 m20 1188 697 m20 1196 696 m20 1203 696 m20 1210 695 m20 1217 693 m20 1225 693 m20 1232 693 m20 1239 692 m20 1246 692 m20 1254 690
 m20 1261 691 m20 1268 690 m20 1275 689 m20 1283 690 m20 1290 689 m20 1297 690 m20 1304 689 m20 1312 689 m20 1319 688 m20 1326 689 m20 1333 688 m20 1341 688 m20 1348 688 m20 1355 687 m20 1362 687 m20 1370 687 m20 1377 686 m20 1384 687 m20 1391 687
 m20 1399 686 m20 1406 686 m20 1413 686 m20 1420 686 m20 1428 685 m20 1435 685 m20 1442 685 m20 1450 685 m20 1457 685 m20 1464 685 m20 1471 685 m20 1479 684 m20 1486 685 m20 1493 684 m20 1500 685 m20 1508 684 m20 1515 684 m20 1522 684 m20 1529 684
 m20 1537 684 m20 1544 684 m20 1551 684 m20 1558 683 m20 1566 684 m20 1573 684 m20 1580 684 m20 1587 683 m20 1595 683 m20 1602 684 m20 1609 683 m20 1616 683 m20 1624 683 m20 1631 683 m20 1638 683 m20 1645 683 m20 1653 683 m20 1660 683 m20 1667 683
 m20 1674 683 m20 1682 683 m20 1689 683 m20 1696 683 m20 1704 683 m20 1711 683 m20 1718 683 m20 1725 683 m20 1733 683 m20 1740 683 m20 1747 683 m20 1754 682 m20 1762 683 m20 1769 683 m20 1776 682 m20 1783 682 m20 1791 683 m20 1798 682 m20 1805 682
 m20 1812 682 m20 1820 682 m20 1827 682 m20 1834 682 m20 1841 682 m20 1849 682 m20 1856 682 m20 1863 682 m20 1870 682 m20 1878 682 m20 1885 682 m20 1892 682 m20 1899 682 m20 1907 682 m20 1914 682 m20 1921 682 m20 1928 682 m20 1936 682 m20 1943 682
 m20 1950 682 m20 1957 682 m20 1965 682 m20 1972 682 m20 1979 682 m20 1987 682 m20 1994 682 m20 2001 682 m20 2008 682 m20 2016 682 m20 2023 682 m20 2030 682 m20 2037 682 m20 0.8 0 0 c black 0.8 0 0 c cs 0.8 0 0 P13 setcolor 230 682 m 160 X 7 1 d 8 3
 d 7 5 d 7 6 d 7 7 d 8 10 d 7 11 d 7 16 d 7 16 d 8 16 d 7 22 d 7 26 d 7 23 d 8 25 d 7 31 d 7 27 d 7 36 d 8 31 d 7 34 d 7 38 d 7 38 d 8 37 d 7 33 d 7 49 d 7 37 d 8 46 d 7 43 d 7 29 d 7 45 d 8 47 d 7 25 d 7 58 d 8 29 d 7 27 d 7 57 d 7 23 d 8 41 d 7 35
 d 7 28 d 7 28 d 8 27 d 7 23 d 7 30 d 7 4 d 8 20 d 7 13 d 7 3 d 7 1 d 8 8 d 7 -15 d 7 8 d 7 -12 d 8 -6 d 7 -9 d 7 -8 d 7 -27 d 8 -35 d 7 -25 d 7 -37 d 7 -40 d 8 -41 d 7 -55 d 7 -24 d 7 -66 d 8 -42 d 7 -49 d 7 -59 d 8 -58 d 7 -59 d 7 -56 d 7 -55 d 8
 -61 d 7 -49 d 7 -51 d 7 -49 d 8 -47 d 7 -35 d 7 -29 d 7 -29 d 8 -16 d 7 -22 d 7 -9 d 7 -8 d 8 -12 d 7 -7 d 7 -6 d 7 -6 d 8 -5 d 7 -7 d 7 X 7 -3 d 8 -6 d 7 -1 d 7 -4 d 7 -1 d 8 -4 d 7 X 7 -2 d 7 -1 d 8 -2 d 7 -2 d 7 -1 d 7 -1 d 8 -3 d 7 1 d 7 -2 d 8
 X 7 -1 d 7 -1 d 7 X 8 -1 d 7 X 7 -1 d 7 -2 d 8 X 7 -1 d 7 X 7 -1 d 8 -1 d 14 X 7 -1 d 8 1 d 7 -1 d 14 X 8 -1 d 14 X 7 -1 d 15 X 7 -1 d 7 1 d 8 -1 d 21 X 8 -1 d 7 X 7 1 d 7 -1 d 22 X 8 -1 d 36 X 7 -1 d 7 1 d 8 -1 d 7 1 d 7 -1 d 87 X 7 -1 d 8 1 d 7 -1
 d 145 X 7 -1 d 8 1 d 7 -1 d 7 X 7 1 d 8 -1 d 217 X -290 X -7 1 d -182 X -7 1 d -72 X -8 1 d -43 X -8 1 d -43 X -7 1 d -37 X -7 1 d -14 X -8 1 d -14 X -7 1 d -8 -1 d -7 1 d -14 X -8 1 d -7 1 d -7 X -7 1 d -8 X -7 1 d -7 1 d -7 1 d -8 X -7 1 d -7 1 d
 -7 X -8 1 d -7 1 d -7 X -8 2 d -7 1 d -7 2 d -7 1 d -8 2 d -7 1 d -7 2 d -7 X -8 4 d -7 1 d -7 4 d -7 1 d -8 6 d -7 2 d -7 1 d -7 7 d -8 5 d -7 6 d -7 5 d -7 7 d -8 12 d -7 8 d -7 9 d -7 21 d -8 17 d -7 28 d -7 30 d -7 34 d -8 46 d -7 49 d -7 51 d
 -7 48 d -8 61 d -7 55 d -7 55 d -7 58 d -8 58 d -7 58 d -7 49 d -8 42 d -7 65 d -7 23 d -7 56 d -8 40 d -7 39 d -7 37 d -7 25 d -8 35 d -7 26 d -7 8 d -7 9 d -8 6 d -7 12 d -7 -8 d -7 15 d -8 -9 d -7 X -7 -3 d -7 -13 d -8 -20 d -7 -4 d -7 -30 d -7
 -23 d -8 -26 d -7 -28 d -7 -28 d -7 -35 d -8 -41 d -7 -22 d -7 -57 d -7 -27 d -8 -29 d -7 -57 d -7 -25 d -8 -46 d -7 -45 d -7 -29 d -7 -42 d -8 -46 d -7 -37 d -7 -49 d -7 -31 d -8 -38 d -7 -37 d -7 -37 d -7 -34 d -8 -31 d -7 -35 d -7 -28 d -7 -29 d
 -8 -25 d -7 -23 d -7 -26 d -7 -21 d -8 -16 d -7 -16 d -7 -15 d -7 -11 d -8 -10 d -7 -7 d -7 -6 d -7 -4 d -8 -3 d -7 -1 d -160 X FA 0 0.4 0 c 1 1 1 c 0.35 0.83 0.33 c 0 0.4 0 c 227 682 m 167 X 3 Y 7 X 5 Y 7 X 8 Y 7 X 10 Y 8 X 9 Y 7 X 15 Y 7 X 15 Y 7
 X 19 Y 8 X 24 Y 7 X 18 Y 7 X 27 Y 7 X 31 Y 8 X 28 Y 7 X 40 Y 7 X 27 Y 8 X 26 Y 7 X 59 Y 7 X 23 Y 7 X 38 Y 8 X 38 Y 7 X 37 Y 7 X 38 Y 7 X 33 Y 8 X 46 Y 7 X 37 Y 7 X 46 Y 7 X 42 Y 8 X 21 Y 7 X 47 Y 7 X 44 Y 7 X 16 Y 8 X 59 Y 7 X 25 Y 7 X 28 Y 7 X 53 Y
 8 X 19 Y 7 X 31 Y 7 X 38 Y 7 X 21 Y 8 X 22 Y 7 X 23 Y 7 X 20 Y 7 X 24 Y 8 X 1 Y 7 X 9 Y 7 X 8 Y 7 X -4 Y 8 X -5 Y 7 X 1 Y 7 X -13 Y 8 X -7 Y 7 X -12 Y 7 X -21 Y 7 X -15 Y 8 X -14 Y 7 X -33 Y 7 X -43 Y 7 X -29 Y 8 X -42 Y 7 X -44 Y 7 X -44 Y 7 X -63
 Y 8 X -34 Y 7 X -65 Y 7 X -47 Y 7 X -53 Y 8 X -58 Y 7 X -64 Y 7 X -56 Y 7 X -58 Y 8 X -56 Y 7 X -56 Y 7 X -47 Y 7 X -51 Y 8 X -42 Y 7 X -40 Y 7 X -30 Y 7 X -26 Y 8 X -22 Y 7 X -13 Y 7 X -13 Y 7 X -7 Y 8 X -6 Y 7 X -5 Y 7 X -4 Y 7 X -3 Y 8 X -2 Y 7 X
 -2 Y 7 X -2 Y 8 X -2 Y 7 X -1 Y 14 X -1 Y 8 X -1 Y 21 X -1 Y 22 X -1 Y 29 X 1 Y 7 X -1 Y 58 X 1 Y 44 X 1 Y 7 X -1 Y 15 X 1 Y 7 X -1 Y 7 X 1 Y 66 X 1 Y 94 X 1 Y 167 X 1 Y 7 X -1 Y 7 X 1 Y 414 X s 0.35 0.83 0.33 c 230 682 m20 238 682 m20 245 682 m20
 252 682 m20 259 682 m20 267 682 m20 274 682 m20 281 682 m20 288 682 m20 296 682 m20 303 682 m20 310 682 m20 317 682 m20 325 682 m20 332 682 m20 339 682 m20 347 682 m20 354 682 m20 361 682 m20 368 682 m20 376 682 m20 383 682 m20 390 682 m20 397 685
 m20 405 690 m20 412 698 m20 419 708 m20 426 717 m20 434 732 m20 441 747 m20 448 766 m20 455 790 m20 463 808 m20 470 835 m20 477 866 m20 484 894 m20 492 934 m20 499 961 m20 506 987 m20 513 1046 m20 521 1069 m20 528 1107 m20 535 1145 m20 542 1182 m20
 550 1220 m20 557 1253 m20 564 1299 m20 571 1336 m20 579 1382 m20 586 1424 m20 593 1445 m20 600 1492 m20 608 1536 m20 615 1552 m20 622 1611 m20 630 1636 m20 637 1664 m20 644 1717 m20 651 1736 m20 659 1767 m20 666 1805 m20 673 1826 m20 680 1848 m20
 688 1871 m20 695 1891 m20 702 1915 m20 709 1916 m20 717 1925 m20 724 1933 m20 731 1929 m20 738 1924 m20 746 1925 m20 753 1912 m20 760 1905 m20 767 1893 m20 775 1872 m20 782 1857 m20 789 1843 m20 796 1810 m20 804 1767 m20 811 1738 m20 818 1696 m20
 825 1652 m20 833 1608 m20 840 1545 m20 847 1511 m20 854 1446 m20 862 1399 m20 869 1346 m20 876 1288 m20 884 1224 m20 891 1168 m20 898 1110 m20 905 1054 m20 913 998 m20 920 951 m20 927 900 m20 934 858 m20 942 818 m20 949 788 m20 956 762 m20 963 740
 m20 971 727 m20 978 714 m20 985 707 m20 992 701 m20 1000 696 m20 1007 692 m20 1014 689 m20 1021 687 m20 1029 685 m20 1036 683 m20 1043 681 m20 1050 680 m20 1058 680 m20 1065 679 m20 1072 678 m20 1079 678 m20 1087 678 m20 1094 677 m20 1101 677 m20
 1108 677 m20 1116 676 m20 1123 676 m20 1130 676 m20 1137 676 m20 1145 677 m20 1152 676 m20 1159 676 m20 1167 676 m20 1174 676 m20 1181 676 m20 1188 676 m20 1196 676 m20 1203 676 m20 1210 677 m20 1217 677 m20 1225 677 m20 1232 677 m20 1239 677 m20
 1246 677 m20 1254 678 m20 1261 677 m20 1268 677 m20 1275 678 m20 1283 677 m20 1290 678 m20 1297 678 m20 1304 678 m20 1312 678 m20 1319 678 m20 1326 678 m20 1333 678 m20 1341 678 m20 1348 678 m20 1355 679 m20 1362 679 m20 1370 679 m20 1377 679 m20
 1384 679 m20 1391 679 m20 1399 679 m20 1406 679 m20 1413 679 m20 1420 679 m20 1428 679 m20 1435 679 m20 1442 679 m20 1450 680 m20 1457 680 m20 1464 680 m20 1471 680 m20 1479 680 m20 1486 680 m20 1493 680 m20 1500 680 m20 1508 680 m20 1515 680 m20
 1522 680 m20 1529 680 m20 1537 680 m20 1544 680 m20 1551 680 m20 1558 680 m20 1566 680 m20 1573 680 m20 1580 680 m20 1587 680 m20 1595 680 m20 1602 680 m20 1609 680 m20 1616 681 m20 1624 680 m20 1631 681 m20 1638 681 m20 1645 681 m20 1653 681 m20
 1660 681 m20 1667 681 m20 1674 681 m20 1682 681 m20 1689 681 m20 1696 681 m20 1704 681 m20 1711 681 m20 1718 681 m20 1725 681 m20 1733 681 m20 1740 681 m20 1747 681 m20 1754 681 m20 1762 681 m20 1769 681 m20 1776 681 m20 1783 681 m20 1791 681 m20
 1798 681 m20 1805 681 m20 1812 681 m20 1820 681 m20 1827 681 m20 1834 681 m20 1841 681 m20 1849 681 m20 1856 681 m20 1863 681 m20 1870 681 m20 1878 681 m20 1885 681 m20 1892 681 m20 1899 681 m20 1907 681 m20 1914 681 m20 1921 681 m20 1928 681 m20
 1936 681 m20 1943 681 m20 1950 681 m20 1957 681 m20 1965 681 m20 1972 681 m20 1979 681 m20 1987 681 m20 1994 681 m20 2001 681 m20 2008 681 m20 2016 681 m20 2023 681 m20 2030 681 m20 2037 681 m20 0 0.4 0 c black 0 0.4 0 c cs 0 0.4 0 P13 setcolor 230
 682 m 160 X 7 4 d 8 5 d 7 8 d 7 11 d 7 8 d 8 16 d 7 15 d 7 20 d 7 23 d 8 19 d 7 27 d 7 32 d 7 28 d 8 40 d 7 28 d 7 25 d 7 60 d 8 23 d 7 38 d 7 38 d 7 37 d 8 39 d 7 32 d 7 47 d 7 37 d 8 46 d 7 42 d 7 21 d 7 47 d 8 45 d 7 16 d 7 58 d 8 26 d 7 27 d 7
 54 d 7 19 d 8 31 d 7 38 d 7 21 d 7 22 d 8 23 d 7 20 d 7 24 d 7 1 d 8 9 d 7 8 d 7 -5 d 7 -4 d 8 1 d 7 -13 d 7 -7 d 7 -12 d 8 -22 d 7 -15 d 7 -14 d 7 -33 d 8 -43 d 7 -30 d 7 -42 d 7 -44 d 8 -44 d 7 -63 d 7 -34 d 7 -66 d 8 -47 d 7 -54 d 7 -57 d 8 -65 d
 7 -56 d 7 -58 d 7 -57 d 8 -56 d 7 -47 d 7 -51 d 7 -42 d 8 -41 d 7 -30 d 7 -26 d 7 -22 d 8 -13 d 7 -13 d 7 -8 d 7 -6 d 8 -4 d 7 -5 d 7 -2 d 7 -3 d 8 -2 d 7 -2 d 7 -2 d 7 -1 d 8 X 7 -1 d 7 X 7 -1 d 15 X 7 -1 d 58 X 8 -1 d 7 1 d 65 X 7 1 d 80 X 7 1 d
 87 X 8 1 d 7 X 7 -1 d 8 1 d 159 X 7 1 d 8 -1 d 7 1 d 377 X 8 1 d 7 -1 d 14 X -363 X -7 -1 d -14 X -8 1 d -7 -1 d -159 X -8 -1 d -101 X -8 -1 d -58 X -7 -1 d -7 1 d -7 -1 d -8 1 d -7 -1 d -7 X -7 1 d -8 -1 d -14 X -7 -1 d -8 1 d -7 -1 d -109 X -7 1 d
 -15 X -7 1 d -7 1 d -7 X -8 1 d -7 1 d -7 1 d -7 2 d -8 2 d -7 3 d -7 2 d -7 5 d -8 4 d -7 6 d -7 8 d -7 13 d -8 12 d -7 22 d -7 26 d -7 30 d -8 40 d -7 42 d -7 50 d -7 47 d -8 56 d -7 55 d -7 58 d -7 56 d -8 64 d -7 57 d -7 53 d -8 47 d -7 65 d -7
 34 d -7 62 d -8 44 d -7 43 d -7 42 d -7 30 d -8 42 d -7 33 d -7 13 d -7 16 d -8 21 d -7 11 d -7 7 d -7 14 d -8 -1 d -7 4 d -7 4 d -7 -8 d -8 -9 d -7 -1 d -7 -24 d -7 -20 d -8 -23 d -7 -22 d -7 -21 d -7 -37 d -8 -32 d -7 -18 d -7 -54 d -7 -27 d -8
 -25 d -7 -59 d -7 -16 d -8 -44 d -7 -47 d -7 -21 d -7 -42 d -8 -46 d -7 -37 d -7 -46 d -7 -32 d -8 -38 d -7 -38 d -7 -38 d -7 -37 d -8 -23 d -7 -59 d -7 -25 d -7 -28 d -8 -38 d -7 -29 d -7 -30 d -7 -27 d -8 -18 d -7 -23 d -7 -19 d -7 -15 d -8 -15 d
 -7 -8 d -7 -10 d -7 -8 d -8 -5 d -7 -2 d -160 X FA black 1 1 1 c 567 470 1587 1550 bf black 1587 1550 m 567 X s 2154 1550 m 470 Y s 2154 2020 m -567 X s 1587 2020 m -470 Y s
 gsave  2268 1568 0 609 C 1728.33 1918.25 t 0 r /Helvetica findfont 72.27 sf 0 0 m (No Int) show NC gr  0.8 0 0 c 1609 1941 m 99 X s black
 gsave  2268 1568 0 609 C 1728.33 1758.71 t 0 r /Helvetica findfont 72.27 sf 0 0 m (With Int) show NC gr  0 0 1 c 1609 1785 m 99 X s black
 gsave  2268 1568 0 609 C 1728.33 1610.57 t 0 r /Helvetica findfont 72.27 sf 0 0 m (Reweighted) show NC gr  0 0.4 0 c 1609 1628 m 99 X s black
 gsave  2268 1568 0 609 C 2222.13 1747.32 t 90 r /Helvetica-BoldOblique findfont 30.4295 sf 0 0 m (LHC HIGGS XS WG 2013) show NC gr  1 1 1 c 2268 609 0 0 bf black 1 1 1 c 1814 457 227 152 bf black 1814 457 227 152 bl 1 1 1 c black 227 152 m 159 X 457
 Y 8 X -205 Y 7 X 61 Y 7 X -31 Y 7 X -27 Y 8 X 15 Y 7 X -21 Y 7 X 12 Y 7 X -12 Y 8 X -6 Y 7 X 10 Y 7 X -4 Y 7 X -4 Y 8 X 2 Y 7 X -13 Y 7 X 6 Y 8 X 12 Y 7 X -22 Y 7 X 10 Y 15 X 3 Y 7 X -3 Y 7 X -4 Y 7 X 4 Y 8 X 1 Y 7 X -3 Y 7 X -2 Y 7 X -2 Y 8 X 5 Y 7
 X -2 Y 7 X -2 Y 7 X 3 Y 8 X -2 Y 7 X 1 Y 7 X 2 Y 7 X -5 Y 8 X 6 Y 7 X -5 Y 7 X -1 Y 7 X 1 Y 8 X -1 Y 14 X 1 Y 7 X -3 Y 8 X 3 Y 7 X -2 Y 7 X -2 Y 7 X 2 Y 15 X -1 Y 7 X 1 Y 8 X 3 Y 7 X -2 Y 22 X -3 Y 14 X 3 Y 7 X -4 Y 8 X -1 Y 21 X 5 Y 8 X -7 Y 7 X 6
 Y 7 X -5 Y 15 X -1 Y 7 X -2 Y 14 X -1 Y 8 X 1 Y 7 X -3 Y 7 X -9 Y 15 X -11 Y 7 X -3 Y 7 X -12 Y 7 X -7 Y 8 X -8 Y 7 X -11 Y 7 X -2 Y 7 X -31 Y 8 X -30 Y 7 X -8 Y 7 X -79 Y 7 X 7 Y 8 X -18 Y 22 X 457 Y 29 X -18 Y 7 X -61 Y 7 X -34 Y 7 X 26 Y 8 X -29
 Y 7 X -26 Y 7 X 18 Y 7 X -48 Y 8 X 69 Y 7 X -31 Y 7 X -24 Y 7 X 23 Y 8 X -24 Y 7 X -28 Y 7 X 14 Y 7 X -12 Y 8 X -23 Y 7 X 26 Y 7 X -27 Y 7 X 32 Y 8 X 35 Y 7 X -93 Y 7 X 36 Y 7 X 44 Y 8 X -68 Y 7 X 52 Y 7 X -29 Y 7 X -42 Y 8 X 89 Y 7 X -85 Y 7 X 14 Y
 8 X 2 Y 14 X 39 Y 7 X -76 Y 8 X -3 Y 7 X 54 Y 7 X 12 Y 7 X -27 Y 8 X -1 Y 7 X 14 Y 7 X -40 Y 7 X 58 Y 8 X -53 Y 7 X 8 Y 7 X 48 Y 7 X -29 Y 8 X -14 Y 7 X 7 Y 7 X 36 Y 7 X -49 Y 8 X 18 Y 7 X -18 Y 7 X 8 Y 7 X 15 Y 8 X 25 Y 7 X -31 Y 7 X -46 Y 7 X 43 Y
 8 X -25 Y 7 X 74 Y 7 X -63 Y 7 X 35 Y 8 X -30 Y 7 X 13 Y 7 X 30 Y 7 X -65 Y 8 X 48 Y 7 X 3 Y 7 X -9 Y 8 X -25 Y 7 X 9 Y 7 X 30 Y 7 X -53 Y 8 X 47 Y 7 X 40 Y 7 X -53 Y 7 X 8 Y 8 X -37 Y 7 X 74 Y 7 X -31 Y 7 X -87 Y 8 X 77 Y 7 X -63 Y 7 X 56 Y 7 X 36
 Y 8 X -31 Y 7 X 16 Y 7 X -7 Y 7 X -43 Y 8 X -6 Y 7 X 19 Y 7 X 116 Y 7 X -193 Y 8 X 162 Y 7 X -112 Y 7 X 17 Y 7 X -18 Y 8 X 110 Y 7 X -108 Y 7 X 71 Y 7 X -54 Y 15 X 60 Y 7 X -37 Y 8 X 37 Y 7 X -47 Y 7 X 15 Y 7 X -95 Y 8 X 89 Y 7 X -39 Y 7 X 50 Y 7 X
 -7 Y 8 X 21 Y 7 X 53 Y 7 X -156 Y 7 X 136 Y 8 X -139 Y 7 X 99 Y 7 X 24 Y 7 X -11 Y 8 X -16 Y 7 X -60 Y 7 X -14 Y 7 X 131 Y 8 X -8 Y 7 X -41 Y 7 X 91 Y 7 X -226 Y 8 X 95 Y 7 X 139 Y 7 X -145 Y 7 X 33 Y 8 X -49 Y 7 X s 227 152 m 1814 X s
 gsave  2268 609 0 0 C 2017.01 26.5896 t 0 r /Helvetica findfont 38.0897 sf 0 0 m (T) show NC gr 
 gsave  2268 609 0 0 C 1971.43 41.7837 t 0 r /Helvetica findfont 57.1345 sf 0 0 m (M) show NC gr  227 167 m -15 Y s 263 160 m -8 Y s 299 160 m -8 Y s 336 160 m -8 Y s 372 160 m -8 Y s 408 167 m -15 Y s 444 160 m -8 Y s 481 160 m -8 Y s 517 160 m -8 Y
 s 553 160 m -8 Y s 590 167 m -15 Y s 626 160 m -8 Y s 662 160 m -8 Y s 698 160 m -8 Y s 735 160 m -8 Y s 771 167 m -15 Y s 807 160 m -8 Y s 844 160 m -8 Y s 880 160 m -8 Y s 916 160 m -8 Y s 952 167 m -15 Y s 989 160 m -8 Y s 1025 160 m -8 Y s 1061
 160 m -8 Y s 1098 160 m -8 Y s 1134 167 m -15 Y s 1170 160 m -8 Y s 1206 160 m -8 Y s 1243 160 m -8 Y s 1279 160 m -8 Y s 1315 167 m -15 Y s 1352 160 m -8 Y s 1388 160 m -8 Y s 1424 160 m -8 Y s 1460 160 m -8 Y s 1497 167 m -15 Y s 1533 160 m -8 Y s
 1569 160 m -8 Y s 1606 160 m -8 Y s 1642 160 m -8 Y s 1678 167 m -15 Y s 1714 160 m -8 Y s 1751 160 m -8 Y s 1787 160 m -8 Y s 1823 160 m -8 Y s 1860 167 m -15 Y s 1896 160 m -8 Y s 1932 160 m -8 Y s 1968 160 m -8 Y s 2005 160 m -8 Y s 2041 167 m
 -15 Y s
 gsave  2268 609 0 0 C 208.919 113.956 t 0 r /Helvetica findfont 45.7076 sf 0 0 m (0) show NC gr 
 gsave  2268 609 0 0 C 368.456 113.956 t 0 r /Helvetica findfont 45.7076 sf 0 0 m (100) show NC gr 
 gsave  2268 609 0 0 C 550.785 113.956 t 0 r /Helvetica findfont 45.7076 sf 0 0 m (200) show NC gr 
 gsave  2268 609 0 0 C 729.316 113.956 t 0 r /Helvetica findfont 45.7076 sf 0 0 m (300) show NC gr 
 gsave  2268 609 0 0 C 911.645 113.956 t 0 r /Helvetica findfont 45.7076 sf 0 0 m (400) show NC gr 
 gsave  2268 609 0 0 C 1093.97 113.956 t 0 r /Helvetica findfont 45.7076 sf 0 0 m (500) show NC gr 
 gsave  2268 609 0 0 C 1276.3 113.956 t 0 r /Helvetica findfont 45.7076 sf 0 0 m (600) show NC gr 
 gsave  2268 609 0 0 C 1458.63 113.956 t 0 r /Helvetica findfont 45.7076 sf 0 0 m (700) show NC gr 
 gsave  2268 609 0 0 C 1637.16 113.956 t 0 r /Helvetica findfont 45.7076 sf 0 0 m (800) show NC gr 
 gsave  2268 609 0 0 C 1819.49 113.956 t 0 r /Helvetica findfont 45.7076 sf 0 0 m (900) show NC gr 
 gsave  2268 609 0 0 C 1986.63 113.956 t 0 r /Helvetica findfont 45.7076 sf 0 0 m (1000) show NC gr  227 152 m 457 Y s
 gsave  2268 609 0 0 C 91.1645 170.933 t 90 r /Helvetica findfont 45.7076 sf 0 0 m (\(S+I\)/\(Reweighted S\)) show NC gr  278 152 m -51 X s 252 164 m -25 X s 252 175 m -25 X s 252 187 m -25 X s 278 198 m -51 X s 252 209 m -25 X s 252 221 m -25 X s
 252 232 m -25 X s 278 244 m -51 X s 252 255 m -25 X s 252 267 m -25 X s 252 278 m -25 X s 278 289 m -51 X s 252 301 m -25 X s 252 312 m -25 X s 252 324 m -25 X s 278 335 m -51 X s 252 347 m -25 X s 252 358 m -25 X s 252 369 m -25 X s 278 381 m -51 X
 s 252 392 m -25 X s 252 404 m -25 X s 252 415 m -25 X s 278 427 m -51 X s 252 438 m -25 X s 252 449 m -25 X s 252 461 m -25 X s 278 472 m -51 X s 252 484 m -25 X s 252 495 m -25 X s 252 507 m -25 X s 278 518 m -51 X s 252 529 m -25 X s 252 541 m -25
 X s 252 552 m -25 X s 278 564 m -51 X s 252 575 m -25 X s 252 587 m -25 X s 252 598 m -25 X s 278 609 m -51 X s
 gsave  2268 609 0 0 C 186.127 136.747 t 0 r /Helvetica findfont 45.7076 sf 0 0 m (0) show NC gr 
 gsave  2268 609 0 0 C 148.142 182.329 t 0 r /Helvetica findfont 45.7076 sf 0 0 m (0.2) show NC gr 
 gsave  2268 609 0 0 C 148.142 227.911 t 0 r /Helvetica findfont 45.7076 sf 0 0 m (0.4) show NC gr 
 gsave  2268 609 0 0 C 148.142 273.493 t 0 r /Helvetica findfont 45.7076 sf 0 0 m (0.6) show NC gr 
 gsave  2268 609 0 0 C 148.142 319.076 t 0 r /Helvetica findfont 45.7076 sf 0 0 m (0.8) show NC gr 
 gsave  2268 609 0 0 C 193.725 364.658 t 0 r /Helvetica findfont 45.7076 sf 0 0 m (1) show NC gr 
 gsave  2268 609 0 0 C 148.142 410.24 t 0 r /Helvetica findfont 45.7076 sf 0 0 m (1.2) show NC gr 
 gsave  2268 609 0 0 C 148.142 455.822 t 0 r /Helvetica findfont 45.7076 sf 0 0 m (1.4) show NC gr 
 gsave  2268 609 0 0 C 148.142 501.405 t 0 r /Helvetica findfont 45.7076 sf 0 0 m (1.6) show NC gr 
 gsave  2268 609 0 0 C 148.142 546.987 t 0 r /Helvetica findfont 45.7076 sf 0 0 m (1.8) show NC gr 
 gsave  2268 609 0 0 C 186.127 592.569 t 0 r /Helvetica findfont 45.7076 sf 0 0 m (2) show NC gr  230 152 m20 238 152 m20 245 152 m20 252 152 m20 259 152 m20 267 152 m20 274 152 m20 281 152 m20 288 152 m20 296 152 m20 303 152 m20 310 152 m20 317 152
 m20 325 152 m20 332 152 m20 339 152 m20 347 152 m20 354 152 m20 361 152 m20 368 152 m20 376 152 m20 383 152 m20 397 404 m20 405 465 m20 412 434 m20 419 407 m20 426 422 m20 434 401 m20 441 413 m20 448 401 m20 455 395 m20 463 405 m20 470 401 m20 477
 397 m20 484 399 m20 492 386 m20 499 392 m20 506 404 m20 513 382 m20 521 392 m20 528 392 m20 535 395 m20 542 392 m20 550 388 m20 557 392 m20 564 393 m20 571 390 m20 579 388 m20 586 386 m20 593 391 m20 600 389 m20 608 387 m20 615 390 m20 622 388 m20
 630 389 m20 637 391 m20 644 386 m20 651 392 m20 659 387 m20 666 386 m20 673 387 m20 680 386 m20 688 386 m20 695 387 m20 702 384 m20 709 387 m20 717 385 m20 724 383 m20 731 385 m20 738 385 m20 746 384 m20 753 385 m20 760 388 m20 767 386 m20 775 386
 m20 782 386 m20 789 383 m20 796 383 m20 804 386 m20 811 382 m20 818 381 m20 825 381 m20 833 381 m20 840 386 m20 847 379 m20 854 385 m20 862 380 m20 869 380 m20 876 379 m20 884 377 m20 891 377 m20 898 376 m20 905 377 m20 913 374 m20 920 365 m20 927
 365 m20 934 354 m20 942 351 m20 949 339 m20 956 332 m20 963 324 m20 971 313 m20 978 311 m20 985 280 m20 992 250 m20 1000 242 m20 1007 163 m20 1014 170 m20 1072 591 m20 1079 530 m20 1087 496 m20 1094 522 m20 1101 493 m20 1108 467 m20 1116 485 m20
 1123 437 m20 1130 506 m20 1137 475 m20 1145 451 m20 1152 474 m20 1159 450 m20 1167 422 m20 1174 436 m20 1181 424 m20 1188 401 m20 1196 427 m20 1203 400 m20 1210 432 m20 1217 467 m20 1225 374 m20 1232 410 m20 1239 454 m20 1246 386 m20 1254 438 m20
 1261 409 m20 1268 367 m20 1275 456 m20 1283 371 m20 1290 385 m20 1297 387 m20 1304 387 m20 1312 426 m20 1319 350 m20 1326 347 m20 1333 401 m20 1341 413 m20 1348 386 m20 1355 385 m20 1362 399 m20 1370 359 m20 1377 417 m20 1384 364 m20 1391 372 m20
 1399 420 m20 1406 391 m20 1413 377 m20 1420 384 m20 1428 420 m20 1435 371 m20 1442 389 m20 1450 371 m20 1457 379 m20 1464 394 m20 1471 419 m20 1479 388 m20 1486 342 m20 1493 385 m20 1500 360 m20 1508 434 m20 1515 371 m20 1522 406 m20 1529 376 m20
 1537 389 m20 1544 419 m20 1551 354 m20 1558 402 m20 1566 405 m20 1573 396 m20 1580 371 m20 1587 380 m20 1595 410 m20 1602 357 m20 1609 404 m20 1616 444 m20 1624 391 m20 1631 399 m20 1638 362 m20 1645 436 m20 1653 405 m20 1660 318 m20 1667 395 m20
 1674 332 m20 1682 388 m20 1689 424 m20 1696 393 m20 1704 409 m20 1711 402 m20 1718 359 m20 1725 353 m20 1733 372 m20 1740 488 m20 1747 295 m20 1754 457 m20 1762 345 m20 1769 362 m20 1776 344 m20 1783 454 m20 1791 346 m20 1798 417 m20 1805 363 m20
 1812 363 m20 1820 423 m20 1827 386 m20 1834 423 m20 1841 376 m20 1849 391 m20 1856 296 m20 1863 385 m20 1870 346 m20 1878 396 m20 1885 389 m20 1892 410 m20 1899 463 m20 1907 307 m20 1914 443 m20 1921 304 m20 1928 403 m20 1936 427 m20 1943 416 m20
 1950 400 m20 1957 340 m20 1965 326 m20 1972 457 m20 1979 449 m20 1987 408 m20 1994 499 m20 2001 273 m20 2008 368 m20 2016 507 m20 2023 362 m20 2030 395 m20 2037 346 m20 cs 0 0 0 P13 setcolor 230 152 m 153 X 7 457 d 7 -156 d 8 44 d 7 -41 d 7 -32 d 7
 12 d 8 -24 d 7 11 d 7 -13 d 7 -8 d 8 10 d 7 -5 d 7 -4 d 7 1 d 8 -14 d 7 7 d 7 11 d 7 -22 d 8 9 d 7 1 d 7 2 d 7 -3 d 8 -4 d 7 4 d 7 1 d 7 -4 d 8 -2 d 7 -1 d 7 4 d 7 -1 d 8 -3 d 7 3 d 7 -2 d 8 1 d 7 2 d 7 -5 d 7 6 d 8 -5 d 7 -1 d 7 1 d 7 -1 d 8 X 7 1
 d 7 -3 d 7 2 d 8 -1 d 7 -2 d 7 2 d 7 X 8 -1 d 7 X 7 4 d 7 -2 d 8 X 7 -1 d 7 -2 d 7 X 8 2 d 7 -4 d 7 -1 d 7 1 d 8 X 7 5 d 7 -8 d 7 7 d 8 -5 d 7 X 7 -1 d 8 -2 d 7 X 7 -1 d 7 1 d 8 -2 d 7 -10 d 7 1 d 7 -11 d 8 -3 d 7 -12 d 7 -6 d 7 -8 d 8 -10 d 7 X 7
 -30 d 7 -27 d 8 -6 d 7 -74 d 7 11 d 7 -40 d 19 X 3 457 d 29 X 7 -33 d 8 -36 d 7 23 d 7 -35 d 7 -27 d 8 15 d 7 -48 d 7 71 d 7 -33 d 8 -24 d 7 22 d 7 -25 d 8 -30 d 7 15 d 7 -11 d 7 -26 d 8 27 d 7 -29 d 7 34 d 7 40 d 8 -100 d 7 38 d 7 47 d 7 -72 d 8 59
 d 7 -35 d 7 -44 d 7 97 d 8 -93 d 7 16 d 7 1 d 7 X 8 44 d 7 -81 d 7 -5 d 7 58 d 8 15 d 7 -29 d 7 X 7 13 d 8 -42 d 7 64 d 7 -57 d 7 7 d 8 54 d 7 -31 d 7 -18 d 7 7 d 8 44 d 7 -55 d 7 19 d 8 -17 d 7 9 d 7 18 d 7 24 d 8 -32 d 7 -49 d 7 49 d 7 -32 d 8 86
 d 7 -72 d 7 40 d 7 -31 d 8 13 d 7 35 d 7 -75 d 7 55 d 8 7 d 7 -13 d 7 -28 d 7 10 d 8 34 d 7 -61 d 7 54 d 7 49 d 8 -64 d 7 11 d 7 -40 d 7 83 d 8 -29 d 7 -105 d 7 90 d 7 -70 d 8 60 d 7 48 d 7 -38 d 8 17 d 7 -8 d 7 -46 d 7 -9 d 8 26 d 7 127 d 7 -218 d
 7 188 d 8 -131 d 7 21 d 7 -19 d 7 130 d 8 -134 d 7 86 d 7 -58 d 7 -3 d 8 70 d 7 -42 d 7 42 d 7 -51 d 8 14 d 7 -109 d 7 101 d 7 -42 d 8 66 d 7 -20 d 7 31 d 7 74 d 8 -195 d 7 162 d 7 -165 d 7 119 d 8 25 d 7 -10 d 7 -20 d 7 -70 d 8 -18 d 7 158 d 7 -4 d
 8 -53 d 7 112 d 7 -277 d 7 118 d 8 177 d 7 -188 d 7 51 d 7 -65 d -105 Y -7 33 d -7 -16 d -7 103 d -8 -103 d -7 -70 d -7 174 d -7 -70 d -8 28 d -7 13 d -7 -105 d -8 10 d -7 51 d -7 13 d -7 11 d -8 -22 d -7 -81 d -7 113 d -7 -110 d -8 119 d -7 -32 d
 -7 -13 d -7 -5 d -8 -34 d -7 35 d -7 -76 d -7 81 d -8 -16 d -7 42 d -7 -31 d -7 32 d -8 -51 d -7 -2 d -7 50 d -7 -57 d -8 82 d -7 -88 d -7 16 d -7 -13 d -8 93 d -7 -137 d -7 170 d -7 -106 d -8 -12 d -7 3 d -7 40 d -7 5 d -8 -14 d -7 23 d -7 -24 d -8
 -50 d -7 55 d -7 -64 d -7 68 d -8 33 d -7 -64 d -7 33 d -7 -3 d -8 41 d -7 -31 d -7 -40 d -7 44 d -8 -25 d -7 -9 d -7 24 d -7 5 d -8 -1 d -7 -39 d -7 55 d -7 -26 d -8 -13 d -7 30 d -7 -31 d -7 54 d -8 -63 d -7 20 d -7 -37 d -7 42 d -8 30 d -7 -25 d
 -7 -14 d -7 -6 d -8 18 d -7 -17 d -7 44 d -8 -29 d -7 -6 d -7 10 d -7 28 d -8 -43 d -7 -9 d -7 49 d -7 -51 d -8 37 d -7 -16 d -7 4 d -7 25 d -8 -10 d -7 -49 d -7 1 d -7 71 d -8 -36 d -7 X -7 -3 d -7 -10 d -8 76 d -7 -81 d -7 39 d -7 24 d -8 -45 d -7
 64 d -7 -41 d -7 -34 d -8 87 d -7 -30 d -7 -31 d -7 25 d -8 -25 d -7 20 d -7 13 d -7 -12 d -8 26 d -7 22 d -7 -24 d -8 25 d -7 28 d -7 -66 d -7 46 d -8 -20 d -7 25 d -7 24 d -7 -29 d -8 31 d -7 45 d -5 80 d -28 X -3 -457 d -29 X -7 76 d -8 11 d -7
 32 d -7 32 d -7 5 d -8 11 d -7 9 d -7 7 d -7 13 d -8 4 d -7 11 d -7 X -7 9 d -8 3 d -7 -1 d -7 1 d -7 X -8 3 d -14 X -8 5 d -7 -6 d -7 7 d -7 -5 d -8 1 d -7 -1 d -7 1 d -7 4 d -8 -3 d -7 X -7 3 d -7 1 d -8 -1 d -7 2 d -7 -3 d -7 -1 d -8 1 d -7 1 d
 -7 -3 d -7 2 d -8 2 d -7 -3 d -7 3 d -7 -1 d -8 X -7 1 d -7 -1 d -7 1 d -8 4 d -7 -5 d -7 5 d -7 -2 d -8 -1 d -7 1 d -7 -2 d -8 2 d -7 1 d -7 -4 d -7 1 d -8 2 d -7 3 d -7 -1 d -7 -4 d -8 3 d -7 3 d -7 -3 d -7 X -8 -10 d -7 21 d -7 -11 d -7 -7 d -8
 13 d -7 -2 d -7 3 d -7 3 d -8 -10 d -7 5 d -7 10 d -7 -13 d -8 17 d -7 -17 d -7 22 d -7 21 d -8 -79 d -7 -200 d -7 -2 d -153 X FA
 gr  gr showpage
end
%%EOF
