%!PS-Adobe-3.0 EPSF-3.0
%%BoundingBox: (atend)
%%LanguageLevel: 2
%%Creator: Grace-5.1.22
%%CreationDate: Tue Mar 26 12:43:52 2013
%%DocumentData: Clean8Bit
%%Orientation: Portrait
%%Title: /home/pcl302a/heinemey/plot/grace/2012/lhc-higgs-br/tauphobic_tb10_BR-A0.grace
%%For: heinemey
%%DocumentNeededResources: (atend)
%%EndComments
%%BeginProlog
/m {moveto} def
/l {lineto} def
/s {stroke} def
/n {newpath} def
/c {closepath} def
/RL {rlineto} def
/SLW {setlinewidth} def
/GS {gsave} def
/GR {grestore} def
/SC {setcolor} def
/SGRY {setgray} def
/SRGB {setrgbcolor} def
/SD {setdash} def
/SLC {setlinecap} def
/SLJ {setlinejoin} def
/SCS {setcolorspace} def
/FFSF {findfont setfont} def
/CC {concat} def
/PXL {n m 0 0 RL s} def
/Color0 {1.0000 1.0000 1.0000} def
/Color1 {0.0000 0.0000 0.0000} def
/Color2 {1.0000 0.0000 0.0000} def
/Color3 {0.0000 1.0000 0.0000} def
/Color4 {0.0000 0.0000 1.0000} def
/Color5 {1.0000 1.0000 0.0000} def
/Color6 {0.7373 0.5608 0.5608} def
/Color7 {0.8627 0.8627 0.8627} def
/Color8 {0.5804 0.0000 0.8275} def
/Color9 {0.0000 1.0000 1.0000} def
/Color10 {1.0000 0.0000 1.0000} def
/Color11 {1.0000 0.6471 0.0000} def
/Color12 {0.4471 0.1294 0.7373} def
/Color13 {0.4039 0.0275 0.2824} def
/Color14 {0.2510 0.8784 0.8157} def
/Color15 {0.0000 0.5451 0.0000} def
/Color16 {0.7529 0.7529 0.7529} def
/Color17 {0.5059 0.5059 0.5059} def
/Color18 {0.2588 0.2588 0.2588} def
/PTRN {
 /pat_bits exch def 
 <<
  /PaintType 2
  /PatternType 1 /TilingType 1
  /BBox[0 0 16 16]
  /XStep 16 /YStep 16
  /PaintProc {
   pop
   16 16 true [-1 0 0 -1 16 16] pat_bits imagemask
  }
 >>
 [0.0016 0 0 0.0016 0 0]
 makepattern
} def
/Pattern0 {<0000000000000000000000000000000000000000000000000000000000000000> PTRN} bind def
/Pattern1 {<ffffffffffffffffffffffffffffffffffffffffffffffffffffffffffffffff> PTRN} bind def
/Pattern2 {<eeeeffffbbbbffffeeeeffffbbbbffffeeeeffffbbbbffffeeeeffffbbbbffff> PTRN} bind def
/Pattern3 {<eeeebbbbeeeebbbbeeeebbbbeeeebbbbeeeebbbbeeeebbbbeeeebbbbeeeebbbb> PTRN} bind def
/Pattern4 {<5555aaaa5555aaaa5555aaaa5555aaaa5555aaaa5555aaaa5555aaaa5555aaaa> PTRN} bind def
/Pattern5 {<1111444411114444111144441111444411114444111144441111444411114444> PTRN} bind def
/Pattern6 {<1111000044440000111100004444000011110000444400001111000044440000> PTRN} bind def
/Pattern7 {<1010000000000000010100000000000010100000000000000101000000000000> PTRN} bind def
/Pattern8 {<0000000000000000000000000000000000000000000000000000000000000000> PTRN} bind def
/Pattern9 {<1e1e0f0f8787c3c3e1e1f0f078783c3c1e1e0f0f8787c3c3e1e1f0f078783c3c> PTRN} bind def
/Pattern10 {<7878f0f0e1e1c3c387870f0f1e1e3c3c7878f0f0e1e1c3c387870f0f1e1e3c3c> PTRN} bind def
/Pattern11 {<3333333333333333333333333333333333333333333333333333333333333333> PTRN} bind def
/Pattern12 {<ffffffff00000000ffffffff00000000ffffffff00000000ffffffff00000000> PTRN} bind def
/Pattern13 {<8181424224241818181824244242818181814242242418181818242442428181> PTRN} bind def
/Pattern14 {<8080404020201010080804040202010180804040202010100808040402020101> PTRN} bind def
/Pattern15 {<0101020204040808101020204040808001010202040408081010202040408080> PTRN} bind def
/Pattern16 {<2222222222222222222222222222222222222222222222222222222222222222> PTRN} bind def
/Pattern17 {<0000ffff000000000000ffff000000000000ffff000000000000ffff00000000> PTRN} bind def
/Pattern18 {<2222ffff222222222222ffff222222222222ffff222222222222ffff22222222> PTRN} bind def
/Pattern19 {<ffffffff33333333ffffffff33333333ffffffff33333333ffffffff33333333> PTRN} bind def
/Pattern20 {<0f0f0f0f0f0f0f0ff0f0f0f0f0f0f0f00f0f0f0f0f0f0f0ff0f0f0f0f0f0f0f0> PTRN} bind def
/Pattern21 {<ff00ff00ff00ff00ff00ff00ff00ff0000ff00ff00ff00ff00ff00ff00ff00ff> PTRN} bind def
/Pattern22 {<8001800180018001800180018001ffffffff8001800180018001800180018001> PTRN} bind def
/Pattern23 {<c003c003c003c003c003c003ffffffffffffffffc003c003c003c003c003c003> PTRN} bind def
/Pattern24 {<040404040404ffff404040404040ffff040404040404ffff404040404040ffff> PTRN} bind def
/Pattern25 {<180018001800180018001800ffffffff001800180018001800180018ffffffff> PTRN} bind def
/Pattern26 {<1111b8b87c7c3a3a1111a3a3c7c78b8b1111b8b87c7c3a3a1111a3a3c7c78b8b> PTRN} bind def
/Pattern27 {<101010102828c7c70101010182827c7c101010102828c7c70101010182827c7c> PTRN} bind def
/Pattern28 {<1c1c121211112121c1c12121111112121c1c121211112121c1c1212111111212> PTRN} bind def
/Pattern29 {<3e3e414180808080e3e31414080808083e3e414180808080e3e3141408080808> PTRN} bind def
/Pattern30 {<4848888884848383848488884848383848488888848483838484888848483838> PTRN} bind def
/Pattern31 {<03030404080808080c0c12122121c0c003030404080808080c0c12122121c0c0> PTRN} bind def
/ellipsedict 8 dict def
ellipsedict /mtrx matrix put
/EARC {
 ellipsedict begin
  /endangle exch def
  /startangle exch def
  /yrad exch def
  /xrad exch def
  /y exch def
  /x exch def
  /savematrix mtrx currentmatrix def
  x y translate
  xrad yrad scale
  0 0 1 startangle endangle arc
  savematrix setmatrix
 end
} def
/TL {
  /kcomp exch def
  /linewidth exch def
  /offset exch def
  GS
  0 offset rmoveto
  linewidth SLW
  dup stringwidth exch kcomp add exch RL s
  GR
} def
/KINIT
{
 /kvector exch def
 /kid 0 def
} def
/KPROC
{
 pop pop
 kvector kid get
 0 rmoveto
 /kid 1 kid add def
} def
/DefEncoding [
 /.notdef
 /.notdef
 /.notdef
 /.notdef
 /.notdef
 /.notdef
 /.notdef
 /.notdef
 /.notdef
 /.notdef
 /.notdef
 /.notdef
 /.notdef
 /.notdef
 /.notdef
 /.notdef
 /.notdef
 /.notdef
 /.notdef
 /.notdef
 /.notdef
 /.notdef
 /.notdef
 /.notdef
 /.notdef
 /.notdef
 /.notdef
 /.notdef
 /.notdef
 /.notdef
 /.notdef
 /.notdef
 /space
 /exclam
 /quotedbl
 /numbersign
 /dollar
 /percent
 /ampersand
 /quoteright
 /parenleft
 /parenright
 /asterisk
 /plus
 /comma
 /hyphen
 /period
 /slash
 /zero
 /one
 /two
 /three
 /four
 /five
 /six
 /seven
 /eight
 /nine
 /colon
 /semicolon
 /less
 /equal
 /greater
 /question
 /at
 /A
 /B
 /C
 /D
 /E
 /F
 /G
 /H
 /I
 /J
 /K
 /L
 /M
 /N
 /O
 /P
 /Q
 /R
 /S
 /T
 /U
 /V
 /W
 /X
 /Y
 /Z
 /bracketleft
 /backslash
 /bracketright
 /asciicircum
 /underscore
 /grave
 /a
 /b
 /c
 /d
 /e
 /f
 /g
 /h
 /i
 /j
 /k
 /l
 /m
 /n
 /o
 /p
 /q
 /r
 /s
 /t
 /u
 /v
 /w
 /x
 /y
 /z
 /braceleft
 /bar
 /braceright
 /asciitilde
 /.notdef
 /.notdef
 /.notdef
 /.notdef
 /.notdef
 /.notdef
 /.notdef
 /.notdef
 /.notdef
 /.notdef
 /.notdef
 /.notdef
 /.notdef
 /.notdef
 /.notdef
 /.notdef
 /.notdef
 /.notdef
 /.notdef
 /.notdef
 /.notdef
 /.notdef
 /.notdef
 /.notdef
 /.notdef
 /.notdef
 /.notdef
 /.notdef
 /.notdef
 /.notdef
 /.notdef
 /.notdef
 /.notdef
 /space
 /exclamdown
 /cent
 /sterling
 /currency
 /yen
 /brokenbar
 /section
 /dieresis
 /copyright
 /ordfeminine
 /guillemotleft
 /logicalnot
 /hyphen
 /registered
 /macron
 /degree
 /plusminus
 /twosuperior
 /threesuperior
 /acute
 /mu
 /paragraph
 /periodcentered
 /cedilla
 /onesuperior
 /ordmasculine
 /guillemotright
 /onequarter
 /onehalf
 /threequarters
 /questiondown
 /Agrave
 /Aacute
 /Acircumflex
 /Atilde
 /Adieresis
 /Aring
 /AE
 /Ccedilla
 /Egrave
 /Eacute
 /Ecircumflex
 /Edieresis
 /Igrave
 /Iacute
 /Icircumflex
 /Idieresis
 /Eth
 /Ntilde
 /Ograve
 /Oacute
 /Ocircumflex
 /Otilde
 /Odieresis
 /multiply
 /Oslash
 /Ugrave
 /Uacute
 /Ucircumflex
 /Udieresis
 /Yacute
 /Thorn
 /germandbls
 /agrave
 /aacute
 /acircumflex
 /atilde
 /adieresis
 /aring
 /ae
 /ccedilla
 /egrave
 /eacute
 /ecircumflex
 /edieresis
 /igrave
 /iacute
 /icircumflex
 /idieresis
 /eth
 /ntilde
 /ograve
 /oacute
 /ocircumflex
 /otilde
 /odieresis
 /divide
 /oslash
 /ugrave
 /uacute
 /ucircumflex
 /udieresis
 /yacute
 /thorn
 /ydieresis
] def
%%EndProlog
%%BeginSetup
%%EndSetup
612.00 612.00 scale
[/DeviceRGB] SCS
Color2 SC
[] 0 SD
0.0045 SLW
0 SLC
0 SLJ
n
0.4901 0.1499 m
0.4904 0.1511 l
0.4920 0.1583 l
0.4935 0.1655 l
0.4951 0.1728 l
0.4967 0.1799 l
0.4982 0.1871 l
0.4998 0.1943 l
0.5014 0.2015 l
0.5029 0.2087 l
0.5045 0.2159 l
0.5061 0.2231 l
0.5076 0.2304 l
0.5092 0.2377 l
0.5108 0.2451 l
0.5124 0.2525 l
0.5139 0.2601 l
0.5155 0.2677 l
0.5171 0.2753 l
0.5186 0.2832 l
0.5202 0.2911 l
0.5218 0.2992 l
0.5233 0.3075 l
0.5249 0.3159 l
0.5265 0.3246 l
0.5280 0.3335 l
0.5296 0.3428 l
0.5312 0.3524 l
0.5327 0.3624 l
0.5343 0.3729 l
0.5359 0.3840 l
0.5375 0.3959 l
0.5390 0.4086 l
0.5406 0.4226 l
0.5422 0.4381 l
0.5437 0.4558 l
0.5453 0.4769 l
0.5469 0.5095 l
0.5484 0.5495 l
0.5502 0.5926 l
0.5516 0.6296 l
0.5531 0.6664 l
0.5547 0.6949 l
0.5563 0.7120 l
0.5578 0.7150 l
0.5594 0.7176 l
0.5610 0.7198 l
0.5625 0.7218 l
0.5641 0.7235 l
0.5657 0.7251 l
0.5673 0.7266 l
0.5688 0.7279 l
0.5704 0.7292 l
0.5720 0.7303 l
0.5735 0.7314 l
0.5751 0.7324 l
0.5767 0.7334 l
0.5782 0.7343 l
0.5798 0.7351 l
0.5814 0.7359 l
0.5829 0.7367 l
0.5845 0.7374 l
0.5861 0.7381 l
0.5876 0.7387 l
0.5892 0.7394 l
0.5908 0.7400 l
0.5924 0.7406 l
0.5939 0.7411 l
0.5955 0.7417 l
0.5971 0.7422 l
0.5986 0.7427 l
0.6002 0.7431 l
0.6018 0.7436 l
0.6033 0.7441 l
0.6049 0.7445 l
0.6065 0.7449 l
0.6080 0.7453 l
0.6096 0.7444 l
0.6112 0.7435 l
0.6127 0.7430 l
0.6143 0.7427 l
0.6159 0.7425 l
0.6175 0.7424 l
0.6190 0.7423 l
0.6206 0.7422 l
0.6222 0.7422 l
0.6237 0.7422 l
0.6253 0.7422 l
0.6269 0.7422 l
0.6284 0.7422 l
0.6300 0.7422 l
0.6316 0.7422 l
0.6331 0.7422 l
0.6347 0.7422 l
0.6363 0.7423 l
0.6378 0.7423 l
0.6394 0.7423 l
0.6410 0.7424 l
0.6425 0.7424 l
0.6441 0.7424 l
0.6457 0.7425 l
0.6473 0.7425 l
0.6488 0.7426 l
0.6504 0.7426 l
0.6520 0.7426 l
0.6535 0.7427 l
0.6551 0.7427 l
0.6567 0.7428 l
0.6582 0.7428 l
0.6598 0.7429 l
0.6614 0.7429 l
0.6629 0.7429 l
0.6645 0.7430 l
0.6661 0.7430 l
0.6676 0.7431 l
0.6692 0.7431 l
0.6708 0.7431 l
0.6724 0.7432 l
0.6739 0.7432 l
0.6755 0.7433 l
0.6771 0.7433 l
0.6786 0.7433 l
0.6802 0.7434 l
0.6818 0.7434 l
0.6833 0.7434 l
0.6849 0.7435 l
0.6865 0.7435 l
0.6880 0.7435 l
0.6896 0.7436 l
0.6912 0.7436 l
0.6927 0.7436 l
0.6943 0.7437 l
0.6959 0.7437 l
0.6975 0.7437 l
0.6990 0.7438 l
0.7006 0.7438 l
0.7022 0.7438 l
0.7037 0.7439 l
0.7053 0.7439 l
0.7069 0.7439 l
0.7084 0.7439 l
0.7100 0.7440 l
0.7116 0.7440 l
0.7131 0.7440 l
0.7147 0.7440 l
0.7163 0.7441 l
0.7178 0.7441 l
0.7194 0.7441 l
0.7210 0.7441 l
0.7225 0.7442 l
0.7241 0.7442 l
0.7257 0.7442 l
0.7273 0.7442 l
0.7288 0.7443 l
0.7304 0.7443 l
0.7320 0.7443 l
0.7335 0.7443 l
0.7351 0.7443 l
0.7367 0.7444 l
0.7382 0.7444 l
0.7398 0.7444 l
0.7414 0.7444 l
0.7429 0.7444 l
0.7445 0.7445 l
0.7461 0.7445 l
0.7476 0.7445 l
0.7492 0.7445 l
0.7508 0.7445 l
0.7524 0.7445 l
0.7539 0.7446 l
0.7555 0.7446 l
0.7571 0.7446 l
0.7586 0.7446 l
0.7602 0.7446 l
0.7618 0.7446 l
0.7633 0.7446 l
0.7649 0.7447 l
0.7665 0.7447 l
0.7680 0.7447 l
0.7696 0.7447 l
0.7712 0.7447 l
0.7727 0.7447 l
0.7743 0.7447 l
0.7759 0.7447 l
0.7775 0.7448 l
0.7790 0.7448 l
0.7806 0.7448 l
0.7822 0.7448 l
0.7837 0.7448 l
0.7853 0.7448 l
0.7869 0.7448 l
0.7884 0.7448 l
0.7900 0.7448 l
0.7916 0.7449 l
0.7931 0.7449 l
0.7947 0.7449 l
0.7963 0.7449 l
0.7978 0.7449 l
0.7994 0.7449 l
0.8010 0.7449 l
0.8025 0.7449 l
0.8041 0.7449 l
0.8057 0.7449 l
0.8073 0.7449 l
0.8088 0.7450 l
0.8104 0.7450 l
0.8120 0.7450 l
0.8135 0.7450 l
0.8151 0.7450 l
0.8167 0.7450 l
0.8182 0.7450 l
0.8198 0.7450 l
0.8214 0.7450 l
0.8229 0.7450 l
0.8245 0.7450 l
0.8261 0.7450 l
0.8276 0.7450 l
0.8292 0.7450 l
0.8308 0.7450 l
0.8324 0.7450 l
0.8339 0.7451 l
0.8355 0.7451 l
0.8371 0.7451 l
0.8386 0.7451 l
0.8402 0.7451 l
0.8418 0.7451 l
0.8433 0.7451 l
0.8449 0.7451 l
0.8465 0.7451 l
0.8480 0.7451 l
0.8496 0.7451 l
0.8512 0.7451 l
0.8527 0.7451 l
0.8543 0.7451 l
0.8559 0.7451 l
0.8575 0.7451 l
0.8590 0.7451 l
0.8606 0.7451 l
0.8622 0.7451 l
0.8637 0.7451 l
0.8653 0.7451 l
0.8669 0.7451 l
0.8684 0.7451 l
0.8700 0.7451 l
0.8716 0.7451 l
0.8731 0.7451 l
0.8747 0.7451 l
0.8763 0.7451 l
0.8778 0.7451 l
0.8794 0.7452 l
0.8810 0.7452 l
0.8825 0.7452 l
0.8841 0.7452 l
0.8857 0.7452 l
0.8873 0.7452 l
0.8888 0.7452 l
0.8904 0.7452 l
0.8920 0.7452 l
0.8935 0.7452 l
0.8951 0.7452 l
0.8967 0.7452 l
0.8982 0.7452 l
0.8998 0.7452 l
0.9014 0.7452 l
0.9029 0.7452 l
0.9045 0.7452 l
0.9061 0.7452 l
0.9076 0.7452 l
0.9092 0.7452 l
0.9108 0.7452 l
0.9124 0.7452 l
0.9139 0.7452 l
0.9155 0.7452 l
0.9171 0.7452 l
0.9186 0.7452 l
0.9202 0.7452 l
0.9218 0.7452 l
0.9233 0.7452 l
0.9249 0.7452 l
0.9265 0.7452 l
0.9280 0.7452 l
0.9296 0.7452 l
0.9312 0.7452 l
0.9327 0.7452 l
0.9343 0.7452 l
0.9359 0.7452 l
0.9375 0.7452 l
0.9390 0.7452 l
0.9406 0.7452 l
0.9422 0.7452 l
0.9437 0.7452 l
0.9453 0.7452 l
0.9469 0.7452 l
0.9484 0.7452 l
0.9500 0.7452 l
s
[/DeviceRGB] SCS
Color3 SC
n
0.1500 0.8908 m
0.1516 0.8907 l
0.1531 0.8907 l
0.1547 0.8907 l
0.1563 0.8907 l
0.1578 0.8907 l
0.1594 0.8907 l
0.1610 0.8906 l
0.1625 0.8906 l
0.1641 0.8906 l
0.1657 0.8906 l
0.1673 0.8906 l
0.1688 0.8906 l
0.1704 0.8906 l
0.1720 0.8905 l
0.1735 0.8905 l
0.1751 0.8905 l
0.1767 0.8905 l
0.1782 0.8905 l
0.1798 0.8905 l
0.1814 0.8905 l
0.1829 0.8904 l
0.1845 0.8904 l
0.1861 0.8904 l
0.1876 0.8904 l
0.1892 0.8904 l
0.1908 0.8904 l
0.1924 0.8904 l
0.1939 0.8903 l
0.1955 0.8903 l
0.1971 0.8903 l
0.1986 0.8903 l
0.2002 0.8903 l
0.2018 0.8903 l
0.2033 0.8903 l
0.2049 0.8903 l
0.2065 0.8902 l
0.2080 0.8902 l
0.2096 0.8902 l
0.2112 0.8902 l
0.2127 0.8902 l
0.2143 0.8902 l
0.2159 0.8902 l
0.2175 0.8902 l
0.2190 0.8902 l
0.2206 0.8901 l
0.2222 0.8901 l
0.2237 0.8901 l
0.2253 0.8901 l
0.2269 0.8901 l
0.2284 0.8901 l
0.2300 0.8901 l
0.2316 0.8901 l
0.2331 0.8901 l
0.2347 0.8900 l
0.2363 0.8900 l
0.2378 0.8900 l
0.2394 0.8900 l
0.2410 0.8900 l
0.2425 0.8900 l
0.2441 0.8900 l
0.2457 0.8900 l
0.2473 0.8900 l
0.2488 0.8899 l
0.2504 0.8899 l
0.2520 0.8899 l
0.2535 0.8899 l
0.2551 0.8899 l
0.2567 0.8899 l
0.2582 0.8899 l
0.2598 0.8899 l
0.2614 0.8899 l
0.2629 0.8899 l
0.2645 0.8898 l
0.2661 0.8898 l
0.2676 0.8898 l
0.2692 0.8898 l
0.2708 0.8898 l
0.2724 0.8898 l
0.2739 0.8898 l
0.2755 0.8898 l
0.2771 0.8898 l
0.2786 0.8898 l
0.2802 0.8898 l
0.2818 0.8897 l
0.2833 0.8897 l
0.2849 0.8897 l
0.2865 0.8897 l
0.2880 0.8897 l
0.2896 0.8897 l
0.2912 0.8897 l
0.2927 0.8897 l
0.2943 0.8897 l
0.2959 0.8897 l
0.2975 0.8897 l
0.2990 0.8896 l
0.3006 0.8896 l
0.3022 0.8896 l
0.3037 0.8896 l
0.3053 0.8895 l
0.3069 0.8894 l
0.3084 0.8894 l
0.3100 0.8893 l
0.3116 0.8893 l
0.3131 0.8893 l
0.3147 0.8892 l
0.3163 0.8892 l
0.3178 0.8892 l
0.3194 0.8892 l
0.3210 0.8891 l
0.3225 0.8891 l
0.3241 0.8891 l
0.3257 0.8891 l
0.3273 0.8891 l
0.3288 0.8890 l
0.3304 0.8890 l
0.3320 0.8890 l
0.3335 0.8890 l
0.3351 0.8890 l
0.3367 0.8889 l
0.3382 0.8889 l
0.3398 0.8889 l
0.3414 0.8889 l
0.3429 0.8889 l
0.3445 0.8888 l
0.3461 0.8888 l
0.3476 0.8888 l
0.3492 0.8888 l
0.3508 0.8888 l
0.3524 0.8888 l
0.3539 0.8887 l
0.3555 0.8887 l
0.3571 0.8887 l
0.3586 0.8887 l
0.3602 0.8887 l
0.3618 0.8886 l
0.3633 0.8886 l
0.3649 0.8886 l
0.3665 0.8886 l
0.3680 0.8886 l
0.3696 0.8885 l
0.3712 0.8885 l
0.3727 0.8885 l
0.3743 0.8885 l
0.3759 0.8885 l
0.3775 0.8884 l
0.3790 0.8884 l
0.3806 0.8884 l
0.3822 0.8884 l
0.3837 0.8884 l
0.3853 0.8883 l
0.3869 0.8883 l
0.3884 0.8883 l
0.3900 0.8883 l
0.3916 0.8883 l
0.3931 0.8883 l
0.3947 0.8882 l
0.3963 0.8882 l
0.3978 0.8882 l
0.3994 0.8882 l
0.4010 0.8882 l
0.4025 0.8882 l
0.4041 0.8881 l
0.4057 0.8881 l
0.4073 0.8881 l
0.4088 0.8881 l
0.4104 0.8881 l
0.4120 0.8881 l
0.4135 0.8880 l
0.4151 0.8880 l
0.4167 0.8880 l
0.4182 0.8880 l
0.4198 0.8880 l
0.4214 0.8880 l
0.4229 0.8880 l
0.4245 0.8880 l
0.4261 0.8879 l
0.4276 0.8879 l
0.4292 0.8879 l
0.4308 0.8879 l
0.4324 0.8879 l
0.4339 0.8879 l
0.4355 0.8879 l
0.4371 0.8879 l
0.4386 0.8878 l
0.4402 0.8878 l
0.4418 0.8878 l
0.4433 0.8878 l
0.4449 0.8878 l
0.4465 0.8878 l
0.4480 0.8878 l
0.4496 0.8878 l
0.4512 0.8878 l
0.4527 0.8877 l
0.4543 0.8877 l
0.4559 0.8877 l
0.4575 0.8873 l
0.4590 0.8870 l
0.4606 0.8868 l
0.4622 0.8866 l
0.4637 0.8865 l
0.4653 0.8863 l
0.4669 0.8862 l
0.4684 0.8861 l
0.4700 0.8860 l
0.4716 0.8859 l
0.4731 0.8858 l
0.4747 0.8857 l
0.4763 0.8856 l
0.4778 0.8855 l
0.4794 0.8855 l
0.4810 0.8854 l
0.4825 0.8853 l
0.4841 0.8852 l
0.4857 0.8852 l
0.4873 0.8851 l
0.4888 0.8850 l
0.4904 0.8850 l
0.4920 0.8849 l
0.4935 0.8848 l
0.4951 0.8848 l
0.4967 0.8847 l
0.4982 0.8846 l
0.4998 0.8846 l
0.5014 0.8845 l
0.5029 0.8845 l
0.5045 0.8844 l
0.5061 0.8844 l
0.5076 0.8843 l
0.5092 0.8843 l
0.5108 0.8842 l
0.5124 0.8842 l
0.5139 0.8841 l
0.5155 0.8840 l
0.5171 0.8840 l
0.5186 0.8839 l
0.5202 0.8839 l
0.5218 0.8838 l
0.5233 0.8838 l
0.5249 0.8837 l
0.5265 0.8837 l
0.5280 0.8836 l
0.5296 0.8836 l
0.5312 0.8835 l
0.5327 0.8835 l
0.5343 0.8834 l
0.5359 0.8834 l
0.5375 0.8833 l
0.5390 0.8832 l
0.5406 0.8832 l
0.5422 0.8831 l
0.5437 0.8830 l
0.5453 0.8828 l
0.5469 0.8826 l
0.5484 0.8821 l
0.5502 0.8769 l
0.5516 0.8747 l
0.5531 0.8722 l
0.5547 0.8697 l
0.5563 0.8675 l
0.5578 0.8668 l
0.5594 0.8662 l
0.5610 0.8656 l
0.5625 0.8651 l
0.5641 0.8646 l
0.5657 0.8641 l
0.5673 0.8637 l
0.5688 0.8633 l
0.5704 0.8629 l
0.5720 0.8625 l
0.5735 0.8622 l
0.5751 0.8618 l
0.5767 0.8615 l
0.5782 0.8612 l
0.5798 0.8609 l
0.5814 0.8606 l
0.5829 0.8603 l
0.5845 0.8601 l
0.5861 0.8598 l
0.5876 0.8596 l
0.5892 0.8593 l
0.5908 0.8591 l
0.5924 0.8589 l
0.5939 0.8586 l
0.5955 0.8584 l
0.5971 0.8582 l
0.5986 0.8580 l
0.6002 0.8578 l
0.6018 0.8576 l
0.6033 0.8574 l
0.6049 0.8572 l
0.6065 0.8570 l
0.6080 0.8568 l
0.6096 0.8554 l
0.6112 0.8539 l
0.6127 0.8529 l
0.6143 0.8521 l
0.6159 0.8514 l
0.6175 0.8508 l
0.6190 0.8502 l
0.6206 0.8496 l
0.6222 0.8491 l
0.6237 0.8487 l
0.6253 0.8482 l
0.6269 0.8478 l
0.6284 0.8474 l
0.6300 0.8470 l
0.6316 0.8466 l
0.6331 0.8462 l
0.6347 0.8459 l
0.6363 0.8455 l
0.6378 0.8452 l
0.6394 0.8449 l
0.6410 0.8445 l
0.6425 0.8442 l
0.6441 0.8439 l
0.6457 0.8436 l
0.6473 0.8434 l
0.6488 0.8431 l
0.6504 0.8428 l
0.6520 0.8426 l
0.6535 0.8423 l
0.6551 0.8420 l
0.6567 0.8418 l
0.6582 0.8415 l
0.6598 0.8413 l
0.6614 0.8411 l
0.6629 0.8409 l
0.6645 0.8406 l
0.6661 0.8404 l
0.6676 0.8402 l
0.6692 0.8400 l
0.6708 0.8398 l
0.6724 0.8396 l
0.6739 0.8394 l
0.6755 0.8392 l
0.6771 0.8390 l
0.6786 0.8388 l
0.6802 0.8386 l
0.6818 0.8384 l
0.6833 0.8382 l
0.6849 0.8380 l
0.6865 0.8379 l
0.6880 0.8377 l
0.6896 0.8375 l
0.6912 0.8373 l
0.6927 0.8372 l
0.6943 0.8370 l
0.6959 0.8369 l
0.6975 0.8367 l
0.6990 0.8365 l
0.7006 0.8364 l
0.7022 0.8362 l
0.7037 0.8361 l
0.7053 0.8359 l
0.7069 0.8358 l
0.7084 0.8356 l
0.7100 0.8355 l
0.7116 0.8353 l
0.7131 0.8352 l
0.7147 0.8351 l
0.7163 0.8349 l
0.7178 0.8348 l
0.7194 0.8347 l
0.7210 0.8345 l
0.7225 0.8344 l
0.7241 0.8343 l
0.7257 0.8341 l
0.7273 0.8340 l
0.7288 0.8339 l
0.7304 0.8338 l
0.7320 0.8336 l
0.7335 0.8335 l
0.7351 0.8334 l
0.7367 0.8333 l
0.7382 0.8332 l
0.7398 0.8330 l
0.7414 0.8329 l
0.7429 0.8328 l
0.7445 0.8327 l
0.7461 0.8326 l
0.7476 0.8325 l
0.7492 0.8324 l
0.7508 0.8323 l
0.7524 0.8322 l
0.7539 0.8321 l
0.7555 0.8320 l
0.7571 0.8319 l
0.7586 0.8318 l
0.7602 0.8316 l
0.7618 0.8315 l
0.7633 0.8314 l
0.7649 0.8314 l
0.7665 0.8313 l
0.7680 0.8312 l
0.7696 0.8311 l
0.7712 0.8310 l
0.7727 0.8309 l
0.7743 0.8308 l
0.7759 0.8307 l
0.7775 0.8306 l
0.7790 0.8305 l
0.7806 0.8304 l
0.7822 0.8303 l
0.7837 0.8302 l
0.7853 0.8302 l
0.7869 0.8301 l
0.7884 0.8300 l
0.7900 0.8299 l
0.7916 0.8298 l
0.7931 0.8297 l
0.7947 0.8296 l
0.7963 0.8296 l
0.7978 0.8295 l
0.7994 0.8294 l
0.8010 0.8293 l
0.8025 0.8292 l
0.8041 0.8292 l
0.8057 0.8291 l
0.8073 0.8290 l
0.8088 0.8289 l
0.8104 0.8289 l
0.8120 0.8288 l
0.8135 0.8287 l
0.8151 0.8286 l
0.8167 0.8286 l
0.8182 0.8285 l
0.8198 0.8284 l
0.8214 0.8283 l
0.8229 0.8283 l
0.8245 0.8282 l
0.8261 0.8281 l
0.8276 0.8280 l
0.8292 0.8280 l
0.8308 0.8279 l
0.8324 0.8278 l
0.8339 0.8278 l
0.8355 0.8277 l
0.8371 0.8276 l
0.8386 0.8276 l
0.8402 0.8275 l
0.8418 0.8274 l
0.8433 0.8274 l
0.8449 0.8273 l
0.8465 0.8272 l
0.8480 0.8272 l
0.8496 0.8271 l
0.8512 0.8271 l
0.8527 0.8270 l
0.8543 0.8269 l
0.8559 0.8269 l
0.8575 0.8268 l
0.8590 0.8268 l
0.8606 0.8267 l
0.8622 0.8266 l
0.8637 0.8266 l
0.8653 0.8265 l
0.8669 0.8265 l
0.8684 0.8264 l
0.8700 0.8263 l
0.8716 0.8263 l
0.8731 0.8262 l
0.8747 0.8262 l
0.8763 0.8261 l
0.8778 0.8261 l
0.8794 0.8260 l
0.8810 0.8259 l
0.8825 0.8259 l
0.8841 0.8258 l
0.8857 0.8258 l
0.8873 0.8257 l
0.8888 0.8257 l
0.8904 0.8256 l
0.8920 0.8256 l
0.8935 0.8255 l
0.8951 0.8255 l
0.8967 0.8254 l
0.8982 0.8254 l
0.8998 0.8253 l
0.9014 0.8253 l
0.9029 0.8252 l
0.9045 0.8252 l
0.9061 0.8251 l
0.9076 0.8251 l
0.9092 0.8250 l
0.9108 0.8250 l
0.9124 0.8249 l
0.9139 0.8249 l
0.9155 0.8248 l
0.9171 0.8248 l
0.9186 0.8247 l
0.9202 0.8247 l
0.9218 0.8246 l
0.9233 0.8246 l
0.9249 0.8245 l
0.9265 0.8245 l
0.9280 0.8244 l
0.9296 0.8244 l
0.9312 0.8244 l
0.9327 0.8243 l
0.9343 0.8243 l
0.9359 0.8242 l
0.9375 0.8242 l
0.9390 0.8241 l
0.9406 0.8241 l
0.9422 0.8240 l
0.9437 0.8240 l
0.9453 0.8240 l
0.9469 0.8239 l
0.9484 0.8239 l
0.9500 0.8238 l
s
[/DeviceRGB] SCS
Color4 SC
n
0.1500 0.7159 m
0.1516 0.7161 l
0.1531 0.7163 l
0.1547 0.7164 l
0.1563 0.7166 l
0.1578 0.7168 l
0.1594 0.7169 l
0.1610 0.7171 l
0.1625 0.7172 l
0.1641 0.7174 l
0.1657 0.7175 l
0.1673 0.7177 l
0.1688 0.7178 l
0.1704 0.7180 l
0.1720 0.7181 l
0.1735 0.7182 l
0.1751 0.7184 l
0.1767 0.7185 l
0.1782 0.7186 l
0.1798 0.7188 l
0.1814 0.7189 l
0.1829 0.7190 l
0.1845 0.7192 l
0.1861 0.7193 l
0.1876 0.7194 l
0.1892 0.7195 l
0.1908 0.7197 l
0.1924 0.7198 l
0.1939 0.7199 l
0.1955 0.7200 l
0.1971 0.7201 l
0.1986 0.7203 l
0.2002 0.7204 l
0.2018 0.7205 l
0.2033 0.7206 l
0.2049 0.7207 l
0.2065 0.7208 l
0.2080 0.7209 l
0.2096 0.7210 l
0.2112 0.7211 l
0.2127 0.7213 l
0.2143 0.7214 l
0.2159 0.7215 l
0.2175 0.7216 l
0.2190 0.7217 l
0.2206 0.7218 l
0.2222 0.7219 l
0.2237 0.7220 l
0.2253 0.7221 l
0.2269 0.7222 l
0.2284 0.7223 l
0.2300 0.7223 l
0.2316 0.7224 l
0.2331 0.7225 l
0.2347 0.7226 l
0.2363 0.7227 l
0.2378 0.7228 l
0.2394 0.7229 l
0.2410 0.7230 l
0.2425 0.7231 l
0.2441 0.7232 l
0.2457 0.7233 l
0.2473 0.7233 l
0.2488 0.7234 l
0.2504 0.7235 l
0.2520 0.7236 l
0.2535 0.7237 l
0.2551 0.7238 l
0.2567 0.7238 l
0.2582 0.7239 l
0.2598 0.7240 l
0.2614 0.7241 l
0.2629 0.7242 l
0.2645 0.7242 l
0.2661 0.7243 l
0.2676 0.7244 l
0.2692 0.7245 l
0.2708 0.7246 l
0.2724 0.7246 l
0.2739 0.7247 l
0.2755 0.7248 l
0.2771 0.7249 l
0.2786 0.7249 l
0.2802 0.7250 l
0.2818 0.7251 l
0.2833 0.7252 l
0.2849 0.7252 l
0.2865 0.7253 l
0.2880 0.7254 l
0.2896 0.7255 l
0.2912 0.7255 l
0.2927 0.7256 l
0.2943 0.7257 l
0.2959 0.7258 l
0.2975 0.7258 l
0.2990 0.7259 l
0.3006 0.7260 l
0.3022 0.7261 l
0.3037 0.7261 l
0.3053 0.7261 l
0.3069 0.7261 l
0.3084 0.7261 l
0.3100 0.7262 l
0.3116 0.7262 l
0.3131 0.7263 l
0.3147 0.7263 l
0.3163 0.7264 l
0.3178 0.7264 l
0.3194 0.7265 l
0.3210 0.7265 l
0.3225 0.7266 l
0.3241 0.7266 l
0.3257 0.7267 l
0.3273 0.7267 l
0.3288 0.7268 l
0.3304 0.7268 l
0.3320 0.7269 l
0.3335 0.7269 l
0.3351 0.7270 l
0.3367 0.7270 l
0.3382 0.7271 l
0.3398 0.7271 l
0.3414 0.7272 l
0.3429 0.7272 l
0.3445 0.7273 l
0.3461 0.7273 l
0.3476 0.7274 l
0.3492 0.7274 l
0.3508 0.7275 l
0.3524 0.7275 l
0.3539 0.7276 l
0.3555 0.7276 l
0.3571 0.7277 l
0.3586 0.7277 l
0.3602 0.7278 l
0.3618 0.7278 l
0.3633 0.7279 l
0.3649 0.7279 l
0.3665 0.7279 l
0.3680 0.7280 l
0.3696 0.7280 l
0.3712 0.7281 l
0.3727 0.7281 l
0.3743 0.7282 l
0.3759 0.7282 l
0.3775 0.7282 l
0.3790 0.7283 l
0.3806 0.7283 l
0.3822 0.7284 l
0.3837 0.7284 l
0.3853 0.7284 l
0.3869 0.7285 l
0.3884 0.7285 l
0.3900 0.7286 l
0.3916 0.7286 l
0.3931 0.7287 l
0.3947 0.7287 l
0.3963 0.7287 l
0.3978 0.7288 l
0.3994 0.7288 l
0.4010 0.7289 l
0.4025 0.7289 l
0.4041 0.7289 l
0.4057 0.7290 l
0.4073 0.7290 l
0.4088 0.7291 l
0.4104 0.7291 l
0.4120 0.7291 l
0.4135 0.7292 l
0.4151 0.7292 l
0.4167 0.7293 l
0.4182 0.7293 l
0.4198 0.7293 l
0.4214 0.7294 l
0.4229 0.7294 l
0.4245 0.7295 l
0.4261 0.7295 l
0.4276 0.7295 l
0.4292 0.7296 l
0.4308 0.7296 l
0.4324 0.7297 l
0.4339 0.7297 l
0.4355 0.7297 l
0.4371 0.7298 l
0.4386 0.7298 l
0.4402 0.7299 l
0.4418 0.7299 l
0.4433 0.7299 l
0.4449 0.7300 l
0.4465 0.7300 l
0.4480 0.7301 l
0.4496 0.7301 l
0.4512 0.7301 l
0.4527 0.7302 l
0.4543 0.7302 l
0.4559 0.7302 l
0.4575 0.7298 l
0.4590 0.7296 l
0.4606 0.7294 l
0.4622 0.7293 l
0.4637 0.7292 l
0.4653 0.7291 l
0.4669 0.7291 l
0.4684 0.7290 l
0.4700 0.7289 l
0.4716 0.7289 l
0.4731 0.7288 l
0.4747 0.7288 l
0.4763 0.7288 l
0.4778 0.7287 l
0.4794 0.7287 l
0.4810 0.7286 l
0.4825 0.7286 l
0.4841 0.7286 l
0.4857 0.7286 l
0.4873 0.7285 l
0.4888 0.7285 l
0.4904 0.7285 l
0.4920 0.7285 l
0.4935 0.7285 l
0.4951 0.7284 l
0.4967 0.7284 l
0.4982 0.7284 l
0.4998 0.7284 l
0.5014 0.7284 l
0.5029 0.7284 l
0.5045 0.7284 l
0.5061 0.7284 l
0.5076 0.7283 l
0.5092 0.7283 l
0.5108 0.7283 l
0.5124 0.7283 l
0.5139 0.7283 l
0.5155 0.7283 l
0.5171 0.7283 l
0.5186 0.7283 l
0.5202 0.7283 l
0.5218 0.7282 l
0.5233 0.7282 l
0.5249 0.7282 l
0.5265 0.7282 l
0.5280 0.7282 l
0.5296 0.7282 l
0.5312 0.7282 l
0.5327 0.7282 l
0.5343 0.7281 l
0.5359 0.7281 l
0.5375 0.7281 l
0.5390 0.7281 l
0.5406 0.7280 l
0.5422 0.7280 l
0.5437 0.7279 l
0.5453 0.7278 l
0.5469 0.7276 l
0.5484 0.7272 l
0.5502 0.7220 l
0.5516 0.7198 l
0.5531 0.7174 l
0.5547 0.7149 l
0.5563 0.7128 l
0.5578 0.7121 l
0.5594 0.7115 l
0.5610 0.7110 l
0.5625 0.7105 l
0.5641 0.7100 l
0.5657 0.7096 l
0.5673 0.7092 l
0.5688 0.7088 l
0.5704 0.7085 l
0.5720 0.7082 l
0.5735 0.7078 l
0.5751 0.7075 l
0.5767 0.7073 l
0.5782 0.7070 l
0.5798 0.7067 l
0.5814 0.7065 l
0.5829 0.7062 l
0.5845 0.7060 l
0.5861 0.7058 l
0.5876 0.7055 l
0.5892 0.7053 l
0.5908 0.7051 l
0.5924 0.7049 l
0.5939 0.7047 l
0.5955 0.7046 l
0.5971 0.7044 l
0.5986 0.7042 l
0.6002 0.7040 l
0.6018 0.7039 l
0.6033 0.7037 l
0.6049 0.7036 l
0.6065 0.7034 l
0.6080 0.7033 l
0.6096 0.7018 l
0.6112 0.7004 l
0.6127 0.6994 l
0.6143 0.6987 l
0.6159 0.6980 l
0.6175 0.6974 l
0.6190 0.6968 l
0.6206 0.6963 l
0.6222 0.6959 l
0.6237 0.6954 l
0.6253 0.6950 l
0.6269 0.6946 l
0.6284 0.6942 l
0.6300 0.6938 l
0.6316 0.6935 l
0.6331 0.6932 l
0.6347 0.6928 l
0.6363 0.6925 l
0.6378 0.6922 l
0.6394 0.6919 l
0.6410 0.6916 l
0.6425 0.6914 l
0.6441 0.6911 l
0.6457 0.6908 l
0.6473 0.6906 l
0.6488 0.6903 l
0.6504 0.6901 l
0.6520 0.6899 l
0.6535 0.6896 l
0.6551 0.6894 l
0.6567 0.6892 l
0.6582 0.6890 l
0.6598 0.6888 l
0.6614 0.6886 l
0.6629 0.6884 l
0.6645 0.6882 l
0.6661 0.6880 l
0.6676 0.6878 l
0.6692 0.6876 l
0.6708 0.6874 l
0.6724 0.6873 l
0.6739 0.6871 l
0.6755 0.6869 l
0.6771 0.6868 l
0.6786 0.6866 l
0.6802 0.6864 l
0.6818 0.6863 l
0.6833 0.6861 l
0.6849 0.6860 l
0.6865 0.6858 l
0.6880 0.6857 l
0.6896 0.6855 l
0.6912 0.6854 l
0.6927 0.6853 l
0.6943 0.6851 l
0.6959 0.6850 l
0.6975 0.6849 l
0.6990 0.6847 l
0.7006 0.6846 l
0.7022 0.6845 l
0.7037 0.6844 l
0.7053 0.6842 l
0.7069 0.6841 l
0.7084 0.6840 l
0.7100 0.6839 l
0.7116 0.6838 l
0.7131 0.6836 l
0.7147 0.6835 l
0.7163 0.6834 l
0.7178 0.6833 l
0.7194 0.6832 l
0.7210 0.6831 l
0.7225 0.6830 l
0.7241 0.6829 l
0.7257 0.6828 l
0.7273 0.6827 l
0.7288 0.6826 l
0.7304 0.6825 l
0.7320 0.6824 l
0.7335 0.6823 l
0.7351 0.6822 l
0.7367 0.6821 l
0.7382 0.6820 l
0.7398 0.6819 l
0.7414 0.6819 l
0.7429 0.6818 l
0.7445 0.6817 l
0.7461 0.6816 l
0.7476 0.6815 l
0.7492 0.6814 l
0.7508 0.6814 l
0.7524 0.6813 l
0.7539 0.6812 l
0.7555 0.6811 l
0.7571 0.6810 l
0.7586 0.6810 l
0.7602 0.6809 l
0.7618 0.6808 l
0.7633 0.6807 l
0.7649 0.6807 l
0.7665 0.6806 l
0.7680 0.6805 l
0.7696 0.6804 l
0.7712 0.6804 l
0.7727 0.6803 l
0.7743 0.6802 l
0.7759 0.6802 l
0.7775 0.6801 l
0.7790 0.6800 l
0.7806 0.6800 l
0.7822 0.6799 l
0.7837 0.6798 l
0.7853 0.6798 l
0.7869 0.6797 l
0.7884 0.6797 l
0.7900 0.6796 l
0.7916 0.6795 l
0.7931 0.6795 l
0.7947 0.6794 l
0.7963 0.6794 l
0.7978 0.6793 l
0.7994 0.6792 l
0.8010 0.6792 l
0.8025 0.6791 l
0.8041 0.6791 l
0.8057 0.6790 l
0.8073 0.6790 l
0.8088 0.6789 l
0.8104 0.6789 l
0.8120 0.6788 l
0.8135 0.6788 l
0.8151 0.6787 l
0.8167 0.6787 l
0.8182 0.6786 l
0.8198 0.6786 l
0.8214 0.6785 l
0.8229 0.6785 l
0.8245 0.6784 l
0.8261 0.6784 l
0.8276 0.6783 l
0.8292 0.6783 l
0.8308 0.6782 l
0.8324 0.6782 l
0.8339 0.6781 l
0.8355 0.6781 l
0.8371 0.6781 l
0.8386 0.6780 l
0.8402 0.6780 l
0.8418 0.6779 l
0.8433 0.6779 l
0.8449 0.6778 l
0.8465 0.6778 l
0.8480 0.6778 l
0.8496 0.6777 l
0.8512 0.6777 l
0.8527 0.6776 l
0.8543 0.6776 l
0.8559 0.6776 l
0.8575 0.6775 l
0.8590 0.6775 l
0.8606 0.6774 l
0.8622 0.6774 l
0.8637 0.6774 l
0.8653 0.6773 l
0.8669 0.6773 l
0.8684 0.6773 l
0.8700 0.6772 l
0.8716 0.6772 l
0.8731 0.6771 l
0.8747 0.6771 l
0.8763 0.6771 l
0.8778 0.6770 l
0.8794 0.6770 l
0.8810 0.6770 l
0.8825 0.6769 l
0.8841 0.6769 l
0.8857 0.6769 l
0.8873 0.6768 l
0.8888 0.6768 l
0.8904 0.6768 l
0.8920 0.6768 l
0.8935 0.6767 l
0.8951 0.6767 l
0.8967 0.6767 l
0.8982 0.6766 l
0.8998 0.6766 l
0.9014 0.6766 l
0.9029 0.6765 l
0.9045 0.6765 l
0.9061 0.6765 l
0.9076 0.6765 l
0.9092 0.6764 l
0.9108 0.6764 l
0.9124 0.6764 l
0.9139 0.6763 l
0.9155 0.6763 l
0.9171 0.6763 l
0.9186 0.6763 l
0.9202 0.6762 l
0.9218 0.6762 l
0.9233 0.6762 l
0.9249 0.6762 l
0.9265 0.6761 l
0.9280 0.6761 l
0.9296 0.6761 l
0.9312 0.6761 l
0.9327 0.6760 l
0.9343 0.6760 l
0.9359 0.6760 l
0.9375 0.6760 l
0.9390 0.6759 l
0.9406 0.6759 l
0.9422 0.6759 l
0.9437 0.6759 l
0.9453 0.6758 l
0.9469 0.6758 l
0.9484 0.6758 l
0.9500 0.6758 l
s
[/DeviceRGB] SCS
Color5 SC
n
0.1500 0.2547 m
0.1516 0.2548 l
0.1531 0.2550 l
0.1547 0.2552 l
0.1563 0.2553 l
0.1578 0.2555 l
0.1594 0.2556 l
0.1610 0.2558 l
0.1625 0.2560 l
0.1641 0.2561 l
0.1657 0.2562 l
0.1673 0.2564 l
0.1688 0.2565 l
0.1704 0.2567 l
0.1720 0.2568 l
0.1735 0.2570 l
0.1751 0.2571 l
0.1767 0.2572 l
0.1782 0.2574 l
0.1798 0.2575 l
0.1814 0.2576 l
0.1829 0.2578 l
0.1845 0.2579 l
0.1861 0.2580 l
0.1876 0.2581 l
0.1892 0.2583 l
0.1908 0.2584 l
0.1924 0.2585 l
0.1939 0.2586 l
0.1955 0.2587 l
0.1971 0.2589 l
0.1986 0.2590 l
0.2002 0.2591 l
0.2018 0.2592 l
0.2033 0.2593 l
0.2049 0.2594 l
0.2065 0.2595 l
0.2080 0.2596 l
0.2096 0.2597 l
0.2112 0.2598 l
0.2127 0.2600 l
0.2143 0.2601 l
0.2159 0.2602 l
0.2175 0.2603 l
0.2190 0.2604 l
0.2206 0.2605 l
0.2222 0.2606 l
0.2237 0.2607 l
0.2253 0.2608 l
0.2269 0.2609 l
0.2284 0.2609 l
0.2300 0.2610 l
0.2316 0.2611 l
0.2331 0.2612 l
0.2347 0.2613 l
0.2363 0.2614 l
0.2378 0.2615 l
0.2394 0.2616 l
0.2410 0.2617 l
0.2425 0.2618 l
0.2441 0.2619 l
0.2457 0.2619 l
0.2473 0.2620 l
0.2488 0.2621 l
0.2504 0.2622 l
0.2520 0.2623 l
0.2535 0.2624 l
0.2551 0.2625 l
0.2567 0.2625 l
0.2582 0.2626 l
0.2598 0.2627 l
0.2614 0.2628 l
0.2629 0.2629 l
0.2645 0.2629 l
0.2661 0.2630 l
0.2676 0.2631 l
0.2692 0.2632 l
0.2708 0.2632 l
0.2724 0.2633 l
0.2739 0.2634 l
0.2755 0.2635 l
0.2771 0.2635 l
0.2786 0.2636 l
0.2802 0.2637 l
0.2818 0.2638 l
0.2833 0.2638 l
0.2849 0.2639 l
0.2865 0.2640 l
0.2880 0.2641 l
0.2896 0.2642 l
0.2912 0.2642 l
0.2927 0.2643 l
0.2943 0.2644 l
0.2959 0.2645 l
0.2975 0.2645 l
0.2990 0.2646 l
0.3006 0.2647 l
0.3022 0.2647 l
0.3037 0.2648 l
0.3053 0.2648 l
0.3069 0.2648 l
0.3084 0.2648 l
0.3100 0.2649 l
0.3116 0.2649 l
0.3131 0.2650 l
0.3147 0.2650 l
0.3163 0.2650 l
0.3178 0.2651 l
0.3194 0.2651 l
0.3210 0.2652 l
0.3225 0.2652 l
0.3241 0.2653 l
0.3257 0.2653 l
0.3273 0.2654 l
0.3288 0.2655 l
0.3304 0.2655 l
0.3320 0.2656 l
0.3335 0.2656 l
0.3351 0.2657 l
0.3367 0.2657 l
0.3382 0.2658 l
0.3398 0.2658 l
0.3414 0.2659 l
0.3429 0.2659 l
0.3445 0.2660 l
0.3461 0.2660 l
0.3476 0.2661 l
0.3492 0.2661 l
0.3508 0.2662 l
0.3524 0.2662 l
0.3539 0.2663 l
0.3555 0.2663 l
0.3571 0.2664 l
0.3586 0.2664 l
0.3602 0.2664 l
0.3618 0.2665 l
0.3633 0.2665 l
0.3649 0.2666 l
0.3665 0.2666 l
0.3680 0.2667 l
0.3696 0.2667 l
0.3712 0.2667 l
0.3727 0.2668 l
0.3743 0.2668 l
0.3759 0.2669 l
0.3775 0.2669 l
0.3790 0.2670 l
0.3806 0.2670 l
0.3822 0.2670 l
0.3837 0.2671 l
0.3853 0.2671 l
0.3869 0.2672 l
0.3884 0.2672 l
0.3900 0.2672 l
0.3916 0.2673 l
0.3931 0.2673 l
0.3947 0.2674 l
0.3963 0.2674 l
0.3978 0.2675 l
0.3994 0.2675 l
0.4010 0.2675 l
0.4025 0.2676 l
0.4041 0.2676 l
0.4057 0.2677 l
0.4073 0.2677 l
0.4088 0.2677 l
0.4104 0.2678 l
0.4120 0.2678 l
0.4135 0.2679 l
0.4151 0.2679 l
0.4167 0.2679 l
0.4182 0.2680 l
0.4198 0.2680 l
0.4214 0.2681 l
0.4229 0.2681 l
0.4245 0.2681 l
0.4261 0.2682 l
0.4276 0.2682 l
0.4292 0.2683 l
0.4308 0.2683 l
0.4324 0.2683 l
0.4339 0.2684 l
0.4355 0.2684 l
0.4371 0.2685 l
0.4386 0.2685 l
0.4402 0.2685 l
0.4418 0.2686 l
0.4433 0.2686 l
0.4449 0.2686 l
0.4465 0.2687 l
0.4480 0.2687 l
0.4496 0.2688 l
0.4512 0.2688 l
0.4527 0.2688 l
0.4543 0.2689 l
0.4559 0.2689 l
0.4575 0.2685 l
0.4590 0.2683 l
0.4606 0.2681 l
0.4622 0.2680 l
0.4637 0.2679 l
0.4653 0.2678 l
0.4669 0.2677 l
0.4684 0.2677 l
0.4700 0.2676 l
0.4716 0.2676 l
0.4731 0.2675 l
0.4747 0.2675 l
0.4763 0.2674 l
0.4778 0.2674 l
0.4794 0.2674 l
0.4810 0.2673 l
0.4825 0.2673 l
0.4841 0.2673 l
0.4857 0.2672 l
0.4873 0.2672 l
0.4888 0.2672 l
0.4904 0.2672 l
0.4920 0.2672 l
0.4935 0.2671 l
0.4951 0.2671 l
0.4967 0.2671 l
0.4982 0.2671 l
0.4998 0.2671 l
0.5014 0.2671 l
0.5029 0.2670 l
0.5045 0.2670 l
0.5061 0.2670 l
0.5076 0.2670 l
0.5092 0.2670 l
0.5108 0.2670 l
0.5124 0.2670 l
0.5139 0.2670 l
0.5155 0.2670 l
0.5171 0.2669 l
0.5186 0.2669 l
0.5202 0.2669 l
0.5218 0.2669 l
0.5233 0.2669 l
0.5249 0.2669 l
0.5265 0.2669 l
0.5280 0.2669 l
0.5296 0.2669 l
0.5312 0.2668 l
0.5327 0.2668 l
0.5343 0.2668 l
0.5359 0.2668 l
0.5375 0.2668 l
0.5390 0.2667 l
0.5406 0.2667 l
0.5422 0.2667 l
0.5437 0.2666 l
0.5453 0.2665 l
0.5469 0.2663 l
0.5484 0.2658 l
0.5502 0.2606 l
0.5516 0.2585 l
0.5531 0.2561 l
0.5547 0.2535 l
0.5563 0.2515 l
0.5578 0.2508 l
0.5594 0.2502 l
0.5610 0.2497 l
0.5625 0.2492 l
0.5641 0.2487 l
0.5657 0.2483 l
0.5673 0.2479 l
0.5688 0.2475 l
0.5704 0.2472 l
0.5720 0.2468 l
0.5735 0.2465 l
0.5751 0.2462 l
0.5767 0.2459 l
0.5782 0.2456 l
0.5798 0.2454 l
0.5814 0.2451 l
0.5829 0.2449 l
0.5845 0.2447 l
0.5861 0.2444 l
0.5876 0.2442 l
0.5892 0.2440 l
0.5908 0.2438 l
0.5924 0.2436 l
0.5939 0.2434 l
0.5955 0.2432 l
0.5971 0.2431 l
0.5986 0.2429 l
0.6002 0.2427 l
0.6018 0.2425 l
0.6033 0.2424 l
0.6049 0.2422 l
0.6065 0.2421 l
0.6080 0.2419 l
0.6096 0.2405 l
0.6112 0.2390 l
0.6127 0.2381 l
0.6143 0.2373 l
0.6159 0.2367 l
0.6175 0.2361 l
0.6190 0.2355 l
0.6206 0.2350 l
0.6222 0.2345 l
0.6237 0.2341 l
0.6253 0.2337 l
0.6269 0.2333 l
0.6284 0.2329 l
0.6300 0.2325 l
0.6316 0.2322 l
0.6331 0.2318 l
0.6347 0.2315 l
0.6363 0.2312 l
0.6378 0.2309 l
0.6394 0.2306 l
0.6410 0.2303 l
0.6425 0.2300 l
0.6441 0.2298 l
0.6457 0.2295 l
0.6473 0.2293 l
0.6488 0.2290 l
0.6504 0.2288 l
0.6520 0.2285 l
0.6535 0.2283 l
0.6551 0.2281 l
0.6567 0.2279 l
0.6582 0.2277 l
0.6598 0.2275 l
0.6614 0.2273 l
0.6629 0.2271 l
0.6645 0.2269 l
0.6661 0.2267 l
0.6676 0.2265 l
0.6692 0.2263 l
0.6708 0.2261 l
0.6724 0.2259 l
0.6739 0.2258 l
0.6755 0.2256 l
0.6771 0.2254 l
0.6786 0.2253 l
0.6802 0.2251 l
0.6818 0.2250 l
0.6833 0.2248 l
0.6849 0.2247 l
0.6865 0.2245 l
0.6880 0.2244 l
0.6896 0.2242 l
0.6912 0.2241 l
0.6927 0.2239 l
0.6943 0.2238 l
0.6959 0.2237 l
0.6975 0.2235 l
0.6990 0.2234 l
0.7006 0.2233 l
0.7022 0.2231 l
0.7037 0.2230 l
0.7053 0.2229 l
0.7069 0.2228 l
0.7084 0.2227 l
0.7100 0.2225 l
0.7116 0.2224 l
0.7131 0.2223 l
0.7147 0.2222 l
0.7163 0.2221 l
0.7178 0.2220 l
0.7194 0.2219 l
0.7210 0.2218 l
0.7225 0.2217 l
0.7241 0.2216 l
0.7257 0.2215 l
0.7273 0.2214 l
0.7288 0.2213 l
0.7304 0.2212 l
0.7320 0.2211 l
0.7335 0.2210 l
0.7351 0.2209 l
0.7367 0.2208 l
0.7382 0.2207 l
0.7398 0.2206 l
0.7414 0.2205 l
0.7429 0.2204 l
0.7445 0.2204 l
0.7461 0.2203 l
0.7476 0.2202 l
0.7492 0.2201 l
0.7508 0.2200 l
0.7524 0.2199 l
0.7539 0.2199 l
0.7555 0.2198 l
0.7571 0.2197 l
0.7586 0.2196 l
0.7602 0.2196 l
0.7618 0.2195 l
0.7633 0.2194 l
0.7649 0.2193 l
0.7665 0.2193 l
0.7680 0.2192 l
0.7696 0.2191 l
0.7712 0.2191 l
0.7727 0.2190 l
0.7743 0.2189 l
0.7759 0.2188 l
0.7775 0.2188 l
0.7790 0.2187 l
0.7806 0.2186 l
0.7822 0.2186 l
0.7837 0.2185 l
0.7853 0.2185 l
0.7869 0.2184 l
0.7884 0.2183 l
0.7900 0.2183 l
0.7916 0.2182 l
0.7931 0.2182 l
0.7947 0.2181 l
0.7963 0.2180 l
0.7978 0.2180 l
0.7994 0.2179 l
0.8010 0.2179 l
0.8025 0.2178 l
0.8041 0.2178 l
0.8057 0.2177 l
0.8073 0.2176 l
0.8088 0.2176 l
0.8104 0.2175 l
0.8120 0.2175 l
0.8135 0.2174 l
0.8151 0.2174 l
0.8167 0.2173 l
0.8182 0.2173 l
0.8198 0.2172 l
0.8214 0.2172 l
0.8229 0.2171 l
0.8245 0.2171 l
0.8261 0.2170 l
0.8276 0.2170 l
0.8292 0.2170 l
0.8308 0.2169 l
0.8324 0.2169 l
0.8339 0.2168 l
0.8355 0.2168 l
0.8371 0.2167 l
0.8386 0.2167 l
0.8402 0.2166 l
0.8418 0.2166 l
0.8433 0.2166 l
0.8449 0.2165 l
0.8465 0.2165 l
0.8480 0.2164 l
0.8496 0.2164 l
0.8512 0.2163 l
0.8527 0.2163 l
0.8543 0.2163 l
0.8559 0.2162 l
0.8575 0.2162 l
0.8590 0.2162 l
0.8606 0.2161 l
0.8622 0.2161 l
0.8637 0.2160 l
0.8653 0.2160 l
0.8669 0.2160 l
0.8684 0.2159 l
0.8700 0.2159 l
0.8716 0.2159 l
0.8731 0.2158 l
0.8747 0.2158 l
0.8763 0.2158 l
0.8778 0.2157 l
0.8794 0.2157 l
0.8810 0.2157 l
0.8825 0.2156 l
0.8841 0.2156 l
0.8857 0.2156 l
0.8873 0.2155 l
0.8888 0.2155 l
0.8904 0.2155 l
0.8920 0.2154 l
0.8935 0.2154 l
0.8951 0.2154 l
0.8967 0.2153 l
0.8982 0.2153 l
0.8998 0.2153 l
0.9014 0.2152 l
0.9029 0.2152 l
0.9045 0.2152 l
0.9061 0.2152 l
0.9076 0.2151 l
0.9092 0.2151 l
0.9108 0.2151 l
0.9124 0.2150 l
0.9139 0.2150 l
0.9155 0.2150 l
0.9171 0.2150 l
0.9186 0.2149 l
0.9202 0.2149 l
0.9218 0.2149 l
0.9233 0.2149 l
0.9249 0.2148 l
0.9265 0.2148 l
0.9280 0.2148 l
0.9296 0.2148 l
0.9312 0.2147 l
0.9327 0.2147 l
0.9343 0.2147 l
0.9359 0.2147 l
0.9375 0.2146 l
0.9390 0.2146 l
0.9406 0.2146 l
0.9422 0.2146 l
0.9437 0.2145 l
0.9453 0.2145 l
0.9469 0.2145 l
0.9484 0.2145 l
0.9500 0.2145 l
s
[/DeviceRGB] SCS
Color1 SC
[] 0 SD
0.0015 SLW
n
0.1971 0.1500 m
0.1971 0.1600 l
s
n
0.1971 0.9000 m
0.1971 0.8900 l
s
n
0.2284 0.1500 m
0.2284 0.1600 l
s
n
0.2284 0.9000 m
0.2284 0.8900 l
s
n
0.2598 0.1500 m
0.2598 0.1600 l
s
n
0.2598 0.9000 m
0.2598 0.8900 l
s
n
0.2912 0.1500 m
0.2912 0.1600 l
s
n
0.2912 0.9000 m
0.2912 0.8900 l
s
n
0.3539 0.1500 m
0.3539 0.1600 l
s
n
0.3539 0.9000 m
0.3539 0.8900 l
s
n
0.3853 0.1500 m
0.3853 0.1600 l
s
n
0.3853 0.9000 m
0.3853 0.8900 l
s
n
0.4167 0.1500 m
0.4167 0.1600 l
s
n
0.4167 0.9000 m
0.4167 0.8900 l
s
n
0.4480 0.1500 m
0.4480 0.1600 l
s
n
0.4480 0.9000 m
0.4480 0.8900 l
s
n
0.5108 0.1500 m
0.5108 0.1600 l
s
n
0.5108 0.9000 m
0.5108 0.8900 l
s
n
0.5422 0.1500 m
0.5422 0.1600 l
s
n
0.5422 0.9000 m
0.5422 0.8900 l
s
n
0.5735 0.1500 m
0.5735 0.1600 l
s
n
0.5735 0.9000 m
0.5735 0.8900 l
s
n
0.6049 0.1500 m
0.6049 0.1600 l
s
n
0.6049 0.9000 m
0.6049 0.8900 l
s
n
0.6676 0.1500 m
0.6676 0.1600 l
s
n
0.6676 0.9000 m
0.6676 0.8900 l
s
n
0.6990 0.1500 m
0.6990 0.1600 l
s
n
0.6990 0.9000 m
0.6990 0.8900 l
s
n
0.7304 0.1500 m
0.7304 0.1600 l
s
n
0.7304 0.9000 m
0.7304 0.8900 l
s
n
0.7618 0.1500 m
0.7618 0.1600 l
s
n
0.7618 0.9000 m
0.7618 0.8900 l
s
n
0.8245 0.1500 m
0.8245 0.1600 l
s
n
0.8245 0.9000 m
0.8245 0.8900 l
s
n
0.8559 0.1500 m
0.8559 0.1600 l
s
n
0.8559 0.9000 m
0.8559 0.8900 l
s
n
0.8873 0.1500 m
0.8873 0.1600 l
s
n
0.8873 0.9000 m
0.8873 0.8900 l
s
n
0.9186 0.1500 m
0.9186 0.1600 l
s
n
0.9186 0.9000 m
0.9186 0.8900 l
s
n
0.1657 0.1500 m
0.1657 0.1700 l
s
n
0.1657 0.9000 m
0.1657 0.8800 l
s
n
0.3225 0.1500 m
0.3225 0.1700 l
s
n
0.3225 0.9000 m
0.3225 0.8800 l
s
n
0.4794 0.1500 m
0.4794 0.1700 l
s
n
0.4794 0.9000 m
0.4794 0.8800 l
s
n
0.6363 0.1500 m
0.6363 0.1700 l
s
n
0.6363 0.9000 m
0.6363 0.8800 l
s
n
0.7931 0.1500 m
0.7931 0.1700 l
s
n
0.7931 0.9000 m
0.7931 0.8800 l
s
n
0.9500 0.1500 m
0.9500 0.1700 l
s
n
0.9500 0.9000 m
0.9500 0.8800 l
s
/Helvetica findfont
dup length dict begin
 {1 index /FID ne {def} {pop pop} ifelse} forall
 /Encoding DefEncoding def
 currentdict
end
/Font4 exch definefont pop
/Font4 FFSF
0.1431 0.1200 m
GS
[0.0280 0.0000 0.0000 0.0280 0 0] CC
(100) show
GR
/Font4 FFSF
0.3000 0.1200 m
GS
[0.0280 0.0000 0.0000 0.0280 0 0] CC
(200) show
GR
/Font4 FFSF
0.4569 0.1200 m
GS
[0.0280 0.0000 0.0000 0.0280 0 0] CC
(300) show
GR
/Font4 FFSF
0.6137 0.1200 m
GS
[0.0280 0.0000 0.0000 0.0280 0 0] CC
(400) show
GR
/Font4 FFSF
0.7706 0.1200 m
GS
[0.0280 0.0000 0.0000 0.0280 0 0] CC
(500) show
GR
/Font4 FFSF
0.9275 0.1200 m
GS
[0.0280 0.0000 0.0000 0.0280 0 0] CC
(600) show
GR
/Font4 FFSF
0.4818 0.0845 m
GS
[0.0336 0.0000 0.0000 0.0336 0 0] CC
(M) show
GR
/Font4 FFSF
0.5096 0.0711 m
GS
[0.0238 0.0000 0.0000 0.0238 0 0] CC
(A) show
GR
/Font4 FFSF
0.5253 0.0845 m
GS
[0.0336 0.0000 0.0000 0.0336 0 0] CC
( [GeV]) show
GR
n
0.1500 0.2064 m
0.1600 0.2064 l
s
n
0.9500 0.2064 m
0.9400 0.2064 l
s
n
0.1500 0.2395 m
0.1600 0.2395 l
s
n
0.9500 0.2395 m
0.9400 0.2395 l
s
n
0.1500 0.2629 m
0.1600 0.2629 l
s
n
0.9500 0.2629 m
0.9400 0.2629 l
s
n
0.1500 0.2811 m
0.1600 0.2811 l
s
n
0.9500 0.2811 m
0.9400 0.2811 l
s
n
0.1500 0.2959 m
0.1600 0.2959 l
s
n
0.9500 0.2959 m
0.9400 0.2959 l
s
n
0.1500 0.3085 m
0.1600 0.3085 l
s
n
0.9500 0.3085 m
0.9400 0.3085 l
s
n
0.1500 0.3193 m
0.1600 0.3193 l
s
n
0.9500 0.3193 m
0.9400 0.3193 l
s
n
0.1500 0.3289 m
0.1600 0.3289 l
s
n
0.9500 0.3289 m
0.9400 0.3289 l
s
n
0.1500 0.3375 m
0.1600 0.3375 l
s
n
0.9500 0.3375 m
0.9400 0.3375 l
s
n
0.1500 0.3939 m
0.1600 0.3939 l
s
n
0.9500 0.3939 m
0.9400 0.3939 l
s
n
0.1500 0.4270 m
0.1600 0.4270 l
s
n
0.9500 0.4270 m
0.9400 0.4270 l
s
n
0.1500 0.4504 m
0.1600 0.4504 l
s
n
0.9500 0.4504 m
0.9400 0.4504 l
s
n
0.1500 0.4686 m
0.1600 0.4686 l
s
n
0.9500 0.4686 m
0.9400 0.4686 l
s
n
0.1500 0.4834 m
0.1600 0.4834 l
s
n
0.9500 0.4834 m
0.9400 0.4834 l
s
n
0.1500 0.4960 m
0.1600 0.4960 l
s
n
0.9500 0.4960 m
0.9400 0.4960 l
s
n
0.1500 0.5068 m
0.1600 0.5068 l
s
n
0.9500 0.5068 m
0.9400 0.5068 l
s
n
0.1500 0.5164 m
0.1600 0.5164 l
s
n
0.9500 0.5164 m
0.9400 0.5164 l
s
n
0.1500 0.5250 m
0.1600 0.5250 l
s
n
0.9500 0.5250 m
0.9400 0.5250 l
s
n
0.1500 0.5814 m
0.1600 0.5814 l
s
n
0.9500 0.5814 m
0.9400 0.5814 l
s
n
0.1500 0.6145 m
0.1600 0.6145 l
s
n
0.9500 0.6145 m
0.9400 0.6145 l
s
n
0.1500 0.6379 m
0.1600 0.6379 l
s
n
0.9500 0.6379 m
0.9400 0.6379 l
s
n
0.1500 0.6561 m
0.1600 0.6561 l
s
n
0.9500 0.6561 m
0.9400 0.6561 l
s
n
0.1500 0.6709 m
0.1600 0.6709 l
s
n
0.9500 0.6709 m
0.9400 0.6709 l
s
n
0.1500 0.6835 m
0.1600 0.6835 l
s
n
0.9500 0.6835 m
0.9400 0.6835 l
s
n
0.1500 0.6943 m
0.1600 0.6943 l
s
n
0.9500 0.6943 m
0.9400 0.6943 l
s
n
0.1500 0.7039 m
0.1600 0.7039 l
s
n
0.9500 0.7039 m
0.9400 0.7039 l
s
n
0.1500 0.7125 m
0.1600 0.7125 l
s
n
0.9500 0.7125 m
0.9400 0.7125 l
s
n
0.1500 0.7689 m
0.1600 0.7689 l
s
n
0.9500 0.7689 m
0.9400 0.7689 l
s
n
0.1500 0.8020 m
0.1600 0.8020 l
s
n
0.9500 0.8020 m
0.9400 0.8020 l
s
n
0.1500 0.8254 m
0.1600 0.8254 l
s
n
0.9500 0.8254 m
0.9400 0.8254 l
s
n
0.1500 0.8436 m
0.1600 0.8436 l
s
n
0.9500 0.8436 m
0.9400 0.8436 l
s
n
0.1500 0.8584 m
0.1600 0.8584 l
s
n
0.9500 0.8584 m
0.9400 0.8584 l
s
n
0.1500 0.8710 m
0.1600 0.8710 l
s
n
0.9500 0.8710 m
0.9400 0.8710 l
s
n
0.1500 0.8818 m
0.1600 0.8818 l
s
n
0.9500 0.8818 m
0.9400 0.8818 l
s
n
0.1500 0.8914 m
0.1600 0.8914 l
s
n
0.9500 0.8914 m
0.9400 0.8914 l
s
n
0.1500 0.9000 m
0.1600 0.9000 l
s
n
0.9500 0.9000 m
0.9400 0.9000 l
s
n
0.1500 0.1500 m
0.1700 0.1500 l
s
n
0.9500 0.1500 m
0.9300 0.1500 l
s
n
0.1500 0.3375 m
0.1700 0.3375 l
s
n
0.9500 0.3375 m
0.9300 0.3375 l
s
n
0.1500 0.5250 m
0.1700 0.5250 l
s
n
0.9500 0.5250 m
0.9300 0.5250 l
s
n
0.1500 0.7125 m
0.1700 0.7125 l
s
n
0.9500 0.7125 m
0.9300 0.7125 l
s
n
0.1500 0.9000 m
0.1700 0.9000 l
s
n
0.9500 0.9000 m
0.9300 0.9000 l
s
/Font4 FFSF
0.0922 0.1349 m
GS
[0.0280 0.0000 0.0000 0.0280 0 0] CC
(10) show
GR
/Font4 FFSF
0.1231 0.1517 m
GS
[0.0198 0.0000 0.0000 0.0198 0 0] CC
(-4) show
GR
/Font4 FFSF
0.0922 0.3224 m
GS
[0.0280 0.0000 0.0000 0.0280 0 0] CC
(10) show
GR
/Font4 FFSF
0.1231 0.3392 m
GS
[0.0198 0.0000 0.0000 0.0198 0 0] CC
(-3) show
GR
/Font4 FFSF
0.0922 0.5099 m
GS
[0.0280 0.0000 0.0000 0.0280 0 0] CC
(10) show
GR
/Font4 FFSF
0.1231 0.5267 m
GS
[0.0198 0.0000 0.0000 0.0198 0 0] CC
(-2) show
GR
/Font4 FFSF
0.0957 0.6974 m
GS
[0.0280 0.0000 0.0000 0.0280 0 0] CC
(10) show
GR
/Font4 FFSF
0.1267 0.7142 m
GS
[0.0198 0.0000 0.0000 0.0198 0 0] CC
(-1) show
GR
/Font4 FFSF
0.0988 0.8849 m
GS
[0.0280 0.0000 0.0000 0.0280 0 0] CC
(10) show
GR
/Font4 FFSF
0.1298 0.9017 m
GS
[0.0198 0.0000 0.0000 0.0198 0 0] CC
(0) show
GR
/Font4 FFSF
0.0751 0.4805 m
GS
[0.0000 0.0336 -0.0336 0.0000 0 0] CC
(BR\(A\)) show
GR
n
0.1500 0.1500 m
0.1500 0.9000 l
0.9500 0.9000 l
0.9500 0.1500 l
0.1500 0.1500 l
c
s
n
0.7000 0.5500 m
0.7000 0.3449 l
0.9143 0.3449 l
0.9143 0.5500 l
c
[/DeviceRGB] SCS
Color0 SC
fill
[/DeviceRGB] SCS
Color1 SC
n
0.7000 0.5500 m
0.7000 0.3449 l
0.9143 0.3449 l
0.9143 0.5500 l
0.7000 0.5500 l
c
s
/Font4 FFSF
0.7862 0.4935 m
GS
[0.0224 0.0000 0.0000 0.0224 0 0] CC
(BR\(A -> tt\)) show
GR
[/DeviceRGB] SCS
Color2 SC
[] 0 SD
0.0045 SLW
n
0.7122 0.4994 m
0.7722 0.4994 l
s
/Font4 FFSF
[/DeviceRGB] SCS
Color1 SC
0.7862 0.4524 m
GS
[0.0224 0.0000 0.0000 0.0224 0 0] CC
(BR\(A -> bb\)) show
GR
[/DeviceRGB] SCS
Color3 SC
n
0.7122 0.4582 m
0.7722 0.4582 l
s
/Font4 FFSF
[/DeviceRGB] SCS
Color1 SC
0.7862 0.4112 m
GS
[0.0224 0.0000 0.0000 0.0224 0 0] CC
(BR\(A -> ) show
GR
/Symbol findfont
/Font12 exch definefont pop
/Font12 FFSF
0.8729 0.4112 m
GS
[0.0224 0.0000 0.0000 0.0224 0 0] CC
(tt) show
GR
/Font4 FFSF
0.8925 0.4112 m
GS
[0.0224 0.0000 0.0000 0.0224 0 0] CC
(\)) show
GR
[/DeviceRGB] SCS
Color4 SC
n
0.7122 0.4171 m
0.7722 0.4171 l
s
/Font4 FFSF
[/DeviceRGB] SCS
Color1 SC
0.7862 0.3700 m
GS
[0.0224 0.0000 0.0000 0.0224 0 0] CC
(BR\(A -> ) show
GR
/Font12 FFSF
0.8729 0.3700 m
GS
[0.0224 0.0000 0.0000 0.0224 0 0] CC
(mm) show
GR
/Font4 FFSF
0.8988 0.3700 m
GS
[0.0224 0.0000 0.0000 0.0224 0 0] CC
(\)) show
GR
[/DeviceRGB] SCS
Color5 SC
n
0.7122 0.3757 m
0.7722 0.3757 l
s
/Font4 FFSF
[/DeviceRGB] SCS
Color1 SC
0.9700 0.7000 m
GS
[0.0000 0.0168 -0.0168 0.0000 0 0] CC
(LHC Higgs XS WG 2013) show
GR
/Font12 FFSF
0.7150 0.5250 m
GS
[0.0224 0.0000 0.0000 0.0224 0 0] CC
(t) show
GR
/Font4 FFSF
0.7248 0.5250 m
GS
[0.0224 0.0000 0.0000 0.0224 0 0] CC
(-phobic, tan) show
GR
/Font12 FFSF
0.8417 0.5250 m
GS
[0.0224 0.0000 0.0000 0.0224 0 0] CC
(b) show
GR
/Font4 FFSF
0.8538 0.5250 m
GS
[0.0224 0.0000 0.0000 0.0224 0 0] CC
( = 10) show
GR
%%Trailer
%%BoundingBox: 30 42 597 562
%%DocumentNeededResources: font Helvetica
%%+ font Symbol
%%EOF
