%!PS-Adobe-2.0 EPSF-2.0
%%BoundingBox:  0 0 567 544
%%Title: HWW_400_ptll_NNLO_cut_YR3.eps: HWW 400Gev ptll NNLO with cuts
%%Creator: ROOT Version 5.34/05
%%CreationDate: Fri Jun 14 02:56:49 2013
%%EndComments
%%BeginProlog
80 dict begin
/s {stroke} def /l {lineto} def /m {moveto} def /t {translate} def
/r {rotate} def /rl {roll}  def /R {repeat} def
/d {rlineto} def /rm {rmoveto} def /gr {grestore} def /f {eofill} def
/c {setrgbcolor} def /black {0 setgray} def /sd {setdash} def
/cl {closepath} def /sf {scalefont setfont} def /lw {setlinewidth} def
/box {m dup 0 exch d exch 0 d 0 exch neg d cl} def
/NC{systemdict begin initclip end}def/C{NC box clip newpath}def
/bl {box s} def /bf {box f} def /Y { 0 exch d} def /X { 0 d} def 
/K {{pop pop 0 moveto} exch kshow} bind def
/ita {/ang 15 def gsave [1 0 ang dup sin exch cos div 1 0 0] concat} def 
/mp {newpath /y exch def /x exch def} def
/side {[w .77 mul w .23 mul] .385 w mul sd w 0 l currentpoint t -144 r} def
/mr {mp x y w2 0 360 arc} def /m24 {mr s} def /m20 {mr f} def
/mb {mp x y w2 add m w2 neg 0 d 0 w neg d w 0 d 0 w d cl} def
/mt {mp x y w2 add m w2 neg w neg d w 0 d cl} def
/m21 {mb f} def /m25 {mb s} def /m22 {mt f} def /m26{mt s} def
/m23 {mp x y w2 sub m w2 w d w neg 0 d cl f} def
/m27 {mp x y w2 add m w3 neg w2 neg d w3 w2 neg d w3 w2 d cl s} def
/m28 {mp x w2 sub y w2 sub w3 add m w3 0 d  0 w3 neg d w3 0 d 0 w3 d w3 0 d  0 w3 d w3 neg 0 d 0 w3 d w3 neg 0 d 0 w3 neg d w3 neg 0 d cl s } def
/m29 {mp gsave x w2 sub y w2 add w3 sub m currentpoint t 4 {side} repeat cl fill gr} def
/m30 {mp gsave x w2 sub y w2 add w3 sub m currentpoint t 4 {side} repeat cl s gr} def
/m31 {mp x y w2 sub m 0 w d x w2 sub y m w 0 d x w2 sub y w2 add m w w neg d x w2 sub y w2 sub m w w d s} def
/m32 {mp x y w2 sub m w2 w d w neg 0 d cl s} def
/m33 {mp x y w2 add m w3 neg w2 neg d w3 w2 neg d w3 w2 d cl f} def
/m34 {mp x w2 sub y w2 sub w3 add m w3 0 d  0 w3 neg d w3 0 d 0 w3 d w3 0 d  0 w3 d w3 neg 0 d 0 w3 d w3 neg 0 d 0 w3 neg d w3 neg 0 d cl f } def
/m2 {mp x y w2 sub m 0 w d x w2 sub y m w 0 d s} def
/m5 {mp x w2 sub y w2 sub m w w d x w2 sub y w2 add m w w neg d s} def
/reEncode {exch findfont dup length dict begin {1 index /FID eq  {pop pop} {def} ifelse } forall /Encoding exch def currentdict end dup /FontName get exch definefont pop } def [/Times-Bold /Times-Italic /Times-BoldItalic /Helvetica /Helvetica-Oblique
 /Helvetica-Bold /Helvetica-BoldOblique /Courier /Courier-Oblique /Courier-Bold /Courier-BoldOblique /Times-Roman /AvantGarde-Book /AvantGarde-BookOblique /AvantGarde-Demi /AvantGarde-DemiOblique /Bookman-Demi /Bookman-DemiItalic /Bookman-Light
 /Bookman-LightItalic /Helvetica-Narrow /Helvetica-Narrow-Bold /Helvetica-Narrow-BoldOblique /Helvetica-Narrow-Oblique /NewCenturySchlbk-Roman /NewCenturySchlbk-Bold /NewCenturySchlbk-BoldItalic /NewCenturySchlbk-Italic /Palatino-Bold
 /Palatino-BoldItalic /Palatino-Italic /Palatino-Roman ] {ISOLatin1Encoding reEncode } forall
%%EndProlog
%%BeginSetup
%%EndSetup
newpath  gsave  .25 .25 scale  gsave  0 0 t black[  ] 0 sd 3 lw 1 1 1 c 2268 2177 0 0 bf black 1 1 1 c 2222 2133 23 22 bf black 1 1 1 c 1778 1706 245 235 bf black 1778 1706 245 235 bl 0.8 0 0.8 c 1 1 1 c 1 0 1 c 0.8 0 0.8 c 245 314 m 195 X 1029 Y 18
 X 403 Y 18 X 37 Y 18 X 46 Y 18 X 20 Y 17 X 11 Y 18 X -28 Y 18 X -41 Y 18 X -126 Y 17 X -238 Y 18 X -192 Y 18 X -141 Y 18 X -115 Y 18 X -96 Y 17 X -85 Y 18 X -69 Y 18 X -59 Y 18 X -57 Y 18 X -46 Y 17 X -42 Y 18 X -37 Y 18 X -28 Y 18 X -28 Y 17 X -24
 Y 18 X -19 Y 18 X -17 Y 18 X -14 Y 18 X -12 Y 17 X -8 Y 18 X -7 Y 18 X -6 Y 18 X -4 Y 17 X -3 Y 18 X -2 Y 18 X -2 Y 18 X -1 Y 71 X -1 Y 18 X 1 Y 533 X 1 Y 338 X s black 245 235 m 1778 X s
 gsave  2222 2133 23 22 C 1990.42 68.3734 t 0 r /Helvetica findfont 45.6261 sf 0 0 m (ll) show NC gr 
 gsave  2222 2133 23 22 C 1990.42 129.15 t 0 r /Helvetica findfont 45.6261 sf 0 0 m (T) show NC gr 
 gsave  2222 2133 23 22 C 1952.44 106.359 t 0 r /Helvetica findfont 68.4392 sf 0 0 m (p) show NC gr  245 286 m -51 Y s 289 261 m -26 Y s 334 261 m -26 Y s 378 261 m -26 Y s 423 261 m -26 Y s 467 286 m -51 Y s 512 261 m -26 Y s 556 261 m -26 Y s 600
 261 m -26 Y s 645 261 m -26 Y s 689 286 m -51 Y s 734 261 m -26 Y s 778 261 m -26 Y s 823 261 m -26 Y s 867 261 m -26 Y s 912 286 m -51 Y s 956 261 m -26 Y s 1001 261 m -26 Y s 1045 261 m -26 Y s 1089 261 m -26 Y s 1134 286 m -51 Y s 1178 261 m -26
 Y s 1223 261 m -26 Y s 1267 261 m -26 Y s 1312 261 m -26 Y s 1356 286 m -51 Y s 1401 261 m -26 Y s 1445 261 m -26 Y s 1489 261 m -26 Y s 1534 261 m -26 Y s 1578 286 m -51 Y s 1623 261 m -26 Y s 1667 261 m -26 Y s 1712 261 m -26 Y s 1756 261 m -26 Y
 s 1801 286 m -51 Y s 1845 261 m -26 Y s 1889 261 m -26 Y s 1934 261 m -26 Y s 1978 261 m -26 Y s 2023 286 m -51 Y s
 gsave  2222 2133 23 22 C 224.113 167.135 t 0 r /Helvetica findfont 68.4392 sf 0 0 m (0) show NC gr 
 gsave  2222 2133 23 22 C 425.434 167.135 t 0 r /Helvetica findfont 68.4392 sf 0 0 m (50) show NC gr 
 gsave  2222 2133 23 22 C 630.554 167.135 t 0 r /Helvetica findfont 68.4392 sf 0 0 m (100) show NC gr 
 gsave  2222 2133 23 22 C 850.869 167.135 t 0 r /Helvetica findfont 68.4392 sf 0 0 m (150) show NC gr 
 gsave  2222 2133 23 22 C 1074.98 167.135 t 0 r /Helvetica findfont 68.4392 sf 0 0 m (200) show NC gr 
 gsave  2222 2133 23 22 C 1299.09 167.135 t 0 r /Helvetica findfont 68.4392 sf 0 0 m (250) show NC gr 
 gsave  2222 2133 23 22 C 1519.41 167.135 t 0 r /Helvetica findfont 68.4392 sf 0 0 m (300) show NC gr 
 gsave  2222 2133 23 22 C 1743.52 167.135 t 0 r /Helvetica findfont 68.4392 sf 0 0 m (350) show NC gr 
 gsave  2222 2133 23 22 C 1963.83 167.135 t 0 r /Helvetica findfont 68.4392 sf 0 0 m (400) show NC gr  245 235 m 1706 Y s
 gsave  2222 2133 23 22 C 113.956 1162.35 t 90 r /Helvetica findfont 45.6261 sf 0 0 m (ll) show NC gr 
 gsave  2222 2133 23 22 C 45.5822 1162.35 t 90 r /Helvetica findfont 45.6261 sf 0 0 m (T) show NC gr 
 gsave  2222 2133 23 22 C 79.7689 1063.59 t 90 r /Helvetica findfont 68.4392 sf 0 0 m (/dp) show NC gr 
 gsave  2222 2133 23 22 C 79.7689 1021.8 t 90 r /Symbol findfont 68.4392 sf 0 0 m (s) show NC gr 
 gsave  2222 2133 23 22 C 79.7689 987.615 t 90 r /Helvetica findfont 68.4392 sf 0 0 m (d) show NC gr  298 314 m -53 X s 272 374 m -27 X s 272 435 m -27 X s 272 496 m -27 X s 272 556 m -27 X s 298 617 m -53 X s 272 678 m -27 X s 272 738 m -27 X s 272
 799 m -27 X s 272 860 m -27 X s 298 920 m -53 X s 272 981 m -27 X s 272 1042 m -27 X s 272 1103 m -27 X s 272 1163 m -27 X s 298 1224 m -53 X s 272 1285 m -27 X s 272 1345 m -27 X s 272 1406 m -27 X s 272 1467 m -27 X s 298 1527 m -53 X s 272 1588 m
 -27 X s 272 1649 m -27 X s 272 1709 m -27 X s 272 1770 m -27 X s 298 1831 m -53 X s 298 314 m -53 X s 272 253 m -27 X s 298 1831 m -53 X s 272 1891 m -27 X s
 gsave  2222 2133 23 22 C 208.919 300.083 t 0 r /Helvetica findfont 38.0218 sf 0 0 m (0) show NC gr 
 gsave  2222 2133 23 22 C 186.127 603.965 t 0 r /Helvetica findfont 38.0218 sf 0 0 m (0.1) show NC gr 
 gsave  2222 2133 23 22 C 178.53 907.846 t 0 r /Helvetica findfont 38.0218 sf 0 0 m (0.2) show NC gr 
 gsave  2222 2133 23 22 C 178.53 1211.73 t 0 r /Helvetica findfont 38.0218 sf 0 0 m (0.3) show NC gr 
 gsave  2222 2133 23 22 C 178.53 1515.61 t 0 r /Helvetica findfont 38.0218 sf 0 0 m (0.4) show NC gr 
 gsave  2222 2133 23 22 C 178.53 1815.69 t 0 r /Helvetica findfont 38.0218 sf 0 0 m (0.5) show NC gr  0.8 0 0.8 c 1 0 1 c /w 2 def /w2 {w 2 div} def /w3 {w 3 div} def 254 314 m20 272 314 m20 289 314 m20 307 314 m20 325 314 m20 343 314 m20 360 314 m20
 378 314 m20 396 314 m20 414 314 m20 432 314 m20 449 1343 m20 467 1746 m20 485 1783 m20 503 1829 m20 520 1849 m20 538 1860 m20 556 1832 m20 574 1791 m20 592 1665 m20 609 1427 m20 627 1235 m20 645 1094 m20 663 979 m20 680 883 m20 698 798 m20 716 729
 m20 734 670 m20 752 613 m20 769 567 m20 787 525 m20 805 488 m20 823 460 m20 841 432 m20 858 408 m20 876 389 m20 894 372 m20 912 358 m20 929 346 m20 947 338 m20 965 331 m20 983 325 m20 1001 321 m20 1018 318 m20 1036 316 m20 1054 314 m20 1072 313 m20
 1089 313 m20 1107 313 m20 1125 313 m20 1143 312 m20 1161 313 m20 1178 313 m20 1196 313 m20 1214 313 m20 1232 313 m20 1249 313 m20 1267 313 m20 1285 313 m20 1303 313 m20 1321 313 m20 1338 313 m20 1356 313 m20 1374 313 m20 1392 313 m20 1409 313 m20
 1427 313 m20 1445 313 m20 1463 313 m20 1481 313 m20 1498 313 m20 1516 313 m20 1534 313 m20 1552 313 m20 1569 313 m20 1587 313 m20 1605 313 m20 1623 313 m20 1641 313 m20 1658 313 m20 1676 313 m20 1694 314 m20 1712 314 m20 1729 314 m20 1747 314 m20
 1765 314 m20 1783 314 m20 1801 314 m20 1818 314 m20 1836 314 m20 1854 314 m20 1872 314 m20 1889 314 m20 1907 314 m20 1925 314 m20 1943 314 m20 1961 314 m20 1978 314 m20 1996 314 m20 2014 314 m20 0.8 0 0.8 c black 0.8 0 0.8 c 1 lw << /PatternType 1
 /PaintType 2 /TilingType 1 /BBox [ 0 0 100 100 ] /XStep 100 /YStep 100 /PaintProc { begin gsave 0 0 m 100 100 l 0 100 m 100 0 l s gr end } >> [ 0.24 0 0 0.24 0 0 ] makepattern /P13 exch def /cs {[/Pattern /DeviceRGB] setcolorspace} def /FA {f
 [/DeviceRGB] setcolorspace} def cs 0.8 0 0.8 P13 setcolor 254 314 m 178 X 17 1033 d 18 404 d 18 36 d 18 46 d 17 21 d 18 11 d 18 -28 d 18 -41 d 18 -127 d 17 -238 d 18 -192 d 18 -142 d 18 -115 d 17 -96 d 18 -85 d 18 -70 d 18 -60 d 18 -57 d 17 -46 d 18
 -42 d 18 -37 d 18 -28 d 18 -28 d 17 -24 d 18 -20 d 18 -16 d 18 -14 d 17 -12 d 18 -8 d 18 -8 d 18 -6 d 18 -4 d 17 -3 d 18 -2 d 18 -2 d 18 -1 d 569 X 17 1 d 356 X -249 X -18 -1 d -18 1 d -35 X -18 -1 d -515 X -18 -1 d -18 1 d -53 X -18 1 d -18 2 d -18
 2 d -17 3 d -18 3 d -18 7 d -18 7 d -18 8 d -17 12 d -18 13 d -18 17 d -18 19 d -17 25 d -18 27 d -18 28 d -18 37 d -18 42 d -17 45 d -18 57 d -18 59 d -18 69 d -18 85 d -17 95 d -18 115 d -18 141 d -18 191 d -17 237 d -18 126 d -18 42 d -18 27 d
 -18 -11 d -17 -20 d -18 -46 d -18 -36 d -18 -403 d -17 -1025 d -178 X FA 3 lw 0.8 0.8 0 c 1 1 1 c 1 1 0 c 0.8 0.8 0 c 245 314 m 195 X 1050 Y 18 X 411 Y 18 X 35 Y 18 X 51 Y 18 X 21 Y 17 X 11 Y 18 X -26 Y 18 X -45 Y 18 X -127 Y 17 X -237 Y 18 X -192 Y
 18 X -143 Y 18 X -114 Y 18 X -96 Y 17 X -87 Y 18 X -69 Y 18 X -60 Y 18 X -58 Y 18 X -48 Y 17 X -43 Y 18 X -39 Y 18 X -30 Y 18 X -29 Y 17 X -25 Y 18 X -21 Y 18 X -18 Y 18 X -15 Y 18 X -13 Y 17 X -10 Y 18 X -8 Y 18 X -7 Y 18 X -5 Y 17 X -4 Y 18 X -3 Y
 18 X -2 Y 18 X -1 Y 18 X -2 Y 35 X -1 Y 53 X -1 Y 303 X -1 Y 17 X 1 Y 36 X -1 Y 36 X 1 Y 17 X -1 Y 160 X 1 Y 18 X -1 Y 53 X 1 Y 36 X -1 Y 36 X 1 Y 142 X s 1 1 0 c 254 314 m20 272 314 m20 289 314 m20 307 314 m20 325 314 m20 343 314 m20 360 314 m20
 378 314 m20 396 314 m20 414 314 m20 432 314 m20 449 1364 m20 467 1775 m20 485 1810 m20 503 1861 m20 520 1882 m20 538 1893 m20 556 1867 m20 574 1822 m20 592 1695 m20 609 1458 m20 627 1266 m20 645 1123 m20 663 1009 m20 680 913 m20 698 826 m20 716 757
 m20 734 697 m20 752 639 m20 769 591 m20 787 548 m20 805 509 m20 823 479 m20 841 450 m20 858 425 m20 876 404 m20 894 386 m20 912 371 m20 929 358 m20 947 348 m20 965 340 m20 983 333 m20 1001 328 m20 1018 324 m20 1036 321 m20 1054 319 m20 1072 318 m20
 1089 316 m20 1107 316 m20 1125 315 m20 1143 315 m20 1161 315 m20 1178 314 m20 1196 314 m20 1214 314 m20 1232 314 m20 1249 314 m20 1267 314 m20 1285 314 m20 1303 314 m20 1321 314 m20 1338 314 m20 1356 314 m20 1374 314 m20 1392 314 m20 1409 314 m20
 1427 314 m20 1445 314 m20 1463 314 m20 1481 313 m20 1498 314 m20 1516 314 m20 1534 313 m20 1552 313 m20 1569 314 m20 1587 313 m20 1605 313 m20 1623 313 m20 1641 313 m20 1658 313 m20 1676 313 m20 1694 313 m20 1712 313 m20 1729 313 m20 1747 314 m20
 1765 313 m20 1783 313 m20 1801 313 m20 1818 314 m20 1836 314 m20 1854 313 m20 1872 313 m20 1889 314 m20 1907 314 m20 1925 314 m20 1943 314 m20 1961 314 m20 1978 314 m20 1996 314 m20 2014 314 m20 0.8 0.8 0 c black 0.8 0.8 0 c cs 0.8 0.8 0 P13
 setcolor 254 314 m 178 X 17 1053 d 18 413 d 18 34 d 18 51 d 17 22 d 18 10 d 18 -26 d 18 -44 d 18 -128 d 17 -237 d 18 -192 d 18 -144 d 18 -114 d 17 -97 d 18 -87 d 18 -69 d 18 -61 d 18 -58 d 17 -48 d 18 -43 d 18 -39 d 18 -30 d 18 -29 d 17 -26 d 18 -21
 d 18 -17 d 18 -16 d 17 -13 d 18 -10 d 18 -8 d 18 -7 d 18 -5 d 17 -4 d 18 -3 d 18 -2 d 18 -1 d 17 -1 d 18 -1 d 18 -1 d 36 X 17 -1 d 356 X 18 -1 d 17 1 d 72 X 17 -1 d 71 X 18 1 d 18 -1 d 18 1 d 231 X -71 X -18 -1 d -18 1 d -18 X -17 -1 d -285 X -18 1
 d -17 -1 d -89 X -18 1 d -267 X -17 1 d -36 X -18 1 d -18 X -17 2 d -18 1 d -18 2 d -18 3 d -17 4 d -18 4 d -18 7 d -18 9 d -18 9 d -17 13 d -18 15 d -18 18 d -18 21 d -17 25 d -18 29 d -18 30 d -18 39 d -18 42 d -17 48 d -18 58 d -18 60 d -18 69 d
 -18 86 d -17 97 d -18 113 d -18 143 d -18 191 d -17 237 d -18 126 d -18 45 d -18 26 d -18 -10 d -17 -22 d -18 -51 d -18 -34 d -18 -411 d -17 -1046 d -178 X FA black 1 1 1 c black 245 314 m 195 X 1039 Y 18 X 407 Y 18 X 35 Y 18 X 49 Y 18 X 20 Y 17 X
 11 Y 18 X -27 Y 18 X -43 Y 18 X -126 Y 17 X -236 Y 18 X -190 Y 18 X -142 Y 18 X -114 Y 18 X -96 Y 17 X -86 Y 18 X -69 Y 18 X -60 Y 18 X -57 Y 18 X -48 Y 17 X -42 Y 18 X -38 Y 18 X -29 Y 18 X -29 Y 17 X -25 Y 18 X -20 Y 18 X -17 Y 18 X -15 Y 18 X -13
 Y 17 X -9 Y 18 X -8 Y 18 X -6 Y 18 X -5 Y 17 X -3 Y 18 X -3 Y 18 X -1 Y 18 X -2 Y 18 X -1 Y 35 X -1 Y 907 X s 254 314 m20 272 314 m20 289 314 m20 307 314 m20 325 314 m20 343 314 m20 360 314 m20 378 314 m20 396 314 m20 414 314 m20 432 314 m20 449
 1353 m20 467 1760 m20 485 1795 m20 503 1844 m20 520 1864 m20 538 1875 m20 556 1848 m20 574 1805 m20 592 1679 m20 609 1443 m20 627 1253 m20 645 1111 m20 663 997 m20 680 901 m20 698 815 m20 716 746 m20 734 686 m20 752 629 m20 769 581 m20 787 539 m20
 805 501 m20 823 472 m20 841 443 m20 858 418 m20 876 398 m20 894 381 m20 912 366 m20 929 353 m20 947 344 m20 965 336 m20 983 330 m20 1001 325 m20 1018 322 m20 1036 319 m20 1054 318 m20 1072 316 m20 1089 315 m20 1107 315 m20 1125 314 m20 1143 314 m20
 1161 314 m20 1178 314 m20 1196 314 m20 1214 314 m20 1232 314 m20 1249 314 m20 1267 314 m20 1285 314 m20 1303 314 m20 1321 314 m20 1338 314 m20 1356 314 m20 1374 314 m20 1392 314 m20 1409 314 m20 1427 314 m20 1445 314 m20 1463 314 m20 1481 314 m20
 1498 314 m20 1516 314 m20 1534 314 m20 1552 314 m20 1569 314 m20 1587 314 m20 1605 314 m20 1623 314 m20 1641 314 m20 1658 314 m20 1676 314 m20 1694 314 m20 1712 314 m20 1729 314 m20 1747 314 m20 1765 314 m20 1783 314 m20 1801 314 m20 1818 314 m20
 1836 314 m20 1854 314 m20 1872 314 m20 1889 314 m20 1907 314 m20 1925 314 m20 1943 314 m20 1961 314 m20 1978 314 m20 1996 314 m20 2014 314 m20 cs 0 0 0 P13 setcolor 254 314 m 178 X 17 1043 d 18 407 d 18 36 d 18 48 d 17 20 d 18 12 d 18 -28 d 18 -42 d
 18 -127 d 17 -236 d 18 -190 d 18 -143 d 18 -114 d 17 -96 d 18 -87 d 18 -69 d 18 -60 d 18 -58 d 17 -47 d 18 -43 d 18 -38 d 18 -29 d 18 -29 d 17 -25 d 18 -20 d 18 -18 d 18 -15 d 17 -12 d 18 -9 d 18 -8 d 18 -7 d 18 -4 d 17 -4 d 18 -3 d 18 -1 d 18 -2 d
 17 -1 d 36 X 18 -1 d 871 X -889 X -18 1 d -18 X -17 1 d -18 1 d -18 2 d -18 3 d -17 3 d -18 4 d -18 7 d -18 8 d -18 9 d -17 13 d -18 14 d -18 17 d -18 21 d -17 24 d -18 29 d -18 29 d -18 38 d -18 42 d -17 47 d -18 57 d -18 60 d -18 69 d -18 86 d -17
 96 d -18 113 d -18 142 d -18 189 d -17 235 d -18 127 d -18 42 d -18 27 d -18 -11 d -17 -20 d -18 -48 d -18 -35 d -18 -406 d -17 -1036 d -178 X FA 0.8 0 0 c 1 1 1 c 1 0 0 c 0.8 0 0 c 245 314 m 195 X 514 Y 18 X 201 Y 18 X 16 Y 18 X 25 Y 18 X 10 Y 17 X
 6 Y 18 X -13 Y 18 X -22 Y 18 X -62 Y 17 X -112 Y 18 X -90 Y 18 X -70 Y 18 X -53 Y 18 X -47 Y 17 X -43 Y 18 X -34 Y 18 X -29 Y 18 X -29 Y 18 X -24 Y 17 X -21 Y 18 X -20 Y 18 X -15 Y 18 X -15 Y 17 X -13 Y 18 X -10 Y 18 X -9 Y 18 X -9 Y 18 X -6 Y 17 X
 -6 Y 18 X -4 Y 18 X -4 Y 18 X -3 Y 17 X -2 Y 18 X -1 Y 18 X -2 Y 18 X -1 Y 18 X -1 Y 71 X -1 Y 71 X -1 Y 800 X s 1 0 0 c 254 314 m20 272 314 m20 289 314 m20 307 314 m20 325 314 m20 343 314 m20 360 314 m20 378 314 m20 396 314 m20 414 314 m20 432 314
 m20 449 828 m20 467 1029 m20 485 1045 m20 503 1070 m20 520 1080 m20 538 1086 m20 556 1073 m20 574 1051 m20 592 989 m20 609 877 m20 627 787 m20 645 717 m20 663 664 m20 680 617 m20 698 574 m20 716 540 m20 734 511 m20 752 482 m20 769 458 m20 787 437
 m20 805 417 m20 823 402 m20 841 387 m20 858 374 m20 876 364 m20 894 355 m20 912 346 m20 929 340 m20 947 334 m20 965 330 m20 983 326 m20 1001 323 m20 1018 321 m20 1036 320 m20 1054 318 m20 1072 317 m20 1089 316 m20 1107 316 m20 1125 316 m20 1143 316
 m20 1161 315 m20 1178 315 m20 1196 315 m20 1214 315 m20 1232 314 m20 1249 314 m20 1267 314 m20 1285 314 m20 1303 314 m20 1321 314 m20 1338 314 m20 1356 314 m20 1374 314 m20 1392 314 m20 1409 314 m20 1427 314 m20 1445 314 m20 1463 314 m20 1481 314
 m20 1498 314 m20 1516 314 m20 1534 314 m20 1552 314 m20 1569 314 m20 1587 314 m20 1605 314 m20 1623 314 m20 1641 314 m20 1658 314 m20 1676 314 m20 1694 314 m20 1712 314 m20 1729 314 m20 1747 314 m20 1765 314 m20 1783 314 m20 1801 314 m20 1818 314
 m20 1836 314 m20 1854 314 m20 1872 314 m20 1889 314 m20 1907 314 m20 1925 314 m20 1943 314 m20 1961 314 m20 1978 314 m20 1996 314 m20 2014 314 m20 0.8 0 0 c black 0.8 0 0 c cs 0.8 0 0 P13 setcolor 254 314 m 178 X 17 516 d 18 201 d 18 16 d 18 25 d 17
 10 d 18 6 d 18 -13 d 18 -22 d 18 -61 d 17 -113 d 18 -90 d 18 -70 d 18 -54 d 17 -47 d 18 -43 d 18 -33 d 18 -30 d 18 -29 d 17 -24 d 18 -21 d 18 -20 d 18 -15 d 18 -15 d 17 -13 d 18 -11 d 18 -9 d 18 -8 d 17 -7 d 18 -5 d 18 -5 d 18 -4 d 18 -3 d 17 -1 d
 18 -2 d 18 -1 d 18 -1 d 17 -1 d 18 -1 d 36 X 18 -1 d 88 X 18 -1 d 747 X -782 X -18 1 d -71 X -18 1 d -36 X -17 1 d -18 1 d -18 2 d -18 1 d -17 2 d -18 3 d -18 4 d -18 4 d -18 6 d -17 6 d -18 8 d -18 9 d -18 11 d -17 13 d -18 15 d -18 15 d -18 19 d
 -18 21 d -17 24 d -18 29 d -18 29 d -18 34 d -18 42 d -17 47 d -18 54 d -18 70 d -18 89 d -17 112 d -18 62 d -18 22 d -18 12 d -18 -5 d -17 -10 d -18 -25 d -18 -16 d -18 -200 d -17 -513 d -178 X FA black 1 1 1 c 556 639 1578 1302 bf black 1578 1302
 m 556 X s 2134 1302 m 639 Y s 2134 1941 m -556 X s 1578 1941 m -639 Y s
 gsave  2222 2133 23 22 C 1716.93 1827.09 t 0 r /Helvetica findfont 95.0544 sf 0 0 m (No Int) show NC gr  0.8 0 0 c 1599 1861 m 97 X s black
 gsave  2222 2133 23 22 C 1716.93 1663.75 t 0 r /Helvetica findfont 95.0544 sf 0 0 m (Add) show NC gr  0.8 0.8 0 c 1599 1702 m 97 X s black
 gsave  2222 2133 23 22 C 1716.93 1504.21 t 0 r /Helvetica findfont 95.0544 sf 0 0 m (Mult) show NC gr  0.8 0 0.8 c 1599 1542 m 97 X s black
 gsave  2222 2133 23 22 C 1716.93 1344.68 t 0 r /Helvetica findfont 95.0544 sf 0 0 m (Central) show NC gr  1599 1382 m 97 X s
 gsave  2222 2133 23 22 C 2199.34 1568.79 t 90 r /Helvetica-BoldOblique findfont 38.0218 sf 0 0 m (LHC HIGGS XS WG 2013) show NC gr 
 gr  gr showpage
end
%%EOF
