%!PS-Adobe-2.0 EPSF-2.0
%%BoundingBox:  0 0 567 544
%%Title: HWW_900_Mt_NNLO_cut_YR3.eps: HWW 900Gev Mt NNLO with cuts
%%Creator: ROOT Version 5.34/05
%%CreationDate: Fri Jun 14 04:49:36 2013
%%EndComments
%%BeginProlog
80 dict begin
/s {stroke} def /l {lineto} def /m {moveto} def /t {translate} def
/r {rotate} def /rl {roll}  def /R {repeat} def
/d {rlineto} def /rm {rmoveto} def /gr {grestore} def /f {eofill} def
/c {setrgbcolor} def /black {0 setgray} def /sd {setdash} def
/cl {closepath} def /sf {scalefont setfont} def /lw {setlinewidth} def
/box {m dup 0 exch d exch 0 d 0 exch neg d cl} def
/NC{systemdict begin initclip end}def/C{NC box clip newpath}def
/bl {box s} def /bf {box f} def /Y { 0 exch d} def /X { 0 d} def 
/K {{pop pop 0 moveto} exch kshow} bind def
/ita {/ang 15 def gsave [1 0 ang dup sin exch cos div 1 0 0] concat} def 
/mp {newpath /y exch def /x exch def} def
/side {[w .77 mul w .23 mul] .385 w mul sd w 0 l currentpoint t -144 r} def
/mr {mp x y w2 0 360 arc} def /m24 {mr s} def /m20 {mr f} def
/mb {mp x y w2 add m w2 neg 0 d 0 w neg d w 0 d 0 w d cl} def
/mt {mp x y w2 add m w2 neg w neg d w 0 d cl} def
/m21 {mb f} def /m25 {mb s} def /m22 {mt f} def /m26{mt s} def
/m23 {mp x y w2 sub m w2 w d w neg 0 d cl f} def
/m27 {mp x y w2 add m w3 neg w2 neg d w3 w2 neg d w3 w2 d cl s} def
/m28 {mp x w2 sub y w2 sub w3 add m w3 0 d  0 w3 neg d w3 0 d 0 w3 d w3 0 d  0 w3 d w3 neg 0 d 0 w3 d w3 neg 0 d 0 w3 neg d w3 neg 0 d cl s } def
/m29 {mp gsave x w2 sub y w2 add w3 sub m currentpoint t 4 {side} repeat cl fill gr} def
/m30 {mp gsave x w2 sub y w2 add w3 sub m currentpoint t 4 {side} repeat cl s gr} def
/m31 {mp x y w2 sub m 0 w d x w2 sub y m w 0 d x w2 sub y w2 add m w w neg d x w2 sub y w2 sub m w w d s} def
/m32 {mp x y w2 sub m w2 w d w neg 0 d cl s} def
/m33 {mp x y w2 add m w3 neg w2 neg d w3 w2 neg d w3 w2 d cl f} def
/m34 {mp x w2 sub y w2 sub w3 add m w3 0 d  0 w3 neg d w3 0 d 0 w3 d w3 0 d  0 w3 d w3 neg 0 d 0 w3 d w3 neg 0 d 0 w3 neg d w3 neg 0 d cl f } def
/m2 {mp x y w2 sub m 0 w d x w2 sub y m w 0 d s} def
/m5 {mp x w2 sub y w2 sub m w w d x w2 sub y w2 add m w w neg d s} def
/reEncode {exch findfont dup length dict begin {1 index /FID eq  {pop pop} {def} ifelse } forall /Encoding exch def currentdict end dup /FontName get exch definefont pop } def [/Times-Bold /Times-Italic /Times-BoldItalic /Helvetica /Helvetica-Oblique
 /Helvetica-Bold /Helvetica-BoldOblique /Courier /Courier-Oblique /Courier-Bold /Courier-BoldOblique /Times-Roman /AvantGarde-Book /AvantGarde-BookOblique /AvantGarde-Demi /AvantGarde-DemiOblique /Bookman-Demi /Bookman-DemiItalic /Bookman-Light
 /Bookman-LightItalic /Helvetica-Narrow /Helvetica-Narrow-Bold /Helvetica-Narrow-BoldOblique /Helvetica-Narrow-Oblique /NewCenturySchlbk-Roman /NewCenturySchlbk-Bold /NewCenturySchlbk-BoldItalic /NewCenturySchlbk-Italic /Palatino-Bold
 /Palatino-BoldItalic /Palatino-Italic /Palatino-Roman ] {ISOLatin1Encoding reEncode } forall
%%EndProlog
%%BeginSetup
%%EndSetup
newpath  gsave  .25 .25 scale  gsave  0 0 t black[  ] 0 sd 3 lw 1 1 1 c 2268 2177 0 0 bf black 1 1 1 c 2222 2133 23 22 bf black 1 1 1 c 1778 1706 245 235 bf black 1778 1706 245 235 bl 0.8 0 0.8 c 1 1 1 c 1 0 1 c 0.8 0 0.8 c 245 235 m 136 X 4 Y 6 X 12
 Y 7 X 12 Y 6 X 22 Y 7 X 7 Y 6 X 26 Y 6 X 17 Y 7 X 29 Y 6 X 34 Y 7 X 55 Y 6 X 48 Y 7 X 25 Y 6 X 44 Y 7 X 14 Y 6 X 72 Y 7 X 62 Y 6 X 61 Y 7 X 85 Y 6 X 49 Y 7 X 40 Y 6 X 35 Y 6 X 67 Y 7 X 37 Y 6 X 70 Y 7 X -8 Y 6 X 85 Y 7 X 25 Y 6 X 60 Y 7 X -4 Y 6 X
 19 Y 7 X 21 Y 6 X 45 Y 7 X 18 Y 6 X 15 Y 6 X 38 Y 7 X 40 Y 6 X 43 Y 7 X -26 Y 6 X 86 Y 13 X -5 Y 7 X 35 Y 6 X 33 Y 7 X 38 Y 6 X -39 Y 7 X 78 Y 6 X -53 Y 7 X 42 Y 6 X 2 Y 6 X 17 Y 7 X 51 Y 6 X 9 Y 7 X -61 Y 6 X 33 Y 7 X 41 Y 6 X -8 Y 7 X -17 Y 6 X 45
 Y 7 X -41 Y 6 X 4 Y 13 X -13 Y 7 X 17 Y 6 X -39 Y 6 X 2 Y 7 X -14 Y 6 X -11 Y 7 X 10 Y 6 X 23 Y 7 X -40 Y 6 X -6 Y 7 X -36 Y 6 X -4 Y 7 X -16 Y 6 X -18 Y 7 X -9 Y 6 X 9 Y 6 X -47 Y 7 X 1 Y 6 X -2 Y 7 X -40 Y 6 X -1 Y 7 X -8 Y 6 X -21 Y 7 X -26 Y 6 X
 -24 Y 7 X -14 Y 6 X -22 Y 7 X 3 Y 6 X -22 Y 7 X -19 Y 6 X -11 Y 6 X -18 Y 7 X -40 Y 6 X -15 Y 7 X -10 Y 6 X -24 Y 7 X 4 Y 6 X -27 Y 7 X -34 Y 6 X 4 Y 7 X -30 Y 6 X -14 Y 7 X -21 Y 6 X -8 Y 7 X -21 Y 6 X -30 Y 13 X -25 Y 6 X -6 Y 7 X -23 Y 6 X -29 Y
 7 X -12 Y 6 X -16 Y 7 X -10 Y 6 X -19 Y 7 X -20 Y 6 X -11 Y 7 X -19 Y 6 X -16 Y 6 X -27 Y 7 X -2 Y 6 X -9 Y 7 X -30 Y 6 X -10 Y 7 X -27 Y 6 X -8 Y 7 X -10 Y 6 X -19 Y 7 X -16 Y 6 X -14 Y 7 X -17 Y 6 X -11 Y 7 X -15 Y 6 X -13 Y 6 X -10 Y 7 X -22 Y 6
 X -12 Y 7 X -12 Y 6 X -9 Y 7 X -20 Y 6 X -7 Y 7 X -21 Y 6 X -4 Y 7 X -9 Y 6 X -14 Y 7 X -10 Y 6 X -11 Y 7 X -12 Y 6 X -7 Y 6 X -16 Y 7 X -12 Y 6 X -8 Y 7 X -12 Y 6 X -4 Y 7 X -13 Y 6 X -7 Y 7 X -8 Y 6 X -8 Y 7 X -11 Y 6 X -7 Y 7 X -11 Y 6 X -7 Y 6 X
 -6 Y 7 X -6 Y 6 X -7 Y 7 X -7 Y 6 X -8 Y 7 X -6 Y 6 X -5 Y 7 X -7 Y 6 X -6 Y 7 X -4 Y 6 X -6 Y 7 X -6 Y 6 X -4 Y 7 X -6 Y 6 X -2 Y 6 X -5 Y 7 X -4 Y 6 X -5 Y 7 X -1 Y 6 X -5 Y 7 X -4 Y 6 X -2 Y 7 X -4 Y 6 X -4 Y 7 X -1 Y 6 X -4 Y 7 X -3 Y 6 X -1 Y 7
 X -4 Y 6 X -2 Y 6 X -1 Y 7 X -3 Y 6 X -2 Y 7 X -2 Y 6 X -1 Y 7 X -2 Y 6 X -2 Y 13 X -2 Y 7 X -1 Y 6 X -2 Y 7 X -1 Y 12 X -2 Y 7 X -1 Y 6 X -1 Y 13 X -1 Y 7 X -1 Y 13 X -1 Y 13 X -1 Y 13 X -1 Y 6 X -1 Y 19 X -1 Y 20 X -1 Y 26 X -1 Y 58 X -1 Y 110 X s
 black 245 235 m 1778 X s
 gsave  2222 2133 23 22 C 1990.42 79.7689 t 0 r /Helvetica findfont 45.6261 sf 0 0 m (T) show NC gr 
 gsave  2222 2133 23 22 C 1937.25 98.7615 t 0 r /Helvetica findfont 68.4392 sf 0 0 m (M) show NC gr  245 286 m -51 Y s 319 261 m -26 Y s 393 261 m -26 Y s 467 261 m -26 Y s 541 286 m -51 Y s 615 261 m -26 Y s 689 261 m -26 Y s 763 261 m -26 Y s 838
 286 m -51 Y s 912 261 m -26 Y s 986 261 m -26 Y s 1060 261 m -26 Y s 1134 286 m -51 Y s 1208 261 m -26 Y s 1282 261 m -26 Y s 1356 261 m -26 Y s 1430 286 m -51 Y s 1504 261 m -26 Y s 1578 261 m -26 Y s 1652 261 m -26 Y s 1726 286 m -51 Y s 1801 261
 m -26 Y s 1875 261 m -26 Y s 1949 261 m -26 Y s 2023 286 m -51 Y s 2023 286 m -51 Y s
 gsave  2222 2133 23 22 C 224.113 167.135 t 0 r /Helvetica findfont 68.4392 sf 0 0 m (0) show NC gr 
 gsave  2222 2133 23 22 C 482.412 167.135 t 0 r /Helvetica findfont 68.4392 sf 0 0 m (200) show NC gr 
 gsave  2222 2133 23 22 C 778.697 167.135 t 0 r /Helvetica findfont 68.4392 sf 0 0 m (400) show NC gr 
 gsave  2222 2133 23 22 C 1074.98 167.135 t 0 r /Helvetica findfont 68.4392 sf 0 0 m (600) show NC gr 
 gsave  2222 2133 23 22 C 1371.27 167.135 t 0 r /Helvetica findfont 68.4392 sf 0 0 m (800) show NC gr 
 gsave  2222 2133 23 22 C 1648.56 167.135 t 0 r /Helvetica findfont 68.4392 sf 0 0 m (1000) show NC gr 
 gsave  2222 2133 23 22 C 1944.84 167.135 t 0 r /Helvetica findfont 68.4392 sf 0 0 m (1200) show NC gr  245 235 m 1706 Y s
 gsave  2222 2133 23 22 C 102.56 1169.94 t 90 r /Helvetica findfont 45.6261 sf 0 0 m (T) show NC gr 
 gsave  2222 2133 23 22 C 75.9704 1055.99 t 90 r /Helvetica findfont 68.4392 sf 0 0 m (/dM) show NC gr 
 gsave  2222 2133 23 22 C 75.9704 1014.2 t 90 r /Symbol findfont 68.4392 sf 0 0 m (s) show NC gr 
 gsave  2222 2133 23 22 C 75.9704 980.018 t 90 r /Helvetica findfont 68.4392 sf 0 0 m (d) show NC gr  298 235 m -53 X s 272 291 m -27 X s 272 346 m -27 X s 272 401 m -27 X s 272 457 m -27 X s 298 512 m -53 X s 272 568 m -27 X s 272 623 m -27 X s 272
 679 m -27 X s 272 734 m -27 X s 298 790 m -53 X s 272 845 m -27 X s 272 901 m -27 X s 272 956 m -27 X s 272 1012 m -27 X s 298 1067 m -53 X s 272 1122 m -27 X s 272 1178 m -27 X s 272 1233 m -27 X s 272 1289 m -27 X s 298 1344 m -53 X s 272 1400 m
 -27 X s 272 1455 m -27 X s 272 1511 m -27 X s 272 1566 m -27 X s 298 1622 m -53 X s 272 1677 m -27 X s 272 1733 m -27 X s 272 1788 m -27 X s 272 1844 m -27 X s 298 1899 m -53 X s 298 1899 m -53 X s
 gsave  2222 2133 23 22 C 208.919 220.314 t 0 r /Helvetica findfont 38.0218 sf 0 0 m (0) show NC gr 
 gsave  2222 2133 23 22 C 113.956 497.606 t 0 r /Helvetica findfont 38.0218 sf 0 0 m (0.0005) show NC gr 
 gsave  2222 2133 23 22 C 144.344 774.898 t 0 r /Helvetica findfont 38.0218 sf 0 0 m (0.001) show NC gr 
 gsave  2222 2133 23 22 C 113.956 1052.19 t 0 r /Helvetica findfont 38.0218 sf 0 0 m (0.0015) show NC gr 
 gsave  2222 2133 23 22 C 136.747 1329.48 t 0 r /Helvetica findfont 38.0218 sf 0 0 m (0.002) show NC gr 
 gsave  2222 2133 23 22 C 113.956 1606.77 t 0 r /Helvetica findfont 38.0218 sf 0 0 m (0.0025) show NC gr 
 gsave  2222 2133 23 22 C 136.747 1884.07 t 0 r /Helvetica findfont 38.0218 sf 0 0 m (0.003) show NC gr  0.8 0 0.8 c 1 0 1 c /w 2 def /w2 {w 2 div} def /w3 {w 3 div} def 248 235 m20 255 235 m20 261 235 m20 268 235 m20 274 235 m20 280 235 m20 287 235
 m20 293 235 m20 300 235 m20 306 235 m20 313 235 m20 319 235 m20 326 235 m20 332 235 m20 339 235 m20 345 235 m20 352 235 m20 358 235 m20 365 235 m20 371 235 m20 377 235 m20 384 239 m20 390 251 m20 397 263 m20 403 285 m20 410 292 m20 416 318 m20 423
 335 m20 429 364 m20 436 398 m20 442 453 m20 449 501 m20 455 526 m20 461 570 m20 468 584 m20 474 656 m20 481 718 m20 487 779 m20 494 864 m20 500 913 m20 507 953 m20 513 988 m20 520 1055 m20 526 1092 m20 533 1162 m20 539 1154 m20 546 1239 m20 552 1264
 m20 558 1324 m20 565 1320 m20 571 1339 m20 578 1360 m20 584 1405 m20 591 1423 m20 597 1438 m20 604 1476 m20 610 1516 m20 617 1559 m20 623 1533 m20 630 1619 m20 636 1619 m20 643 1614 m20 649 1649 m20 655 1682 m20 662 1720 m20 668 1681 m20 675 1759
 m20 681 1706 m20 688 1748 m20 694 1750 m20 701 1767 m20 707 1818 m20 714 1827 m20 720 1766 m20 727 1799 m20 733 1840 m20 739 1832 m20 746 1815 m20 752 1860 m20 759 1819 m20 765 1823 m20 772 1823 m20 778 1810 m20 785 1827 m20 791 1788 m20 798 1790
 m20 804 1776 m20 811 1765 m20 817 1775 m20 824 1798 m20 830 1758 m20 836 1752 m20 843 1716 m20 849 1712 m20 856 1696 m20 862 1678 m20 869 1669 m20 875 1678 m20 882 1631 m20 888 1632 m20 895 1630 m20 901 1590 m20 908 1589 m20 914 1581 m20 921 1560
 m20 927 1534 m20 933 1510 m20 940 1496 m20 946 1474 m20 953 1477 m20 959 1455 m20 966 1436 m20 972 1425 m20 979 1407 m20 985 1367 m20 992 1352 m20 998 1342 m20 1005 1318 m20 1011 1322 m20 1017 1295 m20 1024 1261 m20 1030 1265 m20 1037 1235 m20 1043
 1221 m20 1050 1200 m20 1056 1192 m20 1063 1171 m20 1069 1141 m20 1076 1141 m20 1082 1116 m20 1089 1110 m20 1095 1087 m20 1102 1058 m20 1108 1046 m20 1114 1030 m20 1121 1020 m20 1127 1001 m20 1134 981 m20 1140 970 m20 1147 951 m20 1153 935 m20 1160
 908 m20 1166 906 m20 1173 897 m20 1179 867 m20 1186 857 m20 1192 830 m20 1199 822 m20 1205 812 m20 1211 793 m20 1218 777 m20 1224 763 m20 1231 746 m20 1237 735 m20 1244 720 m20 1250 707 m20 1257 697 m20 1263 675 m20 1270 663 m20 1276 651 m20 1283
 642 m20 1289 622 m20 1295 615 m20 1302 594 m20 1308 590 m20 1315 581 m20 1321 567 m20 1328 557 m20 1334 546 m20 1341 534 m20 1347 527 m20 1354 511 m20 1360 499 m20 1367 491 m20 1373 479 m20 1380 475 m20 1386 462 m20 1392 455 m20 1399 447 m20 1405
 439 m20 1412 428 m20 1418 421 m20 1425 410 m20 1431 403 m20 1438 397 m20 1444 391 m20 1451 384 m20 1457 377 m20 1464 369 m20 1470 363 m20 1477 358 m20 1483 351 m20 1489 345 m20 1496 341 m20 1502 335 m20 1509 329 m20 1515 325 m20 1522 319 m20 1528
 317 m20 1535 312 m20 1541 308 m20 1548 303 m20 1554 302 m20 1561 297 m20 1567 293 m20 1573 291 m20 1580 287 m20 1586 283 m20 1593 282 m20 1599 278 m20 1606 275 m20 1612 274 m20 1619 270 m20 1625 268 m20 1632 267 m20 1638 264 m20 1645 262 m20 1651
 260 m20 1658 259 m20 1664 257 m20 1670 255 m20 1677 255 m20 1683 253 m20 1690 252 m20 1696 250 m20 1703 249 m20 1709 249 m20 1716 247 m20 1722 246 m20 1729 245 m20 1735 245 m20 1742 244 m20 1748 243 m20 1755 243 m20 1761 242 m20 1767 242 m20 1774
 241 m20 1780 241 m20 1787 240 m20 1793 239 m20 1800 239 m20 1806 239 m20 1813 238 m20 1819 238 m20 1826 238 m20 1832 237 m20 1839 237 m20 1845 237 m20 1851 237 m20 1858 236 m20 1864 236 m20 1871 236 m20 1877 236 m20 1884 236 m20 1890 236 m20 1897
 236 m20 1903 236 m20 1910 236 m20 1916 235 m20 1923 235 m20 1929 235 m20 1936 235 m20 1942 235 m20 1948 235 m20 1955 235 m20 1961 235 m20 1968 235 m20 1974 235 m20 1981 235 m20 1987 235 m20 1994 235 m20 2000 235 m20 2007 235 m20 2013 235 m20 2020
 235 m20 0.8 0 0.8 c black 0.8 0 0.8 c 1 lw << /PatternType 1 /PaintType 2 /TilingType 1 /BBox [ 0 0 100 100 ] /XStep 100 /YStep 100 /PaintProc { begin gsave 0 0 m 100 100 l 0 100 m 100 0 l s gr end } >> [ 0.24 0 0 0.24 0 0 ] makepattern /P13 exch
 def /cs {[/Pattern /DeviceRGB] setcolorspace} def /FA {f [/DeviceRGB] setcolorspace} def cs 0.8 0 0.8 P13 setcolor 248 235 m 123 X 6 1 d 7 5 d 6 13 d 7 13 d 6 24 d 7 6 d 6 28 d 7 17 d 6 30 d 7 36 d 6 57 d 7 49 d 6 26 d 6 45 d 7 14 d 6 74 d 7 62 d 6
 64 d 7 86 d 6 50 d 7 40 d 6 35 d 7 68 d 6 37 d 7 71 d 6 -9 d 7 86 d 6 24 d 6 60 d 7 -5 d 6 19 d 7 20 d 6 45 d 7 18 d 6 14 d 7 38 d 6 41 d 7 42 d 6 -26 d 7 86 d 6 X 7 -5 d 6 34 d 6 33 d 7 38 d 6 -40 d 7 79 d 6 -55 d 7 43 d 6 2 d 7 16 d 6 52 d 7 8 d 6
 -62 d 7 34 d 6 41 d 6 -8 d 7 -18 d 6 45 d 7 -41 d 6 3 d 7 X 6 -13 d 7 17 d 6 -40 d 7 2 d 6 -15 d 7 -10 d 6 10 d 7 22 d 6 -40 d 6 -6 d 7 -36 d 6 -4 d 7 -17 d 6 -18 d 7 -9 d 6 9 d 7 -48 d 6 2 d 7 -3 d 6 -40 d 7 -1 d 6 -8 d 7 -21 d 6 -27 d 6 -24 d 7
 -14 d 6 -22 d 7 3 d 6 -22 d 7 -20 d 6 -10 d 7 -19 d 6 -40 d 7 -15 d 6 -10 d 7 -25 d 6 4 d 6 -27 d 7 -35 d 6 5 d 7 -31 d 6 -13 d 7 -22 d 6 -8 d 7 -20 d 6 -31 d 7 X 6 -25 d 7 -7 d 6 -23 d 7 -29 d 6 -12 d 6 -16 d 7 -10 d 6 -19 d 7 -20 d 6 -12 d 7 -18 d
 6 -17 d 7 -26 d 6 -3 d 7 -9 d 6 -31 d 7 -9 d 6 -27 d 7 -8 d 6 -10 d 6 -20 d 7 -15 d 6 -15 d 7 -17 d 6 -11 d 7 -15 d 6 -13 d 7 -10 d 6 -22 d 7 -12 d 6 -12 d 7 -10 d 6 -20 d 6 -7 d 7 -21 d 6 -4 d 7 -9 d 6 -15 d 7 -10 d 6 -11 d 7 -12 d 6 -7 d 7 -16 d 6
 -12 d 7 -8 d 6 -12 d 7 -4 d 6 -13 d 6 -7 d 7 -8 d 6 -8 d 7 -12 d 6 -6 d 7 -11 d 6 -7 d 7 -7 d 6 -6 d 7 -7 d 6 -7 d 7 -7 d 6 -7 d 7 -4 d 6 -8 d 6 -6 d 7 -4 d 6 -6 d 7 -6 d 6 -4 d 7 -6 d 6 -2 d 7 -5 d 6 -4 d 7 -5 d 6 -1 d 7 -5 d 6 -4 d 6 -2 d 7 -4 d 6
 -4 d 7 -2 d 6 -4 d 7 -2 d 6 -1 d 7 -5 d 6 -2 d 7 -1 d 6 -3 d 7 -1 d 6 -2 d 7 -2 d 6 -2 d 6 -1 d 7 -1 d 6 -2 d 7 -1 d 6 -1 d 7 -2 d 6 X 7 -2 d 6 -1 d 7 X 6 -1 d 7 -1 d 6 -1 d 7 X 6 -1 d 6 X 7 -1 d 6 X 7 -1 d 6 X 7 -1 d 6 X 7 -1 d 19 X 7 -1 d 19 X 6
 -1 d 46 X 6 -1 d 104 X -110 X -7 1 d -45 X -7 1 d -19 X -6 1 d -13 X -7 1 d -13 X -6 1 d -7 X -6 1 d -7 X -6 1 d -6 1 d -7 X -6 1 d -7 1 d -6 X -7 1 d -6 1 d -7 1 d -6 1 d -7 1 d -6 1 d -7 2 d -6 1 d -7 1 d -6 2 d -6 1 d -7 2 d -6 2 d -7 2 d -6 2 d
 -7 1 d -6 2 d -7 4 d -6 2 d -7 2 d -6 4 d -7 2 d -6 3 d -7 4 d -6 2 d -6 4 d -7 5 d -6 1 d -7 5 d -6 4 d -7 5 d -6 2 d -7 6 d -6 3 d -7 6 d -6 7 d -7 3 d -6 6 d -6 8 d -7 5 d -6 6 d -7 7 d -6 7 d -7 7 d -6 6 d -7 7 d -6 7 d -7 10 d -6 7 d -7 11 d -6
 8 d -7 7 d -6 8 d -6 13 d -7 3 d -6 12 d -7 8 d -6 12 d -7 16 d -6 7 d -7 12 d -6 11 d -7 10 d -6 14 d -7 9 d -6 4 d -7 21 d -6 7 d -6 19 d -7 10 d -6 12 d -7 12 d -6 21 d -7 10 d -6 13 d -7 14 d -6 11 d -7 18 d -6 14 d -7 15 d -6 20 d -6 9 d -7 8 d
 -6 28 d -7 9 d -6 29 d -7 10 d -6 2 d -7 26 d -6 17 d -7 18 d -6 11 d -7 20 d -6 19 d -7 10 d -6 16 d -6 12 d -7 28 d -6 23 d -7 6 d -6 25 d -7 X -6 30 d -7 21 d -6 7 d -7 22 d -6 13 d -7 30 d -6 -4 d -7 34 d -6 27 d -6 -5 d -7 25 d -6 9 d -7 16 d
 -6 39 d -7 18 d -6 11 d -7 19 d -6 22 d -7 -4 d -6 22 d -7 14 d -6 23 d -6 27 d -7 21 d -6 8 d -7 X -6 40 d -7 2 d -6 -1 d -7 47 d -6 -10 d -7 9 d -6 17 d -7 17 d -6 4 d -7 35 d -6 6 d -6 39 d -7 -22 d -6 -10 d -7 10 d -6 14 d -7 -3 d -6 40 d -7 -18
 d -6 13 d -7 X -6 -4 d -7 40 d -6 -45 d -7 17 d -6 8 d -6 -42 d -7 -33 d -6 61 d -7 -9 d -6 -52 d -7 -17 d -6 -2 d -7 -42 d -6 52 d -7 -77 d -6 37 d -7 -37 d -6 -33 d -6 -35 d -7 4 d -6 X -7 -86 d -6 26 d -7 -43 d -6 -40 d -7 -38 d -6 -15 d -7 -19 d
 -6 -45 d -7 -22 d -6 -20 d -7 4 d -6 -60 d -6 -26 d -7 -83 d -6 6 d -7 -69 d -6 -37 d -7 -66 d -6 -35 d -7 -40 d -6 -47 d -7 -84 d -6 -60 d -7 -61 d -6 -69 d -7 -15 d -6 -43 d -6 -25 d -7 -47 d -6 -53 d -7 -32 d -6 -28 d -7 -17 d -6 -23 d -7 -8 d -6
 -20 d -7 -11 d -6 -10 d -7 -3 d -129 X FA 3 lw 0.8 0.8 0 c 1 1 1 c 1 1 0 c 0.8 0.8 0 c 245 235 m 136 X 6 Y 6 X 13 Y 7 X 24 Y 6 X 13 Y 7 X 25 Y 6 X 16 Y 6 X 22 Y 7 X 40 Y 6 X 51 Y 7 X 8 Y 6 X 90 Y 7 X 17 Y 6 X 13 Y 7 X 9 Y 6 X 83 Y 7 X 6 Y 6 X 8 Y 7
 X 42 Y 6 X 13 Y 7 X -18 Y 6 X 7 Y 6 X 26 Y 7 X 4 Y 6 X 20 Y 7 X -15 Y 6 X 37 Y 7 X 11 Y 6 X 32 Y 7 X 2 Y 6 X 13 Y 7 X 14 Y 6 X 27 Y 7 X 14 Y 6 X 12 Y 6 X 23 Y 7 X 25 Y 6 X 27 Y 7 X -12 Y 6 X 50 Y 7 X 4 Y 6 X 2 Y 7 X 22 Y 6 X 21 Y 7 X 22 Y 6 X -15 Y
 7 X 46 Y 6 X -25 Y 7 X 26 Y 6 X 4 Y 6 X 12 Y 7 X 32 Y 6 X 9 Y 7 X -31 Y 6 X 22 Y 7 X 27 Y 6 X -1 Y 7 X -4 Y 6 X 29 Y 7 X -20 Y 6 X 6 Y 7 X 6 Y 6 X -3 Y 7 X 11 Y 6 X -19 Y 6 X 3 Y 7 X -2 Y 6 X -4 Y 7 X 14 Y 6 X 15 Y 7 X -19 Y 6 X -1 Y 7 X -17 Y 13 X
 -3 Y 6 X -7 Y 7 X -5 Y 6 X 10 Y 6 X -24 Y 7 X 5 Y 6 X 5 Y 7 X -21 Y 6 X 2 Y 7 X -1 Y 6 X -11 Y 7 X -11 Y 6 X -14 Y 7 X -6 Y 6 X -11 Y 7 X 10 Y 6 X -14 Y 7 X -8 Y 6 X -3 Y 6 X -10 Y 7 X -22 Y 6 X -5 Y 7 X -6 Y 6 X -14 Y 7 X 8 Y 6 X -16 Y 7 X -19 Y 6
 X 4 Y 7 X -20 Y 6 X -5 Y 7 X -10 Y 6 X -4 Y 7 X -12 Y 6 X -19 Y 6 X 5 Y 7 X -16 Y 6 X -2 Y 7 X -17 Y 6 X -16 Y 7 X -6 Y 6 X -10 Y 7 X -5 Y 6 X -11 Y 7 X -11 Y 6 X -10 Y 7 X -11 Y 6 X -10 Y 6 X -19 Y 7 X 1 Y 6 X -4 Y 7 X -23 Y 6 X -5 Y 7 X -21 Y 6 X
 -4 Y 7 X -5 Y 6 X -14 Y 7 X -10 Y 6 X -11 Y 7 X -14 Y 6 X -5 Y 7 X -12 Y 6 X -8 Y 6 X -6 Y 7 X -19 Y 6 X -9 Y 7 X -9 Y 6 X -7 Y 7 X -15 Y 6 X -4 Y 7 X -21 Y 6 X 2 Y 7 X -6 Y 6 X -14 Y 7 X -7 Y 6 X -11 Y 7 X -9 Y 6 X -6 Y 6 X -13 Y 7 X -8 Y 6 X -10 Y
 7 X -11 Y 6 X -1 Y 7 X -14 Y 6 X -5 Y 7 X -5 Y 6 X -7 Y 7 X -13 Y 6 X -5 Y 7 X -12 Y 6 X -4 Y 6 X -7 Y 7 X -6 Y 6 X -7 Y 7 X -6 Y 6 X -7 Y 7 X -7 Y 6 X -5 Y 7 X -8 Y 6 X -5 Y 7 X -4 Y 6 X -8 Y 7 X -5 Y 6 X -4 Y 7 X -10 Y 12 X -6 Y 7 X -3 Y 6 X -8 Y
 7 X 1 Y 6 X -7 Y 7 X -4 Y 6 X -2 Y 7 X -5 Y 6 X -5 Y 7 X -3 Y 6 X -4 Y 7 X -4 Y 6 X 1 Y 7 X -7 Y 6 X -2 Y 6 X -1 Y 7 X -4 Y 6 X -2 Y 7 X -3 Y 6 X -2 Y 7 X -2 Y 6 X -4 Y 7 X -1 Y 6 X -2 Y 7 X -3 Y 6 X -1 Y 7 X -3 Y 6 X 1 Y 6 X -4 Y 7 X -1 Y 6 X -1 Y
 7 X -1 Y 6 X -1 Y 7 X -1 Y 6 X -1 Y 7 X -2 Y 6 X 1 Y 7 X -3 Y 19 X -2 Y 233 X s 1 1 0 c 248 235 m20 255 235 m20 261 235 m20 268 235 m20 274 235 m20 280 235 m20 287 235 m20 293 235 m20 300 235 m20 306 235 m20 313 235 m20 319 235 m20 326 235 m20 332
 235 m20 339 235 m20 345 235 m20 352 235 m20 358 235 m20 365 235 m20 371 235 m20 377 235 m20 384 241 m20 390 254 m20 397 278 m20 403 291 m20 410 316 m20 416 332 m20 423 354 m20 429 394 m20 436 445 m20 442 453 m20 449 543 m20 455 560 m20 461 573 m20
 468 582 m20 474 665 m20 481 671 m20 487 679 m20 494 721 m20 500 734 m20 507 716 m20 513 723 m20 520 749 m20 526 753 m20 533 773 m20 539 758 m20 546 795 m20 552 806 m20 558 838 m20 565 840 m20 571 853 m20 578 867 m20 584 894 m20 591 908 m20 597 920
 m20 604 943 m20 610 968 m20 617 995 m20 623 983 m20 630 1033 m20 636 1037 m20 643 1039 m20 649 1061 m20 655 1082 m20 662 1104 m20 668 1089 m20 675 1135 m20 681 1110 m20 688 1136 m20 694 1140 m20 701 1152 m20 707 1184 m20 714 1193 m20 720 1162 m20
 727 1184 m20 733 1211 m20 739 1210 m20 746 1206 m20 752 1235 m20 759 1215 m20 765 1221 m20 772 1227 m20 778 1224 m20 785 1235 m20 791 1216 m20 798 1219 m20 804 1217 m20 811 1213 m20 817 1227 m20 824 1242 m20 830 1223 m20 836 1222 m20 843 1205 m20
 849 1205 m20 856 1202 m20 862 1195 m20 869 1190 m20 875 1200 m20 882 1176 m20 888 1181 m20 895 1186 m20 901 1165 m20 908 1167 m20 914 1166 m20 921 1155 m20 927 1144 m20 933 1130 m20 940 1124 m20 946 1113 m20 953 1123 m20 959 1109 m20 966 1101 m20
 972 1098 m20 979 1088 m20 985 1066 m20 992 1061 m20 998 1055 m20 1005 1041 m20 1011 1049 m20 1017 1033 m20 1024 1014 m20 1030 1018 m20 1037 998 m20 1043 993 m20 1050 983 m20 1056 979 m20 1063 967 m20 1069 948 m20 1076 953 m20 1082 937 m20 1089 935
 m20 1095 918 m20 1102 902 m20 1108 896 m20 1114 886 m20 1121 881 m20 1127 870 m20 1134 859 m20 1140 849 m20 1147 838 m20 1153 828 m20 1160 809 m20 1166 810 m20 1173 806 m20 1179 783 m20 1186 778 m20 1192 757 m20 1199 753 m20 1205 748 m20 1211 734
 m20 1218 724 m20 1224 713 m20 1231 699 m20 1237 694 m20 1244 682 m20 1250 674 m20 1257 668 m20 1263 649 m20 1270 640 m20 1276 631 m20 1283 624 m20 1289 609 m20 1295 605 m20 1302 584 m20 1308 586 m20 1315 580 m20 1321 566 m20 1328 559 m20 1334 548
 m20 1341 539 m20 1347 533 m20 1354 520 m20 1360 512 m20 1367 502 m20 1373 491 m20 1380 490 m20 1386 476 m20 1392 471 m20 1399 466 m20 1405 459 m20 1412 446 m20 1418 441 m20 1425 429 m20 1431 425 m20 1438 418 m20 1444 412 m20 1451 405 m20 1457 399
 m20 1464 392 m20 1470 385 m20 1477 380 m20 1483 372 m20 1489 367 m20 1496 363 m20 1502 355 m20 1509 350 m20 1515 346 m20 1522 336 m20 1528 336 m20 1535 330 m20 1541 327 m20 1548 319 m20 1554 320 m20 1561 313 m20 1567 309 m20 1573 307 m20 1580 302
 m20 1586 297 m20 1593 294 m20 1599 290 m20 1606 286 m20 1612 287 m20 1619 280 m20 1625 278 m20 1632 277 m20 1638 273 m20 1645 271 m20 1651 268 m20 1658 266 m20 1664 264 m20 1670 260 m20 1677 259 m20 1683 257 m20 1690 254 m20 1696 253 m20 1703 250
 m20 1709 251 m20 1716 247 m20 1722 246 m20 1729 245 m20 1735 244 m20 1742 243 m20 1748 242 m20 1755 241 m20 1761 239 m20 1767 240 m20 1774 237 m20 1780 237 m20 1787 237 m20 1793 235 m20 0.8 0.8 0 c black 0.8 0.8 0 c cs 0.8 0.8 0 P13 setcolor 248 235
 m 129 X 7 8 d 6 14 d 7 27 d 6 13 d 7 26 d 6 17 d 7 23 d 6 41 d 7 54 d 6 6 d 7 94 d 6 17 d 6 13 d 7 8 d 6 85 d 7 7 d 6 7 d 7 43 d 6 13 d 7 -20 d 6 6 d 7 26 d 6 4 d 7 19 d 6 -16 d 7 38 d 6 10 d 6 32 d 7 2 d 6 12 d 7 14 d 6 27 d 7 14 d 6 11 d 7 24 d 6
 25 d 7 26 d 6 -11 d 7 50 d 6 4 d 7 2 d 6 21 d 6 22 d 7 22 d 6 -16 d 7 46 d 6 -25 d 7 26 d 6 4 d 7 11 d 6 32 d 7 10 d 6 -32 d 7 23 d 6 27 d 6 -2 d 7 -4 d 6 29 d 7 -20 d 6 6 d 7 5 d 6 -2 d 7 11 d 6 -20 d 7 4 d 6 -3 d 7 -4 d 6 14 d 7 15 d 6 -19 d 6 -1
 d 7 -17 d 6 X 7 -4 d 6 -7 d 7 -5 d 6 10 d 7 -23 d 6 5 d 7 4 d 6 -21 d 7 2 d 6 -1 d 7 -11 d 6 -12 d 6 -13 d 7 -6 d 6 -11 d 7 10 d 6 -15 d 7 -7 d 6 -4 d 7 -9 d 6 -23 d 7 -4 d 6 -7 d 7 -14 d 6 8 d 6 -16 d 7 -20 d 6 5 d 7 -20 d 6 -6 d 7 -10 d 6 -4 d 7
 -11 d 6 -19 d 7 4 d 6 -15 d 7 -3 d 6 -17 d 7 -16 d 6 -6 d 6 -10 d 7 -5 d 6 -11 d 7 -11 d 6 -11 d 7 -11 d 6 -9 d 7 -19 d 6 X 7 -4 d 6 -22 d 7 -5 d 6 -22 d 7 -4 d 6 -5 d 6 -14 d 7 -10 d 6 -11 d 7 -14 d 6 -5 d 7 -12 d 6 -9 d 7 -6 d 6 -18 d 7 -9 d 6 -10
 d 7 -7 d 6 -14 d 6 -5 d 7 -21 d 6 2 d 7 -6 d 6 -14 d 7 -7 d 6 -11 d 7 -9 d 6 -6 d 7 -14 d 6 -8 d 7 -9 d 6 -11 d 7 -1 d 6 -15 d 6 -4 d 7 -6 d 6 -7 d 7 -13 d 6 -5 d 7 -12 d 6 -4 d 7 -6 d 6 -7 d 7 -7 d 6 -6 d 7 -7 d 6 -7 d 7 -6 d 6 -8 d 6 -4 d 7 -4 d 6
 -8 d 7 -5 d 6 -5 d 7 -9 d 6 X 7 -6 d 6 -3 d 7 -8 d 6 X 7 -6 d 6 -4 d 6 -3 d 7 -5 d 6 -4 d 7 -3 d 6 -5 d 7 -4 d 6 1 d 7 -7 d 6 -2 d 7 -1 d 6 -4 d 7 -2 d 6 -3 d 7 -2 d 6 -3 d 6 -3 d 7 -1 d 6 -2 d 7 -3 d 6 -1 d 7 -3 d 6 X 7 -3 d 6 -1 d 7 -2 d 6 X 7 -2
 d 6 -1 d 7 -1 d 6 -1 d 6 X 7 -2 d 6 -1 d 7 X 6 -1 d 4 -1 d 223 X -227 X -6 1 d -7 X -6 1 d -7 2 d -6 X -6 1 d -7 1 d -6 1 d -7 1 d -6 1 d -7 2 d -6 1 d -7 3 d -6 -1 d -7 4 d -6 X -7 3 d -6 2 d -7 1 d -6 4 d -6 2 d -7 2 d -6 3 d -7 2 d -6 4 d -7 1 d
 -6 2 d -7 6 d -6 X -7 4 d -6 4 d -7 3 d -6 5 d -7 4 d -6 3 d -6 4 d -7 6 d -6 X -7 8 d -6 3 d -7 6 d -6 X -7 9 d -6 4 d -7 5 d -6 9 d -7 3 d -6 5 d -6 8 d -7 5 d -6 7 d -7 6 d -6 7 d -7 6 d -6 7 d -7 7 d -6 3 d -7 12 d -6 5 d -7 13 d -6 8 d -7 5 d
 -6 4 d -6 15 d -7 1 d -6 11 d -7 9 d -6 8 d -7 13 d -6 6 d -7 9 d -6 11 d -7 7 d -6 14 d -7 5 d -6 -1 d -7 20 d -6 5 d -6 15 d -7 6 d -6 10 d -7 9 d -6 18 d -7 6 d -6 9 d -7 11 d -6 5 d -7 14 d -6 11 d -7 10 d -6 14 d -6 5 d -7 4 d -6 21 d -7 5 d -6
 22 d -7 4 d -6 X -7 19 d -6 9 d -7 11 d -6 11 d -7 10 d -6 11 d -7 5 d -6 10 d -6 6 d -7 16 d -6 16 d -7 3 d -6 15 d -7 -4 d -6 19 d -7 11 d -6 4 d -7 10 d -6 5 d -7 21 d -6 -5 d -7 20 d -6 15 d -6 -8 d -7 14 d -6 6 d -7 5 d -6 22 d -7 10 d -6 3 d
 -7 7 d -6 14 d -7 -9 d -6 10 d -7 6 d -6 14 d -6 11 d -7 11 d -6 1 d -7 -2 d -6 21 d -7 -5 d -6 -5 d -7 23 d -6 -9 d -7 4 d -6 7 d -7 4 d -6 X -7 16 d -6 1 d -6 19 d -7 -15 d -6 -14 d -7 4 d -6 2 d -7 -4 d -6 20 d -7 -11 d -6 2 d -7 -6 d -6 -6 d -7
 20 d -6 -29 d -7 4 d -6 1 d -6 -27 d -7 -23 d -6 32 d -7 -10 d -6 -32 d -7 -12 d -6 -4 d -7 -26 d -6 24 d -7 -45 d -6 14 d -7 -21 d -6 -22 d -6 -21 d -7 -2 d -6 -5 d -7 -49 d -6 11 d -7 -27 d -6 -24 d -7 -24 d -6 -12 d -7 -14 d -6 -28 d -7 -14 d -6
 -13 d -7 -2 d -6 -32 d -6 -11 d -7 -37 d -6 14 d -7 -21 d -6 -4 d -7 -27 d -6 -7 d -7 17 d -6 -13 d -7 -41 d -6 -9 d -7 -7 d -6 -81 d -7 -8 d -6 -14 d -6 -16 d -7 -88 d -6 -8 d -7 -50 d -6 -38 d -7 -21 d -6 -16 d -7 -22 d -6 -14 d -7 -22 d -6 -10 d
 -7 -5 d -129 X FA black 1 1 1 c black 245 235 m 136 X 3 Y 6 X 8 Y 7 X 9 Y 6 X 16 Y 7 X 5 Y 6 X 18 Y 6 X 13 Y 7 X 21 Y 6 X 25 Y 7 X 39 Y 6 X 35 Y 7 X 19 Y 6 X 32 Y 7 X 11 Y 6 X 52 Y 7 X 45 Y 6 X 45 Y 7 X 62 Y 6 X 36 Y 7 X 30 Y 6 X 26 Y 6 X 51 Y 7 X
 27 Y 6 X 52 Y 7 X -4 Y 6 X 62 Y 7 X 20 Y 6 X 46 Y 7 X -1 Y 6 X 15 Y 7 X 17 Y 6 X 35 Y 7 X 16 Y 6 X 13 Y 6 X 29 Y 7 X 31 Y 6 X 34 Y 7 X -18 Y 6 X 65 Y 7 X 3 Y 6 X -1 Y 7 X 27 Y 6 X 26 Y 7 X 28 Y 6 X -25 Y 7 X 59 Y 6 X -36 Y 7 X 33 Y 6 X 3 Y 6 X 14 Y
 7 X 40 Y 6 X 9 Y 7 X -44 Y 6 X 27 Y 7 X 33 Y 6 X -4 Y 7 X -10 Y 6 X 36 Y 7 X -29 Y 6 X 5 Y 7 X 3 Y 6 X -6 Y 7 X 13 Y 6 X -27 Y 6 X 3 Y 7 X -8 Y 6 X -6 Y 7 X 12 Y 6 X 19 Y 7 X -28 Y 6 X -3 Y 7 X -24 Y 6 X -2 Y 7 X -9 Y 6 X -12 Y 7 X -6 Y 6 X 10 Y 6 X
 -33 Y 7 X 3 Y 6 X 2 Y 7 X -29 Y 6 X 2 Y 7 X -4 Y 6 X -16 Y 7 X -17 Y 6 X -18 Y 7 X -9 Y 6 X -15 Y 7 X 7 Y 6 X -18 Y 7 X -12 Y 6 X -5 Y 6 X -14 Y 7 X -30 Y 6 X -8 Y 7 X -8 Y 6 X -18 Y 7 X 7 Y 6 X -20 Y 7 X -26 Y 6 X 5 Y 7 X -25 Y 6 X -8 Y 7 X -15 Y 6
 X -5 Y 7 X -15 Y 6 X -24 Y 6 X 3 Y 7 X -19 Y 6 X -4 Y 7 X -19 Y 6 X -22 Y 7 X -8 Y 6 X -12 Y 7 X -7 Y 6 X -14 Y 7 X -15 Y 6 X -11 Y 7 X -14 Y 6 X -12 Y 6 X -21 Y 7 X -1 Y 6 X -6 Y 7 X -26 Y 6 X -6 Y 7 X -24 Y 6 X -5 Y 7 X -7 Y 6 X -17 Y 7 X -12 Y 6
 X -12 Y 7 X -16 Y 6 X -7 Y 7 X -13 Y 6 X -10 Y 6 X -8 Y 7 X -19 Y 6 X -10 Y 7 X -11 Y 6 X -8 Y 7 X -17 Y 6 X -5 Y 7 X -20 Y 6 X -1 Y 7 X -7 Y 6 X -14 Y 7 X -8 Y 6 X -11 Y 7 X -10 Y 6 X -6 Y 6 X -15 Y 7 X -10 Y 6 X -8 Y 7 X -12 Y 6 X -2 Y 7 X -13 Y 6
 X -6 Y 7 X -6 Y 6 X -8 Y 7 X -13 Y 6 X -5 Y 7 X -12 Y 6 X -4 Y 6 X -7 Y 7 X -6 Y 6 X -8 Y 7 X -6 Y 6 X -7 Y 7 X -7 Y 6 X -5 Y 7 X -8 Y 6 X -5 Y 7 X -3 Y 6 X -7 Y 7 X -7 Y 6 X -3 Y 7 X -8 Y 6 X -2 Y 6 X -5 Y 7 X -3 Y 6 X -7 Y 13 X -6 Y 7 X -4 Y 6 X
 -2 Y 7 X -5 Y 6 X -4 Y 7 X -2 Y 6 X -5 Y 7 X -3 Y 6 X -1 Y 7 X -5 Y 6 X -2 Y 6 X -2 Y 7 X -3 Y 6 X -2 Y 7 X -3 Y 6 X -2 Y 7 X -2 Y 6 X -3 Y 13 X -2 Y 7 X -2 Y 6 X -2 Y 7 X -2 Y 12 X -3 Y 7 X -1 Y 6 X -1 Y 7 X -1 Y 6 X -1 Y 7 X -1 Y 6 X -1 Y 7 X -1 Y
 6 X -1 Y 7 X -1 Y 6 X -1 Y 13 X -1 Y 7 X -1 Y 6 X -1 Y 19 X -1 Y 7 X -1 Y 6 X -1 Y 20 X -1 Y 19 X -1 Y 32 X -1 Y 33 X -1 Y 84 X s 248 235 m20 255 235 m20 261 235 m20 268 235 m20 274 235 m20 280 235 m20 287 235 m20 293 235 m20 300 235 m20 306 235 m20
 313 235 m20 319 235 m20 326 235 m20 332 235 m20 339 235 m20 345 235 m20 352 235 m20 358 235 m20 365 235 m20 371 235 m20 377 235 m20 384 238 m20 390 246 m20 397 255 m20 403 271 m20 410 276 m20 416 294 m20 423 307 m20 429 328 m20 436 353 m20 442 392
 m20 449 427 m20 455 446 m20 461 478 m20 468 489 m20 474 541 m20 481 586 m20 487 631 m20 494 693 m20 500 729 m20 507 759 m20 513 785 m20 520 836 m20 526 863 m20 533 915 m20 539 911 m20 546 973 m20 552 993 m20 558 1039 m20 565 1038 m20 571 1053 m20
 578 1070 m20 584 1105 m20 591 1121 m20 597 1134 m20 604 1163 m20 610 1194 m20 617 1228 m20 623 1210 m20 630 1275 m20 636 1278 m20 643 1277 m20 649 1304 m20 655 1330 m20 662 1358 m20 668 1333 m20 675 1392 m20 681 1356 m20 688 1389 m20 694 1392 m20
 701 1406 m20 707 1446 m20 714 1455 m20 720 1411 m20 727 1438 m20 733 1471 m20 739 1467 m20 746 1457 m20 752 1493 m20 759 1464 m20 765 1469 m20 772 1472 m20 778 1466 m20 785 1479 m20 791 1452 m20 798 1455 m20 804 1447 m20 811 1441 m20 817 1453 m20
 824 1472 m20 830 1444 m20 836 1441 m20 843 1417 m20 849 1415 m20 856 1406 m20 862 1394 m20 869 1388 m20 875 1398 m20 882 1365 m20 888 1368 m20 895 1370 m20 901 1341 m20 908 1343 m20 914 1339 m20 921 1323 m20 927 1306 m20 933 1288 m20 940 1279 m20
 946 1264 m20 953 1271 m20 959 1253 m20 966 1241 m20 972 1236 m20 979 1222 m20 985 1192 m20 992 1184 m20 998 1176 m20 1005 1158 m20 1011 1165 m20 1017 1145 m20 1024 1119 m20 1030 1124 m20 1037 1099 m20 1043 1091 m20 1050 1076 m20 1056 1071 m20 1063
 1056 m20 1069 1032 m20 1076 1035 m20 1082 1016 m20 1089 1012 m20 1095 993 m20 1102 971 m20 1108 963 m20 1114 951 m20 1121 944 m20 1127 930 m20 1134 915 m20 1140 904 m20 1147 890 m20 1153 878 m20 1160 857 m20 1166 856 m20 1173 850 m20 1179 824 m20
 1186 818 m20 1192 794 m20 1199 789 m20 1205 782 m20 1211 765 m20 1218 753 m20 1224 741 m20 1231 725 m20 1237 718 m20 1244 705 m20 1250 695 m20 1257 687 m20 1263 668 m20 1270 658 m20 1276 647 m20 1283 639 m20 1289 622 m20 1295 617 m20 1302 597 m20
 1308 596 m20 1315 589 m20 1321 575 m20 1328 567 m20 1334 556 m20 1341 546 m20 1347 540 m20 1354 525 m20 1360 515 m20 1367 507 m20 1373 495 m20 1380 493 m20 1386 480 m20 1392 474 m20 1399 468 m20 1405 460 m20 1412 447 m20 1418 442 m20 1425 430 m20
 1431 426 m20 1438 419 m20 1444 413 m20 1451 405 m20 1457 399 m20 1464 392 m20 1470 385 m20 1477 380 m20 1483 372 m20 1489 367 m20 1496 364 m20 1502 357 m20 1509 350 m20 1515 347 m20 1522 339 m20 1528 337 m20 1535 332 m20 1541 329 m20 1548 322 m20
 1554 322 m20 1561 316 m20 1567 312 m20 1573 310 m20 1580 305 m20 1586 301 m20 1593 299 m20 1599 294 m20 1606 291 m20 1612 290 m20 1619 285 m20 1625 283 m20 1632 281 m20 1638 278 m20 1645 276 m20 1651 273 m20 1658 271 m20 1664 269 m20 1670 266 m20
 1677 266 m20 1683 264 m20 1690 262 m20 1696 260 m20 1703 258 m20 1709 258 m20 1716 255 m20 1722 254 m20 1729 253 m20 1735 252 m20 1742 251 m20 1748 250 m20 1755 249 m20 1761 248 m20 1767 247 m20 1774 246 m20 1780 245 m20 1787 245 m20 1793 244 m20
 1800 243 m20 1806 242 m20 1813 242 m20 1819 242 m20 1826 241 m20 1832 240 m20 1839 239 m20 1845 239 m20 1851 239 m20 1858 238 m20 1864 238 m20 1871 238 m20 1877 237 m20 1884 237 m20 1890 237 m20 1897 237 m20 1903 237 m20 1910 236 m20 1916 236 m20
 1923 236 m20 1929 236 m20 1936 236 m20 1942 235 m20 1948 235 m20 1955 235 m20 1961 235 m20 1968 235 m20 1974 235 m20 1981 235 m20 1987 235 m20 1994 235 m20 2000 235 m20 2007 235 m20 2013 235 m20 2020 235 m20 cs 0 0 0 P13 setcolor 248 235 m 123 X 6 1
 d 7 3 d 6 9 d 7 10 d 6 17 d 7 5 d 6 20 d 7 12 d 6 22 d 7 26 d 6 41 d 7 36 d 6 19 d 6 33 d 7 10 d 6 55 d 7 45 d 6 46 d 7 63 d 6 37 d 7 30 d 6 26 d 7 51 d 6 27 d 7 53 d 6 -5 d 7 63 d 6 20 d 6 45 d 7 -1 d 6 15 d 7 16 d 6 35 d 7 16 d 6 12 d 7 30 d 6 31
 d 7 33 d 6 -17 d 7 65 d 6 2 d 7 -1 d 6 27 d 6 26 d 7 29 d 6 -26 d 7 59 d 6 -37 d 7 33 d 6 3 d 7 13 d 6 41 d 7 9 d 6 -45 d 7 27 d 6 33 d 6 -4 d 7 -10 d 6 36 d 7 -29 d 6 5 d 7 3 d 6 -7 d 7 13 d 6 -28 d 7 3 d 6 -7 d 7 -6 d 6 12 d 7 18 d 6 -28 d 6 -3 d
 7 -24 d 6 -2 d 7 -10 d 6 -11 d 7 -7 d 6 10 d 7 -33 d 6 3 d 7 2 d 6 -29 d 7 1 d 6 -4 d 7 -15 d 6 -18 d 6 -18 d 7 -9 d 6 -15 d 7 7 d 6 -18 d 7 -12 d 6 -6 d 7 -14 d 6 -30 d 7 -8 d 6 -8 d 7 -18 d 6 6 d 6 -20 d 7 -26 d 6 5 d 7 -25 d 6 -8 d 7 -15 d 6 -5 d
 7 -15 d 6 -24 d 7 3 d 6 -20 d 7 -4 d 6 -19 d 7 -21 d 6 -9 d 6 -12 d 7 -7 d 6 -14 d 7 -15 d 6 -11 d 7 -14 d 6 -12 d 7 -22 d 6 -1 d 7 -6 d 6 -26 d 7 -5 d 6 -25 d 7 -5 d 6 -7 d 6 -17 d 7 -12 d 6 -12 d 7 -16 d 6 -7 d 7 -13 d 6 -10 d 7 -8 d 6 -20 d 7 -10
 d 6 -10 d 7 -9 d 6 -17 d 6 -4 d 7 -21 d 6 -1 d 7 -7 d 6 -14 d 7 -9 d 6 -10 d 7 -10 d 6 -7 d 7 -14 d 6 -11 d 7 -8 d 6 -12 d 7 -2 d 6 -13 d 6 -6 d 7 -6 d 6 -8 d 7 -13 d 6 -5 d 7 -12 d 6 -4 d 7 -7 d 6 -6 d 7 -8 d 6 -6 d 7 -8 d 6 -6 d 7 -5 d 6 -8 d 6 -5
 d 7 -4 d 6 -7 d 7 -6 d 6 -4 d 7 -8 d 6 -1 d 7 -6 d 6 -3 d 7 -7 d 6 X 7 -6 d 6 -4 d 6 -2 d 7 -5 d 6 -4 d 7 -2 d 6 -5 d 7 -3 d 6 -1 d 7 -5 d 6 -3 d 7 -1 d 6 -4 d 7 -1 d 6 -3 d 7 -2 d 6 -2 d 6 -3 d 7 -1 d 6 -2 d 7 -2 d 6 -1 d 7 -2 d 6 -1 d 7 -2 d 6 -2
 d 7 -1 d 6 -1 d 7 -1 d 6 -1 d 7 -1 d 6 -1 d 6 X 7 -2 d 6 X 7 -1 d 6 -1 d 7 -1 d 6 -1 d 13 X 7 -1 d 6 -1 d 7 X 6 -1 d 6 X 7 -1 d 19 X 7 -1 d 19 X 7 -1 d 32 X 6 -1 d 72 X -78 X -6 1 d -33 X -6 1 d -26 X -7 1 d -6 X -7 1 d -12 X -7 1 d -6 1 d -13 X -7
 1 d -6 X -7 1 d -6 2 d -7 X -6 1 d -7 1 d -6 1 d -6 1 d -7 X -6 1 d -7 2 d -6 X -7 1 d -6 2 d -7 2 d -6 1 d -7 2 d -6 1 d -7 2 d -6 2 d -7 1 d -6 2 d -6 3 d -7 2 d -6 2 d -7 2 d -6 3 d -7 2 d -6 2 d -7 6 d -6 X -7 3 d -6 5 d -7 2 d -6 4 d -7 5 d -6
 2 d -6 4 d -7 5 d -6 1 d -7 7 d -6 3 d -7 5 d -6 2 d -7 7 d -6 4 d -7 6 d -6 7 d -7 4 d -6 5 d -6 8 d -7 5 d -6 6 d -7 7 d -6 7 d -7 7 d -6 6 d -7 7 d -6 4 d -7 12 d -6 5 d -7 13 d -6 7 d -7 6 d -6 7 d -6 12 d -7 3 d -6 11 d -7 8 d -6 10 d -7 15 d
 -6 6 d -7 10 d -6 11 d -7 8 d -6 14 d -7 7 d -6 1 d -7 20 d -6 5 d -6 17 d -7 8 d -6 10 d -7 10 d -6 20 d -7 7 d -6 10 d -7 13 d -6 7 d -7 16 d -6 12 d -7 12 d -6 16 d -6 7 d -7 5 d -6 25 d -7 5 d -6 26 d -7 6 d -6 1 d -7 21 d -6 12 d -7 14 d -6 11
 d -7 15 d -6 13 d -7 7 d -6 12 d -6 9 d -7 21 d -6 19 d -7 4 d -6 19 d -7 -3 d -6 24 d -7 14 d -6 6 d -7 14 d -6 9 d -7 24 d -6 -5 d -7 26 d -6 20 d -6 -7 d -7 18 d -6 8 d -7 8 d -6 29 d -7 14 d -6 6 d -7 12 d -6 17 d -7 -7 d -6 15 d -7 9 d -6 18 d
 -6 17 d -7 15 d -6 4 d -7 -1 d -6 28 d -7 -2 d -6 -3 d -7 33 d -6 -10 d -7 6 d -6 11 d -7 9 d -6 2 d -7 24 d -6 3 d -6 27 d -7 -18 d -6 -12 d -7 6 d -6 7 d -7 -3 d -6 27 d -7 -13 d -6 6 d -7 -3 d -6 -5 d -7 28 d -6 -35 d -7 9 d -6 3 d -6 -32 d -7
 -27 d -6 43 d -7 -10 d -6 -39 d -7 -14 d -6 -4 d -7 -32 d -6 35 d -7 -58 d -6 24 d -7 -28 d -6 -26 d -6 -27 d -7 X -6 -3 d -7 -64 d -6 17 d -7 -33 d -6 -31 d -7 -30 d -6 -13 d -7 -16 d -6 -35 d -7 -17 d -6 -16 d -7 X -6 -45 d -6 -21 d -7 -61 d -6 3
 d -7 -52 d -6 -27 d -7 -50 d -6 -26 d -7 -30 d -6 -35 d -7 -61 d -6 -44 d -7 -44 d -6 -50 d -7 -12 d -6 -31 d -6 -19 d -7 -34 d -6 -38 d -7 -23 d -6 -21 d -7 -12 d -6 -17 d -7 -5 d -6 -15 d -7 -8 d -6 -7 d -7 -2 d -129 X FA 0.8 0 0 c 1 1 1 c 1 0 0 c
 0.8 0 0 c 245 235 m 149 X 1 Y 19 X 1 Y 6 X 1 Y 7 X 1 Y 6 X 1 Y 7 X 2 Y 6 X 2 Y 7 X 2 Y 6 X 1 Y 7 X 3 Y 6 X 3 Y 7 X 2 Y 6 X 3 Y 7 X 3 Y 6 X 4 Y 7 X 3 Y 6 X 3 Y 6 X 5 Y 7 X 2 Y 6 X 5 Y 7 X 4 Y 6 X 4 Y 7 X 4 Y 6 X 6 Y 7 X 4 Y 6 X 4 Y 7 X 4 Y 6 X 5 Y 7
 X 5 Y 6 X 5 Y 6 X 5 Y 7 X 5 Y 6 X 6 Y 7 X 1 Y 6 X 7 Y 7 X 5 Y 6 X 4 Y 7 X 6 Y 6 X 4 Y 7 X 4 Y 6 X 4 Y 7 X 7 Y 6 X 1 Y 7 X 6 Y 6 X 3 Y 6 X 4 Y 7 X 7 Y 6 X 5 Y 7 X -2 Y 6 X 6 Y 7 X 7 Y 6 X 3 Y 7 X 3 Y 6 X 7 Y 13 X 4 Y 7 X 5 Y 6 X 3 Y 7 X 3 Y 6 X -1 Y
 6 X 3 Y 7 X 3 Y 6 X 2 Y 7 X 7 Y 6 X 4 Y 13 X 1 Y 13 X 2 Y 7 X 2 Y 6 X 1 Y 7 X 1 Y 6 X 5 Y 6 X -3 Y 7 X 4 Y 6 X 4 Y 7 X -2 Y 6 X 2 Y 7 X 2 Y 13 X -1 Y 6 X -1 Y 20 X 5 Y 6 X -3 Y 13 X 2 Y 6 X -2 Y 7 X -4 Y 6 X 3 Y 7 X -2 Y 6 X -2 Y 7 X 4 Y 6 X -2 Y 7
 X -4 Y 6 X 3 Y 7 X -6 Y 6 X 1 Y 7 X -2 Y 13 X -1 Y 6 X -4 Y 6 X 3 Y 7 X -3 Y 13 X -4 Y 6 X -4 Y 7 X -1 Y 6 X -2 Y 13 X -2 Y 7 X -3 Y 6 X -2 Y 7 X -3 Y 6 X -2 Y 6 X -5 Y 7 X 1 Y 13 X -7 Y 6 X 1 Y 7 X -8 Y 13 X -1 Y 6 X -5 Y 7 X -3 Y 6 X -1 Y 7 X -6 Y
 6 X -1 Y 7 X -4 Y 6 X -1 Y 6 X -2 Y 7 X -5 Y 6 X -3 Y 7 X -3 Y 6 X -3 Y 7 X -5 Y 6 X 1 Y 7 X -7 Y 13 X -2 Y 6 X -3 Y 7 X -3 Y 6 X -4 Y 7 X -2 Y 6 X -1 Y 6 X -6 Y 7 X -4 Y 6 X -1 Y 7 X -5 Y 6 X -1 Y 7 X -3 Y 6 X -2 Y 7 X -2 Y 6 X -2 Y 7 X -6 Y 6 X -1
 Y 7 X -5 Y 6 X -1 Y 6 X -2 Y 7 X -2 Y 6 X -3 Y 7 X -2 Y 6 X -4 Y 7 X -2 Y 6 X -1 Y 7 X -4 Y 6 X -2 Y 7 X -1 Y 6 X -2 Y 7 X -3 Y 6 X -1 Y 7 X -3 Y 6 X -2 Y 6 X -2 Y 13 X -3 Y 7 X -1 Y 6 X -3 Y 7 X -1 Y 6 X -1 Y 7 X -2 Y 6 X -2 Y 13 X -3 Y 7 X -1 Y 13
 X -3 Y 6 X -1 Y 6 X -1 Y 7 X -2 Y 13 X -2 Y 6 X -1 Y 7 X -1 Y 6 X -1 Y 13 X -1 Y 7 X -1 Y 6 X -1 Y 7 X -1 Y 6 X -1 Y 6 X -1 Y 7 X -1 Y 13 X -1 Y 6 X -1 Y 13 X -1 Y 13 X -1 Y 7 X -1 Y 13 X -1 Y 13 X -1 Y 12 X -1 Y 20 X -1 Y 6 X -1 Y 7 X 1 Y 6 X -2 Y
 7 X 1 Y 6 X -1 Y 7 X 1 Y 6 X -1 Y 7 X -1 Y 25 X -1 Y 20 X -1 Y 32 X -1 Y 26 X -1 Y 39 X s 1 0 0 c 248 235 m20 255 235 m20 261 235 m20 268 235 m20 274 235 m20 280 235 m20 287 235 m20 293 235 m20 300 235 m20 306 235 m20 313 235 m20 319 235 m20 326 235
 m20 332 235 m20 339 235 m20 345 235 m20 352 235 m20 358 235 m20 365 235 m20 371 235 m20 377 235 m20 384 235 m20 390 235 m20 397 236 m20 403 236 m20 410 236 m20 416 237 m20 423 238 m20 429 239 m20 436 240 m20 442 242 m20 449 244 m20 455 246 m20 461
 247 m20 468 250 m20 474 253 m20 481 255 m20 487 258 m20 494 261 m20 500 265 m20 507 268 m20 513 271 m20 520 276 m20 526 278 m20 533 283 m20 539 287 m20 546 291 m20 552 295 m20 558 301 m20 565 305 m20 571 309 m20 578 313 m20 584 318 m20 591 323 m20
 597 328 m20 604 333 m20 610 338 m20 617 344 m20 623 345 m20 630 352 m20 636 357 m20 643 361 m20 649 367 m20 655 371 m20 662 375 m20 668 379 m20 675 386 m20 681 387 m20 688 393 m20 694 396 m20 701 400 m20 707 407 m20 714 412 m20 720 410 m20 727 416
 m20 733 423 m20 739 426 m20 746 429 m20 752 436 m20 759 436 m20 765 440 m20 772 445 m20 778 448 m20 785 451 m20 791 450 m20 798 453 m20 804 456 m20 811 458 m20 817 465 m20 824 469 m20 830 469 m20 836 470 m20 843 470 m20 849 472 m20 856 474 m20 862
 475 m20 869 476 m20 875 481 m20 882 478 m20 888 482 m20 895 486 m20 901 484 m20 908 486 m20 914 488 m20 921 488 m20 927 487 m20 933 486 m20 940 486 m20 946 486 m20 953 491 m20 959 488 m20 966 488 m20 972 490 m20 979 488 m20 985 484 m20 992 487 m20
 998 485 m20 1005 483 m20 1011 487 m20 1017 485 m20 1024 481 m20 1030 484 m20 1037 478 m20 1043 479 m20 1050 477 m20 1056 477 m20 1063 476 m20 1069 472 m20 1076 475 m20 1082 472 m20 1089 472 m20 1095 468 m20 1102 464 m20 1108 463 m20 1114 461 m20
 1121 461 m20 1127 459 m20 1134 456 m20 1140 454 m20 1147 451 m20 1153 449 m20 1160 444 m20 1166 445 m20 1173 445 m20 1179 438 m20 1186 439 m20 1192 431 m20 1199 431 m20 1205 430 m20 1211 425 m20 1218 422 m20 1224 421 m20 1231 415 m20 1237 414 m20
 1244 410 m20 1250 409 m20 1257 407 m20 1263 402 m20 1270 399 m20 1276 396 m20 1283 393 m20 1289 388 m20 1295 389 m20 1302 382 m20 1308 382 m20 1315 380 m20 1321 377 m20 1328 374 m20 1334 370 m20 1341 368 m20 1347 367 m20 1354 361 m20 1360 357 m20
 1367 356 m20 1373 351 m20 1380 350 m20 1386 347 m20 1392 345 m20 1399 343 m20 1405 341 m20 1412 335 m20 1418 334 m20 1425 329 m20 1431 328 m20 1438 326 m20 1444 324 m20 1451 321 m20 1457 319 m20 1464 315 m20 1470 313 m20 1477 312 m20 1483 308 m20
 1489 306 m20 1496 305 m20 1502 303 m20 1509 300 m20 1515 299 m20 1522 296 m20 1528 294 m20 1535 292 m20 1541 292 m20 1548 289 m20 1554 288 m20 1561 285 m20 1567 284 m20 1573 283 m20 1580 281 m20 1586 279 m20 1593 279 m20 1599 276 m20 1606 275 m20
 1612 275 m20 1619 272 m20 1625 271 m20 1632 270 m20 1638 268 m20 1645 268 m20 1651 266 m20 1658 265 m20 1664 264 m20 1670 263 m20 1677 263 m20 1683 262 m20 1690 261 m20 1696 260 m20 1703 259 m20 1709 258 m20 1716 257 m20 1722 256 m20 1729 256 m20
 1735 255 m20 1742 254 m20 1748 254 m20 1755 253 m20 1761 253 m20 1767 252 m20 1774 251 m20 1780 251 m20 1787 250 m20 1793 250 m20 1800 249 m20 1806 249 m20 1813 248 m20 1819 248 m20 1826 248 m20 1832 247 m20 1839 246 m20 1845 247 m20 1851 245 m20
 1858 246 m20 1864 245 m20 1871 246 m20 1877 245 m20 1884 244 m20 1890 244 m20 1897 244 m20 1903 244 m20 1910 243 m20 1916 243 m20 1923 243 m20 1929 242 m20 1936 242 m20 1942 242 m20 1948 242 m20 1955 242 m20 1961 241 m20 1968 241 m20 1974 241 m20
 1981 241 m20 1987 240 m20 1994 240 m20 2000 240 m20 2007 240 m20 2013 240 m20 2020 240 m20 0.8 0 0 c black 0.8 0 0 c cs 0.8 0 0 P13 setcolor 248 235 m 142 X 7 1 d 6 X 7 1 d 6 X 7 1 d 6 1 d 7 1 d 6 2 d 7 2 d 6 2 d 6 1 d 7 3 d 6 3 d 7 3 d 6 2 d 7 4 d
 6 3 d 7 3 d 6 3 d 7 5 d 6 3 d 7 5 d 6 3 d 7 4 d 6 5 d 6 6 d 7 4 d 6 4 d 7 4 d 6 5 d 7 5 d 6 5 d 7 5 d 6 5 d 7 6 d 6 2 d 7 6 d 6 5 d 7 4 d 6 6 d 6 5 d 7 3 d 6 5 d 7 6 d 6 2 d 7 5 d 6 3 d 7 5 d 6 6 d 7 5 d 6 -1 d 7 6 d 6 6 d 6 3 d 7 4 d 6 7 d 7 -1 d 6
 4 d 7 5 d 6 4 d 7 3 d 6 -1 d 7 2 d 6 4 d 7 1 d 6 8 d 7 4 d 6 X 6 1 d 7 X 6 2 d 7 2 d 6 1 d 7 X 6 5 d 7 -2 d 6 4 d 7 4 d 6 -3 d 7 3 d 6 2 d 7 X 6 -1 d 6 -1 d 7 X 6 -1 d 7 6 d 6 -4 d 7 1 d 6 2 d 7 -2 d 6 -4 d 7 3 d 6 -3 d 7 -1 d 6 4 d 6 -2 d 7 -4 d 6
 2 d 7 -5 d 6 X 7 -1 d 6 X 7 -1 d 6 -4 d 7 3 d 6 -3 d 7 X 6 -5 d 7 -3 d 6 -2 d 6 -1 d 7 -1 d 6 -1 d 7 -3 d 6 -3 d 7 -2 d 6 -3 d 7 -4 d 6 1 d 7 X 6 -8 d 7 1 d 6 -7 d 7 X 6 -2 d 6 -5 d 7 -2 d 6 -2 d 7 -6 d 6 X 7 -4 d 6 -2 d 7 -2 d 6 -5 d 7 -2 d 6 -4 d
 7 -2 d 6 -5 d 6 X 7 -7 d 6 X 7 -1 d 6 -4 d 7 -3 d 6 -3 d 7 -3 d 6 -1 d 7 -6 d 6 -4 d 7 -1 d 6 -5 d 7 -1 d 6 -2 d 6 -3 d 7 -2 d 6 -2 d 7 -6 d 6 -1 d 7 -5 d 6 -1 d 7 -2 d 6 -2 d 7 -3 d 6 -2 d 7 -4 d 6 -2 d 7 -2 d 6 -3 d 6 -2 d 7 -1 d 6 -2 d 7 -4 d 6 X
 7 -3 d 6 -2 d 7 -2 d 6 -1 d 7 -2 d 6 -1 d 7 -3 d 6 -1 d 6 -1 d 7 -2 d 6 -2 d 7 X 6 -4 d 7 X 6 -1 d 7 -2 d 6 -2 d 7 -1 d 6 -1 d 7 -1 d 6 -1 d 7 -1 d 6 -2 d 6 -1 d 7 X 6 -1 d 7 -1 d 6 -1 d 7 -1 d 6 X 7 -1 d 6 -2 d 13 X 7 -1 d 6 -1 d 7 X 6 -1 d 6 -1 d
 13 X 7 -1 d 6 -1 d 7 -1 d 6 X 7 -1 d 6 1 d 7 -1 d 6 X 7 -1 d 6 X 6 -1 d 7 X 6 -1 d 7 1 d 6 -1 d 7 -1 d 19 X 7 -1 d 13 X 6 -1 d 32 X 7 -1 d 19 X 7 -1 d 6 1 d 7 -1 d 13 X -33 X -6 1 d -20 X -6 1 d -7 -1 d -6 1 d -6 -1 d -7 1 d -6 1 d -7 -1 d -6 1 d -7
 X -6 1 d -13 X -7 1 d -13 X -6 1 d -7 -1 d -6 1 d -6 X -7 1 d -6 X -7 1 d -13 X -6 1 d -7 X -6 1 d -7 1 d -13 X -6 1 d -6 1 d -7 X -6 1 d -7 1 d -13 X -6 2 d -7 1 d -6 1 d -7 X -6 1 d -7 1 d -6 1 d -7 X -6 1 d -6 2 d -7 1 d -6 1 d -7 1 d -6 1 d -7 1
 d -6 1 d -7 3 d -6 1 d -7 X -6 3 d -7 1 d -6 2 d -7 2 d -6 1 d -6 1 d -7 2 d -6 1 d -7 3 d -6 X -7 2 d -6 2 d -7 3 d -6 1 d -7 3 d -6 2 d -7 1 d -6 3 d -6 3 d -7 1 d -6 2 d -7 4 d -6 2 d -7 3 d -6 2 d -7 3 d -6 X -7 5 d -6 1 d -7 6 d -6 2 d -7 2 d
 -6 2 d -6 3 d -7 1 d -6 4 d -7 2 d -6 4 d -7 5 d -6 2 d -7 2 d -6 4 d -7 3 d -6 3 d -7 2 d -6 -1 d -7 7 d -6 X -6 5 d -7 3 d -6 3 d -7 2 d -6 6 d -7 1 d -6 2 d -7 4 d -6 1 d -7 5 d -6 2 d -7 2 d -6 5 d -6 1 d -7 1 d -6 7 d -7 -1 d -6 8 d -7 X -6 -1
 d -7 4 d -6 3 d -7 2 d -6 3 d -7 2 d -6 2 d -7 X -6 2 d -6 1 d -7 4 d -6 4 d -7 X -6 3 d -7 -3 d -6 4 d -7 1 d -6 1 d -7 1 d -6 -1 d -7 6 d -6 -3 d -7 4 d -6 2 d -6 -4 d -7 2 d -6 2 d -7 -3 d -6 4 d -7 2 d -6 -2 d -7 X -6 3 d -7 -5 d -13 X -6 1 d -6
 1 d -7 1 d -6 -3 d -7 -2 d -6 2 d -7 -4 d -6 -3 d -7 2 d -6 -5 d -7 X -6 -1 d -7 -2 d -6 -2 d -7 X -6 -2 d -6 1 d -7 -5 d -6 -7 d -7 -1 d -6 -4 d -7 -2 d -6 X -7 -3 d -6 -3 d -7 -5 d -6 -4 d -7 X -6 -6 d -7 -4 d -6 -3 d -6 -6 d -7 -6 d -6 1 d -7 -5
 d -6 -6 d -7 -5 d -6 -3 d -7 -5 d -6 -1 d -7 -7 d -6 -5 d -7 -3 d -6 -5 d -6 -5 d -7 -4 d -6 -5 d -7 -7 d -6 -1 d -7 -6 d -6 -5 d -7 -5 d -6 -5 d -7 -5 d -6 -5 d -7 -4 d -6 -4 d -7 -4 d -6 -6 d -6 -4 d -7 -4 d -6 -4 d -7 -5 d -6 -2 d -7 -5 d -6 -3 d
 -7 -3 d -6 -3 d -7 -4 d -6 -2 d -7 -3 d -6 -2 d -7 -3 d -6 -1 d -6 -2 d -7 -3 d -6 -1 d -7 -1 d -6 -1 d -7 -1 d -6 -1 d -7 X -6 -1 d -149 X FA black 1 1 1 c 556 639 1578 1302 bf black 1578 1302 m 556 X s 2134 1302 m 639 Y s 2134 1941 m -556 X s 1578
 1941 m -639 Y s
 gsave  2222 2133 23 22 C 1716.93 1827.09 t 0 r /Helvetica findfont 95.0544 sf 0 0 m (No Int) show NC gr  0.8 0 0 c 1599 1861 m 97 X s black
 gsave  2222 2133 23 22 C 1716.93 1663.75 t 0 r /Helvetica findfont 95.0544 sf 0 0 m (Add) show NC gr  0.8 0.8 0 c 1599 1702 m 97 X s black
 gsave  2222 2133 23 22 C 1716.93 1504.21 t 0 r /Helvetica findfont 95.0544 sf 0 0 m (Mult) show NC gr  0.8 0 0.8 c 1599 1542 m 97 X s black
 gsave  2222 2133 23 22 C 1716.93 1344.68 t 0 r /Helvetica findfont 95.0544 sf 0 0 m (Central) show NC gr  1599 1382 m 97 X s
 gsave  2222 2133 23 22 C 2199.34 1568.79 t 90 r /Helvetica-BoldOblique findfont 38.0218 sf 0 0 m (LHC HIGGS XS WG 2013) show NC gr 
 gr  gr showpage
end
%%EOF
