%!PS-Adobe-2.0 EPSF-2.0
%%BoundingBox:  0 0 567 544
%%Title: HWW_400_Mll_NNLO_cut_YR3.eps: HWW 400Gev Mll NNLO with cuts
%%Creator: ROOT Version 5.34/05
%%CreationDate: Fri Jun 14 02:56:49 2013
%%EndComments
%%BeginProlog
80 dict begin
/s {stroke} def /l {lineto} def /m {moveto} def /t {translate} def
/r {rotate} def /rl {roll}  def /R {repeat} def
/d {rlineto} def /rm {rmoveto} def /gr {grestore} def /f {eofill} def
/c {setrgbcolor} def /black {0 setgray} def /sd {setdash} def
/cl {closepath} def /sf {scalefont setfont} def /lw {setlinewidth} def
/box {m dup 0 exch d exch 0 d 0 exch neg d cl} def
/NC{systemdict begin initclip end}def/C{NC box clip newpath}def
/bl {box s} def /bf {box f} def /Y { 0 exch d} def /X { 0 d} def 
/K {{pop pop 0 moveto} exch kshow} bind def
/ita {/ang 15 def gsave [1 0 ang dup sin exch cos div 1 0 0] concat} def 
/mp {newpath /y exch def /x exch def} def
/side {[w .77 mul w .23 mul] .385 w mul sd w 0 l currentpoint t -144 r} def
/mr {mp x y w2 0 360 arc} def /m24 {mr s} def /m20 {mr f} def
/mb {mp x y w2 add m w2 neg 0 d 0 w neg d w 0 d 0 w d cl} def
/mt {mp x y w2 add m w2 neg w neg d w 0 d cl} def
/m21 {mb f} def /m25 {mb s} def /m22 {mt f} def /m26{mt s} def
/m23 {mp x y w2 sub m w2 w d w neg 0 d cl f} def
/m27 {mp x y w2 add m w3 neg w2 neg d w3 w2 neg d w3 w2 d cl s} def
/m28 {mp x w2 sub y w2 sub w3 add m w3 0 d  0 w3 neg d w3 0 d 0 w3 d w3 0 d  0 w3 d w3 neg 0 d 0 w3 d w3 neg 0 d 0 w3 neg d w3 neg 0 d cl s } def
/m29 {mp gsave x w2 sub y w2 add w3 sub m currentpoint t 4 {side} repeat cl fill gr} def
/m30 {mp gsave x w2 sub y w2 add w3 sub m currentpoint t 4 {side} repeat cl s gr} def
/m31 {mp x y w2 sub m 0 w d x w2 sub y m w 0 d x w2 sub y w2 add m w w neg d x w2 sub y w2 sub m w w d s} def
/m32 {mp x y w2 sub m w2 w d w neg 0 d cl s} def
/m33 {mp x y w2 add m w3 neg w2 neg d w3 w2 neg d w3 w2 d cl f} def
/m34 {mp x w2 sub y w2 sub w3 add m w3 0 d  0 w3 neg d w3 0 d 0 w3 d w3 0 d  0 w3 d w3 neg 0 d 0 w3 d w3 neg 0 d 0 w3 neg d w3 neg 0 d cl f } def
/m2 {mp x y w2 sub m 0 w d x w2 sub y m w 0 d s} def
/m5 {mp x w2 sub y w2 sub m w w d x w2 sub y w2 add m w w neg d s} def
/reEncode {exch findfont dup length dict begin {1 index /FID eq  {pop pop} {def} ifelse } forall /Encoding exch def currentdict end dup /FontName get exch definefont pop } def [/Times-Bold /Times-Italic /Times-BoldItalic /Helvetica /Helvetica-Oblique
 /Helvetica-Bold /Helvetica-BoldOblique /Courier /Courier-Oblique /Courier-Bold /Courier-BoldOblique /Times-Roman /AvantGarde-Book /AvantGarde-BookOblique /AvantGarde-Demi /AvantGarde-DemiOblique /Bookman-Demi /Bookman-DemiItalic /Bookman-Light
 /Bookman-LightItalic /Helvetica-Narrow /Helvetica-Narrow-Bold /Helvetica-Narrow-BoldOblique /Helvetica-Narrow-Oblique /NewCenturySchlbk-Roman /NewCenturySchlbk-Bold /NewCenturySchlbk-BoldItalic /NewCenturySchlbk-Italic /Palatino-Bold
 /Palatino-BoldItalic /Palatino-Italic /Palatino-Roman ] {ISOLatin1Encoding reEncode } forall
%%EndProlog
%%BeginSetup
%%EndSetup
newpath  gsave  .25 .25 scale  gsave  0 0 t black[  ] 0 sd 3 lw 1 1 1 c 2268 2177 0 0 bf black 1 1 1 c 2222 2133 23 22 bf black 1 1 1 c 1778 1706 245 235 bf black 1778 1706 245 235 bl 0.8 0 0.8 c 1 1 1 c 1 0 1 c 0.8 0 0.8 c 245 319 m 4 X 1 Y 5 X 3 Y
 9 X 1 Y 9 X 3 Y 4 X 3 Y 4 X 1 Y 5 X 2 Y 4 X 7 Y 5 X 1 Y 4 X 8 Y 5 X 5 Y 4 X 12 Y 5 X 8 Y 4 X 7 Y 4 X 8 Y 5 X 15 Y 4 X 9 Y 5 X 13 Y 4 X 6 Y 5 X 21 Y 4 X 23 Y 5 X 13 Y 4 X 22 Y 4 X 16 Y 5 X 25 Y 4 X 31 Y 5 X 18 Y 4 X 26 Y 5 X 39 Y 4 X 35 Y 5 X 18 Y 4
 X 19 Y 4 X 52 Y 5 X 23 Y 4 X 38 Y 5 X 44 Y 4 X 32 Y 5 X 28 Y 4 X 35 Y 5 X 43 Y 4 X 19 Y 4 X 37 Y 5 X 30 Y 4 X 28 Y 5 X 23 Y 4 X 34 Y 5 X 41 Y 4 X 32 Y 5 X 44 Y 4 X 30 Y 4 X 35 Y 5 X 23 Y 4 X 21 Y 5 X 10 Y 4 X 36 Y 5 X 28 Y 4 X 29 Y 5 X 15 Y 4 X 48 Y
 4 X 20 Y 5 X 12 Y 4 X 40 Y 5 X 1 Y 4 X 32 Y 5 X 2 Y 4 X 23 Y 5 X 6 Y 4 X 7 Y 4 X 28 Y 5 X 38 Y 4 X -15 Y 5 X 15 Y 4 X -4 Y 5 X 14 Y 4 X 15 Y 5 X 10 Y 4 X 13 Y 4 X 3 Y 5 X -4 Y 4 X -8 Y 5 X 16 Y 4 X -23 Y 5 X 3 Y 4 X 17 Y 5 X -15 Y 4 X 1 Y 4 X -21 Y
 5 X 26 Y 4 X -26 Y 5 X 22 Y 4 X -68 Y 5 X 46 Y 4 X -33 Y 5 X -26 Y 4 X -5 Y 4 X -20 Y 5 X -4 Y 4 X -35 Y 5 X -25 Y 4 X -5 Y 5 X -28 Y 4 X -9 Y 5 X -32 Y 4 X 9 Y 4 X -10 Y 5 X -38 Y 4 X -33 Y 5 X -14 Y 4 X -20 Y 5 X -26 Y 4 X -33 Y 5 X -8 Y 4 X -38 Y
 5 X -15 Y 4 X -50 Y 4 X -21 Y 5 X -15 Y 4 X -31 Y 5 X -37 Y 4 X -2 Y 5 X -41 Y 4 X -20 Y 5 X -27 Y 4 X -8 Y 4 X -43 Y 5 X -13 Y 4 X -38 Y 5 X -25 Y 4 X -27 Y 5 X -24 Y 4 X -33 Y 5 X -14 Y 4 X -37 Y 4 X -17 Y 5 X -20 Y 4 X -16 Y 5 X -39 Y 4 X -21 Y 5
 X -13 Y 4 X -23 Y 5 X -29 Y 4 X -20 Y 4 X -17 Y 5 X -24 Y 4 X -21 Y 5 X -13 Y 4 X -20 Y 5 X -15 Y 4 X -19 Y 5 X -11 Y 4 X -15 Y 4 X -18 Y 5 X -14 Y 4 X -13 Y 5 X -14 Y 4 X -13 Y 5 X -9 Y 4 X -13 Y 5 X -10 Y 4 X -12 Y 4 X -8 Y 5 X -7 Y 4 X -8 Y 5 X
 -6 Y 4 X -3 Y 5 X -11 Y 4 X -2 Y 5 X -6 Y 4 X -4 Y 4 X -4 Y 5 X -5 Y 4 X -1 Y 5 X -2 Y 4 X -4 Y 5 X -1 Y 4 X -2 Y 5 X -1 Y 4 X -2 Y 4 X -1 Y 5 X -2 Y 4 X -1 Y 14 X -1 Y 9 X -1 Y 4 X -1 Y 9 X 1 Y 4 X -2 Y 31 X -1 Y 5 X 1 Y 4 X -1 Y 14 X -1 Y 4 X 1 Y
 9 X 1 Y 4 X -1 Y 32 X 1 Y 4 X -1 Y 18 X 1 Y 4 X -1 Y 5 X 1 Y 4 X -1 Y 9 X 1 Y 4 X -1 Y 5 X 1 Y 44 X 1 Y 9 X -1 Y 5 X 1 Y 13 X -1 Y 4 X 1 Y 5 X 1 Y 4 X -1 Y 14 X 1 Y 4 X -1 Y 9 X 1 Y 13 X -1 Y 9 X 1 Y 31 X 1 Y 5 X -1 Y 18 X 1 Y 4 X -1 Y 4 X 1 Y 5 X
 -1 Y 27 X 1 Y 8 X -1 Y 5 X 1 Y 40 X -1 Y 4 X 1 Y 9 X 1 Y 5 X -1 Y 17 X 1 Y 9 X -1 Y 5 X 1 Y 9 X -1 Y 4 X 1 Y 18 X -1 Y 4 X 1 Y 9 X -1 Y 5 X 1 Y 164 X 1 Y 5 X -1 Y 13 X 1 Y 4 X -1 Y 23 X 1 Y 4 X -1 Y 4 X 1 Y 5 X -1 Y 9 X 1 Y 4 X -1 Y 9 X 1 Y 5 X -1 Y
 8 X 1 Y 9 X -1 Y 5 X 1 Y 22 X -1 Y 4 X 1 Y 94 X s black 245 235 m 1778 X s
 gsave  2222 2133 23 22 C 2001.82 79.7689 t 0 r /Helvetica findfont 45.6261 sf 0 0 m (ll) show NC gr 
 gsave  2222 2133 23 22 C 1948.64 98.7615 t 0 r /Helvetica findfont 68.4392 sf 0 0 m (M) show NC gr  245 286 m -51 Y s 289 261 m -26 Y s 334 261 m -26 Y s 378 261 m -26 Y s 423 261 m -26 Y s 467 286 m -51 Y s 512 261 m -26 Y s 556 261 m -26 Y s 600
 261 m -26 Y s 645 261 m -26 Y s 689 286 m -51 Y s 734 261 m -26 Y s 778 261 m -26 Y s 823 261 m -26 Y s 867 261 m -26 Y s 912 286 m -51 Y s 956 261 m -26 Y s 1001 261 m -26 Y s 1045 261 m -26 Y s 1089 261 m -26 Y s 1134 286 m -51 Y s 1178 261 m -26
 Y s 1223 261 m -26 Y s 1267 261 m -26 Y s 1312 261 m -26 Y s 1356 286 m -51 Y s 1401 261 m -26 Y s 1445 261 m -26 Y s 1489 261 m -26 Y s 1534 261 m -26 Y s 1578 286 m -51 Y s 1623 261 m -26 Y s 1667 261 m -26 Y s 1712 261 m -26 Y s 1756 261 m -26 Y
 s 1801 286 m -51 Y s 1845 261 m -26 Y s 1889 261 m -26 Y s 1934 261 m -26 Y s 1978 261 m -26 Y s 2023 286 m -51 Y s
 gsave  2222 2133 23 22 C 224.113 167.135 t 0 r /Helvetica findfont 68.4392 sf 0 0 m (0) show NC gr 
 gsave  2222 2133 23 22 C 406.442 167.135 t 0 r /Helvetica findfont 68.4392 sf 0 0 m (100) show NC gr 
 gsave  2222 2133 23 22 C 630.554 167.135 t 0 r /Helvetica findfont 68.4392 sf 0 0 m (200) show NC gr 
 gsave  2222 2133 23 22 C 850.869 167.135 t 0 r /Helvetica findfont 68.4392 sf 0 0 m (300) show NC gr 
 gsave  2222 2133 23 22 C 1074.98 167.135 t 0 r /Helvetica findfont 68.4392 sf 0 0 m (400) show NC gr 
 gsave  2222 2133 23 22 C 1299.09 167.135 t 0 r /Helvetica findfont 68.4392 sf 0 0 m (500) show NC gr 
 gsave  2222 2133 23 22 C 1519.41 167.135 t 0 r /Helvetica findfont 68.4392 sf 0 0 m (600) show NC gr 
 gsave  2222 2133 23 22 C 1743.52 167.135 t 0 r /Helvetica findfont 68.4392 sf 0 0 m (700) show NC gr 
 gsave  2222 2133 23 22 C 1963.83 167.135 t 0 r /Helvetica findfont 68.4392 sf 0 0 m (800) show NC gr  245 235 m 1706 Y s
 gsave  2222 2133 23 22 C 102.56 1177.54 t 90 r /Helvetica findfont 45.6261 sf 0 0 m (ll) show NC gr 
 gsave  2222 2133 23 22 C 75.9704 1063.59 t 90 r /Helvetica findfont 68.4392 sf 0 0 m (/dM) show NC gr 
 gsave  2222 2133 23 22 C 75.9704 1021.8 t 90 r /Symbol findfont 68.4392 sf 0 0 m (s) show NC gr 
 gsave  2222 2133 23 22 C 75.9704 987.615 t 90 r /Helvetica findfont 68.4392 sf 0 0 m (d) show NC gr  298 319 m -53 X s 272 358 m -27 X s 272 397 m -27 X s 272 436 m -27 X s 272 475 m -27 X s 298 514 m -53 X s 272 554 m -27 X s 272 593 m -27 X s 272
 632 m -27 X s 272 671 m -27 X s 298 710 m -53 X s 272 749 m -27 X s 272 788 m -27 X s 272 828 m -27 X s 272 867 m -27 X s 298 906 m -53 X s 272 945 m -27 X s 272 984 m -27 X s 272 1023 m -27 X s 272 1062 m -27 X s 298 1101 m -53 X s 272 1141 m -27 X
 s 272 1180 m -27 X s 272 1219 m -27 X s 272 1258 m -27 X s 298 1297 m -53 X s 272 1336 m -27 X s 272 1375 m -27 X s 272 1415 m -27 X s 272 1454 m -27 X s 298 1493 m -53 X s 272 1532 m -27 X s 272 1571 m -27 X s 272 1610 m -27 X s 272 1649 m -27 X s
 298 1689 m -53 X s 272 1728 m -27 X s 272 1767 m -27 X s 272 1806 m -27 X s 272 1845 m -27 X s 298 1884 m -53 X s 298 319 m -53 X s 272 280 m -27 X s 272 240 m -27 X s 298 1884 m -53 X s 272 1923 m -27 X s
 gsave  2222 2133 23 22 C 208.919 303.882 t 0 r /Helvetica findfont 38.0218 sf 0 0 m (0) show NC gr 
 gsave  2222 2133 23 22 C 163.336 501.405 t 0 r /Helvetica findfont 38.0218 sf 0 0 m (0.01) show NC gr 
 gsave  2222 2133 23 22 C 155.739 695.129 t 0 r /Helvetica findfont 38.0218 sf 0 0 m (0.02) show NC gr 
 gsave  2222 2133 23 22 C 159.538 892.652 t 0 r /Helvetica findfont 38.0218 sf 0 0 m (0.03) show NC gr 
 gsave  2222 2133 23 22 C 155.739 1086.38 t 0 r /Helvetica findfont 38.0218 sf 0 0 m (0.04) show NC gr 
 gsave  2222 2133 23 22 C 155.739 1283.9 t 0 r /Helvetica findfont 38.0218 sf 0 0 m (0.05) show NC gr 
 gsave  2222 2133 23 22 C 155.739 1481.42 t 0 r /Helvetica findfont 38.0218 sf 0 0 m (0.06) show NC gr 
 gsave  2222 2133 23 22 C 155.739 1675.15 t 0 r /Helvetica findfont 38.0218 sf 0 0 m (0.07) show NC gr 
 gsave  2222 2133 23 22 C 155.739 1872.67 t 0 r /Helvetica findfont 38.0218 sf 0 0 m (0.08) show NC gr  0.8 0 0.8 c 1 0 1 c /w 2 def /w2 {w 2 div} def /w3 {w 3 div} def 247 319 m20 252 320 m20 256 323 m20 260 323 m20 265 324 m20 269 324 m20 274 327
 m20 278 330 m20 283 331 m20 287 333 m20 292 340 m20 296 341 m20 300 349 m20 305 354 m20 309 366 m20 314 374 m20 318 381 m20 323 389 m20 327 404 m20 332 413 m20 336 426 m20 340 432 m20 345 453 m20 349 476 m20 354 489 m20 358 511 m20 363 527 m20 367
 552 m20 372 583 m20 376 601 m20 380 627 m20 385 666 m20 389 701 m20 394 719 m20 398 738 m20 403 790 m20 407 813 m20 412 851 m20 416 895 m20 420 927 m20 425 955 m20 429 990 m20 434 1033 m20 438 1052 m20 443 1089 m20 447 1119 m20 452 1147 m20 456 1170
 m20 460 1204 m20 465 1245 m20 469 1277 m20 474 1321 m20 478 1351 m20 483 1386 m20 487 1409 m20 492 1430 m20 496 1440 m20 500 1476 m20 505 1504 m20 509 1533 m20 514 1548 m20 518 1596 m20 523 1616 m20 527 1628 m20 532 1668 m20 536 1669 m20 540 1701
 m20 545 1703 m20 549 1726 m20 554 1732 m20 558 1739 m20 563 1767 m20 567 1805 m20 572 1790 m20 576 1805 m20 580 1801 m20 585 1815 m20 589 1830 m20 594 1840 m20 598 1853 m20 603 1856 m20 607 1852 m20 612 1844 m20 616 1860 m20 620 1837 m20 625 1840
 m20 629 1857 m20 634 1842 m20 638 1843 m20 643 1822 m20 647 1848 m20 652 1822 m20 656 1844 m20 660 1776 m20 665 1822 m20 669 1789 m20 674 1763 m20 678 1758 m20 683 1738 m20 687 1734 m20 692 1699 m20 696 1674 m20 700 1669 m20 705 1641 m20 709 1632
 m20 714 1600 m20 718 1609 m20 723 1599 m20 727 1561 m20 732 1528 m20 736 1514 m20 741 1494 m20 745 1468 m20 749 1435 m20 754 1427 m20 758 1389 m20 763 1374 m20 767 1324 m20 772 1303 m20 776 1288 m20 781 1257 m20 785 1220 m20 789 1218 m20 794 1177
 m20 798 1157 m20 803 1130 m20 807 1122 m20 812 1079 m20 816 1066 m20 821 1028 m20 825 1003 m20 829 976 m20 834 952 m20 838 919 m20 843 905 m20 847 868 m20 852 851 m20 856 831 m20 861 815 m20 865 776 m20 869 755 m20 874 742 m20 878 719 m20 883 690
 m20 887 670 m20 892 653 m20 896 629 m20 901 608 m20 905 595 m20 909 575 m20 914 560 m20 918 541 m20 923 530 m20 927 515 m20 932 497 m20 936 483 m20 941 470 m20 945 456 m20 949 443 m20 954 434 m20 958 421 m20 963 411 m20 967 399 m20 972 391 m20 976
 384 m20 981 376 m20 985 370 m20 989 367 m20 994 356 m20 998 354 m20 1003 348 m20 1007 344 m20 1012 340 m20 1016 335 m20 1021 334 m20 1025 332 m20 1029 328 m20 1034 327 m20 1038 325 m20 1043 324 m20 1047 322 m20 1052 321 m20 1056 319 m20 1061 318 m20
 1065 318 m20 1069 318 m20 1074 317 m20 1078 317 m20 1083 316 m20 1087 315 m20 1092 315 m20 1096 316 m20 1101 314 m20 1105 314 m20 1109 314 m20 1114 314 m20 1118 314 m20 1123 314 m20 1127 314 m20 1132 313 m20 1136 314 m20 1141 313 m20 1145 313 m20
 1149 313 m20 1154 312 m20 1158 313 m20 1163 313 m20 1167 314 m20 1172 313 m20 1176 313 m20 1181 313 m20 1185 313 m20 1189 313 m20 1194 313 m20 1198 313 m20 1203 314 m20 1207 313 m20 1212 313 m20 1216 313 m20 1221 313 m20 1225 314 m20 1229 313 m20
 1234 314 m20 1238 313 m20 1243 313 m20 1247 314 m20 1252 313 m20 1256 314 m20 1261 314 m20 1265 314 m20 1269 314 m20 1274 314 m20 1278 314 m20 1283 314 m20 1287 314 m20 1292 314 m20 1296 314 m20 1301 315 m20 1305 315 m20 1309 314 m20 1314 315 m20
 1318 315 m20 1323 315 m20 1327 314 m20 1332 315 m20 1336 316 m20 1341 315 m20 1345 315 m20 1349 315 m20 1354 316 m20 1358 315 m20 1363 315 m20 1367 316 m20 1372 316 m20 1376 316 m20 1381 315 m20 1385 315 m20 1389 316 m20 1394 316 m20 1398 316 m20
 1403 316 m20 1407 316 m20 1412 316 m20 1416 316 m20 1421 317 m20 1425 316 m20 1429 316 m20 1434 316 m20 1438 316 m20 1443 317 m20 1447 316 m20 1452 317 m20 1456 316 m20 1461 316 m20 1465 316 m20 1469 316 m20 1474 316 m20 1478 316 m20 1483 317 m20
 1487 317 m20 1492 316 m20 1496 317 m20 1501 317 m20 1505 317 m20 1509 317 m20 1514 317 m20 1518 317 m20 1523 317 m20 1527 317 m20 1532 317 m20 1536 316 m20 1541 317 m20 1545 317 m20 1549 318 m20 1554 317 m20 1558 317 m20 1563 317 m20 1567 317 m20
 1572 318 m20 1576 318 m20 1581 317 m20 1585 318 m20 1589 318 m20 1594 317 m20 1598 318 m20 1603 318 m20 1607 318 m20 1612 318 m20 1616 317 m20 1621 318 m20 1625 318 m20 1629 317 m20 1634 318 m20 1638 318 m20 1643 318 m20 1647 318 m20 1652 318 m20
 1656 318 m20 1661 318 m20 1665 318 m20 1669 318 m20 1674 318 m20 1678 318 m20 1683 318 m20 1687 318 m20 1692 318 m20 1696 318 m20 1701 318 m20 1705 318 m20 1709 318 m20 1714 318 m20 1718 318 m20 1723 318 m20 1727 318 m20 1732 318 m20 1736 318 m20
 1741 318 m20 1745 318 m20 1749 318 m20 1754 318 m20 1758 318 m20 1763 318 m20 1767 318 m20 1772 318 m20 1776 318 m20 1781 318 m20 1785 318 m20 1789 318 m20 1794 318 m20 1798 319 m20 1803 318 m20 1807 318 m20 1812 318 m20 1816 319 m20 1821 318 m20
 1825 318 m20 1829 318 m20 1834 318 m20 1838 318 m20 1843 319 m20 1847 318 m20 1852 319 m20 1856 318 m20 1861 318 m20 1865 319 m20 1869 318 m20 1874 318 m20 1878 319 m20 1883 318 m20 1887 318 m20 1892 319 m20 1896 319 m20 1901 318 m20 1905 319 m20
 1909 319 m20 1914 319 m20 1918 319 m20 1923 319 m20 1927 318 m20 1932 319 m20 1936 319 m20 1941 319 m20 1945 319 m20 1949 319 m20 1954 319 m20 1958 319 m20 1963 319 m20 1967 319 m20 1972 319 m20 1976 319 m20 1981 319 m20 1985 319 m20 1989 319 m20
 1994 319 m20 1998 319 m20 2003 319 m20 2007 319 m20 2012 319 m20 2016 319 m20 2021 319 m20 0.8 0 0.8 c black 0.8 0 0.8 c 1 lw << /PatternType 1 /PaintType 2 /TilingType 1 /BBox [ 0 0 100 100 ] /XStep 100 /YStep 100 /PaintProc { begin gsave 0 0 m 100
 100 l 0 100 m 100 0 l s gr end } >> [ 0.24 0 0 0.24 0 0 ] makepattern /P13 exch def /cs {[/Pattern /DeviceRGB] setcolorspace} def /FA {f [/DeviceRGB] setcolorspace} def cs 0.8 0 0.8 P13 setcolor 247 319 m 5 1 d 4 4 d 4 -1 d 5 2 d 4 X 5 4 d 4 3 d 5 1
 d 4 1 d 5 8 d 4 1 d 4 8 d 5 5 d 4 12 d 5 9 d 4 7 d 5 8 d 4 15 d 5 9 d 4 14 d 4 5 d 5 22 d 4 23 d 5 14 d 4 22 d 5 15 d 4 26 d 5 31 d 4 18 d 4 26 d 5 40 d 4 36 d 5 17 d 4 19 d 5 53 d 4 23 d 5 38 d 4 45 d 4 31 d 5 29 d 4 35 d 5 44 d 4 19 d 5 36 d 4 30
 d 5 29 d 4 22 d 4 35 d 5 41 d 4 32 d 5 44 d 4 31 d 5 35 d 4 23 d 5 22 d 4 9 d 4 37 d 5 27 d 4 30 d 5 15 d 4 48 d 5 20 d 4 12 d 5 40 d 4 1 d 4 33 d 5 2 d 4 23 d 5 6 d 4 7 d 5 28 d 4 38 d 5 -16 d 4 16 d 4 -4 d 5 14 d 4 15 d 5 10 d 4 14 d 5 2 d 4 -3 d
 5 -8 d 4 15 d 4 -23 d 5 3 d 4 17 d 5 -15 d 4 2 d 5 -22 d 4 26 d 5 -26 d 4 22 d 4 -68 d 5 46 d 4 -33 d 5 -26 d 4 -5 d 5 -21 d 4 -4 d 5 -35 d 4 -25 d 4 -5 d 5 -28 d 4 -9 d 5 -32 d 4 9 d 5 -11 d 4 -38 d 5 -33 d 4 -14 d 5 -20 d 4 -26 d 4 -34 d 5 -7 d 4
 -38 d 5 -16 d 4 -50 d 5 -22 d 4 -15 d 5 -31 d 4 -37 d 4 -1 d 5 -42 d 4 -20 d 5 -28 d 4 -8 d 5 -43 d 4 -13 d 5 -38 d 4 -26 d 4 -27 d 5 -23 d 4 -34 d 5 -14 d 4 -37 d 5 -17 d 4 -20 d 5 -17 d 4 -39 d 4 -22 d 5 -13 d 4 -22 d 5 -29 d 4 -21 d 5 -17 d 4 -24
 d 5 -22 d 4 -13 d 4 -20 d 5 -15 d 4 -19 d 5 -11 d 4 -16 d 5 -17 d 4 -15 d 5 -13 d 4 -14 d 4 -13 d 5 -9 d 4 -14 d 5 -9 d 4 -12 d 5 -8 d 4 -8 d 5 -8 d 4 -6 d 4 -3 d 5 -11 d 4 -2 d 5 -6 d 4 -4 d 5 -4 d 4 -5 d 5 -1 d 4 -2 d 4 -4 d 5 -1 d 4 -2 d 5 -2 d 4
 -1 d 5 -2 d 4 -1 d 5 -1 d 4 X 4 -1 d 9 X 5 -1 d 4 -1 d 5 -1 d 4 2 d 5 -2 d 13 X 4 -1 d 5 1 d 4 -1 d 5 -1 d 4 1 d 5 -1 d 4 X 4 1 d 5 -1 d 4 X 5 1 d 4 1 d 5 -2 d 4 1 d 5 -1 d 4 1 d 4 X 5 -1 d 4 1 d 5 X 4 -1 d 5 1 d 26 X 5 -1 d 4 1 d 5 X 4 1 d 5 -1 d 4
 X 4 1 d 5 -1 d 9 X 4 1 d 14 X 4 1 d 4 -1 d 5 1 d 4 -1 d 14 X 4 1 d 5 X 4 -1 d 4 X 5 1 d 4 X 5 -1 d 4 1 d 18 X 4 1 d 5 -1 d 13 X 5 1 d 4 -1 d 5 1 d 4 X 4 -1 d 5 1 d 9 X 4 -1 d 5 1 d 9 X 4 -1 d 4 1 d 76 X 4 1 d 5 -1 d 4 X 5 1 d 4 -1 d 5 1 d 17 X 5 -1
 d 4 1 d 174 X 4 1 d 5 -1 d 13 X 4 1 d 5 -1 d 4 1 d 5 -1 d 4 1 d 9 X 4 -1 d 9 X 5 1 d 26 X 5 -1 d 4 1 d 5 X 4 -1 d 5 1 d 129 X -67 X -5 -1 d -4 1 d -13 X -5 -1 d -4 1 d -14 X -4 -1 d -4 X -5 1 d -4 -1 d -227 X -4 -1 d -5 1 d -18 X -4 -1 d -5 X -4 1 d
 -4 -1 d -5 X -4 1 d -5 -1 d -4 X -5 1 d -4 -1 d -18 X -4 1 d -5 -1 d -26 X -5 -1 d -4 1 d -9 X -5 -1 d -9 X -4 1 d -4 -1 d -5 1 d -4 -1 d -58 X -5 -1 d -4 1 d -4 1 d -5 -2 d -4 1 d -5 X -4 -1 d -5 X -4 1 d -5 X -4 -1 d -4 X -5 1 d -4 -1 d -18 X -5
 -1 d -4 1 d -9 X -4 -1 d -14 X -4 1 d -5 -1 d -4 1 d -4 X -5 -1 d -9 X -4 -1 d -9 X -5 1 d -4 -1 d -4 1 d -5 X -4 -1 d -5 X -4 -1 d -5 1 d -26 X -5 -1 d -4 1 d -5 X -4 -1 d -5 1 d -4 X -4 -1 d -5 1 d -4 -1 d -5 2 d -4 -1 d -5 -1 d -4 X -5 1 d -4 -1
 d -4 X -5 1 d -4 -1 d -5 1 d -4 1 d -5 -1 d -4 1 d -5 -1 d -4 1 d -4 X -5 1 d -4 -1 d -5 1 d -4 X -5 2 d -4 -1 d -5 1 d -4 X -4 1 d -5 1 d -4 1 d -5 2 d -4 1 d -5 1 d -4 2 d -5 2 d -4 3 d -4 2 d -5 1 d -4 5 d -5 4 d -4 4 d -5 6 d -4 2 d -5 11 d -4 3
 d -4 6 d -5 7 d -4 8 d -5 7 d -4 13 d -5 9 d -4 14 d -5 8 d -4 12 d -4 15 d -5 12 d -4 15 d -5 17 d -4 15 d -5 11 d -4 19 d -5 15 d -4 19 d -4 13 d -5 21 d -4 24 d -5 17 d -4 20 d -5 29 d -4 22 d -5 13 d -4 21 d -4 39 d -5 16 d -4 20 d -5 17 d -4 36
 d -5 14 d -4 33 d -5 23 d -4 27 d -4 25 d -5 38 d -4 13 d -5 43 d -4 7 d -5 27 d -4 21 d -5 40 d -4 2 d -4 36 d -5 31 d -4 15 d -5 22 d -4 48 d -5 16 d -4 38 d -5 7 d -4 34 d -4 25 d -5 20 d -4 14 d -5 32 d -4 38 d -5 11 d -4 -9 d -5 31 d -4 9 d -5
 28 d -4 5 d -4 25 d -5 34 d -4 4 d -5 21 d -4 4 d -5 27 d -4 32 d -5 -45 d -4 67 d -4 -22 d -5 26 d -4 -26 d -5 21 d -4 -1 d -5 15 d -4 -17 d -5 -3 d -4 23 d -4 -16 d -5 8 d -4 3 d -5 -2 d -4 -13 d -5 -10 d -4 -15 d -5 -14 d -4 4 d -4 -15 d -5 14 d
 -4 -37 d -5 -28 d -4 -6 d -5 -7 d -4 -23 d -5 -1 d -4 -32 d -4 -2 d -5 -39 d -4 -12 d -5 -20 d -4 -48 d -5 -15 d -4 -29 d -5 -28 d -4 -35 d -4 -10 d -5 -21 d -4 -24 d -5 -34 d -4 -30 d -5 -44 d -4 -31 d -5 -41 d -4 -34 d -4 -23 d -5 -28 d -4 -30 d
 -5 -36 d -4 -19 d -5 -43 d -4 -35 d -5 -27 d -4 -32 d -4 -44 d -5 -37 d -4 -24 d -5 -51 d -4 -20 d -5 -17 d -4 -35 d -5 -39 d -4 -26 d -4 -17 d -5 -31 d -4 -25 d -5 -15 d -4 -22 d -5 -13 d -4 -23 d -5 -20 d -4 -6 d -4 -14 d -5 -8 d -4 -15 d -5 -8 d
 -4 -7 d -5 -8 d -4 -11 d -5 -6 d -4 -7 d -4 -1 d -5 -7 d -4 -1 d -5 -1 d -4 -3 d -5 -3 d -4 X -5 -1 d -4 X -4 -3 d -5 X FA 3 lw 0.8 0.8 0 c 1 1 1 c 1 1 0 c 0.8 0.8 0 c 245 319 m 4 X 2 Y 5 X 4 Y 4 X 1 Y 5 X 1 Y 4 X 1 Y 5 X 3 Y 4 X 3 Y 4 X 2 Y 5 X 4 Y
 4 X 4 Y 5 X 4 Y 4 X 5 Y 5 X 5 Y 4 X 13 Y 5 X 1 Y 4 X 15 Y 4 X 4 Y 5 X 8 Y 4 X 10 Y 5 X 14 Y 4 X 13 Y 5 X 14 Y 4 X 23 Y 5 X 8 Y 4 X 17 Y 4 X 23 Y 5 X 22 Y 4 X 28 Y 5 X 16 Y 4 X 24 Y 5 X 36 Y 4 X 27 Y 5 X 25 Y 4 X 21 Y 4 X 48 Y 5 X 24 Y 4 X 39 Y 5 X
 36 Y 4 X 34 Y 5 X 29 Y 4 X 29 Y 5 X 40 Y 4 X 21 Y 4 X 38 Y 5 X 28 Y 4 X 31 Y 5 X 27 Y 4 X 31 Y 5 X 41 Y 4 X 31 Y 5 X 40 Y 4 X 33 Y 4 X 35 Y 5 X 24 Y 4 X 22 Y 5 X 17 Y 4 X 28 Y 5 X 34 Y 4 X 26 Y 5 X 23 Y 4 X 45 Y 4 X 21 Y 5 X 9 Y 4 X 38 Y 5 X 7 Y 4 X
 35 Y 5 X 4 Y 4 X 24 Y 5 X 6 Y 4 X 10 Y 4 X 31 Y 5 X 34 Y 4 X -8 Y 5 X 14 Y 4 X 4 Y 5 X 13 Y 4 X 15 Y 5 X 8 Y 4 X 18 Y 4 X 3 Y 5 X -2 Y 9 X 17 Y 4 X -22 Y 5 X 4 Y 4 X 17 Y 5 X -17 Y 4 X 7 Y 4 X -15 Y 5 X 22 Y 4 X -21 Y 5 X 25 Y 4 X -66 Y 5 X 46 Y 4 X
 -33 Y 5 X -20 Y 4 X -7 Y 4 X -17 Y 5 X -1 Y 4 X -41 Y 5 X -19 Y 9 X -27 Y 4 X -7 Y 5 X -31 Y 4 X 10 Y 4 X -9 Y 5 X -37 Y 4 X -30 Y 5 X -12 Y 4 X -19 Y 5 X -27 Y 4 X -33 Y 5 X -10 Y 4 X -34 Y 5 X -15 Y 4 X -46 Y 4 X -21 Y 5 X -16 Y 4 X -28 Y 5 X -39
 Y 4 X 3 Y 5 X -43 Y 4 X -21 Y 5 X -26 Y 4 X -7 Y 4 X -44 Y 5 X -13 Y 4 X -39 Y 5 X -24 Y 4 X -27 Y 5 X -21 Y 4 X -33 Y 5 X -19 Y 4 X -36 Y 4 X -15 Y 5 X -20 Y 4 X -20 Y 5 X -38 Y 4 X -20 Y 5 X -14 Y 4 X -21 Y 5 X -31 Y 4 X -23 Y 4 X -16 Y 5 X -26 Y
 4 X -23 Y 5 X -13 Y 4 X -19 Y 5 X -16 Y 4 X -20 Y 5 X -12 Y 4 X -14 Y 4 X -25 Y 5 X -13 Y 4 X -11 Y 5 X -20 Y 4 X -11 Y 5 X -9 Y 4 X -15 Y 5 X -10 Y 4 X -13 Y 4 X -11 Y 5 X -9 Y 4 X -6 Y 5 X -8 Y 4 X -8 Y 5 X -10 Y 4 X -2 Y 5 X -6 Y 4 X -7 Y 4 X -5
 Y 5 X -3 Y 4 X -2 Y 5 X -7 Y 4 X -1 Y 5 X -5 Y 4 X -3 Y 5 X -3 Y 4 X -1 Y 4 X -2 Y 5 X -1 Y 4 X -3 Y 9 X -2 Y 5 X -2 Y 13 X -3 Y 4 X -1 Y 5 X -1 Y 4 X 1 Y 5 X -1 Y 4 X -2 Y 5 X -1 Y 4 X 1 Y 5 X -1 Y 4 X -1 Y 4 X -1 Y 5 X -1 Y 4 X 1 Y 5 X -1 Y 4 X -1
 Y 5 X 1 Y 4 X -2 Y 9 X -1 Y 4 X 1 Y 5 X -1 Y 9 X -1 Y 4 X 1 Y 9 X -2 Y 9 X 1 Y 4 X -1 Y 9 X -1 Y 36 X -1 Y 13 X -1 Y 5 X 1 Y 13 X -1 Y 18 X -1 Y 4 X 1 Y 5 X -1 Y 22 X -1 Y 4 X 1 Y 14 X -1 Y 9 X 1 Y 4 X -1 Y 18 X 1 Y 4 X -1 Y 22 X -1 Y 5 X 1 Y 4 X -1
 Y 9 X 1 Y 5 X -1 Y 13 X 1 Y 4 X -1 Y 14 X 1 Y 4 X -1 Y 102 X -1 Y 9 X 1 Y 5 X -1 Y 9 X 1 Y 13 X -1 Y 4 X 1 Y 5 X -1 Y 4 X 1 Y 5 X -1 Y 4 X 1 Y 5 X -1 Y 4 X 1 Y 9 X -1 Y 4 X 1 Y 5 X -1 Y 27 X 1 Y 4 X -1 Y 9 X 1 Y 4 X -1 Y 9 X 1 Y 5 X -1 Y 4 X 1 Y 5 X
 -1 Y 31 X 1 Y 4 X -1 Y 9 X 1 Y 4 X -1 Y 254 X s 1 1 0 c 247 319 m20 252 321 m20 256 325 m20 260 326 m20 265 327 m20 269 328 m20 274 331 m20 278 334 m20 283 336 m20 287 340 m20 292 344 m20 296 348 m20 300 353 m20 305 358 m20 309 371 m20 314 372 m20
 318 387 m20 323 391 m20 327 399 m20 332 409 m20 336 423 m20 340 436 m20 345 450 m20 349 473 m20 354 481 m20 358 498 m20 363 521 m20 367 543 m20 372 571 m20 376 587 m20 380 611 m20 385 647 m20 389 674 m20 394 699 m20 398 720 m20 403 768 m20 407 792
 m20 412 831 m20 416 867 m20 420 901 m20 425 930 m20 429 959 m20 434 999 m20 438 1020 m20 443 1058 m20 447 1086 m20 452 1117 m20 456 1144 m20 460 1175 m20 465 1216 m20 469 1247 m20 474 1287 m20 478 1320 m20 483 1355 m20 487 1379 m20 492 1401 m20 496
 1418 m20 500 1446 m20 505 1480 m20 509 1506 m20 514 1529 m20 518 1574 m20 523 1595 m20 527 1604 m20 532 1642 m20 536 1649 m20 540 1684 m20 545 1688 m20 549 1712 m20 554 1718 m20 558 1728 m20 563 1759 m20 567 1793 m20 572 1785 m20 576 1799 m20 580
 1803 m20 585 1816 m20 589 1831 m20 594 1839 m20 598 1857 m20 603 1860 m20 607 1858 m20 612 1858 m20 616 1875 m20 620 1853 m20 625 1857 m20 629 1874 m20 634 1857 m20 638 1864 m20 643 1849 m20 647 1871 m20 652 1850 m20 656 1875 m20 660 1809 m20 665
 1855 m20 669 1822 m20 674 1802 m20 678 1795 m20 683 1778 m20 687 1777 m20 692 1736 m20 696 1717 m20 700 1717 m20 705 1690 m20 709 1683 m20 714 1652 m20 718 1662 m20 723 1653 m20 727 1616 m20 732 1586 m20 736 1574 m20 741 1555 m20 745 1528 m20 749
 1495 m20 754 1485 m20 758 1451 m20 763 1436 m20 767 1390 m20 772 1369 m20 776 1353 m20 781 1325 m20 785 1286 m20 789 1289 m20 794 1246 m20 798 1225 m20 803 1199 m20 807 1192 m20 812 1148 m20 816 1135 m20 821 1096 m20 825 1072 m20 829 1045 m20 834
 1024 m20 838 991 m20 843 972 m20 847 936 m20 852 921 m20 856 901 m20 861 881 m20 865 843 m20 869 823 m20 874 809 m20 878 788 m20 883 757 m20 887 734 m20 892 718 m20 896 692 m20 901 669 m20 905 656 m20 909 637 m20 914 621 m20 918 601 m20 923 589 m20
 927 575 m20 932 550 m20 936 537 m20 941 526 m20 945 506 m20 949 495 m20 954 486 m20 958 471 m20 963 461 m20 967 448 m20 972 437 m20 976 428 m20 981 422 m20 985 414 m20 989 406 m20 994 396 m20 998 394 m20 1003 388 m20 1007 381 m20 1012 376 m20 1016
 373 m20 1021 371 m20 1025 364 m20 1029 363 m20 1034 358 m20 1038 355 m20 1043 352 m20 1047 351 m20 1052 349 m20 1056 348 m20 1061 345 m20 1065 345 m20 1069 343 m20 1074 341 m20 1078 341 m20 1083 341 m20 1087 338 m20 1092 337 m20 1096 336 m20 1101
 337 m20 1105 336 m20 1109 334 m20 1114 333 m20 1118 334 m20 1123 333 m20 1127 332 m20 1132 331 m20 1136 330 m20 1141 331 m20 1145 330 m20 1149 329 m20 1154 330 m20 1158 328 m20 1163 328 m20 1167 327 m20 1172 328 m20 1176 327 m20 1181 327 m20 1185
 326 m20 1189 327 m20 1194 327 m20 1198 325 m20 1203 325 m20 1207 326 m20 1212 325 m20 1216 325 m20 1221 324 m20 1225 324 m20 1229 324 m20 1234 324 m20 1238 324 m20 1243 324 m20 1247 324 m20 1252 324 m20 1256 323 m20 1261 323 m20 1265 323 m20 1269
 322 m20 1274 323 m20 1278 323 m20 1283 323 m20 1287 322 m20 1292 322 m20 1296 322 m20 1301 322 m20 1305 321 m20 1309 322 m20 1314 321 m20 1318 321 m20 1323 321 m20 1327 321 m20 1332 321 m20 1336 320 m20 1341 321 m20 1345 321 m20 1349 321 m20 1354
 320 m20 1358 320 m20 1363 321 m20 1367 320 m20 1372 320 m20 1376 320 m20 1381 320 m20 1385 321 m20 1389 320 m20 1394 320 m20 1398 320 m20 1403 320 m20 1407 320 m20 1412 319 m20 1416 320 m20 1421 319 m20 1425 319 m20 1429 320 m20 1434 319 m20 1438
 319 m20 1443 319 m20 1447 320 m20 1452 319 m20 1456 319 m20 1461 319 m20 1465 320 m20 1469 319 m20 1474 319 m20 1478 319 m20 1483 319 m20 1487 319 m20 1492 319 m20 1496 319 m20 1501 319 m20 1505 319 m20 1509 319 m20 1514 319 m20 1518 319 m20 1523
 319 m20 1527 319 m20 1532 319 m20 1536 319 m20 1541 319 m20 1545 319 m20 1549 319 m20 1554 319 m20 1558 319 m20 1563 319 m20 1567 319 m20 1572 318 m20 1576 318 m20 1581 319 m20 1585 318 m20 1589 318 m20 1594 319 m20 1598 319 m20 1603 319 m20 1607
 318 m20 1612 319 m20 1616 318 m20 1621 319 m20 1625 318 m20 1629 319 m20 1634 318 m20 1638 319 m20 1643 319 m20 1647 318 m20 1652 319 m20 1656 318 m20 1661 318 m20 1665 318 m20 1669 318 m20 1674 318 m20 1678 318 m20 1683 319 m20 1687 318 m20 1692
 318 m20 1696 319 m20 1701 318 m20 1705 318 m20 1709 319 m20 1714 318 m20 1718 319 m20 1723 318 m20 1727 318 m20 1732 318 m20 1736 318 m20 1741 318 m20 1745 318 m20 1749 318 m20 1754 319 m20 1758 318 m20 1763 318 m20 1767 319 m20 1772 318 m20 1776
 318 m20 1781 318 m20 1785 318 m20 1789 318 m20 1794 318 m20 1798 318 m20 1803 318 m20 1807 318 m20 1812 318 m20 1816 318 m20 1821 318 m20 1825 318 m20 1829 318 m20 1834 318 m20 1838 318 m20 1843 318 m20 1847 318 m20 1852 318 m20 1856 318 m20 1861
 318 m20 1865 318 m20 1869 318 m20 1874 318 m20 1878 318 m20 1883 318 m20 1887 318 m20 1892 318 m20 1896 318 m20 1901 318 m20 1905 318 m20 1909 318 m20 1914 318 m20 1918 318 m20 1923 318 m20 1927 318 m20 1932 318 m20 1936 318 m20 1941 318 m20 1945
 318 m20 1949 318 m20 1954 318 m20 1958 318 m20 1963 318 m20 1967 318 m20 1972 318 m20 1976 318 m20 1981 318 m20 1985 318 m20 1989 318 m20 1994 318 m20 1998 318 m20 2003 318 m20 2007 318 m20 2012 318 m20 2016 318 m20 2021 318 m20 0.8 0.8 0 c black
 0.8 0.8 0 c cs 0.8 0.8 0 P13 setcolor 247 319 m 5 3 d 4 5 d 4 X 5 1 d 4 2 d 5 3 d 4 3 d 5 2 d 4 4 d 5 4 d 4 4 d 4 6 d 5 4 d 4 14 d 5 1 d 4 15 d 5 4 d 4 8 d 5 10 d 4 14 d 4 13 d 5 14 d 4 23 d 5 9 d 4 17 d 5 23 d 4 22 d 5 28 d 4 17 d 4 24 d 5 35 d 4
 28 d 5 26 d 4 20 d 5 48 d 4 25 d 5 39 d 4 36 d 4 34 d 5 30 d 4 28 d 5 41 d 4 21 d 5 38 d 4 28 d 5 32 d 4 27 d 4 31 d 5 41 d 4 31 d 5 41 d 4 32 d 5 36 d 4 24 d 5 22 d 4 17 d 4 28 d 5 34 d 4 27 d 5 22 d 4 46 d 5 21 d 4 10 d 5 38 d 4 6 d 4 35 d 5 5 d 4
 24 d 5 6 d 4 10 d 5 31 d 4 34 d 5 -7 d 4 13 d 4 4 d 5 13 d 4 15 d 5 9 d 4 18 d 5 3 d 4 -2 d 5 X 4 16 d 4 -21 d 5 4 d 4 17 d 5 -18 d 4 7 d 5 -15 d 4 23 d 5 -21 d 4 25 d 4 -67 d 5 47 d 4 -33 d 5 -20 d 4 -7 d 5 -18 d 4 -1 d 5 -41 d 4 -19 d 4 X 5 -27 d
 4 -7 d 5 -31 d 4 10 d 5 -9 d 4 -38 d 5 -30 d 4 -12 d 5 -19 d 4 -27 d 4 -34 d 5 -9 d 4 -35 d 5 -15 d 4 -46 d 5 -21 d 4 -16 d 5 -28 d 4 -39 d 4 2 d 5 -43 d 4 -21 d 5 -26 d 4 -8 d 5 -44 d 4 -12 d 5 -40 d 4 -24 d 4 -27 d 5 -22 d 4 -33 d 5 -19 d 4 -36 d
 5 -15 d 4 -20 d 5 -20 d 4 -39 d 4 -20 d 5 -14 d 4 -22 d 5 -31 d 4 -22 d 5 -16 d 4 -27 d 5 -23 d 4 -13 d 4 -19 d 5 -16 d 4 -20 d 5 -13 d 4 -14 d 5 -25 d 4 -13 d 5 -11 d 4 -20 d 4 -12 d 5 -8 d 4 -16 d 5 -10 d 4 -13 d 5 -11 d 4 -9 d 5 -6 d 4 -8 d 4 -9
 d 5 -9 d 4 -3 d 5 -6 d 4 -7 d 5 -5 d 4 -3 d 5 -2 d 4 -7 d 4 -1 d 5 -5 d 4 -3 d 5 -2 d 4 -1 d 5 -3 d 4 -1 d 5 -3 d 4 X 4 -2 d 5 -2 d 9 X 4 -3 d 5 -1 d 4 -1 d 5 1 d 4 -1 d 4 -2 d 5 -1 d 4 X 5 -1 d 4 X 5 -2 d 4 X 5 1 d 4 -1 d 4 -1 d 5 X 4 -1 d 5 X 4 -1
 d 5 1 d 4 -2 d 5 X 4 -1 d 4 1 d 5 X 4 -2 d 5 X 4 1 d 9 X 5 -1 d 4 -1 d 4 1 d 5 -1 d 4 X 5 1 d 4 -1 d 5 X 4 -1 d 27 X 4 -1 d 22 X 5 -1 d 4 1 d 14 X 4 -1 d 18 X 4 -1 d 5 1 d 4 -1 d 5 1 d 4 -1 d 5 1 d 4 X 4 -1 d 27 X 5 -1 d 4 X 4 1 d 5 -1 d 4 1 d 5 -1
 d 4 1 d 5 -1 d 4 1 d 13 X 5 -1 d 9 X 4 1 d 5 X 4 -1 d 5 1 d 4 -1 d 27 X 4 1 d 5 -1 d 26 X 5 -1 d 4 1 d 80 X 5 -1 d 8 X 5 1 d 4 -1 d 5 1 d 13 X 5 -1 d 4 X 4 1 d 9 X 5 -1 d 4 1 d 5 -1 d 4 1 d 5 X 4 -1 d 4 1 d 5 X 4 -1 d 5 X 4 1 d 5 -1 d 13 X 4 1 d 5
 -1 d 4 X 5 1 d 4 -1 d 71 X 5 1 d 4 -1 d 18 X 4 1 d 5 -1 d 107 X -307 X -5 1 d -4 -1 d -4 X -5 1 d -4 -1 d -58 X -5 1 d -4 -1 d -18 X -4 1 d -5 -1 d -4 1 d -5 -1 d -17 X -5 1 d -4 X -5 -1 d -9 X -4 1 d -111 X -5 1 d -4 -1 d -4 X -5 1 d -4 -1 d -5 1 d
 -4 -1 d -5 1 d -9 X -4 1 d -4 -1 d -9 X -5 -1 d -4 1 d -9 X -5 1 d -4 -1 d -9 X -4 1 d -14 X -4 -1 d -5 1 d -13 X -4 1 d -5 X -4 1 d -5 -1 d -17 X -5 1 d -9 X -4 1 d -5 -1 d -4 X -5 1 d -4 -1 d -4 1 d -5 1 d -9 X -4 -1 d -5 1 d -4 1 d -5 X -4 -1 d
 -4 1 d -5 X -4 1 d -5 -1 d -4 1 d -5 1 d -4 1 d -5 -1 d -4 1 d -4 1 d -9 X -5 2 d -4 X -5 1 d -9 X -4 2 d -4 1 d -5 -1 d -4 2 d -5 X -4 3 d -9 X -5 2 d -4 2 d -4 1 d -5 2 d -4 1 d -5 2 d -4 1 d -5 3 d -4 2 d -5 5 d -4 2 d -4 7 d -5 2 d -4 2 d -5 6 d
 -4 6 d -5 6 d -4 3 d -5 9 d -4 9 d -4 7 d -5 6 d -4 9 d -5 11 d -4 13 d -5 10 d -4 15 d -5 8 d -4 12 d -4 20 d -5 11 d -4 12 d -5 25 d -4 13 d -5 13 d -4 20 d -5 15 d -4 19 d -4 13 d -5 23 d -4 26 d -5 16 d -4 22 d -5 31 d -4 21 d -5 13 d -4 21 d -4
 38 d -5 19 d -4 21 d -5 14 d -4 36 d -5 19 d -4 32 d -5 21 d -4 27 d -4 24 d -5 39 d -4 13 d -5 43 d -4 8 d -5 25 d -4 21 d -5 43 d -4 -3 d -4 38 d -5 29 d -4 15 d -5 21 d -4 45 d -5 15 d -4 35 d -5 9 d -4 33 d -4 27 d -5 18 d -4 13 d -5 30 d -4 37
 d -5 9 d -4 -10 d -5 31 d -4 6 d -5 27 d -4 X -4 19 d -5 41 d -4 1 d -5 17 d -4 7 d -5 20 d -4 33 d -5 -47 d -4 67 d -4 -25 d -5 20 d -4 -22 d -5 15 d -4 -7 d -5 18 d -4 -18 d -5 -3 d -4 21 d -4 -17 d -5 X -4 3 d -5 -3 d -4 -18 d -5 -9 d -4 -14 d -5
 -13 d -4 -4 d -4 -14 d -5 8 d -4 -34 d -5 -31 d -4 -10 d -5 -6 d -4 -23 d -5 -5 d -4 -35 d -4 -6 d -5 -38 d -4 -10 d -5 -20 d -4 -45 d -5 -22 d -4 -26 d -5 -35 d -4 -27 d -4 -17 d -5 -22 d -4 -24 d -5 -35 d -4 -32 d -5 -40 d -4 -30 d -5 -42 d -4 -30
 d -4 -27 d -5 -32 d -4 -27 d -5 -38 d -4 -21 d -5 -40 d -4 -28 d -5 -30 d -4 -33 d -4 -36 d -5 -38 d -4 -25 d -5 -47 d -4 -21 d -5 -25 d -4 -27 d -5 -35 d -4 -24 d -4 -16 d -5 -28 d -4 -22 d -5 -22 d -4 -18 d -5 -8 d -4 -23 d -5 -14 d -4 -12 d -4
 -14 d -5 -10 d -4 -8 d -5 -4 d -4 -14 d -5 -2 d -4 -12 d -5 -5 d -4 -5 d -4 -5 d -5 -3 d -4 -4 d -5 -1 d -4 -3 d -5 -3 d -4 -2 d -5 -1 d -4 X -4 -4 d -5 -1 d FA black 1 1 1 c black 245 319 m 4 X 1 Y 5 X 2 Y 9 X 1 Y 9 X 3 Y 4 X 2 Y 4 X 1 Y 5 X 1 Y 4
 X 7 Y 5 X 1 Y 4 X 6 Y 5 X 5 Y 4 X 10 Y 5 X 8 Y 4 X 7 Y 4 X 8 Y 5 X 13 Y 4 X 9 Y 5 X 13 Y 4 X 7 Y 5 X 19 Y 4 X 21 Y 5 X 12 Y 4 X 22 Y 4 X 16 Y 5 X 24 Y 4 X 29 Y 5 X 19 Y 4 X 24 Y 5 X 38 Y 4 X 33 Y 5 X 18 Y 4 X 22 Y 4 X 49 Y 5 X 25 Y 4 X 38 Y 5 X 41 Y
 4 X 33 Y 5 X 27 Y 4 X 34 Y 5 X 41 Y 4 X 22 Y 4 X 36 Y 5 X 30 Y 4 X 29 Y 5 X 26 Y 4 X 32 Y 5 X 42 Y 4 X 30 Y 5 X 44 Y 4 X 32 Y 4 X 34 Y 5 X 25 Y 4 X 21 Y 5 X 14 Y 4 X 32 Y 5 X 32 Y 4 X 27 Y 5 X 19 Y 4 X 47 Y 4 X 20 Y 5 X 11 Y 4 X 39 Y 5 X 4 Y 4 X 34
 Y 5 X 4 Y 4 X 23 Y 5 X 6 Y 4 X 9 Y 4 X 30 Y 5 X 35 Y 4 X -10 Y 5 X 14 Y 4 X 1 Y 5 X 13 Y 4 X 15 Y 5 X 9 Y 4 X 16 Y 4 X 3 Y 5 X -3 Y 4 X -3 Y 5 X 16 Y 4 X -22 Y 5 X 3 Y 4 X 18 Y 5 X -17 Y 4 X 5 Y 4 X -18 Y 5 X 24 Y 4 X -23 Y 5 X 24 Y 4 X -67 Y 5 X 46
 Y 4 X -33 Y 5 X -22 Y 4 X -6 Y 4 X -19 Y 5 X -2 Y 4 X -39 Y 5 X -21 Y 4 X -2 Y 5 X -28 Y 4 X -7 Y 5 X -32 Y 4 X 10 Y 4 X -10 Y 5 X -37 Y 4 X -32 Y 5 X -13 Y 4 X -19 Y 5 X -26 Y 4 X -34 Y 5 X -8 Y 4 X -36 Y 5 X -15 Y 4 X -47 Y 4 X -22 Y 5 X -15 Y 4 X
 -30 Y 5 X -38 Y 4 X 2 Y 5 X -43 Y 4 X -21 Y 5 X -26 Y 4 X -8 Y 4 X -43 Y 5 X -13 Y 4 X -39 Y 5 X -24 Y 4 X -27 Y 5 X -22 Y 4 X -33 Y 5 X -17 Y 4 X -37 Y 4 X -15 Y 5 X -20 Y 4 X -18 Y 5 X -39 Y 4 X -21 Y 5 X -13 Y 4 X -22 Y 5 X -30 Y 4 X -22 Y 4 X
 -16 Y 5 X -26 Y 4 X -22 Y 5 X -13 Y 4 X -19 Y 5 X -15 Y 4 X -20 Y 5 X -12 Y 4 X -14 Y 4 X -23 Y 5 X -13 Y 4 X -11 Y 5 X -18 Y 4 X -12 Y 5 X -9 Y 4 X -14 Y 5 X -10 Y 4 X -13 Y 4 X -10 Y 5 X -8 Y 4 X -7 Y 5 X -6 Y 4 X -7 Y 5 X -10 Y 4 X -2 Y 5 X -6 Y
 4 X -6 Y 4 X -5 Y 5 X -3 Y 4 X -1 Y 5 X -6 Y 4 X -2 Y 5 X -3 Y 4 X -3 Y 5 X -2 Y 4 X -1 Y 4 X -2 Y 5 X -1 Y 4 X -2 Y 5 X -1 Y 4 X -1 Y 5 X -1 Y 9 X -1 Y 4 X -2 Y 4 X -1 Y 18 X -2 Y 18 X -1 Y 4 X -1 Y 18 X -1 Y 9 X -1 Y 5 X 1 Y 4 X -1 Y 18 X -1 Y 9 X
 1 Y 4 X -1 Y 22 X -1 Y 58 X -1 Y 5 X 1 Y 4 X -1 Y 738 X s 247 319 m20 252 320 m20 256 322 m20 260 322 m20 265 323 m20 269 323 m20 274 326 m20 278 328 m20 283 329 m20 287 330 m20 292 337 m20 296 338 m20 300 344 m20 305 349 m20 309 359 m20 314 367 m20
 318 374 m20 323 382 m20 327 395 m20 332 404 m20 336 417 m20 340 424 m20 345 443 m20 349 464 m20 354 476 m20 358 498 m20 363 514 m20 367 538 m20 372 567 m20 376 586 m20 380 610 m20 385 648 m20 389 681 m20 394 699 m20 398 721 m20 403 770 m20 407 795
 m20 412 833 m20 416 874 m20 420 907 m20 425 934 m20 429 968 m20 434 1009 m20 438 1031 m20 443 1067 m20 447 1097 m20 452 1126 m20 456 1152 m20 460 1184 m20 465 1226 m20 469 1256 m20 474 1300 m20 478 1332 m20 483 1366 m20 487 1391 m20 492 1412 m20 496
 1426 m20 500 1458 m20 505 1490 m20 509 1517 m20 514 1536 m20 518 1583 m20 523 1603 m20 527 1614 m20 532 1653 m20 536 1657 m20 540 1691 m20 545 1695 m20 549 1718 m20 554 1724 m20 558 1733 m20 563 1763 m20 567 1798 m20 572 1788 m20 576 1802 m20 580
 1803 m20 585 1816 m20 589 1831 m20 594 1840 m20 598 1856 m20 603 1859 m20 607 1856 m20 612 1853 m20 616 1869 m20 620 1847 m20 625 1850 m20 629 1868 m20 634 1851 m20 638 1856 m20 643 1838 m20 647 1862 m20 652 1839 m20 656 1863 m20 660 1796 m20 665
 1842 m20 669 1809 m20 674 1787 m20 678 1781 m20 683 1762 m20 687 1760 m20 692 1721 m20 696 1700 m20 700 1698 m20 705 1670 m20 709 1663 m20 714 1631 m20 718 1641 m20 723 1631 m20 727 1594 m20 732 1562 m20 736 1549 m20 741 1530 m20 745 1504 m20 749
 1470 m20 754 1462 m20 758 1426 m20 763 1411 m20 767 1364 m20 772 1342 m20 776 1327 m20 781 1297 m20 785 1259 m20 789 1261 m20 794 1218 m20 798 1197 m20 803 1171 m20 807 1163 m20 812 1120 m20 816 1107 m20 821 1068 m20 825 1044 m20 829 1017 m20 834
 995 m20 838 962 m20 843 945 m20 847 908 m20 852 893 m20 856 873 m20 861 855 m20 865 816 m20 869 795 m20 874 782 m20 878 760 m20 883 730 m20 887 708 m20 892 692 m20 896 666 m20 901 644 m20 905 631 m20 909 612 m20 914 597 m20 918 577 m20 923 565 m20
 927 551 m20 932 528 m20 936 515 m20 941 504 m20 945 486 m20 949 474 m20 954 465 m20 958 451 m20 963 441 m20 967 428 m20 972 418 m20 976 410 m20 981 403 m20 985 397 m20 989 390 m20 994 380 m20 998 378 m20 1003 372 m20 1007 366 m20 1012 361 m20 1016
 358 m20 1021 357 m20 1025 351 m20 1029 349 m20 1034 346 m20 1038 343 m20 1043 341 m20 1047 340 m20 1052 338 m20 1056 337 m20 1061 335 m20 1065 334 m20 1069 333 m20 1074 332 m20 1078 332 m20 1083 331 m20 1087 329 m20 1092 328 m20 1096 328 m20 1101
 328 m20 1105 328 m20 1109 326 m20 1114 326 m20 1118 326 m20 1123 326 m20 1127 325 m20 1132 324 m20 1136 324 m20 1141 324 m20 1145 324 m20 1149 323 m20 1154 323 m20 1158 322 m20 1163 323 m20 1167 322 m20 1172 322 m20 1176 322 m20 1181 322 m20 1185
 321 m20 1189 321 m20 1194 322 m20 1198 321 m20 1203 321 m20 1207 321 m20 1212 321 m20 1216 321 m20 1221 320 m20 1225 320 m20 1229 320 m20 1234 320 m20 1238 320 m20 1243 320 m20 1247 320 m20 1252 320 m20 1256 320 m20 1261 320 m20 1265 320 m20 1269
 320 m20 1274 320 m20 1278 319 m20 1283 320 m20 1287 319 m20 1292 319 m20 1296 319 m20 1301 319 m20 1305 319 m20 1309 319 m20 1314 319 m20 1318 319 m20 1323 319 m20 1327 319 m20 1332 319 m20 1336 319 m20 1341 319 m20 1345 319 m20 1349 319 m20 1354
 319 m20 1358 319 m20 1363 319 m20 1367 319 m20 1372 319 m20 1376 319 m20 1381 319 m20 1385 319 m20 1389 319 m20 1394 319 m20 1398 319 m20 1403 319 m20 1407 319 m20 1412 319 m20 1416 319 m20 1421 319 m20 1425 319 m20 1429 319 m20 1434 319 m20 1438
 319 m20 1443 319 m20 1447 319 m20 1452 319 m20 1456 319 m20 1461 319 m20 1465 319 m20 1469 319 m20 1474 319 m20 1478 319 m20 1483 319 m20 1487 319 m20 1492 319 m20 1496 319 m20 1501 319 m20 1505 319 m20 1509 319 m20 1514 319 m20 1518 319 m20 1523
 319 m20 1527 319 m20 1532 319 m20 1536 319 m20 1541 319 m20 1545 319 m20 1549 319 m20 1554 319 m20 1558 319 m20 1563 319 m20 1567 319 m20 1572 319 m20 1576 319 m20 1581 319 m20 1585 319 m20 1589 319 m20 1594 319 m20 1598 319 m20 1603 319 m20 1607
 319 m20 1612 319 m20 1616 319 m20 1621 319 m20 1625 319 m20 1629 319 m20 1634 319 m20 1638 319 m20 1643 319 m20 1647 319 m20 1652 319 m20 1656 319 m20 1661 319 m20 1665 319 m20 1669 319 m20 1674 319 m20 1678 319 m20 1683 319 m20 1687 319 m20 1692
 319 m20 1696 319 m20 1701 319 m20 1705 319 m20 1709 319 m20 1714 319 m20 1718 319 m20 1723 319 m20 1727 319 m20 1732 319 m20 1736 319 m20 1741 319 m20 1745 319 m20 1749 319 m20 1754 319 m20 1758 319 m20 1763 319 m20 1767 319 m20 1772 319 m20 1776
 319 m20 1781 319 m20 1785 319 m20 1789 319 m20 1794 319 m20 1798 319 m20 1803 319 m20 1807 319 m20 1812 319 m20 1816 319 m20 1821 319 m20 1825 319 m20 1829 319 m20 1834 319 m20 1838 319 m20 1843 319 m20 1847 319 m20 1852 319 m20 1856 319 m20 1861
 319 m20 1865 319 m20 1869 319 m20 1874 319 m20 1878 319 m20 1883 319 m20 1887 319 m20 1892 319 m20 1896 319 m20 1901 319 m20 1905 319 m20 1909 319 m20 1914 319 m20 1918 319 m20 1923 319 m20 1927 319 m20 1932 319 m20 1936 319 m20 1941 319 m20 1945
 319 m20 1949 319 m20 1954 319 m20 1958 319 m20 1963 319 m20 1967 319 m20 1972 319 m20 1976 319 m20 1981 319 m20 1985 319 m20 1989 319 m20 1994 319 m20 1998 319 m20 2003 319 m20 2007 319 m20 2012 319 m20 2016 319 m20 2021 319 m20 cs 0 0 0 P13
 setcolor 247 319 m 5 1 d 4 3 d 4 -1 d 5 2 d 4 -1 d 5 3 d 4 3 d 5 1 d 4 1 d 5 7 d 4 1 d 4 7 d 5 5 d 4 10 d 5 8 d 4 7 d 5 8 d 4 14 d 5 8 d 4 13 d 4 7 d 5 20 d 4 22 d 5 12 d 4 22 d 5 16 d 4 24 d 5 29 d 4 19 d 4 25 d 5 38 d 4 33 d 5 19 d 4 22 d 5 49 d 4
 25 d 5 38 d 4 42 d 4 33 d 5 27 d 4 34 d 5 41 d 4 22 d 5 37 d 4 30 d 5 29 d 4 26 d 4 32 d 5 43 d 4 30 d 5 44 d 4 32 d 5 34 d 4 25 d 5 21 d 4 15 d 4 32 d 5 31 d 4 28 d 5 19 d 4 47 d 5 20 d 4 12 d 5 39 d 4 4 d 4 34 d 5 4 d 4 23 d 5 7 d 4 8 d 5 30 d 4
 36 d 5 -11 d 4 15 d 4 X 5 14 d 4 14 d 5 10 d 4 16 d 5 3 d 4 -3 d 5 -3 d 4 16 d 4 -22 d 5 3 d 4 17 d 5 -16 d 4 5 d 5 -18 d 4 24 d 5 -23 d 4 23 d 4 -67 d 5 47 d 4 -33 d 5 -23 d 4 -6 d 5 -19 d 4 -2 d 5 -39 d 4 -21 d 4 -3 d 5 -27 d 4 -8 d 5 -31 d 4 9 d
 5 -9 d 4 -38 d 5 -32 d 4 -13 d 5 -19 d 4 -26 d 4 -34 d 5 -9 d 4 -36 d 5 -15 d 4 -47 d 5 -22 d 4 -16 d 5 -29 d 4 -38 d 4 1 d 5 -43 d 4 -21 d 5 -26 d 4 -8 d 5 -44 d 4 -13 d 5 -39 d 4 -24 d 4 -28 d 5 -22 d 4 -33 d 5 -17 d 4 -37 d 5 -15 d 4 -21 d 5 -18
 d 4 -39 d 4 -21 d 5 -13 d 4 -22 d 5 -31 d 4 -21 d 5 -17 d 4 -26 d 5 -22 d 4 -13 d 4 -19 d 5 -16 d 4 -20 d 5 -12 d 4 -15 d 5 -22 d 4 -13 d 5 -12 d 4 -18 d 4 -12 d 5 -9 d 4 -14 d 5 -10 d 4 -13 d 5 -10 d 4 -8 d 5 -7 d 4 -7 d 4 -7 d 5 -9 d 4 -3 d 5 -6 d
 4 -6 d 5 -5 d 4 -3 d 5 -2 d 4 -5 d 4 -2 d 5 -4 d 4 -2 d 5 -2 d 4 -1 d 5 -3 d 4 X 5 -3 d 4 X 4 -1 d 5 -2 d 9 X 4 -2 d 5 -1 d 9 X 4 -1 d 4 -1 d 5 -1 d 13 X 5 -2 d 13 X 4 -1 d 18 X 5 -1 d 9 X 4 -1 d 4 1 d 5 X 4 -1 d 23 X 4 -1 d 58 X 4 -1 d 734 X -463 X
 -4 -1 d -5 1 d -271 X -4 1 d -5 X -4 -1 d -4 1 d -45 X -4 1 d -5 X -4 -1 d -5 1 d -17 X -5 1 d -18 X -4 1 d -9 X -4 1 d -9 X -5 1 d -4 X -5 1 d -9 X -4 1 d -4 1 d -9 X -5 1 d -4 2 d -9 X -5 2 d -4 1 d -4 X -5 2 d -4 1 d -5 2 d -4 1 d -5 2 d -4 3 d
 -5 3 d -4 2 d -4 6 d -5 1 d -4 3 d -5 5 d -4 6 d -5 5 d -4 3 d -5 10 d -4 6 d -4 7 d -5 7 d -4 8 d -5 9 d -4 13 d -5 10 d -4 14 d -5 9 d -4 11 d -4 18 d -5 12 d -4 13 d -5 22 d -4 14 d -5 12 d -4 19 d -5 16 d -4 19 d -4 12 d -5 23 d -4 25 d -5 16 d
 -4 21 d -5 30 d -4 22 d -5 13 d -4 21 d -4 38 d -5 18 d -4 20 d -5 16 d -4 36 d -5 17 d -4 33 d -5 21 d -4 27 d -4 25 d -5 38 d -4 13 d -5 43 d -4 7 d -5 26 d -4 21 d -5 42 d -4 -1 d -4 38 d -5 29 d -4 15 d -5 22 d -4 46 d -5 16 d -4 35 d -5 9 d -4
 33 d -4 26 d -5 19 d -4 13 d -5 31 d -4 38 d -5 9 d -4 -9 d -5 31 d -4 8 d -5 27 d -4 2 d -4 21 d -5 39 d -4 1 d -5 19 d -4 6 d -5 23 d -4 32 d -5 -46 d -4 67 d -4 -24 d -5 23 d -4 -24 d -5 18 d -4 -5 d -5 17 d -4 -17 d -5 -4 d -4 22 d -4 -16 d -5 3
 d -4 3 d -5 -3 d -4 -16 d -5 -9 d -4 -14 d -5 -14 d -4 -1 d -4 -14 d -5 11 d -4 -36 d -5 -29 d -4 -9 d -5 -6 d -4 -23 d -5 -4 d -4 -33 d -4 -5 d -5 -38 d -4 -12 d -5 -19 d -4 -47 d -5 -19 d -4 -27 d -5 -32 d -4 -31 d -4 -15 d -5 -20 d -4 -25 d -5
 -34 d -4 -32 d -5 -43 d -4 -30 d -5 -42 d -4 -32 d -4 -26 d -5 -28 d -4 -30 d -5 -37 d -4 -21 d -5 -41 d -4 -34 d -5 -26 d -4 -33 d -4 -41 d -5 -37 d -4 -26 d -5 -48 d -4 -22 d -5 -18 d -4 -33 d -5 -37 d -4 -25 d -4 -18 d -5 -29 d -4 -23 d -5 -17 d
 -4 -21 d -5 -12 d -4 -22 d -5 -18 d -4 -7 d -4 -13 d -5 -8 d -4 -13 d -5 -8 d -4 -8 d -5 -7 d -4 -9 d -5 -6 d -4 -6 d -4 -1 d -5 -6 d -4 -1 d -5 -1 d -4 -2 d -5 -3 d -4 X -5 -1 d -4 X -4 -2 d -5 X FA 0.8 0 0 c 1 1 1 c 1 0 0 c 0.8 0 0 c 245 319 m 22
 X 1 Y 9 X 1 Y 9 X 1 Y 4 X 1 Y 5 X 1 Y 4 X 2 Y 5 X 2 Y 4 X 3 Y 5 X 3 Y 4 X 4 Y 4 X 4 Y 5 X 4 Y 4 X 4 Y 5 X 5 Y 4 X 6 Y 5 X 6 Y 4 X 10 Y 5 X 4 Y 4 X 10 Y 4 X 9 Y 5 X 11 Y 4 X 11 Y 5 X 10 Y 4 X 10 Y 5 X 17 Y 4 X 13 Y 5 X 10 Y 4 X 14 Y 4 X 20 Y 5 X 15 Y
 4 X 17 Y 5 X 18 Y 4 X 17 Y 5 X 11 Y 4 X 16 Y 5 X 17 Y 4 X 14 Y 4 X 18 Y 5 X 15 Y 4 X 14 Y 5 X 16 Y 4 X 13 Y 5 X 22 Y 4 X 12 Y 5 X 21 Y 4 X 17 Y 4 X 17 Y 5 X 13 Y 4 X 10 Y 5 X 13 Y 4 X 10 Y 5 X 20 Y 4 X 11 Y 5 X 15 Y 4 X 21 Y 4 X 9 Y 5 X 5 Y 4 X 17 Y
 5 X 6 Y 4 X 18 Y 5 X 4 Y 4 X 11 Y 5 X 4 Y 4 X 6 Y 4 X 16 Y 5 X 15 Y 9 X 5 Y 4 X 6 Y 5 X 6 Y 4 X 7 Y 5 X 4 Y 4 X 10 Y 4 X 2 Y 5 X -1 Y 4 X 4 Y 5 X 8 Y 4 X -10 Y 5 X 3 Y 4 X 8 Y 5 X -10 Y 4 X 6 Y 4 X -4 Y 5 X 9 Y 4 X -8 Y 5 X 14 Y 4 X -32 Y 5 X 23 Y 4
 X -16 Y 5 X -8 Y 4 X -4 Y 4 X -7 Y 5 X 1 Y 4 X -23 Y 5 X -6 Y 4 X 1 Y 5 X -12 Y 4 X -2 Y 5 X -16 Y 4 X 6 Y 4 X -4 Y 5 X -18 Y 4 X -14 Y 5 X -5 Y 4 X -9 Y 5 X -13 Y 4 X -16 Y 5 X -6 Y 4 X -15 Y 5 X -7 Y 4 X -20 Y 4 X -11 Y 5 X -8 Y 4 X -13 Y 5 X -19
 Y 4 X 3 Y 5 X -21 Y 4 X -12 Y 5 X -11 Y 4 X -4 Y 4 X -22 Y 5 X -5 Y 4 X -20 Y 5 X -11 Y 4 X -13 Y 5 X -10 Y 4 X -16 Y 5 X -11 Y 4 X -18 Y 4 X -5 Y 5 X -11 Y 4 X -10 Y 5 X -19 Y 4 X -10 Y 5 X -6 Y 4 X -11 Y 5 X -16 Y 4 X -11 Y 4 X -8 Y 5 X -13 Y 4 X
 -12 Y 5 X -6 Y 4 X -9 Y 5 X -9 Y 4 X -10 Y 5 X -7 Y 4 X -6 Y 4 X -15 Y 5 X -5 Y 4 X -5 Y 5 X -12 Y 4 X -5 Y 5 X -4 Y 4 X -8 Y 5 X -5 Y 4 X -7 Y 4 X -7 Y 5 X -4 Y 4 X -3 Y 5 X -4 Y 4 X -7 Y 5 X -4 Y 4 X -1 Y 5 X -3 Y 4 X -4 Y 4 X -3 Y 5 X -1 Y 4 X -1
 Y 5 X -5 Y 9 X -4 Y 4 X -2 Y 5 X -1 Y 4 X -1 Y 4 X -2 Y 5 X 1 Y 4 X -3 Y 9 X -1 Y 5 X -1 Y 4 X -1 Y 5 X 1 Y 4 X -2 Y 4 X -1 Y 5 X -2 Y 4 X 2 Y 5 X -1 Y 4 X -2 Y 14 X -1 Y 8 X -1 Y 5 X -1 Y 4 X 1 Y 9 X -1 Y 9 X -1 Y 9 X -1 Y 4 X 1 Y 5 X -1 Y 9 X -1 Y
 9 X 1 Y 4 X -2 Y 13 X 1 Y 5 X -1 Y 9 X -1 Y 18 X 1 Y 4 X -1 Y 9 X -1 Y 31 X -1 Y 27 X -1 Y 4 X 1 Y 18 X -1 Y 13 X 1 Y 5 X -1 Y 35 X -1 Y 9 X 1 Y 5 X -1 Y 80 X -1 Y 4 X 1 Y 9 X -1 Y 40 X 1 Y 4 X -1 Y 125 X -1 Y 4 X 1 Y 9 X -1 Y 9 X 1 Y 4 X -1 Y 334 X
 s 1 0 0 c 247 319 m20 252 319 m20 256 319 m20 260 319 m20 265 319 m20 269 320 m20 274 320 m20 278 321 m20 283 321 m20 287 322 m20 292 323 m20 296 324 m20 300 326 m20 305 328 m20 309 331 m20 314 334 m20 318 338 m20 323 342 m20 327 346 m20 332 350 m20
 336 355 m20 340 361 m20 345 367 m20 349 377 m20 354 381 m20 358 391 m20 363 400 m20 367 411 m20 372 422 m20 376 432 m20 380 442 m20 385 459 m20 389 472 m20 394 482 m20 398 496 m20 403 516 m20 407 531 m20 412 548 m20 416 566 m20 420 583 m20 425 594
 m20 429 610 m20 434 627 m20 438 641 m20 443 659 m20 447 674 m20 452 688 m20 456 704 m20 460 717 m20 465 739 m20 469 751 m20 474 772 m20 478 789 m20 483 806 m20 487 819 m20 492 829 m20 496 842 m20 500 852 m20 505 872 m20 509 883 m20 514 898 m20 518
 919 m20 523 928 m20 527 933 m20 532 950 m20 536 956 m20 540 974 m20 545 978 m20 549 989 m20 554 993 m20 558 999 m20 563 1015 m20 567 1030 m20 572 1030 m20 576 1035 m20 580 1041 m20 585 1047 m20 589 1054 m20 594 1058 m20 598 1068 m20 603 1070 m20 607
 1069 m20 612 1073 m20 616 1081 m20 620 1071 m20 625 1074 m20 629 1082 m20 634 1072 m20 638 1078 m20 643 1074 m20 647 1083 m20 652 1075 m20 656 1089 m20 660 1057 m20 665 1080 m20 669 1064 m20 674 1056 m20 678 1052 m20 683 1045 m20 687 1046 m20 692
 1023 m20 696 1017 m20 700 1018 m20 705 1006 m20 709 1004 m20 714 988 m20 718 994 m20 723 990 m20 727 972 m20 732 958 m20 736 953 m20 741 944 m20 745 931 m20 749 915 m20 754 909 m20 758 894 m20 763 887 m20 767 867 m20 772 856 m20 776 848 m20 781 835
 m20 785 816 m20 789 819 m20 794 798 m20 798 786 m20 803 775 m20 807 771 m20 812 749 m20 816 744 m20 821 724 m20 825 713 m20 829 700 m20 834 690 m20 838 674 m20 843 663 m20 847 645 m20 852 640 m20 856 629 m20 861 619 m20 865 600 m20 869 590 m20 874
 584 m20 878 573 m20 883 557 m20 887 546 m20 892 538 m20 896 525 m20 901 513 m20 905 507 m20 909 498 m20 914 489 m20 918 479 m20 923 472 m20 927 466 m20 932 451 m20 936 446 m20 941 441 m20 945 429 m20 949 424 m20 954 420 m20 958 412 m20 963 407 m20
 967 400 m20 972 393 m20 976 389 m20 981 386 m20 985 382 m20 989 375 m20 994 371 m20 998 370 m20 1003 367 m20 1007 363 m20 1012 360 m20 1016 359 m20 1021 358 m20 1025 353 m20 1029 353 m20 1034 349 m20 1038 347 m20 1043 346 m20 1047 345 m20 1052 343
 m20 1056 344 m20 1061 341 m20 1065 341 m20 1069 340 m20 1074 339 m20 1078 338 m20 1083 339 m20 1087 337 m20 1092 336 m20 1096 334 m20 1101 336 m20 1105 335 m20 1109 333 m20 1114 333 m20 1118 333 m20 1123 332 m20 1127 332 m20 1132 331 m20 1136 330
 m20 1141 331 m20 1145 331 m20 1149 330 m20 1154 330 m20 1158 329 m20 1163 329 m20 1167 328 m20 1172 329 m20 1176 328 m20 1181 328 m20 1185 327 m20 1189 327 m20 1194 328 m20 1198 326 m20 1203 326 m20 1207 326 m20 1212 327 m20 1216 326 m20 1221 326
 m20 1225 325 m20 1229 325 m20 1234 325 m20 1238 325 m20 1243 326 m20 1247 325 m20 1252 325 m20 1256 324 m20 1261 324 m20 1265 324 m20 1269 324 m20 1274 324 m20 1278 324 m20 1283 324 m20 1287 323 m20 1292 323 m20 1296 323 m20 1301 323 m20 1305 323
 m20 1309 323 m20 1314 322 m20 1318 323 m20 1323 323 m20 1327 323 m20 1332 323 m20 1336 322 m20 1341 322 m20 1345 322 m20 1349 323 m20 1354 322 m20 1358 322 m20 1363 322 m20 1367 322 m20 1372 322 m20 1376 322 m20 1381 322 m20 1385 322 m20 1389 321
 m20 1394 321 m20 1398 322 m20 1403 321 m20 1407 321 m20 1412 321 m20 1416 321 m20 1421 321 m20 1425 321 m20 1429 321 m20 1434 321 m20 1438 321 m20 1443 321 m20 1447 321 m20 1452 321 m20 1456 321 m20 1461 321 m20 1465 321 m20 1469 321 m20 1474 321
 m20 1478 321 m20 1483 320 m20 1487 321 m20 1492 321 m20 1496 320 m20 1501 320 m20 1505 320 m20 1509 320 m20 1514 320 m20 1518 320 m20 1523 320 m20 1527 320 m20 1532 320 m20 1536 321 m20 1541 320 m20 1545 320 m20 1549 320 m20 1554 320 m20 1558 320
 m20 1563 320 m20 1567 320 m20 1572 320 m20 1576 320 m20 1581 320 m20 1585 320 m20 1589 320 m20 1594 320 m20 1598 320 m20 1603 320 m20 1607 320 m20 1612 320 m20 1616 320 m20 1621 320 m20 1625 320 m20 1629 320 m20 1634 320 m20 1638 320 m20 1643 320
 m20 1647 320 m20 1652 320 m20 1656 320 m20 1661 320 m20 1665 319 m20 1669 320 m20 1674 320 m20 1678 319 m20 1683 319 m20 1687 320 m20 1692 319 m20 1696 319 m20 1701 319 m20 1705 319 m20 1709 319 m20 1714 319 m20 1718 319 m20 1723 319 m20 1727 319
 m20 1732 319 m20 1736 319 m20 1741 319 m20 1745 319 m20 1749 319 m20 1754 319 m20 1758 319 m20 1763 319 m20 1767 319 m20 1772 319 m20 1776 319 m20 1781 319 m20 1785 319 m20 1789 319 m20 1794 319 m20 1798 319 m20 1803 319 m20 1807 319 m20 1812 319
 m20 1816 319 m20 1821 319 m20 1825 319 m20 1829 319 m20 1834 319 m20 1838 319 m20 1843 319 m20 1847 319 m20 1852 319 m20 1856 319 m20 1861 319 m20 1865 319 m20 1869 319 m20 1874 319 m20 1878 319 m20 1883 319 m20 1887 319 m20 1892 319 m20 1896 319
 m20 1901 319 m20 1905 319 m20 1909 319 m20 1914 319 m20 1918 319 m20 1923 319 m20 1927 319 m20 1932 319 m20 1936 319 m20 1941 319 m20 1945 319 m20 1949 319 m20 1954 319 m20 1958 319 m20 1963 319 m20 1967 319 m20 1972 319 m20 1976 319 m20 1981 319
 m20 1985 319 m20 1989 319 m20 1994 319 m20 1998 319 m20 2003 319 m20 2007 319 m20 2012 319 m20 2016 319 m20 2021 319 m20 0.8 0 0 c black 0.8 0 0 c cs 0.8 0 0 P13 setcolor 247 319 m 18 X 4 1 d 5 X 4 1 d 5 X 4 1 d 5 2 d 4 1 d 4 1 d 5 3 d 4 3 d 5 2 d 4
 4 d 5 4 d 4 4 d 5 5 d 4 5 d 4 6 d 5 6 d 4 10 d 5 4 d 4 11 d 5 8 d 4 11 d 5 11 d 4 10 d 4 11 d 5 17 d 4 13 d 5 10 d 4 14 d 5 20 d 4 15 d 5 17 d 4 18 d 4 18 d 5 11 d 4 16 d 5 17 d 4 14 d 5 18 d 4 15 d 5 14 d 4 16 d 4 14 d 5 22 d 4 12 d 5 21 d 4 17 d 5
 17 d 4 13 d 5 10 d 4 13 d 4 10 d 5 20 d 4 12 d 5 14 d 4 21 d 5 10 d 4 5 d 5 17 d 4 6 d 4 18 d 5 4 d 4 11 d 5 4 d 4 6 d 5 16 d 4 15 d 5 X 4 6 d 4 5 d 5 6 d 4 7 d 5 4 d 4 11 d 5 2 d 4 -2 d 5 4 d 4 9 d 4 -10 d 5 3 d 4 8 d 5 -10 d 4 6 d 5 -4 d 4 9 d 5
 -9 d 4 15 d 4 -33 d 5 23 d 4 -16 d 5 -7 d 4 -5 d 5 -7 d 4 2 d 5 -23 d 4 -7 d 4 1 d 5 -12 d 4 -2 d 5 -15 d 4 5 d 5 -4 d 4 -18 d 5 -13 d 4 -6 d 5 -9 d 4 -13 d 4 -16 d 5 -6 d 4 -15 d 5 -7 d 4 -21 d 5 -11 d 4 -7 d 5 -13 d 4 -20 d 4 4 d 5 -22 d 4 -11 d 5
 -12 d 4 -4 d 5 -22 d 4 -5 d 5 -20 d 4 -11 d 4 -14 d 5 -9 d 4 -17 d 5 -11 d 4 -17 d 5 -6 d 4 -11 d 5 -10 d 4 -19 d 4 -10 d 5 -7 d 4 -10 d 5 -16 d 4 -12 d 5 -7 d 4 -14 d 5 -12 d 4 -6 d 4 -9 d 5 -8 d 4 -11 d 5 -7 d 4 -6 d 5 -15 d 4 -5 d 5 -5 d 4 -12 d
 4 -5 d 5 -5 d 4 -8 d 5 -5 d 4 -7 d 5 -7 d 4 -4 d 5 -3 d 4 -4 d 4 -6 d 5 -4 d 4 -2 d 5 -3 d 4 -4 d 5 -3 d 4 -1 d 5 -1 d 4 -6 d 4 1 d 5 -4 d 4 -2 d 5 -1 d 4 -1 d 5 -2 d 4 X 5 -2 d 4 X 4 -1 d 5 -2 d 9 X 4 -2 d 5 -1 d 4 -1 d 5 1 d 4 X 4 -2 d 5 -1 d 4 1
 d 5 -1 d 4 X 5 -1 d 4 -1 d 5 1 d 4 X 4 -1 d 5 X 4 -1 d 5 -1 d 4 -1 d 5 2 d 4 -2 d 18 X 4 -2 d 5 X 4 1 d 9 X 5 -1 d 8 X 5 -1 d 4 1 d 14 X 4 -1 d 18 X 4 -1 d 5 1 d 4 -1 d 5 -1 d 4 1 d 5 -1 d 4 X 4 1 d 5 -1 d 18 X 4 -1 d 5 X 4 1 d 4 X 5 -1 d 4 X 5 1 d
 4 -1 d 18 X 4 -1 d 5 1 d 13 X 5 -1 d 4 1 d 5 -1 d 4 X 4 1 d 5 -1 d 58 X 4 -1 d 5 1 d 8 X 5 -1 d 4 1 d 5 -1 d 9 X 4 1 d 5 -1 d 133 X 4 -1 d 5 X 4 1 d 5 X 4 -1 d 5 1 d 4 X 4 -1 d 9 X 5 1 d 4 X 5 -1 d 289 X -356 X -4 1 d -5 -1 d -18 X -4 1 d -18 X -4
 -1 d -5 1 d -4 X -5 -1 d -4 1 d -98 X -4 1 d -5 -1 d -4 X -5 1 d -4 -1 d -5 X -4 1 d -9 X -4 -1 d -5 1 d -22 X -4 -1 d -5 1 d -31 X -4 1 d -5 -1 d -4 X -5 1 d -9 X -4 -1 d -5 1 d -8 X -5 -1 d -4 2 d -5 X -4 -1 d -5 1 d -4 -1 d -5 1 d -4 -1 d -4 X -5
 1 d -9 X -4 1 d -27 X -4 1 d -14 X -4 -1 d -5 1 d -8 X -5 1 d -9 X -4 -1 d -5 X -4 2 d -5 X -4 -1 d -4 1 d -5 X -4 1 d -5 -1 d -4 1 d -5 1 d -4 1 d -5 -1 d -4 1 d -4 1 d -5 -1 d -4 1 d -5 1 d -13 X -5 1 d -4 2 d -4 X -5 -1 d -4 1 d -5 1 d -4 2 d -5
 -1 d -4 1 d -5 1 d -4 2 d -4 -1 d -5 3 d -4 X -5 2 d -4 X -5 1 d -4 2 d -5 4 d -4 X -4 5 d -5 1 d -4 1 d -5 3 d -4 4 d -5 3 d -4 1 d -5 4 d -4 6 d -4 4 d -5 3 d -4 5 d -5 6 d -4 7 d -5 5 d -4 8 d -5 5 d -4 5 d -4 11 d -5 5 d -4 5 d -5 15 d -4 6 d -5
 7 d -4 10 d -5 9 d -4 8 d -4 6 d -5 12 d -4 14 d -5 7 d -4 12 d -5 16 d -4 10 d -5 6 d -4 10 d -4 19 d -5 10 d -4 10 d -5 6 d -4 18 d -5 11 d -4 16 d -5 9 d -4 13 d -4 11 d -5 20 d -4 6 d -5 21 d -4 4 d -5 11 d -4 11 d -5 22 d -4 -3 d -4 19 d -5 13
 d -4 7 d -5 11 d -4 21 d -5 6 d -4 16 d -5 5 d -4 16 d -4 13 d -5 9 d -4 5 d -5 14 d -4 18 d -5 4 d -4 -6 d -5 15 d -4 2 d -5 12 d -4 -1 d -4 7 d -5 22 d -4 -1 d -5 7 d -4 5 d -5 7 d -4 16 d -5 -23 d -4 32 d -4 -14 d -5 8 d -4 -9 d -5 5 d -4 -6 d -5
 10 d -4 -9 d -5 -2 d -4 9 d -4 -8 d -5 -4 d -4 1 d -5 -1 d -4 -11 d -5 -4 d -4 -7 d -5 -5 d -4 -6 d -4 -5 d -5 X -4 -15 d -5 -16 d -4 -6 d -5 -4 d -4 -11 d -5 -4 d -4 -18 d -4 -6 d -5 -17 d -4 -4 d -5 -10 d -4 -21 d -5 -14 d -4 -11 d -5 -20 d -4 -11
 d -4 -12 d -5 -10 d -4 -13 d -5 -16 d -4 -17 d -5 -21 d -4 -12 d -5 -22 d -4 -14 d -4 -15 d -5 -14 d -4 -15 d -5 -18 d -4 -13 d -5 -18 d -4 -16 d -5 -10 d -4 -18 d -4 -17 d -5 -17 d -4 -15 d -5 -19 d -4 -15 d -5 -10 d -4 -12 d -5 -17 d -4 -11 d -4
 -10 d -5 -11 d -4 -10 d -5 -9 d -4 -10 d -5 -4 d -4 -10 d -5 -6 d -4 -5 d -4 -6 d -5 -4 d -4 -4 d -5 -4 d -4 -3 d -5 -3 d -4 -3 d -5 -2 d -4 -2 d -4 -1 d -5 -1 d -4 -1 d -5 -1 d -4 X -5 -1 d -22 X FA black 1 1 1 c 556 639 1578 1302 bf black 1578
 1302 m 556 X s 2134 1302 m 639 Y s 2134 1941 m -556 X s 1578 1941 m -639 Y s
 gsave  2222 2133 23 22 C 1716.93 1827.09 t 0 r /Helvetica findfont 95.0544 sf 0 0 m (No Int) show NC gr  0.8 0 0 c 1599 1861 m 97 X s black
 gsave  2222 2133 23 22 C 1716.93 1663.75 t 0 r /Helvetica findfont 95.0544 sf 0 0 m (Add) show NC gr  0.8 0.8 0 c 1599 1702 m 97 X s black
 gsave  2222 2133 23 22 C 1716.93 1504.21 t 0 r /Helvetica findfont 95.0544 sf 0 0 m (Mult) show NC gr  0.8 0 0.8 c 1599 1542 m 97 X s black
 gsave  2222 2133 23 22 C 1716.93 1344.68 t 0 r /Helvetica findfont 95.0544 sf 0 0 m (Central) show NC gr  1599 1382 m 97 X s
 gsave  2222 2133 23 22 C 2199.34 1568.79 t 90 r /Helvetica-BoldOblique findfont 38.0218 sf 0 0 m (LHC HIGGS XS WG 2013) show NC gr 
 gr  gr showpage
end
%%EOF
