%!PS-Adobe-2.0 EPSF-2.0
%%BoundingBox:  0 0 567 364
%%Title: eps/h_mll10_sr_sf_1j_nodphi.eps: h_mll10_sr_sf_1j_nodphi
%%Creator: ROOT Version 5.32/03
%%CreationDate: Wed Mar  6 16:50:19 2013
%%EndComments
%%BeginProlog
80 dict begin
/s {stroke} def /l {lineto} def /m {moveto} def /t {translate} def
/r {rotate} def /rl {roll}  def /R {repeat} def
/d {rlineto} def /rm {rmoveto} def /gr {grestore} def /f {eofill} def
/c {setrgbcolor} def /black {0 setgray} def /sd {setdash} def
/cl {closepath} def /sf {scalefont setfont} def /lw {setlinewidth} def
/box {m dup 0 exch d exch 0 d 0 exch neg d cl} def
/NC{systemdict begin initclip end}def/C{NC box clip newpath}def
/bl {box s} def /bf {box f} def /Y { 0 exch d} def /X { 0 d} def 
/K {{pop pop 0 moveto} exch kshow} bind def
/ita {/ang 15 def gsave [1 0 ang dup sin exch cos div 1 0 0] concat} def 
/mp {newpath /y exch def /x exch def} def
/side {[w .77 mul w .23 mul] .385 w mul sd w 0 l currentpoint t -144 r} def
/mr {mp x y w2 0 360 arc} def /m24 {mr s} def /m20 {mr f} def
/mb {mp x y w2 add m w2 neg 0 d 0 w neg d w 0 d 0 w d cl} def
/mt {mp x y w2 add m w2 neg w neg d w 0 d cl} def
/m21 {mb f} def /m25 {mb s} def /m22 {mt f} def /m26{mt s} def
/m23 {mp x y w2 sub m w2 w d w neg 0 d cl f} def
/m27 {mp x y w2 add m w3 neg w2 neg d w3 w2 neg d w3 w2 d cl s} def
/m28 {mp x w2 sub y w2 sub w3 add m w3 0 d  0 w3 neg d w3 0 d 0 w3 d w3 0 d  0 w3 d w3 neg 0 d 0 w3 d w3 neg 0 d 0 w3 neg d w3 neg 0 d cl s } def
/m29 {mp gsave x w2 sub y w2 add w3 sub m currentpoint t 4 {side} repeat cl fill gr} def
/m30 {mp gsave x w2 sub y w2 add w3 sub m currentpoint t 4 {side} repeat cl s gr} def
/m31 {mp x y w2 sub m 0 w d x w2 sub y m w 0 d x w2 sub y w2 add m w w neg d x w2 sub y w2 sub m w w d s} def
/m32 {mp x y w2 sub m w2 w d w neg 0 d cl s} def
/m33 {mp x y w2 add m w3 neg w2 neg d w3 w2 neg d w3 w2 d cl f} def
/m34 {mp x w2 sub y w2 sub w3 add m w3 0 d  0 w3 neg d w3 0 d 0 w3 d w3 0 d  0 w3 d w3 neg 0 d 0 w3 d w3 neg 0 d 0 w3 neg d w3 neg 0 d cl f } def
/m2 {mp x y w2 sub m 0 w d x w2 sub y m w 0 d s} def
/m5 {mp x w2 sub y w2 sub m w w d x w2 sub y w2 add m w w neg d s} def
/reEncode {exch findfont dup length dict begin {1 index /FID eq  {pop pop} {def} ifelse } forall /Encoding exch def currentdict end dup /FontName get exch definefont pop } def [/Times-Bold /Times-Italic /Times-BoldItalic /Helvetica /Helvetica-Oblique
 /Helvetica-Bold /Helvetica-BoldOblique /Courier /Courier-Oblique /Courier-Bold /Courier-BoldOblique /Times-Roman /AvantGarde-Book /AvantGarde-BookOblique /AvantGarde-Demi /AvantGarde-DemiOblique /Bookman-Demi /Bookman-DemiItalic /Bookman-Light
 /Bookman-LightItalic /Helvetica-Narrow /Helvetica-Narrow-Bold /Helvetica-Narrow-BoldOblique /Helvetica-Narrow-Oblique /NewCenturySchlbk-Roman /NewCenturySchlbk-Bold /NewCenturySchlbk-BoldItalic /NewCenturySchlbk-Italic /Palatino-Bold
 /Palatino-BoldItalic /Palatino-Italic /Palatino-Roman ] {ISOLatin1Encoding reEncode } forall%%EndProlog
%%BeginSetup
%%EndSetup
newpath  gsave  .25 .25 scale  gsave  0 0 t black[  ] 0 sd 3 lw 1 1 1 c 2268 1455 0 0 bf black 1 1 1 c 1882 771 272 611 bf black 1882 771 272 611 bl 1 1 1 c 1882 625 272 757 bf black 1882 625 272 757 bl 6 lw 1 1 1 c black 272 895 m 135 X 80 Y 134 X
 78 Y 134 X 90 Y 135 X 63 Y 134 X 8 Y 135 X -30 Y 134 X -43 Y 135 X -45 Y 134 X -48 Y 135 X -43 Y 134 X -39 Y 134 X -33 Y 135 X -27 Y 134 X s 3 lw 272 757 m 1882 X s
 gsave  2268 1455 0 0 C 1959.67 625.916 t 0 r /Helvetica findfont 68.818 sf 0 0 m ( [GeV]) show NC gr 
 gsave  2268 1455 0 0 C 1940.01 602.977 t 0 r /Helvetica findfont 45.8787 sf 0 0 m (ll) show NC gr 
 gsave  2268 1455 0 0 C 1884.3 625.916 t 0 r /Helvetica findfont 68.818 sf 0 0 m (m) show NC gr  407 793 m -36 Y s 474 775 m -18 Y s 541 775 m -18 Y s 608 775 m -18 Y s 675 793 m -36 Y s 743 775 m -18 Y s 810 775 m -18 Y s 877 775 m -18 Y s 944 793 m
 -36 Y s 1012 775 m -18 Y s 1079 775 m -18 Y s 1146 775 m -18 Y s 1213 793 m -36 Y s 1280 775 m -18 Y s 1348 775 m -18 Y s 1415 775 m -18 Y s 1482 793 m -36 Y s 1549 775 m -18 Y s 1617 775 m -18 Y s 1684 775 m -18 Y s 1751 793 m -36 Y s 1818 775 m
 -18 Y s 1885 775 m -18 Y s 1953 775 m -18 Y s 2020 793 m -36 Y s 407 793 m -36 Y s 339 775 m -18 Y s 2020 793 m -36 Y s 2087 775 m -18 Y s 2154 775 m -18 Y s 272 1382 m 1882 X s 407 1346 m 36 Y s 474 1364 m 18 Y s 541 1364 m 18 Y s 608 1364 m 18 Y s
 675 1346 m 36 Y s 743 1364 m 18 Y s 810 1364 m 18 Y s 877 1364 m 18 Y s 944 1346 m 36 Y s 1012 1364 m 18 Y s 1079 1364 m 18 Y s 1146 1364 m 18 Y s 1213 1346 m 36 Y s 1280 1364 m 18 Y s 1348 1364 m 18 Y s 1415 1364 m 18 Y s 1482 1346 m 36 Y s 1549
 1364 m 18 Y s 1617 1364 m 18 Y s 1684 1364 m 18 Y s 1751 1346 m 36 Y s 1818 1364 m 18 Y s 1885 1364 m 18 Y s 1953 1364 m 18 Y s 2020 1346 m 36 Y s 407 1346 m 36 Y s 339 1364 m 18 Y s 2020 1346 m 36 Y s 2087 1364 m 18 Y s 2154 1364 m 18 Y s 272 757 m
 625 Y s
 gsave  2268 1455 0 0 C 108.143 717.673 t 90 r /Helvetica findfont 68.818 sf 0 0 m (Normalised to integral) show NC gr  301 757 m -29 X s 287 777 m -15 X s 287 798 m -15 X s 287 819 m -15 X s 301 840 m -29 X s 287 861 m -15 X s 287 882 m -15 X s 287
 903 m -15 X s 301 923 m -29 X s 287 944 m -15 X s 287 965 m -15 X s 287 986 m -15 X s 301 1007 m -29 X s 287 1028 m -15 X s 287 1049 m -15 X s 287 1069 m -15 X s 301 1090 m -29 X s 287 1111 m -15 X s 287 1132 m -15 X s 287 1153 m -15 X s 301 1174 m
 -29 X s 287 1195 m -15 X s 287 1215 m -15 X s 287 1236 m -15 X s 301 1257 m -29 X s 287 1278 m -15 X s 287 1299 m -15 X s 287 1320 m -15 X s 301 1341 m -29 X s 301 1341 m -29 X s 287 1361 m -15 X s
 gsave  2268 1455 0 0 C 2222.23 880.27 t 90 r /Helvetica-BoldOblique findfont 41.8538 sf 0 0 m (LHC HIGGS XS WG 2013) show NC gr  0.2 0.2 0.2 c black 0.2 0.2 0.2 c
 gsave  2268 1455 0 0 C 222.839 730.781 t 0 r /Helvetica findfont 68.818 sf 0 0 m (0) show NC gr 
 gsave  2268 1455 0 0 C 127.805 815.985 t 0 r /Helvetica findfont 68.818 sf 0 0 m (0.02) show NC gr 
 gsave  2268 1455 0 0 C 127.805 897.911 t 0 r /Helvetica findfont 68.818 sf 0 0 m (0.04) show NC gr 
 gsave  2268 1455 0 0 C 127.805 983.114 t 0 r /Helvetica findfont 68.818 sf 0 0 m (0.06) show NC gr 
 gsave  2268 1455 0 0 C 127.805 1065.04 t 0 r /Helvetica findfont 68.818 sf 0 0 m (0.08) show NC gr 
 gsave  2268 1455 0 0 C 173.683 1150.24 t 0 r /Helvetica findfont 68.818 sf 0 0 m (0.1) show NC gr 
 gsave  2268 1455 0 0 C 127.805 1232.17 t 0 r /Helvetica findfont 68.818 sf 0 0 m (0.12) show NC gr 
 gsave  2268 1455 0 0 C 127.805 1317.37 t 0 r /Helvetica findfont 68.818 sf 0 0 m (0.14) show NC gr  2154 757 m 625 Y s 2125 757 m 29 X s 2140 777 m 14 X s 2140 798 m 14 X s 2140 819 m 14 X s 2125 840 m 29 X s 2140 861 m 14 X s 2140 882 m 14 X s 2140
 903 m 14 X s 2125 923 m 29 X s 2140 944 m 14 X s 2140 965 m 14 X s 2140 986 m 14 X s 2125 1007 m 29 X s 2140 1028 m 14 X s 2140 1049 m 14 X s 2140 1069 m 14 X s 2125 1090 m 29 X s 2140 1111 m 14 X s 2140 1132 m 14 X s 2140 1153 m 14 X s 2125 1174 m
 29 X s 2140 1195 m 14 X s 2140 1215 m 14 X s 2140 1236 m 14 X s 2125 1257 m 29 X s 2140 1278 m 14 X s 2140 1299 m 14 X s 2140 1320 m 14 X s 2125 1341 m 29 X s 2125 1341 m 29 X s 2140 1361 m 14 X s 6 lw 1 1 1 c black 272 895 m 54 X s 352 895 m 55 X s
 3 lw /w 31 def /w2 {w 2 div} def /w3 {w 3 div} def 339 895 m20 6 lw 407 975 m 54 X s 487 975 m 54 X s 3 lw 474 975 m20 6 lw 541 1053 m 54 X s 621 1053 m 54 X s 3 lw 608 1053 m20 6 lw 675 1143 m 55 X s 756 1143 m 54 X s 3 lw 743 1143 m20 6 lw 810
 1206 m 54 X s 890 1206 m 54 X s 3 lw 877 1206 m20 6 lw 944 1214 m 54 X s 1025 1214 m 54 X s 3 lw 1012 1214 m20 6 lw 1079 1184 m 54 X s 1159 1184 m 54 X s 3 lw 1146 1184 m20 6 lw 1213 1141 m 54 X s 1294 1141 m 54 X s 3 lw 1280 1141 m20 6 lw 1348 1096
 m 54 X s 1428 1096 m 54 X s 3 lw 1415 1096 m20 6 lw 1482 1048 m 54 X s 1562 1048 m 55 X s 3 lw 1549 1048 m20 6 lw 1617 1005 m 54 X s 1697 1005 m 54 X s 3 lw 1684 1005 m20 6 lw 1751 966 m 54 X s 1831 966 m 54 X s 3 lw 1818 966 m20 6 lw 1885 933 m 55
 X s 1966 933 m 54 X s 3 lw 1953 933 m20 6 lw 2020 906 m 54 X s 2100 906 m 54 X s 3 lw 2087 906 m20 6 lw 0.8 0 0 c 1 1 1 c 0.8 0 0 c 3 lw 339 899 m24 6 lw 3 lw 474 979 m24 6 lw 3 lw 608 1056 m24 6 lw 3 lw 743 1142 m24 6 lw 3 lw 877 1203 m24 6 lw 3 lw
 1012 1212 m24 6 lw 3 lw 1146 1182 m24 6 lw 3 lw 1280 1140 m24 6 lw 3 lw 1415 1093 m24 6 lw 3 lw 1549 1047 m24 6 lw 3 lw 1684 1004 m24 6 lw 3 lw 1818 966 m24 6 lw 3 lw 1953 935 m24 6 lw 3 lw 2087 906 m24 6 lw 1 1 1 c 0.8 0 0 c 272 899 m 135 X 80 Y
 134 X 77 Y 134 X 86 Y 135 X 61 Y 134 X 9 Y 135 X -30 Y 134 X -42 Y 135 X -47 Y 134 X -46 Y 135 X -43 Y 134 X -38 Y 134 X -31 Y 135 X -29 Y 134 X s 0.2 0.2 0.6 c 1 1 1 c 0.2 0.2 0.6 c 3 lw 339 896 m25 6 lw 3 lw 474 975 m25 6 lw 3 lw 608 1052 m25 6 lw
 3 lw 743 1149 m25 6 lw 3 lw 877 1209 m25 6 lw 3 lw 1012 1213 m25 6 lw 3 lw 1146 1184 m25 6 lw 3 lw 1280 1141 m25 6 lw 3 lw 1415 1091 m25 6 lw 3 lw 1549 1046 m25 6 lw 3 lw 1684 1004 m25 6 lw 3 lw 1818 965 m25 6 lw 3 lw 1953 933 m25 6 lw 3 lw 2087 907
 m25 6 lw 1 1 1 c 0.2 0.2 0.6 c 272 896 m 135 X 79 Y 134 X 77 Y 134 X 97 Y 135 X 60 Y 134 X 4 Y 135 X -29 Y 134 X -43 Y 135 X -50 Y 134 X -45 Y 135 X -42 Y 134 X -39 Y 134 X -32 Y 135 X -26 Y 134 X s black
 gsave  2268 1455 0 0 C 1727 1320.65 t 0 r /Helvetica-Bold findfont 55.7098 sf 0 0 m (Pow + pythia 8) show NC gr  1609 1337 m 99 X s 3 lw 1658 1337 m20 6 lw
 gsave  2268 1455 0 0 C 1727 1225.62 t 0 r /Helvetica-Bold findfont 55.7098 sf 0 0 m (Pow + her) show NC gr  0.8 0 0 c 1609 1246 m 99 X s 3 lw 1658 1246 m24 6 lw black
 gsave  2268 1455 0 0 C 1727 1140.41 t 0 r /Helvetica-Bold findfont 55.7098 sf 0 0 m (aMC@NLO) show NC gr  0.2 0.2 0.6 c 1609 1155 m 99 X s 3 lw 1658 1155 m25 6 lw black
 gsave  2268 1455 0 0 C 1727 1042.1 t 0 r /Helvetica-Bold findfont 55.7098 sf 0 0 m (MCFM) show NC gr  1 1 1 c 3 lw 1609 1032 m 99 X 64 Y -99 X f 6 lw 0 0.4 0 c 1609 1064 m 99 X s 3 lw 1658 1064 m24 6 lw black 3 lw 1 1 1 c black 1 1 1 c 1882 378 272
 233 bf black 1882 378 272 233 bl 1 1 1 c 1882 524 272 233 bf black 1882 524 272 233 bl 0.8 0 0 c 6 lw 1 1 1 c 0.8 0 0 c 272 535 m 54 X s 352 535 m 55 X s 3 lw 339 535 m24 6 lw 407 515 m 54 X s 487 515 m 54 X s 3 lw 474 515 m24 6 lw 541 508 m 54 X s
 621 508 m 54 X s 3 lw 608 508 m24 6 lw 675 491 m 55 X s 756 491 m 54 X s 3 lw 743 491 m24 6 lw 810 487 m 54 X s 890 487 m 54 X s 3 lw 877 487 m24 6 lw 944 487 m 54 X s 1025 487 m 54 X s 3 lw 1012 487 m24 6 lw 1079 487 m 54 X s 1159 487 m 54 X s 3 lw
 1146 487 m24 6 lw 1213 491 m 54 X s 1294 491 m 54 X s 3 lw 1280 491 m24 6 lw 1348 486 m 54 X s 1428 486 m 54 X s 3 lw 1415 486 m24 6 lw 1482 493 m 54 X s 1562 493 m 55 X s 3 lw 1549 493 m24 6 lw 1617 491 m 54 X s 1697 491 m 54 X s 3 lw 1684 491 m24
 6 lw 1751 499 m 54 X s 1831 499 m 54 X s 3 lw 1818 499 m24 6 lw 1885 504 m 55 X s 1966 504 m 54 X s 3 lw 1953 504 m24 6 lw 2020 500 m 54 X s 2100 500 m 54 X s 3 lw 2087 500 m24 6 lw black 3 lw 272 233 m 1882 X s
 gsave  2268 1455 0 0 C 1959.67 101.588 t 0 r /Helvetica findfont 68.818 sf 0 0 m ( [GeV]) show NC gr 
 gsave  2268 1455 0 0 C 1940.01 78.6491 t 0 r /Helvetica findfont 45.8787 sf 0 0 m (ll) show NC gr 
 gsave  2268 1455 0 0 C 1884.3 101.588 t 0 r /Helvetica findfont 68.818 sf 0 0 m (m) show NC gr  407 269 m -36 Y s 474 251 m -18 Y s 541 251 m -18 Y s 608 251 m -18 Y s 675 269 m -36 Y s 743 251 m -18 Y s 810 251 m -18 Y s 877 251 m -18 Y s 944 269 m
 -36 Y s 1012 251 m -18 Y s 1079 251 m -18 Y s 1146 251 m -18 Y s 1213 269 m -36 Y s 1280 251 m -18 Y s 1348 251 m -18 Y s 1415 251 m -18 Y s 1482 269 m -36 Y s 1549 251 m -18 Y s 1617 251 m -18 Y s 1684 251 m -18 Y s 1751 269 m -36 Y s 1818 251 m
 -18 Y s 1885 251 m -18 Y s 1953 251 m -18 Y s 2020 269 m -36 Y s 407 269 m -36 Y s 339 251 m -18 Y s 2020 269 m -36 Y s 2087 251 m -18 Y s 2154 251 m -18 Y s
 gsave  2268 1455 0 0 C 367.029 170.406 t 0 r /Helvetica findfont 68.818 sf 0 0 m (20) show NC gr 
 gsave  2268 1455 0 0 C 635.747 170.406 t 0 r /Helvetica findfont 68.818 sf 0 0 m (40) show NC gr 
 gsave  2268 1455 0 0 C 904.465 170.406 t 0 r /Helvetica findfont 68.818 sf 0 0 m (60) show NC gr 
 gsave  2268 1455 0 0 C 1173.18 170.406 t 0 r /Helvetica findfont 68.818 sf 0 0 m (80) show NC gr 
 gsave  2268 1455 0 0 C 1422.24 170.406 t 0 r /Helvetica findfont 68.818 sf 0 0 m (100) show NC gr 
 gsave  2268 1455 0 0 C 1690.96 170.406 t 0 r /Helvetica findfont 68.818 sf 0 0 m (120) show NC gr 
 gsave  2268 1455 0 0 C 1959.67 170.406 t 0 r /Helvetica findfont 68.818 sf 0 0 m (140) show NC gr  272 757 m 1882 X s 407 720 m 37 Y s 474 738 m 19 Y s 541 738 m 19 Y s 608 738 m 19 Y s 675 720 m 37 Y s 743 738 m 19 Y s 810 738 m 19 Y s 877 738 m 19
 Y s 944 720 m 37 Y s 1012 738 m 19 Y s 1079 738 m 19 Y s 1146 738 m 19 Y s 1213 720 m 37 Y s 1280 738 m 19 Y s 1348 738 m 19 Y s 1415 738 m 19 Y s 1482 720 m 37 Y s 1549 738 m 19 Y s 1617 738 m 19 Y s 1684 738 m 19 Y s 1751 720 m 37 Y s 1818 738 m
 19 Y s 1885 738 m 19 Y s 1953 738 m 19 Y s 2020 720 m 37 Y s 407 720 m 37 Y s 339 738 m 19 Y s 2020 720 m 37 Y s 2087 738 m 19 Y s 2154 738 m 19 Y s 272 233 m 524 Y s
 gsave  2268 1455 0 0 C 78.6491 622.639 t 90 r /Helvetica findfont 68.818 sf 0 0 m (ratio) show NC gr  297 233 m -25 X s 284 246 m -12 X s 284 259 m -12 X s 284 272 m -12 X s 284 285 m -12 X s 297 298 m -25 X s 284 311 m -12 X s 284 324 m -12 X s 284
 338 m -12 X s 284 351 m -12 X s 297 364 m -25 X s 284 377 m -12 X s 284 390 m -12 X s 284 403 m -12 X s 284 416 m -12 X s 297 429 m -25 X s 284 442 m -12 X s 284 455 m -12 X s 284 469 m -12 X s 284 482 m -12 X s 297 495 m -25 X s 284 508 m -12 X s
 284 521 m -12 X s 284 534 m -12 X s 284 547 m -12 X s 297 560 m -25 X s 284 573 m -12 X s 284 586 m -12 X s 284 599 m -12 X s 284 613 m -12 X s 297 626 m -25 X s 284 639 m -12 X s 284 652 m -12 X s 284 665 m -12 X s 284 678 m -12 X s 297 691 m -25 X
 s 284 704 m -12 X s 284 717 m -12 X s 284 730 m -12 X s 284 744 m -12 X s 297 757 m -25 X s
 gsave  2268 1455 0 0 C 183.515 213.008 t 0 r /Helvetica findfont 55.7098 sf 0 0 m (0.8) show NC gr 
 gsave  2268 1455 0 0 C 150.744 278.549 t 0 r /Helvetica findfont 55.7098 sf 0 0 m (0.85) show NC gr 
 gsave  2268 1455 0 0 C 183.515 340.813 t 0 r /Helvetica findfont 55.7098 sf 0 0 m (0.9) show NC gr 
 gsave  2268 1455 0 0 C 150.744 406.354 t 0 r /Helvetica findfont 55.7098 sf 0 0 m (0.95) show NC gr 
 gsave  2268 1455 0 0 C 235.947 471.895 t 0 r /Helvetica findfont 55.7098 sf 0 0 m (1) show NC gr 
 gsave  2268 1455 0 0 C 150.744 537.436 t 0 r /Helvetica findfont 55.7098 sf 0 0 m (1.05) show NC gr 
 gsave  2268 1455 0 0 C 190.069 602.977 t 0 r /Helvetica findfont 55.7098 sf 0 0 m (1.1) show NC gr 
 gsave  2268 1455 0 0 C 150.744 668.518 t 0 r /Helvetica findfont 55.7098 sf 0 0 m (1.15) show NC gr 
 gsave  2268 1455 0 0 C 183.515 734.059 t 0 r /Helvetica findfont 55.7098 sf 0 0 m (1.2) show NC gr  2154 233 m 524 Y s 2130 233 m 24 X s 2142 246 m 12 X s 2142 259 m 12 X s 2142 272 m 12 X s 2142 285 m 12 X s 2130 298 m 24 X s 2142 311 m 12 X s 2142
 324 m 12 X s 2142 338 m 12 X s 2142 351 m 12 X s 2130 364 m 24 X s 2142 377 m 12 X s 2142 390 m 12 X s 2142 403 m 12 X s 2142 416 m 12 X s 2130 429 m 24 X s 2142 442 m 12 X s 2142 455 m 12 X s 2142 469 m 12 X s 2142 482 m 12 X s 2130 495 m 24 X s
 2142 508 m 12 X s 2142 521 m 12 X s 2142 534 m 12 X s 2142 547 m 12 X s 2130 560 m 24 X s 2142 573 m 12 X s 2142 586 m 12 X s 2142 599 m 12 X s 2142 613 m 12 X s 2130 626 m 24 X s 2142 639 m 12 X s 2142 652 m 12 X s 2142 665 m 12 X s 2142 678 m 12 X
 s 2130 691 m 24 X s 2142 704 m 12 X s 2142 717 m 12 X s 2142 730 m 12 X s 2142 744 m 12 X s 2130 757 m 24 X s 0.2 0.2 0.6 c 6 lw 1 1 1 c 0.2 0.2 0.6 c 272 510 m 54 X s 352 510 m 55 X s 3 lw 339 510 m25 6 lw 407 491 m 54 X s 487 491 m 54 X s 3 lw 474
 491 m25 6 lw 541 493 m 54 X s 621 493 m 54 X s 3 lw 608 493 m25 6 lw 675 515 m 55 X s 756 515 m 54 X s 3 lw 743 515 m25 6 lw 810 503 m 54 X s 890 503 m 54 X s 3 lw 877 503 m25 6 lw 944 491 m 54 X s 1025 491 m 54 X s 3 lw 1012 491 m25 6 lw 1079 494 m
 54 X s 1159 494 m 54 X s 3 lw 1146 494 m25 6 lw 1213 495 m 54 X s 1294 495 m 54 X s 3 lw 1280 495 m25 6 lw 1348 478 m 54 X s 1428 478 m 54 X s 3 lw 1415 478 m25 6 lw 1482 486 m 54 X s 1562 486 m 55 X s 3 lw 1549 486 m25 6 lw 1617 493 m 54 X s 1697
 493 m 54 X s 3 lw 1684 493 m25 6 lw 1751 488 m 54 X s 1831 488 m 54 X s 3 lw 1818 488 m25 6 lw 1885 489 m 55 X s 1966 489 m 54 X s 3 lw 1953 489 m25 6 lw 2020 501 m 54 X s 2100 501 m 54 X s 3 lw 2087 501 m25 6 lw black 3 lw 272 495 m 1882 X s 0 0.4
 0 c 6 lw 1 1 1 c 0 0.4 0 c 272 298 m 54 X s 352 298 m 55 X s 3 lw 339 298 m24 6 lw 407 489 m 54 X s 487 489 m 54 X s 3 lw 474 489 m24 6 lw 541 478 m 54 X s 621 478 m 54 X s 3 lw 608 478 m24 6 lw 675 462 m 55 X s 756 462 m 54 X s 3 lw 743 462 m24 6
 lw 810 455 m 54 X s 890 455 m 54 X s 3 lw 877 455 m24 6 lw 944 461 m 54 X s 1025 461 m 54 X s 3 lw 1012 461 m24 6 lw 1079 489 m 54 X s 1159 489 m 54 X s 3 lw 1146 489 m24 6 lw 1213 510 m 54 X s 1294 510 m 54 X s 3 lw 1280 510 m24 6 lw 1348 515 m 54
 X s 1428 515 m 54 X s 3 lw 1415 515 m24 6 lw 1482 534 m 54 X s 1562 534 m 55 X s 3 lw 1549 534 m24 6 lw 1617 549 m 54 X s 1697 549 m 54 X s 3 lw 1684 549 m24 6 lw 1751 568 m 54 X s 1831 568 m 54 X s 3 lw 1818 568 m24 6 lw 1885 577 m 55 X s 1966 577
 m 54 X s 3 lw 1953 577 m24 6 lw 2020 587 m 54 X s 2100 587 m 54 X s 3 lw 2087 587 m24 6 lw black 1 1 1 c black 272 895 m 135 X 80 Y 134 X 78 Y 134 X 90 Y 135 X 63 Y 134 X 8 Y 135 X -30 Y 134 X -43 Y 135 X -45 Y 134 X -48 Y 135 X -43 Y 134 X -39 Y
 134 X -33 Y 135 X -27 Y 134 X s 0 0.4 0 c 1 1 1 c 0 0.4 0 c 272 874 m 135 X 100 Y 134 X 75 Y 134 X 84 Y 135 X 59 Y 134 X 11 Y 135 X -20 Y 134 X -38 Y 135 X -44 Y 134 X -45 Y 135 X -41 Y 134 X -38 Y 134 X -32 Y 135 X -29 Y 134 X s black 1 1 1 c black
 272 895 m 135 X 80 Y 134 X 78 Y 134 X 90 Y 135 X 63 Y 134 X 8 Y 135 X -30 Y 134 X -43 Y 135 X -45 Y 134 X -48 Y 135 X -43 Y 134 X -39 Y 134 X -33 Y 135 X -27 Y 134 X s 0 0.4 0 c 1 1 1 c 0 0.4 0 c 272 874 m 135 X 100 Y 134 X 75 Y 134 X 84 Y 135 X 59
 Y 134 X 11 Y 135 X -20 Y 134 X -38 Y 135 X -44 Y 134 X -45 Y 135 X -41 Y 134 X -38 Y 134 X -32 Y 135 X -29 Y 134 X s 0.8 0 0 c 1 1 1 c 0.8 0 0 c 272 899 m 135 X 80 Y 134 X 77 Y 134 X 86 Y 135 X 61 Y 134 X 9 Y 135 X -30 Y 134 X -42 Y 135 X -47 Y 134
 X -46 Y 135 X -43 Y 134 X -38 Y 134 X -31 Y 135 X -29 Y 134 X s 0 0.4 0 c 1 1 1 c 0 0.4 0 c 272 874 m 135 X 100 Y 134 X 75 Y 134 X 84 Y 135 X 59 Y 134 X 11 Y 135 X -20 Y 134 X -38 Y 135 X -44 Y 134 X -45 Y 135 X -41 Y 134 X -38 Y 134 X -32 Y 135 X
 -29 Y 134 X s 0.2 0.2 0.6 c 1 1 1 c 0.2 0.2 0.6 c 272 896 m 135 X 79 Y 134 X 77 Y 134 X 97 Y 135 X 60 Y 134 X 4 Y 135 X -29 Y 134 X -43 Y 135 X -50 Y 134 X -45 Y 135 X -42 Y 134 X -39 Y 134 X -32 Y 135 X -26 Y 134 X s 0 0.4 0 c 1 1 1 c 0 0.4 0 c 272
 874 m 135 X 100 Y 134 X 75 Y 134 X 84 Y 135 X 59 Y 134 X 11 Y 135 X -20 Y 134 X -38 Y 135 X -44 Y 134 X -45 Y 135 X -41 Y 134 X -38 Y 134 X -32 Y 135 X -29 Y 134 X s
 gr  gr showpage
end
%%EOF
