%!PS-Adobe-1.0
%%Creator: Unified Graphics System
%%Pages: (atend)
%%DocumentFonts: Helvetica
%%BoundingBox:   50   83  469  413
%%EndComments
/Sw{setlinewidth}def
/Sg{setgray}def
/Sd{setdash}def
/P {newpath
    moveto
0 0 rlineto
    stroke}def
/M {moveto}def
/D {lineto}def
/N {newpath}def
/S {stroke}def
/T {/Helvetica findfont
    exch
    scalefont
    setfont}def
/R {rotate}def
/W {show}def
/F {fill}def
/X {gsave}def
/Y {grestore}def
%%EndProlog
%%Page: 1 1
0.12000 0.12000 scale
1 setlinecap
1 setlinejoin
4 Sw
0.00 0.00 0.00 setrgbcolor
[] 0 Sd
N
785 3414 M
785 992 D
S
N
785 992 M
3761 992 D
S
N
3761 992 M
3761 3414 D
S
N
3761 3414 M
785 3414 D
S
N
785 992 M
785 1096 D
S
N
904 1027 M
904 992 D
S
N
1023 992 M
1023 1027 D
S
N
1142 1027 M
1142 992 D
S
N
1261 992 M
1261 1027 D
S
N
1381 1096 M
1381 992 D
S
N
1500 992 M
1500 1027 D
S
N
1619 1027 M
1619 992 D
S
N
1738 992 M
1738 1027 D
S
N
1857 1027 M
1857 992 D
S
N
1976 992 M
1976 1096 D
S
N
2095 1027 M
2095 992 D
S
N
2214 992 M
2214 1027 D
S
N
2333 1027 M
2333 992 D
S
N
2452 992 M
2452 1027 D
S
N
2571 1096 M
2571 992 D
S
N
2690 992 M
2690 1027 D
S
N
2809 1027 M
2809 992 D
S
N
2928 992 M
2928 1027 D
S
N
3047 1027 M
3047 992 D
S
N
3166 992 M
3166 1096 D
S
N
3285 1027 M
3285 992 D
S
N
3404 992 M
3404 1027 D
S
N
3523 1027 M
3523 992 D
S
N
3642 992 M
3642 1027 D
S
N
739 923 M
742 920 D
739 918 D
736 920 D
736 923 D
739 929 D
742 932 D
751 935 D
762 935 D
771 932 D
774 929 D
777 923 D
777 918 D
774 912 D
765 906 D
751 900 D
745 897 D
739 892 D
736 883 D
736 874 D
S
N
762 935 M
768 932 D
771 929 D
774 923 D
774 918 D
771 912 D
762 906 D
751 900 D
S
N
736 880 M
739 883 D
745 883 D
759 877 D
768 877 D
774 880 D
777 883 D
S
N
745 883 M
759 874 D
771 874 D
774 877 D
777 883 D
777 889 D
S
N
811 935 M
803 932 D
797 923 D
794 909 D
794 900 D
797 886 D
803 877 D
811 874 D
817 874 D
826 877 D
832 886 D
834 900 D
834 909 D
832 923 D
826 932 D
817 935 D
811 935 D
S
N
811 935 M
806 932 D
803 929 D
800 923 D
797 909 D
797 900 D
800 886 D
803 880 D
806 877 D
811 874 D
S
N
817 874 M
823 877 D
826 880 D
829 886 D
832 900 D
832 909 D
829 923 D
826 929 D
823 932 D
817 935 D
S
N
1357 929 M
1357 874 D
S
N
1360 935 M
1360 874 D
S
N
1360 935 M
1329 892 D
1375 892 D
S
N
1349 874 M
1369 874 D
S
N
1406 935 M
1398 932 D
1392 923 D
1389 909 D
1389 900 D
1392 886 D
1398 877 D
1406 874 D
1412 874 D
1421 877 D
1427 886 D
1430 900 D
1430 909 D
1427 923 D
1421 932 D
1412 935 D
1406 935 D
S
N
1406 935 M
1401 932 D
1398 929 D
1395 923 D
1392 909 D
1392 900 D
1395 886 D
1398 880 D
1401 877 D
1406 874 D
S
N
1412 874 M
1418 877 D
1421 880 D
1424 886 D
1427 900 D
1427 909 D
1424 923 D
1421 929 D
1418 932 D
1412 935 D
S
N
1961 926 M
1958 923 D
1961 920 D
1964 923 D
1964 926 D
1961 932 D
1955 935 D
1947 935 D
1938 932 D
1932 926 D
1930 920 D
1927 909 D
1927 892 D
1930 883 D
1935 877 D
1944 874 D
1950 874 D
1958 877 D
1964 883 D
1967 892 D
1967 895 D
1964 903 D
1958 909 D
1950 912 D
1947 912 D
1938 909 D
1932 903 D
1930 895 D
S
N
1947 935 M
1941 932 D
1935 926 D
1932 920 D
1930 909 D
1930 892 D
1932 883 D
1938 877 D
1944 874 D
S
N
1950 874 M
1955 877 D
1961 883 D
1964 892 D
1964 895 D
1961 903 D
1955 909 D
1950 912 D
S
N
2002 935 M
1993 932 D
1987 923 D
1984 909 D
1984 900 D
1987 886 D
1993 877 D
2002 874 D
2007 874 D
2016 877 D
2022 886 D
2025 900 D
2025 909 D
2022 923 D
2016 932 D
2007 935 D
2002 935 D
S
N
2002 935 M
1996 932 D
1993 929 D
1990 923 D
1987 909 D
1987 900 D
1990 886 D
1993 880 D
1996 877 D
2002 874 D
S
N
2007 874 M
2013 877 D
2016 880 D
2019 886 D
2022 900 D
2022 909 D
2019 923 D
2016 929 D
2013 932 D
2007 935 D
S
N
2536 935 M
2528 932 D
2525 926 D
2525 918 D
2528 912 D
2536 909 D
2548 909 D
2556 912 D
2559 918 D
2559 926 D
2556 932 D
2548 935 D
2536 935 D
S
N
2536 935 M
2530 932 D
2528 926 D
2528 918 D
2530 912 D
2536 909 D
S
N
2548 909 M
2553 912 D
2556 918 D
2556 926 D
2553 932 D
2548 935 D
S
N
2536 909 M
2528 906 D
2525 903 D
2522 897 D
2522 886 D
2525 880 D
2528 877 D
2536 874 D
2548 874 D
2556 877 D
2559 880 D
2562 886 D
2562 897 D
2559 903 D
2556 906 D
2548 909 D
S
N
2536 909 M
2530 906 D
2528 903 D
2525 897 D
2525 886 D
2528 880 D
2530 877 D
2536 874 D
S
N
2548 874 M
2553 877 D
2556 880 D
2559 886 D
2559 897 D
2556 903 D
2553 906 D
2548 909 D
S
N
2597 935 M
2588 932 D
2582 923 D
2579 909 D
2579 900 D
2582 886 D
2588 877 D
2597 874 D
2602 874 D
2611 877 D
2617 886 D
2620 900 D
2620 909 D
2617 923 D
2611 932 D
2602 935 D
2597 935 D
S
N
2597 935 M
2591 932 D
2588 929 D
2585 923 D
2582 909 D
2582 900 D
2585 886 D
2588 880 D
2591 877 D
2597 874 D
S
N
2602 874 M
2608 877 D
2611 880 D
2614 886 D
2617 900 D
2617 909 D
2614 923 D
2611 929 D
2608 932 D
2602 935 D
S
N
3097 923 M
3102 926 D
3111 935 D
3111 874 D
S
N
3108 932 M
3108 874 D
S
N
3097 874 M
3123 874 D
S
N
3163 935 M
3154 932 D
3149 923 D
3146 909 D
3146 900 D
3149 886 D
3154 877 D
3163 874 D
3169 874 D
3177 877 D
3183 886 D
3186 900 D
3186 909 D
3183 923 D
3177 932 D
3169 935 D
3163 935 D
S
N
3163 935 M
3157 932 D
3154 929 D
3151 923 D
3149 909 D
3149 900 D
3151 886 D
3154 880 D
3157 877 D
3163 874 D
S
N
3169 874 M
3175 877 D
3177 880 D
3180 886 D
3183 900 D
3183 909 D
3180 923 D
3177 929 D
3175 932 D
3169 935 D
S
N
3221 935 M
3212 932 D
3206 923 D
3203 909 D
3203 900 D
3206 886 D
3212 877 D
3221 874 D
3226 874 D
3235 877 D
3241 886 D
3244 900 D
3244 909 D
3241 923 D
3235 932 D
3226 935 D
3221 935 D
S
N
3221 935 M
3215 932 D
3212 929 D
3209 923 D
3206 909 D
3206 900 D
3209 886 D
3212 880 D
3215 877 D
3221 874 D
S
N
3226 874 M
3232 877 D
3235 880 D
3238 886 D
3241 900 D
3241 909 D
3238 923 D
3235 929 D
3232 932 D
3226 935 D
S
N
3692 923 M
3698 926 D
3706 935 D
3706 874 D
S
N
3703 932 M
3703 874 D
S
N
3692 874 M
3718 874 D
S
N
3744 923 M
3747 920 D
3744 918 D
3741 920 D
3741 923 D
3744 929 D
3747 932 D
3755 935 D
3767 935 D
3775 932 D
3778 929 D
3781 923 D
3781 918 D
3778 912 D
3770 906 D
3755 900 D
3749 897 D
3744 892 D
3741 883 D
3741 874 D
S
N
3767 935 M
3773 932 D
3775 929 D
3778 923 D
3778 918 D
3775 912 D
3767 906 D
3755 900 D
S
N
3741 880 M
3744 883 D
3749 883 D
3764 877 D
3773 877 D
3778 880 D
3781 883 D
S
N
3749 883 M
3764 874 D
3775 874 D
3778 877 D
3781 883 D
3781 889 D
S
N
3816 935 M
3807 932 D
3801 923 D
3798 909 D
3798 900 D
3801 886 D
3807 877 D
3816 874 D
3822 874 D
3830 877 D
3836 886 D
3839 900 D
3839 909 D
3836 923 D
3830 932 D
3822 935 D
3816 935 D
S
N
3816 935 M
3810 932 D
3807 929 D
3804 923 D
3801 909 D
3801 900 D
3804 886 D
3807 880 D
3810 877 D
3816 874 D
S
N
3822 874 M
3827 877 D
3830 880 D
3833 886 D
3836 900 D
3836 909 D
3833 923 D
3830 929 D
3827 932 D
3822 935 D
S
N
785 3414 M
3761 3414 D
S
N
785 3310 M
785 3414 D
S
N
904 3414 M
904 3379 D
S
N
1023 3379 M
1023 3414 D
S
N
1142 3414 M
1142 3379 D
S
N
1261 3379 M
1261 3414 D
S
N
1381 3414 M
1381 3310 D
S
N
1500 3379 M
1500 3414 D
S
N
1619 3414 M
1619 3379 D
S
N
1738 3379 M
1738 3414 D
S
N
1857 3414 M
1857 3379 D
S
N
1976 3310 M
1976 3414 D
S
N
2095 3414 M
2095 3379 D
S
N
2214 3379 M
2214 3414 D
S
N
2333 3414 M
2333 3379 D
S
N
2452 3379 M
2452 3414 D
S
N
2571 3414 M
2571 3310 D
S
N
2690 3379 M
2690 3414 D
S
N
2809 3414 M
2809 3379 D
S
N
2928 3379 M
2928 3414 D
S
N
3047 3414 M
3047 3379 D
S
N
3166 3310 M
3166 3414 D
S
N
3285 3414 M
3285 3379 D
S
N
3404 3379 M
3404 3414 D
S
N
3523 3414 M
3523 3379 D
S
N
3642 3379 M
3642 3414 D
S
N
785 992 M
785 3414 D
S
N
820 1107 M
785 1107 D
S
N
785 1223 M
820 1223 D
S
N
820 1338 M
785 1338 D
S
N
785 1453 M
889 1453 D
S
N
820 1569 M
785 1569 D
S
N
785 1684 M
820 1684 D
S
N
820 1799 M
785 1799 D
S
N
785 1915 M
820 1915 D
S
N
889 2030 M
785 2030 D
S
N
785 2145 M
820 2145 D
S
N
820 2261 M
785 2261 D
S
N
785 2376 M
820 2376 D
S
N
820 2491 M
785 2491 D
S
N
785 2607 M
889 2607 D
S
N
820 2722 M
785 2722 D
S
N
785 2837 M
820 2837 D
S
N
820 2953 M
785 2953 D
S
N
785 3068 M
820 3068 D
S
N
889 3183 M
785 3183 D
S
N
785 3299 M
820 3299 D
S
N
820 3414 M
785 3414 D
S
N
633 1479 M
624 1476 D
618 1468 D
615 1453 D
615 1445 D
618 1430 D
624 1422 D
633 1419 D
638 1419 D
647 1422 D
653 1430 D
656 1445 D
656 1453 D
653 1468 D
647 1476 D
638 1479 D
633 1479 D
S
N
633 1479 M
627 1476 D
624 1474 D
621 1468 D
618 1453 D
618 1445 D
621 1430 D
624 1425 D
627 1422 D
633 1419 D
S
N
638 1419 M
644 1422 D
647 1425 D
650 1430 D
653 1445 D
653 1453 D
650 1468 D
647 1474 D
644 1476 D
638 1479 D
S
N
679 1425 M
676 1422 D
679 1419 D
682 1422 D
679 1425 D
S
N
719 1479 M
710 1476 D
705 1468 D
702 1453 D
702 1445 D
705 1430 D
710 1422 D
719 1419 D
725 1419 D
733 1422 D
739 1430 D
742 1445 D
742 1453 D
739 1468 D
733 1476 D
725 1479 D
719 1479 D
S
N
719 1479 M
713 1476 D
710 1474 D
708 1468 D
705 1453 D
705 1445 D
708 1430 D
710 1425 D
713 1422 D
719 1419 D
S
N
725 1419 M
731 1422 D
733 1425 D
736 1430 D
739 1445 D
739 1453 D
736 1468 D
733 1474 D
731 1476 D
725 1479 D
S
N
633 2056 M
624 2053 D
618 2044 D
615 2030 D
615 2021 D
618 2007 D
624 1998 D
633 1995 D
638 1995 D
647 1998 D
653 2007 D
656 2021 D
656 2030 D
653 2044 D
647 2053 D
638 2056 D
633 2056 D
S
N
633 2056 M
627 2053 D
624 2050 D
621 2044 D
618 2030 D
618 2021 D
621 2007 D
624 2001 D
627 1998 D
633 1995 D
S
N
638 1995 M
644 1998 D
647 2001 D
650 2007 D
653 2021 D
653 2030 D
650 2044 D
647 2050 D
644 2053 D
638 2056 D
S
N
679 2001 M
676 1998 D
679 1995 D
682 1998 D
679 2001 D
S
N
708 2056 M
702 2027 D
S
N
702 2027 M
708 2033 D
716 2036 D
725 2036 D
734 2033 D
739 2027 D
742 2018 D
742 2013 D
739 2004 D
734 1998 D
725 1995 D
716 1995 D
708 1998 D
705 2001 D
702 2007 D
702 2010 D
705 2013 D
708 2010 D
705 2007 D
S
N
725 2036 M
731 2033 D
736 2027 D
739 2018 D
739 2013 D
736 2004 D
731 1998 D
725 1995 D
S
N
708 2056 M
736 2056 D
S
N
708 2053 M
722 2053 D
736 2056 D
S
N
624 2621 M
630 2624 D
638 2633 D
638 2572 D
S
N
635 2630 M
635 2572 D
S
N
624 2572 M
650 2572 D
S
N
679 2578 M
676 2575 D
679 2572 D
682 2575 D
679 2578 D
S
N
719 2633 M
710 2630 D
705 2621 D
702 2607 D
702 2598 D
705 2584 D
710 2575 D
719 2572 D
725 2572 D
734 2575 D
739 2584 D
742 2598 D
742 2607 D
739 2621 D
734 2630 D
725 2633 D
719 2633 D
S
N
719 2633 M
713 2630 D
710 2627 D
708 2621 D
705 2607 D
705 2598 D
708 2584 D
710 2578 D
713 2575 D
719 2572 D
S
N
725 2572 M
731 2575 D
734 2578 D
736 2584 D
739 2598 D
739 2607 D
736 2621 D
734 2627 D
731 2630 D
725 2633 D
S
N
624 3198 M
630 3201 D
638 3209 D
638 3149 D
S
N
635 3206 M
635 3149 D
S
N
624 3149 M
650 3149 D
S
N
679 3154 M
676 3152 D
679 3149 D
682 3152 D
679 3154 D
S
N
708 3209 M
702 3180 D
S
N
702 3180 M
708 3186 D
716 3189 D
725 3189 D
734 3186 D
739 3180 D
742 3172 D
742 3166 D
739 3157 D
734 3152 D
725 3149 D
716 3149 D
708 3152 D
705 3154 D
702 3160 D
702 3163 D
705 3166 D
708 3163 D
705 3160 D
S
N
725 3189 M
731 3186 D
736 3180 D
739 3172 D
739 3166 D
736 3157 D
731 3152 D
725 3149 D
S
N
708 3209 M
736 3209 D
S
N
708 3206 M
722 3206 D
736 3209 D
S
N
3761 1107 M
3726 1107 D
S
N
3726 1223 M
3761 1223 D
S
N
3761 1338 M
3726 1338 D
S
N
3657 1453 M
3761 1453 D
S
N
3761 1569 M
3726 1569 D
S
N
3726 1684 M
3761 1684 D
S
N
3761 1799 M
3726 1799 D
S
N
3726 1915 M
3761 1915 D
S
N
3761 2030 M
3657 2030 D
S
N
3726 2145 M
3761 2145 D
S
N
3761 2261 M
3726 2261 D
S
N
3726 2376 M
3761 2376 D
S
N
3761 2491 M
3726 2491 D
S
N
3657 2607 M
3761 2607 D
S
N
3761 2722 M
3726 2722 D
S
N
3726 2837 M
3761 2837 D
S
N
3761 2953 M
3726 2953 D
S
N
3726 3068 M
3761 3068 D
S
N
3761 3183 M
3657 3183 D
S
N
3726 3299 M
3761 3299 D
S
N
3761 3414 M
3726 3414 D
S
N
2019 790 M
2019 730 D
S
N
2022 790 M
2022 730 D
S
N
2022 782 M
2028 787 D
2033 790 D
2039 790 D
2048 787 D
2054 782 D
2056 773 D
2056 767 D
2054 758 D
2048 753 D
2039 750 D
2033 750 D
2028 753 D
2022 758 D
S
N
2039 790 M
2045 787 D
2051 782 D
2054 773 D
2054 767 D
2051 758 D
2045 753 D
2039 750 D
S
N
2010 790 M
2022 790 D
S
N
2010 730 M
2031 730 D
S
N
2086 767 M
2086 727 D
S
N
2088 767 M
2088 727 D
S
N
2075 767 M
2073 756 D
2073 767 D
2102 767 D
2102 756 D
2100 767 D
S
N
2080 727 M
2094 727 D
S
N
2115 754 M
2115 727 D
S
N
2117 754 M
2117 727 D
S
N
2117 748 M
2121 752 D
2127 754 D
2130 754 D
2136 752 D
2138 748 D
2138 727 D
S
N
2130 754 M
2134 752 D
2136 748 D
2136 727 D
S
N
2138 748 M
2142 752 D
2148 754 D
2152 754 D
2157 752 D
2159 748 D
2159 727 D
S
N
2152 754 M
2155 752 D
2157 748 D
2157 727 D
S
N
2109 754 M
2117 754 D
S
N
2109 727 M
2123 727 D
S
N
2130 727 M
2144 727 D
S
N
2152 727 M
2165 727 D
S
N
2179 767 M
2177 765 D
2179 763 D
2180 765 D
2179 767 D
S
N
2179 754 M
2179 727 D
S
N
2180 754 M
2180 727 D
S
N
2173 754 M
2180 754 D
S
N
2173 727 M
2186 727 D
S
N
2200 754 M
2200 727 D
S
N
2202 754 M
2202 727 D
S
N
2202 748 M
2205 752 D
2211 754 D
2215 754 D
2221 752 D
2223 748 D
2223 727 D
S
N
2215 754 M
2219 752 D
2221 748 D
2221 727 D
S
N
2194 754 M
2202 754 D
S
N
2194 727 M
2207 727 D
S
N
2215 727 M
2229 727 D
S
N
2314 822 M
2308 816 D
2303 807 D
2297 796 D
2294 782 D
2294 770 D
2297 756 D
2303 744 D
2308 735 D
2314 730 D
S
N
2308 816 M
2303 805 D
2300 796 D
2297 782 D
2297 770 D
2300 756 D
2303 747 D
2308 735 D
S
N
2372 802 M
2375 793 D
2375 810 D
2372 802 D
2366 807 D
2357 810 D
2352 810 D
2343 807 D
2337 802 D
2334 796 D
2331 787 D
2331 773 D
2334 764 D
2337 758 D
2343 753 D
2352 750 D
2357 750 D
2366 753 D
2372 758 D
S
N
2352 810 M
2346 807 D
2340 802 D
2337 796 D
2334 787 D
2334 773 D
2337 764 D
2340 758 D
2346 753 D
2352 750 D
S
N
2372 773 M
2372 750 D
S
N
2375 773 M
2375 750 D
S
N
2363 773 M
2383 773 D
S
N
2401 773 M
2435 773 D
2435 779 D
2432 784 D
2429 787 D
2424 790 D
2415 790 D
2406 787 D
2401 782 D
2398 773 D
2398 767 D
2401 758 D
2406 753 D
2415 750 D
2421 750 D
2429 753 D
2435 758 D
S
N
2432 773 M
2432 782 D
2429 787 D
S
N
2415 790 M
2409 787 D
2403 782 D
2401 773 D
2401 767 D
2403 758 D
2409 753 D
2415 750 D
S
N
2452 810 M
2473 750 D
S
N
2455 810 M
2473 758 D
S
N
2493 810 M
2473 750 D
S
N
2447 810 M
2464 810 D
S
N
2481 810 M
2499 810 D
S
N
2510 822 M
2516 816 D
2522 807 D
2527 796 D
2530 782 D
2530 770 D
2527 756 D
2522 744 D
2516 735 D
2510 730 D
S
N
2516 816 M
2522 805 D
2525 796 D
2527 782 D
2527 770 D
2525 756 D
2522 747 D
2516 735 D
S
N
462 2154 M
522 2154 D
S
N
462 2157 M
522 2157 D
S
N
491 2154 M
485 2148 D
482 2142 D
482 2137 D
485 2128 D
491 2122 D
499 2119 D
505 2119 D
514 2122 D
520 2128 D
522 2137 D
522 2142 D
520 2148 D
514 2154 D
S
N
482 2137 M
485 2131 D
491 2125 D
499 2122 D
505 2122 D
514 2125 D
520 2131 D
522 2137 D
S
N
462 2145 M
462 2157 D
S
N
522 2154 M
522 2166 D
S
N
482 2226 M
482 2197 D
485 2189 D
494 2183 D
502 2180 D
511 2180 D
517 2183 D
520 2186 D
522 2191 D
522 2197 D
520 2206 D
511 2212 D
502 2215 D
494 2215 D
488 2212 D
485 2209 D
482 2203 D
S
N
482 2197 M
485 2191 D
494 2186 D
502 2183 D
514 2183 D
520 2186 D
S
N
522 2197 M
520 2203 D
511 2209 D
502 2212 D
491 2212 D
485 2209 D
S
N
485 2209 M
485 2226 D
S
N
450 2290 M
543 2238 D
S
N
462 2339 M
522 2339 D
S
N
462 2341 M
522 2341 D
S
N
491 2339 M
485 2333 D
482 2327 D
482 2321 D
485 2313 D
491 2307 D
499 2304 D
505 2304 D
514 2307 D
520 2313 D
522 2321 D
522 2327 D
520 2333 D
514 2339 D
S
N
482 2321 M
485 2315 D
491 2310 D
499 2307 D
505 2307 D
514 2310 D
520 2315 D
522 2321 D
S
N
462 2330 M
462 2341 D
S
N
522 2339 M
522 2350 D
S
N
482 2370 M
543 2370 D
S
N
482 2373 M
543 2373 D
S
N
491 2373 M
485 2379 D
482 2385 D
482 2390 D
485 2399 D
491 2405 D
499 2408 D
505 2408 D
514 2405 D
520 2399 D
522 2390 D
522 2385 D
520 2379 D
514 2373 D
S
N
482 2390 M
485 2396 D
491 2402 D
499 2405 D
505 2405 D
514 2402 D
520 2396 D
522 2390 D
S
N
482 2362 M
482 2373 D
S
N
543 2362 M
543 2382 D
S
N
505 2438 M
546 2438 D
S
N
505 2439 M
546 2439 D
S
N
505 2426 M
517 2424 D
505 2424 D
505 2453 D
517 2453 D
505 2451 D
S
N
546 2432 M
546 2445 D
S
N
450 2538 M
456 2533 D
465 2527 D
476 2521 D
491 2518 D
502 2518 D
517 2521 D
528 2527 D
537 2533 D
543 2538 D
S
N
456 2533 M
468 2527 D
476 2524 D
491 2521 D
502 2521 D
517 2524 D
525 2527 D
537 2533 D
S
N
465 2576 M
468 2573 D
471 2576 D
468 2579 D
465 2579 D
462 2576 D
462 2570 D
465 2564 D
471 2561 D
522 2561 D
S
N
462 2570 M
465 2567 D
471 2564 D
522 2564 D
S
N
482 2553 M
482 2576 D
S
N
522 2553 M
522 2573 D
S
N
462 2599 M
522 2599 D
S
N
462 2602 M
522 2602 D
S
N
491 2602 M
485 2608 D
482 2613 D
482 2619 D
485 2628 D
491 2634 D
499 2636 D
505 2636 D
514 2634 D
520 2628 D
522 2619 D
522 2613 D
520 2608 D
514 2602 D
S
N
482 2619 M
485 2625 D
491 2631 D
499 2634 D
505 2634 D
514 2631 D
520 2625 D
522 2619 D
S
N
462 2590 M
462 2602 D
S
N
450 2703 M
543 2651 D
S
N
471 2758 M
479 2760 D
462 2760 D
471 2758 D
465 2752 D
462 2743 D
462 2737 D
465 2729 D
471 2723 D
476 2720 D
485 2717 D
499 2717 D
508 2720 D
514 2723 D
520 2729 D
522 2737 D
522 2743 D
520 2752 D
514 2758 D
S
N
462 2737 M
465 2732 D
471 2726 D
476 2723 D
485 2720 D
499 2720 D
508 2723 D
514 2726 D
520 2732 D
522 2737 D
S
N
499 2758 M
522 2758 D
S
N
499 2760 M
522 2760 D
S
N
499 2749 M
499 2769 D
S
N
499 2786 M
499 2821 D
494 2821 D
488 2818 D
485 2815 D
482 2809 D
482 2801 D
485 2792 D
491 2786 D
499 2784 D
505 2784 D
514 2786 D
520 2792 D
522 2801 D
522 2807 D
520 2815 D
514 2821 D
S
N
499 2818 M
491 2818 D
485 2815 D
S
N
482 2801 M
485 2795 D
491 2789 D
499 2786 D
505 2786 D
514 2789 D
520 2795 D
522 2801 D
S
N
462 2838 M
522 2858 D
S
N
462 2841 M
514 2858 D
S
N
462 2879 M
522 2858 D
S
N
462 2833 M
462 2850 D
S
N
462 2867 M
462 2884 D
S
N
450 2896 M
456 2902 D
465 2907 D
476 2913 D
491 2916 D
502 2916 D
517 2913 D
528 2907 D
537 2902 D
543 2896 D
S
N
456 2902 M
468 2907 D
476 2910 D
491 2913 D
502 2913 D
517 2910 D
525 2907 D
537 2902 D
S
N
3824 2240 M
3885 2240 D
S
N
3824 2243 M
3885 2243 D
S
N
3824 2232 M
3824 2252 D
S
N
3885 2232 M
3885 2275 D
3868 2275 D
3885 2272 D
S
N
3824 2292 M
3885 2292 D
S
N
3824 2295 M
3885 2295 D
S
N
3824 2330 M
3885 2330 D
S
N
3824 2333 M
3885 2333 D
S
N
3824 2284 M
3824 2304 D
S
N
3824 2321 M
3824 2341 D
S
N
3853 2295 M
3853 2330 D
S
N
3885 2284 M
3885 2304 D
S
N
3885 2321 M
3885 2341 D
S
N
3833 2396 M
3842 2399 D
3824 2399 D
3833 2396 D
3827 2390 D
3824 2382 D
3824 2376 D
3827 2367 D
3833 2362 D
3839 2359 D
3847 2356 D
3862 2356 D
3870 2359 D
3876 2362 D
3882 2367 D
3885 2376 D
3885 2382 D
3882 2390 D
3876 2396 D
3870 2399 D
S
N
3824 2376 M
3827 2370 D
3833 2364 D
3839 2362 D
3847 2359 D
3862 2359 D
3870 2362 D
3876 2364 D
3882 2370 D
3885 2376 D
S
N
3824 2468 M
3885 2468 D
S
N
3824 2471 M
3885 2471 D
S
N
3824 2506 M
3885 2506 D
S
N
3824 2509 M
3885 2509 D
S
N
3824 2460 M
3824 2480 D
S
N
3824 2497 M
3824 2517 D
S
N
3853 2471 M
3853 2506 D
S
N
3885 2460 M
3885 2480 D
S
N
3885 2497 M
3885 2517 D
S
N
3824 2537 M
3885 2537 D
S
N
3824 2540 M
3885 2540 D
S
N
3824 2529 M
3824 2549 D
S
N
3885 2529 M
3885 2549 D
S
N
3833 2604 M
3842 2607 D
3824 2607 D
3833 2604 D
3827 2598 D
3824 2589 D
3824 2584 D
3827 2575 D
3833 2569 D
3839 2566 D
3847 2563 D
3862 2563 D
3870 2566 D
3876 2569 D
3882 2575 D
3885 2584 D
3885 2589 D
3882 2598 D
3876 2604 D
S
N
3824 2584 M
3827 2578 D
3833 2572 D
3839 2569 D
3847 2566 D
3862 2566 D
3870 2569 D
3876 2572 D
3882 2578 D
3885 2584 D
S
N
3862 2604 M
3885 2604 D
S
N
3862 2607 M
3885 2607 D
S
N
3862 2595 M
3862 2615 D
S
N
3833 2670 M
3842 2673 D
3824 2673 D
3833 2670 D
3827 2664 D
3824 2656 D
3824 2650 D
3827 2641 D
3833 2636 D
3839 2633 D
3847 2630 D
3862 2630 D
3870 2633 D
3876 2636 D
3882 2641 D
3885 2650 D
3885 2656 D
3882 2664 D
3876 2670 D
S
N
3824 2650 M
3827 2644 D
3833 2638 D
3839 2636 D
3847 2633 D
3862 2633 D
3870 2636 D
3876 2638 D
3882 2644 D
3885 2650 D
S
N
3862 2670 M
3885 2670 D
S
N
3862 2673 M
3885 2673 D
S
N
3862 2661 M
3862 2682 D
S
N
3833 2734 M
3824 2736 D
3842 2736 D
3833 2734 D
3827 2728 D
3824 2719 D
3824 2710 D
3827 2702 D
3833 2696 D
3839 2696 D
3845 2699 D
3847 2702 D
3850 2708 D
3856 2725 D
3859 2731 D
3865 2736 D
S
N
3839 2696 M
3845 2702 D
3847 2708 D
3853 2725 D
3856 2731 D
3859 2734 D
3865 2736 D
3876 2736 D
3882 2731 D
3885 2722 D
3885 2713 D
3882 2705 D
3876 2699 D
3868 2696 D
3885 2696 D
3876 2699 D
S
N
3824 2800 M
3885 2837 D
S
N
3824 2803 M
3885 2840 D
S
N
3824 2840 M
3885 2800 D
S
N
3824 2794 M
3824 2811 D
S
N
3824 2829 M
3824 2846 D
S
N
3885 2794 M
3885 2811 D
S
N
3885 2829 M
3885 2846 D
S
N
3833 2895 M
3824 2898 D
3842 2898 D
3833 2895 D
3827 2889 D
3824 2881 D
3824 2872 D
3827 2863 D
3833 2858 D
3839 2858 D
3845 2860 D
3847 2863 D
3850 2869 D
3856 2886 D
3859 2892 D
3865 2898 D
S
N
3839 2858 M
3845 2863 D
3847 2869 D
3853 2886 D
3856 2892 D
3859 2895 D
3865 2898 D
3876 2898 D
3882 2892 D
3885 2883 D
3885 2875 D
3882 2866 D
3876 2860 D
3868 2858 D
3885 2858 D
3876 2860 D
S
N
3824 2964 M
3885 2976 D
S
N
3824 2967 M
3870 2976 D
S
N
3824 2987 M
3885 2976 D
S
N
3824 2987 M
3885 2999 D
S
N
3824 2990 M
3870 2999 D
S
N
3824 3010 M
3885 2999 D
S
N
3824 2956 M
3824 2976 D
S
N
3824 3002 M
3824 3019 D
S
N
3833 3071 M
3842 3074 D
3824 3074 D
3833 3071 D
3827 3065 D
3824 3056 D
3824 3051 D
3827 3042 D
3833 3036 D
3839 3033 D
3847 3031 D
3862 3031 D
3870 3033 D
3876 3036 D
3882 3042 D
3885 3051 D
3885 3056 D
3882 3065 D
3876 3071 D
S
N
3824 3051 M
3827 3045 D
3833 3039 D
3839 3036 D
3847 3033 D
3862 3033 D
3870 3036 D
3876 3039 D
3882 3045 D
3885 3051 D
S
N
3862 3071 M
3885 3071 D
S
N
3862 3074 M
3885 3074 D
S
N
3862 3062 M
3862 3082 D
S
N
3836 3146 M
3839 3149 D
3842 3146 D
3839 3143 D
3836 3143 D
3830 3146 D
3827 3149 D
3824 3157 D
3824 3169 D
3827 3178 D
3830 3180 D
3836 3183 D
3842 3183 D
3847 3180 D
3853 3172 D
3859 3157 D
3862 3152 D
3868 3146 D
3876 3143 D
3885 3143 D
S
N
3824 3169 M
3827 3175 D
3830 3178 D
3836 3180 D
3842 3180 D
3847 3178 D
3853 3169 D
3859 3157 D
S
N
3879 3143 M
3876 3146 D
3876 3152 D
3882 3166 D
3882 3175 D
3879 3180 D
3876 3183 D
S
N
3876 3152 M
3885 3166 D
3885 3178 D
3882 3180 D
3876 3183 D
3870 3183 D
S
N
3824 3218 M
3827 3209 D
3836 3204 D
3850 3201 D
3859 3201 D
3873 3204 D
3882 3209 D
3885 3218 D
3885 3224 D
3882 3232 D
3873 3238 D
3859 3241 D
3850 3241 D
3836 3238 D
3827 3232 D
3824 3224 D
3824 3218 D
S
N
3824 3218 M
3827 3212 D
3830 3209 D
3836 3206 D
3850 3204 D
3859 3204 D
3873 3206 D
3879 3209 D
3882 3212 D
3885 3218 D
S
N
3885 3224 M
3882 3229 D
3879 3232 D
3873 3235 D
3859 3238 D
3850 3238 D
3836 3235 D
3830 3232 D
3827 3229 D
3824 3224 D
S
N
3836 3267 M
3833 3273 D
3824 3281 D
3885 3281 D
S
N
3827 3278 M
3885 3278 D
S
N
3885 3267 M
3885 3293 D
S
N
3836 3319 M
3839 3322 D
3842 3319 D
3839 3316 D
3836 3316 D
3830 3319 D
3827 3322 D
3824 3330 D
3824 3342 D
3827 3351 D
3833 3353 D
3842 3353 D
3847 3351 D
3850 3342 D
3850 3333 D
S
N
3824 3342 M
3827 3348 D
3833 3351 D
3842 3351 D
3847 3348 D
3850 3342 D
S
N
3850 3342 M
3853 3348 D
3859 3353 D
3865 3356 D
3873 3356 D
3879 3353 D
3882 3351 D
3885 3342 D
3885 3330 D
3882 3322 D
3879 3319 D
3873 3316 D
3870 3316 D
3868 3319 D
3870 3322 D
3873 3319 D
S
N
3856 3351 M
3865 3353 D
3873 3353 D
3879 3351 D
3882 3348 D
3885 3342 D
S
N
2551 2439 M
2551 2379 D
S
N
2553 2439 M
2553 2379 D
S
N
2553 2431 M
2559 2437 D
2565 2439 D
2571 2439 D
2579 2437 D
2585 2431 D
2588 2422 D
2588 2416 D
2585 2408 D
2579 2402 D
2571 2399 D
2565 2399 D
2559 2402 D
2553 2408 D
S
N
2571 2439 M
2577 2437 D
2582 2431 D
2585 2422 D
2585 2416 D
2582 2408 D
2577 2402 D
2571 2399 D
S
N
2542 2439 M
2553 2439 D
S
N
2542 2379 M
2562 2379 D
S
N
2611 2439 M
2611 2379 D
S
N
2614 2439 M
2614 2379 D
S
N
2614 2431 M
2620 2437 D
2626 2439 D
2631 2439 D
2640 2437 D
2646 2431 D
2649 2422 D
2649 2416 D
2646 2408 D
2640 2402 D
2631 2399 D
2626 2399 D
2620 2402 D
2614 2408 D
S
N
2631 2439 M
2637 2437 D
2643 2431 D
2646 2422 D
2646 2416 D
2643 2408 D
2637 2402 D
2631 2399 D
S
N
2602 2439 M
2614 2439 D
S
N
2602 2379 M
2623 2379 D
S
N
2712 2431 M
2721 2425 D
2712 2419 D
S
N
2703 2439 M
2718 2425 D
2703 2411 D
S
N
2669 2425 M
2718 2425 D
S
N
2747 2460 M
2747 2399 D
S
N
2750 2460 M
2750 2399 D
S
N
2784 2460 M
2784 2399 D
S
N
2787 2460 M
2787 2399 D
S
N
2738 2460 M
2758 2460 D
S
N
2775 2460 M
2796 2460 D
S
N
2750 2431 M
2784 2431 D
S
N
2738 2399 M
2758 2399 D
S
N
2775 2399 M
2796 2399 D
S
N
2839 2451 M
2839 2399 D
S
N
2813 2425 M
2865 2425 D
S
N
2885 2460 M
2923 2399 D
S
N
2888 2460 M
2925 2399 D
S
N
2925 2460 M
2885 2399 D
S
N
2879 2460 M
2897 2460 D
S
N
2914 2460 M
2931 2460 D
S
N
2879 2399 M
2897 2399 D
S
N
2914 2399 M
2931 2399 D
S
N
2989 2431 M
2997 2425 D
2989 2419 D
S
N
2980 2439 M
2995 2425 D
2980 2411 D
S
N
2946 2425 M
2995 2425 D
S
N
3012 2431 M
3018 2437 D
3023 2439 D
3029 2439 D
3035 2437 D
3038 2434 D
3041 2425 D
3041 2413 D
3038 2402 D
3029 2379 D
S
N
3015 2434 M
3021 2437 D
3032 2437 D
3038 2434 D
S
N
3061 2439 M
3058 2431 D
3055 2425 D
3041 2405 D
3032 2390 D
3026 2379 D
S
N
3058 2439 M
3055 2431 D
3052 2425 D
3041 2405 D
S
N
3070 2431 M
3075 2437 D
3081 2439 D
3087 2439 D
3093 2437 D
3096 2434 D
3098 2425 D
3098 2413 D
3096 2402 D
3087 2379 D
S
N
3072 2434 M
3078 2437 D
3090 2437 D
3096 2434 D
S
N
3119 2439 M
3116 2431 D
3113 2425 D
3098 2405 D
3090 2390 D
3084 2379 D
S
N
3116 2439 M
3113 2431 D
3110 2425 D
3098 2405 D
S
N
3162 2451 M
3162 2399 D
S
N
3136 2425 M
3188 2425 D
S
N
3208 2460 M
3245 2399 D
S
N
3211 2460 M
3248 2399 D
S
N
3248 2460 M
3208 2399 D
S
N
3202 2460 M
3220 2460 D
S
N
3237 2460 M
3254 2460 D
S
N
3202 2399 M
3220 2399 D
S
N
3237 2399 M
3254 2399 D
S
N
2545 2290 M
2556 2290 D
2574 2255 D
S
N
2553 2290 M
2574 2249 D
2600 2327 D
S
N
2637 2284 M
2640 2290 D
2640 2278 D
2637 2284 D
2634 2287 D
2628 2290 D
2617 2290 D
2611 2287 D
2608 2284 D
2608 2278 D
2611 2275 D
2617 2272 D
2631 2266 D
2637 2264 D
2640 2261 D
S
N
2608 2281 M
2611 2278 D
2617 2275 D
2631 2269 D
2637 2266 D
2640 2264 D
2640 2255 D
2637 2252 D
2631 2249 D
2620 2249 D
2614 2252 D
2611 2255 D
2608 2261 D
2608 2249 D
2611 2255 D
S
N
2660 2284 M
2712 2284 D
S
N
2660 2266 M
2712 2266 D
S
N
2747 2310 M
2738 2307 D
2735 2301 D
2735 2292 D
2738 2287 D
2747 2284 D
2758 2284 D
2767 2287 D
2770 2292 D
2770 2301 D
2767 2307 D
2758 2310 D
2747 2310 D
S
N
2747 2310 M
2741 2307 D
2738 2301 D
2738 2292 D
2741 2287 D
2747 2284 D
S
N
2758 2284 M
2764 2287 D
2767 2292 D
2767 2301 D
2764 2307 D
2758 2310 D
S
N
2747 2284 M
2738 2281 D
2735 2278 D
2732 2272 D
2732 2261 D
2735 2255 D
2738 2252 D
2747 2249 D
2758 2249 D
2767 2252 D
2770 2255 D
2773 2261 D
2773 2272 D
2770 2278 D
2767 2281 D
2758 2284 D
S
N
2747 2284 M
2741 2281 D
2738 2278 D
2735 2272 D
2735 2261 D
2738 2255 D
2741 2252 D
2747 2249 D
S
N
2758 2249 M
2764 2252 D
2767 2255 D
2770 2261 D
2770 2272 D
2767 2278 D
2764 2281 D
2758 2284 D
S
N
2853 2310 M
2853 2249 D
S
N
2856 2310 M
2856 2249 D
S
N
2836 2310 M
2833 2292 D
2833 2310 D
2876 2310 D
2876 2292 D
2874 2310 D
S
N
2845 2249 M
2865 2249 D
S
N
2894 2272 M
2928 2272 D
2928 2278 D
2925 2284 D
2923 2287 D
2917 2290 D
2908 2290 D
2899 2287 D
2894 2281 D
2891 2272 D
2891 2266 D
2894 2258 D
2899 2252 D
2908 2249 D
2914 2249 D
2923 2252 D
2928 2258 D
S
N
2925 2272 M
2925 2281 D
2923 2287 D
S
N
2908 2290 M
2902 2287 D
2897 2281 D
2894 2272 D
2894 2266 D
2897 2258 D
2902 2252 D
2908 2249 D
S
N
2946 2310 M
2966 2249 D
S
N
2948 2310 M
2966 2258 D
S
N
2986 2310 M
2966 2249 D
S
N
2940 2310 M
2957 2310 D
S
N
2974 2310 M
2992 2310 D
S
N
3009 2249 M
3006 2252 D
3009 2255 D
3012 2252 D
3012 2246 D
3009 2240 D
3006 2238 D
S
N
3084 2310 M
3084 2249 D
S
N
3087 2310 M
3104 2258 D
S
N
3084 2310 M
3104 2249 D
S
N
3124 2310 M
3104 2249 D
S
N
3124 2310 M
3124 2249 D
S
N
3127 2310 M
3127 2249 D
S
N
3075 2310 M
3087 2310 D
S
N
3124 2310 M
3136 2310 D
S
N
3075 2249 M
3093 2249 D
S
N
3116 2249 M
3136 2249 D
S
N
3188 2301 M
3191 2310 D
3191 2292 D
3188 2301 D
3182 2307 D
3173 2310 D
3165 2310 D
3156 2307 D
3150 2301 D
3150 2295 D
3153 2290 D
3156 2287 D
3162 2284 D
3179 2278 D
3185 2275 D
3191 2269 D
S
N
3150 2295 M
3156 2290 D
3162 2287 D
3179 2281 D
3185 2278 D
3188 2275 D
3191 2269 D
3191 2258 D
3185 2252 D
3176 2249 D
3168 2249 D
3159 2252 D
3153 2258 D
3150 2266 D
3150 2249 D
3153 2258 D
S
N
3225 2310 M
3225 2249 D
S
N
3228 2310 M
3228 2249 D
S
N
3208 2310 M
3205 2292 D
3205 2310 D
3248 2310 D
3248 2292 D
3245 2310 D
S
N
3217 2249 M
3237 2249 D
S
N
3266 2310 M
3277 2249 D
S
N
3269 2310 M
3277 2264 D
S
N
3289 2310 M
3277 2249 D
S
N
3289 2310 M
3300 2249 D
S
N
3292 2310 M
3300 2264 D
S
N
3312 2310 M
3300 2249 D
S
N
3257 2310 M
3277 2310 D
S
N
3303 2310 M
3320 2310 D
S
N
3335 2298 M
3338 2295 D
3335 2292 D
3332 2295 D
3332 2298 D
3335 2304 D
3338 2307 D
3346 2310 D
3358 2310 D
3367 2307 D
3369 2304 D
3372 2298 D
3372 2292 D
3369 2287 D
3361 2281 D
3346 2275 D
3341 2272 D
3335 2266 D
3332 2258 D
3332 2249 D
S
N
3358 2310 M
3364 2307 D
3367 2304 D
3369 2298 D
3369 2292 D
3367 2287 D
3358 2281 D
3346 2275 D
S
N
3332 2255 M
3335 2258 D
3341 2258 D
3355 2252 D
3364 2252 D
3369 2255 D
3372 2258 D
S
N
3341 2258 M
3355 2249 D
3367 2249 D
3369 2252 D
3372 2258 D
3372 2264 D
S
N
3407 2310 M
3398 2307 D
3393 2298 D
3390 2284 D
3390 2275 D
3393 2261 D
3398 2252 D
3407 2249 D
3413 2249 D
3421 2252 D
3427 2261 D
3430 2275 D
3430 2284 D
3427 2298 D
3421 2307 D
3413 2310 D
3407 2310 D
S
N
3407 2310 M
3401 2307 D
3398 2304 D
3395 2298 D
3393 2284 D
3393 2275 D
3395 2261 D
3398 2255 D
3401 2252 D
3407 2249 D
S
N
3413 2249 M
3418 2252 D
3421 2255 D
3424 2261 D
3427 2275 D
3427 2284 D
3424 2298 D
3421 2304 D
3418 2307 D
3413 2310 D
S
N
3465 2310 M
3456 2307 D
3450 2298 D
3447 2284 D
3447 2275 D
3450 2261 D
3456 2252 D
3465 2249 D
3470 2249 D
3479 2252 D
3485 2261 D
3488 2275 D
3488 2284 D
3485 2298 D
3479 2307 D
3470 2310 D
3465 2310 D
S
N
3465 2310 M
3459 2307 D
3456 2304 D
3453 2298 D
3450 2284 D
3450 2275 D
3453 2261 D
3456 2255 D
3459 2252 D
3465 2249 D
S
N
3470 2249 M
3476 2252 D
3479 2255 D
3482 2261 D
3485 2275 D
3485 2284 D
3482 2298 D
3479 2304 D
3476 2307 D
3470 2310 D
S
N
3519 2310 M
3511 2307 D
3508 2301 D
3508 2292 D
3511 2287 D
3519 2284 D
3531 2284 D
3540 2287 D
3542 2292 D
3542 2301 D
3540 2307 D
3531 2310 D
3519 2310 D
S
N
3519 2310 M
3514 2307 D
3511 2301 D
3511 2292 D
3514 2287 D
3519 2284 D
S
N
3531 2284 M
3537 2287 D
3540 2292 D
3540 2301 D
3537 2307 D
3531 2310 D
S
N
3519 2284 M
3511 2281 D
3508 2278 D
3505 2272 D
3505 2261 D
3508 2255 D
3511 2252 D
3519 2249 D
3531 2249 D
3540 2252 D
3542 2255 D
3545 2261 D
3545 2272 D
3542 2278 D
3540 2281 D
3531 2284 D
S
N
3519 2284 M
3514 2281 D
3511 2278 D
3508 2272 D
3508 2261 D
3511 2255 D
3514 2252 D
3519 2249 D
S
N
3531 2249 M
3537 2252 D
3540 2255 D
3542 2261 D
3542 2272 D
3540 2278 D
3537 2281 D
3531 2284 D
S
N
2556 2151 M
2539 2091 D
S
N
2559 2151 M
2542 2091 D
S
N
2556 2142 M
2553 2125 D
2553 2117 D
2559 2111 D
2565 2111 D
2571 2114 D
2577 2119 D
2582 2128 D
S
N
2588 2151 M
2579 2119 D
2579 2114 D
2582 2111 D
2591 2111 D
2597 2117 D
2600 2122 D
S
N
2591 2151 M
2582 2119 D
2582 2114 D
2585 2111 D
S
N
2616 2128 M
2616 2088 D
S
N
2618 2128 M
2618 2088 D
S
N
2629 2117 M
2629 2101 D
S
N
2610 2128 M
2641 2128 D
2641 2117 D
2639 2128 D
S
N
2618 2109 M
2629 2109 D
S
N
2610 2088 M
2624 2088 D
S
N
2660 2145 M
2712 2145 D
S
N
2660 2128 M
2712 2128 D
S
N
2744 2151 M
2726 2091 D
S
N
2747 2151 M
2729 2091 D
S
N
2744 2142 M
2741 2125 D
2741 2117 D
2747 2111 D
2752 2111 D
2758 2114 D
2764 2119 D
2770 2128 D
S
N
2775 2151 M
2767 2119 D
2767 2114 D
2770 2111 D
2778 2111 D
2784 2117 D
2787 2122 D
S
N
2778 2151 M
2770 2119 D
2770 2114 D
2773 2111 D
S
N
2803 2128 M
2803 2088 D
S
N
2805 2128 M
2805 2088 D
S
N
2798 2128 M
2821 2128 D
2826 2126 D
2828 2124 D
2830 2120 D
2830 2117 D
2828 2113 D
2826 2111 D
2821 2109 D
2805 2109 D
S
N
2821 2128 M
2824 2126 D
2826 2124 D
2828 2120 D
2828 2117 D
2826 2113 D
2824 2111 D
2821 2109 D
S
N
2798 2088 M
2811 2088 D
S
N
2815 2109 M
2819 2107 D
2821 2105 D
2826 2092 D
2828 2090 D
2830 2090 D
2832 2092 D
S
N
2819 2107 M
2821 2103 D
2824 2090 D
2826 2088 D
2830 2088 D
2832 2092 D
2832 2093 D
S
N
2851 2145 M
2903 2145 D
S
N
2851 2128 M
2903 2128 D
S
N
2926 2160 M
2929 2157 D
2926 2154 D
2923 2157 D
2923 2160 D
2926 2166 D
2929 2168 D
2938 2171 D
2949 2171 D
2958 2168 D
2961 2166 D
2964 2160 D
2964 2154 D
2961 2148 D
2952 2142 D
2938 2137 D
2932 2134 D
2926 2128 D
2923 2119 D
2923 2111 D
S
N
2949 2171 M
2955 2168 D
2958 2166 D
2961 2160 D
2961 2154 D
2958 2148 D
2949 2142 D
2938 2137 D
S
N
2923 2117 M
2926 2119 D
2932 2119 D
2947 2114 D
2955 2114 D
2961 2117 D
2964 2119 D
S
N
2932 2119 M
2947 2111 D
2958 2111 D
2961 2114 D
2964 2119 D
2964 2125 D
S
N
3001 2171 M
2993 2168 D
2987 2163 D
2984 2157 D
2981 2145 D
2981 2137 D
2984 2125 D
2987 2119 D
2993 2114 D
3001 2111 D
3007 2111 D
3016 2114 D
3022 2119 D
3024 2125 D
3027 2137 D
3027 2145 D
3024 2157 D
3022 2163 D
3016 2168 D
3007 2171 D
3001 2171 D
S
N
3001 2171 M
2996 2168 D
2990 2163 D
2987 2157 D
2984 2145 D
2984 2137 D
2987 2125 D
2990 2119 D
2996 2114 D
3001 2111 D
S
N
3007 2111 M
3013 2114 D
3019 2119 D
3022 2125 D
3024 2137 D
3024 2145 D
3022 2157 D
3019 2163 D
3013 2168 D
3007 2171 D
S
N
2993 2117 M
2993 2119 D
2996 2125 D
3001 2128 D
3004 2128 D
3010 2125 D
3013 2119 D
3016 2099 D
3019 2096 D
3024 2096 D
3027 2102 D
3027 2105 D
S
N
3013 2119 M
3016 2108 D
3019 2102 D
3022 2099 D
3024 2099 D
3027 2102 D
S
N
3047 2145 M
3099 2145 D
S
N
3047 2128 M
3099 2128 D
S
N
3125 2151 M
3125 2111 D
S
N
3128 2151 M
3128 2111 D
S
N
3128 2142 M
3134 2148 D
3143 2151 D
3148 2151 D
3157 2148 D
3160 2142 D
3160 2111 D
S
N
3148 2151 M
3154 2148 D
3157 2142 D
3157 2111 D
S
N
3160 2142 M
3166 2148 D
3174 2151 D
3180 2151 D
3189 2148 D
3192 2142 D
3192 2111 D
S
N
3180 2151 M
3186 2148 D
3189 2142 D
3189 2111 D
S
N
3117 2151 M
3128 2151 D
S
N
3117 2111 M
3137 2111 D
S
N
3148 2111 M
3169 2111 D
S
N
3180 2111 M
3200 2111 D
S
N
3220 2128 M
3220 2088 D
S
N
3221 2128 M
3221 2088 D
S
N
3244 2128 M
3244 2088 D
S
N
3246 2128 M
3246 2088 D
S
N
3214 2128 M
3227 2128 D
S
N
3239 2128 M
3252 2128 D
S
N
3221 2109 M
3245 2109 D
S
N
3214 2088 M
3227 2088 D
S
N
3239 2088 M
3252 2088 D
S
N
3271 2145 M
3323 2145 D
S
N
3271 2128 M
3323 2128 D
S
N
3352 2160 M
3358 2163 D
3367 2171 D
3367 2111 D
S
N
3364 2168 M
3364 2111 D
S
N
3352 2111 M
3378 2111 D
S
N
3404 2160 M
3407 2157 D
3404 2154 D
3401 2157 D
3401 2160 D
3404 2166 D
3407 2168 D
3416 2171 D
3427 2171 D
3436 2168 D
3439 2166 D
3442 2160 D
3442 2154 D
3439 2148 D
3430 2142 D
3416 2137 D
3410 2134 D
3404 2128 D
3401 2119 D
3401 2111 D
S
N
3427 2171 M
3433 2168 D
3436 2166 D
3439 2160 D
3439 2154 D
3436 2148 D
3427 2142 D
3416 2137 D
S
N
3401 2117 M
3404 2119 D
3410 2119 D
3424 2114 D
3433 2114 D
3439 2117 D
3442 2119 D
S
N
3410 2119 M
3424 2111 D
3436 2111 D
3439 2114 D
3442 2119 D
3442 2125 D
S
N
3465 2171 M
3459 2142 D
S
N
3459 2142 M
3465 2148 D
3473 2151 D
3482 2151 D
3491 2148 D
3496 2142 D
3499 2134 D
3499 2128 D
3496 2119 D
3491 2114 D
3482 2111 D
3473 2111 D
3465 2114 D
3462 2117 D
3459 2122 D
3459 2125 D
3462 2128 D
3465 2125 D
3462 2122 D
S
N
3482 2151 M
3488 2148 D
3493 2142 D
3496 2134 D
3496 2128 D
3493 2119 D
3488 2114 D
3482 2111 D
S
N
3465 2171 M
3493 2171 D
S
N
3465 2168 M
3479 2168 D
3493 2171 D
S
N
3603 2163 M
3606 2154 D
3606 2171 D
3603 2163 D
3597 2168 D
3589 2171 D
3583 2171 D
3574 2168 D
3568 2163 D
3566 2157 D
3563 2148 D
3563 2134 D
3566 2125 D
3568 2119 D
3574 2114 D
3583 2111 D
3589 2111 D
3597 2114 D
3603 2119 D
S
N
3583 2171 M
3577 2168 D
3571 2163 D
3568 2157 D
3566 2148 D
3566 2134 D
3568 2125 D
3571 2119 D
3577 2114 D
3583 2111 D
S
N
3603 2134 M
3603 2111 D
S
N
3606 2134 M
3606 2111 D
S
N
3594 2134 M
3615 2134 D
S
N
3632 2134 M
3666 2134 D
3666 2140 D
3664 2145 D
3661 2148 D
3655 2151 D
3646 2151 D
3638 2148 D
3632 2142 D
3629 2134 D
3629 2128 D
3632 2119 D
3638 2114 D
3646 2111 D
3652 2111 D
3661 2114 D
3666 2119 D
S
N
3664 2134 M
3664 2142 D
3661 2148 D
S
N
3646 2151 M
3640 2148 D
3635 2142 D
3632 2134 D
3632 2128 D
3635 2119 D
3640 2114 D
3646 2111 D
S
N
3684 2171 M
3704 2111 D
S
N
3687 2171 M
3704 2119 D
S
N
3724 2171 M
3704 2111 D
S
N
3678 2171 M
3695 2171 D
S
N
3713 2171 M
3730 2171 D
S
[4 30] 0 Sd
N
785 1453 M
1381 1453 D
1381 1644 D
1440 1644 D
1440 1668 D
1500 1668 D
1500 1695 D
1559 1695 D
1559 1727 D
1619 1727 D
1619 1765 D
1678 1765 D
1678 1809 D
1738 1809 D
1738 1867 D
1797 1867 D
1797 1944 D
1857 1944 D
1857 2057 D
1916 2057 D
1916 2256 D
1976 2256 D
1976 2824 D
2035 2824 D
2035 2610 D
2095 2610 D
2095 1453 D
3761 1453 D
S
N
2571 2607 M
2868 2607 D
S
[] 0 Sd
N
2997 2633 M
2997 2572 D
S
N
3000 2633 M
3000 2572 D
S
N
2988 2633 M
3008 2633 D
S
N
2988 2572 M
3032 2572 D
3032 2589 D
3029 2572 D
S
N
3063 2633 M
3055 2630 D
3049 2624 D
3046 2618 D
3043 2607 D
3043 2598 D
3046 2586 D
3049 2581 D
3055 2575 D
3063 2572 D
3069 2572 D
3078 2575 D
3083 2581 D
3086 2586 D
3089 2598 D
3089 2607 D
3086 2618 D
3083 2624 D
3078 2630 D
3069 2633 D
3063 2633 D
S
N
3063 2633 M
3057 2630 D
3052 2624 D
3049 2618 D
3046 2607 D
3046 2598 D
3049 2586 D
3052 2581 D
3057 2575 D
3063 2572 D
S
N
3069 2572 M
3075 2575 D
3081 2581 D
3083 2586 D
3086 2598 D
3086 2607 D
3083 2618 D
3081 2624 D
3075 2630 D
3069 2633 D
S
1.00 0.00 0.00 setrgbcolor
N
785 1453 M
904 1453 D
904 1501 D
964 1501 D
964 1563 D
1023 1563 D
1023 1586 D
1083 1586 D
1083 1617 D
1142 1617 D
1142 1657 D
1202 1657 D
1202 1716 D
1261 1716 D
1261 1818 D
1321 1818 D
1321 2120 D
1381 2120 D
1381 1972 D
1440 1972 D
1440 2026 D
1500 2026 D
1500 2090 D
1559 2090 D
1559 2161 D
1619 2161 D
1619 2250 D
1678 2250 D
1678 2350 D
1738 2350 D
1738 2478 D
1797 2478 D
1797 2645 D
1857 2645 D
1857 2867 D
1916 2867 D
1916 3214 D
1976 3214 D
1976 3414 D
S
N
2035 3414 M
2035 992 D
S
N
2095 992 M
2095 1502 D
2154 1502 D
2154 1486 D
2214 1486 D
2214 1478 D
2273 1478 D
2273 1473 D
2333 1473 D
2333 1470 D
2392 1470 D
2392 1467 D
2452 1467 D
2452 1465 D
2511 1465 D
2511 1464 D
2571 1464 D
2571 1463 D
2630 1463 D
2630 1462 D
2690 1462 D
2690 1461 D
2749 1461 D
2749 1460 D
2809 1460 D
2809 1459 D
2868 1459 D
2868 1459 D
2928 1459 D
2928 1458 D
2987 1458 D
2987 1458 D
3047 1458 D
3047 1457 D
3106 1457 D
3106 1457 D
3166 1457 D
3166 1457 D
3225 1457 D
3225 1456 D
3285 1456 D
3285 1456 D
3344 1456 D
3344 1456 D
3404 1456 D
3404 1456 D
3463 1456 D
3463 1456 D
3523 1456 D
3523 1455 D
3582 1455 D
3582 1455 D
3642 1455 D
3642 1455 D
3701 1455 D
3701 1455 D
3761 1455 D
3761 1455 D
3761 1455 D
S
3761 1453 P
N
2571 2837 M
2868 2837 D
S
N
2997 2863 M
2997 2803 D
S
N
3000 2863 M
3034 2809 D
S
N
3000 2858 M
3034 2803 D
S
N
3034 2863 M
3034 2803 D
S
N
2988 2863 M
3000 2863 D
S
N
3026 2863 M
3043 2863 D
S
N
2988 2803 M
3006 2803 D
S
N
3063 2863 M
3063 2803 D
S
N
3066 2863 M
3066 2803 D
S
N
3055 2863 M
3075 2863 D
S
N
3055 2803 M
3098 2803 D
3098 2820 D
3095 2803 D
S
N
3130 2863 M
3121 2860 D
3115 2855 D
3112 2849 D
3109 2837 D
3109 2829 D
3112 2817 D
3115 2811 D
3121 2806 D
3130 2803 D
3135 2803 D
3144 2806 D
3150 2811 D
3153 2817 D
3156 2829 D
3156 2837 D
3153 2849 D
3150 2855 D
3144 2860 D
3135 2863 D
3130 2863 D
S
N
3130 2863 M
3124 2860 D
3118 2855 D
3115 2849 D
3112 2837 D
3112 2829 D
3115 2817 D
3118 2811 D
3124 2806 D
3130 2803 D
S
N
3135 2803 M
3141 2806 D
3147 2811 D
3150 2817 D
3153 2829 D
3153 2837 D
3150 2849 D
3147 2855 D
3141 2860 D
3135 2863 D
S
0.00 0.00 1.00 setrgbcolor
N
969 1545 M
900 1545 D
S
N
934 1545 M
934 1543 D
S
N
969 1543 M
900 1543 D
S
N
1028 1661 M
959 1661 D
S
N
994 1661 M
994 1659 D
S
N
1028 1659 M
959 1659 D
S
N
1088 1707 M
1019 1707 D
S
N
1053 1707 M
1053 1704 D
S
N
1088 1704 M
1019 1704 D
S
N
1147 1757 M
1078 1757 D
S
N
1113 1757 M
1113 1754 D
S
N
1147 1754 M
1078 1754 D
S
N
1207 1824 M
1138 1824 D
S
N
1172 1824 M
1172 1821 D
S
N
1207 1821 M
1138 1821 D
S
N
1266 1914 M
1197 1914 D
S
N
1232 1914 M
1232 1910 D
S
N
1266 1910 M
1197 1910 D
S
N
1326 2032 M
1257 2032 D
S
N
1291 2032 M
1291 2027 D
S
N
1326 2027 M
1257 2027 D
S
N
1385 2014 M
1316 2014 D
S
N
1351 2014 M
1351 2007 D
S
N
1385 2007 M
1316 2007 D
S
N
1445 2158 M
1376 2158 D
S
N
1410 2158 M
1410 2147 D
S
N
1445 2147 M
1376 2147 D
S
N
1504 2233 M
1435 2233 D
S
N
1470 2233 M
1470 2223 D
S
N
1504 2223 M
1435 2223 D
S
N
1564 2306 M
1495 2306 D
S
N
1529 2306 M
1529 2297 D
S
N
1564 2297 M
1495 2297 D
S
N
1623 2407 M
1554 2407 D
S
N
1589 2407 M
1589 2397 D
S
N
1623 2397 M
1554 2397 D
S
N
1683 2499 M
1614 2499 D
S
N
1648 2499 M
1648 2488 D
S
N
1683 2488 M
1614 2488 D
S
N
1742 2606 M
1673 2606 D
S
N
1708 2606 M
1708 2595 D
S
N
1742 2595 M
1673 2595 D
S
N
1802 2729 M
1733 2729 D
S
N
1767 2729 M
1767 2715 D
S
N
1802 2715 M
1733 2715 D
S
N
1861 2869 M
1792 2869 D
S
N
1827 2869 M
1827 2854 D
S
N
1861 2854 M
1792 2854 D
S
N
1921 2975 M
1852 2975 D
S
N
1886 2975 M
1886 2960 D
S
N
1921 2960 M
1852 2960 D
S
N
1980 2976 M
1911 2976 D
S
N
1946 2976 M
1946 2960 D
S
N
1980 2960 M
1911 2960 D
S
N
2040 1645 M
1971 1645 D
S
N
2005 1645 M
2005 1623 D
S
N
2040 1623 M
1971 1623 D
S
N
2100 2366 M
2030 2366 D
S
N
2065 2366 M
2065 2348 D
S
N
2100 2348 M
2030 2348 D
S
N
2159 1547 M
2090 1547 D
S
N
2124 1547 M
2124 1546 D
S
N
2159 1546 M
2090 1546 D
S
N
2219 1516 M
2149 1516 D
S
N
2184 1516 M
2184 1515 D
S
N
2219 1515 M
2149 1515 D
S
N
2278 1500 M
2209 1500 D
S
N
2243 1500 M
2243 1499 D
S
N
2278 1499 M
2209 1499 D
S
N
2338 1491 M
2268 1491 D
S
N
2303 1491 M
2303 1490 D
S
N
2338 1490 M
2268 1490 D
S
N
2397 1484 M
2328 1484 D
S
N
2362 1484 M
2362 1483 D
S
N
2397 1483 M
2328 1483 D
S
N
2457 1479 M
2387 1479 D
S
N
2422 1479 M
2422 1478 D
S
N
2457 1478 M
2387 1478 D
S
N
2516 1475 M
2447 1475 D
S
N
2481 1475 M
2481 1474 D
S
N
2516 1474 M
2447 1474 D
S
N
2576 1472 M
2506 1472 D
S
N
2541 1472 M
2541 1471 D
S
N
2576 1471 M
2506 1471 D
S
N
2635 1470 M
2566 1470 D
S
N
2601 1470 M
2601 1469 D
S
N
2635 1469 M
2566 1469 D
S
N
2695 1467 M
2625 1467 D
S
N
2660 1467 M
2660 1467 D
S
N
2695 1467 M
2625 1467 D
S
N
2754 1466 M
2685 1466 D
S
N
2720 1466 M
2720 1466 D
S
N
2754 1466 M
2685 1466 D
S
N
2814 1464 M
2744 1464 D
S
N
2779 1464 M
2779 1464 D
S
N
2814 1464 M
2744 1464 D
S
N
2873 1463 M
2804 1463 D
S
N
2839 1463 M
2839 1463 D
S
N
2873 1463 M
2804 1463 D
S
N
2933 1462 M
2863 1462 D
S
N
2898 1462 M
2898 1462 D
S
N
2933 1462 M
2863 1462 D
S
N
2992 1461 M
2923 1461 D
S
N
2958 1461 M
2958 1461 D
S
N
2992 1461 M
2923 1461 D
S
N
3052 1461 M
2983 1461 D
S
N
3017 1461 M
3017 1460 D
S
N
3052 1460 M
2983 1460 D
S
N
3111 1460 M
3042 1460 D
S
N
3077 1460 M
3077 1460 D
S
N
3111 1460 M
3042 1460 D
S
N
3171 1459 M
3102 1459 D
S
N
3136 1459 M
3136 1459 D
S
N
3171 1459 M
3102 1459 D
S
N
3230 1459 M
3161 1459 D
S
N
3196 1459 M
3196 1458 D
S
N
3230 1458 M
3161 1458 D
S
N
3290 1458 M
3221 1458 D
S
N
3255 1458 M
3255 1458 D
S
N
3290 1458 M
3221 1458 D
S
N
3349 1458 M
3280 1458 D
S
N
3315 1458 M
3315 1458 D
S
N
3349 1458 M
3280 1458 D
S
N
3409 1457 M
3340 1457 D
S
N
3374 1457 M
3374 1457 D
S
N
3409 1457 M
3340 1457 D
S
N
3468 1457 M
3399 1457 D
S
N
3434 1457 M
3434 1457 D
S
N
3468 1457 M
3399 1457 D
S
N
3528 1457 M
3459 1457 D
S
N
3493 1457 M
3493 1457 D
S
N
3528 1457 M
3459 1457 D
S
N
3587 1456 M
3518 1456 D
S
N
3553 1456 M
3553 1456 D
S
N
3587 1456 M
3518 1456 D
S
N
3647 1456 M
3578 1456 D
S
N
3612 1456 M
3612 1456 D
S
N
3647 1456 M
3578 1456 D
S
N
3706 1456 M
3637 1456 D
S
N
3672 1456 M
3672 1456 D
S
N
3706 1456 M
3637 1456 D
S
N
3761 1456 M
3697 1456 D
S
N
3731 1456 M
3731 1456 D
S
N
3761 1456 M
3697 1456 D
S
N
3761 1456 M
3756 1456 D
S
N
3761 1456 M
3756 1456 D
S
N
2754 3103 M
2685 3103 D
S
N
2720 3103 M
2720 3033 D
S
N
2754 3033 M
2685 3033 D
S
N
2997 3094 M
2997 3033 D
S
N
3000 3094 M
3034 3039 D
S
N
3000 3088 M
3034 3033 D
S
N
3034 3094 M
3034 3033 D
S
N
2988 3094 M
3000 3094 D
S
N
3026 3094 M
3043 3094 D
S
N
2988 3033 M
3006 3033 D
S
N
3063 3094 M
3063 3033 D
S
N
3066 3094 M
3101 3039 D
S
N
3066 3088 M
3101 3033 D
S
N
3101 3094 M
3101 3033 D
S
N
3055 3094 M
3066 3094 D
S
N
3092 3094 M
3109 3094 D
S
N
3055 3033 M
3072 3033 D
S
N
3130 3094 M
3130 3033 D
S
N
3132 3094 M
3132 3033 D
S
N
3121 3094 M
3141 3094 D
S
N
3121 3033 M
3164 3033 D
3164 3051 D
3161 3033 D
S
N
3196 3094 M
3187 3091 D
3181 3085 D
3179 3080 D
3176 3068 D
3176 3059 D
3179 3048 D
3181 3042 D
3187 3036 D
3196 3033 D
3202 3033 D
3210 3036 D
3216 3042 D
3219 3048 D
3222 3059 D
3222 3068 D
3219 3080 D
3216 3085 D
3210 3091 D
3202 3094 D
3196 3094 D
S
N
3196 3094 M
3190 3091 D
3184 3085 D
3181 3080 D
3179 3068 D
3179 3059 D
3181 3048 D
3184 3042 D
3190 3036 D
3196 3033 D
S
N
3202 3033 M
3207 3036 D
3213 3042 D
3216 3048 D
3219 3059 D
3219 3068 D
3216 3080 D
3213 3085 D
3207 3091 D
3202 3094 D
S
0.00 0.00 0.00 setrgbcolor
N
785 3414 M
785 992 D
S
N
785 992 M
3761 992 D
S
N
3761 992 M
3761 3414 D
S
N
3761 3414 M
785 3414 D
S
N
785 992 M
785 1096 D
S
N
904 1027 M
904 992 D
S
N
1023 992 M
1023 1027 D
S
N
1142 1027 M
1142 992 D
S
N
1261 992 M
1261 1027 D
S
N
1381 1096 M
1381 992 D
S
N
1500 992 M
1500 1027 D
S
N
1619 1027 M
1619 992 D
S
N
1738 992 M
1738 1027 D
S
N
1857 1027 M
1857 992 D
S
N
1976 992 M
1976 1096 D
S
N
2095 1027 M
2095 992 D
S
N
2214 992 M
2214 1027 D
S
N
2333 1027 M
2333 992 D
S
N
2452 992 M
2452 1027 D
S
N
2571 1096 M
2571 992 D
S
N
2690 992 M
2690 1027 D
S
N
2809 1027 M
2809 992 D
S
N
2928 992 M
2928 1027 D
S
N
3047 1027 M
3047 992 D
S
N
3166 992 M
3166 1096 D
S
N
3285 1027 M
3285 992 D
S
N
3404 992 M
3404 1027 D
S
N
3523 1027 M
3523 992 D
S
N
3642 992 M
3642 1027 D
S
N
739 923 M
742 920 D
739 918 D
736 920 D
736 923 D
739 929 D
742 932 D
751 935 D
762 935 D
771 932 D
774 929 D
777 923 D
777 918 D
774 912 D
765 906 D
751 900 D
745 897 D
739 892 D
736 883 D
736 874 D
S
N
762 935 M
768 932 D
771 929 D
774 923 D
774 918 D
771 912 D
762 906 D
751 900 D
S
N
736 880 M
739 883 D
745 883 D
759 877 D
768 877 D
774 880 D
777 883 D
S
N
745 883 M
759 874 D
771 874 D
774 877 D
777 883 D
777 889 D
S
N
811 935 M
803 932 D
797 923 D
794 909 D
794 900 D
797 886 D
803 877 D
811 874 D
817 874 D
826 877 D
832 886 D
834 900 D
834 909 D
832 923 D
826 932 D
817 935 D
811 935 D
S
N
811 935 M
806 932 D
803 929 D
800 923 D
797 909 D
797 900 D
800 886 D
803 880 D
806 877 D
811 874 D
S
N
817 874 M
823 877 D
826 880 D
829 886 D
832 900 D
832 909 D
829 923 D
826 929 D
823 932 D
817 935 D
S
N
1357 929 M
1357 874 D
S
N
1360 935 M
1360 874 D
S
N
1360 935 M
1329 892 D
1375 892 D
S
N
1349 874 M
1369 874 D
S
N
1406 935 M
1398 932 D
1392 923 D
1389 909 D
1389 900 D
1392 886 D
1398 877 D
1406 874 D
1412 874 D
1421 877 D
1427 886 D
1430 900 D
1430 909 D
1427 923 D
1421 932 D
1412 935 D
1406 935 D
S
N
1406 935 M
1401 932 D
1398 929 D
1395 923 D
1392 909 D
1392 900 D
1395 886 D
1398 880 D
1401 877 D
1406 874 D
S
N
1412 874 M
1418 877 D
1421 880 D
1424 886 D
1427 900 D
1427 909 D
1424 923 D
1421 929 D
1418 932 D
1412 935 D
S
N
1961 926 M
1958 923 D
1961 920 D
1964 923 D
1964 926 D
1961 932 D
1955 935 D
1947 935 D
1938 932 D
1932 926 D
1930 920 D
1927 909 D
1927 892 D
1930 883 D
1935 877 D
1944 874 D
1950 874 D
1958 877 D
1964 883 D
1967 892 D
1967 895 D
1964 903 D
1958 909 D
1950 912 D
1947 912 D
1938 909 D
1932 903 D
1930 895 D
S
N
1947 935 M
1941 932 D
1935 926 D
1932 920 D
1930 909 D
1930 892 D
1932 883 D
1938 877 D
1944 874 D
S
N
1950 874 M
1955 877 D
1961 883 D
1964 892 D
1964 895 D
1961 903 D
1955 909 D
1950 912 D
S
N
2002 935 M
1993 932 D
1987 923 D
1984 909 D
1984 900 D
1987 886 D
1993 877 D
2002 874 D
2007 874 D
2016 877 D
2022 886 D
2025 900 D
2025 909 D
2022 923 D
2016 932 D
2007 935 D
2002 935 D
S
N
2002 935 M
1996 932 D
1993 929 D
1990 923 D
1987 909 D
1987 900 D
1990 886 D
1993 880 D
1996 877 D
2002 874 D
S
N
2007 874 M
2013 877 D
2016 880 D
2019 886 D
2022 900 D
2022 909 D
2019 923 D
2016 929 D
2013 932 D
2007 935 D
S
N
2536 935 M
2528 932 D
2525 926 D
2525 918 D
2528 912 D
2536 909 D
2548 909 D
2556 912 D
2559 918 D
2559 926 D
2556 932 D
2548 935 D
2536 935 D
S
N
2536 935 M
2530 932 D
2528 926 D
2528 918 D
2530 912 D
2536 909 D
S
N
2548 909 M
2553 912 D
2556 918 D
2556 926 D
2553 932 D
2548 935 D
S
N
2536 909 M
2528 906 D
2525 903 D
2522 897 D
2522 886 D
2525 880 D
2528 877 D
2536 874 D
2548 874 D
2556 877 D
2559 880 D
2562 886 D
2562 897 D
2559 903 D
2556 906 D
2548 909 D
S
N
2536 909 M
2530 906 D
2528 903 D
2525 897 D
2525 886 D
2528 880 D
2530 877 D
2536 874 D
S
N
2548 874 M
2553 877 D
2556 880 D
2559 886 D
2559 897 D
2556 903 D
2553 906 D
2548 909 D
S
N
2597 935 M
2588 932 D
2582 923 D
2579 909 D
2579 900 D
2582 886 D
2588 877 D
2597 874 D
2602 874 D
2611 877 D
2617 886 D
2620 900 D
2620 909 D
2617 923 D
2611 932 D
2602 935 D
2597 935 D
S
N
2597 935 M
2591 932 D
2588 929 D
2585 923 D
2582 909 D
2582 900 D
2585 886 D
2588 880 D
2591 877 D
2597 874 D
S
N
2602 874 M
2608 877 D
2611 880 D
2614 886 D
2617 900 D
2617 909 D
2614 923 D
2611 929 D
2608 932 D
2602 935 D
S
N
3097 923 M
3102 926 D
3111 935 D
3111 874 D
S
N
3108 932 M
3108 874 D
S
N
3097 874 M
3123 874 D
S
N
3163 935 M
3154 932 D
3149 923 D
3146 909 D
3146 900 D
3149 886 D
3154 877 D
3163 874 D
3169 874 D
3177 877 D
3183 886 D
3186 900 D
3186 909 D
3183 923 D
3177 932 D
3169 935 D
3163 935 D
S
N
3163 935 M
3157 932 D
3154 929 D
3151 923 D
3149 909 D
3149 900 D
3151 886 D
3154 880 D
3157 877 D
3163 874 D
S
N
3169 874 M
3175 877 D
3177 880 D
3180 886 D
3183 900 D
3183 909 D
3180 923 D
3177 929 D
3175 932 D
3169 935 D
S
N
3221 935 M
3212 932 D
3206 923 D
3203 909 D
3203 900 D
3206 886 D
3212 877 D
3221 874 D
3226 874 D
3235 877 D
3241 886 D
3244 900 D
3244 909 D
3241 923 D
3235 932 D
3226 935 D
3221 935 D
S
N
3221 935 M
3215 932 D
3212 929 D
3209 923 D
3206 909 D
3206 900 D
3209 886 D
3212 880 D
3215 877 D
3221 874 D
S
N
3226 874 M
3232 877 D
3235 880 D
3238 886 D
3241 900 D
3241 909 D
3238 923 D
3235 929 D
3232 932 D
3226 935 D
S
N
3692 923 M
3698 926 D
3706 935 D
3706 874 D
S
N
3703 932 M
3703 874 D
S
N
3692 874 M
3718 874 D
S
N
3744 923 M
3747 920 D
3744 918 D
3741 920 D
3741 923 D
3744 929 D
3747 932 D
3755 935 D
3767 935 D
3775 932 D
3778 929 D
3781 923 D
3781 918 D
3778 912 D
3770 906 D
3755 900 D
3749 897 D
3744 892 D
3741 883 D
3741 874 D
S
N
3767 935 M
3773 932 D
3775 929 D
3778 923 D
3778 918 D
3775 912 D
3767 906 D
3755 900 D
S
N
3741 880 M
3744 883 D
3749 883 D
3764 877 D
3773 877 D
3778 880 D
3781 883 D
S
N
3749 883 M
3764 874 D
3775 874 D
3778 877 D
3781 883 D
3781 889 D
S
N
3816 935 M
3807 932 D
3801 923 D
3798 909 D
3798 900 D
3801 886 D
3807 877 D
3816 874 D
3822 874 D
3830 877 D
3836 886 D
3839 900 D
3839 909 D
3836 923 D
3830 932 D
3822 935 D
3816 935 D
S
N
3816 935 M
3810 932 D
3807 929 D
3804 923 D
3801 909 D
3801 900 D
3804 886 D
3807 880 D
3810 877 D
3816 874 D
S
N
3822 874 M
3827 877 D
3830 880 D
3833 886 D
3836 900 D
3836 909 D
3833 923 D
3830 929 D
3827 932 D
3822 935 D
S
N
785 3414 M
3761 3414 D
S
N
785 3310 M
785 3414 D
S
N
904 3414 M
904 3379 D
S
N
1023 3379 M
1023 3414 D
S
N
1142 3414 M
1142 3379 D
S
N
1261 3379 M
1261 3414 D
S
N
1381 3414 M
1381 3310 D
S
N
1500 3379 M
1500 3414 D
S
N
1619 3414 M
1619 3379 D
S
N
1738 3379 M
1738 3414 D
S
N
1857 3414 M
1857 3379 D
S
N
1976 3310 M
1976 3414 D
S
N
2095 3414 M
2095 3379 D
S
N
2214 3379 M
2214 3414 D
S
N
2333 3414 M
2333 3379 D
S
N
2452 3379 M
2452 3414 D
S
N
2571 3414 M
2571 3310 D
S
N
2690 3379 M
2690 3414 D
S
N
2809 3414 M
2809 3379 D
S
N
2928 3379 M
2928 3414 D
S
N
3047 3414 M
3047 3379 D
S
N
3166 3310 M
3166 3414 D
S
N
3285 3414 M
3285 3379 D
S
N
3404 3379 M
3404 3414 D
S
N
3523 3414 M
3523 3379 D
S
N
3642 3379 M
3642 3414 D
S
N
785 992 M
785 3414 D
S
N
820 1107 M
785 1107 D
S
N
785 1223 M
820 1223 D
S
N
820 1338 M
785 1338 D
S
N
785 1453 M
889 1453 D
S
N
820 1569 M
785 1569 D
S
N
785 1684 M
820 1684 D
S
N
820 1799 M
785 1799 D
S
N
785 1915 M
820 1915 D
S
N
889 2030 M
785 2030 D
S
N
785 2145 M
820 2145 D
S
N
820 2261 M
785 2261 D
S
N
785 2376 M
820 2376 D
S
N
820 2491 M
785 2491 D
S
N
785 2607 M
889 2607 D
S
N
820 2722 M
785 2722 D
S
N
785 2837 M
820 2837 D
S
N
820 2953 M
785 2953 D
S
N
785 3068 M
820 3068 D
S
N
889 3183 M
785 3183 D
S
N
785 3299 M
820 3299 D
S
N
820 3414 M
785 3414 D
S
N
633 1479 M
624 1476 D
618 1468 D
615 1453 D
615 1445 D
618 1430 D
624 1422 D
633 1419 D
638 1419 D
647 1422 D
653 1430 D
656 1445 D
656 1453 D
653 1468 D
647 1476 D
638 1479 D
633 1479 D
S
N
633 1479 M
627 1476 D
624 1474 D
621 1468 D
618 1453 D
618 1445 D
621 1430 D
624 1425 D
627 1422 D
633 1419 D
S
N
638 1419 M
644 1422 D
647 1425 D
650 1430 D
653 1445 D
653 1453 D
650 1468 D
647 1474 D
644 1476 D
638 1479 D
S
N
679 1425 M
676 1422 D
679 1419 D
682 1422 D
679 1425 D
S
N
719 1479 M
710 1476 D
705 1468 D
702 1453 D
702 1445 D
705 1430 D
710 1422 D
719 1419 D
725 1419 D
733 1422 D
739 1430 D
742 1445 D
742 1453 D
739 1468 D
733 1476 D
725 1479 D
719 1479 D
S
N
719 1479 M
713 1476 D
710 1474 D
708 1468 D
705 1453 D
705 1445 D
708 1430 D
710 1425 D
713 1422 D
719 1419 D
S
N
725 1419 M
731 1422 D
733 1425 D
736 1430 D
739 1445 D
739 1453 D
736 1468 D
733 1474 D
731 1476 D
725 1479 D
S
N
633 2056 M
624 2053 D
618 2044 D
615 2030 D
615 2021 D
618 2007 D
624 1998 D
633 1995 D
638 1995 D
647 1998 D
653 2007 D
656 2021 D
656 2030 D
653 2044 D
647 2053 D
638 2056 D
633 2056 D
S
N
633 2056 M
627 2053 D
624 2050 D
621 2044 D
618 2030 D
618 2021 D
621 2007 D
624 2001 D
627 1998 D
633 1995 D
S
N
638 1995 M
644 1998 D
647 2001 D
650 2007 D
653 2021 D
653 2030 D
650 2044 D
647 2050 D
644 2053 D
638 2056 D
S
N
679 2001 M
676 1998 D
679 1995 D
682 1998 D
679 2001 D
S
N
708 2056 M
702 2027 D
S
N
702 2027 M
708 2033 D
716 2036 D
725 2036 D
734 2033 D
739 2027 D
742 2018 D
742 2013 D
739 2004 D
734 1998 D
725 1995 D
716 1995 D
708 1998 D
705 2001 D
702 2007 D
702 2010 D
705 2013 D
708 2010 D
705 2007 D
S
N
725 2036 M
731 2033 D
736 2027 D
739 2018 D
739 2013 D
736 2004 D
731 1998 D
725 1995 D
S
N
708 2056 M
736 2056 D
S
N
708 2053 M
722 2053 D
736 2056 D
S
N
624 2621 M
630 2624 D
638 2633 D
638 2572 D
S
N
635 2630 M
635 2572 D
S
N
624 2572 M
650 2572 D
S
N
679 2578 M
676 2575 D
679 2572 D
682 2575 D
679 2578 D
S
N
719 2633 M
710 2630 D
705 2621 D
702 2607 D
702 2598 D
705 2584 D
710 2575 D
719 2572 D
725 2572 D
734 2575 D
739 2584 D
742 2598 D
742 2607 D
739 2621 D
734 2630 D
725 2633 D
719 2633 D
S
N
719 2633 M
713 2630 D
710 2627 D
708 2621 D
705 2607 D
705 2598 D
708 2584 D
710 2578 D
713 2575 D
719 2572 D
S
N
725 2572 M
731 2575 D
734 2578 D
736 2584 D
739 2598 D
739 2607 D
736 2621 D
734 2627 D
731 2630 D
725 2633 D
S
N
624 3198 M
630 3201 D
638 3209 D
638 3149 D
S
N
635 3206 M
635 3149 D
S
N
624 3149 M
650 3149 D
S
N
679 3154 M
676 3152 D
679 3149 D
682 3152 D
679 3154 D
S
N
708 3209 M
702 3180 D
S
N
702 3180 M
708 3186 D
716 3189 D
725 3189 D
734 3186 D
739 3180 D
742 3172 D
742 3166 D
739 3157 D
734 3152 D
725 3149 D
716 3149 D
708 3152 D
705 3154 D
702 3160 D
702 3163 D
705 3166 D
708 3163 D
705 3160 D
S
N
725 3189 M
731 3186 D
736 3180 D
739 3172 D
739 3166 D
736 3157 D
731 3152 D
725 3149 D
S
N
708 3209 M
736 3209 D
S
N
708 3206 M
722 3206 D
736 3209 D
S
N
3761 1107 M
3726 1107 D
S
N
3726 1223 M
3761 1223 D
S
N
3761 1338 M
3726 1338 D
S
N
3657 1453 M
3761 1453 D
S
N
3761 1569 M
3726 1569 D
S
N
3726 1684 M
3761 1684 D
S
N
3761 1799 M
3726 1799 D
S
N
3726 1915 M
3761 1915 D
S
N
3761 2030 M
3657 2030 D
S
N
3726 2145 M
3761 2145 D
S
N
3761 2261 M
3726 2261 D
S
N
3726 2376 M
3761 2376 D
S
N
3761 2491 M
3726 2491 D
S
N
3657 2607 M
3761 2607 D
S
N
3761 2722 M
3726 2722 D
S
N
3726 2837 M
3761 2837 D
S
N
3761 2953 M
3726 2953 D
S
N
3726 3068 M
3761 3068 D
S
N
3761 3183 M
3657 3183 D
S
N
3726 3299 M
3761 3299 D
S
N
3761 3414 M
3726 3414 D
S
showpage
%%Trailer
%%Pages: 1
%%BoundingBox:
