%!PS-Adobe-3.0
%%Creator: xpdf/pdftops 3.00
%%LanguageLevel: 2
%%DocumentSuppliedResources: (atend)
%%DocumentMedia: plain 612 792 0 () ()
%%BoundingBox: 0 0 612 792
%%Pages: 1
%%EndComments
%%BeginDefaults
%%PageMedia: plain
%%EndDefaults
%%BeginProlog
%%BeginResource: procset xpdf 3.00 0
/xpdf 75 dict def xpdf begin
% PDF special state
/pdfDictSize 15 def
/pdfSetup {
  3 1 roll 2 array astore
  /setpagedevice where {
    pop 3 dict begin
      /PageSize exch def
      /ImagingBBox null def
      /Policies 1 dict dup begin /PageSize 3 def end def
      { /Duplex true def } if
    currentdict end setpagedevice
  } {
    pop pop
  } ifelse
} def
/pdfStartPage {
  pdfDictSize dict begin
  /pdfFillCS [] def
  /pdfFillXform {} def
  /pdfStrokeCS [] def
  /pdfStrokeXform {} def
  /pdfFill [0] def
  /pdfStroke [0] def
  /pdfFillOP false def
  /pdfStrokeOP false def
  /pdfLastFill false def
  /pdfLastStroke false def
  /pdfTextMat [1 0 0 1 0 0] def
  /pdfFontSize 0 def
  /pdfCharSpacing 0 def
  /pdfTextRender 0 def
  /pdfTextRise 0 def
  /pdfWordSpacing 0 def
  /pdfHorizScaling 1 def
  /pdfTextClipPath [] def
} def
/pdfEndPage { end } def
% PDF color state
/cs { /pdfFillXform exch def dup /pdfFillCS exch def
      setcolorspace } def
/CS { /pdfStrokeXform exch def dup /pdfStrokeCS exch def
      setcolorspace } def
/sc { pdfLastFill not { pdfFillCS setcolorspace } if
      dup /pdfFill exch def aload pop pdfFillXform setcolor
     /pdfLastFill true def /pdfLastStroke false def } def
/SC { pdfLastStroke not { pdfStrokeCS setcolorspace } if
      dup /pdfStroke exch def aload pop pdfStrokeXform setcolor
     /pdfLastStroke true def /pdfLastFill false def } def
/op { /pdfFillOP exch def
      pdfLastFill { pdfFillOP setoverprint } if } def
/OP { /pdfStrokeOP exch def
      pdfLastStroke { pdfStrokeOP setoverprint } if } def
/fCol {
  pdfLastFill not {
    pdfFillCS setcolorspace
    pdfFill aload pop pdfFillXform setcolor
    pdfFillOP setoverprint
    /pdfLastFill true def /pdfLastStroke false def
  } if
} def
/sCol {
  pdfLastStroke not {
    pdfStrokeCS setcolorspace
    pdfStroke aload pop pdfStrokeXform setcolor
    pdfStrokeOP setoverprint
    /pdfLastStroke true def /pdfLastFill false def
  } if
} def
% build a font
/pdfMakeFont {
  4 3 roll findfont
  4 2 roll matrix scale makefont
  dup length dict begin
    { 1 index /FID ne { def } { pop pop } ifelse } forall
    /Encoding exch def
    currentdict
  end
  definefont pop
} def
/pdfMakeFont16 {
  exch findfont
  dup length dict begin
    { 1 index /FID ne { def } { pop pop } ifelse } forall
    /WMode exch def
    currentdict
  end
  definefont pop
} def
% graphics state operators
/q { gsave pdfDictSize dict begin } def
/Q {
  end grestore
  /pdfLastFill where {
    pop
    pdfLastFill {
      pdfFillOP setoverprint
    } {
      pdfStrokeOP setoverprint
    } ifelse
  } if
} def
/cm { concat } def
/d { setdash } def
/i { setflat } def
/j { setlinejoin } def
/J { setlinecap } def
/M { setmiterlimit } def
/w { setlinewidth } def
% path segment operators
/m { moveto } def
/l { lineto } def
/c { curveto } def
/re { 4 2 roll moveto 1 index 0 rlineto 0 exch rlineto
      neg 0 rlineto closepath } def
/h { closepath } def
% path painting operators
/S { sCol stroke } def
/Sf { fCol stroke } def
/f { fCol fill } def
/f* { fCol eofill } def
% clipping operators
/W { clip newpath } def
/W* { eoclip newpath } def
% text state operators
/Tc { /pdfCharSpacing exch def } def
/Tf { dup /pdfFontSize exch def
      dup pdfHorizScaling mul exch matrix scale
      pdfTextMat matrix concatmatrix dup 4 0 put dup 5 0 put
      exch findfont exch makefont setfont } def
/Tr { /pdfTextRender exch def } def
/Ts { /pdfTextRise exch def } def
/Tw { /pdfWordSpacing exch def } def
/Tz { /pdfHorizScaling exch def } def
% text positioning operators
/Td { pdfTextMat transform moveto } def
/Tm { /pdfTextMat exch def } def
% text string operators
/cshow where {
  pop
  /cshow2 {
    dup {
      pop pop
      1 string dup 0 3 index put 3 index exec
    } exch cshow
    pop pop
  } def
}{
  /cshow2 {
    currentfont /FontType get 0 eq {
      0 2 2 index length 1 sub {
        2 copy get exch 1 add 2 index exch get
        2 copy exch 256 mul add
        2 string dup 0 6 5 roll put dup 1 5 4 roll put
        3 index exec
      } for
    } {
      dup {
        1 string dup 0 3 index put 3 index exec
      } forall
    } ifelse
    pop pop
  } def
} ifelse
/awcp {
  exch {
    false charpath
    5 index 5 index rmoveto
    6 index eq { 7 index 7 index rmoveto } if
  } exch cshow2
  6 {pop} repeat
} def
/Tj {
  fCol
  1 index stringwidth pdfTextMat idtransform pop
  sub 1 index length dup 0 ne { div } { pop pop 0 } ifelse
  pdfWordSpacing pdfHorizScaling mul 0 pdfTextMat dtransform 32
  4 3 roll pdfCharSpacing pdfHorizScaling mul add 0
  pdfTextMat dtransform
  6 5 roll Tj1
} def
/Tj16 {
  fCol
  2 index stringwidth pdfTextMat idtransform pop
  sub exch div
  pdfWordSpacing pdfHorizScaling mul 0 pdfTextMat dtransform 32
  4 3 roll pdfCharSpacing pdfHorizScaling mul add 0
  pdfTextMat dtransform
  6 5 roll Tj1
} def
/Tj16V {
  fCol
  2 index stringwidth pdfTextMat idtransform exch pop
  sub exch div
  0 pdfWordSpacing pdfTextMat dtransform 32
  4 3 roll pdfCharSpacing add 0 exch
  pdfTextMat dtransform
  6 5 roll Tj1
} def
/Tj1 {
  0 pdfTextRise pdfTextMat dtransform rmoveto
  currentpoint 8 2 roll
  pdfTextRender 1 and 0 eq {
    6 copy awidthshow
  } if
  pdfTextRender 3 and dup 1 eq exch 2 eq or {
    7 index 7 index moveto
    6 copy
    currentfont /FontType get 3 eq { fCol } { sCol } ifelse
    false awcp currentpoint stroke moveto
  } if
  pdfTextRender 4 and 0 ne {
    8 6 roll moveto
    false awcp
    /pdfTextClipPath [ pdfTextClipPath aload pop
      {/moveto cvx}
      {/lineto cvx}
      {/curveto cvx}
      {/closepath cvx}
    pathforall ] def
    currentpoint newpath moveto
  } {
    8 {pop} repeat
  } ifelse
  0 pdfTextRise neg pdfTextMat dtransform rmoveto
} def
/TJm { pdfFontSize 0.001 mul mul neg 0
       pdfTextMat dtransform rmoveto } def
/TJmV { pdfFontSize 0.001 mul mul neg 0 exch
        pdfTextMat dtransform rmoveto } def
/Tclip { pdfTextClipPath cvx exec clip newpath
         /pdfTextClipPath [] def } def
% Level 2 image operators
/pdfImBuf 100 string def
/pdfIm {
  image
  { currentfile pdfImBuf readline
    not { pop exit } if
    (%-EOD-) eq { exit } if } loop
} def
/pdfImM {
  fCol imagemask
  { currentfile pdfImBuf readline
    not { pop exit } if
    (%-EOD-) eq { exit } if } loop
} def
/pdfImClip {
  gsave
  0 2 4 index length 1 sub {
    dup 4 index exch 2 copy
    get 5 index div put
    1 add 3 index exch 2 copy
    get 3 index div put
  } for
  pop pop rectclip
} def
/pdfImClipEnd { grestore } def
% shading operators
/colordelta {
  false 0 1 3 index length 1 sub {
    dup 4 index exch get 3 index 3 2 roll get sub abs 0.004 gt {
      pop true
    } if
  } for
  exch pop exch pop
} def
/funcCol { func n array astore } def
/funcSH {
  dup 0 eq {
    true
  } {
    dup 6 eq {
      false
    } {
      4 index 4 index funcCol dup
      6 index 4 index funcCol dup
      3 1 roll colordelta 3 1 roll
      5 index 5 index funcCol dup
      3 1 roll colordelta 3 1 roll
      6 index 8 index funcCol dup
      3 1 roll colordelta 3 1 roll
      colordelta or or or
    } ifelse
  } ifelse
  {
    1 add
    4 index 3 index add 0.5 mul exch 4 index 3 index add 0.5 mul exch
    6 index 6 index 4 index 4 index 4 index funcSH
    2 index 6 index 6 index 4 index 4 index funcSH
    6 index 2 index 4 index 6 index 4 index funcSH
    5 3 roll 3 2 roll funcSH pop pop
  } {
    pop 3 index 2 index add 0.5 mul 3 index  2 index add 0.5 mul
    funcCol sc
    dup 4 index exch mat transform m
    3 index 3 index mat transform l
    1 index 3 index mat transform l
    mat transform l pop pop h f*
  } ifelse
} def
/axialCol {
  dup 0 lt {
    pop t0
  } {
    dup 1 gt {
      pop t1
    } {
      dt mul t0 add
    } ifelse
  } ifelse
  func n array astore
} def
/axialSH {
  dup 0 eq {
    true
  } {
    dup 8 eq {
      false
    } {
      2 index axialCol 2 index axialCol colordelta
    } ifelse
  } ifelse
  {
    1 add 3 1 roll 2 copy add 0.5 mul
    dup 4 3 roll exch 4 index axialSH
    exch 3 2 roll axialSH
  } {
    pop 2 copy add 0.5 mul axialCol sc
    exch dup dx mul x0 add exch dy mul y0 add
    3 2 roll dup dx mul x0 add exch dy mul y0 add
    dx abs dy abs ge {
      2 copy yMin sub dy mul dx div add yMin m
      yMax sub dy mul dx div add yMax l
      2 copy yMax sub dy mul dx div add yMax l
      yMin sub dy mul dx div add yMin l
      h f*
    } {
      exch 2 copy xMin sub dx mul dy div add xMin exch m
      xMax sub dx mul dy div add xMax exch l
      exch 2 copy xMax sub dx mul dy div add xMax exch l
      xMin sub dx mul dy div add xMin exch l
      h f*
    } ifelse
  } ifelse
} def
/radialCol {
  dup t0 lt {
    pop t0
  } {
    dup t1 gt {
      pop t1
    } if
  } ifelse
  func n array astore
} def
/radialSH {
  dup 0 eq {
    true
  } {
    dup 8 eq {
      false
    } {
      2 index dt mul t0 add radialCol
      2 index dt mul t0 add radialCol colordelta
    } ifelse
  } ifelse
  {
    1 add 3 1 roll 2 copy add 0.5 mul
    dup 4 3 roll exch 4 index radialSH
    exch 3 2 roll radialSH
  } {
    pop 2 copy add 0.5 mul dt mul t0 add axialCol sc
    exch dup dx mul x0 add exch dup dy mul y0 add exch dr mul r0 add
    0 360 arc h
    dup dx mul x0 add exch dup dy mul y0 add exch dr mul r0 add
    0 360 arc h f*
  } ifelse
} def
end
%%EndResource
%%EndProlog
%%BeginSetup
xpdf begin
612 792 false pdfSetup
%%EndSetup
%%Page: 1 1
%%BeginPageSetup
%%PageOrientation: Portrait
pdfStartPage
0 0 612 792 re W
%%EndPageSetup
[] 0 d
1 i
0 j
0 J
10 M
1 w
/DeviceGray {} cs
[0] sc
/DeviceGray {} CS
[0] SC
false op
false OP
q
q
Q
q
0 0 612 792 re
W
1.2 w
1 J
1 j
/DeviceRGB {} CS
[0 0 0] SC
[0 0 0] SC
69.6 435.6 m
80.64 435.6 l
69.6 436.08 m
80.64 436.08 l
74.88 435.6 m
73.68 434.64 l
73.2 433.44 l
73.2 432.48 l
73.68 431.04 l
74.88 429.84 l
76.32 429.36 l
77.52 429.36 l
78.96 429.84 l
79.92 431.04 l
80.64 432.48 l
80.64 433.44 l
79.92 434.64 l
78.96 435.6 l
73.2 432.48 m
73.68 431.52 l
74.88 430.32 l
76.32 429.84 l
77.52 429.84 l
78.96 430.32 l
79.92 431.52 l
80.64 432.48 l
69.6 434.16 m
69.6 436.08 l
80.64 435.6 m
80.64 437.76 l
73.2 448.56 m
73.2 443.52 l
73.68 441.84 l
75.36 440.88 l
76.8 440.4 l
78.48 440.4 l
79.44 440.88 l
79.92 441.36 l
80.64 442.32 l
80.64 443.52 l
79.92 444.96 l
78.48 445.92 l
76.8 446.64 l
75.36 446.64 l
74.4 445.92 l
73.68 445.44 l
73.2 444.48 l
73.2 443.52 m
73.68 442.32 l
75.36 441.36 l
76.8 440.88 l
78.96 440.88 l
79.92 441.36 l
80.64 443.52 m
79.92 444.48 l
78.48 445.44 l
76.8 445.92 l
74.88 445.92 l
73.68 445.44 l
73.68 448.56 l
77.52 451.44 m
84.72 456 l
77.52 451.68 m
84.72 456.24 l
77.52 456.24 m
84.72 451.44 l
77.52 450.72 m
77.52 452.88 l
77.52 454.8 m
77.52 456.96 l
84.72 450.72 m
84.72 452.88 l
84.72 454.8 m
84.72 456.96 l
67.68 468.48 m
84.24 459.12 l
69.6 477.12 m
80.64 477.12 l
69.6 477.6 m
80.64 477.6 l
74.88 477.12 m
73.68 476.16 l
73.2 475.2 l
73.2 474 l
73.68 472.56 l
74.88 471.6 l
76.32 470.88 l
77.52 470.88 l
78.96 471.6 l
79.92 472.56 l
80.64 474 l
80.64 475.2 l
79.92 476.16 l
78.96 477.12 l
73.2 474 m
73.68 473.04 l
74.88 472.08 l
76.32 471.6 l
77.52 471.6 l
78.96 472.08 l
79.92 473.04 l
80.64 474 l
69.6 475.68 m
69.6 477.6 l
80.64 477.12 m
80.64 479.28 l
73.2 482.88 m
80.64 482.88 l
73.2 483.36 m
80.64 483.36 l
74.88 483.36 m
73.68 484.56 l
73.2 486 l
73.2 486.96 l
73.68 488.64 l
74.88 489.12 l
80.64 489.12 l
73.2 486.96 m
73.68 488.16 l
74.88 488.64 l
80.64 488.64 l
74.88 489.12 m
73.68 490.08 l
73.2 491.76 l
73.2 492.72 l
73.68 494.4 l
74.88 494.88 l
80.64 494.88 l
S
73.2 492.72 m
73.68 493.92 l
74.88 494.4 l
80.64 494.4 l
73.2 481.44 m
73.2 483.36 l
80.64 481.44 m
80.64 485.04 l
80.64 486.96 m
80.64 490.8 l
80.64 492.72 m
80.64 496.32 l
78.24 502.32 m
84.72 502.32 l
77.52 502.56 m
84.72 502.56 l
77.52 502.56 m
82.56 498.96 l
82.56 504.48 l
84.72 501.36 m
84.72 503.76 l
77.52 506.88 m
84.72 506.88 l
77.52 507.12 m
84.72 507.12 l
77.52 505.68 m
77.52 507.12 l
84.72 505.68 m
84.72 508.32 l
345.36 546 m
343.92 545.52 l
343.44 544.32 l
343.44 542.88 l
343.92 541.92 l
345.36 541.2 l
347.52 541.2 l
348.96 541.92 l
349.68 542.88 l
349.68 544.32 l
348.96 545.52 l
347.52 546 l
345.36 546 l
344.4 545.52 l
343.92 544.32 l
343.92 542.88 l
344.4 541.92 l
345.36 541.2 l
347.52 541.2 m
348.48 541.92 l
348.96 542.88 l
348.96 544.32 l
348.48 545.52 l
347.52 546 l
345.36 541.2 m
343.92 540.72 l
343.44 540.24 l
342.96 539.28 l
342.96 537.12 l
343.44 536.16 l
343.92 535.68 l
345.36 535.2 l
347.52 535.2 l
348.96 535.68 l
349.68 536.16 l
350.16 537.12 l
350.16 539.28 l
349.68 540.24 l
348.96 540.72 l
347.52 541.2 l
345.36 541.2 m
344.4 540.72 l
343.92 540.24 l
343.44 539.28 l
343.44 537.12 l
343.92 536.16 l
344.4 535.68 l
345.36 535.2 l
347.52 535.2 m
348.48 535.68 l
348.96 536.16 l
349.68 537.12 l
349.68 539.28 l
348.96 540.24 l
348.48 540.72 l
347.52 541.2 l
364.56 546 m
364.56 535.2 l
365.28 546 m
365.28 535.2 l
361.44 546 m
360.96 542.88 l
360.96 546 l
368.88 546 l
368.88 542.88 l
368.4 546 l
363.12 535.2 m
366.72 535.2 l
372 539.28 m
378.24 539.28 l
378.24 540.24 l
377.76 541.2 l
377.04 541.92 l
376.08 542.4 l
374.64 542.4 l
372.96 541.92 l
372 540.72 l
371.52 539.28 l
371.52 538.32 l
372 536.64 l
372.96 535.68 l
374.64 535.2 l
375.6 535.2 l
377.04 535.68 l
378.24 536.64 l
377.76 539.28 m
377.76 540.72 l
377.04 541.92 l
374.64 542.4 m
373.44 541.92 l
372.48 540.72 l
372 539.28 l
372 538.32 l
372.48 536.64 l
373.44 535.68 l
374.64 535.2 l
381.36 546 m
384.96 535.2 l
381.84 546 m
384.96 536.64 l
S
388.56 546 m
384.96 535.2 l
380.16 546 m
383.28 546 l
386.4 546 m
389.52 546 l
344.64 521.28 m
344.64 515.76 l
345.12 521.28 m
345.12 515.76 l
345.12 520.08 m
345.84 521.04 l
347.04 521.28 l
348 521.28 l
349.2 521.04 l
349.44 520.08 l
349.44 515.76 l
348 521.28 m
348.72 521.04 l
349.2 520.08 l
349.2 515.76 l
349.44 520.08 m
350.4 521.04 l
351.6 521.28 l
352.32 521.28 l
353.52 521.04 l
354 520.08 l
354 515.76 l
352.32 521.28 m
353.04 521.04 l
353.52 520.08 l
353.52 515.76 l
343.44 521.28 m
345.12 521.28 l
343.44 515.76 m
346.32 515.76 l
348 515.76 m
350.64 515.76 l
352.32 515.76 m
355.2 515.76 l
357.84 518.16 m
357.84 512.64 l
358.08 518.16 m
358.08 512.64 l
361.2 518.16 m
361.2 512.64 l
361.44 518.16 m
361.44 512.64 l
356.88 518.16 m
358.8 518.16 l
360.48 518.16 m
362.16 518.16 l
358.08 515.52 m
361.2 515.52 l
356.88 512.64 m
358.8 512.64 l
360.48 512.64 m
362.16 512.64 l
371.28 520.56 m
378.48 520.56 l
371.28 518.16 m
378.48 518.16 l
389.52 524.16 m
388.32 523.68 l
388.08 522.96 l
388.08 521.76 l
388.32 521.04 l
389.52 520.56 l
391.2 520.56 l
392.4 521.04 l
392.88 521.76 l
392.88 522.96 l
392.4 523.68 l
391.2 524.16 l
389.52 524.16 l
388.8 523.68 l
388.32 522.96 l
388.32 521.76 l
388.8 521.04 l
389.52 520.56 l
391.2 520.56 m
391.92 521.04 l
392.4 521.76 l
392.4 522.96 l
391.92 523.68 l
391.2 524.16 l
389.52 520.56 m
388.32 520.08 l
388.08 519.84 l
387.6 518.88 l
387.6 517.44 l
388.08 516.48 l
388.32 516.24 l
389.52 515.76 l
391.2 515.76 l
392.4 516.24 l
392.88 516.48 l
393.12 517.44 l
393.12 518.88 l
392.88 519.84 l
392.4 520.08 l
391.2 520.56 l
389.52 520.56 m
388.8 520.08 l
388.32 519.84 l
388.08 518.88 l
388.08 517.44 l
388.32 516.48 l
388.8 516.24 l
389.52 515.76 l
391.2 515.76 m
391.92 516.24 l
392.4 516.48 l
392.88 517.44 l
392.88 518.88 l
392.4 519.84 l
391.92 520.08 l
391.2 520.56 l
397.92 524.16 m
396.72 523.68 l
396 522.48 l
395.52 520.56 l
395.52 519.36 l
396 517.44 l
396.72 516.24 l
397.92 515.76 l
398.88 515.76 l
399.84 516.24 l
400.8 517.44 l
401.04 519.36 l
401.04 520.56 l
400.8 522.48 l
399.84 523.68 l
398.88 524.16 l
397.92 524.16 l
S
397.92 524.16 m
397.2 523.68 l
396.72 523.44 l
396 520.56 l
396 519.36 l
396.72 516.48 l
397.2 516.24 l
397.92 515.76 l
398.88 515.76 m
399.6 516.24 l
399.84 516.48 l
400.32 517.44 l
400.8 519.36 l
400.8 520.56 l
400.32 522.48 l
399.84 523.44 l
399.6 523.68 l
398.88 524.16 l
405.84 524.16 m
404.64 523.68 l
403.92 522.48 l
403.44 520.56 l
403.44 519.36 l
403.92 517.44 l
404.64 516.24 l
405.84 515.76 l
406.8 515.76 l
408 516.24 l
408.72 517.44 l
409.2 519.36 l
409.2 520.56 l
408.72 522.48 l
408 523.68 l
406.8 524.16 l
405.84 524.16 l
405.12 523.68 l
404.64 523.44 l
403.92 520.56 l
403.92 519.36 l
404.64 516.48 l
405.12 516.24 l
405.84 515.76 l
406.8 515.76 m
407.52 516.24 l
408 516.48 l
408.72 519.36 l
408.72 520.56 l
408 523.44 l
407.52 523.68 l
406.8 524.16 l
423.36 522.96 m
423.84 521.76 l
423.84 524.16 l
423.36 522.96 l
422.64 523.68 l
421.44 524.16 l
420.72 524.16 l
419.52 523.68 l
418.56 522.96 l
418.32 522.24 l
417.84 521.04 l
417.84 518.88 l
418.32 517.68 l
418.56 516.96 l
419.52 516.24 l
420.72 515.76 l
421.44 515.76 l
422.64 516.24 l
423.36 516.96 l
420.72 524.16 m
419.76 523.68 l
419.04 522.96 l
418.56 522.24 l
418.32 521.04 l
418.32 518.88 l
418.56 517.68 l
419.04 516.96 l
419.76 516.24 l
420.72 515.76 l
423.36 518.88 m
423.36 515.76 l
423.84 518.88 m
423.84 515.76 l
422.16 518.88 m
425.04 518.88 l
427.44 518.88 m
432.24 518.88 l
432.24 519.84 l
431.76 520.56 l
431.52 521.04 l
430.56 521.28 l
429.36 521.28 l
428.16 521.04 l
427.44 520.08 l
426.96 518.88 l
426.96 518.16 l
427.44 516.96 l
428.16 516.24 l
429.36 515.76 l
430.32 515.76 l
431.52 516.24 l
432.24 516.96 l
431.76 518.88 m
431.76 520.08 l
431.52 521.04 l
429.36 521.28 m
428.64 521.04 l
427.92 520.08 l
427.44 518.88 l
427.44 518.16 l
427.92 516.96 l
428.64 516.24 l
429.36 515.76 l
434.64 524.16 m
437.28 515.76 l
435.12 524.16 m
437.28 516.96 l
440.16 524.16 m
437.28 515.76 l
433.92 524.16 m
436.08 524.16 l
438.48 524.16 m
440.88 524.16 l
S
[1 0 0] SC
205.92 459.36 m
200.64 459.36 l
199.2 458.88 l
198 457.2 l
197.52 455.76 l
197.52 454.08 l
198 453.12 l
198.48 452.64 l
199.68 452.16 l
200.64 452.16 l
202.08 452.64 l
203.28 454.08 l
203.76 455.76 l
203.76 457.2 l
203.28 458.16 l
202.8 458.88 l
201.6 459.36 l
200.64 459.36 m
199.68 458.88 l
198.48 457.2 l
198 455.76 l
198 453.6 l
198.48 452.64 l
200.64 452.16 m
201.6 452.64 l
202.8 454.08 l
203.28 455.76 l
203.28 457.68 l
202.8 458.88 l
205.92 458.88 l
209.28 455.28 m
209.28 447.84 l
209.76 455.28 m
209.76 447.84 l
213.84 455.28 m
213.84 447.84 l
214.08 455.28 m
214.08 447.84 l
208.32 455.28 m
210.72 455.28 l
212.88 455.28 m
215.28 455.28 l
209.76 451.68 m
213.84 451.68 l
208.32 447.84 m
210.72 447.84 l
212.88 447.84 m
215.28 447.84 l
217.68 447.84 m
217.2 448.32 l
217.68 448.56 l
217.92 448.32 l
217.92 447.6 l
217.68 446.88 l
217.2 446.4 l
221.04 455.28 m
220.8 454.8 l
221.04 454.56 l
221.52 454.8 l
221.04 455.28 l
221.04 452.64 m
221.04 447.84 l
221.52 452.64 m
221.52 447.84 l
220.08 452.64 m
221.52 452.64 l
220.08 447.84 m
222.48 447.84 l
230.64 461.28 m
230.64 452.16 l
225.84 456.72 m
235.2 456.72 l
247.2 459.36 m
242.16 459.36 l
240.48 458.88 l
239.52 457.2 l
239.04 455.76 l
239.04 454.08 l
239.52 453.12 l
240 452.64 l
240.96 452.16 l
242.16 452.16 l
243.6 452.64 l
244.56 454.08 l
245.28 455.76 l
245.28 457.2 l
244.56 458.16 l
244.08 458.88 l
243.12 459.36 l
242.16 459.36 m
240.96 458.88 l
240 457.2 l
239.52 455.76 l
239.52 453.6 l
240 452.64 l
242.16 452.16 m
243.12 452.64 l
244.08 454.08 l
244.56 455.76 l
244.56 457.68 l
244.08 458.88 l
247.2 458.88 l
250.8 455.28 m
250.8 447.84 l
251.04 455.28 m
251.04 447.84 l
249.6 455.28 m
253.92 455.28 l
254.88 454.8 l
255.12 454.56 l
255.6 453.84 l
255.6 453.12 l
255.12 452.4 l
254.88 452.16 l
253.92 451.68 l
253.92 455.28 m
254.64 454.8 l
254.88 454.56 l
255.12 453.84 l
255.12 453.12 l
254.88 452.4 l
254.64 452.16 l
253.92 451.68 l
251.04 451.68 m
253.92 451.68 l
254.88 451.44 l
255.12 450.96 l
255.6 450.24 l
255.6 449.28 l
255.12 448.56 l
254.88 448.32 l
253.92 447.84 l
249.6 447.84 l
S
253.92 451.68 m
254.64 451.44 l
254.88 450.96 l
255.12 450.24 l
255.12 449.28 l
254.88 448.56 l
254.64 448.32 l
253.92 447.84 l
S
[0 0 1] SC
205.92 438.48 m
200.64 438.48 l
199.2 438 l
198 436.56 l
197.52 434.88 l
197.52 433.44 l
198 432.24 l
198.48 431.76 l
199.68 431.28 l
200.64 431.28 l
202.08 431.76 l
203.28 433.44 l
203.76 434.88 l
203.76 436.56 l
203.28 437.52 l
202.8 438 l
201.6 438.48 l
200.64 438.48 m
199.68 438 l
198.48 436.56 l
198 434.88 l
198 432.96 l
198.48 431.76 l
200.64 431.28 m
201.6 431.76 l
202.8 433.44 l
203.28 434.88 l
203.28 437.04 l
202.8 438 l
205.92 438 l
209.28 434.4 m
209.28 427.2 l
209.76 434.4 m
209.76 427.2 l
213.84 434.4 m
213.84 427.2 l
214.08 434.4 m
214.08 427.2 l
208.32 434.4 m
210.72 434.4 l
212.88 434.4 m
215.28 434.4 l
209.76 431.04 m
213.84 431.04 l
208.32 427.2 m
210.72 427.2 l
212.88 427.2 m
215.28 427.2 l
223.44 440.64 m
223.44 431.28 l
218.64 436.08 m
228 436.08 l
240 438.48 m
234.72 438.48 l
233.28 438 l
232.08 436.56 l
231.6 434.88 l
231.6 433.44 l
232.08 432.24 l
232.8 431.76 l
233.76 431.28 l
234.72 431.28 l
236.4 431.76 l
237.36 433.44 l
237.84 434.88 l
237.84 436.56 l
237.36 437.52 l
236.88 438 l
235.92 438.48 l
234.72 438.48 m
233.76 438 l
232.8 436.56 l
232.08 434.88 l
232.08 432.96 l
232.8 431.76 l
234.72 431.28 m
235.92 431.76 l
236.88 433.44 l
237.36 434.88 l
237.36 437.04 l
236.88 438 l
240 438 l
243.36 434.4 m
243.36 427.2 l
243.84 434.4 m
243.84 427.2 l
242.4 434.4 m
246.48 434.4 l
247.68 434.16 l
247.92 433.68 l
248.4 432.96 l
248.4 432.24 l
247.92 431.52 l
247.68 431.28 l
246.48 431.04 l
246.48 434.4 m
247.2 434.16 l
247.68 433.68 l
247.92 432.96 l
247.92 432.24 l
247.68 431.52 l
247.2 431.28 l
246.48 431.04 l
243.84 431.04 m
246.48 431.04 l
247.68 430.56 l
247.92 430.32 l
248.4 429.6 l
248.4 428.4 l
247.92 427.92 l
247.68 427.44 l
246.48 427.2 l
242.4 427.2 l
246.48 431.04 m
247.2 430.56 l
247.68 430.32 l
247.92 429.6 l
247.92 428.4 l
247.68 427.92 l
247.2 427.44 l
246.48 427.2 l
S
[0 0 0] SC
205.92 417.84 m
200.64 417.84 l
199.2 417.36 l
198 415.68 l
197.52 414.24 l
197.52 412.56 l
198 411.6 l
198.48 411.12 l
199.68 410.64 l
200.64 410.64 l
202.08 411.12 l
203.28 412.56 l
203.76 414.24 l
203.76 415.68 l
203.28 416.64 l
202.8 417.36 l
201.6 417.84 l
200.64 417.84 m
199.68 417.36 l
198.48 415.68 l
198 414.24 l
198 412.08 l
198.48 411.12 l
200.64 410.64 m
201.6 411.12 l
202.8 412.56 l
203.28 414.24 l
203.28 416.16 l
202.8 417.36 l
205.92 417.36 l
209.28 413.76 m
209.28 406.32 l
209.76 413.76 m
209.76 406.32 l
208.32 413.76 m
210.72 413.76 l
208.32 406.32 m
210.72 406.32 l
216.96 412.56 m
217.2 413.76 l
217.2 411.6 l
216.96 412.56 l
216.24 413.28 l
215.28 413.76 l
214.08 413.76 l
213.12 413.28 l
212.4 412.56 l
212.4 411.84 l
212.88 411.12 l
213.12 410.88 l
216 409.92 l
217.2 408.72 l
212.4 411.84 m
213.12 411.12 l
216 410.16 l
216.48 409.92 l
216.96 409.44 l
217.2 408.72 l
217.2 407.52 l
216.48 406.8 l
215.52 406.32 l
214.56 406.32 l
213.36 406.8 l
212.88 407.52 l
212.4 408.48 l
212.4 406.32 l
212.88 407.52 l
221.76 413.76 m
219.36 406.32 l
221.76 413.76 m
224.16 406.32 l
221.76 412.56 m
223.92 406.32 l
220.08 408.48 m
223.2 408.48 l
218.64 406.32 m
220.8 406.32 l
222.72 406.32 m
224.88 406.32 l
232.8 419.76 m
232.8 410.64 l
228 415.2 m
237.36 415.2 l
249.36 417.84 m
244.08 417.84 l
242.64 417.36 l
241.44 415.68 l
240.96 414.24 l
240.96 412.56 l
241.44 411.6 l
242.16 411.12 l
243.12 410.64 l
244.08 410.64 l
245.76 411.12 l
246.72 412.56 l
247.2 414.24 l
247.2 415.68 l
246.72 416.64 l
246.24 417.36 l
245.28 417.84 l
244.08 417.84 m
243.12 417.36 l
242.16 415.68 l
241.44 414.24 l
241.44 412.08 l
242.16 411.12 l
244.08 410.64 m
245.28 411.12 l
246.24 412.56 l
246.72 414.24 l
246.72 416.16 l
246.24 417.36 l
249.36 417.36 l
252.72 413.76 m
252.72 406.32 l
253.2 413.76 m
253.2 406.32 l
251.76 413.76 m
255.84 413.76 l
257.04 413.28 l
257.28 413.04 l
257.76 412.32 l
257.76 411.6 l
257.28 410.88 l
257.04 410.64 l
255.84 410.16 l
255.84 413.76 m
256.56 413.28 l
257.04 413.04 l
257.28 412.32 l
257.28 411.6 l
257.04 410.88 l
256.56 410.64 l
255.84 410.16 l
S
253.2 410.16 m
255.84 410.16 l
257.04 409.92 l
257.28 409.44 l
257.76 408.72 l
257.76 407.76 l
257.28 407.04 l
257.04 406.8 l
255.84 406.32 l
251.76 406.32 l
255.84 410.16 m
256.56 409.92 l
257.04 409.44 l
257.28 408.72 l
257.28 407.76 l
257.04 407.04 l
256.56 406.8 l
255.84 406.32 l
139.92 375.12 m
451.44 375.12 l
451.44 562.08 l
139.92 562.08 l
139.92 375.12 l
h
S
[0 0 1] SC
139.92 375.12 m
139.92 375.12 l
144 375.12 m
144 392.16 l
148.32 392.16 l
148.32 411.6 l
152.4 411.6 l
152.4 419.76 l
156.48 419.76 l
156.48 441.36 l
160.56 441.36 l
160.56 471.84 l
164.88 471.84 l
164.88 497.04 l
168.96 497.04 l
168.96 514.56 l
173.04 514.56 l
173.04 539.04 l
177.36 539.04 l
177.36 538.56 l
181.44 538.56 l
181.44 535.68 l
185.52 535.68 l
185.52 532.08 l
189.84 532.08 l
189.84 528.24 l
193.92 528.24 l
193.92 525.12 l
198 525.12 l
198 521.76 l
202.08 521.76 l
202.08 518.16 l
206.4 518.16 l
206.4 515.04 l
210.48 515.04 l
210.48 511.92 l
214.56 511.92 l
214.56 508.8 l
218.88 508.8 l
218.88 507.6 l
222.96 507.6 l
222.96 505.92 l
227.04 505.92 l
227.04 502.8 l
231.36 502.8 l
231.36 501.6 l
235.44 501.6 l
235.44 500.16 l
239.52 500.16 l
239.52 497.76 l
243.6 497.76 l
243.6 496.08 l
247.92 496.08 l
247.92 495.36 l
252 495.36 l
252 494.4 l
256.08 494.4 l
256.08 492.24 l
260.4 492.24 l
260.4 491.52 l
264.48 491.52 l
264.48 488.64 l
268.56 488.64 l
268.56 489.36 l
272.88 489.36 l
272.88 488.64 l
276.96 488.64 l
276.96 486 l
281.04 486 l
281.04 485.76 l
285.12 485.76 l
285.12 484.8 l
289.44 484.8 l
289.44 485.28 l
293.52 485.28 l
293.52 486.96 l
297.6 486.96 l
297.6 485.76 l
306 485.76 l
306 484.56 l
310.08 484.56 l
310.08 483.6 l
314.4 483.6 l
314.4 482.4 l
318.48 482.4 l
318.48 481.68 l
322.56 481.68 l
322.56 479.76 l
326.64 479.76 l
326.64 480 l
330.96 480 l
330.96 476.88 l
335.04 476.88 l
335.04 474 l
339.12 474 l
339.12 472.8 l
343.44 472.8 l
343.44 472.32 l
347.52 472.32 l
347.52 470.16 l
351.6 470.16 l
351.6 468.24 l
355.92 468.24 l
355.92 466.8 l
360 466.8 l
360 464.64 l
364.08 464.64 l
364.08 463.68 l
368.16 463.68 l
368.16 462.24 l
372.48 462.24 l
372.48 460.32 l
376.56 460.32 l
376.56 459.12 l
380.64 459.12 l
380.64 457.68 l
384.96 457.68 l
384.96 456.72 l
389.04 456.72 l
389.04 455.28 l
393.12 455.28 l
393.12 453.84 l
397.44 453.84 l
397.44 452.4 l
401.52 452.4 l
401.52 451.68 l
405.6 451.68 l
405.6 450 l
409.92 450 l
409.92 448.32 l
414 448.32 l
414 447.6 l
418.08 447.6 l
418.08 445.92 l
422.16 445.92 l
422.16 444.48 l
426.48 444.48 l
426.48 444.24 l
430.56 444.24 l
430.56 443.04 l
434.64 443.04 l
434.64 441.6 l
438.96 441.6 l
438.96 441.12 l
443.04 441.12 l
443.04 439.68 l
447.12 439.68 l
447.12 438.72 l
451.2 438.72 l
451.2 433.92 l
451.44 433.92 l
S
451.44 375.12 m
451.44 375.12 l
S
[0 0 0] SC
139.92 375.12 m
139.92 387.6 l
150.24 379.44 m
150.24 375.12 l
160.56 375.12 m
160.56 379.44 l
171.12 379.44 m
171.12 375.12 l
181.44 375.12 m
181.44 379.44 l
191.76 387.6 m
191.76 375.12 l
202.08 375.12 m
202.08 379.44 l
212.64 379.44 m
212.64 375.12 l
222.96 375.12 m
222.96 379.44 l
233.28 379.44 m
233.28 375.12 l
243.6 375.12 m
243.6 387.6 l
254.16 379.44 m
254.16 375.12 l
264.48 375.12 m
264.48 379.44 l
274.8 379.44 m
274.8 375.12 l
285.36 375.12 m
285.36 379.44 l
295.68 387.6 m
295.68 375.12 l
306 375.12 m
306 379.44 l
316.32 379.44 m
316.32 375.12 l
326.64 375.12 m
326.64 379.44 l
337.2 379.44 m
337.2 375.12 l
347.52 375.12 m
347.52 387.6 l
357.84 379.44 m
357.84 375.12 l
368.16 375.12 m
368.16 379.44 l
378.72 379.44 m
378.72 375.12 l
389.04 375.12 m
389.04 379.44 l
399.36 387.6 m
399.36 375.12 l
409.92 375.12 m
409.92 379.44 l
420.24 379.44 m
420.24 375.12 l
430.56 375.12 m
430.56 379.44 l
440.88 379.44 m
440.88 375.12 l
451.44 375.12 m
451.44 387.6 l
139.68 368.4 m
138.48 368.16 l
137.76 366.96 l
137.52 365.28 l
137.52 364.32 l
137.76 362.4 l
138.48 361.44 l
139.68 361.2 l
140.16 361.2 l
141.36 361.44 l
142.08 362.4 l
142.32 364.32 l
142.32 365.28 l
142.08 366.96 l
141.36 368.16 l
140.16 368.4 l
139.68 368.4 l
138.96 368.16 l
138.48 367.68 l
138.24 366.96 l
137.76 365.28 l
137.76 364.32 l
138.24 362.4 l
138.48 361.92 l
138.96 361.44 l
139.68 361.2 l
140.16 361.2 m
140.88 361.44 l
141.36 361.92 l
141.6 362.4 l
142.08 364.32 l
142.08 365.28 l
141.6 366.96 l
141.36 367.68 l
140.88 368.16 l
140.16 368.4 l
182.88 366.96 m
183.12 366.72 l
182.88 366.24 l
182.4 366.72 l
182.4 366.96 l
182.88 367.68 l
183.12 368.16 l
184.32 368.4 l
185.52 368.4 l
186.72 368.16 l
186.96 367.68 l
187.44 366.96 l
187.44 366.24 l
186.96 365.52 l
186 365.04 l
184.32 364.32 l
183.6 363.84 l
182.88 363.12 l
182.4 362.16 l
182.4 361.2 l
185.52 368.4 m
186.24 368.16 l
186.72 367.68 l
186.96 366.96 l
186.96 366.24 l
186.72 365.52 l
185.52 365.04 l
184.32 364.32 l
182.4 361.92 m
182.88 362.16 l
183.6 362.16 l
185.28 361.44 l
186.24 361.44 l
186.96 361.92 l
187.44 362.16 l
S
183.6 362.16 m
185.28 361.2 l
186.72 361.2 l
186.96 361.44 l
187.44 362.16 l
187.44 362.88 l
190.08 368.4 m
189.36 365.04 l
190.08 365.52 l
191.04 366 l
192.24 366 l
193.2 365.52 l
193.92 365.04 l
194.16 363.84 l
194.16 363.12 l
193.92 362.16 l
193.2 361.44 l
192.24 361.2 l
191.04 361.2 l
190.08 361.44 l
189.84 361.92 l
189.36 362.4 l
189.36 362.88 l
189.84 363.12 l
190.08 362.88 l
189.84 362.4 l
192.24 366 m
193.68 365.04 l
193.92 363.84 l
193.92 363.12 l
193.68 362.16 l
192.96 361.44 l
192.24 361.2 l
190.08 368.4 m
193.68 368.4 l
190.08 368.16 m
191.76 368.16 l
193.68 368.4 l
198.48 368.4 m
197.28 368.16 l
196.56 366.96 l
196.32 365.28 l
196.32 364.32 l
196.56 362.4 l
197.28 361.44 l
198.48 361.2 l
199.2 361.2 l
200.16 361.44 l
200.88 362.4 l
201.12 364.32 l
201.12 365.28 l
200.88 366.96 l
200.16 368.16 l
199.2 368.4 l
198.48 368.4 l
197.76 368.16 l
197.28 367.68 l
197.04 366.96 l
196.56 365.28 l
196.56 364.32 l
197.04 362.4 l
197.28 361.92 l
197.76 361.44 l
198.48 361.2 l
199.2 361.2 m
199.68 361.44 l
200.16 361.92 l
200.4 362.4 l
200.88 364.32 l
200.88 365.28 l
200.4 366.96 l
200.16 367.68 l
199.68 368.16 l
199.2 368.4 l
234.96 368.4 m
234.48 365.04 l
234.96 365.52 l
236.16 366 l
237.12 366 l
238.08 365.52 l
238.8 365.04 l
239.28 363.84 l
239.28 363.12 l
238.8 362.16 l
238.08 361.44 l
237.12 361.2 l
236.16 361.2 l
234.96 361.44 l
234.48 362.4 l
234.48 362.88 l
234.72 363.12 l
234.96 362.88 l
234.72 362.4 l
237.12 366 m
238.56 365.04 l
238.8 363.84 l
238.8 363.12 l
238.56 362.16 l
237.84 361.44 l
237.12 361.2 l
234.96 368.4 m
238.56 368.4 l
234.96 368.16 m
236.88 368.16 l
238.56 368.4 l
243.36 368.4 m
242.4 368.16 l
241.68 366.96 l
241.2 365.28 l
241.2 364.32 l
241.68 362.4 l
242.4 361.44 l
243.36 361.2 l
244.08 361.2 l
245.04 361.44 l
245.76 362.4 l
246.24 364.32 l
246.24 365.28 l
245.76 366.96 l
245.04 368.16 l
244.08 368.4 l
243.36 368.4 l
242.64 368.16 l
242.4 367.68 l
241.92 366.96 l
241.68 365.28 l
241.68 364.32 l
241.92 362.4 l
242.4 361.92 l
242.64 361.44 l
243.36 361.2 l
S
244.08 361.2 m
244.8 361.44 l
245.04 361.92 l
245.52 362.4 l
245.76 364.32 l
245.76 365.28 l
245.52 366.96 l
245.04 367.68 l
244.8 368.16 l
244.08 368.4 l
250.32 368.4 m
249.36 368.16 l
248.64 366.96 l
248.16 365.28 l
248.16 364.32 l
248.64 362.4 l
249.36 361.44 l
250.32 361.2 l
251.04 361.2 l
252 361.44 l
252.72 362.4 l
253.2 364.32 l
253.2 365.28 l
252.72 366.96 l
252 368.16 l
251.04 368.4 l
250.32 368.4 l
249.6 368.16 l
249.36 367.68 l
248.88 366.96 l
248.64 365.28 l
248.64 364.32 l
248.88 362.4 l
249.36 361.92 l
249.6 361.44 l
250.32 361.2 l
251.04 361.2 m
251.76 361.44 l
252 361.92 l
252.48 362.4 l
252.72 364.32 l
252.72 365.28 l
252.48 366.96 l
252 367.68 l
251.76 368.16 l
251.04 368.4 l
286.32 368.4 m
286.32 366.24 l
286.32 366.96 m
286.56 367.68 l
287.28 368.4 l
288 368.4 l
289.68 367.44 l
290.4 367.44 l
290.88 367.68 l
291.12 368.4 l
286.56 367.68 m
287.28 368.16 l
288 368.16 l
289.68 367.44 l
291.12 368.4 m
291.12 367.44 l
290.88 366.24 l
289.44 364.56 l
288.96 363.84 l
288.72 362.88 l
288.72 361.2 l
290.88 366.24 m
288.96 364.56 l
288.72 363.84 l
288.24 362.88 l
288.24 361.2 l
294 368.4 m
293.28 365.04 l
294 365.52 l
294.96 366 l
295.92 366 l
297.12 365.52 l
297.6 365.04 l
298.08 363.84 l
298.08 363.12 l
297.6 362.16 l
297.12 361.44 l
295.92 361.2 l
294.96 361.2 l
294 361.44 l
293.52 361.92 l
293.28 362.4 l
293.28 362.88 l
293.52 363.12 l
294 362.88 l
293.52 362.4 l
295.92 366 m
297.36 365.04 l
297.6 363.84 l
297.6 363.12 l
297.36 362.16 l
296.64 361.44 l
295.92 361.2 l
294 368.4 m
297.36 368.4 l
294 368.16 m
295.68 368.16 l
297.36 368.4 l
302.16 368.4 m
301.2 368.16 l
300.48 366.96 l
300.24 365.28 l
300.24 364.32 l
300.48 362.4 l
301.2 361.44 l
302.16 361.2 l
302.88 361.2 l
303.84 361.44 l
304.56 362.4 l
305.04 364.32 l
305.04 365.28 l
304.56 366.96 l
303.84 368.16 l
302.88 368.4 l
302.16 368.4 l
301.44 368.16 l
301.2 367.68 l
300.72 366.96 l
300.48 365.28 l
300.48 364.32 l
300.72 362.4 l
301.2 361.92 l
301.44 361.44 l
302.16 361.2 l
S
302.88 361.2 m
303.6 361.44 l
303.84 361.92 l
304.32 362.4 l
304.56 364.32 l
304.56 365.28 l
304.32 366.96 l
303.84 367.68 l
303.6 368.16 l
302.88 368.4 l
335.76 366.96 m
336.48 367.44 l
337.44 368.4 l
337.44 361.2 l
337.2 368.16 m
337.2 361.2 l
335.76 361.2 m
338.88 361.2 l
343.68 368.4 m
342.72 368.16 l
342 366.96 l
341.76 365.28 l
341.76 364.32 l
342 362.4 l
342.72 361.44 l
343.68 361.2 l
344.4 361.2 l
345.36 361.44 l
346.08 362.4 l
346.56 364.32 l
346.56 365.28 l
346.08 366.96 l
345.36 368.16 l
344.4 368.4 l
343.68 368.4 l
342.96 368.16 l
342.72 367.68 l
342.24 366.96 l
342 365.28 l
342 364.32 l
342.24 362.4 l
342.72 361.92 l
342.96 361.44 l
343.68 361.2 l
344.4 361.2 m
345.12 361.44 l
345.36 361.92 l
345.84 362.4 l
346.08 364.32 l
346.08 365.28 l
345.84 366.96 l
345.36 367.68 l
345.12 368.16 l
344.4 368.4 l
350.64 368.4 m
349.68 368.16 l
348.96 366.96 l
348.48 365.28 l
348.48 364.32 l
348.96 362.4 l
349.68 361.44 l
350.64 361.2 l
351.36 361.2 l
352.32 361.44 l
353.04 362.4 l
353.52 364.32 l
353.52 365.28 l
353.04 366.96 l
352.32 368.16 l
351.36 368.4 l
350.64 368.4 l
349.92 368.16 l
349.68 367.68 l
349.2 366.96 l
348.96 365.28 l
348.96 364.32 l
349.2 362.4 l
349.68 361.92 l
349.92 361.44 l
350.64 361.2 l
351.36 361.2 m
352.08 361.44 l
352.32 361.92 l
352.8 362.4 l
353.04 364.32 l
353.04 365.28 l
352.8 366.96 l
352.32 367.68 l
352.08 368.16 l
351.36 368.4 l
357.6 368.4 m
356.64 368.16 l
355.92 366.96 l
355.44 365.28 l
355.44 364.32 l
355.92 362.4 l
356.64 361.44 l
357.6 361.2 l
358.32 361.2 l
359.28 361.44 l
360 362.4 l
360.24 364.32 l
360.24 365.28 l
360 366.96 l
359.28 368.16 l
358.32 368.4 l
357.6 368.4 l
356.88 368.16 l
356.64 367.68 l
356.16 366.96 l
355.92 365.28 l
355.92 364.32 l
356.16 362.4 l
356.64 361.92 l
356.88 361.44 l
357.6 361.2 l
358.32 361.2 m
359.04 361.44 l
359.28 361.92 l
359.76 362.4 l
360 364.32 l
360 365.28 l
359.76 366.96 l
359.28 367.68 l
359.04 368.16 l
358.32 368.4 l
387.6 366.96 m
388.32 367.44 l
389.28 368.4 l
389.28 361.2 l
S
389.04 368.16 m
389.04 361.2 l
387.6 361.2 m
390.72 361.2 l
393.84 366.96 m
394.32 366.72 l
393.84 366.24 l
393.6 366.72 l
393.6 366.96 l
393.84 367.68 l
394.32 368.16 l
395.28 368.4 l
396.72 368.4 l
397.68 368.16 l
398.16 367.68 l
398.4 366.96 l
398.4 366.24 l
398.16 365.52 l
396.96 365.04 l
395.28 364.32 l
394.56 363.84 l
393.84 363.12 l
393.6 362.16 l
393.6 361.2 l
396.72 368.4 m
397.44 368.16 l
397.68 367.68 l
398.16 366.96 l
398.16 366.24 l
397.68 365.52 l
395.28 364.32 l
393.6 361.92 m
393.84 362.16 l
394.56 362.16 l
396.24 361.44 l
397.44 361.44 l
398.16 361.92 l
398.4 362.16 l
394.56 362.16 m
396.24 361.2 l
397.68 361.2 l
398.16 361.44 l
398.4 362.16 l
398.4 362.88 l
401.28 368.4 m
400.56 365.04 l
401.28 365.52 l
402.24 366 l
403.2 366 l
404.4 365.52 l
404.88 365.04 l
405.36 363.84 l
405.36 363.12 l
404.88 362.16 l
404.4 361.44 l
403.2 361.2 l
402.24 361.2 l
401.28 361.44 l
400.8 361.92 l
400.56 362.4 l
400.56 362.88 l
400.8 363.12 l
401.28 362.88 l
400.8 362.4 l
403.2 366 m
404.64 365.04 l
404.88 363.84 l
404.88 363.12 l
404.64 362.16 l
403.92 361.44 l
403.2 361.2 l
401.28 368.4 m
404.64 368.4 l
401.28 368.16 m
402.96 368.16 l
404.64 368.4 l
409.44 368.4 m
408.48 368.16 l
407.76 366.96 l
407.52 365.28 l
407.52 364.32 l
407.76 362.4 l
408.48 361.44 l
409.44 361.2 l
410.16 361.2 l
411.12 361.44 l
411.84 362.4 l
412.32 364.32 l
412.32 365.28 l
411.84 366.96 l
411.12 368.16 l
410.16 368.4 l
409.44 368.4 l
408.72 368.16 l
408.48 367.68 l
408 366.96 l
407.76 365.28 l
407.76 364.32 l
408 362.4 l
408.48 361.92 l
408.72 361.44 l
409.44 361.2 l
410.16 361.2 m
410.88 361.44 l
411.12 361.92 l
411.6 362.4 l
411.84 364.32 l
411.84 365.28 l
411.6 366.96 l
411.12 367.68 l
410.88 368.16 l
410.16 368.4 l
439.44 366.96 m
440.16 367.44 l
441.36 368.4 l
441.36 361.2 l
440.88 368.16 m
440.88 361.2 l
439.44 361.2 m
442.56 361.2 l
446.16 368.4 m
445.44 365.04 l
446.16 365.52 l
447.12 366 l
448.32 366 l
449.28 365.52 l
450 365.04 l
450.24 363.84 l
450.24 363.12 l
450 362.16 l
449.28 361.44 l
448.32 361.2 l
447.12 361.2 l
446.16 361.44 l
445.68 361.92 l
445.44 362.4 l
445.44 362.88 l
445.68 363.12 l
446.16 362.88 l
445.68 362.4 l
S
448.32 366 m
448.8 365.52 l
449.52 365.04 l
450 363.84 l
450 363.12 l
449.52 362.16 l
448.8 361.44 l
448.32 361.2 l
446.16 368.4 m
449.52 368.4 l
446.16 368.16 m
447.84 368.16 l
449.52 368.4 l
454.56 368.4 m
453.36 368.16 l
452.64 366.96 l
452.4 365.28 l
452.4 364.32 l
452.64 362.4 l
453.36 361.44 l
454.56 361.2 l
455.04 361.2 l
456.24 361.44 l
456.96 362.4 l
457.2 364.32 l
457.2 365.28 l
456.96 366.96 l
456.24 368.16 l
455.04 368.4 l
454.56 368.4 l
453.84 368.16 l
453.36 367.68 l
453.12 366.96 l
452.64 365.28 l
452.64 364.32 l
453.12 362.4 l
453.36 361.92 l
453.84 361.44 l
454.56 361.2 l
455.04 361.2 m
455.76 361.44 l
456.24 361.92 l
456.48 362.4 l
456.96 364.32 l
456.96 365.28 l
456.48 366.96 l
456.24 367.68 l
455.76 368.16 l
455.04 368.4 l
461.28 368.4 m
460.32 368.16 l
459.6 366.96 l
459.36 365.28 l
459.36 364.32 l
459.6 362.4 l
460.32 361.44 l
461.28 361.2 l
462 361.2 l
463.2 361.44 l
463.92 362.4 l
464.16 364.32 l
464.16 365.28 l
463.92 366.96 l
463.2 368.16 l
462 368.4 l
461.28 368.4 l
460.8 368.16 l
460.32 367.68 l
460.08 366.96 l
459.6 365.28 l
459.6 364.32 l
460.08 362.4 l
460.32 361.92 l
460.8 361.44 l
461.28 361.2 l
462 361.2 m
462.72 361.44 l
463.2 361.92 l
463.44 362.4 l
463.92 364.32 l
463.92 365.28 l
463.44 366.96 l
463.2 367.68 l
462.72 368.16 l
462 368.4 l
139.92 549.6 m
139.92 562.08 l
150.24 562.08 m
150.24 558 l
160.56 558 m
160.56 562.08 l
171.12 562.08 m
171.12 558 l
181.44 558 m
181.44 562.08 l
191.76 562.08 m
191.76 549.6 l
202.08 558 m
202.08 562.08 l
212.64 562.08 m
212.64 558 l
222.96 558 m
222.96 562.08 l
233.28 562.08 m
233.28 558 l
243.6 549.6 m
243.6 562.08 l
254.16 562.08 m
254.16 558 l
264.48 558 m
264.48 562.08 l
274.8 562.08 m
274.8 558 l
285.36 558 m
285.36 562.08 l
295.68 562.08 m
295.68 549.6 l
306 558 m
306 562.08 l
316.32 562.08 m
316.32 558 l
326.64 558 m
326.64 562.08 l
337.2 562.08 m
337.2 558 l
347.52 549.6 m
347.52 562.08 l
357.84 562.08 m
357.84 558 l
S
368.16 558 m
368.16 562.08 l
378.72 562.08 m
378.72 558 l
389.04 558 m
389.04 562.08 l
399.36 562.08 m
399.36 549.6 l
409.92 558 m
409.92 562.08 l
420.24 562.08 m
420.24 558 l
430.56 558 m
430.56 562.08 l
440.88 562.08 m
440.88 558 l
451.44 549.6 m
451.44 562.08 l
139.92 375.12 m
152.4 375.12 l
144 398.64 m
139.92 398.64 l
139.92 421.92 m
152.4 421.92 l
144 445.2 m
139.92 445.2 l
139.92 468.72 m
152.4 468.72 l
144 492 m
139.92 492 l
139.92 515.28 m
152.4 515.28 l
144 538.8 m
139.92 538.8 l
139.92 562.08 m
152.4 562.08 l
102.48 377.04 m
103.2 377.28 l
104.4 378.24 l
104.4 371.04 l
103.92 378 m
103.92 371.04 l
102.48 371.04 m
105.6 371.04 l
110.4 378.24 m
109.44 378 l
108.72 377.04 l
108.48 375.12 l
108.48 374.16 l
108.72 372.48 l
109.44 371.52 l
110.4 371.04 l
111.12 371.04 l
112.32 371.52 l
113.04 372.48 l
113.28 374.16 l
113.28 375.12 l
113.04 377.04 l
112.32 378 l
111.12 378.24 l
110.4 378.24 l
109.44 377.76 l
109.2 377.04 l
108.72 375.12 l
108.72 374.16 l
109.2 372.48 l
109.44 371.76 l
109.92 371.52 l
110.4 371.04 l
111.12 371.04 m
111.84 371.52 l
112.32 371.76 l
112.56 372.48 l
113.04 374.16 l
113.04 375.12 l
112.56 377.04 l
112.32 377.76 l
111.84 378 l
111.12 378.24 l
115.68 378.24 m
121.92 378.24 l
126 382.56 m
125.04 382.08 l
124.8 381.36 l
124.8 380.4 l
125.04 379.68 l
126 379.44 l
127.44 379.44 l
128.64 379.68 l
128.88 380.4 l
128.88 381.36 l
128.64 382.08 l
127.44 382.56 l
126 382.56 l
125.52 382.08 l
125.04 381.36 l
125.04 380.4 l
125.52 379.68 l
126 379.44 l
127.44 379.44 m
128.16 379.68 l
128.64 380.4 l
128.64 381.36 l
128.16 382.08 l
127.44 382.56 l
126 379.44 m
125.04 378.96 l
124.8 378.72 l
124.32 378 l
124.32 376.56 l
124.8 375.84 l
125.04 375.6 l
126 375.12 l
127.44 375.12 l
128.64 375.6 l
128.88 375.84 l
129.12 376.56 l
129.12 378 l
128.88 378.72 l
128.64 378.96 l
127.44 379.44 l
126 379.44 m
125.52 378.96 l
125.04 378.72 l
124.8 378 l
124.8 376.56 l
125.04 375.84 l
125.52 375.6 l
126 375.12 l
S
127.44 375.12 m
128.16 375.6 l
128.64 375.84 l
128.88 376.56 l
128.88 378 l
128.64 378.72 l
128.16 378.96 l
127.44 379.44 l
102.48 423.6 m
103.2 424.08 l
104.4 425.04 l
104.4 417.84 l
103.92 424.8 m
103.92 417.84 l
102.48 417.84 m
105.6 417.84 l
110.4 425.04 m
109.44 424.8 l
108.72 423.6 l
108.48 421.92 l
108.48 420.96 l
108.72 419.28 l
109.44 418.08 l
110.4 417.84 l
111.12 417.84 l
112.32 418.08 l
113.04 419.28 l
113.28 420.96 l
113.28 421.92 l
113.04 423.6 l
112.32 424.8 l
111.12 425.04 l
110.4 425.04 l
109.92 424.8 l
109.44 424.32 l
109.2 423.6 l
108.72 421.92 l
108.72 420.96 l
109.2 419.28 l
109.44 418.56 l
109.92 418.08 l
110.4 417.84 l
111.12 417.84 m
111.84 418.08 l
112.32 418.56 l
112.56 419.28 l
113.04 420.96 l
113.04 421.92 l
112.56 423.6 l
112.32 424.32 l
111.84 424.8 l
111.12 425.04 l
115.68 425.04 m
121.92 425.04 l
128.64 428.16 m
128.16 427.92 l
128.64 427.44 l
128.88 427.92 l
128.88 428.16 l
128.64 428.88 l
127.92 429.12 l
126.72 429.12 l
125.76 428.88 l
125.04 428.16 l
124.32 426 l
124.32 424.08 l
124.8 422.88 l
125.52 422.4 l
126.48 421.92 l
127.2 421.92 l
128.16 422.4 l
128.88 422.88 l
129.12 424.08 l
129.12 424.32 l
128.88 425.52 l
128.16 426 l
127.2 426.48 l
126.72 426.48 l
125.76 426 l
125.04 425.52 l
124.8 424.32 l
126.72 429.12 m
126 428.88 l
125.04 427.44 l
124.8 426 l
124.8 424.08 l
125.04 422.88 l
126.48 421.92 l
127.2 421.92 m
128.64 422.88 l
128.88 424.08 l
128.88 424.32 l
128.64 425.52 l
127.2 426.48 l
102.48 470.4 m
103.2 470.64 l
104.4 471.84 l
104.4 464.4 l
103.92 471.36 m
103.92 464.4 l
102.48 464.4 m
105.6 464.4 l
110.4 471.84 m
109.44 471.36 l
108.72 470.4 l
108.48 468.72 l
108.48 467.52 l
108.72 465.84 l
109.44 464.88 l
110.4 464.4 l
111.12 464.4 l
112.32 464.88 l
113.04 465.84 l
113.28 467.52 l
113.28 468.72 l
113.04 470.4 l
112.32 471.36 l
111.12 471.84 l
110.4 471.84 l
109.92 471.36 l
109.44 471.12 l
109.2 470.4 l
108.72 468.72 l
108.72 467.52 l
109.2 465.84 l
109.44 465.12 l
109.92 464.88 l
110.4 464.4 l
S
111.12 464.4 m
111.84 464.88 l
112.32 465.12 l
112.56 465.84 l
113.04 467.52 l
113.04 468.72 l
112.56 470.4 l
112.32 471.12 l
111.84 471.36 l
111.12 471.84 l
115.68 471.84 m
121.92 471.84 l
127.44 475.2 m
127.44 468.72 l
127.92 475.92 m
127.92 468.72 l
127.92 475.92 m
124.08 470.64 l
129.6 470.64 l
126.48 468.72 m
128.88 468.72 l
102.48 517.2 m
103.2 517.44 l
104.4 518.4 l
104.4 511.2 l
103.92 518.16 m
103.92 511.2 l
102.48 511.2 m
105.6 511.2 l
110.4 518.4 m
109.44 518.16 l
108.72 517.2 l
108.48 515.28 l
108.48 514.32 l
108.72 512.64 l
109.44 511.44 l
110.4 511.2 l
111.12 511.2 l
112.32 511.44 l
113.04 512.64 l
113.28 514.32 l
113.28 515.28 l
113.04 517.2 l
112.32 518.16 l
111.12 518.4 l
110.4 518.4 l
109.92 518.16 l
109.44 517.68 l
109.2 517.2 l
108.72 515.28 l
108.72 514.32 l
109.2 512.64 l
109.44 511.92 l
109.92 511.44 l
110.4 511.2 l
111.12 511.2 m
111.84 511.44 l
112.32 511.92 l
112.56 512.64 l
113.04 514.32 l
113.04 515.28 l
112.56 517.2 l
112.32 517.68 l
111.84 518.16 l
111.12 518.4 l
115.68 518.4 m
121.92 518.4 l
124.8 521.28 m
125.04 520.8 l
124.8 520.56 l
124.32 520.8 l
124.32 521.28 l
124.8 522 l
125.04 522.24 l
126 522.72 l
127.44 522.72 l
128.64 522.24 l
128.88 522 l
129.12 521.28 l
129.12 520.56 l
128.88 519.84 l
127.92 519.12 l
126 518.4 l
125.52 518.16 l
124.8 517.44 l
124.32 516.48 l
124.32 515.28 l
127.44 522.72 m
128.16 522.24 l
128.64 522 l
128.88 521.28 l
128.88 520.56 l
128.64 519.84 l
127.44 519.12 l
126 518.4 l
124.32 516 m
124.8 516.48 l
125.52 516.48 l
127.2 515.76 l
128.16 515.76 l
128.88 516 l
129.12 516.48 l
125.52 516.48 m
127.2 515.28 l
128.64 515.28 l
128.88 515.76 l
129.12 516.48 l
129.12 517.2 l
111.6 563.76 m
112.32 564.24 l
113.28 565.2 l
113.28 558 l
113.04 564.96 m
113.04 558 l
111.6 558 m
114.72 558 l
119.52 565.2 m
118.56 564.96 l
117.84 563.76 l
117.36 562.08 l
117.36 561.12 l
117.84 559.2 l
118.56 558.24 l
119.52 558 l
120.24 558 l
121.2 558.24 l
121.92 559.2 l
122.4 561.12 l
122.4 562.08 l
121.92 563.76 l
121.2 564.96 l
120.24 565.2 l
119.52 565.2 l
S
119.52 565.2 m
118.8 564.96 l
118.56 564.48 l
118.08 563.76 l
117.84 562.08 l
117.84 561.12 l
118.08 559.2 l
118.56 558.72 l
118.8 558.24 l
119.52 558 l
120.24 558 m
120.96 558.24 l
121.2 558.72 l
121.68 559.2 l
121.92 561.12 l
121.92 562.08 l
121.68 563.76 l
121.2 564.48 l
120.96 564.96 l
120.24 565.2 l
126.48 569.28 m
125.52 569.04 l
124.8 568.08 l
124.32 566.16 l
124.32 565.2 l
124.8 563.52 l
125.52 562.32 l
126.48 562.08 l
127.2 562.08 l
128.16 562.32 l
128.88 563.52 l
129.12 565.2 l
129.12 566.16 l
128.88 568.08 l
128.16 569.04 l
127.2 569.28 l
126.48 569.28 l
125.76 569.04 l
125.52 568.56 l
125.04 568.08 l
124.8 566.16 l
124.8 565.2 l
125.04 563.52 l
125.52 562.8 l
125.76 562.32 l
126.48 562.08 l
127.2 562.08 m
127.92 562.32 l
128.16 562.8 l
128.64 563.52 l
128.88 565.2 l
128.88 566.16 l
128.64 568.08 l
128.16 568.56 l
127.92 569.04 l
127.2 569.28 l
438.96 375.12 m
451.44 375.12 l
451.44 398.64 m
447.12 398.64 l
438.96 421.92 m
451.44 421.92 l
451.44 445.2 m
447.12 445.2 l
438.96 468.72 m
451.44 468.72 l
451.44 492 m
447.12 492 l
438.96 515.28 m
451.44 515.28 l
451.44 538.8 m
447.12 538.8 l
438.96 562.08 m
451.44 562.08 l
S
[1 0 0] SC
139.92 375.12 m
139.92 375.12 l
144 375.12 m
144 392.16 l
148.32 392.16 l
148.32 411.6 l
152.4 411.6 l
152.4 419.76 l
156.48 419.76 l
156.48 441.36 l
160.56 441.36 l
160.56 471.84 l
164.88 471.84 l
164.88 497.04 l
168.96 497.04 l
168.96 514.56 l
173.04 514.56 l
173.04 539.04 l
177.36 539.04 l
177.36 538.56 l
181.44 538.56 l
181.44 535.68 l
185.52 535.68 l
185.52 532.08 l
189.84 532.08 l
189.84 528.24 l
193.92 528.24 l
193.92 525.36 l
198 525.36 l
198 521.76 l
202.08 521.76 l
202.08 518.16 l
206.4 518.16 l
206.4 515.28 l
210.48 515.28 l
210.48 512.16 l
214.56 512.16 l
214.56 509.28 l
218.88 509.28 l
218.88 508.32 l
222.96 508.32 l
222.96 506.88 l
227.04 506.88 l
227.04 504 l
231.36 504 l
231.36 503.04 l
235.44 503.04 l
235.44 501.84 l
239.52 501.84 l
239.52 499.92 l
243.6 499.92 l
243.6 498.48 l
247.92 498.48 l
247.92 498 l
252 498 l
252 497.04 l
256.08 497.04 l
256.08 495.36 l
260.4 495.36 l
260.4 494.64 l
264.48 494.64 l
264.48 492.48 l
268.56 492.48 l
268.56 492.96 l
272.88 492.96 l
272.88 492.24 l
276.96 492.24 l
276.96 490.08 l
281.04 490.08 l
281.04 489.84 l
285.12 489.84 l
285.12 488.88 l
289.44 488.88 l
289.44 488.64 l
293.52 488.64 l
293.52 489.36 l
297.6 489.36 l
297.6 488.16 l
301.92 488.16 l
301.92 487.2 l
306 487.2 l
306 485.04 l
310.08 485.04 l
310.08 483.84 l
314.4 483.84 l
314.4 481.44 l
318.48 481.44 l
318.48 480 l
322.56 480 l
322.56 477.12 l
326.64 477.12 l
326.64 476.88 l
330.96 476.88 l
330.96 473.28 l
335.04 473.28 l
335.04 468.96 l
339.12 468.96 l
339.12 467.76 l
343.44 467.76 l
343.44 466.32 l
347.52 466.32 l
347.52 462.24 l
351.6 462.24 l
351.6 460.8 l
355.92 460.8 l
355.92 457.92 l
360 457.92 l
360 455.52 l
364.08 455.52 l
364.08 454.8 l
368.16 454.8 l
368.16 452.88 l
372.48 452.88 l
372.48 450.24 l
376.56 450.24 l
376.56 449.04 l
380.64 449.04 l
380.64 446.88 l
384.96 446.88 l
384.96 445.92 l
389.04 445.92 l
389.04 443.52 l
397.44 443.52 l
397.44 440.16 l
401.52 440.16 l
401.52 439.2 l
405.6 439.2 l
405.6 436.08 l
409.92 436.08 l
409.92 434.88 l
414 434.88 l
414 436.08 l
418.08 436.08 l
418.08 431.28 l
422.16 431.28 l
422.16 428.88 l
426.48 428.88 l
426.48 432.96 l
430.56 432.96 l
430.56 431.52 l
434.64 431.52 l
434.64 428.88 l
438.96 428.88 l
438.96 426.72 l
447.12 426.72 l
447.12 429.84 l
451.2 429.84 l
451.2 375.12 l
S
451.44 375.12 m
451.44 375.12 l
S
[0 0 0] SC
139.92 375.12 m
139.92 375.12 l
144 375.12 m
144 392.16 l
148.32 392.16 l
148.32 411.6 l
152.4 411.6 l
152.4 419.76 l
156.48 419.76 l
156.48 441.36 l
160.56 441.36 l
160.56 471.84 l
164.88 471.84 l
164.88 497.04 l
168.96 497.04 l
168.96 514.56 l
173.04 514.56 l
173.04 539.04 l
177.36 539.04 l
177.36 538.56 l
181.44 538.56 l
181.44 535.68 l
185.52 535.68 l
185.52 532.08 l
189.84 532.08 l
189.84 528.48 l
193.92 528.48 l
193.92 525.36 l
198 525.36 l
198 522 l
202.08 522 l
202.08 518.64 l
206.4 518.64 l
206.4 515.76 l
210.48 515.76 l
210.48 512.88 l
214.56 512.88 l
214.56 510.24 l
218.88 510.24 l
218.88 509.28 l
222.96 509.28 l
222.96 508.08 l
227.04 508.08 l
227.04 505.44 l
231.36 505.44 l
231.36 504.48 l
235.44 504.48 l
235.44 503.52 l
239.52 503.52 l
239.52 501.6 l
243.6 501.6 l
243.6 500.4 l
247.92 500.4 l
247.92 499.68 l
252 499.68 l
252 498.96 l
256.08 498.96 l
256.08 497.28 l
260.4 497.28 l
260.4 496.56 l
264.48 496.56 l
264.48 494.88 l
268.56 494.88 l
268.56 495.12 l
272.88 495.12 l
272.88 494.16 l
276.96 494.16 l
276.96 492.48 l
281.04 492.48 l
281.04 492 l
285.12 492 l
285.12 490.8 l
289.44 490.8 l
289.44 490.08 l
297.6 490.08 l
297.6 487.92 l
301.92 487.92 l
301.92 486.48 l
306 486.48 l
306 483.84 l
310.08 483.84 l
310.08 481.44 l
314.4 481.44 l
314.4 478.8 l
318.48 478.8 l
318.48 477.36 l
322.56 477.36 l
322.56 474 l
326.64 474 l
326.64 475.2 l
330.96 475.2 l
330.96 470.64 l
335.04 470.64 l
335.04 465.84 l
339.12 465.84 l
339.12 465.12 l
343.44 465.12 l
343.44 466.08 l
347.52 466.08 l
347.52 463.2 l
351.6 463.2 l
351.6 460.8 l
355.92 460.8 l
355.92 459.12 l
360 459.12 l
360 457.2 l
364.08 457.2 l
364.08 456.24 l
368.16 456.24 l
368.16 454.56 l
372.48 454.56 l
372.48 452.64 l
376.56 452.64 l
376.56 451.68 l
380.64 451.68 l
380.64 449.76 l
384.96 449.76 l
384.96 449.28 l
389.04 449.28 l
389.04 447.84 l
393.12 447.84 l
393.12 446.4 l
397.44 446.4 l
397.44 444.72 l
401.52 444.72 l
401.52 444.48 l
405.6 444.48 l
405.6 442.8 l
409.92 442.8 l
409.92 440.64 l
414 440.64 l
414 441.6 l
418.08 441.6 l
418.08 438.72 l
422.16 438.72 l
422.16 437.28 l
434.64 437.28 l
434.64 434.16 l
438.96 434.16 l
438.96 434.64 l
443.04 434.64 l
443.04 432.48 l
447.12 432.48 l
447.12 431.28 l
451.2 431.28 l
451.2 422.16 l
451.44 422.16 l
S
451.44 375.12 m
451.44 375.12 l
283.68 222.72 m
283.68 215.28 l
284.16 222.72 m
284.16 215.28 l
284.16 221.04 m
285.12 222.24 l
286.8 222.72 l
287.76 222.72 l
289.2 222.24 l
289.92 221.04 l
289.92 215.28 l
287.76 222.72 m
288.72 222.24 l
289.2 221.04 l
289.2 215.28 l
289.92 221.04 m
290.88 222.24 l
292.32 222.72 l
293.52 222.72 l
294.96 222.24 l
295.44 221.04 l
295.44 215.28 l
293.52 222.72 m
294.48 222.24 l
294.96 221.04 l
294.96 215.28 l
282 222.72 m
284.16 222.72 l
282 215.28 m
285.6 215.28 l
287.76 215.28 m
291.36 215.28 l
293.52 215.28 m
297.12 215.28 l
302.88 217.92 m
302.88 211.2 l
303.36 218.4 m
303.36 211.2 l
303.36 218.4 m
299.52 213.36 l
305.04 213.36 l
301.92 211.2 m
304.32 211.2 l
307.44 218.4 m
307.44 211.2 l
307.92 218.4 m
307.92 211.2 l
306.48 218.4 m
307.92 218.4 l
306.48 211.2 m
308.88 211.2 l
73.2 283.2 m
73.2 277.92 l
73.68 276.48 l
75.36 275.52 l
76.8 274.8 l
78.48 274.8 l
79.44 275.52 l
79.92 276 l
80.64 276.96 l
80.64 277.92 l
79.92 279.6 l
78.48 280.56 l
76.8 281.04 l
75.36 281.04 l
74.4 280.56 l
73.68 280.08 l
73.2 279.12 l
73.2 277.92 m
73.68 276.96 l
75.36 276 l
76.8 275.52 l
78.96 275.52 l
79.92 276 l
80.64 277.92 m
79.92 279.12 l
78.48 280.08 l
76.8 280.56 l
74.88 280.56 l
73.68 280.08 l
73.68 283.2 l
77.52 286.08 m
84.72 290.4 l
77.52 286.32 m
84.72 290.88 l
77.52 290.88 m
84.72 286.08 l
77.52 285.36 m
77.52 287.28 l
77.52 289.44 m
77.52 291.6 l
84.72 285.36 m
84.72 287.28 l
84.72 289.44 m
84.72 291.6 l
67.68 302.88 m
84.24 293.52 l
73.2 313.92 m
73.2 308.64 l
73.68 307.2 l
75.36 306 l
76.8 305.52 l
78.48 305.52 l
79.44 306 l
79.92 306.48 l
80.64 307.68 l
80.64 308.64 l
79.92 310.32 l
78.48 311.28 l
76.8 311.76 l
75.36 311.76 l
74.4 311.28 l
73.68 310.8 l
73.2 309.6 l
73.2 308.64 m
73.68 307.68 l
75.36 306.48 l
76.8 306 l
78.96 306 l
79.92 306.48 l
80.64 308.64 m
79.92 309.6 l
78.48 310.8 l
76.8 311.28 l
74.88 311.28 l
73.68 310.8 l
S
73.68 310.8 m
73.68 313.92 l
77.52 317.28 m
84.72 317.28 l
77.52 317.76 m
84.72 317.76 l
77.52 321.84 m
84.72 321.84 l
77.52 322.08 m
84.72 322.08 l
77.52 316.32 m
77.52 318.72 l
77.52 320.88 m
77.52 323.28 l
80.88 317.76 m
80.88 321.84 l
84.72 316.32 m
84.72 318.72 l
84.72 320.88 m
84.72 323.28 l
84.72 325.68 m
84.48 325.2 l
84 325.68 l
84.48 325.92 l
84.96 325.92 l
85.68 325.68 l
86.16 325.2 l
77.52 329.04 m
77.76 328.8 l
78.24 329.04 l
77.76 329.52 l
77.52 329.04 l
79.92 329.04 m
84.72 329.04 l
79.92 329.52 m
84.72 329.52 l
79.92 328.08 m
79.92 329.52 l
84.72 328.08 m
84.72 330.48 l
S
[0 0 1] SC
185.04 334.8 m
180 334.8 l
178.32 334.32 l
177.36 332.64 l
176.88 331.2 l
176.88 329.52 l
177.36 328.56 l
177.84 328.08 l
178.8 327.6 l
180 327.6 l
181.44 328.08 l
182.4 329.52 l
182.88 331.2 l
182.88 332.64 l
182.4 333.6 l
181.92 334.32 l
180.96 334.8 l
180 334.8 m
178.8 334.32 l
177.84 332.64 l
177.36 331.2 l
177.36 329.04 l
177.84 328.08 l
180 327.6 m
180.96 328.08 l
181.92 329.52 l
182.4 331.2 l
182.4 333.12 l
181.92 334.32 l
185.04 334.32 l
188.64 330.72 m
188.64 323.28 l
188.88 330.72 m
188.88 323.28 l
192.96 330.72 m
192.96 323.28 l
193.44 330.72 m
193.44 323.28 l
187.44 330.72 m
189.84 330.72 l
192 330.72 m
194.4 330.72 l
188.88 327.12 m
192.96 327.12 l
187.44 323.28 m
189.84 323.28 l
192 323.28 m
194.4 323.28 l
202.56 336.72 m
202.56 327.6 l
198 332.16 m
207.36 332.16 l
219.12 334.8 m
214.08 334.8 l
212.4 334.32 l
211.44 332.64 l
210.96 331.2 l
210.96 329.52 l
211.44 328.56 l
211.92 328.08 l
212.88 327.6 l
214.08 327.6 l
215.52 328.08 l
216.72 329.52 l
217.2 331.2 l
217.2 332.64 l
216.72 333.6 l
216 334.32 l
215.04 334.8 l
214.08 334.8 m
212.88 334.32 l
211.92 332.64 l
211.44 331.2 l
211.44 329.04 l
211.92 328.08 l
214.08 327.6 m
215.04 328.08 l
216 329.52 l
216.72 331.2 l
216.72 333.12 l
216 334.32 l
219.12 334.32 l
222.72 330.72 m
222.72 323.28 l
222.96 330.72 m
222.96 323.28 l
221.52 330.72 m
225.84 330.72 l
227.28 330 l
227.52 329.28 l
227.52 328.56 l
227.28 327.84 l
225.84 327.12 l
225.84 330.72 m
226.56 330.24 l
226.8 330 l
227.28 329.28 l
227.28 328.56 l
226.8 327.84 l
226.56 327.6 l
225.84 327.12 l
222.96 327.12 m
225.84 327.12 l
226.8 326.88 l
227.28 326.4 l
227.52 325.68 l
227.52 324.72 l
227.28 324 l
225.84 323.28 l
221.52 323.28 l
225.84 327.12 m
226.56 326.88 l
226.8 326.4 l
227.28 325.68 l
227.28 324.72 l
226.8 324 l
226.56 323.76 l
225.84 323.28 l
S
[0 0 0] SC
185.04 313.92 m
180 313.92 l
178.32 313.44 l
177.36 312 l
176.88 310.32 l
176.88 308.88 l
177.36 307.68 l
177.84 307.2 l
178.8 306.72 l
180 306.72 l
181.44 307.2 l
182.4 308.88 l
182.88 310.32 l
182.88 312 l
182.4 312.96 l
181.92 313.44 l
180.96 313.92 l
180 313.92 m
178.8 313.44 l
177.84 312 l
177.36 310.32 l
177.36 308.4 l
177.84 307.2 l
180 306.72 m
180.96 307.2 l
181.92 308.88 l
182.4 310.32 l
182.4 312.48 l
181.92 313.44 l
185.04 313.44 l
188.64 309.84 m
188.64 302.64 l
188.88 309.84 m
188.88 302.64 l
187.44 309.84 m
189.84 309.84 l
187.44 302.64 m
189.84 302.64 l
196.08 308.88 m
196.56 309.84 l
196.56 307.68 l
196.08 308.88 l
195.36 309.6 l
194.4 309.84 l
193.44 309.84 l
192.24 309.6 l
191.76 308.88 l
191.76 308.16 l
192 307.44 l
192.24 306.96 l
195.84 305.76 l
196.56 305.04 l
191.76 308.16 m
192.24 307.44 l
192.96 306.96 l
195.12 306.48 l
195.84 306 l
196.08 305.76 l
196.56 305.04 l
196.56 303.6 l
195.84 302.88 l
194.88 302.64 l
193.68 302.64 l
192.72 302.88 l
192 303.6 l
191.76 304.56 l
191.76 302.64 l
192 303.6 l
201.12 309.84 m
198.48 302.64 l
201.12 309.84 m
203.52 302.64 l
201.12 308.88 m
203.04 302.64 l
199.2 304.56 m
202.32 304.56 l
198 302.64 m
199.92 302.64 l
202.08 302.64 m
204.24 302.64 l
211.92 316.08 m
211.92 306.72 l
207.36 311.52 m
216.72 311.52 l
228.48 313.92 m
223.44 313.92 l
221.76 313.44 l
220.8 312 l
220.32 310.32 l
220.32 308.88 l
220.8 307.68 l
221.28 307.2 l
222.24 306.72 l
223.44 306.72 l
224.88 307.2 l
226.08 308.88 l
226.56 310.32 l
226.56 312 l
226.08 312.96 l
225.36 313.44 l
224.4 313.92 l
223.44 313.92 m
222.24 313.44 l
221.28 312 l
220.8 310.32 l
220.8 308.4 l
221.28 307.2 l
223.44 306.72 m
224.4 307.2 l
225.36 308.88 l
226.08 310.32 l
226.08 312.48 l
225.36 313.44 l
228.48 313.44 l
232.08 309.84 m
232.08 302.64 l
232.32 309.84 m
232.32 302.64 l
230.88 309.84 m
235.2 309.84 l
236.16 309.6 l
236.64 309.12 l
236.88 308.4 l
236.88 307.68 l
236.64 306.96 l
236.16 306.72 l
235.2 306.48 l
235.2 309.84 m
235.92 309.6 l
236.16 309.12 l
236.64 308.4 l
236.64 307.68 l
236.16 306.96 l
235.92 306.72 l
235.2 306.48 l
S
232.32 306.48 m
235.2 306.48 l
236.64 305.76 l
236.88 305.04 l
236.88 303.84 l
236.64 303.36 l
236.16 302.88 l
235.2 302.64 l
230.88 302.64 l
235.2 306.48 m
235.92 306 l
236.16 305.76 l
236.64 305.04 l
236.64 303.84 l
236.16 303.36 l
235.92 302.88 l
235.2 302.64 l
139.92 250.56 m
451.44 250.56 l
451.44 354.48 l
139.92 354.48 l
139.92 250.56 l
h
S
[0 0 1] SC
139.92 268.08 m
139.92 285.36 l
177.36 285.36 l
177.36 285.12 l
206.4 285.12 l
206.4 284.88 l
210.48 284.88 l
210.48 284.64 l
214.56 284.64 l
214.56 284.4 l
218.88 284.4 l
218.88 283.92 l
222.96 283.92 l
222.96 283.68 l
227.04 283.68 l
227.04 283.2 l
231.36 283.2 l
231.36 282.96 l
235.44 282.96 l
235.44 282.72 l
239.52 282.72 l
239.52 282 l
243.6 282 l
243.6 281.76 l
247.92 281.76 l
247.92 281.52 l
252 281.52 l
252 281.28 l
256.08 281.28 l
256.08 280.8 l
260.4 280.8 l
260.4 280.56 l
264.48 280.56 l
264.48 279.84 l
268.56 279.84 l
268.56 280.32 l
272.88 280.32 l
272.88 280.08 l
276.96 280.08 l
276.96 279.6 l
281.04 279.6 l
281.04 279.84 l
285.12 279.84 l
285.12 279.6 l
289.44 279.6 l
289.44 280.56 l
293.52 280.56 l
293.52 281.52 l
301.92 281.52 l
301.92 282.72 l
306 282.72 l
306 284.64 l
310.08 284.64 l
310.08 284.88 l
314.4 284.88 l
314.4 287.04 l
318.48 287.04 l
318.48 288.48 l
322.56 288.48 l
322.56 290.4 l
326.64 290.4 l
326.64 291.6 l
330.96 291.6 l
330.96 293.04 l
335.04 293.04 l
335.04 295.92 l
339.12 295.92 l
339.12 296.64 l
343.44 296.64 l
343.44 299.28 l
347.52 299.28 l
347.52 306.24 l
351.6 306.24 l
351.6 303.84 l
355.92 303.84 l
355.92 309.36 l
360 309.36 l
360 311.04 l
364.08 311.04 l
364.08 309.36 l
368.16 309.36 l
368.16 312 l
372.48 312 l
372.48 314.88 l
376.56 314.88 l
376.56 315.12 l
380.64 315.12 l
380.64 318.24 l
384.96 318.24 l
384.96 317.04 l
389.04 317.04 l
389.04 323.04 l
393.12 323.04 l
393.12 316.08 l
397.44 316.08 l
397.44 325.68 l
401.52 325.68 l
401.52 326.64 l
405.6 326.64 l
405.6 337.2 l
409.92 337.2 l
409.92 333.36 l
414 333.36 l
414 323.04 l
418.08 323.04 l
418.08 342.96 l
422.16 342.96 l
422.16 348.24 l
426.48 348.24 l
426.48 320.16 l
430.56 320.16 l
430.56 322.32 l
434.64 322.32 l
434.64 328.8 l
438.96 328.8 l
438.96 340.32 l
443.04 340.32 l
443.04 330 l
447.12 330 l
447.12 309.12 l
451.2 309.12 l
451.2 250.56 l
451.44 268.08 m
451.44 268.08 l
S
[0 0 0] SC
139.92 250.56 m
139.92 263.04 l
150.24 254.88 m
150.24 250.56 l
160.56 250.56 m
160.56 254.88 l
171.12 254.88 m
171.12 250.56 l
181.44 250.56 m
181.44 254.88 l
191.76 263.04 m
191.76 250.56 l
202.08 250.56 m
202.08 254.88 l
212.64 254.88 m
212.64 250.56 l
222.96 250.56 m
222.96 254.88 l
233.28 254.88 m
233.28 250.56 l
243.6 250.56 m
243.6 263.04 l
254.16 254.88 m
254.16 250.56 l
264.48 250.56 m
264.48 254.88 l
274.8 254.88 m
274.8 250.56 l
285.36 250.56 m
285.36 254.88 l
295.68 263.04 m
295.68 250.56 l
306 250.56 m
306 254.88 l
316.32 254.88 m
316.32 250.56 l
326.64 250.56 m
326.64 254.88 l
337.2 254.88 m
337.2 250.56 l
347.52 250.56 m
347.52 263.04 l
357.84 254.88 m
357.84 250.56 l
368.16 250.56 m
368.16 254.88 l
378.72 254.88 m
378.72 250.56 l
389.04 250.56 m
389.04 254.88 l
399.36 263.04 m
399.36 250.56 l
409.92 250.56 m
409.92 254.88 l
420.24 254.88 m
420.24 250.56 l
430.56 250.56 m
430.56 254.88 l
440.88 254.88 m
440.88 250.56 l
451.44 250.56 m
451.44 263.04 l
139.68 243.84 m
138.48 243.6 l
137.76 242.4 l
137.52 240.72 l
137.52 239.76 l
137.76 237.84 l
138.48 236.88 l
139.68 236.64 l
140.16 236.64 l
141.36 236.88 l
142.08 237.84 l
142.32 239.76 l
142.32 240.72 l
142.08 242.4 l
141.36 243.6 l
140.16 243.84 l
139.68 243.84 l
138.96 243.6 l
138.48 243.12 l
138.24 242.4 l
137.76 240.72 l
137.76 239.76 l
138.24 237.84 l
138.48 237.36 l
138.96 236.88 l
139.68 236.64 l
140.16 236.64 m
140.88 236.88 l
141.36 237.36 l
141.6 237.84 l
142.08 239.76 l
142.08 240.72 l
141.6 242.4 l
141.36 243.12 l
140.88 243.6 l
140.16 243.84 l
182.88 242.4 m
183.12 242.16 l
182.88 241.68 l
182.4 242.16 l
182.4 242.4 l
182.88 243.12 l
183.12 243.6 l
184.32 243.84 l
185.52 243.84 l
186.72 243.6 l
186.96 243.12 l
187.44 242.4 l
187.44 241.68 l
186.96 240.96 l
186 240.48 l
184.32 239.76 l
183.6 239.28 l
182.88 238.56 l
182.4 237.6 l
182.4 236.64 l
185.52 243.84 m
186.24 243.6 l
186.72 243.12 l
186.96 242.4 l
186.96 241.68 l
186.72 240.96 l
185.52 240.48 l
184.32 239.76 l
182.4 237.36 m
182.88 237.6 l
183.6 237.6 l
185.28 236.88 l
186.24 236.88 l
186.96 237.36 l
187.44 237.6 l
S
183.6 237.6 m
185.28 236.64 l
186.72 236.64 l
186.96 236.88 l
187.44 237.6 l
187.44 238.32 l
190.08 243.84 m
189.36 240.48 l
190.08 240.96 l
191.04 241.44 l
192.24 241.44 l
193.2 240.96 l
193.92 240.48 l
194.16 239.28 l
194.16 238.56 l
193.92 237.6 l
193.2 236.88 l
192.24 236.64 l
191.04 236.64 l
190.08 236.88 l
189.84 237.36 l
189.36 237.84 l
189.36 238.32 l
189.84 238.56 l
190.08 238.32 l
189.84 237.84 l
192.24 241.44 m
193.68 240.48 l
193.92 239.28 l
193.92 238.56 l
193.68 237.6 l
192.96 236.88 l
192.24 236.64 l
190.08 243.84 m
193.68 243.84 l
190.08 243.6 m
191.76 243.6 l
193.68 243.84 l
198.48 243.84 m
197.28 243.6 l
196.56 242.4 l
196.32 240.72 l
196.32 239.76 l
196.56 237.84 l
197.28 236.88 l
198.48 236.64 l
199.2 236.64 l
200.16 236.88 l
200.88 237.84 l
201.12 239.76 l
201.12 240.72 l
200.88 242.4 l
200.16 243.6 l
199.2 243.84 l
198.48 243.84 l
197.76 243.6 l
197.28 243.12 l
197.04 242.4 l
196.56 240.72 l
196.56 239.76 l
197.04 237.84 l
197.28 237.36 l
197.76 236.88 l
198.48 236.64 l
199.2 236.64 m
199.68 236.88 l
200.16 237.36 l
200.4 237.84 l
200.88 239.76 l
200.88 240.72 l
200.4 242.4 l
200.16 243.12 l
199.68 243.6 l
199.2 243.84 l
234.96 243.84 m
234.48 240.48 l
234.96 240.96 l
236.16 241.44 l
237.12 241.44 l
238.08 240.96 l
238.8 240.48 l
239.28 239.28 l
239.28 238.56 l
238.8 237.6 l
238.08 236.88 l
237.12 236.64 l
236.16 236.64 l
234.96 236.88 l
234.48 237.84 l
234.48 238.32 l
234.72 238.56 l
234.96 238.32 l
234.72 237.84 l
237.12 241.44 m
238.56 240.48 l
238.8 239.28 l
238.8 238.56 l
238.56 237.6 l
237.84 236.88 l
237.12 236.64 l
234.96 243.84 m
238.56 243.84 l
234.96 243.6 m
236.88 243.6 l
238.56 243.84 l
243.36 243.84 m
242.4 243.6 l
241.68 242.4 l
241.2 240.72 l
241.2 239.76 l
241.68 237.84 l
242.4 236.88 l
243.36 236.64 l
244.08 236.64 l
245.04 236.88 l
245.76 237.84 l
246.24 239.76 l
246.24 240.72 l
245.76 242.4 l
245.04 243.6 l
244.08 243.84 l
243.36 243.84 l
242.64 243.6 l
242.4 243.12 l
241.92 242.4 l
241.68 240.72 l
241.68 239.76 l
241.92 237.84 l
242.4 237.36 l
242.64 236.88 l
243.36 236.64 l
S
244.08 236.64 m
244.8 236.88 l
245.04 237.36 l
245.52 237.84 l
245.76 239.76 l
245.76 240.72 l
245.52 242.4 l
245.04 243.12 l
244.8 243.6 l
244.08 243.84 l
250.32 243.84 m
249.36 243.6 l
248.64 242.4 l
248.16 240.72 l
248.16 239.76 l
248.64 237.84 l
249.36 236.88 l
250.32 236.64 l
251.04 236.64 l
252 236.88 l
252.72 237.84 l
253.2 239.76 l
253.2 240.72 l
252.72 242.4 l
252 243.6 l
251.04 243.84 l
250.32 243.84 l
249.6 243.6 l
249.36 243.12 l
248.88 242.4 l
248.64 240.72 l
248.64 239.76 l
248.88 237.84 l
249.36 237.36 l
249.6 236.88 l
250.32 236.64 l
251.04 236.64 m
251.76 236.88 l
252 237.36 l
252.48 237.84 l
252.72 239.76 l
252.72 240.72 l
252.48 242.4 l
252 243.12 l
251.76 243.6 l
251.04 243.84 l
286.32 243.84 m
286.32 241.68 l
286.32 242.4 m
286.56 243.12 l
287.28 243.84 l
288 243.84 l
289.68 242.88 l
290.4 242.88 l
290.88 243.12 l
291.12 243.84 l
286.56 243.12 m
287.28 243.6 l
288 243.6 l
289.68 242.88 l
291.12 243.84 m
291.12 242.88 l
290.88 241.68 l
289.44 240 l
288.96 239.28 l
288.72 238.32 l
288.72 236.64 l
290.88 241.68 m
288.96 240 l
288.72 239.28 l
288.24 238.32 l
288.24 236.64 l
294 243.84 m
293.28 240.48 l
294 240.96 l
294.96 241.44 l
295.92 241.44 l
297.12 240.96 l
297.6 240.48 l
298.08 239.28 l
298.08 238.56 l
297.6 237.6 l
297.12 236.88 l
295.92 236.64 l
294.96 236.64 l
294 236.88 l
293.52 237.36 l
293.28 237.84 l
293.28 238.32 l
293.52 238.56 l
294 238.32 l
293.52 237.84 l
295.92 241.44 m
297.36 240.48 l
297.6 239.28 l
297.6 238.56 l
297.36 237.6 l
296.64 236.88 l
295.92 236.64 l
294 243.84 m
297.36 243.84 l
294 243.6 m
295.68 243.6 l
297.36 243.84 l
302.16 243.84 m
301.2 243.6 l
300.48 242.4 l
300.24 240.72 l
300.24 239.76 l
300.48 237.84 l
301.2 236.88 l
302.16 236.64 l
302.88 236.64 l
303.84 236.88 l
304.56 237.84 l
305.04 239.76 l
305.04 240.72 l
304.56 242.4 l
303.84 243.6 l
302.88 243.84 l
302.16 243.84 l
301.44 243.6 l
301.2 243.12 l
300.72 242.4 l
300.48 240.72 l
300.48 239.76 l
300.72 237.84 l
301.2 237.36 l
301.44 236.88 l
302.16 236.64 l
S
302.88 236.64 m
303.6 236.88 l
303.84 237.36 l
304.32 237.84 l
304.56 239.76 l
304.56 240.72 l
304.32 242.4 l
303.84 243.12 l
303.6 243.6 l
302.88 243.84 l
335.76 242.4 m
336.48 242.88 l
337.44 243.84 l
337.44 236.64 l
337.2 243.6 m
337.2 236.64 l
335.76 236.64 m
338.88 236.64 l
343.68 243.84 m
342.72 243.6 l
342 242.4 l
341.76 240.72 l
341.76 239.76 l
342 237.84 l
342.72 236.88 l
343.68 236.64 l
344.4 236.64 l
345.36 236.88 l
346.08 237.84 l
346.56 239.76 l
346.56 240.72 l
346.08 242.4 l
345.36 243.6 l
344.4 243.84 l
343.68 243.84 l
342.96 243.6 l
342.72 243.12 l
342.24 242.4 l
342 240.72 l
342 239.76 l
342.24 237.84 l
342.72 237.36 l
342.96 236.88 l
343.68 236.64 l
344.4 236.64 m
345.12 236.88 l
345.36 237.36 l
345.84 237.84 l
346.08 239.76 l
346.08 240.72 l
345.84 242.4 l
345.36 243.12 l
345.12 243.6 l
344.4 243.84 l
350.64 243.84 m
349.68 243.6 l
348.96 242.4 l
348.48 240.72 l
348.48 239.76 l
348.96 237.84 l
349.68 236.88 l
350.64 236.64 l
351.36 236.64 l
352.32 236.88 l
353.04 237.84 l
353.52 239.76 l
353.52 240.72 l
353.04 242.4 l
352.32 243.6 l
351.36 243.84 l
350.64 243.84 l
349.92 243.6 l
349.68 243.12 l
349.2 242.4 l
348.96 240.72 l
348.96 239.76 l
349.2 237.84 l
349.68 237.36 l
349.92 236.88 l
350.64 236.64 l
351.36 236.64 m
352.08 236.88 l
352.32 237.36 l
352.8 237.84 l
353.04 239.76 l
353.04 240.72 l
352.8 242.4 l
352.32 243.12 l
352.08 243.6 l
351.36 243.84 l
357.6 243.84 m
356.64 243.6 l
355.92 242.4 l
355.44 240.72 l
355.44 239.76 l
355.92 237.84 l
356.64 236.88 l
357.6 236.64 l
358.32 236.64 l
359.28 236.88 l
360 237.84 l
360.24 239.76 l
360.24 240.72 l
360 242.4 l
359.28 243.6 l
358.32 243.84 l
357.6 243.84 l
356.88 243.6 l
356.64 243.12 l
356.16 242.4 l
355.92 240.72 l
355.92 239.76 l
356.16 237.84 l
356.64 237.36 l
356.88 236.88 l
357.6 236.64 l
358.32 236.64 m
359.04 236.88 l
359.28 237.36 l
359.76 237.84 l
360 239.76 l
360 240.72 l
359.76 242.4 l
359.28 243.12 l
359.04 243.6 l
358.32 243.84 l
387.6 242.4 m
388.32 242.88 l
389.28 243.84 l
389.28 236.64 l
S
389.04 243.6 m
389.04 236.64 l
387.6 236.64 m
390.72 236.64 l
393.84 242.4 m
394.32 242.16 l
393.84 241.68 l
393.6 242.16 l
393.6 242.4 l
393.84 243.12 l
394.32 243.6 l
395.28 243.84 l
396.72 243.84 l
397.68 243.6 l
398.16 243.12 l
398.4 242.4 l
398.4 241.68 l
398.16 240.96 l
396.96 240.48 l
395.28 239.76 l
394.56 239.28 l
393.84 238.56 l
393.6 237.6 l
393.6 236.64 l
396.72 243.84 m
397.44 243.6 l
397.68 243.12 l
398.16 242.4 l
398.16 241.68 l
397.68 240.96 l
395.28 239.76 l
393.6 237.36 m
393.84 237.6 l
394.56 237.6 l
396.24 236.88 l
397.44 236.88 l
398.16 237.36 l
398.4 237.6 l
394.56 237.6 m
396.24 236.64 l
397.68 236.64 l
398.16 236.88 l
398.4 237.6 l
398.4 238.32 l
401.28 243.84 m
400.56 240.48 l
401.28 240.96 l
402.24 241.44 l
403.2 241.44 l
404.4 240.96 l
404.88 240.48 l
405.36 239.28 l
405.36 238.56 l
404.88 237.6 l
404.4 236.88 l
403.2 236.64 l
402.24 236.64 l
401.28 236.88 l
400.8 237.36 l
400.56 237.84 l
400.56 238.32 l
400.8 238.56 l
401.28 238.32 l
400.8 237.84 l
403.2 241.44 m
404.64 240.48 l
404.88 239.28 l
404.88 238.56 l
404.64 237.6 l
403.92 236.88 l
403.2 236.64 l
401.28 243.84 m
404.64 243.84 l
401.28 243.6 m
402.96 243.6 l
404.64 243.84 l
409.44 243.84 m
408.48 243.6 l
407.76 242.4 l
407.52 240.72 l
407.52 239.76 l
407.76 237.84 l
408.48 236.88 l
409.44 236.64 l
410.16 236.64 l
411.12 236.88 l
411.84 237.84 l
412.32 239.76 l
412.32 240.72 l
411.84 242.4 l
411.12 243.6 l
410.16 243.84 l
409.44 243.84 l
408.72 243.6 l
408.48 243.12 l
408 242.4 l
407.76 240.72 l
407.76 239.76 l
408 237.84 l
408.48 237.36 l
408.72 236.88 l
409.44 236.64 l
410.16 236.64 m
410.88 236.88 l
411.12 237.36 l
411.6 237.84 l
411.84 239.76 l
411.84 240.72 l
411.6 242.4 l
411.12 243.12 l
410.88 243.6 l
410.16 243.84 l
439.44 242.4 m
440.16 242.88 l
441.36 243.84 l
441.36 236.64 l
440.88 243.6 m
440.88 236.64 l
439.44 236.64 m
442.56 236.64 l
446.16 243.84 m
445.44 240.48 l
446.16 240.96 l
447.12 241.44 l
448.32 241.44 l
449.28 240.96 l
450 240.48 l
450.24 239.28 l
450.24 238.56 l
450 237.6 l
449.28 236.88 l
448.32 236.64 l
447.12 236.64 l
446.16 236.88 l
445.68 237.36 l
445.44 237.84 l
445.44 238.32 l
445.68 238.56 l
446.16 238.32 l
445.68 237.84 l
S
448.32 241.44 m
448.8 240.96 l
449.52 240.48 l
450 239.28 l
450 238.56 l
449.52 237.6 l
448.8 236.88 l
448.32 236.64 l
446.16 243.84 m
449.52 243.84 l
446.16 243.6 m
447.84 243.6 l
449.52 243.84 l
454.56 243.84 m
453.36 243.6 l
452.64 242.4 l
452.4 240.72 l
452.4 239.76 l
452.64 237.84 l
453.36 236.88 l
454.56 236.64 l
455.04 236.64 l
456.24 236.88 l
456.96 237.84 l
457.2 239.76 l
457.2 240.72 l
456.96 242.4 l
456.24 243.6 l
455.04 243.84 l
454.56 243.84 l
453.84 243.6 l
453.36 243.12 l
453.12 242.4 l
452.64 240.72 l
452.64 239.76 l
453.12 237.84 l
453.36 237.36 l
453.84 236.88 l
454.56 236.64 l
455.04 236.64 m
455.76 236.88 l
456.24 237.36 l
456.48 237.84 l
456.96 239.76 l
456.96 240.72 l
456.48 242.4 l
456.24 243.12 l
455.76 243.6 l
455.04 243.84 l
461.28 243.84 m
460.32 243.6 l
459.6 242.4 l
459.36 240.72 l
459.36 239.76 l
459.6 237.84 l
460.32 236.88 l
461.28 236.64 l
462 236.64 l
463.2 236.88 l
463.92 237.84 l
464.16 239.76 l
464.16 240.72 l
463.92 242.4 l
463.2 243.6 l
462 243.84 l
461.28 243.84 l
460.8 243.6 l
460.32 243.12 l
460.08 242.4 l
459.6 240.72 l
459.6 239.76 l
460.08 237.84 l
460.32 237.36 l
460.8 236.88 l
461.28 236.64 l
462 236.64 m
462.72 236.88 l
463.2 237.36 l
463.44 237.84 l
463.92 239.76 l
463.92 240.72 l
463.44 242.4 l
463.2 243.12 l
462.72 243.6 l
462 243.84 l
139.92 342 m
139.92 354.48 l
150.24 354.48 m
150.24 350.4 l
160.56 350.4 m
160.56 354.48 l
171.12 354.48 m
171.12 350.4 l
181.44 350.4 m
181.44 354.48 l
191.76 354.48 m
191.76 342 l
202.08 350.4 m
202.08 354.48 l
212.64 354.48 m
212.64 350.4 l
222.96 350.4 m
222.96 354.48 l
233.28 354.48 m
233.28 350.4 l
243.6 342 m
243.6 354.48 l
254.16 354.48 m
254.16 350.4 l
264.48 350.4 m
264.48 354.48 l
274.8 354.48 m
274.8 350.4 l
285.36 350.4 m
285.36 354.48 l
295.68 354.48 m
295.68 342 l
306 350.4 m
306 354.48 l
316.32 354.48 m
316.32 350.4 l
326.64 350.4 m
326.64 354.48 l
337.2 354.48 m
337.2 350.4 l
347.52 342 m
347.52 354.48 l
357.84 354.48 m
357.84 350.4 l
S
368.16 350.4 m
368.16 354.48 l
378.72 354.48 m
378.72 350.4 l
389.04 350.4 m
389.04 354.48 l
399.36 354.48 m
399.36 342 l
409.92 350.4 m
409.92 354.48 l
420.24 354.48 m
420.24 350.4 l
430.56 350.4 m
430.56 354.48 l
440.88 354.48 m
440.88 350.4 l
451.44 342 m
451.44 354.48 l
139.92 250.56 m
152.4 250.56 l
144 254.16 m
139.92 254.16 l
139.92 257.52 m
144 257.52 l
144 261.12 m
139.92 261.12 l
139.92 264.48 m
144 264.48 l
152.4 268.08 m
139.92 268.08 l
139.92 271.44 m
144 271.44 l
144 274.8 m
139.92 274.8 l
139.92 278.4 m
144 278.4 l
144 281.76 m
139.92 281.76 l
139.92 285.36 m
152.4 285.36 l
144 288.72 m
139.92 288.72 l
139.92 292.08 m
144 292.08 l
144 295.68 m
139.92 295.68 l
139.92 299.04 m
144 299.04 l
152.4 302.64 m
139.92 302.64 l
139.92 306 m
144 306 l
144 309.6 m
139.92 309.6 l
139.92 312.96 m
144 312.96 l
144 316.32 m
139.92 316.32 l
139.92 319.92 m
152.4 319.92 l
144 323.28 m
139.92 323.28 l
139.92 326.88 m
144 326.88 l
144 330.24 m
139.92 330.24 l
139.92 333.6 m
144 333.6 l
152.4 337.2 m
139.92 337.2 l
139.92 340.56 m
144 340.56 l
144 344.16 m
139.92 344.16 l
139.92 347.52 m
144 347.52 l
144 351.12 m
139.92 351.12 l
139.92 354.48 m
152.4 354.48 l
121.2 249.6 m
127.44 249.6 l
131.04 252.48 m
131.52 252.72 l
132.72 253.68 l
132.72 246.48 l
132.24 253.44 m
132.24 246.48 l
131.04 246.48 m
134.16 246.48 l
132 271.2 m
131.04 270.72 l
130.32 269.76 l
129.84 268.08 l
129.84 266.88 l
130.32 265.2 l
131.04 264.24 l
132 263.76 l
132.72 263.76 l
133.68 264.24 l
134.4 265.2 l
134.64 266.88 l
134.64 268.08 l
134.4 269.76 l
133.68 270.72 l
132.72 271.2 l
132 271.2 l
131.28 270.72 l
131.04 270.48 l
130.56 269.76 l
130.32 268.08 l
130.32 266.88 l
130.56 265.2 l
131.04 264.48 l
131.28 264.24 l
132 263.76 l
132.72 263.76 m
133.44 264.24 l
133.68 264.48 l
134.16 265.2 l
134.4 266.88 l
134.4 268.08 l
134.16 269.76 l
133.68 270.48 l
133.44 270.72 l
132.72 271.2 l
131.04 287.04 m
131.52 287.28 l
132.72 288.48 l
132.72 281.04 l
S
132.24 288 m
132.24 281.04 l
131.04 281.04 m
134.16 281.04 l
130.32 304.32 m
130.56 304.08 l
130.32 303.6 l
129.84 304.08 l
129.84 304.32 l
130.32 305.04 l
130.56 305.28 l
131.52 305.76 l
132.96 305.76 l
134.16 305.28 l
134.4 305.04 l
134.64 304.32 l
134.64 303.6 l
134.4 302.88 l
133.44 302.16 l
131.52 301.44 l
131.04 301.2 l
130.32 300.48 l
129.84 299.52 l
129.84 298.32 l
132.96 305.76 m
133.68 305.28 l
134.16 305.04 l
134.4 304.32 l
134.4 303.6 l
134.16 302.88 l
132.96 302.16 l
131.52 301.44 l
129.84 299.04 m
130.32 299.52 l
131.04 299.52 l
132.72 298.8 l
133.68 298.8 l
134.4 299.04 l
134.64 299.52 l
131.04 299.52 m
132.72 298.32 l
134.16 298.32 l
134.4 298.8 l
134.64 299.52 l
134.64 300.24 l
130.32 321.6 m
130.56 321.36 l
130.32 320.88 l
129.84 321.36 l
129.84 321.6 l
130.32 322.32 l
130.56 322.56 l
131.52 323.04 l
132.96 323.04 l
134.16 322.56 l
134.4 321.84 l
134.4 320.88 l
134.16 320.16 l
132.96 319.92 l
132 319.92 l
132.96 323.04 m
133.68 322.56 l
134.16 321.84 l
134.16 320.88 l
133.68 320.16 l
132.96 319.92 l
134.4 318.96 l
134.64 318.24 l
134.64 317.04 l
134.4 316.32 l
134.16 316.08 l
132.96 315.84 l
131.52 315.84 l
130.56 316.08 l
130.32 316.32 l
129.84 317.04 l
129.84 317.52 l
130.32 317.76 l
130.56 317.52 l
130.32 317.04 l
134.16 319.2 m
134.4 318.24 l
134.4 317.04 l
134.16 316.32 l
133.68 316.08 l
132.96 315.84 l
132.96 339.6 m
132.96 333.12 l
133.44 340.32 m
133.44 333.12 l
133.44 340.32 m
129.6 335.04 l
135.12 335.04 l
132 333.12 m
134.4 333.12 l
130.56 357.6 m
129.84 354.24 l
130.56 354.72 l
131.52 355.2 l
132.72 355.2 l
133.68 354.72 l
134.4 354.24 l
134.64 353.04 l
134.64 352.32 l
134.4 351.36 l
133.68 350.64 l
132.72 350.4 l
131.52 350.4 l
130.56 350.64 l
130.32 351.12 l
129.84 351.6 l
129.84 352.08 l
130.32 352.32 l
130.56 352.08 l
130.32 351.6 l
132.72 355.2 m
134.16 354.24 l
134.4 353.04 l
134.4 352.32 l
134.16 351.36 l
133.44 350.64 l
132.72 350.4 l
130.56 357.6 m
134.16 357.6 l
130.56 357.36 m
132.24 357.36 l
134.16 357.6 l
S
438.96 250.56 m
451.44 250.56 l
451.44 254.16 m
447.12 254.16 l
447.12 257.52 m
451.44 257.52 l
451.44 261.12 m
447.12 261.12 l
447.12 264.48 m
451.44 264.48 l
451.44 268.08 m
438.96 268.08 l
447.12 271.44 m
451.44 271.44 l
451.44 274.8 m
447.12 274.8 l
447.12 278.4 m
451.44 278.4 l
451.44 281.76 m
447.12 281.76 l
438.96 285.36 m
451.44 285.36 l
451.44 288.72 m
447.12 288.72 l
447.12 292.08 m
451.44 292.08 l
451.44 295.68 m
447.12 295.68 l
447.12 299.04 m
451.44 299.04 l
451.44 302.64 m
438.96 302.64 l
447.12 306 m
451.44 306 l
451.44 309.6 m
447.12 309.6 l
447.12 312.96 m
451.44 312.96 l
451.44 316.32 m
447.12 316.32 l
438.96 319.92 m
451.44 319.92 l
451.44 323.28 m
447.12 323.28 l
447.12 326.88 m
451.44 326.88 l
451.44 330.24 m
447.12 330.24 l
447.12 333.6 m
451.44 333.6 l
451.44 337.2 m
438.96 337.2 l
447.12 340.56 m
451.44 340.56 l
451.44 344.16 m
447.12 344.16 l
447.12 347.52 m
451.44 347.52 l
451.44 351.12 m
447.12 351.12 l
438.96 354.48 m
451.44 354.48 l
139.92 268.08 m
139.92 285.6 l
144 285.6 l
144 285.36 l
198 285.36 l
198 285.6 l
206.4 285.6 l
206.4 285.84 l
210.48 285.84 l
210.48 286.32 l
214.56 286.32 l
214.56 287.04 l
218.88 287.04 l
218.88 287.28 l
222.96 287.28 l
222.96 287.52 l
227.04 287.52 l
227.04 288 l
235.44 288 l
235.44 288.24 l
239.52 288.24 l
239.52 288.48 l
243.6 288.48 l
243.6 288.96 l
247.92 288.96 l
247.92 288.72 l
256.08 288.72 l
256.08 288.96 l
264.48 288.96 l
264.48 289.68 l
268.56 289.68 l
268.56 289.44 l
272.88 289.44 l
272.88 289.2 l
276.96 289.2 l
276.96 290.16 l
281.04 290.16 l
281.04 289.68 l
285.12 289.68 l
285.12 288.72 l
289.44 288.72 l
289.44 288.24 l
293.52 288.24 l
293.52 286.56 l
297.6 286.56 l
297.6 284.88 l
301.92 284.88 l
301.92 284.16 l
306 284.16 l
306 283.44 l
310.08 283.44 l
310.08 281.76 l
314.4 281.76 l
314.4 281.52 l
318.48 281.52 l
318.48 281.28 l
322.56 281.28 l
322.56 281.04 l
326.64 281.04 l
326.64 282.72 l
330.96 282.72 l
330.96 281.28 l
335.04 281.28 l
335.04 280.8 l
339.12 280.8 l
339.12 281.28 l
343.44 281.28 l
343.44 284.64 l
347.52 284.64 l
347.52 286.8 l
351.6 286.8 l
351.6 285.12 l
355.92 285.12 l
355.92 287.52 l
360 287.52 l
360 288.72 l
364.08 288.72 l
364.08 287.76 l
368.16 287.76 l
368.16 288.72 l
372.48 288.72 l
372.48 289.92 l
376.56 289.92 l
376.56 290.64 l
380.64 290.64 l
380.64 291.12 l
384.96 291.12 l
384.96 291.84 l
389.04 291.84 l
389.04 294.72 l
393.12 294.72 l
393.12 291.12 l
397.44 291.12 l
397.44 294.96 l
401.52 294.96 l
401.52 296.88 l
405.6 296.88 l
405.6 301.68 l
409.92 301.68 l
409.92 298.32 l
418.08 298.32 l
418.08 304.32 l
422.16 304.32 l
422.16 306.72 l
426.48 306.72 l
426.48 294.24 l
430.56 294.24 l
430.56 298.8 l
434.64 298.8 l
434.64 296.88 l
438.96 296.88 l
438.96 306.24 l
443.04 306.24 l
443.04 298.8 l
447.12 298.8 l
447.12 288 l
451.2 288 l
451.2 250.56 l
S
451.44 268.08 m
451.44 268.08 l
S
[1 0 1] SC
139.92 268.08 m
139.92 268.08 l
S
[9.36] 0 d
139.92 285.36 m
451.44 285.36 l
S
[] 0 d
451.44 268.08 m
451.44 268.08 l
S
Q
Q
showpage
%%PageTrailer
pdfEndPage
%%Trailer
end
%%DocumentSuppliedResources:
%%EOF
