%!PS-Adobe-2.0 EPSF-2.0
%%BoundingBox:  0 0 567 364
%%Title: eps/h_trans_mass_sr2_df_1j.eps: h_trans_mass_sr2_df_1j
%%Creator: ROOT Version 5.32/03
%%CreationDate: Wed Mar  6 16:50:20 2013
%%EndComments
%%BeginProlog
80 dict begin
/s {stroke} def /l {lineto} def /m {moveto} def /t {translate} def
/r {rotate} def /rl {roll}  def /R {repeat} def
/d {rlineto} def /rm {rmoveto} def /gr {grestore} def /f {eofill} def
/c {setrgbcolor} def /black {0 setgray} def /sd {setdash} def
/cl {closepath} def /sf {scalefont setfont} def /lw {setlinewidth} def
/box {m dup 0 exch d exch 0 d 0 exch neg d cl} def
/NC{systemdict begin initclip end}def/C{NC box clip newpath}def
/bl {box s} def /bf {box f} def /Y { 0 exch d} def /X { 0 d} def 
/K {{pop pop 0 moveto} exch kshow} bind def
/ita {/ang 15 def gsave [1 0 ang dup sin exch cos div 1 0 0] concat} def 
/mp {newpath /y exch def /x exch def} def
/side {[w .77 mul w .23 mul] .385 w mul sd w 0 l currentpoint t -144 r} def
/mr {mp x y w2 0 360 arc} def /m24 {mr s} def /m20 {mr f} def
/mb {mp x y w2 add m w2 neg 0 d 0 w neg d w 0 d 0 w d cl} def
/mt {mp x y w2 add m w2 neg w neg d w 0 d cl} def
/m21 {mb f} def /m25 {mb s} def /m22 {mt f} def /m26{mt s} def
/m23 {mp x y w2 sub m w2 w d w neg 0 d cl f} def
/m27 {mp x y w2 add m w3 neg w2 neg d w3 w2 neg d w3 w2 d cl s} def
/m28 {mp x w2 sub y w2 sub w3 add m w3 0 d  0 w3 neg d w3 0 d 0 w3 d w3 0 d  0 w3 d w3 neg 0 d 0 w3 d w3 neg 0 d 0 w3 neg d w3 neg 0 d cl s } def
/m29 {mp gsave x w2 sub y w2 add w3 sub m currentpoint t 4 {side} repeat cl fill gr} def
/m30 {mp gsave x w2 sub y w2 add w3 sub m currentpoint t 4 {side} repeat cl s gr} def
/m31 {mp x y w2 sub m 0 w d x w2 sub y m w 0 d x w2 sub y w2 add m w w neg d x w2 sub y w2 sub m w w d s} def
/m32 {mp x y w2 sub m w2 w d w neg 0 d cl s} def
/m33 {mp x y w2 add m w3 neg w2 neg d w3 w2 neg d w3 w2 d cl f} def
/m34 {mp x w2 sub y w2 sub w3 add m w3 0 d  0 w3 neg d w3 0 d 0 w3 d w3 0 d  0 w3 d w3 neg 0 d 0 w3 d w3 neg 0 d 0 w3 neg d w3 neg 0 d cl f } def
/m2 {mp x y w2 sub m 0 w d x w2 sub y m w 0 d s} def
/m5 {mp x w2 sub y w2 sub m w w d x w2 sub y w2 add m w w neg d s} def
/reEncode {exch findfont dup length dict begin {1 index /FID eq  {pop pop} {def} ifelse } forall /Encoding exch def currentdict end dup /FontName get exch definefont pop } def [/Times-Bold /Times-Italic /Times-BoldItalic /Helvetica /Helvetica-Oblique
 /Helvetica-Bold /Helvetica-BoldOblique /Courier /Courier-Oblique /Courier-Bold /Courier-BoldOblique /Times-Roman /AvantGarde-Book /AvantGarde-BookOblique /AvantGarde-Demi /AvantGarde-DemiOblique /Bookman-Demi /Bookman-DemiItalic /Bookman-Light
 /Bookman-LightItalic /Helvetica-Narrow /Helvetica-Narrow-Bold /Helvetica-Narrow-BoldOblique /Helvetica-Narrow-Oblique /NewCenturySchlbk-Roman /NewCenturySchlbk-Bold /NewCenturySchlbk-BoldItalic /NewCenturySchlbk-Italic /Palatino-Bold
 /Palatino-BoldItalic /Palatino-Italic /Palatino-Roman ] {ISOLatin1Encoding reEncode } forall%%EndProlog
%%BeginSetup
%%EndSetup
newpath  gsave  .25 .25 scale  gsave  0 0 t black[  ] 0 sd 3 lw 1 1 1 c 2268 1455 0 0 bf black 1 1 1 c 1882 771 272 611 bf black 1882 771 272 611 bl 1 1 1 c 1882 625 272 757 bf black 1882 625 272 757 bl 0.8 0 0 c 6 lw 1 1 1 c 0.8 0 0 c 272 864 m 59 X
 s 358 864 m 59 X s 3 lw /w 31 def /w2 {w 2 div} def /w3 {w 3 div} def 345 864 m24 6 lw 417 924 m 59 X s 502 924 m 60 X s 3 lw 489 924 m24 6 lw 562 996 m 59 X s 647 996 m 59 X s 3 lw 634 996 m24 6 lw 706 1055 m 60 X s 792 1055 m 59 X s 3 lw 779 1055
 m24 6 lw 851 1087 m 60 X s 937 1087 m 59 X s 3 lw 924 1087 m24 6 lw 996 1111 m 59 X s 1082 1111 m 59 X s 3 lw 1068 1111 m24 6 lw 1141 1108 m 59 X s 1226 1108 m 60 X s 3 lw 1213 1108 m24 6 lw 1286 1078 m 59 X s 1371 1078 m 59 X s 3 lw 1358 1078 m24 6
 lw 1430 1029 m 60 X s 1516 1029 m 59 X s 3 lw 1503 1029 m24 6 lw 1575 951 m 59 X s 1661 951 m 59 X s 3 lw 1648 951 m24 6 lw 1720 869 m 59 X s 1805 869 m 60 X s 3 lw 1792 869 m24 6 lw 1865 816 m 59 X s 1950 816 m 60 X s 3 lw 1937 816 m24 6 lw 2010
 791 m 59 X s 2095 791 m 59 X s 3 lw 2082 791 m24 6 lw black 3 lw 272 757 m 1882 X s
 gsave  2268 1455 0 0 C 1959.67 625.916 t 0 r /Helvetica findfont 68.818 sf 0 0 m ( [GeV]) show NC gr 
 gsave  2268 1455 0 0 C 1930.18 602.977 t 0 r /Helvetica findfont 45.8787 sf 0 0 m (T) show NC gr 
 gsave  2268 1455 0 0 C 1874.47 625.916 t 0 r /Helvetica findfont 68.818 sf 0 0 m (m) show NC gr  417 793 m -36 Y s 489 775 m -18 Y s 562 775 m -18 Y s 634 775 m -18 Y s 706 793 m -36 Y s 779 775 m -18 Y s 851 775 m -18 Y s 924 775 m -18 Y s 996 793
 m -36 Y s 1068 775 m -18 Y s 1141 775 m -18 Y s 1213 775 m -18 Y s 1286 793 m -36 Y s 1358 775 m -18 Y s 1430 775 m -18 Y s 1503 775 m -18 Y s 1575 793 m -36 Y s 1648 775 m -18 Y s 1720 775 m -18 Y s 1792 775 m -18 Y s 1865 793 m -36 Y s 1937 775 m
 -18 Y s 2010 775 m -18 Y s 2082 775 m -18 Y s 2154 793 m -36 Y s 417 793 m -36 Y s 345 775 m -18 Y s 272 775 m -18 Y s 272 1382 m 1882 X s 417 1346 m 36 Y s 489 1364 m 18 Y s 562 1364 m 18 Y s 634 1364 m 18 Y s 706 1346 m 36 Y s 779 1364 m 18 Y s
 851 1364 m 18 Y s 924 1364 m 18 Y s 996 1346 m 36 Y s 1068 1364 m 18 Y s 1141 1364 m 18 Y s 1213 1364 m 18 Y s 1286 1346 m 36 Y s 1358 1364 m 18 Y s 1430 1364 m 18 Y s 1503 1364 m 18 Y s 1575 1346 m 36 Y s 1648 1364 m 18 Y s 1720 1364 m 18 Y s 1792
 1364 m 18 Y s 1865 1346 m 36 Y s 1937 1364 m 18 Y s 2010 1364 m 18 Y s 2082 1364 m 18 Y s 2154 1346 m 36 Y s 417 1346 m 36 Y s 345 1364 m 18 Y s 272 1364 m 18 Y s 272 757 m 625 Y s
 gsave  2268 1455 0 0 C 108.143 717.673 t 90 r /Helvetica findfont 68.818 sf 0 0 m (Normalised to integral) show NC gr  301 757 m -29 X s 287 771 m -15 X s 287 785 m -15 X s 287 799 m -15 X s 301 813 m -29 X s 287 828 m -15 X s 287 842 m -15 X s 287
 856 m -15 X s 301 870 m -29 X s 287 885 m -15 X s 287 899 m -15 X s 287 913 m -15 X s 301 927 m -29 X s 287 941 m -15 X s 287 956 m -15 X s 287 970 m -15 X s 301 984 m -29 X s 287 998 m -15 X s 287 1013 m -15 X s 287 1027 m -15 X s 301 1041 m -29 X
 s 287 1055 m -15 X s 287 1069 m -15 X s 287 1084 m -15 X s 301 1098 m -29 X s 287 1112 m -15 X s 287 1126 m -15 X s 287 1141 m -15 X s 301 1155 m -29 X s 287 1169 m -15 X s 287 1183 m -15 X s 287 1197 m -15 X s 301 1212 m -29 X s 287 1226 m -15 X s
 287 1240 m -15 X s 287 1254 m -15 X s 301 1269 m -29 X s 287 1283 m -15 X s 287 1297 m -15 X s 287 1311 m -15 X s 301 1325 m -29 X s 287 1340 m -15 X s 287 1354 m -15 X s 287 1368 m -15 X s 301 1382 m -29 X s
 gsave  2268 1455 0 0 C 2222.23 880.27 t 90 r /Helvetica-BoldOblique findfont 41.8538 sf 0 0 m (LHC HIGGS XS WG 2013) show NC gr  0.2 0.2 0.2 c black 0.2 0.2 0.2 c
 gsave  2268 1455 0 0 C 222.839 730.781 t 0 r /Helvetica findfont 68.818 sf 0 0 m (0) show NC gr 
 gsave  2268 1455 0 0 C 127.805 789.768 t 0 r /Helvetica findfont 68.818 sf 0 0 m (0.02) show NC gr 
 gsave  2268 1455 0 0 C 127.805 845.478 t 0 r /Helvetica findfont 68.818 sf 0 0 m (0.04) show NC gr 
 gsave  2268 1455 0 0 C 127.805 901.188 t 0 r /Helvetica findfont 68.818 sf 0 0 m (0.06) show NC gr 
 gsave  2268 1455 0 0 C 127.805 960.175 t 0 r /Helvetica findfont 68.818 sf 0 0 m (0.08) show NC gr 
 gsave  2268 1455 0 0 C 173.683 1015.88 t 0 r /Helvetica findfont 68.818 sf 0 0 m (0.1) show NC gr 
 gsave  2268 1455 0 0 C 127.805 1074.87 t 0 r /Helvetica findfont 68.818 sf 0 0 m (0.12) show NC gr 
 gsave  2268 1455 0 0 C 127.805 1130.58 t 0 r /Helvetica findfont 68.818 sf 0 0 m (0.14) show NC gr 
 gsave  2268 1455 0 0 C 127.805 1186.29 t 0 r /Helvetica findfont 68.818 sf 0 0 m (0.16) show NC gr 
 gsave  2268 1455 0 0 C 127.805 1245.28 t 0 r /Helvetica findfont 68.818 sf 0 0 m (0.18) show NC gr 
 gsave  2268 1455 0 0 C 163.852 1300.99 t 0 r /Helvetica findfont 68.818 sf 0 0 m (0.2) show NC gr 
 gsave  2268 1455 0 0 C 127.805 1356.7 t 0 r /Helvetica findfont 68.818 sf 0 0 m (0.22) show NC gr  2154 757 m 625 Y s 2125 757 m 29 X s 2140 771 m 14 X s 2140 785 m 14 X s 2140 799 m 14 X s 2125 813 m 29 X s 2140 828 m 14 X s 2140 842 m 14 X s 2140
 856 m 14 X s 2125 870 m 29 X s 2140 885 m 14 X s 2140 899 m 14 X s 2140 913 m 14 X s 2125 927 m 29 X s 2140 941 m 14 X s 2140 956 m 14 X s 2140 970 m 14 X s 2125 984 m 29 X s 2140 998 m 14 X s 2140 1013 m 14 X s 2140 1027 m 14 X s 2125 1041 m 29 X s
 2140 1055 m 14 X s 2140 1069 m 14 X s 2140 1084 m 14 X s 2125 1098 m 29 X s 2140 1112 m 14 X s 2140 1126 m 14 X s 2140 1141 m 14 X s 2125 1155 m 29 X s 2140 1169 m 14 X s 2140 1183 m 14 X s 2140 1197 m 14 X s 2125 1212 m 29 X s 2140 1226 m 14 X s
 2140 1240 m 14 X s 2140 1254 m 14 X s 2125 1269 m 29 X s 2140 1283 m 14 X s 2140 1297 m 14 X s 2140 1311 m 14 X s 2125 1325 m 29 X s 2140 1340 m 14 X s 2140 1354 m 14 X s 2140 1368 m 14 X s 2125 1382 m 29 X s 6 lw 1 1 1 c black 272 869 m 59 X s 358
 869 m 59 X s 3 lw 345 869 m20 6 lw 417 929 m 59 X s 502 929 m 60 X s 3 lw 489 929 m20 6 lw 562 1005 m 59 X s 647 1005 m 59 X s 3 lw 634 1005 m20 6 lw 706 1057 m 60 X s 792 1057 m 59 X s 3 lw 779 1057 m20 6 lw 851 1092 m 60 X s 937 1092 m 59 X s 3 lw
 924 1092 m20 6 lw 996 1108 m 59 X s 1082 1108 m 59 X s 3 lw 1068 1108 m20 6 lw 1141 1106 m 59 X s 1226 1106 m 60 X s 3 lw 1213 1106 m20 6 lw 1286 1071 m 59 X s 1371 1071 m 59 X s 3 lw 1358 1071 m20 6 lw 1430 1022 m 60 X s 1516 1022 m 59 X s 3 lw
 1503 1022 m20 6 lw 1575 947 m 59 X s 1661 947 m 59 X s 3 lw 1648 947 m20 6 lw 1720 867 m 59 X s 1805 867 m 60 X s 3 lw 1792 867 m20 6 lw 1865 815 m 59 X s 1950 815 m 60 X s 3 lw 1937 815 m20 6 lw 2010 790 m 59 X s 2095 790 m 59 X s 3 lw 2082 790 m20
 6 lw 0.8 0 0 c 1 1 1 c 0.8 0 0 c 3 lw 345 864 m24 6 lw 3 lw 489 924 m24 6 lw 3 lw 634 996 m24 6 lw 3 lw 779 1055 m24 6 lw 3 lw 924 1087 m24 6 lw 3 lw 1068 1111 m24 6 lw 3 lw 1213 1108 m24 6 lw 3 lw 1358 1078 m24 6 lw 3 lw 1503 1029 m24 6 lw 3 lw
 1648 951 m24 6 lw 3 lw 1792 869 m24 6 lw 3 lw 1937 816 m24 6 lw 3 lw 2082 791 m24 6 lw 1 1 1 c 0.8 0 0 c 272 864 m 145 X 60 Y 145 X 72 Y 144 X 59 Y 145 X 32 Y 145 X 24 Y 145 X -3 Y 145 X -30 Y 144 X -49 Y 145 X -78 Y 145 X -82 Y 145 X -53 Y 145 X
 -25 Y 144 X s 0.2 0.2 0.6 c 1 1 1 c 0.2 0.2 0.6 c 3 lw 345 877 m25 6 lw 3 lw 489 939 m25 6 lw 3 lw 634 1013 m25 6 lw 3 lw 779 1071 m25 6 lw 3 lw 924 1102 m25 6 lw 3 lw 1068 1109 m25 6 lw 3 lw 1213 1096 m25 6 lw 3 lw 1358 1063 m25 6 lw 3 lw 1503 1012
 m25 6 lw 3 lw 1648 936 m25 6 lw 3 lw 1792 865 m25 6 lw 3 lw 1937 808 m25 6 lw 3 lw 2082 788 m25 6 lw 1 1 1 c 0.2 0.2 0.6 c 272 877 m 145 X 62 Y 145 X 74 Y 144 X 58 Y 145 X 31 Y 145 X 7 Y 145 X -13 Y 145 X -33 Y 144 X -51 Y 145 X -76 Y 145 X -71 Y
 145 X -57 Y 145 X -20 Y 144 X s black
 gsave  2268 1455 0 0 C 1727 1320.65 t 0 r /Helvetica-Bold findfont 55.7098 sf 0 0 m (Pow + pythia 8) show NC gr  1609 1337 m 99 X s 3 lw 1658 1337 m20 6 lw
 gsave  2268 1455 0 0 C 1727 1225.62 t 0 r /Helvetica-Bold findfont 55.7098 sf 0 0 m (Pow + her) show NC gr  0.8 0 0 c 1609 1246 m 99 X s 3 lw 1658 1246 m24 6 lw black
 gsave  2268 1455 0 0 C 1727 1140.41 t 0 r /Helvetica-Bold findfont 55.7098 sf 0 0 m (aMC@NLO) show NC gr  0.2 0.2 0.6 c 1609 1155 m 99 X s 3 lw 1658 1155 m25 6 lw black
 gsave  2268 1455 0 0 C 1727 1042.1 t 0 r /Helvetica-Bold findfont 55.7098 sf 0 0 m (MCFM) show NC gr  1 1 1 c 3 lw 1609 1032 m 99 X 64 Y -99 X f 6 lw 0 0.4 0 c 1609 1064 m 99 X s 3 lw 1658 1064 m24 6 lw black 3 lw 1 1 1 c black 1 1 1 c 1882 378 272
 233 bf black 1882 378 272 233 bl 1 1 1 c 1882 524 272 233 bf black 1882 524 272 233 bl 0.8 0 0 c 6 lw 1 1 1 c 0.8 0 0 c 272 456 m 59 X s 358 456 m 59 X s 3 lw 345 456 m24 6 lw 417 473 m 59 X s 502 473 m 60 X s 3 lw 489 473 m24 6 lw 562 469 m 59 X s
 647 469 m 59 X s 3 lw 634 469 m24 6 lw 706 488 m 60 X s 792 488 m 59 X s 3 lw 779 488 m24 6 lw 851 482 m 60 X s 937 482 m 59 X s 3 lw 924 482 m24 6 lw 996 500 m 59 X s 1082 500 m 59 X s 3 lw 1068 500 m24 6 lw 1141 499 m 59 X s 1226 499 m 60 X s 3 lw
 1213 499 m24 6 lw 1286 512 m 59 X s 1371 512 m 59 X s 3 lw 1358 512 m24 6 lw 1430 515 m 60 X s 1516 515 m 59 X s 3 lw 1503 515 m24 6 lw 1575 511 m 59 X s 1661 511 m 59 X s 3 lw 1648 511 m24 6 lw 1720 507 m 59 X s 1805 507 m 60 X s 3 lw 1792 507 m24
 6 lw 1865 510 m 59 X s 1950 510 m 60 X s 3 lw 1937 510 m24 6 lw 2082 509 m 2 Y s 2082 537 m 1 Y s 2010 524 m 59 X s 2095 524 m 59 X s 3 lw 2082 524 m24 6 lw black 3 lw 272 233 m 1882 X s
 gsave  2268 1455 0 0 C 1959.67 101.588 t 0 r /Helvetica findfont 68.818 sf 0 0 m ( [GeV]) show NC gr 
 gsave  2268 1455 0 0 C 1930.18 78.6491 t 0 r /Helvetica findfont 45.8787 sf 0 0 m (T) show NC gr 
 gsave  2268 1455 0 0 C 1874.47 101.588 t 0 r /Helvetica findfont 68.818 sf 0 0 m (m) show NC gr  417 269 m -36 Y s 489 251 m -18 Y s 562 251 m -18 Y s 634 251 m -18 Y s 706 269 m -36 Y s 779 251 m -18 Y s 851 251 m -18 Y s 924 251 m -18 Y s 996 269
 m -36 Y s 1068 251 m -18 Y s 1141 251 m -18 Y s 1213 251 m -18 Y s 1286 269 m -36 Y s 1358 251 m -18 Y s 1430 251 m -18 Y s 1503 251 m -18 Y s 1575 269 m -36 Y s 1648 251 m -18 Y s 1720 251 m -18 Y s 1792 251 m -18 Y s 1865 269 m -36 Y s 1937 251 m
 -18 Y s 2010 251 m -18 Y s 2082 251 m -18 Y s 2154 269 m -36 Y s 417 269 m -36 Y s 345 251 m -18 Y s 272 251 m -18 Y s
 gsave  2268 1455 0 0 C 376.86 170.406 t 0 r /Helvetica findfont 68.818 sf 0 0 m (80) show NC gr 
 gsave  2268 1455 0 0 C 645.578 170.406 t 0 r /Helvetica findfont 68.818 sf 0 0 m (100) show NC gr 
 gsave  2268 1455 0 0 C 933.958 170.406 t 0 r /Helvetica findfont 68.818 sf 0 0 m (120) show NC gr 
 gsave  2268 1455 0 0 C 1225.62 170.406 t 0 r /Helvetica findfont 68.818 sf 0 0 m (140) show NC gr 
 gsave  2268 1455 0 0 C 1514 170.406 t 0 r /Helvetica findfont 68.818 sf 0 0 m (160) show NC gr 
 gsave  2268 1455 0 0 C 1805.65 170.406 t 0 r /Helvetica findfont 68.818 sf 0 0 m (180) show NC gr 
 gsave  2268 1455 0 0 C 2094.03 170.406 t 0 r /Helvetica findfont 68.818 sf 0 0 m (200) show NC gr  272 757 m 1882 X s 417 720 m 37 Y s 489 738 m 19 Y s 562 738 m 19 Y s 634 738 m 19 Y s 706 720 m 37 Y s 779 738 m 19 Y s 851 738 m 19 Y s 924 738 m 19
 Y s 996 720 m 37 Y s 1068 738 m 19 Y s 1141 738 m 19 Y s 1213 738 m 19 Y s 1286 720 m 37 Y s 1358 738 m 19 Y s 1430 738 m 19 Y s 1503 738 m 19 Y s 1575 720 m 37 Y s 1648 738 m 19 Y s 1720 738 m 19 Y s 1792 738 m 19 Y s 1865 720 m 37 Y s 1937 738 m
 19 Y s 2010 738 m 19 Y s 2082 738 m 19 Y s 2154 720 m 37 Y s 417 720 m 37 Y s 345 738 m 19 Y s 272 738 m 19 Y s 272 233 m 524 Y s
 gsave  2268 1455 0 0 C 78.6491 622.639 t 90 r /Helvetica findfont 68.818 sf 0 0 m (ratio) show NC gr  297 270 m -25 X s 284 285 m -12 X s 284 300 m -12 X s 284 315 m -12 X s 284 330 m -12 X s 297 345 m -25 X s 284 360 m -12 X s 284 375 m -12 X s 284
 390 m -12 X s 284 405 m -12 X s 297 420 m -25 X s 284 435 m -12 X s 284 450 m -12 X s 284 465 m -12 X s 284 480 m -12 X s 297 495 m -25 X s 284 510 m -12 X s 284 525 m -12 X s 284 540 m -12 X s 284 555 m -12 X s 297 570 m -25 X s 284 584 m -12 X s
 284 599 m -12 X s 284 614 m -12 X s 284 629 m -12 X s 297 644 m -25 X s 284 659 m -12 X s 284 674 m -12 X s 284 689 m -12 X s 284 704 m -12 X s 297 719 m -25 X s 297 270 m -25 X s 284 255 m -12 X s 284 240 m -12 X s 297 719 m -25 X s 284 734 m -12 X
 s 284 749 m -12 X s
 gsave  2268 1455 0 0 C 183.515 249.056 t 0 r /Helvetica findfont 55.7098 sf 0 0 m (0.7) show NC gr 
 gsave  2268 1455 0 0 C 183.515 324.428 t 0 r /Helvetica findfont 55.7098 sf 0 0 m (0.8) show NC gr 
 gsave  2268 1455 0 0 C 183.515 399.8 t 0 r /Helvetica findfont 55.7098 sf 0 0 m (0.9) show NC gr 
 gsave  2268 1455 0 0 C 235.947 471.895 t 0 r /Helvetica findfont 55.7098 sf 0 0 m (1) show NC gr 
 gsave  2268 1455 0 0 C 190.069 547.267 t 0 r /Helvetica findfont 55.7098 sf 0 0 m (1.1) show NC gr 
 gsave  2268 1455 0 0 C 183.515 622.639 t 0 r /Helvetica findfont 55.7098 sf 0 0 m (1.2) show NC gr 
 gsave  2268 1455 0 0 C 183.515 698.011 t 0 r /Helvetica findfont 55.7098 sf 0 0 m (1.3) show NC gr  2154 233 m 524 Y s 2130 270 m 24 X s 2142 285 m 12 X s 2142 300 m 12 X s 2142 315 m 12 X s 2142 330 m 12 X s 2130 345 m 24 X s 2142 360 m 12 X s 2142
 375 m 12 X s 2142 390 m 12 X s 2142 405 m 12 X s 2130 420 m 24 X s 2142 435 m 12 X s 2142 450 m 12 X s 2142 465 m 12 X s 2142 480 m 12 X s 2130 495 m 24 X s 2142 510 m 12 X s 2142 525 m 12 X s 2142 540 m 12 X s 2142 555 m 12 X s 2130 570 m 24 X s
 2142 584 m 12 X s 2142 599 m 12 X s 2142 614 m 12 X s 2142 629 m 12 X s 2130 644 m 24 X s 2142 659 m 12 X s 2142 674 m 12 X s 2142 689 m 12 X s 2142 704 m 12 X s 2130 719 m 24 X s 2130 270 m 24 X s 2142 255 m 12 X s 2142 240 m 12 X s 2130 719 m 24 X
 s 2142 734 m 12 X s 2142 749 m 12 X s 0.8 0 0 c 6 lw 1 1 1 c 0.8 0 0 c 272 456 m 59 X s 358 456 m 59 X s 3 lw 345 456 m24 6 lw 417 473 m 59 X s 502 473 m 60 X s 3 lw 489 473 m24 6 lw 562 469 m 59 X s 647 469 m 59 X s 3 lw 634 469 m24 6 lw 706 488 m
 60 X s 792 488 m 59 X s 3 lw 779 488 m24 6 lw 851 482 m 60 X s 937 482 m 59 X s 3 lw 924 482 m24 6 lw 996 500 m 59 X s 1082 500 m 59 X s 3 lw 1068 500 m24 6 lw 1141 499 m 59 X s 1226 499 m 60 X s 3 lw 1213 499 m24 6 lw 1286 512 m 59 X s 1371 512 m
 59 X s 3 lw 1358 512 m24 6 lw 1430 515 m 60 X s 1516 515 m 59 X s 3 lw 1503 515 m24 6 lw 1575 511 m 59 X s 1661 511 m 59 X s 3 lw 1648 511 m24 6 lw 1720 507 m 59 X s 1805 507 m 60 X s 3 lw 1792 507 m24 6 lw 1865 510 m 59 X s 1950 510 m 60 X s 3 lw
 1937 510 m24 6 lw 2082 509 m 2 Y s 2082 537 m 1 Y s 2010 524 m 59 X s 2095 524 m 59 X s 3 lw 2082 524 m24 6 lw 0.2 0.2 0.6 c 1 1 1 c 0.2 0.2 0.6 c 345 531 m 1 Y s 345 559 m 1 Y s 272 545 m 59 X s 358 545 m 59 X s 3 lw 345 545 m25 6 lw 417 537 m 59 X
 s 502 537 m 60 X s 3 lw 489 537 m25 6 lw 562 520 m 59 X s 647 520 m 59 X s 3 lw 634 520 m25 6 lw 706 528 m 60 X s 792 528 m 59 X s 3 lw 779 528 m25 6 lw 851 516 m 60 X s 937 516 m 59 X s 3 lw 924 516 m25 6 lw 996 496 m 59 X s 1082 496 m 59 X s 3 lw
 1068 496 m25 6 lw 1141 474 m 59 X s 1226 474 m 60 X s 3 lw 1213 474 m25 6 lw 1286 477 m 59 X s 1371 477 m 59 X s 3 lw 1358 477 m25 6 lw 1430 465 m 60 X s 1516 465 m 59 X s 3 lw 1503 465 m25 6 lw 1575 453 m 59 X s 1661 453 m 59 X s 3 lw 1648 453 m25
 6 lw 1792 469 m s 1792 496 m s 1720 482 m 59 X s 1805 482 m 60 X s 3 lw 1792 482 m25 6 lw 1937 391 m 5 Y s 1937 422 m 4 Y s 1865 409 m 59 X s 1950 409 m 60 X s 3 lw 1937 409 m25 6 lw 2082 423 m 11 Y s 2082 460 m 11 Y s 2010 447 m 59 X s 2095 447 m
 59 X s 3 lw 2082 447 m25 6 lw black 3 lw 272 495 m 1882 X s 0 0.4 0 c 6 lw 1 1 1 c 0 0.4 0 c 272 465 m 59 X s 358 465 m 59 X s 3 lw 345 465 m24 6 lw 417 462 m 59 X s 502 462 m 60 X s 3 lw 489 462 m24 6 lw 562 450 m 59 X s 647 450 m 59 X s 3 lw 634
 450 m24 6 lw 706 454 m 60 X s 792 454 m 59 X s 3 lw 779 454 m24 6 lw 851 463 m 60 X s 937 463 m 59 X s 3 lw 924 463 m24 6 lw 996 475 m 59 X s 1082 475 m 59 X s 3 lw 1068 475 m24 6 lw 1141 477 m 59 X s 1226 477 m 60 X s 3 lw 1213 477 m24 6 lw 1286
 505 m 59 X s 1371 505 m 59 X s 3 lw 1358 505 m24 6 lw 1430 527 m 60 X s 1516 527 m 59 X s 3 lw 1503 527 m24 6 lw 1575 575 m 59 X s 1661 575 m 59 X s 3 lw 1648 575 m24 6 lw 1720 606 m 59 X s 1805 606 m 60 X s 3 lw 1792 606 m24 6 lw 1865 660 m 59 X s
 1950 660 m 60 X s 3 lw 1937 660 m24 6 lw 2010 702 m 59 X s 2095 702 m 59 X s 3 lw 2082 702 m24 6 lw 0.8 0 0 c 1 1 1 c 0.8 0 0 c 272 864 m 145 X 60 Y 145 X 72 Y 144 X 59 Y 145 X 32 Y 145 X 24 Y 145 X -3 Y 145 X -30 Y 144 X -49 Y 145 X -78 Y 145 X -82
 Y 145 X -53 Y 145 X -25 Y 144 X s 0 0.4 0 c 1 1 1 c 0 0.4 0 c 272 865 m 145 X 57 Y 145 X 68 Y 144 X 51 Y 145 X 37 Y 145 X 21 Y 145 X -1 Y 145 X -22 Y 144 X -42 Y 145 X -66 Y 145 X -84 Y 145 X -56 Y 145 X -29 Y 144 X s black 1 1 1 c black 272 869 m
 145 X 60 Y 145 X 76 Y 144 X 52 Y 145 X 35 Y 145 X 16 Y 145 X -2 Y 145 X -35 Y 144 X -49 Y 145 X -75 Y 145 X -80 Y 145 X -52 Y 145 X -25 Y 144 X s 0 0.4 0 c 1 1 1 c 0 0.4 0 c 272 865 m 145 X 57 Y 145 X 68 Y 144 X 51 Y 145 X 37 Y 145 X 21 Y 145 X -1 Y
 145 X -22 Y 144 X -42 Y 145 X -66 Y 145 X -84 Y 145 X -56 Y 145 X -29 Y 144 X s 0.8 0 0 c 1 1 1 c 0.8 0 0 c 272 864 m 145 X 60 Y 145 X 72 Y 144 X 59 Y 145 X 32 Y 145 X 24 Y 145 X -3 Y 145 X -30 Y 144 X -49 Y 145 X -78 Y 145 X -82 Y 145 X -53 Y 145 X
 -25 Y 144 X s 0 0.4 0 c 1 1 1 c 0 0.4 0 c 272 865 m 145 X 57 Y 145 X 68 Y 144 X 51 Y 145 X 37 Y 145 X 21 Y 145 X -1 Y 145 X -22 Y 144 X -42 Y 145 X -66 Y 145 X -84 Y 145 X -56 Y 145 X -29 Y 144 X s 0.2 0.2 0.6 c 1 1 1 c 0.2 0.2 0.6 c 272 877 m 145 X
 62 Y 145 X 74 Y 144 X 58 Y 145 X 31 Y 145 X 7 Y 145 X -13 Y 145 X -33 Y 144 X -51 Y 145 X -76 Y 145 X -71 Y 145 X -57 Y 145 X -20 Y 144 X s 0 0.4 0 c 1 1 1 c 0 0.4 0 c 272 865 m 145 X 57 Y 145 X 68 Y 144 X 51 Y 145 X 37 Y 145 X 21 Y 145 X -1 Y 145 X
 -22 Y 144 X -42 Y 145 X -66 Y 145 X -84 Y 145 X -56 Y 145 X -29 Y 144 X s
 gr  gr showpage
end
%%EOF
