%!PS-Adobe-2.0 EPSF-2.0
%%BoundingBox:  0 0 567 384
%%Title: wp-bench-nlo.eps: multigraph
%%Creator: ROOT Version 5.34/00
%%CreationDate: Fri Jun  7 12:18:53 2013
%%EndComments
%%BeginProlog
80 dict begin
/s {stroke} def /l {lineto} def /m {moveto} def /t {translate} def
/r {rotate} def /rl {roll}  def /R {repeat} def
/d {rlineto} def /rm {rmoveto} def /gr {grestore} def /f {eofill} def
/c {setrgbcolor} def /black {0 setgray} def /sd {setdash} def
/cl {closepath} def /sf {scalefont setfont} def /lw {setlinewidth} def
/box {m dup 0 exch d exch 0 d 0 exch neg d cl} def
/NC{systemdict begin initclip end}def/C{NC box clip newpath}def
/bl {box s} def /bf {box f} def /Y { 0 exch d} def /X { 0 d} def 
/K {{pop pop 0 moveto} exch kshow} bind def
/ita {/ang 15 def gsave [1 0 ang dup sin exch cos div 1 0 0] concat} def 
/mp {newpath /y exch def /x exch def} def
/side {[w .77 mul w .23 mul] .385 w mul sd w 0 l currentpoint t -144 r} def
/mr {mp x y w2 0 360 arc} def /m24 {mr s} def /m20 {mr f} def
/mb {mp x y w2 add m w2 neg 0 d 0 w neg d w 0 d 0 w d cl} def
/mt {mp x y w2 add m w2 neg w neg d w 0 d cl} def
/m21 {mb f} def /m25 {mb s} def /m22 {mt f} def /m26{mt s} def
/m23 {mp x y w2 sub m w2 w d w neg 0 d cl f} def
/m27 {mp x y w2 add m w3 neg w2 neg d w3 w2 neg d w3 w2 d cl s} def
/m28 {mp x w2 sub y w2 sub w3 add m w3 0 d  0 w3 neg d w3 0 d 0 w3 d w3 0 d  0 w3 d w3 neg 0 d 0 w3 d w3 neg 0 d 0 w3 neg d w3 neg 0 d cl s } def
/m29 {mp gsave x w2 sub y w2 add w3 sub m currentpoint t 4 {side} repeat cl fill gr} def
/m30 {mp gsave x w2 sub y w2 add w3 sub m currentpoint t 4 {side} repeat cl s gr} def
/m31 {mp x y w2 sub m 0 w d x w2 sub y m w 0 d x w2 sub y w2 add m w w neg d x w2 sub y w2 sub m w w d s} def
/m32 {mp x y w2 sub m w2 w d w neg 0 d cl s} def
/m33 {mp x y w2 add m w3 neg w2 neg d w3 w2 neg d w3 w2 d cl f} def
/m34 {mp x w2 sub y w2 sub w3 add m w3 0 d  0 w3 neg d w3 0 d 0 w3 d w3 0 d  0 w3 d w3 neg 0 d 0 w3 d w3 neg 0 d 0 w3 neg d w3 neg 0 d cl f } def
/m2 {mp x y w2 sub m 0 w d x w2 sub y m w 0 d s} def
/m5 {mp x w2 sub y w2 sub m w w d x w2 sub y w2 add m w w neg d s} def
/reEncode {exch findfont dup length dict begin {1 index /FID eq  {pop pop} {def} ifelse } forall /Encoding exch def currentdict end dup /FontName get exch definefont pop } def [/Times-Bold /Times-Italic /Times-BoldItalic /Helvetica /Helvetica-Oblique
 /Helvetica-Bold /Helvetica-BoldOblique /Courier /Courier-Oblique /Courier-Bold /Courier-BoldOblique /Times-Roman /AvantGarde-Book /AvantGarde-BookOblique /AvantGarde-Demi /AvantGarde-DemiOblique /Bookman-Demi /Bookman-DemiItalic /Bookman-Light
 /Bookman-LightItalic /Helvetica-Narrow /Helvetica-Narrow-Bold /Helvetica-Narrow-BoldOblique /Helvetica-Narrow-Oblique /NewCenturySchlbk-Roman /NewCenturySchlbk-Bold /NewCenturySchlbk-BoldItalic /NewCenturySchlbk-Italic /Palatino-Bold
 /Palatino-BoldItalic /Palatino-Italic /Palatino-Roman ] {ISOLatin1Encoding reEncode } forall
%%EndProlog
%%BeginSetup
%%EndSetup
newpath  gsave  .25 .25 scale  gsave  0 0 t black[  ] 0 sd 3 lw 1 1 1 c 2268 1538 0 0 bf black 1 1 1 c 1814 1230 227 154 bf black 1814 1230 227 154 bl 1 1 1 c 1814 1230 227 154 bf black 1814 1230 227 154 bl 227 154 m 1814 X s 227 1384 m 1814 X s 227
 154 m 1230 Y s[ 4 8] 0 sd 2041 256 m -1814 X s 2041 461 m -1814 X s 2041 666 m -1814 X s 2041 871 m -1814 X s 2041 1077 m -1814 X s 2041 1282 m -1814 X s 2041 256 m -1814 X s 2041 1282 m -1814 X s[  ] 0 sd 2041 154 m 1230 Y s 227 154 m 1814 X s 227
 1384 m 1814 X s 227 154 m 1230 Y s
 gsave  2268 1538 0 0 C 55.3896 843.877 t 90 r /Helvetica findfont 71.6807 sf 0 0 m ( [nb]) show NC gr 
 gsave  2268 1538 0 0 C 91.23 814.553 t 90 r /Symbol findfont 48.8732 sf 0 0 m (n) show NC gr 
 gsave  2268 1538 0 0 C 91.23 804.779 t 90 r /Helvetica findfont 48.8732 sf 0 0 m (l) show NC gr 
 gsave  2268 1538 0 0 C 55.3896 716.807 t 90 r /Helvetica findfont 71.6807 sf 0 0 m (\) B) show NC gr 
 gsave  2268 1538 0 0 C 19.5493 690.741 t 90 r /Helvetica findfont 48.8732 sf 0 0 m (+) show NC gr 
 gsave  2268 1538 0 0 C 55.3896 599.511 t 90 r /Helvetica findfont 71.6807 sf 0 0 m (\(W) show NC gr 
 gsave  2268 1538 0 0 C 55.3896 557.154 t 90 r /Symbol findfont 71.6807 sf 0 0 m (s) show NC gr  281 256 m -54 X s 254 308 m -27 X s 254 359 m -27 X s 254 410 m -27 X s 281 461 m -54 X s 254 513 m -27 X s 254 564 m -27 X s 254 615 m -27 X s 281 666 m
 -54 X s 254 718 m -27 X s 254 769 m -27 X s 254 820 m -27 X s 281 871 m -54 X s 254 923 m -27 X s 254 974 m -27 X s 254 1025 m -27 X s 281 1077 m -54 X s 254 1128 m -27 X s 254 1179 m -27 X s 254 1230 m -27 X s 281 1282 m -54 X s 281 256 m -54 X s
 254 205 m -27 X s 254 154 m -27 X s 281 1282 m -54 X s 254 1333 m -27 X s
 gsave  2268 1538 0 0 C 117.296 231.333 t 0 r /Helvetica findfont 71.6807 sf 0 0 m (6.2) show NC gr 
 gsave  2268 1538 0 0 C 117.296 436.601 t 0 r /Helvetica findfont 71.6807 sf 0 0 m (6.4) show NC gr 
 gsave  2268 1538 0 0 C 117.296 641.868 t 0 r /Helvetica findfont 71.6807 sf 0 0 m (6.6) show NC gr 
 gsave  2268 1538 0 0 C 117.296 847.135 t 0 r /Helvetica findfont 71.6807 sf 0 0 m (6.8) show NC gr 
 gsave  2268 1538 0 0 C 175.944 1049.14 t 0 r /Helvetica findfont 71.6807 sf 0 0 m (7) show NC gr 
 gsave  2268 1538 0 0 C 117.296 1254.41 t 0 r /Helvetica findfont 71.6807 sf 0 0 m (7.2) show NC gr  2041 154 m 1230 Y s 1987 256 m 54 X s 2014 308 m 27 X s 2014 359 m 27 X s 2014 410 m 27 X s 1987 461 m 54 X s 2014 513 m 27 X s 2014 564 m 27 X s
 2014 615 m 27 X s 1987 666 m 54 X s 2014 718 m 27 X s 2014 769 m 27 X s 2014 820 m 27 X s 1987 871 m 54 X s 2014 923 m 27 X s 2014 974 m 27 X s 2014 1025 m 27 X s 1987 1077 m 54 X s 2014 1128 m 27 X s 2014 1179 m 27 X s 2014 1230 m 27 X s 1987 1282
 m 54 X s 1987 256 m 54 X s 2014 205 m 27 X s 2014 154 m 27 X s 1987 1282 m 54 X s 2014 1333 m 27 X s 1 0 0 c 9 lw 443 554 m 131 Y s 436 685 m 13 X s 443 508 m -131 Y s 436 377 m 13 X s black 1 0 0 c 3 lw /w 47 def /w2 {w 2 div} def /w3 {w 3 div} def
 443 531 m20 9 lw 0 0 1 c 875 693 m 105 Y s 868 798 m 13 X s 875 648 m -106 Y s 868 542 m 13 X s black 0 0 1 c 3 lw 875 670 m21 9 lw black 1307 876 m 141 Y s 1300 1017 m 13 X s 1307 830 m -141 Y s 1300 689 m 13 X s 3 lw 1307 853 m22 9 lw 1 0 0 c 529
 628 m 131 Y s 523 759 m 13 X s 529 582 m -131 Y s 523 451 m 13 X s black 1 0 0 c 3 lw 529 605 m20 9 lw 0 0 1 c 961 792 m 105 Y s 955 897 m 13 X s 961 746 m -105 Y s 955 641 m 13 X s black 0 0 1 c 3 lw 961 769 m21 9 lw black 1393 966 m 141 Y s 1387
 1107 m 13 X s 1393 920 m -141 Y s 1387 779 m 13 X s 3 lw 1393 943 m22 9 lw 0.4 0.4 0.4 c 1739 1007 m 316 Y s 1732 1323 m 13 X s 1739 961 m -315 Y s 1732 646 m 13 X s black 0.4 0.4 0.4 c 3 lw 1739 984 m23 9 lw 0.8 0 1 c[ 12 12] 0 sd black 0.8 0 1 c
 227 1098 m 1814 X s black 0.8 0 1 c 227 380 m 1814 X s[  ] 0 sd 6 lw black 0.8 0 1 c 227 739 m 1814 X s 1 1 1 c black
 gsave  2268 1538 0 0 C 1811.57 1443.39 t 0 r /Helvetica findfont 45.615 sf 0 0 m (S) show NC gr 
 gsave  2268 1538 0 0 C 1769.21 1466.2 t 0 r /Symbol findfont 65.1643 sf 0 0 m (a) show NC gr 
 gsave  2268 1538 0 0 C 426.826 1466.2 t 0 r /Helvetica findfont 65.1643 sf 0 0 m 
 1358 1319 1301 1260 1212 1168 1149 1127 1108 1075 1034 986 942 923 886 849 812 775 757 735 716 664 627 579 561 517 473 425 380 362 340 321 277 240 207 189 152 134 86 38
(LHC 8 TeV \255 VRAP NLO \255 2010 PDFs \255 PDF + ) K NC gr 
 gsave  2268 1538 0 0 C 319.305 1283.74 t 0 r /Helvetica-Bold findfont 48.8732 sf 0 0 m 
 290 262 236 222 194 180 167 153 125 97 71 57 30
(=0.117,  0.119) K NC gr 
 gsave  2268 1538 0 0 C 299.756 1270.7 t 0 r /Helvetica-Bold findfont 32.5821 sf 0 0 m (s) show NC gr 
 gsave  2268 1538 0 0 C 267.173 1283.74 t 0 r /Symbol findfont 48.8732 sf 0 0 m (a) show NC gr 
 gsave  2268 1538 0 0 C 752.647 1283.74 t 0 r /Helvetica-Bold findfont 48.8732 sf 0 0 m 
 290 262 236 222 194 180 167 153 125 97 71 57 30
(=0.117,  0.119) K NC gr 
 gsave  2268 1538 0 0 C 733.098 1270.7 t 0 r /Helvetica-Bold findfont 32.5821 sf 0 0 m (s) show NC gr 
 gsave  2268 1538 0 0 C 700.516 1283.74 t 0 r /Symbol findfont 48.8732 sf 0 0 m (a) show NC gr 
 gsave  2268 1538 0 0 C 1185.99 1283.74 t 0 r /Helvetica-Bold findfont 48.8732 sf 0 0 m 
 290 262 236 222 194 180 167 153 125 97 71 57 30
(=0.117,  0.119) K NC gr 
 gsave  2268 1538 0 0 C 1166.44 1270.7 t 0 r /Helvetica-Bold findfont 32.5821 sf 0 0 m (s) show NC gr 
 gsave  2268 1538 0 0 C 1133.86 1283.74 t 0 r /Symbol findfont 48.8732 sf 0 0 m (a) show NC gr 
 gsave  2268 1538 0 0 C 1541.13 508.281 t 0 r /Helvetica findfont 68.4225 sf 0 0 m (NNPDF2.0) show NC gr  1 0 0 c 9 lw 1407 532 m 111 X s 3 lw 1463 532 m20 9 lw black
 gsave  2268 1538 0 0 C 1541.13 404.018 t 0 r /Helvetica findfont 68.4225 sf 0 0 m (MSTW08) show NC gr  0 0 1 c 1407 429 m 111 X s 3 lw 1463 429 m21 9 lw black
 gsave  2268 1538 0 0 C 1541.13 299.756 t 0 r /Helvetica findfont 68.4225 sf 0 0 m (CTEQ6.6) show NC gr  1407 325 m 111 X s 3 lw 1463 325 m22 9 lw
 gsave  2268 1538 0 0 C 1541.13 195.493 t 0 r /Helvetica findfont 68.4225 sf 0 0 m (CMS data) show NC gr  0.4 0.4 0.4 c 1407 221 m 111 X s 3 lw 1463 221 m23 9 lw black
 gsave  2268 1538 0 0 C 2166.71 847.135 t 90 r /Helvetica-BoldOblique findfont 45.615 sf 0 0 m (LHC HIGGS XS WG 2013) show NC gr 
 gr  gr showpage
end
%%EOF
