%!PS-Adobe-3.0
%%Creator: xpdf/pdftops 3.00
%%LanguageLevel: 2
%%DocumentSuppliedResources: (atend)
%%DocumentMedia: plain 612 792 0 () ()
%%BoundingBox: 0 0 612 792
%%Pages: 1
%%EndComments
%%BeginDefaults
%%PageMedia: plain
%%EndDefaults
%%BeginProlog
%%BeginResource: procset xpdf 3.00 0
/xpdf 75 dict def xpdf begin
% PDF special state
/pdfDictSize 15 def
/pdfSetup {
  3 1 roll 2 array astore
  /setpagedevice where {
    pop 3 dict begin
      /PageSize exch def
      /ImagingBBox null def
      /Policies 1 dict dup begin /PageSize 3 def end def
      { /Duplex true def } if
    currentdict end setpagedevice
  } {
    pop pop
  } ifelse
} def
/pdfStartPage {
  pdfDictSize dict begin
  /pdfFillCS [] def
  /pdfFillXform {} def
  /pdfStrokeCS [] def
  /pdfStrokeXform {} def
  /pdfFill [0] def
  /pdfStroke [0] def
  /pdfFillOP false def
  /pdfStrokeOP false def
  /pdfLastFill false def
  /pdfLastStroke false def
  /pdfTextMat [1 0 0 1 0 0] def
  /pdfFontSize 0 def
  /pdfCharSpacing 0 def
  /pdfTextRender 0 def
  /pdfTextRise 0 def
  /pdfWordSpacing 0 def
  /pdfHorizScaling 1 def
  /pdfTextClipPath [] def
} def
/pdfEndPage { end } def
% PDF color state
/cs { /pdfFillXform exch def dup /pdfFillCS exch def
      setcolorspace } def
/CS { /pdfStrokeXform exch def dup /pdfStrokeCS exch def
      setcolorspace } def
/sc { pdfLastFill not { pdfFillCS setcolorspace } if
      dup /pdfFill exch def aload pop pdfFillXform setcolor
     /pdfLastFill true def /pdfLastStroke false def } def
/SC { pdfLastStroke not { pdfStrokeCS setcolorspace } if
      dup /pdfStroke exch def aload pop pdfStrokeXform setcolor
     /pdfLastStroke true def /pdfLastFill false def } def
/op { /pdfFillOP exch def
      pdfLastFill { pdfFillOP setoverprint } if } def
/OP { /pdfStrokeOP exch def
      pdfLastStroke { pdfStrokeOP setoverprint } if } def
/fCol {
  pdfLastFill not {
    pdfFillCS setcolorspace
    pdfFill aload pop pdfFillXform setcolor
    pdfFillOP setoverprint
    /pdfLastFill true def /pdfLastStroke false def
  } if
} def
/sCol {
  pdfLastStroke not {
    pdfStrokeCS setcolorspace
    pdfStroke aload pop pdfStrokeXform setcolor
    pdfStrokeOP setoverprint
    /pdfLastStroke true def /pdfLastFill false def
  } if
} def
% build a font
/pdfMakeFont {
  4 3 roll findfont
  4 2 roll matrix scale makefont
  dup length dict begin
    { 1 index /FID ne { def } { pop pop } ifelse } forall
    /Encoding exch def
    currentdict
  end
  definefont pop
} def
/pdfMakeFont16 {
  exch findfont
  dup length dict begin
    { 1 index /FID ne { def } { pop pop } ifelse } forall
    /WMode exch def
    currentdict
  end
  definefont pop
} def
% graphics state operators
/q { gsave pdfDictSize dict begin } def
/Q {
  end grestore
  /pdfLastFill where {
    pop
    pdfLastFill {
      pdfFillOP setoverprint
    } {
      pdfStrokeOP setoverprint
    } ifelse
  } if
} def
/cm { concat } def
/d { setdash } def
/i { setflat } def
/j { setlinejoin } def
/J { setlinecap } def
/M { setmiterlimit } def
/w { setlinewidth } def
% path segment operators
/m { moveto } def
/l { lineto } def
/c { curveto } def
/re { 4 2 roll moveto 1 index 0 rlineto 0 exch rlineto
      neg 0 rlineto closepath } def
/h { closepath } def
% path painting operators
/S { sCol stroke } def
/Sf { fCol stroke } def
/f { fCol fill } def
/f* { fCol eofill } def
% clipping operators
/W { clip newpath } def
/W* { eoclip newpath } def
% text state operators
/Tc { /pdfCharSpacing exch def } def
/Tf { dup /pdfFontSize exch def
      dup pdfHorizScaling mul exch matrix scale
      pdfTextMat matrix concatmatrix dup 4 0 put dup 5 0 put
      exch findfont exch makefont setfont } def
/Tr { /pdfTextRender exch def } def
/Ts { /pdfTextRise exch def } def
/Tw { /pdfWordSpacing exch def } def
/Tz { /pdfHorizScaling exch def } def
% text positioning operators
/Td { pdfTextMat transform moveto } def
/Tm { /pdfTextMat exch def } def
% text string operators
/cshow where {
  pop
  /cshow2 {
    dup {
      pop pop
      1 string dup 0 3 index put 3 index exec
    } exch cshow
    pop pop
  } def
}{
  /cshow2 {
    currentfont /FontType get 0 eq {
      0 2 2 index length 1 sub {
        2 copy get exch 1 add 2 index exch get
        2 copy exch 256 mul add
        2 string dup 0 6 5 roll put dup 1 5 4 roll put
        3 index exec
      } for
    } {
      dup {
        1 string dup 0 3 index put 3 index exec
      } forall
    } ifelse
    pop pop
  } def
} ifelse
/awcp {
  exch {
    false charpath
    5 index 5 index rmoveto
    6 index eq { 7 index 7 index rmoveto } if
  } exch cshow2
  6 {pop} repeat
} def
/Tj {
  fCol
  1 index stringwidth pdfTextMat idtransform pop
  sub 1 index length dup 0 ne { div } { pop pop 0 } ifelse
  pdfWordSpacing pdfHorizScaling mul 0 pdfTextMat dtransform 32
  4 3 roll pdfCharSpacing pdfHorizScaling mul add 0
  pdfTextMat dtransform
  6 5 roll Tj1
} def
/Tj16 {
  fCol
  2 index stringwidth pdfTextMat idtransform pop
  sub exch div
  pdfWordSpacing pdfHorizScaling mul 0 pdfTextMat dtransform 32
  4 3 roll pdfCharSpacing pdfHorizScaling mul add 0
  pdfTextMat dtransform
  6 5 roll Tj1
} def
/Tj16V {
  fCol
  2 index stringwidth pdfTextMat idtransform exch pop
  sub exch div
  0 pdfWordSpacing pdfTextMat dtransform 32
  4 3 roll pdfCharSpacing add 0 exch
  pdfTextMat dtransform
  6 5 roll Tj1
} def
/Tj1 {
  0 pdfTextRise pdfTextMat dtransform rmoveto
  currentpoint 8 2 roll
  pdfTextRender 1 and 0 eq {
    6 copy awidthshow
  } if
  pdfTextRender 3 and dup 1 eq exch 2 eq or {
    7 index 7 index moveto
    6 copy
    currentfont /FontType get 3 eq { fCol } { sCol } ifelse
    false awcp currentpoint stroke moveto
  } if
  pdfTextRender 4 and 0 ne {
    8 6 roll moveto
    false awcp
    /pdfTextClipPath [ pdfTextClipPath aload pop
      {/moveto cvx}
      {/lineto cvx}
      {/curveto cvx}
      {/closepath cvx}
    pathforall ] def
    currentpoint newpath moveto
  } {
    8 {pop} repeat
  } ifelse
  0 pdfTextRise neg pdfTextMat dtransform rmoveto
} def
/TJm { pdfFontSize 0.001 mul mul neg 0
       pdfTextMat dtransform rmoveto } def
/TJmV { pdfFontSize 0.001 mul mul neg 0 exch
        pdfTextMat dtransform rmoveto } def
/Tclip { pdfTextClipPath cvx exec clip newpath
         /pdfTextClipPath [] def } def
% Level 2 image operators
/pdfImBuf 100 string def
/pdfIm {
  image
  { currentfile pdfImBuf readline
    not { pop exit } if
    (%-EOD-) eq { exit } if } loop
} def
/pdfImM {
  fCol imagemask
  { currentfile pdfImBuf readline
    not { pop exit } if
    (%-EOD-) eq { exit } if } loop
} def
/pdfImClip {
  gsave
  0 2 4 index length 1 sub {
    dup 4 index exch 2 copy
    get 5 index div put
    1 add 3 index exch 2 copy
    get 3 index div put
  } for
  pop pop rectclip
} def
/pdfImClipEnd { grestore } def
% shading operators
/colordelta {
  false 0 1 3 index length 1 sub {
    dup 4 index exch get 3 index 3 2 roll get sub abs 0.004 gt {
      pop true
    } if
  } for
  exch pop exch pop
} def
/funcCol { func n array astore } def
/funcSH {
  dup 0 eq {
    true
  } {
    dup 6 eq {
      false
    } {
      4 index 4 index funcCol dup
      6 index 4 index funcCol dup
      3 1 roll colordelta 3 1 roll
      5 index 5 index funcCol dup
      3 1 roll colordelta 3 1 roll
      6 index 8 index funcCol dup
      3 1 roll colordelta 3 1 roll
      colordelta or or or
    } ifelse
  } ifelse
  {
    1 add
    4 index 3 index add 0.5 mul exch 4 index 3 index add 0.5 mul exch
    6 index 6 index 4 index 4 index 4 index funcSH
    2 index 6 index 6 index 4 index 4 index funcSH
    6 index 2 index 4 index 6 index 4 index funcSH
    5 3 roll 3 2 roll funcSH pop pop
  } {
    pop 3 index 2 index add 0.5 mul 3 index  2 index add 0.5 mul
    funcCol sc
    dup 4 index exch mat transform m
    3 index 3 index mat transform l
    1 index 3 index mat transform l
    mat transform l pop pop h f*
  } ifelse
} def
/axialCol {
  dup 0 lt {
    pop t0
  } {
    dup 1 gt {
      pop t1
    } {
      dt mul t0 add
    } ifelse
  } ifelse
  func n array astore
} def
/axialSH {
  dup 0 eq {
    true
  } {
    dup 8 eq {
      false
    } {
      2 index axialCol 2 index axialCol colordelta
    } ifelse
  } ifelse
  {
    1 add 3 1 roll 2 copy add 0.5 mul
    dup 4 3 roll exch 4 index axialSH
    exch 3 2 roll axialSH
  } {
    pop 2 copy add 0.5 mul axialCol sc
    exch dup dx mul x0 add exch dy mul y0 add
    3 2 roll dup dx mul x0 add exch dy mul y0 add
    dx abs dy abs ge {
      2 copy yMin sub dy mul dx div add yMin m
      yMax sub dy mul dx div add yMax l
      2 copy yMax sub dy mul dx div add yMax l
      yMin sub dy mul dx div add yMin l
      h f*
    } {
      exch 2 copy xMin sub dx mul dy div add xMin exch m
      xMax sub dx mul dy div add xMax exch l
      exch 2 copy xMax sub dx mul dy div add xMax exch l
      xMin sub dx mul dy div add xMin exch l
      h f*
    } ifelse
  } ifelse
} def
/radialCol {
  dup t0 lt {
    pop t0
  } {
    dup t1 gt {
      pop t1
    } if
  } ifelse
  func n array astore
} def
/radialSH {
  dup 0 eq {
    true
  } {
    dup 8 eq {
      false
    } {
      2 index dt mul t0 add radialCol
      2 index dt mul t0 add radialCol colordelta
    } ifelse
  } ifelse
  {
    1 add 3 1 roll 2 copy add 0.5 mul
    dup 4 3 roll exch 4 index radialSH
    exch 3 2 roll radialSH
  } {
    pop 2 copy add 0.5 mul dt mul t0 add axialCol sc
    exch dup dx mul x0 add exch dup dy mul y0 add exch dr mul r0 add
    0 360 arc h
    dup dx mul x0 add exch dup dy mul y0 add exch dr mul r0 add
    0 360 arc h f*
  } ifelse
} def
end
%%EndResource
%%EndProlog
%%BeginSetup
xpdf begin
612 792 false pdfSetup
%%EndSetup
%%Page: 1 1
%%BeginPageSetup
%%PageOrientation: Portrait
pdfStartPage
0 0 612 792 re W
%%EndPageSetup
[] 0 d
1 i
0 j
0 J
10 M
1 w
/DeviceGray {} cs
[0] sc
/DeviceGray {} CS
[0] SC
false op
false OP
q
q
Q
q
0 0 612 792 re
W
1.2 w
1 J
1 j
/DeviceRGB {} CS
[0 0 0] SC
[0 0 0] SC
323.04 483.6 m
323.04 472.8 l
323.76 483.6 m
326.64 474.48 l
323.04 483.6 m
326.64 472.8 l
330.48 483.6 m
326.64 472.8 l
330.48 483.6 m
330.48 472.8 l
330.96 483.6 m
330.96 472.8 l
321.6 483.6 m
323.76 483.6 l
330.48 483.6 m
332.4 483.6 l
321.6 472.8 m
324.72 472.8 l
328.8 472.8 m
332.4 472.8 l
336 475.92 m
336 468.72 l
336.24 475.92 m
336.24 468.72 l
340.56 475.92 m
340.56 468.72 l
340.8 475.92 m
340.8 468.72 l
334.8 475.92 m
337.44 475.92 l
339.36 475.92 m
341.76 475.92 l
336.24 472.56 m
340.56 472.56 l
334.8 468.72 m
337.44 468.72 l
339.36 468.72 m
341.76 468.72 l
345.36 479.04 m
354.72 479.04 l
345.36 475.92 m
354.72 475.92 l
360.96 483.6 m
359.28 483.12 l
358.8 482.16 l
358.8 480.48 l
359.28 479.52 l
360.96 479.04 l
362.88 479.04 l
364.56 479.52 l
365.04 480.48 l
365.04 482.16 l
364.56 483.12 l
362.88 483.6 l
360.96 483.6 l
359.76 483.12 l
359.28 482.16 l
359.28 480.48 l
359.76 479.52 l
360.96 479.04 l
362.88 479.04 m
364.08 479.52 l
364.56 480.48 l
364.56 482.16 l
364.08 483.12 l
362.88 483.6 l
360.96 479.04 m
359.28 478.56 l
358.8 478.08 l
358.32 476.88 l
358.32 474.96 l
358.8 473.76 l
359.28 473.28 l
360.96 472.8 l
362.88 472.8 l
364.56 473.28 l
365.04 473.76 l
365.52 474.96 l
365.52 476.88 l
365.04 478.08 l
364.56 478.56 l
362.88 479.04 l
360.96 479.04 m
359.76 478.56 l
359.28 478.08 l
358.8 476.88 l
358.8 474.96 l
359.28 473.76 l
359.76 473.28 l
360.96 472.8 l
362.88 472.8 m
364.08 473.28 l
364.56 473.76 l
365.04 474.96 l
365.04 476.88 l
364.56 478.08 l
364.08 478.56 l
362.88 479.04 l
371.76 483.6 m
370.32 483.12 l
369.12 481.68 l
368.64 479.04 l
368.64 477.6 l
369.12 474.96 l
370.32 473.28 l
371.76 472.8 l
372.96 472.8 l
374.4 473.28 l
375.36 474.96 l
376.08 477.6 l
376.08 479.04 l
375.36 481.68 l
374.4 483.12 l
372.96 483.6 l
371.76 483.6 l
370.8 483.12 l
370.32 482.64 l
369.84 481.68 l
369.12 479.04 l
369.12 477.6 l
369.84 474.96 l
370.32 473.76 l
370.8 473.28 l
371.76 472.8 l
372.96 472.8 m
373.92 473.28 l
374.4 473.76 l
374.88 474.96 l
375.36 477.6 l
375.36 479.04 l
374.88 481.68 l
374.4 482.64 l
373.92 483.12 l
372.96 483.6 l
S
382.32 483.6 m
380.64 483.12 l
379.68 481.68 l
379.2 479.04 l
379.2 477.6 l
379.68 474.96 l
380.64 473.28 l
382.32 472.8 l
383.28 472.8 l
384.72 473.28 l
385.92 474.96 l
386.4 477.6 l
386.4 479.04 l
385.92 481.68 l
384.72 483.12 l
383.28 483.6 l
382.32 483.6 l
381.12 483.12 l
380.64 482.64 l
380.16 481.68 l
379.68 479.04 l
379.68 477.6 l
380.16 474.96 l
380.64 473.76 l
381.12 473.28 l
382.32 472.8 l
383.28 472.8 m
384.24 473.28 l
384.72 473.76 l
385.2 474.96 l
385.92 477.6 l
385.92 479.04 l
385.2 481.68 l
384.72 482.64 l
384.24 483.12 l
383.28 483.6 l
405.12 482.16 m
405.6 480.48 l
405.6 483.6 l
405.12 482.16 l
403.92 483.12 l
402.48 483.6 l
401.52 483.6 l
399.84 483.12 l
398.88 482.16 l
398.4 481.2 l
397.68 479.52 l
397.68 476.88 l
398.88 474.48 l
399.84 473.28 l
401.52 472.8 l
402.48 472.8 l
403.92 473.28 l
405.12 474.48 l
401.52 483.6 m
400.32 483.12 l
399.36 482.16 l
398.88 481.2 l
398.4 479.52 l
398.4 476.88 l
398.88 475.44 l
399.36 474.48 l
400.32 473.28 l
401.52 472.8 l
405.12 476.88 m
405.12 472.8 l
405.6 476.88 m
405.6 472.8 l
403.44 476.88 m
407.04 476.88 l
410.16 476.88 m
416.4 476.88 l
416.4 478.08 l
415.92 479.04 l
415.44 479.52 l
414.48 480 l
412.8 480 l
411.36 479.52 l
410.16 478.56 l
409.68 476.88 l
409.68 475.92 l
410.16 474.48 l
411.36 473.28 l
412.8 472.8 l
414 472.8 l
415.44 473.28 l
416.4 474.48 l
415.92 476.88 m
415.92 478.56 l
415.44 479.52 l
412.8 480 m
411.84 479.52 l
410.88 478.56 l
410.16 476.88 l
410.16 475.92 l
410.88 474.48 l
411.84 473.28 l
412.8 472.8 l
419.52 483.6 m
423.36 472.8 l
420.24 483.6 m
423.36 474.48 l
426.96 483.6 m
423.36 472.8 l
418.56 483.6 m
421.68 483.6 l
424.8 483.6 m
427.92 483.6 l
69.6 439.68 m
80.64 439.68 l
69.6 440.4 m
80.64 440.4 l
74.88 439.68 m
73.68 438.72 l
73.2 437.76 l
73.2 436.56 l
73.68 435.12 l
74.88 434.16 l
76.32 433.44 l
77.52 433.44 l
78.96 434.16 l
79.92 435.12 l
80.64 436.56 l
80.64 437.76 l
79.92 438.72 l
78.96 439.68 l
73.2 436.56 m
73.68 435.6 l
74.88 434.64 l
76.32 434.16 l
77.52 434.16 l
78.96 434.64 l
79.92 435.6 l
80.64 436.56 l
S
69.6 438.24 m
69.6 440.4 l
80.64 439.68 m
80.64 441.84 l
73.2 452.88 m
73.2 447.6 l
73.68 445.92 l
75.36 444.96 l
76.8 444.48 l
78.48 444.48 l
79.44 444.96 l
79.92 445.44 l
80.64 446.64 l
80.64 447.6 l
79.92 449.04 l
78.48 450.24 l
76.8 450.72 l
75.36 450.72 l
74.4 450.24 l
73.68 449.76 l
73.2 448.56 l
73.2 447.6 m
73.68 446.64 l
75.36 445.44 l
76.8 444.96 l
78.96 444.96 l
79.92 445.44 l
80.64 447.6 m
79.92 448.56 l
78.48 449.76 l
76.8 450.24 l
74.88 450.24 l
73.68 449.76 l
73.68 452.88 l
77.52 455.52 m
84.72 460.08 l
77.52 456 m
84.72 460.32 l
77.52 460.32 m
84.72 455.52 l
77.52 454.8 m
77.52 456.96 l
77.52 459.12 m
77.52 461.04 l
84.72 454.8 m
84.72 456.96 l
84.72 459.12 m
84.72 461.04 l
67.68 472.56 m
84.24 463.2 l
69.6 481.44 m
80.64 481.44 l
69.6 481.92 m
80.64 481.92 l
74.88 481.44 m
73.68 480.24 l
73.2 479.28 l
73.2 478.32 l
73.68 476.64 l
74.88 475.68 l
76.32 475.2 l
77.52 475.2 l
78.96 475.68 l
79.92 476.64 l
80.64 478.32 l
80.64 479.28 l
79.92 480.24 l
78.96 481.44 l
73.2 478.32 m
73.68 477.12 l
74.88 476.16 l
76.32 475.68 l
77.52 475.68 l
78.96 476.16 l
79.92 477.12 l
80.64 478.32 l
69.6 479.76 m
69.6 481.92 l
80.64 481.44 m
80.64 483.36 l
69.6 486.96 m
80.64 486.96 l
69.6 487.68 m
78.96 490.8 l
69.6 486.96 m
80.64 490.8 l
69.6 494.4 m
80.64 490.8 l
69.6 494.4 m
80.64 494.4 l
69.6 494.88 m
80.64 494.88 l
69.6 485.52 m
69.6 487.68 l
69.6 494.4 m
69.6 496.32 l
80.64 485.52 m
80.64 488.64 l
80.64 492.72 m
80.64 496.32 l
77.52 501.36 m
84.72 501.36 l
77.52 501.6 m
84.72 501.6 l
77.52 499.2 m
79.44 498.96 l
77.52 498.96 l
77.52 504 l
79.44 504 l
77.52 503.76 l
84.72 500.16 m
84.72 502.56 l
139.92 375.12 m
451.44 375.12 l
451.44 562.08 l
139.92 562.08 l
139.92 375.12 l
h
S
[0 0 1] SC
139.92 406.32 m
147.6 406.32 l
147.6 406.56 l
155.52 406.56 l
155.52 406.8 l
163.2 406.8 l
163.2 407.76 l
171.12 407.76 l
171.12 409.2 l
178.8 409.2 l
178.8 411.6 l
186.72 411.6 l
186.72 414.48 l
194.4 414.48 l
194.4 417.84 l
202.08 417.84 l
202.08 421.92 l
210 421.92 l
210 426 l
217.68 426 l
217.68 429.36 l
225.6 429.36 l
225.6 433.92 l
233.28 433.92 l
233.28 436.8 l
241.2 436.8 l
241.2 438.96 l
248.88 438.96 l
248.88 440.64 l
256.8 440.64 l
256.8 442.8 l
264.48 442.8 l
264.48 442.56 l
272.16 442.56 l
272.16 443.28 l
280.08 443.28 l
280.08 442.8 l
287.76 442.8 l
287.76 440.88 l
295.68 440.88 l
295.68 439.68 l
303.36 439.68 l
303.36 437.76 l
311.28 437.76 l
311.28 435.12 l
318.96 435.12 l
318.96 432.24 l
326.64 432.24 l
326.64 430.08 l
334.56 430.08 l
334.56 426.24 l
342.24 426.24 l
342.24 423.84 l
350.16 423.84 l
350.16 421.2 l
357.84 421.2 l
357.84 418.08 l
365.76 418.08 l
365.76 416.4 l
373.44 416.4 l
373.44 414.24 l
381.36 414.24 l
381.36 412.32 l
389.04 412.32 l
389.04 410.88 l
396.72 410.88 l
396.72 409.92 l
404.64 409.92 l
404.64 409.2 l
412.32 409.2 l
412.32 408.48 l
420.24 408.48 l
420.24 408 l
427.92 408 l
427.92 407.76 l
435.84 407.76 l
435.84 407.28 l
451.44 407.28 l
451.44 406.32 l
S
[0 0 0] SC
139.92 375.12 m
139.92 387.6 l
152.4 379.44 m
152.4 375.12 l
164.88 375.12 m
164.88 379.44 l
177.36 379.44 m
177.36 375.12 l
189.84 375.12 m
189.84 379.44 l
202.08 387.6 m
202.08 375.12 l
214.56 375.12 m
214.56 379.44 l
227.04 379.44 m
227.04 375.12 l
239.52 375.12 m
239.52 379.44 l
252 379.44 m
252 375.12 l
264.48 375.12 m
264.48 387.6 l
276.96 379.44 m
276.96 375.12 l
289.44 375.12 m
289.44 379.44 l
301.92 379.44 m
301.92 375.12 l
314.4 375.12 m
314.4 379.44 l
326.64 387.6 m
326.64 375.12 l
339.12 375.12 m
339.12 379.44 l
351.6 379.44 m
351.6 375.12 l
364.08 375.12 m
364.08 379.44 l
376.56 379.44 m
376.56 375.12 l
389.04 375.12 m
389.04 387.6 l
401.52 379.44 m
401.52 375.12 l
414 375.12 m
414 379.44 l
426.48 379.44 m
426.48 375.12 l
438.96 375.12 m
438.96 379.44 l
451.44 387.6 m
451.44 375.12 l
139.68 368.4 m
138.48 368.16 l
137.76 366.96 l
137.52 365.28 l
137.52 364.32 l
137.76 362.4 l
138.48 361.44 l
139.68 361.2 l
140.16 361.2 l
141.36 361.44 l
142.08 362.4 l
142.32 364.32 l
142.32 365.28 l
142.08 366.96 l
141.36 368.16 l
140.16 368.4 l
139.68 368.4 l
138.96 368.16 l
138.48 367.68 l
138.24 366.96 l
137.76 365.28 l
137.76 364.32 l
138.24 362.4 l
138.48 361.92 l
138.96 361.44 l
139.68 361.2 l
140.16 361.2 m
140.88 361.44 l
141.36 361.92 l
141.6 362.4 l
142.08 364.32 l
142.08 365.28 l
141.6 366.96 l
141.36 367.68 l
140.88 368.16 l
140.16 368.4 l
193.2 366.96 m
193.44 366.72 l
193.2 366.24 l
192.96 366.72 l
192.96 366.96 l
193.2 367.68 l
193.44 368.16 l
194.64 368.4 l
196.08 368.4 l
197.04 368.16 l
197.28 367.68 l
197.76 366.96 l
197.76 366.24 l
197.28 365.52 l
196.32 365.04 l
194.64 364.32 l
193.92 363.84 l
193.2 363.12 l
192.96 362.16 l
192.96 361.2 l
196.08 368.4 m
196.56 368.16 l
197.04 367.68 l
197.28 366.96 l
197.28 366.24 l
197.04 365.52 l
194.64 364.32 l
192.96 361.92 m
193.2 362.16 l
193.92 362.16 l
195.6 361.44 l
196.56 361.44 l
197.28 361.92 l
197.76 362.16 l
193.92 362.16 m
195.6 361.2 l
197.04 361.2 l
197.28 361.44 l
197.76 362.16 l
197.76 362.88 l
S
201.84 368.4 m
200.88 368.16 l
200.16 366.96 l
199.68 365.28 l
199.68 364.32 l
200.16 362.4 l
200.88 361.44 l
201.84 361.2 l
202.56 361.2 l
203.52 361.44 l
204.24 362.4 l
204.72 364.32 l
204.72 365.28 l
204.24 366.96 l
203.52 368.16 l
202.56 368.4 l
201.84 368.4 l
201.12 368.16 l
200.88 367.68 l
200.4 366.96 l
200.16 365.28 l
200.16 364.32 l
200.4 362.4 l
200.88 361.92 l
201.12 361.44 l
201.84 361.2 l
202.56 361.2 m
203.28 361.44 l
203.52 361.92 l
204 362.4 l
204.24 364.32 l
204.24 365.28 l
204 366.96 l
203.52 367.68 l
203.28 368.16 l
202.56 368.4 l
208.8 368.4 m
207.84 368.16 l
207.12 366.96 l
206.64 365.28 l
206.64 364.32 l
207.12 362.4 l
207.84 361.44 l
208.8 361.2 l
209.52 361.2 l
210.48 361.44 l
211.2 362.4 l
211.68 364.32 l
211.68 365.28 l
211.2 366.96 l
210.48 368.16 l
209.52 368.4 l
208.8 368.4 l
208.08 368.16 l
207.84 367.68 l
207.36 366.96 l
207.12 365.28 l
207.12 364.32 l
207.36 362.4 l
207.84 361.92 l
208.08 361.44 l
208.8 361.2 l
209.52 361.2 m
210.24 361.44 l
210.48 361.92 l
210.96 362.4 l
211.2 364.32 l
211.2 365.28 l
210.96 366.96 l
210.48 367.68 l
210.24 368.16 l
209.52 368.4 l
258.24 367.68 m
258.24 361.2 l
258.48 368.4 m
258.48 361.2 l
258.48 368.4 m
254.88 363.12 l
260.4 363.12 l
257.28 361.2 m
259.68 361.2 l
264.24 368.4 m
263.04 368.16 l
262.32 366.96 l
262.08 365.28 l
262.08 364.32 l
262.32 362.4 l
263.04 361.44 l
264.24 361.2 l
264.72 361.2 l
265.92 361.44 l
266.64 362.4 l
266.88 364.32 l
266.88 365.28 l
266.64 366.96 l
265.92 368.16 l
264.72 368.4 l
264.24 368.4 l
263.52 368.16 l
263.04 367.68 l
262.8 366.96 l
262.32 365.28 l
262.32 364.32 l
262.8 362.4 l
263.04 361.92 l
263.52 361.44 l
264.24 361.2 l
264.72 361.2 m
265.44 361.44 l
265.92 361.92 l
266.16 362.4 l
266.64 364.32 l
266.64 365.28 l
266.16 366.96 l
265.92 367.68 l
265.44 368.16 l
264.72 368.4 l
270.96 368.4 m
270 368.16 l
269.28 366.96 l
269.04 365.28 l
269.04 364.32 l
269.28 362.4 l
270 361.44 l
270.96 361.2 l
271.68 361.2 l
272.88 361.44 l
273.6 362.4 l
273.84 364.32 l
273.84 365.28 l
273.6 366.96 l
272.88 368.16 l
271.68 368.4 l
270.96 368.4 l
S
270.96 368.4 m
270.48 368.16 l
270 367.68 l
269.76 366.96 l
269.28 365.28 l
269.28 364.32 l
269.76 362.4 l
270 361.92 l
270.48 361.44 l
270.96 361.2 l
271.68 361.2 m
272.4 361.44 l
272.88 361.92 l
273.12 362.4 l
273.6 364.32 l
273.6 365.28 l
273.12 366.96 l
272.88 367.68 l
272.4 368.16 l
271.68 368.4 l
321.6 367.44 m
321.12 366.96 l
321.6 366.72 l
321.84 366.96 l
321.84 367.44 l
321.6 368.16 l
320.88 368.4 l
319.92 368.4 l
318.72 368.16 l
318 367.44 l
317.76 366.72 l
317.52 365.28 l
317.52 363.12 l
317.76 362.16 l
318.48 361.44 l
319.44 361.2 l
320.16 361.2 l
321.12 361.44 l
321.84 362.16 l
322.32 363.12 l
322.32 363.6 l
321.84 364.56 l
321.12 365.28 l
320.16 365.52 l
319.92 365.52 l
318.72 365.28 l
318 364.56 l
317.76 363.6 l
319.92 368.4 m
319.2 368.16 l
318.48 367.44 l
318 366.72 l
317.76 365.28 l
317.76 363.12 l
318 362.16 l
318.72 361.44 l
319.44 361.2 l
320.16 361.2 m
320.88 361.44 l
321.6 362.16 l
321.84 363.12 l
321.84 363.6 l
321.6 364.56 l
320.88 365.28 l
320.16 365.52 l
326.4 368.4 m
325.44 368.16 l
324.72 366.96 l
324.24 365.28 l
324.24 364.32 l
324.72 362.4 l
325.44 361.44 l
326.4 361.2 l
327.12 361.2 l
328.08 361.44 l
328.8 362.4 l
329.28 364.32 l
329.28 365.28 l
328.8 366.96 l
328.08 368.16 l
327.12 368.4 l
326.4 368.4 l
325.68 368.16 l
325.44 367.68 l
324.96 366.96 l
324.72 365.28 l
324.72 364.32 l
324.96 362.4 l
325.44 361.92 l
325.68 361.44 l
326.4 361.2 l
327.12 361.2 m
327.84 361.44 l
328.08 361.92 l
328.56 362.4 l
328.8 364.32 l
328.8 365.28 l
328.56 366.96 l
328.08 367.68 l
327.84 368.16 l
327.12 368.4 l
333.36 368.4 m
332.4 368.16 l
331.68 366.96 l
331.2 365.28 l
331.2 364.32 l
331.68 362.4 l
332.4 361.44 l
333.36 361.2 l
334.08 361.2 l
335.04 361.44 l
335.76 362.4 l
336.24 364.32 l
336.24 365.28 l
335.76 366.96 l
335.04 368.16 l
334.08 368.4 l
333.36 368.4 l
332.64 368.16 l
332.4 367.68 l
331.92 366.96 l
331.68 365.28 l
331.68 364.32 l
331.92 362.4 l
332.4 361.92 l
332.64 361.44 l
333.36 361.2 l
334.08 361.2 m
334.8 361.44 l
335.04 361.92 l
335.52 362.4 l
335.76 364.32 l
335.76 365.28 l
335.52 366.96 l
335.04 367.68 l
334.8 368.16 l
334.08 368.4 l
S
381.36 368.4 m
380.4 368.16 l
380.16 367.44 l
380.16 366.24 l
380.4 365.52 l
381.36 365.28 l
382.8 365.28 l
383.76 365.52 l
384.24 366.24 l
384.24 367.44 l
383.76 368.16 l
382.8 368.4 l
381.36 368.4 l
380.64 368.16 l
380.4 367.44 l
380.4 366.24 l
380.64 365.52 l
381.36 365.28 l
382.8 365.28 m
383.52 365.52 l
383.76 366.24 l
383.76 367.44 l
383.52 368.16 l
382.8 368.4 l
381.36 365.28 m
380.4 365.04 l
380.16 364.56 l
379.68 363.84 l
379.68 362.4 l
380.16 361.92 l
380.4 361.44 l
381.36 361.2 l
382.8 361.2 l
383.76 361.44 l
384.24 361.92 l
384.48 362.4 l
384.48 363.84 l
384.24 364.56 l
383.76 365.04 l
382.8 365.28 l
381.36 365.28 m
380.64 365.04 l
380.4 364.56 l
380.16 363.84 l
380.16 362.4 l
380.64 361.44 l
381.36 361.2 l
382.8 361.2 m
383.52 361.44 l
383.76 361.92 l
384.24 362.4 l
384.24 363.84 l
383.76 364.56 l
383.52 365.04 l
382.8 365.28 l
388.8 368.4 m
387.6 368.16 l
386.88 366.96 l
386.64 365.28 l
386.64 364.32 l
386.88 362.4 l
387.6 361.44 l
388.8 361.2 l
389.28 361.2 l
390.48 361.44 l
391.2 362.4 l
391.44 364.32 l
391.44 365.28 l
391.2 366.96 l
390.48 368.16 l
389.28 368.4 l
388.8 368.4 l
388.08 368.16 l
387.6 367.68 l
387.36 366.96 l
386.88 365.28 l
386.88 364.32 l
387.36 362.4 l
387.6 361.92 l
388.08 361.44 l
388.8 361.2 l
389.28 361.2 m
390 361.44 l
390.48 361.92 l
390.72 362.4 l
391.2 364.32 l
391.2 365.28 l
390.72 366.96 l
390.48 367.68 l
390 368.16 l
389.28 368.4 l
395.52 368.4 m
394.56 368.16 l
393.84 366.96 l
393.6 365.28 l
393.6 364.32 l
393.84 362.4 l
394.56 361.44 l
395.52 361.2 l
396.24 361.2 l
397.44 361.44 l
398.16 362.4 l
398.4 364.32 l
398.4 365.28 l
398.16 366.96 l
397.44 368.16 l
396.24 368.4 l
395.52 368.4 l
395.04 368.16 l
394.56 367.68 l
394.32 366.96 l
393.84 365.28 l
393.84 364.32 l
394.32 362.4 l
394.56 361.92 l
395.04 361.44 l
395.52 361.2 l
396.24 361.2 m
396.96 361.44 l
397.44 361.92 l
397.68 362.4 l
398.16 364.32 l
398.16 365.28 l
397.68 366.96 l
397.44 367.68 l
396.96 368.16 l
396.24 368.4 l
439.44 366.96 m
440.16 367.44 l
441.36 368.4 l
441.36 361.2 l
S
440.88 368.16 m
440.88 361.2 l
439.44 361.2 m
442.56 361.2 l
447.6 368.4 m
446.4 368.16 l
445.68 366.96 l
445.44 365.28 l
445.44 364.32 l
445.68 362.4 l
446.4 361.44 l
447.6 361.2 l
448.32 361.2 l
449.28 361.44 l
450 362.4 l
450.24 364.32 l
450.24 365.28 l
450 366.96 l
449.28 368.16 l
448.32 368.4 l
447.6 368.4 l
446.88 368.16 l
446.4 367.68 l
446.16 366.96 l
445.68 365.28 l
445.68 364.32 l
446.16 362.4 l
446.4 361.92 l
446.88 361.44 l
447.6 361.2 l
448.32 361.2 m
448.8 361.44 l
449.28 361.92 l
449.52 362.4 l
450 364.32 l
450 365.28 l
449.52 366.96 l
449.28 367.68 l
448.8 368.16 l
448.32 368.4 l
454.56 368.4 m
453.36 368.16 l
452.64 366.96 l
452.4 365.28 l
452.4 364.32 l
452.64 362.4 l
453.36 361.44 l
454.56 361.2 l
455.04 361.2 l
456.24 361.44 l
456.96 362.4 l
457.2 364.32 l
457.2 365.28 l
456.96 366.96 l
456.24 368.16 l
455.04 368.4 l
454.56 368.4 l
453.84 368.16 l
453.36 367.68 l
453.12 366.96 l
452.64 365.28 l
452.64 364.32 l
453.12 362.4 l
453.36 361.92 l
453.84 361.44 l
454.56 361.2 l
455.04 361.2 m
455.76 361.44 l
456.24 361.92 l
456.48 362.4 l
456.96 364.32 l
456.96 365.28 l
456.48 366.96 l
456.24 367.68 l
455.76 368.16 l
455.04 368.4 l
461.28 368.4 m
460.32 368.16 l
459.6 366.96 l
459.36 365.28 l
459.36 364.32 l
459.6 362.4 l
460.32 361.44 l
461.28 361.2 l
462 361.2 l
463.2 361.44 l
463.92 362.4 l
464.16 364.32 l
464.16 365.28 l
463.92 366.96 l
463.2 368.16 l
462 368.4 l
461.28 368.4 l
460.8 368.16 l
460.32 367.68 l
460.08 366.96 l
459.6 365.28 l
459.6 364.32 l
460.08 362.4 l
460.32 361.92 l
460.8 361.44 l
461.28 361.2 l
462 361.2 m
462.72 361.44 l
463.2 361.92 l
463.44 362.4 l
463.92 364.32 l
463.92 365.28 l
463.44 366.96 l
463.2 367.68 l
462.72 368.16 l
462 368.4 l
139.92 549.6 m
139.92 562.08 l
152.4 562.08 m
152.4 558 l
164.88 558 m
164.88 562.08 l
177.36 562.08 m
177.36 558 l
189.84 558 m
189.84 562.08 l
202.08 562.08 m
202.08 549.6 l
214.56 558 m
214.56 562.08 l
227.04 562.08 m
227.04 558 l
S
239.52 558 m
239.52 562.08 l
252 562.08 m
252 558 l
264.48 549.6 m
264.48 562.08 l
276.96 562.08 m
276.96 558 l
289.44 558 m
289.44 562.08 l
301.92 562.08 m
301.92 558 l
314.4 558 m
314.4 562.08 l
326.64 562.08 m
326.64 549.6 l
339.12 558 m
339.12 562.08 l
351.6 562.08 m
351.6 558 l
364.08 558 m
364.08 562.08 l
376.56 562.08 m
376.56 558 l
389.04 549.6 m
389.04 562.08 l
401.52 562.08 m
401.52 558 l
414 558 m
414 562.08 l
426.48 562.08 m
426.48 558 l
438.96 558 m
438.96 562.08 l
451.44 562.08 m
451.44 549.6 l
139.92 375.12 m
144 375.12 l
144 383.04 m
139.92 383.04 l
139.92 390.72 m
144 390.72 l
144 398.64 m
139.92 398.64 l
139.92 406.32 m
152.4 406.32 l
144 414.24 m
139.92 414.24 l
139.92 421.92 m
144 421.92 l
144 429.84 m
139.92 429.84 l
139.92 437.52 m
144 437.52 l
152.4 445.2 m
139.92 445.2 l
139.92 453.12 m
144 453.12 l
144 460.8 m
139.92 460.8 l
139.92 468.72 m
144 468.72 l
144 476.4 m
139.92 476.4 l
139.92 484.32 m
152.4 484.32 l
144 492 m
139.92 492 l
139.92 499.68 m
144 499.68 l
144 507.6 m
139.92 507.6 l
139.92 515.28 m
144 515.28 l
152.4 523.2 m
139.92 523.2 l
139.92 530.88 m
144 530.88 l
144 538.8 m
139.92 538.8 l
139.92 546.48 m
144 546.48 l
144 554.4 m
139.92 554.4 l
139.92 562.08 m
152.4 562.08 l
93.84 409.44 m
92.88 409.2 l
92.16 408 l
91.92 406.32 l
91.92 405.36 l
92.16 403.68 l
92.88 402.48 l
93.84 402.24 l
94.56 402.24 l
95.52 402.48 l
96.24 403.68 l
96.72 405.36 l
96.72 406.32 l
96.24 408 l
95.52 409.2 l
94.56 409.44 l
93.84 409.44 l
93.12 409.2 l
92.88 408.72 l
92.4 408 l
92.16 406.32 l
92.16 405.36 l
92.4 403.68 l
92.88 402.96 l
93.12 402.48 l
93.84 402.24 l
94.56 402.24 m
95.28 402.48 l
95.52 402.96 l
96 403.68 l
96.24 405.36 l
96.24 406.32 l
96 408 l
95.52 408.72 l
95.28 409.2 l
94.56 409.44 l
99.36 402.96 m
99.12 402.48 l
99.36 402.24 l
99.84 402.48 l
99.36 402.96 l
104.4 409.44 m
103.2 409.2 l
102.48 408 l
102.24 406.32 l
102.24 405.36 l
102.48 403.68 l
103.2 402.48 l
104.4 402.24 l
104.88 402.24 l
106.08 402.48 l
106.8 403.68 l
107.04 405.36 l
107.04 406.32 l
106.8 408 l
106.08 409.2 l
104.88 409.44 l
104.4 409.44 l
S
104.4 409.44 m
103.68 409.2 l
103.2 408.72 l
102.96 408 l
102.48 406.32 l
102.48 405.36 l
102.96 403.68 l
103.2 402.96 l
103.68 402.48 l
104.4 402.24 l
104.88 402.24 m
105.6 402.48 l
106.08 402.96 l
106.32 403.68 l
106.8 405.36 l
106.8 406.32 l
106.32 408 l
106.08 408.72 l
105.6 409.2 l
104.88 409.44 l
111.12 409.44 m
110.16 409.2 l
109.44 408 l
109.2 406.32 l
109.2 405.36 l
109.44 403.68 l
110.16 402.48 l
111.12 402.24 l
111.84 402.24 l
113.04 402.48 l
113.76 403.68 l
114 405.36 l
114 406.32 l
113.76 408 l
113.04 409.2 l
111.84 409.44 l
111.12 409.44 l
110.64 409.2 l
110.16 408.72 l
109.92 408 l
109.44 406.32 l
109.44 405.36 l
109.92 403.68 l
110.16 402.96 l
110.64 402.48 l
111.12 402.24 l
111.84 402.24 m
112.56 402.48 l
113.04 402.96 l
113.28 403.68 l
113.76 405.36 l
113.76 406.32 l
113.28 408 l
113.04 408.72 l
112.56 409.2 l
111.84 409.44 l
118.08 409.44 m
117.12 409.2 l
116.4 408 l
116.16 406.32 l
116.16 405.36 l
116.4 403.68 l
117.12 402.48 l
118.08 402.24 l
118.8 402.24 l
120 402.48 l
120.48 403.68 l
120.96 405.36 l
120.96 406.32 l
120.48 408 l
120 409.2 l
118.8 409.44 l
118.08 409.44 l
117.36 409.2 l
117.12 408.72 l
116.88 408 l
116.4 406.32 l
116.4 405.36 l
116.88 403.68 l
117.12 402.96 l
117.36 402.48 l
118.08 402.24 l
118.8 402.24 m
119.52 402.48 l
120 402.96 l
120.24 403.68 l
120.48 405.36 l
120.48 406.32 l
120.24 408 l
120 408.72 l
119.52 409.2 l
118.8 409.44 l
125.04 409.44 m
124.08 409.2 l
123.36 408 l
123.12 406.32 l
123.12 405.36 l
123.36 403.68 l
124.08 402.48 l
125.04 402.24 l
125.76 402.24 l
126.72 402.48 l
127.44 403.68 l
127.92 405.36 l
127.92 406.32 l
127.44 408 l
126.72 409.2 l
125.76 409.44 l
125.04 409.44 l
124.32 409.2 l
124.08 408.72 l
123.6 408 l
123.36 406.32 l
123.36 405.36 l
123.6 403.68 l
124.08 402.96 l
124.32 402.48 l
125.04 402.24 l
125.76 402.24 m
126.48 402.48 l
126.72 402.96 l
127.2 403.68 l
127.44 405.36 l
127.44 406.32 l
127.2 408 l
126.72 408.72 l
126.48 409.2 l
125.76 409.44 l
S
132 409.44 m
131.04 409.2 l
130.32 408 l
129.84 406.32 l
129.84 405.36 l
130.32 403.68 l
131.04 402.48 l
132 402.24 l
132.72 402.24 l
133.68 402.48 l
134.4 403.68 l
134.88 405.36 l
134.88 406.32 l
134.4 408 l
133.68 409.2 l
132.72 409.44 l
132 409.44 l
131.28 409.2 l
131.04 408.72 l
130.56 408 l
130.32 406.32 l
130.32 405.36 l
130.56 403.68 l
131.04 402.96 l
131.28 402.48 l
132 402.24 l
132.72 402.24 m
133.44 402.48 l
133.68 402.96 l
134.16 403.68 l
134.4 405.36 l
134.4 406.32 l
134.16 408 l
133.68 408.72 l
133.44 409.2 l
132.72 409.44 l
93.84 448.32 m
92.88 448.08 l
92.16 447.12 l
91.92 445.2 l
91.92 444.24 l
92.16 442.56 l
92.88 441.6 l
93.84 441.12 l
94.56 441.12 l
95.52 441.6 l
96.24 442.56 l
96.72 444.24 l
96.72 445.2 l
96.24 447.12 l
95.52 448.08 l
94.56 448.32 l
93.84 448.32 l
93.12 448.08 l
92.88 447.84 l
92.4 447.12 l
92.16 445.2 l
92.16 444.24 l
92.4 442.56 l
92.88 441.84 l
93.12 441.6 l
93.84 441.12 l
94.56 441.12 m
95.28 441.6 l
95.52 441.84 l
96 442.56 l
96.24 444.24 l
96.24 445.2 l
96 447.12 l
95.52 447.84 l
95.28 448.08 l
94.56 448.32 l
99.36 441.84 m
99.12 441.6 l
99.36 441.12 l
99.84 441.6 l
99.36 441.84 l
104.4 448.32 m
103.2 448.08 l
102.48 447.12 l
102.24 445.2 l
102.24 444.24 l
102.48 442.56 l
103.2 441.6 l
104.4 441.12 l
104.88 441.12 l
106.08 441.6 l
106.8 442.56 l
107.04 444.24 l
107.04 445.2 l
106.8 447.12 l
106.08 448.08 l
104.88 448.32 l
104.4 448.32 l
103.68 448.08 l
103.2 447.84 l
102.96 447.12 l
102.48 445.2 l
102.48 444.24 l
102.96 442.56 l
103.2 441.84 l
103.68 441.6 l
104.4 441.12 l
104.88 441.12 m
105.6 441.6 l
106.08 441.84 l
106.32 442.56 l
106.8 444.24 l
106.8 445.2 l
106.32 447.12 l
106.08 447.84 l
105.6 448.08 l
104.88 448.32 l
111.12 448.32 m
110.16 448.08 l
109.44 447.12 l
109.2 445.2 l
109.2 444.24 l
109.44 442.56 l
110.16 441.6 l
111.12 441.12 l
111.84 441.12 l
113.04 441.6 l
113.76 442.56 l
114 444.24 l
114 445.2 l
113.76 447.12 l
113.04 448.08 l
111.84 448.32 l
111.12 448.32 l
S
111.12 448.32 m
110.16 447.84 l
109.92 447.12 l
109.44 445.2 l
109.44 444.24 l
109.92 442.56 l
110.16 441.84 l
110.64 441.6 l
111.12 441.12 l
111.84 441.12 m
112.56 441.6 l
113.04 441.84 l
113.28 442.56 l
113.76 444.24 l
113.76 445.2 l
113.28 447.12 l
113.04 447.84 l
112.56 448.08 l
111.84 448.32 l
118.08 448.32 m
117.12 448.08 l
116.4 447.12 l
116.16 445.2 l
116.16 444.24 l
116.4 442.56 l
117.12 441.6 l
118.08 441.12 l
118.8 441.12 l
120 441.6 l
120.48 442.56 l
120.96 444.24 l
120.96 445.2 l
120.48 447.12 l
120 448.08 l
118.8 448.32 l
118.08 448.32 l
117.36 448.08 l
117.12 447.84 l
116.88 447.12 l
116.4 445.2 l
116.4 444.24 l
116.88 442.56 l
117.12 441.84 l
117.36 441.6 l
118.08 441.12 l
118.8 441.12 m
119.52 441.6 l
120 441.84 l
120.24 442.56 l
120.48 444.24 l
120.48 445.2 l
120.24 447.12 l
120 447.84 l
119.52 448.08 l
118.8 448.32 l
123.36 447.12 m
123.6 446.64 l
123.36 446.4 l
123.12 446.64 l
123.12 447.12 l
123.36 447.84 l
123.6 448.08 l
124.8 448.32 l
126.24 448.32 l
127.2 448.08 l
127.44 447.84 l
127.92 447.12 l
127.92 446.4 l
127.44 445.68 l
126.48 444.96 l
124.8 444.24 l
124.08 444 l
123.36 443.28 l
123.12 442.08 l
123.12 441.12 l
126.24 448.32 m
127.2 447.84 l
127.44 447.12 l
127.44 446.4 l
127.2 445.68 l
126.24 444.96 l
124.8 444.24 l
123.12 441.84 m
123.36 442.08 l
124.08 442.08 l
125.76 441.6 l
126.72 441.6 l
127.44 441.84 l
127.92 442.08 l
124.08 442.08 m
125.76 441.12 l
127.2 441.12 l
127.44 441.6 l
127.92 442.08 l
127.92 442.8 l
130.56 448.32 m
129.84 444.96 l
130.56 445.68 l
131.76 445.92 l
132.72 445.92 l
133.68 445.68 l
134.4 444.96 l
134.88 444 l
134.88 443.28 l
134.4 442.08 l
133.68 441.6 l
132.72 441.12 l
131.76 441.12 l
130.56 441.6 l
130.32 441.84 l
129.84 442.56 l
129.84 442.8 l
130.32 443.28 l
130.56 442.8 l
130.32 442.56 l
132.72 445.92 m
133.44 445.68 l
134.16 444.96 l
134.4 444 l
134.4 443.28 l
134.16 442.08 l
132.72 441.12 l
130.56 448.32 m
134.16 448.32 l
130.56 448.08 m
132.48 448.08 l
134.16 448.32 l
93.84 487.44 m
92.88 486.96 l
92.16 486 l
91.92 484.32 l
91.92 483.12 l
92.16 481.44 l
92.88 480.48 l
93.84 480 l
94.56 480 l
95.52 480.48 l
96.24 481.44 l
96.72 483.12 l
96.72 484.32 l
96.24 486 l
95.52 486.96 l
94.56 487.44 l
93.84 487.44 l
S
93.84 487.44 m
93.12 486.96 l
92.88 486.72 l
92.4 486 l
92.16 484.32 l
92.16 483.12 l
92.4 481.44 l
92.88 480.72 l
93.12 480.48 l
93.84 480 l
94.56 480 m
95.28 480.48 l
95.52 480.72 l
96 481.44 l
96.24 483.12 l
96.24 484.32 l
96 486 l
95.52 486.72 l
95.28 486.96 l
94.56 487.44 l
99.36 480.72 m
99.12 480.48 l
99.36 480 l
99.84 480.48 l
99.36 480.72 l
104.4 487.44 m
103.2 486.96 l
102.48 486 l
102.24 484.32 l
102.24 483.12 l
102.48 481.44 l
103.2 480.48 l
104.4 480 l
104.88 480 l
106.08 480.48 l
106.8 481.44 l
107.04 483.12 l
107.04 484.32 l
106.8 486 l
106.08 486.96 l
104.88 487.44 l
104.4 487.44 l
103.68 486.96 l
103.2 486.72 l
102.96 486 l
102.48 484.32 l
102.48 483.12 l
102.96 481.44 l
103.2 480.72 l
103.68 480.48 l
104.4 480 l
104.88 480 m
105.6 480.48 l
106.08 480.72 l
106.32 481.44 l
106.8 483.12 l
106.8 484.32 l
106.32 486 l
106.08 486.72 l
105.6 486.96 l
104.88 487.44 l
111.12 487.44 m
110.16 486.96 l
109.44 486 l
109.2 484.32 l
109.2 483.12 l
109.44 481.44 l
110.16 480.48 l
111.12 480 l
111.84 480 l
113.04 480.48 l
113.76 481.44 l
114 483.12 l
114 484.32 l
113.76 486 l
113.04 486.96 l
111.84 487.44 l
111.12 487.44 l
110.64 486.96 l
110.16 486.72 l
109.92 486 l
109.44 484.32 l
109.44 483.12 l
109.92 481.44 l
110.16 480.72 l
110.64 480.48 l
111.12 480 l
111.84 480 m
112.56 480.48 l
113.04 480.72 l
113.28 481.44 l
113.76 483.12 l
113.76 484.32 l
113.28 486 l
113.04 486.72 l
112.56 486.96 l
111.84 487.44 l
118.08 487.44 m
117.12 486.96 l
116.4 486 l
116.16 484.32 l
116.16 483.12 l
116.4 481.44 l
117.12 480.48 l
118.08 480 l
118.8 480 l
120 480.48 l
120.48 481.44 l
120.96 483.12 l
120.96 484.32 l
120.48 486 l
120 486.96 l
118.8 487.44 l
118.08 487.44 l
117.36 486.96 l
117.12 486.72 l
116.88 486 l
116.4 484.32 l
116.4 483.12 l
116.88 481.44 l
117.12 480.72 l
117.36 480.48 l
118.08 480 l
118.8 480 m
119.52 480.48 l
120 480.72 l
120.24 481.44 l
120.48 483.12 l
120.48 484.32 l
120.24 486 l
120 486.72 l
119.52 486.96 l
118.8 487.44 l
S
123.6 487.44 m
123.12 483.84 l
123.6 484.56 l
124.8 485.04 l
125.76 485.04 l
126.72 484.56 l
127.44 483.84 l
127.92 482.88 l
127.92 482.16 l
127.44 481.2 l
126.72 480.48 l
125.76 480 l
124.8 480 l
123.6 480.48 l
123.36 480.72 l
123.12 481.44 l
123.12 481.92 l
123.36 482.16 l
123.6 481.92 l
123.36 481.44 l
125.76 485.04 m
126.48 484.56 l
127.2 483.84 l
127.44 482.88 l
127.44 482.16 l
127.2 481.2 l
126.48 480.48 l
125.76 480 l
123.6 487.44 m
127.2 487.44 l
123.6 486.96 m
125.52 486.96 l
127.2 487.44 l
132 487.44 m
131.04 486.96 l
130.32 486 l
129.84 484.32 l
129.84 483.12 l
130.32 481.44 l
131.04 480.48 l
132 480 l
132.72 480 l
133.68 480.48 l
134.4 481.44 l
134.88 483.12 l
134.88 484.32 l
134.4 486 l
133.68 486.96 l
132.72 487.44 l
132 487.44 l
131.28 486.96 l
131.04 486.72 l
130.56 486 l
130.32 484.32 l
130.32 483.12 l
130.56 481.44 l
131.04 480.72 l
131.28 480.48 l
132 480 l
132.72 480 m
133.44 480.48 l
133.68 480.72 l
134.16 481.44 l
134.4 483.12 l
134.4 484.32 l
134.16 486 l
133.68 486.72 l
133.44 486.96 l
132.72 487.44 l
93.84 526.32 m
92.88 525.84 l
92.16 524.88 l
91.92 523.2 l
91.92 522 l
92.16 520.32 l
92.88 519.36 l
93.84 518.88 l
94.56 518.88 l
95.52 519.36 l
96.24 520.32 l
96.72 522 l
96.72 523.2 l
96.24 524.88 l
95.52 525.84 l
94.56 526.32 l
93.84 526.32 l
93.12 525.84 l
92.88 525.6 l
92.4 524.88 l
92.16 523.2 l
92.16 522 l
92.4 520.32 l
92.88 519.6 l
93.12 519.36 l
93.84 518.88 l
94.56 518.88 m
95.28 519.36 l
95.52 519.6 l
96 520.32 l
96.24 522 l
96.24 523.2 l
96 524.88 l
95.52 525.6 l
95.28 525.84 l
94.56 526.32 l
99.36 519.6 m
99.12 519.36 l
99.36 518.88 l
99.84 519.36 l
99.36 519.6 l
104.4 526.32 m
103.2 525.84 l
102.48 524.88 l
102.24 523.2 l
102.24 522 l
102.48 520.32 l
103.2 519.36 l
104.4 518.88 l
104.88 518.88 l
106.08 519.36 l
106.8 520.32 l
107.04 522 l
107.04 523.2 l
106.8 524.88 l
106.08 525.84 l
104.88 526.32 l
104.4 526.32 l
S
104.4 526.32 m
103.68 525.84 l
103.2 525.6 l
102.96 524.88 l
102.48 523.2 l
102.48 522 l
102.96 520.32 l
103.2 519.6 l
103.68 519.36 l
104.4 518.88 l
104.88 518.88 m
105.6 519.36 l
106.08 519.6 l
106.32 520.32 l
106.8 522 l
106.8 523.2 l
106.32 524.88 l
106.08 525.6 l
105.6 525.84 l
104.88 526.32 l
111.12 526.32 m
110.16 525.84 l
109.44 524.88 l
109.2 523.2 l
109.2 522 l
109.44 520.32 l
110.16 519.36 l
111.12 518.88 l
111.84 518.88 l
113.04 519.36 l
113.76 520.32 l
114 522 l
114 523.2 l
113.76 524.88 l
113.04 525.84 l
111.84 526.32 l
111.12 526.32 l
110.64 525.84 l
110.16 525.6 l
109.92 524.88 l
109.44 523.2 l
109.44 522 l
109.92 520.32 l
110.16 519.6 l
110.64 519.36 l
111.12 518.88 l
111.84 518.88 m
112.56 519.36 l
113.04 519.6 l
113.28 520.32 l
113.76 522 l
113.76 523.2 l
113.28 524.88 l
113.04 525.6 l
112.56 525.84 l
111.84 526.32 l
118.08 526.32 m
117.12 525.84 l
116.4 524.88 l
116.16 523.2 l
116.16 522 l
116.4 520.32 l
117.12 519.36 l
118.08 518.88 l
118.8 518.88 l
120 519.36 l
120.48 520.32 l
120.96 522 l
120.96 523.2 l
120.48 524.88 l
120 525.84 l
118.8 526.32 l
118.08 526.32 l
117.36 525.84 l
117.12 525.6 l
116.88 524.88 l
116.4 523.2 l
116.4 522 l
116.88 520.32 l
117.12 519.6 l
117.36 519.36 l
118.08 518.88 l
118.8 518.88 m
119.52 519.36 l
120 519.6 l
120.24 520.32 l
120.48 522 l
120.48 523.2 l
120.24 524.88 l
120 525.6 l
119.52 525.84 l
118.8 526.32 l
123.12 526.32 m
123.12 524.16 l
123.12 524.88 m
123.36 525.6 l
124.08 526.32 l
124.8 526.32 l
126.48 525.12 l
127.2 525.12 l
127.44 525.6 l
127.92 526.32 l
123.36 525.6 m
124.08 525.84 l
124.8 525.84 l
126.48 525.12 l
127.92 526.32 m
127.92 525.12 l
127.44 524.16 l
126.24 522.48 l
125.76 521.76 l
125.52 520.8 l
125.52 518.88 l
127.44 524.16 m
125.76 522.48 l
125.52 521.76 l
125.04 520.8 l
125.04 518.88 l
130.56 526.32 m
129.84 522.72 l
130.56 523.44 l
131.76 523.92 l
132.72 523.92 l
133.68 523.44 l
134.4 522.72 l
134.88 521.76 l
134.88 521.04 l
134.4 520.08 l
133.68 519.36 l
132.72 518.88 l
131.76 518.88 l
130.56 519.36 l
130.32 519.6 l
129.84 520.32 l
129.84 520.8 l
130.32 521.04 l
130.56 520.8 l
130.32 520.32 l
S
132.72 523.92 m
133.44 523.44 l
134.16 522.72 l
134.4 521.76 l
134.4 521.04 l
134.16 520.08 l
133.44 519.36 l
132.72 518.88 l
130.56 526.32 m
134.16 526.32 l
130.56 525.84 m
132.48 525.84 l
134.16 526.32 l
93.84 565.2 m
92.88 564.96 l
92.16 563.76 l
91.92 562.08 l
91.92 561.12 l
92.16 559.2 l
92.88 558.24 l
93.84 558 l
94.56 558 l
95.52 558.24 l
96.24 559.2 l
96.72 561.12 l
96.72 562.08 l
96.24 563.76 l
95.52 564.96 l
94.56 565.2 l
93.84 565.2 l
93.12 564.96 l
92.88 564.48 l
92.4 563.76 l
92.16 562.08 l
92.16 561.12 l
92.4 559.2 l
92.88 558.72 l
93.12 558.24 l
93.84 558 l
94.56 558 m
95.28 558.24 l
95.52 558.72 l
96 559.2 l
96.24 561.12 l
96.24 562.08 l
96 563.76 l
95.52 564.48 l
95.28 564.96 l
94.56 565.2 l
99.36 558.72 m
99.12 558.24 l
99.36 558 l
99.84 558.24 l
99.36 558.72 l
104.4 565.2 m
103.2 564.96 l
102.48 563.76 l
102.24 562.08 l
102.24 561.12 l
102.48 559.2 l
103.2 558.24 l
104.4 558 l
104.88 558 l
106.08 558.24 l
106.8 559.2 l
107.04 561.12 l
107.04 562.08 l
106.8 563.76 l
106.08 564.96 l
104.88 565.2 l
104.4 565.2 l
103.68 564.96 l
103.2 564.48 l
102.96 563.76 l
102.48 562.08 l
102.48 561.12 l
102.96 559.2 l
103.2 558.72 l
103.68 558.24 l
104.4 558 l
104.88 558 m
105.6 558.24 l
106.08 558.72 l
106.32 559.2 l
106.8 561.12 l
106.8 562.08 l
106.32 563.76 l
106.08 564.48 l
105.6 564.96 l
104.88 565.2 l
111.12 565.2 m
110.16 564.96 l
109.44 563.76 l
109.2 562.08 l
109.2 561.12 l
109.44 559.2 l
110.16 558.24 l
111.12 558 l
111.84 558 l
113.04 558.24 l
113.76 559.2 l
114 561.12 l
114 562.08 l
113.76 563.76 l
113.04 564.96 l
111.84 565.2 l
111.12 565.2 l
110.64 564.96 l
110.16 564.48 l
109.92 563.76 l
109.44 562.08 l
109.44 561.12 l
109.92 559.2 l
110.16 558.72 l
110.64 558.24 l
111.12 558 l
111.84 558 m
112.56 558.24 l
113.04 558.72 l
113.28 559.2 l
113.76 561.12 l
113.76 562.08 l
113.28 563.76 l
113.04 564.48 l
112.56 564.96 l
111.84 565.2 l
117.12 563.76 m
117.84 564.24 l
118.8 565.2 l
118.8 558 l
S
118.56 564.96 m
118.56 558 l
117.12 558 m
120.24 558 l
125.04 565.2 m
124.08 564.96 l
123.36 563.76 l
123.12 562.08 l
123.12 561.12 l
123.36 559.2 l
124.08 558.24 l
125.04 558 l
125.76 558 l
126.72 558.24 l
127.44 559.2 l
127.92 561.12 l
127.92 562.08 l
127.44 563.76 l
126.72 564.96 l
125.76 565.2 l
125.04 565.2 l
124.32 564.96 l
124.08 564.48 l
123.6 563.76 l
123.36 562.08 l
123.36 561.12 l
123.6 559.2 l
124.08 558.72 l
124.32 558.24 l
125.04 558 l
125.76 558 m
126.48 558.24 l
126.72 558.72 l
127.2 559.2 l
127.44 561.12 l
127.44 562.08 l
127.2 563.76 l
126.72 564.48 l
126.48 564.96 l
125.76 565.2 l
132 565.2 m
131.04 564.96 l
130.32 563.76 l
129.84 562.08 l
129.84 561.12 l
130.32 559.2 l
131.04 558.24 l
132 558 l
132.72 558 l
133.68 558.24 l
134.4 559.2 l
134.88 561.12 l
134.88 562.08 l
134.4 563.76 l
133.68 564.96 l
132.72 565.2 l
132 565.2 l
131.28 564.96 l
131.04 564.48 l
130.56 563.76 l
130.32 562.08 l
130.32 561.12 l
130.56 559.2 l
131.04 558.72 l
131.28 558.24 l
132 558 l
132.72 558 m
133.44 558.24 l
133.68 558.72 l
134.16 559.2 l
134.4 561.12 l
134.4 562.08 l
134.16 563.76 l
133.68 564.48 l
133.44 564.96 l
132.72 565.2 l
447.12 375.12 m
451.44 375.12 l
451.44 383.04 m
447.12 383.04 l
447.12 390.72 m
451.44 390.72 l
451.44 398.64 m
447.12 398.64 l
438.96 406.32 m
451.44 406.32 l
451.44 414.24 m
447.12 414.24 l
447.12 421.92 m
451.44 421.92 l
451.44 429.84 m
447.12 429.84 l
447.12 437.52 m
451.44 437.52 l
451.44 445.2 m
438.96 445.2 l
447.12 453.12 m
451.44 453.12 l
451.44 460.8 m
447.12 460.8 l
447.12 468.72 m
451.44 468.72 l
451.44 476.4 m
447.12 476.4 l
438.96 484.32 m
451.44 484.32 l
451.44 492 m
447.12 492 l
447.12 499.68 m
451.44 499.68 l
451.44 507.6 m
447.12 507.6 l
447.12 515.28 m
451.44 515.28 l
451.44 523.2 m
438.96 523.2 l
447.12 530.88 m
451.44 530.88 l
451.44 538.8 m
447.12 538.8 l
447.12 546.48 m
451.44 546.48 l
451.44 554.4 m
447.12 554.4 l
438.96 562.08 m
451.44 562.08 l
S
[1 0 0] SC
139.92 406.32 m
147.6 406.32 l
147.6 407.28 l
155.52 407.28 l
155.52 410.16 l
163.2 410.16 l
163.2 417.6 l
171.12 417.6 l
171.12 428.88 l
178.8 428.88 l
178.8 446.88 l
186.72 446.88 l
186.72 467.04 l
194.4 467.04 l
194.4 476.16 l
202.08 476.16 l
202.08 484.32 l
210 484.32 l
210 489.36 l
217.68 489.36 l
217.68 495.12 l
225.6 495.12 l
225.6 498.96 l
233.28 498.96 l
233.28 500.16 l
241.2 500.16 l
241.2 494.64 l
248.88 494.64 l
248.88 492.48 l
256.8 492.48 l
256.8 484.8 l
264.48 484.8 l
264.48 480.96 l
272.16 480.96 l
272.16 473.52 l
280.08 473.52 l
280.08 467.76 l
287.76 467.76 l
287.76 461.28 l
295.68 461.28 l
295.68 452.88 l
303.36 452.88 l
303.36 447.84 l
311.28 447.84 l
311.28 442.32 l
318.96 442.32 l
318.96 436.32 l
326.64 436.32 l
326.64 430.32 l
334.56 430.32 l
334.56 425.52 l
342.24 425.52 l
342.24 421.2 l
350.16 421.2 l
350.16 417.84 l
357.84 417.84 l
357.84 414.72 l
365.76 414.72 l
365.76 412.32 l
373.44 412.32 l
373.44 410.64 l
381.36 410.64 l
381.36 409.2 l
389.04 409.2 l
389.04 408 l
396.72 408 l
396.72 407.28 l
404.64 407.28 l
404.64 406.8 l
412.32 406.8 l
412.32 406.56 l
427.92 406.56 l
427.92 406.32 l
451.44 406.32 l
S
[0 0 0] SC
260.16 226.32 m
260.16 215.28 l
260.64 226.32 m
263.76 216.96 l
260.16 226.32 m
263.76 215.28 l
267.6 226.32 m
263.76 215.28 l
267.6 226.32 m
267.6 215.28 l
268.08 226.32 m
268.08 215.28 l
258.72 226.32 m
260.64 226.32 l
267.6 226.32 m
269.52 226.32 l
258.72 215.28 m
261.84 215.28 l
265.92 215.28 m
269.52 215.28 l
274.56 218.4 m
274.56 211.2 l
274.8 218.4 m
274.8 211.2 l
272.4 218.4 m
271.92 216.48 l
271.92 218.4 l
277.2 218.4 l
277.2 216.48 l
276.96 218.4 l
273.36 211.2 m
275.76 211.2 l
288.96 228.48 m
288.96 211.68 l
289.44 228.48 m
289.44 211.68 l
288.96 228.48 m
292.56 228.48 l
288.96 211.68 m
292.56 211.68 l
303.12 224.64 m
303.6 223.2 l
303.6 226.32 l
303.12 224.64 l
301.92 225.84 l
300.48 226.32 l
299.28 226.32 l
297.84 225.84 l
296.88 224.64 l
296.16 223.68 l
295.68 222.24 l
295.68 219.6 l
296.16 217.92 l
296.88 216.96 l
297.84 216 l
299.28 215.28 l
300.48 215.28 l
301.92 216 l
303.12 216.96 l
299.28 226.32 m
298.32 225.84 l
297.36 224.64 l
296.16 222.24 l
296.16 219.6 l
296.88 217.92 l
297.36 216.96 l
298.32 216 l
299.28 215.28 l
303.12 219.6 m
303.12 215.28 l
303.6 219.6 m
303.6 215.28 l
301.44 219.6 m
305.04 219.6 l
308.16 219.6 m
314.4 219.6 l
314.4 220.56 l
313.92 221.52 l
313.44 222.24 l
312.48 222.72 l
310.8 222.72 l
309.36 222.24 l
308.16 221.04 l
307.68 219.6 l
307.68 218.4 l
308.16 216.96 l
309.36 216 l
310.8 215.28 l
311.76 215.28 l
313.44 216 l
314.4 216.96 l
313.92 219.6 m
313.92 221.04 l
313.44 222.24 l
310.8 222.72 m
309.84 222.24 l
308.64 221.04 l
308.16 219.6 l
308.16 218.4 l
308.64 216.96 l
309.84 216 l
310.8 215.28 l
317.52 226.32 m
321.12 215.28 l
318 226.32 m
321.12 216.96 l
324.96 226.32 m
321.12 215.28 l
316.56 226.32 m
319.68 226.32 l
322.8 226.32 m
325.92 226.32 l
331.2 228.48 m
331.2 211.68 l
331.68 228.48 m
331.68 211.68 l
328.08 228.48 m
331.68 228.48 l
328.08 211.68 m
331.68 211.68 l
73.2 282.48 m
73.2 277.2 l
73.68 275.76 l
75.36 274.8 l
76.8 274.32 l
78.48 274.32 l
79.44 274.8 l
79.92 275.28 l
80.64 276.24 l
80.64 277.2 l
79.92 278.88 l
78.48 279.84 l
76.8 280.32 l
75.36 280.32 l
74.4 279.84 l
73.68 279.36 l
73.2 278.4 l
S
73.2 277.2 m
73.68 276.24 l
75.36 275.28 l
76.8 274.8 l
78.96 274.8 l
79.92 275.28 l
80.64 277.2 m
79.92 278.4 l
78.48 279.36 l
76.8 279.84 l
74.88 279.84 l
73.68 279.36 l
73.68 282.48 l
77.52 286.08 m
84.72 286.08 l
77.52 286.32 m
84.72 286.32 l
77.52 290.4 m
84.72 290.4 l
77.52 290.88 m
84.72 290.88 l
77.52 284.88 m
77.52 287.28 l
77.52 289.44 m
77.52 291.84 l
80.88 286.32 m
80.88 290.4 l
84.72 284.88 m
84.72 287.28 l
84.72 289.44 m
84.72 291.84 l
84.72 294.24 m
84.48 294 l
84 294.24 l
84.48 294.72 l
84.96 294.72 l
85.68 294.24 l
86.16 294 l
77.52 297.84 m
77.76 297.36 l
78.24 297.84 l
77.76 298.08 l
77.52 297.84 l
79.92 297.84 m
84.72 297.84 l
79.92 298.08 m
84.72 298.08 l
79.92 296.64 m
79.92 298.08 l
84.72 296.64 m
84.72 299.04 l
67.68 311.04 m
84.24 301.68 l
73.2 321.84 m
73.2 316.56 l
73.68 315.12 l
75.36 314.16 l
76.8 313.44 l
78.48 313.44 l
79.44 314.16 l
79.92 314.64 l
80.64 315.6 l
80.64 316.56 l
79.92 318.24 l
78.48 319.2 l
76.8 319.68 l
75.36 319.68 l
74.4 319.2 l
73.68 318.72 l
73.2 317.76 l
73.2 316.56 m
73.68 315.6 l
75.36 314.64 l
76.8 314.16 l
78.96 314.16 l
79.92 314.64 l
80.64 316.56 m
79.92 317.76 l
78.48 318.72 l
76.8 319.2 l
74.88 319.2 l
73.68 318.72 l
73.68 321.84 l
77.52 325.2 m
84.72 325.2 l
77.52 325.68 m
84.72 325.68 l
77.52 329.76 m
84.72 329.76 l
77.52 330.24 m
84.72 330.24 l
77.52 324.24 m
77.52 326.64 l
77.52 328.8 m
77.52 331.2 l
80.88 325.68 m
80.88 329.76 l
84.72 324.24 m
84.72 326.64 l
84.72 328.8 m
84.72 331.2 l
S
[0 0 1] SC
172.56 521.52 m
167.52 521.52 l
165.84 521.04 l
164.88 519.6 l
164.4 517.92 l
164.4 516.48 l
164.88 515.28 l
165.36 514.8 l
166.32 514.32 l
167.52 514.32 l
168.96 514.8 l
169.92 516.48 l
170.64 517.92 l
170.64 519.6 l
169.92 520.56 l
169.44 521.04 l
168.48 521.52 l
167.52 521.52 m
166.32 521.04 l
165.36 519.6 l
164.88 517.92 l
164.88 516 l
165.36 514.8 l
167.52 514.32 m
168.48 514.8 l
169.44 516.48 l
169.92 517.92 l
169.92 520.08 l
169.44 521.04 l
172.56 521.04 l
175.44 517.44 m
180 510.24 l
175.68 517.44 m
180.24 510.24 l
180.24 517.44 m
175.44 510.24 l
174.72 517.44 m
176.88 517.44 l
178.8 517.44 m
180.96 517.44 l
174.72 510.24 m
176.88 510.24 l
178.8 510.24 m
180.96 510.24 l
184.08 520.56 m
193.44 520.56 l
184.08 517.44 m
193.44 517.44 l
205.44 521.52 m
200.16 521.52 l
198.72 521.04 l
197.52 519.6 l
197.04 517.92 l
197.04 516.48 l
197.52 515.28 l
198 514.8 l
199.2 514.32 l
200.16 514.32 l
201.84 514.8 l
202.8 516.48 l
203.28 517.92 l
203.28 519.6 l
202.8 520.56 l
202.32 521.04 l
201.12 521.52 l
200.16 521.52 m
199.2 521.04 l
198 519.6 l
197.52 517.92 l
197.52 516 l
198 514.8 l
200.16 514.32 m
201.12 514.8 l
202.32 516.48 l
202.8 517.92 l
202.8 520.08 l
202.32 521.04 l
205.44 521.04 l
208.8 517.44 m
208.8 510.24 l
209.28 517.44 m
209.28 510.24 l
213.36 517.44 m
213.36 510.24 l
213.6 517.44 m
213.6 510.24 l
207.84 517.44 m
210.24 517.44 l
212.4 517.44 m
214.8 517.44 l
209.28 514.08 m
213.36 514.08 l
207.84 510.24 m
210.24 510.24 l
212.4 510.24 m
214.8 510.24 l
S
[1 0 0] SC
172.56 542.4 m
167.52 542.4 l
165.84 541.92 l
164.88 540.24 l
164.4 538.8 l
164.4 537.12 l
164.88 536.16 l
165.36 535.68 l
166.32 535.2 l
167.52 535.2 l
168.96 535.68 l
169.92 537.12 l
170.64 538.8 l
170.64 540.24 l
169.92 541.2 l
169.44 541.92 l
168.48 542.4 l
167.52 542.4 m
166.32 541.92 l
165.36 540.24 l
164.88 538.8 l
164.88 536.64 l
165.36 535.68 l
167.52 535.2 m
168.48 535.68 l
169.44 537.12 l
169.92 538.8 l
169.92 540.72 l
169.44 541.92 l
172.56 541.92 l
175.44 538.32 m
180 530.88 l
175.68 538.32 m
180.24 530.88 l
180.24 538.32 m
175.44 530.88 l
174.72 538.32 m
176.88 538.32 l
178.8 538.32 m
180.96 538.32 l
174.72 530.88 m
176.88 530.88 l
178.8 530.88 m
180.96 530.88 l
184.08 541.2 m
193.44 541.2 l
184.08 538.32 m
193.44 538.32 l
205.44 542.4 m
200.16 542.4 l
198.72 541.92 l
197.52 540.24 l
197.04 538.8 l
197.04 537.12 l
197.52 536.16 l
198 535.68 l
199.2 535.2 l
200.16 535.2 l
201.84 535.68 l
202.8 537.12 l
203.28 538.8 l
203.28 540.24 l
202.8 541.2 l
202.32 541.92 l
201.12 542.4 l
200.16 542.4 m
199.2 541.92 l
198 540.24 l
197.52 538.8 l
197.52 536.64 l
198 535.68 l
200.16 535.2 m
201.12 535.68 l
202.32 537.12 l
202.8 538.8 l
202.8 540.72 l
202.32 541.92 l
205.44 541.92 l
208.8 538.32 m
208.8 530.88 l
209.28 538.32 m
209.28 530.88 l
213.36 538.32 m
213.36 530.88 l
213.6 538.32 m
213.6 530.88 l
207.84 538.32 m
210.24 538.32 l
212.4 538.32 m
214.8 538.32 l
209.28 534.72 m
213.36 534.72 l
207.84 530.88 m
210.24 530.88 l
212.4 530.88 m
214.8 530.88 l
217.2 530.88 m
216.72 531.36 l
217.2 531.6 l
217.44 531.36 l
217.44 530.64 l
217.2 529.92 l
216.72 529.44 l
220.56 538.32 m
220.32 537.84 l
220.56 537.6 l
221.04 537.84 l
220.56 538.32 l
220.56 535.68 m
220.56 530.88 l
221.04 535.68 m
221.04 530.88 l
219.6 535.68 m
221.04 535.68 l
219.6 530.88 m
222 530.88 l
S
[0 0 0] SC
139.92 250.56 m
451.44 250.56 l
451.44 354.48 l
139.92 354.48 l
139.92 250.56 l
h
139.92 268.08 m
139.92 354.48 l
155.52 354.48 m
155.52 342.24 l
163.2 342.24 l
163.2 342.72 l
171.12 342.72 l
171.12 335.28 l
178.8 335.28 l
178.8 333.84 l
186.72 333.84 l
186.72 333.36 l
194.4 333.36 l
194.4 320.88 l
202.08 320.88 l
202.08 311.04 l
210 311.04 l
210 304.56 l
217.68 304.56 l
217.68 301.44 l
225.6 301.44 l
225.6 297.12 l
233.28 297.12 l
233.28 294.72 l
241.2 294.72 l
241.2 291.36 l
248.88 291.36 l
248.88 289.68 l
256.8 289.68 l
256.8 286.56 l
264.48 286.56 l
264.48 285.84 l
272.16 285.84 l
272.16 283.68 l
280.08 283.68 l
280.08 282.48 l
287.76 282.48 l
287.76 281.76 l
295.68 281.76 l
295.68 280.08 l
303.36 280.08 l
303.36 279.36 l
311.28 279.36 l
311.28 278.88 l
318.96 278.88 l
318.96 277.92 l
326.64 277.92 l
326.64 276.72 l
334.56 276.72 l
334.56 276.24 l
342.24 276.24 l
342.24 275.28 l
350.16 275.28 l
350.16 274.56 l
357.84 274.56 l
357.84 274.08 l
365.76 274.08 l
365.76 273.12 l
373.44 273.12 l
373.44 272.64 l
381.36 272.64 l
381.36 271.92 l
389.04 271.92 l
389.04 271.2 l
396.72 271.2 l
396.72 270.24 l
404.64 270.24 l
404.64 269.52 l
412.32 269.52 l
412.32 269.04 l
420.24 269.04 l
420.24 268.32 l
427.92 268.32 l
427.92 267.84 l
435.84 267.84 l
435.84 267.6 l
443.52 267.6 l
443.52 267.36 l
451.44 267.36 l
451.44 268.08 l
139.92 250.56 m
139.92 263.04 l
152.4 254.88 m
152.4 250.56 l
164.88 250.56 m
164.88 254.88 l
177.36 254.88 m
177.36 250.56 l
189.84 250.56 m
189.84 254.88 l
202.08 263.04 m
202.08 250.56 l
214.56 250.56 m
214.56 254.88 l
227.04 254.88 m
227.04 250.56 l
239.52 250.56 m
239.52 254.88 l
252 254.88 m
252 250.56 l
264.48 250.56 m
264.48 263.04 l
276.96 254.88 m
276.96 250.56 l
289.44 250.56 m
289.44 254.88 l
301.92 254.88 m
301.92 250.56 l
314.4 250.56 m
314.4 254.88 l
326.64 263.04 m
326.64 250.56 l
339.12 250.56 m
339.12 254.88 l
351.6 254.88 m
351.6 250.56 l
364.08 250.56 m
364.08 254.88 l
376.56 254.88 m
376.56 250.56 l
389.04 250.56 m
389.04 263.04 l
401.52 254.88 m
401.52 250.56 l
S
414 250.56 m
414 254.88 l
426.48 254.88 m
426.48 250.56 l
438.96 250.56 m
438.96 254.88 l
451.44 263.04 m
451.44 250.56 l
139.68 243.84 m
138.48 243.6 l
137.76 242.4 l
137.52 240.72 l
137.52 239.76 l
137.76 237.84 l
138.48 236.88 l
139.68 236.64 l
140.16 236.64 l
141.36 236.88 l
142.08 237.84 l
142.32 239.76 l
142.32 240.72 l
142.08 242.4 l
141.36 243.6 l
140.16 243.84 l
139.68 243.84 l
138.96 243.6 l
138.48 243.12 l
138.24 242.4 l
137.76 240.72 l
137.76 239.76 l
138.24 237.84 l
138.48 237.36 l
138.96 236.88 l
139.68 236.64 l
140.16 236.64 m
140.88 236.88 l
141.36 237.36 l
141.6 237.84 l
142.08 239.76 l
142.08 240.72 l
141.6 242.4 l
141.36 243.12 l
140.88 243.6 l
140.16 243.84 l
193.2 242.4 m
193.44 242.16 l
193.2 241.68 l
192.96 242.16 l
192.96 242.4 l
193.2 243.12 l
193.44 243.6 l
194.64 243.84 l
196.08 243.84 l
197.04 243.6 l
197.28 243.12 l
197.76 242.4 l
197.76 241.68 l
197.28 240.96 l
196.32 240.48 l
194.64 239.76 l
193.92 239.28 l
193.2 238.56 l
192.96 237.6 l
192.96 236.64 l
196.08 243.84 m
196.56 243.6 l
197.04 243.12 l
197.28 242.4 l
197.28 241.68 l
197.04 240.96 l
194.64 239.76 l
192.96 237.36 m
193.2 237.6 l
193.92 237.6 l
195.6 236.88 l
196.56 236.88 l
197.28 237.36 l
197.76 237.6 l
193.92 237.6 m
195.6 236.64 l
197.04 236.64 l
197.28 236.88 l
197.76 237.6 l
197.76 238.32 l
201.84 243.84 m
200.88 243.6 l
200.16 242.4 l
199.68 240.72 l
199.68 239.76 l
200.16 237.84 l
200.88 236.88 l
201.84 236.64 l
202.56 236.64 l
203.52 236.88 l
204.24 237.84 l
204.72 239.76 l
204.72 240.72 l
204.24 242.4 l
203.52 243.6 l
202.56 243.84 l
201.84 243.84 l
201.12 243.6 l
200.88 243.12 l
200.4 242.4 l
200.16 240.72 l
200.16 239.76 l
200.4 237.84 l
200.88 237.36 l
201.12 236.88 l
201.84 236.64 l
202.56 236.64 m
203.28 236.88 l
203.52 237.36 l
204 237.84 l
204.24 239.76 l
204.24 240.72 l
204 242.4 l
203.52 243.12 l
203.28 243.6 l
202.56 243.84 l
208.8 243.84 m
207.84 243.6 l
207.12 242.4 l
206.64 240.72 l
206.64 239.76 l
207.12 237.84 l
207.84 236.88 l
208.8 236.64 l
209.52 236.64 l
210.48 236.88 l
211.2 237.84 l
211.68 239.76 l
211.68 240.72 l
211.2 242.4 l
210.48 243.6 l
209.52 243.84 l
208.8 243.84 l
S
208.8 243.84 m
208.08 243.6 l
207.84 243.12 l
207.36 242.4 l
207.12 240.72 l
207.12 239.76 l
207.36 237.84 l
207.84 237.36 l
208.08 236.88 l
208.8 236.64 l
209.52 236.64 m
210.24 236.88 l
210.48 237.36 l
210.96 237.84 l
211.2 239.76 l
211.2 240.72 l
210.96 242.4 l
210.48 243.12 l
210.24 243.6 l
209.52 243.84 l
258.24 243.12 m
258.24 236.64 l
258.48 243.84 m
258.48 236.64 l
258.48 243.84 m
254.88 238.56 l
260.4 238.56 l
257.28 236.64 m
259.68 236.64 l
264.24 243.84 m
263.04 243.6 l
262.32 242.4 l
262.08 240.72 l
262.08 239.76 l
262.32 237.84 l
263.04 236.88 l
264.24 236.64 l
264.72 236.64 l
265.92 236.88 l
266.64 237.84 l
266.88 239.76 l
266.88 240.72 l
266.64 242.4 l
265.92 243.6 l
264.72 243.84 l
264.24 243.84 l
263.52 243.6 l
263.04 243.12 l
262.8 242.4 l
262.32 240.72 l
262.32 239.76 l
262.8 237.84 l
263.04 237.36 l
263.52 236.88 l
264.24 236.64 l
264.72 236.64 m
265.44 236.88 l
265.92 237.36 l
266.16 237.84 l
266.64 239.76 l
266.64 240.72 l
266.16 242.4 l
265.92 243.12 l
265.44 243.6 l
264.72 243.84 l
270.96 243.84 m
270 243.6 l
269.28 242.4 l
269.04 240.72 l
269.04 239.76 l
269.28 237.84 l
270 236.88 l
270.96 236.64 l
271.68 236.64 l
272.88 236.88 l
273.6 237.84 l
273.84 239.76 l
273.84 240.72 l
273.6 242.4 l
272.88 243.6 l
271.68 243.84 l
270.96 243.84 l
270.48 243.6 l
270 243.12 l
269.76 242.4 l
269.28 240.72 l
269.28 239.76 l
269.76 237.84 l
270 237.36 l
270.48 236.88 l
270.96 236.64 l
271.68 236.64 m
272.4 236.88 l
272.88 237.36 l
273.12 237.84 l
273.6 239.76 l
273.6 240.72 l
273.12 242.4 l
272.88 243.12 l
272.4 243.6 l
271.68 243.84 l
321.6 242.88 m
321.12 242.4 l
321.6 242.16 l
321.84 242.4 l
321.84 242.88 l
321.6 243.6 l
320.88 243.84 l
319.92 243.84 l
318.72 243.6 l
318 242.88 l
317.76 242.16 l
317.52 240.72 l
317.52 238.56 l
317.76 237.6 l
318.48 236.88 l
319.44 236.64 l
320.16 236.64 l
321.12 236.88 l
321.84 237.6 l
322.32 238.56 l
322.32 239.04 l
321.84 240 l
321.12 240.72 l
320.16 240.96 l
319.92 240.96 l
318.72 240.72 l
318 240 l
317.76 239.04 l
S
319.92 243.84 m
319.2 243.6 l
318.48 242.88 l
318 242.16 l
317.76 240.72 l
317.76 238.56 l
318 237.6 l
318.72 236.88 l
319.44 236.64 l
320.16 236.64 m
320.88 236.88 l
321.6 237.6 l
321.84 238.56 l
321.84 239.04 l
321.6 240 l
320.88 240.72 l
320.16 240.96 l
326.4 243.84 m
325.44 243.6 l
324.72 242.4 l
324.24 240.72 l
324.24 239.76 l
324.72 237.84 l
325.44 236.88 l
326.4 236.64 l
327.12 236.64 l
328.08 236.88 l
328.8 237.84 l
329.28 239.76 l
329.28 240.72 l
328.8 242.4 l
328.08 243.6 l
327.12 243.84 l
326.4 243.84 l
325.68 243.6 l
325.44 243.12 l
324.96 242.4 l
324.72 240.72 l
324.72 239.76 l
324.96 237.84 l
325.44 237.36 l
325.68 236.88 l
326.4 236.64 l
327.12 236.64 m
327.84 236.88 l
328.08 237.36 l
328.56 237.84 l
328.8 239.76 l
328.8 240.72 l
328.56 242.4 l
328.08 243.12 l
327.84 243.6 l
327.12 243.84 l
333.36 243.84 m
332.4 243.6 l
331.68 242.4 l
331.2 240.72 l
331.2 239.76 l
331.68 237.84 l
332.4 236.88 l
333.36 236.64 l
334.08 236.64 l
335.04 236.88 l
335.76 237.84 l
336.24 239.76 l
336.24 240.72 l
335.76 242.4 l
335.04 243.6 l
334.08 243.84 l
333.36 243.84 l
332.64 243.6 l
332.4 243.12 l
331.92 242.4 l
331.68 240.72 l
331.68 239.76 l
331.92 237.84 l
332.4 237.36 l
332.64 236.88 l
333.36 236.64 l
334.08 236.64 m
334.8 236.88 l
335.04 237.36 l
335.52 237.84 l
335.76 239.76 l
335.76 240.72 l
335.52 242.4 l
335.04 243.12 l
334.8 243.6 l
334.08 243.84 l
381.36 243.84 m
380.4 243.6 l
380.16 242.88 l
380.16 241.68 l
380.4 240.96 l
381.36 240.72 l
382.8 240.72 l
383.76 240.96 l
384.24 241.68 l
384.24 242.88 l
383.76 243.6 l
382.8 243.84 l
381.36 243.84 l
380.64 243.6 l
380.4 242.88 l
380.4 241.68 l
380.64 240.96 l
381.36 240.72 l
382.8 240.72 m
383.52 240.96 l
383.76 241.68 l
383.76 242.88 l
383.52 243.6 l
382.8 243.84 l
381.36 240.72 m
380.4 240.48 l
380.16 240 l
379.68 239.28 l
379.68 237.84 l
380.16 237.36 l
380.4 236.88 l
381.36 236.64 l
382.8 236.64 l
383.76 236.88 l
384.24 237.36 l
384.48 237.84 l
384.48 239.28 l
384.24 240 l
383.76 240.48 l
382.8 240.72 l
S
381.36 240.72 m
380.64 240.48 l
380.4 240 l
380.16 239.28 l
380.16 237.84 l
380.64 236.88 l
381.36 236.64 l
382.8 236.64 m
383.52 236.88 l
383.76 237.36 l
384.24 237.84 l
384.24 239.28 l
383.76 240 l
383.52 240.48 l
382.8 240.72 l
388.8 243.84 m
387.6 243.6 l
386.88 242.4 l
386.64 240.72 l
386.64 239.76 l
386.88 237.84 l
387.6 236.88 l
388.8 236.64 l
389.28 236.64 l
390.48 236.88 l
391.2 237.84 l
391.44 239.76 l
391.44 240.72 l
391.2 242.4 l
390.48 243.6 l
389.28 243.84 l
388.8 243.84 l
388.08 243.6 l
387.6 243.12 l
387.36 242.4 l
386.88 240.72 l
386.88 239.76 l
387.36 237.84 l
387.6 237.36 l
388.08 236.88 l
388.8 236.64 l
389.28 236.64 m
390 236.88 l
390.48 237.36 l
390.72 237.84 l
391.2 239.76 l
391.2 240.72 l
390.72 242.4 l
390.48 243.12 l
390 243.6 l
389.28 243.84 l
395.52 243.84 m
394.56 243.6 l
393.84 242.4 l
393.6 240.72 l
393.6 239.76 l
393.84 237.84 l
394.56 236.88 l
395.52 236.64 l
396.24 236.64 l
397.44 236.88 l
398.16 237.84 l
398.4 239.76 l
398.4 240.72 l
398.16 242.4 l
397.44 243.6 l
396.24 243.84 l
395.52 243.84 l
395.04 243.6 l
394.56 243.12 l
394.32 242.4 l
393.84 240.72 l
393.84 239.76 l
394.32 237.84 l
394.56 237.36 l
395.04 236.88 l
395.52 236.64 l
396.24 236.64 m
396.96 236.88 l
397.44 237.36 l
397.68 237.84 l
398.16 239.76 l
398.16 240.72 l
397.68 242.4 l
397.44 243.12 l
396.96 243.6 l
396.24 243.84 l
439.44 242.4 m
440.16 242.88 l
441.36 243.84 l
441.36 236.64 l
440.88 243.6 m
440.88 236.64 l
439.44 236.64 m
442.56 236.64 l
447.6 243.84 m
446.4 243.6 l
445.68 242.4 l
445.44 240.72 l
445.44 239.76 l
445.68 237.84 l
446.4 236.88 l
447.6 236.64 l
448.32 236.64 l
449.28 236.88 l
450 237.84 l
450.24 239.76 l
450.24 240.72 l
450 242.4 l
449.28 243.6 l
448.32 243.84 l
447.6 243.84 l
446.88 243.6 l
446.4 243.12 l
446.16 242.4 l
445.68 240.72 l
445.68 239.76 l
446.16 237.84 l
446.4 237.36 l
446.88 236.88 l
447.6 236.64 l
448.32 236.64 m
448.8 236.88 l
449.28 237.36 l
449.52 237.84 l
450 239.76 l
450 240.72 l
449.52 242.4 l
449.28 243.12 l
448.8 243.6 l
448.32 243.84 l
S
454.56 243.84 m
453.36 243.6 l
452.64 242.4 l
452.4 240.72 l
452.4 239.76 l
452.64 237.84 l
453.36 236.88 l
454.56 236.64 l
455.04 236.64 l
456.24 236.88 l
456.96 237.84 l
457.2 239.76 l
457.2 240.72 l
456.96 242.4 l
456.24 243.6 l
455.04 243.84 l
454.56 243.84 l
453.84 243.6 l
453.36 243.12 l
453.12 242.4 l
452.64 240.72 l
452.64 239.76 l
453.12 237.84 l
453.36 237.36 l
453.84 236.88 l
454.56 236.64 l
455.04 236.64 m
455.76 236.88 l
456.24 237.36 l
456.48 237.84 l
456.96 239.76 l
456.96 240.72 l
456.48 242.4 l
456.24 243.12 l
455.76 243.6 l
455.04 243.84 l
461.28 243.84 m
460.32 243.6 l
459.6 242.4 l
459.36 240.72 l
459.36 239.76 l
459.6 237.84 l
460.32 236.88 l
461.28 236.64 l
462 236.64 l
463.2 236.88 l
463.92 237.84 l
464.16 239.76 l
464.16 240.72 l
463.92 242.4 l
463.2 243.6 l
462 243.84 l
461.28 243.84 l
460.8 243.6 l
460.32 243.12 l
460.08 242.4 l
459.6 240.72 l
459.6 239.76 l
460.08 237.84 l
460.32 237.36 l
460.8 236.88 l
461.28 236.64 l
462 236.64 m
462.72 236.88 l
463.2 237.36 l
463.44 237.84 l
463.92 239.76 l
463.92 240.72 l
463.44 242.4 l
463.2 243.12 l
462.72 243.6 l
462 243.84 l
139.92 342 m
139.92 354.48 l
152.4 354.48 m
152.4 350.4 l
164.88 350.4 m
164.88 354.48 l
177.36 354.48 m
177.36 350.4 l
189.84 350.4 m
189.84 354.48 l
202.08 354.48 m
202.08 342 l
214.56 350.4 m
214.56 354.48 l
227.04 354.48 m
227.04 350.4 l
239.52 350.4 m
239.52 354.48 l
252 354.48 m
252 350.4 l
264.48 342 m
264.48 354.48 l
276.96 354.48 m
276.96 350.4 l
289.44 350.4 m
289.44 354.48 l
301.92 354.48 m
301.92 350.4 l
314.4 350.4 m
314.4 354.48 l
326.64 354.48 m
326.64 342 l
339.12 350.4 m
339.12 354.48 l
351.6 354.48 m
351.6 350.4 l
364.08 350.4 m
364.08 354.48 l
376.56 354.48 m
376.56 350.4 l
389.04 342 m
389.04 354.48 l
401.52 354.48 m
401.52 350.4 l
414 350.4 m
414 354.48 l
426.48 354.48 m
426.48 350.4 l
438.96 350.4 m
438.96 354.48 l
451.44 354.48 m
451.44 342 l
139.92 250.56 m
152.4 250.56 l
144 254.16 m
139.92 254.16 l
S
139.92 257.52 m
144 257.52 l
144 261.12 m
139.92 261.12 l
139.92 264.48 m
144 264.48 l
152.4 268.08 m
139.92 268.08 l
139.92 271.44 m
144 271.44 l
144 274.8 m
139.92 274.8 l
139.92 278.4 m
144 278.4 l
144 281.76 m
139.92 281.76 l
139.92 285.36 m
152.4 285.36 l
144 288.72 m
139.92 288.72 l
139.92 292.08 m
144 292.08 l
144 295.68 m
139.92 295.68 l
139.92 299.04 m
144 299.04 l
152.4 302.64 m
139.92 302.64 l
139.92 306 m
144 306 l
144 309.6 m
139.92 309.6 l
139.92 312.96 m
144 312.96 l
144 316.32 m
139.92 316.32 l
139.92 319.92 m
152.4 319.92 l
144 323.28 m
139.92 323.28 l
139.92 326.88 m
144 326.88 l
144 330.24 m
139.92 330.24 l
139.92 333.6 m
144 333.6 l
152.4 337.2 m
139.92 337.2 l
139.92 340.56 m
144 340.56 l
144 344.16 m
139.92 344.16 l
139.92 347.52 m
144 347.52 l
144 351.12 m
139.92 351.12 l
139.92 354.48 m
152.4 354.48 l
121.2 249.6 m
127.44 249.6 l
130.32 252.48 m
130.56 252 l
130.32 251.76 l
129.84 252 l
129.84 252.48 l
130.32 253.2 l
130.56 253.44 l
131.52 253.68 l
132.96 253.68 l
134.16 253.44 l
134.4 253.2 l
134.64 252.48 l
134.64 251.76 l
134.4 251.04 l
133.44 250.32 l
131.52 249.6 l
131.04 249.36 l
130.32 248.64 l
129.84 247.68 l
129.84 246.48 l
132.96 253.68 m
133.68 253.44 l
134.16 253.2 l
134.4 252.48 l
134.4 251.76 l
134.16 251.04 l
132.96 250.32 l
131.52 249.6 l
129.84 247.2 m
130.32 247.68 l
131.04 247.68 l
132.72 246.96 l
133.68 246.96 l
134.4 247.2 l
134.64 247.68 l
131.04 247.68 m
132.72 246.48 l
134.16 246.48 l
134.4 246.96 l
134.64 247.68 l
134.64 248.16 l
132 271.2 m
131.04 270.72 l
130.32 269.76 l
129.84 268.08 l
129.84 266.88 l
130.32 265.2 l
131.04 264.24 l
132 263.76 l
132.72 263.76 l
133.68 264.24 l
134.4 265.2 l
134.64 266.88 l
134.64 268.08 l
134.4 269.76 l
133.68 270.72 l
132.72 271.2 l
132 271.2 l
131.28 270.72 l
131.04 270.48 l
130.56 269.76 l
130.32 268.08 l
130.32 266.88 l
130.56 265.2 l
131.04 264.48 l
131.28 264.24 l
132 263.76 l
132.72 263.76 m
133.44 264.24 l
133.68 264.48 l
134.16 265.2 l
134.4 266.88 l
134.4 268.08 l
134.16 269.76 l
133.68 270.48 l
133.44 270.72 l
132.72 271.2 l
S
130.32 287.04 m
130.56 286.56 l
130.32 286.32 l
129.84 286.56 l
129.84 287.04 l
130.32 287.76 l
130.56 288 l
131.52 288.48 l
132.96 288.48 l
134.16 288 l
134.4 287.76 l
134.64 287.04 l
134.64 286.32 l
134.4 285.6 l
133.44 284.88 l
131.52 284.16 l
131.04 283.92 l
130.32 283.2 l
129.84 282.24 l
129.84 281.04 l
132.96 288.48 m
133.68 288 l
134.16 287.76 l
134.4 287.04 l
134.4 286.32 l
134.16 285.6 l
132.96 284.88 l
131.52 284.16 l
129.84 281.76 m
130.32 282.24 l
131.04 282.24 l
132.72 281.52 l
133.68 281.52 l
134.4 281.76 l
134.64 282.24 l
131.04 282.24 m
132.72 281.04 l
134.16 281.04 l
134.4 281.52 l
134.64 282.24 l
134.64 282.96 l
132.96 305.04 m
132.96 298.32 l
133.44 305.76 m
133.44 298.32 l
133.44 305.76 m
129.6 300.48 l
135.12 300.48 l
132 298.32 m
134.4 298.32 l
134.16 321.84 m
133.68 321.6 l
134.16 321.36 l
134.4 321.6 l
134.4 321.84 l
134.16 322.56 l
133.44 323.04 l
132.24 323.04 l
131.28 322.56 l
130.56 321.84 l
130.32 321.36 l
129.84 319.92 l
129.84 317.76 l
130.32 316.8 l
131.04 316.08 l
132 315.84 l
132.72 315.84 l
133.68 316.08 l
134.4 316.8 l
134.64 317.76 l
134.64 318.24 l
134.4 319.2 l
133.68 319.92 l
132.72 320.16 l
132.24 320.16 l
131.28 319.92 l
130.56 319.2 l
130.32 318.24 l
132.24 323.04 m
131.52 322.56 l
131.04 321.84 l
130.56 321.36 l
130.32 319.92 l
130.32 317.76 l
130.56 316.8 l
131.28 316.08 l
132 315.84 l
132.72 315.84 m
133.44 316.08 l
134.16 316.8 l
134.4 317.76 l
134.4 318.24 l
134.16 319.2 l
133.44 319.92 l
132.72 320.16 l
131.52 340.32 m
130.56 339.84 l
130.32 339.36 l
130.32 338.16 l
130.56 337.44 l
131.52 337.2 l
132.96 337.2 l
134.16 337.44 l
134.4 338.16 l
134.4 339.36 l
134.16 339.84 l
132.96 340.32 l
131.52 340.32 l
130.56 339.36 l
130.56 338.16 l
131.04 337.44 l
131.52 337.2 l
132.96 337.2 m
133.68 337.44 l
134.16 338.16 l
134.16 339.36 l
133.68 339.84 l
132.96 340.32 l
131.52 337.2 m
130.56 336.72 l
130.32 336.48 l
129.84 335.76 l
129.84 334.32 l
130.32 333.6 l
130.56 333.36 l
131.52 333.12 l
132.96 333.12 l
134.16 333.36 l
134.4 333.6 l
134.64 334.32 l
134.64 335.76 l
134.4 336.48 l
134.16 336.72 l
132.96 337.2 l
S
131.52 337.2 m
131.04 336.72 l
130.56 336.48 l
130.32 335.76 l
130.32 334.32 l
130.56 333.6 l
131.52 333.12 l
132.96 333.12 m
133.68 333.36 l
134.16 333.6 l
134.4 334.32 l
134.4 335.76 l
134.16 336.48 l
133.68 336.72 l
132.96 337.2 l
124.08 356.16 m
124.8 356.64 l
125.76 357.6 l
125.76 350.4 l
125.28 357.36 m
125.28 350.4 l
124.08 350.4 m
127.2 350.4 l
132 357.6 m
131.04 357.36 l
130.32 356.16 l
129.84 354.48 l
129.84 353.52 l
130.32 351.6 l
131.04 350.64 l
132 350.4 l
132.72 350.4 l
133.68 350.64 l
134.4 351.6 l
134.64 353.52 l
134.64 354.48 l
134.4 356.16 l
133.68 357.36 l
132.72 357.6 l
132 357.6 l
131.28 357.36 l
131.04 356.88 l
130.56 356.16 l
130.32 354.48 l
130.32 353.52 l
130.56 351.6 l
131.04 351.12 l
131.28 350.64 l
132 350.4 l
132.72 350.4 m
133.44 350.64 l
133.68 351.12 l
134.16 351.6 l
134.4 353.52 l
134.4 354.48 l
134.16 356.16 l
133.68 356.88 l
133.44 357.36 l
132.72 357.6 l
438.96 250.56 m
451.44 250.56 l
451.44 254.16 m
447.12 254.16 l
447.12 257.52 m
451.44 257.52 l
451.44 261.12 m
447.12 261.12 l
447.12 264.48 m
451.44 264.48 l
451.44 268.08 m
438.96 268.08 l
447.12 271.44 m
451.44 271.44 l
451.44 274.8 m
447.12 274.8 l
447.12 278.4 m
451.44 278.4 l
451.44 281.76 m
447.12 281.76 l
438.96 285.36 m
451.44 285.36 l
451.44 288.72 m
447.12 288.72 l
447.12 292.08 m
451.44 292.08 l
451.44 295.68 m
447.12 295.68 l
447.12 299.04 m
451.44 299.04 l
451.44 302.64 m
438.96 302.64 l
447.12 306 m
451.44 306 l
451.44 309.6 m
447.12 309.6 l
447.12 312.96 m
451.44 312.96 l
451.44 316.32 m
447.12 316.32 l
438.96 319.92 m
451.44 319.92 l
451.44 323.28 m
447.12 323.28 l
447.12 326.88 m
451.44 326.88 l
S
451.44 330.24 m
447.12 330.24 l
447.12 333.6 m
451.44 333.6 l
451.44 337.2 m
438.96 337.2 l
447.12 340.56 m
451.44 340.56 l
451.44 344.16 m
447.12 344.16 l
447.12 347.52 m
451.44 347.52 l
451.44 351.12 m
447.12 351.12 l
438.96 354.48 m
451.44 354.48 l
S
[1.2 7.2] 0 d
[1 0 1] SC
139.92 276.72 m
451.44 276.72 l
S
Q
Q
showpage
%%PageTrailer
pdfEndPage
%%Trailer
end
%%DocumentSuppliedResources:
%%EOF
