%!PS-Adobe-2.0 EPSF-2.0
%%BoundingBox:  0 0 567 384
%%Title: plots/VBF_3.14 - DelPhi_ggjj_wo.eps: c1
%%Creator: ROOT Version 5.34/02
%%CreationDate: Wed Jun  5 15:50:51 2013
%%EndComments
%%BeginProlog
80 dict begin
/s {stroke} def /l {lineto} def /m {moveto} def /t {translate} def
/r {rotate} def /rl {roll}  def /R {repeat} def
/d {rlineto} def /rm {rmoveto} def /gr {grestore} def /f {eofill} def
/c {setrgbcolor} def /black {0 setgray} def /sd {setdash} def
/cl {closepath} def /sf {scalefont setfont} def /lw {setlinewidth} def
/box {m dup 0 exch d exch 0 d 0 exch neg d cl} def
/NC{systemdict begin initclip end}def/C{NC box clip newpath}def
/bl {box s} def /bf {box f} def /Y { 0 exch d} def /X { 0 d} def 
/K {{pop pop 0 moveto} exch kshow} bind def
/ita {/ang 15 def gsave [1 0 ang dup sin exch cos div 1 0 0] concat} def 
/mp {newpath /y exch def /x exch def} def
/side {[w .77 mul w .23 mul] .385 w mul sd w 0 l currentpoint t -144 r} def
/mr {mp x y w2 0 360 arc} def /m24 {mr s} def /m20 {mr f} def
/mb {mp x y w2 add m w2 neg 0 d 0 w neg d w 0 d 0 w d cl} def
/mt {mp x y w2 add m w2 neg w neg d w 0 d cl} def
/m21 {mb f} def /m25 {mb s} def /m22 {mt f} def /m26{mt s} def
/m23 {mp x y w2 sub m w2 w d w neg 0 d cl f} def
/m27 {mp x y w2 add m w3 neg w2 neg d w3 w2 neg d w3 w2 d cl s} def
/m28 {mp x w2 sub y w2 sub w3 add m w3 0 d  0 w3 neg d w3 0 d 0 w3 d w3 0 d  0 w3 d w3 neg 0 d 0 w3 d w3 neg 0 d 0 w3 neg d w3 neg 0 d cl s } def
/m29 {mp gsave x w2 sub y w2 add w3 sub m currentpoint t 4 {side} repeat cl fill gr} def
/m30 {mp gsave x w2 sub y w2 add w3 sub m currentpoint t 4 {side} repeat cl s gr} def
/m31 {mp x y w2 sub m 0 w d x w2 sub y m w 0 d x w2 sub y w2 add m w w neg d x w2 sub y w2 sub m w w d s} def
/m32 {mp x y w2 sub m w2 w d w neg 0 d cl s} def
/m33 {mp x y w2 add m w3 neg w2 neg d w3 w2 neg d w3 w2 d cl f} def
/m34 {mp x w2 sub y w2 sub w3 add m w3 0 d  0 w3 neg d w3 0 d 0 w3 d w3 0 d  0 w3 d w3 neg 0 d 0 w3 d w3 neg 0 d 0 w3 neg d w3 neg 0 d cl f } def
/m2 {mp x y w2 sub m 0 w d x w2 sub y m w 0 d s} def
/m5 {mp x w2 sub y w2 sub m w w d x w2 sub y w2 add m w w neg d s} def
/reEncode {exch findfont dup length dict begin {1 index /FID eq  {pop pop} {def} ifelse } forall /Encoding exch def currentdict end dup /FontName get exch definefont pop } def [/Times-Bold /Times-Italic /Times-BoldItalic /Helvetica /Helvetica-Oblique
 /Helvetica-Bold /Helvetica-BoldOblique /Courier /Courier-Oblique /Courier-Bold /Courier-BoldOblique /Times-Roman /AvantGarde-Book /AvantGarde-BookOblique /AvantGarde-Demi /AvantGarde-DemiOblique /Bookman-Demi /Bookman-DemiItalic /Bookman-Light
 /Bookman-LightItalic /Helvetica-Narrow /Helvetica-Narrow-Bold /Helvetica-Narrow-BoldOblique /Helvetica-Narrow-Oblique /NewCenturySchlbk-Roman /NewCenturySchlbk-Bold /NewCenturySchlbk-BoldItalic /NewCenturySchlbk-Italic /Palatino-Bold
 /Palatino-BoldItalic /Palatino-Italic /Palatino-Roman ] {ISOLatin1Encoding reEncode } forall
%%EndProlog
%%BeginSetup
%%EndSetup
newpath  gsave  .25 .25 scale  gsave  0 0 t black[  ] 0 sd 3 lw 1 1 1 c 2268 1538 0 0 bf black 1 1 1 c 1791 984 363 554 bf black 1791 984 363 554 bl 1 1 1 c 1791 984 363 554 bf black 1791 984 363 554 bl 0 0 1 c 6 lw 1 1 1 c 0 0 1 c 363 1397 m 20 X s
 402 1397 m 21 X s 3 lw /w 21 def /w2 {w 2 div} def /w3 {w 3 div} def 393 1397 m20 6 lw 423 979 m 20 X s 462 979 m 20 X s 3 lw 452 979 m20 6 lw 482 801 m 20 X s 522 801 m 20 X s 3 lw 512 801 m20 6 lw 542 710 m 20 X s 582 710 m 20 X s 3 lw 572 710 m20
 6 lw 602 664 m 20 X s 641 664 m 20 X s 3 lw 632 664 m20 6 lw 661 635 m 21 X s 701 635 m 20 X s 3 lw 691 635 m20 6 lw 721 611 m 20 X s 761 611 m 20 X s 3 lw 751 611 m20 6 lw 781 598 m 20 X s 820 598 m 21 X s 3 lw 811 598 m20 6 lw 841 590 m 20 X s 880
 590 m 20 X s 3 lw 870 590 m20 6 lw 900 583 m 20 X s 940 583 m 20 X s 3 lw 930 583 m20 6 lw 960 576 m 20 X s 1000 576 m 20 X s 3 lw 990 576 m20 6 lw 1020 573 m 20 X s 1059 573 m 20 X s 3 lw 1050 573 m20 6 lw 1079 569 m 21 X s 1119 569 m 20 X s 3 lw
 1109 569 m20 6 lw 1139 568 m 20 X s 1179 568 m 20 X s 3 lw 1169 568 m20 6 lw 1199 565 m 20 X s 1238 565 m 21 X s 3 lw 1229 565 m20 6 lw 1259 564 m 20 X s 1298 564 m 20 X s 3 lw 1288 564 m20 6 lw 1318 562 m 20 X s 1358 562 m 20 X s 3 lw 1348 562 m20
 6 lw 1378 561 m 20 X s 1418 561 m 20 X s 3 lw 1408 561 m20 6 lw 1438 560 m 20 X s 1477 560 m 20 X s 3 lw 1468 560 m20 6 lw 1497 560 m 21 X s 1537 560 m 20 X s 3 lw 1527 560 m20 6 lw 1557 559 m 20 X s 1597 559 m 20 X s 3 lw 1587 559 m20 6 lw 1617 558
 m 20 X s 1657 558 m 20 X s 3 lw 1647 558 m20 6 lw 1677 558 m 20 X s 1716 558 m 20 X s 3 lw 1706 558 m20 6 lw 1736 557 m 20 X s 1776 557 m 20 X s 3 lw 1766 557 m20 6 lw 1796 557 m 20 X s 1836 557 m 20 X s 3 lw 1826 557 m20 6 lw 1856 557 m 20 X s 1895
 557 m 20 X s 3 lw 1886 557 m20 6 lw 1915 556 m 21 X s 1955 556 m 20 X s 3 lw 1945 556 m20 6 lw 1975 556 m 20 X s 2015 556 m 20 X s 3 lw 2005 556 m20 6 lw 2035 556 m 20 X s 2075 556 m 20 X s 3 lw 2065 556 m20 6 lw 2095 556 m 20 X s 2134 556 m 20 X s
 3 lw 2124 556 m20 6 lw black 3 lw 363 554 m 1791 X s
 gsave  2268 1538 0 0 C 2117.84 345.371 t 0 r /Helvetica findfont 48.8732 sf 0 0 m (\255jj) show NC gr 
 gsave  2268 1538 0 0 C 2091.77 345.371 t 0 r /Symbol findfont 48.8732 sf 0 0 m (g) show NC gr 
 gsave  2268 1538 0 0 C 2065.71 345.371 t 0 r /Symbol findfont 48.8732 sf 0 0 m (g) show NC gr 
 gsave  2268 1538 0 0 C 2029.87 381.211 t 0 r /Symbol findfont 71.6807 sf 0 0 m (f) show NC gr 
 gsave  2268 1538 0 0 C 2010.32 381.211 t 0 r /Helvetica findfont 71.6807 sf 0 0 m ( ) show NC gr 
 gsave  2268 1538 0 0 C 1964.7 381.211 t 0 r /Symbol findfont 71.6807 sf 0 0 m (D) show NC gr 
 gsave  2268 1538 0 0 C 1902.8 381.211 t 0 r /Helvetica findfont 71.6807 sf 0 0 m ( \255 ) show NC gr 
 gsave  2268 1538 0 0 C 1863.7 381.211 t 0 r /Symbol findfont 71.6807 sf 0 0 m (p) show NC gr  363 590 m -36 Y s 423 572 m -18 Y s 482 572 m -18 Y s 542 572 m -18 Y s 602 590 m -36 Y s 661 572 m -18 Y s 721 572 m -18 Y s 781 572 m -18 Y s 841 590 m
 -36 Y s 900 572 m -18 Y s 960 572 m -18 Y s 1020 572 m -18 Y s 1079 590 m -36 Y s 1139 572 m -18 Y s 1199 572 m -18 Y s 1259 572 m -18 Y s 1318 590 m -36 Y s 1378 572 m -18 Y s 1438 572 m -18 Y s 1497 572 m -18 Y s 1557 590 m -36 Y s 1617 572 m -18
 Y s 1677 572 m -18 Y s 1736 572 m -18 Y s 1796 590 m -36 Y s 1856 572 m -18 Y s 1915 572 m -18 Y s 1975 572 m -18 Y s 2035 590 m -36 Y s 2035 590 m -36 Y s 2095 572 m -18 Y s 2154 572 m -18 Y s
 gsave  2268 1538 0 0 C 342.112 485.474 t 0 r /Helvetica findfont 71.6807 sf 0 0 m (0) show NC gr 
 gsave  2268 1538 0 0 C 550.638 485.474 t 0 r /Helvetica findfont 71.6807 sf 0 0 m (0.2) show NC gr 
 gsave  2268 1538 0 0 C 788.488 485.474 t 0 r /Helvetica findfont 71.6807 sf 0 0 m (0.4) show NC gr 
 gsave  2268 1538 0 0 C 1029.6 485.474 t 0 r /Helvetica findfont 71.6807 sf 0 0 m (0.6) show NC gr 
 gsave  2268 1538 0 0 C 1267.45 485.474 t 0 r /Helvetica findfont 71.6807 sf 0 0 m (0.8) show NC gr 
 gsave  2268 1538 0 0 C 1537.88 485.474 t 0 r /Helvetica findfont 71.6807 sf 0 0 m (1) show NC gr 
 gsave  2268 1538 0 0 C 1746.4 485.474 t 0 r /Helvetica findfont 71.6807 sf 0 0 m (1.2) show NC gr 
 gsave  2268 1538 0 0 C 1984.25 485.474 t 0 r /Helvetica findfont 71.6807 sf 0 0 m (1.4) show NC gr  363 1538 m 1791 X s 363 1501 m 37 Y s 423 1520 m 18 Y s 482 1520 m 18 Y s 542 1520 m 18 Y s 602 1501 m 37 Y s 661 1520 m 18 Y s 721 1520 m 18 Y s 781
 1520 m 18 Y s 841 1501 m 37 Y s 900 1520 m 18 Y s 960 1520 m 18 Y s 1020 1520 m 18 Y s 1079 1501 m 37 Y s 1139 1520 m 18 Y s 1199 1520 m 18 Y s 1259 1520 m 18 Y s 1318 1501 m 37 Y s 1378 1520 m 18 Y s 1438 1520 m 18 Y s 1497 1520 m 18 Y s 1557 1501
 m 37 Y s 1617 1520 m 18 Y s 1677 1520 m 18 Y s 1736 1520 m 18 Y s 1796 1501 m 37 Y s 1856 1520 m 18 Y s 1915 1520 m 18 Y s 1975 1520 m 18 Y s 2035 1501 m 37 Y s 2035 1501 m 37 Y s 2095 1520 m 18 Y s 2154 1520 m 18 Y s 363 554 m 984 Y s
 gsave  2268 1538 0 0 C 185.718 1502.04 t 90 r /Helvetica findfont 48.8732 sf 0 0 m (\255jj) show NC gr 
 gsave  2268 1538 0 0 C 185.718 1475.97 t 90 r /Symbol findfont 48.8732 sf 0 0 m (g) show NC gr 
 gsave  2268 1538 0 0 C 185.718 1449.9 t 90 r /Symbol findfont 48.8732 sf 0 0 m (g) show NC gr 
 gsave  2268 1538 0 0 C 146.62 1414.06 t 90 r /Symbol findfont 71.6807 sf 0 0 m (f) show NC gr 
 gsave  2268 1538 0 0 C 146.62 1394.52 t 90 r /Helvetica findfont 71.6807 sf 0 0 m ( ) show NC gr 
 gsave  2268 1538 0 0 C 146.62 1348.9 t 90 r /Symbol findfont 71.6807 sf 0 0 m (D) show NC gr 
 gsave  2268 1538 0 0 C 146.62 1293.51 t 90 r /Helvetica findfont 71.6807 sf 0 0 m (d ) show NC gr 
 gsave  2268 1538 0 0 C 71.6807 1423.84 t 90 r /Symbol findfont 71.6807 sf 0 0 m (s) show NC gr 
 gsave  2268 1538 0 0 C 71.6807 1368.45 t 90 r /Helvetica findfont 71.6807 sf 0 0 m (d ) show NC gr  6 lw 85 1294 m 244 Y s
 gsave  2268 1538 0 0 C 104.263 1273.96 t 90 r /Helvetica findfont 71.6807 sf 0 0 m ( ) show NC gr 
 gsave  2268 1538 0 0 C 156.394 1208.8 t 90 r /Helvetica findfont 48.8732 sf 0 0 m (ct6) show NC gr 
 gsave  2268 1538 0 0 C 130.329 1166.44 t 90 r /Symbol findfont 71.6807 sf 0 0 m (s) show NC gr 
 gsave  2268 1538 0 0 C 74.9389 1205.54 t 90 r /Helvetica findfont 71.6807 sf 0 0 m (1) show NC gr  85 1166 m 108 Y s 3 lw 406 554 m -43 X s 406 772 m -43 X s 406 991 m -43 X s 406 1210 m -43 X s 406 1429 m -43 X s 406 1429 m -43 X s
 gsave  2268 1538 0 0 C 309.53 527.831 t 0 r /Helvetica findfont 71.6807 sf 0 0 m (0) show NC gr 
 gsave  2268 1538 0 0 C 260.657 749.389 t 0 r /Helvetica findfont 71.6807 sf 0 0 m (0.1) show NC gr 
 gsave  2268 1538 0 0 C 250.882 967.689 t 0 r /Helvetica findfont 71.6807 sf 0 0 m (0.2) show NC gr 
 gsave  2268 1538 0 0 C 250.882 1185.99 t 0 r /Helvetica findfont 71.6807 sf 0 0 m (0.3) show NC gr 
 gsave  2268 1538 0 0 C 250.882 1404.29 t 0 r /Helvetica findfont 71.6807 sf 0 0 m (0.4) show NC gr  2154 554 m 984 Y s 2111 554 m 43 X s 2111 772 m 43 X s 2111 991 m 43 X s 2111 1210 m 43 X s 2111 1429 m 43 X s 2111 1429 m 43 X s 0 0 1 c black 0 0 1
 c
 gsave  2268 1538 0 0 C 1700.79 1306.54 t 0 r /Helvetica findfont 42.3568 sf 0 0 m (AU2\255CT10 ) show NC gr  0.4 0.4 0.4 c 6 lw 1 1 1 c 0.4 0.4 0.4 c 363 1411 m 20 X s 402 1411 m 21 X s 3 lw 393 1411 m20 6 lw 423 958 m 20 X s 462 958 m 20 X s 3 lw
 452 958 m20 6 lw 482 786 m 20 X s 522 786 m 20 X s 3 lw 512 786 m20 6 lw 542 704 m 20 X s 582 704 m 20 X s 3 lw 572 704 m20 6 lw 602 655 m 20 X s 641 655 m 20 X s 3 lw 632 655 m20 6 lw 661 628 m 21 X s 701 628 m 20 X s 3 lw 691 628 m20 6 lw 721 608
 m 20 X s 761 608 m 20 X s 3 lw 751 608 m20 6 lw 781 597 m 20 X s 820 597 m 21 X s 3 lw 811 597 m20 6 lw 841 586 m 20 X s 880 586 m 20 X s 3 lw 870 586 m20 6 lw 900 581 m 20 X s 940 581 m 20 X s 3 lw 930 581 m20 6 lw 960 577 m 20 X s 1000 577 m 20 X
 s 3 lw 990 577 m20 6 lw 1020 571 m 20 X s 1059 571 m 20 X s 3 lw 1050 571 m20 6 lw 1079 568 m 21 X s 1119 568 m 20 X s 3 lw 1109 568 m20 6 lw 1139 567 m 20 X s 1179 567 m 20 X s 3 lw 1169 567 m20 6 lw 1199 565 m 20 X s 1238 565 m 21 X s 3 lw 1229
 565 m20 6 lw 1259 562 m 20 X s 1298 562 m 20 X s 3 lw 1288 562 m20 6 lw 1318 562 m 20 X s 1358 562 m 20 X s 3 lw 1348 562 m20 6 lw 1378 560 m 20 X s 1418 560 m 20 X s 3 lw 1408 560 m20 6 lw 1438 559 m 20 X s 1477 559 m 20 X s 3 lw 1468 559 m20 6 lw
 1497 559 m 21 X s 1537 559 m 20 X s 3 lw 1527 559 m20 6 lw 1557 558 m 20 X s 1597 558 m 20 X s 3 lw 1587 558 m20 6 lw 1617 558 m 20 X s 1657 558 m 20 X s 3 lw 1647 558 m20 6 lw 1677 558 m 20 X s 1716 558 m 20 X s 3 lw 1706 558 m20 6 lw 1736 557 m 20
 X s 1776 557 m 20 X s 3 lw 1766 557 m20 6 lw 1796 556 m 20 X s 1836 556 m 20 X s 3 lw 1826 556 m20 6 lw 1856 557 m 20 X s 1895 557 m 20 X s 3 lw 1886 557 m20 6 lw 1915 556 m 21 X s 1955 556 m 20 X s 3 lw 1945 556 m20 6 lw 1975 556 m 20 X s 2015 556
 m 20 X s 3 lw 2005 556 m20 6 lw 2035 556 m 20 X s 2075 556 m 20 X s 3 lw 2065 556 m20 6 lw 2095 556 m 20 X s 2134 556 m 20 X s 3 lw 2124 556 m20 6 lw black 0.4 0.4 0.4 c
 gsave  2268 1538 0 0 C 1700.79 1247.9 t 0 r /Helvetica findfont 42.3568 sf 0 0 m (no MPI) show NC gr  black
 gsave  2268 1538 0 0 C 2222.1 1016.56 t 90 r /Helvetica-BoldOblique findfont 39.0986 sf 0 0 m (LHC HIGGS XS WG 2013) show NC gr 
 gsave  2268 1538 0 0 C 1847.41 1374.97 t 0 r /Helvetica findfont 42.3568 sf 0 0 m ( = 125 GeV) show NC gr 
 gsave  2268 1538 0 0 C 1827.86 1358.67 t 0 r /Helvetica findfont 29.3239 sf 0 0 m (H) show NC gr 
 gsave  2268 1538 0 0 C 1700.79 1374.97 t 0 r /Helvetica findfont 42.3568 sf 0 0 m (VBF m) show NC gr  3 lw 1 1 1 c black 1 1 1 c 1796 227 359 227 bf black 1796 227 359 227 bl 1 1 1 c 1796 227 359 227 bf black 1796 227 359 227 bl 359 227 m 1796 X s
 359 454 m 1796 X s 359 227 m 227 Y s[ 4 8] 0 sd 2155 227 m -1796 X s 2155 284 m -1796 X s 2155 340 m -1796 X s 2155 397 m -1796 X s 2155 454 m -1796 X s[  ] 0 sd 2155 227 m 227 Y s 0 0 1 c 6 lw 1 1 1 c 0 0 1 c 359 342 m 20 X s 399 342 m 20 X s 3 lw
 389 342 m20 6 lw 419 335 m 20 X s 459 335 m 20 X s 3 lw 449 335 m20 6 lw 479 334 m 20 X s 519 334 m 20 X s 3 lw 509 334 m20 6 lw 539 336 m 20 X s 579 336 m 20 X s 3 lw 569 336 m20 6 lw 599 331 m 20 X s 638 331 m 21 X s 3 lw 629 331 m20 6 lw 659 331
 m 20 X s 698 331 m 20 X s 3 lw 688 331 m20 6 lw 718 334 m 21 X s 758 334 m 20 X s 3 lw 748 334 m20 6 lw 778 339 m 20 X s 818 339 m 20 X s 3 lw 808 339 m20 6 lw 838 328 m 20 X s 878 328 m 20 X s 3 lw 868 328 m20 6 lw 898 332 m 20 X s 938 332 m 20 X s
 3 lw 928 332 m20 6 lw 958 344 m 20 X s 998 344 m 20 X s 3 lw 988 344 m20 6 lw 1018 331 m 20 X s 1057 331 m 21 X s 3 lw 1048 331 m20 6 lw 1078 333 m 20 X s 1117 333 m 20 X s 3 lw 1108 333 m20 6 lw 1137 333 m 21 X s 1177 333 m 20 X s 3 lw 1167 333 m20
 6 lw 1197 338 m 21 X s 1237 338 m 20 X s 3 lw 1227 338 m20 6 lw 1257 321 m 20 X s 1297 321 m 20 X s 3 lw 1287 321 m20 6 lw 1317 333 m 20 X s 1357 333 m 20 X s 3 lw 1347 333 m20 6 lw 1377 329 m 20 X s 1417 329 m 20 X s 3 lw 1407 329 m20 6 lw 1467 316
 m s 1467 336 m s 1437 326 m 20 X s 1477 326 m 20 X s 3 lw 1467 326 m20 6 lw 1497 318 m 20 X s 1536 318 m 21 X s 3 lw 1527 318 m20 6 lw 1586 305 m s 1586 325 m s 1557 315 m 20 X s 1596 315 m 20 X s 3 lw 1586 315 m20 6 lw 1646 313 m 2 Y s 1646 334 m 2
 Y s 1616 325 m 21 X s 1656 325 m 20 X s 3 lw 1646 325 m20 6 lw 1706 324 m 3 Y s 1706 347 m 4 Y s 1676 337 m 20 X s 1716 337 m 20 X s 3 lw 1706 337 m20 6 lw 1766 331 m 6 Y s 1766 356 m 6 Y s 1736 346 m 20 X s 1776 346 m 20 X s 3 lw 1766 346 m20 6 lw
 1826 303 m 3 Y s 1826 326 m 3 Y s 1796 316 m 20 X s 1836 316 m 20 X s 3 lw 1826 316 m20 6 lw 1886 316 m 4 Y s 1886 339 m 5 Y s 1856 330 m 20 X s 1896 330 m 20 X s 3 lw 1886 330 m20 6 lw 1946 313 m 6 Y s 1946 339 m 6 Y s 1916 329 m 20 X s 1955 329 m
 21 X s 3 lw 1946 329 m20 6 lw 2006 326 m 7 Y s 2006 353 m 8 Y s 1976 343 m 20 X s 2015 343 m 21 X s 3 lw 2006 343 m20 6 lw 2065 318 m 6 Y s 2065 344 m 6 Y s 2036 334 m 20 X s 2075 334 m 20 X s 3 lw 2065 334 m20 6 lw 2125 305 m 6 Y s 2125 330 m 6 Y s
 2095 320 m 21 X s 2135 320 m 20 X s 3 lw 2125 320 m20 6 lw black 3 lw 359 227 m 1796 X s
 gsave  2245 1261 0 0 C 2121.1 19.5493 t 0 r /Helvetica findfont 45.6197 sf 0 0 m (\255jj) show NC gr 
 gsave  2245 1261 0 0 C 2098.29 19.5493 t 0 r /Symbol findfont 45.6197 sf 0 0 m (g) show NC gr 
 gsave  2245 1261 0 0 C 2075.48 19.5493 t 0 r /Symbol findfont 45.6197 sf 0 0 m (g) show NC gr 
 gsave  2245 1261 0 0 C 2039.64 55.3896 t 0 r /Symbol findfont 71.6881 sf 0 0 m (f) show NC gr 
 gsave  2245 1261 0 0 C 2020.09 55.3896 t 0 r /Helvetica findfont 71.6881 sf 0 0 m ( ) show NC gr 
 gsave  2245 1261 0 0 C 1974.48 55.3896 t 0 r /Symbol findfont 71.6881 sf 0 0 m (D) show NC gr 
 gsave  2245 1261 0 0 C 1912.57 55.3896 t 0 r /Helvetica findfont 71.6881 sf 0 0 m ( \255 ) show NC gr 
 gsave  2245 1261 0 0 C 1873.47 55.3896 t 0 r /Symbol findfont 71.6881 sf 0 0 m (p) show NC gr  359 257 m -30 Y s 419 242 m -15 Y s 479 242 m -15 Y s 539 242 m -15 Y s 599 257 m -30 Y s 659 242 m -15 Y s 718 242 m -15 Y s 778 242 m -15 Y s 838 257 m
 -30 Y s 898 242 m -15 Y s 958 242 m -15 Y s 1018 242 m -15 Y s 1078 257 m -30 Y s 1137 242 m -15 Y s 1197 242 m -15 Y s 1257 242 m -15 Y s 1317 257 m -30 Y s 1377 242 m -15 Y s 1437 242 m -15 Y s 1497 242 m -15 Y s 1557 257 m -30 Y s 1616 242 m -15
 Y s 1676 242 m -15 Y s 1736 242 m -15 Y s 1796 257 m -30 Y s 1856 242 m -15 Y s 1916 242 m -15 Y s 1976 242 m -15 Y s 2036 257 m -30 Y s 2036 257 m -30 Y s 2095 242 m -15 Y s
 gsave  2245 1261 0 0 C 338.854 162.911 t 0 r /Helvetica findfont 71.6881 sf 0 0 m (0) show NC gr 
 gsave  2245 1261 0 0 C 547.38 162.911 t 0 r /Helvetica findfont 71.6881 sf 0 0 m (0.2) show NC gr 
 gsave  2245 1261 0 0 C 788.488 162.911 t 0 r /Helvetica findfont 71.6881 sf 0 0 m (0.4) show NC gr 
 gsave  2245 1261 0 0 C 1026.34 162.911 t 0 r /Helvetica findfont 71.6881 sf 0 0 m (0.6) show NC gr 
 gsave  2245 1261 0 0 C 1267.45 162.911 t 0 r /Helvetica findfont 71.6881 sf 0 0 m (0.8) show NC gr 
 gsave  2245 1261 0 0 C 1537.88 162.911 t 0 r /Helvetica findfont 71.6881 sf 0 0 m (1) show NC gr 
 gsave  2245 1261 0 0 C 1746.4 162.911 t 0 r /Helvetica findfont 71.6881 sf 0 0 m (1.2) show NC gr 
 gsave  2245 1261 0 0 C 1984.25 162.911 t 0 r /Helvetica findfont 71.6881 sf 0 0 m (1.4) show NC gr  359 454 m 1796 X s 359 424 m 30 Y s 419 439 m 15 Y s 479 439 m 15 Y s 539 439 m 15 Y s 599 424 m 30 Y s 659 439 m 15 Y s 718 439 m 15 Y s 778 439 m
 15 Y s 838 424 m 30 Y s 898 439 m 15 Y s 958 439 m 15 Y s 1018 439 m 15 Y s 1078 424 m 30 Y s 1137 439 m 15 Y s 1197 439 m 15 Y s 1257 439 m 15 Y s 1317 424 m 30 Y s 1377 439 m 15 Y s 1437 439 m 15 Y s 1497 439 m 15 Y s 1557 424 m 30 Y s 1616 439 m
 15 Y s 1676 439 m 15 Y s 1736 439 m 15 Y s 1796 424 m 30 Y s 1856 439 m 15 Y s 1916 439 m 15 Y s 1976 439 m 15 Y s 2036 424 m 30 Y s 2036 424 m 30 Y s 2095 439 m 15 Y s 359 227 m 227 Y s
 gsave  2245 1261 0 0 C 130.329 110.779 t 90 r /Helvetica findfont 58.6539 sf 0 0 m (no MPI / ct10) show NC gr  371 227 m -12 X s 371 284 m -12 X s 371 340 m -12 X s 371 397 m -12 X s 371 454 m -12 X s
 gsave  2245 1261 0 0 C 312.788 205.267 t 0 r /Helvetica findfont 58.6539 sf 0 0 m (0) show NC gr 
 gsave  2245 1261 0 0 C 263.915 263.915 t 0 r /Helvetica findfont 58.6539 sf 0 0 m (0.5) show NC gr 
 gsave  2245 1261 0 0 C 322.563 319.305 t 0 r /Helvetica findfont 58.6539 sf 0 0 m (1) show NC gr 
 gsave  2245 1261 0 0 C 263.915 374.695 t 0 r /Helvetica findfont 58.6539 sf 0 0 m (1.5) show NC gr 
 gsave  2245 1261 0 0 C 312.788 433.342 t 0 r /Helvetica findfont 58.6539 sf 0 0 m (2) show NC gr  2155 227 m 227 Y s 2143 227 m 12 X s 2143 284 m 12 X s 2143 340 m 12 X s 2143 397 m 12 X s 2143 454 m 12 X s
 gr  gr showpage
end
%%EOF
