%!PS-Adobe-3.0 EPSF-3.0
%%BoundingBox: (atend)
%%LanguageLevel: 2
%%Creator: Grace-5.1.22
%%CreationDate: Wed Apr  3 18:27:40 2013
%%DocumentData: Clean8Bit
%%Orientation: Portrait
%%Title: /home/pcl302a/heinemey/plot/grace/2012/lhc-higgs-br/lightstop_tb50_BR-h0.grace
%%For: heinemey
%%DocumentNeededResources: (atend)
%%EndComments
%%BeginProlog
/m {moveto} def
/l {lineto} def
/s {stroke} def
/n {newpath} def
/c {closepath} def
/RL {rlineto} def
/SLW {setlinewidth} def
/GS {gsave} def
/GR {grestore} def
/SC {setcolor} def
/SGRY {setgray} def
/SRGB {setrgbcolor} def
/SD {setdash} def
/SLC {setlinecap} def
/SLJ {setlinejoin} def
/SCS {setcolorspace} def
/FFSF {findfont setfont} def
/CC {concat} def
/PXL {n m 0 0 RL s} def
/Color0 {1.0000 1.0000 1.0000} def
/Color1 {0.0000 0.0000 0.0000} def
/Color2 {1.0000 0.0000 0.0000} def
/Color3 {0.0000 1.0000 0.0000} def
/Color4 {0.0000 0.0000 1.0000} def
/Color5 {1.0000 1.0000 0.0000} def
/Color6 {0.7373 0.5608 0.5608} def
/Color7 {0.8627 0.8627 0.8627} def
/Color8 {0.5804 0.0000 0.8275} def
/Color9 {0.0000 1.0000 1.0000} def
/Color10 {1.0000 0.0000 1.0000} def
/Color11 {1.0000 0.6471 0.0000} def
/Color12 {0.4471 0.1294 0.7373} def
/Color13 {0.4039 0.0275 0.2824} def
/Color14 {0.2510 0.8784 0.8157} def
/Color15 {0.0000 0.5451 0.0000} def
/Color16 {0.7529 0.7529 0.7529} def
/Color17 {0.5059 0.5059 0.5059} def
/Color18 {0.2588 0.2588 0.2588} def
/PTRN {
 /pat_bits exch def 
 <<
  /PaintType 2
  /PatternType 1 /TilingType 1
  /BBox[0 0 16 16]
  /XStep 16 /YStep 16
  /PaintProc {
   pop
   16 16 true [-1 0 0 -1 16 16] pat_bits imagemask
  }
 >>
 [0.0016 0 0 0.0016 0 0]
 makepattern
} def
/Pattern0 {<0000000000000000000000000000000000000000000000000000000000000000> PTRN} bind def
/Pattern1 {<ffffffffffffffffffffffffffffffffffffffffffffffffffffffffffffffff> PTRN} bind def
/Pattern2 {<eeeeffffbbbbffffeeeeffffbbbbffffeeeeffffbbbbffffeeeeffffbbbbffff> PTRN} bind def
/Pattern3 {<eeeebbbbeeeebbbbeeeebbbbeeeebbbbeeeebbbbeeeebbbbeeeebbbbeeeebbbb> PTRN} bind def
/Pattern4 {<5555aaaa5555aaaa5555aaaa5555aaaa5555aaaa5555aaaa5555aaaa5555aaaa> PTRN} bind def
/Pattern5 {<1111444411114444111144441111444411114444111144441111444411114444> PTRN} bind def
/Pattern6 {<1111000044440000111100004444000011110000444400001111000044440000> PTRN} bind def
/Pattern7 {<1010000000000000010100000000000010100000000000000101000000000000> PTRN} bind def
/Pattern8 {<0000000000000000000000000000000000000000000000000000000000000000> PTRN} bind def
/Pattern9 {<1e1e0f0f8787c3c3e1e1f0f078783c3c1e1e0f0f8787c3c3e1e1f0f078783c3c> PTRN} bind def
/Pattern10 {<7878f0f0e1e1c3c387870f0f1e1e3c3c7878f0f0e1e1c3c387870f0f1e1e3c3c> PTRN} bind def
/Pattern11 {<3333333333333333333333333333333333333333333333333333333333333333> PTRN} bind def
/Pattern12 {<ffffffff00000000ffffffff00000000ffffffff00000000ffffffff00000000> PTRN} bind def
/Pattern13 {<8181424224241818181824244242818181814242242418181818242442428181> PTRN} bind def
/Pattern14 {<8080404020201010080804040202010180804040202010100808040402020101> PTRN} bind def
/Pattern15 {<0101020204040808101020204040808001010202040408081010202040408080> PTRN} bind def
/Pattern16 {<2222222222222222222222222222222222222222222222222222222222222222> PTRN} bind def
/Pattern17 {<0000ffff000000000000ffff000000000000ffff000000000000ffff00000000> PTRN} bind def
/Pattern18 {<2222ffff222222222222ffff222222222222ffff222222222222ffff22222222> PTRN} bind def
/Pattern19 {<ffffffff33333333ffffffff33333333ffffffff33333333ffffffff33333333> PTRN} bind def
/Pattern20 {<0f0f0f0f0f0f0f0ff0f0f0f0f0f0f0f00f0f0f0f0f0f0f0ff0f0f0f0f0f0f0f0> PTRN} bind def
/Pattern21 {<ff00ff00ff00ff00ff00ff00ff00ff0000ff00ff00ff00ff00ff00ff00ff00ff> PTRN} bind def
/Pattern22 {<8001800180018001800180018001ffffffff8001800180018001800180018001> PTRN} bind def
/Pattern23 {<c003c003c003c003c003c003ffffffffffffffffc003c003c003c003c003c003> PTRN} bind def
/Pattern24 {<040404040404ffff404040404040ffff040404040404ffff404040404040ffff> PTRN} bind def
/Pattern25 {<180018001800180018001800ffffffff001800180018001800180018ffffffff> PTRN} bind def
/Pattern26 {<1111b8b87c7c3a3a1111a3a3c7c78b8b1111b8b87c7c3a3a1111a3a3c7c78b8b> PTRN} bind def
/Pattern27 {<101010102828c7c70101010182827c7c101010102828c7c70101010182827c7c> PTRN} bind def
/Pattern28 {<1c1c121211112121c1c12121111112121c1c121211112121c1c1212111111212> PTRN} bind def
/Pattern29 {<3e3e414180808080e3e31414080808083e3e414180808080e3e3141408080808> PTRN} bind def
/Pattern30 {<4848888884848383848488884848383848488888848483838484888848483838> PTRN} bind def
/Pattern31 {<03030404080808080c0c12122121c0c003030404080808080c0c12122121c0c0> PTRN} bind def
/ellipsedict 8 dict def
ellipsedict /mtrx matrix put
/EARC {
 ellipsedict begin
  /endangle exch def
  /startangle exch def
  /yrad exch def
  /xrad exch def
  /y exch def
  /x exch def
  /savematrix mtrx currentmatrix def
  x y translate
  xrad yrad scale
  0 0 1 startangle endangle arc
  savematrix setmatrix
 end
} def
/TL {
  /kcomp exch def
  /linewidth exch def
  /offset exch def
  GS
  0 offset rmoveto
  linewidth SLW
  dup stringwidth exch kcomp add exch RL s
  GR
} def
/KINIT
{
 /kvector exch def
 /kid 0 def
} def
/KPROC
{
 pop pop
 kvector kid get
 0 rmoveto
 /kid 1 kid add def
} def
/DefEncoding [
 /.notdef
 /.notdef
 /.notdef
 /.notdef
 /.notdef
 /.notdef
 /.notdef
 /.notdef
 /.notdef
 /.notdef
 /.notdef
 /.notdef
 /.notdef
 /.notdef
 /.notdef
 /.notdef
 /.notdef
 /.notdef
 /.notdef
 /.notdef
 /.notdef
 /.notdef
 /.notdef
 /.notdef
 /.notdef
 /.notdef
 /.notdef
 /.notdef
 /.notdef
 /.notdef
 /.notdef
 /.notdef
 /space
 /exclam
 /quotedbl
 /numbersign
 /dollar
 /percent
 /ampersand
 /quoteright
 /parenleft
 /parenright
 /asterisk
 /plus
 /comma
 /hyphen
 /period
 /slash
 /zero
 /one
 /two
 /three
 /four
 /five
 /six
 /seven
 /eight
 /nine
 /colon
 /semicolon
 /less
 /equal
 /greater
 /question
 /at
 /A
 /B
 /C
 /D
 /E
 /F
 /G
 /H
 /I
 /J
 /K
 /L
 /M
 /N
 /O
 /P
 /Q
 /R
 /S
 /T
 /U
 /V
 /W
 /X
 /Y
 /Z
 /bracketleft
 /backslash
 /bracketright
 /asciicircum
 /underscore
 /grave
 /a
 /b
 /c
 /d
 /e
 /f
 /g
 /h
 /i
 /j
 /k
 /l
 /m
 /n
 /o
 /p
 /q
 /r
 /s
 /t
 /u
 /v
 /w
 /x
 /y
 /z
 /braceleft
 /bar
 /braceright
 /asciitilde
 /.notdef
 /.notdef
 /.notdef
 /.notdef
 /.notdef
 /.notdef
 /.notdef
 /.notdef
 /.notdef
 /.notdef
 /.notdef
 /.notdef
 /.notdef
 /.notdef
 /.notdef
 /.notdef
 /.notdef
 /.notdef
 /.notdef
 /.notdef
 /.notdef
 /.notdef
 /.notdef
 /.notdef
 /.notdef
 /.notdef
 /.notdef
 /.notdef
 /.notdef
 /.notdef
 /.notdef
 /.notdef
 /.notdef
 /space
 /exclamdown
 /cent
 /sterling
 /currency
 /yen
 /brokenbar
 /section
 /dieresis
 /copyright
 /ordfeminine
 /guillemotleft
 /logicalnot
 /hyphen
 /registered
 /macron
 /degree
 /plusminus
 /twosuperior
 /threesuperior
 /acute
 /mu
 /paragraph
 /periodcentered
 /cedilla
 /onesuperior
 /ordmasculine
 /guillemotright
 /onequarter
 /onehalf
 /threequarters
 /questiondown
 /Agrave
 /Aacute
 /Acircumflex
 /Atilde
 /Adieresis
 /Aring
 /AE
 /Ccedilla
 /Egrave
 /Eacute
 /Ecircumflex
 /Edieresis
 /Igrave
 /Iacute
 /Icircumflex
 /Idieresis
 /Eth
 /Ntilde
 /Ograve
 /Oacute
 /Ocircumflex
 /Otilde
 /Odieresis
 /multiply
 /Oslash
 /Ugrave
 /Uacute
 /Ucircumflex
 /Udieresis
 /Yacute
 /Thorn
 /germandbls
 /agrave
 /aacute
 /acircumflex
 /atilde
 /adieresis
 /aring
 /ae
 /ccedilla
 /egrave
 /eacute
 /ecircumflex
 /edieresis
 /igrave
 /iacute
 /icircumflex
 /idieresis
 /eth
 /ntilde
 /ograve
 /oacute
 /ocircumflex
 /otilde
 /odieresis
 /divide
 /oslash
 /ugrave
 /uacute
 /ucircumflex
 /udieresis
 /yacute
 /thorn
 /ydieresis
] def
%%EndProlog
%%BeginSetup
%%EndSetup
612.00 612.00 scale
[/DeviceRGB] SCS
Color2 SC
[] 0 SD
0.0045 SLW
0 SLC
0 SLJ
n
0.1500 0.8799 m
0.1516 0.8798 l
0.1531 0.8798 l
0.1547 0.8797 l
0.1563 0.8797 l
0.1578 0.8797 l
0.1594 0.8796 l
0.1610 0.8796 l
0.1625 0.8796 l
0.1641 0.8795 l
0.1657 0.8795 l
0.1673 0.8794 l
0.1688 0.8794 l
0.1704 0.8794 l
0.1720 0.8793 l
0.1735 0.8793 l
0.1751 0.8793 l
0.1767 0.8792 l
0.1782 0.8792 l
0.1798 0.8791 l
0.1814 0.8791 l
0.1829 0.8790 l
0.1845 0.8790 l
0.1861 0.8789 l
0.1876 0.8788 l
0.1892 0.8788 l
0.1908 0.8786 l
0.1924 0.8785 l
0.1939 0.8783 l
0.1955 0.8781 l
0.1971 0.8777 l
0.1986 0.8773 l
0.2002 0.8766 l
0.2018 0.8757 l
0.2033 0.8750 l
0.2049 0.8748 l
0.2065 0.8757 l
0.2080 0.8771 l
0.2096 0.8786 l
0.2112 0.8798 l
0.2127 0.8808 l
0.2143 0.8816 l
0.2159 0.8822 l
0.2175 0.8826 l
0.2190 0.8830 l
0.2206 0.8833 l
0.2222 0.8835 l
0.2237 0.8837 l
0.2253 0.8838 l
0.2269 0.8839 l
0.2284 0.8840 l
0.2300 0.8841 l
0.2316 0.8841 l
0.2331 0.8841 l
0.2347 0.8841 l
0.2363 0.8841 l
0.2378 0.8841 l
0.2394 0.8841 l
0.2410 0.8840 l
0.2425 0.8840 l
0.2441 0.8839 l
0.2457 0.8839 l
0.2473 0.8838 l
0.2488 0.8837 l
0.2504 0.8836 l
0.2520 0.8835 l
0.2535 0.8834 l
0.2551 0.8833 l
0.2567 0.8832 l
0.2582 0.8831 l
0.2598 0.8830 l
0.2614 0.8829 l
0.2629 0.8828 l
0.2645 0.8827 l
0.2661 0.8826 l
0.2676 0.8825 l
0.2692 0.8823 l
0.2708 0.8822 l
0.2724 0.8821 l
0.2739 0.8820 l
0.2755 0.8818 l
0.2771 0.8817 l
0.2786 0.8816 l
0.2802 0.8815 l
0.2818 0.8813 l
0.2833 0.8812 l
0.2849 0.8811 l
0.2865 0.8809 l
0.2880 0.8808 l
0.2896 0.8807 l
0.2912 0.8806 l
0.2927 0.8804 l
0.2943 0.8803 l
0.2959 0.8802 l
0.2975 0.8800 l
0.2990 0.8799 l
0.3006 0.8798 l
0.3022 0.8797 l
0.3037 0.8795 l
0.3053 0.8794 l
0.3069 0.8793 l
0.3084 0.8792 l
0.3100 0.8790 l
0.3116 0.8789 l
0.3131 0.8788 l
0.3147 0.8787 l
0.3163 0.8786 l
0.3178 0.8784 l
0.3194 0.8783 l
0.3210 0.8782 l
0.3225 0.8781 l
0.3241 0.8780 l
0.3257 0.8779 l
0.3273 0.8777 l
0.3288 0.8776 l
0.3304 0.8775 l
0.3320 0.8774 l
0.3335 0.8773 l
0.3351 0.8772 l
0.3367 0.8771 l
0.3382 0.8769 l
0.3398 0.8768 l
0.3414 0.8767 l
0.3429 0.8766 l
0.3445 0.8765 l
0.3461 0.8764 l
0.3476 0.8763 l
0.3492 0.8762 l
0.3508 0.8761 l
0.3524 0.8760 l
0.3539 0.8759 l
0.3555 0.8758 l
0.3571 0.8757 l
0.3586 0.8756 l
0.3602 0.8755 l
0.3618 0.8754 l
0.3633 0.8753 l
0.3649 0.8752 l
0.3665 0.8751 l
0.3680 0.8750 l
0.3696 0.8749 l
0.3712 0.8748 l
0.3727 0.8747 l
0.3743 0.8746 l
0.3759 0.8745 l
0.3775 0.8745 l
0.3790 0.8744 l
0.3806 0.8743 l
0.3822 0.8742 l
0.3837 0.8741 l
0.3853 0.8740 l
0.3869 0.8739 l
0.3884 0.8738 l
0.3900 0.8738 l
0.3916 0.8737 l
0.3931 0.8736 l
0.3947 0.8735 l
0.3963 0.8734 l
0.3978 0.8733 l
0.3994 0.8733 l
0.4010 0.8732 l
0.4025 0.8731 l
0.4041 0.8730 l
0.4057 0.8730 l
0.4073 0.8729 l
0.4088 0.8728 l
0.4104 0.8727 l
0.4120 0.8727 l
0.4135 0.8726 l
0.4151 0.8725 l
0.4167 0.8724 l
0.4182 0.8724 l
0.4198 0.8723 l
0.4214 0.8722 l
0.4229 0.8722 l
0.4245 0.8721 l
0.4261 0.8720 l
0.4276 0.8719 l
0.4292 0.8719 l
0.4308 0.8718 l
0.4324 0.8717 l
0.4339 0.8717 l
0.4355 0.8716 l
0.4371 0.8715 l
0.4386 0.8715 l
0.4402 0.8714 l
0.4418 0.8714 l
0.4433 0.8713 l
0.4449 0.8712 l
0.4465 0.8712 l
0.4480 0.8711 l
0.4496 0.8711 l
0.4512 0.8710 l
0.4527 0.8709 l
0.4543 0.8709 l
0.4559 0.8708 l
0.4575 0.8708 l
0.4590 0.8707 l
0.4606 0.8706 l
0.4622 0.8706 l
0.4637 0.8705 l
0.4653 0.8705 l
0.4669 0.8704 l
0.4684 0.8704 l
0.4700 0.8703 l
0.4716 0.8703 l
0.4731 0.8702 l
0.4747 0.8702 l
0.4763 0.8701 l
0.4778 0.8701 l
0.4794 0.8700 l
0.4810 0.8700 l
0.4825 0.8699 l
0.4841 0.8699 l
0.4857 0.8698 l
0.4873 0.8698 l
0.4888 0.8697 l
0.4904 0.8697 l
0.4920 0.8696 l
0.4935 0.8696 l
0.4951 0.8695 l
0.4967 0.8695 l
0.4982 0.8694 l
0.4998 0.8694 l
0.5014 0.8693 l
0.5029 0.8693 l
0.5045 0.8692 l
0.5061 0.8692 l
0.5076 0.8692 l
0.5092 0.8691 l
0.5108 0.8691 l
0.5124 0.8690 l
0.5139 0.8690 l
0.5155 0.8689 l
0.5171 0.8689 l
0.5186 0.8689 l
0.5202 0.8688 l
0.5218 0.8688 l
0.5233 0.8687 l
0.5249 0.8687 l
0.5265 0.8686 l
0.5280 0.8686 l
0.5296 0.8686 l
0.5312 0.8685 l
0.5327 0.8685 l
0.5343 0.8685 l
0.5359 0.8684 l
0.5375 0.8684 l
0.5390 0.8684 l
0.5406 0.8683 l
0.5422 0.8683 l
0.5437 0.8682 l
0.5453 0.8682 l
0.5469 0.8682 l
0.5484 0.8681 l
0.5502 0.8681 l
0.5516 0.8681 l
0.5531 0.8680 l
0.5547 0.8680 l
0.5563 0.8680 l
0.5578 0.8679 l
0.5594 0.8679 l
0.5610 0.8679 l
0.5625 0.8678 l
0.5641 0.8678 l
0.5657 0.8678 l
0.5673 0.8677 l
0.5688 0.8677 l
0.5704 0.8677 l
0.5720 0.8677 l
0.5735 0.8676 l
0.5751 0.8676 l
0.5767 0.8676 l
0.5782 0.8675 l
0.5798 0.8675 l
0.5814 0.8675 l
0.5829 0.8674 l
0.5845 0.8674 l
0.5861 0.8674 l
0.5876 0.8674 l
0.5892 0.8673 l
0.5908 0.8673 l
0.5924 0.8673 l
0.5939 0.8672 l
0.5955 0.8672 l
0.5971 0.8672 l
0.5986 0.8672 l
0.6002 0.8671 l
0.6018 0.8671 l
0.6033 0.8671 l
0.6049 0.8671 l
0.6065 0.8670 l
0.6080 0.8670 l
0.6096 0.8670 l
0.6112 0.8669 l
0.6127 0.8669 l
0.6143 0.8669 l
0.6159 0.8669 l
0.6175 0.8668 l
0.6190 0.8668 l
0.6206 0.8668 l
0.6222 0.8668 l
0.6237 0.8667 l
0.6253 0.8667 l
0.6269 0.8667 l
0.6284 0.8667 l
0.6300 0.8666 l
0.6316 0.8666 l
0.6331 0.8666 l
0.6347 0.8666 l
0.6363 0.8666 l
0.6378 0.8665 l
0.6394 0.8665 l
0.6410 0.8665 l
0.6425 0.8665 l
0.6441 0.8664 l
0.6457 0.8664 l
0.6473 0.8664 l
0.6488 0.8664 l
0.6504 0.8664 l
0.6520 0.8663 l
0.6535 0.8663 l
0.6551 0.8663 l
0.6567 0.8663 l
0.6582 0.8662 l
0.6598 0.8662 l
0.6614 0.8662 l
0.6629 0.8662 l
0.6645 0.8662 l
0.6661 0.8661 l
0.6676 0.8661 l
0.6692 0.8661 l
0.6708 0.8661 l
0.6724 0.8661 l
0.6739 0.8660 l
0.6755 0.8660 l
0.6771 0.8660 l
0.6786 0.8660 l
0.6802 0.8660 l
0.6818 0.8659 l
0.6833 0.8659 l
0.6849 0.8659 l
0.6865 0.8659 l
0.6880 0.8659 l
0.6896 0.8659 l
0.6912 0.8658 l
0.6927 0.8658 l
0.6943 0.8658 l
0.6959 0.8658 l
0.6975 0.8658 l
0.6990 0.8657 l
0.7006 0.8657 l
0.7022 0.8657 l
0.7037 0.8657 l
0.7053 0.8657 l
0.7069 0.8657 l
0.7084 0.8656 l
0.7100 0.8656 l
0.7116 0.8656 l
0.7131 0.8656 l
0.7147 0.8656 l
0.7163 0.8656 l
0.7178 0.8655 l
0.7194 0.8655 l
0.7210 0.8655 l
0.7225 0.8655 l
0.7241 0.8655 l
0.7257 0.8655 l
0.7273 0.8654 l
0.7288 0.8654 l
0.7304 0.8654 l
0.7320 0.8654 l
0.7335 0.8654 l
0.7351 0.8654 l
0.7367 0.8653 l
0.7382 0.8653 l
0.7398 0.8653 l
0.7414 0.8653 l
0.7429 0.8653 l
0.7445 0.8653 l
0.7461 0.8653 l
0.7476 0.8652 l
0.7492 0.8652 l
0.7508 0.8652 l
0.7524 0.8652 l
0.7539 0.8652 l
0.7555 0.8652 l
0.7571 0.8652 l
0.7586 0.8651 l
0.7602 0.8651 l
0.7618 0.8651 l
0.7633 0.8651 l
0.7649 0.8651 l
0.7665 0.8651 l
0.7680 0.8651 l
0.7696 0.8650 l
0.7712 0.8650 l
0.7727 0.8650 l
0.7743 0.8650 l
0.7759 0.8650 l
0.7775 0.8650 l
0.7790 0.8650 l
0.7806 0.8650 l
0.7822 0.8649 l
0.7837 0.8649 l
0.7853 0.8649 l
0.7869 0.8649 l
0.7884 0.8649 l
0.7900 0.8649 l
0.7916 0.8649 l
0.7931 0.8649 l
0.7947 0.8648 l
0.7963 0.8648 l
0.7978 0.8648 l
0.7994 0.8648 l
0.8010 0.8648 l
0.8025 0.8648 l
0.8041 0.8648 l
0.8057 0.8648 l
0.8073 0.8647 l
0.8088 0.8647 l
0.8104 0.8647 l
0.8120 0.8647 l
0.8135 0.8647 l
0.8151 0.8647 l
0.8167 0.8647 l
0.8182 0.8647 l
0.8198 0.8647 l
0.8214 0.8646 l
0.8229 0.8646 l
0.8245 0.8646 l
0.8261 0.8646 l
0.8276 0.8646 l
0.8292 0.8646 l
0.8308 0.8646 l
0.8324 0.8646 l
0.8339 0.8646 l
0.8355 0.8645 l
0.8371 0.8645 l
0.8386 0.8645 l
0.8402 0.8645 l
0.8418 0.8645 l
0.8433 0.8645 l
0.8449 0.8645 l
0.8465 0.8645 l
0.8480 0.8645 l
0.8496 0.8644 l
0.8512 0.8644 l
0.8527 0.8644 l
0.8543 0.8644 l
0.8559 0.8644 l
0.8575 0.8644 l
0.8590 0.8644 l
0.8606 0.8644 l
0.8622 0.8644 l
0.8637 0.8644 l
0.8653 0.8644 l
0.8669 0.8643 l
0.8684 0.8643 l
0.8700 0.8643 l
0.8716 0.8643 l
0.8731 0.8643 l
0.8747 0.8643 l
0.8763 0.8643 l
0.8778 0.8643 l
0.8794 0.8643 l
0.8810 0.8643 l
0.8825 0.8642 l
0.8841 0.8642 l
0.8857 0.8642 l
0.8873 0.8642 l
0.8888 0.8642 l
0.8904 0.8642 l
0.8920 0.8642 l
0.8935 0.8642 l
0.8951 0.8642 l
0.8967 0.8642 l
0.8982 0.8642 l
0.8998 0.8642 l
0.9014 0.8641 l
0.9029 0.8641 l
0.9045 0.8641 l
0.9061 0.8641 l
0.9076 0.8641 l
0.9092 0.8641 l
0.9108 0.8641 l
0.9124 0.8641 l
0.9139 0.8641 l
0.9155 0.8641 l
0.9171 0.8641 l
0.9186 0.8641 l
0.9202 0.8640 l
0.9218 0.8640 l
0.9233 0.8640 l
0.9249 0.8640 l
0.9265 0.8640 l
0.9280 0.8640 l
0.9296 0.8640 l
0.9312 0.8640 l
0.9327 0.8640 l
0.9343 0.8640 l
0.9359 0.8640 l
0.9375 0.8640 l
0.9390 0.8639 l
0.9406 0.8639 l
0.9422 0.8639 l
0.9437 0.8639 l
0.9453 0.8639 l
0.9469 0.8639 l
0.9484 0.8639 l
0.9500 0.8639 l
s
[/DeviceRGB] SCS
Color3 SC
n
0.2078 0.1499 m
0.2080 0.1550 l
0.2096 0.1846 l
0.2112 0.2109 l
0.2127 0.2341 l
0.2143 0.2547 l
0.2159 0.2730 l
0.2175 0.2894 l
0.2190 0.3043 l
0.2206 0.3177 l
0.2222 0.3300 l
0.2237 0.3412 l
0.2253 0.3516 l
0.2269 0.3612 l
0.2284 0.3701 l
0.2300 0.3784 l
0.2316 0.3862 l
0.2331 0.3934 l
0.2347 0.4003 l
0.2363 0.4067 l
0.2378 0.4128 l
0.2394 0.4186 l
0.2410 0.4240 l
0.2425 0.4292 l
0.2441 0.4341 l
0.2457 0.4388 l
0.2473 0.4433 l
0.2488 0.4475 l
0.2504 0.4516 l
0.2520 0.4555 l
0.2535 0.4593 l
0.2551 0.4628 l
0.2567 0.4662 l
0.2582 0.4695 l
0.2598 0.4727 l
0.2614 0.4758 l
0.2629 0.4787 l
0.2645 0.4816 l
0.2661 0.4843 l
0.2676 0.4869 l
0.2692 0.4895 l
0.2708 0.4919 l
0.2724 0.4943 l
0.2739 0.4966 l
0.2755 0.4988 l
0.2771 0.5010 l
0.2786 0.5031 l
0.2802 0.5051 l
0.2818 0.5071 l
0.2833 0.5090 l
0.2849 0.5108 l
0.2865 0.5126 l
0.2880 0.5143 l
0.2896 0.5160 l
0.2912 0.5177 l
0.2927 0.5193 l
0.2943 0.5208 l
0.2959 0.5223 l
0.2975 0.5238 l
0.2990 0.5252 l
0.3006 0.5266 l
0.3022 0.5280 l
0.3037 0.5293 l
0.3053 0.5305 l
0.3069 0.5318 l
0.3084 0.5330 l
0.3100 0.5342 l
0.3116 0.5353 l
0.3131 0.5365 l
0.3147 0.5376 l
0.3163 0.5386 l
0.3178 0.5397 l
0.3194 0.5407 l
0.3210 0.5417 l
0.3225 0.5427 l
0.3241 0.5437 l
0.3257 0.5446 l
0.3273 0.5455 l
0.3288 0.5464 l
0.3304 0.5473 l
0.3320 0.5482 l
0.3335 0.5490 l
0.3351 0.5499 l
0.3367 0.5507 l
0.3382 0.5515 l
0.3398 0.5522 l
0.3414 0.5530 l
0.3429 0.5537 l
0.3445 0.5545 l
0.3461 0.5552 l
0.3476 0.5559 l
0.3492 0.5566 l
0.3508 0.5573 l
0.3524 0.5579 l
0.3539 0.5586 l
0.3555 0.5592 l
0.3571 0.5598 l
0.3586 0.5605 l
0.3602 0.5611 l
0.3618 0.5617 l
0.3633 0.5622 l
0.3649 0.5628 l
0.3665 0.5634 l
0.3680 0.5639 l
0.3696 0.5645 l
0.3712 0.5650 l
0.3727 0.5655 l
0.3743 0.5660 l
0.3759 0.5666 l
0.3775 0.5670 l
0.3790 0.5675 l
0.3806 0.5680 l
0.3822 0.5685 l
0.3837 0.5690 l
0.3853 0.5694 l
0.3869 0.5699 l
0.3884 0.5703 l
0.3900 0.5707 l
0.3916 0.5712 l
0.3931 0.5716 l
0.3947 0.5720 l
0.3963 0.5724 l
0.3978 0.5728 l
0.3994 0.5732 l
0.4010 0.5736 l
0.4025 0.5740 l
0.4041 0.5744 l
0.4057 0.5747 l
0.4073 0.5751 l
0.4088 0.5755 l
0.4104 0.5758 l
0.4120 0.5762 l
0.4135 0.5765 l
0.4151 0.5769 l
0.4167 0.5772 l
0.4182 0.5775 l
0.4198 0.5778 l
0.4214 0.5782 l
0.4229 0.5785 l
0.4245 0.5788 l
0.4261 0.5791 l
0.4276 0.5794 l
0.4292 0.5797 l
0.4308 0.5800 l
0.4324 0.5803 l
0.4339 0.5806 l
0.4355 0.5809 l
0.4371 0.5811 l
0.4386 0.5814 l
0.4402 0.5817 l
0.4418 0.5820 l
0.4433 0.5822 l
0.4449 0.5825 l
0.4465 0.5827 l
0.4480 0.5830 l
0.4496 0.5832 l
0.4512 0.5835 l
0.4527 0.5837 l
0.4543 0.5840 l
0.4559 0.5842 l
0.4575 0.5844 l
0.4590 0.5847 l
0.4606 0.5849 l
0.4622 0.5851 l
0.4637 0.5854 l
0.4653 0.5856 l
0.4669 0.5858 l
0.4684 0.5860 l
0.4700 0.5862 l
0.4716 0.5864 l
0.4731 0.5866 l
0.4747 0.5868 l
0.4763 0.5870 l
0.4778 0.5872 l
0.4794 0.5874 l
0.4810 0.5876 l
0.4825 0.5878 l
0.4841 0.5880 l
0.4857 0.5882 l
0.4873 0.5884 l
0.4888 0.5886 l
0.4904 0.5888 l
0.4920 0.5889 l
0.4935 0.5891 l
0.4951 0.5893 l
0.4967 0.5895 l
0.4982 0.5896 l
0.4998 0.5898 l
0.5014 0.5900 l
0.5029 0.5901 l
0.5045 0.5903 l
0.5061 0.5905 l
0.5076 0.5906 l
0.5092 0.5908 l
0.5108 0.5910 l
0.5124 0.5911 l
0.5139 0.5913 l
0.5155 0.5914 l
0.5171 0.5916 l
0.5186 0.5917 l
0.5202 0.5919 l
0.5218 0.5920 l
0.5233 0.5922 l
0.5249 0.5923 l
0.5265 0.5924 l
0.5280 0.5926 l
0.5296 0.5927 l
0.5312 0.5929 l
0.5327 0.5930 l
0.5343 0.5931 l
0.5359 0.5933 l
0.5375 0.5934 l
0.5390 0.5935 l
0.5406 0.5936 l
0.5422 0.5938 l
0.5437 0.5939 l
0.5453 0.5940 l
0.5469 0.5941 l
0.5484 0.5943 l
0.5502 0.5944 l
0.5516 0.5945 l
0.5531 0.5946 l
0.5547 0.5947 l
0.5563 0.5949 l
0.5578 0.5950 l
0.5594 0.5951 l
0.5610 0.5952 l
0.5625 0.5953 l
0.5641 0.5954 l
0.5657 0.5955 l
0.5673 0.5956 l
0.5688 0.5957 l
0.5704 0.5959 l
0.5720 0.5960 l
0.5735 0.5961 l
0.5751 0.5962 l
0.5767 0.5963 l
0.5782 0.5964 l
0.5798 0.5965 l
0.5814 0.5966 l
0.5829 0.5967 l
0.5845 0.5968 l
0.5861 0.5969 l
0.5876 0.5970 l
0.5892 0.5971 l
0.5908 0.5972 l
0.5924 0.5972 l
0.5939 0.5973 l
0.5955 0.5974 l
0.5971 0.5975 l
0.5986 0.5976 l
0.6002 0.5977 l
0.6018 0.5978 l
0.6033 0.5979 l
0.6049 0.5980 l
0.6065 0.5981 l
0.6080 0.5981 l
0.6096 0.5982 l
0.6112 0.5983 l
0.6127 0.5984 l
0.6143 0.5985 l
0.6159 0.5986 l
0.6175 0.5986 l
0.6190 0.5987 l
0.6206 0.5988 l
0.6222 0.5989 l
0.6237 0.5990 l
0.6253 0.5990 l
0.6269 0.5991 l
0.6284 0.5992 l
0.6300 0.5993 l
0.6316 0.5993 l
0.6331 0.5994 l
0.6347 0.5995 l
0.6363 0.5996 l
0.6378 0.5996 l
0.6394 0.5997 l
0.6410 0.5998 l
0.6425 0.5999 l
0.6441 0.5999 l
0.6457 0.6000 l
0.6473 0.6001 l
0.6488 0.6001 l
0.6504 0.6002 l
0.6520 0.6003 l
0.6535 0.6003 l
0.6551 0.6004 l
0.6567 0.6005 l
0.6582 0.6005 l
0.6598 0.6006 l
0.6614 0.6007 l
0.6629 0.6007 l
0.6645 0.6008 l
0.6661 0.6009 l
0.6676 0.6009 l
0.6692 0.6010 l
0.6708 0.6010 l
0.6724 0.6011 l
0.6739 0.6012 l
0.6755 0.6012 l
0.6771 0.6013 l
0.6786 0.6014 l
0.6802 0.6014 l
0.6818 0.6015 l
0.6833 0.6015 l
0.6849 0.6016 l
0.6865 0.6016 l
0.6880 0.6017 l
0.6896 0.6018 l
0.6912 0.6018 l
0.6927 0.6019 l
0.6943 0.6019 l
0.6959 0.6020 l
0.6975 0.6020 l
0.6990 0.6021 l
0.7006 0.6021 l
0.7022 0.6022 l
0.7037 0.6022 l
0.7053 0.6023 l
0.7069 0.6023 l
0.7084 0.6024 l
0.7100 0.6025 l
0.7116 0.6025 l
0.7131 0.6026 l
0.7147 0.6026 l
0.7163 0.6027 l
0.7178 0.6027 l
0.7194 0.6028 l
0.7210 0.6028 l
0.7225 0.6028 l
0.7241 0.6029 l
0.7257 0.6029 l
0.7273 0.6030 l
0.7288 0.6030 l
0.7304 0.6031 l
0.7320 0.6031 l
0.7335 0.6032 l
0.7351 0.6032 l
0.7367 0.6033 l
0.7382 0.6033 l
0.7398 0.6034 l
0.7414 0.6034 l
0.7429 0.6034 l
0.7445 0.6035 l
0.7461 0.6035 l
0.7476 0.6036 l
0.7492 0.6036 l
0.7508 0.6037 l
0.7524 0.6037 l
0.7539 0.6037 l
0.7555 0.6038 l
0.7571 0.6038 l
0.7586 0.6039 l
0.7602 0.6039 l
0.7618 0.6040 l
0.7633 0.6040 l
0.7649 0.6040 l
0.7665 0.6041 l
0.7680 0.6041 l
0.7696 0.6042 l
0.7712 0.6042 l
0.7727 0.6042 l
0.7743 0.6043 l
0.7759 0.6043 l
0.7775 0.6043 l
0.7790 0.6044 l
0.7806 0.6044 l
0.7822 0.6045 l
0.7837 0.6045 l
0.7853 0.6045 l
0.7869 0.6046 l
0.7884 0.6046 l
0.7900 0.6046 l
0.7916 0.6047 l
0.7931 0.6047 l
0.7947 0.6048 l
0.7963 0.6048 l
0.7978 0.6048 l
0.7994 0.6049 l
0.8010 0.6049 l
0.8025 0.6049 l
0.8041 0.6050 l
0.8057 0.6050 l
0.8073 0.6050 l
0.8088 0.6051 l
0.8104 0.6051 l
0.8120 0.6051 l
0.8135 0.6052 l
0.8151 0.6052 l
0.8167 0.6052 l
0.8182 0.6053 l
0.8198 0.6053 l
0.8214 0.6053 l
0.8229 0.6054 l
0.8245 0.6054 l
0.8261 0.6054 l
0.8276 0.6054 l
0.8292 0.6055 l
0.8308 0.6055 l
0.8324 0.6055 l
0.8339 0.6056 l
0.8355 0.6056 l
0.8371 0.6056 l
0.8386 0.6057 l
0.8402 0.6057 l
0.8418 0.6057 l
0.8433 0.6057 l
0.8449 0.6058 l
0.8465 0.6058 l
0.8480 0.6058 l
0.8496 0.6059 l
0.8512 0.6059 l
0.8527 0.6059 l
0.8543 0.6059 l
0.8559 0.6060 l
0.8575 0.6060 l
0.8590 0.6060 l
0.8606 0.6061 l
0.8622 0.6061 l
0.8637 0.6061 l
0.8653 0.6061 l
0.8669 0.6062 l
0.8684 0.6062 l
0.8700 0.6062 l
0.8716 0.6062 l
0.8731 0.6063 l
0.8747 0.6063 l
0.8763 0.6063 l
0.8778 0.6064 l
0.8794 0.6064 l
0.8810 0.6064 l
0.8825 0.6064 l
0.8841 0.6065 l
0.8857 0.6065 l
0.8873 0.6065 l
0.8888 0.6065 l
0.8904 0.6066 l
0.8920 0.6066 l
0.8935 0.6066 l
0.8951 0.6066 l
0.8967 0.6067 l
0.8982 0.6067 l
0.8998 0.6067 l
0.9014 0.6067 l
0.9029 0.6067 l
0.9045 0.6068 l
0.9061 0.6068 l
0.9076 0.6068 l
0.9092 0.6068 l
0.9108 0.6069 l
0.9124 0.6069 l
0.9139 0.6069 l
0.9155 0.6069 l
0.9171 0.6070 l
0.9186 0.6070 l
0.9202 0.6070 l
0.9218 0.6070 l
0.9233 0.6070 l
0.9249 0.6071 l
0.9265 0.6071 l
0.9280 0.6071 l
0.9296 0.6071 l
0.9312 0.6072 l
0.9327 0.6072 l
0.9343 0.6072 l
0.9359 0.6072 l
0.9375 0.6072 l
0.9390 0.6073 l
0.9406 0.6073 l
0.9422 0.6073 l
0.9437 0.6073 l
0.9453 0.6073 l
0.9469 0.6074 l
0.9484 0.6074 l
0.9500 0.6074 l
s
[/DeviceRGB] SCS
Color4 SC
n
0.1500 0.7742 m
0.1516 0.7744 l
0.1531 0.7746 l
0.1547 0.7747 l
0.1563 0.7749 l
0.1578 0.7750 l
0.1594 0.7752 l
0.1610 0.7753 l
0.1625 0.7755 l
0.1641 0.7756 l
0.1657 0.7758 l
0.1673 0.7759 l
0.1688 0.7761 l
0.1704 0.7762 l
0.1720 0.7764 l
0.1735 0.7765 l
0.1751 0.7767 l
0.1767 0.7768 l
0.1782 0.7770 l
0.1798 0.7772 l
0.1814 0.7774 l
0.1829 0.7776 l
0.1845 0.7778 l
0.1861 0.7780 l
0.1876 0.7783 l
0.1892 0.7786 l
0.1908 0.7790 l
0.1924 0.7794 l
0.1939 0.7801 l
0.1955 0.7809 l
0.1971 0.7820 l
0.1986 0.7836 l
0.2002 0.7857 l
0.2018 0.7883 l
0.2033 0.7904 l
0.2049 0.7909 l
0.2065 0.7885 l
0.2080 0.7840 l
0.2096 0.7791 l
0.2112 0.7746 l
0.2127 0.7707 l
0.2143 0.7674 l
0.2159 0.7646 l
0.2175 0.7622 l
0.2190 0.7602 l
0.2206 0.7584 l
0.2222 0.7568 l
0.2237 0.7553 l
0.2253 0.7540 l
0.2269 0.7528 l
0.2284 0.7517 l
0.2300 0.7506 l
0.2316 0.7496 l
0.2331 0.7486 l
0.2347 0.7477 l
0.2363 0.7468 l
0.2378 0.7460 l
0.2394 0.7452 l
0.2410 0.7444 l
0.2425 0.7436 l
0.2441 0.7429 l
0.2457 0.7421 l
0.2473 0.7414 l
0.2488 0.7407 l
0.2504 0.7400 l
0.2520 0.7394 l
0.2535 0.7387 l
0.2551 0.7381 l
0.2567 0.7375 l
0.2582 0.7368 l
0.2598 0.7362 l
0.2614 0.7356 l
0.2629 0.7350 l
0.2645 0.7344 l
0.2661 0.7339 l
0.2676 0.7333 l
0.2692 0.7327 l
0.2708 0.7322 l
0.2724 0.7317 l
0.2739 0.7311 l
0.2755 0.7306 l
0.2771 0.7301 l
0.2786 0.7296 l
0.2802 0.7291 l
0.2818 0.7286 l
0.2833 0.7281 l
0.2849 0.7276 l
0.2865 0.7271 l
0.2880 0.7266 l
0.2896 0.7262 l
0.2912 0.7257 l
0.2927 0.7252 l
0.2943 0.7248 l
0.2959 0.7243 l
0.2975 0.7239 l
0.2990 0.7235 l
0.3006 0.7230 l
0.3022 0.7226 l
0.3037 0.7222 l
0.3053 0.7218 l
0.3069 0.7214 l
0.3084 0.7210 l
0.3100 0.7206 l
0.3116 0.7203 l
0.3131 0.7199 l
0.3147 0.7195 l
0.3163 0.7191 l
0.3178 0.7188 l
0.3194 0.7184 l
0.3210 0.7180 l
0.3225 0.7177 l
0.3241 0.7173 l
0.3257 0.7170 l
0.3273 0.7166 l
0.3288 0.7163 l
0.3304 0.7159 l
0.3320 0.7156 l
0.3335 0.7153 l
0.3351 0.7150 l
0.3367 0.7146 l
0.3382 0.7143 l
0.3398 0.7140 l
0.3414 0.7137 l
0.3429 0.7134 l
0.3445 0.7131 l
0.3461 0.7128 l
0.3476 0.7124 l
0.3492 0.7122 l
0.3508 0.7119 l
0.3524 0.7116 l
0.3539 0.7113 l
0.3555 0.7110 l
0.3571 0.7107 l
0.3586 0.7104 l
0.3602 0.7102 l
0.3618 0.7099 l
0.3633 0.7096 l
0.3649 0.7094 l
0.3665 0.7091 l
0.3680 0.7088 l
0.3696 0.7086 l
0.3712 0.7083 l
0.3727 0.7081 l
0.3743 0.7078 l
0.3759 0.7076 l
0.3775 0.7073 l
0.3790 0.7071 l
0.3806 0.7068 l
0.3822 0.7066 l
0.3837 0.7064 l
0.3853 0.7061 l
0.3869 0.7059 l
0.3884 0.7057 l
0.3900 0.7055 l
0.3916 0.7052 l
0.3931 0.7050 l
0.3947 0.7048 l
0.3963 0.7046 l
0.3978 0.7044 l
0.3994 0.7042 l
0.4010 0.7040 l
0.4025 0.7038 l
0.4041 0.7035 l
0.4057 0.7033 l
0.4073 0.7031 l
0.4088 0.7029 l
0.4104 0.7028 l
0.4120 0.7026 l
0.4135 0.7024 l
0.4151 0.7022 l
0.4167 0.7020 l
0.4182 0.7018 l
0.4198 0.7016 l
0.4214 0.7014 l
0.4229 0.7013 l
0.4245 0.7011 l
0.4261 0.7009 l
0.4276 0.7007 l
0.4292 0.7006 l
0.4308 0.7004 l
0.4324 0.7002 l
0.4339 0.7000 l
0.4355 0.6999 l
0.4371 0.6997 l
0.4386 0.6995 l
0.4402 0.6994 l
0.4418 0.6992 l
0.4433 0.6991 l
0.4449 0.6989 l
0.4465 0.6988 l
0.4480 0.6986 l
0.4496 0.6984 l
0.4512 0.6983 l
0.4527 0.6981 l
0.4543 0.6980 l
0.4559 0.6978 l
0.4575 0.6977 l
0.4590 0.6976 l
0.4606 0.6974 l
0.4622 0.6973 l
0.4637 0.6971 l
0.4653 0.6970 l
0.4669 0.6969 l
0.4684 0.6967 l
0.4700 0.6966 l
0.4716 0.6964 l
0.4731 0.6963 l
0.4747 0.6962 l
0.4763 0.6961 l
0.4778 0.6959 l
0.4794 0.6958 l
0.4810 0.6957 l
0.4825 0.6955 l
0.4841 0.6954 l
0.4857 0.6953 l
0.4873 0.6952 l
0.4888 0.6950 l
0.4904 0.6949 l
0.4920 0.6948 l
0.4935 0.6947 l
0.4951 0.6946 l
0.4967 0.6945 l
0.4982 0.6943 l
0.4998 0.6942 l
0.5014 0.6941 l
0.5029 0.6940 l
0.5045 0.6939 l
0.5061 0.6938 l
0.5076 0.6937 l
0.5092 0.6936 l
0.5108 0.6935 l
0.5124 0.6934 l
0.5139 0.6932 l
0.5155 0.6931 l
0.5171 0.6930 l
0.5186 0.6929 l
0.5202 0.6928 l
0.5218 0.6927 l
0.5233 0.6926 l
0.5249 0.6925 l
0.5265 0.6924 l
0.5280 0.6923 l
0.5296 0.6922 l
0.5312 0.6921 l
0.5327 0.6920 l
0.5343 0.6920 l
0.5359 0.6919 l
0.5375 0.6918 l
0.5390 0.6917 l
0.5406 0.6916 l
0.5422 0.6915 l
0.5437 0.6914 l
0.5453 0.6913 l
0.5469 0.6913 l
0.5484 0.6912 l
0.5502 0.6911 l
0.5516 0.6910 l
0.5531 0.6909 l
0.5547 0.6908 l
0.5563 0.6908 l
0.5578 0.6907 l
0.5594 0.6906 l
0.5610 0.6905 l
0.5625 0.6904 l
0.5641 0.6904 l
0.5657 0.6903 l
0.5673 0.6902 l
0.5688 0.6901 l
0.5704 0.6900 l
0.5720 0.6900 l
0.5735 0.6899 l
0.5751 0.6898 l
0.5767 0.6897 l
0.5782 0.6897 l
0.5798 0.6896 l
0.5814 0.6895 l
0.5829 0.6894 l
0.5845 0.6894 l
0.5861 0.6893 l
0.5876 0.6892 l
0.5892 0.6892 l
0.5908 0.6891 l
0.5924 0.6890 l
0.5939 0.6890 l
0.5955 0.6889 l
0.5971 0.6888 l
0.5986 0.6887 l
0.6002 0.6887 l
0.6018 0.6886 l
0.6033 0.6885 l
0.6049 0.6885 l
0.6065 0.6884 l
0.6080 0.6884 l
0.6096 0.6883 l
0.6112 0.6882 l
0.6127 0.6882 l
0.6143 0.6881 l
0.6159 0.6880 l
0.6175 0.6880 l
0.6190 0.6879 l
0.6206 0.6879 l
0.6222 0.6878 l
0.6237 0.6877 l
0.6253 0.6877 l
0.6269 0.6876 l
0.6284 0.6876 l
0.6300 0.6875 l
0.6316 0.6874 l
0.6331 0.6874 l
0.6347 0.6873 l
0.6363 0.6873 l
0.6378 0.6872 l
0.6394 0.6872 l
0.6410 0.6871 l
0.6425 0.6870 l
0.6441 0.6870 l
0.6457 0.6869 l
0.6473 0.6869 l
0.6488 0.6868 l
0.6504 0.6868 l
0.6520 0.6867 l
0.6535 0.6867 l
0.6551 0.6866 l
0.6567 0.6866 l
0.6582 0.6865 l
0.6598 0.6865 l
0.6614 0.6864 l
0.6629 0.6864 l
0.6645 0.6863 l
0.6661 0.6863 l
0.6676 0.6862 l
0.6692 0.6862 l
0.6708 0.6861 l
0.6724 0.6861 l
0.6739 0.6860 l
0.6755 0.6860 l
0.6771 0.6859 l
0.6786 0.6859 l
0.6802 0.6858 l
0.6818 0.6858 l
0.6833 0.6857 l
0.6849 0.6857 l
0.6865 0.6856 l
0.6880 0.6856 l
0.6896 0.6856 l
0.6912 0.6855 l
0.6927 0.6855 l
0.6943 0.6854 l
0.6959 0.6854 l
0.6975 0.6853 l
0.6990 0.6853 l
0.7006 0.6852 l
0.7022 0.6852 l
0.7037 0.6852 l
0.7053 0.6851 l
0.7069 0.6851 l
0.7084 0.6850 l
0.7100 0.6850 l
0.7116 0.6850 l
0.7131 0.6849 l
0.7147 0.6849 l
0.7163 0.6848 l
0.7178 0.6848 l
0.7194 0.6848 l
0.7210 0.6847 l
0.7225 0.6847 l
0.7241 0.6846 l
0.7257 0.6846 l
0.7273 0.6846 l
0.7288 0.6845 l
0.7304 0.6845 l
0.7320 0.6844 l
0.7335 0.6844 l
0.7351 0.6844 l
0.7367 0.6843 l
0.7382 0.6843 l
0.7398 0.6843 l
0.7414 0.6842 l
0.7429 0.6842 l
0.7445 0.6842 l
0.7461 0.6841 l
0.7476 0.6841 l
0.7492 0.6840 l
0.7508 0.6840 l
0.7524 0.6840 l
0.7539 0.6839 l
0.7555 0.6839 l
0.7571 0.6839 l
0.7586 0.6838 l
0.7602 0.6838 l
0.7618 0.6838 l
0.7633 0.6837 l
0.7649 0.6837 l
0.7665 0.6837 l
0.7680 0.6836 l
0.7696 0.6836 l
0.7712 0.6836 l
0.7727 0.6835 l
0.7743 0.6835 l
0.7759 0.6835 l
0.7775 0.6834 l
0.7790 0.6834 l
0.7806 0.6834 l
0.7822 0.6834 l
0.7837 0.6833 l
0.7853 0.6833 l
0.7869 0.6833 l
0.7884 0.6832 l
0.7900 0.6832 l
0.7916 0.6832 l
0.7931 0.6831 l
0.7947 0.6831 l
0.7963 0.6831 l
0.7978 0.6831 l
0.7994 0.6830 l
0.8010 0.6830 l
0.8025 0.6830 l
0.8041 0.6829 l
0.8057 0.6829 l
0.8073 0.6829 l
0.8088 0.6829 l
0.8104 0.6828 l
0.8120 0.6828 l
0.8135 0.6828 l
0.8151 0.6827 l
0.8167 0.6827 l
0.8182 0.6827 l
0.8198 0.6827 l
0.8214 0.6826 l
0.8229 0.6826 l
0.8245 0.6826 l
0.8261 0.6826 l
0.8276 0.6825 l
0.8292 0.6825 l
0.8308 0.6825 l
0.8324 0.6824 l
0.8339 0.6824 l
0.8355 0.6824 l
0.8371 0.6824 l
0.8386 0.6823 l
0.8402 0.6823 l
0.8418 0.6823 l
0.8433 0.6823 l
0.8449 0.6822 l
0.8465 0.6822 l
0.8480 0.6822 l
0.8496 0.6822 l
0.8512 0.6821 l
0.8527 0.6821 l
0.8543 0.6821 l
0.8559 0.6821 l
0.8575 0.6821 l
0.8590 0.6820 l
0.8606 0.6820 l
0.8622 0.6820 l
0.8637 0.6820 l
0.8653 0.6819 l
0.8669 0.6819 l
0.8684 0.6819 l
0.8700 0.6819 l
0.8716 0.6818 l
0.8731 0.6818 l
0.8747 0.6818 l
0.8763 0.6818 l
0.8778 0.6818 l
0.8794 0.6817 l
0.8810 0.6817 l
0.8825 0.6817 l
0.8841 0.6817 l
0.8857 0.6816 l
0.8873 0.6816 l
0.8888 0.6816 l
0.8904 0.6816 l
0.8920 0.6816 l
0.8935 0.6815 l
0.8951 0.6815 l
0.8967 0.6815 l
0.8982 0.6815 l
0.8998 0.6815 l
0.9014 0.6814 l
0.9029 0.6814 l
0.9045 0.6814 l
0.9061 0.6814 l
0.9076 0.6814 l
0.9092 0.6813 l
0.9108 0.6813 l
0.9124 0.6813 l
0.9139 0.6813 l
0.9155 0.6813 l
0.9171 0.6812 l
0.9186 0.6812 l
0.9202 0.6812 l
0.9218 0.6812 l
0.9233 0.6812 l
0.9249 0.6811 l
0.9265 0.6811 l
0.9280 0.6811 l
0.9296 0.6811 l
0.9312 0.6811 l
0.9327 0.6810 l
0.9343 0.6810 l
0.9359 0.6810 l
0.9375 0.6810 l
0.9390 0.6810 l
0.9406 0.6810 l
0.9422 0.6809 l
0.9437 0.6809 l
0.9453 0.6809 l
0.9469 0.6809 l
0.9484 0.6809 l
0.9500 0.6808 l
s
[/DeviceRGB] SCS
Color5 SC
n
0.1500 0.3187 m
0.1516 0.3189 l
0.1531 0.3190 l
0.1547 0.3192 l
0.1563 0.3193 l
0.1578 0.3195 l
0.1594 0.3196 l
0.1610 0.3198 l
0.1625 0.3199 l
0.1641 0.3201 l
0.1657 0.3202 l
0.1673 0.3203 l
0.1688 0.3205 l
0.1704 0.3206 l
0.1720 0.3208 l
0.1735 0.3209 l
0.1751 0.3211 l
0.1767 0.3212 l
0.1782 0.3214 l
0.1798 0.3216 l
0.1814 0.3217 l
0.1829 0.3219 l
0.1845 0.3221 l
0.1861 0.3224 l
0.1876 0.3226 l
0.1892 0.3229 l
0.1908 0.3233 l
0.1924 0.3238 l
0.1939 0.3244 l
0.1955 0.3253 l
0.1971 0.3264 l
0.1986 0.3280 l
0.2002 0.3301 l
0.2018 0.3326 l
0.2033 0.3347 l
0.2049 0.3352 l
0.2065 0.3327 l
0.2080 0.3283 l
0.2096 0.3233 l
0.2112 0.3187 l
0.2127 0.3147 l
0.2143 0.3114 l
0.2159 0.3086 l
0.2175 0.3062 l
0.2190 0.3041 l
0.2206 0.3022 l
0.2222 0.3006 l
0.2237 0.2991 l
0.2253 0.2977 l
0.2269 0.2965 l
0.2284 0.2953 l
0.2300 0.2942 l
0.2316 0.2931 l
0.2331 0.2921 l
0.2347 0.2912 l
0.2363 0.2902 l
0.2378 0.2893 l
0.2394 0.2885 l
0.2410 0.2877 l
0.2425 0.2868 l
0.2441 0.2861 l
0.2457 0.2853 l
0.2473 0.2845 l
0.2488 0.2838 l
0.2504 0.2831 l
0.2520 0.2824 l
0.2535 0.2817 l
0.2551 0.2810 l
0.2567 0.2804 l
0.2582 0.2797 l
0.2598 0.2791 l
0.2614 0.2784 l
0.2629 0.2778 l
0.2645 0.2772 l
0.2661 0.2766 l
0.2676 0.2760 l
0.2692 0.2754 l
0.2708 0.2748 l
0.2724 0.2742 l
0.2739 0.2737 l
0.2755 0.2731 l
0.2771 0.2725 l
0.2786 0.2720 l
0.2802 0.2715 l
0.2818 0.2709 l
0.2833 0.2704 l
0.2849 0.2699 l
0.2865 0.2694 l
0.2880 0.2689 l
0.2896 0.2684 l
0.2912 0.2679 l
0.2927 0.2674 l
0.2943 0.2669 l
0.2959 0.2665 l
0.2975 0.2660 l
0.2990 0.2655 l
0.3006 0.2651 l
0.3022 0.2646 l
0.3037 0.2642 l
0.3053 0.2638 l
0.3069 0.2634 l
0.3084 0.2629 l
0.3100 0.2625 l
0.3116 0.2621 l
0.3131 0.2617 l
0.3147 0.2613 l
0.3163 0.2609 l
0.3178 0.2605 l
0.3194 0.2601 l
0.3210 0.2598 l
0.3225 0.2594 l
0.3241 0.2590 l
0.3257 0.2586 l
0.3273 0.2583 l
0.3288 0.2579 l
0.3304 0.2575 l
0.3320 0.2572 l
0.3335 0.2568 l
0.3351 0.2565 l
0.3367 0.2561 l
0.3382 0.2558 l
0.3398 0.2555 l
0.3414 0.2551 l
0.3429 0.2548 l
0.3445 0.2545 l
0.3461 0.2541 l
0.3476 0.2538 l
0.3492 0.2535 l
0.3508 0.2532 l
0.3524 0.2529 l
0.3539 0.2526 l
0.3555 0.2523 l
0.3571 0.2520 l
0.3586 0.2517 l
0.3602 0.2514 l
0.3618 0.2511 l
0.3633 0.2508 l
0.3649 0.2505 l
0.3665 0.2503 l
0.3680 0.2500 l
0.3696 0.2497 l
0.3712 0.2494 l
0.3727 0.2492 l
0.3743 0.2489 l
0.3759 0.2486 l
0.3775 0.2484 l
0.3790 0.2481 l
0.3806 0.2479 l
0.3822 0.2476 l
0.3837 0.2474 l
0.3853 0.2471 l
0.3869 0.2469 l
0.3884 0.2466 l
0.3900 0.2464 l
0.3916 0.2462 l
0.3931 0.2459 l
0.3947 0.2457 l
0.3963 0.2455 l
0.3978 0.2453 l
0.3994 0.2450 l
0.4010 0.2448 l
0.4025 0.2446 l
0.4041 0.2444 l
0.4057 0.2442 l
0.4073 0.2439 l
0.4088 0.2437 l
0.4104 0.2435 l
0.4120 0.2433 l
0.4135 0.2431 l
0.4151 0.2429 l
0.4167 0.2427 l
0.4182 0.2425 l
0.4198 0.2423 l
0.4214 0.2421 l
0.4229 0.2419 l
0.4245 0.2417 l
0.4261 0.2416 l
0.4276 0.2414 l
0.4292 0.2412 l
0.4308 0.2410 l
0.4324 0.2408 l
0.4339 0.2406 l
0.4355 0.2405 l
0.4371 0.2403 l
0.4386 0.2401 l
0.4402 0.2399 l
0.4418 0.2398 l
0.4433 0.2396 l
0.4449 0.2394 l
0.4465 0.2393 l
0.4480 0.2391 l
0.4496 0.2389 l
0.4512 0.2388 l
0.4527 0.2386 l
0.4543 0.2385 l
0.4559 0.2383 l
0.4575 0.2381 l
0.4590 0.2380 l
0.4606 0.2378 l
0.4622 0.2377 l
0.4637 0.2375 l
0.4653 0.2374 l
0.4669 0.2372 l
0.4684 0.2371 l
0.4700 0.2370 l
0.4716 0.2368 l
0.4731 0.2367 l
0.4747 0.2365 l
0.4763 0.2364 l
0.4778 0.2363 l
0.4794 0.2361 l
0.4810 0.2360 l
0.4825 0.2359 l
0.4841 0.2357 l
0.4857 0.2356 l
0.4873 0.2355 l
0.4888 0.2353 l
0.4904 0.2352 l
0.4920 0.2351 l
0.4935 0.2349 l
0.4951 0.2348 l
0.4967 0.2347 l
0.4982 0.2346 l
0.4998 0.2345 l
0.5014 0.2343 l
0.5029 0.2342 l
0.5045 0.2341 l
0.5061 0.2340 l
0.5076 0.2339 l
0.5092 0.2337 l
0.5108 0.2336 l
0.5124 0.2335 l
0.5139 0.2334 l
0.5155 0.2333 l
0.5171 0.2332 l
0.5186 0.2331 l
0.5202 0.2330 l
0.5218 0.2329 l
0.5233 0.2328 l
0.5249 0.2326 l
0.5265 0.2325 l
0.5280 0.2324 l
0.5296 0.2323 l
0.5312 0.2322 l
0.5327 0.2321 l
0.5343 0.2320 l
0.5359 0.2319 l
0.5375 0.2319 l
0.5390 0.2318 l
0.5406 0.2317 l
0.5422 0.2316 l
0.5437 0.2315 l
0.5453 0.2314 l
0.5469 0.2313 l
0.5484 0.2312 l
0.5502 0.2311 l
0.5516 0.2310 l
0.5531 0.2309 l
0.5547 0.2308 l
0.5563 0.2308 l
0.5578 0.2307 l
0.5594 0.2306 l
0.5610 0.2305 l
0.5625 0.2304 l
0.5641 0.2303 l
0.5657 0.2302 l
0.5673 0.2302 l
0.5688 0.2301 l
0.5704 0.2300 l
0.5720 0.2299 l
0.5735 0.2298 l
0.5751 0.2297 l
0.5767 0.2297 l
0.5782 0.2296 l
0.5798 0.2295 l
0.5814 0.2294 l
0.5829 0.2294 l
0.5845 0.2293 l
0.5861 0.2292 l
0.5876 0.2291 l
0.5892 0.2291 l
0.5908 0.2290 l
0.5924 0.2289 l
0.5939 0.2288 l
0.5955 0.2288 l
0.5971 0.2287 l
0.5986 0.2286 l
0.6002 0.2285 l
0.6018 0.2285 l
0.6033 0.2284 l
0.6049 0.2283 l
0.6065 0.2283 l
0.6080 0.2282 l
0.6096 0.2281 l
0.6112 0.2281 l
0.6127 0.2280 l
0.6143 0.2279 l
0.6159 0.2279 l
0.6175 0.2278 l
0.6190 0.2277 l
0.6206 0.2277 l
0.6222 0.2276 l
0.6237 0.2275 l
0.6253 0.2275 l
0.6269 0.2274 l
0.6284 0.2273 l
0.6300 0.2273 l
0.6316 0.2272 l
0.6331 0.2272 l
0.6347 0.2271 l
0.6363 0.2270 l
0.6378 0.2270 l
0.6394 0.2269 l
0.6410 0.2269 l
0.6425 0.2268 l
0.6441 0.2267 l
0.6457 0.2267 l
0.6473 0.2266 l
0.6488 0.2266 l
0.6504 0.2265 l
0.6520 0.2265 l
0.6535 0.2264 l
0.6551 0.2263 l
0.6567 0.2263 l
0.6582 0.2262 l
0.6598 0.2262 l
0.6614 0.2261 l
0.6629 0.2261 l
0.6645 0.2260 l
0.6661 0.2260 l
0.6676 0.2259 l
0.6692 0.2259 l
0.6708 0.2258 l
0.6724 0.2258 l
0.6739 0.2257 l
0.6755 0.2257 l
0.6771 0.2256 l
0.6786 0.2256 l
0.6802 0.2255 l
0.6818 0.2255 l
0.6833 0.2254 l
0.6849 0.2254 l
0.6865 0.2253 l
0.6880 0.2253 l
0.6896 0.2252 l
0.6912 0.2252 l
0.6927 0.2251 l
0.6943 0.2251 l
0.6959 0.2250 l
0.6975 0.2250 l
0.6990 0.2249 l
0.7006 0.2249 l
0.7022 0.2248 l
0.7037 0.2248 l
0.7053 0.2247 l
0.7069 0.2247 l
0.7084 0.2247 l
0.7100 0.2246 l
0.7116 0.2246 l
0.7131 0.2245 l
0.7147 0.2245 l
0.7163 0.2244 l
0.7178 0.2244 l
0.7194 0.2244 l
0.7210 0.2243 l
0.7225 0.2243 l
0.7241 0.2242 l
0.7257 0.2242 l
0.7273 0.2241 l
0.7288 0.2241 l
0.7304 0.2241 l
0.7320 0.2240 l
0.7335 0.2240 l
0.7351 0.2239 l
0.7367 0.2239 l
0.7382 0.2239 l
0.7398 0.2238 l
0.7414 0.2238 l
0.7429 0.2238 l
0.7445 0.2237 l
0.7461 0.2237 l
0.7476 0.2236 l
0.7492 0.2236 l
0.7508 0.2236 l
0.7524 0.2235 l
0.7539 0.2235 l
0.7555 0.2235 l
0.7571 0.2234 l
0.7586 0.2234 l
0.7602 0.2233 l
0.7618 0.2233 l
0.7633 0.2233 l
0.7649 0.2232 l
0.7665 0.2232 l
0.7680 0.2232 l
0.7696 0.2231 l
0.7712 0.2231 l
0.7727 0.2231 l
0.7743 0.2230 l
0.7759 0.2230 l
0.7775 0.2230 l
0.7790 0.2229 l
0.7806 0.2229 l
0.7822 0.2229 l
0.7837 0.2228 l
0.7853 0.2228 l
0.7869 0.2228 l
0.7884 0.2227 l
0.7900 0.2227 l
0.7916 0.2227 l
0.7931 0.2226 l
0.7947 0.2226 l
0.7963 0.2226 l
0.7978 0.2225 l
0.7994 0.2225 l
0.8010 0.2225 l
0.8025 0.2224 l
0.8041 0.2224 l
0.8057 0.2224 l
0.8073 0.2224 l
0.8088 0.2223 l
0.8104 0.2223 l
0.8120 0.2223 l
0.8135 0.2222 l
0.8151 0.2222 l
0.8167 0.2222 l
0.8182 0.2221 l
0.8198 0.2221 l
0.8214 0.2221 l
0.8229 0.2221 l
0.8245 0.2220 l
0.8261 0.2220 l
0.8276 0.2220 l
0.8292 0.2219 l
0.8308 0.2219 l
0.8324 0.2219 l
0.8339 0.2219 l
0.8355 0.2218 l
0.8371 0.2218 l
0.8386 0.2218 l
0.8402 0.2218 l
0.8418 0.2217 l
0.8433 0.2217 l
0.8449 0.2217 l
0.8465 0.2216 l
0.8480 0.2216 l
0.8496 0.2216 l
0.8512 0.2216 l
0.8527 0.2215 l
0.8543 0.2215 l
0.8559 0.2215 l
0.8575 0.2215 l
0.8590 0.2214 l
0.8606 0.2214 l
0.8622 0.2214 l
0.8637 0.2214 l
0.8653 0.2213 l
0.8669 0.2213 l
0.8684 0.2213 l
0.8700 0.2213 l
0.8716 0.2212 l
0.8731 0.2212 l
0.8747 0.2212 l
0.8763 0.2212 l
0.8778 0.2212 l
0.8794 0.2211 l
0.8810 0.2211 l
0.8825 0.2211 l
0.8841 0.2211 l
0.8857 0.2210 l
0.8873 0.2210 l
0.8888 0.2210 l
0.8904 0.2210 l
0.8920 0.2209 l
0.8935 0.2209 l
0.8951 0.2209 l
0.8967 0.2209 l
0.8982 0.2209 l
0.8998 0.2208 l
0.9014 0.2208 l
0.9029 0.2208 l
0.9045 0.2208 l
0.9061 0.2207 l
0.9076 0.2207 l
0.9092 0.2207 l
0.9108 0.2207 l
0.9124 0.2207 l
0.9139 0.2206 l
0.9155 0.2206 l
0.9171 0.2206 l
0.9186 0.2206 l
0.9202 0.2206 l
0.9218 0.2205 l
0.9233 0.2205 l
0.9249 0.2205 l
0.9265 0.2205 l
0.9280 0.2205 l
0.9296 0.2204 l
0.9312 0.2204 l
0.9327 0.2204 l
0.9343 0.2204 l
0.9359 0.2204 l
0.9375 0.2203 l
0.9390 0.2203 l
0.9406 0.2203 l
0.9422 0.2203 l
0.9437 0.2203 l
0.9453 0.2202 l
0.9469 0.2202 l
0.9484 0.2202 l
0.9500 0.2202 l
s
[/DeviceRGB] SCS
Color6 SC
n
0.2027 0.1499 m
0.2033 0.1679 l
0.2049 0.2157 l
0.2065 0.2601 l
0.2080 0.2987 l
0.2096 0.3315 l
0.2112 0.3595 l
0.2127 0.3837 l
0.2143 0.4049 l
0.2159 0.4236 l
0.2175 0.4403 l
0.2190 0.4553 l
0.2206 0.4689 l
0.2222 0.4813 l
0.2237 0.4926 l
0.2253 0.5030 l
0.2269 0.5127 l
0.2284 0.5217 l
0.2300 0.5300 l
0.2316 0.5378 l
0.2331 0.5452 l
0.2347 0.5520 l
0.2363 0.5585 l
0.2378 0.5646 l
0.2394 0.5704 l
0.2410 0.5759 l
0.2425 0.5811 l
0.2441 0.5860 l
0.2457 0.5908 l
0.2473 0.5952 l
0.2488 0.5995 l
0.2504 0.6036 l
0.2520 0.6075 l
0.2535 0.6113 l
0.2551 0.6149 l
0.2567 0.6183 l
0.2582 0.6216 l
0.2598 0.6248 l
0.2614 0.6279 l
0.2629 0.6308 l
0.2645 0.6337 l
0.2661 0.6364 l
0.2676 0.6391 l
0.2692 0.6416 l
0.2708 0.6441 l
0.2724 0.6465 l
0.2739 0.6488 l
0.2755 0.6510 l
0.2771 0.6532 l
0.2786 0.6553 l
0.2802 0.6573 l
0.2818 0.6593 l
0.2833 0.6612 l
0.2849 0.6630 l
0.2865 0.6648 l
0.2880 0.6666 l
0.2896 0.6683 l
0.2912 0.6699 l
0.2927 0.6715 l
0.2943 0.6731 l
0.2959 0.6746 l
0.2975 0.6761 l
0.2990 0.6775 l
0.3006 0.6789 l
0.3022 0.6803 l
0.3037 0.6816 l
0.3053 0.6828 l
0.3069 0.6840 l
0.3084 0.6852 l
0.3100 0.6864 l
0.3116 0.6875 l
0.3131 0.6886 l
0.3147 0.6897 l
0.3163 0.6908 l
0.3178 0.6918 l
0.3194 0.6929 l
0.3210 0.6939 l
0.3225 0.6948 l
0.3241 0.6958 l
0.3257 0.6967 l
0.3273 0.6977 l
0.3288 0.6985 l
0.3304 0.6994 l
0.3320 0.7003 l
0.3335 0.7011 l
0.3351 0.7020 l
0.3367 0.7028 l
0.3382 0.7036 l
0.3398 0.7043 l
0.3414 0.7051 l
0.3429 0.7058 l
0.3445 0.7066 l
0.3461 0.7073 l
0.3476 0.7080 l
0.3492 0.7087 l
0.3508 0.7094 l
0.3524 0.7101 l
0.3539 0.7107 l
0.3555 0.7113 l
0.3571 0.7120 l
0.3586 0.7126 l
0.3602 0.7132 l
0.3618 0.7138 l
0.3633 0.7144 l
0.3649 0.7150 l
0.3665 0.7155 l
0.3680 0.7161 l
0.3696 0.7166 l
0.3712 0.7171 l
0.3727 0.7177 l
0.3743 0.7182 l
0.3759 0.7187 l
0.3775 0.7192 l
0.3790 0.7197 l
0.3806 0.7202 l
0.3822 0.7206 l
0.3837 0.7211 l
0.3853 0.7216 l
0.3869 0.7220 l
0.3884 0.7225 l
0.3900 0.7229 l
0.3916 0.7233 l
0.3931 0.7237 l
0.3947 0.7242 l
0.3963 0.7246 l
0.3978 0.7250 l
0.3994 0.7254 l
0.4010 0.7258 l
0.4025 0.7261 l
0.4041 0.7265 l
0.4057 0.7269 l
0.4073 0.7273 l
0.4088 0.7276 l
0.4104 0.7280 l
0.4120 0.7283 l
0.4135 0.7287 l
0.4151 0.7290 l
0.4167 0.7293 l
0.4182 0.7297 l
0.4198 0.7300 l
0.4214 0.7303 l
0.4229 0.7306 l
0.4245 0.7310 l
0.4261 0.7313 l
0.4276 0.7316 l
0.4292 0.7319 l
0.4308 0.7322 l
0.4324 0.7324 l
0.4339 0.7327 l
0.4355 0.7330 l
0.4371 0.7333 l
0.4386 0.7336 l
0.4402 0.7338 l
0.4418 0.7341 l
0.4433 0.7344 l
0.4449 0.7346 l
0.4465 0.7349 l
0.4480 0.7352 l
0.4496 0.7354 l
0.4512 0.7357 l
0.4527 0.7359 l
0.4543 0.7361 l
0.4559 0.7364 l
0.4575 0.7366 l
0.4590 0.7368 l
0.4606 0.7371 l
0.4622 0.7373 l
0.4637 0.7375 l
0.4653 0.7377 l
0.4669 0.7380 l
0.4684 0.7382 l
0.4700 0.7384 l
0.4716 0.7386 l
0.4731 0.7388 l
0.4747 0.7390 l
0.4763 0.7392 l
0.4778 0.7394 l
0.4794 0.7396 l
0.4810 0.7398 l
0.4825 0.7400 l
0.4841 0.7402 l
0.4857 0.7404 l
0.4873 0.7406 l
0.4888 0.7408 l
0.4904 0.7409 l
0.4920 0.7411 l
0.4935 0.7413 l
0.4951 0.7415 l
0.4967 0.7417 l
0.4982 0.7418 l
0.4998 0.7420 l
0.5014 0.7422 l
0.5029 0.7423 l
0.5045 0.7425 l
0.5061 0.7427 l
0.5076 0.7428 l
0.5092 0.7430 l
0.5108 0.7431 l
0.5124 0.7433 l
0.5139 0.7435 l
0.5155 0.7436 l
0.5171 0.7438 l
0.5186 0.7439 l
0.5202 0.7441 l
0.5218 0.7442 l
0.5233 0.7443 l
0.5249 0.7445 l
0.5265 0.7446 l
0.5280 0.7448 l
0.5296 0.7449 l
0.5312 0.7450 l
0.5327 0.7452 l
0.5343 0.7453 l
0.5359 0.7454 l
0.5375 0.7455 l
0.5390 0.7457 l
0.5406 0.7458 l
0.5422 0.7459 l
0.5437 0.7460 l
0.5453 0.7461 l
0.5469 0.7462 l
0.5484 0.7464 l
0.5502 0.7465 l
0.5516 0.7466 l
0.5531 0.7467 l
0.5547 0.7468 l
0.5563 0.7469 l
0.5578 0.7470 l
0.5594 0.7472 l
0.5610 0.7473 l
0.5625 0.7474 l
0.5641 0.7475 l
0.5657 0.7476 l
0.5673 0.7477 l
0.5688 0.7478 l
0.5704 0.7479 l
0.5720 0.7480 l
0.5735 0.7481 l
0.5751 0.7482 l
0.5767 0.7483 l
0.5782 0.7484 l
0.5798 0.7485 l
0.5814 0.7486 l
0.5829 0.7487 l
0.5845 0.7488 l
0.5861 0.7489 l
0.5876 0.7490 l
0.5892 0.7491 l
0.5908 0.7492 l
0.5924 0.7493 l
0.5939 0.7494 l
0.5955 0.7494 l
0.5971 0.7495 l
0.5986 0.7496 l
0.6002 0.7497 l
0.6018 0.7498 l
0.6033 0.7499 l
0.6049 0.7500 l
0.6065 0.7501 l
0.6080 0.7501 l
0.6096 0.7502 l
0.6112 0.7503 l
0.6127 0.7504 l
0.6143 0.7505 l
0.6159 0.7505 l
0.6175 0.7506 l
0.6190 0.7507 l
0.6206 0.7508 l
0.6222 0.7509 l
0.6237 0.7509 l
0.6253 0.7510 l
0.6269 0.7511 l
0.6284 0.7512 l
0.6300 0.7512 l
0.6316 0.7513 l
0.6331 0.7514 l
0.6347 0.7515 l
0.6363 0.7515 l
0.6378 0.7516 l
0.6394 0.7517 l
0.6410 0.7517 l
0.6425 0.7518 l
0.6441 0.7519 l
0.6457 0.7520 l
0.6473 0.7520 l
0.6488 0.7521 l
0.6504 0.7522 l
0.6520 0.7522 l
0.6535 0.7523 l
0.6551 0.7524 l
0.6567 0.7524 l
0.6582 0.7525 l
0.6598 0.7526 l
0.6614 0.7526 l
0.6629 0.7527 l
0.6645 0.7527 l
0.6661 0.7528 l
0.6676 0.7529 l
0.6692 0.7529 l
0.6708 0.7530 l
0.6724 0.7530 l
0.6739 0.7531 l
0.6755 0.7532 l
0.6771 0.7532 l
0.6786 0.7533 l
0.6802 0.7533 l
0.6818 0.7534 l
0.6833 0.7535 l
0.6849 0.7535 l
0.6865 0.7536 l
0.6880 0.7536 l
0.6896 0.7537 l
0.6912 0.7537 l
0.6927 0.7538 l
0.6943 0.7538 l
0.6959 0.7539 l
0.6975 0.7539 l
0.6990 0.7540 l
0.7006 0.7541 l
0.7022 0.7541 l
0.7037 0.7542 l
0.7053 0.7542 l
0.7069 0.7543 l
0.7084 0.7543 l
0.7100 0.7544 l
0.7116 0.7544 l
0.7131 0.7545 l
0.7147 0.7545 l
0.7163 0.7546 l
0.7178 0.7546 l
0.7194 0.7547 l
0.7210 0.7547 l
0.7225 0.7548 l
0.7241 0.7548 l
0.7257 0.7548 l
0.7273 0.7549 l
0.7288 0.7549 l
0.7304 0.7550 l
0.7320 0.7550 l
0.7335 0.7551 l
0.7351 0.7551 l
0.7367 0.7552 l
0.7382 0.7552 l
0.7398 0.7553 l
0.7414 0.7553 l
0.7429 0.7553 l
0.7445 0.7554 l
0.7461 0.7554 l
0.7476 0.7555 l
0.7492 0.7555 l
0.7508 0.7556 l
0.7524 0.7556 l
0.7539 0.7556 l
0.7555 0.7557 l
0.7571 0.7557 l
0.7586 0.7558 l
0.7602 0.7558 l
0.7618 0.7558 l
0.7633 0.7559 l
0.7649 0.7559 l
0.7665 0.7560 l
0.7680 0.7560 l
0.7696 0.7560 l
0.7712 0.7561 l
0.7727 0.7561 l
0.7743 0.7561 l
0.7759 0.7562 l
0.7775 0.7562 l
0.7790 0.7563 l
0.7806 0.7563 l
0.7822 0.7563 l
0.7837 0.7564 l
0.7853 0.7564 l
0.7869 0.7564 l
0.7884 0.7565 l
0.7900 0.7565 l
0.7916 0.7566 l
0.7931 0.7566 l
0.7947 0.7566 l
0.7963 0.7567 l
0.7978 0.7567 l
0.7994 0.7567 l
0.8010 0.7568 l
0.8025 0.7568 l
0.8041 0.7568 l
0.8057 0.7569 l
0.8073 0.7569 l
0.8088 0.7569 l
0.8104 0.7570 l
0.8120 0.7570 l
0.8135 0.7570 l
0.8151 0.7571 l
0.8167 0.7571 l
0.8182 0.7571 l
0.8198 0.7571 l
0.8214 0.7572 l
0.8229 0.7572 l
0.8245 0.7572 l
0.8261 0.7573 l
0.8276 0.7573 l
0.8292 0.7573 l
0.8308 0.7574 l
0.8324 0.7574 l
0.8339 0.7574 l
0.8355 0.7575 l
0.8371 0.7575 l
0.8386 0.7575 l
0.8402 0.7575 l
0.8418 0.7576 l
0.8433 0.7576 l
0.8449 0.7576 l
0.8465 0.7577 l
0.8480 0.7577 l
0.8496 0.7577 l
0.8512 0.7577 l
0.8527 0.7578 l
0.8543 0.7578 l
0.8559 0.7578 l
0.8575 0.7579 l
0.8590 0.7579 l
0.8606 0.7579 l
0.8622 0.7579 l
0.8637 0.7580 l
0.8653 0.7580 l
0.8669 0.7580 l
0.8684 0.7580 l
0.8700 0.7581 l
0.8716 0.7581 l
0.8731 0.7581 l
0.8747 0.7581 l
0.8763 0.7582 l
0.8778 0.7582 l
0.8794 0.7582 l
0.8810 0.7582 l
0.8825 0.7583 l
0.8841 0.7583 l
0.8857 0.7583 l
0.8873 0.7583 l
0.8888 0.7584 l
0.8904 0.7584 l
0.8920 0.7584 l
0.8935 0.7584 l
0.8951 0.7585 l
0.8967 0.7585 l
0.8982 0.7585 l
0.8998 0.7585 l
0.9014 0.7586 l
0.9029 0.7586 l
0.9045 0.7586 l
0.9061 0.7586 l
0.9076 0.7587 l
0.9092 0.7587 l
0.9108 0.7587 l
0.9124 0.7587 l
0.9139 0.7587 l
0.9155 0.7588 l
0.9171 0.7588 l
0.9186 0.7588 l
0.9202 0.7588 l
0.9218 0.7589 l
0.9233 0.7589 l
0.9249 0.7589 l
0.9265 0.7589 l
0.9280 0.7589 l
0.9296 0.7590 l
0.9312 0.7590 l
0.9327 0.7590 l
0.9343 0.7590 l
0.9359 0.7590 l
0.9375 0.7591 l
0.9390 0.7591 l
0.9406 0.7591 l
0.9422 0.7591 l
0.9437 0.7591 l
0.9453 0.7592 l
0.9469 0.7592 l
0.9484 0.7592 l
0.9500 0.7592 l
s
[/DeviceRGB] SCS
Color7 SC
n
0.2093 0.1499 m
0.2096 0.1556 l
0.2112 0.1839 l
0.2127 0.2082 l
0.2143 0.2296 l
0.2159 0.2484 l
0.2175 0.2652 l
0.2190 0.2802 l
0.2206 0.2939 l
0.2222 0.3063 l
0.2237 0.3177 l
0.2253 0.3282 l
0.2269 0.3379 l
0.2284 0.3469 l
0.2300 0.3552 l
0.2316 0.3631 l
0.2331 0.3704 l
0.2347 0.3773 l
0.2363 0.3838 l
0.2378 0.3899 l
0.2394 0.3957 l
0.2410 0.4012 l
0.2425 0.4064 l
0.2441 0.4114 l
0.2457 0.4161 l
0.2473 0.4206 l
0.2488 0.4249 l
0.2504 0.4290 l
0.2520 0.4329 l
0.2535 0.4367 l
0.2551 0.4403 l
0.2567 0.4437 l
0.2582 0.4470 l
0.2598 0.4502 l
0.2614 0.4533 l
0.2629 0.4563 l
0.2645 0.4591 l
0.2661 0.4619 l
0.2676 0.4645 l
0.2692 0.4671 l
0.2708 0.4695 l
0.2724 0.4719 l
0.2739 0.4742 l
0.2755 0.4765 l
0.2771 0.4786 l
0.2786 0.4807 l
0.2802 0.4828 l
0.2818 0.4847 l
0.2833 0.4867 l
0.2849 0.4885 l
0.2865 0.4903 l
0.2880 0.4921 l
0.2896 0.4938 l
0.2912 0.4954 l
0.2927 0.4970 l
0.2943 0.4986 l
0.2959 0.5001 l
0.2975 0.5016 l
0.2990 0.5030 l
0.3006 0.5044 l
0.3022 0.5058 l
0.3037 0.5071 l
0.3053 0.5083 l
0.3069 0.5095 l
0.3084 0.5107 l
0.3100 0.5119 l
0.3116 0.5130 l
0.3131 0.5141 l
0.3147 0.5152 l
0.3163 0.5163 l
0.3178 0.5173 l
0.3194 0.5183 l
0.3210 0.5193 l
0.3225 0.5203 l
0.3241 0.5213 l
0.3257 0.5222 l
0.3273 0.5231 l
0.3288 0.5240 l
0.3304 0.5249 l
0.3320 0.5258 l
0.3335 0.5266 l
0.3351 0.5274 l
0.3367 0.5282 l
0.3382 0.5290 l
0.3398 0.5298 l
0.3414 0.5305 l
0.3429 0.5313 l
0.3445 0.5320 l
0.3461 0.5328 l
0.3476 0.5335 l
0.3492 0.5342 l
0.3508 0.5349 l
0.3524 0.5355 l
0.3539 0.5362 l
0.3555 0.5368 l
0.3571 0.5375 l
0.3586 0.5381 l
0.3602 0.5387 l
0.3618 0.5393 l
0.3633 0.5399 l
0.3649 0.5404 l
0.3665 0.5410 l
0.3680 0.5415 l
0.3696 0.5421 l
0.3712 0.5426 l
0.3727 0.5431 l
0.3743 0.5437 l
0.3759 0.5442 l
0.3775 0.5447 l
0.3790 0.5452 l
0.3806 0.5456 l
0.3822 0.5461 l
0.3837 0.5466 l
0.3853 0.5470 l
0.3869 0.5475 l
0.3884 0.5479 l
0.3900 0.5484 l
0.3916 0.5488 l
0.3931 0.5492 l
0.3947 0.5496 l
0.3963 0.5500 l
0.3978 0.5504 l
0.3994 0.5508 l
0.4010 0.5512 l
0.4025 0.5516 l
0.4041 0.5520 l
0.4057 0.5524 l
0.4073 0.5527 l
0.4088 0.5531 l
0.4104 0.5535 l
0.4120 0.5538 l
0.4135 0.5542 l
0.4151 0.5545 l
0.4167 0.5548 l
0.4182 0.5552 l
0.4198 0.5555 l
0.4214 0.5558 l
0.4229 0.5561 l
0.4245 0.5564 l
0.4261 0.5567 l
0.4276 0.5570 l
0.4292 0.5573 l
0.4308 0.5576 l
0.4324 0.5579 l
0.4339 0.5582 l
0.4355 0.5585 l
0.4371 0.5588 l
0.4386 0.5591 l
0.4402 0.5593 l
0.4418 0.5596 l
0.4433 0.5599 l
0.4449 0.5601 l
0.4465 0.5604 l
0.4480 0.5606 l
0.4496 0.5609 l
0.4512 0.5611 l
0.4527 0.5614 l
0.4543 0.5616 l
0.4559 0.5619 l
0.4575 0.5621 l
0.4590 0.5623 l
0.4606 0.5626 l
0.4622 0.5628 l
0.4637 0.5630 l
0.4653 0.5632 l
0.4669 0.5635 l
0.4684 0.5637 l
0.4700 0.5639 l
0.4716 0.5641 l
0.4731 0.5643 l
0.4747 0.5645 l
0.4763 0.5647 l
0.4778 0.5649 l
0.4794 0.5651 l
0.4810 0.5653 l
0.4825 0.5655 l
0.4841 0.5657 l
0.4857 0.5659 l
0.4873 0.5661 l
0.4888 0.5663 l
0.4904 0.5664 l
0.4920 0.5666 l
0.4935 0.5668 l
0.4951 0.5670 l
0.4967 0.5671 l
0.4982 0.5673 l
0.4998 0.5675 l
0.5014 0.5677 l
0.5029 0.5678 l
0.5045 0.5680 l
0.5061 0.5682 l
0.5076 0.5683 l
0.5092 0.5685 l
0.5108 0.5686 l
0.5124 0.5688 l
0.5139 0.5689 l
0.5155 0.5691 l
0.5171 0.5693 l
0.5186 0.5694 l
0.5202 0.5695 l
0.5218 0.5697 l
0.5233 0.5698 l
0.5249 0.5700 l
0.5265 0.5701 l
0.5280 0.5703 l
0.5296 0.5704 l
0.5312 0.5705 l
0.5327 0.5707 l
0.5343 0.5708 l
0.5359 0.5709 l
0.5375 0.5710 l
0.5390 0.5711 l
0.5406 0.5713 l
0.5422 0.5714 l
0.5437 0.5715 l
0.5453 0.5716 l
0.5469 0.5717 l
0.5484 0.5718 l
0.5502 0.5720 l
0.5516 0.5721 l
0.5531 0.5722 l
0.5547 0.5723 l
0.5563 0.5724 l
0.5578 0.5725 l
0.5594 0.5726 l
0.5610 0.5727 l
0.5625 0.5728 l
0.5641 0.5730 l
0.5657 0.5731 l
0.5673 0.5732 l
0.5688 0.5733 l
0.5704 0.5734 l
0.5720 0.5735 l
0.5735 0.5736 l
0.5751 0.5737 l
0.5767 0.5738 l
0.5782 0.5739 l
0.5798 0.5740 l
0.5814 0.5741 l
0.5829 0.5742 l
0.5845 0.5743 l
0.5861 0.5744 l
0.5876 0.5744 l
0.5892 0.5745 l
0.5908 0.5746 l
0.5924 0.5747 l
0.5939 0.5748 l
0.5955 0.5749 l
0.5971 0.5750 l
0.5986 0.5751 l
0.6002 0.5752 l
0.6018 0.5753 l
0.6033 0.5753 l
0.6049 0.5754 l
0.6065 0.5755 l
0.6080 0.5756 l
0.6096 0.5757 l
0.6112 0.5758 l
0.6127 0.5758 l
0.6143 0.5759 l
0.6159 0.5760 l
0.6175 0.5761 l
0.6190 0.5762 l
0.6206 0.5762 l
0.6222 0.5763 l
0.6237 0.5764 l
0.6253 0.5765 l
0.6269 0.5765 l
0.6284 0.5766 l
0.6300 0.5767 l
0.6316 0.5768 l
0.6331 0.5768 l
0.6347 0.5769 l
0.6363 0.5770 l
0.6378 0.5771 l
0.6394 0.5771 l
0.6410 0.5772 l
0.6425 0.5773 l
0.6441 0.5773 l
0.6457 0.5774 l
0.6473 0.5775 l
0.6488 0.5775 l
0.6504 0.5776 l
0.6520 0.5777 l
0.6535 0.5777 l
0.6551 0.5778 l
0.6567 0.5779 l
0.6582 0.5779 l
0.6598 0.5780 l
0.6614 0.5781 l
0.6629 0.5781 l
0.6645 0.5782 l
0.6661 0.5782 l
0.6676 0.5783 l
0.6692 0.5784 l
0.6708 0.5784 l
0.6724 0.5785 l
0.6739 0.5786 l
0.6755 0.5786 l
0.6771 0.5787 l
0.6786 0.5787 l
0.6802 0.5788 l
0.6818 0.5788 l
0.6833 0.5789 l
0.6849 0.5790 l
0.6865 0.5790 l
0.6880 0.5791 l
0.6896 0.5791 l
0.6912 0.5792 l
0.6927 0.5792 l
0.6943 0.5793 l
0.6959 0.5793 l
0.6975 0.5794 l
0.6990 0.5794 l
0.7006 0.5795 l
0.7022 0.5795 l
0.7037 0.5796 l
0.7053 0.5797 l
0.7069 0.5797 l
0.7084 0.5798 l
0.7100 0.5798 l
0.7116 0.5799 l
0.7131 0.5799 l
0.7147 0.5800 l
0.7163 0.5800 l
0.7178 0.5800 l
0.7194 0.5801 l
0.7210 0.5801 l
0.7225 0.5802 l
0.7241 0.5802 l
0.7257 0.5803 l
0.7273 0.5803 l
0.7288 0.5804 l
0.7304 0.5804 l
0.7320 0.5805 l
0.7335 0.5805 l
0.7351 0.5806 l
0.7367 0.5806 l
0.7382 0.5806 l
0.7398 0.5807 l
0.7414 0.5807 l
0.7429 0.5808 l
0.7445 0.5808 l
0.7461 0.5809 l
0.7476 0.5809 l
0.7492 0.5809 l
0.7508 0.5810 l
0.7524 0.5810 l
0.7539 0.5811 l
0.7555 0.5811 l
0.7571 0.5812 l
0.7586 0.5812 l
0.7602 0.5812 l
0.7618 0.5813 l
0.7633 0.5813 l
0.7649 0.5814 l
0.7665 0.5814 l
0.7680 0.5814 l
0.7696 0.5815 l
0.7712 0.5815 l
0.7727 0.5815 l
0.7743 0.5816 l
0.7759 0.5816 l
0.7775 0.5817 l
0.7790 0.5817 l
0.7806 0.5817 l
0.7822 0.5818 l
0.7837 0.5818 l
0.7853 0.5818 l
0.7869 0.5819 l
0.7884 0.5819 l
0.7900 0.5819 l
0.7916 0.5820 l
0.7931 0.5820 l
0.7947 0.5821 l
0.7963 0.5821 l
0.7978 0.5821 l
0.7994 0.5822 l
0.8010 0.5822 l
0.8025 0.5822 l
0.8041 0.5823 l
0.8057 0.5823 l
0.8073 0.5823 l
0.8088 0.5824 l
0.8104 0.5824 l
0.8120 0.5824 l
0.8135 0.5825 l
0.8151 0.5825 l
0.8167 0.5825 l
0.8182 0.5826 l
0.8198 0.5826 l
0.8214 0.5826 l
0.8229 0.5826 l
0.8245 0.5827 l
0.8261 0.5827 l
0.8276 0.5827 l
0.8292 0.5828 l
0.8308 0.5828 l
0.8324 0.5828 l
0.8339 0.5829 l
0.8355 0.5829 l
0.8371 0.5829 l
0.8386 0.5829 l
0.8402 0.5830 l
0.8418 0.5830 l
0.8433 0.5830 l
0.8449 0.5831 l
0.8465 0.5831 l
0.8480 0.5831 l
0.8496 0.5831 l
0.8512 0.5832 l
0.8527 0.5832 l
0.8543 0.5832 l
0.8559 0.5833 l
0.8575 0.5833 l
0.8590 0.5833 l
0.8606 0.5833 l
0.8622 0.5834 l
0.8637 0.5834 l
0.8653 0.5834 l
0.8669 0.5834 l
0.8684 0.5835 l
0.8700 0.5835 l
0.8716 0.5835 l
0.8731 0.5835 l
0.8747 0.5836 l
0.8763 0.5836 l
0.8778 0.5836 l
0.8794 0.5836 l
0.8810 0.5837 l
0.8825 0.5837 l
0.8841 0.5837 l
0.8857 0.5837 l
0.8873 0.5838 l
0.8888 0.5838 l
0.8904 0.5838 l
0.8920 0.5838 l
0.8935 0.5839 l
0.8951 0.5839 l
0.8967 0.5839 l
0.8982 0.5839 l
0.8998 0.5840 l
0.9014 0.5840 l
0.9029 0.5840 l
0.9045 0.5840 l
0.9061 0.5841 l
0.9076 0.5841 l
0.9092 0.5841 l
0.9108 0.5841 l
0.9124 0.5841 l
0.9139 0.5842 l
0.9155 0.5842 l
0.9171 0.5842 l
0.9186 0.5842 l
0.9202 0.5843 l
0.9218 0.5843 l
0.9233 0.5843 l
0.9249 0.5843 l
0.9265 0.5843 l
0.9280 0.5844 l
0.9296 0.5844 l
0.9312 0.5844 l
0.9327 0.5844 l
0.9343 0.5844 l
0.9359 0.5845 l
0.9375 0.5845 l
0.9390 0.5845 l
0.9406 0.5845 l
0.9422 0.5846 l
0.9437 0.5846 l
0.9453 0.5846 l
0.9469 0.5846 l
0.9484 0.5846 l
0.9500 0.5847 l
s
[/DeviceRGB] SCS
Color8 SC
n
0.2246 0.1499 m
0.2253 0.1540 l
0.2269 0.1631 l
0.2284 0.1715 l
0.2300 0.1793 l
0.2316 0.1867 l
0.2331 0.1936 l
0.2347 0.2002 l
0.2363 0.2063 l
0.2378 0.2122 l
0.2394 0.2177 l
0.2410 0.2229 l
0.2425 0.2279 l
0.2441 0.2326 l
0.2457 0.2371 l
0.2473 0.2414 l
0.2488 0.2456 l
0.2504 0.2495 l
0.2520 0.2533 l
0.2535 0.2569 l
0.2551 0.2603 l
0.2567 0.2637 l
0.2582 0.2669 l
0.2598 0.2700 l
0.2614 0.2729 l
0.2629 0.2758 l
0.2645 0.2785 l
0.2661 0.2812 l
0.2676 0.2838 l
0.2692 0.2863 l
0.2708 0.2887 l
0.2724 0.2910 l
0.2739 0.2932 l
0.2755 0.2954 l
0.2771 0.2975 l
0.2786 0.2995 l
0.2802 0.3015 l
0.2818 0.3034 l
0.2833 0.3053 l
0.2849 0.3071 l
0.2865 0.3088 l
0.2880 0.3105 l
0.2896 0.3122 l
0.2912 0.3138 l
0.2927 0.3153 l
0.2943 0.3169 l
0.2959 0.3183 l
0.2975 0.3198 l
0.2990 0.3212 l
0.3006 0.3225 l
0.3022 0.3239 l
0.3037 0.3252 l
0.3053 0.3264 l
0.3069 0.3276 l
0.3084 0.3288 l
0.3100 0.3299 l
0.3116 0.3310 l
0.3131 0.3322 l
0.3147 0.3332 l
0.3163 0.3343 l
0.3178 0.3353 l
0.3194 0.3363 l
0.3210 0.3373 l
0.3225 0.3383 l
0.3241 0.3392 l
0.3257 0.3401 l
0.3273 0.3410 l
0.3288 0.3419 l
0.3304 0.3428 l
0.3320 0.3436 l
0.3335 0.3445 l
0.3351 0.3453 l
0.3367 0.3461 l
0.3382 0.3469 l
0.3398 0.3476 l
0.3414 0.3484 l
0.3429 0.3491 l
0.3445 0.3498 l
0.3461 0.3505 l
0.3476 0.3512 l
0.3492 0.3519 l
0.3508 0.3526 l
0.3524 0.3532 l
0.3539 0.3539 l
0.3555 0.3545 l
0.3571 0.3551 l
0.3586 0.3557 l
0.3602 0.3563 l
0.3618 0.3569 l
0.3633 0.3575 l
0.3649 0.3580 l
0.3665 0.3586 l
0.3680 0.3591 l
0.3696 0.3597 l
0.3712 0.3602 l
0.3727 0.3607 l
0.3743 0.3612 l
0.3759 0.3617 l
0.3775 0.3622 l
0.3790 0.3627 l
0.3806 0.3632 l
0.3822 0.3636 l
0.3837 0.3641 l
0.3853 0.3645 l
0.3869 0.3650 l
0.3884 0.3654 l
0.3900 0.3659 l
0.3916 0.3663 l
0.3931 0.3667 l
0.3947 0.3671 l
0.3963 0.3675 l
0.3978 0.3679 l
0.3994 0.3683 l
0.4010 0.3687 l
0.4025 0.3691 l
0.4041 0.3694 l
0.4057 0.3698 l
0.4073 0.3702 l
0.4088 0.3705 l
0.4104 0.3709 l
0.4120 0.3712 l
0.4135 0.3715 l
0.4151 0.3719 l
0.4167 0.3722 l
0.4182 0.3725 l
0.4198 0.3729 l
0.4214 0.3732 l
0.4229 0.3735 l
0.4245 0.3738 l
0.4261 0.3741 l
0.4276 0.3744 l
0.4292 0.3747 l
0.4308 0.3750 l
0.4324 0.3753 l
0.4339 0.3756 l
0.4355 0.3758 l
0.4371 0.3761 l
0.4386 0.3764 l
0.4402 0.3767 l
0.4418 0.3769 l
0.4433 0.3772 l
0.4449 0.3774 l
0.4465 0.3777 l
0.4480 0.3779 l
0.4496 0.3782 l
0.4512 0.3784 l
0.4527 0.3787 l
0.4543 0.3789 l
0.4559 0.3791 l
0.4575 0.3794 l
0.4590 0.3796 l
0.4606 0.3798 l
0.4622 0.3801 l
0.4637 0.3803 l
0.4653 0.3805 l
0.4669 0.3807 l
0.4684 0.3809 l
0.4700 0.3811 l
0.4716 0.3813 l
0.4731 0.3815 l
0.4747 0.3818 l
0.4763 0.3820 l
0.4778 0.3822 l
0.4794 0.3823 l
0.4810 0.3825 l
0.4825 0.3827 l
0.4841 0.3829 l
0.4857 0.3831 l
0.4873 0.3833 l
0.4888 0.3835 l
0.4904 0.3837 l
0.4920 0.3838 l
0.4935 0.3840 l
0.4951 0.3842 l
0.4967 0.3844 l
0.4982 0.3845 l
0.4998 0.3847 l
0.5014 0.3849 l
0.5029 0.3850 l
0.5045 0.3852 l
0.5061 0.3853 l
0.5076 0.3855 l
0.5092 0.3857 l
0.5108 0.3858 l
0.5124 0.3860 l
0.5139 0.3861 l
0.5155 0.3863 l
0.5171 0.3864 l
0.5186 0.3866 l
0.5202 0.3867 l
0.5218 0.3869 l
0.5233 0.3870 l
0.5249 0.3871 l
0.5265 0.3873 l
0.5280 0.3874 l
0.5296 0.3876 l
0.5312 0.3877 l
0.5327 0.3878 l
0.5343 0.3880 l
0.5359 0.3881 l
0.5375 0.3882 l
0.5390 0.3883 l
0.5406 0.3885 l
0.5422 0.3886 l
0.5437 0.3887 l
0.5453 0.3888 l
0.5469 0.3889 l
0.5484 0.3891 l
0.5502 0.3892 l
0.5516 0.3893 l
0.5531 0.3894 l
0.5547 0.3895 l
0.5563 0.3896 l
0.5578 0.3898 l
0.5594 0.3899 l
0.5610 0.3900 l
0.5625 0.3901 l
0.5641 0.3902 l
0.5657 0.3903 l
0.5673 0.3904 l
0.5688 0.3905 l
0.5704 0.3906 l
0.5720 0.3907 l
0.5735 0.3908 l
0.5751 0.3909 l
0.5767 0.3910 l
0.5782 0.3911 l
0.5798 0.3912 l
0.5814 0.3913 l
0.5829 0.3914 l
0.5845 0.3915 l
0.5861 0.3916 l
0.5876 0.3917 l
0.5892 0.3918 l
0.5908 0.3919 l
0.5924 0.3920 l
0.5939 0.3921 l
0.5955 0.3922 l
0.5971 0.3923 l
0.5986 0.3924 l
0.6002 0.3924 l
0.6018 0.3925 l
0.6033 0.3926 l
0.6049 0.3927 l
0.6065 0.3928 l
0.6080 0.3929 l
0.6096 0.3930 l
0.6112 0.3930 l
0.6127 0.3931 l
0.6143 0.3932 l
0.6159 0.3933 l
0.6175 0.3934 l
0.6190 0.3934 l
0.6206 0.3935 l
0.6222 0.3936 l
0.6237 0.3937 l
0.6253 0.3938 l
0.6269 0.3938 l
0.6284 0.3939 l
0.6300 0.3940 l
0.6316 0.3941 l
0.6331 0.3941 l
0.6347 0.3942 l
0.6363 0.3943 l
0.6378 0.3944 l
0.6394 0.3944 l
0.6410 0.3945 l
0.6425 0.3946 l
0.6441 0.3946 l
0.6457 0.3947 l
0.6473 0.3948 l
0.6488 0.3948 l
0.6504 0.3949 l
0.6520 0.3950 l
0.6535 0.3950 l
0.6551 0.3951 l
0.6567 0.3952 l
0.6582 0.3952 l
0.6598 0.3953 l
0.6614 0.3954 l
0.6629 0.3954 l
0.6645 0.3955 l
0.6661 0.3956 l
0.6676 0.3956 l
0.6692 0.3957 l
0.6708 0.3957 l
0.6724 0.3958 l
0.6739 0.3959 l
0.6755 0.3959 l
0.6771 0.3960 l
0.6786 0.3960 l
0.6802 0.3961 l
0.6818 0.3962 l
0.6833 0.3962 l
0.6849 0.3963 l
0.6865 0.3963 l
0.6880 0.3964 l
0.6896 0.3964 l
0.6912 0.3965 l
0.6927 0.3965 l
0.6943 0.3966 l
0.6959 0.3967 l
0.6975 0.3967 l
0.6990 0.3968 l
0.7006 0.3968 l
0.7022 0.3969 l
0.7037 0.3969 l
0.7053 0.3970 l
0.7069 0.3970 l
0.7084 0.3971 l
0.7100 0.3971 l
0.7116 0.3972 l
0.7131 0.3972 l
0.7147 0.3973 l
0.7163 0.3973 l
0.7178 0.3974 l
0.7194 0.3974 l
0.7210 0.3975 l
0.7225 0.3975 l
0.7241 0.3976 l
0.7257 0.3976 l
0.7273 0.3977 l
0.7288 0.3977 l
0.7304 0.3977 l
0.7320 0.3978 l
0.7335 0.3978 l
0.7351 0.3979 l
0.7367 0.3979 l
0.7382 0.3980 l
0.7398 0.3980 l
0.7414 0.3981 l
0.7429 0.3981 l
0.7445 0.3981 l
0.7461 0.3982 l
0.7476 0.3982 l
0.7492 0.3983 l
0.7508 0.3983 l
0.7524 0.3984 l
0.7539 0.3984 l
0.7555 0.3984 l
0.7571 0.3985 l
0.7586 0.3985 l
0.7602 0.3986 l
0.7618 0.3986 l
0.7633 0.3986 l
0.7649 0.3987 l
0.7665 0.3987 l
0.7680 0.3988 l
0.7696 0.3988 l
0.7712 0.3988 l
0.7727 0.3989 l
0.7743 0.3989 l
0.7759 0.3990 l
0.7775 0.3990 l
0.7790 0.3990 l
0.7806 0.3991 l
0.7822 0.3991 l
0.7837 0.3991 l
0.7853 0.3992 l
0.7869 0.3992 l
0.7884 0.3992 l
0.7900 0.3993 l
0.7916 0.3993 l
0.7931 0.3994 l
0.7947 0.3994 l
0.7963 0.3994 l
0.7978 0.3995 l
0.7994 0.3995 l
0.8010 0.3995 l
0.8025 0.3996 l
0.8041 0.3996 l
0.8057 0.3996 l
0.8073 0.3997 l
0.8088 0.3997 l
0.8104 0.3997 l
0.8120 0.3998 l
0.8135 0.3998 l
0.8151 0.3998 l
0.8167 0.3999 l
0.8182 0.3999 l
0.8198 0.3999 l
0.8214 0.3999 l
0.8229 0.4000 l
0.8245 0.4000 l
0.8261 0.4000 l
0.8276 0.4001 l
0.8292 0.4001 l
0.8308 0.4001 l
0.8324 0.4002 l
0.8339 0.4002 l
0.8355 0.4002 l
0.8371 0.4003 l
0.8386 0.4003 l
0.8402 0.4003 l
0.8418 0.4003 l
0.8433 0.4004 l
0.8449 0.4004 l
0.8465 0.4004 l
0.8480 0.4005 l
0.8496 0.4005 l
0.8512 0.4005 l
0.8527 0.4005 l
0.8543 0.4006 l
0.8559 0.4006 l
0.8575 0.4006 l
0.8590 0.4007 l
0.8606 0.4007 l
0.8622 0.4007 l
0.8637 0.4007 l
0.8653 0.4008 l
0.8669 0.4008 l
0.8684 0.4008 l
0.8700 0.4008 l
0.8716 0.4009 l
0.8731 0.4009 l
0.8747 0.4009 l
0.8763 0.4009 l
0.8778 0.4010 l
0.8794 0.4010 l
0.8810 0.4010 l
0.8825 0.4010 l
0.8841 0.4011 l
0.8857 0.4011 l
0.8873 0.4011 l
0.8888 0.4011 l
0.8904 0.4012 l
0.8920 0.4012 l
0.8935 0.4012 l
0.8951 0.4012 l
0.8967 0.4013 l
0.8982 0.4013 l
0.8998 0.4013 l
0.9014 0.4013 l
0.9029 0.4014 l
0.9045 0.4014 l
0.9061 0.4014 l
0.9076 0.4014 l
0.9092 0.4014 l
0.9108 0.4015 l
0.9124 0.4015 l
0.9139 0.4015 l
0.9155 0.4015 l
0.9171 0.4016 l
0.9186 0.4016 l
0.9202 0.4016 l
0.9218 0.4016 l
0.9233 0.4016 l
0.9249 0.4017 l
0.9265 0.4017 l
0.9280 0.4017 l
0.9296 0.4017 l
0.9312 0.4018 l
0.9327 0.4018 l
0.9343 0.4018 l
0.9359 0.4018 l
0.9375 0.4018 l
0.9390 0.4019 l
0.9406 0.4019 l
0.9422 0.4019 l
0.9437 0.4019 l
0.9453 0.4019 l
0.9469 0.4020 l
0.9484 0.4020 l
0.9500 0.4020 l
s
[/DeviceRGB] SCS
Color9 SC
n
0.2346 0.1499 m
0.2347 0.1505 l
0.2363 0.1569 l
0.2378 0.1630 l
0.2394 0.1687 l
0.2410 0.1742 l
0.2425 0.1793 l
0.2441 0.1842 l
0.2457 0.1889 l
0.2473 0.1934 l
0.2488 0.1976 l
0.2504 0.2017 l
0.2520 0.2056 l
0.2535 0.2093 l
0.2551 0.2129 l
0.2567 0.2163 l
0.2582 0.2196 l
0.2598 0.2228 l
0.2614 0.2258 l
0.2629 0.2288 l
0.2645 0.2316 l
0.2661 0.2344 l
0.2676 0.2370 l
0.2692 0.2395 l
0.2708 0.2420 l
0.2724 0.2444 l
0.2739 0.2467 l
0.2755 0.2489 l
0.2771 0.2510 l
0.2786 0.2531 l
0.2802 0.2551 l
0.2818 0.2571 l
0.2833 0.2590 l
0.2849 0.2609 l
0.2865 0.2626 l
0.2880 0.2644 l
0.2896 0.2661 l
0.2912 0.2677 l
0.2927 0.2693 l
0.2943 0.2709 l
0.2959 0.2724 l
0.2975 0.2739 l
0.2990 0.2753 l
0.3006 0.2767 l
0.3022 0.2780 l
0.3037 0.2794 l
0.3053 0.2806 l
0.3069 0.2818 l
0.3084 0.2830 l
0.3100 0.2841 l
0.3116 0.2853 l
0.3131 0.2864 l
0.3147 0.2875 l
0.3163 0.2885 l
0.3178 0.2896 l
0.3194 0.2906 l
0.3210 0.2916 l
0.3225 0.2926 l
0.3241 0.2935 l
0.3257 0.2945 l
0.3273 0.2954 l
0.3288 0.2963 l
0.3304 0.2972 l
0.3320 0.2980 l
0.3335 0.2988 l
0.3351 0.2997 l
0.3367 0.3005 l
0.3382 0.3013 l
0.3398 0.3020 l
0.3414 0.3028 l
0.3429 0.3035 l
0.3445 0.3043 l
0.3461 0.3050 l
0.3476 0.3057 l
0.3492 0.3064 l
0.3508 0.3071 l
0.3524 0.3078 l
0.3539 0.3084 l
0.3555 0.3090 l
0.3571 0.3097 l
0.3586 0.3103 l
0.3602 0.3109 l
0.3618 0.3115 l
0.3633 0.3121 l
0.3649 0.3126 l
0.3665 0.3132 l
0.3680 0.3138 l
0.3696 0.3143 l
0.3712 0.3148 l
0.3727 0.3153 l
0.3743 0.3159 l
0.3759 0.3164 l
0.3775 0.3169 l
0.3790 0.3174 l
0.3806 0.3178 l
0.3822 0.3183 l
0.3837 0.3188 l
0.3853 0.3192 l
0.3869 0.3197 l
0.3884 0.3201 l
0.3900 0.3206 l
0.3916 0.3210 l
0.3931 0.3214 l
0.3947 0.3218 l
0.3963 0.3222 l
0.3978 0.3226 l
0.3994 0.3230 l
0.4010 0.3234 l
0.4025 0.3238 l
0.4041 0.3242 l
0.4057 0.3245 l
0.4073 0.3249 l
0.4088 0.3253 l
0.4104 0.3256 l
0.4120 0.3260 l
0.4135 0.3263 l
0.4151 0.3267 l
0.4167 0.3270 l
0.4182 0.3273 l
0.4198 0.3277 l
0.4214 0.3280 l
0.4229 0.3283 l
0.4245 0.3286 l
0.4261 0.3289 l
0.4276 0.3292 l
0.4292 0.3295 l
0.4308 0.3298 l
0.4324 0.3301 l
0.4339 0.3304 l
0.4355 0.3307 l
0.4371 0.3309 l
0.4386 0.3312 l
0.4402 0.3315 l
0.4418 0.3318 l
0.4433 0.3320 l
0.4449 0.3323 l
0.4465 0.3325 l
0.4480 0.3328 l
0.4496 0.3331 l
0.4512 0.3333 l
0.4527 0.3335 l
0.4543 0.3338 l
0.4559 0.3340 l
0.4575 0.3343 l
0.4590 0.3345 l
0.4606 0.3347 l
0.4622 0.3349 l
0.4637 0.3352 l
0.4653 0.3354 l
0.4669 0.3356 l
0.4684 0.3358 l
0.4700 0.3360 l
0.4716 0.3362 l
0.4731 0.3365 l
0.4747 0.3367 l
0.4763 0.3369 l
0.4778 0.3371 l
0.4794 0.3373 l
0.4810 0.3375 l
0.4825 0.3377 l
0.4841 0.3378 l
0.4857 0.3380 l
0.4873 0.3382 l
0.4888 0.3384 l
0.4904 0.3386 l
0.4920 0.3388 l
0.4935 0.3389 l
0.4951 0.3391 l
0.4967 0.3393 l
0.4982 0.3395 l
0.4998 0.3396 l
0.5014 0.3398 l
0.5029 0.3400 l
0.5045 0.3401 l
0.5061 0.3403 l
0.5076 0.3405 l
0.5092 0.3406 l
0.5108 0.3408 l
0.5124 0.3409 l
0.5139 0.3411 l
0.5155 0.3412 l
0.5171 0.3414 l
0.5186 0.3415 l
0.5202 0.3417 l
0.5218 0.3418 l
0.5233 0.3420 l
0.5249 0.3421 l
0.5265 0.3423 l
0.5280 0.3424 l
0.5296 0.3425 l
0.5312 0.3427 l
0.5327 0.3428 l
0.5343 0.3429 l
0.5359 0.3431 l
0.5375 0.3432 l
0.5390 0.3433 l
0.5406 0.3434 l
0.5422 0.3435 l
0.5437 0.3437 l
0.5453 0.3438 l
0.5469 0.3439 l
0.5484 0.3440 l
0.5502 0.3441 l
0.5516 0.3442 l
0.5531 0.3444 l
0.5547 0.3445 l
0.5563 0.3446 l
0.5578 0.3447 l
0.5594 0.3448 l
0.5610 0.3449 l
0.5625 0.3450 l
0.5641 0.3451 l
0.5657 0.3452 l
0.5673 0.3453 l
0.5688 0.3454 l
0.5704 0.3456 l
0.5720 0.3457 l
0.5735 0.3458 l
0.5751 0.3459 l
0.5767 0.3460 l
0.5782 0.3461 l
0.5798 0.3462 l
0.5814 0.3463 l
0.5829 0.3464 l
0.5845 0.3465 l
0.5861 0.3465 l
0.5876 0.3466 l
0.5892 0.3467 l
0.5908 0.3468 l
0.5924 0.3469 l
0.5939 0.3470 l
0.5955 0.3471 l
0.5971 0.3472 l
0.5986 0.3473 l
0.6002 0.3474 l
0.6018 0.3475 l
0.6033 0.3475 l
0.6049 0.3476 l
0.6065 0.3477 l
0.6080 0.3478 l
0.6096 0.3479 l
0.6112 0.3480 l
0.6127 0.3480 l
0.6143 0.3481 l
0.6159 0.3482 l
0.6175 0.3483 l
0.6190 0.3484 l
0.6206 0.3484 l
0.6222 0.3485 l
0.6237 0.3486 l
0.6253 0.3487 l
0.6269 0.3488 l
0.6284 0.3488 l
0.6300 0.3489 l
0.6316 0.3490 l
0.6331 0.3490 l
0.6347 0.3491 l
0.6363 0.3492 l
0.6378 0.3493 l
0.6394 0.3493 l
0.6410 0.3494 l
0.6425 0.3495 l
0.6441 0.3495 l
0.6457 0.3496 l
0.6473 0.3497 l
0.6488 0.3498 l
0.6504 0.3498 l
0.6520 0.3499 l
0.6535 0.3500 l
0.6551 0.3500 l
0.6567 0.3501 l
0.6582 0.3501 l
0.6598 0.3502 l
0.6614 0.3503 l
0.6629 0.3503 l
0.6645 0.3504 l
0.6661 0.3505 l
0.6676 0.3505 l
0.6692 0.3506 l
0.6708 0.3506 l
0.6724 0.3507 l
0.6739 0.3508 l
0.6755 0.3508 l
0.6771 0.3509 l
0.6786 0.3509 l
0.6802 0.3510 l
0.6818 0.3511 l
0.6833 0.3511 l
0.6849 0.3512 l
0.6865 0.3512 l
0.6880 0.3513 l
0.6896 0.3513 l
0.6912 0.3514 l
0.6927 0.3515 l
0.6943 0.3515 l
0.6959 0.3516 l
0.6975 0.3516 l
0.6990 0.3517 l
0.7006 0.3517 l
0.7022 0.3518 l
0.7037 0.3518 l
0.7053 0.3519 l
0.7069 0.3519 l
0.7084 0.3520 l
0.7100 0.3520 l
0.7116 0.3521 l
0.7131 0.3521 l
0.7147 0.3522 l
0.7163 0.3522 l
0.7178 0.3523 l
0.7194 0.3523 l
0.7210 0.3524 l
0.7225 0.3524 l
0.7241 0.3525 l
0.7257 0.3525 l
0.7273 0.3526 l
0.7288 0.3526 l
0.7304 0.3527 l
0.7320 0.3527 l
0.7335 0.3527 l
0.7351 0.3528 l
0.7367 0.3528 l
0.7382 0.3529 l
0.7398 0.3529 l
0.7414 0.3530 l
0.7429 0.3530 l
0.7445 0.3531 l
0.7461 0.3531 l
0.7476 0.3531 l
0.7492 0.3532 l
0.7508 0.3532 l
0.7524 0.3533 l
0.7539 0.3533 l
0.7555 0.3533 l
0.7571 0.3534 l
0.7586 0.3534 l
0.7602 0.3535 l
0.7618 0.3535 l
0.7633 0.3535 l
0.7649 0.3536 l
0.7665 0.3536 l
0.7680 0.3537 l
0.7696 0.3537 l
0.7712 0.3537 l
0.7727 0.3538 l
0.7743 0.3538 l
0.7759 0.3539 l
0.7775 0.3539 l
0.7790 0.3539 l
0.7806 0.3540 l
0.7822 0.3540 l
0.7837 0.3540 l
0.7853 0.3541 l
0.7869 0.3541 l
0.7884 0.3542 l
0.7900 0.3542 l
0.7916 0.3542 l
0.7931 0.3543 l
0.7947 0.3543 l
0.7963 0.3543 l
0.7978 0.3544 l
0.7994 0.3544 l
0.8010 0.3544 l
0.8025 0.3545 l
0.8041 0.3545 l
0.8057 0.3545 l
0.8073 0.3546 l
0.8088 0.3546 l
0.8104 0.3546 l
0.8120 0.3547 l
0.8135 0.3547 l
0.8151 0.3547 l
0.8167 0.3548 l
0.8182 0.3548 l
0.8198 0.3548 l
0.8214 0.3549 l
0.8229 0.3549 l
0.8245 0.3549 l
0.8261 0.3549 l
0.8276 0.3550 l
0.8292 0.3550 l
0.8308 0.3550 l
0.8324 0.3551 l
0.8339 0.3551 l
0.8355 0.3551 l
0.8371 0.3552 l
0.8386 0.3552 l
0.8402 0.3552 l
0.8418 0.3552 l
0.8433 0.3553 l
0.8449 0.3553 l
0.8465 0.3553 l
0.8480 0.3554 l
0.8496 0.3554 l
0.8512 0.3554 l
0.8527 0.3554 l
0.8543 0.3555 l
0.8559 0.3555 l
0.8575 0.3555 l
0.8590 0.3556 l
0.8606 0.3556 l
0.8622 0.3556 l
0.8637 0.3556 l
0.8653 0.3557 l
0.8669 0.3557 l
0.8684 0.3557 l
0.8700 0.3557 l
0.8716 0.3558 l
0.8731 0.3558 l
0.8747 0.3558 l
0.8763 0.3558 l
0.8778 0.3559 l
0.8794 0.3559 l
0.8810 0.3559 l
0.8825 0.3559 l
0.8841 0.3560 l
0.8857 0.3560 l
0.8873 0.3560 l
0.8888 0.3560 l
0.8904 0.3561 l
0.8920 0.3561 l
0.8935 0.3561 l
0.8951 0.3561 l
0.8967 0.3562 l
0.8982 0.3562 l
0.8998 0.3562 l
0.9014 0.3562 l
0.9029 0.3563 l
0.9045 0.3563 l
0.9061 0.3563 l
0.9076 0.3563 l
0.9092 0.3563 l
0.9108 0.3564 l
0.9124 0.3564 l
0.9139 0.3564 l
0.9155 0.3564 l
0.9171 0.3565 l
0.9186 0.3565 l
0.9202 0.3565 l
0.9218 0.3565 l
0.9233 0.3565 l
0.9249 0.3566 l
0.9265 0.3566 l
0.9280 0.3566 l
0.9296 0.3566 l
0.9312 0.3567 l
0.9327 0.3567 l
0.9343 0.3567 l
0.9359 0.3567 l
0.9375 0.3567 l
0.9390 0.3568 l
0.9406 0.3568 l
0.9422 0.3568 l
0.9437 0.3568 l
0.9453 0.3568 l
0.9469 0.3569 l
0.9484 0.3569 l
0.9500 0.3569 l
s
[/DeviceRGB] SCS
Color10 SC
n
0.1500 0.4551 m
0.1516 0.4540 l
0.1531 0.4529 l
0.1547 0.4518 l
0.1563 0.4507 l
0.1578 0.4496 l
0.1594 0.4485 l
0.1610 0.4474 l
0.1625 0.4464 l
0.1641 0.4453 l
0.1657 0.4442 l
0.1673 0.4432 l
0.1688 0.4421 l
0.1704 0.4411 l
0.1720 0.4400 l
0.1735 0.4389 l
0.1751 0.4379 l
0.1767 0.4368 l
0.1782 0.4357 l
0.1798 0.4346 l
0.1814 0.4335 l
0.1829 0.4324 l
0.1845 0.4313 l
0.1861 0.4301 l
0.1876 0.4288 l
0.1892 0.4275 l
0.1908 0.4262 l
0.1924 0.4247 l
0.1939 0.4230 l
0.1955 0.4211 l
0.1971 0.4189 l
0.1986 0.4163 l
0.2002 0.4131 l
0.2018 0.4093 l
0.2033 0.4050 l
0.2049 0.4008 l
0.2065 0.3974 l
0.2080 0.3947 l
0.2096 0.3923 l
0.2112 0.3904 l
0.2127 0.3891 l
0.2143 0.3887 l
0.2159 0.3893 l
0.2175 0.3908 l
0.2190 0.3933 l
0.2206 0.3967 l
0.2222 0.4008 l
0.2237 0.4056 l
0.2253 0.4108 l
0.2269 0.4163 l
0.2284 0.4220 l
0.2300 0.4279 l
0.2316 0.4338 l
0.2331 0.4397 l
0.2347 0.4455 l
0.2363 0.4513 l
0.2378 0.4569 l
0.2394 0.4623 l
0.2410 0.4676 l
0.2425 0.4728 l
0.2441 0.4777 l
0.2457 0.4826 l
0.2473 0.4872 l
0.2488 0.4917 l
0.2504 0.4961 l
0.2520 0.5002 l
0.2535 0.5043 l
0.2551 0.5082 l
0.2567 0.5119 l
0.2582 0.5155 l
0.2598 0.5191 l
0.2614 0.5225 l
0.2629 0.5257 l
0.2645 0.5289 l
0.2661 0.5320 l
0.2676 0.5349 l
0.2692 0.5378 l
0.2708 0.5406 l
0.2724 0.5432 l
0.2739 0.5458 l
0.2755 0.5483 l
0.2771 0.5508 l
0.2786 0.5532 l
0.2802 0.5554 l
0.2818 0.5577 l
0.2833 0.5598 l
0.2849 0.5619 l
0.2865 0.5640 l
0.2880 0.5659 l
0.2896 0.5679 l
0.2912 0.5697 l
0.2927 0.5716 l
0.2943 0.5733 l
0.2959 0.5751 l
0.2975 0.5767 l
0.2990 0.5784 l
0.3006 0.5800 l
0.3022 0.5815 l
0.3037 0.5830 l
0.3053 0.5844 l
0.3069 0.5858 l
0.3084 0.5872 l
0.3100 0.5885 l
0.3116 0.5899 l
0.3131 0.5912 l
0.3147 0.5924 l
0.3163 0.5936 l
0.3178 0.5948 l
0.3194 0.5960 l
0.3210 0.5972 l
0.3225 0.5983 l
0.3241 0.5994 l
0.3257 0.6004 l
0.3273 0.6015 l
0.3288 0.6025 l
0.3304 0.6035 l
0.3320 0.6045 l
0.3335 0.6055 l
0.3351 0.6064 l
0.3367 0.6073 l
0.3382 0.6082 l
0.3398 0.6091 l
0.3414 0.6100 l
0.3429 0.6109 l
0.3445 0.6117 l
0.3461 0.6125 l
0.3476 0.6133 l
0.3492 0.6141 l
0.3508 0.6149 l
0.3524 0.6156 l
0.3539 0.6164 l
0.3555 0.6171 l
0.3571 0.6178 l
0.3586 0.6185 l
0.3602 0.6192 l
0.3618 0.6199 l
0.3633 0.6205 l
0.3649 0.6212 l
0.3665 0.6218 l
0.3680 0.6225 l
0.3696 0.6231 l
0.3712 0.6237 l
0.3727 0.6243 l
0.3743 0.6249 l
0.3759 0.6254 l
0.3775 0.6260 l
0.3790 0.6266 l
0.3806 0.6271 l
0.3822 0.6276 l
0.3837 0.6282 l
0.3853 0.6287 l
0.3869 0.6292 l
0.3884 0.6297 l
0.3900 0.6302 l
0.3916 0.6307 l
0.3931 0.6312 l
0.3947 0.6316 l
0.3963 0.6321 l
0.3978 0.6326 l
0.3994 0.6330 l
0.4010 0.6334 l
0.4025 0.6339 l
0.4041 0.6343 l
0.4057 0.6347 l
0.4073 0.6352 l
0.4088 0.6356 l
0.4104 0.6360 l
0.4120 0.6364 l
0.4135 0.6368 l
0.4151 0.6371 l
0.4167 0.6375 l
0.4182 0.6379 l
0.4198 0.6383 l
0.4214 0.6386 l
0.4229 0.6390 l
0.4245 0.6393 l
0.4261 0.6397 l
0.4276 0.6400 l
0.4292 0.6404 l
0.4308 0.6407 l
0.4324 0.6410 l
0.4339 0.6414 l
0.4355 0.6417 l
0.4371 0.6420 l
0.4386 0.6423 l
0.4402 0.6426 l
0.4418 0.6429 l
0.4433 0.6432 l
0.4449 0.6435 l
0.4465 0.6438 l
0.4480 0.6441 l
0.4496 0.6444 l
0.4512 0.6447 l
0.4527 0.6449 l
0.4543 0.6452 l
0.4559 0.6455 l
0.4575 0.6458 l
0.4590 0.6460 l
0.4606 0.6463 l
0.4622 0.6465 l
0.4637 0.6468 l
0.4653 0.6470 l
0.4669 0.6473 l
0.4684 0.6475 l
0.4700 0.6478 l
0.4716 0.6480 l
0.4731 0.6482 l
0.4747 0.6485 l
0.4763 0.6487 l
0.4778 0.6489 l
0.4794 0.6492 l
0.4810 0.6494 l
0.4825 0.6496 l
0.4841 0.6498 l
0.4857 0.6500 l
0.4873 0.6502 l
0.4888 0.6504 l
0.4904 0.6506 l
0.4920 0.6509 l
0.4935 0.6511 l
0.4951 0.6513 l
0.4967 0.6514 l
0.4982 0.6516 l
0.4998 0.6518 l
0.5014 0.6520 l
0.5029 0.6522 l
0.5045 0.6524 l
0.5061 0.6526 l
0.5076 0.6528 l
0.5092 0.6529 l
0.5108 0.6531 l
0.5124 0.6533 l
0.5139 0.6535 l
0.5155 0.6536 l
0.5171 0.6538 l
0.5186 0.6540 l
0.5202 0.6542 l
0.5218 0.6543 l
0.5233 0.6545 l
0.5249 0.6546 l
0.5265 0.6548 l
0.5280 0.6550 l
0.5296 0.6551 l
0.5312 0.6553 l
0.5327 0.6554 l
0.5343 0.6556 l
0.5359 0.6557 l
0.5375 0.6559 l
0.5390 0.6560 l
0.5406 0.6562 l
0.5422 0.6563 l
0.5437 0.6564 l
0.5453 0.6566 l
0.5469 0.6567 l
0.5484 0.6568 l
0.5502 0.6570 l
0.5516 0.6571 l
0.5531 0.6573 l
0.5547 0.6574 l
0.5563 0.6575 l
0.5578 0.6576 l
0.5594 0.6578 l
0.5610 0.6579 l
0.5625 0.6580 l
0.5641 0.6582 l
0.5657 0.6583 l
0.5673 0.6584 l
0.5688 0.6585 l
0.5704 0.6586 l
0.5720 0.6588 l
0.5735 0.6589 l
0.5751 0.6590 l
0.5767 0.6591 l
0.5782 0.6592 l
0.5798 0.6593 l
0.5814 0.6594 l
0.5829 0.6596 l
0.5845 0.6597 l
0.5861 0.6598 l
0.5876 0.6599 l
0.5892 0.6600 l
0.5908 0.6601 l
0.5924 0.6602 l
0.5939 0.6603 l
0.5955 0.6604 l
0.5971 0.6605 l
0.5986 0.6606 l
0.6002 0.6607 l
0.6018 0.6608 l
0.6033 0.6609 l
0.6049 0.6610 l
0.6065 0.6611 l
0.6080 0.6612 l
0.6096 0.6613 l
0.6112 0.6614 l
0.6127 0.6615 l
0.6143 0.6616 l
0.6159 0.6617 l
0.6175 0.6618 l
0.6190 0.6619 l
0.6206 0.6620 l
0.6222 0.6620 l
0.6237 0.6621 l
0.6253 0.6622 l
0.6269 0.6623 l
0.6284 0.6624 l
0.6300 0.6625 l
0.6316 0.6626 l
0.6331 0.6627 l
0.6347 0.6627 l
0.6363 0.6628 l
0.6378 0.6629 l
0.6394 0.6630 l
0.6410 0.6631 l
0.6425 0.6631 l
0.6441 0.6632 l
0.6457 0.6633 l
0.6473 0.6634 l
0.6488 0.6635 l
0.6504 0.6635 l
0.6520 0.6636 l
0.6535 0.6637 l
0.6551 0.6638 l
0.6567 0.6638 l
0.6582 0.6639 l
0.6598 0.6640 l
0.6614 0.6641 l
0.6629 0.6641 l
0.6645 0.6642 l
0.6661 0.6643 l
0.6676 0.6643 l
0.6692 0.6644 l
0.6708 0.6645 l
0.6724 0.6646 l
0.6739 0.6646 l
0.6755 0.6647 l
0.6771 0.6648 l
0.6786 0.6648 l
0.6802 0.6649 l
0.6818 0.6650 l
0.6833 0.6650 l
0.6849 0.6651 l
0.6865 0.6652 l
0.6880 0.6652 l
0.6896 0.6653 l
0.6912 0.6653 l
0.6927 0.6654 l
0.6943 0.6655 l
0.6959 0.6655 l
0.6975 0.6656 l
0.6990 0.6657 l
0.7006 0.6657 l
0.7022 0.6658 l
0.7037 0.6658 l
0.7053 0.6659 l
0.7069 0.6660 l
0.7084 0.6660 l
0.7100 0.6661 l
0.7116 0.6661 l
0.7131 0.6662 l
0.7147 0.6662 l
0.7163 0.6663 l
0.7178 0.6663 l
0.7194 0.6664 l
0.7210 0.6665 l
0.7225 0.6665 l
0.7241 0.6666 l
0.7257 0.6666 l
0.7273 0.6667 l
0.7288 0.6667 l
0.7304 0.6668 l
0.7320 0.6668 l
0.7335 0.6669 l
0.7351 0.6669 l
0.7367 0.6670 l
0.7382 0.6670 l
0.7398 0.6671 l
0.7414 0.6671 l
0.7429 0.6672 l
0.7445 0.6672 l
0.7461 0.6673 l
0.7476 0.6673 l
0.7492 0.6674 l
0.7508 0.6674 l
0.7524 0.6675 l
0.7539 0.6675 l
0.7555 0.6676 l
0.7571 0.6676 l
0.7586 0.6677 l
0.7602 0.6677 l
0.7618 0.6678 l
0.7633 0.6678 l
0.7649 0.6679 l
0.7665 0.6679 l
0.7680 0.6679 l
0.7696 0.6680 l
0.7712 0.6680 l
0.7727 0.6681 l
0.7743 0.6681 l
0.7759 0.6682 l
0.7775 0.6682 l
0.7790 0.6682 l
0.7806 0.6683 l
0.7822 0.6683 l
0.7837 0.6684 l
0.7853 0.6684 l
0.7869 0.6685 l
0.7884 0.6685 l
0.7900 0.6685 l
0.7916 0.6686 l
0.7931 0.6686 l
0.7947 0.6687 l
0.7963 0.6687 l
0.7978 0.6687 l
0.7994 0.6688 l
0.8010 0.6688 l
0.8025 0.6689 l
0.8041 0.6689 l
0.8057 0.6689 l
0.8073 0.6690 l
0.8088 0.6690 l
0.8104 0.6690 l
0.8120 0.6691 l
0.8135 0.6691 l
0.8151 0.6692 l
0.8167 0.6692 l
0.8182 0.6692 l
0.8198 0.6693 l
0.8214 0.6693 l
0.8229 0.6693 l
0.8245 0.6694 l
0.8261 0.6694 l
0.8276 0.6694 l
0.8292 0.6695 l
0.8308 0.6695 l
0.8324 0.6695 l
0.8339 0.6696 l
0.8355 0.6696 l
0.8371 0.6696 l
0.8386 0.6697 l
0.8402 0.6697 l
0.8418 0.6697 l
0.8433 0.6698 l
0.8449 0.6698 l
0.8465 0.6698 l
0.8480 0.6699 l
0.8496 0.6699 l
0.8512 0.6699 l
0.8527 0.6700 l
0.8543 0.6700 l
0.8559 0.6700 l
0.8575 0.6701 l
0.8590 0.6701 l
0.8606 0.6701 l
0.8622 0.6702 l
0.8637 0.6702 l
0.8653 0.6702 l
0.8669 0.6703 l
0.8684 0.6703 l
0.8700 0.6703 l
0.8716 0.6703 l
0.8731 0.6704 l
0.8747 0.6704 l
0.8763 0.6704 l
0.8778 0.6705 l
0.8794 0.6705 l
0.8810 0.6705 l
0.8825 0.6705 l
0.8841 0.6706 l
0.8857 0.6706 l
0.8873 0.6706 l
0.8888 0.6707 l
0.8904 0.6707 l
0.8920 0.6707 l
0.8935 0.6707 l
0.8951 0.6708 l
0.8967 0.6708 l
0.8982 0.6708 l
0.8998 0.6708 l
0.9014 0.6709 l
0.9029 0.6709 l
0.9045 0.6709 l
0.9061 0.6710 l
0.9076 0.6710 l
0.9092 0.6710 l
0.9108 0.6710 l
0.9124 0.6711 l
0.9139 0.6711 l
0.9155 0.6711 l
0.9171 0.6711 l
0.9186 0.6712 l
0.9202 0.6712 l
0.9218 0.6712 l
0.9233 0.6712 l
0.9249 0.6713 l
0.9265 0.6713 l
0.9280 0.6713 l
0.9296 0.6713 l
0.9312 0.6714 l
0.9327 0.6714 l
0.9343 0.6714 l
0.9359 0.6714 l
0.9375 0.6715 l
0.9390 0.6715 l
0.9406 0.6715 l
0.9422 0.6715 l
0.9437 0.6715 l
0.9453 0.6716 l
0.9469 0.6716 l
0.9484 0.6716 l
0.9500 0.6716 l
s
[/DeviceRGB] SCS
Color1 SC
[] 0 SD
0.0015 SLW
n
0.1971 0.1500 m
0.1971 0.1600 l
s
n
0.1971 0.9000 m
0.1971 0.8900 l
s
n
0.2284 0.1500 m
0.2284 0.1600 l
s
n
0.2284 0.9000 m
0.2284 0.8900 l
s
n
0.2598 0.1500 m
0.2598 0.1600 l
s
n
0.2598 0.9000 m
0.2598 0.8900 l
s
n
0.2912 0.1500 m
0.2912 0.1600 l
s
n
0.2912 0.9000 m
0.2912 0.8900 l
s
n
0.3539 0.1500 m
0.3539 0.1600 l
s
n
0.3539 0.9000 m
0.3539 0.8900 l
s
n
0.3853 0.1500 m
0.3853 0.1600 l
s
n
0.3853 0.9000 m
0.3853 0.8900 l
s
n
0.4167 0.1500 m
0.4167 0.1600 l
s
n
0.4167 0.9000 m
0.4167 0.8900 l
s
n
0.4480 0.1500 m
0.4480 0.1600 l
s
n
0.4480 0.9000 m
0.4480 0.8900 l
s
n
0.5108 0.1500 m
0.5108 0.1600 l
s
n
0.5108 0.9000 m
0.5108 0.8900 l
s
n
0.5422 0.1500 m
0.5422 0.1600 l
s
n
0.5422 0.9000 m
0.5422 0.8900 l
s
n
0.5735 0.1500 m
0.5735 0.1600 l
s
n
0.5735 0.9000 m
0.5735 0.8900 l
s
n
0.6049 0.1500 m
0.6049 0.1600 l
s
n
0.6049 0.9000 m
0.6049 0.8900 l
s
n
0.6676 0.1500 m
0.6676 0.1600 l
s
n
0.6676 0.9000 m
0.6676 0.8900 l
s
n
0.6990 0.1500 m
0.6990 0.1600 l
s
n
0.6990 0.9000 m
0.6990 0.8900 l
s
n
0.7304 0.1500 m
0.7304 0.1600 l
s
n
0.7304 0.9000 m
0.7304 0.8900 l
s
n
0.7618 0.1500 m
0.7618 0.1600 l
s
n
0.7618 0.9000 m
0.7618 0.8900 l
s
n
0.8245 0.1500 m
0.8245 0.1600 l
s
n
0.8245 0.9000 m
0.8245 0.8900 l
s
n
0.8559 0.1500 m
0.8559 0.1600 l
s
n
0.8559 0.9000 m
0.8559 0.8900 l
s
n
0.8873 0.1500 m
0.8873 0.1600 l
s
n
0.8873 0.9000 m
0.8873 0.8900 l
s
n
0.9186 0.1500 m
0.9186 0.1600 l
s
n
0.9186 0.9000 m
0.9186 0.8900 l
s
n
0.1657 0.1500 m
0.1657 0.1700 l
s
n
0.1657 0.9000 m
0.1657 0.8800 l
s
n
0.3225 0.1500 m
0.3225 0.1700 l
s
n
0.3225 0.9000 m
0.3225 0.8800 l
s
n
0.4794 0.1500 m
0.4794 0.1700 l
s
n
0.4794 0.9000 m
0.4794 0.8800 l
s
n
0.6363 0.1500 m
0.6363 0.1700 l
s
n
0.6363 0.9000 m
0.6363 0.8800 l
s
n
0.7931 0.1500 m
0.7931 0.1700 l
s
n
0.7931 0.9000 m
0.7931 0.8800 l
s
n
0.9500 0.1500 m
0.9500 0.1700 l
s
n
0.9500 0.9000 m
0.9500 0.8800 l
s
/Helvetica findfont
dup length dict begin
 {1 index /FID ne {def} {pop pop} ifelse} forall
 /Encoding DefEncoding def
 currentdict
end
/Font4 exch definefont pop
/Font4 FFSF
0.1431 0.1200 m
GS
[0.0280 0.0000 0.0000 0.0280 0 0] CC
(100) show
GR
/Font4 FFSF
0.3000 0.1200 m
GS
[0.0280 0.0000 0.0000 0.0280 0 0] CC
(200) show
GR
/Font4 FFSF
0.4569 0.1200 m
GS
[0.0280 0.0000 0.0000 0.0280 0 0] CC
(300) show
GR
/Font4 FFSF
0.6137 0.1200 m
GS
[0.0280 0.0000 0.0000 0.0280 0 0] CC
(400) show
GR
/Font4 FFSF
0.7706 0.1200 m
GS
[0.0280 0.0000 0.0000 0.0280 0 0] CC
(500) show
GR
/Font4 FFSF
0.9275 0.1200 m
GS
[0.0280 0.0000 0.0000 0.0280 0 0] CC
(600) show
GR
/Font4 FFSF
0.4818 0.0845 m
GS
[0.0336 0.0000 0.0000 0.0336 0 0] CC
(M) show
GR
/Font4 FFSF
0.5096 0.0711 m
GS
[0.0238 0.0000 0.0000 0.0238 0 0] CC
(A) show
GR
/Font4 FFSF
0.5253 0.0845 m
GS
[0.0336 0.0000 0.0000 0.0336 0 0] CC
( [GeV]) show
GR
n
0.1500 0.2064 m
0.1600 0.2064 l
s
n
0.9500 0.2064 m
0.9400 0.2064 l
s
n
0.1500 0.2395 m
0.1600 0.2395 l
s
n
0.9500 0.2395 m
0.9400 0.2395 l
s
n
0.1500 0.2629 m
0.1600 0.2629 l
s
n
0.9500 0.2629 m
0.9400 0.2629 l
s
n
0.1500 0.2811 m
0.1600 0.2811 l
s
n
0.9500 0.2811 m
0.9400 0.2811 l
s
n
0.1500 0.2959 m
0.1600 0.2959 l
s
n
0.9500 0.2959 m
0.9400 0.2959 l
s
n
0.1500 0.3085 m
0.1600 0.3085 l
s
n
0.9500 0.3085 m
0.9400 0.3085 l
s
n
0.1500 0.3193 m
0.1600 0.3193 l
s
n
0.9500 0.3193 m
0.9400 0.3193 l
s
n
0.1500 0.3289 m
0.1600 0.3289 l
s
n
0.9500 0.3289 m
0.9400 0.3289 l
s
n
0.1500 0.3375 m
0.1600 0.3375 l
s
n
0.9500 0.3375 m
0.9400 0.3375 l
s
n
0.1500 0.3939 m
0.1600 0.3939 l
s
n
0.9500 0.3939 m
0.9400 0.3939 l
s
n
0.1500 0.4270 m
0.1600 0.4270 l
s
n
0.9500 0.4270 m
0.9400 0.4270 l
s
n
0.1500 0.4504 m
0.1600 0.4504 l
s
n
0.9500 0.4504 m
0.9400 0.4504 l
s
n
0.1500 0.4686 m
0.1600 0.4686 l
s
n
0.9500 0.4686 m
0.9400 0.4686 l
s
n
0.1500 0.4834 m
0.1600 0.4834 l
s
n
0.9500 0.4834 m
0.9400 0.4834 l
s
n
0.1500 0.4960 m
0.1600 0.4960 l
s
n
0.9500 0.4960 m
0.9400 0.4960 l
s
n
0.1500 0.5068 m
0.1600 0.5068 l
s
n
0.9500 0.5068 m
0.9400 0.5068 l
s
n
0.1500 0.5164 m
0.1600 0.5164 l
s
n
0.9500 0.5164 m
0.9400 0.5164 l
s
n
0.1500 0.5250 m
0.1600 0.5250 l
s
n
0.9500 0.5250 m
0.9400 0.5250 l
s
n
0.1500 0.5814 m
0.1600 0.5814 l
s
n
0.9500 0.5814 m
0.9400 0.5814 l
s
n
0.1500 0.6145 m
0.1600 0.6145 l
s
n
0.9500 0.6145 m
0.9400 0.6145 l
s
n
0.1500 0.6379 m
0.1600 0.6379 l
s
n
0.9500 0.6379 m
0.9400 0.6379 l
s
n
0.1500 0.6561 m
0.1600 0.6561 l
s
n
0.9500 0.6561 m
0.9400 0.6561 l
s
n
0.1500 0.6709 m
0.1600 0.6709 l
s
n
0.9500 0.6709 m
0.9400 0.6709 l
s
n
0.1500 0.6835 m
0.1600 0.6835 l
s
n
0.9500 0.6835 m
0.9400 0.6835 l
s
n
0.1500 0.6943 m
0.1600 0.6943 l
s
n
0.9500 0.6943 m
0.9400 0.6943 l
s
n
0.1500 0.7039 m
0.1600 0.7039 l
s
n
0.9500 0.7039 m
0.9400 0.7039 l
s
n
0.1500 0.7125 m
0.1600 0.7125 l
s
n
0.9500 0.7125 m
0.9400 0.7125 l
s
n
0.1500 0.7689 m
0.1600 0.7689 l
s
n
0.9500 0.7689 m
0.9400 0.7689 l
s
n
0.1500 0.8020 m
0.1600 0.8020 l
s
n
0.9500 0.8020 m
0.9400 0.8020 l
s
n
0.1500 0.8254 m
0.1600 0.8254 l
s
n
0.9500 0.8254 m
0.9400 0.8254 l
s
n
0.1500 0.8436 m
0.1600 0.8436 l
s
n
0.9500 0.8436 m
0.9400 0.8436 l
s
n
0.1500 0.8584 m
0.1600 0.8584 l
s
n
0.9500 0.8584 m
0.9400 0.8584 l
s
n
0.1500 0.8710 m
0.1600 0.8710 l
s
n
0.9500 0.8710 m
0.9400 0.8710 l
s
n
0.1500 0.8818 m
0.1600 0.8818 l
s
n
0.9500 0.8818 m
0.9400 0.8818 l
s
n
0.1500 0.8914 m
0.1600 0.8914 l
s
n
0.9500 0.8914 m
0.9400 0.8914 l
s
n
0.1500 0.9000 m
0.1600 0.9000 l
s
n
0.9500 0.9000 m
0.9400 0.9000 l
s
n
0.1500 0.1500 m
0.1700 0.1500 l
s
n
0.9500 0.1500 m
0.9300 0.1500 l
s
n
0.1500 0.3375 m
0.1700 0.3375 l
s
n
0.9500 0.3375 m
0.9300 0.3375 l
s
n
0.1500 0.5250 m
0.1700 0.5250 l
s
n
0.9500 0.5250 m
0.9300 0.5250 l
s
n
0.1500 0.7125 m
0.1700 0.7125 l
s
n
0.9500 0.7125 m
0.9300 0.7125 l
s
n
0.1500 0.9000 m
0.1700 0.9000 l
s
n
0.9500 0.9000 m
0.9300 0.9000 l
s
/Font4 FFSF
0.0922 0.1349 m
GS
[0.0280 0.0000 0.0000 0.0280 0 0] CC
(10) show
GR
/Font4 FFSF
0.1231 0.1517 m
GS
[0.0198 0.0000 0.0000 0.0198 0 0] CC
(-4) show
GR
/Font4 FFSF
0.0922 0.3224 m
GS
[0.0280 0.0000 0.0000 0.0280 0 0] CC
(10) show
GR
/Font4 FFSF
0.1231 0.3392 m
GS
[0.0198 0.0000 0.0000 0.0198 0 0] CC
(-3) show
GR
/Font4 FFSF
0.0922 0.5099 m
GS
[0.0280 0.0000 0.0000 0.0280 0 0] CC
(10) show
GR
/Font4 FFSF
0.1231 0.5267 m
GS
[0.0198 0.0000 0.0000 0.0198 0 0] CC
(-2) show
GR
/Font4 FFSF
0.0957 0.6974 m
GS
[0.0280 0.0000 0.0000 0.0280 0 0] CC
(10) show
GR
/Font4 FFSF
0.1267 0.7142 m
GS
[0.0198 0.0000 0.0000 0.0198 0 0] CC
(-1) show
GR
/Font4 FFSF
0.0988 0.8849 m
GS
[0.0280 0.0000 0.0000 0.0280 0 0] CC
(10) show
GR
/Font4 FFSF
0.1298 0.9017 m
GS
[0.0198 0.0000 0.0000 0.0198 0 0] CC
(0) show
GR
/Font4 FFSF
0.0747 0.4825 m
GS
[0.0000 0.0336 -0.0336 0.0000 0 0] CC
(BR\(h\)) show
GR
n
0.1500 0.1500 m
0.1500 0.9000 l
0.9500 0.9000 l
0.9500 0.1500 l
0.1500 0.1500 l
c
s
n
0.7000 0.6300 m
0.7000 0.2182 l
0.9290 0.2182 l
0.9290 0.6300 l
c
[/DeviceRGB] SCS
Color0 SC
fill
[/DeviceRGB] SCS
Color1 SC
n
0.7000 0.6300 m
0.7000 0.2182 l
0.9290 0.2182 l
0.9290 0.6300 l
0.7000 0.6300 l
c
s
/Font4 FFSF
0.7872 0.5735 m
GS
[0.0224 0.0000 0.0000 0.0224 0 0] CC
(BR\(h -> bb\)) show
GR
[/DeviceRGB] SCS
Color2 SC
[] 0 SD
0.0045 SLW
n
0.7122 0.5794 m
0.7722 0.5794 l
s
/Font4 FFSF
[/DeviceRGB] SCS
Color1 SC
0.7872 0.5324 m
GS
[0.0224 0.0000 0.0000 0.0224 0 0] CC
(BR\(h -> cc\)) show
GR
[/DeviceRGB] SCS
Color3 SC
n
0.7122 0.5382 m
0.7722 0.5382 l
s
/Font4 FFSF
[/DeviceRGB] SCS
Color1 SC
0.7872 0.4912 m
GS
[0.0224 0.0000 0.0000 0.0224 0 0] CC
(BR\(h -> ) show
GR
/Symbol findfont
/Font12 exch definefont pop
/Font12 FFSF
0.8712 0.4912 m
GS
[0.0224 0.0000 0.0000 0.0224 0 0] CC
(tt) show
GR
/Font4 FFSF
0.8908 0.4912 m
GS
[0.0224 0.0000 0.0000 0.0224 0 0] CC
(\)) show
GR
[/DeviceRGB] SCS
Color4 SC
n
0.7122 0.4971 m
0.7722 0.4971 l
s
/Font4 FFSF
[/DeviceRGB] SCS
Color1 SC
0.7872 0.4500 m
GS
[0.0224 0.0000 0.0000 0.0224 0 0] CC
(BR\(h -> ) show
GR
/Font12 FFSF
0.8712 0.4500 m
GS
[0.0224 0.0000 0.0000 0.0224 0 0] CC
(mm) show
GR
/Font4 FFSF
0.8971 0.4500 m
GS
[0.0224 0.0000 0.0000 0.0224 0 0] CC
(\)) show
GR
[/DeviceRGB] SCS
Color5 SC
n
0.7122 0.4557 m
0.7722 0.4557 l
s
/Font4 FFSF
[/DeviceRGB] SCS
Color1 SC
0.7872 0.4084 m
GS
[0.0224 0.0000 0.0000 0.0224 0 0] CC
(BR\(h -> WW\)) show
GR
[/DeviceRGB] SCS
Color6 SC
n
0.7122 0.4143 m
0.7722 0.4143 l
s
/Font4 FFSF
[/DeviceRGB] SCS
Color1 SC
0.7872 0.3673 m
GS
[0.0224 0.0000 0.0000 0.0224 0 0] CC
(BR\(h -> ZZ\)) show
GR
[/DeviceRGB] SCS
Color7 SC
n
0.7122 0.3731 m
0.7722 0.3731 l
s
/Font4 FFSF
[/DeviceRGB] SCS
Color1 SC
0.7872 0.3261 m
GS
[0.0224 0.0000 0.0000 0.0224 0 0] CC
(BR\(h -> ) show
GR
/Font12 FFSF
0.8712 0.3261 m
GS
[0.0224 0.0000 0.0000 0.0224 0 0] CC
(gg) show
GR
/Font4 FFSF
0.8896 0.3261 m
GS
[0.0224 0.0000 0.0000 0.0224 0 0] CC
(\)) show
GR
[/DeviceRGB] SCS
Color8 SC
n
0.7122 0.3318 m
0.7722 0.3318 l
s
/Font4 FFSF
[/DeviceRGB] SCS
Color1 SC
0.7872 0.2845 m
GS
[0.0224 0.0000 0.0000 0.0224 0 0] CC
(BR\(h -> Z) show
GR
/Font12 FFSF
0.8849 0.2845 m
GS
[0.0224 0.0000 0.0000 0.0224 0 0] CC
(g) show
GR
/Font4 FFSF
0.8939 0.2845 m
GS
[0.0224 0.0000 0.0000 0.0224 0 0] CC
(\)) show
GR
[/DeviceRGB] SCS
Color9 SC
n
0.7122 0.2902 m
0.7722 0.2902 l
s
/Font4 FFSF
[/DeviceRGB] SCS
Color1 SC
0.7872 0.2429 m
GS
[0.0224 0.0000 0.0000 0.0224 0 0] CC
(BR\(h -> gg\)) show
GR
[/DeviceRGB] SCS
Color10 SC
n
0.7122 0.2488 m
0.7722 0.2488 l
s
/Font4 FFSF
[/DeviceRGB] SCS
Color1 SC
0.9700 0.7000 m
GS
[0.0000 0.0168 -0.0168 0.0000 0 0] CC
(LHC Higgs XS WG 2013) show
GR
/Font4 FFSF
0.7150 0.6050 m
GS
[0.0224 0.0000 0.0000 0.0224 0 0] CC
(light stop, tan) show
GR
/Font12 FFSF
0.8483 0.6050 m
GS
[0.0224 0.0000 0.0000 0.0224 0 0] CC
(b) show
GR
/Font4 FFSF
0.8605 0.6050 m
GS
[0.0224 0.0000 0.0000 0.0224 0 0] CC
( = 50) show
GR
%%Trailer
%%BoundingBox: 29 42 597 562
%%DocumentNeededResources: font Helvetica
%%+ font Symbol
%%EOF
