%!PS-Adobe-2.0 EPSF-2.0
%%BoundingBox: 71 198 468 390
%%HiResBoundingBox: 71.000000 198.500000 468.000000 389.500000
%...................................
%%Creator: GPL Ghostscript 870 (pswrite)
%%CreationDate: 2013/02/14 17:37:50
%%DocumentData: Clean7Bit
%%LanguageLevel: 2
%%EndComments
% EPSF created by ps2eps 1.64
%%BeginProlog
save
countdictstack
mark
newpath
/showpage {} def
/setpagedevice {pop} def
%%EndProlog
%%Page 1 1
%%BeginProlog
% This copyright applies to everything between here and the %%EndProlog:
% Copyright (C) 2009 Artifex Software, Inc.  All rights reserved.
%%BeginResource: procset GS_pswrite_2_0_1001 1.001 0
/GS_pswrite_2_0_1001 80 dict dup begin
/PageSize 2 array def/setpagesize{ PageSize aload pop 3 index eq exch
4 index eq and{ pop pop pop}{ PageSize dup  1
5 -1 roll put 0 4 -1 roll put dup null eq {false} {dup where} ifelse{ exch get exec}
{ pop/setpagedevice where
{ pop 1 dict dup /PageSize PageSize put setpagedevice}
{ /setpage where{ pop PageSize aload pop pageparams 3 {exch pop} repeat
setpage}if}ifelse}ifelse}ifelse} bind def
/!{bind def}bind def/#{load def}!/N/counttomark #
/rG{3{3 -1 roll 255 div}repeat setrgbcolor}!/G{255 div setgray}!/K{0 G}!
/r6{dup 3 -1 roll rG}!/r5{dup 3 1 roll rG}!/r3{dup rG}!
/w/setlinewidth #/J/setlinecap #
/j/setlinejoin #/M/setmiterlimit #/d/setdash #/i/setflat #
/m/moveto #/l/lineto #/c/rcurveto #
/p{N 2 idiv{N -2 roll rlineto}repeat}!
/P{N 0 gt{N -2 roll moveto p}if}!
/h{p closepath}!/H{P closepath}!
/lx{0 rlineto}!/ly{0 exch rlineto}!/v{0 0 6 2 roll c}!/y{2 copy c}!
/re{4 -2 roll m exch dup lx exch ly neg lx h}!
/^{3 index neg 3 index neg}!
/f{P fill}!/f*{P eofill}!/s{H stroke}!/S{P stroke}!
/q/gsave #/Q/grestore #/rf{re fill}!
/Y{P clip newpath}!/Y*{P eoclip newpath}!/rY{re Y}!
/|={pop exch 4 1 roll 1 array astore cvx 3 array astore cvx exch 1 index def exec}!
/|{exch string readstring |=}!
/+{dup type/nametype eq{2 index 7 add -3 bitshift 2 index mul}if}!
/@/currentfile #/${+ @ |}!
/B{{2 copy string{readstring pop}aload pop 4 array astore cvx
3 1 roll}repeat pop pop true}!
/Ix{[1 0 0 1 11 -2 roll exch neg exch neg]exch}!
/,{true exch Ix imagemask}!/If{false exch Ix imagemask}!/I{exch Ix image}!
/Ic{exch Ix false 3 colorimage}!
/F{/Columns counttomark 3 add -2 roll/Rows exch/K -1/BlackIs1 true>>
/CCITTFaxDecode filter}!/FX{<</EndOfBlock false F}!
/X{/ASCII85Decode filter}!/@X{@ X}!/&2{2 index 2 index}!
/@F{@ &2<<F}!/@C{@X &2 FX}!
/$X{+ @X |}!/&4{4 index 4 index}!/$F{+ @ &4<<F |}!/$C{+ @X &4 FX |}!
/IC{3 1 roll 10 dict begin 1{/ImageType/Interpolate/Decode/DataSource
/ImageMatrix/BitsPerComponent/Height/Width}{exch def}forall
currentdict end image}!
/~{@ read {pop} if}!
end def
%%EndResource
/pagesave null def
%%EndProlog
%%Page: 1 1
%%PageBoundingBox: 0 0 612 792
%%BeginPageSetup
GS_pswrite_2_0_1001 begin
612 792 /letter setpagesize
/pagesave save store 197 dict begin
0.1 0.1 scale
%%EndPageSetup
gsave mark
Q q
0 0 6120 7920 re
Y
4.8 w
1 J
1 j
K
2335.2 5863.2 -9.6 -12 -9.6 -14.4 -12 -21.6 -4.8 -26.4 0 -19.2 4.8 -26.4 12 -21.6 
9.6 -14.4 9.6 -9.6 P
2325.6 5851.2 -9.6 -19.2 -4.8 -16.8 -7.2 -26.4 0 -19.2 7.2 -26.4 4.8 -14.4 9.6 -21.6 P
2548.8 5841.6 -4.8 -4.8 4.8 -4.8 ^ ^ P
2553.6 5805.6 0 -93.6 -4.8 -9.6 -9.6 -4.8 -9.6 0 -7.2 4.8 0 4.8 7.2 4.8 
4.8 -4.8 -4.8 -4.8 P
2548.8 5805.6 0 -93.6 -4.8 -9.6 -4.8 -4.8 P
2534.4 5805.6 19.2 0 P
2596.8 5820 4.8 -4.8 -4.8 -4.8 -7.2 4.8 0 4.8 7.2 12 4.8 4.8 14.4 4.8 
21.6 0 14.4 -4.8 7.2 -9.6 0 -16.8 -7.2 -9.6 -14.4 -4.8 -16.8 0 P
2637.6 5841.6 9.6 -4.8 4.8 -9.6 0 -16.8 -4.8 -9.6 -9.6 -4.8 9.6 -7.2 12 -9.6 
4.8 -9.6 0 -16.8 -4.8 -9.6 -7.2 -4.8 -14.4 -4.8 -21.6 0 -14.4 4.8 -4.8 4.8 
-7.2 9.6 0 7.2 7.2 4.8 4.8 -4.8 -4.8 -7.2 P
2652 5784 7.2 -14.4 0 -16.8 -7.2 -9.6 -4.8 -4.8 -9.6 -4.8 P
2784 5805.6 31.2 -72 P
2788.8 5805.6 26.4 -62.4 P
2846.4 5805.6 -31.2 -72 -12 -21.6 -9.6 -9.6 -9.6 -4.8 -7.2 0 -4.8 4.8 4.8 4.8 
7.2 -4.8 P
2772 5805.6 31.2 0 P
2824.8 5805.6 31.2 0 P
3708 5805.6 31.2 -72 P
3712.8 5805.6 26.4 -62.4 P
3770.4 5805.6 -31.2 -72 P
3698.4 5805.6 31.2 0 P
3748.8 5805.6 31.2 0 P
3811.2 5841.6 0 -108 P
3818.4 5841.6 0 -108 P
3818.4 5788.8 9.6 12 9.6 4.8 12 0 14.4 -4.8 9.6 -12 7.2 -14.4 0 -9.6 
-7.2 -16.8 -9.6 -9.6 -14.4 -4.8 -12 0 -9.6 4.8 -9.6 9.6 P
3849.6 5805.6 9.6 -4.8 9.6 -12 4.8 -14.4 0 -9.6 -4.8 -16.8 -9.6 -9.6 -9.6 -4.8 S
3796.8 5841.6 21.6 0 P
3948 5836.8 -4.8 -4.8 4.8 -4.8 ^ 0 4.8 -4.8 4.8 -12 0 -9.6 -4.8 
-4.8 -9.6 0 -93.6 P
3936 5841.6 -4.8 -4.8 -4.8 -9.6 0 -93.6 P
3904.8 5805.6 43.2 0 P
3904.8 5733.6 38.4 0 P
4041.6 5788.8 -4.8 -4.8 4.8 -4.8 4.8 4.8 0 4.8 -9.6 12 -12 4.8 -14.4 0 
-16.8 -4.8 -9.6 -12 -4.8 -14.4 0 -9.6 4.8 -16.8 9.6 -9.6 16.8 -4.8 9.6 0 
16.8 4.8 9.6 9.6 P
4010.4 5805.6 -12 -4.8 -9.6 -12 -4.8 -14.4 0 -9.6 4.8 -16.8 9.6 -9.6 12 -4.8 P
4087.2 5805.6 0 -57.6 4.8 -9.6 16.8 -4.8 9.6 0 16.8 4.8 9.6 9.6 P
4092 5805.6 0 -57.6 7.2 -9.6 9.6 -4.8 P
4144.8 5805.6 0 -72 P
4149.6 5805.6 0 -72 P
4072.8 5805.6 19.2 0 P
4130.4 5805.6 19.2 0 P
4144.8 5733.6 21.6 0 P
4202.4 5841.6 0 -88.8 4.8 -14.4 9.6 -4.8 12 0 9.6 4.8 4.8 9.6 P
4207.2 5841.6 0 -88.8 4.8 -14.4 4.8 -4.8 P
4185.6 5805.6 43.2 0 P
4322.4 5796 4.8 9.6 0 -21.6 -4.8 12 -7.2 4.8 -9.6 4.8 -21.6 0 -9.6 -4.8 
-4.8 -4.8 0 -12 4.8 -4.8 9.6 -4.8 26.4 -9.6 12 -4.8 4.8 -7.2 P
4269.6 5788.8 4.8 -4.8 9.6 -4.8 26.4 -9.6 12 -4.8 4.8 -4.8 0 -16.8 -4.8 -4.8 
-12 -4.8 -19.2 0 -12 4.8 -4.8 4.8 -4.8 9.6 0 -19.2 4.8 9.6 P
1190.4 3544.8 4154.4 0 0 2076 ^ H
1689.6 3544.8 0 1053.6 165.6 0 0 189.6 165.6 0 0 254.4 168 0 0 40.8 
165.6 0 0 -4.8 165.6 0 0 45.6 165.6 0 0 -151.2 165.6 0 0 -48 
168 0 0 -134.4 165.6 0 0 -108 165.6 0 0 62.4 165.6 0 0 153.6 
165.6 0 0 72 168 0 0 110.4 331.2 0 0 24 165.6 0 0 -122.4 
168 0 0 -148.8 165.6 0 0 -295.2 165.6 0 0 -993.6 S
5344.8 3544.8 0 0 P
1190.4 3544.8 0 124.8 P
1329.6 3585.6 0 -40.8 P
1468.8 3544.8 0 40.8 P
1605.6 3585.6 0 -40.8 P
1744.8 3544.8 0 40.8 P
1884 3669.6 0 -124.8 P
2020.8 3544.8 0 40.8 P
2160 3585.6 0 -40.8 P
2299.2 3544.8 0 40.8 P
2436 3585.6 0 -40.8 P
2575.2 3544.8 0 124.8 P
2714.4 3585.6 0 -40.8 P
2853.6 3544.8 0 40.8 P
2990.4 3585.6 0 -40.8 P
3129.6 3544.8 0 40.8 P
3266.4 3669.6 0 -124.8 P
3405.6 3544.8 0 40.8 P
3544.8 3585.6 0 -40.8 P
3681.6 3544.8 0 40.8 P
3820.8 3585.6 0 -40.8 P
3960 3544.8 0 124.8 P
4099.2 3585.6 0 -40.8 P
4236 3544.8 0 40.8 P
4375.2 3585.6 0 -40.8 P
4514.4 3544.8 0 40.8 P
4651.2 3669.6 0 -124.8 P
4790.4 3544.8 0 40.8 P
4929.6 3585.6 0 -40.8 P
5066.4 3544.8 0 40.8 P
5205.6 3585.6 0 -40.8 P
5344.8 3544.8 0 124.8 P
1190.4 5496 0 124.8 P
1329.6 5620.8 0 -40.8 P
1468.8 5580 0 40.8 P
1605.6 5620.8 0 -40.8 P
1744.8 5580 0 40.8 P
1884 5620.8 0 -124.8 P
2020.8 5580 0 40.8 P
2160 5620.8 0 -40.8 P
2299.2 5580 0 40.8 P
2436 5620.8 0 -40.8 P
2575.2 5496 0 124.8 P
2714.4 5620.8 0 -40.8 P
2853.6 5580 0 40.8 P
2990.4 5620.8 0 -40.8 P
3129.6 5580 0 40.8 P
3266.4 5620.8 0 -124.8 P
3405.6 5580 0 40.8 P
3544.8 5620.8 0 -40.8 P
3681.6 5580 0 40.8 P
3820.8 5620.8 0 -40.8 P
3960 5496 0 124.8 P
4099.2 5620.8 0 -40.8 P
4236 5580 0 40.8 P
4375.2 5620.8 0 -40.8 P
4514.4 5580 0 40.8 P
4651.2 5620.8 0 -124.8 P
4790.4 5580 0 40.8 P
4929.6 5620.8 0 -40.8 P
5066.4 5580 0 40.8 P
5205.6 5620.8 0 -40.8 P
5344.8 5496 0 124.8 P
1190.4 3544.8 43.2 0 S
1233.6 3667.2 -43.2 0 P
1190.4 3753.6 43.2 0 P
1315.2 3820.8 -124.8 0 P
1190.4 3876 43.2 0 P
1233.6 3921.6 -43.2 0 P
1190.4 3962.4 43.2 0 P
1233.6 3996 -43.2 0 P
1190.4 4029.6 124.8 0 P
1233.6 4236 -43.2 0 P
1190.4 4358.4 43.2 0 P
1233.6 4444.8 -43.2 0 P
1190.4 4512 124.8 0 P
1233.6 4567.2 -43.2 0 P
1190.4 4612.8 43.2 0 P
1233.6 4653.6 -43.2 0 P
1190.4 4689.6 43.2 0 P
1315.2 4720.8 -124.8 0 P
1190.4 4929.6 43.2 0 P
1233.6 5049.6 -43.2 0 P
1190.4 5136 43.2 0 P
1315.2 5203.2 -124.8 0 P
1190.4 5258.4 43.2 0 P
1233.6 5306.4 -43.2 0 P
1190.4 5344.8 43.2 0 P
1233.6 5380.8 -43.2 0 P
1190.4 5412 124.8 0 P
1233.6 5620.8 -43.2 0 P
732 3852 -12 -4.8 -4.8 -9.6 -4.8 -16.8 0 -12 4.8 -16.8 4.8 -9.6 12 -4.8 
7.2 0 9.6 4.8 7.2 9.6 2.4 16.8 0 12 -2.4 16.8 -7.2 9.6 -9.6 4.8 
-7.2 0 -7.2 -4.8 -4.8 -2.4 -2.4 -7.2 -2.4 -16.8 0 -12 2.4 -16.8 2.4 -7.2 
4.8 -2.4 7.2 -4.8 P
739.2 3777.6 7.2 4.8 2.4 2.4 2.4 7.2 4.8 16.8 0 12 -4.8 16.8 -2.4 7.2 
-2.4 2.4 -7.2 4.8 P
787.2 3784.8 -4.8 -2.4 4.8 -4.8 2.4 4.8 -2.4 2.4 P
835.2 3852 -9.6 -4.8 -7.2 -9.6 -4.8 -16.8 0 -12 4.8 -16.8 7.2 -9.6 9.6 -4.8 
7.2 0 9.6 4.8 7.2 9.6 4.8 16.8 0 12 -4.8 16.8 -7.2 9.6 -9.6 4.8 
-7.2 0 -7.2 -4.8 -2.4 -2.4 -4.8 -7.2 -2.4 -16.8 0 -12 2.4 -16.8 4.8 -7.2 
2.4 -2.4 7.2 -4.8 P
842.4 3777.6 7.2 4.8 2.4 2.4 4.8 7.2 2.4 16.8 0 12 -2.4 16.8 -4.8 7.2 
-2.4 2.4 -7.2 4.8 S
904.8 3852 -9.6 -4.8 -7.2 -9.6 -4.8 -16.8 0 -12 4.8 -16.8 7.2 -9.6 9.6 -4.8 
7.2 0 9.6 4.8 7.2 9.6 2.4 16.8 0 12 -2.4 16.8 -7.2 9.6 -9.6 4.8 
-7.2 0 -7.2 -4.8 -2.4 -2.4 -4.8 -7.2 -2.4 -16.8 0 -12 2.4 -16.8 4.8 -7.2 
2.4 -2.4 7.2 -4.8 P
912 3777.6 7.2 4.8 2.4 2.4 4.8 7.2 2.4 16.8 0 12 -2.4 16.8 -4.8 7.2 
-2.4 2.4 -7.2 4.8 P
974.4 3852 -12 -4.8 -4.8 -9.6 -4.8 -16.8 0 -12 4.8 -16.8 4.8 -9.6 12 -4.8 
7.2 0 9.6 4.8 7.2 9.6 2.4 16.8 0 12 -2.4 16.8 -7.2 9.6 -9.6 4.8 
-7.2 0 -7.2 -4.8 -4.8 -2.4 -2.4 -7.2 -2.4 -16.8 0 -12 2.4 -16.8 2.4 -7.2 
4.8 -2.4 7.2 -4.8 P
981.6 3777.6 7.2 4.8 2.4 2.4 2.4 7.2 4.8 16.8 0 12 -4.8 16.8 -2.4 7.2 
-2.4 2.4 -7.2 4.8 P
1044 3852 -12 -4.8 -7.2 -9.6 -2.4 -16.8 0 -12 2.4 -16.8 7.2 -9.6 12 -4.8 
7.2 0 9.6 4.8 7.2 9.6 2.4 16.8 0 12 -2.4 16.8 -7.2 9.6 -9.6 4.8 
-7.2 0 -7.2 -4.8 -4.8 -2.4 -2.4 -7.2 -4.8 -16.8 0 -12 4.8 -16.8 2.4 -7.2 
4.8 -2.4 7.2 -4.8 P
1051.2 3777.6 4.8 4.8 4.8 2.4 2.4 7.2 4.8 16.8 0 12 -4.8 16.8 -2.4 7.2 
-4.8 2.4 -4.8 4.8 P
1099.2 3852 -7.2 -36 7.2 7.2 9.6 4.8 9.6 0 12 -4.8 7.2 -7.2 2.4 -9.6 
0 -7.2 -2.4 -9.6 -7.2 -7.2 -12 -4.8 -9.6 0 -14.4 7.2 -2.4 7.2 0 4.8 
2.4 2.4 4.8 -2.4 -4.8 -4.8 P
1118.4 3828 7.2 -4.8 7.2 -7.2 4.8 -9.6 0 -7.2 -4.8 -9.6 -7.2 -7.2 -7.2 -4.8 S
1099.2 3852 33.6 0 P
1099.2 3847.2 16.8 0 16.8 4.8 P
732 4060.8 -12 -4.8 -4.8 -9.6 -4.8 -16.8 0 -12 4.8 -16.8 4.8 -9.6 12 -4.8 
7.2 0 9.6 4.8 7.2 9.6 2.4 16.8 0 12 -2.4 16.8 -7.2 9.6 -9.6 4.8 
-7.2 0 -7.2 -4.8 -4.8 -2.4 -2.4 -7.2 -2.4 -16.8 0 -12 2.4 -16.8 2.4 -7.2 
4.8 -2.4 7.2 -4.8 P
739.2 3986.4 7.2 4.8 2.4 2.4 2.4 7.2 4.8 16.8 0 12 -4.8 16.8 -2.4 7.2 
-2.4 2.4 -7.2 4.8 P
787.2 3993.6 -4.8 -2.4 4.8 -4.8 2.4 4.8 -2.4 2.4 P
835.2 4060.8 -9.6 -4.8 -7.2 -9.6 -4.8 -16.8 0 -12 4.8 -16.8 7.2 -9.6 9.6 -4.8 
7.2 0 9.6 4.8 7.2 9.6 4.8 16.8 0 12 -4.8 16.8 -7.2 9.6 -9.6 4.8 
-7.2 0 -7.2 -4.8 -2.4 -2.4 -4.8 -7.2 -2.4 -16.8 0 -12 2.4 -16.8 4.8 -7.2 
2.4 -2.4 7.2 -4.8 P
842.4 3986.4 7.2 4.8 2.4 2.4 4.8 7.2 2.4 16.8 0 12 -2.4 16.8 -4.8 7.2 
-2.4 2.4 -7.2 4.8 P
904.8 4060.8 -9.6 -4.8 -7.2 -9.6 -4.8 -16.8 0 -12 4.8 -16.8 7.2 -9.6 9.6 -4.8 
7.2 0 9.6 4.8 7.2 9.6 2.4 16.8 0 12 -2.4 16.8 -7.2 9.6 -9.6 4.8 
-7.2 0 -7.2 -4.8 -2.4 -2.4 -4.8 -7.2 -2.4 -16.8 0 -12 2.4 -16.8 4.8 -7.2 
2.4 -2.4 7.2 -4.8 P
912 3986.4 7.2 4.8 2.4 2.4 4.8 7.2 2.4 16.8 0 12 -2.4 16.8 -4.8 7.2 
-2.4 2.4 -7.2 4.8 P
974.4 4060.8 -12 -4.8 -4.8 -9.6 -4.8 -16.8 0 -12 4.8 -16.8 4.8 -9.6 12 -4.8 
7.2 0 9.6 4.8 7.2 9.6 2.4 16.8 0 12 -2.4 16.8 -7.2 9.6 -9.6 4.8 
-7.2 0 S
974.4 4060.8 -7.2 -4.8 -4.8 -2.4 -2.4 -7.2 -2.4 -16.8 0 -12 2.4 -16.8 2.4 -7.2 
4.8 -2.4 7.2 -4.8 P
981.6 3986.4 7.2 4.8 2.4 2.4 2.4 7.2 4.8 16.8 0 12 -4.8 16.8 -2.4 7.2 
-2.4 2.4 -7.2 4.8 P
1032 4046.4 7.2 2.4 12 12 0 -74.4 P
1046.4 4056 0 -69.6 P
1032 3986.4 31.2 0 P
1113.6 4060.8 -12 -4.8 -7.2 -9.6 -2.4 -16.8 0 -12 2.4 -16.8 7.2 -9.6 12 -4.8 
4.8 0 12 4.8 7.2 9.6 2.4 16.8 0 12 -2.4 16.8 -7.2 9.6 -12 4.8 
-4.8 0 -7.2 -4.8 -4.8 -2.4 -2.4 -7.2 -4.8 -16.8 0 -12 4.8 -16.8 2.4 -7.2 
4.8 -2.4 7.2 -4.8 P
1118.4 3986.4 7.2 4.8 4.8 2.4 2.4 7.2 4.8 16.8 0 12 -4.8 16.8 -2.4 7.2 
-4.8 2.4 -7.2 4.8 P
732 4543.2 -12 -2.4 -4.8 -12 -4.8 -16.8 0 -9.6 4.8 -16.8 4.8 -12 12 -2.4 
7.2 0 9.6 2.4 7.2 12 2.4 16.8 0 9.6 -2.4 16.8 -7.2 12 -9.6 2.4 
-7.2 0 -7.2 -2.4 -4.8 -4.8 -2.4 -7.2 -2.4 -16.8 0 -9.6 2.4 -16.8 2.4 -7.2 
4.8 -4.8 7.2 -2.4 P
739.2 4471.2 7.2 2.4 2.4 4.8 2.4 7.2 4.8 16.8 0 9.6 -4.8 16.8 -2.4 7.2 
-2.4 4.8 -7.2 2.4 P
787.2 4478.4 -4.8 -4.8 4.8 -2.4 2.4 2.4 -2.4 4.8 P
835.2 4543.2 -9.6 -2.4 -7.2 -12 -4.8 -16.8 0 -9.6 4.8 -16.8 7.2 -12 9.6 -2.4 
7.2 0 9.6 2.4 7.2 12 4.8 16.8 0 9.6 -4.8 16.8 -7.2 12 -9.6 2.4 
-7.2 0 -7.2 -2.4 -2.4 -4.8 -4.8 -7.2 -2.4 -16.8 0 -9.6 2.4 -16.8 4.8 -7.2 
2.4 -4.8 7.2 -2.4 S
842.4 4471.2 7.2 2.4 2.4 4.8 4.8 7.2 2.4 16.8 0 9.6 -2.4 16.8 -4.8 7.2 
-2.4 4.8 -7.2 2.4 P
904.8 4543.2 -9.6 -2.4 -7.2 -12 -4.8 -16.8 0 -9.6 4.8 -16.8 7.2 -12 9.6 -2.4 
7.2 0 9.6 2.4 7.2 12 2.4 16.8 0 9.6 -2.4 16.8 -7.2 12 -9.6 2.4 
-7.2 0 -7.2 -2.4 -2.4 -4.8 -4.8 -7.2 -2.4 -16.8 0 -9.6 2.4 -16.8 4.8 -7.2 
2.4 -4.8 7.2 -2.4 P
912 4471.2 7.2 2.4 2.4 4.8 4.8 7.2 2.4 16.8 0 9.6 -2.4 16.8 -4.8 7.2 
-2.4 4.8 -7.2 2.4 P
974.4 4543.2 -12 -2.4 -4.8 -12 -4.8 -16.8 0 -9.6 4.8 -16.8 4.8 -12 12 -2.4 
7.2 0 9.6 2.4 7.2 12 2.4 16.8 0 9.6 -2.4 16.8 -7.2 12 -9.6 2.4 
-7.2 0 -7.2 -2.4 -4.8 -4.8 -2.4 -7.2 -2.4 -16.8 0 -9.6 2.4 -16.8 2.4 -7.2 
4.8 -4.8 7.2 -2.4 P
981.6 4471.2 7.2 2.4 2.4 4.8 2.4 7.2 4.8 16.8 0 9.6 -4.8 16.8 -2.4 7.2 
-2.4 4.8 -7.2 2.4 P
1029.6 4543.2 -7.2 -33.6 7.2 7.2 9.6 2.4 12 0 9.6 -2.4 7.2 -7.2 2.4 -12 
0 -7.2 -2.4 -9.6 -7.2 -7.2 -9.6 -2.4 -12 0 -9.6 2.4 -4.8 4.8 -2.4 7.2 
0 2.4 2.4 2.4 4.8 -2.4 -4.8 -2.4 P
1051.2 4519.2 4.8 -2.4 7.2 -7.2 4.8 -12 0 -7.2 -4.8 -9.6 -7.2 -7.2 -4.8 -2.4 P
1029.6 4543.2 33.6 0 P
1029.6 4540.8 16.8 0 16.8 2.4 P
1113.6 4543.2 -12 -2.4 -7.2 -12 -2.4 -16.8 0 -9.6 2.4 -16.8 7.2 -12 12 -2.4 
4.8 0 12 2.4 7.2 12 2.4 16.8 0 9.6 -2.4 16.8 -7.2 12 -12 2.4 
-4.8 0 S
1113.6 4543.2 -7.2 -2.4 -4.8 -4.8 -2.4 -7.2 -4.8 -16.8 0 -9.6 4.8 -16.8 2.4 -7.2 
4.8 -4.8 7.2 -2.4 S
1118.4 4471.2 7.2 2.4 4.8 4.8 2.4 7.2 4.8 16.8 0 9.6 -4.8 16.8 -2.4 7.2 
-4.8 4.8 -7.2 2.4 P
732 4752 -12 -4.8 -4.8 -9.6 -4.8 -16.8 0 -9.6 4.8 -19.2 4.8 -9.6 12 -2.4 
7.2 0 9.6 2.4 7.2 9.6 2.4 19.2 0 9.6 -2.4 16.8 -7.2 9.6 -9.6 4.8 
-7.2 0 -7.2 -4.8 -4.8 -2.4 -2.4 -7.2 -2.4 -16.8 0 -9.6 2.4 -19.2 2.4 -7.2 
4.8 -2.4 7.2 -2.4 P
739.2 4680 7.2 2.4 2.4 2.4 2.4 7.2 4.8 19.2 0 9.6 -4.8 16.8 -2.4 7.2 
-2.4 2.4 -7.2 4.8 P
787.2 4684.8 -4.8 -2.4 4.8 -2.4 2.4 2.4 -2.4 2.4 P
835.2 4752 -9.6 -4.8 -7.2 -9.6 -4.8 -16.8 0 -9.6 4.8 -19.2 7.2 -9.6 9.6 -2.4 
7.2 0 9.6 2.4 7.2 9.6 4.8 19.2 0 9.6 -4.8 16.8 -7.2 9.6 -9.6 4.8 
-7.2 0 -7.2 -4.8 -2.4 -2.4 -4.8 -7.2 -2.4 -16.8 0 -9.6 2.4 -19.2 4.8 -7.2 
2.4 -2.4 7.2 -2.4 P
842.4 4680 7.2 2.4 2.4 2.4 4.8 7.2 2.4 19.2 0 9.6 -2.4 16.8 -4.8 7.2 
-2.4 2.4 -7.2 4.8 P
904.8 4752 -9.6 -4.8 -7.2 -9.6 -4.8 -16.8 0 -9.6 4.8 -19.2 7.2 -9.6 9.6 -2.4 
7.2 0 9.6 2.4 7.2 9.6 2.4 19.2 0 9.6 -2.4 16.8 -7.2 9.6 -9.6 4.8 
-7.2 0 -7.2 -4.8 -2.4 -2.4 -4.8 -7.2 -2.4 -16.8 0 -9.6 2.4 -19.2 4.8 -7.2 
2.4 -2.4 7.2 -2.4 P
912 4680 7.2 2.4 2.4 2.4 4.8 7.2 2.4 19.2 0 9.6 -2.4 16.8 -4.8 7.2 
-2.4 2.4 -7.2 4.8 P
962.4 4737.6 7.2 4.8 12 9.6 0 -72 P
976.8 4747.2 0 -67.2 S
962.4 4680 31.2 0 P
1044 4752 -12 -4.8 -7.2 -9.6 -2.4 -16.8 0 -9.6 2.4 -19.2 7.2 -9.6 12 -2.4 
7.2 0 9.6 2.4 7.2 9.6 2.4 19.2 0 9.6 -2.4 16.8 -7.2 9.6 -9.6 4.8 
-7.2 0 -7.2 -4.8 -4.8 -2.4 -2.4 -7.2 -4.8 -16.8 0 -9.6 4.8 -19.2 2.4 -7.2 
4.8 -2.4 7.2 -2.4 P
1051.2 4680 9.6 4.8 2.4 7.2 4.8 19.2 0 9.6 -4.8 16.8 -2.4 7.2 -4.8 2.4 
-4.8 4.8 P
1113.6 4752 -12 -4.8 -7.2 -9.6 -2.4 -16.8 0 -9.6 2.4 -19.2 7.2 -9.6 12 -2.4 
4.8 0 12 2.4 7.2 9.6 2.4 19.2 0 9.6 -2.4 16.8 -7.2 9.6 -12 4.8 
-4.8 0 -7.2 -4.8 -4.8 -2.4 -2.4 -7.2 -4.8 -16.8 0 -9.6 4.8 -19.2 2.4 -7.2 
4.8 -2.4 7.2 -2.4 P
1118.4 4680 7.2 2.4 4.8 2.4 2.4 7.2 4.8 19.2 0 9.6 -4.8 16.8 -2.4 7.2 
-4.8 2.4 -7.2 4.8 P
732 5234.4 -12 -2.4 -4.8 -9.6 -4.8 -19.2 0 -9.6 4.8 -16.8 4.8 -9.6 12 -4.8 
7.2 0 9.6 4.8 7.2 9.6 2.4 16.8 0 9.6 -2.4 19.2 -7.2 9.6 -9.6 2.4 
-7.2 0 -7.2 -2.4 -4.8 -2.4 -2.4 -7.2 -2.4 -19.2 0 -9.6 2.4 -16.8 2.4 -7.2 
4.8 -2.4 7.2 -4.8 P
739.2 5162.4 7.2 4.8 2.4 2.4 2.4 7.2 4.8 16.8 0 9.6 -4.8 19.2 -2.4 7.2 
-2.4 2.4 -7.2 2.4 P
787.2 5169.6 -4.8 -2.4 4.8 -4.8 2.4 4.8 -2.4 2.4 P
835.2 5234.4 -9.6 -2.4 -7.2 -9.6 -4.8 -19.2 0 -9.6 4.8 -16.8 7.2 -9.6 9.6 -4.8 
7.2 0 9.6 4.8 7.2 9.6 4.8 16.8 0 9.6 -4.8 19.2 -7.2 9.6 -9.6 2.4 
-7.2 0 S
835.2 5234.4 -7.2 -2.4 -2.4 -2.4 -4.8 -7.2 -2.4 -19.2 0 -9.6 2.4 -16.8 4.8 -7.2 
2.4 -2.4 7.2 -4.8 P
842.4 5162.4 7.2 4.8 2.4 2.4 4.8 7.2 2.4 16.8 0 9.6 -2.4 19.2 -4.8 7.2 
-2.4 2.4 -7.2 2.4 P
904.8 5234.4 -9.6 -2.4 -7.2 -9.6 -4.8 -19.2 0 -9.6 4.8 -16.8 7.2 -9.6 9.6 -4.8 
7.2 0 9.6 4.8 7.2 9.6 2.4 16.8 0 9.6 -2.4 19.2 -7.2 9.6 -9.6 2.4 
-7.2 0 -7.2 -2.4 -2.4 -2.4 -4.8 -7.2 -2.4 -19.2 0 -9.6 2.4 -16.8 4.8 -7.2 
2.4 -2.4 7.2 -4.8 P
912 5162.4 7.2 4.8 2.4 2.4 4.8 7.2 2.4 16.8 0 9.6 -2.4 19.2 -4.8 7.2 
-2.4 2.4 -7.2 2.4 P
960 5234.4 -7.2 -33.6 7.2 7.2 9.6 2.4 12 0 9.6 -2.4 7.2 -7.2 2.4 -9.6 
0 -7.2 -2.4 -12 -7.2 -4.8 -9.6 -4.8 -12 0 -9.6 4.8 -2.4 2.4 -4.8 7.2 
0 2.4 4.8 4.8 2.4 -4.8 -2.4 -2.4 P
981.6 5210.4 7.2 -2.4 4.8 -7.2 4.8 -9.6 0 -7.2 -4.8 -12 -4.8 -4.8 -7.2 -4.8 P
960 5234.4 33.6 0 P
960 5232 16.8 0 16.8 2.4 P
1044 5234.4 -12 -2.4 -7.2 -9.6 -2.4 -19.2 0 -9.6 2.4 -16.8 7.2 -9.6 12 -4.8 
7.2 0 9.6 4.8 7.2 9.6 2.4 16.8 0 9.6 -2.4 19.2 -7.2 9.6 -9.6 2.4 
-7.2 0 -7.2 -2.4 -4.8 -2.4 -2.4 -7.2 -4.8 -19.2 0 -9.6 4.8 -16.8 2.4 -7.2 
4.8 -2.4 7.2 -4.8 P
1051.2 5162.4 4.8 4.8 4.8 2.4 2.4 7.2 4.8 16.8 0 9.6 -4.8 19.2 -2.4 7.2 
-9.6 4.8 P
1113.6 5234.4 -12 -2.4 -7.2 -9.6 -2.4 -19.2 0 -9.6 2.4 -16.8 7.2 -9.6 12 -4.8 
4.8 0 12 4.8 7.2 9.6 2.4 16.8 0 9.6 -2.4 19.2 -7.2 9.6 -12 2.4 
-4.8 0 S
1113.6 5234.4 -7.2 -2.4 -4.8 -2.4 -2.4 -7.2 -4.8 -19.2 0 -9.6 4.8 -16.8 2.4 -7.2 
4.8 -2.4 7.2 -4.8 P
1118.4 5162.4 7.2 4.8 4.8 2.4 2.4 7.2 4.8 16.8 0 9.6 -4.8 19.2 -2.4 7.2 
-4.8 2.4 -7.2 2.4 P
732 5443.2 -12 -2.4 -4.8 -12 -4.8 -16.8 0 -9.6 4.8 -16.8 4.8 -12 12 -2.4 
7.2 0 9.6 2.4 7.2 12 2.4 16.8 0 9.6 -2.4 16.8 -7.2 12 -9.6 2.4 
-7.2 0 -7.2 -2.4 -4.8 -4.8 -2.4 -7.2 -2.4 -16.8 0 -9.6 2.4 -16.8 2.4 -7.2 
4.8 -4.8 7.2 -2.4 P
739.2 5371.2 7.2 2.4 2.4 4.8 2.4 7.2 4.8 16.8 0 9.6 -4.8 16.8 -2.4 7.2 
-2.4 4.8 -7.2 2.4 P
787.2 5378.4 -4.8 -4.8 4.8 -2.4 2.4 2.4 -2.4 4.8 P
835.2 5443.2 -9.6 -2.4 -7.2 -12 -4.8 -16.8 0 -9.6 4.8 -16.8 7.2 -12 9.6 -2.4 
7.2 0 9.6 2.4 7.2 12 4.8 16.8 0 9.6 -4.8 16.8 -7.2 12 -9.6 2.4 
-7.2 0 -7.2 -2.4 -2.4 -4.8 -4.8 -7.2 -2.4 -16.8 0 -9.6 2.4 -16.8 4.8 -7.2 
2.4 -4.8 7.2 -2.4 P
842.4 5371.2 7.2 2.4 2.4 4.8 4.8 7.2 2.4 16.8 0 9.6 -2.4 16.8 -4.8 7.2 
-2.4 4.8 -7.2 2.4 P
895.2 5428.8 4.8 4.8 12 9.6 0 -72 P
907.2 5440.8 0 -69.6 P
895.2 5371.2 31.2 0 P
974.4 5443.2 -12 -2.4 -4.8 -12 -4.8 -16.8 0 -9.6 4.8 -16.8 4.8 -12 12 -2.4 
7.2 0 9.6 2.4 7.2 12 2.4 16.8 0 9.6 -2.4 16.8 -7.2 12 -9.6 2.4 
-7.2 0 -7.2 -2.4 -4.8 -4.8 -2.4 -7.2 -2.4 -16.8 0 -9.6 2.4 -16.8 2.4 -7.2 
4.8 -4.8 7.2 -2.4 S
981.6 5371.2 7.2 2.4 2.4 4.8 2.4 7.2 4.8 16.8 0 9.6 -4.8 16.8 -2.4 7.2 
-2.4 4.8 -7.2 2.4 P
1044 5443.2 -12 -2.4 -7.2 -12 -2.4 -16.8 0 -9.6 2.4 -16.8 7.2 -12 12 -2.4 
7.2 0 9.6 2.4 7.2 12 2.4 16.8 0 9.6 -2.4 16.8 -7.2 12 -9.6 2.4 
-7.2 0 -7.2 -2.4 -4.8 -4.8 -2.4 -7.2 -4.8 -16.8 0 -9.6 4.8 -16.8 2.4 -7.2 
4.8 -4.8 7.2 -2.4 P
1051.2 5371.2 4.8 2.4 4.8 4.8 2.4 7.2 4.8 16.8 0 9.6 -4.8 16.8 -2.4 7.2 
-4.8 4.8 -4.8 2.4 P
1113.6 5443.2 -12 -2.4 -7.2 -12 -2.4 -16.8 0 -9.6 2.4 -16.8 7.2 -12 12 -2.4 
4.8 0 12 2.4 7.2 12 2.4 16.8 0 9.6 -2.4 16.8 -7.2 12 -12 2.4 
-4.8 0 -7.2 -2.4 -4.8 -4.8 -2.4 -7.2 -4.8 -16.8 0 -9.6 4.8 -16.8 2.4 -7.2 
4.8 -4.8 7.2 -2.4 P
1118.4 5371.2 7.2 2.4 4.8 4.8 2.4 7.2 4.8 16.8 0 9.6 -4.8 16.8 -2.4 7.2 
-4.8 4.8 -7.2 2.4 P
5301.6 3544.8 43.2 0 P
5344.8 3667.2 -43.2 0 P
5301.6 3753.6 43.2 0 P
5344.8 3820.8 -124.8 0 P
5301.6 3876 43.2 0 P
5344.8 3921.6 -43.2 0 P
5301.6 3962.4 43.2 0 P
5344.8 3996 -43.2 0 P
5220 4029.6 124.8 0 P
5344.8 4236 -43.2 0 P
5301.6 4358.4 43.2 0 P
5344.8 4444.8 -43.2 0 P
5220 4512 124.8 0 P
5344.8 4567.2 -43.2 0 P
5301.6 4612.8 43.2 0 P
5344.8 4653.6 -43.2 0 P
5301.6 4689.6 43.2 0 P
5344.8 4720.8 -124.8 0 P
5301.6 4929.6 43.2 0 P
5344.8 5049.6 -43.2 0 P
5301.6 5136 43.2 0 P
5344.8 5203.2 -124.8 0 P
5301.6 5258.4 43.2 0 S
5344.8 5306.4 -43.2 0 P
5301.6 5344.8 43.2 0 P
5344.8 5380.8 -43.2 0 P
5220 5412 124.8 0 P
5344.8 5620.8 -43.2 0 S
255 0 r3
1689.6 3544.8 0 700.8 165.6 0 0 441.6 165.6 0 0 57.6 168 0 0 259.2 
165.6 0 0 45.6 165.6 0 0 26.4 165.6 0 0 -64.8 165.6 0 0 -52.8 
168 0 0 -2.4 165.6 0 0 -129.6 165.6 0 0 72 165.6 0 0 148.8 
165.6 0 0 -14.4 168 0 0 -9.6 165.6 0 0 74.4 165.6 0 0 -45.6 
165.6 0 0 -153.6 168 0 0 -175.2 165.6 0 0 -489.6 165.6 0 0 -688.8 P
5344.8 3544.8 0 0 S
K
2815.2 2080.8 -4.8 -2.4 4.8 -4.8 2.4 4.8 -2.4 2.4 P
2817.6 2056.8 0 -62.4 -2.4 -7.2 -7.2 -2.4 -7.2 0 -4.8 2.4 0 4.8 4.8 2.4 
2.4 -2.4 -2.4 -4.8 P
2815.2 2056.8 0 -62.4 -4.8 -7.2 -2.4 -2.4 P
2803.2 2056.8 14.4 0 P
2846.4 2066.4 2.4 -2.4 -2.4 -2.4 -4.8 2.4 0 2.4 4.8 7.2 2.4 4.8 9.6 2.4 
14.4 0 12 -2.4 2.4 -7.2 0 -9.6 -2.4 -7.2 -12 -4.8 -9.6 0 P
2872.8 2080.8 7.2 -2.4 4.8 -7.2 0 -9.6 -4.8 -7.2 -7.2 -4.8 7.2 -2.4 7.2 -7.2 
2.4 -7.2 0 -9.6 -2.4 -7.2 -2.4 -4.8 -12 -2.4 -14.4 0 -9.6 2.4 -2.4 4.8 
-4.8 7.2 0 2.4 4.8 4.8 2.4 -4.8 -2.4 -2.4 P
2884.8 2042.4 2.4 -9.6 0 -9.6 -2.4 -7.2 -4.8 -4.8 -7.2 -2.4 P
2971.2 2056.8 19.2 -48 P
2973.6 2056.8 16.8 -40.8 P
3012 2056.8 -21.6 -48 -7.2 -14.4 -7.2 -7.2 -4.8 -2.4 -4.8 0 -2.4 2.4 2.4 4.8 
4.8 -4.8 P
2964 2056.8 19.2 0 P
2997.6 2056.8 21.6 0 P
1190.4 2299.2 4154.4 0 0 1245.6 ^ H
1190.4 2920.8 21.6 0 P
1233.6 2920.8 19.2 0 P
1274.4 2920.8 21.6 0 P
1315.2 2920.8 21.6 0 P
1358.4 2920.8 19.2 0 P
1399.2 2920.8 21.6 0 P
1440 2920.8 21.6 0 P
1483.2 2920.8 19.2 0 P
1524 2920.8 0 -19.2 P
1524 2880 0 -19.2 P
1524 2839.2 0 -21.6 P
1524 2798.4 0 -21.6 P
1524 2755.2 0 -19.2 P
1524 2714.4 0 -21.6 P
1524 2673.6 0 -21.6 P
1524 2630.4 0 -19.2 P
1524 2589.6 0 -21.6 P
1524 2548.8 0 -21.6 P
1524 2505.6 0 -19.2 P
1524 2464.8 0 -19.2 P
1524 2424 0 -21.6 P
1524 2383.2 0 -21.6 S
1524 2340 0 -19.2 P
1689.6 2299.2 0 21.6 P
1689.6 2340 0 21.6 P
1689.6 2380.8 0 21.6 P
1689.6 2424 0 19.2 P
1689.6 2464.8 0 21.6 P
1689.6 2505.6 0 21.6 P
1689.6 2548.8 0 19.2 P
1689.6 2589.6 0 19.2 2.4 0 P
1711.2 2608.8 21.6 0 P
1754.4 2608.8 19.2 0 P
1795.2 2608.8 21.6 0 P
1836 2608.8 19.2 0 0 2.4 P
1855.2 2630.4 0 21.6 P
1855.2 2673.6 0 19.2 P
1855.2 2714.4 0 21.6 P
1855.2 2755.2 0 21.6 P
1855.2 2796 0 21.6 P
1855.2 2839.2 0 19.2 P
1855.2 2880 0 21.6 P
1855.2 2920.8 0 21.6 P
1855.2 2964 0 19.2 P
1855.2 3004.8 0 21.6 P
1855.2 3045.6 0 21.6 P
1855.2 3088.8 0 19.2 2.4 0 P
1879.2 3108 19.2 0 P
1920 3108 19.2 0 P
1960.8 3108 21.6 0 P
2001.6 3108 19.2 0 0 -2.4 P
2020.8 3084 0 -19.2 P
2020.8 3043.2 0 -21.6 P
2020.8 3002.4 0 -21.6 P
2020.8 2959.2 0 -19.2 P
2020.8 2918.4 0 -19.2 P
2032.8 2889.6 21.6 0 P
2076 2889.6 19.2 0 P
2116.8 2889.6 21.6 0 P
2157.6 2889.6 21.6 0 P
2188.8 2901.6 0 19.2 P
2188.8 2942.4 0 19.2 P
2188.8 2983.2 0 21.6 P
2198.4 3014.4 21.6 0 P
2241.6 3014.4 19.2 0 P
2282.4 3014.4 21.6 0 P
2323.2 3014.4 21.6 0 P
2354.4 3024 0 21.6 P
2354.4 3067.2 0 19.2 P
2373.6 3086.4 21.6 0 P
2416.8 3086.4 19.2 0 P
2457.6 3086.4 21.6 0 P
2498.4 3086.4 21.6 0 P
2520 3067.2 0 -21.6 P
2520 3026.4 0 -21.6 P
2520 2983.2 0 -19.2 P
2520 2942.4 0 -21.6 P
2520 2901.6 0 -21.6 P
2529.6 2868 21.6 0 P
2570.4 2868 21.6 0 P
2613.6 2868 19.2 0 P
2654.4 2868 21.6 0 P
2685.6 2877.6 0 21.6 P
2685.6 2918.4 0 21.6 S
2685.6 2961.6 0 19.2 P
2685.6 3002.4 0 21.6 P
2685.6 3043.2 0 21.6 P
2685.6 3086.4 0 19.2 P
2685.6 3127.2 21.6 0 P
2726.4 3127.2 21.6 0 P
2769.6 3127.2 19.2 0 P
2810.4 3127.2 21.6 0 P
2851.2 3127.2 0 -19.2 P
2851.2 3086.4 0 -21.6 P
2851.2 3045.6 0 -21.6 P
2851.2 3002.4 0 -19.2 P
2851.2 2961.6 0 -21.6 P
2851.2 2920.8 0 -21.6 P
2851.2 2880 0 -21.6 P
2851.2 2836.8 0 -19.2 P
2851.2 2796 0 -21.6 P
2851.2 2755.2 0 -2.4 21.6 0 P
2892 2752.8 21.6 0 P
2935.2 2752.8 19.2 0 P
2976 2752.8 21.6 0 P
3016.8 2752.8 2.4 0 0 19.2 P
3019.2 2793.6 0 21.6 P
3019.2 2834.4 0 21.6 P
3019.2 2877.6 0 12 7.2 0 P
3045.6 2889.6 21.6 0 P
3088.8 2889.6 19.2 0 P
3129.6 2889.6 21.6 0 P
3170.4 2889.6 14.4 0 0 7.2 P
3184.8 2918.4 0 21.6 P
3184.8 2959.2 0 21.6 P
3184.8 3000 0 21.6 P
3204 3024 19.2 0 P
3244.8 3024 21.6 0 P
3285.6 3024 21.6 0 P
3328.8 3024 19.2 0 P
3350.4 3043.2 0 19.2 P
3350.4 3084 0 21.6 P
3350.4 3124.8 0 21.6 P
3352.8 3163.2 21.6 0 P
3396 3163.2 19.2 0 P
3436.8 3163.2 21.6 0 P
3477.6 3163.2 21.6 0 P
3516 3160.8 0 -19.2 P
3516 3120 0 -21.6 P
3516 3079.2 0 -21.6 P
3516 3036 0 -19.2 P
3516 2995.2 0 -19.2 2.4 0 P
3540 2976 21.6 0 P
3580.8 2976 21.6 0 P
3624 2976 19.2 0 P
3664.8 2976 16.8 0 0 2.4 P
3681.6 3000 0 21.6 P
3681.6 3040.8 0 21.6 P
3681.6 3084 21.6 0 P
3722.4 3084 21.6 0 P
3765.6 3084 19.2 0 P
3806.4 3084 21.6 0 P
3847.2 3084 2.4 0 0 -19.2 P
3849.6 3043.2 0 -19.2 P
3849.6 3002.4 0 -21.6 S
3861.6 2971.2 19.2 0 P
3902.4 2971.2 21.6 0 P
3943.2 2971.2 21.6 0 P
3984 2971.2 21.6 0 P
4015.2 2983.2 0 21.6 P
4015.2 3026.4 0 19.2 P
4015.2 3067.2 0 21.6 P
4015.2 3108 0 4.8 14.4 0 P
4051.2 3112.8 21.6 0 P
4092 3112.8 21.6 0 P
4135.2 3112.8 19.2 0 P
4176 3112.8 4.8 0 0 -14.4 P
4180.8 3076.8 0 -19.2 P
4180.8 3036 0 -19.2 P
4180.8 2995.2 0 -21.6 P
4180.8 2954.4 0 -21.6 P
4180.8 2911.2 0 -19.2 P
4190.4 2880 21.6 0 P
4231.2 2880 21.6 0 P
4274.4 2880 19.2 0 P
4315.2 2880 21.6 0 P
4346.4 2889.6 0 21.6 P
4346.4 2930.4 0 21.6 P
4346.4 2973.6 0 19.2 P
4346.4 3014.4 0 19.2 P
4356 3045.6 21.6 0 P
4399.2 3045.6 19.2 0 P
4440 3045.6 21.6 0 P
4480.8 3045.6 21.6 0 P
4514.4 3036 0 -21.6 P
4514.4 2995.2 0 -21.6 P
4514.4 2952 0 -19.2 P
4514.4 2911.2 0 -21.6 P
4528.8 2884.8 19.2 0 P
4569.6 2884.8 21.6 0 P
4610.4 2884.8 21.6 0 P
4653.6 2884.8 19.2 0 P
4680 2870.4 0 -21.6 S
4680 2827.2 0 -19.2 P
4680 2786.4 0 -19.2 P
4680 2745.6 0 -21.6 P
4684.8 2709.6 19.2 0 P
4725.6 2709.6 21.6 0 P
4766.4 2709.6 21.6 0 P
4809.6 2709.6 19.2 0 P
4845.6 2704.8 0 -21.6 P
4845.6 2661.6 0 -19.2 P
4845.6 2620.8 0 -21.6 P
4845.6 2580 0 -21.6 P
4845.6 2536.8 0 -19.2 P
4845.6 2496 0 -21.6 P
4845.6 2455.2 0 -21.6 P
4845.6 2412 0 -19.2 P
4845.6 2371.2 0 -19.2 P
4845.6 2330.4 0 -21.6 P
5176.8 2308.8 0 21.6 P
5176.8 2352 0 19.2 P
5176.8 2392.8 0 21.6 P
5176.8 2433.6 0 21.6 P
5176.8 2474.4 0 21.6 P
5176.8 2517.6 0 19.2 P
5176.8 2558.4 0 21.6 P
5176.8 2599.2 0 21.6 P
5176.8 2642.4 0 19.2 P
5176.8 2683.2 0 21.6 P
5176.8 2724 0 21.6 P
5176.8 2767.2 0 19.2 P
5176.8 2808 0 21.6 P
5176.8 2848.8 0 21.6 P
5176.8 2889.6 0 21.6 P
5188.8 2920.8 19.2 0 P
5229.6 2920.8 21.6 0 P
5270.4 2920.8 21.6 0 P
5311.2 2920.8 21.6 0 P
5342.4 2911.2 0 -19.2 P
5342.4 2870.4 0 -21.6 P
5342.4 2829.6 0 -21.6 P
5342.4 2786.4 0 -19.2 P
5342.4 2745.6 0 -21.6 P
5342.4 2704.8 0 -21.6 P
5342.4 2661.6 0 -19.2 P
5342.4 2620.8 0 -21.6 P
5342.4 2580 0 -21.6 P
5342.4 2539.2 0 -21.6 P
5342.4 2496 0 -19.2 P
5342.4 2455.2 0 -21.6 P
5342.4 2414.4 0 -21.6 P
5342.4 2371.2 0 -19.2 P
5342.4 2330.4 0 -21.6 P
1190.4 2299.2 0 124.8 P
1329.6 2340 0 -40.8 P
1468.8 2299.2 0 40.8 P
1605.6 2340 0 -40.8 P
1744.8 2299.2 0 40.8 P
1884 2424 0 -124.8 P
2020.8 2299.2 0 40.8 P
2160 2340 0 -40.8 P
2299.2 2299.2 0 40.8 P
2436 2340 0 -40.8 P
2575.2 2299.2 0 124.8 P
2714.4 2340 0 -40.8 P
2853.6 2299.2 0 40.8 S
2990.4 2340 0 -40.8 P
3129.6 2299.2 0 40.8 P
3266.4 2424 0 -124.8 P
3405.6 2299.2 0 40.8 P
3544.8 2340 0 -40.8 P
3681.6 2299.2 0 40.8 P
3820.8 2340 0 -40.8 P
3960 2299.2 0 124.8 P
4099.2 2340 0 -40.8 P
4236 2299.2 0 40.8 P
4375.2 2340 0 -40.8 P
4514.4 2299.2 0 40.8 P
4651.2 2424 0 -124.8 P
4790.4 2299.2 0 40.8 P
4929.6 2340 0 -40.8 P
5066.4 2299.2 0 40.8 P
5205.6 2340 0 -40.8 P
5344.8 2299.2 0 124.8 P
1125.6 2188.8 62.4 0 P
1255.2 2220 -4.8 -2.4 4.8 -4.8 2.4 4.8 0 2.4 -2.4 7.2 -7.2 2.4 -12 0 
-9.6 -2.4 -7.2 -7.2 -7.2 -21.6 0 -19.2 4.8 -12 7.2 -4.8 9.6 -4.8 7.2 0 
9.6 4.8 7.2 4.8 2.4 12 0 2.4 -2.4 12 -7.2 4.8 -9.6 4.8 -4.8 0 
-9.6 -4.8 -7.2 -4.8 -2.4 -12 P
1236 2229.6 -7.2 -2.4 -9.6 -14.4 -2.4 -14.4 0 -19.2 2.4 -12 14.4 -9.6 P
1240.8 2157.6 14.4 9.6 2.4 12 0 2.4 -2.4 12 -14.4 9.6 P
1816.8 2188.8 62.4 0 P
1936.8 2224.8 0 -67.2 P
1939.2 2229.6 0 -72 P
1939.2 2229.6 -38.4 -50.4 55.2 0 P
1924.8 2157.6 24 0 P
2510.4 2188.8 62.4 0 P
2599.2 2217.6 4.8 -4.8 -4.8 -2.4 -2.4 2.4 0 4.8 2.4 7.2 4.8 2.4 9.6 2.4 
14.4 0 9.6 -2.4 4.8 -2.4 2.4 -7.2 0 -7.2 -2.4 -7.2 -12 -7.2 -16.8 -7.2 
-7.2 -2.4 -7.2 -7.2 -2.4 -12 0 -9.6 P
2628 2229.6 7.2 -2.4 2.4 -2.4 4.8 -7.2 0 -7.2 -4.8 -7.2 -9.6 -7.2 -14.4 -7.2 P
2596.8 2164.8 2.4 2.4 7.2 0 16.8 -4.8 12 0 7.2 2.4 2.4 2.4 P
2606.4 2167.2 16.8 -9.6 14.4 0 4.8 4.8 2.4 4.8 0 7.2 S
3264 2229.6 -9.6 -2.4 -7.2 -9.6 -4.8 -19.2 0 -9.6 4.8 -16.8 7.2 -9.6 9.6 -4.8 
7.2 0 9.6 4.8 7.2 9.6 4.8 16.8 0 9.6 -4.8 19.2 -7.2 9.6 -9.6 2.4 
-7.2 0 -7.2 -2.4 -2.4 -2.4 -4.8 -7.2 -2.4 -19.2 0 -9.6 2.4 -16.8 4.8 -7.2 
2.4 -2.4 7.2 -4.8 P
3271.2 2157.6 7.2 4.8 2.4 2.4 4.8 7.2 2.4 16.8 0 9.6 -2.4 19.2 -4.8 7.2 
-2.4 2.4 -7.2 2.4 P
3938.4 2217.6 4.8 -4.8 -4.8 -2.4 -2.4 2.4 0 4.8 2.4 7.2 4.8 2.4 9.6 2.4 
14.4 0 9.6 -2.4 2.4 -2.4 4.8 -7.2 0 -7.2 -4.8 -7.2 -9.6 -7.2 -16.8 -7.2 
-7.2 -2.4 -7.2 -7.2 -2.4 -12 0 -9.6 P
3967.2 2229.6 7.2 -2.4 2.4 -2.4 2.4 -7.2 0 -7.2 -2.4 -7.2 -9.6 -7.2 -14.4 -7.2 P
3936 2164.8 2.4 2.4 7.2 0 16.8 -4.8 12 0 9.6 4.8 P
3945.6 2167.2 16.8 -9.6 14.4 0 2.4 4.8 4.8 4.8 0 7.2 P
4658.4 2224.8 0 -67.2 P
4660.8 2229.6 0 -72 P
4660.8 2229.6 -36 -50.4 55.2 0 P
4648.8 2157.6 24 0 P
5361.6 2220 -4.8 -2.4 4.8 -4.8 2.4 4.8 0 2.4 -2.4 7.2 -7.2 2.4 -12 0 
-9.6 -2.4 -7.2 -7.2 -7.2 -21.6 0 -19.2 4.8 -12 7.2 -4.8 9.6 -4.8 7.2 0 
9.6 4.8 7.2 4.8 4.8 12 0 2.4 -4.8 12 -7.2 4.8 -9.6 4.8 -4.8 0 
-9.6 -4.8 -7.2 -4.8 -2.4 -12 P
5342.4 2229.6 -4.8 -2.4 -7.2 -7.2 -4.8 -7.2 -2.4 -14.4 0 -19.2 2.4 -12 14.4 -9.6 P
5347.2 2157.6 14.4 9.6 2.4 12 0 2.4 -2.4 12 -14.4 9.6 P
1190.4 3420 0 124.8 S
1329.6 3544.8 0 -40.8 P
1468.8 3504 0 40.8 P
1605.6 3544.8 0 -40.8 P
1744.8 3504 0 40.8 P
1884 3544.8 0 -124.8 P
2020.8 3504 0 40.8 P
2160 3544.8 0 -40.8 P
2299.2 3504 0 40.8 P
2436 3544.8 0 -40.8 P
2575.2 3420 0 124.8 P
2714.4 3544.8 0 -40.8 P
2853.6 3504 0 40.8 P
2990.4 3544.8 0 -40.8 P
3129.6 3504 0 40.8 P
3266.4 3544.8 0 -124.8 P
3405.6 3504 0 40.8 P
3544.8 3544.8 0 -40.8 P
3681.6 3504 0 40.8 P
3820.8 3544.8 0 -40.8 P
3960 3420 0 124.8 P
4099.2 3544.8 0 -40.8 P
4236 3504 0 40.8 P
4375.2 3544.8 0 -40.8 P
4514.4 3504 0 40.8 P
4651.2 3544.8 0 -124.8 P
4790.4 3504 0 40.8 P
4929.6 3544.8 0 -40.8 P
5066.4 3504 0 40.8 P
5205.6 3544.8 0 -40.8 P
5344.8 3420 0 124.8 P
1190.4 2299.2 124.8 0 P
1233.6 2335.2 -43.2 0 P
1190.4 2368.8 43.2 0 P
1233.6 2400 -43.2 0 P
1190.4 2433.6 43.2 0 P
1315.2 2462.4 -124.8 0 P
1190.4 2493.6 43.2 0 P
1233.6 2520 -43.2 0 P
1190.4 2548.8 43.2 0 P
1233.6 2575.2 -43.2 0 P
1190.4 2601.6 124.8 0 P
1233.6 2628 -43.2 0 P
1190.4 2652 43.2 0 P
1233.6 2676 -43.2 0 P
1190.4 2697.6 43.2 0 P
1315.2 2721.6 -124.8 0 P
1190.4 2743.2 43.2 0 P
1233.6 2764.8 -43.2 0 P
1190.4 2786.4 43.2 0 P
1233.6 2808 -43.2 0 P
1190.4 2827.2 124.8 0 P
1233.6 2846.4 -43.2 0 P
1190.4 2865.6 43.2 0 P
1233.6 2884.8 -43.2 0 P
1190.4 2904 43.2 0 P
1315.2 2920.8 -124.8 0 P
1190.4 3086.4 43.2 0 P
1233.6 3223.2 -43.2 0 P
1190.4 3343.2 43.2 0 P
1233.6 3451.2 -43.2 0 P
1190.4 3544.8 124.8 0 P
1008 2330.4 -9.6 -2.4 -7.2 -12 -4.8 -16.8 0 -9.6 4.8 -19.2 7.2 -9.6 9.6 -2.4 
7.2 0 9.6 2.4 7.2 9.6 4.8 19.2 0 9.6 -4.8 16.8 -7.2 12 -9.6 2.4 
-7.2 0 S
1008 2330.4 -7.2 -2.4 -2.4 -4.8 -4.8 -7.2 -2.4 -16.8 0 -9.6 2.4 -19.2 4.8 -4.8 
2.4 -4.8 7.2 -2.4 P
1015.2 2258.4 7.2 2.4 2.4 4.8 4.8 4.8 2.4 19.2 0 9.6 -2.4 16.8 -4.8 7.2 
-2.4 4.8 -7.2 2.4 P
1063.2 2265.6 -2.4 -4.8 2.4 -2.4 4.8 2.4 -4.8 4.8 P
1099.2 2330.4 -7.2 -33.6 7.2 4.8 9.6 4.8 9.6 0 12 -4.8 7.2 -4.8 2.4 -12 
0 -7.2 -2.4 -9.6 -7.2 -7.2 -12 -2.4 -9.6 0 -9.6 2.4 -4.8 4.8 -2.4 4.8 
0 4.8 2.4 2.4 4.8 -2.4 -4.8 -4.8 P
1118.4 2306.4 14.4 -9.6 4.8 -12 0 -7.2 -4.8 -9.6 -7.2 -7.2 -7.2 -2.4 P
1099.2 2330.4 33.6 0 P
1099.2 2328 16.8 0 16.8 2.4 P
1008 2632.8 -9.6 -2.4 -7.2 -12 -4.8 -16.8 0 -9.6 4.8 -19.2 7.2 -9.6 9.6 -2.4 
7.2 0 9.6 2.4 7.2 9.6 4.8 19.2 0 9.6 -4.8 16.8 -7.2 12 -9.6 2.4 
-7.2 0 -7.2 -2.4 -2.4 -4.8 -4.8 -7.2 -2.4 -16.8 0 -9.6 2.4 -19.2 4.8 -4.8 
2.4 -4.8 7.2 -2.4 P
1015.2 2560.8 7.2 2.4 2.4 4.8 4.8 4.8 2.4 19.2 0 9.6 -2.4 16.8 -4.8 7.2 
-2.4 4.8 -7.2 2.4 P
1063.2 2568 -2.4 -4.8 2.4 -2.4 4.8 2.4 -4.8 4.8 P
1092 2632.8 0 -21.6 P
1092 2618.4 2.4 7.2 7.2 7.2 7.2 0 16.8 -9.6 7.2 0 4.8 2.4 2.4 7.2 P
1094.4 2625.6 7.2 4.8 7.2 0 16.8 -7.2 P
1140 2632.8 0 -9.6 -2.4 -12 -14.4 -16.8 -4.8 -7.2 -2.4 -9.6 0 -16.8 P
1137.6 2611.2 -19.2 -16.8 -2.4 -7.2 -4.8 -9.6 0 -16.8 P
998.4 2940 7.2 2.4 9.6 9.6 0 -72 S
1012.8 2949.6 0 -69.6 P
998.4 2880 31.2 0 P
1063.2 2887.2 -2.4 -2.4 2.4 -4.8 4.8 4.8 -4.8 2.4 P
1111.2 2952 -9.6 -2.4 -7.2 -9.6 -2.4 -16.8 0 -12 2.4 -16.8 7.2 -9.6 9.6 -4.8 
7.2 0 12 4.8 7.2 9.6 2.4 16.8 0 12 -2.4 16.8 -7.2 9.6 -12 2.4 
-7.2 0 -9.6 -4.8 -2.4 -7.2 -4.8 -16.8 0 -12 4.8 -16.8 2.4 -7.2 4.8 -2.4 
4.8 -4.8 P
1118.4 2880 7.2 4.8 4.8 2.4 2.4 7.2 4.8 16.8 0 12 -4.8 16.8 -2.4 7.2 
-4.8 2.4 -7.2 2.4 P
991.2 3561.6 2.4 -2.4 -2.4 -4.8 -4.8 4.8 0 2.4 4.8 7.2 2.4 4.8 12 2.4 
12 0 12 -2.4 2.4 -4.8 4.8 -7.2 0 -7.2 -4.8 -7.2 -9.6 -4.8 -16.8 -7.2 
-7.2 -4.8 -7.2 -7.2 -4.8 -9.6 0 -9.6 P
1017.6 3576 7.2 -2.4 4.8 -4.8 2.4 -7.2 0 -7.2 -2.4 -7.2 -12 -4.8 -12 -7.2 P
986.4 3511.2 4.8 2.4 7.2 0 16.8 -7.2 9.6 0 7.2 4.8 4.8 2.4 S
998.4 3513.6 16.8 -9.6 14.4 0 2.4 2.4 4.8 7.2 0 7.2 P
1063.2 3511.2 -2.4 -4.8 2.4 -2.4 4.8 2.4 -4.8 4.8 P
1111.2 3576 -9.6 -2.4 -7.2 -12 -2.4 -16.8 0 -9.6 2.4 -19.2 7.2 -9.6 9.6 -2.4 
7.2 0 12 2.4 7.2 9.6 2.4 19.2 0 9.6 -2.4 16.8 -7.2 12 -12 2.4 
-7.2 0 -4.8 -2.4 -4.8 -4.8 -2.4 -7.2 -4.8 -16.8 0 -9.6 4.8 -19.2 2.4 -4.8 
4.8 -4.8 4.8 -2.4 P
1118.4 3504 7.2 2.4 4.8 4.8 2.4 4.8 4.8 19.2 0 9.6 -4.8 16.8 -2.4 7.2 
-4.8 4.8 -7.2 2.4 P
5220 2299.2 124.8 0 P
5344.8 2335.2 -43.2 0 P
5301.6 2368.8 43.2 0 P
5344.8 2400 -43.2 0 P
5301.6 2433.6 43.2 0 P
5344.8 2462.4 -124.8 0 P
5301.6 2493.6 43.2 0 P
5344.8 2520 -43.2 0 P
5301.6 2548.8 43.2 0 P
5344.8 2575.2 -43.2 0 P
5220 2601.6 124.8 0 P
5344.8 2628 -43.2 0 P
5301.6 2652 43.2 0 P
5344.8 2676 -43.2 0 P
5301.6 2697.6 43.2 0 P
5344.8 2721.6 -124.8 0 P
5301.6 2743.2 43.2 0 P
5344.8 2764.8 -43.2 0 P
5301.6 2786.4 43.2 0 P
5344.8 2808 -43.2 0 P
5220 2827.2 124.8 0 P
5344.8 2846.4 -43.2 0 P
5301.6 2865.6 43.2 0 P
5344.8 2884.8 -43.2 0 P
5301.6 2904 43.2 0 P
5344.8 2920.8 -124.8 0 P
5301.6 3086.4 43.2 0 P
5344.8 3223.2 -43.2 0 P
5301.6 3343.2 43.2 0 P
5344.8 3451.2 -43.2 0 P
5220 3544.8 124.8 0 S
255 0 r3
1190.4 2920.8 21.6 0 P
1233.6 2920.8 19.2 0 P
1274.4 2920.8 21.6 0 P
1315.2 2920.8 21.6 0 P
1358.4 2920.8 19.2 0 P
1399.2 2920.8 21.6 0 P
1440 2920.8 21.6 0 P
1483.2 2920.8 19.2 0 P
1524 2920.8 21.6 0 P
1564.8 2920.8 21.6 0 P
1605.6 2920.8 21.6 0 P
1648.8 2920.8 19.2 0 P
1689.6 2920.8 0 21.6 P
1689.6 2964 0 19.2 P
1689.6 3004.8 0 21.6 P
1689.6 3045.6 0 21.6 P
1689.6 3088.8 0 19.2 P
1689.6 3129.6 0 21.6 P
1689.6 3170.4 0 21.6 P
1689.6 3213.6 0 19.2 P
1689.6 3254.4 0 21.6 P
1689.6 3295.2 0 21.6 P
1689.6 3338.4 0 19.2 P
1689.6 3379.2 0 19.2 P
1689.6 3420 0 21.6 P
1689.6 3460.8 0 21.6 P
1689.6 3504 0 19.2 P
1855.2 3544.8 0 -21.6 P
1855.2 3504 0 -21.6 P
1855.2 3460.8 0 -19.2 P
1855.2 3420 0 -21.6 P
1855.2 3379.2 0 -21.6 P
1855.2 3336 0 -19.2 P
1855.2 3295.2 0 -19.2 P
1855.2 3254.4 0 -21.6 P
1857.6 3213.6 21.6 0 P
1898.4 3213.6 21.6 0 P
1941.6 3213.6 19.2 0 P
1982.4 3213.6 21.6 0 P
2020.8 3216 0 21.6 P
2020.8 3256.8 0 21.6 P
2020.8 3300 0 19.2 P
2020.8 3340.8 0 21.6 P
2020.8 3381.6 0 21.6 P
2020.8 3424.8 0 19.2 P
2020.8 3465.6 0 21.6 P
2020.8 3506.4 0 21.6 P
2188.8 3540 0 -19.2 P
2188.8 3499.2 0 -21.6 P
2188.8 3458.4 0 -21.6 P
2188.8 3417.6 0 -21.6 P
2188.8 3374.4 0 -19.2 P
2188.8 3333.6 0 -21.6 P
2188.8 3292.8 0 -21.6 P
2188.8 3249.6 0 -19.2 P
2188.8 3208.8 0 -21.6 P
2188.8 3168 0 -21.6 P
2188.8 3124.8 0 -12 7.2 0 P
2217.6 3112.8 19.2 0 P
2258.4 3112.8 21.6 0 P
2299.2 3112.8 21.6 0 P
2342.4 3112.8 12 0 0 -7.2 P
2354.4 3084 0 -21.6 S
2354.4 3043.2 0 -2.4 19.2 0 P
2395.2 3040.8 19.2 0 P
2436 3040.8 19.2 0 P
2476.8 3040.8 21.6 0 P
2517.6 3040.8 2.4 0 0 -19.2 P
2524.8 3004.8 21.6 0 P
2565.6 3004.8 21.6 0 P
2608.8 3004.8 19.2 0 P
2649.6 3004.8 21.6 0 P
2685.6 3002.4 0 -21.6 P
2697.6 2971.2 21.6 0 P
2738.4 2971.2 21.6 0 P
2781.6 2971.2 19.2 0 P
2822.4 2971.2 21.6 0 P
2851.2 2959.2 0 -19.2 P
2851.2 2918.4 0 -21.6 P
2851.2 2877.6 0 -21.6 P
2851.2 2834.4 0 -19.2 P
2872.8 2812.8 19.2 0 P
2913.6 2812.8 21.6 0 P
2954.4 2812.8 21.6 0 P
2997.6 2812.8 19.2 0 P
3019.2 2793.6 0 -21.6 P
3019.2 2752.8 0 -21.6 P
3019.2 2709.6 0 -19.2 P
3019.2 2668.8 0 -21.6 P
3019.2 2628 0 -21.6 P
3033.6 2601.6 21.6 0 P
3076.8 2601.6 19.2 0 P
3117.6 2601.6 19.2 0 P
3158.4 2601.6 21.6 0 P
3184.8 2618.4 0 19.2 P
3184.8 2659.2 0 21.6 P
3184.8 2700 0 21.6 P
3184.8 2743.2 0 19.2 P
3184.8 2784 0 19.2 P
3184.8 2824.8 0 21.6 P
3184.8 2865.6 0 4.8 16.8 0 P
3220.8 2870.4 21.6 0 P
3264 2870.4 19.2 0 P
3304.8 2870.4 21.6 0 P
3345.6 2870.4 4.8 0 0 -16.8 P
3350.4 2834.4 0 -21.6 P
3350.4 2791.2 0 -19.2 P
3350.4 2750.4 0 -21.6 P
3362.4 2719.2 19.2 0 P
3403.2 2719.2 19.2 0 P
3444 2719.2 21.6 0 P
3484.8 2719.2 21.6 0 P
3516 2709.6 0 -21.6 P
3516 2666.4 0 -19.2 P
3516 2625.6 0 -21.6 P
3516 2584.8 0 -21.6 P
3516 2541.6 0 -7.2 12 0 P
3549.6 2534.4 21.6 0 P
3590.4 2534.4 21.6 0 P
3633.6 2534.4 19.2 0 P
3674.4 2534.4 7.2 0 0 12 P
3681.6 2568 0 21.6 P
3681.6 2608.8 0 21.6 P
3681.6 2649.6 0 21.6 S
3681.6 2692.8 0 19.2 P
3681.6 2733.6 0 21.6 P
3681.6 2774.4 0 21.6 P
3681.6 2817.6 0 19.2 P
3681.6 2858.4 0 14.4 9.6 0 P
3710.4 2872.8 21.6 0 P
3751.2 2872.8 21.6 0 P
3794.4 2872.8 19.2 0 P
3835.2 2872.8 14.4 0 0 7.2 P
3849.6 2899.2 0 21.6 P
3849.6 2942.4 0 19.2 P
3849.6 2983.2 0 21.6 P
3849.6 3024 0 21.6 P
3849.6 3064.8 0 21.6 P
3849.6 3108 0 9.6 12 0 P
3880.8 3117.6 21.6 0 P
3924 3117.6 19.2 0 P
3964.8 3117.6 21.6 0 P
4005.6 3117.6 9.6 0 0 -12 P
4015.2 3084 0 -21.6 P
4015.2 3043.2 0 -21.6 P
4015.2 3000 0 -19.2 P
4015.2 2959.2 0 -21.6 P
4027.2 2930.4 19.2 0 P
4068 2930.4 21.6 0 P
4108.8 2930.4 21.6 0 P
4152 2930.4 19.2 0 P
4185.6 2937.6 21.6 0 P
4226.4 2937.6 21.6 0 P
4269.6 2937.6 19.2 0 P
4310.4 2937.6 21.6 0 P
4346.4 2942.4 0 19.2 P
4346.4 2983.2 0 19.2 P
4358.4 3014.4 19.2 0 P
4399.2 3014.4 21.6 0 P
4440 3014.4 21.6 0 P
4483.2 3014.4 19.2 0 P
4514.4 3002.4 0 -19.2 P
4514.4 2961.6 0 -21.6 P
4514.4 2920.8 0 -21.6 P
4514.4 2877.6 0 -4.8 14.4 0 P
4548 2872.8 21.6 0 P
4591.2 2872.8 19.2 0 P
4632 2872.8 21.6 0 P
4672.8 2872.8 7.2 0 0 14.4 P
4680 2908.8 0 21.6 P
4680 2949.6 0 21.6 P
4680 2992.8 0 19.2 P
4680 3033.6 0 19.2 P
4680 3074.4 0 21.6 P
4680 3115.2 0 21.6 P
4680 3158.4 0 19.2 P
4680 3199.2 0 21.6 P
4680 3240 0 21.6 P
4680 3283.2 0 19.2 P
4680 3324 0 21.6 P
4680 3364.8 0 19.2 2.4 0 P
4704 3384 19.2 0 P
4744.8 3384 21.6 0 P
4785.6 3384 21.6 0 P
4828.8 3384 16.8 0 0 -4.8 S
4845.6 3360 0 -21.6 P
4845.6 3316.8 0 -19.2 P
4845.6 3276 0 -21.6 P
4845.6 3235.2 0 -21.6 P
4845.6 3192 0 -19.2 P
4845.6 3151.2 0 -19.2 P
4845.6 3110.4 0 -21.6 P
4845.6 3069.6 0 -21.6 P
4845.6 3026.4 0 -19.2 P
4845.6 2985.6 0 -21.6 P
4845.6 2944.8 0 -21.6 P
4845.6 2901.6 0 -19.2 P
4845.6 2860.8 0 -21.6 P
4845.6 2820 0 -21.6 P
4845.6 2776.8 0 -19.2 S
4845.6 2736 0 -19.2 P
4845.6 2695.2 0 -21.6 P
4845.6 2654.4 0 -21.6 P
4845.6 2611.2 0 -19.2 P
4845.6 2570.4 0 -21.6 P
4845.6 2529.6 0 -21.6 P
4845.6 2486.4 0 -19.2 P
4845.6 2445.6 0 -21.6 P
4845.6 2404.8 0 -21.6 P
4845.6 2361.6 0 -19.2 P
4845.6 2320.8 0 -19.2 P
5176.8 2318.4 0 21.6 P
5176.8 2359.2 0 21.6 P
5176.8 2402.4 0 19.2 P
5176.8 2443.2 0 21.6 P
5176.8 2484 0 21.6 P
5176.8 2524.8 0 21.6 P
5176.8 2568 0 19.2 P
5176.8 2608.8 0 21.6 P
5176.8 2649.6 0 21.6 P
5176.8 2692.8 0 19.2 P
5176.8 2733.6 0 21.6 P
5176.8 2774.4 0 21.6 P
5176.8 2817.6 0 19.2 P
5176.8 2858.4 0 21.6 P
5176.8 2899.2 0 21.6 P
5196 2920.8 21.6 0 P
5239.2 2920.8 19.2 0 P
5280 2920.8 21.6 0 P
5320.8 2920.8 21.6 0 P
5342.4 2904 0 -21.6 P
5342.4 2860.8 0 -19.2 P
5342.4 2820 0 -21.6 P
5342.4 2779.2 0 -21.6 P
5342.4 2736 0 -19.2 P
5342.4 2695.2 0 -21.6 P
5342.4 2654.4 0 -21.6 P
5342.4 2611.2 0 -19.2 P
5342.4 2570.4 0 -21.6 P
5342.4 2529.6 0 -21.6 P
5342.4 2488.8 0 -21.6 P
5342.4 2445.6 0 -19.2 P
5342.4 2404.8 0 -21.6 P
5342.4 2364 0 -21.6 P
5342.4 2320.8 0 -19.2 S
cleartomark end end pagesave restore
 showpage
%%PageTrailer
%%Trailer
%%Pages: 1
%%Trailer
cleartomark
countdictstack
exch sub { end } repeat
restore
%%EOF
