%!PS-Adobe-2.0 EPSF-2.0
%%BoundingBox:  0 0 567 384
%%Title: /home/carrazza/Desktop/yrplots/gg_8tev_as_0118_b.eps: c1_n2
%%Creator: ROOT Version 5.34/07
%%CreationDate: Thu Jun  6 16:50:34 2013
%%EndComments
%%BeginProlog
80 dict begin
/s {stroke} def /l {lineto} def /m {moveto} def /t {translate} def
/r {rotate} def /rl {roll}  def /R {repeat} def
/d {rlineto} def /rm {rmoveto} def /gr {grestore} def /f {eofill} def
/c {setrgbcolor} def /black {0 setgray} def /sd {setdash} def
/cl {closepath} def /sf {scalefont setfont} def /lw {setlinewidth} def
/box {m dup 0 exch d exch 0 d 0 exch neg d cl} def
/NC{systemdict begin initclip end}def/C{NC box clip newpath}def
/bl {box s} def /bf {box f} def /Y { 0 exch d} def /X { 0 d} def 
/K {{pop pop 0 moveto} exch kshow} bind def
/ita {/ang 15 def gsave [1 0 ang dup sin exch cos div 1 0 0] concat} def 
/mp {newpath /y exch def /x exch def} def
/side {[w .77 mul w .23 mul] .385 w mul sd w 0 l currentpoint t -144 r} def
/mr {mp x y w2 0 360 arc} def /m24 {mr s} def /m20 {mr f} def
/mb {mp x y w2 add m w2 neg 0 d 0 w neg d w 0 d 0 w d cl} def
/mt {mp x y w2 add m w2 neg w neg d w 0 d cl} def
/m21 {mb f} def /m25 {mb s} def /m22 {mt f} def /m26{mt s} def
/m23 {mp x y w2 sub m w2 w d w neg 0 d cl f} def
/m27 {mp x y w2 add m w3 neg w2 neg d w3 w2 neg d w3 w2 d cl s} def
/m28 {mp x w2 sub y w2 sub w3 add m w3 0 d  0 w3 neg d w3 0 d 0 w3 d w3 0 d  0 w3 d w3 neg 0 d 0 w3 d w3 neg 0 d 0 w3 neg d w3 neg 0 d cl s } def
/m29 {mp gsave x w2 sub y w2 add w3 sub m currentpoint t 4 {side} repeat cl fill gr} def
/m30 {mp gsave x w2 sub y w2 add w3 sub m currentpoint t 4 {side} repeat cl s gr} def
/m31 {mp x y w2 sub m 0 w d x w2 sub y m w 0 d x w2 sub y w2 add m w w neg d x w2 sub y w2 sub m w w d s} def
/m32 {mp x y w2 sub m w2 w d w neg 0 d cl s} def
/m33 {mp x y w2 add m w3 neg w2 neg d w3 w2 neg d w3 w2 d cl f} def
/m34 {mp x w2 sub y w2 sub w3 add m w3 0 d  0 w3 neg d w3 0 d 0 w3 d w3 0 d  0 w3 d w3 neg 0 d 0 w3 d w3 neg 0 d 0 w3 neg d w3 neg 0 d cl f } def
/m2 {mp x y w2 sub m 0 w d x w2 sub y m w 0 d s} def
/m5 {mp x w2 sub y w2 sub m w w d x w2 sub y w2 add m w w neg d s} def
/reEncode {exch findfont dup length dict begin {1 index /FID eq  {pop pop} {def} ifelse } forall /Encoding exch def currentdict end dup /FontName get exch definefont pop } def [/Times-Bold /Times-Italic /Times-BoldItalic /Helvetica /Helvetica-Oblique
 /Helvetica-Bold /Helvetica-BoldOblique /Courier /Courier-Oblique /Courier-Bold /Courier-BoldOblique /Times-Roman /AvantGarde-Book /AvantGarde-BookOblique /AvantGarde-Demi /AvantGarde-DemiOblique /Bookman-Demi /Bookman-DemiItalic /Bookman-Light
 /Bookman-LightItalic /Helvetica-Narrow /Helvetica-Narrow-Bold /Helvetica-Narrow-BoldOblique /Helvetica-Narrow-Oblique /NewCenturySchlbk-Roman /NewCenturySchlbk-Bold /NewCenturySchlbk-BoldItalic /NewCenturySchlbk-Italic /Palatino-Bold
 /Palatino-BoldItalic /Palatino-Italic /Palatino-Roman ] {ISOLatin1Encoding reEncode } forall
%%EndProlog
%%BeginSetup
%%EndSetup
newpath  gsave  .25 .25 scale  gsave  0 0 t black[  ] 0 sd 3 lw 1 1 1 c 2268 1538 0 0 bf black 1 1 1 c 1814 1230 227 154 bf black 1814 1230 227 154 bl 1 1 1 c 1814 1230 227 154 bf black 1814 1230 227 154 bl 227 154 m 1814 X s
 gsave  2268 1538 0 0 C 1143.63 16.2911 t 0 r /Helvetica findfont 48.8732 sf 0 0 m (X) show NC gr 
 gsave  2268 1538 0 0 C 1088.24 35.8403 t 0 r /Helvetica findfont 71.6807 sf 0 0 m (M) show NC gr  437 172 m -18 Y s 559 172 m -18 Y s 647 172 m -18 Y s 714 172 m -18 Y s 769 172 m -18 Y s 816 172 m -18 Y s 856 172 m -18 Y s 892 172 m -18 Y s 924 191
 m -37 Y s
 gsave  2268 1538 0 0 C 948.14 91.23 t 0 r /Helvetica findfont 48.8732 sf 0 0 m (2) show NC gr 
 gsave  2268 1538 0 0 C 869.943 58.6478 t 0 r /Helvetica findfont 71.6807 sf 0 0 m (10) show NC gr  1134 172 m -18 Y s 1257 172 m -18 Y s 1344 172 m -18 Y s 1411 172 m -18 Y s 1467 172 m -18 Y s 1513 172 m -18 Y s 1554 172 m -18 Y s 1589 172 m -18 Y
 s 1621 191 m -37 Y s
 gsave  2268 1538 0 0 C 1645.4 94.4882 t 0 r /Helvetica findfont 48.8732 sf 0 0 m (3) show NC gr 
 gsave  2268 1538 0 0 C 1567.2 58.6478 t 0 r /Helvetica findfont 71.6807 sf 0 0 m (10) show NC gr  1831 172 m -18 Y s 1954 172 m -18 Y s 2041 172 m -18 Y s 227 1384 m 1814 X s 437 1366 m 18 Y s 559 1366 m 18 Y s 647 1366 m 18 Y s 714 1366 m 18 Y s
 769 1366 m 18 Y s 816 1366 m 18 Y s 856 1366 m 18 Y s 892 1366 m 18 Y s 924 1347 m 37 Y s 1134 1366 m 18 Y s 1257 1366 m 18 Y s 1344 1366 m 18 Y s 1411 1366 m 18 Y s 1467 1366 m 18 Y s 1513 1366 m 18 Y s 1554 1366 m 18 Y s 1589 1366 m 18 Y s 1621
 1347 m 37 Y s 1831 1366 m 18 Y s 1954 1366 m 18 Y s 2041 1366 m 18 Y s 227 154 m 1230 Y s
 gsave  2268 1538 0 0 C 61.9061 364.92 t 90 r /Helvetica findfont 71.6807 sf 0 0 m (Gluon \255 Gluon Luminosity) show NC gr  281 154 m -54 X s 254 178 m -27 X s 254 203 m -27 X s 254 228 m -27 X s 254 252 m -27 X s 281 277 m -54 X s 254 301 m -27 X s
 254 326 m -27 X s 254 351 m -27 X s 254 375 m -27 X s 281 400 m -54 X s 254 424 m -27 X s 254 449 m -27 X s 254 474 m -27 X s 254 498 m -27 X s 281 523 m -54 X s 254 547 m -27 X s 254 572 m -27 X s 254 597 m -27 X s 254 621 m -27 X s 281 646 m -54 X
 s 254 671 m -27 X s 254 695 m -27 X s 254 720 m -27 X s 254 744 m -27 X s 281 769 m -54 X s 254 794 m -27 X s 254 818 m -27 X s 254 843 m -27 X s 254 867 m -27 X s 281 892 m -54 X s 254 917 m -27 X s 254 941 m -27 X s 254 966 m -27 X s 254 990 m -27
 X s 281 1015 m -54 X s 254 1040 m -27 X s 254 1064 m -27 X s 254 1089 m -27 X s 254 1113 m -27 X s 281 1138 m -54 X s 254 1163 m -27 X s 254 1187 m -27 X s 254 1212 m -27 X s 254 1236 m -27 X s 281 1261 m -54 X s 254 1286 m -27 X s 254 1310 m -27 X
 s 254 1335 m -27 X s 254 1359 m -27 X s 281 1384 m -54 X s
 gsave  2268 1538 0 0 C 117.296 130.329 t 0 r /Helvetica findfont 71.6807 sf 0 0 m (0.8) show NC gr 
 gsave  2268 1538 0 0 C 78.1971 250.882 t 0 r /Helvetica findfont 71.6807 sf 0 0 m (0.85) show NC gr 
 gsave  2268 1538 0 0 C 117.296 374.695 t 0 r /Helvetica findfont 71.6807 sf 0 0 m (0.9) show NC gr 
 gsave  2268 1538 0 0 C 78.1971 498.507 t 0 r /Helvetica findfont 71.6807 sf 0 0 m (0.95) show NC gr 
 gsave  2268 1538 0 0 C 188.976 619.061 t 0 r /Helvetica findfont 71.6807 sf 0 0 m (1) show NC gr 
 gsave  2268 1538 0 0 C 78.1971 742.873 t 0 r /Helvetica findfont 71.6807 sf 0 0 m (1.05) show NC gr 
 gsave  2268 1538 0 0 C 130.329 863.427 t 0 r /Helvetica findfont 71.6807 sf 0 0 m (1.1) show NC gr 
 gsave  2268 1538 0 0 C 78.1971 990.497 t 0 r /Helvetica findfont 71.6807 sf 0 0 m (1.15) show NC gr 
 gsave  2268 1538 0 0 C 117.296 1111.05 t 0 r /Helvetica findfont 71.6807 sf 0 0 m (1.2) show NC gr 
 gsave  2268 1538 0 0 C 78.1971 1238.12 t 0 r /Helvetica findfont 71.6807 sf 0 0 m (1.25) show NC gr 
 gsave  2268 1538 0 0 C 117.296 1358.67 t 0 r /Helvetica findfont 71.6807 sf 0 0 m (1.3) show NC gr  2041 154 m 1230 Y s 1987 154 m 54 X s 2014 178 m 27 X s 2014 203 m 27 X s 2014 228 m 27 X s 2014 252 m 27 X s 1987 277 m 54 X s 2014 301 m 27 X s
 2014 326 m 27 X s 2014 351 m 27 X s 2014 375 m 27 X s 1987 400 m 54 X s 2014 424 m 27 X s 2014 449 m 27 X s 2014 474 m 27 X s 2014 498 m 27 X s 1987 523 m 54 X s 2014 547 m 27 X s 2014 572 m 27 X s 2014 597 m 27 X s 2014 621 m 27 X s 1987 646 m 54 X
 s 2014 671 m 27 X s 2014 695 m 27 X s 2014 720 m 27 X s 2014 744 m 27 X s 1987 769 m 54 X s 2014 794 m 27 X s 2014 818 m 27 X s 2014 843 m 27 X s 2014 867 m 27 X s 1987 892 m 54 X s 2014 917 m 27 X s 2014 941 m 27 X s 2014 966 m 27 X s 2014 990 m 27
 X s 1987 1015 m 54 X s 2014 1040 m 27 X s 2014 1064 m 27 X s 2014 1089 m 27 X s 2014 1113 m 27 X s 1987 1138 m 54 X s 2014 1163 m 27 X s 2014 1187 m 27 X s 2014 1212 m 27 X s 2014 1236 m 27 X s 1987 1261 m 54 X s 2014 1286 m 27 X s 2014 1310 m 27 X
 s 2014 1335 m 27 X s 2014 1359 m 27 X s 1987 1384 m 54 X s 0 0.6 0 c[ 12 12] 0 sd 6 lw 0 1 0 c black 0 0.6 0 c 0 1 0 c black[  ] 0 sd 3 lw 0 1 0 c 227 813 m 67 -57 d 66 -34 d 67 -19 d 67 -10 d 67 -8 d 67 -6 d 66 -2 d 67 -4 d 67 -2 d 67 X 66 1 d 67 2
 d 67 4 d 67 6 d 67 8 d 66 11 d 67 15 d 67 19 d 67 25 d 67 31 d 66 39 d 67 49 d 67 68 d 67 103 d 67 171 d 34 161 d 110 X -1230 Y -178 X -33 86 d -67 102 d -67 68 d -67 50 d -66 39 d -67 31 d -67 25 d -67 19 d -67 15 d -66 11 d -67 8 d -67 6 d -67 4 d
 -67 2 d -66 1 d -67 X -67 -2 d -67 -4 d -66 -3 d -67 -5 d -67 -8 d -67 -10 d -67 -19 d -66 -34 d -67 -57 d f[ 12 12] 0 sd 6 lw 0 0.6 0 c black 0 0.6 0 c 227 646 m 1814 X s[  ] 0 sd black 0 0.6 0 c 227 813 m 67 -57 d 66 -34 d 67 -19 d 67 -10 d 67 -8
 d 67 -6 d 66 -2 d 67 -4 d 67 -2 d 67 X 66 1 d 67 2 d 67 4 d 67 6 d 67 8 d 66 11 d 67 15 d 67 19 d 67 25 d 67 31 d 66 39 d 67 49 d 67 68 d 67 103 d 67 171 d 34 161 d s black 0 0.6 0 c 227 479 m 67 57 d 66 34 d 67 19 d 67 10 d 67 8 d 67 5 d 66 3 d 67
 4 d 67 2 d 67 X 66 -1 d 67 -2 d 67 -4 d 67 -6 d 67 -8 d 66 -11 d 67 -15 d 67 -19 d 67 -25 d 67 -31 d 66 -39 d 67 -50 d 67 -68 d 67 -102 d 33 -86 d s 0.8 0 1 c[ 12 12] 0 sd black 0.8 0 1 c 227 656 m 67 X 66 -5 d 67 -10 d 67 -11 d 67 -11 d 67 -11 d 66
 -11 d 67 -10 d 67 -11 d 67 -13 d 66 -13 d 67 -16 d 67 -13 d 67 -11 d 67 -13 d 66 -20 d 67 -27 d 67 -36 d 67 -46 d 67 -57 d 66 -72 d 67 -84 d 1 -1 d s black[  ] 0 sd 3 lw 0.8 0 1 c 1 lw << /PatternType 1 /PaintType 2 /TilingType 1 /BBox [ 0 0 100 100
 ] /XStep 100 /YStep 100 /PaintProc { begin gsave 0 100 m 100 0 l s gr end } >> [ 0.24 0 0 0.24 0 0 ] makepattern /P05 exch def /cs {[/Pattern /DeviceRGB] setcolorspace} def /FA {f [/DeviceRGB] setcolorspace} def cs 0.8 0 1 P05 setcolor 227 746 m 67
 -10 d 66 -15 d 67 -17 d 67 -17 d 67 -17 d 67 -16 d 66 -16 d 67 -14 d 67 -16 d 67 -15 d 66 -16 d 67 -16 d 67 -12 d 67 -4 d 67 -5 d 66 -8 d 67 -12 d 67 -18 d 67 -27 d 67 -39 d 66 -56 d 67 -75 d 67 -97 d 33 -54 d -209 X -24 31 d -67 77 d -67 64 d -67
 53 d -67 42 d -66 33 d -67 22 d -67 16 d -67 16 d -67 15 d -66 11 d -67 9 d -67 7 d -67 6 d -66 7 d -67 6 d -67 5 d -67 4 d -67 2 d -66 -4 d -67 -11 d FA[ 12 12] 0 sd 6 lw 0.8 0 1 c[  ] 0 sd black 0.8 0 1 c 227 746 m 67 -10 d 66 -15 d 67 -17 d 67
 -17 d 67 -17 d 67 -16 d 66 -16 d 67 -14 d 67 -16 d 67 -15 d 66 -16 d 67 -16 d 67 -12 d 67 -4 d 67 -5 d 66 -8 d 67 -12 d 67 -18 d 67 -27 d 67 -39 d 66 -56 d 67 -75 d 67 -97 d 33 -54 d s black 0.8 0 1 c 227 565 m 67 11 d 66 4 d 67 -2 d 67 -4 d 67 -5 d
 67 -6 d 66 -7 d 67 -6 d 67 -7 d 67 -9 d 66 -11 d 67 -15 d 67 -16 d 67 -16 d 67 -22 d 66 -33 d 67 -42 d 67 -53 d 67 -64 d 67 -77 d 24 -31 d s 0 0.8 0.8 c[ 12 12] 0 sd black 0 0.8 0.8 c 227 565 m 67 22 d 66 5 d 67 -4 d 67 -8 d 67 -9 d 67 -8 d 66 -6 d
 67 -3 d 67 X 67 3 d 66 8 d 67 12 d 67 21 d 67 25 d 67 28 d 66 36 d 67 44 d 67 54 d 67 61 d 67 67 d 66 68 d 67 63 d 67 52 d 67 32 d 67 10 d 66 8 d 67 11 d 11 -69 d s black[  ] 0 sd 3 lw 0 0.8 0.8 c 1 lw << /PatternType 1 /PaintType 2 /TilingType 1
 /BBox [ 0 0 100 100 ] /XStep 100 /YStep 100 /PaintProc { begin gsave 0 0 m 100 100 l s gr end } >> [ 0.24 0 0 0.24 0 0 ] makepattern /P04 exch def cs 0 0.8 0.8 P04 setcolor 227 935 m 67 -106 d 66 -65 d 67 -39 d 67 -27 d 67 -18 d 67 -12 d 66 -7 d 67
 -1 d 67 5 d 67 10 d 66 19 d 67 28 d 67 44 d 67 53 d 67 62 d 66 78 d 67 96 d 67 117 d 67 141 d 29 71 d 516 X -1230 Y -322 X -23 47 d -67 91 d -66 56 d -67 32 d -67 18 d -67 10 d -67 7 d -66 6 d -67 6 d -67 3 d -67 2 d -67 4 d -66 4 d -67 4 d -67 4 d
 -67 4 d -66 5 d -67 4 d -67 X -67 -10 d -67 -31 d -66 -75 d -67 -150 d FA[ 12 12] 0 sd 6 lw 0 0.8 0.8 c[  ] 0 sd black 0 0.8 0.8 c 227 935 m 67 -106 d 66 -65 d 67 -39 d 67 -27 d 67 -18 d 67 -12 d 66 -7 d 67 -1 d 67 5 d 67 10 d 66 19 d 67 28 d 67 44
 d 67 53 d 67 62 d 66 78 d 67 96 d 67 117 d 67 141 d 29 71 d s black 0 0.8 0.8 c 227 195 m 67 150 d 66 75 d 67 31 d 67 10 d 67 X 67 -4 d 66 -5 d 67 -4 d 67 -4 d 67 -4 d 66 -4 d 67 -4 d 67 -2 d 67 -3 d 67 -6 d 66 -6 d 67 -7 d 67 -10 d 67 -18 d 67 -32
 d 66 -56 d 67 -91 d 23 -47 d s black 3 lw 1 1 1 c 839 323 295 1015 bf black 295 1015 m 839 X s 1134 1015 m 323 Y s 1134 1338 m -839 X s 295 1338 m -323 Y s
 gsave  2268 1538 0 0 C 501.765 1267.44 t 0 r /Helvetica findfont 48.8732 sf 0 0 m (NNPDF2.3 NNLO) show NC gr  0 1 0 c 326 1246 m 147 X 76 Y -147 X f 0 0.6 0 c[ 12 12] 0 sd 6 lw 326 1284 m 147 X s black
 gsave  2268 1538 0 0 C 501.765 1159.92 t 0 r /Helvetica findfont 48.8732 sf 0 0 m (ABM11 NNLO) show NC gr  0.8 0 1 c[  ] 0 sd 3 lw cs 0.8 0 1 P05 setcolor 326 1139 m 147 X 75 Y -147 X FA[ 12 12] 0 sd 6 lw 0.8 0 1 c 326 1176 m 147 X s black
 gsave  2268 1538 0 0 C 501.765 1052.4 t 0 r /Helvetica findfont 48.8732 sf 0 0 m (HERAPDF1.5 NNLO) show NC gr  0 0.8 0.8 c[  ] 0 sd 3 lw cs 0 0.8 0.8 P04 setcolor 326 1031 m 147 X 76 Y -147 X FA[ 12 12] 0 sd 6 lw 0 0.8 0.8 c 326 1069 m 147 X s 1 1 1
 c black
 gsave  2268 1538 0 0 C 1619.33 1466.2 t 0 r /Helvetica findfont 61.9061 sf 0 0 m ( = 0.118) show NC gr 
 gsave  2268 1538 0 0 C 1596.52 1449.9 t 0 r /Helvetica findfont 42.3568 sf 0 0 m (s) show NC gr 
 gsave  2268 1538 0 0 C 1557.43 1466.2 t 0 r /Symbol findfont 61.9061 sf 0 0 m (a) show NC gr 
 gsave  2268 1538 0 0 C 420.31 1466.2 t 0 r /Helvetica findfont 61.9061 sf 0 0 m (LHC 8 TeV \255 Ratio to NNPDF2.3 NNLO \255 ) show NC gr 
 gsave  2268 1538 0 0 C 2166.71 847.135 t 90 r /Helvetica-BoldOblique findfont 45.615 sf 0 0 m (LHC HIGGS XS WG 2013) show NC gr 
 gr  gr showpage
end
%%EOF
