%!PS-Adobe-2.0 EPSF-2.0
%%Title: finite_merged.eps
%%Creator: gnuplot 4.6 patchlevel 0
%%CreationDate: Mon May 27 16:03:27 2013
%%DocumentFonts: (atend)
%%BoundingBox: 50 50 590 302
%%EndComments
%%BeginProlog
/gnudict 256 dict def
gnudict begin
%
% The following true/false flags may be edited by hand if desired.
% The unit line width and grayscale image gamma correction may also be changed.
%
/Color true def
/Blacktext false def
/Solid true def
/Dashlength 3 def
/Landscape false def
/Level1 false def
/Rounded false def
/ClipToBoundingBox false def
/SuppressPDFMark false def
/TransparentPatterns false def
/gnulinewidth 10.000 def
/userlinewidth gnulinewidth def
/Gamma 1.0 def
/BackgroundColor {-1.000 -1.000 -1.000} def
%
/vshift -83 def
/dl1 {
  10.0 Dashlength mul mul
  Rounded { currentlinewidth 0.75 mul sub dup 0 le { pop 0.01 } if } if
} def
/dl2 {
  10.0 Dashlength mul mul
  Rounded { currentlinewidth 0.75 mul add } if
} def
/hpt_ 31.5 def
/vpt_ 31.5 def
/hpt hpt_ def
/vpt vpt_ def
/doclip {
  ClipToBoundingBox {
    newpath 50 50 moveto 590 50 lineto 590 302 lineto 50 302 lineto closepath
    clip
  } if
} def
%
% Gnuplot Prolog Version 4.4 (August 2010)
%
%/SuppressPDFMark true def
%
/M {moveto} bind def
/L {lineto} bind def
/R {rmoveto} bind def
/V {rlineto} bind def
/N {newpath moveto} bind def
/Z {closepath} bind def
/C {setrgbcolor} bind def
/f {rlineto fill} bind def
/g {setgray} bind def
/Gshow {show} def   % May be redefined later in the file to support UTF-8
/vpt2 vpt 2 mul def
/hpt2 hpt 2 mul def
/Lshow {currentpoint stroke M 0 vshift R 
	Blacktext {gsave 0 setgray show grestore} {show} ifelse} def
/Rshow {currentpoint stroke M dup stringwidth pop neg vshift R
	Blacktext {gsave 0 setgray show grestore} {show} ifelse} def
/Cshow {currentpoint stroke M dup stringwidth pop -2 div vshift R 
	Blacktext {gsave 0 setgray show grestore} {show} ifelse} def
/UP {dup vpt_ mul /vpt exch def hpt_ mul /hpt exch def
  /hpt2 hpt 2 mul def /vpt2 vpt 2 mul def} def
/DL {Color {setrgbcolor Solid {pop []} if 0 setdash}
 {pop pop pop 0 setgray Solid {pop []} if 0 setdash} ifelse} def
/BL {stroke userlinewidth 2 mul setlinewidth
	Rounded {1 setlinejoin 1 setlinecap} if} def
/AL {stroke userlinewidth 2 div setlinewidth
	Rounded {1 setlinejoin 1 setlinecap} if} def
/UL {dup gnulinewidth mul /userlinewidth exch def
	dup 1 lt {pop 1} if 10 mul /udl exch def} def
/PL {stroke userlinewidth setlinewidth
	Rounded {1 setlinejoin 1 setlinecap} if} def
3.8 setmiterlimit
% Default Line colors
/LCw {1 1 1} def
/LCb {0 0 0} def
/LCa {0 0 0} def
/LC0 {1 0 0} def
/LC1 {0 1 0} def
/LC2 {0 0 1} def
/LC3 {1 0 1} def
/LC4 {0 1 1} def
/LC5 {1 1 0} def
/LC6 {0 0 0} def
/LC7 {1 0.3 0} def
/LC8 {0.5 0.5 0.5} def
% Default Line Types
/LTw {PL [] 1 setgray} def
/LTb {BL [] LCb DL} def
/LTa {AL [1 udl mul 2 udl mul] 0 setdash LCa setrgbcolor} def
/LT0 {PL [] LC0 DL} def
/LT1 {PL [4 dl1 2 dl2] LC1 DL} def
/LT2 {PL [2 dl1 3 dl2] LC2 DL} def
/LT3 {PL [1 dl1 1.5 dl2] LC3 DL} def
/LT4 {PL [6 dl1 2 dl2 1 dl1 2 dl2] LC4 DL} def
/LT5 {PL [3 dl1 3 dl2 1 dl1 3 dl2] LC5 DL} def
/LT6 {PL [2 dl1 2 dl2 2 dl1 6 dl2] LC6 DL} def
/LT7 {PL [1 dl1 2 dl2 6 dl1 2 dl2 1 dl1 2 dl2] LC7 DL} def
/LT8 {PL [2 dl1 2 dl2 2 dl1 2 dl2 2 dl1 2 dl2 2 dl1 4 dl2] LC8 DL} def
/Pnt {stroke [] 0 setdash gsave 1 setlinecap M 0 0 V stroke grestore} def
/Dia {stroke [] 0 setdash 2 copy vpt add M
  hpt neg vpt neg V hpt vpt neg V
  hpt vpt V hpt neg vpt V closepath stroke
  Pnt} def
/Pls {stroke [] 0 setdash vpt sub M 0 vpt2 V
  currentpoint stroke M
  hpt neg vpt neg R hpt2 0 V stroke
 } def
/Box {stroke [] 0 setdash 2 copy exch hpt sub exch vpt add M
  0 vpt2 neg V hpt2 0 V 0 vpt2 V
  hpt2 neg 0 V closepath stroke
  Pnt} def
/Crs {stroke [] 0 setdash exch hpt sub exch vpt add M
  hpt2 vpt2 neg V currentpoint stroke M
  hpt2 neg 0 R hpt2 vpt2 V stroke} def
/TriU {stroke [] 0 setdash 2 copy vpt 1.12 mul add M
  hpt neg vpt -1.62 mul V
  hpt 2 mul 0 V
  hpt neg vpt 1.62 mul V closepath stroke
  Pnt} def
/Star {2 copy Pls Crs} def
/BoxF {stroke [] 0 setdash exch hpt sub exch vpt add M
  0 vpt2 neg V hpt2 0 V 0 vpt2 V
  hpt2 neg 0 V closepath fill} def
/TriUF {stroke [] 0 setdash vpt 1.12 mul add M
  hpt neg vpt -1.62 mul V
  hpt 2 mul 0 V
  hpt neg vpt 1.62 mul V closepath fill} def
/TriD {stroke [] 0 setdash 2 copy vpt 1.12 mul sub M
  hpt neg vpt 1.62 mul V
  hpt 2 mul 0 V
  hpt neg vpt -1.62 mul V closepath stroke
  Pnt} def
/TriDF {stroke [] 0 setdash vpt 1.12 mul sub M
  hpt neg vpt 1.62 mul V
  hpt 2 mul 0 V
  hpt neg vpt -1.62 mul V closepath fill} def
/DiaF {stroke [] 0 setdash vpt add M
  hpt neg vpt neg V hpt vpt neg V
  hpt vpt V hpt neg vpt V closepath fill} def
/Pent {stroke [] 0 setdash 2 copy gsave
  translate 0 hpt M 4 {72 rotate 0 hpt L} repeat
  closepath stroke grestore Pnt} def
/PentF {stroke [] 0 setdash gsave
  translate 0 hpt M 4 {72 rotate 0 hpt L} repeat
  closepath fill grestore} def
/Circle {stroke [] 0 setdash 2 copy
  hpt 0 360 arc stroke Pnt} def
/CircleF {stroke [] 0 setdash hpt 0 360 arc fill} def
/C0 {BL [] 0 setdash 2 copy moveto vpt 90 450 arc} bind def
/C1 {BL [] 0 setdash 2 copy moveto
	2 copy vpt 0 90 arc closepath fill
	vpt 0 360 arc closepath} bind def
/C2 {BL [] 0 setdash 2 copy moveto
	2 copy vpt 90 180 arc closepath fill
	vpt 0 360 arc closepath} bind def
/C3 {BL [] 0 setdash 2 copy moveto
	2 copy vpt 0 180 arc closepath fill
	vpt 0 360 arc closepath} bind def
/C4 {BL [] 0 setdash 2 copy moveto
	2 copy vpt 180 270 arc closepath fill
	vpt 0 360 arc closepath} bind def
/C5 {BL [] 0 setdash 2 copy moveto
	2 copy vpt 0 90 arc
	2 copy moveto
	2 copy vpt 180 270 arc closepath fill
	vpt 0 360 arc} bind def
/C6 {BL [] 0 setdash 2 copy moveto
	2 copy vpt 90 270 arc closepath fill
	vpt 0 360 arc closepath} bind def
/C7 {BL [] 0 setdash 2 copy moveto
	2 copy vpt 0 270 arc closepath fill
	vpt 0 360 arc closepath} bind def
/C8 {BL [] 0 setdash 2 copy moveto
	2 copy vpt 270 360 arc closepath fill
	vpt 0 360 arc closepath} bind def
/C9 {BL [] 0 setdash 2 copy moveto
	2 copy vpt 270 450 arc closepath fill
	vpt 0 360 arc closepath} bind def
/C10 {BL [] 0 setdash 2 copy 2 copy moveto vpt 270 360 arc closepath fill
	2 copy moveto
	2 copy vpt 90 180 arc closepath fill
	vpt 0 360 arc closepath} bind def
/C11 {BL [] 0 setdash 2 copy moveto
	2 copy vpt 0 180 arc closepath fill
	2 copy moveto
	2 copy vpt 270 360 arc closepath fill
	vpt 0 360 arc closepath} bind def
/C12 {BL [] 0 setdash 2 copy moveto
	2 copy vpt 180 360 arc closepath fill
	vpt 0 360 arc closepath} bind def
/C13 {BL [] 0 setdash 2 copy moveto
	2 copy vpt 0 90 arc closepath fill
	2 copy moveto
	2 copy vpt 180 360 arc closepath fill
	vpt 0 360 arc closepath} bind def
/C14 {BL [] 0 setdash 2 copy moveto
	2 copy vpt 90 360 arc closepath fill
	vpt 0 360 arc} bind def
/C15 {BL [] 0 setdash 2 copy vpt 0 360 arc closepath fill
	vpt 0 360 arc closepath} bind def
/Rec {newpath 4 2 roll moveto 1 index 0 rlineto 0 exch rlineto
	neg 0 rlineto closepath} bind def
/Square {dup Rec} bind def
/Bsquare {vpt sub exch vpt sub exch vpt2 Square} bind def
/S0 {BL [] 0 setdash 2 copy moveto 0 vpt rlineto BL Bsquare} bind def
/S1 {BL [] 0 setdash 2 copy vpt Square fill Bsquare} bind def
/S2 {BL [] 0 setdash 2 copy exch vpt sub exch vpt Square fill Bsquare} bind def
/S3 {BL [] 0 setdash 2 copy exch vpt sub exch vpt2 vpt Rec fill Bsquare} bind def
/S4 {BL [] 0 setdash 2 copy exch vpt sub exch vpt sub vpt Square fill Bsquare} bind def
/S5 {BL [] 0 setdash 2 copy 2 copy vpt Square fill
	exch vpt sub exch vpt sub vpt Square fill Bsquare} bind def
/S6 {BL [] 0 setdash 2 copy exch vpt sub exch vpt sub vpt vpt2 Rec fill Bsquare} bind def
/S7 {BL [] 0 setdash 2 copy exch vpt sub exch vpt sub vpt vpt2 Rec fill
	2 copy vpt Square fill Bsquare} bind def
/S8 {BL [] 0 setdash 2 copy vpt sub vpt Square fill Bsquare} bind def
/S9 {BL [] 0 setdash 2 copy vpt sub vpt vpt2 Rec fill Bsquare} bind def
/S10 {BL [] 0 setdash 2 copy vpt sub vpt Square fill 2 copy exch vpt sub exch vpt Square fill
	Bsquare} bind def
/S11 {BL [] 0 setdash 2 copy vpt sub vpt Square fill 2 copy exch vpt sub exch vpt2 vpt Rec fill
	Bsquare} bind def
/S12 {BL [] 0 setdash 2 copy exch vpt sub exch vpt sub vpt2 vpt Rec fill Bsquare} bind def
/S13 {BL [] 0 setdash 2 copy exch vpt sub exch vpt sub vpt2 vpt Rec fill
	2 copy vpt Square fill Bsquare} bind def
/S14 {BL [] 0 setdash 2 copy exch vpt sub exch vpt sub vpt2 vpt Rec fill
	2 copy exch vpt sub exch vpt Square fill Bsquare} bind def
/S15 {BL [] 0 setdash 2 copy Bsquare fill Bsquare} bind def
/D0 {gsave translate 45 rotate 0 0 S0 stroke grestore} bind def
/D1 {gsave translate 45 rotate 0 0 S1 stroke grestore} bind def
/D2 {gsave translate 45 rotate 0 0 S2 stroke grestore} bind def
/D3 {gsave translate 45 rotate 0 0 S3 stroke grestore} bind def
/D4 {gsave translate 45 rotate 0 0 S4 stroke grestore} bind def
/D5 {gsave translate 45 rotate 0 0 S5 stroke grestore} bind def
/D6 {gsave translate 45 rotate 0 0 S6 stroke grestore} bind def
/D7 {gsave translate 45 rotate 0 0 S7 stroke grestore} bind def
/D8 {gsave translate 45 rotate 0 0 S8 stroke grestore} bind def
/D9 {gsave translate 45 rotate 0 0 S9 stroke grestore} bind def
/D10 {gsave translate 45 rotate 0 0 S10 stroke grestore} bind def
/D11 {gsave translate 45 rotate 0 0 S11 stroke grestore} bind def
/D12 {gsave translate 45 rotate 0 0 S12 stroke grestore} bind def
/D13 {gsave translate 45 rotate 0 0 S13 stroke grestore} bind def
/D14 {gsave translate 45 rotate 0 0 S14 stroke grestore} bind def
/D15 {gsave translate 45 rotate 0 0 S15 stroke grestore} bind def
/DiaE {stroke [] 0 setdash vpt add M
  hpt neg vpt neg V hpt vpt neg V
  hpt vpt V hpt neg vpt V closepath stroke} def
/BoxE {stroke [] 0 setdash exch hpt sub exch vpt add M
  0 vpt2 neg V hpt2 0 V 0 vpt2 V
  hpt2 neg 0 V closepath stroke} def
/TriUE {stroke [] 0 setdash vpt 1.12 mul add M
  hpt neg vpt -1.62 mul V
  hpt 2 mul 0 V
  hpt neg vpt 1.62 mul V closepath stroke} def
/TriDE {stroke [] 0 setdash vpt 1.12 mul sub M
  hpt neg vpt 1.62 mul V
  hpt 2 mul 0 V
  hpt neg vpt -1.62 mul V closepath stroke} def
/PentE {stroke [] 0 setdash gsave
  translate 0 hpt M 4 {72 rotate 0 hpt L} repeat
  closepath stroke grestore} def
/CircE {stroke [] 0 setdash 
  hpt 0 360 arc stroke} def
/Opaque {gsave closepath 1 setgray fill grestore 0 setgray closepath} def
/DiaW {stroke [] 0 setdash vpt add M
  hpt neg vpt neg V hpt vpt neg V
  hpt vpt V hpt neg vpt V Opaque stroke} def
/BoxW {stroke [] 0 setdash exch hpt sub exch vpt add M
  0 vpt2 neg V hpt2 0 V 0 vpt2 V
  hpt2 neg 0 V Opaque stroke} def
/TriUW {stroke [] 0 setdash vpt 1.12 mul add M
  hpt neg vpt -1.62 mul V
  hpt 2 mul 0 V
  hpt neg vpt 1.62 mul V Opaque stroke} def
/TriDW {stroke [] 0 setdash vpt 1.12 mul sub M
  hpt neg vpt 1.62 mul V
  hpt 2 mul 0 V
  hpt neg vpt -1.62 mul V Opaque stroke} def
/PentW {stroke [] 0 setdash gsave
  translate 0 hpt M 4 {72 rotate 0 hpt L} repeat
  Opaque stroke grestore} def
/CircW {stroke [] 0 setdash 
  hpt 0 360 arc Opaque stroke} def
/BoxFill {gsave Rec 1 setgray fill grestore} def
/Density {
  /Fillden exch def
  currentrgbcolor
  /ColB exch def /ColG exch def /ColR exch def
  /ColR ColR Fillden mul Fillden sub 1 add def
  /ColG ColG Fillden mul Fillden sub 1 add def
  /ColB ColB Fillden mul Fillden sub 1 add def
  ColR ColG ColB setrgbcolor} def
/BoxColFill {gsave Rec PolyFill} def
/PolyFill {gsave Density fill grestore grestore} def
/h {rlineto rlineto rlineto gsave closepath fill grestore} bind def
%
% PostScript Level 1 Pattern Fill routine for rectangles
% Usage: x y w h s a XX PatternFill
%	x,y = lower left corner of box to be filled
%	w,h = width and height of box
%	  a = angle in degrees between lines and x-axis
%	 XX = 0/1 for no/yes cross-hatch
%
/PatternFill {gsave /PFa [ 9 2 roll ] def
  PFa 0 get PFa 2 get 2 div add PFa 1 get PFa 3 get 2 div add translate
  PFa 2 get -2 div PFa 3 get -2 div PFa 2 get PFa 3 get Rec
  gsave 1 setgray fill grestore clip
  currentlinewidth 0.5 mul setlinewidth
  /PFs PFa 2 get dup mul PFa 3 get dup mul add sqrt def
  0 0 M PFa 5 get rotate PFs -2 div dup translate
  0 1 PFs PFa 4 get div 1 add floor cvi
	{PFa 4 get mul 0 M 0 PFs V} for
  0 PFa 6 get ne {
	0 1 PFs PFa 4 get div 1 add floor cvi
	{PFa 4 get mul 0 2 1 roll M PFs 0 V} for
 } if
  stroke grestore} def
%
/languagelevel where
 {pop languagelevel} {1} ifelse
 2 lt
	{/InterpretLevel1 true def}
	{/InterpretLevel1 Level1 def}
 ifelse
%
% PostScript level 2 pattern fill definitions
%
/Level2PatternFill {
/Tile8x8 {/PaintType 2 /PatternType 1 /TilingType 1 /BBox [0 0 8 8] /XStep 8 /YStep 8}
	bind def
/KeepColor {currentrgbcolor [/Pattern /DeviceRGB] setcolorspace} bind def
<< Tile8x8
 /PaintProc {0.5 setlinewidth pop 0 0 M 8 8 L 0 8 M 8 0 L stroke} 
>> matrix makepattern
/Pat1 exch def
<< Tile8x8
 /PaintProc {0.5 setlinewidth pop 0 0 M 8 8 L 0 8 M 8 0 L stroke
	0 4 M 4 8 L 8 4 L 4 0 L 0 4 L stroke}
>> matrix makepattern
/Pat2 exch def
<< Tile8x8
 /PaintProc {0.5 setlinewidth pop 0 0 M 0 8 L
	8 8 L 8 0 L 0 0 L fill}
>> matrix makepattern
/Pat3 exch def
<< Tile8x8
 /PaintProc {0.5 setlinewidth pop -4 8 M 8 -4 L
	0 12 M 12 0 L stroke}
>> matrix makepattern
/Pat4 exch def
<< Tile8x8
 /PaintProc {0.5 setlinewidth pop -4 0 M 8 12 L
	0 -4 M 12 8 L stroke}
>> matrix makepattern
/Pat5 exch def
<< Tile8x8
 /PaintProc {0.5 setlinewidth pop -2 8 M 4 -4 L
	0 12 M 8 -4 L 4 12 M 10 0 L stroke}
>> matrix makepattern
/Pat6 exch def
<< Tile8x8
 /PaintProc {0.5 setlinewidth pop -2 0 M 4 12 L
	0 -4 M 8 12 L 4 -4 M 10 8 L stroke}
>> matrix makepattern
/Pat7 exch def
<< Tile8x8
 /PaintProc {0.5 setlinewidth pop 8 -2 M -4 4 L
	12 0 M -4 8 L 12 4 M 0 10 L stroke}
>> matrix makepattern
/Pat8 exch def
<< Tile8x8
 /PaintProc {0.5 setlinewidth pop 0 -2 M 12 4 L
	-4 0 M 12 8 L -4 4 M 8 10 L stroke}
>> matrix makepattern
/Pat9 exch def
/Pattern1 {PatternBgnd KeepColor Pat1 setpattern} bind def
/Pattern2 {PatternBgnd KeepColor Pat2 setpattern} bind def
/Pattern3 {PatternBgnd KeepColor Pat3 setpattern} bind def
/Pattern4 {PatternBgnd KeepColor Landscape {Pat5} {Pat4} ifelse setpattern} bind def
/Pattern5 {PatternBgnd KeepColor Landscape {Pat4} {Pat5} ifelse setpattern} bind def
/Pattern6 {PatternBgnd KeepColor Landscape {Pat9} {Pat6} ifelse setpattern} bind def
/Pattern7 {PatternBgnd KeepColor Landscape {Pat8} {Pat7} ifelse setpattern} bind def
} def
%
%
%End of PostScript Level 2 code
%
/PatternBgnd {
  TransparentPatterns {} {gsave 1 setgray fill grestore} ifelse
} def
%
% Substitute for Level 2 pattern fill codes with
% grayscale if Level 2 support is not selected.
%
/Level1PatternFill {
/Pattern1 {0.250 Density} bind def
/Pattern2 {0.500 Density} bind def
/Pattern3 {0.750 Density} bind def
/Pattern4 {0.125 Density} bind def
/Pattern5 {0.375 Density} bind def
/Pattern6 {0.625 Density} bind def
/Pattern7 {0.875 Density} bind def
} def
%
% Now test for support of Level 2 code
%
Level1 {Level1PatternFill} {Level2PatternFill} ifelse
%
/Symbol-Oblique /Symbol findfont [1 0 .167 1 0 0] makefont
dup length dict begin {1 index /FID eq {pop pop} {def} ifelse} forall
currentdict end definefont pop
/MFshow {
   { dup 5 get 3 ge
     { 5 get 3 eq {gsave} {grestore} ifelse }
     {dup dup 0 get findfont exch 1 get scalefont setfont
     [ currentpoint ] exch dup 2 get 0 exch R dup 5 get 2 ne {dup dup 6
     get exch 4 get {Gshow} {stringwidth pop 0 R} ifelse }if dup 5 get 0 eq
     {dup 3 get {2 get neg 0 exch R pop} {pop aload pop M} ifelse} {dup 5
     get 1 eq {dup 2 get exch dup 3 get exch 6 get stringwidth pop -2 div
     dup 0 R} {dup 6 get stringwidth pop -2 div 0 R 6 get
     show 2 index {aload pop M neg 3 -1 roll neg R pop pop} {pop pop pop
     pop aload pop M} ifelse }ifelse }ifelse }
     ifelse }
   forall} def
/Gswidth {dup type /stringtype eq {stringwidth} {pop (n) stringwidth} ifelse} def
/MFwidth {0 exch { dup 5 get 3 ge { 5 get 3 eq { 0 } { pop } ifelse }
 {dup 3 get{dup dup 0 get findfont exch 1 get scalefont setfont
     6 get Gswidth pop add} {pop} ifelse} ifelse} forall} def
/MLshow { currentpoint stroke M
  0 exch R
  Blacktext {gsave 0 setgray MFshow grestore} {MFshow} ifelse } bind def
/MRshow { currentpoint stroke M
  exch dup MFwidth neg 3 -1 roll R
  Blacktext {gsave 0 setgray MFshow grestore} {MFshow} ifelse } bind def
/MCshow { currentpoint stroke M
  exch dup MFwidth -2 div 3 -1 roll R
  Blacktext {gsave 0 setgray MFshow grestore} {MFshow} ifelse } bind def
/XYsave    { [( ) 1 2 true false 3 ()] } bind def
/XYrestore { [( ) 1 2 true false 4 ()] } bind def
Level1 SuppressPDFMark or 
{} {
/SDict 10 dict def
systemdict /pdfmark known not {
  userdict /pdfmark systemdict /cleartomark get put
} if
SDict begin [
  /Title (finite_merged.eps)
  /Subject (gnuplot plot)
  /Creator (gnuplot 4.6 patchlevel 0)
  /Author (luisonig)
%  /Producer (gnuplot)
%  /Keywords ()
  /CreationDate (Mon May 27 16:03:27 2013)
  /DOCINFO pdfmark
end
} ifelse
end
%%EndProlog
%%Page: 1 1
gnudict begin
gsave
doclip
50 50 translate
0.050 0.050 scale
0 setgray
newpath
(Helvetica) findfont 250 scalefont setfont
BackgroundColor 0 lt 3 1 roll 0 lt exch 0 lt or or not {BackgroundColor C 1.000 0 0 10800.00 5040.00 BoxColFill} if
1.000 UL
LTb
1225 1457 M
63 0 V
stroke
1075 1457 M
[ [(Helvetica) 250.0 0.0 true true 0 (-50)]
] -83.3 MRshow
1.000 UL
LTb
1225 2277 M
63 0 V
stroke
1075 2277 M
[ [(Helvetica) 250.0 0.0 true true 0 ( 0)]
] -83.3 MRshow
1.000 UL
LTb
1225 3098 M
63 0 V
stroke
1075 3098 M
[ [(Helvetica) 250.0 0.0 true true 0 ( 50)]
] -83.3 MRshow
1.000 UL
LTb
1225 3918 M
63 0 V
stroke
1075 3918 M
[ [(Helvetica) 250.0 0.0 true true 0 ( 100)]
] -83.3 MRshow
1.000 UL
LTb
1225 4739 M
63 0 V
stroke
1075 4739 M
[ [(Helvetica) 250.0 0.0 true true 0 ( 150)]
] -83.3 MRshow
1.000 UL
LTb
1225 800 M
0 63 V
0 3876 R
0 -63 V
stroke
1225 550 M
[ [(Helvetica) 250.0 0.0 true true 0 ( 0)]
] -83.3 MCshow
1.000 UL
LTb
2677 800 M
0 63 V
0 3876 R
0 -63 V
stroke
2677 550 M
[ [(Helvetica) 250.0 0.0 true true 0 ( 1)]
] -83.3 MCshow
1.000 UL
LTb
4129 800 M
0 63 V
0 3876 R
0 -63 V
stroke
4129 550 M
[ [(Helvetica) 250.0 0.0 true true 0 ( 2)]
] -83.3 MCshow
1.000 UL
LTb
5581 800 M
0 63 V
0 3876 R
0 -63 V
stroke
5581 550 M
[ [(Helvetica) 250.0 0.0 true true 0 ( 3)]
] -83.3 MCshow
1.000 UL
LTb
7033 800 M
0 63 V
0 3876 R
0 -63 V
stroke
7033 550 M
[ [(Helvetica) 250.0 0.0 true true 0 ( 4)]
] -83.3 MCshow
1.000 UL
LTb
8485 800 M
0 63 V
0 3876 R
0 -63 V
stroke
8485 550 M
[ [(Helvetica) 250.0 0.0 true true 0 ( 5)]
] -83.3 MCshow
1.000 UL
LTb
9937 800 M
0 63 V
0 3876 R
0 -63 V
stroke
9937 550 M
[ [(Helvetica) 250.0 0.0 true true 0 ( 6)]
] -83.3 MCshow
1.000 UL
LTb
1.000 UL
LTb
1225 4739 N
0 -3939 V
9123 0 V
0 3939 V
-9123 0 V
Z stroke
LCb setrgbcolor
200 2769 M
currentpoint gsave translate -270 rotate 0 0 moveto
[ [(Helvetica) 250.0 0.0 true true 0 (a)]
[(Helvetica) 200.0 -75.0 true true 0 (0)]
] -58.3 MCshow
grestore
LTb
LCb setrgbcolor
5786 175 M
[ [(Helvetica) 250.0 0.0 true true 0 (Angle )]
[(Symbol) 250.0 0.0 true true 0 (q)]
[(Helvetica) 250.0 0.0 true true 0 ( around y-axis)]
] -83.3 MCshow
LTb
1.000 UP
0.00 0.00 0.00 C 10549 1864 M
currentpoint gsave translate -270 rotate 0 0 moveto
[ [(Helvetica) 250.0 0.0 true true 0 (LHC HIGGS XS WG 2013)]
] -83.3 MLshow
grestore
1.000 UL
LTb
% Begin plot #1
1.000 UP
1.000 UL
LT0
LCb setrgbcolor
9235 4551 M
[ [(Helvetica) 250.0 0.0 true true 0 (g g -> H q  )]
XYsave
[(Helvetica) 180.0 125.0 true true 0 (-)]
XYrestore
[(Helvetica) 250.0 0.0 true true 0 (q  g)]
] -108.3 MRshow
LT0
1225 3076 Pls
1316 3104 Pls
1407 3127 Pls
1499 3146 Pls
1590 3160 Pls
1681 3172 Pls
1772 3180 Pls
1864 3185 Pls
1955 3188 Pls
2046 3188 Pls
2137 3186 Pls
2229 3182 Pls
2320 3177 Pls
2411 3170 Pls
2502 3163 Pls
2593 3155 Pls
2685 3146 Pls
2776 3138 Pls
2867 3130 Pls
2958 3122 Pls
3050 3115 Pls
3141 3108 Pls
3232 3102 Pls
3323 3096 Pls
3415 3091 Pls
3506 3085 Pls
3597 3080 Pls
3688 3075 Pls
3779 3069 Pls
3871 3062 Pls
3962 3055 Pls
4053 3046 Pls
4144 3035 Pls
4236 3019 Pls
4327 2995 Pls
4418 2958 Pls
4509 2901 Pls
4601 2812 Pls
4692 2677 Pls
4783 2465 Pls
4874 2144 Pls
4965 1922 Pls
5057 2197 Pls
5148 2480 Pls
5239 2666 Pls
5330 2792 Pls
5422 2881 Pls
5513 2948 Pls
5604 3001 Pls
5695 3042 Pls
5787 3076 Pls
5878 3104 Pls
5969 3127 Pls
6060 3146 Pls
6151 3160 Pls
6243 3172 Pls
6334 3180 Pls
6425 3185 Pls
6516 3188 Pls
6608 3188 Pls
6699 3186 Pls
6790 3182 Pls
6881 3177 Pls
6972 3170 Pls
7064 3163 Pls
7155 3155 Pls
7246 3146 Pls
7337 3138 Pls
7429 3130 Pls
7520 3122 Pls
7611 3115 Pls
7702 3108 Pls
7794 3102 Pls
7885 3096 Pls
7976 3091 Pls
8067 3085 Pls
8158 3080 Pls
8250 3075 Pls
8341 3069 Pls
8432 3062 Pls
8523 3055 Pls
8615 3046 Pls
8706 3035 Pls
8797 3019 Pls
8888 2995 Pls
8980 2958 Pls
9071 2901 Pls
9162 2812 Pls
9253 2677 Pls
9344 2465 Pls
9436 2144 Pls
9527 1922 Pls
9618 2197 Pls
9709 2480 Pls
9801 2666 Pls
9892 2792 Pls
9983 2881 Pls
10074 2948 Pls
10166 3001 Pls
10257 3042 Pls
10348 3076 Pls
9716 4551 Pls
% End plot #1
1.000 UL
LTb
1225 4739 N
0 -3939 V
9123 0 V
0 3939 V
-9123 0 V
Z stroke
1.000 UP
1.000 UL
LTb
1.000 UL
LTb
1225 1457 M
63 0 V
stroke
1075 1457 M
[ [(Helvetica) 250.0 0.0 true true 0 (-50)]
] -83.3 MRshow
1.000 UL
LTb
1225 2277 M
63 0 V
stroke
1075 2277 M
[ [(Helvetica) 250.0 0.0 true true 0 ( 0)]
] -83.3 MRshow
1.000 UL
LTb
1225 3098 M
63 0 V
stroke
1075 3098 M
[ [(Helvetica) 250.0 0.0 true true 0 ( 50)]
] -83.3 MRshow
1.000 UL
LTb
1225 3918 M
63 0 V
stroke
1075 3918 M
[ [(Helvetica) 250.0 0.0 true true 0 ( 100)]
] -83.3 MRshow
1.000 UL
LTb
1225 4739 M
63 0 V
stroke
1075 4739 M
[ [(Helvetica) 250.0 0.0 true true 0 ( 150)]
] -83.3 MRshow
1.000 UL
LTb
1225 800 M
0 63 V
0 3876 R
0 -63 V
stroke
1225 550 M
[ [(Helvetica) 250.0 0.0 true true 0 ( 0)]
] -83.3 MCshow
1.000 UL
LTb
2677 800 M
0 63 V
0 3876 R
0 -63 V
stroke
2677 550 M
[ [(Helvetica) 250.0 0.0 true true 0 ( 1)]
] -83.3 MCshow
1.000 UL
LTb
4129 800 M
0 63 V
0 3876 R
0 -63 V
stroke
4129 550 M
[ [(Helvetica) 250.0 0.0 true true 0 ( 2)]
] -83.3 MCshow
1.000 UL
LTb
5581 800 M
0 63 V
0 3876 R
0 -63 V
stroke
5581 550 M
[ [(Helvetica) 250.0 0.0 true true 0 ( 3)]
] -83.3 MCshow
1.000 UL
LTb
7033 800 M
0 63 V
0 3876 R
0 -63 V
stroke
7033 550 M
[ [(Helvetica) 250.0 0.0 true true 0 ( 4)]
] -83.3 MCshow
1.000 UL
LTb
8485 800 M
0 63 V
0 3876 R
0 -63 V
stroke
8485 550 M
[ [(Helvetica) 250.0 0.0 true true 0 ( 5)]
] -83.3 MCshow
1.000 UL
LTb
9937 800 M
0 63 V
0 3876 R
0 -63 V
stroke
9937 550 M
[ [(Helvetica) 250.0 0.0 true true 0 ( 6)]
] -83.3 MCshow
1.000 UL
LTb
1.000 UL
LTb
1225 4739 N
0 -3939 V
9123 0 V
0 3939 V
-9123 0 V
Z stroke
LCb setrgbcolor
200 2769 M
currentpoint gsave translate -270 rotate 0 0 moveto
[ [(Helvetica) 250.0 0.0 true true 0 (a)]
[(Helvetica) 200.0 -75.0 true true 0 (0)]
] -58.3 MCshow
grestore
LTb
LCb setrgbcolor
5786 175 M
[ [(Helvetica) 250.0 0.0 true true 0 (Angle )]
[(Symbol) 250.0 0.0 true true 0 (q)]
[(Helvetica) 250.0 0.0 true true 0 ( around y-axis)]
] -83.3 MCshow
LTb
1.000 UP
0.00 0.00 0.00 C 10549 1864 M
currentpoint gsave translate -270 rotate 0 0 moveto
[ [(Helvetica) 250.0 0.0 true true 0 (LHC HIGGS XS WG 2013)]
] -83.3 MLshow
grestore
1.000 UL
LTb
% Begin plot #1
1.000 UP
1.000 UL
LT0
LCb setrgbcolor
9235 4551 M
[ [(Helvetica) 250.0 0.0 true true 0 (g g -> H q  )]
XYsave
[(Helvetica) 180.0 125.0 true true 0 (-)]
XYrestore
[(Helvetica) 250.0 0.0 true true 0 (q  g)]
] -108.3 MRshow
LT0
1225 3076 Pls
1316 3104 Pls
1407 3127 Pls
1499 3146 Pls
1590 3160 Pls
1681 3172 Pls
1772 3180 Pls
1864 3185 Pls
1955 3188 Pls
2046 3188 Pls
2137 3186 Pls
2229 3182 Pls
2320 3177 Pls
2411 3170 Pls
2502 3163 Pls
2593 3155 Pls
2685 3146 Pls
2776 3138 Pls
2867 3130 Pls
2958 3122 Pls
3050 3115 Pls
3141 3108 Pls
3232 3102 Pls
3323 3096 Pls
3415 3091 Pls
3506 3085 Pls
3597 3080 Pls
3688 3075 Pls
3779 3069 Pls
3871 3062 Pls
3962 3055 Pls
4053 3046 Pls
4144 3035 Pls
4236 3019 Pls
4327 2995 Pls
4418 2958 Pls
4509 2901 Pls
4601 2812 Pls
4692 2677 Pls
4783 2465 Pls
4874 2144 Pls
4965 1922 Pls
5057 2197 Pls
5148 2480 Pls
5239 2666 Pls
5330 2792 Pls
5422 2881 Pls
5513 2948 Pls
5604 3001 Pls
5695 3042 Pls
5787 3076 Pls
5878 3104 Pls
5969 3127 Pls
6060 3146 Pls
6151 3160 Pls
6243 3172 Pls
6334 3180 Pls
6425 3185 Pls
6516 3188 Pls
6608 3188 Pls
6699 3186 Pls
6790 3182 Pls
6881 3177 Pls
6972 3170 Pls
7064 3163 Pls
7155 3155 Pls
7246 3146 Pls
7337 3138 Pls
7429 3130 Pls
7520 3122 Pls
7611 3115 Pls
7702 3108 Pls
7794 3102 Pls
7885 3096 Pls
7976 3091 Pls
8067 3085 Pls
8158 3080 Pls
8250 3075 Pls
8341 3069 Pls
8432 3062 Pls
8523 3055 Pls
8615 3046 Pls
8706 3035 Pls
8797 3019 Pls
8888 2995 Pls
8980 2958 Pls
9071 2901 Pls
9162 2812 Pls
9253 2677 Pls
9344 2465 Pls
9436 2144 Pls
9527 1922 Pls
9618 2197 Pls
9709 2480 Pls
9801 2666 Pls
9892 2792 Pls
9983 2881 Pls
10074 2948 Pls
10166 3001 Pls
10257 3042 Pls
10348 3076 Pls
9716 4551 Pls
% End plot #1
% Begin plot #2
1.000 UP
1.000 UL
LT1
LCb setrgbcolor
9235 4301 M
[ [(Helvetica) 250.0 0.0 true true 0 (q )]
XYsave
[(Helvetica) 180.0 125.0 true true 0 (-)]
XYrestore
[(Helvetica) 250.0 0.0 true true 0 (q -> H q  )]
XYsave
[(Helvetica) 180.0 125.0 true true 0 (-)]
XYrestore
[(Helvetica) 250.0 0.0 true true 0 (q  g)]
] -108.3 MRshow
LT1
1225 3415 Crs
1316 3459 Crs
1407 3496 Crs
1499 3529 Crs
1590 3558 Crs
1681 3584 Crs
1772 3607 Crs
1864 3628 Crs
1955 3647 Crs
2046 3665 Crs
2137 3682 Crs
2229 3698 Crs
2320 3713 Crs
2411 3728 Crs
2502 3741 Crs
2593 3754 Crs
2685 3767 Crs
2776 3778 Crs
2867 3793 Crs
2958 3800 Crs
3050 3810 Crs
3141 3819 Crs
3232 3828 Crs
3323 3835 Crs
3415 3841 Crs
3506 3846 Crs
3597 3849 Crs
3688 3849 Crs
3779 3846 Crs
3871 3839 Crs
3962 3827 Crs
4053 3808 Crs
4144 3780 Crs
4236 3740 Crs
4327 3685 Crs
4418 3611 Crs
4509 3511 Crs
4601 3377 Crs
4692 3192 Crs
4783 2928 Crs
4874 2551 Crs
4965 2300 Crs
5057 2592 Crs
5148 2886 Crs
5239 3075 Crs
5330 3200 Crs
5422 3286 Crs
5513 3347 Crs
5604 3392 Crs
5695 3425 Crs
5787 3450 Crs
5878 3469 Crs
5969 3484 Crs
6060 3494 Crs
6151 3502 Crs
6243 3507 Crs
6334 3510 Crs
6425 3512 Crs
6516 3511 Crs
6608 3510 Crs
6699 3507 Crs
6790 3504 Crs
6881 3499 Crs
6972 3494 Crs
7064 3487 Crs
7155 3480 Crs
7246 3472 Crs
7337 3463 Crs
7429 3454 Crs
7520 3443 Crs
7611 3432 Crs
7702 3420 Crs
7794 3407 Crs
7885 3393 Crs
7976 3377 Crs
8067 3361 Crs
8158 3343 Crs
8250 3324 Crs
8341 3304 Crs
8432 3282 Crs
8523 3257 Crs
8615 3230 Crs
8706 3199 Crs
8797 3162 Crs
8888 3116 Crs
8980 3058 Crs
9071 2982 Crs
9162 2878 Crs
9253 2728 Crs
9344 2504 Crs
9436 2168 Crs
9527 1958 Crs
9618 2290 Crs
9709 2622 Crs
9801 2850 Crs
9892 3011 Crs
9983 3132 Crs
10074 3226 Crs
10166 3302 Crs
10257 3363 Crs
10348 3415 Crs
9716 4301 Crs
% End plot #2
1.000 UL
LTb
1225 4739 N
0 -3939 V
9123 0 V
0 3939 V
-9123 0 V
Z stroke
1.000 UP
1.000 UL
LTb
1.000 UL
LTb
1225 1457 M
63 0 V
stroke
1075 1457 M
[ [(Helvetica) 250.0 0.0 true true 0 (-50)]
] -83.3 MRshow
1.000 UL
LTb
1225 2277 M
63 0 V
stroke
1075 2277 M
[ [(Helvetica) 250.0 0.0 true true 0 ( 0)]
] -83.3 MRshow
1.000 UL
LTb
1225 3098 M
63 0 V
stroke
1075 3098 M
[ [(Helvetica) 250.0 0.0 true true 0 ( 50)]
] -83.3 MRshow
1.000 UL
LTb
1225 3918 M
63 0 V
stroke
1075 3918 M
[ [(Helvetica) 250.0 0.0 true true 0 ( 100)]
] -83.3 MRshow
1.000 UL
LTb
1225 4739 M
63 0 V
stroke
1075 4739 M
[ [(Helvetica) 250.0 0.0 true true 0 ( 150)]
] -83.3 MRshow
1.000 UL
LTb
1225 800 M
0 63 V
0 3876 R
0 -63 V
stroke
1225 550 M
[ [(Helvetica) 250.0 0.0 true true 0 ( 0)]
] -83.3 MCshow
1.000 UL
LTb
2677 800 M
0 63 V
0 3876 R
0 -63 V
stroke
2677 550 M
[ [(Helvetica) 250.0 0.0 true true 0 ( 1)]
] -83.3 MCshow
1.000 UL
LTb
4129 800 M
0 63 V
0 3876 R
0 -63 V
stroke
4129 550 M
[ [(Helvetica) 250.0 0.0 true true 0 ( 2)]
] -83.3 MCshow
1.000 UL
LTb
5581 800 M
0 63 V
0 3876 R
0 -63 V
stroke
5581 550 M
[ [(Helvetica) 250.0 0.0 true true 0 ( 3)]
] -83.3 MCshow
1.000 UL
LTb
7033 800 M
0 63 V
0 3876 R
0 -63 V
stroke
7033 550 M
[ [(Helvetica) 250.0 0.0 true true 0 ( 4)]
] -83.3 MCshow
1.000 UL
LTb
8485 800 M
0 63 V
0 3876 R
0 -63 V
stroke
8485 550 M
[ [(Helvetica) 250.0 0.0 true true 0 ( 5)]
] -83.3 MCshow
1.000 UL
LTb
9937 800 M
0 63 V
0 3876 R
0 -63 V
stroke
9937 550 M
[ [(Helvetica) 250.0 0.0 true true 0 ( 6)]
] -83.3 MCshow
1.000 UL
LTb
1.000 UL
LTb
1225 4739 N
0 -3939 V
9123 0 V
0 3939 V
-9123 0 V
Z stroke
LCb setrgbcolor
200 2769 M
currentpoint gsave translate -270 rotate 0 0 moveto
[ [(Helvetica) 250.0 0.0 true true 0 (a)]
[(Helvetica) 200.0 -75.0 true true 0 (0)]
] -58.3 MCshow
grestore
LTb
LCb setrgbcolor
5786 175 M
[ [(Helvetica) 250.0 0.0 true true 0 (Angle )]
[(Symbol) 250.0 0.0 true true 0 (q)]
[(Helvetica) 250.0 0.0 true true 0 ( around y-axis)]
] -83.3 MCshow
LTb
1.000 UP
0.00 0.00 0.00 C 10549 1864 M
currentpoint gsave translate -270 rotate 0 0 moveto
[ [(Helvetica) 250.0 0.0 true true 0 (LHC HIGGS XS WG 2013)]
] -83.3 MLshow
grestore
1.000 UL
LTb
% Begin plot #1
1.000 UP
1.000 UL
LT0
LCb setrgbcolor
9235 4551 M
[ [(Helvetica) 250.0 0.0 true true 0 (g g -> H q  )]
XYsave
[(Helvetica) 180.0 125.0 true true 0 (-)]
XYrestore
[(Helvetica) 250.0 0.0 true true 0 (q  g)]
] -108.3 MRshow
LT0
1225 3076 Pls
1316 3104 Pls
1407 3127 Pls
1499 3146 Pls
1590 3160 Pls
1681 3172 Pls
1772 3180 Pls
1864 3185 Pls
1955 3188 Pls
2046 3188 Pls
2137 3186 Pls
2229 3182 Pls
2320 3177 Pls
2411 3170 Pls
2502 3163 Pls
2593 3155 Pls
2685 3146 Pls
2776 3138 Pls
2867 3130 Pls
2958 3122 Pls
3050 3115 Pls
3141 3108 Pls
3232 3102 Pls
3323 3096 Pls
3415 3091 Pls
3506 3085 Pls
3597 3080 Pls
3688 3075 Pls
3779 3069 Pls
3871 3062 Pls
3962 3055 Pls
4053 3046 Pls
4144 3035 Pls
4236 3019 Pls
4327 2995 Pls
4418 2958 Pls
4509 2901 Pls
4601 2812 Pls
4692 2677 Pls
4783 2465 Pls
4874 2144 Pls
4965 1922 Pls
5057 2197 Pls
5148 2480 Pls
5239 2666 Pls
5330 2792 Pls
5422 2881 Pls
5513 2948 Pls
5604 3001 Pls
5695 3042 Pls
5787 3076 Pls
5878 3104 Pls
5969 3127 Pls
6060 3146 Pls
6151 3160 Pls
6243 3172 Pls
6334 3180 Pls
6425 3185 Pls
6516 3188 Pls
6608 3188 Pls
6699 3186 Pls
6790 3182 Pls
6881 3177 Pls
6972 3170 Pls
7064 3163 Pls
7155 3155 Pls
7246 3146 Pls
7337 3138 Pls
7429 3130 Pls
7520 3122 Pls
7611 3115 Pls
7702 3108 Pls
7794 3102 Pls
7885 3096 Pls
7976 3091 Pls
8067 3085 Pls
8158 3080 Pls
8250 3075 Pls
8341 3069 Pls
8432 3062 Pls
8523 3055 Pls
8615 3046 Pls
8706 3035 Pls
8797 3019 Pls
8888 2995 Pls
8980 2958 Pls
9071 2901 Pls
9162 2812 Pls
9253 2677 Pls
9344 2465 Pls
9436 2144 Pls
9527 1922 Pls
9618 2197 Pls
9709 2480 Pls
9801 2666 Pls
9892 2792 Pls
9983 2881 Pls
10074 2948 Pls
10166 3001 Pls
10257 3042 Pls
10348 3076 Pls
9716 4551 Pls
% End plot #1
% Begin plot #2
1.000 UP
1.000 UL
LT1
LCb setrgbcolor
9235 4301 M
[ [(Helvetica) 250.0 0.0 true true 0 (q )]
XYsave
[(Helvetica) 180.0 125.0 true true 0 (-)]
XYrestore
[(Helvetica) 250.0 0.0 true true 0 (q -> H q  )]
XYsave
[(Helvetica) 180.0 125.0 true true 0 (-)]
XYrestore
[(Helvetica) 250.0 0.0 true true 0 (q  g)]
] -108.3 MRshow
LT1
1225 3415 Crs
1316 3459 Crs
1407 3496 Crs
1499 3529 Crs
1590 3558 Crs
1681 3584 Crs
1772 3607 Crs
1864 3628 Crs
1955 3647 Crs
2046 3665 Crs
2137 3682 Crs
2229 3698 Crs
2320 3713 Crs
2411 3728 Crs
2502 3741 Crs
2593 3754 Crs
2685 3767 Crs
2776 3778 Crs
2867 3793 Crs
2958 3800 Crs
3050 3810 Crs
3141 3819 Crs
3232 3828 Crs
3323 3835 Crs
3415 3841 Crs
3506 3846 Crs
3597 3849 Crs
3688 3849 Crs
3779 3846 Crs
3871 3839 Crs
3962 3827 Crs
4053 3808 Crs
4144 3780 Crs
4236 3740 Crs
4327 3685 Crs
4418 3611 Crs
4509 3511 Crs
4601 3377 Crs
4692 3192 Crs
4783 2928 Crs
4874 2551 Crs
4965 2300 Crs
5057 2592 Crs
5148 2886 Crs
5239 3075 Crs
5330 3200 Crs
5422 3286 Crs
5513 3347 Crs
5604 3392 Crs
5695 3425 Crs
5787 3450 Crs
5878 3469 Crs
5969 3484 Crs
6060 3494 Crs
6151 3502 Crs
6243 3507 Crs
6334 3510 Crs
6425 3512 Crs
6516 3511 Crs
6608 3510 Crs
6699 3507 Crs
6790 3504 Crs
6881 3499 Crs
6972 3494 Crs
7064 3487 Crs
7155 3480 Crs
7246 3472 Crs
7337 3463 Crs
7429 3454 Crs
7520 3443 Crs
7611 3432 Crs
7702 3420 Crs
7794 3407 Crs
7885 3393 Crs
7976 3377 Crs
8067 3361 Crs
8158 3343 Crs
8250 3324 Crs
8341 3304 Crs
8432 3282 Crs
8523 3257 Crs
8615 3230 Crs
8706 3199 Crs
8797 3162 Crs
8888 3116 Crs
8980 3058 Crs
9071 2982 Crs
9162 2878 Crs
9253 2728 Crs
9344 2504 Crs
9436 2168 Crs
9527 1958 Crs
9618 2290 Crs
9709 2622 Crs
9801 2850 Crs
9892 3011 Crs
9983 3132 Crs
10074 3226 Crs
10166 3302 Crs
10257 3363 Crs
10348 3415 Crs
9716 4301 Crs
% End plot #2
% Begin plot #3
1.000 UP
1.000 UL
LT2
LCb setrgbcolor
9235 4051 M
[ [(Helvetica) 250.0 0.0 true true 0 (q )]
XYsave
[(Helvetica) 180.0 125.0 true true 0 (-)]
XYrestore
[(Helvetica) 250.0 0.0 true true 0 (q -> H q' )]
XYsave
[(Helvetica) 180.0 125.0 true true 0 (-)]
XYrestore
[(Helvetica) 250.0 0.0 true true 0 (q' g)]
] -108.3 MRshow
LT2
1225 2536 Star
1316 2574 Star
1407 2607 Star
1499 2635 Star
1590 2659 Star
1681 2681 Star
1772 2700 Star
1864 2718 Star
1955 2733 Star
2046 2747 Star
2137 2759 Star
2229 2770 Star
2320 2778 Star
2411 2785 Star
2502 2790 Star
2593 2793 Star
2685 2793 Star
2776 2790 Star
2867 2785 Star
2958 2776 Star
3050 2764 Star
3141 2749 Star
3232 2732 Star
3323 2713 Star
3415 2691 Star
3506 2668 Star
3597 2642 Star
3688 2615 Star
3779 2587 Star
3871 2556 Star
3962 2523 Star
4053 2487 Star
4144 2448 Star
4236 2403 Star
4327 2349 Star
4418 2283 Star
4509 2198 Star
4601 2084 Star
4692 1924 Star
4783 1687 Star
4874 1337 Star
4965 1106 Star
5057 1413 Star
5148 1723 Star
5239 1931 Star
5330 2076 Star
5422 2183 Star
5513 2266 Star
5604 2332 Star
5695 2387 Star
5787 2433 Star
5878 2473 Star
5969 2508 Star
6060 2539 Star
6151 2567 Star
6243 2592 Star
6334 2615 Star
6425 2636 Star
6516 2655 Star
6608 2672 Star
6699 2687 Star
6790 2701 Star
6881 2714 Star
6972 2724 Star
7064 2733 Star
7155 2741 Star
7246 2746 Star
7337 2750 Star
7429 2752 Star
7520 2752 Star
7611 2749 Star
7702 2745 Star
7794 2738 Star
7885 2729 Star
7976 2718 Star
8067 2704 Star
8158 2687 Star
8250 2668 Star
8341 2646 Star
8432 2620 Star
8523 2590 Star
8615 2556 Star
8706 2516 Star
8797 2469 Star
8888 2412 Star
8980 2342 Star
9071 2252 Star
9162 2133 Star
9253 1969 Star
9344 1731 Star
9436 1383 Star
9527 1162 Star
9618 1485 Star
9709 1807 Star
9801 2024 Star
9892 2175 Star
9983 2285 Star
10074 2370 Star
10166 2437 Star
10257 2491 Star
10348 2536 Star
9716 4051 Star
% End plot #3
1.000 UL
LTb
1225 4739 N
0 -3939 V
9123 0 V
0 3939 V
-9123 0 V
Z stroke
1.000 UP
1.000 UL
LTb
1.000 UL
LTb
1225 1457 M
63 0 V
stroke
1075 1457 M
[ [(Helvetica) 250.0 0.0 true true 0 (-50)]
] -83.3 MRshow
1.000 UL
LTb
1225 2277 M
63 0 V
stroke
1075 2277 M
[ [(Helvetica) 250.0 0.0 true true 0 ( 0)]
] -83.3 MRshow
1.000 UL
LTb
1225 3098 M
63 0 V
stroke
1075 3098 M
[ [(Helvetica) 250.0 0.0 true true 0 ( 50)]
] -83.3 MRshow
1.000 UL
LTb
1225 3918 M
63 0 V
stroke
1075 3918 M
[ [(Helvetica) 250.0 0.0 true true 0 ( 100)]
] -83.3 MRshow
1.000 UL
LTb
1225 4739 M
63 0 V
stroke
1075 4739 M
[ [(Helvetica) 250.0 0.0 true true 0 ( 150)]
] -83.3 MRshow
1.000 UL
LTb
1225 800 M
0 63 V
0 3876 R
0 -63 V
stroke
1225 550 M
[ [(Helvetica) 250.0 0.0 true true 0 ( 0)]
] -83.3 MCshow
1.000 UL
LTb
2677 800 M
0 63 V
0 3876 R
0 -63 V
stroke
2677 550 M
[ [(Helvetica) 250.0 0.0 true true 0 ( 1)]
] -83.3 MCshow
1.000 UL
LTb
4129 800 M
0 63 V
0 3876 R
0 -63 V
stroke
4129 550 M
[ [(Helvetica) 250.0 0.0 true true 0 ( 2)]
] -83.3 MCshow
1.000 UL
LTb
5581 800 M
0 63 V
0 3876 R
0 -63 V
stroke
5581 550 M
[ [(Helvetica) 250.0 0.0 true true 0 ( 3)]
] -83.3 MCshow
1.000 UL
LTb
7033 800 M
0 63 V
0 3876 R
0 -63 V
stroke
7033 550 M
[ [(Helvetica) 250.0 0.0 true true 0 ( 4)]
] -83.3 MCshow
1.000 UL
LTb
8485 800 M
0 63 V
0 3876 R
0 -63 V
stroke
8485 550 M
[ [(Helvetica) 250.0 0.0 true true 0 ( 5)]
] -83.3 MCshow
1.000 UL
LTb
9937 800 M
0 63 V
0 3876 R
0 -63 V
stroke
9937 550 M
[ [(Helvetica) 250.0 0.0 true true 0 ( 6)]
] -83.3 MCshow
1.000 UL
LTb
1.000 UL
LTb
1225 4739 N
0 -3939 V
9123 0 V
0 3939 V
-9123 0 V
Z stroke
LCb setrgbcolor
200 2769 M
currentpoint gsave translate -270 rotate 0 0 moveto
[ [(Helvetica) 250.0 0.0 true true 0 (a)]
[(Helvetica) 200.0 -75.0 true true 0 (0)]
] -58.3 MCshow
grestore
LTb
LCb setrgbcolor
5786 175 M
[ [(Helvetica) 250.0 0.0 true true 0 (Angle )]
[(Symbol) 250.0 0.0 true true 0 (q)]
[(Helvetica) 250.0 0.0 true true 0 ( around y-axis)]
] -83.3 MCshow
LTb
1.000 UP
0.00 0.00 0.00 C 10549 1864 M
currentpoint gsave translate -270 rotate 0 0 moveto
[ [(Helvetica) 250.0 0.0 true true 0 (LHC HIGGS XS WG 2013)]
] -83.3 MLshow
grestore
1.000 UL
LTb
% Begin plot #1
1.000 UP
1.000 UL
LT0
LCb setrgbcolor
9235 4551 M
[ [(Helvetica) 250.0 0.0 true true 0 (g g -> H q  )]
XYsave
[(Helvetica) 180.0 125.0 true true 0 (-)]
XYrestore
[(Helvetica) 250.0 0.0 true true 0 (q  g)]
] -108.3 MRshow
LT0
1225 3076 Pls
1316 3104 Pls
1407 3127 Pls
1499 3146 Pls
1590 3160 Pls
1681 3172 Pls
1772 3180 Pls
1864 3185 Pls
1955 3188 Pls
2046 3188 Pls
2137 3186 Pls
2229 3182 Pls
2320 3177 Pls
2411 3170 Pls
2502 3163 Pls
2593 3155 Pls
2685 3146 Pls
2776 3138 Pls
2867 3130 Pls
2958 3122 Pls
3050 3115 Pls
3141 3108 Pls
3232 3102 Pls
3323 3096 Pls
3415 3091 Pls
3506 3085 Pls
3597 3080 Pls
3688 3075 Pls
3779 3069 Pls
3871 3062 Pls
3962 3055 Pls
4053 3046 Pls
4144 3035 Pls
4236 3019 Pls
4327 2995 Pls
4418 2958 Pls
4509 2901 Pls
4601 2812 Pls
4692 2677 Pls
4783 2465 Pls
4874 2144 Pls
4965 1922 Pls
5057 2197 Pls
5148 2480 Pls
5239 2666 Pls
5330 2792 Pls
5422 2881 Pls
5513 2948 Pls
5604 3001 Pls
5695 3042 Pls
5787 3076 Pls
5878 3104 Pls
5969 3127 Pls
6060 3146 Pls
6151 3160 Pls
6243 3172 Pls
6334 3180 Pls
6425 3185 Pls
6516 3188 Pls
6608 3188 Pls
6699 3186 Pls
6790 3182 Pls
6881 3177 Pls
6972 3170 Pls
7064 3163 Pls
7155 3155 Pls
7246 3146 Pls
7337 3138 Pls
7429 3130 Pls
7520 3122 Pls
7611 3115 Pls
7702 3108 Pls
7794 3102 Pls
7885 3096 Pls
7976 3091 Pls
8067 3085 Pls
8158 3080 Pls
8250 3075 Pls
8341 3069 Pls
8432 3062 Pls
8523 3055 Pls
8615 3046 Pls
8706 3035 Pls
8797 3019 Pls
8888 2995 Pls
8980 2958 Pls
9071 2901 Pls
9162 2812 Pls
9253 2677 Pls
9344 2465 Pls
9436 2144 Pls
9527 1922 Pls
9618 2197 Pls
9709 2480 Pls
9801 2666 Pls
9892 2792 Pls
9983 2881 Pls
10074 2948 Pls
10166 3001 Pls
10257 3042 Pls
10348 3076 Pls
9716 4551 Pls
% End plot #1
% Begin plot #2
1.000 UP
1.000 UL
LT1
LCb setrgbcolor
9235 4301 M
[ [(Helvetica) 250.0 0.0 true true 0 (q )]
XYsave
[(Helvetica) 180.0 125.0 true true 0 (-)]
XYrestore
[(Helvetica) 250.0 0.0 true true 0 (q -> H q  )]
XYsave
[(Helvetica) 180.0 125.0 true true 0 (-)]
XYrestore
[(Helvetica) 250.0 0.0 true true 0 (q  g)]
] -108.3 MRshow
LT1
1225 3415 Crs
1316 3459 Crs
1407 3496 Crs
1499 3529 Crs
1590 3558 Crs
1681 3584 Crs
1772 3607 Crs
1864 3628 Crs
1955 3647 Crs
2046 3665 Crs
2137 3682 Crs
2229 3698 Crs
2320 3713 Crs
2411 3728 Crs
2502 3741 Crs
2593 3754 Crs
2685 3767 Crs
2776 3778 Crs
2867 3793 Crs
2958 3800 Crs
3050 3810 Crs
3141 3819 Crs
3232 3828 Crs
3323 3835 Crs
3415 3841 Crs
3506 3846 Crs
3597 3849 Crs
3688 3849 Crs
3779 3846 Crs
3871 3839 Crs
3962 3827 Crs
4053 3808 Crs
4144 3780 Crs
4236 3740 Crs
4327 3685 Crs
4418 3611 Crs
4509 3511 Crs
4601 3377 Crs
4692 3192 Crs
4783 2928 Crs
4874 2551 Crs
4965 2300 Crs
5057 2592 Crs
5148 2886 Crs
5239 3075 Crs
5330 3200 Crs
5422 3286 Crs
5513 3347 Crs
5604 3392 Crs
5695 3425 Crs
5787 3450 Crs
5878 3469 Crs
5969 3484 Crs
6060 3494 Crs
6151 3502 Crs
6243 3507 Crs
6334 3510 Crs
6425 3512 Crs
6516 3511 Crs
6608 3510 Crs
6699 3507 Crs
6790 3504 Crs
6881 3499 Crs
6972 3494 Crs
7064 3487 Crs
7155 3480 Crs
7246 3472 Crs
7337 3463 Crs
7429 3454 Crs
7520 3443 Crs
7611 3432 Crs
7702 3420 Crs
7794 3407 Crs
7885 3393 Crs
7976 3377 Crs
8067 3361 Crs
8158 3343 Crs
8250 3324 Crs
8341 3304 Crs
8432 3282 Crs
8523 3257 Crs
8615 3230 Crs
8706 3199 Crs
8797 3162 Crs
8888 3116 Crs
8980 3058 Crs
9071 2982 Crs
9162 2878 Crs
9253 2728 Crs
9344 2504 Crs
9436 2168 Crs
9527 1958 Crs
9618 2290 Crs
9709 2622 Crs
9801 2850 Crs
9892 3011 Crs
9983 3132 Crs
10074 3226 Crs
10166 3302 Crs
10257 3363 Crs
10348 3415 Crs
9716 4301 Crs
% End plot #2
% Begin plot #3
1.000 UP
1.000 UL
LT2
LCb setrgbcolor
9235 4051 M
[ [(Helvetica) 250.0 0.0 true true 0 (q )]
XYsave
[(Helvetica) 180.0 125.0 true true 0 (-)]
XYrestore
[(Helvetica) 250.0 0.0 true true 0 (q -> H q' )]
XYsave
[(Helvetica) 180.0 125.0 true true 0 (-)]
XYrestore
[(Helvetica) 250.0 0.0 true true 0 (q' g)]
] -108.3 MRshow
LT2
1225 2536 Star
1316 2574 Star
1407 2607 Star
1499 2635 Star
1590 2659 Star
1681 2681 Star
1772 2700 Star
1864 2718 Star
1955 2733 Star
2046 2747 Star
2137 2759 Star
2229 2770 Star
2320 2778 Star
2411 2785 Star
2502 2790 Star
2593 2793 Star
2685 2793 Star
2776 2790 Star
2867 2785 Star
2958 2776 Star
3050 2764 Star
3141 2749 Star
3232 2732 Star
3323 2713 Star
3415 2691 Star
3506 2668 Star
3597 2642 Star
3688 2615 Star
3779 2587 Star
3871 2556 Star
3962 2523 Star
4053 2487 Star
4144 2448 Star
4236 2403 Star
4327 2349 Star
4418 2283 Star
4509 2198 Star
4601 2084 Star
4692 1924 Star
4783 1687 Star
4874 1337 Star
4965 1106 Star
5057 1413 Star
5148 1723 Star
5239 1931 Star
5330 2076 Star
5422 2183 Star
5513 2266 Star
5604 2332 Star
5695 2387 Star
5787 2433 Star
5878 2473 Star
5969 2508 Star
6060 2539 Star
6151 2567 Star
6243 2592 Star
6334 2615 Star
6425 2636 Star
6516 2655 Star
6608 2672 Star
6699 2687 Star
6790 2701 Star
6881 2714 Star
6972 2724 Star
7064 2733 Star
7155 2741 Star
7246 2746 Star
7337 2750 Star
7429 2752 Star
7520 2752 Star
7611 2749 Star
7702 2745 Star
7794 2738 Star
7885 2729 Star
7976 2718 Star
8067 2704 Star
8158 2687 Star
8250 2668 Star
8341 2646 Star
8432 2620 Star
8523 2590 Star
8615 2556 Star
8706 2516 Star
8797 2469 Star
8888 2412 Star
8980 2342 Star
9071 2252 Star
9162 2133 Star
9253 1969 Star
9344 1731 Star
9436 1383 Star
9527 1162 Star
9618 1485 Star
9709 1807 Star
9801 2024 Star
9892 2175 Star
9983 2285 Star
10074 2370 Star
10166 2437 Star
10257 2491 Star
10348 2536 Star
9716 4051 Star
% End plot #3
% Begin plot #4
1.000 UP
1.000 UL
LT3
LCb setrgbcolor
9235 3801 M
[ [(Helvetica) 250.0 0.0 true true 0 (g g -> H g  g  g)]
] -83.3 MRshow
LT3
1225 2954 Box
1316 2989 Box
1407 3018 Box
1499 3045 Box
1590 3068 Box
1681 3088 Box
1772 3105 Box
1864 3120 Box
1955 3134 Box
2046 3145 Box
2137 3154 Box
2229 3162 Box
2320 3167 Box
2411 3171 Box
2502 3173 Box
2593 3174 Box
2685 3173 Box
2776 3171 Box
2867 3166 Box
2958 3161 Box
3050 3154 Box
3141 3146 Box
3232 3135 Box
3323 3123 Box
3415 3110 Box
3506 3094 Box
3597 3077 Box
3688 3059 Box
3779 3040 Box
3871 3020 Box
3962 2999 Box
4053 2977 Box
4144 2952 Box
4236 2922 Box
4327 2884 Box
4418 2833 Box
4509 2761 Box
4601 2659 Box
4692 2512 Box
4783 2292 Box
4874 1966 Box
4965 1738 Box
5057 2013 Box
5148 2304 Box
5239 2498 Box
5330 2632 Box
5422 2730 Box
5513 2805 Box
5604 2864 Box
5695 2913 Box
5787 2954 Box
5878 2989 Box
5969 3018 Box
6060 3045 Box
6151 3068 Box
6243 3088 Box
6334 3105 Box
6425 3120 Box
6516 3134 Box
6608 3145 Box
6699 3154 Box
6790 3162 Box
6881 3167 Box
6972 3171 Box
7064 3173 Box
7155 3174 Box
7246 3173 Box
7337 3171 Box
7429 3167 Box
7520 3161 Box
7611 3154 Box
7702 3146 Box
7794 3135 Box
7885 3123 Box
7976 3110 Box
8067 3094 Box
8158 3077 Box
8250 3059 Box
8341 3040 Box
8432 3020 Box
8523 2999 Box
8615 2977 Box
8706 2952 Box
8797 2922 Box
8888 2884 Box
8980 2833 Box
9071 2761 Box
9162 2659 Box
9253 2512 Box
9344 2292 Box
9436 1966 Box
9527 1738 Box
9618 2013 Box
9709 2304 Box
9801 2498 Box
9892 2632 Box
9983 2730 Box
10074 2805 Box
10166 2864 Box
10257 2913 Box
10348 2954 Box
9716 3801 Box
% End plot #4
1.000 UL
LTb
1225 4739 N
0 -3939 V
9123 0 V
0 3939 V
-9123 0 V
Z stroke
1.000 UP
1.000 UL
LTb
stroke
grestore
end
showpage
%%Trailer
%%DocumentFonts: Symbol Helvetica
