%!PS-Adobe-3.0 EPSF-3.0
%%BoundingBox: (atend)
%%LanguageLevel: 2
%%Creator: Grace-5.1.19
%%CreationDate: Tue May 28 10:53:30 2013
%%DocumentData: Clean8Bit
%%Orientation: Portrait
%%Title: CP_azimuthal_ZZ_logo.agr
%%For: user
%%DocumentNeededResources: (atend)
%%EndComments
%%BeginProlog
/m {moveto} def
/l {lineto} def
/s {stroke} def
/n {newpath} def
/c {closepath} def
/RL {rlineto} def
/SLW {setlinewidth} def
/GS {gsave} def
/GR {grestore} def
/SC {setcolor} def
/SGRY {setgray} def
/SRGB {setrgbcolor} def
/SD {setdash} def
/SLC {setlinecap} def
/SLJ {setlinejoin} def
/SCS {setcolorspace} def
/FFSF {findfont setfont} def
/CC {concat} def
/PXL {n m 0 0 RL s} def
/Color0 {1.0000 1.0000 1.0000} def
/Color1 {0.0000 0.0000 0.0000} def
/Color2 {1.0000 0.0000 0.0000} def
/Color3 {0.0000 1.0000 0.0000} def
/Color4 {0.0000 0.0000 1.0000} def
/Color5 {1.0000 1.0000 0.0000} def
/Color6 {0.7373 0.5608 0.5608} def
/Color7 {0.8627 0.8627 0.8627} def
/Color8 {0.5804 0.0000 0.8275} def
/Color9 {0.0000 1.0000 1.0000} def
/Color10 {1.0000 0.0000 1.0000} def
/Color11 {1.0000 0.6471 0.0000} def
/Color12 {0.4471 0.1294 0.7373} def
/Color13 {0.4039 0.0275 0.2824} def
/Color14 {0.2510 0.8784 0.8157} def
/Color15 {0.0000 0.5451 0.0000} def
/Color16 {0.7529 0.7529 0.7529} def
/Color17 {0.5059 0.5059 0.5059} def
/Color18 {0.2588 0.2588 0.2588} def
/Color19 {0.7529 0.7529 1.0000} def
/Color20 {0.5059 0.5059 1.0000} def
/Color21 {0.2588 0.2588 1.0000} def
/PTRN {
 /pat_bits exch def 
 <<
  /PaintType 2
  /PatternType 1 /TilingType 1
  /BBox[0 0 16 16]
  /XStep 16 /YStep 16
  /PaintProc {
   pop
   16 16 true [-1 0 0 -1 16 16] pat_bits imagemask
  }
 >>
 [0.0017 0 0 0.0017 0 0]
 makepattern
} def
/Pattern0 {<0000000000000000000000000000000000000000000000000000000000000000> PTRN} bind def
/Pattern1 {<ffffffffffffffffffffffffffffffffffffffffffffffffffffffffffffffff> PTRN} bind def
/Pattern2 {<eeeeffffbbbbffffeeeeffffbbbbffffeeeeffffbbbbffffeeeeffffbbbbffff> PTRN} bind def
/Pattern3 {<eeeebbbbeeeebbbbeeeebbbbeeeebbbbeeeebbbbeeeebbbbeeeebbbbeeeebbbb> PTRN} bind def
/Pattern4 {<5555aaaa5555aaaa5555aaaa5555aaaa5555aaaa5555aaaa5555aaaa5555aaaa> PTRN} bind def
/Pattern5 {<1111444411114444111144441111444411114444111144441111444411114444> PTRN} bind def
/Pattern6 {<1111000044440000111100004444000011110000444400001111000044440000> PTRN} bind def
/Pattern7 {<1010000000000000010100000000000010100000000000000101000000000000> PTRN} bind def
/Pattern8 {<0000000000000000000000000000000000000000000000000000000000000000> PTRN} bind def
/Pattern9 {<1e1e0f0f8787c3c3e1e1f0f078783c3c1e1e0f0f8787c3c3e1e1f0f078783c3c> PTRN} bind def
/Pattern10 {<7878f0f0e1e1c3c387870f0f1e1e3c3c7878f0f0e1e1c3c387870f0f1e1e3c3c> PTRN} bind def
/Pattern11 {<3333333333333333333333333333333333333333333333333333333333333333> PTRN} bind def
/Pattern12 {<ffffffff00000000ffffffff00000000ffffffff00000000ffffffff00000000> PTRN} bind def
/Pattern13 {<8181424224241818181824244242818181814242242418181818242442428181> PTRN} bind def
/Pattern14 {<8080404020201010080804040202010180804040202010100808040402020101> PTRN} bind def
/Pattern15 {<0101020204040808101020204040808001010202040408081010202040408080> PTRN} bind def
/Pattern16 {<2222222222222222222222222222222222222222222222222222222222222222> PTRN} bind def
/Pattern17 {<0000ffff000000000000ffff000000000000ffff000000000000ffff00000000> PTRN} bind def
/Pattern18 {<2222ffff222222222222ffff222222222222ffff222222222222ffff22222222> PTRN} bind def
/Pattern19 {<ffffffff33333333ffffffff33333333ffffffff33333333ffffffff33333333> PTRN} bind def
/Pattern20 {<0f0f0f0f0f0f0f0ff0f0f0f0f0f0f0f00f0f0f0f0f0f0f0ff0f0f0f0f0f0f0f0> PTRN} bind def
/Pattern21 {<ff00ff00ff00ff00ff00ff00ff00ff0000ff00ff00ff00ff00ff00ff00ff00ff> PTRN} bind def
/Pattern22 {<8001800180018001800180018001ffffffff8001800180018001800180018001> PTRN} bind def
/Pattern23 {<c003c003c003c003c003c003ffffffffffffffffc003c003c003c003c003c003> PTRN} bind def
/Pattern24 {<040404040404ffff404040404040ffff040404040404ffff404040404040ffff> PTRN} bind def
/Pattern25 {<180018001800180018001800ffffffff001800180018001800180018ffffffff> PTRN} bind def
/Pattern26 {<1111b8b87c7c3a3a1111a3a3c7c78b8b1111b8b87c7c3a3a1111a3a3c7c78b8b> PTRN} bind def
/Pattern27 {<101010102828c7c70101010182827c7c101010102828c7c70101010182827c7c> PTRN} bind def
/Pattern28 {<1c1c121211112121c1c12121111112121c1c121211112121c1c1212111111212> PTRN} bind def
/Pattern29 {<3e3e414180808080e3e31414080808083e3e414180808080e3e3141408080808> PTRN} bind def
/Pattern30 {<4848888884848383848488884848383848488888848483838484888848483838> PTRN} bind def
/Pattern31 {<03030404080808080c0c12122121c0c003030404080808080c0c12122121c0c0> PTRN} bind def
/ellipsedict 8 dict def
ellipsedict /mtrx matrix put
/EARC {
 ellipsedict begin
  /endangle exch def
  /startangle exch def
  /yrad exch def
  /xrad exch def
  /y exch def
  /x exch def
  /savematrix mtrx currentmatrix def
  x y translate
  xrad yrad scale
  0 0 1 startangle endangle arc
  savematrix setmatrix
 end
} def
/TL {
  /kcomp exch def
  /linewidth exch def
  /offset exch def
  GS
  0 offset rmoveto
  linewidth SLW
  dup stringwidth exch kcomp add exch RL s
  GR
} def
/KINIT
{
 /kvector exch def
 /kid 0 def
} def
/KPROC
{
 pop pop
 kvector kid get
 0 rmoveto
 /kid 1 kid add def
} def
/DefEncoding [
 /.notdef
 /.notdef
 /.notdef
 /.notdef
 /.notdef
 /.notdef
 /.notdef
 /.notdef
 /.notdef
 /.notdef
 /.notdef
 /.notdef
 /.notdef
 /.notdef
 /.notdef
 /.notdef
 /.notdef
 /.notdef
 /.notdef
 /.notdef
 /.notdef
 /.notdef
 /.notdef
 /.notdef
 /.notdef
 /.notdef
 /.notdef
 /.notdef
 /.notdef
 /.notdef
 /.notdef
 /.notdef
 /space
 /exclam
 /quotedbl
 /numbersign
 /dollar
 /percent
 /ampersand
 /quoteright
 /parenleft
 /parenright
 /asterisk
 /plus
 /comma
 /hyphen
 /period
 /slash
 /zero
 /one
 /two
 /three
 /four
 /five
 /six
 /seven
 /eight
 /nine
 /colon
 /semicolon
 /less
 /equal
 /greater
 /question
 /at
 /A
 /B
 /C
 /D
 /E
 /F
 /G
 /H
 /I
 /J
 /K
 /L
 /M
 /N
 /O
 /P
 /Q
 /R
 /S
 /T
 /U
 /V
 /W
 /X
 /Y
 /Z
 /bracketleft
 /backslash
 /bracketright
 /asciicircum
 /underscore
 /grave
 /a
 /b
 /c
 /d
 /e
 /f
 /g
 /h
 /i
 /j
 /k
 /l
 /m
 /n
 /o
 /p
 /q
 /r
 /s
 /t
 /u
 /v
 /w
 /x
 /y
 /z
 /braceleft
 /bar
 /braceright
 /asciitilde
 /.notdef
 /.notdef
 /.notdef
 /.notdef
 /.notdef
 /.notdef
 /.notdef
 /.notdef
 /.notdef
 /.notdef
 /.notdef
 /.notdef
 /.notdef
 /.notdef
 /.notdef
 /.notdef
 /.notdef
 /.notdef
 /.notdef
 /.notdef
 /.notdef
 /.notdef
 /.notdef
 /.notdef
 /.notdef
 /.notdef
 /.notdef
 /.notdef
 /.notdef
 /.notdef
 /.notdef
 /.notdef
 /.notdef
 /space
 /exclamdown
 /cent
 /sterling
 /currency
 /yen
 /brokenbar
 /section
 /dieresis
 /copyright
 /ordfeminine
 /guillemotleft
 /logicalnot
 /hyphen
 /registered
 /macron
 /degree
 /plusminus
 /twosuperior
 /threesuperior
 /acute
 /mu
 /paragraph
 /periodcentered
 /cedilla
 /onesuperior
 /ordmasculine
 /guillemotright
 /onequarter
 /onehalf
 /threequarters
 /questiondown
 /Agrave
 /Aacute
 /Acircumflex
 /Atilde
 /Adieresis
 /Aring
 /AE
 /Ccedilla
 /Egrave
 /Eacute
 /Ecircumflex
 /Edieresis
 /Igrave
 /Iacute
 /Icircumflex
 /Idieresis
 /Eth
 /Ntilde
 /Ograve
 /Oacute
 /Ocircumflex
 /Otilde
 /Odieresis
 /multiply
 /Oslash
 /Ugrave
 /Uacute
 /Ucircumflex
 /Udieresis
 /Yacute
 /Thorn
 /germandbls
 /agrave
 /aacute
 /acircumflex
 /atilde
 /adieresis
 /aring
 /ae
 /ccedilla
 /egrave
 /eacute
 /ecircumflex
 /edieresis
 /igrave
 /iacute
 /icircumflex
 /idieresis
 /eth
 /ntilde
 /ograve
 /oacute
 /ocircumflex
 /otilde
 /odieresis
 /divide
 /oslash
 /ugrave
 /uacute
 /ucircumflex
 /udieresis
 /yacute
 /thorn
 /ydieresis
] def
%%EndProlog
%%BeginSetup
%%EndSetup
594.96 594.96 scale
n
0.0000 0.0000 m
0.0000 1.0000 l
1.4151 1.0000 l
1.4151 0.0000 l
c
[/DeviceRGB] SCS
Color0 SC
fill
[/DeviceRGB] SCS
Color1 SC
[] 0 SD
0.0030 SLW
0 SLC
0 SLJ
n
0.2000 0.7637 m
0.2080 0.7626 l
0.2160 0.7592 l
0.2240 0.7537 l
0.2320 0.7462 l
0.2400 0.7368 l
0.2480 0.7255 l
0.2560 0.7125 l
0.2640 0.6982 l
0.2720 0.6827 l
0.2800 0.6662 l
0.2880 0.6491 l
0.2960 0.6315 l
0.3040 0.6137 l
0.3120 0.5961 l
0.3200 0.5790 l
0.3280 0.5625 l
0.3360 0.5471 l
0.3440 0.5327 l
0.3520 0.5198 l
0.3600 0.5085 l
0.3680 0.4990 l
0.3760 0.4915 l
0.3840 0.4860 l
0.3920 0.4827 l
0.4000 0.4815 l
0.4080 0.4827 l
0.4160 0.4860 l
0.4240 0.4915 l
0.4320 0.4990 l
0.4400 0.5085 l
0.4480 0.5198 l
0.4560 0.5327 l
0.4640 0.5471 l
0.4720 0.5625 l
0.4800 0.5790 l
0.4880 0.5961 l
0.4960 0.6137 l
0.5040 0.6315 l
0.5120 0.6491 l
0.5200 0.6662 l
0.5280 0.6827 l
0.5360 0.6982 l
0.5440 0.7125 l
0.5520 0.7255 l
0.5600 0.7368 l
0.5680 0.7462 l
0.5760 0.7537 l
0.5840 0.7592 l
0.5920 0.7626 l
0.6000 0.7637 l
0.6080 0.7626 l
0.6160 0.7592 l
0.6240 0.7537 l
0.6320 0.7462 l
0.6400 0.7368 l
0.6480 0.7255 l
0.6560 0.7125 l
0.6640 0.6982 l
0.6720 0.6827 l
0.6800 0.6662 l
0.6880 0.6491 l
0.6960 0.6315 l
0.7040 0.6137 l
0.7120 0.5961 l
0.7200 0.5790 l
0.7280 0.5625 l
0.7360 0.5471 l
0.7440 0.5327 l
0.7520 0.5198 l
0.7600 0.5085 l
0.7680 0.4990 l
0.7760 0.4915 l
0.7840 0.4860 l
0.7920 0.4827 l
0.8000 0.4815 l
0.8080 0.4827 l
0.8160 0.4860 l
0.8240 0.4915 l
0.8320 0.4990 l
0.8400 0.5085 l
0.8480 0.5198 l
0.8560 0.5327 l
0.8640 0.5471 l
0.8720 0.5625 l
0.8800 0.5790 l
0.8880 0.5961 l
0.8960 0.6137 l
0.9040 0.6315 l
0.9120 0.6491 l
0.9200 0.6662 l
0.9280 0.6827 l
0.9360 0.6982 l
0.9440 0.7125 l
0.9520 0.7255 l
0.9600 0.7368 l
0.9680 0.7462 l
0.9760 0.7537 l
0.9840 0.7592 l
0.9920 0.7626 l
1.0000 0.7637 l
s
[/DeviceRGB] SCS
Color2 SC
[0.0150 0.0090 ] 0 SD
0.0030 SLW
n
0.2000 0.6377 m
0.2080 0.6607 l
0.2160 0.6831 l
0.2240 0.7046 l
0.2320 0.7248 l
0.2400 0.7433 l
0.2480 0.7600 l
0.2560 0.7745 l
0.2640 0.7866 l
0.2720 0.7961 l
0.2800 0.8029 l
0.2880 0.8068 l
0.2960 0.8078 l
0.3040 0.8060 l
0.3120 0.8012 l
0.3200 0.7935 l
0.3280 0.7832 l
0.3360 0.7704 l
0.3440 0.7552 l
0.3520 0.7380 l
0.3600 0.7189 l
0.3680 0.6983 l
0.3760 0.6766 l
0.3840 0.6539 l
0.3920 0.6308 l
0.4000 0.6075 l
0.4080 0.5845 l
0.4160 0.5621 l
0.4240 0.5406 l
0.4320 0.5204 l
0.4400 0.5019 l
0.4480 0.4852 l
0.4560 0.4708 l
0.4640 0.4586 l
0.4720 0.4491 l
0.4800 0.4423 l
0.4880 0.4384 l
0.4960 0.4374 l
0.5040 0.4393 l
0.5120 0.4441 l
0.5200 0.4517 l
0.5280 0.4620 l
0.5360 0.4748 l
0.5440 0.4900 l
0.5520 0.5072 l
0.5600 0.5263 l
0.5680 0.5469 l
0.5760 0.5687 l
0.5840 0.5913 l
0.5920 0.6144 l
0.6000 0.6377 l
0.6080 0.6607 l
0.6160 0.6831 l
0.6240 0.7046 l
0.6320 0.7248 l
0.6400 0.7433 l
0.6480 0.7600 l
0.6560 0.7745 l
0.6640 0.7866 l
0.6720 0.7961 l
0.6800 0.8029 l
0.6880 0.8068 l
0.6960 0.8078 l
0.7040 0.8060 l
0.7120 0.8012 l
0.7200 0.7935 l
0.7280 0.7832 l
0.7360 0.7704 l
0.7440 0.7552 l
0.7520 0.7380 l
0.7600 0.7189 l
0.7680 0.6983 l
0.7760 0.6766 l
0.7840 0.6539 l
0.7920 0.6308 l
0.8000 0.6075 l
0.8080 0.5845 l
0.8160 0.5621 l
0.8240 0.5406 l
0.8320 0.5204 l
0.8400 0.5019 l
0.8480 0.4852 l
0.8560 0.4708 l
0.8640 0.4586 l
0.8720 0.4491 l
0.8800 0.4423 l
0.8880 0.4384 l
0.8960 0.4374 l
0.9040 0.4393 l
0.9120 0.4441 l
0.9200 0.4517 l
0.9280 0.4620 l
0.9360 0.4748 l
0.9440 0.4900 l
0.9520 0.5072 l
0.9600 0.5263 l
0.9680 0.5469 l
0.9760 0.5687 l
0.9840 0.5913 l
0.9920 0.6144 l
1.0000 0.6377 l
s
[/DeviceRGB] SCS
Color1 SC
[] 0 SD
0.0015 SLW
n
0.2000 0.2800 m
1.0000 0.2800 l
s
n
0.2000 0.9800 m
1.0000 0.9800 l
s
n
0.2400 0.2800 m
0.2400 0.2900 l
s
n
0.2400 0.9800 m
0.2400 0.9700 l
s
n
0.2800 0.2800 m
0.2800 0.2900 l
s
n
0.2800 0.9800 m
0.2800 0.9700 l
s
n
0.3200 0.2800 m
0.3200 0.2900 l
s
n
0.3200 0.9800 m
0.3200 0.9700 l
s
n
0.3600 0.2800 m
0.3600 0.2900 l
s
n
0.3600 0.9800 m
0.3600 0.9700 l
s
n
0.4400 0.2800 m
0.4400 0.2900 l
s
n
0.4400 0.9800 m
0.4400 0.9700 l
s
n
0.4800 0.2800 m
0.4800 0.2900 l
s
n
0.4800 0.9800 m
0.4800 0.9700 l
s
n
0.5200 0.2800 m
0.5200 0.2900 l
s
n
0.5200 0.9800 m
0.5200 0.9700 l
s
n
0.5600 0.2800 m
0.5600 0.2900 l
s
n
0.5600 0.9800 m
0.5600 0.9700 l
s
n
0.6400 0.2800 m
0.6400 0.2900 l
s
n
0.6400 0.9800 m
0.6400 0.9700 l
s
n
0.6800 0.2800 m
0.6800 0.2900 l
s
n
0.6800 0.9800 m
0.6800 0.9700 l
s
n
0.7200 0.2800 m
0.7200 0.2900 l
s
n
0.7200 0.9800 m
0.7200 0.9700 l
s
n
0.7600 0.2800 m
0.7600 0.2900 l
s
n
0.7600 0.9800 m
0.7600 0.9700 l
s
n
0.8400 0.2800 m
0.8400 0.2900 l
s
n
0.8400 0.9800 m
0.8400 0.9700 l
s
n
0.8800 0.2800 m
0.8800 0.2900 l
s
n
0.8800 0.9800 m
0.8800 0.9700 l
s
n
0.9200 0.2800 m
0.9200 0.2900 l
s
n
0.9200 0.9800 m
0.9200 0.9700 l
s
n
0.9600 0.2800 m
0.9600 0.2900 l
s
n
0.9600 0.9800 m
0.9600 0.9700 l
s
n
0.2000 0.2800 m
0.2000 0.3000 l
s
n
0.2000 0.9800 m
0.2000 0.9600 l
s
n
0.4000 0.2800 m
0.4000 0.3000 l
s
n
0.4000 0.9800 m
0.4000 0.9600 l
s
n
0.6000 0.2800 m
0.6000 0.3000 l
s
n
0.6000 0.9800 m
0.6000 0.9600 l
s
n
0.8000 0.2800 m
0.8000 0.3000 l
s
n
0.8000 0.9800 m
0.8000 0.9600 l
s
n
1.0000 0.2800 m
1.0000 0.3000 l
s
n
1.0000 0.9800 m
1.0000 0.9600 l
s
/Times-Roman findfont
dup length dict begin
 {1 index /FID ne {def} {pop pop} ifelse} forall
 /Encoding DefEncoding def
 currentdict
end
/Font0 exch definefont pop
/Font0 FFSF
0.1794 0.2474 m
GS
[0.0336 0.0000 0.0000 0.0336 0 0] CC
(0.0) show
GR
/Font0 FFSF
0.3802 0.2470 m
GS
[0.0336 0.0000 0.0000 0.0336 0 0] CC
(0.5) show
GR
/Font0 FFSF
0.5794 0.2474 m
GS
[0.0336 0.0000 0.0000 0.0336 0 0] CC
(1.0) show
GR
/Font0 FFSF
0.7802 0.2470 m
GS
[0.0336 0.0000 0.0000 0.0336 0 0] CC
(1.5) show
GR
/Font0 FFSF
0.9794 0.2474 m
GS
[0.0336 0.0000 0.0000 0.0336 0 0] CC
(2.0) show
GR
/Symbol findfont
/Font12 exch definefont pop
/Font12 FFSF
0.5722 0.1903 m
GS
[0.0420 0.0000 0.0000 0.0420 0 0] CC
(f/p) show
GR
n
0.2000 0.2800 m
0.2000 0.9800 l
s
n
1.0000 0.2800 m
1.0000 0.9800 l
s
n
0.2000 0.3150 m
0.2100 0.3150 l
s
n
1.0000 0.3150 m
0.9900 0.3150 l
s
n
0.2000 0.3500 m
0.2100 0.3500 l
s
n
1.0000 0.3500 m
0.9900 0.3500 l
s
n
0.2000 0.3850 m
0.2100 0.3850 l
s
n
1.0000 0.3850 m
0.9900 0.3850 l
s
n
0.2000 0.4200 m
0.2100 0.4200 l
s
n
1.0000 0.4200 m
0.9900 0.4200 l
s
n
0.2000 0.4900 m
0.2100 0.4900 l
s
n
1.0000 0.4900 m
0.9900 0.4900 l
s
n
0.2000 0.5250 m
0.2100 0.5250 l
s
n
1.0000 0.5250 m
0.9900 0.5250 l
s
n
0.2000 0.5600 m
0.2100 0.5600 l
s
n
1.0000 0.5600 m
0.9900 0.5600 l
s
n
0.2000 0.5950 m
0.2100 0.5950 l
s
n
1.0000 0.5950 m
0.9900 0.5950 l
s
n
0.2000 0.6650 m
0.2100 0.6650 l
s
n
1.0000 0.6650 m
0.9900 0.6650 l
s
n
0.2000 0.7000 m
0.2100 0.7000 l
s
n
1.0000 0.7000 m
0.9900 0.7000 l
s
n
0.2000 0.7350 m
0.2100 0.7350 l
s
n
1.0000 0.7350 m
0.9900 0.7350 l
s
n
0.2000 0.7700 m
0.2100 0.7700 l
s
n
1.0000 0.7700 m
0.9900 0.7700 l
s
n
0.2000 0.8400 m
0.2100 0.8400 l
s
n
1.0000 0.8400 m
0.9900 0.8400 l
s
n
0.2000 0.8750 m
0.2100 0.8750 l
s
n
1.0000 0.8750 m
0.9900 0.8750 l
s
n
0.2000 0.9100 m
0.2100 0.9100 l
s
n
1.0000 0.9100 m
0.9900 0.9100 l
s
n
0.2000 0.9450 m
0.2100 0.9450 l
s
n
1.0000 0.9450 m
0.9900 0.9450 l
s
n
0.2000 0.2800 m
0.2200 0.2800 l
s
n
1.0000 0.2800 m
0.9800 0.2800 l
s
n
0.2000 0.4550 m
0.2200 0.4550 l
s
n
1.0000 0.4550 m
0.9800 0.4550 l
s
n
0.2000 0.6300 m
0.2200 0.6300 l
s
n
1.0000 0.6300 m
0.9800 0.6300 l
s
n
0.2000 0.8050 m
0.2200 0.8050 l
s
n
1.0000 0.8050 m
0.9800 0.8050 l
s
n
0.2000 0.9800 m
0.2200 0.9800 l
s
n
1.0000 0.9800 m
0.9800 0.9800 l
s
/Font0 FFSF
0.1319 0.2689 m
GS
[0.0336 0.0000 0.0000 0.0336 0 0] CC
(0.12) show
GR
/Font0 FFSF
0.1323 0.4439 m
GS
[0.0336 0.0000 0.0000 0.0336 0 0] CC
(0.14) show
GR
/Font0 FFSF
0.1323 0.6187 m
GS
[0.0336 0.0000 0.0000 0.0336 0 0] CC
(0.16) show
GR
/Font0 FFSF
0.1331 0.7939 m
GS
[0.0336 0.0000 0.0000 0.0336 0 0] CC
(0.18) show
GR
/Font0 FFSF
0.1319 0.9689 m
GS
[0.0336 0.0000 0.0000 0.0336 0 0] CC
(0.20) show
GR
/Font0 FFSF
0.0897 0.5459 m
GS
[0.0000 0.0420 -0.0420 0.0000 0 0] CC
(1/) show
GR
/Font12 FFSF
0.0897 0.5786 m
GS
[0.0000 0.0420 -0.0420 0.0000 0 0] CC
(G ) show
GR
/Font0 FFSF
0.0897 0.6145 m
GS
[0.0000 0.0420 -0.0420 0.0000 0 0] CC
(d) show
GR
/Font12 FFSF
0.0897 0.6354 m
GS
[0.0000 0.0420 -0.0420 0.0000 0 0] CC
(G/) show
GR
/Font0 FFSF
0.0897 0.6726 m
GS
[0.0000 0.0420 -0.0420 0.0000 0 0] CC
(d) show
GR
/Font12 FFSF
0.0897 0.6935 m
GS
[0.0000 0.0420 -0.0420 0.0000 0 0] CC
(f) show
GR
n
0.2000 0.2800 m
0.2000 0.9800 l
1.0000 0.9800 l
1.0000 0.2800 l
0.2000 0.2800 l
c
s
n
0.3000 0.4000 m
0.3000 0.3200 l
0.4908 0.3200 l
0.4908 0.4000 l
c
[/DeviceRGB] SCS
Color0 SC
fill
/Font0 FFSF
[/DeviceRGB] SCS
Color1 SC
0.3715 0.3710 m
GS
[0.0280 0.0000 0.0000 0.0280 0 0] CC
(SM \() show
GR
/Font12 FFSF
0.4284 0.3710 m
GS
[0.0280 0.0000 0.0000 0.0280 0 0] CC
(c=0\)) show
GR
[] 0 SD
0.0030 SLW
n
0.3115 0.3777 m
0.3515 0.3777 l
s
/Font12 FFSF
0.3784 0.3356 m
GS
[0.0280 0.0000 0.0000 0.0280 0 0] CC
(c) show
GR
/Font0 FFSF
0.3937 0.3356 m
GS
[0.0280 0.0000 0.0000 0.0280 0 0] CC
( = 2) show
GR
/Font12 FFSF
0.4377 0.3356 m
GS
[0.0280 0.0000 0.0000 0.0280 0 0] CC
(p/5) show
GR
[/DeviceRGB] SCS
Color2 SC
[0.0150 0.0090 ] 0 SD
0.0030 SLW
n
0.3115 0.3427 m
0.3515 0.3427 l
s
/Font0 FFSF
[/DeviceRGB] SCS
Color4 SC
0.6771 0.9122 m
GS
[0.0280 0.0000 0.0000 0.0280 0 0] CC
(H) show
GR
/Courier findfont
dup length dict begin
 {1 index /FID ne {def} {pop pop} ifelse} forall
 /Encoding DefEncoding def
 currentdict
end
/Font8 exch definefont pop
/Font8 FFSF
0.6973 0.9178 m
GS
[0.0280 0.0000 0.0000 0.0280 0 0] CC
(') show
GR
/Font0 FFSF
0.7142 0.9122 m
GS
[0.0280 0.0000 0.0000 0.0280 0 0] CC
(-) show
GR
/Font0 FFSF
0.7179 0.9122 m
GS
[0.0280 0.0000 0.0000 0.0280 0 0] CC
(-) show
GR
/Font0 FFSF
0.7216 0.9122 m
GS
[0.0280 0.0000 0.0000 0.0280 0 0] CC
(-) show
GR
/Font0 FFSF
0.7225 0.9122 m
GS
[0.0280 0.0000 0.0000 0.0280 0 0] CC
(> Z) show
GR
/Font0 FFSF
0.7624 0.9290 m
GS
[0.0198 0.0000 0.0000 0.0198 0 0] CC
(*) show
GR
/Font0 FFSF
0.7725 0.9122 m
GS
[0.0280 0.0000 0.0000 0.0280 0 0] CC
(Z -) show
GR
/Font0 FFSF
0.8004 0.9122 m
GS
[0.0280 0.0000 0.0000 0.0280 0 0] CC
(-) show
GR
/Font0 FFSF
0.8040 0.9122 m
GS
[0.0280 0.0000 0.0000 0.0280 0 0] CC
(-) show
GR
/Font0 FFSF
0.8049 0.9122 m
GS
[0.0280 0.0000 0.0000 0.0280 0 0] CC
(>  \(l) show
GR
/Font0 FFSF
0.8517 0.9290 m
GS
[0.0198 0.0000 0.0000 0.0198 0 0] CC
(-) show
GR
/Font0 FFSF
0.8522 0.9010 m
GS
[0.0198 0.0000 0.0000 0.0198 0 0] CC
(1) show
GR
/Font0 FFSF
0.8623 0.9122 m
GS
[0.0280 0.0000 0.0000 0.0280 0 0] CC
(l) show
GR
/Font0 FFSF
0.8700 0.9290 m
GS
[0.0198 0.0000 0.0000 0.0198 0 0] CC
(+) show
GR
/Font0 FFSF
0.8753 0.9010 m
GS
[0.0198 0.0000 0.0000 0.0198 0 0] CC
(1) show
GR
/Font0 FFSF
0.8854 0.9122 m
GS
[0.0280 0.0000 0.0000 0.0280 0 0] CC
(\) \(l) show
GR
/Font0 FFSF
0.9189 0.9290 m
GS
[0.0198 0.0000 0.0000 0.0198 0 0] CC
(-) show
GR
/Font0 FFSF
0.9194 0.9010 m
GS
[0.0198 0.0000 0.0000 0.0198 0 0] CC
(2) show
GR
/Font0 FFSF
0.9295 0.9122 m
GS
[0.0280 0.0000 0.0000 0.0280 0 0] CC
(l) show
GR
/Font0 FFSF
0.9372 0.9290 m
GS
[0.0198 0.0000 0.0000 0.0198 0 0] CC
(+) show
GR
/Font0 FFSF
0.9425 0.9010 m
GS
[0.0198 0.0000 0.0000 0.0198 0 0] CC
(2) show
GR
/Font0 FFSF
0.9526 0.9122 m
GS
[0.0280 0.0000 0.0000 0.0280 0 0] CC
(\)) show
GR
/Font0 FFSF
0.7743 0.8668 m
GS
[0.0280 0.0000 0.0000 0.0280 0 0] CC
(M) show
GR
/Font0 FFSF
0.7993 0.8556 m
GS
[0.0198 0.0000 0.0000 0.0198 0 0] CC
(H) show
GR
/Font8 FFSF
0.8134 0.8615 m
GS
[0.0198 0.0000 0.0000 0.0198 0 0] CC
(') show
GR
/Font0 FFSF
0.8251 0.8668 m
GS
[0.0280 0.0000 0.0000 0.0280 0 0] CC
( = 125 GeV) show
GR
/Font0 FFSF
[/DeviceRGB] SCS
Color1 SC
0.2618 0.9107 m
GS
[0.0364 0.0000 0.0000 0.0364 0 0] CC
(\(b\)) show
GR
/Helvetica-BoldOblique findfont
dup length dict begin
 {1 index /FID ne {def} {pop pop} ifelse} forall
 /Encoding DefEncoding def
 currentdict
end
/Font7 exch definefont pop
/Font7 FFSF
1.0340 0.7320 m
GS
[0.0000 0.0210 -0.0210 0.0000 0 0] CC
(LHC HIGGS XS WG 2013) show
GR
%%Trailer
%%BoundingBox: 35 106 617 591
%%DocumentNeededResources: font Times-Roman
%%+ font Helvetica-BoldOblique
%%+ font Courier
%%+ font Symbol
%%EOF
