%!PS-Adobe-2.0 EPSF-2.0
%%BoundingBox:  0 0 567 544
%%Title: HWW_600_met_rel_reweighting_cut_YR3.eps: HWW 600Gev MET rel reweighting for interference with cuts
%%Creator: ROOT Version 5.34/05
%%CreationDate: Fri Jun 14 04:56:11 2013
%%EndComments
%%BeginProlog
80 dict begin
/s {stroke} def /l {lineto} def /m {moveto} def /t {translate} def
/r {rotate} def /rl {roll}  def /R {repeat} def
/d {rlineto} def /rm {rmoveto} def /gr {grestore} def /f {eofill} def
/c {setrgbcolor} def /black {0 setgray} def /sd {setdash} def
/cl {closepath} def /sf {scalefont setfont} def /lw {setlinewidth} def
/box {m dup 0 exch d exch 0 d 0 exch neg d cl} def
/NC{systemdict begin initclip end}def/C{NC box clip newpath}def
/bl {box s} def /bf {box f} def /Y { 0 exch d} def /X { 0 d} def 
/K {{pop pop 0 moveto} exch kshow} bind def
/ita {/ang 15 def gsave [1 0 ang dup sin exch cos div 1 0 0] concat} def 
/mp {newpath /y exch def /x exch def} def
/side {[w .77 mul w .23 mul] .385 w mul sd w 0 l currentpoint t -144 r} def
/mr {mp x y w2 0 360 arc} def /m24 {mr s} def /m20 {mr f} def
/mb {mp x y w2 add m w2 neg 0 d 0 w neg d w 0 d 0 w d cl} def
/mt {mp x y w2 add m w2 neg w neg d w 0 d cl} def
/m21 {mb f} def /m25 {mb s} def /m22 {mt f} def /m26{mt s} def
/m23 {mp x y w2 sub m w2 w d w neg 0 d cl f} def
/m27 {mp x y w2 add m w3 neg w2 neg d w3 w2 neg d w3 w2 d cl s} def
/m28 {mp x w2 sub y w2 sub w3 add m w3 0 d  0 w3 neg d w3 0 d 0 w3 d w3 0 d  0 w3 d w3 neg 0 d 0 w3 d w3 neg 0 d 0 w3 neg d w3 neg 0 d cl s } def
/m29 {mp gsave x w2 sub y w2 add w3 sub m currentpoint t 4 {side} repeat cl fill gr} def
/m30 {mp gsave x w2 sub y w2 add w3 sub m currentpoint t 4 {side} repeat cl s gr} def
/m31 {mp x y w2 sub m 0 w d x w2 sub y m w 0 d x w2 sub y w2 add m w w neg d x w2 sub y w2 sub m w w d s} def
/m32 {mp x y w2 sub m w2 w d w neg 0 d cl s} def
/m33 {mp x y w2 add m w3 neg w2 neg d w3 w2 neg d w3 w2 d cl f} def
/m34 {mp x w2 sub y w2 sub w3 add m w3 0 d  0 w3 neg d w3 0 d 0 w3 d w3 0 d  0 w3 d w3 neg 0 d 0 w3 d w3 neg 0 d 0 w3 neg d w3 neg 0 d cl f } def
/m2 {mp x y w2 sub m 0 w d x w2 sub y m w 0 d s} def
/m5 {mp x w2 sub y w2 sub m w w d x w2 sub y w2 add m w w neg d s} def
/reEncode {exch findfont dup length dict begin {1 index /FID eq  {pop pop} {def} ifelse } forall /Encoding exch def currentdict end dup /FontName get exch definefont pop } def [/Times-Bold /Times-Italic /Times-BoldItalic /Helvetica /Helvetica-Oblique
 /Helvetica-Bold /Helvetica-BoldOblique /Courier /Courier-Oblique /Courier-Bold /Courier-BoldOblique /Times-Roman /AvantGarde-Book /AvantGarde-BookOblique /AvantGarde-Demi /AvantGarde-DemiOblique /Bookman-Demi /Bookman-DemiItalic /Bookman-Light
 /Bookman-LightItalic /Helvetica-Narrow /Helvetica-Narrow-Bold /Helvetica-Narrow-BoldOblique /Helvetica-Narrow-Oblique /NewCenturySchlbk-Roman /NewCenturySchlbk-Bold /NewCenturySchlbk-BoldItalic /NewCenturySchlbk-Italic /Palatino-Bold
 /Palatino-BoldItalic /Palatino-Italic /Palatino-Roman ] {ISOLatin1Encoding reEncode } forall
%%EndProlog
%%BeginSetup
%%EndSetup
newpath  gsave  .25 .25 scale  gsave  0 0 t black[  ] 0 sd 3 lw 1 1 1 c 2268 2177 0 0 bf black 1 1 1 c 2268 1568 0 609 bf black 1 1 1 c 1814 1411 227 609 bf black 1814 1411 227 609 bl 0 0 1 c 1 1 1 c 0 0 1 c 227 1097 m 18 X 3 Y 18 X 7 Y 18 X -5 Y 18
 X 17 Y 18 X 7 Y 19 X 15 Y 18 X 10 Y 18 X 24 Y 18 X 14 Y 18 X 17 Y 18 X 22 Y 18 X 18 Y 19 X 10 Y 18 X 14 Y 18 X 8 Y 18 X 25 Y 18 X 17 Y 18 X 29 Y 18 X 18 Y 19 X 44 Y 18 X 55 Y 18 X 247 Y 18 X 187 Y 18 X 16 Y 18 X -6 Y 18 X 21 Y 19 X 3 Y 36 X 12 Y 18
 X 2 Y 18 X 4 Y 18 X -7 Y 18 X 8 Y 19 X -20 Y 18 X -15 Y 18 X -17 Y 18 X -53 Y 18 X -50 Y 18 X -85 Y 18 X -134 Y 19 X -108 Y 18 X -87 Y 18 X -77 Y 18 X -74 Y 18 X -54 Y 18 X -52 Y 18 X -45 Y 19 X -45 Y 18 X -35 Y 18 X -32 Y 18 X -38 Y 18 X -26 Y 18 X
 -25 Y 18 X -27 Y 19 X -19 Y 18 X -21 Y 18 X -21 Y 18 X -13 Y 18 X -14 Y 18 X -13 Y 18 X -11 Y 19 X -13 Y 18 X -12 Y 18 X -9 Y 18 X -6 Y 18 X -10 Y 18 X -6 Y 18 X -8 Y 19 X -5 Y 18 X -4 Y 18 X -7 Y 18 X -3 Y 18 X -6 Y 18 X -3 Y 18 X -3 Y 19 X -4 Y 18
 X -3 Y 18 X -2 Y 18 X -3 Y 18 X -2 Y 18 X -3 Y 18 X -1 Y 19 X -2 Y 18 X -1 Y 18 X -1 Y 18 X -2 Y 18 X -2 Y 18 X -1 Y 18 X -1 Y 37 X -1 Y 18 X -1 Y 18 X -1 Y 18 X -1 Y 36 X -1 Y 55 X -1 Y 18 X s black 227 609 m 1814 X s 227 647 m -38 Y s 272 628 m
 -19 Y s 317 628 m -19 Y s 363 628 m -19 Y s 408 647 m -38 Y s 454 628 m -19 Y s 499 628 m -19 Y s 544 628 m -19 Y s 590 647 m -38 Y s 635 628 m -19 Y s 680 628 m -19 Y s 726 628 m -19 Y s 771 647 m -38 Y s 816 628 m -19 Y s 862 628 m -19 Y s 907 628
 m -19 Y s 952 647 m -38 Y s 998 628 m -19 Y s 1043 628 m -19 Y s 1089 628 m -19 Y s 1134 647 m -38 Y s 1179 628 m -19 Y s 1225 628 m -19 Y s 1270 628 m -19 Y s 1315 647 m -38 Y s 1361 628 m -19 Y s 1406 628 m -19 Y s 1451 628 m -19 Y s 1497 647 m
 -38 Y s 1542 628 m -19 Y s 1587 628 m -19 Y s 1633 628 m -19 Y s 1678 647 m -38 Y s 1723 628 m -19 Y s 1769 628 m -19 Y s 1814 628 m -19 Y s 1860 647 m -38 Y s 1905 628 m -19 Y s 1950 628 m -19 Y s 1996 628 m -19 Y s 2041 647 m -38 Y s
 gsave  2268 1568 0 609 C 208.919 558.382 t 0 r /Helvetica findfont 49.4479 sf 0 0 m (0) show NC gr 
 gsave  2268 1568 0 609 C 379.852 558.382 t 0 r /Helvetica findfont 49.4479 sf 0 0 m (20) show NC gr 
 gsave  2268 1568 0 609 C 562.181 558.382 t 0 r /Helvetica findfont 49.4479 sf 0 0 m (40) show NC gr 
 gsave  2268 1568 0 609 C 740.711 558.382 t 0 r /Helvetica findfont 49.4479 sf 0 0 m (60) show NC gr 
 gsave  2268 1568 0 609 C 923.04 558.382 t 0 r /Helvetica findfont 49.4479 sf 0 0 m (80) show NC gr 
 gsave  2268 1568 0 609 C 1090.18 558.382 t 0 r /Helvetica findfont 49.4479 sf 0 0 m (100) show NC gr 
 gsave  2268 1568 0 609 C 1272.5 558.382 t 0 r /Helvetica findfont 49.4479 sf 0 0 m (120) show NC gr 
 gsave  2268 1568 0 609 C 1454.83 558.382 t 0 r /Helvetica findfont 49.4479 sf 0 0 m (140) show NC gr 
 gsave  2268 1568 0 609 C 1633.36 558.382 t 0 r /Helvetica findfont 49.4479 sf 0 0 m (160) show NC gr 
 gsave  2268 1568 0 609 C 1815.69 558.382 t 0 r /Helvetica findfont 49.4479 sf 0 0 m (180) show NC gr 
 gsave  2268 1568 0 609 C 1998.02 558.382 t 0 r /Helvetica findfont 49.4479 sf 0 0 m (200) show NC gr  227 609 m 1411 Y s
 gsave  2268 1568 0 609 C 68.3734 1348.47 t 90 r /Helvetica findfont 34.2332 sf 0 0 m (T,rel) show NC gr 
 gsave  2268 1568 0 609 C 22.7911 1348.47 t 90 r /Helvetica findfont 34.2332 sf 0 0 m (miss) show NC gr 
 gsave  2268 1568 0 609 C 49.3808 1272.5 t 90 r /Helvetica findfont 49.4479 sf 0 0 m (/dE) show NC gr 
 gsave  2268 1568 0 609 C 49.3808 1242.12 t 90 r /Symbol findfont 49.4479 sf 0 0 m (s) show NC gr 
 gsave  2268 1568 0 609 C 49.3808 1215.53 t 90 r /Helvetica findfont 49.4479 sf 0 0 m (d) show NC gr  288 609 m -61 X s 257 641 m -30 X s 257 673 m -30 X s 257 704 m -30 X s 288 736 m -61 X s 257 767 m -30 X s 257 799 m -30 X s 257 830 m -30 X s 288
 862 m -61 X s 257 894 m -30 X s 257 925 m -30 X s 257 957 m -30 X s 288 988 m -61 X s 257 1020 m -30 X s 257 1051 m -30 X s 257 1083 m -30 X s 288 1115 m -61 X s 257 1146 m -30 X s 257 1178 m -30 X s 257 1209 m -30 X s 288 1241 m -61 X s 257 1272 m
 -30 X s 257 1304 m -30 X s 257 1335 m -30 X s 288 1367 m -61 X s 257 1399 m -30 X s 257 1430 m -30 X s 257 1462 m -30 X s 288 1493 m -61 X s 257 1525 m -30 X s 257 1556 m -30 X s 257 1588 m -30 X s 288 1620 m -61 X s 257 1651 m -30 X s 257 1683 m
 -30 X s 257 1714 m -30 X s 288 1746 m -61 X s 257 1777 m -30 X s 257 1809 m -30 X s 257 1841 m -30 X s 288 1872 m -61 X s 257 1904 m -30 X s 257 1935 m -30 X s 257 1967 m -30 X s 288 1998 m -61 X s 288 1998 m -61 X s
 gsave  2268 1568 0 609 C 186.127 592.569 t 0 r /Helvetica findfont 49.4479 sf 0 0 m (0) show NC gr 
 gsave  2268 1568 0 609 C 91.1645 717.92 t 0 r /Helvetica findfont 49.4479 sf 0 0 m (0.002) show NC gr 
 gsave  2268 1568 0 609 C 87.366 843.271 t 0 r /Helvetica findfont 49.4479 sf 0 0 m (0.004) show NC gr 
 gsave  2268 1568 0 609 C 91.1645 972.421 t 0 r /Helvetica findfont 49.4479 sf 0 0 m (0.006) show NC gr 
 gsave  2268 1568 0 609 C 91.1645 1097.77 t 0 r /Helvetica findfont 49.4479 sf 0 0 m (0.008) show NC gr 
 gsave  2268 1568 0 609 C 125.351 1223.12 t 0 r /Helvetica findfont 49.4479 sf 0 0 m (0.01) show NC gr 
 gsave  2268 1568 0 609 C 91.1645 1348.47 t 0 r /Helvetica findfont 49.4479 sf 0 0 m (0.012) show NC gr 
 gsave  2268 1568 0 609 C 87.366 1477.62 t 0 r /Helvetica findfont 49.4479 sf 0 0 m (0.014) show NC gr 
 gsave  2268 1568 0 609 C 91.1645 1602.98 t 0 r /Helvetica findfont 49.4479 sf 0 0 m (0.016) show NC gr 
 gsave  2268 1568 0 609 C 91.1645 1728.33 t 0 r /Helvetica findfont 49.4479 sf 0 0 m (0.018) show NC gr 
 gsave  2268 1568 0 609 C 117.754 1853.68 t 0 r /Helvetica findfont 49.4479 sf 0 0 m (0.02) show NC gr 
 gsave  2268 1568 0 609 C 91.1645 1982.83 t 0 r /Helvetica findfont 49.4479 sf 0 0 m (0.022) show NC gr  0 0 1 c /w 2 def /w2 {w 2 div} def /w3 {w 3 div} def 236 1097 m20 254 1100 m20 272 1107 m20 290 1102 m20 308 1119 m20 327 1126 m20 345 1141 m20
 363 1151 m20 381 1175 m20 399 1189 m20 417 1206 m20 435 1228 m20 454 1246 m20 472 1256 m20 490 1270 m20 508 1278 m20 526 1303 m20 544 1320 m20 562 1349 m20 581 1367 m20 599 1411 m20 617 1466 m20 635 1713 m20 653 1900 m20 671 1916 m20 689 1910 m20
 708 1931 m20 726 1934 m20 744 1934 m20 762 1946 m20 780 1948 m20 798 1952 m20 816 1945 m20 835 1953 m20 853 1933 m20 871 1918 m20 889 1901 m20 907 1848 m20 925 1798 m20 943 1713 m20 962 1579 m20 980 1471 m20 998 1384 m20 1016 1307 m20 1034 1233 m20
 1052 1179 m20 1070 1127 m20 1089 1082 m20 1107 1037 m20 1125 1002 m20 1143 970 m20 1161 932 m20 1179 906 m20 1197 881 m20 1215 854 m20 1234 835 m20 1252 814 m20 1270 793 m20 1288 780 m20 1306 766 m20 1324 753 m20 1342 742 m20 1361 729 m20 1379 717
 m20 1397 708 m20 1415 702 m20 1433 692 m20 1451 686 m20 1469 678 m20 1488 673 m20 1506 669 m20 1524 662 m20 1542 659 m20 1560 653 m20 1578 650 m20 1596 647 m20 1615 643 m20 1633 640 m20 1651 638 m20 1669 635 m20 1687 633 m20 1705 630 m20 1723 629
 m20 1742 627 m20 1760 626 m20 1778 625 m20 1796 623 m20 1814 621 m20 1832 620 m20 1850 619 m20 1869 619 m20 1887 618 m20 1905 617 m20 1923 616 m20 1941 615 m20 1959 615 m20 1977 614 m20 1996 614 m20 2014 614 m20 2032 613 m20 black 0 0 1 c 1 lw <<
 /PatternType 1 /PaintType 2 /TilingType 1 /BBox [ 0 0 100 100 ] /XStep 100 /YStep 100 /PaintProc { begin gsave 0 0 m 100 100 l 0 100 m 100 0 l s gr end } >> [ 0.24 0 0 0.24 0 0 ] makepattern /P13 exch def /cs {[/Pattern /DeviceRGB] setcolorspace}
 def /FA {f [/DeviceRGB] setcolorspace} def cs 0 0 1 P13 setcolor 236 1100 m 18 4 d 18 7 d 18 -6 d 18 18 d 19 6 d 18 15 d 18 11 d 18 23 d 18 15 d 18 17 d 18 22 d 19 18 d 18 10 d 18 14 d 18 8 d 18 25 d 18 17 d 18 29 d 19 18 d 18 44 d 18 56 d 18 247 d
 18 188 d 18 15 d 18 -5 d 19 20 d 18 4 d 18 -1 d 18 13 d 18 2 d 18 4 d 18 -7 d 19 8 d 18 -19 d 18 -16 d 18 -17 d 18 -53 d 18 -50 d 18 -85 d 19 -134 d 18 -109 d 18 -88 d 18 -77 d 18 -74 d 18 -54 d 18 -52 d 19 -46 d 18 -45 d 18 -35 d 18 -32 d 18 -39 d
 18 -26 d 18 -24 d 18 -28 d 19 -18 d 18 -22 d 18 -21 d 18 -13 d 18 -14 d 18 -14 d 18 -11 d 19 -13 d 18 -12 d 18 -9 d 18 -6 d 18 -10 d 18 -6 d 18 -8 d 19 -5 d 18 -5 d 18 -7 d 18 -2 d 18 -7 d 18 -2 d 18 -3 d 19 -5 d 18 -2 d 18 -3 d 18 -2 d 18 -2 d 18
 -3 d 18 -2 d 19 -2 d 18 -1 d 18 -1 d 18 -2 d 18 -1 d 18 -2 d 18 X 19 -1 d 18 -1 d 18 X 18 -2 d 18 -1 d 18 X 18 -1 d 37 X 18 -1 d -18 1 d -55 X -18 1 d -18 1 d -18 1 d -18 X -18 1 d -19 1 d -18 1 d -18 1 d -18 2 d -18 2 d -18 1 d -18 1 d -19 1 d -18
 2 d -18 3 d -18 2 d -18 2 d -18 3 d -18 2 d -19 4 d -18 4 d -18 2 d -18 7 d -18 2 d -18 7 d -18 4 d -19 5 d -18 8 d -18 6 d -18 10 d -18 6 d -18 9 d -18 11 d -19 13 d -18 11 d -18 13 d -18 15 d -18 12 d -18 21 d -18 21 d -19 19 d -18 27 d -18 24 d
 -18 26 d -18 38 d -18 32 d -18 34 d -18 46 d -19 45 d -18 51 d -18 54 d -18 74 d -18 76 d -18 87 d -18 108 d -19 133 d -18 85 d -18 50 d -18 53 d -18 17 d -18 15 d -18 19 d -19 -7 d -18 7 d -18 -4 d -18 -2 d -18 -12 d -18 X -18 -3 d -19 -21 d -18 6
 d -18 -16 d -18 -186 d -18 -247 d -18 -55 d -18 -43 d -19 -19 d -18 -28 d -18 -17 d -18 -25 d -18 -8 d -18 -14 d -18 -10 d -19 -18 d -18 -22 d -18 -17 d -18 -14 d -18 -24 d -18 -10 d -18 -15 d -19 -7 d -18 -17 d -18 5 d -18 -7 d -18 -3 d FA 3 lw 0.8
 0 0 c 1 0 0 c 0.8 0 0 c 227 1057 m 18 X 4 Y 18 X 7 Y 18 X -3 Y 18 X 10 Y 18 X 8 Y 19 X 15 Y 18 X 9 Y 18 X 17 Y 18 X 16 Y 18 X 16 Y 18 X 9 Y 18 X 21 Y 19 X 7 Y 18 X 7 Y 18 X 14 Y 18 X 15 Y 18 X 10 Y 18 X 24 Y 18 X 21 Y 19 X 33 Y 18 X 38 Y 18 X 159 Y
 18 X 106 Y 18 X -6 Y 18 X -9 Y 37 X -11 Y 18 X -8 Y 18 X -8 Y 18 X -7 Y 18 X -9 Y 18 X -11 Y 18 X -12 Y 19 X -22 Y 18 X -23 Y 18 X -15 Y 18 X -34 Y 18 X -35 Y 18 X -54 Y 18 X -75 Y 19 X -67 Y 18 X -48 Y 18 X -47 Y 18 X -44 Y 18 X -41 Y 18 X -35 Y 18
 X -28 Y 19 X -35 Y 18 X -24 Y 18 X -21 Y 18 X -26 Y 18 X -21 Y 18 X -18 Y 18 X -18 Y 19 X -14 Y 18 X -14 Y 18 X -18 Y 18 X -12 Y 18 X -8 Y 18 X -12 Y 18 X -9 Y 19 X -7 Y 18 X -10 Y 18 X -9 Y 18 X -6 Y 18 X -6 Y 18 X -5 Y 18 X -4 Y 19 X -8 Y 18 X -4
 Y 18 X -4 Y 18 X -3 Y 18 X -3 Y 18 X -3 Y 18 X -4 Y 19 X -2 Y 18 X -3 Y 18 X -2 Y 18 X -3 Y 18 X -1 Y 18 X -2 Y 18 X -2 Y 19 X -2 Y 18 X -1 Y 18 X -1 Y 18 X -2 Y 18 X -1 Y 18 X -1 Y 18 X -1 Y 19 X -1 Y 18 X -1 Y 36 X -1 Y 18 X -1 Y 18 X -1 Y 55 X -1
 Y 36 X s 1 0 0 c 236 1057 m20 254 1061 m20 272 1068 m20 290 1065 m20 308 1075 m20 327 1083 m20 345 1098 m20 363 1107 m20 381 1124 m20 399 1140 m20 417 1156 m20 435 1165 m20 454 1186 m20 472 1193 m20 490 1200 m20 508 1214 m20 526 1229 m20 544 1239
 m20 562 1263 m20 581 1284 m20 599 1317 m20 617 1355 m20 635 1514 m20 653 1620 m20 671 1614 m20 689 1605 m20 708 1605 m20 726 1594 m20 744 1586 m20 762 1578 m20 780 1571 m20 798 1562 m20 816 1551 m20 835 1539 m20 853 1517 m20 871 1494 m20 889 1479
 m20 907 1445 m20 925 1410 m20 943 1356 m20 962 1281 m20 980 1214 m20 998 1166 m20 1016 1119 m20 1034 1075 m20 1052 1034 m20 1070 999 m20 1089 971 m20 1107 936 m20 1125 912 m20 1143 891 m20 1161 865 m20 1179 844 m20 1197 826 m20 1215 808 m20 1234 794
 m20 1252 780 m20 1270 762 m20 1288 750 m20 1306 742 m20 1324 730 m20 1342 721 m20 1361 714 m20 1379 704 m20 1397 695 m20 1415 689 m20 1433 683 m20 1451 678 m20 1469 674 m20 1488 666 m20 1506 662 m20 1524 658 m20 1542 655 m20 1560 652 m20 1578 649
 m20 1596 645 m20 1615 643 m20 1633 640 m20 1651 638 m20 1669 635 m20 1687 634 m20 1705 632 m20 1723 630 m20 1742 628 m20 1760 627 m20 1778 626 m20 1796 624 m20 1814 623 m20 1832 622 m20 1850 621 m20 1869 620 m20 1887 619 m20 1905 619 m20 1923 618
 m20 1941 617 m20 1959 616 m20 1977 616 m20 1996 616 m20 2014 615 m20 2032 615 m20 0.8 0 0 c black 0.8 0 0 c cs 0.8 0 0 P13 setcolor 236 1059 m 18 5 d 18 7 d 18 -4 d 18 11 d 19 8 d 18 15 d 18 9 d 18 17 d 18 16 d 18 16 d 18 9 d 19 21 d 18 7 d 18 7 d
 18 14 d 18 15 d 18 10 d 18 24 d 19 22 d 18 33 d 18 38 d 18 159 d 18 106 d 18 -5 d 18 -10 d 19 1 d 18 -11 d 18 -8 d 18 -9 d 18 -6 d 18 -10 d 18 -10 d 19 -13 d 18 -22 d 18 -23 d 18 -15 d 18 -34 d 18 -35 d 18 -54 d 19 -75 d 18 -67 d 18 -48 d 18 -48 d
 18 -44 d 18 -42 d 18 -35 d 19 -28 d 18 -34 d 18 -25 d 18 -21 d 18 -26 d 18 -21 d 18 -19 d 18 -17 d 19 -15 d 18 -13 d 18 -19 d 18 -12 d 18 -8 d 18 -12 d 18 -9 d 19 -7 d 18 -10 d 18 -9 d 18 -6 d 18 -6 d 18 -5 d 18 -5 d 19 -7 d 18 -4 d 18 -4 d 18 -3 d
 18 -3 d 18 -3 d 18 -4 d 19 -3 d 18 -3 d 18 -2 d 18 -2 d 18 -2 d 18 -1 d 18 -3 d 19 -2 d 18 X 18 -2 d 18 -1 d 18 -1 d 18 -1 d 18 -1 d 19 -1 d 18 -2 d 18 X 18 -1 d 18 -1 d 18 -1 d 37 X 18 -1 d 18 X -1 Y -18 1 d -18 X -19 1 d -18 X -18 1 d -18 1 d -18
 X -18 1 d -18 1 d -19 1 d -18 1 d -18 1 d -18 1 d -18 1 d -18 2 d -18 1 d -19 2 d -18 2 d -18 1 d -18 2 d -18 2 d -18 2 d -18 3 d -19 3 d -18 4 d -18 3 d -18 2 d -18 3 d -18 5 d -18 3 d -19 8 d -18 4 d -18 6 d -18 5 d -18 6 d -18 9 d -18 10 d -19 7
 d -18 9 d -18 12 d -18 7 d -18 13 d -18 18 d -18 13 d -19 14 d -18 18 d -18 18 d -18 21 d -18 26 d -18 21 d -18 24 d -18 35 d -19 27 d -18 35 d -18 41 d -18 44 d -18 47 d -18 48 d -18 67 d -19 75 d -18 53 d -18 35 d -18 34 d -18 15 d -18 23 d -18 22
 d -19 12 d -18 11 d -18 9 d -18 7 d -18 8 d -18 8 d -18 11 d -19 X -18 9 d -18 6 d -18 -106 d -18 -158 d -18 -38 d -18 -33 d -19 -22 d -18 -24 d -18 -10 d -18 -14 d -18 -14 d -18 -8 d -18 -6 d -19 -21 d -18 -9 d -18 -16 d -18 -16 d -18 -17 d -18 -9
 d -18 -15 d -19 -8 d -18 -10 d -18 3 d -18 -7 d -18 -4 d FA 0 0.4 0 c 1 1 1 c 0.35 0.83 0.33 c 0 0.4 0 c 227 1091 m 18 X 1 Y 18 X 12 Y 18 X -5 Y 18 X 9 Y 18 X 11 Y 19 X 13 Y 18 X 10 Y 18 X 20 Y 18 X 19 Y 18 X 22 Y 18 X 12 Y 18 X 27 Y 19 X 17 Y 18 X
 3 Y 18 X 20 Y 18 X 23 Y 18 X 11 Y 18 X 30 Y 18 X 38 Y 19 X 44 Y 18 X 58 Y 18 X 247 Y 18 X 177 Y 18 X 4 Y 18 X 7 Y 18 X -4 Y 19 X -6 Y 18 X 1 Y 18 X -12 Y 18 X -8 Y 18 X 4 Y 18 X -13 Y 18 X 3 Y 19 X -23 Y 18 X -51 Y 18 X -8 Y 18 X -57 Y 18 X -37 Y 18
 X -74 Y 18 X -117 Y 19 X -118 Y 18 X -73 Y 18 X -70 Y 18 X -51 Y 18 X -61 Y 18 X -50 Y 18 X -33 Y 19 X -54 Y 18 X -28 Y 18 X -28 Y 18 X -36 Y 18 X -25 Y 18 X -21 Y 18 X -25 Y 19 X -17 Y 18 X -17 Y 18 X -23 Y 18 X -16 Y 18 X -10 Y 18 X -16 Y 18 X -9
 Y 19 X -9 Y 18 X -12 Y 18 X -11 Y 18 X -8 Y 18 X -6 Y 18 X -7 Y 18 X -5 Y 19 X -9 Y 18 X -3 Y 18 X -5 Y 18 X -4 Y 18 X -4 Y 18 X -3 Y 18 X -4 Y 19 X -3 Y 18 X -4 Y 18 X -3 Y 18 X -2 Y 18 X -1 Y 18 X -3 Y 18 X -2 Y 19 X -2 Y 18 X -1 Y 18 X -2 Y 18 X
 -1 Y 18 X -1 Y 18 X -1 Y 18 X -1 Y 19 X -2 Y 36 X -1 Y 18 X -1 Y 36 X -1 Y 18 X -1 Y 37 X -1 Y 36 X s 0.35 0.83 0.33 c 236 1091 m20 254 1092 m20 272 1104 m20 290 1099 m20 308 1108 m20 327 1119 m20 345 1132 m20 363 1142 m20 381 1162 m20 399 1181 m20
 417 1203 m20 435 1215 m20 454 1242 m20 472 1259 m20 490 1262 m20 508 1282 m20 526 1305 m20 544 1316 m20 562 1346 m20 581 1384 m20 599 1428 m20 617 1486 m20 635 1733 m20 653 1910 m20 671 1914 m20 689 1921 m20 708 1917 m20 726 1911 m20 744 1912 m20
 762 1900 m20 780 1892 m20 798 1896 m20 816 1883 m20 835 1886 m20 853 1863 m20 871 1812 m20 889 1804 m20 907 1747 m20 925 1710 m20 943 1636 m20 962 1519 m20 980 1401 m20 998 1328 m20 1016 1258 m20 1034 1207 m20 1052 1146 m20 1070 1096 m20 1089 1063
 m20 1107 1009 m20 1125 981 m20 1143 953 m20 1161 917 m20 1179 892 m20 1197 871 m20 1215 846 m20 1234 829 m20 1252 812 m20 1270 789 m20 1288 773 m20 1306 763 m20 1324 747 m20 1342 738 m20 1361 729 m20 1379 717 m20 1397 706 m20 1415 698 m20 1433 692
 m20 1451 685 m20 1469 680 m20 1488 671 m20 1506 668 m20 1524 663 m20 1542 659 m20 1560 655 m20 1578 652 m20 1596 648 m20 1615 645 m20 1633 641 m20 1651 638 m20 1669 636 m20 1687 635 m20 1705 632 m20 1723 630 m20 1742 628 m20 1760 627 m20 1778 625
 m20 1796 624 m20 1814 623 m20 1832 622 m20 1850 621 m20 1869 619 m20 1887 619 m20 1905 618 m20 1923 617 m20 1941 617 m20 1959 616 m20 1977 615 m20 1996 615 m20 2014 614 m20 2032 614 m20 0 0.4 0 c black 0 0.4 0 c cs 0 0.4 0 P13 setcolor 236 1095 m 18
 1 d 18 11 d 18 -4 d 18 9 d 19 10 d 18 14 d 18 10 d 18 20 d 18 20 d 18 21 d 18 12 d 19 27 d 18 17 d 18 3 d 18 20 d 18 24 d 18 11 d 18 30 d 19 38 d 18 44 d 18 58 d 18 248 d 18 178 d 18 5 d 18 7 d 19 -4 d 18 -6 d 18 1 d 18 -12 d 18 -8 d 18 4 d 18 -12 d
 19 2 d 18 -23 d 18 -50 d 18 -9 d 18 -57 d 18 -37 d 18 -74 d 19 -118 d 18 -119 d 18 -74 d 18 -70 d 18 -51 d 18 -62 d 18 -50 d 19 -33 d 18 -55 d 18 -27 d 18 -29 d 18 -36 d 18 -25 d 18 -21 d 18 -26 d 19 -17 d 18 -17 d 18 -23 d 18 -17 d 18 -10 d 18 -15
 d 18 -9 d 19 -10 d 18 -11 d 18 -11 d 18 -9 d 18 -6 d 18 -7 d 18 -5 d 19 -9 d 18 -3 d 18 -5 d 18 -5 d 18 -3 d 18 -4 d 18 -4 d 19 -2 d 18 -5 d 18 -2 d 18 -2 d 18 -2 d 18 -2 d 18 -3 d 19 -1 d 18 -2 d 18 -2 d 18 -1 d 18 -1 d 18 -1 d 18 -1 d 19 -1 d 18
 -1 d 18 -1 d 18 -1 d 18 X 18 -1 d 18 -1 d 19 X 18 -1 d 18 X -18 X -18 1 d -37 X -18 1 d -18 1 d -18 1 d -18 X -18 1 d -19 1 d -18 1 d -18 2 d -18 X -18 2 d -18 2 d -18 1 d -19 2 d -18 2 d -18 2 d -18 2 d -18 2 d -18 2 d -18 4 d -19 3 d -18 4 d -18 3
 d -18 4 d -18 4 d -18 5 d -18 3 d -19 9 d -18 5 d -18 7 d -18 6 d -18 8 d -18 11 d -18 11 d -19 10 d -18 9 d -18 15 d -18 10 d -18 16 d -18 23 d -18 16 d -19 17 d -18 26 d -18 21 d -18 24 d -18 36 d -18 28 d -18 27 d -18 54 d -19 33 d -18 49 d -18
 61 d -18 51 d -18 69 d -18 73 d -18 117 d -19 116 d -18 74 d -18 37 d -18 56 d -18 9 d -18 50 d -18 23 d -19 -2 d -18 13 d -18 -4 d -18 8 d -18 12 d -18 -1 d -18 7 d -19 3 d -18 -7 d -18 -4 d -18 -176 d -18 -245 d -18 -58 d -18 -44 d -19 -37 d -18
 -30 d -18 -11 d -18 -24 d -18 -20 d -18 -3 d -18 -16 d -19 -28 d -18 -11 d -18 -22 d -18 -19 d -18 -20 d -18 -10 d -18 -13 d -19 -11 d -18 -9 d -18 5 d -18 -11 d -18 -1 d FA black 1 1 1 c 567 470 1587 1550 bf black 1587 1550 m 567 X s 2154 1550 m
 470 Y s 2154 2020 m -567 X s 1587 2020 m -470 Y s
 gsave  2268 1568 0 609 C 1728.33 1918.25 t 0 r /Helvetica findfont 72.27 sf 0 0 m (No Int) show NC gr  0.8 0 0 c 1609 1941 m 99 X s black
 gsave  2268 1568 0 609 C 1728.33 1758.71 t 0 r /Helvetica findfont 72.27 sf 0 0 m (With Int) show NC gr  0 0 1 c 1609 1785 m 99 X s black
 gsave  2268 1568 0 609 C 1728.33 1610.57 t 0 r /Helvetica findfont 72.27 sf 0 0 m (Reweighted) show NC gr  0 0.4 0 c 1609 1628 m 99 X s black
 gsave  2268 1568 0 609 C 2222.13 1747.32 t 90 r /Helvetica-BoldOblique findfont 30.4295 sf 0 0 m (LHC HIGGS XS WG 2013) show NC gr  1 1 1 c 2268 609 0 0 bf black 1 1 1 c 1814 457 227 152 bf black 1814 457 227 152 bl 1 1 1 c black 227 383 m 18 X 1 Y
 18 X -2 Y 36 X 4 Y 18 X -2 Y 19 X 1 Y 36 X 1 Y 18 X -2 Y 18 X -2 Y 18 X 4 Y 18 X -4 Y 19 X -2 Y 18 X 4 Y 18 X -4 Y 36 X 2 Y 36 X -6 Y 55 X 1 Y 18 X 2 Y 18 X 2 Y 18 X -2 Y 18 X 4 Y 19 X 2 Y 36 X 4 Y 18 X 2 Y 36 X 1 Y 18 X 1 Y 19 X 1 Y 18 X 7 Y 18 X
 -1 Y 18 X 1 Y 18 X -2 Y 18 X -1 Y 18 X -2 Y 19 X 5 Y 18 X -2 Y 18 X -1 Y 18 X -7 Y 18 X 4 Y 18 X 1 Y 18 X -5 Y 19 X 6 Y 18 X -3 Y 18 X -2 Y 54 X -2 Y 18 X -1 Y 19 X -1 Y 18 X -5 Y 18 X 3 Y 18 X 6 Y 18 X -6 Y 18 X 4 Y 18 X -3 Y 19 X -6 Y 18 X -1 Y 18
 X 4 Y 18 X 7 Y 18 X -9 Y 18 X 2 Y 18 X -11 Y 19 X 15 Y 18 X -4 Y 18 X -8 Y 18 X 9 Y 18 X -16 Y 18 X 4 Y 18 X 3 Y 19 X -9 Y 18 X 9 Y 36 X -4 Y 18 X -1 Y 18 X -10 Y 18 X 5 Y 19 X -1 Y 18 X 1 Y 18 X 16 Y 18 X -11 Y 18 X -17 Y 18 X -3 Y 18 X 4 Y 19 X 8
 Y 18 X -8 Y 18 X 12 Y 18 X -21 Y 18 X -10 Y 18 X 15 Y 18 X -26 Y 19 X 16 Y 18 X 22 Y 18 X -15 Y 18 X s 227 152 m 1814 X s
 gsave  2268 609 0 0 C 1960.04 18.9926 t 0 r /Helvetica findfont 38.0897 sf 0 0 m (T,rel) show NC gr 
 gsave  2268 609 0 0 C 1960.04 68.3734 t 0 r /Helvetica findfont 38.0897 sf 0 0 m (miss) show NC gr 
 gsave  2268 609 0 0 C 1922.05 37.9852 t 0 r /Helvetica findfont 57.1345 sf 0 0 m (E) show NC gr  227 167 m -15 Y s 272 160 m -8 Y s 317 160 m -8 Y s 363 160 m -8 Y s 408 167 m -15 Y s 454 160 m -8 Y s 499 160 m -8 Y s 544 160 m -8 Y s 590 167 m -15
 Y s 635 160 m -8 Y s 680 160 m -8 Y s 726 160 m -8 Y s 771 167 m -15 Y s 816 160 m -8 Y s 862 160 m -8 Y s 907 160 m -8 Y s 952 167 m -15 Y s 998 160 m -8 Y s 1043 160 m -8 Y s 1089 160 m -8 Y s 1134 167 m -15 Y s 1179 160 m -8 Y s 1225 160 m -8 Y s
 1270 160 m -8 Y s 1315 167 m -15 Y s 1361 160 m -8 Y s 1406 160 m -8 Y s 1451 160 m -8 Y s 1497 167 m -15 Y s 1542 160 m -8 Y s 1587 160 m -8 Y s 1633 160 m -8 Y s 1678 167 m -15 Y s 1723 160 m -8 Y s 1769 160 m -8 Y s 1814 160 m -8 Y s 1860 167 m
 -15 Y s 1905 160 m -8 Y s 1950 160 m -8 Y s 1996 160 m -8 Y s 2041 167 m -15 Y s
 gsave  2268 609 0 0 C 208.919 113.956 t 0 r /Helvetica findfont 45.7076 sf 0 0 m (0) show NC gr 
 gsave  2268 609 0 0 C 379.852 113.956 t 0 r /Helvetica findfont 45.7076 sf 0 0 m (20) show NC gr 
 gsave  2268 609 0 0 C 562.181 113.956 t 0 r /Helvetica findfont 45.7076 sf 0 0 m (40) show NC gr 
 gsave  2268 609 0 0 C 740.711 113.956 t 0 r /Helvetica findfont 45.7076 sf 0 0 m (60) show NC gr 
 gsave  2268 609 0 0 C 923.04 113.956 t 0 r /Helvetica findfont 45.7076 sf 0 0 m (80) show NC gr 
 gsave  2268 609 0 0 C 1093.97 113.956 t 0 r /Helvetica findfont 45.7076 sf 0 0 m (100) show NC gr 
 gsave  2268 609 0 0 C 1276.3 113.956 t 0 r /Helvetica findfont 45.7076 sf 0 0 m (120) show NC gr 
 gsave  2268 609 0 0 C 1458.63 113.956 t 0 r /Helvetica findfont 45.7076 sf 0 0 m (140) show NC gr 
 gsave  2268 609 0 0 C 1637.16 113.956 t 0 r /Helvetica findfont 45.7076 sf 0 0 m (160) show NC gr 
 gsave  2268 609 0 0 C 1819.49 113.956 t 0 r /Helvetica findfont 45.7076 sf 0 0 m (180) show NC gr 
 gsave  2268 609 0 0 C 2001.82 113.956 t 0 r /Helvetica findfont 45.7076 sf 0 0 m (200) show NC gr  227 152 m 457 Y s
 gsave  2268 609 0 0 C 91.1645 170.933 t 90 r /Helvetica findfont 45.7076 sf 0 0 m (\(S+I\)/\(Reweighted S\)) show NC gr  278 152 m -51 X s 252 164 m -25 X s 252 175 m -25 X s 252 187 m -25 X s 278 198 m -51 X s 252 209 m -25 X s 252 221 m -25 X s
 252 232 m -25 X s 278 244 m -51 X s 252 255 m -25 X s 252 267 m -25 X s 252 278 m -25 X s 278 289 m -51 X s 252 301 m -25 X s 252 312 m -25 X s 252 324 m -25 X s 278 335 m -51 X s 252 347 m -25 X s 252 358 m -25 X s 252 369 m -25 X s 278 381 m -51 X
 s 252 392 m -25 X s 252 404 m -25 X s 252 415 m -25 X s 278 427 m -51 X s 252 438 m -25 X s 252 449 m -25 X s 252 461 m -25 X s 278 472 m -51 X s 252 484 m -25 X s 252 495 m -25 X s 252 507 m -25 X s 278 518 m -51 X s 252 529 m -25 X s 252 541 m -25
 X s 252 552 m -25 X s 278 564 m -51 X s 252 575 m -25 X s 252 587 m -25 X s 252 598 m -25 X s 278 609 m -51 X s
 gsave  2268 609 0 0 C 186.127 136.747 t 0 r /Helvetica findfont 45.7076 sf 0 0 m (0) show NC gr 
 gsave  2268 609 0 0 C 148.142 182.329 t 0 r /Helvetica findfont 45.7076 sf 0 0 m (0.2) show NC gr 
 gsave  2268 609 0 0 C 148.142 227.911 t 0 r /Helvetica findfont 45.7076 sf 0 0 m (0.4) show NC gr 
 gsave  2268 609 0 0 C 148.142 273.493 t 0 r /Helvetica findfont 45.7076 sf 0 0 m (0.6) show NC gr 
 gsave  2268 609 0 0 C 148.142 319.076 t 0 r /Helvetica findfont 45.7076 sf 0 0 m (0.8) show NC gr 
 gsave  2268 609 0 0 C 193.725 364.658 t 0 r /Helvetica findfont 45.7076 sf 0 0 m (1) show NC gr 
 gsave  2268 609 0 0 C 148.142 410.24 t 0 r /Helvetica findfont 45.7076 sf 0 0 m (1.2) show NC gr 
 gsave  2268 609 0 0 C 148.142 455.822 t 0 r /Helvetica findfont 45.7076 sf 0 0 m (1.4) show NC gr 
 gsave  2268 609 0 0 C 148.142 501.405 t 0 r /Helvetica findfont 45.7076 sf 0 0 m (1.6) show NC gr 
 gsave  2268 609 0 0 C 148.142 546.987 t 0 r /Helvetica findfont 45.7076 sf 0 0 m (1.8) show NC gr 
 gsave  2268 609 0 0 C 186.127 592.569 t 0 r /Helvetica findfont 45.7076 sf 0 0 m (2) show NC gr  236 383 m20 254 384 m20 272 382 m20 290 382 m20 308 386 m20 327 384 m20 345 385 m20 363 385 m20 381 386 m20 399 384 m20 417 382 m20 435 386 m20 454 382
 m20 472 380 m20 490 384 m20 508 380 m20 526 380 m20 544 382 m20 562 382 m20 581 376 m20 599 376 m20 617 376 m20 635 377 m20 653 379 m20 671 381 m20 689 379 m20 708 383 m20 726 385 m20 744 385 m20 762 389 m20 780 391 m20 798 391 m20 816 392 m20 835
 393 m20 853 394 m20 871 401 m20 889 400 m20 907 401 m20 925 399 m20 943 398 m20 962 396 m20 980 401 m20 998 399 m20 1016 398 m20 1034 391 m20 1052 395 m20 1070 396 m20 1089 391 m20 1107 397 m20 1125 394 m20 1143 392 m20 1161 392 m20 1179 392 m20
 1197 390 m20 1215 389 m20 1234 388 m20 1252 383 m20 1270 386 m20 1288 392 m20 1306 386 m20 1324 390 m20 1342 387 m20 1361 381 m20 1379 380 m20 1397 384 m20 1415 391 m20 1433 382 m20 1451 384 m20 1469 373 m20 1488 388 m20 1506 384 m20 1524 376 m20
 1542 385 m20 1560 369 m20 1578 373 m20 1596 376 m20 1615 367 m20 1633 376 m20 1651 376 m20 1669 372 m20 1687 371 m20 1705 361 m20 1723 366 m20 1742 365 m20 1760 366 m20 1778 382 m20 1796 371 m20 1814 354 m20 1832 351 m20 1850 355 m20 1869 363 m20
 1887 355 m20 1905 367 m20 1923 346 m20 1941 336 m20 1959 351 m20 1977 325 m20 1996 341 m20 2014 363 m20 2032 348 m20 cs 0 0 0 P13 setcolor 236 386 m 18 1 d 18 -2 d 18 -1 d 18 4 d 19 -2 d 18 1 d 18 X 18 1 d 18 -2 d 18 -2 d 18 4 d 19 -4 d 18 -2 d 18 4
 d 18 -4 d 18 X 18 2 d 18 X 19 -6 d 18 X 18 -1 d 18 2 d 18 2 d 18 2 d 18 -2 d 19 4 d 18 2 d 18 X 18 4 d 18 2 d 18 X 18 1 d 19 1 d 18 1 d 18 7 d 18 -1 d 18 1 d 18 -2 d 18 -1 d 19 -2 d 18 6 d 18 -3 d 18 X 18 -8 d 18 5 d 18 X 19 -5 d 18 7 d 18 -3 d 18
 -2 d 36 X 18 -2 d 18 -1 d 19 -1 d 18 -4 d 18 2 d 18 7 d 18 -7 d 18 5 d 18 -3 d 19 -6 d 18 -1 d 18 5 d 18 6 d 18 -9 d 18 3 d 18 -11 d 19 15 d 18 -4 d 18 -8 d 18 9 d 18 -16 d 18 4 d 18 3 d 19 -9 d 18 10 d 18 X 18 -4 d 18 X 18 -10 d 18 4 d 19 X 18 2 d
 18 16 d 18 -11 d 18 -18 d 18 -2 d 18 4 d 19 9 d 18 -7 d 18 11 d 18 -22 d 18 -8 d 18 16 d 18 -26 d 19 16 d 18 23 d 18 -15 d -23 Y -18 15 d -18 -22 d -19 -16 d -18 26 d -18 -14 d -18 11 d -18 20 d -18 -11 d -18 8 d -19 -7 d -18 -3 d -18 2 d -18 17 d
 -18 11 d -18 -15 d -18 -1 d -19 1 d -18 -4 d -18 10 d -18 1 d -18 4 d -18 X -18 -9 d -19 9 d -18 -2 d -18 -4 d -18 15 d -18 -8 d -18 8 d -18 4 d -19 -14 d -18 10 d -18 -2 d -18 9 d -18 -6 d -18 -4 d -18 1 d -19 6 d -18 3 d -18 -4 d -18 6 d -18 -6 d
 -18 -2 d -18 5 d -19 X -18 2 d -18 2 d -36 X -18 2 d -18 3 d -18 -6 d -19 5 d -18 -1 d -18 -4 d -18 8 d -18 X -18 3 d -18 -5 d -19 2 d -18 1 d -18 2 d -18 -2 d -18 2 d -18 -7 d -18 -1 d -19 -1 d -18 -1 d -18 X -18 -2 d -18 -4 d -18 X -18 -2 d -19 -4
 d -18 3 d -18 -3 d -18 -2 d -18 -1 d -36 X -19 6 d -18 X -18 -2 d -18 X -18 4 d -18 -4 d -18 2 d -19 4 d -18 -4 d -18 2 d -18 2 d -18 -2 d -36 X -19 1 d -18 -3 d -18 X -18 2 d -18 -1 d FA
 gr  gr showpage
end
%%EOF
