%!PS-Adobe-2.0 EPSF-2.0
%%BoundingBox:  0 0 567 639
%%Title: : Canvas
%%Creator: ROOT Version 5.28/00c
%%CreationDate: Wed Mar 13 15:37:51 2013
%%EndComments
%%BeginProlog
80 dict begin
/s {stroke} def /l {lineto} def /m {moveto} def /t {translate} def
/r {rotate} def /rl {roll}  def /R {repeat} def
/d {rlineto} def /rm {rmoveto} def /gr {grestore} def /f {eofill} def
/c {setrgbcolor} def /black {0 setgray} def /sd {setdash} def
/cl {closepath} def /sf {scalefont setfont} def /lw {setlinewidth} def
/box {m dup 0 exch d exch 0 d 0 exch neg d cl} def
/NC{systemdict begin initclip end}def/C{NC box clip newpath}def
/bl {box s} def /bf {box f} def /Y { 0 exch d} def /X { 0 d} def 
/K {{pop pop 0 moveto} exch kshow} bind def
/ita {/ang 15 def gsave [1 0 ang dup sin exch cos div 1 0 0] concat} def 
/mp {newpath /y exch def /x exch def} def
/side {[w .77 mul w .23 mul] .385 w mul sd w 0 l currentpoint t -144 r} def
/mr {mp x y w2 0 360 arc} def /m24 {mr s} def /m20 {mr f} def
/mb {mp x y w2 add m w2 neg 0 d 0 w neg d w 0 d 0 w d cl} def
/mt {mp x y w2 add m w2 neg w neg d w 0 d cl} def
/m21 {mb f} def /m25 {mb s} def /m22 {mt f} def /m26{mt s} def
/m23 {mp x y w2 sub m w2 w d w neg 0 d cl f} def
/m27 {mp x y w2 add m w3 neg w2 neg d w3 w2 neg d w3 w2 d cl s} def
/m28 {mp x w2 sub y w2 sub w3 add m w3 0 d  0 w3 neg d w3 0 d 0 w3 d w3 0 d  0 w3 d w3 neg 0 d 0 w3 d w3 neg 0 d 0 w3 neg d w3 neg 0 d cl s } def
/m29 {mp gsave x w2 sub y w2 add w3 sub m currentpoint t 4 {side} repeat cl fill gr} def
/m30 {mp gsave x w2 sub y w2 add w3 sub m currentpoint t 4 {side} repeat cl s gr} def
/m31 {mp x y w2 sub m 0 w d x w2 sub y m w 0 d x w2 sub y w2 add m w w neg d x w2 sub y w2 sub m w w d s} def
/m32 {mp x y w2 sub m w2 w d w neg 0 d cl s} def
/m33 {mp x y w2 add m w3 neg w2 neg d w3 w2 neg d w3 w2 d cl f} def
/m34 {mp x w2 sub y w2 sub w3 add m w3 0 d  0 w3 neg d w3 0 d 0 w3 d w3 0 d  0 w3 d w3 neg 0 d 0 w3 d w3 neg 0 d 0 w3 neg d w3 neg 0 d cl f } def
/m2 {mp x y w2 sub m 0 w d x w2 sub y m w 0 d s} def
/m5 {mp x w2 sub y w2 sub m w w d x w2 sub y w2 add m w w neg d s} def
/reEncode {exch findfont dup length dict begin {1 index /FID eq  {pop pop} {def} ifelse } forall /Encoding exch def currentdict end dup /FontName get exch definefont pop } def [/Times-Bold /Times-Italic /Times-BoldItalic /Helvetica /Helvetica-Oblique
 /Helvetica-Bold /Helvetica-BoldOblique /Courier /Courier-Oblique /Courier-Bold /Courier-BoldOblique /Times-Roman /AvantGarde-Book /AvantGarde-BookOblique /AvantGarde-Demi /AvantGarde-DemiOblique /Bookman-Demi /Bookman-DemiItalic /Bookman-Light
 /Bookman-LightItalic /Helvetica-Narrow /Helvetica-Narrow-Bold /Helvetica-Narrow-BoldOblique /Helvetica-Narrow-Oblique /NewCenturySchlbk-Roman /NewCenturySchlbk-Bold /NewCenturySchlbk-BoldItalic /NewCenturySchlbk-Italic /Palatino-Bold
 /Palatino-BoldItalic /Palatino-Italic /Palatino-Roman ] {ISOLatin1Encoding reEncode } forall%%EndProlog
%%BeginSetup
%%EndSetup
newpath  gsave  .25 .25 scale  gsave  0 0 t black[  ] 0 sd 3 lw 1 1 1 c 2268 2557 0 0 bf black 1 1 1 c 2268 2557 0 0 bf black 1 1 1 c 1791 1790 363 639 bf black 1791 1790 363 639 bl 1 1 1 c 1791 1790 363 639 bf black 1791 1790 363 639 bl 6 lw 1 1 1 c
 black 363 639 m 1791 X s 3 lw 363 639 m 1791 X s
 gsave  2268 2557 0 0 C 2119.33 426.148 t 0 r /Helvetica findfont 106.537 sf 0 0 m (\)) show NC gr 
 gsave  2268 2557 0 0 C 2066.06 426.148 t 0 r /Symbol findfont 106.537 sf 0 0 m (g) show NC gr 
 gsave  2268 2557 0 0 C 2043.23 426.148 t 0 r /Helvetica findfont 106.537 sf 0 0 m (,) show NC gr 
 gsave  2268 2557 0 0 C 1989.96 426.148 t 0 r /Symbol findfont 106.537 sf 0 0 m (g) show NC gr 
 gsave  2268 2557 0 0 C 1955.72 426.148 t 0 r /Helvetica findfont 106.537 sf 0 0 m (\() show NC gr 
 gsave  2268 2557 0 0 C 1902.45 426.148 t 0 r /Symbol findfont 106.537 sf 0 0 m (f) show NC gr 
 gsave  2268 2557 0 0 C 1833.96 426.148 t 0 r /Symbol findfont 106.537 sf 0 0 m (D) show NC gr  363 700 m -61 Y s 413 670 m -31 Y s 462 670 m -31 Y s 512 670 m -31 Y s 562 700 m -61 Y s 612 670 m -31 Y s 661 670 m -31 Y s 711 670 m -31 Y s 761 700 m
 -61 Y s 811 670 m -31 Y s 860 670 m -31 Y s 910 670 m -31 Y s 960 700 m -61 Y s 1010 670 m -31 Y s 1060 670 m -31 Y s 1109 670 m -31 Y s 1159 700 m -61 Y s 1209 670 m -31 Y s 1259 670 m -31 Y s 1308 670 m -31 Y s 1358 700 m -61 Y s 1408 670 m -31 Y
 s 1458 670 m -31 Y s 1507 670 m -31 Y s 1557 700 m -61 Y s 1607 670 m -31 Y s 1657 670 m -31 Y s 1706 670 m -31 Y s 1756 700 m -61 Y s 1806 670 m -31 Y s 1856 670 m -31 Y s 1906 670 m -31 Y s 1955 700 m -61 Y s 2005 670 m -31 Y s 2055 670 m -31 Y s
 2105 670 m -31 Y s 2154 700 m -61 Y s
 gsave  2268 2557 0 0 C 331.026 525.075 t 0 r /Helvetica findfont 106.537 sf 0 0 m (0) show NC gr 
 gsave  2268 2557 0 0 C 502.246 525.075 t 0 r /Helvetica findfont 106.537 sf 0 0 m (20) show NC gr 
 gsave  2268 2557 0 0 C 700.1 525.075 t 0 r /Helvetica findfont 106.537 sf 0 0 m (40) show NC gr 
 gsave  2268 2557 0 0 C 901.76 525.075 t 0 r /Helvetica findfont 106.537 sf 0 0 m (60) show NC gr 
 gsave  2268 2557 0 0 C 1099.61 525.075 t 0 r /Helvetica findfont 106.537 sf 0 0 m (80) show NC gr 
 gsave  2268 2557 0 0 C 1267.03 525.075 t 0 r /Helvetica findfont 106.537 sf 0 0 m (100) show NC gr 
 gsave  2268 2557 0 0 C 1468.69 525.075 t 0 r /Helvetica findfont 106.537 sf 0 0 m (120) show NC gr 
 gsave  2268 2557 0 0 C 1666.54 525.075 t 0 r /Helvetica findfont 106.537 sf 0 0 m (140) show NC gr 
 gsave  2268 2557 0 0 C 1864.4 525.075 t 0 r /Helvetica findfont 106.537 sf 0 0 m (160) show NC gr 
 gsave  2268 2557 0 0 C 2066.06 525.075 t 0 r /Helvetica findfont 106.537 sf 0 0 m (180) show NC gr  363 2429 m 1791 X s 363 2368 m 61 Y s 413 2399 m 30 Y s 462 2399 m 30 Y s 512 2399 m 30 Y s 562 2368 m 61 Y s 612 2399 m 30 Y s 661 2399 m 30 Y s 711
 2399 m 30 Y s 761 2368 m 61 Y s 811 2399 m 30 Y s 860 2399 m 30 Y s 910 2399 m 30 Y s 960 2368 m 61 Y s 1010 2399 m 30 Y s 1060 2399 m 30 Y s 1109 2399 m 30 Y s 1159 2368 m 61 Y s 1209 2399 m 30 Y s 1259 2399 m 30 Y s 1308 2399 m 30 Y s 1358 2368 m
 61 Y s 1408 2399 m 30 Y s 1458 2399 m 30 Y s 1507 2399 m 30 Y s 1557 2368 m 61 Y s 1607 2399 m 30 Y s 1657 2399 m 30 Y s 1706 2399 m 30 Y s 1756 2368 m 61 Y s 1806 2399 m 30 Y s 1856 2399 m 30 Y s 1906 2399 m 30 Y s 1955 2368 m 61 Y s 2005 2399 m 30
 Y s 2055 2399 m 30 Y s 2105 2399 m 30 Y s 2154 2368 m 61 Y s 363 639 m 1790 Y s
 gsave  2268 2557 0 0 C 209.269 2244.89 t 90 r /Helvetica findfont 106.537 sf 0 0 m ( \(fb\)) show NC gr 
 gsave  2268 2557 0 0 C 209.269 2191.62 t 90 r /Symbol findfont 106.537 sf 0 0 m (f) show NC gr 
 gsave  2268 2557 0 0 C 205.464 2123.13 t 90 r /Symbol findfont 106.537 sf 0 0 m (D) show NC gr 
 gsave  2268 2557 0 0 C 205.464 2039.42 t 90 r /Helvetica findfont 106.537 sf 0 0 m (/d) show NC gr 
 gsave  2268 2557 0 0 C 205.464 1974.74 t 90 r /Symbol findfont 106.537 sf 0 0 m (s) show NC gr 
 gsave  2268 2557 0 0 C 205.464 1921.47 t 90 r /Helvetica findfont 106.537 sf 0 0 m (d) show NC gr  410 843 m -47 X s 387 894 m -24 X s 387 945 m -24 X s 387 996 m -24 X s 410 1047 m -47 X s 387 1099 m -24 X s 387 1150 m -24 X s 387 1201 m -24 X s
 410 1252 m -47 X s 387 1303 m -24 X s 387 1354 m -24 X s 387 1406 m -24 X s 410 1457 m -47 X s 387 1508 m -24 X s 387 1559 m -24 X s 387 1610 m -24 X s 410 1661 m -47 X s 387 1712 m -24 X s 387 1764 m -24 X s 387 1815 m -24 X s 410 1866 m -47 X s
 387 1917 m -24 X s 387 1968 m -24 X s 387 2019 m -24 X s 410 2071 m -47 X s 387 2122 m -24 X s 387 2173 m -24 X s 387 2224 m -24 X s 410 2275 m -47 X s 410 843 m -47 X s 387 792 m -24 X s 387 741 m -24 X s 387 689 m -24 X s 410 2275 m -47 X s 387
 2326 m -24 X s 387 2377 m -24 X s 387 2429 m -24 X s
 gsave  2268 2557 0 0 C 205.464 802.833 t 0 r /Helvetica findfont 106.537 sf 0 0 m (0.2) show NC gr 
 gsave  2268 2557 0 0 C 205.464 1008.3 t 0 r /Helvetica findfont 106.537 sf 0 0 m (0.4) show NC gr 
 gsave  2268 2557 0 0 C 205.464 1213.76 t 0 r /Helvetica findfont 106.537 sf 0 0 m (0.6) show NC gr 
 gsave  2268 2557 0 0 C 205.464 1415.42 t 0 r /Helvetica findfont 106.537 sf 0 0 m (0.8) show NC gr 
 gsave  2268 2557 0 0 C 308.196 1620.88 t 0 r /Helvetica findfont 106.537 sf 0 0 m (1) show NC gr 
 gsave  2268 2557 0 0 C 205.464 1826.35 t 0 r /Helvetica findfont 106.537 sf 0 0 m (1.2) show NC gr 
 gsave  2268 2557 0 0 C 205.464 2031.81 t 0 r /Helvetica findfont 106.537 sf 0 0 m (1.4) show NC gr 
 gsave  2268 2557 0 0 C 205.464 2233.47 t 0 r /Helvetica findfont 106.537 sf 0 0 m (1.6) show NC gr  2154 639 m 1790 Y s 2107 843 m 47 X s 2131 894 m 23 X s 2131 945 m 23 X s 2131 996 m 23 X s 2107 1047 m 47 X s 2131 1099 m 23 X s 2131 1150 m 23 X s
 2131 1201 m 23 X s 2107 1252 m 47 X s 2131 1303 m 23 X s 2131 1354 m 23 X s 2131 1406 m 23 X s 2107 1457 m 47 X s 2131 1508 m 23 X s 2131 1559 m 23 X s 2131 1610 m 23 X s 2107 1661 m 47 X s 2131 1712 m 23 X s 2131 1764 m 23 X s 2131 1815 m 23 X s
 2107 1866 m 47 X s 2131 1917 m 23 X s 2131 1968 m 23 X s 2131 2019 m 23 X s 2107 2071 m 47 X s 2131 2122 m 23 X s 2131 2173 m 23 X s 2131 2224 m 23 X s 2107 2275 m 47 X s 2107 843 m 47 X s 2131 792 m 23 X s 2131 741 m 23 X s 2131 689 m 23 X s 2107
 2275 m 47 X s 2131 2326 m 23 X s 2131 2377 m 23 X s 2131 2429 m 23 X s 6 lw 1 0 0 c black 3 lw 1 0 0 c 1 lw << /PatternType 1 /PaintType 2 /TilingType 1 /BBox [ 0 0 100 100 ] /XStep 100 /YStep 100 /PaintProc { begin gsave 0 100 m 100 0 l s gr end }
 >> [ 0.24 0 0 0.24 0 0 ] makepattern /P05 exch def /cs {[/Pattern /DeviceRGB] setcolorspace} def /FA {f [/DeviceRGB] setcolorspace} def cs 1 0 0 P05 setcolor 363 657 m 199 X 2 Y 99 X 2 Y 100 X 3 Y 99 X 4 Y 100 X 5 Y 100 X 7 Y 99 X 9 Y 100 X 11 Y 99
 X 19 Y 100 X 24 Y 99 X 40 Y 100 X 58 Y 99 X 103 Y 100 X 180 Y 99 X 343 Y 100 X 421 Y 99 X 174 Y -99 X -578 Y -100 X -333 Y -99 X -177 Y -100 X -114 Y -99 X -52 Y -100 X -46 Y -99 X -31 Y -100 X -19 Y -99 X -15 Y -100 X -11 Y -99 X -6 Y -100 X -7 Y
 -100 X -4 Y -99 X -4 Y -100 X -2 Y -99 X -2 Y -100 X -1 Y -99 X FA 6 lw 1 0 0 c 1 1 1 c 1 0 0 c 363 658 m 42 X s 420 658 m 42 X s 3 lw /w 21 def /w2 {w 2 div} def /w3 {w 3 div} def 413 658 m20 6 lw 462 659 m 43 X s 520 659 m 42 X s 3 lw 512 659 m20
 6 lw 562 661 m 42 X s 619 661 m 42 X s 3 lw 612 661 m20 6 lw 661 663 m 43 X s 719 663 m 42 X s 3 lw 711 663 m20 6 lw 761 667 m 42 X s 818 667 m 42 X s 3 lw 811 667 m20 6 lw 860 670 m 43 X s 918 670 m 42 X s 3 lw 910 670 m20 6 lw 960 676 m 42 X s
 1017 676 m 43 X s 3 lw 1010 676 m20 6 lw 1060 683 m 42 X s 1117 683 m 42 X s 3 lw 1109 683 m20 6 lw 1159 692 m 42 X s 1216 692 m 43 X s 3 lw 1209 692 m20 6 lw 1259 704 m 42 X s 1316 704 m 42 X s 3 lw 1308 704 m20 6 lw 1358 724 m 42 X s 1415 724 m 43
 X s 3 lw 1408 724 m20 6 lw 1458 755 m 42 X s 1515 755 m 42 X s 3 lw 1507 755 m20 6 lw 1557 786 m 42 X s 1615 786 m 42 X s 3 lw 1607 786 m20 6 lw 1657 851 m 42 X s 1714 851 m 42 X s 3 lw 1706 851 m20 6 lw 1756 957 m 42 X s 1814 957 m 42 X s 3 lw 1806
 957 m20 6 lw 1856 1135 m 42 X s 1913 1135 m 42 X s 3 lw 1906 1135 m20 6 lw 1955 1482 m 42 X s 2013 1482 m 42 X s 3 lw 2005 1482 m20 6 lw 2105 1964 m 10 Y s 2105 1989 m 10 Y s 2055 1981 m 42 X s 2112 1981 m 42 X s 3 lw 2105 1981 m20 6 lw black 3 lw 1
 lw << /PatternType 1 /PaintType 2 /TilingType 1 /BBox [ 0 0 100 100 ] /XStep 100 /YStep 100 /PaintProc { begin gsave 0 0 m 100 100 l s gr end } >> [ 0.24 0 0 0.24 0 0 ] makepattern /P04 exch def cs 0 0 0 P04 setcolor 363 658 m 99 X 1 Y 100 X 2 Y 99
 X 1 Y 100 X 5 Y 99 X 4 Y 100 X 6 Y 100 X 5 Y 99 X 12 Y 100 X 14 Y 99 X 19 Y 100 X 28 Y 99 X 40 Y 100 X 66 Y 99 X 102 Y 100 X 172 Y 99 X 317 Y 100 X 456 Y 99 X 29 Y -99 X -460 Y -100 X -331 Y -99 X -174 Y -100 X -104 Y -99 X -66 Y -100 X -41 Y -99 X
 -26 Y -100 X -21 Y -99 X -14 Y -100 X -11 Y -99 X -7 Y -100 X -7 Y -100 X -5 Y -99 X -2 Y -100 X -3 Y -99 X -3 Y -100 X -2 Y -99 X FA 6 lw black 1 1 1 c black 363 660 m 42 X s 420 660 m 42 X s 3 lw 413 660 m20 6 lw 462 659 m 43 X s 520 659 m 42 X s
 3 lw 512 659 m20 6 lw 562 663 m 42 X s 619 663 m 42 X s 3 lw 612 663 m20 6 lw 661 664 m 43 X s 719 664 m 42 X s 3 lw 711 664 m20 6 lw 761 667 m 42 X s 818 667 m 42 X s 3 lw 811 667 m20 6 lw 860 674 m 43 X s 918 674 m 42 X s 3 lw 910 674 m20 6 lw 960
 679 m 42 X s 1017 679 m 43 X s 3 lw 1010 679 m20 6 lw 1060 686 m 42 X s 1117 686 m 42 X s 3 lw 1109 686 m20 6 lw 1159 696 m 42 X s 1216 696 m 43 X s 3 lw 1209 696 m20 6 lw 1259 711 m 42 X s 1316 711 m 42 X s 3 lw 1308 711 m20 6 lw 1358 730 m 42 X s
 1415 730 m 43 X s 3 lw 1408 730 m20 6 lw 1458 758 m 42 X s 1515 758 m 42 X s 3 lw 1507 758 m20 6 lw 1557 795 m 42 X s 1615 795 m 42 X s 3 lw 1607 795 m20 6 lw 1657 867 m 42 X s 1714 867 m 42 X s 3 lw 1706 867 m20 6 lw 1756 964 m 42 X s 1814 964 m 42
 X s 3 lw 1806 964 m20 6 lw 1856 1135 m 42 X s 1913 1135 m 42 X s 3 lw 1906 1135 m20 6 lw 1955 1474 m 42 X s 2013 1474 m 42 X s 3 lw 2005 1474 m20 6 lw 2055 1931 m 42 X s 2112 1931 m 42 X s 3 lw 2105 1931 m20 6 lw 1 0.8 0 c 1 1 1 c 1 0.8 0 c 363 661
 m 42 X s 420 661 m 42 X s 3 lw 413 661 m20 6 lw 462 661 m 43 X s 520 661 m 42 X s 3 lw 512 661 m20 6 lw 562 663 m 42 X s 619 663 m 42 X s 3 lw 612 663 m20 6 lw 661 665 m 43 X s 719 665 m 42 X s 3 lw 711 665 m20 6 lw 761 670 m 42 X s 818 670 m 42 X s
 3 lw 811 670 m20 6 lw 860 675 m 43 X s 918 675 m 42 X s 3 lw 910 675 m20 6 lw 960 681 m 42 X s 1017 681 m 43 X s 3 lw 1010 681 m20 6 lw 1060 689 m 42 X s 1117 689 m 42 X s 3 lw 1109 689 m20 6 lw 1159 699 m 42 X s 1216 699 m 43 X s 3 lw 1209 699 m20
 6 lw 1259 716 m 42 X s 1316 716 m 42 X s 3 lw 1308 716 m20 6 lw 1358 733 m 42 X s 1415 733 m 43 X s 3 lw 1408 733 m20 6 lw 1458 766 m 42 X s 1515 766 m 42 X s 3 lw 1507 766 m20 6 lw 1557 809 m 42 X s 1615 809 m 42 X s 3 lw 1607 809 m20 6 lw 1657 877
 m 42 X s 1714 877 m 42 X s 3 lw 1706 877 m20 6 lw 1756 985 m 42 X s 1814 985 m 42 X s 3 lw 1806 985 m20 6 lw 1856 1156 m 42 X s 1913 1156 m 42 X s 3 lw 1906 1156 m20 6 lw 1955 1448 m 42 X s 2013 1448 m 42 X s 3 lw 2005 1448 m20 6 lw 2055 1871 m 42 X
 s 2112 1871 m 42 X s 3 lw 2105 1871 m20 6 lw 0.35 0.83 0.33 c 1 1 1 c 0.35 0.83 0.33 c 363 658 m 42 X s 420 658 m 42 X s 3 lw 413 658 m20 6 lw 462 659 m 43 X s 520 659 m 42 X s 3 lw 512 659 m20 6 lw 562 661 m 42 X s 619 661 m 42 X s 3 lw 612 661 m20
 6 lw 661 663 m 43 X s 719 663 m 42 X s 3 lw 711 663 m20 6 lw 761 667 m 42 X s 818 667 m 42 X s 3 lw 811 667 m20 6 lw 860 671 m 43 X s 918 671 m 42 X s 3 lw 910 671 m20 6 lw 960 677 m 42 X s 1017 677 m 43 X s 3 lw 1010 677 m20 6 lw 1060 684 m 42 X s
 1117 684 m 42 X s 3 lw 1109 684 m20 6 lw 1159 694 m 42 X s 1216 694 m 43 X s 3 lw 1209 694 m20 6 lw 1259 707 m 42 X s 1316 707 m 42 X s 3 lw 1308 707 m20 6 lw 1358 725 m 42 X s 1415 725 m 43 X s 3 lw 1408 725 m20 6 lw 1458 750 m 42 X s 1515 750 m 42
 X s 3 lw 1507 750 m20 6 lw 1557 787 m 42 X s 1615 787 m 42 X s 3 lw 1607 787 m20 6 lw 1657 844 m 42 X s 1714 844 m 42 X s 3 lw 1706 844 m20 6 lw 1756 942 m 42 X s 1814 942 m 42 X s 3 lw 1806 942 m20 6 lw 1856 1116 m 42 X s 1913 1116 m 42 X s 3 lw
 1906 1116 m20 6 lw 1955 1456 m 42 X s 2013 1456 m 42 X s 3 lw 2005 1456 m20 6 lw 2055 2055 m 42 X s 2112 2055 m 42 X s 3 lw 2105 2055 m20 6 lw black
 gsave  2268 2557 0 0 C 2222.06 1856.79 t 90 r /Helvetica-BoldOblique findfont 41.8538 sf 0 0 m (LHC HIGGS XS WG 2013) show NC gr  3 lw 1 1 1 c 841 640 1145 1708 bf black 1168 1708 m -15 Y 833 X 632 Y -15 X -617 Y f 1145 1708 m 640 Y 841 X -640 Y
 -841 X cl s
 gsave  2268 2557 0 0 C 1533.37 2275.33 t 0 r /Helvetica-Bold findfont 60.8783 sf 0 0 m (=125 GeV) show NC gr 
 gsave  2268 2557 0 0 C 1502.93 2244.89 t 0 r /Helvetica-Bold findfont 41.8538 sf 0 0 m (H) show NC gr 
 gsave  2268 2557 0 0 C 1228.98 2275.33 t 0 r /Helvetica-Bold findfont 60.8783 sf 0 0 m 
 219 202 186 151 118 85 69 35
(=8 TeV, m) K NC gr 
 gsave  2268 2557 0 0 C 1194.74 2275.33 t 0 r /Helvetica-Bold findfont 60.8783 sf 0 0 m (s) show NC gr  6 lw 1157 2310 m 23 -38 d s 0 lw 1180 2272 m 7 53 d s 1187 2325 m 42 X s
 gsave  2268 2557 0 0 C 1354.54 2134.55 t 0 r /Helvetica findfont 60.8783 sf 0 0 m (HRes) show NC gr  1 0 0 c 6 lw 1177 2156 m 147 X s black
 gsave  2268 2557 0 0 C 1354.54 2005.18 t 0 r /Helvetica findfont 60.8783 sf 0 0 m (POWHEG) show NC gr  1177 2028 m 147 X s
 gsave  2268 2557 0 0 C 1354.54 1883.42 t 0 r /Helvetica findfont 60.8783 sf 0 0 m (Madgraph) show NC gr  0.35 0.83 0.33 c 1177 1900 m 147 X s black
 gsave  2268 2557 0 0 C 1354.54 1750.25 t 0 r /Helvetica findfont 60.8783 sf 0 0 m (aMCatNLO) show NC gr  1 0.8 0 c 1177 1772 m 147 X s black 3 lw 1 1 1 c 2268 614 0 0 bf black 1 1 1 c 1791 369 363 245 bf black 1791 369 363 245 bl 1 1 1 c 1791 369
 363 245 bf black 1791 369 363 245 bl 363 245 m 1791 X s[ 4 8] 0 sd 363 614 m -369 Y s 562 614 m -369 Y s 761 614 m -369 Y s 960 614 m -369 Y s 1159 614 m -369 Y s 1358 614 m -369 Y s 1557 614 m -369 Y s 1756 614 m -369 Y s 1955 614 m -369 Y s 2154
 614 m -369 Y s[  ] 0 sd 363 614 m 1791 X s 363 245 m 369 Y s[ 4 8] 0 sd 2154 270 m -1791 X s 2154 319 m -1791 X s 2154 368 m -1791 X s 2154 417 m -1791 X s 2154 466 m -1791 X s 2154 515 m -1791 X s 2154 565 m -1791 X s 2154 614 m -1791 X s 2154 270
 m -1791 X s[  ] 0 sd 2154 245 m 369 Y s 1 0 0 c 6 lw 413 334 m 9 Y s 413 358 m 8 Y s 363 350 m 42 X s 420 350 m 42 X s 3 lw 413 350 m20 6 lw 512 351 m 9 Y s 512 375 m 9 Y s 462 367 m 43 X s 520 367 m 42 X s 3 lw 512 367 m20 6 lw 612 332 m 6 Y s 612
 354 m 6 Y s 562 346 m 42 X s 619 346 m 42 X s 3 lw 612 346 m20 6 lw 711 345 m 7 Y s 711 367 m 7 Y s 661 360 m 43 X s 719 360 m 42 X s 3 lw 711 360 m20 6 lw 811 348 m 6 Y s 811 369 m 6 Y s 761 362 m 42 X s 818 362 m 42 X s 3 lw 811 362 m20 6 lw 910
 330 m 4 Y s 910 349 m 4 Y s 860 341 m 43 X s 918 341 m 42 X s 3 lw 910 341 m20 6 lw 1010 338 m 3 Y s 1010 357 m 3 Y s 960 349 m 42 X s 1017 349 m 43 X s 3 lw 1010 349 m20 6 lw 1109 343 m 3 Y s 1109 361 m 3 Y s 1060 353 m 42 X s 1117 353 m 42 X s 3
 lw 1109 353 m20 6 lw 1209 343 m 3 Y s 1209 362 m 3 Y s 1159 354 m 42 X s 1216 354 m 43 X s 3 lw 1209 354 m20 6 lw 1308 337 m 3 Y s 1308 355 m 2 Y s 1259 347 m 42 X s 1316 347 m 42 X s 3 lw 1308 347 m20 6 lw 1408 343 m 1 Y s 1408 359 m 1 Y s 1358 351
 m 42 X s 1415 351 m 43 X s 3 lw 1408 351 m20 6 lw 1507 350 m 4 Y s 1507 369 m 3 Y s 1458 361 m 42 X s 1515 361 m 42 X s 3 lw 1507 361 m20 6 lw 1607 344 m 2 Y s 1607 361 m 2 Y s 1557 354 m 42 X s 1615 354 m 42 X s 3 lw 1607 354 m20 6 lw 1657 351 m 42
 X s 1714 351 m 42 X s 3 lw 1706 351 m20 6 lw 1756 363 m 42 X s 1814 363 m 42 X s 3 lw 1806 363 m20 6 lw 1856 368 m 42 X s 1913 368 m 42 X s 3 lw 1906 368 m20 6 lw 1955 370 m 42 X s 2013 370 m 42 X s 3 lw 2005 370 m20 6 lw 2055 378 m 42 X s 2112 378
 m 42 X s 3 lw 2105 378 m20 6 lw black 3 lw 363 245 m 1791 X s
 gsave  2268 614 0 0 C 2130.74 83.7077 t 0 r /Helvetica-Bold findfont 72.4187 sf 0 0 m (\)) show NC gr 
 gsave  2268 614 0 0 C 2092.69 83.7077 t 0 r /Symbol findfont 72.4187 sf 0 0 m (g) show NC gr 
 gsave  2268 614 0 0 C 2077.47 83.7077 t 0 r /Helvetica-Bold findfont 72.4187 sf 0 0 m (,) show NC gr 
 gsave  2268 614 0 0 C 2039.42 83.7077 t 0 r /Symbol findfont 72.4187 sf 0 0 m (g) show NC gr 
 gsave  2268 614 0 0 C 2016.59 83.7077 t 0 r /Helvetica-Bold findfont 72.4187 sf 0 0 m (\() show NC gr 
 gsave  2268 614 0 0 C 1978.54 83.7077 t 0 r /Symbol findfont 72.4187 sf 0 0 m (f) show NC gr 
 gsave  2268 614 0 0 C 1932.89 83.7077 t 0 r /Symbol findfont 72.4187 sf 0 0 m (D) show NC gr  363 260 m -15 Y s 413 253 m -8 Y s 462 253 m -8 Y s 512 253 m -8 Y s 562 260 m -15 Y s 612 253 m -8 Y s 661 253 m -8 Y s 711 253 m -8 Y s 761 260 m -15 Y s
 811 253 m -8 Y s 860 253 m -8 Y s 910 253 m -8 Y s 960 260 m -15 Y s 1010 253 m -8 Y s 1060 253 m -8 Y s 1109 253 m -8 Y s 1159 260 m -15 Y s 1209 253 m -8 Y s 1259 253 m -8 Y s 1308 253 m -8 Y s 1358 260 m -15 Y s 1408 253 m -8 Y s 1458 253 m -8 Y
 s 1507 253 m -8 Y s 1557 260 m -15 Y s 1607 253 m -8 Y s 1657 253 m -8 Y s 1706 253 m -8 Y s 1756 260 m -15 Y s 1806 253 m -8 Y s 1856 253 m -8 Y s 1906 253 m -8 Y s 1955 260 m -15 Y s 2005 253 m -8 Y s 2055 253 m -8 Y s 2105 253 m -8 Y s 2154 260 m
 -15 Y s
 gsave  2268 614 0 0 C 342.44 182.635 t 0 r /Helvetica-Bold findfont 72.4187 sf 0 0 m (0) show NC gr 
 gsave  2268 614 0 0 C 517.466 182.635 t 0 r /Helvetica-Bold findfont 72.4187 sf 0 0 m (20) show NC gr 
 gsave  2268 614 0 0 C 715.32 182.635 t 0 r /Helvetica-Bold findfont 72.4187 sf 0 0 m (40) show NC gr 
 gsave  2268 614 0 0 C 916.979 182.635 t 0 r /Helvetica-Bold findfont 72.4187 sf 0 0 m (60) show NC gr 
 gsave  2268 614 0 0 C 1114.83 182.635 t 0 r /Helvetica-Bold findfont 72.4187 sf 0 0 m (80) show NC gr 
 gsave  2268 614 0 0 C 1293.66 182.635 t 0 r /Helvetica-Bold findfont 72.4187 sf 0 0 m (100) show NC gr 
 gsave  2268 614 0 0 C 1495.32 182.635 t 0 r /Helvetica-Bold findfont 72.4187 sf 0 0 m (120) show NC gr 
 gsave  2268 614 0 0 C 1693.18 182.635 t 0 r /Helvetica-Bold findfont 72.4187 sf 0 0 m (140) show NC gr 
 gsave  2268 614 0 0 C 1891.03 182.635 t 0 r /Helvetica-Bold findfont 72.4187 sf 0 0 m (160) show NC gr 
 gsave  2268 614 0 0 C 2092.69 182.635 t 0 r /Helvetica-Bold findfont 72.4187 sf 0 0 m (180) show NC gr  363 614 m 1791 X s 363 599 m 15 Y s 413 606 m 8 Y s 462 606 m 8 Y s 512 606 m 8 Y s 562 599 m 15 Y s 612 606 m 8 Y s 661 606 m 8 Y s 711 606 m 8
 Y s 761 599 m 15 Y s 811 606 m 8 Y s 860 606 m 8 Y s 910 606 m 8 Y s 960 599 m 15 Y s 1010 606 m 8 Y s 1060 606 m 8 Y s 1109 606 m 8 Y s 1159 599 m 15 Y s 1209 606 m 8 Y s 1259 606 m 8 Y s 1308 606 m 8 Y s 1358 599 m 15 Y s 1408 606 m 8 Y s 1458 606
 m 8 Y s 1507 606 m 8 Y s 1557 599 m 15 Y s 1607 606 m 8 Y s 1657 606 m 8 Y s 1706 606 m 8 Y s 1756 599 m 15 Y s 1806 606 m 8 Y s 1856 606 m 8 Y s 1906 606 m 8 Y s 1955 599 m 15 Y s 2005 606 m 8 Y s 2055 606 m 8 Y s 2105 606 m 8 Y s 2154 599 m 15 Y s
 363 245 m 369 Y s
 gsave  2268 614 0 0 C 228.294 53.2685 t 90 r /Helvetica-Bold findfont 72.4187 sf 0 0 m (Ratio to Powheg) show NC gr  404 270 m -41 X s 383 282 m -20 X s 383 295 m -20 X s 383 307 m -20 X s 404 319 m -41 X s 383 331 m -20 X s 383 344 m -20 X s 383
 356 m -20 X s 404 368 m -41 X s 383 380 m -20 X s 383 393 m -20 X s 383 405 m -20 X s 404 417 m -41 X s 383 430 m -20 X s 383 442 m -20 X s 383 454 m -20 X s 404 466 m -41 X s 383 479 m -20 X s 383 491 m -20 X s 383 503 m -20 X s 404 515 m -41 X s
 383 528 m -20 X s 383 540 m -20 X s 383 552 m -20 X s 404 565 m -41 X s 383 577 m -20 X s 383 589 m -20 X s 383 601 m -20 X s 404 614 m -41 X s 404 270 m -41 X s 383 258 m -20 X s 383 245 m -20 X s
 gsave  2268 614 0 0 C 292.977 254.928 t 0 r /Helvetica-Bold findfont 41.9266 sf 0 0 m (0.6) show NC gr 
 gsave  2268 614 0 0 C 292.977 304.391 t 0 r /Helvetica-Bold findfont 41.9266 sf 0 0 m (0.8) show NC gr 
 gsave  2268 614 0 0 C 331.026 350.05 t 0 r /Helvetica-Bold findfont 41.9266 sf 0 0 m (1) show NC gr 
 gsave  2268 614 0 0 C 292.977 399.514 t 0 r /Helvetica-Bold findfont 41.9266 sf 0 0 m (1.2) show NC gr 
 gsave  2268 614 0 0 C 289.172 448.977 t 0 r /Helvetica-Bold findfont 41.9266 sf 0 0 m (1.4) show NC gr 
 gsave  2268 614 0 0 C 292.977 502.246 t 0 r /Helvetica-Bold findfont 41.9266 sf 0 0 m (1.6) show NC gr 
 gsave  2268 614 0 0 C 292.977 551.71 t 0 r /Helvetica-Bold findfont 41.9266 sf 0 0 m (1.8) show NC gr 
 gsave  2268 614 0 0 C 327.221 597.368 t 0 r /Helvetica-Bold findfont 41.9266 sf 0 0 m (2) show NC gr  2154 245 m 369 Y s 2114 270 m 40 X s 2134 282 m 20 X s 2134 295 m 20 X s 2134 307 m 20 X s 2114 319 m 40 X s 2134 331 m 20 X s 2134 344 m 20 X s
 2134 356 m 20 X s 2114 368 m 40 X s 2134 380 m 20 X s 2134 393 m 20 X s 2134 405 m 20 X s 2114 417 m 40 X s 2134 430 m 20 X s 2134 442 m 20 X s 2134 454 m 20 X s 2114 466 m 40 X s 2134 479 m 20 X s 2134 491 m 20 X s 2134 503 m 20 X s 2114 515 m 40 X
 s 2134 528 m 20 X s 2134 540 m 20 X s 2134 552 m 20 X s 2114 565 m 40 X s 2134 577 m 20 X s 2134 589 m 20 X s 2134 601 m 20 X s 2114 614 m 40 X s 2114 270 m 40 X s 2134 258 m 20 X s 2134 245 m 20 X s 1 0.8 0 c 6 lw 1 1 1 c 1 0.8 0 c 413 365 m 3 Y s
 413 384 m 3 Y s 363 376 m 42 X s 420 376 m 42 X s 3 lw 413 376 m20 6 lw 512 379 m 4 Y s 512 398 m 5 Y s 462 391 m 43 X s 520 391 m 42 X s 3 lw 512 391 m20 6 lw 612 358 m 3 Y s 612 376 m 3 Y s 562 369 m 42 X s 619 369 m 42 X s 3 lw 612 369 m20 6 lw
 711 372 m 3 Y s 711 391 m 3 Y s 661 383 m 43 X s 719 383 m 42 X s 3 lw 711 383 m20 6 lw 811 378 m 3 Y s 811 396 m 3 Y s 761 388 m 42 X s 818 388 m 42 X s 3 lw 811 388 m20 6 lw 910 363 m 1 Y s 910 379 m 1 Y s 860 371 m 43 X s 918 371 m 42 X s 3 lw
 910 371 m20 6 lw 1010 367 m s 1010 383 m s 960 375 m 42 X s 1017 375 m 43 X s 3 lw 1010 375 m20 6 lw 1109 373 m s 1109 388 m s 1060 381 m 42 X s 1117 381 m 42 X s 3 lw 1109 381 m20 6 lw 1159 383 m 42 X s 1216 383 m 43 X s 3 lw 1209 383 m20 6 lw 1259
 387 m 42 X s 1316 387 m 42 X s 3 lw 1308 387 m20 6 lw 1358 376 m 42 X s 1415 376 m 43 X s 3 lw 1408 376 m20 6 lw 1458 384 m 42 X s 1515 384 m 42 X s 3 lw 1507 384 m20 6 lw 1557 391 m 42 X s 1615 391 m 42 X s 3 lw 1607 391 m20 6 lw 1657 378 m 42 X s
 1714 378 m 42 X s 3 lw 1706 378 m20 6 lw 1756 384 m 42 X s 1814 384 m 42 X s 3 lw 1806 384 m20 6 lw 1856 378 m 42 X s 1913 378 m 42 X s 3 lw 1906 378 m20 6 lw 1955 361 m 42 X s 2013 361 m 42 X s 3 lw 2005 361 m20 6 lw 2055 357 m 42 X s 2112 357 m 42
 X s 3 lw 2105 357 m20 6 lw 0.35 0.83 0.33 c 1 1 1 c 0.35 0.83 0.33 c 413 341 m 2 Y s 413 359 m 2 Y s 363 351 m 42 X s 420 351 m 42 X s 3 lw 413 351 m20 6 lw 512 355 m 3 Y s 512 374 m 3 Y s 462 366 m 43 X s 520 366 m 42 X s 3 lw 512 366 m20 6 lw 612
 337 m 2 Y s 612 354 m 1 Y s 562 346 m 42 X s 619 346 m 42 X s 3 lw 612 346 m20 6 lw 711 355 m 2 Y s 711 373 m 2 Y s 661 365 m 43 X s 719 365 m 42 X s 3 lw 711 365 m20 6 lw 811 355 m 2 Y s 811 372 m 2 Y s 761 364 m 42 X s 818 364 m 42 X s 3 lw 811
 364 m20 6 lw 860 346 m 43 X s 918 346 m 42 X s 3 lw 910 346 m20 6 lw 960 352 m 42 X s 1017 352 m 43 X s 3 lw 1010 352 m20 6 lw 1060 358 m 42 X s 1117 358 m 42 X s 3 lw 1109 358 m20 6 lw 1159 362 m 42 X s 1216 362 m 43 X s 3 lw 1209 362 m20 6 lw 1259
 356 m 42 X s 1316 356 m 42 X s 3 lw 1308 356 m20 6 lw 1358 353 m 42 X s 1415 353 m 43 X s 3 lw 1408 353 m20 6 lw 1458 351 m 42 X s 1515 351 m 42 X s 3 lw 1507 351 m20 6 lw 1557 355 m 42 X s 1615 355 m 42 X s 3 lw 1607 355 m20 6 lw 1657 343 m 42 X s
 1714 343 m 42 X s 3 lw 1706 343 m20 6 lw 1756 352 m 42 X s 1814 352 m 42 X s 3 lw 1806 352 m20 6 lw 1856 359 m 42 X s 1913 359 m 42 X s 3 lw 1906 359 m20 6 lw 1955 363 m 42 X s 2013 363 m 42 X s 3 lw 2005 363 m20 6 lw 2055 392 m 42 X s 2112 392 m 42
 X s 3 lw 2105 392 m20 6 lw black 363 368 m 1791 X s
 gr  gr showpage
end
%%EOF
