%!PS-Adobe-2.0 EPSF-2.0
%%BoundingBox:  0 0 567 544
%%Title: HWW_600_DeltaPhi_ll_NNLO_cut_YR3.eps: HWW 600Gev dPhi NNLO with cuts
%%Creator: ROOT Version 5.34/05
%%CreationDate: Fri Jun 14 04:56:10 2013
%%EndComments
%%BeginProlog
80 dict begin
/s {stroke} def /l {lineto} def /m {moveto} def /t {translate} def
/r {rotate} def /rl {roll}  def /R {repeat} def
/d {rlineto} def /rm {rmoveto} def /gr {grestore} def /f {eofill} def
/c {setrgbcolor} def /black {0 setgray} def /sd {setdash} def
/cl {closepath} def /sf {scalefont setfont} def /lw {setlinewidth} def
/box {m dup 0 exch d exch 0 d 0 exch neg d cl} def
/NC{systemdict begin initclip end}def/C{NC box clip newpath}def
/bl {box s} def /bf {box f} def /Y { 0 exch d} def /X { 0 d} def 
/K {{pop pop 0 moveto} exch kshow} bind def
/ita {/ang 15 def gsave [1 0 ang dup sin exch cos div 1 0 0] concat} def 
/mp {newpath /y exch def /x exch def} def
/side {[w .77 mul w .23 mul] .385 w mul sd w 0 l currentpoint t -144 r} def
/mr {mp x y w2 0 360 arc} def /m24 {mr s} def /m20 {mr f} def
/mb {mp x y w2 add m w2 neg 0 d 0 w neg d w 0 d 0 w d cl} def
/mt {mp x y w2 add m w2 neg w neg d w 0 d cl} def
/m21 {mb f} def /m25 {mb s} def /m22 {mt f} def /m26{mt s} def
/m23 {mp x y w2 sub m w2 w d w neg 0 d cl f} def
/m27 {mp x y w2 add m w3 neg w2 neg d w3 w2 neg d w3 w2 d cl s} def
/m28 {mp x w2 sub y w2 sub w3 add m w3 0 d  0 w3 neg d w3 0 d 0 w3 d w3 0 d  0 w3 d w3 neg 0 d 0 w3 d w3 neg 0 d 0 w3 neg d w3 neg 0 d cl s } def
/m29 {mp gsave x w2 sub y w2 add w3 sub m currentpoint t 4 {side} repeat cl fill gr} def
/m30 {mp gsave x w2 sub y w2 add w3 sub m currentpoint t 4 {side} repeat cl s gr} def
/m31 {mp x y w2 sub m 0 w d x w2 sub y m w 0 d x w2 sub y w2 add m w w neg d x w2 sub y w2 sub m w w d s} def
/m32 {mp x y w2 sub m w2 w d w neg 0 d cl s} def
/m33 {mp x y w2 add m w3 neg w2 neg d w3 w2 neg d w3 w2 d cl f} def
/m34 {mp x w2 sub y w2 sub w3 add m w3 0 d  0 w3 neg d w3 0 d 0 w3 d w3 0 d  0 w3 d w3 neg 0 d 0 w3 d w3 neg 0 d 0 w3 neg d w3 neg 0 d cl f } def
/m2 {mp x y w2 sub m 0 w d x w2 sub y m w 0 d s} def
/m5 {mp x w2 sub y w2 sub m w w d x w2 sub y w2 add m w w neg d s} def
/reEncode {exch findfont dup length dict begin {1 index /FID eq  {pop pop} {def} ifelse } forall /Encoding exch def currentdict end dup /FontName get exch definefont pop } def [/Times-Bold /Times-Italic /Times-BoldItalic /Helvetica /Helvetica-Oblique
 /Helvetica-Bold /Helvetica-BoldOblique /Courier /Courier-Oblique /Courier-Bold /Courier-BoldOblique /Times-Roman /AvantGarde-Book /AvantGarde-BookOblique /AvantGarde-Demi /AvantGarde-DemiOblique /Bookman-Demi /Bookman-DemiItalic /Bookman-Light
 /Bookman-LightItalic /Helvetica-Narrow /Helvetica-Narrow-Bold /Helvetica-Narrow-BoldOblique /Helvetica-Narrow-Oblique /NewCenturySchlbk-Roman /NewCenturySchlbk-Bold /NewCenturySchlbk-BoldItalic /NewCenturySchlbk-Italic /Palatino-Bold
 /Palatino-BoldItalic /Palatino-Italic /Palatino-Roman ] {ISOLatin1Encoding reEncode } forall
%%EndProlog
%%BeginSetup
%%EndSetup
newpath  gsave  .25 .25 scale  gsave  0 0 t black[  ] 0 sd 3 lw 1 1 1 c 2268 2177 0 0 bf black 1 1 1 c 2222 2133 23 22 bf black 1 1 1 c 1778 1706 245 235 bf black 1778 1706 245 235 bl 0.8 0 0.8 c 1 1 1 c 1 0 1 c 0.8 0 0.8 c 245 235 m 89 X 856 Y 9 X
 300 Y 9 X 72 Y 8 X 93 Y 9 X 75 Y 9 X 76 Y 9 X 65 Y 9 X 53 Y 9 X 34 Y 9 X -30 Y 9 X -34 Y 9 X -56 Y 8 X -62 Y 9 X -87 Y 9 X -88 Y 9 X -91 Y 9 X -103 Y 9 X -70 Y 9 X -104 Y 9 X -85 Y 9 X -62 Y 8 X -67 Y 9 X -59 Y 9 X -59 Y 9 X -50 Y 9 X -55 Y 9 X -34
 Y 9 X -47 Y 9 X -27 Y 9 X -34 Y 8 X -28 Y 9 X -33 Y 9 X -15 Y 9 X -21 Y 9 X -21 Y 9 X -19 Y 9 X -8 Y 9 X -12 Y 9 X -16 Y 8 X -5 Y 9 X -20 Y 9 X -6 Y 9 X -15 Y 9 X -6 Y 9 X -5 Y 9 X -3 Y 9 X -4 Y 9 X -9 Y 9 X -4 Y 8 X -5 Y 9 X -5 Y 9 X -3 Y 9 X -2 Y
 9 X -5 Y 9 X -6 Y 9 X 3 Y 9 X -8 Y 9 X 2 Y 8 X -5 Y 9 X 2 Y 9 X -3 Y 9 X -1 Y 9 X -3 Y 9 X 2 Y 9 X -5 Y 9 X 3 Y 9 X -5 Y 8 X -1 Y 9 X -2 Y 9 X 2 Y 9 X -4 Y 9 X 1 Y 18 X -2 Y 9 X 1 Y 17 X 1 Y 9 X -1 Y 9 X -2 Y 18 X -1 Y 9 X 2 Y 9 X -3 Y 9 X 2 Y 9 X
 -4 Y 8 X 5 Y 9 X -1 Y 9 X -4 Y 18 X 2 Y 9 X -1 Y 18 X 2 Y 9 X -1 Y 17 X 4 Y 9 X -5 Y 9 X 2 Y 9 X 2 Y 9 X 2 Y 9 X -6 Y 9 X 5 Y 9 X 1 Y 17 X -2 Y 9 X -1 Y 9 X 4 Y 18 X -1 Y 9 X 2 Y 26 X 2 Y 9 X 1 Y 18 X 1 Y 9 X 3 Y 9 X -2 Y 9 X 4 Y 9 X 2 Y 9 X 1 Y 8 X
 3 Y 9 X 5 Y 9 X 1 Y 9 X -3 Y 9 X 8 Y 9 X 3 Y 9 X 2 Y 9 X 3 Y 9 X 4 Y 8 X 5 Y 9 X 4 Y 9 X 3 Y 9 X -1 Y 9 X 15 Y 9 X 8 Y 9 X 3 Y 9 X 12 Y 9 X 6 Y 8 X 7 Y 9 X 7 Y 9 X 10 Y 9 X 12 Y 9 X 24 Y 9 X 12 Y 9 X 20 Y 9 X 13 Y 9 X 22 Y 8 X 30 Y 9 X 19 Y 9 X 29 Y
 9 X 26 Y 9 X 36 Y 9 X 47 Y 9 X 38 Y 9 X 48 Y 9 X 50 Y 8 X 55 Y 9 X 57 Y 9 X 81 Y 9 X 66 Y 9 X 77 Y 9 X 92 Y 9 X 79 Y 9 X 96 Y 9 X 97 Y 8 X 69 Y 9 X 98 Y 9 X 66 Y 9 X 66 Y 9 X 34 Y 9 X 25 Y 9 X -32 Y 9 X -53 Y 9 X -69 Y 8 X -76 Y 9 X -83 Y 9 X -80 Y
 9 X -78 Y 9 X -305 Y 9 X -849 Y 89 X s black 245 235 m 1778 X s
 gsave  2222 2133 23 22 C 1986.63 98.7615 t 0 r /Symbol findfont 68.4392 sf 0 0 m (f) show NC gr 
 gsave  2222 2133 23 22 C 1944.84 98.7615 t 0 r /Symbol findfont 68.4392 sf 0 0 m (D) show NC gr  372 286 m -51 Y s 423 261 m -26 Y s 473 261 m -26 Y s 524 261 m -26 Y s 575 261 m -26 Y s 626 286 m -51 Y s 677 261 m -26 Y s 727 261 m -26 Y s 778 261
 m -26 Y s 829 261 m -26 Y s 880 286 m -51 Y s 931 261 m -26 Y s 981 261 m -26 Y s 1032 261 m -26 Y s 1083 261 m -26 Y s 1134 286 m -51 Y s 1185 261 m -26 Y s 1235 261 m -26 Y s 1286 261 m -26 Y s 1337 261 m -26 Y s 1388 286 m -51 Y s 1439 261 m -26
 Y s 1489 261 m -26 Y s 1540 261 m -26 Y s 1591 261 m -26 Y s 1642 286 m -51 Y s 1693 261 m -26 Y s 1743 261 m -26 Y s 1794 261 m -26 Y s 1845 261 m -26 Y s 1896 286 m -51 Y s 372 286 m -51 Y s 321 261 m -26 Y s 270 261 m -26 Y s 1896 286 m -51 Y s
 1947 261 m -26 Y s 1997 261 m -26 Y s
 gsave  2222 2133 23 22 C 338.068 167.135 t 0 r /Helvetica findfont 68.4392 sf 0 0 m (\2553) show NC gr 
 gsave  2222 2133 23 22 C 592.569 167.135 t 0 r /Helvetica findfont 68.4392 sf 0 0 m (\2552) show NC gr 
 gsave  2222 2133 23 22 C 850.869 167.135 t 0 r /Helvetica findfont 68.4392 sf 0 0 m (\2551) show NC gr 
 gsave  2222 2133 23 22 C 1112.97 167.135 t 0 r /Helvetica findfont 68.4392 sf 0 0 m (0) show NC gr 
 gsave  2222 2133 23 22 C 1371.27 167.135 t 0 r /Helvetica findfont 68.4392 sf 0 0 m (1) show NC gr 
 gsave  2222 2133 23 22 C 1621.97 167.135 t 0 r /Helvetica findfont 68.4392 sf 0 0 m (2) show NC gr 
 gsave  2222 2133 23 22 C 1876.47 167.135 t 0 r /Helvetica findfont 68.4392 sf 0 0 m (3) show NC gr  245 235 m 1706 Y s
 gsave  2222 2133 23 22 C 83.5674 1162.35 t 90 r /Symbol findfont 68.4392 sf 0 0 m (f) show NC gr 
 gsave  2222 2133 23 22 C 83.5674 1120.56 t 90 r /Symbol findfont 68.4392 sf 0 0 m (D) show NC gr 
 gsave  2222 2133 23 22 C 83.5674 1063.59 t 90 r /Helvetica findfont 68.4392 sf 0 0 m (/d) show NC gr 
 gsave  2222 2133 23 22 C 83.5674 1021.8 t 90 r /Symbol findfont 68.4392 sf 0 0 m (s) show NC gr 
 gsave  2222 2133 23 22 C 83.5674 987.615 t 90 r /Helvetica findfont 68.4392 sf 0 0 m (d) show NC gr  298 235 m -53 X s 272 280 m -27 X s 272 325 m -27 X s 272 370 m -27 X s 272 415 m -27 X s 298 459 m -53 X s 272 504 m -27 X s 272 549 m -27 X s 272
 594 m -27 X s 272 639 m -27 X s 298 684 m -53 X s 272 729 m -27 X s 272 774 m -27 X s 272 819 m -27 X s 272 863 m -27 X s 298 908 m -53 X s 272 953 m -27 X s 272 998 m -27 X s 272 1043 m -27 X s 272 1088 m -27 X s 298 1133 m -53 X s 272 1178 m -27 X
 s 272 1223 m -27 X s 272 1267 m -27 X s 272 1312 m -27 X s 298 1357 m -53 X s 272 1402 m -27 X s 272 1447 m -27 X s 272 1492 m -27 X s 272 1537 m -27 X s 298 1582 m -53 X s 272 1626 m -27 X s 272 1671 m -27 X s 272 1716 m -27 X s 272 1761 m -27 X s
 298 1806 m -53 X s 298 1806 m -53 X s 272 1851 m -27 X s 272 1896 m -27 X s 272 1941 m -27 X s
 gsave  2222 2133 23 22 C 208.919 220.314 t 0 r /Helvetica findfont 38.0218 sf 0 0 m (0) show NC gr 
 gsave  2222 2133 23 22 C 136.747 444.427 t 0 r /Helvetica findfont 38.0218 sf 0 0 m (0.005) show NC gr 
 gsave  2222 2133 23 22 C 163.336 672.338 t 0 r /Helvetica findfont 38.0218 sf 0 0 m (0.01) show NC gr 
 gsave  2222 2133 23 22 C 136.747 896.451 t 0 r /Helvetica findfont 38.0218 sf 0 0 m (0.015) show NC gr 
 gsave  2222 2133 23 22 C 155.739 1120.56 t 0 r /Helvetica findfont 38.0218 sf 0 0 m (0.02) show NC gr 
 gsave  2222 2133 23 22 C 136.747 1344.68 t 0 r /Helvetica findfont 38.0218 sf 0 0 m (0.025) show NC gr 
 gsave  2222 2133 23 22 C 159.538 1568.79 t 0 r /Helvetica findfont 38.0218 sf 0 0 m (0.03) show NC gr 
 gsave  2222 2133 23 22 C 136.747 1792.9 t 0 r /Helvetica findfont 38.0218 sf 0 0 m (0.035) show NC gr  0.8 0 0.8 c 1 0 1 c /w 2 def /w2 {w 2 div} def /w3 {w 3 div} def 249 235 m20 258 235 m20 267 235 m20 276 235 m20 285 235 m20 294 235 m20 303 235
 m20 312 235 m20 320 235 m20 329 235 m20 338 1091 m20 347 1391 m20 356 1463 m20 365 1556 m20 374 1631 m20 383 1707 m20 392 1772 m20 400 1825 m20 409 1859 m20 418 1829 m20 427 1795 m20 436 1739 m20 445 1677 m20 454 1590 m20 463 1502 m20 472 1411 m20
 480 1308 m20 489 1238 m20 498 1134 m20 507 1049 m20 516 987 m20 525 920 m20 534 861 m20 543 802 m20 552 752 m20 560 697 m20 569 663 m20 578 616 m20 587 589 m20 596 555 m20 605 527 m20 614 494 m20 623 479 m20 632 458 m20 640 437 m20 649 418 m20 658
 410 m20 667 398 m20 676 382 m20 685 377 m20 694 357 m20 703 351 m20 712 336 m20 720 330 m20 729 325 m20 738 322 m20 747 318 m20 756 309 m20 765 305 m20 774 300 m20 783 295 m20 792 292 m20 801 290 m20 809 285 m20 818 279 m20 827 282 m20 836 274 m20
 845 276 m20 854 271 m20 863 273 m20 872 270 m20 881 269 m20 889 266 m20 898 268 m20 907 263 m20 916 266 m20 925 261 m20 934 260 m20 943 258 m20 952 260 m20 961 256 m20 969 257 m20 978 257 m20 987 255 m20 996 256 m20 1005 256 m20 1014 257 m20 1023
 256 m20 1032 254 m20 1041 254 m20 1049 253 m20 1058 255 m20 1067 252 m20 1076 254 m20 1085 250 m20 1094 255 m20 1103 254 m20 1112 250 m20 1121 250 m20 1129 252 m20 1138 251 m20 1147 251 m20 1156 253 m20 1165 252 m20 1174 252 m20 1183 256 m20 1192
 251 m20 1201 253 m20 1209 255 m20 1218 257 m20 1227 251 m20 1236 256 m20 1245 257 m20 1254 257 m20 1263 255 m20 1272 254 m20 1281 258 m20 1289 258 m20 1298 257 m20 1307 259 m20 1316 259 m20 1325 259 m20 1334 261 m20 1343 262 m20 1352 262 m20 1361
 263 m20 1369 266 m20 1378 264 m20 1387 268 m20 1396 270 m20 1405 271 m20 1414 274 m20 1423 279 m20 1432 280 m20 1441 277 m20 1449 285 m20 1458 288 m20 1467 290 m20 1476 293 m20 1485 297 m20 1494 302 m20 1503 306 m20 1512 309 m20 1521 308 m20 1529
 323 m20 1538 331 m20 1547 334 m20 1556 346 m20 1565 352 m20 1574 359 m20 1583 366 m20 1592 376 m20 1601 388 m20 1609 412 m20 1618 424 m20 1627 444 m20 1636 457 m20 1645 479 m20 1654 509 m20 1663 528 m20 1672 557 m20 1681 583 m20 1689 619 m20 1698
 666 m20 1707 704 m20 1716 752 m20 1725 802 m20 1734 857 m20 1743 914 m20 1752 995 m20 1761 1061 m20 1769 1138 m20 1778 1230 m20 1787 1309 m20 1796 1405 m20 1805 1502 m20 1814 1571 m20 1823 1669 m20 1832 1735 m20 1841 1801 m20 1849 1835 m20 1858 1860
 m20 1867 1828 m20 1876 1775 m20 1885 1706 m20 1894 1630 m20 1903 1547 m20 1912 1467 m20 1921 1389 m20 1929 1084 m20 1938 235 m20 1947 235 m20 1956 235 m20 1965 235 m20 1974 235 m20 1983 235 m20 1992 235 m20 2001 235 m20 2009 235 m20 2018 235 m20 0.8
 0 0.8 c black 0.8 0 0.8 c 1 lw << /PatternType 1 /PaintType 2 /TilingType 1 /BBox [ 0 0 100 100 ] /XStep 100 /YStep 100 /PaintProc { begin gsave 0 0 m 100 100 l 0 100 m 100 0 l s gr end } >> [ 0.24 0 0 0.24 0 0 ] makepattern /P13 exch def /cs
 {[/Pattern /DeviceRGB] setcolorspace} def /FA {f [/DeviceRGB] setcolorspace} def cs 0.8 0 0.8 P13 setcolor 249 235 m 80 X 9 862 d 9 301 d 9 72 d 9 93 d 9 75 d 9 77 d 9 65 d 8 53 d 9 34 d 9 -30 d 9 -34 d 9 -56 d 9 -62 d 9 -87 d 9 -88 d 9 -91 d 8 -103
 d 9 -70 d 9 -105 d 9 -85 d 9 -63 d 9 -66 d 9 -60 d 9 -59 d 9 -50 d 8 -55 d 9 -35 d 9 -47 d 9 -27 d 9 -34 d 9 -28 d 9 -33 d 9 -16 d 9 -21 d 8 -20 d 9 -20 d 9 -8 d 9 -13 d 9 -15 d 9 -6 d 9 -20 d 9 -6 d 9 -15 d 8 -6 d 9 -4 d 9 -4 d 9 -4 d 9 -9 d 9 -5 d
 9 -5 d 9 -4 d 9 -4 d 9 -1 d 8 -6 d 9 -5 d 9 3 d 9 -9 d 9 2 d 9 -5 d 9 3 d 9 -4 d 9 -1 d 8 -3 d 9 2 d 9 -5 d 9 4 d 9 -6 d 9 -2 d 9 -1 d 9 2 d 9 -5 d 8 2 d 9 X 9 -3 d 9 1 d 9 1 d 9 1 d 9 -1 d 9 -2 d 9 -1 d 8 -1 d 9 3 d 9 -3 d 9 2 d 9 -5 d 9 6 d 9 -1 d
 9 -5 d 9 X 8 2 d 9 -1 d 9 1 d 9 2 d 9 -2 d 9 1 d 9 3 d 9 -5 d 9 3 d 8 2 d 9 2 d 9 -7 d 9 6 d 9 1 d 9 X 9 -2 d 9 -2 d 9 5 d 8 X 9 -1 d 9 1 d 9 1 d 9 X 9 2 d 9 X 9 1 d 9 1 d 8 3 d 9 -3 d 9 5 d 9 2 d 9 1 d 9 3 d 9 5 d 9 2 d 9 -4 d 8 9 d 9 3 d 9 1 d 9 4
 d 9 4 d 9 5 d 9 3 d 9 4 d 9 -1 d 8 15 d 9 9 d 9 2 d 9 12 d 9 6 d 9 7 d 9 8 d 9 9 d 9 13 d 8 24 d 9 12 d 9 20 d 9 13 d 9 22 d 9 31 d 9 19 d 9 28 d 9 27 d 8 37 d 9 46 d 9 38 d 9 48 d 9 51 d 9 55 d 9 57 d 9 82 d 9 66 d 8 77 d 9 92 d 9 80 d 9 96 d 9 98
 d 9 68 d 9 98 d 9 66 d 9 66 d 8 35 d 9 24 d 9 -32 d 9 -54 d 9 -68 d 9 -77 d 9 -83 d 9 -80 d 9 -79 d 8 -305 d 9 -855 d 80 X -80 X -9 843 d -8 304 d -9 78 d -9 80 d -9 83 d -9 76 d -9 68 d -9 54 d -9 31 d -9 -25 d -8 -34 d -9 -66 d -9 -66 d -9 -98 d
 -9 -69 d -9 -96 d -9 -96 d -9 -80 d -9 -92 d -8 -76 d -9 -66 d -9 -81 d -9 -57 d -9 -54 d -9 -50 d -9 -48 d -9 -38 d -9 -46 d -8 -36 d -9 -26 d -9 -28 d -9 -19 d -9 -30 d -9 -22 d -9 -14 d -9 -19 d -9 -12 d -8 -23 d -9 -13 d -9 -9 d -9 -8 d -9 -7 d
 -9 -6 d -9 -12 d -9 -2 d -9 -8 d -8 -14 d -9 X -9 -3 d -9 -4 d -9 -4 d -9 -4 d -9 -4 d -9 -2 d -9 -2 d -8 -8 d -9 3 d -9 -2 d -9 -4 d -9 -3 d -9 -1 d -9 -3 d -9 -3 d -9 2 d -8 -3 d -9 -1 d -9 X -9 -1 d -9 -1 d -9 X -9 -1 d -9 -1 d -9 1 d -8 -1 d -9
 -4 d -9 2 d -9 1 d -9 X -9 -1 d -9 -4 d -9 5 d -9 -2 d -8 -2 d -9 -1 d -9 4 d -9 -3 d -9 -1 d -9 1 d -9 -1 d -9 -1 d -9 1 d -8 -1 d -9 X -9 3 d -9 2 d -9 -6 d -9 5 d -9 -2 d -9 2 d -9 -2 d -8 1 d -9 X -9 3 d -9 X -9 -1 d -9 X -9 -1 d -9 2 d -9 1 d
 -8 -2 d -9 5 d -9 -3 d -9 2 d -9 2 d -9 4 d -9 -3 d -9 5 d -9 -2 d -8 3 d -9 1 d -9 3 d -9 -2 d -9 5 d -9 -3 d -9 9 d -9 -3 d -9 5 d -8 5 d -9 2 d -9 3 d -9 5 d -9 5 d -9 4 d -9 9 d -9 4 d -9 3 d -9 5 d -8 5 d -9 15 d -9 7 d -9 19 d -9 5 d -9 16 d
 -9 12 d -9 8 d -9 19 d -8 21 d -9 20 d -9 16 d -9 33 d -9 27 d -9 33 d -9 27 d -9 47 d -9 35 d -8 54 d -9 50 d -9 58 d -9 60 d -9 66 d -9 63 d -9 84 d -9 103 d -9 70 d -8 103 d -9 91 d -9 88 d -9 86 d -9 63 d -9 56 d -9 34 d -9 30 d -9 -34 d -8 -52
 d -9 -65 d -9 -76 d -9 -75 d -9 -93 d -9 -71 d -9 -300 d -9 -850 d -80 X FA 3 lw 0.8 0.8 0 c 1 1 1 c 1 1 0 c 0.8 0.8 0 c 245 235 m 89 X 853 Y 9 X 302 Y 9 X 77 Y 8 X 88 Y 9 X 70 Y 9 X 72 Y 9 X 56 Y 9 X 34 Y 9 X 18 Y 9 X -46 Y 9 X -48 Y 9 X -70 Y 8 X
 -78 Y 9 X -90 Y 9 X -92 Y 9 X -91 Y 9 X -100 Y 9 X -75 Y 9 X -98 Y 9 X -74 Y 9 X -63 Y 8 X -62 Y 9 X -54 Y 9 X -52 Y 9 X -45 Y 9 X -47 Y 9 X -33 Y 9 X -40 Y 9 X -25 Y 9 X -25 Y 8 X -24 Y 9 X -29 Y 9 X -14 Y 9 X -15 Y 9 X -18 Y 9 X -17 Y 9 X -9 Y 9 X
 -10 Y 9 X -9 Y 8 X -7 Y 9 X -14 Y 9 X -4 Y 9 X -12 Y 9 X -4 Y 9 X -5 Y 9 X -4 Y 9 X -1 Y 9 X -8 Y 9 X -2 Y 8 X -5 Y 9 X -4 Y 9 X -2 Y 9 X -2 Y 9 X -3 Y 9 X -4 Y 9 X 1 Y 9 X -5 Y 9 X 2 Y 8 X -3 Y 18 X -3 Y 18 X -3 Y 9 X 1 Y 9 X -3 Y 9 X 4 Y 9 X -5 Y
 8 X -1 Y 9 X -1 Y 9 X 3 Y 9 X -3 Y 9 X -1 Y 18 X 1 Y 9 X -3 Y 9 X 1 Y 17 X 1 Y 9 X -4 Y 9 X 2 Y 9 X -1 Y 9 X 3 Y 9 X -3 Y 9 X 4 Y 9 X -5 Y 8 X 3 Y 18 X -2 Y 9 X -2 Y 9 X 2 Y 18 X -3 Y 9 X 4 Y 9 X -1 Y 17 X 1 Y 9 X 2 Y 9 X -3 Y 9 X 1 Y 9 X 2 Y 9 X -5
 Y 9 X 4 Y 9 X 1 Y 17 X -1 Y 9 X -2 Y 9 X 5 Y 9 X -1 Y 27 X 2 Y 9 X -2 Y 8 X 6 Y 9 X -2 Y 18 X -1 Y 9 X 5 Y 9 X -4 Y 9 X 4 Y 9 X -1 Y 9 X 2 Y 8 X 3 Y 9 X 3 Y 9 X 1 Y 9 X -2 Y 9 X 4 Y 9 X 2 Y 9 X 3 Y 9 X 3 Y 9 X 4 Y 8 X 2 Y 9 X 3 Y 9 X 3 Y 9 X 2 Y 9 X
 8 Y 9 X 7 Y 9 X 1 Y 9 X 10 Y 9 X 7 Y 8 X 3 Y 9 X 6 Y 9 X 10 Y 9 X 10 Y 9 X 19 Y 9 X 9 Y 9 X 14 Y 9 X 13 Y 9 X 20 Y 8 X 23 Y 9 X 17 Y 9 X 24 Y 9 X 22 Y 9 X 31 Y 9 X 41 Y 9 X 34 Y 9 X 41 Y 9 X 47 Y 8 X 48 Y 9 X 54 Y 9 X 73 Y 9 X 63 Y 9 X 71 Y 9 X 86 Y
 9 X 84 Y 9 X 91 Y 9 X 100 Y 8 X 77 Y 9 X 103 Y 9 X 77 Y 9 X 77 Y 9 X 50 Y 9 X 40 Y 9 X -16 Y 9 X -37 Y 9 X -55 Y 8 X -76 Y 9 X -69 Y 9 X -85 Y 9 X -79 Y 9 X -309 Y 9 X -845 Y 89 X s 1 1 0 c 249 235 m20 258 235 m20 267 235 m20 276 235 m20 285 235 m20
 294 235 m20 303 235 m20 312 235 m20 320 235 m20 329 235 m20 338 1088 m20 347 1390 m20 356 1467 m20 365 1555 m20 374 1625 m20 383 1697 m20 392 1753 m20 400 1787 m20 409 1805 m20 418 1759 m20 427 1711 m20 436 1641 m20 445 1563 m20 454 1473 m20 463
 1381 m20 472 1290 m20 480 1190 m20 489 1115 m20 498 1017 m20 507 943 m20 516 880 m20 525 818 m20 534 764 m20 543 712 m20 552 667 m20 560 620 m20 569 587 m20 578 547 m20 587 522 m20 596 497 m20 605 473 m20 614 444 m20 623 430 m20 632 415 m20 640 397
 m20 649 380 m20 658 371 m20 667 361 m20 676 352 m20 685 345 m20 694 331 m20 703 327 m20 712 315 m20 720 311 m20 729 306 m20 738 302 m20 747 301 m20 756 293 m20 765 291 m20 774 286 m20 783 282 m20 792 280 m20 801 278 m20 809 275 m20 818 271 m20 827
 272 m20 836 267 m20 845 269 m20 854 266 m20 863 266 m20 872 263 m20 881 263 m20 889 260 m20 898 261 m20 907 258 m20 916 262 m20 925 257 m20 934 256 m20 943 255 m20 952 258 m20 961 255 m20 969 254 m20 978 254 m20 987 255 m20 996 252 m20 1005 253 m20
 1014 253 m20 1023 254 m20 1032 250 m20 1041 252 m20 1049 251 m20 1058 254 m20 1067 251 m20 1076 255 m20 1085 250 m20 1094 253 m20 1103 253 m20 1112 251 m20 1121 249 m20 1129 251 m20 1138 251 m20 1147 248 m20 1156 252 m20 1165 251 m20 1174 251 m20
 1183 252 m20 1192 254 m20 1201 251 m20 1209 252 m20 1218 254 m20 1227 249 m20 1236 253 m20 1245 254 m20 1254 254 m20 1263 253 m20 1272 251 m20 1281 256 m20 1289 255 m20 1298 255 m20 1307 255 m20 1316 257 m20 1325 255 m20 1334 261 m20 1343 259 m20
 1352 259 m20 1361 258 m20 1369 263 m20 1378 259 m20 1387 263 m20 1396 262 m20 1405 264 m20 1414 267 m20 1423 270 m20 1432 271 m20 1441 269 m20 1449 273 m20 1458 275 m20 1467 278 m20 1476 281 m20 1485 285 m20 1494 287 m20 1503 290 m20 1512 293 m20
 1521 295 m20 1529 303 m20 1538 310 m20 1547 311 m20 1556 321 m20 1565 328 m20 1574 331 m20 1583 337 m20 1592 347 m20 1601 357 m20 1609 376 m20 1618 385 m20 1627 399 m20 1636 412 m20 1645 432 m20 1654 455 m20 1663 472 m20 1672 496 m20 1681 518 m20
 1689 549 m20 1698 590 m20 1707 624 m20 1716 665 m20 1725 712 m20 1734 760 m20 1743 814 m20 1752 887 m20 1761 950 m20 1769 1021 m20 1778 1107 m20 1787 1191 m20 1796 1282 m20 1805 1382 m20 1814 1459 m20 1823 1562 m20 1832 1639 m20 1841 1716 m20 1849
 1766 m20 1858 1806 m20 1867 1790 m20 1876 1753 m20 1885 1698 m20 1894 1622 m20 1903 1553 m20 1912 1468 m20 1921 1389 m20 1929 1080 m20 1938 235 m20 1947 235 m20 1956 235 m20 1965 235 m20 1974 235 m20 1983 235 m20 1992 235 m20 2001 235 m20 2009 235
 m20 2018 235 m20 0.8 0.8 0 c black 0.8 0.8 0 c cs 0.8 0.8 0 P13 setcolor 249 235 m 80 X 9 858 d 9 303 d 9 77 d 9 88 d 9 70 d 9 72 d 9 56 d 8 35 d 9 18 d 9 -46 d 9 -48 d 9 -70 d 9 -78 d 9 -91 d 9 -91 d 9 -92 d 8 -100 d 9 -76 d 9 -98 d 9 -74 d 9 -63 d
 9 -62 d 9 -55 d 9 -52 d 9 -45 d 8 -47 d 9 -33 d 9 -41 d 9 -24 d 9 -26 d 9 -24 d 9 -28 d 9 -15 d 9 -15 d 8 -18 d 9 -17 d 9 -9 d 9 -10 d 9 -9 d 9 -7 d 9 -14 d 9 -4 d 9 -12 d 8 -5 d 9 -5 d 9 -4 d 9 -1 d 9 -9 d 9 -1 d 9 -6 d 9 -3 d 9 -2 d 9 -2 d 8 -3 d
 9 -4 d 9 1 d 9 -6 d 9 3 d 9 -4 d 9 1 d 9 -3 d 9 -1 d 8 -2 d 9 X 9 -2 d 9 4 d 9 -5 d 9 -1 d 9 -1 d 9 2 d 9 -2 d 8 -2 d 9 X 9 2 d 9 -4 d 9 1 d 9 1 d 9 1 d 9 -5 d 9 3 d 8 -2 d 9 3 d 9 -3 d 9 5 d 9 -6 d 9 4 d 9 X 9 -3 d 9 -2 d 8 2 d 9 1 d 9 -3 d 9 3 d 9
 -1 d 9 1 d 9 1 d 9 1 d 9 -3 d 8 2 d 9 1 d 9 -4 d 9 4 d 18 X 9 -1 d 9 -1 d 9 5 d 8 -1 d 18 X 9 1 d 9 -1 d 9 6 d 9 -3 d 9 1 d 9 -2 d 8 6 d 9 -4 d 9 4 d 9 -1 d 9 1 d 9 4 d 9 2 d 9 1 d 9 -1 d 8 4 d 9 2 d 9 2 d 9 4 d 9 4 d 9 2 d 9 3 d 9 3 d 9 2 d 8 8 d 9
 7 d 9 1 d 9 10 d 9 7 d 9 4 d 9 6 d 9 9 d 9 10 d 8 19 d 9 9 d 9 15 d 9 13 d 9 19 d 9 24 d 9 18 d 9 23 d 9 22 d 8 32 d 9 41 d 9 34 d 9 42 d 9 46 d 9 49 d 9 54 d 9 73 d 9 63 d 8 72 d 9 85 d 9 85 d 9 91 d 9 101 d 9 76 d 9 104 d 9 77 d 9 77 d 8 50 d 9 40
 d 9 -17 d 9 -36 d 9 -55 d 9 -76 d 9 -70 d 9 -85 d 9 -80 d 8 -309 d 9 -850 d 80 X -80 X -9 840 d -8 308 d -9 79 d -9 85 d -9 69 d -9 76 d -9 55 d -9 36 d -9 16 d -9 -40 d -8 -50 d -9 -76 d -9 -77 d -9 -104 d -9 -76 d -9 -100 d -9 -91 d -9 -84 d -9
 -85 d -8 -71 d -9 -63 d -9 -73 d -9 -53 d -9 -48 d -9 -47 d -9 -41 d -9 -34 d -9 -40 d -8 -32 d -9 -21 d -9 -24 d -9 -18 d -9 -22 d -9 -20 d -9 -12 d -9 -15 d -9 -9 d -8 -18 d -9 -11 d -9 -9 d -9 -6 d -9 -4 d -9 -6 d -9 -10 d -9 -2 d -9 -6 d -8 -8 d
 -9 -2 d -9 -3 d -9 -3 d -9 -2 d -9 -4 d -9 -3 d -9 -3 d -9 -1 d -8 -5 d -9 2 d -9 -1 d -9 -2 d -9 -4 d -9 -1 d -9 X -9 -3 d -9 3 d -8 -5 d -9 1 d -9 X -9 2 d -9 -5 d -9 2 d -9 -2 d -26 X -9 -4 d -9 2 d -9 X -9 1 d -9 -1 d -9 -4 d -9 4 d -9 -1 d -8
 -1 d -9 2 d -9 -1 d -9 -1 d -9 X -9 1 d -9 -4 d -9 3 d -9 X -8 -2 d -9 1 d -9 2 d -9 1 d -9 -3 d -9 5 d -9 -4 d -9 2 d -9 -3 d -8 2 d -9 -2 d -9 4 d -9 -1 d -9 X -9 -1 d -9 3 d -9 -2 d -9 1 d -8 X -9 3 d -9 -2 d -9 1 d -9 1 d -9 5 d -9 -4 d -9 2 d
 -9 X -8 2 d -9 1 d -9 3 d -9 -1 d -9 4 d -9 -3 d -9 5 d -9 -1 d -9 4 d -8 3 d -9 2 d -9 2 d -9 4 d -9 5 d -9 2 d -9 8 d -9 1 d -9 4 d -9 5 d -8 4 d -9 12 d -9 4 d -9 14 d -9 7 d -9 9 d -9 10 d -9 9 d -9 16 d -8 18 d -9 15 d -9 14 d -9 28 d -9 24 d
 -9 26 d -9 24 d -9 41 d -9 32 d -8 47 d -9 44 d -9 52 d -9 55 d -9 61 d -9 63 d -9 73 d -9 98 d -9 75 d -8 100 d -9 91 d -9 91 d -9 90 d -9 79 d -9 69 d -9 48 d -9 46 d -9 -17 d -8 -35 d -9 -56 d -9 -71 d -9 -70 d -9 -88 d -9 -77 d -9 -301 d -9 -848
 d -80 X FA black 1 1 1 c black 245 235 m 89 X 866 Y 9 X 306 Y 9 X 76 Y 8 X 89 Y 9 X 71 Y 9 X 72 Y 9 X 58 Y 9 X 40 Y 9 X 23 Y 9 X -41 Y 9 X -44 Y 9 X -65 Y 8 X -72 Y 9 X -90 Y 9 X -91 Y 9 X -91 Y 9 X -102 Y 9 X -73 Y 9 X -101 Y 9 X -79 Y 9 X -62 Y 8
 X -64 Y 9 X -57 Y 9 X -55 Y 9 X -47 Y 9 X -50 Y 9 X -34 Y 9 X -43 Y 9 X -26 Y 9 X -29 Y 8 X -26 Y 9 X -30 Y 9 X -15 Y 9 X -18 Y 9 X -19 Y 9 X -17 Y 9 X -8 Y 9 X -12 Y 9 X -13 Y 8 X -6 Y 9 X -16 Y 9 X -5 Y 9 X -14 Y 9 X -4 Y 9 X -5 Y 9 X -3 Y 9 X -4
 Y 9 X -7 Y 9 X -4 Y 8 X -4 Y 9 X -4 Y 9 X -3 Y 9 X -2 Y 9 X -4 Y 9 X -5 Y 9 X 2 Y 9 X -6 Y 9 X 1 Y 8 X -4 Y 9 X 2 Y 9 X -3 Y 9 X -1 Y 9 X -2 Y 9 X 1 Y 9 X -3 Y 9 X 2 Y 9 X -4 Y 8 X -1 Y 9 X -2 Y 9 X 2 Y 9 X -4 Y 9 X 2 Y 9 X -1 Y 9 X -1 Y 26 X 1 Y 9
 X -1 Y 9 X -1 Y 9 X -1 Y 18 X 1 Y 9 X -2 Y 9 X 2 Y 9 X -4 Y 8 X 4 Y 9 X -1 Y 9 X -2 Y 9 X -1 Y 9 X 2 Y 9 X -1 Y 18 X 2 Y 9 X -1 Y 17 X 3 Y 9 X -4 Y 9 X 2 Y 9 X 2 Y 9 X 1 Y 9 X -4 Y 9 X 3 Y 9 X 1 Y 17 X -1 Y 9 X -1 Y 9 X 3 Y 18 X -1 Y 9 X 2 Y 26 X 2
 Y 18 X 1 Y 18 X 3 Y 9 X -2 Y 9 X 3 Y 9 X 2 Y 9 X 1 Y 8 X 2 Y 9 X 4 Y 9 X 2 Y 9 X -3 Y 9 X 7 Y 9 X 2 Y 9 X 2 Y 9 X 3 Y 9 X 3 Y 8 X 4 Y 9 X 3 Y 9 X 3 Y 9 X 1 Y 9 X 12 Y 9 X 7 Y 9 X 2 Y 9 X 10 Y 9 X 6 Y 8 X 6 Y 9 X 7 Y 9 X 9 Y 9 X 12 Y 9 X 20 Y 9 X 10
 Y 9 X 18 Y 9 X 13 Y 9 X 20 Y 8 X 26 Y 9 X 19 Y 9 X 25 Y 9 X 24 Y 9 X 34 Y 9 X 43 Y 9 X 35 Y 9 X 45 Y 9 X 48 Y 8 X 51 Y 9 X 55 Y 9 X 77 Y 9 X 65 Y 9 X 73 Y 9 X 89 Y 9 X 82 Y 9 X 94 Y 9 X 99 Y 8 X 74 Y 9 X 102 Y 9 X 73 Y 9 X 74 Y 9 X 45 Y 9 X 35 Y 9 X
 -21 Y 9 X -42 Y 9 X -58 Y 8 X -74 Y 9 X -75 Y 9 X -82 Y 9 X -80 Y 9 X -311 Y 9 X -859 Y 89 X s 249 235 m20 258 235 m20 267 235 m20 276 235 m20 285 235 m20 294 235 m20 303 235 m20 312 235 m20 320 235 m20 329 235 m20 338 1101 m20 347 1407 m20 356 1483
 m20 365 1572 m20 374 1643 m20 383 1715 m20 392 1773 m20 400 1813 m20 409 1836 m20 418 1795 m20 427 1751 m20 436 1686 m20 445 1614 m20 454 1524 m20 463 1433 m20 472 1342 m20 480 1240 m20 489 1167 m20 498 1066 m20 507 987 m20 516 925 m20 525 861 m20
 534 804 m20 543 749 m20 552 702 m20 560 652 m20 569 618 m20 578 575 m20 587 549 m20 596 520 m20 605 494 m20 614 464 m20 623 449 m20 632 431 m20 640 412 m20 649 395 m20 658 387 m20 667 375 m20 676 362 m20 685 356 m20 694 340 m20 703 335 m20 712 321
 m20 720 317 m20 729 312 m20 738 309 m20 747 305 m20 756 298 m20 765 294 m20 774 290 m20 783 286 m20 792 283 m20 801 281 m20 809 277 m20 818 272 m20 827 274 m20 836 268 m20 845 269 m20 854 265 m20 863 267 m20 872 264 m20 881 263 m20 889 261 m20 898
 262 m20 907 259 m20 916 261 m20 925 257 m20 934 256 m20 943 254 m20 952 256 m20 961 252 m20 969 254 m20 978 253 m20 987 252 m20 996 252 m20 1005 252 m20 1014 253 m20 1023 252 m20 1032 251 m20 1041 250 m20 1049 250 m20 1058 251 m20 1067 249 m20 1076
 251 m20 1085 247 m20 1094 251 m20 1103 250 m20 1112 248 m20 1121 247 m20 1129 249 m20 1138 248 m20 1147 248 m20 1156 250 m20 1165 249 m20 1174 249 m20 1183 252 m20 1192 248 m20 1201 250 m20 1209 252 m20 1218 253 m20 1227 249 m20 1236 252 m20 1245
 253 m20 1254 253 m20 1263 252 m20 1272 251 m20 1281 254 m20 1289 254 m20 1298 253 m20 1307 255 m20 1316 255 m20 1325 255 m20 1334 257 m20 1343 257 m20 1352 258 m20 1361 258 m20 1369 261 m20 1378 259 m20 1387 262 m20 1396 264 m20 1405 265 m20 1414
 267 m20 1423 271 m20 1432 273 m20 1441 270 m20 1449 277 m20 1458 279 m20 1467 281 m20 1476 284 m20 1485 287 m20 1494 291 m20 1503 294 m20 1512 297 m20 1521 298 m20 1529 310 m20 1538 317 m20 1547 319 m20 1556 329 m20 1565 335 m20 1574 341 m20 1583
 348 m20 1592 357 m20 1601 369 m20 1609 389 m20 1618 399 m20 1627 417 m20 1636 430 m20 1645 450 m20 1654 476 m20 1663 495 m20 1672 520 m20 1681 544 m20 1689 578 m20 1698 621 m20 1707 656 m20 1716 701 m20 1725 749 m20 1734 800 m20 1743 855 m20 1752
 932 m20 1761 997 m20 1769 1070 m20 1778 1159 m20 1787 1241 m20 1796 1335 m20 1805 1434 m20 1814 1508 m20 1823 1610 m20 1832 1683 m20 1841 1757 m20 1849 1802 m20 1858 1837 m20 1867 1816 m20 1876 1774 m20 1885 1716 m20 1894 1642 m20 1903 1567 m20 1912
 1485 m20 1921 1405 m20 1929 1094 m20 1938 235 m20 1947 235 m20 1956 235 m20 1965 235 m20 1974 235 m20 1983 235 m20 1992 235 m20 2001 235 m20 2009 235 m20 2018 235 m20 cs 0 0 0 P13 setcolor 249 235 m 80 X 9 872 d 9 306 d 9 76 d 9 89 d 9 72 d 9 72 d 9
 58 d 8 40 d 9 23 d 9 -41 d 9 -43 d 9 -66 d 9 -72 d 9 -90 d 9 -91 d 9 -91 d 8 -102 d 9 -74 d 9 -100 d 9 -80 d 9 -63 d 9 -63 d 9 -58 d 9 -55 d 9 -47 d 8 -51 d 9 -33 d 9 -44 d 9 -26 d 9 -29 d 9 -26 d 9 -31 d 9 -15 d 9 -17 d 8 -20 d 9 -17 d 9 -8 d 9 -12
 d 9 -13 d 9 -6 d 9 -16 d 9 -6 d 9 -13 d 8 -5 d 9 -5 d 9 -3 d 9 -4 d 9 -7 d 9 -4 d 9 -4 d 9 -4 d 9 -3 d 9 -2 d 8 -5 d 9 -4 d 9 2 d 9 -7 d 9 2 d 9 -4 d 9 2 d 9 -3 d 9 -1 d 8 -3 d 9 2 d 9 -4 d 9 2 d 9 -4 d 9 -1 d 9 -2 d 9 2 d 9 -3 d 8 1 d 9 -1 d 9 -1 d
 9 X 9 1 d 18 X 9 -2 d 9 X 8 -1 d 9 2 d 9 -3 d 9 2 d 9 -4 d 9 5 d 9 -1 d 9 -3 d 9 -1 d 8 2 d 9 -1 d 9 X 9 2 d 9 -1 d 9 X 9 3 d 9 -4 d 9 2 d 8 2 d 9 1 d 9 -5 d 9 4 d 9 1 d 9 X 9 -1 d 9 -1 d 9 3 d 8 1 d 9 -1 d 9 1 d 9 1 d 9 -1 d 9 2 d 9 X 9 1 d 9 X 8 4
 d 9 -2 d 9 3 d 9 2 d 9 X 9 3 d 9 4 d 9 1 d 9 -2 d 8 7 d 9 2 d 9 2 d 9 3 d 9 3 d 9 5 d 9 2 d 9 4 d 9 X 8 12 d 9 7 d 9 3 d 9 10 d 9 6 d 9 6 d 9 7 d 9 9 d 9 12 d 8 20 d 9 11 d 9 17 d 9 13 d 9 21 d 9 26 d 9 18 d 9 26 d 9 25 d 8 34 d 9 42 d 9 36 d 9 45 d
 9 48 d 9 51 d 9 56 d 9 77 d 9 65 d 8 74 d 9 88 d 9 82 d 9 95 d 9 99 d 9 74 d 9 103 d 9 73 d 9 73 d 8 45 d 9 35 d 9 -21 d 9 -42 d 9 -58 d 9 -75 d 9 -75 d 9 -82 d 9 -80 d 8 -312 d 9 -864 d 80 X -80 X -9 854 d -8 310 d -9 79 d -9 82 d -9 75 d -9 74 d
 -9 58 d -9 42 d -9 20 d -9 -34 d -8 -46 d -9 -73 d -9 -73 d -9 -102 d -9 -74 d -9 -99 d -9 -94 d -9 -82 d -9 -88 d -8 -73 d -9 -65 d -9 -76 d -9 -55 d -9 -51 d -9 -48 d -9 -44 d -9 -36 d -9 -42 d -8 -34 d -9 -24 d -9 -25 d -9 -18 d -9 -26 d -9 -21 d
 -9 -13 d -9 -17 d -9 -10 d -8 -20 d -9 -12 d -9 -8 d -9 -8 d -9 -6 d -9 -5 d -9 -10 d -9 -3 d -9 -7 d -8 -11 d -9 -1 d -9 -3 d -9 -3 d -9 -4 d -9 -4 d -9 -2 d -9 -2 d -9 -2 d -8 -6 d -9 2 d -9 -2 d -9 -3 d -9 -3 d -9 X -9 -3 d -9 -2 d -9 2 d -8 -3 d
 -9 -1 d -9 X -9 -1 d -9 -1 d -9 X -9 -1 d -9 -1 d -9 1 d -8 -1 d -9 -3 d -9 1 d -9 2 d -9 -1 d -9 -1 d -9 -2 d -9 4 d -9 -2 d -8 -1 d -9 -2 d -9 3 d -9 -2 d -9 X -9 1 d -9 -2 d -9 X -9 1 d -8 -2 d -9 1 d -9 2 d -9 1 d -9 -4 d -9 4 d -9 -2 d -9 2 d
 -9 -1 d -17 X -9 2 d -27 X -9 -1 d -9 2 d -9 X -8 -1 d -9 4 d -9 -3 d -9 2 d -9 2 d -9 3 d -9 -2 d -9 4 d -9 -2 d -8 2 d -9 1 d -9 3 d -9 -2 d -9 5 d -9 -2 d -9 6 d -9 -2 d -9 5 d -8 4 d -9 2 d -9 3 d -9 4 d -9 4 d -9 4 d -9 7 d -9 3 d -9 4 d -9 4 d
 -8 5 d -9 13 d -9 6 d -9 15 d -9 6 d -9 13 d -9 11 d -9 9 d -9 17 d -8 19 d -9 17 d -9 15 d -9 31 d -9 25 d -9 29 d -9 26 d -9 43 d -9 33 d -8 50 d -9 47 d -9 54 d -9 58 d -9 63 d -9 63 d -9 78 d -9 100 d -9 73 d -8 102 d -9 91 d -9 91 d -9 89 d -9
 73 d -9 65 d -9 44 d -9 40 d -9 -22 d -8 -40 d -9 -58 d -9 -71 d -9 -72 d -9 -89 d -9 -75 d -9 -305 d -9 -861 d -80 X FA 0.8 0 0 c 1 1 1 c 1 0 0 c 0.8 0 0 c 245 235 m 89 X 397 Y 9 X 142 Y 9 X 36 Y 8 X 36 Y 9 X 28 Y 9 X 25 Y 9 X 19 Y 9 X 5 Y 9 X -1 Y
 9 X -28 Y 9 X -29 Y 9 X -37 Y 8 X -42 Y 9 X -42 Y 9 X -43 Y 9 X -40 Y 9 X -45 Y 9 X -35 Y 9 X -41 Y 9 X -30 Y 9 X -28 Y 8 X -26 Y 9 X -23 Y 9 X -21 Y 9 X -18 Y 9 X -18 Y 9 X -14 Y 9 X -16 Y 9 X -10 Y 9 X -9 Y 8 X -9 Y 9 X -11 Y 9 X -6 Y 9 X -5 Y 9 X
 -7 Y 9 X -6 Y 9 X -3 Y 9 X -5 Y 9 X -3 Y 8 X -3 Y 9 X -4 Y 9 X -1 Y 9 X -5 Y 18 X -3 Y 9 X -2 Y 9 X -1 Y 9 X -1 Y 9 X -1 Y 8 X -2 Y 9 X -1 Y 9 X -1 Y 9 X -1 Y 18 X -2 Y 18 X -1 Y 9 X 1 Y 8 X -1 Y 18 X -1 Y 18 X -1 Y 36 X -1 Y 17 X -1 Y 9 X 1 Y 9 X
 -1 Y 98 X -1 Y 18 X 1 Y 9 X -1 Y 71 X 1 Y 9 X -1 Y 17 X 1 Y 9 X -1 Y 18 X 1 Y 27 X -1 Y 9 X 1 Y 44 X 1 Y 9 X -1 Y 9 X 1 Y 62 X 1 Y 27 X 1 Y 17 X 1 Y 18 X 1 Y 18 X 1 Y 9 X 1 Y 9 X 1 Y 18 X 1 Y 8 X 1 Y 9 X 1 Y 9 X 1 Y 9 X 2 Y 9 X 2 Y 9 X 2 Y 9 X 1 Y 9
 X 3 Y 9 X 2 Y 8 X 2 Y 9 X 2 Y 9 X 4 Y 9 X 4 Y 9 X 5 Y 9 X 4 Y 9 X 6 Y 9 X 5 Y 9 X 8 Y 8 X 7 Y 9 X 7 Y 9 X 10 Y 9 X 8 Y 9 X 13 Y 9 X 15 Y 9 X 14 Y 9 X 16 Y 9 X 20 Y 8 X 18 Y 9 X 24 Y 9 X 29 Y 9 X 27 Y 9 X 31 Y 9 X 35 Y 9 X 39 Y 9 X 40 Y 9 X 46 Y 8 X
 38 Y 9 X 48 Y 9 X 39 Y 9 X 40 Y 9 X 30 Y 9 X 25 Y 9 X 2 Y 9 X -7 Y 9 X -15 Y 8 X -30 Y 9 X -25 Y 9 X -37 Y 9 X -37 Y 9 X -144 Y 9 X -394 Y 89 X s 1 0 0 c 249 235 m20 258 235 m20 267 235 m20 276 235 m20 285 235 m20 294 235 m20 303 235 m20 312 235 m20
 320 235 m20 329 235 m20 338 632 m20 347 774 m20 356 810 m20 365 846 m20 374 874 m20 383 899 m20 392 918 m20 400 923 m20 409 922 m20 418 894 m20 427 865 m20 436 828 m20 445 786 m20 454 744 m20 463 701 m20 472 661 m20 480 616 m20 489 581 m20 498 540
 m20 507 510 m20 516 482 m20 525 456 m20 534 433 m20 543 412 m20 552 394 m20 560 376 m20 569 362 m20 578 346 m20 587 336 m20 596 327 m20 605 318 m20 614 307 m20 623 301 m20 632 296 m20 640 289 m20 649 283 m20 658 280 m20 667 275 m20 676 272 m20 685
 269 m20 694 265 m20 703 264 m20 712 259 m20 720 259 m20 729 256 m20 738 254 m20 747 253 m20 756 252 m20 765 251 m20 774 249 m20 783 248 m20 792 247 m20 801 246 m20 809 246 m20 818 244 m20 827 244 m20 836 243 m20 845 244 m20 854 243 m20 863 243 m20
 872 242 m20 881 242 m20 889 241 m20 898 241 m20 907 241 m20 916 241 m20 925 240 m20 934 240 m20 943 239 m20 952 240 m20 961 239 m20 969 239 m20 978 239 m20 987 239 m20 996 239 m20 1005 239 m20 1014 239 m20 1023 239 m20 1032 239 m20 1041 239 m20 1049
 239 m20 1058 238 m20 1067 238 m20 1076 239 m20 1085 238 m20 1094 238 m20 1103 238 m20 1112 238 m20 1121 238 m20 1129 238 m20 1138 238 m20 1147 238 m20 1156 239 m20 1165 238 m20 1174 238 m20 1183 239 m20 1192 238 m20 1201 238 m20 1209 239 m20 1218
 239 m20 1227 239 m20 1236 238 m20 1245 239 m20 1254 239 m20 1263 239 m20 1272 239 m20 1281 239 m20 1289 240 m20 1298 239 m20 1307 240 m20 1316 240 m20 1325 240 m20 1334 240 m20 1343 240 m20 1352 240 m20 1361 240 m20 1369 241 m20 1378 241 m20 1387
 241 m20 1396 242 m20 1405 242 m20 1414 243 m20 1423 243 m20 1432 244 m20 1441 244 m20 1449 245 m20 1458 246 m20 1467 247 m20 1476 247 m20 1485 248 m20 1494 249 m20 1503 250 m20 1512 251 m20 1521 253 m20 1529 255 m20 1538 257 m20 1547 258 m20 1556
 261 m20 1565 263 m20 1574 265 m20 1583 267 m20 1592 271 m20 1601 275 m20 1609 280 m20 1618 284 m20 1627 290 m20 1636 295 m20 1645 303 m20 1654 310 m20 1663 317 m20 1672 327 m20 1681 335 m20 1689 348 m20 1698 363 m20 1707 377 m20 1716 393 m20 1725
 413 m20 1734 431 m20 1743 455 m20 1752 484 m20 1761 511 m20 1769 542 m20 1778 577 m20 1787 616 m20 1796 656 m20 1805 702 m20 1814 740 m20 1823 788 m20 1832 827 m20 1841 867 m20 1849 897 m20 1858 922 m20 1867 924 m20 1876 917 m20 1885 902 m20 1894
 872 m20 1903 847 m20 1912 810 m20 1921 773 m20 1929 629 m20 1938 235 m20 1947 235 m20 1956 235 m20 1965 235 m20 1974 235 m20 1983 235 m20 1992 235 m20 2001 235 m20 2009 235 m20 2018 235 m20 0.8 0 0 c black 0.8 0 0 c cs 0.8 0 0 P13 setcolor 249 235 m
 80 X 9 400 d 9 142 d 9 36 d 9 36 d 9 28 d 9 25 d 9 19 d 8 5 d 9 -1 d 9 -28 d 9 -29 d 9 -38 d 9 -41 d 9 -42 d 9 -43 d 9 -41 d 8 -44 d 9 -36 d 9 -41 d 9 -30 d 9 -29 d 9 -25 d 9 -24 d 9 -21 d 9 -18 d 8 -17 d 9 -14 d 9 -16 d 9 -11 d 9 -9 d 9 -9 d 9 -11
 d 9 -6 d 9 -5 d 8 -7 d 9 -6 d 9 -4 d 9 -4 d 9 -4 d 9 -2 d 9 -4 d 9 -2 d 9 -5 d 8 X 9 -3 d 9 -1 d 9 -1 d 9 -2 d 9 -1 d 9 -1 d 9 -1 d 9 -1 d 9 -1 d 8 -1 d 9 -1 d 9 X 9 -1 d 9 X 9 -1 d 9 X 9 -1 d 9 X 8 -1 d 9 1 d 9 -1 d 18 X 9 -1 d 9 -1 d 9 1 d 17 X 9
 -1 d 80 X 9 -1 d 9 1 d 9 -1 d 9 1 d 9 -1 d 44 X 9 1 d 116 X 9 1 d 62 X 9 1 d 26 X 9 1 d 9 1 d 27 X 9 1 d 9 X 8 2 d 9 X 9 1 d 9 X 9 2 d 9 1 d 9 X 9 2 d 9 1 d 8 3 d 9 2 d 9 1 d 9 2 d 9 3 d 9 1 d 9 3 d 9 3 d 9 5 d 8 5 d 9 4 d 9 5 d 9 6 d 9 8 d 9 7 d 9
 7 d 9 10 d 9 8 d 8 13 d 9 15 d 9 14 d 9 17 d 9 19 d 9 19 d 9 23 d 9 29 d 9 28 d 8 31 d 9 35 d 9 40 d 9 40 d 9 45 d 9 38 d 9 49 d 9 39 d 9 40 d 8 30 d 9 25 d 9 1 d 9 -6 d 9 -16 d 9 -29 d 9 -25 d 9 -37 d 9 -37 d 8 -145 d 9 -396 d 80 X -80 X -9 392 d
 -8 144 d -9 37 d -9 36 d -9 26 d -9 29 d -9 16 d -9 6 d -9 -2 d -9 -25 d -8 -29 d -9 -41 d -9 -38 d -9 -49 d -9 -38 d -9 -45 d -9 -40 d -9 -39 d -9 -35 d -8 -31 d -9 -27 d -9 -29 d -9 -23 d -9 -19 d -9 -19 d -9 -17 d -9 -13 d -9 -16 d -8 -12 d -9 -8
 d -9 -9 d -9 -8 d -9 -7 d -9 -8 d -9 -5 d -9 -6 d -9 -3 d -8 -5 d -9 -5 d -9 -3 d -9 -3 d -9 -1 d -9 -3 d -9 -2 d -9 -1 d -9 -2 d -8 -3 d -9 -1 d -9 -1 d -9 -1 d -9 -1 d -9 -2 d -9 X -9 -1 d -9 X -8 -1 d -9 X -9 -1 d -9 X -9 -1 d -9 X -9 -1 d -18 X
 -8 -1 d -27 X -9 -1 d -9 1 d -9 X -9 -1 d -53 X -9 -1 d -9 X -9 1 d -9 X -8 -1 d -116 X -9 1 d -9 -1 d -18 X -8 1 d -9 -1 d -9 1 d -62 X -9 1 d -9 -1 d -9 1 d -9 X -9 1 d -35 X -9 1 d -18 X -9 1 d -9 X -9 1 d -9 X -9 1 d -8 1 d -9 1 d -9 1 d -9 1 d
 -9 2 d -9 X -9 2 d -9 1 d -9 1 d -9 3 d -8 X -9 5 d -9 2 d -9 3 d -9 3 d -9 4 d -9 4 d -9 4 d -9 5 d -8 7 d -9 5 d -9 6 d -9 11 d -9 9 d -9 9 d -9 10 d -9 16 d -9 14 d -8 18 d -9 17 d -9 21 d -9 23 d -9 26 d -9 28 d -9 30 d -9 41 d -9 35 d -8 44 d
 -9 41 d -9 42 d -9 43 d -9 41 d -9 37 d -9 29 d -9 28 d -9 1 d -8 -5 d -9 -19 d -9 -25 d -9 -28 d -9 -35 d -9 -36 d -9 -142 d -9 -395 d -80 X FA black 1 1 1 c 666 533 801 1408 bf black 801 1408 m 666 X s 1467 1408 m 533 Y s 1467 1941 m -666 X s 801
 1941 m -533 Y s
 gsave  2222 2133 23 22 C 964.824 1846.08 t 0 r /Helvetica findfont 79.8457 sf 0 0 m (No Int) show NC gr  0.8 0 0 c 826 1875 m 116 X s black
 gsave  2222 2133 23 22 C 964.824 1713.13 t 0 r /Helvetica findfont 79.8457 sf 0 0 m (Add) show NC gr  0.8 0.8 0 c 826 1742 m 116 X s black
 gsave  2222 2133 23 22 C 964.824 1580.18 t 0 r /Helvetica findfont 79.8457 sf 0 0 m (Mult) show NC gr  0.8 0 0.8 c 826 1608 m 116 X s black
 gsave  2222 2133 23 22 C 964.824 1447.24 t 0 r /Helvetica findfont 79.8457 sf 0 0 m (Central) show NC gr  826 1475 m 116 X s
 gsave  2222 2133 23 22 C 2199.34 1568.79 t 90 r /Helvetica-BoldOblique findfont 38.0218 sf 0 0 m (LHC HIGGS XS WG 2013) show NC gr 
 gr  gr showpage
end
%%EOF
