%!PS-Adobe-2.0 EPSF-2.0
%%BoundingBox: 84 198 451 390
%%HiResBoundingBox: 84.500000 198.500000 451.000000 389.500000
%...................................
%%Creator: GPL Ghostscript 870 (pswrite)
%%CreationDate: 2013/02/14 17:38:38
%%DocumentData: Clean7Bit
%%LanguageLevel: 2
%%EndComments
% EPSF created by ps2eps 1.64
%%BeginProlog
save
countdictstack
mark
newpath
/showpage {} def
/setpagedevice {pop} def
%%EndProlog
%%Page 1 1
%%BeginProlog
% This copyright applies to everything between here and the %%EndProlog:
% Copyright (C) 2009 Artifex Software, Inc.  All rights reserved.
%%BeginResource: procset GS_pswrite_2_0_1001 1.001 0
/GS_pswrite_2_0_1001 80 dict dup begin
/PageSize 2 array def/setpagesize{ PageSize aload pop 3 index eq exch
4 index eq and{ pop pop pop}{ PageSize dup  1
5 -1 roll put 0 4 -1 roll put dup null eq {false} {dup where} ifelse{ exch get exec}
{ pop/setpagedevice where
{ pop 1 dict dup /PageSize PageSize put setpagedevice}
{ /setpage where{ pop PageSize aload pop pageparams 3 {exch pop} repeat
setpage}if}ifelse}ifelse}ifelse} bind def
/!{bind def}bind def/#{load def}!/N/counttomark #
/rG{3{3 -1 roll 255 div}repeat setrgbcolor}!/G{255 div setgray}!/K{0 G}!
/r6{dup 3 -1 roll rG}!/r5{dup 3 1 roll rG}!/r3{dup rG}!
/w/setlinewidth #/J/setlinecap #
/j/setlinejoin #/M/setmiterlimit #/d/setdash #/i/setflat #
/m/moveto #/l/lineto #/c/rcurveto #
/p{N 2 idiv{N -2 roll rlineto}repeat}!
/P{N 0 gt{N -2 roll moveto p}if}!
/h{p closepath}!/H{P closepath}!
/lx{0 rlineto}!/ly{0 exch rlineto}!/v{0 0 6 2 roll c}!/y{2 copy c}!
/re{4 -2 roll m exch dup lx exch ly neg lx h}!
/^{3 index neg 3 index neg}!
/f{P fill}!/f*{P eofill}!/s{H stroke}!/S{P stroke}!
/q/gsave #/Q/grestore #/rf{re fill}!
/Y{P clip newpath}!/Y*{P eoclip newpath}!/rY{re Y}!
/|={pop exch 4 1 roll 1 array astore cvx 3 array astore cvx exch 1 index def exec}!
/|{exch string readstring |=}!
/+{dup type/nametype eq{2 index 7 add -3 bitshift 2 index mul}if}!
/@/currentfile #/${+ @ |}!
/B{{2 copy string{readstring pop}aload pop 4 array astore cvx
3 1 roll}repeat pop pop true}!
/Ix{[1 0 0 1 11 -2 roll exch neg exch neg]exch}!
/,{true exch Ix imagemask}!/If{false exch Ix imagemask}!/I{exch Ix image}!
/Ic{exch Ix false 3 colorimage}!
/F{/Columns counttomark 3 add -2 roll/Rows exch/K -1/BlackIs1 true>>
/CCITTFaxDecode filter}!/FX{<</EndOfBlock false F}!
/X{/ASCII85Decode filter}!/@X{@ X}!/&2{2 index 2 index}!
/@F{@ &2<<F}!/@C{@X &2 FX}!
/$X{+ @X |}!/&4{4 index 4 index}!/$F{+ @ &4<<F |}!/$C{+ @X &4 FX |}!
/IC{3 1 roll 10 dict begin 1{/ImageType/Interpolate/Decode/DataSource
/ImageMatrix/BitsPerComponent/Height/Width}{exch def}forall
currentdict end image}!
/~{@ read {pop} if}!
end def
%%EndResource
/pagesave null def
%%EndProlog
%%Page: 1 1
%%PageBoundingBox: 0 0 612 792
%%BeginPageSetup
GS_pswrite_2_0_1001 begin
612 792 /letter setpagesize
/pagesave save store 197 dict begin
0.1 0.1 scale
%%EndPageSetup
gsave mark
Q q
0 0 6120 7920 re
Y
4.8 w
1 J
1 j
K
2289.6 5863.2 -9.6 -12 -12 -14.4 -9.6 -21.6 -4.8 -26.4 0 -19.2 4.8 -26.4 9.6 -21.6 
12 -14.4 9.6 -9.6 P
2280 5851.2 -12 -19.2 -4.8 -16.8 -4.8 -26.4 0 -19.2 4.8 -26.4 4.8 -14.4 12 -21.6 P
2498.4 5841.6 0 -108 P
2503.2 5841.6 0 -108 P
2481.6 5841.6 52.8 0 14.4 -4.8 12 -9.6 4.8 -12 4.8 -14.4 0 -26.4 -4.8 -14.4 
-4.8 -12 -12 -9.6 -14.4 -4.8 -52.8 0 P
2534.4 5841.6 9.6 -4.8 9.6 -9.6 7.2 -12 4.8 -14.4 0 -26.4 -4.8 -14.4 -7.2 -12 
-9.6 -9.6 -9.6 -4.8 P
2611.2 5805.6 0 -108 P
2616 5805.6 0 -108 P
2616 5788.8 12 12 9.6 4.8 9.6 0 16.8 -4.8 9.6 -12 4.8 -14.4 0 -9.6 
-4.8 -16.8 -9.6 -9.6 -16.8 -4.8 -9.6 0 -9.6 4.8 -12 9.6 P
2647.2 5805.6 12 -4.8 9.6 -12 4.8 -14.4 0 -9.6 -4.8 -16.8 -9.6 -9.6 -12 -4.8 P
2596.8 5805.6 19.2 0 P
2596.8 5697.6 36 0 P
2721.6 5841.6 0 -108 P
2726.4 5841.6 0 -108 P
2726.4 5788.8 9.6 12 16.8 4.8 9.6 0 14.4 -4.8 7.2 -12 0 -55.2 P
2762.4 5805.6 9.6 -4.8 4.8 -12 0 -55.2 P
2704.8 5841.6 21.6 0 P
2704.8 5733.6 36 0 P
2762.4 5733.6 36 0 P
2834.4 5841.6 -4.8 -4.8 4.8 -4.8 4.8 4.8 -4.8 4.8 P
2834.4 5805.6 0 -72 P
2839.2 5805.6 0 -72 P
2820 5805.6 19.2 0 P
2820 5733.6 36 0 P
2980.8 5841.6 -4.8 -4.8 4.8 -4.8 ^ ^ P
2985.6 5805.6 0 -93.6 -4.8 -9.6 -9.6 -4.8 -12 0 -4.8 4.8 0 4.8 4.8 4.8 
4.8 -4.8 ^ P
2980.8 5805.6 0 -93.6 -4.8 -9.6 -4.8 -4.8 P
2964 5805.6 21.6 0 S
3038.4 5820 9.6 7.2 16.8 14.4 0 -108 P
3057.6 5836.8 0 -103.2 P
3038.4 5733.6 45.6 0 P
3132 5779.2 93.6 0 P
3276 5841.6 -4.8 -4.8 4.8 -4.8 7.2 4.8 -7.2 4.8 P
3283.2 5805.6 0 -93.6 -7.2 -9.6 -9.6 -4.8 -9.6 0 -4.8 4.8 0 4.8 4.8 4.8 
4.8 -4.8 ^ P
3276 5805.6 0 -93.6 -4.8 -9.6 -4.8 -4.8 P
3261.6 5805.6 21.6 0 P
3324 5820 4.8 -4.8 -4.8 -4.8 ^ 0 4.8 4.8 12 4.8 4.8 16.8 4.8 
19.2 0 16.8 -4.8 4.8 -4.8 4.8 -12 0 -9.6 -4.8 -9.6 -16.8 -12 -36 -14.4 
-9.6 -9.6 -4.8 -16.8 0 -14.4 P
3364.8 5841.6 12 -4.8 4.8 -4.8 4.8 -12 0 -9.6 -4.8 -9.6 -16.8 -12 -19.2 -9.6 P
3319.2 5743.2 4.8 4.8 9.6 0 26.4 -9.6 16.8 0 9.6 4.8 4.8 4.8 P
3333.6 5748 26.4 -14.4 21.6 0 4.8 4.8 4.8 9.6 0 12 P
3756 5805.6 31.2 -72 P
3760.8 5805.6 26.4 -62.4 P
3818.4 5805.6 -31.2 -72 P
3744 5805.6 31.2 0 P
3796.8 5805.6 31.2 0 P
3859.2 5841.6 0 -108 P
3864 5841.6 0 -108 P
3864 5788.8 9.6 12 12 4.8 9.6 0 16.8 -4.8 9.6 -12 4.8 -14.4 0 -9.6 
-4.8 -16.8 -9.6 -9.6 -16.8 -4.8 -9.6 0 -12 4.8 -9.6 9.6 P
3895.2 5805.6 9.6 -4.8 12 -12 4.8 -14.4 0 -9.6 -4.8 -16.8 -12 -9.6 -9.6 -4.8 P
3842.4 5841.6 21.6 0 P
3993.6 5836.8 -4.8 -4.8 4.8 -4.8 4.8 4.8 0 4.8 -4.8 4.8 -9.6 0 -9.6 -4.8 
-7.2 -9.6 0 -93.6 P
3984 5841.6 -4.8 -4.8 -4.8 -9.6 0 -93.6 P
3952.8 5805.6 40.8 0 P
3952.8 5733.6 36 0 P
4087.2 5788.8 -4.8 -4.8 4.8 -4.8 ^ 0 4.8 -9.6 12 -9.6 4.8 -16.8 0 
-14.4 -4.8 -12 -12 -4.8 -14.4 0 -9.6 4.8 -16.8 12 -9.6 14.4 -4.8 12 0 
14.4 4.8 9.6 9.6 S
4056 5805.6 -9.6 -4.8 -9.6 -12 -7.2 -14.4 0 -9.6 7.2 -16.8 9.6 -9.6 9.6 -4.8 P
4135.2 5805.6 0 -57.6 4.8 -9.6 14.4 -4.8 12 0 14.4 4.8 12 9.6 P
4140 5805.6 0 -57.6 4.8 -9.6 9.6 -4.8 P
4192.8 5805.6 0 -72 P
4197.6 5805.6 0 -72 P
4118.4 5805.6 21.6 0 P
4176 5805.6 21.6 0 P
4192.8 5733.6 19.2 0 P
4248 5841.6 0 -88.8 7.2 -14.4 9.6 -4.8 9.6 0 12 4.8 4.8 9.6 P
4255.2 5841.6 0 -88.8 4.8 -14.4 4.8 -4.8 P
4233.6 5805.6 40.8 0 P
4368 5796 4.8 9.6 0 -21.6 -4.8 12 -4.8 4.8 -9.6 4.8 -21.6 0 -9.6 -4.8 
-4.8 -4.8 0 -12 4.8 -4.8 9.6 -4.8 26.4 -9.6 9.6 -4.8 4.8 -7.2 P
4317.6 5788.8 4.8 -4.8 9.6 -4.8 26.4 -9.6 9.6 -4.8 4.8 -4.8 0 -16.8 -4.8 -4.8 
-9.6 -4.8 -21.6 0 -9.6 4.8 -4.8 4.8 -4.8 9.6 0 -19.2 4.8 9.6 P
1190.4 3544.8 4154.4 0 0 2076 ^ H
1190.4 4312.8 168 0 0 16.8 165.6 0 0 40.8 165.6 0 0 -19.2 165.6 0 
0 -4.8 333.6 0 0 12 165.6 0 0 19.2 165.6 0 0 12 165.6 0 
0 -24 168 0 0 -7.2 165.6 0 0 45.6 165.6 0 0 2.4 165.6 0 
0 48 165.6 0 0 -4.8 168 0 0 2.4 165.6 0 0 -12 165.6 0 
^ 165.6 0 0 96 165.6 0 0 -16.8 165.6 0 0 -28.8 168 0 
0 21.6 165.6 0 0 33.6 165.6 0 0 -14.4 165.6 0 0 19.2 168 0 P
1190.4 3544.8 0 124.8 P
1456.8 3585.6 0 -40.8 S
1720.8 3544.8 0 40.8 P
1984.8 3585.6 0 -40.8 P
2248.8 3544.8 0 40.8 P
2512.8 3669.6 0 -124.8 P
2776.8 3544.8 0 40.8 P
3040.8 3585.6 0 -40.8 P
3307.2 3544.8 0 40.8 P
3571.2 3585.6 0 -40.8 P
3835.2 3544.8 0 124.8 P
4099.2 3585.6 0 -40.8 P
4363.2 3544.8 0 40.8 P
4627.2 3585.6 0 -40.8 P
4891.2 3544.8 0 40.8 P
5157.6 3669.6 0 -124.8 P
1190.4 5496 0 124.8 P
1456.8 5620.8 0 -40.8 P
1720.8 5580 0 40.8 P
1984.8 5620.8 0 -40.8 P
2248.8 5580 0 40.8 P
2512.8 5620.8 0 -124.8 P
2776.8 5580 0 40.8 P
3040.8 5620.8 0 -40.8 P
3307.2 5580 0 40.8 P
3571.2 5620.8 0 -40.8 P
3835.2 5496 0 124.8 P
4099.2 5620.8 0 -40.8 P
4363.2 5580 0 40.8 P
4627.2 5620.8 0 -40.8 P
4891.2 5580 0 40.8 P
5157.6 5620.8 0 -124.8 P
1190.4 3544.8 124.8 0 P
1233.6 3727.2 -43.2 0 P
1190.4 3856.8 43.2 0 P
1315.2 3957.6 -124.8 0 P
1190.4 4039.2 43.2 0 P
1233.6 4108.8 -43.2 0 P
1190.4 4168.8 43.2 0 P
1233.6 4224 -43.2 0 P
1190.4 4269.6 124.8 0 P
1315.2 4581.6 -124.8 0 P
1190.4 4766.4 43.2 0 P
1233.6 4896 -43.2 0 P
1190.4 4996.8 124.8 0 P
1233.6 5078.4 -43.2 0 P
1190.4 5148 43.2 0 P
1233.6 5208 -43.2 0 P
1190.4 5260.8 43.2 0 P
1315.2 5308.8 -124.8 0 P
1190.4 5620.8 124.8 0 P
868.8 3576 -9.6 -2.4 -7.2 -12 -2.4 -16.8 0 -9.6 2.4 -19.2 7.2 -9.6 9.6 -2.4 
7.2 0 12 2.4 7.2 9.6 2.4 19.2 0 9.6 -2.4 16.8 -7.2 12 -12 2.4 
-7.2 0 -4.8 -2.4 -4.8 -4.8 -2.4 -7.2 -4.8 -16.8 0 -9.6 4.8 -19.2 2.4 -4.8 
4.8 -4.8 4.8 -2.4 P
876 3504 7.2 2.4 4.8 4.8 2.4 4.8 4.8 19.2 0 9.6 -4.8 16.8 -2.4 7.2 
-4.8 4.8 -7.2 2.4 S
926.4 3511.2 -4.8 -4.8 4.8 -2.4 2.4 2.4 -2.4 4.8 P
974.4 3576 -12 -2.4 -4.8 -12 -4.8 -16.8 0 -9.6 4.8 -19.2 4.8 -9.6 12 -2.4 
7.2 0 9.6 2.4 7.2 9.6 2.4 19.2 0 9.6 -2.4 16.8 -7.2 12 -9.6 2.4 
-7.2 0 -7.2 -2.4 -4.8 -4.8 -2.4 -7.2 -2.4 -16.8 0 -9.6 2.4 -19.2 2.4 -4.8 
4.8 -4.8 7.2 -2.4 P
981.6 3504 7.2 2.4 4.8 9.6 4.8 19.2 0 9.6 -4.8 16.8 -2.4 7.2 -2.4 4.8 
-7.2 2.4 P
1044 3576 -12 -2.4 -7.2 -12 -2.4 -16.8 0 -9.6 2.4 -19.2 7.2 -9.6 12 -2.4 
4.8 0 12 2.4 7.2 9.6 2.4 19.2 0 9.6 -2.4 16.8 -7.2 12 -12 2.4 
-4.8 0 -7.2 -2.4 -4.8 -4.8 -2.4 -7.2 -4.8 -16.8 0 -9.6 4.8 -19.2 2.4 -4.8 
4.8 -4.8 7.2 -2.4 P
1048.8 3504 7.2 2.4 4.8 4.8 2.4 4.8 4.8 19.2 0 9.6 -4.8 16.8 -2.4 7.2 
-4.8 4.8 -7.2 2.4 P
1094.4 3561.6 4.8 -2.4 -4.8 -4.8 -2.4 4.8 0 2.4 2.4 7.2 4.8 4.8 9.6 2.4 
14.4 0 9.6 -2.4 4.8 -4.8 2.4 -7.2 0 -7.2 -2.4 -7.2 -12 -4.8 -16.8 -7.2 
-7.2 -4.8 -7.2 -7.2 -2.4 -9.6 0 -9.6 P
1123.2 3576 7.2 -2.4 2.4 -4.8 4.8 -7.2 0 -7.2 -4.8 -7.2 -24 -12 P
1092 3511.2 2.4 2.4 7.2 0 16.8 -7.2 12 0 7.2 4.8 2.4 2.4 P
1101.6 3513.6 16.8 -9.6 14.4 0 4.8 2.4 2.4 7.2 0 7.2 P
868.8 3988.8 -9.6 -2.4 -7.2 -12 -2.4 -16.8 0 -9.6 2.4 -16.8 7.2 -12 9.6 -2.4 
7.2 0 12 2.4 7.2 12 2.4 16.8 0 9.6 -2.4 16.8 -7.2 12 -12 2.4 
-7.2 0 S
868.8 3988.8 -4.8 -2.4 -4.8 -4.8 -2.4 -7.2 -4.8 -16.8 0 -9.6 4.8 -16.8 2.4 -7.2 
4.8 -4.8 4.8 -2.4 P
876 3916.8 7.2 2.4 4.8 4.8 2.4 7.2 4.8 16.8 0 9.6 -4.8 16.8 -2.4 7.2 
-4.8 4.8 -7.2 2.4 P
926.4 3924 -4.8 -4.8 4.8 -2.4 2.4 2.4 -2.4 4.8 P
974.4 3988.8 -12 -2.4 -4.8 -12 -4.8 -16.8 0 -9.6 4.8 -16.8 4.8 -12 12 -2.4 
7.2 0 9.6 2.4 7.2 12 2.4 16.8 0 9.6 -2.4 16.8 -7.2 12 -9.6 2.4 
-7.2 0 -7.2 -2.4 -4.8 -4.8 -2.4 -7.2 -2.4 -16.8 0 -9.6 2.4 -16.8 2.4 -7.2 
4.8 -4.8 7.2 -2.4 P
981.6 3916.8 7.2 2.4 2.4 4.8 2.4 7.2 4.8 16.8 0 9.6 -4.8 16.8 -2.4 7.2 
-2.4 4.8 -7.2 2.4 P
1044 3988.8 -12 -2.4 -7.2 -12 -2.4 -16.8 0 -9.6 2.4 -16.8 7.2 -12 12 -2.4 
4.8 0 12 2.4 7.2 12 2.4 16.8 0 9.6 -2.4 16.8 -7.2 12 -12 2.4 
-4.8 0 -7.2 -2.4 -4.8 -4.8 -2.4 -7.2 -4.8 -16.8 0 -9.6 4.8 -16.8 2.4 -7.2 
4.8 -4.8 7.2 -2.4 P
1048.8 3916.8 7.2 2.4 4.8 4.8 2.4 7.2 4.8 16.8 0 9.6 -4.8 16.8 -2.4 7.2 
-4.8 4.8 -7.2 2.4 P
1099.2 3988.8 -7.2 -33.6 7.2 7.2 9.6 2.4 9.6 0 12 -2.4 7.2 -7.2 2.4 -12 
0 -7.2 -2.4 -9.6 -7.2 -7.2 -12 -2.4 -9.6 0 -9.6 2.4 -4.8 4.8 -2.4 7.2 
0 2.4 2.4 2.4 4.8 -2.4 -4.8 -2.4 P
1118.4 3964.8 7.2 -2.4 7.2 -7.2 4.8 -12 0 -7.2 -4.8 -9.6 -7.2 -7.2 -7.2 -2.4 P
1099.2 3988.8 33.6 0 P
1099.2 3986.4 16.8 0 16.8 2.4 S
868.8 4300.8 -9.6 -2.4 -7.2 -9.6 -2.4 -19.2 0 -9.6 2.4 -16.8 7.2 -12 9.6 -2.4 
7.2 0 12 2.4 7.2 12 2.4 16.8 0 9.6 -2.4 19.2 -7.2 9.6 -12 2.4 
-7.2 0 -4.8 -2.4 -4.8 -4.8 -2.4 -4.8 -4.8 -19.2 0 -9.6 4.8 -16.8 2.4 -7.2 
4.8 -4.8 4.8 -2.4 P
876 4228.8 7.2 2.4 4.8 4.8 2.4 7.2 4.8 16.8 0 9.6 -4.8 19.2 -2.4 4.8 
-4.8 4.8 -7.2 2.4 P
926.4 4236 -4.8 -4.8 4.8 -2.4 2.4 2.4 -2.4 4.8 P
974.4 4300.8 -12 -2.4 -4.8 -9.6 -4.8 -19.2 0 -9.6 4.8 -16.8 4.8 -12 12 -2.4 
7.2 0 9.6 2.4 7.2 12 2.4 16.8 0 9.6 -2.4 19.2 -7.2 9.6 -9.6 2.4 
-7.2 0 -7.2 -2.4 -4.8 -4.8 -2.4 -4.8 -2.4 -19.2 0 -9.6 2.4 -16.8 2.4 -7.2 
4.8 -4.8 7.2 -2.4 P
981.6 4228.8 7.2 2.4 2.4 4.8 2.4 7.2 4.8 16.8 0 9.6 -4.8 19.2 -4.8 9.6 
-7.2 2.4 P
1032 4288.8 7.2 2.4 9.6 9.6 0 -72 P
1046.4 4298.4 0 -69.6 P
1032 4228.8 31.2 0 P
1111.2 4300.8 -9.6 -2.4 -7.2 -9.6 -2.4 -19.2 0 -9.6 2.4 -16.8 7.2 -12 9.6 -2.4 
7.2 0 12 2.4 7.2 12 2.4 16.8 0 9.6 -2.4 19.2 -7.2 9.6 -12 2.4 
-7.2 0 -4.8 -2.4 -4.8 -4.8 -2.4 -4.8 -4.8 -19.2 0 -9.6 4.8 -16.8 2.4 -7.2 
4.8 -4.8 4.8 -2.4 P
1118.4 4228.8 7.2 2.4 4.8 4.8 2.4 7.2 4.8 16.8 0 9.6 -4.8 19.2 -2.4 4.8 
-4.8 4.8 -7.2 2.4 P
868.8 4612.8 -9.6 -2.4 -7.2 -9.6 -2.4 -19.2 0 -9.6 2.4 -16.8 7.2 -9.6 9.6 -4.8 
7.2 0 12 4.8 7.2 9.6 2.4 16.8 0 9.6 -2.4 19.2 -7.2 9.6 -12 2.4 
-7.2 0 S
868.8 4612.8 -9.6 -4.8 -2.4 -7.2 -4.8 -16.8 0 -12 4.8 -16.8 2.4 -7.2 4.8 -2.4 
4.8 -4.8 P
876 4540.8 7.2 4.8 4.8 2.4 2.4 7.2 4.8 16.8 0 12 -4.8 16.8 -2.4 7.2 
-4.8 2.4 -7.2 2.4 P
926.4 4548 -4.8 -2.4 4.8 -4.8 2.4 4.8 -2.4 2.4 P
974.4 4612.8 -12 -2.4 -4.8 -9.6 -4.8 -16.8 0 -12 4.8 -16.8 4.8 -9.6 12 -4.8 
7.2 0 9.6 4.8 7.2 9.6 2.4 16.8 0 12 -2.4 16.8 -7.2 9.6 -9.6 2.4 
-7.2 0 -7.2 -2.4 -4.8 -2.4 -2.4 -7.2 -2.4 -16.8 0 -12 2.4 -16.8 2.4 -7.2 
4.8 -2.4 7.2 -4.8 P
981.6 4540.8 7.2 4.8 2.4 2.4 2.4 7.2 4.8 16.8 0 12 -4.8 16.8 -2.4 7.2 
-2.4 2.4 -7.2 2.4 P
1024.8 4600.8 4.8 -4.8 -4.8 -2.4 -2.4 2.4 0 4.8 2.4 7.2 4.8 2.4 9.6 2.4 
14.4 0 9.6 -2.4 4.8 -2.4 2.4 -7.2 0 -7.2 -2.4 -7.2 -12 -7.2 -16.8 -7.2 
-7.2 -2.4 -7.2 -7.2 -2.4 -9.6 0 -12 P
1053.6 4612.8 7.2 -2.4 2.4 -2.4 4.8 -7.2 0 -7.2 -4.8 -7.2 -9.6 -7.2 -14.4 -7.2 P
1022.4 4548 2.4 4.8 7.2 0 16.8 -7.2 12 0 7.2 2.4 2.4 4.8 P
1032 4552.8 16.8 -12 14.4 0 4.8 4.8 2.4 7.2 0 4.8 P
1111.2 4612.8 -9.6 -2.4 -7.2 -9.6 -2.4 -16.8 0 -12 2.4 -16.8 7.2 -9.6 9.6 -4.8 
7.2 0 12 4.8 7.2 9.6 2.4 16.8 0 12 -2.4 16.8 -7.2 9.6 -12 2.4 
-7.2 0 -9.6 -4.8 -2.4 -7.2 -4.8 -16.8 0 -12 4.8 -16.8 2.4 -7.2 4.8 -2.4 
4.8 -4.8 P
1118.4 4540.8 7.2 4.8 4.8 2.4 2.4 7.2 4.8 16.8 0 12 -4.8 16.8 -2.4 7.2 
-4.8 2.4 -7.2 2.4 S
868.8 5028 -9.6 -4.8 -7.2 -9.6 -2.4 -16.8 0 -12 2.4 -16.8 7.2 -9.6 9.6 -4.8 
7.2 0 12 4.8 7.2 9.6 2.4 16.8 0 12 -2.4 16.8 -7.2 9.6 -12 4.8 
-7.2 0 -4.8 -4.8 -4.8 -2.4 -2.4 -7.2 -4.8 -16.8 0 -12 4.8 -16.8 2.4 -7.2 
4.8 -2.4 4.8 -4.8 P
876 4953.6 7.2 4.8 4.8 2.4 2.4 7.2 4.8 16.8 0 12 -4.8 16.8 -2.4 7.2 
-4.8 2.4 -7.2 4.8 P
926.4 4960.8 -4.8 -2.4 4.8 -4.8 2.4 4.8 -2.4 2.4 P
974.4 5028 -12 -4.8 -4.8 -9.6 -4.8 -16.8 0 -12 4.8 -16.8 4.8 -9.6 12 -4.8 
7.2 0 9.6 4.8 7.2 9.6 2.4 16.8 0 12 -2.4 16.8 -7.2 9.6 -9.6 4.8 
-7.2 0 -7.2 -4.8 -4.8 -2.4 -2.4 -7.2 -2.4 -16.8 0 -12 2.4 -16.8 2.4 -7.2 
4.8 -2.4 7.2 -4.8 P
981.6 4953.6 7.2 4.8 2.4 2.4 2.4 7.2 4.8 16.8 0 12 -4.8 16.8 -2.4 7.2 
-2.4 2.4 -7.2 4.8 P
1029.6 5028 -7.2 -36 7.2 7.2 9.6 2.4 9.6 0 12 -2.4 7.2 -7.2 2.4 -9.6 
0 -7.2 -2.4 -9.6 -7.2 -7.2 -12 -4.8 -9.6 0 -14.4 7.2 -2.4 7.2 0 4.8 
2.4 2.4 4.8 -2.4 -4.8 -4.8 P
1048.8 5001.6 7.2 -2.4 7.2 -7.2 4.8 -9.6 0 -7.2 -4.8 -9.6 -7.2 -7.2 -7.2 -4.8 P
1029.6 5028 33.6 0 P
1029.6 5023.2 16.8 0 16.8 4.8 P
1111.2 5028 -9.6 -4.8 -7.2 -9.6 -2.4 -16.8 0 -12 2.4 -16.8 7.2 -9.6 9.6 -4.8 
7.2 0 12 4.8 7.2 9.6 2.4 16.8 0 12 -2.4 16.8 -7.2 9.6 -12 4.8 
-7.2 0 -4.8 -4.8 -4.8 -2.4 -2.4 -7.2 -4.8 -16.8 0 -12 4.8 -16.8 2.4 -7.2 
4.8 -2.4 4.8 -4.8 S
1118.4 4953.6 7.2 4.8 4.8 2.4 2.4 7.2 4.8 16.8 0 12 -4.8 16.8 -2.4 7.2 
-4.8 2.4 -7.2 4.8 P
868.8 5340 -9.6 -4.8 -7.2 -9.6 -2.4 -16.8 0 -12 2.4 -16.8 7.2 -9.6 9.6 -4.8 
7.2 0 12 4.8 7.2 9.6 2.4 16.8 0 12 -2.4 16.8 -7.2 9.6 -12 4.8 
-7.2 0 -4.8 -4.8 -4.8 -2.4 -2.4 -7.2 -4.8 -16.8 0 -12 4.8 -16.8 2.4 -7.2 
4.8 -2.4 4.8 -4.8 P
876 5265.6 7.2 4.8 4.8 2.4 2.4 7.2 4.8 16.8 0 12 -4.8 16.8 -2.4 7.2 
-4.8 2.4 -7.2 4.8 P
926.4 5272.8 -4.8 -2.4 4.8 -4.8 2.4 4.8 -2.4 2.4 P
962.4 5325.6 7.2 2.4 12 12 0 -74.4 S
976.8 5335.2 0 -69.6 P
962.4 5265.6 31.2 0 P
1044 5340 -12 -4.8 -7.2 -9.6 -2.4 -16.8 0 -12 2.4 -16.8 7.2 -9.6 12 -4.8 
4.8 0 12 4.8 7.2 9.6 2.4 16.8 0 12 -2.4 16.8 -7.2 9.6 -12 4.8 
-4.8 0 -7.2 -4.8 -4.8 -2.4 -2.4 -7.2 -4.8 -16.8 0 -12 4.8 -16.8 2.4 -7.2 
4.8 -2.4 7.2 -4.8 P
1048.8 5265.6 7.2 4.8 4.8 2.4 2.4 7.2 4.8 16.8 0 12 -4.8 16.8 -2.4 7.2 
-4.8 2.4 -7.2 4.8 P
1111.2 5340 -9.6 -4.8 -7.2 -9.6 -2.4 -16.8 0 -12 2.4 -16.8 7.2 -9.6 9.6 -4.8 
7.2 0 12 4.8 7.2 9.6 2.4 16.8 0 12 -2.4 16.8 -7.2 9.6 -12 4.8 
-7.2 0 -4.8 -4.8 -4.8 -2.4 -2.4 -7.2 -4.8 -16.8 0 -12 4.8 -16.8 2.4 -7.2 
4.8 -2.4 4.8 -4.8 P
1118.4 5265.6 7.2 4.8 4.8 2.4 2.4 7.2 4.8 16.8 0 12 -4.8 16.8 -2.4 7.2 
-4.8 2.4 -7.2 4.8 P
868.8 5652 -9.6 -2.4 -7.2 -12 -2.4 -16.8 0 -9.6 2.4 -19.2 7.2 -9.6 9.6 -2.4 
7.2 0 12 2.4 7.2 9.6 2.4 19.2 0 9.6 -2.4 16.8 -7.2 12 -12 2.4 
-7.2 0 -4.8 -2.4 -4.8 -4.8 -2.4 -7.2 -4.8 -16.8 0 -9.6 4.8 -19.2 2.4 -4.8 
4.8 -4.8 4.8 -2.4 P
876 5580 7.2 2.4 4.8 4.8 2.4 4.8 4.8 19.2 0 9.6 -4.8 16.8 -2.4 7.2 
-4.8 4.8 -7.2 2.4 P
926.4 5587.2 -4.8 -4.8 4.8 -2.4 2.4 2.4 -2.4 4.8 P
957.6 5637.6 2.4 -2.4 -2.4 -4.8 -4.8 4.8 0 2.4 4.8 7.2 2.4 4.8 9.6 2.4 
14.4 0 9.6 -2.4 4.8 -4.8 2.4 -7.2 0 -7.2 -2.4 -7.2 -9.6 -4.8 -19.2 -7.2 
-7.2 -4.8 -4.8 -7.2 -4.8 -9.6 0 -9.6 S
984 5652 7.2 -2.4 2.4 -4.8 4.8 -7.2 0 -7.2 -4.8 -7.2 -24 -12 P
952.8 5587.2 4.8 2.4 4.8 0 19.2 -7.2 9.6 0 7.2 4.8 2.4 2.4 P
962.4 5589.6 19.2 -9.6 12 0 4.8 2.4 2.4 7.2 0 7.2 P
1044 5652 -12 -2.4 -7.2 -12 -2.4 -16.8 0 -9.6 2.4 -19.2 7.2 -9.6 12 -2.4 
4.8 0 12 2.4 7.2 9.6 2.4 19.2 0 9.6 -2.4 16.8 -7.2 12 -12 2.4 
-4.8 0 -7.2 -2.4 -4.8 -4.8 -2.4 -7.2 -4.8 -16.8 0 -9.6 4.8 -19.2 2.4 -4.8 
4.8 -4.8 7.2 -2.4 P
1048.8 5580 7.2 2.4 4.8 4.8 2.4 4.8 4.8 19.2 0 9.6 -4.8 16.8 -2.4 7.2 
-4.8 4.8 -7.2 2.4 P
1111.2 5652 -9.6 -2.4 -7.2 -12 -2.4 -16.8 0 -9.6 2.4 -19.2 7.2 -9.6 9.6 -2.4 
7.2 0 12 2.4 7.2 9.6 2.4 19.2 0 9.6 -2.4 16.8 -7.2 12 -12 2.4 
-7.2 0 -4.8 -2.4 -4.8 -4.8 -2.4 -7.2 -4.8 -16.8 0 -9.6 4.8 -19.2 2.4 -4.8 
4.8 -4.8 4.8 -2.4 P
1118.4 5580 7.2 2.4 4.8 4.8 2.4 4.8 4.8 19.2 0 9.6 -4.8 16.8 -2.4 7.2 
-4.8 4.8 -7.2 2.4 P
5220 3544.8 124.8 0 P
5344.8 3727.2 -43.2 0 P
5301.6 3856.8 43.2 0 P
5344.8 3957.6 -124.8 0 P
5301.6 4039.2 43.2 0 P
5344.8 4108.8 -43.2 0 P
5301.6 4168.8 43.2 0 P
5344.8 4224 -43.2 0 P
5220 4269.6 124.8 0 P
5344.8 4581.6 -124.8 0 P
5301.6 4766.4 43.2 0 P
5344.8 4896 -43.2 0 P
5220 4996.8 124.8 0 P
5344.8 5078.4 -43.2 0 P
5301.6 5148 43.2 0 P
5344.8 5208 -43.2 0 P
5301.6 5260.8 43.2 0 P
5344.8 5308.8 -124.8 0 S
5220 5620.8 124.8 0 S
255 0 r3
1190.4 4281.6 168 0 0 57.6 331.2 0 0 -48 165.6 0 0 7.2 165.6 0 
0 -26.4 168 0 0 93.6 165.6 0 0 -26.4 165.6 0 0 7.2 165.6 0 
0 38.4 168 0 ^ 165.6 0 0 -12 165.6 0 0 57.6 165.6 0 
0 -43.2 165.6 0 0 100.8 168 0 0 -33.6 165.6 0 0 19.2 165.6 0 
0 -14.4 165.6 0 0 67.2 165.6 0 0 12 165.6 0 0 9.6 168 0 
0 -43.2 165.6 0 0 -2.4 165.6 0 0 48 165.6 0 0 -19.2 168 0 S
K
2779.2 2080.8 0 -72 P
2784 2080.8 0 -72 P
2769.6 2080.8 33.6 0 12 -2.4 7.2 -7.2 2.4 -7.2 2.4 -9.6 0 -19.2 -2.4 -9.6 
-2.4 -7.2 -7.2 -7.2 -12 -2.4 -33.6 0 P
2803.2 2080.8 7.2 -2.4 7.2 -7.2 4.8 -7.2 2.4 -9.6 0 -19.2 -2.4 -9.6 -4.8 -7.2 
-7.2 -7.2 -7.2 -2.4 P
2856 2056.8 0 -72 P
2858.4 2056.8 0 -72 P
2858.4 2047.2 7.2 7.2 7.2 2.4 7.2 0 9.6 -2.4 7.2 -7.2 4.8 -12 0 -4.8 
-4.8 -12 -7.2 -7.2 -9.6 -2.4 -7.2 0 -7.2 2.4 -7.2 7.2 P
2880 2056.8 7.2 -2.4 7.2 -7.2 2.4 -12 0 -4.8 -2.4 -12 -7.2 -7.2 -7.2 -2.4 P
2846.4 2056.8 12 0 P
2846.4 1984.8 24 0 P
2928 2080.8 0 -72 P
2932.8 2080.8 0 -72 P
2932.8 2047.2 7.2 7.2 9.6 2.4 7.2 0 9.6 -2.4 4.8 -7.2 0 -38.4 P
2956.8 2056.8 7.2 -2.4 2.4 -7.2 0 -38.4 P
2918.4 2080.8 14.4 0 P
2918.4 2008.8 24 0 P
2956.8 2008.8 24 0 P
3004.8 2080.8 -2.4 -2.4 2.4 -4.8 2.4 4.8 -2.4 2.4 P
3004.8 2056.8 0 -48 P
3007.2 2056.8 0 -48 P
2995.2 2056.8 12 0 P
2995.2 2008.8 24 0 P
3100.8 2080.8 -2.4 -2.4 2.4 -4.8 4.8 4.8 -4.8 2.4 P
3105.6 2056.8 0 -62.4 -4.8 -7.2 -4.8 -2.4 -7.2 0 -4.8 2.4 0 4.8 4.8 2.4 
2.4 -2.4 -2.4 -4.8 P
3100.8 2056.8 0 -62.4 -2.4 -7.2 -2.4 -2.4 P
3091.2 2056.8 14.4 0 P
3139.2 2066.4 7.2 4.8 12 9.6 0 -72 P
3153.6 2078.4 0 -69.6 P
3139.2 2008.8 31.2 0 P
3201.6 2040 62.4 0 P
3300 2080.8 -4.8 -2.4 4.8 -4.8 2.4 4.8 -2.4 2.4 P
3302.4 2056.8 0 -62.4 -2.4 -7.2 -7.2 -2.4 -7.2 0 -2.4 2.4 0 4.8 2.4 2.4 
2.4 -2.4 -2.4 -4.8 S
3300 2056.8 0 -62.4 -4.8 -7.2 -2.4 -2.4 P
3288 2056.8 14.4 0 P
3331.2 2066.4 2.4 -2.4 -2.4 -2.4 -4.8 2.4 0 2.4 4.8 7.2 2.4 4.8 12 2.4 
12 0 12 -2.4 2.4 -4.8 4.8 -7.2 0 -4.8 -4.8 -7.2 -9.6 -7.2 -16.8 -7.2 
-14.4 -9.6 -4.8 -12 0 -9.6 P
3357.6 2080.8 7.2 -2.4 4.8 -4.8 2.4 -7.2 0 -4.8 -2.4 -7.2 -24 -14.4 P
3326.4 2016 4.8 2.4 7.2 0 16.8 -7.2 9.6 0 7.2 4.8 4.8 2.4 P
3338.4 2018.4 16.8 -9.6 14.4 0 2.4 2.4 4.8 7.2 0 7.2 P
1190.4 2299.2 4154.4 0 0 1245.6 ^ H
1190.4 2299.2 0 0 P
1190.4 2971.2 21.6 0 P
1233.6 2971.2 19.2 0 P
1274.4 2971.2 21.6 0 P
1315.2 2971.2 21.6 0 P
1358.4 2971.2 0 -19.2 P
1358.4 2930.4 0 -21.6 P
1377.6 2906.4 19.2 0 P
1418.4 2906.4 19.2 0 P
1459.2 2906.4 21.6 0 P
1500 2906.4 21.6 0 P
1524 2889.6 0 -12 9.6 0 P
1552.8 2877.6 21.6 0 P
1596 2877.6 19.2 0 P
1636.8 2877.6 21.6 0 P
1677.6 2877.6 12 0 0 9.6 P
1689.6 2906.4 0 2.4 19.2 0 P
1730.4 2908.8 19.2 0 P
1771.2 2908.8 21.6 0 P
1812 2908.8 21.6 0 P
1855.2 2908.8 0 -19.2 P
1855.2 2868 0 -4.8 14.4 0 P
1891.2 2863.2 21.6 0 P
1932 2863.2 21.6 0 P
1975.2 2863.2 19.2 0 P
2016 2863.2 4.8 0 0 14.4 P
2020.8 2896.8 0 2.4 21.6 0 P
2061.6 2899.2 21.6 0 P
2104.8 2899.2 19.2 0 P
2145.6 2899.2 19.2 0 P
2186.4 2899.2 2.4 0 0 19.2 P
2188.8 2940 0 14.4 7.2 0 P
2215.2 2954.4 21.6 0 P
2256 2954.4 21.6 0 P
2299.2 2954.4 19.2 0 S
2340 2954.4 14.4 0 0 -7.2 P
2354.4 2925.6 0 -12 7.2 0 P
2383.2 2913.6 21.6 0 P
2424 2913.6 21.6 0 P
2467.2 2913.6 19.2 0 P
2508 2913.6 12 0 0 -9.6 P
2520 2884.8 0 -12 9.6 0 P
2551.2 2872.8 21.6 0 P
2592 2872.8 21.6 0 P
2635.2 2872.8 19.2 0 P
2676 2872.8 9.6 0 0 12 P
2685.6 2904 0 21.6 P
2688 2944.8 19.2 0 P
2728.8 2944.8 21.6 0 P
2769.6 2944.8 21.6 0 P
2812.8 2944.8 19.2 0 P
2853.6 2944.8 0 21.6 P
2853.6 2988 0 19.2 P
2872.8 3009.6 21.6 0 P
2913.6 3009.6 21.6 0 P
2954.4 3009.6 21.6 0 P
2997.6 3009.6 19.2 0 P
3019.2 2990.4 0 -21.6 P
3019.2 2947.2 0 -19.2 P
3019.2 2906.4 0 -16.8 4.8 0 P
3045.6 2889.6 19.2 0 P
3086.4 2889.6 21.6 0 P
3127.2 2889.6 21.6 0 P
3170.4 2889.6 14.4 0 0 7.2 P
3184.8 2916 0 21.6 P
3184.8 2959.2 0 4.8 14.4 0 P
3220.8 2964 19.2 0 P
3261.6 2964 21.6 0 P
3302.4 2964 21.6 0 P
3345.6 2964 4.8 0 0 -14.4 P
3350.4 2930.4 0 -21.6 P
3350.4 2887.2 0 -19.2 P
3357.6 2851.2 19.2 0 P
3398.4 2851.2 19.2 0 P
3439.2 2851.2 21.6 0 P
3480 2851.2 21.6 0 P
3516 2858.4 0 21.6 P
3518.4 2896.8 21.6 0 P
3561.6 2896.8 19.2 0 P
3602.4 2896.8 21.6 0 P
3643.2 2896.8 21.6 0 P
3684 2899.2 0 21.6 P
3684 2940 21.6 0 P
3724.8 2940 21.6 0 P
3768 2940 19.2 0 P
3808.8 2940 21.6 0 P
3849.6 2942.4 0 19.2 P
3852 2980.8 19.2 0 P
3892.8 2980.8 21.6 0 P
3933.6 2980.8 21.6 0 P
3976.8 2980.8 19.2 0 P
4015.2 2978.4 0 -21.6 P
4032 2954.4 21.6 0 P
4072.8 2954.4 21.6 0 P
4116 2954.4 19.2 0 S
4156.8 2954.4 21.6 0 P
4180.8 2937.6 0 -21.6 P
4180.8 2894.4 0 -19.2 P
4180.8 2853.6 0 -21.6 P
4197.6 2827.2 21.6 0 P
4238.4 2827.2 21.6 0 P
4279.2 2827.2 21.6 0 P
4322.4 2827.2 19.2 0 P
4346.4 2844 0 21.6 P
4346.4 2887.2 0 4.8 14.4 0 P
4382.4 2892 21.6 0 P
4423.2 2892 21.6 0 P
4464 2892 21.6 0 P
4507.2 2892 4.8 0 0 14.4 P
4512 2928 0 21.6 P
4514.4 2968.8 19.2 0 P
4555.2 2968.8 21.6 0 P
4596 2968.8 21.6 0 P
4639.2 2968.8 19.2 0 P
4680 2968.8 0 -21.6 P
4680 2928 0 -2.4 19.2 0 P
4720.8 2925.6 19.2 0 P
4761.6 2925.6 19.2 0 P
4802.4 2925.6 21.6 0 P
4843.2 2925.6 2.4 0 0 -19.2 P
4855.2 2896.8 21.6 0 P
4898.4 2896.8 19.2 0 P
4939.2 2896.8 19.2 0 P
4980 2896.8 21.6 0 P
5011.2 2906.4 0 21.6 P
5025.6 2935.2 19.2 0 P
5066.4 2935.2 21.6 0 P
5107.2 2935.2 21.6 0 P
5150.4 2935.2 19.2 0 P
5176.8 2920.8 0 -21.6 P
5188.8 2892 21.6 0 P
5229.6 2892 21.6 0 P
5272.8 2892 19.2 0 P
5313.6 2892 21.6 0 P
1190.4 2299.2 0 124.8 P
1456.8 2340 0 -40.8 P
1720.8 2299.2 0 40.8 P
1984.8 2340 0 -40.8 P
2248.8 2299.2 0 40.8 P
2512.8 2424 0 -124.8 P
2776.8 2299.2 0 40.8 P
3040.8 2340 0 -40.8 P
3307.2 2299.2 0 40.8 P
3571.2 2340 0 -40.8 P
3835.2 2299.2 0 124.8 P
4099.2 2340 0 -40.8 P
4363.2 2299.2 0 40.8 P
4627.2 2340 0 -40.8 P
4891.2 2299.2 0 40.8 P
5157.6 2424 0 -124.8 P
1188 2229.6 -9.6 -2.4 -7.2 -9.6 -4.8 -19.2 0 -9.6 4.8 -16.8 7.2 -9.6 9.6 -4.8 
7.2 0 9.6 4.8 7.2 9.6 4.8 16.8 0 9.6 -4.8 19.2 -7.2 9.6 -9.6 2.4 
-7.2 0 S
1188 2229.6 -7.2 -2.4 -2.4 -2.4 -4.8 -7.2 -2.4 -19.2 0 -9.6 2.4 -16.8 4.8 -7.2 
2.4 -2.4 7.2 -4.8 P
1195.2 2157.6 7.2 4.8 2.4 2.4 4.8 7.2 2.4 16.8 0 9.6 -2.4 19.2 -4.8 7.2 
-2.4 2.4 -7.2 2.4 P
2498.4 2217.6 7.2 2.4 12 9.6 0 -72 P
2512.8 2227.2 0 -69.6 P
2498.4 2157.6 31.2 0 P
3813.6 2217.6 4.8 -4.8 -4.8 -2.4 -2.4 2.4 0 4.8 2.4 7.2 4.8 2.4 9.6 2.4 
14.4 0 9.6 -2.4 4.8 -2.4 2.4 -7.2 0 -7.2 -2.4 -7.2 -12 -7.2 -16.8 -7.2 
-7.2 -2.4 -7.2 -7.2 -2.4 -12 0 -9.6 P
3842.4 2229.6 7.2 -2.4 2.4 -2.4 4.8 -7.2 0 -7.2 -4.8 -7.2 -9.6 -7.2 -14.4 -7.2 S
3811.2 2164.8 2.4 2.4 7.2 0 16.8 -4.8 12 0 7.2 2.4 2.4 2.4 P
3820.8 2167.2 16.8 -9.6 14.4 0 4.8 4.8 2.4 4.8 0 7.2 P
5136 2217.6 2.4 -4.8 -2.4 -2.4 -4.8 2.4 0 4.8 4.8 7.2 2.4 2.4 12 2.4 
12 0 12 -2.4 2.4 -7.2 0 -9.6 -2.4 -7.2 -12 -4.8 -9.6 0 P
5162.4 2229.6 7.2 -2.4 4.8 -7.2 0 -9.6 -4.8 -7.2 -7.2 -4.8 7.2 -2.4 7.2 -7.2 
4.8 -7.2 0 -9.6 -4.8 -7.2 -2.4 -2.4 -12 -4.8 -12 0 -12 4.8 -2.4 2.4 
-4.8 7.2 0 2.4 4.8 4.8 2.4 -4.8 -2.4 -2.4 P
5174.4 2193.6 2.4 -12 0 -9.6 -2.4 -7.2 -4.8 -2.4 -7.2 -4.8 P
1190.4 3420 0 124.8 P
1456.8 3544.8 0 -40.8 P
1720.8 3504 0 40.8 P
1984.8 3544.8 0 -40.8 P
2248.8 3504 0 40.8 P
2512.8 3544.8 0 -124.8 P
2776.8 3504 0 40.8 P
3040.8 3544.8 0 -40.8 P
3307.2 3504 0 40.8 P
3571.2 3544.8 0 -40.8 P
3835.2 3420 0 124.8 P
4099.2 3544.8 0 -40.8 P
4363.2 3504 0 40.8 P
4627.2 3544.8 0 -40.8 P
4891.2 3504 0 40.8 P
5157.6 3544.8 0 -124.8 P
1190.4 2299.2 124.8 0 P
1233.6 2335.2 -43.2 0 P
1190.4 2368.8 43.2 0 P
1233.6 2400 -43.2 0 P
1190.4 2433.6 43.2 0 P
1315.2 2462.4 -124.8 0 P
1190.4 2493.6 43.2 0 P
1233.6 2520 -43.2 0 P
1190.4 2548.8 43.2 0 P
1233.6 2575.2 -43.2 0 P
1190.4 2601.6 124.8 0 P
1233.6 2628 -43.2 0 P
1190.4 2652 43.2 0 P
1233.6 2676 -43.2 0 P
1190.4 2697.6 43.2 0 P
1315.2 2721.6 -124.8 0 P
1190.4 2743.2 43.2 0 P
1233.6 2764.8 -43.2 0 P
1190.4 2786.4 43.2 0 P
1233.6 2808 -43.2 0 P
1190.4 2827.2 124.8 0 S
1233.6 2846.4 -43.2 0 P
1190.4 2865.6 43.2 0 P
1233.6 2884.8 -43.2 0 P
1190.4 2904 43.2 0 P
1315.2 2920.8 -124.8 0 P
1190.4 3086.4 43.2 0 P
1233.6 3223.2 -43.2 0 P
1190.4 3343.2 43.2 0 P
1233.6 3451.2 -43.2 0 P
1190.4 3544.8 124.8 0 P
1008 2330.4 -9.6 -2.4 -7.2 -12 -4.8 -16.8 0 -9.6 4.8 -19.2 7.2 -9.6 9.6 -2.4 
7.2 0 9.6 2.4 7.2 9.6 4.8 19.2 0 9.6 -4.8 16.8 -7.2 12 -9.6 2.4 
-7.2 0 -7.2 -2.4 -2.4 -4.8 -4.8 -7.2 -2.4 -16.8 0 -9.6 2.4 -19.2 4.8 -4.8 
2.4 -4.8 7.2 -2.4 P
1015.2 2258.4 7.2 2.4 2.4 4.8 4.8 4.8 2.4 19.2 0 9.6 -2.4 16.8 -4.8 7.2 
-2.4 4.8 -7.2 2.4 P
1063.2 2265.6 -2.4 -4.8 2.4 -2.4 4.8 2.4 -4.8 4.8 P
1099.2 2330.4 -7.2 -33.6 7.2 4.8 9.6 4.8 9.6 0 12 -4.8 7.2 -4.8 2.4 -12 
0 -7.2 -2.4 -9.6 -7.2 -7.2 -12 -2.4 -9.6 0 -9.6 2.4 -4.8 4.8 -2.4 4.8 
0 4.8 2.4 2.4 4.8 -2.4 -4.8 -4.8 P
1118.4 2306.4 14.4 -9.6 4.8 -12 0 -7.2 -4.8 -9.6 -7.2 -7.2 -7.2 -2.4 P
1099.2 2330.4 33.6 0 P
1099.2 2328 16.8 0 16.8 2.4 P
1008 2632.8 -9.6 -2.4 -7.2 -12 -4.8 -16.8 0 -9.6 4.8 -19.2 7.2 -9.6 9.6 -2.4 
7.2 0 9.6 2.4 7.2 9.6 4.8 19.2 0 9.6 -4.8 16.8 -7.2 12 -9.6 2.4 
-7.2 0 -7.2 -2.4 -2.4 -4.8 -4.8 -7.2 -2.4 -16.8 0 -9.6 2.4 -19.2 4.8 -4.8 
2.4 -4.8 7.2 -2.4 P
1015.2 2560.8 7.2 2.4 2.4 4.8 4.8 4.8 2.4 19.2 0 9.6 -2.4 16.8 -4.8 7.2 
-2.4 4.8 -7.2 2.4 S
1063.2 2568 -2.4 -4.8 2.4 -2.4 4.8 2.4 -4.8 4.8 P
1092 2632.8 0 -21.6 P
1092 2618.4 2.4 7.2 7.2 7.2 7.2 0 16.8 -9.6 7.2 0 4.8 2.4 2.4 7.2 P
1094.4 2625.6 7.2 4.8 7.2 0 16.8 -7.2 P
1140 2632.8 0 -9.6 -2.4 -12 -14.4 -16.8 -4.8 -7.2 -2.4 -9.6 0 -16.8 P
1137.6 2611.2 -19.2 -16.8 -2.4 -7.2 -4.8 -9.6 0 -16.8 P
998.4 2940 7.2 2.4 9.6 9.6 0 -72 P
1012.8 2949.6 0 -69.6 P
998.4 2880 31.2 0 P
1063.2 2887.2 -2.4 -2.4 2.4 -4.8 4.8 4.8 -4.8 2.4 P
1111.2 2952 -9.6 -2.4 -7.2 -9.6 -2.4 -16.8 0 -12 2.4 -16.8 7.2 -9.6 9.6 -4.8 
7.2 0 12 4.8 7.2 9.6 2.4 16.8 0 12 -2.4 16.8 -7.2 9.6 -12 2.4 
-7.2 0 -9.6 -4.8 -2.4 -7.2 -4.8 -16.8 0 -12 4.8 -16.8 2.4 -7.2 4.8 -2.4 
4.8 -4.8 P
1118.4 2880 7.2 4.8 4.8 2.4 2.4 7.2 4.8 16.8 0 12 -4.8 16.8 -2.4 7.2 
-4.8 2.4 -7.2 2.4 P
991.2 3561.6 2.4 -2.4 -2.4 -4.8 -4.8 4.8 0 2.4 4.8 7.2 2.4 4.8 12 2.4 
12 0 12 -2.4 2.4 -4.8 4.8 -7.2 0 -7.2 -4.8 -7.2 -9.6 -4.8 -16.8 -7.2 
-7.2 -4.8 -7.2 -7.2 -4.8 -9.6 0 -9.6 P
1017.6 3576 7.2 -2.4 4.8 -4.8 2.4 -7.2 0 -7.2 -2.4 -7.2 -12 -4.8 -12 -7.2 P
986.4 3511.2 4.8 2.4 7.2 0 16.8 -7.2 9.6 0 7.2 4.8 4.8 2.4 P
998.4 3513.6 16.8 -9.6 14.4 0 2.4 2.4 4.8 7.2 0 7.2 P
1063.2 3511.2 -2.4 -4.8 2.4 -2.4 4.8 2.4 -4.8 4.8 P
1111.2 3576 -9.6 -2.4 -7.2 -12 -2.4 -16.8 0 -9.6 2.4 -19.2 7.2 -9.6 9.6 -2.4 
7.2 0 12 2.4 7.2 9.6 2.4 19.2 0 9.6 -2.4 16.8 -7.2 12 -12 2.4 
-7.2 0 S
1111.2 3576 -4.8 -2.4 -4.8 -4.8 -2.4 -7.2 -4.8 -16.8 0 -9.6 4.8 -19.2 2.4 -4.8 
4.8 -4.8 4.8 -2.4 P
1118.4 3504 7.2 2.4 4.8 4.8 2.4 4.8 4.8 19.2 0 9.6 -4.8 16.8 -2.4 7.2 
-4.8 4.8 -7.2 2.4 P
5220 2299.2 124.8 0 P
5344.8 2335.2 -43.2 0 P
5301.6 2368.8 43.2 0 P
5344.8 2400 -43.2 0 P
5301.6 2433.6 43.2 0 P
5344.8 2462.4 -124.8 0 P
5301.6 2493.6 43.2 0 P
5344.8 2520 -43.2 0 P
5301.6 2548.8 43.2 0 P
5344.8 2575.2 -43.2 0 P
5220 2601.6 124.8 0 P
5344.8 2628 -43.2 0 P
5301.6 2652 43.2 0 P
5344.8 2676 -43.2 0 P
5301.6 2697.6 43.2 0 P
5344.8 2721.6 -124.8 0 P
5301.6 2743.2 43.2 0 P
5344.8 2764.8 -43.2 0 P
5301.6 2786.4 43.2 0 P
5344.8 2808 -43.2 0 P
5220 2827.2 124.8 0 P
5344.8 2846.4 -43.2 0 P
5301.6 2865.6 43.2 0 P
5344.8 2884.8 -43.2 0 P
5301.6 2904 43.2 0 P
5344.8 2920.8 -124.8 0 P
5301.6 3086.4 43.2 0 P
5344.8 3223.2 -43.2 0 P
5301.6 3343.2 43.2 0 P
5344.8 3451.2 -43.2 0 P
5220 3544.8 124.8 0 S
255 0 r3
1190.4 2299.2 0 0 P
1190.4 3012 21.6 0 P
1233.6 3012 19.2 0 P
1274.4 3012 21.6 0 P
1315.2 3012 21.6 0 P
1358.4 3012 0 -21.6 P
1358.4 2971.2 0 -21.6 P
1358.4 2928 0 -19.2 P
1358.4 2887.2 0 -12 9.6 0 P
1387.2 2875.2 21.6 0 P
1430.4 2875.2 19.2 0 P
1471.2 2875.2 21.6 0 P
1512 2875.2 12 0 0 9.6 P
1524 2906.4 0 19.2 2.4 0 P
1545.6 2925.6 21.6 0 P
1588.8 2925.6 19.2 0 P
1629.6 2925.6 21.6 0 P
1670.4 2925.6 19.2 0 0 2.4 P
1689.6 2947.2 0 21.6 P
1689.6 2990.4 0 9.6 9.6 0 P
1720.8 3000 21.6 0 P
1761.6 3000 21.6 0 P
1804.8 3000 19.2 0 P
1845.6 3000 9.6 0 0 -9.6 P
1855.2 2968.8 0 -12 9.6 0 P
1884 2956.8 21.6 0 P
1927.2 2956.8 19.2 0 P
1968 2956.8 19.2 0 P
2008.8 2956.8 12 0 0 7.2 P
2020.8 2985.6 0 19.2 P
2020.8 3026.4 0 2.4 19.2 0 P
2061.6 3028.8 19.2 0 P
2102.4 3028.8 21.6 0 P
2143.2 3028.8 21.6 0 P
2186.4 3028.8 2.4 0 0 -16.8 P
2188.8 2990.4 0 -21.6 P
2188.8 2949.6 0 -21.6 P
2188.8 2906.4 0 -14.4 4.8 0 P
2212.8 2892 21.6 0 P
2256 2892 19.2 0 P
2296.8 2892 21.6 0 P
2337.6 2892 16.8 0 0 4.8 P
2354.4 2918.4 0 19.2 P
2354.4 2959.2 0 2.4 16.8 0 P
2392.8 2961.6 19.2 0 P
2433.6 2961.6 21.6 0 P
2474.4 2961.6 21.6 0 P
2517.6 2961.6 2.4 0 0 12 7.2 0 P
2546.4 2973.6 21.6 0 P
2587.2 2973.6 21.6 0 P
2630.4 2973.6 19.2 0 P
2671.2 2973.6 14.4 0 0 -4.8 P
2685.6 2947.2 0 -21.6 P
2697.6 2916 19.2 0 P
2738.4 2916 21.6 0 P
2779.2 2916 21.6 0 S
2822.4 2916 19.2 0 P
2853.6 2925.6 0 21.6 P
2853.6 2968.8 0 16.8 2.4 0 P
2877.6 2985.6 21.6 0 P
2918.4 2985.6 21.6 0 P
2959.2 2985.6 21.6 0 P
3002.4 2985.6 16.8 0 0 2.4 P
3019.2 3009.6 0 19.2 2.4 0 P
3040.8 3028.8 21.6 0 P
3084 3028.8 19.2 0 P
3124.8 3028.8 21.6 0 P
3165.6 3028.8 19.2 0 0 -2.4 P
3184.8 3004.8 0 -19.2 P
3184.8 2964 0 -12 7.2 0 P
3213.6 2952 21.6 0 P
3254.4 2952 21.6 0 P
3297.6 2952 19.2 0 P
3338.4 2952 12 0 0 7.2 P
3350.4 2980.8 0 21.6 P
3350.4 3021.6 0 21.6 P
3350.4 3064.8 0 2.4 16.8 0 P
3388.8 3067.2 21.6 0 P
3429.6 3067.2 21.6 0 P
3472.8 3067.2 19.2 0 P
3513.6 3067.2 2.4 0 0 -19.2 P
3516 3028.8 0 -21.6 P
3516 2985.6 0 -19.2 P
3516 2944.8 0 -21.6 P
3516 2904 0 -16.8 4.8 0 P
3542.4 2887.2 19.2 0 P
3583.2 2887.2 21.6 0 P
3624 2887.2 21.6 0 P
3667.2 2887.2 16.8 0 0 4.8 P
3684 2911.2 0 21.6 P
3684 2954.4 0 19.2 P
3703.2 2976 19.2 0 P
3744 2976 21.6 0 P
3784.8 2976 21.6 0 P
3828 2976 19.2 0 P
3854.4 2961.6 21.6 0 P
3897.6 2961.6 19.2 0 P
3938.4 2961.6 21.6 0 P
3979.2 2961.6 21.6 0 P
4015.2 2968.8 0 21.6 P
4022.4 3002.4 19.2 0 P
4063.2 3002.4 21.6 0 P
4104 3002.4 21.6 0 P
4147.2 3002.4 19.2 0 P
4180.8 2997.6 0 -21.6 P
4180.8 2954.4 0 -19.2 P
4183.2 2916 19.2 0 P
4224 2916 21.6 0 P
4264.8 2916 21.6 0 P
4308 2916 19.2 0 P
4346.4 2916 0 21.6 P
4346.4 2959.2 0 4.8 14.4 0 P
4382.4 2964 21.6 0 P
4423.2 2964 21.6 0 P
4466.4 2964 19.2 0 S
4507.2 2964 4.8 0 0 -14.4 P
4512 2928 0 -7.2 14.4 0 P
4545.6 2920.8 21.6 0 P
4588.8 2920.8 19.2 0 P
4629.6 2920.8 19.2 0 P
4670.4 2920.8 9.6 0 0 12 P
4680 2952 0 21.6 P
4680 2995.2 0 19.2 2.4 0 P
4701.6 3014.4 21.6 0 P
4742.4 3014.4 21.6 0 P
4785.6 3014.4 19.2 0 P
4826.4 3014.4 19.2 0 P
4845.6 3036 0 21.6 P
4855.2 3067.2 21.6 0 P
4898.4 3067.2 19.2 0 P
4939.2 3067.2 21.6 0 P
4980 3067.2 21.6 0 P
5011.2 3055.2 0 -19.2 P
5011.2 3014.4 0 -21.6 P
5011.2 2973.6 0 -19.2 2.4 0 P
5032.8 2954.4 21.6 0 P
5076 2954.4 19.2 0 P
5116.8 2954.4 21.6 0 P
5157.6 2954.4 19.2 0 P
5176.8 2976 0 21.6 P
5179.2 3016.8 21.6 0 P
5220 3016.8 21.6 0 P
5263.2 3016.8 19.2 0 P
5304 3016.8 21.6 0 S
cleartomark end end pagesave restore
 showpage
%%PageTrailer
%%Trailer
%%Pages: 1
%%Trailer
cleartomark
countdictstack
exch sub { end } repeat
restore
%%EOF
