%!PS-Adobe-2.0 EPSF-2.0
%%BoundingBox:  0 0 567 384
%%Title: amp2_wpwp_cos0.eps: 
%%Creator: ROOT Version 5.32/02
%%CreationDate: Thu Mar 28 14:57:17 2013
%%EndComments
%%BeginProlog
80 dict begin
/s {stroke} def /l {lineto} def /m {moveto} def /t {translate} def
/r {rotate} def /rl {roll}  def /R {repeat} def
/d {rlineto} def /rm {rmoveto} def /gr {grestore} def /f {eofill} def
/c {setrgbcolor} def /black {0 setgray} def /sd {setdash} def
/cl {closepath} def /sf {scalefont setfont} def /lw {setlinewidth} def
/box {m dup 0 exch d exch 0 d 0 exch neg d cl} def
/NC{systemdict begin initclip end}def/C{NC box clip newpath}def
/bl {box s} def /bf {box f} def /Y { 0 exch d} def /X { 0 d} def 
/K {{pop pop 0 moveto} exch kshow} bind def
/ita {/ang 15 def gsave [1 0 ang dup sin exch cos div 1 0 0] concat} def 
/mp {newpath /y exch def /x exch def} def
/side {[w .77 mul w .23 mul] .385 w mul sd w 0 l currentpoint t -144 r} def
/mr {mp x y w2 0 360 arc} def /m24 {mr s} def /m20 {mr f} def
/mb {mp x y w2 add m w2 neg 0 d 0 w neg d w 0 d 0 w d cl} def
/mt {mp x y w2 add m w2 neg w neg d w 0 d cl} def
/m21 {mb f} def /m25 {mb s} def /m22 {mt f} def /m26{mt s} def
/m23 {mp x y w2 sub m w2 w d w neg 0 d cl f} def
/m27 {mp x y w2 add m w3 neg w2 neg d w3 w2 neg d w3 w2 d cl s} def
/m28 {mp x w2 sub y w2 sub w3 add m w3 0 d  0 w3 neg d w3 0 d 0 w3 d w3 0 d  0 w3 d w3 neg 0 d 0 w3 d w3 neg 0 d 0 w3 neg d w3 neg 0 d cl s } def
/m29 {mp gsave x w2 sub y w2 add w3 sub m currentpoint t 4 {side} repeat cl fill gr} def
/m30 {mp gsave x w2 sub y w2 add w3 sub m currentpoint t 4 {side} repeat cl s gr} def
/m31 {mp x y w2 sub m 0 w d x w2 sub y m w 0 d x w2 sub y w2 add m w w neg d x w2 sub y w2 sub m w w d s} def
/m32 {mp x y w2 sub m w2 w d w neg 0 d cl s} def
/m33 {mp x y w2 add m w3 neg w2 neg d w3 w2 neg d w3 w2 d cl f} def
/m34 {mp x w2 sub y w2 sub w3 add m w3 0 d  0 w3 neg d w3 0 d 0 w3 d w3 0 d  0 w3 d w3 neg 0 d 0 w3 d w3 neg 0 d 0 w3 neg d w3 neg 0 d cl f } def
/m2 {mp x y w2 sub m 0 w d x w2 sub y m w 0 d s} def
/m5 {mp x w2 sub y w2 sub m w w d x w2 sub y w2 add m w w neg d s} def
/reEncode {exch findfont dup length dict begin {1 index /FID eq  {pop pop} {def} ifelse } forall /Encoding exch def currentdict end dup /FontName get exch definefont pop } def [/Times-Bold /Times-Italic /Times-BoldItalic /Helvetica /Helvetica-Oblique
 /Helvetica-Bold /Helvetica-BoldOblique /Courier /Courier-Oblique /Courier-Bold /Courier-BoldOblique /Times-Roman /AvantGarde-Book /AvantGarde-BookOblique /AvantGarde-Demi /AvantGarde-DemiOblique /Bookman-Demi /Bookman-DemiItalic /Bookman-Light
 /Bookman-LightItalic /Helvetica-Narrow /Helvetica-Narrow-Bold /Helvetica-Narrow-BoldOblique /Helvetica-Narrow-Oblique /NewCenturySchlbk-Roman /NewCenturySchlbk-Bold /NewCenturySchlbk-BoldItalic /NewCenturySchlbk-Italic /Palatino-Bold
 /Palatino-BoldItalic /Palatino-Italic /Palatino-Roman ] {ISOLatin1Encoding reEncode } forall%%EndProlog
%%BeginSetup
%%EndSetup
newpath  gsave  .25 .25 scale  gsave  0 0 t black[  ] 0 sd 3 lw 1 1 1 c 2268 1538 0 0 bf black 1 1 1 c 1791 1215 363 246 bf black 1791 1215 363 246 bl 363 246 m 1791 X s
 gsave  2268 1538 0 0 C 2010.32 146.62 t 0 r /Helvetica findfont 48.8732 sf 0 0 m ( \(GeV\)) show NC gr 
 gsave  2268 1538 0 0 C 1987.51 146.62 t 0 r /Helvetica findfont 48.8732 sf 0 0 m (s) show NC gr  6 lw 1971 173 m 3 -30 d s 0 lw 1974 143 m 7 46 d s 1981 189 m 29 X s 3 lw 363 283 m -37 Y s 428 264 m -18 Y s 494 264 m -18 Y s 559 264 m -18 Y s 624
 264 m -18 Y s 690 283 m -37 Y s 755 264 m -18 Y s 821 264 m -18 Y s 886 264 m -18 Y s 951 264 m -18 Y s 1017 283 m -37 Y s 1082 264 m -18 Y s 1147 264 m -18 Y s 1213 264 m -18 Y s 1278 264 m -18 Y s 1344 283 m -37 Y s 1409 264 m -18 Y s 1474 264 m
 -18 Y s 1540 264 m -18 Y s 1605 264 m -18 Y s 1670 283 m -37 Y s 1736 264 m -18 Y s 1801 264 m -18 Y s 1867 264 m -18 Y s 1932 264 m -18 Y s 1997 283 m -37 Y s 1997 283 m -37 Y s 2063 264 m -18 Y s 2128 264 m -18 Y s
 gsave  2268 1538 0 0 C 348.629 195.493 t 0 r /Helvetica findfont 48.8732 sf 0 0 m (0) show NC gr 
 gsave  2268 1538 0 0 C 632.093 195.493 t 0 r /Helvetica findfont 48.8732 sf 0 0 m (1000) show NC gr 
 gsave  2268 1538 0 0 C 961.173 195.493 t 0 r /Helvetica findfont 48.8732 sf 0 0 m (2000) show NC gr 
 gsave  2268 1538 0 0 C 1286.99 195.493 t 0 r /Helvetica findfont 48.8732 sf 0 0 m (3000) show NC gr 
 gsave  2268 1538 0 0 C 1612.82 195.493 t 0 r /Helvetica findfont 48.8732 sf 0 0 m (4000) show NC gr 
 gsave  2268 1538 0 0 C 1941.9 195.493 t 0 r /Helvetica findfont 48.8732 sf 0 0 m (5000) show NC gr  363 1461 m 1791 X s 363 1425 m 36 Y s 428 1443 m 18 Y s 494 1443 m 18 Y s 559 1443 m 18 Y s 624 1443 m 18 Y s 690 1425 m 36 Y s 755 1443 m 18 Y s 821
 1443 m 18 Y s 886 1443 m 18 Y s 951 1443 m 18 Y s 1017 1425 m 36 Y s 1082 1443 m 18 Y s 1147 1443 m 18 Y s 1213 1443 m 18 Y s 1278 1443 m 18 Y s 1344 1425 m 36 Y s 1409 1443 m 18 Y s 1474 1443 m 18 Y s 1540 1443 m 18 Y s 1605 1443 m 18 Y s 1670 1425
 m 36 Y s 1736 1443 m 18 Y s 1801 1443 m 18 Y s 1867 1443 m 18 Y s 1932 1443 m 18 Y s 1997 1425 m 36 Y s 1997 1425 m 36 Y s 2063 1443 m 18 Y s 2128 1443 m 18 Y s 363 246 m 1215 Y s
 gsave  2268 1538 0 0 C 231.333 1443.39 t 90 r /Helvetica findfont 32.5821 sf 0 0 m (2) show NC gr 
 gsave  2268 1538 0 0 C 254.141 1254.41 t 90 r /Helvetica findfont 48.8732 sf 0 0 m (|M\(s,t,u\)|) show NC gr  417 246 m -54 X s 390 289 m -27 X s 390 332 m -27 X s 390 375 m -27 X s 390 418 m -27 X s 417 461 m -54 X s 390 504 m -27 X s 390 547 m -27
 X s 390 590 m -27 X s 390 633 m -27 X s 417 676 m -54 X s 390 719 m -27 X s 390 762 m -27 X s 390 805 m -27 X s 390 849 m -27 X s 417 892 m -54 X s 390 935 m -27 X s 390 978 m -27 X s 390 1021 m -27 X s 390 1064 m -27 X s 417 1107 m -54 X s 390 1150
 m -27 X s 390 1193 m -27 X s 390 1236 m -27 X s 390 1279 m -27 X s 417 1322 m -54 X s 417 1322 m -54 X s 390 1365 m -27 X s 390 1408 m -27 X s 390 1451 m -27 X s
 gsave  2268 1538 0 0 C 322.563 228.075 t 0 r /Helvetica findfont 48.8732 sf 0 0 m (0) show NC gr 
 gsave  2268 1538 0 0 C 267.173 443.117 t 0 r /Helvetica findfont 48.8732 sf 0 0 m (100) show NC gr 
 gsave  2268 1538 0 0 C 267.173 658.159 t 0 r /Helvetica findfont 48.8732 sf 0 0 m (200) show NC gr 
 gsave  2268 1538 0 0 C 267.173 873.201 t 0 r /Helvetica findfont 48.8732 sf 0 0 m (300) show NC gr 
 gsave  2268 1538 0 0 C 267.173 1088.24 t 0 r /Helvetica findfont 48.8732 sf 0 0 m (400) show NC gr 
 gsave  2268 1538 0 0 C 267.173 1303.29 t 0 r /Helvetica findfont 48.8732 sf 0 0 m (500) show NC gr  2154 246 m 1215 Y s 2101 246 m 53 X s 2127 289 m 27 X s 2127 332 m 27 X s 2127 375 m 27 X s 2127 418 m 27 X s 2101 461 m 53 X s 2127 504 m 27 X s
 2127 547 m 27 X s 2127 590 m 27 X s 2127 633 m 27 X s 2101 676 m 53 X s 2127 719 m 27 X s 2127 762 m 27 X s 2127 805 m 27 X s 2127 849 m 27 X s 2101 892 m 53 X s 2127 935 m 27 X s 2127 978 m 27 X s 2127 1021 m 27 X s 2127 1064 m 27 X s 2101 1107 m
 53 X s 2127 1150 m 27 X s 2127 1193 m 27 X s 2127 1236 m 27 X s 2127 1279 m 27 X s 2101 1322 m 53 X s 2101 1322 m 53 X s 2127 1365 m 27 X s 2127 1408 m 27 X s 2127 1451 m 27 X s 0 1 0 c 6 lw black 0 1 0 c 428 337 m 3 -10 d -2 Y 4 -7 d 3 -4 d 3 -3 d
 3 -1 d 3 -1 d 10 X 3 1 d 3 X 3 1 d 3 1 d 3 1 d 3 1 d 4 1 d 3 1 d 3 2 d 3 1 d 3 1 d 3 2 d 3 1 d 4 2 d 3 2 d 3 1 d 3 2 d 3 2 d 3 2 d 3 2 d 4 2 d 3 2 d 3 2 d 3 3 d 3 2 d 3 2 d 3 3 d 4 2 d 3 3 d 3 3 d 3 3 d 3 2 d 3 3 d 3 3 d 4 3 d 3 4 d 3 3 d 3 3 d 3 3
 d 3 4 d 3 3 d 4 4 d 3 3 d 3 4 d 3 4 d 3 3 d 3 4 d 3 4 d 4 4 d 3 4 d 3 4 d 3 4 d 3 4 d 3 5 d 3 4 d 4 4 d 3 5 d 3 4 d 3 4 d 3 5 d 3 4 d 3 5 d 4 4 d 3 5 d 3 5 d 3 4 d 3 5 d 3 5 d 4 5 d 3 4 d 3 5 d 3 5 d 3 5 d 3 5 d 3 4 d 4 5 d 3 5 d 3 5 d 3 5 d 3 5 d 3
 5 d 3 5 d 4 5 d 3 5 d 3 5 d 3 5 d 3 5 d 3 5 d 3 5 d 4 5 d 3 5 d 3 5 d 3 5 d 3 4 d 3 5 d 3 5 d 4 5 d 3 5 d 3 5 d 3 5 d 3 5 d 3 5 d 3 5 d 4 4 d 3 5 d 3 5 d 3 5 d 3 5 d 3 4 d 3 5 d 4 5 d 3 5 d 3 4 d 3 5 d 3 5 d 3 4 d 3 5 d 4 4 d 3 5 d 3 4 d 3 5 d 3 4 d
 3 5 d 3 4 d 4 5 d 3 4 d 3 5 d 3 4 d 3 4 d 3 5 d 3 4 d 4 4 d 3 4 d 3 5 d 3 4 d 3 4 d 3 4 d 3 4 d 4 4 d 3 4 d 3 4 d 3 4 d 3 4 d 3 4 d 3 4 d 4 4 d 3 4 d 3 4 d 3 4 d 3 3 d 3 4 d 4 4 d 3 4 d 3 3 d 3 4 d 3 4 d 3 3 d 3 4 d 4 3 d 3 4 d 3 3 d 3 4 d 3 3 d 3 4
 d 3 3 d 4 4 d 3 3 d 3 3 d 3 3 d 3 4 d 3 3 d 3 3 d 4 3 d 3 4 d 3 3 d 3 3 d 3 3 d 3 3 d 3 3 d 4 3 d 3 3 d 3 3 d 3 3 d 3 3 d 3 3 d 3 3 d 4 3 d 3 3 d 3 3 d 3 2 d 3 3 d 3 3 d 3 3 d 4 3 d 3 2 d 3 3 d 3 3 d 3 2 d 3 3 d 3 3 d 4 2 d 3 3 d 3 2 d 3 3 d 3 2 d 3
 3 d 3 2 d 4 3 d 3 2 d 3 3 d 3 2 d 3 2 d 3 3 d 3 2 d 4 2 d 3 3 d 3 2 d 3 2 d 3 2 d 3 3 d 3 2 d 4 2 d 3 2 d 3 2 d 3 3 d 3 2 d 3 2 d 4 2 d 3 2 d 3 2 d 3 2 d 3 2 d 3 2 d 3 2 d 4 2 d 3 2 d 3 2 d 3 2 d 3 2 d 3 2 d 3 2 d 4 2 d 3 1 d 3 2 d 3 2 d 3 2 d 3 2 d
 3 2 d 4 1 d 3 2 d 3 2 d 3 2 d 3 1 d 3 2 d 3 2 d 4 1 d 3 2 d 3 2 d 3 1 d 3 2 d 3 2 d 3 1 d 4 2 d 3 2 d 3 1 d 3 2 d 3 1 d 3 2 d 3 1 d 4 2 d 3 1 d 3 2 d 3 1 d 3 2 d 3 1 d 3 2 d 4 1 d 3 2 d 3 1 d 3 1 d 3 2 d 3 1 d 3 2 d 4 1 d 3 1 d 3 2 d 3 1 d 3 1 d 3 2
 d 3 1 d 4 1 d 3 2 d 3 1 d 3 1 d 3 1 d 3 2 d 3 1 d 4 1 d 3 1 d 3 2 d 3 1 d 3 1 d 3 1 d 4 1 d 3 2 d 3 1 d 3 1 d 3 1 d 3 1 d 3 1 d 4 2 d 3 1 d 3 1 d 3 1 d 3 1 d 3 1 d 3 1 d 4 1 d 3 1 d 3 1 d 3 1 d 3 1 d 3 1 d 3 2 d 4 1 d 3 1 d 3 1 d 3 1 d 3 1 d 3 1 d 3
 1 d 4 1 d 3 1 d 3 X 3 1 d 3 1 d 3 1 d 3 1 d 4 1 d 3 1 d 3 1 d 3 1 d 3 1 d 3 1 d 3 1 d 4 1 d 3 X 3 1 d 3 1 d 3 1 d 3 1 d 3 1 d 4 1 d 3 X 3 1 d 3 1 d 3 1 d 3 1 d 3 1 d 4 X 3 1 d 3 1 d 3 1 d 3 1 d 3 X 3 1 d 4 1 d 3 1 d 3 1 d 3 X 3 1 d 3 1 d 3 1 d 4 X 3
 1 d 3 1 d 3 X 3 1 d 3 1 d 3 1 d 4 X 3 1 d 3 1 d 3 X 3 1 d 3 1 d 4 1 d 3 X 3 1 d 3 1 d 3 X 3 1 d 3 1 d 4 X 3 1 d 3 X 3 1 d 3 1 d 3 X 3 1 d 4 1 d 3 X 3 1 d 3 1 d 3 X 3 1 d 3 X 4 1 d 3 1 d 3 X 3 1 d 3 X 3 1 d 3 X 4 1 d 3 1 d 3 X 3 1 d 3 X 3 1 d 3 X 4 1
 d 3 1 d 3 X 3 1 d 3 X 3 1 d 3 X 4 1 d 3 X 3 1 d 3 X 3 1 d 3 X 3 1 d 4 X 3 1 d 3 X 3 1 d 3 X 3 1 d 3 X 4 1 d 3 X 3 1 d 3 X 3 1 d 3 X 3 1 d 4 X 3 1 d 3 X 3 1 d 3 X 3 1 d 3 X 4 1 d 6 X 3 1 d 3 X 3 1 d 4 X 3 1 d 3 X 3 1 d 6 X 3 1 d 4 X 3 1 d 6 X 3 1 d 3
 X 3 1 d 4 X 3 1 d 6 X 3 1 d 3 X 3 1 d 7 X 3 1 d 6 X 3 1 d 3 X s 0 0 1 c[ 20 20] 0 sd black 0 0 1 c 428 337 m 3 -12 d 4 -7 d 3 -4 d 3 -3 d 3 -1 d 3 -1 d 10 X 3 1 d 3 X 3 1 d 3 1 d 3 1 d 3 1 d 4 1 d 3 1 d 3 2 d 3 1 d 3 1 d 3 2 d 3 1 d 4 2 d 3 1 d 3 2
 d 3 2 d 3 2 d 3 1 d 3 2 d 4 2 d 3 2 d 3 3 d 3 2 d 3 2 d 3 2 d 3 3 d 4 2 d 3 3 d 3 2 d 3 3 d 3 3 d 3 2 d 3 3 d 4 3 d 3 3 d 3 3 d 3 3 d 3 3 d 3 4 d 3 3 d 4 3 d 3 3 d 3 4 d 3 3 d 3 4 d 3 4 d 3 3 d 4 4 d 3 4 d 3 3 d 3 4 d 3 4 d 3 4 d 3 4 d 4 4 d 3 4 d 3
 4 d 3 4 d 3 4 d 3 4 d 3 4 d 4 5 d 3 4 d 3 4 d 3 4 d 3 5 d 3 4 d 4 4 d 3 5 d 3 4 d 3 4 d 3 5 d 3 4 d 3 5 d 4 4 d 3 5 d 3 4 d 3 5 d 3 4 d 3 4 d 3 5 d 4 4 d 3 5 d 3 4 d 3 5 d 3 4 d 3 5 d 3 4 d 4 5 d 3 4 d 3 5 d 3 4 d 3 5 d 3 4 d 3 5 d 4 4 d 3 4 d 3 5 d
 3 4 d 3 5 d 3 4 d 3 4 d 4 5 d 3 4 d 3 4 d 3 5 d 3 4 d 3 4 d 3 4 d 4 5 d 3 4 d 3 4 d 3 4 d 3 4 d 3 4 d 3 5 d 4 4 d 3 4 d 3 4 d 3 4 d 3 4 d 3 4 d 3 4 d 4 4 d 3 4 d 3 4 d 3 3 d 3 4 d 3 4 d 3 4 d 4 4 d 3 4 d 3 3 d 3 4 d 3 4 d 3 3 d 3 4 d 4 4 d 3 3 d 3 4
 d 3 3 d 3 4 d 3 4 d 3 3 d 4 3 d 3 4 d 3 3 d 3 4 d 3 3 d 3 3 d 4 4 d 3 3 d 3 3 d 3 4 d 3 3 d 3 3 d 3 3 d 4 3 d 3 4 d 3 3 d 3 3 d 3 3 d 3 3 d 3 3 d 4 3 d 3 3 d 3 3 d 3 3 d 3 3 d 3 3 d 3 3 d 4 2 d 3 3 d 3 3 d 3 3 d 3 3 d 3 2 d 3 3 d 4 3 d 3 3 d 3 2 d 3
 3 d 3 2 d 3 3 d 3 3 d 4 2 d 3 3 d 3 2 d 3 3 d 3 2 d 3 3 d 3 2 d 4 3 d 3 2 d 3 2 d 3 3 d 3 2 d 3 3 d 3 2 d 4 2 d 3 2 d 3 3 d 3 2 d 3 2 d 3 2 d 3 3 d 4 2 d 3 2 d 3 2 d 3 2 d 3 2 d 3 2 d 3 3 d 4 2 d 3 2 d 3 2 d 3 2 d 3 2 d 3 2 d 3 2 d 4 2 d 3 2 d 3 1 d
 3 2 d 3 2 d 3 2 d 4 2 d 3 2 d 3 2 d 3 2 d 3 1 d 3 2 d 3 2 d 4 2 d 3 1 d 3 2 d 3 2 d 3 2 d 3 1 d 3 2 d 4 2 d 3 1 d 3 2 d 3 2 d 3 1 d 3 2 d 3 2 d 4 1 d 3 2 d 3 1 d 3 2 d 3 1 d 3 2 d 3 1 d 4 2 d 3 1 d 3 2 d 3 1 d 3 2 d 3 1 d 3 2 d 4 1 d 3 2 d 3 1 d 3 1
 d 3 2 d 3 1 d 3 2 d 4 1 d 3 1 d 3 2 d 3 1 d 3 1 d 3 2 d 3 1 d 4 1 d 3 1 d 3 2 d 3 1 d 3 1 d 3 1 d 3 2 d 4 1 d 3 1 d 3 1 d 3 1 d 3 2 d 3 1 d 3 1 d 4 1 d 3 1 d 3 1 d 3 2 d 3 1 d 3 1 d 3 1 d 4 1 d 3 1 d 3 1 d 3 1 d 3 1 d 3 2 d 4 1 d 3 1 d 3 1 d 3 1 d 3
 1 d 3 1 d 3 1 d 4 1 d 3 1 d 3 1 d 3 1 d 3 1 d 3 1 d 3 1 d 4 1 d 3 1 d 3 1 d 3 1 d 3 X 3 1 d 3 1 d 4 1 d 3 1 d 3 1 d 3 1 d 3 1 d 3 1 d 3 1 d 4 1 d 3 X 3 1 d 3 1 d 3 1 d 3 1 d 3 1 d 4 X 3 1 d 3 1 d 3 1 d 3 1 d 3 1 d 3 X 4 1 d 3 1 d 3 1 d 3 1 d 3 X 3 1
 d 3 1 d 4 1 d 3 X 3 1 d 3 1 d 3 1 d 3 X 3 1 d 4 1 d 3 1 d 3 X 3 1 d 3 1 d 3 X 3 1 d 4 1 d 3 X 3 1 d 3 1 d 3 X 3 1 d 3 1 d 4 1 d 3 X 3 1 d 3 X 3 1 d 3 1 d 3 X 4 1 d 3 1 d 3 X 3 1 d 3 1 d 3 X 4 1 d 3 X 3 1 d 3 1 d 3 X 3 1 d 3 X 4 1 d 3 1 d 3 X 3 1 d 3
 X 3 1 d 3 X 4 1 d 3 1 d 3 X 3 1 d 3 X 3 1 d 3 X 4 1 d 3 X 3 1 d 3 X 3 1 d 3 X 3 1 d 4 1 d 3 X 3 1 d 3 X 3 1 d 3 X 3 1 d 4 X 3 1 d 3 X 3 1 d 3 X 3 1 d 7 X 3 1 d 3 X 3 1 d 3 X 3 1 d 3 X 4 1 d 3 X 3 1 d 3 X 3 1 d 6 X 4 1 d 3 X 3 1 d 3 X 3 1 d 6 X 4 1 d
 3 X 3 1 d 3 X 3 1 d 6 X 4 1 d 3 X 3 1 d 6 X 3 1 d 4 X 3 1 d 6 X 3 1 d 3 X 3 1 d 7 X 3 1 d 6 X 3 1 d 3 X 4 1 d 6 X 3 1 d 6 X 3 1 d 7 X 3 1 d 6 X 3 1 d 3 X s 1 0 0 c[  12 12 ] 0 sd black 1 0 0 c 428 337 m 3 -12 d 4 -7 d 3 -4 d 3 -3 d 3 -1 d 3 -1 d 10
 X 3 1 d 3 X 3 1 d 3 1 d 3 1 d 3 1 d 4 1 d 3 1 d 3 2 d 3 1 d 3 1 d 3 2 d 3 1 d 4 2 d 3 1 d 3 2 d 3 2 d 3 2 d 3 1 d 3 2 d 4 2 d 3 2 d 3 3 d 3 2 d 3 2 d 3 2 d 3 3 d 4 2 d 3 3 d 3 2 d 3 3 d 3 3 d 3 2 d 3 3 d 4 3 d 3 3 d 3 3 d 3 3 d 3 3 d 3 4 d 3 3 d 4 3
 d 3 3 d 3 4 d 3 3 d 3 4 d 3 4 d 3 3 d 4 4 d 3 4 d 3 3 d 3 4 d 3 4 d 3 4 d 3 4 d 4 4 d 3 4 d 3 4 d 3 4 d 3 4 d 3 4 d 3 4 d 4 5 d 3 4 d 3 4 d 3 4 d 3 5 d 3 4 d 4 4 d 3 5 d 3 4 d 3 4 d 3 5 d 3 4 d 3 5 d 4 4 d 3 5 d 3 4 d 3 5 d 3 4 d 3 4 d 3 5 d 4 4 d 3
 5 d 3 4 d 3 5 d 3 4 d 3 5 d 3 4 d 4 5 d 3 4 d 3 5 d 3 4 d 3 5 d 3 4 d 3 5 d 4 4 d 3 4 d 3 5 d 3 4 d 3 5 d 3 4 d 3 4 d 4 5 d 3 4 d 3 4 d 3 5 d 3 4 d 3 4 d 3 4 d 4 5 d 3 4 d 3 4 d 3 4 d 3 4 d 3 4 d 3 5 d 4 4 d 3 4 d 3 4 d 3 4 d 3 4 d 3 4 d 3 4 d 4 4 d
 3 4 d 3 4 d 3 3 d 3 4 d 3 4 d 3 4 d 4 4 d 3 4 d 3 3 d 3 4 d 3 4 d 3 3 d 3 4 d 4 4 d 3 3 d 3 4 d 3 3 d 3 4 d 3 4 d 3 3 d 4 3 d 3 4 d 3 3 d 3 4 d 3 3 d 3 3 d 4 4 d 3 3 d 3 3 d 3 4 d 3 3 d 3 3 d 3 3 d 4 3 d 3 4 d 3 3 d 3 3 d 3 3 d 3 3 d 3 3 d 4 3 d 3 3
 d 3 3 d 3 3 d 3 3 d 3 3 d 3 3 d 4 2 d 3 3 d 3 3 d 3 3 d 3 3 d 3 2 d 3 3 d 4 3 d 3 3 d 3 2 d 3 3 d 3 2 d 3 3 d 3 3 d 4 2 d 3 3 d 3 2 d 3 3 d 3 2 d 3 3 d 3 2 d 4 3 d 3 2 d 3 2 d 3 3 d 3 2 d 3 3 d 3 2 d 4 2 d 3 2 d 3 3 d 3 2 d 3 2 d 3 2 d 3 3 d 4 2 d 3
 2 d 3 2 d 3 2 d 3 2 d 3 2 d 3 3 d 4 2 d 3 2 d 3 2 d 3 2 d 3 2 d 3 2 d 3 2 d 4 2 d 3 2 d 3 1 d 3 2 d 3 2 d 3 2 d 4 2 d 3 2 d 3 2 d 3 2 d 3 1 d 3 2 d 3 2 d 4 2 d 3 1 d 3 2 d 3 2 d 3 2 d 3 1 d 3 2 d 4 2 d 3 1 d 3 2 d 3 2 d 3 1 d 3 2 d 3 2 d 4 1 d 3 2 d
 3 1 d 3 2 d 3 1 d 3 2 d 3 1 d 4 2 d 3 1 d 3 2 d 3 1 d 3 2 d 3 1 d 3 2 d 4 1 d 3 2 d 3 1 d 3 1 d 3 2 d 3 1 d 3 2 d 4 1 d 3 1 d 3 2 d 3 1 d 3 1 d 3 2 d 3 1 d 4 1 d 3 1 d 3 2 d 3 1 d 3 1 d 3 1 d 3 2 d 4 1 d 3 1 d 3 1 d 3 1 d 3 2 d 3 1 d 3 1 d 4 1 d 3 1
 d 3 1 d 3 2 d 3 1 d 3 1 d 3 1 d 4 1 d 3 1 d 3 1 d 3 1 d 3 1 d 3 2 d 4 1 d 3 1 d 3 1 d 3 1 d 3 1 d 3 1 d 3 1 d 4 1 d 3 1 d 3 1 d 3 1 d 3 1 d 3 1 d 3 1 d 4 1 d 3 1 d 3 1 d 3 1 d 3 X 3 1 d 3 1 d 4 1 d 3 1 d 3 1 d 3 1 d 3 1 d 3 1 d 3 1 d 4 1 d 3 X 3 1 d
 3 1 d 3 1 d 3 1 d 3 1 d 4 X 3 1 d 3 1 d 3 1 d 3 1 d 3 1 d 3 X 4 1 d 3 1 d 3 1 d 3 1 d 3 X 3 1 d 3 1 d 4 1 d 3 X 3 1 d 3 1 d 3 1 d 3 X 3 1 d 4 1 d 3 1 d 3 X 3 1 d 3 1 d 3 X 3 1 d 4 1 d 3 X 3 1 d 3 1 d 3 X 3 1 d 3 1 d 4 1 d 3 X 3 1 d 3 X 3 1 d 3 1 d 3
 X 4 1 d 3 1 d 3 X 3 1 d 3 1 d 3 X 4 1 d 3 X 3 1 d 3 1 d 3 X 3 1 d 3 X 4 1 d 3 1 d 3 X 3 1 d 3 X 3 1 d 3 X 4 1 d 3 1 d 3 X 3 1 d 3 X 3 1 d 3 X 4 1 d 3 X 3 1 d 3 X 3 1 d 3 X 3 1 d 4 1 d 3 X 3 1 d 3 X 3 1 d 3 X 3 1 d 4 X 3 1 d 3 X 3 1 d 3 X 3 1 d 7 X 3
 1 d 3 X 3 1 d 3 X 3 1 d 3 X 4 1 d 3 X 3 1 d 3 X 3 1 d 6 X 4 1 d 3 X 3 1 d 3 X 3 1 d 6 X 4 1 d 3 X 3 1 d 3 X 3 1 d 6 X 4 1 d 3 X 3 1 d 6 X 3 1 d 4 X 3 1 d 6 X 3 1 d 3 X 3 1 d 7 X 3 1 d 6 X 3 1 d 3 X 4 1 d 6 X 3 1 d 6 X 3 1 d 7 X 3 1 d 6 X 3 1 d 3 X s
 black[  ] 0 sd 3 lw 0.95 0.95 0.95 c 454 307 1542 308 bf black 1542 308 m 454 X s 1996 308 m 307 Y s 1996 615 m -454 X s 1542 615 m -307 Y s
 gsave  2268 1538 0 0 C 1655.17 550.638 t 0 r /Helvetica-Bold findfont 42.3568 sf 0 0 m (Fixed width) show NC gr  0 1 0 c 6 lw 1559 564 m 79 X s black
 gsave  2268 1538 0 0 C 1655.17 449.633 t 0 r /Helvetica-Bold findfont 42.3568 sf 0 0 m (Naive prop.) show NC gr  1 0 0 c[  12 12 ] 0 sd 1559 461 m 79 X s black
 gsave  2268 1538 0 0 C 1655.17 345.371 t 0 r /Helvetica-Bold findfont 42.3568 sf 0 0 m 
 296 282 259 235 212 186 175 151 128 116 102 79 56 42 28
(Effective descr.) K NC gr  0 0 1 c[ 20 20] 0 sd 1559 359 m 79 X s black
 gsave  2268 1538 0 0 C 2222.1 1117.57 t 90 r /Helvetica-BoldOblique findfont 29.3239 sf 0 0 m (LHC HIGGS XS WG 2013) show NC gr 
 gr  gr showpage
end
%%EOF
