%!PS-Adobe-2.0 EPSF-2.0
%%BoundingBox: 81 198 464 390
%%HiResBoundingBox: 81.500000 198.500000 464.000000 389.500000
%...................................
%%Creator: GPL Ghostscript 870 (pswrite)
%%CreationDate: 2013/02/14 17:37:25
%%DocumentData: Clean7Bit
%%LanguageLevel: 2
%%EndComments
% EPSF created by ps2eps 1.64
%%BeginProlog
save
countdictstack
mark
newpath
/showpage {} def
/setpagedevice {pop} def
%%EndProlog
%%Page 1 1
%%BeginProlog
% This copyright applies to everything between here and the %%EndProlog:
% Copyright (C) 2009 Artifex Software, Inc.  All rights reserved.
%%BeginResource: procset GS_pswrite_2_0_1001 1.001 0
/GS_pswrite_2_0_1001 80 dict dup begin
/PageSize 2 array def/setpagesize{ PageSize aload pop 3 index eq exch
4 index eq and{ pop pop pop}{ PageSize dup  1
5 -1 roll put 0 4 -1 roll put dup null eq {false} {dup where} ifelse{ exch get exec}
{ pop/setpagedevice where
{ pop 1 dict dup /PageSize PageSize put setpagedevice}
{ /setpage where{ pop PageSize aload pop pageparams 3 {exch pop} repeat
setpage}if}ifelse}ifelse}ifelse} bind def
/!{bind def}bind def/#{load def}!/N/counttomark #
/rG{3{3 -1 roll 255 div}repeat setrgbcolor}!/G{255 div setgray}!/K{0 G}!
/r6{dup 3 -1 roll rG}!/r5{dup 3 1 roll rG}!/r3{dup rG}!
/w/setlinewidth #/J/setlinecap #
/j/setlinejoin #/M/setmiterlimit #/d/setdash #/i/setflat #
/m/moveto #/l/lineto #/c/rcurveto #
/p{N 2 idiv{N -2 roll rlineto}repeat}!
/P{N 0 gt{N -2 roll moveto p}if}!
/h{p closepath}!/H{P closepath}!
/lx{0 rlineto}!/ly{0 exch rlineto}!/v{0 0 6 2 roll c}!/y{2 copy c}!
/re{4 -2 roll m exch dup lx exch ly neg lx h}!
/^{3 index neg 3 index neg}!
/f{P fill}!/f*{P eofill}!/s{H stroke}!/S{P stroke}!
/q/gsave #/Q/grestore #/rf{re fill}!
/Y{P clip newpath}!/Y*{P eoclip newpath}!/rY{re Y}!
/|={pop exch 4 1 roll 1 array astore cvx 3 array astore cvx exch 1 index def exec}!
/|{exch string readstring |=}!
/+{dup type/nametype eq{2 index 7 add -3 bitshift 2 index mul}if}!
/@/currentfile #/${+ @ |}!
/B{{2 copy string{readstring pop}aload pop 4 array astore cvx
3 1 roll}repeat pop pop true}!
/Ix{[1 0 0 1 11 -2 roll exch neg exch neg]exch}!
/,{true exch Ix imagemask}!/If{false exch Ix imagemask}!/I{exch Ix image}!
/Ic{exch Ix false 3 colorimage}!
/F{/Columns counttomark 3 add -2 roll/Rows exch/K -1/BlackIs1 true>>
/CCITTFaxDecode filter}!/FX{<</EndOfBlock false F}!
/X{/ASCII85Decode filter}!/@X{@ X}!/&2{2 index 2 index}!
/@F{@ &2<<F}!/@C{@X &2 FX}!
/$X{+ @X |}!/&4{4 index 4 index}!/$F{+ @ &4<<F |}!/$C{+ @X &4 FX |}!
/IC{3 1 roll 10 dict begin 1{/ImageType/Interpolate/Decode/DataSource
/ImageMatrix/BitsPerComponent/Height/Width}{exch def}forall
currentdict end image}!
/~{@ read {pop} if}!
end def
%%EndResource
/pagesave null def
%%EndProlog
%%Page: 1 1
%%PageBoundingBox: 0 0 612 792
%%BeginPageSetup
GS_pswrite_2_0_1001 begin
612 792 /letter setpagesize
/pagesave save store 197 dict begin
0.1 0.1 scale
%%EndPageSetup
gsave mark
Q q
0 0 6120 7920 re
Y
4.8 w
1 J
1 j
K
2294.4 5863.2 -9.6 -12 -12 -14.4 -9.6 -21.6 -4.8 -26.4 0 -19.2 4.8 -26.4 9.6 -21.6 
12 -14.4 9.6 -9.6 P
2284.8 5851.2 -12 -19.2 -4.8 -16.8 -4.8 -26.4 0 -19.2 4.8 -26.4 4.8 -14.4 12 -21.6 P
2503.2 5841.6 0 -108 P
2508 5841.6 0 -108 P
2570.4 5841.6 0 -108 P
2575.2 5841.6 0 -108 P
2486.4 5841.6 36 0 P
2553.6 5841.6 38.4 0 P
2508 5788.8 62.4 0 P
2486.4 5733.6 36 0 P
2553.6 5733.6 38.4 0 P
2628 5841.6 -4.8 -4.8 4.8 -4.8 ^ ^ P
2628 5805.6 0 -72 P
2632.8 5805.6 0 -72 P
2611.2 5805.6 21.6 0 P
2611.2 5733.6 36 0 P
2700 5805.6 -9.6 -4.8 -7.2 -4.8 -4.8 -12 0 -9.6 4.8 -9.6 7.2 -4.8 9.6 -7.2 
9.6 0 12 7.2 4.8 4.8 4.8 9.6 0 9.6 -4.8 12 -4.8 4.8 -12 4.8 
-9.6 0 P
2690.4 5800.8 -7.2 -12 0 -19.2 7.2 -9.6 P
2721.6 5760 4.8 9.6 0 19.2 -4.8 12 P
2726.4 5796 4.8 4.8 9.6 4.8 0 -4.8 -9.6 0 P
2685.6 5764.8 -7.2 -4.8 -4.8 -12 0 -4.8 4.8 -9.6 16.8 -4.8 26.4 0 14.4 -7.2 
4.8 -4.8 P
2673.6 5743.2 4.8 -4.8 16.8 -4.8 26.4 0 14.4 -4.8 4.8 -12 0 -4.8 -4.8 -9.6 
-14.4 -4.8 -31.2 0 -16.8 4.8 -4.8 9.6 0 4.8 4.8 12 16.8 4.8 P
2798.4 5805.6 -9.6 -4.8 -4.8 -4.8 -7.2 -12 0 -9.6 7.2 -9.6 4.8 -4.8 9.6 -7.2 
9.6 0 12 7.2 4.8 4.8 4.8 9.6 0 9.6 -4.8 12 -4.8 4.8 -12 4.8 
-9.6 0 P
2788.8 5800.8 -4.8 -12 0 -19.2 4.8 -9.6 P
2820 5760 4.8 9.6 0 19.2 -4.8 12 S
2824.8 5796 4.8 4.8 9.6 4.8 0 -4.8 -9.6 0 P
2784 5764.8 -7.2 -4.8 -4.8 -12 0 -4.8 4.8 -9.6 16.8 -4.8 26.4 0 14.4 -7.2 
4.8 -4.8 P
2772 5743.2 4.8 -4.8 16.8 -4.8 26.4 0 14.4 -4.8 4.8 -12 0 -4.8 -4.8 -9.6 
-14.4 -4.8 -31.2 0 -16.8 4.8 -4.8 9.6 0 4.8 4.8 12 16.8 4.8 P
2923.2 5796 4.8 9.6 0 -21.6 -4.8 12 -4.8 4.8 -9.6 4.8 -21.6 0 -9.6 -4.8 
-7.2 -4.8 0 -12 7.2 -4.8 9.6 -4.8 26.4 -9.6 9.6 -4.8 4.8 -7.2 P
2870.4 5788.8 7.2 -4.8 9.6 -4.8 26.4 -9.6 9.6 -4.8 4.8 -4.8 0 -16.8 -4.8 -4.8 
-9.6 -4.8 -21.6 0 -9.6 4.8 -4.8 4.8 -7.2 9.6 0 -19.2 7.2 9.6 P
3052.8 5805.6 0 -108 P
3057.6 5805.6 0 -108 P
3057.6 5788.8 12 12 9.6 4.8 9.6 0 16.8 -4.8 9.6 -12 4.8 -14.4 0 -9.6 
-4.8 -16.8 -9.6 -9.6 -16.8 -4.8 -9.6 0 -9.6 4.8 -12 9.6 P
3088.8 5805.6 12 -4.8 9.6 -12 4.8 -14.4 0 -9.6 -4.8 -16.8 -9.6 -9.6 -12 -4.8 P
3038.4 5805.6 19.2 0 P
3038.4 5697.6 36 0 P
3182.4 5841.6 0 -108 P
3189.6 5841.6 0 -108 P
3151.2 5841.6 -4.8 -31.2 0 31.2 79.2 0 ^ -4.8 31.2 P
3168 5733.6 36 0 P
3748.8 5805.6 31.2 -72 P
3756 5805.6 24 -62.4 P
3811.2 5805.6 -31.2 -72 P
3739.2 5805.6 31.2 0 P
3792 5805.6 31.2 0 P
3854.4 5841.6 0 -108 P
3859.2 5841.6 0 -108 P
3859.2 5788.8 9.6 12 12 4.8 9.6 0 14.4 -4.8 12 -12 4.8 -14.4 0 -9.6 
-4.8 -16.8 -12 -9.6 -14.4 -4.8 -9.6 0 -12 4.8 -9.6 9.6 S
3890.4 5805.6 9.6 -4.8 12 -12 4.8 -14.4 0 -9.6 -4.8 -16.8 -12 -9.6 -9.6 -4.8 P
3837.6 5841.6 21.6 0 P
3988.8 5836.8 -4.8 -4.8 4.8 -4.8 ^ 0 4.8 -4.8 4.8 -9.6 0 -12 -4.8 
-4.8 -9.6 0 -93.6 P
3979.2 5841.6 -4.8 -4.8 -7.2 -9.6 0 -93.6 P
3948 5805.6 40.8 0 P
3948 5733.6 36 0 P
4082.4 5788.8 -4.8 -4.8 4.8 -4.8 4.8 4.8 0 4.8 -9.6 12 -9.6 4.8 -16.8 0 
-14.4 -4.8 -12 -12 -4.8 -14.4 0 -9.6 4.8 -16.8 12 -9.6 14.4 -4.8 9.6 0 
16.8 4.8 9.6 9.6 P
4051.2 5805.6 -9.6 -4.8 -12 -12 -4.8 -14.4 0 -9.6 4.8 -16.8 12 -9.6 9.6 -4.8 P
4130.4 5805.6 0 -57.6 4.8 -9.6 14.4 -4.8 12 0 14.4 4.8 9.6 9.6 P
4135.2 5805.6 0 -57.6 4.8 -9.6 9.6 -4.8 P
4185.6 5805.6 0 -72 P
4192.8 5805.6 0 -72 P
4113.6 5805.6 21.6 0 P
4171.2 5805.6 21.6 0 P
4185.6 5733.6 21.6 0 P
4243.2 5841.6 0 -88.8 4.8 -14.4 12 -4.8 9.6 0 9.6 4.8 7.2 9.6 P
4248 5841.6 0 -88.8 7.2 -14.4 4.8 -4.8 P
4228.8 5805.6 40.8 0 P
4363.2 5796 4.8 9.6 0 -21.6 -4.8 12 -4.8 4.8 -9.6 4.8 -21.6 0 -9.6 -4.8 
-7.2 -4.8 0 -12 7.2 -4.8 9.6 -4.8 26.4 -9.6 9.6 -4.8 4.8 -7.2 P
4310.4 5788.8 7.2 -4.8 9.6 -4.8 26.4 -9.6 9.6 -4.8 4.8 -4.8 0 -16.8 -4.8 -4.8 
-9.6 -4.8 -21.6 0 -9.6 4.8 -4.8 4.8 -7.2 9.6 0 -19.2 7.2 9.6 P
1190.4 3544.8 4154.4 0 0 2076 ^ H
1190.4 3544.8 0 1358.4 168 0 0 230.4 165.6 0 0 81.6 165.6 0 0 50.4 
165.6 0 0 19.2 165.6 0 0 -12 168 0 0 -28.8 165.6 0 0 -33.6 
165.6 0 0 -69.6 165.6 0 0 -57.6 168 0 0 -45.6 165.6 0 0 -67.2 
165.6 0 0 -74.4 165.6 0 0 -50.4 165.6 0 0 -120 165.6 0 0 -67.2 
168 0 0 -28.8 165.6 0 0 -50.4 165.6 0 0 -98.4 165.6 0 0 -98.4 
168 0 0 -103.2 165.6 0 0 14.4 165.6 0 0 -115.2 165.6 0 0 -33.6 
165.6 0 0 -141.6 165.6 0 0 -458.4 S
1190.4 3544.8 0 124.8 P
1399.2 3585.6 0 -40.8 P
1605.6 3544.8 0 40.8 P
1814.4 3585.6 0 -40.8 P
2020.8 3544.8 0 40.8 P
2229.6 3669.6 0 -124.8 P
2436 3544.8 0 40.8 P
2644.8 3585.6 0 -40.8 P
2853.6 3544.8 0 40.8 P
3060 3585.6 0 -40.8 P
3266.4 3544.8 0 124.8 P
3475.2 3585.6 0 -40.8 P
3681.6 3544.8 0 40.8 P
3890.4 3585.6 0 -40.8 P
4099.2 3544.8 0 40.8 P
4305.6 3669.6 0 -124.8 P
4514.4 3544.8 0 40.8 P
4720.8 3585.6 0 -40.8 P
4929.6 3544.8 0 40.8 P
5136 3585.6 0 -40.8 P
5344.8 3544.8 0 124.8 P
1190.4 5496 0 124.8 P
1399.2 5620.8 0 -40.8 P
1605.6 5580 0 40.8 P
1814.4 5620.8 0 -40.8 P
2020.8 5580 0 40.8 P
2229.6 5620.8 0 -124.8 P
2436 5580 0 40.8 P
2644.8 5620.8 0 -40.8 P
2853.6 5580 0 40.8 P
3060 5620.8 0 -40.8 P
3266.4 5496 0 124.8 P
3475.2 5620.8 0 -40.8 P
3681.6 5580 0 40.8 P
3890.4 5620.8 0 -40.8 P
4099.2 5580 0 40.8 P
4305.6 5620.8 0 -124.8 P
4514.4 5580 0 40.8 P
4720.8 5620.8 0 -40.8 P
4929.6 5580 0 40.8 P
5136 5620.8 0 -40.8 P
5344.8 5496 0 124.8 P
1233.6 3636 -43.2 0 P
1190.4 3700.8 43.2 0 P
1233.6 3751.2 -43.2 0 P
1190.4 3792 43.2 0 P
1233.6 3828 -43.2 0 P
1190.4 3856.8 43.2 0 P
1233.6 3883.2 -43.2 0 P
1190.4 3907.2 124.8 0 P
1233.6 4063.2 -43.2 0 P
1190.4 4154.4 43.2 0 P
1233.6 4219.2 -43.2 0 P
1190.4 4269.6 43.2 0 P
1233.6 4310.4 -43.2 0 P
1190.4 4346.4 43.2 0 P
1233.6 4375.2 -43.2 0 P
1190.4 4404 43.2 0 P
1315.2 4425.6 -124.8 0 P
1190.4 4581.6 43.2 0 P
1233.6 4675.2 -43.2 0 P
1190.4 4740 43.2 0 P
1233.6 4790.4 -43.2 0 P
1190.4 4831.2 43.2 0 S
1233.6 4864.8 -43.2 0 P
1190.4 4896 43.2 0 P
1233.6 4922.4 -43.2 0 P
1190.4 4946.4 124.8 0 P
1233.6 5102.4 -43.2 0 P
1190.4 5193.6 43.2 0 P
1233.6 5258.4 -43.2 0 P
1190.4 5308.8 43.2 0 P
1233.6 5349.6 -43.2 0 P
1190.4 5383.2 43.2 0 P
1233.6 5414.4 -43.2 0 P
1190.4 5440.8 43.2 0 P
1315.2 5464.8 -124.8 0 P
1190.4 5620.8 43.2 0 P
818.4 3924 7.2 4.8 9.6 9.6 0 -72 P
832.8 3936 0 -69.6 P
818.4 3866.4 31.2 0 P
897.6 3938.4 -9.6 -2.4 -7.2 -12 -4.8 -16.8 0 -9.6 4.8 -16.8 7.2 -12 9.6 -2.4 
7.2 0 9.6 2.4 7.2 12 4.8 16.8 0 9.6 -4.8 16.8 -7.2 12 -9.6 2.4 
-7.2 0 -7.2 -2.4 -2.4 -4.8 -4.8 -7.2 -2.4 -16.8 0 -9.6 2.4 -16.8 4.8 -7.2 
2.4 -4.8 7.2 -2.4 P
904.8 3866.4 7.2 2.4 2.4 4.8 4.8 7.2 2.4 16.8 0 9.6 -2.4 16.8 -4.8 7.2 
-2.4 4.8 -7.2 2.4 P
950.4 3938.4 62.4 0 P
1068 3974.4 0 -67.2 P
1070.4 3979.2 0 -72 P
1070.4 3979.2 -38.4 -50.4 55.2 0 P
1056 3907.2 26.4 0 P
818.4 4444.8 7.2 2.4 9.6 9.6 0 -72 P
832.8 4454.4 0 -69.6 P
818.4 4384.8 31.2 0 P
897.6 4456.8 -9.6 -2.4 -7.2 -9.6 -4.8 -19.2 0 -9.6 4.8 -16.8 7.2 -9.6 9.6 -4.8 
7.2 0 9.6 4.8 7.2 9.6 4.8 16.8 0 9.6 -4.8 19.2 -7.2 9.6 -9.6 2.4 
-7.2 0 -7.2 -2.4 -2.4 -2.4 -4.8 -7.2 -2.4 -19.2 0 -9.6 2.4 -16.8 4.8 -7.2 
2.4 -2.4 7.2 -4.8 P
904.8 4384.8 7.2 4.8 2.4 2.4 4.8 7.2 2.4 16.8 0 9.6 -2.4 19.2 -4.8 7.2 
-2.4 2.4 -7.2 2.4 P
950.4 4456.8 62.4 0 S
1039.2 4485.6 4.8 -2.4 -4.8 -4.8 -2.4 4.8 0 2.4 2.4 7.2 14.4 7.2 14.4 0 
9.6 -4.8 4.8 -7.2 0 -9.6 -4.8 -7.2 -9.6 -2.4 -12 0 P
1068 4500 7.2 -4.8 2.4 -7.2 0 -9.6 -2.4 -7.2 -7.2 -2.4 7.2 -4.8 7.2 -7.2 
2.4 -4.8 0 -12 -2.4 -7.2 -14.4 -7.2 -14.4 0 -14.4 7.2 -2.4 7.2 0 4.8 
2.4 2.4 4.8 -2.4 -4.8 -4.8 P
1077.6 4461.6 4.8 -9.6 0 -12 -4.8 -7.2 -2.4 -2.4 -7.2 -4.8 P
818.4 4963.2 7.2 2.4 9.6 12 0 -74.4 P
832.8 4972.8 0 -69.6 P
818.4 4903.2 31.2 0 P
897.6 4977.6 -9.6 -4.8 -7.2 -9.6 -4.8 -16.8 0 -12 4.8 -16.8 7.2 -9.6 9.6 -4.8 
7.2 0 9.6 4.8 7.2 9.6 4.8 16.8 0 12 -4.8 16.8 -7.2 9.6 -9.6 4.8 
-7.2 0 -7.2 -4.8 -2.4 -2.4 -4.8 -7.2 -2.4 -16.8 0 -12 2.4 -16.8 4.8 -7.2 
2.4 -2.4 7.2 -4.8 P
904.8 4903.2 7.2 4.8 2.4 2.4 4.8 7.2 2.4 16.8 0 12 -2.4 16.8 -4.8 7.2 
-2.4 2.4 -7.2 4.8 P
950.4 4977.6 62.4 0 P
1039.2 5004 4.8 -2.4 -4.8 -4.8 -2.4 4.8 0 2.4 2.4 7.2 4.8 4.8 9.6 2.4 
14.4 0 9.6 -2.4 4.8 -4.8 2.4 -7.2 0 -7.2 -2.4 -7.2 -12 -4.8 -16.8 -7.2 
-7.2 -4.8 -7.2 -7.2 -2.4 -9.6 0 -9.6 P
1068 5018.4 7.2 -2.4 2.4 -4.8 4.8 -7.2 0 -7.2 -4.8 -7.2 -24 -12 P
1036.8 4953.6 2.4 2.4 7.2 0 16.8 -7.2 12 0 7.2 4.8 2.4 2.4 P
1046.4 4956 16.8 -9.6 14.4 0 4.8 2.4 2.4 7.2 0 7.2 P
818.4 5481.6 7.2 4.8 9.6 9.6 0 -72 S
832.8 5491.2 0 -67.2 P
818.4 5424 31.2 0 P
897.6 5496 -9.6 -4.8 -7.2 -9.6 -4.8 -16.8 0 -9.6 4.8 -19.2 7.2 -9.6 9.6 -2.4 
7.2 0 9.6 2.4 7.2 9.6 4.8 19.2 0 9.6 -4.8 16.8 -7.2 9.6 -9.6 4.8 
-7.2 0 -7.2 -4.8 -2.4 -2.4 -4.8 -7.2 -2.4 -16.8 0 -9.6 2.4 -19.2 4.8 -7.2 
2.4 -2.4 7.2 -2.4 P
904.8 5424 7.2 2.4 2.4 2.4 4.8 7.2 2.4 19.2 0 9.6 -2.4 16.8 -4.8 7.2 
-2.4 2.4 -7.2 4.8 P
950.4 5496 62.4 0 P
1046.4 5522.4 7.2 4.8 9.6 9.6 0 -72 P
1060.8 5534.4 0 -69.6 P
1046.4 5464.8 31.2 0 P
5344.8 3636 -43.2 0 P
5301.6 3700.8 43.2 0 P
5344.8 3751.2 -43.2 0 P
5301.6 3792 43.2 0 P
5344.8 3828 -43.2 0 S
5301.6 3856.8 43.2 0 P
5344.8 3883.2 -43.2 0 P
5220 3907.2 124.8 0 P
5344.8 4063.2 -43.2 0 P
5301.6 4154.4 43.2 0 P
5344.8 4219.2 -43.2 0 P
5301.6 4269.6 43.2 0 P
5344.8 4310.4 -43.2 0 P
5301.6 4346.4 43.2 0 P
5344.8 4375.2 -43.2 0 P
5301.6 4404 43.2 0 P
5344.8 4425.6 -124.8 0 P
5301.6 4581.6 43.2 0 P
5344.8 4675.2 -43.2 0 P
5301.6 4740 43.2 0 P
5344.8 4790.4 -43.2 0 P
5301.6 4831.2 43.2 0 P
5344.8 4864.8 -43.2 0 P
5301.6 4896 43.2 0 P
5344.8 4922.4 -43.2 0 P
5220 4946.4 124.8 0 P
5344.8 5102.4 -43.2 0 P
5301.6 5193.6 43.2 0 P
5344.8 5258.4 -43.2 0 P
5301.6 5308.8 43.2 0 P
5344.8 5349.6 -43.2 0 P
5301.6 5383.2 43.2 0 P
5344.8 5414.4 -43.2 0 P
5301.6 5440.8 43.2 0 P
5344.8 5464.8 -124.8 0 P
5301.6 5620.8 43.2 0 S
255 0 r3
1190.4 3544.8 0 1329.6 168 0 0 252 165.6 0 0 60 165.6 0 0 60 
165.6 0 0 16.8 165.6 0 0 -2.4 168 0 0 -26.4 165.6 0 0 -55.2 
165.6 0 0 -50.4 165.6 0 0 -38.4 168 0 0 -76.8 165.6 0 0 -50.4 
165.6 0 0 -110.4 165.6 0 0 -52.8 165.6 0 0 -100.8 165.6 0 0 -43.2 
168 0 0 -103.2 165.6 0 0 -141.6 165.6 0 0 76.8 165.6 0 0 -127.2 
168 0 0 -144 165.6 0 0 -69.6 165.6 0 0 103.2 165.6 0 0 -19.2 
165.6 0 0 -57.6 165.6 0 0 -628.8 S
K
2784 2080.8 0 -72 P
2786.4 2080.8 0 -72 P
2827.2 2080.8 0 -72 P
2832 2080.8 0 -72 P
2772 2080.8 24 0 P
2817.6 2080.8 24 0 P
2786.4 2047.2 40.8 0 P
2772 2008.8 24 0 P
2817.6 2008.8 24 0 P
2865.6 2080.8 -2.4 -2.4 2.4 -4.8 4.8 4.8 -4.8 2.4 P
2865.6 2056.8 0 -48 P
2870.4 2056.8 0 -48 P
2856 2056.8 14.4 0 P
2856 2008.8 24 0 P
2916 2056.8 -7.2 -2.4 -4.8 -4.8 -2.4 -7.2 0 -7.2 2.4 -4.8 4.8 -4.8 7.2 -2.4 
4.8 0 7.2 2.4 4.8 4.8 2.4 4.8 0 7.2 -2.4 7.2 -4.8 4.8 -7.2 2.4 
-4.8 0 P
2908.8 2054.4 -4.8 -7.2 0 -14.4 4.8 -7.2 P
2928 2025.6 4.8 7.2 0 14.4 -4.8 7.2 P
2932.8 2049.6 2.4 4.8 7.2 2.4 0 -2.4 -7.2 0 P
2904 2030.4 -2.4 -4.8 -4.8 -7.2 0 -2.4 4.8 -7.2 9.6 -4.8 16.8 0 12 -2.4 
2.4 -2.4 P
2896.8 2016 4.8 -4.8 9.6 -2.4 16.8 0 12 -4.8 2.4 -4.8 0 -4.8 -2.4 -7.2 
-12 -2.4 -19.2 0 -12 2.4 -2.4 7.2 0 4.8 2.4 4.8 12 4.8 P
2980.8 2056.8 -7.2 -2.4 -2.4 -4.8 -4.8 -7.2 0 -7.2 4.8 -4.8 2.4 -4.8 7.2 -2.4 
7.2 0 7.2 2.4 2.4 4.8 4.8 4.8 0 7.2 -4.8 7.2 -2.4 4.8 -7.2 2.4 
-7.2 0 P
2973.6 2054.4 -2.4 -7.2 0 -14.4 2.4 -7.2 P
2995.2 2025.6 2.4 7.2 0 14.4 -2.4 7.2 P
2997.6 2049.6 4.8 4.8 4.8 2.4 0 -2.4 -4.8 0 P
2971.2 2030.4 -4.8 -4.8 -2.4 -7.2 0 -2.4 2.4 -7.2 12 -4.8 16.8 0 9.6 -2.4 
2.4 -2.4 P
2964 2016 2.4 -4.8 12 -2.4 16.8 0 9.6 -4.8 2.4 -4.8 0 -4.8 -2.4 -7.2 
-9.6 -2.4 -21.6 0 -9.6 2.4 -4.8 7.2 0 4.8 4.8 4.8 9.6 4.8 S
3064.8 2049.6 2.4 7.2 0 -14.4 -2.4 7.2 -4.8 4.8 -7.2 2.4 -14.4 0 -4.8 -2.4 
-4.8 -4.8 0 -7.2 4.8 -2.4 4.8 -4.8 19.2 -4.8 7.2 -4.8 2.4 -2.4 P
3028.8 2047.2 4.8 -4.8 4.8 -2.4 19.2 -7.2 7.2 -2.4 2.4 -4.8 0 -9.6 -2.4 -4.8 
-7.2 -2.4 -14.4 0 -7.2 2.4 -2.4 4.8 -4.8 7.2 0 -14.4 4.8 7.2 P
3151.2 2056.8 0 -72 P
3153.6 2056.8 0 -72 P
3153.6 2047.2 7.2 7.2 7.2 2.4 7.2 0 9.6 -2.4 7.2 -7.2 2.4 -12 0 -4.8 
-2.4 -12 -7.2 -7.2 -9.6 -2.4 -7.2 0 -7.2 2.4 -7.2 7.2 P
3175.2 2056.8 7.2 -2.4 7.2 -7.2 2.4 -12 0 -4.8 -2.4 -12 -7.2 -7.2 -7.2 -2.4 P
3139.2 2056.8 14.4 0 P
3139.2 1984.8 24 0 P
3237.6 2080.8 0 -72 P
3240 2080.8 0 -72 P
3216 2080.8 -2.4 -19.2 0 19.2 50.4 0 ^ -2.4 19.2 P
3225.6 2008.8 26.4 0 P
1190.4 2299.2 4154.4 0 0 1245.6 ^ H
1190.4 2299.2 0 21.6 P
1190.4 2340 0 21.6 P
1190.4 2383.2 0 19.2 P
1190.4 2424 0 21.6 P
1190.4 2464.8 0 21.6 P
1190.4 2505.6 0 21.6 P
1190.4 2548.8 0 19.2 P
1190.4 2589.6 0 21.6 P
1190.4 2630.4 0 21.6 P
1190.4 2673.6 0 19.2 P
1190.4 2714.4 0 21.6 P
1190.4 2755.2 0 21.6 P
1190.4 2798.4 0 19.2 P
1190.4 2839.2 0 21.6 P
1190.4 2880 0 21.6 P
1190.4 2920.8 0 21.6 P
1197.6 2956.8 21.6 0 P
1240.8 2956.8 19.2 0 P
1281.6 2956.8 21.6 0 P
1322.4 2956.8 21.6 0 P
1358.4 2949.6 0 -19.2 P
1375.2 2928 21.6 0 P
1418.4 2928 19.2 0 P
1459.2 2928 21.6 0 P
1500 2928 21.6 0 P
1531.2 2916 21.6 0 S
1572 2916 21.6 0 P
1615.2 2916 19.2 0 P
1656 2916 19.2 0 P
1689.6 2908.8 0 -21.6 P
1694.4 2872.8 21.6 0 P
1737.6 2872.8 19.2 0 P
1778.4 2872.8 21.6 0 P
1819.2 2872.8 21.6 0 P
1855.2 2877.6 0 9.6 12 0 P
1888.8 2887.2 21.6 0 P
1929.6 2887.2 21.6 0 P
1972.8 2887.2 19.2 0 P
2013.6 2887.2 7.2 0 0 12 P
2035.2 2906.4 21.6 0 P
2076 2906.4 21.6 0 P
2119.2 2906.4 19.2 0 P
2160 2906.4 19.2 0 P
2191.2 2916 21.6 0 P
2232 2916 21.6 0 P
2275.2 2916 19.2 0 P
2316 2916 21.6 0 P
2354.4 2913.6 0 -16.8 4.8 0 P
2380.8 2896.8 19.2 0 P
2421.6 2896.8 21.6 0 P
2462.4 2896.8 21.6 0 P
2505.6 2896.8 14.4 0 0 4.8 P
2520 2923.2 0 21.6 P
2520 2964 0 12 9.6 0 P
2551.2 2976 19.2 0 P
2592 2976 19.2 0 P
2632.8 2976 21.6 0 P
2673.6 2976 12 0 0 9.6 P
2695.2 2997.6 19.2 0 P
2736 2997.6 21.6 0 P
2776.8 2997.6 21.6 0 P
2820 2997.6 19.2 0 P
2853.6 2990.4 0 -21.6 P
2853.6 2949.6 0 -14.4 4.8 0 P
2880 2935.2 21.6 0 P
2920.8 2935.2 21.6 0 P
2964 2935.2 19.2 0 P
3004.8 2935.2 14.4 0 0 -7.2 P
3019.2 2906.4 0 -4.8 14.4 0 P
3052.8 2901.6 21.6 0 P
3096 2901.6 19.2 0 P
3136.8 2901.6 21.6 0 P
3177.6 2901.6 7.2 0 0 14.4 P
3184.8 2935.2 0 4.8 16.8 0 P
3220.8 2940 21.6 0 P
3264 2940 19.2 0 P
3304.8 2940 19.2 0 P
3345.6 2940 4.8 0 0 -16.8 P
3350.4 2904 0 -21.6 P
3357.6 2868 19.2 0 P
3398.4 2868 21.6 0 P
3439.2 2868 21.6 0 P
3482.4 2868 19.2 0 P
3516 2875.2 0 19.2 S
3516 2916 0 21.6 P
3516 2956.8 0 21.6 P
3516 3000 0 19.2 2.4 0 P
3537.6 3019.2 21.6 0 P
3580.8 3019.2 19.2 0 P
3621.6 3019.2 19.2 0 P
3662.4 3019.2 19.2 0 P
3696 3012 21.6 0 P
3739.2 3012 19.2 0 P
3780 3012 21.6 0 P
3820.8 3012 21.6 0 P
3849.6 2997.6 0 -21.6 P
3849.6 2956.8 0 -21.6 P
3849.6 2913.6 0 -19.2 P
3849.6 2872.8 0 -19.2 P
3849.6 2832 0 -21.6 P
3849.6 2791.2 0 -21.6 P
3859.2 2757.6 19.2 0 P
3900 2757.6 21.6 0 P
3940.8 2757.6 21.6 0 P
3984 2757.6 19.2 0 P
4015.2 2767.2 0 16.8 4.8 0 P
4041.6 2784 21.6 0 P
4082.4 2784 21.6 0 P
4125.6 2784 19.2 0 P
4166.4 2784 14.4 0 0 4.8 P
4180.8 2810.4 0 19.2 P
4185.6 2846.4 21.6 0 P
4226.4 2846.4 21.6 0 P
4269.6 2846.4 19.2 0 P
4310.4 2846.4 21.6 0 P
4346.4 2851.2 0 21.6 P
4346.4 2892 0 21.6 P
4346.4 2935.2 0 14.4 7.2 0 P
4372.8 2949.6 21.6 0 P
4413.6 2949.6 21.6 0 P
4456.8 2949.6 19.2 0 P
4497.6 2949.6 16.8 0 0 4.8 P
4514.4 2976 0 21.6 P
4514.4 3016.8 0 21.6 P
4514.4 3060 0 19.2 P
4514.4 3100.8 0 19.2 P
4514.4 3141.6 0 19.2 2.4 0 P
4536 3160.8 21.6 0 P
4579.2 3160.8 19.2 0 P
4620 3160.8 21.6 0 P
4660.8 3160.8 19.2 0 0 -4.8 P
4680 3136.8 0 -21.6 P
4680 3093.6 0 -19.2 P
4680 3052.8 0 -21.6 P
4680 3012 0 -21.6 P
4680 2971.2 0 -21.6 P
4680 2928 0 -19.2 P
4687.2 2896.8 21.6 0 P
4730.4 2896.8 19.2 0 P
4771.2 2896.8 21.6 0 P
4812 2896.8 21.6 0 P
4845.6 2904 0 21.6 P
4845.6 2947.2 0 19.2 P
4845.6 2988 21.6 0 P
4888.8 2988 19.2 0 S
4929.6 2988 21.6 0 P
4970.4 2988 21.6 0 P
5011.2 2988 0 21.6 P
5011.2 3028.8 0 21.6 P
5032.8 3050.4 21.6 0 P
5073.6 3050.4 21.6 0 P
5114.4 3050.4 21.6 0 P
5157.6 3050.4 19.2 0 P
5176.8 3072 0 19.2 P
5176.8 3112.8 0 21.6 P
5176.8 3153.6 0 21.6 P
5176.8 3196.8 0 19.2 S
5198.4 3216 21.6 0 P
5239.2 3216 21.6 0 P
5282.4 3216 19.2 0 P
5323.2 3216 19.2 0 P
5342.4 3194.4 0 -19.2 P
5342.4 3153.6 0 -21.6 P
5342.4 3112.8 0 -21.6 P
5342.4 3069.6 0 -19.2 P
5342.4 3028.8 0 -21.6 P
5342.4 2988 0 -21.6 P
5342.4 2944.8 0 -19.2 P
5342.4 2904 0 -21.6 P
5342.4 2863.2 0 -21.6 P
5342.4 2822.4 0 -21.6 P
5342.4 2779.2 0 -19.2 P
5342.4 2738.4 0 -21.6 P
5342.4 2697.6 0 -21.6 P
5342.4 2654.4 0 -19.2 P
5342.4 2613.6 0 -21.6 P
5342.4 2572.8 0 -21.6 P
5342.4 2529.6 0 -19.2 P
5342.4 2488.8 0 -21.6 P
5342.4 2448 0 -21.6 P
5342.4 2407.2 0 -21.6 P
5342.4 2364 0 -19.2 P
5342.4 2323.2 0 -21.6 P
1190.4 2299.2 0 124.8 P
1399.2 2340 0 -40.8 P
1605.6 2299.2 0 40.8 P
1814.4 2340 0 -40.8 P
2020.8 2299.2 0 40.8 P
2229.6 2424 0 -124.8 P
2436 2299.2 0 40.8 P
2644.8 2340 0 -40.8 P
2853.6 2299.2 0 40.8 P
3060 2340 0 -40.8 P
3266.4 2299.2 0 124.8 P
3475.2 2340 0 -40.8 P
3681.6 2299.2 0 40.8 P
3890.4 2340 0 -40.8 P
4099.2 2299.2 0 40.8 P
4305.6 2424 0 -124.8 P
4514.4 2299.2 0 40.8 P
4720.8 2340 0 -40.8 P
4929.6 2299.2 0 40.8 P
5136 2340 0 -40.8 P
5344.8 2299.2 0 124.8 P
1188 2229.6 -9.6 -2.4 -7.2 -9.6 -4.8 -19.2 0 -9.6 4.8 -16.8 7.2 -9.6 9.6 -4.8 
7.2 0 9.6 4.8 7.2 9.6 4.8 16.8 0 9.6 -4.8 19.2 -7.2 9.6 -9.6 2.4 
-7.2 0 -7.2 -2.4 -2.4 -2.4 -4.8 -7.2 -2.4 -19.2 0 -9.6 2.4 -16.8 4.8 -7.2 
2.4 -2.4 7.2 -4.8 P
1195.2 2157.6 7.2 4.8 2.4 2.4 4.8 7.2 2.4 16.8 0 9.6 -2.4 19.2 -4.8 7.2 
-2.4 2.4 -7.2 2.4 S
2145.6 2217.6 7.2 2.4 12 9.6 0 -72 P
2160 2227.2 0 -69.6 P
2145.6 2157.6 31.2 0 P
2227.2 2229.6 -12 -2.4 -7.2 -9.6 -2.4 -19.2 0 -9.6 2.4 -16.8 7.2 -9.6 12 -4.8 
4.8 0 12 4.8 7.2 9.6 2.4 16.8 0 9.6 -2.4 19.2 -7.2 9.6 -12 2.4 
-4.8 0 -7.2 -2.4 -4.8 -2.4 -2.4 -7.2 -4.8 -19.2 0 -9.6 4.8 -16.8 2.4 -7.2 
4.8 -2.4 7.2 -4.8 P
2232 2157.6 7.2 4.8 4.8 2.4 2.4 7.2 4.8 16.8 0 9.6 -4.8 19.2 -2.4 7.2 
-4.8 2.4 -7.2 2.4 P
2294.4 2229.6 -9.6 -2.4 -7.2 -9.6 -2.4 -19.2 0 -9.6 2.4 -16.8 7.2 -9.6 9.6 -4.8 
7.2 0 12 4.8 7.2 9.6 2.4 16.8 0 9.6 -2.4 19.2 -7.2 9.6 -12 2.4 
-7.2 0 -9.6 -4.8 -2.4 -7.2 -4.8 -19.2 0 -9.6 4.8 -16.8 2.4 -7.2 4.8 -2.4 
4.8 -4.8 P
2301.6 2157.6 7.2 4.8 4.8 2.4 2.4 7.2 4.8 16.8 0 9.6 -4.8 19.2 -2.4 7.2 
-4.8 2.4 -7.2 2.4 P
3177.6 2217.6 2.4 -4.8 -2.4 -2.4 -2.4 2.4 0 4.8 2.4 7.2 2.4 2.4 12 2.4 
14.4 0 9.6 -2.4 2.4 -2.4 4.8 -7.2 0 -7.2 -4.8 -7.2 -9.6 -7.2 -16.8 -7.2 
-7.2 -2.4 -7.2 -7.2 -2.4 -12 0 -9.6 P
3206.4 2229.6 9.6 -4.8 2.4 -7.2 0 -7.2 -2.4 -7.2 -9.6 -7.2 -14.4 -7.2 P
3175.2 2164.8 2.4 2.4 7.2 0 16.8 -4.8 9.6 0 7.2 2.4 4.8 2.4 P
3184.8 2167.2 16.8 -9.6 14.4 0 2.4 4.8 4.8 4.8 0 7.2 P
3264 2229.6 -9.6 -2.4 -7.2 -9.6 -4.8 -19.2 0 -9.6 4.8 -16.8 7.2 -9.6 9.6 -4.8 
7.2 0 9.6 4.8 7.2 9.6 4.8 16.8 0 9.6 -4.8 19.2 -7.2 9.6 -9.6 2.4 
-7.2 0 S
3264 2229.6 -7.2 -2.4 -2.4 -2.4 -4.8 -7.2 -2.4 -19.2 0 -9.6 2.4 -16.8 4.8 -7.2 
2.4 -2.4 7.2 -4.8 P
3271.2 2157.6 7.2 4.8 2.4 2.4 4.8 7.2 2.4 16.8 0 9.6 -2.4 19.2 -4.8 7.2 
-2.4 2.4 -7.2 2.4 P
3333.6 2229.6 -9.6 -2.4 -7.2 -9.6 -4.8 -19.2 0 -9.6 4.8 -16.8 7.2 -9.6 9.6 -4.8 
7.2 0 9.6 4.8 7.2 9.6 4.8 16.8 0 9.6 -4.8 19.2 -7.2 9.6 -9.6 2.4 
-7.2 0 -7.2 -2.4 -2.4 -2.4 -4.8 -7.2 -2.4 -19.2 0 -9.6 2.4 -16.8 4.8 -7.2 
2.4 -2.4 7.2 -4.8 P
3340.8 2157.6 7.2 4.8 2.4 2.4 4.8 7.2 2.4 16.8 0 9.6 -2.4 19.2 -4.8 7.2 
-2.4 2.4 -7.2 2.4 P
4216.8 2217.6 2.4 -4.8 -2.4 -2.4 -4.8 2.4 0 4.8 4.8 7.2 2.4 2.4 9.6 2.4 
14.4 0 9.6 -2.4 4.8 -7.2 0 -9.6 -4.8 -7.2 -9.6 -4.8 -9.6 0 P
4243.2 2229.6 7.2 -2.4 2.4 -7.2 0 -9.6 -2.4 -7.2 -7.2 -4.8 7.2 -2.4 7.2 -7.2 
2.4 -7.2 0 -9.6 -2.4 -7.2 -14.4 -7.2 -14.4 0 -9.6 4.8 -2.4 2.4 -4.8 7.2 
0 2.4 4.8 4.8 2.4 -4.8 -2.4 -2.4 P
4252.8 2193.6 4.8 -12 0 -9.6 -4.8 -7.2 -2.4 -2.4 -7.2 -4.8 P
4303.2 2229.6 -12 -2.4 -7.2 -9.6 -2.4 -19.2 0 -9.6 2.4 -16.8 7.2 -9.6 12 -4.8 
4.8 0 12 4.8 7.2 9.6 2.4 16.8 0 9.6 -2.4 19.2 -7.2 9.6 -12 2.4 
-4.8 0 -7.2 -2.4 -4.8 -2.4 -2.4 -7.2 -4.8 -19.2 0 -9.6 4.8 -16.8 2.4 -7.2 
4.8 -2.4 7.2 -4.8 P
4308 2157.6 7.2 4.8 4.8 2.4 2.4 7.2 4.8 16.8 0 9.6 -4.8 19.2 -2.4 7.2 
-4.8 2.4 -7.2 2.4 S
4370.4 2229.6 -9.6 -2.4 -7.2 -9.6 -2.4 -19.2 0 -9.6 2.4 -16.8 7.2 -9.6 9.6 -4.8 
7.2 0 12 4.8 7.2 9.6 2.4 16.8 0 9.6 -2.4 19.2 -7.2 9.6 -12 2.4 
-7.2 0 -9.6 -4.8 -2.4 -7.2 -4.8 -19.2 0 -9.6 4.8 -16.8 2.4 -7.2 4.8 -2.4 
4.8 -4.8 P
4377.6 2157.6 7.2 4.8 4.8 2.4 2.4 7.2 4.8 16.8 0 9.6 -4.8 19.2 -2.4 7.2 
-4.8 2.4 -7.2 2.4 P
5282.4 2224.8 0 -67.2 P
5284.8 2229.6 0 -72 P
5284.8 2229.6 -38.4 -50.4 55.2 0 P
5270.4 2157.6 24 0 P
5340 2229.6 -9.6 -2.4 -7.2 -9.6 -4.8 -19.2 0 -9.6 4.8 -16.8 7.2 -9.6 9.6 -4.8 
7.2 0 9.6 4.8 7.2 9.6 4.8 16.8 0 9.6 -4.8 19.2 -7.2 9.6 -9.6 2.4 
-7.2 0 -7.2 -2.4 -2.4 -2.4 -4.8 -7.2 -2.4 -19.2 0 -9.6 2.4 -16.8 4.8 -7.2 
2.4 -2.4 7.2 -4.8 P
5347.2 2157.6 7.2 4.8 2.4 2.4 4.8 7.2 2.4 16.8 0 9.6 -2.4 19.2 -4.8 7.2 
-2.4 2.4 -7.2 2.4 P
5409.6 2229.6 -9.6 -2.4 -7.2 -9.6 -4.8 -19.2 0 -9.6 4.8 -16.8 7.2 -9.6 9.6 -4.8 
7.2 0 9.6 4.8 7.2 9.6 4.8 16.8 0 9.6 -4.8 19.2 -7.2 9.6 -9.6 2.4 
-7.2 0 -7.2 -2.4 -2.4 -2.4 -4.8 -7.2 -2.4 -19.2 0 -9.6 2.4 -16.8 4.8 -7.2 
2.4 -2.4 7.2 -4.8 P
5416.8 2157.6 7.2 4.8 2.4 2.4 4.8 7.2 2.4 16.8 0 9.6 -2.4 19.2 -4.8 7.2 
-2.4 2.4 -7.2 2.4 P
1190.4 3420 0 124.8 P
1399.2 3544.8 0 -40.8 P
1605.6 3504 0 40.8 P
1814.4 3544.8 0 -40.8 P
2020.8 3504 0 40.8 P
2229.6 3544.8 0 -124.8 S
2436 3504 0 40.8 P
2644.8 3544.8 0 -40.8 P
2853.6 3504 0 40.8 P
3060 3544.8 0 -40.8 P
3266.4 3420 0 124.8 P
3475.2 3544.8 0 -40.8 P
3681.6 3504 0 40.8 P
3890.4 3544.8 0 -40.8 P
4099.2 3504 0 40.8 P
4305.6 3544.8 0 -124.8 P
4514.4 3504 0 40.8 P
4720.8 3544.8 0 -40.8 P
4929.6 3504 0 40.8 P
5136 3544.8 0 -40.8 P
5344.8 3420 0 124.8 P
1190.4 2299.2 124.8 0 P
1233.6 2335.2 -43.2 0 P
1190.4 2368.8 43.2 0 P
1233.6 2400 -43.2 0 P
1190.4 2433.6 43.2 0 P
1315.2 2462.4 -124.8 0 P
1190.4 2493.6 43.2 0 P
1233.6 2520 -43.2 0 P
1190.4 2548.8 43.2 0 P
1233.6 2575.2 -43.2 0 P
1190.4 2601.6 124.8 0 P
1233.6 2628 -43.2 0 P
1190.4 2652 43.2 0 P
1233.6 2676 -43.2 0 P
1190.4 2697.6 43.2 0 P
1315.2 2721.6 -124.8 0 P
1190.4 2743.2 43.2 0 P
1233.6 2764.8 -43.2 0 P
1190.4 2786.4 43.2 0 P
1233.6 2808 -43.2 0 P
1190.4 2827.2 124.8 0 P
1233.6 2846.4 -43.2 0 P
1190.4 2865.6 43.2 0 P
1233.6 2884.8 -43.2 0 P
1190.4 2904 43.2 0 P
1315.2 2920.8 -124.8 0 P
1190.4 3086.4 43.2 0 P
1233.6 3223.2 -43.2 0 P
1190.4 3343.2 43.2 0 P
1233.6 3451.2 -43.2 0 P
1190.4 3544.8 124.8 0 P
1008 2330.4 -9.6 -2.4 -7.2 -12 -4.8 -16.8 0 -9.6 4.8 -19.2 7.2 -9.6 9.6 -2.4 
7.2 0 9.6 2.4 7.2 9.6 4.8 19.2 0 9.6 -4.8 16.8 -7.2 12 -9.6 2.4 
-7.2 0 -7.2 -2.4 -2.4 -4.8 -4.8 -7.2 -2.4 -16.8 0 -9.6 2.4 -19.2 4.8 -4.8 
2.4 -4.8 7.2 -2.4 P
1015.2 2258.4 7.2 2.4 2.4 4.8 4.8 4.8 2.4 19.2 0 9.6 -2.4 16.8 -4.8 7.2 
-2.4 4.8 -7.2 2.4 S
1063.2 2265.6 -2.4 -4.8 2.4 -2.4 4.8 2.4 -4.8 4.8 P
1099.2 2330.4 -7.2 -33.6 7.2 4.8 9.6 4.8 9.6 0 12 -4.8 7.2 -4.8 2.4 -12 
0 -7.2 -2.4 -9.6 -7.2 -7.2 -12 -2.4 -9.6 0 -9.6 2.4 -4.8 4.8 -2.4 4.8 
0 4.8 2.4 2.4 4.8 -2.4 -4.8 -4.8 P
1118.4 2306.4 14.4 -9.6 4.8 -12 0 -7.2 -4.8 -9.6 -7.2 -7.2 -7.2 -2.4 P
1099.2 2330.4 33.6 0 P
1099.2 2328 16.8 0 16.8 2.4 P
1008 2632.8 -9.6 -2.4 -7.2 -12 -4.8 -16.8 0 -9.6 4.8 -19.2 7.2 -9.6 9.6 -2.4 
7.2 0 9.6 2.4 7.2 9.6 4.8 19.2 0 9.6 -4.8 16.8 -7.2 12 -9.6 2.4 
-7.2 0 -7.2 -2.4 -2.4 -4.8 -4.8 -7.2 -2.4 -16.8 0 -9.6 2.4 -19.2 4.8 -4.8 
2.4 -4.8 7.2 -2.4 P
1015.2 2560.8 7.2 2.4 2.4 4.8 4.8 4.8 2.4 19.2 0 9.6 -2.4 16.8 -4.8 7.2 
-2.4 4.8 -7.2 2.4 P
1063.2 2568 -2.4 -4.8 2.4 -2.4 4.8 2.4 -4.8 4.8 P
1092 2632.8 0 -21.6 P
1092 2618.4 2.4 7.2 7.2 7.2 7.2 0 16.8 -9.6 7.2 0 4.8 2.4 2.4 7.2 P
1094.4 2625.6 7.2 4.8 7.2 0 16.8 -7.2 P
1140 2632.8 0 -9.6 -2.4 -12 -14.4 -16.8 -4.8 -7.2 -2.4 -9.6 0 -16.8 P
1137.6 2611.2 -19.2 -16.8 -2.4 -7.2 -4.8 -9.6 0 -16.8 P
998.4 2940 7.2 2.4 9.6 9.6 0 -72 P
1012.8 2949.6 0 -69.6 P
998.4 2880 31.2 0 P
1063.2 2887.2 -2.4 -2.4 2.4 -4.8 4.8 4.8 -4.8 2.4 P
1111.2 2952 -9.6 -2.4 -7.2 -9.6 -2.4 -16.8 0 -12 2.4 -16.8 7.2 -9.6 9.6 -4.8 
7.2 0 12 4.8 7.2 9.6 2.4 16.8 0 12 -2.4 16.8 -7.2 9.6 -12 2.4 
-7.2 0 S
1111.2 2952 -9.6 -4.8 -2.4 -7.2 -4.8 -16.8 0 -12 4.8 -16.8 2.4 -7.2 4.8 -2.4 
4.8 -4.8 P
1118.4 2880 7.2 4.8 4.8 2.4 2.4 7.2 4.8 16.8 0 12 -4.8 16.8 -2.4 7.2 
-4.8 2.4 -7.2 2.4 P
991.2 3561.6 2.4 -2.4 -2.4 -4.8 -4.8 4.8 0 2.4 4.8 7.2 2.4 4.8 12 2.4 
12 0 12 -2.4 2.4 -4.8 4.8 -7.2 0 -7.2 -4.8 -7.2 -9.6 -4.8 -16.8 -7.2 
-7.2 -4.8 -7.2 -7.2 -4.8 -9.6 0 -9.6 P
1017.6 3576 7.2 -2.4 4.8 -4.8 2.4 -7.2 0 -7.2 -2.4 -7.2 -12 -4.8 -12 -7.2 P
986.4 3511.2 4.8 2.4 7.2 0 16.8 -7.2 9.6 0 7.2 4.8 4.8 2.4 P
998.4 3513.6 16.8 -9.6 14.4 0 2.4 2.4 4.8 7.2 0 7.2 P
1063.2 3511.2 -2.4 -4.8 2.4 -2.4 4.8 2.4 -4.8 4.8 P
1111.2 3576 -9.6 -2.4 -7.2 -12 -2.4 -16.8 0 -9.6 2.4 -19.2 7.2 -9.6 9.6 -2.4 
7.2 0 12 2.4 7.2 9.6 2.4 19.2 0 9.6 -2.4 16.8 -7.2 12 -12 2.4 
-7.2 0 -4.8 -2.4 -4.8 -4.8 -2.4 -7.2 -4.8 -16.8 0 -9.6 4.8 -19.2 2.4 -4.8 
4.8 -4.8 4.8 -2.4 P
1118.4 3504 7.2 2.4 4.8 4.8 2.4 4.8 4.8 19.2 0 9.6 -4.8 16.8 -2.4 7.2 
-4.8 4.8 -7.2 2.4 P
5220 2299.2 124.8 0 P
5344.8 2335.2 -43.2 0 P
5301.6 2368.8 43.2 0 P
5344.8 2400 -43.2 0 P
5301.6 2433.6 43.2 0 P
5344.8 2462.4 -124.8 0 P
5301.6 2493.6 43.2 0 P
5344.8 2520 -43.2 0 P
5301.6 2548.8 43.2 0 P
5344.8 2575.2 -43.2 0 P
5220 2601.6 124.8 0 P
5344.8 2628 -43.2 0 P
5301.6 2652 43.2 0 P
5344.8 2676 -43.2 0 S
5301.6 2697.6 43.2 0 P
5344.8 2721.6 -124.8 0 P
5301.6 2743.2 43.2 0 P
5344.8 2764.8 -43.2 0 P
5301.6 2786.4 43.2 0 P
5344.8 2808 -43.2 0 P
5220 2827.2 124.8 0 P
5344.8 2846.4 -43.2 0 P
5301.6 2865.6 43.2 0 P
5344.8 2884.8 -43.2 0 P
5301.6 2904 43.2 0 P
5344.8 2920.8 -124.8 0 S
5301.6 3086.4 43.2 0 P
5344.8 3223.2 -43.2 0 P
5301.6 3343.2 43.2 0 P
5344.8 3451.2 -43.2 0 P
5220 3544.8 124.8 0 S
255 0 r3
1190.4 2299.2 0 21.6 P
1190.4 2340 0 21.6 P
1190.4 2383.2 0 19.2 P
1190.4 2424 0 21.6 P
1190.4 2464.8 0 21.6 P
1190.4 2505.6 0 21.6 P
1190.4 2548.8 0 19.2 P
1190.4 2589.6 0 21.6 P
1190.4 2630.4 0 21.6 P
1190.4 2673.6 0 19.2 P
1190.4 2714.4 0 21.6 P
1190.4 2755.2 0 21.6 P
1190.4 2798.4 0 19.2 P
1190.4 2839.2 0 21.6 P
1190.4 2880 0 21.6 P
1190.4 2920.8 0 21.6 P
1190.4 2964 0 19.2 P
1190.4 3004.8 0 21.6 P
1190.4 3045.6 0 14.4 7.2 0 P
1219.2 3060 21.6 0 P
1260 3060 21.6 0 P
1303.2 3060 19.2 0 P
1344 3060 14.4 0 0 -7.2 P
1358.4 3033.6 0 -21.6 P
1358.4 2992.8 0 -21.6 P
1358.4 2949.6 0 -14.4 4.8 0 P
1384.8 2935.2 19.2 0 P
1425.6 2935.2 21.6 0 P
1466.4 2935.2 21.6 0 P
1509.6 2935.2 14.4 0 0 4.8 P
1524 2961.6 0 21.6 P
1524 3002.4 0 7.2 14.4 0 P
1560 3009.6 19.2 0 P
1600.8 3009.6 19.2 0 P
1641.6 3009.6 21.6 0 P
1682.4 3009.6 7.2 0 0 -14.4 P
1689.6 2973.6 0 -19.2 P
1689.6 2932.8 0 -7.2 14.4 0 P
1725.6 2925.6 19.2 0 P
1766.4 2925.6 19.2 0 P
1807.2 2925.6 21.6 0 P
1848 2925.6 7.2 0 0 14.4 P
1867.2 2949.6 21.6 0 P
1910.4 2949.6 19.2 0 P
1951.2 2949.6 19.2 0 P
1992 2949.6 21.6 0 P
2032.8 2949.6 21.6 0 P
2073.6 2949.6 21.6 0 P
2116.8 2949.6 19.2 0 P
2157.6 2949.6 19.2 0 P
2191.2 2942.4 21.6 0 P
2232 2942.4 21.6 0 P
2275.2 2942.4 19.2 0 P
2316 2942.4 19.2 0 P
2354.4 2944.8 0 21.6 P
2354.4 2985.6 0 19.2 2.4 0 P
2378.4 3004.8 19.2 0 P
2419.2 3004.8 19.2 0 P
2460 3004.8 21.6 0 P
2500.8 3004.8 19.2 0 0 -2.4 S
2539.2 3000 19.2 0 P
2580 3000 19.2 0 P
2620.8 3000 21.6 0 P
2661.6 3000 21.6 0 P
2685.6 2980.8 0 -19.2 P
2688 2940 19.2 0 P
2728.8 2940 21.6 0 P
2769.6 2940 21.6 0 P
2812.8 2940 19.2 0 P
2853.6 2942.4 0 19.2 P
2853.6 2983.2 0 19.2 P
2875.2 3002.4 19.2 0 P
2916 3002.4 21.6 0 P
2956.8 3002.4 21.6 0 P
3000 3002.4 19.2 0 P
3019.2 2980.8 0 -19.2 P
3019.2 2940 0 -21.6 P
3033.6 2913.6 21.6 0 P
3076.8 2913.6 19.2 0 P
3117.6 2913.6 21.6 0 P
3158.4 2913.6 21.6 0 P
3184.8 2930.4 0 21.6 P
3184.8 2971.2 0 21.6 P
3184.8 3014.4 0 19.2 P
3184.8 3055.2 0 19.2 P
3192 3088.8 21.6 0 P
3235.2 3088.8 19.2 0 P
3276 3088.8 21.6 0 P
3316.8 3088.8 21.6 0 P
3350.4 3079.2 0 -19.2 P
3350.4 3038.4 0 -4.8 16.8 0 P
3388.8 3033.6 19.2 0 P
3429.6 3033.6 19.2 0 P
3470.4 3033.6 21.6 0 P
3511.2 3033.6 4.8 0 0 16.8 P
3516 3072 0 19.2 P
3516 3112.8 21.6 0 P
3556.8 3112.8 21.6 0 P
3597.6 3112.8 21.6 0 P
3640.8 3112.8 19.2 0 P
3681.6 3112.8 0 -19.2 P
3681.6 3072 0 -19.2 P
3681.6 3031.2 0 -21.6 P
3684 2990.4 21.6 0 P
3724.8 2990.4 21.6 0 P
3768 2990.4 19.2 0 P
3808.8 2990.4 21.6 0 P
3849.6 2992.8 0 19.2 P
3849.6 3033.6 0 7.2 12 0 P
3883.2 3040.8 19.2 0 P
3924 3040.8 21.6 0 P
3964.8 3040.8 21.6 0 P
4008 3040.8 7.2 0 0 14.4 P
4015.2 3074.4 0 21.6 P
4015.2 3117.6 0 19.2 P
4015.2 3158.4 0 21.6 P
4015.2 3199.2 0 21.6 P
4015.2 3242.4 0 19.2 P
4015.2 3283.2 0 21.6 P
4015.2 3324 0 21.6 P
4015.2 3367.2 0 12 7.2 0 P
4044 3379.2 19.2 0 S
4084.8 3379.2 21.6 0 P
4125.6 3379.2 21.6 0 P
4168.8 3379.2 12 0 0 -7.2 P
4180.8 3350.4 0 -19.2 P
4180.8 3309.6 0 -21.6 P
4180.8 3268.8 0 -21.6 P
4180.8 3225.6 0 -19.2 P
4180.8 3184.8 0 -21.6 P
4180.8 3144 0 -21.6 P
4180.8 3103.2 0 -21.6 P
4180.8 3060 0 -19.2 P
4180.8 3019.2 0 -21.6 P
4180.8 2978.4 0 -21.6 P
4180.8 2935.2 0 -19.2 P
4180.8 2894.4 0 -21.6 P
4180.8 2853.6 0 -21.6 P
4180.8 2810.4 0 -19.2 P
4180.8 2769.6 0 -19.2 2.4 0 P
4202.4 2750.4 21.6 0 P
4245.6 2750.4 19.2 0 P
4286.4 2750.4 21.6 0 P
4327.2 2750.4 19.2 0 P
4346.4 2772 0 21.6 P
4346.4 2812.8 0 21.6 P
4346.4 2856 0 19.2 P
4346.4 2896.8 0 21.6 P
4346.4 2937.6 0 21.6 P
4346.4 2980.8 0 19.2 P
4346.4 3021.6 0 2.4 19.2 0 P
4387.2 3024 21.6 0 P
4428 3024 21.6 0 P
4471.2 3024 19.2 0 P
4512 3024 2.4 0 0 19.2 P
4514.4 3062.4 0 21.6 P
4514.4 3105.6 0 19.2 P
4514.4 3146.4 0 19.2 P
4514.4 3187.2 0 21.6 P
4514.4 3228 0 21.6 P
4514.4 3271.2 0 19.2 P
4514.4 3312 0 21.6 P
4514.4 3352.8 0 21.6 P
4514.4 3396 0 16.8 2.4 0 P
4536 3412.8 21.6 0 P
4579.2 3412.8 19.2 0 P
4620 3412.8 21.6 0 P
4660.8 3412.8 19.2 0 P
4701.6 3412.8 21.6 0 P
4742.4 3412.8 21.6 0 P
4785.6 3412.8 19.2 0 P
4826.4 3412.8 19.2 0 0 -2.4 P
4845.6 3388.8 0 -21.6 P
4845.6 3348 0 -21.6 P
4845.6 3304.8 0 -19.2 P
4845.6 3264 0 -19.2 P
4845.6 3223.2 0 -21.6 P
4845.6 3182.4 0 -21.6 P
4845.6 3139.2 0 -19.2 P
4845.6 3098.4 0 -21.6 P
4845.6 3057.6 0 -21.6 P
4845.6 3014.4 0 -19.2 P
4845.6 2973.6 0 -21.6 S
4845.6 2932.8 0 -21.6 P
4845.6 2889.6 0 -19.2 P
4845.6 2848.8 0 -19.2 P
4845.6 2808 0 -21.6 P
4845.6 2767.2 0 -21.6 P
4845.6 2724 0 -19.2 P
4845.6 2683.2 0 -21.6 P
4845.6 2642.4 0 -21.6 P
4845.6 2601.6 21.6 0 P
4888.8 2601.6 19.2 0 P
4929.6 2601.6 19.2 0 P
4970.4 2601.6 21.6 0 P
5011.2 2601.6 0 21.6 P
5011.2 2642.4 0 21.6 P
5011.2 2685.6 0 19.2 P
5013.6 2724 19.2 0 S
5054.4 2724 21.6 0 P
5095.2 2724 21.6 0 P
5136 2724 21.6 0 P
5176.8 2724 0 -21.6 P
5176.8 2683.2 0 -21.6 P
5176.8 2640 0 -19.2 P
5176.8 2599.2 0 -21.6 P
5176.8 2558.4 0 -21.6 P
5176.8 2515.2 0 -2.4 16.8 0 P
5215.2 2512.8 19.2 0 P
5256 2512.8 21.6 0 P
5296.8 2512.8 21.6 0 P
5340 2512.8 2.4 0 0 -16.8 P
5342.4 2474.4 0 -19.2 P
5342.4 2433.6 0 -21.6 P
5342.4 2392.8 0 -21.6 P
5342.4 2349.6 0 -19.2 P
5342.4 2308.8 0 -9.6 S
cleartomark end end pagesave restore
 showpage
%%PageTrailer
%%Trailer
%%Pages: 1
%%Trailer
cleartomark
countdictstack
exch sub { end } repeat
restore
%%EOF
