%!PS-Adobe-2.0 EPSF-2.0
%%BoundingBox:  0 0 567 544
%%Title: /afs/cern.ch/user/r/rdinardo/MC_generators/analysis/pTstudy/pT_v1_b_ratio.eps: c1
%%Creator: ROOT Version 5.34/05
%%CreationDate: Sun Apr  7 11:05:59 2013
%%EndComments
%%BeginProlog
80 dict begin
/s {stroke} def /l {lineto} def /m {moveto} def /t {translate} def
/r {rotate} def /rl {roll}  def /R {repeat} def
/d {rlineto} def /rm {rmoveto} def /gr {grestore} def /f {eofill} def
/c {setrgbcolor} def /black {0 setgray} def /sd {setdash} def
/cl {closepath} def /sf {scalefont setfont} def /lw {setlinewidth} def
/box {m dup 0 exch d exch 0 d 0 exch neg d cl} def
/NC{systemdict begin initclip end}def/C{NC box clip newpath}def
/bl {box s} def /bf {box f} def /Y { 0 exch d} def /X { 0 d} def 
/K {{pop pop 0 moveto} exch kshow} bind def
/ita {/ang 15 def gsave [1 0 ang dup sin exch cos div 1 0 0] concat} def 
/mp {newpath /y exch def /x exch def} def
/side {[w .77 mul w .23 mul] .385 w mul sd w 0 l currentpoint t -144 r} def
/mr {mp x y w2 0 360 arc} def /m24 {mr s} def /m20 {mr f} def
/mb {mp x y w2 add m w2 neg 0 d 0 w neg d w 0 d 0 w d cl} def
/mt {mp x y w2 add m w2 neg w neg d w 0 d cl} def
/m21 {mb f} def /m25 {mb s} def /m22 {mt f} def /m26{mt s} def
/m23 {mp x y w2 sub m w2 w d w neg 0 d cl f} def
/m27 {mp x y w2 add m w3 neg w2 neg d w3 w2 neg d w3 w2 d cl s} def
/m28 {mp x w2 sub y w2 sub w3 add m w3 0 d  0 w3 neg d w3 0 d 0 w3 d w3 0 d  0 w3 d w3 neg 0 d 0 w3 d w3 neg 0 d 0 w3 neg d w3 neg 0 d cl s } def
/m29 {mp gsave x w2 sub y w2 add w3 sub m currentpoint t 4 {side} repeat cl fill gr} def
/m30 {mp gsave x w2 sub y w2 add w3 sub m currentpoint t 4 {side} repeat cl s gr} def
/m31 {mp x y w2 sub m 0 w d x w2 sub y m w 0 d x w2 sub y w2 add m w w neg d x w2 sub y w2 sub m w w d s} def
/m32 {mp x y w2 sub m w2 w d w neg 0 d cl s} def
/m33 {mp x y w2 add m w3 neg w2 neg d w3 w2 neg d w3 w2 d cl f} def
/m34 {mp x w2 sub y w2 sub w3 add m w3 0 d  0 w3 neg d w3 0 d 0 w3 d w3 0 d  0 w3 d w3 neg 0 d 0 w3 d w3 neg 0 d 0 w3 neg d w3 neg 0 d cl f } def
/m2 {mp x y w2 sub m 0 w d x w2 sub y m w 0 d s} def
/m5 {mp x w2 sub y w2 sub m w w d x w2 sub y w2 add m w w neg d s} def
/reEncode {exch findfont dup length dict begin {1 index /FID eq  {pop pop} {def} ifelse } forall /Encoding exch def currentdict end dup /FontName get exch definefont pop } def [/Times-Bold /Times-Italic /Times-BoldItalic /Helvetica /Helvetica-Oblique
 /Helvetica-Bold /Helvetica-BoldOblique /Courier /Courier-Oblique /Courier-Bold /Courier-BoldOblique /Times-Roman /AvantGarde-Book /AvantGarde-BookOblique /AvantGarde-Demi /AvantGarde-DemiOblique /Bookman-Demi /Bookman-DemiItalic /Bookman-Light
 /Bookman-LightItalic /Helvetica-Narrow /Helvetica-Narrow-Bold /Helvetica-Narrow-BoldOblique /Helvetica-Narrow-Oblique /NewCenturySchlbk-Roman /NewCenturySchlbk-Bold /NewCenturySchlbk-BoldItalic /NewCenturySchlbk-Italic /Palatino-Bold
 /Palatino-BoldItalic /Palatino-Italic /Palatino-Roman ] {ISOLatin1Encoding reEncode } forall
%%EndProlog
%%BeginSetup
%%EndSetup
newpath  gsave  .25 .25 scale  gsave  0 0 t black[  ] 0 sd 3 lw 1 1 1 c 2268 2176 0 0 bf black 1 1 1 c 2222 1393 23 762 bf black 1 1 1 c 1756 1323 378 762 bf black 1756 1323 378 762 bl 1 1 1 c 1756 1323 378 762 bf black 1756 1323 378 762 bl 6 lw 1 1
 1 c black 378 776 m 43 X 167 Y 43 X 156 Y 43 X 145 Y 43 X 78 Y 42 X 136 Y 43 X 25 Y 43 X 14 Y 43 X 78 Y 43 X 32 Y 42 X 5 Y 43 X -34 Y 43 X 70 Y 43 X -35 Y 43 X -36 Y 43 X -15 Y 42 X -8 Y 43 X -25 Y 43 X -8 Y 43 X -43 Y 43 X -26 Y 42 X -27 Y 43 X -31
 Y 43 X -25 Y 43 X -17 Y 43 X 15 Y 43 X -17 Y 42 X -63 Y 43 X 22 Y 43 X -62 Y 43 X -7 Y 43 X 5 Y 43 X -45 Y 42 X -31 Y 43 X 13 Y 43 X -9 Y 43 X -1 Y 43 X -32 Y 42 X -51 Y 43 X 25 Y 43 X -4 Y 43 X s 3 lw 378 762 m 1756 X s
 gsave  2222 1393 23 762 C 1951.91 601.173 t 0 r /Helvetica findfont 64.6973 sf 0 0 m ( [GeV]) show NC gr 
 gsave  2222 1393 23 762 C 1925.28 563.124 t 0 r /Helvetica findfont 41.863 sf 0 0 m (T) show NC gr 
 gsave  2222 1393 23 762 C 1891.03 601.173 t 0 r /Helvetica findfont 64.6973 sf 0 0 m (p) show NC gr  400 795 m -33 Y s 442 778 m -16 Y s 485 778 m -16 Y s 528 778 m -16 Y s 571 778 m -16 Y s 614 795 m -33 Y s 657 778 m -16 Y s 699 778 m -16 Y s 742
 778 m -16 Y s 785 778 m -16 Y s 828 795 m -33 Y s 871 778 m -16 Y s 914 778 m -16 Y s 956 778 m -16 Y s 999 778 m -16 Y s 1042 795 m -33 Y s 1085 778 m -16 Y s 1128 778 m -16 Y s 1170 778 m -16 Y s 1213 778 m -16 Y s 1256 795 m -33 Y s 1299 778 m
 -16 Y s 1342 778 m -16 Y s 1385 778 m -16 Y s 1427 778 m -16 Y s 1470 795 m -33 Y s 1513 778 m -16 Y s 1556 778 m -16 Y s 1599 778 m -16 Y s 1641 778 m -16 Y s 1684 795 m -33 Y s 1727 778 m -16 Y s 1770 778 m -16 Y s 1813 778 m -16 Y s 1856 778 m
 -16 Y s 1898 795 m -33 Y s 1941 778 m -16 Y s 1984 778 m -16 Y s 2027 778 m -16 Y s 2070 778 m -16 Y s 2113 795 m -33 Y s 400 795 m -33 Y s 2113 795 m -33 Y s
 gsave  2268 2176 0 0 C 2199.23 1613.27 t 90 r /Helvetica-BoldOblique findfont 41.8538 sf 0 0 m (LHC HIGGS XS WG 2013) show NC gr  0.2 0.2 0.2 c black 0.2 0.2 0.2 c
 gsave  2222 1393 23 762 C 380.489 700.1 t 0 r /Helvetica findfont 64.6973 sf 0 0 m (0) show NC gr 
 gsave  2222 1393 23 762 C 593.563 700.1 t 0 r /Helvetica findfont 64.6973 sf 0 0 m (5) show NC gr 
 gsave  2222 1393 23 762 C 787.613 700.1 t 0 r /Helvetica findfont 64.6973 sf 0 0 m (10) show NC gr 
 gsave  2222 1393 23 762 C 1000.69 700.1 t 0 r /Helvetica findfont 64.6973 sf 0 0 m (15) show NC gr 
 gsave  2222 1393 23 762 C 1217.57 700.1 t 0 r /Helvetica findfont 64.6973 sf 0 0 m (20) show NC gr 
 gsave  2222 1393 23 762 C 1430.64 700.1 t 0 r /Helvetica findfont 64.6973 sf 0 0 m (25) show NC gr 
 gsave  2222 1393 23 762 C 1643.71 700.1 t 0 r /Helvetica findfont 64.6973 sf 0 0 m (30) show NC gr 
 gsave  2222 1393 23 762 C 1856.79 700.1 t 0 r /Helvetica findfont 64.6973 sf 0 0 m (35) show NC gr 
 gsave  2222 1393 23 762 C 2073.67 700.1 t 0 r /Helvetica findfont 64.6973 sf 0 0 m (40) show NC gr  378 2085 m 1756 X s 400 2052 m 33 Y s 442 2068 m 17 Y s 485 2068 m 17 Y s 528 2068 m 17 Y s 571 2068 m 17 Y s 614 2052 m 33 Y s 657 2068 m 17 Y s 699
 2068 m 17 Y s 742 2068 m 17 Y s 785 2068 m 17 Y s 828 2052 m 33 Y s 871 2068 m 17 Y s 914 2068 m 17 Y s 956 2068 m 17 Y s 999 2068 m 17 Y s 1042 2052 m 33 Y s 1085 2068 m 17 Y s 1128 2068 m 17 Y s 1170 2068 m 17 Y s 1213 2068 m 17 Y s 1256 2052 m 33
 Y s 1299 2068 m 17 Y s 1342 2068 m 17 Y s 1385 2068 m 17 Y s 1427 2068 m 17 Y s 1470 2052 m 33 Y s 1513 2068 m 17 Y s 1556 2068 m 17 Y s 1599 2068 m 17 Y s 1641 2068 m 17 Y s 1684 2052 m 33 Y s 1727 2068 m 17 Y s 1770 2068 m 17 Y s 1813 2068 m 17 Y
 s 1856 2068 m 17 Y s 1898 2052 m 33 Y s 1941 2068 m 17 Y s 1984 2068 m 17 Y s 2027 2068 m 17 Y s 2070 2068 m 17 Y s 2113 2052 m 33 Y s 400 2052 m 33 Y s 2113 2052 m 33 Y s 378 762 m 1323 Y s 442 924 m -64 X s 410 957 m -32 X s 410 991 m -32 X s 410
 1024 m -32 X s 410 1057 m -32 X s 442 1090 m -64 X s 410 1123 m -32 X s 410 1156 m -32 X s 410 1190 m -32 X s 410 1223 m -32 X s 442 1256 m -64 X s 410 1289 m -32 X s 410 1322 m -32 X s 410 1355 m -32 X s 410 1389 m -32 X s 442 1422 m -64 X s 410
 1455 m -32 X s 410 1488 m -32 X s 410 1521 m -32 X s 410 1554 m -32 X s 442 1588 m -64 X s 410 1621 m -32 X s 410 1654 m -32 X s 410 1687 m -32 X s 410 1720 m -32 X s 442 1753 m -64 X s 410 1787 m -32 X s 410 1820 m -32 X s 410 1853 m -32 X s 410
 1886 m -32 X s 442 1919 m -64 X s 410 1952 m -32 X s 410 1985 m -32 X s 410 2019 m -32 X s 410 2052 m -32 X s 442 2085 m -64 X s 442 924 m -64 X s 410 891 m -32 X s 410 858 m -32 X s 410 825 m -32 X s 410 792 m -32 X s
 gsave  2222 1393 23 762 C 205.464 897.955 t 0 r /Helvetica findfont 64.6973 sf 0 0 m (0.005) show NC gr 
 gsave  2222 1393 23 762 C 251.123 1065.37 t 0 r /Helvetica findfont 64.6973 sf 0 0 m (0.01) show NC gr 
 gsave  2222 1393 23 762 C 205.464 1232.79 t 0 r /Helvetica findfont 64.6973 sf 0 0 m (0.015) show NC gr 
 gsave  2222 1393 23 762 C 239.708 1396.4 t 0 r /Helvetica findfont 64.6973 sf 0 0 m (0.02) show NC gr 
 gsave  2222 1393 23 762 C 205.464 1563.81 t 0 r /Helvetica findfont 64.6973 sf 0 0 m (0.025) show NC gr 
 gsave  2222 1393 23 762 C 239.708 1727.42 t 0 r /Helvetica findfont 64.6973 sf 0 0 m (0.03) show NC gr 
 gsave  2222 1393 23 762 C 205.464 1894.84 t 0 r /Helvetica findfont 64.6973 sf 0 0 m (0.035) show NC gr 
 gsave  2222 1393 23 762 C 239.708 2058.45 t 0 r /Helvetica findfont 64.6973 sf 0 0 m (0.04) show NC gr  2134 762 m 1323 Y s 2071 924 m 63 X s 2102 957 m 32 X s 2102 991 m 32 X s 2102 1024 m 32 X s 2102 1057 m 32 X s 2071 1090 m 63 X s 2102 1123 m 32
 X s 2102 1156 m 32 X s 2102 1190 m 32 X s 2102 1223 m 32 X s 2071 1256 m 63 X s 2102 1289 m 32 X s 2102 1322 m 32 X s 2102 1355 m 32 X s 2102 1389 m 32 X s 2071 1422 m 63 X s 2102 1455 m 32 X s 2102 1488 m 32 X s 2102 1521 m 32 X s 2102 1554 m 32 X
 s 2071 1588 m 63 X s 2102 1621 m 32 X s 2102 1654 m 32 X s 2102 1687 m 32 X s 2102 1720 m 32 X s 2071 1753 m 63 X s 2102 1787 m 32 X s 2102 1820 m 32 X s 2102 1853 m 32 X s 2102 1886 m 32 X s 2071 1919 m 63 X s 2102 1952 m 32 X s 2102 1985 m 32 X s
 2102 2019 m 32 X s 2102 2052 m 32 X s 2071 2085 m 63 X s 2071 924 m 63 X s 2102 891 m 32 X s 2102 858 m 32 X s 2102 825 m 32 X s 2102 792 m 32 X s 1 0 0 c 6 lw 1 1 1 c 1 0 0 c 378 778 m 43 X 143 Y 43 X 160 Y 43 X 150 Y 43 X 142 Y 42 X 52 Y 43 X 72 Y
 43 X 49 Y 43 X 21 Y 43 X 14 Y 42 X -20 Y 43 X 64 Y 43 X -58 Y 43 X 2 Y 43 X -32 Y 43 X -36 Y 42 X -10 Y 43 X -17 Y 43 X -22 Y 43 X -14 Y 43 X -12 Y 42 X -10 Y 43 X -53 Y 43 X -21 Y 43 X -20 Y 43 X -24 Y 43 X -13 Y 42 X -29 Y 43 X -1 Y 43 X -14 Y 43
 X -34 Y 43 X -4 Y 43 X -30 Y 42 X 6 Y 43 X -14 Y 43 X -35 Y 43 X 4 Y 43 X -14 Y 42 X -6 Y 43 X -10 Y 43 X -11 Y 43 X s 0 0 1 c 1 1 1 c 0 0 1 c 378 774 m 43 X 104 Y 43 X 107 Y 43 X 115 Y 43 X 114 Y 42 X 65 Y 43 X 79 Y 43 X 87 Y 43 X -8 Y 43 X 55 Y 42
 X 14 Y 43 X -6 Y 43 X -28 Y 43 X 46 Y 43 X -38 Y 43 X -8 Y 42 X 12 Y 43 X -34 Y 43 X -26 Y 43 X 2 Y 43 X -59 Y 42 X 8 Y 43 X -5 Y 43 X -10 Y 43 X -35 Y 43 X -6 Y 43 X -20 Y 42 X -48 Y 43 X 3 Y 43 X -11 Y 43 X -19 Y 43 X 20 Y 43 X -30 Y 42 X -13 Y 43
 X -29 Y 43 X 5 Y 43 X -13 Y 43 X -18 Y 42 X -14 Y 43 X -9 Y 43 X -18 Y 43 X s 1 0 1 c 1 1 1 c 1 0 1 c 378 771 m 43 X 118 Y 43 X 129 Y 43 X 134 Y 43 X 107 Y 42 X 87 Y 43 X 83 Y 43 X 5 Y 43 X 17 Y 43 X 12 Y 42 X 46 Y 43 X 5 Y 43 X -35 Y 43 X -30 Y 43
 X 12 Y 43 X -37 Y 42 X -18 Y 43 X 1 Y 43 X -24 Y 43 X -31 Y 43 X -5 Y 42 X 4 Y 43 X -34 Y 43 X -18 Y 43 X -31 Y 43 X -26 Y 43 X 14 Y 42 X -38 Y 43 X -15 Y 43 X 9 Y 43 X -27 Y 43 X 19 Y 43 X -38 Y 42 X -8 Y 43 X -13 Y 43 X -19 Y 43 X 7 Y 43 X -11 Y
 42 X -26 Y 43 X -2 Y 43 X -6 Y 43 X s 0 1 0 c 1 1 1 c 0 1 0 c 378 772 m 43 X 130 Y 43 X 140 Y 43 X 171 Y 43 X 103 Y 42 X 100 Y 43 X 41 Y 43 X 50 Y 43 X 28 Y 43 X -4 Y 42 X 17 Y 43 X -24 Y 43 X -9 Y 43 X -43 Y 43 X 20 Y 43 X -25 Y 42 X -38 Y 43 X -27
 Y 43 X 1 Y 43 X -11 Y 43 X -37 Y 42 X -8 Y 43 X -36 Y 43 X -20 Y 43 X -15 Y 43 X -21 Y 43 X -13 Y 42 X -17 Y 43 X -20 Y 43 X -9 Y 43 X -44 Y 43 X 8 Y 43 X -16 Y 42 X 6 Y 43 X -14 Y 43 X -38 Y 43 X 11 Y 43 X -27 Y 42 X 4 Y 43 X -9 Y 43 X 4 Y 43 X s
 black 3 lw 1 1 1 c 841 293 1134 1697 bf black
 gsave  2222 1393 23 762 C 1343.13 1948.11 t 0 r /Helvetica-Bold findfont 45.6687 sf 0 0 m (MC@NLO) show NC gr  1 1 1 c 1165 1940 m 148 X 41 Y -148 X f black 6 lw 1165 1961 m 148 X s 3 lw /w 36 def /w2 {w 2 div} def /w3 {w 3 div} def 1239 1961 m20 6
 lw
 gsave  2222 1393 23 762 C 1343.13 1887.23 t 0 r /Helvetica-Bold findfont 45.6687 sf 0 0 m (POWHEGJimmy with hfact) show NC gr  1 1 1 c 3 lw 1165 1882 m 148 X 41 Y -148 X f 6 lw 1 0 0 c 1165 1902 m 148 X s 3 lw 1239 1902 m20 6 lw black
 gsave  2222 1393 23 762 C 1343.13 1830.15 t 0 r /Helvetica-Bold findfont 45.6687 sf 0 0 m (POWHEGPythia with hfact) show NC gr  1 1 1 c 3 lw 1165 1823 m 148 X 41 Y -148 X f 6 lw 0 0 1 c 1165 1843 m 148 X s 3 lw 1239 1843 m20 6 lw black
 gsave  2222 1393 23 762 C 1343.13 1773.08 t 0 r /Helvetica-Bold findfont 45.6687 sf 0 0 m (POWHEGJimmy no hfact) show NC gr  1 1 1 c 3 lw 1165 1764 m 148 X 41 Y -148 X f 6 lw 1 0 1 c 1165 1785 m 148 X s 3 lw 1239 1785 m20 6 lw black
 gsave  2222 1393 23 762 C 1343.13 1712.2 t 0 r /Helvetica-Bold findfont 45.6687 sf 0 0 m (POWHEGJimmy no q mass) show NC gr  1 1 1 c 3 lw 1165 1706 m 148 X 41 Y -148 X f 6 lw 0 1 0 c 1165 1726 m 148 X s 3 lw 1239 1726 m20 6 lw black 3 lw 1 1 1 c
 2222 740 23 22 bf black 1 1 1 c 1756 555 378 207 bf black 1756 555 378 207 bl 1 1 1 c 1756 555 378 207 bf black 1756 555 378 207 bl 6 lw 1 1 1 c black 378 421 m 1756 X s 3 lw 378 207 m 1756 X s
 gsave  2222 740 23 22 C 1959.52 72.293 t 0 r /Helvetica findfont 61.0289 sf 0 0 m ( [GeV]) show NC gr 
 gsave  2222 740 23 22 C 1932.89 38.0489 t 0 r /Helvetica findfont 41.9574 sf 0 0 m (T) show NC gr 
 gsave  2222 740 23 22 C 1898.64 72.293 t 0 r /Helvetica findfont 61.0289 sf 0 0 m (p) show NC gr  400 224 m -17 Y s 442 216 m -9 Y s 485 216 m -9 Y s 528 216 m -9 Y s 571 216 m -9 Y s 614 224 m -17 Y s 657 216 m -9 Y s 699 216 m -9 Y s 742 216 m -9
 Y s 785 216 m -9 Y s 828 224 m -17 Y s 871 216 m -9 Y s 914 216 m -9 Y s 956 216 m -9 Y s 999 216 m -9 Y s 1042 224 m -17 Y s 1085 216 m -9 Y s 1128 216 m -9 Y s 1170 216 m -9 Y s 1213 216 m -9 Y s 1256 224 m -17 Y s 1299 216 m -9 Y s 1342 216 m -9
 Y s 1385 216 m -9 Y s 1427 216 m -9 Y s 1470 224 m -17 Y s 1513 216 m -9 Y s 1556 216 m -9 Y s 1599 216 m -9 Y s 1641 216 m -9 Y s 1684 224 m -17 Y s 1727 216 m -9 Y s 1770 216 m -9 Y s 1813 216 m -9 Y s 1856 216 m -9 Y s 1898 224 m -17 Y s 1941 216
 m -9 Y s 1984 216 m -9 Y s 2027 216 m -9 Y s 2070 216 m -9 Y s 2113 224 m -17 Y s 400 224 m -17 Y s 2113 224 m -17 Y s
 gsave  2222 740 23 22 C 380.489 152.196 t 0 r /Helvetica findfont 61.0289 sf 0 0 m (0) show NC gr 
 gsave  2222 740 23 22 C 593.563 152.196 t 0 r /Helvetica findfont 61.0289 sf 0 0 m (5) show NC gr 
 gsave  2222 740 23 22 C 791.418 152.196 t 0 r /Helvetica findfont 61.0289 sf 0 0 m (10) show NC gr 
 gsave  2222 740 23 22 C 1004.49 152.196 t 0 r /Helvetica findfont 61.0289 sf 0 0 m (15) show NC gr 
 gsave  2222 740 23 22 C 1221.37 152.196 t 0 r /Helvetica findfont 61.0289 sf 0 0 m (20) show NC gr 
 gsave  2222 740 23 22 C 1434.44 152.196 t 0 r /Helvetica findfont 61.0289 sf 0 0 m (25) show NC gr 
 gsave  2222 740 23 22 C 1647.52 152.196 t 0 r /Helvetica findfont 61.0289 sf 0 0 m (30) show NC gr 
 gsave  2222 740 23 22 C 1860.59 152.196 t 0 r /Helvetica findfont 61.0289 sf 0 0 m (35) show NC gr 
 gsave  2222 740 23 22 C 2077.47 152.196 t 0 r /Helvetica findfont 61.0289 sf 0 0 m (40) show NC gr  378 762 m 1756 X s 400 744 m 18 Y s 442 753 m 9 Y s 485 753 m 9 Y s 528 753 m 9 Y s 571 753 m 9 Y s 614 744 m 18 Y s 657 753 m 9 Y s 699 753 m 9 Y s
 742 753 m 9 Y s 785 753 m 9 Y s 828 744 m 18 Y s 871 753 m 9 Y s 914 753 m 9 Y s 956 753 m 9 Y s 999 753 m 9 Y s 1042 744 m 18 Y s 1085 753 m 9 Y s 1128 753 m 9 Y s 1170 753 m 9 Y s 1213 753 m 9 Y s 1256 744 m 18 Y s 1299 753 m 9 Y s 1342 753 m 9 Y
 s 1385 753 m 9 Y s 1427 753 m 9 Y s 1470 744 m 18 Y s 1513 753 m 9 Y s 1556 753 m 9 Y s 1599 753 m 9 Y s 1641 753 m 9 Y s 1684 744 m 18 Y s 1727 753 m 9 Y s 1770 753 m 9 Y s 1813 753 m 9 Y s 1856 753 m 9 Y s 1898 744 m 18 Y s 1941 753 m 9 Y s 1984
 753 m 9 Y s 2027 753 m 9 Y s 2070 753 m 9 Y s 2113 744 m 18 Y s 400 744 m 18 Y s 2113 744 m 18 Y s 378 207 m 555 Y s
 gsave  2222 740 23 22 C 175.025 418.538 t 90 r /Helvetica findfont 61.0289 sf 0 0 m (Ratio) show NC gr  428 246 m -50 X s 403 268 m -25 X s 403 290 m -25 X s 403 312 m -25 X s 428 333 m -50 X s 403 355 m -25 X s 403 377 m -25 X s 403 399 m -25 X s
 428 421 m -50 X s 403 443 m -25 X s 403 465 m -25 X s 403 486 m -25 X s 428 508 m -50 X s 403 530 m -25 X s 403 552 m -25 X s 403 574 m -25 X s 428 596 m -50 X s 403 618 m -25 X s 403 639 m -25 X s 403 661 m -25 X s 428 683 m -50 X s 428 246 m -50 X
 s 403 224 m -25 X s 428 683 m -50 X s 403 705 m -25 X s 403 727 m -25 X s 403 749 m -25 X s
 gsave  2222 740 23 22 C 281.562 224.489 t 0 r /Helvetica findfont 61.0289 sf 0 0 m (0.6) show NC gr 
 gsave  2222 740 23 22 C 281.562 312.001 t 0 r /Helvetica findfont 61.0289 sf 0 0 m (0.8) show NC gr 
 gsave  2222 740 23 22 C 342.44 395.709 t 0 r /Helvetica findfont 61.0289 sf 0 0 m (1) show NC gr 
 gsave  2222 740 23 22 C 281.562 483.221 t 0 r /Helvetica findfont 61.0289 sf 0 0 m (1.2) show NC gr 
 gsave  2222 740 23 22 C 281.562 570.734 t 0 r /Helvetica findfont 61.0289 sf 0 0 m (1.4) show NC gr 
 gsave  2222 740 23 22 C 281.562 662.052 t 0 r /Helvetica findfont 61.0289 sf 0 0 m (1.6) show NC gr  2134 207 m 555 Y s 2084 246 m 50 X s 2109 268 m 25 X s 2109 290 m 25 X s 2109 312 m 25 X s 2084 333 m 50 X s 2109 355 m 25 X s 2109 377 m 25 X s
 2109 399 m 25 X s 2084 421 m 50 X s 2109 443 m 25 X s 2109 465 m 25 X s 2109 486 m 25 X s 2084 508 m 50 X s 2109 530 m 25 X s 2109 552 m 25 X s 2109 574 m 25 X s 2084 596 m 50 X s 2109 618 m 25 X s 2109 639 m 25 X s 2109 661 m 25 X s 2084 683 m 50 X
 s 2084 246 m 50 X s 2109 224 m 25 X s 2084 683 m 50 X s 2109 705 m 25 X s 2109 727 m 25 X s 2109 749 m 25 X s 1 0 0 c 6 lw 3 lw /w 2 def /w2 {w 2 div} def /w3 {w 3 div} def 400 463 m20 6 lw 3 lw 442 369 m20 6 lw 3 lw 485 398 m20 6 lw 3 lw 528 410
 m20 6 lw 3 lw 571 460 m20 6 lw 3 lw 614 400 m20 6 lw 3 lw 657 429 m20 6 lw 3 lw 699 450 m20 6 lw 3 lw 742 416 m20 6 lw 3 lw 785 407 m20 6 lw 3 lw 828 395 m20 6 lw 3 lw 871 446 m20 6 lw 3 lw 914 381 m20 6 lw 3 lw 956 398 m20 6 lw 3 lw 999 400 m20 6
 lw 3 lw 1042 388 m20 6 lw 3 lw 1085 386 m20 6 lw 3 lw 1128 390 m20 6 lw 3 lw 1170 382 m20 6 lw 3 lw 1213 397 m20 6 lw 3 lw 1256 404 m20 6 lw 3 lw 1299 415 m20 6 lw 3 lw 1342 399 m20 6 lw 3 lw 1385 402 m20 6 lw 3 lw 1427 399 m20 6 lw 3 lw 1470 371
 m20 6 lw 3 lw 1513 373 m20 6 lw 3 lw 1556 396 m20 6 lw 3 lw 1599 378 m20 6 lw 3 lw 1641 415 m20 6 lw 3 lw 1684 391 m20 6 lw 3 lw 1727 383 m20 6 lw 3 lw 1770 395 m20 6 lw 3 lw 1813 431 m20 6 lw 3 lw 1856 403 m20 6 lw 3 lw 1898 376 m20 6 lw 3 lw 1941
 380 m20 6 lw 3 lw 1984 398 m20 6 lw 3 lw 2027 454 m20 6 lw 3 lw 2070 408 m20 6 lw 3 lw 2113 400 m20 6 lw black 3 lw 1 0 0 c 1 lw << /PatternType 1 /PaintType 2 /TilingType 1 /BBox [ 0 0 100 100 ] /XStep 96 /YStep 4 /PaintProc { begin gsave [1 3] 0
 sd 2 4 m 98 4 l s 0 3 m 96 3 l s 2 2 m 98 2 l s 0 1 m 96 1 l s gr end } >> [ 3.0 0 0 3.0 0 0 ] makepattern /P02 exch def /cs {[/Pattern /DeviceRGB] setcolorspace} def /FA {f [/DeviceRGB] setcolorspace} def cs 1 0 0 P02 setcolor 400 625 m -45 Y 1 -13
 d 1 -14 d 1 -13 d 2 -13 d 2 -13 d 2 -13 d 2 -12 d 2 -12 d 3 -11 d 3 -11 d 3 -11 d 3 -8 d 3 -8 d 3 -7 d 4 -7 d 3 -5 d 4 -4 d -1 Y 3 -2 d 3 -1 d 3 -1 d 3 1 d 4 2 d 4 3 d 8 7 d 7 6 d 4 4 d 4 1 d 43 6 d 3 2 d 4 4 d 4 6 d 6 9 d 8 13 d 4 6 d 3 4 d 4 3 d 2
 2 d 5 X 3 -1 d 2 -2 d 3 -3 d 3 -4 d 4 -7 d 4 -10 d 10 -20 d 3 -6 d 3 -5 d 3 -3 d 3 -3 d 2 -1 d 6 X 4 1 d 4 3 d 5 4 d 8 8 d 8 8 d 5 4 d 3 2 d 10 7 d 10 7 d 7 4 d 5 2 d 5 1 d 5 X 5 -2 d 4 -2 d 5 -4 d 7 -7 d 12 -13 d 5 -4 d 4 -3 d 1 -1 d 7 -2 d 8 -2 d
 12 -2 d 12 -2 d 4 -1 d 6 -2 d 11 -6 d 8 -4 d 6 -2 d 8 X 4 1 d 3 2 d 3 3 d 3 4 d 4 6 d 9 16 d 5 8 d 3 5 d 4 4 d 3 3 d 2 1 d 3 1 d 1 X 2 -1 d 3 -2 d 3 -3 d 3 -5 d 3 -6 d 5 -9 d 10 -24 d 4 -7 d 3 -4 d 3 -3 d 3 -3 d 1 X 3 -1 d 3 -1 d 5 1 d 4 2 d 7 4 d
 11 8 d 5 3 d 4 1 d 11 2 d 11 1 d 11 X 10 -1 d 8 -1 d 35 -11 d 12 -1 d 16 -1 d 15 X 11 1 d 20 3 d 9 1 d 3 -1 d 7 -1 d 14 -3 d 10 -3 d 6 -1 d 5 X 7 1 d 8 3 d 12 5 d 11 5 d 5 2 d 43 8 d 10 3 d 16 6 d 8 2 d 9 X 5 -1 d 7 -2 d 14 -6 d 8 -4 d 6 -2 d 3 -1 d
 16 X 21 3 d 6 X 22 1 d 9 -1 d 7 -1 d 4 -1 d 6 -3 d 6 -4 d 11 -9 d 9 -7 d 5 -4 d 5 -2 d 1 X 7 -2 d 15 X 9 1 d 12 3 d 5 2 d 6 4 d 10 7 d 9 6 d 4 3 d 5 1 d 4 1 d 4 X 39 -18 d 3 1 d 4 3 d 4 3 d 5 6 d 12 15 d 4 5 d 4 3 d 3 2 d 3 1 d 4 X 5 -1 d 5 -3 d 29
 -21 d 14 -5 d 10 -2 d 8 -1 d 8 -1 d 3 X 10 1 d 9 2 d 8 3 d 8 3 d 8 4 d 4 3 d 5 5 d 8 9 d 8 9 d 6 6 d 4 3 d 3 2 d 4 2 d 5 X 4 -2 d 5 -2 d 6 -5 d 24 -20 d 7 -6 d 20 -15 d 6 -4 d 5 -2 d 4 -2 d 7 -1 d 6 X 8 1 d 9 1 d 13 4 d 20 6 d 8 3 d 6 3 d 5 4 d 4 3
 d 3 4 d 4 5 d 4 7 d 10 17 d 5 10 d 4 6 d 3 4 d 3 3 d 3 2 d 3 1 d 1 1 d 43 -49 d 2 -1 d 3 X 4 1 d 4 3 d 6 6 d 8 7 d 3 2 d 3 1 d 2 X 2 -2 d 1 -1 d 1 -3 d 1 -3 d 1 -4 d 1 -5 d -6 Y 1 -3 d -38 Y -1 -7 d -1 -6 d -1 -4 d -1 -4 d -1 -3 d -1 -2 d -2 -1 d
 -35 35 d -43 44 d -3 -1 d -3 -2 d -4 -3 d -3 -4 d -5 -7 d -8 -12 d -6 -11 d -4 -5 d -3 -4 d -4 -4 d -7 -4 d -6 -3 d -7 -4 d -10 -2 d -13 -3 d -18 -5 d -8 -1 d -13 X -4 1 d -5 2 d -7 3 d -9 7 d -21 15 d -7 5 d -20 16 d -5 3 d -4 2 d -4 1 d -3 X -4 -1
 d -4 -2 d -5 -3 d -4 -5 d -9 -9 d -7 -8 d -6 -4 d -4 -3 d -8 -4 d -9 -3 d -10 -2 d -10 -1 d -6 -1 d -9 1 d -10 1 d -10 2 d -14 4 d -5 3 d -6 4 d -17 13 d -5 2 d -4 2 d -6 X -3 -1 d -4 -2 d -4 -3 d -5 -5 d -13 -15 d -4 -4 d -4 -3 d -3 -1 d -2 -1 d -8
 X -26 15 d -4 1 d -4 1 d -1 X -5 -1 d -5 -2 d -6 -3 d -11 -7 d -8 -5 d -5 -3 d -3 -1 d -11 -2 d -10 -1 d -15 X -7 2 d -5 2 d -7 4 d -12 9 d -9 6 d -5 4 d -5 2 d -6 1 d -9 2 d -27 X -11 -1 d -18 -2 d -14 X -6 2 d -9 3 d -17 8 d -5 2 d -6 1 d -7 X -7
 -2 d -10 -3 d -15 -4 d -4 -1 d -43 -8 d -7 -2 d -12 -5 d -11 -4 d -6 -2 d -7 -1 d -6 X -8 2 d -25 6 d -12 X -10 -1 d -19 -2 d -39 X -9 1 d -9 2 d -30 10 d -4 X -12 1 d -11 X -10 -1 d -10 -1 d -4 -2 d -6 -3 d -14 -9 d -6 -3 d -4 -1 d -4 X -3 1 d -1 1
 d -3 2 d -3 3 d -4 4 d -3 7 d -5 10 d -9 18 d -4 7 d -3 5 d -3 3 d -3 2 d -2 1 d -4 X -3 -1 d -3 -2 d -3 -4 d -4 -5 d -6 -11 d -8 -12 d -4 -6 d -3 -4 d -3 -3 d -3 -1 d -4 -2 d -4 X -6 1 d -7 3 d -19 9 d -3 1 d -10 2 d -17 2 d -8 1 d -7 3 d -1 X -5 3
 d -6 5 d -19 18 d -5 3 d -4 2 d -4 1 d -4 X -5 -1 d -6 -2 d -6 -3 d -21 -14 d -5 -3 d -6 -6 d -13 -12 d -5 -4 d -4 -3 d -4 -1 d -3 -1 d -3 1 d -3 1 d -3 2 d -3 4 d -4 5 d -4 8 d -11 20 d -3 6 d -4 4 d -3 3 d -2 1 d -3 1 d -3 X -3 -2 d -3 -2 d -4 -4
 d -4 -6 d -7 -11 d -8 -13 d -4 -5 d -3 -5 d -4 -3 d -5 -4 d -6 -3 d -7 -2 d -16 -4 d -5 -3 d -4 -2 d -7 -5 d -9 -7 d -22 -21 d -5 -4 d -20 -16 d -22 -17 d FA 6 lw 0 0 1 c 3 lw 400 381 m20 6 lw 3 lw 442 266 m20 6 lw 3 lw 485 275 m20 6 lw 3 lw 528 292
 m20 6 lw 3 lw 571 337 m20 6 lw 3 lw 614 309 m20 6 lw 3 lw 657 346 m20 6 lw 3 lw 699 390 m20 6 lw 3 lw 742 347 m20 6 lw 3 lw 785 362 m20 6 lw 3 lw 828 367 m20 6 lw 3 lw 871 379 m20 6 lw 3 lw 914 334 m20 6 lw 3 lw 956 372 m20 6 lw 3 lw 999 369 m20 6
 lw 3 lw 1042 372 m20 6 lw 3 lw 1085 382 m20 6 lw 3 lw 1128 376 m20 6 lw 3 lw 1170 366 m20 6 lw 3 lw 1213 389 m20 6 lw 3 lw 1256 368 m20 6 lw 3 lw 1299 388 m20 6 lw 3 lw 1342 404 m20 6 lw 3 lw 1385 415 m20 6 lw 3 lw 1427 401 m20 6 lw 3 lw 1470 386
 m20 6 lw 3 lw 1513 384 m20 6 lw 3 lw 1556 392 m20 6 lw 3 lw 1599 377 m20 6 lw 3 lw 1641 417 m20 6 lw 3 lw 1684 407 m20 6 lw 3 lw 1727 420 m20 6 lw 3 lw 1770 435 m20 6 lw 3 lw 1813 454 m20 6 lw 3 lw 1856 411 m20 6 lw 3 lw 1898 426 m20 6 lw 3 lw 1941
 412 m20 6 lw 3 lw 1984 428 m20 6 lw 3 lw 2027 478 m20 6 lw 3 lw 2070 432 m20 6 lw 3 lw 2113 415 m20 6 lw black 3 lw 0 0 1 c cs 0 0 1 P02 setcolor 400 516 m -1 -12 d -27 Y 1 -14 d -12 Y 1 -13 d 2 -12 d 1 -12 d 2 -12 d 1 -12 d 2 -11 d 3 -11 d 2 -11 d
 3 -10 d 3 -11 d 3 -9 d 4 -8 d 3 -7 d 3 -7 d 4 -5 d 3 -5 d 2 -3 d 3 -2 d 3 -2 d 4 -2 d 8 X 6 1 d 8 4 d 8 2 d 3 1 d 20 4 d 8 2 d 6 2 d 6 3 d 3 2 d 4 3 d 4 4 d 5 7 d 12 16 d 5 6 d 4 4 d 3 3 d 3 1 d 3 1 d 3 X 3 -1 d 3 -2 d 4 -3 d 5 -6 d 11 -12 d 4 -3 d
 3 -3 d 3 -1 d 7 X 4 2 d 4 3 d 6 4 d 6 6 d 10 11 d 7 8 d 3 3 d 4 4 d 5 7 d 13 19 d 5 5 d 4 4 d 3 4 d 3 1 d 3 1 d 5 X 3 -1 d 3 -3 d 4 -4 d 4 -5 d 8 -12 d 5 -8 d 4 -5 d 4 -3 d 2 -2 d 3 -2 d 8 X 4 1 d 6 2 d 9 5 d 8 4 d 6 3 d 2 X 9 2 d 34 3 d 5 2 d 8 4 d
 11 5 d 6 2 d 4 1 d 4 X 4 -1 d 1 X 3 -1 d 3 -3 d 4 -4 d 4 -6 d 15 -23 d 4 -4 d 3 -2 d 3 -2 d 3 -1 d 3 X 3 1 d 4 2 d 3 3 d 5 6 d 8 10 d 5 6 d 4 5 d 3 3 d 4 2 d 1 1 d 5 1 d 38 -4 d 16 X 14 1 d 13 2 d 7 2 d 12 3 d 12 4 d 7 1 d 20 X 12 -2 d 16 -4 d 7 -2
 d 22 -8 d 5 -1 d 5 X 3 1 d 4 1 d 5 2 d 5 3 d 9 8 d 6 4 d 5 3 d 4 2 d 3 1 d 6 X 4 -1 d 5 -3 d 7 -6 d 10 -7 d 4 -2 d 4 -2 d 4 -1 d 1 X 4 1 d 5 1 d 6 3 d 9 5 d 12 8 d 7 3 d 23 10 d 15 6 d 5 1 d 22 8 d 7 2 d 6 1 d 14 X 7 -2 d 29 -11 d 24 -10 d 12 -4 d 7
 -2 d 11 -1 d 12 -1 d 11 -1 d 9 1 d 7 1 d 10 3 d 12 3 d 7 2 d 7 X 4 -1 d 5 -2 d 6 -3 d 12 -7 d 5 -2 d 4 -1 d 4 X 3 1 d 3 1 d 3 2 d 4 4 d 5 6 d 8 10 d 6 8 d 4 4 d 4 3 d 3 2 d 2 1 d 4 1 d 4 X 5 -1 d 7 -2 d 13 -6 d 5 -2 d 5 X 7 1 d 7 1 d 8 4 d 19 7 d 2
 1 d 33 12 d 10 4 d 5 2 d 6 4 d 12 9 d 6 3 d 5 2 d 3 1 d 4 X 2 -1 d 3 -1 d 3 -2 d 37 -41 d 3 -1 d 4 X 4 1 d 5 2 d 8 5 d 8 5 d 4 2 d 4 1 d 2 X 5 -1 d 5 -1 d 6 -2 d 17 -8 d 4 -2 d 13 X 7 2 d 7 2 d 7 3 d 7 4 d 6 5 d 2 1 d 3 3 d 4 4 d 4 6 d 5 10 d 8 13 d
 4 6 d 4 5 d 3 3 d 3 2 d 3 1 d 2 1 d 3 -1 d 3 -1 d 3 -2 d 3 -4 d 31 -41 d 2 -2 d 7 X 4 1 d 12 6 d 4 2 d 5 X 2 -2 d 1 -1 d 2 -3 d 1 -2 d 1 -4 d -4 Y 1 -5 d 1 -4 d -39 Y -1 -5 d -1 -5 d -1 -4 d -1 -3 d -1 -2 d -2 -2 d -1 -1 d -2 1 d -3 1 d -2 2 d -28
 35 d -4 3 d -4 5 d -5 6 d -14 19 d -4 4 d -3 4 d -4 2 d -2 1 d -6 X -3 -2 d -3 -2 d -4 -4 d -4 -5 d -6 -9 d -8 -12 d -4 -5 d -3 -4 d -4 -3 d -1 -1 d -6 -4 d -8 -4 d -7 -3 d -7 -2 d -8 -1 d -7 -1 d -4 1 d -7 1 d -9 4 d -11 5 d -6 2 d -4 1 d -2 X -4
 -1 d -4 -1 d -8 -4 d -10 -6 d -5 -2 d -4 -1 d -7 X -4 2 d -3 2 d -4 4 d -5 6 d -15 19 d -4 4 d -3 3 d -3 1 d -2 1 d -4 1 d -4 -1 d -5 -1 d -6 -3 d -9 -6 d -9 -5 d -5 -3 d -1 X -15 -5 d -28 -8 d -11 -4 d -15 -6 d -8 -2 d -6 -1 d -3 -1 d -4 1 d -6 1 d
 -10 4 d -8 4 d -5 1 d -10 X -3 -2 d -4 -2 d -4 -4 d -5 -5 d -12 -14 d -4 -5 d -4 -3 d -3 -2 d -3 -1 d -4 -1 d -4 1 d -5 1 d -7 3 d -14 7 d -4 2 d -5 1 d -6 X -8 -1 d -11 -3 d -11 -3 d -7 X -14 -1 d -11 1 d -12 1 d -6 2 d -9 2 d -34 11 d -15 6 d -12
 5 d -8 2 d -6 1 d -8 X -8 -1 d -10 -3 d -18 -6 d -17 -5 d -20 -8 d -6 -2 d -7 -4 d -11 -6 d -8 -5 d -5 -3 d -5 -1 d -4 -1 d -7 X -4 2 d -5 3 d -9 7 d -8 5 d -4 2 d -4 2 d -9 X -4 -2 d -5 -3 d -8 -5 d -9 -7 d -5 -3 d -4 -2 d -4 -1 d -5 X -37 11 d -27
 5 d -8 1 d -8 X -8 -1 d -8 -2 d -20 -6 d -7 -1 d -15 -2 d -16 -1 d -12 X -6 1 d -12 2 d -9 2 d -10 X -5 -1 d -1 -1 d -3 -1 d -4 -3 d -4 -4 d -5 -6 d -9 -11 d -5 -5 d -4 -3 d -3 -2 d -3 -1 d -5 X -3 2 d -4 3 d -3 3 d -5 6 d -14 20 d -3 4 d -4 2 d -3
 2 d -1 1 d -4 1 d -4 X -5 -1 d -6 -2 d -9 -4 d -8 -4 d -6 -2 d -1 X -10 -1 d -28 -3 d -5 -1 d -5 -1 d -6 -3 d -14 -8 d -6 -2 d -4 -1 d -8 X -3 2 d -3 2 d -4 4 d -4 5 d -15 20 d -4 4 d -3 2 d -3 2 d -3 1 d -1 X -3 -1 d -3 -1 d -4 -3 d -3 -3 d -6 -6 d
 -6 -9 d -9 -12 d -5 -5 d -3 -4 d -7 -6 d -14 -16 d -6 -5 d -5 -4 d -4 -3 d -4 -1 d -3 -1 d -3 X -4 1 d -3 2 d -5 4 d -8 8 d -6 5 d -5 3 d -3 2 d -6 X -3 -1 d -4 -2 d -3 -3 d -5 -5 d -4 -5 d -12 -17 d -6 -7 d -3 -3 d -3 -3 d -7 -4 d -7 -4 d -29 -12 d
 -23 -11 d -9 -3 d -7 -2 d -4 -1 d -17 X -8 1 d -8 2 d -9 3 d FA 6 lw 1 0 1 c 3 lw 400 298 m20 6 lw 3 lw 442 293 m20 6 lw 3 lw 485 317 m20 6 lw 3 lw 528 339 m20 6 lw 3 lw 571 372 m20 6 lw 3 lw 614 351 m20 6 lw 3 lw 657 388 m20 6 lw 3 lw 699 383 m20 6
 lw 3 lw 742 354 m20 6 lw 3 lw 785 347 m20 6 lw 3 lw 828 368 m20 6 lw 3 lw 871 387 m20 6 lw 3 lw 914 338 m20 6 lw 3 lw 956 337 m20 6 lw 3 lw 999 359 m20 6 lw 3 lw 1042 346 m20 6 lw 3 lw 1085 340 m20 6 lw 3 lw 1128 352 m20 6 lw 3 lw 1170 342 m20 6 lw
 3 lw 1213 344 m20 6 lw 3 lw 1256 355 m20 6 lw 3 lw 1299 372 m20 6 lw 3 lw 1342 368 m20 6 lw 3 lw 1385 371 m20 6 lw 3 lw 1427 359 m20 6 lw 3 lw 1470 331 m20 6 lw 3 lw 1513 352 m20 6 lw 3 lw 1556 364 m20 6 lw 3 lw 1599 337 m20 6 lw 3 lw 1641 389 m20 6
 lw 3 lw 1684 371 m20 6 lw 3 lw 1727 384 m20 6 lw 3 lw 1770 387 m20 6 lw 3 lw 1813 409 m20 6 lw 3 lw 1856 382 m20 6 lw 3 lw 1898 372 m20 6 lw 3 lw 1941 380 m20 6 lw 3 lw 1984 400 m20 6 lw 3 lw 2027 431 m20 6 lw 3 lw 2070 396 m20 6 lw 3 lw 2113 393
 m20 6 lw black 3 lw 1 0 1 c cs 1 0 1 P02 setcolor 400 408 m 2 -9 d 2 -9 d 3 -9 d 2 -8 d 3 -8 d 3 -8 d 4 -8 d 3 -6 d 4 -5 d 4 -5 d 4 -5 d 4 -3 d 4 -3 d -1 Y 3 -1 d 3 -1 d 4 X 3 1 d 5 2 d 4 3 d 9 6 d 7 5 d 4 2 d 1 1 d 18 6 d 12 5 d 8 3 d 5 3 d 4 3 d 6
 4 d 10 10 d 7 7 d 5 4 d 4 2 d 3 1 d 4 1 d 3 X 3 -1 d 4 -2 d 4 -3 d 9 -8 d 6 -5 d 4 -3 d 4 -1 d 2 -1 d 4 X 3 1 d 3 1 d 3 3 d 5 4 d 5 7 d 10 11 d 4 5 d 4 3 d 3 2 d 3 1 d 5 1 d 5 1 d 5 X 7 -1 d 7 -1 d 9 -4 d 4 -1 d 5 -3 d 6 -3 d 7 -6 d 14 -12 d 6 -4 d
 4 -3 d 1 X 10 -4 d 8 -2 d 8 -2 d 17 X 5 1 d 6 3 d 8 4 d 19 11 d 5 3 d 5 3 d 12 8 d 6 4 d 5 2 d 5 2 d 10 X 3 -2 d 3 -2 d 3 -3 d 3 -4 d 5 -7 d 14 -21 d 3 -4 d 3 -4 d 3 -2 d 3 -2 d 4 -2 d 5 -1 d 5 -1 d 6 X 7 1 d 10 2 d 5 1 d 5 1 d 5 3 d 7 5 d 11 7 d 5
 3 d 4 2 d 4 1 d 2 1 d 5 X 38 -14 d 21 -5 d 8 -1 d 14 X 5 1 d 6 1 d 10 4 d 9 4 d 7 2 d 5 1 d 1 X 5 -1 d 6 -1 d 18 -6 d 8 -2 d 5 -1 d 20 X 14 2 d 9 1 d 15 3 d 13 3 d 15 5 d 7 3 d 11 6 d 11 5 d 7 3 d 5 1 d 2 X 43 -4 d 7 1 d 12 1 d 12 2 d 12 X 9 -2 d 9
 -2 d 9 -2 d 9 -4 d 6 -3 d 5 -3 d 6 -4 d 19 -16 d 4 -3 d 4 -2 d 3 -1 d 6 X 4 1 d 4 2 d 6 3 d 9 6 d 8 6 d 5 3 d 3 1 d 13 6 d 9 5 d 7 2 d 5 1 d 9 X 3 -1 d 3 -2 d 4 -3 d 6 -5 d 11 -11 d 4 -3 d 4 -2 d 2 -1 d 3 -1 d 3 X 2 2 d 3 1 d 3 3 d 3 4 d 3 5 d 4 7 d
 9 15 d 3 6 d 4 5 d 3 3 d 2 2 d 3 2 d 4 1 d 3 X 3 -1 d 33 -19 d 5 X 5 1 d 6 2 d 10 4 d 10 4 d 6 2 d 1 1 d 8 1 d 13 X 11 1 d 6 X 5 2 d 4 1 d 5 3 d 9 6 d 8 6 d 5 3 d 4 2 d 4 1 d 7 X 4 -2 d 5 -2 d 31 -23 d 9 -4 d 9 -3 d 9 -2 d 8 -1 d 7 -1 d 7 X 9 1 d 10
 2 d 10 3 d 7 2 d 10 4 d 9 5 d 11 5 d 13 8 d 4 3 d 5 5 d 11 11 d 5 5 d 5 4 d 4 3 d 3 1 d 3 1 d 6 X 3 -2 d 4 -2 d 33 -32 d 2 -1 d 3 X 3 1 d 4 2 d 6 5 d 8 6 d 3 2 d 3 1 d 2 X 2 -1 d 1 -1 d 2 -1 d 1 -3 d 1 -3 d -3 Y 1 -5 d 1 -2 d -38 Y -1 -5 d -1 -4 d
 -1 -3 d -1 -3 d -2 -3 d -1 -1 d -2 -1 d -34 24 d -4 2 d -4 3 d -6 5 d -15 15 d -4 3 d -4 2 d -3 2 d -7 X -3 -1 d -4 -2 d -5 -3 d -6 -5 d -12 -10 d -4 -4 d -5 -3 d -14 -7 d -10 -5 d -10 -4 d -9 -3 d -13 -4 d -10 -2 d -8 -1 d -8 -1 d -4 X -8 1 d -9 2
 d -9 2 d -10 3 d -6 3 d -6 2 d -6 4 d -17 13 d -5 3 d -4 2 d -3 1 d -6 X -4 -1 d -5 -2 d -5 -3 d -10 -7 d -7 -4 d -4 -2 d -4 -1 d -6 -1 d -8 -1 d -25 X -4 -1 d -6 -1 d -8 -3 d -13 -5 d -5 -2 d -5 -1 d -9 X -4 2 d -6 3 d -15 10 d -5 2 d -3 1 d -7 X
 -2 -2 d -3 -2 d -3 -3 d -4 -4 d -4 -7 d -10 -16 d -4 -6 d -3 -4 d -3 -3 d -3 -2 d -2 -1 d -7 X -4 1 d -33 25 d -5 1 d -6 -1 d -5 -1 d -8 -3 d -19 -7 d -5 -3 d -6 -3 d -14 -9 d -5 -3 d -5 -2 d -3 -1 d -5 X -4 1 d -4 1 d -4 3 d -31 22 d -9 4 d -11 4 d
 -9 2 d -10 2 d -3 1 d -8 X -8 -1 d -20 -2 d -7 X -43 4 d -6 -1 d -7 -2 d -10 -5 d -13 -6 d -7 -3 d -14 -4 d -13 -3 d -13 -2 d -3 X -14 -2 d -10 -1 d -19 X -6 1 d -8 3 d -16 5 d -6 1 d -12 X -6 -2 d -10 -4 d -10 -3 d -6 -2 d -5 -1 d -7 X -8 1 d -10 2
 d -18 4 d -6 1 d -12 5 d -10 4 d -5 2 d -5 1 d -5 X -4 -1 d -5 -2 d -5 -3 d -9 -6 d -9 -5 d -5 -3 d -5 -1 d -1 -1 d -11 -2 d -7 -1 d -13 X -4 1 d -5 2 d -2 1 d -4 2 d -3 3 d -4 5 d -5 6 d -14 20 d -4 5 d -3 3 d -3 2 d -3 1 d -4 1 d -4 X -4 -1 d -5
 -2 d -6 -3 d -15 -10 d -5 -2 d -7 -4 d -11 -6 d -10 -6 d -6 -2 d -5 -2 d -4 -1 d -7 -1 d -6 X -8 1 d -8 2 d -9 3 d -5 2 d -5 2 d -38 25 d -10 4 d -8 2 d -6 1 d -11 X -5 -1 d -2 -1 d -4 -2 d -3 -2 d -5 -4 d -4 -5 d -11 -12 d -5 -5 d -4 -4 d -3 -2 d
 -3 -1 d -8 X -3 1 d -6 3 d -15 11 d -4 2 d -3 1 d -5 X -4 -1 d -4 -2 d -4 -3 d -6 -5 d -8 -8 d -9 -9 d -5 -4 d -3 -3 d -9 -6 d -34 -19 d -25 -17 d -7 -5 d -6 -6 d -5 -4 d -6 -7 d -8 -9 d -7 -9 d -8 -11 d -6 -10 d -7 -11 d FA 6 lw 0 1 0 c 3 lw 400
 323 m20 6 lw 3 lw 442 323 m20 6 lw 3 lw 485 348 m20 6 lw 3 lw 528 393 m20 6 lw 3 lw 571 416 m20 6 lw 3 lw 614 394 m20 6 lw 3 lw 657 405 m20 6 lw 3 lw 699 427 m20 6 lw 3 lw 742 399 m20 6 lw 3 lw 785 382 m20 6 lw 3 lw 828 388 m20 6 lw 3 lw 871 392 m20
 6 lw 3 lw 914 355 m20 6 lw 3 lw 956 348 m20 6 lw 3 lw 999 376 m20 6 lw 3 lw 1042 370 m20 6 lw 3 lw 1085 352 m20 6 lw 3 lw 1128 349 m20 6 lw 3 lw 1170 353 m20 6 lw 3 lw 1213 369 m20 6 lw 3 lw 1256 360 m20 6 lw 3 lw 1299 370 m20 6 lw 3 lw 1342 364 m20
 6 lw 3 lw 1385 365 m20 6 lw 3 lw 1427 365 m20 6 lw 3 lw 1470 340 m20 6 lw 3 lw 1513 341 m20 6 lw 3 lw 1556 370 m20 6 lw 3 lw 1599 339 m20 6 lw 3 lw 1641 375 m20 6 lw 3 lw 1684 341 m20 6 lw 3 lw 1727 345 m20 6 lw 3 lw 1770 365 m20 6 lw 3 lw 1813 400
 m20 6 lw 3 lw 1856 373 m20 6 lw 3 lw 1898 342 m20 6 lw 3 lw 1941 354 m20 6 lw 3 lw 1984 355 m20 6 lw 3 lw 2027 417 m20 6 lw 3 lw 2070 376 m20 6 lw 3 lw 2113 385 m20 6 lw black 3 lw 0 1 0 c cs 0 1 0 P02 setcolor 400 441 m 2 -9 d 2 -8 d 2 -9 d 3 -8 d
 2 -8 d 3 -8 d 4 -7 d 3 -6 d 3 -5 d 4 -6 d 4 -4 d 4 -4 d 3 -3 d 3 -2 d 3 -2 d 11 X 5 2 d 4 3 d 6 4 d 13 10 d 1 1 d 5 3 d 6 5 d 7 8 d 13 14 d 6 6 d 5 4 d 1 1 d 13 9 d 7 5 d 6 3 d 6 2 d 4 1 d 10 X 4 -1 d 36 -23 d 5 -1 d 6 1 d 5 X 7 3 d 12 4 d 8 3 d 4 2
 d 6 4 d 15 10 d 5 3 d 4 2 d 4 1 d 4 X 4 -1 d 39 -28 d 19 -10 d 8 -4 d 6 -2 d 6 -2 d 4 X 5 -1 d 7 1 d 9 1 d 16 4 d 6 1 d 6 1 d 17 4 d 6 1 d 9 X 5 -2 d 3 -1 d 4 -3 d 36 -34 d 6 -3 d 7 -2 d 7 -2 d 6 -1 d 11 X 5 1 d 4 2 d 4 2 d 6 4 d 9 7 d 8 7 d 4 3 d 4
 2 d 3 1 d 1 1 d 5 X 6 1 d 6 -1 d 6 -1 d 20 -6 d 7 -2 d 21 -10 d 8 -3 d 7 -2 d 8 -2 d 10 -1 d 13 -1 d 12 X 14 1 d 10 1 d 9 1 d 9 2 d 6 2 d 8 3 d 14 7 d 6 2 d 5 2 d 14 X 8 -2 d 15 -5 d 5 -1 d 5 -1 d 5 1 d 7 1 d 10 3 d 10 4 d 6 1 d 5 1 d 43 -6 d 9 X 34
 2 d 10 X 14 1 d 12 X 5 -1 d 1 X 5 -2 d 5 -3 d 6 -4 d 16 -12 d 5 -3 d 4 -1 d 2 -1 d 7 -2 d 7 -1 d 7 X 7 1 d 7 1 d 6 2 d 2 X 4 2 d 4 3 d 5 4 d 9 9 d 5 5 d 5 4 d 4 2 d 3 1 d 3 1 d 1 X 3 -1 d 3 -1 d 3 -2 d 4 -4 d 5 -5 d 10 -12 d 4 -4 d 3 -2 d 3 -1 d 3
 -1 d 4 X 3 2 d 3 2 d 4 3 d 4 5 d 8 11 d 4 5 d 4 4 d 3 3 d 3 2 d 2 1 d 5 X 3 -1 d 4 -2 d 33 -32 d 5 -1 d 6 -1 d 5 X 7 1 d 7 2 d 13 3 d 8 3 d 9 4 d 10 5 d 10 6 d 6 4 d 4 3 d 5 5 d 9 9 d 7 9 d 5 4 d 4 3 d 3 2 d 3 1 d 6 X 4 -1 d 4 -1 d 4 -3 d 6 -4 d 22
 -18 d 5 -5 d 10 -9 d 8 -7 d 6 -5 d 5 -3 d 4 -2 d 4 -1 d -1 Y 8 X 5 1 d 5 2 d 9 4 d 8 4 d 5 2 d 3 X 5 1 d 6 -1 d 17 -2 d 8 X 4 2 d 3 1 d 3 3 d 2 3 d 3 4 d 3 5 d 4 7 d 8 18 d 4 9 d 3 6 d 3 4 d 3 3 d 2 2 d 2 1 d 3 1 d 5 X 3 -2 d 3 -2 d 3 -4 d 4 -5 d 7
 -11 d 5 -8 d 4 -5 d 3 -3 d 3 -2 d 3 -1 d 2 -1 d 3 1 d 2 1 d 4 2 d 4 4 d 4 4 d 7 9 d 4 3 d 2 2 d 2 1 d 2 X 1 -1 d 2 -1 d 1 -2 d 1 -3 d -3 Y 1 -4 d 1 -3 d -13 Y 1 -6 d -1 -7 d -10 Y -1 -5 d -1 -5 d -1 -4 d -1 -3 d -2 -2 d -2 -2 d -1 -1 d -3 -1 d -2 X
 -29 14 d -3 1 d -3 3 d -4 3 d -4 5 d -15 19 d -3 4 d -3 2 d -3 1 d -2 1 d -3 X -3 -1 d -2 -1 d -3 -3 d -3 -3 d -3 -4 d -3 -7 d -7 -12 d -5 -11 d -4 -5 d -3 -5 d -3 -3 d -2 -2 d -2 -2 d -3 -1 d -4 -2 d -10 X -10 2 d -8 2 d -8 X -5 -2 d -6 -2 d -15 -6
 d -5 -2 d -4 -1 d -8 X -4 2 d -4 2 d -5 3 d -6 5 d -20 17 d -3 2 d -7 5 d -18 14 d -5 3 d -4 2 d -4 1 d -9 X -3 -2 d -4 -2 d -4 -3 d -7 -6 d -11 -12 d -5 -4 d -5 -3 d -10 -6 d -11 -5 d -9 -4 d -9 -3 d -4 -1 d -15 -5 d -9 -1 d -11 X -5 1 d -3 X -3 2
 d -4 2 d -4 4 d -5 5 d -11 12 d -4 4 d -4 2 d -3 2 d -3 1 d -2 X -2 -1 d -3 -1 d -3 -2 d -4 -3 d -4 -5 d -11 -13 d -4 -4 d -4 -3 d -3 -1 d -2 -1 d -2 -1 d -3 1 d -3 1 d -3 1 d -4 3 d -5 5 d -12 13 d -4 3 d -3 2 d -3 1 d -3 1 d -3 -1 d -4 -1 d -4 -2
 d -4 -3 d -7 -5 d -9 -8 d -5 -4 d -4 -2 d -3 -2 d -7 -1 d -7 -2 d -15 X -7 1 d -7 1 d -4 2 d -6 3 d -6 3 d -16 12 d -5 2 d -5 2 d -1 X -5 2 d -14 X -21 -1 d -2 X -19 -1 d -24 X -43 6 d -6 -1 d -6 -1 d -10 -3 d -10 -3 d -5 -1 d -6 -1 d -5 1 d -7 1 d
 -22 7 d -5 1 d -4 X -5 -1 d -6 -2 d -8 -3 d -14 -6 d -6 -3 d -4 -1 d -10 -1 d -12 -2 d -14 -1 d -6 X -17 1 d -10 X -9 1 d -7 2 d -7 2 d -36 15 d -21 5 d -7 1 d -6 1 d -5 -1 d -4 X -4 -2 d -4 -2 d -5 -3 d -9 -8 d -8 -6 d -5 -2 d -3 -2 d -5 -2 d -6 -1
 d -6 X -7 1 d -7 1 d -7 2 d -7 4 d -2 X -4 3 d -5 3 d -6 5 d -16 16 d -4 4 d -4 2 d -3 2 d -1 1 d -5 1 d -10 X -8 -1 d -16 -3 d -4 -1 d -7 -1 d -14 -3 d -9 -2 d -13 X -7 1 d -6 2 d -8 3 d -22 11 d -5 3 d -5 3 d -17 13 d -5 3 d -4 2 d -4 1 d -6 X -4
 -1 d -5 -2 d -5 -3 d -9 -5 d -8 -6 d -5 -3 d -3 -1 d -19 -7 d -7 -2 d -6 -1 d -6 -1 d -5 X -4 1 d -4 1 d -6 3 d -17 10 d -4 2 d -4 1 d -9 X -5 -2 d -5 -2 d -6 -3 d -7 -5 d -10 -8 d -5 -4 d -5 -5 d -5 -6 d -8 -9 d -13 -17 d -7 -7 d -5 -5 d -43 -33 d
 -5 -7 d -5 -8 d -6 -9 d -4 -8 d -5 -10 d -5 -10 d -4 -11 d -4 -11 d -4 -11 d FA 6 lw
 gr  gr showpage
end
%%EOF
