%!PS-Adobe-3.0 EPSF-3.0
%%BoundingBox: (atend)
%%LanguageLevel: 2
%%Creator: Grace-5.1.19
%%CreationDate: Tue May 28 08:12:49 2013
%%DocumentData: Clean8Bit
%%Orientation: Portrait
%%Title: dmx_ZZ_logo.agr
%%For: user
%%DocumentNeededResources: (atend)
%%EndComments
%%BeginProlog
/m {moveto} def
/l {lineto} def
/s {stroke} def
/n {newpath} def
/c {closepath} def
/RL {rlineto} def
/SLW {setlinewidth} def
/GS {gsave} def
/GR {grestore} def
/SC {setcolor} def
/SGRY {setgray} def
/SRGB {setrgbcolor} def
/SD {setdash} def
/SLC {setlinecap} def
/SLJ {setlinejoin} def
/SCS {setcolorspace} def
/FFSF {findfont setfont} def
/CC {concat} def
/PXL {n m 0 0 RL s} def
/Color0 {1.0000 1.0000 1.0000} def
/Color1 {0.0000 0.0000 0.0000} def
/Color2 {1.0000 0.0000 0.0000} def
/Color3 {0.0000 1.0000 0.0000} def
/Color4 {0.0000 0.0000 1.0000} def
/Color5 {1.0000 1.0000 0.0000} def
/Color6 {0.7373 0.5608 0.5608} def
/Color7 {0.8627 0.8627 0.8627} def
/Color8 {0.5804 0.0000 0.8275} def
/Color9 {0.0000 1.0000 1.0000} def
/Color10 {1.0000 0.0000 1.0000} def
/Color11 {1.0000 0.6471 0.0000} def
/Color12 {0.4471 0.1294 0.7373} def
/Color13 {0.4039 0.0275 0.2824} def
/Color14 {0.2510 0.8784 0.8157} def
/Color15 {0.0000 0.5451 0.0000} def
/Color16 {0.7529 0.7529 0.7529} def
/Color17 {0.5059 0.5059 0.5059} def
/Color18 {0.2588 0.2588 0.2588} def
/Color19 {0.7529 0.7529 1.0000} def
/Color20 {0.5059 0.5059 1.0000} def
/Color21 {0.2588 0.2588 1.0000} def
/PTRN {
 /pat_bits exch def 
 <<
  /PaintType 2
  /PatternType 1 /TilingType 1
  /BBox[0 0 16 16]
  /XStep 16 /YStep 16
  /PaintProc {
   pop
   16 16 true [-1 0 0 -1 16 16] pat_bits imagemask
  }
 >>
 [0.0017 0 0 0.0017 0 0]
 makepattern
} def
/Pattern0 {<0000000000000000000000000000000000000000000000000000000000000000> PTRN} bind def
/Pattern1 {<ffffffffffffffffffffffffffffffffffffffffffffffffffffffffffffffff> PTRN} bind def
/Pattern2 {<eeeeffffbbbbffffeeeeffffbbbbffffeeeeffffbbbbffffeeeeffffbbbbffff> PTRN} bind def
/Pattern3 {<eeeebbbbeeeebbbbeeeebbbbeeeebbbbeeeebbbbeeeebbbbeeeebbbbeeeebbbb> PTRN} bind def
/Pattern4 {<5555aaaa5555aaaa5555aaaa5555aaaa5555aaaa5555aaaa5555aaaa5555aaaa> PTRN} bind def
/Pattern5 {<1111444411114444111144441111444411114444111144441111444411114444> PTRN} bind def
/Pattern6 {<1111000044440000111100004444000011110000444400001111000044440000> PTRN} bind def
/Pattern7 {<1010000000000000010100000000000010100000000000000101000000000000> PTRN} bind def
/Pattern8 {<0000000000000000000000000000000000000000000000000000000000000000> PTRN} bind def
/Pattern9 {<1e1e0f0f8787c3c3e1e1f0f078783c3c1e1e0f0f8787c3c3e1e1f0f078783c3c> PTRN} bind def
/Pattern10 {<7878f0f0e1e1c3c387870f0f1e1e3c3c7878f0f0e1e1c3c387870f0f1e1e3c3c> PTRN} bind def
/Pattern11 {<3333333333333333333333333333333333333333333333333333333333333333> PTRN} bind def
/Pattern12 {<ffffffff00000000ffffffff00000000ffffffff00000000ffffffff00000000> PTRN} bind def
/Pattern13 {<8181424224241818181824244242818181814242242418181818242442428181> PTRN} bind def
/Pattern14 {<8080404020201010080804040202010180804040202010100808040402020101> PTRN} bind def
/Pattern15 {<0101020204040808101020204040808001010202040408081010202040408080> PTRN} bind def
/Pattern16 {<2222222222222222222222222222222222222222222222222222222222222222> PTRN} bind def
/Pattern17 {<0000ffff000000000000ffff000000000000ffff000000000000ffff00000000> PTRN} bind def
/Pattern18 {<2222ffff222222222222ffff222222222222ffff222222222222ffff22222222> PTRN} bind def
/Pattern19 {<ffffffff33333333ffffffff33333333ffffffff33333333ffffffff33333333> PTRN} bind def
/Pattern20 {<0f0f0f0f0f0f0f0ff0f0f0f0f0f0f0f00f0f0f0f0f0f0f0ff0f0f0f0f0f0f0f0> PTRN} bind def
/Pattern21 {<ff00ff00ff00ff00ff00ff00ff00ff0000ff00ff00ff00ff00ff00ff00ff00ff> PTRN} bind def
/Pattern22 {<8001800180018001800180018001ffffffff8001800180018001800180018001> PTRN} bind def
/Pattern23 {<c003c003c003c003c003c003ffffffffffffffffc003c003c003c003c003c003> PTRN} bind def
/Pattern24 {<040404040404ffff404040404040ffff040404040404ffff404040404040ffff> PTRN} bind def
/Pattern25 {<180018001800180018001800ffffffff001800180018001800180018ffffffff> PTRN} bind def
/Pattern26 {<1111b8b87c7c3a3a1111a3a3c7c78b8b1111b8b87c7c3a3a1111a3a3c7c78b8b> PTRN} bind def
/Pattern27 {<101010102828c7c70101010182827c7c101010102828c7c70101010182827c7c> PTRN} bind def
/Pattern28 {<1c1c121211112121c1c12121111112121c1c121211112121c1c1212111111212> PTRN} bind def
/Pattern29 {<3e3e414180808080e3e31414080808083e3e414180808080e3e3141408080808> PTRN} bind def
/Pattern30 {<4848888884848383848488884848383848488888848483838484888848483838> PTRN} bind def
/Pattern31 {<03030404080808080c0c12122121c0c003030404080808080c0c12122121c0c0> PTRN} bind def
/ellipsedict 8 dict def
ellipsedict /mtrx matrix put
/EARC {
 ellipsedict begin
  /endangle exch def
  /startangle exch def
  /yrad exch def
  /xrad exch def
  /y exch def
  /x exch def
  /savematrix mtrx currentmatrix def
  x y translate
  xrad yrad scale
  0 0 1 startangle endangle arc
  savematrix setmatrix
 end
} def
/TL {
  /kcomp exch def
  /linewidth exch def
  /offset exch def
  GS
  0 offset rmoveto
  linewidth SLW
  dup stringwidth exch kcomp add exch RL s
  GR
} def
/KINIT
{
 /kvector exch def
 /kid 0 def
} def
/KPROC
{
 pop pop
 kvector kid get
 0 rmoveto
 /kid 1 kid add def
} def
/DefEncoding [
 /.notdef
 /.notdef
 /.notdef
 /.notdef
 /.notdef
 /.notdef
 /.notdef
 /.notdef
 /.notdef
 /.notdef
 /.notdef
 /.notdef
 /.notdef
 /.notdef
 /.notdef
 /.notdef
 /.notdef
 /.notdef
 /.notdef
 /.notdef
 /.notdef
 /.notdef
 /.notdef
 /.notdef
 /.notdef
 /.notdef
 /.notdef
 /.notdef
 /.notdef
 /.notdef
 /.notdef
 /.notdef
 /space
 /exclam
 /quotedbl
 /numbersign
 /dollar
 /percent
 /ampersand
 /quoteright
 /parenleft
 /parenright
 /asterisk
 /plus
 /comma
 /hyphen
 /period
 /slash
 /zero
 /one
 /two
 /three
 /four
 /five
 /six
 /seven
 /eight
 /nine
 /colon
 /semicolon
 /less
 /equal
 /greater
 /question
 /at
 /A
 /B
 /C
 /D
 /E
 /F
 /G
 /H
 /I
 /J
 /K
 /L
 /M
 /N
 /O
 /P
 /Q
 /R
 /S
 /T
 /U
 /V
 /W
 /X
 /Y
 /Z
 /bracketleft
 /backslash
 /bracketright
 /asciicircum
 /underscore
 /grave
 /a
 /b
 /c
 /d
 /e
 /f
 /g
 /h
 /i
 /j
 /k
 /l
 /m
 /n
 /o
 /p
 /q
 /r
 /s
 /t
 /u
 /v
 /w
 /x
 /y
 /z
 /braceleft
 /bar
 /braceright
 /asciitilde
 /.notdef
 /.notdef
 /.notdef
 /.notdef
 /.notdef
 /.notdef
 /.notdef
 /.notdef
 /.notdef
 /.notdef
 /.notdef
 /.notdef
 /.notdef
 /.notdef
 /.notdef
 /.notdef
 /.notdef
 /.notdef
 /.notdef
 /.notdef
 /.notdef
 /.notdef
 /.notdef
 /.notdef
 /.notdef
 /.notdef
 /.notdef
 /.notdef
 /.notdef
 /.notdef
 /.notdef
 /.notdef
 /.notdef
 /space
 /exclamdown
 /cent
 /sterling
 /currency
 /yen
 /brokenbar
 /section
 /dieresis
 /copyright
 /ordfeminine
 /guillemotleft
 /logicalnot
 /hyphen
 /registered
 /macron
 /degree
 /plusminus
 /twosuperior
 /threesuperior
 /acute
 /mu
 /paragraph
 /periodcentered
 /cedilla
 /onesuperior
 /ordmasculine
 /guillemotright
 /onequarter
 /onehalf
 /threequarters
 /questiondown
 /Agrave
 /Aacute
 /Acircumflex
 /Atilde
 /Adieresis
 /Aring
 /AE
 /Ccedilla
 /Egrave
 /Eacute
 /Ecircumflex
 /Edieresis
 /Igrave
 /Iacute
 /Icircumflex
 /Idieresis
 /Eth
 /Ntilde
 /Ograve
 /Oacute
 /Ocircumflex
 /Otilde
 /Odieresis
 /multiply
 /Oslash
 /Ugrave
 /Uacute
 /Ucircumflex
 /Udieresis
 /Yacute
 /Thorn
 /germandbls
 /agrave
 /aacute
 /acircumflex
 /atilde
 /adieresis
 /aring
 /ae
 /ccedilla
 /egrave
 /eacute
 /ecircumflex
 /edieresis
 /igrave
 /iacute
 /icircumflex
 /idieresis
 /eth
 /ntilde
 /ograve
 /oacute
 /ocircumflex
 /otilde
 /odieresis
 /divide
 /oslash
 /ugrave
 /uacute
 /ucircumflex
 /udieresis
 /yacute
 /thorn
 /ydieresis
] def
%%EndProlog
%%BeginSetup
%%EndSetup
594.96 594.96 scale
n
0.0000 0.0000 m
0.0000 1.0000 l
1.4151 1.0000 l
1.4151 0.0000 l
c
[/DeviceRGB] SCS
Color0 SC
fill
[/DeviceRGB] SCS
Color1 SC
[] 0 SD
0.0030 SLW
0 SLC
0 SLJ
n
0.1999 0.5532 m
0.2011 0.5539 l
0.2038 0.5554 l
0.2066 0.5569 l
0.2093 0.5584 l
0.2120 0.5599 l
0.2147 0.5614 l
0.2174 0.5630 l
0.2202 0.5645 l
0.2229 0.5660 l
0.2256 0.5675 l
0.2283 0.5691 l
0.2310 0.5706 l
0.2338 0.5721 l
0.2365 0.5737 l
0.2392 0.5752 l
0.2419 0.5767 l
0.2446 0.5783 l
0.2474 0.5798 l
0.2501 0.5814 l
0.2528 0.5829 l
0.2555 0.5845 l
0.2582 0.5860 l
0.2610 0.5876 l
0.2637 0.5892 l
0.2664 0.5907 l
0.2691 0.5923 l
0.2718 0.5938 l
0.2746 0.5954 l
0.2773 0.5970 l
0.2800 0.5985 l
0.2827 0.6001 l
0.2854 0.6017 l
0.2882 0.6033 l
0.2909 0.6049 l
0.2936 0.6064 l
0.2963 0.6080 l
0.2990 0.6096 l
0.3018 0.6112 l
0.3045 0.6128 l
0.3072 0.6144 l
0.3099 0.6160 l
0.3126 0.6176 l
0.3154 0.6192 l
0.3181 0.6208 l
0.3208 0.6224 l
0.3235 0.6239 l
0.3262 0.6256 l
0.3290 0.6271 l
0.3317 0.6288 l
0.3344 0.6304 l
0.3371 0.6320 l
0.3398 0.6336 l
0.3426 0.6352 l
0.3453 0.6368 l
0.3480 0.6384 l
0.3507 0.6400 l
0.3534 0.6416 l
0.3562 0.6432 l
0.3589 0.6448 l
0.3616 0.6465 l
0.3643 0.6481 l
0.3670 0.6497 l
0.3698 0.6513 l
0.3725 0.6529 l
0.3752 0.6545 l
0.3779 0.6561 l
0.3806 0.6578 l
0.3834 0.6594 l
0.3861 0.6610 l
0.3888 0.6626 l
0.3915 0.6642 l
0.3942 0.6658 l
0.3970 0.6674 l
0.3997 0.6691 l
0.4024 0.6707 l
0.4051 0.6723 l
0.4078 0.6739 l
0.4106 0.6755 l
0.4133 0.6771 l
0.4160 0.6787 l
0.4187 0.6803 l
0.4214 0.6819 l
0.4242 0.6836 l
0.4269 0.6852 l
0.4296 0.6868 l
0.4323 0.6884 l
0.4350 0.6900 l
0.4378 0.6916 l
0.4405 0.6932 l
0.4432 0.6948 l
0.4459 0.6964 l
0.4486 0.6979 l
0.4514 0.6995 l
0.4541 0.7011 l
0.4568 0.7027 l
0.4595 0.7043 l
0.4622 0.7059 l
0.4650 0.7074 l
0.4677 0.7090 l
0.4704 0.7106 l
0.4731 0.7122 l
0.4758 0.7137 l
0.4786 0.7153 l
0.4813 0.7168 l
0.4840 0.7184 l
0.4867 0.7199 l
0.4894 0.7215 l
0.4922 0.7230 l
0.4949 0.7246 l
0.4976 0.7261 l
0.5003 0.7276 l
0.5030 0.7291 l
0.5058 0.7307 l
0.5085 0.7322 l
0.5112 0.7337 l
0.5139 0.7352 l
0.5166 0.7367 l
0.5194 0.7382 l
0.5221 0.7396 l
0.5248 0.7411 l
0.5275 0.7426 l
0.5302 0.7441 l
0.5330 0.7455 l
0.5357 0.7470 l
0.5384 0.7484 l
0.5411 0.7498 l
0.5438 0.7513 l
0.5466 0.7527 l
0.5493 0.7541 l
0.5520 0.7555 l
0.5547 0.7569 l
0.5574 0.7583 l
0.5602 0.7597 l
0.5629 0.7611 l
0.5656 0.7624 l
0.5683 0.7638 l
0.5710 0.7651 l
0.5738 0.7664 l
0.5765 0.7678 l
0.5792 0.7691 l
0.5819 0.7704 l
0.5846 0.7717 l
0.5874 0.7729 l
0.5901 0.7742 l
0.5928 0.7755 l
0.5955 0.7767 l
0.5982 0.7779 l
0.6010 0.7791 l
0.6037 0.7803 l
0.6064 0.7815 l
0.6091 0.7827 l
0.6118 0.7839 l
0.6146 0.7850 l
0.6173 0.7861 l
0.6200 0.7873 l
0.6227 0.7884 l
0.6254 0.7894 l
0.6282 0.7905 l
0.6309 0.7916 l
0.6336 0.7926 l
0.6363 0.7936 l
0.6390 0.7946 l
0.6418 0.7956 l
0.6445 0.7966 l
0.6472 0.7975 l
0.6499 0.7984 l
0.6526 0.7993 l
0.6554 0.8002 l
0.6581 0.8011 l
0.6608 0.8019 l
0.6635 0.8027 l
0.6662 0.8035 l
0.6690 0.8043 l
0.6717 0.8051 l
0.6744 0.8058 l
0.6771 0.8065 l
0.6798 0.8072 l
0.6826 0.8078 l
0.6853 0.8085 l
0.6880 0.8091 l
0.6907 0.8096 l
0.6934 0.8102 l
0.6962 0.8107 l
0.6989 0.8112 l
0.7016 0.8117 l
0.7043 0.8121 l
0.7070 0.8125 l
0.7098 0.8128 l
0.7125 0.8132 l
0.7152 0.8135 l
0.7179 0.8137 l
0.7206 0.8140 l
0.7234 0.8142 l
0.7261 0.8143 l
0.7288 0.8144 l
0.7315 0.8145 l
0.7342 0.8146 l
0.7370 0.8146 l
0.7397 0.8145 l
0.7424 0.8144 l
0.7451 0.8143 l
0.7478 0.8141 l
0.7506 0.8139 l
0.7533 0.8137 l
0.7560 0.8134 l
0.7587 0.8130 l
0.7614 0.8126 l
0.7642 0.8122 l
0.7669 0.8117 l
0.7696 0.8111 l
0.7723 0.8105 l
0.7750 0.8098 l
0.7778 0.8091 l
0.7805 0.8083 l
0.7832 0.8075 l
0.7859 0.8065 l
0.7886 0.8056 l
0.7914 0.8045 l
0.7941 0.8034 l
0.7968 0.8023 l
0.7995 0.8010 l
0.8022 0.7997 l
0.8050 0.7983 l
0.8077 0.7968 l
0.8104 0.7953 l
0.8131 0.7937 l
0.8158 0.7920 l
0.8186 0.7902 l
0.8213 0.7883 l
0.8240 0.7863 l
0.8267 0.7842 l
0.8294 0.7821 l
0.8322 0.7798 l
0.8349 0.7774 l
0.8376 0.7750 l
0.8403 0.7724 l
0.8430 0.7697 l
0.8458 0.7669 l
0.8485 0.7639 l
0.8512 0.7609 l
0.8539 0.7577 l
0.8566 0.7544 l
0.8594 0.7509 l
0.8621 0.7473 l
0.8648 0.7435 l
0.8675 0.7396 l
0.8702 0.7355 l
0.8730 0.7313 l
0.8757 0.7268 l
0.8784 0.7222 l
0.8811 0.7174 l
0.8838 0.7124 l
0.8866 0.7071 l
0.8893 0.7017 l
0.8920 0.6960 l
0.8947 0.6900 l
0.8974 0.6838 l
0.9002 0.6774 l
0.9029 0.6706 l
0.9056 0.6635 l
0.9083 0.6560 l
0.9110 0.6482 l
0.9138 0.6400 l
0.9165 0.6314 l
0.9192 0.6223 l
0.9219 0.6127 l
0.9246 0.6026 l
0.9274 0.5918 l
0.9301 0.5804 l
0.9328 0.5682 l
0.9355 0.5551 l
0.9382 0.5411 l
0.9410 0.5258 l
0.9437 0.5090 l
0.9464 0.4905 l
0.9491 0.4696 l
0.9518 0.4454 l
0.9546 0.4162 l
0.9573 0.3775 l
0.9600 0.2820 l
s
[/DeviceRGB] SCS
Color2 SC
[0.0150 0.0090 ] 0 SD
0.0030 SLW
n
0.1999 0.7886 m
0.2011 0.7888 l
0.2038 0.7893 l
0.2066 0.7898 l
0.2093 0.7903 l
0.2120 0.7907 l
0.2147 0.7911 l
0.2174 0.7915 l
0.2202 0.7919 l
0.2229 0.7922 l
0.2256 0.7926 l
0.2283 0.7928 l
0.2310 0.7931 l
0.2338 0.7933 l
0.2365 0.7936 l
0.2392 0.7937 l
0.2419 0.7939 l
0.2446 0.7940 l
0.2474 0.7941 l
0.2501 0.7942 l
0.2528 0.7943 l
0.2555 0.7943 l
0.2582 0.7943 l
0.2610 0.7942 l
0.2637 0.7942 l
0.2664 0.7941 l
0.2691 0.7940 l
0.2718 0.7938 l
0.2746 0.7937 l
0.2773 0.7935 l
0.2800 0.7932 l
0.2827 0.7930 l
0.2854 0.7927 l
0.2882 0.7924 l
0.2909 0.7921 l
0.2936 0.7917 l
0.2963 0.7913 l
0.2990 0.7909 l
0.3018 0.7905 l
0.3045 0.7900 l
0.3072 0.7895 l
0.3099 0.7889 l
0.3126 0.7884 l
0.3154 0.7878 l
0.3181 0.7872 l
0.3208 0.7865 l
0.3235 0.7859 l
0.3262 0.7852 l
0.3290 0.7844 l
0.3317 0.7837 l
0.3344 0.7829 l
0.3371 0.7821 l
0.3398 0.7812 l
0.3426 0.7804 l
0.3453 0.7795 l
0.3480 0.7785 l
0.3507 0.7776 l
0.3534 0.7766 l
0.3562 0.7756 l
0.3589 0.7745 l
0.3616 0.7735 l
0.3643 0.7723 l
0.3670 0.7712 l
0.3698 0.7701 l
0.3725 0.7689 l
0.3752 0.7676 l
0.3779 0.7664 l
0.3806 0.7651 l
0.3834 0.7638 l
0.3861 0.7625 l
0.3888 0.7611 l
0.3915 0.7598 l
0.3942 0.7583 l
0.3970 0.7569 l
0.3997 0.7554 l
0.4024 0.7539 l
0.4051 0.7524 l
0.4078 0.7508 l
0.4106 0.7493 l
0.4133 0.7477 l
0.4160 0.7460 l
0.4187 0.7443 l
0.4214 0.7426 l
0.4242 0.7409 l
0.4269 0.7392 l
0.4296 0.7374 l
0.4323 0.7356 l
0.4350 0.7338 l
0.4378 0.7319 l
0.4405 0.7300 l
0.4432 0.7281 l
0.4459 0.7262 l
0.4486 0.7242 l
0.4514 0.7222 l
0.4541 0.7202 l
0.4568 0.7181 l
0.4595 0.7161 l
0.4622 0.7140 l
0.4650 0.7118 l
0.4677 0.7097 l
0.4704 0.7075 l
0.4731 0.7053 l
0.4758 0.7031 l
0.4786 0.7008 l
0.4813 0.6986 l
0.4840 0.6963 l
0.4867 0.6939 l
0.4894 0.6916 l
0.4922 0.6892 l
0.4949 0.6868 l
0.4976 0.6844 l
0.5003 0.6820 l
0.5030 0.6795 l
0.5058 0.6770 l
0.5085 0.6745 l
0.5112 0.6720 l
0.5139 0.6694 l
0.5166 0.6668 l
0.5194 0.6642 l
0.5221 0.6616 l
0.5248 0.6590 l
0.5275 0.6563 l
0.5302 0.6536 l
0.5330 0.6509 l
0.5357 0.6482 l
0.5384 0.6454 l
0.5411 0.6427 l
0.5438 0.6399 l
0.5466 0.6371 l
0.5493 0.6342 l
0.5520 0.6314 l
0.5547 0.6285 l
0.5574 0.6257 l
0.5602 0.6228 l
0.5629 0.6198 l
0.5656 0.6169 l
0.5683 0.6140 l
0.5710 0.6110 l
0.5738 0.6080 l
0.5765 0.6050 l
0.5792 0.6020 l
0.5819 0.5990 l
0.5846 0.5960 l
0.5874 0.5929 l
0.5901 0.5898 l
0.5928 0.5868 l
0.5955 0.5837 l
0.5982 0.5806 l
0.6010 0.5775 l
0.6037 0.5743 l
0.6064 0.5712 l
0.6091 0.5680 l
0.6118 0.5649 l
0.6146 0.5617 l
0.6173 0.5585 l
0.6200 0.5554 l
0.6227 0.5522 l
0.6254 0.5490 l
0.6282 0.5458 l
0.6309 0.5425 l
0.6336 0.5393 l
0.6363 0.5361 l
0.6390 0.5328 l
0.6418 0.5296 l
0.6445 0.5264 l
0.6472 0.5231 l
0.6499 0.5199 l
0.6526 0.5166 l
0.6554 0.5134 l
0.6581 0.5101 l
0.6608 0.5068 l
0.6635 0.5036 l
0.6662 0.5003 l
0.6690 0.4971 l
0.6717 0.4938 l
0.6744 0.4906 l
0.6771 0.4873 l
0.6798 0.4841 l
0.6826 0.4808 l
0.6853 0.4776 l
0.6880 0.4743 l
0.6907 0.4711 l
0.6934 0.4679 l
0.6962 0.4646 l
0.6989 0.4614 l
0.7016 0.4582 l
0.7043 0.4550 l
0.7070 0.4518 l
0.7098 0.4487 l
0.7125 0.4455 l
0.7152 0.4423 l
0.7179 0.4392 l
0.7206 0.4361 l
0.7234 0.4329 l
0.7261 0.4298 l
0.7288 0.4267 l
0.7315 0.4236 l
0.7342 0.4206 l
0.7370 0.4175 l
0.7397 0.4145 l
0.7424 0.4115 l
0.7451 0.4085 l
0.7478 0.4055 l
0.7506 0.4026 l
0.7533 0.3996 l
0.7560 0.3967 l
0.7587 0.3938 l
0.7614 0.3910 l
0.7642 0.3881 l
0.7669 0.3853 l
0.7696 0.3825 l
0.7723 0.3797 l
0.7750 0.3770 l
0.7778 0.3743 l
0.7805 0.3716 l
0.7832 0.3689 l
0.7859 0.3663 l
0.7886 0.3637 l
0.7914 0.3611 l
0.7941 0.3586 l
0.7968 0.3560 l
0.7995 0.3536 l
0.8022 0.3511 l
0.8050 0.3487 l
0.8077 0.3463 l
0.8104 0.3440 l
0.8131 0.3417 l
0.8158 0.3394 l
0.8186 0.3372 l
0.8213 0.3350 l
0.8240 0.3328 l
0.8267 0.3307 l
0.8294 0.3286 l
0.8322 0.3266 l
0.8349 0.3246 l
0.8376 0.3226 l
0.8403 0.3207 l
0.8430 0.3188 l
0.8458 0.3170 l
0.8485 0.3152 l
0.8512 0.3135 l
0.8539 0.3118 l
0.8566 0.3101 l
0.8594 0.3085 l
0.8621 0.3070 l
0.8648 0.3054 l
0.8675 0.3040 l
0.8702 0.3026 l
0.8730 0.3012 l
0.8757 0.2999 l
0.8784 0.2986 l
0.8811 0.2974 l
0.8838 0.2962 l
0.8866 0.2950 l
0.8893 0.2940 l
0.8920 0.2929 l
0.8947 0.2919 l
0.8974 0.2910 l
0.9002 0.2901 l
0.9029 0.2893 l
0.9056 0.2885 l
0.9083 0.2878 l
0.9110 0.2871 l
0.9138 0.2864 l
0.9165 0.2858 l
0.9192 0.2853 l
0.9219 0.2848 l
0.9246 0.2843 l
0.9274 0.2839 l
0.9301 0.2836 l
0.9328 0.2832 l
0.9355 0.2830 l
0.9382 0.2827 l
0.9410 0.2825 l
0.9437 0.2824 l
0.9464 0.2822 l
0.9491 0.2821 l
0.9518 0.2821 l
0.9546 0.2820 l
0.9573 0.2820 l
0.9600 0.2820 l
s
[/DeviceRGB] SCS
Color1 SC
[] 0 SD
0.0015 SLW
n
0.2000 0.2800 m
1.0000 0.2800 l
s
n
0.2000 0.9800 m
1.0000 0.9800 l
s
n
0.2400 0.2800 m
0.2400 0.2900 l
s
n
0.2400 0.9800 m
0.2400 0.9700 l
s
n
0.2800 0.2800 m
0.2800 0.2900 l
s
n
0.2800 0.9800 m
0.2800 0.9700 l
s
n
0.3200 0.2800 m
0.3200 0.2900 l
s
n
0.3200 0.9800 m
0.3200 0.9700 l
s
n
0.3600 0.2800 m
0.3600 0.2900 l
s
n
0.3600 0.9800 m
0.3600 0.9700 l
s
n
0.4400 0.2800 m
0.4400 0.2900 l
s
n
0.4400 0.9800 m
0.4400 0.9700 l
s
n
0.4800 0.2800 m
0.4800 0.2900 l
s
n
0.4800 0.9800 m
0.4800 0.9700 l
s
n
0.5200 0.2800 m
0.5200 0.2900 l
s
n
0.5200 0.9800 m
0.5200 0.9700 l
s
n
0.5600 0.2800 m
0.5600 0.2900 l
s
n
0.5600 0.9800 m
0.5600 0.9700 l
s
n
0.6400 0.2800 m
0.6400 0.2900 l
s
n
0.6400 0.9800 m
0.6400 0.9700 l
s
n
0.6800 0.2800 m
0.6800 0.2900 l
s
n
0.6800 0.9800 m
0.6800 0.9700 l
s
n
0.7200 0.2800 m
0.7200 0.2900 l
s
n
0.7200 0.9800 m
0.7200 0.9700 l
s
n
0.7600 0.2800 m
0.7600 0.2900 l
s
n
0.7600 0.9800 m
0.7600 0.9700 l
s
n
0.8400 0.2800 m
0.8400 0.2900 l
s
n
0.8400 0.9800 m
0.8400 0.9700 l
s
n
0.8800 0.2800 m
0.8800 0.2900 l
s
n
0.8800 0.9800 m
0.8800 0.9700 l
s
n
0.9200 0.2800 m
0.9200 0.2900 l
s
n
0.9200 0.9800 m
0.9200 0.9700 l
s
n
0.9600 0.2800 m
0.9600 0.2900 l
s
n
0.9600 0.9800 m
0.9600 0.9700 l
s
n
0.2000 0.2800 m
0.2000 0.3000 l
s
n
0.2000 0.9800 m
0.2000 0.9600 l
s
n
0.4000 0.2800 m
0.4000 0.3000 l
s
n
0.4000 0.9800 m
0.4000 0.9600 l
s
n
0.6000 0.2800 m
0.6000 0.3000 l
s
n
0.6000 0.9800 m
0.6000 0.9600 l
s
n
0.8000 0.2800 m
0.8000 0.3000 l
s
n
0.8000 0.9800 m
0.8000 0.9600 l
s
n
1.0000 0.2800 m
1.0000 0.3000 l
s
n
1.0000 0.9800 m
1.0000 0.9600 l
s
/Times-Roman findfont
dup length dict begin
 {1 index /FID ne {def} {pop pop} ifelse} forall
 /Encoding DefEncoding def
 currentdict
end
/Font0 exch definefont pop
/Font0 FFSF
0.1843 0.2470 m
GS
[0.0336 0.0000 0.0000 0.0336 0 0] CC
(15) show
GR
/Font0 FFSF
0.3835 0.2474 m
GS
[0.0336 0.0000 0.0000 0.0336 0 0] CC
(20) show
GR
/Font0 FFSF
0.5843 0.2470 m
GS
[0.0336 0.0000 0.0000 0.0336 0 0] CC
(25) show
GR
/Font0 FFSF
0.7835 0.2474 m
GS
[0.0336 0.0000 0.0000 0.0336 0 0] CC
(30) show
GR
/Font0 FFSF
0.9843 0.2470 m
GS
[0.0336 0.0000 0.0000 0.0336 0 0] CC
(35) show
GR
/Font0 FFSF
0.5167 0.1902 m
GS
[0.0420 0.0000 0.0000 0.0420 0 0] CC
(M) show
GR
/Font0 FFSF
0.5542 0.1734 m
GS
[0.0297 0.0000 0.0000 0.0297 0 0] CC
(*) show
GR
/Font0 FFSF
0.5691 0.1902 m
GS
[0.0420 0.0000 0.0000 0.0420 0 0] CC
( [GeV]) show
GR
n
0.2000 0.2800 m
0.2000 0.9800 l
s
n
1.0000 0.2800 m
1.0000 0.9800 l
s
n
0.2000 0.3319 m
0.2100 0.3319 l
s
n
1.0000 0.3319 m
0.9900 0.3319 l
s
n
0.2000 0.4316 m
0.2100 0.4316 l
s
n
1.0000 0.4316 m
0.9900 0.4316 l
s
n
0.2000 0.5313 m
0.2100 0.5313 l
s
n
1.0000 0.5313 m
0.9900 0.5313 l
s
n
0.2000 0.6310 m
0.2100 0.6310 l
s
n
1.0000 0.6310 m
0.9900 0.6310 l
s
n
0.2000 0.7307 m
0.2100 0.7307 l
s
n
1.0000 0.7307 m
0.9900 0.7307 l
s
n
0.2000 0.8304 m
0.2100 0.8304 l
s
n
1.0000 0.8304 m
0.9900 0.8304 l
s
n
0.2000 0.9301 m
0.2100 0.9301 l
s
n
1.0000 0.9301 m
0.9900 0.9301 l
s
n
0.2000 0.2820 m
0.2200 0.2820 l
s
n
1.0000 0.2820 m
0.9800 0.2820 l
s
n
0.2000 0.3817 m
0.2200 0.3817 l
s
n
1.0000 0.3817 m
0.9800 0.3817 l
s
n
0.2000 0.4814 m
0.2200 0.4814 l
s
n
1.0000 0.4814 m
0.9800 0.4814 l
s
n
0.2000 0.5811 m
0.2200 0.5811 l
s
n
1.0000 0.5811 m
0.9800 0.5811 l
s
n
0.2000 0.6809 m
0.2200 0.6809 l
s
n
1.0000 0.6809 m
0.9800 0.6809 l
s
n
0.2000 0.7806 m
0.2200 0.7806 l
s
n
1.0000 0.7806 m
0.9800 0.7806 l
s
n
0.2000 0.8803 m
0.2200 0.8803 l
s
n
1.0000 0.8803 m
0.9800 0.8803 l
s
n
0.2000 0.9800 m
0.2200 0.9800 l
s
n
1.0000 0.9800 m
0.9800 0.9800 l
s
/Font0 FFSF
0.1319 0.2709 m
GS
[0.0336 0.0000 0.0000 0.0336 0 0] CC
(0.00) show
GR
/Font0 FFSF
0.1347 0.3706 m
GS
[0.0336 0.0000 0.0000 0.0336 0 0] CC
(0.01) show
GR
/Font0 FFSF
0.1319 0.4703 m
GS
[0.0336 0.0000 0.0000 0.0336 0 0] CC
(0.02) show
GR
/Font0 FFSF
0.1335 0.5700 m
GS
[0.0336 0.0000 0.0000 0.0336 0 0] CC
(0.03) show
GR
/Font0 FFSF
0.1323 0.6698 m
GS
[0.0336 0.0000 0.0000 0.0336 0 0] CC
(0.04) show
GR
/Font0 FFSF
0.1335 0.7693 m
GS
[0.0336 0.0000 0.0000 0.0336 0 0] CC
(0.05) show
GR
/Font0 FFSF
0.1323 0.8690 m
GS
[0.0336 0.0000 0.0000 0.0336 0 0] CC
(0.06) show
GR
/Font0 FFSF
0.1331 0.9689 m
GS
[0.0336 0.0000 0.0000 0.0336 0 0] CC
(0.07) show
GR
/Font0 FFSF
0.0983 0.4465 m
GS
[0.0000 0.0420 -0.0420 0.0000 0 0] CC
(1/) show
GR
/Symbol findfont
/Font12 exch definefont pop
/Font12 FFSF
0.0983 0.4791 m
GS
[0.0000 0.0420 -0.0420 0.0000 0 0] CC
(G  ) show
GR
/Font0 FFSF
0.0983 0.5255 m
GS
[0.0000 0.0420 -0.0420 0.0000 0 0] CC
(d) show
GR
/Font12 FFSF
0.0983 0.5465 m
GS
[0.0000 0.0420 -0.0420 0.0000 0 0] CC
(G/) show
GR
/Font0 FFSF
0.0983 0.5836 m
GS
[0.0000 0.0420 -0.0420 0.0000 0 0] CC
(dM) show
GR
/Font0 FFSF
0.1151 0.6421 m
GS
[0.0000 0.0297 -0.0297 0.0000 0 0] CC
(* ) show
GR
/Font0 FFSF
0.0983 0.6643 m
GS
[0.0000 0.0420 -0.0420 0.0000 0 0] CC
(  [GeV) show
GR
/Font0 FFSF
0.0731 0.7784 m
GS
[0.0000 0.0297 -0.0297 0.0000 0 0] CC
(-1) show
GR
/Font0 FFSF
0.0983 0.8031 m
GS
[0.0000 0.0420 -0.0420 0.0000 0 0] CC
(]) show
GR
n
0.2000 0.2800 m
0.2000 0.9800 l
1.0000 0.9800 l
1.0000 0.2800 l
0.2000 0.2800 l
c
s
n
0.2800 0.4000 m
0.2800 0.3238 l
0.4014 0.3238 l
0.4014 0.4000 l
c
[/DeviceRGB] SCS
Color0 SC
fill
/Font0 FFSF
[/DeviceRGB] SCS
Color1 SC
0.3515 0.3710 m
GS
[0.0280 0.0000 0.0000 0.0280 0 0] CC
(SM) show
GR
[] 0 SD
0.0030 SLW
n
0.2915 0.3803 m
0.3315 0.3803 l
s
/Font0 FFSF
0.3515 0.3338 m
GS
[0.0280 0.0000 0.0000 0.0280 0 0] CC
( 2) show
GR
/Font0 FFSF
0.3725 0.3506 m
GS
[0.0198 0.0000 0.0000 0.0198 0 0] CC
(+) show
GR
[/DeviceRGB] SCS
Color2 SC
[0.0150 0.0090 ] 0 SD
0.0030 SLW
n
0.2915 0.3472 m
0.3315 0.3472 l
s
/Font0 FFSF
[/DeviceRGB] SCS
Color4 SC
0.6646 0.9075 m
GS
[0.0280 0.0000 0.0000 0.0280 0 0] CC
(H -) show
GR
/Font0 FFSF
0.6957 0.9075 m
GS
[0.0280 0.0000 0.0000 0.0280 0 0] CC
(-) show
GR
/Font0 FFSF
0.6994 0.9075 m
GS
[0.0280 0.0000 0.0000 0.0280 0 0] CC
(-) show
GR
/Font0 FFSF
0.7002 0.9075 m
GS
[0.0280 0.0000 0.0000 0.0280 0 0] CC
(>  Z) show
GR
/Font0 FFSF
0.7470 0.9243 m
GS
[0.0198 0.0000 0.0000 0.0198 0 0] CC
(*) show
GR
/Font0 FFSF
0.7571 0.9075 m
GS
[0.0280 0.0000 0.0000 0.0280 0 0] CC
(Z -) show
GR
/Font0 FFSF
0.7850 0.9075 m
GS
[0.0280 0.0000 0.0000 0.0280 0 0] CC
(-) show
GR
/Font0 FFSF
0.7887 0.9075 m
GS
[0.0280 0.0000 0.0000 0.0280 0 0] CC
(-) show
GR
/Font0 FFSF
0.7896 0.9075 m
GS
[0.0280 0.0000 0.0000 0.0280 0 0] CC
(>  \(l) show
GR
/Font0 FFSF
0.8383 0.9243 m
GS
[0.0198 0.0000 0.0000 0.0198 0 0] CC
(-) show
GR
/Font0 FFSF
0.8388 0.8963 m
GS
[0.0198 0.0000 0.0000 0.0198 0 0] CC
(1) show
GR
/Font0 FFSF
0.8489 0.9075 m
GS
[0.0280 0.0000 0.0000 0.0280 0 0] CC
(l) show
GR
/Font0 FFSF
0.8566 0.9243 m
GS
[0.0198 0.0000 0.0000 0.0198 0 0] CC
(+) show
GR
/Font0 FFSF
0.8619 0.8963 m
GS
[0.0198 0.0000 0.0000 0.0198 0 0] CC
(1) show
GR
/Font0 FFSF
0.8720 0.9075 m
GS
[0.0280 0.0000 0.0000 0.0280 0 0] CC
(\) \(l) show
GR
/Font0 FFSF
0.9055 0.9243 m
GS
[0.0198 0.0000 0.0000 0.0198 0 0] CC
(-) show
GR
/Font0 FFSF
0.9060 0.8963 m
GS
[0.0198 0.0000 0.0000 0.0198 0 0] CC
(2) show
GR
/Font0 FFSF
0.9161 0.9075 m
GS
[0.0280 0.0000 0.0000 0.0280 0 0] CC
(l) show
GR
/Font0 FFSF
0.9238 0.9243 m
GS
[0.0198 0.0000 0.0000 0.0198 0 0] CC
(+) show
GR
/Font0 FFSF
0.9291 0.8963 m
GS
[0.0198 0.0000 0.0000 0.0198 0 0] CC
(2) show
GR
/Font0 FFSF
0.9392 0.9075 m
GS
[0.0280 0.0000 0.0000 0.0280 0 0] CC
(\)) show
GR
/Font0 FFSF
0.7696 0.8605 m
GS
[0.0280 0.0000 0.0000 0.0280 0 0] CC
(M) show
GR
/Font0 FFSF
0.7946 0.8493 m
GS
[0.0198 0.0000 0.0000 0.0198 0 0] CC
(H) show
GR
/Font0 FFSF
0.8087 0.8605 m
GS
[0.0280 0.0000 0.0000 0.0280 0 0] CC
( = 125 GeV) show
GR
/Font0 FFSF
[/DeviceRGB] SCS
Color1 SC
0.2567 0.9095 m
GS
[0.0364 0.0000 0.0000 0.0364 0 0] CC
(\(b\)) show
GR
/Helvetica-BoldOblique findfont
dup length dict begin
 {1 index /FID ne {def} {pop pop} ifelse} forall
 /Encoding DefEncoding def
 currentdict
end
/Font7 exch definefont pop
/Font7 FFSF
1.0340 0.7320 m
GS
[0.0000 0.0210 -0.0210 0.0000 0 0] CC
(LHC HIGGS XS WG 2013) show
GR
%%Trailer
%%BoundingBox: 30 106 617 591
%%DocumentNeededResources: font Times-Roman
%%+ font Helvetica-BoldOblique
%%+ font Symbol
%%EOF
