%!PS-Adobe-2.0 EPSF-2.0
%%BoundingBox:  0 0 567 407
%%Title: mHrew.eps: Higgs Cross Section
%%Creator: ROOT Version 5.34/04
%%CreationDate: Thu Mar 28 15:14:21 2013
%%EndComments
%%BeginProlog
80 dict begin
/s {stroke} def /l {lineto} def /m {moveto} def /t {translate} def
/r {rotate} def /rl {roll}  def /R {repeat} def
/d {rlineto} def /rm {rmoveto} def /gr {grestore} def /f {eofill} def
/c {setrgbcolor} def /black {0 setgray} def /sd {setdash} def
/cl {closepath} def /sf {scalefont setfont} def /lw {setlinewidth} def
/box {m dup 0 exch d exch 0 d 0 exch neg d cl} def
/NC{systemdict begin initclip end}def/C{NC box clip newpath}def
/bl {box s} def /bf {box f} def /Y { 0 exch d} def /X { 0 d} def 
/K {{pop pop 0 moveto} exch kshow} bind def
/ita {/ang 15 def gsave [1 0 ang dup sin exch cos div 1 0 0] concat} def 
/mp {newpath /y exch def /x exch def} def
/side {[w .77 mul w .23 mul] .385 w mul sd w 0 l currentpoint t -144 r} def
/mr {mp x y w2 0 360 arc} def /m24 {mr s} def /m20 {mr f} def
/mb {mp x y w2 add m w2 neg 0 d 0 w neg d w 0 d 0 w d cl} def
/mt {mp x y w2 add m w2 neg w neg d w 0 d cl} def
/m21 {mb f} def /m25 {mb s} def /m22 {mt f} def /m26{mt s} def
/m23 {mp x y w2 sub m w2 w d w neg 0 d cl f} def
/m27 {mp x y w2 add m w3 neg w2 neg d w3 w2 neg d w3 w2 d cl s} def
/m28 {mp x w2 sub y w2 sub w3 add m w3 0 d  0 w3 neg d w3 0 d 0 w3 d w3 0 d  0 w3 d w3 neg 0 d 0 w3 d w3 neg 0 d 0 w3 neg d w3 neg 0 d cl s } def
/m29 {mp gsave x w2 sub y w2 add w3 sub m currentpoint t 4 {side} repeat cl fill gr} def
/m30 {mp gsave x w2 sub y w2 add w3 sub m currentpoint t 4 {side} repeat cl s gr} def
/m31 {mp x y w2 sub m 0 w d x w2 sub y m w 0 d x w2 sub y w2 add m w w neg d x w2 sub y w2 sub m w w d s} def
/m32 {mp x y w2 sub m w2 w d w neg 0 d cl s} def
/m33 {mp x y w2 add m w3 neg w2 neg d w3 w2 neg d w3 w2 d cl f} def
/m34 {mp x w2 sub y w2 sub w3 add m w3 0 d  0 w3 neg d w3 0 d 0 w3 d w3 0 d  0 w3 d w3 neg 0 d 0 w3 d w3 neg 0 d 0 w3 neg d w3 neg 0 d cl f } def
/m2 {mp x y w2 sub m 0 w d x w2 sub y m w 0 d s} def
/m5 {mp x w2 sub y w2 sub m w w d x w2 sub y w2 add m w w neg d s} def
/reEncode {exch findfont dup length dict begin {1 index /FID eq  {pop pop} {def} ifelse } forall /Encoding exch def currentdict end dup /FontName get exch definefont pop } def [/Times-Bold /Times-Italic /Times-BoldItalic /Helvetica /Helvetica-Oblique
 /Helvetica-Bold /Helvetica-BoldOblique /Courier /Courier-Oblique /Courier-Bold /Courier-BoldOblique /Times-Roman /AvantGarde-Book /AvantGarde-BookOblique /AvantGarde-Demi /AvantGarde-DemiOblique /Bookman-Demi /Bookman-DemiItalic /Bookman-Light
 /Bookman-LightItalic /Helvetica-Narrow /Helvetica-Narrow-Bold /Helvetica-Narrow-BoldOblique /Helvetica-Narrow-Oblique /NewCenturySchlbk-Roman /NewCenturySchlbk-Bold /NewCenturySchlbk-BoldItalic /NewCenturySchlbk-Italic /Palatino-Bold
 /Palatino-BoldItalic /Palatino-Italic /Palatino-Roman ] {ISOLatin1Encoding reEncode } forall
%%EndProlog
%%BeginSetup
%%EndSetup
newpath  gsave  .25 .25 scale  gsave  0 0 t black[  ] 0 sd 3 lw 1 1 1 c 2268 1630 0 0 bf black 1 1 1 c 1791 1287 363 261 bf black 1791 1287 363 261 bl 0 0 1 c 6 lw 1 1 1 c 0 0 1 c 381 261 m 1 Y s 381 262 m s 372 261 m 17 X s 372 262 m 17 X s 3 lw /w
 2 def /w2 {w 2 div} def /w3 {w 3 div} def 381 262 m20 6 lw 417 262 m s 417 262 m s 408 262 m 17 X s 408 262 m 17 X s 3 lw 417 262 m20 6 lw 452 262 m 1 Y s 452 263 m s 444 262 m 17 X s 444 263 m 17 X s 3 lw 452 263 m20 6 lw 488 264 m s 488 264 m 1 Y
 s 480 264 m 17 X s 480 265 m 17 X s 3 lw 488 264 m20 6 lw 524 265 m 1 Y s 524 266 m s 516 265 m 17 X s 516 266 m 17 X s 3 lw 524 266 m20 6 lw 560 268 m 1 Y s 560 269 m s 551 268 m 17 X s 551 269 m 17 X s 3 lw 560 269 m20 6 lw 596 270 m 1 Y s 596 271
 m 1 Y s 587 270 m 17 X s 587 272 m 17 X s 3 lw 596 271 m20 6 lw 632 276 m 1 Y s 632 277 m 1 Y s 623 276 m 17 X s 623 278 m 17 X s 3 lw 632 277 m20 6 lw 667 284 m 1 Y s 667 285 m 1 Y s 659 284 m 17 X s 659 286 m 17 X s 3 lw 667 285 m20 6 lw 703 292 m
 1 Y s 703 293 m 1 Y s 695 292 m 17 X s 695 294 m 17 X s 3 lw 703 293 m20 6 lw 739 302 m 2 Y s 739 304 m 1 Y s 731 302 m 17 X s 731 305 m 17 X s 3 lw 739 304 m20 6 lw 775 313 m 2 Y s 775 315 m 1 Y s 766 313 m 17 X s 766 316 m 17 X s 3 lw 775 315 m20
 6 lw 811 331 m 1 Y s 811 332 m 2 Y s 802 331 m 17 X s 802 334 m 17 X s 3 lw 811 332 m20 6 lw 847 351 m 2 Y s 847 353 m 2 Y s 838 351 m 17 X s 838 355 m 17 X s 3 lw 847 353 m20 6 lw 882 378 m 3 Y s 882 381 m 2 Y s 874 378 m 17 X s 874 383 m 17 X s 3
 lw 882 381 m20 6 lw 918 406 m 3 Y s 918 409 m 2 Y s 910 406 m 17 X s 910 411 m 17 X s 3 lw 918 409 m20 6 lw 954 446 m 2 Y s 954 448 m 3 Y s 945 446 m 18 X s 945 451 m 18 X s 3 lw 954 448 m20 6 lw 990 499 m 3 Y s 990 502 m 3 Y s 981 499 m 17 X s 981
 505 m 17 X s 3 lw 990 502 m20 6 lw 1026 567 m 3 Y s 1026 570 m 4 Y s 1017 567 m 17 X s 1017 574 m 17 X s 3 lw 1026 570 m20 6 lw 1062 650 m 4 Y s 1062 654 m 3 Y s 1053 650 m 17 X s 1053 657 m 17 X s 3 lw 1062 654 m20 6 lw 1097 756 m 4 Y s 1097 760 m
 5 Y s 1089 756 m 17 X s 1089 765 m 17 X s 3 lw 1097 760 m20 6 lw 1133 906 m 5 Y s 1133 911 m 5 Y s 1125 906 m 17 X s 1125 916 m 17 X s 3 lw 1133 911 m20 6 lw 1169 1073 m 6 Y s 1169 1079 m 5 Y s 1160 1073 m 18 X s 1160 1084 m 18 X s 3 lw 1169 1079
 m20 6 lw 1205 1237 m 6 Y s 1205 1243 m 6 Y s 1196 1237 m 17 X s 1196 1249 m 17 X s 3 lw 1205 1243 m20 6 lw 1241 1392 m 6 Y s 1241 1398 m 7 Y s 1232 1392 m 17 X s 1232 1405 m 17 X s 3 lw 1241 1398 m20 6 lw 1276 1473 m 7 Y s 1276 1480 m 7 Y s 1268
 1473 m 17 X s 1268 1487 m 17 X s 3 lw 1276 1480 m20 6 lw 1312 1430 m 6 Y s 1312 1436 m 7 Y s 1304 1430 m 17 X s 1304 1443 m 17 X s 3 lw 1312 1436 m20 6 lw 1348 1316 m 6 Y s 1348 1322 m 7 Y s 1340 1316 m 17 X s 1340 1329 m 17 X s 3 lw 1348 1322 m20 6
 lw 1384 1176 m 6 Y s 1384 1182 m 6 Y s 1375 1176 m 18 X s 1375 1188 m 18 X s 3 lw 1384 1182 m20 6 lw 1420 1028 m 5 Y s 1420 1033 m 6 Y s 1411 1028 m 17 X s 1411 1039 m 17 X s 3 lw 1420 1033 m20 6 lw 1456 896 m 5 Y s 1456 901 m 5 Y s 1447 896 m 17 X
 s 1447 906 m 17 X s 3 lw 1456 901 m20 6 lw 1491 788 m 4 Y s 1491 792 m 5 Y s 1483 788 m 17 X s 1483 797 m 17 X s 3 lw 1491 792 m20 6 lw 1527 701 m 4 Y s 1527 705 m 4 Y s 1519 701 m 17 X s 1519 709 m 17 X s 3 lw 1527 705 m20 6 lw 1563 636 m 4 Y s
 1563 640 m 4 Y s 1555 636 m 17 X s 1555 644 m 17 X s 3 lw 1563 640 m20 6 lw 1599 574 m 3 Y s 1599 577 m 4 Y s 1590 574 m 18 X s 1590 581 m 18 X s 3 lw 1599 577 m20 6 lw 1635 539 m 3 Y s 1635 542 m 4 Y s 1626 539 m 17 X s 1626 546 m 17 X s 3 lw 1635
 542 m20 6 lw 1671 492 m 3 Y s 1671 495 m 3 Y s 1662 492 m 17 X s 1662 498 m 17 X s 3 lw 1671 495 m20 6 lw 1706 461 m 3 Y s 1706 464 m 3 Y s 1698 461 m 17 X s 1698 467 m 17 X s 3 lw 1706 464 m20 6 lw 1742 443 m 2 Y s 1742 445 m 3 Y s 1734 443 m 17 X
 s 1734 448 m 17 X s 3 lw 1742 445 m20 6 lw 1778 423 m 2 Y s 1778 425 m 3 Y s 1770 423 m 17 X s 1770 428 m 17 X s 3 lw 1778 425 m20 6 lw 1814 406 m 2 Y s 1814 408 m 3 Y s 1805 406 m 17 X s 1805 411 m 17 X s 3 lw 1814 408 m20 6 lw 1850 384 m 2 Y s
 1850 386 m 2 Y s 1841 384 m 17 X s 1841 388 m 17 X s 3 lw 1850 386 m20 6 lw 1886 375 m 2 Y s 1886 377 m 2 Y s 1877 375 m 17 X s 1877 379 m 17 X s 3 lw 1886 377 m20 6 lw 1921 366 m 2 Y s 1921 368 m 2 Y s 1913 366 m 17 X s 1913 370 m 17 X s 3 lw 1921
 368 m20 6 lw 1957 354 m 2 Y s 1957 356 m 2 Y s 1949 354 m 17 X s 1949 358 m 17 X s 3 lw 1957 356 m20 6 lw 1993 342 m 2 Y s 1993 344 m 2 Y s 1985 342 m 17 X s 1985 346 m 17 X s 3 lw 1993 344 m20 6 lw 2029 334 m 1 Y s 2029 335 m 2 Y s 2020 334 m 17 X
 s 2020 337 m 17 X s 3 lw 2029 335 m20 6 lw 2065 329 m 2 Y s 2065 331 m 1 Y s 2056 329 m 17 X s 2056 332 m 17 X s 3 lw 2065 331 m20 6 lw 2101 321 m 1 Y s 2101 322 m 2 Y s 2092 321 m 17 X s 2092 324 m 17 X s 3 lw 2101 322 m20 6 lw 2136 320 m 1 Y s
 2136 321 m 2 Y s 2128 320 m 17 X s 2128 323 m 17 X s 3 lw 2136 321 m20 6 lw 1 1 1 c 0 0 1 c 363 262 m 71 X 1 Y 36 X 1 Y 36 X 2 Y 36 X 3 Y 36 X 2 Y 36 X 6 Y 35 X 8 Y 36 X 8 Y 36 X 11 Y 36 X 11 Y 36 X 17 Y 36 X 21 Y 35 X 28 Y 36 X 28 Y 36 X 39 Y 36 X
 54 Y 36 X 68 Y 36 X 84 Y 35 X 106 Y 36 X 151 Y 36 X 168 Y 36 X 164 Y 36 X 155 Y 36 X 82 Y 35 X -44 Y 36 X -114 Y 36 X -140 Y 36 X -149 Y 36 X -132 Y 36 X -109 Y 35 X -87 Y 36 X -65 Y 36 X -63 Y 36 X -35 Y 36 X -47 Y 36 X -31 Y 35 X -19 Y 36 X -20 Y
 36 X -17 Y 36 X -22 Y 36 X -9 Y 36 X -9 Y 35 X -12 Y 36 X -12 Y 36 X -9 Y 36 X -4 Y 36 X -9 Y 36 X -1 Y 35 X s black 3 lw 363 261 m 1791 X s
 gsave  2268 1630 0 0 C 1940.09 59.8267 t 0 r /Helvetica findfont 76.92 sf 0 0 m ( [GeV]) show NC gr 
 gsave  2268 1630 0 0 C 1843.23 37.0356 t 0 r /Helvetica findfont 51.28 sf 0 0 m (WW) show NC gr 
 gsave  2268 1630 0 0 C 1783.41 59.8267 t 0 r /Helvetica findfont 76.92 sf 0 0 m (m) show NC gr  363 299 m -38 Y s 437 280 m -19 Y s 512 280 m -19 Y s 587 280 m -19 Y s 661 299 m -38 Y s 736 280 m -19 Y s 811 280 m -19 Y s 885 280 m -19 Y s 960 299 m
 -38 Y s 1035 280 m -19 Y s 1109 280 m -19 Y s 1184 280 m -19 Y s 1259 299 m -38 Y s 1333 280 m -19 Y s 1408 280 m -19 Y s 1483 280 m -19 Y s 1557 299 m -38 Y s 1632 280 m -19 Y s 1706 280 m -19 Y s 1781 280 m -19 Y s 1856 299 m -38 Y s 1930 280 m
 -19 Y s 2005 280 m -19 Y s 2080 280 m -19 Y s 2154 299 m -38 Y s
 gsave  2268 1630 0 0 C 299.133 188.027 t 0 r /Helvetica findfont 76.92 sf 0 0 m (200) show NC gr 
 gsave  2268 1630 0 0 C 598.267 188.027 t 0 r /Helvetica findfont 76.92 sf 0 0 m (400) show NC gr 
 gsave  2268 1630 0 0 C 894.552 188.027 t 0 r /Helvetica findfont 76.92 sf 0 0 m (600) show NC gr 
 gsave  2268 1630 0 0 C 1193.68 188.027 t 0 r /Helvetica findfont 76.92 sf 0 0 m (800) show NC gr 
 gsave  2268 1630 0 0 C 1470.03 188.027 t 0 r /Helvetica findfont 76.92 sf 0 0 m (1000) show NC gr 
 gsave  2268 1630 0 0 C 1769.16 188.027 t 0 r /Helvetica findfont 76.92 sf 0 0 m (1200) show NC gr 
 gsave  2268 1630 0 0 C 2068.29 188.027 t 0 r /Helvetica findfont 76.92 sf 0 0 m (1400) show NC gr  363 1548 m 1791 X s 363 1509 m 39 Y s 437 1529 m 19 Y s 512 1529 m 19 Y s 587 1529 m 19 Y s 661 1509 m 39 Y s 736 1529 m 19 Y s 811 1529 m 19 Y s 885
 1529 m 19 Y s 960 1509 m 39 Y s 1035 1529 m 19 Y s 1109 1529 m 19 Y s 1184 1529 m 19 Y s 1259 1509 m 39 Y s 1333 1529 m 19 Y s 1408 1529 m 19 Y s 1483 1529 m 19 Y s 1557 1509 m 39 Y s 1632 1529 m 19 Y s 1706 1529 m 19 Y s 1781 1529 m 19 Y s 1856
 1509 m 39 Y s 1930 1529 m 19 Y s 2005 1529 m 19 Y s 2080 1529 m 19 Y s 2154 1509 m 39 Y s 363 261 m 1287 Y s
 gsave  2268 1630 0 0 C 88.3156 1250.66 t 90 r /Helvetica findfont 76.92 sf 0 0 m ( [fb/GeV]) show NC gr 
 gsave  2268 1630 0 0 C 116.804 1153.8 t 90 r /Helvetica findfont 51.28 sf 0 0 m (WW) show NC gr 
 gsave  2268 1630 0 0 C 88.3156 1025.6 t 90 r /Helvetica findfont 76.92 sf 0 0 m (/dm) show NC gr 
 gsave  2268 1630 0 0 C 88.3156 980.018 t 90 r /Symbol findfont 76.92 sf 0 0 m (s) show NC gr 
 gsave  2268 1630 0 0 C 88.3156 940.134 t 90 r /Helvetica findfont 76.92 sf 0 0 m (d) show NC gr  417 261 m -54 X s 390 310 m -27 X s 390 360 m -27 X s 390 409 m -27 X s 390 459 m -27 X s 417 508 m -54 X s 390 558 m -27 X s 390 607 m -27 X s 390 657
 m -27 X s 390 706 m -27 X s 417 756 m -54 X s 390 805 m -27 X s 390 855 m -27 X s 390 904 m -27 X s 390 954 m -27 X s 417 1003 m -54 X s 390 1053 m -27 X s 390 1102 m -27 X s 390 1152 m -27 X s 390 1201 m -27 X s 417 1251 m -54 X s 390 1300 m -27 X
 s 390 1350 m -27 X s 390 1399 m -27 X s 390 1449 m -27 X s 417 1498 m -54 X s 417 1498 m -54 X s 390 1548 m -27 X s
 gsave  2268 1630 0 0 C 310.529 233.609 t 0 r /Helvetica findfont 76.92 sf 0 0 m (0) show NC gr 
 gsave  2268 1630 0 0 C 216.516 481.462 t 0 r /Helvetica findfont 76.92 sf 0 0 m (0.01) show NC gr 
 gsave  2268 1630 0 0 C 202.271 729.316 t 0 r /Helvetica findfont 76.92 sf 0 0 m (0.02) show NC gr 
 gsave  2268 1630 0 0 C 202.271 977.169 t 0 r /Helvetica findfont 76.92 sf 0 0 m (0.03) show NC gr 
 gsave  2268 1630 0 0 C 202.271 1225.02 t 0 r /Helvetica findfont 76.92 sf 0 0 m (0.04) show NC gr 
 gsave  2268 1630 0 0 C 202.271 1470.03 t 0 r /Helvetica findfont 76.92 sf 0 0 m (0.05) show NC gr  2154 261 m 1287 Y s 2101 261 m 53 X s 2127 310 m 27 X s 2127 360 m 27 X s 2127 409 m 27 X s 2127 459 m 27 X s 2101 508 m 53 X s 2127 558 m 27 X s 2127
 607 m 27 X s 2127 657 m 27 X s 2127 706 m 27 X s 2101 756 m 53 X s 2127 805 m 27 X s 2127 855 m 27 X s 2127 904 m 27 X s 2127 954 m 27 X s 2101 1003 m 53 X s 2127 1053 m 27 X s 2127 1102 m 27 X s 2127 1152 m 27 X s 2127 1201 m 27 X s 2101 1251 m 53
 X s 2127 1300 m 27 X s 2127 1350 m 27 X s 2127 1399 m 27 X s 2127 1449 m 27 X s 2101 1498 m 53 X s 2101 1498 m 53 X s 2127 1548 m 27 X s 1 0 0 c 6 lw 1 1 1 c 1 0 0 c 381 310 m 331 Y s 381 641 m 331 Y s 372 310 m 17 X s 372 972 m 17 X s 3 lw 381 641
 m20 6 lw 417 261 m 123 Y s 417 384 m 174 Y s 408 261 m 17 X s 408 558 m 17 X s 3 lw 417 384 m20 6 lw 452 434 m 352 Y s 452 786 m 352 Y s 444 434 m 17 X s 444 1138 m 17 X s 3 lw 452 786 m20 6 lw 488 555 m 238 Y s 488 793 m 239 Y s 480 555 m 17 X s
 480 1032 m 17 X s 3 lw 488 793 m20 6 lw 524 311 m 111 Y s 524 422 m 111 Y s 516 311 m 17 X s 516 533 m 17 X s 3 lw 524 422 m20 6 lw 560 538 m 132 Y s 560 670 m 133 Y s 551 538 m 17 X s 551 803 m 17 X s 3 lw 560 670 m20 6 lw 596 507 m 85 Y s 596 592
 m 86 Y s 587 507 m 17 X s 587 678 m 17 X s 3 lw 596 592 m20 6 lw 632 571 m 68 Y s 632 639 m 67 Y s 623 571 m 17 X s 623 706 m 17 X s 3 lw 632 639 m20 6 lw 667 595 m 101 Y s 667 696 m 101 Y s 659 595 m 17 X s 659 797 m 17 X s 3 lw 667 696 m20 6 lw
 703 542 m 80 Y s 703 622 m 80 Y s 695 542 m 17 X s 695 702 m 17 X s 3 lw 703 622 m20 6 lw 739 684 m 52 Y s 739 736 m 51 Y s 731 684 m 17 X s 731 787 m 17 X s 3 lw 739 736 m20 6 lw 775 666 m 41 Y s 775 707 m 41 Y s 766 666 m 17 X s 766 748 m 17 X s 3
 lw 775 707 m20 6 lw 811 648 m 29 Y s 811 677 m 29 Y s 802 648 m 17 X s 802 706 m 17 X s 3 lw 811 677 m20 6 lw 847 680 m 28 Y s 847 708 m 28 Y s 838 680 m 17 X s 838 736 m 17 X s 3 lw 847 708 m20 6 lw 882 730 m 31 Y s 882 761 m 30 Y s 874 730 m 17 X
 s 874 791 m 17 X s 3 lw 882 761 m20 6 lw 918 729 m 19 Y s 918 748 m 18 Y s 910 729 m 17 X s 910 766 m 17 X s 3 lw 918 748 m20 6 lw 954 754 m 22 Y s 954 776 m 21 Y s 945 754 m 18 X s 945 797 m 18 X s 3 lw 954 776 m20 6 lw 990 857 m 18 Y s 990 875 m
 18 Y s 981 857 m 17 X s 981 893 m 17 X s 3 lw 990 875 m20 6 lw 1026 907 m 17 Y s 1026 924 m 17 Y s 1017 907 m 17 X s 1017 941 m 17 X s 3 lw 1026 924 m20 6 lw 1062 954 m 13 Y s 1062 967 m 12 Y s 1053 954 m 17 X s 1053 979 m 17 X s 3 lw 1062 967 m20 6
 lw 1097 1032 m 12 Y s 1097 1044 m 12 Y s 1089 1032 m 17 X s 1089 1056 m 17 X s 3 lw 1097 1044 m20 6 lw 1133 1128 m 12 Y s 1133 1140 m 11 Y s 1125 1128 m 17 X s 1125 1151 m 17 X s 3 lw 1133 1140 m20 6 lw 1169 1191 m 11 Y s 1169 1202 m 11 Y s 1160
 1191 m 18 X s 1160 1213 m 18 X s 3 lw 1169 1202 m20 6 lw 1205 1256 m 9 Y s 1205 1265 m 8 Y s 1196 1256 m 17 X s 1196 1273 m 17 X s 3 lw 1205 1265 m20 6 lw 1241 1232 m 28 Y s 1241 1260 m 28 Y s 1232 1232 m 17 X s 1232 1288 m 17 X s 3 lw 1241 1260 m20
 6 lw 1276 1249 m 7 Y s 1276 1256 m 7 Y s 1268 1249 m 17 X s 1268 1263 m 17 X s 3 lw 1276 1256 m20 6 lw 1312 1149 m 7 Y s 1312 1156 m 7 Y s 1304 1149 m 17 X s 1304 1163 m 17 X s 3 lw 1312 1156 m20 6 lw 1348 1002 m 5 Y s 1348 1007 m 6 Y s 1340 1002 m
 17 X s 1340 1013 m 17 X s 3 lw 1348 1007 m20 6 lw 1384 871 m 5 Y s 1384 876 m 6 Y s 1375 871 m 18 X s 1375 882 m 18 X s 3 lw 1384 876 m20 6 lw 1420 740 m 5 Y s 1420 745 m 5 Y s 1411 740 m 17 X s 1411 750 m 17 X s 3 lw 1420 745 m20 6 lw 1456 629 m 8
 Y s 1456 637 m 7 Y s 1447 629 m 17 X s 1447 644 m 17 X s 3 lw 1456 637 m20 6 lw 1491 554 m 4 Y s 1491 558 m 5 Y s 1483 554 m 17 X s 1483 563 m 17 X s 3 lw 1491 558 m20 6 lw 1527 492 m 10 Y s 1527 502 m 9 Y s 1519 492 m 17 X s 1519 511 m 17 X s 3 lw
 1527 502 m20 6 lw 1563 445 m 3 Y s 1563 448 m 3 Y s 1555 445 m 17 X s 1555 451 m 17 X s 3 lw 1563 448 m20 6 lw 1599 400 m 3 Y s 1599 403 m 2 Y s 1590 400 m 18 X s 1590 405 m 18 X s 3 lw 1599 403 m20 6 lw 1635 380 m 2 Y s 1635 382 m 3 Y s 1626 380 m
 17 X s 1626 385 m 17 X s 3 lw 1635 382 m20 6 lw 1671 352 m 2 Y s 1671 354 m 2 Y s 1662 352 m 17 X s 1662 356 m 17 X s 3 lw 1671 354 m20 6 lw 1706 335 m 2 Y s 1706 337 m 1 Y s 1698 335 m 17 X s 1698 338 m 17 X s 3 lw 1706 337 m20 6 lw 1742 324 m 2 Y
 s 1742 326 m 2 Y s 1734 324 m 17 X s 1734 328 m 17 X s 3 lw 1742 326 m20 6 lw 1778 315 m 1 Y s 1778 316 m 2 Y s 1770 315 m 17 X s 1770 318 m 17 X s 3 lw 1778 316 m20 6 lw 1814 307 m 2 Y s 1814 309 m 1 Y s 1805 307 m 17 X s 1805 310 m 17 X s 3 lw
 1814 309 m20 6 lw 1850 293 m 2 Y s 1850 295 m 1 Y s 1841 293 m 17 X s 1841 296 m 17 X s 3 lw 1850 295 m20 6 lw 1886 290 m 1 Y s 1886 291 m 2 Y s 1877 290 m 17 X s 1877 293 m 17 X s 3 lw 1886 291 m20 6 lw 1921 287 m 1 Y s 1921 288 m 1 Y s 1913 287 m
 17 X s 1913 289 m 17 X s 3 lw 1921 288 m20 6 lw 1957 283 m 1 Y s 1957 284 m 1 Y s 1949 283 m 17 X s 1949 285 m 17 X s 3 lw 1957 284 m20 6 lw 1993 278 m 1 Y s 1993 279 m 1 Y s 1985 278 m 17 X s 1985 280 m 17 X s 3 lw 1993 279 m20 6 lw 2029 277 m s
 2029 277 m 1 Y s 2020 277 m 17 X s 2020 278 m 17 X s 3 lw 2029 277 m20 6 lw 2065 265 m 4 Y s 2065 269 m 4 Y s 2056 265 m 17 X s 2056 273 m 17 X s 3 lw 2065 269 m20 6 lw 2101 271 m s 2101 271 m 1 Y s 2092 271 m 17 X s 2092 272 m 17 X s 3 lw 2101 271
 m20 6 lw 2136 270 m 1 Y s 2136 271 m s 2128 270 m 17 X s 2128 271 m 17 X s 3 lw 2136 271 m20 6 lw 1 1 1 c 1 0 0 c 363 641 m 36 X -257 Y 35 X 402 Y 36 X 7 Y 36 X -371 Y 36 X 248 Y 36 X -78 Y 36 X 47 Y 35 X 57 Y 36 X -74 Y 36 X 114 Y 36 X -29 Y 36 X
 -30 Y 36 X 31 Y 35 X 53 Y 36 X -13 Y 36 X 28 Y 36 X 99 Y 36 X 49 Y 36 X 43 Y 35 X 77 Y 36 X 96 Y 36 X 62 Y 36 X 63 Y 36 X -5 Y 36 X -4 Y 35 X -100 Y 36 X -149 Y 36 X -131 Y 36 X -131 Y 36 X -108 Y 36 X -79 Y 35 X -56 Y 36 X -54 Y 36 X -45 Y 36 X -21
 Y 36 X -28 Y 36 X -17 Y 35 X -11 Y 36 X -10 Y 36 X -7 Y 36 X -14 Y 36 X -4 Y 36 X -3 Y 35 X -4 Y 36 X -5 Y 36 X -2 Y 36 X -8 Y 36 X 2 Y 71 X s black 3 lw 1 1 1 c 635 114 1474 1385 bf black
 gsave  2268 1630 0 0 C 1632.41 1450.09 t 0 r /Helvetica-Bold findfont 54.1289 sf 0 0 m (POWHEG CPS) show NC gr  0 0 1 c 6 lw 1498 1471 m 111 X s black
 gsave  2268 1630 0 0 C 1632.41 1393.11 t 0 r /Helvetica-Bold findfont 54.1289 sf 0 0 m (VBFNLO REPOLO) show NC gr  1 0 0 c 1498 1414 m 111 X s black
 gsave  2268 1630 0 0 C 2222.13 1182.29 t 90 r /Helvetica-BoldOblique findfont 31.3378 sf 0 0 m (LHC HIGGS XS WG 2013) show NC gr 
 gr  gr showpage
end
%%EOF
