%!PS-Adobe-2.0 EPSF-2.0
%%BoundingBox:  0 0 567 552
%%Title: /Volumes/DanisWork/mac-Work/Work/Higgs-Joint/VBF/YR3/Plots/Results/j3y.eps: VBF
%%Creator: ROOT Version 5.24/00
%%CreationDate: Tue Mar 19 11:12:30 2013
%%EndComments
%%BeginProlog
80 dict begin
/s {stroke} def /l {lineto} def /m {moveto} def /t {translate} def
/sw {stringwidth} def /r {rotate} def /rl {roll}  def /R {repeat} def
/d {rlineto} def /rm {rmoveto} def /gr {grestore} def /f {eofill} def
/c {setrgbcolor} def /black {0 setgray} def /sd {setdash} def
/cl {closepath} def /sf {scalefont setfont} def /lw {setlinewidth} def
/box {m dup 0 exch d exch 0 d 0 exch neg d cl} def
/NC{systemdict begin initclip end}def/C{NC box clip newpath}def
/bl {box s} def /bf {box f} def /Y { 0 exch d} def /X { 0 d} def 
/mp {newpath /y exch def /x exch def} def
/side {[w .77 mul w .23 mul] .385 w mul sd w 0 l currentpoint t -144 r} def
/mr {mp x y w2 0 360 arc} def /m24 {mr s} def /m20 {mr f} def
/mb {mp x y w2 add m w2 neg 0 d 0 w neg d w 0 d 0 w d cl} def
/mt {mp x y w2 add m w2 neg w neg d w 0 d cl} def
/m21 {mb f} def /m25 {mb s} def /m22 {mt f} def /m26{mt s} def
/m23 {mp x y w2 sub m w2 w d w neg 0 d cl f} def
/m27 {mp x y w2 add m w3 neg w2 neg d w3 w2 neg d w3 w2 d cl s} def
/m28 {mp x w2 sub y w2 sub w3 add m w3 0 d  0 w3 neg d w3 0 d 0 w3 d w3 0 d  0 w3 d w3 neg 0 d 0 w3 d w3 neg 0 d
 0 w3 neg d w3 neg 0 d cl s } def
/m29 {mp gsave x w2 sub y w2 add w3 sub m currentpoint t
 4 {side} repeat cl fill gr} def
/m30 {mp gsave x w2 sub y w2 add w3 sub m currentpoint t
 4 {side} repeat cl s gr} def
/m31 {mp x y w2 sub m 0 w d x w2 sub y m w 0 d x w2 sub y w2 add m w w neg d x w2 sub y w2
 sub m w w d s} def
/m2 {mp x y w2 sub m 0 w d x w2 sub y m w 0 d s} def
/m5 {mp x w2 sub y w2 sub m w w d x w2 sub y w2 add m w w neg d s} def
/reEncode {exch findfont dup length dict begin {1 index /FID eq  {pop pop} {def} ifelse } forall /Encoding exch def currentdict end dup /FontName get exch definefont pop } def [/Times-Bold /Times-Italic /Times-BoldItalic /Helvetica
 /Helvetica-Oblique /Helvetica-Bold /Helvetica-BoldOblique /Courier /Courier-Oblique /Courier-Bold /Courier-BoldOblique /Times-Roman /AvantGarde-Book /AvantGarde-BookOblique /AvantGarde-Demi /AvantGarde-DemiOblique /Bookman-Demi
 /Bookman-DemiItalic /Bookman-Light /Bookman-LightItalic /Helvetica-Narrow /Helvetica-Narrow-Bold /Helvetica-Narrow-BoldOblique /Helvetica-Narrow-Oblique /NewCenturySchlbk-Roman /NewCenturySchlbk-Bold
 /NewCenturySchlbk-BoldItalic /NewCenturySchlbk-Italic /Palatino-Bold /Palatino-BoldItalic /Palatino-Italic /Palatino-Roman ] {ISOLatin1Encoding reEncode } forall
/oshow {gsave [] 0 sd true charpath stroke gr} def
/stwn { /fs exch def /fn exch def /text exch def fn findfont fs sf
 text sw pop xs add /xs exch def} def
/stwb { /fs exch def /fn exch def /nbas exch def /textf exch deftextf length /tlen exch def nbas tlen gt {/nbas tlendef} iffn findfont fs sf textf dup length nbas sub nbas getinterval sw
pop neg xs add /xs exch def} def
%%EndProlog
%%BeginSetup
%%EndSetup
newpath  gsave  .25 .25 scale  gsave  0 0 t black[  ] 0 sd 3 lw 1 1 1 c 2268 2207 0 0 bf black 1 1 1 c 2177 949 45 1214 bf black 1 1 1 c 1677 759 328 1309 bf black 1677 759 328 1309 bl 1 1 1 c 1677 759 328 1309 bf black 1677 759 328 1309 bl 0.8 0 0
 c[  12 12 ] 0 sd 6 lw 1 1 1 c black 0.8 0 0 c 328 1309 m 202 X 138 Y 33 X 166 Y 34 X 83 Y 33 X 69 Y 34 X 77 Y 33 X 26 Y 34 X 40 Y 33 X 13 Y 34 X 19 Y 33 X -20 Y 34 X -5 Y 33 X -23 Y 34 X -42 Y 33 X -47 Y 34 X -37 Y 33 X -67 Y 34 X -66 Y 33 X -20 Y
 34 X -87 Y 34 X -26 Y 33 X 63 Y 34 X 76 Y 33 X 53 Y 34 X 54 Y 33 X 82 Y 34 X 39 Y 33 X 36 Y 34 X 7 Y 33 X 20 Y 34 X -4 Y 33 X 11 Y 34 X -59 Y 67 X -47 Y 33 X -40 Y 34 X -110 Y 33 X -59 Y 34 X -133 Y 34 X -180 Y 201 X s black[  ] 0 sd 3 lw 328 1309
 m 1677 X s 328 1331 m -22 Y s 398 1320 m -11 Y s 468 1320 m -11 Y s 538 1320 m -11 Y s 608 1331 m -22 Y s 678 1320 m -11 Y s 747 1320 m -11 Y s 817 1320 m -11 Y s 887 1331 m -22 Y s 957 1320 m -11 Y s 1027 1320 m -11 Y s 1097 1320 m -11 Y s 1167
 1331 m -22 Y s 1236 1320 m -11 Y s 1306 1320 m -11 Y s 1376 1320 m -11 Y s 1446 1331 m -22 Y s 1516 1320 m -11 Y s 1586 1320 m -11 Y s 1655 1320 m -11 Y s 1725 1331 m -22 Y s 1795 1320 m -11 Y s 1865 1320 m -11 Y s 1935 1320 m -11 Y s 2005 1331 m
 -22 Y s
 gsave  2177 949 45 1214 C 324 1303 t 0 r /Helvetica findfont 2.53743 sf 0 0 m (\2556) show NC gr 
 gsave  2177 949 45 1214 C 605 1303 t 0 r /Helvetica findfont 2.53743 sf 0 0 m (\2554) show NC gr 
 gsave  2177 949 45 1214 C 883 1303 t 0 r /Helvetica findfont 2.53743 sf 0 0 m (\2552) show NC gr 
 gsave  2177 949 45 1214 C 1162 1303 t 0 r /Helvetica findfont 2.53743 sf 0 0 m (0) show NC gr 
 gsave  2177 949 45 1214 C 1443 1303 t 0 r /Helvetica findfont 2.53743 sf 0 0 m (2) show NC gr 
 gsave  2177 949 45 1214 C 1721 1303 t 0 r /Helvetica findfont 2.53743 sf 0 0 m (4) show NC gr 
 gsave  2177 949 45 1214 C 2002 1303 t 0 r /Helvetica findfont 2.53743 sf 0 0 m (6) show NC gr  328 1309 m 759 Y s
 gsave  2177 949 45 1214 C 220 1931 t 90 r /Helvetica findfont 43.1363 sf 0 0 m ([pb/bin]) show NC gr  354 1431 m -26 X s 354 1512 m -26 X s 354 1570 m -26 X s 354 1614 m -26 X s 354 1651 m -26 X s 354 1682 m -26 X s 354 1708 m -26 X s 354 1732 m
 -26 X s 381 1753 m -53 X s
 gsave  2177 949 45 1214 C 286 1754 t 0 r /Helvetica findfont 30.4492 sf 0 0 m (\2553) show NC gr 
 gsave  2177 949 45 1214 C 235 1734 t 0 r /Helvetica findfont 45.6737 sf 0 0 m (10) show NC gr  354 1891 m -26 X s 354 1972 m -26 X s 354 2030 m -26 X s 6 lw 1 1 1 c black 328 1309 m 202 X 176 Y 33 X 132 Y 34 X 100 Y 33 X 99 Y 34 X 35 Y 33 X 53 Y 34
 X 8 Y 33 X 6 Y 34 X 20 Y 33 X -8 Y 34 X -12 Y 33 X -28 Y 34 X -46 Y 33 X -35 Y 34 X -54 Y 33 X -53 Y 34 X -38 Y 33 X -59 Y 34 X 29 Y 34 X -26 Y 33 X 21 Y 34 X 28 Y 33 X 72 Y 34 X 19 Y 33 X 29 Y 34 X 56 Y 33 X 23 Y 34 X 29 Y 33 X 43 Y 34 X 14 Y 67 X
 -19 Y 33 X -15 Y 34 X -73 Y 33 X -42 Y 34 X -55 Y 33 X -107 Y 34 X -137 Y 34 X -185 Y 201 X s 0.2 0.2 0.8 c[ 20 12 4 12] 0 sd 1 1 1 c black 0.2 0.2 0.8 c 328 1309 m 202 X 285 Y 33 X 148 Y 34 X 54 Y 33 X 42 Y 34 X 39 Y 33 X 31 Y 34 X 34 Y 33 X 20 Y
 34 X -15 Y 33 X -7 Y 34 X -16 Y 33 X -29 Y 34 X -51 Y 33 X -34 Y 34 X -44 Y 33 X -63 Y 34 X -9 Y 33 X -64 Y 34 X 19 Y 34 X 19 Y 33 X -7 Y 34 X 16 Y 33 X 37 Y 34 X 29 Y 33 X 67 Y 34 X 38 Y 33 X 51 Y 34 X 21 Y 33 X 7 Y 34 X 26 Y 33 X -17 Y 34 X -7 Y
 33 X -32 Y 34 X -29 Y 33 X -23 Y 34 X -97 Y 33 X -19 Y 34 X -139 Y 34 X -281 Y 201 X s black
 gsave  2177 949 45 1214 C 397 1974 t 0 r /Helvetica findfont 53.286 sf 0 0 m (VBF Higgs \(125 GeV\) @ LHC 8 TeV) show NC gr 
 gsave  2177 949 45 1214 C 2048 1746 t 90 r /Helvetica-BoldOblique findfont 25.3743 sf 0 0 m (LHC HIGGS XS WG 2013) show NC gr  1 1 1 c[  ] 0 sd 3 lw 502 208 1260 1354 bf black
 gsave  2177 949 45 1214 C 1384 1519 t 0 r /Helvetica findfont 38.0615 sf 0 0 m (aMC@NLO+HW6) show NC gr  1 1 1 c 1279 1503 m 88 X 48 Y -88 X f black 6 lw 1279 1527 m 88 X s 3 lw /w 29 def /w2 {w 2 div} def /w3 {w 3 div} def 1323 1527 m20 6 lw
 gsave  2177 949 45 1214 C 1384 1448 t 0 r /Helvetica findfont 38.0615 sf 0 0 m (aMC@NLO+PY6) show NC gr  1 1 1 c 3 lw 1279 1434 m 88 X 48 Y -88 X f 6 lw 0.8 0 0 c[  12 12 ] 0 sd 1279 1458 m 88 X s black[  ] 0 sd 3 lw 1323 1458 m20[  12 12 ] 0 sd 6
 lw
 gsave  2177 949 45 1214 C 1384 1379 t 0 r /Helvetica findfont 38.0615 sf 0 0 m (aMC@NLO+HWPP) show NC gr  1 1 1 c[  ] 0 sd 3 lw 1279 1364 m 88 X 49 Y -88 X f[  12 12 ] 0 sd 6 lw 0.2 0.2 0.8 c[ 20 12 4 12] 0 sd 1279 1389 m 88 X s black[  ] 0 sd 3 lw
 1323 1389 m20[ 20 12 4 12] 0 sd 6 lw[  ] 0 sd 3 lw 1 1 1 c black 1 1 1 c 1677 240 328 1062 bf black 1677 240 328 1062 bl 1 1 1 c 1677 240 328 1062 bf black 1677 240 328 1062 bl 328 1062 m 1677 X s 328 1086 m -24 Y s 398 1074 m -12 Y s 468 1074 m
 -12 Y s 538 1074 m -12 Y s 608 1086 m -24 Y s 678 1074 m -12 Y s 747 1074 m -12 Y s 817 1074 m -12 Y s 887 1086 m -24 Y s 957 1074 m -12 Y s 1027 1074 m -12 Y s 1097 1074 m -12 Y s 1167 1086 m -24 Y s 1236 1074 m -12 Y s 1306 1074 m -12 Y s 1376
 1074 m -12 Y s 1446 1086 m -24 Y s 1516 1074 m -12 Y s 1586 1074 m -12 Y s 1655 1074 m -12 Y s 1725 1086 m -24 Y s 1795 1074 m -12 Y s 1865 1074 m -12 Y s 1935 1074 m -12 Y s 2005 1086 m -24 Y s
 gsave  2177 243 45 1059 C 306 1022 t 0 r /Helvetica findfont 45.998 sf 0 0 m (\2556) show NC gr 
 gsave  2177 243 45 1059 C 587 1022 t 0 r /Helvetica findfont 45.998 sf 0 0 m (\2554) show NC gr 
 gsave  2177 243 45 1059 C 866 1022 t 0 r /Helvetica findfont 45.998 sf 0 0 m (\2552) show NC gr 
 gsave  2177 243 45 1059 C 1152 1022 t 0 r /Helvetica findfont 45.998 sf 0 0 m (0) show NC gr 
 gsave  2177 243 45 1059 C 1433 1022 t 0 r /Helvetica findfont 45.998 sf 0 0 m (2) show NC gr 
 gsave  2177 243 45 1059 C 1711 1022 t 0 r /Helvetica findfont 45.998 sf 0 0 m (4) show NC gr 
 gsave  2177 243 45 1059 C 1992 1022 t 0 r /Helvetica findfont 45.998 sf 0 0 m (6) show NC gr  328 1062 m 240 Y s 393 1102 m -65 X s 361 1122 m -33 X s 361 1142 m -33 X s 361 1162 m -33 X s 393 1182 m -65 X s 361 1202 m -33 X s 361 1222 m -33 X s
 361 1242 m -33 X s 393 1262 m -65 X s 393 1102 m -65 X s 361 1082 m -33 X s 361 1062 m -33 X s 393 1262 m -65 X s 361 1282 m -33 X s
 gsave  2177 243 45 1059 C 253 1086 t 0 r /Helvetica findfont 45.998 sf 0 0 m (0.8) show NC gr 
 gsave  2177 243 45 1059 C 299 1164 t 0 r /Helvetica findfont 45.998 sf 0 0 m (1) show NC gr 
 gsave  2177 243 45 1059 C 253 1245 t 0 r /Helvetica findfont 45.998 sf 0 0 m (1.2) show NC gr 
 gsave  2177 243 45 1059 C 370 1230 t 0 r /Helvetica findfont 35.7762 sf 0 0 m (aMC@NLO \255 Ratio over aMC@NLO+HW6) show NC gr  0.8 0 0 c[  12 12 ] 0 sd 6 lw 1 1 1 c black 0.8 0 0 c 328 1062 m 202 X 50 Y 33 X 61 Y 34 X -31 Y 33 X -50 Y 34 X 71 Y 33
 X -46 Y 34 X 58 Y 33 X 13 Y 34 X -2 Y 33 X -24 Y 34 X 14 Y 33 X 10 Y 34 X 7 Y 33 X -22 Y 34 X 35 Y 33 X -30 Y 34 X -51 Y 33 X 73 Y 34 X -136 Y 67 X 6 Y 34 X 80 Y 33 X -35 Y 34 X 65 Y 33 X 120 Y 34 X -42 Y 33 X 33 Y 34 X -52 Y 33 X -50 Y 34 X -35 Y
 33 X 20 Y 34 X -70 Y 33 X 24 Y 34 X 50 Y 33 X 2 Y 34 X -96 Y 33 X 82 Y 34 X 9 Y 34 X -111 Y 201 X s black[  ] 0 sd 1 1 1 c black 328 1062 m 202 X 120 Y 1274 X -120 Y 201 X s 0.2 0.2 0.8 c[ 20 12 4 12] 0 sd 1 1 1 c black 0.2 0.2 0.8 c 328 1062 m 202
 X 240 Y s 630 1302 m -75 Y s 630 1227 m 34 X 11 Y 33 X -46 Y 34 X 55 Y 33 X 32 Y 34 X -80 Y 33 X 3 Y 34 X -7 Y 33 X -2 Y 34 X -11 Y 33 X 2 Y 34 X 22 Y 33 X -22 Y 34 X 64 Y 33 X -13 Y 34 X -23 Y 34 X 90 Y s 1200 1302 m -51 Y s 1200 1251 m 34 X -27 Y
 33 X -71 Y 34 X 18 Y 33 X 84 Y 34 X -43 Y 33 X 67 Y 34 X -20 Y 33 X -79 Y 34 X 25 Y 33 X -36 Y 34 X 25 Y 33 X -33 Y 34 X 94 Y 33 X 47 Y s 1703 1302 m -100 Y s 1703 1202 m 33 X 100 Y s 1804 1302 m -240 Y s 1804 1062 m 201 X s black[  ] 0 sd 3 lw 1 1
 1 c black 1 1 1 c 1677 262 328 797 bf black 1677 262 328 797 bl 1 1 1 c 1677 262 328 797 bf black 1677 262 328 797 bl 328 797 m 1677 X s 328 824 m -27 Y s 398 810 m -13 Y s 468 810 m -13 Y s 538 810 m -13 Y s 608 824 m -27 Y s 678 810 m -13 Y s 747
 810 m -13 Y s 817 810 m -13 Y s 887 824 m -27 Y s 957 810 m -13 Y s 1027 810 m -13 Y s 1097 810 m -13 Y s 1167 824 m -27 Y s 1236 810 m -13 Y s 1306 810 m -13 Y s 1376 810 m -13 Y s 1446 824 m -27 Y s 1516 810 m -13 Y s 1586 810 m -13 Y s 1655 810
 m -13 Y s 1725 824 m -27 Y s 1795 810 m -13 Y s 1865 810 m -13 Y s 1935 810 m -13 Y s 2005 824 m -27 Y s
 gsave  2177 264 45 795 C 306 759 t 0 r /Helvetica findfont 45.8372 sf 0 0 m (\2556) show NC gr 
 gsave  2177 264 45 795 C 587 759 t 0 r /Helvetica findfont 45.8372 sf 0 0 m (\2554) show NC gr 
 gsave  2177 264 45 795 C 866 759 t 0 r /Helvetica findfont 45.8372 sf 0 0 m (\2552) show NC gr 
 gsave  2177 264 45 795 C 1152 759 t 0 r /Helvetica findfont 45.8372 sf 0 0 m (0) show NC gr 
 gsave  2177 264 45 795 C 1433 759 t 0 r /Helvetica findfont 45.8372 sf 0 0 m (2) show NC gr 
 gsave  2177 264 45 795 C 1711 759 t 0 r /Helvetica findfont 45.8372 sf 0 0 m (4) show NC gr 
 gsave  2177 264 45 795 C 1992 759 t 0 r /Helvetica findfont 45.8372 sf 0 0 m (6) show NC gr  328 797 m 262 Y s 393 841 m -65 X s 361 863 m -33 X s 361 885 m -33 X s 361 906 m -33 X s 393 928 m -65 X s 361 950 m -33 X s 361 972 m -33 X s 361 994 m
 -33 X s 393 1016 m -65 X s 393 841 m -65 X s 361 819 m -33 X s 361 797 m -33 X s 393 1016 m -65 X s 361 1037 m -33 X s
 gsave  2177 264 45 795 C 253 825 t 0 r /Helvetica findfont 45.8372 sf 0 0 m (0.8) show NC gr 
 gsave  2177 264 45 795 C 299 911 t 0 r /Helvetica findfont 45.8372 sf 0 0 m (1) show NC gr 
 gsave  2177 264 45 795 C 253 1000 t 0 r /Helvetica findfont 45.8372 sf 0 0 m (1.2) show NC gr 
 gsave  2177 264 45 795 C 370 982 t 0 r /Helvetica findfont 35.6511 sf 0 0 m (POWHEG \255 Ratio over aMC@NLO+HW6) show NC gr  0.8 0 0 c[  12 12 ] 0 sd 6 lw 1 1 1 c black 0.8 0 0 c 328 797 m 403 X 10 Y 33 X 2 Y 34 X 5 Y 67 X 56 Y 33 X -13 Y 34 X 105
 Y 33 X 13 Y 34 X -12 Y 33 X 96 Y s 1066 1059 m -15 Y s 1066 1044 m 33 X 15 Y s 1133 1059 m -77 Y s 1133 982 m 34 X 8 Y 33 X 38 Y 34 X -27 Y 33 X -32 Y 34 X 90 Y s 1334 1059 m -43 Y s 1334 1016 m 34 X -26 Y 33 X -4 Y 34 X -93 Y 33 X -43 Y 34 X -53 Y
 503 X s black[  ] 0 sd 1 1 1 c black 328 797 m 302 X 2 Y 34 X -2 Y 33 X 10 Y 34 X 37 Y 33 X 15 Y 34 X -17 Y 33 X 38 Y 34 X -16 Y 33 X -22 Y 34 X 51 Y 33 X 2 Y 34 X 32 Y 33 X 61 Y 34 X -86 Y 33 X 74 Y 34 X -78 Y 34 X 90 Y 33 X -152 Y 34 X 203 Y 33 X
 -101 Y 34 X -24 Y 33 X 81 Y 34 X -105 Y 33 X 38 Y 34 X -3 Y 33 X -113 Y 34 X 12 Y 33 X -18 Y 34 X 26 Y 33 X -35 Y 34 X 89 Y 33 X -89 Y 336 X s 0.2 0.2 0.8 c[ 20 12 4 12] 0 sd 1 1 1 c black 0.2 0.2 0.8 c 328 797 m 202 X 46 Y 33 X 147 Y 34 X -35 Y 33
 X -121 Y 34 X 27 Y 33 X -60 Y 34 X 52 Y 33 X 2 Y 34 X 6 Y 33 X -21 Y 34 X 13 Y 33 X -4 Y 34 X 16 Y 33 X 19 Y 34 X -8 Y 33 X 84 Y 34 X -46 Y 33 X 96 Y 34 X -61 Y 34 X -29 Y 33 X 38 Y 34 X 5 Y 33 X -76 Y 34 X 47 Y 33 X -15 Y 34 X -56 Y 33 X 57 Y 34 X
 -8 Y 33 X -78 Y 34 X -8 Y 33 X -10 Y 34 X 9 Y 33 X -25 Y 34 X 60 Y 33 X 23 Y 34 X -14 Y 33 X 59 Y 34 X -78 Y 34 X -53 Y 201 X s black[ 20 20] 0 sd 3 lw 328 928 m 1677 X s[  ] 0 sd 1 1 1 c black 1 1 1 c 1677 248 328 547 bf black 1677 248 328 547 bl
 1 1 1 c 1677 248 328 547 bf black 1677 248 328 547 bl 328 547 m 1677 X s
 gsave  2177 354 45 441 C 1931 458 t 0 r /Helvetica findfont 45.7272 sf 0 0 m (j3 y) show NC gr  328 569 m -22 Y s 398 558 m -11 Y s 468 558 m -11 Y s 538 558 m -11 Y s 608 569 m -22 Y s 678 558 m -11 Y s 747 558 m -11 Y s 817 558 m -11 Y s 887 569
 m -22 Y s 957 558 m -11 Y s 1027 558 m -11 Y s 1097 558 m -11 Y s 1167 569 m -22 Y s 1236 558 m -11 Y s 1306 558 m -11 Y s 1376 558 m -11 Y s 1446 569 m -22 Y s 1516 558 m -11 Y s 1586 558 m -11 Y s 1655 558 m -11 Y s 1725 569 m -22 Y s 1795 558 m
 -11 Y s 1865 558 m -11 Y s 1935 558 m -11 Y s 2005 569 m -22 Y s
 gsave  2177 354 45 441 C 306 504 t 0 r /Helvetica findfont 45.7272 sf 0 0 m (\2556) show NC gr 
 gsave  2177 354 45 441 C 587 504 t 0 r /Helvetica findfont 45.7272 sf 0 0 m (\2554) show NC gr 
 gsave  2177 354 45 441 C 866 504 t 0 r /Helvetica findfont 45.7272 sf 0 0 m (\2552) show NC gr 
 gsave  2177 354 45 441 C 1152 504 t 0 r /Helvetica findfont 45.7272 sf 0 0 m (0) show NC gr 
 gsave  2177 354 45 441 C 1433 504 t 0 r /Helvetica findfont 45.7272 sf 0 0 m (2) show NC gr 
 gsave  2177 354 45 441 C 1711 504 t 0 r /Helvetica findfont 45.7272 sf 0 0 m (4) show NC gr 
 gsave  2177 354 45 441 C 1992 504 t 0 r /Helvetica findfont 45.7272 sf 0 0 m (6) show NC gr  328 547 m 248 Y s 374 589 m -46 X s 351 609 m -23 X s 351 630 m -23 X s 351 650 m -23 X s 374 671 m -46 X s 351 692 m -23 X s 351 712 m -23 X s 351 733 m
 -23 X s 374 753 m -46 X s 374 589 m -46 X s 351 568 m -23 X s 351 547 m -23 X s 374 753 m -46 X s 351 774 m -23 X s
 gsave  2177 354 45 441 C 253 572 t 0 r /Helvetica findfont 45.7272 sf 0 0 m (0.8) show NC gr 
 gsave  2177 354 45 441 C 299 656 t 0 r /Helvetica findfont 45.7272 sf 0 0 m (1) show NC gr 
 gsave  2177 354 45 441 C 253 737 t 0 r /Helvetica findfont 45.7272 sf 0 0 m (1.2) show NC gr  0.8 0 0 c
 gsave  2177 354 45 441 C 370 734 t 0 r /Helvetica findfont 40.6464 sf 0 0 m (Scale uncert) show NC gr  black
 gsave  2177 354 45 441 C 370 590 t 0 r /Helvetica findfont 40.6464 sf 0 0 m (PDF uncert) show NC gr  0.8 0 0 c[  12 12 ] 0 sd 6 lw 1 1 1 c black 0.8 0 0 c 328 547 m 202 X 183 Y 33 X -31 Y 34 X 51 Y 33 X -7 Y 34 X -10 Y 33 X 2 Y 34 X -23 Y 33 X -15
 Y 34 X 35 Y 33 X -22 Y 34 X -1 Y 33 X -12 Y 34 X 27 Y 33 X 16 Y 34 X -16 Y 33 X -9 Y 34 X -6 Y 33 X 15 Y 68 X -16 Y 33 X 28 Y 34 X -42 Y 33 X 42 Y 34 X -16 Y 33 X 14 Y 34 X -25 Y 33 X 22 Y 34 X -1 Y 33 X 6 Y 34 X -4 Y 33 X -6 Y 34 X 7 Y 33 X -6 Y
 34 X 3 Y 33 X -25 Y 34 X 43 Y 33 X -14 Y 34 X -26 Y 34 X -161 Y 201 X s 1 1 1 c black 0.8 0 0 c 328 547 m 202 X 77 Y 33 X 21 Y 34 X -32 Y 33 X 4 Y 34 X 6 Y 33 X -1 Y 34 X 15 Y 33 X 9 Y 34 X -22 Y 33 X 15 Y 67 X 7 Y 34 X -17 Y 33 X -10 Y 34 X 10 Y
 33 X 7 Y 34 X 4 Y 33 X -11 Y 34 X -2 Y 34 X 13 Y 33 X -17 Y 34 X 28 Y 33 X -30 Y 34 X 11 Y 33 X -10 Y 34 X 23 Y 33 X -20 Y 34 X 1 Y 33 X -4 Y 34 X 1 Y 33 X 4 Y 34 X -4 Y 33 X 5 Y 34 X -2 Y 33 X 16 Y 34 X -27 Y 33 X 9 Y 34 X 20 Y 34 X -97 Y 201 X s
 black[ 12 16 4 16] 0 sd 1 1 1 c black 328 547 m 202 X 114 Y 33 X 1 Y 34 X 1 Y 33 X -1 Y 67 X 1 Y 67 X -9 Y 34 X 9 Y 100 X 1 Y 101 X 1 Y 33 X -1 Y 168 X 1 Y 67 X -1 Y 34 X 1 Y 33 X -1 Y 34 X -15 Y 33 X 14 Y 134 X -1 Y 34 X 1 Y 100 X -2 Y 34 X 2 Y 33
 X -1 Y 34 X -1 Y 34 X -114 Y 201 X s 1 1 1 c black 328 547 m 202 X 137 Y 33 X -1 Y 34 X -1 Y 167 X 9 Y 34 X -9 Y 100 X -1 Y 34 X -1 Y 33 X 1 Y 34 X -1 Y 67 X 1 Y 67 X -1 Y 101 X -1 Y 33 X 1 Y 34 X -1 Y 67 X 17 Y 33 X -15 Y 67 X 1 Y 34 X -1 Y 33 X 1
 Y 134 X 2 Y 34 X -2 Y 67 X 2 Y 34 X -137 Y 201 X s[ 20 20] 0 sd 3 lw 328 671 m 1677 X s
 gr  gr 
showpage
end
%%EOF
