%!PS-Adobe-2.0 EPSF-2.0
%%BoundingBox:  0 0 567 384
%%Title: plots/ggF_3.14 - DelPhi_ggjj_wo.eps: c1
%%Creator: ROOT Version 5.34/02
%%CreationDate: Wed Jun  5 15:50:50 2013
%%EndComments
%%BeginProlog
80 dict begin
/s {stroke} def /l {lineto} def /m {moveto} def /t {translate} def
/r {rotate} def /rl {roll}  def /R {repeat} def
/d {rlineto} def /rm {rmoveto} def /gr {grestore} def /f {eofill} def
/c {setrgbcolor} def /black {0 setgray} def /sd {setdash} def
/cl {closepath} def /sf {scalefont setfont} def /lw {setlinewidth} def
/box {m dup 0 exch d exch 0 d 0 exch neg d cl} def
/NC{systemdict begin initclip end}def/C{NC box clip newpath}def
/bl {box s} def /bf {box f} def /Y { 0 exch d} def /X { 0 d} def 
/K {{pop pop 0 moveto} exch kshow} bind def
/ita {/ang 15 def gsave [1 0 ang dup sin exch cos div 1 0 0] concat} def 
/mp {newpath /y exch def /x exch def} def
/side {[w .77 mul w .23 mul] .385 w mul sd w 0 l currentpoint t -144 r} def
/mr {mp x y w2 0 360 arc} def /m24 {mr s} def /m20 {mr f} def
/mb {mp x y w2 add m w2 neg 0 d 0 w neg d w 0 d 0 w d cl} def
/mt {mp x y w2 add m w2 neg w neg d w 0 d cl} def
/m21 {mb f} def /m25 {mb s} def /m22 {mt f} def /m26{mt s} def
/m23 {mp x y w2 sub m w2 w d w neg 0 d cl f} def
/m27 {mp x y w2 add m w3 neg w2 neg d w3 w2 neg d w3 w2 d cl s} def
/m28 {mp x w2 sub y w2 sub w3 add m w3 0 d  0 w3 neg d w3 0 d 0 w3 d w3 0 d  0 w3 d w3 neg 0 d 0 w3 d w3 neg 0 d 0 w3 neg d w3 neg 0 d cl s } def
/m29 {mp gsave x w2 sub y w2 add w3 sub m currentpoint t 4 {side} repeat cl fill gr} def
/m30 {mp gsave x w2 sub y w2 add w3 sub m currentpoint t 4 {side} repeat cl s gr} def
/m31 {mp x y w2 sub m 0 w d x w2 sub y m w 0 d x w2 sub y w2 add m w w neg d x w2 sub y w2 sub m w w d s} def
/m32 {mp x y w2 sub m w2 w d w neg 0 d cl s} def
/m33 {mp x y w2 add m w3 neg w2 neg d w3 w2 neg d w3 w2 d cl f} def
/m34 {mp x w2 sub y w2 sub w3 add m w3 0 d  0 w3 neg d w3 0 d 0 w3 d w3 0 d  0 w3 d w3 neg 0 d 0 w3 d w3 neg 0 d 0 w3 neg d w3 neg 0 d cl f } def
/m2 {mp x y w2 sub m 0 w d x w2 sub y m w 0 d s} def
/m5 {mp x w2 sub y w2 sub m w w d x w2 sub y w2 add m w w neg d s} def
/reEncode {exch findfont dup length dict begin {1 index /FID eq  {pop pop} {def} ifelse } forall /Encoding exch def currentdict end dup /FontName get exch definefont pop } def [/Times-Bold /Times-Italic /Times-BoldItalic /Helvetica /Helvetica-Oblique
 /Helvetica-Bold /Helvetica-BoldOblique /Courier /Courier-Oblique /Courier-Bold /Courier-BoldOblique /Times-Roman /AvantGarde-Book /AvantGarde-BookOblique /AvantGarde-Demi /AvantGarde-DemiOblique /Bookman-Demi /Bookman-DemiItalic /Bookman-Light
 /Bookman-LightItalic /Helvetica-Narrow /Helvetica-Narrow-Bold /Helvetica-Narrow-BoldOblique /Helvetica-Narrow-Oblique /NewCenturySchlbk-Roman /NewCenturySchlbk-Bold /NewCenturySchlbk-BoldItalic /NewCenturySchlbk-Italic /Palatino-Bold
 /Palatino-BoldItalic /Palatino-Italic /Palatino-Roman ] {ISOLatin1Encoding reEncode } forall
%%EndProlog
%%BeginSetup
%%EndSetup
newpath  gsave  .25 .25 scale  gsave  0 0 t black[  ] 0 sd 3 lw 1 1 1 c 2268 1538 0 0 bf black 1 1 1 c 1791 984 363 554 bf black 1791 984 363 554 bl 1 1 1 c 1791 984 363 554 bf black 1791 984 363 554 bl 1 0 0 c 6 lw 1 1 1 c 1 0 0 c 393 1409 m s 393
 1429 m s 363 1419 m 20 X s 402 1419 m 21 X s 3 lw /w 21 def /w2 {w 2 div} def /w3 {w 3 div} def 393 1419 m20 6 lw 423 1311 m 20 X s 462 1311 m 20 X s 3 lw 452 1311 m20 6 lw 482 1202 m 20 X s 522 1202 m 20 X s 3 lw 512 1202 m20 6 lw 542 1084 m 20 X s
 582 1084 m 20 X s 3 lw 572 1084 m20 6 lw 602 1015 m 20 X s 641 1015 m 20 X s 3 lw 632 1015 m20 6 lw 661 920 m 21 X s 701 920 m 20 X s 3 lw 691 920 m20 6 lw 721 858 m 20 X s 761 858 m 20 X s 3 lw 751 858 m20 6 lw 781 809 m 20 X s 820 809 m 21 X s 3
 lw 811 809 m20 6 lw 841 766 m 20 X s 880 766 m 20 X s 3 lw 870 766 m20 6 lw 900 728 m 20 X s 940 728 m 20 X s 3 lw 930 728 m20 6 lw 960 692 m 20 X s 1000 692 m 20 X s 3 lw 990 692 m20 6 lw 1020 676 m 20 X s 1059 676 m 20 X s 3 lw 1050 676 m20 6 lw
 1079 657 m 21 X s 1119 657 m 20 X s 3 lw 1109 657 m20 6 lw 1139 636 m 20 X s 1179 636 m 20 X s 3 lw 1169 636 m20 6 lw 1199 619 m 20 X s 1238 619 m 21 X s 3 lw 1229 619 m20 6 lw 1259 613 m 20 X s 1298 613 m 20 X s 3 lw 1288 613 m20 6 lw 1318 603 m 20
 X s 1358 603 m 20 X s 3 lw 1348 603 m20 6 lw 1378 597 m 20 X s 1418 597 m 20 X s 3 lw 1408 597 m20 6 lw 1438 590 m 20 X s 1477 590 m 20 X s 3 lw 1468 590 m20 6 lw 1497 583 m 21 X s 1537 583 m 20 X s 3 lw 1527 583 m20 6 lw 1557 580 m 20 X s 1597 580
 m 20 X s 3 lw 1587 580 m20 6 lw 1617 579 m 20 X s 1657 579 m 20 X s 3 lw 1647 579 m20 6 lw 1677 574 m 20 X s 1716 574 m 20 X s 3 lw 1706 574 m20 6 lw 1736 570 m 20 X s 1776 570 m 20 X s 3 lw 1766 570 m20 6 lw 1796 570 m 20 X s 1836 570 m 20 X s 3 lw
 1826 570 m20 6 lw 1856 569 m 20 X s 1895 569 m 20 X s 3 lw 1886 569 m20 6 lw 1915 565 m 21 X s 1955 565 m 20 X s 3 lw 1945 565 m20 6 lw 1975 566 m 20 X s 2015 566 m 20 X s 3 lw 2005 566 m20 6 lw 2035 564 m 20 X s 2075 564 m 20 X s 3 lw 2065 564 m20
 6 lw 2095 562 m 20 X s 2134 562 m 20 X s 3 lw 2124 562 m20 6 lw black 3 lw 363 554 m 1791 X s
 gsave  2268 1538 0 0 C 2117.84 345.371 t 0 r /Helvetica findfont 48.8732 sf 0 0 m (\255jj) show NC gr 
 gsave  2268 1538 0 0 C 2091.77 345.371 t 0 r /Symbol findfont 48.8732 sf 0 0 m (g) show NC gr 
 gsave  2268 1538 0 0 C 2065.71 345.371 t 0 r /Symbol findfont 48.8732 sf 0 0 m (g) show NC gr 
 gsave  2268 1538 0 0 C 2029.87 381.211 t 0 r /Symbol findfont 71.6807 sf 0 0 m (f) show NC gr 
 gsave  2268 1538 0 0 C 2010.32 381.211 t 0 r /Helvetica findfont 71.6807 sf 0 0 m ( ) show NC gr 
 gsave  2268 1538 0 0 C 1964.7 381.211 t 0 r /Symbol findfont 71.6807 sf 0 0 m (D) show NC gr 
 gsave  2268 1538 0 0 C 1902.8 381.211 t 0 r /Helvetica findfont 71.6807 sf 0 0 m ( \255 ) show NC gr 
 gsave  2268 1538 0 0 C 1863.7 381.211 t 0 r /Symbol findfont 71.6807 sf 0 0 m (p) show NC gr  363 590 m -36 Y s 423 572 m -18 Y s 482 572 m -18 Y s 542 572 m -18 Y s 602 590 m -36 Y s 661 572 m -18 Y s 721 572 m -18 Y s 781 572 m -18 Y s 841 590 m
 -36 Y s 900 572 m -18 Y s 960 572 m -18 Y s 1020 572 m -18 Y s 1079 590 m -36 Y s 1139 572 m -18 Y s 1199 572 m -18 Y s 1259 572 m -18 Y s 1318 590 m -36 Y s 1378 572 m -18 Y s 1438 572 m -18 Y s 1497 572 m -18 Y s 1557 590 m -36 Y s 1617 572 m -18
 Y s 1677 572 m -18 Y s 1736 572 m -18 Y s 1796 590 m -36 Y s 1856 572 m -18 Y s 1915 572 m -18 Y s 1975 572 m -18 Y s 2035 590 m -36 Y s 2035 590 m -36 Y s 2095 572 m -18 Y s 2154 572 m -18 Y s
 gsave  2268 1538 0 0 C 342.112 485.474 t 0 r /Helvetica findfont 71.6807 sf 0 0 m (0) show NC gr 
 gsave  2268 1538 0 0 C 550.638 485.474 t 0 r /Helvetica findfont 71.6807 sf 0 0 m (0.2) show NC gr 
 gsave  2268 1538 0 0 C 788.488 485.474 t 0 r /Helvetica findfont 71.6807 sf 0 0 m (0.4) show NC gr 
 gsave  2268 1538 0 0 C 1029.6 485.474 t 0 r /Helvetica findfont 71.6807 sf 0 0 m (0.6) show NC gr 
 gsave  2268 1538 0 0 C 1267.45 485.474 t 0 r /Helvetica findfont 71.6807 sf 0 0 m (0.8) show NC gr 
 gsave  2268 1538 0 0 C 1537.88 485.474 t 0 r /Helvetica findfont 71.6807 sf 0 0 m (1) show NC gr 
 gsave  2268 1538 0 0 C 1746.4 485.474 t 0 r /Helvetica findfont 71.6807 sf 0 0 m (1.2) show NC gr 
 gsave  2268 1538 0 0 C 1984.25 485.474 t 0 r /Helvetica findfont 71.6807 sf 0 0 m (1.4) show NC gr  363 1538 m 1791 X s 363 1501 m 37 Y s 423 1520 m 18 Y s 482 1520 m 18 Y s 542 1520 m 18 Y s 602 1501 m 37 Y s 661 1520 m 18 Y s 721 1520 m 18 Y s 781
 1520 m 18 Y s 841 1501 m 37 Y s 900 1520 m 18 Y s 960 1520 m 18 Y s 1020 1520 m 18 Y s 1079 1501 m 37 Y s 1139 1520 m 18 Y s 1199 1520 m 18 Y s 1259 1520 m 18 Y s 1318 1501 m 37 Y s 1378 1520 m 18 Y s 1438 1520 m 18 Y s 1497 1520 m 18 Y s 1557 1501
 m 37 Y s 1617 1520 m 18 Y s 1677 1520 m 18 Y s 1736 1520 m 18 Y s 1796 1501 m 37 Y s 1856 1520 m 18 Y s 1915 1520 m 18 Y s 1975 1520 m 18 Y s 2035 1501 m 37 Y s 2035 1501 m 37 Y s 2095 1520 m 18 Y s 2154 1520 m 18 Y s 363 554 m 984 Y s
 gsave  2268 1538 0 0 C 185.718 1502.04 t 90 r /Helvetica findfont 48.8732 sf 0 0 m (\255jj) show NC gr 
 gsave  2268 1538 0 0 C 185.718 1475.97 t 90 r /Symbol findfont 48.8732 sf 0 0 m (g) show NC gr 
 gsave  2268 1538 0 0 C 185.718 1449.9 t 90 r /Symbol findfont 48.8732 sf 0 0 m (g) show NC gr 
 gsave  2268 1538 0 0 C 146.62 1414.06 t 90 r /Symbol findfont 71.6807 sf 0 0 m (f) show NC gr 
 gsave  2268 1538 0 0 C 146.62 1394.52 t 90 r /Helvetica findfont 71.6807 sf 0 0 m ( ) show NC gr 
 gsave  2268 1538 0 0 C 146.62 1348.9 t 90 r /Symbol findfont 71.6807 sf 0 0 m (D) show NC gr 
 gsave  2268 1538 0 0 C 146.62 1293.51 t 90 r /Helvetica findfont 71.6807 sf 0 0 m (d ) show NC gr 
 gsave  2268 1538 0 0 C 71.6807 1423.84 t 90 r /Symbol findfont 71.6807 sf 0 0 m (s) show NC gr 
 gsave  2268 1538 0 0 C 71.6807 1368.45 t 90 r /Helvetica findfont 71.6807 sf 0 0 m (d ) show NC gr  6 lw 85 1294 m 244 Y s
 gsave  2268 1538 0 0 C 104.263 1273.96 t 90 r /Helvetica findfont 71.6807 sf 0 0 m ( ) show NC gr 
 gsave  2268 1538 0 0 C 156.394 1208.8 t 90 r /Helvetica findfont 48.8732 sf 0 0 m (ct6) show NC gr 
 gsave  2268 1538 0 0 C 130.329 1166.44 t 90 r /Symbol findfont 71.6807 sf 0 0 m (s) show NC gr 
 gsave  2268 1538 0 0 C 74.9389 1205.54 t 90 r /Helvetica findfont 71.6807 sf 0 0 m (1) show NC gr  85 1166 m 108 Y s 3 lw 406 554 m -43 X s 406 827 m -43 X s 406 1100 m -43 X s 406 1374 m -43 X s 406 1374 m -43 X s
 gsave  2268 1538 0 0 C 309.53 527.831 t 0 r /Helvetica findfont 71.6807 sf 0 0 m (0) show NC gr 
 gsave  2268 1538 0 0 C 211.784 801.521 t 0 r /Helvetica findfont 71.6807 sf 0 0 m (0.05) show NC gr 
 gsave  2268 1538 0 0 C 260.657 1075.21 t 0 r /Helvetica findfont 71.6807 sf 0 0 m (0.1) show NC gr 
 gsave  2268 1538 0 0 C 211.784 1348.9 t 0 r /Helvetica findfont 71.6807 sf 0 0 m (0.15) show NC gr  2154 554 m 984 Y s 2111 554 m 43 X s 2111 827 m 43 X s 2111 1100 m 43 X s 2111 1374 m 43 X s 2111 1374 m 43 X s 1 0 0 c black 1 0 0 c
 gsave  2268 1538 0 0 C 1700.79 1306.54 t 0 r /Helvetica findfont 42.3568 sf 0 0 m (AU2\255CT10 ) show NC gr  0.4 0.4 0.4 c 6 lw 1 1 1 c 0.4 0.4 0.4 c 393 1343 m s 393 1362 m s 363 1352 m 20 X s 402 1352 m 21 X s 3 lw 393 1352 m20 6 lw 423 1273 m 20
 X s 462 1273 m 20 X s 3 lw 452 1273 m20 6 lw 482 1135 m 20 X s 522 1135 m 20 X s 3 lw 512 1135 m20 6 lw 542 1041 m 20 X s 582 1041 m 20 X s 3 lw 572 1041 m20 6 lw 602 961 m 20 X s 641 961 m 20 X s 3 lw 632 961 m20 6 lw 661 895 m 21 X s 701 895 m 20
 X s 3 lw 691 895 m20 6 lw 721 832 m 20 X s 761 832 m 20 X s 3 lw 751 832 m20 6 lw 781 786 m 20 X s 820 786 m 21 X s 3 lw 811 786 m20 6 lw 841 748 m 20 X s 880 748 m 20 X s 3 lw 870 748 m20 6 lw 900 706 m 20 X s 940 706 m 20 X s 3 lw 930 706 m20 6 lw
 960 677 m 20 X s 1000 677 m 20 X s 3 lw 990 677 m20 6 lw 1020 654 m 20 X s 1059 654 m 20 X s 3 lw 1050 654 m20 6 lw 1079 637 m 21 X s 1119 637 m 20 X s 3 lw 1109 637 m20 6 lw 1139 623 m 20 X s 1179 623 m 20 X s 3 lw 1169 623 m20 6 lw 1199 611 m 20 X
 s 1238 611 m 21 X s 3 lw 1229 611 m20 6 lw 1259 604 m 20 X s 1298 604 m 20 X s 3 lw 1288 604 m20 6 lw 1318 591 m 20 X s 1358 591 m 20 X s 3 lw 1348 591 m20 6 lw 1378 593 m 20 X s 1418 593 m 20 X s 3 lw 1408 593 m20 6 lw 1438 582 m 20 X s 1477 582 m
 20 X s 3 lw 1468 582 m20 6 lw 1497 581 m 21 X s 1537 581 m 20 X s 3 lw 1527 581 m20 6 lw 1557 576 m 20 X s 1597 576 m 20 X s 3 lw 1587 576 m20 6 lw 1617 570 m 20 X s 1657 570 m 20 X s 3 lw 1647 570 m20 6 lw 1677 568 m 20 X s 1716 568 m 20 X s 3 lw
 1706 568 m20 6 lw 1736 567 m 20 X s 1776 567 m 20 X s 3 lw 1766 567 m20 6 lw 1796 567 m 20 X s 1836 567 m 20 X s 3 lw 1826 567 m20 6 lw 1856 565 m 20 X s 1895 565 m 20 X s 3 lw 1886 565 m20 6 lw 1915 562 m 21 X s 1955 562 m 20 X s 3 lw 1945 562 m20
 6 lw 1975 561 m 20 X s 2015 561 m 20 X s 3 lw 2005 561 m20 6 lw 2035 563 m 20 X s 2075 563 m 20 X s 3 lw 2065 563 m20 6 lw 2095 561 m 20 X s 2134 561 m 20 X s 3 lw 2124 561 m20 6 lw black 0.4 0.4 0.4 c
 gsave  2268 1538 0 0 C 1700.79 1247.9 t 0 r /Helvetica findfont 42.3568 sf 0 0 m (no MPI) show NC gr  black
 gsave  2268 1538 0 0 C 2222.1 1016.56 t 90 r /Helvetica-BoldOblique findfont 39.0986 sf 0 0 m (LHC HIGGS XS WG 2013) show NC gr 
 gsave  2268 1538 0 0 C 1837.63 1378.22 t 0 r /Helvetica findfont 42.3568 sf 0 0 m ( = 125 GeV) show NC gr 
 gsave  2268 1538 0 0 C 1818.08 1355.42 t 0 r /Helvetica findfont 29.3239 sf 0 0 m (H) show NC gr 
 gsave  2268 1538 0 0 C 1700.79 1378.22 t 0 r /Helvetica findfont 42.3568 sf 0 0 m (ggF m) show NC gr  3 lw 1 1 1 c black 1 1 1 c 1796 227 359 227 bf black 1796 227 359 227 bl 1 1 1 c 1796 227 359 227 bf black 1796 227 359 227 bl 359 227 m 1796 X s
 359 454 m 1796 X s 359 227 m 227 Y s[ 4 8] 0 sd 2155 227 m -1796 X s 2155 284 m -1796 X s 2155 340 m -1796 X s 2155 397 m -1796 X s 2155 454 m -1796 X s[  ] 0 sd 2155 227 m 227 Y s 1 0 0 c 6 lw 1 1 1 c 1 0 0 c 359 332 m 20 X s 399 332 m 20 X s 3 lw
 389 332 m20 6 lw 419 335 m 20 X s 459 335 m 20 X s 3 lw 449 335 m20 6 lw 479 329 m 20 X s 519 329 m 20 X s 3 lw 509 329 m20 6 lw 539 331 m 20 X s 579 331 m 20 X s 3 lw 569 331 m20 6 lw 599 327 m 20 X s 638 327 m 21 X s 3 lw 629 327 m20 6 lw 659 333
 m 20 X s 698 333 m 20 X s 3 lw 688 333 m20 6 lw 718 331 m 21 X s 758 331 m 20 X s 3 lw 748 331 m20 6 lw 778 330 m 20 X s 818 330 m 20 X s 3 lw 808 330 m20 6 lw 838 331 m 20 X s 878 331 m 20 X s 3 lw 868 331 m20 6 lw 898 326 m 20 X s 938 326 m 20 X s
 3 lw 928 326 m20 6 lw 958 328 m 20 X s 998 328 m 20 X s 3 lw 988 328 m20 6 lw 1018 320 m 20 X s 1057 320 m 21 X s 3 lw 1048 320 m20 6 lw 1078 319 m 20 X s 1117 319 m 20 X s 3 lw 1108 319 m20 6 lw 1137 323 m 21 X s 1177 323 m 20 X s 3 lw 1167 323 m20
 6 lw 1197 325 m 21 X s 1237 325 m 20 X s 3 lw 1227 325 m20 6 lw 1257 323 m 20 X s 1297 323 m 20 X s 3 lw 1287 323 m20 6 lw 1317 313 m 20 X s 1357 313 m 20 X s 3 lw 1347 313 m20 6 lw 1377 329 m 20 X s 1417 329 m 20 X s 3 lw 1407 329 m20 6 lw 1437 316
 m 20 X s 1477 316 m 20 X s 3 lw 1467 316 m20 6 lw 1497 332 m 20 X s 1536 332 m 21 X s 3 lw 1527 332 m20 6 lw 1557 322 m 20 X s 1596 322 m 20 X s 3 lw 1586 322 m20 6 lw 1616 302 m 21 X s 1656 302 m 20 X s 3 lw 1646 302 m20 6 lw 1676 306 m 20 X s 1716
 306 m 20 X s 3 lw 1706 306 m20 6 lw 1766 309 m 2 Y s 1766 330 m 2 Y s 1736 320 m 20 X s 1776 320 m 20 X s 3 lw 1766 320 m20 6 lw 1826 309 m 3 Y s 1826 331 m 2 Y s 1796 321 m 20 X s 1836 321 m 20 X s 3 lw 1826 321 m20 6 lw 1886 302 m 2 Y s 1886 324 m
 2 Y s 1856 314 m 20 X s 1896 314 m 20 X s 3 lw 1886 314 m20 6 lw 1946 301 m 4 Y s 1946 325 m 4 Y s 1916 315 m 20 X s 1955 315 m 21 X s 3 lw 1946 315 m20 6 lw 2006 286 m 1 Y s 2006 307 m 1 Y s 1976 297 m 20 X s 2015 297 m 21 X s 3 lw 2006 297 m20 6
 lw 2065 312 m 6 Y s 2065 338 m 6 Y s 2036 328 m 20 X s 2075 328 m 20 X s 3 lw 2065 328 m20 6 lw 2125 302 m 7 Y s 2125 328 m 7 Y s 2095 318 m 21 X s 2135 318 m 20 X s 3 lw 2125 318 m20 6 lw black 3 lw 359 227 m 1796 X s
 gsave  2245 1261 0 0 C 2121.1 19.5493 t 0 r /Helvetica findfont 45.6197 sf 0 0 m (\255jj) show NC gr 
 gsave  2245 1261 0 0 C 2098.29 19.5493 t 0 r /Symbol findfont 45.6197 sf 0 0 m (g) show NC gr 
 gsave  2245 1261 0 0 C 2075.48 19.5493 t 0 r /Symbol findfont 45.6197 sf 0 0 m (g) show NC gr 
 gsave  2245 1261 0 0 C 2039.64 55.3896 t 0 r /Symbol findfont 71.6881 sf 0 0 m (f) show NC gr 
 gsave  2245 1261 0 0 C 2020.09 55.3896 t 0 r /Helvetica findfont 71.6881 sf 0 0 m ( ) show NC gr 
 gsave  2245 1261 0 0 C 1974.48 55.3896 t 0 r /Symbol findfont 71.6881 sf 0 0 m (D) show NC gr 
 gsave  2245 1261 0 0 C 1912.57 55.3896 t 0 r /Helvetica findfont 71.6881 sf 0 0 m ( \255 ) show NC gr 
 gsave  2245 1261 0 0 C 1873.47 55.3896 t 0 r /Symbol findfont 71.6881 sf 0 0 m (p) show NC gr  359 257 m -30 Y s 419 242 m -15 Y s 479 242 m -15 Y s 539 242 m -15 Y s 599 257 m -30 Y s 659 242 m -15 Y s 718 242 m -15 Y s 778 242 m -15 Y s 838 257 m
 -30 Y s 898 242 m -15 Y s 958 242 m -15 Y s 1018 242 m -15 Y s 1078 257 m -30 Y s 1137 242 m -15 Y s 1197 242 m -15 Y s 1257 242 m -15 Y s 1317 257 m -30 Y s 1377 242 m -15 Y s 1437 242 m -15 Y s 1497 242 m -15 Y s 1557 257 m -30 Y s 1616 242 m -15
 Y s 1676 242 m -15 Y s 1736 242 m -15 Y s 1796 257 m -30 Y s 1856 242 m -15 Y s 1916 242 m -15 Y s 1976 242 m -15 Y s 2036 257 m -30 Y s 2036 257 m -30 Y s 2095 242 m -15 Y s
 gsave  2245 1261 0 0 C 338.854 162.911 t 0 r /Helvetica findfont 71.6881 sf 0 0 m (0) show NC gr 
 gsave  2245 1261 0 0 C 547.38 162.911 t 0 r /Helvetica findfont 71.6881 sf 0 0 m (0.2) show NC gr 
 gsave  2245 1261 0 0 C 788.488 162.911 t 0 r /Helvetica findfont 71.6881 sf 0 0 m (0.4) show NC gr 
 gsave  2245 1261 0 0 C 1026.34 162.911 t 0 r /Helvetica findfont 71.6881 sf 0 0 m (0.6) show NC gr 
 gsave  2245 1261 0 0 C 1267.45 162.911 t 0 r /Helvetica findfont 71.6881 sf 0 0 m (0.8) show NC gr 
 gsave  2245 1261 0 0 C 1537.88 162.911 t 0 r /Helvetica findfont 71.6881 sf 0 0 m (1) show NC gr 
 gsave  2245 1261 0 0 C 1746.4 162.911 t 0 r /Helvetica findfont 71.6881 sf 0 0 m (1.2) show NC gr 
 gsave  2245 1261 0 0 C 1984.25 162.911 t 0 r /Helvetica findfont 71.6881 sf 0 0 m (1.4) show NC gr  359 454 m 1796 X s 359 424 m 30 Y s 419 439 m 15 Y s 479 439 m 15 Y s 539 439 m 15 Y s 599 424 m 30 Y s 659 439 m 15 Y s 718 439 m 15 Y s 778 439 m
 15 Y s 838 424 m 30 Y s 898 439 m 15 Y s 958 439 m 15 Y s 1018 439 m 15 Y s 1078 424 m 30 Y s 1137 439 m 15 Y s 1197 439 m 15 Y s 1257 439 m 15 Y s 1317 424 m 30 Y s 1377 439 m 15 Y s 1437 439 m 15 Y s 1497 439 m 15 Y s 1557 424 m 30 Y s 1616 439 m
 15 Y s 1676 439 m 15 Y s 1736 439 m 15 Y s 1796 424 m 30 Y s 1856 439 m 15 Y s 1916 439 m 15 Y s 1976 439 m 15 Y s 2036 424 m 30 Y s 2036 424 m 30 Y s 2095 439 m 15 Y s 359 227 m 227 Y s
 gsave  2245 1261 0 0 C 130.329 110.779 t 90 r /Helvetica findfont 58.6539 sf 0 0 m (no MPI / ct10) show NC gr  371 227 m -12 X s 371 284 m -12 X s 371 340 m -12 X s 371 397 m -12 X s 371 454 m -12 X s
 gsave  2245 1261 0 0 C 312.788 205.267 t 0 r /Helvetica findfont 58.6539 sf 0 0 m (0) show NC gr 
 gsave  2245 1261 0 0 C 263.915 263.915 t 0 r /Helvetica findfont 58.6539 sf 0 0 m (0.5) show NC gr 
 gsave  2245 1261 0 0 C 322.563 319.305 t 0 r /Helvetica findfont 58.6539 sf 0 0 m (1) show NC gr 
 gsave  2245 1261 0 0 C 263.915 374.695 t 0 r /Helvetica findfont 58.6539 sf 0 0 m (1.5) show NC gr 
 gsave  2245 1261 0 0 C 312.788 433.342 t 0 r /Helvetica findfont 58.6539 sf 0 0 m (2) show NC gr  2155 227 m 227 Y s 2143 227 m 12 X s 2143 284 m 12 X s 2143 340 m 12 X s 2143 397 m 12 X s 2143 454 m 12 X s
 gr  gr showpage
end
%%EOF
