%!PS-Adobe-2.0 EPSF-2.0
%%BoundingBox:  0 0 567 544
%%Title: HWW_900_met_rel_NNLO_cut_YR3.eps: HWW 900Gev MET rel NNLO with cuts
%%Creator: ROOT Version 5.34/05
%%CreationDate: Fri Jun 14 04:49:36 2013
%%EndComments
%%BeginProlog
80 dict begin
/s {stroke} def /l {lineto} def /m {moveto} def /t {translate} def
/r {rotate} def /rl {roll}  def /R {repeat} def
/d {rlineto} def /rm {rmoveto} def /gr {grestore} def /f {eofill} def
/c {setrgbcolor} def /black {0 setgray} def /sd {setdash} def
/cl {closepath} def /sf {scalefont setfont} def /lw {setlinewidth} def
/box {m dup 0 exch d exch 0 d 0 exch neg d cl} def
/NC{systemdict begin initclip end}def/C{NC box clip newpath}def
/bl {box s} def /bf {box f} def /Y { 0 exch d} def /X { 0 d} def 
/K {{pop pop 0 moveto} exch kshow} bind def
/ita {/ang 15 def gsave [1 0 ang dup sin exch cos div 1 0 0] concat} def 
/mp {newpath /y exch def /x exch def} def
/side {[w .77 mul w .23 mul] .385 w mul sd w 0 l currentpoint t -144 r} def
/mr {mp x y w2 0 360 arc} def /m24 {mr s} def /m20 {mr f} def
/mb {mp x y w2 add m w2 neg 0 d 0 w neg d w 0 d 0 w d cl} def
/mt {mp x y w2 add m w2 neg w neg d w 0 d cl} def
/m21 {mb f} def /m25 {mb s} def /m22 {mt f} def /m26{mt s} def
/m23 {mp x y w2 sub m w2 w d w neg 0 d cl f} def
/m27 {mp x y w2 add m w3 neg w2 neg d w3 w2 neg d w3 w2 d cl s} def
/m28 {mp x w2 sub y w2 sub w3 add m w3 0 d  0 w3 neg d w3 0 d 0 w3 d w3 0 d  0 w3 d w3 neg 0 d 0 w3 d w3 neg 0 d 0 w3 neg d w3 neg 0 d cl s } def
/m29 {mp gsave x w2 sub y w2 add w3 sub m currentpoint t 4 {side} repeat cl fill gr} def
/m30 {mp gsave x w2 sub y w2 add w3 sub m currentpoint t 4 {side} repeat cl s gr} def
/m31 {mp x y w2 sub m 0 w d x w2 sub y m w 0 d x w2 sub y w2 add m w w neg d x w2 sub y w2 sub m w w d s} def
/m32 {mp x y w2 sub m w2 w d w neg 0 d cl s} def
/m33 {mp x y w2 add m w3 neg w2 neg d w3 w2 neg d w3 w2 d cl f} def
/m34 {mp x w2 sub y w2 sub w3 add m w3 0 d  0 w3 neg d w3 0 d 0 w3 d w3 0 d  0 w3 d w3 neg 0 d 0 w3 d w3 neg 0 d 0 w3 neg d w3 neg 0 d cl f } def
/m2 {mp x y w2 sub m 0 w d x w2 sub y m w 0 d s} def
/m5 {mp x w2 sub y w2 sub m w w d x w2 sub y w2 add m w w neg d s} def
/reEncode {exch findfont dup length dict begin {1 index /FID eq  {pop pop} {def} ifelse } forall /Encoding exch def currentdict end dup /FontName get exch definefont pop } def [/Times-Bold /Times-Italic /Times-BoldItalic /Helvetica /Helvetica-Oblique
 /Helvetica-Bold /Helvetica-BoldOblique /Courier /Courier-Oblique /Courier-Bold /Courier-BoldOblique /Times-Roman /AvantGarde-Book /AvantGarde-BookOblique /AvantGarde-Demi /AvantGarde-DemiOblique /Bookman-Demi /Bookman-DemiItalic /Bookman-Light
 /Bookman-LightItalic /Helvetica-Narrow /Helvetica-Narrow-Bold /Helvetica-Narrow-BoldOblique /Helvetica-Narrow-Oblique /NewCenturySchlbk-Roman /NewCenturySchlbk-Bold /NewCenturySchlbk-BoldItalic /NewCenturySchlbk-Italic /Palatino-Bold
 /Palatino-BoldItalic /Palatino-Italic /Palatino-Roman ] {ISOLatin1Encoding reEncode } forall
%%EndProlog
%%BeginSetup
%%EndSetup
newpath  gsave  .25 .25 scale  gsave  0 0 t black[  ] 0 sd 3 lw 1 1 1 c 2268 2177 0 0 bf black 1 1 1 c 2222 2133 23 22 bf black 1 1 1 c 1778 1706 245 235 bf black 1778 1706 245 235 bl 0.8 0 0.8 c 1 1 1 c 1 0 1 c 0.8 0 0.8 c 245 948 m 18 X 5 Y 17 X 13
 Y 18 X -1 Y 18 X 9 Y 18 X 23 Y 18 X 17 Y 17 X 19 Y 18 X 20 Y 18 X 22 Y 18 X 13 Y 17 X 22 Y 18 X 20 Y 18 X 15 Y 18 X -1 Y 18 X 22 Y 17 X 24 Y 18 X 14 Y 18 X 30 Y 18 X 41 Y 17 X 42 Y 18 X 69 Y 18 X 278 Y 18 X 178 Y 18 X 8 Y 17 X 8 Y 18 X 2 Y 18 X -28
 Y 18 X -8 Y 18 X -18 Y 17 X -17 Y 18 X 28 Y 18 X -19 Y 18 X -15 Y 17 X -31 Y 18 X -52 Y 18 X -7 Y 18 X -58 Y 18 X -70 Y 17 X -57 Y 18 X -164 Y 18 X -122 Y 18 X -86 Y 17 X -83 Y 18 X -70 Y 18 X -74 Y 18 X -48 Y 18 X -49 Y 17 X -55 Y 18 X -52 Y 18 X
 -35 Y 18 X -36 Y 17 X -40 Y 18 X -28 Y 18 X -26 Y 18 X -24 Y 18 X -24 Y 17 X -20 Y 18 X -21 Y 18 X -17 Y 18 X -18 Y 17 X -14 Y 18 X -13 Y 18 X -9 Y 18 X -14 Y 18 X -10 Y 17 X -10 Y 18 X -12 Y 18 X -7 Y 18 X -6 Y 17 X -6 Y 18 X -6 Y 18 X -5 Y 18 X -6
 Y 18 X -4 Y 17 X -4 Y 18 X -5 Y 18 X -4 Y 18 X -3 Y 17 X -2 Y 18 X -5 Y 18 X -2 Y 18 X -2 Y 18 X -3 Y 17 X -2 Y 18 X -2 Y 18 X -2 Y 18 X -1 Y 17 X -2 Y 18 X -2 Y 18 X -1 Y 18 X -1 Y 18 X -2 Y 35 X -1 Y 18 X -1 Y 18 X -1 Y 17 X -1 Y 36 X -1 Y 18 X s
 black 245 235 m 1778 X s
 gsave  2222 2133 23 22 C 1925.85 75.9704 t 0 r /Helvetica findfont 45.6261 sf 0 0 m (T,rel) show NC gr 
 gsave  2222 2133 23 22 C 1925.85 129.15 t 0 r /Helvetica findfont 45.6261 sf 0 0 m (miss) show NC gr 
 gsave  2222 2133 23 22 C 1880.27 94.963 t 0 r /Helvetica findfont 68.4392 sf 0 0 m (E) show NC gr  245 286 m -51 Y s 289 261 m -26 Y s 334 261 m -26 Y s 378 261 m -26 Y s 423 286 m -51 Y s 467 261 m -26 Y s 512 261 m -26 Y s 556 261 m -26 Y s 600
 286 m -51 Y s 645 261 m -26 Y s 689 261 m -26 Y s 734 261 m -26 Y s 778 286 m -51 Y s 823 261 m -26 Y s 867 261 m -26 Y s 912 261 m -26 Y s 956 286 m -51 Y s 1001 261 m -26 Y s 1045 261 m -26 Y s 1089 261 m -26 Y s 1134 286 m -51 Y s 1178 261 m -26
 Y s 1223 261 m -26 Y s 1267 261 m -26 Y s 1312 286 m -51 Y s 1356 261 m -26 Y s 1401 261 m -26 Y s 1445 261 m -26 Y s 1489 286 m -51 Y s 1534 261 m -26 Y s 1578 261 m -26 Y s 1623 261 m -26 Y s 1667 286 m -51 Y s 1712 261 m -26 Y s 1756 261 m -26 Y
 s 1801 261 m -26 Y s 1845 286 m -51 Y s 1889 261 m -26 Y s 1934 261 m -26 Y s 1978 261 m -26 Y s 2023 286 m -51 Y s
 gsave  2222 2133 23 22 C 224.113 167.135 t 0 r /Helvetica findfont 68.4392 sf 0 0 m (0) show NC gr 
 gsave  2222 2133 23 22 C 383.651 167.135 t 0 r /Helvetica findfont 68.4392 sf 0 0 m (20) show NC gr 
 gsave  2222 2133 23 22 C 562.181 167.135 t 0 r /Helvetica findfont 68.4392 sf 0 0 m (40) show NC gr 
 gsave  2222 2133 23 22 C 736.913 167.135 t 0 r /Helvetica findfont 68.4392 sf 0 0 m (60) show NC gr 
 gsave  2222 2133 23 22 C 915.443 167.135 t 0 r /Helvetica findfont 68.4392 sf 0 0 m (80) show NC gr 
 gsave  2222 2133 23 22 C 1074.98 167.135 t 0 r /Helvetica findfont 68.4392 sf 0 0 m (100) show NC gr 
 gsave  2222 2133 23 22 C 1253.51 167.135 t 0 r /Helvetica findfont 68.4392 sf 0 0 m (120) show NC gr 
 gsave  2222 2133 23 22 C 1432.04 167.135 t 0 r /Helvetica findfont 68.4392 sf 0 0 m (140) show NC gr 
 gsave  2222 2133 23 22 C 1606.77 167.135 t 0 r /Helvetica findfont 68.4392 sf 0 0 m (160) show NC gr 
 gsave  2222 2133 23 22 C 1785.3 167.135 t 0 r /Helvetica findfont 68.4392 sf 0 0 m (180) show NC gr 
 gsave  2222 2133 23 22 C 1963.83 167.135 t 0 r /Helvetica findfont 68.4392 sf 0 0 m (200) show NC gr  245 235 m 1706 Y s
 gsave  2222 2133 23 22 C 106.359 1135.76 t 90 r /Helvetica findfont 45.6261 sf 0 0 m (T,rel) show NC gr 
 gsave  2222 2133 23 22 C 45.5822 1135.76 t 90 r /Helvetica findfont 45.6261 sf 0 0 m (miss) show NC gr 
 gsave  2222 2133 23 22 C 83.5674 1029.4 t 90 r /Helvetica findfont 68.4392 sf 0 0 m (/dE) show NC gr 
 gsave  2222 2133 23 22 C 83.5674 987.615 t 90 r /Symbol findfont 68.4392 sf 0 0 m (s) show NC gr 
 gsave  2222 2133 23 22 C 79.7689 953.429 t 90 r /Helvetica findfont 68.4392 sf 0 0 m (d) show NC gr  298 235 m -53 X s 272 279 m -27 X s 272 323 m -27 X s 272 367 m -27 X s 272 411 m -27 X s 298 455 m -53 X s 272 499 m -27 X s 272 543 m -27 X s 272
 587 m -27 X s 272 631 m -27 X s 298 675 m -53 X s 272 719 m -27 X s 272 763 m -27 X s 272 807 m -27 X s 272 851 m -27 X s 298 895 m -53 X s 272 939 m -27 X s 272 983 m -27 X s 272 1027 m -27 X s 272 1072 m -27 X s 298 1116 m -53 X s 272 1160 m -27 X
 s 272 1204 m -27 X s 272 1248 m -27 X s 272 1292 m -27 X s 298 1336 m -53 X s 272 1380 m -27 X s 272 1424 m -27 X s 272 1468 m -27 X s 272 1512 m -27 X s 298 1556 m -53 X s 272 1600 m -27 X s 272 1644 m -27 X s 272 1688 m -27 X s 272 1732 m -27 X s
 298 1776 m -53 X s 298 1776 m -53 X s 272 1820 m -27 X s 272 1864 m -27 X s 272 1908 m -27 X s
 gsave  2222 2133 23 22 C 208.919 220.314 t 0 r /Helvetica findfont 38.0218 sf 0 0 m (0) show NC gr 
 gsave  2222 2133 23 22 C 144.344 440.628 t 0 r /Helvetica findfont 38.0218 sf 0 0 m (0.001) show NC gr 
 gsave  2222 2133 23 22 C 136.747 660.943 t 0 r /Helvetica findfont 38.0218 sf 0 0 m (0.002) show NC gr 
 gsave  2222 2133 23 22 C 136.747 881.257 t 0 r /Helvetica findfont 38.0218 sf 0 0 m (0.003) show NC gr 
 gsave  2222 2133 23 22 C 136.747 1101.57 t 0 r /Helvetica findfont 38.0218 sf 0 0 m (0.004) show NC gr 
 gsave  2222 2133 23 22 C 136.747 1321.89 t 0 r /Helvetica findfont 38.0218 sf 0 0 m (0.005) show NC gr 
 gsave  2222 2133 23 22 C 136.747 1542.2 t 0 r /Helvetica findfont 38.0218 sf 0 0 m (0.006) show NC gr 
 gsave  2222 2133 23 22 C 136.747 1762.51 t 0 r /Helvetica findfont 38.0218 sf 0 0 m (0.007) show NC gr  0.8 0 0.8 c 1 0 1 c /w 2 def /w2 {w 2 div} def /w3 {w 3 div} def 254 948 m20 272 953 m20 289 966 m20 307 965 m20 325 974 m20 343 997 m20 360 1014
 m20 378 1033 m20 396 1053 m20 414 1075 m20 432 1088 m20 449 1110 m20 467 1130 m20 485 1145 m20 503 1144 m20 520 1166 m20 538 1190 m20 556 1204 m20 574 1234 m20 592 1275 m20 609 1317 m20 627 1386 m20 645 1664 m20 663 1842 m20 680 1850 m20 698 1858
 m20 716 1860 m20 734 1832 m20 752 1824 m20 769 1806 m20 787 1789 m20 805 1817 m20 823 1798 m20 841 1783 m20 858 1752 m20 876 1700 m20 894 1693 m20 912 1635 m20 929 1565 m20 947 1508 m20 965 1344 m20 983 1222 m20 1001 1136 m20 1018 1053 m20 1036 983
 m20 1054 909 m20 1072 861 m20 1089 812 m20 1107 757 m20 1125 705 m20 1143 670 m20 1161 634 m20 1178 594 m20 1196 566 m20 1214 540 m20 1232 516 m20 1249 492 m20 1267 472 m20 1285 451 m20 1303 434 m20 1321 416 m20 1338 402 m20 1356 389 m20 1374 380
 m20 1392 366 m20 1409 356 m20 1427 346 m20 1445 334 m20 1463 327 m20 1481 321 m20 1498 315 m20 1516 309 m20 1534 304 m20 1552 298 m20 1569 294 m20 1587 290 m20 1605 285 m20 1623 281 m20 1641 278 m20 1658 276 m20 1676 271 m20 1694 269 m20 1712 267
 m20 1729 264 m20 1747 262 m20 1765 260 m20 1783 258 m20 1801 257 m20 1818 255 m20 1836 253 m20 1854 252 m20 1872 251 m20 1889 249 m20 1907 249 m20 1925 248 m20 1943 247 m20 1961 246 m20 1978 245 m20 1996 245 m20 2014 244 m20 0.8 0 0.8 c black 0.8 0
 0.8 c 1 lw << /PatternType 1 /PaintType 2 /TilingType 1 /BBox [ 0 0 100 100 ] /XStep 100 /YStep 100 /PaintProc { begin gsave 0 0 m 100 100 l 0 100 m 100 0 l s gr end } >> [ 0.24 0 0 0.24 0 0 ] makepattern /P13 exch def /cs {[/Pattern /DeviceRGB]
 setcolorspace} def /FA {f [/DeviceRGB] setcolorspace} def cs 0.8 0 0.8 P13 setcolor 254 954 m 18 5 d 17 12 d 18 X 18 8 d 18 23 d 17 18 d 18 19 d 18 19 d 18 23 d 18 13 d 17 22 d 18 20 d 18 15 d 18 X 17 22 d 18 24 d 18 13 d 18 31 d 18 41 d 17 42 d 18
 69 d 18 281 d 18 179 d 17 9 d 18 7 d 18 3 d 18 -29 d 18 -7 d 17 -18 d 18 -18 d 18 29 d 18 -19 d 18 -15 d 17 -30 d 18 -53 d 18 -7 d 18 -57 d 17 -71 d 18 -57 d 18 -166 d 18 -123 d 18 -86 d 17 -84 d 18 -70 d 18 -75 d 18 -49 d 17 -49 d 18 -55 d 18 -53 d
 18 -35 d 18 -37 d 17 -40 d 18 -28 d 18 -26 d 18 -24 d 17 -25 d 18 -20 d 18 -21 d 18 -18 d 18 -18 d 17 -14 d 18 -13 d 18 -9 d 18 -15 d 17 -9 d 18 -11 d 18 -11 d 18 -7 d 18 -6 d 17 -7 d 18 -6 d 18 -5 d 18 -6 d 17 -4 d 18 -4 d 18 -5 d 18 -4 d 18 -3 d
 17 -2 d 18 -6 d 18 -1 d 18 -3 d 17 -2 d 18 -3 d 18 -1 d 18 -2 d 18 -1 d 17 -3 d 18 -1 d 18 -2 d 18 X 17 -2 d 18 -1 d 18 -1 d 18 -1 d 18 -1 d 17 -1 d 18 X 18 -1 d -18 X -18 1 d -17 X -18 2 d -18 1 d -18 1 d -18 X -17 2 d -18 X -18 2 d -18 1 d -17 3 d
 -18 1 d -18 2 d -18 1 d -18 3 d -17 2 d -18 2 d -18 2 d -18 5 d -17 2 d -18 3 d -18 4 d -18 5 d -18 4 d -17 4 d -18 5 d -18 6 d -18 6 d -17 6 d -18 6 d -18 7 d -18 11 d -18 10 d -17 10 d -18 15 d -18 8 d -18 13 d -17 14 d -18 17 d -18 18 d -18 20 d
 -18 20 d -17 24 d -18 24 d -18 25 d -18 28 d -17 39 d -18 36 d -18 35 d -18 52 d -18 54 d -17 48 d -18 48 d -18 74 d -18 69 d -17 83 d -18 85 d -18 120 d -18 163 d -18 57 d -17 70 d -18 58 d -18 7 d -18 51 d -17 32 d -18 15 d -18 18 d -18 -27 d -18
 18 d -17 18 d -18 7 d -18 29 d -18 -2 d -18 -8 d -17 -8 d -18 -177 d -18 -276 d -18 -69 d -17 -41 d -18 -41 d -18 -30 d -18 -13 d -18 -24 d -17 -22 d -18 X -18 -15 d -18 -19 d -17 -22 d -18 -13 d -18 -22 d -18 -20 d -18 -18 d -17 -18 d -18 -23 d -18
 -8 d -18 X -17 -12 d -18 -5 d FA 3 lw 0.8 0.8 0 c 1 1 1 c 1 1 0 c 0.8 0.8 0 c 245 761 m 18 X 5 Y 17 X 8 Y 18 X 1 Y 18 X 7 Y 18 X 17 Y 18 X 10 Y 17 X 15 Y 18 X 14 Y 18 X 15 Y 18 X 8 Y 17 X 15 Y 18 X 10 Y 18 X 9 Y 18 X -1 Y 18 X 16 Y 17 X 14 Y 18 X 8
 Y 18 X 20 Y 18 X 25 Y 17 X 24 Y 18 X 45 Y 18 X 189 Y 18 X 119 Y 18 X 7 Y 17 X 8 Y 18 X -2 Y 18 X -10 Y 18 X -6 Y 18 X -15 Y 17 X -11 Y 18 X 23 Y 18 X -18 Y 18 X -5 Y 17 X -27 Y 18 X -35 Y 18 X -5 Y 18 X -40 Y 18 X -55 Y 17 X -42 Y 18 X -118 Y 18 X
 -85 Y 18 X -60 Y 17 X -64 Y 18 X -46 Y 18 X -51 Y 18 X -33 Y 18 X -35 Y 17 X -36 Y 18 X -33 Y 18 X -25 Y 18 X -25 Y 17 X -25 Y 18 X -20 Y 18 X -17 Y 18 X -17 Y 18 X -16 Y 17 X -13 Y 18 X -15 Y 18 X -12 Y 18 X -12 Y 17 X -9 Y 18 X -9 Y 18 X -6 Y 18 X
 -10 Y 18 X -8 Y 17 X -7 Y 18 X -7 Y 18 X -5 Y 18 X -4 Y 17 X -4 Y 18 X -5 Y 18 X -4 Y 18 X -4 Y 18 X -3 Y 17 X -3 Y 18 X -3 Y 18 X -3 Y 18 X -2 Y 17 X -1 Y 18 X -4 Y 18 X -1 Y 18 X -2 Y 18 X -2 Y 17 X -1 Y 18 X -2 Y 18 X -1 Y 18 X -1 Y 17 X -2 Y 18
 X -1 Y 18 X -1 Y 36 X -2 Y 35 X -1 Y 36 X -2 Y 53 X -1 Y 18 X s 1 1 0 c 254 761 m20 272 766 m20 289 774 m20 307 775 m20 325 782 m20 343 799 m20 360 809 m20 378 824 m20 396 838 m20 414 853 m20 432 861 m20 449 876 m20 467 886 m20 485 895 m20 503 894
 m20 520 910 m20 538 924 m20 556 932 m20 574 952 m20 592 977 m20 609 1001 m20 627 1046 m20 645 1235 m20 663 1354 m20 680 1361 m20 698 1369 m20 716 1367 m20 734 1357 m20 752 1351 m20 769 1336 m20 787 1325 m20 805 1348 m20 823 1330 m20 841 1325 m20 858
 1298 m20 876 1263 m20 894 1258 m20 912 1218 m20 929 1163 m20 947 1121 m20 965 1003 m20 983 918 m20 1001 858 m20 1018 794 m20 1036 748 m20 1054 697 m20 1072 664 m20 1089 629 m20 1107 593 m20 1125 560 m20 1143 535 m20 1161 510 m20 1178 485 m20 1196
 465 m20 1214 448 m20 1232 431 m20 1249 415 m20 1267 402 m20 1285 387 m20 1303 375 m20 1321 363 m20 1338 354 m20 1356 345 m20 1374 339 m20 1392 329 m20 1409 321 m20 1427 314 m20 1445 307 m20 1463 302 m20 1481 298 m20 1498 294 m20 1516 289 m20 1534
 285 m20 1552 281 m20 1569 278 m20 1587 275 m20 1605 272 m20 1623 269 m20 1641 267 m20 1658 266 m20 1676 262 m20 1694 261 m20 1712 259 m20 1729 257 m20 1747 256 m20 1765 254 m20 1783 253 m20 1801 252 m20 1818 250 m20 1836 249 m20 1854 248 m20 1872
 248 m20 1889 246 m20 1907 246 m20 1925 245 m20 1943 245 m20 1961 243 m20 1978 243 m20 1996 243 m20 2014 242 m20 0.8 0.8 0 c black 0.8 0.8 0 c cs 0.8 0.8 0 P13 setcolor 254 765 m 18 5 d 17 7 d 18 2 d 18 6 d 18 18 d 17 10 d 18 15 d 18 14 d 18 14 d 18
 8 d 17 16 d 18 10 d 18 9 d 18 -1 d 17 16 d 18 14 d 18 9 d 18 19 d 18 25 d 17 24 d 18 46 d 18 190 d 18 120 d 17 8 d 18 8 d 18 -3 d 18 -9 d 18 -6 d 17 -15 d 18 -11 d 18 23 d 18 -18 d 18 -5 d 17 -26 d 18 -36 d 18 -5 d 18 -40 d 17 -54 d 18 -43 d 18 -119
 d 18 -86 d 18 -60 d 17 -66 d 18 -46 d 18 -51 d 18 -33 d 17 -35 d 18 -37 d 18 -33 d 18 -25 d 18 -26 d 17 -25 d 18 -20 d 18 -17 d 18 -17 d 17 -16 d 18 -13 d 18 -15 d 18 -13 d 18 -11 d 17 -10 d 18 -9 d 18 -6 d 18 -10 d 17 -8 d 18 -7 d 18 -7 d 18 -5 d
 18 -5 d 17 -3 d 18 -5 d 18 -4 d 18 -4 d 17 -3 d 18 -3 d 18 -4 d 18 -3 d 18 -1 d 17 -2 d 18 -4 d 18 -1 d 18 -2 d 17 -2 d 18 -1 d 18 -2 d 18 -1 d 18 -1 d 17 -1 d 18 -2 d 18 -1 d 18 X 17 -2 d 18 X 18 -1 d 18 X 18 -1 d 17 -1 d 18 X 18 -1 d -18 X -18 1 d
 -17 X -18 1 d -18 1 d -18 1 d -18 X -17 1 d -18 1 d -18 1 d -18 1 d -17 1 d -18 2 d -18 1 d -18 1 d -18 2 d -17 1 d -18 2 d -18 2 d -18 3 d -17 2 d -18 1 d -18 3 d -18 4 d -18 3 d -17 3 d -18 3 d -18 4 d -18 5 d -17 4 d -18 4 d -18 5 d -18 7 d -18 7
 d -17 7 d -18 11 d -18 5 d -18 9 d -17 10 d -18 11 d -18 12 d -18 15 d -18 13 d -17 16 d -18 17 d -18 16 d -18 20 d -17 25 d -18 25 d -18 26 d -18 32 d -18 36 d -17 35 d -18 32 d -18 50 d -18 46 d -17 64 d -18 60 d -18 83 d -18 117 d -18 42 d -17 54
 d -18 40 d -18 5 d -18 36 d -17 26 d -18 6 d -18 18 d -18 -23 d -18 12 d -17 14 d -18 6 d -18 10 d -18 3 d -18 -8 d -17 -7 d -18 -118 d -18 -187 d -18 -46 d -17 -24 d -18 -24 d -18 -20 d -18 -8 d -18 -14 d -17 -16 d -18 1 d -18 -9 d -18 -10 d -17
 -15 d -18 -8 d -18 -15 d -18 -13 d -18 -16 d -17 -9 d -18 -18 d -18 -6 d -18 -2 d -17 -7 d -18 -5 d FA black 1 1 1 c black 245 848 m 18 X 5 Y 17 X 10 Y 18 X 1 Y 18 X 7 Y 18 X 20 Y 18 X 13 Y 17 X 17 Y 18 X 16 Y 18 X 18 Y 18 X 10 Y 17 X 17 Y 18 X 15 Y
 18 X 11 Y 36 X 18 Y 17 X 18 Y 18 X 10 Y 18 X 24 Y 18 X 32 Y 17 X 31 Y 18 X 55 Y 18 X 217 Y 18 X 136 Y 18 X 4 Y 17 X 5 Y 18 X -1 Y 18 X -24 Y 18 X -6 Y 18 X -15 Y 17 X -15 Y 18 X 18 Y 18 X -16 Y 18 X -13 Y 17 X -26 Y 18 X -40 Y 18 X -10 Y 18 X -45 Y
 18 X -56 Y 17 X -47 Y 18 X -128 Y 18 X -96 Y 18 X -68 Y 17 X -66 Y 18 X -57 Y 18 X -60 Y 18 X -38 Y 18 X -41 Y 17 X -43 Y 18 X -42 Y 18 X -29 Y 18 X -30 Y 17 X -31 Y 18 X -24 Y 18 X -21 Y 18 X -20 Y 18 X -19 Y 17 X -16 Y 18 X -18 Y 18 X -14 Y 18 X
 -14 Y 17 X -12 Y 18 X -11 Y 18 X -7 Y 18 X -12 Y 18 X -8 Y 17 X -9 Y 18 X -9 Y 18 X -6 Y 18 X -5 Y 17 X -5 Y 18 X -5 Y 18 X -5 Y 18 X -4 Y 18 X -3 Y 17 X -4 Y 18 X -4 Y 18 X -4 Y 18 X -2 Y 17 X -2 Y 18 X -4 Y 18 X -2 Y 18 X -2 Y 18 X -2 Y 17 X -1 Y
 18 X -2 Y 18 X -2 Y 18 X -1 Y 17 X -2 Y 18 X -1 Y 18 X -1 Y 18 X -1 Y 18 X -1 Y 17 X -1 Y 18 X -1 Y 36 X -1 Y 17 X -1 Y 36 X -1 Y 18 X s 254 848 m20 272 853 m20 289 863 m20 307 864 m20 325 871 m20 343 891 m20 360 904 m20 378 921 m20 396 937 m20 414
 955 m20 432 965 m20 449 982 m20 467 997 m20 485 1008 m20 503 1008 m20 520 1026 m20 538 1044 m20 556 1054 m20 574 1078 m20 592 1110 m20 609 1141 m20 627 1196 m20 645 1413 m20 663 1549 m20 680 1553 m20 698 1558 m20 716 1557 m20 734 1533 m20 752 1527
 m20 769 1512 m20 787 1497 m20 805 1515 m20 823 1499 m20 841 1486 m20 858 1460 m20 876 1420 m20 894 1410 m20 912 1365 m20 929 1309 m20 947 1262 m20 965 1134 m20 983 1038 m20 1001 970 m20 1018 904 m20 1036 847 m20 1054 787 m20 1072 749 m20 1089 708
 m20 1107 665 m20 1125 623 m20 1143 594 m20 1161 564 m20 1178 533 m20 1196 509 m20 1214 488 m20 1232 468 m20 1249 449 m20 1267 433 m20 1285 415 m20 1303 401 m20 1321 387 m20 1338 375 m20 1356 364 m20 1374 357 m20 1392 345 m20 1409 337 m20 1427 328
 m20 1445 319 m20 1463 313 m20 1481 308 m20 1498 303 m20 1516 298 m20 1534 293 m20 1552 289 m20 1569 286 m20 1587 282 m20 1605 278 m20 1623 274 m20 1641 272 m20 1658 270 m20 1676 266 m20 1694 264 m20 1712 262 m20 1729 260 m20 1747 259 m20 1765 257
 m20 1783 255 m20 1801 254 m20 1818 252 m20 1836 251 m20 1854 250 m20 1872 249 m20 1889 248 m20 1907 247 m20 1925 246 m20 1943 246 m20 1961 245 m20 1978 244 m20 1996 244 m20 2014 243 m20 cs 0 0 0 P13 setcolor 254 852 m 18 5 d 17 10 d 18 1 d 18 7 d 18
 20 d 17 13 d 18 17 d 18 17 d 18 17 d 18 10 d 17 18 d 18 15 d 18 11 d 18 X 17 18 d 18 18 d 18 10 d 18 25 d 18 31 d 17 31 d 18 56 d 18 218 d 18 137 d 17 4 d 18 5 d 18 X 18 -24 d 18 -7 d 17 -15 d 18 -14 d 18 18 d 18 -16 d 18 -13 d 17 -25 d 18 -41 d 18
 -9 d 18 -46 d 17 -56 d 18 -48 d 18 -128 d 18 -97 d 18 -69 d 17 -66 d 18 -57 d 18 -61 d 18 -38 d 17 -41 d 18 -44 d 18 -42 d 18 -29 d 18 -31 d 17 -31 d 18 -24 d 18 -21 d 18 -20 d 17 -19 d 18 -17 d 18 -18 d 18 -14 d 18 -15 d 17 -11 d 18 -11 d 18 -7 d
 18 -13 d 17 -8 d 18 -9 d 18 -9 d 18 -6 d 18 -5 d 17 -5 d 18 -5 d 18 -5 d 18 -4 d 17 -4 d 18 -3 d 18 -5 d 18 -3 d 18 -2 d 17 -2 d 18 -4 d 18 -2 d 18 -2 d 17 -2 d 18 -2 d 18 -2 d 18 -1 d 18 -1 d 17 -2 d 18 -2 d 18 -1 d 18 X 17 -2 d 18 X 18 -1 d 18 -1
 d 18 -1 d 17 -1 d 18 X 18 -1 d -18 X -18 1 d -17 X -18 1 d -18 1 d -18 1 d -18 1 d -17 1 d -18 1 d -18 1 d -18 1 d -17 2 d -18 1 d -18 1 d -18 2 d -18 2 d -17 2 d -18 2 d -18 1 d -18 5 d -17 2 d -18 2 d -18 3 d -18 4 d -18 4 d -17 3 d -18 5 d -18 4
 d -18 5 d -17 5 d -18 5 d -18 6 d -18 9 d -18 8 d -17 9 d -18 12 d -18 7 d -18 11 d -17 11 d -18 14 d -18 14 d -18 17 d -18 17 d -17 19 d -18 20 d -18 20 d -18 24 d -17 31 d -18 30 d -18 29 d -18 40 d -18 44 d -17 40 d -18 38 d -18 60 d -18 56 d -17
 65 d -18 69 d -18 95 d -18 126 d -18 47 d -17 56 d -18 45 d -18 10 d -18 40 d -17 26 d -18 13 d -18 16 d -18 -17 d -18 14 d -17 15 d -18 7 d -18 24 d -18 X -18 -5 d -17 -3 d -18 -135 d -18 -216 d -18 -55 d -17 -31 d -18 -31 d -18 -24 d -18 -10 d -18
 -18 d -17 -18 d -18 1 d -18 -12 d -18 -14 d -17 -18 d -18 -10 d -18 -17 d -18 -17 d -18 -17 d -17 -13 d -18 -19 d -18 -8 d -18 -1 d -17 -9 d -18 -5 d FA 0.8 0 0 c 1 1 1 c 1 0 0 c 0.8 0 0 c 245 405 m 18 X 2 Y 17 X 1 Y 18 X 3 Y 18 X 1 Y 18 X 5 Y 18 X
 3 Y 17 X 4 Y 18 X 5 Y 18 X 2 Y 18 X 1 Y 17 X 6 Y 18 X 1 Y 18 X 1 Y 18 X -1 Y 18 X 4 Y 17 X 2 Y 18 X 2 Y 18 X 4 Y 18 X 5 Y 17 X 4 Y 18 X 10 Y 18 X 33 Y 18 X 19 Y 18 X -4 Y 35 X -3 Y 18 X -6 Y 18 X -2 Y 18 X -3 Y 17 X -3 Y 18 X -4 Y 18 X -3 Y 18 X -4
 Y 17 X -7 Y 18 X -6 Y 18 X -7 Y 18 X -7 Y 18 X -11 Y 17 X -11 Y 18 X -19 Y 18 X -17 Y 18 X -12 Y 17 X -12 Y 18 X -12 Y 18 X -12 Y 18 X -8 Y 18 X -8 Y 17 X -9 Y 18 X -8 Y 18 X -6 Y 18 X -7 Y 17 X -6 Y 18 X -6 Y 18 X -4 Y 18 X -5 Y 18 X -3 Y 17 X -4 Y
 18 X -4 Y 18 X -4 Y 18 X -2 Y 17 X -3 Y 18 X -3 Y 18 X -1 Y 18 X -3 Y 18 X -2 Y 17 X -2 Y 18 X -2 Y 18 X -1 Y 18 X -2 Y 17 X -1 Y 18 X -1 Y 18 X -1 Y 18 X -1 Y 18 X -1 Y 17 X -1 Y 18 X -1 Y 18 X -1 Y 35 X -1 Y 18 X -1 Y 36 X -1 Y 18 X -1 Y 35 X -1 Y
 53 X -1 Y 54 X -1 Y 71 X -1 Y 89 X s 1 0 0 c 254 405 m20 272 407 m20 289 408 m20 307 411 m20 325 412 m20 343 417 m20 360 420 m20 378 424 m20 396 429 m20 414 431 m20 432 432 m20 449 438 m20 467 439 m20 485 440 m20 503 439 m20 520 443 m20 538 445 m20
 556 447 m20 574 451 m20 592 456 m20 609 460 m20 627 470 m20 645 503 m20 663 522 m20 680 518 m20 698 518 m20 716 515 m20 734 509 m20 752 507 m20 769 504 m20 787 501 m20 805 497 m20 823 494 m20 841 490 m20 858 483 m20 876 477 m20 894 470 m20 912 463
 m20 929 452 m20 947 441 m20 965 422 m20 983 405 m20 1001 393 m20 1018 381 m20 1036 369 m20 1054 357 m20 1072 349 m20 1089 341 m20 1107 332 m20 1125 324 m20 1143 318 m20 1161 311 m20 1178 305 m20 1196 299 m20 1214 295 m20 1232 290 m20 1249 287 m20
 1267 283 m20 1285 279 m20 1303 275 m20 1321 273 m20 1338 270 m20 1356 267 m20 1374 266 m20 1392 263 m20 1409 261 m20 1427 259 m20 1445 257 m20 1463 256 m20 1481 254 m20 1498 253 m20 1516 252 m20 1534 251 m20 1552 250 m20 1569 249 m20 1587 248 m20
 1605 247 m20 1623 246 m20 1641 246 m20 1658 245 m20 1676 244 m20 1694 244 m20 1712 243 m20 1729 242 m20 1747 242 m20 1765 241 m20 1783 241 m20 1801 241 m20 1818 240 m20 1836 240 m20 1854 240 m20 1872 239 m20 1889 239 m20 1907 239 m20 1925 239 m20
 1943 238 m20 1961 238 m20 1978 238 m20 1996 238 m20 2014 238 m20 0.8 0 0 c black 0.8 0 0 c cs 0.8 0 0 P13 setcolor 254 406 m 18 2 d 17 1 d 18 3 d 18 1 d 18 5 d 17 3 d 18 4 d 18 5 d 18 2 d 18 1 d 17 6 d 18 1 d 18 1 d 18 -1 d 17 4 d 18 2 d 18 2 d 18 4
 d 18 5 d 17 4 d 18 10 d 18 33 d 18 19 d 17 -4 d 18 X 18 -3 d 18 -6 d 18 -2 d 17 -3 d 18 -3 d 18 -4 d 18 -3 d 18 -3 d 17 -8 d 18 -6 d 18 -7 d 18 -7 d 17 -11 d 18 -11 d 18 -19 d 18 -17 d 18 -13 d 17 -11 d 18 -12 d 18 -12 d 18 -8 d 17 -9 d 18 -8 d 18
 -8 d 18 -7 d 18 -6 d 17 -6 d 18 -6 d 18 -4 d 18 -5 d 17 -4 d 18 -4 d 18 -4 d 18 -3 d 18 -3 d 17 -2 d 18 -3 d 18 -2 d 18 -3 d 17 -2 d 18 -2 d 18 -2 d 18 -1 d 18 -1 d 17 -2 d 18 -1 d 18 -1 d 18 -1 d 17 -1 d 18 -1 d 18 -1 d 18 -1 d 18 X 17 -1 d 18 -1 d
 18 X 18 -1 d 17 -1 d 36 X 18 -1 d 18 X 17 -1 d 54 X 17 -1 d 54 X 18 -1 d 53 X -71 X -18 1 d -53 X -18 1 d -36 X -17 1 d -36 X -18 1 d -18 X -17 1 d -18 X -18 1 d -18 1 d -17 X -18 1 d -18 1 d -18 1 d -18 1 d -17 X -18 1 d -18 2 d -18 1 d -17 1 d -18
 1 d -18 2 d -18 2 d -18 2 d -17 2 d -18 3 d -18 1 d -18 3 d -17 2 d -18 3 d -18 4 d -18 4 d -18 3 d -17 4 d -18 5 d -18 4 d -18 6 d -17 6 d -18 6 d -18 6 d -18 9 d -18 8 d -17 9 d -18 8 d -18 11 d -18 12 d -17 12 d -18 12 d -18 17 d -18 19 d -18 11
 d -17 11 d -18 7 d -18 7 d -18 6 d -17 7 d -18 4 d -18 3 d -18 4 d -18 3 d -17 3 d -18 2 d -18 6 d -18 3 d -18 -1 d -17 5 d -18 -19 d -18 -33 d -18 -10 d -17 -4 d -18 -5 d -18 -4 d -18 -2 d -18 -2 d -17 -4 d -18 1 d -18 -1 d -18 -1 d -17 -6 d -18 -1
 d -18 -2 d -18 -4 d -18 -5 d -17 -3 d -18 -5 d -18 -1 d -18 -3 d -17 -1 d -18 -2 d FA black 1 1 1 c 556 639 1578 1302 bf black 1578 1302 m 556 X s 2134 1302 m 639 Y s 2134 1941 m -556 X s 1578 1941 m -639 Y s
 gsave  2222 2133 23 22 C 1716.93 1827.09 t 0 r /Helvetica findfont 95.0544 sf 0 0 m (No Int) show NC gr  0.8 0 0 c 1599 1861 m 97 X s black
 gsave  2222 2133 23 22 C 1716.93 1663.75 t 0 r /Helvetica findfont 95.0544 sf 0 0 m (Add) show NC gr  0.8 0.8 0 c 1599 1702 m 97 X s black
 gsave  2222 2133 23 22 C 1716.93 1504.21 t 0 r /Helvetica findfont 95.0544 sf 0 0 m (Mult) show NC gr  0.8 0 0.8 c 1599 1542 m 97 X s black
 gsave  2222 2133 23 22 C 1716.93 1344.68 t 0 r /Helvetica findfont 95.0544 sf 0 0 m (Central) show NC gr  1599 1382 m 97 X s
 gsave  2222 2133 23 22 C 2199.34 1568.79 t 90 r /Helvetica-BoldOblique findfont 38.0218 sf 0 0 m (LHC HIGGS XS WG 2013) show NC gr 
 gr  gr showpage
end
%%EOF
