%!PS-Adobe-2.0 EPSF-2.0
%%BoundingBox:  0 0 567 384
%%Title: h8-as0119.eps: multigraph
%%Creator: ROOT Version 5.34/00
%%CreationDate: Fri Jun  7 12:18:00 2013
%%EndComments
%%BeginProlog
80 dict begin
/s {stroke} def /l {lineto} def /m {moveto} def /t {translate} def
/r {rotate} def /rl {roll}  def /R {repeat} def
/d {rlineto} def /rm {rmoveto} def /gr {grestore} def /f {eofill} def
/c {setrgbcolor} def /black {0 setgray} def /sd {setdash} def
/cl {closepath} def /sf {scalefont setfont} def /lw {setlinewidth} def
/box {m dup 0 exch d exch 0 d 0 exch neg d cl} def
/NC{systemdict begin initclip end}def/C{NC box clip newpath}def
/bl {box s} def /bf {box f} def /Y { 0 exch d} def /X { 0 d} def 
/K {{pop pop 0 moveto} exch kshow} bind def
/ita {/ang 15 def gsave [1 0 ang dup sin exch cos div 1 0 0] concat} def 
/mp {newpath /y exch def /x exch def} def
/side {[w .77 mul w .23 mul] .385 w mul sd w 0 l currentpoint t -144 r} def
/mr {mp x y w2 0 360 arc} def /m24 {mr s} def /m20 {mr f} def
/mb {mp x y w2 add m w2 neg 0 d 0 w neg d w 0 d 0 w d cl} def
/mt {mp x y w2 add m w2 neg w neg d w 0 d cl} def
/m21 {mb f} def /m25 {mb s} def /m22 {mt f} def /m26{mt s} def
/m23 {mp x y w2 sub m w2 w d w neg 0 d cl f} def
/m27 {mp x y w2 add m w3 neg w2 neg d w3 w2 neg d w3 w2 d cl s} def
/m28 {mp x w2 sub y w2 sub w3 add m w3 0 d  0 w3 neg d w3 0 d 0 w3 d w3 0 d  0 w3 d w3 neg 0 d 0 w3 d w3 neg 0 d 0 w3 neg d w3 neg 0 d cl s } def
/m29 {mp gsave x w2 sub y w2 add w3 sub m currentpoint t 4 {side} repeat cl fill gr} def
/m30 {mp gsave x w2 sub y w2 add w3 sub m currentpoint t 4 {side} repeat cl s gr} def
/m31 {mp x y w2 sub m 0 w d x w2 sub y m w 0 d x w2 sub y w2 add m w w neg d x w2 sub y w2 sub m w w d s} def
/m32 {mp x y w2 sub m w2 w d w neg 0 d cl s} def
/m33 {mp x y w2 add m w3 neg w2 neg d w3 w2 neg d w3 w2 d cl f} def
/m34 {mp x w2 sub y w2 sub w3 add m w3 0 d  0 w3 neg d w3 0 d 0 w3 d w3 0 d  0 w3 d w3 neg 0 d 0 w3 d w3 neg 0 d 0 w3 neg d w3 neg 0 d cl f } def
/m2 {mp x y w2 sub m 0 w d x w2 sub y m w 0 d s} def
/m5 {mp x w2 sub y w2 sub m w w d x w2 sub y w2 add m w w neg d s} def
/reEncode {exch findfont dup length dict begin {1 index /FID eq  {pop pop} {def} ifelse } forall /Encoding exch def currentdict end dup /FontName get exch definefont pop } def [/Times-Bold /Times-Italic /Times-BoldItalic /Helvetica /Helvetica-Oblique
 /Helvetica-Bold /Helvetica-BoldOblique /Courier /Courier-Oblique /Courier-Bold /Courier-BoldOblique /Times-Roman /AvantGarde-Book /AvantGarde-BookOblique /AvantGarde-Demi /AvantGarde-DemiOblique /Bookman-Demi /Bookman-DemiItalic /Bookman-Light
 /Bookman-LightItalic /Helvetica-Narrow /Helvetica-Narrow-Bold /Helvetica-Narrow-BoldOblique /Helvetica-Narrow-Oblique /NewCenturySchlbk-Roman /NewCenturySchlbk-Bold /NewCenturySchlbk-BoldItalic /NewCenturySchlbk-Italic /Palatino-Bold
 /Palatino-BoldItalic /Palatino-Italic /Palatino-Roman ] {ISOLatin1Encoding reEncode } forall
%%EndProlog
%%BeginSetup
%%EndSetup
newpath  gsave  .25 .25 scale  gsave  0 0 t black[  ] 0 sd 3 lw 1 1 1 c 2268 1538 0 0 bf black 1 1 1 c 1814 1230 227 154 bf black 1814 1230 227 154 bl 1 1 1 c 1814 1230 227 154 bf black 1814 1230 227 154 bl 227 154 m 1814 X s 227 1384 m 1814 X s 227
 154 m 1230 Y s[ 4 8] 0 sd 2041 262 m -1814 X s 2041 443 m -1814 X s 2041 624 m -1814 X s 2041 805 m -1814 X s 2041 986 m -1814 X s 2041 1167 m -1814 X s 2041 1348 m -1814 X s 2041 262 m -1814 X s 2041 1348 m -1814 X s[  ] 0 sd 2041 154 m 1230 Y s
 227 154 m 1814 X s 227 1384 m 1814 X s 227 154 m 1230 Y s
 gsave  2268 1538 0 0 C 58.6478 674.45 t 90 r /Helvetica findfont 71.6807 sf 0 0 m (\(H\) [pb]) show NC gr 
 gsave  2268 1538 0 0 C 55.3896 632.093 t 90 r /Symbol findfont 71.6807 sf 0 0 m (s) show NC gr  281 262 m -54 X s 254 299 m -27 X s 254 335 m -27 X s 254 371 m -27 X s 254 407 m -27 X s 281 443 m -54 X s 254 479 m -27 X s 254 516 m -27 X s 254 552 m
 -27 X s 254 588 m -27 X s 281 624 m -54 X s 254 660 m -27 X s 254 697 m -27 X s 254 733 m -27 X s 254 769 m -27 X s 281 805 m -54 X s 254 841 m -27 X s 254 877 m -27 X s 254 914 m -27 X s 254 950 m -27 X s 281 986 m -54 X s 254 1022 m -27 X s 254
 1058 m -27 X s 254 1095 m -27 X s 254 1131 m -27 X s 281 1167 m -54 X s 254 1203 m -27 X s 254 1239 m -27 X s 254 1276 m -27 X s 254 1312 m -27 X s 281 1348 m -54 X s 281 262 m -54 X s 254 226 m -27 X s 254 190 m -27 X s 254 154 m -27 X s 281 1348 m
 -54 X s 254 1384 m -27 X s
 gsave  2268 1538 0 0 C 136.845 234.591 t 0 r /Helvetica findfont 71.6807 sf 0 0 m (17) show NC gr 
 gsave  2268 1538 0 0 C 78.1971 420.31 t 0 r /Helvetica findfont 71.6807 sf 0 0 m (17.5) show NC gr 
 gsave  2268 1538 0 0 C 136.845 599.511 t 0 r /Helvetica findfont 71.6807 sf 0 0 m (18) show NC gr 
 gsave  2268 1538 0 0 C 78.1971 781.971 t 0 r /Helvetica findfont 71.6807 sf 0 0 m (18.5) show NC gr 
 gsave  2268 1538 0 0 C 136.845 961.173 t 0 r /Helvetica findfont 71.6807 sf 0 0 m (19) show NC gr 
 gsave  2268 1538 0 0 C 78.1971 1143.63 t 0 r /Helvetica findfont 71.6807 sf 0 0 m (19.5) show NC gr 
 gsave  2268 1538 0 0 C 136.845 1322.83 t 0 r /Helvetica findfont 71.6807 sf 0 0 m (20) show NC gr  2041 154 m 1230 Y s 1987 262 m 54 X s 2014 299 m 27 X s 2014 335 m 27 X s 2014 371 m 27 X s 2014 407 m 27 X s 1987 443 m 54 X s 2014 479 m 27 X s 2014
 516 m 27 X s 2014 552 m 27 X s 2014 588 m 27 X s 1987 624 m 54 X s 2014 660 m 27 X s 2014 697 m 27 X s 2014 733 m 27 X s 2014 769 m 27 X s 1987 805 m 54 X s 2014 841 m 27 X s 2014 877 m 27 X s 2014 914 m 27 X s 2014 950 m 27 X s 1987 986 m 54 X s
 2014 1022 m 27 X s 2014 1058 m 27 X s 2014 1095 m 27 X s 2014 1131 m 27 X s 1987 1167 m 54 X s 2014 1203 m 27 X s 2014 1239 m 27 X s 2014 1276 m 27 X s 2014 1312 m 27 X s 1987 1348 m 54 X s 1987 262 m 54 X s 2014 226 m 27 X s 2014 190 m 27 X s 2014
 154 m 27 X s 1987 1348 m 54 X s 2014 1384 m 27 X s 1 0 0 c 6 lw 481 1204 m 68 Y s 474 1272 m 13 X s 481 1159 m -68 Y s 474 1091 m 13 X s black 1 0 0 c 3 lw /w 47 def /w2 {w 2 div} def /w3 {w 3 div} def 481 1181 m20 6 lw 0 0 1 c 844 1052 m 68 Y s 837
 1120 m 13 X s 844 1007 m -68 Y s 837 939 m 13 X s black 0 0 1 c 3 lw 844 1029 m20 6 lw black 1206 911 m 111 Y s 1200 1022 m 13 X s 1206 866 m -112 Y s 1200 754 m 13 X s 3 lw 1206 888 m21 6 lw 0.4 0.4 0.4 c 1569 904 m 129 Y s 1563 1033 m 13 X s 1569
 858 m -129 Y s 1563 729 m 13 X s black 0.4 0.4 0.4 c 3 lw 1569 881 m22 6 lw 0 1 0 c 1932 987 m 365 Y s 1926 1352 m 13 X s 1932 942 m -365 Y s 1926 577 m 13 X s black 0 1 0 c 3 lw 1932 964 m20 6 lw 1 1 1 c black
 gsave  2268 1538 0 0 C 1185.99 1469.45 t 0 r /Helvetica findfont 52.1314 sf 0 0 m 
 638 608 596 581 551 540 510 495 477 447 420 391 361 346 313 275 239 224 206 191 161 132 106 91 61 46 15
( = 0.119 \255 PDF uncertainties) K NC gr 
 gsave  2268 1538 0 0 C 1163.18 1449.9 t 0 r /Helvetica findfont 35.8403 sf 0 0 m (S) show NC gr 
 gsave  2268 1538 0 0 C 1130.6 1469.45 t 0 r /Symbol findfont 52.1314 sf 0 0 m (a) show NC gr 
 gsave  2268 1538 0 0 C 430.084 1469.45 t 0 r /Helvetica findfont 52.1314 sf 0 0 m 
 708 690 675 633 604 565 526 511 482 467 437 422 395 368 357 318 306 291 273 258 223 193 166 152 122 107 69 30
(LHC 8 TeV \255 iHixs 1.3 NNLO \255 ) K NC gr 
 gsave  2268 1538 0 0 C 592.995 534.347 t 0 r /Helvetica findfont 55.3896 sf 0 0 m (NNPDF2.3) show NC gr  1 0 0 c 301 557 m 242 X s 3 lw 422 557 m20 6 lw black
 gsave  2268 1538 0 0 C 592.995 449.633 t 0 r /Helvetica findfont 55.3896 sf 0 0 m (MSTW08) show NC gr  0 0 1 c 301 471 m 242 X s 3 lw 422 471 m20 6 lw black
 gsave  2268 1538 0 0 C 592.995 361.662 t 0 r /Helvetica findfont 55.3896 sf 0 0 m (CT10) show NC gr  301 384 m 242 X s 3 lw 422 384 m21 6 lw
 gsave  2268 1538 0 0 C 592.995 276.948 t 0 r /Helvetica findfont 55.3896 sf 0 0 m 
 145 119 73 37
(ABM11) K NC gr  0.4 0.4 0.4 c 301 298 m 242 X s 3 lw 422 298 m22 6 lw black
 gsave  2268 1538 0 0 C 592.995 192.235 t 0 r /Helvetica findfont 55.3896 sf 0 0 m (HERAPDF1.5) show NC gr  0 1 0 c 301 212 m 242 X s 3 lw 422 212 m20 6 lw black
 gsave  2268 1538 0 0 C 2166.71 847.135 t 90 r /Helvetica-BoldOblique findfont 45.615 sf 0 0 m (LHC HIGGS XS WG 2013) show NC gr 
 gr  gr showpage
end
%%EOF
