%!PS-Adobe-1.0
%%Creator: Unified Graphics System
%%Pages: (atend)
%%DocumentFonts: Helvetica
%%BoundingBox:   50  236  464  565
%%EndComments
/Sw{setlinewidth}def
/Sg{setgray}def
/Sd{setdash}def
/P {newpath
    moveto
0 0 rlineto
    stroke}def
/M {moveto}def
/D {lineto}def
/N {newpath}def
/S {stroke}def
/T {/Helvetica findfont
    exch
    scalefont
    setfont}def
/R {rotate}def
/W {show}def
/F {fill}def
/X {gsave}def
/Y {grestore}def
%%EndProlog
%%Page: 1 1
0.12000 0.12000 scale
1 setlinecap
1 setlinejoin
6 Sw
0.00 0.00 0.00 setrgbcolor
[] 0 Sd
N
785 4685 M
785 2262 D
S
N
785 2262 M
3762 2262 D
S
N
3762 2262 M
3762 4685 D
S
N
3762 4685 M
785 4685 D
S
N
785 2262 M
785 2366 D
S
N
904 2296 M
904 2262 D
S
N
1023 2262 M
1023 2296 D
S
N
1142 2296 M
1142 2262 D
S
N
1261 2262 M
1261 2296 D
S
N
1380 2366 M
1380 2262 D
S
N
1499 2262 M
1499 2296 D
S
N
1618 2296 M
1618 2262 D
S
N
1737 2262 M
1737 2296 D
S
N
1856 2296 M
1856 2262 D
S
N
1975 2262 M
1975 2366 D
S
N
2094 2296 M
2094 2262 D
S
N
2214 2262 M
2214 2296 D
S
N
2333 2296 M
2333 2262 D
S
N
2452 2262 M
2452 2296 D
S
N
2571 2366 M
2571 2262 D
S
N
2690 2262 M
2690 2296 D
S
N
2809 2296 M
2809 2262 D
S
N
2928 2262 M
2928 2296 D
S
N
3047 2296 M
3047 2262 D
S
N
3166 2262 M
3166 2366 D
S
N
3285 2296 M
3285 2262 D
S
N
3404 2262 M
3404 2296 D
S
N
3523 2296 M
3523 2262 D
S
N
3642 2262 M
3642 2296 D
S
N
738 2193 M
741 2190 D
738 2187 D
736 2190 D
736 2193 D
738 2199 D
741 2202 D
750 2205 D
762 2205 D
770 2202 D
773 2199 D
776 2193 D
776 2187 D
773 2182 D
764 2176 D
750 2170 D
744 2167 D
738 2161 D
736 2153 D
736 2144 D
S
N
762 2205 M
767 2202 D
770 2199 D
773 2193 D
773 2187 D
770 2182 D
762 2176 D
750 2170 D
S
N
736 2150 M
738 2153 D
744 2153 D
759 2147 D
767 2147 D
773 2150 D
776 2153 D
S
N
744 2153 M
759 2144 D
770 2144 D
773 2147 D
776 2153 D
776 2158 D
S
N
811 2205 M
802 2202 D
796 2193 D
793 2179 D
793 2170 D
796 2156 D
802 2147 D
811 2144 D
816 2144 D
825 2147 D
831 2156 D
834 2170 D
834 2179 D
831 2193 D
825 2202 D
816 2205 D
811 2205 D
S
N
811 2205 M
805 2202 D
802 2199 D
799 2193 D
796 2179 D
796 2170 D
799 2156 D
802 2150 D
805 2147 D
811 2144 D
S
N
816 2144 M
822 2147 D
825 2150 D
828 2156 D
831 2170 D
831 2179 D
828 2193 D
825 2199 D
822 2202 D
816 2205 D
S
N
1357 2199 M
1357 2144 D
S
N
1360 2205 M
1360 2144 D
S
N
1360 2205 M
1328 2161 D
1374 2161 D
S
N
1348 2144 M
1368 2144 D
S
N
1406 2205 M
1397 2202 D
1392 2193 D
1389 2179 D
1389 2170 D
1392 2156 D
1397 2147 D
1406 2144 D
1412 2144 D
1420 2147 D
1426 2156 D
1429 2170 D
1429 2179 D
1426 2193 D
1420 2202 D
1412 2205 D
1406 2205 D
S
N
1406 2205 M
1400 2202 D
1397 2199 D
1394 2193 D
1392 2179 D
1392 2170 D
1394 2156 D
1397 2150 D
1400 2147 D
1406 2144 D
S
N
1412 2144 M
1418 2147 D
1420 2150 D
1423 2156 D
1426 2170 D
1426 2179 D
1423 2193 D
1420 2199 D
1418 2202 D
1412 2205 D
S
N
1961 2196 M
1958 2193 D
1961 2190 D
1964 2193 D
1964 2196 D
1961 2202 D
1955 2205 D
1947 2205 D
1938 2202 D
1932 2196 D
1929 2190 D
1926 2179 D
1926 2161 D
1929 2153 D
1935 2147 D
1944 2144 D
1949 2144 D
1958 2147 D
1964 2153 D
1967 2161 D
1967 2164 D
1964 2173 D
1958 2179 D
1949 2182 D
1947 2182 D
1938 2179 D
1932 2173 D
1929 2164 D
S
N
1947 2205 M
1941 2202 D
1935 2196 D
1932 2190 D
1929 2179 D
1929 2161 D
1932 2153 D
1938 2147 D
1944 2144 D
S
N
1949 2144 M
1955 2147 D
1961 2153 D
1964 2161 D
1964 2164 D
1961 2173 D
1955 2179 D
1949 2182 D
S
N
2001 2205 M
1993 2202 D
1987 2193 D
1984 2179 D
1984 2170 D
1987 2156 D
1993 2147 D
2001 2144 D
2007 2144 D
2016 2147 D
2022 2156 D
2024 2170 D
2024 2179 D
2022 2193 D
2016 2202 D
2007 2205 D
2001 2205 D
S
N
2001 2205 M
1996 2202 D
1993 2199 D
1990 2193 D
1987 2179 D
1987 2170 D
1990 2156 D
1993 2150 D
1996 2147 D
2001 2144 D
S
N
2007 2144 M
2013 2147 D
2016 2150 D
2019 2156 D
2022 2170 D
2022 2179 D
2019 2193 D
2016 2199 D
2013 2202 D
2007 2205 D
S
N
2536 2205 M
2527 2202 D
2525 2196 D
2525 2187 D
2527 2182 D
2536 2179 D
2548 2179 D
2556 2182 D
2559 2187 D
2559 2196 D
2556 2202 D
2548 2205 D
2536 2205 D
S
N
2536 2205 M
2530 2202 D
2527 2196 D
2527 2187 D
2530 2182 D
2536 2179 D
S
N
2548 2179 M
2553 2182 D
2556 2187 D
2556 2196 D
2553 2202 D
2548 2205 D
S
N
2536 2179 M
2527 2176 D
2525 2173 D
2522 2167 D
2522 2156 D
2525 2150 D
2527 2147 D
2536 2144 D
2548 2144 D
2556 2147 D
2559 2150 D
2562 2156 D
2562 2167 D
2559 2173 D
2556 2176 D
2548 2179 D
S
N
2536 2179 M
2530 2176 D
2527 2173 D
2525 2167 D
2525 2156 D
2527 2150 D
2530 2147 D
2536 2144 D
S
N
2548 2144 M
2553 2147 D
2556 2150 D
2559 2156 D
2559 2167 D
2556 2173 D
2553 2176 D
2548 2179 D
S
N
2597 2205 M
2588 2202 D
2582 2193 D
2579 2179 D
2579 2170 D
2582 2156 D
2588 2147 D
2597 2144 D
2603 2144 D
2611 2147 D
2617 2156 D
2620 2170 D
2620 2179 D
2617 2193 D
2611 2202 D
2603 2205 D
2597 2205 D
S
N
2597 2205 M
2591 2202 D
2588 2199 D
2585 2193 D
2582 2179 D
2582 2170 D
2585 2156 D
2588 2150 D
2591 2147 D
2597 2144 D
S
N
2603 2144 M
2608 2147 D
2611 2150 D
2614 2156 D
2617 2170 D
2617 2179 D
2614 2193 D
2611 2199 D
2608 2202 D
2603 2205 D
S
N
3097 2193 M
3103 2196 D
3111 2205 D
3111 2144 D
S
N
3108 2202 M
3108 2144 D
S
N
3097 2144 M
3123 2144 D
S
N
3163 2205 M
3155 2202 D
3149 2193 D
3146 2179 D
3146 2170 D
3149 2156 D
3155 2147 D
3163 2144 D
3169 2144 D
3178 2147 D
3184 2156 D
3186 2170 D
3186 2179 D
3184 2193 D
3178 2202 D
3169 2205 D
3163 2205 D
S
N
3163 2205 M
3158 2202 D
3155 2199 D
3152 2193 D
3149 2179 D
3149 2170 D
3152 2156 D
3155 2150 D
3158 2147 D
3163 2144 D
S
N
3169 2144 M
3175 2147 D
3178 2150 D
3181 2156 D
3184 2170 D
3184 2179 D
3181 2193 D
3178 2199 D
3175 2202 D
3169 2205 D
S
N
3221 2205 M
3212 2202 D
3207 2193 D
3204 2179 D
3204 2170 D
3207 2156 D
3212 2147 D
3221 2144 D
3227 2144 D
3236 2147 D
3241 2156 D
3244 2170 D
3244 2179 D
3241 2193 D
3236 2202 D
3227 2205 D
3221 2205 D
S
N
3221 2205 M
3215 2202 D
3212 2199 D
3210 2193 D
3207 2179 D
3207 2170 D
3210 2156 D
3212 2150 D
3215 2147 D
3221 2144 D
S
N
3227 2144 M
3233 2147 D
3236 2150 D
3238 2156 D
3241 2170 D
3241 2179 D
3238 2193 D
3236 2199 D
3233 2202 D
3227 2205 D
S
N
3692 2193 M
3698 2196 D
3707 2205 D
3707 2144 D
S
N
3704 2202 M
3704 2144 D
S
N
3692 2144 M
3718 2144 D
S
N
3744 2193 M
3747 2190 D
3744 2187 D
3741 2190 D
3741 2193 D
3744 2199 D
3747 2202 D
3756 2205 D
3767 2205 D
3776 2202 D
3779 2199 D
3782 2193 D
3782 2187 D
3779 2182 D
3770 2176 D
3756 2170 D
3750 2167 D
3744 2161 D
3741 2153 D
3741 2144 D
S
N
3767 2205 M
3773 2202 D
3776 2199 D
3779 2193 D
3779 2187 D
3776 2182 D
3767 2176 D
3756 2170 D
S
N
3741 2150 M
3744 2153 D
3750 2153 D
3764 2147 D
3773 2147 D
3779 2150 D
3782 2153 D
S
N
3750 2153 M
3764 2144 D
3776 2144 D
3779 2147 D
3782 2153 D
3782 2158 D
S
N
3816 2205 M
3808 2202 D
3802 2193 D
3799 2179 D
3799 2170 D
3802 2156 D
3808 2147 D
3816 2144 D
3822 2144 D
3831 2147 D
3837 2156 D
3840 2170 D
3840 2179 D
3837 2193 D
3831 2202 D
3822 2205 D
3816 2205 D
S
N
3816 2205 M
3811 2202 D
3808 2199 D
3805 2193 D
3802 2179 D
3802 2170 D
3805 2156 D
3808 2150 D
3811 2147 D
3816 2144 D
S
N
3822 2144 M
3828 2147 D
3831 2150 D
3834 2156 D
3837 2170 D
3837 2179 D
3834 2193 D
3831 2199 D
3828 2202 D
3822 2205 D
S
N
785 4685 M
3762 4685 D
S
N
785 4581 M
785 4685 D
S
N
904 4685 M
904 4650 D
S
N
1023 4650 M
1023 4685 D
S
N
1142 4685 M
1142 4650 D
S
N
1261 4650 M
1261 4685 D
S
N
1380 4685 M
1380 4581 D
S
N
1499 4650 M
1499 4685 D
S
N
1618 4685 M
1618 4650 D
S
N
1737 4650 M
1737 4685 D
S
N
1856 4685 M
1856 4650 D
S
N
1975 4581 M
1975 4685 D
S
N
2094 4685 M
2094 4650 D
S
N
2214 4650 M
2214 4685 D
S
N
2333 4685 M
2333 4650 D
S
N
2452 4650 M
2452 4685 D
S
N
2571 4685 M
2571 4581 D
S
N
2690 4650 M
2690 4685 D
S
N
2809 4685 M
2809 4650 D
S
N
2928 4650 M
2928 4685 D
S
N
3047 4685 M
3047 4650 D
S
N
3166 4581 M
3166 4685 D
S
N
3285 4685 M
3285 4650 D
S
N
3404 4650 M
3404 4685 D
S
N
3523 4685 M
3523 4650 D
S
N
3642 4650 M
3642 4685 D
S
N
785 2262 M
785 4685 D
S
N
819 2377 M
785 2377 D
S
N
785 2493 M
819 2493 D
S
N
819 2608 M
785 2608 D
S
N
785 2723 M
888 2723 D
S
N
819 2839 M
785 2839 D
S
N
785 2954 M
819 2954 D
S
N
819 3069 M
785 3069 D
S
N
785 3185 M
819 3185 D
S
N
888 3300 M
785 3300 D
S
N
785 3416 M
819 3416 D
S
N
819 3531 M
785 3531 D
S
N
785 3646 M
819 3646 D
S
N
819 3762 M
785 3762 D
S
N
785 3877 M
888 3877 D
S
N
819 3993 M
785 3993 D
S
N
785 4108 M
819 4108 D
S
N
819 4223 M
785 4223 D
S
N
785 4339 M
819 4339 D
S
N
888 4454 M
785 4454 D
S
N
785 4569 M
819 4569 D
S
N
819 4685 M
785 4685 D
S
N
632 2749 M
623 2746 D
617 2738 D
614 2723 D
614 2715 D
617 2700 D
623 2692 D
632 2689 D
637 2689 D
646 2692 D
652 2700 D
655 2715 D
655 2723 D
652 2738 D
646 2746 D
637 2749 D
632 2749 D
S
N
632 2749 M
626 2746 D
623 2744 D
620 2738 D
617 2723 D
617 2715 D
620 2700 D
623 2694 D
626 2692 D
632 2689 D
S
N
637 2689 M
643 2692 D
646 2694 D
649 2700 D
652 2715 D
652 2723 D
649 2738 D
646 2744 D
643 2746 D
637 2749 D
S
N
678 2694 M
675 2692 D
678 2689 D
681 2692 D
678 2694 D
S
N
718 2749 M
710 2746 D
704 2738 D
701 2723 D
701 2715 D
704 2700 D
710 2692 D
718 2689 D
724 2689 D
733 2692 D
739 2700 D
741 2715 D
741 2723 D
739 2738 D
733 2746 D
724 2749 D
718 2749 D
S
N
718 2749 M
713 2746 D
710 2744 D
707 2738 D
704 2723 D
704 2715 D
707 2700 D
710 2694 D
713 2692 D
718 2689 D
S
N
724 2689 M
730 2692 D
733 2694 D
736 2700 D
739 2715 D
739 2723 D
736 2738 D
733 2744 D
730 2746 D
724 2749 D
S
N
632 3326 M
623 3323 D
617 3315 D
614 3300 D
614 3292 D
617 3277 D
623 3268 D
632 3266 D
637 3266 D
646 3268 D
652 3277 D
655 3292 D
655 3300 D
652 3315 D
646 3323 D
637 3326 D
632 3326 D
S
N
632 3326 M
626 3323 D
623 3320 D
620 3315 D
617 3300 D
617 3292 D
620 3277 D
623 3271 D
626 3268 D
632 3266 D
S
N
637 3266 M
643 3268 D
646 3271 D
649 3277 D
652 3292 D
652 3300 D
649 3315 D
646 3320 D
643 3323 D
637 3326 D
S
N
678 3271 M
675 3268 D
678 3266 D
681 3268 D
678 3271 D
S
N
707 3326 M
701 3297 D
S
N
701 3297 M
707 3303 D
715 3306 D
724 3306 D
733 3303 D
739 3297 D
741 3289 D
741 3283 D
739 3274 D
733 3268 D
724 3266 D
715 3266 D
707 3268 D
704 3271 D
701 3277 D
701 3280 D
704 3283 D
707 3280 D
704 3277 D
S
N
724 3306 M
730 3303 D
736 3297 D
739 3289 D
739 3283 D
736 3274 D
730 3268 D
724 3266 D
S
N
707 3326 M
736 3326 D
S
N
707 3323 M
721 3323 D
736 3326 D
S
N
623 3892 M
629 3894 D
637 3903 D
637 3843 D
S
N
635 3900 M
635 3843 D
S
N
623 3843 M
649 3843 D
S
N
678 3848 M
675 3845 D
678 3843 D
681 3845 D
678 3848 D
S
N
718 3903 M
710 3900 D
704 3892 D
701 3877 D
701 3868 D
704 3854 D
710 3845 D
718 3843 D
724 3843 D
733 3845 D
739 3854 D
741 3868 D
741 3877 D
739 3892 D
733 3900 D
724 3903 D
718 3903 D
S
N
718 3903 M
713 3900 D
710 3897 D
707 3892 D
704 3877 D
704 3868 D
707 3854 D
710 3848 D
713 3845 D
718 3843 D
S
N
724 3843 M
730 3845 D
733 3848 D
736 3854 D
739 3868 D
739 3877 D
736 3892 D
733 3897 D
730 3900 D
724 3903 D
S
N
623 4469 M
629 4471 D
637 4480 D
637 4419 D
S
N
635 4477 M
635 4419 D
S
N
623 4419 M
649 4419 D
S
N
678 4425 M
675 4422 D
678 4419 D
681 4422 D
678 4425 D
S
N
707 4480 M
701 4451 D
S
N
701 4451 M
707 4457 D
715 4460 D
724 4460 D
733 4457 D
739 4451 D
741 4443 D
741 4437 D
739 4428 D
733 4422 D
724 4419 D
715 4419 D
707 4422 D
704 4425 D
701 4431 D
701 4434 D
704 4437 D
707 4434 D
704 4431 D
S
N
724 4460 M
730 4457 D
736 4451 D
739 4443 D
739 4437 D
736 4428 D
730 4422 D
724 4419 D
S
N
707 4480 M
736 4480 D
S
N
707 4477 M
721 4477 D
736 4480 D
S
N
3762 2377 M
3727 2377 D
S
N
3727 2493 M
3762 2493 D
S
N
3762 2608 M
3727 2608 D
S
N
3658 2723 M
3762 2723 D
S
N
3762 2839 M
3727 2839 D
S
N
3727 2954 M
3762 2954 D
S
N
3762 3069 M
3727 3069 D
S
N
3727 3185 M
3762 3185 D
S
N
3762 3300 M
3658 3300 D
S
N
3727 3416 M
3762 3416 D
S
N
3762 3531 M
3727 3531 D
S
N
3727 3646 M
3762 3646 D
S
N
3762 3762 M
3727 3762 D
S
N
3658 3877 M
3762 3877 D
S
N
3762 3993 M
3727 3993 D
S
N
3727 4108 M
3762 4108 D
S
N
3762 4223 M
3727 4223 D
S
N
3727 4339 M
3762 4339 D
S
N
3762 4454 M
3658 4454 D
S
N
3727 4569 M
3762 4569 D
S
N
3762 4685 M
3727 4685 D
S
N
2019 2060 M
2019 1999 D
S
N
2022 2060 M
2022 1999 D
S
N
2022 2051 M
2027 2057 D
2033 2060 D
2039 2060 D
2048 2057 D
2053 2051 D
2056 2043 D
2056 2037 D
2053 2028 D
2048 2022 D
2039 2019 D
2033 2019 D
2027 2022 D
2022 2028 D
S
N
2039 2060 M
2045 2057 D
2050 2051 D
2053 2043 D
2053 2037 D
2050 2028 D
2045 2022 D
2039 2019 D
S
N
2010 2060 M
2022 2060 D
S
N
2010 1999 M
2030 1999 D
S
N
2086 2037 M
2086 1996 D
S
N
2088 2037 M
2088 1996 D
S
N
2075 2037 M
2073 2025 D
2073 2037 D
2102 2037 D
2102 2025 D
2100 2037 D
S
N
2080 1996 M
2094 1996 D
S
N
2115 2023 M
2115 1996 D
S
N
2117 2023 M
2117 1996 D
S
N
2117 2018 M
2121 2021 D
2127 2023 D
2130 2023 D
2136 2021 D
2138 2018 D
2138 1996 D
S
N
2130 2023 M
2134 2021 D
2136 2018 D
2136 1996 D
S
N
2138 2018 M
2142 2021 D
2148 2023 D
2152 2023 D
2157 2021 D
2159 2018 D
2159 1996 D
S
N
2152 2023 M
2155 2021 D
2157 2018 D
2157 1996 D
S
N
2109 2023 M
2117 2023 D
S
N
2109 1996 M
2123 1996 D
S
N
2130 1996 M
2144 1996 D
S
N
2152 1996 M
2165 1996 D
S
N
2179 2037 M
2177 2035 D
2179 2033 D
2180 2035 D
2179 2037 D
S
N
2179 2023 M
2179 1996 D
S
N
2180 2023 M
2180 1996 D
S
N
2173 2023 M
2180 2023 D
S
N
2173 1996 M
2186 1996 D
S
N
2200 2023 M
2200 1996 D
S
N
2202 2023 M
2202 1996 D
S
N
2202 2018 M
2205 2021 D
2211 2023 D
2215 2023 D
2221 2021 D
2223 2018 D
2223 1996 D
S
N
2215 2023 M
2219 2021 D
2221 2018 D
2221 1996 D
S
N
2194 2023 M
2202 2023 D
S
N
2194 1996 M
2207 1996 D
S
N
2215 1996 M
2229 1996 D
S
N
2314 2092 M
2308 2086 D
2303 2077 D
2297 2066 D
2294 2051 D
2294 2040 D
2297 2025 D
2303 2014 D
2308 2005 D
2314 1999 D
S
N
2308 2086 M
2303 2074 D
2300 2066 D
2297 2051 D
2297 2040 D
2300 2025 D
2303 2017 D
2308 2005 D
S
N
2372 2071 M
2375 2063 D
2375 2080 D
2372 2071 D
2366 2077 D
2358 2080 D
2352 2080 D
2343 2077 D
2337 2071 D
2334 2066 D
2332 2057 D
2332 2043 D
2334 2034 D
2337 2028 D
2343 2022 D
2352 2019 D
2358 2019 D
2366 2022 D
2372 2028 D
S
N
2352 2080 M
2346 2077 D
2340 2071 D
2337 2066 D
2334 2057 D
2334 2043 D
2337 2034 D
2340 2028 D
2346 2022 D
2352 2019 D
S
N
2372 2043 M
2372 2019 D
S
N
2375 2043 M
2375 2019 D
S
N
2363 2043 M
2384 2043 D
S
N
2401 2043 M
2435 2043 D
2435 2048 D
2433 2054 D
2430 2057 D
2424 2060 D
2415 2060 D
2407 2057 D
2401 2051 D
2398 2043 D
2398 2037 D
2401 2028 D
2407 2022 D
2415 2019 D
2421 2019 D
2430 2022 D
2435 2028 D
S
N
2433 2043 M
2433 2051 D
2430 2057 D
S
N
2415 2060 M
2410 2057 D
2404 2051 D
2401 2043 D
2401 2037 D
2404 2028 D
2410 2022 D
2415 2019 D
S
N
2453 2080 M
2473 2019 D
S
N
2456 2080 M
2473 2028 D
S
N
2493 2080 M
2473 2019 D
S
N
2447 2080 M
2464 2080 D
S
N
2482 2080 M
2499 2080 D
S
N
2511 2092 M
2516 2086 D
2522 2077 D
2528 2066 D
2531 2051 D
2531 2040 D
2528 2025 D
2522 2014 D
2516 2005 D
2511 1999 D
S
N
2516 2086 M
2522 2074 D
2525 2066 D
2528 2051 D
2528 2040 D
2525 2025 D
2522 2017 D
2516 2005 D
S
N
461 3424 M
522 3424 D
S
N
461 3427 M
522 3427 D
S
N
490 3424 M
484 3419 D
481 3413 D
481 3407 D
484 3398 D
490 3393 D
498 3390 D
504 3390 D
513 3393 D
519 3398 D
522 3407 D
522 3413 D
519 3419 D
513 3424 D
S
N
481 3407 M
484 3401 D
490 3395 D
498 3393 D
504 3393 D
513 3395 D
519 3401 D
522 3407 D
S
N
461 3416 M
461 3427 D
S
N
522 3424 M
522 3436 D
S
N
481 3496 M
481 3468 D
484 3459 D
493 3453 D
501 3450 D
510 3450 D
516 3453 D
519 3456 D
522 3462 D
522 3468 D
519 3476 D
510 3482 D
501 3485 D
493 3485 D
487 3482 D
484 3479 D
481 3473 D
S
N
481 3468 M
484 3462 D
493 3456 D
501 3453 D
513 3453 D
519 3456 D
S
N
522 3468 M
519 3473 D
510 3479 D
501 3482 D
490 3482 D
484 3479 D
S
N
484 3479 M
484 3496 D
S
N
449 3560 M
542 3508 D
S
N
461 3609 M
522 3609 D
S
N
461 3612 M
522 3612 D
S
N
490 3609 M
484 3603 D
481 3598 D
481 3592 D
484 3583 D
490 3577 D
498 3574 D
504 3574 D
513 3577 D
519 3583 D
522 3592 D
522 3598 D
519 3603 D
513 3609 D
S
N
481 3592 M
484 3586 D
490 3580 D
498 3577 D
504 3577 D
513 3580 D
519 3586 D
522 3592 D
S
N
461 3600 M
461 3612 D
S
N
522 3609 M
522 3621 D
S
N
481 3641 M
542 3641 D
S
N
481 3644 M
542 3644 D
S
N
490 3644 M
484 3650 D
481 3655 D
481 3661 D
484 3670 D
490 3675 D
498 3678 D
504 3678 D
513 3675 D
519 3670 D
522 3661 D
522 3655 D
519 3650 D
513 3644 D
S
N
481 3661 M
484 3667 D
490 3673 D
498 3675 D
504 3675 D
513 3673 D
519 3667 D
522 3661 D
S
N
481 3632 M
481 3644 D
S
N
542 3632 M
542 3652 D
S
N
504 3708 M
545 3708 D
S
N
504 3710 M
545 3710 D
S
N
504 3697 M
516 3695 D
504 3695 D
504 3724 D
516 3724 D
504 3722 D
S
N
545 3702 M
545 3716 D
S
N
449 3809 M
455 3804 D
464 3798 D
475 3792 D
490 3789 D
501 3789 D
516 3792 D
527 3798 D
536 3804 D
542 3809 D
S
N
455 3804 M
467 3798 D
475 3795 D
490 3792 D
501 3792 D
516 3795 D
524 3798 D
536 3804 D
S
N
464 3847 M
467 3844 D
470 3847 D
467 3850 D
464 3850 D
461 3847 D
461 3841 D
464 3835 D
470 3832 D
522 3832 D
S
N
461 3841 M
464 3838 D
470 3835 D
522 3835 D
S
N
481 3824 M
481 3847 D
S
N
522 3824 M
522 3844 D
S
N
461 3870 M
522 3870 D
S
N
461 3873 M
522 3873 D
S
N
490 3873 M
484 3879 D
481 3884 D
481 3890 D
484 3899 D
490 3905 D
498 3907 D
504 3907 D
513 3905 D
519 3899 D
522 3890 D
522 3884 D
519 3879 D
513 3873 D
S
N
481 3890 M
484 3896 D
490 3902 D
498 3905 D
504 3905 D
513 3902 D
519 3896 D
522 3890 D
S
N
461 3861 M
461 3873 D
S
N
449 3974 M
542 3922 D
S
N
470 4029 M
478 4032 D
461 4032 D
470 4029 D
464 4023 D
461 4014 D
461 4009 D
464 4000 D
470 3994 D
475 3991 D
484 3988 D
498 3988 D
507 3991 D
513 3994 D
519 4000 D
522 4009 D
522 4014 D
519 4023 D
513 4029 D
S
N
461 4009 M
464 4003 D
470 3997 D
475 3994 D
484 3991 D
498 3991 D
507 3994 D
513 3997 D
519 4003 D
522 4009 D
S
N
498 4029 M
522 4029 D
S
N
498 4032 M
522 4032 D
S
N
498 4020 M
498 4040 D
S
N
498 4058 M
498 4092 D
493 4092 D
487 4089 D
484 4086 D
481 4081 D
481 4072 D
484 4063 D
490 4058 D
498 4055 D
504 4055 D
513 4058 D
519 4063 D
522 4072 D
522 4078 D
519 4086 D
513 4092 D
S
N
498 4089 M
490 4089 D
484 4086 D
S
N
481 4072 M
484 4066 D
490 4060 D
498 4058 D
504 4058 D
513 4060 D
519 4066 D
522 4072 D
S
N
461 4110 M
522 4130 D
S
N
461 4112 M
513 4130 D
S
N
461 4150 M
522 4130 D
S
N
461 4104 M
461 4121 D
S
N
461 4138 M
461 4156 D
S
N
449 4167 M
455 4173 D
464 4179 D
475 4185 D
490 4188 D
501 4188 D
516 4185 D
527 4179 D
536 4173 D
542 4167 D
S
N
455 4173 M
467 4179 D
475 4182 D
490 4185 D
501 4185 D
516 4182 D
524 4179 D
536 4173 D
S
N
2551 3710 M
2551 3649 D
S
N
2553 3710 M
2553 3649 D
S
N
2553 3701 M
2559 3707 D
2565 3710 D
2571 3710 D
2579 3707 D
2585 3701 D
2588 3693 D
2588 3687 D
2585 3678 D
2579 3672 D
2571 3669 D
2565 3669 D
2559 3672 D
2553 3678 D
S
N
2571 3710 M
2577 3707 D
2582 3701 D
2585 3693 D
2585 3687 D
2582 3678 D
2577 3672 D
2571 3669 D
S
N
2542 3710 M
2553 3710 D
S
N
2542 3649 M
2562 3649 D
S
N
2611 3710 M
2611 3649 D
S
N
2614 3710 M
2614 3649 D
S
N
2614 3701 M
2620 3707 D
2626 3710 D
2631 3710 D
2640 3707 D
2646 3701 D
2649 3693 D
2649 3687 D
2646 3678 D
2640 3672 D
2631 3669 D
2626 3669 D
2620 3672 D
2614 3678 D
S
N
2631 3710 M
2637 3707 D
2643 3701 D
2646 3693 D
2646 3687 D
2643 3678 D
2637 3672 D
2631 3669 D
S
N
2603 3710 M
2614 3710 D
S
N
2603 3649 M
2623 3649 D
S
N
2712 3701 M
2721 3695 D
2712 3690 D
S
N
2704 3710 M
2718 3695 D
2704 3681 D
S
N
2669 3695 M
2718 3695 D
S
N
2747 3730 M
2747 3669 D
S
N
2750 3730 M
2750 3669 D
S
N
2784 3730 M
2784 3669 D
S
N
2787 3730 M
2787 3669 D
S
N
2738 3730 M
2758 3730 D
S
N
2776 3730 M
2796 3730 D
S
N
2750 3701 M
2784 3701 D
S
N
2738 3669 M
2758 3669 D
S
N
2776 3669 M
2796 3669 D
S
N
2839 3721 M
2839 3669 D
S
N
2813 3695 M
2865 3695 D
S
N
2886 3730 M
2923 3669 D
S
N
2888 3730 M
2926 3669 D
S
N
2926 3730 M
2886 3669 D
S
N
2880 3730 M
2897 3730 D
S
N
2914 3730 M
2932 3730 D
S
N
2880 3669 M
2897 3669 D
S
N
2914 3669 M
2932 3669 D
S
N
2989 3701 M
2998 3695 D
2989 3690 D
S
N
2981 3710 M
2995 3695 D
2981 3681 D
S
N
2946 3695 M
2995 3695 D
S
N
3013 3701 M
3018 3707 D
3024 3710 D
3030 3710 D
3036 3707 D
3039 3704 D
3041 3695 D
3041 3684 D
3039 3672 D
3030 3649 D
S
N
3015 3704 M
3021 3707 D
3033 3707 D
3039 3704 D
S
N
3062 3710 M
3059 3701 D
3056 3695 D
3041 3675 D
3033 3661 D
3027 3649 D
S
N
3059 3710 M
3056 3701 D
3053 3695 D
3041 3675 D
S
N
3070 3701 M
3076 3707 D
3082 3710 D
3088 3710 D
3093 3707 D
3096 3704 D
3099 3695 D
3099 3684 D
3096 3672 D
3088 3649 D
S
N
3073 3704 M
3079 3707 D
3091 3707 D
3096 3704 D
S
N
3119 3710 M
3117 3701 D
3114 3695 D
3099 3675 D
3091 3661 D
3085 3649 D
S
N
3117 3710 M
3114 3701 D
3111 3695 D
3099 3675 D
S
N
3163 3721 M
3163 3669 D
S
N
3137 3695 M
3189 3695 D
S
N
3209 3730 M
3246 3669 D
S
N
3212 3730 M
3249 3669 D
S
N
3249 3730 M
3209 3669 D
S
N
3203 3730 M
3220 3730 D
S
N
3238 3730 M
3255 3730 D
S
N
3203 3669 M
3220 3669 D
S
N
3238 3669 M
3255 3669 D
S
N
2545 3560 M
2556 3560 D
2574 3525 D
S
N
2553 3560 M
2574 3519 D
2600 3597 D
S
N
2637 3554 M
2640 3560 D
2640 3548 D
2637 3554 D
2634 3557 D
2629 3560 D
2617 3560 D
2611 3557 D
2608 3554 D
2608 3548 D
2611 3545 D
2617 3543 D
2631 3537 D
2637 3534 D
2640 3531 D
S
N
2608 3551 M
2611 3548 D
2617 3545 D
2631 3540 D
2637 3537 D
2640 3534 D
2640 3525 D
2637 3522 D
2631 3519 D
2620 3519 D
2614 3522 D
2611 3525 D
2608 3531 D
2608 3519 D
2611 3525 D
S
N
2660 3554 M
2712 3554 D
S
N
2660 3537 M
2712 3537 D
S
N
2747 3580 M
2738 3577 D
2735 3571 D
2735 3563 D
2738 3557 D
2747 3554 D
2758 3554 D
2767 3557 D
2770 3563 D
2770 3571 D
2767 3577 D
2758 3580 D
2747 3580 D
S
N
2747 3580 M
2741 3577 D
2738 3571 D
2738 3563 D
2741 3557 D
2747 3554 D
S
N
2758 3554 M
2764 3557 D
2767 3563 D
2767 3571 D
2764 3577 D
2758 3580 D
S
N
2747 3554 M
2738 3551 D
2735 3548 D
2732 3543 D
2732 3531 D
2735 3525 D
2738 3522 D
2747 3519 D
2758 3519 D
2767 3522 D
2770 3525 D
2773 3531 D
2773 3543 D
2770 3548 D
2767 3551 D
2758 3554 D
S
N
2747 3554 M
2741 3551 D
2738 3548 D
2735 3543 D
2735 3531 D
2738 3525 D
2741 3522 D
2747 3519 D
S
N
2758 3519 M
2764 3522 D
2767 3525 D
2770 3531 D
2770 3543 D
2767 3548 D
2764 3551 D
2758 3554 D
S
N
2854 3580 M
2854 3519 D
S
N
2857 3580 M
2857 3519 D
S
N
2836 3580 M
2834 3563 D
2834 3580 D
2877 3580 D
2877 3563 D
2874 3580 D
S
N
2845 3519 M
2865 3519 D
S
N
2894 3543 M
2929 3543 D
2929 3548 D
2926 3554 D
2923 3557 D
2917 3560 D
2909 3560 D
2900 3557 D
2894 3551 D
2891 3543 D
2891 3537 D
2894 3528 D
2900 3522 D
2909 3519 D
2914 3519 D
2923 3522 D
2929 3528 D
S
N
2926 3543 M
2926 3551 D
2923 3557 D
S
N
2909 3560 M
2903 3557 D
2897 3551 D
2894 3543 D
2894 3537 D
2897 3528 D
2903 3522 D
2909 3519 D
S
N
2946 3580 M
2966 3519 D
S
N
2949 3580 M
2966 3528 D
S
N
2987 3580 M
2966 3519 D
S
N
2940 3580 M
2958 3580 D
S
N
2975 3580 M
2992 3580 D
S
N
3010 3519 M
3007 3522 D
3010 3525 D
3013 3522 D
3013 3517 D
3010 3511 D
3007 3508 D
S
N
3085 3580 M
3085 3519 D
S
N
3088 3580 M
3105 3528 D
S
N
3085 3580 M
3105 3519 D
S
N
3125 3580 M
3105 3519 D
S
N
3125 3580 M
3125 3519 D
S
N
3128 3580 M
3128 3519 D
S
N
3076 3580 M
3088 3580 D
S
N
3125 3580 M
3137 3580 D
S
N
3076 3519 M
3093 3519 D
S
N
3117 3519 M
3137 3519 D
S
N
3189 3571 M
3192 3580 D
3192 3563 D
3189 3571 D
3183 3577 D
3174 3580 D
3166 3580 D
3157 3577 D
3151 3571 D
3151 3566 D
3154 3560 D
3157 3557 D
3163 3554 D
3180 3548 D
3186 3545 D
3192 3540 D
S
N
3151 3566 M
3157 3560 D
3163 3557 D
3180 3551 D
3186 3548 D
3189 3545 D
3192 3540 D
3192 3528 D
3186 3522 D
3177 3519 D
3168 3519 D
3160 3522 D
3154 3528 D
3151 3537 D
3151 3519 D
3154 3528 D
S
N
3226 3580 M
3226 3519 D
S
N
3229 3580 M
3229 3519 D
S
N
3209 3580 M
3206 3563 D
3206 3580 D
3249 3580 D
3249 3563 D
3246 3580 D
S
N
3218 3519 M
3238 3519 D
S
N
3267 3580 M
3278 3519 D
S
N
3270 3580 M
3278 3534 D
S
N
3290 3580 M
3278 3519 D
S
N
3290 3580 M
3301 3519 D
S
N
3293 3580 M
3301 3534 D
S
N
3313 3580 M
3301 3519 D
S
N
3258 3580 M
3278 3580 D
S
N
3304 3580 M
3322 3580 D
S
N
3336 3569 M
3339 3566 D
3336 3563 D
3333 3566 D
3333 3569 D
3336 3574 D
3339 3577 D
3348 3580 D
3359 3580 D
3368 3577 D
3371 3574 D
3373 3569 D
3373 3563 D
3371 3557 D
3362 3551 D
3348 3545 D
3342 3543 D
3336 3537 D
3333 3528 D
3333 3519 D
S
N
3359 3580 M
3365 3577 D
3368 3574 D
3371 3569 D
3371 3563 D
3368 3557 D
3359 3551 D
3348 3545 D
S
N
3333 3525 M
3336 3528 D
3342 3528 D
3356 3522 D
3365 3522 D
3371 3525 D
3373 3528 D
S
N
3342 3528 M
3356 3519 D
3368 3519 D
3371 3522 D
3373 3528 D
3373 3534 D
S
N
3408 3580 M
3399 3577 D
3394 3569 D
3391 3554 D
3391 3545 D
3394 3531 D
3399 3522 D
3408 3519 D
3414 3519 D
3423 3522 D
3428 3531 D
3431 3545 D
3431 3554 D
3428 3569 D
3423 3577 D
3414 3580 D
3408 3580 D
S
N
3408 3580 M
3402 3577 D
3399 3574 D
3397 3569 D
3394 3554 D
3394 3545 D
3397 3531 D
3399 3525 D
3402 3522 D
3408 3519 D
S
N
3414 3519 M
3420 3522 D
3423 3525 D
3425 3531 D
3428 3545 D
3428 3554 D
3425 3569 D
3423 3574 D
3420 3577 D
3414 3580 D
S
N
3466 3580 M
3457 3577 D
3451 3569 D
3449 3554 D
3449 3545 D
3451 3531 D
3457 3522 D
3466 3519 D
3472 3519 D
3480 3522 D
3486 3531 D
3489 3545 D
3489 3554 D
3486 3569 D
3480 3577 D
3472 3580 D
3466 3580 D
S
N
3466 3580 M
3460 3577 D
3457 3574 D
3454 3569 D
3451 3554 D
3451 3545 D
3454 3531 D
3457 3525 D
3460 3522 D
3466 3519 D
S
N
3472 3519 M
3477 3522 D
3480 3525 D
3483 3531 D
3486 3545 D
3486 3554 D
3483 3569 D
3480 3574 D
3477 3577 D
3472 3580 D
S
N
3521 3580 M
3512 3577 D
3509 3571 D
3509 3563 D
3512 3557 D
3521 3554 D
3532 3554 D
3541 3557 D
3544 3563 D
3544 3571 D
3541 3577 D
3532 3580 D
3521 3580 D
S
N
3521 3580 M
3515 3577 D
3512 3571 D
3512 3563 D
3515 3557 D
3521 3554 D
S
N
3532 3554 M
3538 3557 D
3541 3563 D
3541 3571 D
3538 3577 D
3532 3580 D
S
N
3521 3554 M
3512 3551 D
3509 3548 D
3506 3543 D
3506 3531 D
3509 3525 D
3512 3522 D
3521 3519 D
3532 3519 D
3541 3522 D
3544 3525 D
3547 3531 D
3547 3543 D
3544 3548 D
3541 3551 D
3532 3554 D
S
N
3521 3554 M
3515 3551 D
3512 3548 D
3509 3543 D
3509 3531 D
3512 3525 D
3515 3522 D
3521 3519 D
S
N
3532 3519 M
3538 3522 D
3541 3525 D
3544 3531 D
3544 3543 D
3541 3548 D
3538 3551 D
3532 3554 D
S
N
2556 3421 M
2539 3361 D
S
N
2559 3421 M
2542 3361 D
S
N
2556 3413 M
2553 3395 D
2553 3387 D
2559 3381 D
2565 3381 D
2571 3384 D
2577 3390 D
2582 3398 D
S
N
2588 3421 M
2579 3390 D
2579 3384 D
2582 3381 D
2591 3381 D
2597 3387 D
2600 3393 D
S
N
2591 3421 M
2582 3390 D
2582 3384 D
2585 3381 D
S
N
2616 3398 M
2616 3358 D
S
N
2618 3398 M
2618 3358 D
S
N
2629 3387 M
2629 3371 D
S
N
2610 3398 M
2641 3398 D
2641 3387 D
2639 3398 D
S
N
2618 3379 M
2629 3379 D
S
N
2610 3358 M
2624 3358 D
S
N
2660 3416 M
2712 3416 D
S
N
2660 3398 M
2712 3398 D
S
N
2744 3421 M
2727 3361 D
S
N
2747 3421 M
2730 3361 D
S
N
2744 3413 M
2741 3395 D
2741 3387 D
2747 3381 D
2753 3381 D
2758 3384 D
2764 3390 D
2770 3398 D
S
N
2776 3421 M
2767 3390 D
2767 3384 D
2770 3381 D
2779 3381 D
2784 3387 D
2787 3393 D
S
N
2779 3421 M
2770 3390 D
2770 3384 D
2773 3381 D
S
N
2804 3398 M
2804 3358 D
S
N
2806 3398 M
2806 3358 D
S
N
2798 3398 M
2821 3398 D
2827 3396 D
2829 3394 D
2831 3391 D
2831 3387 D
2829 3383 D
2827 3381 D
2821 3379 D
2806 3379 D
S
N
2821 3398 M
2825 3396 D
2827 3394 D
2829 3391 D
2829 3387 D
2827 3383 D
2825 3381 D
2821 3379 D
S
N
2798 3358 M
2811 3358 D
S
N
2815 3379 M
2819 3377 D
2821 3375 D
2827 3362 D
2829 3360 D
2831 3360 D
2833 3362 D
S
N
2819 3377 M
2821 3373 D
2825 3360 D
2827 3358 D
2831 3358 D
2833 3362 D
2833 3364 D
S
N
2852 3416 M
2904 3416 D
S
N
2852 3398 M
2904 3398 D
S
N
2927 3430 M
2930 3427 D
2927 3424 D
2924 3427 D
2924 3430 D
2927 3436 D
2930 3439 D
2938 3442 D
2950 3442 D
2959 3439 D
2962 3436 D
2964 3430 D
2964 3424 D
2962 3419 D
2953 3413 D
2938 3407 D
2933 3404 D
2927 3398 D
2924 3390 D
2924 3381 D
S
N
2950 3442 M
2956 3439 D
2959 3436 D
2962 3430 D
2962 3424 D
2959 3419 D
2950 3413 D
2938 3407 D
S
N
2924 3387 M
2927 3390 D
2933 3390 D
2947 3384 D
2956 3384 D
2962 3387 D
2964 3390 D
S
N
2933 3390 M
2947 3381 D
2959 3381 D
2962 3384 D
2964 3390 D
2964 3395 D
S
N
3002 3442 M
2993 3439 D
2988 3433 D
2985 3427 D
2982 3416 D
2982 3407 D
2985 3395 D
2988 3390 D
2993 3384 D
3002 3381 D
3008 3381 D
3016 3384 D
3022 3390 D
3025 3395 D
3028 3407 D
3028 3416 D
3025 3427 D
3022 3433 D
3016 3439 D
3008 3442 D
3002 3442 D
S
N
3002 3442 M
2996 3439 D
2990 3433 D
2988 3427 D
2985 3416 D
2985 3407 D
2988 3395 D
2990 3390 D
2996 3384 D
3002 3381 D
S
N
3008 3381 M
3014 3384 D
3019 3390 D
3022 3395 D
3025 3407 D
3025 3416 D
3022 3427 D
3019 3433 D
3014 3439 D
3008 3442 D
S
N
2993 3387 M
2993 3390 D
2996 3395 D
3002 3398 D
3005 3398 D
3011 3395 D
3014 3390 D
3016 3369 D
3019 3367 D
3025 3367 D
3028 3372 D
3028 3375 D
S
N
3014 3390 M
3016 3378 D
3019 3372 D
3022 3369 D
3025 3369 D
3028 3372 D
S
N
3048 3416 M
3100 3416 D
S
N
3048 3398 M
3100 3398 D
S
N
3126 3421 M
3126 3381 D
S
N
3129 3421 M
3129 3381 D
S
N
3129 3413 M
3135 3419 D
3143 3421 D
3149 3421 D
3158 3419 D
3161 3413 D
3161 3381 D
S
N
3149 3421 M
3155 3419 D
3158 3413 D
3158 3381 D
S
N
3161 3413 M
3167 3419 D
3175 3421 D
3181 3421 D
3190 3419 D
3193 3413 D
3193 3381 D
S
N
3181 3421 M
3187 3419 D
3190 3413 D
3190 3381 D
S
N
3117 3421 M
3129 3421 D
S
N
3117 3381 M
3138 3381 D
S
N
3149 3381 M
3169 3381 D
S
N
3181 3381 M
3201 3381 D
S
N
3220 3398 M
3220 3358 D
S
N
3222 3398 M
3222 3358 D
S
N
3245 3398 M
3245 3358 D
S
N
3247 3398 M
3247 3358 D
S
N
3215 3398 M
3228 3398 D
S
N
3240 3398 M
3253 3398 D
S
N
3222 3379 M
3245 3379 D
S
N
3215 3358 M
3228 3358 D
S
N
3240 3358 M
3253 3358 D
S
N
3272 3416 M
3324 3416 D
S
N
3272 3398 M
3324 3398 D
S
N
3353 3430 M
3359 3433 D
3368 3442 D
3368 3381 D
S
N
3365 3439 M
3365 3381 D
S
N
3353 3381 M
3379 3381 D
S
N
3405 3430 M
3408 3427 D
3405 3424 D
3402 3427 D
3402 3430 D
3405 3436 D
3408 3439 D
3417 3442 D
3428 3442 D
3437 3439 D
3440 3436 D
3443 3430 D
3443 3424 D
3440 3419 D
3431 3413 D
3417 3407 D
3411 3404 D
3405 3398 D
3402 3390 D
3402 3381 D
S
N
3428 3442 M
3434 3439 D
3437 3436 D
3440 3430 D
3440 3424 D
3437 3419 D
3428 3413 D
3417 3407 D
S
N
3402 3387 M
3405 3390 D
3411 3390 D
3425 3384 D
3434 3384 D
3440 3387 D
3443 3390 D
S
N
3411 3390 M
3425 3381 D
3437 3381 D
3440 3384 D
3443 3390 D
3443 3395 D
S
N
3466 3442 M
3460 3413 D
S
N
3460 3413 M
3466 3419 D
3475 3421 D
3483 3421 D
3492 3419 D
3498 3413 D
3501 3404 D
3501 3398 D
3498 3390 D
3492 3384 D
3483 3381 D
3475 3381 D
3466 3384 D
3463 3387 D
3460 3393 D
3460 3395 D
3463 3398 D
3466 3395 D
3463 3393 D
S
N
3483 3421 M
3489 3419 D
3495 3413 D
3498 3404 D
3498 3398 D
3495 3390 D
3489 3384 D
3483 3381 D
S
N
3466 3442 M
3495 3442 D
S
N
3466 3439 M
3480 3439 D
3495 3442 D
S
N
3604 3433 M
3607 3424 D
3607 3442 D
3604 3433 D
3599 3439 D
3590 3442 D
3584 3442 D
3576 3439 D
3570 3433 D
3567 3427 D
3564 3419 D
3564 3404 D
3567 3395 D
3570 3390 D
3576 3384 D
3584 3381 D
3590 3381 D
3599 3384 D
3604 3390 D
S
N
3584 3442 M
3579 3439 D
3573 3433 D
3570 3427 D
3567 3419 D
3567 3404 D
3570 3395 D
3573 3390 D
3579 3384 D
3584 3381 D
S
N
3604 3404 M
3604 3381 D
S
N
3607 3404 M
3607 3381 D
S
N
3596 3404 M
3616 3404 D
S
N
3633 3404 M
3668 3404 D
3668 3410 D
3665 3416 D
3662 3419 D
3656 3421 D
3648 3421 D
3639 3419 D
3633 3413 D
3630 3404 D
3630 3398 D
3633 3390 D
3639 3384 D
3648 3381 D
3654 3381 D
3662 3384 D
3668 3390 D
S
N
3665 3404 M
3665 3413 D
3662 3419 D
S
N
3648 3421 M
3642 3419 D
3636 3413 D
3633 3404 D
3633 3398 D
3636 3390 D
3642 3384 D
3648 3381 D
S
N
3685 3442 M
3706 3381 D
S
N
3688 3442 M
3706 3390 D
S
N
3726 3442 M
3706 3381 D
S
N
3680 3442 M
3697 3442 D
S
N
3714 3442 M
3732 3442 D
S
[6 30] 0 Sd
N
785 2723 M
1380 2723 D
1380 2914 D
1440 2914 D
1440 2938 D
1499 2938 D
1499 2965 D
1559 2965 D
1559 2997 D
1618 2997 D
1618 3035 D
1678 3035 D
1678 3080 D
1737 3080 D
1737 3138 D
1797 3138 D
1797 3214 D
1856 3214 D
1856 3327 D
1916 3327 D
1916 3526 D
1975 3526 D
1975 4095 D
2035 4095 D
2035 3880 D
2094 3880 D
2094 2723 D
3762 2723 D
S
N
2571 3877 M
2868 3877 D
S
[] 0 Sd
N
2997 3903 M
2997 3843 D
S
N
3000 3903 M
3000 3843 D
S
N
2988 3903 M
3009 3903 D
S
N
2988 3843 M
3032 3843 D
3032 3860 D
3029 3843 D
S
N
3064 3903 M
3055 3900 D
3049 3894 D
3046 3889 D
3043 3877 D
3043 3868 D
3046 3857 D
3049 3851 D
3055 3845 D
3064 3843 D
3069 3843 D
3078 3845 D
3084 3851 D
3087 3857 D
3089 3868 D
3089 3877 D
3087 3889 D
3084 3894 D
3078 3900 D
3069 3903 D
3064 3903 D
S
N
3064 3903 M
3058 3900 D
3052 3894 D
3049 3889 D
3046 3877 D
3046 3868 D
3049 3857 D
3052 3851 D
3058 3845 D
3064 3843 D
S
N
3069 3843 M
3075 3845 D
3081 3851 D
3084 3857 D
3087 3868 D
3087 3877 D
3084 3889 D
3081 3894 D
3075 3900 D
3069 3903 D
S
1.00 0.00 0.00 setrgbcolor
N
785 2723 M
904 2723 D
904 2771 D
963 2771 D
963 2833 D
1023 2833 D
1023 2856 D
1082 2856 D
1082 2887 D
1142 2887 D
1142 2927 D
1201 2927 D
1201 2986 D
1261 2986 D
1261 3088 D
1320 3088 D
1320 3391 D
1380 3391 D
1380 3243 D
1440 3243 D
1440 3296 D
1499 3296 D
1499 3361 D
1559 3361 D
1559 3431 D
1618 3431 D
1618 3520 D
1678 3520 D
1678 3620 D
1737 3620 D
1737 3749 D
1797 3749 D
1797 3915 D
1856 3915 D
1856 4138 D
1916 4138 D
1916 4485 D
1975 4485 D
1975 4685 D
S
N
2035 4685 M
2035 2262 D
S
N
2094 2262 M
2094 2772 D
2154 2772 D
2154 2756 D
2214 2756 D
2214 2748 D
2273 2748 D
2273 2743 D
2333 2743 D
2333 2740 D
2392 2740 D
2392 2737 D
2452 2737 D
2452 2735 D
2511 2735 D
2511 2734 D
2571 2734 D
2571 2733 D
2630 2733 D
2630 2731 D
2690 2731 D
2690 2731 D
2749 2731 D
2749 2730 D
2809 2730 D
2809 2729 D
2868 2729 D
2868 2729 D
2928 2729 D
2928 2728 D
2988 2728 D
2988 2728 D
3047 2728 D
3047 2727 D
3107 2727 D
3107 2727 D
3166 2727 D
3166 2727 D
3226 2727 D
3226 2726 D
3285 2726 D
3285 2726 D
3345 2726 D
3345 2726 D
3404 2726 D
3404 2726 D
3464 2726 D
3464 2726 D
3523 2726 D
3523 2725 D
3583 2725 D
3583 2725 D
3642 2725 D
3642 2725 D
3702 2725 D
3702 2725 D
3762 2725 D
3762 2725 D
3762 2725 D
S
3762 2723 P
N
2571 4108 M
2868 4108 D
S
N
2997 4134 M
2997 4073 D
S
N
3000 4134 M
3035 4079 D
S
N
3000 4128 M
3035 4073 D
S
N
3035 4134 M
3035 4073 D
S
N
2988 4134 M
3000 4134 D
S
N
3026 4134 M
3043 4134 D
S
N
2988 4073 M
3006 4073 D
S
N
3064 4134 M
3064 4073 D
S
N
3066 4134 M
3066 4073 D
S
N
3055 4134 M
3075 4134 D
S
N
3055 4073 M
3098 4073 D
3098 4091 D
3095 4073 D
S
N
3130 4134 M
3121 4131 D
3115 4125 D
3113 4119 D
3110 4108 D
3110 4099 D
3113 4088 D
3115 4082 D
3121 4076 D
3130 4073 D
3136 4073 D
3144 4076 D
3150 4082 D
3153 4088 D
3156 4099 D
3156 4108 D
3153 4119 D
3150 4125 D
3144 4131 D
3136 4134 D
3130 4134 D
S
N
3130 4134 M
3124 4131 D
3118 4125 D
3115 4119 D
3113 4108 D
3113 4099 D
3115 4088 D
3118 4082 D
3124 4076 D
3130 4073 D
S
N
3136 4073 M
3141 4076 D
3147 4082 D
3150 4088 D
3153 4099 D
3153 4108 D
3150 4119 D
3147 4125 D
3141 4131 D
3136 4134 D
S
0.00 0.00 1.00 setrgbcolor
N
968 2815 M
899 2815 D
S
N
933 2815 M
933 2813 D
S
N
968 2813 M
899 2813 D
S
N
1028 2932 M
958 2932 D
S
N
993 2932 M
993 2929 D
S
N
1028 2929 M
958 2929 D
S
N
1087 2977 M
1018 2977 D
S
N
1053 2977 M
1053 2974 D
S
N
1087 2974 M
1018 2974 D
S
N
1147 3027 M
1077 3027 D
S
N
1112 3027 M
1112 3024 D
S
N
1147 3024 M
1077 3024 D
S
N
1206 3094 M
1137 3094 D
S
N
1172 3094 M
1172 3091 D
S
N
1206 3091 M
1137 3091 D
S
N
1266 3184 M
1197 3184 D
S
N
1231 3184 M
1231 3180 D
S
N
1266 3180 M
1197 3180 D
S
N
1325 3302 M
1256 3302 D
S
N
1291 3302 M
1291 3298 D
S
N
1325 3298 M
1256 3298 D
S
N
1385 3284 M
1316 3284 D
S
N
1350 3284 M
1350 3277 D
S
N
1385 3277 M
1316 3277 D
S
N
1444 3428 M
1375 3428 D
S
N
1410 3428 M
1410 3417 D
S
N
1444 3417 M
1375 3417 D
S
N
1504 3503 M
1435 3503 D
S
N
1469 3503 M
1469 3493 D
S
N
1504 3493 M
1435 3493 D
S
N
1563 3576 M
1494 3576 D
S
N
1529 3576 M
1529 3567 D
S
N
1563 3567 M
1494 3567 D
S
N
1623 3678 M
1554 3678 D
S
N
1588 3678 M
1588 3668 D
S
N
1623 3668 M
1554 3668 D
S
N
1683 3770 M
1613 3770 D
S
N
1648 3770 M
1648 3758 D
S
N
1683 3758 M
1613 3758 D
S
N
1742 3877 M
1673 3877 D
S
N
1707 3877 M
1707 3865 D
S
N
1742 3865 M
1673 3865 D
S
N
1802 3999 M
1732 3999 D
S
N
1767 3999 M
1767 3986 D
S
N
1802 3986 M
1732 3986 D
S
N
1861 4140 M
1792 4140 D
S
N
1827 4140 M
1827 4125 D
S
N
1861 4125 M
1792 4125 D
S
N
1921 4246 M
1851 4246 D
S
N
1886 4246 M
1886 4230 D
S
N
1921 4230 M
1851 4230 D
S
N
1980 4247 M
1911 4247 D
S
N
1946 4247 M
1946 4231 D
S
N
1980 4231 M
1911 4231 D
S
N
2040 2915 M
1971 2915 D
S
N
2005 2915 M
2005 2893 D
S
N
2040 2893 M
1971 2893 D
S
N
2099 3636 M
2030 3636 D
S
N
2065 3636 M
2065 3618 D
S
N
2099 3618 M
2030 3618 D
S
N
2159 2817 M
2090 2817 D
S
N
2124 2817 M
2124 2816 D
S
N
2159 2816 M
2090 2816 D
S
N
2218 2786 M
2149 2786 D
S
N
2184 2786 M
2184 2785 D
S
N
2218 2785 M
2149 2785 D
S
N
2278 2770 M
2209 2770 D
S
N
2243 2770 M
2243 2769 D
S
N
2278 2769 M
2209 2769 D
S
N
2337 2761 M
2268 2761 D
S
N
2303 2761 M
2303 2760 D
S
N
2337 2760 M
2268 2760 D
S
N
2397 2754 M
2328 2754 D
S
N
2362 2754 M
2362 2753 D
S
N
2397 2753 M
2328 2753 D
S
N
2457 2749 M
2387 2749 D
S
N
2422 2749 M
2422 2748 D
S
N
2457 2748 M
2387 2748 D
S
N
2516 2745 M
2447 2745 D
S
N
2481 2745 M
2481 2744 D
S
N
2516 2744 M
2447 2744 D
S
N
2576 2742 M
2506 2742 D
S
N
2541 2742 M
2541 2741 D
S
N
2576 2741 M
2506 2741 D
S
N
2635 2740 M
2566 2740 D
S
N
2601 2740 M
2601 2739 D
S
N
2635 2739 M
2566 2739 D
S
N
2695 2737 M
2625 2737 D
S
N
2660 2737 M
2660 2737 D
S
N
2695 2737 M
2625 2737 D
S
N
2754 2736 M
2685 2736 D
S
N
2720 2736 M
2720 2736 D
S
N
2754 2736 M
2685 2736 D
S
N
2814 2734 M
2745 2734 D
S
N
2779 2734 M
2779 2734 D
S
N
2814 2734 M
2745 2734 D
S
N
2873 2733 M
2804 2733 D
S
N
2839 2733 M
2839 2733 D
S
N
2873 2733 M
2804 2733 D
S
N
2933 2732 M
2864 2732 D
S
N
2898 2732 M
2898 2732 D
S
N
2933 2732 M
2864 2732 D
S
N
2992 2731 M
2923 2731 D
S
N
2958 2731 M
2958 2731 D
S
N
2992 2731 M
2923 2731 D
S
N
3052 2731 M
2983 2731 D
S
N
3017 2731 M
3017 2730 D
S
N
3052 2730 M
2983 2730 D
S
N
3111 2730 M
3042 2730 D
S
N
3077 2730 M
3077 2730 D
S
N
3111 2730 M
3042 2730 D
S
N
3171 2729 M
3102 2729 D
S
N
3136 2729 M
3136 2729 D
S
N
3171 2729 M
3102 2729 D
S
N
3231 2729 M
3161 2729 D
S
N
3196 2729 M
3196 2728 D
S
N
3231 2728 M
3161 2728 D
S
N
3290 2728 M
3221 2728 D
S
N
3255 2728 M
3255 2728 D
S
N
3290 2728 M
3221 2728 D
S
N
3350 2728 M
3280 2728 D
S
N
3315 2728 M
3315 2728 D
S
N
3350 2728 M
3280 2728 D
S
N
3409 2727 M
3340 2727 D
S
N
3375 2727 M
3375 2727 D
S
N
3409 2727 M
3340 2727 D
S
N
3469 2727 M
3399 2727 D
S
N
3434 2727 M
3434 2727 D
S
N
3469 2727 M
3399 2727 D
S
N
3528 2727 M
3459 2727 D
S
N
3494 2727 M
3494 2727 D
S
N
3528 2727 M
3459 2727 D
S
N
3588 2726 M
3519 2726 D
S
N
3553 2726 M
3553 2726 D
S
N
3588 2726 M
3519 2726 D
S
N
3647 2726 M
3578 2726 D
S
N
3613 2726 M
3613 2726 D
S
N
3647 2726 M
3578 2726 D
S
N
3707 2726 M
3638 2726 D
S
N
3672 2726 M
3672 2726 D
S
N
3707 2726 M
3638 2726 D
S
N
3762 2726 M
3697 2726 D
S
N
3732 2726 M
3732 2726 D
S
N
3762 2726 M
3697 2726 D
S
N
3762 2726 M
3757 2726 D
S
N
3762 2726 M
3757 2726 D
S
N
2754 4373 M
2685 4373 D
S
N
2720 4373 M
2720 4304 D
S
N
2754 4304 M
2685 4304 D
S
N
2997 4365 M
2997 4304 D
S
N
3000 4365 M
3035 4310 D
S
N
3000 4359 M
3035 4304 D
S
N
3035 4365 M
3035 4304 D
S
N
2988 4365 M
3000 4365 D
S
N
3026 4365 M
3043 4365 D
S
N
2988 4304 M
3006 4304 D
S
N
3064 4365 M
3064 4304 D
S
N
3066 4365 M
3101 4310 D
S
N
3066 4359 M
3101 4304 D
S
N
3101 4365 M
3101 4304 D
S
N
3055 4365 M
3066 4365 D
S
N
3092 4365 M
3110 4365 D
S
N
3055 4304 M
3072 4304 D
S
N
3130 4365 M
3130 4304 D
S
N
3133 4365 M
3133 4304 D
S
N
3121 4365 M
3141 4365 D
S
N
3121 4304 M
3165 4304 D
3165 4321 D
3162 4304 D
S
N
3196 4365 M
3188 4362 D
3182 4356 D
3179 4350 D
3176 4339 D
3176 4330 D
3179 4318 D
3182 4313 D
3188 4307 D
3196 4304 D
3202 4304 D
3211 4307 D
3217 4313 D
3219 4318 D
3222 4330 D
3222 4339 D
3219 4350 D
3217 4356 D
3211 4362 D
3202 4365 D
3196 4365 D
S
N
3196 4365 M
3191 4362 D
3185 4356 D
3182 4350 D
3179 4339 D
3179 4330 D
3182 4318 D
3185 4313 D
3191 4307 D
3196 4304 D
S
N
3202 4304 M
3208 4307 D
3214 4313 D
3217 4318 D
3219 4330 D
3219 4339 D
3217 4350 D
3214 4356 D
3208 4362 D
3202 4365 D
S
0.00 0.00 0.00 setrgbcolor
N
785 4685 M
785 2262 D
S
N
785 2262 M
3762 2262 D
S
N
3762 2262 M
3762 4685 D
S
N
3762 4685 M
785 4685 D
S
N
785 2262 M
785 2366 D
S
N
904 2296 M
904 2262 D
S
N
1023 2262 M
1023 2296 D
S
N
1142 2296 M
1142 2262 D
S
N
1261 2262 M
1261 2296 D
S
N
1380 2366 M
1380 2262 D
S
N
1499 2262 M
1499 2296 D
S
N
1618 2296 M
1618 2262 D
S
N
1737 2262 M
1737 2296 D
S
N
1856 2296 M
1856 2262 D
S
N
1975 2262 M
1975 2366 D
S
N
2094 2296 M
2094 2262 D
S
N
2214 2262 M
2214 2296 D
S
N
2333 2296 M
2333 2262 D
S
N
2452 2262 M
2452 2296 D
S
N
2571 2366 M
2571 2262 D
S
N
2690 2262 M
2690 2296 D
S
N
2809 2296 M
2809 2262 D
S
N
2928 2262 M
2928 2296 D
S
N
3047 2296 M
3047 2262 D
S
N
3166 2262 M
3166 2366 D
S
N
3285 2296 M
3285 2262 D
S
N
3404 2262 M
3404 2296 D
S
N
3523 2296 M
3523 2262 D
S
N
3642 2262 M
3642 2296 D
S
N
738 2193 M
741 2190 D
738 2187 D
736 2190 D
736 2193 D
738 2199 D
741 2202 D
750 2205 D
762 2205 D
770 2202 D
773 2199 D
776 2193 D
776 2187 D
773 2182 D
764 2176 D
750 2170 D
744 2167 D
738 2161 D
736 2153 D
736 2144 D
S
N
762 2205 M
767 2202 D
770 2199 D
773 2193 D
773 2187 D
770 2182 D
762 2176 D
750 2170 D
S
N
736 2150 M
738 2153 D
744 2153 D
759 2147 D
767 2147 D
773 2150 D
776 2153 D
S
N
744 2153 M
759 2144 D
770 2144 D
773 2147 D
776 2153 D
776 2158 D
S
N
811 2205 M
802 2202 D
796 2193 D
793 2179 D
793 2170 D
796 2156 D
802 2147 D
811 2144 D
816 2144 D
825 2147 D
831 2156 D
834 2170 D
834 2179 D
831 2193 D
825 2202 D
816 2205 D
811 2205 D
S
N
811 2205 M
805 2202 D
802 2199 D
799 2193 D
796 2179 D
796 2170 D
799 2156 D
802 2150 D
805 2147 D
811 2144 D
S
N
816 2144 M
822 2147 D
825 2150 D
828 2156 D
831 2170 D
831 2179 D
828 2193 D
825 2199 D
822 2202 D
816 2205 D
S
N
1357 2199 M
1357 2144 D
S
N
1360 2205 M
1360 2144 D
S
N
1360 2205 M
1328 2161 D
1374 2161 D
S
N
1348 2144 M
1368 2144 D
S
N
1406 2205 M
1397 2202 D
1392 2193 D
1389 2179 D
1389 2170 D
1392 2156 D
1397 2147 D
1406 2144 D
1412 2144 D
1420 2147 D
1426 2156 D
1429 2170 D
1429 2179 D
1426 2193 D
1420 2202 D
1412 2205 D
1406 2205 D
S
N
1406 2205 M
1400 2202 D
1397 2199 D
1394 2193 D
1392 2179 D
1392 2170 D
1394 2156 D
1397 2150 D
1400 2147 D
1406 2144 D
S
N
1412 2144 M
1418 2147 D
1420 2150 D
1423 2156 D
1426 2170 D
1426 2179 D
1423 2193 D
1420 2199 D
1418 2202 D
1412 2205 D
S
N
1961 2196 M
1958 2193 D
1961 2190 D
1964 2193 D
1964 2196 D
1961 2202 D
1955 2205 D
1947 2205 D
1938 2202 D
1932 2196 D
1929 2190 D
1926 2179 D
1926 2161 D
1929 2153 D
1935 2147 D
1944 2144 D
1949 2144 D
1958 2147 D
1964 2153 D
1967 2161 D
1967 2164 D
1964 2173 D
1958 2179 D
1949 2182 D
1947 2182 D
1938 2179 D
1932 2173 D
1929 2164 D
S
N
1947 2205 M
1941 2202 D
1935 2196 D
1932 2190 D
1929 2179 D
1929 2161 D
1932 2153 D
1938 2147 D
1944 2144 D
S
N
1949 2144 M
1955 2147 D
1961 2153 D
1964 2161 D
1964 2164 D
1961 2173 D
1955 2179 D
1949 2182 D
S
N
2001 2205 M
1993 2202 D
1987 2193 D
1984 2179 D
1984 2170 D
1987 2156 D
1993 2147 D
2001 2144 D
2007 2144 D
2016 2147 D
2022 2156 D
2024 2170 D
2024 2179 D
2022 2193 D
2016 2202 D
2007 2205 D
2001 2205 D
S
N
2001 2205 M
1996 2202 D
1993 2199 D
1990 2193 D
1987 2179 D
1987 2170 D
1990 2156 D
1993 2150 D
1996 2147 D
2001 2144 D
S
N
2007 2144 M
2013 2147 D
2016 2150 D
2019 2156 D
2022 2170 D
2022 2179 D
2019 2193 D
2016 2199 D
2013 2202 D
2007 2205 D
S
N
2536 2205 M
2527 2202 D
2525 2196 D
2525 2187 D
2527 2182 D
2536 2179 D
2548 2179 D
2556 2182 D
2559 2187 D
2559 2196 D
2556 2202 D
2548 2205 D
2536 2205 D
S
N
2536 2205 M
2530 2202 D
2527 2196 D
2527 2187 D
2530 2182 D
2536 2179 D
S
N
2548 2179 M
2553 2182 D
2556 2187 D
2556 2196 D
2553 2202 D
2548 2205 D
S
N
2536 2179 M
2527 2176 D
2525 2173 D
2522 2167 D
2522 2156 D
2525 2150 D
2527 2147 D
2536 2144 D
2548 2144 D
2556 2147 D
2559 2150 D
2562 2156 D
2562 2167 D
2559 2173 D
2556 2176 D
2548 2179 D
S
N
2536 2179 M
2530 2176 D
2527 2173 D
2525 2167 D
2525 2156 D
2527 2150 D
2530 2147 D
2536 2144 D
S
N
2548 2144 M
2553 2147 D
2556 2150 D
2559 2156 D
2559 2167 D
2556 2173 D
2553 2176 D
2548 2179 D
S
N
2597 2205 M
2588 2202 D
2582 2193 D
2579 2179 D
2579 2170 D
2582 2156 D
2588 2147 D
2597 2144 D
2603 2144 D
2611 2147 D
2617 2156 D
2620 2170 D
2620 2179 D
2617 2193 D
2611 2202 D
2603 2205 D
2597 2205 D
S
N
2597 2205 M
2591 2202 D
2588 2199 D
2585 2193 D
2582 2179 D
2582 2170 D
2585 2156 D
2588 2150 D
2591 2147 D
2597 2144 D
S
N
2603 2144 M
2608 2147 D
2611 2150 D
2614 2156 D
2617 2170 D
2617 2179 D
2614 2193 D
2611 2199 D
2608 2202 D
2603 2205 D
S
N
3097 2193 M
3103 2196 D
3111 2205 D
3111 2144 D
S
N
3108 2202 M
3108 2144 D
S
N
3097 2144 M
3123 2144 D
S
N
3163 2205 M
3155 2202 D
3149 2193 D
3146 2179 D
3146 2170 D
3149 2156 D
3155 2147 D
3163 2144 D
3169 2144 D
3178 2147 D
3184 2156 D
3186 2170 D
3186 2179 D
3184 2193 D
3178 2202 D
3169 2205 D
3163 2205 D
S
N
3163 2205 M
3158 2202 D
3155 2199 D
3152 2193 D
3149 2179 D
3149 2170 D
3152 2156 D
3155 2150 D
3158 2147 D
3163 2144 D
S
N
3169 2144 M
3175 2147 D
3178 2150 D
3181 2156 D
3184 2170 D
3184 2179 D
3181 2193 D
3178 2199 D
3175 2202 D
3169 2205 D
S
N
3221 2205 M
3212 2202 D
3207 2193 D
3204 2179 D
3204 2170 D
3207 2156 D
3212 2147 D
3221 2144 D
3227 2144 D
3236 2147 D
3241 2156 D
3244 2170 D
3244 2179 D
3241 2193 D
3236 2202 D
3227 2205 D
3221 2205 D
S
N
3221 2205 M
3215 2202 D
3212 2199 D
3210 2193 D
3207 2179 D
3207 2170 D
3210 2156 D
3212 2150 D
3215 2147 D
3221 2144 D
S
N
3227 2144 M
3233 2147 D
3236 2150 D
3238 2156 D
3241 2170 D
3241 2179 D
3238 2193 D
3236 2199 D
3233 2202 D
3227 2205 D
S
N
3692 2193 M
3698 2196 D
3707 2205 D
3707 2144 D
S
N
3704 2202 M
3704 2144 D
S
N
3692 2144 M
3718 2144 D
S
N
3744 2193 M
3747 2190 D
3744 2187 D
3741 2190 D
3741 2193 D
3744 2199 D
3747 2202 D
3756 2205 D
3767 2205 D
3776 2202 D
3779 2199 D
3782 2193 D
3782 2187 D
3779 2182 D
3770 2176 D
3756 2170 D
3750 2167 D
3744 2161 D
3741 2153 D
3741 2144 D
S
N
3767 2205 M
3773 2202 D
3776 2199 D
3779 2193 D
3779 2187 D
3776 2182 D
3767 2176 D
3756 2170 D
S
N
3741 2150 M
3744 2153 D
3750 2153 D
3764 2147 D
3773 2147 D
3779 2150 D
3782 2153 D
S
N
3750 2153 M
3764 2144 D
3776 2144 D
3779 2147 D
3782 2153 D
3782 2158 D
S
N
3816 2205 M
3808 2202 D
3802 2193 D
3799 2179 D
3799 2170 D
3802 2156 D
3808 2147 D
3816 2144 D
3822 2144 D
3831 2147 D
3837 2156 D
3840 2170 D
3840 2179 D
3837 2193 D
3831 2202 D
3822 2205 D
3816 2205 D
S
N
3816 2205 M
3811 2202 D
3808 2199 D
3805 2193 D
3802 2179 D
3802 2170 D
3805 2156 D
3808 2150 D
3811 2147 D
3816 2144 D
S
N
3822 2144 M
3828 2147 D
3831 2150 D
3834 2156 D
3837 2170 D
3837 2179 D
3834 2193 D
3831 2199 D
3828 2202 D
3822 2205 D
S
N
785 4685 M
3762 4685 D
S
N
785 4581 M
785 4685 D
S
N
904 4685 M
904 4650 D
S
N
1023 4650 M
1023 4685 D
S
N
1142 4685 M
1142 4650 D
S
N
1261 4650 M
1261 4685 D
S
N
1380 4685 M
1380 4581 D
S
N
1499 4650 M
1499 4685 D
S
N
1618 4685 M
1618 4650 D
S
N
1737 4650 M
1737 4685 D
S
N
1856 4685 M
1856 4650 D
S
N
1975 4581 M
1975 4685 D
S
N
2094 4685 M
2094 4650 D
S
N
2214 4650 M
2214 4685 D
S
N
2333 4685 M
2333 4650 D
S
N
2452 4650 M
2452 4685 D
S
N
2571 4685 M
2571 4581 D
S
N
2690 4650 M
2690 4685 D
S
N
2809 4685 M
2809 4650 D
S
N
2928 4650 M
2928 4685 D
S
N
3047 4685 M
3047 4650 D
S
N
3166 4581 M
3166 4685 D
S
N
3285 4685 M
3285 4650 D
S
N
3404 4650 M
3404 4685 D
S
N
3523 4685 M
3523 4650 D
S
N
3642 4650 M
3642 4685 D
S
N
785 2262 M
785 4685 D
S
N
819 2377 M
785 2377 D
S
N
785 2493 M
819 2493 D
S
N
819 2608 M
785 2608 D
S
N
785 2723 M
888 2723 D
S
N
819 2839 M
785 2839 D
S
N
785 2954 M
819 2954 D
S
N
819 3069 M
785 3069 D
S
N
785 3185 M
819 3185 D
S
N
888 3300 M
785 3300 D
S
N
785 3416 M
819 3416 D
S
N
819 3531 M
785 3531 D
S
N
785 3646 M
819 3646 D
S
N
819 3762 M
785 3762 D
S
N
785 3877 M
888 3877 D
S
N
819 3993 M
785 3993 D
S
N
785 4108 M
819 4108 D
S
N
819 4223 M
785 4223 D
S
N
785 4339 M
819 4339 D
S
N
888 4454 M
785 4454 D
S
N
785 4569 M
819 4569 D
S
N
819 4685 M
785 4685 D
S
N
632 2749 M
623 2746 D
617 2738 D
614 2723 D
614 2715 D
617 2700 D
623 2692 D
632 2689 D
637 2689 D
646 2692 D
652 2700 D
655 2715 D
655 2723 D
652 2738 D
646 2746 D
637 2749 D
632 2749 D
S
N
632 2749 M
626 2746 D
623 2744 D
620 2738 D
617 2723 D
617 2715 D
620 2700 D
623 2694 D
626 2692 D
632 2689 D
S
N
637 2689 M
643 2692 D
646 2694 D
649 2700 D
652 2715 D
652 2723 D
649 2738 D
646 2744 D
643 2746 D
637 2749 D
S
N
678 2694 M
675 2692 D
678 2689 D
681 2692 D
678 2694 D
S
N
718 2749 M
710 2746 D
704 2738 D
701 2723 D
701 2715 D
704 2700 D
710 2692 D
718 2689 D
724 2689 D
733 2692 D
739 2700 D
741 2715 D
741 2723 D
739 2738 D
733 2746 D
724 2749 D
718 2749 D
S
N
718 2749 M
713 2746 D
710 2744 D
707 2738 D
704 2723 D
704 2715 D
707 2700 D
710 2694 D
713 2692 D
718 2689 D
S
N
724 2689 M
730 2692 D
733 2694 D
736 2700 D
739 2715 D
739 2723 D
736 2738 D
733 2744 D
730 2746 D
724 2749 D
S
N
632 3326 M
623 3323 D
617 3315 D
614 3300 D
614 3292 D
617 3277 D
623 3268 D
632 3266 D
637 3266 D
646 3268 D
652 3277 D
655 3292 D
655 3300 D
652 3315 D
646 3323 D
637 3326 D
632 3326 D
S
N
632 3326 M
626 3323 D
623 3320 D
620 3315 D
617 3300 D
617 3292 D
620 3277 D
623 3271 D
626 3268 D
632 3266 D
S
N
637 3266 M
643 3268 D
646 3271 D
649 3277 D
652 3292 D
652 3300 D
649 3315 D
646 3320 D
643 3323 D
637 3326 D
S
N
678 3271 M
675 3268 D
678 3266 D
681 3268 D
678 3271 D
S
N
707 3326 M
701 3297 D
S
N
701 3297 M
707 3303 D
715 3306 D
724 3306 D
733 3303 D
739 3297 D
741 3289 D
741 3283 D
739 3274 D
733 3268 D
724 3266 D
715 3266 D
707 3268 D
704 3271 D
701 3277 D
701 3280 D
704 3283 D
707 3280 D
704 3277 D
S
N
724 3306 M
730 3303 D
736 3297 D
739 3289 D
739 3283 D
736 3274 D
730 3268 D
724 3266 D
S
N
707 3326 M
736 3326 D
S
N
707 3323 M
721 3323 D
736 3326 D
S
N
623 3892 M
629 3894 D
637 3903 D
637 3843 D
S
N
635 3900 M
635 3843 D
S
N
623 3843 M
649 3843 D
S
N
678 3848 M
675 3845 D
678 3843 D
681 3845 D
678 3848 D
S
N
718 3903 M
710 3900 D
704 3892 D
701 3877 D
701 3868 D
704 3854 D
710 3845 D
718 3843 D
724 3843 D
733 3845 D
739 3854 D
741 3868 D
741 3877 D
739 3892 D
733 3900 D
724 3903 D
718 3903 D
S
N
718 3903 M
713 3900 D
710 3897 D
707 3892 D
704 3877 D
704 3868 D
707 3854 D
710 3848 D
713 3845 D
718 3843 D
S
N
724 3843 M
730 3845 D
733 3848 D
736 3854 D
739 3868 D
739 3877 D
736 3892 D
733 3897 D
730 3900 D
724 3903 D
S
N
623 4469 M
629 4471 D
637 4480 D
637 4419 D
S
N
635 4477 M
635 4419 D
S
N
623 4419 M
649 4419 D
S
N
678 4425 M
675 4422 D
678 4419 D
681 4422 D
678 4425 D
S
N
707 4480 M
701 4451 D
S
N
701 4451 M
707 4457 D
715 4460 D
724 4460 D
733 4457 D
739 4451 D
741 4443 D
741 4437 D
739 4428 D
733 4422 D
724 4419 D
715 4419 D
707 4422 D
704 4425 D
701 4431 D
701 4434 D
704 4437 D
707 4434 D
704 4431 D
S
N
724 4460 M
730 4457 D
736 4451 D
739 4443 D
739 4437 D
736 4428 D
730 4422 D
724 4419 D
S
N
707 4480 M
736 4480 D
S
N
707 4477 M
721 4477 D
736 4480 D
S
N
3762 2377 M
3727 2377 D
S
N
3727 2493 M
3762 2493 D
S
N
3762 2608 M
3727 2608 D
S
N
3658 2723 M
3762 2723 D
S
N
3762 2839 M
3727 2839 D
S
N
3727 2954 M
3762 2954 D
S
N
3762 3069 M
3727 3069 D
S
N
3727 3185 M
3762 3185 D
S
N
3762 3300 M
3658 3300 D
S
N
3727 3416 M
3762 3416 D
S
N
3762 3531 M
3727 3531 D
S
N
3727 3646 M
3762 3646 D
S
N
3762 3762 M
3727 3762 D
S
N
3658 3877 M
3762 3877 D
S
N
3762 3993 M
3727 3993 D
S
N
3727 4108 M
3762 4108 D
S
N
3762 4223 M
3727 4223 D
S
N
3727 4339 M
3762 4339 D
S
N
3762 4454 M
3658 4454 D
S
N
3727 4569 M
3762 4569 D
S
N
3762 4685 M
3727 4685 D
S
showpage
%%Trailer
%%Pages: 1
%%BoundingBox: 50 236 464 565
