%!PS-Adobe-2.0 EPSF-2.0
%%BoundingBox: 71 198 475 390
%%HiResBoundingBox: 71.000000 198.500000 475.000000 389.500000
%...................................
%%Creator: GPL Ghostscript 870 (pswrite)
%%CreationDate: 2013/02/14 17:58:14
%%DocumentData: Clean7Bit
%%LanguageLevel: 2
%%EndComments
% EPSF created by ps2eps 1.64
%%BeginProlog
save
countdictstack
mark
newpath
/showpage {} def
/setpagedevice {pop} def
%%EndProlog
%%Page 1 1
%%BeginProlog
% This copyright applies to everything between here and the %%EndProlog:
% Copyright (C) 2009 Artifex Software, Inc.  All rights reserved.
%%BeginResource: procset GS_pswrite_2_0_1001 1.001 0
/GS_pswrite_2_0_1001 80 dict dup begin
/PageSize 2 array def/setpagesize{ PageSize aload pop 3 index eq exch
4 index eq and{ pop pop pop}{ PageSize dup  1
5 -1 roll put 0 4 -1 roll put dup null eq {false} {dup where} ifelse{ exch get exec}
{ pop/setpagedevice where
{ pop 1 dict dup /PageSize PageSize put setpagedevice}
{ /setpage where{ pop PageSize aload pop pageparams 3 {exch pop} repeat
setpage}if}ifelse}ifelse}ifelse} bind def
/!{bind def}bind def/#{load def}!/N/counttomark #
/rG{3{3 -1 roll 255 div}repeat setrgbcolor}!/G{255 div setgray}!/K{0 G}!
/r6{dup 3 -1 roll rG}!/r5{dup 3 1 roll rG}!/r3{dup rG}!
/w/setlinewidth #/J/setlinecap #
/j/setlinejoin #/M/setmiterlimit #/d/setdash #/i/setflat #
/m/moveto #/l/lineto #/c/rcurveto #
/p{N 2 idiv{N -2 roll rlineto}repeat}!
/P{N 0 gt{N -2 roll moveto p}if}!
/h{p closepath}!/H{P closepath}!
/lx{0 rlineto}!/ly{0 exch rlineto}!/v{0 0 6 2 roll c}!/y{2 copy c}!
/re{4 -2 roll m exch dup lx exch ly neg lx h}!
/^{3 index neg 3 index neg}!
/f{P fill}!/f*{P eofill}!/s{H stroke}!/S{P stroke}!
/q/gsave #/Q/grestore #/rf{re fill}!
/Y{P clip newpath}!/Y*{P eoclip newpath}!/rY{re Y}!
/|={pop exch 4 1 roll 1 array astore cvx 3 array astore cvx exch 1 index def exec}!
/|{exch string readstring |=}!
/+{dup type/nametype eq{2 index 7 add -3 bitshift 2 index mul}if}!
/@/currentfile #/${+ @ |}!
/B{{2 copy string{readstring pop}aload pop 4 array astore cvx
3 1 roll}repeat pop pop true}!
/Ix{[1 0 0 1 11 -2 roll exch neg exch neg]exch}!
/,{true exch Ix imagemask}!/If{false exch Ix imagemask}!/I{exch Ix image}!
/Ic{exch Ix false 3 colorimage}!
/F{/Columns counttomark 3 add -2 roll/Rows exch/K -1/BlackIs1 true>>
/CCITTFaxDecode filter}!/FX{<</EndOfBlock false F}!
/X{/ASCII85Decode filter}!/@X{@ X}!/&2{2 index 2 index}!
/@F{@ &2<<F}!/@C{@X &2 FX}!
/$X{+ @X |}!/&4{4 index 4 index}!/$F{+ @ &4<<F |}!/$C{+ @X &4 FX |}!
/IC{3 1 roll 10 dict begin 1{/ImageType/Interpolate/Decode/DataSource
/ImageMatrix/BitsPerComponent/Height/Width}{exch def}forall
currentdict end image}!
/~{@ read {pop} if}!
end def
%%EndResource
/pagesave null def
%%EndProlog
%%Page: 1 1
%%PageBoundingBox: 0 0 612 792
%%BeginPageSetup
GS_pswrite_2_0_1001 begin
612 792 /letter setpagesize
/pagesave save store 197 dict begin
0.1 0.1 scale
%%EndPageSetup
gsave mark
Q q
0 0 6120 7920 re
Y
4.8 w
1 J
1 j
K
2395.2 5863.2 -9.6 -12 -9.6 -14.4 -12 -21.6 -4.8 -26.4 0 -19.2 4.8 -26.4 12 -21.6 
9.6 -14.4 9.6 -9.6 P
2385.6 5851.2 -9.6 -19.2 -7.2 -16.8 -4.8 -26.4 0 -19.2 4.8 -26.4 7.2 -14.4 9.6 -21.6 P
2608.8 5841.6 -4.8 -4.8 4.8 -4.8 ^ ^ P
2613.6 5805.6 0 -93.6 -4.8 -9.6 -9.6 -4.8 -12 0 -4.8 4.8 0 4.8 4.8 4.8 
7.2 -4.8 -7.2 -4.8 P
2608.8 5805.6 0 -93.6 -4.8 -9.6 -4.8 -4.8 P
2594.4 5805.6 19.2 0 P
2649.6 5805.6 31.2 -72 P
2656.8 5805.6 24 -62.4 P
2712 5805.6 -31.2 -72 P
2640 5805.6 31.2 0 P
2692.8 5805.6 31.2 0 P
2750.4 5774.4 60 0 0 9.6 -4.8 12 -4.8 4.8 -9.6 4.8 -16.8 0 -14.4 -4.8 
-9.6 -12 -7.2 -14.4 0 -9.6 7.2 -16.8 9.6 -9.6 14.4 -4.8 12 0 14.4 4.8 
9.6 9.6 P
2805.6 5774.4 0 14.4 -4.8 12 P
2774.4 5805.6 -9.6 -4.8 -9.6 -12 -4.8 -14.4 0 -9.6 4.8 -16.8 9.6 -9.6 9.6 -4.8 P
2853.6 5841.6 0 -88.8 4.8 -14.4 9.6 -4.8 12 0 9.6 4.8 4.8 9.6 P
2858.4 5841.6 0 -88.8 4.8 -14.4 4.8 -4.8 P
2836.8 5805.6 43.2 0 P
2952 5805.6 -16.8 -4.8 -9.6 -12 -4.8 -14.4 0 -9.6 4.8 -16.8 9.6 -9.6 16.8 -4.8 
9.6 0 16.8 4.8 9.6 9.6 4.8 16.8 0 9.6 -4.8 14.4 -9.6 12 -16.8 4.8 
-9.6 0 -9.6 -4.8 -12 -12 -4.8 -14.4 0 -9.6 4.8 -16.8 12 -9.6 9.6 -4.8 P
2961.6 5733.6 12 4.8 9.6 9.6 4.8 16.8 0 9.6 -4.8 14.4 -9.6 12 -12 4.8 P
3117.6 5805.6 0 -108 P
3122.4 5805.6 0 -108 P
3122.4 5788.8 12 12 9.6 4.8 9.6 0 16.8 -4.8 9.6 -12 4.8 -14.4 0 -9.6 
-4.8 -16.8 -9.6 -9.6 -16.8 -4.8 -9.6 0 -9.6 4.8 -12 9.6 S
3153.6 5805.6 12 -4.8 9.6 -12 4.8 -14.4 0 -9.6 -4.8 -16.8 -9.6 -9.6 -12 -4.8 P
3103.2 5805.6 19.2 0 P
3103.2 5697.6 36 0 P
3247.2 5841.6 0 -108 P
3254.4 5841.6 0 -108 P
3216 5841.6 -4.8 -31.2 0 31.2 79.2 0 ^ -4.8 31.2 P
3232.8 5733.6 36 0 P
3648 5805.6 31.2 -72 P
3652.8 5805.6 26.4 -62.4 P
3710.4 5805.6 -31.2 -72 P
3638.4 5805.6 31.2 0 P
3688.8 5805.6 31.2 0 P
3751.2 5841.6 0 -108 P
3758.4 5841.6 0 -108 P
3758.4 5788.8 9.6 12 9.6 4.8 12 0 14.4 -4.8 9.6 -12 7.2 -14.4 0 -9.6 
-7.2 -16.8 -9.6 -9.6 -14.4 -4.8 -12 0 -9.6 4.8 -9.6 9.6 P
3789.6 5805.6 9.6 -4.8 9.6 -12 4.8 -14.4 0 -9.6 -4.8 -16.8 -9.6 -9.6 -9.6 -4.8 P
3736.8 5841.6 21.6 0 P
3888 5836.8 -4.8 -4.8 4.8 -4.8 ^ 0 4.8 -4.8 4.8 -12 0 -9.6 -4.8 
-4.8 -9.6 0 -93.6 P
3876 5841.6 -4.8 -4.8 -4.8 -9.6 0 -93.6 P
3844.8 5805.6 43.2 0 P
3844.8 5733.6 38.4 0 P
3981.6 5788.8 -4.8 -4.8 4.8 -4.8 4.8 4.8 0 4.8 -9.6 12 -12 4.8 -14.4 0 
-16.8 -4.8 -9.6 -12 -4.8 -14.4 0 -9.6 4.8 -16.8 9.6 -9.6 16.8 -4.8 9.6 0 
16.8 4.8 9.6 9.6 P
3950.4 5805.6 -12 -4.8 -9.6 -12 -4.8 -14.4 0 -9.6 4.8 -16.8 9.6 -9.6 12 -4.8 P
4027.2 5805.6 0 -57.6 4.8 -9.6 16.8 -4.8 9.6 0 16.8 4.8 9.6 9.6 P
4032 5805.6 0 -57.6 7.2 -9.6 9.6 -4.8 P
4084.8 5805.6 0 -72 P
4089.6 5805.6 0 -72 P
4012.8 5805.6 19.2 0 P
4070.4 5805.6 19.2 0 P
4084.8 5733.6 21.6 0 P
4142.4 5841.6 0 -88.8 4.8 -14.4 9.6 -4.8 12 0 9.6 4.8 4.8 9.6 S
4147.2 5841.6 0 -88.8 4.8 -14.4 4.8 -4.8 P
4125.6 5805.6 43.2 0 P
4262.4 5796 4.8 9.6 0 -21.6 -4.8 12 -4.8 4.8 -12 4.8 -19.2 0 -12 -4.8 
-4.8 -4.8 0 -12 4.8 -4.8 48 -19.2 4.8 -7.2 P
4209.6 5788.8 4.8 -4.8 48 -19.2 4.8 -4.8 0 -16.8 -4.8 -4.8 -12 -4.8 -19.2 0 
-12 4.8 -4.8 4.8 -4.8 9.6 0 -19.2 4.8 9.6 P
1190.4 3544.8 4154.4 0 0 2076 ^ H
1190.4 3544.8 0 0 P
2020.8 3544.8 0 1701.6 168 0 0 -103.2 165.6 0 0 -103.2 165.6 0 0 -19.2 
165.6 0 0 -117.6 168 0 0 -98.4 165.6 0 0 -67.2 165.6 0 0 -144 
165.6 0 0 -50.4 165.6 0 0 -184.8 165.6 0 0 158.4 168 0 0 -180 
165.6 0 0 -156 165.6 0 0 -81.6 165.6 0 0 -72 168 0 0 -228 
165.6 0 0 -254.4 P
5011.2 3544.8 0 86.4 165.6 0 ^ P
5344.8 3544.8 0 0 P
1190.4 3544.8 0 124.8 P
1358.4 3585.6 0 -40.8 P
1524 3544.8 0 40.8 P
1689.6 3585.6 0 -40.8 P
1855.2 3544.8 0 40.8 P
2020.8 3669.6 0 -124.8 P
2188.8 3544.8 0 40.8 P
2354.4 3585.6 0 -40.8 P
2520 3544.8 0 40.8 P
2685.6 3585.6 0 -40.8 P
2853.6 3544.8 0 124.8 P
3019.2 3585.6 0 -40.8 P
3184.8 3544.8 0 40.8 P
3350.4 3585.6 0 -40.8 P
3516 3544.8 0 40.8 P
3681.6 3669.6 0 -124.8 P
3849.6 3544.8 0 40.8 P
4015.2 3585.6 0 -40.8 P
4180.8 3544.8 0 40.8 P
4346.4 3585.6 0 -40.8 P
4514.4 3544.8 0 124.8 P
4680 3585.6 0 -40.8 P
4845.6 3544.8 0 40.8 P
5011.2 3585.6 0 -40.8 P
5176.8 3544.8 0 40.8 S
5344.8 3669.6 0 -124.8 P
1190.4 5496 0 124.8 P
1358.4 5620.8 0 -40.8 P
1524 5580 0 40.8 P
1689.6 5620.8 0 -40.8 P
1855.2 5580 0 40.8 P
2020.8 5620.8 0 -124.8 P
2188.8 5580 0 40.8 P
2354.4 5620.8 0 -40.8 P
2520 5580 0 40.8 P
2685.6 5620.8 0 -40.8 P
2853.6 5496 0 124.8 P
3019.2 5620.8 0 -40.8 P
3184.8 5580 0 40.8 P
3350.4 5620.8 0 -40.8 P
3516 5580 0 40.8 P
3681.6 5620.8 0 -124.8 P
3849.6 5580 0 40.8 P
4015.2 5620.8 0 -40.8 P
4180.8 5580 0 40.8 P
4346.4 5620.8 0 -40.8 P
4514.4 5496 0 124.8 P
4680 5620.8 0 -40.8 P
4845.6 5580 0 40.8 P
5011.2 5620.8 0 -40.8 P
5176.8 5580 0 40.8 P
5344.8 5620.8 0 -124.8 P
1190.4 3544.8 43.2 0 P
1233.6 3667.2 -43.2 0 P
1190.4 3753.6 43.2 0 P
1315.2 3820.8 -124.8 0 P
1190.4 3876 43.2 0 P
1233.6 3921.6 -43.2 0 P
1190.4 3962.4 43.2 0 P
1233.6 3996 -43.2 0 P
1190.4 4029.6 124.8 0 P
1233.6 4236 -43.2 0 P
1190.4 4358.4 43.2 0 P
1233.6 4444.8 -43.2 0 P
1190.4 4512 124.8 0 P
1233.6 4567.2 -43.2 0 P
1190.4 4612.8 43.2 0 P
1233.6 4653.6 -43.2 0 P
1190.4 4689.6 43.2 0 P
1315.2 4720.8 -124.8 0 P
1190.4 4929.6 43.2 0 P
1233.6 5049.6 -43.2 0 P
1190.4 5136 43.2 0 P
1315.2 5203.2 -124.8 0 P
1190.4 5258.4 43.2 0 P
1233.6 5306.4 -43.2 0 P
1190.4 5344.8 43.2 0 P
1233.6 5380.8 -43.2 0 P
1190.4 5412 124.8 0 P
1233.6 5620.8 -43.2 0 P
732 3852 -12 -4.8 -4.8 -9.6 -4.8 -16.8 0 -12 4.8 -16.8 4.8 -9.6 12 -4.8 
7.2 0 9.6 4.8 7.2 9.6 2.4 16.8 0 12 -2.4 16.8 -7.2 9.6 -9.6 4.8 
-7.2 0 -7.2 -4.8 -4.8 -2.4 -2.4 -7.2 -2.4 -16.8 0 -12 2.4 -16.8 2.4 -7.2 
4.8 -2.4 7.2 -4.8 S
739.2 3777.6 7.2 4.8 2.4 2.4 2.4 7.2 4.8 16.8 0 12 -4.8 16.8 -2.4 7.2 
-2.4 2.4 -7.2 4.8 P
787.2 3784.8 -4.8 -2.4 4.8 -4.8 2.4 4.8 -2.4 2.4 P
835.2 3852 -9.6 -4.8 -7.2 -9.6 -4.8 -16.8 0 -12 4.8 -16.8 7.2 -9.6 9.6 -4.8 
7.2 0 9.6 4.8 7.2 9.6 4.8 16.8 0 12 -4.8 16.8 -7.2 9.6 -9.6 4.8 
-7.2 0 -7.2 -4.8 -2.4 -2.4 -4.8 -7.2 -2.4 -16.8 0 -12 2.4 -16.8 4.8 -7.2 
2.4 -2.4 7.2 -4.8 P
842.4 3777.6 7.2 4.8 2.4 2.4 4.8 7.2 2.4 16.8 0 12 -2.4 16.8 -4.8 7.2 
-2.4 2.4 -7.2 4.8 P
904.8 3852 -9.6 -4.8 -7.2 -9.6 -4.8 -16.8 0 -12 4.8 -16.8 7.2 -9.6 9.6 -4.8 
7.2 0 9.6 4.8 7.2 9.6 2.4 16.8 0 12 -2.4 16.8 -7.2 9.6 -9.6 4.8 
-7.2 0 -7.2 -4.8 -2.4 -2.4 -4.8 -7.2 -2.4 -16.8 0 -12 2.4 -16.8 4.8 -7.2 
2.4 -2.4 7.2 -4.8 P
912 3777.6 7.2 4.8 2.4 2.4 4.8 7.2 2.4 16.8 0 12 -2.4 16.8 -4.8 7.2 
-2.4 2.4 -7.2 4.8 P
974.4 3852 -12 -4.8 -4.8 -9.6 -4.8 -16.8 0 -12 4.8 -16.8 4.8 -9.6 12 -4.8 
7.2 0 9.6 4.8 7.2 9.6 2.4 16.8 0 12 -2.4 16.8 -7.2 9.6 -9.6 4.8 
-7.2 0 -7.2 -4.8 -4.8 -2.4 -2.4 -7.2 -2.4 -16.8 0 -12 2.4 -16.8 2.4 -7.2 
4.8 -2.4 7.2 -4.8 P
981.6 3777.6 7.2 4.8 2.4 2.4 2.4 7.2 4.8 16.8 0 12 -4.8 16.8 -2.4 7.2 
-2.4 2.4 -7.2 4.8 P
1044 3852 -12 -4.8 -7.2 -9.6 -2.4 -16.8 0 -12 2.4 -16.8 7.2 -9.6 12 -4.8 
7.2 0 9.6 4.8 7.2 9.6 2.4 16.8 0 12 -2.4 16.8 -7.2 9.6 -9.6 4.8 
-7.2 0 S
1044 3852 -7.2 -4.8 -4.8 -2.4 -2.4 -7.2 -4.8 -16.8 0 -12 4.8 -16.8 2.4 -7.2 
4.8 -2.4 7.2 -4.8 P
1051.2 3777.6 4.8 4.8 4.8 2.4 2.4 7.2 4.8 16.8 0 12 -4.8 16.8 -2.4 7.2 
-4.8 2.4 -4.8 4.8 P
1099.2 3852 -7.2 -36 7.2 7.2 9.6 4.8 9.6 0 12 -4.8 7.2 -7.2 2.4 -9.6 
0 -7.2 -2.4 -9.6 -7.2 -7.2 -12 -4.8 -9.6 0 -14.4 7.2 -2.4 7.2 0 4.8 
2.4 2.4 4.8 -2.4 -4.8 -4.8 P
1118.4 3828 7.2 -4.8 7.2 -7.2 4.8 -9.6 0 -7.2 -4.8 -9.6 -7.2 -7.2 -7.2 -4.8 P
1099.2 3852 33.6 0 P
1099.2 3847.2 16.8 0 16.8 4.8 P
732 4060.8 -12 -4.8 -4.8 -9.6 -4.8 -16.8 0 -12 4.8 -16.8 4.8 -9.6 12 -4.8 
7.2 0 9.6 4.8 7.2 9.6 2.4 16.8 0 12 -2.4 16.8 -7.2 9.6 -9.6 4.8 
-7.2 0 -7.2 -4.8 -4.8 -2.4 -2.4 -7.2 -2.4 -16.8 0 -12 2.4 -16.8 2.4 -7.2 
4.8 -2.4 7.2 -4.8 P
739.2 3986.4 7.2 4.8 2.4 2.4 2.4 7.2 4.8 16.8 0 12 -4.8 16.8 -2.4 7.2 
-2.4 2.4 -7.2 4.8 P
787.2 3993.6 -4.8 -2.4 4.8 -4.8 2.4 4.8 -2.4 2.4 P
835.2 4060.8 -9.6 -4.8 -7.2 -9.6 -4.8 -16.8 0 -12 4.8 -16.8 7.2 -9.6 9.6 -4.8 
7.2 0 9.6 4.8 7.2 9.6 4.8 16.8 0 12 -4.8 16.8 -7.2 9.6 -9.6 4.8 
-7.2 0 -7.2 -4.8 -2.4 -2.4 -4.8 -7.2 -2.4 -16.8 0 -12 2.4 -16.8 4.8 -7.2 
2.4 -2.4 7.2 -4.8 P
842.4 3986.4 7.2 4.8 2.4 2.4 4.8 7.2 2.4 16.8 0 12 -2.4 16.8 -4.8 7.2 
-2.4 2.4 -7.2 4.8 S
904.8 4060.8 -9.6 -4.8 -7.2 -9.6 -4.8 -16.8 0 -12 4.8 -16.8 7.2 -9.6 9.6 -4.8 
7.2 0 9.6 4.8 7.2 9.6 2.4 16.8 0 12 -2.4 16.8 -7.2 9.6 -9.6 4.8 
-7.2 0 -7.2 -4.8 -2.4 -2.4 -4.8 -7.2 -2.4 -16.8 0 -12 2.4 -16.8 4.8 -7.2 
2.4 -2.4 7.2 -4.8 P
912 3986.4 7.2 4.8 2.4 2.4 4.8 7.2 2.4 16.8 0 12 -2.4 16.8 -4.8 7.2 
-2.4 2.4 -7.2 4.8 P
974.4 4060.8 -12 -4.8 -4.8 -9.6 -4.8 -16.8 0 -12 4.8 -16.8 4.8 -9.6 12 -4.8 
7.2 0 9.6 4.8 7.2 9.6 2.4 16.8 0 12 -2.4 16.8 -7.2 9.6 -9.6 4.8 
-7.2 0 -7.2 -4.8 -4.8 -2.4 -2.4 -7.2 -2.4 -16.8 0 -12 2.4 -16.8 2.4 -7.2 
4.8 -2.4 7.2 -4.8 P
981.6 3986.4 7.2 4.8 2.4 2.4 2.4 7.2 4.8 16.8 0 12 -4.8 16.8 -2.4 7.2 
-2.4 2.4 -7.2 4.8 P
1032 4046.4 7.2 2.4 12 12 0 -74.4 P
1046.4 4056 0 -69.6 P
1032 3986.4 31.2 0 P
1113.6 4060.8 -12 -4.8 -7.2 -9.6 -2.4 -16.8 0 -12 2.4 -16.8 7.2 -9.6 12 -4.8 
4.8 0 12 4.8 7.2 9.6 2.4 16.8 0 12 -2.4 16.8 -7.2 9.6 -12 4.8 
-4.8 0 -7.2 -4.8 -4.8 -2.4 -2.4 -7.2 -4.8 -16.8 0 -12 4.8 -16.8 2.4 -7.2 
4.8 -2.4 7.2 -4.8 P
1118.4 3986.4 7.2 4.8 4.8 2.4 2.4 7.2 4.8 16.8 0 12 -4.8 16.8 -2.4 7.2 
-4.8 2.4 -7.2 4.8 P
732 4543.2 -12 -2.4 -4.8 -12 -4.8 -16.8 0 -9.6 4.8 -16.8 4.8 -12 12 -2.4 
7.2 0 9.6 2.4 7.2 12 2.4 16.8 0 9.6 -2.4 16.8 -7.2 12 -9.6 2.4 
-7.2 0 S
732 4543.2 -7.2 -2.4 -4.8 -4.8 -2.4 -7.2 -2.4 -16.8 0 -9.6 2.4 -16.8 2.4 -7.2 
4.8 -4.8 7.2 -2.4 P
739.2 4471.2 7.2 2.4 2.4 4.8 2.4 7.2 4.8 16.8 0 9.6 -4.8 16.8 -2.4 7.2 
-2.4 4.8 -7.2 2.4 P
787.2 4478.4 -4.8 -4.8 4.8 -2.4 2.4 2.4 -2.4 4.8 P
835.2 4543.2 -9.6 -2.4 -7.2 -12 -4.8 -16.8 0 -9.6 4.8 -16.8 7.2 -12 9.6 -2.4 
7.2 0 9.6 2.4 7.2 12 4.8 16.8 0 9.6 -4.8 16.8 -7.2 12 -9.6 2.4 
-7.2 0 -7.2 -2.4 -2.4 -4.8 -4.8 -7.2 -2.4 -16.8 0 -9.6 2.4 -16.8 4.8 -7.2 
2.4 -4.8 7.2 -2.4 P
842.4 4471.2 7.2 2.4 2.4 4.8 4.8 7.2 2.4 16.8 0 9.6 -2.4 16.8 -4.8 7.2 
-2.4 4.8 -7.2 2.4 P
904.8 4543.2 -9.6 -2.4 -7.2 -12 -4.8 -16.8 0 -9.6 4.8 -16.8 7.2 -12 9.6 -2.4 
7.2 0 9.6 2.4 7.2 12 2.4 16.8 0 9.6 -2.4 16.8 -7.2 12 -9.6 2.4 
-7.2 0 -7.2 -2.4 -2.4 -4.8 -4.8 -7.2 -2.4 -16.8 0 -9.6 2.4 -16.8 4.8 -7.2 
2.4 -4.8 7.2 -2.4 P
912 4471.2 7.2 2.4 2.4 4.8 4.8 7.2 2.4 16.8 0 9.6 -2.4 16.8 -4.8 7.2 
-2.4 4.8 -7.2 2.4 P
974.4 4543.2 -12 -2.4 -4.8 -12 -4.8 -16.8 0 -9.6 4.8 -16.8 4.8 -12 12 -2.4 
7.2 0 9.6 2.4 7.2 12 2.4 16.8 0 9.6 -2.4 16.8 -7.2 12 -9.6 2.4 
-7.2 0 -7.2 -2.4 -4.8 -4.8 -2.4 -7.2 -2.4 -16.8 0 -9.6 2.4 -16.8 2.4 -7.2 
4.8 -4.8 7.2 -2.4 S
981.6 4471.2 7.2 2.4 2.4 4.8 2.4 7.2 4.8 16.8 0 9.6 -4.8 16.8 -2.4 7.2 
-2.4 4.8 -7.2 2.4 P
1029.6 4543.2 -7.2 -33.6 7.2 7.2 9.6 2.4 12 0 9.6 -2.4 7.2 -7.2 2.4 -12 
0 -7.2 -2.4 -9.6 -7.2 -7.2 -9.6 -2.4 -12 0 -9.6 2.4 -4.8 4.8 -2.4 7.2 
0 2.4 2.4 2.4 4.8 -2.4 -4.8 -2.4 P
1051.2 4519.2 4.8 -2.4 7.2 -7.2 4.8 -12 0 -7.2 -4.8 -9.6 -7.2 -7.2 -4.8 -2.4 P
1029.6 4543.2 33.6 0 P
1029.6 4540.8 16.8 0 16.8 2.4 P
1113.6 4543.2 -12 -2.4 -7.2 -12 -2.4 -16.8 0 -9.6 2.4 -16.8 7.2 -12 12 -2.4 
4.8 0 12 2.4 7.2 12 2.4 16.8 0 9.6 -2.4 16.8 -7.2 12 -12 2.4 
-4.8 0 -7.2 -2.4 -4.8 -4.8 -2.4 -7.2 -4.8 -16.8 0 -9.6 4.8 -16.8 2.4 -7.2 
4.8 -4.8 7.2 -2.4 P
1118.4 4471.2 7.2 2.4 4.8 4.8 2.4 7.2 4.8 16.8 0 9.6 -4.8 16.8 -2.4 7.2 
-4.8 4.8 -7.2 2.4 P
732 4752 -12 -4.8 -4.8 -9.6 -4.8 -16.8 0 -9.6 4.8 -19.2 4.8 -9.6 12 -2.4 
7.2 0 9.6 2.4 7.2 9.6 2.4 19.2 0 9.6 -2.4 16.8 -7.2 9.6 -9.6 4.8 
-7.2 0 -7.2 -4.8 -4.8 -2.4 -2.4 -7.2 -2.4 -16.8 0 -9.6 2.4 -19.2 2.4 -7.2 
4.8 -2.4 7.2 -2.4 P
739.2 4680 7.2 2.4 2.4 2.4 2.4 7.2 4.8 19.2 0 9.6 -4.8 16.8 -2.4 7.2 
-2.4 2.4 -7.2 4.8 P
787.2 4684.8 -4.8 -2.4 4.8 -2.4 2.4 2.4 -2.4 2.4 P
835.2 4752 -9.6 -4.8 -7.2 -9.6 -4.8 -16.8 0 -9.6 4.8 -19.2 7.2 -9.6 9.6 -2.4 
7.2 0 9.6 2.4 7.2 9.6 4.8 19.2 0 9.6 -4.8 16.8 -7.2 9.6 -9.6 4.8 
-7.2 0 S
835.2 4752 -7.2 -4.8 -2.4 -2.4 -4.8 -7.2 -2.4 -16.8 0 -9.6 2.4 -19.2 4.8 -7.2 
2.4 -2.4 7.2 -2.4 P
842.4 4680 7.2 2.4 2.4 2.4 4.8 7.2 2.4 19.2 0 9.6 -2.4 16.8 -4.8 7.2 
-2.4 2.4 -7.2 4.8 P
904.8 4752 -9.6 -4.8 -7.2 -9.6 -4.8 -16.8 0 -9.6 4.8 -19.2 7.2 -9.6 9.6 -2.4 
7.2 0 9.6 2.4 7.2 9.6 2.4 19.2 0 9.6 -2.4 16.8 -7.2 9.6 -9.6 4.8 
-7.2 0 -7.2 -4.8 -2.4 -2.4 -4.8 -7.2 -2.4 -16.8 0 -9.6 2.4 -19.2 4.8 -7.2 
2.4 -2.4 7.2 -2.4 P
912 4680 7.2 2.4 2.4 2.4 4.8 7.2 2.4 19.2 0 9.6 -2.4 16.8 -4.8 7.2 
-2.4 2.4 -7.2 4.8 P
962.4 4737.6 7.2 4.8 12 9.6 0 -72 P
976.8 4747.2 0 -67.2 P
962.4 4680 31.2 0 P
1044 4752 -12 -4.8 -7.2 -9.6 -2.4 -16.8 0 -9.6 2.4 -19.2 7.2 -9.6 12 -2.4 
7.2 0 9.6 2.4 7.2 9.6 2.4 19.2 0 9.6 -2.4 16.8 -7.2 9.6 -9.6 4.8 
-7.2 0 -7.2 -4.8 -4.8 -2.4 -2.4 -7.2 -4.8 -16.8 0 -9.6 4.8 -19.2 2.4 -7.2 
4.8 -2.4 7.2 -2.4 P
1051.2 4680 9.6 4.8 2.4 7.2 4.8 19.2 0 9.6 -4.8 16.8 -2.4 7.2 -4.8 2.4 
-4.8 4.8 P
1113.6 4752 -12 -4.8 -7.2 -9.6 -2.4 -16.8 0 -9.6 2.4 -19.2 7.2 -9.6 12 -2.4 
4.8 0 12 2.4 7.2 9.6 2.4 19.2 0 9.6 -2.4 16.8 -7.2 9.6 -12 4.8 
-4.8 0 -7.2 -4.8 -4.8 -2.4 -2.4 -7.2 -4.8 -16.8 0 -9.6 4.8 -19.2 2.4 -7.2 
4.8 -2.4 7.2 -2.4 P
1118.4 4680 7.2 2.4 4.8 2.4 2.4 7.2 4.8 19.2 0 9.6 -4.8 16.8 -2.4 7.2 
-4.8 2.4 -7.2 4.8 S
732 5234.4 -12 -2.4 -4.8 -9.6 -4.8 -19.2 0 -9.6 4.8 -16.8 4.8 -9.6 12 -4.8 
7.2 0 9.6 4.8 7.2 9.6 2.4 16.8 0 9.6 -2.4 19.2 -7.2 9.6 -9.6 2.4 
-7.2 0 -7.2 -2.4 -4.8 -2.4 -2.4 -7.2 -2.4 -19.2 0 -9.6 2.4 -16.8 2.4 -7.2 
4.8 -2.4 7.2 -4.8 P
739.2 5162.4 7.2 4.8 2.4 2.4 2.4 7.2 4.8 16.8 0 9.6 -4.8 19.2 -2.4 7.2 
-2.4 2.4 -7.2 2.4 P
787.2 5169.6 -4.8 -2.4 4.8 -4.8 2.4 4.8 -2.4 2.4 P
835.2 5234.4 -9.6 -2.4 -7.2 -9.6 -4.8 -19.2 0 -9.6 4.8 -16.8 7.2 -9.6 9.6 -4.8 
7.2 0 9.6 4.8 7.2 9.6 4.8 16.8 0 9.6 -4.8 19.2 -7.2 9.6 -9.6 2.4 
-7.2 0 -7.2 -2.4 -2.4 -2.4 -4.8 -7.2 -2.4 -19.2 0 -9.6 2.4 -16.8 4.8 -7.2 
2.4 -2.4 7.2 -4.8 P
842.4 5162.4 7.2 4.8 2.4 2.4 4.8 7.2 2.4 16.8 0 9.6 -2.4 19.2 -4.8 7.2 
-2.4 2.4 -7.2 2.4 P
904.8 5234.4 -9.6 -2.4 -7.2 -9.6 -4.8 -19.2 0 -9.6 4.8 -16.8 7.2 -9.6 9.6 -4.8 
7.2 0 9.6 4.8 7.2 9.6 2.4 16.8 0 9.6 -2.4 19.2 -7.2 9.6 -9.6 2.4 
-7.2 0 -7.2 -2.4 -2.4 -2.4 -4.8 -7.2 -2.4 -19.2 0 -9.6 2.4 -16.8 4.8 -7.2 
2.4 -2.4 7.2 -4.8 P
912 5162.4 7.2 4.8 2.4 2.4 4.8 7.2 2.4 16.8 0 9.6 -2.4 19.2 -4.8 7.2 
-2.4 2.4 -7.2 2.4 P
960 5234.4 -7.2 -33.6 7.2 7.2 9.6 2.4 12 0 9.6 -2.4 7.2 -7.2 2.4 -9.6 
0 -7.2 -2.4 -12 -7.2 -4.8 -9.6 -4.8 -12 0 -9.6 4.8 -2.4 2.4 -4.8 7.2 
0 2.4 4.8 4.8 2.4 -4.8 -2.4 -2.4 S
981.6 5210.4 7.2 -2.4 4.8 -7.2 4.8 -9.6 0 -7.2 -4.8 -12 -4.8 -4.8 -7.2 -4.8 P
960 5234.4 33.6 0 P
960 5232 16.8 0 16.8 2.4 P
1044 5234.4 -12 -2.4 -7.2 -9.6 -2.4 -19.2 0 -9.6 2.4 -16.8 7.2 -9.6 12 -4.8 
7.2 0 9.6 4.8 7.2 9.6 2.4 16.8 0 9.6 -2.4 19.2 -7.2 9.6 -9.6 2.4 
-7.2 0 -7.2 -2.4 -4.8 -2.4 -2.4 -7.2 -4.8 -19.2 0 -9.6 4.8 -16.8 2.4 -7.2 
4.8 -2.4 7.2 -4.8 P
1051.2 5162.4 4.8 4.8 4.8 2.4 2.4 7.2 4.8 16.8 0 9.6 -4.8 19.2 -2.4 7.2 
-9.6 4.8 P
1113.6 5234.4 -12 -2.4 -7.2 -9.6 -2.4 -19.2 0 -9.6 2.4 -16.8 7.2 -9.6 12 -4.8 
4.8 0 12 4.8 7.2 9.6 2.4 16.8 0 9.6 -2.4 19.2 -7.2 9.6 -12 2.4 
-4.8 0 -7.2 -2.4 -4.8 -2.4 -2.4 -7.2 -4.8 -19.2 0 -9.6 4.8 -16.8 2.4 -7.2 
4.8 -2.4 7.2 -4.8 P
1118.4 5162.4 7.2 4.8 4.8 2.4 2.4 7.2 4.8 16.8 0 9.6 -4.8 19.2 -2.4 7.2 
-4.8 2.4 -7.2 2.4 P
732 5443.2 -12 -2.4 -4.8 -12 -4.8 -16.8 0 -9.6 4.8 -16.8 4.8 -12 12 -2.4 
7.2 0 9.6 2.4 7.2 12 2.4 16.8 0 9.6 -2.4 16.8 -7.2 12 -9.6 2.4 
-7.2 0 -7.2 -2.4 -4.8 -4.8 -2.4 -7.2 -2.4 -16.8 0 -9.6 2.4 -16.8 2.4 -7.2 
4.8 -4.8 7.2 -2.4 P
739.2 5371.2 7.2 2.4 2.4 4.8 2.4 7.2 4.8 16.8 0 9.6 -4.8 16.8 -2.4 7.2 
-2.4 4.8 -7.2 2.4 P
787.2 5378.4 -4.8 -4.8 4.8 -2.4 2.4 2.4 -2.4 4.8 P
835.2 5443.2 -9.6 -2.4 -7.2 -12 -4.8 -16.8 0 -9.6 4.8 -16.8 7.2 -12 9.6 -2.4 
7.2 0 9.6 2.4 7.2 12 4.8 16.8 0 9.6 -4.8 16.8 -7.2 12 -9.6 2.4 
-7.2 0 S
835.2 5443.2 -7.2 -2.4 -2.4 -4.8 -4.8 -7.2 -2.4 -16.8 0 -9.6 2.4 -16.8 4.8 -7.2 
2.4 -4.8 7.2 -2.4 P
842.4 5371.2 7.2 2.4 2.4 4.8 4.8 7.2 2.4 16.8 0 9.6 -2.4 16.8 -4.8 7.2 
-2.4 4.8 -7.2 2.4 P
895.2 5428.8 4.8 4.8 12 9.6 0 -72 P
907.2 5440.8 0 -69.6 P
895.2 5371.2 31.2 0 P
974.4 5443.2 -12 -2.4 -4.8 -12 -4.8 -16.8 0 -9.6 4.8 -16.8 4.8 -12 12 -2.4 
7.2 0 9.6 2.4 7.2 12 2.4 16.8 0 9.6 -2.4 16.8 -7.2 12 -9.6 2.4 
-7.2 0 -7.2 -2.4 -4.8 -4.8 -2.4 -7.2 -2.4 -16.8 0 -9.6 2.4 -16.8 2.4 -7.2 
4.8 -4.8 7.2 -2.4 P
981.6 5371.2 7.2 2.4 2.4 4.8 2.4 7.2 4.8 16.8 0 9.6 -4.8 16.8 -2.4 7.2 
-2.4 4.8 -7.2 2.4 P
1044 5443.2 -12 -2.4 -7.2 -12 -2.4 -16.8 0 -9.6 2.4 -16.8 7.2 -12 12 -2.4 
7.2 0 9.6 2.4 7.2 12 2.4 16.8 0 9.6 -2.4 16.8 -7.2 12 -9.6 2.4 
-7.2 0 -7.2 -2.4 -4.8 -4.8 -2.4 -7.2 -4.8 -16.8 0 -9.6 4.8 -16.8 2.4 -7.2 
4.8 -4.8 7.2 -2.4 P
1051.2 5371.2 4.8 2.4 4.8 4.8 2.4 7.2 4.8 16.8 0 9.6 -4.8 16.8 -2.4 7.2 
-4.8 4.8 -4.8 2.4 P
1113.6 5443.2 -12 -2.4 -7.2 -12 -2.4 -16.8 0 -9.6 2.4 -16.8 7.2 -12 12 -2.4 
4.8 0 12 2.4 7.2 12 2.4 16.8 0 9.6 -2.4 16.8 -7.2 12 -12 2.4 
-4.8 0 -7.2 -2.4 -4.8 -4.8 -2.4 -7.2 -4.8 -16.8 0 -9.6 4.8 -16.8 2.4 -7.2 
4.8 -4.8 7.2 -2.4 P
1118.4 5371.2 7.2 2.4 4.8 4.8 2.4 7.2 4.8 16.8 0 9.6 -4.8 16.8 -2.4 7.2 
-4.8 4.8 -7.2 2.4 S
5301.6 3544.8 43.2 0 P
5344.8 3667.2 -43.2 0 P
5301.6 3753.6 43.2 0 P
5344.8 3820.8 -124.8 0 P
5301.6 3876 43.2 0 P
5344.8 3921.6 -43.2 0 P
5301.6 3962.4 43.2 0 P
5344.8 3996 -43.2 0 P
5220 4029.6 124.8 0 P
5344.8 4236 -43.2 0 P
5301.6 4358.4 43.2 0 P
5344.8 4444.8 -43.2 0 P
5220 4512 124.8 0 P
5344.8 4567.2 -43.2 0 P
5301.6 4612.8 43.2 0 P
5344.8 4653.6 -43.2 0 P
5301.6 4689.6 43.2 0 P
5344.8 4720.8 -124.8 0 P
5301.6 4929.6 43.2 0 P
5344.8 5049.6 -43.2 0 P
5301.6 5136 43.2 0 P
5344.8 5203.2 -124.8 0 P
5301.6 5258.4 43.2 0 P
5344.8 5306.4 -43.2 0 P
5301.6 5344.8 43.2 0 P
5344.8 5380.8 -43.2 0 P
5220 5412 124.8 0 P
5344.8 5620.8 -43.2 0 S
255 0 r3
1190.4 3544.8 0 0 P
2020.8 3544.8 0 1848 168 0 0 -120 165.6 0 0 -79.2 165.6 0 0 -165.6 
165.6 0 0 -132 168 0 0 -76.8 165.6 0 0 -28.8 165.6 0 0 -43.2 
165.6 0 0 -134.4 165.6 0 0 -112.8 165.6 0 0 -585.6 168 0 0 192 
165.6 0 0 216 165.6 0 0 -777.6 P
4346.4 3544.8 0 710.4 168 0 0 -518.4 165.6 0 0 208.8 165.6 0 0 -67.2 
165.6 0 0 -333.6 P
5344.8 3544.8 0 0 S
K
2808 2080.8 -2.4 -2.4 2.4 -4.8 4.8 4.8 -4.8 2.4 P
2812.8 2056.8 0 -62.4 -4.8 -7.2 -4.8 -2.4 -7.2 0 -4.8 2.4 0 4.8 4.8 2.4 
2.4 -2.4 -2.4 -4.8 P
2808 2056.8 0 -62.4 -2.4 -7.2 -2.4 -2.4 P
2798.4 2056.8 14.4 0 P
2836.8 2056.8 21.6 -48 P
2839.2 2056.8 19.2 -40.8 P
2877.6 2056.8 -19.2 -48 P
2829.6 2056.8 21.6 0 P
2865.6 2056.8 19.2 0 P
2961.6 2056.8 0 -72 P
2964 2056.8 0 -72 P
2964 2047.2 7.2 7.2 7.2 2.4 7.2 0 9.6 -2.4 7.2 -7.2 4.8 -12 0 -4.8 
-4.8 -12 -7.2 -7.2 -9.6 -2.4 -7.2 0 -7.2 2.4 -7.2 7.2 P
2985.6 2056.8 7.2 -2.4 7.2 -7.2 2.4 -12 0 -4.8 -2.4 -12 -7.2 -7.2 -7.2 -2.4 P
2952 2056.8 12 0 P
2952 1984.8 24 0 P
3048 2080.8 0 -72 P
3052.8 2080.8 0 -72 P
3026.4 2080.8 -2.4 -19.2 0 19.2 52.8 0 ^ -4.8 19.2 P
3038.4 2008.8 24 0 P
1190.4 2299.2 4154.4 0 0 1245.6 ^ H
1190.4 2299.2 0 21.6 P
1190.4 2340 0 21.6 P
1190.4 2383.2 0 19.2 P
1190.4 2424 0 21.6 P
1190.4 2464.8 0 21.6 P
1190.4 2505.6 0 21.6 P
1190.4 2548.8 0 19.2 P
1190.4 2589.6 0 21.6 P
1190.4 2630.4 0 21.6 P
1190.4 2673.6 0 19.2 P
1190.4 2714.4 0 21.6 P
1190.4 2755.2 0 21.6 P
1190.4 2798.4 0 19.2 P
1190.4 2839.2 0 21.6 P
1190.4 2880 0 21.6 P
1190.4 2920.8 21.6 0 P
1233.6 2920.8 19.2 0 P
1274.4 2920.8 21.6 0 P
1315.2 2920.8 21.6 0 P
1358.4 2920.8 19.2 0 P
1399.2 2920.8 21.6 0 P
1440 2920.8 21.6 0 P
1483.2 2920.8 19.2 0 P
1524 2920.8 21.6 0 P
1564.8 2920.8 21.6 0 S
1605.6 2920.8 21.6 0 P
1648.8 2920.8 19.2 0 P
1689.6 2920.8 21.6 0 P
1730.4 2920.8 21.6 0 P
1773.6 2920.8 19.2 0 P
1814.4 2920.8 21.6 0 P
1855.2 2920.8 21.6 0 P
1898.4 2920.8 19.2 0 P
1939.2 2920.8 21.6 0 P
1980 2920.8 21.6 0 P
2020.8 2920.8 0 21.6 P
2020.8 2964 0 19.2 P
2020.8 3004.8 0 21.6 P
2020.8 3045.6 21.6 0 P
2064 3045.6 19.2 0 P
2104.8 3045.6 21.6 0 P
2145.6 3045.6 21.6 0 P
2188.8 3045.6 0 21.6 P
2188.8 3088.8 0 19.2 P
2188.8 3129.6 0 21.6 P
2200.8 3158.4 21.6 0 P
2241.6 3158.4 21.6 0 P
2284.8 3158.4 19.2 0 P
2325.6 3158.4 21.6 0 P
2366.4 3158.4 21.6 0 P
2407.2 3158.4 21.6 0 P
2448 3158.4 21.6 0 P
2491.2 3158.4 19.2 0 P
2520 3146.4 0 -19.2 P
2520 3105.6 0 -21.6 P
2520 3064.8 0 -21.6 P
2520 3021.6 0 -19.2 P
2520 2980.8 0 -19.2 P
2520 2940 0 -21.6 P
2520 2899.2 0 -21.6 P
2520 2856 0 -19.2 P
2520 2815.2 0 -2.4 19.2 0 P
2558.4 2812.8 21.6 0 P
2601.6 2812.8 19.2 0 P
2642.4 2812.8 21.6 0 P
2683.2 2812.8 2.4 0 0 19.2 P
2685.6 2851.2 0 19.2 2.4 0 P
2709.6 2870.4 19.2 0 P
2750.4 2870.4 21.6 0 P
2791.2 2870.4 21.6 0 P
2834.4 2870.4 19.2 0 0 2.4 P
2853.6 2894.4 0 19.2 P
2853.6 2935.2 0 21.6 P
2860.8 2966.4 21.6 0 P
2904 2966.4 19.2 0 P
2944.8 2966.4 21.6 0 P
2985.6 2966.4 21.6 0 P
3019.2 2956.8 0 -19.2 P
3019.2 2916 0 -21.6 P
3019.2 2875.2 0 -21.6 P
3019.2 2832 0 -19.2 P
3019.2 2791.2 0 -21.6 P
3019.2 2750.4 0 -7.2 12 0 P
3052.8 2743.2 21.6 0 P
3093.6 2743.2 21.6 0 P
3136.8 2743.2 19.2 0 P
3177.6 2743.2 7.2 0 0 14.4 S
3184.8 2776.8 0 21.6 P
3184.8 2820 0 19.2 P
3184.8 2860.8 0 21.6 P
3184.8 2901.6 0 21.6 P
3184.8 2944.8 0 19.2 P
3184.8 2983.2 21.6 0 P
3228 2983.2 19.2 0 P
3268.8 2983.2 21.6 0 P
3309.6 2983.2 21.6 0 P
3350.4 2983.2 0 -21.6 P
3350.4 2942.4 0 -21.6 P
3350.4 2899.2 0 -19.2 P
3350.4 2858.4 0 -21.6 P
3350.4 2817.6 0 -21.6 P
3350.4 2776.8 0 -21.6 P
3350.4 2733.6 0 -19.2 P
3350.4 2692.8 0 -7.2 14.4 0 P
3386.4 2685.6 19.2 0 P
3427.2 2685.6 21.6 0 P
3468 2685.6 21.6 0 P
3511.2 2685.6 4.8 0 0 14.4 P
3516 2721.6 0 21.6 P
3516 2762.4 0 21.6 P
3516 2805.6 0 19.2 P
3516 2846.4 0 21.6 P
3516 2887.2 0 21.6 P
3516 2930.4 0 19.2 P
3516 2971.2 0 21.6 P
3516 3012 0 21.6 P
3516 3055.2 0 12 7.2 0 P
3544.8 3067.2 19.2 0 P
3585.6 3067.2 21.6 0 P
3626.4 3067.2 21.6 0 P
3669.6 3067.2 12 0 0 -7.2 P
3681.6 3040.8 0 -21.6 P
3681.6 2997.6 0 -19.2 P
3681.6 2956.8 0 -21.6 P
3681.6 2916 0 -21.6 P
3681.6 2875.2 0 -21.6 P
3681.6 2832 0 -19.2 P
3681.6 2791.2 0 -21.6 P
3681.6 2750.4 0 -21.6 P
3681.6 2707.2 0 -19.2 P
3681.6 2666.4 0 -21.6 P
3681.6 2625.6 0 -21.6 P
3681.6 2582.4 0 -19.2 P
3681.6 2541.6 0 -21.6 P
3681.6 2500.8 0 -21.6 P
3681.6 2460 0 -19.2 4.8 0 P
3708 2440.8 19.2 0 P
3748.8 2440.8 21.6 0 P
3789.6 2440.8 21.6 0 P
3832.8 2440.8 16.8 0 0 4.8 P
3849.6 2467.2 0 19.2 P
3849.6 2508 0 21.6 P
3849.6 2548.8 0 21.6 P
3849.6 2592 0 19.2 P
3849.6 2632.8 0 19.2 P
3849.6 2673.6 0 21.6 P
3866.4 2700 19.2 0 P
3907.2 2700 21.6 0 S
3948 2700 21.6 0 P
3988.8 2700 21.6 0 P
4015.2 2683.2 0 -21.6 P
4015.2 2640 0 -19.2 P
4015.2 2599.2 0 -21.6 P
4015.2 2558.4 0 -21.6 P
4015.2 2515.2 0 -19.2 P
4015.2 2474.4 0 -4.8 16.8 0 P
4051.2 2469.6 21.6 0 P
4094.4 2469.6 19.2 0 P
4135.2 2469.6 21.6 0 P
4176 2469.6 4.8 0 0 16.8 P
4180.8 2508 0 19.2 P
4180.8 2548.8 0 21.6 P
4180.8 2589.6 0 21.6 P
4180.8 2632.8 0 19.2 P
4180.8 2673.6 0 21.6 P
4180.8 2714.4 0 21.6 P
4180.8 2757.6 0 19.2 P
4180.8 2798.4 0 19.2 P
4180.8 2839.2 0 21.6 P
4180.8 2880 0 21.6 P
4180.8 2923.2 0 14.4 7.2 0 P
4207.2 2937.6 21.6 0 P
4250.4 2937.6 19.2 0 P
4291.2 2937.6 21.6 0 S
4332 2937.6 14.4 0 0 -7.2 P
4346.4 2911.2 0 -21.6 P
4346.4 2868 0 -19.2 P
4346.4 2827.2 0 -21.6 P
4346.4 2786.4 0 -21.6 P
4346.4 2743.2 0 -19.2 P
4346.4 2702.4 0 -21.6 P
4346.4 2661.6 0 -21.6 P
4346.4 2620.8 0 -21.6 P
4346.4 2577.6 0 -19.2 P
4346.4 2536.8 0 -21.6 P
4346.4 2496 0 -21.6 P
4346.4 2452.8 0 -19.2 P
4346.4 2412 0 -21.6 P
4346.4 2371.2 0 -21.6 P
4346.4 2328 0 -19.2 P
4514.4 2311.2 0 21.6 P
4514.4 2352 0 21.6 P
4514.4 2392.8 0 21.6 P
4514.4 2436 0 19.2 P
4514.4 2476.8 0 21.6 P
4514.4 2517.6 0 21.6 P
4514.4 2560.8 0 19.2 P
4514.4 2601.6 0 21.6 P
4514.4 2642.4 0 21.6 P
4514.4 2685.6 0 19.2 P
4514.4 2726.4 0 21.6 P
4514.4 2767.2 0 21.6 P
4514.4 2808 0 21.6 P
4514.4 2851.2 0 19.2 P
4514.4 2892 0 21.6 P
4514.4 2932.8 0 21.6 P
4514.4 2976 0 19.2 P
4514.4 3016.8 0 21.6 P
4514.4 3057.6 0 21.6 P
4514.4 3100.8 0 19.2 P
4514.4 3141.6 0 21.6 P
4514.4 3182.4 0 21.6 P
4514.4 3223.2 0 21.6 P
4528.8 3249.6 21.6 0 P
4569.6 3249.6 21.6 0 P
4612.8 3249.6 19.2 0 P
4653.6 3249.6 21.6 0 P
4680 3266.4 0 19.2 P
4680 3307.2 0 21.6 P
4680 3348 0 21.6 P
4680 3391.2 0 19.2 P
4680 3432 0 21.6 P
4680 3472.8 0 21.6 P
4680 3516 0 19.2 P
5011.2 3532.8 0 -21.6 P
5011.2 3492 0 -21.6 P
5011.2 3451.2 0 -21.6 P
5011.2 3408 0 -19.2 P
5032.8 3388.8 21.6 0 P
5073.6 3388.8 21.6 0 P
5116.8 3388.8 19.2 0 P
5157.6 3388.8 19.2 0 P
5176.8 3367.2 0 -21.6 P
5176.8 3326.4 0 -21.6 P
5176.8 3283.2 0 -19.2 P
5176.8 3242.4 0 -21.6 P
5176.8 3201.6 0 -21.6 P
5176.8 3158.4 0 -19.2 S
5176.8 3117.6 0 -21.6 P
5176.8 3076.8 0 -21.6 P
5176.8 3036 0 -21.6 P
5176.8 2992.8 0 -19.2 P
5176.8 2952 0 -21.6 P
5176.8 2911.2 0 -21.6 P
5176.8 2868 0 -19.2 P
5176.8 2827.2 0 -21.6 P
5176.8 2786.4 0 -21.6 P
5198.4 2764.8 21.6 0 P
5239.2 2764.8 21.6 0 P
5282.4 2764.8 19.2 0 P
5323.2 2764.8 19.2 0 P
5342.4 2743.2 0 -19.2 P
5342.4 2702.4 0 -21.6 P
5342.4 2661.6 0 -21.6 P
5342.4 2620.8 0 -21.6 P
5342.4 2577.6 0 -19.2 P
5342.4 2536.8 0 -21.6 P
5342.4 2496 0 -21.6 P
5342.4 2452.8 0 -19.2 P
5342.4 2412 0 -21.6 P
5342.4 2371.2 0 -21.6 P
5342.4 2328 0 -19.2 P
1190.4 2299.2 0 124.8 P
1358.4 2340 0 -40.8 P
1524 2299.2 0 40.8 P
1689.6 2340 0 -40.8 P
1855.2 2299.2 0 40.8 P
2020.8 2424 0 -124.8 P
2188.8 2299.2 0 40.8 P
2354.4 2340 0 -40.8 P
2520 2299.2 0 40.8 P
2685.6 2340 0 -40.8 P
2853.6 2299.2 0 124.8 P
3019.2 2340 0 -40.8 P
3184.8 2299.2 0 40.8 P
3350.4 2340 0 -40.8 P
3516 2299.2 0 40.8 P
3681.6 2424 0 -124.8 P
3849.6 2299.2 0 40.8 P
4015.2 2340 0 -40.8 P
4180.8 2299.2 0 40.8 P
4346.4 2340 0 -40.8 P
4514.4 2299.2 0 124.8 P
4680 2340 0 -40.8 P
4845.6 2299.2 0 40.8 P
5011.2 2340 0 -40.8 P
5176.8 2299.2 0 40.8 P
5344.8 2424 0 -124.8 P
1188 2229.6 -9.6 -2.4 -7.2 -9.6 -4.8 -19.2 0 -9.6 4.8 -16.8 7.2 -9.6 9.6 -4.8 
7.2 0 9.6 4.8 7.2 9.6 4.8 16.8 0 9.6 -4.8 19.2 -7.2 9.6 -9.6 2.4 
-7.2 0 -7.2 -2.4 -2.4 -2.4 -4.8 -7.2 -2.4 -19.2 0 -9.6 2.4 -16.8 4.8 -7.2 
2.4 -2.4 7.2 -4.8 P
1195.2 2157.6 7.2 4.8 2.4 2.4 4.8 7.2 2.4 16.8 0 9.6 -2.4 19.2 -4.8 7.2 
-2.4 2.4 -7.2 2.4 S
1965.6 2217.6 4.8 -4.8 -4.8 -2.4 -2.4 2.4 0 4.8 2.4 7.2 4.8 2.4 9.6 2.4 
14.4 0 9.6 -2.4 4.8 -2.4 2.4 -7.2 0 -7.2 -2.4 -7.2 -12 -7.2 -16.8 -7.2 
-7.2 -2.4 -7.2 -7.2 -2.4 -12 0 -9.6 P
1994.4 2229.6 7.2 -2.4 2.4 -2.4 4.8 -7.2 0 -7.2 -4.8 -7.2 -9.6 -7.2 -14.4 -7.2 P
1963.2 2164.8 2.4 2.4 7.2 0 19.2 -4.8 9.6 0 7.2 2.4 2.4 2.4 P
1972.8 2167.2 19.2 -9.6 12 0 4.8 4.8 2.4 4.8 0 7.2 P
2054.4 2229.6 -12 -2.4 -7.2 -9.6 -2.4 -19.2 0 -9.6 2.4 -16.8 7.2 -9.6 12 -4.8 
4.8 0 12 4.8 7.2 9.6 2.4 16.8 0 9.6 -2.4 19.2 -7.2 9.6 -12 2.4 
-4.8 0 -7.2 -2.4 -4.8 -2.4 -2.4 -7.2 -4.8 -19.2 0 -9.6 4.8 -16.8 2.4 -7.2 
4.8 -2.4 7.2 -4.8 P
2059.2 2157.6 7.2 4.8 4.8 2.4 2.4 7.2 4.8 16.8 0 9.6 -4.8 19.2 -2.4 7.2 
-4.8 2.4 -7.2 2.4 P
2824.8 2224.8 0 -67.2 P
2827.2 2229.6 0 -72 P
2827.2 2229.6 -36 -50.4 55.2 0 P
2815.2 2157.6 24 0 P
2884.8 2229.6 -12 -2.4 -7.2 -9.6 -2.4 -19.2 0 -9.6 2.4 -16.8 7.2 -9.6 12 -4.8 
4.8 0 12 4.8 7.2 9.6 2.4 16.8 0 9.6 -2.4 19.2 -7.2 9.6 -12 2.4 
-4.8 0 -7.2 -2.4 -4.8 -2.4 -2.4 -7.2 -4.8 -19.2 0 -9.6 4.8 -16.8 2.4 -7.2 
4.8 -2.4 7.2 -4.8 P
2889.6 2157.6 7.2 4.8 4.8 2.4 2.4 7.2 4.8 16.8 0 9.6 -4.8 19.2 -2.4 7.2 
-4.8 2.4 -7.2 2.4 P
3664.8 2220 -2.4 -2.4 2.4 -4.8 4.8 4.8 0 2.4 -4.8 7.2 -7.2 2.4 -9.6 0 
-9.6 -2.4 -7.2 -7.2 -4.8 -7.2 -2.4 -14.4 0 -19.2 2.4 -12 7.2 -4.8 12 -4.8 
7.2 0 9.6 4.8 7.2 4.8 2.4 12 0 2.4 -2.4 12 -7.2 4.8 -9.6 4.8 
-4.8 0 -9.6 -4.8 -7.2 -4.8 -4.8 -12 S
3648 2229.6 -7.2 -2.4 -7.2 -7.2 -7.2 -21.6 0 -19.2 4.8 -12 14.4 -9.6 P
3652.8 2157.6 4.8 4.8 7.2 4.8 4.8 12 0 2.4 -4.8 12 -7.2 4.8 -4.8 4.8 P
3715.2 2229.6 -12 -2.4 -7.2 -9.6 -2.4 -19.2 0 -9.6 2.4 -16.8 7.2 -9.6 12 -4.8 
4.8 0 12 4.8 7.2 9.6 2.4 16.8 0 9.6 -2.4 19.2 -7.2 9.6 -12 2.4 
-4.8 0 -7.2 -2.4 -4.8 -2.4 -2.4 -7.2 -4.8 -19.2 0 -9.6 4.8 -16.8 2.4 -7.2 
4.8 -2.4 7.2 -4.8 P
3720 2157.6 7.2 4.8 4.8 2.4 2.4 7.2 4.8 16.8 0 9.6 -4.8 19.2 -2.4 7.2 
-4.8 2.4 -7.2 2.4 P
4471.2 2229.6 -9.6 -2.4 -4.8 -7.2 0 -9.6 4.8 -7.2 9.6 -4.8 14.4 0 9.6 4.8 
4.8 7.2 0 9.6 -4.8 7.2 -9.6 2.4 -14.4 0 -7.2 -2.4 -2.4 -7.2 0 -9.6 
2.4 -7.2 7.2 -4.8 P
4485.6 2198.4 7.2 4.8 2.4 7.2 0 9.6 -2.4 7.2 -7.2 2.4 P
4471.2 2198.4 -9.6 -2.4 -4.8 -2.4 -2.4 -7.2 0 -14.4 2.4 -7.2 14.4 -7.2 14.4 0 
14.4 7.2 2.4 7.2 0 14.4 -2.4 7.2 -4.8 2.4 -9.6 2.4 P
4471.2 2198.4 -7.2 -2.4 -2.4 -2.4 -4.8 -7.2 0 -14.4 4.8 -7.2 2.4 -2.4 7.2 -4.8 P
4485.6 2157.6 7.2 4.8 2.4 2.4 4.8 7.2 0 14.4 -4.8 7.2 -2.4 2.4 -7.2 2.4 P
4545.6 2229.6 -12 -2.4 -7.2 -9.6 -2.4 -19.2 0 -9.6 2.4 -16.8 7.2 -9.6 12 -4.8 
4.8 0 12 4.8 7.2 9.6 2.4 16.8 0 9.6 -2.4 19.2 -7.2 9.6 -12 2.4 
-4.8 0 -7.2 -2.4 -4.8 -2.4 -2.4 -7.2 -4.8 -19.2 0 -9.6 4.8 -16.8 2.4 -7.2 
4.8 -2.4 7.2 -4.8 S
4550.4 2157.6 7.2 4.8 4.8 2.4 2.4 7.2 4.8 16.8 0 9.6 -4.8 19.2 -2.4 7.2 
-4.8 2.4 -7.2 2.4 P
5260.8 2217.6 7.2 2.4 9.6 9.6 0 -72 P
5275.2 2227.2 0 -69.6 P
5260.8 2157.6 31.2 0 P
5340 2229.6 -9.6 -2.4 -7.2 -9.6 -4.8 -19.2 0 -9.6 4.8 -16.8 7.2 -9.6 9.6 -4.8 
7.2 0 9.6 4.8 7.2 9.6 4.8 16.8 0 9.6 -4.8 19.2 -7.2 9.6 -9.6 2.4 
-7.2 0 -7.2 -2.4 -2.4 -2.4 -4.8 -7.2 -2.4 -19.2 0 -9.6 2.4 -16.8 4.8 -7.2 
2.4 -2.4 7.2 -4.8 P
5347.2 2157.6 7.2 4.8 2.4 2.4 4.8 7.2 2.4 16.8 0 9.6 -2.4 19.2 -4.8 7.2 
-2.4 2.4 -7.2 2.4 P
5409.6 2229.6 -9.6 -2.4 -7.2 -9.6 -4.8 -19.2 0 -9.6 4.8 -16.8 7.2 -9.6 9.6 -4.8 
7.2 0 9.6 4.8 7.2 9.6 4.8 16.8 0 9.6 -4.8 19.2 -7.2 9.6 -9.6 2.4 
-7.2 0 -7.2 -2.4 -2.4 -2.4 -4.8 -7.2 -2.4 -19.2 0 -9.6 2.4 -16.8 4.8 -7.2 
2.4 -2.4 7.2 -4.8 P
5416.8 2157.6 7.2 4.8 2.4 2.4 4.8 7.2 2.4 16.8 0 9.6 -2.4 19.2 -4.8 7.2 
-2.4 2.4 -7.2 2.4 P
1190.4 3420 0 124.8 P
1358.4 3544.8 0 -40.8 P
1524 3504 0 40.8 P
1689.6 3544.8 0 -40.8 P
1855.2 3504 0 40.8 P
2020.8 3544.8 0 -124.8 P
2188.8 3504 0 40.8 P
2354.4 3544.8 0 -40.8 P
2520 3504 0 40.8 P
2685.6 3544.8 0 -40.8 P
2853.6 3420 0 124.8 P
3019.2 3544.8 0 -40.8 P
3184.8 3504 0 40.8 P
3350.4 3544.8 0 -40.8 P
3516 3504 0 40.8 P
3681.6 3544.8 0 -124.8 P
3849.6 3504 0 40.8 P
4015.2 3544.8 0 -40.8 P
4180.8 3504 0 40.8 S
4346.4 3544.8 0 -40.8 P
4514.4 3420 0 124.8 P
4680 3544.8 0 -40.8 P
4845.6 3504 0 40.8 P
5011.2 3544.8 0 -40.8 P
5176.8 3504 0 40.8 P
5344.8 3544.8 0 -124.8 P
1190.4 2299.2 124.8 0 P
1233.6 2335.2 -43.2 0 P
1190.4 2368.8 43.2 0 P
1233.6 2400 -43.2 0 P
1190.4 2433.6 43.2 0 P
1315.2 2462.4 -124.8 0 P
1190.4 2493.6 43.2 0 P
1233.6 2520 -43.2 0 P
1190.4 2548.8 43.2 0 P
1233.6 2575.2 -43.2 0 P
1190.4 2601.6 124.8 0 P
1233.6 2628 -43.2 0 P
1190.4 2652 43.2 0 P
1233.6 2676 -43.2 0 P
1190.4 2697.6 43.2 0 P
1315.2 2721.6 -124.8 0 P
1190.4 2743.2 43.2 0 P
1233.6 2764.8 -43.2 0 P
1190.4 2786.4 43.2 0 S
1233.6 2808 -43.2 0 P
1190.4 2827.2 124.8 0 P
1233.6 2846.4 -43.2 0 P
1190.4 2865.6 43.2 0 P
1233.6 2884.8 -43.2 0 P
1190.4 2904 43.2 0 P
1315.2 2920.8 -124.8 0 P
1190.4 3086.4 43.2 0 P
1233.6 3223.2 -43.2 0 P
1190.4 3343.2 43.2 0 P
1233.6 3451.2 -43.2 0 P
1190.4 3544.8 124.8 0 P
1008 2330.4 -9.6 -2.4 -7.2 -12 -4.8 -16.8 0 -9.6 4.8 -19.2 7.2 -9.6 9.6 -2.4 
7.2 0 9.6 2.4 7.2 9.6 4.8 19.2 0 9.6 -4.8 16.8 -7.2 12 -9.6 2.4 
-7.2 0 -7.2 -2.4 -2.4 -4.8 -4.8 -7.2 -2.4 -16.8 0 -9.6 2.4 -19.2 4.8 -4.8 
2.4 -4.8 7.2 -2.4 P
1015.2 2258.4 7.2 2.4 2.4 4.8 4.8 4.8 2.4 19.2 0 9.6 -2.4 16.8 -4.8 7.2 
-2.4 4.8 -7.2 2.4 P
1063.2 2265.6 -2.4 -4.8 2.4 -2.4 4.8 2.4 -4.8 4.8 P
1099.2 2330.4 -7.2 -33.6 7.2 4.8 9.6 4.8 9.6 0 12 -4.8 7.2 -4.8 2.4 -12 
0 -7.2 -2.4 -9.6 -7.2 -7.2 -12 -2.4 -9.6 0 -9.6 2.4 -4.8 4.8 -2.4 4.8 
0 4.8 2.4 2.4 4.8 -2.4 -4.8 -4.8 P
1118.4 2306.4 14.4 -9.6 4.8 -12 0 -7.2 -4.8 -9.6 -7.2 -7.2 -7.2 -2.4 P
1099.2 2330.4 33.6 0 P
1099.2 2328 16.8 0 16.8 2.4 P
1008 2632.8 -9.6 -2.4 -7.2 -12 -4.8 -16.8 0 -9.6 4.8 -19.2 7.2 -9.6 9.6 -2.4 
7.2 0 9.6 2.4 7.2 9.6 4.8 19.2 0 9.6 -4.8 16.8 -7.2 12 -9.6 2.4 
-7.2 0 -7.2 -2.4 -2.4 -4.8 -4.8 -7.2 -2.4 -16.8 0 -9.6 2.4 -19.2 4.8 -4.8 
2.4 -4.8 7.2 -2.4 P
1015.2 2560.8 7.2 2.4 2.4 4.8 4.8 4.8 2.4 19.2 0 9.6 -2.4 16.8 -4.8 7.2 
-2.4 4.8 -7.2 2.4 S
1063.2 2568 -2.4 -4.8 2.4 -2.4 4.8 2.4 -4.8 4.8 P
1092 2632.8 0 -21.6 P
1092 2618.4 2.4 7.2 7.2 7.2 7.2 0 16.8 -9.6 7.2 0 4.8 2.4 2.4 7.2 P
1094.4 2625.6 7.2 4.8 7.2 0 16.8 -7.2 P
1140 2632.8 0 -9.6 -2.4 -12 -14.4 -16.8 -4.8 -7.2 -2.4 -9.6 0 -16.8 P
1137.6 2611.2 -19.2 -16.8 -2.4 -7.2 -4.8 -9.6 0 -16.8 P
998.4 2940 7.2 2.4 9.6 9.6 0 -72 P
1012.8 2949.6 0 -69.6 P
998.4 2880 31.2 0 P
1063.2 2887.2 -2.4 -2.4 2.4 -4.8 4.8 4.8 -4.8 2.4 P
1111.2 2952 -9.6 -2.4 -7.2 -9.6 -2.4 -16.8 0 -12 2.4 -16.8 7.2 -9.6 9.6 -4.8 
7.2 0 12 4.8 7.2 9.6 2.4 16.8 0 12 -2.4 16.8 -7.2 9.6 -12 2.4 
-7.2 0 -9.6 -4.8 -2.4 -7.2 -4.8 -16.8 0 -12 4.8 -16.8 2.4 -7.2 4.8 -2.4 
4.8 -4.8 P
1118.4 2880 7.2 4.8 4.8 2.4 2.4 7.2 4.8 16.8 0 12 -4.8 16.8 -2.4 7.2 
-4.8 2.4 -7.2 2.4 P
991.2 3561.6 2.4 -2.4 -2.4 -4.8 -4.8 4.8 0 2.4 4.8 7.2 2.4 4.8 12 2.4 
12 0 12 -2.4 2.4 -4.8 4.8 -7.2 0 -7.2 -4.8 -7.2 -9.6 -4.8 -16.8 -7.2 
-7.2 -4.8 -7.2 -7.2 -4.8 -9.6 0 -9.6 P
1017.6 3576 7.2 -2.4 4.8 -4.8 2.4 -7.2 0 -7.2 -2.4 -7.2 -12 -4.8 -12 -7.2 P
986.4 3511.2 4.8 2.4 7.2 0 16.8 -7.2 9.6 0 7.2 4.8 4.8 2.4 P
998.4 3513.6 16.8 -9.6 14.4 0 2.4 2.4 4.8 7.2 0 7.2 P
1063.2 3511.2 -2.4 -4.8 2.4 -2.4 4.8 2.4 -4.8 4.8 P
1111.2 3576 -9.6 -2.4 -7.2 -12 -2.4 -16.8 0 -9.6 2.4 -19.2 7.2 -9.6 9.6 -2.4 
7.2 0 12 2.4 7.2 9.6 2.4 19.2 0 9.6 -2.4 16.8 -7.2 12 -12 2.4 
-7.2 0 S
1111.2 3576 -4.8 -2.4 -4.8 -4.8 -2.4 -7.2 -4.8 -16.8 0 -9.6 4.8 -19.2 2.4 -4.8 
4.8 -4.8 4.8 -2.4 P
1118.4 3504 7.2 2.4 4.8 4.8 2.4 4.8 4.8 19.2 0 9.6 -4.8 16.8 -2.4 7.2 
-4.8 4.8 -7.2 2.4 P
5220 2299.2 124.8 0 P
5344.8 2335.2 -43.2 0 P
5301.6 2368.8 43.2 0 P
5344.8 2400 -43.2 0 P
5301.6 2433.6 43.2 0 P
5344.8 2462.4 -124.8 0 P
5301.6 2493.6 43.2 0 P
5344.8 2520 -43.2 0 P
5301.6 2548.8 43.2 0 P
5344.8 2575.2 -43.2 0 P
5220 2601.6 124.8 0 P
5344.8 2628 -43.2 0 P
5301.6 2652 43.2 0 P
5344.8 2676 -43.2 0 P
5301.6 2697.6 43.2 0 P
5344.8 2721.6 -124.8 0 P
5301.6 2743.2 43.2 0 P
5344.8 2764.8 -43.2 0 P
5301.6 2786.4 43.2 0 P
5344.8 2808 -43.2 0 P
5220 2827.2 124.8 0 P
5344.8 2846.4 -43.2 0 P
5301.6 2865.6 43.2 0 P
5344.8 2884.8 -43.2 0 P
5301.6 2904 43.2 0 P
5344.8 2920.8 -124.8 0 P
5301.6 3086.4 43.2 0 P
5344.8 3223.2 -43.2 0 P
5301.6 3343.2 43.2 0 P
5344.8 3451.2 -43.2 0 P
5220 3544.8 124.8 0 S
255 0 r3
1190.4 2299.2 0 21.6 P
1190.4 2340 0 21.6 P
1190.4 2383.2 0 19.2 P
1190.4 2424 0 21.6 P
1190.4 2464.8 0 21.6 P
1190.4 2505.6 0 21.6 P
1190.4 2548.8 0 19.2 P
1190.4 2589.6 0 21.6 P
1190.4 2630.4 0 21.6 P
1190.4 2673.6 0 19.2 P
1190.4 2714.4 0 21.6 P
1190.4 2755.2 0 21.6 P
1190.4 2798.4 0 19.2 P
1190.4 2839.2 0 21.6 P
1190.4 2880 0 21.6 P
1190.4 2920.8 21.6 0 P
1233.6 2920.8 19.2 0 P
1274.4 2920.8 21.6 0 P
1315.2 2920.8 21.6 0 P
1358.4 2920.8 19.2 0 P
1399.2 2920.8 21.6 0 P
1440 2920.8 21.6 0 P
1483.2 2920.8 19.2 0 P
1524 2920.8 21.6 0 P
1564.8 2920.8 21.6 0 P
1605.6 2920.8 21.6 0 P
1648.8 2920.8 19.2 0 P
1689.6 2920.8 21.6 0 P
1730.4 2920.8 21.6 0 P
1773.6 2920.8 19.2 0 P
1814.4 2920.8 21.6 0 P
1855.2 2920.8 21.6 0 P
1898.4 2920.8 19.2 0 P
1939.2 2920.8 21.6 0 P
1980 2920.8 21.6 0 P
2020.8 2920.8 0 -19.2 P
2020.8 2880 0 -19.2 P
2020.8 2839.2 0 -21.6 P
2020.8 2798.4 0 -21.6 P
2020.8 2755.2 0 -19.2 P
2020.8 2714.4 0 -21.6 P
2028 2678.4 19.2 0 P
2068.8 2678.4 21.6 0 P
2109.6 2678.4 21.6 0 P
2152.8 2678.4 19.2 0 P
2188.8 2683.2 0 21.6 P
2188.8 2724 0 14.4 7.2 0 P
2215.2 2738.4 21.6 0 P
2258.4 2738.4 19.2 0 P
2299.2 2738.4 21.6 0 P
2340 2738.4 14.4 0 0 -7.2 P
2354.4 2709.6 0 -19.2 P
2354.4 2668.8 0 -21.6 P
2368.8 2642.4 21.6 0 P
2412 2642.4 19.2 0 P
2452.8 2642.4 21.6 0 P
2493.6 2642.4 21.6 0 P
2520 2656.8 0 21.6 P
2520 2700 0 19.2 P
2520 2740.8 0 21.6 P
2520 2781.6 0 21.6 P
2522.4 2820 21.6 0 P
2565.6 2820 19.2 0 S
2606.4 2820 21.6 0 P
2647.2 2820 21.6 0 P
2685.6 2824.8 0 19.2 P
2685.6 2865.6 0 21.6 P
2685.6 2906.4 0 21.6 P
2685.6 2949.6 0 19.2 P
2685.6 2990.4 0 21.6 P
2685.6 3031.2 0 21.6 P
2685.6 3072 0 16.8 7.2 0 P
2712 3088.8 21.6 0 P
2755.2 3088.8 19.2 0 P
2796 3088.8 21.6 0 P
2836.8 3088.8 16.8 0 0 -7.2 P
2853.6 3062.4 0 -21.6 P
2853.6 3019.2 0 -19.2 P
2853.6 2978.4 0 -19.2 P
2863.2 2949.6 21.6 0 P
2904 2949.6 21.6 0 P
2947.2 2949.6 19.2 0 P
2988 2949.6 21.6 0 P
3019.2 2937.6 0 -21.6 P
3019.2 2896.8 0 -21.6 P
3019.2 2853.6 0 -19.2 P
3019.2 2812.8 0 -21.6 P
3038.4 2791.2 21.6 0 P
3079.2 2791.2 21.6 0 P
3122.4 2791.2 19.2 0 P
3163.2 2791.2 21.6 0 P
3184.8 2772 0 -21.6 P
3184.8 2728.8 0 -19.2 P
3184.8 2688 0 -21.6 P
3184.8 2647.2 0 -21.6 P
3184.8 2604 0 -19.2 P
3184.8 2563.2 0 -19.2 P
3184.8 2522.4 0 -21.6 P
3184.8 2481.6 0 -7.2 14.4 0 P
3220.8 2474.4 21.6 0 P
3261.6 2474.4 21.6 0 P
3304.8 2474.4 19.2 0 P
3345.6 2474.4 4.8 0 0 16.8 P
3350.4 2510.4 0 21.6 P
3350.4 2553.6 0 19.2 P
3350.4 2594.4 0 21.6 P
3369.6 2616 21.6 0 P
3410.4 2616 21.6 0 P
3453.6 2616 19.2 0 P
3494.4 2616 21.6 0 P
3516 2635.2 0 21.6 P
3516 2678.4 0 19.2 P
3516 2719.2 0 21.6 P
3516 2760 0 21.6 P
3528 2791.2 19.2 0 P
3568.8 2791.2 21.6 0 P
3609.6 2791.2 21.6 0 P
3652.8 2791.2 19.2 0 P
3681.6 2803.2 0 19.2 P
3681.6 2844 0 19.2 P
3681.6 2884.8 0 21.6 P
3681.6 2925.6 0 21.6 P
3681.6 2968.8 0 19.2 P
3681.6 3009.6 0 21.6 P
3681.6 3050.4 0 21.6 S
3681.6 3093.6 0 19.2 P
3681.6 3134.4 0 21.6 P
3681.6 3175.2 0 21.6 P
3681.6 3218.4 0 19.2 P
3681.6 3259.2 0 19.2 P
3681.6 3300 0 21.6 P
3681.6 3340.8 0 21.6 P
3681.6 3384 0 19.2 P
3681.6 3424.8 0 21.6 P
3681.6 3465.6 0 21.6 P
3681.6 3508.8 0 19.2 P
3849.6 3540 0 -21.6 P
3849.6 3499.2 0 -21.6 P
3849.6 3456 0 -19.2 P
3849.6 3415.2 19.2 0 P
3890.4 3415.2 21.6 0 P
3931.2 3415.2 21.6 0 P
3974.4 3415.2 19.2 0 P
4015.2 3415.2 0 -19.2 P
4015.2 3374.4 0 -21.6 P
4015.2 3333.6 0 -21.6 P
4015.2 3290.4 0 -19.2 P
4015.2 3249.6 0 -21.6 P
4015.2 3208.8 0 -21.6 P
4015.2 3165.6 0 -19.2 P
4015.2 3124.8 0 -21.6 P
4015.2 3084 0 -21.6 P
4015.2 3040.8 0 -19.2 P
4015.2 3000 0 -19.2 P
4015.2 2959.2 0 -21.6 P
4015.2 2918.4 0 -21.6 P
4015.2 2875.2 0 -19.2 P
4015.2 2834.4 0 -21.6 P
4015.2 2793.6 0 -4.8 16.8 0 P
4053.6 2788.8 19.2 0 P
4094.4 2788.8 21.6 0 P
4135.2 2788.8 21.6 0 P
4178.4 2788.8 2.4 0 0 16.8 P
4180.8 2827.2 0 21.6 P
4180.8 2868 0 21.6 P
4180.8 2911.2 0 19.2 P
4180.8 2952 0 21.6 P
4180.8 2992.8 0 21.6 P
4180.8 3036 0 19.2 P
4180.8 3076.8 0 21.6 P
4180.8 3117.6 0 21.6 P
4180.8 3158.4 0 21.6 P
4180.8 3201.6 0 19.2 P
4180.8 3242.4 0 21.6 P
4180.8 3283.2 0 21.6 P
4180.8 3326.4 0 19.2 P
4180.8 3367.2 0 21.6 P
4180.8 3408 0 21.6 P
4180.8 3451.2 0 19.2 P
4180.8 3492 0 21.6 P
4180.8 3532.8 0 12 P
4346.4 3544.8 0 -9.6 P
4346.4 3516 0 -21.6 P
4346.4 3472.8 0 -19.2 P
4346.4 3432 0 -21.6 P
4346.4 3391.2 0 -21.6 P
4346.4 3348 0 -19.2 P
4346.4 3307.2 0 -21.6 S
4346.4 3266.4 0 -21.6 P
4346.4 3223.2 0 -19.2 P
4346.4 3182.4 0 -21.6 P
4346.4 3141.6 0 -21.6 P
4346.4 3100.8 0 -21.6 P
4346.4 3057.6 0 -19.2 P
4346.4 3016.8 0 -21.6 P
4346.4 2976 0 -21.6 P
4346.4 2932.8 0 -19.2 S
4346.4 2892 0 -21.6 P
4346.4 2851.2 0 -21.6 P
4346.4 2808 0 -19.2 P
4346.4 2767.2 0 -21.6 P
4346.4 2726.4 0 -21.6 P
4346.4 2685.6 0 -21.6 P
4346.4 2642.4 0 -19.2 P
4346.4 2601.6 0 -21.6 P
4346.4 2560.8 0 -21.6 P
4346.4 2517.6 0 -19.2 P
4346.4 2476.8 0 -21.6 P
4346.4 2436 0 -21.6 P
4346.4 2392.8 0 -19.2 P
4346.4 2352 0 -21.6 P
4346.4 2311.2 0 -12 P
4514.4 2299.2 0 9.6 P
4514.4 2328 0 21.6 P
4514.4 2371.2 0 19.2 P
4514.4 2412 0 21.6 P
4514.4 2452.8 0 21.6 P
4514.4 2496 0 19.2 P
4514.4 2536.8 0 21.6 P
4514.4 2577.6 0 21.6 P
4514.4 2620.8 0 19.2 P
4514.4 2661.6 0 21.6 P
4514.4 2702.4 0 21.6 P
4514.4 2743.2 0 21.6 P
4514.4 2786.4 0 19.2 P
4514.4 2827.2 0 21.6 P
4514.4 2868 0 21.6 P
4514.4 2911.2 0 19.2 P
4514.4 2952 0 21.6 P
4514.4 2992.8 0 21.6 P
4514.4 3036 0 19.2 P
4514.4 3076.8 0 21.6 P
4514.4 3117.6 0 21.6 P
4514.4 3158.4 0 21.6 P
4514.4 3201.6 0 19.2 P
4514.4 3242.4 0 21.6 P
4514.4 3283.2 0 21.6 P
4514.4 3326.4 0 19.2 P
4514.4 3367.2 0 21.6 P
4514.4 3408 0 21.6 P
4514.4 3451.2 0 19.2 P
4514.4 3492 0 21.6 P
4514.4 3532.8 0 12 P
4680 3544.8 0 -9.6 P
4680 3516 0 -21.6 P
4680 3472.8 0 -19.2 P
4680 3432 0 -21.6 P
4680 3391.2 0 -21.6 P
4680 3348 0 -19.2 P
4680 3307.2 0 -21.6 P
4680 3266.4 0 -21.6 P
4680 3223.2 0 -19.2 P
4680 3182.4 0 -21.6 P
4680 3141.6 0 -21.6 P
4680 3100.8 0 -21.6 P
4680 3057.6 0 -19.2 P
4680 3016.8 0 -21.6 P
4680 2976 0 -21.6 P
4680 2932.8 0 -19.2 P
4680 2892 0 -21.6 P
4680 2851.2 0 -21.6 S
4680 2808 0 -19.2 P
4680 2767.2 0 -21.6 P
4680 2726.4 0 -21.6 P
4680 2685.6 0 -21.6 P
4680 2642.4 0 -19.2 P
4680 2601.6 0 -21.6 P
4680 2560.8 0 -21.6 P
4680 2517.6 0 -19.2 P
4680 2476.8 0 -21.6 P
4680 2436 0 -21.6 P
4680 2392.8 0 -19.2 P
4680 2352 0 -21.6 P
4680 2311.2 0 -12 P
5344.8 2299.2 0 0 S
cleartomark end end pagesave restore
 showpage
%%PageTrailer
%%Trailer
%%Pages: 1
%%Trailer
cleartomark
countdictstack
exch sub { end } repeat
restore
%%EOF
