%!PS-Adobe-2.0 EPSF-2.0
%%BoundingBox:  0 0 567 544
%%Title: HWW_400_Mt_NNLO_cut_YR3.eps: HWW 400Gev Mt NNLO with cuts
%%Creator: ROOT Version 5.34/05
%%CreationDate: Fri Jun 14 02:56:49 2013
%%EndComments
%%BeginProlog
80 dict begin
/s {stroke} def /l {lineto} def /m {moveto} def /t {translate} def
/r {rotate} def /rl {roll}  def /R {repeat} def
/d {rlineto} def /rm {rmoveto} def /gr {grestore} def /f {eofill} def
/c {setrgbcolor} def /black {0 setgray} def /sd {setdash} def
/cl {closepath} def /sf {scalefont setfont} def /lw {setlinewidth} def
/box {m dup 0 exch d exch 0 d 0 exch neg d cl} def
/NC{systemdict begin initclip end}def/C{NC box clip newpath}def
/bl {box s} def /bf {box f} def /Y { 0 exch d} def /X { 0 d} def 
/K {{pop pop 0 moveto} exch kshow} bind def
/ita {/ang 15 def gsave [1 0 ang dup sin exch cos div 1 0 0] concat} def 
/mp {newpath /y exch def /x exch def} def
/side {[w .77 mul w .23 mul] .385 w mul sd w 0 l currentpoint t -144 r} def
/mr {mp x y w2 0 360 arc} def /m24 {mr s} def /m20 {mr f} def
/mb {mp x y w2 add m w2 neg 0 d 0 w neg d w 0 d 0 w d cl} def
/mt {mp x y w2 add m w2 neg w neg d w 0 d cl} def
/m21 {mb f} def /m25 {mb s} def /m22 {mt f} def /m26{mt s} def
/m23 {mp x y w2 sub m w2 w d w neg 0 d cl f} def
/m27 {mp x y w2 add m w3 neg w2 neg d w3 w2 neg d w3 w2 d cl s} def
/m28 {mp x w2 sub y w2 sub w3 add m w3 0 d  0 w3 neg d w3 0 d 0 w3 d w3 0 d  0 w3 d w3 neg 0 d 0 w3 d w3 neg 0 d 0 w3 neg d w3 neg 0 d cl s } def
/m29 {mp gsave x w2 sub y w2 add w3 sub m currentpoint t 4 {side} repeat cl fill gr} def
/m30 {mp gsave x w2 sub y w2 add w3 sub m currentpoint t 4 {side} repeat cl s gr} def
/m31 {mp x y w2 sub m 0 w d x w2 sub y m w 0 d x w2 sub y w2 add m w w neg d x w2 sub y w2 sub m w w d s} def
/m32 {mp x y w2 sub m w2 w d w neg 0 d cl s} def
/m33 {mp x y w2 add m w3 neg w2 neg d w3 w2 neg d w3 w2 d cl f} def
/m34 {mp x w2 sub y w2 sub w3 add m w3 0 d  0 w3 neg d w3 0 d 0 w3 d w3 0 d  0 w3 d w3 neg 0 d 0 w3 d w3 neg 0 d 0 w3 neg d w3 neg 0 d cl f } def
/m2 {mp x y w2 sub m 0 w d x w2 sub y m w 0 d s} def
/m5 {mp x w2 sub y w2 sub m w w d x w2 sub y w2 add m w w neg d s} def
/reEncode {exch findfont dup length dict begin {1 index /FID eq  {pop pop} {def} ifelse } forall /Encoding exch def currentdict end dup /FontName get exch definefont pop } def [/Times-Bold /Times-Italic /Times-BoldItalic /Helvetica /Helvetica-Oblique
 /Helvetica-Bold /Helvetica-BoldOblique /Courier /Courier-Oblique /Courier-Bold /Courier-BoldOblique /Times-Roman /AvantGarde-Book /AvantGarde-BookOblique /AvantGarde-Demi /AvantGarde-DemiOblique /Bookman-Demi /Bookman-DemiItalic /Bookman-Light
 /Bookman-LightItalic /Helvetica-Narrow /Helvetica-Narrow-Bold /Helvetica-Narrow-BoldOblique /Helvetica-Narrow-Oblique /NewCenturySchlbk-Roman /NewCenturySchlbk-Bold /NewCenturySchlbk-BoldItalic /NewCenturySchlbk-Italic /Palatino-Bold
 /Palatino-BoldItalic /Palatino-Italic /Palatino-Roman ] {ISOLatin1Encoding reEncode } forall
%%EndProlog
%%BeginSetup
%%EndSetup
newpath  gsave  .25 .25 scale  gsave  0 0 t black[  ] 0 sd 3 lw 1 1 1 c 2268 2177 0 0 bf black 1 1 1 c 2222 2133 23 22 bf black 1 1 1 c 1778 1706 245 235 bf black 1778 1706 245 235 bl 0.8 0 0.8 c 1 1 1 c 1 0 1 c 0.8 0 0.8 c 245 320 m 163 X 2 Y 8 X 5
 Y 7 X 8 Y 7 X 8 Y 7 X 12 Y 7 X 16 Y 7 X 14 Y 7 X 24 Y 7 X 22 Y 7 X 22 Y 8 X 31 Y 7 X 36 Y 7 X 35 Y 7 X 37 Y 7 X 37 Y 7 X 32 Y 7 X 63 Y 7 X 37 Y 7 X 44 Y 8 X 53 Y 7 X 48 Y 7 X 53 Y 7 X 41 Y 7 X 62 Y 7 X 51 Y 7 X 58 Y 7 X 57 Y 7 X 27 Y 8 X 59 Y 7 X 56
 Y 7 X 20 Y 7 X 72 Y 7 X 31 Y 7 X 34 Y 7 X 66 Y 7 X 23 Y 7 X 39 Y 8 X 46 Y 7 X 26 Y 7 X 27 Y 7 X 28 Y 7 X 25 Y 7 X 30 Y 7 X 1 Y 7 X 12 Y 7 X 10 Y 8 X -5 Y 7 X -5 Y 7 X 1 Y 7 X -16 Y 7 X -8 Y 7 X -14 Y 7 X -26 Y 7 X -19 Y 8 X -17 Y 7 X -39 Y 7 X -53 Y
 7 X -36 Y 7 X -51 Y 7 X -54 Y 7 X -54 Y 7 X -77 Y 7 X -41 Y 8 X -81 Y 7 X -58 Y 7 X -65 Y 7 X -70 Y 7 X -80 Y 7 X -69 Y 7 X -71 Y 7 X -69 Y 7 X -69 Y 8 X -59 Y 7 X -62 Y 7 X -52 Y 7 X -51 Y 7 X -38 Y 7 X -32 Y 7 X -27 Y 7 X -16 Y 7 X -16 Y 8 X -10 Y
 7 X -8 Y 7 X -5 Y 7 X -6 Y 7 X -3 Y 7 X -3 Y 7 X -3 Y 7 X -2 Y 7 X -3 Y 8 X -1 Y 14 X -1 Y 7 X -1 Y 7 X -1 Y 21 X -1 Y 36 X -1 Y 7 X 1 Y 21 X -1 Y 7 X 1 Y 43 X 1 Y 7 X -1 Y 7 X 1 Y 22 X 1 Y 7 X -1 Y 14 X 1 Y 7 X -1 Y 7 X 1 Y 7 X -1 Y 7 X 1 Y 29 X 1
 Y 64 X 1 Y 14 X -1 Y 14 X 1 Y 50 X 1 Y 128 X 1 Y 242 X 1 Y 7 X -1 Y 7 X 1 Y 171 X s black 245 235 m 1778 X s
 gsave  2222 2133 23 22 C 1990.42 79.7689 t 0 r /Helvetica findfont 45.6261 sf 0 0 m (T) show NC gr 
 gsave  2222 2133 23 22 C 1937.25 98.7615 t 0 r /Helvetica findfont 68.4392 sf 0 0 m (M) show NC gr  245 286 m -51 Y s 280 261 m -26 Y s 316 261 m -26 Y s 352 261 m -26 Y s 387 261 m -26 Y s 423 286 m -51 Y s 458 261 m -26 Y s 494 261 m -26 Y s 529
 261 m -26 Y s 565 261 m -26 Y s 600 286 m -51 Y s 636 261 m -26 Y s 672 261 m -26 Y s 707 261 m -26 Y s 743 261 m -26 Y s 778 286 m -51 Y s 814 261 m -26 Y s 849 261 m -26 Y s 885 261 m -26 Y s 921 261 m -26 Y s 956 286 m -51 Y s 992 261 m -26 Y s
 1027 261 m -26 Y s 1063 261 m -26 Y s 1098 261 m -26 Y s 1134 286 m -51 Y s 1169 261 m -26 Y s 1205 261 m -26 Y s 1241 261 m -26 Y s 1276 261 m -26 Y s 1312 286 m -51 Y s 1347 261 m -26 Y s 1383 261 m -26 Y s 1418 261 m -26 Y s 1454 261 m -26 Y s
 1489 286 m -51 Y s 1525 261 m -26 Y s 1561 261 m -26 Y s 1596 261 m -26 Y s 1632 261 m -26 Y s 1667 286 m -51 Y s 1703 261 m -26 Y s 1738 261 m -26 Y s 1774 261 m -26 Y s 1809 261 m -26 Y s 1845 286 m -51 Y s 1881 261 m -26 Y s 1916 261 m -26 Y s
 1952 261 m -26 Y s 1987 261 m -26 Y s 2023 286 m -51 Y s
 gsave  2222 2133 23 22 C 224.113 167.135 t 0 r /Helvetica findfont 68.4392 sf 0 0 m (0) show NC gr 
 gsave  2222 2133 23 22 C 364.658 167.135 t 0 r /Helvetica findfont 68.4392 sf 0 0 m (100) show NC gr 
 gsave  2222 2133 23 22 C 543.188 167.135 t 0 r /Helvetica findfont 68.4392 sf 0 0 m (200) show NC gr 
 gsave  2222 2133 23 22 C 717.92 167.135 t 0 r /Helvetica findfont 68.4392 sf 0 0 m (300) show NC gr 
 gsave  2222 2133 23 22 C 896.451 167.135 t 0 r /Helvetica findfont 68.4392 sf 0 0 m (400) show NC gr 
 gsave  2222 2133 23 22 C 1074.98 167.135 t 0 r /Helvetica findfont 68.4392 sf 0 0 m (500) show NC gr 
 gsave  2222 2133 23 22 C 1253.51 167.135 t 0 r /Helvetica findfont 68.4392 sf 0 0 m (600) show NC gr 
 gsave  2222 2133 23 22 C 1432.04 167.135 t 0 r /Helvetica findfont 68.4392 sf 0 0 m (700) show NC gr 
 gsave  2222 2133 23 22 C 1606.77 167.135 t 0 r /Helvetica findfont 68.4392 sf 0 0 m (800) show NC gr 
 gsave  2222 2133 23 22 C 1785.3 167.135 t 0 r /Helvetica findfont 68.4392 sf 0 0 m (900) show NC gr 
 gsave  2222 2133 23 22 C 1944.84 167.135 t 0 r /Helvetica findfont 68.4392 sf 0 0 m (1000) show NC gr  245 235 m 1706 Y s
 gsave  2222 2133 23 22 C 102.56 1169.94 t 90 r /Helvetica findfont 45.6261 sf 0 0 m (T) show NC gr 
 gsave  2222 2133 23 22 C 75.9704 1055.99 t 90 r /Helvetica findfont 68.4392 sf 0 0 m (/dM) show NC gr 
 gsave  2222 2133 23 22 C 75.9704 1014.2 t 90 r /Symbol findfont 68.4392 sf 0 0 m (s) show NC gr 
 gsave  2222 2133 23 22 C 75.9704 980.018 t 90 r /Helvetica findfont 68.4392 sf 0 0 m (d) show NC gr  298 320 m -53 X s 272 369 m -27 X s 272 418 m -27 X s 272 468 m -27 X s 298 517 m -53 X s 272 567 m -27 X s 272 616 m -27 X s 272 666 m -27 X s 298
 715 m -53 X s 272 764 m -27 X s 272 814 m -27 X s 272 863 m -27 X s 298 913 m -53 X s 272 962 m -27 X s 272 1012 m -27 X s 272 1061 m -27 X s 298 1110 m -53 X s 272 1160 m -27 X s 272 1209 m -27 X s 272 1259 m -27 X s 298 1308 m -53 X s 272 1358 m
 -27 X s 272 1407 m -27 X s 272 1456 m -27 X s 298 1506 m -53 X s 272 1555 m -27 X s 272 1605 m -27 X s 272 1654 m -27 X s 298 1704 m -53 X s 272 1753 m -27 X s 272 1802 m -27 X s 272 1852 m -27 X s 298 1901 m -53 X s 298 320 m -53 X s 272 270 m -27
 X s 298 1901 m -53 X s
 gsave  2222 2133 23 22 C 208.919 307.68 t 0 r /Helvetica findfont 38.0218 sf 0 0 m (0) show NC gr 
 gsave  2222 2133 23 22 C 155.739 505.203 t 0 r /Helvetica findfont 38.0218 sf 0 0 m (0.02) show NC gr 
 gsave  2222 2133 23 22 C 155.739 702.726 t 0 r /Helvetica findfont 38.0218 sf 0 0 m (0.04) show NC gr 
 gsave  2222 2133 23 22 C 155.739 900.249 t 0 r /Helvetica findfont 38.0218 sf 0 0 m (0.06) show NC gr 
 gsave  2222 2133 23 22 C 155.739 1097.77 t 0 r /Helvetica findfont 38.0218 sf 0 0 m (0.08) show NC gr 
 gsave  2222 2133 23 22 C 186.127 1295.3 t 0 r /Helvetica findfont 38.0218 sf 0 0 m (0.1) show NC gr 
 gsave  2222 2133 23 22 C 155.739 1492.82 t 0 r /Helvetica findfont 38.0218 sf 0 0 m (0.12) show NC gr 
 gsave  2222 2133 23 22 C 155.739 1690.34 t 0 r /Helvetica findfont 38.0218 sf 0 0 m (0.14) show NC gr 
 gsave  2222 2133 23 22 C 155.739 1887.86 t 0 r /Helvetica findfont 38.0218 sf 0 0 m (0.16) show NC gr  0.8 0 0.8 c 1 0 1 c /w 2 def /w2 {w 2 div} def /w3 {w 3 div} def 248 320 m20 256 320 m20 263 320 m20 270 320 m20 277 320 m20 284 320 m20 291 320
 m20 298 320 m20 305 320 m20 312 320 m20 320 320 m20 327 320 m20 334 320 m20 341 320 m20 348 320 m20 355 320 m20 362 320 m20 369 320 m20 376 320 m20 384 320 m20 391 320 m20 398 320 m20 405 320 m20 412 322 m20 419 327 m20 426 335 m20 433 343 m20 440
 355 m20 448 371 m20 455 385 m20 462 409 m20 469 431 m20 476 453 m20 483 484 m20 490 520 m20 497 555 m20 504 592 m20 512 629 m20 519 661 m20 526 724 m20 533 761 m20 540 805 m20 547 858 m20 554 906 m20 561 959 m20 568 1000 m20 576 1062 m20 583 1113
 m20 590 1171 m20 597 1228 m20 604 1255 m20 611 1314 m20 618 1370 m20 625 1390 m20 632 1462 m20 640 1493 m20 647 1527 m20 654 1593 m20 661 1616 m20 668 1655 m20 675 1701 m20 682 1727 m20 689 1754 m20 696 1782 m20 704 1807 m20 711 1837 m20 718 1838
 m20 725 1850 m20 732 1860 m20 739 1855 m20 746 1850 m20 753 1851 m20 761 1835 m20 768 1827 m20 775 1813 m20 782 1787 m20 789 1768 m20 796 1751 m20 803 1712 m20 810 1659 m20 817 1623 m20 825 1572 m20 832 1518 m20 839 1464 m20 846 1387 m20 853 1346
 m20 860 1265 m20 867 1207 m20 874 1142 m20 881 1072 m20 889 992 m20 896 923 m20 903 852 m20 910 783 m20 917 714 m20 924 655 m20 931 593 m20 938 541 m20 945 490 m20 953 452 m20 960 420 m20 967 393 m20 974 377 m20 981 361 m20 988 351 m20 995 343 m20
 1002 338 m20 1009 332 m20 1017 329 m20 1024 326 m20 1031 323 m20 1038 321 m20 1045 318 m20 1052 317 m20 1059 317 m20 1066 316 m20 1073 315 m20 1081 314 m20 1088 314 m20 1095 314 m20 1102 313 m20 1109 313 m20 1116 313 m20 1123 313 m20 1130 313 m20
 1137 312 m20 1145 313 m20 1152 313 m20 1159 313 m20 1166 312 m20 1173 313 m20 1180 313 m20 1187 313 m20 1194 313 m20 1201 313 m20 1209 313 m20 1216 314 m20 1223 313 m20 1230 314 m20 1237 314 m20 1244 314 m20 1251 315 m20 1258 314 m20 1265 314 m20
 1273 315 m20 1280 314 m20 1287 315 m20 1294 314 m20 1301 315 m20 1308 315 m20 1315 315 m20 1322 315 m20 1329 316 m20 1337 316 m20 1344 316 m20 1351 316 m20 1358 316 m20 1365 316 m20 1372 316 m20 1379 316 m20 1386 316 m20 1393 317 m20 1401 317 m20
 1408 316 m20 1415 316 m20 1422 317 m20 1429 317 m20 1436 317 m20 1443 317 m20 1450 317 m20 1457 317 m20 1465 317 m20 1472 318 m20 1479 318 m20 1486 318 m20 1493 318 m20 1500 318 m20 1507 318 m20 1514 318 m20 1521 318 m20 1529 318 m20 1536 318 m20
 1543 318 m20 1550 318 m20 1557 318 m20 1564 318 m20 1571 318 m20 1578 318 m20 1585 318 m20 1593 318 m20 1600 319 m20 1607 319 m20 1614 319 m20 1621 319 m20 1628 319 m20 1635 319 m20 1642 319 m20 1649 319 m20 1657 319 m20 1664 319 m20 1671 319 m20
 1678 319 m20 1685 319 m20 1692 319 m20 1699 319 m20 1706 319 m20 1713 319 m20 1721 319 m20 1728 319 m20 1735 319 m20 1742 319 m20 1749 319 m20 1756 319 m20 1763 319 m20 1770 319 m20 1777 319 m20 1785 319 m20 1792 319 m20 1799 319 m20 1806 319 m20
 1813 319 m20 1820 319 m20 1827 319 m20 1834 319 m20 1841 320 m20 1849 319 m20 1856 320 m20 1863 320 m20 1870 320 m20 1877 320 m20 1884 320 m20 1891 320 m20 1898 320 m20 1905 320 m20 1913 320 m20 1920 320 m20 1927 320 m20 1934 320 m20 1941 320 m20
 1948 320 m20 1955 320 m20 1962 320 m20 1969 320 m20 1977 320 m20 1984 320 m20 1991 320 m20 1998 320 m20 2005 320 m20 2012 320 m20 2019 320 m20 0.8 0 0.8 c black 0.8 0 0.8 c 1 lw << /PatternType 1 /PaintType 2 /TilingType 1 /BBox [ 0 0 100 100 ]
 /XStep 100 /YStep 100 /PaintProc { begin gsave 0 0 m 100 100 l 0 100 m 100 0 l s gr end } >> [ 0.24 0 0 0.24 0 0 ] makepattern /P13 exch def /cs {[/Pattern /DeviceRGB] setcolorspace} def /FA {f [/DeviceRGB] setcolorspace} def cs 0.8 0 0.8 P13
 setcolor 248 320 m 157 X 7 3 d 7 5 d 7 7 d 7 9 d 7 13 d 8 15 d 7 15 d 7 24 d 7 23 d 7 22 d 7 30 d 7 37 d 7 35 d 7 38 d 8 36 d 7 33 d 7 64 d 7 37 d 7 45 d 7 53 d 7 48 d 7 54 d 7 40 d 8 63 d 7 50 d 7 59 d 7 57 d 7 28 d 7 59 d 7 55 d 7 20 d 7 73 d 8 31
 d 7 34 d 7 66 d 7 23 d 7 39 d 7 46 d 7 27 d 7 27 d 7 28 d 8 25 d 7 30 d 7 1 d 7 12 d 7 10 d 7 -6 d 7 -5 d 7 2 d 8 -17 d 7 -8 d 7 -14 d 7 -26 d 7 -19 d 7 -17 d 7 -40 d 7 -53 d 7 -36 d 8 -52 d 7 -54 d 7 -54 d 7 -77 d 7 -42 d 7 -81 d 7 -58 d 7 -66 d 7
 -70 d 8 -80 d 7 -69 d 7 -72 d 7 -69 d 7 -70 d 7 -58 d 7 -63 d 7 -53 d 7 -50 d 8 -38 d 7 -33 d 7 -27 d 7 -16 d 7 -17 d 7 -9 d 7 -8 d 7 -6 d 7 -5 d 8 -3 d 7 -4 d 7 -2 d 7 -3 d 7 -2 d 7 -1 d 7 -1 d 7 -1 d 7 X 8 -2 d 14 X 7 -1 d 107 X 7 1 d 28 X 7 1 d
 22 X 7 -1 d 7 1 d 21 X 7 1 d 7 -1 d 7 1 d 36 X 7 1 d 7 -1 d 7 1 d 50 X 7 1 d 7 X 7 -1 d 8 1 d 85 X 7 1 d 7 -1 d 7 1 d 228 X 7 1 d 213 X -163 X -7 -1 d -8 1 d -7 -1 d -227 X -7 -1 d -100 X -7 -1 d -7 1 d -7 -1 d -7 1 d -7 -1 d -43 X -7 -1 d -71 X -7
 -1 d -8 X -7 -1 d -7 1 d -14 X -7 -1 d -7 1 d -7 -1 d -7 1 d -8 -1 d -7 X -7 1 d -7 -1 d -7 X -7 -1 d -21 X -8 -1 d -85 X -7 1 d -14 X -7 1 d -7 X -8 1 d -7 X -7 1 d -7 1 d -7 1 d -7 2 d -7 3 d -7 2 d -7 4 d -8 3 d -7 5 d -7 6 d -7 8 d -7 9 d -7 16
 d -7 16 d -7 27 d -7 32 d -8 38 d -7 50 d -7 52 d -7 62 d -7 58 d -7 69 d -7 68 d -7 72 d -7 69 d -8 78 d -7 70 d -7 66 d -7 57 d -7 80 d -7 41 d -7 77 d -7 54 d -7 53 d -8 51 d -7 36 d -7 52 d -7 40 d -7 17 d -7 18 d -7 26 d -7 14 d -7 7 d -8 17 d
 -7 -1 d -7 4 d -7 6 d -7 -11 d -7 -11 d -7 -2 d -7 -30 d -8 -24 d -7 -28 d -7 -27 d -7 -27 d -7 -46 d -7 -39 d -7 -22 d -7 -67 d -7 -33 d -8 -31 d -7 -72 d -7 -20 d -7 -55 d -7 -59 d -7 -27 d -7 -57 d -7 -58 d -7 -50 d -8 -63 d -7 -40 d -7 -53 d -7
 -48 d -7 -52 d -7 -44 d -7 -37 d -7 -62 d -7 -32 d -8 -37 d -7 -36 d -7 -35 d -7 -36 d -7 -30 d -7 -22 d -7 -22 d -7 -24 d -7 -13 d -8 -16 d -7 -12 d -7 -8 d -7 -7 d -7 -5 d -7 -2 d -157 X FA 3 lw 0.8 0.8 0 c 1 1 1 c 1 1 0 c 0.8 0.8 0 c 245 320 m
 163 X 2 Y 8 X 5 Y 7 X 8 Y 7 X 10 Y 7 X 9 Y 7 X 16 Y 7 X 16 Y 7 X 21 Y 7 X 24 Y 7 X 21 Y 8 X 30 Y 7 X 35 Y 7 X 32 Y 7 X 39 Y 7 X 36 Y 7 X 33 Y 7 X 58 Y 7 X 33 Y 7 X 45 Y 8 X 46 Y 7 X 46 Y 7 X 47 Y 7 X 40 Y 7 X 59 Y 7 X 46 Y 7 X 57 Y 7 X 53 Y 7 X 31 Y
 8 X 57 Y 7 X 56 Y 7 X 26 Y 7 X 71 Y 7 X 34 Y 7 X 34 Y 7 X 69 Y 7 X 25 Y 7 X 45 Y 8 X 45 Y 7 X 31 Y 7 X 31 Y 7 X 31 Y 7 X 26 Y 7 X 34 Y 7 X 3 Y 7 X 19 Y 7 X 13 Y 15 X -2 Y 7 X 6 Y 7 X -18 Y 7 X 2 Y 7 X -15 Y 7 X -15 Y 7 X -15 Y 8 X -13 Y 7 X -36 Y 7
 X -48 Y 7 X -33 Y 7 X -49 Y 7 X -50 Y 7 X -53 Y 7 X -73 Y 7 X -34 Y 8 X -81 Y 7 X -55 Y 7 X -62 Y 7 X -72 Y 7 X -75 Y 7 X -71 Y 7 X -70 Y 7 X -69 Y 7 X -73 Y 8 X -58 Y 7 X -63 Y 7 X -57 Y 7 X -55 Y 7 X -40 Y 7 X -34 Y 7 X -32 Y 7 X -19 Y 7 X -21 Y 8
 X -11 Y 7 X -9 Y 7 X -11 Y 7 X -7 Y 7 X -5 Y 7 X -6 Y 7 X -5 Y 7 X -5 Y 7 X -2 Y 8 X -2 Y 7 X -5 Y 7 X -1 Y 7 X -3 Y 7 X -1 Y 7 X -3 Y 14 X -2 Y 15 X -2 Y 7 X -1 Y 7 X -1 Y 7 X -1 Y 7 X -1 Y 14 X -1 Y 7 X -1 Y 15 X -1 Y 14 X -1 Y 14 X -1 Y 7 X -1 Y
 29 X -1 Y 7 X -1 Y 7 X 1 Y 7 X -1 Y 14 X 1 Y 7 X -1 Y 29 X -1 Y 28 X -1 Y 7 X 1 Y 7 X -1 Y 7 X 1 Y 8 X -1 Y 49 X -1 Y 7 X 1 Y 8 X -1 Y 85 X -1 Y 7 X 1 Y 43 X -1 Y 7 X 1 Y 14 X -1 Y 14 X 1 Y 7 X -1 Y 413 X s 1 1 0 c 248 320 m20 256 320 m20 263 320
 m20 270 320 m20 277 320 m20 284 320 m20 291 320 m20 298 320 m20 305 320 m20 312 320 m20 320 320 m20 327 320 m20 334 320 m20 341 320 m20 348 320 m20 355 320 m20 362 320 m20 369 320 m20 376 320 m20 384 320 m20 391 320 m20 398 320 m20 405 320 m20 412
 322 m20 419 327 m20 426 335 m20 433 345 m20 440 354 m20 448 370 m20 455 386 m20 462 407 m20 469 431 m20 476 452 m20 483 482 m20 490 517 m20 497 549 m20 504 588 m20 512 624 m20 519 657 m20 526 715 m20 533 748 m20 540 793 m20 547 839 m20 554 885 m20
 561 932 m20 568 972 m20 576 1031 m20 583 1077 m20 590 1134 m20 597 1187 m20 604 1218 m20 611 1275 m20 618 1331 m20 625 1357 m20 632 1428 m20 640 1462 m20 647 1496 m20 654 1565 m20 661 1590 m20 668 1635 m20 675 1680 m20 682 1711 m20 689 1742 m20 696
 1773 m20 704 1799 m20 711 1833 m20 718 1836 m20 725 1855 m20 732 1868 m20 739 1868 m20 746 1866 m20 753 1872 m20 761 1854 m20 768 1856 m20 775 1841 m20 782 1826 m20 789 1811 m20 796 1798 m20 803 1762 m20 810 1714 m20 817 1681 m20 825 1632 m20 832
 1582 m20 839 1529 m20 846 1456 m20 853 1422 m20 860 1341 m20 867 1286 m20 874 1224 m20 881 1152 m20 889 1077 m20 896 1006 m20 903 936 m20 910 867 m20 917 794 m20 924 736 m20 931 673 m20 938 616 m20 945 561 m20 953 521 m20 960 487 m20 967 455 m20 974
 436 m20 981 415 m20 988 404 m20 995 395 m20 1002 384 m20 1009 377 m20 1017 372 m20 1024 366 m20 1031 361 m20 1038 356 m20 1045 354 m20 1052 352 m20 1059 347 m20 1066 346 m20 1073 343 m20 1081 342 m20 1088 339 m20 1095 339 m20 1102 337 m20 1109 337
 m20 1116 335 m20 1123 334 m20 1130 333 m20 1137 332 m20 1145 331 m20 1152 331 m20 1159 330 m20 1166 329 m20 1173 329 m20 1180 328 m20 1187 328 m20 1194 327 m20 1201 327 m20 1209 326 m20 1216 325 m20 1223 325 m20 1230 325 m20 1237 325 m20 1244 324
 m20 1251 323 m20 1258 324 m20 1265 323 m20 1273 323 m20 1280 324 m20 1287 323 m20 1294 323 m20 1301 323 m20 1308 323 m20 1315 322 m20 1322 322 m20 1329 322 m20 1337 322 m20 1344 321 m20 1351 322 m20 1358 321 m20 1365 322 m20 1372 321 m20 1379 321
 m20 1386 321 m20 1393 321 m20 1401 321 m20 1408 321 m20 1415 321 m20 1422 320 m20 1429 321 m20 1436 320 m20 1443 320 m20 1450 320 m20 1457 320 m20 1465 320 m20 1472 320 m20 1479 320 m20 1486 320 m20 1493 320 m20 1500 320 m20 1507 320 m20 1514 320
 m20 1521 319 m20 1529 320 m20 1536 320 m20 1543 320 m20 1550 320 m20 1557 320 m20 1564 320 m20 1571 319 m20 1578 320 m20 1585 320 m20 1593 319 m20 1600 319 m20 1607 320 m20 1614 319 m20 1621 319 m20 1628 319 m20 1635 319 m20 1642 319 m20 1649 319
 m20 1657 319 m20 1664 319 m20 1671 319 m20 1678 319 m20 1685 319 m20 1692 319 m20 1699 319 m20 1706 319 m20 1713 319 m20 1721 319 m20 1728 319 m20 1735 319 m20 1742 319 m20 1749 319 m20 1756 319 m20 1763 319 m20 1770 319 m20 1777 319 m20 1785 319
 m20 1792 319 m20 1799 319 m20 1806 319 m20 1813 319 m20 1820 319 m20 1827 319 m20 1834 319 m20 1841 319 m20 1849 319 m20 1856 319 m20 1863 319 m20 1870 319 m20 1877 319 m20 1884 319 m20 1891 319 m20 1898 319 m20 1905 319 m20 1913 319 m20 1920 319
 m20 1927 319 m20 1934 319 m20 1941 319 m20 1948 319 m20 1955 319 m20 1962 319 m20 1969 319 m20 1977 319 m20 1984 319 m20 1991 319 m20 1998 319 m20 2005 319 m20 2012 319 m20 2019 319 m20 0.8 0.8 0 c black 0.8 0.8 0 c cs 0.8 0.8 0 P13 setcolor 248 320
 m 157 X 7 3 d 7 5 d 7 8 d 7 10 d 7 9 d 8 16 d 7 16 d 7 22 d 7 24 d 7 22 d 7 30 d 7 35 d 7 32 d 7 40 d 8 36 d 7 33 d 7 58 d 7 34 d 7 44 d 7 47 d 7 46 d 7 48 d 7 40 d 8 59 d 7 46 d 7 57 d 7 53 d 7 32 d 7 56 d 7 57 d 7 26 d 7 71 d 8 35 d 7 33 d 7 69 d
 7 26 d 7 45 d 7 45 d 7 31 d 7 31 d 7 31 d 8 27 d 7 33 d 7 4 d 7 18 d 7 14 d 7 -1 d 7 -2 d 7 6 d 8 -18 d 7 2 d 7 -15 d 7 -15 d 7 -15 d 7 -14 d 7 -36 d 7 -48 d 7 -33 d 8 -49 d 7 -51 d 7 -53 d 7 -73 d 7 -34 d 7 -81 d 7 -55 d 7 -63 d 7 -72 d 8 -76 d 7
 -71 d 7 -70 d 7 -69 d 7 -74 d 7 -59 d 7 -63 d 7 -57 d 7 -55 d 8 -40 d 7 -35 d 7 -31 d 7 -19 d 7 -22 d 7 -11 d 7 -9 d 7 -11 d 7 -7 d 8 -5 d 7 -6 d 7 -5 d 7 -6 d 7 -1 d 7 -2 d 7 -5 d 7 -1 d 7 -3 d 8 -1 d 7 -3 d 7 X 7 -2 d 7 -1 d 7 -2 d 7 -1 d 7 -1 d 7
 X 8 -2 d 7 X 7 -1 d 7 -1 d 7 X 7 -1 d 14 X 7 -1 d 8 X 7 -1 d 7 X 7 -1 d 14 X 7 -1 d 14 X 8 -1 d 7 1 d 7 -1 d 21 X 7 -1 d 7 1 d 7 -1 d 36 X 7 -1 d 57 X 7 -1 d 14 X 7 1 d 8 -1 d 128 X 7 -1 d 7 1 d 7 -1 d 405 X -426 X -8 1 d -7 X -7 -1 d -7 1 d -7 -1 d
 -7 1 d -7 -1 d -7 1 d -7 X -8 -1 d -7 1 d -7 -1 d -7 1 d -64 X -7 1 d -7 -1 d -7 1 d -7 X -7 -1 d -8 1 d -56 X -8 1 d -14 X -7 1 d -7 -1 d -7 1 d -43 X -7 1 d -7 1 d -21 X -7 1 d -8 1 d -14 X -7 1 d -7 X -7 1 d -7 X -7 1 d -7 X -8 2 d -7 X -7 2 d -7
 X -7 2 d -7 1 d -7 2 d -7 X -7 2 d -8 2 d -7 3 d -7 1 d -7 4 d -7 3 d -7 1 d -7 6 d -7 4 d -7 6 d -8 5 d -7 7 d -7 11 d -7 9 d -7 10 d -7 22 d -7 19 d -7 31 d -7 34 d -8 40 d -7 54 d -7 57 d -7 63 d -7 58 d -7 73 d -7 68 d -7 70 d -7 71 d -8 75 d -7
 71 d -7 62 d -7 55 d -7 80 d -7 35 d -7 72 d -7 52 d -7 51 d -8 48 d -7 33 d -7 47 d -7 36 d -7 14 d -7 14 d -7 15 d -7 15 d -7 -2 d -8 18 d -7 -6 d -7 2 d -7 X -7 -13 d -7 -19 d -7 -3 d -7 -34 d -8 -27 d -7 -30 d -7 -31 d -7 -31 d -7 -45 d -7 -45 d
 -7 -25 d -7 -69 d -7 -33 d -8 -34 d -7 -71 d -7 -26 d -7 -56 d -7 -56 d -7 -31 d -7 -53 d -7 -56 d -7 -46 d -8 -59 d -7 -40 d -7 -46 d -7 -46 d -7 -47 d -7 -44 d -7 -33 d -7 -58 d -7 -32 d -8 -36 d -7 -39 d -7 -32 d -7 -34 d -7 -30 d -7 -21 d -7 -23
 d -7 -22 d -7 -15 d -8 -16 d -7 -9 d -7 -10 d -7 -7 d -7 -5 d -7 -2 d -157 X FA black 1 1 1 c black 245 320 m 163 X 2 Y 8 X 5 Y 7 X 6 Y 7 X 9 Y 7 X 11 Y 7 X 14 Y 7 X 14 Y 7 X 23 Y 7 X 22 Y 7 X 21 Y 8 X 29 Y 7 X 35 Y 7 X 33 Y 7 X 35 Y 7 X 37 Y 7 X 33
 Y 7 X 58 Y 7 X 37 Y 7 X 44 Y 8 X 51 Y 7 X 47 Y 7 X 52 Y 7 X 40 Y 7 X 62 Y 7 X 49 Y 7 X 58 Y 7 X 56 Y 7 X 30 Y 8 X 58 Y 7 X 56 Y 7 X 24 Y 7 X 71 Y 7 X 33 Y 7 X 34 Y 7 X 68 Y 7 X 24 Y 7 X 42 Y 8 X 46 Y 7 X 29 Y 7 X 29 Y 7 X 30 Y 7 X 26 Y 7 X 32 Y 7 X
 2 Y 7 X 16 Y 7 X 12 Y 8 X -2 Y 7 X -3 Y 7 X 4 Y 7 X -17 Y 7 X -3 Y 7 X -14 Y 7 X -20 Y 7 X -16 Y 8 X -15 Y 7 X -38 Y 7 X -49 Y 7 X -35 Y 7 X -49 Y 7 X -52 Y 7 X -53 Y 7 X -75 Y 7 X -37 Y 8 X -81 Y 7 X -56 Y 7 X -64 Y 7 X -71 Y 7 X -77 Y 7 X -70 Y 7
 X -71 Y 7 X -68 Y 7 X -72 Y 8 X -58 Y 7 X -63 Y 7 X -55 Y 7 X -53 Y 7 X -39 Y 7 X -33 Y 7 X -30 Y 7 X -18 Y 7 X -19 Y 8 X -10 Y 7 X -9 Y 7 X -9 Y 7 X -6 Y 7 X -4 Y 7 X -5 Y 7 X -4 Y 7 X -4 Y 7 X -2 Y 8 X -2 Y 7 X -3 Y 7 X -1 Y 7 X -2 Y 7 X -1 Y 7 X
 -2 Y 14 X -1 Y 7 X -1 Y 8 X -1 Y 14 X -1 Y 7 X -1 Y 21 X -1 Y 22 X -1 Y 28 X -1 Y 43 X -1 Y 199 X -1 Y 14 X 1 Y 562 X s 248 320 m20 256 320 m20 263 320 m20 270 320 m20 277 320 m20 284 320 m20 291 320 m20 298 320 m20 305 320 m20 312 320 m20 320 320
 m20 327 320 m20 334 320 m20 341 320 m20 348 320 m20 355 320 m20 362 320 m20 369 320 m20 376 320 m20 384 320 m20 391 320 m20 398 320 m20 405 320 m20 412 322 m20 419 327 m20 426 333 m20 433 342 m20 440 353 m20 448 367 m20 455 381 m20 462 404 m20 469
 426 m20 476 447 m20 483 476 m20 490 511 m20 497 544 m20 504 579 m20 512 616 m20 519 649 m20 526 707 m20 533 744 m20 540 788 m20 547 839 m20 554 886 m20 561 938 m20 568 978 m20 576 1040 m20 583 1089 m20 590 1147 m20 597 1203 m20 604 1233 m20 611 1291
 m20 618 1347 m20 625 1371 m20 632 1442 m20 640 1475 m20 647 1509 m20 654 1577 m20 661 1601 m20 668 1643 m20 675 1689 m20 682 1718 m20 689 1747 m20 696 1777 m20 704 1803 m20 711 1835 m20 718 1837 m20 725 1853 m20 732 1865 m20 739 1863 m20 746 1860
 m20 753 1864 m20 761 1847 m20 768 1844 m20 775 1830 m20 782 1810 m20 789 1794 m20 796 1779 m20 803 1741 m20 810 1692 m20 817 1657 m20 825 1608 m20 832 1556 m20 839 1503 m20 846 1428 m20 853 1391 m20 860 1310 m20 867 1254 m20 874 1190 m20 881 1119
 m20 889 1042 m20 896 972 m20 903 901 m20 910 833 m20 917 761 m20 924 703 m20 931 640 m20 938 585 m20 945 532 m20 953 493 m20 960 460 m20 967 430 m20 974 412 m20 981 393 m20 988 383 m20 995 374 m20 1002 365 m20 1009 359 m20 1017 355 m20 1024 350 m20
 1031 346 m20 1038 342 m20 1045 340 m20 1052 338 m20 1059 335 m20 1066 334 m20 1073 332 m20 1081 331 m20 1088 329 m20 1095 329 m20 1102 328 m20 1109 327 m20 1116 326 m20 1123 326 m20 1130 325 m20 1137 324 m20 1145 324 m20 1152 324 m20 1159 323 m20
 1166 323 m20 1173 323 m20 1180 322 m20 1187 322 m20 1194 322 m20 1201 322 m20 1209 321 m20 1216 321 m20 1223 321 m20 1230 321 m20 1237 321 m20 1244 321 m20 1251 320 m20 1258 320 m20 1265 320 m20 1273 320 m20 1280 320 m20 1287 320 m20 1294 320 m20
 1301 320 m20 1308 320 m20 1315 320 m20 1322 320 m20 1329 320 m20 1337 320 m20 1344 320 m20 1351 320 m20 1358 320 m20 1365 320 m20 1372 320 m20 1379 320 m20 1386 320 m20 1393 320 m20 1401 320 m20 1408 320 m20 1415 320 m20 1422 320 m20 1429 320 m20
 1436 320 m20 1443 320 m20 1450 319 m20 1457 319 m20 1465 320 m20 1472 320 m20 1479 320 m20 1486 320 m20 1493 320 m20 1500 320 m20 1507 320 m20 1514 320 m20 1521 320 m20 1529 320 m20 1536 320 m20 1543 320 m20 1550 320 m20 1557 320 m20 1564 320 m20
 1571 320 m20 1578 320 m20 1585 320 m20 1593 320 m20 1600 320 m20 1607 320 m20 1614 320 m20 1621 320 m20 1628 320 m20 1635 320 m20 1642 320 m20 1649 320 m20 1657 320 m20 1664 320 m20 1671 320 m20 1678 320 m20 1685 320 m20 1692 320 m20 1699 320 m20
 1706 320 m20 1713 320 m20 1721 320 m20 1728 320 m20 1735 320 m20 1742 320 m20 1749 320 m20 1756 320 m20 1763 320 m20 1770 320 m20 1777 320 m20 1785 320 m20 1792 320 m20 1799 320 m20 1806 320 m20 1813 320 m20 1820 320 m20 1827 320 m20 1834 320 m20
 1841 320 m20 1849 320 m20 1856 320 m20 1863 320 m20 1870 320 m20 1877 320 m20 1884 320 m20 1891 320 m20 1898 320 m20 1905 320 m20 1913 320 m20 1920 320 m20 1927 320 m20 1934 320 m20 1941 320 m20 1948 320 m20 1955 320 m20 1962 320 m20 1969 320 m20
 1977 320 m20 1984 320 m20 1991 320 m20 1998 320 m20 2005 320 m20 2012 320 m20 2019 320 m20 cs 0 0 0 P13 setcolor 248 320 m 157 X 7 2 d 7 5 d 7 7 d 7 8 d 7 12 d 8 15 d 7 14 d 7 23 d 7 21 d 7 22 d 7 29 d 7 36 d 7 33 d 7 36 d 8 37 d 7 33 d 7 58 d 7 38
 d 7 43 d 7 52 d 7 47 d 7 52 d 7 40 d 8 63 d 7 49 d 7 59 d 7 56 d 7 30 d 7 58 d 7 56 d 7 24 d 7 72 d 8 33 d 7 33 d 7 68 d 7 25 d 7 42 d 7 46 d 7 29 d 7 30 d 7 29 d 8 26 d 7 33 d 7 2 d 7 16 d 7 12 d 7 -3 d 7 -3 d 7 4 d 8 -17 d 7 -3 d 7 -14 d 7 -20 d 7
 -16 d 7 -15 d 7 -38 d 7 -50 d 7 -35 d 8 -50 d 7 -52 d 7 -53 d 7 -75 d 7 -38 d 7 -81 d 7 -56 d 7 -64 d 7 -72 d 8 -77 d 7 -70 d 7 -71 d 7 -69 d 7 -72 d 7 -59 d 7 -63 d 7 -55 d 7 -53 d 8 -39 d 7 -34 d 7 -30 d 7 -18 d 7 -19 d 7 -10 d 7 -9 d 7 -9 d 7 -7
 d 8 -4 d 7 -5 d 7 -4 d 7 -4 d 7 -2 d 7 -2 d 7 -3 d 7 X 7 -3 d 8 -1 d 7 -2 d 7 X 7 -1 d 7 -1 d 7 -1 d 7 X 7 -1 d 7 X 8 -1 d 7 X 7 -1 d 14 X 7 -1 d 21 X 8 -1 d 35 X 7 -1 d 199 X 7 -1 d 8 1 d 554 X -426 X -8 -1 d -7 1 d -57 X -7 -1 d -7 X -7 1 d -7 -1
 d -7 1 d -7 -1 d -7 X -7 1 d -8 -1 d -7 X -7 1 d -7 -1 d -7 1 d -7 X -7 -1 d -7 X -7 1 d -157 X -7 1 d -36 X -7 1 d -21 X -7 1 d -7 X -7 1 d -7 -1 d -8 1 d -7 1 d -7 X -7 1 d -7 1 d -7 X -7 2 d -7 X -7 2 d -8 1 d -7 2 d -7 1 d -7 3 d -7 1 d -7 2 d
 -7 4 d -7 4 d -7 5 d -8 4 d -7 7 d -7 8 d -7 9 d -7 10 d -7 19 d -7 18 d -7 29 d -7 34 d -8 39 d -7 52 d -7 55 d -7 62 d -7 59 d -7 71 d -7 68 d -7 70 d -7 70 d -8 77 d -7 71 d -7 63 d -7 56 d -7 80 d -7 37 d -7 75 d -7 52 d -7 52 d -8 49 d -7 35 d
 -7 49 d -7 38 d -7 14 d -7 17 d -7 19 d -7 14 d -7 3 d -8 17 d -7 -5 d -7 3 d -7 3 d -7 -12 d -7 -16 d -7 -2 d -7 -33 d -8 -25 d -7 -30 d -7 -29 d -7 -29 d -7 -46 d -7 -42 d -7 -24 d -7 -68 d -7 -33 d -8 -33 d -7 -72 d -7 -23 d -7 -56 d -7 -58 d -7
 -30 d -7 -55 d -7 -58 d -7 -49 d -8 -62 d -7 -40 d -7 -51 d -7 -47 d -7 -51 d -7 -43 d -7 -37 d -7 -57 d -7 -33 d -8 -37 d -7 -35 d -7 -33 d -7 -34 d -7 -29 d -7 -21 d -7 -21 d -7 -23 d -7 -14 d -8 -14 d -7 -11 d -7 -8 d -7 -7 d -7 -4 d -7 -2 d -157
 X FA 0.8 0 0 c 1 1 1 c 1 0 0 c 0.8 0 0 c 245 320 m 171 X 2 Y 7 X 3 Y 7 X 4 Y 7 X 4 Y 7 X 6 Y 7 X 7 Y 7 X 9 Y 7 X 10 Y 7 X 9 Y 8 X 13 Y 7 X 16 Y 7 X 14 Y 7 X 15 Y 7 X 18 Y 7 X 17 Y 7 X 22 Y 7 X 18 Y 7 X 21 Y 8 X 23 Y 7 X 22 Y 7 X 23 Y 7 X 19 Y 7 X 30
 Y 7 X 22 Y 7 X 28 Y 7 X 26 Y 7 X 18 Y 8 X 27 Y 7 X 28 Y 7 X 15 Y 7 X 35 Y 7 X 18 Y 7 X 16 Y 7 X 34 Y 7 X 14 Y 7 X 25 Y 8 X 21 Y 7 X 17 Y 7 X 17 Y 7 X 16 Y 7 X 14 Y 7 X 18 Y 7 X 2 Y 7 X 13 Y 7 X 8 Y 8 X 1 Y 7 X 1 Y 7 X 5 Y 7 X -9 Y 7 X 4 Y 7 X -7 Y 7
 X -3 Y 7 X -6 Y 8 X -5 Y 7 X -16 Y 7 X -21 Y 7 X -15 Y 7 X -22 Y 7 X -24 Y 7 X -25 Y 7 X -34 Y 7 X -14 Y 8 X -39 Y 7 X -26 Y 7 X -29 Y 7 X -36 Y 7 X -35 Y 7 X -36 Y 7 X -33 Y 7 X -33 Y 7 X -37 Y 8 X -30 Y 7 X -31 Y 7 X -29 Y 7 X -29 Y 7 X -20 Y 7 X
 -18 Y 7 X -17 Y 7 X -11 Y 7 X -12 Y 8 X -6 Y 7 X -5 Y 7 X -7 Y 7 X -4 Y 7 X -3 Y 7 X -4 Y 7 X -3 Y 7 X -4 Y 7 X -1 Y 8 X -1 Y 7 X -4 Y 14 X -3 Y 7 X -1 Y 7 X -2 Y 14 X -1 Y 7 X -1 Y 8 X -1 Y 7 X -1 Y 7 X -1 Y 14 X -2 Y 14 X -1 Y 22 X -1 Y 14 X -1 Y
 21 X -1 Y 14 X -1 Y 22 X -1 Y 21 X -1 Y 7 X 1 Y 7 X -1 Y 7 X 1 Y 7 X -1 Y 29 X -1 Y 43 X -1 Y 7 X 1 Y 14 X -1 Y 78 X -1 Y 149 X -1 Y 8 X 1 Y 7 X -1 Y 14 X 1 Y 7 X -1 Y 370 X s 1 0 0 c 248 320 m20 256 320 m20 263 320 m20 270 320 m20 277 320 m20 284
 320 m20 291 320 m20 298 320 m20 305 320 m20 312 320 m20 320 320 m20 327 320 m20 334 320 m20 341 320 m20 348 320 m20 355 320 m20 362 320 m20 369 320 m20 376 320 m20 384 320 m20 391 320 m20 398 320 m20 405 320 m20 412 320 m20 419 322 m20 426 325 m20
 433 329 m20 440 333 m20 448 339 m20 455 346 m20 462 355 m20 469 365 m20 476 374 m20 483 387 m20 490 403 m20 497 417 m20 504 432 m20 512 450 m20 519 467 m20 526 489 m20 533 507 m20 540 528 m20 547 551 m20 554 573 m20 561 596 m20 568 615 m20 576 645
 m20 583 667 m20 590 695 m20 597 721 m20 604 739 m20 611 766 m20 618 794 m20 625 809 m20 632 844 m20 640 862 m20 647 878 m20 654 912 m20 661 926 m20 668 951 m20 675 972 m20 682 989 m20 689 1006 m20 696 1022 m20 704 1036 m20 711 1054 m20 718 1056 m20
 725 1069 m20 732 1077 m20 739 1078 m20 746 1079 m20 753 1084 m20 761 1075 m20 768 1079 m20 775 1072 m20 782 1069 m20 789 1063 m20 796 1058 m20 803 1042 m20 810 1021 m20 817 1006 m20 825 984 m20 832 960 m20 839 935 m20 846 901 m20 853 887 m20 860 848
 m20 867 822 m20 874 793 m20 881 757 m20 889 722 m20 896 686 m20 903 653 m20 910 620 m20 917 583 m20 924 553 m20 931 522 m20 938 493 m20 945 464 m20 953 444 m20 960 426 m20 967 409 m20 974 398 m20 981 386 m20 988 380 m20 995 375 m20 1002 368 m20 1009
 364 m20 1017 361 m20 1024 357 m20 1031 354 m20 1038 350 m20 1045 349 m20 1052 348 m20 1059 344 m20 1066 344 m20 1073 341 m20 1081 340 m20 1088 338 m20 1095 338 m20 1102 337 m20 1109 336 m20 1116 335 m20 1123 334 m20 1130 333 m20 1137 333 m20 1145
 331 m20 1152 331 m20 1159 330 m20 1166 330 m20 1173 330 m20 1180 329 m20 1187 329 m20 1194 328 m20 1201 328 m20 1209 328 m20 1216 327 m20 1223 327 m20 1230 326 m20 1237 326 m20 1244 326 m20 1251 325 m20 1258 325 m20 1265 325 m20 1273 324 m20 1280
 325 m20 1287 324 m20 1294 325 m20 1301 324 m20 1308 324 m20 1315 324 m20 1322 324 m20 1329 323 m20 1337 323 m20 1344 323 m20 1351 323 m20 1358 323 m20 1365 323 m20 1372 322 m20 1379 323 m20 1386 323 m20 1393 322 m20 1401 322 m20 1408 322 m20 1415
 322 m20 1422 322 m20 1429 322 m20 1436 322 m20 1443 322 m20 1450 322 m20 1457 322 m20 1465 322 m20 1472 321 m20 1479 321 m20 1486 321 m20 1493 321 m20 1500 321 m20 1507 321 m20 1514 321 m20 1521 321 m20 1529 321 m20 1536 321 m20 1543 321 m20 1550
 321 m20 1557 321 m20 1564 321 m20 1571 321 m20 1578 321 m20 1585 321 m20 1593 321 m20 1600 321 m20 1607 321 m20 1614 321 m20 1621 320 m20 1628 321 m20 1635 320 m20 1642 320 m20 1649 321 m20 1657 320 m20 1664 320 m20 1671 320 m20 1678 320 m20 1685
 320 m20 1692 320 m20 1699 320 m20 1706 320 m20 1713 320 m20 1721 320 m20 1728 320 m20 1735 320 m20 1742 320 m20 1749 320 m20 1756 320 m20 1763 320 m20 1770 320 m20 1777 320 m20 1785 320 m20 1792 320 m20 1799 320 m20 1806 320 m20 1813 320 m20 1820
 320 m20 1827 320 m20 1834 320 m20 1841 320 m20 1849 320 m20 1856 320 m20 1863 320 m20 1870 320 m20 1877 320 m20 1884 320 m20 1891 320 m20 1898 320 m20 1905 320 m20 1913 320 m20 1920 320 m20 1927 320 m20 1934 320 m20 1941 320 m20 1948 320 m20 1955
 320 m20 1962 320 m20 1969 320 m20 1977 320 m20 1984 320 m20 1991 320 m20 1998 320 m20 2005 320 m20 2012 320 m20 2019 320 m20 0.8 0 0 c black 0.8 0 0 c cs 0.8 0 0 P13 setcolor 248 320 m 164 X 7 2 d 7 3 d 7 4 d 7 4 d 8 6 d 7 7 d 7 10 d 7 9 d 7 10 d 7
 13 d 7 16 d 7 14 d 7 15 d 8 19 d 7 16 d 7 22 d 7 19 d 7 21 d 7 23 d 7 22 d 7 23 d 7 19 d 8 30 d 7 23 d 7 28 d 7 26 d 7 18 d 7 27 d 7 28 d 7 15 d 7 35 d 8 18 d 7 16 d 7 35 d 7 14 d 7 24 d 7 22 d 7 17 d 7 17 d 7 16 d 8 14 d 7 18 d 7 2 d 7 13 d 7 8 d 7
 1 d 7 1 d 7 5 d 8 -9 d 7 4 d 7 -7 d 7 -3 d 7 -6 d 7 -5 d 7 -16 d 7 -22 d 7 -15 d 8 -22 d 7 -24 d 7 -25 d 7 -33 d 7 -15 d 7 -40 d 7 -25 d 7 -30 d 7 -35 d 8 -36 d 7 -35 d 7 -34 d 7 -33 d 7 -38 d 7 -29 d 7 -31 d 7 -30 d 7 -28 d 8 -21 d 7 -18 d 7 -17 d
 7 -11 d 7 -12 d 7 -6 d 7 -5 d 7 -7 d 7 -5 d 8 -3 d 7 -4 d 7 -3 d 7 -4 d 7 X 7 -2 d 7 -4 d 7 X 7 -2 d 8 -1 d 7 -3 d 7 1 d 7 -2 d 7 X 7 -2 d 7 X 7 -1 d 7 -1 d 8 -2 d 7 1 d 7 -1 d 7 X 7 -1 d 7 -1 d 21 X 8 -1 d 7 -1 d 14 X 7 -1 d 7 X 7 -1 d 43 X 7 -1 d
 28 X 8 -1 d 49 X 7 -1 d 8 X 7 1 d 7 -1 d 50 X 7 -1 d 7 1 d 7 -1 d 142 X 7 -1 d 7 1 d 15 X 7 -1 d 7 1 d 7 -1 d 341 X -398 X -7 1 d -7 -1 d -7 1 d -157 X -7 1 d -64 X -7 1 d -36 X -7 1 d -7 -1 d -7 1 d -21 X -7 1 d -7 -1 d -8 1 d -21 X -7 1 d -21 X -7
 1 d -8 1 d -7 X -7 1 d -14 X -7 1 d -7 X -7 1 d -7 X -8 1 d -7 1 d -7 1 d -7 X -7 2 d -7 X -7 2 d -7 -1 d -7 3 d -8 X -7 3 d -7 X -7 4 d -7 2 d -7 X -7 4 d -7 3 d -7 4 d -8 3 d -7 4 d -7 7 d -7 5 d -7 6 d -7 12 d -7 11 d -7 17 d -7 17 d -8 21 d -7
 28 d -7 30 d -7 31 d -7 29 d -7 37 d -7 33 d -7 33 d -7 36 d -8 35 d -7 35 d -7 29 d -7 26 d -7 39 d -7 14 d -7 34 d -7 24 d -7 24 d -8 22 d -7 15 d -7 21 d -7 17 d -7 4 d -7 6 d -7 3 d -7 7 d -7 -4 d -8 9 d -7 -5 d -7 -1 d -7 -1 d -7 -8 d -7 -13 d
 -7 -2 d -7 -18 d -8 -14 d -7 -16 d -7 -17 d -7 -17 d -7 -21 d -7 -24 d -7 -14 d -7 -35 d -7 -16 d -8 -17 d -7 -35 d -7 -15 d -7 -28 d -7 -27 d -7 -18 d -7 -25 d -7 -28 d -7 -22 d -8 -30 d -7 -19 d -7 -23 d -7 -22 d -7 -23 d -7 -20 d -7 -19 d -7 -21
 d -7 -17 d -8 -18 d -7 -15 d -7 -14 d -7 -15 d -7 -14 d -7 -9 d -7 -9 d -7 -10 d -7 -6 d -8 -7 d -7 -3 d -7 -4 d -7 -3 d -7 -2 d -164 X FA black 1 1 1 c 556 639 1578 1302 bf black 1578 1302 m 556 X s 2134 1302 m 639 Y s 2134 1941 m -556 X s 1578
 1941 m -639 Y s
 gsave  2222 2133 23 22 C 1716.93 1827.09 t 0 r /Helvetica findfont 95.0544 sf 0 0 m (No Int) show NC gr  0.8 0 0 c 1599 1861 m 97 X s black
 gsave  2222 2133 23 22 C 1716.93 1663.75 t 0 r /Helvetica findfont 95.0544 sf 0 0 m (Add) show NC gr  0.8 0.8 0 c 1599 1702 m 97 X s black
 gsave  2222 2133 23 22 C 1716.93 1504.21 t 0 r /Helvetica findfont 95.0544 sf 0 0 m (Mult) show NC gr  0.8 0 0.8 c 1599 1542 m 97 X s black
 gsave  2222 2133 23 22 C 1716.93 1344.68 t 0 r /Helvetica findfont 95.0544 sf 0 0 m (Central) show NC gr  1599 1382 m 97 X s
 gsave  2222 2133 23 22 C 2199.34 1568.79 t 90 r /Helvetica-BoldOblique findfont 38.0218 sf 0 0 m (LHC HIGGS XS WG 2013) show NC gr 
 gr  gr showpage
end
%%EOF
