%!PS-Adobe-3.0 EPSF-3.0
%%BoundingBox: (atend)
%%LanguageLevel: 2
%%Creator: Grace-5.1.22
%%CreationDate: Wed Apr  3 18:29:16 2013
%%DocumentData: Clean8Bit
%%Orientation: Portrait
%%Title: /home/pcl302a/heinemey/plot/grace/2012/lhc-higgs-br/tauphobic_tb50_BR-h0.grace
%%For: heinemey
%%DocumentNeededResources: (atend)
%%EndComments
%%BeginProlog
/m {moveto} def
/l {lineto} def
/s {stroke} def
/n {newpath} def
/c {closepath} def
/RL {rlineto} def
/SLW {setlinewidth} def
/GS {gsave} def
/GR {grestore} def
/SC {setcolor} def
/SGRY {setgray} def
/SRGB {setrgbcolor} def
/SD {setdash} def
/SLC {setlinecap} def
/SLJ {setlinejoin} def
/SCS {setcolorspace} def
/FFSF {findfont setfont} def
/CC {concat} def
/PXL {n m 0 0 RL s} def
/Color0 {1.0000 1.0000 1.0000} def
/Color1 {0.0000 0.0000 0.0000} def
/Color2 {1.0000 0.0000 0.0000} def
/Color3 {0.0000 1.0000 0.0000} def
/Color4 {0.0000 0.0000 1.0000} def
/Color5 {1.0000 1.0000 0.0000} def
/Color6 {0.7373 0.5608 0.5608} def
/Color7 {0.8627 0.8627 0.8627} def
/Color8 {0.5804 0.0000 0.8275} def
/Color9 {0.0000 1.0000 1.0000} def
/Color10 {1.0000 0.0000 1.0000} def
/Color11 {1.0000 0.6471 0.0000} def
/Color12 {0.4471 0.1294 0.7373} def
/Color13 {0.4039 0.0275 0.2824} def
/Color14 {0.2510 0.8784 0.8157} def
/Color15 {0.0000 0.5451 0.0000} def
/Color16 {0.7529 0.7529 0.7529} def
/Color17 {0.5059 0.5059 0.5059} def
/Color18 {0.2588 0.2588 0.2588} def
/PTRN {
 /pat_bits exch def 
 <<
  /PaintType 2
  /PatternType 1 /TilingType 1
  /BBox[0 0 16 16]
  /XStep 16 /YStep 16
  /PaintProc {
   pop
   16 16 true [-1 0 0 -1 16 16] pat_bits imagemask
  }
 >>
 [0.0016 0 0 0.0016 0 0]
 makepattern
} def
/Pattern0 {<0000000000000000000000000000000000000000000000000000000000000000> PTRN} bind def
/Pattern1 {<ffffffffffffffffffffffffffffffffffffffffffffffffffffffffffffffff> PTRN} bind def
/Pattern2 {<eeeeffffbbbbffffeeeeffffbbbbffffeeeeffffbbbbffffeeeeffffbbbbffff> PTRN} bind def
/Pattern3 {<eeeebbbbeeeebbbbeeeebbbbeeeebbbbeeeebbbbeeeebbbbeeeebbbbeeeebbbb> PTRN} bind def
/Pattern4 {<5555aaaa5555aaaa5555aaaa5555aaaa5555aaaa5555aaaa5555aaaa5555aaaa> PTRN} bind def
/Pattern5 {<1111444411114444111144441111444411114444111144441111444411114444> PTRN} bind def
/Pattern6 {<1111000044440000111100004444000011110000444400001111000044440000> PTRN} bind def
/Pattern7 {<1010000000000000010100000000000010100000000000000101000000000000> PTRN} bind def
/Pattern8 {<0000000000000000000000000000000000000000000000000000000000000000> PTRN} bind def
/Pattern9 {<1e1e0f0f8787c3c3e1e1f0f078783c3c1e1e0f0f8787c3c3e1e1f0f078783c3c> PTRN} bind def
/Pattern10 {<7878f0f0e1e1c3c387870f0f1e1e3c3c7878f0f0e1e1c3c387870f0f1e1e3c3c> PTRN} bind def
/Pattern11 {<3333333333333333333333333333333333333333333333333333333333333333> PTRN} bind def
/Pattern12 {<ffffffff00000000ffffffff00000000ffffffff00000000ffffffff00000000> PTRN} bind def
/Pattern13 {<8181424224241818181824244242818181814242242418181818242442428181> PTRN} bind def
/Pattern14 {<8080404020201010080804040202010180804040202010100808040402020101> PTRN} bind def
/Pattern15 {<0101020204040808101020204040808001010202040408081010202040408080> PTRN} bind def
/Pattern16 {<2222222222222222222222222222222222222222222222222222222222222222> PTRN} bind def
/Pattern17 {<0000ffff000000000000ffff000000000000ffff000000000000ffff00000000> PTRN} bind def
/Pattern18 {<2222ffff222222222222ffff222222222222ffff222222222222ffff22222222> PTRN} bind def
/Pattern19 {<ffffffff33333333ffffffff33333333ffffffff33333333ffffffff33333333> PTRN} bind def
/Pattern20 {<0f0f0f0f0f0f0f0ff0f0f0f0f0f0f0f00f0f0f0f0f0f0f0ff0f0f0f0f0f0f0f0> PTRN} bind def
/Pattern21 {<ff00ff00ff00ff00ff00ff00ff00ff0000ff00ff00ff00ff00ff00ff00ff00ff> PTRN} bind def
/Pattern22 {<8001800180018001800180018001ffffffff8001800180018001800180018001> PTRN} bind def
/Pattern23 {<c003c003c003c003c003c003ffffffffffffffffc003c003c003c003c003c003> PTRN} bind def
/Pattern24 {<040404040404ffff404040404040ffff040404040404ffff404040404040ffff> PTRN} bind def
/Pattern25 {<180018001800180018001800ffffffff001800180018001800180018ffffffff> PTRN} bind def
/Pattern26 {<1111b8b87c7c3a3a1111a3a3c7c78b8b1111b8b87c7c3a3a1111a3a3c7c78b8b> PTRN} bind def
/Pattern27 {<101010102828c7c70101010182827c7c101010102828c7c70101010182827c7c> PTRN} bind def
/Pattern28 {<1c1c121211112121c1c12121111112121c1c121211112121c1c1212111111212> PTRN} bind def
/Pattern29 {<3e3e414180808080e3e31414080808083e3e414180808080e3e3141408080808> PTRN} bind def
/Pattern30 {<4848888884848383848488884848383848488888848483838484888848483838> PTRN} bind def
/Pattern31 {<03030404080808080c0c12122121c0c003030404080808080c0c12122121c0c0> PTRN} bind def
/ellipsedict 8 dict def
ellipsedict /mtrx matrix put
/EARC {
 ellipsedict begin
  /endangle exch def
  /startangle exch def
  /yrad exch def
  /xrad exch def
  /y exch def
  /x exch def
  /savematrix mtrx currentmatrix def
  x y translate
  xrad yrad scale
  0 0 1 startangle endangle arc
  savematrix setmatrix
 end
} def
/TL {
  /kcomp exch def
  /linewidth exch def
  /offset exch def
  GS
  0 offset rmoveto
  linewidth SLW
  dup stringwidth exch kcomp add exch RL s
  GR
} def
/KINIT
{
 /kvector exch def
 /kid 0 def
} def
/KPROC
{
 pop pop
 kvector kid get
 0 rmoveto
 /kid 1 kid add def
} def
/DefEncoding [
 /.notdef
 /.notdef
 /.notdef
 /.notdef
 /.notdef
 /.notdef
 /.notdef
 /.notdef
 /.notdef
 /.notdef
 /.notdef
 /.notdef
 /.notdef
 /.notdef
 /.notdef
 /.notdef
 /.notdef
 /.notdef
 /.notdef
 /.notdef
 /.notdef
 /.notdef
 /.notdef
 /.notdef
 /.notdef
 /.notdef
 /.notdef
 /.notdef
 /.notdef
 /.notdef
 /.notdef
 /.notdef
 /space
 /exclam
 /quotedbl
 /numbersign
 /dollar
 /percent
 /ampersand
 /quoteright
 /parenleft
 /parenright
 /asterisk
 /plus
 /comma
 /hyphen
 /period
 /slash
 /zero
 /one
 /two
 /three
 /four
 /five
 /six
 /seven
 /eight
 /nine
 /colon
 /semicolon
 /less
 /equal
 /greater
 /question
 /at
 /A
 /B
 /C
 /D
 /E
 /F
 /G
 /H
 /I
 /J
 /K
 /L
 /M
 /N
 /O
 /P
 /Q
 /R
 /S
 /T
 /U
 /V
 /W
 /X
 /Y
 /Z
 /bracketleft
 /backslash
 /bracketright
 /asciicircum
 /underscore
 /grave
 /a
 /b
 /c
 /d
 /e
 /f
 /g
 /h
 /i
 /j
 /k
 /l
 /m
 /n
 /o
 /p
 /q
 /r
 /s
 /t
 /u
 /v
 /w
 /x
 /y
 /z
 /braceleft
 /bar
 /braceright
 /asciitilde
 /.notdef
 /.notdef
 /.notdef
 /.notdef
 /.notdef
 /.notdef
 /.notdef
 /.notdef
 /.notdef
 /.notdef
 /.notdef
 /.notdef
 /.notdef
 /.notdef
 /.notdef
 /.notdef
 /.notdef
 /.notdef
 /.notdef
 /.notdef
 /.notdef
 /.notdef
 /.notdef
 /.notdef
 /.notdef
 /.notdef
 /.notdef
 /.notdef
 /.notdef
 /.notdef
 /.notdef
 /.notdef
 /.notdef
 /space
 /exclamdown
 /cent
 /sterling
 /currency
 /yen
 /brokenbar
 /section
 /dieresis
 /copyright
 /ordfeminine
 /guillemotleft
 /logicalnot
 /hyphen
 /registered
 /macron
 /degree
 /plusminus
 /twosuperior
 /threesuperior
 /acute
 /mu
 /paragraph
 /periodcentered
 /cedilla
 /onesuperior
 /ordmasculine
 /guillemotright
 /onequarter
 /onehalf
 /threequarters
 /questiondown
 /Agrave
 /Aacute
 /Acircumflex
 /Atilde
 /Adieresis
 /Aring
 /AE
 /Ccedilla
 /Egrave
 /Eacute
 /Ecircumflex
 /Edieresis
 /Igrave
 /Iacute
 /Icircumflex
 /Idieresis
 /Eth
 /Ntilde
 /Ograve
 /Oacute
 /Ocircumflex
 /Otilde
 /Odieresis
 /multiply
 /Oslash
 /Ugrave
 /Uacute
 /Ucircumflex
 /Udieresis
 /Yacute
 /Thorn
 /germandbls
 /agrave
 /aacute
 /acircumflex
 /atilde
 /adieresis
 /aring
 /ae
 /ccedilla
 /egrave
 /eacute
 /ecircumflex
 /edieresis
 /igrave
 /iacute
 /icircumflex
 /idieresis
 /eth
 /ntilde
 /ograve
 /oacute
 /ocircumflex
 /otilde
 /odieresis
 /divide
 /oslash
 /ugrave
 /uacute
 /ucircumflex
 /udieresis
 /yacute
 /thorn
 /ydieresis
] def
%%EndProlog
%%BeginSetup
%%EndSetup
612.00 612.00 scale
[/DeviceRGB] SCS
Color2 SC
[] 0 SD
0.0045 SLW
0 SLC
0 SLJ
n
0.1500 0.8856 m
0.1516 0.8856 l
0.1531 0.8856 l
0.1547 0.8856 l
0.1563 0.8855 l
0.1578 0.8855 l
0.1594 0.8855 l
0.1610 0.8854 l
0.1625 0.8854 l
0.1641 0.8854 l
0.1657 0.8854 l
0.1673 0.8853 l
0.1688 0.8853 l
0.1704 0.8853 l
0.1720 0.8853 l
0.1735 0.8852 l
0.1751 0.8852 l
0.1767 0.8852 l
0.1782 0.8852 l
0.1798 0.8852 l
0.1814 0.8851 l
0.1829 0.8851 l
0.1845 0.8851 l
0.1861 0.8851 l
0.1876 0.8850 l
0.1892 0.8850 l
0.1908 0.8850 l
0.1924 0.8850 l
0.1939 0.8850 l
0.1955 0.8849 l
0.1971 0.8849 l
0.1986 0.8849 l
0.2002 0.8849 l
0.2018 0.8848 l
0.2033 0.8848 l
0.2049 0.8847 l
0.2065 0.8843 l
0.2080 0.8773 l
0.2096 0.8037 l
0.2112 0.8970 l
0.2127 0.8969 l
0.2143 0.8958 l
0.2159 0.8944 l
0.2175 0.8928 l
0.2190 0.8911 l
0.2206 0.8895 l
0.2222 0.8880 l
0.2237 0.8865 l
0.2253 0.8851 l
0.2269 0.8838 l
0.2284 0.8825 l
0.2300 0.8813 l
0.2316 0.8802 l
0.2331 0.8792 l
0.2347 0.8782 l
0.2363 0.8772 l
0.2378 0.8764 l
0.2394 0.8755 l
0.2410 0.8747 l
0.2425 0.8740 l
0.2441 0.8733 l
0.2457 0.8726 l
0.2473 0.8720 l
0.2488 0.8714 l
0.2504 0.8708 l
0.2520 0.8703 l
0.2535 0.8697 l
0.2551 0.8692 l
0.2567 0.8688 l
0.2582 0.8683 l
0.2598 0.8679 l
0.2614 0.8675 l
0.2629 0.8671 l
0.2645 0.8667 l
0.2661 0.8663 l
0.2676 0.8660 l
0.2692 0.8656 l
0.2708 0.8653 l
0.2724 0.8650 l
0.2739 0.8647 l
0.2755 0.8644 l
0.2771 0.8641 l
0.2786 0.8639 l
0.2802 0.8636 l
0.2818 0.8634 l
0.2833 0.8631 l
0.2849 0.8629 l
0.2865 0.8627 l
0.2880 0.8625 l
0.2896 0.8622 l
0.2912 0.8620 l
0.2927 0.8619 l
0.2943 0.8617 l
0.2959 0.8615 l
0.2975 0.8613 l
0.2990 0.8611 l
0.3006 0.8610 l
0.3022 0.8608 l
0.3037 0.8606 l
0.3053 0.8605 l
0.3069 0.8603 l
0.3084 0.8602 l
0.3100 0.8601 l
0.3116 0.8599 l
0.3131 0.8598 l
0.3147 0.8597 l
0.3163 0.8595 l
0.3178 0.8594 l
0.3194 0.8593 l
0.3210 0.8592 l
0.3225 0.8591 l
0.3241 0.8590 l
0.3257 0.8589 l
0.3273 0.8587 l
0.3288 0.8586 l
0.3304 0.8585 l
0.3320 0.8584 l
0.3335 0.8584 l
0.3351 0.8583 l
0.3367 0.8582 l
0.3382 0.8581 l
0.3398 0.8580 l
0.3414 0.8580 l
0.3429 0.8579 l
0.3445 0.8578 l
0.3461 0.8577 l
0.3476 0.8577 l
0.3492 0.8576 l
0.3508 0.8575 l
0.3524 0.8574 l
0.3539 0.8574 l
0.3555 0.8573 l
0.3571 0.8572 l
0.3586 0.8572 l
0.3602 0.8571 l
0.3618 0.8570 l
0.3633 0.8570 l
0.3649 0.8569 l
0.3665 0.8569 l
0.3680 0.8568 l
0.3696 0.8567 l
0.3712 0.8567 l
0.3727 0.8566 l
0.3743 0.8566 l
0.3759 0.8565 l
0.3775 0.8564 l
0.3790 0.8564 l
0.3806 0.8563 l
0.3822 0.8563 l
0.3837 0.8562 l
0.3853 0.8562 l
0.3869 0.8561 l
0.3884 0.8561 l
0.3900 0.8560 l
0.3916 0.8560 l
0.3931 0.8559 l
0.3947 0.8559 l
0.3963 0.8558 l
0.3978 0.8558 l
0.3994 0.8558 l
0.4010 0.8557 l
0.4025 0.8557 l
0.4041 0.8556 l
0.4057 0.8556 l
0.4073 0.8555 l
0.4088 0.8555 l
0.4104 0.8555 l
0.4120 0.8554 l
0.4135 0.8554 l
0.4151 0.8554 l
0.4167 0.8553 l
0.4182 0.8553 l
0.4198 0.8552 l
0.4214 0.8552 l
0.4229 0.8552 l
0.4245 0.8551 l
0.4261 0.8551 l
0.4276 0.8551 l
0.4292 0.8550 l
0.4308 0.8550 l
0.4324 0.8550 l
0.4339 0.8549 l
0.4355 0.8549 l
0.4371 0.8549 l
0.4386 0.8549 l
0.4402 0.8548 l
0.4418 0.8548 l
0.4433 0.8548 l
0.4449 0.8547 l
0.4465 0.8547 l
0.4480 0.8547 l
0.4496 0.8547 l
0.4512 0.8546 l
0.4527 0.8546 l
0.4543 0.8546 l
0.4559 0.8546 l
0.4575 0.8545 l
0.4590 0.8545 l
0.4606 0.8545 l
0.4622 0.8545 l
0.4637 0.8544 l
0.4653 0.8544 l
0.4669 0.8544 l
0.4684 0.8544 l
0.4700 0.8543 l
0.4716 0.8543 l
0.4731 0.8543 l
0.4747 0.8543 l
0.4763 0.8543 l
0.4778 0.8542 l
0.4794 0.8542 l
0.4810 0.8542 l
0.4825 0.8542 l
0.4841 0.8541 l
0.4857 0.8541 l
0.4873 0.8541 l
0.4888 0.8541 l
0.4904 0.8541 l
0.4920 0.8540 l
0.4935 0.8540 l
0.4951 0.8540 l
0.4967 0.8540 l
0.4982 0.8540 l
0.4998 0.8540 l
0.5014 0.8539 l
0.5029 0.8539 l
0.5045 0.8539 l
0.5061 0.8539 l
0.5076 0.8539 l
0.5092 0.8538 l
0.5108 0.8538 l
0.5124 0.8538 l
0.5139 0.8538 l
0.5155 0.8538 l
0.5171 0.8538 l
0.5186 0.8538 l
0.5202 0.8537 l
0.5218 0.8537 l
0.5233 0.8537 l
0.5249 0.8537 l
0.5265 0.8537 l
0.5280 0.8537 l
0.5296 0.8536 l
0.5312 0.8536 l
0.5327 0.8536 l
0.5343 0.8536 l
0.5359 0.8536 l
0.5375 0.8536 l
0.5390 0.8536 l
0.5406 0.8535 l
0.5422 0.8535 l
0.5437 0.8535 l
0.5453 0.8535 l
0.5469 0.8535 l
0.5484 0.8535 l
0.5502 0.8535 l
0.5516 0.8535 l
0.5531 0.8534 l
0.5547 0.8534 l
0.5563 0.8534 l
0.5578 0.8534 l
0.5594 0.8534 l
0.5610 0.8534 l
0.5625 0.8534 l
0.5641 0.8534 l
0.5657 0.8533 l
0.5673 0.8533 l
0.5688 0.8533 l
0.5704 0.8533 l
0.5720 0.8533 l
0.5735 0.8533 l
0.5751 0.8533 l
0.5767 0.8533 l
0.5782 0.8533 l
0.5798 0.8532 l
0.5814 0.8532 l
0.5829 0.8532 l
0.5845 0.8532 l
0.5861 0.8532 l
0.5876 0.8532 l
0.5892 0.8532 l
0.5908 0.8532 l
0.5924 0.8532 l
0.5939 0.8532 l
0.5955 0.8531 l
0.5971 0.8531 l
0.5986 0.8531 l
0.6002 0.8531 l
0.6018 0.8531 l
0.6033 0.8531 l
0.6049 0.8531 l
0.6065 0.8531 l
0.6080 0.8531 l
0.6096 0.8531 l
0.6112 0.8531 l
0.6127 0.8530 l
0.6143 0.8530 l
0.6159 0.8530 l
0.6175 0.8530 l
0.6190 0.8530 l
0.6206 0.8530 l
0.6222 0.8530 l
0.6237 0.8530 l
0.6253 0.8530 l
0.6269 0.8530 l
0.6284 0.8530 l
0.6300 0.8529 l
0.6316 0.8529 l
0.6331 0.8529 l
0.6347 0.8529 l
0.6363 0.8529 l
0.6378 0.8529 l
0.6394 0.8529 l
0.6410 0.8529 l
0.6425 0.8529 l
0.6441 0.8529 l
0.6457 0.8529 l
0.6473 0.8529 l
0.6488 0.8529 l
0.6504 0.8529 l
0.6520 0.8528 l
0.6535 0.8528 l
0.6551 0.8528 l
0.6567 0.8528 l
0.6582 0.8528 l
0.6598 0.8528 l
0.6614 0.8528 l
0.6629 0.8528 l
0.6645 0.8528 l
0.6661 0.8528 l
0.6676 0.8528 l
0.6692 0.8528 l
0.6708 0.8528 l
0.6724 0.8528 l
0.6739 0.8528 l
0.6755 0.8527 l
0.6771 0.8527 l
0.6786 0.8527 l
0.6802 0.8527 l
0.6818 0.8527 l
0.6833 0.8527 l
0.6849 0.8527 l
0.6865 0.8527 l
0.6880 0.8527 l
0.6896 0.8527 l
0.6912 0.8527 l
0.6927 0.8527 l
0.6943 0.8527 l
0.6959 0.8527 l
0.6975 0.8527 l
0.6990 0.8527 l
0.7006 0.8527 l
0.7022 0.8527 l
0.7037 0.8526 l
0.7053 0.8526 l
0.7069 0.8526 l
0.7084 0.8526 l
0.7100 0.8526 l
0.7116 0.8526 l
0.7131 0.8526 l
0.7147 0.8526 l
0.7163 0.8526 l
0.7178 0.8526 l
0.7194 0.8526 l
0.7210 0.8526 l
0.7225 0.8526 l
0.7241 0.8526 l
0.7257 0.8526 l
0.7273 0.8526 l
0.7288 0.8526 l
0.7304 0.8526 l
0.7320 0.8526 l
0.7335 0.8525 l
0.7351 0.8525 l
0.7367 0.8525 l
0.7382 0.8525 l
0.7398 0.8525 l
0.7414 0.8525 l
0.7429 0.8525 l
0.7445 0.8525 l
0.7461 0.8525 l
0.7476 0.8525 l
0.7492 0.8525 l
0.7508 0.8525 l
0.7524 0.8525 l
0.7539 0.8525 l
0.7555 0.8525 l
0.7571 0.8525 l
0.7586 0.8525 l
0.7602 0.8525 l
0.7618 0.8525 l
0.7633 0.8525 l
0.7649 0.8525 l
0.7665 0.8525 l
0.7680 0.8525 l
0.7696 0.8524 l
0.7712 0.8524 l
0.7727 0.8524 l
0.7743 0.8524 l
0.7759 0.8524 l
0.7775 0.8524 l
0.7790 0.8524 l
0.7806 0.8524 l
0.7822 0.8524 l
0.7837 0.8524 l
0.7853 0.8524 l
0.7869 0.8524 l
0.7884 0.8524 l
0.7900 0.8524 l
0.7916 0.8524 l
0.7931 0.8524 l
0.7947 0.8524 l
0.7963 0.8524 l
0.7978 0.8524 l
0.7994 0.8524 l
0.8010 0.8524 l
0.8025 0.8524 l
0.8041 0.8524 l
0.8057 0.8524 l
0.8073 0.8524 l
0.8088 0.8524 l
0.8104 0.8524 l
0.8120 0.8523 l
0.8135 0.8523 l
0.8151 0.8523 l
0.8167 0.8523 l
0.8182 0.8523 l
0.8198 0.8523 l
0.8214 0.8523 l
0.8229 0.8523 l
0.8245 0.8523 l
0.8261 0.8523 l
0.8276 0.8523 l
0.8292 0.8523 l
0.8308 0.8523 l
0.8324 0.8523 l
0.8339 0.8523 l
0.8355 0.8523 l
0.8371 0.8523 l
0.8386 0.8523 l
0.8402 0.8523 l
0.8418 0.8523 l
0.8433 0.8523 l
0.8449 0.8523 l
0.8465 0.8523 l
0.8480 0.8523 l
0.8496 0.8523 l
0.8512 0.8523 l
0.8527 0.8523 l
0.8543 0.8523 l
0.8559 0.8523 l
0.8575 0.8523 l
0.8590 0.8523 l
0.8606 0.8523 l
0.8622 0.8522 l
0.8637 0.8522 l
0.8653 0.8522 l
0.8669 0.8522 l
0.8684 0.8522 l
0.8700 0.8522 l
0.8716 0.8522 l
0.8731 0.8522 l
0.8747 0.8522 l
0.8763 0.8522 l
0.8778 0.8522 l
0.8794 0.8522 l
0.8810 0.8522 l
0.8825 0.8522 l
0.8841 0.8522 l
0.8857 0.8522 l
0.8873 0.8522 l
0.8888 0.8522 l
0.8904 0.8522 l
0.8920 0.8522 l
0.8935 0.8522 l
0.8951 0.8522 l
0.8967 0.8522 l
0.8982 0.8522 l
0.8998 0.8522 l
0.9014 0.8522 l
0.9029 0.8522 l
0.9045 0.8522 l
0.9061 0.8522 l
0.9076 0.8522 l
0.9092 0.8522 l
0.9108 0.8522 l
0.9124 0.8522 l
0.9139 0.8522 l
0.9155 0.8522 l
0.9171 0.8522 l
0.9186 0.8522 l
0.9202 0.8522 l
0.9218 0.8522 l
0.9233 0.8521 l
0.9249 0.8521 l
0.9265 0.8521 l
0.9280 0.8521 l
0.9296 0.8521 l
0.9312 0.8521 l
0.9327 0.8521 l
0.9343 0.8521 l
0.9359 0.8521 l
0.9375 0.8521 l
0.9390 0.8521 l
0.9406 0.8521 l
0.9422 0.8521 l
0.9437 0.8521 l
0.9453 0.8521 l
0.9469 0.8521 l
0.9484 0.8521 l
0.9500 0.8521 l
s
[/DeviceRGB] SCS
Color3 SC
n
0.2096 0.1499 m
0.2096 0.1542 l
0.2112 0.3487 l
0.2127 0.4044 l
0.2143 0.4401 l
0.2159 0.4652 l
0.2175 0.4838 l
0.2190 0.4983 l
0.2206 0.5099 l
0.2222 0.5194 l
0.2237 0.5272 l
0.2253 0.5339 l
0.2269 0.5396 l
0.2284 0.5445 l
0.2300 0.5488 l
0.2316 0.5525 l
0.2331 0.5559 l
0.2347 0.5588 l
0.2363 0.5615 l
0.2378 0.5639 l
0.2394 0.5661 l
0.2410 0.5681 l
0.2425 0.5699 l
0.2441 0.5716 l
0.2457 0.5731 l
0.2473 0.5745 l
0.2488 0.5758 l
0.2504 0.5770 l
0.2520 0.5782 l
0.2535 0.5792 l
0.2551 0.5802 l
0.2567 0.5811 l
0.2582 0.5820 l
0.2598 0.5828 l
0.2614 0.5836 l
0.2629 0.5843 l
0.2645 0.5850 l
0.2661 0.5857 l
0.2676 0.5863 l
0.2692 0.5869 l
0.2708 0.5874 l
0.2724 0.5879 l
0.2739 0.5884 l
0.2755 0.5889 l
0.2771 0.5894 l
0.2786 0.5898 l
0.2802 0.5902 l
0.2818 0.5906 l
0.2833 0.5910 l
0.2849 0.5914 l
0.2865 0.5917 l
0.2880 0.5921 l
0.2896 0.5924 l
0.2912 0.5927 l
0.2927 0.5930 l
0.2943 0.5933 l
0.2959 0.5936 l
0.2975 0.5938 l
0.2990 0.5941 l
0.3006 0.5943 l
0.3022 0.5946 l
0.3037 0.5948 l
0.3053 0.5950 l
0.3069 0.5953 l
0.3084 0.5955 l
0.3100 0.5957 l
0.3116 0.5959 l
0.3131 0.5961 l
0.3147 0.5962 l
0.3163 0.5964 l
0.3178 0.5966 l
0.3194 0.5968 l
0.3210 0.5969 l
0.3225 0.5971 l
0.3241 0.5973 l
0.3257 0.5974 l
0.3273 0.5976 l
0.3288 0.5977 l
0.3304 0.5978 l
0.3320 0.5980 l
0.3335 0.5981 l
0.3351 0.5982 l
0.3367 0.5983 l
0.3382 0.5984 l
0.3398 0.5985 l
0.3414 0.5986 l
0.3429 0.5987 l
0.3445 0.5988 l
0.3461 0.5989 l
0.3476 0.5990 l
0.3492 0.5991 l
0.3508 0.5992 l
0.3524 0.5993 l
0.3539 0.5994 l
0.3555 0.5995 l
0.3571 0.5996 l
0.3586 0.5996 l
0.3602 0.5997 l
0.3618 0.5998 l
0.3633 0.5999 l
0.3649 0.6000 l
0.3665 0.6001 l
0.3680 0.6001 l
0.3696 0.6002 l
0.3712 0.6003 l
0.3727 0.6004 l
0.3743 0.6004 l
0.3759 0.6005 l
0.3775 0.6005 l
0.3790 0.6006 l
0.3806 0.6007 l
0.3822 0.6007 l
0.3837 0.6008 l
0.3853 0.6008 l
0.3869 0.6009 l
0.3884 0.6010 l
0.3900 0.6010 l
0.3916 0.6011 l
0.3931 0.6011 l
0.3947 0.6012 l
0.3963 0.6012 l
0.3978 0.6013 l
0.3994 0.6013 l
0.4010 0.6014 l
0.4025 0.6014 l
0.4041 0.6015 l
0.4057 0.6015 l
0.4073 0.6016 l
0.4088 0.6016 l
0.4104 0.6017 l
0.4120 0.6017 l
0.4135 0.6018 l
0.4151 0.6018 l
0.4167 0.6019 l
0.4182 0.6019 l
0.4198 0.6019 l
0.4214 0.6020 l
0.4229 0.6020 l
0.4245 0.6021 l
0.4261 0.6021 l
0.4276 0.6021 l
0.4292 0.6022 l
0.4308 0.6022 l
0.4324 0.6022 l
0.4339 0.6023 l
0.4355 0.6023 l
0.4371 0.6024 l
0.4386 0.6024 l
0.4402 0.6024 l
0.4418 0.6025 l
0.4433 0.6025 l
0.4449 0.6025 l
0.4465 0.6026 l
0.4480 0.6026 l
0.4496 0.6026 l
0.4512 0.6027 l
0.4527 0.6027 l
0.4543 0.6027 l
0.4559 0.6027 l
0.4575 0.6028 l
0.4590 0.6028 l
0.4606 0.6028 l
0.4622 0.6029 l
0.4637 0.6029 l
0.4653 0.6029 l
0.4669 0.6029 l
0.4684 0.6030 l
0.4700 0.6030 l
0.4716 0.6030 l
0.4731 0.6030 l
0.4747 0.6031 l
0.4763 0.6031 l
0.4778 0.6031 l
0.4794 0.6031 l
0.4810 0.6032 l
0.4825 0.6032 l
0.4841 0.6032 l
0.4857 0.6032 l
0.4873 0.6033 l
0.4888 0.6033 l
0.4904 0.6033 l
0.4920 0.6033 l
0.4935 0.6034 l
0.4951 0.6034 l
0.4967 0.6034 l
0.4982 0.6034 l
0.4998 0.6034 l
0.5014 0.6035 l
0.5029 0.6035 l
0.5045 0.6035 l
0.5061 0.6035 l
0.5076 0.6035 l
0.5092 0.6036 l
0.5108 0.6036 l
0.5124 0.6036 l
0.5139 0.6036 l
0.5155 0.6036 l
0.5171 0.6037 l
0.5186 0.6037 l
0.5202 0.6037 l
0.5218 0.6037 l
0.5233 0.6037 l
0.5249 0.6037 l
0.5265 0.6038 l
0.5280 0.6038 l
0.5296 0.6038 l
0.5312 0.6038 l
0.5327 0.6038 l
0.5343 0.6038 l
0.5359 0.6039 l
0.5375 0.6039 l
0.5390 0.6039 l
0.5406 0.6039 l
0.5422 0.6039 l
0.5437 0.6039 l
0.5453 0.6040 l
0.5469 0.6040 l
0.5484 0.6040 l
0.5502 0.6040 l
0.5516 0.6040 l
0.5531 0.6040 l
0.5547 0.6040 l
0.5563 0.6041 l
0.5578 0.6041 l
0.5594 0.6041 l
0.5610 0.6041 l
0.5625 0.6041 l
0.5641 0.6041 l
0.5657 0.6041 l
0.5673 0.6041 l
0.5688 0.6042 l
0.5704 0.6042 l
0.5720 0.6042 l
0.5735 0.6042 l
0.5751 0.6042 l
0.5767 0.6042 l
0.5782 0.6042 l
0.5798 0.6043 l
0.5814 0.6043 l
0.5829 0.6043 l
0.5845 0.6043 l
0.5861 0.6043 l
0.5876 0.6043 l
0.5892 0.6043 l
0.5908 0.6043 l
0.5924 0.6043 l
0.5939 0.6044 l
0.5955 0.6044 l
0.5971 0.6044 l
0.5986 0.6044 l
0.6002 0.6044 l
0.6018 0.6044 l
0.6033 0.6044 l
0.6049 0.6044 l
0.6065 0.6044 l
0.6080 0.6045 l
0.6096 0.6045 l
0.6112 0.6045 l
0.6127 0.6045 l
0.6143 0.6045 l
0.6159 0.6045 l
0.6175 0.6045 l
0.6190 0.6045 l
0.6206 0.6045 l
0.6222 0.6045 l
0.6237 0.6045 l
0.6253 0.6046 l
0.6269 0.6046 l
0.6284 0.6046 l
0.6300 0.6046 l
0.6316 0.6046 l
0.6331 0.6046 l
0.6347 0.6046 l
0.6363 0.6046 l
0.6378 0.6046 l
0.6394 0.6046 l
0.6410 0.6046 l
0.6425 0.6047 l
0.6441 0.6047 l
0.6457 0.6047 l
0.6473 0.6047 l
0.6488 0.6047 l
0.6504 0.6047 l
0.6520 0.6047 l
0.6535 0.6047 l
0.6551 0.6047 l
0.6567 0.6047 l
0.6582 0.6047 l
0.6598 0.6047 l
0.6614 0.6047 l
0.6629 0.6048 l
0.6645 0.6048 l
0.6661 0.6048 l
0.6676 0.6048 l
0.6692 0.6048 l
0.6708 0.6048 l
0.6724 0.6048 l
0.6739 0.6048 l
0.6755 0.6048 l
0.6771 0.6048 l
0.6786 0.6048 l
0.6802 0.6048 l
0.6818 0.6048 l
0.6833 0.6048 l
0.6849 0.6048 l
0.6865 0.6049 l
0.6880 0.6049 l
0.6896 0.6049 l
0.6912 0.6049 l
0.6927 0.6049 l
0.6943 0.6049 l
0.6959 0.6049 l
0.6975 0.6049 l
0.6990 0.6049 l
0.7006 0.6049 l
0.7022 0.6049 l
0.7037 0.6049 l
0.7053 0.6049 l
0.7069 0.6049 l
0.7084 0.6049 l
0.7100 0.6049 l
0.7116 0.6050 l
0.7131 0.6050 l
0.7147 0.6050 l
0.7163 0.6050 l
0.7178 0.6050 l
0.7194 0.6050 l
0.7210 0.6050 l
0.7225 0.6050 l
0.7241 0.6050 l
0.7257 0.6050 l
0.7273 0.6050 l
0.7288 0.6050 l
0.7304 0.6050 l
0.7320 0.6050 l
0.7335 0.6050 l
0.7351 0.6050 l
0.7367 0.6050 l
0.7382 0.6050 l
0.7398 0.6051 l
0.7414 0.6051 l
0.7429 0.6051 l
0.7445 0.6051 l
0.7461 0.6051 l
0.7476 0.6051 l
0.7492 0.6051 l
0.7508 0.6051 l
0.7524 0.6051 l
0.7539 0.6051 l
0.7555 0.6051 l
0.7571 0.6051 l
0.7586 0.6051 l
0.7602 0.6051 l
0.7618 0.6051 l
0.7633 0.6051 l
0.7649 0.6051 l
0.7665 0.6051 l
0.7680 0.6051 l
0.7696 0.6051 l
0.7712 0.6052 l
0.7727 0.6052 l
0.7743 0.6052 l
0.7759 0.6052 l
0.7775 0.6052 l
0.7790 0.6052 l
0.7806 0.6052 l
0.7822 0.6052 l
0.7837 0.6052 l
0.7853 0.6052 l
0.7869 0.6052 l
0.7884 0.6052 l
0.7900 0.6052 l
0.7916 0.6052 l
0.7931 0.6052 l
0.7947 0.6052 l
0.7963 0.6052 l
0.7978 0.6052 l
0.7994 0.6052 l
0.8010 0.6052 l
0.8025 0.6052 l
0.8041 0.6052 l
0.8057 0.6052 l
0.8073 0.6052 l
0.8088 0.6053 l
0.8104 0.6053 l
0.8120 0.6053 l
0.8135 0.6053 l
0.8151 0.6053 l
0.8167 0.6053 l
0.8182 0.6053 l
0.8198 0.6053 l
0.8214 0.6053 l
0.8229 0.6053 l
0.8245 0.6053 l
0.8261 0.6053 l
0.8276 0.6053 l
0.8292 0.6053 l
0.8308 0.6053 l
0.8324 0.6053 l
0.8339 0.6053 l
0.8355 0.6053 l
0.8371 0.6053 l
0.8386 0.6053 l
0.8402 0.6053 l
0.8418 0.6053 l
0.8433 0.6053 l
0.8449 0.6053 l
0.8465 0.6053 l
0.8480 0.6053 l
0.8496 0.6053 l
0.8512 0.6053 l
0.8527 0.6054 l
0.8543 0.6054 l
0.8559 0.6054 l
0.8575 0.6054 l
0.8590 0.6054 l
0.8606 0.6054 l
0.8622 0.6054 l
0.8637 0.6054 l
0.8653 0.6054 l
0.8669 0.6054 l
0.8684 0.6054 l
0.8700 0.6054 l
0.8716 0.6054 l
0.8731 0.6054 l
0.8747 0.6054 l
0.8763 0.6054 l
0.8778 0.6054 l
0.8794 0.6054 l
0.8810 0.6054 l
0.8825 0.6054 l
0.8841 0.6054 l
0.8857 0.6054 l
0.8873 0.6054 l
0.8888 0.6054 l
0.8904 0.6054 l
0.8920 0.6054 l
0.8935 0.6054 l
0.8951 0.6054 l
0.8967 0.6054 l
0.8982 0.6054 l
0.8998 0.6054 l
0.9014 0.6054 l
0.9029 0.6054 l
0.9045 0.6055 l
0.9061 0.6055 l
0.9076 0.6055 l
0.9092 0.6055 l
0.9108 0.6055 l
0.9124 0.6055 l
0.9139 0.6055 l
0.9155 0.6055 l
0.9171 0.6055 l
0.9186 0.6055 l
0.9202 0.6055 l
0.9218 0.6055 l
0.9233 0.6055 l
0.9249 0.6055 l
0.9265 0.6055 l
0.9280 0.6055 l
0.9296 0.6055 l
0.9312 0.6055 l
0.9327 0.6055 l
0.9343 0.6055 l
0.9359 0.6055 l
0.9375 0.6055 l
0.9390 0.6055 l
0.9406 0.6055 l
0.9422 0.6055 l
0.9437 0.6055 l
0.9453 0.6055 l
0.9469 0.6055 l
0.9484 0.6055 l
0.9500 0.6055 l
s
[/DeviceRGB] SCS
Color4 SC
n
0.1500 0.7496 m
0.1516 0.7498 l
0.1531 0.7499 l
0.1547 0.7501 l
0.1563 0.7503 l
0.1578 0.7504 l
0.1594 0.7506 l
0.1610 0.7507 l
0.1625 0.7509 l
0.1641 0.7510 l
0.1657 0.7512 l
0.1673 0.7513 l
0.1688 0.7514 l
0.1704 0.7516 l
0.1720 0.7517 l
0.1735 0.7519 l
0.1751 0.7520 l
0.1767 0.7521 l
0.1782 0.7523 l
0.1798 0.7524 l
0.1814 0.7525 l
0.1829 0.7526 l
0.1845 0.7528 l
0.1861 0.7529 l
0.1876 0.7530 l
0.1892 0.7531 l
0.1908 0.7532 l
0.1924 0.7534 l
0.1939 0.7535 l
0.1955 0.7536 l
0.1971 0.7537 l
0.1986 0.7538 l
0.2002 0.7540 l
0.2018 0.7541 l
0.2033 0.7544 l
0.2049 0.7549 l
0.2065 0.7571 l
0.2080 0.7839 l
0.2096 0.8698 l
0.2112 0.5800 l
0.2127 0.4686 l
0.2143 0.3122 l
0.2151 0.1499 l
s
n
0.2166 0.1499 m
0.2175 0.3148 l
0.2190 0.4012 l
0.2206 0.4494 l
0.2222 0.4815 l
0.2237 0.5049 l
0.2253 0.5229 l
0.2269 0.5372 l
0.2284 0.5490 l
0.2300 0.5589 l
0.2316 0.5672 l
0.2331 0.5745 l
0.2347 0.5807 l
0.2363 0.5863 l
0.2378 0.5912 l
0.2394 0.5956 l
0.2410 0.5995 l
0.2425 0.6030 l
0.2441 0.6063 l
0.2457 0.6092 l
0.2473 0.6119 l
0.2488 0.6144 l
0.2504 0.6167 l
0.2520 0.6188 l
0.2535 0.6207 l
0.2551 0.6226 l
0.2567 0.6243 l
0.2582 0.6259 l
0.2598 0.6273 l
0.2614 0.6287 l
0.2629 0.6301 l
0.2645 0.6313 l
0.2661 0.6325 l
0.2676 0.6336 l
0.2692 0.6346 l
0.2708 0.6356 l
0.2724 0.6366 l
0.2739 0.6375 l
0.2755 0.6383 l
0.2771 0.6391 l
0.2786 0.6399 l
0.2802 0.6407 l
0.2818 0.6414 l
0.2833 0.6420 l
0.2849 0.6427 l
0.2865 0.6433 l
0.2880 0.6439 l
0.2896 0.6445 l
0.2912 0.6450 l
0.2927 0.6456 l
0.2943 0.6461 l
0.2959 0.6466 l
0.2975 0.6470 l
0.2990 0.6475 l
0.3006 0.6479 l
0.3022 0.6484 l
0.3037 0.6488 l
0.3053 0.6492 l
0.3069 0.6496 l
0.3084 0.6500 l
0.3100 0.6504 l
0.3116 0.6507 l
0.3131 0.6511 l
0.3147 0.6514 l
0.3163 0.6517 l
0.3178 0.6520 l
0.3194 0.6523 l
0.3210 0.6526 l
0.3225 0.6529 l
0.3241 0.6532 l
0.3257 0.6535 l
0.3273 0.6537 l
0.3288 0.6540 l
0.3304 0.6542 l
0.3320 0.6545 l
0.3335 0.6548 l
0.3351 0.6550 l
0.3367 0.6553 l
0.3382 0.6555 l
0.3398 0.6558 l
0.3414 0.6560 l
0.3429 0.6562 l
0.3445 0.6564 l
0.3461 0.6566 l
0.3476 0.6568 l
0.3492 0.6570 l
0.3508 0.6572 l
0.3524 0.6573 l
0.3539 0.6575 l
0.3555 0.6577 l
0.3571 0.6579 l
0.3586 0.6580 l
0.3602 0.6582 l
0.3618 0.6583 l
0.3633 0.6585 l
0.3649 0.6586 l
0.3665 0.6588 l
0.3680 0.6589 l
0.3696 0.6591 l
0.3712 0.6592 l
0.3727 0.6593 l
0.3743 0.6594 l
0.3759 0.6595 l
0.3775 0.6597 l
0.3790 0.6598 l
0.3806 0.6599 l
0.3822 0.6600 l
0.3837 0.6601 l
0.3853 0.6602 l
0.3869 0.6603 l
0.3884 0.6604 l
0.3900 0.6605 l
0.3916 0.6606 l
0.3931 0.6607 l
0.3947 0.6608 l
0.3963 0.6609 l
0.3978 0.6610 l
0.3994 0.6611 l
0.4010 0.6612 l
0.4025 0.6613 l
0.4041 0.6613 l
0.4057 0.6614 l
0.4073 0.6615 l
0.4088 0.6616 l
0.4104 0.6617 l
0.4120 0.6618 l
0.4135 0.6618 l
0.4151 0.6619 l
0.4167 0.6620 l
0.4182 0.6621 l
0.4198 0.6621 l
0.4214 0.6622 l
0.4229 0.6623 l
0.4245 0.6624 l
0.4261 0.6624 l
0.4276 0.6625 l
0.4292 0.6626 l
0.4308 0.6626 l
0.4324 0.6627 l
0.4339 0.6627 l
0.4355 0.6628 l
0.4371 0.6629 l
0.4386 0.6629 l
0.4402 0.6630 l
0.4418 0.6631 l
0.4433 0.6631 l
0.4449 0.6632 l
0.4465 0.6632 l
0.4480 0.6633 l
0.4496 0.6633 l
0.4512 0.6634 l
0.4527 0.6634 l
0.4543 0.6635 l
0.4559 0.6635 l
0.4575 0.6636 l
0.4590 0.6636 l
0.4606 0.6637 l
0.4622 0.6637 l
0.4637 0.6638 l
0.4653 0.6638 l
0.4669 0.6639 l
0.4684 0.6639 l
0.4700 0.6640 l
0.4716 0.6640 l
0.4731 0.6641 l
0.4747 0.6641 l
0.4763 0.6642 l
0.4778 0.6642 l
0.4794 0.6642 l
0.4810 0.6643 l
0.4825 0.6643 l
0.4841 0.6644 l
0.4857 0.6644 l
0.4873 0.6644 l
0.4888 0.6645 l
0.4904 0.6645 l
0.4920 0.6646 l
0.4935 0.6646 l
0.4951 0.6646 l
0.4967 0.6647 l
0.4982 0.6647 l
0.4998 0.6647 l
0.5014 0.6648 l
0.5029 0.6648 l
0.5045 0.6649 l
0.5061 0.6649 l
0.5076 0.6649 l
0.5092 0.6650 l
0.5108 0.6650 l
0.5124 0.6650 l
0.5139 0.6651 l
0.5155 0.6651 l
0.5171 0.6651 l
0.5186 0.6651 l
0.5202 0.6652 l
0.5218 0.6652 l
0.5233 0.6652 l
0.5249 0.6653 l
0.5265 0.6653 l
0.5280 0.6653 l
0.5296 0.6654 l
0.5312 0.6654 l
0.5327 0.6654 l
0.5343 0.6654 l
0.5359 0.6655 l
0.5375 0.6655 l
0.5390 0.6655 l
0.5406 0.6655 l
0.5422 0.6656 l
0.5437 0.6656 l
0.5453 0.6656 l
0.5469 0.6656 l
0.5484 0.6657 l
0.5502 0.6657 l
0.5516 0.6657 l
0.5531 0.6657 l
0.5547 0.6658 l
0.5563 0.6658 l
0.5578 0.6658 l
0.5594 0.6658 l
0.5610 0.6659 l
0.5625 0.6659 l
0.5641 0.6659 l
0.5657 0.6659 l
0.5673 0.6660 l
0.5688 0.6660 l
0.5704 0.6660 l
0.5720 0.6660 l
0.5735 0.6660 l
0.5751 0.6661 l
0.5767 0.6661 l
0.5782 0.6661 l
0.5798 0.6661 l
0.5814 0.6661 l
0.5829 0.6662 l
0.5845 0.6662 l
0.5861 0.6662 l
0.5876 0.6662 l
0.5892 0.6662 l
0.5908 0.6663 l
0.5924 0.6663 l
0.5939 0.6663 l
0.5955 0.6663 l
0.5971 0.6663 l
0.5986 0.6664 l
0.6002 0.6664 l
0.6018 0.6664 l
0.6033 0.6664 l
0.6049 0.6664 l
0.6065 0.6664 l
0.6080 0.6665 l
0.6096 0.6665 l
0.6112 0.6665 l
0.6127 0.6665 l
0.6143 0.6665 l
0.6159 0.6665 l
0.6175 0.6666 l
0.6190 0.6666 l
0.6206 0.6666 l
0.6222 0.6666 l
0.6237 0.6666 l
0.6253 0.6666 l
0.6269 0.6667 l
0.6284 0.6667 l
0.6300 0.6667 l
0.6316 0.6667 l
0.6331 0.6667 l
0.6347 0.6667 l
0.6363 0.6668 l
0.6378 0.6668 l
0.6394 0.6668 l
0.6410 0.6668 l
0.6425 0.6668 l
0.6441 0.6668 l
0.6457 0.6668 l
0.6473 0.6669 l
0.6488 0.6669 l
0.6504 0.6669 l
0.6520 0.6669 l
0.6535 0.6669 l
0.6551 0.6669 l
0.6567 0.6669 l
0.6582 0.6670 l
0.6598 0.6670 l
0.6614 0.6670 l
0.6629 0.6670 l
0.6645 0.6670 l
0.6661 0.6670 l
0.6676 0.6670 l
0.6692 0.6670 l
0.6708 0.6671 l
0.6724 0.6671 l
0.6739 0.6671 l
0.6755 0.6671 l
0.6771 0.6671 l
0.6786 0.6671 l
0.6802 0.6671 l
0.6818 0.6671 l
0.6833 0.6672 l
0.6849 0.6672 l
0.6865 0.6672 l
0.6880 0.6672 l
0.6896 0.6672 l
0.6912 0.6672 l
0.6927 0.6672 l
0.6943 0.6672 l
0.6959 0.6672 l
0.6975 0.6673 l
0.6990 0.6673 l
0.7006 0.6673 l
0.7022 0.6673 l
0.7037 0.6673 l
0.7053 0.6673 l
0.7069 0.6673 l
0.7084 0.6673 l
0.7100 0.6673 l
0.7116 0.6673 l
0.7131 0.6674 l
0.7147 0.6674 l
0.7163 0.6674 l
0.7178 0.6674 l
0.7194 0.6674 l
0.7210 0.6674 l
0.7225 0.6674 l
0.7241 0.6674 l
0.7257 0.6674 l
0.7273 0.6674 l
0.7288 0.6675 l
0.7304 0.6675 l
0.7320 0.6675 l
0.7335 0.6675 l
0.7351 0.6675 l
0.7367 0.6675 l
0.7382 0.6675 l
0.7398 0.6675 l
0.7414 0.6675 l
0.7429 0.6675 l
0.7445 0.6675 l
0.7461 0.6676 l
0.7476 0.6676 l
0.7492 0.6676 l
0.7508 0.6676 l
0.7524 0.6676 l
0.7539 0.6676 l
0.7555 0.6676 l
0.7571 0.6676 l
0.7586 0.6676 l
0.7602 0.6676 l
0.7618 0.6676 l
0.7633 0.6676 l
0.7649 0.6677 l
0.7665 0.6677 l
0.7680 0.6677 l
0.7696 0.6677 l
0.7712 0.6677 l
0.7727 0.6677 l
0.7743 0.6677 l
0.7759 0.6677 l
0.7775 0.6677 l
0.7790 0.6677 l
0.7806 0.6677 l
0.7822 0.6677 l
0.7837 0.6677 l
0.7853 0.6678 l
0.7869 0.6678 l
0.7884 0.6678 l
0.7900 0.6678 l
0.7916 0.6678 l
0.7931 0.6678 l
0.7947 0.6678 l
0.7963 0.6678 l
0.7978 0.6678 l
0.7994 0.6678 l
0.8010 0.6678 l
0.8025 0.6678 l
0.8041 0.6678 l
0.8057 0.6678 l
0.8073 0.6678 l
0.8088 0.6679 l
0.8104 0.6679 l
0.8120 0.6679 l
0.8135 0.6679 l
0.8151 0.6679 l
0.8167 0.6679 l
0.8182 0.6679 l
0.8198 0.6679 l
0.8214 0.6679 l
0.8229 0.6679 l
0.8245 0.6679 l
0.8261 0.6679 l
0.8276 0.6679 l
0.8292 0.6679 l
0.8308 0.6679 l
0.8324 0.6679 l
0.8339 0.6680 l
0.8355 0.6680 l
0.8371 0.6680 l
0.8386 0.6680 l
0.8402 0.6680 l
0.8418 0.6680 l
0.8433 0.6680 l
0.8449 0.6680 l
0.8465 0.6680 l
0.8480 0.6680 l
0.8496 0.6680 l
0.8512 0.6680 l
0.8527 0.6680 l
0.8543 0.6680 l
0.8559 0.6680 l
0.8575 0.6680 l
0.8590 0.6680 l
0.8606 0.6680 l
0.8622 0.6681 l
0.8637 0.6681 l
0.8653 0.6681 l
0.8669 0.6681 l
0.8684 0.6681 l
0.8700 0.6681 l
0.8716 0.6681 l
0.8731 0.6681 l
0.8747 0.6681 l
0.8763 0.6681 l
0.8778 0.6681 l
0.8794 0.6681 l
0.8810 0.6681 l
0.8825 0.6681 l
0.8841 0.6681 l
0.8857 0.6681 l
0.8873 0.6681 l
0.8888 0.6681 l
0.8904 0.6681 l
0.8920 0.6681 l
0.8935 0.6682 l
0.8951 0.6682 l
0.8967 0.6682 l
0.8982 0.6682 l
0.8998 0.6682 l
0.9014 0.6682 l
0.9029 0.6682 l
0.9045 0.6682 l
0.9061 0.6682 l
0.9076 0.6682 l
0.9092 0.6682 l
0.9108 0.6682 l
0.9124 0.6682 l
0.9139 0.6682 l
0.9155 0.6682 l
0.9171 0.6682 l
0.9186 0.6682 l
0.9202 0.6682 l
0.9218 0.6682 l
0.9233 0.6682 l
0.9249 0.6682 l
0.9265 0.6682 l
0.9280 0.6682 l
0.9296 0.6683 l
0.9312 0.6683 l
0.9327 0.6683 l
0.9343 0.6683 l
0.9359 0.6683 l
0.9375 0.6683 l
0.9390 0.6683 l
0.9406 0.6683 l
0.9422 0.6683 l
0.9437 0.6683 l
0.9453 0.6683 l
0.9469 0.6683 l
0.9484 0.6683 l
0.9500 0.6683 l
s
[/DeviceRGB] SCS
Color5 SC
n
0.1500 0.2884 m
0.1516 0.2886 l
0.1531 0.2887 l
0.1547 0.2889 l
0.1563 0.2891 l
0.1578 0.2892 l
0.1594 0.2894 l
0.1610 0.2895 l
0.1625 0.2896 l
0.1641 0.2898 l
0.1657 0.2899 l
0.1673 0.2901 l
0.1688 0.2902 l
0.1704 0.2904 l
0.1720 0.2905 l
0.1735 0.2906 l
0.1751 0.2907 l
0.1767 0.2909 l
0.1782 0.2910 l
0.1798 0.2911 l
0.1814 0.2913 l
0.1829 0.2914 l
0.1845 0.2915 l
0.1861 0.2916 l
0.1876 0.2917 l
0.1892 0.2919 l
0.1908 0.2920 l
0.1924 0.2921 l
0.1939 0.2922 l
0.1955 0.2923 l
0.1971 0.2924 l
0.1986 0.2926 l
0.2002 0.2927 l
0.2018 0.2929 l
0.2033 0.2931 l
0.2049 0.2936 l
0.2065 0.2958 l
0.2080 0.3226 l
0.2096 0.4085 l
0.2110 0.1499 l
s
n
0.2467 0.1499 m
0.2473 0.1508 l
0.2488 0.1533 l
0.2504 0.1556 l
0.2520 0.1577 l
0.2535 0.1597 l
0.2551 0.1615 l
0.2567 0.1632 l
0.2582 0.1648 l
0.2598 0.1663 l
0.2614 0.1677 l
0.2629 0.1690 l
0.2645 0.1702 l
0.2661 0.1714 l
0.2676 0.1725 l
0.2692 0.1735 l
0.2708 0.1745 l
0.2724 0.1755 l
0.2739 0.1764 l
0.2755 0.1772 l
0.2771 0.1780 l
0.2786 0.1788 l
0.2802 0.1796 l
0.2818 0.1803 l
0.2833 0.1809 l
0.2849 0.1816 l
0.2865 0.1822 l
0.2880 0.1828 l
0.2896 0.1834 l
0.2912 0.1839 l
0.2927 0.1845 l
0.2943 0.1850 l
0.2959 0.1855 l
0.2975 0.1859 l
0.2990 0.1864 l
0.3006 0.1868 l
0.3022 0.1873 l
0.3037 0.1877 l
0.3053 0.1881 l
0.3069 0.1885 l
0.3084 0.1889 l
0.3100 0.1893 l
0.3116 0.1896 l
0.3131 0.1900 l
0.3147 0.1903 l
0.3163 0.1906 l
0.3178 0.1909 l
0.3194 0.1912 l
0.3210 0.1915 l
0.3225 0.1918 l
0.3241 0.1921 l
0.3257 0.1924 l
0.3273 0.1926 l
0.3288 0.1929 l
0.3304 0.1931 l
0.3320 0.1934 l
0.3335 0.1937 l
0.3351 0.1939 l
0.3367 0.1942 l
0.3382 0.1944 l
0.3398 0.1946 l
0.3414 0.1949 l
0.3429 0.1951 l
0.3445 0.1953 l
0.3461 0.1955 l
0.3476 0.1957 l
0.3492 0.1959 l
0.3508 0.1960 l
0.3524 0.1962 l
0.3539 0.1964 l
0.3555 0.1966 l
0.3571 0.1967 l
0.3586 0.1969 l
0.3602 0.1971 l
0.3618 0.1972 l
0.3633 0.1974 l
0.3649 0.1975 l
0.3665 0.1977 l
0.3680 0.1978 l
0.3696 0.1979 l
0.3712 0.1981 l
0.3727 0.1982 l
0.3743 0.1983 l
0.3759 0.1984 l
0.3775 0.1985 l
0.3790 0.1986 l
0.3806 0.1988 l
0.3822 0.1989 l
0.3837 0.1990 l
0.3853 0.1991 l
0.3869 0.1992 l
0.3884 0.1993 l
0.3900 0.1994 l
0.3916 0.1995 l
0.3931 0.1996 l
0.3947 0.1997 l
0.3963 0.1998 l
0.3978 0.1999 l
0.3994 0.2000 l
0.4010 0.2000 l
0.4025 0.2001 l
0.4041 0.2002 l
0.4057 0.2003 l
0.4073 0.2004 l
0.4088 0.2005 l
0.4104 0.2006 l
0.4120 0.2006 l
0.4135 0.2007 l
0.4151 0.2008 l
0.4167 0.2009 l
0.4182 0.2009 l
0.4198 0.2010 l
0.4214 0.2011 l
0.4229 0.2012 l
0.4245 0.2012 l
0.4261 0.2013 l
0.4276 0.2014 l
0.4292 0.2014 l
0.4308 0.2015 l
0.4324 0.2016 l
0.4339 0.2016 l
0.4355 0.2017 l
0.4371 0.2017 l
0.4386 0.2018 l
0.4402 0.2019 l
0.4418 0.2019 l
0.4433 0.2020 l
0.4449 0.2020 l
0.4465 0.2021 l
0.4480 0.2021 l
0.4496 0.2022 l
0.4512 0.2023 l
0.4527 0.2023 l
0.4543 0.2024 l
0.4559 0.2024 l
0.4575 0.2025 l
0.4590 0.2025 l
0.4606 0.2026 l
0.4622 0.2026 l
0.4637 0.2027 l
0.4653 0.2027 l
0.4669 0.2028 l
0.4684 0.2028 l
0.4700 0.2029 l
0.4716 0.2029 l
0.4731 0.2029 l
0.4747 0.2030 l
0.4763 0.2030 l
0.4778 0.2031 l
0.4794 0.2031 l
0.4810 0.2032 l
0.4825 0.2032 l
0.4841 0.2032 l
0.4857 0.2033 l
0.4873 0.2033 l
0.4888 0.2034 l
0.4904 0.2034 l
0.4920 0.2034 l
0.4935 0.2035 l
0.4951 0.2035 l
0.4967 0.2035 l
0.4982 0.2036 l
0.4998 0.2036 l
0.5014 0.2036 l
0.5029 0.2037 l
0.5045 0.2037 l
0.5061 0.2038 l
0.5076 0.2038 l
0.5092 0.2038 l
0.5108 0.2039 l
0.5124 0.2039 l
0.5139 0.2039 l
0.5155 0.2039 l
0.5171 0.2040 l
0.5186 0.2040 l
0.5202 0.2040 l
0.5218 0.2041 l
0.5233 0.2041 l
0.5249 0.2041 l
0.5265 0.2042 l
0.5280 0.2042 l
0.5296 0.2042 l
0.5312 0.2042 l
0.5327 0.2043 l
0.5343 0.2043 l
0.5359 0.2043 l
0.5375 0.2044 l
0.5390 0.2044 l
0.5406 0.2044 l
0.5422 0.2044 l
0.5437 0.2045 l
0.5453 0.2045 l
0.5469 0.2045 l
0.5484 0.2045 l
0.5502 0.2046 l
0.5516 0.2046 l
0.5531 0.2046 l
0.5547 0.2046 l
0.5563 0.2047 l
0.5578 0.2047 l
0.5594 0.2047 l
0.5610 0.2047 l
0.5625 0.2048 l
0.5641 0.2048 l
0.5657 0.2048 l
0.5673 0.2048 l
0.5688 0.2048 l
0.5704 0.2049 l
0.5720 0.2049 l
0.5735 0.2049 l
0.5751 0.2049 l
0.5767 0.2049 l
0.5782 0.2050 l
0.5798 0.2050 l
0.5814 0.2050 l
0.5829 0.2050 l
0.5845 0.2051 l
0.5861 0.2051 l
0.5876 0.2051 l
0.5892 0.2051 l
0.5908 0.2051 l
0.5924 0.2051 l
0.5939 0.2052 l
0.5955 0.2052 l
0.5971 0.2052 l
0.5986 0.2052 l
0.6002 0.2052 l
0.6018 0.2053 l
0.6033 0.2053 l
0.6049 0.2053 l
0.6065 0.2053 l
0.6080 0.2053 l
0.6096 0.2053 l
0.6112 0.2054 l
0.6127 0.2054 l
0.6143 0.2054 l
0.6159 0.2054 l
0.6175 0.2054 l
0.6190 0.2054 l
0.6206 0.2055 l
0.6222 0.2055 l
0.6237 0.2055 l
0.6253 0.2055 l
0.6269 0.2055 l
0.6284 0.2055 l
0.6300 0.2056 l
0.6316 0.2056 l
0.6331 0.2056 l
0.6347 0.2056 l
0.6363 0.2056 l
0.6378 0.2056 l
0.6394 0.2056 l
0.6410 0.2057 l
0.6425 0.2057 l
0.6441 0.2057 l
0.6457 0.2057 l
0.6473 0.2057 l
0.6488 0.2057 l
0.6504 0.2057 l
0.6520 0.2058 l
0.6535 0.2058 l
0.6551 0.2058 l
0.6567 0.2058 l
0.6582 0.2058 l
0.6598 0.2058 l
0.6614 0.2058 l
0.6629 0.2059 l
0.6645 0.2059 l
0.6661 0.2059 l
0.6676 0.2059 l
0.6692 0.2059 l
0.6708 0.2059 l
0.6724 0.2059 l
0.6739 0.2059 l
0.6755 0.2060 l
0.6771 0.2060 l
0.6786 0.2060 l
0.6802 0.2060 l
0.6818 0.2060 l
0.6833 0.2060 l
0.6849 0.2060 l
0.6865 0.2060 l
0.6880 0.2060 l
0.6896 0.2061 l
0.6912 0.2061 l
0.6927 0.2061 l
0.6943 0.2061 l
0.6959 0.2061 l
0.6975 0.2061 l
0.6990 0.2061 l
0.7006 0.2061 l
0.7022 0.2061 l
0.7037 0.2062 l
0.7053 0.2062 l
0.7069 0.2062 l
0.7084 0.2062 l
0.7100 0.2062 l
0.7116 0.2062 l
0.7131 0.2062 l
0.7147 0.2062 l
0.7163 0.2062 l
0.7178 0.2062 l
0.7194 0.2063 l
0.7210 0.2063 l
0.7225 0.2063 l
0.7241 0.2063 l
0.7257 0.2063 l
0.7273 0.2063 l
0.7288 0.2063 l
0.7304 0.2063 l
0.7320 0.2063 l
0.7335 0.2063 l
0.7351 0.2064 l
0.7367 0.2064 l
0.7382 0.2064 l
0.7398 0.2064 l
0.7414 0.2064 l
0.7429 0.2064 l
0.7445 0.2064 l
0.7461 0.2064 l
0.7476 0.2064 l
0.7492 0.2064 l
0.7508 0.2064 l
0.7524 0.2064 l
0.7539 0.2065 l
0.7555 0.2065 l
0.7571 0.2065 l
0.7586 0.2065 l
0.7602 0.2065 l
0.7618 0.2065 l
0.7633 0.2065 l
0.7649 0.2065 l
0.7665 0.2065 l
0.7680 0.2065 l
0.7696 0.2065 l
0.7712 0.2065 l
0.7727 0.2066 l
0.7743 0.2066 l
0.7759 0.2066 l
0.7775 0.2066 l
0.7790 0.2066 l
0.7806 0.2066 l
0.7822 0.2066 l
0.7837 0.2066 l
0.7853 0.2066 l
0.7869 0.2066 l
0.7884 0.2066 l
0.7900 0.2066 l
0.7916 0.2066 l
0.7931 0.2066 l
0.7947 0.2067 l
0.7963 0.2067 l
0.7978 0.2067 l
0.7994 0.2067 l
0.8010 0.2067 l
0.8025 0.2067 l
0.8041 0.2067 l
0.8057 0.2067 l
0.8073 0.2067 l
0.8088 0.2067 l
0.8104 0.2067 l
0.8120 0.2067 l
0.8135 0.2067 l
0.8151 0.2067 l
0.8167 0.2067 l
0.8182 0.2068 l
0.8198 0.2068 l
0.8214 0.2068 l
0.8229 0.2068 l
0.8245 0.2068 l
0.8261 0.2068 l
0.8276 0.2068 l
0.8292 0.2068 l
0.8308 0.2068 l
0.8324 0.2068 l
0.8339 0.2068 l
0.8355 0.2068 l
0.8371 0.2068 l
0.8386 0.2068 l
0.8402 0.2068 l
0.8418 0.2068 l
0.8433 0.2068 l
0.8449 0.2069 l
0.8465 0.2069 l
0.8480 0.2069 l
0.8496 0.2069 l
0.8512 0.2069 l
0.8527 0.2069 l
0.8543 0.2069 l
0.8559 0.2069 l
0.8575 0.2069 l
0.8590 0.2069 l
0.8606 0.2069 l
0.8622 0.2069 l
0.8637 0.2069 l
0.8653 0.2069 l
0.8669 0.2069 l
0.8684 0.2069 l
0.8700 0.2069 l
0.8716 0.2069 l
0.8731 0.2069 l
0.8747 0.2070 l
0.8763 0.2070 l
0.8778 0.2070 l
0.8794 0.2070 l
0.8810 0.2070 l
0.8825 0.2070 l
0.8841 0.2070 l
0.8857 0.2070 l
0.8873 0.2070 l
0.8888 0.2070 l
0.8904 0.2070 l
0.8920 0.2070 l
0.8935 0.2070 l
0.8951 0.2070 l
0.8967 0.2070 l
0.8982 0.2070 l
0.8998 0.2070 l
0.9014 0.2070 l
0.9029 0.2070 l
0.9045 0.2070 l
0.9061 0.2070 l
0.9076 0.2071 l
0.9092 0.2071 l
0.9108 0.2071 l
0.9124 0.2071 l
0.9139 0.2071 l
0.9155 0.2071 l
0.9171 0.2071 l
0.9186 0.2071 l
0.9202 0.2071 l
0.9218 0.2071 l
0.9233 0.2071 l
0.9249 0.2071 l
0.9265 0.2071 l
0.9280 0.2071 l
0.9296 0.2071 l
0.9312 0.2071 l
0.9327 0.2071 l
0.9343 0.2071 l
0.9359 0.2071 l
0.9375 0.2071 l
0.9390 0.2071 l
0.9406 0.2071 l
0.9422 0.2071 l
0.9437 0.2071 l
0.9453 0.2072 l
0.9469 0.2072 l
0.9484 0.2072 l
0.9500 0.2072 l
s
[/DeviceRGB] SCS
Color6 SC
n
0.2102 0.1499 m
0.2112 0.5321 l
0.2127 0.5868 l
0.2143 0.6221 l
0.2159 0.6470 l
0.2175 0.6656 l
0.2190 0.6801 l
0.2206 0.6916 l
0.2222 0.7010 l
0.2237 0.7089 l
0.2253 0.7155 l
0.2269 0.7211 l
0.2284 0.7260 l
0.2300 0.7303 l
0.2316 0.7341 l
0.2331 0.7374 l
0.2347 0.7404 l
0.2363 0.7430 l
0.2378 0.7454 l
0.2394 0.7476 l
0.2410 0.7496 l
0.2425 0.7514 l
0.2441 0.7530 l
0.2457 0.7546 l
0.2473 0.7560 l
0.2488 0.7573 l
0.2504 0.7585 l
0.2520 0.7596 l
0.2535 0.7607 l
0.2551 0.7616 l
0.2567 0.7626 l
0.2582 0.7634 l
0.2598 0.7642 l
0.2614 0.7650 l
0.2629 0.7657 l
0.2645 0.7664 l
0.2661 0.7670 l
0.2676 0.7677 l
0.2692 0.7682 l
0.2708 0.7688 l
0.2724 0.7693 l
0.2739 0.7698 l
0.2755 0.7703 l
0.2771 0.7707 l
0.2786 0.7712 l
0.2802 0.7716 l
0.2818 0.7720 l
0.2833 0.7723 l
0.2849 0.7727 l
0.2865 0.7731 l
0.2880 0.7734 l
0.2896 0.7737 l
0.2912 0.7740 l
0.2927 0.7743 l
0.2943 0.7746 l
0.2959 0.7749 l
0.2975 0.7751 l
0.2990 0.7754 l
0.3006 0.7756 l
0.3022 0.7759 l
0.3037 0.7761 l
0.3053 0.7763 l
0.3069 0.7765 l
0.3084 0.7767 l
0.3100 0.7769 l
0.3116 0.7771 l
0.3131 0.7772 l
0.3147 0.7774 l
0.3163 0.7776 l
0.3178 0.7778 l
0.3194 0.7779 l
0.3210 0.7781 l
0.3225 0.7782 l
0.3241 0.7784 l
0.3257 0.7785 l
0.3273 0.7787 l
0.3288 0.7788 l
0.3304 0.7789 l
0.3320 0.7791 l
0.3335 0.7791 l
0.3351 0.7792 l
0.3367 0.7793 l
0.3382 0.7794 l
0.3398 0.7795 l
0.3414 0.7796 l
0.3429 0.7797 l
0.3445 0.7798 l
0.3461 0.7799 l
0.3476 0.7800 l
0.3492 0.7801 l
0.3508 0.7802 l
0.3524 0.7803 l
0.3539 0.7804 l
0.3555 0.7805 l
0.3571 0.7806 l
0.3586 0.7806 l
0.3602 0.7807 l
0.3618 0.7808 l
0.3633 0.7809 l
0.3649 0.7810 l
0.3665 0.7810 l
0.3680 0.7811 l
0.3696 0.7812 l
0.3712 0.7812 l
0.3727 0.7813 l
0.3743 0.7814 l
0.3759 0.7815 l
0.3775 0.7816 l
0.3790 0.7817 l
0.3806 0.7817 l
0.3822 0.7818 l
0.3837 0.7819 l
0.3853 0.7820 l
0.3869 0.7820 l
0.3884 0.7821 l
0.3900 0.7821 l
0.3916 0.7822 l
0.3931 0.7823 l
0.3947 0.7823 l
0.3963 0.7824 l
0.3978 0.7824 l
0.3994 0.7825 l
0.4010 0.7826 l
0.4025 0.7826 l
0.4041 0.7827 l
0.4057 0.7827 l
0.4073 0.7828 l
0.4088 0.7828 l
0.4104 0.7829 l
0.4120 0.7829 l
0.4135 0.7830 l
0.4151 0.7830 l
0.4167 0.7831 l
0.4182 0.7831 l
0.4198 0.7831 l
0.4214 0.7832 l
0.4229 0.7832 l
0.4245 0.7833 l
0.4261 0.7833 l
0.4276 0.7834 l
0.4292 0.7834 l
0.4308 0.7834 l
0.4324 0.7835 l
0.4339 0.7835 l
0.4355 0.7835 l
0.4371 0.7836 l
0.4386 0.7836 l
0.4402 0.7837 l
0.4418 0.7837 l
0.4433 0.7837 l
0.4449 0.7838 l
0.4465 0.7838 l
0.4480 0.7838 l
0.4496 0.7839 l
0.4512 0.7839 l
0.4527 0.7839 l
0.4543 0.7840 l
0.4559 0.7840 l
0.4575 0.7840 l
0.4590 0.7841 l
0.4606 0.7841 l
0.4622 0.7841 l
0.4637 0.7841 l
0.4653 0.7842 l
0.4669 0.7842 l
0.4684 0.7842 l
0.4700 0.7843 l
0.4716 0.7843 l
0.4731 0.7843 l
0.4747 0.7843 l
0.4763 0.7844 l
0.4778 0.7844 l
0.4794 0.7844 l
0.4810 0.7844 l
0.4825 0.7845 l
0.4841 0.7845 l
0.4857 0.7845 l
0.4873 0.7845 l
0.4888 0.7846 l
0.4904 0.7846 l
0.4920 0.7846 l
0.4935 0.7846 l
0.4951 0.7847 l
0.4967 0.7847 l
0.4982 0.7847 l
0.4998 0.7847 l
0.5014 0.7847 l
0.5029 0.7848 l
0.5045 0.7848 l
0.5061 0.7848 l
0.5076 0.7848 l
0.5092 0.7848 l
0.5108 0.7849 l
0.5124 0.7849 l
0.5139 0.7849 l
0.5155 0.7849 l
0.5171 0.7849 l
0.5186 0.7850 l
0.5202 0.7850 l
0.5218 0.7850 l
0.5233 0.7850 l
0.5249 0.7850 l
0.5265 0.7851 l
0.5280 0.7851 l
0.5296 0.7851 l
0.5312 0.7851 l
0.5327 0.7851 l
0.5343 0.7851 l
0.5359 0.7852 l
0.5375 0.7852 l
0.5390 0.7852 l
0.5406 0.7852 l
0.5422 0.7852 l
0.5437 0.7852 l
0.5453 0.7853 l
0.5469 0.7853 l
0.5484 0.7853 l
0.5502 0.7853 l
0.5516 0.7853 l
0.5531 0.7853 l
0.5547 0.7853 l
0.5563 0.7854 l
0.5578 0.7854 l
0.5594 0.7854 l
0.5610 0.7854 l
0.5625 0.7854 l
0.5641 0.7854 l
0.5657 0.7854 l
0.5673 0.7855 l
0.5688 0.7855 l
0.5704 0.7855 l
0.5720 0.7855 l
0.5735 0.7855 l
0.5751 0.7855 l
0.5767 0.7855 l
0.5782 0.7856 l
0.5798 0.7856 l
0.5814 0.7856 l
0.5829 0.7856 l
0.5845 0.7856 l
0.5861 0.7856 l
0.5876 0.7856 l
0.5892 0.7856 l
0.5908 0.7856 l
0.5924 0.7857 l
0.5939 0.7857 l
0.5955 0.7857 l
0.5971 0.7857 l
0.5986 0.7857 l
0.6002 0.7857 l
0.6018 0.7857 l
0.6033 0.7857 l
0.6049 0.7858 l
0.6065 0.7858 l
0.6080 0.7858 l
0.6096 0.7858 l
0.6112 0.7858 l
0.6127 0.7858 l
0.6143 0.7858 l
0.6159 0.7858 l
0.6175 0.7858 l
0.6190 0.7858 l
0.6206 0.7859 l
0.6222 0.7859 l
0.6237 0.7859 l
0.6253 0.7859 l
0.6269 0.7859 l
0.6284 0.7859 l
0.6300 0.7859 l
0.6316 0.7859 l
0.6331 0.7859 l
0.6347 0.7859 l
0.6363 0.7859 l
0.6378 0.7860 l
0.6394 0.7860 l
0.6410 0.7860 l
0.6425 0.7860 l
0.6441 0.7860 l
0.6457 0.7860 l
0.6473 0.7860 l
0.6488 0.7860 l
0.6504 0.7860 l
0.6520 0.7860 l
0.6535 0.7860 l
0.6551 0.7860 l
0.6567 0.7861 l
0.6582 0.7861 l
0.6598 0.7861 l
0.6614 0.7861 l
0.6629 0.7861 l
0.6645 0.7861 l
0.6661 0.7861 l
0.6676 0.7861 l
0.6692 0.7861 l
0.6708 0.7861 l
0.6724 0.7861 l
0.6739 0.7861 l
0.6755 0.7861 l
0.6771 0.7861 l
0.6786 0.7862 l
0.6802 0.7862 l
0.6818 0.7862 l
0.6833 0.7862 l
0.6849 0.7862 l
0.6865 0.7862 l
0.6880 0.7862 l
0.6896 0.7862 l
0.6912 0.7862 l
0.6927 0.7862 l
0.6943 0.7862 l
0.6959 0.7862 l
0.6975 0.7862 l
0.6990 0.7862 l
0.7006 0.7862 l
0.7022 0.7863 l
0.7037 0.7863 l
0.7053 0.7863 l
0.7069 0.7863 l
0.7084 0.7863 l
0.7100 0.7863 l
0.7116 0.7863 l
0.7131 0.7863 l
0.7147 0.7863 l
0.7163 0.7863 l
0.7178 0.7863 l
0.7194 0.7863 l
0.7210 0.7863 l
0.7225 0.7863 l
0.7241 0.7863 l
0.7257 0.7863 l
0.7273 0.7863 l
0.7288 0.7864 l
0.7304 0.7864 l
0.7320 0.7864 l
0.7335 0.7864 l
0.7351 0.7864 l
0.7367 0.7864 l
0.7382 0.7864 l
0.7398 0.7864 l
0.7414 0.7864 l
0.7429 0.7864 l
0.7445 0.7864 l
0.7461 0.7864 l
0.7476 0.7864 l
0.7492 0.7864 l
0.7508 0.7864 l
0.7524 0.7864 l
0.7539 0.7864 l
0.7555 0.7864 l
0.7571 0.7864 l
0.7586 0.7865 l
0.7602 0.7865 l
0.7618 0.7865 l
0.7633 0.7865 l
0.7649 0.7865 l
0.7665 0.7865 l
0.7680 0.7865 l
0.7696 0.7865 l
0.7712 0.7865 l
0.7727 0.7865 l
0.7743 0.7865 l
0.7759 0.7865 l
0.7775 0.7865 l
0.7790 0.7865 l
0.7806 0.7865 l
0.7822 0.7865 l
0.7837 0.7865 l
0.7853 0.7865 l
0.7869 0.7865 l
0.7884 0.7865 l
0.7900 0.7865 l
0.7916 0.7865 l
0.7931 0.7866 l
0.7947 0.7866 l
0.7963 0.7866 l
0.7978 0.7866 l
0.7994 0.7866 l
0.8010 0.7866 l
0.8025 0.7866 l
0.8041 0.7866 l
0.8057 0.7866 l
0.8073 0.7866 l
0.8088 0.7866 l
0.8104 0.7866 l
0.8120 0.7866 l
0.8135 0.7866 l
0.8151 0.7866 l
0.8167 0.7866 l
0.8182 0.7866 l
0.8198 0.7866 l
0.8214 0.7866 l
0.8229 0.7866 l
0.8245 0.7866 l
0.8261 0.7866 l
0.8276 0.7866 l
0.8292 0.7866 l
0.8308 0.7866 l
0.8324 0.7866 l
0.8339 0.7867 l
0.8355 0.7867 l
0.8371 0.7867 l
0.8386 0.7867 l
0.8402 0.7867 l
0.8418 0.7867 l
0.8433 0.7867 l
0.8449 0.7867 l
0.8465 0.7867 l
0.8480 0.7867 l
0.8496 0.7867 l
0.8512 0.7867 l
0.8527 0.7867 l
0.8543 0.7867 l
0.8559 0.7867 l
0.8575 0.7867 l
0.8590 0.7867 l
0.8606 0.7867 l
0.8622 0.7867 l
0.8637 0.7867 l
0.8653 0.7867 l
0.8669 0.7867 l
0.8684 0.7867 l
0.8700 0.7867 l
0.8716 0.7867 l
0.8731 0.7867 l
0.8747 0.7867 l
0.8763 0.7867 l
0.8778 0.7867 l
0.8794 0.7867 l
0.8810 0.7868 l
0.8825 0.7868 l
0.8841 0.7868 l
0.8857 0.7868 l
0.8873 0.7868 l
0.8888 0.7868 l
0.8904 0.7868 l
0.8920 0.7868 l
0.8935 0.7868 l
0.8951 0.7868 l
0.8967 0.7868 l
0.8982 0.7868 l
0.8998 0.7868 l
0.9014 0.7868 l
0.9029 0.7868 l
0.9045 0.7868 l
0.9061 0.7868 l
0.9076 0.7868 l
0.9092 0.7868 l
0.9108 0.7868 l
0.9124 0.7868 l
0.9139 0.7868 l
0.9155 0.7868 l
0.9171 0.7868 l
0.9186 0.7868 l
0.9202 0.7868 l
0.9218 0.7868 l
0.9233 0.7868 l
0.9249 0.7868 l
0.9265 0.7868 l
0.9280 0.7868 l
0.9296 0.7868 l
0.9312 0.7868 l
0.9327 0.7868 l
0.9343 0.7868 l
0.9359 0.7868 l
0.9375 0.7868 l
0.9390 0.7869 l
0.9406 0.7869 l
0.9422 0.7869 l
0.9437 0.7869 l
0.9453 0.7869 l
0.9469 0.7869 l
0.9484 0.7869 l
0.9500 0.7869 l
s
[/DeviceRGB] SCS
Color7 SC
n
0.2106 0.1499 m
0.2112 0.3635 l
0.2127 0.4182 l
0.2143 0.4535 l
0.2159 0.4784 l
0.2175 0.4970 l
0.2190 0.5115 l
0.2206 0.5230 l
0.2222 0.5324 l
0.2237 0.5403 l
0.2253 0.5469 l
0.2269 0.5526 l
0.2284 0.5574 l
0.2300 0.5617 l
0.2316 0.5655 l
0.2331 0.5688 l
0.2347 0.5718 l
0.2363 0.5744 l
0.2378 0.5768 l
0.2394 0.5790 l
0.2410 0.5810 l
0.2425 0.5828 l
0.2441 0.5844 l
0.2457 0.5860 l
0.2473 0.5874 l
0.2488 0.5887 l
0.2504 0.5899 l
0.2520 0.5910 l
0.2535 0.5921 l
0.2551 0.5930 l
0.2567 0.5940 l
0.2582 0.5948 l
0.2598 0.5956 l
0.2614 0.5964 l
0.2629 0.5971 l
0.2645 0.5978 l
0.2661 0.5984 l
0.2676 0.5990 l
0.2692 0.5996 l
0.2708 0.6002 l
0.2724 0.6007 l
0.2739 0.6012 l
0.2755 0.6017 l
0.2771 0.6021 l
0.2786 0.6025 l
0.2802 0.6030 l
0.2818 0.6034 l
0.2833 0.6037 l
0.2849 0.6041 l
0.2865 0.6044 l
0.2880 0.6048 l
0.2896 0.6051 l
0.2912 0.6054 l
0.2927 0.6057 l
0.2943 0.6060 l
0.2959 0.6063 l
0.2975 0.6065 l
0.2990 0.6068 l
0.3006 0.6070 l
0.3022 0.6072 l
0.3037 0.6075 l
0.3053 0.6077 l
0.3069 0.6078 l
0.3084 0.6080 l
0.3100 0.6082 l
0.3116 0.6084 l
0.3131 0.6086 l
0.3147 0.6088 l
0.3163 0.6089 l
0.3178 0.6091 l
0.3194 0.6093 l
0.3210 0.6094 l
0.3225 0.6096 l
0.3241 0.6097 l
0.3257 0.6099 l
0.3273 0.6100 l
0.3288 0.6101 l
0.3304 0.6103 l
0.3320 0.6104 l
0.3335 0.6105 l
0.3351 0.6106 l
0.3367 0.6107 l
0.3382 0.6108 l
0.3398 0.6109 l
0.3414 0.6110 l
0.3429 0.6111 l
0.3445 0.6112 l
0.3461 0.6113 l
0.3476 0.6114 l
0.3492 0.6115 l
0.3508 0.6115 l
0.3524 0.6116 l
0.3539 0.6117 l
0.3555 0.6118 l
0.3571 0.6119 l
0.3586 0.6120 l
0.3602 0.6120 l
0.3618 0.6121 l
0.3633 0.6122 l
0.3649 0.6123 l
0.3665 0.6123 l
0.3680 0.6124 l
0.3696 0.6125 l
0.3712 0.6126 l
0.3727 0.6126 l
0.3743 0.6127 l
0.3759 0.6128 l
0.3775 0.6129 l
0.3790 0.6130 l
0.3806 0.6131 l
0.3822 0.6131 l
0.3837 0.6132 l
0.3853 0.6133 l
0.3869 0.6134 l
0.3884 0.6134 l
0.3900 0.6135 l
0.3916 0.6136 l
0.3931 0.6136 l
0.3947 0.6137 l
0.3963 0.6137 l
0.3978 0.6138 l
0.3994 0.6138 l
0.4010 0.6139 l
0.4025 0.6140 l
0.4041 0.6140 l
0.4057 0.6141 l
0.4073 0.6141 l
0.4088 0.6142 l
0.4104 0.6142 l
0.4120 0.6143 l
0.4135 0.6143 l
0.4151 0.6144 l
0.4167 0.6144 l
0.4182 0.6145 l
0.4198 0.6145 l
0.4214 0.6145 l
0.4229 0.6146 l
0.4245 0.6146 l
0.4261 0.6147 l
0.4276 0.6147 l
0.4292 0.6148 l
0.4308 0.6148 l
0.4324 0.6148 l
0.4339 0.6149 l
0.4355 0.6149 l
0.4371 0.6149 l
0.4386 0.6150 l
0.4402 0.6150 l
0.4418 0.6151 l
0.4433 0.6151 l
0.4449 0.6151 l
0.4465 0.6152 l
0.4480 0.6152 l
0.4496 0.6152 l
0.4512 0.6153 l
0.4527 0.6153 l
0.4543 0.6153 l
0.4559 0.6154 l
0.4575 0.6154 l
0.4590 0.6154 l
0.4606 0.6155 l
0.4622 0.6155 l
0.4637 0.6155 l
0.4653 0.6155 l
0.4669 0.6156 l
0.4684 0.6156 l
0.4700 0.6156 l
0.4716 0.6157 l
0.4731 0.6157 l
0.4747 0.6157 l
0.4763 0.6157 l
0.4778 0.6158 l
0.4794 0.6158 l
0.4810 0.6158 l
0.4825 0.6158 l
0.4841 0.6159 l
0.4857 0.6159 l
0.4873 0.6159 l
0.4888 0.6159 l
0.4904 0.6160 l
0.4920 0.6160 l
0.4935 0.6160 l
0.4951 0.6160 l
0.4967 0.6160 l
0.4982 0.6161 l
0.4998 0.6161 l
0.5014 0.6161 l
0.5029 0.6161 l
0.5045 0.6162 l
0.5061 0.6162 l
0.5076 0.6162 l
0.5092 0.6162 l
0.5108 0.6162 l
0.5124 0.6163 l
0.5139 0.6163 l
0.5155 0.6163 l
0.5171 0.6163 l
0.5186 0.6163 l
0.5202 0.6164 l
0.5218 0.6164 l
0.5233 0.6164 l
0.5249 0.6164 l
0.5265 0.6164 l
0.5280 0.6164 l
0.5296 0.6165 l
0.5312 0.6165 l
0.5327 0.6165 l
0.5343 0.6165 l
0.5359 0.6165 l
0.5375 0.6166 l
0.5390 0.6166 l
0.5406 0.6166 l
0.5422 0.6166 l
0.5437 0.6166 l
0.5453 0.6166 l
0.5469 0.6166 l
0.5484 0.6167 l
0.5502 0.6167 l
0.5516 0.6167 l
0.5531 0.6167 l
0.5547 0.6167 l
0.5563 0.6167 l
0.5578 0.6168 l
0.5594 0.6168 l
0.5610 0.6168 l
0.5625 0.6168 l
0.5641 0.6168 l
0.5657 0.6168 l
0.5673 0.6168 l
0.5688 0.6169 l
0.5704 0.6169 l
0.5720 0.6169 l
0.5735 0.6169 l
0.5751 0.6169 l
0.5767 0.6169 l
0.5782 0.6169 l
0.5798 0.6169 l
0.5814 0.6170 l
0.5829 0.6170 l
0.5845 0.6170 l
0.5861 0.6170 l
0.5876 0.6170 l
0.5892 0.6170 l
0.5908 0.6170 l
0.5924 0.6170 l
0.5939 0.6171 l
0.5955 0.6171 l
0.5971 0.6171 l
0.5986 0.6171 l
0.6002 0.6171 l
0.6018 0.6171 l
0.6033 0.6171 l
0.6049 0.6171 l
0.6065 0.6171 l
0.6080 0.6172 l
0.6096 0.6172 l
0.6112 0.6172 l
0.6127 0.6172 l
0.6143 0.6172 l
0.6159 0.6172 l
0.6175 0.6172 l
0.6190 0.6172 l
0.6206 0.6172 l
0.6222 0.6172 l
0.6237 0.6173 l
0.6253 0.6173 l
0.6269 0.6173 l
0.6284 0.6173 l
0.6300 0.6173 l
0.6316 0.6173 l
0.6331 0.6173 l
0.6347 0.6173 l
0.6363 0.6173 l
0.6378 0.6173 l
0.6394 0.6173 l
0.6410 0.6174 l
0.6425 0.6174 l
0.6441 0.6174 l
0.6457 0.6174 l
0.6473 0.6174 l
0.6488 0.6174 l
0.6504 0.6174 l
0.6520 0.6174 l
0.6535 0.6174 l
0.6551 0.6174 l
0.6567 0.6174 l
0.6582 0.6174 l
0.6598 0.6174 l
0.6614 0.6175 l
0.6629 0.6175 l
0.6645 0.6175 l
0.6661 0.6175 l
0.6676 0.6175 l
0.6692 0.6175 l
0.6708 0.6175 l
0.6724 0.6175 l
0.6739 0.6175 l
0.6755 0.6175 l
0.6771 0.6175 l
0.6786 0.6175 l
0.6802 0.6175 l
0.6818 0.6175 l
0.6833 0.6176 l
0.6849 0.6176 l
0.6865 0.6176 l
0.6880 0.6176 l
0.6896 0.6176 l
0.6912 0.6176 l
0.6927 0.6176 l
0.6943 0.6176 l
0.6959 0.6176 l
0.6975 0.6176 l
0.6990 0.6176 l
0.7006 0.6176 l
0.7022 0.6176 l
0.7037 0.6176 l
0.7053 0.6176 l
0.7069 0.6177 l
0.7084 0.6177 l
0.7100 0.6177 l
0.7116 0.6177 l
0.7131 0.6177 l
0.7147 0.6177 l
0.7163 0.6177 l
0.7178 0.6177 l
0.7194 0.6177 l
0.7210 0.6177 l
0.7225 0.6177 l
0.7241 0.6177 l
0.7257 0.6177 l
0.7273 0.6177 l
0.7288 0.6177 l
0.7304 0.6177 l
0.7320 0.6177 l
0.7335 0.6178 l
0.7351 0.6178 l
0.7367 0.6178 l
0.7382 0.6178 l
0.7398 0.6178 l
0.7414 0.6178 l
0.7429 0.6178 l
0.7445 0.6178 l
0.7461 0.6178 l
0.7476 0.6178 l
0.7492 0.6178 l
0.7508 0.6178 l
0.7524 0.6178 l
0.7539 0.6178 l
0.7555 0.6178 l
0.7571 0.6178 l
0.7586 0.6178 l
0.7602 0.6178 l
0.7618 0.6178 l
0.7633 0.6178 l
0.7649 0.6179 l
0.7665 0.6179 l
0.7680 0.6179 l
0.7696 0.6179 l
0.7712 0.6179 l
0.7727 0.6179 l
0.7743 0.6179 l
0.7759 0.6179 l
0.7775 0.6179 l
0.7790 0.6179 l
0.7806 0.6179 l
0.7822 0.6179 l
0.7837 0.6179 l
0.7853 0.6179 l
0.7869 0.6179 l
0.7884 0.6179 l
0.7900 0.6179 l
0.7916 0.6179 l
0.7931 0.6179 l
0.7947 0.6179 l
0.7963 0.6179 l
0.7978 0.6179 l
0.7994 0.6180 l
0.8010 0.6180 l
0.8025 0.6180 l
0.8041 0.6180 l
0.8057 0.6180 l
0.8073 0.6180 l
0.8088 0.6180 l
0.8104 0.6180 l
0.8120 0.6180 l
0.8135 0.6180 l
0.8151 0.6180 l
0.8167 0.6180 l
0.8182 0.6180 l
0.8198 0.6180 l
0.8214 0.6180 l
0.8229 0.6180 l
0.8245 0.6180 l
0.8261 0.6180 l
0.8276 0.6180 l
0.8292 0.6180 l
0.8308 0.6180 l
0.8324 0.6180 l
0.8339 0.6180 l
0.8355 0.6180 l
0.8371 0.6180 l
0.8386 0.6180 l
0.8402 0.6180 l
0.8418 0.6181 l
0.8433 0.6181 l
0.8449 0.6181 l
0.8465 0.6181 l
0.8480 0.6181 l
0.8496 0.6181 l
0.8512 0.6181 l
0.8527 0.6181 l
0.8543 0.6181 l
0.8559 0.6181 l
0.8575 0.6181 l
0.8590 0.6181 l
0.8606 0.6181 l
0.8622 0.6181 l
0.8637 0.6181 l
0.8653 0.6181 l
0.8669 0.6181 l
0.8684 0.6181 l
0.8700 0.6181 l
0.8716 0.6181 l
0.8731 0.6181 l
0.8747 0.6181 l
0.8763 0.6181 l
0.8778 0.6181 l
0.8794 0.6181 l
0.8810 0.6181 l
0.8825 0.6181 l
0.8841 0.6181 l
0.8857 0.6181 l
0.8873 0.6181 l
0.8888 0.6181 l
0.8904 0.6182 l
0.8920 0.6182 l
0.8935 0.6182 l
0.8951 0.6182 l
0.8967 0.6182 l
0.8982 0.6182 l
0.8998 0.6182 l
0.9014 0.6182 l
0.9029 0.6182 l
0.9045 0.6182 l
0.9061 0.6182 l
0.9076 0.6182 l
0.9092 0.6182 l
0.9108 0.6182 l
0.9124 0.6182 l
0.9139 0.6182 l
0.9155 0.6182 l
0.9171 0.6182 l
0.9186 0.6182 l
0.9202 0.6182 l
0.9218 0.6182 l
0.9233 0.6182 l
0.9249 0.6182 l
0.9265 0.6182 l
0.9280 0.6182 l
0.9296 0.6182 l
0.9312 0.6182 l
0.9327 0.6182 l
0.9343 0.6182 l
0.9359 0.6182 l
0.9375 0.6182 l
0.9390 0.6182 l
0.9406 0.6182 l
0.9422 0.6182 l
0.9437 0.6182 l
0.9453 0.6182 l
0.9469 0.6182 l
0.9484 0.6182 l
0.9500 0.6183 l
s
[/DeviceRGB] SCS
Color8 SC
n
0.2111 0.1499 m
0.2112 0.1559 l
0.2127 0.2088 l
0.2143 0.2431 l
0.2159 0.2673 l
0.2175 0.2855 l
0.2190 0.2996 l
0.2206 0.3109 l
0.2222 0.3201 l
0.2237 0.3278 l
0.2253 0.3343 l
0.2269 0.3398 l
0.2284 0.3447 l
0.2300 0.3489 l
0.2316 0.3525 l
0.2331 0.3558 l
0.2347 0.3587 l
0.2363 0.3614 l
0.2378 0.3637 l
0.2394 0.3659 l
0.2410 0.3678 l
0.2425 0.3696 l
0.2441 0.3713 l
0.2457 0.3728 l
0.2473 0.3742 l
0.2488 0.3754 l
0.2504 0.3766 l
0.2520 0.3778 l
0.2535 0.3788 l
0.2551 0.3798 l
0.2567 0.3807 l
0.2582 0.3815 l
0.2598 0.3824 l
0.2614 0.3831 l
0.2629 0.3838 l
0.2645 0.3845 l
0.2661 0.3851 l
0.2676 0.3858 l
0.2692 0.3863 l
0.2708 0.3869 l
0.2724 0.3874 l
0.2739 0.3879 l
0.2755 0.3884 l
0.2771 0.3888 l
0.2786 0.3893 l
0.2802 0.3897 l
0.2818 0.3901 l
0.2833 0.3904 l
0.2849 0.3908 l
0.2865 0.3912 l
0.2880 0.3915 l
0.2896 0.3918 l
0.2912 0.3921 l
0.2927 0.3924 l
0.2943 0.3927 l
0.2959 0.3930 l
0.2975 0.3932 l
0.2990 0.3935 l
0.3006 0.3937 l
0.3022 0.3940 l
0.3037 0.3942 l
0.3053 0.3944 l
0.3069 0.3946 l
0.3084 0.3948 l
0.3100 0.3950 l
0.3116 0.3952 l
0.3131 0.3954 l
0.3147 0.3956 l
0.3163 0.3958 l
0.3178 0.3960 l
0.3194 0.3961 l
0.3210 0.3963 l
0.3225 0.3965 l
0.3241 0.3966 l
0.3257 0.3968 l
0.3273 0.3969 l
0.3288 0.3970 l
0.3304 0.3972 l
0.3320 0.3973 l
0.3335 0.3974 l
0.3351 0.3975 l
0.3367 0.3976 l
0.3382 0.3977 l
0.3398 0.3978 l
0.3414 0.3979 l
0.3429 0.3980 l
0.3445 0.3981 l
0.3461 0.3982 l
0.3476 0.3983 l
0.3492 0.3984 l
0.3508 0.3985 l
0.3524 0.3986 l
0.3539 0.3987 l
0.3555 0.3988 l
0.3571 0.3989 l
0.3586 0.3990 l
0.3602 0.3991 l
0.3618 0.3991 l
0.3633 0.3992 l
0.3649 0.3993 l
0.3665 0.3994 l
0.3680 0.3995 l
0.3696 0.3995 l
0.3712 0.3996 l
0.3727 0.3997 l
0.3743 0.3998 l
0.3759 0.3998 l
0.3775 0.3999 l
0.3790 0.4000 l
0.3806 0.4000 l
0.3822 0.4001 l
0.3837 0.4002 l
0.3853 0.4002 l
0.3869 0.4003 l
0.3884 0.4003 l
0.3900 0.4004 l
0.3916 0.4005 l
0.3931 0.4005 l
0.3947 0.4006 l
0.3963 0.4006 l
0.3978 0.4007 l
0.3994 0.4007 l
0.4010 0.4008 l
0.4025 0.4008 l
0.4041 0.4009 l
0.4057 0.4009 l
0.4073 0.4010 l
0.4088 0.4010 l
0.4104 0.4011 l
0.4120 0.4011 l
0.4135 0.4012 l
0.4151 0.4012 l
0.4167 0.4013 l
0.4182 0.4013 l
0.4198 0.4014 l
0.4214 0.4014 l
0.4229 0.4014 l
0.4245 0.4015 l
0.4261 0.4015 l
0.4276 0.4016 l
0.4292 0.4016 l
0.4308 0.4016 l
0.4324 0.4017 l
0.4339 0.4017 l
0.4355 0.4018 l
0.4371 0.4018 l
0.4386 0.4018 l
0.4402 0.4019 l
0.4418 0.4019 l
0.4433 0.4019 l
0.4449 0.4020 l
0.4465 0.4020 l
0.4480 0.4020 l
0.4496 0.4021 l
0.4512 0.4021 l
0.4527 0.4021 l
0.4543 0.4022 l
0.4559 0.4022 l
0.4575 0.4022 l
0.4590 0.4023 l
0.4606 0.4023 l
0.4622 0.4023 l
0.4637 0.4023 l
0.4653 0.4024 l
0.4669 0.4024 l
0.4684 0.4024 l
0.4700 0.4025 l
0.4716 0.4025 l
0.4731 0.4025 l
0.4747 0.4025 l
0.4763 0.4026 l
0.4778 0.4026 l
0.4794 0.4026 l
0.4810 0.4026 l
0.4825 0.4027 l
0.4841 0.4027 l
0.4857 0.4027 l
0.4873 0.4027 l
0.4888 0.4028 l
0.4904 0.4028 l
0.4920 0.4028 l
0.4935 0.4028 l
0.4951 0.4029 l
0.4967 0.4029 l
0.4982 0.4029 l
0.4998 0.4029 l
0.5014 0.4029 l
0.5029 0.4030 l
0.5045 0.4030 l
0.5061 0.4030 l
0.5076 0.4030 l
0.5092 0.4030 l
0.5108 0.4031 l
0.5124 0.4031 l
0.5139 0.4031 l
0.5155 0.4031 l
0.5171 0.4031 l
0.5186 0.4032 l
0.5202 0.4032 l
0.5218 0.4032 l
0.5233 0.4032 l
0.5249 0.4032 l
0.5265 0.4033 l
0.5280 0.4033 l
0.5296 0.4033 l
0.5312 0.4033 l
0.5327 0.4033 l
0.5343 0.4033 l
0.5359 0.4034 l
0.5375 0.4034 l
0.5390 0.4034 l
0.5406 0.4034 l
0.5422 0.4034 l
0.5437 0.4034 l
0.5453 0.4035 l
0.5469 0.4035 l
0.5484 0.4035 l
0.5502 0.4035 l
0.5516 0.4035 l
0.5531 0.4035 l
0.5547 0.4035 l
0.5563 0.4036 l
0.5578 0.4036 l
0.5594 0.4036 l
0.5610 0.4036 l
0.5625 0.4036 l
0.5641 0.4036 l
0.5657 0.4036 l
0.5673 0.4037 l
0.5688 0.4037 l
0.5704 0.4037 l
0.5720 0.4037 l
0.5735 0.4037 l
0.5751 0.4037 l
0.5767 0.4037 l
0.5782 0.4038 l
0.5798 0.4038 l
0.5814 0.4038 l
0.5829 0.4038 l
0.5845 0.4038 l
0.5861 0.4038 l
0.5876 0.4038 l
0.5892 0.4038 l
0.5908 0.4039 l
0.5924 0.4039 l
0.5939 0.4039 l
0.5955 0.4039 l
0.5971 0.4039 l
0.5986 0.4039 l
0.6002 0.4039 l
0.6018 0.4039 l
0.6033 0.4039 l
0.6049 0.4040 l
0.6065 0.4040 l
0.6080 0.4040 l
0.6096 0.4040 l
0.6112 0.4040 l
0.6127 0.4040 l
0.6143 0.4040 l
0.6159 0.4040 l
0.6175 0.4040 l
0.6190 0.4040 l
0.6206 0.4041 l
0.6222 0.4041 l
0.6237 0.4041 l
0.6253 0.4041 l
0.6269 0.4041 l
0.6284 0.4041 l
0.6300 0.4041 l
0.6316 0.4041 l
0.6331 0.4041 l
0.6347 0.4041 l
0.6363 0.4042 l
0.6378 0.4042 l
0.6394 0.4042 l
0.6410 0.4042 l
0.6425 0.4042 l
0.6441 0.4042 l
0.6457 0.4042 l
0.6473 0.4042 l
0.6488 0.4042 l
0.6504 0.4042 l
0.6520 0.4042 l
0.6535 0.4042 l
0.6551 0.4043 l
0.6567 0.4043 l
0.6582 0.4043 l
0.6598 0.4043 l
0.6614 0.4043 l
0.6629 0.4043 l
0.6645 0.4043 l
0.6661 0.4043 l
0.6676 0.4043 l
0.6692 0.4043 l
0.6708 0.4043 l
0.6724 0.4043 l
0.6739 0.4043 l
0.6755 0.4044 l
0.6771 0.4044 l
0.6786 0.4044 l
0.6802 0.4044 l
0.6818 0.4044 l
0.6833 0.4044 l
0.6849 0.4044 l
0.6865 0.4044 l
0.6880 0.4044 l
0.6896 0.4044 l
0.6912 0.4044 l
0.6927 0.4044 l
0.6943 0.4044 l
0.6959 0.4044 l
0.6975 0.4044 l
0.6990 0.4045 l
0.7006 0.4045 l
0.7022 0.4045 l
0.7037 0.4045 l
0.7053 0.4045 l
0.7069 0.4045 l
0.7084 0.4045 l
0.7100 0.4045 l
0.7116 0.4045 l
0.7131 0.4045 l
0.7147 0.4045 l
0.7163 0.4045 l
0.7178 0.4045 l
0.7194 0.4045 l
0.7210 0.4045 l
0.7225 0.4045 l
0.7241 0.4046 l
0.7257 0.4046 l
0.7273 0.4046 l
0.7288 0.4046 l
0.7304 0.4046 l
0.7320 0.4046 l
0.7335 0.4046 l
0.7351 0.4046 l
0.7367 0.4046 l
0.7382 0.4046 l
0.7398 0.4046 l
0.7414 0.4046 l
0.7429 0.4046 l
0.7445 0.4046 l
0.7461 0.4046 l
0.7476 0.4046 l
0.7492 0.4046 l
0.7508 0.4046 l
0.7524 0.4047 l
0.7539 0.4047 l
0.7555 0.4047 l
0.7571 0.4047 l
0.7586 0.4047 l
0.7602 0.4047 l
0.7618 0.4047 l
0.7633 0.4047 l
0.7649 0.4047 l
0.7665 0.4047 l
0.7680 0.4047 l
0.7696 0.4047 l
0.7712 0.4047 l
0.7727 0.4047 l
0.7743 0.4047 l
0.7759 0.4047 l
0.7775 0.4047 l
0.7790 0.4047 l
0.7806 0.4047 l
0.7822 0.4047 l
0.7837 0.4047 l
0.7853 0.4048 l
0.7869 0.4048 l
0.7884 0.4048 l
0.7900 0.4048 l
0.7916 0.4048 l
0.7931 0.4048 l
0.7947 0.4048 l
0.7963 0.4048 l
0.7978 0.4048 l
0.7994 0.4048 l
0.8010 0.4048 l
0.8025 0.4048 l
0.8041 0.4048 l
0.8057 0.4048 l
0.8073 0.4048 l
0.8088 0.4048 l
0.8104 0.4048 l
0.8120 0.4048 l
0.8135 0.4048 l
0.8151 0.4048 l
0.8167 0.4048 l
0.8182 0.4048 l
0.8198 0.4048 l
0.8214 0.4048 l
0.8229 0.4049 l
0.8245 0.4049 l
0.8261 0.4049 l
0.8276 0.4049 l
0.8292 0.4049 l
0.8308 0.4049 l
0.8324 0.4049 l
0.8339 0.4049 l
0.8355 0.4049 l
0.8371 0.4049 l
0.8386 0.4049 l
0.8402 0.4049 l
0.8418 0.4049 l
0.8433 0.4049 l
0.8449 0.4049 l
0.8465 0.4049 l
0.8480 0.4049 l
0.8496 0.4049 l
0.8512 0.4049 l
0.8527 0.4049 l
0.8543 0.4049 l
0.8559 0.4049 l
0.8575 0.4049 l
0.8590 0.4049 l
0.8606 0.4049 l
0.8622 0.4049 l
0.8637 0.4049 l
0.8653 0.4049 l
0.8669 0.4050 l
0.8684 0.4050 l
0.8700 0.4050 l
0.8716 0.4050 l
0.8731 0.4050 l
0.8747 0.4050 l
0.8763 0.4050 l
0.8778 0.4050 l
0.8794 0.4050 l
0.8810 0.4050 l
0.8825 0.4050 l
0.8841 0.4050 l
0.8857 0.4050 l
0.8873 0.4050 l
0.8888 0.4050 l
0.8904 0.4050 l
0.8920 0.4050 l
0.8935 0.4050 l
0.8951 0.4050 l
0.8967 0.4050 l
0.8982 0.4050 l
0.8998 0.4050 l
0.9014 0.4050 l
0.9029 0.4050 l
0.9045 0.4050 l
0.9061 0.4050 l
0.9076 0.4050 l
0.9092 0.4050 l
0.9108 0.4050 l
0.9124 0.4050 l
0.9139 0.4050 l
0.9155 0.4050 l
0.9171 0.4050 l
0.9186 0.4050 l
0.9202 0.4051 l
0.9218 0.4051 l
0.9233 0.4051 l
0.9249 0.4051 l
0.9265 0.4051 l
0.9280 0.4051 l
0.9296 0.4051 l
0.9312 0.4051 l
0.9327 0.4051 l
0.9343 0.4051 l
0.9359 0.4051 l
0.9375 0.4051 l
0.9390 0.4051 l
0.9406 0.4051 l
0.9422 0.4051 l
0.9437 0.4051 l
0.9453 0.4051 l
0.9469 0.4051 l
0.9484 0.4051 l
0.9500 0.4051 l
s
[/DeviceRGB] SCS
Color9 SC
n
0.2119 0.1499 m
0.2127 0.1802 l
0.2143 0.2155 l
0.2159 0.2404 l
0.2175 0.2590 l
0.2190 0.2734 l
0.2206 0.2849 l
0.2222 0.2943 l
0.2237 0.3021 l
0.2253 0.3087 l
0.2269 0.3144 l
0.2284 0.3192 l
0.2300 0.3235 l
0.2316 0.3272 l
0.2331 0.3306 l
0.2347 0.3335 l
0.2363 0.3362 l
0.2378 0.3386 l
0.2394 0.3407 l
0.2410 0.3427 l
0.2425 0.3445 l
0.2441 0.3462 l
0.2457 0.3477 l
0.2473 0.3491 l
0.2488 0.3504 l
0.2504 0.3516 l
0.2520 0.3528 l
0.2535 0.3538 l
0.2551 0.3548 l
0.2567 0.3557 l
0.2582 0.3566 l
0.2598 0.3574 l
0.2614 0.3581 l
0.2629 0.3589 l
0.2645 0.3595 l
0.2661 0.3602 l
0.2676 0.3608 l
0.2692 0.3614 l
0.2708 0.3619 l
0.2724 0.3624 l
0.2739 0.3629 l
0.2755 0.3634 l
0.2771 0.3639 l
0.2786 0.3643 l
0.2802 0.3647 l
0.2818 0.3651 l
0.2833 0.3655 l
0.2849 0.3659 l
0.2865 0.3662 l
0.2880 0.3665 l
0.2896 0.3669 l
0.2912 0.3672 l
0.2927 0.3675 l
0.2943 0.3678 l
0.2959 0.3680 l
0.2975 0.3683 l
0.2990 0.3686 l
0.3006 0.3688 l
0.3022 0.3690 l
0.3037 0.3693 l
0.3053 0.3695 l
0.3069 0.3697 l
0.3084 0.3699 l
0.3100 0.3701 l
0.3116 0.3702 l
0.3131 0.3704 l
0.3147 0.3706 l
0.3163 0.3708 l
0.3178 0.3710 l
0.3194 0.3711 l
0.3210 0.3713 l
0.3225 0.3714 l
0.3241 0.3716 l
0.3257 0.3717 l
0.3273 0.3719 l
0.3288 0.3720 l
0.3304 0.3722 l
0.3320 0.3723 l
0.3335 0.3724 l
0.3351 0.3725 l
0.3367 0.3726 l
0.3382 0.3727 l
0.3398 0.3728 l
0.3414 0.3729 l
0.3429 0.3730 l
0.3445 0.3731 l
0.3461 0.3732 l
0.3476 0.3733 l
0.3492 0.3734 l
0.3508 0.3734 l
0.3524 0.3735 l
0.3539 0.3736 l
0.3555 0.3737 l
0.3571 0.3738 l
0.3586 0.3739 l
0.3602 0.3740 l
0.3618 0.3740 l
0.3633 0.3741 l
0.3649 0.3742 l
0.3665 0.3743 l
0.3680 0.3743 l
0.3696 0.3744 l
0.3712 0.3745 l
0.3727 0.3746 l
0.3743 0.3747 l
0.3759 0.3747 l
0.3775 0.3748 l
0.3790 0.3749 l
0.3806 0.3750 l
0.3822 0.3750 l
0.3837 0.3751 l
0.3853 0.3752 l
0.3869 0.3752 l
0.3884 0.3753 l
0.3900 0.3754 l
0.3916 0.3754 l
0.3931 0.3755 l
0.3947 0.3756 l
0.3963 0.3756 l
0.3978 0.3757 l
0.3994 0.3757 l
0.4010 0.3758 l
0.4025 0.3758 l
0.4041 0.3759 l
0.4057 0.3759 l
0.4073 0.3760 l
0.4088 0.3760 l
0.4104 0.3761 l
0.4120 0.3761 l
0.4135 0.3762 l
0.4151 0.3762 l
0.4167 0.3763 l
0.4182 0.3763 l
0.4198 0.3764 l
0.4214 0.3764 l
0.4229 0.3764 l
0.4245 0.3765 l
0.4261 0.3765 l
0.4276 0.3766 l
0.4292 0.3766 l
0.4308 0.3767 l
0.4324 0.3767 l
0.4339 0.3767 l
0.4355 0.3768 l
0.4371 0.3768 l
0.4386 0.3768 l
0.4402 0.3769 l
0.4418 0.3769 l
0.4433 0.3770 l
0.4449 0.3770 l
0.4465 0.3770 l
0.4480 0.3771 l
0.4496 0.3771 l
0.4512 0.3771 l
0.4527 0.3772 l
0.4543 0.3772 l
0.4559 0.3772 l
0.4575 0.3772 l
0.4590 0.3773 l
0.4606 0.3773 l
0.4622 0.3773 l
0.4637 0.3774 l
0.4653 0.3774 l
0.4669 0.3774 l
0.4684 0.3775 l
0.4700 0.3775 l
0.4716 0.3775 l
0.4731 0.3775 l
0.4747 0.3776 l
0.4763 0.3776 l
0.4778 0.3776 l
0.4794 0.3776 l
0.4810 0.3777 l
0.4825 0.3777 l
0.4841 0.3777 l
0.4857 0.3777 l
0.4873 0.3778 l
0.4888 0.3778 l
0.4904 0.3778 l
0.4920 0.3778 l
0.4935 0.3779 l
0.4951 0.3779 l
0.4967 0.3779 l
0.4982 0.3779 l
0.4998 0.3779 l
0.5014 0.3780 l
0.5029 0.3780 l
0.5045 0.3780 l
0.5061 0.3780 l
0.5076 0.3781 l
0.5092 0.3781 l
0.5108 0.3781 l
0.5124 0.3781 l
0.5139 0.3781 l
0.5155 0.3782 l
0.5171 0.3782 l
0.5186 0.3782 l
0.5202 0.3782 l
0.5218 0.3782 l
0.5233 0.3782 l
0.5249 0.3783 l
0.5265 0.3783 l
0.5280 0.3783 l
0.5296 0.3783 l
0.5312 0.3783 l
0.5327 0.3784 l
0.5343 0.3784 l
0.5359 0.3784 l
0.5375 0.3784 l
0.5390 0.3784 l
0.5406 0.3784 l
0.5422 0.3785 l
0.5437 0.3785 l
0.5453 0.3785 l
0.5469 0.3785 l
0.5484 0.3785 l
0.5502 0.3785 l
0.5516 0.3785 l
0.5531 0.3786 l
0.5547 0.3786 l
0.5563 0.3786 l
0.5578 0.3786 l
0.5594 0.3786 l
0.5610 0.3786 l
0.5625 0.3786 l
0.5641 0.3787 l
0.5657 0.3787 l
0.5673 0.3787 l
0.5688 0.3787 l
0.5704 0.3787 l
0.5720 0.3787 l
0.5735 0.3787 l
0.5751 0.3788 l
0.5767 0.3788 l
0.5782 0.3788 l
0.5798 0.3788 l
0.5814 0.3788 l
0.5829 0.3788 l
0.5845 0.3788 l
0.5861 0.3788 l
0.5876 0.3789 l
0.5892 0.3789 l
0.5908 0.3789 l
0.5924 0.3789 l
0.5939 0.3789 l
0.5955 0.3789 l
0.5971 0.3789 l
0.5986 0.3789 l
0.6002 0.3790 l
0.6018 0.3790 l
0.6033 0.3790 l
0.6049 0.3790 l
0.6065 0.3790 l
0.6080 0.3790 l
0.6096 0.3790 l
0.6112 0.3790 l
0.6127 0.3790 l
0.6143 0.3790 l
0.6159 0.3791 l
0.6175 0.3791 l
0.6190 0.3791 l
0.6206 0.3791 l
0.6222 0.3791 l
0.6237 0.3791 l
0.6253 0.3791 l
0.6269 0.3791 l
0.6284 0.3791 l
0.6300 0.3791 l
0.6316 0.3792 l
0.6331 0.3792 l
0.6347 0.3792 l
0.6363 0.3792 l
0.6378 0.3792 l
0.6394 0.3792 l
0.6410 0.3792 l
0.6425 0.3792 l
0.6441 0.3792 l
0.6457 0.3792 l
0.6473 0.3792 l
0.6488 0.3793 l
0.6504 0.3793 l
0.6520 0.3793 l
0.6535 0.3793 l
0.6551 0.3793 l
0.6567 0.3793 l
0.6582 0.3793 l
0.6598 0.3793 l
0.6614 0.3793 l
0.6629 0.3793 l
0.6645 0.3793 l
0.6661 0.3793 l
0.6676 0.3793 l
0.6692 0.3793 l
0.6708 0.3794 l
0.6724 0.3794 l
0.6739 0.3794 l
0.6755 0.3794 l
0.6771 0.3794 l
0.6786 0.3794 l
0.6802 0.3794 l
0.6818 0.3794 l
0.6833 0.3794 l
0.6849 0.3794 l
0.6865 0.3794 l
0.6880 0.3794 l
0.6896 0.3794 l
0.6912 0.3794 l
0.6927 0.3795 l
0.6943 0.3795 l
0.6959 0.3795 l
0.6975 0.3795 l
0.6990 0.3795 l
0.7006 0.3795 l
0.7022 0.3795 l
0.7037 0.3795 l
0.7053 0.3795 l
0.7069 0.3795 l
0.7084 0.3795 l
0.7100 0.3795 l
0.7116 0.3795 l
0.7131 0.3795 l
0.7147 0.3795 l
0.7163 0.3795 l
0.7178 0.3796 l
0.7194 0.3796 l
0.7210 0.3796 l
0.7225 0.3796 l
0.7241 0.3796 l
0.7257 0.3796 l
0.7273 0.3796 l
0.7288 0.3796 l
0.7304 0.3796 l
0.7320 0.3796 l
0.7335 0.3796 l
0.7351 0.3796 l
0.7367 0.3796 l
0.7382 0.3796 l
0.7398 0.3796 l
0.7414 0.3796 l
0.7429 0.3796 l
0.7445 0.3796 l
0.7461 0.3797 l
0.7476 0.3797 l
0.7492 0.3797 l
0.7508 0.3797 l
0.7524 0.3797 l
0.7539 0.3797 l
0.7555 0.3797 l
0.7571 0.3797 l
0.7586 0.3797 l
0.7602 0.3797 l
0.7618 0.3797 l
0.7633 0.3797 l
0.7649 0.3797 l
0.7665 0.3797 l
0.7680 0.3797 l
0.7696 0.3797 l
0.7712 0.3797 l
0.7727 0.3797 l
0.7743 0.3797 l
0.7759 0.3797 l
0.7775 0.3798 l
0.7790 0.3798 l
0.7806 0.3798 l
0.7822 0.3798 l
0.7837 0.3798 l
0.7853 0.3798 l
0.7869 0.3798 l
0.7884 0.3798 l
0.7900 0.3798 l
0.7916 0.3798 l
0.7931 0.3798 l
0.7947 0.3798 l
0.7963 0.3798 l
0.7978 0.3798 l
0.7994 0.3798 l
0.8010 0.3798 l
0.8025 0.3798 l
0.8041 0.3798 l
0.8057 0.3798 l
0.8073 0.3798 l
0.8088 0.3798 l
0.8104 0.3798 l
0.8120 0.3798 l
0.8135 0.3798 l
0.8151 0.3799 l
0.8167 0.3799 l
0.8182 0.3799 l
0.8198 0.3799 l
0.8214 0.3799 l
0.8229 0.3799 l
0.8245 0.3799 l
0.8261 0.3799 l
0.8276 0.3799 l
0.8292 0.3799 l
0.8308 0.3799 l
0.8324 0.3799 l
0.8339 0.3799 l
0.8355 0.3799 l
0.8371 0.3799 l
0.8386 0.3799 l
0.8402 0.3799 l
0.8418 0.3799 l
0.8433 0.3799 l
0.8449 0.3799 l
0.8465 0.3799 l
0.8480 0.3799 l
0.8496 0.3799 l
0.8512 0.3799 l
0.8527 0.3799 l
0.8543 0.3799 l
0.8559 0.3799 l
0.8575 0.3800 l
0.8590 0.3800 l
0.8606 0.3800 l
0.8622 0.3800 l
0.8637 0.3800 l
0.8653 0.3800 l
0.8669 0.3800 l
0.8684 0.3800 l
0.8700 0.3800 l
0.8716 0.3800 l
0.8731 0.3800 l
0.8747 0.3800 l
0.8763 0.3800 l
0.8778 0.3800 l
0.8794 0.3800 l
0.8810 0.3800 l
0.8825 0.3800 l
0.8841 0.3800 l
0.8857 0.3800 l
0.8873 0.3800 l
0.8888 0.3800 l
0.8904 0.3800 l
0.8920 0.3800 l
0.8935 0.3800 l
0.8951 0.3800 l
0.8967 0.3800 l
0.8982 0.3800 l
0.8998 0.3800 l
0.9014 0.3800 l
0.9029 0.3800 l
0.9045 0.3800 l
0.9061 0.3800 l
0.9076 0.3800 l
0.9092 0.3801 l
0.9108 0.3801 l
0.9124 0.3801 l
0.9139 0.3801 l
0.9155 0.3801 l
0.9171 0.3801 l
0.9186 0.3801 l
0.9202 0.3801 l
0.9218 0.3801 l
0.9233 0.3801 l
0.9249 0.3801 l
0.9265 0.3801 l
0.9280 0.3801 l
0.9296 0.3801 l
0.9312 0.3801 l
0.9327 0.3801 l
0.9343 0.3801 l
0.9359 0.3801 l
0.9375 0.3801 l
0.9390 0.3801 l
0.9406 0.3801 l
0.9422 0.3801 l
0.9437 0.3801 l
0.9453 0.3801 l
0.9469 0.3801 l
0.9484 0.3801 l
0.9500 0.3801 l
s
[/DeviceRGB] SCS
Color10 SC
n
0.1500 0.4280 m
0.1516 0.4270 l
0.1531 0.4259 l
0.1547 0.4249 l
0.1563 0.4239 l
0.1578 0.4229 l
0.1594 0.4219 l
0.1610 0.4210 l
0.1625 0.4200 l
0.1641 0.4190 l
0.1657 0.4181 l
0.1673 0.4171 l
0.1688 0.4162 l
0.1704 0.4153 l
0.1720 0.4144 l
0.1735 0.4134 l
0.1751 0.4125 l
0.1767 0.4117 l
0.1782 0.4108 l
0.1798 0.4099 l
0.1814 0.4090 l
0.1829 0.4082 l
0.1845 0.4073 l
0.1861 0.4065 l
0.1876 0.4056 l
0.1892 0.4047 l
0.1908 0.4039 l
0.1924 0.4030 l
0.1939 0.4021 l
0.1955 0.4012 l
0.1971 0.4003 l
0.1986 0.3994 l
0.2002 0.3984 l
0.2018 0.3974 l
0.2033 0.3961 l
0.2049 0.3944 l
0.2065 0.3912 l
0.2080 0.3729 l
0.2096 0.2773 l
0.2112 0.4115 l
0.2127 0.4628 l
0.2143 0.5011 l
0.2159 0.5292 l
0.2175 0.5505 l
0.2190 0.5670 l
0.2206 0.5802 l
0.2222 0.5910 l
0.2237 0.5999 l
0.2253 0.6075 l
0.2269 0.6140 l
0.2284 0.6195 l
0.2300 0.6244 l
0.2316 0.6287 l
0.2331 0.6324 l
0.2347 0.6358 l
0.2363 0.6388 l
0.2378 0.6416 l
0.2394 0.6440 l
0.2410 0.6463 l
0.2425 0.6483 l
0.2441 0.6502 l
0.2457 0.6519 l
0.2473 0.6535 l
0.2488 0.6550 l
0.2504 0.6564 l
0.2520 0.6577 l
0.2535 0.6589 l
0.2551 0.6600 l
0.2567 0.6610 l
0.2582 0.6620 l
0.2598 0.6629 l
0.2614 0.6638 l
0.2629 0.6646 l
0.2645 0.6654 l
0.2661 0.6661 l
0.2676 0.6668 l
0.2692 0.6675 l
0.2708 0.6681 l
0.2724 0.6687 l
0.2739 0.6693 l
0.2755 0.6698 l
0.2771 0.6703 l
0.2786 0.6708 l
0.2802 0.6713 l
0.2818 0.6717 l
0.2833 0.6722 l
0.2849 0.6726 l
0.2865 0.6730 l
0.2880 0.6734 l
0.2896 0.6737 l
0.2912 0.6741 l
0.2927 0.6744 l
0.2943 0.6747 l
0.2959 0.6750 l
0.2975 0.6753 l
0.2990 0.6756 l
0.3006 0.6759 l
0.3022 0.6762 l
0.3037 0.6764 l
0.3053 0.6767 l
0.3069 0.6769 l
0.3084 0.6772 l
0.3100 0.6774 l
0.3116 0.6776 l
0.3131 0.6778 l
0.3147 0.6780 l
0.3163 0.6782 l
0.3178 0.6784 l
0.3194 0.6786 l
0.3210 0.6788 l
0.3225 0.6790 l
0.3241 0.6792 l
0.3257 0.6793 l
0.3273 0.6795 l
0.3288 0.6797 l
0.3304 0.6798 l
0.3320 0.6800 l
0.3335 0.6801 l
0.3351 0.6802 l
0.3367 0.6803 l
0.3382 0.6804 l
0.3398 0.6805 l
0.3414 0.6807 l
0.3429 0.6808 l
0.3445 0.6809 l
0.3461 0.6810 l
0.3476 0.6811 l
0.3492 0.6812 l
0.3508 0.6813 l
0.3524 0.6814 l
0.3539 0.6815 l
0.3555 0.6816 l
0.3571 0.6817 l
0.3586 0.6818 l
0.3602 0.6819 l
0.3618 0.6820 l
0.3633 0.6821 l
0.3649 0.6822 l
0.3665 0.6823 l
0.3680 0.6824 l
0.3696 0.6825 l
0.3712 0.6826 l
0.3727 0.6826 l
0.3743 0.6827 l
0.3759 0.6828 l
0.3775 0.6829 l
0.3790 0.6829 l
0.3806 0.6830 l
0.3822 0.6831 l
0.3837 0.6832 l
0.3853 0.6832 l
0.3869 0.6833 l
0.3884 0.6834 l
0.3900 0.6834 l
0.3916 0.6835 l
0.3931 0.6835 l
0.3947 0.6836 l
0.3963 0.6837 l
0.3978 0.6837 l
0.3994 0.6838 l
0.4010 0.6838 l
0.4025 0.6839 l
0.4041 0.6840 l
0.4057 0.6840 l
0.4073 0.6841 l
0.4088 0.6841 l
0.4104 0.6842 l
0.4120 0.6842 l
0.4135 0.6843 l
0.4151 0.6843 l
0.4167 0.6844 l
0.4182 0.6844 l
0.4198 0.6845 l
0.4214 0.6845 l
0.4229 0.6846 l
0.4245 0.6846 l
0.4261 0.6847 l
0.4276 0.6847 l
0.4292 0.6847 l
0.4308 0.6848 l
0.4324 0.6848 l
0.4339 0.6849 l
0.4355 0.6849 l
0.4371 0.6850 l
0.4386 0.6850 l
0.4402 0.6850 l
0.4418 0.6851 l
0.4433 0.6851 l
0.4449 0.6851 l
0.4465 0.6852 l
0.4480 0.6852 l
0.4496 0.6853 l
0.4512 0.6853 l
0.4527 0.6853 l
0.4543 0.6854 l
0.4559 0.6854 l
0.4575 0.6854 l
0.4590 0.6855 l
0.4606 0.6855 l
0.4622 0.6855 l
0.4637 0.6856 l
0.4653 0.6856 l
0.4669 0.6856 l
0.4684 0.6857 l
0.4700 0.6857 l
0.4716 0.6857 l
0.4731 0.6857 l
0.4747 0.6858 l
0.4763 0.6858 l
0.4778 0.6858 l
0.4794 0.6859 l
0.4810 0.6859 l
0.4825 0.6859 l
0.4841 0.6859 l
0.4857 0.6860 l
0.4873 0.6860 l
0.4888 0.6860 l
0.4904 0.6860 l
0.4920 0.6861 l
0.4935 0.6861 l
0.4951 0.6861 l
0.4967 0.6861 l
0.4982 0.6862 l
0.4998 0.6862 l
0.5014 0.6862 l
0.5029 0.6862 l
0.5045 0.6863 l
0.5061 0.6863 l
0.5076 0.6863 l
0.5092 0.6863 l
0.5108 0.6864 l
0.5124 0.6864 l
0.5139 0.6864 l
0.5155 0.6864 l
0.5171 0.6864 l
0.5186 0.6865 l
0.5202 0.6865 l
0.5218 0.6865 l
0.5233 0.6865 l
0.5249 0.6865 l
0.5265 0.6866 l
0.5280 0.6866 l
0.5296 0.6866 l
0.5312 0.6866 l
0.5327 0.6866 l
0.5343 0.6867 l
0.5359 0.6867 l
0.5375 0.6867 l
0.5390 0.6867 l
0.5406 0.6867 l
0.5422 0.6867 l
0.5437 0.6868 l
0.5453 0.6868 l
0.5469 0.6868 l
0.5484 0.6868 l
0.5502 0.6868 l
0.5516 0.6868 l
0.5531 0.6869 l
0.5547 0.6869 l
0.5563 0.6869 l
0.5578 0.6869 l
0.5594 0.6869 l
0.5610 0.6869 l
0.5625 0.6870 l
0.5641 0.6870 l
0.5657 0.6870 l
0.5673 0.6870 l
0.5688 0.6870 l
0.5704 0.6870 l
0.5720 0.6870 l
0.5735 0.6871 l
0.5751 0.6871 l
0.5767 0.6871 l
0.5782 0.6871 l
0.5798 0.6871 l
0.5814 0.6871 l
0.5829 0.6871 l
0.5845 0.6872 l
0.5861 0.6872 l
0.5876 0.6872 l
0.5892 0.6872 l
0.5908 0.6872 l
0.5924 0.6872 l
0.5939 0.6872 l
0.5955 0.6872 l
0.5971 0.6873 l
0.5986 0.6873 l
0.6002 0.6873 l
0.6018 0.6873 l
0.6033 0.6873 l
0.6049 0.6873 l
0.6065 0.6873 l
0.6080 0.6873 l
0.6096 0.6874 l
0.6112 0.6874 l
0.6127 0.6874 l
0.6143 0.6874 l
0.6159 0.6874 l
0.6175 0.6874 l
0.6190 0.6874 l
0.6206 0.6874 l
0.6222 0.6874 l
0.6237 0.6875 l
0.6253 0.6875 l
0.6269 0.6875 l
0.6284 0.6875 l
0.6300 0.6875 l
0.6316 0.6875 l
0.6331 0.6875 l
0.6347 0.6875 l
0.6363 0.6875 l
0.6378 0.6875 l
0.6394 0.6876 l
0.6410 0.6876 l
0.6425 0.6876 l
0.6441 0.6876 l
0.6457 0.6876 l
0.6473 0.6876 l
0.6488 0.6876 l
0.6504 0.6876 l
0.6520 0.6876 l
0.6535 0.6876 l
0.6551 0.6876 l
0.6567 0.6877 l
0.6582 0.6877 l
0.6598 0.6877 l
0.6614 0.6877 l
0.6629 0.6877 l
0.6645 0.6877 l
0.6661 0.6877 l
0.6676 0.6877 l
0.6692 0.6877 l
0.6708 0.6877 l
0.6724 0.6877 l
0.6739 0.6877 l
0.6755 0.6877 l
0.6771 0.6878 l
0.6786 0.6878 l
0.6802 0.6878 l
0.6818 0.6878 l
0.6833 0.6878 l
0.6849 0.6878 l
0.6865 0.6878 l
0.6880 0.6878 l
0.6896 0.6878 l
0.6912 0.6878 l
0.6927 0.6878 l
0.6943 0.6878 l
0.6959 0.6878 l
0.6975 0.6879 l
0.6990 0.6879 l
0.7006 0.6879 l
0.7022 0.6879 l
0.7037 0.6879 l
0.7053 0.6879 l
0.7069 0.6879 l
0.7084 0.6879 l
0.7100 0.6879 l
0.7116 0.6879 l
0.7131 0.6879 l
0.7147 0.6879 l
0.7163 0.6879 l
0.7178 0.6879 l
0.7194 0.6879 l
0.7210 0.6880 l
0.7225 0.6880 l
0.7241 0.6880 l
0.7257 0.6880 l
0.7273 0.6880 l
0.7288 0.6880 l
0.7304 0.6880 l
0.7320 0.6880 l
0.7335 0.6880 l
0.7351 0.6880 l
0.7367 0.6880 l
0.7382 0.6880 l
0.7398 0.6880 l
0.7414 0.6880 l
0.7429 0.6880 l
0.7445 0.6880 l
0.7461 0.6881 l
0.7476 0.6881 l
0.7492 0.6881 l
0.7508 0.6881 l
0.7524 0.6881 l
0.7539 0.6881 l
0.7555 0.6881 l
0.7571 0.6881 l
0.7586 0.6881 l
0.7602 0.6881 l
0.7618 0.6881 l
0.7633 0.6881 l
0.7649 0.6881 l
0.7665 0.6881 l
0.7680 0.6881 l
0.7696 0.6881 l
0.7712 0.6881 l
0.7727 0.6881 l
0.7743 0.6881 l
0.7759 0.6882 l
0.7775 0.6882 l
0.7790 0.6882 l
0.7806 0.6882 l
0.7822 0.6882 l
0.7837 0.6882 l
0.7853 0.6882 l
0.7869 0.6882 l
0.7884 0.6882 l
0.7900 0.6882 l
0.7916 0.6882 l
0.7931 0.6882 l
0.7947 0.6882 l
0.7963 0.6882 l
0.7978 0.6882 l
0.7994 0.6882 l
0.8010 0.6882 l
0.8025 0.6882 l
0.8041 0.6882 l
0.8057 0.6882 l
0.8073 0.6882 l
0.8088 0.6883 l
0.8104 0.6883 l
0.8120 0.6883 l
0.8135 0.6883 l
0.8151 0.6883 l
0.8167 0.6883 l
0.8182 0.6883 l
0.8198 0.6883 l
0.8214 0.6883 l
0.8229 0.6883 l
0.8245 0.6883 l
0.8261 0.6883 l
0.8276 0.6883 l
0.8292 0.6883 l
0.8308 0.6883 l
0.8324 0.6883 l
0.8339 0.6883 l
0.8355 0.6883 l
0.8371 0.6883 l
0.8386 0.6883 l
0.8402 0.6883 l
0.8418 0.6883 l
0.8433 0.6883 l
0.8449 0.6883 l
0.8465 0.6883 l
0.8480 0.6884 l
0.8496 0.6884 l
0.8512 0.6884 l
0.8527 0.6884 l
0.8543 0.6884 l
0.8559 0.6884 l
0.8575 0.6884 l
0.8590 0.6884 l
0.8606 0.6884 l
0.8622 0.6884 l
0.8637 0.6884 l
0.8653 0.6884 l
0.8669 0.6884 l
0.8684 0.6884 l
0.8700 0.6884 l
0.8716 0.6884 l
0.8731 0.6884 l
0.8747 0.6884 l
0.8763 0.6884 l
0.8778 0.6884 l
0.8794 0.6884 l
0.8810 0.6884 l
0.8825 0.6884 l
0.8841 0.6884 l
0.8857 0.6884 l
0.8873 0.6884 l
0.8888 0.6884 l
0.8904 0.6884 l
0.8920 0.6885 l
0.8935 0.6885 l
0.8951 0.6885 l
0.8967 0.6885 l
0.8982 0.6885 l
0.8998 0.6885 l
0.9014 0.6885 l
0.9029 0.6885 l
0.9045 0.6885 l
0.9061 0.6885 l
0.9076 0.6885 l
0.9092 0.6885 l
0.9108 0.6885 l
0.9124 0.6885 l
0.9139 0.6885 l
0.9155 0.6885 l
0.9171 0.6885 l
0.9186 0.6885 l
0.9202 0.6885 l
0.9218 0.6885 l
0.9233 0.6885 l
0.9249 0.6885 l
0.9265 0.6885 l
0.9280 0.6885 l
0.9296 0.6885 l
0.9312 0.6885 l
0.9327 0.6885 l
0.9343 0.6885 l
0.9359 0.6885 l
0.9375 0.6885 l
0.9390 0.6885 l
0.9406 0.6885 l
0.9422 0.6885 l
0.9437 0.6885 l
0.9453 0.6886 l
0.9469 0.6886 l
0.9484 0.6886 l
0.9500 0.6886 l
s
[/DeviceRGB] SCS
Color1 SC
[] 0 SD
0.0015 SLW
n
0.1971 0.1500 m
0.1971 0.1600 l
s
n
0.1971 0.9000 m
0.1971 0.8900 l
s
n
0.2284 0.1500 m
0.2284 0.1600 l
s
n
0.2284 0.9000 m
0.2284 0.8900 l
s
n
0.2598 0.1500 m
0.2598 0.1600 l
s
n
0.2598 0.9000 m
0.2598 0.8900 l
s
n
0.2912 0.1500 m
0.2912 0.1600 l
s
n
0.2912 0.9000 m
0.2912 0.8900 l
s
n
0.3539 0.1500 m
0.3539 0.1600 l
s
n
0.3539 0.9000 m
0.3539 0.8900 l
s
n
0.3853 0.1500 m
0.3853 0.1600 l
s
n
0.3853 0.9000 m
0.3853 0.8900 l
s
n
0.4167 0.1500 m
0.4167 0.1600 l
s
n
0.4167 0.9000 m
0.4167 0.8900 l
s
n
0.4480 0.1500 m
0.4480 0.1600 l
s
n
0.4480 0.9000 m
0.4480 0.8900 l
s
n
0.5108 0.1500 m
0.5108 0.1600 l
s
n
0.5108 0.9000 m
0.5108 0.8900 l
s
n
0.5422 0.1500 m
0.5422 0.1600 l
s
n
0.5422 0.9000 m
0.5422 0.8900 l
s
n
0.5735 0.1500 m
0.5735 0.1600 l
s
n
0.5735 0.9000 m
0.5735 0.8900 l
s
n
0.6049 0.1500 m
0.6049 0.1600 l
s
n
0.6049 0.9000 m
0.6049 0.8900 l
s
n
0.6676 0.1500 m
0.6676 0.1600 l
s
n
0.6676 0.9000 m
0.6676 0.8900 l
s
n
0.6990 0.1500 m
0.6990 0.1600 l
s
n
0.6990 0.9000 m
0.6990 0.8900 l
s
n
0.7304 0.1500 m
0.7304 0.1600 l
s
n
0.7304 0.9000 m
0.7304 0.8900 l
s
n
0.7618 0.1500 m
0.7618 0.1600 l
s
n
0.7618 0.9000 m
0.7618 0.8900 l
s
n
0.8245 0.1500 m
0.8245 0.1600 l
s
n
0.8245 0.9000 m
0.8245 0.8900 l
s
n
0.8559 0.1500 m
0.8559 0.1600 l
s
n
0.8559 0.9000 m
0.8559 0.8900 l
s
n
0.8873 0.1500 m
0.8873 0.1600 l
s
n
0.8873 0.9000 m
0.8873 0.8900 l
s
n
0.9186 0.1500 m
0.9186 0.1600 l
s
n
0.9186 0.9000 m
0.9186 0.8900 l
s
n
0.1657 0.1500 m
0.1657 0.1700 l
s
n
0.1657 0.9000 m
0.1657 0.8800 l
s
n
0.3225 0.1500 m
0.3225 0.1700 l
s
n
0.3225 0.9000 m
0.3225 0.8800 l
s
n
0.4794 0.1500 m
0.4794 0.1700 l
s
n
0.4794 0.9000 m
0.4794 0.8800 l
s
n
0.6363 0.1500 m
0.6363 0.1700 l
s
n
0.6363 0.9000 m
0.6363 0.8800 l
s
n
0.7931 0.1500 m
0.7931 0.1700 l
s
n
0.7931 0.9000 m
0.7931 0.8800 l
s
n
0.9500 0.1500 m
0.9500 0.1700 l
s
n
0.9500 0.9000 m
0.9500 0.8800 l
s
/Helvetica findfont
dup length dict begin
 {1 index /FID ne {def} {pop pop} ifelse} forall
 /Encoding DefEncoding def
 currentdict
end
/Font4 exch definefont pop
/Font4 FFSF
0.1431 0.1200 m
GS
[0.0280 0.0000 0.0000 0.0280 0 0] CC
(100) show
GR
/Font4 FFSF
0.3000 0.1200 m
GS
[0.0280 0.0000 0.0000 0.0280 0 0] CC
(200) show
GR
/Font4 FFSF
0.4569 0.1200 m
GS
[0.0280 0.0000 0.0000 0.0280 0 0] CC
(300) show
GR
/Font4 FFSF
0.6137 0.1200 m
GS
[0.0280 0.0000 0.0000 0.0280 0 0] CC
(400) show
GR
/Font4 FFSF
0.7706 0.1200 m
GS
[0.0280 0.0000 0.0000 0.0280 0 0] CC
(500) show
GR
/Font4 FFSF
0.9275 0.1200 m
GS
[0.0280 0.0000 0.0000 0.0280 0 0] CC
(600) show
GR
/Font4 FFSF
0.4818 0.0845 m
GS
[0.0336 0.0000 0.0000 0.0336 0 0] CC
(M) show
GR
/Font4 FFSF
0.5096 0.0711 m
GS
[0.0238 0.0000 0.0000 0.0238 0 0] CC
(A) show
GR
/Font4 FFSF
0.5253 0.0845 m
GS
[0.0336 0.0000 0.0000 0.0336 0 0] CC
( [GeV]) show
GR
n
0.1500 0.2064 m
0.1600 0.2064 l
s
n
0.9500 0.2064 m
0.9400 0.2064 l
s
n
0.1500 0.2395 m
0.1600 0.2395 l
s
n
0.9500 0.2395 m
0.9400 0.2395 l
s
n
0.1500 0.2629 m
0.1600 0.2629 l
s
n
0.9500 0.2629 m
0.9400 0.2629 l
s
n
0.1500 0.2811 m
0.1600 0.2811 l
s
n
0.9500 0.2811 m
0.9400 0.2811 l
s
n
0.1500 0.2959 m
0.1600 0.2959 l
s
n
0.9500 0.2959 m
0.9400 0.2959 l
s
n
0.1500 0.3085 m
0.1600 0.3085 l
s
n
0.9500 0.3085 m
0.9400 0.3085 l
s
n
0.1500 0.3193 m
0.1600 0.3193 l
s
n
0.9500 0.3193 m
0.9400 0.3193 l
s
n
0.1500 0.3289 m
0.1600 0.3289 l
s
n
0.9500 0.3289 m
0.9400 0.3289 l
s
n
0.1500 0.3375 m
0.1600 0.3375 l
s
n
0.9500 0.3375 m
0.9400 0.3375 l
s
n
0.1500 0.3939 m
0.1600 0.3939 l
s
n
0.9500 0.3939 m
0.9400 0.3939 l
s
n
0.1500 0.4270 m
0.1600 0.4270 l
s
n
0.9500 0.4270 m
0.9400 0.4270 l
s
n
0.1500 0.4504 m
0.1600 0.4504 l
s
n
0.9500 0.4504 m
0.9400 0.4504 l
s
n
0.1500 0.4686 m
0.1600 0.4686 l
s
n
0.9500 0.4686 m
0.9400 0.4686 l
s
n
0.1500 0.4834 m
0.1600 0.4834 l
s
n
0.9500 0.4834 m
0.9400 0.4834 l
s
n
0.1500 0.4960 m
0.1600 0.4960 l
s
n
0.9500 0.4960 m
0.9400 0.4960 l
s
n
0.1500 0.5068 m
0.1600 0.5068 l
s
n
0.9500 0.5068 m
0.9400 0.5068 l
s
n
0.1500 0.5164 m
0.1600 0.5164 l
s
n
0.9500 0.5164 m
0.9400 0.5164 l
s
n
0.1500 0.5250 m
0.1600 0.5250 l
s
n
0.9500 0.5250 m
0.9400 0.5250 l
s
n
0.1500 0.5814 m
0.1600 0.5814 l
s
n
0.9500 0.5814 m
0.9400 0.5814 l
s
n
0.1500 0.6145 m
0.1600 0.6145 l
s
n
0.9500 0.6145 m
0.9400 0.6145 l
s
n
0.1500 0.6379 m
0.1600 0.6379 l
s
n
0.9500 0.6379 m
0.9400 0.6379 l
s
n
0.1500 0.6561 m
0.1600 0.6561 l
s
n
0.9500 0.6561 m
0.9400 0.6561 l
s
n
0.1500 0.6709 m
0.1600 0.6709 l
s
n
0.9500 0.6709 m
0.9400 0.6709 l
s
n
0.1500 0.6835 m
0.1600 0.6835 l
s
n
0.9500 0.6835 m
0.9400 0.6835 l
s
n
0.1500 0.6943 m
0.1600 0.6943 l
s
n
0.9500 0.6943 m
0.9400 0.6943 l
s
n
0.1500 0.7039 m
0.1600 0.7039 l
s
n
0.9500 0.7039 m
0.9400 0.7039 l
s
n
0.1500 0.7125 m
0.1600 0.7125 l
s
n
0.9500 0.7125 m
0.9400 0.7125 l
s
n
0.1500 0.7689 m
0.1600 0.7689 l
s
n
0.9500 0.7689 m
0.9400 0.7689 l
s
n
0.1500 0.8020 m
0.1600 0.8020 l
s
n
0.9500 0.8020 m
0.9400 0.8020 l
s
n
0.1500 0.8254 m
0.1600 0.8254 l
s
n
0.9500 0.8254 m
0.9400 0.8254 l
s
n
0.1500 0.8436 m
0.1600 0.8436 l
s
n
0.9500 0.8436 m
0.9400 0.8436 l
s
n
0.1500 0.8584 m
0.1600 0.8584 l
s
n
0.9500 0.8584 m
0.9400 0.8584 l
s
n
0.1500 0.8710 m
0.1600 0.8710 l
s
n
0.9500 0.8710 m
0.9400 0.8710 l
s
n
0.1500 0.8818 m
0.1600 0.8818 l
s
n
0.9500 0.8818 m
0.9400 0.8818 l
s
n
0.1500 0.8914 m
0.1600 0.8914 l
s
n
0.9500 0.8914 m
0.9400 0.8914 l
s
n
0.1500 0.9000 m
0.1600 0.9000 l
s
n
0.9500 0.9000 m
0.9400 0.9000 l
s
n
0.1500 0.1500 m
0.1700 0.1500 l
s
n
0.9500 0.1500 m
0.9300 0.1500 l
s
n
0.1500 0.3375 m
0.1700 0.3375 l
s
n
0.9500 0.3375 m
0.9300 0.3375 l
s
n
0.1500 0.5250 m
0.1700 0.5250 l
s
n
0.9500 0.5250 m
0.9300 0.5250 l
s
n
0.1500 0.7125 m
0.1700 0.7125 l
s
n
0.9500 0.7125 m
0.9300 0.7125 l
s
n
0.1500 0.9000 m
0.1700 0.9000 l
s
n
0.9500 0.9000 m
0.9300 0.9000 l
s
/Font4 FFSF
0.0922 0.1349 m
GS
[0.0280 0.0000 0.0000 0.0280 0 0] CC
(10) show
GR
/Font4 FFSF
0.1231 0.1517 m
GS
[0.0198 0.0000 0.0000 0.0198 0 0] CC
(-4) show
GR
/Font4 FFSF
0.0922 0.3224 m
GS
[0.0280 0.0000 0.0000 0.0280 0 0] CC
(10) show
GR
/Font4 FFSF
0.1231 0.3392 m
GS
[0.0198 0.0000 0.0000 0.0198 0 0] CC
(-3) show
GR
/Font4 FFSF
0.0922 0.5099 m
GS
[0.0280 0.0000 0.0000 0.0280 0 0] CC
(10) show
GR
/Font4 FFSF
0.1231 0.5267 m
GS
[0.0198 0.0000 0.0000 0.0198 0 0] CC
(-2) show
GR
/Font4 FFSF
0.0957 0.6974 m
GS
[0.0280 0.0000 0.0000 0.0280 0 0] CC
(10) show
GR
/Font4 FFSF
0.1267 0.7142 m
GS
[0.0198 0.0000 0.0000 0.0198 0 0] CC
(-1) show
GR
/Font4 FFSF
0.0988 0.8849 m
GS
[0.0280 0.0000 0.0000 0.0280 0 0] CC
(10) show
GR
/Font4 FFSF
0.1298 0.9017 m
GS
[0.0198 0.0000 0.0000 0.0198 0 0] CC
(0) show
GR
/Font4 FFSF
0.0747 0.4825 m
GS
[0.0000 0.0336 -0.0336 0.0000 0 0] CC
(BR\(h\)) show
GR
n
0.1500 0.1500 m
0.1500 0.9000 l
0.9500 0.9000 l
0.9500 0.1500 l
0.1500 0.1500 l
c
s
n
0.7000 0.6300 m
0.7000 0.2182 l
0.9290 0.2182 l
0.9290 0.6300 l
c
[/DeviceRGB] SCS
Color0 SC
fill
[/DeviceRGB] SCS
Color1 SC
n
0.7000 0.6300 m
0.7000 0.2182 l
0.9290 0.2182 l
0.9290 0.6300 l
0.7000 0.6300 l
c
s
/Font4 FFSF
0.7872 0.5735 m
GS
[0.0224 0.0000 0.0000 0.0224 0 0] CC
(BR\(h -> bb\)) show
GR
[/DeviceRGB] SCS
Color2 SC
[] 0 SD
0.0045 SLW
n
0.7122 0.5794 m
0.7722 0.5794 l
s
/Font4 FFSF
[/DeviceRGB] SCS
Color1 SC
0.7872 0.5324 m
GS
[0.0224 0.0000 0.0000 0.0224 0 0] CC
(BR\(h -> cc\)) show
GR
[/DeviceRGB] SCS
Color3 SC
n
0.7122 0.5382 m
0.7722 0.5382 l
s
/Font4 FFSF
[/DeviceRGB] SCS
Color1 SC
0.7872 0.4912 m
GS
[0.0224 0.0000 0.0000 0.0224 0 0] CC
(BR\(h -> ) show
GR
/Symbol findfont
/Font12 exch definefont pop
/Font12 FFSF
0.8712 0.4912 m
GS
[0.0224 0.0000 0.0000 0.0224 0 0] CC
(tt) show
GR
/Font4 FFSF
0.8908 0.4912 m
GS
[0.0224 0.0000 0.0000 0.0224 0 0] CC
(\)) show
GR
[/DeviceRGB] SCS
Color4 SC
n
0.7122 0.4971 m
0.7722 0.4971 l
s
/Font4 FFSF
[/DeviceRGB] SCS
Color1 SC
0.7872 0.4500 m
GS
[0.0224 0.0000 0.0000 0.0224 0 0] CC
(BR\(h -> ) show
GR
/Font12 FFSF
0.8712 0.4500 m
GS
[0.0224 0.0000 0.0000 0.0224 0 0] CC
(mm) show
GR
/Font4 FFSF
0.8971 0.4500 m
GS
[0.0224 0.0000 0.0000 0.0224 0 0] CC
(\)) show
GR
[/DeviceRGB] SCS
Color5 SC
n
0.7122 0.4557 m
0.7722 0.4557 l
s
/Font4 FFSF
[/DeviceRGB] SCS
Color1 SC
0.7872 0.4084 m
GS
[0.0224 0.0000 0.0000 0.0224 0 0] CC
(BR\(h -> WW\)) show
GR
[/DeviceRGB] SCS
Color6 SC
n
0.7122 0.4143 m
0.7722 0.4143 l
s
/Font4 FFSF
[/DeviceRGB] SCS
Color1 SC
0.7872 0.3673 m
GS
[0.0224 0.0000 0.0000 0.0224 0 0] CC
(BR\(h -> ZZ\)) show
GR
[/DeviceRGB] SCS
Color7 SC
n
0.7122 0.3731 m
0.7722 0.3731 l
s
/Font4 FFSF
[/DeviceRGB] SCS
Color1 SC
0.7872 0.3261 m
GS
[0.0224 0.0000 0.0000 0.0224 0 0] CC
(BR\(h -> ) show
GR
/Font12 FFSF
0.8712 0.3261 m
GS
[0.0224 0.0000 0.0000 0.0224 0 0] CC
(gg) show
GR
/Font4 FFSF
0.8896 0.3261 m
GS
[0.0224 0.0000 0.0000 0.0224 0 0] CC
(\)) show
GR
[/DeviceRGB] SCS
Color8 SC
n
0.7122 0.3318 m
0.7722 0.3318 l
s
/Font4 FFSF
[/DeviceRGB] SCS
Color1 SC
0.7872 0.2845 m
GS
[0.0224 0.0000 0.0000 0.0224 0 0] CC
(BR\(h -> Z) show
GR
/Font12 FFSF
0.8849 0.2845 m
GS
[0.0224 0.0000 0.0000 0.0224 0 0] CC
(g) show
GR
/Font4 FFSF
0.8939 0.2845 m
GS
[0.0224 0.0000 0.0000 0.0224 0 0] CC
(\)) show
GR
[/DeviceRGB] SCS
Color9 SC
n
0.7122 0.2902 m
0.7722 0.2902 l
s
/Font4 FFSF
[/DeviceRGB] SCS
Color1 SC
0.7872 0.2429 m
GS
[0.0224 0.0000 0.0000 0.0224 0 0] CC
(BR\(h -> gg\)) show
GR
[/DeviceRGB] SCS
Color10 SC
n
0.7122 0.2488 m
0.7722 0.2488 l
s
/Font4 FFSF
[/DeviceRGB] SCS
Color1 SC
0.9700 0.7000 m
GS
[0.0000 0.0168 -0.0168 0.0000 0 0] CC
(LHC Higgs XS WG 2013) show
GR
/Font12 FFSF
0.7150 0.6050 m
GS
[0.0224 0.0000 0.0000 0.0224 0 0] CC
(t) show
GR
/Font4 FFSF
0.7248 0.6050 m
GS
[0.0224 0.0000 0.0000 0.0224 0 0] CC
(-phobic, tan) show
GR
/Font12 FFSF
0.8417 0.6050 m
GS
[0.0224 0.0000 0.0000 0.0224 0 0] CC
(b) show
GR
/Font4 FFSF
0.8538 0.6050 m
GS
[0.0224 0.0000 0.0000 0.0224 0 0] CC
( = 50) show
GR
%%Trailer
%%BoundingBox: 29 42 597 562
%%DocumentNeededResources: font Helvetica
%%+ font Symbol
%%EOF
