%!PS-Adobe-2.0 EPSF-2.0
%%BoundingBox:  0 0 567 544
%%Title: HWW_600_DeltaPhi_ll_reweighting_cut_YR3.eps: HWW 600Gev dPhi reweighting for interference with cuts
%%Creator: ROOT Version 5.34/05
%%CreationDate: Fri Jun 14 04:56:11 2013
%%EndComments
%%BeginProlog
80 dict begin
/s {stroke} def /l {lineto} def /m {moveto} def /t {translate} def
/r {rotate} def /rl {roll}  def /R {repeat} def
/d {rlineto} def /rm {rmoveto} def /gr {grestore} def /f {eofill} def
/c {setrgbcolor} def /black {0 setgray} def /sd {setdash} def
/cl {closepath} def /sf {scalefont setfont} def /lw {setlinewidth} def
/box {m dup 0 exch d exch 0 d 0 exch neg d cl} def
/NC{systemdict begin initclip end}def/C{NC box clip newpath}def
/bl {box s} def /bf {box f} def /Y { 0 exch d} def /X { 0 d} def 
/K {{pop pop 0 moveto} exch kshow} bind def
/ita {/ang 15 def gsave [1 0 ang dup sin exch cos div 1 0 0] concat} def 
/mp {newpath /y exch def /x exch def} def
/side {[w .77 mul w .23 mul] .385 w mul sd w 0 l currentpoint t -144 r} def
/mr {mp x y w2 0 360 arc} def /m24 {mr s} def /m20 {mr f} def
/mb {mp x y w2 add m w2 neg 0 d 0 w neg d w 0 d 0 w d cl} def
/mt {mp x y w2 add m w2 neg w neg d w 0 d cl} def
/m21 {mb f} def /m25 {mb s} def /m22 {mt f} def /m26{mt s} def
/m23 {mp x y w2 sub m w2 w d w neg 0 d cl f} def
/m27 {mp x y w2 add m w3 neg w2 neg d w3 w2 neg d w3 w2 d cl s} def
/m28 {mp x w2 sub y w2 sub w3 add m w3 0 d  0 w3 neg d w3 0 d 0 w3 d w3 0 d  0 w3 d w3 neg 0 d 0 w3 d w3 neg 0 d 0 w3 neg d w3 neg 0 d cl s } def
/m29 {mp gsave x w2 sub y w2 add w3 sub m currentpoint t 4 {side} repeat cl fill gr} def
/m30 {mp gsave x w2 sub y w2 add w3 sub m currentpoint t 4 {side} repeat cl s gr} def
/m31 {mp x y w2 sub m 0 w d x w2 sub y m w 0 d x w2 sub y w2 add m w w neg d x w2 sub y w2 sub m w w d s} def
/m32 {mp x y w2 sub m w2 w d w neg 0 d cl s} def
/m33 {mp x y w2 add m w3 neg w2 neg d w3 w2 neg d w3 w2 d cl f} def
/m34 {mp x w2 sub y w2 sub w3 add m w3 0 d  0 w3 neg d w3 0 d 0 w3 d w3 0 d  0 w3 d w3 neg 0 d 0 w3 d w3 neg 0 d 0 w3 neg d w3 neg 0 d cl f } def
/m2 {mp x y w2 sub m 0 w d x w2 sub y m w 0 d s} def
/m5 {mp x w2 sub y w2 sub m w w d x w2 sub y w2 add m w w neg d s} def
/reEncode {exch findfont dup length dict begin {1 index /FID eq  {pop pop} {def} ifelse } forall /Encoding exch def currentdict end dup /FontName get exch definefont pop } def [/Times-Bold /Times-Italic /Times-BoldItalic /Helvetica /Helvetica-Oblique
 /Helvetica-Bold /Helvetica-BoldOblique /Courier /Courier-Oblique /Courier-Bold /Courier-BoldOblique /Times-Roman /AvantGarde-Book /AvantGarde-BookOblique /AvantGarde-Demi /AvantGarde-DemiOblique /Bookman-Demi /Bookman-DemiItalic /Bookman-Light
 /Bookman-LightItalic /Helvetica-Narrow /Helvetica-Narrow-Bold /Helvetica-Narrow-BoldOblique /Helvetica-Narrow-Oblique /NewCenturySchlbk-Roman /NewCenturySchlbk-Bold /NewCenturySchlbk-BoldItalic /NewCenturySchlbk-Italic /Palatino-Bold
 /Palatino-BoldItalic /Palatino-Italic /Palatino-Roman ] {ISOLatin1Encoding reEncode } forall
%%EndProlog
%%BeginSetup
%%EndSetup
newpath  gsave  .25 .25 scale  gsave  0 0 t black[  ] 0 sd 3 lw 1 1 1 c 2268 2177 0 0 bf black 1 1 1 c 2268 1568 0 609 bf black 1 1 1 c 1814 1411 227 609 bf black 1814 1411 227 609 bl 0 0 1 c 1 1 1 c 0 0 1 c 227 609 m 90 X 734 Y 10 X 263 Y 9 X 68 Y 9
 X 68 Y 9 X 59 Y 9 X 50 Y 9 X 43 Y 9 X 40 Y 9 X 1 Y 9 X 7 Y 9 X -45 Y 9 X -39 Y 9 X -64 Y 9 X -63 Y 9 X -73 Y 10 X -64 Y 9 X -75 Y 9 X -68 Y 9 X -68 Y 9 X -68 Y 9 X -61 Y 9 X -48 Y 9 X -56 Y 9 X -43 Y 9 X -36 Y 9 X -42 Y 9 X -36 Y 9 X -28 Y 9 X -28 Y
 10 X -32 Y 9 X -24 Y 9 X -18 Y 9 X -15 Y 9 X -21 Y 9 X -15 Y 9 X -9 Y 9 X -19 Y 9 X -9 Y 9 X -11 Y 9 X -11 Y 9 X -6 Y 9 X -10 Y 9 X -9 Y 10 X -7 Y 9 X -5 Y 9 X -1 Y 9 X -10 Y 9 X -4 Y 9 X -6 Y 9 X -2 Y 9 X -3 Y 9 X -5 Y 9 X 1 Y 9 X -9 Y 18 X -3 Y 19
 X -6 Y 9 X 3 Y 9 X -7 Y 9 X -2 Y 18 X -1 Y 9 X -2 Y 18 X -3 Y 27 X -2 Y 18 X -3 Y 10 X 1 Y 9 X -2 Y 27 X -2 Y 9 X -1 Y 9 X 2 Y 9 X -2 Y 9 X 1 Y 9 X -1 Y 9 X -3 Y 9 X 2 Y 9 X 2 Y 9 X -1 Y 10 X -2 Y 18 X -1 Y 9 X 1 Y 18 X 2 Y 9 X -4 Y 9 X 3 Y 9 X -1 Y
 27 X 2 Y 27 X -1 Y 10 X 2 Y 9 X -1 Y 18 X 2 Y 9 X -2 Y 9 X 2 Y 9 X 3 Y 9 X -1 Y 9 X 1 Y 18 X 2 Y 9 X 2 Y 9 X -2 Y 9 X 1 Y 10 X 2 Y 9 X 1 Y 9 X 1 Y 9 X 4 Y 18 X -1 Y 9 X 1 Y 9 X 5 Y 9 X 2 Y 9 X 5 Y 9 X 1 Y 18 X 4 Y 9 X 1 Y 10 X 3 Y 9 X 5 Y 9 X 5 Y 9
 X 2 Y 9 X 7 Y 9 X 4 Y 9 X 4 Y 9 X 5 Y 9 X 7 Y 9 X 4 Y 9 X 12 Y 9 X 11 Y 9 X 6 Y 9 X 10 Y 10 X 11 Y 9 X 8 Y 9 X 15 Y 9 X 12 Y 9 X 21 Y 9 X 12 Y 9 X 17 Y 9 X 25 Y 9 X 20 Y 9 X 25 Y 9 X 33 Y 9 X 32 Y 9 X 31 Y 9 X 43 Y 10 X 34 Y 9 X 51 Y 9 X 47 Y 9 X 52
 Y 9 X 62 Y 9 X 58 Y 9 X 71 Y 9 X 70 Y 9 X 65 Y 9 X 82 Y 9 X 65 Y 9 X 69 Y 9 X 61 Y 9 X 42 Y 10 X 37 Y 9 X 16 Y 9 X -26 Y 9 X -18 Y 9 X -63 Y 9 X -42 Y 9 X -52 Y 9 X -82 Y 9 X -72 Y 9 X -256 Y 9 X -733 Y 91 X s black 227 609 m 1814 X s 356 647 m -38
 Y s 408 628 m -19 Y s 460 628 m -19 Y s 512 628 m -19 Y s 564 628 m -19 Y s 616 647 m -38 Y s 667 628 m -19 Y s 719 628 m -19 Y s 771 628 m -19 Y s 823 628 m -19 Y s 875 647 m -38 Y s 927 628 m -19 Y s 978 628 m -19 Y s 1030 628 m -19 Y s 1082 628 m
 -19 Y s 1134 647 m -38 Y s 1186 628 m -19 Y s 1238 628 m -19 Y s 1289 628 m -19 Y s 1341 628 m -19 Y s 1393 647 m -38 Y s 1445 628 m -19 Y s 1497 628 m -19 Y s 1549 628 m -19 Y s 1600 628 m -19 Y s 1652 647 m -38 Y s 1704 628 m -19 Y s 1756 628 m
 -19 Y s 1808 628 m -19 Y s 1860 628 m -19 Y s 1911 647 m -38 Y s 356 647 m -38 Y s 305 628 m -19 Y s 253 628 m -19 Y s 1911 647 m -38 Y s 1963 628 m -19 Y s 2015 628 m -19 Y s
 gsave  2268 1568 0 609 C 330.471 558.382 t 0 r /Helvetica findfont 49.4479 sf 0 0 m (\2553) show NC gr 
 gsave  2268 1568 0 609 C 592.569 558.382 t 0 r /Helvetica findfont 49.4479 sf 0 0 m (\2552) show NC gr 
 gsave  2268 1568 0 609 C 854.667 558.382 t 0 r /Helvetica findfont 49.4479 sf 0 0 m (\2551) show NC gr 
 gsave  2268 1568 0 609 C 1116.76 558.382 t 0 r /Helvetica findfont 49.4479 sf 0 0 m (0) show NC gr 
 gsave  2268 1568 0 609 C 1378.86 558.382 t 0 r /Helvetica findfont 49.4479 sf 0 0 m (1) show NC gr 
 gsave  2268 1568 0 609 C 1633.36 558.382 t 0 r /Helvetica findfont 49.4479 sf 0 0 m (2) show NC gr 
 gsave  2268 1568 0 609 C 1895.46 558.382 t 0 r /Helvetica findfont 49.4479 sf 0 0 m (3) show NC gr  227 609 m 1411 Y s
 gsave  2268 1568 0 609 C 49.3808 1371.27 t 90 r /Symbol findfont 49.4479 sf 0 0 m (f) show NC gr 
 gsave  2268 1568 0 609 C 49.3808 1340.88 t 90 r /Symbol findfont 49.4479 sf 0 0 m (D) show NC gr 
 gsave  2268 1568 0 609 C 49.3808 1295.3 t 90 r /Helvetica findfont 49.4479 sf 0 0 m (/d) show NC gr 
 gsave  2268 1568 0 609 C 49.3808 1264.91 t 90 r /Symbol findfont 49.4479 sf 0 0 m (s) show NC gr 
 gsave  2268 1568 0 609 C 49.3808 1238.32 t 90 r /Helvetica findfont 49.4479 sf 0 0 m (d) show NC gr  288 609 m -61 X s 257 651 m -30 X s 257 693 m -30 X s 257 735 m -30 X s 288 777 m -61 X s 257 819 m -30 X s 257 861 m -30 X s 257 903 m -30 X s 288
 945 m -61 X s 257 987 m -30 X s 257 1029 m -30 X s 257 1070 m -30 X s 288 1112 m -61 X s 257 1154 m -30 X s 257 1196 m -30 X s 257 1238 m -30 X s 288 1280 m -61 X s 257 1322 m -30 X s 257 1364 m -30 X s 257 1406 m -30 X s 288 1448 m -61 X s 257 1490
 m -30 X s 257 1532 m -30 X s 257 1573 m -30 X s 288 1615 m -61 X s 257 1657 m -30 X s 257 1699 m -30 X s 257 1741 m -30 X s 288 1783 m -61 X s 257 1825 m -30 X s 257 1867 m -30 X s 257 1909 m -30 X s 288 1951 m -61 X s 288 1951 m -61 X s 257 1993 m
 -30 X s
 gsave  2268 1568 0 609 C 186.127 592.569 t 0 r /Helvetica findfont 49.4479 sf 0 0 m (0) show NC gr 
 gsave  2268 1568 0 609 C 91.1645 759.704 t 0 r /Helvetica findfont 49.4479 sf 0 0 m (0.002) show NC gr 
 gsave  2268 1568 0 609 C 87.366 926.839 t 0 r /Helvetica findfont 49.4479 sf 0 0 m (0.004) show NC gr 
 gsave  2268 1568 0 609 C 91.1645 1093.97 t 0 r /Helvetica findfont 49.4479 sf 0 0 m (0.006) show NC gr 
 gsave  2268 1568 0 609 C 91.1645 1261.11 t 0 r /Helvetica findfont 49.4479 sf 0 0 m (0.008) show NC gr 
 gsave  2268 1568 0 609 C 125.351 1432.04 t 0 r /Helvetica findfont 49.4479 sf 0 0 m (0.01) show NC gr 
 gsave  2268 1568 0 609 C 91.1645 1599.18 t 0 r /Helvetica findfont 49.4479 sf 0 0 m (0.012) show NC gr 
 gsave  2268 1568 0 609 C 87.366 1766.31 t 0 r /Helvetica findfont 49.4479 sf 0 0 m (0.014) show NC gr 
 gsave  2268 1568 0 609 C 91.1645 1933.45 t 0 r /Helvetica findfont 49.4479 sf 0 0 m (0.016) show NC gr  0 0 1 c /w 2 def /w2 {w 2 div} def /w3 {w 3 div} def 231 609 m20 240 609 m20 249 609 m20 259 609 m20 268 609 m20 277 609 m20 286 609 m20 295 609
 m20 304 609 m20 313 609 m20 322 1343 m20 331 1606 m20 340 1674 m20 349 1742 m20 358 1801 m20 367 1851 m20 376 1894 m20 386 1934 m20 395 1935 m20 404 1942 m20 413 1897 m20 422 1858 m20 431 1794 m20 440 1731 m20 449 1658 m20 458 1594 m20 467 1519 m20
 476 1451 m20 485 1383 m20 494 1315 m20 503 1254 m20 513 1206 m20 522 1150 m20 531 1107 m20 540 1071 m20 549 1029 m20 558 993 m20 567 965 m20 576 937 m20 585 905 m20 594 881 m20 603 863 m20 612 848 m20 621 827 m20 630 812 m20 639 803 m20 649 784 m20
 658 775 m20 667 764 m20 676 753 m20 685 747 m20 694 737 m20 703 728 m20 712 721 m20 721 716 m20 730 715 m20 739 705 m20 748 701 m20 757 695 m20 766 693 m20 776 690 m20 785 685 m20 794 686 m20 803 677 m20 812 677 m20 821 674 m20 830 674 m20 839 668
 m20 848 671 m20 857 664 m20 866 662 m20 875 662 m20 884 661 m20 893 659 m20 903 659 m20 912 656 m20 921 656 m20 930 656 m20 939 654 m20 948 654 m20 957 651 m20 966 652 m20 975 650 m20 984 650 m20 993 650 m20 1002 648 m20 1011 647 m20 1020 649 m20
 1030 647 m20 1039 648 m20 1048 647 m20 1057 644 m20 1066 646 m20 1075 648 m20 1084 647 m20 1093 645 m20 1102 645 m20 1111 644 m20 1120 645 m20 1129 645 m20 1138 647 m20 1147 643 m20 1157 646 m20 1166 645 m20 1175 645 m20 1184 645 m20 1193 647 m20
 1202 647 m20 1211 647 m20 1220 646 m20 1229 648 m20 1238 647 m20 1247 647 m20 1256 649 m20 1265 647 m20 1274 649 m20 1284 652 m20 1293 651 m20 1302 652 m20 1311 652 m20 1320 654 m20 1329 656 m20 1338 654 m20 1347 655 m20 1356 657 m20 1365 658 m20
 1374 659 m20 1383 663 m20 1392 663 m20 1401 662 m20 1411 663 m20 1420 668 m20 1429 670 m20 1438 675 m20 1447 676 m20 1456 676 m20 1465 680 m20 1474 681 m20 1483 684 m20 1492 689 m20 1501 694 m20 1510 696 m20 1519 703 m20 1528 707 m20 1538 711 m20
 1547 716 m20 1556 723 m20 1565 727 m20 1574 739 m20 1583 750 m20 1592 756 m20 1601 766 m20 1610 777 m20 1619 785 m20 1628 800 m20 1637 812 m20 1646 833 m20 1655 845 m20 1665 862 m20 1674 887 m20 1683 907 m20 1692 932 m20 1701 965 m20 1710 997 m20
 1719 1028 m20 1728 1071 m20 1737 1105 m20 1746 1156 m20 1755 1203 m20 1764 1255 m20 1773 1317 m20 1782 1375 m20 1791 1446 m20 1801 1516 m20 1810 1581 m20 1819 1663 m20 1828 1728 m20 1837 1797 m20 1846 1858 m20 1855 1900 m20 1864 1937 m20 1873 1953
 m20 1882 1927 m20 1891 1909 m20 1900 1846 m20 1909 1804 m20 1918 1752 m20 1928 1670 m20 1937 1598 m20 1946 1342 m20 1955 609 m20 1964 609 m20 1973 609 m20 1982 609 m20 1991 609 m20 2000 609 m20 2009 609 m20 2018 609 m20 2027 609 m20 2036 609 m20
 black 0 0 1 c 1 lw << /PatternType 1 /PaintType 2 /TilingType 1 /BBox [ 0 0 100 100 ] /XStep 100 /YStep 100 /PaintProc { begin gsave 0 0 m 100 100 l 0 100 m 100 0 l s gr end } >> [ 0.24 0 0 0.24 0 0 ] makepattern /P13 exch def /cs {[/Pattern
 /DeviceRGB] setcolorspace} def /FA {f [/DeviceRGB] setcolorspace} def cs 0 0 1 P13 setcolor 231 609 m 82 X 9 739 d 9 264 d 9 68 d 9 68 d 9 59 d 9 51 d 9 43 d 10 39 d 9 2 d 9 7 d 9 -45 d 9 -40 d 9 -64 d 9 -62 d 9 -74 d 9 -64 d 9 -76 d 9 -67 d 9 -69 d
 9 -68 d 9 -62 d 10 -47 d 9 -57 d 9 -43 d 9 -36 d 9 -42 d 9 -37 d 9 -28 d 9 -27 d 9 -33 d 9 -24 d 9 -18 d 9 -16 d 9 -20 d 9 -15 d 9 -9 d 10 -19 d 9 -9 d 9 -12 d 9 -10 d 9 -7 d 9 -10 d 9 -9 d 9 -7 d 9 -5 d 9 -1 d 9 -10 d 9 -4 d 9 -6 d 9 -2 d 10 -3 d 9
 -5 d 9 1 d 9 -9 d 9 X 9 -3 d 9 -1 d 9 -5 d 9 3 d 9 -7 d 9 -2 d 9 X 9 -2 d 9 -1 d 10 -1 d 9 -2 d 9 -1 d 9 1 d 9 -3 d 9 X 9 -3 d 9 1 d 9 -1 d 9 -1 d 9 1 d 9 -3 d 9 -1 d 9 3 d 10 -2 d 9 X 9 -1 d 9 -2 d 9 1 d 9 3 d 9 -2 d 9 -2 d 9 X 9 -1 d 9 1 d 9 1 d 9
 2 d 9 -5 d 10 3 d 9 -1 d 9 X 9 1 d 9 1 d 9 1 d 9 X 9 -1 d 9 1 d 9 -1 d 9 1 d 9 2 d 9 -3 d 9 2 d 10 3 d 9 -1 d 9 1 d 9 1 d 9 2 d 9 2 d 9 -3 d 9 2 d 9 2 d 9 X 9 1 d 9 4 d 18 X 10 1 d 9 4 d 9 2 d 9 5 d 9 2 d 9 -1 d 9 4 d 9 1 d 9 4 d 9 5 d 9 5 d 9 1 d 9
 8 d 9 4 d 10 4 d 9 5 d 9 7 d 9 4 d 9 13 d 9 10 d 9 7 d 9 9 d 9 11 d 9 9 d 9 14 d 9 13 d 9 20 d 9 12 d 10 18 d 9 26 d 9 20 d 9 25 d 9 33 d 9 32 d 9 31 d 9 43 d 9 34 d 9 51 d 9 48 d 9 52 d 9 62 d 9 58 d 9 71 d 10 70 d 9 66 d 9 82 d 9 66 d 9 69 d 9 60
 d 9 43 d 9 37 d 9 15 d 9 -25 d 9 -19 d 9 -63 d 9 -42 d 9 -51 d 10 -83 d 9 -72 d 9 -257 d 9 -738 d 81 X -81 X -9 728 d -9 256 d -9 71 d -10 82 d -9 51 d -9 42 d -9 63 d -9 19 d -9 25 d -9 -15 d -9 -37 d -9 -43 d -9 -60 d -9 -69 d -9 -65 d -9 -81 d -9
 -66 d -10 -70 d -9 -70 d -9 -57 d -9 -62 d -9 -52 d -9 -47 d -9 -51 d -9 -34 d -9 -43 d -9 -31 d -9 -31 d -9 -33 d -9 -25 d -9 -20 d -9 -25 d -10 -17 d -9 -12 d -9 -20 d -9 -13 d -9 -14 d -9 -9 d -9 -11 d -9 -9 d -9 -6 d -9 -11 d -9 -12 d -9 -5 d -9
 -6 d -9 -5 d -10 -4 d -9 -4 d -9 -7 d -9 -2 d -9 -4 d -9 -6 d -9 -3 d -9 -1 d -9 -4 d -9 X -9 -1 d -9 -5 d -9 -2 d -9 -4 d -10 -1 d -18 X -9 -4 d -9 -1 d -9 X -9 -2 d -9 -2 d -9 3 d -9 -2 d -9 -2 d -9 -1 d -18 X -10 -3 d -9 -1 d -9 2 d -9 -2 d -18 X
 -9 -1 d -9 1 d -18 X -9 -2 d -9 -1 d -9 1 d -9 X -10 -3 d -9 5 d -9 -2 d -9 -1 d -27 X -9 2 d -9 2 d -9 -3 d -9 -1 d -9 3 d -9 1 d -9 -1 d -10 2 d -9 -2 d -9 X -9 3 d -18 X -9 1 d -9 -1 d -9 3 d -9 X -9 3 d -9 -1 d -9 1 d -9 2 d -10 1 d -9 1 d -9 2
 d -9 X -9 2 d -9 7 d -9 -3 d -9 5 d -9 1 d -9 3 d -9 -1 d -9 9 d -9 -1 d -9 5 d -10 3 d -9 2 d -9 6 d -9 4 d -9 10 d -9 1 d -9 5 d -9 7 d -9 9 d -9 10 d -9 6 d -9 11 d -9 11 d -9 9 d -10 18 d -9 10 d -9 14 d -9 21 d -9 15 d -9 18 d -9 24 d -9 32 d
 -9 27 d -9 28 d -9 36 d -9 42 d -9 36 d -9 43 d -9 55 d -10 48 d -9 61 d -9 68 d -9 68 d -9 67 d -9 75 d -9 64 d -9 73 d -9 63 d -9 63 d -9 40 d -9 44 d -9 -6 d -9 -2 d -10 -39 d -9 -43 d -9 -51 d -9 -58 d -9 -68 d -9 -68 d -9 -262 d -9 -729 d -82 X
 FA 3 lw 0.8 0 0 c 1 0 0 c 0.8 0 0 c 227 609 m 90 X 742 Y 10 X 266 Y 9 X 67 Y 9 X 67 Y 9 X 52 Y 9 X 47 Y 9 X 35 Y 9 X 9 Y 9 X -1 Y 9 X -53 Y 9 X -54 Y 9 X -70 Y 9 X -77 Y 9 X -79 Y 9 X -80 Y 10 X -75 Y 9 X -83 Y 9 X -67 Y 9 X -77 Y 9 X -55 Y 9 X -53
 Y 9 X -48 Y 9 X -44 Y 9 X -39 Y 9 X -33 Y 9 X -33 Y 9 X -26 Y 9 X -29 Y 9 X -20 Y 10 X -16 Y 9 X -17 Y 9 X -22 Y 9 X -10 Y 9 X -10 Y 9 X -13 Y 9 X -10 Y 9 X -8 Y 9 X -7 Y 9 X -7 Y 9 X -5 Y 9 X -7 Y 9 X -3 Y 9 X -9 Y 10 X -1 Y 9 X -5 Y 9 X -2 Y 9 X
 -2 Y 9 X -3 Y 9 X -2 Y 9 X -3 Y 9 X -2 Y 9 X -2 Y 9 X -1 Y 9 X -2 Y 9 X -2 Y 18 X -2 Y 19 X -1 Y 18 X -2 Y 18 X -1 Y 18 X -1 Y 18 X -1 Y 18 X -2 Y 9 X 1 Y 19 X -1 Y 36 X -1 Y 9 X 1 Y 9 X -1 Y 45 X -1 Y 9 X 2 Y 9 X -2 Y 10 X 1 Y 9 X -1 Y 54 X 1 Y 63
 X 1 Y 10 X -1 Y 27 X 1 Y 18 X -1 Y 9 X 1 Y 9 X 1 Y 27 X 1 Y 9 X -1 Y 9 X 1 Y 19 X 1 Y 18 X 1 Y 27 X 2 Y 18 X 1 Y 9 X 1 Y 9 X 1 Y 18 X 2 Y 9 X 2 Y 9 X 1 Y 19 X 3 Y 9 X 2 Y 9 X 1 Y 9 X 3 Y 9 X 2 Y 9 X 5 Y 9 X 3 Y 9 X 2 Y 9 X 6 Y 9 X 4 Y 9 X 2 Y 9 X 6
 Y 9 X 6 Y 10 X 8 Y 9 X 10 Y 9 X 7 Y 9 X 10 Y 9 X 11 Y 9 X 14 Y 9 X 13 Y 9 X 14 Y 9 X 17 Y 9 X 17 Y 9 X 22 Y 9 X 29 Y 9 X 26 Y 9 X 31 Y 10 X 36 Y 9 X 35 Y 9 X 44 Y 9 X 54 Y 9 X 51 Y 9 X 57 Y 9 X 67 Y 9 X 72 Y 9 X 75 Y 9 X 85 Y 9 X 71 Y 9 X 91 Y 9 X
 72 Y 9 X 75 Y 10 X 56 Y 9 X 47 Y 9 X 2 Y 9 X -11 Y 9 X -30 Y 9 X -54 Y 9 X -47 Y 9 X -69 Y 9 X -69 Y 9 X -270 Y 9 X -736 Y 91 X s 1 0 0 c 231 609 m20 240 609 m20 249 609 m20 259 609 m20 268 609 m20 277 609 m20 286 609 m20 295 609 m20 304 609 m20 313
 609 m20 322 1351 m20 331 1617 m20 340 1684 m20 349 1751 m20 358 1803 m20 367 1850 m20 376 1885 m20 386 1894 m20 395 1893 m20 404 1840 m20 413 1786 m20 422 1716 m20 431 1639 m20 440 1560 m20 449 1480 m20 458 1405 m20 467 1322 m20 476 1255 m20 485
 1178 m20 494 1123 m20 503 1070 m20 513 1022 m20 522 978 m20 531 939 m20 540 906 m20 549 873 m20 558 847 m20 567 818 m20 576 798 m20 585 782 m20 594 765 m20 603 743 m20 612 733 m20 621 723 m20 630 710 m20 639 700 m20 649 692 m20 658 685 m20 667 678
 m20 676 673 m20 685 666 m20 694 663 m20 703 654 m20 712 653 m20 721 648 m20 730 646 m20 739 644 m20 748 641 m20 757 639 m20 766 636 m20 776 634 m20 785 632 m20 794 631 m20 803 629 m20 812 627 m20 821 627 m20 830 625 m20 839 625 m20 848 624 m20 857
 624 m20 866 622 m20 875 622 m20 884 621 m20 893 621 m20 903 620 m20 912 620 m20 921 619 m20 930 619 m20 939 617 m20 948 618 m20 957 618 m20 966 617 m20 975 617 m20 984 617 m20 993 617 m20 1002 616 m20 1011 617 m20 1020 616 m20 1030 616 m20 1039 616
 m20 1048 616 m20 1057 616 m20 1066 615 m20 1075 617 m20 1084 615 m20 1093 616 m20 1102 615 m20 1111 615 m20 1120 615 m20 1129 615 m20 1138 615 m20 1147 615 m20 1157 616 m20 1166 616 m20 1175 616 m20 1184 616 m20 1193 616 m20 1202 616 m20 1211 616
 m20 1220 617 m20 1229 616 m20 1238 616 m20 1247 616 m20 1256 617 m20 1265 617 m20 1274 616 m20 1284 617 m20 1293 618 m20 1302 618 m20 1311 618 m20 1320 619 m20 1329 618 m20 1338 619 m20 1347 619 m20 1356 620 m20 1365 620 m20 1374 621 m20 1383 621
 m20 1392 621 m20 1401 623 m20 1411 623 m20 1420 624 m20 1429 625 m20 1438 626 m20 1447 626 m20 1456 628 m20 1465 630 m20 1474 631 m20 1483 631 m20 1492 634 m20 1501 636 m20 1510 637 m20 1519 640 m20 1528 642 m20 1538 647 m20 1547 650 m20 1556 652
 m20 1565 658 m20 1574 662 m20 1583 664 m20 1592 670 m20 1601 676 m20 1610 684 m20 1619 694 m20 1628 701 m20 1637 711 m20 1646 722 m20 1655 736 m20 1665 749 m20 1674 763 m20 1683 780 m20 1692 797 m20 1701 819 m20 1710 848 m20 1719 874 m20 1728 905
 m20 1737 941 m20 1746 976 m20 1755 1020 m20 1764 1074 m20 1773 1125 m20 1782 1182 m20 1791 1249 m20 1801 1321 m20 1810 1396 m20 1819 1481 m20 1828 1552 m20 1837 1643 m20 1846 1715 m20 1855 1790 m20 1864 1846 m20 1873 1893 m20 1882 1895 m20 1891 1884
 m20 1900 1854 m20 1909 1800 m20 1918 1753 m20 1928 1684 m20 1937 1615 m20 1946 1345 m20 1955 609 m20 1964 609 m20 1973 609 m20 1982 609 m20 1991 609 m20 2000 609 m20 2009 609 m20 2018 609 m20 2027 609 m20 2036 609 m20 0.8 0 0 c black 0.8 0 0 c cs
 0.8 0 0 P13 setcolor 231 609 m 82 X 9 746 d 9 266 d 9 68 d 9 67 d 9 52 d 9 47 d 9 36 d 10 8 d 9 -1 d 9 -52 d 9 -55 d 9 -70 d 9 -77 d 9 -79 d 9 -80 d 9 -76 d 9 -83 d 9 -67 d 9 -77 d 9 -56 d 9 -53 d 10 -48 d 9 -44 d 9 -39 d 9 -33 d 9 -33 d 9 -27 d 9
 -29 d 9 -20 d 9 -17 d 9 -17 d 9 -21 d 9 -10 d 9 -11 d 9 -13 d 9 -10 d 10 -7 d 9 -8 d 9 -7 d 9 -5 d 9 -7 d 9 -3 d 9 -9 d 9 -1 d 9 -5 d 9 -3 d 9 -1 d 9 -4 d 9 -1 d 9 -3 d 10 -2 d 9 -2 d 9 -2 d 9 -1 d 9 -3 d 9 1 d 9 -2 d 9 X 9 -2 d 9 X 9 -1 d 9 -1 d 9
 -1 d 9 1 d 10 -1 d 9 X 9 -1 d 9 -1 d 9 -1 d 9 1 d 9 -1 d 18 X 9 -1 d 9 1 d 9 -1 d 18 X 10 -1 d 9 1 d 9 -1 d 18 X 9 1 d 9 -1 d 9 X 9 -1 d 9 1 d 9 -1 d 9 1 d 9 -1 d 9 X 10 1 d 45 X 9 1 d 9 X 9 -1 d 9 X 9 1 d 27 X 10 1 d 18 X 9 1 d 18 X 9 1 d 9 -1 d 9
 1 d 9 X 9 1 d 9 X 9 1 d 9 1 d 10 X 9 2 d 9 X 9 2 d 9 X 9 2 d 9 1 d 9 1 d 9 1 d 9 3 d 9 2 d 9 1 d 9 3 d 9 2 d 10 5 d 9 3 d 9 2 d 9 6 d 9 4 d 9 2 d 9 6 d 9 6 d 9 9 d 9 9 d 9 7 d 9 11 d 9 10 d 9 14 d 10 14 d 9 14 d 9 17 d 9 17 d 9 23 d 9 29 d 9 25 d 9
 32 d 9 36 d 9 35 d 9 44 d 9 54 d 9 52 d 9 57 d 9 67 d 10 73 d 9 75 d 9 85 d 9 71 d 9 91 d 9 72 d 9 76 d 9 55 d 9 47 d 9 3 d 9 -12 d 9 -29 d 9 -55 d 9 -47 d 10 -70 d 9 -68 d 9 -271 d 9 -740 d 81 X -81 X -9 732 d -9 269 d -9 69 d -10 69 d -9 47 d -9
 54 d -9 30 d -9 11 d -9 -3 d -9 -47 d -9 -55 d -9 -75 d -9 -72 d -9 -91 d -9 -70 d -9 -85 d -9 -75 d -10 -72 d -9 -66 d -9 -57 d -9 -51 d -9 -54 d -9 -44 d -9 -34 d -9 -36 d -9 -32 d -9 -25 d -9 -29 d -9 -22 d -9 -16 d -9 -17 d -9 -14 d -10 -14 d -9
 -14 d -9 -10 d -9 -11 d -9 -6 d -9 -10 d -9 -8 d -9 -6 d -9 -6 d -9 -2 d -9 -4 d -9 -5 d -9 -2 d -9 -4 d -10 -5 d -9 -2 d -9 -2 d -9 -2 d -9 -1 d -9 -3 d -9 -1 d -9 -1 d -9 -1 d -9 -2 d -9 X -9 -2 d -9 X -9 -2 d -10 X -9 -1 d -9 -1 d -9 X -9 -1 d
 -27 X -9 -1 d -18 X -9 -1 d -9 1 d -9 -1 d -10 -1 d -27 X -9 -1 d -9 X -9 1 d -9 X -9 -1 d -9 X -9 1 d -9 -1 d -9 X -9 1 d -10 -2 d -9 1 d -54 X -9 1 d -9 -1 d -9 X -9 1 d -46 X -9 1 d -36 X -9 1 d -9 -1 d -9 1 d -9 1 d -9 1 d -9 X -10 1 d -9 -1 d
 -9 1 d -9 1 d -9 1 d -9 X -9 2 d -9 X -9 1 d -9 X -9 3 d -9 1 d -9 2 d -9 2 d -10 2 d -9 2 d -9 2 d -9 3 d -9 2 d -9 2 d -9 5 d -9 1 d -9 9 d -9 3 d -9 7 d -9 5 d -9 6 d -9 8 d -10 7 d -9 10 d -9 13 d -9 10 d -9 11 d -9 21 d -9 17 d -9 16 d -9 19 d
 -9 30 d -9 26 d -9 33 d -9 33 d -9 38 d -9 44 d -10 48 d -9 52 d -9 56 d -9 76 d -9 66 d -9 83 d -9 75 d -9 80 d -9 79 d -9 77 d -9 69 d -9 55 d -9 52 d -9 2 d -10 -9 d -9 -35 d -9 -47 d -9 -52 d -9 -67 d -9 -67 d -9 -265 d -9 -738 d -82 X FA 0 0.4
 0 c 1 1 1 c 0.35 0.83 0.33 c 0 0.4 0 c 227 609 m 90 X 716 Y 10 X 250 Y 9 X 61 Y 9 X 79 Y 9 X 65 Y 9 X 67 Y 9 X 57 Y 9 X 48 Y 9 X 32 Y 9 X -23 Y 9 X -26 Y 9 X -45 Y 9 X -51 Y 9 X -72 Y 9 X -74 Y 10 X -76 Y 9 X -87 Y 9 X -58 Y 9 X -88 Y 9 X -73 Y 9 X
 -52 Y 9 X -57 Y 9 X -49 Y 9 X -49 Y 9 X -44 Y 9 X -49 Y 9 X -28 Y 9 X -40 Y 9 X -23 Y 10 X -28 Y 9 X -24 Y 9 X -27 Y 9 X -15 Y 9 X -16 Y 9 X -18 Y 9 X -18 Y 9 X -8 Y 9 X -10 Y 9 X -9 Y 9 X -6 Y 9 X -18 Y 9 X -5 Y 9 X -11 Y 10 X -8 Y 9 X -4 Y 9 X -4
 Y 9 X 1 Y 9 X -12 Y 18 X -8 Y 9 X -4 Y 9 X -1 Y 9 X -2 Y 9 X -4 Y 9 X -5 Y 9 X 2 Y 9 X -8 Y 10 X 5 Y 9 X -5 Y 9 X 1 Y 9 X -4 Y 18 X -3 Y 18 X -4 Y 9 X 8 Y 9 X -8 Y 9 X -2 Y 18 X 3 Y 9 X -4 Y 10 X -2 Y 18 X 4 Y 9 X -6 Y 9 X 2 Y 18 X 2 Y 9 X -8 Y 9 X
 5 Y 9 X -3 Y 9 X 6 Y 9 X -5 Y 9 X 7 Y 9 X -9 Y 10 X 6 Y 9 X 1 Y 9 X -5 Y 9 X -3 Y 9 X 3 Y 9 X 1 Y 9 X -5 Y 9 X 6 Y 9 X -2 Y 9 X 1 Y 9 X 1 Y 9 X 3 Y 9 X -5 Y 9 X 2 Y 9 X 1 Y 10 X -6 Y 9 X 7 Y 9 X 1 Y 9 X -1 Y 9 X -2 Y 9 X -2 Y 9 X 7 Y 9 X -2 Y 9 X 1
 Y 9 X -1 Y 9 X 2 Y 9 X -2 Y 9 X 10 Y 9 X -4 Y 10 X -1 Y 9 X -2 Y 9 X 8 Y 9 X -7 Y 9 X 7 Y 9 X -3 Y 9 X 2 Y 9 X 5 Y 9 X 4 Y 18 X -3 Y 9 X 5 Y 9 X 3 Y 9 X 3 Y 10 X 6 Y 9 X 3 Y 9 X 3 Y 9 X 3 Y 9 X 3 Y 9 X 2 Y 9 X 8 Y 9 X 8 Y 9 X 1 Y 9 X 11 Y 9 X 8 Y 9
 X 5 Y 9 X 4 Y 9 X 10 Y 10 X 9 Y 9 X 24 Y 9 X 9 Y 9 X 14 Y 9 X 11 Y 9 X 20 Y 9 X 27 Y 9 X 16 Y 9 X 24 Y 9 X 21 Y 9 X 31 Y 9 X 41 Y 9 X 33 Y 9 X 40 Y 10 X 43 Y 9 X 47 Y 9 X 47 Y 9 X 72 Y 9 X 54 Y 9 X 64 Y 9 X 79 Y 9 X 67 Y 9 X 80 Y 9 X 82 Y 9 X 56 Y 9
 X 83 Y 9 X 54 Y 9 X 53 Y 10 X 27 Y 9 X 18 Y 9 X -30 Y 9 X -48 Y 9 X -61 Y 9 X -67 Y 9 X -72 Y 9 X -68 Y 9 X -65 Y 9 X -255 Y 9 X -710 Y 91 X s 0.35 0.83 0.33 c 231 609 m20 240 609 m20 249 609 m20 259 609 m20 268 609 m20 277 609 m20 286 609 m20 295
 609 m20 304 609 m20 313 609 m20 322 1325 m20 331 1575 m20 340 1636 m20 349 1715 m20 358 1780 m20 367 1847 m20 376 1904 m20 386 1952 m20 395 1984 m20 404 1961 m20 413 1935 m20 422 1890 m20 431 1839 m20 440 1767 m20 449 1693 m20 458 1617 m20 467 1530
 m20 476 1472 m20 485 1384 m20 494 1311 m20 503 1259 m20 513 1202 m20 522 1153 m20 531 1104 m20 540 1060 m20 549 1011 m20 558 983 m20 567 943 m20 576 920 m20 585 892 m20 594 868 m20 603 841 m20 612 826 m20 621 810 m20 630 792 m20 639 774 m20 649 766
 m20 658 756 m20 667 747 m20 676 741 m20 685 723 m20 694 718 m20 703 707 m20 712 699 m20 721 695 m20 730 691 m20 739 692 m20 748 680 m20 757 680 m20 766 672 m20 776 668 m20 785 667 m20 794 665 m20 803 661 m20 812 656 m20 821 658 m20 830 650 m20 839
 655 m20 848 650 m20 857 651 m20 866 647 m20 875 647 m20 884 644 m20 893 644 m20 903 640 m20 912 648 m20 921 640 m20 930 638 m20 939 638 m20 948 641 m20 957 637 m20 966 635 m20 975 635 m20 984 639 m20 993 633 m20 1002 635 m20 1011 635 m20 1020 637
 m20 1030 629 m20 1039 634 m20 1048 631 m20 1057 637 m20 1066 632 m20 1075 639 m20 1084 630 m20 1093 636 m20 1102 637 m20 1111 632 m20 1120 629 m20 1129 632 m20 1138 633 m20 1147 628 m20 1157 634 m20 1166 632 m20 1175 633 m20 1184 634 m20 1193 637
 m20 1202 632 m20 1211 634 m20 1220 635 m20 1229 629 m20 1238 636 m20 1247 637 m20 1256 636 m20 1265 634 m20 1274 632 m20 1284 639 m20 1293 637 m20 1302 638 m20 1311 637 m20 1320 639 m20 1329 637 m20 1338 647 m20 1347 643 m20 1356 642 m20 1365 640
 m20 1374 648 m20 1383 641 m20 1392 648 m20 1401 645 m20 1411 647 m20 1420 652 m20 1429 656 m20 1438 656 m20 1447 653 m20 1456 658 m20 1465 661 m20 1474 664 m20 1483 670 m20 1492 673 m20 1501 676 m20 1510 679 m20 1519 682 m20 1528 684 m20 1538 692
 m20 1547 700 m20 1556 701 m20 1565 712 m20 1574 720 m20 1583 725 m20 1592 729 m20 1601 739 m20 1610 748 m20 1619 772 m20 1628 781 m20 1637 795 m20 1646 806 m20 1655 826 m20 1665 853 m20 1674 869 m20 1683 893 m20 1692 914 m20 1701 945 m20 1710 986
 m20 1719 1019 m20 1728 1059 m20 1737 1102 m20 1746 1149 m20 1755 1196 m20 1764 1268 m20 1773 1322 m20 1782 1386 m20 1791 1465 m20 1801 1532 m20 1810 1612 m20 1819 1694 m20 1828 1750 m20 1837 1833 m20 1846 1887 m20 1855 1940 m20 1864 1967 m20 1873
 1985 m20 1882 1955 m20 1891 1907 m20 1900 1846 m20 1909 1779 m20 1918 1707 m20 1928 1639 m20 1937 1574 m20 1946 1319 m20 1955 609 m20 1964 609 m20 1973 609 m20 1982 609 m20 1991 609 m20 2000 609 m20 2009 609 m20 2018 609 m20 2027 609 m20 2036 609
 m20 0 0.4 0 c black 0 0.4 0 c cs 0 0.4 0 P13 setcolor 231 609 m 82 X 9 721 d 9 251 d 9 61 d 9 79 d 9 65 d 9 68 d 9 56 d 10 49 d 9 32 d 9 -23 d 9 -26 d 9 -45 d 9 -50 d 9 -72 d 9 -75 d 9 -77 d 9 -86 d 9 -58 d 9 -89 d 9 -73 d 9 -52 d 10 -57 d 9 -50 d 9
 -49 d 9 -44 d 9 -49 d 9 -29 d 9 -39 d 9 -24 d 9 -27 d 9 -25 d 9 -27 d 9 -14 d 9 -17 d 9 -18 d 9 -18 d 10 -8 d 9 -10 d 9 -9 d 9 -7 d 9 -18 d 9 -4 d 9 -12 d 9 -8 d 9 -3 d 9 -5 d 9 1 d 9 -12 d 9 X 9 -8 d 10 -4 d 9 -1 d 9 -2 d 9 -5 d 9 -4 d 9 1 d 9 -7 d
 9 5 d 9 -6 d 9 2 d 9 -4 d 9 -1 d 9 -3 d 9 X 10 -4 d 9 9 d 9 -9 d 9 -1 d 9 X 9 3 d 9 -4 d 9 -3 d 9 1 d 9 4 d 9 -7 d 9 2 d 9 X 9 3 d 10 -9 d 9 5 d 9 -3 d 9 7 d 9 -5 d 9 6 d 9 -9 d 9 7 d 9 X 9 -5 d 9 -3 d 9 4 d 9 1 d 9 -6 d 10 6 d 9 -2 d 9 1 d 9 1 d 9
 4 d 9 -6 d 9 2 d 9 2 d 9 -7 d 9 8 d 18 X 9 -2 d 9 -3 d 10 8 d 9 -2 d 9 1 d 9 -2 d 9 3 d 9 -3 d 9 11 d 9 -5 d 9 X 9 -3 d 9 9 d 9 -8 d 9 8 d 9 -4 d 10 3 d 9 5 d 9 4 d 9 -1 d 9 -2 d 9 5 d 9 3 d 9 3 d 9 6 d 9 3 d 9 3 d 9 3 d 9 4 d 9 1 d 10 8 d 9 8 d 9 1
 d 9 12 d 9 8 d 9 4 d 9 5 d 9 9 d 9 10 d 9 24 d 9 9 d 9 14 d 9 11 d 9 20 d 10 27 d 9 16 d 9 24 d 9 21 d 9 32 d 9 41 d 9 33 d 9 40 d 9 43 d 9 48 d 9 47 d 9 72 d 9 55 d 9 64 d 9 79 d 10 67 d 9 80 d 9 82 d 9 56 d 9 83 d 9 55 d 9 52 d 9 27 d 9 18 d 9 -30
 d 9 -49 d 9 -61 d 9 -67 d 9 -72 d 10 -68 d 9 -66 d 9 -255 d 9 -715 d 81 X -81 X -9 705 d -9 254 d -9 65 d -10 68 d -9 72 d -9 67 d -9 60 d -9 49 d -9 29 d -9 -18 d -9 -27 d -9 -53 d -9 -55 d -9 -82 d -9 -56 d -9 -82 d -9 -80 d -10 -66 d -9 -79 d -9
 -64 d -9 -54 d -9 -71 d -9 -48 d -9 -47 d -9 -43 d -9 -40 d -9 -32 d -9 -41 d -9 -31 d -9 -21 d -9 -24 d -9 -16 d -10 -26 d -9 -20 d -9 -11 d -9 -14 d -9 -9 d -9 -23 d -9 -10 d -9 -9 d -9 -5 d -9 -4 d -9 -8 d -9 -11 d -9 -1 d -9 -8 d -10 -9 d -9 -1
 d -9 -3 d -9 -3 d -9 -3 d -9 -3 d -9 -6 d -9 -3 d -9 -2 d -9 -5 d -9 2 d -9 X -9 -4 d -9 -4 d -10 -3 d -9 3 d -9 -6 d -9 6 d -9 -8 d -9 3 d -9 X -9 4 d -9 -9 d -9 2 d -9 -2 d -9 1 d -9 -1 d -9 2 d -10 -7 d -9 2 d -9 2 d -18 X -9 -7 d -9 6 d -9 -1 d
 -9 -2 d -9 4 d -9 -2 d -9 -1 d -9 -1 d -9 1 d -10 -5 d -9 5 d -9 -1 d -9 -3 d -9 3 d -9 4 d -9 X -9 -6 d -9 8 d -9 -6 d -9 5 d -9 -6 d -9 2 d -9 -3 d -10 7 d -9 -2 d -9 X -9 -2 d -9 5 d -9 -3 d -9 X -9 1 d -9 5 d -9 -3 d -9 X -9 2 d -9 7 d -9 -7 d
 -10 3 d -9 X -9 3 d -9 1 d -9 3 d -9 -1 d -9 5 d -9 -4 d -9 7 d -9 -1 d -9 4 d -9 4 d -9 2 d -9 1 d -10 4 d -9 7 d -9 1 d -9 12 d -9 -1 d -9 4 d -9 4 d -9 7 d -9 12 d -9 4 d -9 18 d -9 6 d -9 9 d -9 10 d -10 8 d -9 18 d -9 18 d -9 16 d -9 15 d -9 26
 d -9 25 d -9 27 d -9 23 d -9 40 d -9 28 d -9 48 d -9 44 d -9 49 d -9 49 d -10 57 d -9 52 d -9 72 d -9 88 d -9 58 d -9 87 d -9 76 d -9 74 d -9 72 d -9 51 d -9 45 d -9 26 d -9 23 d -9 -32 d -10 -48 d -9 -56 d -9 -67 d -9 -65 d -9 -79 d -9 -60 d -9
 -250 d -9 -711 d -82 X FA black 1 1 1 c 680 392 794 1628 bf black 794 1628 m 680 X s 1474 1628 m 392 Y s 1474 2020 m -680 X s 794 2020 m -392 Y s
 gsave  2268 1568 0 609 C 961.026 1922.05 t 0 r /Helvetica findfont 91.2884 sf 0 0 m (No Int) show NC gr  0.8 0 0 c 819 1955 m 119 X s black
 gsave  2268 1568 0 609 C 961.026 1792.9 t 0 r /Helvetica findfont 91.2884 sf 0 0 m (With Int) show NC gr  0 0 1 c 819 1824 m 119 X s black
 gsave  2268 1568 0 609 C 961.026 1667.55 t 0 r /Helvetica findfont 91.2884 sf 0 0 m (Reweighted) show NC gr  0 0.4 0 c 819 1693 m 119 X s black
 gsave  2268 1568 0 609 C 2222.13 1747.32 t 90 r /Helvetica-BoldOblique findfont 30.4295 sf 0 0 m (LHC HIGGS XS WG 2013) show NC gr  1 1 1 c 2268 609 0 0 bf black 1 1 1 c 1814 457 227 152 bf black 1814 457 227 152 bl 1 1 1 c black 227 152 m 90 X 235
 Y 10 X 1 Y 9 X 1 Y 9 X -3 Y 9 X -1 Y 9 X -3 Y 9 X -3 Y 9 X -1 Y 9 X -5 Y 9 X 5 Y 9 X -4 Y 9 X 1 Y 9 X -3 Y 9 X 2 Y 9 X -1 Y 10 X 3 Y 9 X 2 Y 9 X -3 Y 9 X 6 Y 9 X 1 Y 9 X -3 Y 9 X 3 Y 9 X -2 Y 9 X 2 Y 9 X 4 Y 9 X 5 Y 9 X -4 Y 9 X 9 Y 9 X -2 Y 10 X -3
 Y 9 X 2 Y 9 X 10 Y 18 X -2 Y 9 X 5 Y 9 X 15 Y 9 X -13 Y 9 X 3 Y 9 X -3 Y 9 X -5 Y 9 X 27 Y 9 X -10 Y 9 X 11 Y 10 X 7 Y 9 X -2 Y 9 X 11 Y 9 X -30 Y 9 X 32 Y 9 X -17 Y 9 X 26 Y 9 X 8 Y 9 X -14 Y 9 X 17 Y 9 X -15 Y 9 X 29 Y 9 X -22 Y 9 X 49 Y 10 X -62
 Y 9 X 57 Y 9 X -51 Y 9 X 16 Y 9 X 6 Y 9 X 20 Y 9 X -11 Y 9 X 39 Y 9 X -95 Y 9 X 71 Y 9 X 26 Y 9 X -25 Y 9 X -32 Y 9 X 25 Y 10 X 33 Y 9 X -13 Y 9 X -48 Y 9 X 90 Y 9 X -57 Y 9 X -12 Y 9 X -7 Y 9 X 104 Y 9 X -70 Y 9 X 33 Y 9 X -108 Y 9 X 76 Y 9 X -57 Y
 9 X 102 Y 10 X -109 Y 9 X -2 Y 9 X 57 Y 9 X 54 Y 9 X -47 Y 9 X 4 Y 9 X 45 Y 9 X -65 Y 9 X 16 Y 9 X -19 Y 9 X -6 Y 9 X -25 Y 9 X 77 Y 9 X -32 Y 9 X -32 Y 10 X 126 Y 9 X -130 Y 9 X -4 Y 9 X 23 Y 9 X 4 Y 9 X 57 Y 9 X -76 Y 9 X 17 Y 9 X -4 Y 9 X 17 Y 9
 X -11 Y 9 X 44 Y 9 X -114 Y 9 X 45 Y 10 X 14 Y 9 X 35 Y 9 X -76 Y 9 X 92 Y 9 X -66 Y 9 X 27 Y 9 X -20 Y 9 X -12 Y 9 X -16 Y 9 X 26 Y 9 X 26 Y 9 X -39 Y 9 X 3 Y 9 X -13 Y 10 X -17 Y 9 X 6 Y 9 X 4 Y 9 X -9 Y 9 X 10 Y 9 X 7 Y 9 X -17 Y 9 X -15 Y 9 X 15
 Y 9 X -22 Y 9 X 7 Y 9 X 11 Y 9 X 2 Y 9 X -4 Y 10 X -2 Y 9 X -27 Y 9 X 6 Y 9 X -4 Y 9 X 9 Y 9 X -11 Y 9 X -10 Y 9 X 7 Y 9 X -4 Y 9 X 2 Y 18 X -7 Y 9 X -2 Y 9 X 1 Y 10 X -4 Y 9 X 1 Y 18 X -7 Y 9 X 2 Y 9 X -1 Y 9 X -2 Y 9 X 1 Y 9 X -3 Y 18 X 3 Y 9 X -3
 Y 9 X 2 Y 9 X -2 Y 10 X 2 Y 9 X -1 Y 9 X 1 Y 9 X 5 Y 18 X 5 Y 9 X 4 Y 9 X -2 Y 9 X -1 Y 9 X 1 Y 9 X -236 Y 91 X s 227 152 m 1814 X s
 gsave  2268 609 0 0 C 2009.42 41.7837 t 0 r /Symbol findfont 57.1345 sf 0 0 m (f) show NC gr 
 gsave  2268 609 0 0 C 1971.43 41.7837 t 0 r /Symbol findfont 57.1345 sf 0 0 m (D) show NC gr  356 167 m -15 Y s 408 160 m -8 Y s 460 160 m -8 Y s 512 160 m -8 Y s 564 160 m -8 Y s 616 167 m -15 Y s 667 160 m -8 Y s 719 160 m -8 Y s 771 160 m -8 Y s
 823 160 m -8 Y s 875 167 m -15 Y s 927 160 m -8 Y s 978 160 m -8 Y s 1030 160 m -8 Y s 1082 160 m -8 Y s 1134 167 m -15 Y s 1186 160 m -8 Y s 1238 160 m -8 Y s 1289 160 m -8 Y s 1341 160 m -8 Y s 1393 167 m -15 Y s 1445 160 m -8 Y s 1497 160 m -8 Y
 s 1549 160 m -8 Y s 1600 160 m -8 Y s 1652 167 m -15 Y s 1704 160 m -8 Y s 1756 160 m -8 Y s 1808 160 m -8 Y s 1860 160 m -8 Y s 1911 167 m -15 Y s 356 167 m -15 Y s 305 160 m -8 Y s 253 160 m -8 Y s 1911 167 m -15 Y s 1963 160 m -8 Y s 2015 160 m
 -8 Y s
 gsave  2268 609 0 0 C 330.471 113.956 t 0 r /Helvetica findfont 45.7076 sf 0 0 m (\2553) show NC gr 
 gsave  2268 609 0 0 C 592.569 113.956 t 0 r /Helvetica findfont 45.7076 sf 0 0 m (\2552) show NC gr 
 gsave  2268 609 0 0 C 854.667 113.956 t 0 r /Helvetica findfont 45.7076 sf 0 0 m (\2551) show NC gr 
 gsave  2268 609 0 0 C 1116.76 113.956 t 0 r /Helvetica findfont 45.7076 sf 0 0 m (0) show NC gr 
 gsave  2268 609 0 0 C 1378.86 113.956 t 0 r /Helvetica findfont 45.7076 sf 0 0 m (1) show NC gr 
 gsave  2268 609 0 0 C 1633.36 113.956 t 0 r /Helvetica findfont 45.7076 sf 0 0 m (2) show NC gr 
 gsave  2268 609 0 0 C 1895.46 113.956 t 0 r /Helvetica findfont 45.7076 sf 0 0 m (3) show NC gr  227 152 m 457 Y s
 gsave  2268 609 0 0 C 91.1645 170.933 t 90 r /Helvetica findfont 45.7076 sf 0 0 m (\(S+I\)/\(Reweighted S\)) show NC gr  278 152 m -51 X s 252 164 m -25 X s 252 175 m -25 X s 252 187 m -25 X s 278 198 m -51 X s 252 209 m -25 X s 252 221 m -25 X s
 252 232 m -25 X s 278 244 m -51 X s 252 255 m -25 X s 252 267 m -25 X s 252 278 m -25 X s 278 289 m -51 X s 252 301 m -25 X s 252 312 m -25 X s 252 324 m -25 X s 278 335 m -51 X s 252 347 m -25 X s 252 358 m -25 X s 252 369 m -25 X s 278 381 m -51 X
 s 252 392 m -25 X s 252 404 m -25 X s 252 415 m -25 X s 278 427 m -51 X s 252 438 m -25 X s 252 449 m -25 X s 252 461 m -25 X s 278 472 m -51 X s 252 484 m -25 X s 252 495 m -25 X s 252 507 m -25 X s 278 518 m -51 X s 252 529 m -25 X s 252 541 m -25
 X s 252 552 m -25 X s 278 564 m -51 X s 252 575 m -25 X s 252 587 m -25 X s 252 598 m -25 X s 278 609 m -51 X s
 gsave  2268 609 0 0 C 186.127 136.747 t 0 r /Helvetica findfont 45.7076 sf 0 0 m (0) show NC gr 
 gsave  2268 609 0 0 C 148.142 182.329 t 0 r /Helvetica findfont 45.7076 sf 0 0 m (0.2) show NC gr 
 gsave  2268 609 0 0 C 148.142 227.911 t 0 r /Helvetica findfont 45.7076 sf 0 0 m (0.4) show NC gr 
 gsave  2268 609 0 0 C 148.142 273.493 t 0 r /Helvetica findfont 45.7076 sf 0 0 m (0.6) show NC gr 
 gsave  2268 609 0 0 C 148.142 319.076 t 0 r /Helvetica findfont 45.7076 sf 0 0 m (0.8) show NC gr 
 gsave  2268 609 0 0 C 193.725 364.658 t 0 r /Helvetica findfont 45.7076 sf 0 0 m (1) show NC gr 
 gsave  2268 609 0 0 C 148.142 410.24 t 0 r /Helvetica findfont 45.7076 sf 0 0 m (1.2) show NC gr 
 gsave  2268 609 0 0 C 148.142 455.822 t 0 r /Helvetica findfont 45.7076 sf 0 0 m (1.4) show NC gr 
 gsave  2268 609 0 0 C 148.142 501.405 t 0 r /Helvetica findfont 45.7076 sf 0 0 m (1.6) show NC gr 
 gsave  2268 609 0 0 C 148.142 546.987 t 0 r /Helvetica findfont 45.7076 sf 0 0 m (1.8) show NC gr 
 gsave  2268 609 0 0 C 186.127 592.569 t 0 r /Helvetica findfont 45.7076 sf 0 0 m (2) show NC gr  231 152 m20 240 152 m20 249 152 m20 259 152 m20 268 152 m20 277 152 m20 286 152 m20 295 152 m20 304 152 m20 313 152 m20 322 387 m20 331 388 m20 340 389
 m20 349 386 m20 358 385 m20 367 382 m20 376 379 m20 386 378 m20 395 373 m20 404 378 m20 413 374 m20 422 375 m20 431 372 m20 440 374 m20 449 373 m20 458 376 m20 467 378 m20 476 375 m20 485 381 m20 494 382 m20 503 379 m20 513 382 m20 522 380 m20 531
 382 m20 540 386 m20 549 391 m20 558 387 m20 567 396 m20 576 394 m20 585 391 m20 594 393 m20 603 403 m20 612 403 m20 621 401 m20 630 406 m20 639 421 m20 649 408 m20 658 411 m20 667 408 m20 676 403 m20 685 430 m20 694 420 m20 703 431 m20 712 438 m20
 721 436 m20 730 447 m20 739 417 m20 748 449 m20 757 432 m20 766 458 m20 776 466 m20 785 452 m20 794 469 m20 803 454 m20 812 483 m20 821 461 m20 830 510 m20 839 448 m20 848 505 m20 857 454 m20 866 470 m20 875 476 m20 884 496 m20 893 485 m20 903 524
 m20 912 429 m20 921 500 m20 930 526 m20 939 501 m20 948 469 m20 957 494 m20 966 527 m20 975 514 m20 984 466 m20 993 556 m20 1002 499 m20 1011 487 m20 1020 480 m20 1030 584 m20 1039 514 m20 1048 547 m20 1057 439 m20 1066 515 m20 1075 458 m20 1084 560
 m20 1093 451 m20 1102 449 m20 1111 506 m20 1120 560 m20 1129 513 m20 1138 517 m20 1147 562 m20 1157 497 m20 1166 513 m20 1175 494 m20 1184 488 m20 1193 463 m20 1202 540 m20 1211 508 m20 1220 476 m20 1229 602 m20 1238 472 m20 1247 468 m20 1256 491
 m20 1265 495 m20 1274 552 m20 1284 476 m20 1293 493 m20 1302 489 m20 1311 506 m20 1320 495 m20 1329 539 m20 1338 425 m20 1347 470 m20 1356 484 m20 1365 519 m20 1374 443 m20 1383 535 m20 1392 469 m20 1401 496 m20 1411 476 m20 1420 464 m20 1429 448
 m20 1438 474 m20 1447 500 m20 1456 461 m20 1465 464 m20 1474 451 m20 1483 434 m20 1492 440 m20 1501 444 m20 1510 435 m20 1519 445 m20 1528 452 m20 1538 435 m20 1547 420 m20 1556 435 m20 1565 413 m20 1574 420 m20 1583 431 m20 1592 433 m20 1601 429
 m20 1610 427 m20 1619 400 m20 1628 406 m20 1637 402 m20 1646 411 m20 1655 400 m20 1665 390 m20 1674 397 m20 1683 393 m20 1692 395 m20 1701 395 m20 1710 388 m20 1719 386 m20 1728 387 m20 1737 383 m20 1746 384 m20 1755 384 m20 1764 377 m20 1773 379
 m20 1782 378 m20 1791 376 m20 1801 377 m20 1810 374 m20 1819 374 m20 1828 377 m20 1837 374 m20 1846 376 m20 1855 374 m20 1864 376 m20 1873 375 m20 1882 376 m20 1891 381 m20 1900 381 m20 1909 386 m20 1918 390 m20 1928 388 m20 1937 387 m20 1946 388
 m20 1955 152 m20 1964 152 m20 1973 152 m20 1982 152 m20 1991 152 m20 2000 152 m20 2009 152 m20 2018 152 m20 2027 152 m20 2036 152 m20 cs 0 0 0 P13 setcolor 231 152 m 82 X 9 237 d 9 1 d 9 1 d 9 -3 d 9 -1 d 9 -4 d 9 -2 d 10 -2 d 9 -5 d 9 5 d 9 -3 d 9
 1 d 9 -3 d 9 2 d 9 -1 d 9 3 d 9 2 d 9 -2 d 9 5 d 9 2 d 9 -3 d 10 3 d 9 -2 d 9 3 d 9 4 d 9 5 d 9 -4 d 9 9 d 9 -2 d 9 -2 d 9 2 d 9 10 d 9 1 d 9 -3 d 9 6 d 9 16 d 10 -13 d 9 4 d 9 -2 d 9 -5 d 9 27 d 9 -10 d 9 13 d 9 8 d 9 -3 d 9 13 d 9 -31 d 9 34 d 9
 -17 d 9 28 d 10 9 d 9 -14 d 9 18 d 9 -15 d 9 32 d 9 -24 d 9 55 d 9 -66 d 9 61 d 9 -55 d 9 21 d 9 4 d 9 22 d 9 -11 d 10 43 d 9 -101 d 9 76 d 9 32 d 9 -27 d 9 -37 d 9 33 d 9 31 d 9 -12 d 9 -50 d 9 95 d 9 -62 d 9 -11 d 9 -7 d 10 95 d 9 -58 d 9 40 d 9
 -123 d 9 88 d 9 -68 d 9 118 d 9 -123 d 9 -1 d 9 62 d 9 61 d 9 -52 d 9 5 d 9 51 d 10 -75 d 9 18 d 9 -21 d 9 -9 d 9 -23 d 9 82 d 9 -37 d 9 -36 d 9 101 d 9 -105 d 9 -6 d 9 27 d 9 3 d 9 63 d 10 -83 d 9 16 d 9 -2 d 9 15 d 9 -12 d 9 48 d 9 -124 d 9 48 d 9
 15 d 9 36 d 9 -82 d 9 99 d 9 -71 d 9 27 d 10 -21 d 9 -14 d 9 -18 d 9 27 d 9 28 d 9 -44 d 9 3 d 9 -14 d 9 -17 d 9 4 d 9 5 d 9 -10 d 9 10 d 9 7 d 10 -21 d 9 -15 d 9 15 d 9 -23 d 9 7 d 9 10 d 9 2 d 9 -5 d 9 -2 d 9 -28 d 9 6 d 9 -5 d 9 10 d 9 -12 d 10
 -11 d 9 7 d 9 -5 d 9 2 d 9 X 9 -8 d 9 -1 d 9 X 9 -4 d 9 1 d 9 -1 d 9 -7 d 9 3 d 9 -2 d 9 -2 d 10 1 d 9 -3 d 9 X 9 2 d 9 -2 d 9 1 d 9 -1 d 9 2 d 9 -1 d 9 1 d 9 5 d 9 X 9 4 d 9 5 d 10 -2 d 9 -1 d 9 2 d 9 -239 d 81 X -81 X -9 234 d -9 -1 d -9 1 d -10 2
 d -9 -4 d -9 -5 d -9 1 d -9 -5 d -9 -1 d -9 X -9 -2 d -9 2 d -9 -1 d -9 2 d -9 -3 d -9 X -9 3 d -10 -2 d -9 2 d -9 2 d -9 -3 d -9 7 d -9 X -9 -2 d -9 4 d -9 X -9 1 d -9 6 d -9 1 d -9 -3 d -9 4 d -9 -7 d -10 10 d -9 10 d -9 -9 d -9 3 d -9 -6 d -9 26
 d -9 1 d -9 4 d -9 -3 d -9 -10 d -9 -8 d -9 20 d -9 -14 d -9 14 d -10 15 d -9 -7 d -9 -10 d -9 8 d -9 -4 d -9 -7 d -9 16 d -9 11 d -9 -1 d -9 33 d -9 -23 d -9 -27 d -9 16 d -9 9 d -10 19 d -9 -28 d -9 63 d -9 -87 d -9 72 d -9 -36 d -9 -13 d -9 -42 d
 -9 105 d -9 -40 d -9 10 d -9 -19 d -9 6 d -9 -18 d -10 69 d -9 -51 d -9 -4 d -9 -20 d -9 2 d -9 116 d -9 -111 d -9 27 d -9 26 d -9 -70 d -9 26 d -9 3 d -9 18 d -9 -15 d -10 54 d -9 -37 d -9 -4 d -9 42 d -9 -48 d -9 -52 d -9 4 d -9 96 d -9 -88 d -9
 47 d -9 -63 d -9 93 d -9 -27 d -9 66 d -10 -96 d -9 6 d -9 13 d -9 52 d -9 -85 d -9 45 d -9 15 d -9 -35 d -9 -17 d -9 28 d -9 22 d -9 -20 d -9 -66 d -9 90 d -10 -36 d -9 10 d -9 -18 d -9 -6 d -9 -13 d -9 47 d -9 -51 d -9 58 d -9 -45 d -9 21 d -9 -25
 d -9 13 d -9 -15 d -9 15 d -10 -8 d -9 -24 d -9 17 d -9 -30 d -9 29 d -9 -10 d -9 3 d -9 -7 d -9 -10 d -9 10 d -9 -25 d -9 5 d -9 4 d -9 -3 d -10 13 d -9 -15 d -9 -4 d -9 2 d -9 X -9 -9 d -9 -1 d -9 2 d -9 3 d -9 -9 d -9 4 d -9 -4 d -9 -4 d -9 -2 d
 -9 3 d -10 -4 d -9 4 d -9 -2 d -9 -5 d -9 3 d -9 -2 d -9 -2 d -9 X -9 -1 d -9 2 d -9 X -9 3 d -9 -5 d -9 5 d -10 2 d -9 2 d -9 3 d -9 2 d -9 2 d -9 -1 d -9 -1 d -9 -233 d -82 X FA
 gr  gr showpage
end
%%EOF
