%!PS-Adobe-2.0 EPSF-2.0
%%BoundingBox:  0 0 567 544
%%Title: plots_pow_new_root_cteq66_2/mT_standard_emu.eps: canvas_mT_standard_emu
%%Creator: ROOT Version 5.33/03
%%CreationDate: Thu Sep 27 23:34:41 2012
%%EndComments
%%BeginProlog
80 dict begin
/s {stroke} def /l {lineto} def /m {moveto} def /t {translate} def
/r {rotate} def /rl {roll}  def /R {repeat} def
/d {rlineto} def /rm {rmoveto} def /gr {grestore} def /f {eofill} def
/c {setrgbcolor} def /black {0 setgray} def /sd {setdash} def
/cl {closepath} def /sf {scalefont setfont} def /lw {setlinewidth} def
/box {m dup 0 exch d exch 0 d 0 exch neg d cl} def
/NC{systemdict begin initclip end}def/C{NC box clip newpath}def
/bl {box s} def /bf {box f} def /Y { 0 exch d} def /X { 0 d} def 
/K {{pop pop 0 moveto} exch kshow} bind def
/ita {/ang 15 def gsave [1 0 ang dup sin exch cos div 1 0 0] concat} def 
/mp {newpath /y exch def /x exch def} def
/side {[w .77 mul w .23 mul] .385 w mul sd w 0 l currentpoint t -144 r} def
/mr {mp x y w2 0 360 arc} def /m24 {mr s} def /m20 {mr f} def
/mb {mp x y w2 add m w2 neg 0 d 0 w neg d w 0 d 0 w d cl} def
/mt {mp x y w2 add m w2 neg w neg d w 0 d cl} def
/m21 {mb f} def /m25 {mb s} def /m22 {mt f} def /m26{mt s} def
/m23 {mp x y w2 sub m w2 w d w neg 0 d cl f} def
/m27 {mp x y w2 add m w3 neg w2 neg d w3 w2 neg d w3 w2 d cl s} def
/m28 {mp x w2 sub y w2 sub w3 add m w3 0 d  0 w3 neg d w3 0 d 0 w3 d w3 0 d  0 w3 d w3 neg 0 d 0 w3 d w3 neg 0 d 0 w3 neg d w3 neg 0 d cl s } def
/m29 {mp gsave x w2 sub y w2 add w3 sub m currentpoint t 4 {side} repeat cl fill gr} def
/m30 {mp gsave x w2 sub y w2 add w3 sub m currentpoint t 4 {side} repeat cl s gr} def
/m31 {mp x y w2 sub m 0 w d x w2 sub y m w 0 d x w2 sub y w2 add m w w neg d x w2 sub y w2 sub m w w d s} def
/m32 {mp x y w2 sub m w2 w d w neg 0 d cl s} def
/m33 {mp x y w2 add m w3 neg w2 neg d w3 w2 neg d w3 w2 d cl f} def
/m34 {mp x w2 sub y w2 sub w3 add m w3 0 d  0 w3 neg d w3 0 d 0 w3 d w3 0 d  0 w3 d w3 neg 0 d 0 w3 d w3 neg 0 d 0 w3 neg d w3 neg 0 d cl f } def
/m2 {mp x y w2 sub m 0 w d x w2 sub y m w 0 d s} def
/m5 {mp x w2 sub y w2 sub m w w d x w2 sub y w2 add m w w neg d s} def
/reEncode {exch findfont dup length dict begin {1 index /FID eq  {pop pop} {def} ifelse } forall /Encoding exch def currentdict end dup /FontName get exch definefont pop } def [/Times-Bold /Times-Italic /Times-BoldItalic /Helvetica /Helvetica-Oblique
 /Helvetica-Bold /Helvetica-BoldOblique /Courier /Courier-Oblique /Courier-Bold /Courier-BoldOblique /Times-Roman /AvantGarde-Book /AvantGarde-BookOblique /AvantGarde-Demi /AvantGarde-DemiOblique /Bookman-Demi /Bookman-DemiItalic /Bookman-Light
 /Bookman-LightItalic /Helvetica-Narrow /Helvetica-Narrow-Bold /Helvetica-Narrow-BoldOblique /Helvetica-Narrow-Oblique /NewCenturySchlbk-Roman /NewCenturySchlbk-Bold /NewCenturySchlbk-BoldItalic /NewCenturySchlbk-Italic /Palatino-Bold
 /Palatino-BoldItalic /Palatino-Italic /Palatino-Roman ] {ISOLatin1Encoding reEncode } forall
%%EndProlog
%%BeginSetup
%%EndSetup
newpath  gsave  .25 .25 scale  gsave  0 0 t black[  ] 0 sd 3 lw 1 1 1 c 2268 2176 0 0 bf black 1 1 1 c 2222 1393 23 762 bf black 1 1 1 c 1756 1323 378 762 bf black 1756 1323 378 762 bl 1 1 1 c 1756 1323 378 762 bf black 1756 1323 378 762 bl 1 0 0 c 6
 lw 1 1 1 c 1 0 0 c 3 lw /w 36 def /w2 {w 2 div} def /w3 {w 3 div} def 393 823 m24 6 lw 3 lw 422 835 m24 6 lw 3 lw 451 853 m24 6 lw 3 lw 481 862 m24 6 lw 3 lw 510 875 m24 6 lw 3 lw 539 897 m24 6 lw 3 lw 568 1005 m24 6 lw 3 lw 598 1245 m24 6 lw 3 lw
 627 1559 m24 6 lw 3 lw 656 1841 m24 6 lw 3 lw 685 1990 m24 6 lw 3 lw 715 2016 m24 6 lw 3 lw 744 1924 m24 6 lw 3 lw 773 1772 m24 6 lw 3 lw 803 1532 m24 6 lw 3 lw 832 1285 m24 6 lw 3 lw 861 1068 m24 6 lw 3 lw 890 952 m24 6 lw 3 lw 920 888 m24 6 lw 3
 lw 949 858 m24 6 lw 3 lw 978 846 m24 6 lw 3 lw 1007 836 m24 6 lw 3 lw 1037 830 m24 6 lw 3 lw 1066 827 m24 6 lw 3 lw 1095 824 m24 6 lw 3 lw 1124 824 m24 6 lw 3 lw 1154 823 m24 6 lw 3 lw 1183 823 m24 6 lw 3 lw 1212 823 m24 6 lw 3 lw 1241 822 m24 6 lw
 3 lw 1271 822 m24 6 lw 3 lw 1300 822 m24 6 lw 3 lw 1329 822 m24 6 lw 3 lw 1359 822 m24 6 lw 3 lw 1388 822 m24 6 lw 3 lw 1417 822 m24 6 lw 3 lw 1446 822 m24 6 lw 3 lw 1476 822 m24 6 lw 3 lw 1534 822 m24 6 lw 3 lw 1563 822 m24 6 lw 3 lw 1593 822 m24 6
 lw 3 lw 1622 822 m24 6 lw 3 lw 1651 822 m24 6 lw 3 lw 1680 822 m24 6 lw 3 lw 1710 822 m24 6 lw 3 lw 1856 822 m24 6 lw 3 lw 2002 822 m24 6 lw black 3 lw 378 762 m 1756 X s
 gsave  2222 1393 23 762 C 1948.11 589.759 t 0 r /Helvetica findfont 64.6973 sf 0 0 m ( [GeV]) show NC gr 
 gsave  2222 1393 23 762 C 1921.47 574.539 t 0 r /Helvetica findfont 41.863 sf 0 0 m (T) show NC gr 
 gsave  2222 1393 23 762 C 1868.2 589.759 t 0 r /Helvetica findfont 64.6973 sf 0 0 m (m) show NC gr  378 795 m -33 Y s 437 778 m -16 Y s 495 778 m -16 Y s 554 778 m -16 Y s 612 778 m -16 Y s 671 795 m -33 Y s 729 778 m -16 Y s 788 778 m -16 Y s 846
 778 m -16 Y s 905 778 m -16 Y s 963 795 m -33 Y s 1022 778 m -16 Y s 1081 778 m -16 Y s 1139 778 m -16 Y s 1198 778 m -16 Y s 1256 795 m -33 Y s 1315 778 m -16 Y s 1373 778 m -16 Y s 1432 778 m -16 Y s 1490 778 m -16 Y s 1549 795 m -33 Y s 1607 778
 m -16 Y s 1666 778 m -16 Y s 1724 778 m -16 Y s 1783 778 m -16 Y s 1841 795 m -33 Y s 1900 778 m -16 Y s 1958 778 m -16 Y s 2017 778 m -16 Y s 2075 778 m -16 Y s 2134 795 m -33 Y s
 gsave  2268 2255 0 0 C 2222.23 1580.27 t 90 r /Helvetica-BoldOblique findfont 41.8538 sf 0 0 m (LHC HIGGS XS WG 2013) show NC gr  0.2 0.2 0.2 c black 0.2 0.2 0.2 c
 gsave  2222 1393 23 762 C 357.66 700.1 t 0 r /Helvetica findfont 64.6973 sf 0 0 m (0) show NC gr 
 gsave  2222 1393 23 762 C 616.393 700.1 t 0 r /Helvetica findfont 64.6973 sf 0 0 m (100) show NC gr 
 gsave  2222 1393 23 762 C 909.37 700.1 t 0 r /Helvetica findfont 64.6973 sf 0 0 m (200) show NC gr 
 gsave  2222 1393 23 762 C 1202.35 700.1 t 0 r /Helvetica findfont 64.6973 sf 0 0 m (300) show NC gr 
 gsave  2222 1393 23 762 C 1495.32 700.1 t 0 r /Helvetica findfont 64.6973 sf 0 0 m (400) show NC gr 
 gsave  2222 1393 23 762 C 1784.5 700.1 t 0 r /Helvetica findfont 64.6973 sf 0 0 m (500) show NC gr 
 gsave  2222 1393 23 762 C 2077.47 700.1 t 0 r /Helvetica findfont 64.6973 sf 0 0 m (600) show NC gr  378 2085 m 1756 X s 378 2052 m 33 Y s 437 2068 m 17 Y s 495 2068 m 17 Y s 554 2068 m 17 Y s 612 2068 m 17 Y s 671 2052 m 33 Y s 729 2068 m 17 Y s
 788 2068 m 17 Y s 846 2068 m 17 Y s 905 2068 m 17 Y s 963 2052 m 33 Y s 1022 2068 m 17 Y s 1081 2068 m 17 Y s 1139 2068 m 17 Y s 1198 2068 m 17 Y s 1256 2052 m 33 Y s 1315 2068 m 17 Y s 1373 2068 m 17 Y s 1432 2068 m 17 Y s 1490 2068 m 17 Y s 1549
 2052 m 33 Y s 1607 2068 m 17 Y s 1666 2068 m 17 Y s 1724 2068 m 17 Y s 1783 2068 m 17 Y s 1841 2052 m 33 Y s 1900 2068 m 17 Y s 1958 2068 m 17 Y s 2017 2068 m 17 Y s 2075 2068 m 17 Y s 2134 2052 m 33 Y s 378 762 m 1323 Y s 442 822 m -64 X s 410 865
 m -32 X s 410 909 m -32 X s 410 952 m -32 X s 442 996 m -64 X s 410 1039 m -32 X s 410 1083 m -32 X s 410 1126 m -32 X s 442 1170 m -64 X s 410 1213 m -32 X s 410 1257 m -32 X s 410 1300 m -32 X s 442 1344 m -64 X s 410 1387 m -32 X s 410 1431 m -32
 X s 410 1475 m -32 X s 442 1518 m -64 X s 410 1562 m -32 X s 410 1605 m -32 X s 410 1649 m -32 X s 442 1692 m -64 X s 410 1736 m -32 X s 410 1779 m -32 X s 410 1823 m -32 X s 442 1866 m -64 X s 410 1910 m -32 X s 410 1953 m -32 X s 410 1997 m -32 X
 s 442 2040 m -64 X s 442 822 m -64 X s 410 778 m -32 X s 442 2040 m -64 X s 410 2084 m -32 X s
 gsave  2222 1393 23 762 C 331.026 795.223 t 0 r /Helvetica findfont 64.6973 sf 0 0 m (0) show NC gr 
 gsave  2222 1393 23 762 C 239.708 970.248 t 0 r /Helvetica findfont 64.6973 sf 0 0 m (0.02) show NC gr 
 gsave  2222 1393 23 762 C 239.708 1145.27 t 0 r /Helvetica findfont 64.6973 sf 0 0 m (0.04) show NC gr 
 gsave  2222 1393 23 762 C 239.708 1320.3 t 0 r /Helvetica findfont 64.6973 sf 0 0 m (0.06) show NC gr 
 gsave  2222 1393 23 762 C 239.708 1491.52 t 0 r /Helvetica findfont 64.6973 sf 0 0 m (0.08) show NC gr 
 gsave  2222 1393 23 762 C 285.367 1666.54 t 0 r /Helvetica findfont 64.6973 sf 0 0 m (0.1) show NC gr 
 gsave  2222 1393 23 762 C 239.708 1841.57 t 0 r /Helvetica findfont 64.6973 sf 0 0 m (0.12) show NC gr 
 gsave  2222 1393 23 762 C 239.708 2016.59 t 0 r /Helvetica findfont 64.6973 sf 0 0 m (0.14) show NC gr  2134 762 m 1323 Y s 2071 822 m 63 X s 2102 865 m 32 X s 2102 909 m 32 X s 2102 952 m 32 X s 2071 996 m 63 X s 2102 1039 m 32 X s 2102 1083 m 32 X
 s 2102 1126 m 32 X s 2071 1170 m 63 X s 2102 1213 m 32 X s 2102 1257 m 32 X s 2102 1300 m 32 X s 2071 1344 m 63 X s 2102 1387 m 32 X s 2102 1431 m 32 X s 2102 1475 m 32 X s 2071 1518 m 63 X s 2102 1562 m 32 X s 2102 1605 m 32 X s 2102 1649 m 32 X s
 2071 1692 m 63 X s 2102 1736 m 32 X s 2102 1779 m 32 X s 2102 1823 m 32 X s 2071 1866 m 63 X s 2102 1910 m 32 X s 2102 1953 m 32 X s 2102 1997 m 32 X s 2071 2040 m 63 X s 2071 822 m 63 X s 2102 778 m 32 X s 2071 2040 m 63 X s 2102 2084 m 32 X s 0 0
 1 c 6 lw 1 1 1 c 0 0 1 c 378 823 m 30 X 7 Y 29 X 11 Y 29 X 9 Y 29 X 8 Y 30 X 14 Y 29 X 113 Y 29 X 231 Y 29 X 326 Y 30 X 302 Y 29 X 141 Y 29 X 35 Y 29 X -94 Y 30 X -161 Y 29 X -214 Y 29 X -227 Y 29 X -225 Y 30 X -134 Y 29 X -66 Y 29 X -33 Y 29 X -18
 Y 30 X -9 Y 29 X -8 Y 29 X -2 Y 30 X -2 Y 29 X -2 Y 29 X -1 Y 29 X -1 Y 88 X -1 Y 29 X 1 Y 30 X -1 Y 819 X s 0 1 0 c 1 1 1 c 0 1 0 c 3 lw 393 823 m21 6 lw 3 lw 422 833 m21 6 lw 3 lw 451 845 m21 6 lw 3 lw 481 855 m21 6 lw 3 lw 510 865 m21 6 lw 3 lw
 539 886 m21 6 lw 3 lw 568 989 m21 6 lw 3 lw 598 1239 m21 6 lw 3 lw 627 1558 m21 6 lw 3 lw 656 1841 m21 6 lw 3 lw 685 1987 m21 6 lw 3 lw 715 2007 m21 6 lw 3 lw 744 1917 m21 6 lw 3 lw 773 1757 m21 6 lw 3 lw 803 1543 m21 6 lw 3 lw 832 1313 m21 6 lw 3
 lw 861 1090 m21 6 lw 3 lw 890 958 m21 6 lw 3 lw 920 896 m21 6 lw 3 lw 949 863 m21 6 lw 3 lw 978 846 m21 6 lw 3 lw 1007 837 m21 6 lw 3 lw 1037 831 m21 6 lw 3 lw 1066 828 m21 6 lw 3 lw 1095 826 m21 6 lw 3 lw 1124 825 m21 6 lw 3 lw 1154 824 m21 6 lw 3
 lw 1183 823 m21 6 lw 3 lw 1212 823 m21 6 lw 3 lw 1241 823 m21 6 lw 3 lw 1271 822 m21 6 lw 3 lw 1300 822 m21 6 lw 3 lw 1329 822 m21 6 lw 3 lw 1359 822 m21 6 lw 3 lw 1388 822 m21 6 lw 3 lw 1417 822 m21 6 lw 3 lw 1446 822 m21 6 lw 3 lw 1476 822 m21 6
 lw 3 lw 1505 822 m21 6 lw 3 lw 1534 822 m21 6 lw 3 lw 1563 822 m21 6 lw 3 lw 1593 822 m21 6 lw 3 lw 1622 822 m21 6 lw 3 lw 1651 822 m21 6 lw 3 lw 1680 822 m21 6 lw 3 lw 1710 822 m21 6 lw 3 lw 1739 822 m21 6 lw 3 lw 1768 822 m21 6 lw 3 lw 1827 822
 m21 6 lw 3 lw 1856 822 m21 6 lw 3 lw 1885 822 m21 6 lw 3 lw 1914 822 m21 6 lw 3 lw 1944 822 m21 6 lw 3 lw 2032 822 m21 6 lw 3 lw 2061 822 m21 6 lw 3 lw 2119 822 m21 6 lw 1 0.8 0 c 1 1 1 c 1 0.8 0 c 3 lw 393 823 m23 6 lw 3 lw 422 833 m23 6 lw 3 lw
 451 844 m23 6 lw 3 lw 481 853 m23 6 lw 3 lw 510 865 m23 6 lw 3 lw 539 877 m23 6 lw 3 lw 568 973 m23 6 lw 3 lw 598 1207 m23 6 lw 3 lw 627 1551 m23 6 lw 3 lw 656 1851 m23 6 lw 3 lw 685 2013 m23 6 lw 3 lw 715 2017 m23 6 lw 3 lw 744 1928 m23 6 lw 3 lw
 773 1759 m23 6 lw 3 lw 803 1547 m23 6 lw 3 lw 832 1309 m23 6 lw 3 lw 861 1097 m23 6 lw 3 lw 890 960 m23 6 lw 3 lw 920 898 m23 6 lw 3 lw 949 864 m23 6 lw 3 lw 978 847 m23 6 lw 3 lw 1007 837 m23 6 lw 3 lw 1037 831 m23 6 lw 3 lw 1066 828 m23 6 lw 3 lw
 1095 826 m23 6 lw 3 lw 1124 824 m23 6 lw 3 lw 1154 824 m23 6 lw 3 lw 1183 823 m23 6 lw 3 lw 1212 823 m23 6 lw 3 lw 1241 822 m23 6 lw 3 lw 1271 822 m23 6 lw 3 lw 1300 822 m23 6 lw 3 lw 1329 822 m23 6 lw 3 lw 1359 822 m23 6 lw 3 lw 1388 822 m23 6 lw 3
 lw 1417 822 m23 6 lw 3 lw 1446 822 m23 6 lw 3 lw 1476 822 m23 6 lw 3 lw 1505 822 m23 6 lw 3 lw 1534 822 m23 6 lw 3 lw 1593 822 m23 6 lw 3 lw 1710 822 m23 6 lw 3 lw 1797 822 m23 6 lw 3 lw 1885 822 m23 6 lw 3 lw 1914 822 m23 6 lw 1 1 1 c 0 lw 400 202
 1689 1841 bf 3 lw 1712 1841 m -15 Y 393 X 194 Y -16 X -179 Y f 0 lw 1689 1841 m 202 Y 400 X -202 Y -400 X cl s black
 gsave  2222 1393 23 762 C 1788.3 2001.37 t 0 r /Helvetica findfont 41.863 sf 0 0 m (MCFM) show NC gr  0 0 1 c 6 lw 1704 2018 m 70 X s black
 gsave  2222 1393 23 762 C 1788.3 1955.72 t 0 r /Helvetica findfont 41.863 sf 0 0 m (MC@NLO) show NC gr  1 1 1 c 3 lw 1704 1950 m 70 X 35 Y -70 X f 6 lw 1 0 0 c 1704 1967 m 70 X s 3 lw 1739 1967 m24 6 lw black
 gsave  2222 1393 23 762 C 1788.3 1898.64 t 0 r /Helvetica findfont 41.863 sf 0 0 m (POWHEG) show NC gr  1 1 1 c 3 lw 1704 1899 m 70 X 36 Y -70 X f 6 lw 0 1 0 c 1704 1917 m 70 X s 3 lw 1739 1917 m21 6 lw black
 gsave  2222 1393 23 762 C 1788.3 1849.18 t 0 r /Helvetica findfont 41.863 sf 0 0 m 
 142 117 87 58 28
(SHERPA) K NC gr  1 1 1 c 3 lw 1704 1849 m 70 X 35 Y -70 X f 6 lw 1 0.8 0 c 1704 1866 m 70 X s 3 lw 1739 1866 m23 6 lw black 3 lw 1 1 1 c 2222 740 23 22 bf black 1 1 1 c 1756 518 378 244 bf black 1756 518 378 244 bl 1 1 1 c 1756 518 378 244 bf black
 1756 518 378 244 bl 1 0 0 c 6 lw 1 1 1 c 1 0 0 c 393 332 m 42 Y s 393 405 m 42 Y s 3 lw 393 389 m24 6 lw 3 lw 422 358 m24 6 lw 3 lw 451 333 m24 6 lw 3 lw 481 367 m24 6 lw 3 lw 510 365 m24 6 lw 3 lw 539 362 m24 6 lw 3 lw 568 456 m24 6 lw 3 lw 598 473
 m24 6 lw 3 lw 627 492 m24 6 lw 3 lw 656 504 m24 6 lw 3 lw 685 501 m24 6 lw 3 lw 715 504 m24 6 lw 3 lw 744 504 m24 6 lw 3 lw 773 500 m24 6 lw 3 lw 803 515 m24 6 lw 3 lw 832 539 m24 6 lw 3 lw 861 557 m24 6 lw 3 lw 890 546 m24 6 lw 3 lw 920 574 m24 6
 lw 949 588 m s 949 619 m s 3 lw 949 604 m24 6 lw 978 531 m 2 Y s 978 563 m 2 Y s 3 lw 978 548 m24 6 lw 1007 570 m 8 Y s 1007 608 m 9 Y s 3 lw 1007 593 m24 6 lw 1037 521 m 13 Y s 1037 564 m 14 Y s 3 lw 1037 549 m24 6 lw 1066 671 m 35 Y s 1066 736 m
 26 Y s 3 lw 1066 721 m24 6 lw 1212 556 m 79 Y s 1212 665 m 79 Y s 3 lw 1212 650 m24 6 lw 1271 423 m 78 Y s 1271 532 m 78 Y s 3 lw 1271 517 m24 6 lw 1329 292 m 71 Y s 1329 393 m 71 Y s 3 lw 1329 378 m24 6 lw 1476 394 m 309 Y s 1476 733 m 29 Y s 3 lw
 1476 718 m24 6 lw 1856 244 m 318 Y s 1856 592 m 170 Y s 3 lw 1856 577 m24 6 lw black 3 lw 378 244 m 1756 X s
 gsave  2222 740 23 22 C 1917.67 83.7077 t 0 r /Helvetica findfont 76.2862 sf 0 0 m ( [GeV]) show NC gr 
 gsave  2222 740 23 22 C 1887.23 60.8783 t 0 r /Helvetica findfont 49.586 sf 0 0 m (T) show NC gr 
 gsave  2222 740 23 22 C 1826.35 83.7077 t 0 r /Helvetica findfont 76.2862 sf 0 0 m (m) show NC gr  378 261 m -17 Y s 437 253 m -9 Y s 495 253 m -9 Y s 554 253 m -9 Y s 612 253 m -9 Y s 671 261 m -17 Y s 729 253 m -9 Y s 788 253 m -9 Y s 846 253 m -9
 Y s 905 253 m -9 Y s 963 261 m -17 Y s 1022 253 m -9 Y s 1081 253 m -9 Y s 1139 253 m -9 Y s 1198 253 m -9 Y s 1256 261 m -17 Y s 1315 253 m -9 Y s 1373 253 m -9 Y s 1432 253 m -9 Y s 1490 253 m -9 Y s 1549 261 m -17 Y s 1607 253 m -9 Y s 1666 253 m
 -9 Y s 1724 253 m -9 Y s 1783 253 m -9 Y s 1841 261 m -17 Y s 1900 253 m -9 Y s 1958 253 m -9 Y s 2017 253 m -9 Y s 2075 253 m -9 Y s 2134 261 m -17 Y s
 gsave  2222 740 23 22 C 357.66 190.245 t 0 r /Helvetica findfont 61.0289 sf 0 0 m (0) show NC gr 
 gsave  2222 740 23 22 C 620.198 190.245 t 0 r /Helvetica findfont 61.0289 sf 0 0 m (100) show NC gr 
 gsave  2222 740 23 22 C 913.174 190.245 t 0 r /Helvetica findfont 61.0289 sf 0 0 m (200) show NC gr 
 gsave  2222 740 23 22 C 1206.15 190.245 t 0 r /Helvetica findfont 61.0289 sf 0 0 m (300) show NC gr 
 gsave  2222 740 23 22 C 1499.13 190.245 t 0 r /Helvetica findfont 61.0289 sf 0 0 m (400) show NC gr 
 gsave  2222 740 23 22 C 1788.3 190.245 t 0 r /Helvetica findfont 61.0289 sf 0 0 m (500) show NC gr 
 gsave  2222 740 23 22 C 2081.28 190.245 t 0 r /Helvetica findfont 61.0289 sf 0 0 m (600) show NC gr  378 762 m 1756 X s 378 744 m 18 Y s 437 753 m 9 Y s 495 753 m 9 Y s 554 753 m 9 Y s 612 753 m 9 Y s 671 744 m 18 Y s 729 753 m 9 Y s 788 753 m 9 Y s
 846 753 m 9 Y s 905 753 m 9 Y s 963 744 m 18 Y s 1022 753 m 9 Y s 1081 753 m 9 Y s 1139 753 m 9 Y s 1198 753 m 9 Y s 1256 744 m 18 Y s 1315 753 m 9 Y s 1373 753 m 9 Y s 1432 753 m 9 Y s 1490 753 m 9 Y s 1549 744 m 18 Y s 1607 753 m 9 Y s 1666 753 m
 9 Y s 1724 753 m 9 Y s 1783 753 m 9 Y s 1841 744 m 18 Y s 1900 753 m 9 Y s 1958 753 m 9 Y s 2017 753 m 9 Y s 2075 753 m 9 Y s 2134 744 m 18 Y s 378 244 m 518 Y s
 gsave  2222 740 23 22 C 171.22 433.758 t 90 r /Helvetica findfont 76.2862 sf 0 0 m (ratio) show NC gr  425 244 m -47 X s 402 265 m -24 X s 402 287 m -24 X s 402 309 m -24 X s 425 330 m -47 X s 402 352 m -24 X s 402 373 m -24 X s 402 395 m -24 X s
 425 416 m -47 X s 402 438 m -24 X s 402 460 m -24 X s 402 481 m -24 X s 425 503 m -47 X s 402 524 m -24 X s 402 546 m -24 X s 402 567 m -24 X s 425 589 m -47 X s 402 611 m -24 X s 402 632 m -24 X s 402 654 m -24 X s 425 675 m -47 X s 402 697 m -24 X
 s 402 719 m -24 X s 402 740 m -24 X s 425 762 m -47 X s
 gsave  2222 740 23 22 C 281.562 224.489 t 0 r /Helvetica findfont 61.0289 sf 0 0 m (0.4) show NC gr 
 gsave  2222 740 23 22 C 281.562 308.196 t 0 r /Helvetica findfont 61.0289 sf 0 0 m (0.6) show NC gr 
 gsave  2222 740 23 22 C 281.562 395.709 t 0 r /Helvetica findfont 61.0289 sf 0 0 m (0.8) show NC gr 
 gsave  2222 740 23 22 C 342.44 479.417 t 0 r /Helvetica findfont 61.0289 sf 0 0 m (1) show NC gr 
 gsave  2222 740 23 22 C 281.562 563.124 t 0 r /Helvetica findfont 61.0289 sf 0 0 m (1.2) show NC gr 
 gsave  2222 740 23 22 C 281.562 650.637 t 0 r /Helvetica findfont 61.0289 sf 0 0 m (1.4) show NC gr 
 gsave  2222 740 23 22 C 281.562 741.954 t 0 r /Helvetica findfont 61.0289 sf 0 0 m (1.6) show NC gr  2134 244 m 518 Y s 2087 244 m 47 X s 2111 265 m 23 X s 2111 287 m 23 X s 2111 309 m 23 X s 2087 330 m 47 X s 2111 352 m 23 X s 2111 373 m 23 X s
 2111 395 m 23 X s 2087 416 m 47 X s 2111 438 m 23 X s 2111 460 m 23 X s 2111 481 m 23 X s 2087 503 m 47 X s 2111 524 m 23 X s 2111 546 m 23 X s 2111 567 m 23 X s 2087 589 m 47 X s 2111 611 m 23 X s 2111 632 m 23 X s 2111 654 m 23 X s 2087 675 m 47 X
 s 2111 697 m 23 X s 2111 719 m 23 X s 2111 740 m 23 X s 2087 762 m 47 X s 0 1 0 c 6 lw 1 1 1 c 0 1 0 c 393 376 m 32 Y s 393 439 m 32 Y s 3 lw 393 423 m21 6 lw 3 lw 422 395 m21 6 lw 3 lw 451 416 m21 6 lw 3 lw 481 433 m21 6 lw 3 lw 510 428 m21 6 lw 3
 lw 539 412 m21 6 lw 3 lw 568 493 m21 6 lw 3 lw 598 479 m21 6 lw 3 lw 627 493 m21 6 lw 3 lw 656 504 m21 6 lw 3 lw 685 502 m21 6 lw 3 lw 715 507 m21 6 lw 3 lw 744 506 m21 6 lw 3 lw 773 506 m21 6 lw 3 lw 803 507 m21 6 lw 3 lw 832 512 m21 6 lw 3 lw 861
 517 m21 6 lw 3 lw 890 523 m21 6 lw 3 lw 920 526 m21 6 lw 3 lw 949 529 m21 6 lw 3 lw 978 539 m21 6 lw 1007 523 m 1 Y s 1007 554 m s 3 lw 1007 539 m21 6 lw 1037 453 m 2 Y s 1037 485 m 2 Y s 3 lw 1037 470 m21 6 lw 1066 552 m 12 Y s 1066 594 m 12 Y s 3
 lw 1066 579 m21 6 lw 1095 546 m 17 Y s 1095 593 m 17 Y s 3 lw 1095 578 m21 6 lw 1124 481 m 16 Y s 1124 527 m 17 Y s 3 lw 1124 512 m21 6 lw 1154 557 m 34 Y s 1154 621 m 34 Y s 3 lw 1154 606 m21 6 lw 1183 403 m 21 Y s 1183 455 m 21 Y s 3 lw 1183 439
 m21 6 lw 1212 499 m 46 Y s 1212 575 m 46 Y s 3 lw 1212 560 m21 6 lw 1241 582 m 76 Y s 1241 688 m 74 Y s 3 lw 1241 673 m21 6 lw 1271 462 m 65 Y s 1271 557 m 65 Y s 3 lw 1271 542 m21 6 lw 1329 262 m 27 Y s 1329 319 m 28 Y s 3 lw 1329 304 m21 6 lw 1359
 529 m 137 Y s 1359 696 m 66 Y s 3 lw 1359 681 m21 6 lw 1476 276 m 63 Y s 1476 369 m 64 Y s 3 lw 1476 354 m21 6 lw 1505 442 m 144 Y s 1505 617 m 144 Y s 3 lw 1505 602 m21 6 lw 1651 343 m 257 Y s 1651 630 m 132 Y s 3 lw 1651 615 m21 6 lw 1680 244 m
 237 Y s 1680 512 m 250 Y s 3 lw 1680 496 m21 6 lw 1 0.8 0 c 1 1 1 c 1 0.8 0 c 393 279 m 49 Y s 393 358 m 49 Y s 3 lw 393 343 m23 6 lw 422 376 m 10 Y s 422 416 m 10 Y s 3 lw 422 401 m23 6 lw 451 419 m 5 Y s 451 454 m 5 Y s 3 lw 451 439 m23 6 lw 481
 435 m 2 Y s 481 468 m 2 Y s 3 lw 481 452 m23 6 lw 3 lw 510 428 m23 6 lw 3 lw 539 470 m23 6 lw 3 lw 568 537 m23 6 lw 3 lw 598 513 m23 6 lw 3 lw 627 497 m23 6 lw 3 lw 656 500 m23 6 lw 3 lw 685 493 m23 6 lw 3 lw 715 504 m23 6 lw 3 lw 744 502 m23 6 lw 3
 lw 773 506 m23 6 lw 3 lw 803 506 m23 6 lw 3 lw 832 516 m23 6 lw 3 lw 861 506 m23 6 lw 3 lw 890 517 m23 6 lw 3 lw 920 511 m23 6 lw 949 502 m 3 Y s 949 535 m 3 Y s 3 lw 949 520 m23 6 lw 978 509 m 8 Y s 978 548 m 8 Y s 3 lw 978 532 m23 6 lw 1007 512 m
 16 Y s 1007 559 m 15 Y s 3 lw 1007 543 m23 6 lw 1037 467 m 22 Y s 1037 520 m 22 Y s 3 lw 1037 505 m23 6 lw 1066 516 m 35 Y s 1066 582 m 35 Y s 3 lw 1066 566 m23 6 lw 1095 565 m 60 Y s 1095 656 m 60 Y s 3 lw 1095 641 m23 6 lw 1124 529 m 69 Y s 1124
 629 m 69 Y s 3 lw 1124 613 m23 6 lw 1154 535 m 90 Y s 1154 656 m 90 Y s 3 lw 1154 640 m23 6 lw 1183 577 m 169 Y s 3 lw 1183 761 m23 6 lw 1212 413 m 90 Y s 1212 533 m 91 Y s 3 lw 1212 518 m23 6 lw 1329 244 m 37 Y s 1329 311 m 64 Y s 3 lw 1329 296 m23
 6 lw 1359 385 m 298 Y s 1359 714 m 48 Y s 3 lw 1359 699 m23 6 lw 1417 244 m 54 Y s 1417 329 m 76 Y s 3 lw 1417 313 m23 6 lw 1446 244 m 40 Y s 1446 315 m 71 Y s 3 lw 1446 300 m23 6 lw 1476 244 m 49 Y s 1476 323 m 103 Y s 3 lw 1476 308 m23 6 lw
 gr  gr showpage
end
%%EOF
