%!PS-Adobe-2.0 EPSF-2.0
%%BoundingBox:  0 0 567 306
%%Title: /imports/home/pttaylor/Histos_from_D3PDs/S_and_S+I_Pass_MVV.eps: Canvas_1
%%Creator: ROOT Version 5.34/05
%%CreationDate: Wed Apr 17 05:37:16 2013
%%EndComments
%%BeginProlog
80 dict begin
/s {stroke} def /l {lineto} def /m {moveto} def /t {translate} def
/r {rotate} def /rl {roll}  def /R {repeat} def
/d {rlineto} def /rm {rmoveto} def /gr {grestore} def /f {eofill} def
/c {setrgbcolor} def /black {0 setgray} def /sd {setdash} def
/cl {closepath} def /sf {scalefont setfont} def /lw {setlinewidth} def
/box {m dup 0 exch d exch 0 d 0 exch neg d cl} def
/NC{systemdict begin initclip end}def/C{NC box clip newpath}def
/bl {box s} def /bf {box f} def /Y { 0 exch d} def /X { 0 d} def 
/K {{pop pop 0 moveto} exch kshow} bind def
/ita {/ang 15 def gsave [1 0 ang dup sin exch cos div 1 0 0] concat} def 
/mp {newpath /y exch def /x exch def} def
/side {[w .77 mul w .23 mul] .385 w mul sd w 0 l currentpoint t -144 r} def
/mr {mp x y w2 0 360 arc} def /m24 {mr s} def /m20 {mr f} def
/mb {mp x y w2 add m w2 neg 0 d 0 w neg d w 0 d 0 w d cl} def
/mt {mp x y w2 add m w2 neg w neg d w 0 d cl} def
/m21 {mb f} def /m25 {mb s} def /m22 {mt f} def /m26{mt s} def
/m23 {mp x y w2 sub m w2 w d w neg 0 d cl f} def
/m27 {mp x y w2 add m w3 neg w2 neg d w3 w2 neg d w3 w2 d cl s} def
/m28 {mp x w2 sub y w2 sub w3 add m w3 0 d  0 w3 neg d w3 0 d 0 w3 d w3 0 d  0 w3 d w3 neg 0 d 0 w3 d w3 neg 0 d 0 w3 neg d w3 neg 0 d cl s } def
/m29 {mp gsave x w2 sub y w2 add w3 sub m currentpoint t 4 {side} repeat cl fill gr} def
/m30 {mp gsave x w2 sub y w2 add w3 sub m currentpoint t 4 {side} repeat cl s gr} def
/m31 {mp x y w2 sub m 0 w d x w2 sub y m w 0 d x w2 sub y w2 add m w w neg d x w2 sub y w2 sub m w w d s} def
/m32 {mp x y w2 sub m w2 w d w neg 0 d cl s} def
/m33 {mp x y w2 add m w3 neg w2 neg d w3 w2 neg d w3 w2 d cl f} def
/m34 {mp x w2 sub y w2 sub w3 add m w3 0 d  0 w3 neg d w3 0 d 0 w3 d w3 0 d  0 w3 d w3 neg 0 d 0 w3 d w3 neg 0 d 0 w3 neg d w3 neg 0 d cl f } def
/m2 {mp x y w2 sub m 0 w d x w2 sub y m w 0 d s} def
/m5 {mp x w2 sub y w2 sub m w w d x w2 sub y w2 add m w w neg d s} def
/reEncode {exch findfont dup length dict begin {1 index /FID eq  {pop pop} {def} ifelse } forall /Encoding exch def currentdict end dup /FontName get exch definefont pop } def [/Times-Bold /Times-Italic /Times-BoldItalic /Helvetica /Helvetica-Oblique
 /Helvetica-Bold /Helvetica-BoldOblique /Courier /Courier-Oblique /Courier-Bold /Courier-BoldOblique /Times-Roman /AvantGarde-Book /AvantGarde-BookOblique /AvantGarde-Demi /AvantGarde-DemiOblique /Bookman-Demi /Bookman-DemiItalic /Bookman-Light
 /Bookman-LightItalic /Helvetica-Narrow /Helvetica-Narrow-Bold /Helvetica-Narrow-BoldOblique /Helvetica-Narrow-Oblique /NewCenturySchlbk-Roman /NewCenturySchlbk-Bold /NewCenturySchlbk-BoldItalic /NewCenturySchlbk-Italic /Palatino-Bold
 /Palatino-BoldItalic /Palatino-Italic /Palatino-Roman ] {ISOLatin1Encoding reEncode } forall
%%EndProlog
%%BeginSetup
%%EndSetup
newpath  gsave  .25 .25 scale  gsave  0 0 t black[  ] 0 sd 3 lw 1 1 1 c 2268 1225 0 0 bf black 1 1 1 c 1814 980 227 123 bf black 1814 980 227 123 bl 1 1 1 c 1814 980 227 123 bf black 1814 980 227 123 bl 0.35 0.83 0.33 c[ 12 12] 0 sd 1 1 1 c 0.35 0.83
 0.33 c 227 123 m 272 X 63 Y 9 X 1 Y 9 X -1 Y 9 X -2 Y 9 X -3 Y 9 X -3 Y 9 X -2 Y 9 X -2 Y 19 X 3 Y 9 X -7 Y 9 X 1 Y 9 X 2 Y 9 X -1 Y 9 X 4 Y 18 X 2 Y 9 X -1 Y 9 X 4 Y 9 X 4 Y 9 X 13 Y 9 X 3 Y 9 X 3 Y 10 X 3 Y 9 X 12 Y 9 X 20 Y 18 X 12 Y 18 X 21 Y 9
 X -6 Y 9 X 16 Y 9 X 2 Y 9 X -4 Y 9 X 16 Y 9 X 3 Y 9 X 17 Y 10 X 1 Y 9 X 27 Y 9 X 8 Y 18 X -1 Y 9 X 37 Y 9 X -2 Y 9 X 10 Y 9 X -10 Y 9 X 8 Y 9 X 25 Y 9 X 18 Y 9 X 17 Y 9 X -8 Y 10 X 9 Y 9 X 54 Y 9 X -8 Y 9 X 33 Y 9 X 10 Y 9 X 16 Y 9 X 11 Y 9 X 31 Y 9
 X -15 Y 9 X 36 Y 9 X 32 Y 9 X 4 Y 18 X 82 Y 10 X -28 Y 9 X 39 Y 9 X 55 Y 9 X -19 Y 9 X 63 Y 9 X -10 Y 9 X 48 Y 9 X 35 Y 9 X 18 Y 9 X 39 Y 9 X 3 Y 9 X 22 Y 9 X -2 Y 9 X -12 Y 9 X 46 Y 10 X 18 Y 9 X -5 Y 9 X -58 Y 9 X 31 Y 9 X -33 Y 9 X 2 Y 9 X -52 Y
 9 X -55 Y 9 X -66 Y 9 X 10 Y 9 X -45 Y 9 X -37 Y 9 X -47 Y 9 X -34 Y 10 X -36 Y 9 X -33 Y 9 X -35 Y 9 X -45 Y 9 X -3 Y 9 X -67 Y 9 X -15 Y 9 X -32 Y 9 X -22 Y 9 X -18 Y 9 X -8 Y 9 X -8 Y 9 X -33 Y 9 X -24 Y 10 X 6 Y 9 X -19 Y 9 X -24 Y 9 X 5 Y 9 X
 -41 Y 9 X 53 Y 9 X -16 Y 9 X 4 Y 9 X -30 Y 9 X 4 Y 9 X 9 Y 9 X -23 Y 9 X -1 Y 9 X 1 Y 10 X -3 Y 9 X -11 Y 9 X -10 Y 9 X 4 Y 9 X -8 Y 9 X -4 Y 9 X -10 Y 9 X -4 Y 9 X 4 Y 9 X -5 Y 9 X -2 Y 9 X -8 Y 9 X 2 Y 9 X 1 Y 10 X 4 Y 9 X -4 Y 9 X -6 Y 9 X -5 Y 9
 X 3 Y 9 X 3 Y 9 X -5 Y 9 X 1 Y 9 X -5 Y 9 X -3 Y 9 X -1 Y 9 X 1 Y 9 X 1 Y 9 X -1 Y 10 X 3 Y 9 X -9 Y 9 X 1 Y 9 X -1 Y 9 X 5 Y 9 X -11 Y 9 X 4 Y 18 X 4 Y 9 X -6 Y 9 X 1 Y 18 X -4 Y 9 X 1 Y 10 X 2 Y 9 X -1 Y 9 X -1 Y 18 X -1 Y 9 X -1 Y 9 X s black[  ]
 0 sd 227 123 m 1814 X s
 gsave  2268 1225 0 0 C 2005.53 33.7321 t 0 r /Helvetica findfont 26.0657 sf 0 0 m (VV) show NC gr 
 gsave  2268 1225 0 0 C 1974.86 45.9983 t 0 r /Helvetica findfont 39.8652 sf 0 0 m (M) show NC gr  227 152 m -29 Y s 292 137 m -14 Y s 356 137 m -14 Y s 421 137 m -14 Y s 486 152 m -29 Y s 551 137 m -14 Y s 616 137 m -14 Y s 680 137 m -14 Y s 745 152
 m -29 Y s 810 137 m -14 Y s 875 137 m -14 Y s 939 137 m -14 Y s 1004 152 m -29 Y s 1069 137 m -14 Y s 1134 137 m -14 Y s 1199 137 m -14 Y s 1263 152 m -29 Y s 1328 137 m -14 Y s 1393 137 m -14 Y s 1458 137 m -14 Y s 1523 152 m -29 Y s 1587 137 m -14
 Y s 1652 137 m -14 Y s 1717 137 m -14 Y s 1782 152 m -29 Y s 1847 137 m -14 Y s 1911 137 m -14 Y s 1976 137 m -14 Y s 2041 152 m -29 Y s
 gsave  2268 1225 0 0 C 214.659 82.797 t 0 r /Helvetica findfont 39.8652 sf 0 0 m (0) show NC gr 
 gsave  2268 1225 0 0 C 450.783 82.797 t 0 r /Helvetica findfont 39.8652 sf 0 0 m (200) show NC gr 
 gsave  2268 1225 0 0 C 709.907 82.797 t 0 r /Helvetica findfont 39.8652 sf 0 0 m (400) show NC gr 
 gsave  2268 1225 0 0 C 969.031 82.797 t 0 r /Helvetica findfont 39.8652 sf 0 0 m (600) show NC gr 
 gsave  2268 1225 0 0 C 1229.69 82.797 t 0 r /Helvetica findfont 39.8652 sf 0 0 m (800) show NC gr 
 gsave  2268 1225 0 0 C 1478.08 82.797 t 0 r /Helvetica findfont 39.8652 sf 0 0 m (1000) show NC gr 
 gsave  2268 1225 0 0 C 1737.2 82.797 t 0 r /Helvetica findfont 39.8652 sf 0 0 m (1200) show NC gr 
 gsave  2268 1225 0 0 C 1996.33 82.797 t 0 r /Helvetica findfont 39.8652 sf 0 0 m (1400) show NC gr  227 123 m 980 Y s 281 123 m -54 X s 254 149 m -27 X s 254 175 m -27 X s 254 201 m -27 X s 281 227 m -54 X s 254 253 m -27 X s 254 280 m -27 X s 254
 306 m -27 X s 281 332 m -54 X s 254 358 m -27 X s 254 384 m -27 X s 254 410 m -27 X s 281 437 m -54 X s 254 463 m -27 X s 254 489 m -27 X s 254 515 m -27 X s 281 541 m -54 X s 254 568 m -27 X s 254 594 m -27 X s 254 620 m -27 X s 281 646 m -54 X s
 254 672 m -27 X s 254 698 m -27 X s 254 725 m -27 X s 281 751 m -54 X s 254 777 m -27 X s 254 803 m -27 X s 254 829 m -27 X s 281 855 m -54 X s 254 882 m -27 X s 254 908 m -27 X s 254 934 m -27 X s 281 960 m -54 X s 254 986 m -27 X s 254 1013 m -27
 X s 254 1039 m -27 X s 281 1065 m -54 X s 281 1065 m -54 X s 254 1091 m -27 X s
 gsave  2268 1225 0 0 C 193.193 107.329 t 0 r /Helvetica findfont 39.8652 sf 0 0 m (0) show NC gr 
 gsave  2268 1225 0 0 C 137.995 213.125 t 0 r /Helvetica findfont 39.8652 sf 0 0 m (0.02) show NC gr 
 gsave  2268 1225 0 0 C 137.995 317.388 t 0 r /Helvetica findfont 39.8652 sf 0 0 m (0.04) show NC gr 
 gsave  2268 1225 0 0 C 137.995 421.651 t 0 r /Helvetica findfont 39.8652 sf 0 0 m (0.06) show NC gr 
 gsave  2268 1225 0 0 C 137.995 527.447 t 0 r /Helvetica findfont 39.8652 sf 0 0 m (0.08) show NC gr 
 gsave  2268 1225 0 0 C 167.127 631.71 t 0 r /Helvetica findfont 39.8652 sf 0 0 m (0.1) show NC gr 
 gsave  2268 1225 0 0 C 137.995 735.973 t 0 r /Helvetica findfont 39.8652 sf 0 0 m (0.12) show NC gr 
 gsave  2268 1225 0 0 C 137.995 840.236 t 0 r /Helvetica findfont 39.8652 sf 0 0 m (0.14) show NC gr 
 gsave  2268 1225 0 0 C 137.995 946.032 t 0 r /Helvetica findfont 39.8652 sf 0 0 m (0.16) show NC gr 
 gsave  2268 1225 0 0 C 137.995 1050.29 t 0 r /Helvetica findfont 39.8652 sf 0 0 m (0.18) show NC gr  0.35 0.83 0.33 c 1 1 1 c 0.35 0.83 0.33 c 227 123 m 272 X 49 Y 9 X 1 Y 18 X -2 Y 9 X -2 Y 9 X -3 Y 9 X -1 Y 9 X -2 Y 9 X 1 Y 10 X 2 Y 9 X -6 Y 9 X 2
 Y 9 X 1 Y 9 X -1 Y 9 X 5 Y 18 X 1 Y 18 X 3 Y 9 X 5 Y 9 X 12 Y 9 X 3 Y 9 X 2 Y 10 X 2 Y 9 X 11 Y 9 X 19 Y 18 X 11 Y 18 X 21 Y 9 X -6 Y 9 X 16 Y 9 X 2 Y 9 X -6 Y 9 X 15 Y 9 X 3 Y 9 X 17 Y 19 X 26 Y 9 X 6 Y 27 X 34 Y 9 X -3 Y 9 X 12 Y 9 X -11 Y 9 X 7 Y
 9 X 26 Y 9 X 14 Y 9 X 16 Y 9 X -8 Y 10 X 8 Y 9 X 48 Y 9 X -6 Y 9 X 29 Y 9 X 14 Y 9 X 15 Y 9 X 7 Y 9 X 29 Y 9 X -12 Y 9 X 34 Y 9 X 28 Y 9 X 1 Y 9 X 4 Y 9 X 76 Y 10 X -24 Y 9 X 34 Y 9 X 55 Y 9 X -19 Y 9 X 61 Y 9 X -6 Y 9 X 37 Y 9 X 39 Y 9 X 18 Y 9 X
 43 Y 9 X 3 Y 9 X 22 Y 9 X 2 Y 9 X -3 Y 9 X 41 Y 10 X 22 Y 9 X 2 Y 9 X -52 Y 9 X 35 Y 9 X -33 Y 9 X 8 Y 9 X -45 Y 9 X -48 Y 9 X -67 Y 9 X 6 Y 9 X -49 Y 9 X -41 Y 9 X -50 Y 9 X -35 Y 10 X -38 Y 9 X -35 Y 9 X -38 Y 9 X -46 Y 9 X -5 Y 9 X -62 Y 9 X -15
 Y 9 X -33 Y 9 X -25 Y 9 X -15 Y 9 X -11 Y 9 X -7 Y 9 X -28 Y 9 X -23 Y 10 X 2 Y 9 X -17 Y 9 X -20 Y 9 X 2 Y 9 X -37 Y 9 X 71 Y 9 X -16 Y 9 X 4 Y 9 X -30 Y 9 X 4 Y 9 X 9 Y 9 X -23 Y 9 X -1 Y 9 X 1 Y 10 X -3 Y 9 X -11 Y 9 X -10 Y 9 X 4 Y 9 X -8 Y 9 X
 -4 Y 9 X -10 Y 9 X -4 Y 9 X 4 Y 9 X -5 Y 9 X -2 Y 9 X -8 Y 9 X 2 Y 9 X 1 Y 10 X 4 Y 9 X -4 Y 9 X -6 Y 9 X -5 Y 9 X 3 Y 9 X 3 Y 9 X -5 Y 9 X 1 Y 9 X -5 Y 9 X -3 Y 9 X -1 Y 9 X 1 Y 9 X 1 Y 9 X -1 Y 10 X 3 Y 9 X -9 Y 9 X 1 Y 9 X -1 Y 9 X 5 Y 9 X -11 Y
 9 X 4 Y 18 X 4 Y 9 X -6 Y 9 X 1 Y 18 X -4 Y 9 X 1 Y 10 X 2 Y 9 X -1 Y 9 X -1 Y 18 X -1 Y 9 X -1 Y 9 X s[ 12 12] 0 sd 1 1 1 c 0.35 0.83 0.33 c 227 123 m 272 X 35 Y 9 X 1 Y 18 X -2 Y 9 X -1 Y 9 X -1 Y 9 X -2 Y 9 X -1 Y 9 X 1 Y 10 X 2 Y 9 X -5 Y 9 X 2
 Y 9 X 1 Y 9 X -1 Y 9 X 6 Y 18 X 1 Y 18 X 3 Y 9 X 5 Y 9 X 10 Y 9 X 3 Y 9 X 1 Y 10 X 3 Y 9 X 9 Y 9 X 19 Y 9 X -1 Y 9 X 11 Y 18 X 20 Y 9 X -6 Y 9 X 16 Y 9 X 2 Y 9 X -8 Y 9 X 14 Y 9 X 4 Y 9 X 15 Y 19 X 25 Y 9 X 5 Y 18 X 1 Y 9 X 31 Y 9 X -3 Y 9 X 12 Y 9
 X -11 Y 9 X 6 Y 9 X 26 Y 9 X 11 Y 9 X 16 Y 9 X -9 Y 10 X 8 Y 9 X 44 Y 9 X -7 Y 9 X 25 Y 9 X 18 Y 9 X 15 Y 9 X 3 Y 9 X 27 Y 9 X -9 Y 9 X 33 Y 9 X 20 Y 9 X 4 Y 9 X 6 Y 9 X 68 Y 10 X -23 Y 9 X 32 Y 9 X 52 Y 9 X -14 Y 9 X 51 Y 18 X 36 Y 9 X 38 Y 9 X 18
 Y 9 X 41 Y 9 X 9 Y 9 X 22 Y 9 X 6 Y 9 X -1 Y 9 X 46 Y 10 X 23 Y 9 X 7 Y 9 X -45 Y 9 X 37 Y 9 X -28 Y 9 X 14 Y 9 X -40 Y 9 X -43 Y 9 X -69 Y 9 X -1 Y 9 X -55 Y 9 X -46 Y 9 X -52 Y 9 X -42 Y 10 X -39 Y 9 X -37 Y 9 X -39 Y 9 X -47 Y 9 X -11 Y 9 X -57 Y
 9 X -16 Y 9 X -33 Y 9 X -22 Y 9 X -17 Y 9 X -11 Y 9 X -6 Y 9 X -28 Y 9 X -19 Y 10 X 3 Y 9 X -22 Y 9 X -9 Y 9 X -7 Y 9 X -23 Y 9 X 91 Y 9 X -16 Y 9 X 4 Y 9 X -30 Y 9 X 4 Y 9 X 9 Y 9 X -23 Y 9 X -1 Y 9 X 1 Y 10 X -3 Y 9 X -11 Y 9 X -10 Y 9 X 4 Y 9 X
 -8 Y 9 X -4 Y 9 X -10 Y 9 X -4 Y 9 X 4 Y 9 X -5 Y 9 X -2 Y 9 X -8 Y 9 X 2 Y 9 X 1 Y 10 X 4 Y 9 X -4 Y 9 X -6 Y 9 X -5 Y 9 X 3 Y 9 X 3 Y 9 X -5 Y 9 X 1 Y 9 X -5 Y 9 X -3 Y 9 X -1 Y 9 X 1 Y 9 X 1 Y 9 X -1 Y 10 X 3 Y 9 X -9 Y 9 X 1 Y 9 X -1 Y 9 X 5 Y 9
 X -11 Y 9 X 4 Y 18 X 4 Y 9 X -6 Y 9 X 1 Y 18 X -4 Y 9 X 1 Y 10 X 2 Y 9 X -1 Y 9 X -1 Y 18 X -1 Y 9 X -1 Y 9 X s 0 0 0.6 c[  ] 0 sd 1 1 1 c black 0 0 0.6 c 227 123 m 281 X 1 Y 9 X 2 Y 9 X -1 Y 18 X 2 Y 9 X -2 Y 9 X 2 Y 19 X 1 Y 9 X -2 Y 9 X 3 Y 9 X 1
 Y 9 X -1 Y 9 X 7 Y 27 X 2 Y 9 X 1 Y 9 X 6 Y 9 X 6 Y 9 X 4 Y 9 X -1 Y 10 X 1 Y 9 X 8 Y 9 X 18 Y 9 X -2 Y 9 X 10 Y 9 X -1 Y 9 X 19 Y 9 X -6 Y 9 X 18 Y 9 X 2 Y 9 X -14 Y 9 X 13 Y 9 X 6 Y 9 X 13 Y 19 X 22 Y 9 X 1 Y 9 X 2 Y 9 X 1 Y 9 X 27 Y 9 X -5 Y 9 X
 15 Y 9 X -13 Y 9 X 6 Y 9 X 27 Y 9 X 3 Y 9 X 15 Y 9 X -10 Y 10 X 8 Y 9 X 34 Y 9 X -6 Y 9 X 17 Y 9 X 28 Y 9 X 14 Y 9 X -6 Y 9 X 24 Y 9 X -2 Y 9 X 29 Y 9 X 8 Y 9 X 4 Y 9 X 14 Y 9 X 53 Y 10 X -16 Y 9 X 25 Y 9 X 50 Y 9 X -9 Y 9 X 39 Y 9 X 11 Y 9 X 26 Y 9
 X 39 Y 9 X 19 Y 9 X 44 Y 9 X 15 Y 9 X 22 Y 9 X 14 Y 9 X 9 Y 9 X 47 Y 10 X 28 Y 9 X 18 Y 9 X -33 Y 9 X 43 Y 9 X -18 Y 9 X 22 Y 9 X -30 Y 9 X -35 Y 9 X -53 Y 9 X 16 Y 9 X -38 Y 9 X -30 Y 9 X -45 Y 9 X -28 Y 10 X -34 Y 9 X -32 Y 9 X -31 Y 9 X -46 Y 9 X
 3 Y 9 X -73 Y 9 X -15 Y 9 X -32 Y 9 X -23 Y 9 X -18 Y 9 X -6 Y 9 X -11 Y 9 X -36 Y 9 X -27 Y 10 X 8 Y 9 X -19 Y 9 X -32 Y 9 X 11 Y 9 X -17 Y 9 X -3 Y 9 X -16 Y 9 X 4 Y 9 X -30 Y 9 X 4 Y 9 X 9 Y 9 X -23 Y 9 X -1 Y 9 X 1 Y 10 X -3 Y 9 X -11 Y 9 X -10
 Y 9 X 4 Y 9 X -8 Y 9 X -4 Y 9 X -10 Y 9 X -4 Y 9 X 4 Y 9 X -5 Y 9 X -2 Y 9 X -8 Y 9 X 2 Y 9 X 1 Y 10 X 4 Y 9 X -4 Y 9 X -6 Y 9 X -5 Y 9 X 3 Y 9 X 3 Y 9 X -5 Y 9 X 1 Y 9 X -5 Y 9 X -3 Y 9 X -1 Y 9 X 1 Y 9 X 1 Y 9 X -1 Y 10 X 3 Y 9 X -9 Y 9 X 1 Y 9 X
 -1 Y 9 X 5 Y 9 X -11 Y 9 X 4 Y 18 X 4 Y 9 X -6 Y 9 X 1 Y 18 X -4 Y 9 X 1 Y 10 X 2 Y 9 X -1 Y 9 X -1 Y 18 X -1 Y 9 X -1 Y 9 X s black 1 1 1 c 454 245 1587 858 bf black 1587 858 m 454 X s 2041 858 m 245 Y s 2041 1103 m -454 X s 1587 1103 m -245 Y s
 gsave  2268 1225 0 0 C 1700.4 1036.5 t 0 r /Helvetica findfont 16.866 sf 0 0 m (Signal Only) show NC gr  0 0 0.6 c 1604 1041 m 80 X s black
 gsave  2268 1225 0 0 C 1700.4 913.833 t 0 r /Helvetica findfont 16.866 sf 0 0 m (Signal + Interference, Passarino's weights) show NC gr  0.35 0.83 0.33 c 1604 919 m 80 X s black
 gsave  2268 1225 0 0 C 2221.72 889.301 t 90 r /Helvetica-BoldOblique findfont 22.9992 sf 0 0 m (LHC HIGGS XS WG 2013) show NC gr  1 1 1 c black
 gsave  2268 1225 0 0 C 863.235 1166.82 t 0 r /Helvetica findfont 58.2645 sf 0 0 m (Signal + Interference) show NC gr 
 gr  gr showpage
end
%%EOF
