%!PS-Adobe-1.0
%%Creator: Unified Graphics System
%%Pages: (atend)
%%DocumentFonts: Helvetica
%%BoundingBox:   39  236  462  568
%%EndComments
/Sw{setlinewidth}def
/Sg{setgray}def
/Sd{setdash}def
/P {newpath
    moveto
0 0 rlineto
    stroke}def
/M {moveto}def
/D {lineto}def
/N {newpath}def
/S {stroke}def
/T {/Helvetica findfont
    exch
    scalefont
    setfont}def
/R {rotate}def
/W {show}def
/F {fill}def
/X {gsave}def
/Y {grestore}def
%%EndProlog
%%Page: 1 1
0.12000 0.12000 scale
1 setlinecap
1 setlinejoin
6 Sw
0.00 0.00 0.00 setrgbcolor
[] 0 Sd
N
2104 2092 M
2104 1999 D
S
N
2159 2051 M
2156 2048 D
2159 2045 D
2162 2048 D
2162 2051 D
2156 2057 D
2151 2060 D
2142 2060 D
2133 2057 D
2127 2051 D
2125 2043 D
2125 2037 D
2127 2028 D
2133 2022 D
2142 2019 D
2148 2019 D
2156 2022 D
2162 2028 D
S
N
2142 2060 M
2136 2057 D
2130 2051 D
2127 2043 D
2127 2037 D
2130 2028 D
2136 2022 D
2142 2019 D
S
N
2197 2060 M
2188 2057 D
2182 2051 D
2179 2043 D
2179 2037 D
2182 2028 D
2188 2022 D
2197 2019 D
2202 2019 D
2211 2022 D
2217 2028 D
2220 2037 D
2220 2043 D
2217 2051 D
2211 2057 D
2202 2060 D
2197 2060 D
S
N
2197 2060 M
2191 2057 D
2185 2051 D
2182 2043 D
2182 2037 D
2185 2028 D
2191 2022 D
2197 2019 D
S
N
2202 2019 M
2208 2022 D
2214 2028 D
2217 2037 D
2217 2043 D
2214 2051 D
2208 2057 D
2202 2060 D
S
N
2266 2054 M
2269 2060 D
2269 2048 D
2266 2054 D
2263 2057 D
2257 2060 D
2246 2060 D
2240 2057 D
2237 2054 D
2237 2048 D
2240 2045 D
2246 2043 D
2260 2037 D
2266 2034 D
2269 2031 D
S
N
2237 2051 M
2240 2048 D
2246 2045 D
2260 2040 D
2266 2037 D
2269 2034 D
2269 2025 D
2266 2022 D
2260 2019 D
2249 2019 D
2243 2022 D
2240 2025 D
2237 2031 D
2237 2019 D
2240 2025 D
S
N
2309 2080 M
2301 2077 D
2295 2069 D
2292 2063 D
2289 2054 D
2286 2040 D
2286 2028 D
2289 2022 D
2295 2019 D
2301 2019 D
2309 2022 D
2315 2031 D
2318 2037 D
2321 2045 D
2324 2060 D
2324 2071 D
2321 2077 D
2315 2080 D
2309 2080 D
S
N
2309 2080 M
2304 2077 D
2298 2069 D
2295 2063 D
2292 2054 D
2289 2040 D
2289 2028 D
2292 2022 D
2295 2019 D
S
N
2301 2019 M
2306 2022 D
2312 2031 D
2315 2037 D
2318 2045 D
2321 2060 D
2321 2071 D
2318 2077 D
2315 2080 D
S
N
2292 2051 M
2318 2051 D
S
N
2369 2123 M
2394 2063 D
S
N
2394 2123 M
2369 2063 D
S
N
2351 2106 M
2412 2080 D
S
N
2412 2106 M
2351 2080 D
S
N
2442 2092 M
2442 1999 D
S
N
401 2917 M
462 2917 D
S
N
401 2919 M
462 2919 D
S
N
430 2917 M
424 2911 D
422 2905 D
422 2899 D
424 2891 D
430 2885 D
439 2882 D
445 2882 D
453 2885 D
459 2891 D
462 2899 D
462 2905 D
459 2911 D
453 2917 D
S
N
422 2899 M
424 2893 D
430 2888 D
439 2885 D
445 2885 D
453 2888 D
459 2893 D
462 2899 D
S
N
401 2908 M
401 2919 D
S
N
462 2917 M
462 2928 D
S
N
422 2989 M
422 2960 D
424 2951 D
433 2945 D
442 2943 D
450 2943 D
456 2945 D
459 2948 D
462 2954 D
462 2960 D
459 2969 D
450 2974 D
442 2977 D
433 2977 D
427 2974 D
424 2971 D
422 2966 D
S
N
422 2960 M
424 2954 D
433 2948 D
442 2945 D
453 2945 D
459 2948 D
S
N
462 2960 M
459 2966 D
450 2971 D
442 2974 D
430 2974 D
424 2971 D
S
N
424 2971 M
424 2989 D
S
N
390 3052 M
482 3000 D
S
N
401 3101 M
462 3101 D
S
N
401 3104 M
462 3104 D
S
N
430 3101 M
424 3096 D
422 3090 D
422 3084 D
424 3075 D
430 3070 D
439 3067 D
445 3067 D
453 3070 D
459 3075 D
462 3084 D
462 3090 D
459 3096 D
453 3101 D
S
N
422 3084 M
424 3078 D
430 3073 D
439 3070 D
445 3070 D
453 3073 D
459 3078 D
462 3084 D
S
N
401 3093 M
401 3104 D
S
N
462 3101 M
462 3113 D
S
N
390 3176 M
482 3176 D
S
N
430 3231 M
433 3228 D
436 3231 D
433 3234 D
430 3234 D
424 3228 D
422 3223 D
422 3214 D
424 3205 D
430 3200 D
439 3197 D
445 3197 D
453 3200 D
459 3205 D
462 3214 D
462 3220 D
459 3228 D
453 3234 D
S
N
422 3214 M
424 3208 D
430 3202 D
439 3200 D
445 3200 D
453 3202 D
459 3208 D
462 3214 D
S
N
422 3269 M
424 3260 D
430 3254 D
439 3252 D
445 3252 D
453 3254 D
459 3260 D
462 3269 D
462 3275 D
459 3283 D
453 3289 D
445 3292 D
439 3292 D
430 3289 D
424 3283 D
422 3275 D
422 3269 D
S
N
422 3269 M
424 3263 D
430 3257 D
439 3254 D
445 3254 D
453 3257 D
459 3263 D
462 3269 D
S
N
462 3275 M
459 3280 D
453 3286 D
445 3289 D
439 3289 D
430 3286 D
424 3280 D
422 3275 D
S
N
427 3338 M
422 3341 D
433 3341 D
427 3338 D
424 3335 D
422 3329 D
422 3318 D
424 3312 D
427 3309 D
433 3309 D
436 3312 D
439 3318 D
445 3332 D
448 3338 D
450 3341 D
S
N
430 3309 M
433 3312 D
436 3318 D
442 3332 D
445 3338 D
448 3341 D
456 3341 D
459 3338 D
462 3332 D
462 3321 D
459 3315 D
456 3312 D
450 3309 D
462 3309 D
456 3312 D
S
N
401 3381 M
404 3373 D
413 3367 D
419 3364 D
427 3361 D
442 3358 D
453 3358 D
459 3361 D
462 3367 D
462 3373 D
459 3381 D
450 3387 D
445 3390 D
436 3393 D
422 3396 D
410 3396 D
404 3393 D
401 3387 D
401 3381 D
S
N
401 3381 M
404 3376 D
413 3370 D
419 3367 D
427 3364 D
442 3361 D
453 3361 D
459 3364 D
462 3367 D
S
N
462 3373 M
459 3379 D
450 3384 D
445 3387 D
436 3390 D
422 3393 D
410 3393 D
404 3390 D
401 3387 D
S
N
430 3364 M
430 3390 D
S
N
358 3441 M
419 3467 D
S
N
358 3467 M
419 3441 D
S
N
375 3423 M
401 3484 D
S
N
375 3484 M
401 3423 D
S
N
390 3514 M
482 3514 D
S
N
390 3604 M
396 3598 D
404 3592 D
416 3586 D
430 3584 D
442 3584 D
456 3586 D
468 3592 D
476 3598 D
482 3604 D
S
N
396 3598 M
407 3592 D
416 3589 D
430 3586 D
442 3586 D
456 3589 D
465 3592 D
476 3598 D
S
N
404 3641 M
407 3638 D
410 3641 D
407 3644 D
404 3644 D
401 3641 D
401 3636 D
404 3630 D
410 3627 D
462 3627 D
S
N
401 3636 M
404 3633 D
410 3630 D
462 3630 D
S
N
422 3618 M
422 3641 D
S
N
462 3618 M
462 3638 D
S
N
401 3664 M
462 3664 D
S
N
401 3667 M
462 3667 D
S
N
430 3667 M
424 3673 D
422 3679 D
422 3685 D
424 3693 D
430 3699 D
439 3702 D
445 3702 D
453 3699 D
459 3693 D
462 3685 D
462 3679 D
459 3673 D
453 3667 D
S
N
422 3685 M
424 3690 D
430 3696 D
439 3699 D
445 3699 D
453 3696 D
459 3690 D
462 3685 D
S
N
401 3656 M
401 3667 D
S
N
390 3719 M
396 3725 D
404 3731 D
416 3737 D
430 3740 D
442 3740 D
456 3737 D
468 3731 D
476 3725 D
482 3719 D
S
N
396 3725 M
407 3731 D
416 3734 D
430 3737 D
442 3737 D
456 3734 D
465 3731 D
476 3725 D
S
N
1062 2833 M
1062 2772 D
S
N
1065 2833 M
1065 2772 D
S
N
1065 2824 M
1071 2830 D
1077 2833 D
1082 2833 D
1091 2830 D
1097 2824 D
1100 2816 D
1100 2810 D
1097 2801 D
1091 2795 D
1082 2793 D
1077 2793 D
1071 2795 D
1065 2801 D
S
N
1082 2833 M
1088 2830 D
1094 2824 D
1097 2816 D
1097 2810 D
1094 2801 D
1088 2795 D
1082 2793 D
S
N
1053 2833 M
1065 2833 D
S
N
1053 2772 M
1074 2772 D
S
N
1123 2833 M
1123 2772 D
S
N
1126 2833 M
1126 2772 D
S
N
1126 2824 M
1131 2830 D
1137 2833 D
1143 2833 D
1152 2830 D
1157 2824 D
1160 2816 D
1160 2810 D
1157 2801 D
1152 2795 D
1143 2793 D
1137 2793 D
1131 2795 D
1126 2801 D
S
N
1143 2833 M
1149 2830 D
1154 2824 D
1157 2816 D
1157 2810 D
1154 2801 D
1149 2795 D
1143 2793 D
S
N
1114 2833 M
1126 2833 D
S
N
1114 2772 M
1134 2772 D
S
N
1224 2824 M
1232 2818 D
1224 2813 D
S
N
1215 2833 M
1230 2818 D
1215 2804 D
S
N
1180 2818 M
1230 2818 D
S
N
1258 2853 M
1258 2793 D
S
N
1261 2853 M
1261 2793 D
S
N
1296 2853 M
1296 2793 D
S
N
1299 2853 M
1299 2793 D
S
N
1250 2853 M
1270 2853 D
S
N
1287 2853 M
1308 2853 D
S
N
1261 2824 M
1296 2824 D
S
N
1250 2793 M
1270 2793 D
S
N
1287 2793 M
1308 2793 D
S
N
1351 2844 M
1351 2793 D
S
N
1325 2818 M
1377 2818 D
S
N
1397 2853 M
1435 2793 D
S
N
1400 2853 M
1437 2793 D
S
N
1437 2853 M
1397 2793 D
S
N
1391 2853 M
1409 2853 D
S
N
1426 2853 M
1443 2853 D
S
N
1391 2793 M
1409 2793 D
S
N
1426 2793 M
1443 2793 D
S
N
1501 2824 M
1510 2818 D
1501 2813 D
S
N
1492 2833 M
1507 2818 D
1492 2804 D
S
N
1458 2818 M
1507 2818 D
S
N
1524 2824 M
1530 2830 D
1536 2833 D
1541 2833 D
1547 2830 D
1550 2827 D
1553 2818 D
1553 2807 D
1550 2795 D
1541 2772 D
S
N
1527 2827 M
1533 2830 D
1544 2830 D
1550 2827 D
S
N
1573 2833 M
1570 2824 D
1567 2818 D
1553 2798 D
1544 2784 D
1539 2772 D
S
N
1570 2833 M
1567 2824 D
1565 2818 D
1553 2798 D
S
N
1582 2824 M
1588 2830 D
1593 2833 D
1599 2833 D
1605 2830 D
1608 2827 D
1611 2818 D
1611 2807 D
1608 2795 D
1599 2772 D
S
N
1585 2827 M
1591 2830 D
1602 2830 D
1608 2827 D
S
N
1631 2833 M
1628 2824 D
1625 2818 D
1611 2798 D
1602 2784 D
1596 2772 D
S
N
1628 2833 M
1625 2824 D
1622 2818 D
1611 2798 D
S
N
1674 2844 M
1674 2793 D
S
N
1648 2818 M
1700 2818 D
S
N
1720 2853 M
1758 2793 D
S
N
1723 2853 M
1761 2793 D
S
N
1761 2853 M
1720 2793 D
S
N
1715 2853 M
1732 2853 D
S
N
1749 2853 M
1767 2853 D
S
N
1715 2793 M
1732 2793 D
S
N
1749 2793 M
1767 2793 D
S
N
1056 2671 M
1068 2671 D
1085 2637 D
S
N
1065 2671 M
1085 2631 D
1111 2709 D
S
N
1149 2666 M
1152 2671 D
1152 2660 D
1149 2666 D
1146 2669 D
1140 2671 D
1129 2671 D
1123 2669 D
1120 2666 D
1120 2660 D
1123 2657 D
1129 2654 D
1143 2648 D
1149 2645 D
1152 2643 D
S
N
1120 2663 M
1123 2660 D
1129 2657 D
1143 2651 D
1149 2648 D
1152 2645 D
1152 2637 D
1149 2634 D
1143 2631 D
1131 2631 D
1126 2634 D
1123 2637 D
1120 2643 D
1120 2631 D
1123 2637 D
S
N
1172 2666 M
1224 2666 D
S
N
1172 2648 M
1224 2648 D
S
N
1258 2692 M
1250 2689 D
1247 2683 D
1247 2674 D
1250 2669 D
1258 2666 D
1270 2666 D
1279 2669 D
1282 2674 D
1282 2683 D
1279 2689 D
1270 2692 D
1258 2692 D
S
N
1258 2692 M
1253 2689 D
1250 2683 D
1250 2674 D
1253 2669 D
1258 2666 D
S
N
1270 2666 M
1276 2669 D
1279 2674 D
1279 2683 D
1276 2689 D
1270 2692 D
S
N
1258 2666 M
1250 2663 D
1247 2660 D
1244 2654 D
1244 2643 D
1247 2637 D
1250 2634 D
1258 2631 D
1270 2631 D
1279 2634 D
1282 2637 D
1284 2643 D
1284 2654 D
1282 2660 D
1279 2663 D
1270 2666 D
S
N
1258 2666 M
1253 2663 D
1250 2660 D
1247 2654 D
1247 2643 D
1250 2637 D
1253 2634 D
1258 2631 D
S
N
1270 2631 M
1276 2634 D
1279 2637 D
1282 2643 D
1282 2654 D
1279 2660 D
1276 2663 D
1270 2666 D
S
N
1365 2692 M
1365 2631 D
S
N
1368 2692 M
1368 2631 D
S
N
1348 2692 M
1345 2674 D
1345 2692 D
1388 2692 D
1388 2674 D
1385 2692 D
S
N
1357 2631 M
1377 2631 D
S
N
1406 2654 M
1440 2654 D
1440 2660 D
1437 2666 D
1435 2669 D
1429 2671 D
1420 2671 D
1411 2669 D
1406 2663 D
1403 2654 D
1403 2648 D
1406 2640 D
1411 2634 D
1420 2631 D
1426 2631 D
1435 2634 D
1440 2640 D
S
N
1437 2654 M
1437 2663 D
1435 2669 D
S
N
1420 2671 M
1414 2669 D
1409 2663 D
1406 2654 D
1406 2648 D
1409 2640 D
1414 2634 D
1420 2631 D
S
N
1458 2692 M
1478 2631 D
S
N
1461 2692 M
1478 2640 D
S
N
1498 2692 M
1478 2631 D
S
N
1452 2692 M
1469 2692 D
S
N
1487 2692 M
1504 2692 D
S
N
1521 2631 M
1518 2634 D
1521 2637 D
1524 2634 D
1524 2628 D
1521 2622 D
1518 2619 D
S
N
1596 2692 M
1596 2631 D
S
N
1599 2692 M
1616 2640 D
S
N
1596 2692 M
1616 2631 D
S
N
1637 2692 M
1616 2631 D
S
N
1637 2692 M
1637 2631 D
S
N
1640 2692 M
1640 2631 D
S
N
1588 2692 M
1599 2692 D
S
N
1637 2692 M
1648 2692 D
S
N
1588 2631 M
1605 2631 D
S
N
1628 2631 M
1648 2631 D
S
N
1700 2683 M
1703 2692 D
1703 2674 D
1700 2683 D
1694 2689 D
1686 2692 D
1677 2692 D
1668 2689 D
1663 2683 D
1663 2677 D
1666 2671 D
1668 2669 D
1674 2666 D
1692 2660 D
1697 2657 D
1703 2651 D
S
N
1663 2677 M
1668 2671 D
1674 2669 D
1692 2663 D
1697 2660 D
1700 2657 D
1703 2651 D
1703 2640 D
1697 2634 D
1689 2631 D
1680 2631 D
1671 2634 D
1666 2640 D
1663 2648 D
1663 2631 D
1666 2640 D
S
N
1738 2692 M
1738 2631 D
S
N
1741 2692 M
1741 2631 D
S
N
1720 2692 M
1718 2674 D
1718 2692 D
1761 2692 D
1761 2674 D
1758 2692 D
S
N
1729 2631 M
1749 2631 D
S
N
1778 2692 M
1790 2631 D
S
N
1781 2692 M
1790 2645 D
S
N
1801 2692 M
1790 2631 D
S
N
1801 2692 M
1813 2631 D
S
N
1804 2692 M
1813 2645 D
S
N
1824 2692 M
1813 2631 D
S
N
1770 2692 M
1790 2692 D
S
N
1816 2692 M
1833 2692 D
S
N
1847 2680 M
1850 2677 D
1847 2674 D
1845 2677 D
1845 2680 D
1847 2686 D
1850 2689 D
1859 2692 D
1871 2692 D
1879 2689 D
1882 2686 D
1885 2680 D
1885 2674 D
1882 2669 D
1873 2663 D
1859 2657 D
1853 2654 D
1847 2648 D
1845 2640 D
1845 2631 D
S
N
1871 2692 M
1876 2689 D
1879 2686 D
1882 2680 D
1882 2674 D
1879 2669 D
1871 2663 D
1859 2657 D
S
N
1845 2637 M
1847 2640 D
1853 2640 D
1868 2634 D
1876 2634 D
1882 2637 D
1885 2640 D
S
N
1853 2640 M
1868 2631 D
1879 2631 D
1882 2634 D
1885 2640 D
1885 2645 D
S
N
1920 2692 M
1911 2689 D
1905 2680 D
1902 2666 D
1902 2657 D
1905 2643 D
1911 2634 D
1920 2631 D
1925 2631 D
1934 2634 D
1940 2643 D
1943 2657 D
1943 2666 D
1940 2680 D
1934 2689 D
1925 2692 D
1920 2692 D
S
N
1920 2692 M
1914 2689 D
1911 2686 D
1908 2680 D
1905 2666 D
1905 2657 D
1908 2643 D
1911 2637 D
1914 2634 D
1920 2631 D
S
N
1925 2631 M
1931 2634 D
1934 2637 D
1937 2643 D
1940 2657 D
1940 2666 D
1937 2680 D
1934 2686 D
1931 2689 D
1925 2692 D
S
N
1977 2692 M
1969 2689 D
1963 2680 D
1960 2666 D
1960 2657 D
1963 2643 D
1969 2634 D
1977 2631 D
1983 2631 D
1992 2634 D
1998 2643 D
2001 2657 D
2001 2666 D
1998 2680 D
1992 2689 D
1983 2692 D
1977 2692 D
S
N
1977 2692 M
1972 2689 D
1969 2686 D
1966 2680 D
1963 2666 D
1963 2657 D
1966 2643 D
1969 2637 D
1972 2634 D
1977 2631 D
S
N
1983 2631 M
1989 2634 D
1992 2637 D
1995 2643 D
1998 2657 D
1998 2666 D
1995 2680 D
1992 2686 D
1989 2689 D
1983 2692 D
S
N
2032 2692 M
2024 2689 D
2021 2683 D
2021 2674 D
2024 2669 D
2032 2666 D
2044 2666 D
2053 2669 D
2055 2674 D
2055 2683 D
2053 2689 D
2044 2692 D
2032 2692 D
S
N
2032 2692 M
2027 2689 D
2024 2683 D
2024 2674 D
2027 2669 D
2032 2666 D
S
N
2044 2666 M
2050 2669 D
2053 2674 D
2053 2683 D
2050 2689 D
2044 2692 D
S
N
2032 2666 M
2024 2663 D
2021 2660 D
2018 2654 D
2018 2643 D
2021 2637 D
2024 2634 D
2032 2631 D
2044 2631 D
2053 2634 D
2055 2637 D
2058 2643 D
2058 2654 D
2055 2660 D
2053 2663 D
2044 2666 D
S
N
2032 2666 M
2027 2663 D
2024 2660 D
2021 2654 D
2021 2643 D
2024 2637 D
2027 2634 D
2032 2631 D
S
N
2044 2631 M
2050 2634 D
2053 2637 D
2055 2643 D
2055 2654 D
2053 2660 D
2050 2663 D
2044 2666 D
S
N
1068 2510 M
1051 2449 D
S
N
1071 2510 M
1053 2449 D
S
N
1068 2501 M
1065 2484 D
1065 2475 D
1071 2469 D
1077 2469 D
1082 2472 D
1088 2478 D
1094 2487 D
S
N
1100 2510 M
1091 2478 D
1091 2472 D
1094 2469 D
1103 2469 D
1108 2475 D
1111 2481 D
S
N
1103 2510 M
1094 2478 D
1094 2472 D
1097 2469 D
S
N
1128 2487 M
1128 2446 D
S
N
1129 2487 M
1129 2446 D
S
N
1141 2475 M
1141 2460 D
S
N
1122 2487 M
1153 2487 D
1153 2475 D
1151 2487 D
S
N
1129 2468 M
1141 2468 D
S
N
1122 2446 M
1135 2446 D
S
N
1172 2504 M
1224 2504 D
S
N
1172 2487 M
1224 2487 D
S
N
1256 2510 M
1238 2449 D
S
N
1258 2510 M
1241 2449 D
S
N
1256 2501 M
1253 2484 D
1253 2475 D
1258 2469 D
1264 2469 D
1270 2472 D
1276 2478 D
1282 2487 D
S
N
1287 2510 M
1279 2478 D
1279 2472 D
1282 2469 D
1290 2469 D
1296 2475 D
1299 2481 D
S
N
1290 2510 M
1282 2478 D
1282 2472 D
1284 2469 D
S
N
1315 2487 M
1315 2446 D
S
N
1317 2487 M
1317 2446 D
S
N
1309 2487 M
1333 2487 D
1338 2485 D
1340 2483 D
1342 2479 D
1342 2475 D
1340 2471 D
1338 2469 D
1333 2468 D
1317 2468 D
S
N
1333 2487 M
1336 2485 D
1338 2483 D
1340 2479 D
1340 2475 D
1338 2471 D
1336 2469 D
1333 2468 D
S
N
1309 2446 M
1323 2446 D
S
N
1327 2468 M
1331 2466 D
1333 2464 D
1338 2450 D
1340 2448 D
1342 2448 D
1344 2450 D
S
N
1331 2466 M
1333 2462 D
1336 2448 D
1338 2446 D
1342 2446 D
1344 2450 D
1344 2452 D
S
N
1363 2504 M
1415 2504 D
S
N
1363 2487 M
1415 2487 D
S
N
1438 2519 M
1441 2516 D
1438 2513 D
1436 2516 D
1436 2519 D
1438 2524 D
1441 2527 D
1450 2530 D
1462 2530 D
1470 2527 D
1473 2524 D
1476 2519 D
1476 2513 D
1473 2507 D
1464 2501 D
1450 2495 D
1444 2493 D
1438 2487 D
1436 2478 D
1436 2469 D
S
N
1462 2530 M
1467 2527 D
1470 2524 D
1473 2519 D
1473 2513 D
1470 2507 D
1462 2501 D
1450 2495 D
S
N
1436 2475 M
1438 2478 D
1444 2478 D
1459 2472 D
1467 2472 D
1473 2475 D
1476 2478 D
S
N
1444 2478 M
1459 2469 D
1470 2469 D
1473 2472 D
1476 2478 D
1476 2484 D
S
N
1514 2530 M
1505 2527 D
1499 2521 D
1496 2516 D
1493 2504 D
1493 2495 D
1496 2484 D
1499 2478 D
1505 2472 D
1514 2469 D
1519 2469 D
1528 2472 D
1534 2478 D
1537 2484 D
1539 2495 D
1539 2504 D
1537 2516 D
1534 2521 D
1528 2527 D
1519 2530 D
1514 2530 D
S
N
1514 2530 M
1508 2527 D
1502 2521 D
1499 2516 D
1496 2504 D
1496 2495 D
1499 2484 D
1502 2478 D
1508 2472 D
1514 2469 D
S
N
1519 2469 M
1525 2472 D
1531 2478 D
1534 2484 D
1537 2495 D
1537 2504 D
1534 2516 D
1531 2521 D
1525 2527 D
1519 2530 D
S
N
1505 2475 M
1505 2478 D
1508 2484 D
1514 2487 D
1516 2487 D
1522 2484 D
1525 2478 D
1528 2458 D
1531 2455 D
1537 2455 D
1539 2461 D
1539 2464 D
S
N
1525 2478 M
1528 2467 D
1531 2461 D
1534 2458 D
1537 2458 D
1539 2461 D
S
N
1560 2504 M
1612 2504 D
S
N
1560 2487 M
1612 2487 D
S
N
1638 2510 M
1638 2469 D
S
N
1641 2510 M
1641 2469 D
S
N
1641 2501 M
1646 2507 D
1655 2510 D
1661 2510 D
1669 2507 D
1672 2501 D
1672 2469 D
S
N
1661 2510 M
1667 2507 D
1669 2501 D
1669 2469 D
S
N
1672 2501 M
1678 2507 D
1687 2510 D
1693 2510 D
1701 2507 D
1704 2501 D
1704 2469 D
S
N
1693 2510 M
1698 2507 D
1701 2501 D
1701 2469 D
S
N
1629 2510 M
1641 2510 D
S
N
1629 2469 M
1649 2469 D
S
N
1661 2469 M
1681 2469 D
S
N
1693 2469 M
1713 2469 D
S
N
1732 2487 M
1732 2446 D
S
N
1734 2487 M
1734 2446 D
S
N
1757 2487 M
1757 2446 D
S
N
1759 2487 M
1759 2446 D
S
N
1726 2487 M
1740 2487 D
S
N
1751 2487 M
1765 2487 D
S
N
1734 2468 M
1757 2468 D
S
N
1726 2446 M
1740 2446 D
S
N
1751 2446 M
1765 2446 D
S
N
1784 2504 M
1836 2504 D
S
N
1784 2487 M
1836 2487 D
S
N
1865 2519 M
1871 2521 D
1879 2530 D
1879 2469 D
S
N
1876 2527 M
1876 2469 D
S
N
1865 2469 M
1891 2469 D
S
N
1917 2519 M
1920 2516 D
1917 2513 D
1914 2516 D
1914 2519 D
1917 2524 D
1920 2527 D
1928 2530 D
1940 2530 D
1949 2527 D
1951 2524 D
1954 2519 D
1954 2513 D
1951 2507 D
1943 2501 D
1928 2495 D
1923 2493 D
1917 2487 D
1914 2478 D
1914 2469 D
S
N
1940 2530 M
1946 2527 D
1949 2524 D
1951 2519 D
1951 2513 D
1949 2507 D
1940 2501 D
1928 2495 D
S
N
1914 2475 M
1917 2478 D
1923 2478 D
1937 2472 D
1946 2472 D
1951 2475 D
1954 2478 D
S
N
1923 2478 M
1937 2469 D
1949 2469 D
1951 2472 D
1954 2478 D
1954 2484 D
S
N
1977 2530 M
1972 2501 D
S
N
1972 2501 M
1977 2507 D
1986 2510 D
1995 2510 D
2003 2507 D
2009 2501 D
2012 2493 D
2012 2487 D
2009 2478 D
2003 2472 D
1995 2469 D
1986 2469 D
1977 2472 D
1975 2475 D
1972 2481 D
1972 2484 D
1975 2487 D
1977 2484 D
1975 2481 D
S
N
1995 2510 M
2001 2507 D
2006 2501 D
2009 2493 D
2009 2487 D
2006 2478 D
2001 2472 D
1995 2469 D
S
N
1977 2530 M
2006 2530 D
S
N
1977 2527 M
1992 2527 D
2006 2530 D
S
N
2116 2521 M
2119 2513 D
2119 2530 D
2116 2521 D
2110 2527 D
2102 2530 D
2096 2530 D
2087 2527 D
2081 2521 D
2078 2516 D
2076 2507 D
2076 2493 D
2078 2484 D
2081 2478 D
2087 2472 D
2096 2469 D
2102 2469 D
2110 2472 D
2116 2478 D
S
N
2096 2530 M
2090 2527 D
2084 2521 D
2081 2516 D
2078 2507 D
2078 2493 D
2081 2484 D
2084 2478 D
2090 2472 D
2096 2469 D
S
N
2116 2493 M
2116 2469 D
S
N
2119 2493 M
2119 2469 D
S
N
2107 2493 M
2128 2493 D
S
N
2145 2493 M
2180 2493 D
2180 2498 D
2177 2504 D
2174 2507 D
2168 2510 D
2159 2510 D
2151 2507 D
2145 2501 D
2142 2493 D
2142 2487 D
2145 2478 D
2151 2472 D
2159 2469 D
2165 2469 D
2174 2472 D
2180 2478 D
S
N
2177 2493 M
2177 2501 D
2174 2507 D
S
N
2159 2510 M
2154 2507 D
2148 2501 D
2145 2493 D
2145 2487 D
2148 2478 D
2154 2472 D
2159 2469 D
S
N
2197 2530 M
2217 2469 D
S
N
2200 2530 M
2217 2478 D
S
N
2237 2530 M
2217 2469 D
S
N
2191 2530 M
2208 2530 D
S
N
2226 2530 M
2243 2530 D
S
N
785 4685 M
785 2262 D
S
N
785 2262 M
3762 2262 D
S
N
3762 2262 M
3762 4685 D
S
N
3762 4685 M
785 4685 D
S
785 2262 P
[6 30] 0 Sd
N
785 2262 M
785 4586 D
814 4586 D
814 4583 D
844 4583 D
844 4583 D
874 4583 D
874 4577 D
904 4577 D
904 4572 D
933 4572 D
933 4573 D
963 4573 D
963 4565 D
993 4565 D
993 4559 D
1023 4559 D
1023 4557 D
1053 4557 D
1053 4549 D
1082 4549 D
1082 4545 D
1112 4545 D
1112 4547 D
1142 4547 D
1142 4534 D
1172 4534 D
1172 4539 D
1201 4539 D
1201 4525 D
1231 4525 D
1231 4524 D
1261 4524 D
1261 4518 D
1291 4518 D
1291 4512 D
1320 4512 D
1320 4516 D
1350 4516 D
1350 4502 D
1380 4502 D
1380 4506 D
1410 4506 D
1410 4503 D
1440 4503 D
1440 4500 D
1469 4500 D
1469 4485 D
1499 4485 D
1499 4491 D
1529 4491 D
1529 4479 D
1559 4479 D
1559 4471 D
1588 4471 D
1588 4464 D
1618 4464 D
1618 4457 D
1648 4457 D
1648 4459 D
1678 4459 D
1678 4453 D
1707 4453 D
1707 4445 D
1737 4445 D
1737 4439 D
1767 4439 D
1767 4439 D
1797 4439 D
1797 4432 D
1827 4432 D
1827 4422 D
1856 4422 D
1856 4419 D
1886 4419 D
1886 4404 D
1916 4404 D
1916 4398 D
1946 4398 D
1946 4394 D
1975 4394 D
1975 4391 D
2005 4391 D
2005 4379 D
2035 4379 D
2035 4377 D
2065 4377 D
2065 4362 D
2094 4362 D
2094 4357 D
2124 4357 D
2124 4353 D
2154 4353 D
2154 4341 D
2184 4341 D
2184 4339 D
2214 4339 D
2214 4327 D
2243 4327 D
2243 4320 D
2273 4320 D
2273 4312 D
2303 4312 D
2303 4302 D
2333 4302 D
2333 4295 D
2362 4295 D
2362 4289 D
2392 4289 D
2392 4276 D
2422 4276 D
2422 4269 D
2452 4269 D
2452 4253 D
2481 4253 D
2481 4240 D
2511 4240 D
2511 4233 D
2541 4233 D
2541 4226 D
2571 4226 D
2571 4213 D
2601 4213 D
2601 4204 D
2630 4204 D
2630 4191 D
2660 4191 D
2660 4179 D
2660 4179 D
2660 4179 D
2690 4179 D
2690 4163 D
2720 4163 D
2720 4143 D
2749 4143 D
2749 4136 D
2779 4136 D
2779 4125 D
2809 4125 D
2809 4113 D
2839 4113 D
2839 4092 D
2868 4092 D
2868 4070 D
2898 4070 D
2898 4058 D
2928 4058 D
2928 4041 D
2958 4041 D
2958 4024 D
2988 4024 D
2988 4006 D
3017 4006 D
3017 3989 D
3047 3989 D
3047 3682 D
3077 3682 D
3077 2262 D
3762 2262 D
S
[] 0 Sd
N
785 2262 M
785 2366 D
S
N
904 2296 M
904 2262 D
S
N
1023 2262 M
1023 2296 D
S
N
1142 2296 M
1142 2262 D
S
N
1261 2262 M
1261 2296 D
S
N
1380 2366 M
1380 2262 D
S
N
1499 2262 M
1499 2296 D
S
N
1618 2296 M
1618 2262 D
S
N
1737 2262 M
1737 2296 D
S
N
1856 2296 M
1856 2262 D
S
N
1975 2262 M
1975 2366 D
S
N
2094 2296 M
2094 2262 D
S
N
2214 2262 M
2214 2296 D
S
N
2333 2296 M
2333 2262 D
S
N
2452 2262 M
2452 2296 D
S
N
2571 2366 M
2571 2262 D
S
N
2690 2262 M
2690 2296 D
S
N
2809 2296 M
2809 2262 D
S
N
2928 2262 M
2928 2296 D
S
N
3047 2296 M
3047 2262 D
S
N
3166 2262 M
3166 2366 D
S
N
3285 2296 M
3285 2262 D
S
N
3404 2262 M
3404 2296 D
S
N
3523 2296 M
3523 2262 D
S
N
3642 2262 M
3642 2296 D
S
N
3762 2366 M
3762 2262 D
S
N
738 2205 M
730 2202 D
724 2193 D
721 2179 D
721 2170 D
724 2156 D
730 2147 D
738 2144 D
744 2144 D
753 2147 D
759 2156 D
762 2170 D
762 2179 D
759 2193 D
753 2202 D
744 2205 D
738 2205 D
S
N
738 2205 M
733 2202 D
730 2199 D
727 2193 D
724 2179 D
724 2170 D
727 2156 D
730 2150 D
733 2147 D
738 2144 D
S
N
744 2144 M
750 2147 D
753 2150 D
756 2156 D
759 2170 D
759 2179 D
756 2193 D
753 2199 D
750 2202 D
744 2205 D
S
N
785 2150 M
782 2147 D
785 2144 D
788 2147 D
785 2150 D
S
N
825 2205 M
816 2202 D
811 2193 D
808 2179 D
808 2170 D
811 2156 D
816 2147 D
825 2144 D
831 2144 D
840 2147 D
845 2156 D
848 2170 D
848 2179 D
845 2193 D
840 2202 D
831 2205 D
825 2205 D
S
N
825 2205 M
819 2202 D
816 2199 D
814 2193 D
811 2179 D
811 2170 D
814 2156 D
816 2150 D
819 2147 D
825 2144 D
S
N
831 2144 M
837 2147 D
840 2150 D
842 2156 D
845 2170 D
845 2179 D
842 2193 D
840 2199 D
837 2202 D
831 2205 D
S
N
1334 2205 M
1325 2202 D
1319 2193 D
1317 2179 D
1317 2170 D
1319 2156 D
1325 2147 D
1334 2144 D
1340 2144 D
1348 2147 D
1354 2156 D
1357 2170 D
1357 2179 D
1354 2193 D
1348 2202 D
1340 2205 D
1334 2205 D
S
N
1334 2205 M
1328 2202 D
1325 2199 D
1322 2193 D
1319 2179 D
1319 2170 D
1322 2156 D
1325 2150 D
1328 2147 D
1334 2144 D
S
N
1340 2144 M
1345 2147 D
1348 2150 D
1351 2156 D
1354 2170 D
1354 2179 D
1351 2193 D
1348 2199 D
1345 2202 D
1340 2205 D
S
N
1380 2150 M
1377 2147 D
1380 2144 D
1383 2147 D
1380 2150 D
S
N
1406 2193 M
1409 2190 D
1406 2187 D
1403 2190 D
1403 2193 D
1406 2199 D
1409 2202 D
1418 2205 D
1429 2205 D
1438 2202 D
1441 2199 D
1444 2193 D
1444 2187 D
1441 2182 D
1432 2176 D
1418 2170 D
1412 2167 D
1406 2161 D
1403 2153 D
1403 2144 D
S
N
1429 2205 M
1435 2202 D
1438 2199 D
1441 2193 D
1441 2187 D
1438 2182 D
1429 2176 D
1418 2170 D
S
N
1403 2150 M
1406 2153 D
1412 2153 D
1426 2147 D
1435 2147 D
1441 2150 D
1444 2153 D
S
N
1412 2153 M
1426 2144 D
1438 2144 D
1441 2147 D
1444 2153 D
1444 2158 D
S
N
1929 2205 M
1921 2202 D
1915 2193 D
1912 2179 D
1912 2170 D
1915 2156 D
1921 2147 D
1929 2144 D
1935 2144 D
1944 2147 D
1949 2156 D
1952 2170 D
1952 2179 D
1949 2193 D
1944 2202 D
1935 2205 D
1929 2205 D
S
N
1929 2205 M
1923 2202 D
1921 2199 D
1918 2193 D
1915 2179 D
1915 2170 D
1918 2156 D
1921 2150 D
1923 2147 D
1929 2144 D
S
N
1935 2144 M
1941 2147 D
1944 2150 D
1947 2156 D
1949 2170 D
1949 2179 D
1947 2193 D
1944 2199 D
1941 2202 D
1935 2205 D
S
N
1975 2150 M
1973 2147 D
1975 2144 D
1978 2147 D
1975 2150 D
S
N
2025 2199 M
2025 2144 D
S
N
2027 2205 M
2027 2144 D
S
N
2027 2205 M
1996 2161 D
2042 2161 D
S
N
2016 2144 M
2036 2144 D
S
N
2525 2205 M
2516 2202 D
2510 2193 D
2507 2179 D
2507 2170 D
2510 2156 D
2516 2147 D
2525 2144 D
2530 2144 D
2539 2147 D
2545 2156 D
2548 2170 D
2548 2179 D
2545 2193 D
2539 2202 D
2530 2205 D
2525 2205 D
S
N
2525 2205 M
2519 2202 D
2516 2199 D
2513 2193 D
2510 2179 D
2510 2170 D
2513 2156 D
2516 2150 D
2519 2147 D
2525 2144 D
S
N
2530 2144 M
2536 2147 D
2539 2150 D
2542 2156 D
2545 2170 D
2545 2179 D
2542 2193 D
2539 2199 D
2536 2202 D
2530 2205 D
S
N
2571 2150 M
2568 2147 D
2571 2144 D
2574 2147 D
2571 2150 D
S
N
2629 2196 M
2626 2193 D
2629 2190 D
2631 2193 D
2631 2196 D
2629 2202 D
2623 2205 D
2614 2205 D
2605 2202 D
2600 2196 D
2597 2190 D
2594 2179 D
2594 2161 D
2597 2153 D
2603 2147 D
2611 2144 D
2617 2144 D
2626 2147 D
2631 2153 D
2634 2161 D
2634 2164 D
2631 2173 D
2626 2179 D
2617 2182 D
2614 2182 D
2605 2179 D
2600 2173 D
2597 2164 D
S
N
2614 2205 M
2608 2202 D
2603 2196 D
2600 2190 D
2597 2179 D
2597 2161 D
2600 2153 D
2605 2147 D
2611 2144 D
S
N
2617 2144 M
2623 2147 D
2629 2153 D
2631 2161 D
2631 2164 D
2629 2173 D
2623 2179 D
2617 2182 D
S
N
3120 2205 M
3111 2202 D
3106 2193 D
3103 2179 D
3103 2170 D
3106 2156 D
3111 2147 D
3120 2144 D
3126 2144 D
3134 2147 D
3140 2156 D
3143 2170 D
3143 2179 D
3140 2193 D
3134 2202 D
3126 2205 D
3120 2205 D
S
N
3120 2205 M
3114 2202 D
3111 2199 D
3108 2193 D
3106 2179 D
3106 2170 D
3108 2156 D
3111 2150 D
3114 2147 D
3120 2144 D
S
N
3126 2144 M
3132 2147 D
3134 2150 D
3137 2156 D
3140 2170 D
3140 2179 D
3137 2193 D
3134 2199 D
3132 2202 D
3126 2205 D
S
N
3166 2150 M
3163 2147 D
3166 2144 D
3169 2147 D
3166 2150 D
S
N
3204 2205 M
3195 2202 D
3192 2196 D
3192 2187 D
3195 2182 D
3204 2179 D
3215 2179 D
3224 2182 D
3227 2187 D
3227 2196 D
3224 2202 D
3215 2205 D
3204 2205 D
S
N
3204 2205 M
3198 2202 D
3195 2196 D
3195 2187 D
3198 2182 D
3204 2179 D
S
N
3215 2179 M
3221 2182 D
3224 2187 D
3224 2196 D
3221 2202 D
3215 2205 D
S
N
3204 2179 M
3195 2176 D
3192 2173 D
3189 2167 D
3189 2156 D
3192 2150 D
3195 2147 D
3204 2144 D
3215 2144 D
3224 2147 D
3227 2150 D
3230 2156 D
3230 2167 D
3227 2173 D
3224 2176 D
3215 2179 D
S
N
3204 2179 M
3198 2176 D
3195 2173 D
3192 2167 D
3192 2156 D
3195 2150 D
3198 2147 D
3204 2144 D
S
N
3215 2144 M
3221 2147 D
3224 2150 D
3227 2156 D
3227 2167 D
3224 2173 D
3221 2176 D
3215 2179 D
S
N
3707 2193 M
3712 2196 D
3721 2205 D
3721 2144 D
S
N
3718 2202 M
3718 2144 D
S
N
3707 2144 M
3733 2144 D
S
N
3762 2150 M
3759 2147 D
3762 2144 D
3764 2147 D
3762 2150 D
S
N
3802 2205 M
3793 2202 D
3788 2193 D
3785 2179 D
3785 2170 D
3788 2156 D
3793 2147 D
3802 2144 D
3808 2144 D
3816 2147 D
3822 2156 D
3825 2170 D
3825 2179 D
3822 2193 D
3816 2202 D
3808 2205 D
3802 2205 D
S
N
3802 2205 M
3796 2202 D
3793 2199 D
3790 2193 D
3788 2179 D
3788 2170 D
3790 2156 D
3793 2150 D
3796 2147 D
3802 2144 D
S
N
3808 2144 M
3814 2147 D
3816 2150 D
3819 2156 D
3822 2170 D
3822 2179 D
3819 2193 D
3816 2199 D
3814 2202 D
3808 2205 D
S
N
785 4581 M
785 4685 D
S
N
904 4685 M
904 4650 D
S
N
1023 4650 M
1023 4685 D
S
N
1142 4685 M
1142 4650 D
S
N
1261 4650 M
1261 4685 D
S
N
1380 4685 M
1380 4581 D
S
N
1499 4650 M
1499 4685 D
S
N
1618 4685 M
1618 4650 D
S
N
1737 4650 M
1737 4685 D
S
N
1856 4685 M
1856 4650 D
S
N
1975 4581 M
1975 4685 D
S
N
2094 4685 M
2094 4650 D
S
N
2214 4650 M
2214 4685 D
S
N
2333 4685 M
2333 4650 D
S
N
2452 4650 M
2452 4685 D
S
N
2571 4685 M
2571 4581 D
S
N
2690 4650 M
2690 4685 D
S
N
2809 4685 M
2809 4650 D
S
N
2928 4650 M
2928 4685 D
S
N
3047 4685 M
3047 4650 D
S
N
3166 4581 M
3166 4685 D
S
N
3285 4685 M
3285 4650 D
S
N
3404 4650 M
3404 4685 D
S
N
3523 4685 M
3523 4650 D
S
N
3642 4650 M
3642 4685 D
S
N
3762 4685 M
3762 4581 D
S
N
785 2262 M
888 2262 D
S
N
819 2343 M
785 2343 D
S
N
785 2423 M
819 2423 D
S
N
819 2504 M
785 2504 D
S
N
785 2585 M
819 2585 D
S
N
888 2666 M
785 2666 D
S
N
785 2746 M
819 2746 D
S
N
819 2827 M
785 2827 D
S
N
785 2908 M
819 2908 D
S
N
819 2989 M
785 2989 D
S
N
785 3069 M
888 3069 D
S
N
819 3150 M
785 3150 D
S
N
785 3231 M
819 3231 D
S
N
819 3312 M
785 3312 D
S
N
785 3393 M
819 3393 D
S
N
888 3473 M
785 3473 D
S
N
785 3554 M
819 3554 D
S
N
819 3635 M
785 3635 D
S
N
785 3716 M
819 3716 D
S
N
819 3796 M
785 3796 D
S
N
785 3877 M
888 3877 D
S
N
819 3958 M
785 3958 D
S
N
785 4039 M
819 4039 D
S
N
819 4119 M
785 4119 D
S
N
785 4200 M
819 4200 D
S
N
888 4281 M
785 4281 D
S
N
785 4362 M
819 4362 D
S
N
819 4443 M
785 4443 D
S
N
785 4523 M
819 4523 D
S
N
819 4604 M
785 4604 D
S
N
785 4685 M
888 4685 D
S
N
574 2288 M
565 2285 D
560 2276 D
557 2262 D
557 2253 D
560 2239 D
565 2230 D
574 2227 D
580 2227 D
588 2230 D
594 2239 D
597 2253 D
597 2262 D
594 2276 D
588 2285 D
580 2288 D
574 2288 D
S
N
574 2288 M
568 2285 D
565 2282 D
562 2276 D
560 2262 D
560 2253 D
562 2239 D
565 2233 D
568 2230 D
574 2227 D
S
N
580 2227 M
586 2230 D
588 2233 D
591 2239 D
594 2253 D
594 2262 D
591 2276 D
588 2282 D
586 2285 D
580 2288 D
S
N
620 2233 M
617 2230 D
620 2227 D
623 2230 D
620 2233 D
S
N
661 2288 M
652 2285 D
646 2276 D
643 2262 D
643 2253 D
646 2239 D
652 2230 D
661 2227 D
666 2227 D
675 2230 D
681 2239 D
684 2253 D
684 2262 D
681 2276 D
675 2285 D
666 2288 D
661 2288 D
S
N
661 2288 M
655 2285 D
652 2282 D
649 2276 D
646 2262 D
646 2253 D
649 2239 D
652 2233 D
655 2230 D
661 2227 D
S
N
666 2227 M
672 2230 D
675 2233 D
678 2239 D
681 2253 D
681 2262 D
678 2276 D
675 2282 D
672 2285 D
666 2288 D
S
N
718 2288 M
710 2285 D
704 2276 D
701 2262 D
701 2253 D
704 2239 D
710 2230 D
718 2227 D
724 2227 D
733 2230 D
739 2239 D
742 2253 D
742 2262 D
739 2276 D
733 2285 D
724 2288 D
718 2288 D
S
N
718 2288 M
713 2285 D
710 2282 D
707 2276 D
704 2262 D
704 2253 D
707 2239 D
710 2233 D
713 2230 D
718 2227 D
S
N
724 2227 M
730 2230 D
733 2233 D
736 2239 D
739 2253 D
739 2262 D
736 2276 D
733 2282 D
730 2285 D
724 2288 D
S
N
574 2692 M
565 2689 D
560 2680 D
557 2666 D
557 2657 D
560 2643 D
565 2634 D
574 2631 D
580 2631 D
588 2634 D
594 2643 D
597 2657 D
597 2666 D
594 2680 D
588 2689 D
580 2692 D
574 2692 D
S
N
574 2692 M
568 2689 D
565 2686 D
562 2680 D
560 2666 D
560 2657 D
562 2643 D
565 2637 D
568 2634 D
574 2631 D
S
N
580 2631 M
586 2634 D
588 2637 D
591 2643 D
594 2657 D
594 2666 D
591 2680 D
588 2686 D
586 2689 D
580 2692 D
S
N
620 2637 M
617 2634 D
620 2631 D
623 2634 D
620 2637 D
S
N
646 2680 M
649 2677 D
646 2674 D
643 2677 D
643 2680 D
646 2686 D
649 2689 D
658 2692 D
669 2692 D
678 2689 D
681 2686 D
684 2680 D
684 2674 D
681 2669 D
672 2663 D
658 2657 D
652 2654 D
646 2648 D
643 2640 D
643 2631 D
S
N
669 2692 M
675 2689 D
678 2686 D
681 2680 D
681 2674 D
678 2669 D
669 2663 D
658 2657 D
S
N
643 2637 M
646 2640 D
652 2640 D
666 2634 D
675 2634 D
681 2637 D
684 2640 D
S
N
652 2640 M
666 2631 D
678 2631 D
681 2634 D
684 2640 D
684 2645 D
S
N
707 2692 M
701 2663 D
S
N
701 2663 M
707 2669 D
716 2671 D
724 2671 D
733 2669 D
739 2663 D
742 2654 D
742 2648 D
739 2640 D
733 2634 D
724 2631 D
716 2631 D
707 2634 D
704 2637 D
701 2643 D
701 2645 D
704 2648 D
707 2645 D
704 2643 D
S
N
724 2671 M
730 2669 D
736 2663 D
739 2654 D
739 2648 D
736 2640 D
730 2634 D
724 2631 D
S
N
707 2692 M
736 2692 D
S
N
707 2689 M
721 2689 D
736 2692 D
S
N
574 3095 M
565 3093 D
560 3084 D
557 3069 D
557 3061 D
560 3046 D
565 3038 D
574 3035 D
580 3035 D
588 3038 D
594 3046 D
597 3061 D
597 3069 D
594 3084 D
588 3093 D
580 3095 D
574 3095 D
S
N
574 3095 M
568 3093 D
565 3090 D
562 3084 D
560 3069 D
560 3061 D
562 3046 D
565 3041 D
568 3038 D
574 3035 D
S
N
580 3035 M
586 3038 D
588 3041 D
591 3046 D
594 3061 D
594 3069 D
591 3084 D
588 3090 D
586 3093 D
580 3095 D
S
N
620 3041 M
617 3038 D
620 3035 D
623 3038 D
620 3041 D
S
N
649 3095 M
643 3067 D
S
N
643 3067 M
649 3072 D
658 3075 D
666 3075 D
675 3072 D
681 3067 D
684 3058 D
684 3052 D
681 3043 D
675 3038 D
666 3035 D
658 3035 D
649 3038 D
646 3041 D
643 3046 D
643 3049 D
646 3052 D
649 3049 D
646 3046 D
S
N
666 3075 M
672 3072 D
678 3067 D
681 3058 D
681 3052 D
678 3043 D
672 3038 D
666 3035 D
S
N
649 3095 M
678 3095 D
S
N
649 3093 M
664 3093 D
678 3095 D
S
N
718 3095 M
710 3093 D
704 3084 D
701 3069 D
701 3061 D
704 3046 D
710 3038 D
718 3035 D
724 3035 D
733 3038 D
739 3046 D
742 3061 D
742 3069 D
739 3084 D
733 3093 D
724 3095 D
718 3095 D
S
N
718 3095 M
713 3093 D
710 3090 D
707 3084 D
704 3069 D
704 3061 D
707 3046 D
710 3041 D
713 3038 D
718 3035 D
S
N
724 3035 M
730 3038 D
733 3041 D
736 3046 D
739 3061 D
739 3069 D
736 3084 D
733 3090 D
730 3093 D
724 3095 D
S
N
574 3499 M
565 3496 D
560 3488 D
557 3473 D
557 3465 D
560 3450 D
565 3442 D
574 3439 D
580 3439 D
588 3442 D
594 3450 D
597 3465 D
597 3473 D
594 3488 D
588 3496 D
580 3499 D
574 3499 D
S
N
574 3499 M
568 3496 D
565 3494 D
562 3488 D
560 3473 D
560 3465 D
562 3450 D
565 3444 D
568 3442 D
574 3439 D
S
N
580 3439 M
586 3442 D
588 3444 D
591 3450 D
594 3465 D
594 3473 D
591 3488 D
588 3494 D
586 3496 D
580 3499 D
S
N
620 3444 M
617 3442 D
620 3439 D
623 3442 D
620 3444 D
S
N
643 3499 M
643 3482 D
S
N
643 3488 M
646 3494 D
652 3499 D
658 3499 D
672 3491 D
678 3491 D
681 3494 D
684 3499 D
S
N
646 3494 M
652 3496 D
658 3496 D
672 3491 D
S
N
684 3499 M
684 3491 D
681 3482 D
669 3468 D
666 3462 D
664 3453 D
664 3439 D
S
N
681 3482 M
666 3468 D
664 3462 D
661 3453 D
661 3439 D
S
N
707 3499 M
701 3470 D
S
N
701 3470 M
707 3476 D
716 3479 D
724 3479 D
733 3476 D
739 3470 D
742 3462 D
742 3456 D
739 3447 D
733 3442 D
724 3439 D
716 3439 D
707 3442 D
704 3444 D
701 3450 D
701 3453 D
704 3456 D
707 3453 D
704 3450 D
S
N
724 3479 M
730 3476 D
736 3470 D
739 3462 D
739 3456 D
736 3447 D
730 3442 D
724 3439 D
S
N
707 3499 M
736 3499 D
S
N
707 3496 M
721 3496 D
736 3499 D
S
N
565 3892 M
571 3894 D
580 3903 D
580 3843 D
S
N
577 3900 M
577 3843 D
S
N
565 3843 M
591 3843 D
S
N
620 3848 M
617 3845 D
620 3843 D
623 3845 D
620 3848 D
S
N
661 3903 M
652 3900 D
646 3892 D
643 3877 D
643 3868 D
646 3854 D
652 3845 D
661 3843 D
666 3843 D
675 3845 D
681 3854 D
684 3868 D
684 3877 D
681 3892 D
675 3900 D
666 3903 D
661 3903 D
S
N
661 3903 M
655 3900 D
652 3897 D
649 3892 D
646 3877 D
646 3868 D
649 3854 D
652 3848 D
655 3845 D
661 3843 D
S
N
666 3843 M
672 3845 D
675 3848 D
678 3854 D
681 3868 D
681 3877 D
678 3892 D
675 3897 D
672 3900 D
666 3903 D
S
N
718 3903 M
710 3900 D
704 3892 D
701 3877 D
701 3868 D
704 3854 D
710 3845 D
718 3843 D
724 3843 D
733 3845 D
739 3854 D
742 3868 D
742 3877 D
739 3892 D
733 3900 D
724 3903 D
718 3903 D
S
N
718 3903 M
713 3900 D
710 3897 D
707 3892 D
704 3877 D
704 3868 D
707 3854 D
710 3848 D
713 3845 D
718 3843 D
S
N
724 3843 M
730 3845 D
733 3848 D
736 3854 D
739 3868 D
739 3877 D
736 3892 D
733 3897 D
730 3900 D
724 3903 D
S
N
565 4295 M
571 4298 D
580 4307 D
580 4246 D
S
N
577 4304 M
577 4246 D
S
N
565 4246 M
591 4246 D
S
N
620 4252 M
617 4249 D
620 4246 D
623 4249 D
620 4252 D
S
N
646 4295 M
649 4293 D
646 4290 D
643 4293 D
643 4295 D
646 4301 D
649 4304 D
658 4307 D
669 4307 D
678 4304 D
681 4301 D
684 4295 D
684 4290 D
681 4284 D
672 4278 D
658 4272 D
652 4269 D
646 4264 D
643 4255 D
643 4246 D
S
N
669 4307 M
675 4304 D
678 4301 D
681 4295 D
681 4290 D
678 4284 D
669 4278 D
658 4272 D
S
N
643 4252 M
646 4255 D
652 4255 D
666 4249 D
675 4249 D
681 4252 D
684 4255 D
S
N
652 4255 M
666 4246 D
678 4246 D
681 4249 D
684 4255 D
684 4261 D
S
N
707 4307 M
701 4278 D
S
N
701 4278 M
707 4284 D
716 4287 D
724 4287 D
733 4284 D
739 4278 D
742 4269 D
742 4264 D
739 4255 D
733 4249 D
724 4246 D
716 4246 D
707 4249 D
704 4252 D
701 4258 D
701 4261 D
704 4264 D
707 4261 D
704 4258 D
S
N
724 4287 M
730 4284 D
736 4278 D
739 4269 D
739 4264 D
736 4255 D
730 4249 D
724 4246 D
S
N
707 4307 M
736 4307 D
S
N
707 4304 M
721 4304 D
736 4307 D
S
N
565 4699 M
571 4702 D
580 4711 D
580 4650 D
S
N
577 4708 M
577 4650 D
S
N
565 4650 M
591 4650 D
S
N
620 4656 M
617 4653 D
620 4650 D
623 4653 D
620 4656 D
S
N
649 4711 M
643 4682 D
S
N
643 4682 M
649 4688 D
658 4691 D
666 4691 D
675 4688 D
681 4682 D
684 4673 D
684 4668 D
681 4659 D
675 4653 D
666 4650 D
658 4650 D
649 4653 D
646 4656 D
643 4662 D
643 4665 D
646 4668 D
649 4665 D
646 4662 D
S
N
666 4691 M
672 4688 D
678 4682 D
681 4673 D
681 4668 D
678 4659 D
672 4653 D
666 4650 D
S
N
649 4711 M
678 4711 D
S
N
649 4708 M
664 4708 D
678 4711 D
S
N
718 4711 M
710 4708 D
704 4699 D
701 4685 D
701 4676 D
704 4662 D
710 4653 D
718 4650 D
724 4650 D
733 4653 D
739 4662 D
742 4676 D
742 4685 D
739 4699 D
733 4708 D
724 4711 D
718 4711 D
S
N
718 4711 M
713 4708 D
710 4705 D
707 4699 D
704 4685 D
704 4676 D
707 4662 D
710 4656 D
713 4653 D
718 4650 D
S
N
724 4650 M
730 4653 D
733 4656 D
736 4662 D
739 4676 D
739 4685 D
736 4699 D
733 4705 D
730 4708 D
724 4711 D
S
N
3658 2262 M
3762 2262 D
S
N
3762 2343 M
3727 2343 D
S
N
3727 2423 M
3762 2423 D
S
N
3762 2504 M
3727 2504 D
S
N
3727 2585 M
3762 2585 D
S
N
3762 2666 M
3658 2666 D
S
N
3727 2746 M
3762 2746 D
S
N
3762 2827 M
3727 2827 D
S
N
3727 2908 M
3762 2908 D
S
N
3762 2989 M
3727 2989 D
S
N
3658 3069 M
3762 3069 D
S
N
3762 3150 M
3727 3150 D
S
N
3727 3231 M
3762 3231 D
S
N
3762 3312 M
3727 3312 D
S
N
3727 3393 M
3762 3393 D
S
N
3762 3473 M
3658 3473 D
S
N
3727 3554 M
3762 3554 D
S
N
3762 3635 M
3727 3635 D
S
N
3727 3716 M
3762 3716 D
S
N
3762 3796 M
3727 3796 D
S
N
3658 3877 M
3762 3877 D
S
N
3762 3958 M
3727 3958 D
S
N
3727 4039 M
3762 4039 D
S
N
3762 4119 M
3727 4119 D
S
N
3727 4200 M
3762 4200 D
S
N
3762 4281 M
3658 4281 D
S
N
3727 4362 M
3762 4362 D
S
N
3762 4443 M
3727 4443 D
S
N
3727 4523 M
3762 4523 D
S
N
3762 4604 M
3727 4604 D
S
N
3658 4685 M
3762 4685 D
S
[6 30] 0 Sd
N
1082 3069 M
1529 3069 D
S
[] 0 Sd
N
1657 3095 M
1657 3035 D
S
N
1660 3095 M
1660 3035 D
S
N
1649 3095 M
1669 3095 D
S
N
1649 3035 M
1692 3035 D
1692 3052 D
1689 3035 D
S
N
1724 3095 M
1715 3093 D
1709 3087 D
1707 3081 D
1704 3069 D
1704 3061 D
1707 3049 D
1709 3043 D
1715 3038 D
1724 3035 D
1730 3035 D
1738 3038 D
1744 3043 D
1747 3049 D
1750 3061 D
1750 3069 D
1747 3081 D
1744 3087 D
1738 3093 D
1730 3095 D
1724 3095 D
S
N
1724 3095 M
1718 3093 D
1712 3087 D
1709 3081 D
1707 3069 D
1707 3061 D
1709 3049 D
1712 3043 D
1718 3038 D
1724 3035 D
S
N
1730 3035 M
1735 3038 D
1741 3043 D
1744 3049 D
1747 3061 D
1747 3069 D
1744 3081 D
1741 3087 D
1735 3093 D
1730 3095 D
S
1.00 0.00 0.00 setrgbcolor
785 2262 P
N
785 2262 M
785 4391 D
814 4391 D
814 4390 D
844 4390 D
844 4389 D
874 4389 D
874 4395 D
904 4395 D
904 4393 D
933 4393 D
933 4384 D
963 4384 D
963 4390 D
993 4390 D
993 4391 D
1023 4391 D
1023 4380 D
1053 4380 D
1053 4371 D
1082 4371 D
1082 4376 D
1112 4376 D
1112 4371 D
1142 4371 D
1142 4368 D
1172 4368 D
1172 4367 D
1201 4367 D
1201 4365 D
1231 4365 D
1231 4361 D
1261 4361 D
1261 4359 D
1291 4359 D
1291 4358 D
1320 4358 D
1320 4349 D
1350 4349 D
1350 4348 D
1380 4348 D
1380 4345 D
1410 4345 D
1410 4344 D
1440 4344 D
1440 4334 D
1469 4334 D
1469 4333 D
1499 4333 D
1499 4334 D
1529 4334 D
1529 4326 D
1559 4326 D
1559 4321 D
1588 4321 D
1588 4310 D
1618 4310 D
1618 4308 D
1648 4308 D
1648 4310 D
1678 4310 D
1678 4308 D
1707 4308 D
1707 4290 D
1737 4290 D
1737 4286 D
1767 4286 D
1767 4285 D
1797 4285 D
1797 4291 D
1827 4291 D
1827 4275 D
1856 4275 D
1856 4268 D
1886 4268 D
1886 4265 D
1916 4265 D
1916 4265 D
1946 4265 D
1946 4241 D
1975 4241 D
1975 4251 D
2005 4251 D
2005 4240 D
2035 4240 D
2035 4236 D
2065 4236 D
2065 4229 D
2094 4229 D
2094 4231 D
2124 4231 D
2124 4226 D
2154 4226 D
2154 4207 D
2184 4207 D
2184 4204 D
2214 4204 D
2214 4205 D
2243 4205 D
2243 4184 D
2273 4184 D
2273 4182 D
2303 4182 D
2303 4179 D
2333 4179 D
2333 4165 D
2362 4165 D
2362 4151 D
2392 4151 D
2392 4138 D
2422 4138 D
2422 4130 D
2452 4130 D
2452 4132 D
2481 4132 D
2481 4119 D
2511 4119 D
2511 4098 D
2541 4098 D
2541 4098 D
2571 4098 D
2571 4087 D
2601 4087 D
2601 4079 D
2630 4079 D
2630 4070 D
2660 4070 D
2660 4054 D
2660 4054 D
2660 4054 D
2690 4054 D
2690 4040 D
2720 4040 D
2720 4022 D
2749 4022 D
2749 4015 D
2779 4015 D
2779 3998 D
2809 3998 D
2809 3993 D
2839 3993 D
2839 3968 D
2868 3968 D
2868 3957 D
2898 3957 D
2898 3932 D
2928 3932 D
2928 3922 D
2958 3922 D
2958 3911 D
2988 3911 D
2988 3885 D
3017 3885 D
3017 3882 D
3047 3882 D
3047 4276 D
3077 4276 D
3077 4685 D
S
N
3107 4685 M
3107 3724 D
3136 3724 D
3136 3351 D
3166 3351 D
3166 3121 D
3196 3121 D
3196 2964 D
3226 2964 D
3226 2842 D
3255 2842 D
3255 2745 D
3285 2745 D
3285 2661 D
3315 2661 D
3315 2593 D
3345 2593 D
3345 2536 D
3375 2536 D
3375 2484 D
3404 2484 D
3404 2446 D
3434 2446 D
3434 2419 D
3464 2419 D
3464 2406 D
3494 2406 D
3494 2397 D
3523 2397 D
3523 2392 D
3553 2392 D
3553 2386 D
3583 2386 D
3583 2382 D
3613 2382 D
3613 2380 D
3642 2380 D
3642 2377 D
3672 2377 D
3672 2376 D
3702 2376 D
3702 2373 D
3732 2373 D
3732 2368 D
3762 2368 D
3762 2262 D
3762 2262 D
S
N
1082 3231 M
1529 3231 D
S
N
1657 3257 M
1657 3196 D
S
N
1660 3257 M
1695 3202 D
S
N
1660 3251 M
1695 3196 D
S
N
1695 3257 M
1695 3196 D
S
N
1649 3257 M
1660 3257 D
S
N
1686 3257 M
1704 3257 D
S
N
1649 3196 M
1666 3196 D
S
N
1724 3257 M
1724 3196 D
S
N
1727 3257 M
1727 3196 D
S
N
1715 3257 M
1735 3257 D
S
N
1715 3196 M
1759 3196 D
1759 3214 D
1756 3196 D
S
N
1790 3257 M
1782 3254 D
1776 3248 D
1773 3243 D
1770 3231 D
1770 3222 D
1773 3211 D
1776 3205 D
1782 3199 D
1790 3196 D
1796 3196 D
1805 3199 D
1811 3205 D
1813 3211 D
1816 3222 D
1816 3231 D
1813 3243 D
1811 3248 D
1805 3254 D
1796 3257 D
1790 3257 D
S
N
1790 3257 M
1785 3254 D
1779 3248 D
1776 3243 D
1773 3231 D
1773 3222 D
1776 3211 D
1779 3205 D
1785 3199 D
1790 3196 D
S
N
1796 3196 M
1802 3199 D
1808 3205 D
1811 3211 D
1813 3222 D
1813 3231 D
1811 3243 D
1808 3248 D
1802 3254 D
1796 3257 D
S
0.00 0.00 1.00 setrgbcolor
N
834 4450 M
785 4450 D
S
N
800 4450 M
800 4394 D
S
N
834 4394 M
785 4394 D
S
N
864 4463 M
795 4463 D
S
N
829 4463 M
829 4401 D
S
N
864 4401 M
795 4401 D
S
N
894 4340 M
824 4340 D
S
N
859 4340 M
859 4286 D
S
N
894 4286 M
824 4286 D
S
N
923 4387 M
854 4387 D
S
N
889 4387 M
889 4322 D
S
N
923 4322 M
854 4322 D
S
N
953 4420 M
884 4420 D
S
N
919 4420 M
919 4366 D
S
N
953 4366 M
884 4366 D
S
N
983 4415 M
914 4415 D
S
N
948 4415 M
948 4359 D
S
N
983 4359 M
914 4359 D
S
N
1013 4460 M
944 4460 D
S
N
978 4460 M
978 4400 D
S
N
1013 4400 M
944 4400 D
S
N
1043 4418 M
973 4418 D
S
N
1008 4418 M
1008 4366 D
S
N
1043 4366 M
973 4366 D
S
N
1072 4393 M
1003 4393 D
S
N
1038 4393 M
1038 4335 D
S
N
1072 4335 M
1003 4335 D
S
N
1102 4458 M
1033 4458 D
S
N
1067 4458 M
1067 4398 D
S
N
1102 4398 M
1033 4398 D
S
N
1132 4372 M
1063 4372 D
S
N
1097 4372 M
1097 4311 D
S
N
1132 4311 M
1063 4311 D
S
N
1162 4409 M
1092 4409 D
S
N
1127 4409 M
1127 4358 D
S
N
1162 4358 M
1092 4358 D
S
N
1191 4366 M
1122 4366 D
S
N
1157 4366 M
1157 4318 D
S
N
1191 4318 M
1122 4318 D
S
N
1221 4381 M
1152 4381 D
S
N
1187 4381 M
1187 4319 D
S
N
1221 4319 M
1152 4319 D
S
N
1251 4442 M
1182 4442 D
S
N
1216 4442 M
1216 4388 D
S
N
1251 4388 M
1182 4388 D
S
N
1281 4390 M
1211 4390 D
S
N
1246 4390 M
1246 4327 D
S
N
1281 4327 M
1211 4327 D
S
N
1310 4398 M
1241 4398 D
S
N
1276 4398 M
1276 4338 D
S
N
1310 4338 M
1241 4338 D
S
N
1340 4391 M
1271 4391 D
S
N
1306 4391 M
1306 4331 D
S
N
1340 4331 M
1271 4331 D
S
N
1370 4366 M
1301 4366 D
S
N
1335 4366 M
1335 4310 D
S
N
1370 4310 M
1301 4310 D
S
N
1400 4380 M
1331 4380 D
S
N
1365 4380 M
1365 4324 D
S
N
1400 4324 M
1331 4324 D
S
N
1430 4352 M
1360 4352 D
S
N
1395 4352 M
1395 4300 D
S
N
1430 4300 M
1360 4300 D
S
N
1459 4355 M
1390 4355 D
S
N
1425 4355 M
1425 4298 D
S
N
1459 4298 M
1390 4298 D
S
N
1489 4363 M
1420 4363 D
S
N
1454 4363 M
1454 4306 D
S
N
1489 4306 M
1420 4306 D
S
N
1519 4340 M
1450 4340 D
S
N
1484 4340 M
1484 4285 D
S
N
1519 4285 M
1450 4285 D
S
N
1549 4370 M
1479 4370 D
S
N
1514 4370 M
1514 4318 D
S
N
1549 4318 M
1479 4318 D
S
N
1578 4328 M
1509 4328 D
S
N
1544 4328 M
1544 4275 D
S
N
1578 4275 M
1509 4275 D
S
N
1608 4307 M
1539 4307 D
S
N
1574 4307 M
1574 4257 D
S
N
1608 4257 M
1539 4257 D
S
N
1638 4332 M
1569 4332 D
S
N
1603 4332 M
1603 4275 D
S
N
1638 4275 M
1569 4275 D
S
N
1668 4329 M
1598 4329 D
S
N
1633 4329 M
1633 4278 D
S
N
1668 4278 M
1598 4278 D
S
N
1697 4258 M
1628 4258 D
S
N
1663 4258 M
1663 4204 D
S
N
1697 4204 M
1628 4204 D
S
N
1727 4309 M
1658 4309 D
S
N
1693 4309 M
1693 4254 D
S
N
1727 4254 M
1658 4254 D
S
N
1757 4299 M
1688 4299 D
S
N
1722 4299 M
1722 4246 D
S
N
1757 4246 M
1688 4246 D
S
N
1787 4333 M
1718 4333 D
S
N
1752 4333 M
1752 4277 D
S
N
1787 4277 M
1718 4277 D
S
N
1816 4305 M
1747 4305 D
S
N
1782 4305 M
1782 4246 D
S
N
1816 4246 M
1747 4246 D
S
N
1846 4287 M
1777 4287 D
S
N
1812 4287 M
1812 4235 D
S
N
1846 4235 M
1777 4235 D
S
N
1876 4303 M
1807 4303 D
S
N
1841 4303 M
1841 4244 D
S
N
1876 4244 M
1807 4244 D
S
N
1906 4234 M
1837 4234 D
S
N
1871 4234 M
1871 4183 D
S
N
1906 4183 M
1837 4183 D
S
N
1936 4276 M
1866 4276 D
S
N
1901 4276 M
1901 4221 D
S
N
1936 4221 M
1866 4221 D
S
N
1965 4226 M
1896 4226 D
S
N
1931 4226 M
1931 4175 D
S
N
1965 4175 M
1896 4175 D
S
N
1995 4251 M
1926 4251 D
S
N
1961 4251 M
1961 4195 D
S
N
1995 4195 M
1926 4195 D
S
N
2025 4268 M
1956 4268 D
S
N
1990 4268 M
1990 4213 D
S
N
2025 4213 M
1956 4213 D
S
N
2055 4204 M
1985 4204 D
S
N
2020 4204 M
2020 4148 D
S
N
2055 4148 M
1985 4148 D
S
N
2084 4309 M
2015 4309 D
S
N
2050 4309 M
2050 4245 D
S
N
2084 4245 M
2015 4245 D
S
N
2114 4282 M
2045 4282 D
S
N
2080 4282 M
2080 4222 D
S
N
2114 4222 M
2045 4222 D
S
N
2144 4210 M
2075 4210 D
S
N
2109 4210 M
2109 4156 D
S
N
2144 4156 M
2075 4156 D
S
N
2174 4229 M
2105 4229 D
S
N
2139 4229 M
2139 4181 D
S
N
2174 4181 M
2105 4181 D
S
N
2204 4252 M
2134 4252 D
S
N
2169 4252 M
2169 4199 D
S
N
2204 4199 M
2134 4199 D
S
N
2233 4158 M
2164 4158 D
S
N
2199 4158 M
2199 4109 D
S
N
2233 4109 M
2164 4109 D
S
N
2263 4259 M
2194 4259 D
S
N
2228 4259 M
2228 4202 D
S
N
2263 4202 M
2194 4202 D
S
N
2293 4175 M
2224 4175 D
S
N
2258 4175 M
2258 4121 D
S
N
2293 4121 M
2224 4121 D
S
N
2323 4228 M
2253 4228 D
S
N
2288 4228 M
2288 4173 D
S
N
2323 4173 M
2253 4173 D
S
N
2352 4195 M
2283 4195 D
S
N
2318 4195 M
2318 4134 D
S
N
2352 4134 M
2283 4134 D
S
N
2382 4212 M
2313 4212 D
S
N
2348 4212 M
2348 4157 D
S
N
2382 4157 M
2313 4157 D
S
N
2412 4151 M
2343 4151 D
S
N
2377 4151 M
2377 4102 D
S
N
2412 4102 M
2343 4102 D
S
N
2442 4179 M
2372 4179 D
S
N
2407 4179 M
2407 4129 D
S
N
2442 4129 M
2372 4129 D
S
N
2471 4166 M
2402 4166 D
S
N
2437 4166 M
2437 4114 D
S
N
2471 4114 M
2402 4114 D
S
N
2501 4142 M
2432 4142 D
S
N
2467 4142 M
2467 4087 D
S
N
2501 4087 M
2432 4087 D
S
N
2531 4091 M
2462 4091 D
S
N
2496 4091 M
2496 4029 D
S
N
2531 4029 M
2462 4029 D
S
N
2561 4125 M
2492 4125 D
S
N
2526 4125 M
2526 4077 D
S
N
2561 4077 M
2492 4077 D
S
N
2591 4132 M
2521 4132 D
S
N
2556 4132 M
2556 4085 D
S
N
2591 4085 M
2521 4085 D
S
N
2620 4149 M
2551 4149 D
S
N
2586 4149 M
2586 4103 D
S
N
2620 4103 M
2551 4103 D
S
N
2650 4039 M
2581 4039 D
S
N
2615 4039 M
2615 3994 D
S
N
2650 3994 M
2581 3994 D
S
N
2680 4098 M
2611 4098 D
S
N
2645 4098 M
2645 4049 D
S
N
2680 4049 M
2611 4049 D
S
N
2710 4096 M
2640 4096 D
S
N
2675 4096 M
2675 4045 D
S
N
2710 4045 M
2640 4045 D
S
N
2739 4074 M
2670 4074 D
S
N
2705 4074 M
2705 4026 D
S
N
2739 4026 M
2670 4026 D
S
N
2769 4041 M
2700 4041 D
S
N
2735 4041 M
2735 3992 D
S
N
2769 3992 M
2700 3992 D
S
N
2799 4026 M
2730 4026 D
S
N
2764 4026 M
2764 3973 D
S
N
2799 3973 M
2730 3973 D
S
N
2829 4020 M
2759 4020 D
S
N
2794 4020 M
2794 3974 D
S
N
2829 3974 M
2759 3974 D
S
N
2858 3991 M
2789 3991 D
S
N
2824 3991 M
2824 3948 D
S
N
2858 3948 M
2789 3948 D
S
N
2888 3983 M
2819 3983 D
S
N
2854 3983 M
2854 3936 D
S
N
2888 3936 M
2819 3936 D
S
N
2918 3988 M
2849 3988 D
S
N
2883 3988 M
2883 3938 D
S
N
2918 3938 M
2849 3938 D
S
N
2948 3940 M
2878 3940 D
S
N
2913 3940 M
2913 3888 D
S
N
2948 3888 M
2878 3888 D
S
N
2977 3942 M
2908 3942 D
S
N
2943 3942 M
2943 3895 D
S
N
2977 3895 M
2908 3895 D
S
N
3007 3878 M
2938 3878 D
S
N
2973 3878 M
2973 3825 D
S
N
3007 3825 M
2938 3825 D
S
N
3037 3876 M
2968 3876 D
S
N
3002 3876 M
3002 3814 D
S
N
3037 3814 M
2968 3814 D
S
N
3067 3903 M
2998 3903 D
S
N
3032 3903 M
3032 3841 D
S
N
3067 3841 M
2998 3841 D
S
N
3097 3524 M
3027 3524 D
S
N
3062 3524 M
3062 3459 D
S
N
3097 3459 M
3027 3459 D
S
N
3126 3716 M
3057 3716 D
S
N
3092 3716 M
3092 3676 D
S
N
3126 3676 M
3057 3676 D
S
N
3156 3853 M
3087 3853 D
S
N
3121 3853 M
3121 3822 D
S
N
3156 3822 M
3087 3822 D
S
N
3186 3616 M
3117 3616 D
S
N
3151 3616 M
3151 3598 D
S
N
3186 3598 M
3117 3598 D
S
N
3216 3418 M
3146 3418 D
S
N
3181 3418 M
3181 3400 D
S
N
3216 3400 M
3146 3400 D
S
N
3245 3230 M
3176 3230 D
S
N
3211 3230 M
3211 3216 D
S
N
3245 3216 M
3176 3216 D
S
N
3275 3095 M
3206 3095 D
S
N
3241 3095 M
3241 3081 D
S
N
3275 3081 M
3206 3081 D
S
N
3305 2954 M
3236 2954 D
S
N
3270 2954 M
3270 2942 D
S
N
3305 2942 M
3236 2942 D
S
N
3335 2868 M
3266 2868 D
S
N
3300 2868 M
3300 2856 D
S
N
3335 2856 M
3266 2856 D
S
N
3365 2747 M
3295 2747 D
S
N
3330 2747 M
3330 2738 D
S
N
3365 2738 M
3295 2738 D
S
N
3394 2672 M
3325 2672 D
S
N
3360 2672 M
3360 2665 D
S
N
3394 2665 M
3325 2665 D
S
N
3424 2599 M
3355 2599 D
S
N
3389 2599 M
3389 2588 D
S
N
3424 2588 M
3355 2588 D
S
N
3454 2540 M
3385 2540 D
S
N
3419 2540 M
3419 2531 D
S
N
3454 2531 M
3385 2531 D
S
N
3484 2500 M
3414 2500 D
S
N
3449 2500 M
3449 2496 D
S
N
3484 2496 M
3414 2496 D
S
N
3513 2474 M
3444 2474 D
S
N
3479 2474 M
3479 2470 D
S
N
3513 2470 M
3444 2470 D
S
N
3543 2463 M
3474 2463 D
S
N
3509 2463 M
3509 2460 D
S
N
3543 2460 M
3474 2460 D
S
N
3573 2453 M
3504 2453 D
S
N
3538 2453 M
3538 2449 D
S
N
3573 2449 M
3504 2449 D
S
N
3603 2443 M
3533 2443 D
S
N
3568 2443 M
3568 2440 D
S
N
3603 2440 M
3533 2440 D
S
N
3632 2437 M
3563 2437 D
S
N
3598 2437 M
3598 2434 D
S
N
3632 2434 M
3563 2434 D
S
N
3662 2435 M
3593 2435 D
S
N
3628 2435 M
3628 2432 D
S
N
3662 2432 M
3593 2432 D
S
N
3692 2431 M
3623 2431 D
S
N
3657 2431 M
3657 2428 D
S
N
3692 2428 M
3623 2428 D
S
N
3722 2426 M
3652 2426 D
S
N
3687 2426 M
3687 2424 D
S
N
3722 2424 M
3652 2424 D
S
N
3752 2424 M
3682 2424 D
S
N
3717 2424 M
3717 2422 D
S
N
3752 2422 M
3682 2422 D
S
N
3762 2417 M
3712 2417 D
S
N
3747 2417 M
3747 2415 D
S
N
3762 2415 M
3712 2415 D
S
N
1325 3425 M
1256 3425 D
S
N
1291 3425 M
1291 3360 D
S
N
1325 3360 M
1256 3360 D
S
N
1657 3419 M
1657 3358 D
S
N
1660 3419 M
1695 3364 D
S
N
1660 3413 M
1695 3358 D
S
N
1695 3419 M
1695 3358 D
S
N
1649 3419 M
1660 3419 D
S
N
1686 3419 M
1704 3419 D
S
N
1649 3358 M
1666 3358 D
S
N
1724 3419 M
1724 3358 D
S
N
1727 3419 M
1761 3364 D
S
N
1727 3413 M
1761 3358 D
S
N
1761 3419 M
1761 3358 D
S
N
1715 3419 M
1727 3419 D
S
N
1753 3419 M
1770 3419 D
S
N
1715 3358 M
1733 3358 D
S
N
1790 3419 M
1790 3358 D
S
N
1793 3419 M
1793 3358 D
S
N
1782 3419 M
1802 3419 D
S
N
1782 3358 M
1825 3358 D
1825 3375 D
1822 3358 D
S
N
1857 3419 M
1848 3416 D
1842 3410 D
1839 3404 D
1837 3393 D
1837 3384 D
1839 3372 D
1842 3367 D
1848 3361 D
1857 3358 D
1862 3358 D
1871 3361 D
1877 3367 D
1880 3372 D
1883 3384 D
1883 3393 D
1880 3404 D
1877 3410 D
1871 3416 D
1862 3419 D
1857 3419 D
S
N
1857 3419 M
1851 3416 D
1845 3410 D
1842 3404 D
1839 3393 D
1839 3384 D
1842 3372 D
1845 3367 D
1851 3361 D
1857 3358 D
S
N
1862 3358 M
1868 3361 D
1874 3367 D
1877 3372 D
1880 3384 D
1880 3393 D
1877 3404 D
1874 3410 D
1868 3416 D
1862 3419 D
S
0.00 0.00 0.00 setrgbcolor
N
785 4685 M
785 2262 D
S
N
785 2262 M
3762 2262 D
S
N
3762 2262 M
3762 4685 D
S
N
3762 4685 M
785 4685 D
S
N
785 2262 M
3762 2262 D
S
N
785 2262 M
785 2366 D
S
N
904 2296 M
904 2262 D
S
N
1023 2262 M
1023 2296 D
S
N
1142 2296 M
1142 2262 D
S
N
1261 2262 M
1261 2296 D
S
N
1380 2366 M
1380 2262 D
S
N
1499 2262 M
1499 2296 D
S
N
1618 2296 M
1618 2262 D
S
N
1737 2262 M
1737 2296 D
S
N
1856 2296 M
1856 2262 D
S
N
1975 2262 M
1975 2366 D
S
N
2094 2296 M
2094 2262 D
S
N
2214 2262 M
2214 2296 D
S
N
2333 2296 M
2333 2262 D
S
N
2452 2262 M
2452 2296 D
S
N
2571 2366 M
2571 2262 D
S
N
2690 2262 M
2690 2296 D
S
N
2809 2296 M
2809 2262 D
S
N
2928 2262 M
2928 2296 D
S
N
3047 2296 M
3047 2262 D
S
N
3166 2262 M
3166 2366 D
S
N
3285 2296 M
3285 2262 D
S
N
3404 2262 M
3404 2296 D
S
N
3523 2296 M
3523 2262 D
S
N
3642 2262 M
3642 2296 D
S
N
3762 2366 M
3762 2262 D
S
N
738 2205 M
730 2202 D
724 2193 D
721 2179 D
721 2170 D
724 2156 D
730 2147 D
738 2144 D
744 2144 D
753 2147 D
759 2156 D
762 2170 D
762 2179 D
759 2193 D
753 2202 D
744 2205 D
738 2205 D
S
N
738 2205 M
733 2202 D
730 2199 D
727 2193 D
724 2179 D
724 2170 D
727 2156 D
730 2150 D
733 2147 D
738 2144 D
S
N
744 2144 M
750 2147 D
753 2150 D
756 2156 D
759 2170 D
759 2179 D
756 2193 D
753 2199 D
750 2202 D
744 2205 D
S
N
785 2150 M
782 2147 D
785 2144 D
788 2147 D
785 2150 D
S
N
825 2205 M
816 2202 D
811 2193 D
808 2179 D
808 2170 D
811 2156 D
816 2147 D
825 2144 D
831 2144 D
840 2147 D
845 2156 D
848 2170 D
848 2179 D
845 2193 D
840 2202 D
831 2205 D
825 2205 D
S
N
825 2205 M
819 2202 D
816 2199 D
814 2193 D
811 2179 D
811 2170 D
814 2156 D
816 2150 D
819 2147 D
825 2144 D
S
N
831 2144 M
837 2147 D
840 2150 D
842 2156 D
845 2170 D
845 2179 D
842 2193 D
840 2199 D
837 2202 D
831 2205 D
S
N
1334 2205 M
1325 2202 D
1319 2193 D
1317 2179 D
1317 2170 D
1319 2156 D
1325 2147 D
1334 2144 D
1340 2144 D
1348 2147 D
1354 2156 D
1357 2170 D
1357 2179 D
1354 2193 D
1348 2202 D
1340 2205 D
1334 2205 D
S
N
1334 2205 M
1328 2202 D
1325 2199 D
1322 2193 D
1319 2179 D
1319 2170 D
1322 2156 D
1325 2150 D
1328 2147 D
1334 2144 D
S
N
1340 2144 M
1345 2147 D
1348 2150 D
1351 2156 D
1354 2170 D
1354 2179 D
1351 2193 D
1348 2199 D
1345 2202 D
1340 2205 D
S
N
1380 2150 M
1377 2147 D
1380 2144 D
1383 2147 D
1380 2150 D
S
N
1406 2193 M
1409 2190 D
1406 2187 D
1403 2190 D
1403 2193 D
1406 2199 D
1409 2202 D
1418 2205 D
1429 2205 D
1438 2202 D
1441 2199 D
1444 2193 D
1444 2187 D
1441 2182 D
1432 2176 D
1418 2170 D
1412 2167 D
1406 2161 D
1403 2153 D
1403 2144 D
S
N
1429 2205 M
1435 2202 D
1438 2199 D
1441 2193 D
1441 2187 D
1438 2182 D
1429 2176 D
1418 2170 D
S
N
1403 2150 M
1406 2153 D
1412 2153 D
1426 2147 D
1435 2147 D
1441 2150 D
1444 2153 D
S
N
1412 2153 M
1426 2144 D
1438 2144 D
1441 2147 D
1444 2153 D
1444 2158 D
S
N
1929 2205 M
1921 2202 D
1915 2193 D
1912 2179 D
1912 2170 D
1915 2156 D
1921 2147 D
1929 2144 D
1935 2144 D
1944 2147 D
1949 2156 D
1952 2170 D
1952 2179 D
1949 2193 D
1944 2202 D
1935 2205 D
1929 2205 D
S
N
1929 2205 M
1923 2202 D
1921 2199 D
1918 2193 D
1915 2179 D
1915 2170 D
1918 2156 D
1921 2150 D
1923 2147 D
1929 2144 D
S
N
1935 2144 M
1941 2147 D
1944 2150 D
1947 2156 D
1949 2170 D
1949 2179 D
1947 2193 D
1944 2199 D
1941 2202 D
1935 2205 D
S
N
1975 2150 M
1973 2147 D
1975 2144 D
1978 2147 D
1975 2150 D
S
N
2025 2199 M
2025 2144 D
S
N
2027 2205 M
2027 2144 D
S
N
2027 2205 M
1996 2161 D
2042 2161 D
S
N
2016 2144 M
2036 2144 D
S
N
2525 2205 M
2516 2202 D
2510 2193 D
2507 2179 D
2507 2170 D
2510 2156 D
2516 2147 D
2525 2144 D
2530 2144 D
2539 2147 D
2545 2156 D
2548 2170 D
2548 2179 D
2545 2193 D
2539 2202 D
2530 2205 D
2525 2205 D
S
N
2525 2205 M
2519 2202 D
2516 2199 D
2513 2193 D
2510 2179 D
2510 2170 D
2513 2156 D
2516 2150 D
2519 2147 D
2525 2144 D
S
N
2530 2144 M
2536 2147 D
2539 2150 D
2542 2156 D
2545 2170 D
2545 2179 D
2542 2193 D
2539 2199 D
2536 2202 D
2530 2205 D
S
N
2571 2150 M
2568 2147 D
2571 2144 D
2574 2147 D
2571 2150 D
S
N
2629 2196 M
2626 2193 D
2629 2190 D
2631 2193 D
2631 2196 D
2629 2202 D
2623 2205 D
2614 2205 D
2605 2202 D
2600 2196 D
2597 2190 D
2594 2179 D
2594 2161 D
2597 2153 D
2603 2147 D
2611 2144 D
2617 2144 D
2626 2147 D
2631 2153 D
2634 2161 D
2634 2164 D
2631 2173 D
2626 2179 D
2617 2182 D
2614 2182 D
2605 2179 D
2600 2173 D
2597 2164 D
S
N
2614 2205 M
2608 2202 D
2603 2196 D
2600 2190 D
2597 2179 D
2597 2161 D
2600 2153 D
2605 2147 D
2611 2144 D
S
N
2617 2144 M
2623 2147 D
2629 2153 D
2631 2161 D
2631 2164 D
2629 2173 D
2623 2179 D
2617 2182 D
S
N
3120 2205 M
3111 2202 D
3106 2193 D
3103 2179 D
3103 2170 D
3106 2156 D
3111 2147 D
3120 2144 D
3126 2144 D
3134 2147 D
3140 2156 D
3143 2170 D
3143 2179 D
3140 2193 D
3134 2202 D
3126 2205 D
3120 2205 D
S
N
3120 2205 M
3114 2202 D
3111 2199 D
3108 2193 D
3106 2179 D
3106 2170 D
3108 2156 D
3111 2150 D
3114 2147 D
3120 2144 D
S
N
3126 2144 M
3132 2147 D
3134 2150 D
3137 2156 D
3140 2170 D
3140 2179 D
3137 2193 D
3134 2199 D
3132 2202 D
3126 2205 D
S
N
3166 2150 M
3163 2147 D
3166 2144 D
3169 2147 D
3166 2150 D
S
N
3204 2205 M
3195 2202 D
3192 2196 D
3192 2187 D
3195 2182 D
3204 2179 D
3215 2179 D
3224 2182 D
3227 2187 D
3227 2196 D
3224 2202 D
3215 2205 D
3204 2205 D
S
N
3204 2205 M
3198 2202 D
3195 2196 D
3195 2187 D
3198 2182 D
3204 2179 D
S
N
3215 2179 M
3221 2182 D
3224 2187 D
3224 2196 D
3221 2202 D
3215 2205 D
S
N
3204 2179 M
3195 2176 D
3192 2173 D
3189 2167 D
3189 2156 D
3192 2150 D
3195 2147 D
3204 2144 D
3215 2144 D
3224 2147 D
3227 2150 D
3230 2156 D
3230 2167 D
3227 2173 D
3224 2176 D
3215 2179 D
S
N
3204 2179 M
3198 2176 D
3195 2173 D
3192 2167 D
3192 2156 D
3195 2150 D
3198 2147 D
3204 2144 D
S
N
3215 2144 M
3221 2147 D
3224 2150 D
3227 2156 D
3227 2167 D
3224 2173 D
3221 2176 D
3215 2179 D
S
N
3707 2193 M
3712 2196 D
3721 2205 D
3721 2144 D
S
N
3718 2202 M
3718 2144 D
S
N
3707 2144 M
3733 2144 D
S
N
3762 2150 M
3759 2147 D
3762 2144 D
3764 2147 D
3762 2150 D
S
N
3802 2205 M
3793 2202 D
3788 2193 D
3785 2179 D
3785 2170 D
3788 2156 D
3793 2147 D
3802 2144 D
3808 2144 D
3816 2147 D
3822 2156 D
3825 2170 D
3825 2179 D
3822 2193 D
3816 2202 D
3808 2205 D
3802 2205 D
S
N
3802 2205 M
3796 2202 D
3793 2199 D
3790 2193 D
3788 2179 D
3788 2170 D
3790 2156 D
3793 2150 D
3796 2147 D
3802 2144 D
S
N
3808 2144 M
3814 2147 D
3816 2150 D
3819 2156 D
3822 2170 D
3822 2179 D
3819 2193 D
3816 2199 D
3814 2202 D
3808 2205 D
S
N
785 4685 M
3762 4685 D
S
N
785 4581 M
785 4685 D
S
N
904 4685 M
904 4650 D
S
N
1023 4650 M
1023 4685 D
S
N
1142 4685 M
1142 4650 D
S
N
1261 4650 M
1261 4685 D
S
N
1380 4685 M
1380 4581 D
S
N
1499 4650 M
1499 4685 D
S
N
1618 4685 M
1618 4650 D
S
N
1737 4650 M
1737 4685 D
S
N
1856 4685 M
1856 4650 D
S
N
1975 4581 M
1975 4685 D
S
N
2094 4685 M
2094 4650 D
S
N
2214 4650 M
2214 4685 D
S
N
2333 4685 M
2333 4650 D
S
N
2452 4650 M
2452 4685 D
S
N
2571 4685 M
2571 4581 D
S
N
2690 4650 M
2690 4685 D
S
N
2809 4685 M
2809 4650 D
S
N
2928 4650 M
2928 4685 D
S
N
3047 4685 M
3047 4650 D
S
N
3166 4581 M
3166 4685 D
S
N
3285 4685 M
3285 4650 D
S
N
3404 4650 M
3404 4685 D
S
N
3523 4685 M
3523 4650 D
S
N
3642 4650 M
3642 4685 D
S
N
3762 4685 M
3762 4581 D
S
N
785 2262 M
785 4685 D
S
N
785 2262 M
888 2262 D
S
N
819 2343 M
785 2343 D
S
N
785 2423 M
819 2423 D
S
N
819 2504 M
785 2504 D
S
N
785 2585 M
819 2585 D
S
N
888 2666 M
785 2666 D
S
N
785 2746 M
819 2746 D
S
N
819 2827 M
785 2827 D
S
N
785 2908 M
819 2908 D
S
N
819 2989 M
785 2989 D
S
N
785 3069 M
888 3069 D
S
N
819 3150 M
785 3150 D
S
N
785 3231 M
819 3231 D
S
N
819 3312 M
785 3312 D
S
N
785 3393 M
819 3393 D
S
N
888 3473 M
785 3473 D
S
N
785 3554 M
819 3554 D
S
N
819 3635 M
785 3635 D
S
N
785 3716 M
819 3716 D
S
N
819 3796 M
785 3796 D
S
N
785 3877 M
888 3877 D
S
N
819 3958 M
785 3958 D
S
N
785 4039 M
819 4039 D
S
N
819 4119 M
785 4119 D
S
N
785 4200 M
819 4200 D
S
N
888 4281 M
785 4281 D
S
N
785 4362 M
819 4362 D
S
N
819 4443 M
785 4443 D
S
N
785 4523 M
819 4523 D
S
N
819 4604 M
785 4604 D
S
N
785 4685 M
888 4685 D
S
N
574 2288 M
565 2285 D
560 2276 D
557 2262 D
557 2253 D
560 2239 D
565 2230 D
574 2227 D
580 2227 D
588 2230 D
594 2239 D
597 2253 D
597 2262 D
594 2276 D
588 2285 D
580 2288 D
574 2288 D
S
N
574 2288 M
568 2285 D
565 2282 D
562 2276 D
560 2262 D
560 2253 D
562 2239 D
565 2233 D
568 2230 D
574 2227 D
S
N
580 2227 M
586 2230 D
588 2233 D
591 2239 D
594 2253 D
594 2262 D
591 2276 D
588 2282 D
586 2285 D
580 2288 D
S
N
620 2233 M
617 2230 D
620 2227 D
623 2230 D
620 2233 D
S
N
661 2288 M
652 2285 D
646 2276 D
643 2262 D
643 2253 D
646 2239 D
652 2230 D
661 2227 D
666 2227 D
675 2230 D
681 2239 D
684 2253 D
684 2262 D
681 2276 D
675 2285 D
666 2288 D
661 2288 D
S
N
661 2288 M
655 2285 D
652 2282 D
649 2276 D
646 2262 D
646 2253 D
649 2239 D
652 2233 D
655 2230 D
661 2227 D
S
N
666 2227 M
672 2230 D
675 2233 D
678 2239 D
681 2253 D
681 2262 D
678 2276 D
675 2282 D
672 2285 D
666 2288 D
S
N
718 2288 M
710 2285 D
704 2276 D
701 2262 D
701 2253 D
704 2239 D
710 2230 D
718 2227 D
724 2227 D
733 2230 D
739 2239 D
742 2253 D
742 2262 D
739 2276 D
733 2285 D
724 2288 D
718 2288 D
S
N
718 2288 M
713 2285 D
710 2282 D
707 2276 D
704 2262 D
704 2253 D
707 2239 D
710 2233 D
713 2230 D
718 2227 D
S
N
724 2227 M
730 2230 D
733 2233 D
736 2239 D
739 2253 D
739 2262 D
736 2276 D
733 2282 D
730 2285 D
724 2288 D
S
N
574 2692 M
565 2689 D
560 2680 D
557 2666 D
557 2657 D
560 2643 D
565 2634 D
574 2631 D
580 2631 D
588 2634 D
594 2643 D
597 2657 D
597 2666 D
594 2680 D
588 2689 D
580 2692 D
574 2692 D
S
N
574 2692 M
568 2689 D
565 2686 D
562 2680 D
560 2666 D
560 2657 D
562 2643 D
565 2637 D
568 2634 D
574 2631 D
S
N
580 2631 M
586 2634 D
588 2637 D
591 2643 D
594 2657 D
594 2666 D
591 2680 D
588 2686 D
586 2689 D
580 2692 D
S
N
620 2637 M
617 2634 D
620 2631 D
623 2634 D
620 2637 D
S
N
646 2680 M
649 2677 D
646 2674 D
643 2677 D
643 2680 D
646 2686 D
649 2689 D
658 2692 D
669 2692 D
678 2689 D
681 2686 D
684 2680 D
684 2674 D
681 2669 D
672 2663 D
658 2657 D
652 2654 D
646 2648 D
643 2640 D
643 2631 D
S
N
669 2692 M
675 2689 D
678 2686 D
681 2680 D
681 2674 D
678 2669 D
669 2663 D
658 2657 D
S
N
643 2637 M
646 2640 D
652 2640 D
666 2634 D
675 2634 D
681 2637 D
684 2640 D
S
N
652 2640 M
666 2631 D
678 2631 D
681 2634 D
684 2640 D
684 2645 D
S
N
707 2692 M
701 2663 D
S
N
701 2663 M
707 2669 D
716 2671 D
724 2671 D
733 2669 D
739 2663 D
742 2654 D
742 2648 D
739 2640 D
733 2634 D
724 2631 D
716 2631 D
707 2634 D
704 2637 D
701 2643 D
701 2645 D
704 2648 D
707 2645 D
704 2643 D
S
N
724 2671 M
730 2669 D
736 2663 D
739 2654 D
739 2648 D
736 2640 D
730 2634 D
724 2631 D
S
N
707 2692 M
736 2692 D
S
N
707 2689 M
721 2689 D
736 2692 D
S
N
574 3095 M
565 3093 D
560 3084 D
557 3069 D
557 3061 D
560 3046 D
565 3038 D
574 3035 D
580 3035 D
588 3038 D
594 3046 D
597 3061 D
597 3069 D
594 3084 D
588 3093 D
580 3095 D
574 3095 D
S
N
574 3095 M
568 3093 D
565 3090 D
562 3084 D
560 3069 D
560 3061 D
562 3046 D
565 3041 D
568 3038 D
574 3035 D
S
N
580 3035 M
586 3038 D
588 3041 D
591 3046 D
594 3061 D
594 3069 D
591 3084 D
588 3090 D
586 3093 D
580 3095 D
S
N
620 3041 M
617 3038 D
620 3035 D
623 3038 D
620 3041 D
S
N
649 3095 M
643 3067 D
S
N
643 3067 M
649 3072 D
658 3075 D
666 3075 D
675 3072 D
681 3067 D
684 3058 D
684 3052 D
681 3043 D
675 3038 D
666 3035 D
658 3035 D
649 3038 D
646 3041 D
643 3046 D
643 3049 D
646 3052 D
649 3049 D
646 3046 D
S
N
666 3075 M
672 3072 D
678 3067 D
681 3058 D
681 3052 D
678 3043 D
672 3038 D
666 3035 D
S
N
649 3095 M
678 3095 D
S
N
649 3093 M
664 3093 D
678 3095 D
S
N
718 3095 M
710 3093 D
704 3084 D
701 3069 D
701 3061 D
704 3046 D
710 3038 D
718 3035 D
724 3035 D
733 3038 D
739 3046 D
742 3061 D
742 3069 D
739 3084 D
733 3093 D
724 3095 D
718 3095 D
S
N
718 3095 M
713 3093 D
710 3090 D
707 3084 D
704 3069 D
704 3061 D
707 3046 D
710 3041 D
713 3038 D
718 3035 D
S
N
724 3035 M
730 3038 D
733 3041 D
736 3046 D
739 3061 D
739 3069 D
736 3084 D
733 3090 D
730 3093 D
724 3095 D
S
N
574 3499 M
565 3496 D
560 3488 D
557 3473 D
557 3465 D
560 3450 D
565 3442 D
574 3439 D
580 3439 D
588 3442 D
594 3450 D
597 3465 D
597 3473 D
594 3488 D
588 3496 D
580 3499 D
574 3499 D
S
N
574 3499 M
568 3496 D
565 3494 D
562 3488 D
560 3473 D
560 3465 D
562 3450 D
565 3444 D
568 3442 D
574 3439 D
S
N
580 3439 M
586 3442 D
588 3444 D
591 3450 D
594 3465 D
594 3473 D
591 3488 D
588 3494 D
586 3496 D
580 3499 D
S
N
620 3444 M
617 3442 D
620 3439 D
623 3442 D
620 3444 D
S
N
643 3499 M
643 3482 D
S
N
643 3488 M
646 3494 D
652 3499 D
658 3499 D
672 3491 D
678 3491 D
681 3494 D
684 3499 D
S
N
646 3494 M
652 3496 D
658 3496 D
672 3491 D
S
N
684 3499 M
684 3491 D
681 3482 D
669 3468 D
666 3462 D
664 3453 D
664 3439 D
S
N
681 3482 M
666 3468 D
664 3462 D
661 3453 D
661 3439 D
S
N
707 3499 M
701 3470 D
S
N
701 3470 M
707 3476 D
716 3479 D
724 3479 D
733 3476 D
739 3470 D
742 3462 D
742 3456 D
739 3447 D
733 3442 D
724 3439 D
716 3439 D
707 3442 D
704 3444 D
701 3450 D
701 3453 D
704 3456 D
707 3453 D
704 3450 D
S
N
724 3479 M
730 3476 D
736 3470 D
739 3462 D
739 3456 D
736 3447 D
730 3442 D
724 3439 D
S
N
707 3499 M
736 3499 D
S
N
707 3496 M
721 3496 D
736 3499 D
S
N
565 3892 M
571 3894 D
580 3903 D
580 3843 D
S
N
577 3900 M
577 3843 D
S
N
565 3843 M
591 3843 D
S
N
620 3848 M
617 3845 D
620 3843 D
623 3845 D
620 3848 D
S
N
661 3903 M
652 3900 D
646 3892 D
643 3877 D
643 3868 D
646 3854 D
652 3845 D
661 3843 D
666 3843 D
675 3845 D
681 3854 D
684 3868 D
684 3877 D
681 3892 D
675 3900 D
666 3903 D
661 3903 D
S
N
661 3903 M
655 3900 D
652 3897 D
649 3892 D
646 3877 D
646 3868 D
649 3854 D
652 3848 D
655 3845 D
661 3843 D
S
N
666 3843 M
672 3845 D
675 3848 D
678 3854 D
681 3868 D
681 3877 D
678 3892 D
675 3897 D
672 3900 D
666 3903 D
S
N
718 3903 M
710 3900 D
704 3892 D
701 3877 D
701 3868 D
704 3854 D
710 3845 D
718 3843 D
724 3843 D
733 3845 D
739 3854 D
742 3868 D
742 3877 D
739 3892 D
733 3900 D
724 3903 D
718 3903 D
S
N
718 3903 M
713 3900 D
710 3897 D
707 3892 D
704 3877 D
704 3868 D
707 3854 D
710 3848 D
713 3845 D
718 3843 D
S
N
724 3843 M
730 3845 D
733 3848 D
736 3854 D
739 3868 D
739 3877 D
736 3892 D
733 3897 D
730 3900 D
724 3903 D
S
N
565 4295 M
571 4298 D
580 4307 D
580 4246 D
S
N
577 4304 M
577 4246 D
S
N
565 4246 M
591 4246 D
S
N
620 4252 M
617 4249 D
620 4246 D
623 4249 D
620 4252 D
S
N
646 4295 M
649 4293 D
646 4290 D
643 4293 D
643 4295 D
646 4301 D
649 4304 D
658 4307 D
669 4307 D
678 4304 D
681 4301 D
684 4295 D
684 4290 D
681 4284 D
672 4278 D
658 4272 D
652 4269 D
646 4264 D
643 4255 D
643 4246 D
S
N
669 4307 M
675 4304 D
678 4301 D
681 4295 D
681 4290 D
678 4284 D
669 4278 D
658 4272 D
S
N
643 4252 M
646 4255 D
652 4255 D
666 4249 D
675 4249 D
681 4252 D
684 4255 D
S
N
652 4255 M
666 4246 D
678 4246 D
681 4249 D
684 4255 D
684 4261 D
S
N
707 4307 M
701 4278 D
S
N
701 4278 M
707 4284 D
716 4287 D
724 4287 D
733 4284 D
739 4278 D
742 4269 D
742 4264 D
739 4255 D
733 4249 D
724 4246 D
716 4246 D
707 4249 D
704 4252 D
701 4258 D
701 4261 D
704 4264 D
707 4261 D
704 4258 D
S
N
724 4287 M
730 4284 D
736 4278 D
739 4269 D
739 4264 D
736 4255 D
730 4249 D
724 4246 D
S
N
707 4307 M
736 4307 D
S
N
707 4304 M
721 4304 D
736 4307 D
S
N
565 4699 M
571 4702 D
580 4711 D
580 4650 D
S
N
577 4708 M
577 4650 D
S
N
565 4650 M
591 4650 D
S
N
620 4656 M
617 4653 D
620 4650 D
623 4653 D
620 4656 D
S
N
649 4711 M
643 4682 D
S
N
643 4682 M
649 4688 D
658 4691 D
666 4691 D
675 4688 D
681 4682 D
684 4673 D
684 4668 D
681 4659 D
675 4653 D
666 4650 D
658 4650 D
649 4653 D
646 4656 D
643 4662 D
643 4665 D
646 4668 D
649 4665 D
646 4662 D
S
N
666 4691 M
672 4688 D
678 4682 D
681 4673 D
681 4668 D
678 4659 D
672 4653 D
666 4650 D
S
N
649 4711 M
678 4711 D
S
N
649 4708 M
664 4708 D
678 4711 D
S
N
718 4711 M
710 4708 D
704 4699 D
701 4685 D
701 4676 D
704 4662 D
710 4653 D
718 4650 D
724 4650 D
733 4653 D
739 4662 D
742 4676 D
742 4685 D
739 4699 D
733 4708 D
724 4711 D
718 4711 D
S
N
718 4711 M
713 4708 D
710 4705 D
707 4699 D
704 4685 D
704 4676 D
707 4662 D
710 4656 D
713 4653 D
718 4650 D
S
N
724 4650 M
730 4653 D
733 4656 D
736 4662 D
739 4676 D
739 4685 D
736 4699 D
733 4705 D
730 4708 D
724 4711 D
S
N
3762 2262 M
3762 4685 D
S
N
3658 2262 M
3762 2262 D
S
N
3762 2343 M
3727 2343 D
S
N
3727 2423 M
3762 2423 D
S
N
3762 2504 M
3727 2504 D
S
N
3727 2585 M
3762 2585 D
S
N
3762 2666 M
3658 2666 D
S
N
3727 2746 M
3762 2746 D
S
N
3762 2827 M
3727 2827 D
S
N
3727 2908 M
3762 2908 D
S
N
3762 2989 M
3727 2989 D
S
N
3658 3069 M
3762 3069 D
S
N
3762 3150 M
3727 3150 D
S
N
3727 3231 M
3762 3231 D
S
N
3762 3312 M
3727 3312 D
S
N
3727 3393 M
3762 3393 D
S
N
3762 3473 M
3658 3473 D
S
N
3727 3554 M
3762 3554 D
S
N
3762 3635 M
3727 3635 D
S
N
3727 3716 M
3762 3716 D
S
N
3762 3796 M
3727 3796 D
S
N
3658 3877 M
3762 3877 D
S
N
3762 3958 M
3727 3958 D
S
N
3727 4039 M
3762 4039 D
S
N
3762 4119 M
3727 4119 D
S
N
3727 4200 M
3762 4200 D
S
N
3762 4281 M
3658 4281 D
S
N
3727 4362 M
3762 4362 D
S
N
3762 4443 M
3727 4443 D
S
N
3727 4523 M
3762 4523 D
S
N
3762 4604 M
3727 4604 D
S
N
3658 4685 M
3762 4685 D
S
showpage
%%Trailer
%%Pages: 1
%%BoundingBox: 39 236 462 568
