%!PS-Adobe-3.0 EPSF-3.0
%%BoundingBox: (atend)
%%LanguageLevel: 2
%%Creator: Grace-5.1.22
%%CreationDate: Tue Mar 26 12:41:32 2013
%%DocumentData: Clean8Bit
%%Orientation: Portrait
%%Title: /home/pcl302a/heinemey/plot/grace/2012/lhc-higgs-br/lightstop_tb50_BR-A0.grace
%%For: heinemey
%%DocumentNeededResources: (atend)
%%EndComments
%%BeginProlog
/m {moveto} def
/l {lineto} def
/s {stroke} def
/n {newpath} def
/c {closepath} def
/RL {rlineto} def
/SLW {setlinewidth} def
/GS {gsave} def
/GR {grestore} def
/SC {setcolor} def
/SGRY {setgray} def
/SRGB {setrgbcolor} def
/SD {setdash} def
/SLC {setlinecap} def
/SLJ {setlinejoin} def
/SCS {setcolorspace} def
/FFSF {findfont setfont} def
/CC {concat} def
/PXL {n m 0 0 RL s} def
/Color0 {1.0000 1.0000 1.0000} def
/Color1 {0.0000 0.0000 0.0000} def
/Color2 {1.0000 0.0000 0.0000} def
/Color3 {0.0000 1.0000 0.0000} def
/Color4 {0.0000 0.0000 1.0000} def
/Color5 {1.0000 1.0000 0.0000} def
/Color6 {0.7373 0.5608 0.5608} def
/Color7 {0.8627 0.8627 0.8627} def
/Color8 {0.5804 0.0000 0.8275} def
/Color9 {0.0000 1.0000 1.0000} def
/Color10 {1.0000 0.0000 1.0000} def
/Color11 {1.0000 0.6471 0.0000} def
/Color12 {0.4471 0.1294 0.7373} def
/Color13 {0.4039 0.0275 0.2824} def
/Color14 {0.2510 0.8784 0.8157} def
/Color15 {0.0000 0.5451 0.0000} def
/Color16 {0.7529 0.7529 0.7529} def
/Color17 {0.5059 0.5059 0.5059} def
/Color18 {0.2588 0.2588 0.2588} def
/PTRN {
 /pat_bits exch def 
 <<
  /PaintType 2
  /PatternType 1 /TilingType 1
  /BBox[0 0 16 16]
  /XStep 16 /YStep 16
  /PaintProc {
   pop
   16 16 true [-1 0 0 -1 16 16] pat_bits imagemask
  }
 >>
 [0.0016 0 0 0.0016 0 0]
 makepattern
} def
/Pattern0 {<0000000000000000000000000000000000000000000000000000000000000000> PTRN} bind def
/Pattern1 {<ffffffffffffffffffffffffffffffffffffffffffffffffffffffffffffffff> PTRN} bind def
/Pattern2 {<eeeeffffbbbbffffeeeeffffbbbbffffeeeeffffbbbbffffeeeeffffbbbbffff> PTRN} bind def
/Pattern3 {<eeeebbbbeeeebbbbeeeebbbbeeeebbbbeeeebbbbeeeebbbbeeeebbbbeeeebbbb> PTRN} bind def
/Pattern4 {<5555aaaa5555aaaa5555aaaa5555aaaa5555aaaa5555aaaa5555aaaa5555aaaa> PTRN} bind def
/Pattern5 {<1111444411114444111144441111444411114444111144441111444411114444> PTRN} bind def
/Pattern6 {<1111000044440000111100004444000011110000444400001111000044440000> PTRN} bind def
/Pattern7 {<1010000000000000010100000000000010100000000000000101000000000000> PTRN} bind def
/Pattern8 {<0000000000000000000000000000000000000000000000000000000000000000> PTRN} bind def
/Pattern9 {<1e1e0f0f8787c3c3e1e1f0f078783c3c1e1e0f0f8787c3c3e1e1f0f078783c3c> PTRN} bind def
/Pattern10 {<7878f0f0e1e1c3c387870f0f1e1e3c3c7878f0f0e1e1c3c387870f0f1e1e3c3c> PTRN} bind def
/Pattern11 {<3333333333333333333333333333333333333333333333333333333333333333> PTRN} bind def
/Pattern12 {<ffffffff00000000ffffffff00000000ffffffff00000000ffffffff00000000> PTRN} bind def
/Pattern13 {<8181424224241818181824244242818181814242242418181818242442428181> PTRN} bind def
/Pattern14 {<8080404020201010080804040202010180804040202010100808040402020101> PTRN} bind def
/Pattern15 {<0101020204040808101020204040808001010202040408081010202040408080> PTRN} bind def
/Pattern16 {<2222222222222222222222222222222222222222222222222222222222222222> PTRN} bind def
/Pattern17 {<0000ffff000000000000ffff000000000000ffff000000000000ffff00000000> PTRN} bind def
/Pattern18 {<2222ffff222222222222ffff222222222222ffff222222222222ffff22222222> PTRN} bind def
/Pattern19 {<ffffffff33333333ffffffff33333333ffffffff33333333ffffffff33333333> PTRN} bind def
/Pattern20 {<0f0f0f0f0f0f0f0ff0f0f0f0f0f0f0f00f0f0f0f0f0f0f0ff0f0f0f0f0f0f0f0> PTRN} bind def
/Pattern21 {<ff00ff00ff00ff00ff00ff00ff00ff0000ff00ff00ff00ff00ff00ff00ff00ff> PTRN} bind def
/Pattern22 {<8001800180018001800180018001ffffffff8001800180018001800180018001> PTRN} bind def
/Pattern23 {<c003c003c003c003c003c003ffffffffffffffffc003c003c003c003c003c003> PTRN} bind def
/Pattern24 {<040404040404ffff404040404040ffff040404040404ffff404040404040ffff> PTRN} bind def
/Pattern25 {<180018001800180018001800ffffffff001800180018001800180018ffffffff> PTRN} bind def
/Pattern26 {<1111b8b87c7c3a3a1111a3a3c7c78b8b1111b8b87c7c3a3a1111a3a3c7c78b8b> PTRN} bind def
/Pattern27 {<101010102828c7c70101010182827c7c101010102828c7c70101010182827c7c> PTRN} bind def
/Pattern28 {<1c1c121211112121c1c12121111112121c1c121211112121c1c1212111111212> PTRN} bind def
/Pattern29 {<3e3e414180808080e3e31414080808083e3e414180808080e3e3141408080808> PTRN} bind def
/Pattern30 {<4848888884848383848488884848383848488888848483838484888848483838> PTRN} bind def
/Pattern31 {<03030404080808080c0c12122121c0c003030404080808080c0c12122121c0c0> PTRN} bind def
/ellipsedict 8 dict def
ellipsedict /mtrx matrix put
/EARC {
 ellipsedict begin
  /endangle exch def
  /startangle exch def
  /yrad exch def
  /xrad exch def
  /y exch def
  /x exch def
  /savematrix mtrx currentmatrix def
  x y translate
  xrad yrad scale
  0 0 1 startangle endangle arc
  savematrix setmatrix
 end
} def
/TL {
  /kcomp exch def
  /linewidth exch def
  /offset exch def
  GS
  0 offset rmoveto
  linewidth SLW
  dup stringwidth exch kcomp add exch RL s
  GR
} def
/KINIT
{
 /kvector exch def
 /kid 0 def
} def
/KPROC
{
 pop pop
 kvector kid get
 0 rmoveto
 /kid 1 kid add def
} def
/DefEncoding [
 /.notdef
 /.notdef
 /.notdef
 /.notdef
 /.notdef
 /.notdef
 /.notdef
 /.notdef
 /.notdef
 /.notdef
 /.notdef
 /.notdef
 /.notdef
 /.notdef
 /.notdef
 /.notdef
 /.notdef
 /.notdef
 /.notdef
 /.notdef
 /.notdef
 /.notdef
 /.notdef
 /.notdef
 /.notdef
 /.notdef
 /.notdef
 /.notdef
 /.notdef
 /.notdef
 /.notdef
 /.notdef
 /space
 /exclam
 /quotedbl
 /numbersign
 /dollar
 /percent
 /ampersand
 /quoteright
 /parenleft
 /parenright
 /asterisk
 /plus
 /comma
 /hyphen
 /period
 /slash
 /zero
 /one
 /two
 /three
 /four
 /five
 /six
 /seven
 /eight
 /nine
 /colon
 /semicolon
 /less
 /equal
 /greater
 /question
 /at
 /A
 /B
 /C
 /D
 /E
 /F
 /G
 /H
 /I
 /J
 /K
 /L
 /M
 /N
 /O
 /P
 /Q
 /R
 /S
 /T
 /U
 /V
 /W
 /X
 /Y
 /Z
 /bracketleft
 /backslash
 /bracketright
 /asciicircum
 /underscore
 /grave
 /a
 /b
 /c
 /d
 /e
 /f
 /g
 /h
 /i
 /j
 /k
 /l
 /m
 /n
 /o
 /p
 /q
 /r
 /s
 /t
 /u
 /v
 /w
 /x
 /y
 /z
 /braceleft
 /bar
 /braceright
 /asciitilde
 /.notdef
 /.notdef
 /.notdef
 /.notdef
 /.notdef
 /.notdef
 /.notdef
 /.notdef
 /.notdef
 /.notdef
 /.notdef
 /.notdef
 /.notdef
 /.notdef
 /.notdef
 /.notdef
 /.notdef
 /.notdef
 /.notdef
 /.notdef
 /.notdef
 /.notdef
 /.notdef
 /.notdef
 /.notdef
 /.notdef
 /.notdef
 /.notdef
 /.notdef
 /.notdef
 /.notdef
 /.notdef
 /.notdef
 /space
 /exclamdown
 /cent
 /sterling
 /currency
 /yen
 /brokenbar
 /section
 /dieresis
 /copyright
 /ordfeminine
 /guillemotleft
 /logicalnot
 /hyphen
 /registered
 /macron
 /degree
 /plusminus
 /twosuperior
 /threesuperior
 /acute
 /mu
 /paragraph
 /periodcentered
 /cedilla
 /onesuperior
 /ordmasculine
 /guillemotright
 /onequarter
 /onehalf
 /threequarters
 /questiondown
 /Agrave
 /Aacute
 /Acircumflex
 /Atilde
 /Adieresis
 /Aring
 /AE
 /Ccedilla
 /Egrave
 /Eacute
 /Ecircumflex
 /Edieresis
 /Igrave
 /Iacute
 /Icircumflex
 /Idieresis
 /Eth
 /Ntilde
 /Ograve
 /Oacute
 /Ocircumflex
 /Otilde
 /Odieresis
 /multiply
 /Oslash
 /Ugrave
 /Uacute
 /Ucircumflex
 /Udieresis
 /Yacute
 /Thorn
 /germandbls
 /agrave
 /aacute
 /acircumflex
 /atilde
 /adieresis
 /aring
 /ae
 /ccedilla
 /egrave
 /eacute
 /ecircumflex
 /edieresis
 /igrave
 /iacute
 /icircumflex
 /idieresis
 /eth
 /ntilde
 /ograve
 /oacute
 /ocircumflex
 /otilde
 /odieresis
 /divide
 /oslash
 /ugrave
 /uacute
 /ucircumflex
 /udieresis
 /yacute
 /thorn
 /ydieresis
] def
%%EndProlog
%%BeginSetup
%%EndSetup
612.00 612.00 scale
[/DeviceRGB] SCS
Color2 SC
[] 0 SD
0.0045 SLW
0 SLC
0 SLJ
n
0.5508 0.1499 m
0.5516 0.1718 l
0.5531 0.2110 l
0.5547 0.2421 l
0.5563 0.2613 l
0.5578 0.2650 l
0.5594 0.2681 l
0.5610 0.2709 l
0.5625 0.2734 l
0.5641 0.2756 l
0.5657 0.2777 l
0.5673 0.2796 l
0.5688 0.2813 l
0.5704 0.2829 l
0.5720 0.2844 l
0.5735 0.2859 l
0.5751 0.2872 l
0.5767 0.2885 l
0.5782 0.2897 l
0.5798 0.2908 l
0.5814 0.2919 l
0.5829 0.2929 l
0.5845 0.2939 l
0.5861 0.2948 l
0.5876 0.2957 l
0.5892 0.2966 l
0.5908 0.2974 l
0.5924 0.2982 l
0.5939 0.2990 l
0.5955 0.2998 l
0.5971 0.3005 l
0.5986 0.3012 l
0.6002 0.3018 l
0.6018 0.3025 l
0.6033 0.3031 l
0.6049 0.3037 l
0.6065 0.3043 l
0.6080 0.3049 l
0.6096 0.3055 l
0.6112 0.3060 l
0.6127 0.3065 l
0.6143 0.3070 l
0.6159 0.3075 l
0.6175 0.3080 l
0.6190 0.3085 l
0.6206 0.3090 l
0.6222 0.3094 l
0.6237 0.3099 l
0.6253 0.3103 l
0.6269 0.3107 l
0.6284 0.3111 l
0.6300 0.3115 l
0.6316 0.3119 l
0.6331 0.3123 l
0.6347 0.3127 l
0.6363 0.3130 l
0.6378 0.3134 l
0.6394 0.3137 l
0.6410 0.3141 l
0.6425 0.3144 l
0.6441 0.3147 l
0.6457 0.3151 l
0.6473 0.3154 l
0.6488 0.3157 l
0.6504 0.3160 l
0.6520 0.3163 l
0.6535 0.3166 l
0.6551 0.3169 l
0.6567 0.3171 l
0.6582 0.3174 l
0.6598 0.3177 l
0.6614 0.3180 l
0.6629 0.3182 l
0.6645 0.3185 l
0.6661 0.3187 l
0.6676 0.3190 l
0.6692 0.3192 l
0.6708 0.3195 l
0.6724 0.3197 l
0.6739 0.3199 l
0.6755 0.3202 l
0.6771 0.3204 l
0.6786 0.3206 l
0.6802 0.3208 l
0.6818 0.3210 l
0.6833 0.3213 l
0.6849 0.3215 l
0.6865 0.3217 l
0.6880 0.3219 l
0.6896 0.3221 l
0.6912 0.3223 l
0.6927 0.3224 l
0.6943 0.3226 l
0.6959 0.3228 l
0.6975 0.3230 l
0.6990 0.3232 l
0.7006 0.3234 l
0.7022 0.3235 l
0.7037 0.3237 l
0.7053 0.3239 l
0.7069 0.3241 l
0.7084 0.3242 l
0.7100 0.3244 l
0.7116 0.3246 l
0.7131 0.3247 l
0.7147 0.3249 l
0.7163 0.3250 l
0.7178 0.3252 l
0.7194 0.3253 l
0.7210 0.3255 l
0.7225 0.3256 l
0.7241 0.3258 l
0.7257 0.3259 l
0.7273 0.3261 l
0.7288 0.3262 l
0.7304 0.3263 l
0.7320 0.3264 l
0.7335 0.3264 l
0.7351 0.3265 l
0.7367 0.3266 l
0.7382 0.3267 l
0.7398 0.3268 l
0.7414 0.3269 l
0.7429 0.3270 l
0.7445 0.3271 l
0.7461 0.3271 l
0.7476 0.3272 l
0.7492 0.3273 l
0.7508 0.3274 l
0.7524 0.3275 l
0.7539 0.3276 l
0.7555 0.3277 l
0.7571 0.3278 l
0.7586 0.3279 l
0.7602 0.3280 l
0.7618 0.3281 l
0.7633 0.3282 l
0.7649 0.3283 l
0.7665 0.3283 l
0.7680 0.3284 l
0.7696 0.3285 l
0.7712 0.3286 l
0.7727 0.3287 l
0.7743 0.3288 l
0.7759 0.3289 l
0.7775 0.3289 l
0.7790 0.3290 l
0.7806 0.3291 l
0.7822 0.3292 l
0.7837 0.3293 l
0.7853 0.3294 l
0.7869 0.3294 l
0.7884 0.3295 l
0.7900 0.3296 l
0.7916 0.3297 l
0.7931 0.3297 l
0.7947 0.3298 l
0.7963 0.3299 l
0.7978 0.3300 l
0.7994 0.3300 l
0.8010 0.3301 l
0.8025 0.3302 l
0.8041 0.3303 l
0.8057 0.3303 l
0.8073 0.3304 l
0.8088 0.3305 l
0.8104 0.3305 l
0.8120 0.3306 l
0.8135 0.3307 l
0.8151 0.3307 l
0.8167 0.3308 l
0.8182 0.3309 l
0.8198 0.3309 l
0.8214 0.3310 l
0.8229 0.3311 l
0.8245 0.3311 l
0.8261 0.3312 l
0.8276 0.3312 l
0.8292 0.3313 l
0.8308 0.3314 l
0.8324 0.3314 l
0.8339 0.3315 l
0.8355 0.3315 l
0.8371 0.3316 l
0.8386 0.3316 l
0.8402 0.3317 l
0.8418 0.3318 l
0.8433 0.3318 l
0.8449 0.3319 l
0.8465 0.3319 l
0.8480 0.3320 l
0.8496 0.3320 l
0.8512 0.3321 l
0.8527 0.3321 l
0.8543 0.3322 l
0.8559 0.3322 l
0.8575 0.3323 l
0.8590 0.3323 l
0.8606 0.3324 l
0.8622 0.3324 l
0.8637 0.3325 l
0.8653 0.3325 l
0.8669 0.3325 l
0.8684 0.3326 l
0.8700 0.3326 l
0.8716 0.3327 l
0.8731 0.3327 l
0.8747 0.3328 l
0.8763 0.3328 l
0.8778 0.3329 l
0.8794 0.3329 l
0.8810 0.3329 l
0.8825 0.3330 l
0.8841 0.3330 l
0.8857 0.3331 l
0.8873 0.3331 l
0.8888 0.3331 l
0.8904 0.3332 l
0.8920 0.3332 l
0.8935 0.3333 l
0.8951 0.3333 l
0.8967 0.3333 l
0.8982 0.3334 l
0.8998 0.3334 l
0.9014 0.3335 l
0.9029 0.3335 l
0.9045 0.3335 l
0.9061 0.3336 l
0.9076 0.3336 l
0.9092 0.3336 l
0.9108 0.3337 l
0.9124 0.3337 l
0.9139 0.3337 l
0.9155 0.3337 l
0.9171 0.3338 l
0.9186 0.3338 l
0.9202 0.3338 l
0.9218 0.3339 l
0.9233 0.3339 l
0.9249 0.3339 l
0.9265 0.3340 l
0.9280 0.3340 l
0.9296 0.3340 l
0.9312 0.3340 l
0.9327 0.3341 l
0.9343 0.3341 l
0.9359 0.3341 l
0.9375 0.3342 l
0.9390 0.3339 l
0.9406 0.3335 l
0.9422 0.3332 l
0.9437 0.3329 l
0.9453 0.3326 l
0.9469 0.3324 l
0.9484 0.3323 l
0.9500 0.3321 l
s
[/DeviceRGB] SCS
Color3 SC
n
0.1500 0.8798 m
0.1516 0.8797 l
0.1531 0.8797 l
0.1547 0.8796 l
0.1563 0.8796 l
0.1578 0.8796 l
0.1594 0.8795 l
0.1610 0.8795 l
0.1625 0.8795 l
0.1641 0.8794 l
0.1657 0.8794 l
0.1673 0.8794 l
0.1688 0.8794 l
0.1704 0.8793 l
0.1720 0.8793 l
0.1735 0.8793 l
0.1751 0.8792 l
0.1767 0.8792 l
0.1782 0.8792 l
0.1798 0.8791 l
0.1814 0.8791 l
0.1829 0.8791 l
0.1845 0.8791 l
0.1861 0.8790 l
0.1876 0.8790 l
0.1892 0.8790 l
0.1908 0.8789 l
0.1924 0.8789 l
0.1939 0.8789 l
0.1955 0.8789 l
0.1971 0.8788 l
0.1986 0.8788 l
0.2002 0.8788 l
0.2018 0.8788 l
0.2033 0.8787 l
0.2049 0.8787 l
0.2065 0.8787 l
0.2080 0.8787 l
0.2096 0.8786 l
0.2112 0.8786 l
0.2127 0.8786 l
0.2143 0.8786 l
0.2159 0.8785 l
0.2175 0.8785 l
0.2190 0.8785 l
0.2206 0.8785 l
0.2222 0.8784 l
0.2237 0.8784 l
0.2253 0.8784 l
0.2269 0.8784 l
0.2284 0.8783 l
0.2300 0.8783 l
0.2316 0.8783 l
0.2331 0.8783 l
0.2347 0.8783 l
0.2363 0.8782 l
0.2378 0.8782 l
0.2394 0.8782 l
0.2410 0.8782 l
0.2425 0.8781 l
0.2441 0.8781 l
0.2457 0.8781 l
0.2473 0.8781 l
0.2488 0.8781 l
0.2504 0.8780 l
0.2520 0.8780 l
0.2535 0.8780 l
0.2551 0.8780 l
0.2567 0.8780 l
0.2582 0.8779 l
0.2598 0.8779 l
0.2614 0.8779 l
0.2629 0.8779 l
0.2645 0.8779 l
0.2661 0.8778 l
0.2676 0.8778 l
0.2692 0.8778 l
0.2708 0.8778 l
0.2724 0.8778 l
0.2739 0.8777 l
0.2755 0.8777 l
0.2771 0.8777 l
0.2786 0.8777 l
0.2802 0.8777 l
0.2818 0.8777 l
0.2833 0.8776 l
0.2849 0.8776 l
0.2865 0.8776 l
0.2880 0.8776 l
0.2896 0.8776 l
0.2912 0.8775 l
0.2927 0.8775 l
0.2943 0.8775 l
0.2959 0.8775 l
0.2975 0.8775 l
0.2990 0.8774 l
0.3006 0.8774 l
0.3022 0.8774 l
0.3037 0.8774 l
0.3053 0.8774 l
0.3069 0.8773 l
0.3084 0.8773 l
0.3100 0.8773 l
0.3116 0.8773 l
0.3131 0.8773 l
0.3147 0.8773 l
0.3163 0.8772 l
0.3178 0.8772 l
0.3194 0.8772 l
0.3210 0.8772 l
0.3225 0.8772 l
0.3241 0.8772 l
0.3257 0.8771 l
0.3273 0.8771 l
0.3288 0.8771 l
0.3304 0.8771 l
0.3320 0.8771 l
0.3335 0.8770 l
0.3351 0.8770 l
0.3367 0.8770 l
0.3382 0.8770 l
0.3398 0.8770 l
0.3414 0.8770 l
0.3429 0.8770 l
0.3445 0.8769 l
0.3461 0.8769 l
0.3476 0.8769 l
0.3492 0.8769 l
0.3508 0.8769 l
0.3524 0.8769 l
0.3539 0.8768 l
0.3555 0.8768 l
0.3571 0.8768 l
0.3586 0.8768 l
0.3602 0.8768 l
0.3618 0.8768 l
0.3633 0.8767 l
0.3649 0.8767 l
0.3665 0.8767 l
0.3680 0.8767 l
0.3696 0.8767 l
0.3712 0.8767 l
0.3727 0.8767 l
0.3743 0.8766 l
0.3759 0.8766 l
0.3775 0.8766 l
0.3790 0.8766 l
0.3806 0.8766 l
0.3822 0.8766 l
0.3837 0.8766 l
0.3853 0.8765 l
0.3869 0.8765 l
0.3884 0.8765 l
0.3900 0.8765 l
0.3916 0.8765 l
0.3931 0.8765 l
0.3947 0.8765 l
0.3963 0.8764 l
0.3978 0.8764 l
0.3994 0.8764 l
0.4010 0.8764 l
0.4025 0.8764 l
0.4041 0.8764 l
0.4057 0.8764 l
0.4073 0.8763 l
0.4088 0.8763 l
0.4104 0.8763 l
0.4120 0.8763 l
0.4135 0.8763 l
0.4151 0.8763 l
0.4167 0.8763 l
0.4182 0.8763 l
0.4198 0.8762 l
0.4214 0.8762 l
0.4229 0.8762 l
0.4245 0.8762 l
0.4261 0.8762 l
0.4276 0.8762 l
0.4292 0.8762 l
0.4308 0.8761 l
0.4324 0.8761 l
0.4339 0.8761 l
0.4355 0.8761 l
0.4371 0.8761 l
0.4386 0.8761 l
0.4402 0.8761 l
0.4418 0.8761 l
0.4433 0.8760 l
0.4449 0.8760 l
0.4465 0.8760 l
0.4480 0.8760 l
0.4496 0.8760 l
0.4512 0.8760 l
0.4527 0.8760 l
0.4543 0.8760 l
0.4559 0.8759 l
0.4575 0.8759 l
0.4590 0.8759 l
0.4606 0.8759 l
0.4622 0.8759 l
0.4637 0.8759 l
0.4653 0.8759 l
0.4669 0.8759 l
0.4684 0.8759 l
0.4700 0.8758 l
0.4716 0.8758 l
0.4731 0.8758 l
0.4747 0.8758 l
0.4763 0.8758 l
0.4778 0.8758 l
0.4794 0.8758 l
0.4810 0.8758 l
0.4825 0.8758 l
0.4841 0.8757 l
0.4857 0.8757 l
0.4873 0.8757 l
0.4888 0.8757 l
0.4904 0.8757 l
0.4920 0.8757 l
0.4935 0.8757 l
0.4951 0.8757 l
0.4967 0.8756 l
0.4982 0.8756 l
0.4998 0.8756 l
0.5014 0.8756 l
0.5029 0.8756 l
0.5045 0.8756 l
0.5061 0.8756 l
0.5076 0.8756 l
0.5092 0.8756 l
0.5108 0.8756 l
0.5124 0.8755 l
0.5139 0.8755 l
0.5155 0.8755 l
0.5171 0.8755 l
0.5186 0.8755 l
0.5202 0.8755 l
0.5218 0.8755 l
0.5233 0.8754 l
0.5249 0.8754 l
0.5265 0.8754 l
0.5280 0.8754 l
0.5296 0.8754 l
0.5312 0.8754 l
0.5327 0.8753 l
0.5343 0.8753 l
0.5359 0.8753 l
0.5375 0.8753 l
0.5390 0.8753 l
0.5406 0.8753 l
0.5422 0.8753 l
0.5437 0.8753 l
0.5453 0.8752 l
0.5469 0.8752 l
0.5484 0.8752 l
0.5502 0.8752 l
0.5516 0.8752 l
0.5531 0.8752 l
0.5547 0.8751 l
0.5563 0.8751 l
0.5578 0.8751 l
0.5594 0.8751 l
0.5610 0.8751 l
0.5625 0.8751 l
0.5641 0.8751 l
0.5657 0.8750 l
0.5673 0.8750 l
0.5688 0.8750 l
0.5704 0.8750 l
0.5720 0.8750 l
0.5735 0.8750 l
0.5751 0.8750 l
0.5767 0.8750 l
0.5782 0.8749 l
0.5798 0.8749 l
0.5814 0.8749 l
0.5829 0.8749 l
0.5845 0.8749 l
0.5861 0.8749 l
0.5876 0.8749 l
0.5892 0.8749 l
0.5908 0.8749 l
0.5924 0.8748 l
0.5939 0.8748 l
0.5955 0.8748 l
0.5971 0.8748 l
0.5986 0.8748 l
0.6002 0.8748 l
0.6018 0.8748 l
0.6033 0.8748 l
0.6049 0.8748 l
0.6065 0.8747 l
0.6080 0.8747 l
0.6096 0.8747 l
0.6112 0.8747 l
0.6127 0.8747 l
0.6143 0.8747 l
0.6159 0.8747 l
0.6175 0.8747 l
0.6190 0.8747 l
0.6206 0.8747 l
0.6222 0.8746 l
0.6237 0.8746 l
0.6253 0.8746 l
0.6269 0.8746 l
0.6284 0.8746 l
0.6300 0.8746 l
0.6316 0.8746 l
0.6331 0.8746 l
0.6347 0.8746 l
0.6363 0.8746 l
0.6378 0.8745 l
0.6394 0.8745 l
0.6410 0.8745 l
0.6425 0.8745 l
0.6441 0.8745 l
0.6457 0.8745 l
0.6473 0.8745 l
0.6488 0.8745 l
0.6504 0.8745 l
0.6520 0.8745 l
0.6535 0.8745 l
0.6551 0.8744 l
0.6567 0.8744 l
0.6582 0.8744 l
0.6598 0.8744 l
0.6614 0.8744 l
0.6629 0.8744 l
0.6645 0.8744 l
0.6661 0.8744 l
0.6676 0.8744 l
0.6692 0.8744 l
0.6708 0.8743 l
0.6724 0.8743 l
0.6739 0.8743 l
0.6755 0.8743 l
0.6771 0.8743 l
0.6786 0.8743 l
0.6802 0.8743 l
0.6818 0.8743 l
0.6833 0.8743 l
0.6849 0.8743 l
0.6865 0.8743 l
0.6880 0.8743 l
0.6896 0.8742 l
0.6912 0.8742 l
0.6927 0.8742 l
0.6943 0.8742 l
0.6959 0.8742 l
0.6975 0.8742 l
0.6990 0.8742 l
0.7006 0.8742 l
0.7022 0.8742 l
0.7037 0.8742 l
0.7053 0.8742 l
0.7069 0.8741 l
0.7084 0.8741 l
0.7100 0.8741 l
0.7116 0.8741 l
0.7131 0.8741 l
0.7147 0.8741 l
0.7163 0.8741 l
0.7178 0.8741 l
0.7194 0.8741 l
0.7210 0.8741 l
0.7225 0.8741 l
0.7241 0.8741 l
0.7257 0.8740 l
0.7273 0.8740 l
0.7288 0.8740 l
0.7304 0.8740 l
0.7320 0.8740 l
0.7335 0.8738 l
0.7351 0.8738 l
0.7367 0.8737 l
0.7382 0.8737 l
0.7398 0.8736 l
0.7414 0.8736 l
0.7429 0.8735 l
0.7445 0.8735 l
0.7461 0.8735 l
0.7476 0.8734 l
0.7492 0.8734 l
0.7508 0.8734 l
0.7524 0.8733 l
0.7539 0.8733 l
0.7555 0.8733 l
0.7571 0.8733 l
0.7586 0.8732 l
0.7602 0.8732 l
0.7618 0.8732 l
0.7633 0.8732 l
0.7649 0.8731 l
0.7665 0.8731 l
0.7680 0.8731 l
0.7696 0.8731 l
0.7712 0.8730 l
0.7727 0.8730 l
0.7743 0.8730 l
0.7759 0.8730 l
0.7775 0.8729 l
0.7790 0.8729 l
0.7806 0.8729 l
0.7822 0.8729 l
0.7837 0.8729 l
0.7853 0.8728 l
0.7869 0.8728 l
0.7884 0.8728 l
0.7900 0.8728 l
0.7916 0.8728 l
0.7931 0.8727 l
0.7947 0.8727 l
0.7963 0.8727 l
0.7978 0.8727 l
0.7994 0.8727 l
0.8010 0.8727 l
0.8025 0.8726 l
0.8041 0.8726 l
0.8057 0.8726 l
0.8073 0.8726 l
0.8088 0.8726 l
0.8104 0.8725 l
0.8120 0.8725 l
0.8135 0.8725 l
0.8151 0.8725 l
0.8167 0.8725 l
0.8182 0.8725 l
0.8198 0.8724 l
0.8214 0.8724 l
0.8229 0.8724 l
0.8245 0.8724 l
0.8261 0.8724 l
0.8276 0.8724 l
0.8292 0.8723 l
0.8308 0.8723 l
0.8324 0.8723 l
0.8339 0.8723 l
0.8355 0.8723 l
0.8371 0.8723 l
0.8386 0.8722 l
0.8402 0.8722 l
0.8418 0.8722 l
0.8433 0.8722 l
0.8449 0.8722 l
0.8465 0.8722 l
0.8480 0.8721 l
0.8496 0.8721 l
0.8512 0.8721 l
0.8527 0.8721 l
0.8543 0.8721 l
0.8559 0.8720 l
0.8575 0.8720 l
0.8590 0.8720 l
0.8606 0.8720 l
0.8622 0.8720 l
0.8637 0.8720 l
0.8653 0.8719 l
0.8669 0.8719 l
0.8684 0.8719 l
0.8700 0.8719 l
0.8716 0.8719 l
0.8731 0.8719 l
0.8747 0.8718 l
0.8763 0.8718 l
0.8778 0.8718 l
0.8794 0.8718 l
0.8810 0.8718 l
0.8825 0.8718 l
0.8841 0.8717 l
0.8857 0.8717 l
0.8873 0.8717 l
0.8888 0.8717 l
0.8904 0.8717 l
0.8920 0.8717 l
0.8935 0.8716 l
0.8951 0.8716 l
0.8967 0.8716 l
0.8982 0.8716 l
0.8998 0.8716 l
0.9014 0.8716 l
0.9029 0.8715 l
0.9045 0.8715 l
0.9061 0.8715 l
0.9076 0.8715 l
0.9092 0.8715 l
0.9108 0.8715 l
0.9124 0.8714 l
0.9139 0.8714 l
0.9155 0.8714 l
0.9171 0.8714 l
0.9186 0.8714 l
0.9202 0.8713 l
0.9218 0.8713 l
0.9233 0.8713 l
0.9249 0.8713 l
0.9265 0.8713 l
0.9280 0.8712 l
0.9296 0.8712 l
0.9312 0.8712 l
0.9327 0.8712 l
0.9343 0.8712 l
0.9359 0.8711 l
0.9375 0.8711 l
0.9390 0.8709 l
0.9406 0.8704 l
0.9422 0.8701 l
0.9437 0.8697 l
0.9453 0.8694 l
0.9469 0.8691 l
0.9484 0.8689 l
0.9500 0.8687 l
s
[/DeviceRGB] SCS
Color4 SC
n
0.1500 0.7744 m
0.1516 0.7746 l
0.1531 0.7747 l
0.1547 0.7749 l
0.1563 0.7750 l
0.1578 0.7752 l
0.1594 0.7753 l
0.1610 0.7754 l
0.1625 0.7756 l
0.1641 0.7757 l
0.1657 0.7758 l
0.1673 0.7760 l
0.1688 0.7761 l
0.1704 0.7762 l
0.1720 0.7764 l
0.1735 0.7765 l
0.1751 0.7766 l
0.1767 0.7767 l
0.1782 0.7768 l
0.1798 0.7770 l
0.1814 0.7771 l
0.1829 0.7772 l
0.1845 0.7773 l
0.1861 0.7774 l
0.1876 0.7775 l
0.1892 0.7776 l
0.1908 0.7778 l
0.1924 0.7779 l
0.1939 0.7780 l
0.1955 0.7781 l
0.1971 0.7782 l
0.1986 0.7783 l
0.2002 0.7784 l
0.2018 0.7785 l
0.2033 0.7786 l
0.2049 0.7787 l
0.2065 0.7788 l
0.2080 0.7789 l
0.2096 0.7790 l
0.2112 0.7791 l
0.2127 0.7792 l
0.2143 0.7793 l
0.2159 0.7794 l
0.2175 0.7794 l
0.2190 0.7795 l
0.2206 0.7796 l
0.2222 0.7797 l
0.2237 0.7798 l
0.2253 0.7799 l
0.2269 0.7800 l
0.2284 0.7801 l
0.2300 0.7801 l
0.2316 0.7802 l
0.2331 0.7803 l
0.2347 0.7804 l
0.2363 0.7805 l
0.2378 0.7805 l
0.2394 0.7806 l
0.2410 0.7807 l
0.2425 0.7808 l
0.2441 0.7809 l
0.2457 0.7809 l
0.2473 0.7810 l
0.2488 0.7811 l
0.2504 0.7812 l
0.2520 0.7812 l
0.2535 0.7813 l
0.2551 0.7814 l
0.2567 0.7815 l
0.2582 0.7815 l
0.2598 0.7816 l
0.2614 0.7817 l
0.2629 0.7817 l
0.2645 0.7818 l
0.2661 0.7819 l
0.2676 0.7820 l
0.2692 0.7820 l
0.2708 0.7821 l
0.2724 0.7822 l
0.2739 0.7822 l
0.2755 0.7823 l
0.2771 0.7824 l
0.2786 0.7824 l
0.2802 0.7825 l
0.2818 0.7826 l
0.2833 0.7826 l
0.2849 0.7827 l
0.2865 0.7828 l
0.2880 0.7828 l
0.2896 0.7829 l
0.2912 0.7830 l
0.2927 0.7830 l
0.2943 0.7831 l
0.2959 0.7832 l
0.2975 0.7832 l
0.2990 0.7833 l
0.3006 0.7834 l
0.3022 0.7834 l
0.3037 0.7835 l
0.3053 0.7835 l
0.3069 0.7836 l
0.3084 0.7837 l
0.3100 0.7837 l
0.3116 0.7838 l
0.3131 0.7838 l
0.3147 0.7839 l
0.3163 0.7840 l
0.3178 0.7840 l
0.3194 0.7841 l
0.3210 0.7841 l
0.3225 0.7842 l
0.3241 0.7843 l
0.3257 0.7843 l
0.3273 0.7844 l
0.3288 0.7844 l
0.3304 0.7845 l
0.3320 0.7845 l
0.3335 0.7846 l
0.3351 0.7847 l
0.3367 0.7847 l
0.3382 0.7848 l
0.3398 0.7848 l
0.3414 0.7849 l
0.3429 0.7849 l
0.3445 0.7850 l
0.3461 0.7850 l
0.3476 0.7851 l
0.3492 0.7851 l
0.3508 0.7852 l
0.3524 0.7852 l
0.3539 0.7853 l
0.3555 0.7853 l
0.3571 0.7854 l
0.3586 0.7854 l
0.3602 0.7855 l
0.3618 0.7855 l
0.3633 0.7856 l
0.3649 0.7856 l
0.3665 0.7857 l
0.3680 0.7857 l
0.3696 0.7858 l
0.3712 0.7858 l
0.3727 0.7859 l
0.3743 0.7859 l
0.3759 0.7860 l
0.3775 0.7860 l
0.3790 0.7861 l
0.3806 0.7861 l
0.3822 0.7862 l
0.3837 0.7862 l
0.3853 0.7863 l
0.3869 0.7863 l
0.3884 0.7863 l
0.3900 0.7864 l
0.3916 0.7864 l
0.3931 0.7865 l
0.3947 0.7865 l
0.3963 0.7866 l
0.3978 0.7866 l
0.3994 0.7867 l
0.4010 0.7867 l
0.4025 0.7867 l
0.4041 0.7868 l
0.4057 0.7868 l
0.4073 0.7869 l
0.4088 0.7869 l
0.4104 0.7870 l
0.4120 0.7870 l
0.4135 0.7870 l
0.4151 0.7871 l
0.4167 0.7871 l
0.4182 0.7872 l
0.4198 0.7872 l
0.4214 0.7873 l
0.4229 0.7873 l
0.4245 0.7873 l
0.4261 0.7874 l
0.4276 0.7874 l
0.4292 0.7875 l
0.4308 0.7875 l
0.4324 0.7875 l
0.4339 0.7876 l
0.4355 0.7876 l
0.4371 0.7877 l
0.4386 0.7877 l
0.4402 0.7877 l
0.4418 0.7878 l
0.4433 0.7878 l
0.4449 0.7878 l
0.4465 0.7879 l
0.4480 0.7879 l
0.4496 0.7880 l
0.4512 0.7880 l
0.4527 0.7880 l
0.4543 0.7881 l
0.4559 0.7881 l
0.4575 0.7881 l
0.4590 0.7882 l
0.4606 0.7882 l
0.4622 0.7883 l
0.4637 0.7883 l
0.4653 0.7883 l
0.4669 0.7884 l
0.4684 0.7884 l
0.4700 0.7884 l
0.4716 0.7885 l
0.4731 0.7885 l
0.4747 0.7885 l
0.4763 0.7886 l
0.4778 0.7886 l
0.4794 0.7886 l
0.4810 0.7887 l
0.4825 0.7887 l
0.4841 0.7887 l
0.4857 0.7888 l
0.4873 0.7888 l
0.4888 0.7889 l
0.4904 0.7889 l
0.4920 0.7889 l
0.4935 0.7890 l
0.4951 0.7890 l
0.4967 0.7890 l
0.4982 0.7891 l
0.4998 0.7891 l
0.5014 0.7891 l
0.5029 0.7891 l
0.5045 0.7892 l
0.5061 0.7892 l
0.5076 0.7892 l
0.5092 0.7893 l
0.5108 0.7893 l
0.5124 0.7893 l
0.5139 0.7894 l
0.5155 0.7894 l
0.5171 0.7894 l
0.5186 0.7895 l
0.5202 0.7895 l
0.5218 0.7895 l
0.5233 0.7895 l
0.5249 0.7896 l
0.5265 0.7896 l
0.5280 0.7896 l
0.5296 0.7896 l
0.5312 0.7897 l
0.5327 0.7897 l
0.5343 0.7897 l
0.5359 0.7897 l
0.5375 0.7898 l
0.5390 0.7898 l
0.5406 0.7898 l
0.5422 0.7898 l
0.5437 0.7899 l
0.5453 0.7899 l
0.5469 0.7899 l
0.5484 0.7900 l
0.5502 0.7900 l
0.5516 0.7900 l
0.5531 0.7900 l
0.5547 0.7900 l
0.5563 0.7901 l
0.5578 0.7901 l
0.5594 0.7901 l
0.5610 0.7901 l
0.5625 0.7902 l
0.5641 0.7902 l
0.5657 0.7902 l
0.5673 0.7902 l
0.5688 0.7903 l
0.5704 0.7903 l
0.5720 0.7903 l
0.5735 0.7903 l
0.5751 0.7904 l
0.5767 0.7904 l
0.5782 0.7904 l
0.5798 0.7904 l
0.5814 0.7905 l
0.5829 0.7905 l
0.5845 0.7905 l
0.5861 0.7905 l
0.5876 0.7906 l
0.5892 0.7906 l
0.5908 0.7906 l
0.5924 0.7906 l
0.5939 0.7907 l
0.5955 0.7907 l
0.5971 0.7907 l
0.5986 0.7907 l
0.6002 0.7908 l
0.6018 0.7908 l
0.6033 0.7908 l
0.6049 0.7908 l
0.6065 0.7909 l
0.6080 0.7909 l
0.6096 0.7909 l
0.6112 0.7909 l
0.6127 0.7910 l
0.6143 0.7910 l
0.6159 0.7910 l
0.6175 0.7910 l
0.6190 0.7910 l
0.6206 0.7911 l
0.6222 0.7911 l
0.6237 0.7911 l
0.6253 0.7911 l
0.6269 0.7912 l
0.6284 0.7912 l
0.6300 0.7912 l
0.6316 0.7912 l
0.6331 0.7913 l
0.6347 0.7913 l
0.6363 0.7913 l
0.6378 0.7913 l
0.6394 0.7914 l
0.6410 0.7914 l
0.6425 0.7914 l
0.6441 0.7914 l
0.6457 0.7914 l
0.6473 0.7915 l
0.6488 0.7915 l
0.6504 0.7915 l
0.6520 0.7915 l
0.6535 0.7916 l
0.6551 0.7916 l
0.6567 0.7916 l
0.6582 0.7916 l
0.6598 0.7916 l
0.6614 0.7917 l
0.6629 0.7917 l
0.6645 0.7917 l
0.6661 0.7917 l
0.6676 0.7918 l
0.6692 0.7918 l
0.6708 0.7918 l
0.6724 0.7918 l
0.6739 0.7918 l
0.6755 0.7919 l
0.6771 0.7919 l
0.6786 0.7919 l
0.6802 0.7919 l
0.6818 0.7920 l
0.6833 0.7920 l
0.6849 0.7920 l
0.6865 0.7920 l
0.6880 0.7920 l
0.6896 0.7921 l
0.6912 0.7921 l
0.6927 0.7921 l
0.6943 0.7921 l
0.6959 0.7922 l
0.6975 0.7922 l
0.6990 0.7922 l
0.7006 0.7922 l
0.7022 0.7922 l
0.7037 0.7923 l
0.7053 0.7923 l
0.7069 0.7923 l
0.7084 0.7923 l
0.7100 0.7923 l
0.7116 0.7924 l
0.7131 0.7924 l
0.7147 0.7924 l
0.7163 0.7924 l
0.7178 0.7924 l
0.7194 0.7925 l
0.7210 0.7925 l
0.7225 0.7925 l
0.7241 0.7925 l
0.7257 0.7925 l
0.7273 0.7926 l
0.7288 0.7926 l
0.7304 0.7926 l
0.7320 0.7926 l
0.7335 0.7925 l
0.7351 0.7924 l
0.7367 0.7924 l
0.7382 0.7924 l
0.7398 0.7924 l
0.7414 0.7924 l
0.7429 0.7923 l
0.7445 0.7923 l
0.7461 0.7923 l
0.7476 0.7923 l
0.7492 0.7923 l
0.7508 0.7923 l
0.7524 0.7923 l
0.7539 0.7923 l
0.7555 0.7923 l
0.7571 0.7923 l
0.7586 0.7923 l
0.7602 0.7923 l
0.7618 0.7923 l
0.7633 0.7923 l
0.7649 0.7923 l
0.7665 0.7923 l
0.7680 0.7923 l
0.7696 0.7923 l
0.7712 0.7923 l
0.7727 0.7923 l
0.7743 0.7923 l
0.7759 0.7924 l
0.7775 0.7924 l
0.7790 0.7924 l
0.7806 0.7924 l
0.7822 0.7924 l
0.7837 0.7924 l
0.7853 0.7924 l
0.7869 0.7924 l
0.7884 0.7924 l
0.7900 0.7924 l
0.7916 0.7924 l
0.7931 0.7924 l
0.7947 0.7924 l
0.7963 0.7924 l
0.7978 0.7924 l
0.7994 0.7924 l
0.8010 0.7925 l
0.8025 0.7925 l
0.8041 0.7925 l
0.8057 0.7925 l
0.8073 0.7925 l
0.8088 0.7925 l
0.8104 0.7925 l
0.8120 0.7925 l
0.8135 0.7925 l
0.8151 0.7925 l
0.8167 0.7925 l
0.8182 0.7925 l
0.8198 0.7926 l
0.8214 0.7926 l
0.8229 0.7926 l
0.8245 0.7926 l
0.8261 0.7926 l
0.8276 0.7926 l
0.8292 0.7926 l
0.8308 0.7926 l
0.8324 0.7926 l
0.8339 0.7926 l
0.8355 0.7926 l
0.8371 0.7926 l
0.8386 0.7926 l
0.8402 0.7927 l
0.8418 0.7927 l
0.8433 0.7927 l
0.8449 0.7927 l
0.8465 0.7927 l
0.8480 0.7927 l
0.8496 0.7927 l
0.8512 0.7927 l
0.8527 0.7927 l
0.8543 0.7927 l
0.8559 0.7927 l
0.8575 0.7927 l
0.8590 0.7927 l
0.8606 0.7927 l
0.8622 0.7928 l
0.8637 0.7928 l
0.8653 0.7928 l
0.8669 0.7928 l
0.8684 0.7928 l
0.8700 0.7928 l
0.8716 0.7928 l
0.8731 0.7928 l
0.8747 0.7928 l
0.8763 0.7928 l
0.8778 0.7928 l
0.8794 0.7928 l
0.8810 0.7928 l
0.8825 0.7928 l
0.8841 0.7929 l
0.8857 0.7929 l
0.8873 0.7929 l
0.8888 0.7929 l
0.8904 0.7929 l
0.8920 0.7929 l
0.8935 0.7929 l
0.8951 0.7929 l
0.8967 0.7929 l
0.8982 0.7929 l
0.8998 0.7929 l
0.9014 0.7929 l
0.9029 0.7929 l
0.9045 0.7929 l
0.9061 0.7929 l
0.9076 0.7930 l
0.9092 0.7930 l
0.9108 0.7930 l
0.9124 0.7930 l
0.9139 0.7930 l
0.9155 0.7930 l
0.9171 0.7930 l
0.9186 0.7930 l
0.9202 0.7930 l
0.9218 0.7930 l
0.9233 0.7930 l
0.9249 0.7930 l
0.9265 0.7930 l
0.9280 0.7930 l
0.9296 0.7930 l
0.9312 0.7930 l
0.9327 0.7930 l
0.9343 0.7930 l
0.9359 0.7930 l
0.9375 0.7930 l
0.9390 0.7928 l
0.9406 0.7923 l
0.9422 0.7921 l
0.9437 0.7917 l
0.9453 0.7914 l
0.9469 0.7912 l
0.9484 0.7910 l
0.9500 0.7908 l
s
[/DeviceRGB] SCS
Color5 SC
n
0.1500 0.3188 m
0.1516 0.3189 l
0.1531 0.3191 l
0.1547 0.3192 l
0.1563 0.3194 l
0.1578 0.3195 l
0.1594 0.3196 l
0.1610 0.3198 l
0.1625 0.3199 l
0.1641 0.3200 l
0.1657 0.3202 l
0.1673 0.3203 l
0.1688 0.3204 l
0.1704 0.3206 l
0.1720 0.3207 l
0.1735 0.3208 l
0.1751 0.3209 l
0.1767 0.3210 l
0.1782 0.3212 l
0.1798 0.3213 l
0.1814 0.3214 l
0.1829 0.3215 l
0.1845 0.3216 l
0.1861 0.3217 l
0.1876 0.3219 l
0.1892 0.3220 l
0.1908 0.3221 l
0.1924 0.3222 l
0.1939 0.3223 l
0.1955 0.3224 l
0.1971 0.3225 l
0.1986 0.3226 l
0.2002 0.3227 l
0.2018 0.3228 l
0.2033 0.3229 l
0.2049 0.3230 l
0.2065 0.3231 l
0.2080 0.3232 l
0.2096 0.3233 l
0.2112 0.3234 l
0.2127 0.3235 l
0.2143 0.3236 l
0.2159 0.3237 l
0.2175 0.3237 l
0.2190 0.3238 l
0.2206 0.3239 l
0.2222 0.3240 l
0.2237 0.3241 l
0.2253 0.3242 l
0.2269 0.3243 l
0.2284 0.3244 l
0.2300 0.3244 l
0.2316 0.3245 l
0.2331 0.3246 l
0.2347 0.3247 l
0.2363 0.3248 l
0.2378 0.3249 l
0.2394 0.3249 l
0.2410 0.3250 l
0.2425 0.3251 l
0.2441 0.3252 l
0.2457 0.3252 l
0.2473 0.3253 l
0.2488 0.3254 l
0.2504 0.3255 l
0.2520 0.3255 l
0.2535 0.3256 l
0.2551 0.3257 l
0.2567 0.3258 l
0.2582 0.3258 l
0.2598 0.3259 l
0.2614 0.3260 l
0.2629 0.3260 l
0.2645 0.3261 l
0.2661 0.3262 l
0.2676 0.3263 l
0.2692 0.3263 l
0.2708 0.3264 l
0.2724 0.3265 l
0.2739 0.3265 l
0.2755 0.3266 l
0.2771 0.3267 l
0.2786 0.3267 l
0.2802 0.3268 l
0.2818 0.3269 l
0.2833 0.3269 l
0.2849 0.3270 l
0.2865 0.3271 l
0.2880 0.3271 l
0.2896 0.3272 l
0.2912 0.3273 l
0.2927 0.3273 l
0.2943 0.3274 l
0.2959 0.3275 l
0.2975 0.3275 l
0.2990 0.3276 l
0.3006 0.3276 l
0.3022 0.3277 l
0.3037 0.3278 l
0.3053 0.3278 l
0.3069 0.3279 l
0.3084 0.3280 l
0.3100 0.3280 l
0.3116 0.3281 l
0.3131 0.3281 l
0.3147 0.3282 l
0.3163 0.3283 l
0.3178 0.3283 l
0.3194 0.3284 l
0.3210 0.3284 l
0.3225 0.3285 l
0.3241 0.3286 l
0.3257 0.3286 l
0.3273 0.3287 l
0.3288 0.3287 l
0.3304 0.3288 l
0.3320 0.3288 l
0.3335 0.3289 l
0.3351 0.3290 l
0.3367 0.3290 l
0.3382 0.3291 l
0.3398 0.3291 l
0.3414 0.3292 l
0.3429 0.3292 l
0.3445 0.3293 l
0.3461 0.3293 l
0.3476 0.3294 l
0.3492 0.3294 l
0.3508 0.3295 l
0.3524 0.3295 l
0.3539 0.3296 l
0.3555 0.3296 l
0.3571 0.3297 l
0.3586 0.3297 l
0.3602 0.3298 l
0.3618 0.3298 l
0.3633 0.3299 l
0.3649 0.3299 l
0.3665 0.3300 l
0.3680 0.3300 l
0.3696 0.3301 l
0.3712 0.3301 l
0.3727 0.3302 l
0.3743 0.3302 l
0.3759 0.3303 l
0.3775 0.3303 l
0.3790 0.3304 l
0.3806 0.3304 l
0.3822 0.3305 l
0.3837 0.3305 l
0.3853 0.3306 l
0.3869 0.3306 l
0.3884 0.3307 l
0.3900 0.3307 l
0.3916 0.3307 l
0.3931 0.3308 l
0.3947 0.3308 l
0.3963 0.3309 l
0.3978 0.3309 l
0.3994 0.3310 l
0.4010 0.3310 l
0.4025 0.3311 l
0.4041 0.3311 l
0.4057 0.3311 l
0.4073 0.3312 l
0.4088 0.3312 l
0.4104 0.3313 l
0.4120 0.3313 l
0.4135 0.3314 l
0.4151 0.3314 l
0.4167 0.3314 l
0.4182 0.3315 l
0.4198 0.3315 l
0.4214 0.3316 l
0.4229 0.3316 l
0.4245 0.3316 l
0.4261 0.3317 l
0.4276 0.3317 l
0.4292 0.3318 l
0.4308 0.3318 l
0.4324 0.3318 l
0.4339 0.3319 l
0.4355 0.3319 l
0.4371 0.3320 l
0.4386 0.3320 l
0.4402 0.3320 l
0.4418 0.3321 l
0.4433 0.3321 l
0.4449 0.3322 l
0.4465 0.3322 l
0.4480 0.3322 l
0.4496 0.3323 l
0.4512 0.3323 l
0.4527 0.3323 l
0.4543 0.3324 l
0.4559 0.3324 l
0.4575 0.3325 l
0.4590 0.3325 l
0.4606 0.3325 l
0.4622 0.3326 l
0.4637 0.3326 l
0.4653 0.3326 l
0.4669 0.3327 l
0.4684 0.3327 l
0.4700 0.3327 l
0.4716 0.3328 l
0.4731 0.3328 l
0.4747 0.3329 l
0.4763 0.3329 l
0.4778 0.3329 l
0.4794 0.3330 l
0.4810 0.3330 l
0.4825 0.3330 l
0.4841 0.3331 l
0.4857 0.3331 l
0.4873 0.3331 l
0.4888 0.3332 l
0.4904 0.3332 l
0.4920 0.3332 l
0.4935 0.3333 l
0.4951 0.3333 l
0.4967 0.3333 l
0.4982 0.3334 l
0.4998 0.3334 l
0.5014 0.3334 l
0.5029 0.3335 l
0.5045 0.3335 l
0.5061 0.3335 l
0.5076 0.3336 l
0.5092 0.3336 l
0.5108 0.3336 l
0.5124 0.3337 l
0.5139 0.3337 l
0.5155 0.3337 l
0.5171 0.3338 l
0.5186 0.3338 l
0.5202 0.3338 l
0.5218 0.3338 l
0.5233 0.3339 l
0.5249 0.3339 l
0.5265 0.3339 l
0.5280 0.3339 l
0.5296 0.3340 l
0.5312 0.3340 l
0.5327 0.3340 l
0.5343 0.3340 l
0.5359 0.3341 l
0.5375 0.3341 l
0.5390 0.3341 l
0.5406 0.3341 l
0.5422 0.3342 l
0.5437 0.3342 l
0.5453 0.3342 l
0.5469 0.3343 l
0.5484 0.3343 l
0.5502 0.3343 l
0.5516 0.3343 l
0.5531 0.3343 l
0.5547 0.3344 l
0.5563 0.3344 l
0.5578 0.3344 l
0.5594 0.3344 l
0.5610 0.3345 l
0.5625 0.3345 l
0.5641 0.3345 l
0.5657 0.3345 l
0.5673 0.3346 l
0.5688 0.3346 l
0.5704 0.3346 l
0.5720 0.3346 l
0.5735 0.3347 l
0.5751 0.3347 l
0.5767 0.3347 l
0.5782 0.3347 l
0.5798 0.3348 l
0.5814 0.3348 l
0.5829 0.3348 l
0.5845 0.3348 l
0.5861 0.3349 l
0.5876 0.3349 l
0.5892 0.3349 l
0.5908 0.3349 l
0.5924 0.3350 l
0.5939 0.3350 l
0.5955 0.3350 l
0.5971 0.3350 l
0.5986 0.3351 l
0.6002 0.3351 l
0.6018 0.3351 l
0.6033 0.3351 l
0.6049 0.3352 l
0.6065 0.3352 l
0.6080 0.3352 l
0.6096 0.3352 l
0.6112 0.3353 l
0.6127 0.3353 l
0.6143 0.3353 l
0.6159 0.3353 l
0.6175 0.3354 l
0.6190 0.3354 l
0.6206 0.3354 l
0.6222 0.3354 l
0.6237 0.3355 l
0.6253 0.3355 l
0.6269 0.3355 l
0.6284 0.3355 l
0.6300 0.3356 l
0.6316 0.3356 l
0.6331 0.3356 l
0.6347 0.3356 l
0.6363 0.3357 l
0.6378 0.3357 l
0.6394 0.3357 l
0.6410 0.3357 l
0.6425 0.3357 l
0.6441 0.3358 l
0.6457 0.3358 l
0.6473 0.3358 l
0.6488 0.3358 l
0.6504 0.3359 l
0.6520 0.3359 l
0.6535 0.3359 l
0.6551 0.3359 l
0.6567 0.3360 l
0.6582 0.3360 l
0.6598 0.3360 l
0.6614 0.3360 l
0.6629 0.3361 l
0.6645 0.3361 l
0.6661 0.3361 l
0.6676 0.3361 l
0.6692 0.3361 l
0.6708 0.3362 l
0.6724 0.3362 l
0.6739 0.3362 l
0.6755 0.3362 l
0.6771 0.3363 l
0.6786 0.3363 l
0.6802 0.3363 l
0.6818 0.3363 l
0.6833 0.3363 l
0.6849 0.3364 l
0.6865 0.3364 l
0.6880 0.3364 l
0.6896 0.3364 l
0.6912 0.3365 l
0.6927 0.3365 l
0.6943 0.3365 l
0.6959 0.3365 l
0.6975 0.3365 l
0.6990 0.3366 l
0.7006 0.3366 l
0.7022 0.3366 l
0.7037 0.3366 l
0.7053 0.3366 l
0.7069 0.3367 l
0.7084 0.3367 l
0.7100 0.3367 l
0.7116 0.3367 l
0.7131 0.3368 l
0.7147 0.3368 l
0.7163 0.3368 l
0.7178 0.3368 l
0.7194 0.3368 l
0.7210 0.3369 l
0.7225 0.3369 l
0.7241 0.3369 l
0.7257 0.3369 l
0.7273 0.3369 l
0.7288 0.3370 l
0.7304 0.3370 l
0.7320 0.3370 l
0.7335 0.3369 l
0.7351 0.3368 l
0.7367 0.3368 l
0.7382 0.3368 l
0.7398 0.3368 l
0.7414 0.3367 l
0.7429 0.3367 l
0.7445 0.3367 l
0.7461 0.3367 l
0.7476 0.3367 l
0.7492 0.3367 l
0.7508 0.3367 l
0.7524 0.3367 l
0.7539 0.3367 l
0.7555 0.3367 l
0.7571 0.3367 l
0.7586 0.3367 l
0.7602 0.3367 l
0.7618 0.3367 l
0.7633 0.3367 l
0.7649 0.3367 l
0.7665 0.3367 l
0.7680 0.3367 l
0.7696 0.3367 l
0.7712 0.3367 l
0.7727 0.3367 l
0.7743 0.3367 l
0.7759 0.3367 l
0.7775 0.3368 l
0.7790 0.3368 l
0.7806 0.3368 l
0.7822 0.3368 l
0.7837 0.3368 l
0.7853 0.3368 l
0.7869 0.3368 l
0.7884 0.3368 l
0.7900 0.3368 l
0.7916 0.3368 l
0.7931 0.3368 l
0.7947 0.3368 l
0.7963 0.3368 l
0.7978 0.3368 l
0.7994 0.3369 l
0.8010 0.3369 l
0.8025 0.3369 l
0.8041 0.3369 l
0.8057 0.3369 l
0.8073 0.3369 l
0.8088 0.3369 l
0.8104 0.3369 l
0.8120 0.3369 l
0.8135 0.3369 l
0.8151 0.3369 l
0.8167 0.3369 l
0.8182 0.3370 l
0.8198 0.3370 l
0.8214 0.3370 l
0.8229 0.3370 l
0.8245 0.3370 l
0.8261 0.3370 l
0.8276 0.3370 l
0.8292 0.3370 l
0.8308 0.3370 l
0.8324 0.3370 l
0.8339 0.3370 l
0.8355 0.3371 l
0.8371 0.3371 l
0.8386 0.3371 l
0.8402 0.3371 l
0.8418 0.3371 l
0.8433 0.3371 l
0.8449 0.3371 l
0.8465 0.3371 l
0.8480 0.3371 l
0.8496 0.3371 l
0.8512 0.3371 l
0.8527 0.3371 l
0.8543 0.3371 l
0.8559 0.3372 l
0.8575 0.3372 l
0.8590 0.3372 l
0.8606 0.3372 l
0.8622 0.3372 l
0.8637 0.3372 l
0.8653 0.3372 l
0.8669 0.3372 l
0.8684 0.3372 l
0.8700 0.3372 l
0.8716 0.3372 l
0.8731 0.3372 l
0.8747 0.3372 l
0.8763 0.3373 l
0.8778 0.3373 l
0.8794 0.3373 l
0.8810 0.3373 l
0.8825 0.3373 l
0.8841 0.3373 l
0.8857 0.3373 l
0.8873 0.3373 l
0.8888 0.3373 l
0.8904 0.3373 l
0.8920 0.3373 l
0.8935 0.3373 l
0.8951 0.3374 l
0.8967 0.3374 l
0.8982 0.3374 l
0.8998 0.3374 l
0.9014 0.3374 l
0.9029 0.3374 l
0.9045 0.3374 l
0.9061 0.3374 l
0.9076 0.3374 l
0.9092 0.3374 l
0.9108 0.3374 l
0.9124 0.3374 l
0.9139 0.3374 l
0.9155 0.3374 l
0.9171 0.3374 l
0.9186 0.3374 l
0.9202 0.3375 l
0.9218 0.3375 l
0.9233 0.3375 l
0.9249 0.3375 l
0.9265 0.3375 l
0.9280 0.3375 l
0.9296 0.3375 l
0.9312 0.3375 l
0.9327 0.3375 l
0.9343 0.3375 l
0.9359 0.3375 l
0.9375 0.3375 l
0.9390 0.3373 l
0.9406 0.3368 l
0.9422 0.3366 l
0.9437 0.3362 l
0.9453 0.3359 l
0.9469 0.3357 l
0.9484 0.3355 l
0.9500 0.3353 l
s
[/DeviceRGB] SCS
Color1 SC
[] 0 SD
0.0015 SLW
n
0.1971 0.1500 m
0.1971 0.1600 l
s
n
0.1971 0.9000 m
0.1971 0.8900 l
s
n
0.2284 0.1500 m
0.2284 0.1600 l
s
n
0.2284 0.9000 m
0.2284 0.8900 l
s
n
0.2598 0.1500 m
0.2598 0.1600 l
s
n
0.2598 0.9000 m
0.2598 0.8900 l
s
n
0.2912 0.1500 m
0.2912 0.1600 l
s
n
0.2912 0.9000 m
0.2912 0.8900 l
s
n
0.3539 0.1500 m
0.3539 0.1600 l
s
n
0.3539 0.9000 m
0.3539 0.8900 l
s
n
0.3853 0.1500 m
0.3853 0.1600 l
s
n
0.3853 0.9000 m
0.3853 0.8900 l
s
n
0.4167 0.1500 m
0.4167 0.1600 l
s
n
0.4167 0.9000 m
0.4167 0.8900 l
s
n
0.4480 0.1500 m
0.4480 0.1600 l
s
n
0.4480 0.9000 m
0.4480 0.8900 l
s
n
0.5108 0.1500 m
0.5108 0.1600 l
s
n
0.5108 0.9000 m
0.5108 0.8900 l
s
n
0.5422 0.1500 m
0.5422 0.1600 l
s
n
0.5422 0.9000 m
0.5422 0.8900 l
s
n
0.5735 0.1500 m
0.5735 0.1600 l
s
n
0.5735 0.9000 m
0.5735 0.8900 l
s
n
0.6049 0.1500 m
0.6049 0.1600 l
s
n
0.6049 0.9000 m
0.6049 0.8900 l
s
n
0.6676 0.1500 m
0.6676 0.1600 l
s
n
0.6676 0.9000 m
0.6676 0.8900 l
s
n
0.6990 0.1500 m
0.6990 0.1600 l
s
n
0.6990 0.9000 m
0.6990 0.8900 l
s
n
0.7304 0.1500 m
0.7304 0.1600 l
s
n
0.7304 0.9000 m
0.7304 0.8900 l
s
n
0.7618 0.1500 m
0.7618 0.1600 l
s
n
0.7618 0.9000 m
0.7618 0.8900 l
s
n
0.8245 0.1500 m
0.8245 0.1600 l
s
n
0.8245 0.9000 m
0.8245 0.8900 l
s
n
0.8559 0.1500 m
0.8559 0.1600 l
s
n
0.8559 0.9000 m
0.8559 0.8900 l
s
n
0.8873 0.1500 m
0.8873 0.1600 l
s
n
0.8873 0.9000 m
0.8873 0.8900 l
s
n
0.9186 0.1500 m
0.9186 0.1600 l
s
n
0.9186 0.9000 m
0.9186 0.8900 l
s
n
0.1657 0.1500 m
0.1657 0.1700 l
s
n
0.1657 0.9000 m
0.1657 0.8800 l
s
n
0.3225 0.1500 m
0.3225 0.1700 l
s
n
0.3225 0.9000 m
0.3225 0.8800 l
s
n
0.4794 0.1500 m
0.4794 0.1700 l
s
n
0.4794 0.9000 m
0.4794 0.8800 l
s
n
0.6363 0.1500 m
0.6363 0.1700 l
s
n
0.6363 0.9000 m
0.6363 0.8800 l
s
n
0.7931 0.1500 m
0.7931 0.1700 l
s
n
0.7931 0.9000 m
0.7931 0.8800 l
s
n
0.9500 0.1500 m
0.9500 0.1700 l
s
n
0.9500 0.9000 m
0.9500 0.8800 l
s
/Helvetica findfont
dup length dict begin
 {1 index /FID ne {def} {pop pop} ifelse} forall
 /Encoding DefEncoding def
 currentdict
end
/Font4 exch definefont pop
/Font4 FFSF
0.1431 0.1200 m
GS
[0.0280 0.0000 0.0000 0.0280 0 0] CC
(100) show
GR
/Font4 FFSF
0.3000 0.1200 m
GS
[0.0280 0.0000 0.0000 0.0280 0 0] CC
(200) show
GR
/Font4 FFSF
0.4569 0.1200 m
GS
[0.0280 0.0000 0.0000 0.0280 0 0] CC
(300) show
GR
/Font4 FFSF
0.6137 0.1200 m
GS
[0.0280 0.0000 0.0000 0.0280 0 0] CC
(400) show
GR
/Font4 FFSF
0.7706 0.1200 m
GS
[0.0280 0.0000 0.0000 0.0280 0 0] CC
(500) show
GR
/Font4 FFSF
0.9275 0.1200 m
GS
[0.0280 0.0000 0.0000 0.0280 0 0] CC
(600) show
GR
/Font4 FFSF
0.4818 0.0845 m
GS
[0.0336 0.0000 0.0000 0.0336 0 0] CC
(M) show
GR
/Font4 FFSF
0.5096 0.0711 m
GS
[0.0238 0.0000 0.0000 0.0238 0 0] CC
(A) show
GR
/Font4 FFSF
0.5253 0.0845 m
GS
[0.0336 0.0000 0.0000 0.0336 0 0] CC
( [GeV]) show
GR
n
0.1500 0.2064 m
0.1600 0.2064 l
s
n
0.9500 0.2064 m
0.9400 0.2064 l
s
n
0.1500 0.2395 m
0.1600 0.2395 l
s
n
0.9500 0.2395 m
0.9400 0.2395 l
s
n
0.1500 0.2629 m
0.1600 0.2629 l
s
n
0.9500 0.2629 m
0.9400 0.2629 l
s
n
0.1500 0.2811 m
0.1600 0.2811 l
s
n
0.9500 0.2811 m
0.9400 0.2811 l
s
n
0.1500 0.2959 m
0.1600 0.2959 l
s
n
0.9500 0.2959 m
0.9400 0.2959 l
s
n
0.1500 0.3085 m
0.1600 0.3085 l
s
n
0.9500 0.3085 m
0.9400 0.3085 l
s
n
0.1500 0.3193 m
0.1600 0.3193 l
s
n
0.9500 0.3193 m
0.9400 0.3193 l
s
n
0.1500 0.3289 m
0.1600 0.3289 l
s
n
0.9500 0.3289 m
0.9400 0.3289 l
s
n
0.1500 0.3375 m
0.1600 0.3375 l
s
n
0.9500 0.3375 m
0.9400 0.3375 l
s
n
0.1500 0.3939 m
0.1600 0.3939 l
s
n
0.9500 0.3939 m
0.9400 0.3939 l
s
n
0.1500 0.4270 m
0.1600 0.4270 l
s
n
0.9500 0.4270 m
0.9400 0.4270 l
s
n
0.1500 0.4504 m
0.1600 0.4504 l
s
n
0.9500 0.4504 m
0.9400 0.4504 l
s
n
0.1500 0.4686 m
0.1600 0.4686 l
s
n
0.9500 0.4686 m
0.9400 0.4686 l
s
n
0.1500 0.4834 m
0.1600 0.4834 l
s
n
0.9500 0.4834 m
0.9400 0.4834 l
s
n
0.1500 0.4960 m
0.1600 0.4960 l
s
n
0.9500 0.4960 m
0.9400 0.4960 l
s
n
0.1500 0.5068 m
0.1600 0.5068 l
s
n
0.9500 0.5068 m
0.9400 0.5068 l
s
n
0.1500 0.5164 m
0.1600 0.5164 l
s
n
0.9500 0.5164 m
0.9400 0.5164 l
s
n
0.1500 0.5250 m
0.1600 0.5250 l
s
n
0.9500 0.5250 m
0.9400 0.5250 l
s
n
0.1500 0.5814 m
0.1600 0.5814 l
s
n
0.9500 0.5814 m
0.9400 0.5814 l
s
n
0.1500 0.6145 m
0.1600 0.6145 l
s
n
0.9500 0.6145 m
0.9400 0.6145 l
s
n
0.1500 0.6379 m
0.1600 0.6379 l
s
n
0.9500 0.6379 m
0.9400 0.6379 l
s
n
0.1500 0.6561 m
0.1600 0.6561 l
s
n
0.9500 0.6561 m
0.9400 0.6561 l
s
n
0.1500 0.6709 m
0.1600 0.6709 l
s
n
0.9500 0.6709 m
0.9400 0.6709 l
s
n
0.1500 0.6835 m
0.1600 0.6835 l
s
n
0.9500 0.6835 m
0.9400 0.6835 l
s
n
0.1500 0.6943 m
0.1600 0.6943 l
s
n
0.9500 0.6943 m
0.9400 0.6943 l
s
n
0.1500 0.7039 m
0.1600 0.7039 l
s
n
0.9500 0.7039 m
0.9400 0.7039 l
s
n
0.1500 0.7125 m
0.1600 0.7125 l
s
n
0.9500 0.7125 m
0.9400 0.7125 l
s
n
0.1500 0.7689 m
0.1600 0.7689 l
s
n
0.9500 0.7689 m
0.9400 0.7689 l
s
n
0.1500 0.8020 m
0.1600 0.8020 l
s
n
0.9500 0.8020 m
0.9400 0.8020 l
s
n
0.1500 0.8254 m
0.1600 0.8254 l
s
n
0.9500 0.8254 m
0.9400 0.8254 l
s
n
0.1500 0.8436 m
0.1600 0.8436 l
s
n
0.9500 0.8436 m
0.9400 0.8436 l
s
n
0.1500 0.8584 m
0.1600 0.8584 l
s
n
0.9500 0.8584 m
0.9400 0.8584 l
s
n
0.1500 0.8710 m
0.1600 0.8710 l
s
n
0.9500 0.8710 m
0.9400 0.8710 l
s
n
0.1500 0.8818 m
0.1600 0.8818 l
s
n
0.9500 0.8818 m
0.9400 0.8818 l
s
n
0.1500 0.8914 m
0.1600 0.8914 l
s
n
0.9500 0.8914 m
0.9400 0.8914 l
s
n
0.1500 0.9000 m
0.1600 0.9000 l
s
n
0.9500 0.9000 m
0.9400 0.9000 l
s
n
0.1500 0.1500 m
0.1700 0.1500 l
s
n
0.9500 0.1500 m
0.9300 0.1500 l
s
n
0.1500 0.3375 m
0.1700 0.3375 l
s
n
0.9500 0.3375 m
0.9300 0.3375 l
s
n
0.1500 0.5250 m
0.1700 0.5250 l
s
n
0.9500 0.5250 m
0.9300 0.5250 l
s
n
0.1500 0.7125 m
0.1700 0.7125 l
s
n
0.9500 0.7125 m
0.9300 0.7125 l
s
n
0.1500 0.9000 m
0.1700 0.9000 l
s
n
0.9500 0.9000 m
0.9300 0.9000 l
s
/Font4 FFSF
0.0922 0.1349 m
GS
[0.0280 0.0000 0.0000 0.0280 0 0] CC
(10) show
GR
/Font4 FFSF
0.1231 0.1517 m
GS
[0.0198 0.0000 0.0000 0.0198 0 0] CC
(-4) show
GR
/Font4 FFSF
0.0922 0.3224 m
GS
[0.0280 0.0000 0.0000 0.0280 0 0] CC
(10) show
GR
/Font4 FFSF
0.1231 0.3392 m
GS
[0.0198 0.0000 0.0000 0.0198 0 0] CC
(-3) show
GR
/Font4 FFSF
0.0922 0.5099 m
GS
[0.0280 0.0000 0.0000 0.0280 0 0] CC
(10) show
GR
/Font4 FFSF
0.1231 0.5267 m
GS
[0.0198 0.0000 0.0000 0.0198 0 0] CC
(-2) show
GR
/Font4 FFSF
0.0957 0.6974 m
GS
[0.0280 0.0000 0.0000 0.0280 0 0] CC
(10) show
GR
/Font4 FFSF
0.1267 0.7142 m
GS
[0.0198 0.0000 0.0000 0.0198 0 0] CC
(-1) show
GR
/Font4 FFSF
0.0988 0.8849 m
GS
[0.0280 0.0000 0.0000 0.0280 0 0] CC
(10) show
GR
/Font4 FFSF
0.1298 0.9017 m
GS
[0.0198 0.0000 0.0000 0.0198 0 0] CC
(0) show
GR
/Font4 FFSF
0.0751 0.4805 m
GS
[0.0000 0.0336 -0.0336 0.0000 0 0] CC
(BR\(A\)) show
GR
n
0.1500 0.1500 m
0.1500 0.9000 l
0.9500 0.9000 l
0.9500 0.1500 l
0.1500 0.1500 l
c
s
n
0.7000 0.5500 m
0.7000 0.3449 l
0.9143 0.3449 l
0.9143 0.5500 l
c
[/DeviceRGB] SCS
Color0 SC
fill
[/DeviceRGB] SCS
Color1 SC
n
0.7000 0.5500 m
0.7000 0.3449 l
0.9143 0.3449 l
0.9143 0.5500 l
0.7000 0.5500 l
c
s
/Font4 FFSF
0.7862 0.4935 m
GS
[0.0224 0.0000 0.0000 0.0224 0 0] CC
(BR\(A -> tt\)) show
GR
[/DeviceRGB] SCS
Color2 SC
[] 0 SD
0.0045 SLW
n
0.7122 0.4994 m
0.7722 0.4994 l
s
/Font4 FFSF
[/DeviceRGB] SCS
Color1 SC
0.7862 0.4524 m
GS
[0.0224 0.0000 0.0000 0.0224 0 0] CC
(BR\(A -> bb\)) show
GR
[/DeviceRGB] SCS
Color3 SC
n
0.7122 0.4582 m
0.7722 0.4582 l
s
/Font4 FFSF
[/DeviceRGB] SCS
Color1 SC
0.7862 0.4112 m
GS
[0.0224 0.0000 0.0000 0.0224 0 0] CC
(BR\(A -> ) show
GR
/Symbol findfont
/Font12 exch definefont pop
/Font12 FFSF
0.8729 0.4112 m
GS
[0.0224 0.0000 0.0000 0.0224 0 0] CC
(tt) show
GR
/Font4 FFSF
0.8925 0.4112 m
GS
[0.0224 0.0000 0.0000 0.0224 0 0] CC
(\)) show
GR
[/DeviceRGB] SCS
Color4 SC
n
0.7122 0.4171 m
0.7722 0.4171 l
s
/Font4 FFSF
[/DeviceRGB] SCS
Color1 SC
0.7862 0.3700 m
GS
[0.0224 0.0000 0.0000 0.0224 0 0] CC
(BR\(A -> ) show
GR
/Font12 FFSF
0.8729 0.3700 m
GS
[0.0224 0.0000 0.0000 0.0224 0 0] CC
(mm) show
GR
/Font4 FFSF
0.8988 0.3700 m
GS
[0.0224 0.0000 0.0000 0.0224 0 0] CC
(\)) show
GR
[/DeviceRGB] SCS
Color5 SC
n
0.7122 0.3757 m
0.7722 0.3757 l
s
/Font4 FFSF
[/DeviceRGB] SCS
Color1 SC
0.9700 0.7000 m
GS
[0.0000 0.0168 -0.0168 0.0000 0 0] CC
(LHC Higgs XS WG 2013) show
GR
/Font4 FFSF
0.7150 0.5250 m
GS
[0.0224 0.0000 0.0000 0.0224 0 0] CC
(light stop, tan) show
GR
/Font12 FFSF
0.8483 0.5250 m
GS
[0.0224 0.0000 0.0000 0.0224 0 0] CC
(b) show
GR
/Font4 FFSF
0.8605 0.5250 m
GS
[0.0224 0.0000 0.0000 0.0224 0 0] CC
( = 50) show
GR
%%Trailer
%%BoundingBox: 30 42 597 562
%%DocumentNeededResources: font Helvetica
%%+ font Symbol
%%EOF
