%!PS-Adobe-3.0 EPSF-3.0
%%BoundingBox: (atend)
%%LanguageLevel: 2
%%Creator: Grace-5.1.22
%%CreationDate: Tue Mar 26 12:40:46 2013
%%DocumentData: Clean8Bit
%%Orientation: Portrait
%%Title: /home/pcl302a/heinemey/plot/grace/2012/lhc-higgs-br/lightstop_tb10_BR-A0.grace
%%For: heinemey
%%DocumentNeededResources: (atend)
%%EndComments
%%BeginProlog
/m {moveto} def
/l {lineto} def
/s {stroke} def
/n {newpath} def
/c {closepath} def
/RL {rlineto} def
/SLW {setlinewidth} def
/GS {gsave} def
/GR {grestore} def
/SC {setcolor} def
/SGRY {setgray} def
/SRGB {setrgbcolor} def
/SD {setdash} def
/SLC {setlinecap} def
/SLJ {setlinejoin} def
/SCS {setcolorspace} def
/FFSF {findfont setfont} def
/CC {concat} def
/PXL {n m 0 0 RL s} def
/Color0 {1.0000 1.0000 1.0000} def
/Color1 {0.0000 0.0000 0.0000} def
/Color2 {1.0000 0.0000 0.0000} def
/Color3 {0.0000 1.0000 0.0000} def
/Color4 {0.0000 0.0000 1.0000} def
/Color5 {1.0000 1.0000 0.0000} def
/Color6 {0.7373 0.5608 0.5608} def
/Color7 {0.8627 0.8627 0.8627} def
/Color8 {0.5804 0.0000 0.8275} def
/Color9 {0.0000 1.0000 1.0000} def
/Color10 {1.0000 0.0000 1.0000} def
/Color11 {1.0000 0.6471 0.0000} def
/Color12 {0.4471 0.1294 0.7373} def
/Color13 {0.4039 0.0275 0.2824} def
/Color14 {0.2510 0.8784 0.8157} def
/Color15 {0.0000 0.5451 0.0000} def
/Color16 {0.7529 0.7529 0.7529} def
/Color17 {0.5059 0.5059 0.5059} def
/Color18 {0.2588 0.2588 0.2588} def
/PTRN {
 /pat_bits exch def 
 <<
  /PaintType 2
  /PatternType 1 /TilingType 1
  /BBox[0 0 16 16]
  /XStep 16 /YStep 16
  /PaintProc {
   pop
   16 16 true [-1 0 0 -1 16 16] pat_bits imagemask
  }
 >>
 [0.0016 0 0 0.0016 0 0]
 makepattern
} def
/Pattern0 {<0000000000000000000000000000000000000000000000000000000000000000> PTRN} bind def
/Pattern1 {<ffffffffffffffffffffffffffffffffffffffffffffffffffffffffffffffff> PTRN} bind def
/Pattern2 {<eeeeffffbbbbffffeeeeffffbbbbffffeeeeffffbbbbffffeeeeffffbbbbffff> PTRN} bind def
/Pattern3 {<eeeebbbbeeeebbbbeeeebbbbeeeebbbbeeeebbbbeeeebbbbeeeebbbbeeeebbbb> PTRN} bind def
/Pattern4 {<5555aaaa5555aaaa5555aaaa5555aaaa5555aaaa5555aaaa5555aaaa5555aaaa> PTRN} bind def
/Pattern5 {<1111444411114444111144441111444411114444111144441111444411114444> PTRN} bind def
/Pattern6 {<1111000044440000111100004444000011110000444400001111000044440000> PTRN} bind def
/Pattern7 {<1010000000000000010100000000000010100000000000000101000000000000> PTRN} bind def
/Pattern8 {<0000000000000000000000000000000000000000000000000000000000000000> PTRN} bind def
/Pattern9 {<1e1e0f0f8787c3c3e1e1f0f078783c3c1e1e0f0f8787c3c3e1e1f0f078783c3c> PTRN} bind def
/Pattern10 {<7878f0f0e1e1c3c387870f0f1e1e3c3c7878f0f0e1e1c3c387870f0f1e1e3c3c> PTRN} bind def
/Pattern11 {<3333333333333333333333333333333333333333333333333333333333333333> PTRN} bind def
/Pattern12 {<ffffffff00000000ffffffff00000000ffffffff00000000ffffffff00000000> PTRN} bind def
/Pattern13 {<8181424224241818181824244242818181814242242418181818242442428181> PTRN} bind def
/Pattern14 {<8080404020201010080804040202010180804040202010100808040402020101> PTRN} bind def
/Pattern15 {<0101020204040808101020204040808001010202040408081010202040408080> PTRN} bind def
/Pattern16 {<2222222222222222222222222222222222222222222222222222222222222222> PTRN} bind def
/Pattern17 {<0000ffff000000000000ffff000000000000ffff000000000000ffff00000000> PTRN} bind def
/Pattern18 {<2222ffff222222222222ffff222222222222ffff222222222222ffff22222222> PTRN} bind def
/Pattern19 {<ffffffff33333333ffffffff33333333ffffffff33333333ffffffff33333333> PTRN} bind def
/Pattern20 {<0f0f0f0f0f0f0f0ff0f0f0f0f0f0f0f00f0f0f0f0f0f0f0ff0f0f0f0f0f0f0f0> PTRN} bind def
/Pattern21 {<ff00ff00ff00ff00ff00ff00ff00ff0000ff00ff00ff00ff00ff00ff00ff00ff> PTRN} bind def
/Pattern22 {<8001800180018001800180018001ffffffff8001800180018001800180018001> PTRN} bind def
/Pattern23 {<c003c003c003c003c003c003ffffffffffffffffc003c003c003c003c003c003> PTRN} bind def
/Pattern24 {<040404040404ffff404040404040ffff040404040404ffff404040404040ffff> PTRN} bind def
/Pattern25 {<180018001800180018001800ffffffff001800180018001800180018ffffffff> PTRN} bind def
/Pattern26 {<1111b8b87c7c3a3a1111a3a3c7c78b8b1111b8b87c7c3a3a1111a3a3c7c78b8b> PTRN} bind def
/Pattern27 {<101010102828c7c70101010182827c7c101010102828c7c70101010182827c7c> PTRN} bind def
/Pattern28 {<1c1c121211112121c1c12121111112121c1c121211112121c1c1212111111212> PTRN} bind def
/Pattern29 {<3e3e414180808080e3e31414080808083e3e414180808080e3e3141408080808> PTRN} bind def
/Pattern30 {<4848888884848383848488884848383848488888848483838484888848483838> PTRN} bind def
/Pattern31 {<03030404080808080c0c12122121c0c003030404080808080c0c12122121c0c0> PTRN} bind def
/ellipsedict 8 dict def
ellipsedict /mtrx matrix put
/EARC {
 ellipsedict begin
  /endangle exch def
  /startangle exch def
  /yrad exch def
  /xrad exch def
  /y exch def
  /x exch def
  /savematrix mtrx currentmatrix def
  x y translate
  xrad yrad scale
  0 0 1 startangle endangle arc
  savematrix setmatrix
 end
} def
/TL {
  /kcomp exch def
  /linewidth exch def
  /offset exch def
  GS
  0 offset rmoveto
  linewidth SLW
  dup stringwidth exch kcomp add exch RL s
  GR
} def
/KINIT
{
 /kvector exch def
 /kid 0 def
} def
/KPROC
{
 pop pop
 kvector kid get
 0 rmoveto
 /kid 1 kid add def
} def
/DefEncoding [
 /.notdef
 /.notdef
 /.notdef
 /.notdef
 /.notdef
 /.notdef
 /.notdef
 /.notdef
 /.notdef
 /.notdef
 /.notdef
 /.notdef
 /.notdef
 /.notdef
 /.notdef
 /.notdef
 /.notdef
 /.notdef
 /.notdef
 /.notdef
 /.notdef
 /.notdef
 /.notdef
 /.notdef
 /.notdef
 /.notdef
 /.notdef
 /.notdef
 /.notdef
 /.notdef
 /.notdef
 /.notdef
 /space
 /exclam
 /quotedbl
 /numbersign
 /dollar
 /percent
 /ampersand
 /quoteright
 /parenleft
 /parenright
 /asterisk
 /plus
 /comma
 /hyphen
 /period
 /slash
 /zero
 /one
 /two
 /three
 /four
 /five
 /six
 /seven
 /eight
 /nine
 /colon
 /semicolon
 /less
 /equal
 /greater
 /question
 /at
 /A
 /B
 /C
 /D
 /E
 /F
 /G
 /H
 /I
 /J
 /K
 /L
 /M
 /N
 /O
 /P
 /Q
 /R
 /S
 /T
 /U
 /V
 /W
 /X
 /Y
 /Z
 /bracketleft
 /backslash
 /bracketright
 /asciicircum
 /underscore
 /grave
 /a
 /b
 /c
 /d
 /e
 /f
 /g
 /h
 /i
 /j
 /k
 /l
 /m
 /n
 /o
 /p
 /q
 /r
 /s
 /t
 /u
 /v
 /w
 /x
 /y
 /z
 /braceleft
 /bar
 /braceright
 /asciitilde
 /.notdef
 /.notdef
 /.notdef
 /.notdef
 /.notdef
 /.notdef
 /.notdef
 /.notdef
 /.notdef
 /.notdef
 /.notdef
 /.notdef
 /.notdef
 /.notdef
 /.notdef
 /.notdef
 /.notdef
 /.notdef
 /.notdef
 /.notdef
 /.notdef
 /.notdef
 /.notdef
 /.notdef
 /.notdef
 /.notdef
 /.notdef
 /.notdef
 /.notdef
 /.notdef
 /.notdef
 /.notdef
 /.notdef
 /space
 /exclamdown
 /cent
 /sterling
 /currency
 /yen
 /brokenbar
 /section
 /dieresis
 /copyright
 /ordfeminine
 /guillemotleft
 /logicalnot
 /hyphen
 /registered
 /macron
 /degree
 /plusminus
 /twosuperior
 /threesuperior
 /acute
 /mu
 /paragraph
 /periodcentered
 /cedilla
 /onesuperior
 /ordmasculine
 /guillemotright
 /onequarter
 /onehalf
 /threequarters
 /questiondown
 /Agrave
 /Aacute
 /Acircumflex
 /Atilde
 /Adieresis
 /Aring
 /AE
 /Ccedilla
 /Egrave
 /Eacute
 /Ecircumflex
 /Edieresis
 /Igrave
 /Iacute
 /Icircumflex
 /Idieresis
 /Eth
 /Ntilde
 /Ograve
 /Oacute
 /Ocircumflex
 /Otilde
 /Odieresis
 /multiply
 /Oslash
 /Ugrave
 /Uacute
 /Ucircumflex
 /Udieresis
 /Yacute
 /Thorn
 /germandbls
 /agrave
 /aacute
 /acircumflex
 /atilde
 /adieresis
 /aring
 /ae
 /ccedilla
 /egrave
 /eacute
 /ecircumflex
 /edieresis
 /igrave
 /iacute
 /icircumflex
 /idieresis
 /eth
 /ntilde
 /ograve
 /oacute
 /ocircumflex
 /otilde
 /odieresis
 /divide
 /oslash
 /ugrave
 /uacute
 /ucircumflex
 /udieresis
 /yacute
 /thorn
 /ydieresis
] def
%%EndProlog
%%BeginSetup
%%EndSetup
612.00 612.00 scale
[/DeviceRGB] SCS
Color2 SC
[] 0 SD
0.0045 SLW
0 SLC
0 SLJ
n
0.4876 0.1499 m
0.4888 0.1557 l
0.4904 0.1631 l
0.4920 0.1704 l
0.4935 0.1777 l
0.4951 0.1849 l
0.4967 0.1922 l
0.4982 0.1994 l
0.4998 0.2066 l
0.5014 0.2139 l
0.5029 0.2211 l
0.5045 0.2284 l
0.5061 0.2357 l
0.5076 0.2430 l
0.5092 0.2504 l
0.5108 0.2578 l
0.5124 0.2652 l
0.5139 0.2728 l
0.5155 0.2804 l
0.5171 0.2882 l
0.5186 0.2957 l
0.5202 0.3035 l
0.5218 0.3115 l
0.5233 0.3197 l
0.5249 0.3281 l
0.5265 0.3367 l
0.5280 0.3456 l
0.5296 0.3549 l
0.5312 0.3644 l
0.5327 0.3744 l
0.5343 0.3849 l
0.5359 0.3960 l
0.5375 0.4078 l
0.5390 0.4205 l
0.5406 0.4344 l
0.5422 0.4499 l
0.5437 0.4676 l
0.5453 0.4887 l
0.5469 0.5213 l
0.5484 0.5612 l
0.5502 0.6041 l
0.5516 0.6409 l
0.5531 0.6774 l
0.5547 0.7056 l
0.5563 0.7225 l
0.5578 0.7254 l
0.5594 0.7279 l
0.5610 0.7301 l
0.5625 0.7320 l
0.5641 0.7338 l
0.5657 0.7353 l
0.5673 0.7368 l
0.5688 0.7381 l
0.5704 0.7393 l
0.5720 0.7404 l
0.5735 0.7415 l
0.5751 0.7425 l
0.5767 0.7434 l
0.5782 0.7443 l
0.5798 0.7451 l
0.5814 0.7459 l
0.5829 0.7466 l
0.5845 0.7473 l
0.5861 0.7480 l
0.5876 0.7487 l
0.5892 0.7493 l
0.5908 0.7499 l
0.5924 0.7504 l
0.5939 0.7510 l
0.5955 0.7515 l
0.5971 0.7520 l
0.5986 0.7525 l
0.6002 0.7530 l
0.6018 0.7534 l
0.6033 0.7539 l
0.6049 0.7543 l
0.6065 0.7547 l
0.6080 0.7551 l
0.6096 0.7555 l
0.6112 0.7559 l
0.6127 0.7562 l
0.6143 0.7566 l
0.6159 0.7569 l
0.6175 0.7572 l
0.6190 0.7576 l
0.6206 0.7579 l
0.6222 0.7582 l
0.6237 0.7585 l
0.6253 0.7588 l
0.6269 0.7590 l
0.6284 0.7593 l
0.6300 0.7596 l
0.6316 0.7598 l
0.6331 0.7601 l
0.6347 0.7603 l
0.6363 0.7606 l
0.6378 0.7608 l
0.6394 0.7611 l
0.6410 0.7613 l
0.6425 0.7615 l
0.6441 0.7617 l
0.6457 0.7619 l
0.6473 0.7621 l
0.6488 0.7623 l
0.6504 0.7625 l
0.6520 0.7627 l
0.6535 0.7629 l
0.6551 0.7631 l
0.6567 0.7633 l
0.6582 0.7635 l
0.6598 0.7637 l
0.6614 0.7638 l
0.6629 0.7640 l
0.6645 0.7642 l
0.6661 0.7643 l
0.6676 0.7645 l
0.6692 0.7646 l
0.6708 0.7648 l
0.6724 0.7649 l
0.6739 0.7651 l
0.6755 0.7652 l
0.6771 0.7654 l
0.6786 0.7655 l
0.6802 0.7657 l
0.6818 0.7658 l
0.6833 0.7659 l
0.6849 0.7661 l
0.6865 0.7662 l
0.6880 0.7663 l
0.6896 0.7665 l
0.6912 0.7666 l
0.6927 0.7667 l
0.6943 0.7668 l
0.6959 0.7669 l
0.6975 0.7671 l
0.6990 0.7672 l
0.7006 0.7673 l
0.7022 0.7674 l
0.7037 0.7675 l
0.7053 0.7676 l
0.7069 0.7677 l
0.7084 0.7678 l
0.7100 0.7679 l
0.7116 0.7680 l
0.7131 0.7681 l
0.7147 0.7682 l
0.7163 0.7683 l
0.7178 0.7684 l
0.7194 0.7685 l
0.7210 0.7686 l
0.7225 0.7687 l
0.7241 0.7681 l
0.7257 0.7671 l
0.7273 0.7665 l
0.7288 0.7661 l
0.7304 0.7658 l
0.7320 0.7655 l
0.7335 0.7653 l
0.7351 0.7650 l
0.7367 0.7648 l
0.7382 0.7646 l
0.7398 0.7645 l
0.7414 0.7643 l
0.7429 0.7642 l
0.7445 0.7640 l
0.7461 0.7639 l
0.7476 0.7638 l
0.7492 0.7637 l
0.7508 0.7636 l
0.7524 0.7635 l
0.7539 0.7634 l
0.7555 0.7633 l
0.7571 0.7632 l
0.7586 0.7631 l
0.7602 0.7630 l
0.7618 0.7630 l
0.7633 0.7629 l
0.7649 0.7628 l
0.7665 0.7627 l
0.7680 0.7627 l
0.7696 0.7626 l
0.7712 0.7625 l
0.7727 0.7625 l
0.7743 0.7624 l
0.7759 0.7624 l
0.7775 0.7623 l
0.7790 0.7623 l
0.7806 0.7622 l
0.7822 0.7622 l
0.7837 0.7621 l
0.7853 0.7621 l
0.7869 0.7620 l
0.7884 0.7620 l
0.7900 0.7619 l
0.7916 0.7619 l
0.7931 0.7618 l
0.7947 0.7618 l
0.7963 0.7617 l
0.7978 0.7617 l
0.7994 0.7617 l
0.8010 0.7616 l
0.8025 0.7616 l
0.8041 0.7615 l
0.8057 0.7615 l
0.8073 0.7615 l
0.8088 0.7614 l
0.8104 0.7614 l
0.8120 0.7614 l
0.8135 0.7613 l
0.8151 0.7613 l
0.8167 0.7613 l
0.8182 0.7612 l
0.8198 0.7612 l
0.8214 0.7612 l
0.8229 0.7611 l
0.8245 0.7611 l
0.8261 0.7611 l
0.8276 0.7610 l
0.8292 0.7610 l
0.8308 0.7609 l
0.8324 0.7609 l
0.8339 0.7609 l
0.8355 0.7608 l
0.8371 0.7608 l
0.8386 0.7607 l
0.8402 0.7607 l
0.8418 0.7606 l
0.8433 0.7606 l
0.8449 0.7606 l
0.8465 0.7605 l
0.8480 0.7605 l
0.8496 0.7604 l
0.8512 0.7604 l
0.8527 0.7603 l
0.8543 0.7603 l
0.8559 0.7603 l
0.8575 0.7602 l
0.8590 0.7602 l
0.8606 0.7601 l
0.8622 0.7601 l
0.8637 0.7600 l
0.8653 0.7600 l
0.8669 0.7600 l
0.8684 0.7599 l
0.8700 0.7599 l
0.8716 0.7598 l
0.8731 0.7598 l
0.8747 0.7597 l
0.8763 0.7597 l
0.8778 0.7596 l
0.8794 0.7596 l
0.8810 0.7596 l
0.8825 0.7595 l
0.8841 0.7595 l
0.8857 0.7594 l
0.8873 0.7594 l
0.8888 0.7593 l
0.8904 0.7593 l
0.8920 0.7593 l
0.8935 0.7592 l
0.8951 0.7592 l
0.8967 0.7591 l
0.8982 0.7591 l
0.8998 0.7590 l
0.9014 0.7590 l
0.9029 0.7590 l
0.9045 0.7589 l
0.9061 0.7589 l
0.9076 0.7588 l
0.9092 0.7588 l
0.9108 0.7587 l
0.9124 0.7587 l
0.9139 0.7587 l
0.9155 0.7586 l
0.9171 0.7585 l
0.9186 0.7584 l
0.9202 0.7583 l
0.9218 0.7582 l
0.9233 0.7566 l
0.9249 0.7526 l
0.9265 0.7505 l
0.9280 0.7489 l
0.9296 0.7476 l
0.9312 0.7451 l
0.9327 0.7435 l
0.9343 0.7421 l
0.9359 0.7409 l
0.9375 0.7398 l
0.9390 0.7388 l
0.9406 0.7378 l
0.9422 0.7370 l
0.9437 0.7361 l
0.9453 0.7354 l
0.9469 0.7346 l
0.9484 0.7339 l
0.9500 0.7332 l
s
[/DeviceRGB] SCS
Color3 SC
n
0.1500 0.8898 m
0.1516 0.8898 l
0.1531 0.8898 l
0.1547 0.8898 l
0.1563 0.8897 l
0.1578 0.8897 l
0.1594 0.8897 l
0.1610 0.8897 l
0.1625 0.8897 l
0.1641 0.8897 l
0.1657 0.8896 l
0.1673 0.8896 l
0.1688 0.8896 l
0.1704 0.8896 l
0.1720 0.8896 l
0.1735 0.8896 l
0.1751 0.8895 l
0.1767 0.8895 l
0.1782 0.8895 l
0.1798 0.8895 l
0.1814 0.8895 l
0.1829 0.8895 l
0.1845 0.8895 l
0.1861 0.8894 l
0.1876 0.8894 l
0.1892 0.8894 l
0.1908 0.8894 l
0.1924 0.8894 l
0.1939 0.8894 l
0.1955 0.8893 l
0.1971 0.8893 l
0.1986 0.8893 l
0.2002 0.8893 l
0.2018 0.8893 l
0.2033 0.8893 l
0.2049 0.8893 l
0.2065 0.8893 l
0.2080 0.8892 l
0.2096 0.8892 l
0.2112 0.8892 l
0.2127 0.8892 l
0.2143 0.8892 l
0.2159 0.8892 l
0.2175 0.8892 l
0.2190 0.8891 l
0.2206 0.8891 l
0.2222 0.8891 l
0.2237 0.8891 l
0.2253 0.8891 l
0.2269 0.8891 l
0.2284 0.8891 l
0.2300 0.8891 l
0.2316 0.8890 l
0.2331 0.8890 l
0.2347 0.8890 l
0.2363 0.8890 l
0.2378 0.8890 l
0.2394 0.8890 l
0.2410 0.8890 l
0.2425 0.8890 l
0.2441 0.8890 l
0.2457 0.8889 l
0.2473 0.8889 l
0.2488 0.8889 l
0.2504 0.8889 l
0.2520 0.8889 l
0.2535 0.8889 l
0.2551 0.8889 l
0.2567 0.8889 l
0.2582 0.8889 l
0.2598 0.8888 l
0.2614 0.8888 l
0.2629 0.8888 l
0.2645 0.8888 l
0.2661 0.8888 l
0.2676 0.8888 l
0.2692 0.8888 l
0.2708 0.8888 l
0.2724 0.8888 l
0.2739 0.8888 l
0.2755 0.8887 l
0.2771 0.8887 l
0.2786 0.8887 l
0.2802 0.8887 l
0.2818 0.8887 l
0.2833 0.8887 l
0.2849 0.8887 l
0.2865 0.8887 l
0.2880 0.8887 l
0.2896 0.8886 l
0.2912 0.8886 l
0.2927 0.8886 l
0.2943 0.8886 l
0.2959 0.8886 l
0.2975 0.8886 l
0.2990 0.8886 l
0.3006 0.8886 l
0.3022 0.8886 l
0.3037 0.8886 l
0.3053 0.8885 l
0.3069 0.8885 l
0.3084 0.8885 l
0.3100 0.8885 l
0.3116 0.8885 l
0.3131 0.8885 l
0.3147 0.8885 l
0.3163 0.8885 l
0.3178 0.8885 l
0.3194 0.8885 l
0.3210 0.8884 l
0.3225 0.8884 l
0.3241 0.8884 l
0.3257 0.8884 l
0.3273 0.8884 l
0.3288 0.8884 l
0.3304 0.8884 l
0.3320 0.8884 l
0.3335 0.8884 l
0.3351 0.8884 l
0.3367 0.8884 l
0.3382 0.8883 l
0.3398 0.8883 l
0.3414 0.8883 l
0.3429 0.8883 l
0.3445 0.8883 l
0.3461 0.8883 l
0.3476 0.8883 l
0.3492 0.8883 l
0.3508 0.8882 l
0.3524 0.8882 l
0.3539 0.8882 l
0.3555 0.8882 l
0.3571 0.8882 l
0.3586 0.8881 l
0.3602 0.8881 l
0.3618 0.8881 l
0.3633 0.8881 l
0.3649 0.8881 l
0.3665 0.8880 l
0.3680 0.8880 l
0.3696 0.8880 l
0.3712 0.8880 l
0.3727 0.8880 l
0.3743 0.8879 l
0.3759 0.8879 l
0.3775 0.8879 l
0.3790 0.8879 l
0.3806 0.8879 l
0.3822 0.8878 l
0.3837 0.8878 l
0.3853 0.8878 l
0.3869 0.8878 l
0.3884 0.8878 l
0.3900 0.8878 l
0.3916 0.8877 l
0.3931 0.8877 l
0.3947 0.8877 l
0.3963 0.8877 l
0.3978 0.8877 l
0.3994 0.8877 l
0.4010 0.8877 l
0.4025 0.8876 l
0.4041 0.8876 l
0.4057 0.8876 l
0.4073 0.8876 l
0.4088 0.8876 l
0.4104 0.8876 l
0.4120 0.8876 l
0.4135 0.8875 l
0.4151 0.8875 l
0.4167 0.8875 l
0.4182 0.8875 l
0.4198 0.8875 l
0.4214 0.8875 l
0.4229 0.8875 l
0.4245 0.8875 l
0.4261 0.8874 l
0.4276 0.8874 l
0.4292 0.8874 l
0.4308 0.8874 l
0.4324 0.8874 l
0.4339 0.8874 l
0.4355 0.8874 l
0.4371 0.8874 l
0.4386 0.8874 l
0.4402 0.8874 l
0.4418 0.8873 l
0.4433 0.8873 l
0.4449 0.8873 l
0.4465 0.8873 l
0.4480 0.8873 l
0.4496 0.8873 l
0.4512 0.8873 l
0.4527 0.8873 l
0.4543 0.8873 l
0.4559 0.8873 l
0.4575 0.8873 l
0.4590 0.8872 l
0.4606 0.8872 l
0.4622 0.8872 l
0.4637 0.8872 l
0.4653 0.8872 l
0.4669 0.8872 l
0.4684 0.8872 l
0.4700 0.8872 l
0.4716 0.8872 l
0.4731 0.8872 l
0.4747 0.8872 l
0.4763 0.8872 l
0.4778 0.8871 l
0.4794 0.8871 l
0.4810 0.8871 l
0.4825 0.8871 l
0.4841 0.8871 l
0.4857 0.8871 l
0.4873 0.8871 l
0.4888 0.8871 l
0.4904 0.8871 l
0.4920 0.8871 l
0.4935 0.8871 l
0.4951 0.8871 l
0.4967 0.8871 l
0.4982 0.8870 l
0.4998 0.8870 l
0.5014 0.8870 l
0.5029 0.8870 l
0.5045 0.8870 l
0.5061 0.8870 l
0.5076 0.8870 l
0.5092 0.8870 l
0.5108 0.8870 l
0.5124 0.8870 l
0.5139 0.8870 l
0.5155 0.8870 l
0.5171 0.8869 l
0.5186 0.8866 l
0.5202 0.8864 l
0.5218 0.8863 l
0.5233 0.8862 l
0.5249 0.8860 l
0.5265 0.8860 l
0.5280 0.8859 l
0.5296 0.8858 l
0.5312 0.8857 l
0.5327 0.8856 l
0.5343 0.8855 l
0.5359 0.8854 l
0.5375 0.8854 l
0.5390 0.8853 l
0.5406 0.8852 l
0.5422 0.8851 l
0.5437 0.8849 l
0.5453 0.8848 l
0.5469 0.8845 l
0.5484 0.8839 l
0.5502 0.8785 l
0.5516 0.8761 l
0.5531 0.8734 l
0.5547 0.8705 l
0.5563 0.8681 l
0.5578 0.8674 l
0.5594 0.8667 l
0.5610 0.8661 l
0.5625 0.8655 l
0.5641 0.8650 l
0.5657 0.8645 l
0.5673 0.8640 l
0.5688 0.8636 l
0.5704 0.8632 l
0.5720 0.8628 l
0.5735 0.8624 l
0.5751 0.8620 l
0.5767 0.8617 l
0.5782 0.8613 l
0.5798 0.8610 l
0.5814 0.8607 l
0.5829 0.8604 l
0.5845 0.8601 l
0.5861 0.8599 l
0.5876 0.8596 l
0.5892 0.8593 l
0.5908 0.8591 l
0.5924 0.8588 l
0.5939 0.8586 l
0.5955 0.8584 l
0.5971 0.8582 l
0.5986 0.8579 l
0.6002 0.8577 l
0.6018 0.8575 l
0.6033 0.8573 l
0.6049 0.8571 l
0.6065 0.8569 l
0.6080 0.8567 l
0.6096 0.8565 l
0.6112 0.8564 l
0.6127 0.8562 l
0.6143 0.8560 l
0.6159 0.8558 l
0.6175 0.8557 l
0.6190 0.8555 l
0.6206 0.8554 l
0.6222 0.8552 l
0.6237 0.8550 l
0.6253 0.8549 l
0.6269 0.8548 l
0.6284 0.8546 l
0.6300 0.8545 l
0.6316 0.8543 l
0.6331 0.8542 l
0.6347 0.8541 l
0.6363 0.8539 l
0.6378 0.8538 l
0.6394 0.8537 l
0.6410 0.8535 l
0.6425 0.8534 l
0.6441 0.8533 l
0.6457 0.8532 l
0.6473 0.8531 l
0.6488 0.8529 l
0.6504 0.8528 l
0.6520 0.8527 l
0.6535 0.8526 l
0.6551 0.8525 l
0.6567 0.8524 l
0.6582 0.8523 l
0.6598 0.8522 l
0.6614 0.8521 l
0.6629 0.8520 l
0.6645 0.8519 l
0.6661 0.8518 l
0.6676 0.8517 l
0.6692 0.8516 l
0.6708 0.8515 l
0.6724 0.8514 l
0.6739 0.8513 l
0.6755 0.8512 l
0.6771 0.8511 l
0.6786 0.8510 l
0.6802 0.8509 l
0.6818 0.8509 l
0.6833 0.8508 l
0.6849 0.8507 l
0.6865 0.8506 l
0.6880 0.8505 l
0.6896 0.8504 l
0.6912 0.8504 l
0.6927 0.8503 l
0.6943 0.8502 l
0.6959 0.8501 l
0.6975 0.8501 l
0.6990 0.8500 l
0.7006 0.8499 l
0.7022 0.8498 l
0.7037 0.8498 l
0.7053 0.8497 l
0.7069 0.8496 l
0.7084 0.8495 l
0.7100 0.8495 l
0.7116 0.8494 l
0.7131 0.8493 l
0.7147 0.8493 l
0.7163 0.8492 l
0.7178 0.8491 l
0.7194 0.8491 l
0.7210 0.8490 l
0.7225 0.8490 l
0.7241 0.8482 l
0.7257 0.8470 l
0.7273 0.8463 l
0.7288 0.8458 l
0.7304 0.8453 l
0.7320 0.8449 l
0.7335 0.8445 l
0.7351 0.8441 l
0.7367 0.8438 l
0.7382 0.8435 l
0.7398 0.8432 l
0.7414 0.8429 l
0.7429 0.8426 l
0.7445 0.8423 l
0.7461 0.8421 l
0.7476 0.8418 l
0.7492 0.8416 l
0.7508 0.8413 l
0.7524 0.8411 l
0.7539 0.8409 l
0.7555 0.8407 l
0.7571 0.8405 l
0.7586 0.8403 l
0.7602 0.8401 l
0.7618 0.8399 l
0.7633 0.8397 l
0.7649 0.8395 l
0.7665 0.8393 l
0.7680 0.8391 l
0.7696 0.8390 l
0.7712 0.8388 l
0.7727 0.8386 l
0.7743 0.8385 l
0.7759 0.8383 l
0.7775 0.8381 l
0.7790 0.8380 l
0.7806 0.8378 l
0.7822 0.8377 l
0.7837 0.8375 l
0.7853 0.8374 l
0.7869 0.8372 l
0.7884 0.8371 l
0.7900 0.8369 l
0.7916 0.8368 l
0.7931 0.8367 l
0.7947 0.8365 l
0.7963 0.8364 l
0.7978 0.8363 l
0.7994 0.8361 l
0.8010 0.8360 l
0.8025 0.8359 l
0.8041 0.8357 l
0.8057 0.8356 l
0.8073 0.8355 l
0.8088 0.8354 l
0.8104 0.8353 l
0.8120 0.8351 l
0.8135 0.8350 l
0.8151 0.8349 l
0.8167 0.8348 l
0.8182 0.8347 l
0.8198 0.8346 l
0.8214 0.8345 l
0.8229 0.8343 l
0.8245 0.8342 l
0.8261 0.8341 l
0.8276 0.8340 l
0.8292 0.8339 l
0.8308 0.8338 l
0.8324 0.8336 l
0.8339 0.8335 l
0.8355 0.8334 l
0.8371 0.8333 l
0.8386 0.8332 l
0.8402 0.8331 l
0.8418 0.8329 l
0.8433 0.8328 l
0.8449 0.8327 l
0.8465 0.8326 l
0.8480 0.8325 l
0.8496 0.8324 l
0.8512 0.8323 l
0.8527 0.8322 l
0.8543 0.8321 l
0.8559 0.8319 l
0.8575 0.8318 l
0.8590 0.8317 l
0.8606 0.8316 l
0.8622 0.8315 l
0.8637 0.8314 l
0.8653 0.8313 l
0.8669 0.8312 l
0.8684 0.8311 l
0.8700 0.8310 l
0.8716 0.8309 l
0.8731 0.8308 l
0.8747 0.8307 l
0.8763 0.8306 l
0.8778 0.8305 l
0.8794 0.8304 l
0.8810 0.8303 l
0.8825 0.8302 l
0.8841 0.8301 l
0.8857 0.8300 l
0.8873 0.8299 l
0.8888 0.8298 l
0.8904 0.8297 l
0.8920 0.8296 l
0.8935 0.8295 l
0.8951 0.8294 l
0.8967 0.8293 l
0.8982 0.8292 l
0.8998 0.8291 l
0.9014 0.8290 l
0.9029 0.8289 l
0.9045 0.8288 l
0.9061 0.8287 l
0.9076 0.8286 l
0.9092 0.8285 l
0.9108 0.8284 l
0.9124 0.8283 l
0.9139 0.8282 l
0.9155 0.8281 l
0.9171 0.8280 l
0.9186 0.8278 l
0.9202 0.8277 l
0.9218 0.8275 l
0.9233 0.8259 l
0.9249 0.8218 l
0.9265 0.8197 l
0.9280 0.8181 l
0.9296 0.8167 l
0.9312 0.8142 l
0.9327 0.8125 l
0.9343 0.8110 l
0.9359 0.8098 l
0.9375 0.8086 l
0.9390 0.8076 l
0.9406 0.8066 l
0.9422 0.8057 l
0.9437 0.8048 l
0.9453 0.8040 l
0.9469 0.8032 l
0.9484 0.8025 l
0.9500 0.8017 l
s
[/DeviceRGB] SCS
Color4 SC
n
0.1500 0.7233 m
0.1516 0.7235 l
0.1531 0.7237 l
0.1547 0.7238 l
0.1563 0.7240 l
0.1578 0.7242 l
0.1594 0.7243 l
0.1610 0.7245 l
0.1625 0.7246 l
0.1641 0.7248 l
0.1657 0.7249 l
0.1673 0.7251 l
0.1688 0.7252 l
0.1704 0.7253 l
0.1720 0.7255 l
0.1735 0.7256 l
0.1751 0.7258 l
0.1767 0.7259 l
0.1782 0.7260 l
0.1798 0.7262 l
0.1814 0.7263 l
0.1829 0.7264 l
0.1845 0.7266 l
0.1861 0.7267 l
0.1876 0.7268 l
0.1892 0.7269 l
0.1908 0.7270 l
0.1924 0.7272 l
0.1939 0.7273 l
0.1955 0.7274 l
0.1971 0.7275 l
0.1986 0.7276 l
0.2002 0.7278 l
0.2018 0.7279 l
0.2033 0.7280 l
0.2049 0.7281 l
0.2065 0.7282 l
0.2080 0.7283 l
0.2096 0.7284 l
0.2112 0.7285 l
0.2127 0.7286 l
0.2143 0.7287 l
0.2159 0.7288 l
0.2175 0.7289 l
0.2190 0.7290 l
0.2206 0.7291 l
0.2222 0.7292 l
0.2237 0.7293 l
0.2253 0.7294 l
0.2269 0.7295 l
0.2284 0.7296 l
0.2300 0.7297 l
0.2316 0.7298 l
0.2331 0.7299 l
0.2347 0.7300 l
0.2363 0.7301 l
0.2378 0.7302 l
0.2394 0.7303 l
0.2410 0.7304 l
0.2425 0.7304 l
0.2441 0.7305 l
0.2457 0.7306 l
0.2473 0.7307 l
0.2488 0.7308 l
0.2504 0.7309 l
0.2520 0.7310 l
0.2535 0.7310 l
0.2551 0.7311 l
0.2567 0.7312 l
0.2582 0.7313 l
0.2598 0.7314 l
0.2614 0.7315 l
0.2629 0.7315 l
0.2645 0.7316 l
0.2661 0.7317 l
0.2676 0.7318 l
0.2692 0.7318 l
0.2708 0.7319 l
0.2724 0.7320 l
0.2739 0.7321 l
0.2755 0.7321 l
0.2771 0.7322 l
0.2786 0.7323 l
0.2802 0.7324 l
0.2818 0.7324 l
0.2833 0.7325 l
0.2849 0.7326 l
0.2865 0.7327 l
0.2880 0.7328 l
0.2896 0.7328 l
0.2912 0.7329 l
0.2927 0.7330 l
0.2943 0.7331 l
0.2959 0.7331 l
0.2975 0.7332 l
0.2990 0.7333 l
0.3006 0.7333 l
0.3022 0.7334 l
0.3037 0.7335 l
0.3053 0.7336 l
0.3069 0.7336 l
0.3084 0.7337 l
0.3100 0.7338 l
0.3116 0.7338 l
0.3131 0.7339 l
0.3147 0.7340 l
0.3163 0.7340 l
0.3178 0.7341 l
0.3194 0.7342 l
0.3210 0.7342 l
0.3225 0.7343 l
0.3241 0.7344 l
0.3257 0.7344 l
0.3273 0.7345 l
0.3288 0.7346 l
0.3304 0.7346 l
0.3320 0.7347 l
0.3335 0.7348 l
0.3351 0.7348 l
0.3367 0.7349 l
0.3382 0.7349 l
0.3398 0.7350 l
0.3414 0.7351 l
0.3429 0.7351 l
0.3445 0.7352 l
0.3461 0.7352 l
0.3476 0.7353 l
0.3492 0.7353 l
0.3508 0.7354 l
0.3524 0.7354 l
0.3539 0.7355 l
0.3555 0.7355 l
0.3571 0.7356 l
0.3586 0.7356 l
0.3602 0.7357 l
0.3618 0.7357 l
0.3633 0.7358 l
0.3649 0.7358 l
0.3665 0.7358 l
0.3680 0.7359 l
0.3696 0.7359 l
0.3712 0.7360 l
0.3727 0.7360 l
0.3743 0.7361 l
0.3759 0.7361 l
0.3775 0.7362 l
0.3790 0.7362 l
0.3806 0.7362 l
0.3822 0.7363 l
0.3837 0.7363 l
0.3853 0.7364 l
0.3869 0.7364 l
0.3884 0.7365 l
0.3900 0.7365 l
0.3916 0.7365 l
0.3931 0.7366 l
0.3947 0.7366 l
0.3963 0.7367 l
0.3978 0.7367 l
0.3994 0.7368 l
0.4010 0.7368 l
0.4025 0.7368 l
0.4041 0.7369 l
0.4057 0.7369 l
0.4073 0.7370 l
0.4088 0.7370 l
0.4104 0.7371 l
0.4120 0.7371 l
0.4135 0.7371 l
0.4151 0.7372 l
0.4167 0.7372 l
0.4182 0.7373 l
0.4198 0.7373 l
0.4214 0.7373 l
0.4229 0.7374 l
0.4245 0.7374 l
0.4261 0.7375 l
0.4276 0.7375 l
0.4292 0.7376 l
0.4308 0.7376 l
0.4324 0.7376 l
0.4339 0.7377 l
0.4355 0.7377 l
0.4371 0.7378 l
0.4386 0.7378 l
0.4402 0.7378 l
0.4418 0.7379 l
0.4433 0.7379 l
0.4449 0.7380 l
0.4465 0.7380 l
0.4480 0.7381 l
0.4496 0.7381 l
0.4512 0.7381 l
0.4527 0.7382 l
0.4543 0.7382 l
0.4559 0.7383 l
0.4575 0.7383 l
0.4590 0.7383 l
0.4606 0.7384 l
0.4622 0.7384 l
0.4637 0.7385 l
0.4653 0.7385 l
0.4669 0.7385 l
0.4684 0.7386 l
0.4700 0.7386 l
0.4716 0.7387 l
0.4731 0.7387 l
0.4747 0.7387 l
0.4763 0.7388 l
0.4778 0.7388 l
0.4794 0.7388 l
0.4810 0.7389 l
0.4825 0.7389 l
0.4841 0.7390 l
0.4857 0.7390 l
0.4873 0.7390 l
0.4888 0.7391 l
0.4904 0.7391 l
0.4920 0.7392 l
0.4935 0.7392 l
0.4951 0.7392 l
0.4967 0.7393 l
0.4982 0.7393 l
0.4998 0.7393 l
0.5014 0.7394 l
0.5029 0.7394 l
0.5045 0.7395 l
0.5061 0.7395 l
0.5076 0.7395 l
0.5092 0.7396 l
0.5108 0.7396 l
0.5124 0.7396 l
0.5139 0.7397 l
0.5155 0.7397 l
0.5171 0.7397 l
0.5186 0.7395 l
0.5202 0.7393 l
0.5218 0.7392 l
0.5233 0.7391 l
0.5249 0.7390 l
0.5265 0.7390 l
0.5280 0.7389 l
0.5296 0.7389 l
0.5312 0.7388 l
0.5327 0.7388 l
0.5343 0.7387 l
0.5359 0.7387 l
0.5375 0.7387 l
0.5390 0.7386 l
0.5406 0.7386 l
0.5422 0.7385 l
0.5437 0.7384 l
0.5453 0.7383 l
0.5469 0.7380 l
0.5484 0.7375 l
0.5502 0.7321 l
0.5516 0.7297 l
0.5531 0.7271 l
0.5547 0.7242 l
0.5563 0.7219 l
0.5578 0.7212 l
0.5594 0.7205 l
0.5610 0.7199 l
0.5625 0.7194 l
0.5641 0.7189 l
0.5657 0.7185 l
0.5673 0.7180 l
0.5688 0.7176 l
0.5704 0.7173 l
0.5720 0.7169 l
0.5735 0.7166 l
0.5751 0.7162 l
0.5767 0.7159 l
0.5782 0.7156 l
0.5798 0.7154 l
0.5814 0.7151 l
0.5829 0.7148 l
0.5845 0.7146 l
0.5861 0.7143 l
0.5876 0.7141 l
0.5892 0.7139 l
0.5908 0.7137 l
0.5924 0.7135 l
0.5939 0.7133 l
0.5955 0.7131 l
0.5971 0.7129 l
0.5986 0.7127 l
0.6002 0.7125 l
0.6018 0.7123 l
0.6033 0.7122 l
0.6049 0.7120 l
0.6065 0.7118 l
0.6080 0.7117 l
0.6096 0.7115 l
0.6112 0.7114 l
0.6127 0.7112 l
0.6143 0.7111 l
0.6159 0.7110 l
0.6175 0.7108 l
0.6190 0.7107 l
0.6206 0.7106 l
0.6222 0.7105 l
0.6237 0.7103 l
0.6253 0.7102 l
0.6269 0.7101 l
0.6284 0.7100 l
0.6300 0.7099 l
0.6316 0.7098 l
0.6331 0.7097 l
0.6347 0.7096 l
0.6363 0.7095 l
0.6378 0.7094 l
0.6394 0.7093 l
0.6410 0.7092 l
0.6425 0.7091 l
0.6441 0.7090 l
0.6457 0.7089 l
0.6473 0.7088 l
0.6488 0.7087 l
0.6504 0.7087 l
0.6520 0.7086 l
0.6535 0.7085 l
0.6551 0.7084 l
0.6567 0.7084 l
0.6582 0.7083 l
0.6598 0.7082 l
0.6614 0.7081 l
0.6629 0.7081 l
0.6645 0.7080 l
0.6661 0.7079 l
0.6676 0.7079 l
0.6692 0.7078 l
0.6708 0.7077 l
0.6724 0.7077 l
0.6739 0.7076 l
0.6755 0.7075 l
0.6771 0.7075 l
0.6786 0.7074 l
0.6802 0.7074 l
0.6818 0.7073 l
0.6833 0.7073 l
0.6849 0.7072 l
0.6865 0.7072 l
0.6880 0.7071 l
0.6896 0.7070 l
0.6912 0.7070 l
0.6927 0.7070 l
0.6943 0.7069 l
0.6959 0.7069 l
0.6975 0.7068 l
0.6990 0.7068 l
0.7006 0.7067 l
0.7022 0.7067 l
0.7037 0.7066 l
0.7053 0.7066 l
0.7069 0.7065 l
0.7084 0.7065 l
0.7100 0.7065 l
0.7116 0.7064 l
0.7131 0.7064 l
0.7147 0.7064 l
0.7163 0.7063 l
0.7178 0.7063 l
0.7194 0.7062 l
0.7210 0.7062 l
0.7225 0.7062 l
0.7241 0.7055 l
0.7257 0.7043 l
0.7273 0.7036 l
0.7288 0.7031 l
0.7304 0.7027 l
0.7320 0.7023 l
0.7335 0.7019 l
0.7351 0.7016 l
0.7367 0.7012 l
0.7382 0.7010 l
0.7398 0.7007 l
0.7414 0.7004 l
0.7429 0.7002 l
0.7445 0.6999 l
0.7461 0.6997 l
0.7476 0.6995 l
0.7492 0.6993 l
0.7508 0.6991 l
0.7524 0.6989 l
0.7539 0.6987 l
0.7555 0.6985 l
0.7571 0.6983 l
0.7586 0.6981 l
0.7602 0.6980 l
0.7618 0.6978 l
0.7633 0.6976 l
0.7649 0.6975 l
0.7665 0.6973 l
0.7680 0.6972 l
0.7696 0.6970 l
0.7712 0.6969 l
0.7727 0.6967 l
0.7743 0.6966 l
0.7759 0.6964 l
0.7775 0.6963 l
0.7790 0.6962 l
0.7806 0.6960 l
0.7822 0.6959 l
0.7837 0.6958 l
0.7853 0.6957 l
0.7869 0.6955 l
0.7884 0.6954 l
0.7900 0.6953 l
0.7916 0.6952 l
0.7931 0.6951 l
0.7947 0.6950 l
0.7963 0.6949 l
0.7978 0.6948 l
0.7994 0.6947 l
0.8010 0.6945 l
0.8025 0.6944 l
0.8041 0.6943 l
0.8057 0.6942 l
0.8073 0.6941 l
0.8088 0.6941 l
0.8104 0.6940 l
0.8120 0.6939 l
0.8135 0.6938 l
0.8151 0.6937 l
0.8167 0.6936 l
0.8182 0.6935 l
0.8198 0.6934 l
0.8214 0.6933 l
0.8229 0.6932 l
0.8245 0.6931 l
0.8261 0.6930 l
0.8276 0.6930 l
0.8292 0.6929 l
0.8308 0.6928 l
0.8324 0.6927 l
0.8339 0.6926 l
0.8355 0.6925 l
0.8371 0.6924 l
0.8386 0.6923 l
0.8402 0.6922 l
0.8418 0.6921 l
0.8433 0.6920 l
0.8449 0.6920 l
0.8465 0.6919 l
0.8480 0.6918 l
0.8496 0.6917 l
0.8512 0.6916 l
0.8527 0.6915 l
0.8543 0.6914 l
0.8559 0.6913 l
0.8575 0.6913 l
0.8590 0.6912 l
0.8606 0.6911 l
0.8622 0.6910 l
0.8637 0.6909 l
0.8653 0.6908 l
0.8669 0.6908 l
0.8684 0.6907 l
0.8700 0.6906 l
0.8716 0.6905 l
0.8731 0.6904 l
0.8747 0.6904 l
0.8763 0.6903 l
0.8778 0.6902 l
0.8794 0.6901 l
0.8810 0.6900 l
0.8825 0.6900 l
0.8841 0.6899 l
0.8857 0.6898 l
0.8873 0.6897 l
0.8888 0.6897 l
0.8904 0.6896 l
0.8920 0.6895 l
0.8935 0.6894 l
0.8951 0.6894 l
0.8967 0.6893 l
0.8982 0.6892 l
0.8998 0.6891 l
0.9014 0.6891 l
0.9029 0.6890 l
0.9045 0.6889 l
0.9061 0.6888 l
0.9076 0.6888 l
0.9092 0.6887 l
0.9108 0.6886 l
0.9124 0.6886 l
0.9139 0.6885 l
0.9155 0.6884 l
0.9171 0.6883 l
0.9186 0.6881 l
0.9202 0.6880 l
0.9218 0.6879 l
0.9233 0.6863 l
0.9249 0.6822 l
0.9265 0.6801 l
0.9280 0.6785 l
0.9296 0.6772 l
0.9312 0.6747 l
0.9327 0.6730 l
0.9343 0.6716 l
0.9359 0.6704 l
0.9375 0.6692 l
0.9390 0.6682 l
0.9406 0.6673 l
0.9422 0.6664 l
0.9437 0.6655 l
0.9453 0.6647 l
0.9469 0.6639 l
0.9484 0.6632 l
0.9500 0.6625 l
s
[/DeviceRGB] SCS
Color5 SC
n
0.1500 0.2633 m
0.1516 0.2634 l
0.1531 0.2636 l
0.1547 0.2638 l
0.1563 0.2639 l
0.1578 0.2641 l
0.1594 0.2642 l
0.1610 0.2644 l
0.1625 0.2645 l
0.1641 0.2647 l
0.1657 0.2648 l
0.1673 0.2650 l
0.1688 0.2651 l
0.1704 0.2653 l
0.1720 0.2654 l
0.1735 0.2655 l
0.1751 0.2657 l
0.1767 0.2658 l
0.1782 0.2659 l
0.1798 0.2661 l
0.1814 0.2662 l
0.1829 0.2663 l
0.1845 0.2665 l
0.1861 0.2666 l
0.1876 0.2667 l
0.1892 0.2668 l
0.1908 0.2669 l
0.1924 0.2671 l
0.1939 0.2672 l
0.1955 0.2673 l
0.1971 0.2674 l
0.1986 0.2675 l
0.2002 0.2676 l
0.2018 0.2678 l
0.2033 0.2679 l
0.2049 0.2680 l
0.2065 0.2681 l
0.2080 0.2682 l
0.2096 0.2683 l
0.2112 0.2684 l
0.2127 0.2685 l
0.2143 0.2686 l
0.2159 0.2687 l
0.2175 0.2688 l
0.2190 0.2689 l
0.2206 0.2690 l
0.2222 0.2691 l
0.2237 0.2692 l
0.2253 0.2693 l
0.2269 0.2694 l
0.2284 0.2695 l
0.2300 0.2696 l
0.2316 0.2697 l
0.2331 0.2698 l
0.2347 0.2699 l
0.2363 0.2700 l
0.2378 0.2701 l
0.2394 0.2702 l
0.2410 0.2702 l
0.2425 0.2703 l
0.2441 0.2704 l
0.2457 0.2705 l
0.2473 0.2706 l
0.2488 0.2707 l
0.2504 0.2708 l
0.2520 0.2708 l
0.2535 0.2709 l
0.2551 0.2710 l
0.2567 0.2711 l
0.2582 0.2712 l
0.2598 0.2713 l
0.2614 0.2713 l
0.2629 0.2714 l
0.2645 0.2715 l
0.2661 0.2716 l
0.2676 0.2716 l
0.2692 0.2717 l
0.2708 0.2718 l
0.2724 0.2719 l
0.2739 0.2720 l
0.2755 0.2720 l
0.2771 0.2721 l
0.2786 0.2722 l
0.2802 0.2722 l
0.2818 0.2723 l
0.2833 0.2724 l
0.2849 0.2725 l
0.2865 0.2726 l
0.2880 0.2726 l
0.2896 0.2727 l
0.2912 0.2728 l
0.2927 0.2729 l
0.2943 0.2729 l
0.2959 0.2730 l
0.2975 0.2731 l
0.2990 0.2732 l
0.3006 0.2732 l
0.3022 0.2733 l
0.3037 0.2734 l
0.3053 0.2734 l
0.3069 0.2735 l
0.3084 0.2736 l
0.3100 0.2737 l
0.3116 0.2737 l
0.3131 0.2738 l
0.3147 0.2739 l
0.3163 0.2739 l
0.3178 0.2740 l
0.3194 0.2741 l
0.3210 0.2741 l
0.3225 0.2742 l
0.3241 0.2743 l
0.3257 0.2743 l
0.3273 0.2744 l
0.3288 0.2744 l
0.3304 0.2745 l
0.3320 0.2746 l
0.3335 0.2746 l
0.3351 0.2747 l
0.3367 0.2748 l
0.3382 0.2748 l
0.3398 0.2749 l
0.3414 0.2749 l
0.3429 0.2750 l
0.3445 0.2751 l
0.3461 0.2751 l
0.3476 0.2752 l
0.3492 0.2752 l
0.3508 0.2753 l
0.3524 0.2753 l
0.3539 0.2754 l
0.3555 0.2754 l
0.3571 0.2755 l
0.3586 0.2755 l
0.3602 0.2756 l
0.3618 0.2756 l
0.3633 0.2756 l
0.3649 0.2757 l
0.3665 0.2757 l
0.3680 0.2758 l
0.3696 0.2758 l
0.3712 0.2759 l
0.3727 0.2759 l
0.3743 0.2759 l
0.3759 0.2760 l
0.3775 0.2760 l
0.3790 0.2761 l
0.3806 0.2761 l
0.3822 0.2762 l
0.3837 0.2762 l
0.3853 0.2763 l
0.3869 0.2763 l
0.3884 0.2763 l
0.3900 0.2764 l
0.3916 0.2764 l
0.3931 0.2765 l
0.3947 0.2765 l
0.3963 0.2766 l
0.3978 0.2766 l
0.3994 0.2766 l
0.4010 0.2767 l
0.4025 0.2767 l
0.4041 0.2768 l
0.4057 0.2768 l
0.4073 0.2769 l
0.4088 0.2769 l
0.4104 0.2769 l
0.4120 0.2770 l
0.4135 0.2770 l
0.4151 0.2771 l
0.4167 0.2771 l
0.4182 0.2771 l
0.4198 0.2772 l
0.4214 0.2772 l
0.4229 0.2773 l
0.4245 0.2773 l
0.4261 0.2774 l
0.4276 0.2774 l
0.4292 0.2774 l
0.4308 0.2775 l
0.4324 0.2775 l
0.4339 0.2776 l
0.4355 0.2776 l
0.4371 0.2777 l
0.4386 0.2777 l
0.4402 0.2777 l
0.4418 0.2778 l
0.4433 0.2778 l
0.4449 0.2779 l
0.4465 0.2779 l
0.4480 0.2779 l
0.4496 0.2780 l
0.4512 0.2780 l
0.4527 0.2781 l
0.4543 0.2781 l
0.4559 0.2781 l
0.4575 0.2782 l
0.4590 0.2782 l
0.4606 0.2783 l
0.4622 0.2783 l
0.4637 0.2783 l
0.4653 0.2784 l
0.4669 0.2784 l
0.4684 0.2785 l
0.4700 0.2785 l
0.4716 0.2785 l
0.4731 0.2786 l
0.4747 0.2786 l
0.4763 0.2787 l
0.4778 0.2787 l
0.4794 0.2787 l
0.4810 0.2788 l
0.4825 0.2788 l
0.4841 0.2789 l
0.4857 0.2789 l
0.4873 0.2789 l
0.4888 0.2790 l
0.4904 0.2790 l
0.4920 0.2790 l
0.4935 0.2791 l
0.4951 0.2791 l
0.4967 0.2792 l
0.4982 0.2792 l
0.4998 0.2792 l
0.5014 0.2793 l
0.5029 0.2793 l
0.5045 0.2794 l
0.5061 0.2794 l
0.5076 0.2794 l
0.5092 0.2795 l
0.5108 0.2795 l
0.5124 0.2795 l
0.5139 0.2796 l
0.5155 0.2796 l
0.5171 0.2796 l
0.5186 0.2794 l
0.5202 0.2792 l
0.5218 0.2791 l
0.5233 0.2790 l
0.5249 0.2789 l
0.5265 0.2789 l
0.5280 0.2788 l
0.5296 0.2788 l
0.5312 0.2787 l
0.5327 0.2787 l
0.5343 0.2786 l
0.5359 0.2786 l
0.5375 0.2786 l
0.5390 0.2785 l
0.5406 0.2785 l
0.5422 0.2784 l
0.5437 0.2783 l
0.5453 0.2782 l
0.5469 0.2779 l
0.5484 0.2774 l
0.5502 0.2720 l
0.5516 0.2696 l
0.5531 0.2670 l
0.5547 0.2641 l
0.5563 0.2618 l
0.5578 0.2611 l
0.5594 0.2604 l
0.5610 0.2598 l
0.5625 0.2593 l
0.5641 0.2588 l
0.5657 0.2584 l
0.5673 0.2579 l
0.5688 0.2575 l
0.5704 0.2572 l
0.5720 0.2568 l
0.5735 0.2565 l
0.5751 0.2561 l
0.5767 0.2558 l
0.5782 0.2555 l
0.5798 0.2553 l
0.5814 0.2550 l
0.5829 0.2547 l
0.5845 0.2545 l
0.5861 0.2542 l
0.5876 0.2540 l
0.5892 0.2538 l
0.5908 0.2536 l
0.5924 0.2534 l
0.5939 0.2532 l
0.5955 0.2530 l
0.5971 0.2528 l
0.5986 0.2526 l
0.6002 0.2524 l
0.6018 0.2522 l
0.6033 0.2521 l
0.6049 0.2519 l
0.6065 0.2518 l
0.6080 0.2516 l
0.6096 0.2514 l
0.6112 0.2513 l
0.6127 0.2512 l
0.6143 0.2510 l
0.6159 0.2509 l
0.6175 0.2508 l
0.6190 0.2506 l
0.6206 0.2505 l
0.6222 0.2504 l
0.6237 0.2503 l
0.6253 0.2501 l
0.6269 0.2500 l
0.6284 0.2499 l
0.6300 0.2498 l
0.6316 0.2497 l
0.6331 0.2496 l
0.6347 0.2495 l
0.6363 0.2494 l
0.6378 0.2493 l
0.6394 0.2492 l
0.6410 0.2491 l
0.6425 0.2490 l
0.6441 0.2489 l
0.6457 0.2488 l
0.6473 0.2488 l
0.6488 0.2487 l
0.6504 0.2486 l
0.6520 0.2485 l
0.6535 0.2484 l
0.6551 0.2484 l
0.6567 0.2483 l
0.6582 0.2482 l
0.6598 0.2481 l
0.6614 0.2481 l
0.6629 0.2480 l
0.6645 0.2479 l
0.6661 0.2479 l
0.6676 0.2478 l
0.6692 0.2477 l
0.6708 0.2477 l
0.6724 0.2476 l
0.6739 0.2475 l
0.6755 0.2475 l
0.6771 0.2474 l
0.6786 0.2474 l
0.6802 0.2473 l
0.6818 0.2472 l
0.6833 0.2472 l
0.6849 0.2471 l
0.6865 0.2471 l
0.6880 0.2470 l
0.6896 0.2470 l
0.6912 0.2469 l
0.6927 0.2469 l
0.6943 0.2468 l
0.6959 0.2468 l
0.6975 0.2467 l
0.6990 0.2467 l
0.7006 0.2467 l
0.7022 0.2466 l
0.7037 0.2466 l
0.7053 0.2465 l
0.7069 0.2465 l
0.7084 0.2464 l
0.7100 0.2464 l
0.7116 0.2464 l
0.7131 0.2463 l
0.7147 0.2463 l
0.7163 0.2463 l
0.7178 0.2462 l
0.7194 0.2462 l
0.7210 0.2462 l
0.7225 0.2461 l
0.7241 0.2454 l
0.7257 0.2443 l
0.7273 0.2436 l
0.7288 0.2431 l
0.7304 0.2426 l
0.7320 0.2422 l
0.7335 0.2418 l
0.7351 0.2415 l
0.7367 0.2412 l
0.7382 0.2409 l
0.7398 0.2406 l
0.7414 0.2404 l
0.7429 0.2401 l
0.7445 0.2399 l
0.7461 0.2397 l
0.7476 0.2394 l
0.7492 0.2392 l
0.7508 0.2390 l
0.7524 0.2388 l
0.7539 0.2386 l
0.7555 0.2384 l
0.7571 0.2383 l
0.7586 0.2381 l
0.7602 0.2379 l
0.7618 0.2377 l
0.7633 0.2376 l
0.7649 0.2374 l
0.7665 0.2373 l
0.7680 0.2371 l
0.7696 0.2370 l
0.7712 0.2368 l
0.7727 0.2367 l
0.7743 0.2365 l
0.7759 0.2364 l
0.7775 0.2363 l
0.7790 0.2361 l
0.7806 0.2360 l
0.7822 0.2359 l
0.7837 0.2358 l
0.7853 0.2356 l
0.7869 0.2355 l
0.7884 0.2354 l
0.7900 0.2353 l
0.7916 0.2352 l
0.7931 0.2351 l
0.7947 0.2349 l
0.7963 0.2348 l
0.7978 0.2347 l
0.7994 0.2346 l
0.8010 0.2345 l
0.8025 0.2344 l
0.8041 0.2343 l
0.8057 0.2342 l
0.8073 0.2341 l
0.8088 0.2340 l
0.8104 0.2339 l
0.8120 0.2338 l
0.8135 0.2338 l
0.8151 0.2337 l
0.8167 0.2336 l
0.8182 0.2335 l
0.8198 0.2334 l
0.8214 0.2333 l
0.8229 0.2332 l
0.8245 0.2331 l
0.8261 0.2330 l
0.8276 0.2329 l
0.8292 0.2329 l
0.8308 0.2328 l
0.8324 0.2327 l
0.8339 0.2326 l
0.8355 0.2325 l
0.8371 0.2324 l
0.8386 0.2323 l
0.8402 0.2322 l
0.8418 0.2321 l
0.8433 0.2320 l
0.8449 0.2320 l
0.8465 0.2319 l
0.8480 0.2318 l
0.8496 0.2317 l
0.8512 0.2316 l
0.8527 0.2315 l
0.8543 0.2314 l
0.8559 0.2313 l
0.8575 0.2313 l
0.8590 0.2312 l
0.8606 0.2311 l
0.8622 0.2310 l
0.8637 0.2309 l
0.8653 0.2308 l
0.8669 0.2308 l
0.8684 0.2307 l
0.8700 0.2306 l
0.8716 0.2305 l
0.8731 0.2304 l
0.8747 0.2304 l
0.8763 0.2303 l
0.8778 0.2302 l
0.8794 0.2301 l
0.8810 0.2301 l
0.8825 0.2300 l
0.8841 0.2299 l
0.8857 0.2298 l
0.8873 0.2297 l
0.8888 0.2297 l
0.8904 0.2296 l
0.8920 0.2295 l
0.8935 0.2295 l
0.8951 0.2294 l
0.8967 0.2293 l
0.8982 0.2292 l
0.8998 0.2292 l
0.9014 0.2291 l
0.9029 0.2290 l
0.9045 0.2290 l
0.9061 0.2289 l
0.9076 0.2288 l
0.9092 0.2287 l
0.9108 0.2287 l
0.9124 0.2286 l
0.9139 0.2285 l
0.9155 0.2285 l
0.9171 0.2283 l
0.9186 0.2282 l
0.9202 0.2281 l
0.9218 0.2280 l
0.9233 0.2264 l
0.9249 0.2223 l
0.9265 0.2202 l
0.9280 0.2186 l
0.9296 0.2173 l
0.9312 0.2148 l
0.9327 0.2131 l
0.9343 0.2117 l
0.9359 0.2105 l
0.9375 0.2093 l
0.9390 0.2083 l
0.9406 0.2073 l
0.9422 0.2064 l
0.9437 0.2056 l
0.9453 0.2048 l
0.9469 0.2040 l
0.9484 0.2033 l
0.9500 0.2026 l
s
[/DeviceRGB] SCS
Color1 SC
[] 0 SD
0.0015 SLW
n
0.1971 0.1500 m
0.1971 0.1600 l
s
n
0.1971 0.9000 m
0.1971 0.8900 l
s
n
0.2284 0.1500 m
0.2284 0.1600 l
s
n
0.2284 0.9000 m
0.2284 0.8900 l
s
n
0.2598 0.1500 m
0.2598 0.1600 l
s
n
0.2598 0.9000 m
0.2598 0.8900 l
s
n
0.2912 0.1500 m
0.2912 0.1600 l
s
n
0.2912 0.9000 m
0.2912 0.8900 l
s
n
0.3539 0.1500 m
0.3539 0.1600 l
s
n
0.3539 0.9000 m
0.3539 0.8900 l
s
n
0.3853 0.1500 m
0.3853 0.1600 l
s
n
0.3853 0.9000 m
0.3853 0.8900 l
s
n
0.4167 0.1500 m
0.4167 0.1600 l
s
n
0.4167 0.9000 m
0.4167 0.8900 l
s
n
0.4480 0.1500 m
0.4480 0.1600 l
s
n
0.4480 0.9000 m
0.4480 0.8900 l
s
n
0.5108 0.1500 m
0.5108 0.1600 l
s
n
0.5108 0.9000 m
0.5108 0.8900 l
s
n
0.5422 0.1500 m
0.5422 0.1600 l
s
n
0.5422 0.9000 m
0.5422 0.8900 l
s
n
0.5735 0.1500 m
0.5735 0.1600 l
s
n
0.5735 0.9000 m
0.5735 0.8900 l
s
n
0.6049 0.1500 m
0.6049 0.1600 l
s
n
0.6049 0.9000 m
0.6049 0.8900 l
s
n
0.6676 0.1500 m
0.6676 0.1600 l
s
n
0.6676 0.9000 m
0.6676 0.8900 l
s
n
0.6990 0.1500 m
0.6990 0.1600 l
s
n
0.6990 0.9000 m
0.6990 0.8900 l
s
n
0.7304 0.1500 m
0.7304 0.1600 l
s
n
0.7304 0.9000 m
0.7304 0.8900 l
s
n
0.7618 0.1500 m
0.7618 0.1600 l
s
n
0.7618 0.9000 m
0.7618 0.8900 l
s
n
0.8245 0.1500 m
0.8245 0.1600 l
s
n
0.8245 0.9000 m
0.8245 0.8900 l
s
n
0.8559 0.1500 m
0.8559 0.1600 l
s
n
0.8559 0.9000 m
0.8559 0.8900 l
s
n
0.8873 0.1500 m
0.8873 0.1600 l
s
n
0.8873 0.9000 m
0.8873 0.8900 l
s
n
0.9186 0.1500 m
0.9186 0.1600 l
s
n
0.9186 0.9000 m
0.9186 0.8900 l
s
n
0.1657 0.1500 m
0.1657 0.1700 l
s
n
0.1657 0.9000 m
0.1657 0.8800 l
s
n
0.3225 0.1500 m
0.3225 0.1700 l
s
n
0.3225 0.9000 m
0.3225 0.8800 l
s
n
0.4794 0.1500 m
0.4794 0.1700 l
s
n
0.4794 0.9000 m
0.4794 0.8800 l
s
n
0.6363 0.1500 m
0.6363 0.1700 l
s
n
0.6363 0.9000 m
0.6363 0.8800 l
s
n
0.7931 0.1500 m
0.7931 0.1700 l
s
n
0.7931 0.9000 m
0.7931 0.8800 l
s
n
0.9500 0.1500 m
0.9500 0.1700 l
s
n
0.9500 0.9000 m
0.9500 0.8800 l
s
/Helvetica findfont
dup length dict begin
 {1 index /FID ne {def} {pop pop} ifelse} forall
 /Encoding DefEncoding def
 currentdict
end
/Font4 exch definefont pop
/Font4 FFSF
0.1431 0.1200 m
GS
[0.0280 0.0000 0.0000 0.0280 0 0] CC
(100) show
GR
/Font4 FFSF
0.3000 0.1200 m
GS
[0.0280 0.0000 0.0000 0.0280 0 0] CC
(200) show
GR
/Font4 FFSF
0.4569 0.1200 m
GS
[0.0280 0.0000 0.0000 0.0280 0 0] CC
(300) show
GR
/Font4 FFSF
0.6137 0.1200 m
GS
[0.0280 0.0000 0.0000 0.0280 0 0] CC
(400) show
GR
/Font4 FFSF
0.7706 0.1200 m
GS
[0.0280 0.0000 0.0000 0.0280 0 0] CC
(500) show
GR
/Font4 FFSF
0.9275 0.1200 m
GS
[0.0280 0.0000 0.0000 0.0280 0 0] CC
(600) show
GR
/Font4 FFSF
0.4818 0.0845 m
GS
[0.0336 0.0000 0.0000 0.0336 0 0] CC
(M) show
GR
/Font4 FFSF
0.5096 0.0711 m
GS
[0.0238 0.0000 0.0000 0.0238 0 0] CC
(A) show
GR
/Font4 FFSF
0.5253 0.0845 m
GS
[0.0336 0.0000 0.0000 0.0336 0 0] CC
( [GeV]) show
GR
n
0.1500 0.2064 m
0.1600 0.2064 l
s
n
0.9500 0.2064 m
0.9400 0.2064 l
s
n
0.1500 0.2395 m
0.1600 0.2395 l
s
n
0.9500 0.2395 m
0.9400 0.2395 l
s
n
0.1500 0.2629 m
0.1600 0.2629 l
s
n
0.9500 0.2629 m
0.9400 0.2629 l
s
n
0.1500 0.2811 m
0.1600 0.2811 l
s
n
0.9500 0.2811 m
0.9400 0.2811 l
s
n
0.1500 0.2959 m
0.1600 0.2959 l
s
n
0.9500 0.2959 m
0.9400 0.2959 l
s
n
0.1500 0.3085 m
0.1600 0.3085 l
s
n
0.9500 0.3085 m
0.9400 0.3085 l
s
n
0.1500 0.3193 m
0.1600 0.3193 l
s
n
0.9500 0.3193 m
0.9400 0.3193 l
s
n
0.1500 0.3289 m
0.1600 0.3289 l
s
n
0.9500 0.3289 m
0.9400 0.3289 l
s
n
0.1500 0.3375 m
0.1600 0.3375 l
s
n
0.9500 0.3375 m
0.9400 0.3375 l
s
n
0.1500 0.3939 m
0.1600 0.3939 l
s
n
0.9500 0.3939 m
0.9400 0.3939 l
s
n
0.1500 0.4270 m
0.1600 0.4270 l
s
n
0.9500 0.4270 m
0.9400 0.4270 l
s
n
0.1500 0.4504 m
0.1600 0.4504 l
s
n
0.9500 0.4504 m
0.9400 0.4504 l
s
n
0.1500 0.4686 m
0.1600 0.4686 l
s
n
0.9500 0.4686 m
0.9400 0.4686 l
s
n
0.1500 0.4834 m
0.1600 0.4834 l
s
n
0.9500 0.4834 m
0.9400 0.4834 l
s
n
0.1500 0.4960 m
0.1600 0.4960 l
s
n
0.9500 0.4960 m
0.9400 0.4960 l
s
n
0.1500 0.5068 m
0.1600 0.5068 l
s
n
0.9500 0.5068 m
0.9400 0.5068 l
s
n
0.1500 0.5164 m
0.1600 0.5164 l
s
n
0.9500 0.5164 m
0.9400 0.5164 l
s
n
0.1500 0.5250 m
0.1600 0.5250 l
s
n
0.9500 0.5250 m
0.9400 0.5250 l
s
n
0.1500 0.5814 m
0.1600 0.5814 l
s
n
0.9500 0.5814 m
0.9400 0.5814 l
s
n
0.1500 0.6145 m
0.1600 0.6145 l
s
n
0.9500 0.6145 m
0.9400 0.6145 l
s
n
0.1500 0.6379 m
0.1600 0.6379 l
s
n
0.9500 0.6379 m
0.9400 0.6379 l
s
n
0.1500 0.6561 m
0.1600 0.6561 l
s
n
0.9500 0.6561 m
0.9400 0.6561 l
s
n
0.1500 0.6709 m
0.1600 0.6709 l
s
n
0.9500 0.6709 m
0.9400 0.6709 l
s
n
0.1500 0.6835 m
0.1600 0.6835 l
s
n
0.9500 0.6835 m
0.9400 0.6835 l
s
n
0.1500 0.6943 m
0.1600 0.6943 l
s
n
0.9500 0.6943 m
0.9400 0.6943 l
s
n
0.1500 0.7039 m
0.1600 0.7039 l
s
n
0.9500 0.7039 m
0.9400 0.7039 l
s
n
0.1500 0.7125 m
0.1600 0.7125 l
s
n
0.9500 0.7125 m
0.9400 0.7125 l
s
n
0.1500 0.7689 m
0.1600 0.7689 l
s
n
0.9500 0.7689 m
0.9400 0.7689 l
s
n
0.1500 0.8020 m
0.1600 0.8020 l
s
n
0.9500 0.8020 m
0.9400 0.8020 l
s
n
0.1500 0.8254 m
0.1600 0.8254 l
s
n
0.9500 0.8254 m
0.9400 0.8254 l
s
n
0.1500 0.8436 m
0.1600 0.8436 l
s
n
0.9500 0.8436 m
0.9400 0.8436 l
s
n
0.1500 0.8584 m
0.1600 0.8584 l
s
n
0.9500 0.8584 m
0.9400 0.8584 l
s
n
0.1500 0.8710 m
0.1600 0.8710 l
s
n
0.9500 0.8710 m
0.9400 0.8710 l
s
n
0.1500 0.8818 m
0.1600 0.8818 l
s
n
0.9500 0.8818 m
0.9400 0.8818 l
s
n
0.1500 0.8914 m
0.1600 0.8914 l
s
n
0.9500 0.8914 m
0.9400 0.8914 l
s
n
0.1500 0.9000 m
0.1600 0.9000 l
s
n
0.9500 0.9000 m
0.9400 0.9000 l
s
n
0.1500 0.1500 m
0.1700 0.1500 l
s
n
0.9500 0.1500 m
0.9300 0.1500 l
s
n
0.1500 0.3375 m
0.1700 0.3375 l
s
n
0.9500 0.3375 m
0.9300 0.3375 l
s
n
0.1500 0.5250 m
0.1700 0.5250 l
s
n
0.9500 0.5250 m
0.9300 0.5250 l
s
n
0.1500 0.7125 m
0.1700 0.7125 l
s
n
0.9500 0.7125 m
0.9300 0.7125 l
s
n
0.1500 0.9000 m
0.1700 0.9000 l
s
n
0.9500 0.9000 m
0.9300 0.9000 l
s
/Font4 FFSF
0.0922 0.1349 m
GS
[0.0280 0.0000 0.0000 0.0280 0 0] CC
(10) show
GR
/Font4 FFSF
0.1231 0.1517 m
GS
[0.0198 0.0000 0.0000 0.0198 0 0] CC
(-4) show
GR
/Font4 FFSF
0.0922 0.3224 m
GS
[0.0280 0.0000 0.0000 0.0280 0 0] CC
(10) show
GR
/Font4 FFSF
0.1231 0.3392 m
GS
[0.0198 0.0000 0.0000 0.0198 0 0] CC
(-3) show
GR
/Font4 FFSF
0.0922 0.5099 m
GS
[0.0280 0.0000 0.0000 0.0280 0 0] CC
(10) show
GR
/Font4 FFSF
0.1231 0.5267 m
GS
[0.0198 0.0000 0.0000 0.0198 0 0] CC
(-2) show
GR
/Font4 FFSF
0.0957 0.6974 m
GS
[0.0280 0.0000 0.0000 0.0280 0 0] CC
(10) show
GR
/Font4 FFSF
0.1267 0.7142 m
GS
[0.0198 0.0000 0.0000 0.0198 0 0] CC
(-1) show
GR
/Font4 FFSF
0.0988 0.8849 m
GS
[0.0280 0.0000 0.0000 0.0280 0 0] CC
(10) show
GR
/Font4 FFSF
0.1298 0.9017 m
GS
[0.0198 0.0000 0.0000 0.0198 0 0] CC
(0) show
GR
/Font4 FFSF
0.0751 0.4805 m
GS
[0.0000 0.0336 -0.0336 0.0000 0 0] CC
(BR\(A\)) show
GR
n
0.1500 0.1500 m
0.1500 0.9000 l
0.9500 0.9000 l
0.9500 0.1500 l
0.1500 0.1500 l
c
s
n
0.7000 0.5500 m
0.7000 0.3449 l
0.9143 0.3449 l
0.9143 0.5500 l
c
[/DeviceRGB] SCS
Color0 SC
fill
[/DeviceRGB] SCS
Color1 SC
n
0.7000 0.5500 m
0.7000 0.3449 l
0.9143 0.3449 l
0.9143 0.5500 l
0.7000 0.5500 l
c
s
/Font4 FFSF
0.7862 0.4935 m
GS
[0.0224 0.0000 0.0000 0.0224 0 0] CC
(BR\(A -> tt\)) show
GR
[/DeviceRGB] SCS
Color2 SC
[] 0 SD
0.0045 SLW
n
0.7122 0.4994 m
0.7722 0.4994 l
s
/Font4 FFSF
[/DeviceRGB] SCS
Color1 SC
0.7862 0.4524 m
GS
[0.0224 0.0000 0.0000 0.0224 0 0] CC
(BR\(A -> bb\)) show
GR
[/DeviceRGB] SCS
Color3 SC
n
0.7122 0.4582 m
0.7722 0.4582 l
s
/Font4 FFSF
[/DeviceRGB] SCS
Color1 SC
0.7862 0.4112 m
GS
[0.0224 0.0000 0.0000 0.0224 0 0] CC
(BR\(A -> ) show
GR
/Symbol findfont
/Font12 exch definefont pop
/Font12 FFSF
0.8729 0.4112 m
GS
[0.0224 0.0000 0.0000 0.0224 0 0] CC
(tt) show
GR
/Font4 FFSF
0.8925 0.4112 m
GS
[0.0224 0.0000 0.0000 0.0224 0 0] CC
(\)) show
GR
[/DeviceRGB] SCS
Color4 SC
n
0.7122 0.4171 m
0.7722 0.4171 l
s
/Font4 FFSF
[/DeviceRGB] SCS
Color1 SC
0.7862 0.3700 m
GS
[0.0224 0.0000 0.0000 0.0224 0 0] CC
(BR\(A -> ) show
GR
/Font12 FFSF
0.8729 0.3700 m
GS
[0.0224 0.0000 0.0000 0.0224 0 0] CC
(mm) show
GR
/Font4 FFSF
0.8988 0.3700 m
GS
[0.0224 0.0000 0.0000 0.0224 0 0] CC
(\)) show
GR
[/DeviceRGB] SCS
Color5 SC
n
0.7122 0.3757 m
0.7722 0.3757 l
s
/Font4 FFSF
[/DeviceRGB] SCS
Color1 SC
0.9700 0.7000 m
GS
[0.0000 0.0168 -0.0168 0.0000 0 0] CC
(LHC Higgs XS WG 2013) show
GR
/Font4 FFSF
0.7150 0.5250 m
GS
[0.0224 0.0000 0.0000 0.0224 0 0] CC
(light stop, tan) show
GR
/Font12 FFSF
0.8483 0.5250 m
GS
[0.0224 0.0000 0.0000 0.0224 0 0] CC
(b) show
GR
/Font4 FFSF
0.8605 0.5250 m
GS
[0.0224 0.0000 0.0000 0.0224 0 0] CC
( = 10) show
GR
%%Trailer
%%BoundingBox: 30 42 597 562
%%DocumentNeededResources: font Helvetica
%%+ font Symbol
%%EOF
