%!PS-Adobe-1.0
%%Creator: Unified Graphics System
%%Pages: (atend)
%%DocumentFonts: Helvetica
%%BoundingBox:   50   83  469  413
%%EndComments
/Sw{setlinewidth}def
/Sg{setgray}def
/Sd{setdash}def
/P {newpath
    moveto
0 0 rlineto
    stroke}def
/M {moveto}def
/D {lineto}def
/N {newpath}def
/S {stroke}def
/T {/Helvetica findfont
    exch
    scalefont
    setfont}def
/R {rotate}def
/W {show}def
/F {fill}def
/X {gsave}def
/Y {grestore}def
%%EndProlog
%%Page: 1 1
0.12000 0.12000 scale
1 setlinecap
1 setlinejoin
4 Sw
0.00 0.00 0.00 setrgbcolor
[] 0 Sd
N
785 3414 M
785 992 D
S
N
785 992 M
3761 992 D
S
N
3761 992 M
3761 3414 D
S
N
3761 3414 M
785 3414 D
S
N
785 992 M
785 1096 D
S
N
904 1027 M
904 992 D
S
N
1023 992 M
1023 1027 D
S
N
1142 1027 M
1142 992 D
S
N
1261 992 M
1261 1027 D
S
N
1381 1096 M
1381 992 D
S
N
1500 992 M
1500 1027 D
S
N
1619 1027 M
1619 992 D
S
N
1738 992 M
1738 1027 D
S
N
1857 1027 M
1857 992 D
S
N
1976 992 M
1976 1096 D
S
N
2095 1027 M
2095 992 D
S
N
2214 992 M
2214 1027 D
S
N
2333 1027 M
2333 992 D
S
N
2452 992 M
2452 1027 D
S
N
2571 1096 M
2571 992 D
S
N
2690 992 M
2690 1027 D
S
N
2809 1027 M
2809 992 D
S
N
2928 992 M
2928 1027 D
S
N
3047 1027 M
3047 992 D
S
N
3166 992 M
3166 1096 D
S
N
3285 1027 M
3285 992 D
S
N
3404 992 M
3404 1027 D
S
N
3523 1027 M
3523 992 D
S
N
3642 992 M
3642 1027 D
S
N
739 923 M
742 920 D
739 918 D
736 920 D
736 923 D
739 929 D
742 932 D
751 935 D
762 935 D
771 932 D
774 929 D
777 923 D
777 918 D
774 912 D
765 906 D
751 900 D
745 897 D
739 892 D
736 883 D
736 874 D
S
N
762 935 M
768 932 D
771 929 D
774 923 D
774 918 D
771 912 D
762 906 D
751 900 D
S
N
736 880 M
739 883 D
745 883 D
759 877 D
768 877 D
774 880 D
777 883 D
S
N
745 883 M
759 874 D
771 874 D
774 877 D
777 883 D
777 889 D
S
N
811 935 M
803 932 D
797 923 D
794 909 D
794 900 D
797 886 D
803 877 D
811 874 D
817 874 D
826 877 D
832 886 D
834 900 D
834 909 D
832 923 D
826 932 D
817 935 D
811 935 D
S
N
811 935 M
806 932 D
803 929 D
800 923 D
797 909 D
797 900 D
800 886 D
803 880 D
806 877 D
811 874 D
S
N
817 874 M
823 877 D
826 880 D
829 886 D
832 900 D
832 909 D
829 923 D
826 929 D
823 932 D
817 935 D
S
N
1357 929 M
1357 874 D
S
N
1360 935 M
1360 874 D
S
N
1360 935 M
1329 892 D
1375 892 D
S
N
1349 874 M
1369 874 D
S
N
1406 935 M
1398 932 D
1392 923 D
1389 909 D
1389 900 D
1392 886 D
1398 877 D
1406 874 D
1412 874 D
1421 877 D
1427 886 D
1430 900 D
1430 909 D
1427 923 D
1421 932 D
1412 935 D
1406 935 D
S
N
1406 935 M
1401 932 D
1398 929 D
1395 923 D
1392 909 D
1392 900 D
1395 886 D
1398 880 D
1401 877 D
1406 874 D
S
N
1412 874 M
1418 877 D
1421 880 D
1424 886 D
1427 900 D
1427 909 D
1424 923 D
1421 929 D
1418 932 D
1412 935 D
S
N
1961 926 M
1958 923 D
1961 920 D
1964 923 D
1964 926 D
1961 932 D
1955 935 D
1947 935 D
1938 932 D
1932 926 D
1930 920 D
1927 909 D
1927 892 D
1930 883 D
1935 877 D
1944 874 D
1950 874 D
1958 877 D
1964 883 D
1967 892 D
1967 895 D
1964 903 D
1958 909 D
1950 912 D
1947 912 D
1938 909 D
1932 903 D
1930 895 D
S
N
1947 935 M
1941 932 D
1935 926 D
1932 920 D
1930 909 D
1930 892 D
1932 883 D
1938 877 D
1944 874 D
S
N
1950 874 M
1955 877 D
1961 883 D
1964 892 D
1964 895 D
1961 903 D
1955 909 D
1950 912 D
S
N
2002 935 M
1993 932 D
1987 923 D
1984 909 D
1984 900 D
1987 886 D
1993 877 D
2002 874 D
2007 874 D
2016 877 D
2022 886 D
2025 900 D
2025 909 D
2022 923 D
2016 932 D
2007 935 D
2002 935 D
S
N
2002 935 M
1996 932 D
1993 929 D
1990 923 D
1987 909 D
1987 900 D
1990 886 D
1993 880 D
1996 877 D
2002 874 D
S
N
2007 874 M
2013 877 D
2016 880 D
2019 886 D
2022 900 D
2022 909 D
2019 923 D
2016 929 D
2013 932 D
2007 935 D
S
N
2536 935 M
2528 932 D
2525 926 D
2525 918 D
2528 912 D
2536 909 D
2548 909 D
2556 912 D
2559 918 D
2559 926 D
2556 932 D
2548 935 D
2536 935 D
S
N
2536 935 M
2530 932 D
2528 926 D
2528 918 D
2530 912 D
2536 909 D
S
N
2548 909 M
2553 912 D
2556 918 D
2556 926 D
2553 932 D
2548 935 D
S
N
2536 909 M
2528 906 D
2525 903 D
2522 897 D
2522 886 D
2525 880 D
2528 877 D
2536 874 D
2548 874 D
2556 877 D
2559 880 D
2562 886 D
2562 897 D
2559 903 D
2556 906 D
2548 909 D
S
N
2536 909 M
2530 906 D
2528 903 D
2525 897 D
2525 886 D
2528 880 D
2530 877 D
2536 874 D
S
N
2548 874 M
2553 877 D
2556 880 D
2559 886 D
2559 897 D
2556 903 D
2553 906 D
2548 909 D
S
N
2597 935 M
2588 932 D
2582 923 D
2579 909 D
2579 900 D
2582 886 D
2588 877 D
2597 874 D
2602 874 D
2611 877 D
2617 886 D
2620 900 D
2620 909 D
2617 923 D
2611 932 D
2602 935 D
2597 935 D
S
N
2597 935 M
2591 932 D
2588 929 D
2585 923 D
2582 909 D
2582 900 D
2585 886 D
2588 880 D
2591 877 D
2597 874 D
S
N
2602 874 M
2608 877 D
2611 880 D
2614 886 D
2617 900 D
2617 909 D
2614 923 D
2611 929 D
2608 932 D
2602 935 D
S
N
3097 923 M
3102 926 D
3111 935 D
3111 874 D
S
N
3108 932 M
3108 874 D
S
N
3097 874 M
3123 874 D
S
N
3163 935 M
3154 932 D
3149 923 D
3146 909 D
3146 900 D
3149 886 D
3154 877 D
3163 874 D
3169 874 D
3177 877 D
3183 886 D
3186 900 D
3186 909 D
3183 923 D
3177 932 D
3169 935 D
3163 935 D
S
N
3163 935 M
3157 932 D
3154 929 D
3151 923 D
3149 909 D
3149 900 D
3151 886 D
3154 880 D
3157 877 D
3163 874 D
S
N
3169 874 M
3175 877 D
3177 880 D
3180 886 D
3183 900 D
3183 909 D
3180 923 D
3177 929 D
3175 932 D
3169 935 D
S
N
3221 935 M
3212 932 D
3206 923 D
3203 909 D
3203 900 D
3206 886 D
3212 877 D
3221 874 D
3226 874 D
3235 877 D
3241 886 D
3244 900 D
3244 909 D
3241 923 D
3235 932 D
3226 935 D
3221 935 D
S
N
3221 935 M
3215 932 D
3212 929 D
3209 923 D
3206 909 D
3206 900 D
3209 886 D
3212 880 D
3215 877 D
3221 874 D
S
N
3226 874 M
3232 877 D
3235 880 D
3238 886 D
3241 900 D
3241 909 D
3238 923 D
3235 929 D
3232 932 D
3226 935 D
S
N
3692 923 M
3698 926 D
3706 935 D
3706 874 D
S
N
3703 932 M
3703 874 D
S
N
3692 874 M
3718 874 D
S
N
3744 923 M
3747 920 D
3744 918 D
3741 920 D
3741 923 D
3744 929 D
3747 932 D
3755 935 D
3767 935 D
3775 932 D
3778 929 D
3781 923 D
3781 918 D
3778 912 D
3770 906 D
3755 900 D
3749 897 D
3744 892 D
3741 883 D
3741 874 D
S
N
3767 935 M
3773 932 D
3775 929 D
3778 923 D
3778 918 D
3775 912 D
3767 906 D
3755 900 D
S
N
3741 880 M
3744 883 D
3749 883 D
3764 877 D
3773 877 D
3778 880 D
3781 883 D
S
N
3749 883 M
3764 874 D
3775 874 D
3778 877 D
3781 883 D
3781 889 D
S
N
3816 935 M
3807 932 D
3801 923 D
3798 909 D
3798 900 D
3801 886 D
3807 877 D
3816 874 D
3822 874 D
3830 877 D
3836 886 D
3839 900 D
3839 909 D
3836 923 D
3830 932 D
3822 935 D
3816 935 D
S
N
3816 935 M
3810 932 D
3807 929 D
3804 923 D
3801 909 D
3801 900 D
3804 886 D
3807 880 D
3810 877 D
3816 874 D
S
N
3822 874 M
3827 877 D
3830 880 D
3833 886 D
3836 900 D
3836 909 D
3833 923 D
3830 929 D
3827 932 D
3822 935 D
S
N
785 3414 M
3761 3414 D
S
N
785 3310 M
785 3414 D
S
N
904 3414 M
904 3379 D
S
N
1023 3379 M
1023 3414 D
S
N
1142 3414 M
1142 3379 D
S
N
1261 3379 M
1261 3414 D
S
N
1381 3414 M
1381 3310 D
S
N
1500 3379 M
1500 3414 D
S
N
1619 3414 M
1619 3379 D
S
N
1738 3379 M
1738 3414 D
S
N
1857 3414 M
1857 3379 D
S
N
1976 3310 M
1976 3414 D
S
N
2095 3414 M
2095 3379 D
S
N
2214 3379 M
2214 3414 D
S
N
2333 3414 M
2333 3379 D
S
N
2452 3379 M
2452 3414 D
S
N
2571 3414 M
2571 3310 D
S
N
2690 3379 M
2690 3414 D
S
N
2809 3414 M
2809 3379 D
S
N
2928 3379 M
2928 3414 D
S
N
3047 3414 M
3047 3379 D
S
N
3166 3310 M
3166 3414 D
S
N
3285 3414 M
3285 3379 D
S
N
3404 3379 M
3404 3414 D
S
N
3523 3414 M
3523 3379 D
S
N
3642 3379 M
3642 3414 D
S
N
785 992 M
785 3414 D
S
N
820 1107 M
785 1107 D
S
N
785 1223 M
820 1223 D
S
N
820 1338 M
785 1338 D
S
N
785 1453 M
889 1453 D
S
N
820 1569 M
785 1569 D
S
N
785 1684 M
820 1684 D
S
N
820 1799 M
785 1799 D
S
N
785 1915 M
820 1915 D
S
N
889 2030 M
785 2030 D
S
N
785 2145 M
820 2145 D
S
N
820 2261 M
785 2261 D
S
N
785 2376 M
820 2376 D
S
N
820 2491 M
785 2491 D
S
N
785 2607 M
889 2607 D
S
N
820 2722 M
785 2722 D
S
N
785 2837 M
820 2837 D
S
N
820 2953 M
785 2953 D
S
N
785 3068 M
820 3068 D
S
N
889 3183 M
785 3183 D
S
N
785 3299 M
820 3299 D
S
N
820 3414 M
785 3414 D
S
N
633 1479 M
624 1476 D
618 1468 D
615 1453 D
615 1445 D
618 1430 D
624 1422 D
633 1419 D
638 1419 D
647 1422 D
653 1430 D
656 1445 D
656 1453 D
653 1468 D
647 1476 D
638 1479 D
633 1479 D
S
N
633 1479 M
627 1476 D
624 1474 D
621 1468 D
618 1453 D
618 1445 D
621 1430 D
624 1425 D
627 1422 D
633 1419 D
S
N
638 1419 M
644 1422 D
647 1425 D
650 1430 D
653 1445 D
653 1453 D
650 1468 D
647 1474 D
644 1476 D
638 1479 D
S
N
679 1425 M
676 1422 D
679 1419 D
682 1422 D
679 1425 D
S
N
719 1479 M
710 1476 D
705 1468 D
702 1453 D
702 1445 D
705 1430 D
710 1422 D
719 1419 D
725 1419 D
733 1422 D
739 1430 D
742 1445 D
742 1453 D
739 1468 D
733 1476 D
725 1479 D
719 1479 D
S
N
719 1479 M
713 1476 D
710 1474 D
708 1468 D
705 1453 D
705 1445 D
708 1430 D
710 1425 D
713 1422 D
719 1419 D
S
N
725 1419 M
731 1422 D
733 1425 D
736 1430 D
739 1445 D
739 1453 D
736 1468 D
733 1474 D
731 1476 D
725 1479 D
S
N
633 2056 M
624 2053 D
618 2044 D
615 2030 D
615 2021 D
618 2007 D
624 1998 D
633 1995 D
638 1995 D
647 1998 D
653 2007 D
656 2021 D
656 2030 D
653 2044 D
647 2053 D
638 2056 D
633 2056 D
S
N
633 2056 M
627 2053 D
624 2050 D
621 2044 D
618 2030 D
618 2021 D
621 2007 D
624 2001 D
627 1998 D
633 1995 D
S
N
638 1995 M
644 1998 D
647 2001 D
650 2007 D
653 2021 D
653 2030 D
650 2044 D
647 2050 D
644 2053 D
638 2056 D
S
N
679 2001 M
676 1998 D
679 1995 D
682 1998 D
679 2001 D
S
N
708 2056 M
702 2027 D
S
N
702 2027 M
708 2033 D
716 2036 D
725 2036 D
734 2033 D
739 2027 D
742 2018 D
742 2013 D
739 2004 D
734 1998 D
725 1995 D
716 1995 D
708 1998 D
705 2001 D
702 2007 D
702 2010 D
705 2013 D
708 2010 D
705 2007 D
S
N
725 2036 M
731 2033 D
736 2027 D
739 2018 D
739 2013 D
736 2004 D
731 1998 D
725 1995 D
S
N
708 2056 M
736 2056 D
S
N
708 2053 M
722 2053 D
736 2056 D
S
N
624 2621 M
630 2624 D
638 2633 D
638 2572 D
S
N
635 2630 M
635 2572 D
S
N
624 2572 M
650 2572 D
S
N
679 2578 M
676 2575 D
679 2572 D
682 2575 D
679 2578 D
S
N
719 2633 M
710 2630 D
705 2621 D
702 2607 D
702 2598 D
705 2584 D
710 2575 D
719 2572 D
725 2572 D
734 2575 D
739 2584 D
742 2598 D
742 2607 D
739 2621 D
734 2630 D
725 2633 D
719 2633 D
S
N
719 2633 M
713 2630 D
710 2627 D
708 2621 D
705 2607 D
705 2598 D
708 2584 D
710 2578 D
713 2575 D
719 2572 D
S
N
725 2572 M
731 2575 D
734 2578 D
736 2584 D
739 2598 D
739 2607 D
736 2621 D
734 2627 D
731 2630 D
725 2633 D
S
N
624 3198 M
630 3201 D
638 3209 D
638 3149 D
S
N
635 3206 M
635 3149 D
S
N
624 3149 M
650 3149 D
S
N
679 3154 M
676 3152 D
679 3149 D
682 3152 D
679 3154 D
S
N
708 3209 M
702 3180 D
S
N
702 3180 M
708 3186 D
716 3189 D
725 3189 D
734 3186 D
739 3180 D
742 3172 D
742 3166 D
739 3157 D
734 3152 D
725 3149 D
716 3149 D
708 3152 D
705 3154 D
702 3160 D
702 3163 D
705 3166 D
708 3163 D
705 3160 D
S
N
725 3189 M
731 3186 D
736 3180 D
739 3172 D
739 3166 D
736 3157 D
731 3152 D
725 3149 D
S
N
708 3209 M
736 3209 D
S
N
708 3206 M
722 3206 D
736 3209 D
S
N
3761 1107 M
3726 1107 D
S
N
3726 1223 M
3761 1223 D
S
N
3761 1338 M
3726 1338 D
S
N
3657 1453 M
3761 1453 D
S
N
3761 1569 M
3726 1569 D
S
N
3726 1684 M
3761 1684 D
S
N
3761 1799 M
3726 1799 D
S
N
3726 1915 M
3761 1915 D
S
N
3761 2030 M
3657 2030 D
S
N
3726 2145 M
3761 2145 D
S
N
3761 2261 M
3726 2261 D
S
N
3726 2376 M
3761 2376 D
S
N
3761 2491 M
3726 2491 D
S
N
3657 2607 M
3761 2607 D
S
N
3761 2722 M
3726 2722 D
S
N
3726 2837 M
3761 2837 D
S
N
3761 2953 M
3726 2953 D
S
N
3726 3068 M
3761 3068 D
S
N
3761 3183 M
3657 3183 D
S
N
3726 3299 M
3761 3299 D
S
N
3761 3414 M
3726 3414 D
S
N
2019 790 M
2019 730 D
S
N
2022 790 M
2022 730 D
S
N
2022 782 M
2028 787 D
2033 790 D
2039 790 D
2048 787 D
2054 782 D
2056 773 D
2056 767 D
2054 758 D
2048 753 D
2039 750 D
2033 750 D
2028 753 D
2022 758 D
S
N
2039 790 M
2045 787 D
2051 782 D
2054 773 D
2054 767 D
2051 758 D
2045 753 D
2039 750 D
S
N
2010 790 M
2022 790 D
S
N
2010 730 M
2031 730 D
S
N
2086 767 M
2086 727 D
S
N
2088 767 M
2088 727 D
S
N
2075 767 M
2073 756 D
2073 767 D
2102 767 D
2102 756 D
2100 767 D
S
N
2080 727 M
2094 727 D
S
N
2115 754 M
2115 727 D
S
N
2117 754 M
2117 727 D
S
N
2117 748 M
2121 752 D
2127 754 D
2130 754 D
2136 752 D
2138 748 D
2138 727 D
S
N
2130 754 M
2134 752 D
2136 748 D
2136 727 D
S
N
2138 748 M
2142 752 D
2148 754 D
2152 754 D
2157 752 D
2159 748 D
2159 727 D
S
N
2152 754 M
2155 752 D
2157 748 D
2157 727 D
S
N
2109 754 M
2117 754 D
S
N
2109 727 M
2123 727 D
S
N
2130 727 M
2144 727 D
S
N
2152 727 M
2165 727 D
S
N
2179 767 M
2177 765 D
2179 763 D
2180 765 D
2179 767 D
S
N
2179 754 M
2179 727 D
S
N
2180 754 M
2180 727 D
S
N
2173 754 M
2180 754 D
S
N
2173 727 M
2186 727 D
S
N
2200 754 M
2200 727 D
S
N
2202 754 M
2202 727 D
S
N
2202 748 M
2205 752 D
2211 754 D
2215 754 D
2221 752 D
2223 748 D
2223 727 D
S
N
2215 754 M
2219 752 D
2221 748 D
2221 727 D
S
N
2194 754 M
2202 754 D
S
N
2194 727 M
2207 727 D
S
N
2215 727 M
2229 727 D
S
N
2314 822 M
2308 816 D
2303 807 D
2297 796 D
2294 782 D
2294 770 D
2297 756 D
2303 744 D
2308 735 D
2314 730 D
S
N
2308 816 M
2303 805 D
2300 796 D
2297 782 D
2297 770 D
2300 756 D
2303 747 D
2308 735 D
S
N
2372 802 M
2375 793 D
2375 810 D
2372 802 D
2366 807 D
2357 810 D
2352 810 D
2343 807 D
2337 802 D
2334 796 D
2331 787 D
2331 773 D
2334 764 D
2337 758 D
2343 753 D
2352 750 D
2357 750 D
2366 753 D
2372 758 D
S
N
2352 810 M
2346 807 D
2340 802 D
2337 796 D
2334 787 D
2334 773 D
2337 764 D
2340 758 D
2346 753 D
2352 750 D
S
N
2372 773 M
2372 750 D
S
N
2375 773 M
2375 750 D
S
N
2363 773 M
2383 773 D
S
N
2401 773 M
2435 773 D
2435 779 D
2432 784 D
2429 787 D
2424 790 D
2415 790 D
2406 787 D
2401 782 D
2398 773 D
2398 767 D
2401 758 D
2406 753 D
2415 750 D
2421 750 D
2429 753 D
2435 758 D
S
N
2432 773 M
2432 782 D
2429 787 D
S
N
2415 790 M
2409 787 D
2403 782 D
2401 773 D
2401 767 D
2403 758 D
2409 753 D
2415 750 D
S
N
2452 810 M
2473 750 D
S
N
2455 810 M
2473 758 D
S
N
2493 810 M
2473 750 D
S
N
2447 810 M
2464 810 D
S
N
2481 810 M
2499 810 D
S
N
2510 822 M
2516 816 D
2522 807 D
2527 796 D
2530 782 D
2530 770 D
2527 756 D
2522 744 D
2516 735 D
2510 730 D
S
N
2516 816 M
2522 805 D
2525 796 D
2527 782 D
2527 770 D
2525 756 D
2522 747 D
2516 735 D
S
N
462 2154 M
522 2154 D
S
N
462 2157 M
522 2157 D
S
N
491 2154 M
485 2148 D
482 2142 D
482 2137 D
485 2128 D
491 2122 D
499 2119 D
505 2119 D
514 2122 D
520 2128 D
522 2137 D
522 2142 D
520 2148 D
514 2154 D
S
N
482 2137 M
485 2131 D
491 2125 D
499 2122 D
505 2122 D
514 2125 D
520 2131 D
522 2137 D
S
N
462 2145 M
462 2157 D
S
N
522 2154 M
522 2166 D
S
N
482 2226 M
482 2197 D
485 2189 D
494 2183 D
502 2180 D
511 2180 D
517 2183 D
520 2186 D
522 2191 D
522 2197 D
520 2206 D
511 2212 D
502 2215 D
494 2215 D
488 2212 D
485 2209 D
482 2203 D
S
N
482 2197 M
485 2191 D
494 2186 D
502 2183 D
514 2183 D
520 2186 D
S
N
522 2197 M
520 2203 D
511 2209 D
502 2212 D
491 2212 D
485 2209 D
S
N
485 2209 M
485 2226 D
S
N
450 2290 M
543 2238 D
S
N
462 2339 M
522 2339 D
S
N
462 2341 M
522 2341 D
S
N
491 2339 M
485 2333 D
482 2327 D
482 2321 D
485 2313 D
491 2307 D
499 2304 D
505 2304 D
514 2307 D
520 2313 D
522 2321 D
522 2327 D
520 2333 D
514 2339 D
S
N
482 2321 M
485 2315 D
491 2310 D
499 2307 D
505 2307 D
514 2310 D
520 2315 D
522 2321 D
S
N
462 2330 M
462 2341 D
S
N
522 2339 M
522 2350 D
S
N
482 2370 M
543 2370 D
S
N
482 2373 M
543 2373 D
S
N
491 2373 M
485 2379 D
482 2385 D
482 2390 D
485 2399 D
491 2405 D
499 2408 D
505 2408 D
514 2405 D
520 2399 D
522 2390 D
522 2385 D
520 2379 D
514 2373 D
S
N
482 2390 M
485 2396 D
491 2402 D
499 2405 D
505 2405 D
514 2402 D
520 2396 D
522 2390 D
S
N
482 2362 M
482 2373 D
S
N
543 2362 M
543 2382 D
S
N
505 2438 M
546 2438 D
S
N
505 2439 M
546 2439 D
S
N
505 2426 M
517 2424 D
505 2424 D
505 2453 D
517 2453 D
505 2451 D
S
N
546 2432 M
546 2445 D
S
N
450 2538 M
456 2533 D
465 2527 D
476 2521 D
491 2518 D
502 2518 D
517 2521 D
528 2527 D
537 2533 D
543 2538 D
S
N
456 2533 M
468 2527 D
476 2524 D
491 2521 D
502 2521 D
517 2524 D
525 2527 D
537 2533 D
S
N
465 2576 M
468 2573 D
471 2576 D
468 2579 D
465 2579 D
462 2576 D
462 2570 D
465 2564 D
471 2561 D
522 2561 D
S
N
462 2570 M
465 2567 D
471 2564 D
522 2564 D
S
N
482 2553 M
482 2576 D
S
N
522 2553 M
522 2573 D
S
N
462 2599 M
522 2599 D
S
N
462 2602 M
522 2602 D
S
N
491 2602 M
485 2608 D
482 2613 D
482 2619 D
485 2628 D
491 2634 D
499 2636 D
505 2636 D
514 2634 D
520 2628 D
522 2619 D
522 2613 D
520 2608 D
514 2602 D
S
N
482 2619 M
485 2625 D
491 2631 D
499 2634 D
505 2634 D
514 2631 D
520 2625 D
522 2619 D
S
N
462 2590 M
462 2602 D
S
N
450 2703 M
543 2651 D
S
N
471 2758 M
479 2760 D
462 2760 D
471 2758 D
465 2752 D
462 2743 D
462 2737 D
465 2729 D
471 2723 D
476 2720 D
485 2717 D
499 2717 D
508 2720 D
514 2723 D
520 2729 D
522 2737 D
522 2743 D
520 2752 D
514 2758 D
S
N
462 2737 M
465 2732 D
471 2726 D
476 2723 D
485 2720 D
499 2720 D
508 2723 D
514 2726 D
520 2732 D
522 2737 D
S
N
499 2758 M
522 2758 D
S
N
499 2760 M
522 2760 D
S
N
499 2749 M
499 2769 D
S
N
499 2786 M
499 2821 D
494 2821 D
488 2818 D
485 2815 D
482 2809 D
482 2801 D
485 2792 D
491 2786 D
499 2784 D
505 2784 D
514 2786 D
520 2792 D
522 2801 D
522 2807 D
520 2815 D
514 2821 D
S
N
499 2818 M
491 2818 D
485 2815 D
S
N
482 2801 M
485 2795 D
491 2789 D
499 2786 D
505 2786 D
514 2789 D
520 2795 D
522 2801 D
S
N
462 2838 M
522 2858 D
S
N
462 2841 M
514 2858 D
S
N
462 2879 M
522 2858 D
S
N
462 2833 M
462 2850 D
S
N
462 2867 M
462 2884 D
S
N
450 2896 M
456 2902 D
465 2907 D
476 2913 D
491 2916 D
502 2916 D
517 2913 D
528 2907 D
537 2902 D
543 2896 D
S
N
456 2902 M
468 2907 D
476 2910 D
491 2913 D
502 2913 D
517 2910 D
525 2907 D
537 2902 D
S
N
3824 2240 M
3885 2240 D
S
N
3824 2243 M
3885 2243 D
S
N
3824 2232 M
3824 2252 D
S
N
3885 2232 M
3885 2275 D
3868 2275 D
3885 2272 D
S
N
3824 2292 M
3885 2292 D
S
N
3824 2295 M
3885 2295 D
S
N
3824 2330 M
3885 2330 D
S
N
3824 2333 M
3885 2333 D
S
N
3824 2284 M
3824 2304 D
S
N
3824 2321 M
3824 2341 D
S
N
3853 2295 M
3853 2330 D
S
N
3885 2284 M
3885 2304 D
S
N
3885 2321 M
3885 2341 D
S
N
3833 2396 M
3842 2399 D
3824 2399 D
3833 2396 D
3827 2390 D
3824 2382 D
3824 2376 D
3827 2367 D
3833 2362 D
3839 2359 D
3847 2356 D
3862 2356 D
3870 2359 D
3876 2362 D
3882 2367 D
3885 2376 D
3885 2382 D
3882 2390 D
3876 2396 D
3870 2399 D
S
N
3824 2376 M
3827 2370 D
3833 2364 D
3839 2362 D
3847 2359 D
3862 2359 D
3870 2362 D
3876 2364 D
3882 2370 D
3885 2376 D
S
N
3824 2468 M
3885 2468 D
S
N
3824 2471 M
3885 2471 D
S
N
3824 2506 M
3885 2506 D
S
N
3824 2509 M
3885 2509 D
S
N
3824 2460 M
3824 2480 D
S
N
3824 2497 M
3824 2517 D
S
N
3853 2471 M
3853 2506 D
S
N
3885 2460 M
3885 2480 D
S
N
3885 2497 M
3885 2517 D
S
N
3824 2537 M
3885 2537 D
S
N
3824 2540 M
3885 2540 D
S
N
3824 2529 M
3824 2549 D
S
N
3885 2529 M
3885 2549 D
S
N
3833 2604 M
3842 2607 D
3824 2607 D
3833 2604 D
3827 2598 D
3824 2589 D
3824 2584 D
3827 2575 D
3833 2569 D
3839 2566 D
3847 2563 D
3862 2563 D
3870 2566 D
3876 2569 D
3882 2575 D
3885 2584 D
3885 2589 D
3882 2598 D
3876 2604 D
S
N
3824 2584 M
3827 2578 D
3833 2572 D
3839 2569 D
3847 2566 D
3862 2566 D
3870 2569 D
3876 2572 D
3882 2578 D
3885 2584 D
S
N
3862 2604 M
3885 2604 D
S
N
3862 2607 M
3885 2607 D
S
N
3862 2595 M
3862 2615 D
S
N
3833 2670 M
3842 2673 D
3824 2673 D
3833 2670 D
3827 2664 D
3824 2656 D
3824 2650 D
3827 2641 D
3833 2636 D
3839 2633 D
3847 2630 D
3862 2630 D
3870 2633 D
3876 2636 D
3882 2641 D
3885 2650 D
3885 2656 D
3882 2664 D
3876 2670 D
S
N
3824 2650 M
3827 2644 D
3833 2638 D
3839 2636 D
3847 2633 D
3862 2633 D
3870 2636 D
3876 2638 D
3882 2644 D
3885 2650 D
S
N
3862 2670 M
3885 2670 D
S
N
3862 2673 M
3885 2673 D
S
N
3862 2661 M
3862 2682 D
S
N
3833 2734 M
3824 2736 D
3842 2736 D
3833 2734 D
3827 2728 D
3824 2719 D
3824 2710 D
3827 2702 D
3833 2696 D
3839 2696 D
3845 2699 D
3847 2702 D
3850 2708 D
3856 2725 D
3859 2731 D
3865 2736 D
S
N
3839 2696 M
3845 2702 D
3847 2708 D
3853 2725 D
3856 2731 D
3859 2734 D
3865 2736 D
3876 2736 D
3882 2731 D
3885 2722 D
3885 2713 D
3882 2705 D
3876 2699 D
3868 2696 D
3885 2696 D
3876 2699 D
S
N
3824 2800 M
3885 2837 D
S
N
3824 2803 M
3885 2840 D
S
N
3824 2840 M
3885 2800 D
S
N
3824 2794 M
3824 2811 D
S
N
3824 2829 M
3824 2846 D
S
N
3885 2794 M
3885 2811 D
S
N
3885 2829 M
3885 2846 D
S
N
3833 2895 M
3824 2898 D
3842 2898 D
3833 2895 D
3827 2889 D
3824 2881 D
3824 2872 D
3827 2863 D
3833 2858 D
3839 2858 D
3845 2860 D
3847 2863 D
3850 2869 D
3856 2886 D
3859 2892 D
3865 2898 D
S
N
3839 2858 M
3845 2863 D
3847 2869 D
3853 2886 D
3856 2892 D
3859 2895 D
3865 2898 D
3876 2898 D
3882 2892 D
3885 2883 D
3885 2875 D
3882 2866 D
3876 2860 D
3868 2858 D
3885 2858 D
3876 2860 D
S
N
3824 2964 M
3885 2976 D
S
N
3824 2967 M
3870 2976 D
S
N
3824 2987 M
3885 2976 D
S
N
3824 2987 M
3885 2999 D
S
N
3824 2990 M
3870 2999 D
S
N
3824 3010 M
3885 2999 D
S
N
3824 2956 M
3824 2976 D
S
N
3824 3002 M
3824 3019 D
S
N
3833 3071 M
3842 3074 D
3824 3074 D
3833 3071 D
3827 3065 D
3824 3056 D
3824 3051 D
3827 3042 D
3833 3036 D
3839 3033 D
3847 3031 D
3862 3031 D
3870 3033 D
3876 3036 D
3882 3042 D
3885 3051 D
3885 3056 D
3882 3065 D
3876 3071 D
S
N
3824 3051 M
3827 3045 D
3833 3039 D
3839 3036 D
3847 3033 D
3862 3033 D
3870 3036 D
3876 3039 D
3882 3045 D
3885 3051 D
S
N
3862 3071 M
3885 3071 D
S
N
3862 3074 M
3885 3074 D
S
N
3862 3062 M
3862 3082 D
S
N
3836 3146 M
3839 3149 D
3842 3146 D
3839 3143 D
3836 3143 D
3830 3146 D
3827 3149 D
3824 3157 D
3824 3169 D
3827 3178 D
3830 3180 D
3836 3183 D
3842 3183 D
3847 3180 D
3853 3172 D
3859 3157 D
3862 3152 D
3868 3146 D
3876 3143 D
3885 3143 D
S
N
3824 3169 M
3827 3175 D
3830 3178 D
3836 3180 D
3842 3180 D
3847 3178 D
3853 3169 D
3859 3157 D
S
N
3879 3143 M
3876 3146 D
3876 3152 D
3882 3166 D
3882 3175 D
3879 3180 D
3876 3183 D
S
N
3876 3152 M
3885 3166 D
3885 3178 D
3882 3180 D
3876 3183 D
3870 3183 D
S
N
3824 3218 M
3827 3209 D
3836 3204 D
3850 3201 D
3859 3201 D
3873 3204 D
3882 3209 D
3885 3218 D
3885 3224 D
3882 3232 D
3873 3238 D
3859 3241 D
3850 3241 D
3836 3238 D
3827 3232 D
3824 3224 D
3824 3218 D
S
N
3824 3218 M
3827 3212 D
3830 3209 D
3836 3206 D
3850 3204 D
3859 3204 D
3873 3206 D
3879 3209 D
3882 3212 D
3885 3218 D
S
N
3885 3224 M
3882 3229 D
3879 3232 D
3873 3235 D
3859 3238 D
3850 3238 D
3836 3235 D
3830 3232 D
3827 3229 D
3824 3224 D
S
N
3836 3267 M
3833 3273 D
3824 3281 D
3885 3281 D
S
N
3827 3278 M
3885 3278 D
S
N
3885 3267 M
3885 3293 D
S
N
3836 3319 M
3839 3322 D
3842 3319 D
3839 3316 D
3836 3316 D
3830 3319 D
3827 3322 D
3824 3330 D
3824 3342 D
3827 3351 D
3833 3353 D
3842 3353 D
3847 3351 D
3850 3342 D
3850 3333 D
S
N
3824 3342 M
3827 3348 D
3833 3351 D
3842 3351 D
3847 3348 D
3850 3342 D
S
N
3850 3342 M
3853 3348 D
3859 3353 D
3865 3356 D
3873 3356 D
3879 3353 D
3882 3351 D
3885 3342 D
3885 3330 D
3882 3322 D
3879 3319 D
3873 3316 D
3870 3316 D
3868 3319 D
3870 3322 D
3873 3319 D
S
N
3856 3351 M
3865 3353 D
3873 3353 D
3879 3351 D
3882 3348 D
3885 3342 D
S
N
2491 2439 M
2491 2379 D
S
N
2494 2439 M
2494 2379 D
S
N
2494 2431 M
2500 2437 D
2505 2439 D
2511 2439 D
2520 2437 D
2526 2431 D
2529 2422 D
2529 2416 D
2526 2408 D
2520 2402 D
2511 2399 D
2505 2399 D
2500 2402 D
2494 2408 D
S
N
2511 2439 M
2517 2437 D
2523 2431 D
2526 2422 D
2526 2416 D
2523 2408 D
2517 2402 D
2511 2399 D
S
N
2482 2439 M
2494 2439 D
S
N
2482 2379 M
2503 2379 D
S
N
2552 2439 M
2552 2379 D
S
N
2554 2439 M
2554 2379 D
S
N
2554 2431 M
2560 2437 D
2566 2439 D
2572 2439 D
2580 2437 D
2586 2431 D
2589 2422 D
2589 2416 D
2586 2408 D
2580 2402 D
2572 2399 D
2566 2399 D
2560 2402 D
2554 2408 D
S
N
2572 2439 M
2578 2437 D
2583 2431 D
2586 2422 D
2586 2416 D
2583 2408 D
2578 2402 D
2572 2399 D
S
N
2543 2439 M
2554 2439 D
S
N
2543 2379 M
2563 2379 D
S
N
2653 2431 M
2661 2425 D
2653 2419 D
S
N
2644 2439 M
2658 2425 D
2644 2411 D
S
N
2609 2425 M
2658 2425 D
S
N
2687 2460 M
2687 2399 D
S
N
2690 2460 M
2690 2399 D
S
N
2725 2460 M
2725 2399 D
S
N
2727 2460 M
2727 2399 D
S
N
2678 2460 M
2699 2460 D
S
N
2716 2460 M
2736 2460 D
S
N
2690 2431 M
2725 2431 D
S
N
2678 2399 M
2699 2399 D
S
N
2716 2399 M
2736 2399 D
S
N
2779 2451 M
2779 2399 D
S
N
2753 2425 M
2805 2425 D
S
N
2826 2460 M
2863 2399 D
S
N
2828 2460 M
2866 2399 D
S
N
2866 2460 M
2826 2399 D
S
N
2820 2460 M
2837 2460 D
S
N
2854 2460 M
2872 2460 D
S
N
2820 2399 M
2837 2399 D
S
N
2854 2399 M
2872 2399 D
S
N
2929 2431 M
2938 2425 D
2929 2419 D
S
N
2921 2439 M
2935 2425 D
2921 2411 D
S
N
2886 2425 M
2935 2425 D
S
N
2952 2431 M
2958 2437 D
2964 2439 D
2970 2439 D
2975 2437 D
2978 2434 D
2981 2425 D
2981 2413 D
2978 2402 D
2970 2379 D
S
N
2955 2434 M
2961 2437 D
2973 2437 D
2978 2434 D
S
N
3001 2439 M
2999 2431 D
2996 2425 D
2981 2405 D
2973 2390 D
2967 2379 D
S
N
2999 2439 M
2996 2431 D
2993 2425 D
2981 2405 D
S
N
3010 2431 M
3016 2437 D
3022 2439 D
3027 2439 D
3033 2437 D
3036 2434 D
3039 2425 D
3039 2413 D
3036 2402 D
3027 2379 D
S
N
3013 2434 M
3019 2437 D
3030 2437 D
3036 2434 D
S
N
3059 2439 M
3056 2431 D
3053 2425 D
3039 2405 D
3030 2390 D
3024 2379 D
S
N
3056 2439 M
3053 2431 D
3050 2425 D
3039 2405 D
S
N
3102 2451 M
3102 2399 D
S
N
3076 2425 M
3128 2425 D
S
N
3148 2460 M
3186 2399 D
S
N
3151 2460 M
3189 2399 D
S
N
3189 2460 M
3148 2399 D
S
N
3143 2460 M
3160 2460 D
S
N
3177 2460 M
3195 2460 D
S
N
3143 2399 M
3160 2399 D
S
N
3177 2399 M
3195 2399 D
S
N
2485 2290 M
2497 2290 D
2514 2255 D
S
N
2494 2290 M
2514 2249 D
2540 2327 D
S
N
2578 2284 M
2580 2290 D
2580 2278 D
2578 2284 D
2575 2287 D
2569 2290 D
2557 2290 D
2552 2287 D
2549 2284 D
2549 2278 D
2552 2275 D
2557 2272 D
2572 2266 D
2578 2264 D
2580 2261 D
S
N
2549 2281 M
2552 2278 D
2557 2275 D
2572 2269 D
2578 2266 D
2580 2264 D
2580 2255 D
2578 2252 D
2572 2249 D
2560 2249 D
2554 2252 D
2552 2255 D
2549 2261 D
2549 2249 D
2552 2255 D
S
N
2601 2284 M
2653 2284 D
S
N
2601 2266 M
2653 2266 D
S
N
2687 2310 M
2678 2307 D
2676 2301 D
2676 2292 D
2678 2287 D
2687 2284 D
2699 2284 D
2707 2287 D
2710 2292 D
2710 2301 D
2707 2307 D
2699 2310 D
2687 2310 D
S
N
2687 2310 M
2681 2307 D
2678 2301 D
2678 2292 D
2681 2287 D
2687 2284 D
S
N
2699 2284 M
2704 2287 D
2707 2292 D
2707 2301 D
2704 2307 D
2699 2310 D
S
N
2687 2284 M
2678 2281 D
2676 2278 D
2673 2272 D
2673 2261 D
2676 2255 D
2678 2252 D
2687 2249 D
2699 2249 D
2707 2252 D
2710 2255 D
2713 2261 D
2713 2272 D
2710 2278 D
2707 2281 D
2699 2284 D
S
N
2687 2284 M
2681 2281 D
2678 2278 D
2676 2272 D
2676 2261 D
2678 2255 D
2681 2252 D
2687 2249 D
S
N
2699 2249 M
2704 2252 D
2707 2255 D
2710 2261 D
2710 2272 D
2707 2278 D
2704 2281 D
2699 2284 D
S
N
2794 2310 M
2794 2249 D
S
N
2797 2310 M
2797 2249 D
S
N
2777 2310 M
2774 2292 D
2774 2310 D
2817 2310 D
2817 2292 D
2814 2310 D
S
N
2785 2249 M
2805 2249 D
S
N
2834 2272 M
2869 2272 D
2869 2278 D
2866 2284 D
2863 2287 D
2857 2290 D
2849 2290 D
2840 2287 D
2834 2281 D
2831 2272 D
2831 2266 D
2834 2258 D
2840 2252 D
2849 2249 D
2854 2249 D
2863 2252 D
2869 2258 D
S
N
2866 2272 M
2866 2281 D
2863 2287 D
S
N
2849 2290 M
2843 2287 D
2837 2281 D
2834 2272 D
2834 2266 D
2837 2258 D
2843 2252 D
2849 2249 D
S
N
2886 2310 M
2906 2249 D
S
N
2889 2310 M
2906 2258 D
S
N
2926 2310 M
2906 2249 D
S
N
2880 2310 M
2898 2310 D
S
N
2915 2310 M
2932 2310 D
S
N
2950 2249 M
2947 2252 D
2950 2255 D
2952 2252 D
2952 2246 D
2950 2240 D
2947 2238 D
S
N
3024 2310 M
3024 2249 D
S
N
3027 2310 M
3045 2258 D
S
N
3024 2310 M
3045 2249 D
S
N
3065 2310 M
3045 2249 D
S
N
3065 2310 M
3065 2249 D
S
N
3068 2310 M
3068 2249 D
S
N
3016 2310 M
3027 2310 D
S
N
3065 2310 M
3076 2310 D
S
N
3016 2249 M
3033 2249 D
S
N
3056 2249 M
3076 2249 D
S
N
3128 2301 M
3131 2310 D
3131 2292 D
3128 2301 D
3123 2307 D
3114 2310 D
3105 2310 D
3097 2307 D
3091 2301 D
3091 2295 D
3094 2290 D
3097 2287 D
3102 2284 D
3120 2278 D
3125 2275 D
3131 2269 D
S
N
3091 2295 M
3097 2290 D
3102 2287 D
3120 2281 D
3125 2278 D
3128 2275 D
3131 2269 D
3131 2258 D
3125 2252 D
3117 2249 D
3108 2249 D
3099 2252 D
3094 2258 D
3091 2266 D
3091 2249 D
3094 2258 D
S
N
3166 2310 M
3166 2249 D
S
N
3169 2310 M
3169 2249 D
S
N
3148 2310 M
3146 2292 D
3146 2310 D
3189 2310 D
3189 2292 D
3186 2310 D
S
N
3157 2249 M
3177 2249 D
S
N
3206 2310 M
3218 2249 D
S
N
3209 2310 M
3218 2264 D
S
N
3229 2310 M
3218 2249 D
S
N
3229 2310 M
3241 2249 D
S
N
3232 2310 M
3241 2264 D
S
N
3252 2310 M
3241 2249 D
S
N
3197 2310 M
3218 2310 D
S
N
3244 2310 M
3261 2310 D
S
N
3275 2298 M
3278 2295 D
3275 2292 D
3272 2295 D
3272 2298 D
3275 2304 D
3278 2307 D
3287 2310 D
3298 2310 D
3307 2307 D
3310 2304 D
3313 2298 D
3313 2292 D
3310 2287 D
3301 2281 D
3287 2275 D
3281 2272 D
3275 2266 D
3272 2258 D
3272 2249 D
S
N
3298 2310 M
3304 2307 D
3307 2304 D
3310 2298 D
3310 2292 D
3307 2287 D
3298 2281 D
3287 2275 D
S
N
3272 2255 M
3275 2258 D
3281 2258 D
3296 2252 D
3304 2252 D
3310 2255 D
3313 2258 D
S
N
3281 2258 M
3296 2249 D
3307 2249 D
3310 2252 D
3313 2258 D
3313 2264 D
S
N
3347 2310 M
3339 2307 D
3333 2298 D
3330 2284 D
3330 2275 D
3333 2261 D
3339 2252 D
3347 2249 D
3353 2249 D
3362 2252 D
3368 2261 D
3370 2275 D
3370 2284 D
3368 2298 D
3362 2307 D
3353 2310 D
3347 2310 D
S
N
3347 2310 M
3342 2307 D
3339 2304 D
3336 2298 D
3333 2284 D
3333 2275 D
3336 2261 D
3339 2255 D
3342 2252 D
3347 2249 D
S
N
3353 2249 M
3359 2252 D
3362 2255 D
3365 2261 D
3368 2275 D
3368 2284 D
3365 2298 D
3362 2304 D
3359 2307 D
3353 2310 D
S
N
3405 2310 M
3396 2307 D
3391 2298 D
3388 2284 D
3388 2275 D
3391 2261 D
3396 2252 D
3405 2249 D
3411 2249 D
3419 2252 D
3425 2261 D
3428 2275 D
3428 2284 D
3425 2298 D
3419 2307 D
3411 2310 D
3405 2310 D
S
N
3405 2310 M
3399 2307 D
3396 2304 D
3394 2298 D
3391 2284 D
3391 2275 D
3394 2261 D
3396 2255 D
3399 2252 D
3405 2249 D
S
N
3411 2249 M
3417 2252 D
3419 2255 D
3422 2261 D
3425 2275 D
3425 2284 D
3422 2298 D
3419 2304 D
3417 2307 D
3411 2310 D
S
N
3460 2310 M
3451 2307 D
3448 2301 D
3448 2292 D
3451 2287 D
3460 2284 D
3471 2284 D
3480 2287 D
3483 2292 D
3483 2301 D
3480 2307 D
3471 2310 D
3460 2310 D
S
N
3460 2310 M
3454 2307 D
3451 2301 D
3451 2292 D
3454 2287 D
3460 2284 D
S
N
3471 2284 M
3477 2287 D
3480 2292 D
3480 2301 D
3477 2307 D
3471 2310 D
S
N
3460 2284 M
3451 2281 D
3448 2278 D
3445 2272 D
3445 2261 D
3448 2255 D
3451 2252 D
3460 2249 D
3471 2249 D
3480 2252 D
3483 2255 D
3486 2261 D
3486 2272 D
3483 2278 D
3480 2281 D
3471 2284 D
S
N
3460 2284 M
3454 2281 D
3451 2278 D
3448 2272 D
3448 2261 D
3451 2255 D
3454 2252 D
3460 2249 D
S
N
3471 2249 M
3477 2252 D
3480 2255 D
3483 2261 D
3483 2272 D
3480 2278 D
3477 2281 D
3471 2284 D
S
N
2497 2151 M
2480 2091 D
S
N
2500 2151 M
2482 2091 D
S
N
2497 2142 M
2494 2125 D
2494 2117 D
2500 2111 D
2505 2111 D
2511 2114 D
2517 2119 D
2523 2128 D
S
N
2529 2151 M
2520 2119 D
2520 2114 D
2523 2111 D
2531 2111 D
2537 2117 D
2540 2122 D
S
N
2531 2151 M
2523 2119 D
2523 2114 D
2526 2111 D
S
N
2556 2128 M
2556 2088 D
S
N
2558 2128 M
2558 2088 D
S
N
2570 2117 M
2570 2101 D
S
N
2551 2128 M
2581 2128 D
2581 2117 D
2579 2128 D
S
N
2558 2109 M
2570 2109 D
S
N
2551 2088 M
2564 2088 D
S
N
2601 2145 M
2653 2145 D
S
N
2601 2128 M
2653 2128 D
S
N
2684 2151 M
2667 2091 D
S
N
2687 2151 M
2670 2091 D
S
N
2684 2142 M
2681 2125 D
2681 2117 D
2687 2111 D
2693 2111 D
2699 2114 D
2704 2119 D
2710 2128 D
S
N
2716 2151 M
2707 2119 D
2707 2114 D
2710 2111 D
2719 2111 D
2725 2117 D
2727 2122 D
S
N
2719 2151 M
2710 2119 D
2710 2114 D
2713 2111 D
S
N
2744 2128 M
2744 2088 D
S
N
2746 2128 M
2746 2088 D
S
N
2738 2128 M
2761 2128 D
2767 2126 D
2769 2124 D
2771 2120 D
2771 2117 D
2769 2113 D
2767 2111 D
2761 2109 D
2746 2109 D
S
N
2761 2128 M
2765 2126 D
2767 2124 D
2769 2120 D
2769 2117 D
2767 2113 D
2765 2111 D
2761 2109 D
S
N
2738 2088 M
2752 2088 D
S
N
2755 2109 M
2759 2107 D
2761 2105 D
2767 2092 D
2769 2090 D
2771 2090 D
2773 2092 D
S
N
2759 2107 M
2761 2103 D
2765 2090 D
2767 2088 D
2771 2088 D
2773 2092 D
2773 2093 D
S
N
2792 2145 M
2844 2145 D
S
N
2792 2128 M
2844 2128 D
S
N
2867 2160 M
2870 2157 D
2867 2154 D
2864 2157 D
2864 2160 D
2867 2166 D
2870 2168 D
2878 2171 D
2890 2171 D
2899 2168 D
2901 2166 D
2904 2160 D
2904 2154 D
2901 2148 D
2893 2142 D
2878 2137 D
2873 2134 D
2867 2128 D
2864 2119 D
2864 2111 D
S
N
2890 2171 M
2896 2168 D
2899 2166 D
2901 2160 D
2901 2154 D
2899 2148 D
2890 2142 D
2878 2137 D
S
N
2864 2117 M
2867 2119 D
2873 2119 D
2887 2114 D
2896 2114 D
2901 2117 D
2904 2119 D
S
N
2873 2119 M
2887 2111 D
2899 2111 D
2901 2114 D
2904 2119 D
2904 2125 D
S
N
2942 2171 M
2933 2168 D
2927 2163 D
2925 2157 D
2922 2145 D
2922 2137 D
2925 2125 D
2927 2119 D
2933 2114 D
2942 2111 D
2948 2111 D
2956 2114 D
2962 2119 D
2965 2125 D
2968 2137 D
2968 2145 D
2965 2157 D
2962 2163 D
2956 2168 D
2948 2171 D
2942 2171 D
S
N
2942 2171 M
2936 2168 D
2930 2163 D
2927 2157 D
2925 2145 D
2925 2137 D
2927 2125 D
2930 2119 D
2936 2114 D
2942 2111 D
S
N
2948 2111 M
2953 2114 D
2959 2119 D
2962 2125 D
2965 2137 D
2965 2145 D
2962 2157 D
2959 2163 D
2953 2168 D
2948 2171 D
S
N
2933 2117 M
2933 2119 D
2936 2125 D
2942 2128 D
2945 2128 D
2950 2125 D
2953 2119 D
2956 2099 D
2959 2096 D
2965 2096 D
2968 2102 D
2968 2105 D
S
N
2953 2119 M
2956 2108 D
2959 2102 D
2962 2099 D
2965 2099 D
2968 2102 D
S
N
2988 2145 M
3040 2145 D
S
N
2988 2128 M
3040 2128 D
S
N
3066 2151 M
3066 2111 D
S
N
3069 2151 M
3069 2111 D
S
N
3069 2142 M
3074 2148 D
3083 2151 D
3089 2151 D
3098 2148 D
3100 2142 D
3100 2111 D
S
N
3089 2151 M
3095 2148 D
3098 2142 D
3098 2111 D
S
N
3100 2142 M
3106 2148 D
3115 2151 D
3121 2151 D
3129 2148 D
3132 2142 D
3132 2111 D
S
N
3121 2151 M
3126 2148 D
3129 2142 D
3129 2111 D
S
N
3057 2151 M
3069 2151 D
S
N
3057 2111 M
3077 2111 D
S
N
3089 2111 M
3109 2111 D
S
N
3121 2111 M
3141 2111 D
S
N
3160 2128 M
3160 2088 D
S
N
3162 2128 M
3162 2088 D
S
N
3185 2128 M
3185 2088 D
S
N
3187 2128 M
3187 2088 D
S
N
3154 2128 M
3168 2128 D
S
N
3179 2128 M
3193 2128 D
S
N
3162 2109 M
3185 2109 D
S
N
3154 2088 M
3168 2088 D
S
N
3179 2088 M
3193 2088 D
S
N
3212 2145 M
3264 2145 D
S
N
3212 2128 M
3264 2128 D
S
N
3293 2160 M
3298 2163 D
3307 2171 D
3307 2111 D
S
N
3304 2168 M
3304 2111 D
S
N
3293 2111 M
3319 2111 D
S
N
3345 2160 M
3347 2157 D
3345 2154 D
3342 2157 D
3342 2160 D
3345 2166 D
3347 2168 D
3356 2171 D
3368 2171 D
3376 2168 D
3379 2166 D
3382 2160 D
3382 2154 D
3379 2148 D
3370 2142 D
3356 2137 D
3350 2134 D
3345 2128 D
3342 2119 D
3342 2111 D
S
N
3368 2171 M
3373 2168 D
3376 2166 D
3379 2160 D
3379 2154 D
3376 2148 D
3368 2142 D
3356 2137 D
S
N
3342 2117 M
3345 2119 D
3350 2119 D
3365 2114 D
3373 2114 D
3379 2117 D
3382 2119 D
S
N
3350 2119 M
3365 2111 D
3376 2111 D
3379 2114 D
3382 2119 D
3382 2125 D
S
N
3405 2171 M
3399 2142 D
S
N
3399 2142 M
3405 2148 D
3414 2151 D
3422 2151 D
3431 2148 D
3437 2142 D
3440 2134 D
3440 2128 D
3437 2119 D
3431 2114 D
3422 2111 D
3414 2111 D
3405 2114 D
3402 2117 D
3399 2122 D
3399 2125 D
3402 2128 D
3405 2125 D
3402 2122 D
S
N
3422 2151 M
3428 2148 D
3434 2142 D
3437 2134 D
3437 2128 D
3434 2119 D
3428 2114 D
3422 2111 D
S
N
3405 2171 M
3434 2171 D
S
N
3405 2168 M
3419 2168 D
3434 2171 D
S
N
3543 2163 M
3546 2154 D
3546 2171 D
3543 2163 D
3538 2168 D
3529 2171 D
3523 2171 D
3515 2168 D
3509 2163 D
3506 2157 D
3503 2148 D
3503 2134 D
3506 2125 D
3509 2119 D
3515 2114 D
3523 2111 D
3529 2111 D
3538 2114 D
3543 2119 D
S
N
3523 2171 M
3518 2168 D
3512 2163 D
3509 2157 D
3506 2148 D
3506 2134 D
3509 2125 D
3512 2119 D
3518 2114 D
3523 2111 D
S
N
3543 2134 M
3543 2111 D
S
N
3546 2134 M
3546 2111 D
S
N
3535 2134 M
3555 2134 D
S
N
3572 2134 M
3607 2134 D
3607 2140 D
3604 2145 D
3601 2148 D
3595 2151 D
3587 2151 D
3578 2148 D
3572 2142 D
3569 2134 D
3569 2128 D
3572 2119 D
3578 2114 D
3587 2111 D
3593 2111 D
3601 2114 D
3607 2119 D
S
N
3604 2134 M
3604 2142 D
3601 2148 D
S
N
3587 2151 M
3581 2148 D
3575 2142 D
3572 2134 D
3572 2128 D
3575 2119 D
3581 2114 D
3587 2111 D
S
N
3624 2171 M
3644 2111 D
S
N
3627 2171 M
3644 2119 D
S
N
3665 2171 M
3644 2111 D
S
N
3618 2171 M
3636 2171 D
S
N
3653 2171 M
3670 2171 D
S
1.00 0.00 0.00 setrgbcolor
N
785 1453 M
904 1453 D
904 1525 D
964 1525 D
964 1619 D
1023 1619 D
1023 1653 D
1083 1653 D
1083 1694 D
1142 1694 D
1142 1744 D
1202 1744 D
1202 1802 D
1261 1802 D
1261 1871 D
1321 1871 D
1321 1952 D
1381 1952 D
1381 2026 D
1440 2026 D
1440 2090 D
1500 2090 D
1500 2157 D
1559 2157 D
1559 2230 D
1619 2230 D
1619 2308 D
1678 2308 D
1678 2388 D
1738 2388 D
1738 2467 D
1797 2467 D
1797 2536 D
1857 2536 D
1857 2570 D
1916 2570 D
1916 2524 D
1976 2524 D
1976 2301 D
2035 2301 D
2035 1700 D
2095 1700 D
2095 1525 D
2154 1525 D
2154 1496 D
2214 1496 D
2214 1483 D
2273 1483 D
2273 1476 D
2333 1476 D
2333 1471 D
2392 1471 D
2392 1468 D
2452 1468 D
2452 1466 D
2511 1466 D
2511 1464 D
2571 1464 D
2571 1463 D
2630 1463 D
2630 1462 D
2690 1462 D
2690 1461 D
2749 1461 D
2749 1460 D
2809 1460 D
2809 1459 D
2868 1459 D
2868 1459 D
2928 1459 D
2928 1458 D
2987 1458 D
2987 1458 D
3047 1458 D
3047 1457 D
3106 1457 D
3106 1457 D
3166 1457 D
3166 1457 D
3225 1457 D
3225 1456 D
3285 1456 D
3285 1456 D
3344 1456 D
3344 1456 D
3404 1456 D
3404 1456 D
3463 1456 D
3463 1456 D
3523 1456 D
3523 1455 D
3582 1455 D
3582 1455 D
3642 1455 D
3642 1455 D
3701 1455 D
3701 1455 D
3761 1455 D
3761 1455 D
3761 1455 D
S
3761 1453 P
N
2571 2837 M
2868 2837 D
S
N
2997 2863 M
2997 2803 D
S
N
3000 2863 M
3034 2809 D
S
N
3000 2858 M
3034 2803 D
S
N
3034 2863 M
3034 2803 D
S
N
2988 2863 M
3000 2863 D
S
N
3026 2863 M
3043 2863 D
S
N
2988 2803 M
3006 2803 D
S
N
3063 2863 M
3063 2803 D
S
N
3066 2863 M
3066 2803 D
S
N
3055 2863 M
3075 2863 D
S
N
3055 2803 M
3098 2803 D
3098 2820 D
3095 2803 D
S
N
3115 2863 M
3115 2803 D
S
N
3118 2863 M
3118 2803 D
S
N
3106 2863 M
3127 2863 D
S
N
3106 2803 M
3150 2803 D
3150 2820 D
3147 2803 D
S
N
3190 2855 M
3190 2803 D
S
N
3164 2829 M
3216 2829 D
S
N
3242 2863 M
3242 2803 D
S
N
3245 2863 M
3279 2809 D
S
N
3245 2858 M
3279 2803 D
S
N
3279 2863 M
3279 2803 D
S
N
3233 2863 M
3245 2863 D
S
N
3271 2863 M
3288 2863 D
S
N
3233 2803 M
3251 2803 D
S
N
3308 2863 M
3308 2803 D
S
N
3311 2863 M
3311 2803 D
S
N
3300 2863 M
3320 2863 D
S
N
3300 2803 M
3343 2803 D
3343 2820 D
3340 2803 D
S
N
3375 2863 M
3366 2860 D
3360 2855 D
3357 2849 D
3354 2837 D
3354 2829 D
3357 2817 D
3360 2811 D
3366 2806 D
3375 2803 D
3380 2803 D
3389 2806 D
3395 2811 D
3398 2817 D
3401 2829 D
3401 2837 D
3398 2849 D
3395 2855 D
3389 2860 D
3380 2863 D
3375 2863 D
S
N
3375 2863 M
3369 2860 D
3363 2855 D
3360 2849 D
3357 2837 D
3357 2829 D
3360 2817 D
3363 2811 D
3369 2806 D
3375 2803 D
S
N
3380 2803 M
3386 2806 D
3392 2811 D
3395 2817 D
3398 2829 D
3398 2837 D
3395 2849 D
3392 2855 D
3386 2860 D
3380 2863 D
S
0.00 0.00 1.00 setrgbcolor
N
969 1558 M
900 1558 D
S
N
934 1558 M
934 1554 D
S
N
969 1554 M
900 1554 D
S
N
1028 1689 M
959 1689 D
S
N
994 1689 M
994 1683 D
S
N
1028 1683 M
959 1683 D
S
N
1088 1740 M
1019 1740 D
S
N
1053 1740 M
1053 1734 D
S
N
1088 1734 M
1019 1734 D
S
N
1147 1789 M
1078 1789 D
S
N
1113 1789 M
1113 1782 D
S
N
1147 1782 M
1078 1782 D
S
N
1207 1856 M
1138 1856 D
S
N
1172 1856 M
1172 1848 D
S
N
1207 1848 M
1138 1848 D
S
N
1266 1932 M
1197 1932 D
S
N
1232 1932 M
1232 1923 D
S
N
1266 1923 M
1197 1923 D
S
N
1326 2007 M
1257 2007 D
S
N
1291 2007 M
1291 1999 D
S
N
1326 1999 M
1257 1999 D
S
N
1385 2114 M
1316 2114 D
S
N
1351 2114 M
1351 2103 D
S
N
1385 2103 M
1316 2103 D
S
N
1445 2187 M
1376 2187 D
S
N
1410 2187 M
1410 2175 D
S
N
1445 2175 M
1376 2175 D
S
N
1504 2272 M
1435 2272 D
S
N
1470 2272 M
1470 2259 D
S
N
1504 2259 M
1435 2259 D
S
N
1564 2343 M
1495 2343 D
S
N
1529 2343 M
1529 2330 D
S
N
1564 2330 M
1495 2330 D
S
N
1623 2431 M
1554 2431 D
S
N
1589 2431 M
1589 2418 D
S
N
1623 2418 M
1554 2418 D
S
N
1683 2528 M
1614 2528 D
S
N
1648 2528 M
1648 2513 D
S
N
1683 2513 M
1614 2513 D
S
N
1742 2608 M
1673 2608 D
S
N
1708 2608 M
1708 2591 D
S
N
1742 2591 M
1673 2591 D
S
N
1802 2704 M
1733 2704 D
S
N
1767 2704 M
1767 2688 D
S
N
1802 2688 M
1733 2688 D
S
N
1861 2771 M
1792 2771 D
S
N
1827 2771 M
1827 2752 D
S
N
1861 2752 M
1792 2752 D
S
N
1921 2767 M
1852 2767 D
S
N
1886 2767 M
1886 2746 D
S
N
1921 2746 M
1852 2746 D
S
N
1980 2711 M
1911 2711 D
S
N
1946 2711 M
1946 2690 D
S
N
1980 2690 M
1911 2690 D
S
N
2040 2461 M
1971 2461 D
S
N
2005 2461 M
2005 2432 D
S
N
2040 2432 M
1971 2432 D
S
N
2100 1746 M
2030 1746 D
S
N
2065 1746 M
2065 1725 D
S
N
2100 1725 M
2030 1725 D
S
N
2159 1564 M
2090 1564 D
S
N
2124 1564 M
2124 1561 D
S
N
2159 1561 M
2090 1561 D
S
N
2219 1523 M
2149 1523 D
S
N
2184 1523 M
2184 1520 D
S
N
2219 1520 M
2149 1520 D
S
N
2278 1505 M
2209 1505 D
S
N
2243 1505 M
2243 1502 D
S
N
2278 1502 M
2209 1502 D
S
N
2338 1494 M
2268 1494 D
S
N
2303 1494 M
2303 1491 D
S
N
2338 1491 M
2268 1491 D
S
N
2397 1486 M
2328 1486 D
S
N
2362 1486 M
2362 1484 D
S
N
2397 1484 M
2328 1484 D
S
N
2457 1480 M
2387 1480 D
S
N
2422 1480 M
2422 1479 D
S
N
2457 1479 M
2387 1479 D
S
N
2516 1476 M
2447 1476 D
S
N
2481 1476 M
2481 1474 D
S
N
2516 1474 M
2447 1474 D
S
N
2576 1472 M
2506 1472 D
S
N
2541 1472 M
2541 1471 D
S
N
2576 1471 M
2506 1471 D
S
N
2635 1470 M
2566 1470 D
S
N
2601 1470 M
2601 1469 D
S
N
2635 1469 M
2566 1469 D
S
N
2695 1467 M
2625 1467 D
S
N
2660 1467 M
2660 1467 D
S
N
2695 1467 M
2625 1467 D
S
N
2754 1466 M
2685 1466 D
S
N
2720 1466 M
2720 1466 D
S
N
2754 1466 M
2685 1466 D
S
N
2814 1465 M
2744 1465 D
S
N
2779 1465 M
2779 1464 D
S
N
2814 1464 M
2744 1464 D
S
N
2873 1463 M
2804 1463 D
S
N
2839 1463 M
2839 1463 D
S
N
2873 1463 M
2804 1463 D
S
N
2933 1462 M
2863 1462 D
S
N
2898 1462 M
2898 1462 D
S
N
2933 1462 M
2863 1462 D
S
N
2992 1461 M
2923 1461 D
S
N
2958 1461 M
2958 1461 D
S
N
2992 1461 M
2923 1461 D
S
N
3052 1461 M
2983 1461 D
S
N
3017 1461 M
3017 1460 D
S
N
3052 1460 M
2983 1460 D
S
N
3111 1460 M
3042 1460 D
S
N
3077 1460 M
3077 1460 D
S
N
3111 1460 M
3042 1460 D
S
N
3171 1459 M
3102 1459 D
S
N
3136 1459 M
3136 1459 D
S
N
3171 1459 M
3102 1459 D
S
N
3230 1459 M
3161 1459 D
S
N
3196 1459 M
3196 1458 D
S
N
3230 1458 M
3161 1458 D
S
N
3290 1459 M
3221 1459 D
S
N
3255 1459 M
3255 1458 D
S
N
3290 1458 M
3221 1458 D
S
N
3349 1458 M
3280 1458 D
S
N
3315 1458 M
3315 1457 D
S
N
3349 1457 M
3280 1457 D
S
N
3409 1458 M
3340 1458 D
S
N
3374 1458 M
3374 1457 D
S
N
3409 1457 M
3340 1457 D
S
N
3468 1457 M
3399 1457 D
S
N
3434 1457 M
3434 1457 D
S
N
3468 1457 M
3399 1457 D
S
N
3528 1457 M
3459 1457 D
S
N
3493 1457 M
3493 1457 D
S
N
3528 1457 M
3459 1457 D
S
N
3587 1456 M
3518 1456 D
S
N
3553 1456 M
3553 1456 D
S
N
3587 1456 M
3518 1456 D
S
N
3647 1456 M
3578 1456 D
S
N
3612 1456 M
3612 1456 D
S
N
3647 1456 M
3578 1456 D
S
N
3706 1456 M
3637 1456 D
S
N
3672 1456 M
3672 1456 D
S
N
3706 1456 M
3637 1456 D
S
N
3761 1456 M
3697 1456 D
S
N
3731 1456 M
3731 1456 D
S
N
3761 1456 M
3697 1456 D
S
N
3761 1456 M
3756 1456 D
S
N
3761 1455 M
3756 1455 D
S
N
2754 3103 M
2685 3103 D
S
N
2720 3103 M
2720 3033 D
S
N
2754 3033 M
2685 3033 D
S
N
2997 3094 M
2997 3033 D
S
N
3000 3094 M
3034 3039 D
S
N
3000 3088 M
3034 3033 D
S
N
3034 3094 M
3034 3033 D
S
N
2988 3094 M
3000 3094 D
S
N
3026 3094 M
3043 3094 D
S
N
2988 3033 M
3006 3033 D
S
N
3063 3094 M
3063 3033 D
S
N
3066 3094 M
3101 3039 D
S
N
3066 3088 M
3101 3033 D
S
N
3101 3094 M
3101 3033 D
S
N
3055 3094 M
3066 3094 D
S
N
3092 3094 M
3109 3094 D
S
N
3055 3033 M
3072 3033 D
S
N
3130 3094 M
3130 3033 D
S
N
3132 3094 M
3132 3033 D
S
N
3121 3094 M
3141 3094 D
S
N
3121 3033 M
3164 3033 D
3164 3051 D
3161 3033 D
S
N
3181 3094 M
3181 3033 D
S
N
3184 3094 M
3184 3033 D
S
N
3173 3094 M
3193 3094 D
S
N
3173 3033 M
3216 3033 D
3216 3051 D
3213 3033 D
S
N
3256 3085 M
3256 3033 D
S
N
3230 3059 M
3282 3059 D
S
N
3308 3094 M
3308 3033 D
S
N
3311 3094 M
3346 3039 D
S
N
3311 3088 M
3346 3033 D
S
N
3346 3094 M
3346 3033 D
S
N
3300 3094 M
3311 3094 D
S
N
3337 3094 M
3354 3094 D
S
N
3300 3033 M
3317 3033 D
S
N
3375 3094 M
3375 3033 D
S
N
3378 3094 M
3412 3039 D
S
N
3378 3088 M
3412 3033 D
S
N
3412 3094 M
3412 3033 D
S
N
3366 3094 M
3378 3094 D
S
N
3403 3094 M
3421 3094 D
S
N
3366 3033 M
3383 3033 D
S
N
3441 3094 M
3441 3033 D
S
N
3444 3094 M
3444 3033 D
S
N
3432 3094 M
3452 3094 D
S
N
3432 3033 M
3476 3033 D
3476 3051 D
3473 3033 D
S
N
3507 3094 M
3499 3091 D
3493 3085 D
3490 3080 D
3487 3068 D
3487 3059 D
3490 3048 D
3493 3042 D
3499 3036 D
3507 3033 D
3513 3033 D
3522 3036 D
3527 3042 D
3530 3048 D
3533 3059 D
3533 3068 D
3530 3080 D
3527 3085 D
3522 3091 D
3513 3094 D
3507 3094 D
S
N
3507 3094 M
3502 3091 D
3496 3085 D
3493 3080 D
3490 3068 D
3490 3059 D
3493 3048 D
3496 3042 D
3502 3036 D
3507 3033 D
S
N
3513 3033 M
3519 3036 D
3525 3042 D
3527 3048 D
3530 3059 D
3530 3068 D
3527 3080 D
3525 3085 D
3519 3091 D
3513 3094 D
S
0.00 0.00 0.00 setrgbcolor
[4 30] 0 Sd
N
785 1453 M
904 1453 D
904 1544 D
964 1544 D
964 1660 D
1023 1660 D
1023 1705 D
1083 1705 D
1083 1755 D
1142 1755 D
1142 1823 D
1202 1823 D
1202 1912 D
1261 1912 D
1261 2030 D
1321 2030 D
1321 2010 D
1381 2010 D
1381 2152 D
1440 2152 D
1440 2228 D
1500 2228 D
1500 2302 D
1559 2302 D
1559 2402 D
1619 2402 D
1619 2494 D
1678 2494 D
1678 2601 D
1738 2601 D
1738 2722 D
1797 2722 D
1797 2861 D
1857 2861 D
1857 2968 D
1916 2968 D
1916 2968 D
1976 2968 D
1976 1634 D
2035 1634 D
2035 2357 D
2095 2357 D
2095 1547 D
2154 1547 D
2154 1516 D
2214 1516 D
2214 1499 D
2273 1499 D
2273 1490 D
2333 1490 D
2333 1484 D
2392 1484 D
2392 1478 D
2452 1478 D
2452 1475 D
2511 1475 D
2511 1472 D
2571 1472 D
2571 1469 D
2630 1469 D
2630 1467 D
2690 1467 D
2690 1466 D
2749 1466 D
2749 1464 D
2809 1464 D
2809 1463 D
2868 1463 D
2868 1462 D
2928 1462 D
2928 1461 D
2987 1461 D
2987 1461 D
3047 1461 D
3047 1460 D
3106 1460 D
3106 1459 D
3166 1459 D
3166 1459 D
3225 1459 D
3225 1458 D
3285 1458 D
3285 1458 D
3344 1458 D
3344 1457 D
3404 1457 D
3404 1457 D
3463 1457 D
3463 1457 D
3523 1457 D
3523 1456 D
3582 1456 D
3582 1456 D
3642 1456 D
3642 1456 D
3701 1456 D
3701 1456 D
3761 1456 D
3761 1456 D
3761 1456 D
S
[] 0 Sd
3761 1453 P
[4 30] 0 Sd
N
2571 2607 M
2868 2607 D
S
[] 0 Sd
N
2997 2633 M
2997 2572 D
S
N
3000 2633 M
3034 2578 D
S
N
3000 2627 M
3034 2572 D
S
N
3034 2633 M
3034 2572 D
S
N
2988 2633 M
3000 2633 D
S
N
3026 2633 M
3043 2633 D
S
N
2988 2572 M
3006 2572 D
S
N
3063 2633 M
3063 2572 D
S
N
3066 2633 M
3101 2578 D
S
N
3066 2627 M
3101 2572 D
S
N
3101 2633 M
3101 2572 D
S
N
3055 2633 M
3066 2633 D
S
N
3092 2633 M
3109 2633 D
S
N
3055 2572 M
3072 2572 D
S
N
3130 2633 M
3130 2572 D
S
N
3132 2633 M
3132 2572 D
S
N
3121 2633 M
3141 2633 D
S
N
3121 2572 M
3164 2572 D
3164 2589 D
3161 2572 D
S
N
3196 2633 M
3187 2630 D
3181 2624 D
3179 2618 D
3176 2607 D
3176 2598 D
3179 2586 D
3181 2581 D
3187 2575 D
3196 2572 D
3202 2572 D
3210 2575 D
3216 2581 D
3219 2586 D
3222 2598 D
3222 2607 D
3219 2618 D
3216 2624 D
3210 2630 D
3202 2633 D
3196 2633 D
S
N
3196 2633 M
3190 2630 D
3184 2624 D
3181 2618 D
3179 2607 D
3179 2598 D
3181 2586 D
3184 2581 D
3190 2575 D
3196 2572 D
S
N
3202 2572 M
3207 2575 D
3213 2581 D
3216 2586 D
3219 2598 D
3219 2607 D
3216 2618 D
3213 2624 D
3207 2630 D
3202 2633 D
S
N
785 3414 M
785 992 D
S
N
785 992 M
3761 992 D
S
N
3761 992 M
3761 3414 D
S
N
3761 3414 M
785 3414 D
S
N
785 992 M
785 1096 D
S
N
904 1027 M
904 992 D
S
N
1023 992 M
1023 1027 D
S
N
1142 1027 M
1142 992 D
S
N
1261 992 M
1261 1027 D
S
N
1381 1096 M
1381 992 D
S
N
1500 992 M
1500 1027 D
S
N
1619 1027 M
1619 992 D
S
N
1738 992 M
1738 1027 D
S
N
1857 1027 M
1857 992 D
S
N
1976 992 M
1976 1096 D
S
N
2095 1027 M
2095 992 D
S
N
2214 992 M
2214 1027 D
S
N
2333 1027 M
2333 992 D
S
N
2452 992 M
2452 1027 D
S
N
2571 1096 M
2571 992 D
S
N
2690 992 M
2690 1027 D
S
N
2809 1027 M
2809 992 D
S
N
2928 992 M
2928 1027 D
S
N
3047 1027 M
3047 992 D
S
N
3166 992 M
3166 1096 D
S
N
3285 1027 M
3285 992 D
S
N
3404 992 M
3404 1027 D
S
N
3523 1027 M
3523 992 D
S
N
3642 992 M
3642 1027 D
S
N
739 923 M
742 920 D
739 918 D
736 920 D
736 923 D
739 929 D
742 932 D
751 935 D
762 935 D
771 932 D
774 929 D
777 923 D
777 918 D
774 912 D
765 906 D
751 900 D
745 897 D
739 892 D
736 883 D
736 874 D
S
N
762 935 M
768 932 D
771 929 D
774 923 D
774 918 D
771 912 D
762 906 D
751 900 D
S
N
736 880 M
739 883 D
745 883 D
759 877 D
768 877 D
774 880 D
777 883 D
S
N
745 883 M
759 874 D
771 874 D
774 877 D
777 883 D
777 889 D
S
N
811 935 M
803 932 D
797 923 D
794 909 D
794 900 D
797 886 D
803 877 D
811 874 D
817 874 D
826 877 D
832 886 D
834 900 D
834 909 D
832 923 D
826 932 D
817 935 D
811 935 D
S
N
811 935 M
806 932 D
803 929 D
800 923 D
797 909 D
797 900 D
800 886 D
803 880 D
806 877 D
811 874 D
S
N
817 874 M
823 877 D
826 880 D
829 886 D
832 900 D
832 909 D
829 923 D
826 929 D
823 932 D
817 935 D
S
N
1357 929 M
1357 874 D
S
N
1360 935 M
1360 874 D
S
N
1360 935 M
1329 892 D
1375 892 D
S
N
1349 874 M
1369 874 D
S
N
1406 935 M
1398 932 D
1392 923 D
1389 909 D
1389 900 D
1392 886 D
1398 877 D
1406 874 D
1412 874 D
1421 877 D
1427 886 D
1430 900 D
1430 909 D
1427 923 D
1421 932 D
1412 935 D
1406 935 D
S
N
1406 935 M
1401 932 D
1398 929 D
1395 923 D
1392 909 D
1392 900 D
1395 886 D
1398 880 D
1401 877 D
1406 874 D
S
N
1412 874 M
1418 877 D
1421 880 D
1424 886 D
1427 900 D
1427 909 D
1424 923 D
1421 929 D
1418 932 D
1412 935 D
S
N
1961 926 M
1958 923 D
1961 920 D
1964 923 D
1964 926 D
1961 932 D
1955 935 D
1947 935 D
1938 932 D
1932 926 D
1930 920 D
1927 909 D
1927 892 D
1930 883 D
1935 877 D
1944 874 D
1950 874 D
1958 877 D
1964 883 D
1967 892 D
1967 895 D
1964 903 D
1958 909 D
1950 912 D
1947 912 D
1938 909 D
1932 903 D
1930 895 D
S
N
1947 935 M
1941 932 D
1935 926 D
1932 920 D
1930 909 D
1930 892 D
1932 883 D
1938 877 D
1944 874 D
S
N
1950 874 M
1955 877 D
1961 883 D
1964 892 D
1964 895 D
1961 903 D
1955 909 D
1950 912 D
S
N
2002 935 M
1993 932 D
1987 923 D
1984 909 D
1984 900 D
1987 886 D
1993 877 D
2002 874 D
2007 874 D
2016 877 D
2022 886 D
2025 900 D
2025 909 D
2022 923 D
2016 932 D
2007 935 D
2002 935 D
S
N
2002 935 M
1996 932 D
1993 929 D
1990 923 D
1987 909 D
1987 900 D
1990 886 D
1993 880 D
1996 877 D
2002 874 D
S
N
2007 874 M
2013 877 D
2016 880 D
2019 886 D
2022 900 D
2022 909 D
2019 923 D
2016 929 D
2013 932 D
2007 935 D
S
N
2536 935 M
2528 932 D
2525 926 D
2525 918 D
2528 912 D
2536 909 D
2548 909 D
2556 912 D
2559 918 D
2559 926 D
2556 932 D
2548 935 D
2536 935 D
S
N
2536 935 M
2530 932 D
2528 926 D
2528 918 D
2530 912 D
2536 909 D
S
N
2548 909 M
2553 912 D
2556 918 D
2556 926 D
2553 932 D
2548 935 D
S
N
2536 909 M
2528 906 D
2525 903 D
2522 897 D
2522 886 D
2525 880 D
2528 877 D
2536 874 D
2548 874 D
2556 877 D
2559 880 D
2562 886 D
2562 897 D
2559 903 D
2556 906 D
2548 909 D
S
N
2536 909 M
2530 906 D
2528 903 D
2525 897 D
2525 886 D
2528 880 D
2530 877 D
2536 874 D
S
N
2548 874 M
2553 877 D
2556 880 D
2559 886 D
2559 897 D
2556 903 D
2553 906 D
2548 909 D
S
N
2597 935 M
2588 932 D
2582 923 D
2579 909 D
2579 900 D
2582 886 D
2588 877 D
2597 874 D
2602 874 D
2611 877 D
2617 886 D
2620 900 D
2620 909 D
2617 923 D
2611 932 D
2602 935 D
2597 935 D
S
N
2597 935 M
2591 932 D
2588 929 D
2585 923 D
2582 909 D
2582 900 D
2585 886 D
2588 880 D
2591 877 D
2597 874 D
S
N
2602 874 M
2608 877 D
2611 880 D
2614 886 D
2617 900 D
2617 909 D
2614 923 D
2611 929 D
2608 932 D
2602 935 D
S
N
3097 923 M
3102 926 D
3111 935 D
3111 874 D
S
N
3108 932 M
3108 874 D
S
N
3097 874 M
3123 874 D
S
N
3163 935 M
3154 932 D
3149 923 D
3146 909 D
3146 900 D
3149 886 D
3154 877 D
3163 874 D
3169 874 D
3177 877 D
3183 886 D
3186 900 D
3186 909 D
3183 923 D
3177 932 D
3169 935 D
3163 935 D
S
N
3163 935 M
3157 932 D
3154 929 D
3151 923 D
3149 909 D
3149 900 D
3151 886 D
3154 880 D
3157 877 D
3163 874 D
S
N
3169 874 M
3175 877 D
3177 880 D
3180 886 D
3183 900 D
3183 909 D
3180 923 D
3177 929 D
3175 932 D
3169 935 D
S
N
3221 935 M
3212 932 D
3206 923 D
3203 909 D
3203 900 D
3206 886 D
3212 877 D
3221 874 D
3226 874 D
3235 877 D
3241 886 D
3244 900 D
3244 909 D
3241 923 D
3235 932 D
3226 935 D
3221 935 D
S
N
3221 935 M
3215 932 D
3212 929 D
3209 923 D
3206 909 D
3206 900 D
3209 886 D
3212 880 D
3215 877 D
3221 874 D
S
N
3226 874 M
3232 877 D
3235 880 D
3238 886 D
3241 900 D
3241 909 D
3238 923 D
3235 929 D
3232 932 D
3226 935 D
S
N
3692 923 M
3698 926 D
3706 935 D
3706 874 D
S
N
3703 932 M
3703 874 D
S
N
3692 874 M
3718 874 D
S
N
3744 923 M
3747 920 D
3744 918 D
3741 920 D
3741 923 D
3744 929 D
3747 932 D
3755 935 D
3767 935 D
3775 932 D
3778 929 D
3781 923 D
3781 918 D
3778 912 D
3770 906 D
3755 900 D
3749 897 D
3744 892 D
3741 883 D
3741 874 D
S
N
3767 935 M
3773 932 D
3775 929 D
3778 923 D
3778 918 D
3775 912 D
3767 906 D
3755 900 D
S
N
3741 880 M
3744 883 D
3749 883 D
3764 877 D
3773 877 D
3778 880 D
3781 883 D
S
N
3749 883 M
3764 874 D
3775 874 D
3778 877 D
3781 883 D
3781 889 D
S
N
3816 935 M
3807 932 D
3801 923 D
3798 909 D
3798 900 D
3801 886 D
3807 877 D
3816 874 D
3822 874 D
3830 877 D
3836 886 D
3839 900 D
3839 909 D
3836 923 D
3830 932 D
3822 935 D
3816 935 D
S
N
3816 935 M
3810 932 D
3807 929 D
3804 923 D
3801 909 D
3801 900 D
3804 886 D
3807 880 D
3810 877 D
3816 874 D
S
N
3822 874 M
3827 877 D
3830 880 D
3833 886 D
3836 900 D
3836 909 D
3833 923 D
3830 929 D
3827 932 D
3822 935 D
S
N
785 3414 M
3761 3414 D
S
N
785 3310 M
785 3414 D
S
N
904 3414 M
904 3379 D
S
N
1023 3379 M
1023 3414 D
S
N
1142 3414 M
1142 3379 D
S
N
1261 3379 M
1261 3414 D
S
N
1381 3414 M
1381 3310 D
S
N
1500 3379 M
1500 3414 D
S
N
1619 3414 M
1619 3379 D
S
N
1738 3379 M
1738 3414 D
S
N
1857 3414 M
1857 3379 D
S
N
1976 3310 M
1976 3414 D
S
N
2095 3414 M
2095 3379 D
S
N
2214 3379 M
2214 3414 D
S
N
2333 3414 M
2333 3379 D
S
N
2452 3379 M
2452 3414 D
S
N
2571 3414 M
2571 3310 D
S
N
2690 3379 M
2690 3414 D
S
N
2809 3414 M
2809 3379 D
S
N
2928 3379 M
2928 3414 D
S
N
3047 3414 M
3047 3379 D
S
N
3166 3310 M
3166 3414 D
S
N
3285 3414 M
3285 3379 D
S
N
3404 3379 M
3404 3414 D
S
N
3523 3414 M
3523 3379 D
S
N
3642 3379 M
3642 3414 D
S
N
785 992 M
785 3414 D
S
N
820 1107 M
785 1107 D
S
N
785 1223 M
820 1223 D
S
N
820 1338 M
785 1338 D
S
N
785 1453 M
889 1453 D
S
N
820 1569 M
785 1569 D
S
N
785 1684 M
820 1684 D
S
N
820 1799 M
785 1799 D
S
N
785 1915 M
820 1915 D
S
N
889 2030 M
785 2030 D
S
N
785 2145 M
820 2145 D
S
N
820 2261 M
785 2261 D
S
N
785 2376 M
820 2376 D
S
N
820 2491 M
785 2491 D
S
N
785 2607 M
889 2607 D
S
N
820 2722 M
785 2722 D
S
N
785 2837 M
820 2837 D
S
N
820 2953 M
785 2953 D
S
N
785 3068 M
820 3068 D
S
N
889 3183 M
785 3183 D
S
N
785 3299 M
820 3299 D
S
N
820 3414 M
785 3414 D
S
N
633 1479 M
624 1476 D
618 1468 D
615 1453 D
615 1445 D
618 1430 D
624 1422 D
633 1419 D
638 1419 D
647 1422 D
653 1430 D
656 1445 D
656 1453 D
653 1468 D
647 1476 D
638 1479 D
633 1479 D
S
N
633 1479 M
627 1476 D
624 1474 D
621 1468 D
618 1453 D
618 1445 D
621 1430 D
624 1425 D
627 1422 D
633 1419 D
S
N
638 1419 M
644 1422 D
647 1425 D
650 1430 D
653 1445 D
653 1453 D
650 1468 D
647 1474 D
644 1476 D
638 1479 D
S
N
679 1425 M
676 1422 D
679 1419 D
682 1422 D
679 1425 D
S
N
719 1479 M
710 1476 D
705 1468 D
702 1453 D
702 1445 D
705 1430 D
710 1422 D
719 1419 D
725 1419 D
733 1422 D
739 1430 D
742 1445 D
742 1453 D
739 1468 D
733 1476 D
725 1479 D
719 1479 D
S
N
719 1479 M
713 1476 D
710 1474 D
708 1468 D
705 1453 D
705 1445 D
708 1430 D
710 1425 D
713 1422 D
719 1419 D
S
N
725 1419 M
731 1422 D
733 1425 D
736 1430 D
739 1445 D
739 1453 D
736 1468 D
733 1474 D
731 1476 D
725 1479 D
S
N
633 2056 M
624 2053 D
618 2044 D
615 2030 D
615 2021 D
618 2007 D
624 1998 D
633 1995 D
638 1995 D
647 1998 D
653 2007 D
656 2021 D
656 2030 D
653 2044 D
647 2053 D
638 2056 D
633 2056 D
S
N
633 2056 M
627 2053 D
624 2050 D
621 2044 D
618 2030 D
618 2021 D
621 2007 D
624 2001 D
627 1998 D
633 1995 D
S
N
638 1995 M
644 1998 D
647 2001 D
650 2007 D
653 2021 D
653 2030 D
650 2044 D
647 2050 D
644 2053 D
638 2056 D
S
N
679 2001 M
676 1998 D
679 1995 D
682 1998 D
679 2001 D
S
N
708 2056 M
702 2027 D
S
N
702 2027 M
708 2033 D
716 2036 D
725 2036 D
734 2033 D
739 2027 D
742 2018 D
742 2013 D
739 2004 D
734 1998 D
725 1995 D
716 1995 D
708 1998 D
705 2001 D
702 2007 D
702 2010 D
705 2013 D
708 2010 D
705 2007 D
S
N
725 2036 M
731 2033 D
736 2027 D
739 2018 D
739 2013 D
736 2004 D
731 1998 D
725 1995 D
S
N
708 2056 M
736 2056 D
S
N
708 2053 M
722 2053 D
736 2056 D
S
N
624 2621 M
630 2624 D
638 2633 D
638 2572 D
S
N
635 2630 M
635 2572 D
S
N
624 2572 M
650 2572 D
S
N
679 2578 M
676 2575 D
679 2572 D
682 2575 D
679 2578 D
S
N
719 2633 M
710 2630 D
705 2621 D
702 2607 D
702 2598 D
705 2584 D
710 2575 D
719 2572 D
725 2572 D
734 2575 D
739 2584 D
742 2598 D
742 2607 D
739 2621 D
734 2630 D
725 2633 D
719 2633 D
S
N
719 2633 M
713 2630 D
710 2627 D
708 2621 D
705 2607 D
705 2598 D
708 2584 D
710 2578 D
713 2575 D
719 2572 D
S
N
725 2572 M
731 2575 D
734 2578 D
736 2584 D
739 2598 D
739 2607 D
736 2621 D
734 2627 D
731 2630 D
725 2633 D
S
N
624 3198 M
630 3201 D
638 3209 D
638 3149 D
S
N
635 3206 M
635 3149 D
S
N
624 3149 M
650 3149 D
S
N
679 3154 M
676 3152 D
679 3149 D
682 3152 D
679 3154 D
S
N
708 3209 M
702 3180 D
S
N
702 3180 M
708 3186 D
716 3189 D
725 3189 D
734 3186 D
739 3180 D
742 3172 D
742 3166 D
739 3157 D
734 3152 D
725 3149 D
716 3149 D
708 3152 D
705 3154 D
702 3160 D
702 3163 D
705 3166 D
708 3163 D
705 3160 D
S
N
725 3189 M
731 3186 D
736 3180 D
739 3172 D
739 3166 D
736 3157 D
731 3152 D
725 3149 D
S
N
708 3209 M
736 3209 D
S
N
708 3206 M
722 3206 D
736 3209 D
S
N
3761 1107 M
3726 1107 D
S
N
3726 1223 M
3761 1223 D
S
N
3761 1338 M
3726 1338 D
S
N
3657 1453 M
3761 1453 D
S
N
3761 1569 M
3726 1569 D
S
N
3726 1684 M
3761 1684 D
S
N
3761 1799 M
3726 1799 D
S
N
3726 1915 M
3761 1915 D
S
N
3761 2030 M
3657 2030 D
S
N
3726 2145 M
3761 2145 D
S
N
3761 2261 M
3726 2261 D
S
N
3726 2376 M
3761 2376 D
S
N
3761 2491 M
3726 2491 D
S
N
3657 2607 M
3761 2607 D
S
N
3761 2722 M
3726 2722 D
S
N
3726 2837 M
3761 2837 D
S
N
3761 2953 M
3726 2953 D
S
N
3726 3068 M
3761 3068 D
S
N
3761 3183 M
3657 3183 D
S
N
3726 3299 M
3761 3299 D
S
N
3761 3414 M
3726 3414 D
S
showpage
%%Trailer
%%Pages: 1
%%BoundingBox:
