%!PS-Adobe-1.0
%%Creator: Unified Graphics System
%%Pages: (atend)
%%DocumentFonts: Courier
%%BoundingBox:   64  259  548  563
%%EndComments
/Sw{setlinewidth}def
/Sg{setgray}def
/Sd{setdash}def
/P {newpath
    moveto
0 0 rlineto
    stroke}def
/M {moveto}def
/D {lineto}def
/N {newpath}def
/S {stroke}def
/T {/Courier findfont
    exch
    scalefont
    setfont}def
/R {rotate}def
/W {show}def
/F {fill}def
/X {gsave}def
/Y {grestore}def
%%EndProlog
%%Page: 1 1
0.24000 0.24000 scale
1 setlinecap
1 setlinejoin
4 Sw
0 0 0 setrgbcolor
[] 0 Sd
N
1241 1127 M
1241 1096 D
S
N
1243 1127 M
1251 1101 D
S
N
1241 1127 M
1251 1096 D
S
N
1261 1127 M
1251 1096 D
S
N
1261 1127 M
1261 1096 D
S
N
1263 1127 M
1263 1096 D
S
N
1237 1127 M
1243 1127 D
S
N
1261 1127 M
1267 1127 D
S
N
1237 1096 M
1245 1096 D
S
N
1257 1096 M
1267 1096 D
S
N
1286 1132 M
1283 1130 D
1280 1125 D
1277 1119 D
1276 1112 D
1276 1106 D
1277 1099 D
1280 1093 D
1283 1089 D
1286 1086 D
S
N
1283 1130 M
1280 1124 D
1279 1119 D
1277 1112 D
1277 1106 D
1279 1099 D
1280 1095 D
1283 1089 D
S
N
1296 1108 M
1313 1108 D
1313 1111 D
1312 1114 D
1310 1115 D
1308 1117 D
1303 1117 D
1299 1115 D
1296 1112 D
1295 1108 D
1295 1105 D
1296 1101 D
1299 1098 D
1303 1096 D
1306 1096 D
1310 1098 D
1313 1101 D
S
N
1312 1108 M
1312 1112 D
1310 1115 D
S
N
1303 1117 M
1300 1115 D
1297 1112 D
1296 1108 D
1296 1105 D
1297 1101 D
1300 1098 D
1303 1096 D
S
N
1323 1108 M
1341 1108 D
1341 1111 D
1339 1114 D
1338 1115 D
1335 1117 D
1331 1117 D
1326 1115 D
1323 1112 D
1322 1108 D
1322 1105 D
1323 1101 D
1326 1098 D
1331 1096 D
1334 1096 D
1338 1098 D
1341 1101 D
S
N
1339 1108 M
1339 1112 D
1338 1115 D
S
N
1331 1117 M
1328 1115 D
1325 1112 D
1323 1108 D
1323 1105 D
1325 1101 D
1328 1098 D
1331 1096 D
S
N
1354 1117 M
1351 1096 D
S
N
1355 1117 M
1354 1108 D
1352 1101 D
1351 1096 D
S
N
1370 1117 M
1368 1111 D
1365 1105 D
S
N
1371 1117 M
1370 1112 D
1368 1109 D
1365 1105 D
1362 1102 D
1358 1099 D
1355 1098 D
1351 1096 D
S
N
1349 1117 M
1355 1117 D
S
N
1383 1117 M
1380 1096 D
S
N
1384 1117 M
1383 1108 D
1381 1101 D
1380 1096 D
S
N
1398 1117 M
1397 1111 D
1394 1105 D
S
N
1400 1117 M
1398 1112 D
1397 1109 D
1394 1105 D
1391 1102 D
1387 1099 D
1384 1098 D
1380 1096 D
S
N
1378 1117 M
1384 1117 D
S
N
1407 1132 M
1410 1130 D
1413 1125 D
1416 1119 D
1417 1112 D
1417 1106 D
1416 1099 D
1413 1093 D
1410 1089 D
1407 1086 D
S
N
1410 1130 M
1413 1124 D
1414 1119 D
1416 1112 D
1416 1106 D
1414 1099 D
1413 1095 D
1410 1089 D
S
N
1462 1132 M
1459 1130 D
1456 1125 D
1453 1119 D
1452 1112 D
1452 1106 D
1453 1099 D
1456 1093 D
1459 1089 D
1462 1086 D
S
N
1459 1130 M
1456 1124 D
1455 1119 D
1453 1112 D
1453 1106 D
1455 1099 D
1456 1095 D
1459 1089 D
S
N
1491 1122 M
1492 1118 D
1492 1127 D
1491 1122 D
1488 1125 D
1484 1127 D
1481 1127 D
1476 1125 D
1474 1122 D
1472 1119 D
1471 1115 D
1471 1108 D
1472 1104 D
1474 1101 D
1476 1098 D
1481 1096 D
1484 1096 D
1488 1098 D
1491 1101 D
S
N
1481 1127 M
1478 1125 D
1475 1122 D
1474 1119 D
1472 1115 D
1472 1108 D
1474 1104 D
1475 1101 D
1478 1098 D
1481 1096 D
S
N
1491 1108 M
1491 1096 D
S
N
1492 1108 M
1492 1096 D
S
N
1487 1108 M
1497 1108 D
S
N
1505 1108 M
1523 1108 D
1523 1111 D
1521 1114 D
1520 1115 D
1517 1117 D
1513 1117 D
1508 1115 D
1505 1112 D
1504 1108 D
1504 1105 D
1505 1101 D
1508 1098 D
1513 1096 D
1515 1096 D
1520 1098 D
1523 1101 D
S
N
1521 1108 M
1521 1112 D
1520 1115 D
S
N
1513 1117 M
1510 1115 D
1507 1112 D
1505 1108 D
1505 1105 D
1507 1101 D
1510 1098 D
1513 1096 D
S
N
1531 1127 M
1541 1096 D
S
N
1533 1127 M
1541 1101 D
S
N
1552 1127 M
1541 1096 D
S
N
1528 1127 M
1537 1127 D
S
N
1546 1127 M
1554 1127 D
S
N
1560 1132 M
1563 1130 D
1566 1125 D
1569 1119 D
1570 1112 D
1570 1106 D
1569 1099 D
1566 1093 D
1563 1089 D
1560 1086 D
S
N
1563 1130 M
1566 1124 D
1567 1119 D
1569 1112 D
1569 1106 D
1567 1099 D
1566 1095 D
1563 1089 D
S
N
292 1540 M
289 1542 D
295 1542 D
292 1540 D
291 1539 D
289 1536 D
289 1530 D
291 1527 D
292 1526 D
295 1526 D
297 1527 D
298 1530 D
301 1538 D
302 1540 D
304 1542 D
S
N
294 1526 M
295 1527 D
297 1530 D
300 1538 D
301 1540 D
302 1542 D
307 1542 D
308 1540 D
310 1538 D
310 1532 D
308 1529 D
307 1527 D
304 1526 D
310 1526 D
307 1527 D
S
N
279 1553 M
281 1552 D
282 1553 D
281 1555 D
279 1553 D
S
N
289 1553 M
310 1553 D
S
N
289 1555 M
310 1555 D
S
N
289 1549 M
289 1555 D
S
N
310 1549 M
310 1559 D
S
N
289 1574 M
291 1571 D
292 1569 D
295 1568 D
298 1568 D
301 1569 D
302 1571 D
304 1574 D
304 1577 D
302 1579 D
301 1581 D
298 1582 D
295 1582 D
292 1581 D
291 1579 D
289 1577 D
289 1574 D
S
N
291 1571 M
294 1569 D
300 1569 D
302 1571 D
S
N
302 1579 M
300 1581 D
294 1581 D
291 1579 D
S
N
292 1581 M
291 1582 D
289 1585 D
291 1585 D
291 1582 D
S
N
301 1569 M
302 1568 D
305 1566 D
307 1566 D
310 1568 D
311 1572 D
311 1579 D
313 1584 D
314 1585 D
S
N
307 1566 M
308 1568 D
310 1572 D
310 1579 D
311 1584 D
314 1585 D
315 1585 D
318 1584 D
320 1579 D
320 1571 D
318 1566 D
315 1565 D
314 1565 D
311 1566 D
310 1571 D
S
N
289 1597 M
310 1597 D
S
N
289 1598 M
310 1598 D
S
N
294 1598 M
291 1601 D
289 1605 D
289 1608 D
291 1613 D
294 1614 D
310 1614 D
S
N
289 1608 M
291 1611 D
294 1613 D
310 1613 D
S
N
294 1614 M
291 1617 D
289 1621 D
289 1624 D
291 1629 D
294 1630 D
310 1630 D
S
N
289 1624 M
291 1627 D
294 1629 D
310 1629 D
S
N
289 1592 M
289 1598 D
S
N
310 1592 M
310 1603 D
S
N
310 1608 M
310 1618 D
S
N
310 1624 M
310 1634 D
S
N
292 1644 M
294 1644 D
294 1643 D
292 1643 D
291 1644 D
289 1647 D
289 1653 D
291 1656 D
292 1657 D
295 1659 D
305 1659 D
308 1660 D
310 1662 D
S
N
292 1657 M
305 1657 D
308 1659 D
310 1662 D
310 1663 D
S
N
295 1657 M
297 1656 D
298 1647 D
300 1643 D
302 1641 D
305 1641 D
308 1643 D
310 1647 D
310 1652 D
308 1654 D
305 1657 D
S
N
298 1647 M
300 1644 D
302 1643 D
305 1643 D
308 1644 D
310 1647 D
S
N
274 1705 M
276 1702 D
281 1699 D
287 1696 D
294 1695 D
300 1695 D
307 1696 D
313 1699 D
317 1702 D
320 1705 D
S
N
276 1702 M
282 1699 D
287 1698 D
294 1696 D
300 1696 D
307 1698 D
311 1699 D
317 1702 D
S
N
289 1717 M
320 1717 D
S
N
289 1718 M
320 1718 D
S
N
294 1718 M
291 1721 D
289 1724 D
289 1727 D
291 1731 D
294 1734 D
298 1735 D
301 1735 D
305 1734 D
308 1731 D
310 1727 D
310 1724 D
308 1721 D
305 1718 D
S
N
289 1727 M
291 1730 D
294 1732 D
298 1734 D
301 1734 D
305 1732 D
308 1730 D
310 1727 D
S
N
289 1712 M
289 1718 D
S
N
320 1712 M
320 1722 D
S
N
279 1747 M
310 1747 D
S
N
279 1748 M
310 1748 D
S
N
294 1748 M
291 1751 D
289 1754 D
289 1757 D
291 1761 D
294 1764 D
298 1766 D
301 1766 D
305 1764 D
308 1761 D
310 1757 D
310 1754 D
308 1751 D
305 1748 D
S
N
289 1757 M
291 1760 D
294 1763 D
298 1764 D
301 1764 D
305 1763 D
308 1760 D
310 1757 D
S
N
279 1743 M
279 1748 D
S
N
274 1799 M
320 1773 D
S
N
279 1809 M
310 1809 D
S
N
279 1810 M
310 1810 D
S
N
294 1810 M
291 1813 D
289 1816 D
289 1819 D
291 1823 D
294 1826 D
298 1828 D
301 1828 D
305 1826 D
308 1823 D
310 1819 D
310 1816 D
308 1813 D
305 1810 D
S
N
289 1819 M
291 1822 D
294 1825 D
298 1826 D
301 1826 D
305 1825 D
308 1822 D
310 1819 D
S
N
279 1805 M
279 1810 D
S
N
279 1839 M
281 1838 D
282 1839 D
281 1841 D
279 1839 D
S
N
289 1839 M
310 1839 D
S
N
289 1841 M
310 1841 D
S
N
289 1835 M
289 1841 D
S
N
310 1835 M
310 1845 D
S
N
289 1855 M
310 1855 D
S
N
289 1857 M
310 1857 D
S
N
294 1857 M
291 1860 D
289 1864 D
289 1867 D
291 1871 D
294 1872 D
310 1872 D
S
N
289 1867 M
291 1870 D
294 1871 D
310 1871 D
S
N
289 1851 M
289 1857 D
S
N
310 1851 M
310 1861 D
S
N
310 1867 M
310 1877 D
S
N
274 1884 M
276 1887 D
281 1890 D
287 1893 D
294 1894 D
300 1894 D
307 1893 D
313 1890 D
317 1887 D
320 1884 D
S
N
276 1887 M
282 1890 D
287 1891 D
294 1893 D
300 1893 D
307 1891 D
311 1890 D
317 1887 D
S
N
1005 1576 M
1005 1546 D
S
N
1007 1576 M
1007 1546 D
S
N
1001 1576 M
1011 1576 D
S
N
1001 1546 M
1023 1546 D
1023 1555 D
1021 1546 D
S
N
1031 1576 M
1031 1546 D
S
N
1033 1576 M
1033 1546 D
S
N
1050 1576 M
1050 1546 D
S
N
1052 1576 M
1052 1546 D
S
N
1027 1576 M
1037 1576 D
S
N
1046 1576 M
1056 1576 D
S
N
1033 1562 M
1050 1562 D
S
N
1027 1546 M
1037 1546 D
S
N
1046 1546 M
1056 1546 D
S
N
1083 1572 M
1085 1568 D
1085 1576 D
1083 1572 D
1080 1575 D
1076 1576 D
1073 1576 D
1069 1575 D
1066 1572 D
1065 1569 D
1063 1565 D
1063 1558 D
1065 1553 D
1066 1551 D
1069 1548 D
1073 1546 D
1076 1546 D
1080 1548 D
1083 1551 D
1085 1553 D
S
N
1073 1576 M
1070 1575 D
1067 1572 D
1066 1569 D
1065 1565 D
1065 1558 D
1066 1553 D
1067 1551 D
1070 1548 D
1073 1546 D
S
N
1124 1576 M
1119 1575 D
1118 1572 D
1118 1568 D
1119 1565 D
1124 1564 D
1130 1564 D
1134 1565 D
1135 1568 D
1135 1572 D
1134 1575 D
1130 1576 D
1124 1576 D
S
N
1124 1576 M
1121 1575 D
1119 1572 D
1119 1568 D
1121 1565 D
1124 1564 D
S
N
1130 1564 M
1132 1565 D
1134 1568 D
1134 1572 D
1132 1575 D
1130 1576 D
S
N
1124 1564 M
1119 1562 D
1118 1561 D
1117 1558 D
1117 1552 D
1118 1549 D
1119 1548 D
1124 1546 D
1130 1546 D
1134 1548 D
1135 1549 D
1137 1552 D
1137 1558 D
1135 1561 D
1134 1562 D
1130 1564 D
S
N
1124 1564 M
1121 1562 D
1119 1561 D
1118 1558 D
1118 1552 D
1119 1549 D
1121 1548 D
1124 1546 D
S
N
1130 1546 M
1132 1548 D
1134 1549 D
1135 1552 D
1135 1558 D
1134 1561 D
1132 1562 D
1130 1564 D
S
N
1177 1576 M
1177 1546 D
S
N
1179 1576 M
1179 1546 D
S
N
1169 1576 M
1167 1568 D
1167 1576 D
1189 1576 D
1189 1568 D
1187 1576 D
S
N
1173 1546 M
1183 1546 D
S
N
1197 1558 M
1215 1558 D
1215 1561 D
1213 1564 D
1212 1565 D
1209 1566 D
1205 1566 D
1200 1565 D
1197 1562 D
1196 1558 D
1196 1555 D
1197 1551 D
1200 1548 D
1205 1546 D
1208 1546 D
1212 1548 D
1215 1551 D
S
N
1213 1558 M
1213 1562 D
1212 1565 D
S
N
1205 1566 M
1202 1565 D
1199 1562 D
1197 1558 D
1197 1555 D
1199 1551 D
1202 1548 D
1205 1546 D
S
N
1223 1576 M
1234 1546 D
S
N
1225 1576 M
1234 1551 D
S
N
1244 1576 M
1234 1546 D
S
N
1221 1576 M
1229 1576 D
S
N
1238 1576 M
1247 1576 D
S
N
1005 1480 M
1005 1450 D
S
N
1007 1480 M
1007 1450 D
S
N
1007 1476 M
1010 1478 D
1013 1480 D
1015 1480 D
1020 1478 D
1023 1476 D
1024 1471 D
1024 1468 D
1023 1464 D
1020 1461 D
1015 1460 D
1013 1460 D
1010 1461 D
1007 1464 D
S
N
1016 1480 M
1018 1478 D
1021 1476 D
1023 1471 D
1023 1468 D
1021 1464 D
1018 1461 D
1016 1460 D
S
N
1001 1480 M
1007 1480 D
S
N
1001 1450 M
1011 1450 D
S
N
1036 1480 M
1036 1450 D
S
N
1037 1480 M
1037 1450 D
S
N
1037 1476 M
1040 1478 D
1043 1480 D
1046 1480 D
1050 1478 D
1053 1476 D
1054 1471 D
1054 1468 D
1053 1464 D
1050 1461 D
1046 1460 D
1043 1460 D
1040 1461 D
1037 1464 D
S
N
1046 1480 M
1049 1478 D
1052 1476 D
1053 1471 D
1053 1468 D
1052 1464 D
1049 1461 D
1046 1460 D
S
N
1031 1480 M
1037 1480 D
S
N
1031 1450 M
1041 1450 D
S
N
1109 1476 M
1114 1473 D
1109 1470 D
S
N
1105 1480 M
1112 1473 D
1105 1465 D
S
N
1088 1473 M
1112 1473 D
S
N
1166 1490 M
1147 1460 D
S
N
1167 1490 M
1148 1460 D
S
N
1148 1490 M
1147 1481 D
1147 1490 D
1167 1490 D
S
N
1147 1460 M
1167 1460 D
1167 1468 D
1166 1460 D
S
N
1200 1496 M
1174 1450 D
S
N
1205 1476 M
1208 1478 D
1210 1480 D
1213 1480 D
1216 1478 D
1218 1477 D
1219 1473 D
1219 1467 D
1218 1461 D
1213 1450 D
S
N
1206 1477 M
1209 1478 D
1215 1478 D
1218 1477 D
S
N
1229 1480 M
1228 1476 D
1226 1473 D
1219 1463 D
1215 1455 D
1212 1450 D
S
N
1228 1480 M
1226 1476 D
1225 1473 D
1219 1463 D
S
N
1241 1498 M
1246 1485 D
S
N
1246 1498 M
1241 1485 D
S
N
1237 1494 M
1250 1489 D
S
N
1250 1494 M
1237 1489 D
S
N
1301 1490 M
1283 1460 D
S
N
1303 1490 M
1284 1460 D
S
N
1284 1490 M
1283 1481 D
1283 1490 D
1303 1490 D
S
N
1283 1460 M
1303 1460 D
1303 1468 D
1301 1460 D
S
N
1358 1476 M
1362 1473 D
1358 1470 D
S
N
1353 1480 M
1361 1473 D
1353 1465 D
S
N
1336 1473 M
1361 1473 D
S
N
1397 1471 M
1414 1471 D
1414 1474 D
1413 1477 D
1411 1478 D
1408 1480 D
1404 1480 D
1400 1478 D
1397 1476 D
1395 1471 D
1395 1468 D
1397 1464 D
1400 1461 D
1404 1460 D
1407 1460 D
1411 1461 D
1414 1464 D
S
N
1413 1471 M
1413 1476 D
1411 1478 D
S
N
1404 1480 M
1401 1478 D
1398 1476 D
1397 1471 D
1397 1468 D
1398 1464 D
1401 1461 D
1404 1460 D
S
N
1433 1500 M
1433 1483 D
S
N
1424 1491 M
1441 1491 D
S
N
1476 1471 M
1493 1471 D
1493 1474 D
1492 1477 D
1490 1478 D
1488 1480 D
1483 1480 D
1479 1478 D
1476 1476 D
1475 1471 D
1475 1468 D
1476 1464 D
1479 1461 D
1483 1460 D
1486 1460 D
1490 1461 D
1493 1464 D
S
N
1492 1471 M
1492 1476 D
1490 1478 D
S
N
1483 1480 M
1480 1478 D
1477 1476 D
1476 1471 D
1476 1468 D
1477 1464 D
1480 1461 D
1483 1460 D
S
N
1503 1491 M
1521 1491 D
S
N
1558 1480 M
1555 1460 D
S
N
1560 1480 M
1558 1471 D
1557 1464 D
1555 1460 D
S
N
1574 1480 M
1573 1474 D
1570 1468 D
S
N
1576 1480 M
1574 1476 D
1573 1473 D
1570 1468 D
1567 1465 D
1563 1463 D
1560 1461 D
1555 1460 D
S
N
1554 1480 M
1560 1480 D
S
N
1587 1462 M
1581 1441 D
S
N
1588 1462 M
1582 1441 D
S
N
1587 1459 M
1586 1453 D
1586 1450 D
1588 1448 D
1590 1448 D
1592 1449 D
1594 1451 D
1596 1454 D
S
N
1598 1462 M
1595 1451 D
1595 1449 D
1596 1448 D
1599 1448 D
1601 1450 D
1602 1452 D
S
N
1599 1462 M
1596 1451 D
1596 1449 D
1597 1448 D
S
N
1636 1480 M
1633 1460 D
S
N
1638 1480 M
1636 1471 D
1635 1464 D
1633 1460 D
S
N
1652 1480 M
1651 1474 D
1648 1468 D
S
N
1654 1480 M
1652 1476 D
1651 1473 D
1648 1468 D
1645 1465 D
1641 1463 D
1638 1461 D
1633 1460 D
S
N
1632 1480 M
1638 1480 D
S
N
1665 1462 M
1659 1441 D
S
N
1666 1462 M
1660 1441 D
S
N
1665 1459 M
1664 1453 D
1664 1450 D
1666 1448 D
1668 1448 D
1670 1449 D
1672 1451 D
1674 1454 D
S
N
1676 1462 M
1673 1451 D
1673 1449 D
1674 1448 D
1677 1448 D
1679 1450 D
1680 1452 D
S
N
1677 1462 M
1674 1451 D
1674 1449 D
1675 1448 D
S
N
2248 1778 M
2278 1778 D
S
N
2248 1780 M
2278 1780 D
S
N
2248 1774 M
2248 1784 D
S
N
2278 1774 M
2278 1796 D
2270 1796 D
2278 1794 D
S
N
2248 1804 M
2278 1804 D
S
N
2248 1806 M
2278 1806 D
S
N
2248 1823 M
2278 1823 D
S
N
2248 1824 M
2278 1824 D
S
N
2248 1800 M
2248 1810 D
S
N
2248 1819 M
2248 1829 D
S
N
2263 1806 M
2263 1823 D
S
N
2278 1800 M
2278 1810 D
S
N
2278 1819 M
2278 1829 D
S
N
2252 1856 M
2257 1858 D
2248 1858 D
2252 1856 D
2250 1853 D
2248 1849 D
2248 1846 D
2250 1842 D
2252 1839 D
2255 1837 D
2260 1836 D
2267 1836 D
2271 1837 D
2274 1839 D
2277 1842 D
2278 1846 D
2278 1849 D
2277 1853 D
2274 1856 D
2271 1858 D
S
N
2248 1846 M
2250 1843 D
2252 1840 D
2255 1839 D
2260 1837 D
2267 1837 D
2271 1839 D
2274 1840 D
2277 1843 D
2278 1846 D
S
N
2248 1892 M
2278 1892 D
S
N
2248 1894 M
2278 1894 D
S
N
2248 1911 M
2278 1911 D
S
N
2248 1913 M
2278 1913 D
S
N
2248 1888 M
2248 1898 D
S
N
2248 1907 M
2248 1917 D
S
N
2263 1894 M
2263 1911 D
S
N
2278 1888 M
2278 1898 D
S
N
2278 1907 M
2278 1917 D
S
N
2248 1927 M
2278 1927 D
S
N
2248 1928 M
2278 1928 D
S
N
2248 1923 M
2248 1933 D
S
N
2278 1923 M
2278 1933 D
S
N
2252 1960 M
2257 1962 D
2248 1962 D
2252 1960 D
2250 1957 D
2248 1953 D
2248 1950 D
2250 1946 D
2252 1943 D
2255 1941 D
2260 1940 D
2267 1940 D
2271 1941 D
2274 1943 D
2277 1946 D
2278 1950 D
2278 1953 D
2277 1957 D
2274 1960 D
S
N
2248 1950 M
2250 1947 D
2252 1944 D
2255 1943 D
2260 1941 D
2267 1941 D
2271 1943 D
2274 1944 D
2277 1947 D
2278 1950 D
S
N
2267 1960 M
2278 1960 D
S
N
2267 1962 M
2278 1962 D
S
N
2267 1956 M
2267 1966 D
S
N
2252 1993 M
2257 1995 D
2248 1995 D
2252 1993 D
2250 1991 D
2248 1986 D
2248 1983 D
2250 1979 D
2252 1976 D
2255 1975 D
2260 1973 D
2267 1973 D
2271 1975 D
2274 1976 D
2277 1979 D
2278 1983 D
2278 1986 D
2277 1991 D
2274 1993 D
S
N
2248 1983 M
2250 1980 D
2252 1978 D
2255 1976 D
2260 1975 D
2267 1975 D
2271 1976 D
2274 1978 D
2277 1980 D
2278 1983 D
S
N
2267 1993 M
2278 1993 D
S
N
2267 1995 M
2278 1995 D
S
N
2267 1989 M
2267 1999 D
S
N
2252 2025 M
2248 2027 D
2257 2027 D
2252 2025 D
2250 2022 D
2248 2018 D
2248 2014 D
2250 2009 D
2252 2006 D
2255 2006 D
2258 2008 D
2260 2009 D
2261 2012 D
2264 2021 D
2265 2024 D
2268 2027 D
S
N
2255 2006 M
2258 2009 D
2260 2012 D
2263 2021 D
2264 2024 D
2265 2025 D
2268 2027 D
2274 2027 D
2277 2024 D
2278 2019 D
2278 2015 D
2277 2011 D
2274 2008 D
2270 2006 D
2278 2006 D
2274 2008 D
S
N
2248 2058 M
2278 2077 D
S
N
2248 2060 M
2278 2079 D
S
N
2248 2079 M
2278 2058 D
S
N
2248 2055 M
2248 2064 D
S
N
2248 2073 M
2248 2081 D
S
N
2278 2055 M
2278 2064 D
S
N
2278 2073 M
2278 2081 D
S
N
2252 2106 M
2248 2107 D
2257 2107 D
2252 2106 D
2250 2103 D
2248 2099 D
2248 2094 D
2250 2090 D
2252 2087 D
2255 2087 D
2258 2089 D
2260 2090 D
2261 2093 D
2264 2102 D
2265 2105 D
2268 2107 D
S
N
2255 2087 M
2258 2090 D
2260 2093 D
2263 2102 D
2264 2105 D
2265 2106 D
2268 2107 D
2274 2107 D
2277 2105 D
2278 2100 D
2278 2096 D
2277 2092 D
2274 2089 D
2270 2087 D
2278 2087 D
2274 2089 D
S
N
2248 2141 M
2278 2146 D
S
N
2248 2142 M
2271 2146 D
S
N
2248 2152 M
2278 2146 D
S
N
2248 2152 M
2278 2158 D
S
N
2248 2154 M
2271 2158 D
S
N
2248 2164 M
2278 2158 D
S
N
2248 2136 M
2248 2146 D
S
N
2248 2159 M
2248 2168 D
S
N
2252 2194 M
2257 2196 D
2248 2196 D
2252 2194 D
2250 2191 D
2248 2187 D
2248 2184 D
2250 2180 D
2252 2177 D
2255 2175 D
2260 2174 D
2267 2174 D
2271 2175 D
2274 2177 D
2277 2180 D
2278 2184 D
2278 2187 D
2277 2191 D
2274 2194 D
S
N
2248 2184 M
2250 2181 D
2252 2178 D
2255 2177 D
2260 2175 D
2267 2175 D
2271 2177 D
2274 2178 D
2277 2181 D
2278 2184 D
S
N
2267 2194 M
2278 2194 D
S
N
2267 2196 M
2278 2196 D
S
N
2267 2190 M
2267 2200 D
S
N
2254 2232 M
2255 2233 D
2257 2232 D
2255 2230 D
2254 2230 D
2251 2232 D
2250 2233 D
2248 2237 D
2248 2243 D
2250 2248 D
2251 2249 D
2254 2250 D
2257 2250 D
2260 2249 D
2263 2245 D
2265 2237 D
2267 2235 D
2270 2232 D
2274 2230 D
2278 2230 D
S
N
2248 2243 M
2250 2246 D
2251 2248 D
2254 2249 D
2257 2249 D
2260 2248 D
2263 2243 D
2265 2237 D
S
N
2276 2230 M
2274 2232 D
2274 2235 D
2277 2242 D
2277 2246 D
2276 2249 D
2274 2250 D
S
N
2274 2235 M
2278 2242 D
2278 2248 D
2277 2249 D
2274 2250 D
2271 2250 D
S
N
2248 2268 M
2250 2263 D
2254 2261 D
2261 2259 D
2265 2259 D
2273 2261 D
2277 2263 D
2278 2268 D
2278 2271 D
2277 2275 D
2273 2278 D
2265 2279 D
2261 2279 D
2254 2278 D
2250 2275 D
2248 2271 D
2248 2268 D
S
N
2248 2268 M
2250 2265 D
2251 2263 D
2254 2262 D
2261 2261 D
2265 2261 D
2273 2262 D
2276 2263 D
2277 2265 D
2278 2268 D
S
N
2278 2271 M
2277 2273 D
2276 2275 D
2273 2276 D
2265 2278 D
2261 2278 D
2254 2276 D
2251 2275 D
2250 2273 D
2248 2271 D
S
N
2254 2292 M
2252 2295 D
2248 2299 D
2278 2299 D
S
N
2250 2298 M
2278 2298 D
S
N
2278 2292 M
2278 2305 D
S
N
2254 2318 M
2255 2320 D
2257 2318 D
2255 2317 D
2254 2317 D
2251 2318 D
2250 2320 D
2248 2324 D
2248 2330 D
2250 2334 D
2252 2336 D
2257 2336 D
2260 2334 D
2261 2330 D
2261 2325 D
S
N
2248 2330 M
2250 2333 D
2252 2334 D
2257 2334 D
2260 2333 D
2261 2330 D
S
N
2261 2330 M
2263 2333 D
2265 2336 D
2268 2337 D
2273 2337 D
2276 2336 D
2277 2334 D
2278 2330 D
2278 2324 D
2277 2320 D
2276 2318 D
2273 2317 D
2271 2317 D
2270 2318 D
2271 2320 D
2273 2318 D
S
N
2264 2334 M
2268 2336 D
2273 2336 D
2276 2334 D
2277 2333 D
2278 2330 D
S
N
1839 2085 M
1824 2085 D
1820 2084 D
1817 2080 D
1816 2075 D
1816 2071 D
1817 2068 D
1818 2067 D
1821 2065 D
1824 2065 D
1829 2067 D
1831 2071 D
1833 2075 D
1833 2080 D
1831 2082 D
1830 2084 D
1827 2085 D
S
N
1824 2085 M
1821 2084 D
1818 2080 D
1817 2075 D
1817 2070 D
1818 2067 D
S
N
1824 2065 M
1827 2067 D
1830 2071 D
1831 2075 D
1831 2081 D
1830 2084 D
S
N
1830 2084 M
1839 2084 D
S
N
1848 2074 M
1848 2054 D
S
N
1849 2074 M
1849 2054 D
S
N
1845 2074 M
1857 2074 D
1860 2073 D
1861 2072 D
1862 2070 D
1862 2068 D
1861 2066 D
1860 2065 D
1857 2064 D
S
N
1857 2074 M
1859 2073 D
1860 2072 D
1861 2070 D
1861 2068 D
1860 2066 D
1859 2065 D
1857 2064 D
S
N
1849 2064 M
1857 2064 D
1860 2063 D
1861 2062 D
1862 2060 D
1862 2057 D
1861 2056 D
1860 2055 D
1857 2054 D
1845 2054 D
S
N
1857 2064 M
1859 2063 D
1860 2062 D
1861 2060 D
1861 2057 D
1860 2056 D
1859 2055 D
1857 2054 D
S
N
1873 2108 M
1873 2088 D
S
N
1874 2108 M
1874 2088 D
S
N
1870 2108 M
1877 2108 D
S
N
1870 2088 M
1885 2088 D
1885 2094 D
1884 2088 D
S
N
1895 2108 M
1893 2108 D
1891 2106 D
1890 2104 D
1889 2100 D
1889 2097 D
1890 2093 D
1891 2091 D
1893 2089 D
1895 2088 D
1897 2088 D
1900 2089 D
1902 2091 D
1903 2093 D
1904 2097 D
1904 2100 D
1903 2104 D
1902 2106 D
1900 2108 D
1897 2108 D
1895 2108 D
S
N
1895 2108 M
1894 2108 D
1892 2106 D
1891 2104 D
1890 2100 D
1890 2097 D
1891 2093 D
1892 2091 D
1894 2089 D
1895 2088 D
S
N
1897 2088 M
1899 2089 D
1901 2091 D
1902 2093 D
1903 2097 D
1903 2100 D
1902 2104 D
1901 2106 D
1899 2108 D
1897 2108 D
S
N
1951 2091 M
1951 2065 D
S
N
1938 2078 M
1964 2078 D
S
N
2020 2085 M
2006 2085 D
2001 2084 D
1998 2080 D
1997 2075 D
1997 2071 D
1998 2068 D
2000 2067 D
2003 2065 D
2006 2065 D
2010 2067 D
2013 2071 D
2014 2075 D
2014 2080 D
2013 2083 D
2011 2084 D
2009 2085 D
S
N
2006 2085 M
2003 2084 D
2000 2080 D
1998 2075 D
1998 2070 D
2000 2067 D
S
N
2006 2065 M
2009 2067 D
2011 2071 D
2013 2075 D
2013 2081 D
2011 2084 D
S
N
2011 2084 M
2020 2084 D
S
N
2040 2071 M
2041 2074 D
2041 2068 D
2040 2071 D
2038 2073 D
2036 2074 D
2033 2074 D
2030 2073 D
2028 2071 D
2028 2069 D
2029 2067 D
2030 2066 D
2032 2065 D
2037 2063 D
2039 2062 D
2041 2060 D
S
N
2028 2069 M
2030 2067 D
2032 2066 D
2037 2064 D
2039 2063 D
2040 2062 D
2041 2060 D
2041 2057 D
2039 2055 D
2037 2054 D
2034 2054 D
2031 2055 D
2029 2057 D
2028 2059 D
2028 2054 D
2029 2057 D
S
N
2053 2108 M
2053 2088 D
S
N
2054 2108 M
2065 2090 D
S
N
2054 2107 M
2065 2088 D
S
N
2065 2108 M
2065 2088 D
S
N
2050 2108 M
2054 2108 D
S
N
2062 2108 M
2068 2108 D
S
N
2050 2088 M
2056 2088 D
S
N
2075 2108 M
2075 2088 D
S
N
2076 2108 M
2076 2088 D
S
N
2072 2108 M
2079 2108 D
S
N
2072 2088 M
2087 2088 D
2087 2094 D
2086 2088 D
S
N
2097 2108 M
2094 2108 D
2092 2106 D
2091 2104 D
2090 2100 D
2090 2097 D
2091 2093 D
2092 2091 D
2094 2089 D
2097 2088 D
2099 2088 D
2102 2089 D
2104 2091 D
2105 2093 D
2106 2097 D
2106 2100 D
2105 2104 D
2104 2106 D
2102 2108 D
2099 2108 D
2097 2108 D
S
N
2097 2108 M
2095 2108 D
2093 2106 D
2092 2104 D
2091 2100 D
2091 2097 D
2092 2093 D
2093 2091 D
2095 2089 D
2097 2088 D
S
N
2099 2088 M
2101 2089 D
2103 2091 D
2104 2093 D
2105 2097 D
2105 2100 D
2104 2104 D
2103 2106 D
2101 2108 D
2099 2108 D
S
1 0 0 setrgbcolor
N
1839 2172 M
1824 2172 D
1820 2170 D
1817 2166 D
1816 2162 D
1816 2157 D
1817 2155 D
1818 2153 D
1821 2152 D
1824 2152 D
1829 2153 D
1831 2157 D
1833 2162 D
1833 2166 D
1831 2169 D
1830 2170 D
1827 2172 D
S
N
1824 2172 M
1821 2170 D
1818 2166 D
1817 2162 D
1817 2156 D
1818 2153 D
S
N
1824 2152 M
1827 2153 D
1830 2157 D
1831 2162 D
1831 2168 D
1830 2170 D
S
N
1830 2170 M
1839 2170 D
S
N
1848 2160 M
1848 2140 D
S
N
1849 2160 M
1849 2140 D
S
N
1845 2160 M
1857 2160 D
1860 2159 D
1861 2158 D
1862 2156 D
1862 2155 D
1861 2153 D
1860 2152 D
1857 2151 D
S
N
1857 2160 M
1859 2159 D
1860 2158 D
1861 2156 D
1861 2155 D
1860 2153 D
1859 2152 D
1857 2151 D
S
N
1849 2151 M
1857 2151 D
1860 2150 D
1861 2149 D
1862 2147 D
1862 2144 D
1861 2142 D
1860 2141 D
1857 2140 D
1845 2140 D
S
N
1857 2151 M
1859 2150 D
1860 2149 D
1861 2147 D
1861 2144 D
1860 2142 D
1859 2141 D
1857 2140 D
S
N
1877 2157 M
1877 2140 D
S
N
1869 2149 M
1886 2149 D
S
N
1895 2160 M
1894 2159 D
1895 2158 D
1895 2159 D
1895 2160 D
S
N
1895 2154 M
1895 2140 D
S
N
1895 2154 M
1895 2140 D
S
N
1892 2154 M
1895 2154 D
S
N
1892 2140 M
1898 2140 D
S
N
1909 2195 M
1909 2175 D
S
N
1910 2195 M
1910 2175 D
S
N
1906 2195 M
1913 2195 D
S
N
1906 2175 M
1921 2175 D
1921 2181 D
1920 2175 D
S
N
1931 2195 M
1928 2194 D
1926 2192 D
1925 2190 D
1924 2186 D
1924 2183 D
1925 2180 D
1926 2178 D
1928 2176 D
1931 2175 D
1933 2175 D
1936 2176 D
1938 2178 D
1939 2180 D
1940 2183 D
1940 2186 D
1939 2190 D
1938 2192 D
1936 2194 D
1933 2195 D
1931 2195 D
S
N
1931 2195 M
1929 2194 D
1927 2192 D
1926 2190 D
1925 2186 D
1925 2183 D
1926 2180 D
1927 2178 D
1929 2176 D
1931 2175 D
S
N
1933 2175 M
1935 2176 D
1937 2178 D
1938 2180 D
1939 2183 D
1939 2186 D
1938 2190 D
1937 2192 D
1935 2194 D
1933 2195 D
S
N
1986 2178 M
1986 2152 D
S
N
1973 2165 M
1999 2165 D
S
N
2056 2172 M
2041 2172 D
2037 2170 D
2034 2166 D
2033 2162 D
2033 2157 D
2034 2155 D
2036 2153 D
2038 2152 D
2041 2152 D
2046 2153 D
2049 2157 D
2050 2162 D
2050 2166 D
2049 2169 D
2047 2170 D
2044 2172 D
S
N
2041 2172 M
2038 2170 D
2036 2166 D
2034 2162 D
2034 2156 D
2036 2153 D
S
N
2041 2152 M
2044 2153 D
2047 2157 D
2049 2162 D
2049 2168 D
2047 2170 D
S
N
2047 2170 M
2056 2170 D
S
N
2076 2157 M
2077 2160 D
2077 2155 D
2076 2157 D
2074 2159 D
2071 2160 D
2068 2160 D
2065 2159 D
2063 2157 D
2063 2156 D
2064 2154 D
2065 2153 D
2067 2152 D
2073 2150 D
2075 2149 D
2077 2147 D
S
N
2063 2156 M
2065 2154 D
2067 2153 D
2073 2151 D
2075 2150 D
2076 2149 D
2077 2147 D
2077 2143 D
2075 2141 D
2072 2140 D
2069 2140 D
2066 2141 D
2064 2143 D
2063 2146 D
2063 2140 D
2064 2143 D
S
N
2088 2195 M
2088 2175 D
S
N
2089 2195 M
2101 2177 D
S
N
2089 2193 M
2101 2175 D
S
N
2101 2195 M
2101 2175 D
S
N
2086 2195 M
2089 2195 D
S
N
2098 2195 M
2104 2195 D
S
N
2086 2175 M
2091 2175 D
S
N
2111 2195 M
2111 2175 D
S
N
2112 2195 M
2112 2175 D
S
N
2108 2195 M
2114 2195 D
S
N
2108 2175 M
2122 2175 D
2122 2181 D
2121 2175 D
S
N
2133 2195 M
2130 2194 D
2128 2192 D
2127 2190 D
2126 2186 D
2126 2183 D
2127 2180 D
2128 2178 D
2130 2176 D
2133 2175 D
2135 2175 D
2138 2176 D
2139 2178 D
2140 2180 D
2141 2183 D
2141 2186 D
2140 2190 D
2139 2192 D
2138 2194 D
2135 2195 D
2133 2195 D
S
N
2133 2195 M
2131 2194 D
2129 2192 D
2128 2190 D
2127 2186 D
2127 2183 D
2128 2180 D
2129 2178 D
2131 2176 D
2133 2175 D
S
N
2135 2175 M
2137 2176 D
2139 2178 D
2139 2180 D
2140 2183 D
2140 2186 D
2139 2190 D
2139 2192 D
2137 2194 D
2135 2195 D
S
0 0 1 setrgbcolor
N
1839 1999 M
1824 1999 D
1820 1997 D
1817 1993 D
1816 1989 D
1816 1984 D
1817 1982 D
1818 1980 D
1821 1979 D
1824 1979 D
1829 1980 D
1831 1984 D
1833 1989 D
1833 1993 D
1831 1996 D
1830 1997 D
1827 1999 D
S
N
1824 1999 M
1821 1997 D
1818 1993 D
1817 1989 D
1817 1983 D
1818 1980 D
S
N
1824 1979 M
1827 1980 D
1830 1984 D
1831 1989 D
1831 1995 D
1830 1997 D
S
N
1830 1997 M
1839 1997 D
S
N
1848 1987 M
1848 1967 D
S
N
1849 1987 M
1849 1967 D
S
N
1845 1987 M
1857 1987 D
1860 1986 D
1861 1985 D
1862 1983 D
1862 1982 D
1861 1980 D
1860 1979 D
1857 1978 D
S
N
1857 1987 M
1859 1986 D
1860 1985 D
1861 1983 D
1861 1982 D
1860 1980 D
1859 1979 D
1857 1978 D
S
N
1849 1978 M
1857 1978 D
1860 1977 D
1861 1976 D
1862 1974 D
1862 1971 D
1861 1969 D
1860 1968 D
1857 1967 D
1845 1967 D
S
N
1857 1978 M
1859 1977 D
1860 1976 D
1861 1974 D
1861 1971 D
1860 1969 D
1859 1968 D
1857 1967 D
S
N
1877 1984 M
1877 1967 D
S
N
1869 1976 M
1886 1976 D
S
N
1895 1987 M
1894 1986 D
1895 1985 D
1895 1986 D
1895 1987 D
S
N
1895 1981 M
1895 1967 D
S
N
1895 1981 M
1895 1967 D
S
N
1892 1981 M
1895 1981 D
S
N
1892 1967 M
1898 1967 D
S
N
1909 2022 M
1909 2002 D
S
N
1910 2022 M
1910 2002 D
S
N
1906 2022 M
1913 2022 D
S
N
1906 2002 M
1921 2002 D
1921 2008 D
1920 2002 D
S
N
1931 2022 M
1928 2021 D
1926 2019 D
1925 2017 D
1924 2013 D
1924 2010 D
1925 2007 D
1926 2005 D
1928 2003 D
1931 2002 D
1933 2002 D
1936 2003 D
1938 2005 D
1939 2007 D
1940 2010 D
1940 2013 D
1939 2017 D
1938 2019 D
1936 2021 D
1933 2022 D
1931 2022 D
S
N
1931 2022 M
1929 2021 D
1927 2019 D
1926 2017 D
1925 2013 D
1925 2010 D
1926 2007 D
1927 2005 D
1929 2003 D
1931 2002 D
S
N
1933 2002 M
1935 2003 D
1937 2005 D
1938 2007 D
1939 2010 D
1939 2013 D
1938 2017 D
1937 2019 D
1935 2021 D
1933 2022 D
S
N
1986 2005 M
1986 1979 D
S
N
1973 1992 M
1999 1992 D
S
N
2056 1999 M
2041 1999 D
2037 1997 D
2034 1993 D
2033 1989 D
2033 1984 D
2034 1982 D
2036 1980 D
2038 1979 D
2041 1979 D
2046 1980 D
2049 1984 D
2050 1989 D
2050 1993 D
2049 1996 D
2047 1997 D
2044 1999 D
S
N
2041 1999 M
2038 1997 D
2036 1993 D
2034 1989 D
2034 1983 D
2036 1980 D
S
N
2041 1979 M
2044 1980 D
2047 1984 D
2049 1989 D
2049 1995 D
2047 1997 D
S
N
2047 1997 M
2056 1997 D
S
N
2076 1984 M
2077 1987 D
2077 1982 D
2076 1984 D
2074 1986 D
2071 1987 D
2068 1987 D
2065 1986 D
2063 1984 D
2063 1983 D
2064 1981 D
2065 1980 D
2067 1979 D
2073 1977 D
2075 1976 D
2077 1974 D
S
N
2063 1983 M
2065 1981 D
2067 1980 D
2073 1978 D
2075 1977 D
2076 1976 D
2077 1974 D
2077 1970 D
2075 1968 D
2072 1967 D
2069 1967 D
2066 1968 D
2064 1970 D
2063 1973 D
2063 1967 D
2064 1970 D
S
N
2088 2022 M
2088 2002 D
S
N
2089 2022 M
2089 2002 D
S
N
2086 2022 M
2092 2022 D
S
N
2086 2002 M
2100 2002 D
2100 2008 D
2099 2002 D
S
N
2111 2022 M
2108 2021 D
2106 2019 D
2105 2017 D
2104 2013 D
2104 2010 D
2105 2007 D
2106 2005 D
2108 2003 D
2111 2002 D
2113 2002 D
2115 2003 D
2117 2005 D
2118 2007 D
2119 2010 D
2119 2013 D
2118 2017 D
2117 2019 D
2115 2021 D
2113 2022 D
2111 2022 D
S
N
2111 2022 M
2109 2021 D
2107 2019 D
2106 2017 D
2105 2013 D
2105 2010 D
2106 2007 D
2107 2005 D
2109 2003 D
2111 2002 D
S
N
2113 2002 M
2114 2003 D
2116 2005 D
2117 2007 D
2118 2010 D
2118 2013 D
2117 2017 D
2116 2019 D
2114 2021 D
2113 2022 D
S
0 0 0 setrgbcolor
N
583 2342 M
583 1217 D
S
N
583 1217 M
2227 1217 D
S
N
2227 1217 M
2227 2342 D
S
N
2227 2342 M
583 2342 D
S
1 0 0 setrgbcolor
N
797 1217 M
797 1311 D
813 1311 D
813 1393 D
830 1393 D
830 1618 D
846 1618 D
846 1786 D
862 1786 D
862 1975 D
879 1975 D
879 2202 D
895 2202 D
895 2248 D
912 2248 D
912 2247 D
928 2247 D
928 2232 D
945 2232 D
945 2218 D
961 2218 D
961 2198 D
977 2198 D
977 2180 D
994 2180 D
994 2160 D
1010 2160 D
1010 2140 D
1027 2140 D
1027 2115 D
1043 2115 D
1043 2100 D
1060 2100 D
1060 2079 D
1076 2079 D
1076 2066 D
1092 2066 D
1092 2044 D
1109 2044 D
1109 2029 D
1125 2029 D
1125 2015 D
1142 2015 D
1142 1999 D
1158 1999 D
1158 1991 D
1175 1991 D
1175 1969 D
1191 1969 D
1191 1977 D
1208 1977 D
1208 1968 D
1224 1968 D
1224 1958 D
1240 1958 D
1240 1960 D
1257 1960 D
1257 1952 D
1273 1952 D
1273 1948 D
1290 1948 D
1290 1951 D
1306 1951 D
1306 1953 D
1323 1953 D
1323 1952 D
1339 1952 D
1339 1962 D
1355 1962 D
1355 1968 D
1372 1968 D
1372 1973 D
1388 1973 D
1388 1985 D
1405 1985 D
1405 1992 D
1421 1992 D
1421 2005 D
1438 2005 D
1438 2021 D
1454 2021 D
1454 2036 D
1470 2036 D
1470 2054 D
1487 2054 D
1487 2069 D
1503 2069 D
1503 2089 D
1520 2089 D
1520 2106 D
1536 2106 D
1536 2116 D
1553 2116 D
1553 2119 D
1569 2119 D
1569 2117 D
1586 2117 D
1586 2106 D
1602 2106 D
1602 2086 D
1618 2086 D
1618 2062 D
1635 2062 D
1635 2036 D
1651 2036 D
1651 2009 D
1668 2009 D
1668 1980 D
1684 1980 D
1684 1954 D
1701 1954 D
1701 1935 D
1717 1935 D
1717 1915 D
1733 1915 D
1733 1889 D
1750 1889 D
1750 1863 D
1766 1863 D
1766 1838 D
1783 1838 D
1783 1811 D
1799 1811 D
1799 1803 D
1816 1803 D
1816 1789 D
1832 1789 D
1832 1757 D
1832 1757 D
1832 1757 D
1848 1757 D
1848 1766 D
1865 1766 D
1865 1716 D
1881 1716 D
1881 1726 D
1898 1726 D
1898 1708 D
1914 1708 D
1914 1672 D
1931 1672 D
1931 1691 D
1947 1691 D
1947 1674 D
1964 1674 D
1964 1637 D
1980 1637 D
1980 1650 D
1996 1650 D
1996 1620 D
2013 1620 D
2013 1597 D
2029 1597 D
2029 1577 D
2046 1577 D
2046 1607 D
2062 1607 D
2062 1586 D
2079 1586 D
2079 1588 D
2095 1588 D
2095 1481 D
2111 1481 D
2111 1582 D
2128 1582 D
2128 1547 D
2144 1547 D
2144 1535 D
2161 1535 D
2161 1422 D
2177 1422 D
2177 1523 D
2194 1523 D
2194 1518 D
2210 1518 D
2210 1536 D
2226 1536 D
2226 1217 D
S
0 0 0 setrgbcolor
N
583 1217 M
583 1269 D
S
N
649 1235 M
649 1217 D
S
N
714 1217 M
714 1235 D
S
N
780 1235 M
780 1217 D
S
N
846 1217 M
846 1235 D
S
N
912 1269 M
912 1217 D
S
N
977 1217 M
977 1235 D
S
N
1043 1235 M
1043 1217 D
S
N
1109 1217 M
1109 1235 D
S
N
1175 1235 M
1175 1217 D
S
N
1240 1217 M
1240 1269 D
S
N
1306 1235 M
1306 1217 D
S
N
1372 1217 M
1372 1235 D
S
N
1438 1235 M
1438 1217 D
S
N
1503 1217 M
1503 1235 D
S
N
1569 1269 M
1569 1217 D
S
N
1635 1217 M
1635 1235 D
S
N
1701 1235 M
1701 1217 D
S
N
1766 1217 M
1766 1235 D
S
N
1832 1235 M
1832 1217 D
S
N
1898 1217 M
1898 1269 D
S
N
1964 1235 M
1964 1217 D
S
N
2029 1217 M
2029 1235 D
S
N
2095 1235 M
2095 1217 D
S
N
2161 1217 M
2161 1235 D
S
N
2227 1269 M
2227 1217 D
S
N
582 1189 M
577 1188 D
574 1183 D
573 1176 D
573 1172 D
574 1164 D
577 1160 D
582 1159 D
584 1159 D
589 1160 D
592 1164 D
593 1172 D
593 1176 D
592 1183 D
589 1188 D
584 1189 D
582 1189 D
S
N
582 1189 M
579 1188 D
577 1186 D
576 1183 D
574 1176 D
574 1172 D
576 1164 D
577 1162 D
579 1160 D
582 1159 D
S
N
584 1159 M
587 1160 D
589 1162 D
590 1164 D
592 1172 D
592 1176 D
590 1183 D
589 1186 D
587 1188 D
584 1189 D
S
N
874 1183 M
876 1182 D
874 1180 D
873 1182 D
873 1183 D
874 1186 D
876 1188 D
880 1189 D
886 1189 D
890 1188 D
892 1186 D
893 1183 D
893 1180 D
892 1177 D
887 1175 D
880 1172 D
877 1170 D
874 1167 D
873 1163 D
873 1159 D
S
N
886 1189 M
889 1188 D
890 1186 D
892 1183 D
892 1180 D
890 1177 D
886 1175 D
880 1172 D
S
N
873 1162 M
874 1163 D
877 1163 D
884 1160 D
889 1160 D
892 1162 D
893 1163 D
S
N
877 1163 M
884 1159 D
890 1159 D
892 1160 D
893 1163 D
893 1166 D
S
N
910 1189 M
906 1188 D
903 1183 D
902 1176 D
902 1172 D
903 1164 D
906 1160 D
910 1159 D
913 1159 D
918 1160 D
920 1164 D
922 1172 D
922 1176 D
920 1183 D
918 1188 D
913 1189 D
910 1189 D
S
N
910 1189 M
907 1188 D
906 1186 D
905 1183 D
903 1176 D
903 1172 D
905 1164 D
906 1162 D
907 1160 D
910 1159 D
S
N
913 1159 M
916 1160 D
918 1162 D
919 1164 D
920 1172 D
920 1176 D
919 1183 D
918 1186 D
916 1188 D
913 1189 D
S
N
939 1189 M
935 1188 D
932 1183 D
931 1176 D
931 1172 D
932 1164 D
935 1160 D
939 1159 D
942 1159 D
946 1160 D
949 1164 D
951 1172 D
951 1176 D
949 1183 D
946 1188 D
942 1189 D
939 1189 D
S
N
939 1189 M
936 1188 D
935 1186 D
933 1183 D
932 1176 D
932 1172 D
933 1164 D
935 1162 D
936 1160 D
939 1159 D
S
N
942 1159 M
945 1160 D
946 1162 D
948 1164 D
949 1172 D
949 1176 D
948 1183 D
946 1186 D
945 1188 D
942 1189 D
S
N
1214 1186 M
1214 1159 D
S
N
1216 1189 M
1216 1159 D
S
N
1216 1189 M
1200 1167 D
1223 1167 D
S
N
1210 1159 M
1220 1159 D
S
N
1239 1189 M
1235 1188 D
1232 1183 D
1230 1176 D
1230 1172 D
1232 1164 D
1235 1160 D
1239 1159 D
1242 1159 D
1246 1160 D
1249 1164 D
1251 1172 D
1251 1176 D
1249 1183 D
1246 1188 D
1242 1189 D
1239 1189 D
S
N
1239 1189 M
1236 1188 D
1235 1186 D
1233 1183 D
1232 1176 D
1232 1172 D
1233 1164 D
1235 1162 D
1236 1160 D
1239 1159 D
S
N
1242 1159 M
1245 1160 D
1246 1162 D
1248 1164 D
1249 1172 D
1249 1176 D
1248 1183 D
1246 1186 D
1245 1188 D
1242 1189 D
S
N
1268 1189 M
1264 1188 D
1261 1183 D
1259 1176 D
1259 1172 D
1261 1164 D
1264 1160 D
1268 1159 D
1271 1159 D
1275 1160 D
1278 1164 D
1279 1172 D
1279 1176 D
1278 1183 D
1275 1188 D
1271 1189 D
1268 1189 D
S
N
1268 1189 M
1265 1188 D
1264 1186 D
1262 1183 D
1261 1176 D
1261 1172 D
1262 1164 D
1264 1162 D
1265 1160 D
1268 1159 D
S
N
1271 1159 M
1274 1160 D
1275 1162 D
1277 1164 D
1278 1172 D
1278 1176 D
1277 1183 D
1275 1186 D
1274 1188 D
1271 1189 D
S
N
1547 1185 M
1546 1183 D
1547 1182 D
1549 1183 D
1549 1185 D
1547 1188 D
1545 1189 D
1540 1189 D
1536 1188 D
1533 1185 D
1532 1182 D
1530 1176 D
1530 1167 D
1532 1163 D
1534 1160 D
1539 1159 D
1542 1159 D
1546 1160 D
1549 1163 D
1550 1167 D
1550 1169 D
1549 1173 D
1546 1176 D
1542 1177 D
1540 1177 D
1536 1176 D
1533 1173 D
1532 1169 D
S
N
1540 1189 M
1537 1188 D
1534 1185 D
1533 1182 D
1532 1176 D
1532 1167 D
1533 1163 D
1536 1160 D
1539 1159 D
S
N
1542 1159 M
1545 1160 D
1547 1163 D
1549 1167 D
1549 1169 D
1547 1173 D
1545 1176 D
1542 1177 D
S
N
1568 1189 M
1563 1188 D
1560 1183 D
1559 1176 D
1559 1172 D
1560 1164 D
1563 1160 D
1568 1159 D
1571 1159 D
1575 1160 D
1578 1164 D
1579 1172 D
1579 1176 D
1578 1183 D
1575 1188 D
1571 1189 D
1568 1189 D
S
N
1568 1189 M
1565 1188 D
1563 1186 D
1562 1183 D
1560 1176 D
1560 1172 D
1562 1164 D
1563 1162 D
1565 1160 D
1568 1159 D
S
N
1571 1159 M
1573 1160 D
1575 1162 D
1576 1164 D
1578 1172 D
1578 1176 D
1576 1183 D
1575 1186 D
1573 1188 D
1571 1189 D
S
N
1597 1189 M
1592 1188 D
1589 1183 D
1588 1176 D
1588 1172 D
1589 1164 D
1592 1160 D
1597 1159 D
1599 1159 D
1604 1160 D
1607 1164 D
1608 1172 D
1608 1176 D
1607 1183 D
1604 1188 D
1599 1189 D
1597 1189 D
S
N
1597 1189 M
1594 1188 D
1592 1186 D
1591 1183 D
1589 1176 D
1589 1172 D
1591 1164 D
1592 1162 D
1594 1160 D
1597 1159 D
S
N
1599 1159 M
1602 1160 D
1604 1162 D
1605 1164 D
1607 1172 D
1607 1176 D
1605 1183 D
1604 1186 D
1602 1188 D
1599 1189 D
S
N
1866 1189 M
1862 1188 D
1860 1185 D
1860 1180 D
1862 1177 D
1866 1176 D
1872 1176 D
1876 1177 D
1878 1180 D
1878 1185 D
1876 1188 D
1872 1189 D
1866 1189 D
S
N
1866 1189 M
1863 1188 D
1862 1185 D
1862 1180 D
1863 1177 D
1866 1176 D
S
N
1872 1176 M
1875 1177 D
1876 1180 D
1876 1185 D
1875 1188 D
1872 1189 D
S
N
1866 1176 M
1862 1175 D
1860 1173 D
1859 1170 D
1859 1164 D
1860 1162 D
1862 1160 D
1866 1159 D
1872 1159 D
1876 1160 D
1878 1162 D
1879 1164 D
1879 1170 D
1878 1173 D
1876 1175 D
1872 1176 D
S
N
1866 1176 M
1863 1175 D
1862 1173 D
1860 1170 D
1860 1164 D
1862 1162 D
1863 1160 D
1866 1159 D
S
N
1872 1159 M
1875 1160 D
1876 1162 D
1878 1164 D
1878 1170 D
1876 1173 D
1875 1175 D
1872 1176 D
S
N
1896 1189 M
1892 1188 D
1889 1183 D
1888 1176 D
1888 1172 D
1889 1164 D
1892 1160 D
1896 1159 D
1899 1159 D
1904 1160 D
1907 1164 D
1908 1172 D
1908 1176 D
1907 1183 D
1904 1188 D
1899 1189 D
1896 1189 D
S
N
1896 1189 M
1894 1188 D
1892 1186 D
1891 1183 D
1889 1176 D
1889 1172 D
1891 1164 D
1892 1162 D
1894 1160 D
1896 1159 D
S
N
1899 1159 M
1902 1160 D
1904 1162 D
1905 1164 D
1907 1172 D
1907 1176 D
1905 1183 D
1904 1186 D
1902 1188 D
1899 1189 D
S
N
1925 1189 M
1921 1188 D
1918 1183 D
1917 1176 D
1917 1172 D
1918 1164 D
1921 1160 D
1925 1159 D
1928 1159 D
1932 1160 D
1935 1164 D
1937 1172 D
1937 1176 D
1935 1183 D
1932 1188 D
1928 1189 D
1925 1189 D
S
N
1925 1189 M
1922 1188 D
1921 1186 D
1919 1183 D
1918 1176 D
1918 1172 D
1919 1164 D
1921 1162 D
1922 1160 D
1925 1159 D
S
N
1928 1159 M
1931 1160 D
1932 1162 D
1934 1164 D
1935 1172 D
1935 1176 D
1934 1183 D
1932 1186 D
1931 1188 D
1928 1189 D
S
N
2177 1183 M
2180 1185 D
2185 1189 D
2185 1159 D
S
N
2183 1188 M
2183 1159 D
S
N
2177 1159 M
2190 1159 D
S
N
2211 1189 M
2206 1188 D
2203 1183 D
2202 1176 D
2202 1172 D
2203 1164 D
2206 1160 D
2211 1159 D
2214 1159 D
2218 1160 D
2221 1164 D
2222 1172 D
2222 1176 D
2221 1183 D
2218 1188 D
2214 1189 D
2211 1189 D
S
N
2211 1189 M
2208 1188 D
2206 1186 D
2205 1183 D
2203 1176 D
2203 1172 D
2205 1164 D
2206 1162 D
2208 1160 D
2211 1159 D
S
N
2214 1159 M
2216 1160 D
2218 1162 D
2219 1164 D
2221 1172 D
2221 1176 D
2219 1183 D
2218 1186 D
2216 1188 D
2214 1189 D
S
N
2240 1189 M
2235 1188 D
2232 1183 D
2231 1176 D
2231 1172 D
2232 1164 D
2235 1160 D
2240 1159 D
2242 1159 D
2247 1160 D
2250 1164 D
2251 1172 D
2251 1176 D
2250 1183 D
2247 1188 D
2242 1189 D
2240 1189 D
S
N
2240 1189 M
2237 1188 D
2235 1186 D
2234 1183 D
2232 1176 D
2232 1172 D
2234 1164 D
2235 1162 D
2237 1160 D
2240 1159 D
S
N
2242 1159 M
2245 1160 D
2247 1162 D
2248 1164 D
2250 1172 D
2250 1176 D
2248 1183 D
2247 1186 D
2245 1188 D
2242 1189 D
S
N
2268 1189 M
2264 1188 D
2261 1183 D
2260 1176 D
2260 1172 D
2261 1164 D
2264 1160 D
2268 1159 D
2271 1159 D
2276 1160 D
2279 1164 D
2280 1172 D
2280 1176 D
2279 1183 D
2276 1188 D
2271 1189 D
2268 1189 D
S
N
2268 1189 M
2266 1188 D
2264 1186 D
2263 1183 D
2261 1176 D
2261 1172 D
2263 1164 D
2264 1162 D
2266 1160 D
2268 1159 D
S
N
2271 1159 M
2274 1160 D
2276 1162 D
2277 1164 D
2279 1172 D
2279 1176 D
2277 1183 D
2276 1186 D
2274 1188 D
2271 1189 D
S
N
583 2290 M
583 2342 D
S
N
649 2342 M
649 2325 D
S
N
714 2325 M
714 2342 D
S
N
780 2342 M
780 2325 D
S
N
846 2325 M
846 2342 D
S
N
912 2342 M
912 2290 D
S
N
977 2325 M
977 2342 D
S
N
1043 2342 M
1043 2325 D
S
N
1109 2325 M
1109 2342 D
S
N
1175 2342 M
1175 2325 D
S
N
1240 2290 M
1240 2342 D
S
N
1306 2342 M
1306 2325 D
S
N
1372 2325 M
1372 2342 D
S
N
1438 2342 M
1438 2325 D
S
N
1503 2325 M
1503 2342 D
S
N
1569 2342 M
1569 2290 D
S
N
1635 2325 M
1635 2342 D
S
N
1701 2342 M
1701 2325 D
S
N
1766 2325 M
1766 2342 D
S
N
1832 2342 M
1832 2325 D
S
N
1898 2290 M
1898 2342 D
S
N
1964 2342 M
1964 2325 D
S
N
2029 2325 M
2029 2342 D
S
N
2095 2342 M
2095 2325 D
S
N
2161 2325 M
2161 2342 D
S
N
2227 2342 M
2227 2290 D
S
N
583 1257 M
600 1257 D
S
N
600 1305 M
583 1305 D
S
N
583 1339 M
600 1339 D
S
N
600 1366 M
583 1366 D
S
N
583 1387 M
600 1387 D
S
N
600 1405 M
583 1405 D
S
N
583 1421 M
600 1421 D
S
N
600 1435 M
583 1435 D
S
N
583 1447 M
635 1447 D
S
N
600 1529 M
583 1529 D
S
N
583 1577 M
600 1577 D
S
N
600 1611 M
583 1611 D
S
N
583 1637 M
600 1637 D
S
N
600 1659 M
583 1659 D
S
N
583 1677 M
600 1677 D
S
N
600 1693 M
583 1693 D
S
N
583 1706 M
600 1706 D
S
N
635 1719 M
583 1719 D
S
N
583 1801 M
600 1801 D
S
N
600 1848 M
583 1848 D
S
N
583 1882 M
600 1882 D
S
N
600 1909 M
583 1909 D
S
N
583 1930 M
600 1930 D
S
N
600 1948 M
583 1948 D
S
N
583 1964 M
600 1964 D
S
N
600 1978 M
583 1978 D
S
N
583 1990 M
635 1990 D
S
N
600 2072 M
583 2072 D
S
N
583 2120 M
600 2120 D
S
N
600 2154 M
583 2154 D
S
N
583 2180 M
600 2180 D
S
N
600 2202 M
583 2202 D
S
N
583 2220 M
600 2220 D
S
N
600 2236 M
583 2236 D
S
N
583 2250 M
600 2250 D
S
N
635 2262 M
583 2262 D
S
N
427 1455 M
430 1456 D
435 1460 D
435 1430 D
S
N
433 1459 M
433 1430 D
S
N
427 1430 M
440 1430 D
S
N
460 1460 M
456 1459 D
453 1455 D
452 1447 D
452 1443 D
453 1436 D
456 1431 D
460 1430 D
463 1430 D
468 1431 D
471 1436 D
472 1443 D
472 1447 D
471 1455 D
468 1459 D
463 1460 D
460 1460 D
S
N
460 1460 M
458 1459 D
456 1457 D
455 1455 D
453 1447 D
453 1443 D
455 1436 D
456 1433 D
458 1431 D
460 1430 D
S
N
463 1430 M
466 1431 D
468 1433 D
469 1436 D
471 1443 D
471 1447 D
469 1455 D
468 1457 D
466 1459 D
463 1460 D
S
N
482 1460 M
508 1460 D
S
N
518 1478 M
518 1469 D
S
N
518 1472 M
520 1475 D
523 1478 D
525 1478 D
533 1473 D
536 1473 D
537 1475 D
538 1478 D
S
N
520 1475 M
523 1476 D
525 1476 D
533 1473 D
S
N
538 1478 M
538 1473 D
537 1469 D
531 1462 D
530 1459 D
528 1455 D
528 1447 D
S
N
537 1469 M
530 1462 D
528 1459 D
527 1455 D
527 1447 D
S
N
427 1726 M
430 1728 D
435 1732 D
435 1702 D
S
N
433 1730 M
433 1702 D
S
N
427 1702 M
440 1702 D
S
N
460 1732 M
456 1730 D
453 1726 D
452 1719 D
452 1715 D
453 1707 D
456 1703 D
460 1702 D
463 1702 D
468 1703 D
471 1707 D
472 1715 D
472 1719 D
471 1726 D
468 1730 D
463 1732 D
460 1732 D
S
N
460 1732 M
458 1730 D
456 1729 D
455 1726 D
453 1719 D
453 1715 D
455 1707 D
456 1704 D
458 1703 D
460 1702 D
S
N
463 1702 M
466 1703 D
468 1704 D
469 1707 D
471 1715 D
471 1719 D
469 1726 D
468 1729 D
466 1730 D
463 1732 D
S
N
482 1732 M
508 1732 D
S
N
536 1745 M
534 1743 D
536 1742 D
537 1743 D
537 1745 D
536 1748 D
533 1749 D
528 1749 D
524 1748 D
521 1745 D
520 1742 D
518 1736 D
518 1728 D
520 1723 D
523 1720 D
527 1719 D
530 1719 D
534 1720 D
537 1723 D
538 1728 D
538 1729 D
537 1733 D
534 1736 D
530 1738 D
528 1738 D
524 1736 D
521 1733 D
520 1729 D
S
N
528 1749 M
525 1748 D
523 1745 D
521 1742 D
520 1736 D
520 1728 D
521 1723 D
524 1720 D
527 1719 D
S
N
530 1719 M
533 1720 D
536 1723 D
537 1728 D
537 1729 D
536 1733 D
533 1736 D
530 1738 D
S
N
427 1998 M
430 1999 D
435 2003 D
435 1973 D
S
N
433 2002 M
433 1973 D
S
N
427 1973 M
440 1973 D
S
N
460 2003 M
456 2002 D
453 1998 D
452 1990 D
452 1986 D
453 1979 D
456 1975 D
460 1973 D
463 1973 D
468 1975 D
471 1979 D
472 1986 D
472 1990 D
471 1998 D
468 2002 D
463 2003 D
460 2003 D
S
N
460 2003 M
458 2002 D
456 2001 D
455 1998 D
453 1990 D
453 1986 D
455 1979 D
456 1976 D
458 1975 D
460 1973 D
S
N
463 1973 M
466 1975 D
468 1976 D
469 1979 D
471 1986 D
471 1990 D
469 1998 D
468 2001 D
466 2002 D
463 2003 D
S
N
482 2003 M
508 2003 D
S
N
521 2021 M
518 2006 D
S
N
518 2006 M
521 2009 D
525 2011 D
530 2011 D
534 2009 D
537 2006 D
538 2002 D
538 1999 D
537 1995 D
534 1992 D
530 1990 D
525 1990 D
521 1992 D
520 1993 D
518 1996 D
518 1998 D
520 1999 D
521 1998 D
520 1996 D
S
N
530 2011 M
533 2009 D
536 2006 D
537 2002 D
537 1999 D
536 1995 D
533 1992 D
530 1990 D
S
N
521 2021 M
536 2021 D
S
N
521 2019 M
528 2019 D
536 2021 D
S
N
427 2269 M
430 2271 D
435 2275 D
435 2245 D
S
N
433 2274 M
433 2245 D
S
N
427 2245 M
440 2245 D
S
N
460 2275 M
456 2274 D
453 2269 D
452 2262 D
452 2258 D
453 2250 D
456 2246 D
460 2245 D
463 2245 D
468 2246 D
471 2250 D
472 2258 D
472 2262 D
471 2269 D
468 2274 D
463 2275 D
460 2275 D
S
N
460 2275 M
458 2274 D
456 2272 D
455 2269 D
453 2262 D
453 2258 D
455 2250 D
456 2248 D
458 2246 D
460 2245 D
S
N
463 2245 M
466 2246 D
468 2248 D
469 2250 D
471 2258 D
471 2262 D
469 2269 D
468 2272 D
466 2274 D
463 2275 D
S
N
482 2275 M
508 2275 D
S
N
531 2289 M
531 2262 D
S
N
533 2292 M
533 2262 D
S
N
533 2292 M
517 2271 D
540 2271 D
S
N
527 2262 M
537 2262 D
S
N
2209 1257 M
2227 1257 D
S
N
2227 1305 M
2209 1305 D
S
N
2209 1339 M
2227 1339 D
S
N
2227 1366 M
2209 1366 D
S
N
2209 1387 M
2227 1387 D
S
N
2227 1405 M
2209 1405 D
S
N
2209 1421 M
2227 1421 D
S
N
2227 1435 M
2209 1435 D
S
N
2175 1447 M
2227 1447 D
S
N
2227 1529 M
2209 1529 D
S
N
2209 1577 M
2227 1577 D
S
N
2227 1611 M
2209 1611 D
S
N
2209 1637 M
2227 1637 D
S
N
2227 1659 M
2209 1659 D
S
N
2209 1677 M
2227 1677 D
S
N
2227 1693 M
2209 1693 D
S
N
2209 1706 M
2227 1706 D
S
N
2227 1719 M
2175 1719 D
S
N
2209 1801 M
2227 1801 D
S
N
2227 1848 M
2209 1848 D
S
N
2209 1882 M
2227 1882 D
S
N
2227 1909 M
2209 1909 D
S
N
2209 1930 M
2227 1930 D
S
N
2227 1948 M
2209 1948 D
S
N
2209 1964 M
2227 1964 D
S
N
2227 1978 M
2209 1978 D
S
N
2175 1990 M
2227 1990 D
S
N
2227 2072 M
2209 2072 D
S
N
2209 2120 M
2227 2120 D
S
N
2227 2154 M
2209 2154 D
S
N
2209 2180 M
2227 2180 D
S
N
2227 2202 M
2209 2202 D
S
N
2209 2220 M
2227 2220 D
S
N
2227 2236 M
2209 2236 D
S
N
2209 2250 M
2227 2250 D
S
N
2227 2262 M
2175 2262 D
S
N
797 1217 M
797 1226 D
S
N
797 1238 M
797 1247 D
S
N
797 1259 M
797 1268 D
S
N
797 1280 M
797 1288 D
S
N
797 1301 M
797 1309 D
S
N
807 1311 M
813 1311 D
813 1314 D
S
N
813 1326 M
813 1334 D
S
N
813 1346 M
813 1355 D
S
N
813 1367 M
813 1376 D
S
N
813 1388 M
813 1393 D
817 1393 D
S
N
829 1393 M
830 1393 D
830 1401 D
S
N
830 1413 M
830 1422 D
S
N
830 1434 M
830 1442 D
S
N
830 1455 M
830 1463 D
S
N
830 1475 M
830 1484 D
S
N
830 1496 M
830 1505 D
S
N
830 1517 M
830 1525 D
S
N
830 1538 M
830 1546 D
S
N
830 1558 M
830 1567 D
S
N
830 1579 M
830 1588 D
S
N
830 1600 M
830 1608 D
S
N
832 1618 M
841 1618 D
S
N
846 1625 M
846 1634 D
S
N
846 1646 M
846 1654 D
S
N
846 1666 M
846 1675 D
S
N
846 1687 M
846 1696 D
S
N
846 1708 M
846 1717 D
S
N
846 1729 M
846 1737 D
S
N
846 1749 M
846 1758 D
S
N
846 1770 M
846 1779 D
S
N
851 1786 M
860 1786 D
S
N
862 1795 M
862 1804 D
S
N
862 1816 M
862 1825 D
S
N
862 1837 M
862 1845 D
S
N
862 1858 M
862 1866 D
S
N
862 1878 M
862 1887 D
S
N
862 1899 M
862 1908 D
S
N
862 1920 M
862 1929 D
S
N
862 1941 M
862 1949 D
S
N
862 1961 M
862 1970 D
S
N
869 1975 M
878 1975 D
S
N
879 1986 M
879 1995 D
S
N
879 2007 M
879 2016 D
S
N
879 2028 M
879 2037 D
S
N
879 2049 M
879 2057 D
S
N
879 2070 M
879 2078 D
S
N
879 2090 M
879 2099 D
S
N
879 2111 M
879 2120 D
S
N
879 2132 M
879 2140 D
S
N
879 2153 M
879 2161 D
S
N
879 2173 M
879 2182 D
S
N
879 2194 M
879 2202 D
880 2202 D
S
N
892 2202 M
895 2202 D
895 2207 D
S
N
895 2219 M
895 2228 D
S
N
895 2240 M
895 2248 D
896 2248 D
S
N
908 2248 M
912 2248 D
912 2248 D
916 2248 D
S
N
928 2248 M
928 2240 D
S
N
939 2239 M
945 2239 D
945 2235 D
S
N
945 2223 M
945 2222 D
952 2222 D
S
N
961 2219 M
961 2210 D
S
N
966 2203 M
975 2203 D
S
N
977 2194 M
977 2185 D
S
N
984 2180 M
993 2180 D
S
N
994 2169 M
994 2166 D
1000 2166 D
S
N
1010 2164 M
1010 2156 D
S
N
1010 2144 M
1010 2142 D
1017 2142 D
S
N
1027 2139 M
1027 2131 D
S
N
1035 2127 M
1043 2127 D
1043 2126 D
S
N
1043 2114 M
1043 2106 D
S
N
1052 2102 M
1060 2102 D
1060 2101 D
S
N
1060 2089 M
1060 2086 D
1065 2086 D
S
N
1076 2085 M
1076 2076 D
S
N
1076 2064 M
1076 2061 D
1082 2061 D
S
N
1092 2060 M
1092 2051 D
S
N
1103 2050 M
1109 2050 D
1109 2047 D
S
N
1112 2038 M
1121 2038 D
S
N
1125 2030 M
1125 2022 D
S
N
1131 2015 M
1139 2015 D
S
N
1142 2005 M
1142 2002 D
1147 2002 D
S
N
1158 2001 M
1158 1995 D
1161 1995 D
S
N
1173 1995 M
1175 1995 D
1175 1988 D
S
N
1175 1976 M
1175 1971 D
1179 1971 D
S
N
1191 1971 M
1191 1971 D
1191 1963 D
S
N
1203 1963 M
1208 1963 D
1208 1959 D
S
N
1219 1958 M
1224 1958 D
1224 1954 D
S
N
1232 1951 M
1240 1951 D
1240 1950 D
S
N
1249 1946 M
1257 1946 D
1257 1946 D
S
N
1258 1934 M
1266 1934 D
S
N
1278 1934 M
1287 1934 D
S
N
1290 1925 M
1290 1921 D
1295 1921 D
S
N
1306 1922 M
1306 1930 D
S
N
1316 1933 M
1323 1933 D
1323 1931 D
S
N
1327 1923 M
1335 1923 D
S
N
1340 1931 M
1348 1931 D
S
N
1355 1936 M
1355 1945 D
S
N
1366 1946 M
1372 1946 D
1372 1949 D
S
N
1379 1954 M
1388 1954 D
S
N
1388 1965 M
1388 1966 D
1396 1966 D
S
N
1406 1965 M
1415 1965 D
S
N
1421 1971 M
1421 1979 D
S
N
1424 1988 M
1433 1988 D
S
N
1438 1996 M
1438 2004 D
S
N
1449 2005 M
1454 2005 D
1454 2009 D
S
N
1455 2020 M
1464 2020 D
S
N
1470 2025 M
1470 2034 D
S
N
1482 2034 M
1487 2034 D
1487 2038 D
S
N
1487 2050 M
1487 2056 D
1489 2056 D
S
N
1502 2056 M
1503 2056 D
1503 2063 D
S
N
1503 2075 M
1503 2078 D
1509 2078 D
S
N
1520 2080 M
1520 2088 D
S
N
1525 2096 M
1533 2096 D
S
N
1536 2105 M
1536 2109 D
1541 2109 D
S
N
1553 2109 M
1553 2115 D
1555 2115 D
S
N
1568 2115 M
1569 2115 D
1569 2116 D
1576 2116 D
S
N
1586 2114 M
1586 2107 D
1587 2107 D
S
N
1600 2107 M
1602 2107 D
1602 2101 D
S
N
1602 2088 M
1602 2088 D
1610 2088 D
S
N
1618 2084 M
1618 2075 D
S
N
1623 2068 M
1632 2068 D
S
N
1635 2059 M
1635 2050 D
S
N
1639 2042 M
1647 2042 D
S
N
1651 2034 M
1651 2025 D
S
N
1658 2020 M
1667 2020 D
S
N
1668 2009 M
1668 2000 D
S
N
1673 1993 M
1681 1993 D
S
N
1684 1984 M
1684 1975 D
S
N
1689 1968 M
1698 1968 D
S
N
1701 1959 M
1701 1950 D
S
N
1710 1947 M
1717 1947 D
1717 1946 D
S
N
1717 1934 M
1717 1928 D
1720 1928 D
S
N
1732 1928 M
1733 1928 D
1733 1921 D
S
N
1735 1910 M
1744 1910 D
S
N
1750 1904 M
1750 1896 D
S
N
1754 1888 M
1763 1888 D
S
N
1766 1879 M
1766 1870 D
S
N
1770 1862 M
1779 1862 D
S
N
1783 1854 M
1783 1845 D
S
N
1785 1836 M
1794 1836 D
S
N
1800 1830 M
1809 1830 D
S
N
1816 1825 M
1816 1816 D
1816 1816 D
S
N
1828 1816 M
1832 1816 D
1832 1812 D
S
N
1832 1800 M
1832 1791 D
S
N
1832 1779 M
1832 1772 D
1832 1772 D
1832 1772 D
1834 1772 D
S
N
1846 1772 M
1848 1772 D
1848 1778 D
S
N
1854 1785 M
1862 1785 D
S
N
1865 1776 M
1865 1767 D
S
N
1870 1760 M
1878 1760 D
S
N
1887 1763 M
1896 1763 D
S
N
1898 1753 M
1898 1744 D
S
N
1903 1738 M
1912 1738 D
S
N
1914 1728 M
1914 1719 D
S
N
1914 1707 M
1914 1705 D
1921 1705 D
S
N
1931 1707 M
1931 1714 D
1933 1714 D
S
N
1945 1714 M
1947 1714 D
1947 1707 D
S
N
1959 1707 M
1964 1707 D
1964 1703 D
S
N
1964 1691 M
1964 1685 D
1967 1685 D
S
N
1979 1685 M
1980 1685 D
1980 1679 D
1981 1679 D
S
N
1994 1679 M
1996 1679 D
1996 1679 D
2002 1679 D
S
N
2013 1678 M
2013 1669 D
S
N
2013 1657 M
2013 1648 D
S
N
2017 1640 M
2026 1640 D
S
N
2031 1634 M
2040 1634 D
S
N
2050 1636 M
2058 1636 D
S
N
2062 1628 M
2062 1619 D
S
N
2062 1607 M
2062 1599 D
S
N
2072 1596 M
2079 1596 D
2079 1599 D
S
N
2079 1611 M
2079 1613 D
2085 1613 D
S
N
2095 1611 M
2095 1603 D
S
N
2095 1591 M
2104 1591 D
S
N
2111 1595 M
2111 1599 D
2116 1599 D
S
N
2128 1599 M
2128 1603 D
2133 1603 D
S
N
2144 1602 M
2144 1593 D
S
N
2144 1581 M
2144 1572 D
S
N
2144 1560 M
2144 1552 D
S
N
2156 1551 M
2161 1551 D
2161 1554 D
S
N
2170 1557 M
2177 1557 D
2177 1559 D
S
N
2178 1570 M
2187 1570 D
S
N
2194 1565 M
2194 1556 D
S
N
2202 1553 M
2210 1553 D
2210 1552 D
S
N
2210 1540 M
2210 1536 D
2214 1536 D
S
N
2226 1536 M
2226 1536 D
2226 1527 D
S
N
2226 1515 M
2226 1506 D
S
N
2226 1494 M
2226 1486 D
S
N
2226 1473 M
2226 1465 D
S
N
2226 1453 M
2226 1444 D
S
N
2226 1432 M
2226 1423 D
S
N
2226 1411 M
2226 1402 D
S
N
2226 1390 M
2226 1382 D
S
N
2226 1370 M
2226 1361 D
S
N
2226 1349 M
2226 1340 D
S
N
2226 1328 M
2226 1319 D
S
N
2226 1307 M
2226 1299 D
S
N
2226 1287 M
2226 1278 D
S
N
2226 1266 M
2226 1257 D
S
N
2226 1245 M
2226 1236 D
S
N
2226 1224 M
2226 1217 D
S
0 0 1 setrgbcolor
N
797 1217 M
797 1311 D
813 1311 D
813 1393 D
830 1393 D
830 1618 D
846 1618 D
846 1786 D
862 1786 D
862 1975 D
879 1975 D
879 2202 D
895 2202 D
895 2248 D
912 2248 D
912 2247 D
928 2247 D
928 2232 D
945 2232 D
945 2218 D
961 2218 D
961 2197 D
977 2197 D
977 2180 D
994 2180 D
994 2160 D
1010 2160 D
1010 2140 D
1027 2140 D
1027 2115 D
1043 2115 D
1043 2100 D
1060 2100 D
1060 2079 D
1076 2079 D
1076 2065 D
1092 2065 D
1092 2043 D
1109 2043 D
1109 2028 D
1125 2028 D
1125 2013 D
1142 2013 D
1142 1996 D
1158 1996 D
1158 1986 D
1175 1986 D
1175 1962 D
1191 1962 D
1191 1971 D
1208 1971 D
1208 1956 D
1224 1956 D
1224 1944 D
1240 1944 D
1240 1944 D
1257 1944 D
1257 1934 D
1273 1934 D
1273 1925 D
1290 1925 D
1290 1930 D
1306 1930 D
1306 1927 D
1323 1927 D
1323 1926 D
1339 1926 D
1339 1933 D
1355 1933 D
1355 1924 D
1372 1924 D
1372 1932 D
1388 1932 D
1388 1938 D
1405 1938 D
1405 1951 D
1421 1951 D
1421 1957 D
1438 1957 D
1438 1963 D
1454 1963 D
1454 1981 D
1470 1981 D
1470 1996 D
1487 1996 D
1487 2007 D
1503 2007 D
1503 2021 D
1520 2021 D
1520 2037 D
1536 2037 D
1536 2045 D
1553 2045 D
1553 2047 D
1569 2047 D
1569 2042 D
1586 2042 D
1586 2029 D
1602 2029 D
1602 2009 D
1618 2009 D
1618 1983 D
1635 1983 D
1635 1954 D
1651 1954 D
1651 1926 D
1668 1926 D
1668 1897 D
1684 1897 D
1684 1873 D
1701 1873 D
1701 1847 D
1717 1847 D
1717 1827 D
1733 1827 D
1733 1783 D
1750 1783 D
1750 1748 D
1766 1748 D
1766 1755 D
1783 1755 D
1783 1722 D
1799 1722 D
1799 1706 D
1816 1706 D
1816 1679 D
1832 1679 D
1832 1704 D
1832 1704 D
1832 1704 D
1848 1704 D
1848 1679 D
1865 1679 D
1865 1624 D
1881 1624 D
1881 1602 D
1898 1602 D
1898 1607 D
1914 1607 D
1914 1596 D
1931 1596 D
1931 1606 D
1947 1606 D
1947 1570 D
1964 1570 D
1964 1471 D
1980 1471 D
1980 1546 D
1996 1546 D
1996 1417 D
2013 1417 D
2013 1481 D
2029 1481 D
2029 1485 D
2046 1485 D
2046 1537 D
2062 1537 D
2062 1519 D
2079 1519 D
2079 1490 D
2095 1490 D
2095 1217 D
S
N
2111 1217 M
2111 1473 D
2128 1473 D
2128 1388 D
2144 1388 D
2144 1476 D
2161 1476 D
2161 1217 D
S
N
2177 1217 M
2177 1374 D
2194 1374 D
2194 1317 D
2210 1317 D
2210 1436 D
2226 1436 D
2226 1217 D
S
showpage
%%Trailer
%%Pages: 1
%%BoundingBox: 64 259 548 563
