%!PS-Adobe-3.0 EPSF-3.0
%%BoundingBox: (atend)
%%LanguageLevel: 2
%%Creator: Grace-5.1.19
%%CreationDate: Tue May 28 10:50:26 2013
%%DocumentData: Clean8Bit
%%Orientation: Portrait
%%Title: CP_polar_ZZ_logo.agr
%%For: user
%%DocumentNeededResources: (atend)
%%EndComments
%%BeginProlog
/m {moveto} def
/l {lineto} def
/s {stroke} def
/n {newpath} def
/c {closepath} def
/RL {rlineto} def
/SLW {setlinewidth} def
/GS {gsave} def
/GR {grestore} def
/SC {setcolor} def
/SGRY {setgray} def
/SRGB {setrgbcolor} def
/SD {setdash} def
/SLC {setlinecap} def
/SLJ {setlinejoin} def
/SCS {setcolorspace} def
/FFSF {findfont setfont} def
/CC {concat} def
/PXL {n m 0 0 RL s} def
/Color0 {1.0000 1.0000 1.0000} def
/Color1 {0.0000 0.0000 0.0000} def
/Color2 {1.0000 0.0000 0.0000} def
/Color3 {0.0000 1.0000 0.0000} def
/Color4 {0.0000 0.0000 1.0000} def
/Color5 {1.0000 1.0000 0.0000} def
/Color6 {0.7373 0.5608 0.5608} def
/Color7 {0.8627 0.8627 0.8627} def
/Color8 {0.5804 0.0000 0.8275} def
/Color9 {0.0000 1.0000 1.0000} def
/Color10 {1.0000 0.0000 1.0000} def
/Color11 {1.0000 0.6471 0.0000} def
/Color12 {0.4471 0.1294 0.7373} def
/Color13 {0.4039 0.0275 0.2824} def
/Color14 {0.2510 0.8784 0.8157} def
/Color15 {0.0000 0.5451 0.0000} def
/Color16 {0.7529 0.7529 0.7529} def
/Color17 {0.5059 0.5059 0.5059} def
/Color18 {0.2588 0.2588 0.2588} def
/Color19 {0.7529 0.7529 1.0000} def
/Color20 {0.5059 0.5059 1.0000} def
/Color21 {0.2588 0.2588 1.0000} def
/PTRN {
 /pat_bits exch def 
 <<
  /PaintType 2
  /PatternType 1 /TilingType 1
  /BBox[0 0 16 16]
  /XStep 16 /YStep 16
  /PaintProc {
   pop
   16 16 true [-1 0 0 -1 16 16] pat_bits imagemask
  }
 >>
 [0.0016 0 0 0.0016 0 0]
 makepattern
} def
/Pattern0 {<0000000000000000000000000000000000000000000000000000000000000000> PTRN} bind def
/Pattern1 {<ffffffffffffffffffffffffffffffffffffffffffffffffffffffffffffffff> PTRN} bind def
/Pattern2 {<eeeeffffbbbbffffeeeeffffbbbbffffeeeeffffbbbbffffeeeeffffbbbbffff> PTRN} bind def
/Pattern3 {<eeeebbbbeeeebbbbeeeebbbbeeeebbbbeeeebbbbeeeebbbbeeeebbbbeeeebbbb> PTRN} bind def
/Pattern4 {<5555aaaa5555aaaa5555aaaa5555aaaa5555aaaa5555aaaa5555aaaa5555aaaa> PTRN} bind def
/Pattern5 {<1111444411114444111144441111444411114444111144441111444411114444> PTRN} bind def
/Pattern6 {<1111000044440000111100004444000011110000444400001111000044440000> PTRN} bind def
/Pattern7 {<1010000000000000010100000000000010100000000000000101000000000000> PTRN} bind def
/Pattern8 {<0000000000000000000000000000000000000000000000000000000000000000> PTRN} bind def
/Pattern9 {<1e1e0f0f8787c3c3e1e1f0f078783c3c1e1e0f0f8787c3c3e1e1f0f078783c3c> PTRN} bind def
/Pattern10 {<7878f0f0e1e1c3c387870f0f1e1e3c3c7878f0f0e1e1c3c387870f0f1e1e3c3c> PTRN} bind def
/Pattern11 {<3333333333333333333333333333333333333333333333333333333333333333> PTRN} bind def
/Pattern12 {<ffffffff00000000ffffffff00000000ffffffff00000000ffffffff00000000> PTRN} bind def
/Pattern13 {<8181424224241818181824244242818181814242242418181818242442428181> PTRN} bind def
/Pattern14 {<8080404020201010080804040202010180804040202010100808040402020101> PTRN} bind def
/Pattern15 {<0101020204040808101020204040808001010202040408081010202040408080> PTRN} bind def
/Pattern16 {<2222222222222222222222222222222222222222222222222222222222222222> PTRN} bind def
/Pattern17 {<0000ffff000000000000ffff000000000000ffff000000000000ffff00000000> PTRN} bind def
/Pattern18 {<2222ffff222222222222ffff222222222222ffff222222222222ffff22222222> PTRN} bind def
/Pattern19 {<ffffffff33333333ffffffff33333333ffffffff33333333ffffffff33333333> PTRN} bind def
/Pattern20 {<0f0f0f0f0f0f0f0ff0f0f0f0f0f0f0f00f0f0f0f0f0f0f0ff0f0f0f0f0f0f0f0> PTRN} bind def
/Pattern21 {<ff00ff00ff00ff00ff00ff00ff00ff0000ff00ff00ff00ff00ff00ff00ff00ff> PTRN} bind def
/Pattern22 {<8001800180018001800180018001ffffffff8001800180018001800180018001> PTRN} bind def
/Pattern23 {<c003c003c003c003c003c003ffffffffffffffffc003c003c003c003c003c003> PTRN} bind def
/Pattern24 {<040404040404ffff404040404040ffff040404040404ffff404040404040ffff> PTRN} bind def
/Pattern25 {<180018001800180018001800ffffffff001800180018001800180018ffffffff> PTRN} bind def
/Pattern26 {<1111b8b87c7c3a3a1111a3a3c7c78b8b1111b8b87c7c3a3a1111a3a3c7c78b8b> PTRN} bind def
/Pattern27 {<101010102828c7c70101010182827c7c101010102828c7c70101010182827c7c> PTRN} bind def
/Pattern28 {<1c1c121211112121c1c12121111112121c1c121211112121c1c1212111111212> PTRN} bind def
/Pattern29 {<3e3e414180808080e3e31414080808083e3e414180808080e3e3141408080808> PTRN} bind def
/Pattern30 {<4848888884848383848488884848383848488888848483838484888848483838> PTRN} bind def
/Pattern31 {<03030404080808080c0c12122121c0c003030404080808080c0c12122121c0c0> PTRN} bind def
/ellipsedict 8 dict def
ellipsedict /mtrx matrix put
/EARC {
 ellipsedict begin
  /endangle exch def
  /startangle exch def
  /yrad exch def
  /xrad exch def
  /y exch def
  /x exch def
  /savematrix mtrx currentmatrix def
  x y translate
  xrad yrad scale
  0 0 1 startangle endangle arc
  savematrix setmatrix
 end
} def
/TL {
  /kcomp exch def
  /linewidth exch def
  /offset exch def
  GS
  0 offset rmoveto
  linewidth SLW
  dup stringwidth exch kcomp add exch RL s
  GR
} def
/KINIT
{
 /kvector exch def
 /kid 0 def
} def
/KPROC
{
 pop pop
 kvector kid get
 0 rmoveto
 /kid 1 kid add def
} def
/DefEncoding [
 /.notdef
 /.notdef
 /.notdef
 /.notdef
 /.notdef
 /.notdef
 /.notdef
 /.notdef
 /.notdef
 /.notdef
 /.notdef
 /.notdef
 /.notdef
 /.notdef
 /.notdef
 /.notdef
 /.notdef
 /.notdef
 /.notdef
 /.notdef
 /.notdef
 /.notdef
 /.notdef
 /.notdef
 /.notdef
 /.notdef
 /.notdef
 /.notdef
 /.notdef
 /.notdef
 /.notdef
 /.notdef
 /space
 /exclam
 /quotedbl
 /numbersign
 /dollar
 /percent
 /ampersand
 /quoteright
 /parenleft
 /parenright
 /asterisk
 /plus
 /comma
 /hyphen
 /period
 /slash
 /zero
 /one
 /two
 /three
 /four
 /five
 /six
 /seven
 /eight
 /nine
 /colon
 /semicolon
 /less
 /equal
 /greater
 /question
 /at
 /A
 /B
 /C
 /D
 /E
 /F
 /G
 /H
 /I
 /J
 /K
 /L
 /M
 /N
 /O
 /P
 /Q
 /R
 /S
 /T
 /U
 /V
 /W
 /X
 /Y
 /Z
 /bracketleft
 /backslash
 /bracketright
 /asciicircum
 /underscore
 /grave
 /a
 /b
 /c
 /d
 /e
 /f
 /g
 /h
 /i
 /j
 /k
 /l
 /m
 /n
 /o
 /p
 /q
 /r
 /s
 /t
 /u
 /v
 /w
 /x
 /y
 /z
 /braceleft
 /bar
 /braceright
 /asciitilde
 /.notdef
 /.notdef
 /.notdef
 /.notdef
 /.notdef
 /.notdef
 /.notdef
 /.notdef
 /.notdef
 /.notdef
 /.notdef
 /.notdef
 /.notdef
 /.notdef
 /.notdef
 /.notdef
 /.notdef
 /.notdef
 /.notdef
 /.notdef
 /.notdef
 /.notdef
 /.notdef
 /.notdef
 /.notdef
 /.notdef
 /.notdef
 /.notdef
 /.notdef
 /.notdef
 /.notdef
 /.notdef
 /.notdef
 /space
 /exclamdown
 /cent
 /sterling
 /currency
 /yen
 /brokenbar
 /section
 /dieresis
 /copyright
 /ordfeminine
 /guillemotleft
 /logicalnot
 /hyphen
 /registered
 /macron
 /degree
 /plusminus
 /twosuperior
 /threesuperior
 /acute
 /mu
 /paragraph
 /periodcentered
 /cedilla
 /onesuperior
 /ordmasculine
 /guillemotright
 /onequarter
 /onehalf
 /threequarters
 /questiondown
 /Agrave
 /Aacute
 /Acircumflex
 /Atilde
 /Adieresis
 /Aring
 /AE
 /Ccedilla
 /Egrave
 /Eacute
 /Ecircumflex
 /Edieresis
 /Igrave
 /Iacute
 /Icircumflex
 /Idieresis
 /Eth
 /Ntilde
 /Ograve
 /Oacute
 /Ocircumflex
 /Otilde
 /Odieresis
 /multiply
 /Oslash
 /Ugrave
 /Uacute
 /Ucircumflex
 /Udieresis
 /Yacute
 /Thorn
 /germandbls
 /agrave
 /aacute
 /acircumflex
 /atilde
 /adieresis
 /aring
 /ae
 /ccedilla
 /egrave
 /eacute
 /ecircumflex
 /edieresis
 /igrave
 /iacute
 /icircumflex
 /idieresis
 /eth
 /ntilde
 /ograve
 /oacute
 /ocircumflex
 /otilde
 /odieresis
 /divide
 /oslash
 /ugrave
 /uacute
 /ucircumflex
 /udieresis
 /yacute
 /thorn
 /ydieresis
] def
%%EndProlog
%%BeginSetup
%%EndSetup
612.00 612.00 scale
n
0.0000 0.0000 m
0.0000 1.0000 l
1.2941 1.0000 l
1.2941 0.0000 l
c
[/DeviceRGB] SCS
Color0 SC
fill
[/DeviceRGB] SCS
Color1 SC
[] 0 SD
0.0030 SLW
0 SLC
0 SLJ
n
0.2000 0.6964 m
0.2080 0.6964 l
0.2160 0.6964 l
0.2240 0.6963 l
0.2320 0.6963 l
0.2400 0.6963 l
0.2480 0.6962 l
0.2560 0.6962 l
0.2640 0.6961 l
0.2720 0.6961 l
0.2800 0.6960 l
0.2880 0.6959 l
0.2960 0.6958 l
0.3040 0.6957 l
0.3120 0.6956 l
0.3200 0.6955 l
0.3280 0.6954 l
0.3360 0.6952 l
0.3440 0.6951 l
0.3520 0.6949 l
0.3600 0.6948 l
0.3680 0.6946 l
0.3760 0.6944 l
0.3840 0.6942 l
0.3920 0.6940 l
0.4000 0.6938 l
0.4080 0.6935 l
0.4160 0.6933 l
0.4240 0.6930 l
0.4320 0.6927 l
0.4400 0.6924 l
0.4480 0.6921 l
0.4560 0.6918 l
0.4640 0.6915 l
0.4720 0.6911 l
0.4800 0.6907 l
0.4880 0.6903 l
0.4960 0.6899 l
0.5040 0.6894 l
0.5120 0.6890 l
0.5200 0.6885 l
0.5280 0.6879 l
0.5360 0.6874 l
0.5440 0.6868 l
0.5520 0.6862 l
0.5600 0.6855 l
0.5680 0.6848 l
0.5760 0.6841 l
0.5840 0.6833 l
0.5920 0.6825 l
0.6000 0.6817 l
0.6080 0.6807 l
0.6160 0.6798 l
0.6240 0.6787 l
0.6320 0.6776 l
0.6400 0.6765 l
0.6480 0.6752 l
0.6560 0.6739 l
0.6640 0.6725 l
0.6720 0.6710 l
0.6800 0.6694 l
0.6880 0.6676 l
0.6960 0.6658 l
0.7040 0.6638 l
0.7120 0.6617 l
0.7200 0.6594 l
0.7280 0.6569 l
0.7360 0.6542 l
0.7440 0.6514 l
0.7520 0.6483 l
0.7600 0.6449 l
0.7680 0.6413 l
0.7760 0.6373 l
0.7840 0.6330 l
0.7920 0.6283 l
0.8000 0.6231 l
0.8080 0.6175 l
0.8160 0.6114 l
0.8240 0.6047 l
0.8320 0.5973 l
0.8400 0.5891 l
0.8480 0.5802 l
0.8560 0.5704 l
0.8640 0.5596 l
0.8720 0.5477 l
0.8800 0.5346 l
0.8880 0.5203 l
0.8960 0.5046 l
0.9040 0.4875 l
0.9120 0.4691 l
0.9200 0.4493 l
0.9280 0.4283 l
0.9360 0.4064 l
0.9440 0.3840 l
0.9520 0.3617 l
0.9600 0.3402 l
0.9680 0.3206 l
0.9760 0.3038 l
0.9840 0.2909 l
0.9920 0.2828 l
1.0000 0.2800 l
s
[/DeviceRGB] SCS
Color2 SC
[0.0150 0.0090 ] 0 SD
0.0030 SLW
n
0.2000 0.5636 m
0.2080 0.5636 l
0.2160 0.5636 l
0.2240 0.5637 l
0.2320 0.5637 l
0.2400 0.5637 l
0.2480 0.5638 l
0.2560 0.5638 l
0.2640 0.5639 l
0.2720 0.5639 l
0.2800 0.5640 l
0.2880 0.5641 l
0.2960 0.5642 l
0.3040 0.5643 l
0.3120 0.5644 l
0.3200 0.5645 l
0.3280 0.5646 l
0.3360 0.5648 l
0.3440 0.5649 l
0.3520 0.5651 l
0.3600 0.5652 l
0.3680 0.5654 l
0.3760 0.5656 l
0.3840 0.5658 l
0.3920 0.5660 l
0.4000 0.5662 l
0.4080 0.5665 l
0.4160 0.5667 l
0.4240 0.5670 l
0.4320 0.5673 l
0.4400 0.5676 l
0.4480 0.5679 l
0.4560 0.5682 l
0.4640 0.5685 l
0.4720 0.5689 l
0.4800 0.5693 l
0.4880 0.5697 l
0.4960 0.5701 l
0.5040 0.5706 l
0.5120 0.5710 l
0.5200 0.5715 l
0.5280 0.5721 l
0.5360 0.5726 l
0.5440 0.5732 l
0.5520 0.5738 l
0.5600 0.5745 l
0.5680 0.5752 l
0.5760 0.5759 l
0.5840 0.5767 l
0.5920 0.5775 l
0.6000 0.5783 l
0.6080 0.5793 l
0.6160 0.5802 l
0.6240 0.5813 l
0.6320 0.5824 l
0.6400 0.5835 l
0.6480 0.5848 l
0.6560 0.5861 l
0.6640 0.5875 l
0.6720 0.5890 l
0.6800 0.5906 l
0.6880 0.5924 l
0.6960 0.5942 l
0.7040 0.5962 l
0.7120 0.5983 l
0.7200 0.6006 l
0.7280 0.6031 l
0.7360 0.6058 l
0.7440 0.6086 l
0.7520 0.6117 l
0.7600 0.6151 l
0.7680 0.6187 l
0.7760 0.6227 l
0.7840 0.6270 l
0.7920 0.6317 l
0.8000 0.6369 l
0.8080 0.6425 l
0.8160 0.6486 l
0.8240 0.6553 l
0.8320 0.6627 l
0.8400 0.6709 l
0.8480 0.6798 l
0.8560 0.6896 l
0.8640 0.7004 l
0.8720 0.7123 l
0.8800 0.7254 l
0.8880 0.7397 l
0.8960 0.7554 l
0.9040 0.7725 l
0.9120 0.7909 l
0.9200 0.8107 l
0.9280 0.8317 l
0.9360 0.8536 l
0.9440 0.8760 l
0.9520 0.8983 l
0.9600 0.9198 l
0.9680 0.9394 l
0.9760 0.9562 l
0.9840 0.9691 l
0.9920 0.9772 l
1.0000 0.9800 l
s
[/DeviceRGB] SCS
Color1 SC
[] 0 SD
0.0015 SLW
n
0.2000 0.2800 m
1.0000 0.2800 l
s
n
0.2000 0.9800 m
1.0000 0.9800 l
s
n
0.2320 0.2800 m
0.2320 0.2900 l
s
n
0.2320 0.9800 m
0.2320 0.9700 l
s
n
0.2640 0.2800 m
0.2640 0.2900 l
s
n
0.2640 0.9800 m
0.2640 0.9700 l
s
n
0.2960 0.2800 m
0.2960 0.2900 l
s
n
0.2960 0.9800 m
0.2960 0.9700 l
s
n
0.3280 0.2800 m
0.3280 0.2900 l
s
n
0.3280 0.9800 m
0.3280 0.9700 l
s
n
0.3920 0.2800 m
0.3920 0.2900 l
s
n
0.3920 0.9800 m
0.3920 0.9700 l
s
n
0.4240 0.2800 m
0.4240 0.2900 l
s
n
0.4240 0.9800 m
0.4240 0.9700 l
s
n
0.4560 0.2800 m
0.4560 0.2900 l
s
n
0.4560 0.9800 m
0.4560 0.9700 l
s
n
0.4880 0.2800 m
0.4880 0.2900 l
s
n
0.4880 0.9800 m
0.4880 0.9700 l
s
n
0.5520 0.2800 m
0.5520 0.2900 l
s
n
0.5520 0.9800 m
0.5520 0.9700 l
s
n
0.5840 0.2800 m
0.5840 0.2900 l
s
n
0.5840 0.9800 m
0.5840 0.9700 l
s
n
0.6160 0.2800 m
0.6160 0.2900 l
s
n
0.6160 0.9800 m
0.6160 0.9700 l
s
n
0.6480 0.2800 m
0.6480 0.2900 l
s
n
0.6480 0.9800 m
0.6480 0.9700 l
s
n
0.7120 0.2800 m
0.7120 0.2900 l
s
n
0.7120 0.9800 m
0.7120 0.9700 l
s
n
0.7440 0.2800 m
0.7440 0.2900 l
s
n
0.7440 0.9800 m
0.7440 0.9700 l
s
n
0.7760 0.2800 m
0.7760 0.2900 l
s
n
0.7760 0.9800 m
0.7760 0.9700 l
s
n
0.8080 0.2800 m
0.8080 0.2900 l
s
n
0.8080 0.9800 m
0.8080 0.9700 l
s
n
0.8720 0.2800 m
0.8720 0.2900 l
s
n
0.8720 0.9800 m
0.8720 0.9700 l
s
n
0.9040 0.2800 m
0.9040 0.2900 l
s
n
0.9040 0.9800 m
0.9040 0.9700 l
s
n
0.9360 0.2800 m
0.9360 0.2900 l
s
n
0.9360 0.9800 m
0.9360 0.9700 l
s
n
0.9680 0.2800 m
0.9680 0.2900 l
s
n
0.9680 0.9800 m
0.9680 0.9700 l
s
n
0.2000 0.2800 m
0.2000 0.3000 l
s
n
0.2000 0.9800 m
0.2000 0.9600 l
s
n
0.3600 0.2800 m
0.3600 0.3000 l
s
n
0.3600 0.9800 m
0.3600 0.9600 l
s
n
0.5200 0.2800 m
0.5200 0.3000 l
s
n
0.5200 0.9800 m
0.5200 0.9600 l
s
n
0.6800 0.2800 m
0.6800 0.3000 l
s
n
0.6800 0.9800 m
0.6800 0.9600 l
s
n
0.8400 0.2800 m
0.8400 0.3000 l
s
n
0.8400 0.9800 m
0.8400 0.9600 l
s
n
1.0000 0.2800 m
1.0000 0.3000 l
s
n
1.0000 0.9800 m
1.0000 0.9600 l
s
/Times-Roman findfont
dup length dict begin
 {1 index /FID ne {def} {pop pop} ifelse} forall
 /Encoding DefEncoding def
 currentdict
end
/Font0 exch definefont pop
/Font0 FFSF
0.1794 0.2473 m
GS
[0.0336 0.0000 0.0000 0.0336 0 0] CC
(0.0) show
GR
/Font0 FFSF
0.3408 0.2473 m
GS
[0.0336 0.0000 0.0000 0.0336 0 0] CC
(0.1) show
GR
/Font0 FFSF
0.4994 0.2473 m
GS
[0.0336 0.0000 0.0000 0.0336 0 0] CC
(0.2) show
GR
/Font0 FFSF
0.6602 0.2473 m
GS
[0.0336 0.0000 0.0000 0.0336 0 0] CC
(0.3) show
GR
/Font0 FFSF
0.8196 0.2473 m
GS
[0.0336 0.0000 0.0000 0.0336 0 0] CC
(0.4) show
GR
/Font0 FFSF
0.9800 0.2469 m
GS
[0.0336 0.0000 0.0000 0.0336 0 0] CC
(0.5) show
GR
/Symbol findfont
/Font12 exch definefont pop
/Font12 FFSF
0.5714 0.1904 m
GS
[0.0420 0.0000 0.0000 0.0420 0 0] CC
(c/p) show
GR
n
0.2000 0.2800 m
0.2000 0.9800 l
s
n
1.0000 0.2800 m
1.0000 0.9800 l
s
n
0.2000 0.3080 m
0.2100 0.3080 l
s
n
1.0000 0.3080 m
0.9900 0.3080 l
s
n
0.2000 0.3360 m
0.2100 0.3360 l
s
n
1.0000 0.3360 m
0.9900 0.3360 l
s
n
0.2000 0.3640 m
0.2100 0.3640 l
s
n
1.0000 0.3640 m
0.9900 0.3640 l
s
n
0.2000 0.3920 m
0.2100 0.3920 l
s
n
1.0000 0.3920 m
0.9900 0.3920 l
s
n
0.2000 0.4480 m
0.2100 0.4480 l
s
n
1.0000 0.4480 m
0.9900 0.4480 l
s
n
0.2000 0.4760 m
0.2100 0.4760 l
s
n
1.0000 0.4760 m
0.9900 0.4760 l
s
n
0.2000 0.5040 m
0.2100 0.5040 l
s
n
1.0000 0.5040 m
0.9900 0.5040 l
s
n
0.2000 0.5320 m
0.2100 0.5320 l
s
n
1.0000 0.5320 m
0.9900 0.5320 l
s
n
0.2000 0.5880 m
0.2100 0.5880 l
s
n
1.0000 0.5880 m
0.9900 0.5880 l
s
n
0.2000 0.6160 m
0.2100 0.6160 l
s
n
1.0000 0.6160 m
0.9900 0.6160 l
s
n
0.2000 0.6440 m
0.2100 0.6440 l
s
n
1.0000 0.6440 m
0.9900 0.6440 l
s
n
0.2000 0.6720 m
0.2100 0.6720 l
s
n
1.0000 0.6720 m
0.9900 0.6720 l
s
n
0.2000 0.7280 m
0.2100 0.7280 l
s
n
1.0000 0.7280 m
0.9900 0.7280 l
s
n
0.2000 0.7560 m
0.2100 0.7560 l
s
n
1.0000 0.7560 m
0.9900 0.7560 l
s
n
0.2000 0.7840 m
0.2100 0.7840 l
s
n
1.0000 0.7840 m
0.9900 0.7840 l
s
n
0.2000 0.8120 m
0.2100 0.8120 l
s
n
1.0000 0.8120 m
0.9900 0.8120 l
s
n
0.2000 0.8680 m
0.2100 0.8680 l
s
n
1.0000 0.8680 m
0.9900 0.8680 l
s
n
0.2000 0.8960 m
0.2100 0.8960 l
s
n
1.0000 0.8960 m
0.9900 0.8960 l
s
n
0.2000 0.9240 m
0.2100 0.9240 l
s
n
1.0000 0.9240 m
0.9900 0.9240 l
s
n
0.2000 0.9520 m
0.2100 0.9520 l
s
n
1.0000 0.9520 m
0.9900 0.9520 l
s
n
0.2000 0.2800 m
0.2200 0.2800 l
s
n
1.0000 0.2800 m
0.9800 0.2800 l
s
n
0.2000 0.4200 m
0.2200 0.4200 l
s
n
1.0000 0.4200 m
0.9800 0.4200 l
s
n
0.2000 0.5600 m
0.2200 0.5600 l
s
n
1.0000 0.5600 m
0.9800 0.5600 l
s
n
0.2000 0.7000 m
0.2200 0.7000 l
s
n
1.0000 0.7000 m
0.9800 0.7000 l
s
n
0.2000 0.8400 m
0.2200 0.8400 l
s
n
1.0000 0.8400 m
0.9800 0.8400 l
s
n
0.2000 0.9800 m
0.2200 0.9800 l
s
n
1.0000 0.9800 m
0.9800 0.9800 l
s
/Font0 FFSF
0.1320 0.2688 m
GS
[0.0336 0.0000 0.0000 0.0336 0 0] CC
(0.00) show
GR
/Font0 FFSF
0.1320 0.4088 m
GS
[0.0336 0.0000 0.0000 0.0336 0 0] CC
(0.20) show
GR
/Font0 FFSF
0.1320 0.5488 m
GS
[0.0336 0.0000 0.0000 0.0336 0 0] CC
(0.40) show
GR
/Font0 FFSF
0.1320 0.6886 m
GS
[0.0336 0.0000 0.0000 0.0336 0 0] CC
(0.60) show
GR
/Font0 FFSF
0.1320 0.8288 m
GS
[0.0336 0.0000 0.0000 0.0336 0 0] CC
(0.80) show
GR
/Font0 FFSF
0.1320 0.9688 m
GS
[0.0336 0.0000 0.0000 0.0336 0 0] CC
(1.00) show
GR
/Font0 FFSF
0.0941 0.5280 m
GS
[0.0000 0.0420 -0.0420 0.0000 0 0] CC
(Coefficients) show
GR
n
0.2000 0.2800 m
0.2000 0.9800 l
1.0000 0.9800 l
1.0000 0.2800 l
0.2000 0.2800 l
c
s
n
0.3000 0.4600 m
0.3000 0.3386 l
0.6993 0.3386 l
0.6993 0.4600 l
c
[/DeviceRGB] SCS
Color0 SC
fill
/Font0 FFSF
[/DeviceRGB] SCS
Color1 SC
0.4015 0.4166 m
GS
[0.0308 0.0000 0.0000 0.0308 0 0] CC
(sin) show
GR
/Font0 FFSF
0.4376 0.4351 m
GS
[0.0218 0.0000 0.0000 0.0218 0 0] CC
(2) show
GR
/Font12 FFSF
0.4486 0.4166 m
GS
[0.0308 0.0000 0.0000 0.0308 0 0] CC
(q) show
GR
/Font12 FFSF
0.4646 0.4043 m
GS
[0.0218 0.0000 0.0000 0.0218 0 0] CC
(1) show
GR
/Font0 FFSF
0.4756 0.4166 m
GS
[0.0308 0.0000 0.0000 0.0308 0 0] CC
(sin) show
GR
/Font0 FFSF
0.5117 0.4351 m
GS
[0.0218 0.0000 0.0000 0.0218 0 0] CC
(2) show
GR
/Font12 FFSF
0.5227 0.4166 m
GS
[0.0308 0.0000 0.0000 0.0308 0 0] CC
(q) show
GR
/Font12 FFSF
0.5388 0.4043 m
GS
[0.0218 0.0000 0.0000 0.0218 0 0] CC
(2) show
GR
[] 0 SD
0.0030 SLW
n
0.3115 0.4271 m
0.3815 0.4271 l
s
/Font0 FFSF
0.4015 0.3609 m
GS
[0.0308 0.0000 0.0000 0.0308 0 0] CC
(\(1+cos) show
GR
/Font0 FFSF
0.4854 0.3794 m
GS
[0.0218 0.0000 0.0000 0.0218 0 0] CC
(2) show
GR
/Font12 FFSF
0.4964 0.3609 m
GS
[0.0308 0.0000 0.0000 0.0308 0 0] CC
(q) show
GR
/Font12 FFSF
0.5125 0.3486 m
GS
[0.0218 0.0000 0.0000 0.0218 0 0] CC
(1) show
GR
/Font0 FFSF
0.5235 0.3609 m
GS
[0.0308 0.0000 0.0000 0.0308 0 0] CC
(\)\(1+cos) show
GR
/Font0 FFSF
0.6180 0.3794 m
GS
[0.0218 0.0000 0.0000 0.0218 0 0] CC
(2) show
GR
/Font12 FFSF
0.6290 0.3609 m
GS
[0.0308 0.0000 0.0000 0.0308 0 0] CC
(q) show
GR
/Font12 FFSF
0.6450 0.3486 m
GS
[0.0218 0.0000 0.0000 0.0218 0 0] CC
(2) show
GR
/Font0 FFSF
0.6560 0.3609 m
GS
[0.0308 0.0000 0.0000 0.0308 0 0] CC
(\)/4) show
GR
[/DeviceRGB] SCS
Color2 SC
[0.0150 0.0090 ] 0 SD
0.0030 SLW
n
0.3115 0.3714 m
0.3815 0.3714 l
s
[/DeviceRGB] SCS
Color1 SC
[] 0 SD
0.0015 SLW
n
0.2931 0.6552 m
0.2931 0.6034 l
0.3574 0.6034 l
0.3574 0.6552 l
0.2931 0.6552 l
c
s
n
0.8715 0.6520 m
0.8715 0.6066 l
0.9279 0.6066 l
0.9279 0.6520 l
0.8715 0.6520 l
c
s
n
0.2774 0.6238 m
0.2304 0.6238 l
s
n
0.2404 0.6288 m
0.2304 0.6238 l
0.2404 0.6188 l
s
n
0.9360 0.6285 m
0.9810 0.6285 l
s
n
0.9710 0.6235 m
0.9810 0.6285 l
0.9710 0.6335 l
s
/Font0 FFSF
[/DeviceRGB] SCS
Color4 SC
0.6348 0.9154 m
GS
[0.0280 0.0000 0.0000 0.0280 0 0] CC
(H) show
GR
/Courier findfont
dup length dict begin
 {1 index /FID ne {def} {pop pop} ifelse} forall
 /Encoding DefEncoding def
 currentdict
end
/Font8 exch definefont pop
/Font8 FFSF
0.6552 0.9210 m
GS
[0.0280 0.0000 0.0000 0.0280 0 0] CC
(') show
GR
/Font0 FFSF
0.6721 0.9154 m
GS
[0.0280 0.0000 0.0000 0.0280 0 0] CC
(-) show
GR
/Font0 FFSF
0.6759 0.9154 m
GS
[0.0280 0.0000 0.0000 0.0280 0 0] CC
(-) show
GR
/Font0 FFSF
0.6797 0.9154 m
GS
[0.0280 0.0000 0.0000 0.0280 0 0] CC
(-) show
GR
/Font0 FFSF
0.6807 0.9154 m
GS
[0.0280 0.0000 0.0000 0.0280 0 0] CC
(> Z) show
GR
/Font0 FFSF
0.7207 0.9322 m
GS
[0.0198 0.0000 0.0000 0.0198 0 0] CC
(*) show
GR
/Font0 FFSF
0.7305 0.9154 m
GS
[0.0280 0.0000 0.0000 0.0280 0 0] CC
(Z -) show
GR
/Font0 FFSF
0.7582 0.9154 m
GS
[0.0280 0.0000 0.0000 0.0280 0 0] CC
(-) show
GR
/Font0 FFSF
0.7620 0.9154 m
GS
[0.0280 0.0000 0.0000 0.0280 0 0] CC
(-) show
GR
/Font0 FFSF
0.7630 0.9154 m
GS
[0.0280 0.0000 0.0000 0.0280 0 0] CC
(>  \(l) show
GR
/Font0 FFSF
0.8101 0.9322 m
GS
[0.0198 0.0000 0.0000 0.0198 0 0] CC
(-) show
GR
/Font0 FFSF
0.8108 0.9042 m
GS
[0.0198 0.0000 0.0000 0.0198 0 0] CC
(1) show
GR
/Font0 FFSF
0.8206 0.9154 m
GS
[0.0280 0.0000 0.0000 0.0280 0 0] CC
(l) show
GR
/Font0 FFSF
0.8285 0.9322 m
GS
[0.0198 0.0000 0.0000 0.0198 0 0] CC
(+) show
GR
/Font0 FFSF
0.8335 0.9042 m
GS
[0.0198 0.0000 0.0000 0.0198 0 0] CC
(1) show
GR
/Font0 FFSF
0.8433 0.9154 m
GS
[0.0280 0.0000 0.0000 0.0280 0 0] CC
(\) \(l) show
GR
/Font0 FFSF
0.8767 0.9322 m
GS
[0.0198 0.0000 0.0000 0.0198 0 0] CC
(-) show
GR
/Font0 FFSF
0.8774 0.9042 m
GS
[0.0198 0.0000 0.0000 0.0198 0 0] CC
(2) show
GR
/Font0 FFSF
0.8872 0.9154 m
GS
[0.0280 0.0000 0.0000 0.0280 0 0] CC
(l) show
GR
/Font0 FFSF
0.8950 0.9322 m
GS
[0.0198 0.0000 0.0000 0.0198 0 0] CC
(+) show
GR
/Font0 FFSF
0.9001 0.9042 m
GS
[0.0198 0.0000 0.0000 0.0198 0 0] CC
(2) show
GR
/Font0 FFSF
0.9099 0.9154 m
GS
[0.0280 0.0000 0.0000 0.0280 0 0] CC
(\)) show
GR
/Font0 FFSF
0.7351 0.8683 m
GS
[0.0280 0.0000 0.0000 0.0280 0 0] CC
(M) show
GR
/Font0 FFSF
0.7598 0.8571 m
GS
[0.0198 0.0000 0.0000 0.0198 0 0] CC
(H) show
GR
/Font8 FFSF
0.7739 0.8631 m
GS
[0.0198 0.0000 0.0000 0.0198 0 0] CC
(') show
GR
/Font0 FFSF
0.7857 0.8683 m
GS
[0.0280 0.0000 0.0000 0.0280 0 0] CC
( = 125 GeV) show
GR
/Font0 FFSF
[/DeviceRGB] SCS
Color1 SC
0.2665 0.9028 m
GS
[0.0364 0.0000 0.0000 0.0364 0 0] CC
(\(a\)) show
GR
/Font0 FFSF
0.2994 0.6129 m
GS
[0.0364 0.0000 0.0000 0.0364 0 0] CC
(SM) show
GR
/Font0 FFSF
0.8856 0.6144 m
GS
[0.0364 0.0000 0.0000 0.0364 0 0] CC
(0) show
GR
/Font0 FFSF
0.9036 0.6363 m
GS
[0.0257 0.0000 0.0000 0.0257 0 0] CC
(-) show
GR
/Helvetica-BoldOblique findfont
dup length dict begin
 {1 index /FID ne {def} {pop pop} ifelse} forall
 /Encoding DefEncoding def
 currentdict
end
/Font7 exch definefont pop
/Font7 FFSF
1.0340 0.7320 m
GS
[0.0000 0.0210 -0.0210 0.0000 0 0] CC
(LHC HIGGS XS WG 2013) show
GR
%%Trailer
%%BoundingBox: 39 110 635 608
%%DocumentNeededResources: font Times-Roman
%%+ font Helvetica-BoldOblique
%%+ font Courier
%%+ font Symbol
%%EOF
