%!PS-Adobe-2.0 EPSF-2.0
%%BoundingBox:  0 0 567 341
%%Title: /home/qliphy/Downloads/MCFM/Bin/plot0/h700/ptl.eps: 
%%Creator: ROOT Version 5.32/00
%%CreationDate: Thu Jun 13 17:06:07 2013
%%EndComments
%%BeginProlog
80 dict begin
/s {stroke} def /l {lineto} def /m {moveto} def /t {translate} def
/r {rotate} def /rl {roll}  def /R {repeat} def
/d {rlineto} def /rm {rmoveto} def /gr {grestore} def /f {eofill} def
/c {setrgbcolor} def /black {0 setgray} def /sd {setdash} def
/cl {closepath} def /sf {scalefont setfont} def /lw {setlinewidth} def
/box {m dup 0 exch d exch 0 d 0 exch neg d cl} def
/NC{systemdict begin initclip end}def/C{NC box clip newpath}def
/bl {box s} def /bf {box f} def /Y { 0 exch d} def /X { 0 d} def 
/K {{pop pop 0 moveto} exch kshow} bind def
/ita {/ang 15 def gsave [1 0 ang dup sin exch cos div 1 0 0] concat} def 
/mp {newpath /y exch def /x exch def} def
/side {[w .77 mul w .23 mul] .385 w mul sd w 0 l currentpoint t -144 r} def
/mr {mp x y w2 0 360 arc} def /m24 {mr s} def /m20 {mr f} def
/mb {mp x y w2 add m w2 neg 0 d 0 w neg d w 0 d 0 w d cl} def
/mt {mp x y w2 add m w2 neg w neg d w 0 d cl} def
/m21 {mb f} def /m25 {mb s} def /m22 {mt f} def /m26{mt s} def
/m23 {mp x y w2 sub m w2 w d w neg 0 d cl f} def
/m27 {mp x y w2 add m w3 neg w2 neg d w3 w2 neg d w3 w2 d cl s} def
/m28 {mp x w2 sub y w2 sub w3 add m w3 0 d  0 w3 neg d w3 0 d 0 w3 d w3 0 d  0 w3 d w3 neg 0 d 0 w3 d w3 neg 0 d 0 w3 neg d w3 neg 0 d cl s } def
/m29 {mp gsave x w2 sub y w2 add w3 sub m currentpoint t 4 {side} repeat cl fill gr} def
/m30 {mp gsave x w2 sub y w2 add w3 sub m currentpoint t 4 {side} repeat cl s gr} def
/m31 {mp x y w2 sub m 0 w d x w2 sub y m w 0 d x w2 sub y w2 add m w w neg d x w2 sub y w2 sub m w w d s} def
/m32 {mp x y w2 sub m w2 w d w neg 0 d cl s} def
/m33 {mp x y w2 add m w3 neg w2 neg d w3 w2 neg d w3 w2 d cl f} def
/m34 {mp x w2 sub y w2 sub w3 add m w3 0 d  0 w3 neg d w3 0 d 0 w3 d w3 0 d  0 w3 d w3 neg 0 d 0 w3 d w3 neg 0 d 0 w3 neg d w3 neg 0 d cl f } def
/m2 {mp x y w2 sub m 0 w d x w2 sub y m w 0 d s} def
/m5 {mp x w2 sub y w2 sub m w w d x w2 sub y w2 add m w w neg d s} def
/reEncode {exch findfont dup length dict begin {1 index /FID eq  {pop pop} {def} ifelse } forall /Encoding exch def currentdict end dup /FontName get exch definefont pop } def [/Times-Bold /Times-Italic /Times-BoldItalic /Helvetica /Helvetica-Oblique
 /Helvetica-Bold /Helvetica-BoldOblique /Courier /Courier-Oblique /Courier-Bold /Courier-BoldOblique /Times-Roman /AvantGarde-Book /AvantGarde-BookOblique /AvantGarde-Demi /AvantGarde-DemiOblique /Bookman-Demi /Bookman-DemiItalic /Bookman-Light
 /Bookman-LightItalic /Helvetica-Narrow /Helvetica-Narrow-Bold /Helvetica-Narrow-BoldOblique /Helvetica-Narrow-Oblique /NewCenturySchlbk-Roman /NewCenturySchlbk-Bold /NewCenturySchlbk-BoldItalic /NewCenturySchlbk-Italic /Palatino-Bold
 /Palatino-BoldItalic /Palatino-Italic /Palatino-Roman ] {ISOLatin1Encoding reEncode } forall%%EndProlog
%%BeginSetup
%%EndSetup
newpath  gsave  .25 .25 scale  gsave  0 0 t black[  ] 0 sd 3 lw 1 1 1 c 2268 1364 0 0 bf black 1 1 1 c 1791 1078 363 218 bf black 1791 1078 363 218 bl 1 1 1 c 1791 1078 363 218 bf black 1791 1078 363 218 bl 363 218 m 1791 X s[ 4 8] 0 sd 475 1296 m
 -1078 Y s 755 1296 m -1078 Y s 1035 1296 m -1078 Y s 1315 1296 m -1078 Y s 1594 1296 m -1078 Y s 1874 1296 m -1078 Y s 2154 1296 m -1078 Y s 475 1296 m -1078 Y s[  ] 0 sd 363 1296 m 1791 X s 363 218 m 1078 Y s[ 4 8] 0 sd 2154 218 m -1791 X s 2154
 404 m -1791 X s 2154 590 m -1791 X s 2154 775 m -1791 X s 2154 961 m -1791 X s 2154 1147 m -1791 X s 2154 1147 m -1791 X s[  ] 0 sd 2154 218 m 1078 Y s 1 0 0 c 6 lw 1 1 1 c black 1 0 0 c 363 958 m 56 X 113 Y 56 X 73 Y 56 X 26 Y 56 X 43 Y 56 X 12 Y
 56 X 20 Y 56 X -31 Y 56 X -31 Y 56 X -35 Y 56 X -63 Y 56 X -72 Y 56 X -53 Y 56 X -79 Y 56 X -64 Y 56 X -56 Y 56 X -60 Y 56 X -60 Y 56 X -63 Y 56 X -39 Y 56 X -59 Y 56 X -41 Y 55 X -35 Y 56 X -43 Y 56 X -34 Y 56 X -18 Y 56 X -25 Y 56 X -23 Y 56 X -14
 Y 56 X -10 Y 56 X -5 Y 56 X -6 Y 56 X s black 3 lw 363 218 m 1791 X s
 gsave  2268 1364 0 0 C 1929.57 76.4184 t 0 r /Helvetica findfont 76.4184 sf 0 0 m ( \(GeV\)) show NC gr 
 gsave  2268 1364 0 0 C 1920.01 53.4929 t 0 r /Helvetica findfont 51.5824 sf 0 0 m (l) show NC gr 
 gsave  2268 1364 0 0 C 1822.58 76.4184 t 0 r /Helvetica findfont 76.4184 sf 0 0 m (PT) show NC gr  475 251 m -33 Y s 531 234 m -16 Y s 587 234 m -16 Y s 643 234 m -16 Y s 699 234 m -16 Y s 755 251 m -33 Y s 811 234 m -16 Y s 867 234 m -16 Y s 923
 234 m -16 Y s 979 234 m -16 Y s 1035 251 m -33 Y s 1091 234 m -16 Y s 1147 234 m -16 Y s 1203 234 m -16 Y s 1259 234 m -16 Y s 1315 251 m -33 Y s 1371 234 m -16 Y s 1427 234 m -16 Y s 1483 234 m -16 Y s 1539 234 m -16 Y s 1594 251 m -33 Y s 1650 234
 m -16 Y s 1706 234 m -16 Y s 1762 234 m -16 Y s 1818 234 m -16 Y s 1874 251 m -33 Y s 1930 234 m -16 Y s 1986 234 m -16 Y s 2042 234 m -16 Y s 2098 234 m -16 Y s 2154 251 m -33 Y s 475 251 m -33 Y s 419 234 m -16 Y s
 gsave  2268 1364 0 0 C 439.406 158.568 t 0 r /Helvetica findfont 63.0452 sf 0 0 m (50) show NC gr 
 gsave  2268 1364 0 0 C 703.049 158.568 t 0 r /Helvetica findfont 63.0452 sf 0 0 m (100) show NC gr 
 gsave  2268 1364 0 0 C 981.977 158.568 t 0 r /Helvetica findfont 63.0452 sf 0 0 m (150) show NC gr 
 gsave  2268 1364 0 0 C 1262.81 158.568 t 0 r /Helvetica findfont 63.0452 sf 0 0 m (200) show NC gr 
 gsave  2268 1364 0 0 C 1541.74 158.568 t 0 r /Helvetica findfont 63.0452 sf 0 0 m (250) show NC gr 
 gsave  2268 1364 0 0 C 1822.58 158.568 t 0 r /Helvetica findfont 63.0452 sf 0 0 m (300) show NC gr 
 gsave  2268 1364 0 0 C 2101.51 158.568 t 0 r /Helvetica findfont 63.0452 sf 0 0 m (350) show NC gr  363 1296 m 1791 X s 475 1264 m 32 Y s 531 1280 m 16 Y s 587 1280 m 16 Y s 643 1280 m 16 Y s 699 1280 m 16 Y s 755 1264 m 32 Y s 811 1280 m 16 Y s 867
 1280 m 16 Y s 923 1280 m 16 Y s 979 1280 m 16 Y s 1035 1264 m 32 Y s 1091 1280 m 16 Y s 1147 1280 m 16 Y s 1203 1280 m 16 Y s 1259 1280 m 16 Y s 1315 1264 m 32 Y s 1371 1280 m 16 Y s 1427 1280 m 16 Y s 1483 1280 m 16 Y s 1539 1280 m 16 Y s 1594 1264
 m 32 Y s 1650 1280 m 16 Y s 1706 1280 m 16 Y s 1762 1280 m 16 Y s 1818 1280 m 16 Y s 1874 1264 m 32 Y s 1930 1280 m 16 Y s 1986 1280 m 16 Y s 2042 1280 m 16 Y s 2098 1280 m 16 Y s 2154 1264 m 32 Y s 475 1264 m 32 Y s 419 1280 m 16 Y s 363 218 m 1078
 Y s
 gsave  2268 1364 0 0 C 164.3 1018.28 t 90 r /Helvetica findfont 76.4184 sf 0 0 m ( \(pb/bin\)) show NC gr 
 gsave  2268 1364 0 0 C 189.136 1008.72 t 90 r /Helvetica findfont 51.5824 sf 0 0 m (l) show NC gr 
 gsave  2268 1364 0 0 C 164.3 848.244 t 90 r /Helvetica findfont 76.4184 sf 0 0 m (/dPT) show NC gr 
 gsave  2268 1364 0 0 C 164.3 802.393 t 90 r /Symbol findfont 76.4184 sf 0 0 m (s) show NC gr 
 gsave  2268 1364 0 0 C 164.3 764.184 t 90 r /Helvetica findfont 76.4184 sf 0 0 m (d) show NC gr  417 218 m -54 X s 390 265 m -27 X s 390 311 m -27 X s 390 357 m -27 X s 417 404 m -54 X s 390 450 m -27 X s 390 497 m -27 X s 390 543 m -27 X s 417 590
 m -54 X s 390 636 m -27 X s 390 682 m -27 X s 390 729 m -27 X s 417 775 m -54 X s 390 822 m -27 X s 390 868 m -27 X s 390 914 m -27 X s 417 961 m -54 X s 390 1007 m -27 X s 390 1054 m -27 X s 390 1100 m -27 X s 417 1147 m -54 X s 417 1147 m -54 X s
 390 1193 m -27 X s 390 1239 m -27 X s 390 1286 m -27 X s
 gsave  2268 1364 0 0 C 322.868 200.598 t 0 r /Helvetica findfont 51.5824 sf 0 0 m (0) show NC gr 
 gsave  2268 1364 0 0 C 221.613 385.913 t 0 r /Helvetica findfont 51.5824 sf 0 0 m (0.002) show NC gr 
 gsave  2268 1364 0 0 C 221.613 571.228 t 0 r /Helvetica findfont 51.5824 sf 0 0 m (0.004) show NC gr 
 gsave  2268 1364 0 0 C 221.613 756.542 t 0 r /Helvetica findfont 51.5824 sf 0 0 m (0.006) show NC gr 
 gsave  2268 1364 0 0 C 221.613 941.857 t 0 r /Helvetica findfont 51.5824 sf 0 0 m (0.008) show NC gr 
 gsave  2268 1364 0 0 C 257.912 1129.08 t 0 r /Helvetica findfont 51.5824 sf 0 0 m (0.01) show NC gr  2154 218 m 1078 Y s 2101 218 m 53 X s 2127 265 m 27 X s 2127 311 m 27 X s 2127 357 m 27 X s 2101 404 m 53 X s 2127 450 m 27 X s 2127 497 m 27 X s
 2127 543 m 27 X s 2101 590 m 53 X s 2127 636 m 27 X s 2127 682 m 27 X s 2127 729 m 27 X s 2101 775 m 53 X s 2127 822 m 27 X s 2127 868 m 27 X s 2127 914 m 27 X s 2101 961 m 53 X s 2127 1007 m 27 X s 2127 1054 m 27 X s 2127 1100 m 27 X s 2101 1147 m
 53 X s 2101 1147 m 53 X s 2127 1193 m 27 X s 2127 1239 m 27 X s 2127 1286 m 27 X s 1 1 0 c black 1 1 0 c 363 606 m 28 388 d 56 120 d 56 40 d 56 70 d 56 33 d 56 -3 d 56 -19 d 56 -6 d 56 -48 d 56 -43 d 56 -59 d 56 -61 d 56 -55 d 56 -71 d 56 -55 d 56
 -67 d 56 -70 d 56 -52 d 56 -60 d 56 -54 d 56 -46 d 55 -46 d 56 -38 d 56 -32 d 56 -31 d 56 -25 d 56 -23 d 56 -18 d 56 -16 d 56 -13 d 56 -8 d 56 -6 d 28 -2 d -5 Y -28 1 d -56 5 d -56 7 d -56 10 d -56 15 d -56 17 d -56 23 d -56 27 d -56 34 d -56 33 d
 -56 45 d -55 39 d -56 39 d -56 44 d -56 48 d -56 40 d -56 50 d -56 53 d -56 39 d -56 50 d -56 34 d -56 41 d -56 38 d -56 21 d -56 29 d -56 -3 d -56 4 d -56 -7 d -56 -35 d -56 -55 d -56 -44 d -56 -90 d -28 -279 d f 1 0 0 c 6 lw 1 1 1 c black 1 0 0 c
 363 958 m 56 X 113 Y 56 X 73 Y 56 X 26 Y 56 X 43 Y 56 X 12 Y 56 X 20 Y 56 X -31 Y 56 X -31 Y 56 X -35 Y 56 X -63 Y 56 X -72 Y 56 X -53 Y 56 X -79 Y 56 X -64 Y 56 X -56 Y 56 X -60 Y 56 X -60 Y 56 X -63 Y 56 X -39 Y 56 X -59 Y 56 X -41 Y 55 X -35 Y 56
 X -43 Y 56 X -34 Y 56 X -18 Y 56 X -25 Y 56 X -23 Y 56 X -14 Y 56 X -10 Y 56 X -5 Y 56 X -6 Y 56 X s 0 0 1 c 1 1 1 c black 0 0 1 c 363 576 m 56 X 62 Y 56 X 49 Y 56 X 41 Y 56 X 38 Y 56 X 17 Y 56 X 11 Y 56 X 14 Y 56 X -13 Y 112 X -19 Y 56 X -22 Y 56 X
 -15 Y 56 X -32 Y 56 X -25 Y 56 X -40 Y 56 X -34 Y 56 X -29 Y 56 X -38 Y 56 X -34 Y 56 X -33 Y 56 X -34 Y 55 X -33 Y 56 X -29 Y 56 X -30 Y 56 X -23 Y 56 X -23 Y 56 X -19 Y 56 X -16 Y 56 X -15 Y 56 X -9 Y 56 X -7 Y 56 X s black 3 lw 1 1 1 c 899 273
 1183 955 bf black 1183 955 m 899 X s 2082 955 m 273 Y s 2082 1228 m -899 X s 1183 1228 m -273 Y s
 gsave  2268 1364 0 0 C 1406.1 1173.02 t 0 r /Times-Bold findfont 40.1197 sf 0 0 m (\(1+R2\)*\(MCFM S700\): Uncertainty) show NC gr  1 1 0 c 1216 1151 m 158 X 64 Y -158 X f black 1216 1215 m 158 X s 1216 1151 m 158 X s 1374 1151 m 64 Y s 1216 1151 m
 64 Y s
 gsave  2268 1364 0 0 C 1406.1 1081.32 t 0 r /Times-Bold findfont 40.1197 sf 0 0 m (MCFM \(S+I\)700) show NC gr  1 0 0 c 6 lw 1216 1092 m 158 X s black
 gsave  2268 1364 0 0 C 1406.1 985.798 t 0 r /Times-Bold findfont 40.1197 sf 0 0 m (MCFM S700) show NC gr  0 0 1 c 1216 1001 m 158 X s black
 gsave  2268 1364 0 0 C 2221.87 989.619 t 90 r /Helvetica-BoldOblique findfont 24.836 sf 0 0 m (LHC HIGGS XS WG 2013) show NC gr 
 gr  gr showpage
end
%%EOF
