%!PS-Adobe-2.0 EPSF-2.0
%%BoundingBox:  0 0 567 544
%%Title: HWW_600_Mll_reweighting_cut_YR3.eps: HWW 600Gev Mll reweighting for interference with cuts
%%Creator: ROOT Version 5.34/05
%%CreationDate: Fri Jun 14 04:56:11 2013
%%EndComments
%%BeginProlog
80 dict begin
/s {stroke} def /l {lineto} def /m {moveto} def /t {translate} def
/r {rotate} def /rl {roll}  def /R {repeat} def
/d {rlineto} def /rm {rmoveto} def /gr {grestore} def /f {eofill} def
/c {setrgbcolor} def /black {0 setgray} def /sd {setdash} def
/cl {closepath} def /sf {scalefont setfont} def /lw {setlinewidth} def
/box {m dup 0 exch d exch 0 d 0 exch neg d cl} def
/NC{systemdict begin initclip end}def/C{NC box clip newpath}def
/bl {box s} def /bf {box f} def /Y { 0 exch d} def /X { 0 d} def 
/K {{pop pop 0 moveto} exch kshow} bind def
/ita {/ang 15 def gsave [1 0 ang dup sin exch cos div 1 0 0] concat} def 
/mp {newpath /y exch def /x exch def} def
/side {[w .77 mul w .23 mul] .385 w mul sd w 0 l currentpoint t -144 r} def
/mr {mp x y w2 0 360 arc} def /m24 {mr s} def /m20 {mr f} def
/mb {mp x y w2 add m w2 neg 0 d 0 w neg d w 0 d 0 w d cl} def
/mt {mp x y w2 add m w2 neg w neg d w 0 d cl} def
/m21 {mb f} def /m25 {mb s} def /m22 {mt f} def /m26{mt s} def
/m23 {mp x y w2 sub m w2 w d w neg 0 d cl f} def
/m27 {mp x y w2 add m w3 neg w2 neg d w3 w2 neg d w3 w2 d cl s} def
/m28 {mp x w2 sub y w2 sub w3 add m w3 0 d  0 w3 neg d w3 0 d 0 w3 d w3 0 d  0 w3 d w3 neg 0 d 0 w3 d w3 neg 0 d 0 w3 neg d w3 neg 0 d cl s } def
/m29 {mp gsave x w2 sub y w2 add w3 sub m currentpoint t 4 {side} repeat cl fill gr} def
/m30 {mp gsave x w2 sub y w2 add w3 sub m currentpoint t 4 {side} repeat cl s gr} def
/m31 {mp x y w2 sub m 0 w d x w2 sub y m w 0 d x w2 sub y w2 add m w w neg d x w2 sub y w2 sub m w w d s} def
/m32 {mp x y w2 sub m w2 w d w neg 0 d cl s} def
/m33 {mp x y w2 add m w3 neg w2 neg d w3 w2 neg d w3 w2 d cl f} def
/m34 {mp x w2 sub y w2 sub w3 add m w3 0 d  0 w3 neg d w3 0 d 0 w3 d w3 0 d  0 w3 d w3 neg 0 d 0 w3 d w3 neg 0 d 0 w3 neg d w3 neg 0 d cl f } def
/m2 {mp x y w2 sub m 0 w d x w2 sub y m w 0 d s} def
/m5 {mp x w2 sub y w2 sub m w w d x w2 sub y w2 add m w w neg d s} def
/reEncode {exch findfont dup length dict begin {1 index /FID eq  {pop pop} {def} ifelse } forall /Encoding exch def currentdict end dup /FontName get exch definefont pop } def [/Times-Bold /Times-Italic /Times-BoldItalic /Helvetica /Helvetica-Oblique
 /Helvetica-Bold /Helvetica-BoldOblique /Courier /Courier-Oblique /Courier-Bold /Courier-BoldOblique /Times-Roman /AvantGarde-Book /AvantGarde-BookOblique /AvantGarde-Demi /AvantGarde-DemiOblique /Bookman-Demi /Bookman-DemiItalic /Bookman-Light
 /Bookman-LightItalic /Helvetica-Narrow /Helvetica-Narrow-Bold /Helvetica-Narrow-BoldOblique /Helvetica-Narrow-Oblique /NewCenturySchlbk-Roman /NewCenturySchlbk-Bold /NewCenturySchlbk-BoldItalic /NewCenturySchlbk-Italic /Palatino-Bold
 /Palatino-BoldItalic /Palatino-Italic /Palatino-Roman ] {ISOLatin1Encoding reEncode } forall
%%EndProlog
%%BeginSetup
%%EndSetup
newpath  gsave  .25 .25 scale  gsave  0 0 t black[  ] 0 sd 3 lw 1 1 1 c 2268 2177 0 0 bf black 1 1 1 c 2268 1568 0 609 bf black 1 1 1 c 1814 1411 227 609 bf black 1814 1411 227 609 bl 0 0 1 c 1 1 1 c 0 0 1 c 227 682 m 4 X 11 Y 5 X 9 Y 4 X 8 Y 5 X 9 Y
 4 X 11 Y 5 X 13 Y 5 X 11 Y 4 X 7 Y 5 X 9 Y 4 X 10 Y 5 X 3 Y 4 X 18 Y 5 X -3 Y 4 X 15 Y 5 X 8 Y 4 X 7 Y 5 X 11 Y 4 X 9 Y 5 X 5 Y 4 X 17 Y 5 X 11 Y 5 X 3 Y 4 X 9 Y 5 X 3 Y 4 X 18 Y 5 X 9 Y 4 X 13 Y 5 X 6 Y 4 X 6 Y 5 X 20 Y 4 X 11 Y 5 X 23 Y 4 X 6 Y 5
 X 14 Y 5 X 9 Y 4 X 8 Y 5 X 31 Y 4 X 12 Y 5 X 13 Y 4 X 23 Y 5 X 7 Y 4 X 20 Y 5 X 17 Y 4 X 15 Y 5 X 22 Y 4 X 16 Y 5 X 13 Y 4 X 23 Y 5 X 23 Y 5 X 14 Y 4 X 12 Y 5 X 31 Y 4 X 10 Y 5 X 17 Y 4 X 16 Y 5 X 31 Y 4 X -5 Y 5 X 15 Y 4 X 32 Y 5 X 12 Y 4 X 23 Y 5
 X 19 Y 5 X 10 Y 4 X 13 Y 5 X 16 Y 4 X 39 Y 5 X -1 Y 4 X 9 Y 5 X 20 Y 4 X 4 Y 5 X 35 Y 4 X 8 Y 5 X 11 Y 4 X 14 Y 5 X 33 Y 4 X 5 Y 5 X 15 Y 5 X -9 Y 4 X 22 Y 5 X 10 Y 4 X 17 Y 5 X 11 Y 4 X 15 Y 5 X 2 Y 4 X 8 Y 5 X 1 Y 4 X 26 Y 5 X 7 Y 4 X 4 Y 5 X -12
 Y 4 X 15 Y 5 X 21 Y 5 X -17 Y 4 X 43 Y 5 X -24 Y 4 X 25 Y 5 X 9 Y 4 X -22 Y 5 X 31 Y 4 X -8 Y 5 X 15 Y 4 X -5 Y 5 X -8 Y 4 X 9 Y 5 X 6 Y 5 X -7 Y 9 X 11 Y 4 X 19 Y 5 X -17 Y 4 X 4 Y 5 X 19 Y 4 X -36 Y 5 X 4 Y 4 X -5 Y 5 X -3 Y 4 X 22 Y 5 X -20 Y 4 X
 -6 Y 5 X 5 Y 5 X -7 Y 4 X 1 Y 5 X -10 Y 4 X -26 Y 5 X 5 Y 4 X 15 Y 5 X -21 Y 9 X 5 Y 4 X 8 Y 5 X -28 Y 4 X -18 Y 5 X 7 Y 5 X -13 Y 4 X -14 Y 5 X -4 Y 4 X -18 Y 5 X -4 Y 4 X -2 Y 5 X -3 Y 4 X -32 Y 5 X -12 Y 4 X 6 Y 5 X -28 Y 4 X 7 Y 5 X -16 Y 4 X
 -14 Y 5 X -12 Y 5 X 11 Y 4 X -40 Y 5 X 16 Y 4 X -31 Y 5 X -2 Y 4 X -7 Y 5 X -18 Y 4 X -5 Y 5 X -15 Y 4 X -6 Y 5 X -15 Y 4 X -25 Y 5 X 3 Y 5 X -34 Y 4 X 3 Y 5 X -12 Y 4 X -20 Y 5 X -1 Y 4 X -28 Y 5 X -4 Y 4 X -17 Y 5 X -16 Y 4 X -1 Y 5 X -32 Y 4 X -9
 Y 5 X -7 Y 4 X -9 Y 5 X -12 Y 5 X -15 Y 4 X -14 Y 5 X 4 Y 4 X -15 Y 5 X -19 Y 4 X -12 Y 5 X -19 Y 4 X 4 Y 5 X -30 Y 4 X -15 Y 5 X -10 Y 4 X -6 Y 5 X -11 Y 5 X -14 Y 4 X -18 Y 5 X -6 Y 4 X -8 Y 5 X -15 Y 4 X -10 Y 5 X -12 Y 4 X -13 Y 5 X -6 Y 4 X -15
 Y 5 X -7 Y 9 X -25 Y 4 X -2 Y 5 X -9 Y 5 X -23 Y 4 X -3 Y 5 X -8 Y 4 X -14 Y 5 X 2 Y 4 X -17 Y 5 X -16 Y 4 X 5 Y 5 X -13 Y 4 X -18 Y 5 X -1 Y 4 X -1 Y 5 X -19 Y 4 X 3 Y 5 X -17 Y 5 X -7 Y 4 X -7 Y 5 X -11 Y 4 X -5 Y 5 X -11 Y 4 X -1 Y 5 X -4 Y 4 X
 -14 Y 5 X -3 Y 4 X -5 Y 5 X -8 Y 4 X -2 Y 5 X -6 Y 5 X -11 Y 4 X -9 Y 9 X -10 Y 5 X 1 Y 4 X -6 Y 5 X -6 Y 4 X -2 Y 5 X -5 Y 4 X -5 Y 5 X -1 Y 4 X -6 Y 5 X -7 Y 4 X 3 Y 5 X -7 Y 5 X -6 Y 4 X -2 Y 5 X -2 Y 4 X 1 Y 5 X -8 Y 9 X -3 Y 4 X -3 Y 5 X -4 Y 4
 X 2 Y 5 X -6 Y 4 X -2 Y 10 X -2 Y 4 X -4 Y 5 X -2 Y 9 X -2 Y 9 X -3 Y 4 X -2 Y 5 X 1 Y 4 X -2 Y 5 X -3 Y 4 X 2 Y 5 X -4 Y 9 X 1 Y 5 X -2 Y 4 X -3 Y 5 X 1 Y 9 X -1 Y 4 X -1 Y 5 X -1 Y 4 X 2 Y 5 X -2 Y 9 X -1 Y 14 X -1 Y 13 X -1 Y 5 X -1 Y 4 X -1 Y 5
 X 1 Y 4 X 1 Y 5 X -2 Y 4 X 1 Y 18 X -1 Y 5 X 1 Y 5 X -2 Y 4 X 2 Y 5 X -2 Y 4 X 1 Y 5 X 1 Y 4 X -1 Y 5 X -1 Y 4 X -1 Y 5 X 2 Y 4 X -1 Y 9 X 2 Y 5 X -1 Y 9 X -1 Y 27 X -1 Y 5 X 1 Y 9 X 1 Y 4 X -1 Y 9 X 1 Y 5 X -2 Y 5 X 1 Y 36 X 1 Y 4 X -1 Y 55 X 1 Y
 13 X 1 Y 5 X -2 Y 4 X 2 Y 10 X -2 Y 9 X 1 Y 4 X -1 Y 5 X 1 Y 4 X -1 Y 5 X 1 Y 13 X 1 Y 5 X -1 Y 4 X -1 Y 5 X 1 Y 41 X 1 Y 4 X -1 Y 9 X 1 Y 5 X -1 Y 9 X 1 Y 5 X -1 Y 18 X 1 Y 4 X -1 Y 9 X 1 Y 9 X -1 Y 5 X 1 Y 9 X s black 227 609 m 1814 X s 227 647 m
 -38 Y s 272 628 m -19 Y s 317 628 m -19 Y s 363 628 m -19 Y s 408 628 m -19 Y s 454 647 m -38 Y s 499 628 m -19 Y s 544 628 m -19 Y s 590 628 m -19 Y s 635 628 m -19 Y s 680 647 m -38 Y s 726 628 m -19 Y s 771 628 m -19 Y s 816 628 m -19 Y s 862 628
 m -19 Y s 907 647 m -38 Y s 952 628 m -19 Y s 998 628 m -19 Y s 1043 628 m -19 Y s 1089 628 m -19 Y s 1134 647 m -38 Y s 1179 628 m -19 Y s 1225 628 m -19 Y s 1270 628 m -19 Y s 1315 628 m -19 Y s 1361 647 m -38 Y s 1406 628 m -19 Y s 1451 628 m -19
 Y s 1497 628 m -19 Y s 1542 628 m -19 Y s 1587 647 m -38 Y s 1633 628 m -19 Y s 1678 628 m -19 Y s 1723 628 m -19 Y s 1769 628 m -19 Y s 1814 647 m -38 Y s 1860 628 m -19 Y s 1905 628 m -19 Y s 1950 628 m -19 Y s 1996 628 m -19 Y s 2041 647 m -38 Y
 s
 gsave  2268 1568 0 609 C 208.919 558.382 t 0 r /Helvetica findfont 49.4479 sf 0 0 m (0) show NC gr 
 gsave  2268 1568 0 609 C 410.24 558.382 t 0 r /Helvetica findfont 49.4479 sf 0 0 m (100) show NC gr 
 gsave  2268 1568 0 609 C 638.151 558.382 t 0 r /Helvetica findfont 49.4479 sf 0 0 m (200) show NC gr 
 gsave  2268 1568 0 609 C 862.264 558.382 t 0 r /Helvetica findfont 49.4479 sf 0 0 m (300) show NC gr 
 gsave  2268 1568 0 609 C 1090.18 558.382 t 0 r /Helvetica findfont 49.4479 sf 0 0 m (400) show NC gr 
 gsave  2268 1568 0 609 C 1318.09 558.382 t 0 r /Helvetica findfont 49.4479 sf 0 0 m (500) show NC gr 
 gsave  2268 1568 0 609 C 1542.2 558.382 t 0 r /Helvetica findfont 49.4479 sf 0 0 m (600) show NC gr 
 gsave  2268 1568 0 609 C 1770.11 558.382 t 0 r /Helvetica findfont 49.4479 sf 0 0 m (700) show NC gr 
 gsave  2268 1568 0 609 C 1998.02 558.382 t 0 r /Helvetica findfont 49.4479 sf 0 0 m (800) show NC gr  227 609 m 1411 Y s
 gsave  2268 1568 0 609 C 64.5748 1382.66 t 90 r /Helvetica findfont 34.2332 sf 0 0 m (ll) show NC gr 
 gsave  2268 1568 0 609 C 45.5822 1299.09 t 90 r /Helvetica findfont 49.4479 sf 0 0 m (/dM) show NC gr 
 gsave  2268 1568 0 609 C 45.5822 1268.71 t 90 r /Symbol findfont 49.4479 sf 0 0 m (s) show NC gr 
 gsave  2268 1568 0 609 C 45.5822 1242.12 t 90 r /Helvetica findfont 49.4479 sf 0 0 m (d) show NC gr  288 677 m -61 X s 257 722 m -30 X s 257 766 m -30 X s 257 810 m -30 X s 257 855 m -30 X s 288 899 m -61 X s 257 944 m -30 X s 257 988 m -30 X s 257
 1033 m -30 X s 257 1077 m -30 X s 288 1121 m -61 X s 257 1166 m -30 X s 257 1210 m -30 X s 257 1255 m -30 X s 257 1299 m -30 X s 288 1343 m -61 X s 257 1388 m -30 X s 257 1432 m -30 X s 257 1477 m -30 X s 257 1521 m -30 X s 288 1565 m -61 X s 257
 1610 m -30 X s 257 1654 m -30 X s 257 1699 m -30 X s 257 1743 m -30 X s 288 1787 m -61 X s 257 1832 m -30 X s 257 1876 m -30 X s 257 1921 m -30 X s 257 1965 m -30 X s 288 2009 m -61 X s 288 677 m -61 X s 257 633 m -30 X s 288 2009 m -61 X s
 gsave  2268 1568 0 609 C 186.127 660.943 t 0 r /Helvetica findfont 49.4479 sf 0 0 m (0) show NC gr 
 gsave  2268 1568 0 609 C 98.7615 881.257 t 0 r /Helvetica findfont 49.4479 sf 0 0 m (0.001) show NC gr 
 gsave  2268 1568 0 609 C 91.1645 1105.37 t 0 r /Helvetica findfont 49.4479 sf 0 0 m (0.002) show NC gr 
 gsave  2268 1568 0 609 C 91.1645 1325.68 t 0 r /Helvetica findfont 49.4479 sf 0 0 m (0.003) show NC gr 
 gsave  2268 1568 0 609 C 87.366 1549.8 t 0 r /Helvetica findfont 49.4479 sf 0 0 m (0.004) show NC gr 
 gsave  2268 1568 0 609 C 91.1645 1770.11 t 0 r /Helvetica findfont 49.4479 sf 0 0 m (0.005) show NC gr 
 gsave  2268 1568 0 609 C 91.1645 1994.22 t 0 r /Helvetica findfont 49.4479 sf 0 0 m (0.006) show NC gr  0 0 1 c /w 2 def /w2 {w 2 div} def /w3 {w 3 div} def 229 682 m20 234 693 m20 238 702 m20 243 710 m20 247 719 m20 252 730 m20 256 743 m20 261 754
 m20 265 761 m20 270 770 m20 274 780 m20 279 783 m20 283 801 m20 288 798 m20 293 813 m20 297 821 m20 302 828 m20 306 839 m20 311 848 m20 315 853 m20 320 870 m20 324 881 m20 329 884 m20 333 893 m20 338 896 m20 342 914 m20 347 923 m20 351 936 m20 356
 942 m20 361 948 m20 365 968 m20 370 979 m20 374 1002 m20 379 1008 m20 383 1022 m20 388 1031 m20 392 1039 m20 397 1070 m20 401 1082 m20 406 1095 m20 410 1118 m20 415 1125 m20 420 1145 m20 424 1162 m20 429 1177 m20 433 1199 m20 438 1215 m20 442 1228
 m20 447 1251 m20 451 1274 m20 456 1288 m20 460 1300 m20 465 1331 m20 469 1341 m20 474 1358 m20 478 1374 m20 483 1405 m20 488 1400 m20 492 1415 m20 497 1447 m20 501 1459 m20 506 1482 m20 510 1501 m20 515 1511 m20 519 1524 m20 524 1540 m20 528 1579
 m20 533 1578 m20 537 1587 m20 542 1607 m20 547 1611 m20 551 1646 m20 556 1654 m20 560 1665 m20 565 1679 m20 569 1712 m20 574 1717 m20 578 1732 m20 583 1723 m20 587 1745 m20 592 1755 m20 596 1772 m20 601 1783 m20 605 1798 m20 610 1800 m20 615 1808
 m20 619 1809 m20 624 1835 m20 628 1842 m20 633 1846 m20 637 1834 m20 642 1849 m20 646 1870 m20 651 1853 m20 655 1896 m20 660 1872 m20 664 1897 m20 669 1906 m20 674 1884 m20 678 1915 m20 683 1907 m20 687 1922 m20 692 1917 m20 696 1909 m20 701 1918
 m20 705 1924 m20 710 1917 m20 714 1917 m20 719 1928 m20 723 1947 m20 728 1930 m20 732 1934 m20 737 1953 m20 742 1917 m20 746 1921 m20 751 1916 m20 755 1913 m20 760 1935 m20 764 1915 m20 769 1909 m20 773 1914 m20 778 1907 m20 782 1908 m20 787 1898
 m20 791 1872 m20 796 1877 m20 801 1892 m20 805 1871 m20 810 1871 m20 814 1876 m20 819 1884 m20 823 1856 m20 828 1838 m20 832 1845 m20 837 1832 m20 841 1818 m20 846 1814 m20 850 1796 m20 855 1792 m20 859 1790 m20 864 1787 m20 869 1755 m20 873 1743
 m20 878 1749 m20 882 1721 m20 887 1728 m20 891 1712 m20 896 1698 m20 900 1686 m20 905 1697 m20 909 1657 m20 914 1673 m20 918 1642 m20 923 1640 m20 927 1633 m20 932 1615 m20 937 1610 m20 941 1595 m20 946 1589 m20 950 1574 m20 955 1549 m20 959 1552
 m20 964 1518 m20 968 1521 m20 973 1509 m20 977 1489 m20 982 1488 m20 986 1460 m20 991 1456 m20 996 1439 m20 1000 1423 m20 1005 1422 m20 1009 1390 m20 1014 1381 m20 1018 1374 m20 1023 1365 m20 1027 1353 m20 1032 1338 m20 1036 1324 m20 1041 1328 m20
 1045 1313 m20 1050 1294 m20 1054 1282 m20 1059 1263 m20 1064 1267 m20 1068 1237 m20 1073 1222 m20 1077 1212 m20 1082 1206 m20 1086 1195 m20 1091 1181 m20 1095 1163 m20 1100 1157 m20 1104 1149 m20 1109 1134 m20 1113 1124 m20 1118 1112 m20 1123 1099
 m20 1127 1093 m20 1132 1078 m20 1136 1071 m20 1141 1071 m20 1145 1046 m20 1150 1044 m20 1154 1035 m20 1159 1012 m20 1163 1009 m20 1168 1001 m20 1172 987 m20 1177 989 m20 1181 972 m20 1186 956 m20 1191 961 m20 1195 948 m20 1200 930 m20 1204 929 m20
 1209 928 m20 1213 909 m20 1218 912 m20 1222 895 m20 1227 888 m20 1231 881 m20 1236 870 m20 1240 865 m20 1245 854 m20 1250 853 m20 1254 849 m20 1259 835 m20 1263 832 m20 1268 827 m20 1272 819 m20 1277 817 m20 1281 811 m20 1286 800 m20 1290 791 m20
 1295 791 m20 1299 781 m20 1304 782 m20 1308 776 m20 1313 770 m20 1318 768 m20 1322 763 m20 1327 758 m20 1331 757 m20 1336 751 m20 1340 744 m20 1345 747 m20 1349 740 m20 1354 734 m20 1358 732 m20 1363 730 m20 1367 731 m20 1372 723 m20 1377 723 m20
 1381 720 m20 1386 717 m20 1390 713 m20 1395 715 m20 1399 709 m20 1404 707 m20 1408 707 m20 1413 705 m20 1417 701 m20 1422 699 m20 1426 699 m20 1431 697 m20 1435 697 m20 1440 694 m20 1445 692 m20 1449 693 m20 1454 691 m20 1458 688 m20 1463 690 m20
 1467 686 m20 1472 686 m20 1476 687 m20 1481 685 m20 1485 682 m20 1490 683 m20 1494 683 m20 1499 682 m20 1503 681 m20 1508 680 m20 1513 682 m20 1517 680 m20 1522 680 m20 1526 679 m20 1531 679 m20 1535 679 m20 1540 678 m20 1544 678 m20 1549 678 m20
 1553 677 m20 1558 676 m20 1562 675 m20 1567 676 m20 1572 677 m20 1576 675 m20 1581 676 m20 1585 676 m20 1590 676 m20 1594 676 m20 1599 675 m20 1603 676 m20 1608 674 m20 1612 676 m20 1617 674 m20 1621 675 m20 1626 676 m20 1630 675 m20 1635 674 m20
 1640 673 m20 1644 675 m20 1649 674 m20 1653 674 m20 1658 676 m20 1662 675 m20 1667 675 m20 1671 674 m20 1676 674 m20 1680 674 m20 1685 674 m20 1689 674 m20 1694 674 m20 1699 673 m20 1703 674 m20 1708 674 m20 1712 675 m20 1717 674 m20 1721 674 m20
 1726 675 m20 1730 673 m20 1735 674 m20 1739 674 m20 1744 674 m20 1748 674 m20 1753 674 m20 1757 674 m20 1762 674 m20 1767 674 m20 1771 675 m20 1776 674 m20 1780 674 m20 1785 674 m20 1789 674 m20 1794 674 m20 1798 674 m20 1803 674 m20 1807 674 m20
 1812 674 m20 1816 674 m20 1821 674 m20 1826 674 m20 1830 675 m20 1835 675 m20 1839 675 m20 1844 676 m20 1848 674 m20 1853 676 m20 1857 676 m20 1862 674 m20 1866 674 m20 1871 675 m20 1875 674 m20 1880 675 m20 1884 674 m20 1889 675 m20 1894 675 m20
 1898 675 m20 1903 676 m20 1907 675 m20 1912 674 m20 1916 675 m20 1921 675 m20 1925 675 m20 1930 675 m20 1934 675 m20 1939 675 m20 1943 675 m20 1948 675 m20 1953 675 m20 1957 676 m20 1962 675 m20 1966 675 m20 1971 676 m20 1975 675 m20 1980 675 m20
 1984 676 m20 1989 675 m20 1993 675 m20 1998 675 m20 2002 675 m20 2007 676 m20 2011 675 m20 2016 675 m20 2021 676 m20 2025 676 m20 2030 675 m20 2034 676 m20 2039 676 m20 black 0 0 1 c 1 lw << /PatternType 1 /PaintType 2 /TilingType 1 /BBox [ 0 0 100
 100 ] /XStep 100 /YStep 100 /PaintProc { begin gsave 0 0 m 100 100 l 0 100 m 100 0 l s gr end } >> [ 0.24 0 0 0.24 0 0 ] makepattern /P13 exch def /cs {[/Pattern /DeviceRGB] setcolorspace} def /FA {f [/DeviceRGB] setcolorspace} def cs 0 0 1 P13
 setcolor 229 683 m 5 11 d 4 10 d 5 8 d 4 10 d 5 11 d 4 13 d 5 11 d 4 8 d 5 9 d 4 10 d 5 2 d 4 19 d 5 -3 d 5 15 d 4 9 d 5 6 d 4 12 d 5 8 d 4 6 d 5 17 d 4 11 d 5 3 d 4 9 d 5 2 d 4 19 d 5 9 d 4 13 d 5 6 d 5 7 d 4 19 d 5 11 d 4 24 d 5 6 d 4 14 d 5 9 d 4
 7 d 5 32 d 4 12 d 5 13 d 4 23 d 5 7 d 5 20 d 4 17 d 5 15 d 4 22 d 5 17 d 4 12 d 5 23 d 4 24 d 5 14 d 4 12 d 5 31 d 4 10 d 5 17 d 4 16 d 5 32 d 5 -6 d 4 16 d 5 32 d 4 12 d 5 23 d 4 19 d 5 11 d 4 13 d 5 15 d 4 39 d 5 X 4 9 d 5 19 d 5 5 d 4 35 d 5 8 d
 4 11 d 5 14 d 4 34 d 5 4 d 4 15 d 5 -8 d 4 22 d 5 10 d 4 17 d 5 11 d 4 15 d 5 2 d 5 8 d 4 1 d 5 27 d 4 6 d 5 5 d 4 -12 d 5 15 d 4 21 d 5 -18 d 4 44 d 5 -24 d 4 25 d 5 9 d 5 -23 d 4 32 d 5 -8 d 4 15 d 5 -6 d 4 -7 d 5 9 d 4 6 d 5 -7 d 4 X 5 11 d 4 19
 d 5 -16 d 4 3 d 5 19 d 5 -35 d 4 3 d 5 -5 d 4 -3 d 5 23 d 4 -21 d 5 -6 d 4 5 d 5 -7 d 4 1 d 5 -10 d 4 -26 d 5 5 d 5 15 d 4 -21 d 5 X 4 5 d 5 8 d 4 -28 d 5 -19 d 4 8 d 5 -13 d 4 -14 d 5 -5 d 4 -18 d 5 -4 d 4 -2 d 5 -2 d 5 -33 d 4 -12 d 5 6 d 4 -27 d
 5 6 d 4 -16 d 5 -14 d 4 -12 d 5 11 d 4 -40 d 5 16 d 4 -31 d 5 -2 d 4 -7 d 5 -18 d 5 -5 d 4 -15 d 5 -6 d 4 -15 d 5 -26 d 4 3 d 5 -34 d 4 3 d 5 -12 d 4 -20 d 5 -2 d 4 -28 d 5 -3 d 5 -18 d 4 -15 d 5 -2 d 4 -32 d 5 -10 d 4 -6 d 5 -9 d 4 -12 d 5 -15 d 4
 -15 d 5 4 d 4 -15 d 5 -19 d 4 -12 d 5 -19 d 5 4 d 4 -30 d 5 -15 d 4 -11 d 5 -6 d 4 -10 d 5 -14 d 4 -18 d 5 -7 d 4 -8 d 5 -15 d 4 -10 d 5 -12 d 5 -14 d 4 -5 d 5 -15 d 4 -7 d 5 -1 d 4 -24 d 5 -3 d 4 -9 d 5 -23 d 4 -4 d 5 -7 d 4 -14 d 5 2 d 4 -18 d 5
 -16 d 5 5 d 4 -13 d 5 -18 d 4 -1 d 5 -1 d 4 -19 d 5 3 d 4 -17 d 5 -7 d 4 -7 d 5 -12 d 4 -4 d 5 -11 d 5 -1 d 4 -5 d 5 -14 d 4 -3 d 5 -5 d 4 -8 d 5 -3 d 4 -6 d 5 -10 d 4 -9 d 5 X 4 -10 d 5 X 4 -5 d 5 -7 d 5 -2 d 4 -4 d 5 -6 d 4 -1 d 5 -6 d 4 -7 d 5 3
 d 4 -7 d 5 -6 d 4 -2 d 5 -2 d 4 1 d 5 -8 d 5 -1 d 4 -2 d 5 -4 d 4 -4 d 5 2 d 4 -6 d 5 -2 d 4 X 5 -2 d 4 -3 d 5 -2 d 4 X 5 -3 d 4 X 5 -3 d 5 -2 d 4 1 d 5 -2 d 4 -3 d 5 2 d 4 -4 d 5 X 4 1 d 5 -2 d 4 -3 d 5 1 d 4 X 5 -1 d 4 -1 d 5 -1 d 5 2 d 4 -1 d 5
 -1 d 4 -1 d 9 X 5 -1 d 9 X 4 -1 d 5 -1 d 4 -1 d 5 1 d 5 X 4 -1 d 5 X 4 1 d 9 X 5 -1 d 4 1 d 5 -2 d 4 2 d 5 -2 d 4 1 d 9 X 5 -1 d 5 -1 d 4 1 d 9 X 5 1 d 4 -1 d 5 X 4 -1 d 5 1 d 18 X 5 -1 d 4 1 d 5 X 4 1 d 5 -1 d 4 X 5 1 d 4 -2 d 5 1 d 13 X 5 -1 d 4 1
 d 10 X 4 1 d 5 -1 d 4 -1 d 14 X 4 1 d 5 X 4 -1 d 5 1 d 4 X 5 -1 d 5 1 d 9 X 4 1 d 5 X 4 -1 d 5 1 d 4 X 5 -2 d 4 1 d 32 X 5 1 d 4 -1 d 23 X 4 1 d 5 -1 d 4 1 d 5 X 5 -1 d 4 1 d 14 X 4 -1 d 5 X 4 1 d 5 X 4 -1 d 5 1 d 4 -1 d 5 1 d 4 -1 d 5 1 d 23 X -1 Y
 -14 X -4 1 d -5 -1 d -9 X -5 -1 d -4 1 d -5 -1 d -4 1 d -9 X -5 -1 d -4 1 d -14 X -4 -1 d -5 1 d -5 X -4 -1 d -5 1 d -4 X -5 -1 d -4 1 d -5 -1 d -9 X -4 1 d -5 -1 d -4 X -5 1 d -5 -2 d -4 1 d -14 X -4 -1 d -5 2 d -4 1 d -5 -2 d -4 1 d -5 X -4 -1 d
 -9 X -5 -1 d -5 1 d -4 -1 d -5 X -4 1 d -5 X -4 -1 d -14 X -4 1 d -5 1 d -4 -2 d -5 1 d -5 X -4 -1 d -5 1 d -4 -1 d -5 X -4 1 d -5 -1 d -4 1 d -5 -1 d -4 1 d -5 1 d -4 -2 d -5 1 d -4 -1 d -10 X -4 1 d -5 -1 d -4 1 d -5 -1 d -4 1 d -5 X -4 1 d -5 -1
 d -9 X -4 -1 d -5 X -5 1 d -4 1 d -5 -1 d -4 X -5 2 d -4 -3 d -5 2 d -4 -1 d -5 1 d -4 X -5 1 d -4 -1 d -5 -1 d -4 2 d -5 -1 d -5 -1 d -4 1 d -5 1 d -4 1 d -9 X -5 1 d -9 X -4 1 d -5 X -4 2 d -5 -2 d -5 1 d -4 1 d -5 1 d -4 X -5 -1 d -4 3 d -5 2 d
 -4 -1 d -5 X -4 4 d -5 -2 d -4 3 d -5 2 d -4 -1 d -5 2 d -5 2 d -4 X -5 3 d -4 X -5 2 d -4 3 d -5 2 d -4 1 d -5 1 d -4 6 d -5 -2 d -4 4 d -5 4 d -4 2 d -5 1 d -5 8 d -4 -2 d -5 2 d -4 3 d -5 5 d -4 7 d -5 -3 d -4 7 d -5 6 d -4 1 d -5 5 d -4 5 d -5 2
 d -5 6 d -4 5 d -5 X -4 9 d -5 X -4 10 d -5 10 d -4 6 d -5 2 d -4 8 d -5 5 d -4 3 d -5 14 d -4 4 d -5 1 d -5 11 d -4 4 d -5 11 d -4 7 d -5 7 d -4 17 d -5 -3 d -4 18 d -5 2 d -4 X -5 18 d -4 14 d -5 -6 d -5 16 d -4 17 d -5 -1 d -4 13 d -5 8 d -4 3 d
 -5 23 d -4 9 d -5 2 d -4 24 d -5 1 d -4 7 d -5 15 d -4 5 d -5 13 d -5 12 d -4 10 d -5 14 d -4 9 d -5 6 d -4 18 d -5 14 d -4 10 d -5 6 d -4 11 d -5 14 d -4 30 d -5 -4 d -5 18 d -4 13 d -5 18 d -4 15 d -5 -4 d -4 14 d -5 16 d -4 11 d -5 10 d -4 6 d -5
 9 d -4 32 d -5 1 d -4 15 d -5 18 d -5 3 d -4 28 d -5 2 d -4 20 d -5 11 d -4 -3 d -5 33 d -4 -2 d -5 25 d -4 15 d -5 6 d -4 15 d -5 5 d -5 18 d -4 6 d -5 2 d -4 31 d -5 -16 d -4 40 d -5 -11 d -4 12 d -5 14 d -4 15 d -5 -6 d -4 28 d -5 -6 d -4 11 d -5
 33 d -5 2 d -4 2 d -5 4 d -4 18 d -5 4 d -4 14 d -5 14 d -4 -8 d -5 18 d -4 28 d -5 -8 d -4 -5 d -5 X -4 21 d -5 -15 d -5 -5 d -4 26 d -5 10 d -4 -1 d -5 7 d -4 -5 d -5 6 d -4 20 d -5 -22 d -4 3 d -5 5 d -4 -4 d -5 35 d -5 -18 d -4 -4 d -5 16 d -4
 -18 d -5 -11 d -4 X -5 7 d -4 -6 d -5 -8 d -4 7 d -5 5 d -4 -15 d -5 9 d -4 -32 d -5 22 d -5 -9 d -4 -24 d -5 23 d -4 -43 d -5 18 d -4 -21 d -5 -15 d -4 12 d -5 -4 d -4 -7 d -5 -26 d -4 -1 d -5 -8 d -5 -2 d -4 -15 d -5 -11 d -4 -17 d -5 -9 d -4 -22
 d -5 8 d -4 -15 d -5 -4 d -4 -33 d -5 -15 d -4 -10 d -5 -8 d -4 -34 d -5 -5 d -5 -19 d -4 -10 d -5 1 d -4 -39 d -5 -15 d -4 -13 d -5 -10 d -4 -19 d -5 -23 d -4 -12 d -5 -31 d -4 -16 d -5 5 d -5 -31 d -4 -16 d -5 -16 d -4 -11 d -5 -30 d -4 -12 d -5
 -14 d -4 -23 d -5 -23 d -4 -13 d -5 -16 d -4 -22 d -5 -14 d -4 -18 d -5 -19 d -5 -7 d -4 -23 d -5 -13 d -4 -12 d -5 -31 d -4 -8 d -5 -9 d -4 -13 d -5 -7 d -4 -23 d -5 -11 d -4 -19 d -5 -7 d -5 -6 d -4 -13 d -5 -9 d -4 -17 d -5 -3 d -4 -9 d -5 -3 d
 -4 -11 d -5 -16 d -4 -6 d -5 -8 d -4 -12 d -5 -6 d -4 -8 d -5 -15 d -5 3 d -4 -18 d -5 -2 d -4 -10 d -5 -9 d -4 -8 d -5 -10 d -4 -13 d -5 -10 d -4 -9 d -5 -8 d -4 -8 d -5 -11 d FA 3 lw 0.8 0 0 c 1 0 0 c 0.8 0 0 c 227 677 m 18 X 1 Y 23 X 1 Y 13 X 1 Y
 14 X 1 Y 9 X 2 Y 4 X 1 Y 5 X 1 Y 4 X 1 Y 5 X 3 Y 5 X 2 Y 4 X 2 Y 5 X 3 Y 4 X 3 Y 5 X 2 Y 4 X 4 Y 5 X 6 Y 4 X 5 Y 5 X 5 Y 4 X 7 Y 5 X 6 Y 4 X 6 Y 5 X 8 Y 5 X 10 Y 4 X 9 Y 5 X 9 Y 4 X 9 Y 5 X 12 Y 4 X 10 Y 5 X 13 Y 4 X 9 Y 5 X 17 Y 4 X 8 Y 5 X 12 Y 4
 X 16 Y 5 X 10 Y 4 X 21 Y 5 X 6 Y 5 X 15 Y 4 X 14 Y 5 X 19 Y 4 X 10 Y 5 X 12 Y 4 X 14 Y 5 X 12 Y 4 X 17 Y 5 X 14 Y 4 X 13 Y 5 X 17 Y 4 X 12 Y 5 X 8 Y 5 X 19 Y 4 X 16 Y 5 X 2 Y 4 X 15 Y 5 X 20 Y 4 X 7 Y 5 X 29 Y 4 X 7 Y 5 X 2 Y 4 X 13 Y 5 X 17 Y 4 X
 14 Y 5 X 13 Y 4 X 19 Y 5 X 11 Y 5 X 23 Y 4 X -2 Y 5 X 16 Y 4 X 18 Y 5 X 6 Y 4 X 11 Y 5 X 13 Y 4 X 9 Y 5 X 12 Y 4 X 10 Y 5 X 2 Y 4 X 7 Y 5 X 17 Y 4 X 11 Y 5 X 4 Y 5 X 22 Y 4 X 4 Y 5 X 7 Y 4 X 9 Y 5 X 2 Y 4 X 30 Y 5 X -4 Y 4 X -11 Y 5 X 27 Y 4 X -1 Y
 5 X 2 Y 4 X 18 Y 5 X 12 Y 5 X -18 Y 4 X 16 Y 5 X 9 Y 4 X -9 Y 5 X 20 Y 4 X 8 Y 5 X -18 Y 4 X 32 Y 5 X -18 Y 4 X 7 Y 5 X 5 Y 4 X 10 Y 9 X -4 Y 5 X 7 Y 5 X -6 Y 4 X 13 Y 5 X 11 Y 4 X -18 Y 5 X 4 Y 4 X -13 Y 5 X 15 Y 4 X -5 Y 5 X 3 Y 4 X 3 Y 5 X 1 Y 4
 X -8 Y 5 X -1 Y 5 X 7 Y 4 X -10 Y 5 X -5 Y 4 X -16 Y 5 X 8 Y 4 X -5 Y 5 X 9 Y 4 X -7 Y 5 X -25 Y 4 X 18 Y 5 X -8 Y 4 X 2 Y 5 X -3 Y 4 X -6 Y 5 X -17 Y 5 X 13 Y 4 X -11 Y 5 X -13 Y 4 X -1 Y 5 X -15 Y 4 X -6 Y 5 X -4 Y 4 X -2 Y 5 X 7 Y 4 X -36 Y 5 X
 -7 Y 4 X 6 Y 5 X -7 Y 5 X -16 Y 4 X -3 Y 5 X -6 Y 4 X -8 Y 5 X -13 Y 4 X 7 Y 5 X -1 Y 4 X -28 Y 5 X 7 Y 4 X -11 Y 5 X -8 Y 4 X -19 Y 5 X -11 Y 4 X 7 Y 5 X -19 Y 5 X -2 Y 4 X -16 Y 5 X -5 Y 4 X -21 Y 5 X -1 Y 4 X -15 Y 5 X 1 Y 4 X -16 Y 5 X -18 Y 4 X
 -4 Y 5 X -1 Y 4 X -18 Y 5 X -18 Y 5 X 11 Y 4 X -17 Y 5 X -5 Y 4 X -10 Y 5 X -6 Y 4 X -3 Y 5 X -16 Y 4 X -8 Y 5 X -21 Y 4 X -4 Y 5 X -12 Y 4 X -5 Y 5 X -9 Y 4 X 1 Y 5 X -23 Y 5 X -1 Y 4 X -22 Y 5 X 11 Y 4 X -24 Y 5 X -6 Y 4 X -11 Y 5 X -5 Y 4 X -8 Y
 5 X -11 Y 4 X -4 Y 5 X -4 Y 4 X -7 Y 5 X -23 Y 4 X -3 Y 5 X -1 Y 5 X -8 Y 4 X 1 Y 5 X -22 Y 4 X -3 Y 5 X -9 Y 4 X -11 Y 5 X 8 Y 4 X -19 Y 5 X -2 Y 4 X -5 Y 5 X -4 Y 4 X -9 Y 5 X -6 Y 5 X -9 Y 4 X -10 Y 5 X -2 Y 4 X -8 Y 5 X 2 Y 4 X -9 Y 5 X -10 Y 4
 X -2 Y 5 X -6 Y 4 X -1 Y 5 X -7 Y 4 X -5 Y 5 X -5 Y 4 X -6 Y 10 X -9 Y 4 X -1 Y 5 X -6 Y 4 X -5 Y 5 X -5 Y 4 X -5 Y 5 X -4 Y 4 X 2 Y 5 X -8 Y 4 X -4 Y 5 X -1 Y 9 X -7 Y 5 X -1 Y 4 X -4 Y 5 X -6 Y 9 X 2 Y 4 X -7 Y 9 X -2 Y 5 X -4 Y 4 X -5 Y 14 X -4 Y
 4 X -1 Y 5 X -2 Y 5 X -4 Y 9 X -2 Y 13 X 1 Y 5 X -6 Y 9 X -3 Y 9 X -2 Y 4 X 1 Y 10 X -4 Y 4 X -2 Y 5 X 2 Y 4 X -2 Y 5 X -2 Y 4 X -1 Y 5 X 3 Y 4 X -6 Y 5 X 3 Y 4 X -1 Y 5 X -2 Y 18 X -4 Y 5 X 2 Y 4 X -1 Y 5 X -2 Y 9 X -1 Y 4 X 2 Y 5 X -3 Y 9 X -1 Y 4
 X 1 Y 9 X -1 Y 10 X -1 Y 4 X 1 Y 5 X -2 Y 4 X -1 Y 5 X 1 Y 4 X -1 Y 9 X -1 Y 9 X -1 Y 9 X 2 Y 5 X -2 Y 14 X -1 Y 4 X -1 Y 9 X 1 Y 5 X -1 Y 9 X 1 Y 4 X -2 Y 5 X -1 Y 13 X -1 Y 5 X 1 Y 14 X -1 Y 4 X 1 Y 18 X -1 Y 5 X 1 Y 4 X -1 Y 5 X -1 Y 4 X 2 Y 5 X
 -1 Y 4 X -2 Y 10 X 2 Y 4 X -2 Y 5 X 1 Y 4 X -1 Y 18 X -1 Y 18 X -1 Y 5 X 2 Y 4 X -2 Y 5 X 1 Y 36 X -1 Y 18 X 1 Y 5 X -1 Y 5 X 2 Y 4 X -2 Y 32 X -1 Y 13 X 1 Y 5 X s 1 0 0 c 229 677 m20 234 677 m20 238 677 m20 243 677 m20 247 678 m20 252 678 m20 256
 678 m20 261 678 m20 265 678 m20 270 679 m20 274 679 m20 279 679 m20 283 680 m20 288 680 m20 293 680 m20 297 681 m20 302 681 m20 306 683 m20 311 684 m20 315 685 m20 320 686 m20 324 689 m20 329 691 m20 333 693 m20 338 696 m20 342 699 m20 347 701 m20
 351 705 m20 356 711 m20 361 716 m20 365 721 m20 370 728 m20 374 734 m20 379 740 m20 383 748 m20 388 758 m20 392 767 m20 397 776 m20 401 785 m20 406 797 m20 410 807 m20 415 820 m20 420 829 m20 424 846 m20 429 854 m20 433 866 m20 438 882 m20 442 892
 m20 447 913 m20 451 919 m20 456 934 m20 460 948 m20 465 967 m20 469 977 m20 474 989 m20 478 1003 m20 483 1015 m20 488 1032 m20 492 1046 m20 497 1059 m20 501 1076 m20 506 1088 m20 510 1096 m20 515 1115 m20 519 1131 m20 524 1133 m20 528 1148 m20 533
 1168 m20 537 1175 m20 542 1204 m20 547 1211 m20 551 1213 m20 556 1226 m20 560 1243 m20 565 1257 m20 569 1270 m20 574 1289 m20 578 1300 m20 583 1323 m20 587 1321 m20 592 1337 m20 596 1355 m20 601 1361 m20 605 1372 m20 610 1385 m20 615 1394 m20 619
 1406 m20 624 1416 m20 628 1418 m20 633 1425 m20 637 1442 m20 642 1453 m20 646 1457 m20 651 1479 m20 655 1483 m20 660 1490 m20 664 1499 m20 669 1501 m20 674 1531 m20 678 1527 m20 683 1516 m20 687 1543 m20 692 1542 m20 696 1544 m20 701 1562 m20 705
 1574 m20 710 1556 m20 714 1572 m20 719 1581 m20 723 1572 m20 728 1592 m20 732 1600 m20 737 1582 m20 742 1614 m20 746 1596 m20 751 1603 m20 755 1608 m20 760 1618 m20 764 1618 m20 769 1614 m20 773 1621 m20 778 1615 m20 782 1628 m20 787 1639 m20 791
 1621 m20 796 1625 m20 801 1612 m20 805 1627 m20 810 1622 m20 814 1625 m20 819 1628 m20 823 1629 m20 828 1621 m20 832 1620 m20 837 1627 m20 841 1617 m20 846 1612 m20 850 1596 m20 855 1604 m20 859 1599 m20 864 1608 m20 869 1601 m20 873 1576 m20 878
 1594 m20 882 1586 m20 887 1588 m20 891 1585 m20 896 1579 m20 900 1562 m20 905 1575 m20 909 1564 m20 914 1551 m20 918 1550 m20 923 1535 m20 927 1529 m20 932 1525 m20 937 1523 m20 941 1530 m20 946 1494 m20 950 1487 m20 955 1493 m20 959 1486 m20 964
 1470 m20 968 1467 m20 973 1461 m20 977 1453 m20 982 1440 m20 986 1447 m20 991 1446 m20 996 1418 m20 1000 1425 m20 1005 1414 m20 1009 1406 m20 1014 1387 m20 1018 1376 m20 1023 1383 m20 1027 1364 m20 1032 1362 m20 1036 1346 m20 1041 1341 m20 1045 1320
 m20 1050 1319 m20 1054 1304 m20 1059 1305 m20 1064 1289 m20 1068 1271 m20 1073 1267 m20 1077 1266 m20 1082 1248 m20 1086 1230 m20 1091 1241 m20 1095 1224 m20 1100 1219 m20 1104 1209 m20 1109 1203 m20 1113 1200 m20 1118 1184 m20 1123 1176 m20 1127
 1155 m20 1132 1151 m20 1136 1139 m20 1141 1134 m20 1145 1125 m20 1150 1126 m20 1154 1103 m20 1159 1102 m20 1163 1080 m20 1168 1091 m20 1172 1067 m20 1177 1061 m20 1181 1050 m20 1186 1045 m20 1191 1037 m20 1195 1026 m20 1200 1022 m20 1204 1018 m20
 1209 1011 m20 1213 988 m20 1218 985 m20 1222 984 m20 1227 976 m20 1231 977 m20 1236 955 m20 1240 952 m20 1245 943 m20 1250 932 m20 1254 940 m20 1259 921 m20 1263 919 m20 1268 914 m20 1272 910 m20 1277 901 m20 1281 895 m20 1286 886 m20 1290 876 m20
 1295 874 m20 1299 866 m20 1304 868 m20 1308 859 m20 1313 849 m20 1318 847 m20 1322 841 m20 1327 840 m20 1331 833 m20 1336 828 m20 1340 823 m20 1345 817 m20 1349 817 m20 1354 808 m20 1358 807 m20 1363 801 m20 1367 796 m20 1372 791 m20 1377 786 m20
 1381 782 m20 1386 784 m20 1390 776 m20 1395 772 m20 1399 771 m20 1404 771 m20 1408 764 m20 1413 763 m20 1417 759 m20 1422 753 m20 1426 753 m20 1431 755 m20 1435 748 m20 1440 748 m20 1445 746 m20 1449 742 m20 1454 737 m20 1458 737 m20 1463 737 m20
 1467 733 m20 1472 732 m20 1476 730 m20 1481 726 m20 1485 726 m20 1490 724 m20 1494 724 m20 1499 724 m20 1503 725 m20 1508 719 m20 1513 719 m20 1517 716 m20 1522 716 m20 1526 714 m20 1531 715 m20 1535 715 m20 1540 711 m20 1544 709 m20 1549 711 m20
 1553 709 m20 1558 707 m20 1562 706 m20 1567 709 m20 1572 703 m20 1576 706 m20 1581 705 m20 1585 703 m20 1590 703 m20 1594 703 m20 1599 703 m20 1603 699 m20 1608 701 m20 1612 700 m20 1617 698 m20 1621 698 m20 1626 697 m20 1630 699 m20 1635 696 m20
 1640 696 m20 1644 695 m20 1649 696 m20 1653 696 m20 1658 695 m20 1662 695 m20 1667 694 m20 1671 695 m20 1676 693 m20 1680 692 m20 1685 693 m20 1689 692 m20 1694 692 m20 1699 691 m20 1703 691 m20 1708 690 m20 1712 690 m20 1717 692 m20 1721 690 m20
 1726 690 m20 1730 690 m20 1735 689 m20 1739 688 m20 1744 688 m20 1748 689 m20 1753 688 m20 1757 688 m20 1762 689 m20 1767 687 m20 1771 686 m20 1776 686 m20 1780 686 m20 1785 685 m20 1789 686 m20 1794 686 m20 1798 686 m20 1803 685 m20 1807 686 m20
 1812 686 m20 1816 686 m20 1821 686 m20 1826 685 m20 1830 686 m20 1835 685 m20 1839 684 m20 1844 686 m20 1848 685 m20 1853 683 m20 1857 683 m20 1862 685 m20 1866 683 m20 1871 684 m20 1875 683 m20 1880 683 m20 1884 683 m20 1889 683 m20 1894 682 m20
 1898 682 m20 1903 682 m20 1907 682 m20 1912 681 m20 1916 683 m20 1921 681 m20 1925 682 m20 1930 682 m20 1934 682 m20 1939 682 m20 1943 682 m20 1948 682 m20 1953 682 m20 1957 682 m20 1962 681 m20 1966 681 m20 1971 681 m20 1975 681 m20 1980 682 m20
 1984 681 m20 1989 683 m20 1993 681 m20 1998 681 m20 2002 681 m20 2007 681 m20 2011 681 m20 2016 681 m20 2021 681 m20 2025 680 m20 2030 680 m20 2034 680 m20 2039 681 m20 0.8 0 0 c black 0.8 0 0 c cs 0.8 0 0 P13 setcolor 229 677 m 5 X 4 1 d 27 X 5 1 d
 9 X 4 1 d 10 X 4 1 d 5 1 d 4 1 d 5 2 d 4 X 5 2 d 4 2 d 5 2 d 4 3 d 5 3 d 4 3 d 5 2 d 4 4 d 5 6 d 5 5 d 4 5 d 5 7 d 4 6 d 5 6 d 4 8 d 5 10 d 4 9 d 5 10 d 4 9 d 5 12 d 4 10 d 5 13 d 5 9 d 4 17 d 5 8 d 4 13 d 5 16 d 4 9 d 5 21 d 4 7 d 5 15 d 4 14 d 5
 19 d 4 10 d 5 12 d 4 15 d 5 12 d 5 17 d 4 14 d 5 13 d 4 17 d 5 12 d 4 8 d 5 19 d 4 17 d 5 2 d 4 15 d 5 20 d 4 7 d 5 29 d 5 7 d 4 1 d 5 14 d 4 17 d 5 14 d 4 13 d 5 20 d 4 10 d 5 24 d 4 -3 d 5 17 d 4 17 d 5 7 d 4 11 d 5 13 d 5 9 d 4 12 d 5 10 d 4 3 d
 5 6 d 4 17 d 5 12 d 4 3 d 5 22 d 4 5 d 5 7 d 4 9 d 5 2 d 5 30 d 4 -4 d 5 -11 d 4 28 d 5 -2 d 4 2 d 5 18 d 4 13 d 5 -19 d 4 17 d 5 9 d 4 -9 d 5 20 d 4 8 d 5 -18 d 5 32 d 4 -19 d 5 8 d 4 5 d 5 10 d 4 X 5 -4 d 4 7 d 5 -6 d 4 13 d 5 11 d 4 -18 d 5 5 d 5
 -14 d 4 15 d 5 -5 d 4 3 d 5 3 d 4 1 d 5 -8 d 4 -1 d 5 7 d 4 -10 d 5 -5 d 4 -16 d 5 8 d 4 -5 d 5 9 d 5 -7 d 4 -25 d 5 18 d 4 -8 d 5 2 d 4 -3 d 5 -6 d 4 -17 d 5 12 d 4 -10 d 5 -13 d 4 -1 d 5 -16 d 4 -6 d 5 -4 d 5 -2 d 4 8 d 5 -37 d 4 -7 d 5 7 d 4 -7 d
 5 -17 d 4 -3 d 5 -6 d 4 -8 d 5 -12 d 4 6 d 5 -1 d 5 -28 d 4 7 d 5 -11 d 4 -8 d 5 -19 d 4 -11 d 5 6 d 4 -18 d 5 -2 d 4 -16 d 5 -5 d 4 -22 d 5 -1 d 4 -15 d 5 2 d 5 -17 d 4 -18 d 5 -4 d 4 -1 d 5 -18 d 4 -18 d 5 11 d 4 -17 d 5 -5 d 4 -11 d 5 -5 d 4 -3 d
 5 -17 d 5 -7 d 4 -22 d 5 -4 d 4 -12 d 5 -5 d 4 -9 d 5 2 d 4 -24 d 5 -1 d 4 -22 d 5 11 d 4 -24 d 5 -7 d 4 -10 d 5 -6 d 5 -7 d 4 -12 d 5 -3 d 4 -5 d 5 -7 d 4 -23 d 5 -3 d 4 -1 d 5 -8 d 4 X 5 -21 d 4 -4 d 5 -9 d 5 -11 d 4 8 d 5 -19 d 4 -2 d 5 -5 d 4 -4
 d 5 -8 d 4 -7 d 5 -9 d 4 -10 d 5 -2 d 4 -8 d 5 2 d 4 -9 d 5 -11 d 5 -2 d 4 -5 d 5 -1 d 4 -7 d 5 -5 d 4 -6 d 5 -6 d 4 1 d 5 -10 d 4 -1 d 5 -5 d 4 -6 d 5 -5 d 5 -5 d 4 -4 d 5 2 d 4 -8 d 5 -4 d 4 -1 d 5 X 4 -7 d 5 -1 d 4 -4 d 5 -6 d 4 X 5 1 d 4 -7 d 5
 1 d 5 -2 d 4 -4 d 5 -6 d 4 1 d 5 X 4 -4 d 5 -2 d 4 -2 d 5 -4 d 4 1 d 5 -3 d 4 1 d 5 X 4 1 d 5 -7 d 5 1 d 4 -3 d 5 -1 d 4 -2 d 5 1 d 4 X 5 -3 d 4 -3 d 5 3 d 4 -3 d 5 -2 d 4 -1 d 5 3 d 5 -5 d 4 2 d 5 -1 d 4 -2 d 14 X 4 -4 d 5 2 d 4 -1 d 5 -2 d 4 X 5
 -1 d 4 2 d 5 -3 d 5 X 4 -1 d 5 1 d 4 X 5 -1 d 4 X 5 -1 d 4 1 d 5 -3 d 4 X 5 1 d 4 -1 d 5 X 5 -1 d 4 X 5 -1 d 4 X 5 1 d 4 -1 d 5 X 4 -1 d 5 X 4 -1 d 5 X 4 1 d 5 -1 d 4 X 5 1 d 5 -3 d 13 X 5 -1 d 4 1 d 5 -1 d 4 1 d 5 -1 d 4 1 d 5 -1 d 4 X 5 1 d 5 -1 d
 4 X 5 -1 d 4 X 5 1 d 4 -1 d 5 -1 d 4 X 5 1 d 4 -1 d 5 X 4 -1 d 5 X 4 1 d 5 X 5 -1 d 13 X 5 -1 d 4 1 d 5 -1 d 4 1 d 9 X 5 -1 d 27 X 5 -1 d 4 X 5 1 d 4 -1 d 5 2 d 4 -1 d 5 -1 d 23 X 4 -1 d 5 1 d 4 X 5 1 d -1 Y -5 -1 d -27 X -5 1 d -9 X -4 1 d -5 -1 d
 -4 X -5 -1 d -4 X -5 1 d -18 X -5 1 d -4 -1 d -5 1 d -9 X -4 -1 d -5 1 d -4 -1 d -5 1 d -13 X -5 1 d -5 X -4 -1 d -5 X -4 1 d -5 X -4 1 d -5 -1 d -4 X -5 1 d -4 1 d -5 -1 d -4 X -5 1 d -4 -1 d -5 1 d -32 X -4 -1 d -5 2 d -4 -1 d -5 1 d -4 X -5 2 d
 -5 -1 d -4 X -5 1 d -4 -1 d -5 X -4 1 d -5 1 d -9 X -4 2 d -5 -2 d -4 1 d -9 X -5 1 d -5 X -4 1 d -5 -1 d -4 1 d -5 2 d -4 -1 d -5 1 d -4 X -5 1 d -18 X -5 3 d -4 -2 d -5 1 d -4 X -5 2 d -4 1 d -5 -2 d -4 4 d -14 X -4 2 d -5 1 d -4 -3 d -5 5 d -5 -2
 d -4 1 d -5 1 d -4 3 d -5 -2 d -4 2 d -5 3 d -4 X -5 -1 d -4 2 d -5 1 d -4 3 d -5 -1 d -5 7 d -4 -1 d -5 X -4 -1 d -5 3 d -4 -1 d -5 4 d -4 2 d -5 1 d -4 4 d -9 X -5 6 d -4 3 d -5 2 d -5 X -4 7 d -5 -2 d -4 X -5 6 d -4 4 d -5 1 d -4 7 d -5 X -4 1 d
 -5 4 d -4 8 d -5 -2 d -4 4 d -5 4 d -5 6 d -4 5 d -5 5 d -4 2 d -5 9 d -4 -1 d -5 6 d -4 5 d -5 6 d -4 7 d -5 X -4 6 d -5 2 d -5 10 d -4 9 d -5 -2 d -4 8 d -5 1 d -4 11 d -5 9 d -4 6 d -5 9 d -4 4 d -5 4 d -4 2 d -5 19 d -4 -8 d -5 11 d -5 9 d -4 3
 d -5 22 d -4 -1 d -5 8 d -4 1 d -5 3 d -4 23 d -5 7 d -4 4 d -5 3 d -4 12 d -5 7 d -5 6 d -4 10 d -5 7 d -4 24 d -5 -12 d -4 22 d -5 1 d -4 23 d -5 -1 d -4 8 d -5 5 d -4 12 d -5 4 d -4 22 d -5 7 d -5 17 d -4 3 d -5 5 d -4 10 d -5 5 d -4 17 d -5 -11
 d -4 18 d -5 18 d -4 1 d -5 4 d -4 17 d -5 17 d -5 -1 d -4 14 d -5 1 d -4 22 d -5 4 d -4 16 d -5 3 d -4 18 d -5 -7 d -4 12 d -5 18 d -4 8 d -5 10 d -4 -6 d -5 28 d -5 1 d -4 -7 d -5 13 d -4 7 d -5 7 d -4 3 d -5 16 d -4 7 d -5 -7 d -4 7 d -5 36 d -4
 -7 d -5 2 d -5 4 d -4 6 d -5 15 d -4 1 d -5 14 d -4 10 d -5 -13 d -4 17 d -5 6 d -4 3 d -5 -2 d -4 8 d -5 -17 d -4 24 d -5 7 d -5 -9 d -4 5 d -5 -8 d -4 16 d -5 5 d -4 10 d -5 -7 d -4 1 d -5 7 d -4 X -5 -3 d -4 -3 d -5 5 d -4 -15 d -5 13 d -5 -4 d
 -4 18 d -5 -11 d -4 -13 d -5 6 d -4 -7 d -5 5 d -4 -1 d -5 -10 d -4 -4 d -5 -8 d -4 19 d -5 -33 d -5 19 d -4 -9 d -5 -20 d -4 9 d -5 -9 d -4 -15 d -5 18 d -4 -13 d -5 -18 d -4 -1 d -5 1 d -4 -28 d -5 11 d -4 5 d -5 -30 d -5 -2 d -4 -9 d -5 -7 d -4
 -4 d -5 -22 d -4 -3 d -5 -12 d -4 -17 d -5 -6 d -4 -2 d -5 -10 d -4 -13 d -5 -8 d -5 -13 d -4 -11 d -5 -6 d -4 -17 d -5 -17 d -4 2 d -5 -23 d -4 -10 d -5 -20 d -4 -13 d -5 -14 d -4 -16 d -5 -13 d -4 -2 d -5 -7 d -5 -28 d -4 -8 d -5 -19 d -4 -15 d -5
 -2 d -4 -16 d -5 -20 d -4 -7 d -5 -12 d -4 -17 d -5 -13 d -4 -14 d -5 -16 d -5 -12 d -4 -14 d -5 -12 d -4 -11 d -5 -18 d -4 -14 d -5 -15 d -4 -6 d -5 -21 d -4 -9 d -5 -16 d -4 -12 d -5 -9 d -4 -16 d -5 -9 d -5 -13 d -4 -10 d -5 -12 d -4 -8 d -5 -10
 d -4 -9 d -5 -9 d -4 -8 d -5 -6 d -4 -6 d -5 -7 d -4 -5 d -5 -4 d -5 -6 d -4 -5 d -5 -1 d -4 -3 d -5 -3 d -4 -3 d -5 -2 d -4 -2 d -5 -2 d -4 X -5 -2 d -4 -1 d -5 X -4 -1 d -5 X -5 -1 d -13 X -5 -1 d -18 X -4 -1 d -14 X FA 0 0.4 0 c 1 1 1 c 0.35 0.83
 0.33 c 0 0.4 0 c 227 680 m 4 X 9 Y 5 X 10 Y 9 X 13 Y 4 X 13 Y 5 X -16 Y 5 X 18 Y 4 X 7 Y 5 X 6 Y 4 X 16 Y 9 X 3 Y 5 X 2 Y 4 X -1 Y 5 X 15 Y 4 X 7 Y 5 X -3 Y 4 X 20 Y 5 X 3 Y 4 X -12 Y 5 X 46 Y 5 X -7 Y 4 X -8 Y 5 X 21 Y 4 X 12 Y 5 X 10 Y 4 X -13 Y 5
 X 12 Y 4 X 30 Y 5 X -8 Y 4 X 14 Y 5 X 1 Y 4 X 50 Y 5 X -20 Y 5 X 23 Y 4 X 37 Y 5 X 2 Y 4 X 22 Y 5 X 13 Y 4 X 26 Y 9 X 12 Y 5 X 26 Y 4 X 16 Y 5 X 3 Y 4 X 30 Y 5 X 32 Y 4 X 34 Y 5 X 6 Y 5 X 6 Y 4 X 17 Y 5 X 39 Y 9 X 26 Y 4 X 15 Y 5 X 7 Y 4 X 28 Y 5 X
 29 Y 4 X 32 Y 5 X -3 Y 4 X 15 Y 5 X 15 Y 5 X 37 Y 4 X 7 Y 5 X 3 Y 4 X 7 Y 5 X 34 Y 4 X 8 Y 5 X 63 Y 4 X -1 Y 5 X -7 Y 4 X 5 Y 5 X 10 Y 4 X 29 Y 5 X 19 Y 4 X 26 Y 5 X -5 Y 5 X 31 Y 9 X 29 Y 4 X 19 Y 9 X 17 Y 5 X 2 Y 4 X 7 Y 5 X -4 Y 4 X 19 Y 5 X -2 Y
 4 X 14 Y 5 X 15 Y 4 X 23 Y 5 X -22 Y 5 X 34 Y 4 X 7 Y 5 X 4 Y 4 X -7 Y 5 X 2 Y 4 X 55 Y 5 X -13 Y 4 X -26 Y 5 X 20 Y 4 X -15 Y 5 X 22 Y 4 X 7 Y 5 X 31 Y 5 X -56 Y 4 X 16 Y 5 X 16 Y 4 X -13 Y 5 X 29 Y 4 X -7 Y 5 X -41 Y 4 X 47 Y 5 X -32 Y 4 X 8 Y 5 X
 -10 Y 4 X 18 Y 5 X -14 Y 4 X -19 Y 5 X 21 Y 5 X -22 Y 4 X 9 Y 5 X 12 Y 4 X -28 Y 5 X 6 Y 4 X -24 Y 5 X 20 Y 4 X -21 Y 5 X -2 Y 4 X 4 Y 5 X -13 Y 4 X -15 Y 10 X 6 Y 4 X -16 Y 5 X -14 Y 4 X -26 Y 5 X -4 Y 4 X -5 Y 5 X 4 Y 4 X -26 Y 5 X -20 Y 4 X 6 Y 5
 X -8 Y 9 X -10 Y 4 X -12 Y 5 X -24 Y 5 X 16 Y 4 X -20 Y 5 X -21 Y 4 X -10 Y 5 X -24 Y 4 X -4 Y 5 X -14 Y 4 X -1 Y 5 X 4 Y 4 X -43 Y 5 X -13 Y 9 X -15 Y 5 X -17 Y 4 X -1 Y 5 X -21 Y 4 X -9 Y 5 X -13 Y 4 X -8 Y 5 X 1 Y 4 X -30 Y 5 X 1 Y 4 X -13 Y 5 X
 -15 Y 4 X -23 Y 5 X -14 Y 4 X 4 Y 5 X -21 Y 5 X -13 Y 4 X -14 Y 5 X -6 Y 4 X -22 Y 5 X -5 Y 4 X -18 Y 5 X -6 Y 4 X -15 Y 5 X -25 Y 4 X -1 Y 5 X -6 Y 4 X -23 Y 5 X -14 Y 5 X 5 Y 4 X -21 Y 5 X -11 Y 4 X -6 Y 5 X -12 Y 4 X -1 Y 5 X -20 Y 4 X -12 Y 5 X
 -22 Y 4 X -5 Y 5 X -8 Y 4 X -10 Y 5 X -10 Y 4 X -4 Y 5 X -20 Y 5 X -3 Y 4 X -24 Y 5 X 7 Y 4 X -23 Y 5 X -7 Y 4 X -10 Y 5 X -1 Y 4 X -10 Y 5 X -12 Y 4 X -8 Y 5 X -9 Y 4 X -3 Y 5 X -20 Y 4 X -4 Y 5 X -1 Y 5 X -11 Y 4 X -3 Y 5 X -17 Y 4 X -1 Y 5 X -9 Y
 4 X -11 Y 5 X 2 Y 4 X -13 Y 5 X -5 Y 4 X -2 Y 5 X -7 Y 4 X -6 Y 5 X -7 Y 5 X -6 Y 4 X -7 Y 5 X -4 Y 4 X -7 Y 5 X -4 Y 4 X -4 Y 5 X -7 Y 4 X -3 Y 5 X -5 Y 4 X -3 Y 5 X -5 Y 4 X -3 Y 5 X -5 Y 4 X -3 Y 5 X -4 Y 5 X -3 Y 4 X -4 Y 5 X -4 Y 4 X -1 Y 5 X
 -5 Y 4 X -4 Y 5 X -2 Y 4 X -1 Y 5 X -6 Y 4 X -1 Y 9 X -1 Y 5 X -6 Y 9 X -2 Y 5 X -3 Y 4 X -2 Y 5 X 1 Y 4 X -3 Y 5 X -2 Y 4 X 1 Y 5 X -2 Y 4 X -2 Y 5 X -2 Y 4 X -1 Y 5 X -1 Y 4 X -1 Y 5 X 1 Y 5 X -3 Y 9 X -1 Y 9 X -1 Y 4 X -2 Y 5 X 1 Y 4 X -1 Y 9 X
 -1 Y 9 X -1 Y 5 X -1 Y 14 X -1 Y 13 X -1 Y 18 X -1 Y 32 X -1 Y 5 X 1 Y 4 X -1 Y 50 X -1 Y 5 X 1 Y 9 X -1 Y 13 X 1 Y 9 X -1 Y 59 X 1 Y 14 X -1 Y 4 X 1 Y 14 X -1 Y 5 X 1 Y 4 X -1 Y 18 X 1 Y 5 X -1 Y 4 X 1 Y 9 X -1 Y 9 X 1 Y 10 X -1 Y 4 X 1 Y 45 X 1 Y
 5 X -1 Y 4 X 1 Y 5 X -1 Y 45 X 1 Y 9 X -1 Y 5 X 1 Y 5 X -1 Y 18 X 1 Y 31 X -1 Y 5 X s 0.35 0.83 0.33 c 229 680 m20 234 689 m20 238 699 m20 243 699 m20 247 712 m20 252 725 m20 256 709 m20 261 727 m20 265 734 m20 270 740 m20 274 756 m20 279 756 m20
 283 759 m20 288 761 m20 293 760 m20 297 775 m20 302 782 m20 306 779 m20 311 799 m20 315 802 m20 320 790 m20 324 836 m20 329 829 m20 333 821 m20 338 842 m20 342 854 m20 347 864 m20 351 851 m20 356 863 m20 361 893 m20 365 885 m20 370 899 m20 374 900
 m20 379 950 m20 383 930 m20 388 953 m20 392 990 m20 397 992 m20 401 1014 m20 406 1027 m20 410 1053 m20 415 1053 m20 420 1065 m20 424 1091 m20 429 1107 m20 433 1110 m20 438 1140 m20 442 1172 m20 447 1206 m20 451 1212 m20 456 1218 m20 460 1235 m20 465
 1274 m20 469 1274 m20 474 1300 m20 478 1315 m20 483 1322 m20 488 1350 m20 492 1379 m20 497 1411 m20 501 1408 m20 506 1423 m20 510 1438 m20 515 1475 m20 519 1482 m20 524 1485 m20 528 1492 m20 533 1526 m20 537 1534 m20 542 1597 m20 547 1596 m20 551
 1589 m20 556 1594 m20 560 1604 m20 565 1633 m20 569 1652 m20 574 1678 m20 578 1673 m20 583 1704 m20 587 1704 m20 592 1733 m20 596 1752 m20 601 1752 m20 605 1769 m20 610 1771 m20 615 1778 m20 619 1774 m20 624 1793 m20 628 1791 m20 633 1805 m20 637
 1820 m20 642 1843 m20 646 1821 m20 651 1855 m20 655 1862 m20 660 1866 m20 664 1859 m20 669 1861 m20 674 1916 m20 678 1903 m20 683 1877 m20 687 1897 m20 692 1882 m20 696 1904 m20 701 1911 m20 705 1942 m20 710 1886 m20 714 1902 m20 719 1918 m20 723
 1905 m20 728 1934 m20 732 1927 m20 737 1886 m20 742 1933 m20 746 1901 m20 751 1909 m20 755 1899 m20 760 1917 m20 764 1903 m20 769 1884 m20 773 1905 m20 778 1883 m20 782 1892 m20 787 1904 m20 791 1876 m20 796 1882 m20 801 1858 m20 805 1878 m20 810
 1857 m20 814 1855 m20 819 1859 m20 823 1846 m20 828 1831 m20 832 1831 m20 837 1837 m20 841 1821 m20 846 1807 m20 850 1781 m20 855 1777 m20 859 1772 m20 864 1776 m20 869 1750 m20 873 1730 m20 878 1736 m20 882 1728 m20 887 1728 m20 891 1718 m20 896
 1706 m20 900 1682 m20 905 1698 m20 909 1678 m20 914 1657 m20 918 1647 m20 923 1623 m20 927 1619 m20 932 1605 m20 937 1604 m20 941 1608 m20 946 1565 m20 950 1552 m20 955 1552 m20 959 1537 m20 964 1520 m20 968 1519 m20 973 1498 m20 977 1489 m20 982
 1476 m20 986 1468 m20 991 1469 m20 996 1439 m20 1000 1440 m20 1005 1427 m20 1009 1412 m20 1014 1389 m20 1018 1375 m20 1023 1379 m20 1027 1358 m20 1032 1345 m20 1036 1331 m20 1041 1325 m20 1045 1303 m20 1050 1298 m20 1054 1280 m20 1059 1274 m20 1064
 1259 m20 1068 1234 m20 1073 1233 m20 1077 1227 m20 1082 1204 m20 1086 1190 m20 1091 1195 m20 1095 1174 m20 1100 1163 m20 1104 1157 m20 1109 1145 m20 1113 1144 m20 1118 1124 m20 1123 1112 m20 1127 1090 m20 1132 1085 m20 1136 1077 m20 1141 1067 m20
 1145 1057 m20 1150 1053 m20 1154 1033 m20 1159 1030 m20 1163 1006 m20 1168 1013 m20 1172 990 m20 1177 983 m20 1181 973 m20 1186 972 m20 1191 962 m20 1195 950 m20 1200 942 m20 1204 933 m20 1209 930 m20 1213 910 m20 1218 906 m20 1222 905 m20 1227 894
 m20 1231 891 m20 1236 874 m20 1240 873 m20 1245 864 m20 1250 853 m20 1254 855 m20 1259 842 m20 1263 837 m20 1268 835 m20 1272 828 m20 1277 822 m20 1281 815 m20 1286 809 m20 1290 802 m20 1295 798 m20 1299 791 m20 1304 787 m20 1308 783 m20 1313 776
 m20 1318 773 m20 1322 768 m20 1327 765 m20 1331 760 m20 1336 757 m20 1340 752 m20 1345 749 m20 1349 745 m20 1354 742 m20 1358 738 m20 1363 734 m20 1367 733 m20 1372 728 m20 1377 724 m20 1381 722 m20 1386 721 m20 1390 715 m20 1395 714 m20 1399 714
 m20 1404 713 m20 1408 707 m20 1413 707 m20 1417 705 m20 1422 702 m20 1426 700 m20 1431 701 m20 1435 698 m20 1440 696 m20 1445 697 m20 1449 695 m20 1454 693 m20 1458 691 m20 1463 690 m20 1467 689 m20 1472 688 m20 1476 689 m20 1481 686 m20 1485 686
 m20 1490 685 m20 1494 685 m20 1499 684 m20 1503 682 m20 1508 683 m20 1513 682 m20 1517 682 m20 1522 681 m20 1526 681 m20 1531 680 m20 1535 679 m20 1540 679 m20 1544 679 m20 1549 678 m20 1553 678 m20 1558 678 m20 1562 677 m20 1567 677 m20 1572 677
 m20 1576 677 m20 1581 676 m20 1585 676 m20 1590 676 m20 1594 676 m20 1599 676 m20 1603 676 m20 1608 676 m20 1612 675 m20 1617 676 m20 1621 675 m20 1626 675 m20 1630 675 m20 1635 675 m20 1640 675 m20 1644 675 m20 1649 675 m20 1653 675 m20 1658 675
 m20 1662 675 m20 1667 675 m20 1671 674 m20 1676 675 m20 1680 675 m20 1685 674 m20 1689 674 m20 1694 674 m20 1699 675 m20 1703 675 m20 1708 674 m20 1712 674 m20 1717 674 m20 1721 674 m20 1726 674 m20 1730 674 m20 1735 674 m20 1739 674 m20 1744 674
 m20 1748 674 m20 1753 674 m20 1757 674 m20 1762 674 m20 1767 675 m20 1771 675 m20 1776 675 m20 1780 674 m20 1785 675 m20 1789 675 m20 1794 675 m20 1798 674 m20 1803 675 m20 1807 674 m20 1812 674 m20 1816 674 m20 1821 674 m20 1826 675 m20 1830 674
 m20 1835 675 m20 1839 675 m20 1844 674 m20 1848 674 m20 1853 675 m20 1857 675 m20 1862 674 m20 1866 675 m20 1871 675 m20 1875 675 m20 1880 675 m20 1884 675 m20 1889 675 m20 1894 675 m20 1898 675 m20 1903 675 m20 1907 675 m20 1912 676 m20 1916 675
 m20 1921 676 m20 1925 675 m20 1930 675 m20 1934 675 m20 1939 675 m20 1943 675 m20 1948 675 m20 1953 675 m20 1957 675 m20 1962 675 m20 1966 675 m20 1971 676 m20 1975 676 m20 1980 675 m20 1984 676 m20 1989 675 m20 1993 675 m20 1998 675 m20 2002 675
 m20 2007 676 m20 2011 676 m20 2016 676 m20 2021 676 m20 2025 676 m20 2030 676 m20 2034 676 m20 2039 675 m20 0 0.4 0 c black 0 0.4 0 c cs 0 0.4 0 P13 setcolor 229 681 m 5 11 d 4 12 d 5 1 d 4 13 d 5 14 d 4 -17 d 5 19 d 4 8 d 5 5 d 4 18 d 5 X 4 3 d 5 2
 d 5 -1 d 4 15 d 5 8 d 4 -4 d 5 21 d 4 4 d 5 -13 d 4 49 d 5 -8 d 4 -9 d 5 21 d 4 13 d 5 10 d 4 -15 d 5 13 d 5 31 d 4 -9 d 5 15 d 4 -1 d 5 53 d 4 -23 d 5 25 d 4 37 d 5 2 d 4 22 d 5 12 d 4 27 d 5 -1 d 5 12 d 4 26 d 5 17 d 4 1 d 5 32 d 4 32 d 5 34 d 4 6
 d 5 5 d 4 18 d 5 39 d 4 X 5 26 d 4 15 d 5 7 d 5 28 d 4 29 d 5 32 d 4 -3 d 5 15 d 4 15 d 5 38 d 4 6 d 5 3 d 4 8 d 5 34 d 4 8 d 5 63 d 5 -1 d 4 -7 d 5 4 d 4 11 d 5 29 d 4 19 d 5 26 d 4 -5 d 5 31 d 4 X 5 29 d 4 20 d 5 -1 d 4 17 d 5 2 d 5 8 d 4 -5 d 5
 20 d 4 -3 d 5 15 d 4 15 d 5 22 d 4 -22 d 5 35 d 4 7 d 5 3 d 4 -7 d 5 2 d 5 55 d 4 -13 d 5 -26 d 4 20 d 5 -15 d 4 22 d 5 7 d 4 31 d 5 -56 d 4 16 d 5 16 d 4 -13 d 5 29 d 4 -7 d 5 -41 d 5 47 d 4 -32 d 5 7 d 4 -10 d 5 19 d 4 -15 d 5 -18 d 4 21 d 5 -23 d
 4 9 d 5 12 d 4 -28 d 5 6 d 5 -24 d 4 20 d 5 -22 d 4 -1 d 5 4 d 4 -13 d 5 -16 d 4 X 5 7 d 4 -17 d 5 -14 d 4 -26 d 5 -5 d 4 -5 d 5 5 d 5 -27 d 4 -20 d 5 7 d 4 -9 d 5 X 4 -9 d 5 -13 d 4 -25 d 5 16 d 4 -20 d 5 -21 d 4 -9 d 5 -25 d 4 -4 d 5 -13 d 5 -2 d
 4 4 d 5 -43 d 4 -13 d 5 X 4 -16 d 5 -17 d 4 X 5 -22 d 4 -9 d 5 -13 d 4 -8 d 5 1 d 5 -30 d 4 1 d 5 -14 d 4 -15 d 5 -23 d 4 -14 d 5 4 d 4 -21 d 5 -13 d 4 -14 d 5 -6 d 4 -22 d 5 -6 d 4 -18 d 5 -5 d 5 -15 d 4 -26 d 5 -1 d 4 -6 d 5 -23 d 4 -15 d 5 5 d 4
 -20 d 5 -11 d 4 -6 d 5 -13 d 4 -1 d 5 -20 d 5 -12 d 4 -22 d 5 -5 d 4 -9 d 5 -9 d 4 -11 d 5 -3 d 4 -21 d 5 -3 d 4 -24 d 5 7 d 4 -23 d 5 -8 d 4 -10 d 5 X 5 -10 d 4 -13 d 5 -8 d 4 -9 d 5 -3 d 4 -20 d 5 -4 d 4 -1 d 5 -11 d 4 -3 d 5 -17 d 4 -1 d 5 -10 d
 5 -10 d 4 2 d 5 -13 d 4 -5 d 5 -3 d 4 -7 d 5 -6 d 4 -7 d 5 -6 d 4 -8 d 5 -3 d 4 -7 d 5 -4 d 4 -4 d 5 -8 d 5 -2 d 4 -5 d 5 -4 d 4 -4 d 5 -4 d 4 -4 d 5 -3 d 4 -4 d 5 -4 d 4 -4 d 5 -3 d 4 -2 d 5 -5 d 5 -4 d 4 -2 d 5 -1 d 4 -6 d 5 -2 d 4 1 d 5 -2 d 4 -5
 d 5 X 4 -2 d 5 -3 d 4 -2 d 5 X 4 -2 d 5 -2 d 5 X 4 -1 d 5 -2 d 4 -3 d 5 X 4 -1 d 5 -1 d 4 X 5 -2 d 4 X 5 -2 d 4 1 d 5 -1 d 4 -3 d 5 2 d 5 -2 d 9 X 4 -1 d 5 -1 d 4 X 5 -1 d 13 X 5 -1 d 4 X 5 -1 d 5 X 4 1 d 5 -1 d 4 -1 d 5 1 d 4 -1 d 5 X 4 1 d 5 -1 d
 18 X 4 -1 d 5 1 d 5 -1 d 63 X 5 -1 d 4 1 d 5 -1 d 4 1 d 5 -1 d 4 1 d 14 X 4 -1 d 14 X 5 1 d 45 X 4 -1 d 5 1 d 5 X 4 -1 d 5 1 d 4 X 5 -1 d 4 1 d 46 X 4 1 d 5 -1 d 4 X 5 1 d 4 -1 d 5 1 d 4 -1 d 23 X 5 1 d 4 -1 d 5 1 d 13 X 5 -1 d 4 1 d 5 -1 d 4 1 d 41
 X 5 -1 d -5 1 d -9 X -4 -1 d -41 X -5 1 d -4 -1 d -96 X -4 -1 d -5 1 d -4 -1 d -5 1 d -4 X -5 -1 d -4 X -5 1 d -4 -1 d -37 X -4 1 d -5 -1 d -4 1 d -5 -1 d -4 1 d -5 -1 d -4 X -5 -1 d -5 1 d -36 X -4 -1 d -5 1 d -4 -1 d -5 1 d -50 X -4 1 d -5 -1 d -4
 1 d -5 X -5 -1 d -4 1 d -18 X -5 1 d -22 X -5 1 d -14 X -4 1 d -18 X -5 1 d -4 X -5 1 d -4 1 d -9 X -5 2 d -5 -2 d -4 3 d -5 1 d -4 -1 d -5 2 d -4 X -5 2 d -4 X -5 1 d -4 1 d -5 X -4 3 d -5 1 d -4 2 d -5 -1 d -5 2 d -4 3 d -5 X -4 1 d -5 3 d -4 3 d
 -5 -1 d -4 6 d -5 1 d -4 X -5 1 d -4 5 d -5 2 d -4 2 d -5 4 d -5 5 d -4 1 d -5 3 d -4 5 d -5 3 d -4 4 d -5 3 d -4 4 d -5 4 d -4 4 d -5 4 d -4 4 d -5 3 d -5 8 d -4 4 d -5 3 d -4 7 d -5 4 d -4 7 d -5 6 d -4 7 d -5 6 d -4 6 d -5 3 d -4 5 d -5 13 d -4
 -3 d -5 11 d -5 10 d -4 1 d -5 16 d -4 4 d -5 10 d -4 1 d -5 4 d -4 19 d -5 4 d -4 8 d -5 8 d -4 12 d -5 10 d -5 1 d -4 10 d -5 7 d -4 23 d -5 -7 d -4 24 d -5 3 d -4 20 d -5 4 d -4 9 d -5 10 d -4 9 d -5 4 d -4 22 d -5 12 d -5 20 d -4 X -5 13 d -4 6
 d -5 11 d -4 20 d -5 -5 d -4 14 d -5 23 d -4 6 d -5 1 d -4 25 d -5 15 d -5 5 d -4 18 d -5 6 d -4 21 d -5 6 d -4 14 d -5 13 d -4 21 d -5 -5 d -4 15 d -5 22 d -4 15 d -5 14 d -4 -2 d -5 30 d -5 -1 d -4 8 d -5 12 d -4 9 d -5 22 d -4 X -5 17 d -4 16 d
 -5 X -4 12 d -5 43 d -4 -5 d -5 2 d -5 14 d -4 4 d -5 24 d -4 9 d -5 21 d -4 20 d -5 -16 d -4 24 d -5 12 d -4 10 d -5 X -4 8 d -5 -6 d -4 20 d -5 25 d -5 -4 d -4 5 d -5 4 d -4 26 d -5 14 d -4 16 d -5 -7 d -4 X -5 16 d -4 13 d -5 -4 d -4 1 d -5 21 d
 -4 -20 d -5 25 d -5 -7 d -4 28 d -5 -12 d -4 -9 d -5 22 d -4 -21 d -5 19 d -4 14 d -5 -18 d -4 9 d -5 -7 d -4 31 d -5 -47 d -5 41 d -4 7 d -5 -29 d -4 13 d -5 -16 d -4 -15 d -5 54 d -4 -30 d -5 -7 d -4 -22 d -5 15 d -4 -20 d -5 25 d -4 13 d -5 -54 d
 -5 -2 d -4 6 d -5 -3 d -4 -7 d -5 -34 d -4 21 d -5 -22 d -4 -15 d -5 -14 d -4 2 d -5 -19 d -4 4 d -5 -7 d -5 -3 d -4 -16 d -5 X -4 -20 d -5 -28 d -4 1 d -5 -31 d -4 4 d -5 -27 d -4 -18 d -5 -29 d -4 -10 d -5 -5 d -4 6 d -5 1 d -5 -62 d -4 -7 d -5
 -34 d -4 -8 d -5 -3 d -4 -7 d -5 -36 d -4 -15 d -5 -15 d -4 2 d -5 -31 d -4 -29 d -5 -28 d -5 -7 d -4 -15 d -5 -25 d -4 -1 d -5 -39 d -4 -17 d -5 -6 d -4 -6 d -5 -34 d -4 -31 d -5 -30 d -4 -4 d -5 -16 d -4 -25 d -5 -12 d -5 -1 d -4 -26 d -5 -13 d -4
 -21 d -5 -3 d -4 -36 d -5 -23 d -4 19 d -5 -48 d -4 -2 d -5 -14 d -4 8 d -5 -29 d -5 -13 d -4 12 d -5 -9 d -4 -12 d -5 -20 d -4 7 d -5 6 d -4 -44 d -5 11 d -4 -3 d -5 -18 d -4 2 d -5 -6 d -4 -14 d -5 X -5 -2 d -4 -3 d -5 X -4 -15 d -5 -5 d -4 -7 d
 -5 -16 d -4 13 d -5 -11 d -4 -12 d -5 X -4 -9 d -5 -6 d FA black 1 1 1 c 567 470 1587 1550 bf black 1587 1550 m 567 X s 2154 1550 m 470 Y s 2154 2020 m -567 X s 1587 2020 m -470 Y s
 gsave  2268 1568 0 609 C 1728.33 1918.25 t 0 r /Helvetica findfont 72.27 sf 0 0 m (No Int) show NC gr  0.8 0 0 c 1609 1941 m 99 X s black
 gsave  2268 1568 0 609 C 1728.33 1758.71 t 0 r /Helvetica findfont 72.27 sf 0 0 m (With Int) show NC gr  0 0 1 c 1609 1785 m 99 X s black
 gsave  2268 1568 0 609 C 1728.33 1610.57 t 0 r /Helvetica findfont 72.27 sf 0 0 m (Reweighted) show NC gr  0 0.4 0 c 1609 1628 m 99 X s black
 gsave  2268 1568 0 609 C 2222.13 1747.32 t 90 r /Helvetica-BoldOblique findfont 30.4295 sf 0 0 m (LHC HIGGS XS WG 2013) show NC gr  1 1 1 c 2268 609 0 0 bf black 1 1 1 c 1814 457 227 152 bf black 1814 457 227 152 bl 1 1 1 c black 227 545 m 4 X -79 Y
 5 X -49 Y 4 X 75 Y 5 X -60 Y 4 X -27 Y 5 X 204 Y 5 X -104 Y 4 X -16 Y 5 X 4 Y 4 X -41 Y 5 X 5 Y 4 X 41 Y 5 X -17 Y 4 X 45 Y 5 X -35 Y 4 X -10 Y 5 X 35 Y 4 X -43 Y 5 X 1 Y 4 X 69 Y 5 X -97 Y 5 X 17 Y 4 X 31 Y 5 X -38 Y 4 X 1 Y 5 X -5 Y 4 X 41 Y 5 X
 -16 Y 4 X -38 Y 5 X 33 Y 4 X -10 Y 5 X 23 Y 4 X -55 Y 5 X 35 Y 5 X -20 Y 4 X -29 Y 5 X 21 Y 4 X -10 Y 5 X -2 Y 4 X -5 Y 5 X 4 Y 4 X 4 Y 5 X -8 Y 4 X -2 Y 5 X 10 Y 4 X -10 Y 5 X -11 Y 4 X -7 Y 5 X 8 Y 5 X 2 Y 4 X -2 Y 5 X -5 Y 4 X 3 Y 5 X -4 Y 9 X 8
 Y 4 X -12 Y 5 X -5 Y 4 X -1 Y 5 X 5 Y 4 X 2 Y 5 X 1 Y 5 X -9 Y 4 X 2 Y 5 X 3 Y 4 X 9 Y 5 X -10 Y 9 X -12 Y 4 X 2 Y 5 X 10 Y 4 X 1 Y 9 X -4 Y 5 X 3 Y 4 X -5 Y 5 X 4 Y 5 X -9 Y 4 X 5 Y 5 X -4 Y 4 X -1 Y 5 X 2 Y 18 X 1 Y 4 X 1 Y 5 X 2 Y 4 X -2 Y 5 X -5
 Y 4 X -2 Y 5 X 9 Y 5 X -11 Y 4 X 7 Y 5 X -5 Y 4 X 6 Y 5 X 2 Y 4 X -15 Y 5 X 8 Y 4 X 4 Y 5 X -1 Y 4 X 2 Y 5 X -6 Y 9 X -4 Y 5 X 9 Y 4 X -3 Y 5 X -1 Y 4 X 6 Y 5 X -9 Y 4 X 2 Y 5 X 12 Y 4 X -16 Y 5 X 7 Y 4 X -3 Y 5 X 2 Y 9 X -1 Y 4 X 2 Y 5 X -2 Y 5 X 3
 Y 4 X -2 Y 5 X -4 Y 13 X 8 Y 5 X -9 Y 4 X 5 Y 5 X 1 Y 4 X 1 Y 5 X -3 Y 4 X -1 Y 5 X 2 Y 5 X -4 Y 9 X 2 Y 4 X 2 Y 9 X 1 Y 5 X -2 Y 4 X -1 Y 5 X 2 Y 9 X -5 Y 4 X 2 Y 5 X -2 Y 9 X 3 Y 5 X -1 Y 4 X -5 Y 5 X 9 Y 4 X -5 Y 5 X 5 Y 4 X -1 Y 5 X -1 Y 9 X -5
 Y 4 X 9 Y 9 X -7 Y 5 X 5 Y 5 X -5 Y 4 X 1 Y 5 X 3 Y 4 X -3 Y 5 X 3 Y 4 X -6 Y 5 X -1 Y 4 X 4 Y 5 X -5 Y 4 X 3 Y 5 X -5 Y 4 X 4 Y 5 X 3 Y 4 X -5 Y 5 X 3 Y 14 X 3 Y 4 X 2 Y 5 X -5 Y 4 X 3 Y 5 X -5 Y 4 X 7 Y 5 X -2 Y 4 X -6 Y 5 X -1 Y 4 X 7 Y 5 X 1 Y 5
 X -8 Y 4 X 1 Y 5 X 2 Y 4 X -1 Y 5 X -2 Y 4 X -4 Y 5 X 4 Y 4 X -1 Y 5 X 9 Y 4 X -6 Y 5 X 1 Y 4 X 5 Y 5 X -8 Y 9 X 7 Y 5 X -13 Y 4 X 14 Y 5 X -10 Y 4 X 6 Y 5 X 7 Y 4 X -6 Y 5 X -12 Y 4 X 12 Y 5 X -1 Y 4 X -9 Y 5 X 7 Y 4 X 2 Y 5 X 1 Y 4 X 7 Y 5 X -16 Y
 5 X 3 Y 4 X -4 Y 5 X 5 Y 4 X -3 Y 5 X -2 Y 4 X 11 Y 5 X -8 Y 4 X -3 Y 5 X 4 Y 4 X -4 Y 5 X -3 Y 4 X 5 Y 5 X 2 Y 5 X -7 Y 4 X -5 Y 5 X 6 Y 4 X -6 Y 5 X 7 Y 4 X -4 Y 5 X 3 Y 4 X 1 Y 5 X -1 Y 4 X -5 Y 5 X 9 Y 4 X -8 Y 5 X -8 Y 4 X 18 Y 5 X -12 Y 5 X -7
 Y 4 X 5 Y 5 X 3 Y 4 X 12 Y 5 X -16 Y 4 X 14 Y 5 X -1 Y 4 X -12 Y 5 X 8 Y 4 X 20 Y 5 X -40 Y 4 X -3 Y 5 X 33 Y 5 X -19 Y 4 X -9 Y 5 X 7 Y 4 X 13 Y 5 X -27 Y 4 X 23 Y 5 X -8 Y 4 X -31 Y 5 X 25 Y 4 X -5 Y 5 X -8 Y 4 X 35 Y 5 X -54 Y 4 X 5 Y 5 X 20 Y 5
 X 16 Y 4 X -95 Y 5 X 51 Y 4 X 10 Y 5 X -4 Y 4 X 28 Y 5 X -105 Y 4 X 151 Y 5 X -79 Y 4 X -4 Y 5 X -72 Y 4 X 76 Y 10 X -33 Y 4 X -75 Y 5 X 194 Y 4 X -252 Y 14 X 457 Y 18 X -308 Y 4 X 98 Y 5 X -16 Y 4 X 176 Y 5 X -15 Y 5 X 65 Y 4 X -352 Y 5 X 343 Y 4 X
 -156 Y 5 X -80 Y 4 X -39 Y 5 X 258 Y 4 X -50 Y 5 X -158 Y 4 X 52 Y 5 X -22 Y 4 X -98 Y 5 X 82 Y 5 X -26 Y 4 X 66 Y 5 X -43 Y 4 X 55 Y 5 X -66 Y 4 X 35 Y 5 X -20 Y 4 X 110 Y 5 X -111 Y 4 X -28 Y 5 X -42 Y 4 X 16 Y 5 X 78 Y 4 X -104 Y 5 X 142 Y 5 X
 -41 Y 4 X -1 Y 5 X -6 Y 4 X -56 Y 5 X 53 Y 4 X -38 Y 5 X -20 Y 4 X 79 Y 5 X -85 Y 4 X 87 Y 5 X 6 Y 4 X 79 Y 5 X -51 Y 4 X 9 Y 5 X -74 Y 5 X 35 Y 4 X 24 Y 5 X -49 Y 4 X -19 Y 5 X 60 Y 4 X -33 Y 5 X -71 Y 4 X 35 Y 5 X -47 Y 4 X -52 Y 5 X 126 Y 4 X
 -105 Y 5 X 14 Y 5 X 121 Y 4 X 14 Y 5 X -67 Y 4 X 105 Y 5 X -82 Y 4 X 69 Y 5 X -103 Y 4 X 74 Y 5 X -1 Y 4 X -113 Y 5 X 97 Y 4 X 125 Y 5 X -120 Y 4 X 35 Y 5 X -25 Y 5 X -47 Y 4 X -13 Y 5 X 54 Y 4 X -68 Y 5 X 26 Y 4 X 91 Y 5 X -147 Y 4 X 49 Y 5 X 35 Y
 4 X -51 Y 5 X 165 Y 4 X -121 Y 5 X -24 Y 5 X -39 Y 4 X 116 Y 5 X -56 Y 4 X 53 Y 5 X -89 Y 4 X 93 Y 5 X -28 Y 4 X -91 Y 5 X 97 Y 4 X 5 Y 5 X -53 Y 4 X -79 Y 5 X s 227 152 m 1814 X s
 gsave  2268 609 0 0 C 2024.61 26.5896 t 0 r /Helvetica findfont 38.0897 sf 0 0 m (ll) show NC gr 
 gsave  2268 609 0 0 C 1979.03 41.7837 t 0 r /Helvetica findfont 57.1345 sf 0 0 m (M) show NC gr  227 167 m -15 Y s 272 160 m -8 Y s 317 160 m -8 Y s 363 160 m -8 Y s 408 160 m -8 Y s 454 167 m -15 Y s 499 160 m -8 Y s 544 160 m -8 Y s 590 160 m -8 Y
 s 635 160 m -8 Y s 680 167 m -15 Y s 726 160 m -8 Y s 771 160 m -8 Y s 816 160 m -8 Y s 862 160 m -8 Y s 907 167 m -15 Y s 952 160 m -8 Y s 998 160 m -8 Y s 1043 160 m -8 Y s 1089 160 m -8 Y s 1134 167 m -15 Y s 1179 160 m -8 Y s 1225 160 m -8 Y s
 1270 160 m -8 Y s 1315 160 m -8 Y s 1361 167 m -15 Y s 1406 160 m -8 Y s 1451 160 m -8 Y s 1497 160 m -8 Y s 1542 160 m -8 Y s 1587 167 m -15 Y s 1633 160 m -8 Y s 1678 160 m -8 Y s 1723 160 m -8 Y s 1769 160 m -8 Y s 1814 167 m -15 Y s 1860 160 m
 -8 Y s 1905 160 m -8 Y s 1950 160 m -8 Y s 1996 160 m -8 Y s 2041 167 m -15 Y s
 gsave  2268 609 0 0 C 208.919 113.956 t 0 r /Helvetica findfont 45.7076 sf 0 0 m (0) show NC gr 
 gsave  2268 609 0 0 C 414.039 113.956 t 0 r /Helvetica findfont 45.7076 sf 0 0 m (100) show NC gr 
 gsave  2268 609 0 0 C 641.95 113.956 t 0 r /Helvetica findfont 45.7076 sf 0 0 m (200) show NC gr 
 gsave  2268 609 0 0 C 866.063 113.956 t 0 r /Helvetica findfont 45.7076 sf 0 0 m (300) show NC gr 
 gsave  2268 609 0 0 C 1093.97 113.956 t 0 r /Helvetica findfont 45.7076 sf 0 0 m (400) show NC gr 
 gsave  2268 609 0 0 C 1321.89 113.956 t 0 r /Helvetica findfont 45.7076 sf 0 0 m (500) show NC gr 
 gsave  2268 609 0 0 C 1546 113.956 t 0 r /Helvetica findfont 45.7076 sf 0 0 m (600) show NC gr 
 gsave  2268 609 0 0 C 1773.91 113.956 t 0 r /Helvetica findfont 45.7076 sf 0 0 m (700) show NC gr 
 gsave  2268 609 0 0 C 2001.82 113.956 t 0 r /Helvetica findfont 45.7076 sf 0 0 m (800) show NC gr  227 152 m 457 Y s
 gsave  2268 609 0 0 C 91.1645 170.933 t 90 r /Helvetica findfont 45.7076 sf 0 0 m (\(S+I\)/\(Reweighted S\)) show NC gr  278 152 m -51 X s 252 164 m -25 X s 252 175 m -25 X s 252 187 m -25 X s 278 198 m -51 X s 252 209 m -25 X s 252 221 m -25 X s
 252 232 m -25 X s 278 244 m -51 X s 252 255 m -25 X s 252 267 m -25 X s 252 278 m -25 X s 278 289 m -51 X s 252 301 m -25 X s 252 312 m -25 X s 252 324 m -25 X s 278 335 m -51 X s 252 347 m -25 X s 252 358 m -25 X s 252 369 m -25 X s 278 381 m -51 X
 s 252 392 m -25 X s 252 404 m -25 X s 252 415 m -25 X s 278 427 m -51 X s 252 438 m -25 X s 252 449 m -25 X s 252 461 m -25 X s 278 472 m -51 X s 252 484 m -25 X s 252 495 m -25 X s 252 507 m -25 X s 278 518 m -51 X s 252 529 m -25 X s 252 541 m -25
 X s 252 552 m -25 X s 278 564 m -51 X s 252 575 m -25 X s 252 587 m -25 X s 252 598 m -25 X s 278 609 m -51 X s
 gsave  2268 609 0 0 C 186.127 136.747 t 0 r /Helvetica findfont 45.7076 sf 0 0 m (0) show NC gr 
 gsave  2268 609 0 0 C 148.142 182.329 t 0 r /Helvetica findfont 45.7076 sf 0 0 m (0.2) show NC gr 
 gsave  2268 609 0 0 C 148.142 227.911 t 0 r /Helvetica findfont 45.7076 sf 0 0 m (0.4) show NC gr 
 gsave  2268 609 0 0 C 148.142 273.493 t 0 r /Helvetica findfont 45.7076 sf 0 0 m (0.6) show NC gr 
 gsave  2268 609 0 0 C 148.142 319.076 t 0 r /Helvetica findfont 45.7076 sf 0 0 m (0.8) show NC gr 
 gsave  2268 609 0 0 C 193.725 364.658 t 0 r /Helvetica findfont 45.7076 sf 0 0 m (1) show NC gr 
 gsave  2268 609 0 0 C 148.142 410.24 t 0 r /Helvetica findfont 45.7076 sf 0 0 m (1.2) show NC gr 
 gsave  2268 609 0 0 C 148.142 455.822 t 0 r /Helvetica findfont 45.7076 sf 0 0 m (1.4) show NC gr 
 gsave  2268 609 0 0 C 148.142 501.405 t 0 r /Helvetica findfont 45.7076 sf 0 0 m (1.6) show NC gr 
 gsave  2268 609 0 0 C 148.142 546.987 t 0 r /Helvetica findfont 45.7076 sf 0 0 m (1.8) show NC gr 
 gsave  2268 609 0 0 C 186.127 592.569 t 0 r /Helvetica findfont 45.7076 sf 0 0 m (2) show NC gr  229 545 m20 234 466 m20 238 417 m20 243 492 m20 247 432 m20 252 405 m20 261 505 m20 265 489 m20 270 493 m20 274 452 m20 279 457 m20 283 498 m20 288 481
 m20 293 526 m20 297 491 m20 302 481 m20 306 516 m20 311 473 m20 315 474 m20 320 543 m20 324 446 m20 329 463 m20 333 494 m20 338 456 m20 342 457 m20 347 452 m20 351 493 m20 356 477 m20 361 439 m20 365 472 m20 370 462 m20 374 485 m20 379 430 m20 383
 465 m20 388 445 m20 392 416 m20 397 437 m20 401 427 m20 406 425 m20 410 420 m20 415 424 m20 420 428 m20 424 420 m20 429 418 m20 433 428 m20 438 418 m20 442 407 m20 447 400 m20 451 408 m20 456 410 m20 460 408 m20 465 403 m20 469 406 m20 474 402 m20
 478 402 m20 483 410 m20 488 398 m20 492 393 m20 497 392 m20 501 397 m20 506 399 m20 510 400 m20 515 391 m20 519 393 m20 524 396 m20 528 405 m20 533 395 m20 537 395 m20 542 383 m20 547 385 m20 551 395 m20 556 396 m20 560 396 m20 565 392 m20 569 395
 m20 574 390 m20 578 394 m20 583 385 m20 587 390 m20 592 386 m20 596 385 m20 601 387 m20 605 387 m20 610 387 m20 615 387 m20 619 388 m20 624 389 m20 628 391 m20 633 389 m20 637 384 m20 642 382 m20 646 391 m20 651 380 m20 655 387 m20 660 382 m20 664
 388 m20 669 390 m20 674 375 m20 678 383 m20 683 387 m20 687 386 m20 692 388 m20 696 382 m20 701 382 m20 705 378 m20 710 387 m20 714 384 m20 719 383 m20 723 389 m20 728 380 m20 732 382 m20 737 394 m20 742 378 m20 746 385 m20 751 382 m20 755 384 m20
 760 384 m20 764 383 m20 769 385 m20 773 383 m20 778 386 m20 782 384 m20 787 380 m20 791 380 m20 796 380 m20 801 388 m20 805 379 m20 810 384 m20 814 385 m20 819 386 m20 823 383 m20 828 382 m20 832 384 m20 837 380 m20 841 380 m20 846 382 m20 850 384
 m20 855 384 m20 859 385 m20 864 383 m20 869 382 m20 873 384 m20 878 384 m20 882 379 m20 887 381 m20 891 379 m20 896 379 m20 900 382 m20 905 381 m20 909 376 m20 914 385 m20 918 380 m20 923 385 m20 927 384 m20 932 383 m20 937 383 m20 941 378 m20 946
 387 m20 950 387 m20 955 380 m20 959 385 m20 964 380 m20 968 381 m20 973 384 m20 977 381 m20 982 384 m20 986 378 m20 991 377 m20 996 381 m20 1000 376 m20 1005 379 m20 1009 374 m20 1014 378 m20 1018 381 m20 1023 376 m20 1027 379 m20 1032 379 m20 1036
 379 m20 1041 382 m20 1045 384 m20 1050 379 m20 1054 382 m20 1059 377 m20 1064 384 m20 1068 382 m20 1073 376 m20 1077 375 m20 1082 382 m20 1086 383 m20 1091 375 m20 1095 376 m20 1100 378 m20 1104 377 m20 1109 375 m20 1113 371 m20 1118 375 m20 1123
 374 m20 1127 383 m20 1132 377 m20 1136 378 m20 1141 383 m20 1145 375 m20 1150 375 m20 1154 382 m20 1159 369 m20 1163 383 m20 1168 373 m20 1172 379 m20 1177 386 m20 1181 380 m20 1186 368 m20 1191 380 m20 1195 379 m20 1200 370 m20 1204 377 m20 1209
 379 m20 1213 380 m20 1218 387 m20 1222 371 m20 1227 374 m20 1231 370 m20 1236 375 m20 1240 372 m20 1245 370 m20 1250 381 m20 1254 373 m20 1259 370 m20 1263 374 m20 1268 370 m20 1272 367 m20 1277 372 m20 1281 374 m20 1286 367 m20 1290 362 m20 1295
 368 m20 1299 362 m20 1304 369 m20 1308 365 m20 1313 368 m20 1318 369 m20 1322 368 m20 1327 363 m20 1331 372 m20 1336 364 m20 1340 356 m20 1345 374 m20 1349 362 m20 1354 355 m20 1358 360 m20 1363 363 m20 1367 375 m20 1372 359 m20 1377 373 m20 1381
 372 m20 1386 360 m20 1390 368 m20 1395 388 m20 1399 348 m20 1404 345 m20 1408 378 m20 1413 359 m20 1417 350 m20 1422 357 m20 1426 370 m20 1431 343 m20 1435 366 m20 1440 358 m20 1445 327 m20 1449 352 m20 1454 347 m20 1458 339 m20 1463 374 m20 1467
 320 m20 1472 325 m20 1476 345 m20 1481 361 m20 1485 266 m20 1490 317 m20 1494 327 m20 1499 323 m20 1503 351 m20 1508 246 m20 1513 397 m20 1517 318 m20 1522 314 m20 1526 242 m20 1531 318 m20 1535 318 m20 1540 285 m20 1544 210 m20 1549 404 m20 1585
 301 m20 1590 399 m20 1594 383 m20 1599 559 m20 1603 544 m20 1612 257 m20 1617 600 m20 1621 444 m20 1626 364 m20 1630 325 m20 1635 583 m20 1640 533 m20 1644 375 m20 1649 427 m20 1653 405 m20 1658 307 m20 1662 389 m20 1667 363 m20 1671 429 m20 1676
 386 m20 1680 441 m20 1685 375 m20 1689 410 m20 1694 390 m20 1699 500 m20 1703 389 m20 1708 361 m20 1712 319 m20 1717 335 m20 1721 413 m20 1726 309 m20 1730 451 m20 1735 410 m20 1739 409 m20 1744 403 m20 1748 347 m20 1753 400 m20 1757 362 m20 1762
 342 m20 1767 421 m20 1771 336 m20 1776 423 m20 1780 429 m20 1785 508 m20 1789 457 m20 1794 466 m20 1798 392 m20 1803 427 m20 1807 451 m20 1812 402 m20 1816 383 m20 1821 443 m20 1826 410 m20 1830 339 m20 1835 374 m20 1839 327 m20 1844 275 m20 1848
 401 m20 1853 296 m20 1857 310 m20 1862 431 m20 1866 445 m20 1871 378 m20 1875 483 m20 1880 401 m20 1884 470 m20 1889 367 m20 1894 441 m20 1898 440 m20 1903 327 m20 1907 424 m20 1912 549 m20 1916 429 m20 1921 464 m20 1925 439 m20 1930 392 m20 1934
 379 m20 1939 433 m20 1943 365 m20 1948 391 m20 1953 482 m20 1957 335 m20 1962 384 m20 1966 419 m20 1971 368 m20 1975 533 m20 1980 412 m20 1984 388 m20 1989 349 m20 1993 465 m20 1998 409 m20 2002 462 m20 2007 373 m20 2011 466 m20 2016 438 m20 2021
 347 m20 2025 444 m20 2030 449 m20 2034 396 m20 2039 317 m20 cs 0 0 0 P13 setcolor 229 609 m 5 -47 d 4 -80 d 5 92 d 4 -91 d 5 -37 d 4 163 d 5 -52 d 4 -22 d 5 1 d 4 -49 d 5 6 d 4 44 d 5 -20 d 5 50 d 4 -44 d 5 -10 d 4 37 d 5 -47 d 4 1 d 5 74 d 4 -108 d
 5 17 d 4 32 d 5 -42 d 4 1 d 5 -6 d 4 43 d 5 -18 d 5 -41 d 4 34 d 5 -11 d 4 22 d 5 -58 d 4 36 d 5 -21 d 4 -31 d 5 22 d 4 -11 d 5 -3 d 4 -5 d 5 3 d 5 4 d 4 -9 d 5 -2 d 4 10 d 5 -11 d 4 -11 d 5 -8 d 4 8 d 5 3 d 4 -3 d 5 -6 d 4 4 d 5 -5 d 4 1 d 5 8 d 5
 -13 d 4 -5 d 5 -1 d 4 5 d 5 2 d 4 1 d 5 -9 d 4 1 d 5 4 d 4 9 d 5 -11 d 4 X 5 -12 d 5 2 d 4 10 d 5 1 d 4 X 5 -4 d 4 3 d 5 -5 d 4 4 d 5 -9 d 4 5 d 5 -5 d 4 X 5 2 d 4 X 5 -1 d 5 1 d 4 1 d 5 1 d 4 2 d 5 -2 d 4 -6 d 5 -1 d 4 8 d 5 -10 d 4 7 d 5 -6 d 4 7
 d 5 1 d 5 -15 d 4 9 d 5 3 d 4 -1 d 5 2 d 4 -6 d 5 1 d 4 -5 d 5 9 d 4 -3 d 5 -1 d 4 6 d 5 -9 d 4 2 d 5 12 d 5 -16 d 4 7 d 5 -3 d 4 2 d 5 X 4 -1 d 5 3 d 4 -3 d 5 3 d 4 -2 d 5 -4 d 9 X 5 8 d 4 -8 d 5 4 d 4 1 d 5 1 d 4 -3 d 5 -1 d 4 2 d 5 -4 d 4 X 5 2 d
 4 2 d 5 X 4 1 d 5 -2 d 5 -1 d 4 2 d 5 X 4 -4 d 5 1 d 4 -1 d 5 -1 d 4 3 d 5 -1 d 4 -5 d 5 9 d 4 -5 d 5 5 d 4 X 5 -1 d 5 -1 d 4 -5 d 5 9 d 4 X 5 -7 d 4 5 d 5 -4 d 4 1 d 5 3 d 4 -4 d 5 4 d 4 -6 d 5 -2 d 5 4 d 4 -5 d 5 4 d 4 -5 d 5 4 d 4 2 d 5 -4 d 4 3
 d 5 -1 d 4 X 5 3 d 4 3 d 5 -5 d 4 2 d 5 -5 d 5 8 d 4 -2 d 5 -6 d 4 -2 d 5 7 d 4 2 d 5 -8 d 4 1 d 5 2 d 4 -1 d 5 -2 d 4 -4 d 5 4 d 5 -1 d 4 9 d 5 -6 d 4 1 d 5 5 d 4 -8 d 5 X 4 7 d 5 -12 d 4 13 d 5 -10 d 4 6 d 5 7 d 4 -5 d 5 -12 d 5 12 d 4 -1 d 5 -9 d
 4 7 d 5 2 d 4 1 d 5 7 d 4 -16 d 5 3 d 4 -4 d 5 6 d 4 -4 d 5 -2 d 5 12 d 4 -9 d 5 -2 d 4 3 d 5 -4 d 4 -2 d 5 5 d 4 2 d 5 -8 d 4 -4 d 5 6 d 4 -6 d 5 7 d 4 -3 d 5 2 d 5 2 d 4 -1 d 5 -5 d 4 9 d 5 -7 d 4 -8 d 5 17 d 4 -12 d 5 -6 d 4 6 d 5 2 d 4 13 d 5
 -16 d 5 14 d 4 X 5 -12 d 4 9 d 5 21 d 4 -41 d 5 -3 d 4 35 d 5 -21 d 4 -7 d 5 9 d 4 14 d 5 -29 d 4 25 d 5 -7 d 5 -32 d 4 28 d 5 -4 d 4 -6 d 5 35 d 4 -53 d 5 5 d 4 19 d 5 23 d 4 -96 d 5 57 d 4 7 d 5 -2 d 4 47 d 5 -117 d 5 163 d 4 -73 d 5 -6 d 4 -62 d
 5 88 d 4 35 d 5 5 d 4 -102 d 5 275 d 4 -346 d 5 -100 d 4 446 d 19 X 4 -163 d 5 140 d 4 -41 d 5 64 d 9 X 4 -277 d 5 277 d 4 -56 d 5 -100 d 4 -62 d 5 218 d 5 X 4 -171 d 5 64 d 4 -30 d 5 -110 d 4 91 d 5 -33 d 4 70 d 5 -45 d 4 61 d 5 -77 d 4 38 d 5 -24
 d 5 132 d 4 -125 d 5 -38 d 4 -45 d 5 9 d 4 95 d 5 -122 d 4 164 d 5 -49 d 4 X 5 -11 d 4 -62 d 5 59 d 4 -41 d 5 -24 d 5 93 d 4 -97 d 5 100 d 4 4 d 5 96 d 4 -65 d 5 13 d 4 -85 d 5 43 d 4 23 d 5 -57 d 4 -18 d 5 64 d 5 -37 d 4 -81 d 5 39 d 4 -48 d 5 -64
 d 4 144 d 5 -115 d 4 18 d 5 130 d 4 28 d 5 -84 d 4 124 d 5 -95 d 4 80 d 5 -125 d 5 95 d 4 2 d 5 -135 d 4 109 d 5 125 d 4 -120 d 5 50 d 4 -35 d 5 -58 d 4 -15 d 5 65 d 4 -81 d 5 31 d 5 107 d 4 -169 d 5 56 d 4 42 d 5 -55 d 4 182 d 5 -141 d 4 -20 d 5
 -52 d 4 138 d 5 -61 d 4 60 d 5 -102 d 4 110 d 5 -36 d 5 -108 d 4 126 d 5 -4 d 4 -59 d 5 -100 d -86 Y -5 58 d -4 47 d -5 -14 d -4 -69 d -5 75 d -5 20 d -4 -75 d -5 75 d -4 -45 d -5 50 d -4 -94 d -5 26 d -4 29 d -5 91 d -4 -139 d -5 47 d -4 -29 d -5
 -41 d -4 125 d -5 -74 d -5 -21 d -4 54 d -5 -43 d -4 12 d -5 36 d -4 15 d -5 -21 d -4 94 d -5 -100 d -4 -83 d -5 89 d -4 5 d -5 -54 d -5 81 d -4 -57 d -5 69 d -4 -85 d -5 49 d -4 -1 d -5 -111 d -4 -10 d -5 94 d -4 -107 d -5 40 d -4 45 d -5 -30 d -4
 61 d -5 29 d -5 -56 d -4 21 d -5 39 d -4 -23 d -5 -29 d -4 64 d -5 -5 d -4 38 d -5 -63 d -4 -7 d -5 -76 d -4 74 d -5 -64 d -5 16 d -4 33 d -5 -45 d -4 49 d -5 X -4 2 d -5 34 d -4 -120 d -5 86 d -4 -61 d -5 -24 d -4 40 d -5 19 d -4 96 d -5 -89 d -5
 17 d -4 -32 d -5 55 d -4 -48 d -5 40 d -4 -62 d -5 18 d -4 -72 d -5 86 d -4 14 d -5 -41 d -4 130 d -5 15 d -5 -197 d -4 17 d -5 59 d -4 112 d -5 -265 d -4 294 d -5 -202 d -4 89 d -5 -142 d -4 -8 d -5 -57 d -4 147 d -5 -151 d -36 X -5 53 d -4 35 d -5
 -64 d -4 82 d -5 3 d -4 84 d -5 -139 d -5 92 d -4 -9 d -5 7 d -4 -13 d -5 -46 d -4 95 d -5 -8 d -4 -21 d -5 -7 d -4 57 d -5 -36 d -4 11 d -5 6 d -4 -23 d -5 29 d -5 11 d -4 -22 d -5 26 d -4 -12 d -5 -6 d -4 10 d -5 18 d -4 -30 d -5 2 d -4 40 d -5
 -20 d -4 -7 d -5 12 d -4 2 d -5 -14 d -5 16 d -4 -12 d -5 -2 d -4 -5 d -5 7 d -4 12 d -5 -17 d -4 8 d -5 8 d -4 -9 d -5 5 d -4 1 d -5 -1 d -5 -2 d -4 4 d -5 -7 d -4 6 d -5 -6 d -4 5 d -5 7 d -4 -2 d -5 -5 d -4 3 d -5 4 d -4 -3 d -5 2 d -4 9 d -5 -12
 d -5 3 d -4 3 d -5 -5 d -4 4 d -5 -3 d -4 16 d -5 -7 d -4 -1 d -5 -2 d -4 -6 d -5 9 d -4 X -5 -11 d -5 12 d -4 5 d -5 -6 d -4 -7 d -5 10 d -4 -13 d -5 13 d -4 -7 d -5 -1 d -4 9 d -5 -5 d -4 -1 d -5 5 d -4 -8 d -5 1 d -5 -4 d -4 5 d -5 1 d -4 1 d -5
 -2 d -4 -1 d -5 8 d -4 -1 d -5 -7 d -4 2 d -5 6 d -4 1 d -5 -7 d -5 5 d -4 -2 d -5 5 d -4 -3 d -5 -3 d -4 X -5 1 d -4 -3 d -5 4 d -4 -2 d -5 -4 d -4 5 d -5 -4 d -4 5 d -5 -3 d -5 1 d -4 6 d -5 -3 d -4 3 d -5 -3 d -4 -1 d -5 5 d -4 -5 d -5 6 d -4 1 d
 -5 -9 d -4 4 d -5 1 d -5 1 d -4 1 d -5 -6 d -4 6 d -5 -9 d -4 5 d -5 1 d -4 -3 d -5 X -4 2 d -5 -2 d -4 4 d -5 1 d -4 -2 d -5 1 d -5 2 d -4 -1 d -5 X -4 -2 d -5 -2 d -4 X -5 4 d -4 -2 d -5 1 d -4 3 d -5 -1 d -4 -1 d -5 -5 d -4 8 d -5 -7 d -9 X -5 4
 d -4 1 d -5 -3 d -4 3 d -5 -2 d -4 1 d -5 -1 d -4 -1 d -5 2 d -4 -6 d -5 15 d -5 -11 d -4 -2 d -5 8 d -4 -5 d -5 X -4 3 d -5 -8 d -4 4 d -5 X -4 5 d -5 -2 d -4 1 d -5 -3 d -4 -8 d -5 14 d -5 -1 d -4 -6 d -5 5 d -4 -7 d -5 10 d -4 -8 d -5 1 d -4 6 d
 -5 2 d -4 -2 d -5 -1 d -4 -1 d -5 -1 d -5 1 d -4 X -5 -3 d -4 1 d -5 4 d -4 -5 d -5 9 d -4 -4 d -5 5 d -4 -3 d -5 4 d -4 X -5 -1 d -4 -10 d -5 -2 d -5 12 d -4 X -5 10 d -4 -9 d -5 -3 d -4 -2 d -5 8 d -4 -1 d -5 -2 d -4 -5 d -5 1 d -4 5 d -5 12 d -5
 -8 d -4 -1 d -5 5 d -4 -4 d -5 5 d -4 2 d -5 -3 d -4 -7 d -5 6 d -4 10 d -5 10 d -4 -10 d -5 2 d -4 7 d -5 -3 d -5 -5 d -4 4 d -5 1 d -4 10 d -5 -21 d -4 27 d -5 18 d -4 -34 d -5 53 d -4 -23 d -5 8 d -4 -32 d -5 36 d -5 13 d -4 -39 d -5 5 d -4 -3 d
 -5 35 d -4 -31 d -5 -16 d -4 86 d -5 -63 d -4 -1 d -5 38 d -4 -33 d -5 9 d -4 28 d -5 -40 d -5 13 d -4 -38 d -5 -3 d -4 33 d -5 -8 d -4 11 d -5 81 d -4 -171 d -5 17 d -4 28 d -5 -58 d -4 20 d -5 -33 d FA
 gr  gr showpage
end
%%EOF
