%!PS-Adobe-2.0
%%Title: bm1plot-logo.ps
%%Creator: gnuplot 4.4 patchlevel 0
%%CreationDate: Tue Mar 26 11:27:05 2013
%%DocumentFonts: (atend)
%%BoundingBox: 50 50 554 770
%%Orientation: Landscape
%%Pages: (atend)
%%EndComments
%%BeginProlog
/gnudict 256 dict def
gnudict begin
%
% The following true/false flags may be edited by hand if desired.
% The unit line width and grayscale image gamma correction may also be changed.
%
/Color false def
/Blacktext false def
/Solid false def
/Dashlength 2 def
/Landscape true def
/Level1 false def
/Rounded false def
/ClipToBoundingBox false def
/TransparentPatterns false def
/gnulinewidth 10.000 def
/userlinewidth gnulinewidth def
/Gamma 1.0 def
%
/vshift -66 def
/dl1 {
  10.0 Dashlength mul mul
  Rounded { currentlinewidth 0.75 mul sub dup 0 le { pop 0.01 } if } if
} def
/dl2 {
  10.0 Dashlength mul mul
  Rounded { currentlinewidth 0.75 mul add } if
} def
/hpt_ 31.5 def
/vpt_ 31.5 def
/hpt hpt_ def
/vpt vpt_ def
Level1 {} {
/SDict 10 dict def
systemdict /pdfmark known not {
  userdict /pdfmark systemdict /cleartomark get put
} if
SDict begin [
  /Title (bm1plot-logo.ps)
  /Subject (gnuplot plot)
  /Creator (gnuplot 4.4 patchlevel 0)
  /Author (logan)
%  /Producer (gnuplot)
%  /Keywords ()
  /CreationDate (Tue Mar 26 11:27:05 2013)
  /DOCINFO pdfmark
end
} ifelse
/doclip {
  ClipToBoundingBox {
    newpath 50 50 moveto 554 50 lineto 554 770 lineto 50 770 lineto closepath
    clip
  } if
} def
%
% Gnuplot Prolog Version 4.4 (January 2010)
%
%/SuppressPDFMark true def
%
/M {moveto} bind def
/L {lineto} bind def
/R {rmoveto} bind def
/V {rlineto} bind def
/N {newpath moveto} bind def
/Z {closepath} bind def
/C {setrgbcolor} bind def
/f {rlineto fill} bind def
/Gshow {show} def   % May be redefined later in the file to support UTF-8
/vpt2 vpt 2 mul def
/hpt2 hpt 2 mul def
/Lshow {currentpoint stroke M 0 vshift R 
	Blacktext {gsave 0 setgray show grestore} {show} ifelse} def
/Rshow {currentpoint stroke M dup stringwidth pop neg vshift R
	Blacktext {gsave 0 setgray show grestore} {show} ifelse} def
/Cshow {currentpoint stroke M dup stringwidth pop -2 div vshift R 
	Blacktext {gsave 0 setgray show grestore} {show} ifelse} def
/UP {dup vpt_ mul /vpt exch def hpt_ mul /hpt exch def
  /hpt2 hpt 2 mul def /vpt2 vpt 2 mul def} def
/DL {Color {setrgbcolor Solid {pop []} if 0 setdash}
 {pop pop pop 0 setgray Solid {pop []} if 0 setdash} ifelse} def
/BL {stroke userlinewidth 2 mul setlinewidth
	Rounded {1 setlinejoin 1 setlinecap} if} def
/AL {stroke userlinewidth 2 div setlinewidth
	Rounded {1 setlinejoin 1 setlinecap} if} def
/UL {dup gnulinewidth mul /userlinewidth exch def
	dup 1 lt {pop 1} if 10 mul /udl exch def} def
/PL {stroke userlinewidth setlinewidth
	Rounded {1 setlinejoin 1 setlinecap} if} def
% Default Line colors
/LCw {1 1 1} def
/LCb {0 0 0} def
/LCa {0 0 0} def
/LC0 {1 0 0} def
/LC1 {0 1 0} def
/LC2 {0 0 1} def
/LC3 {1 0 1} def
/LC4 {0 1 1} def
/LC5 {1 1 0} def
/LC6 {0 0 0} def
/LC7 {1 0.3 0} def
/LC8 {0.5 0.5 0.5} def
% Default Line Types
/LTw {PL [] 1 setgray} def
/LTb {BL [] LCb DL} def
/LTa {AL [1 udl mul 2 udl mul] 0 setdash LCa setrgbcolor} def
/LT0 {PL [] LC0 DL} def
/LT1 {PL [4 dl1 2 dl2] LC1 DL} def
/LT2 {PL [2 dl1 3 dl2] LC2 DL} def
/LT3 {PL [1 dl1 1.5 dl2] LC3 DL} def
/LT4 {PL [6 dl1 2 dl2 1 dl1 2 dl2] LC4 DL} def
/LT5 {PL [3 dl1 3 dl2 1 dl1 3 dl2] LC5 DL} def
/LT6 {PL [2 dl1 2 dl2 2 dl1 6 dl2] LC6 DL} def
/LT7 {PL [1 dl1 2 dl2 6 dl1 2 dl2 1 dl1 2 dl2] LC7 DL} def
/LT8 {PL [2 dl1 2 dl2 2 dl1 2 dl2 2 dl1 2 dl2 2 dl1 4 dl2] LC8 DL} def
/Pnt {stroke [] 0 setdash gsave 1 setlinecap M 0 0 V stroke grestore} def
/Dia {stroke [] 0 setdash 2 copy vpt add M
  hpt neg vpt neg V hpt vpt neg V
  hpt vpt V hpt neg vpt V closepath stroke
  Pnt} def
/Pls {stroke [] 0 setdash vpt sub M 0 vpt2 V
  currentpoint stroke M
  hpt neg vpt neg R hpt2 0 V stroke
 } def
/Box {stroke [] 0 setdash 2 copy exch hpt sub exch vpt add M
  0 vpt2 neg V hpt2 0 V 0 vpt2 V
  hpt2 neg 0 V closepath stroke
  Pnt} def
/Crs {stroke [] 0 setdash exch hpt sub exch vpt add M
  hpt2 vpt2 neg V currentpoint stroke M
  hpt2 neg 0 R hpt2 vpt2 V stroke} def
/TriU {stroke [] 0 setdash 2 copy vpt 1.12 mul add M
  hpt neg vpt -1.62 mul V
  hpt 2 mul 0 V
  hpt neg vpt 1.62 mul V closepath stroke
  Pnt} def
/Star {2 copy Pls Crs} def
/BoxF {stroke [] 0 setdash exch hpt sub exch vpt add M
  0 vpt2 neg V hpt2 0 V 0 vpt2 V
  hpt2 neg 0 V closepath fill} def
/TriUF {stroke [] 0 setdash vpt 1.12 mul add M
  hpt neg vpt -1.62 mul V
  hpt 2 mul 0 V
  hpt neg vpt 1.62 mul V closepath fill} def
/TriD {stroke [] 0 setdash 2 copy vpt 1.12 mul sub M
  hpt neg vpt 1.62 mul V
  hpt 2 mul 0 V
  hpt neg vpt -1.62 mul V closepath stroke
  Pnt} def
/TriDF {stroke [] 0 setdash vpt 1.12 mul sub M
  hpt neg vpt 1.62 mul V
  hpt 2 mul 0 V
  hpt neg vpt -1.62 mul V closepath fill} def
/DiaF {stroke [] 0 setdash vpt add M
  hpt neg vpt neg V hpt vpt neg V
  hpt vpt V hpt neg vpt V closepath fill} def
/Pent {stroke [] 0 setdash 2 copy gsave
  translate 0 hpt M 4 {72 rotate 0 hpt L} repeat
  closepath stroke grestore Pnt} def
/PentF {stroke [] 0 setdash gsave
  translate 0 hpt M 4 {72 rotate 0 hpt L} repeat
  closepath fill grestore} def
/Circle {stroke [] 0 setdash 2 copy
  hpt 0 360 arc stroke Pnt} def
/CircleF {stroke [] 0 setdash hpt 0 360 arc fill} def
/C0 {BL [] 0 setdash 2 copy moveto vpt 90 450 arc} bind def
/C1 {BL [] 0 setdash 2 copy moveto
	2 copy vpt 0 90 arc closepath fill
	vpt 0 360 arc closepath} bind def
/C2 {BL [] 0 setdash 2 copy moveto
	2 copy vpt 90 180 arc closepath fill
	vpt 0 360 arc closepath} bind def
/C3 {BL [] 0 setdash 2 copy moveto
	2 copy vpt 0 180 arc closepath fill
	vpt 0 360 arc closepath} bind def
/C4 {BL [] 0 setdash 2 copy moveto
	2 copy vpt 180 270 arc closepath fill
	vpt 0 360 arc closepath} bind def
/C5 {BL [] 0 setdash 2 copy moveto
	2 copy vpt 0 90 arc
	2 copy moveto
	2 copy vpt 180 270 arc closepath fill
	vpt 0 360 arc} bind def
/C6 {BL [] 0 setdash 2 copy moveto
	2 copy vpt 90 270 arc closepath fill
	vpt 0 360 arc closepath} bind def
/C7 {BL [] 0 setdash 2 copy moveto
	2 copy vpt 0 270 arc closepath fill
	vpt 0 360 arc closepath} bind def
/C8 {BL [] 0 setdash 2 copy moveto
	2 copy vpt 270 360 arc closepath fill
	vpt 0 360 arc closepath} bind def
/C9 {BL [] 0 setdash 2 copy moveto
	2 copy vpt 270 450 arc closepath fill
	vpt 0 360 arc closepath} bind def
/C10 {BL [] 0 setdash 2 copy 2 copy moveto vpt 270 360 arc closepath fill
	2 copy moveto
	2 copy vpt 90 180 arc closepath fill
	vpt 0 360 arc closepath} bind def
/C11 {BL [] 0 setdash 2 copy moveto
	2 copy vpt 0 180 arc closepath fill
	2 copy moveto
	2 copy vpt 270 360 arc closepath fill
	vpt 0 360 arc closepath} bind def
/C12 {BL [] 0 setdash 2 copy moveto
	2 copy vpt 180 360 arc closepath fill
	vpt 0 360 arc closepath} bind def
/C13 {BL [] 0 setdash 2 copy moveto
	2 copy vpt 0 90 arc closepath fill
	2 copy moveto
	2 copy vpt 180 360 arc closepath fill
	vpt 0 360 arc closepath} bind def
/C14 {BL [] 0 setdash 2 copy moveto
	2 copy vpt 90 360 arc closepath fill
	vpt 0 360 arc} bind def
/C15 {BL [] 0 setdash 2 copy vpt 0 360 arc closepath fill
	vpt 0 360 arc closepath} bind def
/Rec {newpath 4 2 roll moveto 1 index 0 rlineto 0 exch rlineto
	neg 0 rlineto closepath} bind def
/Square {dup Rec} bind def
/Bsquare {vpt sub exch vpt sub exch vpt2 Square} bind def
/S0 {BL [] 0 setdash 2 copy moveto 0 vpt rlineto BL Bsquare} bind def
/S1 {BL [] 0 setdash 2 copy vpt Square fill Bsquare} bind def
/S2 {BL [] 0 setdash 2 copy exch vpt sub exch vpt Square fill Bsquare} bind def
/S3 {BL [] 0 setdash 2 copy exch vpt sub exch vpt2 vpt Rec fill Bsquare} bind def
/S4 {BL [] 0 setdash 2 copy exch vpt sub exch vpt sub vpt Square fill Bsquare} bind def
/S5 {BL [] 0 setdash 2 copy 2 copy vpt Square fill
	exch vpt sub exch vpt sub vpt Square fill Bsquare} bind def
/S6 {BL [] 0 setdash 2 copy exch vpt sub exch vpt sub vpt vpt2 Rec fill Bsquare} bind def
/S7 {BL [] 0 setdash 2 copy exch vpt sub exch vpt sub vpt vpt2 Rec fill
	2 copy vpt Square fill Bsquare} bind def
/S8 {BL [] 0 setdash 2 copy vpt sub vpt Square fill Bsquare} bind def
/S9 {BL [] 0 setdash 2 copy vpt sub vpt vpt2 Rec fill Bsquare} bind def
/S10 {BL [] 0 setdash 2 copy vpt sub vpt Square fill 2 copy exch vpt sub exch vpt Square fill
	Bsquare} bind def
/S11 {BL [] 0 setdash 2 copy vpt sub vpt Square fill 2 copy exch vpt sub exch vpt2 vpt Rec fill
	Bsquare} bind def
/S12 {BL [] 0 setdash 2 copy exch vpt sub exch vpt sub vpt2 vpt Rec fill Bsquare} bind def
/S13 {BL [] 0 setdash 2 copy exch vpt sub exch vpt sub vpt2 vpt Rec fill
	2 copy vpt Square fill Bsquare} bind def
/S14 {BL [] 0 setdash 2 copy exch vpt sub exch vpt sub vpt2 vpt Rec fill
	2 copy exch vpt sub exch vpt Square fill Bsquare} bind def
/S15 {BL [] 0 setdash 2 copy Bsquare fill Bsquare} bind def
/D0 {gsave translate 45 rotate 0 0 S0 stroke grestore} bind def
/D1 {gsave translate 45 rotate 0 0 S1 stroke grestore} bind def
/D2 {gsave translate 45 rotate 0 0 S2 stroke grestore} bind def
/D3 {gsave translate 45 rotate 0 0 S3 stroke grestore} bind def
/D4 {gsave translate 45 rotate 0 0 S4 stroke grestore} bind def
/D5 {gsave translate 45 rotate 0 0 S5 stroke grestore} bind def
/D6 {gsave translate 45 rotate 0 0 S6 stroke grestore} bind def
/D7 {gsave translate 45 rotate 0 0 S7 stroke grestore} bind def
/D8 {gsave translate 45 rotate 0 0 S8 stroke grestore} bind def
/D9 {gsave translate 45 rotate 0 0 S9 stroke grestore} bind def
/D10 {gsave translate 45 rotate 0 0 S10 stroke grestore} bind def
/D11 {gsave translate 45 rotate 0 0 S11 stroke grestore} bind def
/D12 {gsave translate 45 rotate 0 0 S12 stroke grestore} bind def
/D13 {gsave translate 45 rotate 0 0 S13 stroke grestore} bind def
/D14 {gsave translate 45 rotate 0 0 S14 stroke grestore} bind def
/D15 {gsave translate 45 rotate 0 0 S15 stroke grestore} bind def
/DiaE {stroke [] 0 setdash vpt add M
  hpt neg vpt neg V hpt vpt neg V
  hpt vpt V hpt neg vpt V closepath stroke} def
/BoxE {stroke [] 0 setdash exch hpt sub exch vpt add M
  0 vpt2 neg V hpt2 0 V 0 vpt2 V
  hpt2 neg 0 V closepath stroke} def
/TriUE {stroke [] 0 setdash vpt 1.12 mul add M
  hpt neg vpt -1.62 mul V
  hpt 2 mul 0 V
  hpt neg vpt 1.62 mul V closepath stroke} def
/TriDE {stroke [] 0 setdash vpt 1.12 mul sub M
  hpt neg vpt 1.62 mul V
  hpt 2 mul 0 V
  hpt neg vpt -1.62 mul V closepath stroke} def
/PentE {stroke [] 0 setdash gsave
  translate 0 hpt M 4 {72 rotate 0 hpt L} repeat
  closepath stroke grestore} def
/CircE {stroke [] 0 setdash 
  hpt 0 360 arc stroke} def
/Opaque {gsave closepath 1 setgray fill grestore 0 setgray closepath} def
/DiaW {stroke [] 0 setdash vpt add M
  hpt neg vpt neg V hpt vpt neg V
  hpt vpt V hpt neg vpt V Opaque stroke} def
/BoxW {stroke [] 0 setdash exch hpt sub exch vpt add M
  0 vpt2 neg V hpt2 0 V 0 vpt2 V
  hpt2 neg 0 V Opaque stroke} def
/TriUW {stroke [] 0 setdash vpt 1.12 mul add M
  hpt neg vpt -1.62 mul V
  hpt 2 mul 0 V
  hpt neg vpt 1.62 mul V Opaque stroke} def
/TriDW {stroke [] 0 setdash vpt 1.12 mul sub M
  hpt neg vpt 1.62 mul V
  hpt 2 mul 0 V
  hpt neg vpt -1.62 mul V Opaque stroke} def
/PentW {stroke [] 0 setdash gsave
  translate 0 hpt M 4 {72 rotate 0 hpt L} repeat
  Opaque stroke grestore} def
/CircW {stroke [] 0 setdash 
  hpt 0 360 arc Opaque stroke} def
/BoxFill {gsave Rec 1 setgray fill grestore} def
/Density {
  /Fillden exch def
  currentrgbcolor
  /ColB exch def /ColG exch def /ColR exch def
  /ColR ColR Fillden mul Fillden sub 1 add def
  /ColG ColG Fillden mul Fillden sub 1 add def
  /ColB ColB Fillden mul Fillden sub 1 add def
  ColR ColG ColB setrgbcolor} def
/BoxColFill {gsave Rec PolyFill} def
/PolyFill {gsave Density fill grestore grestore} def
/h {rlineto rlineto rlineto gsave closepath fill grestore} bind def
%
% PostScript Level 1 Pattern Fill routine for rectangles
% Usage: x y w h s a XX PatternFill
%	x,y = lower left corner of box to be filled
%	w,h = width and height of box
%	  a = angle in degrees between lines and x-axis
%	 XX = 0/1 for no/yes cross-hatch
%
/PatternFill {gsave /PFa [ 9 2 roll ] def
  PFa 0 get PFa 2 get 2 div add PFa 1 get PFa 3 get 2 div add translate
  PFa 2 get -2 div PFa 3 get -2 div PFa 2 get PFa 3 get Rec
  gsave 1 setgray fill grestore clip
  currentlinewidth 0.5 mul setlinewidth
  /PFs PFa 2 get dup mul PFa 3 get dup mul add sqrt def
  0 0 M PFa 5 get rotate PFs -2 div dup translate
  0 1 PFs PFa 4 get div 1 add floor cvi
	{PFa 4 get mul 0 M 0 PFs V} for
  0 PFa 6 get ne {
	0 1 PFs PFa 4 get div 1 add floor cvi
	{PFa 4 get mul 0 2 1 roll M PFs 0 V} for
 } if
  stroke grestore} def
%
/languagelevel where
 {pop languagelevel} {1} ifelse
 2 lt
	{/InterpretLevel1 true def}
	{/InterpretLevel1 Level1 def}
 ifelse
%
% PostScript level 2 pattern fill definitions
%
/Level2PatternFill {
/Tile8x8 {/PaintType 2 /PatternType 1 /TilingType 1 /BBox [0 0 8 8] /XStep 8 /YStep 8}
	bind def
/KeepColor {currentrgbcolor [/Pattern /DeviceRGB] setcolorspace} bind def
<< Tile8x8
 /PaintProc {0.5 setlinewidth pop 0 0 M 8 8 L 0 8 M 8 0 L stroke} 
>> matrix makepattern
/Pat1 exch def
<< Tile8x8
 /PaintProc {0.5 setlinewidth pop 0 0 M 8 8 L 0 8 M 8 0 L stroke
	0 4 M 4 8 L 8 4 L 4 0 L 0 4 L stroke}
>> matrix makepattern
/Pat2 exch def
<< Tile8x8
 /PaintProc {0.5 setlinewidth pop 0 0 M 0 8 L
	8 8 L 8 0 L 0 0 L fill}
>> matrix makepattern
/Pat3 exch def
<< Tile8x8
 /PaintProc {0.5 setlinewidth pop -4 8 M 8 -4 L
	0 12 M 12 0 L stroke}
>> matrix makepattern
/Pat4 exch def
<< Tile8x8
 /PaintProc {0.5 setlinewidth pop -4 0 M 8 12 L
	0 -4 M 12 8 L stroke}
>> matrix makepattern
/Pat5 exch def
<< Tile8x8
 /PaintProc {0.5 setlinewidth pop -2 8 M 4 -4 L
	0 12 M 8 -4 L 4 12 M 10 0 L stroke}
>> matrix makepattern
/Pat6 exch def
<< Tile8x8
 /PaintProc {0.5 setlinewidth pop -2 0 M 4 12 L
	0 -4 M 8 12 L 4 -4 M 10 8 L stroke}
>> matrix makepattern
/Pat7 exch def
<< Tile8x8
 /PaintProc {0.5 setlinewidth pop 8 -2 M -4 4 L
	12 0 M -4 8 L 12 4 M 0 10 L stroke}
>> matrix makepattern
/Pat8 exch def
<< Tile8x8
 /PaintProc {0.5 setlinewidth pop 0 -2 M 12 4 L
	-4 0 M 12 8 L -4 4 M 8 10 L stroke}
>> matrix makepattern
/Pat9 exch def
/Pattern1 {PatternBgnd KeepColor Pat1 setpattern} bind def
/Pattern2 {PatternBgnd KeepColor Pat2 setpattern} bind def
/Pattern3 {PatternBgnd KeepColor Pat3 setpattern} bind def
/Pattern4 {PatternBgnd KeepColor Landscape {Pat5} {Pat4} ifelse setpattern} bind def
/Pattern5 {PatternBgnd KeepColor Landscape {Pat4} {Pat5} ifelse setpattern} bind def
/Pattern6 {PatternBgnd KeepColor Landscape {Pat9} {Pat6} ifelse setpattern} bind def
/Pattern7 {PatternBgnd KeepColor Landscape {Pat8} {Pat7} ifelse setpattern} bind def
} def
%
%
%End of PostScript Level 2 code
%
/PatternBgnd {
  TransparentPatterns {} {gsave 1 setgray fill grestore} ifelse
} def
%
% Substitute for Level 2 pattern fill codes with
% grayscale if Level 2 support is not selected.
%
/Level1PatternFill {
/Pattern1 {0.250 Density} bind def
/Pattern2 {0.500 Density} bind def
/Pattern3 {0.750 Density} bind def
/Pattern4 {0.125 Density} bind def
/Pattern5 {0.375 Density} bind def
/Pattern6 {0.625 Density} bind def
/Pattern7 {0.875 Density} bind def
} def
%
% Now test for support of Level 2 code
%
Level1 {Level1PatternFill} {Level2PatternFill} ifelse
%
/Symbol-Oblique /Symbol findfont [1 0 .167 1 0 0] makefont
dup length dict begin {1 index /FID eq {pop pop} {def} ifelse} forall
currentdict end definefont pop
/MFshow {
   { dup 5 get 3 ge
     { 5 get 3 eq {gsave} {grestore} ifelse }
     {dup dup 0 get findfont exch 1 get scalefont setfont
     [ currentpoint ] exch dup 2 get 0 exch R dup 5 get 2 ne {dup dup 6
     get exch 4 get {Gshow} {stringwidth pop 0 R} ifelse }if dup 5 get 0 eq
     {dup 3 get {2 get neg 0 exch R pop} {pop aload pop M} ifelse} {dup 5
     get 1 eq {dup 2 get exch dup 3 get exch 6 get stringwidth pop -2 div
     dup 0 R} {dup 6 get stringwidth pop -2 div 0 R 6 get
     show 2 index {aload pop M neg 3 -1 roll neg R pop pop} {pop pop pop
     pop aload pop M} ifelse }ifelse }ifelse }
     ifelse }
   forall} def
/Gswidth {dup type /stringtype eq {stringwidth} {pop (n) stringwidth} ifelse} def
/MFwidth {0 exch { dup 5 get 3 ge { 5 get 3 eq { 0 } { pop } ifelse }
 {dup 3 get{dup dup 0 get findfont exch 1 get scalefont setfont
     6 get Gswidth pop add} {pop} ifelse} ifelse} forall} def
/MLshow { currentpoint stroke M
  0 exch R
  Blacktext {gsave 0 setgray MFshow grestore} {MFshow} ifelse } bind def
/MRshow { currentpoint stroke M
  exch dup MFwidth neg 3 -1 roll R
  Blacktext {gsave 0 setgray MFshow grestore} {MFshow} ifelse } bind def
/MCshow { currentpoint stroke M
  exch dup MFwidth -2 div 3 -1 roll R
  Blacktext {gsave 0 setgray MFshow grestore} {MFshow} ifelse } bind def
/XYsave    { [( ) 1 2 true false 3 ()] } bind def
/XYrestore { [( ) 1 2 true false 4 ()] } bind def
end
%%EndProlog
%%Page: 1 1
gnudict begin
gsave
doclip
50 50 translate
0.100 0.100 scale
90 rotate
0 -5040 translate
0 setgray
newpath
(Helvetica) findfont 200 scalefont setfont
1.000 UL
LTb
1100 840 M
63 0 V
5636 0 R
-63 0 V
stroke
980 840 M
[ [(Helvetica) 200.0 0.0 true true 0 ( 0)]
] -66.7 MRshow
1.000 UL
LTb
1100 919 M
31 0 V
5668 0 R
-31 0 V
1100 998 M
31 0 V
5668 0 R
-31 0 V
-5668 80 R
31 0 V
5668 0 R
-31 0 V
-5668 79 R
31 0 V
5668 0 R
-31 0 V
-5668 79 R
63 0 V
5636 0 R
-63 0 V
stroke
980 1236 M
[ [(Helvetica) 200.0 0.0 true true 0 ( 0.1)]
] -66.7 MRshow
1.000 UL
LTb
1100 1315 M
31 0 V
5668 0 R
-31 0 V
-5668 79 R
31 0 V
5668 0 R
-31 0 V
-5668 79 R
31 0 V
5668 0 R
-31 0 V
-5668 80 R
31 0 V
5668 0 R
-31 0 V
-5668 79 R
63 0 V
5636 0 R
-63 0 V
stroke
980 1632 M
[ [(Helvetica) 200.0 0.0 true true 0 ( 0.2)]
] -66.7 MRshow
1.000 UL
LTb
1100 1711 M
31 0 V
5668 0 R
-31 0 V
-5668 79 R
31 0 V
5668 0 R
-31 0 V
-5668 79 R
31 0 V
5668 0 R
-31 0 V
-5668 80 R
31 0 V
5668 0 R
-31 0 V
-5668 79 R
63 0 V
5636 0 R
-63 0 V
stroke
980 2028 M
[ [(Helvetica) 200.0 0.0 true true 0 ( 0.3)]
] -66.7 MRshow
1.000 UL
LTb
1100 2107 M
31 0 V
5668 0 R
-31 0 V
-5668 79 R
31 0 V
5668 0 R
-31 0 V
-5668 79 R
31 0 V
5668 0 R
-31 0 V
-5668 79 R
31 0 V
5668 0 R
-31 0 V
-5668 80 R
63 0 V
5636 0 R
-63 0 V
stroke
980 2424 M
[ [(Helvetica) 200.0 0.0 true true 0 ( 0.4)]
] -66.7 MRshow
1.000 UL
LTb
1100 2503 M
31 0 V
5668 0 R
-31 0 V
-5668 79 R
31 0 V
5668 0 R
-31 0 V
-5668 79 R
31 0 V
5668 0 R
-31 0 V
-5668 79 R
31 0 V
5668 0 R
-31 0 V
-5668 80 R
63 0 V
5636 0 R
-63 0 V
stroke
980 2820 M
[ [(Helvetica) 200.0 0.0 true true 0 ( 0.5)]
] -66.7 MRshow
1.000 UL
LTb
1100 2899 M
31 0 V
5668 0 R
-31 0 V
-5668 79 R
31 0 V
5668 0 R
-31 0 V
-5668 79 R
31 0 V
5668 0 R
-31 0 V
-5668 79 R
31 0 V
5668 0 R
-31 0 V
-5668 79 R
63 0 V
5636 0 R
-63 0 V
stroke
980 3215 M
[ [(Helvetica) 200.0 0.0 true true 0 ( 0.6)]
] -66.7 MRshow
1.000 UL
LTb
1100 3295 M
31 0 V
5668 0 R
-31 0 V
-5668 79 R
31 0 V
5668 0 R
-31 0 V
-5668 79 R
31 0 V
5668 0 R
-31 0 V
-5668 79 R
31 0 V
5668 0 R
-31 0 V
-5668 79 R
63 0 V
5636 0 R
-63 0 V
stroke
980 3611 M
[ [(Helvetica) 200.0 0.0 true true 0 ( 0.7)]
] -66.7 MRshow
1.000 UL
LTb
1100 3690 M
31 0 V
5668 0 R
-31 0 V
-5668 80 R
31 0 V
5668 0 R
-31 0 V
-5668 79 R
31 0 V
5668 0 R
-31 0 V
-5668 79 R
31 0 V
5668 0 R
-31 0 V
-5668 79 R
63 0 V
5636 0 R
-63 0 V
stroke
980 4007 M
[ [(Helvetica) 200.0 0.0 true true 0 ( 0.8)]
] -66.7 MRshow
1.000 UL
LTb
1100 4086 M
31 0 V
5668 0 R
-31 0 V
-5668 80 R
31 0 V
5668 0 R
-31 0 V
-5668 79 R
31 0 V
5668 0 R
-31 0 V
-5668 79 R
31 0 V
5668 0 R
-31 0 V
-5668 79 R
63 0 V
5636 0 R
-63 0 V
stroke
980 4403 M
[ [(Helvetica) 200.0 0.0 true true 0 ( 0.9)]
] -66.7 MRshow
1.000 UL
LTb
1100 4482 M
31 0 V
5668 0 R
-31 0 V
-5668 79 R
31 0 V
5668 0 R
-31 0 V
-5668 80 R
31 0 V
5668 0 R
-31 0 V
-5668 79 R
31 0 V
5668 0 R
-31 0 V
-5668 79 R
63 0 V
5636 0 R
-63 0 V
stroke
980 4799 M
[ [(Helvetica) 200.0 0.0 true true 0 ( 1)]
] -66.7 MRshow
1.000 UL
LTb
1100 840 M
0 63 V
0 3896 R
0 -63 V
stroke
1100 640 M
[ [(Helvetica) 200.0 0.0 true true 0 ( 0)]
] -66.7 MCshow
1.000 UL
LTb
1263 840 M
0 31 V
0 3928 R
0 -31 V
1426 840 M
0 31 V
0 3928 R
0 -31 V
1588 840 M
0 31 V
0 3928 R
0 -31 V
1751 840 M
0 31 V
0 3928 R
0 -31 V
1914 840 M
0 63 V
0 3896 R
0 -63 V
stroke
1914 640 M
[ [(Helvetica) 200.0 0.0 true true 0 ( 0.1)]
] -66.7 MCshow
1.000 UL
LTb
2077 840 M
0 31 V
0 3928 R
0 -31 V
2240 840 M
0 31 V
0 3928 R
0 -31 V
2403 840 M
0 31 V
0 3928 R
0 -31 V
2565 840 M
0 31 V
0 3928 R
0 -31 V
2728 840 M
0 63 V
0 3896 R
0 -63 V
stroke
2728 640 M
[ [(Helvetica) 200.0 0.0 true true 0 ( 0.2)]
] -66.7 MCshow
1.000 UL
LTb
2891 840 M
0 31 V
0 3928 R
0 -31 V
3054 840 M
0 31 V
0 3928 R
0 -31 V
3217 840 M
0 31 V
0 3928 R
0 -31 V
3380 840 M
0 31 V
0 3928 R
0 -31 V
3542 840 M
0 63 V
0 3896 R
0 -63 V
stroke
3542 640 M
[ [(Helvetica) 200.0 0.0 true true 0 ( 0.3)]
] -66.7 MCshow
1.000 UL
LTb
3705 840 M
0 31 V
0 3928 R
0 -31 V
3868 840 M
0 31 V
0 3928 R
0 -31 V
4031 840 M
0 31 V
0 3928 R
0 -31 V
4194 840 M
0 31 V
0 3928 R
0 -31 V
4357 840 M
0 63 V
0 3896 R
0 -63 V
stroke
4357 640 M
[ [(Helvetica) 200.0 0.0 true true 0 ( 0.4)]
] -66.7 MCshow
1.000 UL
LTb
4519 840 M
0 31 V
0 3928 R
0 -31 V
4682 840 M
0 31 V
0 3928 R
0 -31 V
4845 840 M
0 31 V
0 3928 R
0 -31 V
5008 840 M
0 31 V
0 3928 R
0 -31 V
5171 840 M
0 63 V
0 3896 R
0 -63 V
stroke
5171 640 M
[ [(Helvetica) 200.0 0.0 true true 0 ( 0.5)]
] -66.7 MCshow
1.000 UL
LTb
5334 840 M
0 31 V
0 3928 R
0 -31 V
5496 840 M
0 31 V
0 3928 R
0 -31 V
5659 840 M
0 31 V
0 3928 R
0 -31 V
5822 840 M
0 31 V
0 3928 R
0 -31 V
5985 840 M
0 63 V
0 3896 R
0 -63 V
stroke
5985 640 M
[ [(Helvetica) 200.0 0.0 true true 0 ( 0.6)]
] -66.7 MCshow
1.000 UL
LTb
6148 840 M
0 31 V
0 3928 R
0 -31 V
6311 840 M
0 31 V
0 3928 R
0 -31 V
6473 840 M
0 31 V
0 3928 R
0 -31 V
6636 840 M
0 31 V
0 3928 R
0 -31 V
6799 840 M
0 63 V
0 3896 R
0 -63 V
stroke
6799 640 M
[ [(Helvetica) 200.0 0.0 true true 0 ( 0.7)]
] -66.7 MCshow
1.000 UL
LTb
1.000 UL
LTb
1100 4799 N
0 -3959 V
5699 0 V
0 3959 V
-5699 0 V
Z stroke
LCb setrgbcolor
280 2819 M
currentpoint gsave translate -270 rotate 0 0 moveto
[ [(Helvetica) 200.0 0.0 true true 0 (BR)]
[(Helvetica) 160.0 -60.0 true true 0 (new)]
] -46.7 MCshow
grestore
LTb
LCb setrgbcolor
LTb
LCb setrgbcolor
3949 340 M
[ [(Helvetica) 200.0 0.0 true true 0 (\(C'\))]
[(Helvetica) 160.0 100.0 true true 0 (2)]
] -86.7 MCshow
LTb
LCb setrgbcolor
LTb
1.000 UP
5171 4086 M
[ [(Symbol) 200.0 0.0 true true 0 (m)]
[(Helvetica) 200.0 0.0 true true 0 (' = 0.1)]
] -66.7 MRshow
5415 3374 M
[ [(Helvetica) 200.0 0.0 true true 0 (0.2)]
] -66.7 MRshow
6066 2899 M
[ [(Helvetica) 200.0 0.0 true true 0 (0.3)]
] -66.7 MRshow
5496 1909 M
[ [(Helvetica) 200.0 0.0 true true 0 (0.4)]
] -66.7 MRshow
5985 1553 M
[ [(Helvetica) 200.0 0.0 true true 0 (0.5)]
] -66.7 MRshow
6392 1196 M
[ [(Helvetica) 200.0 0.0 true true 0 (0.6)]
] -66.7 MRshow
3542 4443 M
[ [(Symbol) 200.0 0.0 true true 0 (G)]
[(Helvetica) 200.0 0.0 true true 0 ('/)]
[(Symbol) 200.0 0.0 true true 0 (G)]
[(Helvetica) 160.0 -60.0 true true 0 (SM)]
[(Helvetica) 200.0 0.0 true true 0 ( = 5)]
] -46.7 MRshow
2403 4086 M
[ [(Helvetica) 200.0 0.0 true true 0 (1)]
] -66.7 MRshow
2158 3651 M
[ [(Helvetica) 200.0 0.0 true true 0 (0.5)]
] -66.7 MRshow
1507 3176 M
[ [(Helvetica) 200.0 0.0 true true 0 (0.1)]
] -66.7 MLshow
6880 4799 M
currentpoint gsave translate -270 rotate 0 0 moveto
[ [(Helvetica) 140.0 0.0 true true 0 (LHC HIGGS XS WG 2013)]
] -66.7 MRshow
grestore
1.000 UL
LTb
% Begin plot #1
1.000 UL
LT0
/Helvetica findfont 200 scalefont setfont
1914 840 M
21 99 V
20 90 V
2 9 V
23 99 V
25 99 V
25 99 V
28 99 V
29 99 V
10 34 V
21 65 V
33 99 V
35 99 V
37 99 V
17 42 V
23 57 V
43 99 V
47 99 V
29 59 V
21 40 V
54 99 V
59 99 V
9 14 V
55 85 V
71 99 V
16 21 V
61 78 V
82 94 V
4 4 V
95 99 V
43 42 V
64 57 V
79 67 V
40 32 V
102 76 V
34 23 V
109 71 V
46 28 V
96 55 V
83 44 V
60 30 V
142 66 V
7 3 V
135 57 V
112 42 V
31 12 V
142 49 V
123 38 V
20 6 V
142 41 V
143 38 V
56 14 V
86 21 V
143 32 V
142 30 V
82 16 V
61 12 V
142 26 V
143 24 V
142 23 V
93 14 V
50 7 V
142 21 V
143 19 V
142 18 V
143 17 V
142 16 V
14 1 V
129 14 V
142 14 V
% End plot #1
% Begin plot #2
/Helvetica findfont 200 scalefont setfont
2728 840 M
42 99 V
40 90 V
4 9 V
46 99 V
49 99 V
43 83 V
9 16 V
55 99 V
58 99 V
21 34 V
40 65 V
66 99 V
36 52 V
34 47 V
75 99 V
34 42 V
46 57 V
86 99 V
10 10 V
83 89 V
60 59 V
40 40 V
102 93 V
7 6 V
118 99 V
17 14 V
112 85 V
31 22 V
109 77 V
33 21 V
123 78 V
20 12 V
142 82 V
9 4 V
stroke 4528 2918 M
134 71 V
56 28 V
86 42 V
127 57 V
16 7 V
142 60 V
82 32 V
61 24 V
142 52 V
68 23 V
75 25 V
142 46 V
93 28 V
50 15 V
142 40 V
143 38 V
23 6 V
119 30 V
143 34 V
142 32 V
14 3 V
129 28 V
142 29 V
% End plot #2
% Begin plot #3
/Helvetica findfont 200 scalefont setfont
3542 840 M
63 99 V
60 90 V
6 9 V
69 99 V
67 90 V
7 9 V
77 99 V
58 71 V
24 28 V
88 99 V
31 34 V
61 65 V
81 82 V
18 17 V
105 99 V
20 18 V
92 81 V
50 42 V
70 57 V
73 56 V
56 43 V
86 62 V
54 37 V
89 59 V
61 40 V
81 50 V
82 49 V
61 35 V
116 64 V
26 14 V
143 73 V
24 12 V
118 56 V
93 43 V
50 21 V
142 61 V
41 17 V
102 40 V
142 54 V
13 4 V
130 47 V
142 48 V
14 4 V
129 42 V
142 43 V
% End plot #3
% Begin plot #4
/Helvetica findfont 200 scalefont setfont
4357 840 M
20 25 V
63 74 V
79 90 V
9 9 V
93 99 V
41 42 V
56 57 V
86 83 V
18 16 V
109 99 V
16 13 V
100 86 V
42 34 V
82 65 V
61 47 V
70 52 V
72 52 V
68 47 V
75 50 V
75 49 V
67 42 V
93 57 V
50 29 V
123 70 V
19 10 V
143 77 V
23 12 V
119 59 V
82 40 V
61 28 V
142 65 V
14 6 V
129 55 V
107 44 V
stroke 6764 2523 M
35 14 V
% End plot #4
% Begin plot #5
/Helvetica findfont 200 scalefont setfont
5171 840 M
61 59 V
43 40 V
99 90 V
11 9 V
116 99 V
16 13 V
106 86 V
36 28 V
93 71 V
50 36 V
87 63 V
55 38 V
90 61 V
53 34 V
101 65 V
41 25 V
124 74 V
19 11 V
142 80 V
14 8 V
129 69 V
58 30 V
84 42 V
% End plot #5
% Begin plot #6
/Helvetica findfont 200 scalefont setfont
5985 840 M
102 81 V
23 18 V
119 90 V
13 9 V
130 92 V
9 7 V
133 90 V
14 9 V
129 83 V
26 16 V
116 71 V
% End plot #6
% Begin plot #7
stroke
LT1
/Helvetica findfont 200 scalefont setfont
1914 840 M
-20 99 V
-21 99 V
-20 99 V
-20 99 V
-21 99 V
-20 99 V
-20 99 V
-21 99 V
-20 99 V
-20 99 V
-21 99 V
-20 98 V
0 1 V
-20 99 V
-21 99 V
-20 99 V
-21 99 V
-20 99 V
-20 99 V
-21 98 V
0 1 V
-20 99 V
-20 98 V
-21 99 V
-20 99 V
-20 99 V
-21 99 V
-20 99 V
-20 99 V
-21 99 V
-20 99 V
-20 99 V
-21 99 V
-20 99 V
-21 99 V
-20 99 V
-20 99 V
-21 99 V
-20 99 V
-20 99 V
-21 99 V
% End plot #7
% Begin plot #8
/Helvetica findfont 200 scalefont setfont
5171 840 M
-82 79 V
-20 20 V
-102 99 V
-20 19 V
-82 80 V
-61 59 V
-40 40 V
-102 99 V
-102 99 V
-41 39 V
-61 60 V
-81 79 V
-20 20 V
-102 99 V
-21 19 V
-81 80 V
-61 58 V
-41 41 V
-102 98 V
0 1 V
-101 99 V
-41 38 V
-61 61 V
-81 78 V
-21 21 V
-102 99 V
-20 19 V
-81 80 V
-61 58 V
-41 41 V
-102 98 V
0 1 V
-102 99 V
-40 38 V
-61 60 V
-82 79 V
-20 20 V
-102 99 V
-20 19 V
-82 80 V
-61 58 V
-40 41 V
-102 99 V
-102 99 V
-41 38 V
-61 61 V
-81 78 V
-21 21 V
-101 99 V
-21 18 V
-81 81 V
-61 57 V
-41 42 V
-102 99 V
-101 99 V
-41 35 V
-61 64 V
-82 76 V
-20 23 V
-102 99 V
-20 14 V
-81 85 V
stroke 1304 4601 M
-62 42 V
-40 57 V
% End plot #8
% Begin plot #9
/Helvetica findfont 200 scalefont setfont
6798 2028 M
1 -1 V
-1 1 R
-141 68 V
-62 31 V
-81 38 V
-122 61 V
-20 9 V
-143 69 V
-41 21 V
-101 48 V
-102 51 V
-41 19 V
-142 69 V
-21 11 V
-122 58 V
-81 41 V
-61 28 V
-143 70 V
0 1 V
-142 68 V
-61 31 V
-82 38 V
-122 60 V
-20 10 V
-143 69 V
-40 20 V
-102 49 V
-102 50 V
-41 19 V
-142 70 V
-20 10 V
-123 58 V
-81 41 V
-61 29 V
-143 70 V
-142 68 V
-61 31 V
-81 38 V
-123 61 V
-20 9 V
-142 69 V
-41 21 V
-102 47 V
-102 52 V
-40 18 V
-143 70 V
-20 11 V
-122 57 V
-82 42 V
-61 27 V
-142 72 V
-143 66 V
-61 33 V
-81 35 V
-122 64 V
-21 8 V
-142 68 V
-41 23 V
-102 43 V
-101 56 V
-41 14 V
-143 71 V
-20 14 V
-122 42 V
-81 57 V
% End plot #9
% Begin plot #10
/Helvetica findfont 200 scalefont setfont
6229 4299 M
-41 5 V
-101 8 V
-143 12 V
-142 13 V
-143 13 V
-142 14 V
-143 16 V
-142 16 V
-61 7 V
-82 6 V
-142 11 V
-143 12 V
-142 14 V
-143 14 V
-142 15 V
-143 17 V
-81 10 V
-61 4 V
-143 10 V
-142 11 V
-142 13 V
-143 14 V
-142 15 V
-143 18 V
-102 14 V
-40 2 V
-143 8 V
-142 9 V
-143 11 V
-142 12 V
-143 16 V
-142 20 V
-122 21 V
6229 4299 M
143 -16 V
stroke 6372 4283 M
142 -15 V
143 -14 V
142 -14 V
% End plot #10
stroke
LTb
1100 4799 N
0 -3959 V
5699 0 V
0 3959 V
-5699 0 V
Z stroke
1.000 UP
1.000 UL
LTb
stroke
grestore
end
showpage
%%Trailer
%%DocumentFonts: Symbol Helvetica
%%Pages: 1
