%!PS-Adobe-3.0 EPSF-3.0
%%BoundingBox: (atend)
%%LanguageLevel: 2
%%Creator: Grace-5.1.22
%%CreationDate: Wed Nov 30 10:20:06 2011
%%DocumentData: Clean8Bit
%%Orientation: Portrait
%%Title: /home/pcl302a/heinemey/plot/grace/2011/lhc-higgs-br/mhmax_tb10_BR-h0.grace
%%For: heinemey
%%DocumentNeededResources: (atend)
%%EndComments
%%BeginProlog
/m {moveto} def
/l {lineto} def
/s {stroke} def
/n {newpath} def
/c {closepath} def
/RL {rlineto} def
/SLW {setlinewidth} def
/GS {gsave} def
/GR {grestore} def
/SC {setcolor} def
/SGRY {setgray} def
/SRGB {setrgbcolor} def
/SD {setdash} def
/SLC {setlinecap} def
/SLJ {setlinejoin} def
/SCS {setcolorspace} def
/FFSF {findfont setfont} def
/CC {concat} def
/PXL {n m 0 0 RL s} def
/Color0 {1.0000 1.0000 1.0000} def
/Color1 {0.0000 0.0000 0.0000} def
/Color2 {1.0000 0.0000 0.0000} def
/Color3 {0.0000 1.0000 0.0000} def
/Color4 {0.0000 0.0000 1.0000} def
/Color5 {1.0000 1.0000 0.0000} def
/Color6 {0.7373 0.5608 0.5608} def
/Color7 {0.8627 0.8627 0.8627} def
/Color8 {0.5804 0.0000 0.8275} def
/Color9 {0.0000 1.0000 1.0000} def
/Color10 {1.0000 0.0000 1.0000} def
/Color11 {1.0000 0.6471 0.0000} def
/Color12 {0.4471 0.1294 0.7373} def
/Color13 {0.4039 0.0275 0.2824} def
/Color14 {0.2510 0.8784 0.8157} def
/Color15 {0.0000 0.5451 0.0000} def
/Color16 {0.7529 0.7529 0.7529} def
/Color17 {0.5059 0.5059 0.5059} def
/Color18 {0.2588 0.2588 0.2588} def
/PTRN {
 /pat_bits exch def 
 <<
  /PaintType 2
  /PatternType 1 /TilingType 1
  /BBox[0 0 16 16]
  /XStep 16 /YStep 16
  /PaintProc {
   pop
   16 16 true [-1 0 0 -1 16 16] pat_bits imagemask
  }
 >>
 [0.0016 0 0 0.0016 0 0]
 makepattern
} def
/Pattern0 {<0000000000000000000000000000000000000000000000000000000000000000> PTRN} bind def
/Pattern1 {<ffffffffffffffffffffffffffffffffffffffffffffffffffffffffffffffff> PTRN} bind def
/Pattern2 {<eeeeffffbbbbffffeeeeffffbbbbffffeeeeffffbbbbffffeeeeffffbbbbffff> PTRN} bind def
/Pattern3 {<eeeebbbbeeeebbbbeeeebbbbeeeebbbbeeeebbbbeeeebbbbeeeebbbbeeeebbbb> PTRN} bind def
/Pattern4 {<5555aaaa5555aaaa5555aaaa5555aaaa5555aaaa5555aaaa5555aaaa5555aaaa> PTRN} bind def
/Pattern5 {<1111444411114444111144441111444411114444111144441111444411114444> PTRN} bind def
/Pattern6 {<1111000044440000111100004444000011110000444400001111000044440000> PTRN} bind def
/Pattern7 {<1010000000000000010100000000000010100000000000000101000000000000> PTRN} bind def
/Pattern8 {<0000000000000000000000000000000000000000000000000000000000000000> PTRN} bind def
/Pattern9 {<1e1e0f0f8787c3c3e1e1f0f078783c3c1e1e0f0f8787c3c3e1e1f0f078783c3c> PTRN} bind def
/Pattern10 {<7878f0f0e1e1c3c387870f0f1e1e3c3c7878f0f0e1e1c3c387870f0f1e1e3c3c> PTRN} bind def
/Pattern11 {<3333333333333333333333333333333333333333333333333333333333333333> PTRN} bind def
/Pattern12 {<ffffffff00000000ffffffff00000000ffffffff00000000ffffffff00000000> PTRN} bind def
/Pattern13 {<8181424224241818181824244242818181814242242418181818242442428181> PTRN} bind def
/Pattern14 {<8080404020201010080804040202010180804040202010100808040402020101> PTRN} bind def
/Pattern15 {<0101020204040808101020204040808001010202040408081010202040408080> PTRN} bind def
/Pattern16 {<2222222222222222222222222222222222222222222222222222222222222222> PTRN} bind def
/Pattern17 {<0000ffff000000000000ffff000000000000ffff000000000000ffff00000000> PTRN} bind def
/Pattern18 {<2222ffff222222222222ffff222222222222ffff222222222222ffff22222222> PTRN} bind def
/Pattern19 {<ffffffff33333333ffffffff33333333ffffffff33333333ffffffff33333333> PTRN} bind def
/Pattern20 {<0f0f0f0f0f0f0f0ff0f0f0f0f0f0f0f00f0f0f0f0f0f0f0ff0f0f0f0f0f0f0f0> PTRN} bind def
/Pattern21 {<ff00ff00ff00ff00ff00ff00ff00ff0000ff00ff00ff00ff00ff00ff00ff00ff> PTRN} bind def
/Pattern22 {<8001800180018001800180018001ffffffff8001800180018001800180018001> PTRN} bind def
/Pattern23 {<c003c003c003c003c003c003ffffffffffffffffc003c003c003c003c003c003> PTRN} bind def
/Pattern24 {<040404040404ffff404040404040ffff040404040404ffff404040404040ffff> PTRN} bind def
/Pattern25 {<180018001800180018001800ffffffff001800180018001800180018ffffffff> PTRN} bind def
/Pattern26 {<1111b8b87c7c3a3a1111a3a3c7c78b8b1111b8b87c7c3a3a1111a3a3c7c78b8b> PTRN} bind def
/Pattern27 {<101010102828c7c70101010182827c7c101010102828c7c70101010182827c7c> PTRN} bind def
/Pattern28 {<1c1c121211112121c1c12121111112121c1c121211112121c1c1212111111212> PTRN} bind def
/Pattern29 {<3e3e414180808080e3e31414080808083e3e414180808080e3e3141408080808> PTRN} bind def
/Pattern30 {<4848888884848383848488884848383848488888848483838484888848483838> PTRN} bind def
/Pattern31 {<03030404080808080c0c12122121c0c003030404080808080c0c12122121c0c0> PTRN} bind def
/ellipsedict 8 dict def
ellipsedict /mtrx matrix put
/EARC {
 ellipsedict begin
  /endangle exch def
  /startangle exch def
  /yrad exch def
  /xrad exch def
  /y exch def
  /x exch def
  /savematrix mtrx currentmatrix def
  x y translate
  xrad yrad scale
  0 0 1 startangle endangle arc
  savematrix setmatrix
 end
} def
/TL {
  /kcomp exch def
  /linewidth exch def
  /offset exch def
  GS
  0 offset rmoveto
  linewidth SLW
  dup stringwidth exch kcomp add exch RL s
  GR
} def
/KINIT
{
 /kvector exch def
 /kid 0 def
} def
/KPROC
{
 pop pop
 kvector kid get
 0 rmoveto
 /kid 1 kid add def
} def
/DefEncoding [
 /.notdef
 /.notdef
 /.notdef
 /.notdef
 /.notdef
 /.notdef
 /.notdef
 /.notdef
 /.notdef
 /.notdef
 /.notdef
 /.notdef
 /.notdef
 /.notdef
 /.notdef
 /.notdef
 /.notdef
 /.notdef
 /.notdef
 /.notdef
 /.notdef
 /.notdef
 /.notdef
 /.notdef
 /.notdef
 /.notdef
 /.notdef
 /.notdef
 /.notdef
 /.notdef
 /.notdef
 /.notdef
 /space
 /exclam
 /quotedbl
 /numbersign
 /dollar
 /percent
 /ampersand
 /quoteright
 /parenleft
 /parenright
 /asterisk
 /plus
 /comma
 /hyphen
 /period
 /slash
 /zero
 /one
 /two
 /three
 /four
 /five
 /six
 /seven
 /eight
 /nine
 /colon
 /semicolon
 /less
 /equal
 /greater
 /question
 /at
 /A
 /B
 /C
 /D
 /E
 /F
 /G
 /H
 /I
 /J
 /K
 /L
 /M
 /N
 /O
 /P
 /Q
 /R
 /S
 /T
 /U
 /V
 /W
 /X
 /Y
 /Z
 /bracketleft
 /backslash
 /bracketright
 /asciicircum
 /underscore
 /grave
 /a
 /b
 /c
 /d
 /e
 /f
 /g
 /h
 /i
 /j
 /k
 /l
 /m
 /n
 /o
 /p
 /q
 /r
 /s
 /t
 /u
 /v
 /w
 /x
 /y
 /z
 /braceleft
 /bar
 /braceright
 /asciitilde
 /.notdef
 /.notdef
 /.notdef
 /.notdef
 /.notdef
 /.notdef
 /.notdef
 /.notdef
 /.notdef
 /.notdef
 /.notdef
 /.notdef
 /.notdef
 /.notdef
 /.notdef
 /.notdef
 /.notdef
 /.notdef
 /.notdef
 /.notdef
 /.notdef
 /.notdef
 /.notdef
 /.notdef
 /.notdef
 /.notdef
 /.notdef
 /.notdef
 /.notdef
 /.notdef
 /.notdef
 /.notdef
 /.notdef
 /space
 /exclamdown
 /cent
 /sterling
 /currency
 /yen
 /brokenbar
 /section
 /dieresis
 /copyright
 /ordfeminine
 /guillemotleft
 /logicalnot
 /hyphen
 /registered
 /macron
 /degree
 /plusminus
 /twosuperior
 /threesuperior
 /acute
 /mu
 /paragraph
 /periodcentered
 /cedilla
 /onesuperior
 /ordmasculine
 /guillemotright
 /onequarter
 /onehalf
 /threequarters
 /questiondown
 /Agrave
 /Aacute
 /Acircumflex
 /Atilde
 /Adieresis
 /Aring
 /AE
 /Ccedilla
 /Egrave
 /Eacute
 /Ecircumflex
 /Edieresis
 /Igrave
 /Iacute
 /Icircumflex
 /Idieresis
 /Eth
 /Ntilde
 /Ograve
 /Oacute
 /Ocircumflex
 /Otilde
 /Odieresis
 /multiply
 /Oslash
 /Ugrave
 /Uacute
 /Ucircumflex
 /Udieresis
 /Yacute
 /Thorn
 /germandbls
 /agrave
 /aacute
 /acircumflex
 /atilde
 /adieresis
 /aring
 /ae
 /ccedilla
 /egrave
 /eacute
 /ecircumflex
 /edieresis
 /igrave
 /iacute
 /icircumflex
 /idieresis
 /eth
 /ntilde
 /ograve
 /oacute
 /ocircumflex
 /otilde
 /odieresis
 /divide
 /oslash
 /ugrave
 /uacute
 /ucircumflex
 /udieresis
 /yacute
 /thorn
 /ydieresis
] def
%%EndProlog
%%BeginSetup
%%EndSetup
612.00 612.00 scale
[/DeviceRGB] SCS
Color2 SC
[] 0 SD
0.0045 SLW
0 SLC
0 SLJ
n
0.1500 0.8919 m
0.1657 0.8918 l
0.1814 0.8916 l
0.1971 0.8915 l
0.2127 0.8912 l
0.2284 0.8905 l
0.2441 0.8892 l
0.2598 0.8874 l
0.2755 0.8853 l
0.2912 0.8830 l
0.3069 0.8807 l
0.3225 0.8785 l
0.3382 0.8763 l
0.3539 0.8742 l
0.3696 0.8722 l
0.3853 0.8704 l
0.4794 0.8621 l
0.5108 0.8601 l
0.5422 0.8583 l
0.5735 0.8568 l
0.6049 0.8555 l
0.6363 0.8543 l
0.6676 0.8533 l
0.6990 0.8524 l
0.7304 0.8516 l
0.7618 0.8507 l
0.7931 0.8500 l
0.8245 0.8493 l
0.8559 0.8487 l
0.8873 0.8482 l
0.9186 0.8475 l
0.9500 0.8471 l
s
[/DeviceRGB] SCS
Color3 SC
n
0.1903 0.1499 m
0.1971 0.1820 l
0.2127 0.2660 l
0.2284 0.3423 l
0.2441 0.3998 l
0.2598 0.4407 l
0.2755 0.4703 l
0.2912 0.4925 l
0.3069 0.5094 l
0.3225 0.5227 l
0.3382 0.5334 l
0.3539 0.5421 l
0.3696 0.5493 l
0.3853 0.5553 l
0.4794 0.5769 l
0.5108 0.5810 l
0.5422 0.5844 l
0.5735 0.5871 l
0.6049 0.5894 l
0.6363 0.5913 l
0.6676 0.5929 l
0.6990 0.5943 l
0.7304 0.5955 l
0.7618 0.5967 l
0.7931 0.5977 l
0.8245 0.5986 l
0.8559 0.5994 l
0.8873 0.6001 l
0.9186 0.6010 l
0.9500 0.6014 l
s
[/DeviceRGB] SCS
Color4 SC
n
0.1500 0.7058 m
0.1657 0.7073 l
0.1814 0.7087 l
0.1971 0.7099 l
0.2127 0.7108 l
0.2284 0.7107 l
0.2441 0.7096 l
0.2598 0.7080 l
0.2755 0.7060 l
0.2912 0.7039 l
0.3069 0.7018 l
0.3225 0.6997 l
0.3382 0.6977 l
0.3539 0.6958 l
0.3696 0.6940 l
0.3853 0.6924 l
0.4794 0.6844 l
0.5108 0.6826 l
0.5422 0.6810 l
0.5735 0.6796 l
0.6049 0.6785 l
0.6363 0.6775 l
0.6676 0.6766 l
0.6990 0.6759 l
0.7304 0.6753 l
0.7618 0.6748 l
0.7931 0.6744 l
0.8245 0.6740 l
0.8559 0.6737 l
0.8873 0.6734 l
0.9186 0.6734 l
0.9500 0.6730 l
s
[/DeviceRGB] SCS
Color5 SC
n
0.1500 0.2447 m
0.1657 0.2462 l
0.1814 0.2475 l
0.1971 0.2487 l
0.2127 0.2496 l
0.2284 0.2495 l
0.2441 0.2484 l
0.2598 0.2468 l
0.2755 0.2448 l
0.2912 0.2427 l
0.3069 0.2406 l
0.3225 0.2385 l
0.3382 0.2365 l
0.3539 0.2346 l
0.3696 0.2328 l
0.3853 0.2311 l
0.4794 0.2232 l
0.5108 0.2213 l
0.5422 0.2197 l
0.5735 0.2184 l
0.6049 0.2172 l
0.6363 0.2162 l
0.6676 0.2154 l
0.6990 0.2146 l
0.7304 0.2140 l
0.7618 0.2136 l
0.7931 0.2132 l
0.8245 0.2128 l
0.8559 0.2125 l
0.8873 0.2122 l
0.9186 0.2122 l
0.9500 0.2118 l
s
[/DeviceRGB] SCS
Color6 SC
n
0.1843 0.1499 m
0.1971 0.2701 l
0.2127 0.4007 l
0.2284 0.5023 l
0.2441 0.5721 l
0.2598 0.6195 l
0.2755 0.6529 l
0.2912 0.6775 l
0.3069 0.6961 l
0.3225 0.7106 l
0.3382 0.7222 l
0.3539 0.7317 l
0.3696 0.7394 l
0.3853 0.7460 l
0.4794 0.7692 l
0.5108 0.7737 l
0.5422 0.7773 l
0.5735 0.7801 l
0.6049 0.7826 l
0.6363 0.7846 l
0.6676 0.7864 l
0.6990 0.7878 l
0.7304 0.7892 l
0.7618 0.7904 l
0.7931 0.7915 l
0.8245 0.7924 l
0.8559 0.7933 l
0.8873 0.7941 l
0.9186 0.7950 l
0.9500 0.7954 l
s
[/DeviceRGB] SCS
Color7 SC
n
0.2046 0.1499 m
0.2127 0.2233 l
0.2284 0.3302 l
0.2441 0.4024 l
0.2598 0.4510 l
0.2755 0.4851 l
0.2912 0.5101 l
0.3069 0.5290 l
0.3225 0.5437 l
0.3382 0.5555 l
0.3539 0.5650 l
0.3696 0.5729 l
0.3853 0.5795 l
0.4794 0.6030 l
0.5108 0.6075 l
0.5422 0.6111 l
0.5735 0.6140 l
0.6049 0.6165 l
0.6363 0.6185 l
0.6676 0.6203 l
0.6990 0.6218 l
0.7304 0.6231 l
0.7618 0.6244 l
0.7931 0.6255 l
0.8245 0.6264 l
0.8559 0.6273 l
0.8873 0.6281 l
0.9186 0.6290 l
0.9500 0.6294 l
s
[/DeviceRGB] SCS
Color8 SC
n
0.2274 0.1499 m
0.2284 0.1546 l
0.2441 0.2084 l
0.2598 0.2474 l
0.2755 0.2759 l
0.2912 0.2973 l
0.3069 0.3137 l
0.3225 0.3267 l
0.3382 0.3371 l
0.3539 0.3456 l
0.3696 0.3526 l
0.3853 0.3585 l
0.4794 0.3797 l
0.5108 0.3838 l
0.5422 0.3871 l
0.5735 0.3898 l
0.6049 0.3920 l
0.6363 0.3939 l
0.6676 0.3955 l
0.6990 0.3968 l
0.7304 0.3981 l
0.7618 0.3992 l
0.7931 0.4002 l
0.8245 0.4011 l
0.8559 0.4019 l
0.8873 0.4026 l
0.9186 0.4034 l
0.9500 0.4038 l
s
[/DeviceRGB] SCS
Color9 SC
n
0.2396 0.1499 m
0.2441 0.1689 l
0.2598 0.2143 l
0.2755 0.2466 l
0.2912 0.2704 l
0.3069 0.2885 l
0.3225 0.3026 l
0.3382 0.3139 l
0.3539 0.3231 l
0.3696 0.3307 l
0.3853 0.3371 l
0.4794 0.3598 l
0.5108 0.3642 l
0.5422 0.3677 l
0.5735 0.3705 l
0.6049 0.3729 l
0.6363 0.3749 l
0.6676 0.3766 l
0.6990 0.3781 l
0.7304 0.3794 l
0.7618 0.3806 l
0.7931 0.3817 l
0.8245 0.3826 l
0.8559 0.3834 l
0.8873 0.3842 l
0.9186 0.3851 l
0.9500 0.3855 l
s
[/DeviceRGB] SCS
Color10 SC
n
0.1500 0.3817 m
0.1657 0.3677 l
0.1814 0.3517 l
0.1971 0.3361 l
0.2127 0.3433 l
0.2284 0.3975 l
0.2441 0.4587 l
0.2598 0.5055 l
0.2755 0.5395 l
0.2912 0.5648 l
0.3069 0.5840 l
0.3225 0.5991 l
0.3382 0.6111 l
0.3539 0.6208 l
0.3696 0.6289 l
0.3853 0.6356 l
0.4794 0.6596 l
0.5108 0.6642 l
0.5422 0.6679 l
0.5735 0.6709 l
0.6049 0.6734 l
0.6363 0.6756 l
0.6676 0.6774 l
0.6990 0.6789 l
0.7304 0.6803 l
0.7618 0.6816 l
0.7931 0.6827 l
0.8245 0.6837 l
0.8559 0.6846 l
0.8873 0.6854 l
0.9186 0.6863 l
0.9500 0.6868 l
s
[/DeviceRGB] SCS
Color1 SC
[] 0 SD
0.0015 SLW
n
0.1971 0.1500 m
0.1971 0.1600 l
s
n
0.1971 0.9000 m
0.1971 0.8900 l
s
n
0.2284 0.1500 m
0.2284 0.1600 l
s
n
0.2284 0.9000 m
0.2284 0.8900 l
s
n
0.2598 0.1500 m
0.2598 0.1600 l
s
n
0.2598 0.9000 m
0.2598 0.8900 l
s
n
0.2912 0.1500 m
0.2912 0.1600 l
s
n
0.2912 0.9000 m
0.2912 0.8900 l
s
n
0.3539 0.1500 m
0.3539 0.1600 l
s
n
0.3539 0.9000 m
0.3539 0.8900 l
s
n
0.3853 0.1500 m
0.3853 0.1600 l
s
n
0.3853 0.9000 m
0.3853 0.8900 l
s
n
0.4167 0.1500 m
0.4167 0.1600 l
s
n
0.4167 0.9000 m
0.4167 0.8900 l
s
n
0.4480 0.1500 m
0.4480 0.1600 l
s
n
0.4480 0.9000 m
0.4480 0.8900 l
s
n
0.5108 0.1500 m
0.5108 0.1600 l
s
n
0.5108 0.9000 m
0.5108 0.8900 l
s
n
0.5422 0.1500 m
0.5422 0.1600 l
s
n
0.5422 0.9000 m
0.5422 0.8900 l
s
n
0.5735 0.1500 m
0.5735 0.1600 l
s
n
0.5735 0.9000 m
0.5735 0.8900 l
s
n
0.6049 0.1500 m
0.6049 0.1600 l
s
n
0.6049 0.9000 m
0.6049 0.8900 l
s
n
0.6676 0.1500 m
0.6676 0.1600 l
s
n
0.6676 0.9000 m
0.6676 0.8900 l
s
n
0.6990 0.1500 m
0.6990 0.1600 l
s
n
0.6990 0.9000 m
0.6990 0.8900 l
s
n
0.7304 0.1500 m
0.7304 0.1600 l
s
n
0.7304 0.9000 m
0.7304 0.8900 l
s
n
0.7618 0.1500 m
0.7618 0.1600 l
s
n
0.7618 0.9000 m
0.7618 0.8900 l
s
n
0.8245 0.1500 m
0.8245 0.1600 l
s
n
0.8245 0.9000 m
0.8245 0.8900 l
s
n
0.8559 0.1500 m
0.8559 0.1600 l
s
n
0.8559 0.9000 m
0.8559 0.8900 l
s
n
0.8873 0.1500 m
0.8873 0.1600 l
s
n
0.8873 0.9000 m
0.8873 0.8900 l
s
n
0.9186 0.1500 m
0.9186 0.1600 l
s
n
0.9186 0.9000 m
0.9186 0.8900 l
s
n
0.1657 0.1500 m
0.1657 0.1700 l
s
n
0.1657 0.9000 m
0.1657 0.8800 l
s
n
0.3225 0.1500 m
0.3225 0.1700 l
s
n
0.3225 0.9000 m
0.3225 0.8800 l
s
n
0.4794 0.1500 m
0.4794 0.1700 l
s
n
0.4794 0.9000 m
0.4794 0.8800 l
s
n
0.6363 0.1500 m
0.6363 0.1700 l
s
n
0.6363 0.9000 m
0.6363 0.8800 l
s
n
0.7931 0.1500 m
0.7931 0.1700 l
s
n
0.7931 0.9000 m
0.7931 0.8800 l
s
n
0.9500 0.1500 m
0.9500 0.1700 l
s
n
0.9500 0.9000 m
0.9500 0.8800 l
s
/Helvetica findfont
dup length dict begin
 {1 index /FID ne {def} {pop pop} ifelse} forall
 /Encoding DefEncoding def
 currentdict
end
/Font4 exch definefont pop
/Font4 FFSF
0.1431 0.1200 m
GS
[0.0280 0.0000 0.0000 0.0280 0 0] CC
(100) show
GR
/Font4 FFSF
0.3000 0.1200 m
GS
[0.0280 0.0000 0.0000 0.0280 0 0] CC
(200) show
GR
/Font4 FFSF
0.4569 0.1200 m
GS
[0.0280 0.0000 0.0000 0.0280 0 0] CC
(300) show
GR
/Font4 FFSF
0.6137 0.1200 m
GS
[0.0280 0.0000 0.0000 0.0280 0 0] CC
(400) show
GR
/Font4 FFSF
0.7706 0.1200 m
GS
[0.0280 0.0000 0.0000 0.0280 0 0] CC
(500) show
GR
/Font4 FFSF
0.9275 0.1200 m
GS
[0.0280 0.0000 0.0000 0.0280 0 0] CC
(600) show
GR
/Font4 FFSF
0.4818 0.0845 m
GS
[0.0336 0.0000 0.0000 0.0336 0 0] CC
(M) show
GR
/Font4 FFSF
0.5096 0.0711 m
GS
[0.0238 0.0000 0.0000 0.0238 0 0] CC
(A) show
GR
/Font4 FFSF
0.5253 0.0845 m
GS
[0.0336 0.0000 0.0000 0.0336 0 0] CC
( [GeV]) show
GR
n
0.1500 0.2064 m
0.1600 0.2064 l
s
n
0.9500 0.2064 m
0.9400 0.2064 l
s
n
0.1500 0.2395 m
0.1600 0.2395 l
s
n
0.9500 0.2395 m
0.9400 0.2395 l
s
n
0.1500 0.2629 m
0.1600 0.2629 l
s
n
0.9500 0.2629 m
0.9400 0.2629 l
s
n
0.1500 0.2811 m
0.1600 0.2811 l
s
n
0.9500 0.2811 m
0.9400 0.2811 l
s
n
0.1500 0.2959 m
0.1600 0.2959 l
s
n
0.9500 0.2959 m
0.9400 0.2959 l
s
n
0.1500 0.3085 m
0.1600 0.3085 l
s
n
0.9500 0.3085 m
0.9400 0.3085 l
s
n
0.1500 0.3193 m
0.1600 0.3193 l
s
n
0.9500 0.3193 m
0.9400 0.3193 l
s
n
0.1500 0.3289 m
0.1600 0.3289 l
s
n
0.9500 0.3289 m
0.9400 0.3289 l
s
n
0.1500 0.3375 m
0.1600 0.3375 l
s
n
0.9500 0.3375 m
0.9400 0.3375 l
s
n
0.1500 0.3939 m
0.1600 0.3939 l
s
n
0.9500 0.3939 m
0.9400 0.3939 l
s
n
0.1500 0.4270 m
0.1600 0.4270 l
s
n
0.9500 0.4270 m
0.9400 0.4270 l
s
n
0.1500 0.4504 m
0.1600 0.4504 l
s
n
0.9500 0.4504 m
0.9400 0.4504 l
s
n
0.1500 0.4686 m
0.1600 0.4686 l
s
n
0.9500 0.4686 m
0.9400 0.4686 l
s
n
0.1500 0.4834 m
0.1600 0.4834 l
s
n
0.9500 0.4834 m
0.9400 0.4834 l
s
n
0.1500 0.4960 m
0.1600 0.4960 l
s
n
0.9500 0.4960 m
0.9400 0.4960 l
s
n
0.1500 0.5068 m
0.1600 0.5068 l
s
n
0.9500 0.5068 m
0.9400 0.5068 l
s
n
0.1500 0.5164 m
0.1600 0.5164 l
s
n
0.9500 0.5164 m
0.9400 0.5164 l
s
n
0.1500 0.5250 m
0.1600 0.5250 l
s
n
0.9500 0.5250 m
0.9400 0.5250 l
s
n
0.1500 0.5814 m
0.1600 0.5814 l
s
n
0.9500 0.5814 m
0.9400 0.5814 l
s
n
0.1500 0.6145 m
0.1600 0.6145 l
s
n
0.9500 0.6145 m
0.9400 0.6145 l
s
n
0.1500 0.6379 m
0.1600 0.6379 l
s
n
0.9500 0.6379 m
0.9400 0.6379 l
s
n
0.1500 0.6561 m
0.1600 0.6561 l
s
n
0.9500 0.6561 m
0.9400 0.6561 l
s
n
0.1500 0.6709 m
0.1600 0.6709 l
s
n
0.9500 0.6709 m
0.9400 0.6709 l
s
n
0.1500 0.6835 m
0.1600 0.6835 l
s
n
0.9500 0.6835 m
0.9400 0.6835 l
s
n
0.1500 0.6943 m
0.1600 0.6943 l
s
n
0.9500 0.6943 m
0.9400 0.6943 l
s
n
0.1500 0.7039 m
0.1600 0.7039 l
s
n
0.9500 0.7039 m
0.9400 0.7039 l
s
n
0.1500 0.7125 m
0.1600 0.7125 l
s
n
0.9500 0.7125 m
0.9400 0.7125 l
s
n
0.1500 0.7689 m
0.1600 0.7689 l
s
n
0.9500 0.7689 m
0.9400 0.7689 l
s
n
0.1500 0.8020 m
0.1600 0.8020 l
s
n
0.9500 0.8020 m
0.9400 0.8020 l
s
n
0.1500 0.8254 m
0.1600 0.8254 l
s
n
0.9500 0.8254 m
0.9400 0.8254 l
s
n
0.1500 0.8436 m
0.1600 0.8436 l
s
n
0.9500 0.8436 m
0.9400 0.8436 l
s
n
0.1500 0.8584 m
0.1600 0.8584 l
s
n
0.9500 0.8584 m
0.9400 0.8584 l
s
n
0.1500 0.8710 m
0.1600 0.8710 l
s
n
0.9500 0.8710 m
0.9400 0.8710 l
s
n
0.1500 0.8818 m
0.1600 0.8818 l
s
n
0.9500 0.8818 m
0.9400 0.8818 l
s
n
0.1500 0.8914 m
0.1600 0.8914 l
s
n
0.9500 0.8914 m
0.9400 0.8914 l
s
n
0.1500 0.9000 m
0.1600 0.9000 l
s
n
0.9500 0.9000 m
0.9400 0.9000 l
s
n
0.1500 0.1500 m
0.1700 0.1500 l
s
n
0.9500 0.1500 m
0.9300 0.1500 l
s
n
0.1500 0.3375 m
0.1700 0.3375 l
s
n
0.9500 0.3375 m
0.9300 0.3375 l
s
n
0.1500 0.5250 m
0.1700 0.5250 l
s
n
0.9500 0.5250 m
0.9300 0.5250 l
s
n
0.1500 0.7125 m
0.1700 0.7125 l
s
n
0.9500 0.7125 m
0.9300 0.7125 l
s
n
0.1500 0.9000 m
0.1700 0.9000 l
s
n
0.9500 0.9000 m
0.9300 0.9000 l
s
/Font4 FFSF
0.0922 0.1349 m
GS
[0.0280 0.0000 0.0000 0.0280 0 0] CC
(10) show
GR
/Font4 FFSF
0.1231 0.1517 m
GS
[0.0198 0.0000 0.0000 0.0198 0 0] CC
(-4) show
GR
/Font4 FFSF
0.0922 0.3224 m
GS
[0.0280 0.0000 0.0000 0.0280 0 0] CC
(10) show
GR
/Font4 FFSF
0.1231 0.3392 m
GS
[0.0198 0.0000 0.0000 0.0198 0 0] CC
(-3) show
GR
/Font4 FFSF
0.0922 0.5099 m
GS
[0.0280 0.0000 0.0000 0.0280 0 0] CC
(10) show
GR
/Font4 FFSF
0.1231 0.5267 m
GS
[0.0198 0.0000 0.0000 0.0198 0 0] CC
(-2) show
GR
/Font4 FFSF
0.0957 0.6974 m
GS
[0.0280 0.0000 0.0000 0.0280 0 0] CC
(10) show
GR
/Font4 FFSF
0.1267 0.7142 m
GS
[0.0198 0.0000 0.0000 0.0198 0 0] CC
(-1) show
GR
/Font4 FFSF
0.0988 0.8849 m
GS
[0.0280 0.0000 0.0000 0.0280 0 0] CC
(10) show
GR
/Font4 FFSF
0.1298 0.9017 m
GS
[0.0198 0.0000 0.0000 0.0198 0 0] CC
(0) show
GR
/Font4 FFSF
0.0747 0.4825 m
GS
[0.0000 0.0336 -0.0336 0.0000 0 0] CC
(BR\(h\)) show
GR
n
0.1500 0.1500 m
0.1500 0.9000 l
0.9500 0.9000 l
0.9500 0.1500 l
0.1500 0.1500 l
c
s
n
0.7000 0.6300 m
0.7000 0.2182 l
0.9290 0.2182 l
0.9290 0.6300 l
c
[/DeviceRGB] SCS
Color0 SC
fill
[/DeviceRGB] SCS
Color1 SC
n
0.7000 0.6300 m
0.7000 0.2182 l
0.9290 0.2182 l
0.9290 0.6300 l
0.7000 0.6300 l
c
s
/Font4 FFSF
0.7872 0.5735 m
GS
[0.0224 0.0000 0.0000 0.0224 0 0] CC
(BR\(h -> bb\)) show
GR
[/DeviceRGB] SCS
Color2 SC
[] 0 SD
0.0045 SLW
n
0.7122 0.5794 m
0.7722 0.5794 l
s
/Font4 FFSF
[/DeviceRGB] SCS
Color1 SC
0.7872 0.5324 m
GS
[0.0224 0.0000 0.0000 0.0224 0 0] CC
(BR\(h -> cc\)) show
GR
[/DeviceRGB] SCS
Color3 SC
n
0.7122 0.5382 m
0.7722 0.5382 l
s
/Font4 FFSF
[/DeviceRGB] SCS
Color1 SC
0.7872 0.4912 m
GS
[0.0224 0.0000 0.0000 0.0224 0 0] CC
(BR\(h -> ) show
GR
/Symbol findfont
/Font12 exch definefont pop
/Font12 FFSF
0.8712 0.4912 m
GS
[0.0224 0.0000 0.0000 0.0224 0 0] CC
(tt) show
GR
/Font4 FFSF
0.8908 0.4912 m
GS
[0.0224 0.0000 0.0000 0.0224 0 0] CC
(\)) show
GR
[/DeviceRGB] SCS
Color4 SC
n
0.7122 0.4971 m
0.7722 0.4971 l
s
/Font4 FFSF
[/DeviceRGB] SCS
Color1 SC
0.7872 0.4500 m
GS
[0.0224 0.0000 0.0000 0.0224 0 0] CC
(BR\(h -> ) show
GR
/Font12 FFSF
0.8712 0.4500 m
GS
[0.0224 0.0000 0.0000 0.0224 0 0] CC
(mm) show
GR
/Font4 FFSF
0.8971 0.4500 m
GS
[0.0224 0.0000 0.0000 0.0224 0 0] CC
(\)) show
GR
[/DeviceRGB] SCS
Color5 SC
n
0.7122 0.4557 m
0.7722 0.4557 l
s
/Font4 FFSF
[/DeviceRGB] SCS
Color1 SC
0.7872 0.4084 m
GS
[0.0224 0.0000 0.0000 0.0224 0 0] CC
(BR\(h -> WW\)) show
GR
[/DeviceRGB] SCS
Color6 SC
n
0.7122 0.4143 m
0.7722 0.4143 l
s
/Font4 FFSF
[/DeviceRGB] SCS
Color1 SC
0.7872 0.3673 m
GS
[0.0224 0.0000 0.0000 0.0224 0 0] CC
(BR\(h -> ZZ\)) show
GR
[/DeviceRGB] SCS
Color7 SC
n
0.7122 0.3731 m
0.7722 0.3731 l
s
/Font4 FFSF
[/DeviceRGB] SCS
Color1 SC
0.7872 0.3261 m
GS
[0.0224 0.0000 0.0000 0.0224 0 0] CC
(BR\(h -> ) show
GR
/Font12 FFSF
0.8712 0.3261 m
GS
[0.0224 0.0000 0.0000 0.0224 0 0] CC
(gg) show
GR
/Font4 FFSF
0.8896 0.3261 m
GS
[0.0224 0.0000 0.0000 0.0224 0 0] CC
(\)) show
GR
[/DeviceRGB] SCS
Color8 SC
n
0.7122 0.3318 m
0.7722 0.3318 l
s
/Font4 FFSF
[/DeviceRGB] SCS
Color1 SC
0.7872 0.2845 m
GS
[0.0224 0.0000 0.0000 0.0224 0 0] CC
(BR\(h -> Z) show
GR
/Font12 FFSF
0.8849 0.2845 m
GS
[0.0224 0.0000 0.0000 0.0224 0 0] CC
(g) show
GR
/Font4 FFSF
0.8939 0.2845 m
GS
[0.0224 0.0000 0.0000 0.0224 0 0] CC
(\)) show
GR
[/DeviceRGB] SCS
Color9 SC
n
0.7122 0.2902 m
0.7722 0.2902 l
s
/Font4 FFSF
[/DeviceRGB] SCS
Color1 SC
0.7872 0.2429 m
GS
[0.0224 0.0000 0.0000 0.0224 0 0] CC
(BR\(h -> gg\)) show
GR
[/DeviceRGB] SCS
Color10 SC
n
0.7122 0.2488 m
0.7722 0.2488 l
s
/Font4 FFSF
[/DeviceRGB] SCS
Color1 SC
0.9700 0.7000 m
GS
[0.0000 0.0168 -0.0168 0.0000 0 0] CC
(LHC Higgs XS WG 2011) show
GR
/Font4 FFSF
0.7150 0.6050 m
GS
[0.0224 0.0000 0.0000 0.0224 0 0] CC
(m) show
GR
/Font4 FFSF
0.7338 0.5960 m
GS
[0.0158 0.0000 0.0000 0.0158 0 0] CC
(h) show
GR
/Font4 FFSF
0.7425 0.6184 m
GS
[0.0158 0.0000 0.0000 0.0158 0 0] CC
(max) show
GR
/Font4 FFSF
0.7723 0.6050 m
GS
[0.0224 0.0000 0.0000 0.0224 0 0] CC
(, tan) show
GR
/Font12 FFSF
0.8158 0.6050 m
GS
[0.0224 0.0000 0.0000 0.0224 0 0] CC
(b) show
GR
/Font4 FFSF
0.8279 0.6050 m
GS
[0.0224 0.0000 0.0000 0.0224 0 0] CC
( = 10) show
GR
%%Trailer
%%BoundingBox: 29 42 597 562
%%DocumentNeededResources: font Helvetica
%%+ font Symbol
%%EOF
