%!PS-Adobe-2.0 EPSF-2.0
%%BoundingBox:  0 0 567 306
%%Title: /imports/home/pttaylor/Histos_from_D3PDs/S_and_S+I_MCFM_MWW.eps: Canvas_1
%%Creator: ROOT Version 5.34/05
%%CreationDate: Fri Jun 14 05:33:35 2013
%%EndComments
%%BeginProlog
80 dict begin
/s {stroke} def /l {lineto} def /m {moveto} def /t {translate} def
/r {rotate} def /rl {roll}  def /R {repeat} def
/d {rlineto} def /rm {rmoveto} def /gr {grestore} def /f {eofill} def
/c {setrgbcolor} def /black {0 setgray} def /sd {setdash} def
/cl {closepath} def /sf {scalefont setfont} def /lw {setlinewidth} def
/box {m dup 0 exch d exch 0 d 0 exch neg d cl} def
/NC{systemdict begin initclip end}def/C{NC box clip newpath}def
/bl {box s} def /bf {box f} def /Y { 0 exch d} def /X { 0 d} def 
/K {{pop pop 0 moveto} exch kshow} bind def
/ita {/ang 15 def gsave [1 0 ang dup sin exch cos div 1 0 0] concat} def 
/mp {newpath /y exch def /x exch def} def
/side {[w .77 mul w .23 mul] .385 w mul sd w 0 l currentpoint t -144 r} def
/mr {mp x y w2 0 360 arc} def /m24 {mr s} def /m20 {mr f} def
/mb {mp x y w2 add m w2 neg 0 d 0 w neg d w 0 d 0 w d cl} def
/mt {mp x y w2 add m w2 neg w neg d w 0 d cl} def
/m21 {mb f} def /m25 {mb s} def /m22 {mt f} def /m26{mt s} def
/m23 {mp x y w2 sub m w2 w d w neg 0 d cl f} def
/m27 {mp x y w2 add m w3 neg w2 neg d w3 w2 neg d w3 w2 d cl s} def
/m28 {mp x w2 sub y w2 sub w3 add m w3 0 d  0 w3 neg d w3 0 d 0 w3 d w3 0 d  0 w3 d w3 neg 0 d 0 w3 d w3 neg 0 d 0 w3 neg d w3 neg 0 d cl s } def
/m29 {mp gsave x w2 sub y w2 add w3 sub m currentpoint t 4 {side} repeat cl fill gr} def
/m30 {mp gsave x w2 sub y w2 add w3 sub m currentpoint t 4 {side} repeat cl s gr} def
/m31 {mp x y w2 sub m 0 w d x w2 sub y m w 0 d x w2 sub y w2 add m w w neg d x w2 sub y w2 sub m w w d s} def
/m32 {mp x y w2 sub m w2 w d w neg 0 d cl s} def
/m33 {mp x y w2 add m w3 neg w2 neg d w3 w2 neg d w3 w2 d cl f} def
/m34 {mp x w2 sub y w2 sub w3 add m w3 0 d  0 w3 neg d w3 0 d 0 w3 d w3 0 d  0 w3 d w3 neg 0 d 0 w3 d w3 neg 0 d 0 w3 neg d w3 neg 0 d cl f } def
/m2 {mp x y w2 sub m 0 w d x w2 sub y m w 0 d s} def
/m5 {mp x w2 sub y w2 sub m w w d x w2 sub y w2 add m w w neg d s} def
/reEncode {exch findfont dup length dict begin {1 index /FID eq  {pop pop} {def} ifelse } forall /Encoding exch def currentdict end dup /FontName get exch definefont pop } def [/Times-Bold /Times-Italic /Times-BoldItalic /Helvetica /Helvetica-Oblique
 /Helvetica-Bold /Helvetica-BoldOblique /Courier /Courier-Oblique /Courier-Bold /Courier-BoldOblique /Times-Roman /AvantGarde-Book /AvantGarde-BookOblique /AvantGarde-Demi /AvantGarde-DemiOblique /Bookman-Demi /Bookman-DemiItalic /Bookman-Light
 /Bookman-LightItalic /Helvetica-Narrow /Helvetica-Narrow-Bold /Helvetica-Narrow-BoldOblique /Helvetica-Narrow-Oblique /NewCenturySchlbk-Roman /NewCenturySchlbk-Bold /NewCenturySchlbk-BoldItalic /NewCenturySchlbk-Italic /Palatino-Bold
 /Palatino-BoldItalic /Palatino-Italic /Palatino-Roman ] {ISOLatin1Encoding reEncode } forall
%%EndProlog
%%BeginSetup
%%EndSetup
newpath  gsave  .25 .25 scale  gsave  0 0 t black[  ] 0 sd 3 lw 1 1 1 c 2268 1225 0 0 bf black 1 1 1 c 1814 980 227 123 bf black 1814 980 227 123 bl 1 1 1 c 1814 980 227 123 bf black 1814 980 227 123 bl 1 0 0 c[ 12 12] 0 sd 1 1 1 c 1 0 0 c 227 123 m
 380 X 88 Y 13 X 130 Y 13 X 56 Y 12 X -97 Y 13 X 4 Y 13 X 18 Y 12 X -67 Y 13 X 12 Y 13 X 15 Y 13 X -23 Y 12 X -44 Y 13 X 51 Y 25 X -26 Y 13 X 107 Y 13 X -10 Y 12 X -18 Y 13 X -7 Y 13 X 4 Y 12 X 62 Y 13 X 49 Y 13 X 27 Y 12 X -43 Y 13 X -1 Y 13 X 73 Y
 13 X 125 Y 12 X -34 Y 13 X 53 Y 13 X -29 Y 12 X 111 Y 13 X -68 Y 13 X 90 Y 12 X -12 Y 13 X -92 Y 13 X 50 Y 12 X 6 Y 13 X 39 Y 13 X -32 Y 12 X 100 Y 13 X -15 Y 13 X -23 Y 13 X -14 Y 12 X 83 Y 13 X -40 Y 13 X 42 Y 12 X -73 Y 13 X -5 Y 13 X 66 Y 12 X
 -12 Y 13 X 21 Y 13 X -53 Y 12 X 9 Y 13 X 72 Y 13 X -33 Y 12 X 12 Y 13 X 70 Y 13 X -6 Y 12 X -29 Y 13 X 26 Y 13 X -32 Y 13 X 52 Y 12 X -10 Y 13 X -10 Y 25 X 75 Y 13 X -63 Y 13 X 22 Y 12 X 67 Y 13 X -34 Y 13 X 34 Y 25 X 7 Y 13 X 26 Y 12 X -8 Y 13 X 42
 Y 13 X -2 Y 13 X -5 Y 12 X -14 Y 13 X -17 Y 13 X 25 Y 12 X -2 Y 13 X -7 Y 13 X -73 Y 12 X 29 Y 13 X -53 Y 13 X 2 Y 12 X -71 Y 13 X -46 Y 13 X -71 Y 12 X -15 Y 13 X -59 Y 13 X -36 Y 13 X -57 Y 12 X -37 Y 13 X -31 Y 13 X -43 Y 12 X -32 Y 13 X -48 Y 13
 X -4 Y 12 X -56 Y 13 X -16 Y 13 X -24 Y 12 X -20 Y 13 X -15 Y 13 X -9 Y 12 X -10 Y 13 X -23 Y 13 X -14 Y 13 X -3 Y 12 X -8 Y 13 X -15 Y 25 X 7 Y 13 X s black[  ] 0 sd 227 123 m 1814 X s
 gsave  2268 1225 0 0 C 1991.73 33.7321 t 0 r /Helvetica findfont 26.0657 sf 0 0 m (WW) show NC gr 
 gsave  2268 1225 0 0 C 1961.06 45.9983 t 0 r /Helvetica findfont 39.8652 sf 0 0 m (M) show NC gr  227 152 m -29 Y s 317 137 m -14 Y s 408 137 m -14 Y s 499 137 m -14 Y s 589 152 m -29 Y s 680 137 m -14 Y s 770 137 m -14 Y s 861 137 m -14 Y s 952 152
 m -29 Y s 1042 137 m -14 Y s 1133 137 m -14 Y s 1224 137 m -14 Y s 1314 152 m -29 Y s 1405 137 m -14 Y s 1495 137 m -14 Y s 1586 137 m -14 Y s 1677 152 m -29 Y s 1767 137 m -14 Y s 1858 137 m -14 Y s 1949 137 m -14 Y s 2039 152 m -29 Y s 2039 152 m
 -29 Y s
 gsave  2268 1225 0 0 C 214.659 82.797 t 0 r /Helvetica findfont 39.8652 sf 0 0 m (0) show NC gr 
 gsave  2268 1225 0 0 C 555.046 82.797 t 0 r /Helvetica findfont 39.8652 sf 0 0 m (200) show NC gr 
 gsave  2268 1225 0 0 C 916.9 82.797 t 0 r /Helvetica findfont 39.8652 sf 0 0 m (400) show NC gr 
 gsave  2268 1225 0 0 C 1280.29 82.797 t 0 r /Helvetica findfont 39.8652 sf 0 0 m (600) show NC gr 
 gsave  2268 1225 0 0 C 1642.14 82.797 t 0 r /Helvetica findfont 39.8652 sf 0 0 m (800) show NC gr 
 gsave  2268 1225 0 0 C 1993.26 82.797 t 0 r /Helvetica findfont 39.8652 sf 0 0 m (1000) show NC gr  227 123 m 980 Y s 281 123 m -54 X s 254 146 m -27 X s 254 169 m -27 X s 254 193 m -27 X s 281 216 m -54 X s 254 240 m -27 X s 254 263 m -27 X s 254
 286 m -27 X s 281 310 m -54 X s 254 333 m -27 X s 254 357 m -27 X s 254 380 m -27 X s 281 404 m -54 X s 254 427 m -27 X s 254 450 m -27 X s 254 474 m -27 X s 281 497 m -54 X s 254 521 m -27 X s 254 544 m -27 X s 254 568 m -27 X s 281 591 m -54 X s
 254 614 m -27 X s 254 638 m -27 X s 254 661 m -27 X s 281 685 m -54 X s 254 708 m -27 X s 254 732 m -27 X s 254 755 m -27 X s 281 778 m -54 X s 254 802 m -27 X s 254 825 m -27 X s 254 849 m -27 X s 281 872 m -54 X s 254 896 m -27 X s 254 919 m -27 X
 s 254 942 m -27 X s 281 966 m -54 X s 254 989 m -27 X s 254 1013 m -27 X s 254 1036 m -27 X s 281 1060 m -54 X s 281 1060 m -54 X s 254 1083 m -27 X s
 gsave  2268 1225 0 0 C 193.193 107.329 t 0 r /Helvetica findfont 39.8652 sf 0 0 m (0) show NC gr 
 gsave  2268 1225 0 0 C 137.995 202.393 t 0 r /Helvetica findfont 39.8652 sf 0 0 m (0.02) show NC gr 
 gsave  2268 1225 0 0 C 137.995 295.922 t 0 r /Helvetica findfont 39.8652 sf 0 0 m (0.04) show NC gr 
 gsave  2268 1225 0 0 C 137.995 389.452 t 0 r /Helvetica findfont 39.8652 sf 0 0 m (0.06) show NC gr 
 gsave  2268 1225 0 0 C 137.995 482.982 t 0 r /Helvetica findfont 39.8652 sf 0 0 m (0.08) show NC gr 
 gsave  2268 1225 0 0 C 167.127 576.512 t 0 r /Helvetica findfont 39.8652 sf 0 0 m (0.1) show NC gr 
 gsave  2268 1225 0 0 C 137.995 670.042 t 0 r /Helvetica findfont 39.8652 sf 0 0 m (0.12) show NC gr 
 gsave  2268 1225 0 0 C 137.995 763.572 t 0 r /Helvetica findfont 39.8652 sf 0 0 m (0.14) show NC gr 
 gsave  2268 1225 0 0 C 137.995 857.102 t 0 r /Helvetica findfont 39.8652 sf 0 0 m (0.16) show NC gr 
 gsave  2268 1225 0 0 C 137.995 950.632 t 0 r /Helvetica findfont 39.8652 sf 0 0 m (0.18) show NC gr 
 gsave  2268 1225 0 0 C 160.994 1045.69 t 0 r /Helvetica findfont 39.8652 sf 0 0 m (0.2) show NC gr  1 0 0 c 1 1 1 c 1 0 0 c 227 123 m 380 X 62 Y 13 X 92 Y 13 X 40 Y 12 X -69 Y 13 X 3 Y 13 X 13 Y 12 X -47 Y 13 X 9 Y 13 X 11 Y 13 X -17 Y 12 X -31 Y 13
 X 36 Y 13 X 1 Y 12 X -19 Y 13 X 77 Y 13 X -7 Y 12 X -12 Y 13 X -4 Y 13 X 3 Y 12 X 47 Y 13 X 36 Y 13 X 20 Y 12 X -32 Y 26 X 53 Y 13 X 92 Y 12 X -25 Y 13 X 39 Y 13 X -21 Y 12 X 82 Y 13 X -50 Y 13 X 67 Y 12 X -9 Y 13 X -68 Y 13 X 37 Y 12 X 6 Y 13 X 30
 Y 13 X -22 Y 12 X 75 Y 13 X -11 Y 13 X -15 Y 13 X -10 Y 12 X 64 Y 13 X -30 Y 13 X 32 Y 12 X -53 Y 13 X -2 Y 13 X 53 Y 12 X -9 Y 13 X 19 Y 13 X -39 Y 12 X 8 Y 13 X 58 Y 13 X -24 Y 12 X 12 Y 13 X 55 Y 25 X -22 Y 13 X 25 Y 13 X -23 Y 13 X 43 Y 12 X -4
 Y 13 X -6 Y 13 X 3 Y 12 X 66 Y 13 X -47 Y 13 X 22 Y 12 X 59 Y 13 X -26 Y 13 X 34 Y 12 X 3 Y 13 X 12 Y 13 X 29 Y 25 X 41 Y 13 X 3 Y 13 X 3 Y 12 X -5 Y 13 X -9 Y 13 X 31 Y 12 X 7 Y 26 X -57 Y 12 X 32 Y 13 X -41 Y 13 X 9 Y 12 X -56 Y 13 X -41 Y 13 X
 -63 Y 12 X -4 Y 13 X -50 Y 13 X -33 Y 13 X -50 Y 12 X -33 Y 13 X -31 Y 13 X -37 Y 12 X -31 Y 13 X -46 Y 13 X -1 Y 12 X -59 Y 13 X -15 Y 13 X -26 Y 12 X -20 Y 13 X -15 Y 13 X -8 Y 12 X -9 Y 13 X -26 Y 13 X -18 Y 13 X 1 Y 12 X -11 Y 13 X -20 Y 13 X 4
 Y 12 X -2 Y 13 X s[ 12 12] 0 sd 1 1 1 c 1 0 0 c 227 123 m 380 X 44 Y 13 X 66 Y 13 X 28 Y 12 X -49 Y 13 X 2 Y 13 X 10 Y 12 X -34 Y 13 X 7 Y 13 X 7 Y 13 X -11 Y 12 X -23 Y 13 X 27 Y 25 X -13 Y 13 X 56 Y 13 X -5 Y 12 X -9 Y 13 X -2 Y 13 X 3 Y 12 X 35 Y
 13 X 28 Y 13 X 15 Y 12 X -24 Y 26 X 39 Y 13 X 69 Y 12 X -19 Y 13 X 30 Y 13 X -16 Y 12 X 62 Y 13 X -37 Y 13 X 51 Y 12 X -6 Y 13 X -51 Y 13 X 28 Y 12 X 6 Y 13 X 24 Y 13 X -16 Y 12 X 58 Y 13 X -8 Y 13 X -11 Y 13 X -6 Y 12 X 51 Y 13 X -22 Y 13 X 25 Y 12
 X -40 Y 26 X 43 Y 12 X -4 Y 13 X 16 Y 13 X -29 Y 12 X 7 Y 13 X 49 Y 13 X -18 Y 12 X 12 Y 13 X 45 Y 13 X 4 Y 12 X -17 Y 13 X 24 Y 13 X -17 Y 13 X 38 Y 12 X -1 Y 13 X -3 Y 13 X 6 Y 12 X 60 Y 13 X -37 Y 13 X 22 Y 12 X 54 Y 13 X -20 Y 13 X 34 Y 12 X 5 Y
 13 X 16 Y 13 X 30 Y 12 X 6 Y 13 X 40 Y 13 X 7 Y 13 X 9 Y 25 X -3 Y 13 X 35 Y 12 X 13 Y 13 X 6 Y 13 X -47 Y 12 X 34 Y 13 X -32 Y 13 X 13 Y 12 X -46 Y 13 X -37 Y 13 X -57 Y 12 X 2 Y 13 X -44 Y 13 X -31 Y 13 X -46 Y 12 X -30 Y 13 X -31 Y 13 X -34 Y 12
 X -29 Y 13 X -44 Y 13 X 1 Y 12 X -62 Y 13 X -15 Y 13 X -26 Y 12 X -20 Y 13 X -16 Y 13 X -7 Y 12 X -9 Y 13 X -28 Y 13 X -20 Y 13 X 3 Y 12 X -13 Y 13 X -24 Y 13 X 7 Y 12 X -7 Y 13 X s 0 0 0.6 c[  ] 0 sd 1 1 1 c black 0 0 0.6 c 227 123 m 393 X 1 Y 13 X
 1 Y 38 X 1 Y 12 X -1 Y 13 X 1 Y 13 X 1 Y 25 X -1 Y 13 X 2 Y 13 X 1 Y 12 X -1 Y 13 X 7 Y 38 X 1 Y 13 X 1 Y 12 X 6 Y 13 X 5 Y 13 X 4 Y 12 X -2 Y 13 X 2 Y 13 X 7 Y 13 X 15 Y 12 X -1 Y 13 X 9 Y 13 X -1 Y 12 X 17 Y 13 X -5 Y 13 X 16 Y 12 X 2 Y 13 X -12 Y
 13 X 11 Y 12 X 5 Y 13 X 12 Y 13 X -1 Y 12 X 21 Y 26 X 2 Y 13 X 1 Y 12 X 24 Y 13 X -4 Y 13 X 13 Y 12 X -11 Y 13 X 5 Y 13 X 24 Y 12 X 2 Y 13 X 14 Y 13 X -8 Y 12 X 7 Y 13 X 30 Y 13 X -5 Y 12 X 14 Y 13 X 25 Y 13 X 13 Y 12 X -5 Y 13 X 22 Y 13 X -3 Y 13 X
 26 Y 12 X 8 Y 13 X 3 Y 13 X 12 Y 12 X 48 Y 13 X -14 Y 13 X 22 Y 12 X 45 Y 13 X -8 Y 13 X 35 Y 12 X 10 Y 13 X 23 Y 13 X 35 Y 12 X 17 Y 13 X 39 Y 13 X 14 Y 13 X 19 Y 12 X 13 Y 13 X 8 Y 13 X 42 Y 12 X 25 Y 13 X 16 Y 13 X -29 Y 12 X 38 Y 13 X -16 Y 13 X
 20 Y 12 X -27 Y 13 X -31 Y 13 X -48 Y 12 X 15 Y 13 X -35 Y 13 X -27 Y 13 X -39 Y 12 X -26 Y 13 X -30 Y 13 X -29 Y 12 X -28 Y 13 X -40 Y 13 X 2 Y 12 X -66 Y 13 X -13 Y 13 X -29 Y 12 X -20 Y 13 X -16 Y 13 X -6 Y 12 X -9 Y 13 X -32 Y 13 X -25 Y 13 X 8
 Y 12 X -17 Y 13 X -29 Y 13 X 10 Y 12 X -15 Y 13 X s black 1 1 1 c 680 368 340 735 bf black 340 735 m 680 X s 1020 735 m 368 Y s 1020 1103 m -680 X s 340 1103 m -368 Y s
 gsave  2268 1225 0 0 C 509.048 998.163 t 0 r /Helvetica findfont 49.0649 sf 0 0 m (Signal Only) show NC gr  0 0 0.6 c 366 1011 m 119 X s black
 gsave  2268 1225 0 0 C 509.048 814.17 t 0 r /Helvetica findfont 49.0649 sf 0 0 m (Signal + Interference) show NC gr  1 0 0 c 366 827 m 119 X s black
 gsave  2268 1225 0 0 C 2221.72 889.301 t 90 r /Helvetica-BoldOblique findfont 22.9992 sf 0 0 m (LHC HIGGS XS WG 2013) show NC gr  1 1 1 c black
 gsave  2268 1225 0 0 C 863.235 1166.82 t 0 r /Helvetica findfont 58.2645 sf 0 0 m (Signal + Interference) show NC gr 
 gr  gr showpage
end
%%EOF
