%!PS-Adobe-2.0 EPSF-2.0
%%BoundingBox:  0 0 567 544
%%Title: HWW_600_ptll_NNLO_cut_YR3.eps: HWW 600Gev ptll NNLO with cuts
%%Creator: ROOT Version 5.34/05
%%CreationDate: Fri Jun 14 04:56:10 2013
%%EndComments
%%BeginProlog
80 dict begin
/s {stroke} def /l {lineto} def /m {moveto} def /t {translate} def
/r {rotate} def /rl {roll}  def /R {repeat} def
/d {rlineto} def /rm {rmoveto} def /gr {grestore} def /f {eofill} def
/c {setrgbcolor} def /black {0 setgray} def /sd {setdash} def
/cl {closepath} def /sf {scalefont setfont} def /lw {setlinewidth} def
/box {m dup 0 exch d exch 0 d 0 exch neg d cl} def
/NC{systemdict begin initclip end}def/C{NC box clip newpath}def
/bl {box s} def /bf {box f} def /Y { 0 exch d} def /X { 0 d} def 
/K {{pop pop 0 moveto} exch kshow} bind def
/ita {/ang 15 def gsave [1 0 ang dup sin exch cos div 1 0 0] concat} def 
/mp {newpath /y exch def /x exch def} def
/side {[w .77 mul w .23 mul] .385 w mul sd w 0 l currentpoint t -144 r} def
/mr {mp x y w2 0 360 arc} def /m24 {mr s} def /m20 {mr f} def
/mb {mp x y w2 add m w2 neg 0 d 0 w neg d w 0 d 0 w d cl} def
/mt {mp x y w2 add m w2 neg w neg d w 0 d cl} def
/m21 {mb f} def /m25 {mb s} def /m22 {mt f} def /m26{mt s} def
/m23 {mp x y w2 sub m w2 w d w neg 0 d cl f} def
/m27 {mp x y w2 add m w3 neg w2 neg d w3 w2 neg d w3 w2 d cl s} def
/m28 {mp x w2 sub y w2 sub w3 add m w3 0 d  0 w3 neg d w3 0 d 0 w3 d w3 0 d  0 w3 d w3 neg 0 d 0 w3 d w3 neg 0 d 0 w3 neg d w3 neg 0 d cl s } def
/m29 {mp gsave x w2 sub y w2 add w3 sub m currentpoint t 4 {side} repeat cl fill gr} def
/m30 {mp gsave x w2 sub y w2 add w3 sub m currentpoint t 4 {side} repeat cl s gr} def
/m31 {mp x y w2 sub m 0 w d x w2 sub y m w 0 d x w2 sub y w2 add m w w neg d x w2 sub y w2 sub m w w d s} def
/m32 {mp x y w2 sub m w2 w d w neg 0 d cl s} def
/m33 {mp x y w2 add m w3 neg w2 neg d w3 w2 neg d w3 w2 d cl f} def
/m34 {mp x w2 sub y w2 sub w3 add m w3 0 d  0 w3 neg d w3 0 d 0 w3 d w3 0 d  0 w3 d w3 neg 0 d 0 w3 d w3 neg 0 d 0 w3 neg d w3 neg 0 d cl f } def
/m2 {mp x y w2 sub m 0 w d x w2 sub y m w 0 d s} def
/m5 {mp x w2 sub y w2 sub m w w d x w2 sub y w2 add m w w neg d s} def
/reEncode {exch findfont dup length dict begin {1 index /FID eq  {pop pop} {def} ifelse } forall /Encoding exch def currentdict end dup /FontName get exch definefont pop } def [/Times-Bold /Times-Italic /Times-BoldItalic /Helvetica /Helvetica-Oblique
 /Helvetica-Bold /Helvetica-BoldOblique /Courier /Courier-Oblique /Courier-Bold /Courier-BoldOblique /Times-Roman /AvantGarde-Book /AvantGarde-BookOblique /AvantGarde-Demi /AvantGarde-DemiOblique /Bookman-Demi /Bookman-DemiItalic /Bookman-Light
 /Bookman-LightItalic /Helvetica-Narrow /Helvetica-Narrow-Bold /Helvetica-Narrow-BoldOblique /Helvetica-Narrow-Oblique /NewCenturySchlbk-Roman /NewCenturySchlbk-Bold /NewCenturySchlbk-BoldItalic /NewCenturySchlbk-Italic /Palatino-Bold
 /Palatino-BoldItalic /Palatino-Italic /Palatino-Roman ] {ISOLatin1Encoding reEncode } forall
%%EndProlog
%%BeginSetup
%%EndSetup
newpath  gsave  .25 .25 scale  gsave  0 0 t black[  ] 0 sd 3 lw 1 1 1 c 2268 2177 0 0 bf black 1 1 1 c 2222 2133 23 22 bf black 1 1 1 c 1778 1706 245 235 bf black 1778 1706 245 235 bl 0.8 0 0.8 c 1 1 1 c 1 0 1 c 0.8 0 0.8 c 245 313 m 195 X 1018 Y 18
 X 390 Y 18 X 53 Y 18 X 39 Y 18 X 24 Y 17 X 23 Y 18 X -17 Y 18 X -43 Y 18 X -82 Y 17 X -191 Y 18 X -149 Y 18 X -109 Y 18 X -93 Y 18 X -87 Y 17 X -65 Y 18 X -62 Y 18 X -52 Y 18 X -57 Y 18 X -42 Y 17 X -46 Y 18 X -40 Y 18 X -33 Y 18 X -42 Y 17 X -24 Y
 18 X -31 Y 18 X -25 Y 18 X -27 Y 18 X -22 Y 17 X -21 Y 18 X -18 Y 18 X -19 Y 18 X -15 Y 17 X -15 Y 18 X -14 Y 18 X -12 Y 18 X -11 Y 18 X -11 Y 17 X -8 Y 18 X -9 Y 18 X -7 Y 18 X -7 Y 17 X -5 Y 18 X -6 Y 18 X -5 Y 18 X -4 Y 18 X -3 Y 17 X -3 Y 18 X
 -3 Y 18 X -2 Y 18 X -2 Y 17 X -2 Y 18 X -1 Y 18 X -1 Y 18 X -1 Y 18 X -1 Y 35 X -1 Y 36 X -1 Y 160 X -1 Y 355 X 1 Y 18 X -1 Y 18 X s black 245 235 m 1778 X s
 gsave  2222 2133 23 22 C 1990.42 68.3734 t 0 r /Helvetica findfont 45.6261 sf 0 0 m (ll) show NC gr 
 gsave  2222 2133 23 22 C 1990.42 129.15 t 0 r /Helvetica findfont 45.6261 sf 0 0 m (T) show NC gr 
 gsave  2222 2133 23 22 C 1952.44 106.359 t 0 r /Helvetica findfont 68.4392 sf 0 0 m (p) show NC gr  245 286 m -51 Y s 289 261 m -26 Y s 334 261 m -26 Y s 378 261 m -26 Y s 423 261 m -26 Y s 467 286 m -51 Y s 512 261 m -26 Y s 556 261 m -26 Y s 600
 261 m -26 Y s 645 261 m -26 Y s 689 286 m -51 Y s 734 261 m -26 Y s 778 261 m -26 Y s 823 261 m -26 Y s 867 261 m -26 Y s 912 286 m -51 Y s 956 261 m -26 Y s 1001 261 m -26 Y s 1045 261 m -26 Y s 1089 261 m -26 Y s 1134 286 m -51 Y s 1178 261 m -26
 Y s 1223 261 m -26 Y s 1267 261 m -26 Y s 1312 261 m -26 Y s 1356 286 m -51 Y s 1401 261 m -26 Y s 1445 261 m -26 Y s 1489 261 m -26 Y s 1534 261 m -26 Y s 1578 286 m -51 Y s 1623 261 m -26 Y s 1667 261 m -26 Y s 1712 261 m -26 Y s 1756 261 m -26 Y
 s 1801 286 m -51 Y s 1845 261 m -26 Y s 1889 261 m -26 Y s 1934 261 m -26 Y s 1978 261 m -26 Y s 2023 286 m -51 Y s
 gsave  2222 2133 23 22 C 224.113 167.135 t 0 r /Helvetica findfont 68.4392 sf 0 0 m (0) show NC gr 
 gsave  2222 2133 23 22 C 425.434 167.135 t 0 r /Helvetica findfont 68.4392 sf 0 0 m (50) show NC gr 
 gsave  2222 2133 23 22 C 630.554 167.135 t 0 r /Helvetica findfont 68.4392 sf 0 0 m (100) show NC gr 
 gsave  2222 2133 23 22 C 850.869 167.135 t 0 r /Helvetica findfont 68.4392 sf 0 0 m (150) show NC gr 
 gsave  2222 2133 23 22 C 1074.98 167.135 t 0 r /Helvetica findfont 68.4392 sf 0 0 m (200) show NC gr 
 gsave  2222 2133 23 22 C 1299.09 167.135 t 0 r /Helvetica findfont 68.4392 sf 0 0 m (250) show NC gr 
 gsave  2222 2133 23 22 C 1519.41 167.135 t 0 r /Helvetica findfont 68.4392 sf 0 0 m (300) show NC gr 
 gsave  2222 2133 23 22 C 1743.52 167.135 t 0 r /Helvetica findfont 68.4392 sf 0 0 m (350) show NC gr 
 gsave  2222 2133 23 22 C 1963.83 167.135 t 0 r /Helvetica findfont 68.4392 sf 0 0 m (400) show NC gr  245 235 m 1706 Y s
 gsave  2222 2133 23 22 C 113.956 1162.35 t 90 r /Helvetica findfont 45.6261 sf 0 0 m (ll) show NC gr 
 gsave  2222 2133 23 22 C 45.5822 1162.35 t 90 r /Helvetica findfont 45.6261 sf 0 0 m (T) show NC gr 
 gsave  2222 2133 23 22 C 79.7689 1063.59 t 90 r /Helvetica findfont 68.4392 sf 0 0 m (/dp) show NC gr 
 gsave  2222 2133 23 22 C 79.7689 1021.8 t 90 r /Symbol findfont 68.4392 sf 0 0 m (s) show NC gr 
 gsave  2222 2133 23 22 C 79.7689 987.615 t 90 r /Helvetica findfont 68.4392 sf 0 0 m (d) show NC gr  298 313 m -53 X s 272 393 m -27 X s 272 474 m -27 X s 272 554 m -27 X s 298 635 m -53 X s 272 716 m -27 X s 272 796 m -27 X s 272 877 m -27 X s 298
 958 m -53 X s 272 1038 m -27 X s 272 1119 m -27 X s 272 1199 m -27 X s 298 1280 m -53 X s 272 1361 m -27 X s 272 1441 m -27 X s 272 1522 m -27 X s 298 1603 m -53 X s 272 1683 m -27 X s 272 1764 m -27 X s 272 1844 m -27 X s 298 1925 m -53 X s 298 313
 m -53 X s 298 1925 m -53 X s
 gsave  2222 2133 23 22 C 208.919 300.083 t 0 r /Helvetica findfont 38.0218 sf 0 0 m (0) show NC gr 
 gsave  2222 2133 23 22 C 155.739 622.957 t 0 r /Helvetica findfont 38.0218 sf 0 0 m (0.02) show NC gr 
 gsave  2222 2133 23 22 C 155.739 945.832 t 0 r /Helvetica findfont 38.0218 sf 0 0 m (0.04) show NC gr 
 gsave  2222 2133 23 22 C 155.739 1264.91 t 0 r /Helvetica findfont 38.0218 sf 0 0 m (0.06) show NC gr 
 gsave  2222 2133 23 22 C 155.739 1587.78 t 0 r /Helvetica findfont 38.0218 sf 0 0 m (0.08) show NC gr 
 gsave  2222 2133 23 22 C 186.127 1910.66 t 0 r /Helvetica findfont 38.0218 sf 0 0 m (0.1) show NC gr  0.8 0 0.8 c 1 0 1 c /w 2 def /w2 {w 2 div} def /w3 {w 3 div} def 254 313 m20 272 313 m20 289 313 m20 307 313 m20 325 313 m20 343 313 m20 360 313
 m20 378 313 m20 396 313 m20 414 313 m20 432 313 m20 449 1331 m20 467 1721 m20 485 1774 m20 503 1813 m20 520 1837 m20 538 1860 m20 556 1843 m20 574 1800 m20 592 1718 m20 609 1527 m20 627 1378 m20 645 1269 m20 663 1176 m20 680 1089 m20 698 1024 m20
 716 962 m20 734 910 m20 752 853 m20 769 811 m20 787 765 m20 805 725 m20 823 692 m20 841 650 m20 858 626 m20 876 595 m20 894 570 m20 912 543 m20 929 521 m20 947 500 m20 965 482 m20 983 463 m20 1001 448 m20 1018 433 m20 1036 419 m20 1054 407 m20 1072
 396 m20 1089 385 m20 1107 377 m20 1125 368 m20 1143 361 m20 1161 354 m20 1178 349 m20 1196 343 m20 1214 338 m20 1232 334 m20 1249 331 m20 1267 328 m20 1285 325 m20 1303 323 m20 1321 321 m20 1338 319 m20 1356 318 m20 1374 317 m20 1392 316 m20 1409
 315 m20 1427 315 m20 1445 314 m20 1463 314 m20 1481 313 m20 1498 313 m20 1516 313 m20 1534 313 m20 1552 313 m20 1569 313 m20 1587 313 m20 1605 313 m20 1623 313 m20 1641 312 m20 1658 312 m20 1676 312 m20 1694 312 m20 1712 312 m20 1729 312 m20 1747
 312 m20 1765 312 m20 1783 312 m20 1801 312 m20 1818 312 m20 1836 312 m20 1854 312 m20 1872 312 m20 1889 312 m20 1907 312 m20 1925 312 m20 1943 312 m20 1961 312 m20 1978 312 m20 1996 313 m20 2014 312 m20 0.8 0 0.8 c black 0.8 0 0.8 c 1 lw <<
 /PatternType 1 /PaintType 2 /TilingType 1 /BBox [ 0 0 100 100 ] /XStep 100 /YStep 100 /PaintProc { begin gsave 0 0 m 100 100 l 0 100 m 100 0 l s gr end } >> [ 0.24 0 0 0.24 0 0 ] makepattern /P13 exch def /cs {[/Pattern /DeviceRGB] setcolorspace}
 def /FA {f [/DeviceRGB] setcolorspace} def cs 0.8 0 0.8 P13 setcolor 254 313 m 178 X 17 1023 d 18 391 d 18 53 d 18 39 d 17 24 d 18 23 d 18 -17 d 18 -43 d 18 -82 d 17 -191 d 18 -151 d 18 -109 d 18 -93 d 17 -87 d 18 -66 d 18 -62 d 18 -52 d 18 -57 d 17
 -42 d 18 -47 d 18 -40 d 18 -33 d 18 -42 d 17 -24 d 18 -31 d 18 -26 d 18 -27 d 17 -22 d 18 -21 d 18 -18 d 18 -19 d 18 -15 d 17 -15 d 18 -14 d 18 -13 d 18 -11 d 17 -10 d 18 -9 d 18 -8 d 18 -8 d 18 -6 d 17 -6 d 18 -5 d 18 -5 d 18 -4 d 17 -4 d 18 -3 d
 18 -2 d 18 -3 d 18 -2 d 17 -2 d 18 -1 d 18 -1 d 18 -1 d 17 -1 d 18 X 18 -1 d 36 X 17 -1 d 125 X 18 -1 d 320 X 17 1 d 18 X 18 -1 d -391 X -18 1 d -124 X -18 1 d -18 X -18 1 d -18 X -17 1 d -18 1 d -18 1 d -18 1 d -17 2 d -18 2 d -18 2 d -18 3 d -18 3
 d -17 3 d -18 4 d -18 5 d -18 6 d -17 5 d -18 7 d -18 7 d -18 8 d -18 9 d -17 10 d -18 11 d -18 12 d -18 14 d -17 15 d -18 15 d -18 19 d -18 18 d -18 21 d -17 22 d -18 27 d -18 25 d -18 31 d -17 23 d -18 42 d -18 32 d -18 41 d -18 46 d -17 42 d -18
 56 d -18 52 d -18 62 d -18 65 d -17 86 d -18 92 d -18 109 d -18 149 d -17 190 d -18 82 d -18 43 d -18 17 d -18 -23 d -17 -24 d -18 -39 d -18 -52 d -18 -390 d -17 -1013 d -178 X FA 3 lw 0.8 0.8 0 c 1 1 1 c 1 1 0 c 0.8 0.8 0 c 245 313 m 195 X 893 Y 18
 X 346 Y 18 X 45 Y 18 X 40 Y 18 X 19 Y 17 X 23 Y 18 X -11 Y 18 X -39 Y 18 X -74 Y 17 X -159 Y 18 X -129 Y 18 X -93 Y 18 X -79 Y 18 X -70 Y 17 X -58 Y 18 X -53 Y 18 X -44 Y 18 X -49 Y 18 X -37 Y 17 X -39 Y 18 X -37 Y 18 X -29 Y 18 X -36 Y 17 X -22 Y
 18 X -29 Y 18 X -23 Y 18 X -25 Y 18 X -19 Y 17 X -20 Y 18 X -18 Y 18 X -18 Y 18 X -14 Y 17 X -14 Y 18 X -13 Y 18 X -13 Y 18 X -11 Y 18 X -10 Y 17 X -9 Y 18 X -9 Y 18 X -7 Y 18 X -7 Y 17 X -5 Y 18 X -7 Y 18 X -5 Y 18 X -4 Y 18 X -4 Y 17 X -4 Y 18 X
 -2 Y 18 X -4 Y 18 X -2 Y 17 X -2 Y 18 X -2 Y 18 X -1 Y 18 X -2 Y 18 X -1 Y 35 X -1 Y 18 X -1 Y 35 X -1 Y 36 X -1 Y 142 X -1 Y 356 X s 1 1 0 c 254 313 m20 272 313 m20 289 313 m20 307 313 m20 325 313 m20 343 313 m20 360 313 m20 378 313 m20 396 313 m20
 414 313 m20 432 313 m20 449 1206 m20 467 1552 m20 485 1597 m20 503 1637 m20 520 1656 m20 538 1679 m20 556 1668 m20 574 1629 m20 592 1555 m20 609 1396 m20 627 1267 m20 645 1174 m20 663 1095 m20 680 1025 m20 698 967 m20 716 914 m20 734 870 m20 752 821
 m20 769 784 m20 787 745 m20 805 708 m20 823 679 m20 841 643 m20 858 621 m20 876 592 m20 894 569 m20 912 544 m20 929 525 m20 947 505 m20 965 487 m20 983 469 m20 1001 455 m20 1018 441 m20 1036 428 m20 1054 415 m20 1072 404 m20 1089 394 m20 1107 385
 m20 1125 376 m20 1143 369 m20 1161 362 m20 1178 357 m20 1196 350 m20 1214 345 m20 1232 341 m20 1249 337 m20 1267 333 m20 1285 331 m20 1303 327 m20 1321 325 m20 1338 323 m20 1356 321 m20 1374 320 m20 1392 318 m20 1409 317 m20 1427 317 m20 1445 316
 m20 1463 315 m20 1481 315 m20 1498 314 m20 1516 314 m20 1534 313 m20 1552 313 m20 1569 313 m20 1587 313 m20 1605 313 m20 1623 313 m20 1641 313 m20 1658 313 m20 1676 312 m20 1694 312 m20 1712 312 m20 1729 312 m20 1747 312 m20 1765 312 m20 1783 312
 m20 1801 312 m20 1818 312 m20 1836 312 m20 1854 312 m20 1872 312 m20 1889 312 m20 1907 312 m20 1925 312 m20 1943 312 m20 1961 312 m20 1978 312 m20 1996 312 m20 2014 312 m20 0.8 0.8 0 c black 0.8 0.8 0 c cs 0.8 0.8 0 P13 setcolor 254 313 m 178 X 17
 897 d 18 346 d 18 45 d 18 40 d 17 19 d 18 23 d 18 -10 d 18 -39 d 18 -75 d 17 -159 d 18 -130 d 18 -93 d 18 -78 d 17 -72 d 18 -57 d 18 -53 d 18 -45 d 18 -49 d 17 -37 d 18 -39 d 18 -37 d 18 -29 d 18 -37 d 17 -21 d 18 -29 d 18 -24 d 18 -24 d 17 -20 d 18
 -20 d 18 -18 d 18 -18 d 18 -14 d 17 -15 d 18 -13 d 18 -12 d 18 -11 d 17 -10 d 18 -10 d 18 -8 d 18 -8 d 18 -7 d 17 -5 d 18 -6 d 18 -5 d 18 -5 d 17 -4 d 18 -4 d 18 -2 d 18 -3 d 18 -3 d 17 -2 d 18 -1 d 18 -2 d 18 -1 d 17 -1 d 18 -1 d 18 -1 d 18 -1 d 18
 X 17 -1 d 36 X 18 -1 d 124 X 18 -1 d 320 X -338 X -18 1 d -124 X -18 1 d -18 X -17 1 d -36 X -18 1 d -18 1 d -17 1 d -18 2 d -18 1 d -18 2 d -17 2 d -18 2 d -18 3 d -18 3 d -18 3 d -17 4 d -18 5 d -18 5 d -18 6 d -17 5 d -18 7 d -18 8 d -18 8 d -18
 9 d -17 11 d -18 10 d -18 13 d -18 13 d -17 14 d -18 14 d -18 18 d -18 17 d -18 20 d -17 20 d -18 24 d -18 24 d -18 29 d -17 21 d -18 37 d -18 29 d -18 36 d -18 39 d -17 37 d -18 48 d -18 44 d -18 54 d -18 57 d -17 70 d -18 78 d -18 93 d -18 129 d
 -17 158 d -18 75 d -18 38 d -18 11 d -18 -23 d -17 -19 d -18 -40 d -18 -45 d -18 -344 d -17 -890 d -178 X FA black 1 1 1 c black 245 313 m 195 X 942 Y 18 X 362 Y 18 X 48 Y 18 X 36 Y 18 X 23 Y 17 X 21 Y 18 X -13 Y 18 X -40 Y 18 X -75 Y 17 X -169 Y 18
 X -134 Y 18 X -99 Y 18 X -84 Y 18 X -77 Y 17 X -61 Y 18 X -57 Y 18 X -47 Y 18 X -53 Y 18 X -38 Y 17 X -43 Y 18 X -38 Y 18 X -30 Y 18 X -39 Y 17 X -23 Y 18 X -30 Y 18 X -24 Y 18 X -26 Y 18 X -20 Y 17 X -21 Y 18 X -17 Y 18 X -19 Y 18 X -15 Y 17 X -14
 Y 18 X -13 Y 18 X -13 Y 18 X -11 Y 18 X -10 Y 17 X -9 Y 18 X -9 Y 18 X -7 Y 18 X -7 Y 17 X -5 Y 18 X -7 Y 18 X -5 Y 18 X -4 Y 18 X -4 Y 17 X -3 Y 18 X -3 Y 18 X -3 Y 18 X -2 Y 17 X -2 Y 18 X -1 Y 18 X -2 Y 18 X -1 Y 18 X -1 Y 17 X -1 Y 36 X -1 Y 35
 X -1 Y 54 X -1 Y 480 X s 254 313 m20 272 313 m20 289 313 m20 307 313 m20 325 313 m20 343 313 m20 360 313 m20 378 313 m20 396 313 m20 414 313 m20 432 313 m20 449 1255 m20 467 1617 m20 485 1665 m20 503 1701 m20 520 1724 m20 538 1745 m20 556 1732 m20
 574 1692 m20 592 1617 m20 609 1448 m20 627 1314 m20 645 1215 m20 663 1131 m20 680 1054 m20 698 993 m20 716 936 m20 734 889 m20 752 836 m20 769 798 m20 787 755 m20 805 717 m20 823 687 m20 841 648 m20 858 625 m20 876 595 m20 894 571 m20 912 545 m20
 929 525 m20 947 504 m20 965 487 m20 983 468 m20 1001 453 m20 1018 439 m20 1036 426 m20 1054 413 m20 1072 402 m20 1089 392 m20 1107 383 m20 1125 374 m20 1143 367 m20 1161 360 m20 1178 355 m20 1196 348 m20 1214 343 m20 1232 339 m20 1249 335 m20 1267
 332 m20 1285 329 m20 1303 326 m20 1321 324 m20 1338 322 m20 1356 321 m20 1374 319 m20 1392 318 m20 1409 317 m20 1427 316 m20 1445 316 m20 1463 315 m20 1481 315 m20 1498 314 m20 1516 314 m20 1534 314 m20 1552 313 m20 1569 313 m20 1587 313 m20 1605
 313 m20 1623 313 m20 1641 313 m20 1658 313 m20 1676 313 m20 1694 313 m20 1712 313 m20 1729 313 m20 1747 313 m20 1765 313 m20 1783 313 m20 1801 313 m20 1818 313 m20 1836 313 m20 1854 313 m20 1872 313 m20 1889 313 m20 1907 313 m20 1925 313 m20 1943
 313 m20 1961 313 m20 1978 313 m20 1996 313 m20 2014 313 m20 cs 0 0 0 P13 setcolor 254 313 m 178 X 17 947 d 18 362 d 18 48 d 18 36 d 17 23 d 18 21 d 18 -13 d 18 -39 d 18 -76 d 17 -170 d 18 -134 d 18 -100 d 18 -84 d 17 -77 d 18 -61 d 18 -57 d 18 -48 d
 18 -52 d 17 -39 d 18 -43 d 18 -38 d 18 -30 d 18 -40 d 17 -22 d 18 -30 d 18 -24 d 18 -26 d 17 -21 d 18 -21 d 18 -17 d 18 -19 d 18 -15 d 17 -14 d 18 -14 d 18 -12 d 18 -11 d 17 -11 d 18 -9 d 18 -8 d 18 -8 d 18 -7 d 17 -5 d 18 -6 d 18 -5 d 18 -5 d 17 -3
 d 18 -4 d 18 -3 d 18 -2 d 18 -2 d 17 -3 d 18 -1 d 18 -1 d 18 -2 d 17 -1 d 18 -1 d 18 X 18 -1 d 18 X 17 -1 d 36 X 18 -1 d 462 X -462 X -18 1 d -36 X -17 1 d -18 X -18 1 d -18 X -18 1 d -17 1 d -18 1 d -18 2 d -18 1 d -17 2 d -18 2 d -18 3 d -18 3 d
 -18 3 d -17 4 d -18 4 d -18 5 d -18 6 d -17 5 d -18 7 d -18 8 d -18 8 d -18 9 d -17 10 d -18 11 d -18 13 d -18 13 d -17 14 d -18 15 d -18 19 d -18 17 d -18 21 d -17 20 d -18 26 d -18 24 d -18 30 d -17 22 d -18 39 d -18 30 d -18 38 d -18 43 d -17 38
 d -18 52 d -18 48 d -18 56 d -18 61 d -17 77 d -18 83 d -18 99 d -18 133 d -17 169 d -18 75 d -18 39 d -18 14 d -18 -21 d -17 -23 d -18 -36 d -18 -48 d -18 -361 d -17 -938 d -178 X FA 0.8 0 0 c 1 1 1 c 1 0 0 c 0.8 0 0 c 245 313 m 195 X 345 Y 18 X
 132 Y 18 X 17 Y 18 X 13 Y 18 X 10 Y 17 X 7 Y 18 X -3 Y 18 X -13 Y 18 X -28 Y 17 X -54 Y 18 X -44 Y 18 X -34 Y 18 X -29 Y 18 X -25 Y 17 X -22 Y 18 X -20 Y 18 X -17 Y 18 X -19 Y 18 X -14 Y 17 X -15 Y 18 X -15 Y 18 X -11 Y 18 X -15 Y 17 X -9 Y 18 X -12
 Y 18 X -9 Y 18 X -11 Y 18 X -8 Y 17 X -8 Y 18 X -8 Y 18 X -7 Y 18 X -7 Y 17 X -6 Y 18 X -6 Y 18 X -5 Y 18 X -5 Y 18 X -5 Y 17 X -4 Y 18 X -4 Y 18 X -3 Y 18 X -3 Y 17 X -3 Y 18 X -3 Y 18 X -2 Y 18 X -2 Y 18 X -2 Y 17 X -2 Y 18 X -1 Y 18 X -2 Y 18 X
 -1 Y 17 X -1 Y 18 X -1 Y 18 X -1 Y 18 X -1 Y 35 X -1 Y 36 X -1 Y 53 X -1 Y 107 X -1 Y 409 X s 1 0 0 c 254 313 m20 272 313 m20 289 313 m20 307 313 m20 325 313 m20 343 313 m20 360 313 m20 378 313 m20 396 313 m20 414 313 m20 432 313 m20 449 658 m20 467
 790 m20 485 807 m20 503 820 m20 520 830 m20 538 837 m20 556 834 m20 574 821 m20 592 793 m20 609 739 m20 627 695 m20 645 661 m20 663 632 m20 680 607 m20 698 585 m20 716 565 m20 734 548 m20 752 529 m20 769 515 m20 787 500 m20 805 485 m20 823 474 m20
 841 459 m20 858 450 m20 876 438 m20 894 429 m20 912 418 m20 929 410 m20 947 402 m20 965 394 m20 983 387 m20 1001 380 m20 1018 374 m20 1036 368 m20 1054 363 m20 1072 358 m20 1089 353 m20 1107 349 m20 1125 345 m20 1143 342 m20 1161 339 m20 1178 336
 m20 1196 333 m20 1214 331 m20 1232 329 m20 1249 327 m20 1267 325 m20 1285 324 m20 1303 322 m20 1321 321 m20 1338 320 m20 1356 319 m20 1374 318 m20 1392 317 m20 1409 317 m20 1427 316 m20 1445 316 m20 1463 315 m20 1481 315 m20 1498 315 m20 1516 314
 m20 1534 314 m20 1552 314 m20 1569 314 m20 1587 314 m20 1605 314 m20 1623 313 m20 1641 313 m20 1658 313 m20 1676 313 m20 1694 313 m20 1712 313 m20 1729 313 m20 1747 313 m20 1765 313 m20 1783 313 m20 1801 313 m20 1818 313 m20 1836 313 m20 1854 313
 m20 1872 313 m20 1889 313 m20 1907 313 m20 1925 313 m20 1943 313 m20 1961 313 m20 1978 313 m20 1996 313 m20 2014 313 m20 0.8 0 0 c black 0.8 0 0 c cs 0.8 0 0 P13 setcolor 254 313 m 178 X 17 346 d 18 133 d 18 16 d 18 14 d 17 9 d 18 7 d 18 -2 d 18 -14
 d 18 -28 d 17 -54 d 18 -44 d 18 -34 d 18 -29 d 17 -25 d 18 -21 d 18 -21 d 18 -17 d 18 -19 d 17 -14 d 18 -16 d 18 -14 d 18 -11 d 18 -16 d 17 -8 d 18 -12 d 18 -10 d 18 -10 d 17 -8 d 18 -9 d 18 -7 d 18 -8 d 18 -6 d 17 -6 d 18 -6 d 18 -6 d 18 -5 d 17 -4
 d 18 -5 d 18 -3 d 18 -4 d 18 -3 d 17 -2 d 18 -3 d 18 -3 d 18 -2 d 17 -2 d 18 -2 d 18 -1 d 18 -2 d 18 -1 d 17 -1 d 18 -1 d 18 -1 d 18 -1 d 17 X 18 -1 d 18 X 18 -1 d 53 X 18 -1 d 89 X 18 -1 d 373 X -391 X -18 1 d -89 X -18 1 d -35 X -18 1 d -18 X -18
 1 d -17 X -18 1 d -18 1 d -18 X -17 2 d -18 1 d -18 1 d -18 2 d -18 1 d -17 2 d -18 3 d -18 2 d -18 3 d -17 2 d -18 4 d -18 3 d -18 4 d -18 4 d -17 5 d -18 4 d -18 6 d -18 6 d -17 6 d -18 6 d -18 8 d -18 7 d -18 8 d -17 8 d -18 11 d -18 9 d -18 13 d
 -17 8 d -18 15 d -18 11 d -18 15 d -18 15 d -17 14 d -18 19 d -18 17 d -18 20 d -18 22 d -17 25 d -18 29 d -18 34 d -18 44 d -17 53 d -18 28 d -18 14 d -18 2 d -18 -7 d -17 -9 d -18 -14 d -18 -16 d -18 -133 d -17 -343 d -178 X FA black 1 1 1 c 556
 639 1578 1302 bf black 1578 1302 m 556 X s 2134 1302 m 639 Y s 2134 1941 m -556 X s 1578 1941 m -639 Y s
 gsave  2222 2133 23 22 C 1716.93 1827.09 t 0 r /Helvetica findfont 95.0544 sf 0 0 m (No Int) show NC gr  0.8 0 0 c 1599 1861 m 97 X s black
 gsave  2222 2133 23 22 C 1716.93 1663.75 t 0 r /Helvetica findfont 95.0544 sf 0 0 m (Add) show NC gr  0.8 0.8 0 c 1599 1702 m 97 X s black
 gsave  2222 2133 23 22 C 1716.93 1504.21 t 0 r /Helvetica findfont 95.0544 sf 0 0 m (Mult) show NC gr  0.8 0 0.8 c 1599 1542 m 97 X s black
 gsave  2222 2133 23 22 C 1716.93 1344.68 t 0 r /Helvetica findfont 95.0544 sf 0 0 m (Central) show NC gr  1599 1382 m 97 X s
 gsave  2222 2133 23 22 C 2199.34 1568.79 t 90 r /Helvetica-BoldOblique findfont 38.0218 sf 0 0 m (LHC HIGGS XS WG 2013) show NC gr 
 gr  gr showpage
end
%%EOF
