%!PS-Adobe-2.0 EPSF-2.0
%%BoundingBox:  0 0 567 544
%%Title: HWW_400_met_rel_reweighting_cut_YR3.eps: HWW 400Gev MET rel reweighting for interference with cuts
%%Creator: ROOT Version 5.34/05
%%CreationDate: Fri Jun 14 02:56:50 2013
%%EndComments
%%BeginProlog
80 dict begin
/s {stroke} def /l {lineto} def /m {moveto} def /t {translate} def
/r {rotate} def /rl {roll}  def /R {repeat} def
/d {rlineto} def /rm {rmoveto} def /gr {grestore} def /f {eofill} def
/c {setrgbcolor} def /black {0 setgray} def /sd {setdash} def
/cl {closepath} def /sf {scalefont setfont} def /lw {setlinewidth} def
/box {m dup 0 exch d exch 0 d 0 exch neg d cl} def
/NC{systemdict begin initclip end}def/C{NC box clip newpath}def
/bl {box s} def /bf {box f} def /Y { 0 exch d} def /X { 0 d} def 
/K {{pop pop 0 moveto} exch kshow} bind def
/ita {/ang 15 def gsave [1 0 ang dup sin exch cos div 1 0 0] concat} def 
/mp {newpath /y exch def /x exch def} def
/side {[w .77 mul w .23 mul] .385 w mul sd w 0 l currentpoint t -144 r} def
/mr {mp x y w2 0 360 arc} def /m24 {mr s} def /m20 {mr f} def
/mb {mp x y w2 add m w2 neg 0 d 0 w neg d w 0 d 0 w d cl} def
/mt {mp x y w2 add m w2 neg w neg d w 0 d cl} def
/m21 {mb f} def /m25 {mb s} def /m22 {mt f} def /m26{mt s} def
/m23 {mp x y w2 sub m w2 w d w neg 0 d cl f} def
/m27 {mp x y w2 add m w3 neg w2 neg d w3 w2 neg d w3 w2 d cl s} def
/m28 {mp x w2 sub y w2 sub w3 add m w3 0 d  0 w3 neg d w3 0 d 0 w3 d w3 0 d  0 w3 d w3 neg 0 d 0 w3 d w3 neg 0 d 0 w3 neg d w3 neg 0 d cl s } def
/m29 {mp gsave x w2 sub y w2 add w3 sub m currentpoint t 4 {side} repeat cl fill gr} def
/m30 {mp gsave x w2 sub y w2 add w3 sub m currentpoint t 4 {side} repeat cl s gr} def
/m31 {mp x y w2 sub m 0 w d x w2 sub y m w 0 d x w2 sub y w2 add m w w neg d x w2 sub y w2 sub m w w d s} def
/m32 {mp x y w2 sub m w2 w d w neg 0 d cl s} def
/m33 {mp x y w2 add m w3 neg w2 neg d w3 w2 neg d w3 w2 d cl f} def
/m34 {mp x w2 sub y w2 sub w3 add m w3 0 d  0 w3 neg d w3 0 d 0 w3 d w3 0 d  0 w3 d w3 neg 0 d 0 w3 d w3 neg 0 d 0 w3 neg d w3 neg 0 d cl f } def
/m2 {mp x y w2 sub m 0 w d x w2 sub y m w 0 d s} def
/m5 {mp x w2 sub y w2 sub m w w d x w2 sub y w2 add m w w neg d s} def
/reEncode {exch findfont dup length dict begin {1 index /FID eq  {pop pop} {def} ifelse } forall /Encoding exch def currentdict end dup /FontName get exch definefont pop } def [/Times-Bold /Times-Italic /Times-BoldItalic /Helvetica /Helvetica-Oblique
 /Helvetica-Bold /Helvetica-BoldOblique /Courier /Courier-Oblique /Courier-Bold /Courier-BoldOblique /Times-Roman /AvantGarde-Book /AvantGarde-BookOblique /AvantGarde-Demi /AvantGarde-DemiOblique /Bookman-Demi /Bookman-DemiItalic /Bookman-Light
 /Bookman-LightItalic /Helvetica-Narrow /Helvetica-Narrow-Bold /Helvetica-Narrow-BoldOblique /Helvetica-Narrow-Oblique /NewCenturySchlbk-Roman /NewCenturySchlbk-Bold /NewCenturySchlbk-BoldItalic /NewCenturySchlbk-Italic /Palatino-Bold
 /Palatino-BoldItalic /Palatino-Italic /Palatino-Roman ] {ISOLatin1Encoding reEncode } forall
%%EndProlog
%%BeginSetup
%%EndSetup
newpath  gsave  .25 .25 scale  gsave  0 0 t black[  ] 0 sd 3 lw 1 1 1 c 2268 2177 0 0 bf black 1 1 1 c 2268 1568 0 609 bf black 1 1 1 c 1814 1411 227 609 bf black 1814 1411 227 609 bl 0 0 1 c 1 1 1 c 0 0 1 c 227 943 m 18 X 2 Y 18 X -5 Y 18 X 8 Y 18 X
 3 Y 18 X 4 Y 19 X 10 Y 18 X -1 Y 18 X 14 Y 18 X 12 Y 18 X 12 Y 18 X 15 Y 18 X 21 Y 19 X 17 Y 18 X 21 Y 18 X 17 Y 18 X 19 Y 18 X 31 Y 18 X 19 Y 18 X 32 Y 19 X 52 Y 18 X 61 Y 18 X 307 Y 18 X 244 Y 18 X 18 Y 18 X 7 Y 18 X 10 Y 19 X 13 Y 18 X 18 Y 18 X
 8 Y 18 X 2 Y 18 X 2 Y 18 X 17 Y 18 X -4 Y 19 X -17 Y 18 X -11 Y 18 X -21 Y 18 X -36 Y 18 X -62 Y 18 X -93 Y 18 X -132 Y 19 X -119 Y 18 X -89 Y 18 X -89 Y 18 X -54 Y 18 X -62 Y 18 X -53 Y 18 X -41 Y 19 X -38 Y 18 X -39 Y 18 X -30 Y 18 X -28 Y 18 X
 -27 Y 18 X -26 Y 18 X -21 Y 19 X -21 Y 18 X -16 Y 18 X -13 Y 18 X -15 Y 18 X -14 Y 18 X -12 Y 18 X -9 Y 19 X -9 Y 18 X -7 Y 18 X -10 Y 18 X -6 Y 18 X -7 Y 18 X -6 Y 18 X -5 Y 19 X -5 Y 18 X -2 Y 18 X -5 Y 18 X -3 Y 18 X -2 Y 18 X -4 Y 18 X -2 Y 19 X
 -2 Y 18 X -2 Y 18 X -2 Y 36 X -1 Y 18 X -2 Y 18 X -1 Y 19 X -1 Y 18 X -1 Y 36 X -1 Y 54 X -1 Y 73 X -1 Y 18 X 1 Y 36 X -1 Y 19 X 1 Y 54 X s black 227 609 m 1814 X s 227 647 m -38 Y s 272 628 m -19 Y s 317 628 m -19 Y s 363 628 m -19 Y s 408 647 m
 -38 Y s 454 628 m -19 Y s 499 628 m -19 Y s 544 628 m -19 Y s 590 647 m -38 Y s 635 628 m -19 Y s 680 628 m -19 Y s 726 628 m -19 Y s 771 647 m -38 Y s 816 628 m -19 Y s 862 628 m -19 Y s 907 628 m -19 Y s 952 647 m -38 Y s 998 628 m -19 Y s 1043
 628 m -19 Y s 1089 628 m -19 Y s 1134 647 m -38 Y s 1179 628 m -19 Y s 1225 628 m -19 Y s 1270 628 m -19 Y s 1315 647 m -38 Y s 1361 628 m -19 Y s 1406 628 m -19 Y s 1451 628 m -19 Y s 1497 647 m -38 Y s 1542 628 m -19 Y s 1587 628 m -19 Y s 1633
 628 m -19 Y s 1678 647 m -38 Y s 1723 628 m -19 Y s 1769 628 m -19 Y s 1814 628 m -19 Y s 1860 647 m -38 Y s 1905 628 m -19 Y s 1950 628 m -19 Y s 1996 628 m -19 Y s 2041 647 m -38 Y s
 gsave  2268 1568 0 609 C 208.919 558.382 t 0 r /Helvetica findfont 49.4479 sf 0 0 m (0) show NC gr 
 gsave  2268 1568 0 609 C 379.852 558.382 t 0 r /Helvetica findfont 49.4479 sf 0 0 m (20) show NC gr 
 gsave  2268 1568 0 609 C 562.181 558.382 t 0 r /Helvetica findfont 49.4479 sf 0 0 m (40) show NC gr 
 gsave  2268 1568 0 609 C 740.711 558.382 t 0 r /Helvetica findfont 49.4479 sf 0 0 m (60) show NC gr 
 gsave  2268 1568 0 609 C 923.04 558.382 t 0 r /Helvetica findfont 49.4479 sf 0 0 m (80) show NC gr 
 gsave  2268 1568 0 609 C 1090.18 558.382 t 0 r /Helvetica findfont 49.4479 sf 0 0 m (100) show NC gr 
 gsave  2268 1568 0 609 C 1272.5 558.382 t 0 r /Helvetica findfont 49.4479 sf 0 0 m (120) show NC gr 
 gsave  2268 1568 0 609 C 1454.83 558.382 t 0 r /Helvetica findfont 49.4479 sf 0 0 m (140) show NC gr 
 gsave  2268 1568 0 609 C 1633.36 558.382 t 0 r /Helvetica findfont 49.4479 sf 0 0 m (160) show NC gr 
 gsave  2268 1568 0 609 C 1815.69 558.382 t 0 r /Helvetica findfont 49.4479 sf 0 0 m (180) show NC gr 
 gsave  2268 1568 0 609 C 1998.02 558.382 t 0 r /Helvetica findfont 49.4479 sf 0 0 m (200) show NC gr  227 609 m 1411 Y s
 gsave  2268 1568 0 609 C 68.3734 1348.47 t 90 r /Helvetica findfont 34.2332 sf 0 0 m (T,rel) show NC gr 
 gsave  2268 1568 0 609 C 22.7911 1348.47 t 90 r /Helvetica findfont 34.2332 sf 0 0 m (miss) show NC gr 
 gsave  2268 1568 0 609 C 49.3808 1272.5 t 90 r /Helvetica findfont 49.4479 sf 0 0 m (/dE) show NC gr 
 gsave  2268 1568 0 609 C 49.3808 1242.12 t 90 r /Symbol findfont 49.4479 sf 0 0 m (s) show NC gr 
 gsave  2268 1568 0 609 C 49.3808 1215.53 t 90 r /Helvetica findfont 49.4479 sf 0 0 m (d) show NC gr  288 674 m -61 X s 257 732 m -30 X s 257 790 m -30 X s 257 848 m -30 X s 288 906 m -61 X s 257 964 m -30 X s 257 1022 m -30 X s 257 1080 m -30 X s
 288 1138 m -61 X s 257 1197 m -30 X s 257 1255 m -30 X s 257 1313 m -30 X s 288 1371 m -61 X s 257 1429 m -30 X s 257 1487 m -30 X s 257 1545 m -30 X s 288 1603 m -61 X s 257 1661 m -30 X s 257 1719 m -30 X s 257 1777 m -30 X s 288 1835 m -61 X s
 288 674 m -61 X s 257 616 m -30 X s 288 1835 m -61 X s 257 1894 m -30 X s 257 1952 m -30 X s 257 2010 m -30 X s
 gsave  2268 1568 0 609 C 186.127 657.144 t 0 r /Helvetica findfont 49.4479 sf 0 0 m (0) show NC gr 
 gsave  2268 1568 0 609 C 117.754 888.854 t 0 r /Helvetica findfont 49.4479 sf 0 0 m (0.02) show NC gr 
 gsave  2268 1568 0 609 C 117.754 1120.56 t 0 r /Helvetica findfont 49.4479 sf 0 0 m (0.04) show NC gr 
 gsave  2268 1568 0 609 C 117.754 1352.27 t 0 r /Helvetica findfont 49.4479 sf 0 0 m (0.06) show NC gr 
 gsave  2268 1568 0 609 C 117.754 1587.78 t 0 r /Helvetica findfont 49.4479 sf 0 0 m (0.08) show NC gr 
 gsave  2268 1568 0 609 C 151.941 1819.49 t 0 r /Helvetica findfont 49.4479 sf 0 0 m (0.1) show NC gr  0 0 1 c /w 2 def /w2 {w 2 div} def /w3 {w 3 div} def 236 943 m20 254 945 m20 272 940 m20 290 948 m20 308 951 m20 327 955 m20 345 965 m20 363 964
 m20 381 978 m20 399 990 m20 417 1002 m20 435 1017 m20 454 1038 m20 472 1055 m20 490 1076 m20 508 1093 m20 526 1112 m20 544 1143 m20 562 1162 m20 581 1194 m20 599 1246 m20 617 1307 m20 635 1614 m20 653 1858 m20 671 1876 m20 689 1883 m20 708 1893 m20
 726 1906 m20 744 1924 m20 762 1932 m20 780 1934 m20 798 1936 m20 816 1953 m20 835 1949 m20 853 1932 m20 871 1921 m20 889 1900 m20 907 1864 m20 925 1802 m20 943 1709 m20 962 1577 m20 980 1458 m20 998 1369 m20 1016 1280 m20 1034 1226 m20 1052 1164 m20
 1070 1111 m20 1089 1070 m20 1107 1032 m20 1125 993 m20 1143 963 m20 1161 935 m20 1179 908 m20 1197 882 m20 1215 861 m20 1234 840 m20 1252 824 m20 1270 811 m20 1288 796 m20 1306 782 m20 1324 770 m20 1342 761 m20 1361 752 m20 1379 745 m20 1397 735 m20
 1415 729 m20 1433 722 m20 1451 716 m20 1469 711 m20 1488 706 m20 1506 704 m20 1524 699 m20 1542 696 m20 1560 694 m20 1578 690 m20 1596 688 m20 1615 686 m20 1633 684 m20 1651 682 m20 1669 682 m20 1687 681 m20 1705 679 m20 1723 678 m20 1742 677 m20
 1760 676 m20 1778 676 m20 1796 675 m20 1814 675 m20 1832 675 m20 1850 674 m20 1869 674 m20 1887 674 m20 1905 674 m20 1923 673 m20 1941 674 m20 1959 674 m20 1977 673 m20 1996 674 m20 2014 674 m20 2032 674 m20 black 0 0 1 c 1 lw << /PatternType 1
 /PaintType 2 /TilingType 1 /BBox [ 0 0 100 100 ] /XStep 100 /YStep 100 /PaintProc { begin gsave 0 0 m 100 100 l 0 100 m 100 0 l s gr end } >> [ 0.24 0 0 0.24 0 0 ] makepattern /P13 exch def /cs {[/Pattern /DeviceRGB] setcolorspace} def /FA {f
 [/DeviceRGB] setcolorspace} def cs 0 0 1 P13 setcolor 236 946 m 18 1 d 18 -4 d 18 7 d 18 4 d 19 3 d 18 11 d 18 -1 d 18 13 d 18 13 d 18 11 d 18 16 d 19 21 d 18 16 d 18 22 d 18 17 d 18 19 d 18 31 d 18 19 d 19 32 d 18 52 d 18 62 d 18 308 d 18 244 d 18
 18 d 18 7 d 19 10 d 18 14 d 18 17 d 18 8 d 18 2 d 18 3 d 18 16 d 19 -4 d 18 -16 d 18 -11 d 18 -21 d 18 -36 d 18 -62 d 18 -94 d 19 -132 d 18 -119 d 18 -89 d 18 -90 d 18 -55 d 18 -62 d 18 -52 d 19 -42 d 18 -39 d 18 -38 d 18 -30 d 18 -29 d 18 -27 d 18
 -26 d 18 -21 d 19 -22 d 18 -15 d 18 -14 d 18 -15 d 18 -14 d 18 -12 d 18 -9 d 19 -9 d 18 -7 d 18 -10 d 18 -6 d 18 -7 d 18 -6 d 18 -5 d 19 -5 d 18 -2 d 18 -6 d 18 -2 d 18 -3 d 18 -3 d 18 -3 d 19 -2 d 18 -1 d 18 -2 d 18 -1 d 18 -1 d 18 -1 d 18 -2 d 19
 X 18 -1 d 18 -1 d 18 X 18 -1 d 18 X 18 -1 d 182 X -1 Y -18 X -18 1 d -19 -1 d -18 X -18 1 d -18 -1 d -18 1 d -73 X -18 1 d -36 X -18 1 d -18 1 d -19 1 d -18 1 d -18 1 d -18 2 d -18 X -18 2 d -18 2 d -19 2 d -18 2 d -18 4 d -18 2 d -18 2 d -18 6 d
 -18 2 d -19 5 d -18 4 d -18 7 d -18 6 d -18 6 d -18 10 d -18 7 d -19 8 d -18 10 d -18 11 d -18 14 d -18 15 d -18 14 d -18 15 d -19 21 d -18 21 d -18 26 d -18 27 d -18 28 d -18 29 d -18 39 d -18 38 d -19 41 d -18 52 d -18 62 d -18 54 d -18 89 d -18
 89 d -18 118 d -19 131 d -18 94 d -18 61 d -18 37 d -18 21 d -18 10 d -18 17 d -19 4 d -18 -16 d -18 -3 d -18 -2 d -18 -8 d -18 -17 d -18 -14 d -19 -9 d -18 -7 d -18 -19 d -18 -243 d -18 -306 d -18 -61 d -18 -51 d -19 -33 d -18 -18 d -18 -31 d -18
 -19 d -18 -17 d -18 -21 d -18 -17 d -19 -21 d -18 -15 d -18 -11 d -18 -13 d -18 -13 d -18 1 d -18 -11 d -19 -3 d -18 -4 d -18 -7 d -18 4 d -18 -1 d FA 3 lw 0.8 0 0 c 1 0 0 c 0.8 0 0 c 227 980 m 18 X 2 Y 18 X 1 Y 36 X 4 Y 18 X 12 Y 19 X 2 Y 18 X 8 Y
 18 X 7 Y 18 X 21 Y 18 X 5 Y 18 X 21 Y 18 X 24 Y 19 X 17 Y 18 X 17 Y 18 X 22 Y 18 X 20 Y 18 X 33 Y 18 X 21 Y 18 X 38 Y 19 X 51 Y 18 X 65 Y 18 X 296 Y 18 X 236 Y 18 X 9 Y 18 X -7 Y 18 X 11 Y 19 X -12 Y 18 X 23 Y 36 X -1 Y 18 X -13 Y 18 X 12 Y 18 X -17
 Y 19 X -11 Y 18 X -31 Y 18 X -13 Y 18 X -45 Y 18 X -52 Y 18 X -88 Y 18 X -122 Y 19 X -107 Y 18 X -78 Y 18 X -81 Y 18 X -59 Y 18 X -55 Y 18 X -47 Y 18 X -40 Y 19 X -38 Y 18 X -39 Y 18 X -32 Y 18 X -26 Y 18 X -22 Y 18 X -27 Y 18 X -22 Y 19 X -21 Y 18
 X -16 Y 18 X -14 Y 18 X -16 Y 18 X -13 Y 18 X -14 Y 18 X -10 Y 19 X -8 Y 18 X -7 Y 18 X -10 Y 18 X -8 Y 18 X -5 Y 18 X -7 Y 18 X -5 Y 19 X -5 Y 18 X -5 Y 18 X -3 Y 18 X -4 Y 18 X -3 Y 18 X -3 Y 18 X -2 Y 19 X -2 Y 18 X -3 Y 18 X -2 Y 18 X -1 Y 18 X
 -2 Y 18 X -1 Y 18 X -1 Y 19 X -2 Y 36 X -1 Y 18 X -1 Y 18 X -1 Y 36 X -1 Y 55 X -1 Y 91 X -1 Y 54 X s 1 0 0 c 236 980 m20 254 982 m20 272 983 m20 290 983 m20 308 987 m20 327 999 m20 345 1001 m20 363 1009 m20 381 1016 m20 399 1037 m20 417 1042 m20
 435 1063 m20 454 1087 m20 472 1104 m20 490 1121 m20 508 1143 m20 526 1163 m20 544 1196 m20 562 1217 m20 581 1255 m20 599 1306 m20 617 1371 m20 635 1667 m20 653 1903 m20 671 1912 m20 689 1905 m20 708 1916 m20 726 1904 m20 744 1927 m20 762 1927 m20
 780 1926 m20 798 1913 m20 816 1925 m20 835 1908 m20 853 1897 m20 871 1866 m20 889 1853 m20 907 1808 m20 925 1756 m20 943 1668 m20 962 1546 m20 980 1439 m20 998 1361 m20 1016 1280 m20 1034 1221 m20 1052 1166 m20 1070 1119 m20 1089 1079 m20 1107 1041
 m20 1125 1002 m20 1143 970 m20 1161 944 m20 1179 922 m20 1197 895 m20 1215 873 m20 1234 852 m20 1252 836 m20 1270 822 m20 1288 806 m20 1306 793 m20 1324 779 m20 1342 769 m20 1361 761 m20 1379 754 m20 1397 744 m20 1415 736 m20 1433 731 m20 1451 724
 m20 1469 719 m20 1488 714 m20 1506 709 m20 1524 706 m20 1542 702 m20 1560 699 m20 1578 696 m20 1596 694 m20 1615 692 m20 1633 689 m20 1651 687 m20 1669 686 m20 1687 684 m20 1705 683 m20 1723 682 m20 1742 680 m20 1760 680 m20 1778 679 m20 1796 678
 m20 1814 677 m20 1832 677 m20 1850 676 m20 1869 676 m20 1887 676 m20 1905 675 m20 1923 675 m20 1941 675 m20 1959 675 m20 1977 675 m20 1996 674 m20 2014 674 m20 2032 674 m20 0.8 0 0 c black 0.8 0 0 c cs 0.8 0 0 P13 setcolor 236 983 m 18 1 d 18 1 d 18
 X 18 5 d 19 11 d 18 3 d 18 8 d 18 7 d 18 21 d 18 5 d 18 21 d 19 24 d 18 17 d 18 17 d 18 22 d 18 20 d 18 33 d 18 21 d 19 39 d 18 51 d 18 65 d 18 297 d 18 236 d 18 9 d 18 -7 d 19 11 d 18 -12 d 18 24 d 18 -1 d 18 -1 d 18 -13 d 18 13 d 19 -17 d 18 -12 d
 18 -31 d 18 -13 d 18 -44 d 18 -52 d 18 -89 d 19 -123 d 18 -107 d 18 -78 d 18 -82 d 18 -59 d 18 -54 d 18 -48 d 19 -40 d 18 -38 d 18 -40 d 18 -32 d 18 -26 d 18 -22 d 18 -27 d 18 -22 d 19 -21 d 18 -16 d 18 -15 d 18 -15 d 18 -14 d 18 -14 d 18 -9 d 19 -9
 d 18 -7 d 18 -10 d 18 -8 d 18 -5 d 18 -8 d 18 -4 d 19 -5 d 18 -5 d 18 -4 d 18 -3 d 18 -3 d 18 -3 d 18 -3 d 19 -2 d 18 -3 d 18 -2 d 18 -1 d 18 -2 d 18 -1 d 18 -1 d 19 -1 d 18 -1 d 18 -1 d 18 -1 d 18 -1 d 36 X 19 -1 d 36 X 18 -1 d 54 X 19 -1 d 36 X
 -36 X -19 1 d -72 X -18 1 d -37 X -18 1 d -18 X -18 1 d -18 1 d -18 X -18 1 d -19 2 d -18 X -18 2 d -18 2 d -18 1 d -18 2 d -18 2 d -19 2 d -18 3 d -18 3 d -18 3 d -18 3 d -18 4 d -18 5 d -19 5 d -18 4 d -18 8 d -18 5 d -18 7 d -18 10 d -18 7 d -19
 8 d -18 9 d -18 15 d -18 13 d -18 15 d -18 15 d -18 16 d -19 21 d -18 21 d -18 27 d -18 22 d -18 25 d -18 32 d -18 39 d -18 38 d -19 40 d -18 47 d -18 54 d -18 59 d -18 81 d -18 78 d -18 106 d -19 122 d -18 88 d -18 52 d -18 44 d -18 14 d -18 31 d
 -18 11 d -19 17 d -18 -12 d -18 13 d -18 X -18 1 d -18 -23 d -18 12 d -19 -11 d -18 7 d -18 -9 d -18 -235 d -18 -296 d -18 -64 d -18 -51 d -19 -39 d -18 -21 d -18 -32 d -18 -20 d -18 -22 d -18 -17 d -18 -17 d -19 -24 d -18 -21 d -18 -5 d -18 -20 d
 -18 -7 d -18 -8 d -18 -3 d -19 -11 d -18 -5 d -18 X -18 -1 d -18 -1 d FA 0 0.4 0 c 1 1 1 c 0.35 0.83 0.33 c 0 0.4 0 c 227 940 m 18 X -1 Y 18 X 3 Y 18 X 1 Y 18 X 2 Y 18 X 9 Y 19 X 3 Y 18 X 8 Y 18 X 4 Y 18 X 20 Y 18 X 4 Y 18 X 18 Y 18 X 23 Y 19 X 17 Y
 18 X 18 Y 18 X 19 Y 18 X 25 Y 18 X 28 Y 18 X 19 Y 18 X 41 Y 19 X 48 Y 18 X 65 Y 18 X 306 Y 18 X 251 Y 18 X 13 Y 36 X 17 Y 19 X -19 Y 18 X 25 Y 18 X 9 Y 18 X 1 Y 18 X -2 Y 18 X 6 Y 18 X -10 Y 19 X -12 Y 18 X -36 Y 18 X -3 Y 18 X -53 Y 18 X -41 Y 18 X
 -95 Y 18 X -131 Y 19 X -109 Y 18 X -85 Y 18 X -83 Y 18 X -58 Y 18 X -55 Y 18 X -51 Y 18 X -40 Y 19 X -38 Y 18 X -36 Y 18 X -33 Y 18 X -24 Y 18 X -21 Y 18 X -28 Y 18 X -20 Y 19 X -21 Y 18 X -15 Y 18 X -14 Y 18 X -15 Y 18 X -13 Y 18 X -13 Y 18 X -8 Y
 19 X -9 Y 18 X -6 Y 18 X -10 Y 18 X -6 Y 18 X -4 Y 18 X -8 Y 18 X -4 Y 19 X -5 Y 18 X -4 Y 18 X -4 Y 18 X -2 Y 18 X -4 Y 18 X -2 Y 18 X -2 Y 19 X -2 Y 18 X -2 Y 18 X -2 Y 18 X -1 Y 18 X -2 Y 18 X -1 Y 37 X -2 Y 36 X -1 Y 18 X -1 Y 36 X -1 Y 73 X -1
 Y 145 X s 0.35 0.83 0.33 c 236 940 m20 254 939 m20 272 942 m20 290 943 m20 308 945 m20 327 954 m20 345 957 m20 363 965 m20 381 969 m20 399 989 m20 417 993 m20 435 1011 m20 454 1034 m20 472 1051 m20 490 1069 m20 508 1088 m20 526 1113 m20 544 1141 m20
 562 1160 m20 581 1201 m20 599 1249 m20 617 1314 m20 635 1620 m20 653 1871 m20 671 1884 m20 689 1884 m20 708 1901 m20 726 1882 m20 744 1907 m20 762 1916 m20 780 1917 m20 798 1915 m20 816 1921 m20 835 1911 m20 853 1899 m20 871 1863 m20 889 1860 m20
 907 1807 m20 925 1766 m20 943 1671 m20 962 1540 m20 980 1431 m20 998 1346 m20 1016 1263 m20 1034 1205 m20 1052 1150 m20 1070 1099 m20 1089 1059 m20 1107 1021 m20 1125 985 m20 1143 952 m20 1161 928 m20 1179 907 m20 1197 879 m20 1215 859 m20 1234 838
 m20 1252 823 m20 1270 809 m20 1288 794 m20 1306 781 m20 1324 768 m20 1342 760 m20 1361 751 m20 1379 745 m20 1397 735 m20 1415 729 m20 1433 725 m20 1451 717 m20 1469 713 m20 1488 708 m20 1506 704 m20 1524 700 m20 1542 698 m20 1560 694 m20 1578 692
 m20 1596 690 m20 1615 688 m20 1633 686 m20 1651 684 m20 1669 683 m20 1687 681 m20 1705 680 m20 1723 680 m20 1742 678 m20 1760 678 m20 1778 677 m20 1796 676 m20 1814 676 m20 1832 675 m20 1850 675 m20 1869 675 m20 1887 675 m20 1905 674 m20 1923 674
 m20 1941 674 m20 1959 674 m20 1977 674 m20 1996 674 m20 2014 674 m20 2032 674 m20 0 0.4 0 c black 0 0.4 0 c cs 0 0.4 0 P13 setcolor 236 943 m 18 -1 d 18 3 d 18 X 18 2 d 19 9 d 18 4 d 18 7 d 18 5 d 18 20 d 18 4 d 18 18 d 19 23 d 18 17 d 18 18 d 18 19
 d 18 25 d 18 29 d 18 19 d 19 40 d 18 49 d 18 65 d 18 307 d 18 252 d 18 13 d 18 X 19 17 d 18 -19 d 18 25 d 18 9 d 18 1 d 18 -2 d 18 6 d 19 -10 d 18 -12 d 18 -35 d 18 -3 d 18 -53 d 18 -41 d 18 -97 d 19 -130 d 18 -110 d 18 -86 d 18 -83 d 18 -58 d 18
 -56 d 18 -50 d 19 -41 d 18 -38 d 18 -37 d 18 -32 d 18 -25 d 18 -21 d 18 -28 d 18 -20 d 19 -21 d 18 -15 d 18 -15 d 18 -14 d 18 -14 d 18 -12 d 18 -9 d 19 -9 d 18 -6 d 18 -10 d 18 -7 d 18 -4 d 18 -7 d 18 -5 d 19 -4 d 18 -4 d 18 -4 d 18 -3 d 18 -3 d 18
 -2 d 18 -3 d 19 -2 d 18 -2 d 18 -2 d 18 -1 d 18 -2 d 18 -1 d 18 X 19 -1 d 18 -1 d 18 -1 d 18 -1 d 18 X 18 -1 d 55 X 18 -1 d 127 X -127 X -18 1 d -55 X -18 1 d -18 X -18 1 d -18 X -18 1 d -19 1 d -18 1 d -18 1 d -18 2 d -18 1 d -18 1 d -18 2 d -19 2
 d -18 3 d -18 2 d -18 3 d -18 3 d -18 3 d -18 5 d -19 4 d -18 5 d -18 7 d -18 4 d -18 6 d -18 10 d -18 6 d -19 8 d -18 9 d -18 13 d -18 13 d -18 14 d -18 15 d -18 14 d -19 21 d -18 20 d -18 27 d -18 22 d -18 24 d -18 32 d -18 37 d -18 37 d -19 40 d
 -18 50 d -18 55 d -18 58 d -18 82 d -18 85 d -18 109 d -19 130 d -18 95 d -18 41 d -18 53 d -18 3 d -18 35 d -18 12 d -19 10 d -18 -5 d -18 1 d -18 X -18 -9 d -18 -24 d -18 18 d -19 -16 d -18 -1 d -18 -13 d -18 -250 d -18 -305 d -18 -65 d -18 -48 d
 -19 -40 d -18 -19 d -18 -28 d -18 -25 d -18 -19 d -18 -18 d -18 -16 d -19 -23 d -18 -18 d -18 -4 d -18 -20 d -18 -5 d -18 -7 d -18 -4 d -19 -8 d -18 -3 d -18 X -18 -3 d -18 1 d FA black 1 1 1 c 567 470 1587 1550 bf black 1587 1550 m 567 X s 2154
 1550 m 470 Y s 2154 2020 m -567 X s 1587 2020 m -470 Y s
 gsave  2268 1568 0 609 C 1728.33 1918.25 t 0 r /Helvetica findfont 72.27 sf 0 0 m (No Int) show NC gr  0.8 0 0 c 1609 1941 m 99 X s black
 gsave  2268 1568 0 609 C 1728.33 1758.71 t 0 r /Helvetica findfont 72.27 sf 0 0 m (With Int) show NC gr  0 0 1 c 1609 1785 m 99 X s black
 gsave  2268 1568 0 609 C 1728.33 1610.57 t 0 r /Helvetica findfont 72.27 sf 0 0 m (Reweighted) show NC gr  0 0.4 0 c 1609 1628 m 99 X s black
 gsave  2268 1568 0 609 C 2222.13 1747.32 t 90 r /Helvetica-BoldOblique findfont 30.4295 sf 0 0 m (LHC HIGGS XS WG 2013) show NC gr  1 1 1 c 2268 609 0 0 bf black 1 1 1 c 1814 457 227 152 bf black 1814 457 227 152 bl 1 1 1 c black 227 384 m 18 X 1 Y
 18 X -6 Y 18 X 6 Y 18 X 1 Y 18 X -4 Y 19 X 6 Y 18 X -7 Y 18 X 6 Y 18 X -5 Y 18 X 5 Y 18 X -2 Y 18 X -2 Y 37 X 2 Y 18 X -1 Y 18 X -4 Y 18 X 2 Y 36 X -4 Y 19 X 2 Y 18 X -2 Y 18 X 1 Y 18 X -1 Y 18 X 1 Y 18 X 2 Y 18 X -2 Y 19 X 6 Y 18 X -1 Y 54 X 1 Y 18
 X 2 Y 18 X 1 Y 19 X -1 Y 18 X 5 Y 18 X -3 Y 18 X 3 Y 18 X -4 Y 18 X 2 Y 37 X -1 Y 36 X -2 Y 18 X 3 Y 18 X -2 Y 18 X -1 Y 18 X 1 Y 37 X -1 Y 18 X 3 Y 18 X -3 Y 18 X -5 Y 18 X 2 Y 37 X -1 Y 36 X 1 Y 18 X -1 Y 18 X -1 Y 18 X 3 Y 18 X -1 Y 19 X -1 Y 18
 X -3 Y 18 X -1 Y 18 X 3 Y 18 X -10 Y 18 X 2 Y 18 X -1 Y 19 X -4 Y 18 X 15 Y 18 X -15 Y 18 X -1 Y 18 X 11 Y 18 X -19 Y 18 X -2 Y 19 X -6 Y 18 X 3 Y 18 X -9 Y 18 X 12 Y 18 X 6 Y 18 X -11 Y 18 X -28 Y 19 X 2 Y 18 X -16 Y 18 X -32 Y 18 X 14 Y 18 X 2 Y
 18 X -37 Y 18 X -32 Y 19 X -42 Y 18 X 5 Y 18 X -37 Y 127 X 457 Y 18 X s 227 152 m 1814 X s
 gsave  2268 609 0 0 C 1960.04 18.9926 t 0 r /Helvetica findfont 38.0897 sf 0 0 m (T,rel) show NC gr 
 gsave  2268 609 0 0 C 1960.04 68.3734 t 0 r /Helvetica findfont 38.0897 sf 0 0 m (miss) show NC gr 
 gsave  2268 609 0 0 C 1922.05 37.9852 t 0 r /Helvetica findfont 57.1345 sf 0 0 m (E) show NC gr  227 167 m -15 Y s 272 160 m -8 Y s 317 160 m -8 Y s 363 160 m -8 Y s 408 167 m -15 Y s 454 160 m -8 Y s 499 160 m -8 Y s 544 160 m -8 Y s 590 167 m -15
 Y s 635 160 m -8 Y s 680 160 m -8 Y s 726 160 m -8 Y s 771 167 m -15 Y s 816 160 m -8 Y s 862 160 m -8 Y s 907 160 m -8 Y s 952 167 m -15 Y s 998 160 m -8 Y s 1043 160 m -8 Y s 1089 160 m -8 Y s 1134 167 m -15 Y s 1179 160 m -8 Y s 1225 160 m -8 Y s
 1270 160 m -8 Y s 1315 167 m -15 Y s 1361 160 m -8 Y s 1406 160 m -8 Y s 1451 160 m -8 Y s 1497 167 m -15 Y s 1542 160 m -8 Y s 1587 160 m -8 Y s 1633 160 m -8 Y s 1678 167 m -15 Y s 1723 160 m -8 Y s 1769 160 m -8 Y s 1814 160 m -8 Y s 1860 167 m
 -15 Y s 1905 160 m -8 Y s 1950 160 m -8 Y s 1996 160 m -8 Y s 2041 167 m -15 Y s
 gsave  2268 609 0 0 C 208.919 113.956 t 0 r /Helvetica findfont 45.7076 sf 0 0 m (0) show NC gr 
 gsave  2268 609 0 0 C 379.852 113.956 t 0 r /Helvetica findfont 45.7076 sf 0 0 m (20) show NC gr 
 gsave  2268 609 0 0 C 562.181 113.956 t 0 r /Helvetica findfont 45.7076 sf 0 0 m (40) show NC gr 
 gsave  2268 609 0 0 C 740.711 113.956 t 0 r /Helvetica findfont 45.7076 sf 0 0 m (60) show NC gr 
 gsave  2268 609 0 0 C 923.04 113.956 t 0 r /Helvetica findfont 45.7076 sf 0 0 m (80) show NC gr 
 gsave  2268 609 0 0 C 1093.97 113.956 t 0 r /Helvetica findfont 45.7076 sf 0 0 m (100) show NC gr 
 gsave  2268 609 0 0 C 1276.3 113.956 t 0 r /Helvetica findfont 45.7076 sf 0 0 m (120) show NC gr 
 gsave  2268 609 0 0 C 1458.63 113.956 t 0 r /Helvetica findfont 45.7076 sf 0 0 m (140) show NC gr 
 gsave  2268 609 0 0 C 1637.16 113.956 t 0 r /Helvetica findfont 45.7076 sf 0 0 m (160) show NC gr 
 gsave  2268 609 0 0 C 1819.49 113.956 t 0 r /Helvetica findfont 45.7076 sf 0 0 m (180) show NC gr 
 gsave  2268 609 0 0 C 2001.82 113.956 t 0 r /Helvetica findfont 45.7076 sf 0 0 m (200) show NC gr  227 152 m 457 Y s
 gsave  2268 609 0 0 C 91.1645 170.933 t 90 r /Helvetica findfont 45.7076 sf 0 0 m (\(S+I\)/\(Reweighted S\)) show NC gr  278 152 m -51 X s 252 164 m -25 X s 252 175 m -25 X s 252 187 m -25 X s 278 198 m -51 X s 252 209 m -25 X s 252 221 m -25 X s
 252 232 m -25 X s 278 244 m -51 X s 252 255 m -25 X s 252 267 m -25 X s 252 278 m -25 X s 278 289 m -51 X s 252 301 m -25 X s 252 312 m -25 X s 252 324 m -25 X s 278 335 m -51 X s 252 347 m -25 X s 252 358 m -25 X s 252 369 m -25 X s 278 381 m -51 X
 s 252 392 m -25 X s 252 404 m -25 X s 252 415 m -25 X s 278 427 m -51 X s 252 438 m -25 X s 252 449 m -25 X s 252 461 m -25 X s 278 472 m -51 X s 252 484 m -25 X s 252 495 m -25 X s 252 507 m -25 X s 278 518 m -51 X s 252 529 m -25 X s 252 541 m -25
 X s 252 552 m -25 X s 278 564 m -51 X s 252 575 m -25 X s 252 587 m -25 X s 252 598 m -25 X s 278 609 m -51 X s
 gsave  2268 609 0 0 C 186.127 136.747 t 0 r /Helvetica findfont 45.7076 sf 0 0 m (0) show NC gr 
 gsave  2268 609 0 0 C 148.142 182.329 t 0 r /Helvetica findfont 45.7076 sf 0 0 m (0.2) show NC gr 
 gsave  2268 609 0 0 C 148.142 227.911 t 0 r /Helvetica findfont 45.7076 sf 0 0 m (0.4) show NC gr 
 gsave  2268 609 0 0 C 148.142 273.493 t 0 r /Helvetica findfont 45.7076 sf 0 0 m (0.6) show NC gr 
 gsave  2268 609 0 0 C 148.142 319.076 t 0 r /Helvetica findfont 45.7076 sf 0 0 m (0.8) show NC gr 
 gsave  2268 609 0 0 C 193.725 364.658 t 0 r /Helvetica findfont 45.7076 sf 0 0 m (1) show NC gr 
 gsave  2268 609 0 0 C 148.142 410.24 t 0 r /Helvetica findfont 45.7076 sf 0 0 m (1.2) show NC gr 
 gsave  2268 609 0 0 C 148.142 455.822 t 0 r /Helvetica findfont 45.7076 sf 0 0 m (1.4) show NC gr 
 gsave  2268 609 0 0 C 148.142 501.405 t 0 r /Helvetica findfont 45.7076 sf 0 0 m (1.6) show NC gr 
 gsave  2268 609 0 0 C 148.142 546.987 t 0 r /Helvetica findfont 45.7076 sf 0 0 m (1.8) show NC gr 
 gsave  2268 609 0 0 C 186.127 592.569 t 0 r /Helvetica findfont 45.7076 sf 0 0 m (2) show NC gr  236 384 m20 254 385 m20 272 379 m20 290 385 m20 308 386 m20 327 382 m20 345 388 m20 363 381 m20 381 387 m20 399 382 m20 417 387 m20 435 385 m20 454 383
 m20 472 383 m20 490 385 m20 508 384 m20 526 380 m20 544 382 m20 562 382 m20 581 378 m20 599 380 m20 617 378 m20 635 379 m20 653 378 m20 671 379 m20 689 381 m20 708 379 m20 726 385 m20 744 384 m20 762 384 m20 780 384 m20 798 385 m20 816 387 m20 835
 388 m20 853 387 m20 871 392 m20 889 389 m20 907 392 m20 925 388 m20 943 390 m20 962 390 m20 980 389 m20 998 389 m20 1016 387 m20 1034 390 m20 1052 388 m20 1070 387 m20 1089 388 m20 1107 388 m20 1125 387 m20 1143 390 m20 1161 387 m20 1179 382 m20
 1197 384 m20 1215 384 m20 1234 383 m20 1252 383 m20 1270 384 m20 1288 383 m20 1306 382 m20 1324 385 m20 1342 384 m20 1361 383 m20 1379 380 m20 1397 379 m20 1415 382 m20 1433 372 m20 1451 374 m20 1469 373 m20 1488 369 m20 1506 384 m20 1524 369 m20
 1542 368 m20 1560 379 m20 1578 360 m20 1596 358 m20 1615 352 m20 1633 355 m20 1651 346 m20 1669 358 m20 1687 364 m20 1705 353 m20 1723 325 m20 1742 327 m20 1760 311 m20 1778 279 m20 1796 293 m20 1814 295 m20 1832 258 m20 1850 226 m20 1869 184 m20
 1887 189 m20 cs 0 0 0 P13 setcolor 236 387 m 18 1 d 18 -6 d 18 6 d 18 1 d 19 -5 d 18 6 d 18 -6 d 18 6 d 18 -5 d 18 5 d 18 -3 d 19 -1 d 18 -1 d 18 2 d 18 -1 d 18 -3 d 18 1 d 18 X 19 -4 d 18 2 d 18 -2 d 18 1 d 18 -1 d 18 1 d 18 1 d 19 -1 d 18 6 d 18
 -2 d 18 X 18 1 d 18 X 18 2 d 19 2 d 18 -1 d 18 5 d 18 -4 d 18 4 d 18 -4 d 18 2 d 19 X 18 -1 d 18 X 18 -1 d 18 2 d 18 -2 d 73 X 18 3 d 18 -3 d 18 -5 d 18 3 d 18 -1 d 19 X 18 -1 d 18 2 d 18 -1 d 18 -1 d 18 4 d 18 -2 d 19 X 18 -3 d 18 -1 d 18 3 d 18
 -10 d 18 3 d 18 -1 d 19 -4 d 18 15 d 18 -15 d 18 X 18 11 d 18 -19 d 18 -1 d 19 -6 d 18 4 d 18 -9 d 18 13 d 18 6 d 18 -10 d 18 -27 d 19 2 d 18 -14 d 18 -32 d 18 21 d 18 -2 d 18 -32 d 18 -33 d 19 -26 d 18 6 d 18 -42 d 3 -33 d 32 X 1 10 d 2 -10 d 81 X
 8 457 d -457 Y -163 X -19 54 d -18 30 d -18 42 d -18 -7 d -18 -5 d -18 30 d -18 19 d -19 -1 d -18 29 d -18 11 d -18 -5 d -18 -13 d -18 10 d -18 -2 d -19 6 d -18 3 d -18 19 d -18 -10 d -18 1 d -18 15 d -18 -14 d -19 4 d -18 1 d -18 -2 d -18 10 d -18
 -3 d -18 2 d -18 3 d -19 1 d -18 1 d -18 -3 d -18 2 d -18 X -18 -1 d -18 1 d -19 1 d -18 X -18 -2 d -18 5 d -18 3 d -18 -3 d -18 1 d -55 X -18 2 d -18 -2 d -18 2 d -18 X -18 1 d -19 X -18 -1 d -18 4 d -18 -4 d -18 3 d -18 -5 d -18 1 d -19 -1 d -18
 -2 d -18 -1 d -36 X -18 2 d -18 -6 d -19 1 d -18 -1 d -18 -1 d -18 1 d -18 -1 d -18 1 d -18 -2 d -19 3 d -18 1 d -18 -2 d -18 4 d -18 X -18 -2 d -18 X -19 2 d -18 2 d -18 -5 d -18 5 d -18 -6 d -18 7 d -18 -6 d -19 4 d -18 -1 d -18 -6 d -18 6 d -18
 -1 d FA
 gr  gr showpage
end
%%EOF
