%!PS-Adobe-2.0 EPSF-2.0
%%BoundingBox:  0 0 567 384
%%Title: plots/MVA_cut_uncertainty.eps: c1
%%Creator: ROOT Version 5.34/03
%%CreationDate: Tue Jun  4 13:29:47 2013
%%EndComments
%%BeginProlog
80 dict begin
/s {stroke} def /l {lineto} def /m {moveto} def /t {translate} def
/r {rotate} def /rl {roll}  def /R {repeat} def
/d {rlineto} def /rm {rmoveto} def /gr {grestore} def /f {eofill} def
/c {setrgbcolor} def /black {0 setgray} def /sd {setdash} def
/cl {closepath} def /sf {scalefont setfont} def /lw {setlinewidth} def
/box {m dup 0 exch d exch 0 d 0 exch neg d cl} def
/NC{systemdict begin initclip end}def/C{NC box clip newpath}def
/bl {box s} def /bf {box f} def /Y { 0 exch d} def /X { 0 d} def 
/K {{pop pop 0 moveto} exch kshow} bind def
/ita {/ang 15 def gsave [1 0 ang dup sin exch cos div 1 0 0] concat} def 
/mp {newpath /y exch def /x exch def} def
/side {[w .77 mul w .23 mul] .385 w mul sd w 0 l currentpoint t -144 r} def
/mr {mp x y w2 0 360 arc} def /m24 {mr s} def /m20 {mr f} def
/mb {mp x y w2 add m w2 neg 0 d 0 w neg d w 0 d 0 w d cl} def
/mt {mp x y w2 add m w2 neg w neg d w 0 d cl} def
/m21 {mb f} def /m25 {mb s} def /m22 {mt f} def /m26{mt s} def
/m23 {mp x y w2 sub m w2 w d w neg 0 d cl f} def
/m27 {mp x y w2 add m w3 neg w2 neg d w3 w2 neg d w3 w2 d cl s} def
/m28 {mp x w2 sub y w2 sub w3 add m w3 0 d  0 w3 neg d w3 0 d 0 w3 d w3 0 d  0 w3 d w3 neg 0 d 0 w3 d w3 neg 0 d 0 w3 neg d w3 neg 0 d cl s } def
/m29 {mp gsave x w2 sub y w2 add w3 sub m currentpoint t 4 {side} repeat cl fill gr} def
/m30 {mp gsave x w2 sub y w2 add w3 sub m currentpoint t 4 {side} repeat cl s gr} def
/m31 {mp x y w2 sub m 0 w d x w2 sub y m w 0 d x w2 sub y w2 add m w w neg d x w2 sub y w2 sub m w w d s} def
/m32 {mp x y w2 sub m w2 w d w neg 0 d cl s} def
/m33 {mp x y w2 add m w3 neg w2 neg d w3 w2 neg d w3 w2 d cl f} def
/m34 {mp x w2 sub y w2 sub w3 add m w3 0 d  0 w3 neg d w3 0 d 0 w3 d w3 0 d  0 w3 d w3 neg 0 d 0 w3 d w3 neg 0 d 0 w3 neg d w3 neg 0 d cl f } def
/m2 {mp x y w2 sub m 0 w d x w2 sub y m w 0 d s} def
/m5 {mp x w2 sub y w2 sub m w w d x w2 sub y w2 add m w w neg d s} def
/reEncode {exch findfont dup length dict begin {1 index /FID eq  {pop pop} {def} ifelse } forall /Encoding exch def currentdict end dup /FontName get exch definefont pop } def [/Times-Bold /Times-Italic /Times-BoldItalic /Helvetica /Helvetica-Oblique
 /Helvetica-Bold /Helvetica-BoldOblique /Courier /Courier-Oblique /Courier-Bold /Courier-BoldOblique /Times-Roman /AvantGarde-Book /AvantGarde-BookOblique /AvantGarde-Demi /AvantGarde-DemiOblique /Bookman-Demi /Bookman-DemiItalic /Bookman-Light
 /Bookman-LightItalic /Helvetica-Narrow /Helvetica-Narrow-Bold /Helvetica-Narrow-BoldOblique /Helvetica-Narrow-Oblique /NewCenturySchlbk-Roman /NewCenturySchlbk-Bold /NewCenturySchlbk-BoldItalic /NewCenturySchlbk-Italic /Palatino-Bold
 /Palatino-BoldItalic /Palatino-Italic /Palatino-Roman ] {ISOLatin1Encoding reEncode } forall
%%EndProlog
%%BeginSetup
%%EndSetup
newpath  gsave  .25 .25 scale  gsave  0 0 t black[  ] 0 sd 3 lw 1 1 1 c 2268 1538 0 0 bf black 1 1 1 c 1860 1224 317 252 bf black 1860 1224 317 252 bl 1 1 1 c 1860 1224 317 252 bf black 1860 1224 317 252 bl 1 0.8 0 c 6 lw 1 1 1 c 1 0.8 0 c 317 1328 m
 9 X s 346 1328 m 9 X s 3 lw /w 21 def /w2 {w 2 div} def /w3 {w 3 div} def 336 1328 m20 6 lw 355 1326 m 8 X s 383 1326 m 9 X s 3 lw 373 1326 m20 6 lw 392 1264 m 9 X s 420 1264 m 9 X s 3 lw 410 1264 m20 6 lw 429 1186 m 9 X s 457 1186 m 9 X s 3 lw 448
 1186 m20 6 lw 466 1121 m 9 X s 495 1121 m 8 X s 3 lw 485 1121 m20 6 lw 503 1056 m 9 X s 532 1056 m 9 X s 3 lw 522 1056 m20 6 lw 541 1015 m 8 X s 569 1015 m 9 X s 3 lw 559 1015 m20 6 lw 578 951 m 9 X s 606 951 m 9 X s 3 lw 596 951 m20 6 lw 615 896 m
 9 X s 643 896 m 9 X s 3 lw 634 896 m20 6 lw 652 849 m 9 X s 681 849 m 8 X s 3 lw 671 849 m20 6 lw 689 812 m 9 X s 718 812 m 9 X s 3 lw 708 812 m20 6 lw 727 763 m 8 X s 755 763 m 9 X s 3 lw 745 763 m20 6 lw 764 722 m 9 X s 792 722 m 9 X s 3 lw 782
 722 m20 6 lw 801 697 m 9 X s 829 697 m 9 X s 3 lw 820 697 m20 6 lw 838 653 m 9 X s 867 653 m 8 X s 3 lw 857 653 m20 6 lw 875 618 m 9 X s 904 618 m 9 X s 3 lw 894 618 m20 6 lw 913 594 m 8 X s 941 594 m 9 X s 3 lw 931 594 m20 6 lw 950 566 m 9 X s 978
 566 m 9 X s 3 lw 968 566 m20 6 lw 987 543 m 9 X s 1015 543 m 9 X s 3 lw 1006 543 m20 6 lw 1024 520 m 9 X s 1052 520 m 9 X s 3 lw 1043 520 m20 6 lw 1061 500 m 9 X s 1090 500 m 8 X s 3 lw 1080 500 m20 6 lw 1098 485 m 9 X s 1127 485 m 9 X s 3 lw 1117
 485 m20 6 lw 1136 458 m 8 X s 1164 458 m 9 X s 3 lw 1154 458 m20 6 lw 1173 452 m 9 X s 1201 452 m 9 X s 3 lw 1191 452 m20 6 lw 1210 437 m 9 X s 1238 437 m 9 X s 3 lw 1229 437 m20 6 lw 1247 426 m 9 X s 1276 426 m 8 X s 3 lw 1266 426 m20 6 lw 1284 411
 m 9 X s 1313 411 m 9 X s 3 lw 1303 411 m20 6 lw 1322 397 m 8 X s 1350 397 m 9 X s 3 lw 1340 397 m20 6 lw 1359 386 m 9 X s 1387 386 m 9 X s 3 lw 1377 386 m20 6 lw 1396 370 m 9 X s 1424 370 m 9 X s 3 lw 1415 370 m20 6 lw 1433 364 m 9 X s 1462 364 m 8
 X s 3 lw 1452 364 m20 6 lw 1470 359 m 9 X s 1499 359 m 9 X s 3 lw 1489 359 m20 6 lw 1508 348 m 8 X s 1536 348 m 9 X s 3 lw 1526 348 m20 6 lw 1545 346 m 9 X s 1573 346 m 9 X s 3 lw 1563 346 m20 6 lw 1582 336 m 9 X s 1610 336 m 9 X s 3 lw 1601 336 m20
 6 lw 1619 329 m 9 X s 1648 329 m 8 X s 3 lw 1638 329 m20 6 lw 1656 327 m 9 X s 1685 327 m 9 X s 3 lw 1675 327 m20 6 lw 1694 323 m 8 X s 1722 323 m 9 X s 3 lw 1712 323 m20 6 lw 1731 320 m 9 X s 1759 320 m 9 X s 3 lw 1749 320 m20 6 lw 1768 312 m 9 X s
 1796 312 m 9 X s 3 lw 1787 312 m20 6 lw 1805 306 m 9 X s 1833 306 m 9 X s 3 lw 1824 306 m20 6 lw 1842 301 m 9 X s 1871 301 m 8 X s 3 lw 1861 301 m20 6 lw 1879 298 m 9 X s 1908 298 m 9 X s 3 lw 1898 298 m20 6 lw 1917 296 m 8 X s 1945 296 m 9 X s 3 lw
 1935 296 m20 6 lw 1954 294 m 9 X s 1982 294 m 9 X s 3 lw 1972 294 m20 6 lw 1991 291 m 9 X s 2019 291 m 9 X s 3 lw 2010 291 m20 6 lw 2028 291 m 9 X s 2057 291 m 8 X s 3 lw 2047 291 m20 6 lw 2065 288 m 9 X s 2094 288 m 9 X s 3 lw 2084 288 m20 6 lw
 2103 285 m 8 X s 2131 285 m 9 X s 3 lw 2121 285 m20 6 lw 2140 282 m 9 X s 2168 282 m 9 X s 3 lw 2158 282 m20 6 lw black 3 lw 317 252 m 1860 X s
 gsave  2268 1538 0 0 C 2082 19.5493 t 0 r /Helvetica-Oblique findfont 58.6478 sf 0 0 m (H\255jj) show NC gr 
 gsave  2268 1538 0 0 C 2029.87 68.4225 t 0 r /Symbol findfont 84.7136 sf 0 0 m ita (f) show gr NC gr 
 gsave  2268 1538 0 0 C 1977.74 68.4225 t 0 r /Symbol findfont 84.7136 sf 0 0 m (D) show NC gr 
 gsave  2268 1538 0 0 C 1899.54 68.4225 t 0 r /Helvetica findfont 84.7136 sf 0 0 m ( \255 ) show NC gr 
 gsave  2268 1538 0 0 C 1853.92 68.4225 t 0 r /Symbol findfont 84.7136 sf 0 0 m (p) show NC gr  317 290 m -38 Y s 355 271 m -19 Y s 392 271 m -19 Y s 429 271 m -19 Y s 466 271 m -19 Y s 503 290 m -38 Y s 541 271 m -19 Y s 578 271 m -19 Y s 615 271 m
 -19 Y s 652 271 m -19 Y s 689 290 m -38 Y s 727 271 m -19 Y s 764 271 m -19 Y s 801 271 m -19 Y s 838 271 m -19 Y s 875 290 m -38 Y s 913 271 m -19 Y s 950 271 m -19 Y s 987 271 m -19 Y s 1024 271 m -19 Y s 1061 290 m -38 Y s 1098 271 m -19 Y s 1136
 271 m -19 Y s 1173 271 m -19 Y s 1210 271 m -19 Y s 1247 290 m -38 Y s 1284 271 m -19 Y s 1322 271 m -19 Y s 1359 271 m -19 Y s 1396 271 m -19 Y s 1433 290 m -38 Y s 1470 271 m -19 Y s 1508 271 m -19 Y s 1545 271 m -19 Y s 1582 271 m -19 Y s 1619
 290 m -38 Y s 1656 271 m -19 Y s 1694 271 m -19 Y s 1731 271 m -19 Y s 1768 271 m -19 Y s 1805 290 m -38 Y s 1842 271 m -19 Y s 1879 271 m -19 Y s 1917 271 m -19 Y s 1954 271 m -19 Y s 1991 290 m -38 Y s 2028 271 m -19 Y s 2065 271 m -19 Y s 2103
 271 m -19 Y s 2140 271 m -19 Y s 2177 290 m -38 Y s
 gsave  2268 1538 0 0 C 293.239 172.685 t 0 r /Helvetica findfont 84.7136 sf 0 0 m (0) show NC gr 
 gsave  2268 1538 0 0 C 449.633 172.685 t 0 r /Helvetica findfont 84.7136 sf 0 0 m (0.1) show NC gr 
 gsave  2268 1538 0 0 C 628.835 172.685 t 0 r /Helvetica findfont 84.7136 sf 0 0 m (0.2) show NC gr 
 gsave  2268 1538 0 0 C 814.553 172.685 t 0 r /Helvetica findfont 84.7136 sf 0 0 m (0.3) show NC gr 
 gsave  2268 1538 0 0 C 1000.27 172.685 t 0 r /Helvetica findfont 84.7136 sf 0 0 m (0.4) show NC gr 
 gsave  2268 1538 0 0 C 1185.99 172.685 t 0 r /Helvetica findfont 84.7136 sf 0 0 m (0.5) show NC gr 
 gsave  2268 1538 0 0 C 1371.71 172.685 t 0 r /Helvetica findfont 84.7136 sf 0 0 m (0.6) show NC gr 
 gsave  2268 1538 0 0 C 1557.43 172.685 t 0 r /Helvetica findfont 84.7136 sf 0 0 m (0.7) show NC gr 
 gsave  2268 1538 0 0 C 1746.4 172.685 t 0 r /Helvetica findfont 84.7136 sf 0 0 m (0.8) show NC gr 
 gsave  2268 1538 0 0 C 1932.12 172.685 t 0 r /Helvetica findfont 84.7136 sf 0 0 m (0.9) show NC gr 
 gsave  2268 1538 0 0 C 2160.2 172.685 t 0 r /Helvetica findfont 84.7136 sf 0 0 m (1) show NC gr  317 1476 m 1860 X s 317 1439 m 37 Y s 355 1457 m 19 Y s 392 1457 m 19 Y s 429 1457 m 19 Y s 466 1457 m 19 Y s 503 1439 m 37 Y s 541 1457 m 19 Y s 578
 1457 m 19 Y s 615 1457 m 19 Y s 652 1457 m 19 Y s 689 1439 m 37 Y s 727 1457 m 19 Y s 764 1457 m 19 Y s 801 1457 m 19 Y s 838 1457 m 19 Y s 875 1439 m 37 Y s 913 1457 m 19 Y s 950 1457 m 19 Y s 987 1457 m 19 Y s 1024 1457 m 19 Y s 1061 1439 m 37 Y s
 1098 1457 m 19 Y s 1136 1457 m 19 Y s 1173 1457 m 19 Y s 1210 1457 m 19 Y s 1247 1439 m 37 Y s 1284 1457 m 19 Y s 1322 1457 m 19 Y s 1359 1457 m 19 Y s 1396 1457 m 19 Y s 1433 1439 m 37 Y s 1470 1457 m 19 Y s 1508 1457 m 19 Y s 1545 1457 m 19 Y s
 1582 1457 m 19 Y s 1619 1439 m 37 Y s 1656 1457 m 19 Y s 1694 1457 m 19 Y s 1731 1457 m 19 Y s 1768 1457 m 19 Y s 1805 1439 m 37 Y s 1842 1457 m 19 Y s 1879 1457 m 19 Y s 1917 1457 m 19 Y s 1954 1457 m 19 Y s 1991 1439 m 37 Y s 2028 1457 m 19 Y s
 2065 1457 m 19 Y s 2103 1457 m 19 Y s 2140 1457 m 19 Y s 2177 1439 m 37 Y s 317 252 m 1224 Y s
 gsave  2268 1538 0 0 C 84.7135 654.901 t 90 r /Helvetica findfont 84.7136 sf 0 0 m (Normalized frequency) show NC gr  372 252 m -55 X s 345 277 m -28 X s 345 301 m -28 X s 345 326 m -28 X s 345 350 m -28 X s 372 375 m -55 X s 345 399 m -28 X s 345
 424 m -28 X s 345 448 m -28 X s 345 473 m -28 X s 372 497 m -55 X s 345 522 m -28 X s 345 546 m -28 X s 345 570 m -28 X s 345 595 m -28 X s 372 619 m -55 X s 345 644 m -28 X s 345 668 m -28 X s 345 693 m -28 X s 345 717 m -28 X s 372 742 m -55 X s
 345 766 m -28 X s 345 791 m -28 X s 345 815 m -28 X s 345 840 m -28 X s 372 864 m -55 X s 345 889 m -28 X s 345 913 m -28 X s 345 938 m -28 X s 345 962 m -28 X s 372 987 m -55 X s 345 1011 m -28 X s 345 1036 m -28 X s 345 1060 m -28 X s 345 1085 m
 -28 X s 372 1109 m -55 X s 345 1134 m -28 X s 345 1158 m -28 X s 345 1183 m -28 X s 345 1207 m -28 X s 372 1232 m -55 X s 345 1256 m -28 X s 345 1280 m -28 X s 345 1305 m -28 X s 345 1329 m -28 X s 372 1354 m -55 X s 345 1378 m -28 X s 345 1403 m
 -28 X s 345 1427 m -28 X s 345 1452 m -28 X s 372 1476 m -55 X s
 gsave  2268 1538 0 0 C 257.399 221.559 t 0 r /Helvetica findfont 84.7136 sf 0 0 m (0) show NC gr 
 gsave  2268 1538 0 0 C 153.136 342.112 t 0 r /Helvetica findfont 84.7136 sf 0 0 m (0.01) show NC gr 
 gsave  2268 1538 0 0 C 140.103 465.924 t 0 r /Helvetica findfont 84.7136 sf 0 0 m (0.02) show NC gr 
 gsave  2268 1538 0 0 C 140.103 589.737 t 0 r /Helvetica findfont 84.7136 sf 0 0 m (0.03) show NC gr 
 gsave  2268 1538 0 0 C 140.103 710.291 t 0 r /Helvetica findfont 84.7136 sf 0 0 m (0.04) show NC gr 
 gsave  2268 1538 0 0 C 140.103 834.103 t 0 r /Helvetica findfont 84.7136 sf 0 0 m (0.05) show NC gr 
 gsave  2268 1538 0 0 C 140.103 954.656 t 0 r /Helvetica findfont 84.7136 sf 0 0 m (0.06) show NC gr 
 gsave  2268 1538 0 0 C 140.103 1078.47 t 0 r /Helvetica findfont 84.7136 sf 0 0 m (0.07) show NC gr 
 gsave  2268 1538 0 0 C 140.103 1199.02 t 0 r /Helvetica findfont 84.7136 sf 0 0 m (0.08) show NC gr 
 gsave  2268 1538 0 0 C 140.103 1322.83 t 0 r /Helvetica findfont 84.7136 sf 0 0 m (0.09) show NC gr 
 gsave  2268 1538 0 0 C 202.009 1446.65 t 0 r /Helvetica findfont 84.7136 sf 0 0 m (0.1) show NC gr  2177 252 m 1224 Y s 2123 252 m 54 X s 2150 277 m 27 X s 2150 301 m 27 X s 2150 326 m 27 X s 2150 350 m 27 X s 2123 375 m 54 X s 2150 399 m 27 X s
 2150 424 m 27 X s 2150 448 m 27 X s 2150 473 m 27 X s 2123 497 m 54 X s 2150 522 m 27 X s 2150 546 m 27 X s 2150 570 m 27 X s 2150 595 m 27 X s 2123 619 m 54 X s 2150 644 m 27 X s 2150 668 m 27 X s 2150 693 m 27 X s 2150 717 m 27 X s 2123 742 m 54 X
 s 2150 766 m 27 X s 2150 791 m 27 X s 2150 815 m 27 X s 2150 840 m 27 X s 2123 864 m 54 X s 2150 889 m 27 X s 2150 913 m 27 X s 2150 938 m 27 X s 2150 962 m 27 X s 2123 987 m 54 X s 2150 1011 m 27 X s 2150 1036 m 27 X s 2150 1060 m 27 X s 2150 1085
 m 27 X s 2123 1109 m 54 X s 2150 1134 m 27 X s 2150 1158 m 27 X s 2150 1183 m 27 X s 2150 1207 m 27 X s 2123 1232 m 54 X s 2150 1256 m 27 X s 2150 1280 m 27 X s 2150 1305 m 27 X s 2150 1329 m 27 X s 2123 1354 m 54 X s 2150 1378 m 27 X s 2150 1403 m
 27 X s 2150 1427 m 27 X s 2150 1452 m 27 X s 2123 1476 m 54 X s 1 0.6 0.2 c 6 lw 1 1 1 c 1 0.6 0.2 c 336 1299 m 9 Y s 336 1327 m 9 Y s 317 1317 m 9 X s 346 1317 m 9 X s 3 lw 336 1317 m21 6 lw 373 1317 m 9 Y s 373 1346 m 9 Y s 355 1336 m 8 X s 383
 1336 m 9 X s 3 lw 373 1336 m21 6 lw 410 1248 m 9 Y s 410 1276 m 9 Y s 392 1266 m 9 X s 420 1266 m 9 X s 3 lw 410 1266 m21 6 lw 448 1175 m 7 Y s 448 1202 m 8 Y s 429 1192 m 9 X s 457 1192 m 9 X s 3 lw 448 1192 m21 6 lw 485 1101 m 7 Y s 485 1127 m 7 Y
 s 466 1118 m 9 X s 495 1118 m 8 X s 3 lw 485 1118 m21 6 lw 522 1044 m 6 Y s 522 1070 m 6 Y s 503 1060 m 9 X s 532 1060 m 9 X s 3 lw 522 1060 m21 6 lw 559 998 m 6 Y s 559 1023 m 6 Y s 541 1014 m 8 X s 569 1014 m 9 X s 3 lw 559 1014 m21 6 lw 596 931 m
 5 Y s 596 956 m 5 Y s 578 946 m 9 X s 606 946 m 9 X s 3 lw 596 946 m21 6 lw 634 879 m 4 Y s 634 903 m 5 Y s 615 893 m 9 X s 643 893 m 9 X s 3 lw 634 893 m21 6 lw 671 796 m 3 Y s 671 819 m 4 Y s 652 809 m 9 X s 681 809 m 8 X s 3 lw 671 809 m21 6 lw
 708 779 m 4 Y s 708 802 m 4 Y s 689 792 m 9 X s 718 792 m 9 X s 3 lw 708 792 m21 6 lw 745 743 m 3 Y s 745 766 m 3 Y s 727 756 m 8 X s 755 756 m 9 X s 3 lw 745 756 m21 6 lw 782 702 m 2 Y s 782 724 m 3 Y s 764 714 m 9 X s 792 714 m 9 X s 3 lw 782 714
 m21 6 lw 820 658 m 2 Y s 820 679 m 2 Y s 801 670 m 9 X s 829 670 m 9 X s 3 lw 820 670 m21 6 lw 857 616 m 1 Y s 857 637 m 1 Y s 838 627 m 9 X s 867 627 m 8 X s 3 lw 857 627 m21 6 lw 894 562 m 1 Y s 894 582 m 1 Y s 875 573 m 9 X s 904 573 m 9 X s 3 lw
 894 573 m21 6 lw 913 525 m 8 X s 941 525 m 9 X s 3 lw 931 525 m21 6 lw 950 496 m 9 X s 978 496 m 9 X s 3 lw 968 496 m21 6 lw 987 461 m 9 X s 1015 461 m 9 X s 3 lw 1006 461 m21 6 lw 1024 439 m 9 X s 1052 439 m 9 X s 3 lw 1043 439 m21 6 lw 1061 411 m
 9 X s 1090 411 m 8 X s 3 lw 1080 411 m21 6 lw 1098 403 m 9 X s 1127 403 m 9 X s 3 lw 1117 403 m21 6 lw 1136 383 m 8 X s 1164 383 m 9 X s 3 lw 1154 383 m21 6 lw 1173 385 m 9 X s 1201 385 m 9 X s 3 lw 1191 385 m21 6 lw 1210 360 m 9 X s 1238 360 m 9 X
 s 3 lw 1229 360 m21 6 lw 1247 350 m 9 X s 1276 350 m 8 X s 3 lw 1266 350 m21 6 lw 1284 333 m 9 X s 1313 333 m 9 X s 3 lw 1303 333 m21 6 lw 1322 330 m 8 X s 1350 330 m 9 X s 3 lw 1340 330 m21 6 lw 1359 319 m 9 X s 1387 319 m 9 X s 3 lw 1377 319 m21 6
 lw 1396 316 m 9 X s 1424 316 m 9 X s 3 lw 1415 316 m21 6 lw 1433 307 m 9 X s 1462 307 m 8 X s 3 lw 1452 307 m21 6 lw 1470 309 m 9 X s 1499 309 m 9 X s 3 lw 1489 309 m21 6 lw 1508 301 m 8 X s 1536 301 m 9 X s 3 lw 1526 301 m21 6 lw 1545 290 m 9 X s
 1573 290 m 9 X s 3 lw 1563 290 m21 6 lw 1582 292 m 9 X s 1610 292 m 9 X s 3 lw 1601 292 m21 6 lw 1619 287 m 9 X s 1648 287 m 8 X s 3 lw 1638 287 m21 6 lw 1656 286 m 9 X s 1685 286 m 9 X s 3 lw 1675 286 m21 6 lw 1694 282 m 8 X s 1722 282 m 9 X s 3 lw
 1712 282 m21 6 lw 1731 285 m 9 X s 1759 285 m 9 X s 3 lw 1749 285 m21 6 lw 1768 278 m 9 X s 1796 278 m 9 X s 3 lw 1787 278 m21 6 lw 1805 274 m 9 X s 1833 274 m 9 X s 3 lw 1824 274 m21 6 lw 1842 276 m 9 X s 1871 276 m 8 X s 3 lw 1861 276 m21 6 lw
 1879 267 m 9 X s 1908 267 m 9 X s 3 lw 1898 267 m21 6 lw 1917 272 m 8 X s 1945 272 m 9 X s 3 lw 1935 272 m21 6 lw 1954 264 m 9 X s 1982 264 m 9 X s 3 lw 1972 264 m21 6 lw 1991 264 m 9 X s 2019 264 m 9 X s 3 lw 2010 264 m21 6 lw 2028 266 m 9 X s 2057
 266 m 8 X s 3 lw 2047 266 m21 6 lw 2065 267 m 9 X s 2094 267 m 9 X s 3 lw 2084 267 m21 6 lw 2103 264 m 8 X s 2131 264 m 9 X s 3 lw 2121 264 m21 6 lw 2140 264 m 9 X s 2168 264 m 9 X s 3 lw 2158 264 m21 6 lw 0.8 0.4 0 c 1 1 1 c 0.8 0.4 0 c 336 1286 m
 22 Y s 336 1328 m 22 Y s 317 1318 m 9 X s 346 1318 m 9 X s 3 lw 336 1318 m22 6 lw 373 1346 m 23 Y s 373 1389 m 23 Y s 355 1379 m 8 X s 383 1379 m 9 X s 3 lw 373 1379 m22 6 lw 410 1254 m 22 Y s 410 1296 m 21 Y s 392 1286 m 9 X s 420 1286 m 9 X s 3 lw
 410 1286 m22 6 lw 448 1156 m 20 Y s 448 1195 m 20 Y s 429 1185 m 9 X s 457 1185 m 9 X s 3 lw 448 1185 m22 6 lw 485 1061 m 19 Y s 485 1099 m 19 Y s 466 1090 m 9 X s 495 1090 m 8 X s 3 lw 485 1090 m22 6 lw 522 1000 m 17 Y s 522 1037 m 17 Y s 503 1027
 m 9 X s 532 1027 m 9 X s 3 lw 522 1027 m22 6 lw 559 1004 m 17 Y s 559 1041 m 17 Y s 541 1031 m 8 X s 569 1031 m 9 X s 3 lw 559 1031 m22 6 lw 596 904 m 16 Y s 596 940 m 15 Y s 578 930 m 9 X s 606 930 m 9 X s 3 lw 596 930 m22 6 lw 634 872 m 15 Y s 634
 907 m 15 Y s 615 897 m 9 X s 643 897 m 9 X s 3 lw 634 897 m22 6 lw 671 784 m 13 Y s 671 817 m 13 Y s 652 807 m 9 X s 681 807 m 8 X s 3 lw 671 807 m22 6 lw 708 768 m 13 Y s 708 801 m 13 Y s 689 791 m 9 X s 718 791 m 9 X s 3 lw 708 791 m22 6 lw 745
 696 m 11 Y s 745 726 m 12 Y s 727 717 m 8 X s 755 717 m 9 X s 3 lw 745 717 m22 6 lw 782 690 m 11 Y s 782 721 m 11 Y s 764 711 m 9 X s 792 711 m 9 X s 3 lw 782 711 m22 6 lw 820 626 m 9 Y s 820 655 m 9 Y s 801 645 m 9 X s 829 645 m 9 X s 3 lw 820 645
 m22 6 lw 857 604 m 9 Y s 857 632 m 9 Y s 838 623 m 9 X s 867 623 m 8 X s 3 lw 857 623 m22 6 lw 894 512 m 7 Y s 894 538 m 7 Y s 875 529 m 9 X s 904 529 m 9 X s 3 lw 894 529 m22 6 lw 931 471 m 5 Y s 931 496 m 5 Y s 913 486 m 8 X s 941 486 m 9 X s 3 lw
 931 486 m22 6 lw 968 409 m 3 Y s 968 431 m 3 Y s 950 421 m 9 X s 978 421 m 9 X s 3 lw 968 421 m22 6 lw 1006 367 m 1 Y s 1006 388 m 1 Y s 987 378 m 9 X s 1015 378 m 9 X s 3 lw 1006 378 m22 6 lw 1043 361 m s 1043 381 m 1 Y s 1024 371 m 9 X s 1052 371
 m 9 X s 3 lw 1043 371 m22 6 lw 1061 332 m 9 X s 1090 332 m 8 X s 3 lw 1080 332 m22 6 lw 1098 322 m 9 X s 1127 322 m 9 X s 3 lw 1117 322 m22 6 lw 1136 315 m 8 X s 1164 315 m 9 X s 3 lw 1154 315 m22 6 lw 1173 324 m 9 X s 1201 324 m 9 X s 3 lw 1191 324
 m22 6 lw 1210 307 m 9 X s 1238 307 m 9 X s 3 lw 1229 307 m22 6 lw 1247 290 m 9 X s 1276 290 m 8 X s 3 lw 1266 290 m22 6 lw 1284 286 m 9 X s 1313 286 m 9 X s 3 lw 1303 286 m22 6 lw 1322 290 m 8 X s 1350 290 m 9 X s 3 lw 1340 290 m22 6 lw 1359 282 m 9
 X s 1387 282 m 9 X s 3 lw 1377 282 m22 6 lw 1396 274 m 9 X s 1424 274 m 9 X s 3 lw 1415 274 m22 6 lw 1433 271 m 9 X s 1462 271 m 8 X s 3 lw 1452 271 m22 6 lw 1470 275 m 9 X s 1499 275 m 9 X s 3 lw 1489 275 m22 6 lw 1508 273 m 8 X s 1536 273 m 9 X s
 3 lw 1526 273 m22 6 lw 1545 265 m 9 X s 1573 265 m 9 X s 3 lw 1563 265 m22 6 lw 1582 266 m 9 X s 1610 266 m 9 X s 3 lw 1601 266 m22 6 lw 1619 265 m 9 X s 1648 265 m 8 X s 3 lw 1638 265 m22 6 lw 1656 263 m 9 X s 1685 263 m 9 X s 3 lw 1675 263 m22 6
 lw 1694 260 m 8 X s 1722 260 m 9 X s 3 lw 1712 260 m22 6 lw 1731 260 m 9 X s 1759 260 m 9 X s 3 lw 1749 260 m22 6 lw 1768 257 m 9 X s 1796 257 m 9 X s 3 lw 1787 257 m22 6 lw 1805 255 m 9 X s 1833 255 m 9 X s 3 lw 1824 255 m22 6 lw 1842 257 m 9 X s
 1871 257 m 8 X s 3 lw 1861 257 m22 6 lw 1879 256 m 9 X s 1908 256 m 9 X s 3 lw 1898 256 m22 6 lw 1917 258 m 8 X s 1945 258 m 9 X s 3 lw 1935 258 m22 6 lw 1954 254 m 9 X s 1982 254 m 9 X s 3 lw 1972 254 m22 6 lw 1991 253 m 9 X s 2019 253 m 9 X s 3 lw
 2010 253 m22 6 lw 2028 254 m 9 X s 2057 254 m 8 X s 3 lw 2047 254 m22 6 lw 2065 257 m 9 X s 2094 257 m 9 X s 3 lw 2084 257 m22 6 lw 2103 254 m 8 X s 2131 254 m 9 X s 3 lw 2121 254 m22 6 lw 2140 254 m 9 X s 2168 254 m 9 X s 3 lw 2158 254 m22 6 lw 0.4
 0.2 0 c 1 1 1 c 0.4 0.2 0 c 336 1255 m 46 Y s 336 1321 m 46 Y s 317 1311 m 9 X s 346 1311 m 9 X s 3 lw 336 1311 m23 6 lw 373 1293 m 48 Y s 373 1360 m 47 Y s 355 1350 m 8 X s 383 1350 m 9 X s 3 lw 373 1350 m23 6 lw 410 1249 m 47 Y s 410 1315 m 47 Y s
 392 1305 m 9 X s 420 1305 m 9 X s 3 lw 410 1305 m23 6 lw 448 1191 m 45 Y s 448 1256 m 44 Y s 429 1246 m 9 X s 457 1246 m 9 X s 3 lw 448 1246 m23 6 lw 485 996 m 39 Y s 485 1055 m 38 Y s 466 1045 m 9 X s 495 1045 m 8 X s 3 lw 485 1045 m23 6 lw 522 997
 m 39 Y s 522 1055 m 39 Y s 503 1046 m 9 X s 532 1046 m 9 X s 3 lw 522 1046 m23 6 lw 559 1013 m 39 Y s 559 1071 m 40 Y s 541 1062 m 8 X s 569 1062 m 9 X s 3 lw 559 1062 m23 6 lw 596 844 m 34 Y s 596 897 m 34 Y s 578 888 m 9 X s 606 888 m 9 X s 3 lw
 596 888 m23 6 lw 634 847 m 33 Y s 634 900 m 34 Y s 615 890 m 9 X s 643 890 m 9 X s 3 lw 634 890 m23 6 lw 671 765 m 30 Y s 671 815 m 31 Y s 652 805 m 9 X s 681 805 m 8 X s 3 lw 671 805 m23 6 lw 708 757 m 31 Y s 708 807 m 31 Y s 689 797 m 9 X s 718
 797 m 9 X s 3 lw 708 797 m23 6 lw 745 705 m 29 Y s 745 753 m 28 Y s 727 743 m 8 X s 755 743 m 9 X s 3 lw 745 743 m23 6 lw 782 624 m 25 Y s 782 668 m 25 Y s 764 658 m 9 X s 792 658 m 9 X s 3 lw 782 658 m23 6 lw 820 582 m 23 Y s 820 625 m 23 Y s 801
 615 m 9 X s 829 615 m 9 X s 3 lw 820 615 m23 6 lw 857 553 m 22 Y s 857 595 m 21 Y s 838 585 m 9 X s 867 585 m 8 X s 3 lw 857 585 m23 6 lw 894 454 m 16 Y s 894 490 m 16 Y s 875 480 m 9 X s 904 480 m 9 X s 3 lw 894 480 m23 6 lw 931 400 m 13 Y s 931
 433 m 12 Y s 913 423 m 8 X s 941 423 m 9 X s 3 lw 931 423 m23 6 lw 968 337 m 8 Y s 968 365 m 7 Y s 950 355 m 9 X s 978 355 m 9 X s 3 lw 968 355 m23 6 lw 1006 309 m 5 Y s 1006 334 m 4 Y s 987 324 m 9 X s 1015 324 m 9 X s 3 lw 1006 324 m23 6 lw 1043
 299 m 4 Y s 1043 322 m 4 Y s 1024 313 m 9 X s 1052 313 m 9 X s 3 lw 1043 313 m23 6 lw 1080 279 m 1 Y s 1080 300 m 1 Y s 1061 290 m 9 X s 1090 290 m 8 X s 3 lw 1080 290 m23 6 lw 1098 277 m 9 X s 1127 277 m 9 X s 3 lw 1117 277 m23 6 lw 1136 270 m 8 X
 s 1164 270 m 9 X s 3 lw 1154 270 m23 6 lw 1173 275 m 9 X s 1201 275 m 9 X s 3 lw 1191 275 m23 6 lw 1210 258 m 9 X s 1238 258 m 9 X s 3 lw 1229 258 m23 6 lw 1247 255 m 9 X s 1276 255 m 8 X s 3 lw 1266 255 m23 6 lw 1284 264 m 9 X s 1313 264 m 9 X s 3
 lw 1303 264 m23 6 lw 1322 261 m 8 X s 1350 261 m 9 X s 3 lw 1340 261 m23 6 lw 1359 255 m 9 X s 1387 255 m 9 X s 3 lw 1377 255 m23 6 lw 1396 258 m 9 X s 1424 258 m 9 X s 3 lw 1415 258 m23 6 lw 1433 264 m 9 X s 1462 264 m 8 X s 3 lw 1452 264 m23 6 lw
 1619 255 m 9 X s 1648 255 m 8 X s 3 lw 1638 255 m23 6 lw 1731 255 m 9 X s 1759 255 m 9 X s 3 lw 1749 255 m23 6 lw 1917 255 m 8 X s 1945 255 m 9 X s 3 lw 1935 255 m23 6 lw black
 gsave  2268 1538 0 0 C 1189.25 1358.67 t 0 r /Helvetica findfont 65.1643 sf 0 0 m ( = 8 TeV,  ggF + 2 jets) show NC gr 
 gsave  2268 1538 0 0 C 1153.41 1358.67 t 0 r /Helvetica-Oblique findfont 65.1643 sf 0 0 m (s) show NC gr  1134 1395 m 6 -40 d s 0 lw 1140 1355 m 7 56 d s 1147 1411 m 42 X s
 gsave  2268 1538 0 0 C 1785.5 1270.7 t 0 r /Helvetica findfont 65.1643 sf 0 0 m ( = 125 GeV) show NC gr 
 gsave  2268 1538 0 0 C 1746.4 1251.15 t 0 r /Helvetica-Oblique findfont 45.615 sf 0 0 m (H) show NC gr 
 gsave  2268 1538 0 0 C 1691.01 1270.7 t 0 r /Helvetica-Oblique findfont 65.1643 sf 0 0 m (m) show NC gr 
 gsave  2268 1538 0 0 C 1596.52 1270.7 t 0 r /Helvetica findfont 65.1643 sf 0 0 m (8,  ) show NC gr 
 gsave  2268 1538 0 0 C 1443.39 1270.7 t 0 r /Helvetica findfont 52.1314 sf 0 0 m (YTHIA) show NC gr 
 gsave  2268 1538 0 0 C 1365.19 1270.7 t 0 r /Helvetica findfont 65.1643 sf 0 0 m (+P) show NC gr 
 gsave  2268 1538 0 0 C 1163.18 1270.7 t 0 r /Helvetica findfont 52.1314 sf 0 0 m (OWHEG) show NC gr 
 gsave  2268 1538 0 0 C 1120.83 1270.7 t 0 r /Helvetica findfont 65.1643 sf 0 0 m (P) show NC gr  1 0.8 0 c 3 lw 1111 1192 m 12 X s 1157 1192 m -12 X s /w 26 def /w2 {w 2 div} def /w3 {w 3 div} def 1134 1192 m20 black
 gsave  2268 1538 0 0 C 1840.89 1176.21 t 0 r /Helvetica findfont 65.1643 sf 0 0 m ( = 21%) show NC gr 
 gsave  2268 1538 0 0 C 1814.82 1153.41 t 0 r /Helvetica findfont 45.615 sf 0 0 m (2) show NC gr 
 gsave  2268 1538 0 0 C 1775.73 1176.21 t 0 r /Symbol findfont 65.1643 sf 0 0 m (s) show NC gr 
 gsave  2268 1538 0 0 C 1713.82 1176.21 t 0 r /Helvetica findfont 65.1643 sf 0 0 m ( / ) show NC gr 
 gsave  2268 1538 0 0 C 1687.75 1153.41 t 0 r /Helvetica findfont 45.615 sf 0 0 m (2) show NC gr 
 gsave  2268 1538 0 0 C 1638.88 1176.21 t 0 r /Symbol findfont 65.1643 sf 0 0 m ita (s) show gr NC gr 
 gsave  2268 1538 0 0 C 1596.52 1176.21 t 0 r /Symbol findfont 65.1643 sf 0 0 m (D) show NC gr 
 gsave  2268 1538 0 0 C 1189.25 1176.21 t 0 r /Helvetica findfont 65.1643 sf 0 0 m (No MVA cut,  ) show NC gr  1 0.6 0.2 c 1111 1115 m 12 X s 1157 1115 m -12 X s 1134 1115 m21 black
 gsave  2268 1538 0 0 C 1860.44 1104.53 t 0 r /Helvetica findfont 65.1643 sf 0 0 m ( = 27%) show NC gr 
 gsave  2268 1538 0 0 C 1834.37 1081.73 t 0 r /Helvetica findfont 45.615 sf 0 0 m (2) show NC gr 
 gsave  2268 1538 0 0 C 1795.28 1104.53 t 0 r /Symbol findfont 65.1643 sf 0 0 m (s) show NC gr 
 gsave  2268 1538 0 0 C 1733.37 1104.53 t 0 r /Helvetica findfont 65.1643 sf 0 0 m ( / ) show NC gr 
 gsave  2268 1538 0 0 C 1707.3 1081.73 t 0 r /Helvetica findfont 45.615 sf 0 0 m (2) show NC gr 
 gsave  2268 1538 0 0 C 1658.43 1104.53 t 0 r /Symbol findfont 65.1643 sf 0 0 m ita (s) show gr NC gr 
 gsave  2268 1538 0 0 C 1616.07 1104.53 t 0 r /Symbol findfont 65.1643 sf 0 0 m (D) show NC gr 
 gsave  2268 1538 0 0 C 1345.64 1104.53 t 0 r /Helvetica findfont 65.1643 sf 0 0 m ( > 0.2,    ) show NC gr 
 gsave  2268 1538 0 0 C 1244.64 1078.47 t 0 r /Helvetica findfont 45.615 sf 0 0 m (MVA) show NC gr 
 gsave  2268 1538 0 0 C 1189.25 1104.53 t 0 r /Helvetica-Oblique findfont 65.1643 sf 0 0 m (O) show NC gr  0.8 0.4 0 c 1111 1038 m 12 X s 1157 1038 m -12 X s 1134 1038 m22 black
 gsave  2268 1538 0 0 C 1860.44 1026.34 t 0 r /Helvetica findfont 65.1643 sf 0 0 m ( = 35%) show NC gr 
 gsave  2268 1538 0 0 C 1834.37 1003.53 t 0 r /Helvetica findfont 45.615 sf 0 0 m (2) show NC gr 
 gsave  2268 1538 0 0 C 1795.28 1026.34 t 0 r /Symbol findfont 65.1643 sf 0 0 m (s) show NC gr 
 gsave  2268 1538 0 0 C 1733.37 1026.34 t 0 r /Helvetica findfont 65.1643 sf 0 0 m ( / ) show NC gr 
 gsave  2268 1538 0 0 C 1707.3 1003.53 t 0 r /Helvetica findfont 45.615 sf 0 0 m (2) show NC gr 
 gsave  2268 1538 0 0 C 1658.43 1026.34 t 0 r /Symbol findfont 65.1643 sf 0 0 m ita (s) show gr NC gr 
 gsave  2268 1538 0 0 C 1616.07 1026.34 t 0 r /Symbol findfont 65.1643 sf 0 0 m (D) show NC gr 
 gsave  2268 1538 0 0 C 1345.64 1026.34 t 0 r /Helvetica findfont 65.1643 sf 0 0 m ( > 0.6,    ) show NC gr 
 gsave  2268 1538 0 0 C 1244.64 1000.27 t 0 r /Helvetica findfont 45.615 sf 0 0 m (MVA) show NC gr 
 gsave  2268 1538 0 0 C 1189.25 1026.34 t 0 r /Helvetica-Oblique findfont 65.1643 sf 0 0 m (O) show NC gr  0.4 0.2 0 c 1111 961 m 12 X s 1157 961 m -12 X s 1134 961 m23 black
 gsave  2268 1538 0 0 C 1860.44 948.14 t 0 r /Helvetica findfont 65.1643 sf 0 0 m ( = 41%) show NC gr 
 gsave  2268 1538 0 0 C 1834.37 925.333 t 0 r /Helvetica findfont 45.615 sf 0 0 m (2) show NC gr 
 gsave  2268 1538 0 0 C 1795.28 948.14 t 0 r /Symbol findfont 65.1643 sf 0 0 m (s) show NC gr 
 gsave  2268 1538 0 0 C 1733.37 948.14 t 0 r /Helvetica findfont 65.1643 sf 0 0 m ( / ) show NC gr 
 gsave  2268 1538 0 0 C 1707.3 925.333 t 0 r /Helvetica findfont 45.615 sf 0 0 m (2) show NC gr 
 gsave  2268 1538 0 0 C 1658.43 948.14 t 0 r /Symbol findfont 65.1643 sf 0 0 m ita (s) show gr NC gr 
 gsave  2268 1538 0 0 C 1616.07 948.14 t 0 r /Symbol findfont 65.1643 sf 0 0 m (D) show NC gr 
 gsave  2268 1538 0 0 C 1345.64 948.14 t 0 r /Helvetica findfont 65.1643 sf 0 0 m ( > 0.8,    ) show NC gr 
 gsave  2268 1538 0 0 C 1244.64 922.074 t 0 r /Helvetica findfont 45.615 sf 0 0 m (MVA) show NC gr 
 gsave  2268 1538 0 0 C 1189.25 948.14 t 0 r /Helvetica-Oblique findfont 65.1643 sf 0 0 m (O) show NC gr 
 gsave  2268 1538 0 0 C 2222.1 1016.56 t 90 r /Helvetica-BoldOblique findfont 39.0986 sf 0 0 m (LHC HIGGS XS WG 2013) show NC gr 
 gr  gr showpage
end
%%EOF
