%!PS-Adobe-2.0 EPSF-2.0
%%BoundingBox:  0 0 567 615
%%Title: Results/Dyj1-j2.eps: VBF
%%Creator: ROOT Version 5.24/00
%%CreationDate: Tue Mar 19 10:04:25 2013
%%EndComments
%%BeginProlog
80 dict begin
/s {stroke} def /l {lineto} def /m {moveto} def /t {translate} def
/sw {stringwidth} def /r {rotate} def /rl {roll}  def /R {repeat} def
/d {rlineto} def /rm {rmoveto} def /gr {grestore} def /f {eofill} def
/c {setrgbcolor} def /black {0 setgray} def /sd {setdash} def
/cl {closepath} def /sf {scalefont setfont} def /lw {setlinewidth} def
/box {m dup 0 exch d exch 0 d 0 exch neg d cl} def
/NC{systemdict begin initclip end}def/C{NC box clip newpath}def
/bl {box s} def /bf {box f} def /Y { 0 exch d} def /X { 0 d} def 
/mp {newpath /y exch def /x exch def} def
/side {[w .77 mul w .23 mul] .385 w mul sd w 0 l currentpoint t -144 r} def
/mr {mp x y w2 0 360 arc} def /m24 {mr s} def /m20 {mr f} def
/mb {mp x y w2 add m w2 neg 0 d 0 w neg d w 0 d 0 w d cl} def
/mt {mp x y w2 add m w2 neg w neg d w 0 d cl} def
/m21 {mb f} def /m25 {mb s} def /m22 {mt f} def /m26{mt s} def
/m23 {mp x y w2 sub m w2 w d w neg 0 d cl f} def
/m27 {mp x y w2 add m w3 neg w2 neg d w3 w2 neg d w3 w2 d cl s} def
/m28 {mp x w2 sub y w2 sub w3 add m w3 0 d  0 w3 neg d w3 0 d 0 w3 d w3 0 d  0 w3 d w3 neg 0 d 0 w3 d w3 neg 0 d
 0 w3 neg d w3 neg 0 d cl s } def
/m29 {mp gsave x w2 sub y w2 add w3 sub m currentpoint t
 4 {side} repeat cl fill gr} def
/m30 {mp gsave x w2 sub y w2 add w3 sub m currentpoint t
 4 {side} repeat cl s gr} def
/m31 {mp x y w2 sub m 0 w d x w2 sub y m w 0 d x w2 sub y w2 add m w w neg d x w2 sub y w2
 sub m w w d s} def
/m2 {mp x y w2 sub m 0 w d x w2 sub y m w 0 d s} def
/m5 {mp x w2 sub y w2 sub m w w d x w2 sub y w2 add m w w neg d s} def
/reEncode {exch findfont dup length dict begin {1 index /FID eq  {pop pop} {def} ifelse } forall /Encoding exch def currentdict end dup /FontName get exch definefont pop } def [/Times-Bold /Times-Italic /Times-BoldItalic /Helvetica
 /Helvetica-Oblique /Helvetica-Bold /Helvetica-BoldOblique /Courier /Courier-Oblique /Courier-Bold /Courier-BoldOblique /Times-Roman /AvantGarde-Book /AvantGarde-BookOblique /AvantGarde-Demi /AvantGarde-DemiOblique /Bookman-Demi
 /Bookman-DemiItalic /Bookman-Light /Bookman-LightItalic /Helvetica-Narrow /Helvetica-Narrow-Bold /Helvetica-Narrow-BoldOblique /Helvetica-Narrow-Oblique /NewCenturySchlbk-Roman /NewCenturySchlbk-Bold
 /NewCenturySchlbk-BoldItalic /NewCenturySchlbk-Italic /Palatino-Bold /Palatino-BoldItalic /Palatino-Italic /Palatino-Roman ] {ISOLatin1Encoding reEncode } forall
/oshow {gsave [] 0 sd true charpath stroke gr} def
/stwn { /fs exch def /fn exch def /text exch def fn findfont fs sf
 text sw pop xs add /xs exch def} def
/stwb { /fs exch def /fn exch def /nbas exch def /textf exch deftextf length /tlen exch def nbas tlen gt {/nbas tlendef} iffn findfont fs sf textf dup length nbas sub nbas getinterval sw
pop neg xs add /xs exch def} def
%%EndProlog
%%BeginSetup
%%EndSetup
newpath  gsave  .25 .25 scale  gsave  0 0 t black[  ] 0 sd 3 lw 1 1 1 c 2268 2460 0 0 bf black 1 1 1 c 2177 1058 45 1353 bf black 1 1 1 c 1677 846 328 1459 bf black 1677 846 328 1459 bl 1 1 1 c 1677 846 328 1459 bf black 1677 846 328 1459 bl 0.8 0 0
 c[  12 12 ] 0 sd 6 lw 1 1 1 c black 0.8 0 0 c 328 2186 m 112 X 35 Y 112 X 18 Y 112 X 7 Y 111 X -9 Y 112 X -23 Y 112 X -34 Y 112 X -51 Y 111 X -56 Y 112 X -80 Y 112 X -90 Y 112 X -124 Y 111 X -256 Y 112 X -64 Y 224 X s black[  ] 0 sd 3 lw 328 1459 m
 1677 X s 328 1483 m -24 Y s 384 1471 m -12 Y s 440 1471 m -12 Y s 496 1471 m -12 Y s 552 1471 m -12 Y s 608 1483 m -24 Y s 664 1471 m -12 Y s 720 1471 m -12 Y s 775 1471 m -12 Y s 831 1471 m -12 Y s 887 1483 m -24 Y s 943 1471 m -12 Y s 999 1471 m
 -12 Y s 1055 1471 m -12 Y s 1111 1471 m -12 Y s 1167 1483 m -24 Y s 1222 1471 m -12 Y s 1278 1471 m -12 Y s 1334 1471 m -12 Y s 1390 1471 m -12 Y s 1446 1483 m -24 Y s 1502 1471 m -12 Y s 1558 1471 m -12 Y s 1614 1471 m -12 Y s 1669 1471 m -12 Y s
 1725 1483 m -24 Y s 1781 1471 m -12 Y s 1837 1471 m -12 Y s 1893 1471 m -12 Y s 1949 1471 m -12 Y s 2005 1483 m -24 Y s 2005 1483 m -24 Y s
 gsave  2177 1058 45 1353 C 324 1453 t 0 r /Helvetica findfont 2.53676 sf 0 0 m (4) show NC gr 
 gsave  2177 1058 45 1353 C 605 1453 t 0 r /Helvetica findfont 2.53676 sf 0 0 m (5) show NC gr 
 gsave  2177 1058 45 1353 C 883 1453 t 0 r /Helvetica findfont 2.53676 sf 0 0 m (6) show NC gr 
 gsave  2177 1058 45 1353 C 1162 1453 t 0 r /Helvetica findfont 2.53676 sf 0 0 m (7) show NC gr 
 gsave  2177 1058 45 1353 C 1443 1453 t 0 r /Helvetica findfont 2.53676 sf 0 0 m (8) show NC gr 
 gsave  2177 1058 45 1353 C 1721 1453 t 0 r /Helvetica findfont 2.53676 sf 0 0 m (9) show NC gr 
 gsave  2177 1058 45 1353 C 2002 1453 t 0 r /Helvetica findfont 2.53676 sf 0 0 m (10) show NC gr  328 1459 m 846 Y s
 gsave  2177 1058 45 1353 C 223 2149 t 90 r /Helvetica findfont 48.1984 sf 0 0 m ([pb/bin]) show NC gr  354 1507 m -26 X s 354 1545 m -26 X s 354 1571 m -26 X s 354 1592 m -26 X s 354 1609 m -26 X s 354 1623 m -26 X s 354 1635 m -26 X s 354 1646 m
 -26 X s 381 1656 m -53 X s
 gsave  2177 1058 45 1353 C 286 1655 t 0 r /Helvetica findfont 30.4411 sf 0 0 m (\2554) show NC gr 
 gsave  2177 1058 45 1353 C 235 1638 t 0 r /Helvetica findfont 45.6617 sf 0 0 m (10) show NC gr  354 1720 m -26 X s 354 1757 m -26 X s 354 1784 m -26 X s 354 1805 m -26 X s 354 1822 m -26 X s 354 1836 m -26 X s 354 1848 m -26 X s 354 1859 m -26 X s
 381 1869 m -53 X s
 gsave  2177 1058 45 1353 C 286 1870 t 0 r /Helvetica findfont 30.4411 sf 0 0 m (\2553) show NC gr 
 gsave  2177 1058 45 1353 C 235 1850 t 0 r /Helvetica findfont 45.6617 sf 0 0 m (10) show NC gr  354 1933 m -26 X s 354 1970 m -26 X s 354 1997 m -26 X s 354 2018 m -26 X s 354 2034 m -26 X s 354 2049 m -26 X s 354 2061 m -26 X s 354 2072 m -26 X s
 381 2082 m -53 X s
 gsave  2177 1058 45 1353 C 286 2080 t 0 r /Helvetica findfont 30.4411 sf 0 0 m (\2552) show NC gr 
 gsave  2177 1058 45 1353 C 235 2063 t 0 r /Helvetica findfont 45.6617 sf 0 0 m (10) show NC gr  354 2146 m -26 X s 354 2183 m -26 X s 354 2210 m -26 X s 354 2230 m -26 X s 354 2247 m -26 X s 354 2262 m -26 X s 354 2274 m -26 X s 354 2285 m -26 X s
 381 2295 m -53 X s
 gsave  2177 1058 45 1353 C 291 2293 t 0 r /Helvetica findfont 30.4411 sf 0 0 m (\2551) show NC gr 
 gsave  2177 1058 45 1353 C 240 2275 t 0 r /Helvetica findfont 45.6617 sf 0 0 m (10) show NC gr  6 lw 1 1 1 c black 328 2189 m 112 X 34 Y 112 X 20 Y 112 X 6 Y 111 X -9 Y 112 X -21 Y 112 X -36 Y 112 X -44 Y 111 X -58 Y 112 X -68 Y 112 X -110 Y 112 X
 -114 Y 111 X -314 Y 112 X -16 Y 224 X s 0.2 0.2 0.8 c[ 20 12 4 12] 0 sd 1 1 1 c black 0.2 0.2 0.8 c 328 2178 m 112 X 35 Y 112 X 20 Y 112 X 5 Y 111 X -8 Y 112 X -21 Y 112 X -32 Y 112 X -47 Y 111 X -57 Y 112 X -72 Y 112 X -96 Y 112 X -130 Y 111 X
 -300 Y 112 X -16 Y 224 X s black
 gsave  2177 1058 45 1353 C 410 1546 t 0 r /Helvetica findfont 58.3455 sf 0 0 m (VBF Higgs \(125 GeV\) @ LHC 8 TeV) show NC gr 
 gsave  2177 1058 45 1353 C 2048 1946 t 90 r /Helvetica-BoldOblique findfont 30.4411 sf 0 0 m (LHC HIGGS XS WG 2013) show NC gr  1 1 1 c[  ] 0 sd 3 lw 588 243 1417 2041 bf black
 gsave  2177 1058 45 1353 C 1562 2230 t 0 r /Helvetica findfont 45.6617 sf 0 0 m (aMC@NLO+HW6) show NC gr  1 1 1 c 1439 2215 m 103 X 57 Y -103 X f black 6 lw 1439 2243 m 103 X s 3 lw /w 29 def /w2 {w 2 div} def /w3 {w 3 div} def 1490 2243 m20 6 lw
 gsave  2177 1058 45 1353 C 1562 2149 t 0 r /Helvetica findfont 45.6617 sf 0 0 m (aMC@NLO+PY6) show NC gr  1 1 1 c 3 lw 1439 2134 m 103 X 57 Y -103 X f 6 lw 0.8 0 0 c[  12 12 ] 0 sd 1439 2162 m 103 X s black[  ] 0 sd 3 lw 1490 2162 m20[  12 12 
] 0 sd 6 lw
 gsave  2177 1058 45 1353 C 1562 2068 t 0 r /Helvetica findfont 45.6617 sf 0 0 m (aMC@NLO+HWPP) show NC gr  1 1 1 c[  ] 0 sd 3 lw 1439 2053 m 103 X 57 Y -103 X f[  12 12 ] 0 sd 6 lw 0.2 0.2 0.8 c[ 20 12 4 12] 0 sd 1439 2081 m 103 X s black[  ] 0 sd
 3 lw 1490 2081 m20[ 20 12 4 12] 0 sd 6 lw[  ] 0 sd 3 lw 1 1 1 c black 1 1 1 c 1677 267 328 1184 bf black 1677 267 328 1184 bl 1 1 1 c 1677 267 328 1184 bf black 1677 267 328 1184 bl 328 1184 m 1677 X s 328 1211 m -27 Y s 384 1197 m -13 Y s 440 1197
 m -13 Y s 496 1197 m -13 Y s 552 1197 m -13 Y s 608 1211 m -27 Y s 664 1197 m -13 Y s 720 1197 m -13 Y s 775 1197 m -13 Y s 831 1197 m -13 Y s 887 1211 m -27 Y s 943 1197 m -13 Y s 999 1197 m -13 Y s 1055 1197 m -13 Y s 1111 1197 m -13 Y s 1167
 1211 m -27 Y s 1222 1197 m -13 Y s 1278 1197 m -13 Y s 1334 1197 m -13 Y s 1390 1197 m -13 Y s 1446 1211 m -27 Y s 1502 1197 m -13 Y s 1558 1197 m -13 Y s 1614 1197 m -13 Y s 1669 1197 m -13 Y s 1725 1211 m -27 Y s 1781 1197 m -13 Y s 1837 1197 m
 -13 Y s 1893 1197 m -13 Y s 1949 1197 m -13 Y s 2005 1211 m -27 Y s 2005 1211 m -27 Y s
 gsave  2177 270 45 1181 C 314 1144 t 0 r /Helvetica findfont 45.9522 sf 0 0 m (4) show NC gr 
 gsave  2177 270 45 1181 C 595 1144 t 0 r /Helvetica findfont 45.9522 sf 0 0 m (5) show NC gr 
 gsave  2177 270 45 1181 C 873 1144 t 0 r /Helvetica findfont 45.9522 sf 0 0 m (6) show NC gr 
 gsave  2177 270 45 1181 C 1152 1144 t 0 r /Helvetica findfont 45.9522 sf 0 0 m (7) show NC gr 
 gsave  2177 270 45 1181 C 1433 1144 t 0 r /Helvetica findfont 45.9522 sf 0 0 m (8) show NC gr 
 gsave  2177 270 45 1181 C 1711 1144 t 0 r /Helvetica findfont 45.9522 sf 0 0 m (9) show NC gr 
 gsave  2177 270 45 1181 C 1979 1144 t 0 r /Helvetica findfont 45.9522 sf 0 0 m (10) show NC gr  328 1184 m 267 Y s 393 1228 m -65 X s 361 1251 m -33 X s 361 1273 m -33 X s 361 1295 m -33 X s 393 1317 m -65 X s 361 1340 m -33 X s 361 1362 m -33 X s
 361 1384 m -33 X s 393 1407 m -65 X s 393 1228 m -65 X s 361 1206 m -33 X s 361 1184 m -33 X s 393 1407 m -65 X s 361 1429 m -33 X s
 gsave  2177 270 45 1181 C 253 1212 t 0 r /Helvetica findfont 45.9522 sf 0 0 m (0.8) show NC gr 
 gsave  2177 270 45 1181 C 299 1301 t 0 r /Helvetica findfont 45.9522 sf 0 0 m (1) show NC gr 
 gsave  2177 270 45 1181 C 253 1389 t 0 r /Helvetica findfont 45.9522 sf 0 0 m (1.2) show NC gr 
 gsave  2177 270 45 1181 C 410 1372 t 0 r /Helvetica findfont 38.2935 sf 0 0 m (aMC@NLO \255 Ratio over aMC@NLO+HW6) show NC gr  0.8 0 0 c[  12 12 ] 0 sd 6 lw 1 1 1 c black 0.8 0 0 c 328 1305 m 112 X 1 Y 112 X -6 Y 112 X 5 Y 111 X -3 Y 112 X -7 Y
 112 X 7 Y 112 X -29 Y 111 X 8 Y 112 X -50 Y 112 X 86 Y 112 X -45 Y 111 X 179 Y s 1781 1451 m -267 Y s 1781 1184 m 224 X s black[  ] 0 sd 1 1 1 c black 328 1317 m 1453 X -133 Y 224 X s 0.2 0.2 0.8 c[ 20 12 4 12] 0 sd 1 1 1 c black 0.2 0.2 0.8 c 328
 1268 m 112 X 3 Y 224 X -3 Y 111 X 4 Y 112 X -2 Y 112 X 16 Y 112 X -9 Y 111 X 4 Y 112 X -16 Y 112 X 62 Y 112 X -75 Y 111 X 69 Y 112 X -137 Y 224 X s black[  ] 0 sd 3 lw 1 1 1 c black 1 1 1 c 1677 292 328 889 bf black 1677 292 328 889 bl 1 1 1 c 1677
 292 328 889 bf black 1677 292 328 889 bl 328 889 m 1677 X s 328 918 m -29 Y s 384 903 m -14 Y s 440 903 m -14 Y s 496 903 m -14 Y s 552 903 m -14 Y s 608 918 m -29 Y s 664 903 m -14 Y s 720 903 m -14 Y s 775 903 m -14 Y s 831 903 m -14 Y s 887 918
 m -29 Y s 943 903 m -14 Y s 999 903 m -14 Y s 1055 903 m -14 Y s 1111 903 m -14 Y s 1167 918 m -29 Y s 1222 903 m -14 Y s 1278 903 m -14 Y s 1334 903 m -14 Y s 1390 903 m -14 Y s 1446 918 m -29 Y s 1502 903 m -14 Y s 1558 903 m -14 Y s 1614 903 m
 -14 Y s 1669 903 m -14 Y s 1725 918 m -29 Y s 1781 903 m -14 Y s 1837 903 m -14 Y s 1893 903 m -14 Y s 1949 903 m -14 Y s 2005 918 m -29 Y s 2005 918 m -29 Y s
 gsave  2177 295 45 886 C 314 850 t 0 r /Helvetica findfont 45.8082 sf 0 0 m (4) show NC gr 
 gsave  2177 295 45 886 C 595 850 t 0 r /Helvetica findfont 45.8082 sf 0 0 m (5) show NC gr 
 gsave  2177 295 45 886 C 873 850 t 0 r /Helvetica findfont 45.8082 sf 0 0 m (6) show NC gr 
 gsave  2177 295 45 886 C 1152 850 t 0 r /Helvetica findfont 45.8082 sf 0 0 m (7) show NC gr 
 gsave  2177 295 45 886 C 1433 850 t 0 r /Helvetica findfont 45.8082 sf 0 0 m (8) show NC gr 
 gsave  2177 295 45 886 C 1711 850 t 0 r /Helvetica findfont 45.8082 sf 0 0 m (9) show NC gr 
 gsave  2177 295 45 886 C 1979 850 t 0 r /Helvetica findfont 45.8082 sf 0 0 m (10) show NC gr  328 889 m 292 Y s 393 937 m -65 X s 361 962 m -33 X s 361 986 m -33 X s 361 1010 m -33 X s 393 1035 m -65 X s 361 1059 m -33 X s 361 1083 m -33 X s 361
 1108 m -33 X s 393 1132 m -65 X s 393 937 m -65 X s 361 913 m -33 X s 361 889 m -33 X s 393 1132 m -65 X s 361 1156 m -33 X s
 gsave  2177 295 45 886 C 253 921 t 0 r /Helvetica findfont 45.8082 sf 0 0 m (0.8) show NC gr 
 gsave  2177 295 45 886 C 299 1017 t 0 r /Helvetica findfont 45.8082 sf 0 0 m (1) show NC gr 
 gsave  2177 295 45 886 C 253 1116 t 0 r /Helvetica findfont 45.8082 sf 0 0 m (1.2) show NC gr 
 gsave  2177 295 45 886 C 410 1093 t 0 r /Helvetica findfont 38.1735 sf 0 0 m (POWHEG \255 Ratio over aMC@NLO+HW6) show NC gr  0.8 0 0 c[  12 12 ] 0 sd 6 lw 1 1 1 c black 0.8 0 0 c 328 1007 m 112 X -7 Y 112 X -2 Y 112 X -5 Y 111 X -1 Y 112 X 8 Y 112
 X 10 Y 112 X -12 Y 111 X 5 Y 112 X -48 Y 112 X 57 Y 112 X -71 Y 111 X 240 Y s 1781 1181 m -292 Y s 1781 889 m 224 X s black[  ] 0 sd 1 1 1 c black 328 1016 m 112 X 3 Y 112 X 1 Y 112 X -1 Y 111 X 13 Y 112 X 7 Y 112 X 27 Y 112 X -15 Y 111 X 4 Y 112 X
 -47 Y 112 X 101 Y 112 X -114 Y 111 X 186 Y s 1781 1181 m -292 Y s 1781 889 m 224 X s 0.2 0.2 0.8 c[ 20 12 4 12] 0 sd 1 1 1 c black 0.2 0.2 0.8 c 328 969 m 112 X -4 Y 112 X 13 Y 112 X 3 Y 111 X 8 Y 112 X 6 Y 112 X 23 Y 112 X -2 Y 111 X -2 Y 112 X
 -42 Y 112 X 41 Y 112 X -93 Y 111 X 261 Y s 1781 1181 m -292 Y s 1781 889 m 224 X s black[ 20 20] 0 sd 3 lw 328 1035 m 1677 X s[  ] 0 sd 1 1 1 c black 1 1 1 c 1677 276 328 610 bf black 1677 276 328 610 bl 1 1 1 c 1677 276 328 610 bf black 1677 276
 328 610 bl 328 610 m 1677 X s
 gsave  2177 394 45 492 C 1789 504 t 0 r /Helvetica findfont 45.7096 sf 0 0 m (|D\(yj1\255yj2\)|) show NC gr  328 634 m -24 Y s 384 622 m -12 Y s 440 622 m -12 Y s 496 622 m -12 Y s 552 622 m -12 Y s 608 634 m -24 Y s 664 622 m -12 Y s 720 622 m -12
 Y s 775 622 m -12 Y s 831 622 m -12 Y s 887 634 m -24 Y s 943 622 m -12 Y s 999 622 m -12 Y s 1055 622 m -12 Y s 1111 622 m -12 Y s 1167 634 m -24 Y s 1222 622 m -12 Y s 1278 622 m -12 Y s 1334 622 m -12 Y s 1390 622 m -12 Y s 1446 634 m -24 Y s
 1502 622 m -12 Y s 1558 622 m -12 Y s 1614 622 m -12 Y s 1669 622 m -12 Y s 1725 634 m -24 Y s 1781 622 m -12 Y s 1837 622 m -12 Y s 1893 622 m -12 Y s 1949 622 m -12 Y s 2005 634 m -24 Y s 2005 634 m -24 Y s
 gsave  2177 394 45 492 C 314 564 t 0 r /Helvetica findfont 45.7096 sf 0 0 m (4) show NC gr 
 gsave  2177 394 45 492 C 595 564 t 0 r /Helvetica findfont 45.7096 sf 0 0 m (5) show NC gr 
 gsave  2177 394 45 492 C 873 564 t 0 r /Helvetica findfont 45.7096 sf 0 0 m (6) show NC gr 
 gsave  2177 394 45 492 C 1152 564 t 0 r /Helvetica findfont 45.7096 sf 0 0 m (7) show NC gr 
 gsave  2177 394 45 492 C 1433 564 t 0 r /Helvetica findfont 45.7096 sf 0 0 m (8) show NC gr 
 gsave  2177 394 45 492 C 1711 564 t 0 r /Helvetica findfont 45.7096 sf 0 0 m (9) show NC gr 
 gsave  2177 394 45 492 C 1979 564 t 0 r /Helvetica findfont 45.7096 sf 0 0 m (10) show NC gr  328 610 m 276 Y s 374 656 m -46 X s 351 679 m -23 X s 351 702 m -23 X s 351 725 m -23 X s 374 748 m -46 X s 351 771 m -23 X s 351 794 m -23 X s 351 817 m
 -23 X s 374 840 m -46 X s 374 656 m -46 X s 351 633 m -23 X s 351 610 m -23 X s 374 840 m -46 X s 351 863 m -23 X s
 gsave  2177 394 45 492 C 253 640 t 0 r /Helvetica findfont 45.7096 sf 0 0 m (0.8) show NC gr 
 gsave  2177 394 45 492 C 299 731 t 0 r /Helvetica findfont 45.7096 sf 0 0 m (1) show NC gr 
 gsave  2177 394 45 492 C 253 823 t 0 r /Helvetica findfont 45.7096 sf 0 0 m (1.2) show NC gr  0.8 0 0 c
 gsave  2177 394 45 492 C 410 795 t 0 r /Helvetica findfont 43.1702 sf 0 0 m (Scale uncert) show NC gr  black
 gsave  2177 394 45 492 C 410 681 t 0 r /Helvetica findfont 43.1702 sf 0 0 m (PDF uncert) show NC gr  0.8 0 0 c[  12 12 ] 0 sd 6 lw 1 1 1 c black 0.8 0 0 c 328 757 m 112 X -1 Y 112 X 4 Y 112 X -6 Y 111 X 1 Y 112 X 1 Y 112 X -2 Y 112 X 5 Y 111 X 5 Y
 112 X 9 Y 112 X 9 Y 112 X 8 Y 111 X 56 Y 112 X -236 Y 224 X s 1 1 1 c black 0.8 0 0 c 328 733 m 112 X 11 Y 112 X -6 Y 112 X 1 Y 111 X -2 Y 112 X -3 Y 112 X 1 Y 112 X -5 Y 111 X -5 Y 112 X -7 Y 112 X -7 Y 112 X -6 Y 111 X -95 Y 336 X s black[
 12 16 4 16] 0 sd 1 1 1 c black 328 739 m 224 X -1 Y 670 X -1 Y 224 X -1 Y 112 X -3 Y 111 X -24 Y 112 X -99 Y 224 X s 1 1 1 c black 328 760 m 224 X 1 Y 112 X -1 Y 223 X 1 Y 335 X 2 Y 224 X 1 Y 112 X 5 Y 111 X 30 Y 112 X -189 Y 224 X s[ 20 20] 0 sd 3
 lw 328 748 m 1677 X s
 gr  gr 
showpage
end
%%EOF
