%!PS-Adobe-3.0 EPSF-3.0
%%BoundingBox: (atend)
%%LanguageLevel: 2
%%Creator: Grace-5.1.22
%%CreationDate: Mon Jun  3 12:34:29 2013
%%DocumentData: Clean8Bit
%%Orientation: Portrait
%%Title: /home/pcl321b/heinemey/plot/grace/2012/lhc-higgs-br/mhmodm_tb10_BR-HH.grace
%%For: heinemey
%%DocumentNeededResources: (atend)
%%EndComments
%%BeginProlog
/m {moveto} def
/l {lineto} def
/s {stroke} def
/n {newpath} def
/c {closepath} def
/RL {rlineto} def
/SLW {setlinewidth} def
/GS {gsave} def
/GR {grestore} def
/SC {setcolor} def
/SGRY {setgray} def
/SRGB {setrgbcolor} def
/SD {setdash} def
/SLC {setlinecap} def
/SLJ {setlinejoin} def
/SCS {setcolorspace} def
/FFSF {findfont setfont} def
/CC {concat} def
/PXL {n m 0 0 RL s} def
/Color0 {1.0000 1.0000 1.0000} def
/Color1 {0.0000 0.0000 0.0000} def
/Color2 {1.0000 0.0000 0.0000} def
/Color3 {0.0000 1.0000 0.0000} def
/Color4 {0.0000 0.0000 1.0000} def
/Color5 {1.0000 1.0000 0.0000} def
/Color6 {0.7373 0.5608 0.5608} def
/Color7 {0.8627 0.8627 0.8627} def
/Color8 {0.5804 0.0000 0.8275} def
/Color9 {0.0000 1.0000 1.0000} def
/Color10 {1.0000 0.0000 1.0000} def
/Color11 {1.0000 0.6471 0.0000} def
/Color12 {0.4471 0.1294 0.7373} def
/Color13 {0.4039 0.0275 0.2824} def
/Color14 {0.2510 0.8784 0.8157} def
/Color15 {0.0000 0.5451 0.0000} def
/Color16 {0.7529 0.7529 0.7529} def
/Color17 {0.5059 0.5059 0.5059} def
/Color18 {0.2588 0.2588 0.2588} def
/PTRN {
 /pat_bits exch def 
 <<
  /PaintType 2
  /PatternType 1 /TilingType 1
  /BBox[0 0 16 16]
  /XStep 16 /YStep 16
  /PaintProc {
   pop
   16 16 true [-1 0 0 -1 16 16] pat_bits imagemask
  }
 >>
 [0.0016 0 0 0.0016 0 0]
 makepattern
} def
/Pattern0 {<0000000000000000000000000000000000000000000000000000000000000000> PTRN} bind def
/Pattern1 {<ffffffffffffffffffffffffffffffffffffffffffffffffffffffffffffffff> PTRN} bind def
/Pattern2 {<eeeeffffbbbbffffeeeeffffbbbbffffeeeeffffbbbbffffeeeeffffbbbbffff> PTRN} bind def
/Pattern3 {<eeeebbbbeeeebbbbeeeebbbbeeeebbbbeeeebbbbeeeebbbbeeeebbbbeeeebbbb> PTRN} bind def
/Pattern4 {<5555aaaa5555aaaa5555aaaa5555aaaa5555aaaa5555aaaa5555aaaa5555aaaa> PTRN} bind def
/Pattern5 {<1111444411114444111144441111444411114444111144441111444411114444> PTRN} bind def
/Pattern6 {<1111000044440000111100004444000011110000444400001111000044440000> PTRN} bind def
/Pattern7 {<1010000000000000010100000000000010100000000000000101000000000000> PTRN} bind def
/Pattern8 {<0000000000000000000000000000000000000000000000000000000000000000> PTRN} bind def
/Pattern9 {<1e1e0f0f8787c3c3e1e1f0f078783c3c1e1e0f0f8787c3c3e1e1f0f078783c3c> PTRN} bind def
/Pattern10 {<7878f0f0e1e1c3c387870f0f1e1e3c3c7878f0f0e1e1c3c387870f0f1e1e3c3c> PTRN} bind def
/Pattern11 {<3333333333333333333333333333333333333333333333333333333333333333> PTRN} bind def
/Pattern12 {<ffffffff00000000ffffffff00000000ffffffff00000000ffffffff00000000> PTRN} bind def
/Pattern13 {<8181424224241818181824244242818181814242242418181818242442428181> PTRN} bind def
/Pattern14 {<8080404020201010080804040202010180804040202010100808040402020101> PTRN} bind def
/Pattern15 {<0101020204040808101020204040808001010202040408081010202040408080> PTRN} bind def
/Pattern16 {<2222222222222222222222222222222222222222222222222222222222222222> PTRN} bind def
/Pattern17 {<0000ffff000000000000ffff000000000000ffff000000000000ffff00000000> PTRN} bind def
/Pattern18 {<2222ffff222222222222ffff222222222222ffff222222222222ffff22222222> PTRN} bind def
/Pattern19 {<ffffffff33333333ffffffff33333333ffffffff33333333ffffffff33333333> PTRN} bind def
/Pattern20 {<0f0f0f0f0f0f0f0ff0f0f0f0f0f0f0f00f0f0f0f0f0f0f0ff0f0f0f0f0f0f0f0> PTRN} bind def
/Pattern21 {<ff00ff00ff00ff00ff00ff00ff00ff0000ff00ff00ff00ff00ff00ff00ff00ff> PTRN} bind def
/Pattern22 {<8001800180018001800180018001ffffffff8001800180018001800180018001> PTRN} bind def
/Pattern23 {<c003c003c003c003c003c003ffffffffffffffffc003c003c003c003c003c003> PTRN} bind def
/Pattern24 {<040404040404ffff404040404040ffff040404040404ffff404040404040ffff> PTRN} bind def
/Pattern25 {<180018001800180018001800ffffffff001800180018001800180018ffffffff> PTRN} bind def
/Pattern26 {<1111b8b87c7c3a3a1111a3a3c7c78b8b1111b8b87c7c3a3a1111a3a3c7c78b8b> PTRN} bind def
/Pattern27 {<101010102828c7c70101010182827c7c101010102828c7c70101010182827c7c> PTRN} bind def
/Pattern28 {<1c1c121211112121c1c12121111112121c1c121211112121c1c1212111111212> PTRN} bind def
/Pattern29 {<3e3e414180808080e3e31414080808083e3e414180808080e3e3141408080808> PTRN} bind def
/Pattern30 {<4848888884848383848488884848383848488888848483838484888848483838> PTRN} bind def
/Pattern31 {<03030404080808080c0c12122121c0c003030404080808080c0c12122121c0c0> PTRN} bind def
/ellipsedict 8 dict def
ellipsedict /mtrx matrix put
/EARC {
 ellipsedict begin
  /endangle exch def
  /startangle exch def
  /yrad exch def
  /xrad exch def
  /y exch def
  /x exch def
  /savematrix mtrx currentmatrix def
  x y translate
  xrad yrad scale
  0 0 1 startangle endangle arc
  savematrix setmatrix
 end
} def
/TL {
  /kcomp exch def
  /linewidth exch def
  /offset exch def
  GS
  0 offset rmoveto
  linewidth SLW
  dup stringwidth exch kcomp add exch RL s
  GR
} def
/KINIT
{
 /kvector exch def
 /kid 0 def
} def
/KPROC
{
 pop pop
 kvector kid get
 0 rmoveto
 /kid 1 kid add def
} def
/DefEncoding [
 /.notdef
 /.notdef
 /.notdef
 /.notdef
 /.notdef
 /.notdef
 /.notdef
 /.notdef
 /.notdef
 /.notdef
 /.notdef
 /.notdef
 /.notdef
 /.notdef
 /.notdef
 /.notdef
 /.notdef
 /.notdef
 /.notdef
 /.notdef
 /.notdef
 /.notdef
 /.notdef
 /.notdef
 /.notdef
 /.notdef
 /.notdef
 /.notdef
 /.notdef
 /.notdef
 /.notdef
 /.notdef
 /space
 /exclam
 /quotedbl
 /numbersign
 /dollar
 /percent
 /ampersand
 /quoteright
 /parenleft
 /parenright
 /asterisk
 /plus
 /comma
 /hyphen
 /period
 /slash
 /zero
 /one
 /two
 /three
 /four
 /five
 /six
 /seven
 /eight
 /nine
 /colon
 /semicolon
 /less
 /equal
 /greater
 /question
 /at
 /A
 /B
 /C
 /D
 /E
 /F
 /G
 /H
 /I
 /J
 /K
 /L
 /M
 /N
 /O
 /P
 /Q
 /R
 /S
 /T
 /U
 /V
 /W
 /X
 /Y
 /Z
 /bracketleft
 /backslash
 /bracketright
 /asciicircum
 /underscore
 /grave
 /a
 /b
 /c
 /d
 /e
 /f
 /g
 /h
 /i
 /j
 /k
 /l
 /m
 /n
 /o
 /p
 /q
 /r
 /s
 /t
 /u
 /v
 /w
 /x
 /y
 /z
 /braceleft
 /bar
 /braceright
 /asciitilde
 /.notdef
 /.notdef
 /.notdef
 /.notdef
 /.notdef
 /.notdef
 /.notdef
 /.notdef
 /.notdef
 /.notdef
 /.notdef
 /.notdef
 /.notdef
 /.notdef
 /.notdef
 /.notdef
 /.notdef
 /.notdef
 /.notdef
 /.notdef
 /.notdef
 /.notdef
 /.notdef
 /.notdef
 /.notdef
 /.notdef
 /.notdef
 /.notdef
 /.notdef
 /.notdef
 /.notdef
 /.notdef
 /.notdef
 /space
 /exclamdown
 /cent
 /sterling
 /currency
 /yen
 /brokenbar
 /section
 /dieresis
 /copyright
 /ordfeminine
 /guillemotleft
 /logicalnot
 /hyphen
 /registered
 /macron
 /degree
 /plusminus
 /twosuperior
 /threesuperior
 /acute
 /mu
 /paragraph
 /periodcentered
 /cedilla
 /onesuperior
 /ordmasculine
 /guillemotright
 /onequarter
 /onehalf
 /threequarters
 /questiondown
 /Agrave
 /Aacute
 /Acircumflex
 /Atilde
 /Adieresis
 /Aring
 /AE
 /Ccedilla
 /Egrave
 /Eacute
 /Ecircumflex
 /Edieresis
 /Igrave
 /Iacute
 /Icircumflex
 /Idieresis
 /Eth
 /Ntilde
 /Ograve
 /Oacute
 /Ocircumflex
 /Otilde
 /Odieresis
 /multiply
 /Oslash
 /Ugrave
 /Uacute
 /Ucircumflex
 /Udieresis
 /Yacute
 /Thorn
 /germandbls
 /agrave
 /aacute
 /acircumflex
 /atilde
 /adieresis
 /aring
 /ae
 /ccedilla
 /egrave
 /eacute
 /ecircumflex
 /edieresis
 /igrave
 /iacute
 /icircumflex
 /idieresis
 /eth
 /ntilde
 /ograve
 /oacute
 /ocircumflex
 /otilde
 /odieresis
 /divide
 /oslash
 /ugrave
 /uacute
 /ucircumflex
 /udieresis
 /yacute
 /thorn
 /ydieresis
] def
%%EndProlog
%%BeginSetup
%%EndSetup
612.00 612.00 scale
[/DeviceRGB] SCS
Color2 SC
[] 0 SD
0.0045 SLW
0 SLC
0 SLJ
n
0.5218 0.1499 m
0.5233 0.1551 l
0.5249 0.1605 l
0.5265 0.1660 l
0.5280 0.1716 l
0.5296 0.1774 l
0.5312 0.1832 l
0.5327 0.1893 l
0.5343 0.1955 l
0.5359 0.2020 l
0.5375 0.2088 l
0.5390 0.2160 l
0.5406 0.2236 l
0.5422 0.2319 l
0.5437 0.2412 l
0.5453 0.2552 l
0.5469 0.2748 l
0.5484 0.2981 l
0.5502 0.3265 l
0.5516 0.3506 l
0.5531 0.3771 l
0.5547 0.4021 l
0.5563 0.4243 l
0.5578 0.4423 l
0.5594 0.4572 l
0.5610 0.4699 l
0.5625 0.4811 l
0.5641 0.4910 l
0.5657 0.4998 l
0.5673 0.5078 l
0.5688 0.5151 l
0.5704 0.5214 l
0.5720 0.5271 l
0.5735 0.5326 l
0.5751 0.5377 l
0.5767 0.5425 l
0.5782 0.5470 l
0.5798 0.5512 l
0.5814 0.5552 l
0.5829 0.5590 l
0.5845 0.5626 l
0.5861 0.5659 l
0.5876 0.5692 l
0.5892 0.5722 l
0.5908 0.5751 l
0.5924 0.5779 l
0.5939 0.5806 l
0.5955 0.5831 l
0.5971 0.5855 l
0.5986 0.5879 l
0.6002 0.5901 l
0.6018 0.5922 l
0.6033 0.5943 l
0.6049 0.5963 l
0.6065 0.5982 l
0.6080 0.6000 l
0.6096 0.6018 l
0.6112 0.6035 l
0.6127 0.6052 l
0.6143 0.6068 l
0.6159 0.6083 l
0.6175 0.6098 l
0.6190 0.6113 l
0.6206 0.6127 l
0.6222 0.6140 l
0.6237 0.6153 l
0.6253 0.6166 l
0.6269 0.6178 l
0.6284 0.6190 l
0.6300 0.6202 l
0.6316 0.6214 l
0.6331 0.6225 l
0.6347 0.6235 l
0.6363 0.6246 l
0.6378 0.6256 l
0.6394 0.6266 l
0.6410 0.6276 l
0.6425 0.6285 l
0.6441 0.6295 l
0.6457 0.6304 l
0.6473 0.6313 l
0.6488 0.6322 l
0.6504 0.6331 l
0.6520 0.6340 l
0.6535 0.6351 l
0.6551 0.6366 l
0.6567 0.6325 l
0.6582 0.6303 l
0.6598 0.6293 l
0.6614 0.6286 l
0.6629 0.6282 l
0.6645 0.6279 l
0.6661 0.6277 l
0.6676 0.6275 l
0.6692 0.6274 l
0.6708 0.6274 l
0.6724 0.6274 l
0.6739 0.6274 l
0.6755 0.6274 l
0.6771 0.6274 l
0.6786 0.6275 l
0.6802 0.6276 l
0.6818 0.6277 l
0.6833 0.6278 l
0.6849 0.6279 l
0.6865 0.6280 l
0.6880 0.6281 l
0.6896 0.6282 l
0.6912 0.6283 l
0.6927 0.6285 l
0.6943 0.6286 l
0.6959 0.6287 l
0.6975 0.6289 l
0.6990 0.6290 l
0.7006 0.6291 l
0.7022 0.6293 l
0.7037 0.6294 l
0.7053 0.6295 l
0.7069 0.6297 l
0.7084 0.6298 l
0.7100 0.6300 l
0.7116 0.6301 l
0.7131 0.6302 l
0.7147 0.6304 l
0.7163 0.6305 l
0.7178 0.6306 l
0.7194 0.6308 l
0.7210 0.6309 l
0.7225 0.6310 l
0.7241 0.6311 l
0.7257 0.6313 l
0.7273 0.6314 l
0.7288 0.6315 l
0.7304 0.6316 l
0.7320 0.6318 l
0.7335 0.6319 l
0.7351 0.6320 l
0.7367 0.6321 l
0.7382 0.6323 l
0.7398 0.6324 l
0.7414 0.6325 l
0.7429 0.6326 l
0.7445 0.6327 l
0.7461 0.6329 l
0.7476 0.6330 l
0.7492 0.6331 l
0.7508 0.6333 l
0.7524 0.6334 l
0.7539 0.6336 l
0.7555 0.6338 l
0.7571 0.6342 l
0.7586 0.6338 l
0.7602 0.6327 l
0.7618 0.6324 l
0.7633 0.6321 l
0.7649 0.6319 l
0.7665 0.6317 l
0.7680 0.6316 l
0.7696 0.6314 l
0.7712 0.6313 l
0.7727 0.6312 l
0.7743 0.6312 l
0.7759 0.6311 l
0.7775 0.6310 l
0.7790 0.6310 l
0.7806 0.6309 l
0.7822 0.6308 l
0.7837 0.6308 l
0.7853 0.6308 l
0.7869 0.6307 l
0.7884 0.6307 l
0.7900 0.6306 l
0.7916 0.6306 l
0.7931 0.6306 l
0.7947 0.6306 l
0.7963 0.6305 l
0.7978 0.6305 l
0.7994 0.6305 l
0.8010 0.6305 l
0.8025 0.6305 l
0.8041 0.6304 l
0.8057 0.6304 l
0.8073 0.6304 l
0.8088 0.6304 l
0.8104 0.6304 l
0.8120 0.6304 l
0.8135 0.6304 l
0.8151 0.6304 l
0.8167 0.6304 l
0.8182 0.6303 l
0.8198 0.6303 l
0.8214 0.6303 l
0.8229 0.6303 l
0.8245 0.6303 l
0.8261 0.6303 l
0.8276 0.6303 l
0.8292 0.6303 l
0.8308 0.6303 l
0.8324 0.6303 l
0.8339 0.6303 l
0.8355 0.6303 l
0.8371 0.6303 l
0.8386 0.6303 l
0.8402 0.6303 l
0.8418 0.6303 l
0.8433 0.6303 l
0.8449 0.6303 l
0.8465 0.6303 l
0.8480 0.6303 l
0.8496 0.6303 l
0.8512 0.6372 l
0.8527 0.6373 l
0.8543 0.6373 l
0.8559 0.6373 l
0.8575 0.6373 l
0.8590 0.6373 l
0.8606 0.6374 l
0.8622 0.6374 l
0.8637 0.6374 l
0.8653 0.6374 l
0.8669 0.6374 l
0.8684 0.6375 l
0.8700 0.6375 l
0.8716 0.6375 l
0.8731 0.6375 l
0.8747 0.6375 l
0.8763 0.6375 l
0.8778 0.6375 l
0.8794 0.6376 l
0.8810 0.6376 l
0.8825 0.6376 l
0.8841 0.6376 l
0.8857 0.6376 l
0.8873 0.6376 l
0.8888 0.6376 l
0.8904 0.6376 l
0.8920 0.6376 l
0.8935 0.6376 l
0.8951 0.6376 l
0.8967 0.6376 l
0.8982 0.6377 l
0.8998 0.6377 l
0.9014 0.6377 l
0.9029 0.6377 l
0.9045 0.6377 l
0.9061 0.6377 l
0.9076 0.6377 l
0.9092 0.6377 l
0.9108 0.6377 l
0.9124 0.6377 l
0.9139 0.6377 l
0.9155 0.6377 l
0.9171 0.6377 l
0.9186 0.6377 l
0.9202 0.6377 l
0.9218 0.6377 l
0.9233 0.6377 l
0.9249 0.6377 l
0.9265 0.6377 l
0.9280 0.6377 l
0.9296 0.6377 l
0.9312 0.6377 l
0.9327 0.6377 l
0.9343 0.6377 l
0.9359 0.6377 l
0.9375 0.6376 l
0.9390 0.6376 l
0.9406 0.6376 l
0.9422 0.6376 l
0.9437 0.6376 l
0.9453 0.6376 l
0.9469 0.6376 l
0.9484 0.6376 l
0.9500 0.6376 l
s
[/DeviceRGB] SCS
Color3 SC
n
0.1500 0.8782 m
0.1516 0.8789 l
0.1531 0.8795 l
0.1547 0.8802 l
0.1563 0.8808 l
0.1578 0.8813 l
0.1594 0.8819 l
0.1610 0.8824 l
0.1625 0.8830 l
0.1641 0.8834 l
0.1657 0.8839 l
0.1673 0.8844 l
0.1688 0.8848 l
0.1704 0.8852 l
0.1720 0.8856 l
0.1735 0.8860 l
0.1751 0.8863 l
0.1767 0.8867 l
0.1782 0.8870 l
0.1798 0.8873 l
0.1814 0.8876 l
0.1829 0.8878 l
0.1845 0.8881 l
0.1861 0.8883 l
0.1876 0.8885 l
0.1892 0.8887 l
0.1908 0.8889 l
0.1924 0.8891 l
0.1939 0.8893 l
0.1955 0.8894 l
0.1971 0.8895 l
0.1986 0.8897 l
0.2002 0.8898 l
0.2018 0.8899 l
0.2033 0.8900 l
0.2049 0.8901 l
0.2065 0.8901 l
0.2080 0.8902 l
0.2096 0.8902 l
0.2112 0.8903 l
0.2127 0.8903 l
0.2143 0.8904 l
0.2159 0.8904 l
0.2175 0.8904 l
0.2190 0.8905 l
0.2206 0.8905 l
0.2222 0.8905 l
0.2237 0.8905 l
0.2253 0.8905 l
0.2269 0.8905 l
0.2284 0.8905 l
0.2300 0.8905 l
0.2316 0.8905 l
0.2331 0.8905 l
0.2347 0.8905 l
0.2363 0.8905 l
0.2378 0.8905 l
0.2394 0.8905 l
0.2410 0.8904 l
0.2425 0.8904 l
0.2441 0.8904 l
0.2457 0.8903 l
0.2473 0.8903 l
0.2488 0.8902 l
0.2504 0.8902 l
0.2520 0.8901 l
0.2535 0.8900 l
0.2551 0.8899 l
0.2567 0.8893 l
0.2582 0.8889 l
0.2598 0.8886 l
0.2614 0.8884 l
0.2629 0.8882 l
0.2645 0.8881 l
0.2661 0.8880 l
0.2676 0.8879 l
0.2692 0.8878 l
0.2708 0.8878 l
0.2724 0.8877 l
0.2739 0.8877 l
0.2755 0.8877 l
0.2771 0.8877 l
0.2786 0.8877 l
0.2802 0.8877 l
0.2818 0.8876 l
0.2833 0.8876 l
0.2849 0.8875 l
0.2865 0.8875 l
0.2880 0.8874 l
0.2896 0.8874 l
0.2912 0.8873 l
0.2927 0.8872 l
0.2943 0.8871 l
0.2959 0.8871 l
0.2975 0.8870 l
0.2990 0.8869 l
0.3006 0.8868 l
0.3022 0.8867 l
0.3037 0.8867 l
0.3053 0.8866 l
0.3069 0.8866 l
0.3084 0.8865 l
0.3100 0.8864 l
0.3116 0.8864 l
0.3131 0.8863 l
0.3147 0.8863 l
0.3163 0.8863 l
0.3178 0.8862 l
0.3194 0.8862 l
0.3210 0.8861 l
0.3225 0.8861 l
0.3241 0.8860 l
0.3257 0.8860 l
0.3273 0.8859 l
0.3288 0.8859 l
0.3304 0.8859 l
0.3320 0.8858 l
0.3335 0.8858 l
0.3351 0.8857 l
0.3367 0.8857 l
0.3382 0.8856 l
0.3398 0.8856 l
0.3414 0.8855 l
0.3429 0.8855 l
0.3445 0.8854 l
0.3461 0.8854 l
0.3476 0.8853 l
0.3492 0.8853 l
0.3508 0.8852 l
0.3524 0.8852 l
0.3539 0.8851 l
0.3555 0.8851 l
0.3571 0.8850 l
0.3586 0.8850 l
0.3602 0.8849 l
0.3618 0.8849 l
0.3633 0.8848 l
0.3649 0.8848 l
0.3665 0.8847 l
0.3680 0.8847 l
0.3696 0.8847 l
0.3712 0.8846 l
0.3727 0.8846 l
0.3743 0.8845 l
0.3759 0.8845 l
0.3775 0.8844 l
0.3790 0.8843 l
0.3806 0.8842 l
0.3822 0.8841 l
0.3837 0.8840 l
0.3853 0.8839 l
0.3869 0.8838 l
0.3884 0.8836 l
0.3900 0.8835 l
0.3916 0.8834 l
0.3931 0.8832 l
0.3947 0.8831 l
0.3963 0.8829 l
0.3978 0.8818 l
0.3994 0.8812 l
0.4010 0.8807 l
0.4025 0.8802 l
0.4041 0.8798 l
0.4057 0.8795 l
0.4073 0.8792 l
0.4088 0.8789 l
0.4104 0.8786 l
0.4120 0.8783 l
0.4135 0.8781 l
0.4151 0.8778 l
0.4167 0.8776 l
0.4182 0.8773 l
0.4198 0.8771 l
0.4214 0.8769 l
0.4229 0.8767 l
0.4245 0.8765 l
0.4261 0.8763 l
0.4276 0.8761 l
0.4292 0.8759 l
0.4308 0.8757 l
0.4324 0.8755 l
0.4339 0.8753 l
0.4355 0.8751 l
0.4371 0.8750 l
0.4386 0.8748 l
0.4402 0.8746 l
0.4418 0.8744 l
0.4433 0.8743 l
0.4449 0.8741 l
0.4465 0.8739 l
0.4480 0.8738 l
0.4496 0.8736 l
0.4512 0.8735 l
0.4527 0.8733 l
0.4543 0.8731 l
0.4559 0.8730 l
0.4575 0.8728 l
0.4590 0.8727 l
0.4606 0.8725 l
0.4622 0.8723 l
0.4637 0.8720 l
0.4653 0.8717 l
0.4669 0.8714 l
0.4684 0.8711 l
0.4700 0.8709 l
0.4716 0.8689 l
0.4731 0.8678 l
0.4747 0.8669 l
0.4763 0.8661 l
0.4778 0.8653 l
0.4794 0.8646 l
0.4810 0.8639 l
0.4825 0.8632 l
0.4841 0.8625 l
0.4857 0.8619 l
0.4873 0.8613 l
0.4888 0.8606 l
0.4904 0.8600 l
0.4920 0.8594 l
0.4935 0.8588 l
0.4951 0.8582 l
0.4967 0.8576 l
0.4982 0.8571 l
0.4998 0.8565 l
0.5014 0.8559 l
0.5029 0.8554 l
0.5045 0.8548 l
0.5061 0.8543 l
0.5076 0.8537 l
0.5092 0.8532 l
0.5108 0.8527 l
0.5124 0.8521 l
0.5139 0.8516 l
0.5155 0.8511 l
0.5171 0.8506 l
0.5186 0.8501 l
0.5202 0.8496 l
0.5218 0.8491 l
0.5233 0.8486 l
0.5249 0.8481 l
0.5265 0.8476 l
0.5280 0.8471 l
0.5296 0.8466 l
0.5312 0.8462 l
0.5327 0.8457 l
0.5343 0.8452 l
0.5359 0.8448 l
0.5375 0.8443 l
0.5390 0.8439 l
0.5406 0.8434 l
0.5422 0.8430 l
0.5437 0.8425 l
0.5453 0.8421 l
0.5469 0.8416 l
0.5484 0.8412 l
0.5502 0.8407 l
0.5516 0.8403 l
0.5531 0.8398 l
0.5547 0.8393 l
0.5563 0.8387 l
0.5578 0.8382 l
0.5594 0.8377 l
0.5610 0.8372 l
0.5625 0.8367 l
0.5641 0.8362 l
0.5657 0.8357 l
0.5673 0.8352 l
0.5688 0.8348 l
0.5704 0.8339 l
0.5720 0.8330 l
0.5735 0.8322 l
0.5751 0.8316 l
0.5767 0.8309 l
0.5782 0.8303 l
0.5798 0.8297 l
0.5814 0.8291 l
0.5829 0.8286 l
0.5845 0.8280 l
0.5861 0.8275 l
0.5876 0.8269 l
0.5892 0.8264 l
0.5908 0.8259 l
0.5924 0.8254 l
0.5939 0.8249 l
0.5955 0.8244 l
0.5971 0.8239 l
0.5986 0.8235 l
0.6002 0.8230 l
0.6018 0.8225 l
0.6033 0.8221 l
0.6049 0.8216 l
0.6065 0.8212 l
0.6080 0.8207 l
0.6096 0.8203 l
0.6112 0.8199 l
0.6127 0.8195 l
0.6143 0.8190 l
0.6159 0.8186 l
0.6175 0.8182 l
0.6190 0.8178 l
0.6206 0.8174 l
0.6222 0.8170 l
0.6237 0.8166 l
0.6253 0.8163 l
0.6269 0.8159 l
0.6284 0.8155 l
0.6300 0.8152 l
0.6316 0.8148 l
0.6331 0.8144 l
0.6347 0.8141 l
0.6363 0.8137 l
0.6378 0.8134 l
0.6394 0.8131 l
0.6410 0.8127 l
0.6425 0.8124 l
0.6441 0.8121 l
0.6457 0.8118 l
0.6473 0.8115 l
0.6488 0.8113 l
0.6504 0.8111 l
0.6520 0.8109 l
0.6535 0.8108 l
0.6551 0.8113 l
0.6567 0.8062 l
0.6582 0.8030 l
0.6598 0.8009 l
0.6614 0.7993 l
0.6629 0.7978 l
0.6645 0.7966 l
0.6661 0.7954 l
0.6676 0.7943 l
0.6692 0.7933 l
0.6708 0.7924 l
0.6724 0.7915 l
0.6739 0.7906 l
0.6755 0.7898 l
0.6771 0.7890 l
0.6786 0.7882 l
0.6802 0.7875 l
0.6818 0.7868 l
0.6833 0.7861 l
0.6849 0.7854 l
0.6865 0.7848 l
0.6880 0.7842 l
0.6896 0.7836 l
0.6912 0.7830 l
0.6927 0.7824 l
0.6943 0.7818 l
0.6959 0.7813 l
0.6975 0.7807 l
0.6990 0.7802 l
0.7006 0.7797 l
0.7022 0.7792 l
0.7037 0.7787 l
0.7053 0.7782 l
0.7069 0.7777 l
0.7084 0.7772 l
0.7100 0.7768 l
0.7116 0.7763 l
0.7131 0.7759 l
0.7147 0.7754 l
0.7163 0.7750 l
0.7178 0.7746 l
0.7194 0.7742 l
0.7210 0.7738 l
0.7225 0.7734 l
0.7241 0.7730 l
0.7257 0.7726 l
0.7273 0.7722 l
0.7288 0.7718 l
0.7304 0.7714 l
0.7320 0.7711 l
0.7335 0.7707 l
0.7351 0.7704 l
0.7367 0.7700 l
0.7382 0.7697 l
0.7398 0.7693 l
0.7414 0.7690 l
0.7429 0.7687 l
0.7445 0.7684 l
0.7461 0.7680 l
0.7476 0.7677 l
0.7492 0.7674 l
0.7508 0.7672 l
0.7524 0.7669 l
0.7539 0.7667 l
0.7555 0.7665 l
0.7571 0.7665 l
0.7586 0.7657 l
0.7602 0.7643 l
0.7618 0.7635 l
0.7633 0.7628 l
0.7649 0.7623 l
0.7665 0.7617 l
0.7680 0.7612 l
0.7696 0.7607 l
0.7712 0.7602 l
0.7727 0.7598 l
0.7743 0.7593 l
0.7759 0.7589 l
0.7775 0.7585 l
0.7790 0.7581 l
0.7806 0.7577 l
0.7822 0.7573 l
0.7837 0.7570 l
0.7853 0.7566 l
0.7869 0.7562 l
0.7884 0.7559 l
0.7900 0.7555 l
0.7916 0.7552 l
0.7931 0.7548 l
0.7947 0.7545 l
0.7963 0.7542 l
0.7978 0.7539 l
0.7994 0.7536 l
0.8010 0.7532 l
0.8025 0.7529 l
0.8041 0.7526 l
0.8057 0.7523 l
0.8073 0.7520 l
0.8088 0.7518 l
0.8104 0.7515 l
0.8120 0.7512 l
0.8135 0.7509 l
0.8151 0.7506 l
0.8167 0.7504 l
0.8182 0.7501 l
0.8198 0.7498 l
0.8214 0.7496 l
0.8229 0.7493 l
0.8245 0.7490 l
0.8261 0.7488 l
0.8276 0.7485 l
0.8292 0.7483 l
0.8308 0.7480 l
0.8324 0.7478 l
0.8339 0.7476 l
0.8355 0.7473 l
0.8371 0.7471 l
0.8386 0.7469 l
0.8402 0.7466 l
0.8418 0.7464 l
0.8433 0.7462 l
0.8449 0.7459 l
0.8465 0.7457 l
0.8480 0.7455 l
0.8496 0.7453 l
0.8512 0.7520 l
0.8527 0.7518 l
0.8543 0.7517 l
0.8559 0.7515 l
0.8575 0.7513 l
0.8590 0.7511 l
0.8606 0.7509 l
0.8622 0.7508 l
0.8637 0.7506 l
0.8653 0.7504 l
0.8669 0.7502 l
0.8684 0.7501 l
0.8700 0.7499 l
0.8716 0.7497 l
0.8731 0.7496 l
0.8747 0.7494 l
0.8763 0.7492 l
0.8778 0.7490 l
0.8794 0.7489 l
0.8810 0.7487 l
0.8825 0.7485 l
0.8841 0.7484 l
0.8857 0.7482 l
0.8873 0.7480 l
0.8888 0.7479 l
0.8904 0.7477 l
0.8920 0.7476 l
0.8935 0.7474 l
0.8951 0.7472 l
0.8967 0.7471 l
0.8982 0.7469 l
0.8998 0.7468 l
0.9014 0.7466 l
0.9029 0.7465 l
0.9045 0.7463 l
0.9061 0.7462 l
0.9076 0.7460 l
0.9092 0.7459 l
0.9108 0.7457 l
0.9124 0.7456 l
0.9139 0.7454 l
0.9155 0.7453 l
0.9171 0.7451 l
0.9186 0.7450 l
0.9202 0.7448 l
0.9218 0.7447 l
0.9233 0.7445 l
0.9249 0.7444 l
0.9265 0.7442 l
0.9280 0.7441 l
0.9296 0.7440 l
0.9312 0.7438 l
0.9327 0.7437 l
0.9343 0.7435 l
0.9359 0.7434 l
0.9375 0.7433 l
0.9390 0.7431 l
0.9406 0.7430 l
0.9422 0.7429 l
0.9437 0.7427 l
0.9453 0.7426 l
0.9469 0.7425 l
0.9484 0.7423 l
0.9500 0.7422 l
s
[/DeviceRGB] SCS
Color4 SC
n
0.1500 0.7003 m
0.1516 0.7009 l
0.1531 0.7015 l
0.1547 0.7021 l
0.1563 0.7027 l
0.1578 0.7032 l
0.1594 0.7037 l
0.1610 0.7042 l
0.1625 0.7047 l
0.1641 0.7052 l
0.1657 0.7056 l
0.1673 0.7060 l
0.1688 0.7064 l
0.1704 0.7068 l
0.1720 0.7072 l
0.1735 0.7075 l
0.1751 0.7079 l
0.1767 0.7082 l
0.1782 0.7085 l
0.1798 0.7087 l
0.1814 0.7090 l
0.1829 0.7093 l
0.1845 0.7095 l
0.1861 0.7097 l
0.1876 0.7099 l
0.1892 0.7101 l
0.1908 0.7103 l
0.1924 0.7104 l
0.1939 0.7106 l
0.1955 0.7108 l
0.1971 0.7109 l
0.1986 0.7110 l
0.2002 0.7112 l
0.2018 0.7113 l
0.2033 0.7114 l
0.2049 0.7115 l
0.2065 0.7116 l
0.2080 0.7117 l
0.2096 0.7118 l
0.2112 0.7119 l
0.2127 0.7120 l
0.2143 0.7121 l
0.2159 0.7122 l
0.2175 0.7123 l
0.2190 0.7124 l
0.2206 0.7125 l
0.2222 0.7126 l
0.2237 0.7127 l
0.2253 0.7127 l
0.2269 0.7128 l
0.2284 0.7129 l
0.2300 0.7130 l
0.2316 0.7130 l
0.2331 0.7131 l
0.2347 0.7132 l
0.2363 0.7133 l
0.2378 0.7133 l
0.2394 0.7134 l
0.2410 0.7134 l
0.2425 0.7135 l
0.2441 0.7135 l
0.2457 0.7136 l
0.2473 0.7136 l
0.2488 0.7136 l
0.2504 0.7137 l
0.2520 0.7137 l
0.2535 0.7137 l
0.2551 0.7136 l
0.2567 0.7132 l
0.2582 0.7129 l
0.2598 0.7127 l
0.2614 0.7125 l
0.2629 0.7124 l
0.2645 0.7123 l
0.2661 0.7123 l
0.2676 0.7123 l
0.2692 0.7123 l
0.2708 0.7123 l
0.2724 0.7124 l
0.2739 0.7124 l
0.2755 0.7125 l
0.2771 0.7125 l
0.2786 0.7126 l
0.2802 0.7126 l
0.2818 0.7126 l
0.2833 0.7125 l
0.2849 0.7129 l
0.2865 0.7129 l
0.2880 0.7129 l
0.2896 0.7130 l
0.2912 0.7130 l
0.2927 0.7130 l
0.2943 0.7130 l
0.2959 0.7130 l
0.2975 0.7129 l
0.2990 0.7129 l
0.3006 0.7129 l
0.3022 0.7129 l
0.3037 0.7129 l
0.3053 0.7130 l
0.3069 0.7130 l
0.3084 0.7130 l
0.3100 0.7130 l
0.3116 0.7130 l
0.3131 0.7131 l
0.3147 0.7131 l
0.3163 0.7131 l
0.3178 0.7131 l
0.3194 0.7132 l
0.3210 0.7132 l
0.3225 0.7132 l
0.3241 0.7132 l
0.3257 0.7133 l
0.3273 0.7133 l
0.3288 0.7133 l
0.3304 0.7133 l
0.3320 0.7134 l
0.3335 0.7134 l
0.3351 0.7134 l
0.3367 0.7134 l
0.3382 0.7134 l
0.3398 0.7135 l
0.3414 0.7135 l
0.3429 0.7135 l
0.3445 0.7135 l
0.3461 0.7135 l
0.3476 0.7135 l
0.3492 0.7136 l
0.3508 0.7136 l
0.3524 0.7136 l
0.3539 0.7136 l
0.3555 0.7136 l
0.3571 0.7136 l
0.3586 0.7136 l
0.3602 0.7136 l
0.3618 0.7137 l
0.3633 0.7137 l
0.3649 0.7137 l
0.3665 0.7137 l
0.3680 0.7137 l
0.3696 0.7137 l
0.3712 0.7137 l
0.3727 0.7137 l
0.3743 0.7137 l
0.3759 0.7137 l
0.3775 0.7137 l
0.3790 0.7137 l
0.3806 0.7137 l
0.3822 0.7136 l
0.3837 0.7136 l
0.3853 0.7135 l
0.3869 0.7134 l
0.3884 0.7134 l
0.3900 0.7133 l
0.3916 0.7132 l
0.3931 0.7131 l
0.3947 0.7130 l
0.3963 0.7129 l
0.3978 0.7119 l
0.3994 0.7113 l
0.4010 0.7108 l
0.4025 0.7104 l
0.4041 0.7101 l
0.4057 0.7098 l
0.4073 0.7096 l
0.4088 0.7093 l
0.4104 0.7091 l
0.4120 0.7089 l
0.4135 0.7086 l
0.4151 0.7084 l
0.4167 0.7083 l
0.4182 0.7081 l
0.4198 0.7079 l
0.4214 0.7077 l
0.4229 0.7076 l
0.4245 0.7074 l
0.4261 0.7072 l
0.4276 0.7071 l
0.4292 0.7070 l
0.4308 0.7068 l
0.4324 0.7067 l
0.4339 0.7065 l
0.4355 0.7064 l
0.4371 0.7063 l
0.4386 0.7061 l
0.4402 0.7060 l
0.4418 0.7059 l
0.4433 0.7057 l
0.4449 0.7056 l
0.4465 0.7055 l
0.4480 0.7054 l
0.4496 0.7053 l
0.4512 0.7051 l
0.4527 0.7050 l
0.4543 0.7049 l
0.4559 0.7048 l
0.4575 0.7047 l
0.4590 0.7045 l
0.4606 0.7044 l
0.4622 0.7042 l
0.4637 0.7039 l
0.4653 0.7037 l
0.4669 0.7034 l
0.4684 0.7031 l
0.4700 0.7026 l
0.4716 0.7012 l
0.4731 0.7001 l
0.4747 0.6993 l
0.4763 0.6985 l
0.4778 0.6978 l
0.4794 0.6971 l
0.4810 0.6965 l
0.4825 0.6958 l
0.4841 0.6952 l
0.4857 0.6946 l
0.4873 0.6940 l
0.4888 0.6934 l
0.4904 0.6929 l
0.4920 0.6923 l
0.4935 0.6917 l
0.4951 0.6912 l
0.4967 0.6907 l
0.4982 0.6901 l
0.4998 0.6896 l
0.5014 0.6891 l
0.5029 0.6886 l
0.5045 0.6880 l
0.5061 0.6875 l
0.5076 0.6870 l
0.5092 0.6865 l
0.5108 0.6860 l
0.5124 0.6856 l
0.5139 0.6851 l
0.5155 0.6846 l
0.5171 0.6841 l
0.5186 0.6837 l
0.5202 0.6832 l
0.5218 0.6827 l
0.5233 0.6823 l
0.5249 0.6818 l
0.5265 0.6814 l
0.5280 0.6809 l
0.5296 0.6805 l
0.5312 0.6801 l
0.5327 0.6796 l
0.5343 0.6792 l
0.5359 0.6788 l
0.5375 0.6784 l
0.5390 0.6779 l
0.5406 0.6775 l
0.5422 0.6771 l
0.5437 0.6767 l
0.5453 0.6763 l
0.5469 0.6759 l
0.5484 0.6755 l
0.5502 0.6750 l
0.5516 0.6746 l
0.5531 0.6741 l
0.5547 0.6737 l
0.5563 0.6732 l
0.5578 0.6727 l
0.5594 0.6722 l
0.5610 0.6718 l
0.5625 0.6713 l
0.5641 0.6708 l
0.5657 0.6703 l
0.5673 0.6699 l
0.5688 0.6694 l
0.5704 0.6687 l
0.5720 0.6678 l
0.5735 0.6671 l
0.5751 0.6665 l
0.5767 0.6659 l
0.5782 0.6653 l
0.5798 0.6648 l
0.5814 0.6642 l
0.5829 0.6637 l
0.5845 0.6632 l
0.5861 0.6627 l
0.5876 0.6622 l
0.5892 0.6617 l
0.5908 0.6612 l
0.5924 0.6607 l
0.5939 0.6602 l
0.5955 0.6598 l
0.5971 0.6593 l
0.5986 0.6589 l
0.6002 0.6584 l
0.6018 0.6580 l
0.6033 0.6576 l
0.6049 0.6572 l
0.6065 0.6567 l
0.6080 0.6563 l
0.6096 0.6559 l
0.6112 0.6555 l
0.6127 0.6551 l
0.6143 0.6547 l
0.6159 0.6543 l
0.6175 0.6539 l
0.6190 0.6536 l
0.6206 0.6532 l
0.6222 0.6528 l
0.6237 0.6525 l
0.6253 0.6521 l
0.6269 0.6517 l
0.6284 0.6514 l
0.6300 0.6510 l
0.6316 0.6507 l
0.6331 0.6503 l
0.6347 0.6500 l
0.6363 0.6496 l
0.6378 0.6493 l
0.6394 0.6490 l
0.6410 0.6486 l
0.6425 0.6483 l
0.6441 0.6480 l
0.6457 0.6476 l
0.6473 0.6473 l
0.6488 0.6470 l
0.6504 0.6466 l
0.6520 0.6462 l
0.6535 0.6458 l
0.6551 0.6450 l
0.6567 0.6430 l
0.6582 0.6399 l
0.6598 0.6379 l
0.6614 0.6363 l
0.6629 0.6349 l
0.6645 0.6337 l
0.6661 0.6325 l
0.6676 0.6315 l
0.6692 0.6305 l
0.6708 0.6296 l
0.6724 0.6287 l
0.6739 0.6279 l
0.6755 0.6271 l
0.6771 0.6263 l
0.6786 0.6256 l
0.6802 0.6249 l
0.6818 0.6242 l
0.6833 0.6236 l
0.6849 0.6229 l
0.6865 0.6223 l
0.6880 0.6217 l
0.6896 0.6211 l
0.6912 0.6206 l
0.6927 0.6200 l
0.6943 0.6195 l
0.6959 0.6190 l
0.6975 0.6184 l
0.6990 0.6179 l
0.7006 0.6175 l
0.7022 0.6170 l
0.7037 0.6165 l
0.7053 0.6160 l
0.7069 0.6156 l
0.7084 0.6151 l
0.7100 0.6147 l
0.7116 0.6143 l
0.7131 0.6139 l
0.7147 0.6135 l
0.7163 0.6131 l
0.7178 0.6127 l
0.7194 0.6123 l
0.7210 0.6119 l
0.7225 0.6115 l
0.7241 0.6111 l
0.7257 0.6108 l
0.7273 0.6104 l
0.7288 0.6100 l
0.7304 0.6097 l
0.7320 0.6093 l
0.7335 0.6090 l
0.7351 0.6087 l
0.7367 0.6083 l
0.7382 0.6080 l
0.7398 0.6077 l
0.7414 0.6074 l
0.7429 0.6070 l
0.7445 0.6067 l
0.7461 0.6064 l
0.7476 0.6061 l
0.7492 0.6058 l
0.7508 0.6055 l
0.7524 0.6052 l
0.7539 0.6049 l
0.7555 0.6046 l
0.7571 0.6042 l
0.7586 0.6045 l
0.7602 0.6032 l
0.7618 0.6025 l
0.7633 0.6019 l
0.7649 0.6013 l
0.7665 0.6008 l
0.7680 0.6003 l
0.7696 0.5999 l
0.7712 0.5994 l
0.7727 0.5990 l
0.7743 0.5986 l
0.7759 0.5982 l
0.7775 0.5978 l
0.7790 0.5974 l
0.7806 0.5971 l
0.7822 0.5967 l
0.7837 0.5964 l
0.7853 0.5960 l
0.7869 0.5957 l
0.7884 0.5954 l
0.7900 0.5950 l
0.7916 0.5947 l
0.7931 0.5944 l
0.7947 0.5941 l
0.7963 0.5938 l
0.7978 0.5935 l
0.7994 0.5932 l
0.8010 0.5929 l
0.8025 0.5926 l
0.8041 0.5924 l
0.8057 0.5921 l
0.8073 0.5918 l
0.8088 0.5916 l
0.8104 0.5913 l
0.8120 0.5910 l
0.8135 0.5908 l
0.8151 0.5905 l
0.8167 0.5903 l
0.8182 0.5900 l
0.8198 0.5898 l
0.8214 0.5896 l
0.8229 0.5893 l
0.8245 0.5891 l
0.8261 0.5889 l
0.8276 0.5886 l
0.8292 0.5884 l
0.8308 0.5882 l
0.8324 0.5880 l
0.8339 0.5877 l
0.8355 0.5875 l
0.8371 0.5873 l
0.8386 0.5871 l
0.8402 0.5869 l
0.8418 0.5867 l
0.8433 0.5865 l
0.8449 0.5863 l
0.8465 0.5861 l
0.8480 0.5859 l
0.8496 0.5857 l
0.8512 0.5924 l
0.8527 0.5923 l
0.8543 0.5921 l
0.8559 0.5920 l
0.8575 0.5918 l
0.8590 0.5917 l
0.8606 0.5915 l
0.8622 0.5913 l
0.8637 0.5912 l
0.8653 0.5910 l
0.8669 0.5909 l
0.8684 0.5907 l
0.8700 0.5906 l
0.8716 0.5904 l
0.8731 0.5903 l
0.8747 0.5901 l
0.8763 0.5900 l
0.8778 0.5898 l
0.8794 0.5897 l
0.8810 0.5896 l
0.8825 0.5894 l
0.8841 0.5893 l
0.8857 0.5891 l
0.8873 0.5890 l
0.8888 0.5889 l
0.8904 0.5887 l
0.8920 0.5886 l
0.8935 0.5884 l
0.8951 0.5883 l
0.8967 0.5882 l
0.8982 0.5880 l
0.8998 0.5879 l
0.9014 0.5878 l
0.9029 0.5876 l
0.9045 0.5875 l
0.9061 0.5874 l
0.9076 0.5872 l
0.9092 0.5871 l
0.9108 0.5870 l
0.9124 0.5868 l
0.9139 0.5867 l
0.9155 0.5866 l
0.9171 0.5865 l
0.9186 0.5863 l
0.9202 0.5862 l
0.9218 0.5861 l
0.9233 0.5860 l
0.9249 0.5859 l
0.9265 0.5857 l
0.9280 0.5856 l
0.9296 0.5855 l
0.9312 0.5854 l
0.9327 0.5853 l
0.9343 0.5851 l
0.9359 0.5850 l
0.9375 0.5849 l
0.9390 0.5848 l
0.9406 0.5847 l
0.9422 0.5846 l
0.9437 0.5844 l
0.9453 0.5843 l
0.9469 0.5842 l
0.9484 0.5841 l
0.9500 0.5840 l
s
[/DeviceRGB] SCS
Color5 SC
n
0.1500 0.2402 m
0.1516 0.2408 l
0.1531 0.2414 l
0.1547 0.2420 l
0.1563 0.2426 l
0.1578 0.2431 l
0.1594 0.2436 l
0.1610 0.2441 l
0.1625 0.2446 l
0.1641 0.2450 l
0.1657 0.2455 l
0.1673 0.2459 l
0.1688 0.2463 l
0.1704 0.2466 l
0.1720 0.2470 l
0.1735 0.2473 l
0.1751 0.2476 l
0.1767 0.2479 l
0.1782 0.2482 l
0.1798 0.2485 l
0.1814 0.2488 l
0.1829 0.2490 l
0.1845 0.2492 l
0.1861 0.2494 l
0.1876 0.2496 l
0.1892 0.2498 l
0.1908 0.2500 l
0.1924 0.2501 l
0.1939 0.2503 l
0.1955 0.2504 l
0.1971 0.2506 l
0.1986 0.2507 l
0.2002 0.2508 l
0.2018 0.2509 l
0.2033 0.2511 l
0.2049 0.2512 l
0.2065 0.2513 l
0.2080 0.2514 l
0.2096 0.2515 l
0.2112 0.2516 l
0.2127 0.2517 l
0.2143 0.2517 l
0.2159 0.2518 l
0.2175 0.2519 l
0.2190 0.2520 l
0.2206 0.2521 l
0.2222 0.2522 l
0.2237 0.2523 l
0.2253 0.2523 l
0.2269 0.2524 l
0.2284 0.2525 l
0.2300 0.2526 l
0.2316 0.2527 l
0.2331 0.2527 l
0.2347 0.2528 l
0.2363 0.2529 l
0.2378 0.2529 l
0.2394 0.2530 l
0.2410 0.2530 l
0.2425 0.2531 l
0.2441 0.2531 l
0.2457 0.2532 l
0.2473 0.2532 l
0.2488 0.2532 l
0.2504 0.2532 l
0.2520 0.2533 l
0.2535 0.2532 l
0.2551 0.2532 l
0.2567 0.2527 l
0.2582 0.2525 l
0.2598 0.2522 l
0.2614 0.2521 l
0.2629 0.2520 l
0.2645 0.2519 l
0.2661 0.2519 l
0.2676 0.2518 l
0.2692 0.2519 l
0.2708 0.2519 l
0.2724 0.2519 l
0.2739 0.2520 l
0.2755 0.2520 l
0.2771 0.2521 l
0.2786 0.2521 l
0.2802 0.2522 l
0.2818 0.2522 l
0.2833 0.2521 l
0.2849 0.2525 l
0.2865 0.2525 l
0.2880 0.2525 l
0.2896 0.2525 l
0.2912 0.2525 l
0.2927 0.2525 l
0.2943 0.2525 l
0.2959 0.2525 l
0.2975 0.2525 l
0.2990 0.2525 l
0.3006 0.2525 l
0.3022 0.2525 l
0.3037 0.2525 l
0.3053 0.2525 l
0.3069 0.2525 l
0.3084 0.2526 l
0.3100 0.2526 l
0.3116 0.2526 l
0.3131 0.2526 l
0.3147 0.2526 l
0.3163 0.2527 l
0.3178 0.2527 l
0.3194 0.2527 l
0.3210 0.2527 l
0.3225 0.2528 l
0.3241 0.2528 l
0.3257 0.2528 l
0.3273 0.2528 l
0.3288 0.2529 l
0.3304 0.2529 l
0.3320 0.2529 l
0.3335 0.2529 l
0.3351 0.2530 l
0.3367 0.2530 l
0.3382 0.2530 l
0.3398 0.2530 l
0.3414 0.2530 l
0.3429 0.2531 l
0.3445 0.2531 l
0.3461 0.2531 l
0.3476 0.2531 l
0.3492 0.2531 l
0.3508 0.2531 l
0.3524 0.2531 l
0.3539 0.2532 l
0.3555 0.2532 l
0.3571 0.2532 l
0.3586 0.2532 l
0.3602 0.2532 l
0.3618 0.2532 l
0.3633 0.2532 l
0.3649 0.2532 l
0.3665 0.2533 l
0.3680 0.2533 l
0.3696 0.2533 l
0.3712 0.2533 l
0.3727 0.2533 l
0.3743 0.2533 l
0.3759 0.2533 l
0.3775 0.2533 l
0.3790 0.2533 l
0.3806 0.2532 l
0.3822 0.2532 l
0.3837 0.2531 l
0.3853 0.2531 l
0.3869 0.2530 l
0.3884 0.2529 l
0.3900 0.2529 l
0.3916 0.2528 l
0.3931 0.2527 l
0.3947 0.2526 l
0.3963 0.2525 l
0.3978 0.2515 l
0.3994 0.2508 l
0.4010 0.2504 l
0.4025 0.2500 l
0.4041 0.2497 l
0.4057 0.2494 l
0.4073 0.2491 l
0.4088 0.2489 l
0.4104 0.2486 l
0.4120 0.2484 l
0.4135 0.2482 l
0.4151 0.2480 l
0.4167 0.2478 l
0.4182 0.2476 l
0.4198 0.2475 l
0.4214 0.2473 l
0.4229 0.2471 l
0.4245 0.2470 l
0.4261 0.2468 l
0.4276 0.2467 l
0.4292 0.2465 l
0.4308 0.2464 l
0.4324 0.2462 l
0.4339 0.2461 l
0.4355 0.2460 l
0.4371 0.2458 l
0.4386 0.2457 l
0.4402 0.2456 l
0.4418 0.2455 l
0.4433 0.2453 l
0.4449 0.2452 l
0.4465 0.2451 l
0.4480 0.2450 l
0.4496 0.2448 l
0.4512 0.2447 l
0.4527 0.2446 l
0.4543 0.2445 l
0.4559 0.2444 l
0.4575 0.2443 l
0.4590 0.2441 l
0.4606 0.2440 l
0.4622 0.2438 l
0.4637 0.2435 l
0.4653 0.2433 l
0.4669 0.2430 l
0.4684 0.2427 l
0.4700 0.2422 l
0.4716 0.2408 l
0.4731 0.2397 l
0.4747 0.2389 l
0.4763 0.2381 l
0.4778 0.2374 l
0.4794 0.2367 l
0.4810 0.2361 l
0.4825 0.2354 l
0.4841 0.2348 l
0.4857 0.2342 l
0.4873 0.2336 l
0.4888 0.2330 l
0.4904 0.2325 l
0.4920 0.2319 l
0.4935 0.2313 l
0.4951 0.2308 l
0.4967 0.2303 l
0.4982 0.2297 l
0.4998 0.2292 l
0.5014 0.2287 l
0.5029 0.2282 l
0.5045 0.2276 l
0.5061 0.2271 l
0.5076 0.2266 l
0.5092 0.2261 l
0.5108 0.2257 l
0.5124 0.2252 l
0.5139 0.2247 l
0.5155 0.2242 l
0.5171 0.2237 l
0.5186 0.2233 l
0.5202 0.2228 l
0.5218 0.2223 l
0.5233 0.2219 l
0.5249 0.2214 l
0.5265 0.2210 l
0.5280 0.2206 l
0.5296 0.2201 l
0.5312 0.2197 l
0.5327 0.2192 l
0.5343 0.2188 l
0.5359 0.2184 l
0.5375 0.2180 l
0.5390 0.2176 l
0.5406 0.2171 l
0.5422 0.2167 l
0.5437 0.2163 l
0.5453 0.2159 l
0.5469 0.2155 l
0.5484 0.2151 l
0.5502 0.2146 l
0.5516 0.2142 l
0.5531 0.2138 l
0.5547 0.2133 l
0.5563 0.2128 l
0.5578 0.2124 l
0.5594 0.2119 l
0.5610 0.2114 l
0.5625 0.2109 l
0.5641 0.2104 l
0.5657 0.2100 l
0.5673 0.2095 l
0.5688 0.2090 l
0.5704 0.2084 l
0.5720 0.2075 l
0.5735 0.2068 l
0.5751 0.2061 l
0.5767 0.2055 l
0.5782 0.2050 l
0.5798 0.2044 l
0.5814 0.2039 l
0.5829 0.2033 l
0.5845 0.2028 l
0.5861 0.2023 l
0.5876 0.2018 l
0.5892 0.2013 l
0.5908 0.2008 l
0.5924 0.2004 l
0.5939 0.1999 l
0.5955 0.1994 l
0.5971 0.1990 l
0.5986 0.1985 l
0.6002 0.1981 l
0.6018 0.1977 l
0.6033 0.1972 l
0.6049 0.1968 l
0.6065 0.1964 l
0.6080 0.1960 l
0.6096 0.1956 l
0.6112 0.1952 l
0.6127 0.1948 l
0.6143 0.1944 l
0.6159 0.1940 l
0.6175 0.1936 l
0.6190 0.1932 l
0.6206 0.1929 l
0.6222 0.1925 l
0.6237 0.1921 l
0.6253 0.1918 l
0.6269 0.1914 l
0.6284 0.1910 l
0.6300 0.1907 l
0.6316 0.1903 l
0.6331 0.1900 l
0.6347 0.1897 l
0.6363 0.1893 l
0.6378 0.1890 l
0.6394 0.1887 l
0.6410 0.1883 l
0.6425 0.1880 l
0.6441 0.1877 l
0.6457 0.1873 l
0.6473 0.1870 l
0.6488 0.1867 l
0.6504 0.1863 l
0.6520 0.1859 l
0.6535 0.1855 l
0.6551 0.1848 l
0.6567 0.1827 l
0.6582 0.1796 l
0.6598 0.1776 l
0.6614 0.1760 l
0.6629 0.1746 l
0.6645 0.1734 l
0.6661 0.1722 l
0.6676 0.1712 l
0.6692 0.1702 l
0.6708 0.1693 l
0.6724 0.1684 l
0.6739 0.1676 l
0.6755 0.1668 l
0.6771 0.1661 l
0.6786 0.1653 l
0.6802 0.1646 l
0.6818 0.1639 l
0.6833 0.1633 l
0.6849 0.1627 l
0.6865 0.1620 l
0.6880 0.1614 l
0.6896 0.1609 l
0.6912 0.1603 l
0.6927 0.1597 l
0.6943 0.1592 l
0.6959 0.1587 l
0.6975 0.1582 l
0.6990 0.1577 l
0.7006 0.1572 l
0.7022 0.1567 l
0.7037 0.1562 l
0.7053 0.1558 l
0.7069 0.1553 l
0.7084 0.1549 l
0.7100 0.1544 l
0.7116 0.1540 l
0.7131 0.1536 l
0.7147 0.1532 l
0.7163 0.1528 l
0.7178 0.1524 l
0.7194 0.1520 l
0.7210 0.1516 l
0.7225 0.1512 l
0.7241 0.1508 l
0.7257 0.1505 l
0.7273 0.1501 l
0.7282 0.1499 l
s
[/DeviceRGB] SCS
Color6 SC
n
0.1500 0.7020 m
0.1516 0.6980 l
0.1531 0.6939 l
0.1547 0.6898 l
0.1563 0.6855 l
0.1578 0.6812 l
0.1594 0.6767 l
0.1610 0.6721 l
0.1625 0.6675 l
0.1641 0.6627 l
0.1657 0.6578 l
0.1673 0.6529 l
0.1688 0.6478 l
0.1704 0.6426 l
0.1720 0.6373 l
0.1735 0.6319 l
0.1751 0.6265 l
0.1767 0.6209 l
0.1782 0.6152 l
0.1798 0.6094 l
0.1814 0.6035 l
0.1829 0.5976 l
0.1845 0.5916 l
0.1861 0.5855 l
0.1876 0.5793 l
0.1892 0.5731 l
0.1908 0.5669 l
0.1924 0.5607 l
0.1939 0.5545 l
0.1955 0.5484 l
0.1971 0.5423 l
0.1986 0.5363 l
0.2002 0.5304 l
0.2018 0.5246 l
0.2033 0.5190 l
0.2049 0.5135 l
0.2065 0.5083 l
0.2080 0.5034 l
0.2096 0.4987 l
0.2112 0.4943 l
0.2127 0.4902 l
0.2143 0.4865 l
0.2159 0.4830 l
0.2175 0.4800 l
0.2190 0.4773 l
0.2206 0.4751 l
0.2222 0.4732 l
0.2237 0.4717 l
0.2253 0.4706 l
0.2269 0.4700 l
0.2284 0.4698 l
0.2300 0.4700 l
0.2316 0.4707 l
0.2331 0.4718 l
0.2347 0.4734 l
0.2363 0.4755 l
0.2378 0.4780 l
0.2394 0.4810 l
0.2410 0.4846 l
0.2425 0.4886 l
0.2441 0.4931 l
0.2457 0.4982 l
0.2473 0.5037 l
0.2488 0.5099 l
0.2504 0.5165 l
0.2520 0.5238 l
0.2535 0.5316 l
0.2551 0.5400 l
0.2567 0.5770 l
0.2582 0.5935 l
0.2598 0.6048 l
0.2614 0.6128 l
0.2629 0.6185 l
0.2645 0.6227 l
0.2661 0.6257 l
0.2676 0.6278 l
0.2692 0.6293 l
0.2708 0.6303 l
0.2724 0.6309 l
0.2739 0.6312 l
0.2755 0.6312 l
0.2771 0.6310 l
0.2786 0.6306 l
0.2802 0.6300 l
0.2818 0.6294 l
0.2833 0.6283 l
0.2849 0.6278 l
0.2865 0.6270 l
0.2880 0.6261 l
0.2896 0.6251 l
0.2912 0.6242 l
0.2927 0.6232 l
0.2943 0.6221 l
0.2959 0.6210 l
0.2975 0.6199 l
0.2990 0.6188 l
0.3006 0.6177 l
0.3022 0.6166 l
0.3037 0.6155 l
0.3053 0.6144 l
0.3069 0.6133 l
0.3084 0.6122 l
0.3100 0.6111 l
0.3116 0.6100 l
0.3131 0.6089 l
0.3147 0.6079 l
0.3163 0.6068 l
0.3178 0.6057 l
0.3194 0.6047 l
0.3210 0.6036 l
0.3225 0.6026 l
0.3241 0.6015 l
0.3257 0.6005 l
0.3273 0.5995 l
0.3288 0.5984 l
0.3304 0.5974 l
0.3320 0.5964 l
0.3335 0.5954 l
0.3351 0.5944 l
0.3367 0.5934 l
0.3382 0.5925 l
0.3398 0.5915 l
0.3414 0.5905 l
0.3429 0.5896 l
0.3445 0.5886 l
0.3461 0.5877 l
0.3476 0.5867 l
0.3492 0.5858 l
0.3508 0.5849 l
0.3524 0.5840 l
0.3539 0.5831 l
0.3555 0.5822 l
0.3571 0.5813 l
0.3586 0.5804 l
0.3602 0.5795 l
0.3618 0.5786 l
0.3633 0.5778 l
0.3649 0.5769 l
0.3665 0.5760 l
0.3680 0.5752 l
0.3696 0.5743 l
0.3712 0.5735 l
0.3727 0.5727 l
0.3743 0.5718 l
0.3759 0.5710 l
0.3775 0.5702 l
0.3790 0.5693 l
0.3806 0.5685 l
0.3822 0.5676 l
0.3837 0.5668 l
0.3853 0.5659 l
0.3869 0.5650 l
0.3884 0.5642 l
0.3900 0.5633 l
0.3916 0.5625 l
0.3931 0.5616 l
0.3947 0.5607 l
0.3963 0.5599 l
0.3978 0.5581 l
0.3994 0.5567 l
0.4010 0.5555 l
0.4025 0.5544 l
0.4041 0.5533 l
0.4057 0.5522 l
0.4073 0.5512 l
0.4088 0.5502 l
0.4104 0.5493 l
0.4120 0.5483 l
0.4135 0.5474 l
0.4151 0.5465 l
0.4167 0.5455 l
0.4182 0.5446 l
0.4198 0.5437 l
0.4214 0.5429 l
0.4229 0.5420 l
0.4245 0.5411 l
0.4261 0.5403 l
0.4276 0.5394 l
0.4292 0.5385 l
0.4308 0.5377 l
0.4324 0.5369 l
0.4339 0.5360 l
0.4355 0.5352 l
0.4371 0.5344 l
0.4386 0.5335 l
0.4402 0.5327 l
0.4418 0.5319 l
0.4433 0.5311 l
0.4449 0.5303 l
0.4465 0.5295 l
0.4480 0.5287 l
0.4496 0.5279 l
0.4512 0.5271 l
0.4527 0.5263 l
0.4543 0.5255 l
0.4559 0.5247 l
0.4575 0.5239 l
0.4590 0.5231 l
0.4606 0.5222 l
0.4622 0.5213 l
0.4637 0.5204 l
0.4653 0.5195 l
0.4669 0.5185 l
0.4684 0.5174 l
0.4700 0.5162 l
0.4716 0.5140 l
0.4731 0.5123 l
0.4747 0.5108 l
0.4763 0.5095 l
0.4778 0.5081 l
0.4794 0.5069 l
0.4810 0.5056 l
0.4825 0.5043 l
0.4841 0.5031 l
0.4857 0.5019 l
0.4873 0.5007 l
0.4888 0.4995 l
0.4904 0.4983 l
0.4920 0.4971 l
0.4935 0.4960 l
0.4951 0.4948 l
0.4967 0.4936 l
0.4982 0.4925 l
0.4998 0.4913 l
0.5014 0.4902 l
0.5029 0.4890 l
0.5045 0.4879 l
0.5061 0.4868 l
0.5076 0.4856 l
0.5092 0.4845 l
0.5108 0.4834 l
0.5124 0.4822 l
0.5139 0.4811 l
0.5155 0.4800 l
0.5171 0.4788 l
0.5186 0.4777 l
0.5202 0.4766 l
0.5218 0.4754 l
0.5233 0.4743 l
0.5249 0.4732 l
0.5265 0.4720 l
0.5280 0.4709 l
0.5296 0.4697 l
0.5312 0.4685 l
0.5327 0.4673 l
0.5343 0.4662 l
0.5359 0.4650 l
0.5375 0.4638 l
0.5390 0.4626 l
0.5406 0.4615 l
0.5422 0.4603 l
0.5437 0.4591 l
0.5453 0.4580 l
0.5469 0.4568 l
0.5484 0.4557 l
0.5502 0.4544 l
0.5516 0.4533 l
0.5531 0.4521 l
0.5547 0.4508 l
0.5563 0.4496 l
0.5578 0.4484 l
0.5594 0.4471 l
0.5610 0.4459 l
0.5625 0.4446 l
0.5641 0.4434 l
0.5657 0.4421 l
0.5673 0.4408 l
0.5688 0.4394 l
0.5704 0.4376 l
0.5720 0.4361 l
0.5735 0.4347 l
0.5751 0.4334 l
0.5767 0.4321 l
0.5782 0.4308 l
0.5798 0.4295 l
0.5814 0.4283 l
0.5829 0.4270 l
0.5845 0.4258 l
0.5861 0.4246 l
0.5876 0.4234 l
0.5892 0.4222 l
0.5908 0.4210 l
0.5924 0.4198 l
0.5939 0.4186 l
0.5955 0.4174 l
0.5971 0.4163 l
0.5986 0.4151 l
0.6002 0.4139 l
0.6018 0.4128 l
0.6033 0.4116 l
0.6049 0.4104 l
0.6065 0.4093 l
0.6080 0.4081 l
0.6096 0.4070 l
0.6112 0.4058 l
0.6127 0.4047 l
0.6143 0.4035 l
0.6159 0.4024 l
0.6175 0.4012 l
0.6190 0.4001 l
0.6206 0.3989 l
0.6222 0.3978 l
0.6237 0.3966 l
0.6253 0.3954 l
0.6269 0.3943 l
0.6284 0.3931 l
0.6300 0.3919 l
0.6316 0.3907 l
0.6331 0.3895 l
0.6347 0.3883 l
0.6363 0.3870 l
0.6378 0.3858 l
0.6394 0.3845 l
0.6410 0.3832 l
0.6425 0.3819 l
0.6441 0.3805 l
0.6457 0.3791 l
0.6473 0.3776 l
0.6488 0.3761 l
0.6504 0.3744 l
0.6520 0.3726 l
0.6535 0.3705 l
0.6551 0.3676 l
0.6567 0.3600 l
0.6582 0.3578 l
0.6598 0.3556 l
0.6614 0.3538 l
0.6629 0.3520 l
0.6645 0.3505 l
0.6661 0.3490 l
0.6676 0.3476 l
0.6692 0.3462 l
0.6708 0.3449 l
0.6724 0.3437 l
0.6739 0.3425 l
0.6755 0.3414 l
0.6771 0.3402 l
0.6786 0.3391 l
0.6802 0.3381 l
0.6818 0.3370 l
0.6833 0.3360 l
0.6849 0.3350 l
0.6865 0.3341 l
0.6880 0.3331 l
0.6896 0.3322 l
0.6912 0.3313 l
0.6927 0.3304 l
0.6943 0.3296 l
0.6959 0.3287 l
0.6975 0.3279 l
0.6990 0.3270 l
0.7006 0.3262 l
0.7022 0.3254 l
0.7037 0.3246 l
0.7053 0.3239 l
0.7069 0.3231 l
0.7084 0.3223 l
0.7100 0.3216 l
0.7116 0.3209 l
0.7131 0.3202 l
0.7147 0.3194 l
0.7163 0.3187 l
0.7178 0.3181 l
0.7194 0.3174 l
0.7210 0.3167 l
0.7225 0.3160 l
0.7241 0.3154 l
0.7257 0.3147 l
0.7273 0.3141 l
0.7288 0.3134 l
0.7304 0.3128 l
0.7320 0.3122 l
0.7335 0.3116 l
0.7351 0.3109 l
0.7367 0.3103 l
0.7382 0.3097 l
0.7398 0.3091 l
0.7414 0.3085 l
0.7429 0.3079 l
0.7445 0.3072 l
0.7461 0.3066 l
0.7476 0.3060 l
0.7492 0.3053 l
0.7508 0.3047 l
0.7524 0.3040 l
0.7539 0.3032 l
0.7555 0.3024 l
0.7571 0.3012 l
0.7586 0.2963 l
0.7602 0.2988 l
0.7618 0.2985 l
0.7633 0.2982 l
0.7649 0.2978 l
0.7665 0.2974 l
0.7680 0.2971 l
0.7696 0.2968 l
0.7712 0.2964 l
0.7727 0.2961 l
0.7743 0.2958 l
0.7759 0.2956 l
0.7775 0.2953 l
0.7790 0.2950 l
0.7806 0.2948 l
0.7822 0.2946 l
0.7837 0.2943 l
0.7853 0.2941 l
0.7869 0.2939 l
0.7884 0.2937 l
0.7900 0.2935 l
0.7916 0.2934 l
0.7931 0.2932 l
0.7947 0.2930 l
0.7963 0.2929 l
0.7978 0.2928 l
0.7994 0.2926 l
0.8010 0.2925 l
0.8025 0.2924 l
0.8041 0.2923 l
0.8057 0.2922 l
0.8073 0.2921 l
0.8088 0.2920 l
0.8104 0.2919 l
0.8120 0.2919 l
0.8135 0.2918 l
0.8151 0.2917 l
0.8167 0.2917 l
0.8182 0.2917 l
0.8198 0.2916 l
0.8214 0.2916 l
0.8229 0.2916 l
0.8245 0.2916 l
0.8261 0.2916 l
0.8276 0.2916 l
0.8292 0.2916 l
0.8308 0.2916 l
0.8324 0.2916 l
0.8339 0.2916 l
0.8355 0.2916 l
0.8371 0.2917 l
0.8386 0.2917 l
0.8402 0.2918 l
0.8418 0.2918 l
0.8433 0.2919 l
0.8449 0.2920 l
0.8465 0.2921 l
0.8480 0.2922 l
0.8496 0.2923 l
0.8512 0.2994 l
0.8527 0.2996 l
0.8543 0.2997 l
0.8559 0.2999 l
0.8575 0.3000 l
0.8590 0.3002 l
0.8606 0.3003 l
0.8622 0.3004 l
0.8637 0.3006 l
0.8653 0.3007 l
0.8669 0.3008 l
0.8684 0.3009 l
0.8700 0.3011 l
0.8716 0.3012 l
0.8731 0.3013 l
0.8747 0.3015 l
0.8763 0.3016 l
0.8778 0.3017 l
0.8794 0.3018 l
0.8810 0.3020 l
0.8825 0.3021 l
0.8841 0.3022 l
0.8857 0.3023 l
0.8873 0.3024 l
0.8888 0.3026 l
0.8904 0.3027 l
0.8920 0.3028 l
0.8935 0.3029 l
0.8951 0.3031 l
0.8967 0.3032 l
0.8982 0.3033 l
0.8998 0.3034 l
0.9014 0.3035 l
0.9029 0.3037 l
0.9045 0.3038 l
0.9061 0.3039 l
0.9076 0.3040 l
0.9092 0.3041 l
0.9108 0.3043 l
0.9124 0.3044 l
0.9139 0.3045 l
0.9155 0.3046 l
0.9171 0.3047 l
0.9186 0.3049 l
0.9202 0.3050 l
0.9218 0.3051 l
0.9233 0.3052 l
0.9249 0.3053 l
0.9265 0.3055 l
0.9280 0.3056 l
0.9296 0.3057 l
0.9312 0.3058 l
0.9327 0.3060 l
0.9343 0.3061 l
0.9359 0.3062 l
0.9375 0.3063 l
0.9390 0.3064 l
0.9406 0.3066 l
0.9422 0.3067 l
0.9437 0.3068 l
0.9453 0.3069 l
0.9469 0.3070 l
0.9484 0.3072 l
0.9500 0.3073 l
s
[/DeviceRGB] SCS
Color1 SC
[] 0 SD
0.0015 SLW
n
0.1971 0.1500 m
0.1971 0.1600 l
s
n
0.1971 0.9000 m
0.1971 0.8900 l
s
n
0.2284 0.1500 m
0.2284 0.1600 l
s
n
0.2284 0.9000 m
0.2284 0.8900 l
s
n
0.2598 0.1500 m
0.2598 0.1600 l
s
n
0.2598 0.9000 m
0.2598 0.8900 l
s
n
0.2912 0.1500 m
0.2912 0.1600 l
s
n
0.2912 0.9000 m
0.2912 0.8900 l
s
n
0.3539 0.1500 m
0.3539 0.1600 l
s
n
0.3539 0.9000 m
0.3539 0.8900 l
s
n
0.3853 0.1500 m
0.3853 0.1600 l
s
n
0.3853 0.9000 m
0.3853 0.8900 l
s
n
0.4167 0.1500 m
0.4167 0.1600 l
s
n
0.4167 0.9000 m
0.4167 0.8900 l
s
n
0.4480 0.1500 m
0.4480 0.1600 l
s
n
0.4480 0.9000 m
0.4480 0.8900 l
s
n
0.5108 0.1500 m
0.5108 0.1600 l
s
n
0.5108 0.9000 m
0.5108 0.8900 l
s
n
0.5422 0.1500 m
0.5422 0.1600 l
s
n
0.5422 0.9000 m
0.5422 0.8900 l
s
n
0.5735 0.1500 m
0.5735 0.1600 l
s
n
0.5735 0.9000 m
0.5735 0.8900 l
s
n
0.6049 0.1500 m
0.6049 0.1600 l
s
n
0.6049 0.9000 m
0.6049 0.8900 l
s
n
0.6676 0.1500 m
0.6676 0.1600 l
s
n
0.6676 0.9000 m
0.6676 0.8900 l
s
n
0.6990 0.1500 m
0.6990 0.1600 l
s
n
0.6990 0.9000 m
0.6990 0.8900 l
s
n
0.7304 0.1500 m
0.7304 0.1600 l
s
n
0.7304 0.9000 m
0.7304 0.8900 l
s
n
0.7618 0.1500 m
0.7618 0.1600 l
s
n
0.7618 0.9000 m
0.7618 0.8900 l
s
n
0.8245 0.1500 m
0.8245 0.1600 l
s
n
0.8245 0.9000 m
0.8245 0.8900 l
s
n
0.8559 0.1500 m
0.8559 0.1600 l
s
n
0.8559 0.9000 m
0.8559 0.8900 l
s
n
0.8873 0.1500 m
0.8873 0.1600 l
s
n
0.8873 0.9000 m
0.8873 0.8900 l
s
n
0.9186 0.1500 m
0.9186 0.1600 l
s
n
0.9186 0.9000 m
0.9186 0.8900 l
s
n
0.1657 0.1500 m
0.1657 0.1700 l
s
n
0.1657 0.9000 m
0.1657 0.8800 l
s
n
0.3225 0.1500 m
0.3225 0.1700 l
s
n
0.3225 0.9000 m
0.3225 0.8800 l
s
n
0.4794 0.1500 m
0.4794 0.1700 l
s
n
0.4794 0.9000 m
0.4794 0.8800 l
s
n
0.6363 0.1500 m
0.6363 0.1700 l
s
n
0.6363 0.9000 m
0.6363 0.8800 l
s
n
0.7931 0.1500 m
0.7931 0.1700 l
s
n
0.7931 0.9000 m
0.7931 0.8800 l
s
n
0.9500 0.1500 m
0.9500 0.1700 l
s
n
0.9500 0.9000 m
0.9500 0.8800 l
s
/Helvetica findfont
dup length dict begin
 {1 index /FID ne {def} {pop pop} ifelse} forall
 /Encoding DefEncoding def
 currentdict
end
/Font4 exch definefont pop
/Font4 FFSF
0.1431 0.1200 m
GS
[0.0280 0.0000 0.0000 0.0280 0 0] CC
(100) show
GR
/Font4 FFSF
0.3000 0.1200 m
GS
[0.0280 0.0000 0.0000 0.0280 0 0] CC
(200) show
GR
/Font4 FFSF
0.4569 0.1200 m
GS
[0.0280 0.0000 0.0000 0.0280 0 0] CC
(300) show
GR
/Font4 FFSF
0.6137 0.1200 m
GS
[0.0280 0.0000 0.0000 0.0280 0 0] CC
(400) show
GR
/Font4 FFSF
0.7706 0.1200 m
GS
[0.0280 0.0000 0.0000 0.0280 0 0] CC
(500) show
GR
/Font4 FFSF
0.9275 0.1200 m
GS
[0.0280 0.0000 0.0000 0.0280 0 0] CC
(600) show
GR
/Font4 FFSF
0.4818 0.0845 m
GS
[0.0336 0.0000 0.0000 0.0336 0 0] CC
(M) show
GR
/Font4 FFSF
0.5096 0.0711 m
GS
[0.0238 0.0000 0.0000 0.0238 0 0] CC
(A) show
GR
/Font4 FFSF
0.5253 0.0845 m
GS
[0.0336 0.0000 0.0000 0.0336 0 0] CC
( [GeV]) show
GR
n
0.1500 0.2064 m
0.1600 0.2064 l
s
n
0.9500 0.2064 m
0.9400 0.2064 l
s
n
0.1500 0.2395 m
0.1600 0.2395 l
s
n
0.9500 0.2395 m
0.9400 0.2395 l
s
n
0.1500 0.2629 m
0.1600 0.2629 l
s
n
0.9500 0.2629 m
0.9400 0.2629 l
s
n
0.1500 0.2811 m
0.1600 0.2811 l
s
n
0.9500 0.2811 m
0.9400 0.2811 l
s
n
0.1500 0.2959 m
0.1600 0.2959 l
s
n
0.9500 0.2959 m
0.9400 0.2959 l
s
n
0.1500 0.3085 m
0.1600 0.3085 l
s
n
0.9500 0.3085 m
0.9400 0.3085 l
s
n
0.1500 0.3193 m
0.1600 0.3193 l
s
n
0.9500 0.3193 m
0.9400 0.3193 l
s
n
0.1500 0.3289 m
0.1600 0.3289 l
s
n
0.9500 0.3289 m
0.9400 0.3289 l
s
n
0.1500 0.3375 m
0.1600 0.3375 l
s
n
0.9500 0.3375 m
0.9400 0.3375 l
s
n
0.1500 0.3939 m
0.1600 0.3939 l
s
n
0.9500 0.3939 m
0.9400 0.3939 l
s
n
0.1500 0.4270 m
0.1600 0.4270 l
s
n
0.9500 0.4270 m
0.9400 0.4270 l
s
n
0.1500 0.4504 m
0.1600 0.4504 l
s
n
0.9500 0.4504 m
0.9400 0.4504 l
s
n
0.1500 0.4686 m
0.1600 0.4686 l
s
n
0.9500 0.4686 m
0.9400 0.4686 l
s
n
0.1500 0.4834 m
0.1600 0.4834 l
s
n
0.9500 0.4834 m
0.9400 0.4834 l
s
n
0.1500 0.4960 m
0.1600 0.4960 l
s
n
0.9500 0.4960 m
0.9400 0.4960 l
s
n
0.1500 0.5068 m
0.1600 0.5068 l
s
n
0.9500 0.5068 m
0.9400 0.5068 l
s
n
0.1500 0.5164 m
0.1600 0.5164 l
s
n
0.9500 0.5164 m
0.9400 0.5164 l
s
n
0.1500 0.5250 m
0.1600 0.5250 l
s
n
0.9500 0.5250 m
0.9400 0.5250 l
s
n
0.1500 0.5814 m
0.1600 0.5814 l
s
n
0.9500 0.5814 m
0.9400 0.5814 l
s
n
0.1500 0.6145 m
0.1600 0.6145 l
s
n
0.9500 0.6145 m
0.9400 0.6145 l
s
n
0.1500 0.6379 m
0.1600 0.6379 l
s
n
0.9500 0.6379 m
0.9400 0.6379 l
s
n
0.1500 0.6561 m
0.1600 0.6561 l
s
n
0.9500 0.6561 m
0.9400 0.6561 l
s
n
0.1500 0.6709 m
0.1600 0.6709 l
s
n
0.9500 0.6709 m
0.9400 0.6709 l
s
n
0.1500 0.6835 m
0.1600 0.6835 l
s
n
0.9500 0.6835 m
0.9400 0.6835 l
s
n
0.1500 0.6943 m
0.1600 0.6943 l
s
n
0.9500 0.6943 m
0.9400 0.6943 l
s
n
0.1500 0.7039 m
0.1600 0.7039 l
s
n
0.9500 0.7039 m
0.9400 0.7039 l
s
n
0.1500 0.7125 m
0.1600 0.7125 l
s
n
0.9500 0.7125 m
0.9400 0.7125 l
s
n
0.1500 0.7689 m
0.1600 0.7689 l
s
n
0.9500 0.7689 m
0.9400 0.7689 l
s
n
0.1500 0.8020 m
0.1600 0.8020 l
s
n
0.9500 0.8020 m
0.9400 0.8020 l
s
n
0.1500 0.8254 m
0.1600 0.8254 l
s
n
0.9500 0.8254 m
0.9400 0.8254 l
s
n
0.1500 0.8436 m
0.1600 0.8436 l
s
n
0.9500 0.8436 m
0.9400 0.8436 l
s
n
0.1500 0.8584 m
0.1600 0.8584 l
s
n
0.9500 0.8584 m
0.9400 0.8584 l
s
n
0.1500 0.8710 m
0.1600 0.8710 l
s
n
0.9500 0.8710 m
0.9400 0.8710 l
s
n
0.1500 0.8818 m
0.1600 0.8818 l
s
n
0.9500 0.8818 m
0.9400 0.8818 l
s
n
0.1500 0.8914 m
0.1600 0.8914 l
s
n
0.9500 0.8914 m
0.9400 0.8914 l
s
n
0.1500 0.9000 m
0.1600 0.9000 l
s
n
0.9500 0.9000 m
0.9400 0.9000 l
s
n
0.1500 0.1500 m
0.1700 0.1500 l
s
n
0.9500 0.1500 m
0.9300 0.1500 l
s
n
0.1500 0.3375 m
0.1700 0.3375 l
s
n
0.9500 0.3375 m
0.9300 0.3375 l
s
n
0.1500 0.5250 m
0.1700 0.5250 l
s
n
0.9500 0.5250 m
0.9300 0.5250 l
s
n
0.1500 0.7125 m
0.1700 0.7125 l
s
n
0.9500 0.7125 m
0.9300 0.7125 l
s
n
0.1500 0.9000 m
0.1700 0.9000 l
s
n
0.9500 0.9000 m
0.9300 0.9000 l
s
/Font4 FFSF
0.0922 0.1349 m
GS
[0.0280 0.0000 0.0000 0.0280 0 0] CC
(10) show
GR
/Font4 FFSF
0.1231 0.1517 m
GS
[0.0198 0.0000 0.0000 0.0198 0 0] CC
(-4) show
GR
/Font4 FFSF
0.0922 0.3224 m
GS
[0.0280 0.0000 0.0000 0.0280 0 0] CC
(10) show
GR
/Font4 FFSF
0.1231 0.3392 m
GS
[0.0198 0.0000 0.0000 0.0198 0 0] CC
(-3) show
GR
/Font4 FFSF
0.0922 0.5099 m
GS
[0.0280 0.0000 0.0000 0.0280 0 0] CC
(10) show
GR
/Font4 FFSF
0.1231 0.5267 m
GS
[0.0198 0.0000 0.0000 0.0198 0 0] CC
(-2) show
GR
/Font4 FFSF
0.0957 0.6974 m
GS
[0.0280 0.0000 0.0000 0.0280 0 0] CC
(10) show
GR
/Font4 FFSF
0.1267 0.7142 m
GS
[0.0198 0.0000 0.0000 0.0198 0 0] CC
(-1) show
GR
/Font4 FFSF
0.0988 0.8849 m
GS
[0.0280 0.0000 0.0000 0.0280 0 0] CC
(10) show
GR
/Font4 FFSF
0.1298 0.9017 m
GS
[0.0198 0.0000 0.0000 0.0198 0 0] CC
(0) show
GR
/Font4 FFSF
0.0751 0.4797 m
GS
[0.0000 0.0336 -0.0336 0.0000 0 0] CC
(BR\(H\)) show
GR
n
0.1500 0.1500 m
0.1500 0.9000 l
0.9500 0.9000 l
0.9500 0.1500 l
0.1500 0.1500 l
c
s
n
0.7000 0.5500 m
0.7000 0.3037 l
0.9319 0.3037 l
0.9319 0.5500 l
c
[/DeviceRGB] SCS
Color0 SC
fill
[/DeviceRGB] SCS
Color1 SC
n
0.7000 0.5500 m
0.7000 0.3037 l
0.9319 0.3037 l
0.9319 0.5500 l
0.7000 0.5500 l
c
s
/Font4 FFSF
0.7862 0.4935 m
GS
[0.0224 0.0000 0.0000 0.0224 0 0] CC
(BR\(H -> tt\)) show
GR
[/DeviceRGB] SCS
Color2 SC
[] 0 SD
0.0045 SLW
n
0.7122 0.4994 m
0.7722 0.4994 l
s
/Font4 FFSF
[/DeviceRGB] SCS
Color1 SC
0.7862 0.4524 m
GS
[0.0224 0.0000 0.0000 0.0224 0 0] CC
(BR\(H -> bb\)) show
GR
[/DeviceRGB] SCS
Color3 SC
n
0.7122 0.4582 m
0.7722 0.4582 l
s
/Font4 FFSF
[/DeviceRGB] SCS
Color1 SC
0.7862 0.4112 m
GS
[0.0224 0.0000 0.0000 0.0224 0 0] CC
(BR\(H -> ) show
GR
/Symbol findfont
/Font12 exch definefont pop
/Font12 FFSF
0.8741 0.4112 m
GS
[0.0224 0.0000 0.0000 0.0224 0 0] CC
(tt) show
GR
/Font4 FFSF
0.8937 0.4112 m
GS
[0.0224 0.0000 0.0000 0.0224 0 0] CC
(\)) show
GR
[/DeviceRGB] SCS
Color4 SC
n
0.7122 0.4171 m
0.7722 0.4171 l
s
/Font4 FFSF
[/DeviceRGB] SCS
Color1 SC
0.7862 0.3700 m
GS
[0.0224 0.0000 0.0000 0.0224 0 0] CC
(BR\(H -> ) show
GR
/Font12 FFSF
0.8741 0.3700 m
GS
[0.0224 0.0000 0.0000 0.0224 0 0] CC
(mm) show
GR
/Font4 FFSF
0.9000 0.3700 m
GS
[0.0224 0.0000 0.0000 0.0224 0 0] CC
(\)) show
GR
[/DeviceRGB] SCS
Color5 SC
n
0.7122 0.3757 m
0.7722 0.3757 l
s
/Font4 FFSF
[/DeviceRGB] SCS
Color1 SC
0.7862 0.3284 m
GS
[0.0224 0.0000 0.0000 0.0224 0 0] CC
(BR\(H -> WW\)) show
GR
[/DeviceRGB] SCS
Color6 SC
n
0.7122 0.3343 m
0.7722 0.3343 l
s
/Font4 FFSF
[/DeviceRGB] SCS
Color1 SC
0.9700 0.7000 m
GS
[0.0000 0.0168 -0.0168 0.0000 0 0] CC
(LHC Higgs XS WG 2013) show
GR
/Font4 FFSF
0.7150 0.5250 m
GS
[0.0224 0.0000 0.0000 0.0224 0 0] CC
(m) show
GR
/Font4 FFSF
0.7338 0.5160 m
GS
[0.0158 0.0000 0.0000 0.0158 0 0] CC
(h) show
GR
/Font4 FFSF
0.7425 0.5384 m
GS
[0.0158 0.0000 0.0000 0.0158 0 0] CC
(mod-) show
GR
/Font4 FFSF
0.7785 0.5250 m
GS
[0.0224 0.0000 0.0000 0.0224 0 0] CC
(, tan) show
GR
/Font12 FFSF
0.8221 0.5250 m
GS
[0.0224 0.0000 0.0000 0.0224 0 0] CC
(b) show
GR
/Font4 FFSF
0.8342 0.5250 m
GS
[0.0224 0.0000 0.0000 0.0224 0 0] CC
( = 10) show
GR
%%Trailer
%%BoundingBox: 30 42 597 562
%%DocumentNeededResources: font Helvetica
%%+ font Symbol
%%EOF
