%!PS-Adobe-2.0 EPSF-2.0
%%BoundingBox:  0 0 567 544
%%Title: HWW_900_Mt_reweighting_cut_YR3.eps: HWW 900Gev Mt reweighting for interference with cuts
%%Creator: ROOT Version 5.34/05
%%CreationDate: Fri Jun 14 04:49:37 2013
%%EndComments
%%BeginProlog
80 dict begin
/s {stroke} def /l {lineto} def /m {moveto} def /t {translate} def
/r {rotate} def /rl {roll}  def /R {repeat} def
/d {rlineto} def /rm {rmoveto} def /gr {grestore} def /f {eofill} def
/c {setrgbcolor} def /black {0 setgray} def /sd {setdash} def
/cl {closepath} def /sf {scalefont setfont} def /lw {setlinewidth} def
/box {m dup 0 exch d exch 0 d 0 exch neg d cl} def
/NC{systemdict begin initclip end}def/C{NC box clip newpath}def
/bl {box s} def /bf {box f} def /Y { 0 exch d} def /X { 0 d} def 
/K {{pop pop 0 moveto} exch kshow} bind def
/ita {/ang 15 def gsave [1 0 ang dup sin exch cos div 1 0 0] concat} def 
/mp {newpath /y exch def /x exch def} def
/side {[w .77 mul w .23 mul] .385 w mul sd w 0 l currentpoint t -144 r} def
/mr {mp x y w2 0 360 arc} def /m24 {mr s} def /m20 {mr f} def
/mb {mp x y w2 add m w2 neg 0 d 0 w neg d w 0 d 0 w d cl} def
/mt {mp x y w2 add m w2 neg w neg d w 0 d cl} def
/m21 {mb f} def /m25 {mb s} def /m22 {mt f} def /m26{mt s} def
/m23 {mp x y w2 sub m w2 w d w neg 0 d cl f} def
/m27 {mp x y w2 add m w3 neg w2 neg d w3 w2 neg d w3 w2 d cl s} def
/m28 {mp x w2 sub y w2 sub w3 add m w3 0 d  0 w3 neg d w3 0 d 0 w3 d w3 0 d  0 w3 d w3 neg 0 d 0 w3 d w3 neg 0 d 0 w3 neg d w3 neg 0 d cl s } def
/m29 {mp gsave x w2 sub y w2 add w3 sub m currentpoint t 4 {side} repeat cl fill gr} def
/m30 {mp gsave x w2 sub y w2 add w3 sub m currentpoint t 4 {side} repeat cl s gr} def
/m31 {mp x y w2 sub m 0 w d x w2 sub y m w 0 d x w2 sub y w2 add m w w neg d x w2 sub y w2 sub m w w d s} def
/m32 {mp x y w2 sub m w2 w d w neg 0 d cl s} def
/m33 {mp x y w2 add m w3 neg w2 neg d w3 w2 neg d w3 w2 d cl f} def
/m34 {mp x w2 sub y w2 sub w3 add m w3 0 d  0 w3 neg d w3 0 d 0 w3 d w3 0 d  0 w3 d w3 neg 0 d 0 w3 d w3 neg 0 d 0 w3 neg d w3 neg 0 d cl f } def
/m2 {mp x y w2 sub m 0 w d x w2 sub y m w 0 d s} def
/m5 {mp x w2 sub y w2 sub m w w d x w2 sub y w2 add m w w neg d s} def
/reEncode {exch findfont dup length dict begin {1 index /FID eq  {pop pop} {def} ifelse } forall /Encoding exch def currentdict end dup /FontName get exch definefont pop } def [/Times-Bold /Times-Italic /Times-BoldItalic /Helvetica /Helvetica-Oblique
 /Helvetica-Bold /Helvetica-BoldOblique /Courier /Courier-Oblique /Courier-Bold /Courier-BoldOblique /Times-Roman /AvantGarde-Book /AvantGarde-BookOblique /AvantGarde-Demi /AvantGarde-DemiOblique /Bookman-Demi /Bookman-DemiItalic /Bookman-Light
 /Bookman-LightItalic /Helvetica-Narrow /Helvetica-Narrow-Bold /Helvetica-Narrow-BoldOblique /Helvetica-Narrow-Oblique /NewCenturySchlbk-Roman /NewCenturySchlbk-Bold /NewCenturySchlbk-BoldItalic /NewCenturySchlbk-Italic /Palatino-Bold
 /Palatino-BoldItalic /Palatino-Italic /Palatino-Roman ] {ISOLatin1Encoding reEncode } forall
%%EndProlog
%%BeginSetup
%%EndSetup
newpath  gsave  .25 .25 scale  gsave  0 0 t black[  ] 0 sd 3 lw 1 1 1 c 2268 2177 0 0 bf black 1 1 1 c 2268 1568 0 609 bf black 1 1 1 c 1814 1411 227 609 bf black 1814 1411 227 609 bl 0 0 1 c 1 1 1 c 0 0 1 c 227 676 m 132 X 1 Y 6 X 15 Y 7 X 27 Y 7 X
 36 Y 6 X 36 Y 7 X 44 Y 6 X 43 Y 7 X 59 Y 6 X 50 Y 7 X 65 Y 7 X 55 Y 6 X 61 Y 7 X 80 Y 6 X 61 Y 7 X 75 Y 7 X 43 Y 6 X 58 Y 7 X 54 Y 6 X 14 Y 7 X 29 Y 7 X -11 Y 6 X 18 Y 7 X 14 Y 6 X 18 Y 7 X 13 Y 7 X 4 Y 6 X 31 Y 7 X 12 Y 6 X 21 Y 7 X -5 Y 13 X 44 Y
 7 X 35 Y 6 X -24 Y 7 X 33 Y 7 X 2 Y 6 X 9 Y 7 X 22 Y 6 X 19 Y 7 X 10 Y 7 X 15 Y 6 X 13 Y 7 X 4 Y 6 X 26 Y 7 X -12 Y 7 X 7 Y 6 X 14 Y 7 X 18 Y 6 X 15 Y 7 X -16 Y 7 X 6 Y 6 X 13 Y 7 X 3 Y 6 X -12 Y 7 X -11 Y 7 X 6 Y 6 X -14 Y 7 X -4 Y 6 X -17 Y 7 X 19
 Y 7 X -14 Y 6 X -14 Y 7 X -10 Y 6 X -14 Y 7 X 2 Y 7 X -4 Y 6 X -26 Y 7 X 1 Y 6 X -29 Y 7 X -7 Y 7 X -8 Y 6 X -21 Y 7 X -11 Y 6 X -24 Y 7 X 3 Y 6 X -21 Y 7 X -8 Y 7 X -5 Y 6 X -30 Y 7 X -10 Y 6 X -18 Y 7 X -7 Y 7 X -8 Y 6 X -17 Y 7 X -14 Y 6 X -13 Y
 7 X -20 Y 7 X 3 Y 6 X -31 Y 7 X -7 Y 6 X -20 Y 7 X -19 Y 7 X -2 Y 6 X -14 Y 7 X -28 Y 6 X -3 Y 7 X -14 Y 7 X -17 Y 6 X -16 Y 7 X -17 Y 6 X -9 Y 7 X -9 Y 7 X -15 Y 6 X -18 Y 7 X -12 Y 6 X -10 Y 7 X -21 Y 7 X -3 Y 6 X -20 Y 7 X -12 Y 6 X -4 Y 7 X -7 Y
 7 X -27 Y 6 X -3 Y 7 X -9 Y 6 X -17 Y 7 X -17 Y 7 X -5 Y 6 X -24 Y 7 X -11 Y 6 X -3 Y 7 X -13 Y 7 X -15 Y 6 X -17 Y 7 X 2 Y 6 X -19 Y 7 X -12 Y 7 X -2 Y 6 X -22 Y 7 X 4 Y 6 X -17 Y 7 X -13 Y 7 X -12 Y 6 X 1 Y 7 X -11 Y 6 X -18 Y 7 X -16 Y 6 X 2 Y 7
 X -16 Y 7 X 2 Y 6 X -18 Y 7 X -6 Y 6 X -8 Y 7 X -7 Y 7 X -4 Y 6 X -16 Y 7 X -2 Y 6 X -5 Y 7 X -9 Y 7 X -15 Y 6 X 2 Y 7 X -13 Y 6 X -2 Y 7 X -6 Y 7 X -8 Y 6 X -6 Y 7 X -5 Y 6 X -5 Y 7 X -4 Y 7 X -6 Y 6 X -5 Y 7 X -6 Y 6 X -4 Y 7 X -3 Y 7 X -10 Y 6 X
 -1 Y 7 X -7 Y 6 X -2 Y 7 X -4 Y 7 X -2 Y 6 X -6 Y 7 X -1 Y 6 X -7 Y 7 X -3 Y 7 X -6 Y 6 X -1 Y 7 X -3 Y 6 X -2 Y 7 X -3 Y 7 X -3 Y 6 X -2 Y 7 X -1 Y 6 X -3 Y 7 X -3 Y 7 X -2 Y 6 X -1 Y 7 X -2 Y 6 X -1 Y 7 X -3 Y 7 X -1 Y 6 X -2 Y 7 X -2 Y 13 X -3 Y
 7 X -1 Y 6 X -1 Y 7 X -1 Y 13 X -2 Y 7 X -1 Y 13 X -1 Y 6 X -1 Y 13 X -2 Y 7 X -1 Y 26 X -1 Y 14 X -2 Y 6 X 1 Y 7 X -1 Y 6 X -1 Y 7 X 1 Y 7 X -1 Y 33 X -1 Y 13 X 1 Y 6 X -1 Y 20 X -1 Y 27 X -1 Y 6 X 1 Y 20 X -1 Y 13 X 1 Y 13 X -1 Y 27 X -1 Y 6 X 2 Y
 7 X -1 Y 7 X 1 Y 6 X -1 Y 53 X s black 227 609 m 1814 X s 227 647 m -38 Y s 302 628 m -19 Y s 378 628 m -19 Y s 454 628 m -19 Y s 529 647 m -38 Y s 605 628 m -19 Y s 680 628 m -19 Y s 756 628 m -19 Y s 831 647 m -38 Y s 907 628 m -19 Y s 983 628 m
 -19 Y s 1058 628 m -19 Y s 1134 647 m -38 Y s 1209 628 m -19 Y s 1285 628 m -19 Y s 1361 628 m -19 Y s 1436 647 m -38 Y s 1512 628 m -19 Y s 1587 628 m -19 Y s 1663 628 m -19 Y s 1739 647 m -38 Y s 1814 628 m -19 Y s 1890 628 m -19 Y s 1965 628 m
 -19 Y s 2041 647 m -38 Y s 2041 647 m -38 Y s
 gsave  2268 1568 0 609 C 208.919 558.382 t 0 r /Helvetica findfont 49.4479 sf 0 0 m (0) show NC gr 
 gsave  2268 1568 0 609 C 486.211 558.382 t 0 r /Helvetica findfont 49.4479 sf 0 0 m (200) show NC gr 
 gsave  2268 1568 0 609 C 786.294 558.382 t 0 r /Helvetica findfont 49.4479 sf 0 0 m (400) show NC gr 
 gsave  2268 1568 0 609 C 1090.18 558.382 t 0 r /Helvetica findfont 49.4479 sf 0 0 m (600) show NC gr 
 gsave  2268 1568 0 609 C 1394.06 558.382 t 0 r /Helvetica findfont 49.4479 sf 0 0 m (800) show NC gr 
 gsave  2268 1568 0 609 C 1678.95 558.382 t 0 r /Helvetica findfont 49.4479 sf 0 0 m (1000) show NC gr 
 gsave  2268 1568 0 609 C 1982.83 558.382 t 0 r /Helvetica findfont 49.4479 sf 0 0 m (1200) show NC gr  227 609 m 1411 Y s
 gsave  2268 1568 0 609 C 64.5748 1378.86 t 90 r /Helvetica findfont 34.2332 sf 0 0 m (T) show NC gr 
 gsave  2268 1568 0 609 C 45.5822 1295.3 t 90 r /Helvetica findfont 49.4479 sf 0 0 m (/dM) show NC gr 
 gsave  2268 1568 0 609 C 45.5822 1264.91 t 90 r /Symbol findfont 49.4479 sf 0 0 m (s) show NC gr 
 gsave  2268 1568 0 609 C 45.5822 1238.32 t 90 r /Helvetica findfont 49.4479 sf 0 0 m (d) show NC gr  288 676 m -61 X s 257 722 m -30 X s 257 767 m -30 X s 257 812 m -30 X s 288 857 m -61 X s 257 903 m -30 X s 257 948 m -30 X s 257 993 m -30 X s 288
 1038 m -61 X s 257 1084 m -30 X s 257 1129 m -30 X s 257 1174 m -30 X s 288 1219 m -61 X s 257 1265 m -30 X s 257 1310 m -30 X s 257 1355 m -30 X s 288 1400 m -61 X s 257 1446 m -30 X s 257 1491 m -30 X s 257 1536 m -30 X s 288 1581 m -61 X s 257
 1626 m -30 X s 257 1672 m -30 X s 257 1717 m -30 X s 288 1762 m -61 X s 257 1807 m -30 X s 257 1853 m -30 X s 257 1898 m -30 X s 288 1943 m -61 X s 288 676 m -61 X s 257 631 m -30 X s 288 1943 m -61 X s 257 1988 m -30 X s
 gsave  2268 1568 0 609 C 186.127 660.943 t 0 r /Helvetica findfont 49.4479 sf 0 0 m (0) show NC gr 
 gsave  2268 1568 0 609 C 60.7763 839.473 t 0 r /Helvetica findfont 49.4479 sf 0 0 m (0.0002) show NC gr 
 gsave  2268 1568 0 609 C 60.7763 1021.8 t 0 r /Helvetica findfont 49.4479 sf 0 0 m (0.0004) show NC gr 
 gsave  2268 1568 0 609 C 60.7763 1200.33 t 0 r /Helvetica findfont 49.4479 sf 0 0 m (0.0006) show NC gr 
 gsave  2268 1568 0 609 C 60.7763 1382.66 t 0 r /Helvetica findfont 49.4479 sf 0 0 m (0.0008) show NC gr 
 gsave  2268 1568 0 609 C 98.7615 1564.99 t 0 r /Helvetica findfont 49.4479 sf 0 0 m (0.001) show NC gr 
 gsave  2268 1568 0 609 C 60.7763 1743.52 t 0 r /Helvetica findfont 49.4479 sf 0 0 m (0.0012) show NC gr 
 gsave  2268 1568 0 609 C 60.7763 1925.85 t 0 r /Helvetica findfont 49.4479 sf 0 0 m (0.0014) show NC gr  0 0 1 c /w 2 def /w2 {w 2 div} def /w3 {w 3 div} def 230 676 m20 237 676 m20 243 676 m20 250 676 m20 256 676 m20 263 676 m20 270 676 m20 276 676
 m20 283 676 m20 289 676 m20 296 676 m20 303 676 m20 309 676 m20 316 676 m20 322 676 m20 329 676 m20 336 676 m20 342 676 m20 349 676 m20 355 676 m20 362 677 m20 369 692 m20 375 719 m20 382 755 m20 388 791 m20 395 835 m20 402 878 m20 408 937 m20 415
 987 m20 421 1052 m20 428 1107 m20 435 1168 m20 441 1248 m20 448 1309 m20 454 1384 m20 461 1427 m20 468 1485 m20 474 1539 m20 481 1553 m20 487 1582 m20 494 1571 m20 501 1589 m20 507 1603 m20 514 1621 m20 520 1634 m20 527 1638 m20 534 1669 m20 540
 1681 m20 547 1702 m20 553 1697 m20 560 1697 m20 567 1741 m20 573 1776 m20 580 1752 m20 586 1785 m20 593 1787 m20 600 1796 m20 606 1818 m20 613 1837 m20 619 1847 m20 626 1862 m20 632 1875 m20 639 1879 m20 646 1905 m20 652 1893 m20 659 1900 m20 665
 1914 m20 672 1932 m20 679 1947 m20 685 1931 m20 692 1937 m20 698 1950 m20 705 1953 m20 712 1941 m20 718 1930 m20 725 1936 m20 731 1922 m20 738 1918 m20 745 1901 m20 751 1920 m20 758 1906 m20 764 1892 m20 771 1882 m20 778 1868 m20 784 1870 m20 791
 1866 m20 797 1840 m20 804 1841 m20 811 1812 m20 817 1805 m20 824 1797 m20 830 1776 m20 837 1765 m20 844 1741 m20 850 1744 m20 857 1723 m20 863 1715 m20 870 1710 m20 877 1680 m20 883 1670 m20 890 1652 m20 896 1645 m20 903 1637 m20 910 1620 m20 916
 1606 m20 923 1593 m20 929 1573 m20 936 1576 m20 943 1545 m20 949 1538 m20 956 1518 m20 962 1499 m20 969 1497 m20 976 1483 m20 982 1455 m20 989 1452 m20 995 1438 m20 1002 1421 m20 1009 1405 m20 1015 1388 m20 1022 1379 m20 1028 1370 m20 1035 1355 m20
 1042 1337 m20 1048 1325 m20 1055 1315 m20 1061 1294 m20 1068 1291 m20 1074 1271 m20 1081 1259 m20 1088 1255 m20 1094 1248 m20 1101 1221 m20 1107 1218 m20 1114 1209 m20 1121 1192 m20 1127 1175 m20 1134 1170 m20 1140 1146 m20 1147 1135 m20 1154 1132
 m20 1160 1119 m20 1167 1104 m20 1173 1087 m20 1180 1089 m20 1187 1070 m20 1193 1058 m20 1200 1056 m20 1206 1034 m20 1213 1038 m20 1220 1021 m20 1226 1008 m20 1233 996 m20 1239 997 m20 1246 986 m20 1253 968 m20 1259 952 m20 1266 954 m20 1272 938 m20
 1279 940 m20 1286 922 m20 1292 916 m20 1299 908 m20 1305 901 m20 1312 897 m20 1319 881 m20 1325 879 m20 1332 874 m20 1338 865 m20 1345 850 m20 1352 852 m20 1358 839 m20 1365 837 m20 1371 831 m20 1378 823 m20 1385 817 m20 1391 812 m20 1398 807 m20
 1404 803 m20 1411 797 m20 1418 792 m20 1424 786 m20 1431 782 m20 1437 779 m20 1444 769 m20 1451 768 m20 1457 761 m20 1464 759 m20 1470 755 m20 1477 753 m20 1483 747 m20 1490 746 m20 1497 739 m20 1503 736 m20 1510 730 m20 1516 729 m20 1523 726 m20
 1530 724 m20 1536 721 m20 1543 718 m20 1549 716 m20 1556 715 m20 1563 712 m20 1569 709 m20 1576 707 m20 1582 706 m20 1589 704 m20 1596 703 m20 1602 700 m20 1609 699 m20 1615 697 m20 1622 695 m20 1629 695 m20 1635 692 m20 1642 691 m20 1648 690 m20
 1655 689 m20 1662 689 m20 1668 687 m20 1675 686 m20 1681 686 m20 1688 685 m20 1695 684 m20 1701 684 m20 1708 682 m20 1714 681 m20 1721 681 m20 1728 681 m20 1734 681 m20 1741 680 m20 1747 680 m20 1754 678 m20 1761 679 m20 1767 678 m20 1774 677 m20
 1780 678 m20 1787 677 m20 1794 677 m20 1800 677 m20 1807 677 m20 1813 677 m20 1820 676 m20 1827 676 m20 1833 677 m20 1840 676 m20 1846 676 m20 1853 676 m20 1860 675 m20 1866 675 m20 1873 675 m20 1879 675 m20 1886 674 m20 1893 675 m20 1899 675 m20
 1906 675 m20 1912 674 m20 1919 674 m20 1925 675 m20 1932 675 m20 1939 674 m20 1945 674 m20 1952 674 m20 1958 674 m20 1965 673 m20 1972 675 m20 1978 674 m20 1985 675 m20 1991 674 m20 1998 674 m20 2005 674 m20 2011 674 m20 2018 674 m20 2024 674 m20
 2031 674 m20 2038 674 m20 black 0 0 1 c 1 lw << /PatternType 1 /PaintType 2 /TilingType 1 /BBox [ 0 0 100 100 ] /XStep 100 /YStep 100 /PaintProc { begin gsave 0 0 m 100 100 l 0 100 m 100 0 l s gr end } >> [ 0.24 0 0 0.24 0 0 ] makepattern /P13 exch
 def /cs {[/Pattern /DeviceRGB] setcolorspace} def /FA {f [/DeviceRGB] setcolorspace} def cs 0 0 1 P13 setcolor 230 676 m 125 X 7 1 d 7 16 d 6 27 d 7 38 d 6 36 d 7 45 d 7 43 d 6 59 d 7 50 d 6 66 d 7 55 d 7 62 d 6 80 d 7 62 d 6 76 d 7 43 d 7 58 d 6 54
 d 7 14 d 6 30 d 7 -12 d 7 18 d 6 14 d 7 18 d 6 14 d 7 3 d 7 32 d 6 11 d 7 22 d 6 -5 d 7 X 7 44 d 6 35 d 7 -24 d 6 33 d 7 2 d 7 9 d 6 23 d 7 18 d 6 10 d 7 15 d 6 14 d 7 3 d 7 26 d 6 -11 d 7 7 d 6 13 d 7 19 d 7 15 d 6 -16 d 7 5 d 6 14 d 7 2 d 7 -12 d
 6 -11 d 7 6 d 6 -13 d 7 -5 d 7 -16 d 6 18 d 7 -14 d 6 -14 d 7 -10 d 7 -14 d 6 2 d 7 -4 d 6 -26 d 7 1 d 7 -29 d 6 -7 d 7 -8 d 6 -21 d 7 -12 d 7 -24 d 6 3 d 7 -21 d 6 -7 d 7 -6 d 7 -30 d 6 -10 d 7 -18 d 6 -7 d 7 -8 d 7 -17 d 6 -15 d 7 -13 d 6 -20 d 7
 4 d 7 -31 d 6 -8 d 7 -20 d 6 -19 d 7 -2 d 7 -13 d 6 -29 d 7 -3 d 6 -14 d 7 -17 d 7 -16 d 6 -18 d 7 -8 d 6 -9 d 7 -16 d 7 -18 d 6 -12 d 7 -10 d 6 -21 d 7 -3 d 6 -20 d 7 -12 d 7 -4 d 6 -7 d 7 -27 d 6 -3 d 7 -10 d 7 -17 d 6 -17 d 7 -4 d 6 -25 d 7 -11 d
 7 -3 d 6 -13 d 7 -15 d 6 -17 d 7 1 d 7 -18 d 6 -13 d 7 -1 d 6 -23 d 7 5 d 7 -17 d 6 -14 d 7 -12 d 6 1 d 7 -11 d 7 -18 d 6 -16 d 7 2 d 6 -16 d 7 2 d 7 -19 d 6 -5 d 7 -8 d 6 -7 d 7 -5 d 7 -16 d 6 -2 d 7 -5 d 6 -9 d 7 -15 d 7 2 d 6 -13 d 7 -3 d 6 -5 d
 7 -9 d 7 -6 d 6 -5 d 7 -5 d 6 -4 d 7 -6 d 7 -5 d 6 -5 d 7 -5 d 6 -3 d 7 -10 d 7 -1 d 6 -7 d 7 -2 d 6 -4 d 7 -2 d 6 -7 d 7 -1 d 7 -7 d 6 -3 d 7 -5 d 6 -1 d 7 -4 d 7 -2 d 6 -2 d 7 -4 d 6 -2 d 7 -1 d 7 -2 d 6 -4 d 7 -2 d 6 -1 d 7 -2 d 7 -1 d 6 -3 d 7
 -1 d 6 -2 d 7 -2 d 7 X 6 -3 d 7 -1 d 6 -1 d 7 -1 d 7 X 6 -2 d 7 -1 d 6 X 7 -1 d 7 -1 d 6 X 7 -2 d 6 -1 d 14 X 6 -1 d 7 -1 d 6 X 7 -1 d 7 1 d 6 -1 d 7 -1 d 20 X 6 -1 d 13 X 7 -1 d 7 X 6 1 d 7 X 6 -1 d 14 X 6 -1 d 33 X 7 1 d 6 -2 d 7 X 6 1 d 33 X 7 -1
 d 7 1 d 26 X 7 -1 d 6 1 d 27 X -1 Y -60 X -6 1 d -7 -2 d -7 1 d -33 X -6 -1 d -7 1 d -6 1 d -7 X -6 -1 d -7 X -7 1 d -6 -1 d -7 1 d -20 X -6 1 d -7 X -6 -1 d -7 X -7 1 d -13 X -6 1 d -27 X -6 2 d -7 -1 d -7 1 d -6 X -7 1 d -20 X -6 2 d -7 1 d -6 X
 -7 1 d -7 1 d -6 X -7 2 d -6 1 d -7 X -7 2 d -6 X -7 1 d -6 3 d -7 X -7 2 d -6 1 d -7 2 d -6 3 d -7 1 d -7 2 d -6 1 d -7 2 d -6 3 d -7 2 d -7 1 d -6 2 d -7 4 d -6 2 d -7 2 d -7 3 d -6 2 d -7 5 d -6 3 d -7 7 d -7 1 d -6 7 d -7 1 d -6 4 d -7 2 d -6 7
 d -7 1 d -7 9 d -6 4 d -7 4 d -6 6 d -7 5 d -7 6 d -6 3 d -7 5 d -6 5 d -7 6 d -7 8 d -6 6 d -7 2 d -6 13 d -7 -1 d -7 14 d -6 9 d -7 4 d -6 2 d -7 16 d -7 5 d -6 7 d -7 8 d -6 5 d -7 19 d -7 -2 d -6 15 d -7 -2 d -6 16 d -7 18 d -7 10 d -6 X -7 12 d
 -6 13 d -7 17 d -7 -4 d -6 22 d -7 1 d -6 13 d -7 18 d -7 -2 d -6 18 d -7 14 d -6 12 d -7 4 d -7 11 d -6 24 d -7 4 d -6 17 d -7 17 d -7 9 d -6 3 d -7 28 d -6 6 d -7 4 d -7 12 d -6 20 d -7 3 d -6 21 d -7 10 d -6 12 d -7 17 d -7 16 d -6 9 d -7 8 d -6
 17 d -7 16 d -7 17 d -6 14 d -7 3 d -6 28 d -7 14 d -7 1 d -6 19 d -7 21 d -6 7 d -7 31 d -7 -4 d -6 20 d -7 13 d -6 15 d -7 16 d -7 8 d -6 7 d -7 18 d -6 10 d -7 30 d -7 5 d -6 8 d -7 21 d -6 -3 d -7 23 d -7 12 d -6 21 d -7 8 d -6 7 d -7 28 d -7 -1
 d -6 26 d -7 4 d -6 -1 d -7 13 d -7 10 d -6 14 d -7 14 d -6 -19 d -7 17 d -7 4 d -6 14 d -7 -6 d -6 11 d -7 11 d -7 -2 d -6 -14 d -7 -5 d -6 15 d -7 -14 d -7 -19 d -6 -13 d -7 -7 d -6 11 d -7 -26 d -7 -3 d -6 -13 d -7 -15 d -6 -11 d -7 -18 d -6 -22
 d -7 -9 d -7 -2 d -6 -33 d -7 24 d -6 -35 d -7 -44 d -7 1 d -6 5 d -7 -22 d -6 -11 d -7 -31 d -7 -4 d -6 -14 d -7 -18 d -6 -13 d -7 -18 d -7 11 d -6 -29 d -7 -14 d -6 -54 d -7 -57 d -7 -43 d -6 -75 d -7 -61 d -6 -79 d -7 -61 d -7 -55 d -6 -64 d -7
 -50 d -6 -58 d -7 -42 d -7 -44 d -6 -35 d -7 -36 d -6 -26 d -7 -14 d -7 -1 d -125 X FA 3 lw 0.8 0 0 c 1 0 0 c 0.8 0 0 c 227 676 m 145 X 1 Y 13 X 1 Y 7 X 1 Y 6 X 1 Y 7 X 1 Y 6 X 2 Y 7 X 2 Y 7 X 2 Y 6 X 4 Y 7 X 3 Y 6 X 2 Y 7 X 5 Y 7 X 4 Y 6 X 4 Y 7 X
 5 Y 6 X 5 Y 7 X 6 Y 7 X 4 Y 6 X 6 Y 7 X 8 Y 6 X 3 Y 7 X 9 Y 7 X 6 Y 6 X 6 Y 7 X 7 Y 6 X 10 Y 7 X 7 Y 7 X 6 Y 6 X 6 Y 7 X 9 Y 6 X 8 Y 7 X 7 Y 7 X 10 Y 6 X 7 Y 7 X 10 Y 6 X 2 Y 7 X 11 Y 7 X 9 Y 6 X 6 Y 7 X 9 Y 6 X 8 Y 7 X 5 Y 7 X 8 Y 6 X 10 Y 7 X 3 Y
 6 X 9 Y 7 X 5 Y 7 X 7 Y 6 X 10 Y 7 X 9 Y 6 X -3 Y 7 X 10 Y 7 X 11 Y 6 X 4 Y 7 X 6 Y 6 X 11 Y 14 X 6 Y 6 X 8 Y 7 X 6 Y 6 X 4 Y 7 X -1 Y 7 X 4 Y 6 X 6 Y 7 X 2 Y 6 X 12 Y 7 X 8 Y 7 X -1 Y 6 X 2 Y 13 X 4 Y 7 X 3 Y 6 X 1 Y 7 X 1 Y 7 X 8 Y 6 X -4 Y 7 X 6
 Y 6 X 7 Y 7 X -4 Y 7 X 4 Y 6 X 4 Y 7 X -1 Y 6 X -1 Y 7 X -3 Y 7 X 1 Y 6 X -1 Y 7 X 9 Y 6 X -6 Y 7 X 1 Y 7 X 4 Y 6 X -4 Y 7 X -7 Y 6 X 5 Y 7 X -3 Y 7 X -3 Y 6 X 6 Y 7 X -3 Y 6 X -7 Y 7 X 5 Y 7 X -9 Y 6 X 1 Y 7 X -2 Y 6 X -1 Y 7 X -2 Y 7 X -6 Y 6 X 5
 Y 7 X -5 Y 13 X -7 Y 7 X -6 Y 6 X -2 Y 7 X -3 Y 13 X -3 Y 7 X -5 Y 6 X -4 Y 7 X -4 Y 6 X -4 Y 7 X -7 Y 7 X 1 Y 13 X -12 Y 6 X 1 Y 7 X -11 Y 7 X -1 Y 6 X -2 Y 7 X -8 Y 6 X -4 Y 7 X -3 Y 7 X -9 Y 6 X -1 Y 7 X -7 Y 6 X -2 Y 7 X -3 Y 6 X -9 Y 7 X -4 Y 7
 X -5 Y 6 X -5 Y 7 X -8 Y 6 X 1 Y 7 X -11 Y 13 X -2 Y 7 X -6 Y 6 X -5 Y 7 X -6 Y 7 X -4 Y 6 X -2 Y 7 X -9 Y 6 X -6 Y 7 X -3 Y 7 X -8 Y 6 X -1 Y 7 X -4 Y 6 X -5 Y 7 X -3 Y 7 X -3 Y 6 X -9 Y 7 X -2 Y 6 X -8 Y 7 X -1 Y 7 X -5 Y 6 X -2 Y 7 X -6 Y 6 X -3
 Y 7 X -6 Y 7 X -3 Y 6 X -3 Y 7 X -5 Y 6 X -4 Y 7 X -1 Y 7 X -4 Y 6 X -5 Y 7 X -2 Y 6 X -4 Y 7 X -3 Y 7 X -4 Y 6 X -1 Y 7 X -4 Y 6 X -1 Y 7 X -5 Y 7 X -1 Y 6 X -2 Y 7 X -3 Y 6 X -3 Y 7 X -1 Y 7 X -5 Y 6 X -1 Y 7 X -1 Y 6 X -4 Y 7 X -2 Y 7 X -2 Y 6 X
 -2 Y 7 X -2 Y 6 X -2 Y 7 X -1 Y 7 X -3 Y 6 X -1 Y 13 X -2 Y 7 X -2 Y 6 X -2 Y 7 X -1 Y 7 X -1 Y 6 X -1 Y 7 X -3 Y 13 X -1 Y 7 X -1 Y 6 X -1 Y 7 X -1 Y 6 X -1 Y 7 X -2 Y 20 X -2 Y 6 X -1 Y 7 X -1 Y 13 X -2 Y 7 X 1 Y 6 X -1 Y 14 X -2 Y 13 X -2 Y 6 X 1
 Y 7 X -1 Y 7 X 1 Y 6 X -2 Y 7 X -1 Y 20 X -1 Y 6 X -1 Y 20 X -1 Y 7 X -1 Y 19 X 1 Y 7 X -1 Y 7 X -1 Y 19 X -1 Y 20 X -1 Y 20 X s 1 0 0 c 230 676 m20 237 676 m20 243 676 m20 250 676 m20 256 676 m20 263 676 m20 270 676 m20 276 676 m20 283 676 m20 289
 676 m20 296 676 m20 303 676 m20 309 676 m20 316 676 m20 322 676 m20 329 676 m20 336 676 m20 342 676 m20 349 676 m20 355 676 m20 362 676 m20 369 676 m20 375 677 m20 382 677 m20 388 678 m20 395 679 m20 402 680 m20 408 681 m20 415 683 m20 421 685 m20
 428 687 m20 435 691 m20 441 694 m20 448 696 m20 454 701 m20 461 705 m20 468 709 m20 474 714 m20 481 719 m20 487 725 m20 494 729 m20 501 735 m20 507 743 m20 514 746 m20 520 755 m20 527 761 m20 534 767 m20 540 774 m20 547 784 m20 553 791 m20 560 797
 m20 567 803 m20 573 812 m20 580 820 m20 586 827 m20 593 837 m20 600 844 m20 606 854 m20 613 856 m20 619 867 m20 626 876 m20 632 882 m20 639 891 m20 646 899 m20 652 904 m20 659 912 m20 665 922 m20 672 925 m20 679 934 m20 685 939 m20 692 946 m20 698
 956 m20 705 965 m20 712 962 m20 718 972 m20 725 983 m20 731 987 m20 738 993 m20 745 1004 m20 751 1004 m20 758 1010 m20 764 1018 m20 771 1024 m20 778 1028 m20 784 1027 m20 791 1031 m20 797 1037 m20 804 1039 m20 811 1051 m20 817 1059 m20 824 1058 m20
 830 1060 m20 837 1060 m20 844 1064 m20 850 1067 m20 857 1068 m20 863 1069 m20 870 1077 m20 877 1073 m20 883 1079 m20 890 1086 m20 896 1082 m20 903 1086 m20 910 1090 m20 916 1089 m20 923 1088 m20 929 1085 m20 936 1086 m20 943 1085 m20 949 1094 m20
 956 1088 m20 962 1089 m20 969 1093 m20 976 1089 m20 982 1082 m20 989 1087 m20 995 1084 m20 1002 1081 m20 1009 1087 m20 1015 1084 m20 1022 1077 m20 1028 1082 m20 1035 1073 m20 1042 1074 m20 1048 1072 m20 1055 1071 m20 1061 1069 m20 1068 1063 m20 1074
 1068 m20 1081 1063 m20 1088 1063 m20 1094 1056 m20 1101 1050 m20 1107 1048 m20 1114 1045 m20 1121 1045 m20 1127 1042 m20 1134 1037 m20 1140 1033 m20 1147 1029 m20 1154 1025 m20 1160 1018 m20 1167 1019 m20 1173 1019 m20 1180 1007 m20 1187 1008 m20
 1193 997 m20 1200 996 m20 1206 994 m20 1213 986 m20 1220 982 m20 1226 979 m20 1233 970 m20 1239 969 m20 1246 962 m20 1253 960 m20 1259 957 m20 1266 948 m20 1272 944 m20 1279 939 m20 1286 934 m20 1292 926 m20 1299 927 m20 1305 916 m20 1312 916 m20
 1319 914 m20 1325 908 m20 1332 903 m20 1338 897 m20 1345 893 m20 1352 891 m20 1358 882 m20 1365 876 m20 1371 873 m20 1378 865 m20 1385 864 m20 1391 860 m20 1398 855 m20 1404 852 m20 1411 849 m20 1418 840 m20 1424 838 m20 1431 830 m20 1437 829 m20
 1444 824 m20 1451 822 m20 1457 816 m20 1464 813 m20 1470 807 m20 1477 804 m20 1483 801 m20 1490 796 m20 1497 792 m20 1503 791 m20 1510 787 m20 1516 782 m20 1523 780 m20 1530 776 m20 1536 773 m20 1543 769 m20 1549 768 m20 1556 764 m20 1563 763 m20
 1569 758 m20 1576 757 m20 1582 755 m20 1589 752 m20 1596 749 m20 1602 748 m20 1609 743 m20 1615 742 m20 1622 741 m20 1629 737 m20 1635 735 m20 1642 733 m20 1648 731 m20 1655 729 m20 1662 727 m20 1668 726 m20 1675 723 m20 1681 722 m20 1688 722 m20
 1695 720 m20 1701 718 m20 1708 716 m20 1714 715 m20 1721 714 m20 1728 713 m20 1734 710 m20 1741 710 m20 1747 709 m20 1754 708 m20 1761 707 m20 1767 706 m20 1774 705 m20 1780 703 m20 1787 703 m20 1794 703 m20 1800 701 m20 1807 700 m20 1813 699 m20
 1820 699 m20 1827 697 m20 1833 698 m20 1840 697 m20 1846 697 m20 1853 695 m20 1860 695 m20 1866 693 m20 1873 694 m20 1879 693 m20 1886 694 m20 1893 692 m20 1899 691 m20 1906 691 m20 1912 691 m20 1919 690 m20 1925 689 m20 1932 689 m20 1939 689 m20
 1945 688 m20 1952 687 m20 1958 687 m20 1965 687 m20 1972 688 m20 1978 687 m20 1985 686 m20 1991 686 m20 1998 686 m20 2005 685 m20 2011 685 m20 2018 685 m20 2024 684 m20 2031 684 m20 2038 684 m20 0.8 0 0 c black 0.8 0 0 c cs 0.8 0 0 P13 setcolor 230
 676 m 132 X 7 1 d 13 X 6 1 d 7 1 d 7 1 d 6 1 d 7 2 d 6 2 d 7 2 d 7 4 d 6 3 d 7 3 d 6 4 d 7 4 d 7 5 d 6 4 d 7 6 d 6 6 d 7 4 d 7 6 d 6 8 d 7 3 d 6 9 d 7 6 d 7 6 d 6 8 d 7 9 d 6 7 d 7 6 d 7 7 d 6 9 d 7 8 d 6 7 d 7 9 d 7 8 d 6 10 d 7 2 d 6 11 d 7 9 d 6
 6 d 7 9 d 7 8 d 6 5 d 7 8 d 6 11 d 7 2 d 7 9 d 6 5 d 7 7 d 6 11 d 7 8 d 7 -3 d 6 10 d 7 11 d 6 5 d 7 6 d 7 11 d 6 -1 d 7 7 d 6 8 d 7 5 d 7 5 d 6 -1 d 7 4 d 6 6 d 7 2 d 7 12 d 6 7 d 7 X 6 2 d 7 X 7 4 d 6 3 d 7 1 d 6 1 d 7 8 d 7 -4 d 6 6 d 7 7 d 6 -4
 d 7 4 d 7 4 d 6 -1 d 7 -1 d 6 -3 d 7 1 d 7 -1 d 6 9 d 7 -6 d 6 1 d 7 4 d 7 -4 d 6 -7 d 7 5 d 6 -3 d 7 -3 d 7 6 d 6 -3 d 7 -7 d 6 5 d 7 -9 d 7 1 d 6 -2 d 7 -1 d 6 -2 d 7 -7 d 6 6 d 7 -5 d 7 -1 d 6 -6 d 7 -7 d 6 -1 d 7 -3 d 7 -1 d 6 -3 d 7 -4 d 6 -4 d
 7 -4 d 7 -4 d 6 -7 d 7 1 d 6 X 7 -13 d 7 2 d 6 -12 d 7 X 6 -2 d 7 -8 d 7 -5 d 6 -2 d 7 -10 d 6 -1 d 7 -6 d 7 -3 d 6 -3 d 7 -8 d 6 -4 d 7 -6 d 7 -4 d 6 -8 d 7 X 6 -11 d 7 X 7 -2 d 6 -6 d 7 -5 d 6 -6 d 7 -4 d 7 -2 d 6 -9 d 7 -6 d 6 -3 d 7 -8 d 7 -1 d
 6 -4 d 7 -5 d 6 -3 d 7 -4 d 7 -9 d 6 -2 d 7 -8 d 6 -1 d 7 -4 d 7 -3 d 6 -6 d 7 -2 d 6 -7 d 7 -3 d 6 -2 d 7 -6 d 7 -3 d 6 -2 d 7 -3 d 6 -6 d 7 -1 d 7 -5 d 6 -3 d 7 -3 d 6 -1 d 7 -5 d 7 -1 d 6 -4 d 7 -2 d 6 -2 d 7 -3 d 7 -3 d 6 -1 d 7 -5 d 6 -1 d 7 -1
 d 7 -4 d 6 -2 d 7 -2 d 6 -3 d 7 -1 d 7 -2 d 6 -2 d 7 -2 d 6 -2 d 7 1 d 7 -2 d 6 -2 d 7 -2 d 6 -1 d 7 -1 d 7 -1 d 6 -3 d 7 X 6 -1 d 7 -1 d 7 -2 d 6 X 7 -1 d 6 -2 d 7 X 7 -1 d 6 -1 d 7 -1 d 6 -1 d 7 -1 d 7 -1 d 6 1 d 7 -2 d 6 X 7 -1 d 7 X 6 -2 d 7 1 d
 6 -2 d 7 1 d 7 -1 d 6 -2 d 7 X 6 1 d 7 -1 d 6 -2 d 14 X 6 -1 d 27 X 6 -1 d 7 X 6 -1 d 7 X 7 -1 d 6 X 7 1 d 6 -1 d 7 X 7 -1 d -14 X -6 1 d -7 -1 d -6 1 d -7 X -7 1 d -13 X -6 2 d -7 -1 d -20 X -6 2 d -7 -1 d -7 1 d -6 1 d -7 1 d -6 -1 d -7 X -6 2 d
 -7 1 d -7 -1 d -6 2 d -7 -1 d -6 2 d -7 -1 d -7 2 d -6 X -7 2 d -6 -1 d -7 1 d -7 X -6 2 d -7 1 d -6 1 d -7 X -7 1 d -6 2 d -7 1 d -6 X -7 1 d -7 2 d -6 X -7 1 d -6 2 d -7 2 d -7 1 d -6 1 d -7 1 d -6 2 d -7 2 d -7 X -6 1 d -7 3 d -6 1 d -7 3 d -7 1
 d -6 2 d -7 2 d -6 2 d -7 4 d -7 1 d -6 1 d -7 5 d -6 1 d -7 3 d -7 3 d -6 2 d -7 1 d -6 5 d -7 1 d -7 4 d -6 1 d -7 3 d -6 3 d -7 5 d -7 1 d -6 6 d -7 3 d -6 2 d -7 4 d -7 5 d -6 2 d -7 3 d -6 7 d -7 2 d -6 6 d -7 3 d -7 4 d -6 1 d -7 8 d -6 2 d -7
 9 d -7 3 d -6 3 d -7 5 d -6 4 d -7 2 d -7 7 d -6 3 d -7 6 d -6 9 d -7 2 d -7 4 d -6 6 d -7 5 d -6 6 d -7 2 d -7 -1 d -6 12 d -7 -1 d -6 8 d -7 5 d -7 5 d -6 4 d -7 9 d -6 2 d -7 3 d -7 6 d -6 2 d -7 9 d -6 2 d -7 5 d -7 8 d -6 2 d -7 X -6 12 d -7 -2
 d -7 13 d -6 X -7 -2 d -6 7 d -7 5 d -7 3 d -6 4 d -7 5 d -6 3 d -7 X -7 3 d -6 2 d -7 6 d -6 7 d -7 X -7 5 d -6 -5 d -7 6 d -6 2 d -7 1 d -6 2 d -7 -1 d -7 9 d -6 -5 d -7 7 d -6 3 d -7 -6 d -7 3 d -6 3 d -7 -5 d -6 7 d -7 4 d -7 -4 d -6 -1 d -7 6 d
 -6 -9 d -7 1 d -7 -1 d -6 3 d -7 1 d -6 1 d -7 -4 d -7 -4 d -6 4 d -7 -7 d -6 -5 d -7 3 d -7 -8 d -6 X -7 -2 d -6 -3 d -7 -4 d -7 X -6 -2 d -7 1 d -6 -8 d -7 -11 d -7 -2 d -6 -6 d -7 -4 d -6 1 d -7 -5 d -7 -6 d -6 -7 d -7 -7 d -6 X -7 -10 d -7 -6 d
 -6 -5 d -7 -11 d -6 -10 d -7 3 d -7 -8 d -6 -10 d -7 -8 d -6 -5 d -7 -8 d -7 -3 d -6 -10 d -7 -8 d -6 -5 d -7 -8 d -7 -9 d -6 -6 d -7 -8 d -6 -11 d -7 -3 d -6 -10 d -7 -7 d -7 -9 d -6 -7 d -7 -9 d -6 -8 d -7 -7 d -7 -6 d -6 -7 d -7 -9 d -6 -7 d -7
 -6 d -7 -6 d -6 -9 d -7 -3 d -6 -8 d -7 -5 d -7 -5 d -6 -5 d -7 -6 d -6 -4 d -7 -5 d -7 -4 d -6 -4 d -7 -3 d -6 -3 d -7 -3 d -7 -3 d -6 -1 d -7 -2 d -6 -2 d -7 -1 d -7 X -6 -1 d -7 X -6 -1 d -139 X FA 0 0.4 0 c 1 1 1 c 0.35 0.83 0.33 c 0 0.4 0 c 227
 676 m 132 X 1 Y 6 X 10 Y 7 X 19 Y 7 X 39 Y 6 X 22 Y 7 X 39 Y 6 X 25 Y 7 X 35 Y 6 X 62 Y 7 X 82 Y 7 X 10 Y 6 X 144 Y 7 X 23 Y 6 X 19 Y 7 X 9 Y 7 X 130 Y 6 X 5 Y 7 X 8 Y 6 X 62 Y 7 X 14 Y 7 X -36 Y 6 X 4 Y 7 X 33 Y 6 X 2 Y 7 X 22 Y 7 X -32 Y 6 X 53 Y
 7 X 8 Y 6 X 41 Y 7 X -7 Y 7 X 14 Y 6 X 14 Y 7 X 34 Y 6 X 11 Y 7 X 10 Y 7 X 27 Y 6 X 31 Y 7 X 30 Y 6 X -22 Y 7 X 67 Y 7 X -4 Y 6 X -6 Y 7 X 24 Y 6 X 24 Y 7 X 29 Y 7 X -35 Y 6 X 60 Y 7 X -46 Y 6 X 32 Y 7 X -1 Y 7 X 10 Y 6 X 38 Y 7 X 4 Y 6 X -49 Y 7 X
 23 Y 7 X 28 Y 6 X -8 Y 7 X -16 Y 6 X 32 Y 7 X -33 Y 13 X -3 Y 7 X -13 Y 6 X 12 Y 7 X -31 Y 13 X -14 Y 7 X -8 Y 6 X 3 Y 7 X 16 Y 7 X -32 Y 6 X -6 Y 7 X -28 Y 6 X -5 Y 7 X -14 Y 6 X -14 Y 7 X -8 Y 7 X 5 Y 6 X -36 Y 7 X -1 Y 6 X -4 Y 7 X -30 Y 7 X -2 Y
 6 X -7 Y 7 X -17 Y 6 X -20 Y 7 X -18 Y 7 X -11 Y 6 X -17 Y 13 X -16 Y 7 X -15 Y 7 X -9 Y 6 X -14 Y 7 X -29 Y 6 X -13 Y 7 X -6 Y 7 X -19 Y 6 X 2 Y 7 X -20 Y 6 X -25 Y 7 X 2 Y 7 X -21 Y 6 X -11 Y 7 X -16 Y 6 X -6 Y 7 X -15 Y 7 X -22 Y 6 X -1 Y 7 X -18
 Y 6 X -5 Y 7 X -16 Y 7 X -21 Y 6 X -9 Y 7 X -11 Y 6 X -8 Y 7 X -13 Y 7 X -15 Y 6 X -8 Y 7 X -13 Y 6 X -12 Y 7 X -18 Y 7 X -2 Y 6 X -7 Y 7 X -20 Y 6 X -7 Y 7 X -19 Y 7 X -6 Y 6 X -7 Y 7 X -13 Y 6 X -11 Y 7 X -10 Y 7 X -11 Y 6 X -9 Y 7 X -9 Y 6 X -9 Y
 7 X -7 Y 6 X -15 Y 7 X -8 Y 7 X -8 Y 6 X -7 Y 7 X -13 Y 6 X -5 Y 7 X -14 Y 7 X -3 Y 6 X -6 Y 7 X -10 Y 6 X -6 Y 7 X -7 Y 7 X -9 Y 6 X -4 Y 7 X -11 Y 6 X -7 Y 7 X -6 Y 7 X -8 Y 6 X -2 Y 7 X -9 Y 6 X -4 Y 7 X -5 Y 7 X -6 Y 6 X -7 Y 7 X -4 Y 6 X -7 Y 7
 X -5 Y 7 X -4 Y 6 X -4 Y 7 X -4 Y 6 X -5 Y 7 X -4 Y 7 X -4 Y 6 X -3 Y 7 X -5 Y 6 X -4 Y 7 X -2 Y 7 X -4 Y 6 X -4 Y 7 X -2 Y 6 X -4 Y 7 X -1 Y 7 X -3 Y 6 X -3 Y 7 X -3 Y 6 X -1 Y 7 X -2 Y 7 X -3 Y 6 X -1 Y 7 X -3 Y 6 X -2 Y 7 X -1 Y 7 X -2 Y 6 X -2 Y
 13 X -3 Y 7 X -1 Y 7 X -1 Y 6 X -1 Y 7 X -1 Y 6 X -1 Y 7 X -1 Y 7 X -1 Y 6 X -1 Y 7 X -1 Y 6 X -1 Y 13 X -1 Y 7 X -1 Y 13 X -1 Y 13 X -1 Y 14 X -1 Y 19 X -1 Y 20 X -1 Y 33 X -1 Y 60 X -1 Y 125 X 1 Y 7 X -1 Y 6 X 1 Y 20 X s 0.35 0.83 0.33 c 230 676
 m20 237 676 m20 243 676 m20 250 676 m20 256 676 m20 263 676 m20 270 676 m20 276 676 m20 283 676 m20 289 676 m20 296 676 m20 303 676 m20 309 676 m20 316 676 m20 322 676 m20 329 676 m20 336 676 m20 342 676 m20 349 676 m20 355 676 m20 362 677 m20 369
 687 m20 375 706 m20 382 745 m20 388 767 m20 395 806 m20 402 831 m20 408 866 m20 415 928 m20 421 1010 m20 428 1020 m20 435 1164 m20 441 1187 m20 448 1206 m20 454 1215 m20 461 1345 m20 468 1350 m20 474 1358 m20 481 1420 m20 487 1434 m20 494 1398 m20
 501 1402 m20 507 1435 m20 514 1437 m20 520 1459 m20 527 1427 m20 534 1480 m20 540 1488 m20 547 1529 m20 553 1522 m20 560 1536 m20 567 1550 m20 573 1584 m20 580 1595 m20 586 1605 m20 593 1632 m20 600 1663 m20 606 1693 m20 613 1671 m20 619 1738 m20
 626 1734 m20 632 1728 m20 639 1752 m20 646 1776 m20 652 1805 m20 659 1770 m20 665 1830 m20 672 1784 m20 679 1816 m20 685 1815 m20 692 1825 m20 698 1863 m20 705 1867 m20 712 1818 m20 718 1841 m20 725 1869 m20 731 1861 m20 738 1845 m20 745 1877 m20
 751 1844 m20 758 1844 m20 764 1841 m20 771 1828 m20 778 1840 m20 784 1809 m20 791 1809 m20 797 1795 m20 804 1787 m20 811 1790 m20 817 1806 m20 824 1774 m20 830 1768 m20 837 1740 m20 844 1735 m20 850 1721 m20 857 1707 m20 863 1699 m20 870 1704 m20
 877 1668 m20 883 1667 m20 890 1663 m20 896 1633 m20 903 1631 m20 910 1624 m20 916 1607 m20 923 1587 m20 929 1569 m20 936 1558 m20 943 1541 m20 949 1541 m20 956 1525 m20 962 1510 m20 969 1501 m20 976 1487 m20 982 1458 m20 989 1445 m20 995 1439 m20
 1002 1420 m20 1009 1422 m20 1015 1402 m20 1022 1377 m20 1028 1379 m20 1035 1358 m20 1042 1347 m20 1048 1331 m20 1055 1325 m20 1061 1310 m20 1068 1288 m20 1074 1287 m20 1081 1269 m20 1088 1264 m20 1094 1248 m20 1101 1227 m20 1107 1218 m20 1114 1207
 m20 1121 1199 m20 1127 1186 m20 1134 1171 m20 1140 1163 m20 1147 1150 m20 1154 1138 m20 1160 1120 m20 1167 1118 m20 1173 1111 m20 1180 1091 m20 1187 1084 m20 1193 1065 m20 1200 1059 m20 1206 1052 m20 1213 1039 m20 1220 1028 m20 1226 1018 m20 1233
 1007 m20 1239 998 m20 1246 989 m20 1253 980 m20 1259 973 m20 1266 958 m20 1272 950 m20 1279 942 m20 1286 935 m20 1292 922 m20 1299 917 m20 1305 903 m20 1312 900 m20 1319 894 m20 1325 884 m20 1332 878 m20 1338 871 m20 1345 862 m20 1352 858 m20 1358
 847 m20 1365 840 m20 1371 834 m20 1378 826 m20 1385 824 m20 1391 815 m20 1398 811 m20 1404 806 m20 1411 800 m20 1418 793 m20 1424 789 m20 1431 782 m20 1437 777 m20 1444 773 m20 1451 769 m20 1457 765 m20 1464 760 m20 1470 756 m20 1477 752 m20 1483
 749 m20 1490 744 m20 1497 740 m20 1503 738 m20 1510 734 m20 1516 730 m20 1523 728 m20 1530 724 m20 1536 723 m20 1543 720 m20 1549 717 m20 1556 714 m20 1563 713 m20 1569 711 m20 1576 708 m20 1582 707 m20 1589 704 m20 1596 702 m20 1602 701 m20 1609
 699 m20 1615 697 m20 1622 697 m20 1629 694 m20 1635 693 m20 1642 692 m20 1648 691 m20 1655 690 m20 1662 689 m20 1668 688 m20 1675 687 m20 1681 686 m20 1688 685 m20 1695 684 m20 1701 684 m20 1708 683 m20 1714 682 m20 1721 682 m20 1728 681 m20 1734
 681 m20 1741 680 m20 1747 680 m20 1754 679 m20 1761 679 m20 1767 679 m20 1774 678 m20 1780 678 m20 1787 678 m20 1794 677 m20 1800 677 m20 1807 677 m20 1813 677 m20 1820 677 m20 1827 676 m20 1833 676 m20 1840 676 m20 1846 676 m20 1853 676 m20 1860
 676 m20 1866 676 m20 1873 676 m20 1879 676 m20 1886 675 m20 1893 675 m20 1899 675 m20 1906 675 m20 1912 675 m20 1919 675 m20 1925 675 m20 1932 675 m20 1939 675 m20 1945 675 m20 1952 675 m20 1958 675 m20 1965 675 m20 1972 675 m20 1978 675 m20 1985
 675 m20 1991 675 m20 1998 675 m20 2005 675 m20 2011 676 m20 2018 675 m20 2024 676 m20 2031 676 m20 2038 676 m20 0 0.4 0 c black 0 0.4 0 c cs 0 0.4 0 P13 setcolor 230 676 m 125 X 7 1 d 7 13 d 6 22 d 7 43 d 6 21 d 7 42 d 7 26 d 6 36 d 7 65 d 6 86 d 7
 7 d 7 149 d 6 24 d 7 20 d 6 7 d 7 134 d 7 5 d 6 7 d 7 62 d 6 14 d 7 -38 d 7 3 d 6 33 d 7 X 6 22 d 7 -34 d 7 53 d 6 8 d 7 41 d 6 -8 d 7 14 d 7 13 d 6 34 d 7 11 d 6 9 d 7 27 d 7 31 d 6 30 d 7 -22 d 6 67 d 7 -4 d 6 -7 d 7 24 d 7 24 d 6 30 d 7 -37 d 6
 60 d 7 -46 d 7 32 d 6 -1 d 7 9 d 6 39 d 7 3 d 7 -50 d 6 23 d 7 29 d 6 -8 d 7 -17 d 7 32 d 6 -34 d 7 X 6 -3 d 7 -13 d 7 12 d 6 -32 d 7 X 6 -14 d 7 -8 d 7 3 d 6 16 d 7 -32 d 6 -6 d 7 -29 d 7 -4 d 6 -15 d 7 -14 d 6 -8 d 7 5 d 7 -37 d 6 -1 d 7 -3 d 6
 -31 d 7 -2 d 7 -7 d 6 -17 d 7 -21 d 6 -18 d 7 -11 d 7 -17 d 6 X 7 -16 d 6 -15 d 7 -9 d 7 -14 d 6 -29 d 7 -14 d 6 -6 d 7 -19 d 7 2 d 6 -20 d 7 -26 d 6 3 d 7 -22 d 7 -10 d 6 -17 d 7 -6 d 6 -15 d 7 -22 d 6 -2 d 7 -18 d 7 -4 d 6 -17 d 7 -20 d 6 -9 d 7
 -12 d 7 -7 d 6 -14 d 7 -15 d 6 -8 d 7 -13 d 7 -12 d 6 -18 d 7 -3 d 6 -7 d 7 -20 d 7 -7 d 6 -19 d 7 -6 d 6 -7 d 7 -13 d 7 -11 d 6 -10 d 7 -12 d 6 -8 d 7 -10 d 7 -9 d 6 -7 d 7 -15 d 6 -8 d 7 -8 d 7 -7 d 6 -13 d 7 -5 d 6 -14 d 7 -3 d 7 -6 d 6 -10 d 7
 -7 d 6 -7 d 7 -8 d 7 -5 d 6 -10 d 7 -8 d 6 -5 d 7 -8 d 7 -3 d 6 -8 d 7 -5 d 6 -5 d 7 -5 d 7 -8 d 6 -4 d 7 -7 d 6 -5 d 7 -4 d 7 -4 d 6 -4 d 7 -5 d 6 -4 d 7 -4 d 6 -3 d 7 -5 d 7 -4 d 6 -2 d 7 -5 d 6 -3 d 7 -3 d 7 -4 d 6 -1 d 7 -3 d 6 -2 d 7 -3 d 7 -1
 d 6 -3 d 7 -2 d 6 -2 d 7 -2 d 7 -2 d 6 -2 d 7 -2 d 6 -1 d 7 -1 d 7 -2 d 6 -2 d 7 X 6 -2 d 7 -1 d 7 -1 d 6 -1 d 7 -1 d 6 -1 d 7 X 7 -1 d 6 -1 d 7 -1 d 6 -1 d 7 X 7 -1 d 6 X 7 -1 d 13 X 7 -1 d 6 X 7 -1 d 20 X 6 -1 d 27 X 6 -1 d 46 X 7 -1 d 7 1 d 6 X 7
 -1 d 92 X 7 1 d 6 X 7 -1 d 6 1 d 14 X -7 -1 d -145 X -7 1 d -6 -1 d -7 1 d -39 X -7 1 d -26 X -7 1 d -13 X -7 1 d -13 X -7 1 d -13 X -6 1 d -7 1 d -7 X -6 1 d -7 X -6 1 d -7 1 d -7 1 d -6 1 d -7 1 d -6 X -7 2 d -7 1 d -6 1 d -7 1 d -6 1 d -7 2 d -7
 1 d -6 1 d -7 3 d -6 1 d -7 2 d -7 2 d -6 2 d -7 2 d -6 3 d -7 1 d -7 3 d -6 2 d -7 3 d -6 1 d -7 4 d -7 2 d -6 4 d -7 4 d -6 2 d -7 4 d -7 5 d -6 3 d -7 4 d -6 4 d -7 5 d -6 4 d -7 4 d -7 4 d -6 5 d -7 7 d -6 4 d -7 7 d -7 5 d -6 5 d -7 5 d -6 8 d
 -7 3 d -7 8 d -6 5 d -7 8 d -6 10 d -7 5 d -7 8 d -6 7 d -7 6 d -6 10 d -7 6 d -7 3 d -6 14 d -7 5 d -6 13 d -7 6 d -7 9 d -6 8 d -7 14 d -6 7 d -7 9 d -7 10 d -6 8 d -7 11 d -6 10 d -7 11 d -7 13 d -6 7 d -7 6 d -6 18 d -7 7 d -7 20 d -6 7 d -7 3 d
 -6 18 d -7 11 d -7 14 d -6 7 d -7 15 d -6 13 d -7 8 d -7 11 d -6 9 d -7 21 d -6 16 d -7 4 d -7 18 d -6 2 d -7 21 d -6 15 d -7 6 d -6 16 d -7 10 d -7 22 d -6 -3 d -7 26 d -6 19 d -7 -2 d -7 19 d -6 6 d -7 13 d -6 29 d -7 14 d -7 9 d -6 15 d -7 15 d
 -6 X -7 17 d -7 11 d -6 18 d -7 20 d -6 16 d -7 8 d -7 1 d -6 30 d -7 4 d -6 1 d -7 36 d -7 -5 d -6 7 d -7 14 d -6 14 d -7 5 d -7 28 d -6 6 d -7 31 d -6 -16 d -7 -4 d -7 9 d -6 13 d -7 X -6 32 d -7 -13 d -7 12 d -6 3 d -7 X -6 33 d -7 -32 d -7 16 d
 -6 8 d -7 -29 d -6 -23 d -7 48 d -7 -3 d -6 -39 d -7 -10 d -6 X -7 -31 d -7 45 d -6 -60 d -7 35 d -6 -29 d -7 -24 d -7 -24 d -6 5 d -7 4 d -6 -66 d -7 21 d -6 -31 d -7 -30 d -7 -27 d -6 -10 d -7 -12 d -6 -34 d -7 -15 d -7 -14 d -6 6 d -7 -41 d -6 -9
 d -7 -52 d -7 30 d -6 -23 d -7 -2 d -6 -34 d -7 -6 d -7 34 d -6 -14 d -7 -60 d -6 -9 d -7 -6 d -7 -127 d -6 -9 d -7 -19 d -6 -23 d -7 -139 d -7 -11 d -6 -78 d -7 -61 d -6 -32 d -7 -25 d -7 -36 d -6 -22 d -7 -36 d -6 -16 d -7 -8 d -132 X FA black 1 1
 1 c 567 470 1587 1550 bf black 1587 1550 m 567 X s 2154 1550 m 470 Y s 2154 2020 m -567 X s 1587 2020 m -470 Y s
 gsave  2268 1568 0 609 C 1728.33 1918.25 t 0 r /Helvetica findfont 72.27 sf 0 0 m (No Int) show NC gr  0.8 0 0 c 1609 1941 m 99 X s black
 gsave  2268 1568 0 609 C 1728.33 1758.71 t 0 r /Helvetica findfont 72.27 sf 0 0 m (With Int) show NC gr  0 0 1 c 1609 1785 m 99 X s black
 gsave  2268 1568 0 609 C 1728.33 1610.57 t 0 r /Helvetica findfont 72.27 sf 0 0 m (Reweighted) show NC gr  0 0.4 0 c 1609 1628 m 99 X s black
 gsave  2268 1568 0 609 C 2222.13 1747.32 t 90 r /Helvetica-BoldOblique findfont 30.4295 sf 0 0 m (LHC HIGGS XS WG 2013) show NC gr  1 1 1 c 2268 609 0 0 bf black 1 1 1 c 1814 457 227 152 bf black 1814 457 227 152 bl 1 1 1 c black 227 152 m 132 X 457
 Y 6 X -106 Y 7 X -30 Y 7 X -59 Y 6 X 29 Y 7 X -10 Y 6 X 16 Y 7 X 18 Y 6 X -33 Y 7 X -25 Y 7 X 30 Y 6 X -56 Y 7 X 25 Y 6 X 17 Y 7 X 28 Y 7 X -44 Y 6 X 18 Y 7 X 15 Y 6 X -20 Y 7 X 4 Y 7 X 10 Y 6 X 4 Y 7 X -9 Y 6 X 5 Y 7 X -4 Y 7 X 13 Y 6 X -10 Y 13 X
 -8 Y 7 X 1 Y 7 X -4 Y 6 X 7 Y 7 X -2 Y 6 X -9 Y 7 X 5 Y 7 X -7 Y 6 X -6 Y 7 X -3 Y 6 X 10 Y 7 X -15 Y 7 X 5 Y 6 X 4 Y 7 X -5 Y 13 X -9 Y 7 X 9 Y 6 X -10 Y 7 X 13 Y 6 X -4 Y 7 X -3 Y 7 X -1 Y 6 X -5 Y 7 X -1 Y 6 X 9 Y 7 X -8 Y 7 X -4 Y 6 X -1 Y 7 X 2
 Y 6 X -9 Y 7 X 10 Y 7 X -3 Y 6 X -2 Y 13 X -5 Y 7 X 7 Y 7 X -1 Y 6 X -2 Y 7 X 2 Y 6 X -7 Y 7 X -4 Y 7 X 5 Y 6 X -3 Y 7 X 3 Y 6 X -4 Y 7 X 4 Y 6 X -1 Y 7 X -1 Y 7 X -2 Y 6 X 2 Y 7 X -3 Y 6 X -3 Y 7 X 6 Y 7 X -2 Y 6 X -2 Y 13 X 2 Y 14 X 4 Y 6 X -4 Y 7
 X -2 Y 6 X -1 Y 7 X -1 Y 7 X 2 Y 19 X 3 Y 7 X -2 Y 13 X -5 Y 13 X 6 Y 7 X -4 Y 7 X 2 Y 6 X -3 Y 7 X 2 Y 6 X -2 Y 7 X -2 Y 7 X 7 Y 6 X -7 Y 7 X 2 Y 13 X 4 Y 7 X -3 Y 6 X 3 Y 7 X 1 Y 6 X -5 Y 7 X -1 Y 7 X 4 Y 6 X -7 Y 7 X 1 Y 6 X 4 Y 7 X 2 Y 7 X -6 Y
 6 X -6 Y 7 X 12 Y 6 X -7 Y 7 X 4 Y 7 X 2 Y 6 X -9 Y 7 X 11 Y 6 X -5 Y 7 X -2 Y 13 X 6 Y 7 X -1 Y 6 X -7 Y 7 X -7 Y 6 X 13 Y 7 X -7 Y 7 X 9 Y 6 X -11 Y 7 X 7 Y 6 X -3 Y 7 X 6 Y 7 X -2 Y 6 X -10 Y 7 X 8 Y 6 X 2 Y 7 X -2 Y 7 X -9 Y 6 X 8 Y 7 X -4 Y 6 X
 7 Y 14 X -2 Y 6 X -5 Y 7 X 5 Y 13 X 1 Y 7 X -2 Y 6 X 4 Y 7 X -2 Y 6 X 4 Y 7 X 4 Y 7 X -14 Y 6 X 7 Y 7 X -5 Y 6 X 5 Y 14 X 9 Y 6 X -12 Y 7 X 13 Y 6 X -12 Y 7 X -3 Y 7 X -5 Y 6 X 10 Y 7 X -5 Y 6 X 8 Y 7 X -6 Y 7 X -3 Y 6 X 2 Y 7 X 11 Y 6 X -10 Y 7 X
 -4 Y 7 X 2 Y 6 X 2 Y 7 X 4 Y 6 X 10 Y 7 X -15 Y 7 X 5 Y 6 X 2 Y 7 X -20 Y 6 X 31 Y 7 X -19 Y 7 X -4 Y 6 X 6 Y 7 X -9 Y 6 X 18 Y 7 X -8 Y 7 X -18 Y 6 X 32 Y 7 X -22 Y 6 X -4 Y 7 X 39 Y 6 X -43 Y 7 X -17 Y 7 X 2 Y 6 X 30 Y 7 X 3 Y 6 X -32 Y 7 X 23 Y 7
 X -86 Y 6 X 127 Y 7 X -99 Y 6 X -51 Y 7 X 34 Y 7 X 46 Y 6 X 31 Y 7 X -159 Y 6 X 22 Y 7 X -1 Y 7 X -80 Y 19 X 256 Y 7 X 201 Y 7 X -172 Y 6 X 77 Y 7 X 95 Y 6 X -46 Y 7 X -29 Y 7 X 75 Y 6 X -88 Y 7 X -19 Y 6 X -71 Y 7 X 178 Y 13 X -111 Y 7 X 43 Y 6 X
 31 Y 7 X 37 Y 13 X -40 Y 7 X 40 Y 6 X -202 Y 7 X 189 Y 7 X -23 Y 6 X 13 Y 7 X 23 Y 46 X s 227 152 m 1814 X s
 gsave  2268 609 0 0 C 2017.01 26.5896 t 0 r /Helvetica findfont 38.0897 sf 0 0 m (T) show NC gr 
 gsave  2268 609 0 0 C 1971.43 41.7837 t 0 r /Helvetica findfont 57.1345 sf 0 0 m (M) show NC gr  227 167 m -15 Y s 302 160 m -8 Y s 378 160 m -8 Y s 454 160 m -8 Y s 529 167 m -15 Y s 605 160 m -8 Y s 680 160 m -8 Y s 756 160 m -8 Y s 831 167 m -15
 Y s 907 160 m -8 Y s 983 160 m -8 Y s 1058 160 m -8 Y s 1134 167 m -15 Y s 1209 160 m -8 Y s 1285 160 m -8 Y s 1361 160 m -8 Y s 1436 167 m -15 Y s 1512 160 m -8 Y s 1587 160 m -8 Y s 1663 160 m -8 Y s 1739 167 m -15 Y s 1814 160 m -8 Y s 1890 160 m
 -8 Y s 1965 160 m -8 Y s 2041 167 m -15 Y s 2041 167 m -15 Y s
 gsave  2268 609 0 0 C 208.919 113.956 t 0 r /Helvetica findfont 45.7076 sf 0 0 m (0) show NC gr 
 gsave  2268 609 0 0 C 490.009 113.956 t 0 r /Helvetica findfont 45.7076 sf 0 0 m (200) show NC gr 
 gsave  2268 609 0 0 C 790.092 113.956 t 0 r /Helvetica findfont 45.7076 sf 0 0 m (400) show NC gr 
 gsave  2268 609 0 0 C 1093.97 113.956 t 0 r /Helvetica findfont 45.7076 sf 0 0 m (600) show NC gr 
 gsave  2268 609 0 0 C 1397.86 113.956 t 0 r /Helvetica findfont 45.7076 sf 0 0 m (800) show NC gr 
 gsave  2268 609 0 0 C 1682.74 113.956 t 0 r /Helvetica findfont 45.7076 sf 0 0 m (1000) show NC gr 
 gsave  2268 609 0 0 C 1986.63 113.956 t 0 r /Helvetica findfont 45.7076 sf 0 0 m (1200) show NC gr  227 152 m 457 Y s
 gsave  2268 609 0 0 C 91.1645 170.933 t 90 r /Helvetica findfont 45.7076 sf 0 0 m (\(S+I\)/\(Reweighted S\)) show NC gr  278 152 m -51 X s 252 164 m -25 X s 252 175 m -25 X s 252 187 m -25 X s 278 198 m -51 X s 252 209 m -25 X s 252 221 m -25 X s
 252 232 m -25 X s 278 244 m -51 X s 252 255 m -25 X s 252 267 m -25 X s 252 278 m -25 X s 278 289 m -51 X s 252 301 m -25 X s 252 312 m -25 X s 252 324 m -25 X s 278 335 m -51 X s 252 347 m -25 X s 252 358 m -25 X s 252 369 m -25 X s 278 381 m -51 X
 s 252 392 m -25 X s 252 404 m -25 X s 252 415 m -25 X s 278 427 m -51 X s 252 438 m -25 X s 252 449 m -25 X s 252 461 m -25 X s 278 472 m -51 X s 252 484 m -25 X s 252 495 m -25 X s 252 507 m -25 X s 278 518 m -51 X s 252 529 m -25 X s 252 541 m -25
 X s 252 552 m -25 X s 278 564 m -51 X s 252 575 m -25 X s 252 587 m -25 X s 252 598 m -25 X s 278 609 m -51 X s
 gsave  2268 609 0 0 C 186.127 136.747 t 0 r /Helvetica findfont 45.7076 sf 0 0 m (0) show NC gr 
 gsave  2268 609 0 0 C 148.142 182.329 t 0 r /Helvetica findfont 45.7076 sf 0 0 m (0.2) show NC gr 
 gsave  2268 609 0 0 C 148.142 227.911 t 0 r /Helvetica findfont 45.7076 sf 0 0 m (0.4) show NC gr 
 gsave  2268 609 0 0 C 148.142 273.493 t 0 r /Helvetica findfont 45.7076 sf 0 0 m (0.6) show NC gr 
 gsave  2268 609 0 0 C 148.142 319.076 t 0 r /Helvetica findfont 45.7076 sf 0 0 m (0.8) show NC gr 
 gsave  2268 609 0 0 C 193.725 364.658 t 0 r /Helvetica findfont 45.7076 sf 0 0 m (1) show NC gr 
 gsave  2268 609 0 0 C 148.142 410.24 t 0 r /Helvetica findfont 45.7076 sf 0 0 m (1.2) show NC gr 
 gsave  2268 609 0 0 C 148.142 455.822 t 0 r /Helvetica findfont 45.7076 sf 0 0 m (1.4) show NC gr 
 gsave  2268 609 0 0 C 148.142 501.405 t 0 r /Helvetica findfont 45.7076 sf 0 0 m (1.6) show NC gr 
 gsave  2268 609 0 0 C 148.142 546.987 t 0 r /Helvetica findfont 45.7076 sf 0 0 m (1.8) show NC gr 
 gsave  2268 609 0 0 C 186.127 592.569 t 0 r /Helvetica findfont 45.7076 sf 0 0 m (2) show NC gr  230 152 m20 237 152 m20 243 152 m20 250 152 m20 256 152 m20 263 152 m20 270 152 m20 276 152 m20 283 152 m20 289 152 m20 296 152 m20 303 152 m20 309 152
 m20 316 152 m20 322 152 m20 329 152 m20 336 152 m20 342 152 m20 349 152 m20 355 152 m20 369 503 m20 375 473 m20 382 414 m20 388 443 m20 395 433 m20 402 449 m20 408 467 m20 415 434 m20 421 409 m20 428 439 m20 435 383 m20 441 408 m20 448 425 m20 454
 453 m20 461 409 m20 468 427 m20 474 442 m20 481 422 m20 487 426 m20 494 436 m20 501 440 m20 507 431 m20 514 436 m20 520 432 m20 527 445 m20 534 435 m20 540 435 m20 547 427 m20 553 428 m20 560 424 m20 567 431 m20 573 429 m20 580 420 m20 586 425 m20
 593 418 m20 600 412 m20 606 409 m20 613 419 m20 619 404 m20 626 409 m20 632 413 m20 639 408 m20 646 408 m20 652 399 m20 659 408 m20 665 398 m20 672 411 m20 679 407 m20 685 404 m20 692 403 m20 698 398 m20 705 397 m20 712 406 m20 718 398 m20 725 394
 m20 731 393 m20 738 395 m20 745 386 m20 751 396 m20 758 393 m20 764 391 m20 771 391 m20 778 386 m20 784 393 m20 791 392 m20 797 390 m20 804 392 m20 811 385 m20 817 381 m20 824 386 m20 830 383 m20 837 386 m20 844 382 m20 850 386 m20 857 385 m20 863
 384 m20 870 382 m20 877 384 m20 883 381 m20 890 378 m20 896 384 m20 903 382 m20 910 380 m20 916 380 m20 923 382 m20 929 382 m20 936 386 m20 943 382 m20 949 380 m20 956 379 m20 962 378 m20 969 380 m20 976 380 m20 982 380 m20 989 383 m20 995 381 m20
 1002 381 m20 1009 376 m20 1015 376 m20 1022 382 m20 1028 378 m20 1035 380 m20 1042 377 m20 1048 379 m20 1055 377 m20 1061 375 m20 1068 382 m20 1074 375 m20 1081 377 m20 1088 377 m20 1094 381 m20 1101 378 m20 1107 381 m20 1114 382 m20 1121 377 m20
 1127 376 m20 1134 380 m20 1140 373 m20 1147 374 m20 1154 378 m20 1160 380 m20 1167 374 m20 1173 368 m20 1180 380 m20 1187 373 m20 1193 377 m20 1200 379 m20 1206 370 m20 1213 381 m20 1220 376 m20 1226 374 m20 1233 374 m20 1239 380 m20 1246 379 m20
 1253 372 m20 1259 365 m20 1266 378 m20 1272 371 m20 1279 380 m20 1286 369 m20 1292 376 m20 1299 373 m20 1305 379 m20 1312 377 m20 1319 367 m20 1325 375 m20 1332 377 m20 1338 375 m20 1345 366 m20 1352 374 m20 1358 370 m20 1365 377 m20 1371 377 m20
 1378 375 m20 1385 370 m20 1391 375 m20 1398 375 m20 1404 376 m20 1411 374 m20 1418 378 m20 1424 376 m20 1431 380 m20 1437 384 m20 1444 370 m20 1451 377 m20 1457 372 m20 1464 377 m20 1470 377 m20 1477 386 m20 1483 374 m20 1490 387 m20 1497 375 m20
 1503 372 m20 1510 367 m20 1516 377 m20 1523 372 m20 1530 380 m20 1536 374 m20 1543 371 m20 1549 373 m20 1556 384 m20 1563 374 m20 1569 370 m20 1576 372 m20 1582 374 m20 1589 378 m20 1596 388 m20 1602 373 m20 1609 378 m20 1615 380 m20 1622 360 m20
 1629 391 m20 1635 372 m20 1642 368 m20 1648 374 m20 1655 365 m20 1662 383 m20 1668 375 m20 1675 357 m20 1681 389 m20 1688 367 m20 1695 363 m20 1701 402 m20 1708 359 m20 1714 342 m20 1721 344 m20 1728 374 m20 1734 377 m20 1741 345 m20 1747 368 m20
 1754 282 m20 1761 409 m20 1767 310 m20 1774 259 m20 1780 293 m20 1787 339 m20 1794 370 m20 1800 211 m20 1807 233 m20 1813 232 m20 1840 408 m20 1853 437 m20 1860 514 m20 1873 563 m20 1879 534 m20 1893 521 m20 1899 502 m20 1906 431 m20 1925 498 m20
 1932 541 m20 1939 572 m20 1958 569 m20 1972 407 m20 1978 596 m20 1985 573 m20 1991 586 m20 cs 0 0 0 P13 setcolor 230 152 m 125 X 7 457 d 7 X 6 -71 d 7 -88 d 6 24 d 7 -14 d 7 15 d 6 16 d 7 -39 d 6 -27 d 7 30 d 7 -61 d 6 26 d 7 18 d 6 28 d 7 -46 d 7
 18 d 6 15 d 7 -21 d 6 4 d 7 10 d 7 3 d 6 -9 d 7 5 d 6 -5 d 7 13 d 7 -11 d 6 X 7 -8 d 6 1 d 7 -5 d 7 7 d 6 -2 d 7 -10 d 6 5 d 7 -7 d 7 -6 d 6 -3 d 7 10 d 6 -15 d 7 4 d 6 4 d 7 -5 d 7 X 6 -9 d 7 9 d 6 -11 d 7 14 d 7 -4 d 6 -3 d 7 -1 d 6 -6 d 7 X 7 8 d
 6 -7 d 7 -5 d 6 -1 d 7 2 d 7 -10 d 6 11 d 7 -3 d 6 -2 d 7 X 7 -5 d 6 7 d 7 -1 d 6 -2 d 7 2 d 7 -7 d 6 -5 d 7 5 d 6 -3 d 7 4 d 7 -4 d 6 4 d 7 -2 d 6 X 7 -2 d 7 1 d 6 -2 d 7 -3 d 6 5 d 7 -1 d 7 -2 d 6 X 7 2 d 6 -1 d 7 4 d 7 -3 d 6 -2 d 7 -2 d 6 -1 d 7
 2 d 7 1 d 6 X 7 3 d 6 -2 d 7 X 7 -6 d 6 1 d 7 5 d 6 -3 d 7 2 d 7 -3 d 6 2 d 7 -2 d 6 -2 d 7 7 d 6 -7 d 7 2 d 7 X 6 4 d 7 -3 d 6 3 d 7 1 d 7 -5 d 6 -1 d 7 4 d 6 -7 d 7 1 d 7 4 d 6 2 d 7 -6 d 6 -6 d 7 12 d 7 -6 d 6 3 d 7 3 d 6 -10 d 7 11 d 7 -4 d 6 -2
 d 7 -1 d 6 6 d 7 -1 d 7 -6 d 6 -7 d 7 12 d 6 -6 d 7 9 d 7 -11 d 6 7 d 7 -4 d 6 7 d 7 -2 d 7 -11 d 6 9 d 7 2 d 6 -2 d 7 -9 d 7 8 d 6 -4 d 7 7 d 6 X 7 -1 d 7 -6 d 6 6 d 7 -1 d 6 2 d 7 -2 d 7 5 d 6 -3 d 7 4 d 6 4 d 7 -13 d 7 6 d 6 -5 d 7 5 d 6 1 d 7 10
 d 6 -13 d 7 14 d 7 -13 d 6 -2 d 7 -5 d 6 10 d 7 -5 d 7 9 d 6 -7 d 7 -2 d 6 2 d 7 11 d 7 -9 d 6 -5 d 7 4 d 6 2 d 7 5 d 7 10 d 6 -15 d 7 6 d 6 2 d 7 -21 d 7 34 d 6 -20 d 7 -2 d 6 5 d 7 -7 d 7 19 d 6 -7 d 7 -17 d 6 33 d 7 -21 d 7 -2 d 6 41 d 7 -42 d 6
 -14 d 7 -1 d 7 36 d 6 7 d 7 -25 d 6 25 d 7 -88 d 7 138 d 6 -97 d 7 -42 d 6 38 d 7 79 d 7 38 d 6 -155 d 7 99 d 6 117 d 7 -288 d 7 278 d 6 79 d 60 X 6 -10 d 7 -78 d 6 88 d 7 X 6 -18 d 7 18 d 33 X 7 -135 d 6 135 d 60 X -16 X -4 -54 d -5 54 d -11 X -4
 -47 d -7 -54 d -6 -14 d -7 22 d -6 -177 d -5 270 d -5 X -4 -121 d -6 40 d -7 4 d -6 -52 d -7 -25 d -7 -50 d -6 204 d -7 -47 d -6 -220 d -7 63 d -6 11 d -7 140 d -7 -155 d -6 41 d -7 119 d -6 -222 d -7 -138 d -7 126 d -6 -175 d -40 X -6 109 d -7 -25
 d -7 -12 d -6 -30 d -7 60 d -6 102 d -7 -118 d -7 85 d -6 -20 d -7 38 d -6 X -7 -23 d -7 -5 d -6 19 d -7 45 d -6 -37 d -7 6 d -7 22 d -6 -30 d -7 19 d -6 10 d -7 -18 d -7 11 d -6 -6 d -7 5 d -6 19 d -7 -29 d -7 19 d -6 -1 d -7 -5 d -6 16 d -7 -10 d
 -7 -3 d -6 -2 d -7 -2 d -6 5 d -7 9 d -7 -10 d -6 -2 d -7 3 d -6 6 d -7 -7 d -7 4 d -6 -8 d -7 5 d -6 2 d -7 12 d -7 -12 d -6 12 d -7 -9 d -6 X -7 -5 d -6 5 d -7 -6 d -7 13 d -6 -3 d -7 -4 d -6 2 d -7 -3 d -7 1 d -6 -1 d -7 1 d -6 -5 d -7 5 d -7 1 d
 -6 X -7 -7 d -6 4 d -7 -7 d -7 8 d -6 3 d -7 -2 d -6 -8 d -7 10 d -7 2 d -6 -6 d -7 3 d -6 -7 d -7 11 d -7 -8 d -6 6 d -7 -12 d -6 7 d -7 6 d -7 1 d -6 -6 d -7 1 d -6 2 d -7 4 d -7 -10 d -6 9 d -7 -3 d -6 -3 d -7 7 d -7 -12 d -6 6 d -7 6 d -6 -3 d
 -7 -3 d -7 -1 d -6 7 d -7 -4 d -6 2 d -7 4 d -7 -1 d -6 -3 d -7 3 d -6 -3 d -7 -1 d -7 -2 d -6 7 d -7 -7 d -6 3 d -7 1 d -6 -1 d -7 2 d -7 -2 d -6 4 d -7 -5 d -6 -1 d -7 5 d -7 X -6 2 d -7 -3 d -13 X -7 -2 d -6 1 d -7 1 d -6 2 d -7 4 d -7 -4 d -6 1
 d -7 -2 d -6 -1 d -7 3 d -7 1 d -6 -5 d -7 3 d -6 2 d -7 -1 d -7 2 d -6 X -7 1 d -6 -4 d -7 4 d -7 -3 d -6 3 d -7 -5 d -6 5 d -7 6 d -7 -2 d -6 3 d -7 X -6 -6 d -7 5 d -7 -1 d -6 2 d -7 3 d -6 -10 d -7 9 d -7 -2 d -6 X -7 5 d -6 7 d -7 -8 d -7 X -6
 6 d -7 1 d -6 3 d -7 4 d -7 -14 d -6 10 d -7 -9 d -6 9 d -7 X -7 5 d -6 -5 d -7 -4 d -6 14 d -7 -10 d -6 3 d -7 6 d -7 7 d -6 -5 d -7 9 d -6 1 d -7 -7 d -7 4 d -6 -1 d -7 7 d -6 X -7 9 d -7 -13 d -6 4 d -7 -5 d -6 7 d -7 -4 d -7 -10 d -6 -4 d -7 18
 d -6 -14 d -7 -18 d -7 42 d -6 -28 d -7 -16 d -6 -25 d -7 52 d -7 -30 d -6 22 d -7 27 d -6 -18 d -7 -17 d -7 6 d -6 -36 d -7 31 d -6 -12 d -7 -244 d -132 X FA
 gr  gr showpage
end
%%EOF
