%!PS-Adobe-2.0 EPSF-2.0
%%BoundingBox:  0 0 567 544
%%Title: HWW_400_MWW_reweighting_cut_YR3.eps: HWW 400Gev MWW reweighting for interference with cuts
%%Creator: ROOT Version 5.34/05
%%CreationDate: Fri Jun 14 02:56:50 2013
%%EndComments
%%BeginProlog
80 dict begin
/s {stroke} def /l {lineto} def /m {moveto} def /t {translate} def
/r {rotate} def /rl {roll}  def /R {repeat} def
/d {rlineto} def /rm {rmoveto} def /gr {grestore} def /f {eofill} def
/c {setrgbcolor} def /black {0 setgray} def /sd {setdash} def
/cl {closepath} def /sf {scalefont setfont} def /lw {setlinewidth} def
/box {m dup 0 exch d exch 0 d 0 exch neg d cl} def
/NC{systemdict begin initclip end}def/C{NC box clip newpath}def
/bl {box s} def /bf {box f} def /Y { 0 exch d} def /X { 0 d} def 
/K {{pop pop 0 moveto} exch kshow} bind def
/ita {/ang 15 def gsave [1 0 ang dup sin exch cos div 1 0 0] concat} def 
/mp {newpath /y exch def /x exch def} def
/side {[w .77 mul w .23 mul] .385 w mul sd w 0 l currentpoint t -144 r} def
/mr {mp x y w2 0 360 arc} def /m24 {mr s} def /m20 {mr f} def
/mb {mp x y w2 add m w2 neg 0 d 0 w neg d w 0 d 0 w d cl} def
/mt {mp x y w2 add m w2 neg w neg d w 0 d cl} def
/m21 {mb f} def /m25 {mb s} def /m22 {mt f} def /m26{mt s} def
/m23 {mp x y w2 sub m w2 w d w neg 0 d cl f} def
/m27 {mp x y w2 add m w3 neg w2 neg d w3 w2 neg d w3 w2 d cl s} def
/m28 {mp x w2 sub y w2 sub w3 add m w3 0 d  0 w3 neg d w3 0 d 0 w3 d w3 0 d  0 w3 d w3 neg 0 d 0 w3 d w3 neg 0 d 0 w3 neg d w3 neg 0 d cl s } def
/m29 {mp gsave x w2 sub y w2 add w3 sub m currentpoint t 4 {side} repeat cl fill gr} def
/m30 {mp gsave x w2 sub y w2 add w3 sub m currentpoint t 4 {side} repeat cl s gr} def
/m31 {mp x y w2 sub m 0 w d x w2 sub y m w 0 d x w2 sub y w2 add m w w neg d x w2 sub y w2 sub m w w d s} def
/m32 {mp x y w2 sub m w2 w d w neg 0 d cl s} def
/m33 {mp x y w2 add m w3 neg w2 neg d w3 w2 neg d w3 w2 d cl f} def
/m34 {mp x w2 sub y w2 sub w3 add m w3 0 d  0 w3 neg d w3 0 d 0 w3 d w3 0 d  0 w3 d w3 neg 0 d 0 w3 d w3 neg 0 d 0 w3 neg d w3 neg 0 d cl f } def
/m2 {mp x y w2 sub m 0 w d x w2 sub y m w 0 d s} def
/m5 {mp x w2 sub y w2 sub m w w d x w2 sub y w2 add m w w neg d s} def
/reEncode {exch findfont dup length dict begin {1 index /FID eq  {pop pop} {def} ifelse } forall /Encoding exch def currentdict end dup /FontName get exch definefont pop } def [/Times-Bold /Times-Italic /Times-BoldItalic /Helvetica /Helvetica-Oblique
 /Helvetica-Bold /Helvetica-BoldOblique /Courier /Courier-Oblique /Courier-Bold /Courier-BoldOblique /Times-Roman /AvantGarde-Book /AvantGarde-BookOblique /AvantGarde-Demi /AvantGarde-DemiOblique /Bookman-Demi /Bookman-DemiItalic /Bookman-Light
 /Bookman-LightItalic /Helvetica-Narrow /Helvetica-Narrow-Bold /Helvetica-Narrow-BoldOblique /Helvetica-Narrow-Oblique /NewCenturySchlbk-Roman /NewCenturySchlbk-Bold /NewCenturySchlbk-BoldItalic /NewCenturySchlbk-Italic /Palatino-Bold
 /Palatino-BoldItalic /Palatino-Italic /Palatino-Roman ] {ISOLatin1Encoding reEncode } forall
%%EndProlog
%%BeginSetup
%%EndSetup
newpath  gsave  .25 .25 scale  gsave  0 0 t black[  ] 0 sd 3 lw 1 1 1 c 2268 2177 0 0 bf black 1 1 1 c 2268 1568 0 609 bf black 1 1 1 c 1814 1411 227 609 bf black 1814 1411 227 609 bl 0 0 1 c 1 1 1 c 0 0 1 c 227 676 m 286 X 1 Y 4 X 1 Y 4 X 1 Y 3 X 2
 Y 4 X 1 Y 7 X 1 Y 4 X 1 Y 11 X 1 Y 7 X 1 Y 14 X 1 Y 8 X 1 Y 3 X -1 Y 8 X 2 Y 3 X 1 Y 4 X -2 Y 7 X 2 Y 7 X -1 Y 4 X 2 Y 4 X -2 Y 7 X 1 Y 4 X -1 Y 3 X 1 Y 11 X 1 Y 4 X -1 Y 3 X 1 Y 4 X -1 Y 4 X 1 Y 7 X 1 Y 7 X -1 Y 4 X 1 Y 7 X 1 Y 4 X 1 Y 3 X -2 Y 4 X
 2 Y 3 X -1 Y 4 X 1 Y 4 X 1 Y 3 X 1 Y 4 X -1 Y 4 X 1 Y 3 X 1 Y 4 X -2 Y 3 X 1 Y 4 X 1 Y 7 X 1 Y 4 X 1 Y 11 X 2 Y 11 X 3 Y 7 X 1 Y 7 X 2 Y 8 X 2 Y 3 X 2 Y 7 X 1 Y 4 X 1 Y 4 X 2 Y 3 X 2 Y 4 X 3 Y 4 X 1 Y 3 X 4 Y 4 X 3 Y 3 X 3 Y 4 X 1 Y 4 X 4 Y 3 X 5 Y
 4 X 4 Y 4 X 4 Y 3 X 5 Y 4 X 7 Y 3 X 7 Y 4 X 10 Y 4 X 12 Y 3 X 4 Y 4 X 15 Y 4 X 13 Y 3 X 15 Y 4 X 12 Y 4 X 19 Y 3 X 18 Y 4 X 24 Y 3 X 22 Y 4 X 31 Y 4 X 31 Y 3 X 41 Y 4 X 43 Y 4 X 51 Y 3 X 59 Y 4 X 73 Y 3 X 83 Y 4 X 85 Y 4 X 98 Y 3 X 117 Y 4 X 98 Y 4
 X 100 Y 3 X 73 Y 4 X 38 Y 3 X -16 Y 4 X -45 Y 4 X -102 Y 3 X -111 Y 4 X -127 Y 4 X -114 Y 3 X -109 Y 4 X -94 Y 3 X -82 Y 4 X -71 Y 4 X -51 Y 3 X -47 Y 4 X -44 Y 4 X -34 Y 3 X -31 Y 4 X -21 Y 3 X -24 Y 4 X -16 Y 4 X -14 Y 3 X -15 Y 4 X -12 Y 4 X -9 Y
 3 X -11 Y 4 X -7 Y 4 X -6 Y 3 X -7 Y 4 X -4 Y 3 X -7 Y 4 X -3 Y 4 X -5 Y 3 X -3 Y 4 X -4 Y 4 X -4 Y 3 X -1 Y 4 X -2 Y 3 X -2 Y 4 X -2 Y 4 X -2 Y 3 X -1 Y 4 X -2 Y 4 X -1 Y 3 X -3 Y 11 X -2 Y 4 X -1 Y 7 X -1 Y 7 X -2 Y 11 X -2 Y 4 X 1 Y 3 X -1 Y 11 X
 -1 Y 8 X -1 Y 7 X -1 Y 3 X 1 Y 8 X -1 Y 18 X -1 Y 29 X -1 Y 32 X -1 Y 4 X 1 Y 18 X -1 Y 4 X 1 Y 36 X -1 Y 4 X 1 Y 203 X 1 Y 7 X -1 Y 15 X 1 Y 3 X -1 Y 8 X 1 Y 18 X -1 Y 11 X 1 Y 54 X -1 Y 4 X 1 Y 315 X 1 Y 4 X -1 Y 65 X 1 Y 4 X s black 227 609 m
 1814 X s 227 647 m -38 Y s 263 628 m -19 Y s 299 628 m -19 Y s 336 628 m -19 Y s 372 628 m -19 Y s 408 647 m -38 Y s 444 628 m -19 Y s 481 628 m -19 Y s 517 628 m -19 Y s 553 628 m -19 Y s 590 647 m -38 Y s 626 628 m -19 Y s 662 628 m -19 Y s 698
 628 m -19 Y s 735 628 m -19 Y s 771 647 m -38 Y s 807 628 m -19 Y s 844 628 m -19 Y s 880 628 m -19 Y s 916 628 m -19 Y s 952 647 m -38 Y s 989 628 m -19 Y s 1025 628 m -19 Y s 1061 628 m -19 Y s 1098 628 m -19 Y s 1134 647 m -38 Y s 1170 628 m -19
 Y s 1206 628 m -19 Y s 1243 628 m -19 Y s 1279 628 m -19 Y s 1315 647 m -38 Y s 1352 628 m -19 Y s 1388 628 m -19 Y s 1424 628 m -19 Y s 1460 628 m -19 Y s 1497 647 m -38 Y s 1533 628 m -19 Y s 1569 628 m -19 Y s 1606 628 m -19 Y s 1642 628 m -19 Y
 s 1678 647 m -38 Y s 1714 628 m -19 Y s 1751 628 m -19 Y s 1787 628 m -19 Y s 1823 628 m -19 Y s 1860 647 m -38 Y s 1896 628 m -19 Y s 1932 628 m -19 Y s 1968 628 m -19 Y s 2005 628 m -19 Y s 2041 647 m -38 Y s
 gsave  2268 1568 0 609 C 208.919 558.382 t 0 r /Helvetica findfont 49.4479 sf 0 0 m (0) show NC gr 
 gsave  2268 1568 0 609 C 364.658 558.382 t 0 r /Helvetica findfont 49.4479 sf 0 0 m (100) show NC gr 
 gsave  2268 1568 0 609 C 546.987 558.382 t 0 r /Helvetica findfont 49.4479 sf 0 0 m (200) show NC gr 
 gsave  2268 1568 0 609 C 725.517 558.382 t 0 r /Helvetica findfont 49.4479 sf 0 0 m (300) show NC gr 
 gsave  2268 1568 0 609 C 907.846 558.382 t 0 r /Helvetica findfont 49.4479 sf 0 0 m (400) show NC gr 
 gsave  2268 1568 0 609 C 1090.18 558.382 t 0 r /Helvetica findfont 49.4479 sf 0 0 m (500) show NC gr 
 gsave  2268 1568 0 609 C 1272.5 558.382 t 0 r /Helvetica findfont 49.4479 sf 0 0 m (600) show NC gr 
 gsave  2268 1568 0 609 C 1454.83 558.382 t 0 r /Helvetica findfont 49.4479 sf 0 0 m (700) show NC gr 
 gsave  2268 1568 0 609 C 1633.36 558.382 t 0 r /Helvetica findfont 49.4479 sf 0 0 m (800) show NC gr 
 gsave  2268 1568 0 609 C 1815.69 558.382 t 0 r /Helvetica findfont 49.4479 sf 0 0 m (900) show NC gr 
 gsave  2268 1568 0 609 C 1982.83 558.382 t 0 r /Helvetica findfont 49.4479 sf 0 0 m (1000) show NC gr  227 609 m 1411 Y s
 gsave  2268 1568 0 609 C 64.5748 1356.07 t 90 r /Helvetica findfont 34.2332 sf 0 0 m (WW) show NC gr 
 gsave  2268 1568 0 609 C 45.5822 1272.5 t 90 r /Helvetica findfont 49.4479 sf 0 0 m (/dM) show NC gr 
 gsave  2268 1568 0 609 C 45.5822 1242.12 t 90 r /Symbol findfont 49.4479 sf 0 0 m (s) show NC gr 
 gsave  2268 1568 0 609 C 45.5822 1215.53 t 90 r /Helvetica findfont 49.4479 sf 0 0 m (d) show NC gr  288 676 m -61 X s 257 716 m -30 X s 257 755 m -30 X s 257 795 m -30 X s 288 835 m -61 X s 257 875 m -30 X s 257 915 m -30 X s 257 954 m -30 X s 288
 994 m -61 X s 257 1034 m -30 X s 257 1074 m -30 X s 257 1114 m -30 X s 288 1153 m -61 X s 257 1193 m -30 X s 257 1233 m -30 X s 257 1273 m -30 X s 288 1313 m -61 X s 257 1352 m -30 X s 257 1392 m -30 X s 257 1432 m -30 X s 288 1472 m -61 X s 257
 1512 m -30 X s 257 1551 m -30 X s 257 1591 m -30 X s 288 1631 m -61 X s 257 1671 m -30 X s 257 1711 m -30 X s 257 1750 m -30 X s 288 1790 m -61 X s 257 1830 m -30 X s 257 1870 m -30 X s 257 1910 m -30 X s 288 1949 m -61 X s 288 676 m -61 X s 257 636
 m -30 X s 288 1949 m -61 X s 257 1989 m -30 X s
 gsave  2268 1568 0 609 C 186.127 657.144 t 0 r /Helvetica findfont 49.4479 sf 0 0 m (0) show NC gr 
 gsave  2268 1568 0 609 C 117.754 816.682 t 0 r /Helvetica findfont 49.4479 sf 0 0 m (0.02) show NC gr 
 gsave  2268 1568 0 609 C 117.754 976.22 t 0 r /Helvetica findfont 49.4479 sf 0 0 m (0.04) show NC gr 
 gsave  2268 1568 0 609 C 117.754 1135.76 t 0 r /Helvetica findfont 49.4479 sf 0 0 m (0.06) show NC gr 
 gsave  2268 1568 0 609 C 117.754 1295.3 t 0 r /Helvetica findfont 49.4479 sf 0 0 m (0.08) show NC gr 
 gsave  2268 1568 0 609 C 151.941 1454.83 t 0 r /Helvetica findfont 49.4479 sf 0 0 m (0.1) show NC gr 
 gsave  2268 1568 0 609 C 117.754 1614.37 t 0 r /Helvetica findfont 49.4479 sf 0 0 m (0.12) show NC gr 
 gsave  2268 1568 0 609 C 117.754 1773.91 t 0 r /Helvetica findfont 49.4479 sf 0 0 m (0.14) show NC gr 
 gsave  2268 1568 0 609 C 117.754 1933.45 t 0 r /Helvetica findfont 49.4479 sf 0 0 m (0.16) show NC gr  0 0 1 c /w 2 def /w2 {w 2 div} def /w3 {w 3 div} def 229 676 m20 232 676 m20 236 676 m20 239 676 m20 243 676 m20 247 676 m20 250 676 m20 254 676
 m20 258 676 m20 261 676 m20 265 676 m20 268 676 m20 272 676 m20 276 676 m20 279 676 m20 283 676 m20 287 676 m20 290 676 m20 294 676 m20 298 676 m20 301 676 m20 305 676 m20 308 676 m20 312 676 m20 316 676 m20 319 676 m20 323 676 m20 327 676 m20 330
 676 m20 334 676 m20 337 676 m20 341 676 m20 345 676 m20 348 676 m20 352 676 m20 356 676 m20 359 676 m20 363 676 m20 366 676 m20 370 676 m20 374 676 m20 377 676 m20 381 676 m20 385 676 m20 388 676 m20 392 676 m20 395 676 m20 399 676 m20 403 676 m20
 406 676 m20 410 676 m20 414 676 m20 417 676 m20 421 676 m20 425 676 m20 428 676 m20 432 676 m20 435 676 m20 439 676 m20 443 676 m20 446 676 m20 450 676 m20 454 676 m20 457 676 m20 461 676 m20 464 676 m20 468 676 m20 472 676 m20 475 676 m20 479 676
 m20 483 676 m20 486 676 m20 490 676 m20 493 676 m20 497 676 m20 501 676 m20 504 676 m20 508 676 m20 512 676 m20 515 677 m20 519 678 m20 522 679 m20 526 681 m20 530 682 m20 533 682 m20 537 683 m20 541 684 m20 544 684 m20 548 684 m20 552 685 m20 555
 685 m20 559 686 m20 562 686 m20 566 686 m20 570 686 m20 573 687 m20 577 687 m20 581 688 m20 584 687 m20 588 687 m20 591 689 m20 595 690 m20 599 688 m20 602 688 m20 606 690 m20 610 690 m20 613 689 m20 617 691 m20 620 689 m20 624 689 m20 628 690 m20
 631 689 m20 635 690 m20 639 690 m20 642 690 m20 646 691 m20 649 690 m20 653 691 m20 657 690 m20 660 691 m20 664 691 m20 668 692 m20 671 692 m20 675 691 m20 679 692 m20 682 692 m20 686 693 m20 689 694 m20 693 692 m20 697 694 m20 700 693 m20 704 694
 m20 708 695 m20 711 696 m20 715 695 m20 718 696 m20 722 697 m20 726 695 m20 729 696 m20 733 697 m20 737 697 m20 740 698 m20 744 699 m20 747 699 m20 751 699 m20 755 701 m20 758 701 m20 762 701 m20 766 704 m20 769 704 m20 773 705 m20 776 705 m20 780
 707 m20 784 707 m20 787 709 m20 791 711 m20 795 711 m20 798 712 m20 802 713 m20 805 715 m20 809 717 m20 813 720 m20 816 721 m20 820 725 m20 824 728 m20 827 731 m20 831 732 m20 835 736 m20 838 741 m20 842 745 m20 845 749 m20 849 754 m20 853 761 m20
 856 768 m20 860 778 m20 864 790 m20 867 794 m20 871 809 m20 874 822 m20 878 837 m20 882 849 m20 885 868 m20 889 886 m20 893 910 m20 896 932 m20 900 963 m20 903 994 m20 907 1035 m20 911 1078 m20 914 1129 m20 918 1188 m20 922 1261 m20 925 1344 m20 929
 1429 m20 932 1527 m20 936 1644 m20 940 1742 m20 943 1842 m20 947 1915 m20 951 1953 m20 954 1937 m20 958 1892 m20 962 1790 m20 965 1679 m20 969 1552 m20 972 1438 m20 976 1329 m20 980 1235 m20 983 1153 m20 987 1082 m20 991 1031 m20 994 984 m20 998 940
 m20 1001 906 m20 1005 875 m20 1009 854 m20 1012 830 m20 1016 814 m20 1020 800 m20 1023 785 m20 1027 773 m20 1030 764 m20 1034 753 m20 1038 746 m20 1041 740 m20 1045 733 m20 1049 729 m20 1052 722 m20 1056 719 m20 1059 714 m20 1063 711 m20 1067 707
 m20 1070 703 m20 1074 702 m20 1078 700 m20 1081 698 m20 1085 696 m20 1089 694 m20 1092 693 m20 1096 691 m20 1099 690 m20 1103 687 m20 1107 687 m20 1110 687 m20 1114 685 m20 1118 684 m20 1121 684 m20 1125 683 m20 1128 683 m20 1132 681 m20 1136 681
 m20 1139 681 m20 1143 679 m20 1147 680 m20 1150 679 m20 1154 679 m20 1157 679 m20 1161 678 m20 1165 678 m20 1168 677 m20 1172 677 m20 1176 676 m20 1179 677 m20 1183 677 m20 1186 676 m20 1190 676 m20 1194 676 m20 1197 676 m20 1201 676 m20 1205 675
 m20 1208 675 m20 1212 675 m20 1215 675 m20 1219 675 m20 1223 675 m20 1226 675 m20 1230 675 m20 1234 674 m20 1237 674 m20 1241 674 m20 1245 674 m20 1248 674 m20 1252 674 m20 1255 674 m20 1259 674 m20 1263 674 m20 1266 673 m20 1270 674 m20 1274 674
 m20 1277 674 m20 1281 674 m20 1284 674 m20 1288 673 m20 1292 674 m20 1295 674 m20 1299 674 m20 1303 674 m20 1306 674 m20 1310 674 m20 1313 674 m20 1317 674 m20 1321 674 m20 1324 674 m20 1328 673 m20 1332 674 m20 1335 674 m20 1339 674 m20 1342 674
 m20 1346 674 m20 1350 674 m20 1353 674 m20 1357 674 m20 1361 674 m20 1364 674 m20 1368 674 m20 1372 674 m20 1375 674 m20 1379 674 m20 1382 674 m20 1386 674 m20 1390 674 m20 1393 674 m20 1397 674 m20 1401 674 m20 1404 674 m20 1408 674 m20 1411 674
 m20 1415 674 m20 1419 674 m20 1422 674 m20 1426 674 m20 1430 674 m20 1433 674 m20 1437 674 m20 1440 674 m20 1444 674 m20 1448 674 m20 1451 674 m20 1455 674 m20 1459 674 m20 1462 674 m20 1466 674 m20 1469 674 m20 1473 674 m20 1477 674 m20 1480 674
 m20 1484 674 m20 1488 674 m20 1491 674 m20 1495 674 m20 1499 674 m20 1502 674 m20 1506 674 m20 1509 674 m20 1513 674 m20 1517 674 m20 1520 674 m20 1524 674 m20 1528 674 m20 1531 674 m20 1535 675 m20 1538 675 m20 1542 674 m20 1546 674 m20 1549 674
 m20 1553 674 m20 1557 675 m20 1560 674 m20 1564 674 m20 1567 675 m20 1571 675 m20 1575 675 m20 1578 675 m20 1582 675 m20 1586 674 m20 1589 674 m20 1593 674 m20 1596 675 m20 1600 675 m20 1604 675 m20 1607 675 m20 1611 675 m20 1615 675 m20 1618 675
 m20 1622 675 m20 1625 675 m20 1629 675 m20 1633 675 m20 1636 675 m20 1640 675 m20 1644 675 m20 1647 675 m20 1651 674 m20 1655 675 m20 1658 675 m20 1662 675 m20 1665 675 m20 1669 675 m20 1673 675 m20 1676 675 m20 1680 675 m20 1684 675 m20 1687 675
 m20 1691 675 m20 1694 675 m20 1698 675 m20 1702 675 m20 1705 675 m20 1709 675 m20 1713 675 m20 1716 675 m20 1720 675 m20 1723 675 m20 1727 675 m20 1731 675 m20 1734 675 m20 1738 675 m20 1742 675 m20 1745 675 m20 1749 675 m20 1752 675 m20 1756 675
 m20 1760 675 m20 1763 675 m20 1767 675 m20 1771 675 m20 1774 675 m20 1778 675 m20 1782 675 m20 1785 675 m20 1789 675 m20 1792 675 m20 1796 675 m20 1800 675 m20 1803 675 m20 1807 675 m20 1811 675 m20 1814 675 m20 1818 675 m20 1821 675 m20 1825 675
 m20 1829 675 m20 1832 675 m20 1836 675 m20 1840 675 m20 1843 675 m20 1847 675 m20 1850 675 m20 1854 675 m20 1858 675 m20 1861 675 m20 1865 675 m20 1869 675 m20 1872 675 m20 1876 675 m20 1879 675 m20 1883 675 m20 1887 675 m20 1890 675 m20 1894 675
 m20 1898 675 m20 1901 675 m20 1905 675 m20 1909 675 m20 1912 675 m20 1916 675 m20 1919 675 m20 1923 675 m20 1927 675 m20 1930 675 m20 1934 675 m20 1938 675 m20 1941 675 m20 1945 675 m20 1948 675 m20 1952 675 m20 1956 675 m20 1959 675 m20 1963 675
 m20 1967 675 m20 1970 676 m20 1974 675 m20 1977 675 m20 1981 675 m20 1985 675 m20 1988 675 m20 1992 675 m20 1996 675 m20 1999 675 m20 2003 675 m20 2006 675 m20 2010 675 m20 2014 675 m20 2017 675 m20 2021 675 m20 2025 675 m20 2028 675 m20 2032 675
 m20 2036 675 m20 2039 676 m20 black 0 0 1 c 1 lw << /PatternType 1 /PaintType 2 /TilingType 1 /BBox [ 0 0 100 100 ] /XStep 100 /YStep 100 /PaintProc { begin gsave 0 0 m 100 100 l 0 100 m 100 0 l s gr end } >> [ 0.24 0 0 0.24 0 0 ] makepattern /P13
 exch def /cs {[/Pattern /DeviceRGB] setcolorspace} def /FA {f [/DeviceRGB] setcolorspace} def cs 0 0 1 P13 setcolor 229 676 m 279 X 4 1 d 3 X 4 1 d 3 1 d 4 2 d 4 1 d 3 1 d 4 X 4 1 d 3 1 d 4 X 4 1 d 7 X 3 1 d 11 X 4 1 d 4 1 d 3 -1 d 4 X 3 1 d 4 1 d 4
 -1 d 3 X 4 1 d 7 X 4 2 d 3 -2 d 4 X 4 1 d 3 -2 d 4 2 d 4 -1 d 3 1 d 4 1 d 3 -1 d 8 X 3 1 d 15 X 4 1 d 3 -1 d 4 2 d 3 X 4 -1 d 4 1 d 3 -1 d 4 2 d 4 X 3 2 d 4 -1 d 3 X 4 2 d 4 -2 d 3 1 d 4 1 d 4 X 3 1 d 4 1 d 7 X 4 2 d 7 X 4 3 d 3 X 4 1 d 3 -1 d 4 3 d
 4 X 3 2 d 4 1 d 4 X 3 2 d 4 1 d 3 2 d 4 2 d 4 3 d 3 1 d 4 4 d 4 3 d 3 3 d 4 1 d 4 4 d 3 5 d 4 4 d 3 4 d 4 5 d 4 7 d 3 7 d 4 10 d 4 12 d 3 5 d 4 15 d 3 13 d 4 15 d 4 12 d 3 19 d 4 18 d 4 24 d 3 22 d 4 31 d 3 32 d 4 41 d 4 43 d 3 51 d 4 58 d 4 74 d 3
 83 d 4 85 d 3 99 d 4 117 d 4 99 d 3 100 d 4 72 d 4 38 d 3 -16 d 4 -45 d 4 -102 d 3 -111 d 4 -127 d 3 -115 d 4 -109 d 4 -94 d 3 -82 d 4 -71 d 4 -51 d 3 -48 d 4 -44 d 3 -34 d 4 -32 d 4 -21 d 3 -24 d 4 -16 d 4 -14 d 3 -15 d 4 -12 d 3 -9 d 4 -11 d 4 -7
 d 3 -6 d 4 -7 d 4 -4 d 3 -8 d 4 -2 d 3 -5 d 4 -3 d 4 -4 d 3 -4 d 4 -1 d 4 -2 d 3 -3 d 4 -2 d 4 -2 d 3 -1 d 4 -2 d 3 X 4 -3 d 4 -1 d 3 X 4 -1 d 4 -1 d 3 -1 d 4 X 3 -1 d 4 -1 d 4 -1 d 3 X 4 -1 d 4 X 3 -1 d 11 X 4 -1 d 3 -1 d 4 1 d 4 -1 d 3 1 d 4 -1 d
 3 -1 d 19 X 3 -1 d 4 1 d 3 -1 d 19 X 3 -1 d 4 1 d 4 X 3 -1 d 4 X 3 1 d 4 -1 d 4 1 d 3 -1 d 214 X 4 1 d 4 -1 d 3 1 d 4 -1 d 25 X 4 1 d 4 X 3 -1 d 4 1 d 3 X 4 -1 d 11 X 4 1 d 3 -1 d 4 X 3 1 d 400 X 3 1 d 4 X 3 -1 d 4 1 d 4 -1 d 3 1 d 4 X 4 -1 d 40 X 3
 1 d -1 Y -348 X -4 -1 d -3 1 d -11 X -4 -1 d -4 1 d -3 -1 d -4 1 d -3 X -4 -1 d -4 X -3 1 d -37 X -3 -1 d -4 X -4 1 d -3 -1 d -7 X -4 1 d -4 X -3 -1 d -4 1 d -4 -1 d -25 X -4 1 d -3 -1 d -15 X -3 -1 d -4 1 d -36 X -4 -1 d -4 1 d -25 X -4 -1 d -3 1 d
 -7 X -4 -1 d -4 1 d -3 -1 d -4 1 d -4 X -3 -1 d -4 1 d -3 -1 d -11 X -4 1 d -4 X -3 -1 d -4 X -3 1 d -4 X -4 -1 d -18 X -4 1 d -3 -1 d -4 1 d -3 -1 d -8 X -3 1 d -4 X -4 -1 d -3 1 d -7 X -4 -1 d -4 1 d -3 X -4 -1 d -4 1 d -3 -1 d -4 1 d -3 X -4 -1 d
 -4 X -3 1 d -8 X -3 -1 d -4 1 d -14 X -4 1 d -4 -1 d -3 1 d -4 -1 d -4 1 d -21 X -4 1 d -4 X -3 1 d -4 X -3 -1 d -4 1 d -7 X -4 1 d -7 X -4 1 d -3 1 d -4 -1 d -4 1 d -3 1 d -4 X -4 1 d -3 1 d -4 1 d -3 X -4 1 d -4 1 d -3 X -4 1 d -4 3 d -3 X -4 2 d
 -3 1 d -4 2 d -4 2 d -3 3 d -4 2 d -4 1 d -3 4 d -4 3 d -4 4 d -3 4 d -4 3 d -3 7 d -4 4 d -4 7 d -3 6 d -4 7 d -4 10 d -3 10 d -4 11 d -3 15 d -4 14 d -4 16 d -3 24 d -4 21 d -4 31 d -3 34 d -4 44 d -3 47 d -4 51 d -4 71 d -3 81 d -4 94 d -4 108 d
 -3 115 d -4 126 d -3 111 d -4 101 d -4 45 d -3 16 d -4 -38 d -4 -72 d -3 -100 d -4 -97 d -4 -117 d -3 -99 d -4 -84 d -3 -83 d -4 -73 d -4 -58 d -3 -52 d -4 -42 d -4 -41 d -3 -31 d -4 -31 d -3 -22 d -4 -24 d -4 -18 d -3 -18 d -4 -13 d -4 -15 d -3 -12
 d -4 -15 d -3 -5 d -4 -11 d -4 -10 d -3 -8 d -4 -6 d -4 -5 d -3 -4 d -4 -4 d -3 -5 d -4 -4 d -4 -1 d -3 -3 d -4 -3 d -4 -3 d -3 -2 d -4 -3 d -4 -2 d -3 -2 d -4 -1 d -3 -1 d -4 X -4 -2 d -3 -2 d -4 X -4 -2 d -3 X -4 -1 d -3 X -4 -3 d -7 X -4 -1 d -4
 -1 d -3 X -4 -1 d -3 -1 d -4 X -4 -1 d -3 -1 d -4 2 d -4 -1 d -3 -1 d -4 1 d -3 -1 d -4 X -4 -2 d -3 1 d -4 -2 d -4 2 d -3 X -4 -2 d -22 X -3 -1 d -4 1 d -4 -1 d -3 1 d -4 -1 d -3 -1 d -4 1 d -4 -2 d -3 1 d -4 -1 d -4 1 d -3 1 d -4 -1 d -7 X -4 -1 d
 -3 X -4 1 d -4 -1 d -3 -1 d -11 X -4 -1 d -3 X -4 -1 d -4 1 d -3 -1 d -7 X -4 -1 d -4 X -3 -1 d -4 -1 d -4 X -3 -1 d -4 X -4 -2 d -3 -1 d -4 -1 d -3 -1 d -283 X FA 3 lw 0.8 0 0 c 1 0 0 c 0.8 0 0 c 227 676 m 395 X 1 Y 4 X -1 Y 11 X 1 Y 51 X 1 Y 3 X
 -1 Y 7 X 1 Y 26 X 1 Y 22 X 1 Y 11 X 1 Y 3 X 1 Y 4 X -1 Y 3 X 1 Y 8 X 1 Y 3 X -1 Y 4 X 2 Y 7 X 1 Y 7 X 1 Y 4 X 2 Y 7 X 1 Y 4 X 1 Y 4 X 1 Y 3 X 1 Y 4 X 2 Y 3 X 2 Y 4 X 2 Y 4 X 3 Y 3 X 2 Y 4 X 2 Y 4 X 2 Y 3 X 2 Y 4 X 5 Y 3 X 6 Y 4 X 4 Y 4 X 6 Y 3 X 7 Y
 4 X 8 Y 4 X 9 Y 3 X 12 Y 4 X 9 Y 4 X 13 Y 3 X 16 Y 4 X 16 Y 3 X 19 Y 4 X 24 Y 4 X 28 Y 3 X 32 Y 4 X 34 Y 4 X 50 Y 3 X 56 Y 4 X 62 Y 3 X 74 Y 4 X 88 Y 4 X 106 Y 3 X 107 Y 4 X 125 Y 4 X 115 Y 3 X 96 Y 4 X 69 Y 3 X 20 Y 4 X -22 Y 4 X -62 Y 3 X -89 Y 4
 X -97 Y 4 X -114 Y 3 X -94 Y 4 X -93 Y 3 X -79 Y 4 X -76 Y 4 X -54 Y 3 X -53 Y 4 X -47 Y 4 X -37 Y 3 X -36 Y 4 X -26 Y 3 X -27 Y 4 X -20 Y 4 X -21 Y 3 X -13 Y 4 X -15 Y 4 X -14 Y 3 X -9 Y 4 X -13 Y 4 X -10 Y 3 X -9 Y 4 X -6 Y 3 X -5 Y 4 X -12 Y 4 X
 -5 Y 3 X -1 Y 4 X -8 Y 4 X -3 Y 3 X -4 Y 4 X -5 Y 3 X -1 Y 4 X -4 Y 4 X -3 Y 3 X -5 Y 4 X -1 Y 4 X -3 Y 3 X -2 Y 4 X -1 Y 3 X -2 Y 4 X -4 Y 4 X -1 Y 3 X -1 Y 4 X -4 Y 4 X 1 Y 3 X -1 Y 4 X -2 Y 3 X -1 Y 4 X -2 Y 4 X -1 Y 3 X -1 Y 4 X -2 Y 4 X -1 Y 7
 X -1 Y 4 X -1 Y 3 X -2 Y 7 X -2 Y 4 X 1 Y 7 X -3 Y 4 X 1 Y 11 X -2 Y 3 X -1 Y 8 X -1 Y 18 X -2 Y 7 X -1 Y 15 X -1 Y 14 X -1 Y 11 X -1 Y 11 X -1 Y 4 X 1 Y 3 X -1 Y 7 X -1 Y 8 X 1 Y 3 X -1 Y 4 X -1 Y 11 X -1 Y 3 X 1 Y 22 X -1 Y 15 X -1 Y 3 X 1 Y 8 X
 -1 Y 25 X -1 Y 18 X 1 Y 4 X -2 Y 3 X 1 Y 15 X -1 Y 4 X -1 Y 3 X 2 Y 4 X -1 Y 14 X -1 Y 4 X 1 Y 14 X -1 Y 11 X 1 Y 4 X -1 Y 54 X -1 Y 4 X 1 Y 7 X -1 Y 62 X -1 Y 4 X 1 Y 10 X -1 Y 4 X 1 Y 7 X -1 Y 4 X 1 Y 11 X -1 Y 14 X 1 Y 4 X -1 Y 7 X 1 Y 8 X -1 Y
 185 X -1 Y 10 X 1 Y 29 X -1 Y 8 X 1 Y 3 X -1 Y 15 X 1 Y 3 X -1 Y 11 X 1 Y 4 X -1 Y 69 X s 1 0 0 c 229 676 m20 232 676 m20 236 676 m20 239 676 m20 243 676 m20 247 676 m20 250 676 m20 254 676 m20 258 676 m20 261 676 m20 265 676 m20 268 676 m20 272 676
 m20 276 676 m20 279 676 m20 283 676 m20 287 676 m20 290 676 m20 294 676 m20 298 676 m20 301 676 m20 305 676 m20 308 676 m20 312 676 m20 316 676 m20 319 676 m20 323 676 m20 327 676 m20 330 676 m20 334 676 m20 337 676 m20 341 676 m20 345 676 m20 348
 676 m20 352 676 m20 356 676 m20 359 676 m20 363 676 m20 366 676 m20 370 676 m20 374 676 m20 377 676 m20 381 676 m20 385 676 m20 388 676 m20 392 676 m20 395 676 m20 399 676 m20 403 676 m20 406 676 m20 410 676 m20 414 676 m20 417 676 m20 421 676 m20
 425 676 m20 428 676 m20 432 676 m20 435 676 m20 439 676 m20 443 676 m20 446 676 m20 450 676 m20 454 676 m20 457 676 m20 461 676 m20 464 676 m20 468 676 m20 472 676 m20 475 676 m20 479 676 m20 483 676 m20 486 676 m20 490 676 m20 493 676 m20 497 676
 m20 501 676 m20 504 676 m20 508 676 m20 512 676 m20 515 676 m20 519 676 m20 522 676 m20 526 676 m20 530 676 m20 533 676 m20 537 676 m20 541 676 m20 544 676 m20 548 676 m20 552 676 m20 555 676 m20 559 676 m20 562 676 m20 566 676 m20 570 676 m20 573
 676 m20 577 676 m20 581 676 m20 584 676 m20 588 676 m20 591 676 m20 595 676 m20 599 676 m20 602 676 m20 606 676 m20 610 676 m20 613 676 m20 617 676 m20 620 676 m20 624 677 m20 628 676 m20 631 676 m20 635 676 m20 639 677 m20 642 677 m20 646 677 m20
 649 677 m20 653 677 m20 657 677 m20 660 677 m20 664 677 m20 668 677 m20 671 677 m20 675 677 m20 679 677 m20 682 677 m20 686 677 m20 689 678 m20 693 677 m20 697 677 m20 700 678 m20 704 678 m20 708 678 m20 711 678 m20 715 678 m20 718 678 m20 722 678
 m20 726 679 m20 729 679 m20 733 679 m20 737 679 m20 740 679 m20 744 679 m20 747 680 m20 751 680 m20 755 680 m20 758 681 m20 762 682 m20 766 681 m20 769 682 m20 773 682 m20 776 683 m20 780 682 m20 784 684 m20 787 684 m20 791 685 m20 795 685 m20 798
 686 m20 802 688 m20 805 688 m20 809 689 m20 813 690 m20 816 691 m20 820 692 m20 824 694 m20 827 696 m20 831 698 m20 835 701 m20 838 703 m20 842 705 m20 845 707 m20 849 709 m20 853 714 m20 856 720 m20 860 724 m20 864 730 m20 867 737 m20 871 745 m20
 874 754 m20 878 766 m20 882 775 m20 885 788 m20 889 804 m20 893 820 m20 896 839 m20 900 863 m20 903 891 m20 907 923 m20 911 957 m20 914 1007 m20 918 1063 m20 922 1125 m20 925 1199 m20 929 1287 m20 932 1393 m20 936 1500 m20 940 1625 m20 943 1740 m20
 947 1836 m20 951 1905 m20 954 1925 m20 958 1903 m20 962 1841 m20 965 1752 m20 969 1655 m20 972 1541 m20 976 1447 m20 980 1354 m20 983 1275 m20 987 1199 m20 991 1145 m20 994 1092 m20 998 1045 m20 1001 1008 m20 1005 972 m20 1009 946 m20 1012 919 m20
 1016 899 m20 1020 878 m20 1023 865 m20 1027 850 m20 1030 836 m20 1034 827 m20 1038 814 m20 1041 804 m20 1045 795 m20 1049 789 m20 1052 784 m20 1056 772 m20 1059 767 m20 1063 766 m20 1067 758 m20 1070 755 m20 1074 751 m20 1078 746 m20 1081 745 m20
 1085 741 m20 1089 738 m20 1092 733 m20 1096 732 m20 1099 729 m20 1103 727 m20 1107 726 m20 1110 724 m20 1114 720 m20 1118 719 m20 1121 718 m20 1125 714 m20 1128 715 m20 1132 714 m20 1136 712 m20 1139 711 m20 1143 709 m20 1147 708 m20 1150 707 m20
 1154 705 m20 1157 704 m20 1161 704 m20 1165 703 m20 1168 702 m20 1172 700 m20 1176 700 m20 1179 698 m20 1183 699 m20 1186 699 m20 1190 696 m20 1194 697 m20 1197 697 m20 1201 697 m20 1205 695 m20 1208 694 m20 1212 694 m20 1215 693 m20 1219 693 m20
 1223 693 m20 1226 693 m20 1230 693 m20 1234 691 m20 1237 691 m20 1241 690 m20 1245 690 m20 1248 690 m20 1252 690 m20 1255 689 m20 1259 689 m20 1263 689 m20 1266 689 m20 1270 688 m20 1274 688 m20 1277 688 m20 1281 687 m20 1284 687 m20 1288 687 m20
 1292 686 m20 1295 687 m20 1299 686 m20 1303 686 m20 1306 685 m20 1310 685 m20 1313 686 m20 1317 685 m20 1321 684 m20 1324 684 m20 1328 684 m20 1332 683 m20 1335 684 m20 1339 684 m20 1342 684 m20 1346 684 m20 1350 684 m20 1353 684 m20 1357 683 m20
 1361 683 m20 1364 683 m20 1368 683 m20 1372 682 m20 1375 683 m20 1379 683 m20 1382 682 m20 1386 682 m20 1390 682 m20 1393 682 m20 1397 682 m20 1401 682 m20 1404 682 m20 1408 681 m20 1411 681 m20 1415 681 m20 1419 681 m20 1422 681 m20 1426 682 m20
 1430 680 m20 1433 681 m20 1437 681 m20 1440 681 m20 1444 681 m20 1448 680 m20 1451 679 m20 1455 681 m20 1459 680 m20 1462 680 m20 1466 680 m20 1469 680 m20 1473 679 m20 1477 680 m20 1480 680 m20 1484 680 m20 1488 680 m20 1491 679 m20 1495 679 m20
 1499 679 m20 1502 680 m20 1506 679 m20 1509 679 m20 1513 679 m20 1517 679 m20 1520 679 m20 1524 679 m20 1528 679 m20 1531 679 m20 1535 679 m20 1538 679 m20 1542 679 m20 1546 679 m20 1549 679 m20 1553 679 m20 1557 679 m20 1560 678 m20 1564 679 m20
 1567 679 m20 1571 678 m20 1575 678 m20 1578 678 m20 1582 678 m20 1586 678 m20 1589 678 m20 1593 678 m20 1596 678 m20 1600 678 m20 1604 678 m20 1607 678 m20 1611 678 m20 1615 678 m20 1618 678 m20 1622 678 m20 1625 678 m20 1629 678 m20 1633 677 m20
 1636 678 m20 1640 678 m20 1644 678 m20 1647 677 m20 1651 678 m20 1655 678 m20 1658 677 m20 1662 678 m20 1665 678 m20 1669 678 m20 1673 677 m20 1676 677 m20 1680 677 m20 1684 677 m20 1687 678 m20 1691 677 m20 1694 677 m20 1698 678 m20 1702 678 m20
 1705 677 m20 1709 677 m20 1713 677 m20 1716 677 m20 1720 677 m20 1723 677 m20 1727 677 m20 1731 677 m20 1734 677 m20 1738 677 m20 1742 677 m20 1745 677 m20 1749 677 m20 1752 677 m20 1756 677 m20 1760 677 m20 1763 677 m20 1767 677 m20 1771 677 m20
 1774 677 m20 1778 677 m20 1782 677 m20 1785 677 m20 1789 677 m20 1792 677 m20 1796 677 m20 1800 677 m20 1803 677 m20 1807 677 m20 1811 677 m20 1814 677 m20 1818 677 m20 1821 677 m20 1825 677 m20 1829 677 m20 1832 677 m20 1836 677 m20 1840 677 m20
 1843 677 m20 1847 677 m20 1850 677 m20 1854 677 m20 1858 677 m20 1861 677 m20 1865 677 m20 1869 677 m20 1872 677 m20 1876 677 m20 1879 677 m20 1883 677 m20 1887 677 m20 1890 676 m20 1894 676 m20 1898 676 m20 1901 677 m20 1905 677 m20 1909 677 m20
 1912 677 m20 1916 677 m20 1919 677 m20 1923 677 m20 1927 677 m20 1930 676 m20 1934 676 m20 1938 677 m20 1941 676 m20 1945 676 m20 1948 676 m20 1952 676 m20 1956 677 m20 1959 676 m20 1963 676 m20 1967 676 m20 1970 677 m20 1974 676 m20 1977 676 m20
 1981 676 m20 1985 676 m20 1988 676 m20 1992 676 m20 1996 676 m20 1999 676 m20 2003 676 m20 2006 676 m20 2010 676 m20 2014 676 m20 2017 676 m20 2021 676 m20 2025 676 m20 2028 676 m20 2032 676 m20 2036 676 m20 2039 676 m20 0.8 0 0 c black 0.8 0 0 c cs
 0.8 0 0 P13 setcolor 229 676 m 391 X 4 1 d 4 -1 d 3 X 4 1 d 51 X 3 1 d 22 X 4 1 d 3 -1 d 4 1 d 18 X 4 1 d 7 X 4 1 d 3 X 4 1 d 7 X 4 1 d 7 X 4 1 d 3 X 4 1 d 4 X 3 1 d 4 2 d 3 1 d 4 1 d 4 1 d 3 X 4 2 d 4 2 d 3 2 d 4 1 d 4 3 d 3 3 d 4 2 d 3 2 d 4 2 d 4
 5 d 3 5 d 4 5 d 4 6 d 3 7 d 4 8 d 3 10 d 4 11 d 4 9 d 3 13 d 4 17 d 4 16 d 3 19 d 4 23 d 3 28 d 4 33 d 4 34 d 3 50 d 4 56 d 4 63 d 3 74 d 4 88 d 3 106 d 4 107 d 4 126 d 3 115 d 4 96 d 4 69 d 3 20 d 4 -21 d 4 -63 d 3 -89 d 4 -97 d 3 -114 d 4 -95 d 4
 -93 d 3 -79 d 4 -76 d 4 -54 d 3 -53 d 4 -48 d 3 -37 d 4 -36 d 4 -26 d 3 -27 d 4 -20 d 4 -21 d 3 -13 d 4 -15 d 3 -14 d 4 -10 d 4 -13 d 3 -9 d 4 -10 d 4 -6 d 3 -5 d 4 -12 d 3 -5 d 4 -1 d 4 -8 d 3 -3 d 4 -4 d 4 -5 d 3 -1 d 4 -4 d 4 -3 d 3 -5 d 4 -2 d 3
 -2 d 4 -2 d 4 -1 d 3 -2 d 4 -4 d 4 -1 d 3 -2 d 4 -3 d 3 1 d 4 -2 d 4 -2 d 3 -1 d 4 -2 d 4 X 3 -2 d 4 -1 d 3 -2 d 8 X 3 -1 d 4 -2 d 4 X 3 -2 d 4 1 d 3 -1 d 4 -2 d 11 X 4 -1 d 3 -1 d 4 X 3 -2 d 4 1 d 4 -1 d 7 X 4 -2 d 3 1 d 4 -1 d 4 X 3 -1 d 4 X 3 -1
 d 15 X 4 -1 d 3 X 4 -1 d 18 X 4 -1 d 7 X 3 1 d 4 -2 d 4 X 3 -1 d 4 1 d 4 -1 d 7 X 3 1 d 4 -1 d 11 X 4 -1 d 21 X 4 -1 d 25 X 4 -1 d 4 1 d 3 -1 d 4 1 d 4 -2 d 3 1 d 15 X 3 -2 d 4 2 d 4 -1 d 7 X 3 1 d 4 -1 d 15 X 3 -1 d 4 1 d 4 -1 d 3 1 d 4 -1 d 3 1 d
 4 -1 d 4 1 d 3 -1 d 37 X 3 -1 d 4 1 d 3 X 4 -1 d 4 1 d 7 X 4 -1 d 3 X 4 1 d 3 -1 d 4 1 d 4 -1 d 69 X 3 -1 d 4 1 d 22 X 3 -1 d 8 X 3 1 d 4 -1 d 207 X 3 -1 d 4 1 d 7 X 4 -1 d 3 1 d 22 X 4 -1 d 3 1 d 4 -1 d 15 X 3 1 d 4 -1 d 11 X 3 1 d 4 -1 d 18 X -109
 X -3 1 d -4 -1 d -7 X -4 1 d -11 X -3 -1 d -8 X -3 1 d -11 X -4 -1 d -3 1 d -167 X -4 1 d -4 -1 d -21 X -4 1 d -4 -1 d -3 1 d -4 -1 d -3 1 d -4 X -4 -1 d -3 1 d -4 X -4 -1 d -3 X -4 1 d -4 -1 d -3 1 d -65 X -4 1 d -11 X -4 -1 d -3 1 d -44 X -3 1 d
 -8 X -3 -1 d -4 X -4 1 d -14 X -4 -1 d -3 1 d -4 1 d -4 -1 d -3 X -4 1 d -3 -1 d -4 1 d -4 -1 d -3 1 d -15 X -3 1 d -4 -1 d -4 1 d -3 X -4 -1 d -4 1 d -3 1 d -4 -1 d -14 X -4 1 d -11 X -4 1 d -3 -1 d -7 X -4 1 d -4 -1 d -3 1 d -4 X -4 2 d -3 -1 d -7
 X -4 1 d -15 X -3 1 d -4 X -3 1 d -8 X -3 1 d -4 X -4 -1 d -3 1 d -4 1 d -7 X -4 1 d -3 -1 d -4 2 d -7 X -4 1 d -4 -1 d -3 2 d -7 X -4 2 d -11 X -4 2 d -3 1 d -4 -1 d -3 2 d -4 X -4 1 d -3 2 d -8 X -3 2 d -4 1 d -3 2 d -4 X -4 2 d -3 1 d -4 2 d -4 2
 d -3 -1 d -4 3 d -3 2 d -4 X -4 4 d -3 2 d -4 1 d -4 2 d -3 3 d -4 1 d -3 5 d -4 4 d -4 3 d -3 1 d -4 5 d -4 4 d -3 3 d -4 8 d -4 1 d -3 5 d -4 12 d -3 4 d -4 7 d -4 9 d -3 10 d -4 12 d -4 10 d -3 14 d -4 14 d -3 13 d -4 21 d -4 20 d -3 27 d -4 26 d
 -4 36 d -3 36 d -4 48 d -3 53 d -4 54 d -4 75 d -3 79 d -4 92 d -4 95 d -3 113 d -4 97 d -3 88 d -4 63 d -4 21 d -3 -19 d -4 -69 d -4 -96 d -3 -115 d -4 -125 d -4 -106 d -3 -106 d -4 -87 d -3 -74 d -4 -63 d -4 -55 d -3 -50 d -4 -34 d -4 -32 d -3 -28
 d -4 -23 d -3 -19 d -4 -16 d -4 -16 d -3 -14 d -4 -8 d -4 -12 d -3 -9 d -4 -8 d -3 -7 d -4 -6 d -4 -4 d -3 -5 d -4 -6 d -4 -1 d -3 -2 d -4 -3 d -3 -2 d -4 -3 d -4 -2 d -3 -1 d -4 -2 d -4 -2 d -3 X -4 -1 d -4 -1 d -3 -1 d -4 -1 d -3 -2 d -4 X -4 -1 d
 -3 X -4 -1 d -4 1 d -3 -1 d -4 X -3 -1 d -4 X -4 -1 d -7 X -4 -1 d -14 X -4 -1 d -18 X -3 -1 d -4 1 d -4 X -3 -1 d -51 X -4 -1 d -3 1 d -4 -1 d -406 X FA 0 0.4 0 c 1 1 1 c 0.35 0.83 0.33 c 0 0.4 0 c 227 676 m 286 X 1 Y 4 X 1 Y 4 X 2 Y 3 X 1 Y 4 X 1
 Y 4 X 1 Y 3 X 1 Y 7 X 1 Y 11 X 1 Y 4 X -2 Y 4 X 1 Y 3 X 1 Y 4 X -1 Y 7 X 1 Y 4 X -1 Y 3 X 1 Y 4 X -1 Y 4 X 1 Y 3 X -1 Y 7 X 1 Y 8 X -1 Y 3 X 2 Y 4 X 1 Y 4 X -2 Y 3 X 1 Y 4 X -1 Y 4 X -1 Y 3 X 1 Y 7 X 1 Y 11 X 1 Y 4 X -1 Y 14 X 1 Y 4 X -1 Y 7 X -1 Y
 4 X 3 Y 7 X -1 Y 11 X 1 Y 4 X -1 Y 3 X 2 Y 11 X 1 Y 4 X -1 Y 7 X 1 Y 4 X -1 Y 3 X 1 Y 4 X 1 Y 11 X 3 Y 4 X 1 Y 3 X -1 Y 7 X 2 Y 4 X 1 Y 4 X 1 Y 7 X 1 Y 4 X -1 Y 3 X 4 Y 11 X 3 Y 4 X 1 Y 3 X 2 Y 4 X 2 Y 4 X 2 Y 3 X 2 Y 4 X 4 Y 3 X 1 Y 4 X 3 Y 4 X 5 Y
 3 X 3 Y 4 X 5 Y 4 X 2 Y 3 X 3 Y 4 X 8 Y 3 X 8 Y 4 X 8 Y 4 X 10 Y 3 X 6 Y 4 X 13 Y 4 X 13 Y 3 X 15 Y 4 X 13 Y 4 X 18 Y 3 X 19 Y 4 X 19 Y 3 X 23 Y 4 X 30 Y 4 X 28 Y 3 X 44 Y 4 X 39 Y 4 X 50 Y 3 X 60 Y 4 X 69 Y 3 X 85 Y 4 X 85 Y 4 X 102 Y 3 X 112 Y 4 X
 106 Y 4 X 102 Y 3 X 81 Y 4 X 36 Y 3 X -9 Y 4 X -47 Y 4 X -88 Y 3 X -105 Y 4 X -125 Y 4 X -114 Y 3 X -105 Y 4 X -95 Y 3 X -83 Y 4 X -73 Y 4 X -53 Y 3 X -45 Y 4 X -47 Y 4 X -34 Y 3 X -31 Y 4 X -23 Y 3 X -25 Y 4 X -14 Y 4 X -18 Y 3 X -14 Y 4 X -12 Y 4
 X -11 Y 3 X -9 Y 4 X -7 Y 4 X -8 Y 3 X -7 Y 4 X -6 Y 3 X -6 Y 4 X -5 Y 4 X -4 Y 3 X -2 Y 4 X -5 Y 4 X -3 Y 3 X -2 Y 4 X -2 Y 3 X -3 Y 4 X -2 Y 4 X -3 Y 3 X -2 Y 4 X -1 Y 4 X -2 Y 3 X -1 Y 4 X -1 Y 3 X -1 Y 4 X -2 Y 4 X -1 Y 7 X -1 Y 4 X -1 Y 3 X -1
 Y 7 X -1 Y 4 X -1 Y 11 X -1 Y 4 X -1 Y 11 X -1 Y 7 X -1 Y 3 X 1 Y 4 X -1 Y 4 X -1 Y 21 X -1 Y 4 X 1 Y 4 X -1 Y 21 X -1 Y 8 X 1 Y 3 X -1 Y 18 X -1 Y 4 X 1 Y 11 X -1 Y 11 X 1 Y 7 X -1 Y 7 X 1 Y 4 X -1 Y 142 X 1 Y 3 X -1 Y 36 X 1 Y 4 X -1 Y 33 X 1 Y 3
 X -1 Y 4 X 1 Y 7 X -1 Y 15 X 1 Y 3 X -1 Y 11 X 1 Y 15 X -1 Y 3 X 1 Y 4 X -1 Y 4 X 1 Y 355 X 1 Y 4 X -1 Y 83 X 1 Y 4 X s 0.35 0.83 0.33 c 229 676 m20 232 676 m20 236 676 m20 239 676 m20 243 676 m20 247 676 m20 250 676 m20 254 676 m20 258 676 m20 261
 676 m20 265 676 m20 268 676 m20 272 676 m20 276 676 m20 279 676 m20 283 676 m20 287 676 m20 290 676 m20 294 676 m20 298 676 m20 301 676 m20 305 676 m20 308 676 m20 312 676 m20 316 676 m20 319 676 m20 323 676 m20 327 676 m20 330 676 m20 334 676 m20
 337 676 m20 341 676 m20 345 676 m20 348 676 m20 352 676 m20 356 676 m20 359 676 m20 363 676 m20 366 676 m20 370 676 m20 374 676 m20 377 676 m20 381 676 m20 385 676 m20 388 676 m20 392 676 m20 395 676 m20 399 676 m20 403 676 m20 406 676 m20 410 676
 m20 414 676 m20 417 676 m20 421 676 m20 425 676 m20 428 676 m20 432 676 m20 435 676 m20 439 676 m20 443 676 m20 446 676 m20 450 676 m20 454 676 m20 457 676 m20 461 676 m20 464 676 m20 468 676 m20 472 676 m20 475 676 m20 479 676 m20 483 676 m20 486
 676 m20 490 676 m20 493 676 m20 497 676 m20 501 676 m20 504 676 m20 508 676 m20 512 676 m20 515 677 m20 519 678 m20 522 680 m20 526 681 m20 530 682 m20 533 683 m20 537 684 m20 541 684 m20 544 685 m20 548 685 m20 552 685 m20 555 686 m20 559 684 m20
 562 685 m20 566 686 m20 570 685 m20 573 685 m20 577 686 m20 581 685 m20 584 686 m20 588 685 m20 591 686 m20 595 685 m20 599 685 m20 602 686 m20 606 686 m20 610 685 m20 613 687 m20 617 688 m20 620 686 m20 624 687 m20 628 686 m20 631 685 m20 635 686
 m20 639 686 m20 642 687 m20 646 687 m20 649 687 m20 653 688 m20 657 687 m20 660 687 m20 664 687 m20 668 687 m20 671 688 m20 675 687 m20 679 687 m20 682 686 m20 686 689 m20 689 689 m20 693 688 m20 697 688 m20 700 688 m20 704 689 m20 708 688 m20 711
 690 m20 715 690 m20 718 690 m20 722 691 m20 726 690 m20 729 690 m20 733 691 m20 737 690 m20 740 691 m20 744 692 m20 747 692 m20 751 692 m20 755 695 m20 758 696 m20 762 695 m20 766 695 m20 769 697 m20 773 698 m20 776 699 m20 780 699 m20 784 700 m20
 787 699 m20 791 703 m20 795 703 m20 798 703 m20 802 706 m20 805 707 m20 809 709 m20 813 711 m20 816 713 m20 820 715 m20 824 719 m20 827 720 m20 831 723 m20 835 728 m20 838 731 m20 842 736 m20 845 738 m20 849 741 m20 853 749 m20 856 757 m20 860 765
 m20 864 775 m20 867 781 m20 871 794 m20 874 807 m20 878 822 m20 882 835 m20 885 853 m20 889 872 m20 893 891 m20 896 914 m20 900 944 m20 903 972 m20 907 1016 m20 911 1055 m20 914 1105 m20 918 1165 m20 922 1234 m20 925 1319 m20 929 1404 m20 932 1506
 m20 936 1618 m20 940 1724 m20 943 1826 m20 947 1907 m20 951 1943 m20 954 1934 m20 958 1887 m20 962 1799 m20 965 1694 m20 969 1569 m20 972 1455 m20 976 1350 m20 980 1255 m20 983 1172 m20 987 1099 m20 991 1046 m20 994 1001 m20 998 954 m20 1001 920 m20
 1005 889 m20 1009 866 m20 1012 841 m20 1016 827 m20 1020 809 m20 1023 795 m20 1027 783 m20 1030 772 m20 1034 763 m20 1038 756 m20 1041 748 m20 1045 741 m20 1049 735 m20 1052 729 m20 1056 724 m20 1059 720 m20 1063 718 m20 1067 713 m20 1070 710 m20
 1074 708 m20 1078 706 m20 1081 703 m20 1085 701 m20 1089 698 m20 1092 696 m20 1096 695 m20 1099 693 m20 1103 692 m20 1107 691 m20 1110 690 m20 1114 688 m20 1118 687 m20 1121 687 m20 1125 686 m20 1128 685 m20 1132 684 m20 1136 684 m20 1139 683 m20
 1143 682 m20 1147 682 m20 1150 682 m20 1154 681 m20 1157 680 m20 1161 680 m20 1165 680 m20 1168 679 m20 1172 679 m20 1176 678 m20 1179 679 m20 1183 678 m20 1186 677 m20 1190 677 m20 1194 677 m20 1197 677 m20 1201 677 m20 1205 677 m20 1208 676 m20
 1212 677 m20 1215 676 m20 1219 676 m20 1223 676 m20 1226 676 m20 1230 676 m20 1234 676 m20 1237 675 m20 1241 675 m20 1245 676 m20 1248 675 m20 1252 675 m20 1255 675 m20 1259 675 m20 1263 675 m20 1266 674 m20 1270 675 m20 1274 675 m20 1277 675 m20
 1281 674 m20 1284 674 m20 1288 674 m20 1292 675 m20 1295 675 m20 1299 674 m20 1303 674 m20 1306 675 m20 1310 674 m20 1313 674 m20 1317 674 m20 1321 674 m20 1324 674 m20 1328 674 m20 1332 674 m20 1335 674 m20 1339 674 m20 1342 674 m20 1346 674 m20
 1350 674 m20 1353 674 m20 1357 674 m20 1361 674 m20 1364 674 m20 1368 674 m20 1372 674 m20 1375 674 m20 1379 674 m20 1382 674 m20 1386 674 m20 1390 674 m20 1393 674 m20 1397 674 m20 1401 674 m20 1404 674 m20 1408 674 m20 1411 674 m20 1415 674 m20
 1419 674 m20 1422 674 m20 1426 674 m20 1430 674 m20 1433 674 m20 1437 674 m20 1440 674 m20 1444 674 m20 1448 674 m20 1451 675 m20 1455 674 m20 1459 674 m20 1462 674 m20 1466 674 m20 1469 674 m20 1473 674 m20 1477 674 m20 1480 674 m20 1484 674 m20
 1488 674 m20 1491 675 m20 1495 674 m20 1499 674 m20 1502 674 m20 1506 674 m20 1509 674 m20 1513 674 m20 1517 674 m20 1520 674 m20 1524 674 m20 1528 675 m20 1531 674 m20 1535 675 m20 1538 675 m20 1542 674 m20 1546 674 m20 1549 674 m20 1553 674 m20
 1557 675 m20 1560 674 m20 1564 674 m20 1567 674 m20 1571 675 m20 1575 675 m20 1578 675 m20 1582 675 m20 1586 674 m20 1589 675 m20 1593 674 m20 1596 675 m20 1600 675 m20 1604 675 m20 1607 675 m20 1611 675 m20 1615 675 m20 1618 675 m20 1622 675 m20
 1625 675 m20 1629 675 m20 1633 675 m20 1636 675 m20 1640 675 m20 1644 675 m20 1647 675 m20 1651 675 m20 1655 675 m20 1658 675 m20 1662 675 m20 1665 675 m20 1669 675 m20 1673 675 m20 1676 675 m20 1680 675 m20 1684 675 m20 1687 675 m20 1691 675 m20
 1694 675 m20 1698 675 m20 1702 675 m20 1705 675 m20 1709 675 m20 1713 675 m20 1716 675 m20 1720 675 m20 1723 675 m20 1727 675 m20 1731 675 m20 1734 675 m20 1738 675 m20 1742 675 m20 1745 675 m20 1749 675 m20 1752 675 m20 1756 675 m20 1760 675 m20
 1763 675 m20 1767 675 m20 1771 675 m20 1774 675 m20 1778 675 m20 1782 675 m20 1785 675 m20 1789 675 m20 1792 675 m20 1796 675 m20 1800 675 m20 1803 675 m20 1807 675 m20 1811 675 m20 1814 675 m20 1818 675 m20 1821 675 m20 1825 675 m20 1829 675 m20
 1832 675 m20 1836 675 m20 1840 675 m20 1843 675 m20 1847 675 m20 1850 675 m20 1854 675 m20 1858 675 m20 1861 675 m20 1865 675 m20 1869 675 m20 1872 675 m20 1876 675 m20 1879 675 m20 1883 675 m20 1887 675 m20 1890 675 m20 1894 675 m20 1898 675 m20
 1901 675 m20 1905 675 m20 1909 675 m20 1912 675 m20 1916 675 m20 1919 675 m20 1923 675 m20 1927 675 m20 1930 675 m20 1934 675 m20 1938 675 m20 1941 675 m20 1945 675 m20 1948 675 m20 1952 676 m20 1956 675 m20 1959 675 m20 1963 675 m20 1967 675 m20
 1970 675 m20 1974 675 m20 1977 675 m20 1981 675 m20 1985 675 m20 1988 675 m20 1992 675 m20 1996 675 m20 1999 675 m20 2003 675 m20 2006 675 m20 2010 675 m20 2014 675 m20 2017 675 m20 2021 675 m20 2025 675 m20 2028 675 m20 2032 675 m20 2036 675 m20
 2039 676 m20 0 0.4 0 c black 0 0.4 0 c cs 0 0.4 0 P13 setcolor 229 676 m 279 X 4 1 d 3 X 4 2 d 3 1 d 4 2 d 4 1 d 3 1 d 4 1 d 4 X 3 1 d 8 X 3 1 d 4 -2 d 3 1 d 4 1 d 4 -1 d 3 X 4 2 d 4 -2 d 3 1 d 4 -1 d 3 1 d 4 -1 d 4 1 d 7 X 4 -1 d 3 2 d 4 2 d 3 -3 d
 4 1 d 4 -1 d 3 -1 d 4 1 d 4 X 3 1 d 7 X 4 1 d 4 -1 d 11 X 3 1 d 4 -1 d 4 X 3 -1 d 4 3 d 3 X 4 -1 d 7 X 4 1 d 4 -1 d 3 2 d 7 X 4 1 d 4 -1 d 3 X 4 1 d 4 -1 d 3 1 d 4 1 d 7 X 4 3 d 3 1 d 4 -1 d 4 X 3 3 d 4 X 3 1 d 4 X 4 2 d 3 -2 d 4 4 d 7 X 4 3 d 3 1 d
 4 2 d 4 3 d 3 1 d 4 2 d 4 4 d 3 2 d 4 3 d 4 4 d 3 3 d 4 6 d 3 1 d 4 3 d 4 9 d 3 8 d 4 7 d 4 11 d 3 6 d 4 13 d 3 13 d 4 15 d 4 13 d 3 18 d 4 19 d 4 19 d 3 23 d 4 30 d 3 29 d 4 44 d 4 38 d 3 51 d 4 60 d 4 69 d 3 85 d 4 85 d 3 103 d 4 111 d 4 108 d 3
 101 d 4 81 d 4 37 d 3 -9 d 4 -48 d 4 -88 d 3 -105 d 4 -125 d 3 -114 d 4 -106 d 4 -95 d 3 -84 d 4 -73 d 4 -53 d 3 -45 d 4 -47 d 3 -34 d 4 -31 d 4 -24 d 3 -25 d 4 -14 d 4 -18 d 3 -14 d 4 -12 d 3 -11 d 4 -9 d 4 -7 d 3 -8 d 4 -8 d 4 -5 d 3 -7 d 4 -4 d 3
 -5 d 4 -2 d 4 -5 d 3 -3 d 4 -2 d 4 -2 d 3 -2 d 4 -3 d 4 -2 d 3 -2 d 4 -2 d 3 -2 d 4 -1 d 4 -1 d 3 -1 d 4 -1 d 4 -1 d 3 -1 d 4 X 3 -1 d 4 -2 d 4 X 3 -1 d 4 -1 d 4 1 d 3 -1 d 4 -1 d 3 X 4 -1 d 4 X 3 -1 d 4 X 4 -1 d 3 1 d 4 -1 d 3 -1 d 19 X 3 -1 d 4 1
 d 3 -1 d 19 X 3 -1 d 4 X 4 1 d 3 -1 d 15 X 3 -1 d 4 1 d 7 X 4 -1 d 7 X 4 1 d 3 X 4 -1 d 4 X 3 1 d 4 -1 d 116 X 4 1 d 3 -1 d 15 X 3 1 d 4 -1 d 7 X 4 1 d 3 -1 d 19 X 3 1 d 4 -1 d 4 1 d 3 -1 d 15 X 3 1 d 8 X 3 -1 d 4 1 d 3 X 4 -1 d 11 X 4 1 d 3 -1 d 4
 X 3 1 d 22 X 4 -1 d 3 1 d 352 X 4 1 d 4 -1 d 11 X 3 1 d 4 -1 d 14 X 4 1 d 4 -1 d 10 X 4 1 d 4 -1 d 22 X 3 1 d -1 Y -374 X -3 -1 d -4 1 d -51 X -3 -1 d -4 1 d -4 X -3 -1 d -7 X -4 1 d -11 X -4 -1 d -7 X -3 1 d -4 -1 d -11 X -4 1 d -3 X -4 -1 d -221 X
 -4 1 d -3 -1 d -4 X -4 1 d -3 X -4 -1 d -7 X -4 1 d -7 X -4 -1 d -3 1 d -15 X -3 1 d -4 -1 d -4 X -3 1 d -19 X -3 1 d -4 -1 d -3 1 d -19 X -3 1 d -4 1 d -3 -1 d -4 1 d -4 X -3 1 d -8 X -3 1 d -4 X -3 1 d -4 X -4 1 d -3 X -4 1 d -4 1 d -3 1 d -4 1 d
 -3 X -4 1 d -4 2 d -3 X -4 2 d -4 1 d -3 2 d -4 1 d -3 2 d -4 2 d -4 3 d -3 2 d -4 2 d -4 2 d -3 3 d -4 5 d -4 2 d -3 5 d -4 4 d -3 6 d -4 6 d -4 7 d -3 8 d -4 8 d -4 8 d -3 11 d -4 12 d -3 14 d -4 18 d -4 13 d -3 26 d -4 23 d -4 30 d -3 34 d -4 47
 d -3 44 d -4 53 d -4 73 d -3 83 d -4 95 d -4 105 d -3 114 d -4 124 d -3 105 d -4 88 d -4 47 d -3 9 d -4 -37 d -4 -80 d -3 -102 d -4 -106 d -4 -111 d -3 -103 d -4 -84 d -3 -86 d -4 -68 d -4 -60 d -3 -50 d -4 -39 d -4 -43 d -3 -29 d -4 -30 d -3 -22 d
 -4 -19 d -4 -19 d -3 -18 d -4 -13 d -4 -15 d -3 -13 d -4 -12 d -3 -6 d -4 -10 d -4 -8 d -3 -8 d -4 -9 d -4 -3 d -3 -1 d -4 -5 d -3 -4 d -4 -4 d -4 -3 d -3 -2 d -4 -3 d -4 -2 d -3 -2 d -4 -2 d -4 -2 d -3 -2 d -4 -2 d -3 -1 d -4 X -4 -3 d -3 1 d -4 -1
 d -4 X -3 -1 d -4 -1 d -3 -2 d -8 X -3 -1 d -4 -2 d -7 X -4 -1 d -3 -1 d -4 1 d -4 -1 d -3 X -4 1 d -4 -1 d -7 X -3 -2 d -4 1 d -4 -1 d -7 X -4 1 d -3 X -4 -3 d -3 2 d -4 -1 d -4 1 d -3 -1 d -26 X -3 -1 d -4 X -4 -1 d -3 1 d -4 1 d -4 -1 d -3 2 d -4
 -2 d -3 -1 d -4 X -4 1 d -3 -1 d -4 X -4 1 d -3 -1 d -7 X -4 1 d -4 -1 d -11 X -3 -1 d -4 2 d -3 -2 d -4 1 d -4 X -3 -1 d -4 X -4 -1 d -3 -1 d -4 -1 d -4 -1 d -3 -1 d -4 -2 d -286 X FA black 1 1 1 c 567 470 1587 1550 bf black 1587 1550 m 567 X s
 2154 1550 m 470 Y s 2154 2020 m -567 X s 1587 2020 m -470 Y s
 gsave  2268 1568 0 609 C 1728.33 1918.25 t 0 r /Helvetica findfont 72.27 sf 0 0 m (No Int) show NC gr  0.8 0 0 c 1609 1941 m 99 X s black
 gsave  2268 1568 0 609 C 1728.33 1758.71 t 0 r /Helvetica findfont 72.27 sf 0 0 m (With Int) show NC gr  0 0 1 c 1609 1785 m 99 X s black
 gsave  2268 1568 0 609 C 1728.33 1610.57 t 0 r /Helvetica findfont 72.27 sf 0 0 m (Reweighted) show NC gr  0 0.4 0 c 1609 1628 m 99 X s black
 gsave  2268 1568 0 609 C 2222.13 1747.32 t 90 r /Helvetica-BoldOblique findfont 30.4295 sf 0 0 m (LHC HIGGS XS WG 2013) show NC gr  1 1 1 c 2268 609 0 0 bf black 1 1 1 c 1814 457 227 152 bf black 1814 457 227 152 bl 1 1 1 c black 227 152 m 178 X 457
 Y 3 X -457 Y 4 X 24 Y 3 X -24 Y 4 X 457 Y 4 X -304 Y 3 X -17 Y 4 X 205 Y 4 X 116 Y 7 X -310 Y 3 X -74 Y 4 X 32 Y 4 X 90 Y 3 X -35 Y 4 X 138 Y 4 X -79 Y 3 X 60 Y 4 X 178 Y 3 X -284 Y 4 X 29 Y 4 X -112 Y 3 X 367 Y 4 X -268 Y 4 X 268 Y 3 X -216 Y 4 X
 216 Y 4 X -319 Y 3 X 146 Y 4 X -3 Y 3 X 49 Y 4 X -126 Y 4 X -6 Y 3 X 28 Y 4 X -11 Y 4 X -1 Y 3 X -10 Y 4 X 19 Y 3 X -20 Y 4 X 18 Y 4 X 27 Y 3 X -31 Y 4 X 69 Y 4 X -32 Y 3 X -13 Y 4 X 16 Y 3 X 20 Y 4 X -31 Y 4 X 50 Y 3 X -26 Y 4 X 16 Y 4 X 6 Y 3 X 42
 Y 4 X -35 Y 3 X -16 Y 4 X 44 Y 4 X 13 Y 3 X -54 Y 4 X -15 Y 4 X 28 Y 3 X -36 Y 4 X 50 Y 4 X 6 Y 3 X 2 Y 4 X -15 Y 3 X 3 Y 4 X -3 Y 4 X -2 Y 3 X -10 Y 4 X 10 Y 4 X 13 Y 3 X 6 Y 4 X 10 Y 3 X -34 Y 4 X 3 Y 4 X 18 Y 3 X 29 Y 4 X -47 Y 7 X -3 Y 4 X 30 Y
 3 X -19 Y 4 X 6 Y 4 X 33 Y 3 X -24 Y 4 X -16 Y 4 X 11 Y 3 X 6 Y 4 X -26 Y 3 X 24 Y 4 X -9 Y 4 X 22 Y 3 X 2 Y 4 X -15 Y 4 X -5 Y 3 X 5 Y 4 X -15 Y 4 X -18 Y 3 X 7 Y 4 X 34 Y 3 X -34 Y 4 X 3 Y 4 X -16 Y 3 X 23 Y 4 X -18 Y 4 X 31 Y 3 X -24 Y 4 X 1 Y 3
 X 7 Y 4 X -21 Y 4 X 2 Y 3 X -5 Y 4 X 5 Y 4 X -6 Y 3 X 3 Y 4 X -4 Y 3 X 4 Y 4 X -12 Y 4 X -5 Y 3 X 4 Y 4 X -10 Y 4 X 10 Y 3 X 5 Y 4 X -12 Y 3 X -4 Y 4 X 3 Y 7 X -5 Y 4 X 1 Y 4 X -4 Y 3 X -2 Y 4 X -2 Y 4 X -1 Y 3 X -4 Y 4 X 5 Y 3 X -3 Y 4 X -2 Y 4 X 1
 Y 3 X -4 Y 4 X 1 Y 4 X -1 Y 3 X -3 Y 4 X 1 Y 3 X -2 Y 4 X -1 Y 4 X -2 Y 7 X -2 Y 4 X -1 Y 3 X -2 Y 4 X 1 Y 3 X -2 Y 4 X 1 Y 4 X -3 Y 3 X -2 Y 4 X -1 Y 7 X -2 Y 4 X -1 Y 3 X -1 Y 11 X -3 Y 4 X 1 Y 4 X -2 Y 3 X -3 Y 4 X 1 Y 7 X -5 Y 4 X 5 Y 3 X -6 Y 8
 X 1 Y 3 X -6 Y 4 X -4 Y 4 X 5 Y 3 X -3 Y 4 X 4 Y 3 X -7 Y 4 X 6 Y 4 X -3 Y 3 X -9 Y 4 X 2 Y 4 X -8 Y 3 X 2 Y 4 X 2 Y 3 X -7 Y 8 X -2 Y 3 X 5 Y 4 X -8 Y 4 X 13 Y 3 X -28 Y 4 X 7 Y 3 X 1 Y 11 X -8 Y 4 X -2 Y 4 X 2 Y 3 X -10 Y 4 X -2 Y 7 X -18 Y 4 X 16
 Y 3 X -20 Y 4 X -7 Y 4 X 12 Y 3 X -3 Y 4 X -16 Y 4 X -37 Y 3 X 35 Y 4 X -64 Y 3 X 47 Y 4 X 9 Y 4 X -85 Y 3 X -15 Y 4 X -5 Y 25 X 457 Y 4 X -457 Y 7 X 457 Y 33 X -24 Y 3 X -60 Y 4 X 64 Y 4 X -43 Y 3 X -28 Y 4 X -15 Y 4 X -64 Y 3 X 43 Y 4 X 62 Y 4 X
 -32 Y 3 X -46 Y 4 X -2 Y 3 X -19 Y 4 X -26 Y 4 X 25 Y 3 X -1 Y 4 X -7 Y 4 X -20 Y 3 X 42 Y 4 X 34 Y 3 X -47 Y 4 X 7 Y 4 X 6 Y 3 X -24 Y 4 X 6 Y 4 X -8 Y 3 X 38 Y 4 X -20 Y 3 X -39 Y 4 X 28 Y 4 X 26 Y 3 X -23 Y 4 X -10 Y 4 X -33 Y 3 X 17 Y 4 X 15 Y 3
 X -27 Y 4 X 3 Y 4 X 5 Y 3 X 4 Y 4 X 8 Y 4 X -43 Y 3 X 32 Y 4 X -4 Y 3 X 27 Y 4 X -15 Y 4 X 29 Y 3 X -42 Y 4 X -28 Y 4 X 9 Y 3 X -1 Y 4 X 15 Y 4 X 35 Y 3 X -25 Y 7 X -12 Y 4 X 21 Y 4 X 1 Y 3 X 17 Y 4 X -23 Y 4 X -14 Y 3 X -24 Y 4 X 21 Y 3 X 14 Y 4 X
 4 Y 4 X -4 Y 3 X -21 Y 4 X 14 Y 4 X 15 Y 3 X -14 Y 4 X 1 Y 3 X 2 Y 4 X -14 Y 4 X 16 Y 3 X -40 Y 4 X 10 Y 4 X 14 Y 3 X 34 Y 4 X -43 Y 3 X 12 Y 4 X -4 Y 4 X 18 Y 3 X -21 Y 4 X 6 Y 4 X -41 Y 3 X 26 Y 4 X -5 Y 4 X 37 Y 3 X -38 Y 4 X 26 Y 3 X -16 Y 4 X
 -15 Y 4 X 21 Y 3 X 7 Y 4 X -24 Y 4 X -3 Y 3 X -5 Y 4 X 6 Y 3 X -15 Y 4 X 29 Y 4 X 16 Y 3 X 7 Y 4 X -19 Y 4 X -5 Y 3 X 5 Y 4 X 10 Y 3 X -10 Y 4 X 45 Y 4 X -46 Y 3 X 38 Y 4 X -56 Y 4 X 47 Y 3 X -6 Y 4 X -28 Y 3 X -2 Y 4 X 3 Y 4 X -24 Y 3 X 18 Y 4 X
 -13 Y 4 X 9 Y 3 X 2 Y 4 X 24 Y 4 X -8 Y 3 X -15 Y 4 X 16 Y 3 X -33 Y 4 X 32 Y 4 X -4 Y 3 X 3 Y 4 X -16 Y 4 X 40 Y 3 X -14 Y 4 X -35 Y 3 X -9 Y 4 X 64 Y 4 X -6 Y 3 X -9 Y 4 X -7 Y 4 X -63 Y 3 X 28 Y 4 X 38 Y 3 X -13 Y 4 X 13 Y 4 X -1 Y 3 X -12 Y 4 X
 -23 Y 4 X 37 Y 3 X -3 Y 4 X -15 Y 3 X 24 Y 4 X 22 Y 4 X 8 Y 3 X -60 Y 4 X -1 Y 4 X 39 Y 3 X -60 Y 4 X 12 Y 4 X -3 Y 3 X 37 Y 4 X -18 Y 3 X 1 Y 4 X -2 Y 4 X 30 Y 3 X -75 Y 4 X 20 Y 4 X 12 Y 3 X 42 Y 4 X -64 Y 3 X 31 Y 4 X 13 Y 4 X -16 Y 3 X -4 Y 4 X
 6 Y 4 X 38 Y 3 X -11 Y 4 X -11 Y 3 X -23 Y 4 X -8 Y 4 X 19 Y 3 X -11 Y 4 X -1 Y 4 X 18 Y 3 X -36 Y 4 X -12 Y 3 X 108 Y 4 X -39 Y 4 X -21 Y 3 X -3 Y 4 X -9 Y 4 X -8 Y 3 X 89 Y 4 X -72 Y 3 X -5 Y 4 X -38 Y 4 X 51 Y 3 X -49 Y 4 X 6 Y 4 X 36 Y 3 X -30 Y
 4 X 48 Y 4 X -24 Y 3 X 23 Y 4 X -54 Y 3 X 39 Y 4 X 20 Y 4 X 6 Y 3 X 8 Y 4 X -57 Y 4 X 15 Y 3 X 36 Y 4 X -59 Y 3 X 17 Y 4 X 22 Y 4 X 10 Y 3 X -32 Y 4 X s 227 152 m 1814 X s
 gsave  2268 609 0 0 C 1967.63 26.5896 t 0 r /Helvetica findfont 38.0897 sf 0 0 m (WW) show NC gr 
 gsave  2268 609 0 0 C 1922.05 41.7837 t 0 r /Helvetica findfont 57.1345 sf 0 0 m (M) show NC gr  227 167 m -15 Y s 263 160 m -8 Y s 299 160 m -8 Y s 336 160 m -8 Y s 372 160 m -8 Y s 408 167 m -15 Y s 444 160 m -8 Y s 481 160 m -8 Y s 517 160 m -8 Y
 s 553 160 m -8 Y s 590 167 m -15 Y s 626 160 m -8 Y s 662 160 m -8 Y s 698 160 m -8 Y s 735 160 m -8 Y s 771 167 m -15 Y s 807 160 m -8 Y s 844 160 m -8 Y s 880 160 m -8 Y s 916 160 m -8 Y s 952 167 m -15 Y s 989 160 m -8 Y s 1025 160 m -8 Y s 1061
 160 m -8 Y s 1098 160 m -8 Y s 1134 167 m -15 Y s 1170 160 m -8 Y s 1206 160 m -8 Y s 1243 160 m -8 Y s 1279 160 m -8 Y s 1315 167 m -15 Y s 1352 160 m -8 Y s 1388 160 m -8 Y s 1424 160 m -8 Y s 1460 160 m -8 Y s 1497 167 m -15 Y s 1533 160 m -8 Y s
 1569 160 m -8 Y s 1606 160 m -8 Y s 1642 160 m -8 Y s 1678 167 m -15 Y s 1714 160 m -8 Y s 1751 160 m -8 Y s 1787 160 m -8 Y s 1823 160 m -8 Y s 1860 167 m -15 Y s 1896 160 m -8 Y s 1932 160 m -8 Y s 1968 160 m -8 Y s 2005 160 m -8 Y s 2041 167 m
 -15 Y s
 gsave  2268 609 0 0 C 208.919 113.956 t 0 r /Helvetica findfont 45.7076 sf 0 0 m (0) show NC gr 
 gsave  2268 609 0 0 C 368.456 113.956 t 0 r /Helvetica findfont 45.7076 sf 0 0 m (100) show NC gr 
 gsave  2268 609 0 0 C 550.785 113.956 t 0 r /Helvetica findfont 45.7076 sf 0 0 m (200) show NC gr 
 gsave  2268 609 0 0 C 729.316 113.956 t 0 r /Helvetica findfont 45.7076 sf 0 0 m (300) show NC gr 
 gsave  2268 609 0 0 C 911.645 113.956 t 0 r /Helvetica findfont 45.7076 sf 0 0 m (400) show NC gr 
 gsave  2268 609 0 0 C 1093.97 113.956 t 0 r /Helvetica findfont 45.7076 sf 0 0 m (500) show NC gr 
 gsave  2268 609 0 0 C 1276.3 113.956 t 0 r /Helvetica findfont 45.7076 sf 0 0 m (600) show NC gr 
 gsave  2268 609 0 0 C 1458.63 113.956 t 0 r /Helvetica findfont 45.7076 sf 0 0 m (700) show NC gr 
 gsave  2268 609 0 0 C 1637.16 113.956 t 0 r /Helvetica findfont 45.7076 sf 0 0 m (800) show NC gr 
 gsave  2268 609 0 0 C 1819.49 113.956 t 0 r /Helvetica findfont 45.7076 sf 0 0 m (900) show NC gr 
 gsave  2268 609 0 0 C 1986.63 113.956 t 0 r /Helvetica findfont 45.7076 sf 0 0 m (1000) show NC gr  227 152 m 457 Y s
 gsave  2268 609 0 0 C 91.1645 170.933 t 90 r /Helvetica findfont 45.7076 sf 0 0 m (\(S+I\)/\(Reweighted S\)) show NC gr  278 152 m -51 X s 252 164 m -25 X s 252 175 m -25 X s 252 187 m -25 X s 278 198 m -51 X s 252 209 m -25 X s 252 221 m -25 X s
 252 232 m -25 X s 278 244 m -51 X s 252 255 m -25 X s 252 267 m -25 X s 252 278 m -25 X s 278 289 m -51 X s 252 301 m -25 X s 252 312 m -25 X s 252 324 m -25 X s 278 335 m -51 X s 252 347 m -25 X s 252 358 m -25 X s 252 369 m -25 X s 278 381 m -51 X
 s 252 392 m -25 X s 252 404 m -25 X s 252 415 m -25 X s 278 427 m -51 X s 252 438 m -25 X s 252 449 m -25 X s 252 461 m -25 X s 278 472 m -51 X s 252 484 m -25 X s 252 495 m -25 X s 252 507 m -25 X s 278 518 m -51 X s 252 529 m -25 X s 252 541 m -25
 X s 252 552 m -25 X s 278 564 m -51 X s 252 575 m -25 X s 252 587 m -25 X s 252 598 m -25 X s 278 609 m -51 X s
 gsave  2268 609 0 0 C 186.127 136.747 t 0 r /Helvetica findfont 45.7076 sf 0 0 m (0) show NC gr 
 gsave  2268 609 0 0 C 148.142 182.329 t 0 r /Helvetica findfont 45.7076 sf 0 0 m (0.2) show NC gr 
 gsave  2268 609 0 0 C 148.142 227.911 t 0 r /Helvetica findfont 45.7076 sf 0 0 m (0.4) show NC gr 
 gsave  2268 609 0 0 C 148.142 273.493 t 0 r /Helvetica findfont 45.7076 sf 0 0 m (0.6) show NC gr 
 gsave  2268 609 0 0 C 148.142 319.076 t 0 r /Helvetica findfont 45.7076 sf 0 0 m (0.8) show NC gr 
 gsave  2268 609 0 0 C 193.725 364.658 t 0 r /Helvetica findfont 45.7076 sf 0 0 m (1) show NC gr 
 gsave  2268 609 0 0 C 148.142 410.24 t 0 r /Helvetica findfont 45.7076 sf 0 0 m (1.2) show NC gr 
 gsave  2268 609 0 0 C 148.142 455.822 t 0 r /Helvetica findfont 45.7076 sf 0 0 m (1.4) show NC gr 
 gsave  2268 609 0 0 C 148.142 501.405 t 0 r /Helvetica findfont 45.7076 sf 0 0 m (1.6) show NC gr 
 gsave  2268 609 0 0 C 148.142 546.987 t 0 r /Helvetica findfont 45.7076 sf 0 0 m (1.8) show NC gr 
 gsave  2268 609 0 0 C 186.127 592.569 t 0 r /Helvetica findfont 45.7076 sf 0 0 m (2) show NC gr  229 152 m20 232 152 m20 236 152 m20 239 152 m20 243 152 m20 247 152 m20 250 152 m20 254 152 m20 258 152 m20 261 152 m20 265 152 m20 268 152 m20 272 152
 m20 276 152 m20 279 152 m20 283 152 m20 287 152 m20 290 152 m20 294 152 m20 298 152 m20 301 152 m20 305 152 m20 308 152 m20 312 152 m20 316 152 m20 319 152 m20 323 152 m20 327 152 m20 330 152 m20 334 152 m20 337 152 m20 341 152 m20 345 152 m20 348
 152 m20 352 152 m20 356 152 m20 359 152 m20 363 152 m20 366 152 m20 370 152 m20 374 152 m20 377 152 m20 381 152 m20 385 152 m20 388 152 m20 392 152 m20 395 152 m20 399 152 m20 403 152 m20 410 152 m20 414 176 m20 417 152 m20 425 305 m20 428 288 m20
 432 493 m20 443 299 m20 446 225 m20 450 257 m20 454 347 m20 457 312 m20 461 450 m20 464 371 m20 468 431 m20 475 325 m20 479 354 m20 483 242 m20 490 341 m20 497 393 m20 504 290 m20 508 436 m20 512 433 m20 515 482 m20 519 356 m20 522 350 m20 526 378
 m20 530 367 m20 533 366 m20 537 356 m20 541 375 m20 544 355 m20 548 373 m20 552 400 m20 555 369 m20 559 438 m20 562 406 m20 566 393 m20 570 409 m20 573 429 m20 577 398 m20 581 448 m20 584 422 m20 588 438 m20 591 444 m20 595 486 m20 599 451 m20 602
 435 m20 606 479 m20 610 492 m20 613 438 m20 617 423 m20 620 451 m20 624 415 m20 628 465 m20 631 471 m20 635 473 m20 639 458 m20 642 461 m20 646 458 m20 649 456 m20 653 446 m20 657 456 m20 660 469 m20 664 475 m20 668 485 m20 671 451 m20 675 454 m20
 679 472 m20 682 501 m20 686 454 m20 689 454 m20 693 451 m20 697 481 m20 700 462 m20 704 468 m20 708 501 m20 711 477 m20 715 461 m20 718 472 m20 722 478 m20 726 452 m20 729 476 m20 733 467 m20 737 489 m20 740 491 m20 744 476 m20 747 471 m20 751 476
 m20 755 461 m20 758 443 m20 762 450 m20 766 484 m20 769 450 m20 773 453 m20 776 437 m20 780 460 m20 784 442 m20 787 473 m20 791 449 m20 795 450 m20 798 457 m20 802 436 m20 805 438 m20 809 433 m20 813 438 m20 816 432 m20 820 435 m20 824 431 m20 827
 435 m20 831 423 m20 835 418 m20 838 422 m20 842 412 m20 845 422 m20 849 427 m20 853 415 m20 856 411 m20 860 414 m20 864 414 m20 867 409 m20 871 410 m20 874 406 m20 878 404 m20 882 402 m20 885 401 m20 889 397 m20 893 402 m20 896 399 m20 900 397 m20
 903 398 m20 907 394 m20 911 395 m20 914 394 m20 918 391 m20 922 392 m20 925 390 m20 929 389 m20 932 387 m20 936 387 m20 940 385 m20 943 384 m20 947 382 m20 951 383 m20 954 381 m20 958 382 m20 962 379 m20 965 377 m20 969 376 m20 972 376 m20 976 374
 m20 980 373 m20 983 372 m20 987 372 m20 991 372 m20 994 369 m20 998 370 m20 1001 368 m20 1005 365 m20 1009 366 m20 1012 366 m20 1016 361 m20 1020 366 m20 1023 360 m20 1027 360 m20 1030 361 m20 1034 355 m20 1038 351 m20 1041 356 m20 1045 353 m20 1049
 357 m20 1052 350 m20 1056 356 m20 1059 353 m20 1063 344 m20 1067 346 m20 1070 338 m20 1074 340 m20 1078 342 m20 1081 335 m20 1085 335 m20 1089 333 m20 1092 338 m20 1096 330 m20 1099 343 m20 1103 315 m20 1107 322 m20 1110 323 m20 1114 323 m20 1118
 323 m20 1121 315 m20 1125 313 m20 1128 315 m20 1132 305 m20 1136 303 m20 1139 303 m20 1143 285 m20 1147 301 m20 1150 281 m20 1154 274 m20 1157 286 m20 1161 283 m20 1165 267 m20 1168 230 m20 1172 265 m20 1176 201 m20 1179 248 m20 1183 257 m20 1186
 172 m20 1190 157 m20 1263 585 m20 1266 525 m20 1270 589 m20 1274 546 m20 1277 518 m20 1281 503 m20 1284 439 m20 1288 482 m20 1292 544 m20 1295 512 m20 1299 466 m20 1303 464 m20 1306 445 m20 1310 419 m20 1313 444 m20 1317 443 m20 1321 436 m20 1324
 416 m20 1328 458 m20 1332 492 m20 1335 445 m20 1339 452 m20 1342 458 m20 1346 434 m20 1350 440 m20 1353 432 m20 1357 470 m20 1361 450 m20 1364 411 m20 1368 439 m20 1372 465 m20 1375 442 m20 1379 432 m20 1382 399 m20 1386 416 m20 1390 431 m20 1393
 404 m20 1397 407 m20 1401 412 m20 1404 416 m20 1408 424 m20 1411 381 m20 1415 413 m20 1419 409 m20 1422 436 m20 1426 421 m20 1430 450 m20 1433 408 m20 1437 380 m20 1440 389 m20 1444 388 m20 1448 403 m20 1451 438 m20 1455 413 m20 1459 413 m20 1462
 401 m20 1466 422 m20 1469 423 m20 1473 440 m20 1477 417 m20 1480 403 m20 1484 379 m20 1488 400 m20 1491 414 m20 1495 418 m20 1499 414 m20 1502 393 m20 1506 407 m20 1509 422 m20 1513 408 m20 1517 409 m20 1520 411 m20 1524 397 m20 1528 413 m20 1531
 373 m20 1535 383 m20 1538 397 m20 1542 431 m20 1546 388 m20 1549 400 m20 1553 396 m20 1557 414 m20 1560 393 m20 1564 399 m20 1567 358 m20 1571 384 m20 1575 379 m20 1578 416 m20 1582 378 m20 1586 404 m20 1589 388 m20 1593 373 m20 1596 394 m20 1600
 401 m20 1604 377 m20 1607 374 m20 1611 369 m20 1615 375 m20 1618 360 m20 1622 389 m20 1625 405 m20 1629 412 m20 1633 393 m20 1636 388 m20 1640 393 m20 1644 403 m20 1647 393 m20 1651 438 m20 1655 392 m20 1658 430 m20 1662 374 m20 1665 421 m20 1669
 415 m20 1673 387 m20 1676 385 m20 1680 388 m20 1684 364 m20 1687 382 m20 1691 369 m20 1694 378 m20 1698 380 m20 1702 404 m20 1705 396 m20 1709 381 m20 1713 397 m20 1716 364 m20 1720 396 m20 1723 392 m20 1727 395 m20 1731 379 m20 1734 419 m20 1738
 405 m20 1742 370 m20 1745 361 m20 1749 425 m20 1752 419 m20 1756 410 m20 1760 403 m20 1763 340 m20 1767 368 m20 1771 406 m20 1774 393 m20 1778 406 m20 1782 405 m20 1785 393 m20 1789 370 m20 1792 407 m20 1796 404 m20 1800 389 m20 1803 413 m20 1807
 435 m20 1811 443 m20 1814 383 m20 1818 382 m20 1821 421 m20 1825 361 m20 1829 373 m20 1832 370 m20 1836 407 m20 1840 389 m20 1843 390 m20 1847 388 m20 1850 418 m20 1854 343 m20 1858 363 m20 1861 375 m20 1865 417 m20 1869 353 m20 1872 384 m20 1876
 397 m20 1879 381 m20 1883 377 m20 1887 383 m20 1890 421 m20 1894 410 m20 1898 399 m20 1901 376 m20 1905 368 m20 1909 387 m20 1912 376 m20 1916 375 m20 1919 393 m20 1923 357 m20 1927 345 m20 1930 453 m20 1934 414 m20 1938 393 m20 1941 390 m20 1945
 381 m20 1948 373 m20 1952 462 m20 1956 390 m20 1959 385 m20 1963 347 m20 1967 398 m20 1970 349 m20 1974 355 m20 1977 391 m20 1981 361 m20 1985 409 m20 1988 385 m20 1992 408 m20 1996 354 m20 1999 393 m20 2003 413 m20 2006 419 m20 2010 427 m20 2014
 370 m20 2017 385 m20 2021 421 m20 2025 362 m20 2028 379 m20 2032 401 m20 2036 411 m20 2039 379 m20 cs 0 0 0 P13 setcolor 229 152 m 174 X 3 457 d 4 -457 d 4 52 d 3 -52 d 4 457 d 4 -113 d 3 -118 d 4 231 d 7 X 4 -255 d 3 -60 d 4 -1 d 4 126 d 3 -58 d 4
 247 d 3 -139 d 4 140 d 4 X 3 -155 d 4 -14 d 4 -127 d 3 296 d 4 -154 d 3 154 d 4 -68 d 4 68 d 3 -262 d 4 231 d 4 -49 d 3 25 d 4 -157 d 3 -17 d 4 34 d 4 -15 d 3 1 d 4 -13 d 4 22 d 3 -26 d 4 22 d 4 30 d 3 -36 d 4 80 d 3 -39 d 4 -16 d 4 19 d 3 24 d 4
 -38 d 4 55 d 3 -25 d 4 16 d 3 8 d 4 47 d 4 -40 d 3 -18 d 4 48 d 4 15 d 3 -63 d 4 -19 d 3 32 d 4 -42 d 4 56 d 3 9 d 4 -1 d 4 -17 d 3 2 d 4 -4 d 3 -2 d 4 -11 d 4 10 d 3 13 d 4 7 d 4 11 d 3 -38 d 4 3 d 4 20 d 3 35 d 4 -56 d 3 -1 d 4 -2 d 4 33 d 3 -22 d
 4 6 d 4 37 d 3 -29 d 4 -18 d 3 13 d 4 5 d 4 -27 d 3 24 d 4 -9 d 4 24 d 3 2 d 4 -17 d 3 -6 d 4 5 d 4 -17 d 3 -20 d 4 6 d 4 37 d 3 -36 d 4 3 d 3 -18 d 4 25 d 4 -20 d 3 33 d 4 -27 d 4 1 d 3 7 d 4 -23 d 3 1 d 4 -6 d 4 5 d 3 -6 d 4 3 d 4 -5 d 3 4 d 4 -13
 d 4 -5 d 3 4 d 4 -11 d 3 10 d 4 5 d 4 -13 d 3 -6 d 4 4 d 4 X 3 -6 d 4 1 d 3 -4 d 4 -3 d 4 -2 d 3 -2 d 4 -3 d 4 4 d 3 -3 d 4 -2 d 3 1 d 4 -5 d 4 1 d 3 -1 d 4 -3 d 4 1 d 3 -2 d 4 -2 d 3 -2 d 4 1 d 4 -3 d 3 -1 d 4 -1 d 4 X 3 -2 d 4 1 d 4 -3 d 3 -1 d 4
 -1 d 3 -1 d 4 -2 d 4 X 3 -1 d 8 X 3 -3 d 4 1 d 3 -2 d 4 -3 d 4 2 d 3 X 4 -5 d 4 5 d 3 -5 d 4 -1 d 3 1 d 4 -6 d 4 -3 d 3 4 d 4 -2 d 4 4 d 3 -6 d 4 5 d 3 -3 d 4 -9 d 4 3 d 3 -8 d 4 2 d 4 2 d 3 -6 d 4 X 4 -2 d 3 6 d 4 -9 d 3 15 d 4 -29 d 4 8 d 3 1 d 4
 1 d 4 X 3 -8 d 4 -1 d 3 3 d 4 -10 d 4 -1 d 3 -1 d 4 -15 d 4 15 d 3 -19 d 4 -5 d 3 13 d 4 -2 d 4 -14 d 3 -35 d 4 35 d 4 -57 d 3 40 d 4 16 d 3 -69 d 4 -8 d 4 -34 d 3 41 d 4 -58 d -6 Y 16 X 2 457 d 1 -457 d 10 X 457 Y 33 X 3 -41 d 4 41 d 4 -6 d 3 -35 d
 4 -19 d 3 -71 d 4 43 d 4 72 d 3 -33 d 4 -54 d 4 3 d 3 -18 d 4 -34 d 3 23 d 4 X 4 -4 d 3 -23 d 4 42 d 4 41 d 3 -54 d 4 6 d 3 10 d 4 -30 d 4 7 d 3 -8 d 4 40 d 4 -21 d 3 -43 d 4 33 d 4 27 d 3 -25 d 4 -13 d 3 -34 d 4 19 d 4 14 d 3 -30 d 4 4 d 4 6 d 3 8
 d 4 6 d 3 -45 d 4 34 d 4 -7 d 3 36 d 4 -23 d 4 39 d 3 -51 d 4 -30 d 3 6 d 4 6 d 4 13 d 3 42 d 4 -30 d 4 X 3 -15 d 4 26 d 3 -2 d 4 20 d 4 -24 d 3 -16 d 4 -24 d 4 19 d 3 19 d 4 4 d 4 -3 d 3 -27 d 4 18 d 3 15 d 4 -14 d 4 -3 d 3 7 d 4 -15 d 4 17 d 3 -47
 d 4 14 d 3 20 d 4 30 d 4 -47 d 3 16 d 4 -6 d 4 26 d 3 -31 d 4 9 d 3 -46 d 4 34 d 4 -8 d 3 44 d 4 -39 d 4 22 d 3 -17 d 4 -18 d 3 29 d 4 4 d 4 -27 d 3 X 4 -8 d 4 7 d 3 -18 d 4 34 d 3 22 d 4 11 d 4 -24 d 3 -10 d 4 5 d 4 14 d 3 -13 d 4 49 d 4 -48 d 3 44
 d 4 -69 d 3 57 d 4 -11 d 4 -28 d 3 -2 d 4 6 d 4 -27 d 3 15 d 4 -14 d 3 16 d 4 -3 d 4 27 d 3 -7 d 4 -14 d 4 16 d 3 -38 d 4 36 d 3 -2 d 4 3 d 4 -19 d 3 46 d 4 -14 d 4 -36 d 3 -15 d 4 75 d 3 -5 d 4 -16 d 4 -6 d 3 -72 d 4 31 d 4 46 d 3 -14 d 4 12 d 4 3
 d 3 -19 d 4 -22 d 3 39 d 4 -2 d 4 -17 d 3 32 d 4 21 d 4 12 d 3 -68 d 4 -5 d 3 49 d 4 -68 d 4 11 d 3 -7 d 4 51 d 4 -23 d 3 -2 d 4 1 d 3 37 d 4 -96 d 4 28 d 3 13 d 4 50 d 4 -70 d 3 35 d 4 12 d 3 -19 d 4 -5 d 4 7 d 3 46 d 4 -7 d 4 -10 d 3 -34 d 4 -11 d
 4 17 d 3 -8 d 4 4 d 3 21 d 4 -46 d 4 -14 d 3 132 d 4 -49 d 4 -29 d 3 2 d 4 -15 d 3 -3 d 4 111 d 4 -101 d 3 3 d 4 -44 d 4 59 d 3 -51 d 4 2 d 3 39 d 4 -28 d 4 50 d 3 -24 d 4 30 d 4 -72 d 3 46 d 4 29 d 3 5 d 4 13 d 4 -70 d 3 17 d 4 43 d 4 -70 d 3 19 d
 4 29 d 4 10 d 3 -30 d -122 Y -3 33 d -4 -10 d -4 -15 d -3 -14 d -4 47 d -4 -28 d -3 -14 d -4 46 d -4 -4 d -3 -7 d -4 -11 d -3 -31 d -4 36 d -4 -16 d -3 23 d -4 -45 d -4 32 d -3 -34 d -4 -10 d -3 47 d -4 -42 d -4 32 d -3 11 d -4 45 d -4 -68 d -3 13 d
 -4 4 d -3 8 d -4 13 d -4 29 d -3 -85 d -4 10 d -4 26 d -3 -15 d -4 6 d -3 14 d -4 -20 d -4 4 d -3 12 d -4 12 d -4 15 d -3 -31 d -4 -4 d -4 2 d -3 14 d -4 -14 d -3 -28 d -4 59 d -4 -35 d -3 -10 d -4 -12 d -4 54 d -3 -22 d -4 4 d -3 -3 d -4 12 d -4
 -22 d -3 -2 d -4 -13 d -4 52 d -3 -29 d -4 -2 d -3 51 d -4 -5 d -4 -22 d -3 -15 d -4 12 d -4 3 d -3 -33 d -4 24 d -3 5 d -4 4 d -4 -15 d -3 13 d -4 -29 d -4 -25 d -3 53 d -4 7 d -4 4 d -3 5 d -4 -51 d -3 3 d -4 33 d -4 14 d -3 -33 d -4 12 d -4 -3 d
 -3 7 d -4 -30 d -3 29 d -4 -16 d -4 17 d -3 7 d -4 -20 d -4 -7 d -3 -3 d -4 13 d -3 -22 d -4 23 d -4 X -3 2 d -4 27 d -4 1 d -3 -37 d -4 42 d -3 -31 d -4 44 d -4 -41 d -3 6 d -4 -6 d -4 -4 d -3 1 d -4 14 d -4 -5 d -3 -9 d -4 -25 d -3 12 d -4 -4 d -4
 2 d -3 6 d -4 20 d -4 -10 d -3 -11 d -4 10 d -3 15 d -4 -29 d -4 37 d -3 -29 d -4 1 d -4 -19 d -3 36 d -4 -3 d -3 12 d -4 -11 d -4 3 d -3 -8 d -4 38 d -4 -37 d -3 -9 d -4 -4 d -3 31 d -4 -13 d -4 12 d -3 4 d -4 -6 d -4 13 d -3 -14 d -4 -10 d -3 15 d
 -4 5 d -4 -4 d -3 -8 d -4 -23 d -4 23 d -3 11 d -4 23 d -4 -13 d -3 -5 d -4 -15 d -3 8 d -4 1 d -4 19 d -3 -28 d -4 -16 d -4 6 d -3 -11 d -4 25 d -3 35 d -4 -20 d -4 7 d -3 -18 d -4 2 d -4 -32 d -3 41 d -4 -8 d -3 -1 d -4 -4 d -4 -2 d -3 25 d -4 -18
 d -4 -14 d -3 32 d -4 8 d -3 20 d -4 -25 d -4 -23 d -3 35 d -4 19 d -4 -37 d -3 8 d -4 -5 d -4 19 d -3 -1 d -4 -10 d -3 42 d -4 -28 d -4 -41 d -3 15 d -4 10 d -4 3 d -3 -26 d -4 17 d -3 20 d -4 8 d -4 38 d -3 29 d -4 -51 d -4 -43 d -3 57 d -4 11 d
 -3 21 d -4 47 d -4 -55 d -3 29 d -4 51 d -1 48 d -5 X -1 -38 d -4 -19 d 57 Y -19 X -3 -457 d -3 X 457 Y -7 X -1 -457 d -29 X -3 76 d -4 -2 d -3 -54 d -4 70 d -4 -34 d -3 38 d -4 20 d -4 3 d -3 -10 d -4 7 d -3 22 d -4 -16 d -4 19 d -3 X -4 3 d -4 11
 d -3 -3 d -4 4 d -3 7 d -4 1 d -4 1 d -3 -1 d -4 -6 d -4 28 d -3 -13 d -4 8 d -3 -5 d -4 4 d -4 X -3 7 d -4 -2 d -4 -3 d -3 9 d -4 -2 d -4 9 d -3 3 d -4 -5 d -3 6 d -4 -2 d -4 2 d -3 -4 d -4 3 d -4 7 d -3 -1 d -4 X -3 6 d -4 -4 d -4 4 d -3 1 d -4 -1
 d -4 2 d -3 3 d -4 -1 d -3 3 d -4 X -4 1 d -3 X -4 1 d -4 2 d -3 1 d -4 1 d -3 2 d -4 3 d -4 -1 d -3 1 d -4 X -4 2 d -3 1 d -4 2 d -4 -1 d -3 2 d -4 1 d -3 2 d -4 -1 d -4 3 d -3 1 d -4 -2 d -4 4 d -3 -1 d -4 2 d -3 3 d -4 -5 d -4 3 d -3 1 d -4 2 d
 -4 2 d -3 4 d -4 -2 d -3 5 d -4 X -4 -4 d -3 4 d -4 10 d -4 -5 d -3 -10 d -4 10 d -3 -4 d -4 4 d -4 12 d -3 -5 d -4 4 d -4 -4 d -3 6 d -4 -6 d -4 6 d -3 -4 d -4 19 d -3 -8 d -4 -1 d -4 23 d -3 -30 d -4 16 d -4 -21 d -3 15 d -4 -3 d -3 30 d -4 -31 d
 -4 -8 d -3 17 d -4 14 d -4 -5 d -3 3 d -4 14 d -3 -3 d -4 -19 d -4 7 d -3 -22 d -4 23 d -4 -6 d -3 -9 d -4 14 d -3 20 d -4 -30 d -4 -6 d -3 16 d -4 -28 d -4 5 d -3 -2 d -4 40 d -3 -24 d -4 -16 d -4 -3 d -3 29 d -4 -8 d -4 -5 d -3 -13 d -4 -9 d -4 8
 d -3 3 d -4 1 d -3 -3 d -4 11 d -4 -5 d -3 -3 d -4 -42 d -4 29 d -3 -23 d -4 11 d -3 44 d -4 -10 d -4 -40 d -3 14 d -4 30 d -4 -38 d -3 -5 d -4 -16 d -3 28 d -4 -45 d -4 23 d -3 -15 d -4 -14 d -4 12 d -3 24 d -4 -59 d -3 26 d -4 -24 d -4 -13 d -3 15
 d -4 -16 d -4 6 d -3 4 d -4 6 d -4 -22 d -3 -5 d -4 94 d -3 -71 d -4 -44 d -4 -61 d -3 376 d -1 X -3 -363 d -4 302 d -3 -320 d -1 381 d -5 X -1 -437 d -4 96 d -4 -73 d -3 410 d -4 -403 d -4 71 d -3 19 d -4 -30 d -3 13 d -4 -54 d -4 -66 d -3 89 d -3
 365 d -2 X -3 -215 d -3 -88 d -4 -109 d -3 -45 d -4 457 d -4 -457 d -188 X FA
 gr  gr showpage
end
%%EOF
