%!PS-Adobe-2.0 EPSF-2.0
%%BoundingBox:  0 0 567 544
%%Title: HWW_900_ptll_reweighting_cut_YR3.eps: HWW 900Gev ptll reweighting for interference with cuts
%%Creator: ROOT Version 5.34/05
%%CreationDate: Fri Jun 14 04:49:37 2013
%%EndComments
%%BeginProlog
80 dict begin
/s {stroke} def /l {lineto} def /m {moveto} def /t {translate} def
/r {rotate} def /rl {roll}  def /R {repeat} def
/d {rlineto} def /rm {rmoveto} def /gr {grestore} def /f {eofill} def
/c {setrgbcolor} def /black {0 setgray} def /sd {setdash} def
/cl {closepath} def /sf {scalefont setfont} def /lw {setlinewidth} def
/box {m dup 0 exch d exch 0 d 0 exch neg d cl} def
/NC{systemdict begin initclip end}def/C{NC box clip newpath}def
/bl {box s} def /bf {box f} def /Y { 0 exch d} def /X { 0 d} def 
/K {{pop pop 0 moveto} exch kshow} bind def
/ita {/ang 15 def gsave [1 0 ang dup sin exch cos div 1 0 0] concat} def 
/mp {newpath /y exch def /x exch def} def
/side {[w .77 mul w .23 mul] .385 w mul sd w 0 l currentpoint t -144 r} def
/mr {mp x y w2 0 360 arc} def /m24 {mr s} def /m20 {mr f} def
/mb {mp x y w2 add m w2 neg 0 d 0 w neg d w 0 d 0 w d cl} def
/mt {mp x y w2 add m w2 neg w neg d w 0 d cl} def
/m21 {mb f} def /m25 {mb s} def /m22 {mt f} def /m26{mt s} def
/m23 {mp x y w2 sub m w2 w d w neg 0 d cl f} def
/m27 {mp x y w2 add m w3 neg w2 neg d w3 w2 neg d w3 w2 d cl s} def
/m28 {mp x w2 sub y w2 sub w3 add m w3 0 d  0 w3 neg d w3 0 d 0 w3 d w3 0 d  0 w3 d w3 neg 0 d 0 w3 d w3 neg 0 d 0 w3 neg d w3 neg 0 d cl s } def
/m29 {mp gsave x w2 sub y w2 add w3 sub m currentpoint t 4 {side} repeat cl fill gr} def
/m30 {mp gsave x w2 sub y w2 add w3 sub m currentpoint t 4 {side} repeat cl s gr} def
/m31 {mp x y w2 sub m 0 w d x w2 sub y m w 0 d x w2 sub y w2 add m w w neg d x w2 sub y w2 sub m w w d s} def
/m32 {mp x y w2 sub m w2 w d w neg 0 d cl s} def
/m33 {mp x y w2 add m w3 neg w2 neg d w3 w2 neg d w3 w2 d cl f} def
/m34 {mp x w2 sub y w2 sub w3 add m w3 0 d  0 w3 neg d w3 0 d 0 w3 d w3 0 d  0 w3 d w3 neg 0 d 0 w3 d w3 neg 0 d 0 w3 neg d w3 neg 0 d cl f } def
/m2 {mp x y w2 sub m 0 w d x w2 sub y m w 0 d s} def
/m5 {mp x w2 sub y w2 sub m w w d x w2 sub y w2 add m w w neg d s} def
/reEncode {exch findfont dup length dict begin {1 index /FID eq  {pop pop} {def} ifelse } forall /Encoding exch def currentdict end dup /FontName get exch definefont pop } def [/Times-Bold /Times-Italic /Times-BoldItalic /Helvetica /Helvetica-Oblique
 /Helvetica-Bold /Helvetica-BoldOblique /Courier /Courier-Oblique /Courier-Bold /Courier-BoldOblique /Times-Roman /AvantGarde-Book /AvantGarde-BookOblique /AvantGarde-Demi /AvantGarde-DemiOblique /Bookman-Demi /Bookman-DemiItalic /Bookman-Light
 /Bookman-LightItalic /Helvetica-Narrow /Helvetica-Narrow-Bold /Helvetica-Narrow-BoldOblique /Helvetica-Narrow-Oblique /NewCenturySchlbk-Roman /NewCenturySchlbk-Bold /NewCenturySchlbk-BoldItalic /NewCenturySchlbk-Italic /Palatino-Bold
 /Palatino-BoldItalic /Palatino-Italic /Palatino-Roman ] {ISOLatin1Encoding reEncode } forall
%%EndProlog
%%BeginSetup
%%EndSetup
newpath  gsave  .25 .25 scale  gsave  0 0 t black[  ] 0 sd 3 lw 1 1 1 c 2268 2177 0 0 bf black 1 1 1 c 2268 1568 0 609 bf black 1 1 1 c 1814 1411 227 609 bf black 1814 1411 227 609 bl 0 0 1 c 1 1 1 c 0 0 1 c 227 609 m 199 X 712 Y 18 X 316 Y 19 X 83 Y
 18 X 78 Y 18 X 73 Y 18 X 51 Y 18 X 31 Y 18 X -8 Y 18 X -87 Y 19 X -207 Y 18 X -165 Y 18 X -110 Y 18 X -85 Y 18 X -73 Y 18 X -60 Y 18 X -47 Y 19 X -37 Y 18 X -43 Y 18 X -34 Y 18 X -29 Y 18 X -30 Y 18 X -26 Y 18 X -18 Y 19 X -25 Y 18 X -21 Y 18 X -17
 Y 18 X -16 Y 18 X -14 Y 18 X -15 Y 18 X -14 Y 19 X -11 Y 18 X -11 Y 18 X -11 Y 18 X -9 Y 18 X -10 Y 18 X -8 Y 18 X -9 Y 19 X -8 Y 18 X -5 Y 18 X -5 Y 18 X -7 Y 18 X -5 Y 18 X -6 Y 18 X -4 Y 19 X -3 Y 18 X -5 Y 18 X -3 Y 18 X -3 Y 18 X -4 Y 18 X -3 Y
 18 X -2 Y 19 X -3 Y 18 X -2 Y 18 X -2 Y 18 X -2 Y 18 X -2 Y 18 X -2 Y 18 X -2 Y 19 X -1 Y 18 X -2 Y 36 X -2 Y 36 X -2 Y 37 X -1 Y 18 X -1 Y 18 X -1 Y 36 X -1 Y 36 X -1 Y 37 X -1 Y 54 X -1 Y 91 X -1 Y 145 X s black 227 609 m 1814 X s 227 647 m -38 Y
 s 272 628 m -19 Y s 317 628 m -19 Y s 363 628 m -19 Y s 408 628 m -19 Y s 454 647 m -38 Y s 499 628 m -19 Y s 544 628 m -19 Y s 590 628 m -19 Y s 635 628 m -19 Y s 680 647 m -38 Y s 726 628 m -19 Y s 771 628 m -19 Y s 816 628 m -19 Y s 862 628 m -19
 Y s 907 647 m -38 Y s 952 628 m -19 Y s 998 628 m -19 Y s 1043 628 m -19 Y s 1089 628 m -19 Y s 1134 647 m -38 Y s 1179 628 m -19 Y s 1225 628 m -19 Y s 1270 628 m -19 Y s 1315 628 m -19 Y s 1361 647 m -38 Y s 1406 628 m -19 Y s 1451 628 m -19 Y s
 1497 628 m -19 Y s 1542 628 m -19 Y s 1587 647 m -38 Y s 1633 628 m -19 Y s 1678 628 m -19 Y s 1723 628 m -19 Y s 1769 628 m -19 Y s 1814 647 m -38 Y s 1860 628 m -19 Y s 1905 628 m -19 Y s 1950 628 m -19 Y s 1996 628 m -19 Y s 2041 647 m -38 Y s
 gsave  2268 1568 0 609 C 208.919 558.382 t 0 r /Helvetica findfont 49.4479 sf 0 0 m (0) show NC gr 
 gsave  2268 1568 0 609 C 425.434 558.382 t 0 r /Helvetica findfont 49.4479 sf 0 0 m (50) show NC gr 
 gsave  2268 1568 0 609 C 638.151 558.382 t 0 r /Helvetica findfont 49.4479 sf 0 0 m (100) show NC gr 
 gsave  2268 1568 0 609 C 862.264 558.382 t 0 r /Helvetica findfont 49.4479 sf 0 0 m (150) show NC gr 
 gsave  2268 1568 0 609 C 1090.18 558.382 t 0 r /Helvetica findfont 49.4479 sf 0 0 m (200) show NC gr 
 gsave  2268 1568 0 609 C 1318.09 558.382 t 0 r /Helvetica findfont 49.4479 sf 0 0 m (250) show NC gr 
 gsave  2268 1568 0 609 C 1542.2 558.382 t 0 r /Helvetica findfont 49.4479 sf 0 0 m (300) show NC gr 
 gsave  2268 1568 0 609 C 1770.11 558.382 t 0 r /Helvetica findfont 49.4479 sf 0 0 m (350) show NC gr 
 gsave  2268 1568 0 609 C 1998.02 558.382 t 0 r /Helvetica findfont 49.4479 sf 0 0 m (400) show NC gr  227 609 m 1411 Y s
 gsave  2268 1568 0 609 C 75.9704 1371.27 t 90 r /Helvetica findfont 34.2332 sf 0 0 m (ll) show NC gr 
 gsave  2268 1568 0 609 C 22.7911 1371.27 t 90 r /Helvetica findfont 34.2332 sf 0 0 m (T) show NC gr 
 gsave  2268 1568 0 609 C 45.5822 1299.09 t 90 r /Helvetica findfont 49.4479 sf 0 0 m (/dp) show NC gr 
 gsave  2268 1568 0 609 C 45.5822 1268.71 t 90 r /Symbol findfont 49.4479 sf 0 0 m (s) show NC gr 
 gsave  2268 1568 0 609 C 45.5822 1242.12 t 90 r /Helvetica findfont 49.4479 sf 0 0 m (d) show NC gr  288 609 m -61 X s 257 642 m -30 X s 257 675 m -30 X s 257 709 m -30 X s 257 742 m -30 X s 288 775 m -61 X s 257 808 m -30 X s 257 841 m -30 X s 257
 874 m -30 X s 257 907 m -30 X s 288 940 m -61 X s 257 973 m -30 X s 257 1006 m -30 X s 257 1039 m -30 X s 257 1072 m -30 X s 288 1105 m -61 X s 257 1138 m -30 X s 257 1171 m -30 X s 257 1204 m -30 X s 257 1237 m -30 X s 288 1270 m -61 X s 257 1303 m
 -30 X s 257 1336 m -30 X s 257 1369 m -30 X s 257 1402 m -30 X s 288 1435 m -61 X s 257 1468 m -30 X s 257 1501 m -30 X s 257 1534 m -30 X s 257 1567 m -30 X s 288 1600 m -61 X s 257 1633 m -30 X s 257 1666 m -30 X s 257 1699 m -30 X s 257 1732 m
 -30 X s 288 1765 m -61 X s 257 1798 m -30 X s 257 1831 m -30 X s 257 1865 m -30 X s 257 1898 m -30 X s 288 1931 m -61 X s 288 1931 m -61 X s 257 1964 m -30 X s 257 1997 m -30 X s
 gsave  2268 1568 0 609 C 186.127 592.569 t 0 r /Helvetica findfont 49.4479 sf 0 0 m (0) show NC gr 
 gsave  2268 1568 0 609 C 98.7615 755.906 t 0 r /Helvetica findfont 49.4479 sf 0 0 m (0.001) show NC gr 
 gsave  2268 1568 0 609 C 91.1645 923.04 t 0 r /Helvetica findfont 49.4479 sf 0 0 m (0.002) show NC gr 
 gsave  2268 1568 0 609 C 91.1645 1086.38 t 0 r /Helvetica findfont 49.4479 sf 0 0 m (0.003) show NC gr 
 gsave  2268 1568 0 609 C 87.366 1253.51 t 0 r /Helvetica findfont 49.4479 sf 0 0 m (0.004) show NC gr 
 gsave  2268 1568 0 609 C 91.1645 1416.85 t 0 r /Helvetica findfont 49.4479 sf 0 0 m (0.005) show NC gr 
 gsave  2268 1568 0 609 C 91.1645 1583.98 t 0 r /Helvetica findfont 49.4479 sf 0 0 m (0.006) show NC gr 
 gsave  2268 1568 0 609 C 87.366 1747.32 t 0 r /Helvetica findfont 49.4479 sf 0 0 m (0.007) show NC gr 
 gsave  2268 1568 0 609 C 91.1645 1914.45 t 0 r /Helvetica findfont 49.4479 sf 0 0 m (0.008) show NC gr  0 0 1 c /w 2 def /w2 {w 2 div} def /w3 {w 3 div} def 236 609 m20 254 609 m20 272 609 m20 290 609 m20 308 609 m20 327 609 m20 345 609 m20 363 609
 m20 381 609 m20 399 609 m20 417 609 m20 435 1321 m20 454 1637 m20 472 1720 m20 490 1798 m20 508 1871 m20 526 1922 m20 544 1953 m20 562 1945 m20 581 1858 m20 599 1651 m20 617 1486 m20 635 1376 m20 653 1291 m20 671 1218 m20 689 1158 m20 708 1111 m20
 726 1074 m20 744 1031 m20 762 997 m20 780 968 m20 798 938 m20 816 912 m20 835 894 m20 853 869 m20 871 848 m20 889 831 m20 907 815 m20 925 801 m20 943 786 m20 962 772 m20 980 761 m20 998 750 m20 1016 739 m20 1034 730 m20 1052 720 m20 1070 712 m20
 1089 703 m20 1107 695 m20 1125 690 m20 1143 685 m20 1161 678 m20 1179 673 m20 1197 667 m20 1215 663 m20 1234 660 m20 1252 655 m20 1270 652 m20 1288 649 m20 1306 645 m20 1324 642 m20 1342 640 m20 1361 637 m20 1379 635 m20 1397 633 m20 1415 631 m20
 1433 629 m20 1451 627 m20 1469 625 m20 1488 624 m20 1506 622 m20 1524 622 m20 1542 620 m20 1560 620 m20 1578 618 m20 1596 618 m20 1615 617 m20 1633 616 m20 1651 615 m20 1669 615 m20 1687 614 m20 1705 614 m20 1723 613 m20 1742 613 m20 1760 612 m20
 1778 612 m20 1796 612 m20 1814 611 m20 1832 611 m20 1850 611 m20 1869 611 m20 1887 611 m20 1905 610 m20 1923 610 m20 1941 610 m20 1959 610 m20 1977 610 m20 1996 610 m20 2014 610 m20 2032 610 m20 black 0 0 1 c 1 lw << /PatternType 1 /PaintType 2
 /TilingType 1 /BBox [ 0 0 100 100 ] /XStep 100 /YStep 100 /PaintProc { begin gsave 0 0 m 100 100 l 0 100 m 100 0 l s gr end } >> [ 0.24 0 0 0.24 0 0 ] makepattern /P13 exch def /cs {[/Pattern /DeviceRGB] setcolorspace} def /FA {f [/DeviceRGB]
 setcolorspace} def cs 0 0 1 P13 setcolor 236 609 m 181 X 18 715 d 19 317 d 18 83 d 18 78 d 18 73 d 18 51 d 18 31 d 18 -8 d 19 -86 d 18 -209 d 18 -165 d 18 -110 d 18 -86 d 18 -73 d 18 -60 d 19 -46 d 18 -38 d 18 -43 d 18 -34 d 18 -29 d 18 -30 d 18 -26
 d 19 -18 d 18 -25 d 18 -21 d 18 -18 d 18 -16 d 18 -14 d 18 -15 d 19 -13 d 18 -12 d 18 -11 d 18 -11 d 18 -9 d 18 -10 d 18 -8 d 19 -10 d 18 -7 d 18 -6 d 18 -5 d 18 -6 d 18 -5 d 18 -6 d 18 -4 d 19 -3 d 18 -5 d 18 -4 d 18 -3 d 18 -3 d 18 -3 d 18 -2 d 19
 -3 d 18 -2 d 18 -3 d 18 -2 d 18 -2 d 18 -2 d 18 -2 d 19 -1 d 18 -2 d 18 X 18 -2 d 18 X 18 -2 d 18 X 19 -1 d 18 -1 d 18 X 18 -1 d 18 -1 d 18 X 18 -1 d 37 X 18 -1 d 36 X 18 -1 d 55 X 18 -1 d 127 X -145 X -18 1 d -55 X -18 1 d -36 X -18 1 d -19 X -18 1
 d -18 X -18 1 d -18 X -18 1 d -18 1 d -19 X -18 1 d -18 1 d -18 1 d -18 2 d -18 X -18 2 d -19 1 d -18 1 d -18 2 d -18 2 d -18 3 d -18 2 d -18 2 d -19 3 d -18 2 d -18 3 d -18 3 d -18 3 d -18 4 d -18 5 d -19 3 d -18 4 d -18 5 d -18 5 d -18 7 d -18 5 d
 -18 5 d -18 8 d -19 9 d -18 8 d -18 10 d -18 9 d -18 10 d -18 12 d -18 11 d -19 14 d -18 14 d -18 14 d -18 16 d -18 18 d -18 21 d -18 24 d -19 18 d -18 26 d -18 30 d -18 29 d -18 33 d -18 43 d -18 38 d -19 46 d -18 60 d -18 73 d -18 85 d -18 109 d
 -18 165 d -18 207 d -19 87 d -18 7 d -18 -30 d -18 -51 d -18 -73 d -18 -78 d -18 -82 d -19 -316 d -18 -709 d -181 X FA 3 lw 0.8 0 0 c 1 0 0 c 0.8 0 0 c 227 609 m 199 X 239 Y 18 X 89 Y 19 X 13 Y 18 X 11 Y 18 X 7 Y 18 X 5 Y 36 X -6 Y 18 X -17 Y 19 X
 -33 Y 18 X -24 Y 18 X -18 Y 18 X -17 Y 18 X -16 Y 18 X -10 Y 18 X -13 Y 19 X -11 Y 18 X -9 Y 18 X -10 Y 18 X -9 Y 18 X -7 Y 18 X -9 Y 18 X -8 Y 19 X -6 Y 18 X -7 Y 18 X -7 Y 18 X -6 Y 18 X -6 Y 18 X -6 Y 18 X -5 Y 19 X -5 Y 18 X -5 Y 18 X -4 Y 18 X
 -6 Y 18 X -4 Y 18 X -4 Y 18 X -4 Y 19 X -4 Y 18 X -3 Y 18 X -4 Y 18 X -3 Y 18 X -3 Y 18 X -3 Y 18 X -3 Y 19 X -3 Y 18 X -3 Y 18 X -1 Y 18 X -3 Y 18 X -2 Y 18 X -2 Y 18 X -2 Y 19 X -2 Y 18 X -2 Y 18 X -2 Y 18 X -1 Y 18 X -2 Y 18 X -1 Y 18 X -2 Y 19 X
 -1 Y 18 X -1 Y 18 X -2 Y 36 X -2 Y 18 X -1 Y 37 X -1 Y 18 X -1 Y 18 X -1 Y 18 X -1 Y 36 X -1 Y 18 X -1 Y 55 X -1 Y 18 X -1 Y 54 X -1 Y 55 X -1 Y 72 X -1 Y 73 X s 1 0 0 c 236 609 m20 254 609 m20 272 609 m20 290 609 m20 308 609 m20 327 609 m20 345 609
 m20 363 609 m20 381 609 m20 399 609 m20 417 609 m20 435 848 m20 454 937 m20 472 950 m20 490 961 m20 508 968 m20 526 973 m20 544 973 m20 562 967 m20 581 950 m20 599 917 m20 617 893 m20 635 875 m20 653 858 m20 671 842 m20 689 832 m20 708 819 m20 726
 808 m20 744 799 m20 762 789 m20 780 780 m20 798 773 m20 816 764 m20 835 756 m20 853 750 m20 871 743 m20 889 736 m20 907 730 m20 925 724 m20 943 718 m20 962 713 m20 980 708 m20 998 703 m20 1016 699 m20 1034 693 m20 1052 689 m20 1070 685 m20 1089 681
 m20 1107 677 m20 1125 674 m20 1143 670 m20 1161 667 m20 1179 664 m20 1197 661 m20 1215 658 m20 1234 655 m20 1252 652 m20 1270 651 m20 1288 648 m20 1306 646 m20 1324 644 m20 1342 642 m20 1361 640 m20 1379 638 m20 1397 636 m20 1415 635 m20 1433 633
 m20 1451 632 m20 1469 630 m20 1488 629 m20 1506 628 m20 1524 626 m20 1542 626 m20 1560 624 m20 1578 623 m20 1596 623 m20 1615 622 m20 1633 621 m20 1651 620 m20 1669 619 m20 1687 619 m20 1705 618 m20 1723 617 m20 1742 617 m20 1760 617 m20 1778 616
 m20 1796 615 m20 1814 615 m20 1832 615 m20 1850 614 m20 1869 614 m20 1887 614 m20 1905 613 m20 1923 613 m20 1941 613 m20 1959 613 m20 1977 612 m20 1996 612 m20 2014 612 m20 2032 612 m20 0.8 0 0 c black 0.8 0 0 c cs 0.8 0 0 P13 setcolor 236 609 m 181
 X 18 240 d 19 89 d 18 13 d 18 11 d 18 7 d 18 5 d 18 X 18 -6 d 19 -17 d 18 -33 d 18 -24 d 18 -18 d 18 -17 d 18 -16 d 18 -10 d 19 -13 d 18 -11 d 18 -10 d 18 -9 d 18 -9 d 18 -7 d 18 -10 d 19 -7 d 18 -7 d 18 -7 d 18 -7 d 18 -5 d 18 -7 d 18 -5 d 19 -6 d
 18 -4 d 18 -6 d 18 -4 d 18 -5 d 18 -5 d 18 -4 d 19 -3 d 18 -4 d 18 -4 d 18 -4 d 18 -3 d 18 -3 d 18 -3 d 18 -3 d 19 -3 d 18 -2 d 18 -2 d 18 -2 d 18 -3 d 18 -2 d 18 -2 d 19 -2 d 18 -2 d 18 -2 d 18 -1 d 18 -2 d 18 -1 d 18 -1 d 19 -2 d 18 -1 d 18 -1 d
 18 -1 d 18 -1 d 18 -1 d 18 -1 d 19 -1 d 18 -1 d 18 -1 d 18 X 18 -1 d 18 -1 d 18 -1 d 37 X 18 -1 d 18 X 18 -1 d 18 X 18 -1 d 37 X 18 -1 d 54 X 18 -1 d 55 X -73 X -18 1 d -54 X -18 1 d -19 X -18 1 d -36 X -18 1 d -18 1 d -37 X -18 1 d -18 1 d -18 X
 -18 1 d -18 1 d -18 1 d -19 X -18 1 d -18 1 d -18 2 d -18 X -18 2 d -18 1 d -19 1 d -18 1 d -18 2 d -18 1 d -18 2 d -18 1 d -18 2 d -19 2 d -18 2 d -18 2 d -18 3 d -18 2 d -18 2 d -18 3 d -19 3 d -18 3 d -18 2 d -18 4 d -18 3 d -18 4 d -18 3 d -18 4
 d -19 3 d -18 4 d -18 5 d -18 5 d -18 4 d -18 5 d -18 5 d -19 5 d -18 6 d -18 6 d -18 6 d -18 7 d -18 7 d -18 7 d -19 7 d -18 9 d -18 7 d -18 9 d -18 10 d -18 10 d -18 11 d -19 12 d -18 10 d -18 16 d -18 17 d -18 17 d -18 25 d -18 32 d -19 17 d -18
 7 d -18 -1 d -18 -4 d -18 -7 d -18 -11 d -18 -13 d -19 -89 d -18 -238 d -181 X FA 0 0.4 0 c 1 1 1 c 0.35 0.83 0.33 c 0 0.4 0 c 227 609 m 199 X 759 Y 18 X 301 Y 19 X 56 Y 18 X 31 Y 18 X 28 Y 18 X 28 Y 18 X -20 Y 18 X -7 Y 18 X -98 Y 19 X -178 Y 18 X
 -120 Y 18 X -87 Y 18 X -73 Y 18 X -61 Y 18 X -41 Y 18 X -48 Y 19 X -37 Y 18 X -29 Y 18 X -34 Y 18 X -26 Y 18 X -23 Y 18 X -26 Y 18 X -22 Y 19 X -18 Y 18 X -20 Y 18 X -17 Y 18 X -13 Y 18 X -16 Y 18 X -14 Y 18 X -14 Y 19 X -11 Y 18 X -10 Y 18 X -10 Y
 18 X -10 Y 18 X -9 Y 18 X -8 Y 18 X -8 Y 19 X -8 Y 18 X -5 Y 18 X -7 Y 18 X -6 Y 18 X -4 Y 18 X -5 Y 18 X -4 Y 19 X -5 Y 18 X -4 Y 18 X -4 Y 18 X -3 Y 18 X -3 Y 18 X -2 Y 18 X -4 Y 19 X -2 Y 18 X -3 Y 18 X -2 Y 18 X -2 Y 18 X -2 Y 18 X -1 Y 18 X -2
 Y 19 X -1 Y 18 X -2 Y 18 X -1 Y 18 X -1 Y 18 X -1 Y 18 X -1 Y 18 X -1 Y 19 X -1 Y 18 X -1 Y 36 X -1 Y 36 X -1 Y 37 X -1 Y 36 X -1 Y 54 X -1 Y 91 X -1 Y 127 X s 0.35 0.83 0.33 c 236 609 m20 254 609 m20 272 609 m20 290 609 m20 308 609 m20 327 609 m20
 345 609 m20 363 609 m20 381 609 m20 399 609 m20 417 609 m20 435 1368 m20 454 1669 m20 472 1725 m20 490 1756 m20 508 1784 m20 526 1812 m20 544 1792 m20 562 1785 m20 581 1687 m20 599 1509 m20 617 1389 m20 635 1302 m20 653 1229 m20 671 1168 m20 689
 1127 m20 708 1079 m20 726 1042 m20 744 1013 m20 762 979 m20 780 953 m20 798 930 m20 816 904 m20 835 882 m20 853 864 m20 871 844 m20 889 827 m20 907 814 m20 925 798 m20 943 784 m20 962 770 m20 980 759 m20 998 749 m20 1016 739 m20 1034 729 m20 1052
 720 m20 1070 712 m20 1089 704 m20 1107 696 m20 1125 691 m20 1143 684 m20 1161 678 m20 1179 674 m20 1197 669 m20 1215 665 m20 1234 660 m20 1252 656 m20 1270 652 m20 1288 649 m20 1306 646 m20 1324 644 m20 1342 640 m20 1361 638 m20 1379 635 m20 1397
 633 m20 1415 631 m20 1433 629 m20 1451 628 m20 1469 626 m20 1488 625 m20 1506 623 m20 1524 622 m20 1542 621 m20 1560 620 m20 1578 619 m20 1596 618 m20 1615 617 m20 1633 616 m20 1651 616 m20 1669 615 m20 1687 615 m20 1705 614 m20 1723 614 m20 1742
 613 m20 1760 613 m20 1778 612 m20 1796 612 m20 1814 612 m20 1832 611 m20 1850 611 m20 1869 611 m20 1887 611 m20 1905 611 m20 1923 610 m20 1941 610 m20 1959 610 m20 1977 610 m20 1996 610 m20 2014 610 m20 2032 610 m20 0 0.4 0 c black 0 0.4 0 c cs 0
 0.4 0 P13 setcolor 236 609 m 181 X 18 765 d 19 302 d 18 56 d 18 31 d 18 29 d 18 28 d 18 -19 d 18 -7 d 19 -99 d 18 -180 d 18 -121 d 18 -88 d 18 -73 d 18 -62 d 18 -41 d 19 -49 d 18 -36 d 18 -29 d 18 -35 d 18 -25 d 18 -24 d 18 -26 d 19 -22 d 18 -18 d
 18 -20 d 18 -17 d 18 -14 d 18 -16 d 18 -14 d 19 -14 d 18 -11 d 18 -10 d 18 -10 d 18 -10 d 18 -9 d 18 -8 d 19 -8 d 18 -8 d 18 -5 d 18 -7 d 18 -6 d 18 -5 d 18 -5 d 18 -4 d 19 -5 d 18 -4 d 18 -3 d 18 -3 d 18 -4 d 18 -2 d 18 -4 d 19 -2 d 18 -3 d 18 -2 d
 18 -2 d 18 -2 d 18 -1 d 18 -2 d 19 -1 d 18 -2 d 18 -1 d 18 -1 d 18 -1 d 18 -1 d 18 -1 d 19 -1 d 18 -1 d 18 X 18 -1 d 18 X 18 -1 d 18 X 19 -1 d 18 X 18 -1 d 36 X 18 -1 d 73 X 18 -1 d 109 X -109 X -18 1 d -73 X -18 1 d -36 X -18 1 d -37 X -18 1 d -18
 X -18 1 d -18 1 d -18 X -18 1 d -19 1 d -18 1 d -18 1 d -18 1 d -18 1 d -18 1 d -18 2 d -19 1 d -18 2 d -18 1 d -18 2 d -18 2 d -18 2 d -18 2 d -19 2 d -18 4 d -18 3 d -18 3 d -18 3 d -18 3 d -18 5 d -19 4 d -18 4 d -18 5 d -18 5 d -18 6 d -18 6 d
 -18 6 d -18 7 d -19 8 d -18 8 d -18 9 d -18 10 d -18 10 d -18 10 d -18 11 d -19 14 d -18 13 d -18 16 d -18 14 d -18 17 d -18 20 d -18 17 d -19 23 d -18 25 d -18 23 d -18 26 d -18 34 d -18 29 d -18 36 d -19 48 d -18 41 d -18 61 d -18 71 d -18 87 d
 -18 118 d -18 177 d -19 97 d -18 8 d -18 19 d -18 -27 d -18 -28 d -18 -31 d -18 -56 d -19 -299 d -18 -753 d -181 X FA black 1 1 1 c 567 470 1587 1550 bf black 1587 1550 m 567 X s 2154 1550 m 470 Y s 2154 2020 m -567 X s 1587 2020 m -470 Y s
 gsave  2268 1568 0 609 C 1728.33 1918.25 t 0 r /Helvetica findfont 72.27 sf 0 0 m (No Int) show NC gr  0.8 0 0 c 1609 1941 m 99 X s black
 gsave  2268 1568 0 609 C 1728.33 1758.71 t 0 r /Helvetica findfont 72.27 sf 0 0 m (With Int) show NC gr  0 0 1 c 1609 1785 m 99 X s black
 gsave  2268 1568 0 609 C 1728.33 1610.57 t 0 r /Helvetica findfont 72.27 sf 0 0 m (Reweighted) show NC gr  0 0.4 0 c 1609 1628 m 99 X s black
 gsave  2268 1568 0 609 C 2222.13 1747.32 t 90 r /Helvetica-BoldOblique findfont 30.4295 sf 0 0 m (LHC HIGGS XS WG 2013) show NC gr  1 1 1 c 2268 609 0 0 bf black 1 1 1 c 1814 457 227 152 bf black 1814 457 227 152 bl 1 1 1 c black 227 152 m 199 X 215
 Y 18 X 7 Y 19 X 6 Y 18 X 9 Y 18 X 9 Y 18 X 4 Y 18 X 10 Y 36 X 5 Y 37 X -8 Y 18 X -4 Y 18 X -2 Y 18 X -2 Y 18 X -7 Y 18 X 3 Y 37 X -6 Y 18 X 1 Y 18 X -2 Y 18 X -4 Y 18 X 1 Y 18 X 4 Y 19 X -5 Y 18 X -1 Y 18 X -1 Y 18 X -2 Y 18 X 3 Y 18 X -2 Y 18 X 2 Y
 19 X -2 Y 18 X -1 Y 18 X -2 Y 18 X 3 Y 18 X -3 Y 36 X -3 Y 19 X 1 Y 18 X -1 Y 18 X 5 Y 18 X -3 Y 18 X -1 Y 18 X -3 Y 18 X 1 Y 19 X 6 Y 18 X -3 Y 18 X -2 Y 36 X -2 Y 18 X -5 Y 18 X 14 Y 19 X -4 Y 18 X 4 Y 18 X -2 Y 18 X -5 Y 18 X -1 Y 18 X -6 Y 18 X
 -2 Y 19 X -3 Y 18 X -3 Y 18 X 18 Y 18 X -24 Y 18 X 19 Y 18 X -9 Y 18 X 2 Y 19 X 7 Y 18 X 5 Y 18 X -12 Y 18 X -2 Y 18 X 1 Y 18 X -4 Y 37 X 8 Y 18 X -15 Y 18 X -2 Y 18 X -2 Y 18 X -7 Y 18 X 15 Y 18 X -19 Y 19 X 1 Y 18 X -12 Y 18 X -2 Y 18 X 31 Y 18 X
 -60 Y 18 X 2 Y 18 X -41 Y 19 X 91 Y 18 X -37 Y 18 X 16 Y 18 X s 227 152 m 1814 X s
 gsave  2268 609 0 0 C 2017.01 11.3956 t 0 r /Helvetica findfont 38.0897 sf 0 0 m (ll) show NC gr 
 gsave  2268 609 0 0 C 2017.01 68.3734 t 0 r /Helvetica findfont 38.0897 sf 0 0 m (T) show NC gr 
 gsave  2268 609 0 0 C 1986.63 45.5822 t 0 r /Helvetica findfont 57.1345 sf 0 0 m (p) show NC gr  227 167 m -15 Y s 272 160 m -8 Y s 317 160 m -8 Y s 363 160 m -8 Y s 408 160 m -8 Y s 454 167 m -15 Y s 499 160 m -8 Y s 544 160 m -8 Y s 590 160 m -8 Y
 s 635 160 m -8 Y s 680 167 m -15 Y s 726 160 m -8 Y s 771 160 m -8 Y s 816 160 m -8 Y s 862 160 m -8 Y s 907 167 m -15 Y s 952 160 m -8 Y s 998 160 m -8 Y s 1043 160 m -8 Y s 1089 160 m -8 Y s 1134 167 m -15 Y s 1179 160 m -8 Y s 1225 160 m -8 Y s
 1270 160 m -8 Y s 1315 160 m -8 Y s 1361 167 m -15 Y s 1406 160 m -8 Y s 1451 160 m -8 Y s 1497 160 m -8 Y s 1542 160 m -8 Y s 1587 167 m -15 Y s 1633 160 m -8 Y s 1678 160 m -8 Y s 1723 160 m -8 Y s 1769 160 m -8 Y s 1814 167 m -15 Y s 1860 160 m
 -8 Y s 1905 160 m -8 Y s 1950 160 m -8 Y s 1996 160 m -8 Y s 2041 167 m -15 Y s
 gsave  2268 609 0 0 C 208.919 113.956 t 0 r /Helvetica findfont 45.7076 sf 0 0 m (0) show NC gr 
 gsave  2268 609 0 0 C 425.434 113.956 t 0 r /Helvetica findfont 45.7076 sf 0 0 m (50) show NC gr 
 gsave  2268 609 0 0 C 641.95 113.956 t 0 r /Helvetica findfont 45.7076 sf 0 0 m (100) show NC gr 
 gsave  2268 609 0 0 C 866.063 113.956 t 0 r /Helvetica findfont 45.7076 sf 0 0 m (150) show NC gr 
 gsave  2268 609 0 0 C 1093.97 113.956 t 0 r /Helvetica findfont 45.7076 sf 0 0 m (200) show NC gr 
 gsave  2268 609 0 0 C 1321.89 113.956 t 0 r /Helvetica findfont 45.7076 sf 0 0 m (250) show NC gr 
 gsave  2268 609 0 0 C 1546 113.956 t 0 r /Helvetica findfont 45.7076 sf 0 0 m (300) show NC gr 
 gsave  2268 609 0 0 C 1773.91 113.956 t 0 r /Helvetica findfont 45.7076 sf 0 0 m (350) show NC gr 
 gsave  2268 609 0 0 C 2001.82 113.956 t 0 r /Helvetica findfont 45.7076 sf 0 0 m (400) show NC gr  227 152 m 457 Y s
 gsave  2268 609 0 0 C 91.1645 170.933 t 90 r /Helvetica findfont 45.7076 sf 0 0 m (\(S+I\)/\(Reweighted S\)) show NC gr  278 152 m -51 X s 252 164 m -25 X s 252 175 m -25 X s 252 187 m -25 X s 278 198 m -51 X s 252 209 m -25 X s 252 221 m -25 X s
 252 232 m -25 X s 278 244 m -51 X s 252 255 m -25 X s 252 267 m -25 X s 252 278 m -25 X s 278 289 m -51 X s 252 301 m -25 X s 252 312 m -25 X s 252 324 m -25 X s 278 335 m -51 X s 252 347 m -25 X s 252 358 m -25 X s 252 369 m -25 X s 278 381 m -51 X
 s 252 392 m -25 X s 252 404 m -25 X s 252 415 m -25 X s 278 427 m -51 X s 252 438 m -25 X s 252 449 m -25 X s 252 461 m -25 X s 278 472 m -51 X s 252 484 m -25 X s 252 495 m -25 X s 252 507 m -25 X s 278 518 m -51 X s 252 529 m -25 X s 252 541 m -25
 X s 252 552 m -25 X s 278 564 m -51 X s 252 575 m -25 X s 252 587 m -25 X s 252 598 m -25 X s 278 609 m -51 X s
 gsave  2268 609 0 0 C 186.127 136.747 t 0 r /Helvetica findfont 45.7076 sf 0 0 m (0) show NC gr 
 gsave  2268 609 0 0 C 148.142 182.329 t 0 r /Helvetica findfont 45.7076 sf 0 0 m (0.2) show NC gr 
 gsave  2268 609 0 0 C 148.142 227.911 t 0 r /Helvetica findfont 45.7076 sf 0 0 m (0.4) show NC gr 
 gsave  2268 609 0 0 C 148.142 273.493 t 0 r /Helvetica findfont 45.7076 sf 0 0 m (0.6) show NC gr 
 gsave  2268 609 0 0 C 148.142 319.076 t 0 r /Helvetica findfont 45.7076 sf 0 0 m (0.8) show NC gr 
 gsave  2268 609 0 0 C 193.725 364.658 t 0 r /Helvetica findfont 45.7076 sf 0 0 m (1) show NC gr 
 gsave  2268 609 0 0 C 148.142 410.24 t 0 r /Helvetica findfont 45.7076 sf 0 0 m (1.2) show NC gr 
 gsave  2268 609 0 0 C 148.142 455.822 t 0 r /Helvetica findfont 45.7076 sf 0 0 m (1.4) show NC gr 
 gsave  2268 609 0 0 C 148.142 501.405 t 0 r /Helvetica findfont 45.7076 sf 0 0 m (1.6) show NC gr 
 gsave  2268 609 0 0 C 148.142 546.987 t 0 r /Helvetica findfont 45.7076 sf 0 0 m (1.8) show NC gr 
 gsave  2268 609 0 0 C 186.127 592.569 t 0 r /Helvetica findfont 45.7076 sf 0 0 m (2) show NC gr  236 152 m20 254 152 m20 272 152 m20 290 152 m20 308 152 m20 327 152 m20 345 152 m20 363 152 m20 381 152 m20 399 152 m20 417 152 m20 435 367 m20 454 374
 m20 472 380 m20 490 389 m20 508 398 m20 526 402 m20 544 412 m20 562 412 m20 581 417 m20 599 417 m20 617 409 m20 635 405 m20 653 403 m20 671 401 m20 689 394 m20 708 397 m20 726 397 m20 744 391 m20 762 392 m20 780 390 m20 798 386 m20 816 387 m20 835
 391 m20 853 386 m20 871 385 m20 889 384 m20 907 382 m20 925 385 m20 943 383 m20 962 385 m20 980 383 m20 998 382 m20 1016 380 m20 1034 383 m20 1052 380 m20 1070 380 m20 1089 377 m20 1107 378 m20 1125 377 m20 1143 382 m20 1161 379 m20 1179 378 m20
 1197 375 m20 1215 376 m20 1234 382 m20 1252 379 m20 1270 377 m20 1288 377 m20 1306 375 m20 1324 370 m20 1342 384 m20 1361 380 m20 1379 384 m20 1397 382 m20 1415 377 m20 1433 376 m20 1451 370 m20 1469 368 m20 1488 365 m20 1506 362 m20 1524 380 m20
 1542 356 m20 1560 375 m20 1578 366 m20 1596 368 m20 1615 375 m20 1633 380 m20 1651 368 m20 1669 366 m20 1687 367 m20 1705 363 m20 1723 363 m20 1742 371 m20 1760 356 m20 1778 354 m20 1796 352 m20 1814 345 m20 1832 360 m20 1850 341 m20 1869 342 m20
 1887 330 m20 1905 328 m20 1923 359 m20 1941 299 m20 1959 301 m20 1977 260 m20 1996 351 m20 2014 314 m20 2032 330 m20 cs 0 0 0 P13 setcolor 236 152 m 181 X 18 217 d 19 7 d 18 6 d 18 9 d 18 9 d 18 4 d 18 10 d 18 X 19 5 d 18 X 18 -8 d 18 -4 d 18 -2 d
 18 -2 d 18 -7 d 19 3 d 18 X 18 -6 d 18 1 d 18 -2 d 18 -4 d 18 1 d 19 4 d 18 -5 d 18 -1 d 18 -1 d 18 -2 d 18 3 d 18 -2 d 19 2 d 18 -1 d 18 -1 d 18 -2 d 18 2 d 18 -2 d 18 X 19 -3 d 18 1 d 18 -1 d 18 5 d 18 -3 d 18 -1 d 18 -3 d 18 1 d 19 7 d 18 -4 d 18
 -2 d 18 1 d 18 -3 d 18 -4 d 18 14 d 19 -4 d 18 4 d 18 -2 d 18 -4 d 18 -1 d 18 -7 d 18 -1 d 19 -3 d 18 -3 d 18 19 d 18 -25 d 18 21 d 18 -10 d 18 3 d 19 7 d 18 5 d 18 -12 d 18 -1 d 18 2 d 18 -4 d 18 X 19 9 d 18 -15 d 18 -1 d 18 -1 d 18 -6 d 18 16 d 18
 -19 d 19 2 d 18 -10 d 18 -2 d 18 35 d 18 -60 d 18 6 d 18 -40 d 19 95 d 18 -34 d 18 20 d -74 Y -18 -13 d -18 41 d -19 -87 d -18 42 d -18 1 d -18 62 d -18 -28 d -18 2 d -18 13 d -19 X -18 20 d -18 -13 d -18 7 d -18 3 d -18 3 d -18 14 d -19 -6 d -18 1
 d -18 4 d -18 -1 d -18 2 d -18 13 d -18 -5 d -19 -6 d -18 -3 d -18 10 d -18 -19 d -18 25 d -18 -18 d -18 3 d -19 3 d -18 2 d -18 6 d -18 2 d -18 4 d -18 2 d -18 -3 d -19 4 d -18 -14 d -18 5 d -18 3 d -18 -1 d -18 3 d -18 3 d -19 -6 d -18 -1 d -18 3
 d -18 1 d -18 3 d -18 -5 d -18 1 d -18 X -19 3 d -18 X -18 2 d -18 -2 d -18 2 d -18 1 d -18 1 d -19 -1 d -18 2 d -18 -3 d -18 2 d -18 1 d -18 1 d -18 5 d -19 -4 d -18 -1 d -18 5 d -18 1 d -18 -1 d -18 6 d -18 X -19 -3 d -18 7 d -18 3 d -18 2 d -18 3
 d -18 8 d -18 X -19 -5 d -18 X -18 -10 d -18 -4 d -18 -8 d -18 -10 d -18 -5 d -19 -8 d -18 -213 d -181 X FA
 gr  gr showpage
end
%%EOF
