%!PS-Adobe-1.0
%%Creator: Unified Graphics System
%%Pages: (atend)
%%DocumentFonts: Courier
%%BoundingBox:   66  210  467  570
%%EndComments
/Sw{setlinewidth}def
/Sg{setgray}def
/Sd{setdash}def
/P {newpath
    moveto
0 0 rlineto
    stroke}def
/M {moveto}def
/D {lineto}def
/N {newpath}def
/S {stroke}def
/T {/Courier findfont
    exch
    scalefont
    setfont}def
/R {rotate}def
/W {show}def
/F {fill}def
/X {gsave}def
/Y {grestore}def
%%EndProlog
%%Page: 1 1
0.24000 0.24000 scale
1 setlinecap
1 setlinejoin
5 Sw
0 0 0 setrgbcolor
[] 0 Sd
N
290 1815 M
336 1815 D
S
N
290 1817 M
336 1817 D
S
N
312 1815 M
307 1811 D
305 1806 D
305 1802 D
307 1796 D
312 1791 D
318 1789 D
323 1789 D
329 1791 D
333 1796 D
336 1802 D
336 1806 D
333 1811 D
329 1815 D
S
N
305 1802 M
307 1798 D
312 1793 D
318 1791 D
323 1791 D
329 1793 D
333 1798 D
336 1802 D
S
N
290 1809 M
290 1817 D
S
N
336 1815 M
336 1824 D
S
N
305 1869 M
305 1848 D
307 1841 D
314 1837 D
320 1835 D
327 1835 D
331 1837 D
333 1839 D
336 1843 D
336 1848 D
333 1854 D
327 1858 D
320 1861 D
314 1861 D
310 1858 D
307 1856 D
305 1852 D
S
N
305 1848 M
307 1843 D
314 1839 D
320 1837 D
329 1837 D
333 1839 D
S
N
336 1848 M
333 1852 D
327 1856 D
320 1858 D
312 1858 D
307 1856 D
S
N
307 1856 M
307 1869 D
S
N
323 1881 M
353 1900 D
S
N
323 1882 M
353 1901 D
S
N
323 1901 M
353 1881 D
S
N
323 1878 M
323 1887 D
S
N
323 1895 M
323 1904 D
S
N
353 1878 M
353 1887 D
S
N
353 1895 M
353 1904 D
S
N
282 1952 M
351 1913 D
S
N
290 1988 M
336 1988 D
S
N
290 1990 M
336 1990 D
S
N
312 1988 M
307 1984 D
305 1980 D
305 1975 D
307 1969 D
312 1965 D
318 1962 D
323 1962 D
329 1965 D
333 1969 D
336 1975 D
336 1980 D
333 1984 D
329 1988 D
S
N
305 1975 M
307 1971 D
312 1967 D
318 1965 D
323 1965 D
329 1967 D
333 1971 D
336 1975 D
S
N
290 1982 M
290 1990 D
S
N
336 1988 M
336 1997 D
S
N
305 2012 M
336 2012 D
S
N
305 2014 M
336 2014 D
S
N
312 2014 M
307 2019 D
305 2025 D
305 2029 D
307 2036 D
312 2038 D
336 2038 D
S
N
305 2029 M
307 2034 D
312 2036 D
336 2036 D
S
N
312 2038 M
307 2042 D
305 2049 D
305 2053 D
307 2060 D
312 2062 D
336 2062 D
S
N
305 2053 M
307 2058 D
312 2060 D
336 2060 D
S
N
305 2006 M
305 2014 D
S
N
336 2006 M
336 2021 D
S
N
336 2029 M
336 2045 D
S
N
336 2053 M
336 2068 D
S
N
326 2093 M
353 2093 D
S
N
323 2094 M
353 2094 D
S
N
323 2094 M
344 2079 D
344 2102 D
S
N
353 2089 M
353 2099 D
S
N
323 2112 M
353 2112 D
S
N
323 2113 M
353 2113 D
S
N
323 2107 M
323 2113 D
S
N
353 2107 M
353 2118 D
S
N
1942 2219 M
1912 2219 D
S
N
1942 2217 M
1912 2217 D
S
N
1942 2223 M
1942 2213 D
S
N
1912 2223 M
1912 2201 D
1920 2201 D
1912 2203 D
S
N
1942 2193 M
1912 2193 D
S
N
1942 2191 M
1912 2191 D
S
N
1942 2174 M
1912 2174 D
S
N
1942 2173 M
1912 2173 D
S
N
1942 2197 M
1942 2187 D
S
N
1942 2178 M
1942 2168 D
S
N
1927 2191 M
1927 2174 D
S
N
1912 2197 M
1912 2187 D
S
N
1912 2178 M
1912 2168 D
S
N
1938 2141 M
1933 2139 D
1942 2139 D
1938 2141 D
1940 2144 D
1942 2148 D
1942 2151 D
1940 2155 D
1938 2158 D
1935 2160 D
1930 2161 D
1923 2161 D
1919 2160 D
1916 2158 D
1913 2155 D
1912 2151 D
1912 2148 D
1913 2144 D
1916 2141 D
1919 2139 D
S
N
1942 2151 M
1940 2154 D
1938 2157 D
1935 2158 D
1930 2160 D
1923 2160 D
1919 2158 D
1916 2157 D
1913 2154 D
1912 2151 D
S
N
1942 2105 M
1912 2105 D
S
N
1942 2103 M
1912 2103 D
S
N
1942 2086 M
1912 2086 D
S
N
1942 2084 M
1912 2084 D
S
N
1942 2109 M
1942 2099 D
S
N
1942 2090 M
1942 2080 D
S
N
1927 2103 M
1927 2086 D
S
N
1912 2109 M
1912 2099 D
S
N
1912 2090 M
1912 2080 D
S
N
1942 2070 M
1912 2070 D
S
N
1942 2069 M
1912 2069 D
S
N
1942 2074 M
1942 2064 D
S
N
1912 2074 M
1912 2064 D
S
N
1938 2037 M
1933 2035 D
1942 2035 D
1938 2037 D
1940 2040 D
1942 2044 D
1942 2047 D
1940 2051 D
1938 2054 D
1935 2056 D
1930 2057 D
1923 2057 D
1919 2056 D
1916 2054 D
1913 2051 D
1912 2047 D
1912 2044 D
1913 2040 D
1916 2037 D
S
N
1942 2047 M
1940 2050 D
1938 2053 D
1935 2054 D
1930 2056 D
1923 2056 D
1919 2054 D
1916 2053 D
1913 2050 D
1912 2047 D
S
N
1923 2037 M
1912 2037 D
S
N
1923 2035 M
1912 2035 D
S
N
1923 2041 M
1923 2031 D
S
N
1938 2004 M
1933 2002 D
1942 2002 D
1938 2004 D
1940 2007 D
1942 2011 D
1942 2014 D
1940 2018 D
1938 2021 D
1935 2022 D
1930 2024 D
1923 2024 D
1919 2022 D
1916 2021 D
1913 2018 D
1912 2014 D
1912 2011 D
1913 2007 D
1916 2004 D
S
N
1942 2014 M
1940 2017 D
1938 2020 D
1935 2021 D
1930 2022 D
1923 2022 D
1919 2021 D
1916 2020 D
1913 2017 D
1912 2014 D
S
N
1923 2004 M
1912 2004 D
S
N
1923 2002 M
1912 2002 D
S
N
1923 2008 M
1923 1998 D
S
N
1938 1972 M
1942 1970 D
1933 1970 D
1938 1972 D
1940 1975 D
1942 1979 D
1942 1983 D
1940 1988 D
1938 1991 D
1935 1991 D
1932 1989 D
1930 1988 D
1929 1985 D
1926 1976 D
1925 1973 D
1922 1970 D
S
N
1935 1991 M
1932 1988 D
1930 1985 D
1927 1976 D
1926 1973 D
1925 1972 D
1922 1970 D
1916 1970 D
1913 1973 D
1912 1978 D
1912 1982 D
1913 1986 D
1916 1989 D
1920 1991 D
1912 1991 D
1916 1989 D
S
N
1942 1939 M
1912 1920 D
S
N
1942 1937 M
1912 1918 D
S
N
1942 1918 M
1912 1939 D
S
N
1942 1942 M
1942 1933 D
S
N
1942 1924 M
1942 1916 D
S
N
1912 1942 M
1912 1933 D
S
N
1912 1924 M
1912 1916 D
S
N
1938 1891 M
1942 1890 D
1933 1890 D
1938 1891 D
1940 1894 D
1942 1898 D
1942 1903 D
1940 1907 D
1938 1910 D
1935 1910 D
1932 1908 D
1930 1907 D
1929 1904 D
1926 1895 D
1925 1892 D
1922 1890 D
S
N
1935 1910 M
1932 1907 D
1930 1904 D
1927 1895 D
1926 1892 D
1925 1891 D
1922 1890 D
1916 1890 D
1913 1892 D
1912 1897 D
1912 1901 D
1913 1905 D
1916 1908 D
1920 1910 D
1912 1910 D
1916 1908 D
S
N
1942 1879 M
1912 1874 D
S
N
1942 1878 M
1919 1874 D
S
N
1942 1868 M
1912 1874 D
S
N
1942 1868 M
1912 1862 D
S
N
1942 1866 M
1919 1862 D
S
N
1942 1856 M
1912 1862 D
S
N
1942 1884 M
1942 1874 D
S
N
1942 1861 M
1942 1852 D
S
N
1938 1826 M
1933 1825 D
1942 1825 D
1938 1826 D
1940 1829 D
1942 1833 D
1942 1836 D
1940 1840 D
1938 1843 D
1935 1845 D
1930 1846 D
1923 1846 D
1919 1845 D
1916 1843 D
1913 1840 D
1912 1836 D
1912 1833 D
1913 1829 D
1916 1826 D
S
N
1942 1836 M
1940 1839 D
1938 1842 D
1935 1843 D
1930 1845 D
1923 1845 D
1919 1843 D
1916 1842 D
1913 1839 D
1912 1836 D
S
N
1923 1826 M
1912 1826 D
S
N
1923 1825 M
1912 1825 D
S
N
1923 1830 M
1923 1820 D
S
N
1936 1789 M
1935 1787 D
1933 1789 D
1935 1790 D
1936 1790 D
1939 1789 D
1940 1787 D
1942 1783 D
1942 1777 D
1940 1773 D
1939 1771 D
1936 1770 D
1933 1770 D
1930 1771 D
1927 1776 D
1925 1783 D
1923 1786 D
1920 1789 D
1916 1790 D
1912 1790 D
S
N
1942 1777 M
1940 1774 D
1939 1773 D
1936 1771 D
1933 1771 D
1930 1773 D
1927 1777 D
1925 1783 D
S
N
1915 1790 M
1916 1789 D
1916 1786 D
1913 1778 D
1913 1774 D
1915 1771 D
1916 1770 D
S
N
1916 1786 M
1912 1778 D
1912 1773 D
1913 1771 D
1916 1770 D
1919 1770 D
S
N
1942 1752 M
1940 1757 D
1936 1760 D
1929 1761 D
1925 1761 D
1917 1760 D
1913 1757 D
1912 1752 D
1912 1750 D
1913 1745 D
1917 1742 D
1925 1741 D
1929 1741 D
1936 1742 D
1940 1745 D
1942 1750 D
1942 1752 D
S
N
1942 1752 M
1940 1755 D
1939 1757 D
1936 1758 D
1929 1760 D
1925 1760 D
1917 1758 D
1915 1757 D
1913 1755 D
1912 1752 D
S
N
1912 1750 M
1913 1747 D
1915 1745 D
1917 1744 D
1925 1742 D
1929 1742 D
1936 1744 D
1939 1745 D
1940 1747 D
1942 1750 D
S
N
1936 1728 M
1938 1725 D
1942 1721 D
1912 1721 D
S
N
1940 1722 M
1912 1722 D
S
N
1912 1728 M
1912 1715 D
S
N
1936 1702 M
1935 1700 D
1933 1702 D
1935 1703 D
1936 1703 D
1939 1702 D
1940 1700 D
1942 1696 D
1942 1690 D
1940 1686 D
1938 1685 D
1933 1685 D
1930 1686 D
1929 1690 D
1929 1695 D
S
N
1942 1690 M
1940 1687 D
1938 1686 D
1933 1686 D
1930 1687 D
1929 1690 D
S
N
1929 1690 M
1927 1687 D
1925 1685 D
1922 1683 D
1917 1683 D
1915 1685 D
1913 1686 D
1912 1690 D
1912 1696 D
1913 1700 D
1915 1702 D
1917 1703 D
1919 1703 D
1920 1702 D
1919 1700 D
1917 1702 D
S
N
1926 1686 M
1922 1685 D
1917 1685 D
1915 1686 D
1913 1687 D
1912 1690 D
S
N
1439 2275 M
1433 2273 D
1431 2268 D
1431 2262 D
1433 2258 D
1439 2255 D
1448 2255 D
1454 2258 D
1457 2262 D
1457 2268 D
1454 2273 D
1448 2275 D
1439 2275 D
S
N
1439 2275 M
1435 2273 D
1433 2268 D
1433 2262 D
1435 2258 D
1439 2255 D
S
N
1448 2255 M
1452 2258 D
1454 2262 D
1454 2268 D
1452 2273 D
1448 2275 D
S
N
1439 2255 M
1433 2253 D
1431 2251 D
1429 2247 D
1429 2238 D
1431 2234 D
1433 2232 D
1439 2230 D
1448 2230 D
1454 2232 D
1457 2234 D
1459 2238 D
1459 2247 D
1457 2251 D
1454 2253 D
1448 2255 D
S
N
1439 2255 M
1435 2253 D
1433 2251 D
1431 2247 D
1431 2238 D
1433 2234 D
1435 2232 D
1439 2230 D
S
N
1448 2230 M
1452 2232 D
1454 2234 D
1457 2238 D
1457 2247 D
1454 2251 D
1452 2253 D
1448 2255 D
S
N
1519 2275 M
1519 2230 D
S
N
1522 2275 M
1522 2230 D
S
N
1506 2275 M
1504 2262 D
1504 2275 D
1537 2275 D
1537 2262 D
1535 2275 D
S
N
1513 2230 M
1528 2230 D
S
N
1550 2247 M
1576 2247 D
1576 2251 D
1574 2255 D
1571 2258 D
1567 2260 D
1561 2260 D
1554 2258 D
1550 2253 D
1548 2247 D
1548 2243 D
1550 2236 D
1554 2232 D
1561 2230 D
1565 2230 D
1571 2232 D
1576 2236 D
S
N
1574 2247 M
1574 2253 D
1571 2258 D
S
N
1561 2260 M
1556 2258 D
1552 2253 D
1550 2247 D
1550 2243 D
1552 2236 D
1556 2232 D
1561 2230 D
S
N
1589 2275 M
1604 2230 D
S
N
1591 2275 M
1604 2236 D
S
N
1619 2275 M
1604 2230 D
S
N
1584 2275 M
1597 2275 D
S
N
1610 2275 M
1623 2275 D
S
N
1436 2172 M
1436 2149 D
S
N
1438 2172 M
1438 2149 D
S
N
1438 2167 M
1441 2171 D
1446 2172 D
1450 2172 D
1455 2171 D
1456 2167 D
1456 2149 D
S
N
1450 2172 M
1453 2171 D
1455 2167 D
1455 2149 D
S
N
1456 2167 M
1460 2171 D
1465 2172 D
1468 2172 D
1473 2171 D
1475 2167 D
1475 2149 D
S
N
1468 2172 M
1471 2171 D
1473 2167 D
1473 2149 D
S
N
1431 2172 M
1438 2172 D
S
N
1431 2149 M
1443 2149 D
S
N
1450 2149 M
1461 2149 D
S
N
1468 2149 M
1480 2149 D
S
N
1491 2159 M
1491 2136 D
S
N
1492 2159 M
1492 2136 D
S
N
1505 2159 M
1505 2136 D
S
N
1506 2159 M
1506 2136 D
S
N
1487 2159 M
1495 2159 D
S
N
1502 2159 M
1509 2159 D
S
N
1492 2148 M
1505 2148 D
S
N
1487 2136 M
1495 2136 D
S
N
1502 2136 M
1509 2136 D
S
N
1547 2169 M
1577 2169 D
S
N
1547 2159 M
1577 2159 D
S
N
1623 2184 M
1618 2182 D
1617 2179 D
1617 2174 D
1618 2171 D
1623 2169 D
1630 2169 D
1635 2171 D
1637 2174 D
1637 2179 D
1635 2182 D
1630 2184 D
1623 2184 D
S
N
1623 2184 M
1620 2182 D
1618 2179 D
1618 2174 D
1620 2171 D
1623 2169 D
S
N
1630 2169 M
1633 2171 D
1635 2174 D
1635 2179 D
1633 2182 D
1630 2184 D
S
N
1623 2169 M
1618 2167 D
1617 2166 D
1615 2162 D
1615 2156 D
1617 2152 D
1618 2151 D
1623 2149 D
1630 2149 D
1635 2151 D
1637 2152 D
1638 2156 D
1638 2162 D
1637 2166 D
1635 2167 D
1630 2169 D
S
N
1623 2169 M
1620 2167 D
1618 2166 D
1617 2162 D
1617 2156 D
1618 2152 D
1620 2151 D
1623 2149 D
S
N
1630 2149 M
1633 2151 D
1635 2152 D
1637 2156 D
1637 2162 D
1635 2166 D
1633 2167 D
1630 2169 D
S
N
1658 2184 M
1653 2182 D
1650 2177 D
1648 2169 D
1648 2164 D
1650 2156 D
1653 2151 D
1658 2149 D
1662 2149 D
1666 2151 D
1670 2156 D
1671 2164 D
1671 2169 D
1670 2177 D
1666 2182 D
1662 2184 D
1658 2184 D
S
N
1658 2184 M
1655 2182 D
1653 2181 D
1652 2177 D
1650 2169 D
1650 2164 D
1652 2156 D
1653 2152 D
1655 2151 D
1658 2149 D
S
N
1662 2149 M
1665 2151 D
1666 2152 D
1668 2156 D
1670 2164 D
1670 2169 D
1668 2177 D
1666 2181 D
1665 2182 D
1662 2184 D
S
N
1691 2184 M
1686 2182 D
1683 2177 D
1681 2169 D
1681 2164 D
1683 2156 D
1686 2151 D
1691 2149 D
1695 2149 D
1700 2151 D
1703 2156 D
1705 2164 D
1705 2169 D
1703 2177 D
1700 2182 D
1695 2184 D
1691 2184 D
S
N
1691 2184 M
1688 2182 D
1686 2181 D
1685 2177 D
1683 2169 D
1683 2164 D
1685 2156 D
1686 2152 D
1688 2151 D
1691 2149 D
S
N
1695 2149 M
1698 2151 D
1700 2152 D
1701 2156 D
1703 2164 D
1703 2169 D
1701 2177 D
1700 2181 D
1698 2182 D
1695 2184 D
S
N
1764 2179 M
1766 2174 D
1766 2184 D
1764 2179 D
1761 2182 D
1756 2184 D
1753 2184 D
1748 2182 D
1744 2179 D
1743 2176 D
1741 2171 D
1741 2162 D
1743 2157 D
1744 2154 D
1748 2151 D
1753 2149 D
1756 2149 D
1761 2151 D
1764 2154 D
S
N
1753 2184 M
1749 2182 D
1746 2179 D
1744 2176 D
1743 2171 D
1743 2162 D
1744 2157 D
1746 2154 D
1749 2151 D
1753 2149 D
S
N
1764 2162 M
1764 2149 D
S
N
1766 2162 M
1766 2149 D
S
N
1759 2162 M
1771 2162 D
S
N
1781 2162 M
1801 2162 D
1801 2166 D
1799 2169 D
1798 2171 D
1794 2172 D
1789 2172 D
1784 2171 D
1781 2167 D
1779 2162 D
1779 2159 D
1781 2154 D
1784 2151 D
1789 2149 D
1793 2149 D
1798 2151 D
1801 2154 D
S
N
1799 2162 M
1799 2167 D
1798 2171 D
S
N
1789 2172 M
1786 2171 D
1783 2167 D
1781 2162 D
1781 2159 D
1783 2154 D
1786 2151 D
1789 2149 D
S
N
1811 2184 M
1822 2149 D
S
N
1813 2184 M
1822 2154 D
S
N
1834 2184 M
1822 2149 D
S
N
1808 2184 M
1817 2184 D
S
N
1827 2184 M
1837 2184 D
S
1 0 0 setrgbcolor
N
858 1914 M
836 1914 D
830 1912 D
825 1905 D
823 1899 D
823 1892 D
825 1888 D
827 1886 D
832 1884 D
836 1884 D
842 1886 D
847 1892 D
849 1899 D
849 1905 D
847 1909 D
845 1912 D
840 1914 D
S
N
836 1914 M
832 1912 D
827 1905 D
825 1899 D
825 1890 D
827 1886 D
S
N
836 1884 M
840 1886 D
845 1892 D
847 1899 D
847 1907 D
845 1912 D
S
N
845 1912 M
858 1912 D
S
N
872 1897 M
872 1866 D
S
N
874 1897 M
874 1866 D
S
N
891 1897 M
891 1866 D
S
N
892 1897 M
892 1866 D
S
N
868 1897 M
878 1897 D
S
N
887 1897 M
897 1897 D
S
N
874 1882 M
891 1882 D
S
N
868 1866 M
878 1866 D
S
N
887 1866 M
897 1866 D
S
N
907 1866 M
905 1868 D
907 1869 D
908 1868 D
908 1865 D
907 1862 D
905 1860 D
S
N
921 1897 M
920 1895 D
921 1894 D
923 1895 D
921 1897 D
S
N
921 1886 M
921 1866 D
S
N
923 1886 M
923 1866 D
S
N
917 1886 M
923 1886 D
S
N
917 1866 M
927 1866 D
S
N
961 1922 M
961 1884 D
S
N
941 1903 M
980 1903 D
S
N
1030 1914 M
1009 1914 D
1002 1912 D
998 1905 D
996 1899 D
996 1892 D
998 1888 D
1000 1886 D
1004 1884 D
1009 1884 D
1015 1886 D
1019 1892 D
1022 1899 D
1022 1905 D
1019 1909 D
1017 1912 D
1013 1914 D
S
N
1009 1914 M
1004 1912 D
1000 1905 D
998 1899 D
998 1890 D
1000 1886 D
S
N
1009 1884 M
1013 1886 D
1017 1892 D
1019 1899 D
1019 1907 D
1017 1912 D
S
N
1017 1912 M
1030 1912 D
S
N
1045 1897 M
1045 1866 D
S
N
1046 1897 M
1046 1866 D
S
N
1040 1897 M
1058 1897 D
1062 1895 D
1063 1894 D
1065 1891 D
1065 1888 D
1063 1885 D
1062 1884 D
1058 1882 D
S
N
1058 1897 M
1061 1895 D
1062 1894 D
1063 1891 D
1063 1888 D
1062 1885 D
1061 1884 D
1058 1882 D
S
N
1046 1882 M
1058 1882 D
1062 1881 D
1063 1879 D
1065 1876 D
1065 1872 D
1063 1869 D
1062 1868 D
1058 1866 D
1040 1866 D
S
N
1058 1882 M
1061 1881 D
1062 1879 D
1063 1876 D
1063 1872 D
1062 1869 D
1061 1868 D
1058 1866 D
S
0 0 1 setrgbcolor
N
858 1827 M
836 1827 D
830 1825 D
825 1819 D
823 1812 D
823 1806 D
825 1801 D
827 1799 D
832 1797 D
836 1797 D
842 1799 D
847 1806 D
849 1812 D
849 1819 D
847 1823 D
845 1825 D
840 1827 D
S
N
836 1827 M
832 1825 D
827 1819 D
825 1812 D
825 1804 D
827 1799 D
S
N
836 1797 M
840 1799 D
845 1806 D
847 1812 D
847 1821 D
845 1825 D
S
N
845 1825 M
858 1825 D
S
N
872 1810 M
872 1780 D
S
N
874 1810 M
874 1780 D
S
N
891 1810 M
891 1780 D
S
N
892 1810 M
892 1780 D
S
N
868 1810 M
878 1810 D
S
N
887 1810 M
897 1810 D
S
N
874 1796 M
891 1796 D
S
N
868 1780 M
878 1780 D
S
N
887 1780 M
897 1780 D
S
N
931 1836 M
931 1797 D
S
N
911 1817 M
950 1817 D
S
N
1000 1827 M
978 1827 D
972 1825 D
967 1819 D
965 1812 D
965 1806 D
967 1801 D
970 1799 D
974 1797 D
978 1797 D
985 1799 D
989 1806 D
991 1812 D
991 1819 D
989 1823 D
987 1825 D
983 1827 D
S
N
978 1827 M
974 1825 D
970 1819 D
967 1812 D
967 1804 D
970 1799 D
S
N
978 1797 M
983 1799 D
987 1806 D
989 1812 D
989 1821 D
987 1825 D
S
N
987 1825 M
1000 1825 D
S
N
1014 1810 M
1014 1780 D
S
N
1016 1810 M
1016 1780 D
S
N
1010 1810 M
1027 1810 D
1032 1809 D
1033 1807 D
1035 1804 D
1035 1801 D
1033 1798 D
1032 1797 D
1027 1796 D
S
N
1027 1810 M
1030 1809 D
1032 1807 D
1033 1804 D
1033 1801 D
1032 1798 D
1030 1797 D
1027 1796 D
S
N
1016 1796 M
1027 1796 D
1032 1794 D
1033 1793 D
1035 1790 D
1035 1785 D
1033 1783 D
1032 1781 D
1027 1780 D
1010 1780 D
S
N
1027 1796 M
1030 1794 D
1032 1793 D
1033 1790 D
1033 1785 D
1032 1783 D
1030 1781 D
1027 1780 D
S
0 0 0 setrgbcolor
N
858 1741 M
836 1741 D
830 1739 D
825 1732 D
823 1726 D
823 1719 D
825 1715 D
827 1713 D
832 1711 D
836 1711 D
842 1713 D
847 1719 D
849 1726 D
849 1732 D
847 1736 D
845 1739 D
840 1741 D
S
N
836 1741 M
832 1739 D
827 1732 D
825 1726 D
825 1717 D
827 1713 D
S
N
836 1711 M
840 1713 D
845 1719 D
847 1726 D
847 1734 D
845 1739 D
S
N
845 1739 M
858 1739 D
S
N
872 1724 M
872 1693 D
S
N
874 1724 M
874 1693 D
S
N
868 1724 M
878 1724 D
S
N
868 1693 M
878 1693 D
S
N
904 1719 M
905 1724 D
905 1715 D
904 1719 D
901 1722 D
897 1724 D
892 1724 D
888 1722 D
885 1719 D
885 1716 D
887 1713 D
888 1712 D
891 1711 D
900 1708 D
902 1706 D
905 1703 D
S
N
885 1716 M
888 1713 D
891 1712 D
900 1709 D
902 1708 D
904 1706 D
905 1703 D
905 1698 D
902 1695 D
898 1693 D
894 1693 D
889 1695 D
887 1698 D
885 1702 D
885 1693 D
887 1698 D
S
N
924 1724 M
914 1693 D
S
N
924 1724 M
934 1693 D
S
N
924 1719 M
933 1693 D
S
N
917 1702 M
930 1702 D
S
N
911 1693 M
920 1693 D
S
N
928 1693 M
937 1693 D
S
N
970 1749 M
970 1711 D
S
N
950 1730 M
989 1730 D
S
N
1039 1741 M
1017 1741 D
1011 1739 D
1006 1732 D
1004 1726 D
1004 1719 D
1006 1715 D
1009 1713 D
1013 1711 D
1017 1711 D
1024 1713 D
1028 1719 D
1030 1726 D
1030 1732 D
1028 1736 D
1026 1739 D
1022 1741 D
S
N
1017 1741 M
1013 1739 D
1009 1732 D
1006 1726 D
1006 1717 D
1009 1713 D
S
N
1017 1711 M
1022 1713 D
1026 1719 D
1028 1726 D
1028 1734 D
1026 1739 D
S
N
1026 1739 M
1039 1739 D
S
N
1053 1724 M
1053 1693 D
S
N
1055 1724 M
1055 1693 D
S
N
1049 1724 M
1066 1724 D
1071 1722 D
1072 1721 D
1074 1718 D
1074 1715 D
1072 1712 D
1071 1711 D
1066 1709 D
S
N
1066 1724 M
1069 1722 D
1071 1721 D
1072 1718 D
1072 1715 D
1071 1712 D
1069 1711 D
1066 1709 D
S
N
1055 1709 M
1066 1709 D
1071 1708 D
1072 1706 D
1074 1703 D
1074 1699 D
1072 1696 D
1071 1695 D
1066 1693 D
1049 1693 D
S
N
1066 1709 M
1069 1708 D
1071 1706 D
1072 1703 D
1072 1699 D
1071 1696 D
1069 1695 D
1066 1693 D
S
N
583 2342 M
583 1563 D
S
N
583 1563 M
1881 1563 D
S
N
1881 1563 M
1881 2342 D
S
N
1881 2342 M
583 2342 D
S
0 0 1 setrgbcolor
583 1563 P
583 1563 P
N
600 1563 M
600 1634 D
618 1634 D
618 1715 D
635 1715 D
635 1749 D
652 1749 D
652 1839 D
669 1839 D
669 1966 D
687 1966 D
687 2071 D
704 2071 D
704 2144 D
721 2144 D
721 2246 D
739 2246 D
739 2244 D
756 2244 D
756 2232 D
773 2232 D
773 2217 D
791 2217 D
791 2201 D
808 2201 D
808 2188 D
825 2188 D
825 2174 D
842 2174 D
842 2159 D
860 2159 D
860 2146 D
877 2146 D
877 2133 D
894 2133 D
894 2120 D
912 2120 D
912 2115 D
929 2115 D
929 2108 D
946 2108 D
946 2095 D
964 2095 D
964 2090 D
981 2090 D
981 2084 D
998 2084 D
998 2074 D
1015 2074 D
1015 2067 D
1033 2067 D
1033 2064 D
1050 2064 D
1050 2060 D
1067 2060 D
1067 2051 D
1085 2051 D
1085 2048 D
1102 2048 D
1102 2036 D
1119 2036 D
1119 2039 D
1137 2039 D
1137 2036 D
1154 2036 D
1154 2025 D
1171 2025 D
1171 2024 D
1188 2024 D
1188 2020 D
1206 2020 D
1206 2022 D
1223 2022 D
1223 2029 D
1240 2029 D
1240 2024 D
1258 2024 D
1258 2024 D
1275 2024 D
1275 2019 D
1292 2019 D
1292 2015 D
1310 2015 D
1310 2010 D
1327 2010 D
1327 2007 D
1344 2007 D
1344 1999 D
1361 1999 D
1361 2000 D
1379 2000 D
1379 1987 D
1396 1987 D
1396 1975 D
1413 1975 D
1413 1970 D
1431 1970 D
1431 1968 D
1448 1968 D
1448 1959 D
1465 1959 D
1465 1951 D
1483 1951 D
1483 1945 D
1500 1945 D
1500 1936 D
1517 1936 D
1517 1932 D
1534 1932 D
1534 1926 D
1552 1926 D
1552 1918 D
1569 1918 D
1569 1913 D
1586 1913 D
1586 1907 D
1604 1907 D
1604 1903 D
1621 1903 D
1621 1897 D
1638 1897 D
1638 1891 D
1656 1891 D
1656 1885 D
1673 1885 D
1673 1882 D
1673 1882 D
1673 1882 D
1690 1882 D
1690 1875 D
1708 1875 D
1708 1868 D
1725 1868 D
1725 1865 D
1742 1865 D
1742 1858 D
1759 1858 D
1759 1852 D
1777 1852 D
1777 1851 D
1794 1851 D
1794 1846 D
1811 1846 D
1811 1840 D
1829 1840 D
1829 1838 D
1846 1838 D
1846 1832 D
1863 1832 D
1863 1828 D
1880 1828 D
1880 1808 D
1881 1808 D
S
1881 1563 P
0 0 0 setrgbcolor
N
583 1563 M
583 1615 D
S
N
626 1581 M
626 1563 D
S
N
669 1563 M
669 1581 D
S
N
713 1581 M
713 1563 D
S
N
756 1563 M
756 1581 D
S
N
799 1615 M
799 1563 D
S
N
842 1563 M
842 1581 D
S
N
886 1581 M
886 1563 D
S
N
929 1563 M
929 1581 D
S
N
972 1581 M
972 1563 D
S
N
1015 1563 M
1015 1615 D
S
N
1059 1581 M
1059 1563 D
S
N
1102 1563 M
1102 1581 D
S
N
1145 1581 M
1145 1563 D
S
N
1189 1563 M
1189 1581 D
S
N
1232 1615 M
1232 1563 D
S
N
1275 1563 M
1275 1581 D
S
N
1318 1581 M
1318 1563 D
S
N
1361 1563 M
1361 1581 D
S
N
1405 1581 M
1405 1563 D
S
N
1448 1563 M
1448 1615 D
S
N
1491 1581 M
1491 1563 D
S
N
1534 1563 M
1534 1581 D
S
N
1578 1581 M
1578 1563 D
S
N
1621 1563 M
1621 1581 D
S
N
1664 1615 M
1664 1563 D
S
N
1708 1563 M
1708 1581 D
S
N
1751 1581 M
1751 1563 D
S
N
1794 1563 M
1794 1581 D
S
N
1837 1581 M
1837 1563 D
S
N
1881 1563 M
1881 1615 D
S
N
582 1535 M
577 1534 D
574 1529 D
573 1522 D
573 1518 D
574 1510 D
577 1506 D
582 1505 D
584 1505 D
589 1506 D
592 1510 D
593 1518 D
593 1522 D
592 1529 D
589 1534 D
584 1535 D
582 1535 D
S
N
582 1535 M
579 1534 D
577 1532 D
576 1529 D
574 1522 D
574 1518 D
576 1510 D
577 1508 D
579 1506 D
582 1505 D
S
N
584 1505 M
587 1506 D
589 1508 D
590 1510 D
592 1518 D
592 1522 D
590 1529 D
589 1532 D
587 1534 D
584 1535 D
S
N
762 1529 M
763 1528 D
762 1526 D
760 1528 D
760 1529 D
762 1532 D
763 1534 D
768 1535 D
773 1535 D
778 1534 D
779 1532 D
781 1529 D
781 1526 D
779 1523 D
775 1521 D
768 1518 D
765 1516 D
762 1513 D
760 1509 D
760 1505 D
S
N
773 1535 M
776 1534 D
778 1532 D
779 1529 D
779 1526 D
778 1523 D
773 1521 D
768 1518 D
S
N
760 1508 M
762 1509 D
765 1509 D
772 1506 D
776 1506 D
779 1508 D
781 1509 D
S
N
765 1509 M
772 1505 D
778 1505 D
779 1506 D
781 1509 D
781 1512 D
S
N
792 1535 M
789 1521 D
S
N
789 1521 M
792 1523 D
796 1525 D
801 1525 D
805 1523 D
808 1521 D
809 1516 D
809 1513 D
808 1509 D
805 1506 D
801 1505 D
796 1505 D
792 1506 D
791 1508 D
789 1510 D
789 1512 D
791 1513 D
792 1512 D
791 1510 D
S
N
801 1525 M
804 1523 D
807 1521 D
808 1516 D
808 1513 D
807 1509 D
804 1506 D
801 1505 D
S
N
792 1535 M
807 1535 D
S
N
792 1534 M
799 1534 D
807 1535 D
S
N
827 1535 M
822 1534 D
819 1529 D
818 1522 D
818 1518 D
819 1510 D
822 1506 D
827 1505 D
830 1505 D
834 1506 D
837 1510 D
838 1518 D
838 1522 D
837 1529 D
834 1534 D
830 1535 D
827 1535 D
S
N
827 1535 M
824 1534 D
822 1532 D
821 1529 D
819 1522 D
819 1518 D
821 1510 D
822 1508 D
824 1506 D
827 1505 D
S
N
830 1505 M
832 1506 D
834 1508 D
835 1510 D
837 1518 D
837 1522 D
835 1529 D
834 1532 D
832 1534 D
830 1535 D
S
N
979 1535 M
977 1521 D
S
N
977 1521 M
979 1523 D
984 1525 D
988 1525 D
992 1523 D
995 1521 D
997 1516 D
997 1513 D
995 1509 D
992 1506 D
988 1505 D
984 1505 D
979 1506 D
978 1508 D
977 1510 D
977 1512 D
978 1513 D
979 1512 D
978 1510 D
S
N
988 1525 M
991 1523 D
994 1521 D
995 1516 D
995 1513 D
994 1509 D
991 1506 D
988 1505 D
S
N
979 1535 M
994 1535 D
S
N
979 1534 M
987 1534 D
994 1535 D
S
N
1014 1535 M
1010 1534 D
1007 1529 D
1005 1522 D
1005 1518 D
1007 1510 D
1010 1506 D
1014 1505 D
1017 1505 D
1021 1506 D
1024 1510 D
1026 1518 D
1026 1522 D
1024 1529 D
1021 1534 D
1017 1535 D
1014 1535 D
S
N
1014 1535 M
1011 1534 D
1010 1532 D
1008 1529 D
1007 1522 D
1007 1518 D
1008 1510 D
1010 1508 D
1011 1506 D
1014 1505 D
S
N
1017 1505 M
1020 1506 D
1021 1508 D
1023 1510 D
1024 1518 D
1024 1522 D
1023 1529 D
1021 1532 D
1020 1534 D
1017 1535 D
S
N
1043 1535 M
1039 1534 D
1036 1529 D
1034 1522 D
1034 1518 D
1036 1510 D
1039 1506 D
1043 1505 D
1046 1505 D
1050 1506 D
1053 1510 D
1055 1518 D
1055 1522 D
1053 1529 D
1050 1534 D
1046 1535 D
1043 1535 D
S
N
1043 1535 M
1040 1534 D
1039 1532 D
1037 1529 D
1036 1522 D
1036 1518 D
1037 1510 D
1039 1508 D
1040 1506 D
1043 1505 D
S
N
1046 1505 M
1049 1506 D
1050 1508 D
1052 1510 D
1053 1518 D
1053 1522 D
1052 1529 D
1050 1532 D
1049 1534 D
1046 1535 D
S
N
1193 1535 M
1193 1526 D
S
N
1193 1529 M
1194 1532 D
1197 1535 D
1200 1535 D
1207 1531 D
1210 1531 D
1212 1532 D
1213 1535 D
S
N
1194 1532 M
1197 1534 D
1200 1534 D
1207 1531 D
S
N
1213 1535 M
1213 1531 D
1212 1526 D
1206 1519 D
1204 1516 D
1203 1512 D
1203 1505 D
S
N
1212 1526 M
1204 1519 D
1203 1516 D
1201 1512 D
1201 1505 D
S
N
1225 1535 M
1222 1521 D
S
N
1222 1521 M
1225 1523 D
1229 1525 D
1233 1525 D
1238 1523 D
1240 1521 D
1242 1516 D
1242 1513 D
1240 1509 D
1238 1506 D
1233 1505 D
1229 1505 D
1225 1506 D
1223 1508 D
1222 1510 D
1222 1512 D
1223 1513 D
1225 1512 D
1223 1510 D
S
N
1233 1525 M
1236 1523 D
1239 1521 D
1240 1516 D
1240 1513 D
1239 1509 D
1236 1506 D
1233 1505 D
S
N
1225 1535 M
1239 1535 D
S
N
1225 1534 M
1232 1534 D
1239 1535 D
S
N
1259 1535 M
1255 1534 D
1252 1529 D
1251 1522 D
1251 1518 D
1252 1510 D
1255 1506 D
1259 1505 D
1262 1505 D
1266 1506 D
1269 1510 D
1271 1518 D
1271 1522 D
1269 1529 D
1266 1534 D
1262 1535 D
1259 1535 D
S
N
1259 1535 M
1256 1534 D
1255 1532 D
1253 1529 D
1252 1522 D
1252 1518 D
1253 1510 D
1255 1508 D
1256 1506 D
1259 1505 D
S
N
1262 1505 M
1265 1506 D
1266 1508 D
1268 1510 D
1269 1518 D
1269 1522 D
1268 1529 D
1266 1532 D
1265 1534 D
1262 1535 D
S
N
1399 1529 M
1402 1531 D
1406 1535 D
1406 1505 D
S
N
1405 1534 M
1405 1505 D
S
N
1399 1505 M
1412 1505 D
S
N
1432 1535 M
1428 1534 D
1425 1529 D
1424 1522 D
1424 1518 D
1425 1510 D
1428 1506 D
1432 1505 D
1435 1505 D
1439 1506 D
1442 1510 D
1444 1518 D
1444 1522 D
1442 1529 D
1439 1534 D
1435 1535 D
1432 1535 D
S
N
1432 1535 M
1429 1534 D
1428 1532 D
1426 1529 D
1425 1522 D
1425 1518 D
1426 1510 D
1428 1508 D
1429 1506 D
1432 1505 D
S
N
1435 1505 M
1438 1506 D
1439 1508 D
1441 1510 D
1442 1518 D
1442 1522 D
1441 1529 D
1439 1532 D
1438 1534 D
1435 1535 D
S
N
1461 1535 M
1457 1534 D
1454 1529 D
1452 1522 D
1452 1518 D
1454 1510 D
1457 1506 D
1461 1505 D
1464 1505 D
1468 1506 D
1471 1510 D
1473 1518 D
1473 1522 D
1471 1529 D
1468 1534 D
1464 1535 D
1461 1535 D
S
N
1461 1535 M
1458 1534 D
1457 1532 D
1455 1529 D
1454 1522 D
1454 1518 D
1455 1510 D
1457 1508 D
1458 1506 D
1461 1505 D
S
N
1464 1505 M
1467 1506 D
1468 1508 D
1470 1510 D
1471 1518 D
1471 1522 D
1470 1529 D
1468 1532 D
1467 1534 D
1464 1535 D
S
N
1490 1535 M
1486 1534 D
1483 1529 D
1481 1522 D
1481 1518 D
1483 1510 D
1486 1506 D
1490 1505 D
1493 1505 D
1497 1506 D
1500 1510 D
1501 1518 D
1501 1522 D
1500 1529 D
1497 1534 D
1493 1535 D
1490 1535 D
S
N
1490 1535 M
1487 1534 D
1486 1532 D
1484 1529 D
1483 1522 D
1483 1518 D
1484 1510 D
1486 1508 D
1487 1506 D
1490 1505 D
S
N
1493 1505 M
1496 1506 D
1497 1508 D
1499 1510 D
1500 1518 D
1500 1522 D
1499 1529 D
1497 1532 D
1496 1534 D
1493 1535 D
S
N
1615 1529 M
1618 1531 D
1622 1535 D
1622 1505 D
S
N
1621 1534 M
1621 1505 D
S
N
1615 1505 M
1628 1505 D
S
N
1641 1529 M
1643 1528 D
1641 1526 D
1640 1528 D
1640 1529 D
1641 1532 D
1643 1534 D
1647 1535 D
1653 1535 D
1657 1534 D
1659 1532 D
1660 1529 D
1660 1526 D
1659 1523 D
1654 1521 D
1647 1518 D
1644 1516 D
1641 1513 D
1640 1509 D
1640 1505 D
S
N
1653 1535 M
1656 1534 D
1657 1532 D
1659 1529 D
1659 1526 D
1657 1523 D
1653 1521 D
1647 1518 D
S
N
1640 1508 M
1641 1509 D
1644 1509 D
1651 1506 D
1656 1506 D
1659 1508 D
1660 1509 D
S
N
1644 1509 M
1651 1505 D
1657 1505 D
1659 1506 D
1660 1509 D
1660 1512 D
S
N
1672 1535 M
1669 1521 D
S
N
1669 1521 M
1672 1523 D
1676 1525 D
1680 1525 D
1685 1523 D
1687 1521 D
1689 1516 D
1689 1513 D
1687 1509 D
1685 1506 D
1680 1505 D
1676 1505 D
1672 1506 D
1670 1508 D
1669 1510 D
1669 1512 D
1670 1513 D
1672 1512 D
1670 1510 D
S
N
1680 1525 M
1683 1523 D
1686 1521 D
1687 1516 D
1687 1513 D
1686 1509 D
1683 1506 D
1680 1505 D
S
N
1672 1535 M
1686 1535 D
S
N
1672 1534 M
1679 1534 D
1686 1535 D
S
N
1706 1535 M
1702 1534 D
1699 1529 D
1698 1522 D
1698 1518 D
1699 1510 D
1702 1506 D
1706 1505 D
1709 1505 D
1713 1506 D
1716 1510 D
1718 1518 D
1718 1522 D
1716 1529 D
1713 1534 D
1709 1535 D
1706 1535 D
S
N
1706 1535 M
1703 1534 D
1702 1532 D
1700 1529 D
1699 1522 D
1699 1518 D
1700 1510 D
1702 1508 D
1703 1506 D
1706 1505 D
S
N
1709 1505 M
1712 1506 D
1713 1508 D
1715 1510 D
1716 1518 D
1716 1522 D
1715 1529 D
1713 1532 D
1712 1534 D
1709 1535 D
S
N
1831 1529 M
1834 1531 D
1839 1535 D
1839 1505 D
S
N
1837 1534 M
1837 1505 D
S
N
1831 1505 M
1844 1505 D
S
N
1859 1535 M
1856 1521 D
S
N
1856 1521 M
1859 1523 D
1863 1525 D
1868 1525 D
1872 1523 D
1875 1521 D
1876 1516 D
1876 1513 D
1875 1509 D
1872 1506 D
1868 1505 D
1863 1505 D
1859 1506 D
1857 1508 D
1856 1510 D
1856 1512 D
1857 1513 D
1859 1512 D
1857 1510 D
S
N
1868 1525 M
1870 1523 D
1873 1521 D
1875 1516 D
1875 1513 D
1873 1509 D
1870 1506 D
1868 1505 D
S
N
1859 1535 M
1873 1535 D
S
N
1859 1534 M
1866 1534 D
1873 1535 D
S
N
1894 1535 M
1889 1534 D
1886 1529 D
1885 1522 D
1885 1518 D
1886 1510 D
1889 1506 D
1894 1505 D
1896 1505 D
1901 1506 D
1904 1510 D
1905 1518 D
1905 1522 D
1904 1529 D
1901 1534 D
1896 1535 D
1894 1535 D
S
N
1894 1535 M
1891 1534 D
1889 1532 D
1888 1529 D
1886 1522 D
1886 1518 D
1888 1510 D
1889 1508 D
1891 1506 D
1894 1505 D
S
N
1896 1505 M
1899 1506 D
1901 1508 D
1902 1510 D
1904 1518 D
1904 1522 D
1902 1529 D
1901 1532 D
1899 1534 D
1896 1535 D
S
N
1922 1535 M
1918 1534 D
1915 1529 D
1914 1522 D
1914 1518 D
1915 1510 D
1918 1506 D
1922 1505 D
1925 1505 D
1930 1506 D
1933 1510 D
1934 1518 D
1934 1522 D
1933 1529 D
1930 1534 D
1925 1535 D
1922 1535 D
S
N
1922 1535 M
1920 1534 D
1918 1532 D
1917 1529 D
1915 1522 D
1915 1518 D
1917 1510 D
1918 1508 D
1920 1506 D
1922 1505 D
S
N
1925 1505 M
1928 1506 D
1930 1508 D
1931 1510 D
1933 1518 D
1933 1522 D
1931 1529 D
1930 1532 D
1928 1534 D
1925 1535 D
S
N
583 2290 M
583 2342 D
S
N
626 2342 M
626 2325 D
S
N
669 2325 M
669 2342 D
S
N
713 2342 M
713 2325 D
S
N
756 2325 M
756 2342 D
S
N
799 2342 M
799 2290 D
S
N
842 2325 M
842 2342 D
S
N
886 2342 M
886 2325 D
S
N
929 2325 M
929 2342 D
S
N
972 2342 M
972 2325 D
S
N
1015 2290 M
1015 2342 D
S
N
1059 2342 M
1059 2325 D
S
N
1102 2325 M
1102 2342 D
S
N
1145 2342 M
1145 2325 D
S
N
1189 2325 M
1189 2342 D
S
N
1232 2342 M
1232 2290 D
S
N
1275 2325 M
1275 2342 D
S
N
1318 2342 M
1318 2325 D
S
N
1361 2325 M
1361 2342 D
S
N
1405 2342 M
1405 2325 D
S
N
1448 2290 M
1448 2342 D
S
N
1491 2342 M
1491 2325 D
S
N
1534 2325 M
1534 2342 D
S
N
1578 2342 M
1578 2325 D
S
N
1621 2325 M
1621 2342 D
S
N
1664 2342 M
1664 2290 D
S
N
1708 2325 M
1708 2342 D
S
N
1751 2342 M
1751 2325 D
S
N
1794 2325 M
1794 2342 D
S
N
1837 2342 M
1837 2325 D
S
N
1881 2290 M
1881 2342 D
S
N
583 1563 M
635 1563 D
S
N
600 1661 M
583 1661 D
S
N
583 1758 M
635 1758 D
S
N
600 1855 M
583 1855 D
S
N
583 1953 M
635 1953 D
S
N
600 2050 M
583 2050 D
S
N
583 2147 M
635 2147 D
S
N
600 2245 M
583 2245 D
S
N
583 2342 M
635 2342 D
S
N
427 1571 M
430 1572 D
435 1576 D
435 1546 D
S
N
433 1575 M
433 1546 D
S
N
427 1546 M
440 1546 D
S
N
460 1576 M
456 1575 D
453 1571 D
452 1563 D
452 1559 D
453 1552 D
456 1548 D
460 1546 D
463 1546 D
468 1548 D
471 1552 D
472 1559 D
472 1563 D
471 1571 D
468 1575 D
463 1576 D
460 1576 D
S
N
460 1576 M
458 1575 D
456 1574 D
455 1571 D
453 1563 D
453 1559 D
455 1552 D
456 1549 D
458 1548 D
460 1546 D
S
N
463 1546 M
466 1548 D
468 1549 D
469 1552 D
471 1559 D
471 1563 D
469 1571 D
468 1574 D
466 1575 D
463 1576 D
S
N
482 1576 M
508 1576 D
S
N
525 1594 M
521 1592 D
520 1589 D
520 1585 D
521 1582 D
525 1581 D
531 1581 D
536 1582 D
537 1585 D
537 1589 D
536 1592 D
531 1594 D
525 1594 D
S
N
525 1594 M
523 1592 D
521 1589 D
521 1585 D
523 1582 D
525 1581 D
S
N
531 1581 M
534 1582 D
536 1585 D
536 1589 D
534 1592 D
531 1594 D
S
N
525 1581 M
521 1579 D
520 1578 D
518 1575 D
518 1569 D
520 1566 D
521 1565 D
525 1563 D
531 1563 D
536 1565 D
537 1566 D
538 1569 D
538 1575 D
537 1578 D
536 1579 D
531 1581 D
S
N
525 1581 M
523 1579 D
521 1578 D
520 1575 D
520 1569 D
521 1566 D
523 1565 D
525 1563 D
S
N
531 1563 M
534 1565 D
536 1566 D
537 1569 D
537 1575 D
536 1578 D
534 1579 D
531 1581 D
S
N
427 1765 M
430 1767 D
435 1771 D
435 1741 D
S
N
433 1770 M
433 1741 D
S
N
427 1741 M
440 1741 D
S
N
460 1771 M
456 1770 D
453 1765 D
452 1758 D
452 1754 D
453 1747 D
456 1742 D
460 1741 D
463 1741 D
468 1742 D
471 1747 D
472 1754 D
472 1758 D
471 1765 D
468 1770 D
463 1771 D
460 1771 D
S
N
460 1771 M
458 1770 D
456 1768 D
455 1765 D
453 1758 D
453 1754 D
455 1747 D
456 1744 D
458 1742 D
460 1741 D
S
N
463 1741 M
466 1742 D
468 1744 D
469 1747 D
471 1754 D
471 1758 D
469 1765 D
468 1768 D
466 1770 D
463 1771 D
S
N
482 1771 M
508 1771 D
S
N
536 1784 M
534 1783 D
536 1781 D
537 1783 D
537 1784 D
536 1787 D
533 1788 D
528 1788 D
524 1787 D
521 1784 D
520 1781 D
518 1775 D
518 1767 D
520 1762 D
523 1760 D
527 1758 D
530 1758 D
534 1760 D
537 1762 D
538 1767 D
538 1768 D
537 1773 D
534 1775 D
530 1777 D
528 1777 D
524 1775 D
521 1773 D
520 1768 D
S
N
528 1788 M
525 1787 D
523 1784 D
521 1781 D
520 1775 D
520 1767 D
521 1762 D
524 1760 D
527 1758 D
S
N
530 1758 M
533 1760 D
536 1762 D
537 1767 D
537 1768 D
536 1773 D
533 1775 D
530 1777 D
S
N
427 1960 M
430 1961 D
435 1966 D
435 1935 D
S
N
433 1964 M
433 1935 D
S
N
427 1935 M
440 1935 D
S
N
460 1966 M
456 1964 D
453 1960 D
452 1953 D
452 1948 D
453 1941 D
456 1937 D
460 1935 D
463 1935 D
468 1937 D
471 1941 D
472 1948 D
472 1953 D
471 1960 D
468 1964 D
463 1966 D
460 1966 D
S
N
460 1966 M
458 1964 D
456 1963 D
455 1960 D
453 1953 D
453 1948 D
455 1941 D
456 1938 D
458 1937 D
460 1935 D
S
N
463 1935 M
466 1937 D
468 1938 D
469 1941 D
471 1948 D
471 1953 D
469 1960 D
468 1963 D
466 1964 D
463 1966 D
S
N
482 1966 M
508 1966 D
S
N
531 1980 M
531 1953 D
S
N
533 1983 M
533 1953 D
S
N
533 1983 M
517 1961 D
540 1961 D
S
N
527 1953 M
537 1953 D
S
N
427 2155 M
430 2156 D
435 2160 D
435 2130 D
S
N
433 2159 M
433 2130 D
S
N
427 2130 M
440 2130 D
S
N
460 2160 M
456 2159 D
453 2155 D
452 2147 D
452 2143 D
453 2136 D
456 2131 D
460 2130 D
463 2130 D
468 2131 D
471 2136 D
472 2143 D
472 2147 D
471 2155 D
468 2159 D
463 2160 D
460 2160 D
S
N
460 2160 M
458 2159 D
456 2157 D
455 2155 D
453 2147 D
453 2143 D
455 2136 D
456 2133 D
458 2131 D
460 2130 D
S
N
463 2130 M
466 2131 D
468 2133 D
469 2136 D
471 2143 D
471 2147 D
469 2155 D
468 2157 D
466 2159 D
463 2160 D
S
N
482 2160 M
508 2160 D
S
N
520 2172 M
521 2170 D
520 2169 D
518 2170 D
518 2172 D
520 2175 D
521 2176 D
525 2178 D
531 2178 D
536 2176 D
537 2175 D
538 2172 D
538 2169 D
537 2166 D
533 2163 D
525 2160 D
523 2159 D
520 2156 D
518 2152 D
518 2147 D
S
N
531 2178 M
534 2176 D
536 2175 D
537 2172 D
537 2169 D
536 2166 D
531 2163 D
525 2160 D
S
N
518 2150 M
520 2152 D
523 2152 D
530 2149 D
534 2149 D
537 2150 D
538 2152 D
S
N
523 2152 M
530 2147 D
536 2147 D
537 2149 D
538 2152 D
538 2155 D
S
N
465 2349 M
468 2351 D
472 2355 D
472 2325 D
S
N
471 2354 M
471 2325 D
S
N
465 2325 M
478 2325 D
S
N
498 2355 M
494 2354 D
491 2349 D
489 2342 D
489 2338 D
491 2330 D
494 2326 D
498 2325 D
501 2325 D
505 2326 D
508 2330 D
510 2338 D
510 2342 D
508 2349 D
505 2354 D
501 2355 D
498 2355 D
S
N
498 2355 M
495 2354 D
494 2352 D
492 2349 D
491 2342 D
491 2338 D
492 2330 D
494 2328 D
495 2326 D
498 2325 D
S
N
501 2325 M
504 2326 D
505 2328 D
507 2330 D
508 2338 D
508 2342 D
507 2349 D
505 2352 D
504 2354 D
501 2355 D
S
N
527 2372 M
523 2371 D
520 2367 D
518 2359 D
518 2355 D
520 2348 D
523 2343 D
527 2342 D
530 2342 D
534 2343 D
537 2348 D
538 2355 D
538 2359 D
537 2367 D
534 2371 D
530 2372 D
527 2372 D
S
N
527 2372 M
524 2371 D
523 2369 D
521 2367 D
520 2359 D
520 2355 D
521 2348 D
523 2345 D
524 2343 D
527 2342 D
S
N
530 2342 M
533 2343 D
534 2345 D
536 2348 D
537 2355 D
537 2359 D
536 2367 D
534 2369 D
533 2371 D
530 2372 D
S
N
1829 1563 M
1881 1563 D
S
N
1881 1661 M
1863 1661 D
S
N
1829 1758 M
1881 1758 D
S
N
1881 1855 M
1863 1855 D
S
N
1829 1953 M
1881 1953 D
S
N
1881 2050 M
1863 2050 D
S
N
1829 2147 M
1881 2147 D
S
N
1881 2245 M
1863 2245 D
S
N
1829 2342 M
1881 2342 D
S
1 0 0 setrgbcolor
583 1563 P
583 1563 P
N
600 1563 M
600 1634 D
618 1634 D
618 1715 D
635 1715 D
635 1749 D
652 1749 D
652 1839 D
669 1839 D
669 1966 D
687 1966 D
687 2071 D
704 2071 D
704 2144 D
721 2144 D
721 2246 D
739 2246 D
739 2244 D
756 2244 D
756 2232 D
773 2232 D
773 2217 D
791 2217 D
791 2201 D
808 2201 D
808 2189 D
825 2189 D
825 2174 D
842 2174 D
842 2159 D
860 2159 D
860 2147 D
877 2147 D
877 2134 D
894 2134 D
894 2122 D
912 2122 D
912 2118 D
929 2118 D
929 2112 D
946 2112 D
946 2100 D
964 2100 D
964 2096 D
981 2096 D
981 2091 D
998 2091 D
998 2083 D
1015 2083 D
1015 2077 D
1033 2077 D
1033 2075 D
1050 2075 D
1050 2071 D
1067 2071 D
1067 2064 D
1085 2064 D
1085 2061 D
1102 2061 D
1102 2052 D
1119 2052 D
1119 2054 D
1137 2054 D
1137 2051 D
1154 2051 D
1154 2042 D
1171 2042 D
1171 2041 D
1188 2041 D
1188 2037 D
1206 2037 D
1206 2036 D
1223 2036 D
1223 2039 D
1240 2039 D
1240 2034 D
1258 2034 D
1258 2030 D
1275 2030 D
1275 2021 D
1292 2021 D
1292 2016 D
1310 2016 D
1310 2006 D
1327 2006 D
1327 2000 D
1344 2000 D
1344 1988 D
1361 1988 D
1361 1987 D
1379 1987 D
1379 1972 D
1396 1972 D
1396 1954 D
1413 1954 D
1413 1949 D
1431 1949 D
1431 1943 D
1448 1943 D
1448 1926 D
1465 1926 D
1465 1920 D
1483 1920 D
1483 1908 D
1500 1908 D
1500 1898 D
1517 1898 D
1517 1895 D
1534 1895 D
1534 1887 D
1552 1887 D
1552 1876 D
1569 1876 D
1569 1871 D
1586 1871 D
1586 1862 D
1604 1862 D
1604 1858 D
1621 1858 D
1621 1848 D
1638 1848 D
1638 1848 D
1656 1848 D
1656 1834 D
1673 1834 D
1673 1830 D
1673 1830 D
1673 1830 D
1690 1830 D
1690 1817 D
1708 1817 D
1708 1812 D
1725 1812 D
1725 1817 D
1742 1817 D
1742 1797 D
1759 1797 D
1759 1787 D
1777 1787 D
1777 1804 D
1794 1804 D
1794 1798 D
1811 1798 D
1811 1787 D
1829 1787 D
1829 1778 D
1846 1778 D
1846 1778 D
1863 1778 D
1863 1791 D
1880 1791 D
1880 1563 D
S
1881 1563 P
0 0 0 setrgbcolor
583 1563 P
583 1563 P
N
600 1563 M
600 1634 D
618 1634 D
618 1715 D
635 1715 D
635 1749 D
652 1749 D
652 1839 D
669 1839 D
669 1966 D
687 1966 D
687 2071 D
704 2071 D
704 2144 D
721 2144 D
721 2246 D
739 2246 D
739 2244 D
756 2244 D
756 2232 D
773 2232 D
773 2217 D
791 2217 D
791 2202 D
808 2202 D
808 2189 D
825 2189 D
825 2175 D
842 2175 D
842 2161 D
860 2161 D
860 2149 D
877 2149 D
877 2137 D
894 2137 D
894 2126 D
912 2126 D
912 2122 D
929 2122 D
929 2117 D
946 2117 D
946 2106 D
964 2106 D
964 2102 D
981 2102 D
981 2098 D
998 2098 D
998 2090 D
1015 2090 D
1015 2085 D
1033 2085 D
1033 2082 D
1050 2082 D
1050 2079 D
1067 2079 D
1067 2072 D
1085 2072 D
1085 2069 D
1102 2069 D
1102 2062 D
1119 2062 D
1119 2063 D
1137 2063 D
1137 2059 D
1154 2059 D
1154 2052 D
1171 2052 D
1171 2050 D
1188 2050 D
1188 2045 D
1206 2045 D
1206 2042 D
1223 2042 D
1223 2042 D
1240 2042 D
1240 2033 D
1258 2033 D
1258 2027 D
1275 2027 D
1275 2016 D
1292 2016 D
1292 2006 D
1310 2006 D
1310 1995 D
1327 1995 D
1327 1989 D
1344 1989 D
1344 1975 D
1361 1975 D
1361 1980 D
1379 1980 D
1379 1961 D
1396 1961 D
1396 1941 D
1413 1941 D
1413 1938 D
1431 1938 D
1431 1942 D
1448 1942 D
1448 1930 D
1465 1930 D
1465 1920 D
1483 1920 D
1483 1913 D
1500 1913 D
1500 1905 D
1517 1905 D
1517 1901 D
1534 1901 D
1534 1894 D
1552 1894 D
1552 1886 D
1569 1886 D
1569 1882 D
1586 1882 D
1586 1874 D
1604 1874 D
1604 1872 D
1621 1872 D
1621 1866 D
1638 1866 D
1638 1860 D
1656 1860 D
1656 1853 D
1673 1853 D
1673 1852 D
1673 1852 D
1673 1852 D
1690 1852 D
1690 1845 D
1708 1845 D
1708 1836 D
1725 1836 D
1725 1840 D
1742 1840 D
1742 1828 D
1759 1828 D
1759 1822 D
1777 1822 D
1777 1822 D
1794 1822 D
1794 1822 D
1811 1822 D
1811 1809 D
1829 1809 D
1829 1811 D
1846 1811 D
1846 1802 D
1863 1802 D
1863 1797 D
1880 1797 D
1880 1759 D
1881 1759 D
S
1881 1563 P
N
1182 928 M
1182 897 D
S
N
1184 928 M
1184 897 D
S
N
1184 921 M
1188 926 D
1195 928 D
1199 928 D
1205 926 D
1208 921 D
1208 897 D
S
N
1199 928 M
1203 926 D
1205 921 D
1205 897 D
S
N
1208 921 M
1212 926 D
1218 928 D
1223 928 D
1229 926 D
1231 921 D
1231 897 D
S
N
1223 928 M
1227 926 D
1229 921 D
1229 897 D
S
N
1175 928 M
1184 928 D
S
N
1175 897 M
1190 897 D
S
N
1199 897 M
1214 897 D
S
N
1223 897 M
1238 897 D
S
N
1262 908 M
1262 880 D
S
N
1264 910 M
1264 880 D
S
N
1264 910 M
1248 889 D
1271 889 D
S
N
1258 880 M
1268 880 D
S
N
1281 910 M
1281 880 D
S
N
1283 910 M
1283 880 D
S
N
1277 910 M
1283 910 D
S
N
1277 880 M
1287 880 D
S
N
305 1180 M
305 1158 D
307 1152 D
314 1148 D
320 1145 D
327 1145 D
331 1148 D
333 1150 D
336 1154 D
336 1158 D
333 1165 D
327 1169 D
320 1171 D
314 1171 D
310 1169 D
307 1167 D
305 1163 D
S
N
305 1158 M
307 1154 D
314 1150 D
320 1148 D
329 1148 D
333 1150 D
S
N
336 1158 M
333 1163 D
327 1167 D
320 1169 D
312 1169 D
307 1167 D
S
N
307 1167 M
307 1180 D
S
N
323 1192 M
353 1210 D
S
N
323 1193 M
353 1212 D
S
N
323 1212 M
353 1192 D
S
N
323 1189 M
323 1197 D
S
N
323 1206 M
323 1215 D
S
N
353 1189 M
353 1197 D
S
N
353 1206 M
353 1215 D
S
N
282 1262 M
351 1223 D
S
N
305 1308 M
305 1286 D
307 1280 D
314 1275 D
320 1273 D
327 1273 D
331 1275 D
333 1277 D
336 1282 D
336 1286 D
333 1293 D
327 1297 D
320 1299 D
314 1299 D
310 1297 D
307 1295 D
305 1290 D
S
N
305 1286 M
307 1282 D
314 1277 D
320 1275 D
329 1275 D
333 1277 D
S
N
336 1286 M
333 1290 D
327 1295 D
320 1297 D
312 1297 D
307 1295 D
S
N
307 1295 M
307 1308 D
S
N
323 1322 M
353 1322 D
S
N
323 1324 M
353 1324 D
S
N
323 1341 M
353 1341 D
S
N
323 1342 M
353 1342 D
S
N
323 1318 M
323 1328 D
S
N
323 1337 M
323 1347 D
S
N
337 1324 M
337 1341 D
S
N
353 1318 M
353 1328 D
S
N
353 1337 M
353 1347 D
S
N
353 1357 M
352 1355 D
350 1357 D
352 1358 D
354 1358 D
357 1357 D
359 1355 D
S
N
323 1371 M
324 1370 D
326 1371 D
324 1373 D
323 1371 D
S
N
333 1371 M
353 1371 D
S
N
333 1373 M
353 1373 D
S
N
333 1367 M
333 1373 D
S
N
353 1367 M
353 1377 D
S
0 0 1 setrgbcolor
N
771 1395 M
750 1395 D
743 1393 D
739 1386 D
737 1380 D
737 1373 D
739 1369 D
741 1367 D
745 1365 D
750 1365 D
756 1367 D
760 1373 D
762 1380 D
762 1386 D
760 1390 D
758 1393 D
754 1395 D
S
N
750 1395 M
745 1393 D
741 1386 D
739 1380 D
739 1371 D
741 1367 D
S
N
750 1365 M
754 1367 D
758 1373 D
760 1380 D
760 1388 D
758 1393 D
S
N
758 1393 M
771 1393 D
S
N
786 1378 M
786 1347 D
S
N
787 1378 M
787 1347 D
S
N
804 1378 M
804 1347 D
S
N
806 1378 M
806 1347 D
S
N
781 1378 M
791 1378 D
S
N
800 1378 M
810 1378 D
S
N
787 1363 M
804 1363 D
S
N
781 1347 M
791 1347 D
S
N
800 1347 M
810 1347 D
S
N
844 1403 M
844 1365 D
S
N
825 1384 M
864 1384 D
S
N
913 1395 M
892 1395 D
885 1393 D
881 1386 D
879 1380 D
879 1373 D
881 1369 D
883 1367 D
887 1365 D
892 1365 D
898 1367 D
903 1373 D
905 1380 D
905 1386 D
903 1390 D
900 1393 D
896 1395 D
S
N
892 1395 M
887 1393 D
883 1386 D
881 1380 D
881 1371 D
883 1367 D
S
N
892 1365 M
896 1367 D
900 1373 D
903 1380 D
903 1388 D
900 1393 D
S
N
900 1393 M
913 1393 D
S
N
928 1378 M
928 1347 D
S
N
929 1378 M
929 1347 D
S
N
923 1378 M
941 1378 D
945 1376 D
947 1375 D
948 1372 D
948 1369 D
947 1366 D
945 1365 D
941 1363 D
S
N
941 1378 M
944 1376 D
945 1375 D
947 1372 D
947 1369 D
945 1366 D
944 1365 D
941 1363 D
S
N
929 1363 M
941 1363 D
945 1362 D
947 1360 D
948 1357 D
948 1353 D
947 1350 D
945 1349 D
941 1347 D
923 1347 D
S
N
941 1363 M
944 1362 D
945 1360 D
947 1357 D
947 1353 D
945 1350 D
944 1349 D
941 1347 D
S
0 0 0 setrgbcolor
N
771 1308 M
750 1308 D
743 1306 D
739 1300 D
737 1293 D
737 1287 D
739 1282 D
741 1280 D
745 1278 D
750 1278 D
756 1280 D
760 1287 D
762 1293 D
762 1300 D
760 1304 D
758 1306 D
754 1308 D
S
N
750 1308 M
745 1306 D
741 1300 D
739 1293 D
739 1285 D
741 1280 D
S
N
750 1278 M
754 1280 D
758 1287 D
760 1293 D
760 1302 D
758 1306 D
S
N
758 1306 M
771 1306 D
S
N
786 1291 M
786 1261 D
S
N
787 1291 M
787 1261 D
S
N
781 1291 M
791 1291 D
S
N
781 1261 M
791 1261 D
S
N
817 1287 M
819 1291 D
819 1282 D
817 1287 D
814 1290 D
810 1291 D
806 1291 D
801 1290 D
799 1287 D
799 1284 D
800 1281 D
801 1279 D
804 1278 D
813 1275 D
816 1274 D
819 1271 D
S
N
799 1284 M
801 1281 D
804 1279 D
813 1277 D
816 1275 D
817 1274 D
819 1271 D
819 1265 D
816 1262 D
812 1261 D
807 1261 D
803 1262 D
800 1265 D
799 1269 D
799 1261 D
800 1265 D
S
N
838 1291 M
827 1261 D
S
N
838 1291 M
848 1261 D
S
N
838 1287 M
846 1261 D
S
N
830 1269 M
843 1269 D
S
N
825 1261 M
833 1261 D
S
N
842 1261 M
851 1261 D
S
N
883 1317 M
883 1278 D
S
N
864 1298 M
903 1298 D
S
N
952 1308 M
931 1308 D
924 1306 D
920 1300 D
918 1293 D
918 1287 D
920 1282 D
922 1280 D
926 1278 D
931 1278 D
937 1280 D
942 1287 D
944 1293 D
944 1300 D
942 1304 D
939 1306 D
935 1308 D
S
N
931 1308 M
926 1306 D
922 1300 D
920 1293 D
920 1285 D
922 1280 D
S
N
931 1278 M
935 1280 D
939 1287 D
942 1293 D
942 1302 D
939 1306 D
S
N
939 1306 M
952 1306 D
S
N
967 1291 M
967 1261 D
S
N
968 1291 M
968 1261 D
S
N
962 1291 M
980 1291 D
984 1290 D
986 1288 D
987 1285 D
987 1282 D
986 1279 D
984 1278 D
980 1277 D
S
N
980 1291 M
983 1290 D
984 1288 D
986 1285 D
986 1282 D
984 1279 D
983 1278 D
980 1277 D
S
N
968 1277 M
980 1277 D
984 1275 D
986 1274 D
987 1271 D
987 1266 D
986 1264 D
984 1262 D
980 1261 D
962 1261 D
S
N
980 1277 M
983 1275 D
984 1274 D
986 1271 D
986 1266 D
984 1264 D
983 1262 D
980 1261 D
S
N
583 1477 M
583 1044 D
S
N
583 1044 M
1881 1044 D
S
N
1881 1044 M
1881 1477 D
S
N
1881 1477 M
583 1477 D
S
0 0 1 setrgbcolor
583 1117 P
N
583 1117 M
583 1189 D
600 1189 D
600 1189 D
618 1189 D
618 1189 D
635 1189 D
635 1189 D
652 1189 D
652 1189 D
669 1189 D
669 1189 D
687 1189 D
687 1189 D
704 1189 D
704 1189 D
721 1189 D
721 1189 D
739 1189 D
739 1188 D
756 1188 D
756 1188 D
773 1188 D
773 1188 D
791 1188 D
791 1188 D
808 1188 D
808 1188 D
825 1188 D
825 1188 D
842 1188 D
842 1188 D
860 1188 D
860 1187 D
877 1187 D
877 1186 D
894 1186 D
894 1185 D
912 1185 D
912 1183 D
929 1183 D
929 1182 D
946 1182 D
946 1180 D
964 1180 D
964 1179 D
981 1179 D
981 1178 D
998 1178 D
998 1175 D
1015 1175 D
1015 1174 D
1033 1174 D
1033 1173 D
1050 1173 D
1050 1172 D
1067 1172 D
1067 1170 D
1085 1170 D
1085 1169 D
1102 1169 D
1102 1166 D
1119 1166 D
1119 1168 D
1137 1168 D
1137 1167 D
1154 1167 D
1154 1165 D
1171 1165 D
1171 1166 D
1188 1166 D
1188 1165 D
1206 1165 D
1206 1169 D
1223 1169 D
1223 1173 D
1240 1173 D
1240 1173 D
1258 1173 D
1258 1178 D
1275 1178 D
1275 1186 D
1292 1186 D
1292 1187 D
1310 1187 D
1310 1196 D
1327 1196 D
1327 1202 D
1344 1202 D
1344 1210 D
1361 1210 D
1361 1215 D
1379 1215 D
1379 1221 D
1396 1221 D
1396 1233 D
1413 1233 D
1413 1236 D
1431 1236 D
1431 1247 D
1448 1247 D
1448 1276 D
1465 1276 D
1465 1266 D
1483 1266 D
1483 1289 D
1500 1289 D
1500 1296 D
1517 1296 D
1517 1289 D
1534 1289 D
1534 1300 D
1552 1300 D
1552 1312 D
1569 1312 D
1569 1313 D
1586 1313 D
1586 1326 D
1604 1326 D
1604 1321 D
1621 1321 D
1621 1346 D
1638 1346 D
1638 1317 D
1656 1317 D
1656 1357 D
1673 1357 D
1673 1361 D
1673 1361 D
1673 1361 D
1690 1361 D
1690 1405 D
S
N
1690 1405 M
1708 1405 D
1708 1389 D
1725 1389 D
1725 1346 D
1742 1346 D
1742 1429 D
1759 1429 D
1759 1451 D
1777 1451 D
1777 1334 D
1794 1334 D
1794 1343 D
1811 1343 D
1811 1370 D
1829 1370 D
1829 1418 D
1846 1418 D
1846 1375 D
1863 1375 D
1863 1288 D
1880 1288 D
1880 1044 D
S
1881 1117 P
0 0 0 setrgbcolor
N
583 1044 M
583 1096 D
S
N
626 1062 M
626 1044 D
S
N
669 1044 M
669 1062 D
S
N
713 1062 M
713 1044 D
S
N
756 1044 M
756 1062 D
S
N
799 1096 M
799 1044 D
S
N
842 1044 M
842 1062 D
S
N
886 1062 M
886 1044 D
S
N
929 1044 M
929 1062 D
S
N
972 1062 M
972 1044 D
S
N
1015 1044 M
1015 1096 D
S
N
1059 1062 M
1059 1044 D
S
N
1102 1044 M
1102 1062 D
S
N
1145 1062 M
1145 1044 D
S
N
1189 1044 M
1189 1062 D
S
N
1232 1096 M
1232 1044 D
S
N
1275 1044 M
1275 1062 D
S
N
1318 1062 M
1318 1044 D
S
N
1361 1044 M
1361 1062 D
S
N
1405 1062 M
1405 1044 D
S
N
1448 1044 M
1448 1096 D
S
N
1491 1062 M
1491 1044 D
S
N
1534 1044 M
1534 1062 D
S
N
1578 1062 M
1578 1044 D
S
N
1621 1044 M
1621 1062 D
S
N
1664 1096 M
1664 1044 D
S
N
1708 1044 M
1708 1062 D
S
N
1751 1062 M
1751 1044 D
S
N
1794 1044 M
1794 1062 D
S
N
1837 1062 M
1837 1044 D
S
N
1881 1044 M
1881 1096 D
S
N
582 1016 M
577 1015 D
574 1010 D
573 1003 D
573 999 D
574 991 D
577 987 D
582 986 D
584 986 D
589 987 D
592 991 D
593 999 D
593 1003 D
592 1010 D
589 1015 D
584 1016 D
582 1016 D
S
N
582 1016 M
579 1015 D
577 1013 D
576 1010 D
574 1003 D
574 999 D
576 991 D
577 989 D
579 987 D
582 986 D
S
N
584 986 M
587 987 D
589 989 D
590 991 D
592 999 D
592 1003 D
590 1010 D
589 1013 D
587 1015 D
584 1016 D
S
N
762 1010 M
763 1009 D
762 1007 D
760 1009 D
760 1010 D
762 1013 D
763 1015 D
768 1016 D
773 1016 D
778 1015 D
779 1013 D
781 1010 D
781 1007 D
779 1004 D
775 1002 D
768 999 D
765 997 D
762 994 D
760 990 D
760 986 D
S
N
773 1016 M
776 1015 D
778 1013 D
779 1010 D
779 1007 D
778 1004 D
773 1002 D
768 999 D
S
N
760 989 M
762 990 D
765 990 D
772 987 D
776 987 D
779 989 D
781 990 D
S
N
765 990 M
772 986 D
778 986 D
779 987 D
781 990 D
781 993 D
S
N
792 1016 M
789 1002 D
S
N
789 1002 M
792 1004 D
796 1006 D
801 1006 D
805 1004 D
808 1002 D
809 997 D
809 994 D
808 990 D
805 987 D
801 986 D
796 986 D
792 987 D
791 989 D
789 991 D
789 993 D
791 994 D
792 993 D
791 991 D
S
N
801 1006 M
804 1004 D
807 1002 D
808 997 D
808 994 D
807 990 D
804 987 D
801 986 D
S
N
792 1016 M
807 1016 D
S
N
792 1015 M
799 1015 D
807 1016 D
S
N
827 1016 M
822 1015 D
819 1010 D
818 1003 D
818 999 D
819 991 D
822 987 D
827 986 D
830 986 D
834 987 D
837 991 D
838 999 D
838 1003 D
837 1010 D
834 1015 D
830 1016 D
827 1016 D
S
N
827 1016 M
824 1015 D
822 1013 D
821 1010 D
819 1003 D
819 999 D
821 991 D
822 989 D
824 987 D
827 986 D
S
N
830 986 M
832 987 D
834 989 D
835 991 D
837 999 D
837 1003 D
835 1010 D
834 1013 D
832 1015 D
830 1016 D
S
N
979 1016 M
977 1002 D
S
N
977 1002 M
979 1004 D
984 1006 D
988 1006 D
992 1004 D
995 1002 D
997 997 D
997 994 D
995 990 D
992 987 D
988 986 D
984 986 D
979 987 D
978 989 D
977 991 D
977 993 D
978 994 D
979 993 D
978 991 D
S
N
988 1006 M
991 1004 D
994 1002 D
995 997 D
995 994 D
994 990 D
991 987 D
988 986 D
S
N
979 1016 M
994 1016 D
S
N
979 1015 M
987 1015 D
994 1016 D
S
N
1014 1016 M
1010 1015 D
1007 1010 D
1005 1003 D
1005 999 D
1007 991 D
1010 987 D
1014 986 D
1017 986 D
1021 987 D
1024 991 D
1026 999 D
1026 1003 D
1024 1010 D
1021 1015 D
1017 1016 D
1014 1016 D
S
N
1014 1016 M
1011 1015 D
1010 1013 D
1008 1010 D
1007 1003 D
1007 999 D
1008 991 D
1010 989 D
1011 987 D
1014 986 D
S
N
1017 986 M
1020 987 D
1021 989 D
1023 991 D
1024 999 D
1024 1003 D
1023 1010 D
1021 1013 D
1020 1015 D
1017 1016 D
S
N
1043 1016 M
1039 1015 D
1036 1010 D
1034 1003 D
1034 999 D
1036 991 D
1039 987 D
1043 986 D
1046 986 D
1050 987 D
1053 991 D
1055 999 D
1055 1003 D
1053 1010 D
1050 1015 D
1046 1016 D
1043 1016 D
S
N
1043 1016 M
1040 1015 D
1039 1013 D
1037 1010 D
1036 1003 D
1036 999 D
1037 991 D
1039 989 D
1040 987 D
1043 986 D
S
N
1046 986 M
1049 987 D
1050 989 D
1052 991 D
1053 999 D
1053 1003 D
1052 1010 D
1050 1013 D
1049 1015 D
1046 1016 D
S
N
1193 1016 M
1193 1007 D
S
N
1193 1010 M
1194 1013 D
1197 1016 D
1200 1016 D
1207 1012 D
1210 1012 D
1212 1013 D
1213 1016 D
S
N
1194 1013 M
1197 1015 D
1200 1015 D
1207 1012 D
S
N
1213 1016 M
1213 1012 D
1212 1007 D
1206 1000 D
1204 997 D
1203 993 D
1203 986 D
S
N
1212 1007 M
1204 1000 D
1203 997 D
1201 993 D
1201 986 D
S
N
1225 1016 M
1222 1002 D
S
N
1222 1002 M
1225 1004 D
1229 1006 D
1233 1006 D
1238 1004 D
1240 1002 D
1242 997 D
1242 994 D
1240 990 D
1238 987 D
1233 986 D
1229 986 D
1225 987 D
1223 989 D
1222 991 D
1222 993 D
1223 994 D
1225 993 D
1223 991 D
S
N
1233 1006 M
1236 1004 D
1239 1002 D
1240 997 D
1240 994 D
1239 990 D
1236 987 D
1233 986 D
S
N
1225 1016 M
1239 1016 D
S
N
1225 1015 M
1232 1015 D
1239 1016 D
S
N
1259 1016 M
1255 1015 D
1252 1010 D
1251 1003 D
1251 999 D
1252 991 D
1255 987 D
1259 986 D
1262 986 D
1266 987 D
1269 991 D
1271 999 D
1271 1003 D
1269 1010 D
1266 1015 D
1262 1016 D
1259 1016 D
S
N
1259 1016 M
1256 1015 D
1255 1013 D
1253 1010 D
1252 1003 D
1252 999 D
1253 991 D
1255 989 D
1256 987 D
1259 986 D
S
N
1262 986 M
1265 987 D
1266 989 D
1268 991 D
1269 999 D
1269 1003 D
1268 1010 D
1266 1013 D
1265 1015 D
1262 1016 D
S
N
1399 1010 M
1402 1012 D
1406 1016 D
1406 986 D
S
N
1405 1015 M
1405 986 D
S
N
1399 986 M
1412 986 D
S
N
1432 1016 M
1428 1015 D
1425 1010 D
1424 1003 D
1424 999 D
1425 991 D
1428 987 D
1432 986 D
1435 986 D
1439 987 D
1442 991 D
1444 999 D
1444 1003 D
1442 1010 D
1439 1015 D
1435 1016 D
1432 1016 D
S
N
1432 1016 M
1429 1015 D
1428 1013 D
1426 1010 D
1425 1003 D
1425 999 D
1426 991 D
1428 989 D
1429 987 D
1432 986 D
S
N
1435 986 M
1438 987 D
1439 989 D
1441 991 D
1442 999 D
1442 1003 D
1441 1010 D
1439 1013 D
1438 1015 D
1435 1016 D
S
N
1461 1016 M
1457 1015 D
1454 1010 D
1452 1003 D
1452 999 D
1454 991 D
1457 987 D
1461 986 D
1464 986 D
1468 987 D
1471 991 D
1473 999 D
1473 1003 D
1471 1010 D
1468 1015 D
1464 1016 D
1461 1016 D
S
N
1461 1016 M
1458 1015 D
1457 1013 D
1455 1010 D
1454 1003 D
1454 999 D
1455 991 D
1457 989 D
1458 987 D
1461 986 D
S
N
1464 986 M
1467 987 D
1468 989 D
1470 991 D
1471 999 D
1471 1003 D
1470 1010 D
1468 1013 D
1467 1015 D
1464 1016 D
S
N
1490 1016 M
1486 1015 D
1483 1010 D
1481 1003 D
1481 999 D
1483 991 D
1486 987 D
1490 986 D
1493 986 D
1497 987 D
1500 991 D
1501 999 D
1501 1003 D
1500 1010 D
1497 1015 D
1493 1016 D
1490 1016 D
S
N
1490 1016 M
1487 1015 D
1486 1013 D
1484 1010 D
1483 1003 D
1483 999 D
1484 991 D
1486 989 D
1487 987 D
1490 986 D
S
N
1493 986 M
1496 987 D
1497 989 D
1499 991 D
1500 999 D
1500 1003 D
1499 1010 D
1497 1013 D
1496 1015 D
1493 1016 D
S
N
1615 1010 M
1618 1012 D
1622 1016 D
1622 986 D
S
N
1621 1015 M
1621 986 D
S
N
1615 986 M
1628 986 D
S
N
1641 1010 M
1643 1009 D
1641 1007 D
1640 1009 D
1640 1010 D
1641 1013 D
1643 1015 D
1647 1016 D
1653 1016 D
1657 1015 D
1659 1013 D
1660 1010 D
1660 1007 D
1659 1004 D
1654 1002 D
1647 999 D
1644 997 D
1641 994 D
1640 990 D
1640 986 D
S
N
1653 1016 M
1656 1015 D
1657 1013 D
1659 1010 D
1659 1007 D
1657 1004 D
1653 1002 D
1647 999 D
S
N
1640 989 M
1641 990 D
1644 990 D
1651 987 D
1656 987 D
1659 989 D
1660 990 D
S
N
1644 990 M
1651 986 D
1657 986 D
1659 987 D
1660 990 D
1660 993 D
S
N
1672 1016 M
1669 1002 D
S
N
1669 1002 M
1672 1004 D
1676 1006 D
1680 1006 D
1685 1004 D
1687 1002 D
1689 997 D
1689 994 D
1687 990 D
1685 987 D
1680 986 D
1676 986 D
1672 987 D
1670 989 D
1669 991 D
1669 993 D
1670 994 D
1672 993 D
1670 991 D
S
N
1680 1006 M
1683 1004 D
1686 1002 D
1687 997 D
1687 994 D
1686 990 D
1683 987 D
1680 986 D
S
N
1672 1016 M
1686 1016 D
S
N
1672 1015 M
1679 1015 D
1686 1016 D
S
N
1706 1016 M
1702 1015 D
1699 1010 D
1698 1003 D
1698 999 D
1699 991 D
1702 987 D
1706 986 D
1709 986 D
1713 987 D
1716 991 D
1718 999 D
1718 1003 D
1716 1010 D
1713 1015 D
1709 1016 D
1706 1016 D
S
N
1706 1016 M
1703 1015 D
1702 1013 D
1700 1010 D
1699 1003 D
1699 999 D
1700 991 D
1702 989 D
1703 987 D
1706 986 D
S
N
1709 986 M
1712 987 D
1713 989 D
1715 991 D
1716 999 D
1716 1003 D
1715 1010 D
1713 1013 D
1712 1015 D
1709 1016 D
S
N
1831 1010 M
1834 1012 D
1839 1016 D
1839 986 D
S
N
1837 1015 M
1837 986 D
S
N
1831 986 M
1844 986 D
S
N
1859 1016 M
1856 1002 D
S
N
1856 1002 M
1859 1004 D
1863 1006 D
1868 1006 D
1872 1004 D
1875 1002 D
1876 997 D
1876 994 D
1875 990 D
1872 987 D
1868 986 D
1863 986 D
1859 987 D
1857 989 D
1856 991 D
1856 993 D
1857 994 D
1859 993 D
1857 991 D
S
N
1868 1006 M
1870 1004 D
1873 1002 D
1875 997 D
1875 994 D
1873 990 D
1870 987 D
1868 986 D
S
N
1859 1016 M
1873 1016 D
S
N
1859 1015 M
1866 1015 D
1873 1016 D
S
N
1894 1016 M
1889 1015 D
1886 1010 D
1885 1003 D
1885 999 D
1886 991 D
1889 987 D
1894 986 D
1896 986 D
1901 987 D
1904 991 D
1905 999 D
1905 1003 D
1904 1010 D
1901 1015 D
1896 1016 D
1894 1016 D
S
N
1894 1016 M
1891 1015 D
1889 1013 D
1888 1010 D
1886 1003 D
1886 999 D
1888 991 D
1889 989 D
1891 987 D
1894 986 D
S
N
1896 986 M
1899 987 D
1901 989 D
1902 991 D
1904 999 D
1904 1003 D
1902 1010 D
1901 1013 D
1899 1015 D
1896 1016 D
S
N
1922 1016 M
1918 1015 D
1915 1010 D
1914 1003 D
1914 999 D
1915 991 D
1918 987 D
1922 986 D
1925 986 D
1930 987 D
1933 991 D
1934 999 D
1934 1003 D
1933 1010 D
1930 1015 D
1925 1016 D
1922 1016 D
S
N
1922 1016 M
1920 1015 D
1918 1013 D
1917 1010 D
1915 1003 D
1915 999 D
1917 991 D
1918 989 D
1920 987 D
1922 986 D
S
N
1925 986 M
1928 987 D
1930 989 D
1931 991 D
1933 999 D
1933 1003 D
1931 1010 D
1930 1013 D
1928 1015 D
1925 1016 D
S
N
583 1425 M
583 1477 D
S
N
626 1477 M
626 1460 D
S
N
669 1460 M
669 1477 D
S
N
713 1477 M
713 1460 D
S
N
756 1460 M
756 1477 D
S
N
799 1477 M
799 1425 D
S
N
842 1460 M
842 1477 D
S
N
886 1477 M
886 1460 D
S
N
929 1460 M
929 1477 D
S
N
972 1477 M
972 1460 D
S
N
1015 1425 M
1015 1477 D
S
N
1059 1477 M
1059 1460 D
S
N
1102 1460 M
1102 1477 D
S
N
1145 1477 M
1145 1460 D
S
N
1189 1460 M
1189 1477 D
S
N
1232 1477 M
1232 1425 D
S
N
1275 1460 M
1275 1477 D
S
N
1318 1477 M
1318 1460 D
S
N
1361 1460 M
1361 1477 D
S
N
1405 1477 M
1405 1460 D
S
N
1448 1425 M
1448 1477 D
S
N
1491 1477 M
1491 1460 D
S
N
1534 1460 M
1534 1477 D
S
N
1578 1477 M
1578 1460 D
S
N
1621 1460 M
1621 1477 D
S
N
1664 1477 M
1664 1425 D
S
N
1708 1460 M
1708 1477 D
S
N
1751 1477 M
1751 1460 D
S
N
1794 1460 M
1794 1477 D
S
N
1837 1477 M
1837 1460 D
S
N
1881 1425 M
1881 1477 D
S
N
583 1044 M
635 1044 D
S
N
600 1059 M
583 1059 D
S
N
583 1073 M
600 1073 D
S
N
600 1088 M
583 1088 D
S
N
583 1102 M
600 1102 D
S
N
635 1117 M
583 1117 D
S
N
583 1131 M
600 1131 D
S
N
600 1145 M
583 1145 D
S
N
583 1160 M
600 1160 D
S
N
600 1174 M
583 1174 D
S
N
583 1189 M
635 1189 D
S
N
600 1203 M
583 1203 D
S
N
583 1217 M
600 1217 D
S
N
600 1232 M
583 1232 D
S
N
583 1246 M
600 1246 D
S
N
635 1261 M
583 1261 D
S
N
583 1275 M
600 1275 D
S
N
600 1290 M
583 1290 D
S
N
583 1304 M
600 1304 D
S
N
600 1318 M
583 1318 D
S
N
583 1333 M
635 1333 D
S
N
600 1347 M
583 1347 D
S
N
583 1362 M
600 1362 D
S
N
600 1376 M
583 1376 D
S
N
583 1390 M
600 1390 D
S
N
635 1405 M
583 1405 D
S
N
583 1419 M
600 1419 D
S
N
600 1434 M
583 1434 D
S
N
583 1448 M
600 1448 D
S
N
600 1463 M
583 1463 D
S
N
583 1477 M
635 1477 D
S
N
505 1040 M
531 1040 D
S
N
546 1052 M
548 1053 D
553 1057 D
553 1027 D
S
N
551 1056 M
551 1027 D
S
N
546 1027 M
559 1027 D
S
N
550 1130 M
546 1128 D
543 1124 D
541 1117 D
541 1112 D
543 1105 D
546 1101 D
550 1099 D
553 1099 D
557 1101 D
560 1105 D
561 1112 D
561 1117 D
560 1124 D
557 1128 D
553 1130 D
550 1130 D
S
N
550 1130 M
547 1128 D
546 1127 D
544 1124 D
543 1117 D
543 1112 D
544 1105 D
546 1102 D
547 1101 D
550 1099 D
S
N
553 1099 M
556 1101 D
557 1102 D
559 1105 D
560 1112 D
560 1117 D
559 1124 D
557 1127 D
556 1128 D
553 1130 D
S
N
546 1196 M
548 1197 D
553 1202 D
553 1171 D
S
N
551 1200 M
551 1171 D
S
N
546 1171 M
559 1171 D
S
N
543 1268 M
544 1267 D
543 1265 D
541 1267 D
541 1268 D
543 1271 D
544 1272 D
548 1274 D
554 1274 D
559 1272 D
560 1271 D
561 1268 D
561 1265 D
560 1262 D
556 1259 D
548 1256 D
546 1255 D
543 1252 D
541 1248 D
541 1243 D
S
N
554 1274 M
557 1272 D
559 1271 D
560 1268 D
560 1265 D
559 1262 D
554 1259 D
548 1256 D
S
N
541 1246 M
543 1248 D
546 1248 D
553 1245 D
557 1245 D
560 1246 D
561 1248 D
S
N
546 1248 M
553 1243 D
559 1243 D
560 1245 D
561 1248 D
561 1251 D
S
N
543 1340 M
544 1339 D
543 1337 D
541 1339 D
541 1340 D
543 1343 D
544 1344 D
548 1346 D
554 1346 D
559 1344 D
560 1341 D
560 1337 D
559 1334 D
554 1333 D
550 1333 D
S
N
554 1346 M
557 1344 D
559 1341 D
559 1337 D
557 1334 D
554 1333 D
S
N
554 1333 M
557 1331 D
560 1329 D
561 1326 D
561 1321 D
560 1318 D
559 1317 D
554 1316 D
548 1316 D
544 1317 D
543 1318 D
541 1321 D
541 1323 D
543 1324 D
544 1323 D
543 1321 D
S
N
559 1330 M
560 1326 D
560 1321 D
559 1318 D
557 1317 D
554 1316 D
S
N
554 1415 M
554 1388 D
S
N
556 1418 M
556 1388 D
S
N
556 1418 M
540 1396 D
563 1396 D
S
N
550 1388 M
560 1388 D
S
N
544 1490 M
541 1476 D
S
N
541 1476 M
544 1478 D
548 1480 D
553 1480 D
557 1478 D
560 1476 D
561 1471 D
561 1468 D
560 1464 D
557 1461 D
553 1460 D
548 1460 D
544 1461 D
543 1463 D
541 1465 D
541 1467 D
543 1468 D
544 1467 D
543 1465 D
S
N
553 1480 M
556 1478 D
559 1476 D
560 1471 D
560 1468 D
559 1464 D
556 1461 D
553 1460 D
S
N
544 1490 M
559 1490 D
S
N
544 1489 M
551 1489 D
559 1490 D
S
N
1829 1044 M
1881 1044 D
S
N
1881 1059 M
1863 1059 D
S
N
1863 1073 M
1881 1073 D
S
N
1881 1088 M
1863 1088 D
S
N
1863 1102 M
1881 1102 D
S
N
1881 1117 M
1829 1117 D
S
N
1863 1131 M
1881 1131 D
S
N
1881 1145 M
1863 1145 D
S
N
1863 1160 M
1881 1160 D
S
N
1881 1174 M
1863 1174 D
S
N
1829 1189 M
1881 1189 D
S
N
1881 1203 M
1863 1203 D
S
N
1863 1217 M
1881 1217 D
S
N
1881 1232 M
1863 1232 D
S
N
1863 1246 M
1881 1246 D
S
N
1881 1261 M
1829 1261 D
S
N
1863 1275 M
1881 1275 D
S
N
1881 1290 M
1863 1290 D
S
N
1863 1304 M
1881 1304 D
S
N
1881 1318 M
1863 1318 D
S
N
1829 1333 M
1881 1333 D
S
N
1881 1347 M
1863 1347 D
S
N
1863 1362 M
1881 1362 D
S
N
1881 1376 M
1863 1376 D
S
N
1863 1390 M
1881 1390 D
S
N
1881 1405 M
1829 1405 D
S
N
1863 1419 M
1881 1419 D
S
N
1881 1434 M
1863 1434 D
S
N
1863 1448 M
1881 1448 D
S
N
1881 1463 M
1863 1463 D
S
N
1829 1477 M
1881 1477 D
S
583 1117 P
N
583 1117 M
583 1190 D
600 1190 D
600 1189 D
618 1189 D
618 1189 D
635 1189 D
635 1189 D
652 1189 D
652 1189 D
669 1189 D
669 1189 D
687 1189 D
687 1189 D
704 1189 D
704 1189 D
721 1189 D
721 1189 D
739 1189 D
739 1189 D
756 1189 D
756 1189 D
773 1189 D
773 1189 D
791 1189 D
791 1189 D
808 1189 D
808 1189 D
825 1189 D
825 1190 D
842 1190 D
842 1190 D
860 1190 D
860 1191 D
877 1191 D
877 1193 D
894 1193 D
894 1196 D
912 1196 D
912 1197 D
929 1197 D
929 1198 D
946 1198 D
946 1200 D
964 1200 D
964 1200 D
981 1200 D
981 1201 D
998 1201 D
998 1202 D
1015 1202 D
1015 1204 D
1033 1204 D
1033 1203 D
1050 1203 D
1050 1203 D
1067 1203 D
1067 1204 D
1085 1204 D
1085 1204 D
1102 1204 D
1102 1207 D
1119 1207 D
1119 1206 D
1137 1206 D
1137 1205 D
1154 1205 D
1154 1209 D
1171 1209 D
1171 1207 D
1188 1207 D
1188 1203 D
1206 1203 D
1206 1201 D
1223 1201 D
1223 1194 D
1240 1194 D
1240 1187 D
1258 1187 D
1258 1184 D
1275 1184 D
1275 1181 D
1292 1181 D
1292 1174 D
1310 1174 D
1310 1173 D
1327 1173 D
1327 1172 D
1344 1172 D
1344 1171 D
1361 1171 D
1361 1178 D
1379 1178 D
1379 1172 D
1396 1172 D
1396 1170 D
1413 1170 D
1413 1172 D
1431 1172 D
1431 1186 D
1448 1186 D
1448 1195 D
1465 1195 D
1465 1188 D
1483 1188 D
1483 1198 D
1500 1198 D
1500 1203 D
1517 1203 D
1517 1199 D
1534 1199 D
1534 1203 D
1552 1203 D
1552 1208 D
1569 1208 D
1569 1211 D
1586 1211 D
1586 1213 D
1604 1213 D
1604 1216 D
1621 1216 D
1621 1228 D
1638 1228 D
1638 1213 D
1656 1213 D
1656 1229 D
1673 1229 D
1673 1237 D
1673 1237 D
1673 1237 D
1690 1237 D
1690 1257 D
1708 1257 D
1708 1243 D
1725 1243 D
1725 1243 D
1742 1243 D
1742 1268 D
1759 1268 D
1759 1278 D
1777 1278 D
1777 1226 D
1794 1226 D
1794 1245 D
1811 1245 D
1811 1237 D
1829 1237 D
1829 1276 D
1846 1276 D
1846 1245 D
1863 1245 D
1863 1200 D
1880 1200 D
1880 1044 D
S
1881 1117 P
1 0 1 setrgbcolor
583 1117 P
[39] 0 Sd
N
583 1189 M
1881 1189 D
S
[] 0 Sd
1881 1117 P
showpage
%%Trailer
%%Pages: 1
%%BoundingBox: 66 209 467 570
