%!PS-Adobe-1.0
%%Creator: Unified Graphics System
%%Pages: (atend)
%%DocumentFonts: Helvetica
%%BoundingBox:   64  228  228  391
%%EndComments
/Sw{setlinewidth}def
/Sg{setgray}def
/Sd{setdash}def
/P {newpath
    moveto
0 0 rlineto
    stroke}def
/M {moveto}def
/D {lineto}def
/N {newpath}def
/S {stroke}def
/T {/Helvetica findfont
    exch
    scalefont
    setfont}def
/R {rotate}def
/W {show}def
/F {fill}def
/X {gsave}def
/Y {grestore}def
%%EndProlog
%%Page: 1 1
0.12000 0.12000 scale
1 setlinecap
1 setlinejoin
2 Sw
0.00 0.00 0.00 setrgbcolor
[] 0 Sd
N
1492 3176 M
1490 3175 D
1488 3173 D
1487 3171 D
1487 3169 D
1488 3167 D
1490 3165 D
1492 3164 D
1494 3164 D
1496 3165 D
1498 3167 D
1499 3169 D
1499 3171 D
1498 3173 D
1496 3175 D
1494 3176 D
1492 3176 D
S
N
1490 3175 M
1488 3172 D
1488 3168 D
1490 3165 D
S
N
1496 3165 M
1498 3168 D
1498 3172 D
1496 3175 D
S
N
1498 3173 M
1499 3175 D
1501 3176 D
1501 3175 D
1499 3175 D
S
N
1488 3167 M
1487 3165 D
1486 3163 D
1486 3162 D
1487 3160 D
1491 3158 D
1496 3158 D
1500 3157 D
1501 3156 D
S
N
1486 3162 M
1487 3161 D
1491 3160 D
1496 3160 D
1500 3158 D
1501 3156 D
1501 3155 D
1500 3153 D
1496 3152 D
1490 3152 D
1486 3153 D
1485 3155 D
1485 3156 D
1486 3158 D
1490 3160 D
S
N
1514 3176 M
1511 3175 D
1510 3173 D
1509 3171 D
1509 3169 D
1510 3167 D
1511 3165 D
1514 3164 D
1516 3164 D
1518 3165 D
1520 3167 D
1521 3169 D
1521 3171 D
1520 3173 D
1518 3175 D
1516 3176 D
1514 3176 D
S
N
1511 3175 M
1510 3172 D
1510 3168 D
1511 3165 D
S
N
1518 3165 M
1520 3168 D
1520 3172 D
1518 3175 D
S
N
1520 3173 M
1521 3175 D
1523 3176 D
1523 3175 D
1521 3175 D
S
N
1510 3167 M
1509 3165 D
1508 3163 D
1508 3162 D
1509 3160 D
1513 3158 D
1518 3158 D
1522 3157 D
1523 3156 D
S
N
1508 3162 M
1509 3161 D
1513 3160 D
1518 3160 D
1522 3158 D
1523 3156 D
1523 3155 D
1522 3153 D
1518 3152 D
1511 3152 D
1508 3153 D
1507 3155 D
1507 3156 D
1508 3158 D
1511 3160 D
S
N
1551 3184 M
1550 3183 D
1551 3181 D
1552 3183 D
1551 3184 D
S
N
1551 3176 M
1551 3160 D
S
N
1552 3176 M
1552 3160 D
S
N
1547 3176 M
1552 3176 D
S
N
1547 3160 M
1555 3160 D
S
N
1563 3176 M
1563 3160 D
S
N
1565 3176 M
1565 3160 D
S
N
1565 3172 M
1567 3175 D
1570 3176 D
1573 3176 D
1576 3175 D
1577 3172 D
1577 3160 D
S
N
1573 3176 M
1575 3175 D
1576 3172 D
1576 3160 D
S
N
1560 3176 M
1565 3176 D
S
N
1560 3160 M
1568 3160 D
S
N
1573 3160 M
1581 3160 D
S
N
1589 3184 M
1589 3164 D
1590 3161 D
1592 3160 D
1594 3160 D
1597 3161 D
1598 3163 D
S
N
1590 3184 M
1590 3164 D
1591 3161 D
1592 3160 D
S
N
1585 3176 M
1594 3176 D
S
N
1605 3169 M
1619 3169 D
1619 3171 D
1618 3173 D
1616 3175 D
1614 3176 D
1611 3176 D
1607 3175 D
1605 3172 D
1604 3169 D
1604 3167 D
1605 3163 D
1607 3161 D
1611 3160 D
1613 3160 D
1616 3161 D
1619 3163 D
S
N
1618 3169 M
1618 3172 D
1616 3175 D
S
N
1611 3176 M
1608 3175 D
1606 3172 D
1605 3169 D
1605 3167 D
1606 3163 D
1608 3161 D
1611 3160 D
S
N
1628 3176 M
1628 3160 D
S
N
1629 3176 M
1629 3160 D
S
N
1629 3169 M
1630 3172 D
1633 3175 D
1635 3176 D
1638 3176 D
1639 3175 D
1639 3173 D
1638 3172 D
1637 3173 D
1638 3175 D
S
N
1624 3176 M
1629 3176 D
S
N
1624 3160 M
1633 3160 D
S
N
1653 3183 M
1652 3181 D
1653 3180 D
1654 3181 D
1654 3183 D
1653 3184 D
1651 3184 D
1649 3183 D
1648 3180 D
1648 3160 D
S
N
1651 3184 M
1650 3183 D
1649 3180 D
1649 3160 D
S
N
1644 3176 M
1653 3176 D
S
N
1644 3160 M
1652 3160 D
S
N
1661 3169 M
1675 3169 D
1675 3171 D
1674 3173 D
1673 3175 D
1671 3176 D
1667 3176 D
1664 3175 D
1661 3172 D
1660 3169 D
1660 3167 D
1661 3163 D
1664 3161 D
1667 3160 D
1669 3160 D
1673 3161 D
1675 3163 D
S
N
1674 3169 M
1674 3172 D
1673 3175 D
S
N
1667 3176 M
1665 3175 D
1663 3172 D
1661 3169 D
1661 3167 D
1663 3163 D
1665 3161 D
1667 3160 D
S
N
1684 3176 M
1684 3160 D
S
N
1686 3176 M
1686 3160 D
S
N
1686 3169 M
1687 3172 D
1689 3175 D
1691 3176 D
1695 3176 D
1696 3175 D
1696 3173 D
1695 3172 D
1694 3173 D
1695 3175 D
S
N
1681 3176 M
1686 3176 D
S
N
1681 3160 M
1689 3160 D
S
N
1703 3169 M
1717 3169 D
1717 3171 D
1716 3173 D
1714 3175 D
1712 3176 D
1709 3176 D
1705 3175 D
1703 3172 D
1702 3169 D
1702 3167 D
1703 3163 D
1705 3161 D
1709 3160 D
1711 3160 D
1714 3161 D
1717 3163 D
S
N
1716 3169 M
1716 3172 D
1714 3175 D
S
N
1709 3176 M
1706 3175 D
1704 3172 D
1703 3169 D
1703 3167 D
1704 3163 D
1706 3161 D
1709 3160 D
S
N
1726 3176 M
1726 3160 D
S
N
1727 3176 M
1727 3160 D
S
N
1727 3172 M
1729 3175 D
1733 3176 D
1735 3176 D
1739 3175 D
1740 3172 D
1740 3160 D
S
N
1735 3176 M
1738 3175 D
1739 3172 D
1739 3160 D
S
N
1723 3176 M
1727 3176 D
S
N
1723 3160 M
1731 3160 D
S
N
1735 3160 M
1743 3160 D
S
N
1763 3172 M
1762 3171 D
1763 3170 D
1764 3171 D
1764 3172 D
1762 3175 D
1759 3176 D
1756 3176 D
1752 3175 D
1750 3172 D
1749 3169 D
1749 3167 D
1750 3163 D
1752 3161 D
1756 3160 D
1758 3160 D
1762 3161 D
1764 3163 D
S
N
1756 3176 M
1754 3175 D
1751 3172 D
1750 3169 D
1750 3167 D
1751 3163 D
1754 3161 D
1756 3160 D
S
N
1772 3169 M
1786 3169 D
1786 3171 D
1785 3173 D
1784 3175 D
1781 3176 D
1778 3176 D
1774 3175 D
1772 3172 D
1771 3169 D
1771 3167 D
1772 3163 D
1774 3161 D
1778 3160 D
1780 3160 D
1784 3161 D
1786 3163 D
S
N
1785 3169 M
1785 3172 D
1784 3175 D
S
N
1778 3176 M
1776 3175 D
1773 3172 D
1772 3169 D
1772 3167 D
1773 3163 D
1776 3161 D
1778 3160 D
S
N
1500 3084 M
1500 3060 D
S
N
1501 3084 M
1501 3060 D
S
N
1500 3080 M
1498 3083 D
1495 3084 D
1493 3084 D
1490 3083 D
1487 3080 D
1486 3077 D
1486 3075 D
1487 3071 D
1490 3069 D
1493 3068 D
1495 3068 D
1498 3069 D
1500 3071 D
S
N
1493 3084 M
1491 3083 D
1488 3080 D
1487 3077 D
1487 3075 D
1488 3071 D
1491 3069 D
1493 3068 D
S
N
1496 3060 M
1505 3060 D
S
N
1515 3084 M
1513 3083 D
1511 3082 D
1510 3079 D
1510 3077 D
1511 3075 D
1513 3073 D
1515 3072 D
1517 3072 D
1520 3073 D
1521 3075 D
1522 3077 D
1522 3079 D
1521 3082 D
1520 3083 D
1517 3084 D
1515 3084 D
S
N
1513 3083 M
1511 3080 D
1511 3076 D
1513 3073 D
S
N
1520 3073 M
1521 3076 D
1521 3080 D
1520 3083 D
S
N
1521 3082 M
1522 3083 D
1524 3084 D
1524 3083 D
1522 3083 D
S
N
1511 3075 M
1510 3073 D
1509 3071 D
1509 3070 D
1510 3068 D
1514 3067 D
1520 3067 D
1523 3065 D
1524 3064 D
S
N
1509 3070 M
1510 3069 D
1514 3068 D
1520 3068 D
1523 3067 D
1524 3064 D
1524 3063 D
1523 3061 D
1520 3060 D
1513 3060 D
1509 3061 D
1508 3063 D
1508 3064 D
1509 3067 D
1513 3068 D
S
N
1552 3092 M
1551 3091 D
1552 3090 D
1553 3091 D
1552 3092 D
S
N
1552 3084 M
1552 3068 D
S
N
1553 3084 M
1553 3068 D
S
N
1548 3084 M
1553 3084 D
S
N
1548 3068 M
1556 3068 D
S
N
1565 3084 M
1565 3068 D
S
N
1566 3084 M
1566 3068 D
S
N
1566 3080 M
1568 3083 D
1571 3084 D
1574 3084 D
1577 3083 D
1578 3080 D
1578 3068 D
S
N
1574 3084 M
1576 3083 D
1577 3080 D
1577 3068 D
S
N
1561 3084 M
1566 3084 D
S
N
1561 3068 M
1569 3068 D
S
N
1574 3068 M
1582 3068 D
S
N
1590 3092 M
1590 3072 D
1591 3069 D
1593 3068 D
1596 3068 D
1598 3069 D
1599 3071 D
S
N
1591 3092 M
1591 3072 D
1592 3069 D
1593 3068 D
S
N
1586 3084 M
1596 3084 D
S
N
1606 3077 M
1620 3077 D
1620 3079 D
1619 3082 D
1618 3083 D
1615 3084 D
1612 3084 D
1608 3083 D
1606 3080 D
1605 3077 D
1605 3075 D
1606 3071 D
1608 3069 D
1612 3068 D
1614 3068 D
1618 3069 D
1620 3071 D
S
N
1619 3077 M
1619 3080 D
1618 3083 D
S
N
1612 3084 M
1609 3083 D
1607 3080 D
1606 3077 D
1606 3075 D
1607 3071 D
1609 3069 D
1612 3068 D
S
N
1629 3084 M
1629 3068 D
S
N
1630 3084 M
1630 3068 D
S
N
1630 3077 M
1631 3080 D
1634 3083 D
1636 3084 D
1639 3084 D
1641 3083 D
1641 3082 D
1639 3080 D
1638 3082 D
1639 3083 D
S
N
1626 3084 M
1630 3084 D
S
N
1626 3068 M
1634 3068 D
S
N
1654 3091 M
1653 3090 D
1654 3088 D
1656 3090 D
1656 3091 D
1654 3092 D
1652 3092 D
1650 3091 D
1649 3088 D
1649 3068 D
S
N
1652 3092 M
1651 3091 D
1650 3088 D
1650 3068 D
S
N
1645 3084 M
1654 3084 D
S
N
1645 3068 M
1653 3068 D
S
N
1663 3077 M
1676 3077 D
1676 3079 D
1675 3082 D
1674 3083 D
1672 3084 D
1668 3084 D
1665 3083 D
1663 3080 D
1661 3077 D
1661 3075 D
1663 3071 D
1665 3069 D
1668 3068 D
1671 3068 D
1674 3069 D
1676 3071 D
S
N
1675 3077 M
1675 3080 D
1674 3083 D
S
N
1668 3084 M
1666 3083 D
1664 3080 D
1663 3077 D
1663 3075 D
1664 3071 D
1666 3069 D
1668 3068 D
S
N
1686 3084 M
1686 3068 D
S
N
1687 3084 M
1687 3068 D
S
N
1687 3077 M
1688 3080 D
1690 3083 D
1693 3084 D
1696 3084 D
1697 3083 D
1697 3082 D
1696 3080 D
1695 3082 D
1696 3083 D
S
N
1682 3084 M
1687 3084 D
S
N
1682 3068 M
1690 3068 D
S
N
1704 3077 M
1718 3077 D
1718 3079 D
1717 3082 D
1716 3083 D
1713 3084 D
1710 3084 D
1706 3083 D
1704 3080 D
1703 3077 D
1703 3075 D
1704 3071 D
1706 3069 D
1710 3068 D
1712 3068 D
1716 3069 D
1718 3071 D
S
N
1717 3077 M
1717 3080 D
1716 3083 D
S
N
1710 3084 M
1708 3083 D
1705 3080 D
1704 3077 D
1704 3075 D
1705 3071 D
1708 3069 D
1710 3068 D
S
N
1727 3084 M
1727 3068 D
S
N
1728 3084 M
1728 3068 D
S
N
1728 3080 M
1731 3083 D
1734 3084 D
1736 3084 D
1740 3083 D
1741 3080 D
1741 3068 D
S
N
1736 3084 M
1739 3083 D
1740 3080 D
1740 3068 D
S
N
1724 3084 M
1728 3084 D
S
N
1724 3068 M
1732 3068 D
S
N
1736 3068 M
1744 3068 D
S
N
1764 3080 M
1763 3079 D
1764 3078 D
1765 3079 D
1765 3080 D
1763 3083 D
1761 3084 D
1757 3084 D
1754 3083 D
1751 3080 D
1750 3077 D
1750 3075 D
1751 3071 D
1754 3069 D
1757 3068 D
1759 3068 D
1763 3069 D
1765 3071 D
S
N
1757 3084 M
1755 3083 D
1752 3080 D
1751 3077 D
1751 3075 D
1752 3071 D
1755 3069 D
1757 3068 D
S
N
1773 3077 M
1787 3077 D
1787 3079 D
1786 3082 D
1785 3083 D
1782 3084 D
1779 3084 D
1776 3083 D
1773 3080 D
1772 3077 D
1772 3075 D
1773 3071 D
1776 3069 D
1779 3068 D
1781 3068 D
1785 3069 D
1787 3071 D
S
N
1786 3077 M
1786 3080 D
1785 3083 D
S
N
1779 3084 M
1777 3083 D
1774 3080 D
1773 3077 D
1773 3075 D
1774 3071 D
1777 3069 D
1779 3068 D
S
N
1500 2992 M
1500 2968 D
S
N
1501 2992 M
1501 2968 D
S
N
1500 2988 M
1498 2991 D
1495 2992 D
1493 2992 D
1490 2991 D
1487 2988 D
1486 2985 D
1486 2983 D
1487 2979 D
1490 2977 D
1493 2976 D
1495 2976 D
1498 2977 D
1500 2979 D
S
N
1493 2992 M
1491 2991 D
1488 2988 D
1487 2985 D
1487 2983 D
1488 2979 D
1491 2977 D
1493 2976 D
S
N
1496 2968 M
1505 2968 D
S
N
1523 2992 M
1523 2968 D
S
N
1524 2992 M
1524 2968 D
S
N
1523 2988 M
1521 2991 D
1518 2992 D
1516 2992 D
1513 2991 D
1510 2988 D
1509 2985 D
1509 2983 D
1510 2979 D
1513 2977 D
1516 2976 D
1518 2976 D
1521 2977 D
1523 2979 D
S
N
1516 2992 M
1514 2991 D
1511 2988 D
1510 2985 D
1510 2983 D
1511 2979 D
1514 2977 D
1516 2976 D
S
N
1520 2968 M
1528 2968 D
S
N
1553 3000 M
1552 2999 D
1553 2998 D
1554 2999 D
1553 3000 D
S
N
1553 2992 M
1553 2976 D
S
N
1554 2992 M
1554 2976 D
S
N
1550 2992 M
1554 2992 D
S
N
1550 2976 M
1558 2976 D
S
N
1566 2992 M
1566 2976 D
S
N
1567 2992 M
1567 2976 D
S
N
1567 2988 M
1569 2991 D
1573 2992 D
1575 2992 D
1578 2991 D
1579 2988 D
1579 2976 D
S
N
1575 2992 M
1577 2991 D
1578 2988 D
1578 2976 D
S
N
1562 2992 M
1567 2992 D
S
N
1562 2976 M
1570 2976 D
S
N
1575 2976 M
1583 2976 D
S
N
1591 3000 M
1591 2980 D
1592 2977 D
1594 2976 D
1597 2976 D
1599 2977 D
1600 2979 D
S
N
1592 3000 M
1592 2980 D
1593 2977 D
1594 2976 D
S
N
1588 2992 M
1597 2992 D
S
N
1607 2985 M
1621 2985 D
1621 2987 D
1620 2990 D
1619 2991 D
1616 2992 D
1613 2992 D
1609 2991 D
1607 2988 D
1606 2985 D
1606 2983 D
1607 2979 D
1609 2977 D
1613 2976 D
1615 2976 D
1619 2977 D
1621 2979 D
S
N
1620 2985 M
1620 2988 D
1619 2991 D
S
N
1613 2992 M
1611 2991 D
1608 2988 D
1607 2985 D
1607 2983 D
1608 2979 D
1611 2977 D
1613 2976 D
S
N
1630 2992 M
1630 2976 D
S
N
1631 2992 M
1631 2976 D
S
N
1631 2985 M
1633 2988 D
1635 2991 D
1637 2992 D
1641 2992 D
1642 2991 D
1642 2990 D
1641 2988 D
1639 2990 D
1641 2991 D
S
N
1627 2992 M
1631 2992 D
S
N
1627 2976 M
1635 2976 D
S
N
1656 2999 M
1654 2998 D
1656 2997 D
1657 2998 D
1657 2999 D
1656 3000 D
1653 3000 D
1651 2999 D
1650 2997 D
1650 2976 D
S
N
1653 3000 M
1652 2999 D
1651 2997 D
1651 2976 D
S
N
1646 2992 M
1656 2992 D
S
N
1646 2976 M
1654 2976 D
S
N
1664 2985 M
1678 2985 D
1678 2987 D
1676 2990 D
1675 2991 D
1673 2992 D
1669 2992 D
1666 2991 D
1664 2988 D
1663 2985 D
1663 2983 D
1664 2979 D
1666 2977 D
1669 2976 D
1672 2976 D
1675 2977 D
1678 2979 D
S
N
1676 2985 M
1676 2988 D
1675 2991 D
S
N
1669 2992 M
1667 2991 D
1665 2988 D
1664 2985 D
1664 2983 D
1665 2979 D
1667 2977 D
1669 2976 D
S
N
1687 2992 M
1687 2976 D
S
N
1688 2992 M
1688 2976 D
S
N
1688 2985 M
1689 2988 D
1691 2991 D
1694 2992 D
1697 2992 D
1698 2991 D
1698 2990 D
1697 2988 D
1696 2990 D
1697 2991 D
S
N
1683 2992 M
1688 2992 D
S
N
1683 2976 M
1691 2976 D
S
N
1705 2985 M
1719 2985 D
1719 2987 D
1718 2990 D
1717 2991 D
1714 2992 D
1711 2992 D
1708 2991 D
1705 2988 D
1704 2985 D
1704 2983 D
1705 2979 D
1708 2977 D
1711 2976 D
1713 2976 D
1717 2977 D
1719 2979 D
S
N
1718 2985 M
1718 2988 D
1717 2991 D
S
N
1711 2992 M
1709 2991 D
1706 2988 D
1705 2985 D
1705 2983 D
1706 2979 D
1709 2977 D
1711 2976 D
S
N
1728 2992 M
1728 2976 D
S
N
1729 2992 M
1729 2976 D
S
N
1729 2988 M
1732 2991 D
1735 2992 D
1738 2992 D
1741 2991 D
1742 2988 D
1742 2976 D
S
N
1738 2992 M
1740 2991 D
1741 2988 D
1741 2976 D
S
N
1725 2992 M
1729 2992 D
S
N
1725 2976 M
1733 2976 D
S
N
1738 2976 M
1746 2976 D
S
N
1765 2988 M
1764 2987 D
1765 2986 D
1766 2987 D
1766 2988 D
1764 2991 D
1762 2992 D
1758 2992 D
1755 2991 D
1752 2988 D
1751 2985 D
1751 2983 D
1752 2979 D
1755 2977 D
1758 2976 D
1761 2976 D
1764 2977 D
1766 2979 D
S
N
1758 2992 M
1756 2991 D
1754 2988 D
1752 2985 D
1752 2983 D
1754 2979 D
1756 2977 D
1758 2976 D
S
N
1774 2985 M
1788 2985 D
1788 2987 D
1787 2990 D
1786 2991 D
1784 2992 D
1780 2992 D
1777 2991 D
1774 2988 D
1773 2985 D
1773 2983 D
1774 2979 D
1777 2977 D
1780 2976 D
1782 2976 D
1786 2977 D
1788 2979 D
S
N
1787 2985 M
1787 2988 D
1786 2991 D
S
N
1780 2992 M
1778 2991 D
1776 2988 D
1774 2985 D
1774 2983 D
1776 2979 D
1778 2977 D
1780 2976 D
S
4 Sw
N
820 3219 M
820 2117 D
S
N
820 2117 M
1815 2117 D
S
N
1815 2117 M
1815 3219 D
S
N
1815 3219 M
820 3219 D
S
N
825 2710 M
835 2711 D
845 2712 D
855 2713 D
865 2714 D
875 2715 D
885 2716 D
895 2717 D
905 2718 D
915 2719 D
925 2721 D
934 2722 D
944 2724 D
954 2725 D
964 2727 D
974 2728 D
984 2730 D
994 2732 D
1004 2734 D
1014 2736 D
1024 2738 D
1034 2741 D
1044 2743 D
1054 2746 D
1064 2749 D
1074 2753 D
1084 2756 D
1094 2760 D
1104 2764 D
1114 2769 D
1123 2774 D
1133 2780 D
1143 2786 D
1153 2794 D
1163 2802 D
1173 2811 D
1183 2822 D
1193 2833 D
1203 2845 D
1213 2860 D
1223 2878 D
1233 2900 D
1243 2927 D
1253 2960 D
1263 3001 D
1273 3051 D
1283 3108 D
1293 3158 D
1303 3133 D
1312 2889 D
1322 2459 D
1332 2212 D
1342 2184 D
1352 2231 D
1362 2287 D
1372 2337 D
1382 2377 D
1392 2410 D
1402 2437 D
1412 2458 D
1422 2477 D
1432 2492 D
1442 2504 D
1452 2517 D
1462 2527 D
1472 2536 D
1482 2543 D
1491 2550 D
1501 2557 D
1511 2562 D
1521 2567 D
1531 2572 D
1541 2576 D
1551 2580 D
1561 2583 D
1571 2586 D
1581 2590 D
1591 2593 D
1601 2595 D
1611 2598 D
1621 2600 D
1631 2602 D
1641 2604 D
1651 2606 D
1661 2608 D
1670 2609 D
1680 2611 D
1690 2612 D
1700 2614 D
1710 2615 D
1720 2617 D
1730 2618 D
1740 2619 D
1750 2620 D
1760 2621 D
1770 2622 D
1780 2623 D
1790 2624 D
1800 2625 D
1810 2626 D
S
N
840 2117 M
840 2125 D
S
N
880 2125 M
880 2117 D
S
N
920 2117 M
920 2142 D
S
N
959 2125 M
959 2117 D
S
N
999 2117 M
999 2125 D
S
N
1039 2125 M
1039 2117 D
S
N
1079 2117 M
1079 2125 D
S
N
1119 2142 M
1119 2117 D
S
N
1158 2117 M
1158 2125 D
S
N
1198 2125 M
1198 2117 D
S
N
1238 2117 M
1238 2125 D
S
N
1278 2125 M
1278 2117 D
S
N
1317 2117 M
1317 2142 D
S
N
1357 2125 M
1357 2117 D
S
N
1397 2117 M
1397 2125 D
S
N
1437 2125 M
1437 2117 D
S
N
1477 2117 M
1477 2125 D
S
N
1516 2142 M
1516 2117 D
S
N
1556 2117 M
1556 2125 D
S
N
1596 2125 M
1596 2117 D
S
N
1636 2117 M
1636 2125 D
S
N
1676 2125 M
1676 2117 D
S
N
1715 2117 M
1715 2142 D
S
N
1755 2125 M
1755 2117 D
S
N
1795 2117 M
1795 2125 D
S
N
849 2082 M
852 2084 D
856 2088 D
856 2058 D
S
N
855 2087 M
855 2058 D
S
N
849 2058 M
862 2058 D
S
N
875 2082 M
876 2081 D
875 2079 D
873 2081 D
873 2082 D
875 2085 D
876 2087 D
881 2088 D
886 2088 D
891 2087 D
892 2085 D
894 2082 D
894 2079 D
892 2076 D
888 2074 D
881 2071 D
878 2069 D
875 2066 D
873 2062 D
873 2058 D
S
N
886 2088 M
889 2087 D
891 2085 D
892 2082 D
892 2079 D
891 2076 D
886 2074 D
881 2071 D
S
N
873 2061 M
875 2062 D
878 2062 D
885 2059 D
889 2059 D
892 2061 D
894 2062 D
S
N
878 2062 M
885 2058 D
891 2058 D
892 2059 D
894 2062 D
894 2065 D
S
N
915 2085 M
915 2058 D
S
N
917 2088 M
917 2058 D
S
N
917 2088 M
901 2066 D
924 2066 D
S
N
911 2058 M
921 2058 D
S
N
934 2061 M
932 2059 D
934 2058 D
935 2059 D
934 2061 D
S
N
964 2078 M
963 2074 D
960 2071 D
956 2069 D
954 2069 D
950 2071 D
947 2074 D
945 2078 D
945 2079 D
947 2084 D
950 2087 D
954 2088 D
957 2088 D
961 2087 D
964 2084 D
966 2079 D
966 2071 D
964 2065 D
963 2062 D
960 2059 D
956 2058 D
951 2058 D
948 2059 D
947 2062 D
947 2063 D
948 2065 D
950 2063 D
948 2062 D
S
N
954 2069 M
951 2071 D
948 2074 D
947 2078 D
947 2079 D
948 2084 D
951 2087 D
954 2088 D
S
N
957 2088 M
960 2087 D
963 2084 D
964 2079 D
964 2071 D
963 2065 D
961 2062 D
958 2059 D
956 2058 D
S
N
992 2084 M
990 2082 D
992 2081 D
993 2082 D
993 2084 D
992 2087 D
989 2088 D
984 2088 D
980 2087 D
977 2084 D
976 2081 D
974 2075 D
974 2066 D
976 2062 D
979 2059 D
983 2058 D
986 2058 D
990 2059 D
993 2062 D
994 2066 D
994 2068 D
993 2072 D
990 2075 D
986 2076 D
984 2076 D
980 2075 D
977 2072 D
976 2068 D
S
N
984 2088 M
982 2087 D
979 2084 D
977 2081 D
976 2075 D
976 2066 D
977 2062 D
980 2059 D
983 2058 D
S
N
986 2058 M
989 2059 D
992 2062 D
993 2066 D
993 2068 D
992 2072 D
989 2075 D
986 2076 D
S
N
1048 2082 M
1051 2084 D
1055 2088 D
1055 2058 D
S
N
1054 2087 M
1054 2058 D
S
N
1048 2058 M
1061 2058 D
S
N
1074 2082 M
1075 2081 D
1074 2079 D
1072 2081 D
1072 2082 D
1074 2085 D
1075 2087 D
1080 2088 D
1085 2088 D
1090 2087 D
1091 2085 D
1093 2082 D
1093 2079 D
1091 2076 D
1087 2074 D
1080 2071 D
1077 2069 D
1074 2066 D
1072 2062 D
1072 2058 D
S
N
1085 2088 M
1088 2087 D
1090 2085 D
1091 2082 D
1091 2079 D
1090 2076 D
1085 2074 D
1080 2071 D
S
N
1072 2061 M
1074 2062 D
1077 2062 D
1084 2059 D
1088 2059 D
1091 2061 D
1093 2062 D
S
N
1077 2062 M
1084 2058 D
1090 2058 D
1091 2059 D
1093 2062 D
1093 2065 D
S
N
1114 2085 M
1114 2058 D
S
N
1116 2088 M
1116 2058 D
S
N
1116 2088 M
1100 2066 D
1123 2066 D
S
N
1110 2058 M
1120 2058 D
S
N
1133 2061 M
1132 2059 D
1133 2058 D
1134 2059 D
1133 2061 D
S
N
1163 2078 M
1162 2074 D
1159 2071 D
1155 2069 D
1153 2069 D
1149 2071 D
1146 2074 D
1144 2078 D
1144 2079 D
1146 2084 D
1149 2087 D
1153 2088 D
1156 2088 D
1160 2087 D
1163 2084 D
1165 2079 D
1165 2071 D
1163 2065 D
1162 2062 D
1159 2059 D
1155 2058 D
1150 2058 D
1147 2059 D
1146 2062 D
1146 2063 D
1147 2065 D
1149 2063 D
1147 2062 D
S
N
1153 2069 M
1150 2071 D
1147 2074 D
1146 2078 D
1146 2079 D
1147 2084 D
1150 2087 D
1153 2088 D
S
N
1156 2088 M
1159 2087 D
1162 2084 D
1163 2079 D
1163 2071 D
1162 2065 D
1160 2062 D
1157 2059 D
1155 2058 D
S
N
1181 2088 M
1176 2087 D
1175 2084 D
1175 2079 D
1176 2076 D
1181 2075 D
1186 2075 D
1191 2076 D
1192 2079 D
1192 2084 D
1191 2087 D
1186 2088 D
1181 2088 D
S
N
1181 2088 M
1178 2087 D
1176 2084 D
1176 2079 D
1178 2076 D
1181 2075 D
S
N
1186 2075 M
1189 2076 D
1191 2079 D
1191 2084 D
1189 2087 D
1186 2088 D
S
N
1181 2075 M
1176 2074 D
1175 2072 D
1173 2069 D
1173 2063 D
1175 2061 D
1176 2059 D
1181 2058 D
1186 2058 D
1191 2059 D
1192 2061 D
1193 2063 D
1193 2069 D
1192 2072 D
1191 2074 D
1186 2075 D
S
N
1181 2075 M
1178 2074 D
1176 2072 D
1175 2069 D
1175 2063 D
1176 2061 D
1178 2059 D
1181 2058 D
S
N
1186 2058 M
1189 2059 D
1191 2061 D
1192 2063 D
1192 2069 D
1191 2072 D
1189 2074 D
1186 2075 D
S
N
1247 2082 M
1250 2084 D
1254 2088 D
1254 2058 D
S
N
1253 2087 M
1253 2058 D
S
N
1247 2058 M
1260 2058 D
S
N
1273 2082 M
1274 2081 D
1273 2079 D
1271 2081 D
1271 2082 D
1273 2085 D
1274 2087 D
1279 2088 D
1284 2088 D
1289 2087 D
1290 2085 D
1292 2082 D
1292 2079 D
1290 2076 D
1286 2074 D
1279 2071 D
1276 2069 D
1273 2066 D
1271 2062 D
1271 2058 D
S
N
1284 2088 M
1287 2087 D
1289 2085 D
1290 2082 D
1290 2079 D
1289 2076 D
1284 2074 D
1279 2071 D
S
N
1271 2061 M
1273 2062 D
1276 2062 D
1283 2059 D
1287 2059 D
1290 2061 D
1292 2062 D
S
N
1276 2062 M
1283 2058 D
1289 2058 D
1290 2059 D
1292 2062 D
1292 2065 D
S
N
1303 2088 M
1300 2074 D
S
N
1300 2074 M
1303 2076 D
1307 2078 D
1312 2078 D
1316 2076 D
1319 2074 D
1320 2069 D
1320 2066 D
1319 2062 D
1316 2059 D
1312 2058 D
1307 2058 D
1303 2059 D
1302 2061 D
1300 2063 D
1300 2065 D
1302 2066 D
1303 2065 D
1302 2063 D
S
N
1312 2078 M
1315 2076 D
1317 2074 D
1319 2069 D
1319 2066 D
1317 2062 D
1315 2059 D
1312 2058 D
S
N
1303 2088 M
1317 2088 D
S
N
1303 2087 M
1310 2087 D
1317 2088 D
S
N
1332 2061 M
1330 2059 D
1332 2058 D
1333 2059 D
1332 2061 D
S
N
1352 2088 M
1348 2087 D
1345 2082 D
1343 2075 D
1343 2071 D
1345 2063 D
1348 2059 D
1352 2058 D
1355 2058 D
1359 2059 D
1362 2063 D
1364 2071 D
1364 2075 D
1362 2082 D
1359 2087 D
1355 2088 D
1352 2088 D
S
N
1352 2088 M
1349 2087 D
1348 2085 D
1346 2082 D
1345 2075 D
1345 2071 D
1346 2063 D
1348 2061 D
1349 2059 D
1352 2058 D
S
N
1355 2058 M
1358 2059 D
1359 2061 D
1361 2063 D
1362 2071 D
1362 2075 D
1361 2082 D
1359 2085 D
1358 2087 D
1355 2088 D
S
N
1381 2088 M
1377 2087 D
1374 2082 D
1372 2075 D
1372 2071 D
1374 2063 D
1377 2059 D
1381 2058 D
1384 2058 D
1388 2059 D
1391 2063 D
1392 2071 D
1392 2075 D
1391 2082 D
1388 2087 D
1384 2088 D
1381 2088 D
S
N
1381 2088 M
1378 2087 D
1377 2085 D
1375 2082 D
1374 2075 D
1374 2071 D
1375 2063 D
1377 2061 D
1378 2059 D
1381 2058 D
S
N
1384 2058 M
1387 2059 D
1388 2061 D
1390 2063 D
1391 2071 D
1391 2075 D
1390 2082 D
1388 2085 D
1387 2087 D
1384 2088 D
S
N
1446 2082 M
1449 2084 D
1453 2088 D
1453 2058 D
S
N
1451 2087 M
1451 2058 D
S
N
1446 2058 M
1459 2058 D
S
N
1472 2082 M
1473 2081 D
1472 2079 D
1470 2081 D
1470 2082 D
1472 2085 D
1473 2087 D
1477 2088 D
1483 2088 D
1487 2087 D
1489 2085 D
1490 2082 D
1490 2079 D
1489 2076 D
1485 2074 D
1477 2071 D
1474 2069 D
1472 2066 D
1470 2062 D
1470 2058 D
S
N
1483 2088 M
1486 2087 D
1487 2085 D
1489 2082 D
1489 2079 D
1487 2076 D
1483 2074 D
1477 2071 D
S
N
1470 2061 M
1472 2062 D
1474 2062 D
1482 2059 D
1486 2059 D
1489 2061 D
1490 2062 D
S
N
1474 2062 M
1482 2058 D
1487 2058 D
1489 2059 D
1490 2062 D
1490 2065 D
S
N
1502 2088 M
1499 2074 D
S
N
1499 2074 M
1502 2076 D
1506 2078 D
1511 2078 D
1515 2076 D
1518 2074 D
1519 2069 D
1519 2066 D
1518 2062 D
1515 2059 D
1511 2058 D
1506 2058 D
1502 2059 D
1500 2061 D
1499 2063 D
1499 2065 D
1500 2066 D
1502 2065 D
1500 2063 D
S
N
1511 2078 M
1513 2076 D
1516 2074 D
1518 2069 D
1518 2066 D
1516 2062 D
1513 2059 D
1511 2058 D
S
N
1502 2088 M
1516 2088 D
S
N
1502 2087 M
1509 2087 D
1516 2088 D
S
N
1531 2061 M
1529 2059 D
1531 2058 D
1532 2059 D
1531 2061 D
S
N
1551 2088 M
1547 2087 D
1544 2082 D
1542 2075 D
1542 2071 D
1544 2063 D
1547 2059 D
1551 2058 D
1554 2058 D
1558 2059 D
1561 2063 D
1562 2071 D
1562 2075 D
1561 2082 D
1558 2087 D
1554 2088 D
1551 2088 D
S
N
1551 2088 M
1548 2087 D
1547 2085 D
1545 2082 D
1544 2075 D
1544 2071 D
1545 2063 D
1547 2061 D
1548 2059 D
1551 2058 D
S
N
1554 2058 M
1557 2059 D
1558 2061 D
1560 2063 D
1561 2071 D
1561 2075 D
1560 2082 D
1558 2085 D
1557 2087 D
1554 2088 D
S
N
1573 2082 M
1574 2081 D
1573 2079 D
1571 2081 D
1571 2082 D
1573 2085 D
1574 2087 D
1578 2088 D
1584 2088 D
1588 2087 D
1590 2085 D
1591 2082 D
1591 2079 D
1590 2076 D
1586 2074 D
1578 2071 D
1575 2069 D
1573 2066 D
1571 2062 D
1571 2058 D
S
N
1584 2088 M
1587 2087 D
1588 2085 D
1590 2082 D
1590 2079 D
1588 2076 D
1584 2074 D
1578 2071 D
S
N
1571 2061 M
1573 2062 D
1575 2062 D
1583 2059 D
1587 2059 D
1590 2061 D
1591 2062 D
S
N
1575 2062 M
1583 2058 D
1588 2058 D
1590 2059 D
1591 2062 D
1591 2065 D
S
N
1645 2082 M
1648 2084 D
1652 2088 D
1652 2058 D
S
N
1650 2087 M
1650 2058 D
S
N
1645 2058 M
1658 2058 D
S
N
1671 2082 M
1672 2081 D
1671 2079 D
1669 2081 D
1669 2082 D
1671 2085 D
1672 2087 D
1676 2088 D
1682 2088 D
1686 2087 D
1688 2085 D
1689 2082 D
1689 2079 D
1688 2076 D
1684 2074 D
1676 2071 D
1674 2069 D
1671 2066 D
1669 2062 D
1669 2058 D
S
N
1682 2088 M
1685 2087 D
1686 2085 D
1688 2082 D
1688 2079 D
1686 2076 D
1682 2074 D
1676 2071 D
S
N
1669 2061 M
1671 2062 D
1674 2062 D
1681 2059 D
1685 2059 D
1688 2061 D
1689 2062 D
S
N
1674 2062 M
1681 2058 D
1686 2058 D
1688 2059 D
1689 2062 D
1689 2065 D
S
N
1701 2088 M
1698 2074 D
S
N
1698 2074 M
1701 2076 D
1705 2078 D
1710 2078 D
1714 2076 D
1717 2074 D
1718 2069 D
1718 2066 D
1717 2062 D
1714 2059 D
1710 2058 D
1705 2058 D
1701 2059 D
1699 2061 D
1698 2063 D
1698 2065 D
1699 2066 D
1701 2065 D
1699 2063 D
S
N
1710 2078 M
1712 2076 D
1715 2074 D
1717 2069 D
1717 2066 D
1715 2062 D
1712 2059 D
1710 2058 D
S
N
1701 2088 M
1715 2088 D
S
N
1701 2087 M
1708 2087 D
1715 2088 D
S
N
1730 2061 M
1728 2059 D
1730 2058 D
1731 2059 D
1730 2061 D
S
N
1750 2088 M
1746 2087 D
1743 2082 D
1741 2075 D
1741 2071 D
1743 2063 D
1746 2059 D
1750 2058 D
1753 2058 D
1757 2059 D
1760 2063 D
1761 2071 D
1761 2075 D
1760 2082 D
1757 2087 D
1753 2088 D
1750 2088 D
S
N
1750 2088 M
1747 2087 D
1746 2085 D
1744 2082 D
1743 2075 D
1743 2071 D
1744 2063 D
1746 2061 D
1747 2059 D
1750 2058 D
S
N
1753 2058 M
1756 2059 D
1757 2061 D
1759 2063 D
1760 2071 D
1760 2075 D
1759 2082 D
1757 2085 D
1756 2087 D
1753 2088 D
S
N
1783 2085 M
1783 2058 D
S
N
1785 2088 M
1785 2058 D
S
N
1785 2088 M
1769 2066 D
1792 2066 D
S
N
1779 2058 M
1789 2058 D
S
N
820 2117 M
846 2117 D
S
N
829 2153 M
820 2153 D
S
N
820 2190 M
829 2190 D
S
N
829 2227 M
820 2227 D
S
N
820 2264 M
829 2264 D
S
N
846 2300 M
820 2300 D
S
N
820 2337 M
829 2337 D
S
N
829 2374 M
820 2374 D
S
N
820 2411 M
829 2411 D
S
N
829 2447 M
820 2447 D
S
N
820 2484 M
846 2484 D
S
N
829 2521 M
820 2521 D
S
N
820 2558 M
829 2558 D
S
N
829 2594 M
820 2594 D
S
N
820 2631 M
829 2631 D
S
N
846 2668 M
820 2668 D
S
N
820 2705 M
829 2705 D
S
N
829 2741 M
820 2741 D
S
N
820 2778 M
829 2778 D
S
N
829 2815 M
820 2815 D
S
N
820 2852 M
846 2852 D
S
N
829 2889 M
820 2889 D
S
N
820 2925 M
829 2925 D
S
N
829 2962 M
820 2962 D
S
N
820 2999 M
829 2999 D
S
N
846 3036 M
820 3036 D
S
N
820 3072 M
829 3072 D
S
N
829 3109 M
820 3109 D
S
N
820 3146 M
829 3146 D
S
N
829 3183 M
820 3183 D
S
N
820 3219 M
846 3219 D
S
N
713 2112 M
739 2112 D
S
N
767 2125 M
765 2124 D
767 2122 D
768 2124 D
768 2125 D
767 2128 D
764 2129 D
760 2129 D
755 2128 D
752 2125 D
751 2122 D
749 2117 D
749 2108 D
751 2104 D
754 2101 D
758 2099 D
761 2099 D
765 2101 D
768 2104 D
770 2108 D
770 2109 D
768 2114 D
765 2117 D
761 2118 D
760 2118 D
755 2117 D
752 2114 D
751 2109 D
S
N
760 2129 M
757 2128 D
754 2125 D
752 2122 D
751 2117 D
751 2108 D
752 2104 D
755 2101 D
758 2099 D
S
N
761 2099 M
764 2101 D
767 2104 D
768 2108 D
768 2109 D
767 2114 D
764 2117 D
761 2118 D
S
N
787 2129 M
783 2128 D
780 2124 D
778 2117 D
778 2112 D
780 2105 D
783 2101 D
787 2099 D
790 2099 D
794 2101 D
797 2105 D
798 2112 D
798 2117 D
797 2124 D
794 2128 D
790 2129 D
787 2129 D
S
N
787 2129 M
784 2128 D
783 2127 D
781 2124 D
780 2117 D
780 2112 D
781 2105 D
783 2102 D
784 2101 D
787 2099 D
S
N
790 2099 M
793 2101 D
794 2102 D
796 2105 D
797 2112 D
797 2117 D
796 2124 D
794 2127 D
793 2128 D
790 2129 D
S
N
713 2296 M
739 2296 D
S
N
762 2310 M
762 2283 D
S
N
764 2313 M
764 2283 D
S
N
764 2313 M
748 2292 D
771 2292 D
S
N
758 2283 M
768 2283 D
S
N
787 2313 M
783 2312 D
780 2308 D
778 2300 D
778 2296 D
780 2289 D
783 2284 D
787 2283 D
790 2283 D
794 2284 D
797 2289 D
798 2296 D
798 2300 D
797 2308 D
794 2312 D
790 2313 D
787 2313 D
S
N
787 2313 M
784 2312 D
783 2310 D
781 2308 D
780 2300 D
780 2296 D
781 2289 D
783 2286 D
784 2284 D
787 2283 D
S
N
790 2283 M
793 2284 D
794 2286 D
796 2289 D
797 2296 D
797 2300 D
796 2308 D
794 2310 D
793 2312 D
790 2313 D
S
N
713 2480 M
739 2480 D
S
N
751 2491 M
752 2490 D
751 2488 D
749 2490 D
749 2491 D
751 2494 D
752 2496 D
757 2497 D
762 2497 D
767 2496 D
768 2494 D
770 2491 D
770 2488 D
768 2486 D
764 2483 D
757 2480 D
754 2478 D
751 2475 D
749 2471 D
749 2467 D
S
N
762 2497 M
765 2496 D
767 2494 D
768 2491 D
768 2488 D
767 2486 D
762 2483 D
757 2480 D
S
N
749 2470 M
751 2471 D
754 2471 D
761 2468 D
765 2468 D
768 2470 D
770 2471 D
S
N
754 2471 M
761 2467 D
767 2467 D
768 2468 D
770 2471 D
770 2474 D
S
N
787 2497 M
783 2496 D
780 2491 D
778 2484 D
778 2480 D
780 2473 D
783 2468 D
787 2467 D
790 2467 D
794 2468 D
797 2473 D
798 2480 D
798 2484 D
797 2491 D
794 2496 D
790 2497 D
787 2497 D
S
N
787 2497 M
784 2496 D
783 2494 D
781 2491 D
780 2484 D
780 2480 D
781 2473 D
783 2470 D
784 2468 D
787 2467 D
S
N
790 2467 M
793 2468 D
794 2470 D
796 2473 D
797 2480 D
797 2484 D
796 2491 D
794 2494 D
793 2496 D
790 2497 D
S
N
787 2681 M
783 2679 D
780 2675 D
778 2668 D
778 2664 D
780 2656 D
783 2652 D
787 2651 D
790 2651 D
794 2652 D
797 2656 D
798 2664 D
798 2668 D
797 2675 D
794 2679 D
790 2681 D
787 2681 D
S
N
787 2681 M
784 2679 D
783 2678 D
781 2675 D
780 2668 D
780 2664 D
781 2656 D
783 2654 D
784 2652 D
787 2651 D
S
N
790 2651 M
793 2652 D
794 2654 D
796 2656 D
797 2664 D
797 2668 D
796 2675 D
794 2678 D
793 2679 D
790 2681 D
S
N
751 2859 M
752 2858 D
751 2856 D
749 2858 D
749 2859 D
751 2862 D
752 2863 D
757 2865 D
762 2865 D
767 2863 D
768 2862 D
770 2859 D
770 2856 D
768 2853 D
764 2850 D
757 2847 D
754 2846 D
751 2843 D
749 2839 D
749 2834 D
S
N
762 2865 M
765 2863 D
767 2862 D
768 2859 D
768 2856 D
767 2853 D
762 2850 D
757 2847 D
S
N
749 2837 M
751 2839 D
754 2839 D
761 2836 D
765 2836 D
768 2837 D
770 2839 D
S
N
754 2839 M
761 2834 D
767 2834 D
768 2836 D
770 2839 D
770 2842 D
S
N
787 2865 M
783 2863 D
780 2859 D
778 2852 D
778 2847 D
780 2840 D
783 2836 D
787 2834 D
790 2834 D
794 2836 D
797 2840 D
798 2847 D
798 2852 D
797 2859 D
794 2863 D
790 2865 D
787 2865 D
S
N
787 2865 M
784 2863 D
783 2862 D
781 2859 D
780 2852 D
780 2847 D
781 2840 D
783 2837 D
784 2836 D
787 2834 D
S
N
790 2834 M
793 2836 D
794 2837 D
796 2840 D
797 2847 D
797 2852 D
796 2859 D
794 2862 D
793 2863 D
790 2865 D
S
N
762 3046 M
762 3018 D
S
N
764 3049 M
764 3018 D
S
N
764 3049 M
748 3027 D
771 3027 D
S
N
758 3018 M
768 3018 D
S
N
787 3049 M
783 3047 D
780 3043 D
778 3036 D
778 3031 D
780 3024 D
783 3020 D
787 3018 D
790 3018 D
794 3020 D
797 3024 D
798 3031 D
798 3036 D
797 3043 D
794 3047 D
790 3049 D
787 3049 D
S
N
787 3049 M
784 3047 D
783 3046 D
781 3043 D
780 3036 D
780 3031 D
781 3024 D
783 3021 D
784 3020 D
787 3018 D
S
N
790 3018 M
793 3020 D
794 3021 D
796 3024 D
797 3031 D
797 3036 D
796 3043 D
794 3046 D
793 3047 D
790 3049 D
S
N
767 3228 M
765 3227 D
767 3225 D
768 3227 D
768 3228 D
767 3231 D
764 3232 D
760 3232 D
755 3231 D
752 3228 D
751 3225 D
749 3219 D
749 3211 D
751 3206 D
754 3204 D
758 3202 D
761 3202 D
765 3204 D
768 3206 D
770 3211 D
770 3212 D
768 3216 D
765 3219 D
761 3221 D
760 3221 D
755 3219 D
752 3216 D
751 3212 D
S
N
760 3232 M
757 3231 D
754 3228 D
752 3225 D
751 3219 D
751 3211 D
752 3206 D
755 3204 D
758 3202 D
S
N
761 3202 M
764 3204 D
767 3206 D
768 3211 D
768 3212 D
767 3216 D
764 3219 D
761 3221 D
S
N
787 3232 M
783 3231 D
780 3227 D
778 3219 D
778 3215 D
780 3208 D
783 3204 D
787 3202 D
790 3202 D
794 3204 D
797 3208 D
798 3215 D
798 3219 D
797 3227 D
794 3231 D
790 3232 D
787 3232 D
S
N
787 3232 M
784 3231 D
783 3229 D
781 3227 D
780 3219 D
780 3215 D
781 3208 D
783 3205 D
784 3204 D
787 3202 D
S
N
790 3202 M
793 3204 D
794 3205 D
796 3208 D
797 3215 D
797 3219 D
796 3227 D
794 3229 D
793 3231 D
790 3232 D
S
N
1789 2117 M
1815 2117 D
S
N
1815 2153 M
1806 2153 D
S
N
1806 2190 M
1815 2190 D
S
N
1815 2227 M
1806 2227 D
S
N
1806 2264 M
1815 2264 D
S
N
1815 2300 M
1789 2300 D
S
N
1806 2337 M
1815 2337 D
S
N
1815 2374 M
1806 2374 D
S
N
1806 2411 M
1815 2411 D
S
N
1815 2447 M
1806 2447 D
S
N
1789 2484 M
1815 2484 D
S
N
1815 2521 M
1806 2521 D
S
N
1806 2558 M
1815 2558 D
S
N
1815 2594 M
1806 2594 D
S
N
1806 2631 M
1815 2631 D
S
N
1815 2668 M
1789 2668 D
S
N
1806 2705 M
1815 2705 D
S
N
1815 2741 M
1806 2741 D
S
N
1806 2778 M
1815 2778 D
S
N
1815 2815 M
1806 2815 D
S
N
1789 2852 M
1815 2852 D
S
N
1815 2889 M
1806 2889 D
S
N
1806 2925 M
1815 2925 D
S
N
1815 2962 M
1806 2962 D
S
N
1806 2999 M
1815 2999 D
S
N
1815 3036 M
1789 3036 D
S
N
1806 3072 M
1815 3072 D
S
N
1815 3109 M
1806 3109 D
S
N
1806 3146 M
1815 3146 D
S
N
1815 3183 M
1806 3183 D
S
N
1789 3219 M
1815 3219 D
S
1.00 0.00 0.00 setrgbcolor
[4 30] 0 Sd
N
825 2667 M
835 2667 D
845 2667 D
855 2667 D
865 2667 D
875 2667 D
885 2667 D
895 2667 D
905 2667 D
915 2667 D
925 2667 D
934 2667 D
944 2667 D
954 2667 D
964 2667 D
974 2667 D
984 2667 D
994 2667 D
1004 2667 D
1014 2667 D
1024 2667 D
1034 2667 D
1044 2667 D
1054 2667 D
1064 2667 D
1074 2667 D
1084 2667 D
1094 2667 D
1104 2667 D
1114 2667 D
1123 2667 D
1133 2667 D
1143 2667 D
1153 2666 D
1163 2666 D
1173 2666 D
1183 2666 D
1193 2666 D
1203 2666 D
1213 2666 D
1223 2665 D
1233 2665 D
1243 2665 D
1253 2665 D
1263 2664 D
1273 2663 D
1283 2663 D
1293 2662 D
1303 2663 D
1312 2665 D
1322 2670 D
1332 2673 D
1342 2674 D
1352 2673 D
1362 2672 D
1372 2672 D
1382 2671 D
1392 2671 D
1402 2671 D
1412 2670 D
1422 2670 D
1432 2670 D
1442 2670 D
1452 2670 D
1462 2670 D
1472 2669 D
1482 2669 D
1491 2669 D
1501 2669 D
1511 2669 D
1521 2669 D
1531 2669 D
1541 2669 D
1551 2669 D
1561 2669 D
1571 2669 D
1581 2669 D
1591 2669 D
1601 2669 D
1611 2669 D
1621 2669 D
1631 2669 D
1641 2669 D
1651 2669 D
1661 2669 D
1670 2669 D
1680 2669 D
1690 2669 D
1700 2669 D
1710 2669 D
1720 2669 D
1730 2669 D
1740 2669 D
1750 2668 D
1760 2668 D
1770 2668 D
1780 2668 D
1790 2668 D
1800 2668 D
1810 2668 D
S
0.00 0.00 1.00 setrgbcolor
[39] 0 Sd
N
825 2654 M
835 2654 D
845 2653 D
855 2653 D
865 2653 D
875 2652 D
885 2652 D
895 2652 D
905 2651 D
915 2651 D
925 2650 D
934 2650 D
944 2649 D
954 2649 D
964 2648 D
974 2648 D
984 2647 D
994 2647 D
1004 2646 D
1014 2645 D
1024 2644 D
1034 2644 D
1044 2643 D
1054 2642 D
1064 2641 D
1074 2640 D
1084 2638 D
1094 2637 D
1104 2636 D
1114 2634 D
1123 2633 D
1133 2631 D
1143 2629 D
1153 2626 D
1163 2624 D
1173 2620 D
1183 2617 D
1193 2613 D
1203 2609 D
1213 2604 D
1223 2598 D
1233 2590 D
1243 2582 D
1253 2571 D
1263 2557 D
1273 2541 D
1283 2522 D
1293 2505 D
1303 2514 D
1312 2596 D
1322 2740 D
1332 2822 D
1342 2830 D
1352 2814 D
1362 2795 D
1372 2779 D
1382 2765 D
1392 2755 D
1402 2745 D
1412 2738 D
1422 2732 D
1432 2727 D
1442 2722 D
1452 2719 D
1462 2715 D
1472 2712 D
1482 2709 D
1491 2707 D
1501 2705 D
1511 2703 D
1521 2701 D
1531 2700 D
1541 2698 D
1551 2697 D
1561 2696 D
1571 2695 D
1581 2694 D
1591 2693 D
1601 2692 D
1611 2691 D
1621 2691 D
1631 2690 D
1641 2689 D
1651 2689 D
1661 2688 D
1670 2687 D
1680 2687 D
1690 2686 D
1700 2686 D
1710 2685 D
1720 2685 D
1730 2685 D
1740 2684 D
1750 2684 D
1760 2683 D
1770 2683 D
1780 2683 D
1790 2683 D
1800 2682 D
1810 2682 D
S
0.00 0.00 0.00 setrgbcolor
[] 0 Sd
N
1347 3173 M
1467 3173 D
S
0.00 0.00 1.00 setrgbcolor
[39] 0 Sd
N
1347 3082 M
1467 3082 D
S
1.00 0.00 0.00 setrgbcolor
[4 30] 0 Sd
N
1347 2990 M
1467 2990 D
S
2 Sw
0.00 0.00 0.00 setrgbcolor
[] 0 Sd
N
1511 2999 M
1526 2999 D
S
4 Sw
N
574 2674 M
614 2674 D
S
N
574 2675 M
614 2675 D
S
N
593 2674 M
589 2670 D
588 2666 D
588 2662 D
589 2657 D
593 2653 D
599 2651 D
603 2651 D
608 2653 D
612 2657 D
614 2662 D
614 2666 D
612 2670 D
608 2674 D
S
N
588 2662 M
589 2659 D
593 2655 D
599 2653 D
603 2653 D
608 2655 D
612 2659 D
614 2662 D
S
N
574 2668 M
574 2675 D
S
N
614 2674 M
614 2681 D
S
N
588 2720 M
588 2702 D
589 2696 D
595 2692 D
601 2690 D
606 2690 D
610 2692 D
612 2694 D
614 2698 D
614 2702 D
612 2707 D
606 2711 D
601 2713 D
595 2713 D
591 2711 D
589 2709 D
588 2705 D
S
N
588 2702 M
589 2698 D
595 2694 D
601 2692 D
608 2692 D
612 2694 D
S
N
614 2702 M
612 2705 D
606 2709 D
601 2711 D
593 2711 D
589 2709 D
S
N
589 2709 M
589 2720 D
S
N
567 2762 M
627 2728 D
S
N
574 2794 M
614 2794 D
S
N
574 2795 M
614 2795 D
S
N
593 2794 M
589 2790 D
588 2786 D
588 2782 D
589 2777 D
593 2773 D
599 2771 D
603 2771 D
608 2773 D
612 2777 D
614 2782 D
614 2786 D
612 2790 D
608 2794 D
S
N
588 2782 M
589 2779 D
593 2775 D
599 2773 D
603 2773 D
608 2775 D
612 2779 D
614 2782 D
S
N
574 2788 M
574 2795 D
S
N
614 2794 M
614 2801 D
S
N
574 2814 M
614 2814 D
S
N
574 2816 M
608 2827 D
S
N
574 2814 M
614 2827 D
S
N
574 2840 M
614 2827 D
S
N
574 2840 M
614 2840 D
S
N
574 2842 M
614 2842 D
S
N
574 2809 M
574 2816 D
S
N
574 2840 M
574 2848 D
S
N
614 2809 M
614 2820 D
S
N
614 2835 M
614 2848 D
S
N
615 2855 M
613 2858 D
611 2860 D
611 2863 D
613 2865 D
614 2867 D
618 2868 D
623 2868 D
628 2867 D
638 2863 D
S
N
614 2857 M
613 2859 D
613 2864 D
614 2867 D
S
N
611 2877 M
615 2875 D
618 2874 D
626 2868 D
633 2864 D
638 2862 D
S
N
611 2875 M
615 2874 D
618 2873 D
626 2868 D
S
N
615 2880 M
613 2883 D
611 2885 D
611 2888 D
613 2890 D
614 2892 D
618 2893 D
623 2893 D
628 2892 D
638 2888 D
S
N
614 2882 M
613 2884 D
613 2889 D
614 2892 D
S
N
611 2902 M
615 2900 D
618 2899 D
626 2893 D
633 2889 D
638 2887 D
S
N
611 2900 M
615 2899 D
618 2898 D
626 2893 D
S
N
567 2927 M
571 2923 D
576 2920 D
584 2916 D
593 2914 D
601 2914 D
610 2916 D
618 2920 D
623 2923 D
627 2927 D
S
N
571 2923 M
578 2920 D
584 2918 D
593 2916 D
601 2916 D
610 2918 D
616 2920 D
623 2923 D
S
N
576 2952 M
578 2950 D
580 2952 D
578 2953 D
576 2953 D
574 2952 D
574 2948 D
576 2944 D
580 2942 D
614 2942 D
S
N
574 2948 M
576 2946 D
580 2944 D
614 2944 D
S
N
588 2937 M
588 2952 D
S
N
614 2937 M
614 2950 D
S
N
574 2967 M
614 2967 D
S
N
574 2968 M
614 2968 D
S
N
593 2968 M
589 2972 D
588 2976 D
588 2980 D
589 2985 D
593 2989 D
599 2991 D
603 2991 D
608 2989 D
612 2985 D
614 2980 D
614 2976 D
612 2972 D
608 2968 D
S
N
588 2980 M
589 2983 D
593 2987 D
599 2989 D
603 2989 D
608 2987 D
612 2983 D
614 2980 D
S
N
574 2961 M
574 2968 D
S
N
567 3034 M
627 3000 D
S
N
580 3070 M
586 3072 D
574 3072 D
580 3070 D
576 3066 D
574 3060 D
574 3057 D
576 3051 D
580 3047 D
584 3045 D
589 3043 D
599 3043 D
604 3045 D
608 3047 D
612 3051 D
614 3057 D
614 3060 D
612 3066 D
608 3070 D
S
N
574 3057 M
576 3053 D
580 3049 D
584 3047 D
589 3045 D
599 3045 D
604 3047 D
608 3049 D
612 3053 D
614 3057 D
S
N
599 3070 M
614 3070 D
S
N
599 3072 M
614 3072 D
S
N
599 3064 M
599 3077 D
S
N
599 3088 M
599 3111 D
595 3111 D
591 3109 D
589 3107 D
588 3103 D
588 3098 D
589 3092 D
593 3088 D
599 3087 D
603 3087 D
608 3088 D
612 3092 D
614 3098 D
614 3101 D
612 3107 D
608 3111 D
S
N
599 3109 M
593 3109 D
589 3107 D
S
N
588 3098 M
589 3094 D
593 3090 D
599 3088 D
603 3088 D
608 3090 D
612 3094 D
614 3098 D
S
N
574 3122 M
614 3135 D
S
N
574 3124 M
608 3135 D
S
N
574 3148 M
614 3135 D
S
N
574 3118 M
574 3130 D
S
N
574 3141 M
574 3152 D
S
N
567 3160 M
571 3163 D
576 3167 D
584 3171 D
593 3173 D
601 3173 D
610 3171 D
618 3167 D
623 3163 D
627 3160 D
S
N
571 3163 M
578 3167 D
584 3169 D
593 3171 D
601 3171 D
610 3169 D
616 3167 D
623 3163 D
S
N
1503 1996 M
1503 1956 D
S
N
1505 1996 M
1516 1962 D
S
N
1503 1996 M
1516 1956 D
S
N
1529 1996 M
1516 1956 D
S
N
1529 1996 M
1529 1956 D
S
N
1531 1996 M
1531 1956 D
S
N
1498 1996 M
1505 1996 D
S
N
1529 1996 M
1537 1996 D
S
N
1498 1956 M
1509 1956 D
S
N
1524 1956 M
1537 1956 D
S
N
1544 1955 M
1547 1957 D
1549 1959 D
1552 1959 D
1554 1957 D
1556 1956 D
1557 1952 D
1557 1947 D
1556 1942 D
1552 1932 D
S
N
1546 1956 M
1548 1957 D
1553 1957 D
1556 1956 D
S
N
1566 1959 M
1564 1955 D
1563 1952 D
1557 1944 D
1553 1937 D
1551 1932 D
S
N
1564 1959 M
1563 1955 D
1562 1952 D
1557 1944 D
S
N
1569 1955 M
1572 1957 D
1574 1959 D
1577 1959 D
1579 1957 D
1581 1956 D
1582 1952 D
1582 1947 D
1581 1942 D
1577 1932 D
S
N
1571 1956 M
1573 1957 D
1578 1957 D
1581 1956 D
S
N
1591 1959 M
1589 1955 D
1588 1952 D
1582 1944 D
1578 1937 D
1576 1932 D
S
N
1589 1959 M
1588 1955 D
1587 1952 D
1582 1944 D
S
N
1646 2003 M
1643 1999 D
1639 1994 D
1635 1986 D
1633 1977 D
1633 1969 D
1635 1960 D
1639 1952 D
1643 1947 D
1646 1943 D
S
N
1643 1999 M
1639 1992 D
1637 1986 D
1635 1977 D
1635 1969 D
1637 1960 D
1639 1954 D
1643 1947 D
S
N
1684 1990 M
1686 1984 D
1686 1996 D
1684 1990 D
1680 1994 D
1674 1996 D
1671 1996 D
1665 1994 D
1661 1990 D
1659 1986 D
1657 1981 D
1657 1971 D
1659 1966 D
1661 1962 D
1665 1958 D
1671 1956 D
1674 1956 D
1680 1958 D
1684 1962 D
S
N
1671 1996 M
1667 1994 D
1663 1990 D
1661 1986 D
1659 1981 D
1659 1971 D
1661 1966 D
1663 1962 D
1667 1958 D
1671 1956 D
S
N
1684 1971 M
1684 1956 D
S
N
1686 1971 M
1686 1956 D
S
N
1678 1971 M
1691 1971 D
S
N
1702 1971 M
1725 1971 D
1725 1975 D
1723 1979 D
1721 1981 D
1717 1982 D
1712 1982 D
1706 1981 D
1702 1977 D
1701 1971 D
1701 1967 D
1702 1962 D
1706 1958 D
1712 1956 D
1716 1956 D
1721 1958 D
1725 1962 D
S
N
1723 1971 M
1723 1977 D
1721 1981 D
S
N
1712 1982 M
1708 1981 D
1704 1977 D
1702 1971 D
1702 1967 D
1704 1962 D
1708 1958 D
1712 1956 D
S
N
1736 1996 M
1749 1956 D
S
N
1738 1996 M
1749 1962 D
S
N
1762 1996 M
1749 1956 D
S
N
1732 1996 M
1744 1996 D
S
N
1755 1996 M
1766 1996 D
S
N
1774 2003 M
1777 1999 D
1781 1994 D
1785 1986 D
1787 1977 D
1787 1969 D
1785 1960 D
1781 1952 D
1777 1947 D
1774 1943 D
S
N
1777 1999 M
1781 1992 D
1783 1986 D
1785 1977 D
1785 1969 D
1783 1960 D
1781 1954 D
1777 1947 D
S
N
1854 2770 M
1878 2770 D
S
N
1854 2771 M
1878 2771 D
S
N
1854 2767 M
1854 2775 D
S
N
1878 2767 M
1878 2784 D
1871 2784 D
1878 2783 D
S
N
1854 2791 M
1878 2791 D
S
N
1854 2792 M
1878 2792 D
S
N
1854 2806 M
1878 2806 D
S
N
1854 2807 M
1878 2807 D
S
N
1854 2787 M
1854 2796 D
S
N
1854 2802 M
1854 2811 D
S
N
1866 2792 M
1866 2806 D
S
N
1878 2787 M
1878 2796 D
S
N
1878 2802 M
1878 2811 D
S
N
1858 2832 M
1861 2834 D
1854 2834 D
1858 2832 D
1855 2830 D
1854 2827 D
1854 2824 D
1855 2821 D
1858 2819 D
1860 2817 D
1863 2816 D
1869 2816 D
1873 2817 D
1875 2819 D
1877 2821 D
1878 2824 D
1878 2827 D
1877 2830 D
1875 2832 D
1873 2834 D
S
N
1854 2824 M
1855 2822 D
1858 2820 D
1860 2819 D
1863 2817 D
1869 2817 D
1873 2819 D
1875 2820 D
1877 2822 D
1878 2824 D
S
N
1854 2861 M
1878 2861 D
S
N
1854 2862 M
1878 2862 D
S
N
1854 2876 M
1878 2876 D
S
N
1854 2877 M
1878 2877 D
S
N
1854 2858 M
1854 2866 D
S
N
1854 2873 M
1854 2881 D
S
N
1866 2862 M
1866 2876 D
S
N
1878 2858 M
1878 2866 D
S
N
1878 2873 M
1878 2881 D
S
N
1854 2889 M
1878 2889 D
S
N
1854 2890 M
1878 2890 D
S
N
1854 2885 M
1854 2894 D
S
N
1878 2885 M
1878 2894 D
S
N
1858 2915 M
1861 2917 D
1854 2917 D
1858 2915 D
1855 2913 D
1854 2910 D
1854 2907 D
1855 2904 D
1858 2902 D
1860 2900 D
1863 2899 D
1869 2899 D
1873 2900 D
1875 2902 D
1877 2904 D
1878 2907 D
1878 2910 D
1877 2913 D
1875 2915 D
S
N
1854 2907 M
1855 2905 D
1858 2903 D
1860 2902 D
1863 2900 D
1869 2900 D
1873 2902 D
1875 2903 D
1877 2905 D
1878 2907 D
S
N
1869 2915 M
1878 2915 D
S
N
1869 2917 M
1878 2917 D
S
N
1869 2912 M
1869 2920 D
S
N
1858 2942 M
1861 2943 D
1854 2943 D
1858 2942 D
1855 2940 D
1854 2936 D
1854 2934 D
1855 2930 D
1858 2928 D
1860 2927 D
1863 2926 D
1869 2926 D
1873 2927 D
1875 2928 D
1877 2930 D
1878 2934 D
1878 2936 D
1877 2940 D
1875 2942 D
S
N
1854 2934 M
1855 2932 D
1858 2929 D
1860 2928 D
1863 2927 D
1869 2927 D
1873 2928 D
1875 2929 D
1877 2932 D
1878 2934 D
S
N
1869 2942 M
1878 2942 D
S
N
1869 2943 M
1878 2943 D
S
N
1869 2939 M
1869 2947 D
S
N
1858 2967 M
1854 2969 D
1861 2969 D
1858 2967 D
1855 2965 D
1854 2962 D
1854 2958 D
1855 2955 D
1858 2952 D
1860 2952 D
1862 2954 D
1863 2955 D
1865 2957 D
1867 2964 D
1868 2966 D
1870 2969 D
S
N
1860 2952 M
1862 2955 D
1863 2957 D
1866 2964 D
1867 2966 D
1868 2967 D
1870 2969 D
1875 2969 D
1877 2966 D
1878 2963 D
1878 2959 D
1877 2956 D
1875 2954 D
1871 2952 D
1878 2952 D
1875 2954 D
S
N
1854 2994 M
1878 3009 D
S
N
1854 2995 M
1878 3010 D
S
N
1854 3010 M
1878 2994 D
S
N
1854 2992 M
1854 2999 D
S
N
1854 3005 M
1854 3012 D
S
N
1878 2992 M
1878 2999 D
S
N
1878 3005 M
1878 3012 D
S
N
1858 3032 M
1854 3033 D
1861 3033 D
1858 3032 D
1855 3030 D
1854 3026 D
1854 3023 D
1855 3019 D
1858 3017 D
1860 3017 D
1862 3018 D
1863 3019 D
1865 3022 D
1867 3028 D
1868 3031 D
1870 3033 D
S
N
1860 3017 M
1862 3019 D
1863 3022 D
1866 3028 D
1867 3031 D
1868 3032 D
1870 3033 D
1875 3033 D
1877 3031 D
1878 3027 D
1878 3024 D
1877 3020 D
1875 3018 D
1871 3017 D
1878 3017 D
1875 3018 D
S
N
1854 3060 M
1878 3064 D
S
N
1854 3061 M
1873 3064 D
S
N
1854 3069 M
1878 3064 D
S
N
1854 3069 M
1878 3073 D
S
N
1854 3070 M
1873 3073 D
S
N
1854 3078 M
1878 3073 D
S
N
1854 3056 M
1854 3064 D
S
N
1854 3075 M
1854 3082 D
S
N
1858 3102 M
1861 3103 D
1854 3103 D
1858 3102 D
1855 3100 D
1854 3097 D
1854 3094 D
1855 3091 D
1858 3088 D
1860 3087 D
1863 3086 D
1869 3086 D
1873 3087 D
1875 3088 D
1877 3091 D
1878 3094 D
1878 3097 D
1877 3100 D
1875 3102 D
S
N
1854 3094 M
1855 3092 D
1858 3090 D
1860 3088 D
1863 3087 D
1869 3087 D
1873 3088 D
1875 3090 D
1877 3092 D
1878 3094 D
S
N
1869 3102 M
1878 3102 D
S
N
1869 3103 M
1878 3103 D
S
N
1869 3099 M
1869 3107 D
S
N
1859 3132 M
1860 3133 D
1861 3132 D
1860 3131 D
1859 3131 D
1856 3132 D
1855 3133 D
1854 3137 D
1854 3142 D
1855 3145 D
1856 3146 D
1859 3147 D
1861 3147 D
1863 3146 D
1866 3143 D
1868 3137 D
1869 3135 D
1871 3132 D
1875 3131 D
1878 3131 D
S
N
1854 3142 M
1855 3144 D
1856 3145 D
1859 3146 D
1861 3146 D
1863 3145 D
1866 3142 D
1868 3137 D
S
N
1876 3131 M
1875 3132 D
1875 3135 D
1877 3140 D
1877 3144 D
1876 3146 D
1875 3147 D
S
N
1875 3135 M
1878 3140 D
1878 3145 D
1877 3146 D
1875 3147 D
1873 3147 D
S
N
1854 3161 M
1855 3158 D
1859 3155 D
1865 3154 D
1868 3154 D
1874 3155 D
1877 3158 D
1878 3161 D
1878 3163 D
1877 3167 D
1874 3169 D
1868 3170 D
1865 3170 D
1859 3169 D
1855 3167 D
1854 3163 D
1854 3161 D
S
N
1854 3161 M
1855 3159 D
1856 3158 D
1859 3157 D
1865 3155 D
1868 3155 D
1874 3157 D
1876 3158 D
1877 3159 D
1878 3161 D
S
N
1878 3163 M
1877 3166 D
1876 3167 D
1874 3168 D
1868 3169 D
1865 3169 D
1859 3168 D
1856 3167 D
1855 3166 D
1854 3163 D
S
N
1859 3181 M
1858 3183 D
1854 3187 D
1878 3187 D
S
N
1855 3185 M
1878 3185 D
S
N
1878 3181 M
1878 3191 D
S
N
1859 3201 M
1860 3203 D
1861 3201 D
1860 3200 D
1859 3200 D
1856 3201 D
1855 3203 D
1854 3206 D
1854 3211 D
1855 3214 D
1858 3215 D
1861 3215 D
1863 3214 D
1865 3211 D
1865 3207 D
S
N
1854 3211 M
1855 3213 D
1858 3214 D
1861 3214 D
1863 3213 D
1865 3211 D
S
N
1865 3211 M
1866 3213 D
1868 3215 D
1870 3216 D
1874 3216 D
1876 3215 D
1877 3214 D
1878 3211 D
1878 3206 D
1877 3203 D
1876 3201 D
1874 3200 D
1873 3200 D
1871 3201 D
1873 3203 D
1874 3201 D
S
N
1867 3214 M
1870 3215 D
1874 3215 D
1876 3214 D
1877 3213 D
1878 3211 D
S
showpage
%%Trailer
%%Pages: 1
%%BoundingBox:
