%!PS-Adobe-3.0
%%Creator: xpdf/pdftops 3.00
%%LanguageLevel: 2
%%DocumentSuppliedResources: (atend)
%%DocumentMedia: plain 612 792 0 () ()
%%BoundingBox: 0 0 612 792
%%Pages: 1
%%EndComments
%%BeginDefaults
%%PageMedia: plain
%%EndDefaults
%%BeginProlog
%%BeginResource: procset xpdf 3.00 0
/xpdf 75 dict def xpdf begin
% PDF special state
/pdfDictSize 15 def
/pdfSetup {
  3 1 roll 2 array astore
  /setpagedevice where {
    pop 3 dict begin
      /PageSize exch def
      /ImagingBBox null def
      /Policies 1 dict dup begin /PageSize 3 def end def
      { /Duplex true def } if
    currentdict end setpagedevice
  } {
    pop pop
  } ifelse
} def
/pdfStartPage {
  pdfDictSize dict begin
  /pdfFillCS [] def
  /pdfFillXform {} def
  /pdfStrokeCS [] def
  /pdfStrokeXform {} def
  /pdfFill [0] def
  /pdfStroke [0] def
  /pdfFillOP false def
  /pdfStrokeOP false def
  /pdfLastFill false def
  /pdfLastStroke false def
  /pdfTextMat [1 0 0 1 0 0] def
  /pdfFontSize 0 def
  /pdfCharSpacing 0 def
  /pdfTextRender 0 def
  /pdfTextRise 0 def
  /pdfWordSpacing 0 def
  /pdfHorizScaling 1 def
  /pdfTextClipPath [] def
} def
/pdfEndPage { end } def
% PDF color state
/cs { /pdfFillXform exch def dup /pdfFillCS exch def
      setcolorspace } def
/CS { /pdfStrokeXform exch def dup /pdfStrokeCS exch def
      setcolorspace } def
/sc { pdfLastFill not { pdfFillCS setcolorspace } if
      dup /pdfFill exch def aload pop pdfFillXform setcolor
     /pdfLastFill true def /pdfLastStroke false def } def
/SC { pdfLastStroke not { pdfStrokeCS setcolorspace } if
      dup /pdfStroke exch def aload pop pdfStrokeXform setcolor
     /pdfLastStroke true def /pdfLastFill false def } def
/op { /pdfFillOP exch def
      pdfLastFill { pdfFillOP setoverprint } if } def
/OP { /pdfStrokeOP exch def
      pdfLastStroke { pdfStrokeOP setoverprint } if } def
/fCol {
  pdfLastFill not {
    pdfFillCS setcolorspace
    pdfFill aload pop pdfFillXform setcolor
    pdfFillOP setoverprint
    /pdfLastFill true def /pdfLastStroke false def
  } if
} def
/sCol {
  pdfLastStroke not {
    pdfStrokeCS setcolorspace
    pdfStroke aload pop pdfStrokeXform setcolor
    pdfStrokeOP setoverprint
    /pdfLastStroke true def /pdfLastFill false def
  } if
} def
% build a font
/pdfMakeFont {
  4 3 roll findfont
  4 2 roll matrix scale makefont
  dup length dict begin
    { 1 index /FID ne { def } { pop pop } ifelse } forall
    /Encoding exch def
    currentdict
  end
  definefont pop
} def
/pdfMakeFont16 {
  exch findfont
  dup length dict begin
    { 1 index /FID ne { def } { pop pop } ifelse } forall
    /WMode exch def
    currentdict
  end
  definefont pop
} def
% graphics state operators
/q { gsave pdfDictSize dict begin } def
/Q {
  end grestore
  /pdfLastFill where {
    pop
    pdfLastFill {
      pdfFillOP setoverprint
    } {
      pdfStrokeOP setoverprint
    } ifelse
  } if
} def
/cm { concat } def
/d { setdash } def
/i { setflat } def
/j { setlinejoin } def
/J { setlinecap } def
/M { setmiterlimit } def
/w { setlinewidth } def
% path segment operators
/m { moveto } def
/l { lineto } def
/c { curveto } def
/re { 4 2 roll moveto 1 index 0 rlineto 0 exch rlineto
      neg 0 rlineto closepath } def
/h { closepath } def
% path painting operators
/S { sCol stroke } def
/Sf { fCol stroke } def
/f { fCol fill } def
/f* { fCol eofill } def
% clipping operators
/W { clip newpath } def
/W* { eoclip newpath } def
% text state operators
/Tc { /pdfCharSpacing exch def } def
/Tf { dup /pdfFontSize exch def
      dup pdfHorizScaling mul exch matrix scale
      pdfTextMat matrix concatmatrix dup 4 0 put dup 5 0 put
      exch findfont exch makefont setfont } def
/Tr { /pdfTextRender exch def } def
/Ts { /pdfTextRise exch def } def
/Tw { /pdfWordSpacing exch def } def
/Tz { /pdfHorizScaling exch def } def
% text positioning operators
/Td { pdfTextMat transform moveto } def
/Tm { /pdfTextMat exch def } def
% text string operators
/cshow where {
  pop
  /cshow2 {
    dup {
      pop pop
      1 string dup 0 3 index put 3 index exec
    } exch cshow
    pop pop
  } def
}{
  /cshow2 {
    currentfont /FontType get 0 eq {
      0 2 2 index length 1 sub {
        2 copy get exch 1 add 2 index exch get
        2 copy exch 256 mul add
        2 string dup 0 6 5 roll put dup 1 5 4 roll put
        3 index exec
      } for
    } {
      dup {
        1 string dup 0 3 index put 3 index exec
      } forall
    } ifelse
    pop pop
  } def
} ifelse
/awcp {
  exch {
    false charpath
    5 index 5 index rmoveto
    6 index eq { 7 index 7 index rmoveto } if
  } exch cshow2
  6 {pop} repeat
} def
/Tj {
  fCol
  1 index stringwidth pdfTextMat idtransform pop
  sub 1 index length dup 0 ne { div } { pop pop 0 } ifelse
  pdfWordSpacing pdfHorizScaling mul 0 pdfTextMat dtransform 32
  4 3 roll pdfCharSpacing pdfHorizScaling mul add 0
  pdfTextMat dtransform
  6 5 roll Tj1
} def
/Tj16 {
  fCol
  2 index stringwidth pdfTextMat idtransform pop
  sub exch div
  pdfWordSpacing pdfHorizScaling mul 0 pdfTextMat dtransform 32
  4 3 roll pdfCharSpacing pdfHorizScaling mul add 0
  pdfTextMat dtransform
  6 5 roll Tj1
} def
/Tj16V {
  fCol
  2 index stringwidth pdfTextMat idtransform exch pop
  sub exch div
  0 pdfWordSpacing pdfTextMat dtransform 32
  4 3 roll pdfCharSpacing add 0 exch
  pdfTextMat dtransform
  6 5 roll Tj1
} def
/Tj1 {
  0 pdfTextRise pdfTextMat dtransform rmoveto
  currentpoint 8 2 roll
  pdfTextRender 1 and 0 eq {
    6 copy awidthshow
  } if
  pdfTextRender 3 and dup 1 eq exch 2 eq or {
    7 index 7 index moveto
    6 copy
    currentfont /FontType get 3 eq { fCol } { sCol } ifelse
    false awcp currentpoint stroke moveto
  } if
  pdfTextRender 4 and 0 ne {
    8 6 roll moveto
    false awcp
    /pdfTextClipPath [ pdfTextClipPath aload pop
      {/moveto cvx}
      {/lineto cvx}
      {/curveto cvx}
      {/closepath cvx}
    pathforall ] def
    currentpoint newpath moveto
  } {
    8 {pop} repeat
  } ifelse
  0 pdfTextRise neg pdfTextMat dtransform rmoveto
} def
/TJm { pdfFontSize 0.001 mul mul neg 0
       pdfTextMat dtransform rmoveto } def
/TJmV { pdfFontSize 0.001 mul mul neg 0 exch
        pdfTextMat dtransform rmoveto } def
/Tclip { pdfTextClipPath cvx exec clip newpath
         /pdfTextClipPath [] def } def
% Level 2 image operators
/pdfImBuf 100 string def
/pdfIm {
  image
  { currentfile pdfImBuf readline
    not { pop exit } if
    (%-EOD-) eq { exit } if } loop
} def
/pdfImM {
  fCol imagemask
  { currentfile pdfImBuf readline
    not { pop exit } if
    (%-EOD-) eq { exit } if } loop
} def
/pdfImClip {
  gsave
  0 2 4 index length 1 sub {
    dup 4 index exch 2 copy
    get 5 index div put
    1 add 3 index exch 2 copy
    get 3 index div put
  } for
  pop pop rectclip
} def
/pdfImClipEnd { grestore } def
% shading operators
/colordelta {
  false 0 1 3 index length 1 sub {
    dup 4 index exch get 3 index 3 2 roll get sub abs 0.004 gt {
      pop true
    } if
  } for
  exch pop exch pop
} def
/funcCol { func n array astore } def
/funcSH {
  dup 0 eq {
    true
  } {
    dup 6 eq {
      false
    } {
      4 index 4 index funcCol dup
      6 index 4 index funcCol dup
      3 1 roll colordelta 3 1 roll
      5 index 5 index funcCol dup
      3 1 roll colordelta 3 1 roll
      6 index 8 index funcCol dup
      3 1 roll colordelta 3 1 roll
      colordelta or or or
    } ifelse
  } ifelse
  {
    1 add
    4 index 3 index add 0.5 mul exch 4 index 3 index add 0.5 mul exch
    6 index 6 index 4 index 4 index 4 index funcSH
    2 index 6 index 6 index 4 index 4 index funcSH
    6 index 2 index 4 index 6 index 4 index funcSH
    5 3 roll 3 2 roll funcSH pop pop
  } {
    pop 3 index 2 index add 0.5 mul 3 index  2 index add 0.5 mul
    funcCol sc
    dup 4 index exch mat transform m
    3 index 3 index mat transform l
    1 index 3 index mat transform l
    mat transform l pop pop h f*
  } ifelse
} def
/axialCol {
  dup 0 lt {
    pop t0
  } {
    dup 1 gt {
      pop t1
    } {
      dt mul t0 add
    } ifelse
  } ifelse
  func n array astore
} def
/axialSH {
  dup 0 eq {
    true
  } {
    dup 8 eq {
      false
    } {
      2 index axialCol 2 index axialCol colordelta
    } ifelse
  } ifelse
  {
    1 add 3 1 roll 2 copy add 0.5 mul
    dup 4 3 roll exch 4 index axialSH
    exch 3 2 roll axialSH
  } {
    pop 2 copy add 0.5 mul axialCol sc
    exch dup dx mul x0 add exch dy mul y0 add
    3 2 roll dup dx mul x0 add exch dy mul y0 add
    dx abs dy abs ge {
      2 copy yMin sub dy mul dx div add yMin m
      yMax sub dy mul dx div add yMax l
      2 copy yMax sub dy mul dx div add yMax l
      yMin sub dy mul dx div add yMin l
      h f*
    } {
      exch 2 copy xMin sub dx mul dy div add xMin exch m
      xMax sub dx mul dy div add xMax exch l
      exch 2 copy xMax sub dx mul dy div add xMax exch l
      xMin sub dx mul dy div add xMin exch l
      h f*
    } ifelse
  } ifelse
} def
/radialCol {
  dup t0 lt {
    pop t0
  } {
    dup t1 gt {
      pop t1
    } if
  } ifelse
  func n array astore
} def
/radialSH {
  dup 0 eq {
    true
  } {
    dup 8 eq {
      false
    } {
      2 index dt mul t0 add radialCol
      2 index dt mul t0 add radialCol colordelta
    } ifelse
  } ifelse
  {
    1 add 3 1 roll 2 copy add 0.5 mul
    dup 4 3 roll exch 4 index radialSH
    exch 3 2 roll radialSH
  } {
    pop 2 copy add 0.5 mul dt mul t0 add axialCol sc
    exch dup dx mul x0 add exch dup dy mul y0 add exch dr mul r0 add
    0 360 arc h
    dup dx mul x0 add exch dup dy mul y0 add exch dr mul r0 add
    0 360 arc h f*
  } ifelse
} def
end
%%EndResource
%%EndProlog
%%BeginSetup
xpdf begin
612 792 false pdfSetup
%%EndSetup
%%Page: 1 1
%%BeginPageSetup
%%PageOrientation: Portrait
pdfStartPage
0 0 612 792 re W
%%EndPageSetup
[] 0 d
1 i
0 j
0 J
10 M
1 w
/DeviceGray {} cs
[0] sc
/DeviceGray {} CS
[0] SC
false op
false OP
q
q
Q
q
0 0 612 792 re
W
1.2 w
1 J
1 j
/DeviceRGB {} CS
[0 0 0] SC
[0 0 0] SC
52.56 463.2 m
52.56 457.92 l
53.04 456.48 l
54.48 455.52 l
56.16 454.8 l
57.6 454.8 l
58.8 455.52 l
59.28 456 l
59.76 456.96 l
59.76 457.92 l
59.28 459.6 l
57.6 460.56 l
56.16 461.04 l
54.48 461.04 l
53.52 460.56 l
53.04 460.08 l
52.56 459.12 l
52.56 457.92 m
53.04 456.96 l
54.48 456 l
56.16 455.52 l
58.32 455.52 l
59.28 456 l
59.76 457.92 m
59.28 459.12 l
57.6 460.08 l
56.16 460.56 l
54 460.56 l
53.04 460.08 l
53.04 463.2 l
56.64 466.08 m
63.84 470.4 l
56.64 466.32 m
63.84 470.88 l
56.64 470.88 m
63.84 466.08 l
56.64 465.36 m
56.64 467.28 l
56.64 469.44 m
56.64 471.6 l
63.84 465.36 m
63.84 467.28 l
63.84 469.44 m
63.84 471.6 l
46.8 482.88 m
63.36 482.88 l
46.8 483.6 m
63.36 483.6 l
46.8 482.88 m
46.8 486.72 l
63.36 482.88 m
63.36 486.72 l
49.44 493.44 m
49.92 492.96 l
50.4 493.44 l
49.92 493.92 l
49.44 493.92 l
48.96 493.44 l
48.96 492.24 l
49.44 491.28 l
50.4 490.8 l
59.76 490.8 l
48.96 492.24 m
49.44 491.76 l
50.4 491.28 l
59.76 491.28 l
52.56 489.12 m
52.56 493.44 l
59.76 489.12 m
59.76 492.96 l
48.96 497.52 m
59.76 497.52 l
48.96 498 m
59.76 498 l
54 498 m
53.04 499.2 l
52.56 500.16 l
52.56 501.12 l
53.04 502.8 l
54 503.76 l
55.68 504.24 l
56.64 504.24 l
58.32 503.76 l
59.28 502.8 l
59.76 501.12 l
59.76 500.16 l
59.28 499.2 l
58.32 498 l
52.56 501.12 m
53.04 502.32 l
54 503.28 l
55.68 503.76 l
56.64 503.76 l
58.32 503.28 l
59.28 502.32 l
59.76 501.12 l
48.96 496.08 m
48.96 498 l
46.8 510.48 m
63.36 510.48 l
46.8 510.96 m
63.36 510.96 l
46.8 507.36 m
46.8 510.96 l
63.36 507.36 m
63.36 510.96 l
S
[1 0 0] SC
164.4 473.76 m
159.12 473.76 l
157.68 473.28 l
156.48 471.84 l
156 470.16 l
156 468.72 l
156.48 467.52 l
156.96 467.04 l
158.16 466.56 l
159.12 466.56 l
160.56 467.04 l
161.76 468.72 l
162.24 470.16 l
162.24 471.84 l
161.76 472.8 l
161.28 473.28 l
160.08 473.76 l
159.12 473.76 m
158.16 473.28 l
156.96 471.84 l
156.48 470.16 l
156.48 468.24 l
156.96 467.04 l
159.12 466.56 m
160.08 467.04 l
161.28 468.72 l
161.76 470.16 l
161.76 472.32 l
161.28 473.28 l
164.4 473.28 l
167.04 469.68 m
171.6 462.48 l
167.52 469.68 m
171.84 462.48 l
171.84 469.68 m
167.04 462.48 l
166.32 469.68 m
168.48 469.68 l
170.64 469.68 m
172.56 469.68 l
166.32 462.48 m
168.48 462.48 l
170.64 462.48 m
172.56 462.48 l
175.68 472.8 m
185.04 472.8 l
175.68 469.68 m
185.04 469.68 l
197.04 473.76 m
191.76 473.76 l
190.32 473.28 l
189.36 471.84 l
188.64 470.16 l
188.64 468.72 l
189.36 467.52 l
189.84 467.04 l
190.8 466.56 l
191.76 466.56 l
193.44 467.04 l
194.4 468.72 l
194.88 470.16 l
194.88 471.84 l
194.4 472.8 l
193.92 473.28 l
192.96 473.76 l
191.76 473.76 m
190.8 473.28 l
189.84 471.84 l
189.36 470.16 l
189.36 468.24 l
189.84 467.04 l
191.76 466.56 m
192.96 467.04 l
193.92 468.72 l
194.4 470.16 l
194.4 472.32 l
193.92 473.28 l
197.04 473.28 l
200.64 469.68 m
200.64 462.48 l
200.88 469.68 m
200.88 462.48 l
204.96 469.68 m
204.96 462.48 l
205.44 469.68 m
205.44 462.48 l
199.44 469.68 m
201.84 469.68 l
204 469.68 m
206.4 469.68 l
200.88 466.32 m
204.96 466.32 l
199.44 462.48 m
201.84 462.48 l
204 462.48 m
206.4 462.48 l
208.8 462.48 m
208.56 462.72 l
208.8 463.2 l
209.28 462.72 l
209.28 462 l
208.8 461.28 l
208.56 461.04 l
212.4 469.68 m
211.92 469.44 l
212.4 468.96 l
212.64 469.44 l
212.4 469.68 l
212.4 467.28 m
212.4 462.48 l
212.64 467.28 m
212.64 462.48 l
211.2 467.28 m
212.64 467.28 l
211.2 462.48 m
213.6 462.48 l
S
[0 0 1] SC
164.4 453.12 m
159.12 453.12 l
157.68 452.64 l
156.48 450.96 l
156 449.52 l
156 447.84 l
156.48 446.88 l
156.96 446.4 l
158.16 445.92 l
159.12 445.92 l
160.56 446.4 l
161.76 447.84 l
162.24 449.52 l
162.24 450.96 l
161.76 452.16 l
161.28 452.64 l
160.08 453.12 l
159.12 453.12 m
158.16 452.64 l
156.96 450.96 l
156.48 449.52 l
156.48 447.36 l
156.96 446.4 l
159.12 445.92 m
160.08 446.4 l
161.28 447.84 l
161.76 449.52 l
161.76 451.44 l
161.28 452.64 l
164.4 452.64 l
167.04 449.04 m
171.6 441.6 l
167.52 449.04 m
171.84 441.6 l
171.84 449.04 m
167.04 441.6 l
166.32 449.04 m
168.48 449.04 l
170.64 449.04 m
172.56 449.04 l
166.32 441.6 m
168.48 441.6 l
170.64 441.6 m
172.56 441.6 l
175.68 452.16 m
185.04 452.16 l
175.68 449.04 m
185.04 449.04 l
197.04 453.12 m
191.76 453.12 l
190.32 452.64 l
189.36 450.96 l
188.64 449.52 l
188.64 447.84 l
189.36 446.88 l
189.84 446.4 l
190.8 445.92 l
191.76 445.92 l
193.44 446.4 l
194.4 447.84 l
194.88 449.52 l
194.88 450.96 l
194.4 452.16 l
193.92 452.64 l
192.96 453.12 l
191.76 453.12 m
190.8 452.64 l
189.84 450.96 l
189.36 449.52 l
189.36 447.36 l
189.84 446.4 l
191.76 445.92 m
192.96 446.4 l
193.92 447.84 l
194.4 449.52 l
194.4 451.44 l
193.92 452.64 l
197.04 452.64 l
200.64 449.04 m
200.64 441.6 l
200.88 449.04 m
200.88 441.6 l
204.96 449.04 m
204.96 441.6 l
205.44 449.04 m
205.44 441.6 l
199.44 449.04 m
201.84 449.04 l
204 449.04 m
206.4 449.04 l
200.88 445.44 m
204.96 445.44 l
199.44 441.6 m
201.84 441.6 l
204 441.6 m
206.4 441.6 l
S
[0 1 0] SC
366.24 525.12 m
364.56 524.64 l
364.08 523.68 l
364.08 522 l
364.56 521.04 l
366.24 520.56 l
368.16 520.56 l
369.84 521.04 l
370.32 522 l
370.32 523.68 l
369.84 524.64 l
368.16 525.12 l
366.24 525.12 l
365.28 524.64 l
364.56 523.68 l
364.56 522 l
365.28 521.04 l
366.24 520.56 l
368.16 520.56 m
369.36 521.04 l
369.84 522 l
369.84 523.68 l
369.36 524.64 l
368.16 525.12 l
366.24 520.56 m
364.56 520.08 l
364.08 519.6 l
363.6 518.4 l
363.6 516.48 l
364.08 515.28 l
364.56 514.8 l
366.24 514.32 l
368.16 514.32 l
369.84 514.8 l
370.32 515.28 l
370.8 516.48 l
370.8 518.4 l
370.32 519.6 l
369.84 520.08 l
368.16 520.56 l
366.24 520.56 m
365.28 520.08 l
364.56 519.6 l
364.08 518.4 l
364.08 516.48 l
364.56 515.28 l
365.28 514.8 l
366.24 514.32 l
368.16 514.32 m
369.36 514.8 l
369.84 515.28 l
370.32 516.48 l
370.32 518.4 l
369.84 519.6 l
369.36 520.08 l
368.16 520.56 l
385.44 525.12 m
385.44 514.32 l
385.92 525.12 m
385.92 514.32 l
382.32 525.12 m
381.84 522 l
381.84 525.12 l
389.52 525.12 l
389.52 522 l
389.04 525.12 l
383.76 514.32 m
387.6 514.32 l
392.64 518.4 m
398.88 518.4 l
398.88 519.6 l
398.4 520.56 l
397.92 521.04 l
396.96 521.52 l
395.28 521.52 l
393.84 521.04 l
392.64 520.08 l
392.16 518.4 l
392.16 517.44 l
392.64 516 l
393.84 514.8 l
395.28 514.32 l
396.24 514.32 l
397.92 514.8 l
398.88 516 l
398.4 518.4 m
398.4 520.08 l
397.92 521.04 l
395.28 521.52 m
394.32 521.04 l
393.12 520.08 l
392.64 518.4 l
392.64 517.44 l
393.12 516 l
394.32 514.8 l
395.28 514.32 l
402 525.12 m
405.6 514.32 l
402.48 525.12 m
405.6 516 l
409.44 525.12 m
405.6 514.32 l
401.04 525.12 m
404.16 525.12 l
407.28 525.12 m
410.4 525.12 l
S
[0 0 0] SC
119.04 396 332.4 166.08 re
S
[0 0 1] SC
119.04 553.92 m
123.12 553.92 l
127.2 554.16 l
131.04 553.92 l
135.12 553.44 l
138.96 552.96 l
142.8 552 l
150.96 549.6 l
155.04 548.16 l
162.72 545.28 l
166.56 543.6 l
170.64 541.68 l
174.48 539.76 l
178.56 538.08 l
182.4 536.16 l
186.48 534.24 l
190.32 532.56 l
194.4 530.64 l
202.08 526.8 l
206.16 525.12 l
210 523.2 l
214.08 521.28 l
217.92 519.36 l
222 517.68 l
225.84 515.76 l
229.92 514.08 l
233.76 512.16 l
237.84 510.48 l
241.68 508.56 l
245.76 506.88 l
249.6 504.96 l
253.68 503.28 l
257.52 501.6 l
261.6 499.68 l
265.44 498 l
269.52 496.32 l
277.2 492.96 l
281.28 491.04 l
285.36 489.36 l
293.04 486 l
297.12 484.32 l
300.96 482.88 l
305.04 481.2 l
308.88 479.52 l
312.96 477.84 l
316.8 476.16 l
320.88 474.48 l
324.72 473.04 l
328.8 471.36 l
332.64 469.68 l
336.72 468 l
340.56 466.56 l
344.64 464.88 l
348.48 463.44 l
352.56 461.76 l
356.4 460.08 l
360.48 458.64 l
364.32 456.96 l
368.16 455.52 l
372.24 454.08 l
376.08 452.4 l
380.16 450.96 l
384 449.28 l
388.08 447.84 l
391.92 446.4 l
396 444.72 l
399.84 443.28 l
403.92 441.84 l
407.76 440.16 l
411.84 438.72 l
415.68 437.28 l
419.76 435.84 l
423.6 434.16 l
427.68 432.72 l
431.52 431.28 l
435.6 429.84 l
439.44 428.4 l
443.52 426.96 l
447.36 425.52 l
451.44 424.08 l
S
[0 0 0] SC
128.64 396 m
128.64 400.08 l
147.6 400.08 m
147.6 396 l
166.56 396 m
166.56 408.48 l
185.52 400.08 m
185.52 396 l
204.48 396 m
204.48 400.08 l
223.44 400.08 m
223.44 396 l
242.64 396 m
242.64 400.08 l
261.6 408.48 m
261.6 396 l
280.56 396 m
280.56 400.08 l
299.52 400.08 m
299.52 396 l
318.48 396 m
318.48 400.08 l
337.44 400.08 m
337.44 396 l
356.4 396 m
356.4 408.48 l
375.36 400.08 m
375.36 396 l
394.32 396 m
394.32 400.08 l
413.28 400.08 m
413.28 396 l
432.24 396 m
432.24 400.08 l
128.64 558 m
128.64 562.08 l
147.6 562.08 m
147.6 558 l
166.56 549.6 m
166.56 562.08 l
185.52 562.08 m
185.52 558 l
204.48 558 m
204.48 562.08 l
223.44 562.08 m
223.44 558 l
242.64 558 m
242.64 562.08 l
261.6 562.08 m
261.6 549.6 l
280.56 558 m
280.56 562.08 l
299.52 562.08 m
299.52 558 l
318.48 558 m
318.48 562.08 l
337.44 562.08 m
337.44 558 l
356.4 549.6 m
356.4 562.08 l
375.36 562.08 m
375.36 558 l
394.32 558 m
394.32 562.08 l
413.28 562.08 m
413.28 558 l
432.24 558 m
432.24 562.08 l
119.04 396 m
131.52 396 l
123.36 411.84 m
119.04 411.84 l
119.04 420.96 m
123.36 420.96 l
123.36 427.44 m
119.04 427.44 l
119.04 432.48 m
131.52 432.48 l
123.36 436.8 m
119.04 436.8 l
119.04 440.16 m
123.36 440.16 l
123.36 443.28 m
119.04 443.28 l
119.04 445.92 m
123.36 445.92 l
131.52 448.32 m
119.04 448.32 l
119.04 463.92 m
123.36 463.92 l
123.36 473.28 m
119.04 473.28 l
119.04 479.76 m
123.36 479.76 l
131.52 484.8 m
119.04 484.8 l
119.04 488.88 m
123.36 488.88 l
123.36 492.48 m
119.04 492.48 l
119.04 495.6 m
123.36 495.6 l
123.36 498.24 m
119.04 498.24 l
119.04 500.64 m
131.52 500.64 l
123.36 516.24 m
119.04 516.24 l
119.04 525.6 m
123.36 525.6 l
123.36 532.08 m
119.04 532.08 l
119.04 537.12 m
131.52 537.12 l
123.36 541.2 m
119.04 541.2 l
119.04 544.8 m
123.36 544.8 l
123.36 547.92 m
119.04 547.92 l
119.04 550.56 m
123.36 550.56 l
131.52 552.96 m
119.04 552.96 l
93.84 399.12 m
92.88 398.88 l
92.16 397.68 l
91.92 396 l
91.92 395.04 l
92.16 393.12 l
92.88 392.16 l
93.84 391.92 l
94.56 391.92 l
95.76 392.16 l
96.24 393.12 l
96.72 395.04 l
96.72 396 l
96.24 397.68 l
95.76 398.88 l
94.56 399.12 l
93.84 399.12 l
S
93.84 399.12 m
93.12 398.88 l
92.88 398.4 l
92.64 397.68 l
92.16 396 l
92.16 395.04 l
92.64 393.12 l
93.12 392.16 l
93.84 391.92 l
94.56 391.92 m
95.28 392.16 l
95.76 392.64 l
96 393.12 l
96.24 395.04 l
96.24 396 l
96 397.68 l
95.76 398.4 l
95.28 398.88 l
94.56 399.12 l
99.36 392.64 m
99.12 392.16 l
99.36 391.92 l
99.84 392.16 l
99.36 392.64 l
104.4 399.12 m
103.2 398.88 l
102.48 397.68 l
102.24 396 l
102.24 395.04 l
102.48 393.12 l
103.2 392.16 l
104.4 391.92 l
104.88 391.92 l
106.08 392.16 l
106.8 393.12 l
107.04 395.04 l
107.04 396 l
106.8 397.68 l
106.08 398.88 l
104.88 399.12 l
104.4 399.12 l
103.68 398.88 l
103.2 398.4 l
102.96 397.68 l
102.48 396 l
102.48 395.04 l
102.96 393.12 l
103.2 392.64 l
103.68 392.16 l
104.4 391.92 l
104.88 391.92 m
105.6 392.16 l
106.08 392.64 l
106.32 393.12 l
106.8 395.04 l
106.8 396 l
106.32 397.68 l
106.08 398.4 l
105.6 398.88 l
104.88 399.12 l
110.16 397.68 m
110.88 398.16 l
111.84 399.12 l
111.84 391.92 l
111.6 398.88 m
111.6 391.92 l
110.16 391.92 m
113.28 391.92 l
93.84 435.6 m
92.88 435.36 l
92.16 434.4 l
91.92 432.48 l
91.92 431.52 l
92.16 429.84 l
92.88 428.64 l
93.84 428.4 l
94.56 428.4 l
95.76 428.64 l
96.24 429.84 l
96.72 431.52 l
96.72 432.48 l
96.24 434.4 l
95.76 435.36 l
94.56 435.6 l
93.84 435.6 l
93.12 435.36 l
92.64 434.4 l
92.16 432.48 l
92.16 431.52 l
92.64 429.84 l
92.88 429.12 l
93.12 428.64 l
93.84 428.4 l
94.56 428.4 m
95.28 428.64 l
95.76 429.12 l
96 429.84 l
96.24 431.52 l
96.24 432.48 l
96 434.4 l
95.76 434.88 l
95.28 435.36 l
94.56 435.6 l
99.36 429.12 m
99.12 428.64 l
99.36 428.4 l
99.84 428.64 l
99.36 429.12 l
104.4 435.6 m
103.2 435.36 l
102.48 434.4 l
102.24 432.48 l
102.24 431.52 l
102.48 429.84 l
103.2 428.64 l
104.4 428.4 l
104.88 428.4 l
106.08 428.64 l
106.8 429.84 l
107.04 431.52 l
107.04 432.48 l
106.8 434.4 l
106.08 435.36 l
104.88 435.6 l
104.4 435.6 l
103.68 435.36 l
103.2 434.88 l
102.96 434.4 l
102.48 432.48 l
102.48 431.52 l
102.96 429.84 l
103.2 429.12 l
103.68 428.64 l
104.4 428.4 l
S
104.88 428.4 m
105.6 428.64 l
106.08 429.12 l
106.32 429.84 l
106.8 431.52 l
106.8 432.48 l
106.32 434.4 l
106.08 434.88 l
105.6 435.36 l
104.88 435.6 l
109.92 435.6 m
109.2 432.24 l
109.92 432.96 l
110.88 433.2 l
111.84 433.2 l
113.04 432.96 l
113.76 432.24 l
114 431.28 l
114 430.56 l
113.76 429.36 l
113.04 428.64 l
111.84 428.4 l
110.88 428.4 l
109.92 428.64 l
109.44 429.12 l
109.2 429.84 l
109.2 430.08 l
109.44 430.56 l
109.92 430.08 l
109.44 429.84 l
111.84 433.2 m
112.56 432.96 l
113.28 432.24 l
113.76 431.28 l
113.76 430.56 l
113.28 429.36 l
112.56 428.64 l
111.84 428.4 l
109.92 435.6 m
113.28 435.6 l
109.92 435.36 m
111.6 435.36 l
113.28 435.6 l
93.84 451.44 m
92.88 450.96 l
92.16 450 l
91.92 448.32 l
91.92 447.36 l
92.16 445.44 l
92.88 444.48 l
93.84 444.24 l
94.56 444.24 l
95.76 444.48 l
96.24 445.44 l
96.72 447.36 l
96.72 448.32 l
96.24 450 l
95.76 450.96 l
94.56 451.44 l
93.84 451.44 l
93.12 450.96 l
92.88 450.72 l
92.64 450 l
92.16 448.32 l
92.16 447.36 l
92.64 445.44 l
92.88 444.72 l
93.12 444.48 l
93.84 444.24 l
94.56 444.24 m
95.28 444.48 l
95.76 444.72 l
96 445.44 l
96.24 447.36 l
96.24 448.32 l
96 450 l
95.76 450.72 l
95.28 450.96 l
94.56 451.44 l
99.36 444.72 m
99.12 444.48 l
99.36 444.24 l
99.84 444.48 l
99.36 444.72 l
103.2 450 m
103.92 450.48 l
104.88 451.44 l
104.88 444.24 l
104.64 450.96 m
104.64 444.24 l
103.2 444.24 m
106.32 444.24 l
111.12 451.44 m
110.16 450.96 l
109.44 450 l
109.2 448.32 l
109.2 447.36 l
109.44 445.44 l
110.16 444.48 l
111.12 444.24 l
111.84 444.24 l
113.04 444.48 l
113.76 445.44 l
114 447.36 l
114 448.32 l
113.76 450 l
113.04 450.96 l
111.84 451.44 l
111.12 451.44 l
110.64 450.96 l
110.16 450.72 l
109.92 450 l
109.44 448.32 l
109.44 447.36 l
109.92 445.44 l
110.16 444.72 l
111.12 444.24 l
111.84 444.24 m
112.56 444.48 l
113.04 444.72 l
113.28 445.44 l
113.76 447.36 l
113.76 448.32 l
113.28 450 l
113.04 450.72 l
112.56 450.96 l
111.84 451.44 l
93.84 487.92 m
92.88 487.68 l
92.16 486.48 l
91.92 484.8 l
91.92 483.84 l
92.16 482.16 l
92.88 480.96 l
93.84 480.72 l
94.56 480.72 l
95.76 480.96 l
96.24 482.16 l
96.72 483.84 l
96.72 484.8 l
96.24 486.48 l
95.76 487.68 l
94.56 487.92 l
93.84 487.92 l
S
93.84 487.92 m
93.12 487.68 l
92.88 487.2 l
92.64 486.48 l
92.16 484.8 l
92.16 483.84 l
92.64 482.16 l
92.88 481.44 l
93.12 480.96 l
93.84 480.72 l
94.56 480.72 m
95.28 480.96 l
95.76 481.44 l
96 482.16 l
96.24 483.84 l
96.24 484.8 l
96 486.48 l
95.76 487.2 l
95.28 487.68 l
94.56 487.92 l
99.36 481.44 m
99.12 480.96 l
99.36 480.72 l
99.84 480.96 l
99.36 481.44 l
102.96 487.92 m
102.24 484.56 l
102.96 485.28 l
103.92 485.52 l
104.88 485.52 l
106.08 485.28 l
106.8 484.56 l
107.04 483.36 l
107.04 482.88 l
106.8 481.68 l
106.08 480.96 l
104.88 480.72 l
103.92 480.72 l
102.96 480.96 l
102.48 481.44 l
102.24 482.16 l
102.24 482.4 l
102.48 482.88 l
102.96 482.4 l
102.48 482.16 l
104.88 485.52 m
105.6 485.28 l
106.32 484.56 l
106.8 483.36 l
106.8 482.88 l
106.32 481.68 l
105.6 480.96 l
104.88 480.72 l
102.96 487.92 m
106.32 487.92 l
102.96 487.68 m
104.64 487.68 l
106.32 487.92 l
111.12 487.92 m
110.16 487.68 l
109.44 486.48 l
109.2 484.8 l
109.2 483.84 l
109.44 482.16 l
110.16 480.96 l
111.12 480.72 l
111.84 480.72 l
113.04 480.96 l
113.76 482.16 l
114 483.84 l
114 484.8 l
113.76 486.48 l
113.04 487.68 l
111.84 487.92 l
111.12 487.92 l
110.64 487.68 l
110.16 487.2 l
109.92 486.48 l
109.44 484.8 l
109.44 483.84 l
109.92 482.16 l
110.16 481.44 l
110.64 480.96 l
111.12 480.72 l
111.84 480.72 m
112.56 480.96 l
113.04 481.44 l
113.28 482.16 l
113.76 483.84 l
113.76 484.8 l
113.28 486.48 l
113.04 487.2 l
112.56 487.68 l
111.84 487.92 l
92.88 502.32 m
93.6 502.56 l
94.56 503.76 l
94.56 496.32 l
94.32 503.28 m
94.32 496.32 l
92.88 496.32 m
96 496.32 l
99.36 497.04 m
99.12 496.8 l
99.36 496.32 l
99.84 496.8 l
99.36 497.04 l
104.4 503.76 m
103.2 503.28 l
102.48 502.32 l
102.24 500.64 l
102.24 499.44 l
102.48 497.76 l
103.2 496.8 l
104.4 496.32 l
104.88 496.32 l
106.08 496.8 l
106.8 497.76 l
107.04 499.44 l
107.04 500.64 l
106.8 502.32 l
106.08 503.28 l
104.88 503.76 l
104.4 503.76 l
103.68 503.28 l
103.2 503.04 l
102.96 502.32 l
102.48 500.64 l
102.48 499.44 l
102.96 497.76 l
103.2 497.04 l
103.68 496.8 l
104.4 496.32 l
S
104.88 496.32 m
105.6 496.8 l
106.08 497.04 l
106.32 497.76 l
106.8 499.44 l
106.8 500.64 l
106.32 502.32 l
106.08 503.04 l
105.6 503.28 l
104.88 503.76 l
111.12 503.76 m
110.16 503.28 l
109.44 502.32 l
109.2 500.64 l
109.2 499.44 l
109.44 497.76 l
110.16 496.8 l
111.12 496.32 l
111.84 496.32 l
113.04 496.8 l
113.76 497.76 l
114 499.44 l
114 500.64 l
113.76 502.32 l
113.04 503.28 l
111.84 503.76 l
111.12 503.76 l
110.64 503.28 l
110.16 503.04 l
109.92 502.32 l
109.44 500.64 l
109.44 499.44 l
109.92 497.76 l
110.16 497.04 l
110.64 496.8 l
111.12 496.32 l
111.84 496.32 m
112.56 496.8 l
113.04 497.04 l
113.28 497.76 l
113.76 499.44 l
113.76 500.64 l
113.28 502.32 l
113.04 503.04 l
112.56 503.28 l
111.84 503.76 l
92.64 540.24 m
91.92 536.88 l
92.64 537.36 l
93.6 537.84 l
94.56 537.84 l
95.76 537.36 l
96.24 536.88 l
96.72 535.68 l
96.72 534.96 l
96.24 534 l
95.76 533.28 l
94.56 533.04 l
93.6 533.04 l
92.64 533.28 l
92.16 533.76 l
91.92 534.24 l
91.92 534.72 l
92.16 534.96 l
92.64 534.72 l
92.16 534.24 l
94.56 537.84 m
96 536.88 l
96.24 535.68 l
96.24 534.96 l
96 534 l
95.28 533.28 l
94.56 533.04 l
92.64 540.24 m
96 540.24 l
92.64 540 m
94.32 540 l
96 540.24 l
99.36 533.76 m
99.12 533.28 l
99.36 533.04 l
99.84 533.28 l
99.36 533.76 l
104.4 540.24 m
103.2 540 l
102.48 538.8 l
102.24 537.12 l
102.24 536.16 l
102.48 534.24 l
103.2 533.28 l
104.4 533.04 l
104.88 533.04 l
106.08 533.28 l
106.8 534.24 l
107.04 536.16 l
107.04 537.12 l
106.8 538.8 l
106.08 540 l
104.88 540.24 l
104.4 540.24 l
103.68 540 l
103.2 539.52 l
102.96 538.8 l
102.48 537.12 l
102.48 536.16 l
102.96 534.24 l
103.2 533.76 l
103.68 533.28 l
104.4 533.04 l
104.88 533.04 m
105.6 533.28 l
106.08 533.76 l
106.32 534.24 l
106.8 536.16 l
106.8 537.12 l
106.32 538.8 l
106.08 539.52 l
105.6 540 l
104.88 540.24 l
111.12 540.24 m
110.16 540 l
109.44 538.8 l
109.2 537.12 l
109.2 536.16 l
109.44 534.24 l
110.16 533.28 l
111.12 533.04 l
111.84 533.04 l
113.04 533.28 l
113.76 534.24 l
114 536.16 l
114 537.12 l
113.76 538.8 l
113.04 540 l
111.84 540.24 l
111.12 540.24 l
S
111.12 540.24 m
110.64 540 l
110.16 539.52 l
109.92 538.8 l
109.44 537.12 l
109.44 536.16 l
109.92 534.24 l
110.16 533.76 l
110.64 533.28 l
111.12 533.04 l
111.84 533.04 m
112.56 533.28 l
113.04 533.76 l
113.28 534.24 l
113.76 536.16 l
113.76 537.12 l
113.28 538.8 l
113.04 539.52 l
112.56 540 l
111.84 540.24 l
85.92 554.64 m
86.64 554.88 l
87.6 556.08 l
87.6 548.64 l
87.36 555.6 m
87.36 548.64 l
85.92 548.64 m
89.04 548.64 l
93.84 556.08 m
92.88 555.6 l
92.16 554.64 l
91.92 552.96 l
91.92 551.76 l
92.16 550.08 l
92.88 549.12 l
93.84 548.64 l
94.56 548.64 l
95.76 549.12 l
96.24 550.08 l
96.72 551.76 l
96.72 552.96 l
96.24 554.64 l
95.76 555.6 l
94.56 556.08 l
93.84 556.08 l
93.12 555.6 l
92.88 555.36 l
92.64 554.64 l
92.16 552.96 l
92.16 551.76 l
92.64 550.08 l
92.88 549.36 l
93.12 549.12 l
93.84 548.64 l
94.56 548.64 m
95.28 549.12 l
95.76 549.36 l
96 550.08 l
96.24 551.76 l
96.24 552.96 l
96 554.64 l
95.76 555.36 l
95.28 555.6 l
94.56 556.08 l
99.36 549.36 m
99.12 549.12 l
99.36 548.64 l
99.84 549.12 l
99.36 549.36 l
104.4 556.08 m
103.2 555.6 l
102.48 554.64 l
102.24 552.96 l
102.24 551.76 l
102.48 550.08 l
103.2 549.12 l
104.4 548.64 l
104.88 548.64 l
106.08 549.12 l
106.8 550.08 l
107.04 551.76 l
107.04 552.96 l
106.8 554.64 l
106.08 555.6 l
104.88 556.08 l
104.4 556.08 l
103.68 555.6 l
103.2 555.36 l
102.96 554.64 l
102.48 552.96 l
102.48 551.76 l
102.96 550.08 l
103.2 549.36 l
103.68 549.12 l
104.4 548.64 l
104.88 548.64 m
105.6 549.12 l
106.08 549.36 l
106.32 550.08 l
106.8 551.76 l
106.8 552.96 l
106.32 554.64 l
106.08 555.36 l
105.6 555.6 l
104.88 556.08 l
111.12 556.08 m
110.16 555.6 l
109.44 554.64 l
109.2 552.96 l
109.2 551.76 l
109.44 550.08 l
110.16 549.12 l
111.12 548.64 l
111.84 548.64 l
113.04 549.12 l
113.76 550.08 l
114 551.76 l
114 552.96 l
113.76 554.64 l
113.04 555.6 l
111.84 556.08 l
111.12 556.08 l
110.64 555.6 l
110.16 555.36 l
109.92 554.64 l
109.44 552.96 l
109.44 551.76 l
109.92 550.08 l
110.16 549.36 l
110.64 549.12 l
111.12 548.64 l
S
111.84 548.64 m
112.56 549.12 l
113.04 549.36 l
113.28 550.08 l
113.76 551.76 l
113.76 552.96 l
113.28 554.64 l
113.04 555.36 l
112.56 555.6 l
111.84 556.08 l
438.96 396 m
451.44 396 l
451.44 411.84 m
447.12 411.84 l
447.12 420.96 m
451.44 420.96 l
451.44 427.44 m
447.12 427.44 l
438.96 432.48 m
451.44 432.48 l
451.44 436.8 m
447.12 436.8 l
447.12 440.16 m
451.44 440.16 l
451.44 443.28 m
447.12 443.28 l
447.12 445.92 m
451.44 445.92 l
451.44 448.32 m
438.96 448.32 l
447.12 463.92 m
451.44 463.92 l
451.44 473.28 m
447.12 473.28 l
447.12 479.76 m
451.44 479.76 l
451.44 484.8 m
438.96 484.8 l
447.12 488.88 m
451.44 488.88 l
451.44 492.48 m
447.12 492.48 l
447.12 495.6 m
451.44 495.6 l
451.44 498.24 m
447.12 498.24 l
438.96 500.64 m
451.44 500.64 l
451.44 516.24 m
447.12 516.24 l
447.12 525.6 m
451.44 525.6 l
451.44 532.08 m
447.12 532.08 l
438.96 537.12 m
451.44 537.12 l
451.44 541.2 m
447.12 541.2 l
447.12 544.8 m
451.44 544.8 l
451.44 547.92 m
447.12 547.92 l
447.12 550.56 m
451.44 550.56 l
451.44 552.96 m
438.96 552.96 l
S
[1 0 0] SC
119.04 552.96 m
123.12 552.96 l
127.2 552.72 l
131.04 552.48 l
135.12 552 l
138.96 551.52 l
142.8 550.56 l
146.88 549.6 l
150.96 548.4 l
154.8 547.2 l
158.88 546 l
166.56 543.12 l
170.64 541.44 l
174.48 539.76 l
178.56 538.08 l
182.4 536.64 l
186.48 534.96 l
190.32 533.28 l
194.4 531.6 l
198.24 530.16 l
202.08 528.48 l
206.16 526.8 l
210 525.12 l
214.08 523.68 l
217.92 522 l
222 520.56 l
225.84 518.88 l
229.92 517.44 l
233.76 516 l
237.84 514.56 l
241.68 513.12 l
245.76 511.44 l
249.6 510 l
253.68 508.56 l
257.52 507.36 l
261.6 505.92 l
265.44 504.48 l
269.52 503.04 l
273.36 501.84 l
277.2 500.4 l
281.28 499.2 l
285.36 497.76 l
289.2 496.56 l
293.04 495.12 l
297.12 493.92 l
300.96 492.72 l
305.04 491.52 l
308.88 490.32 l
312.96 489.12 l
316.8 487.92 l
320.88 486.72 l
324.72 485.52 l
328.8 484.32 l
332.64 483.12 l
336.72 482.16 l
340.56 480.96 l
344.64 479.76 l
348.48 478.8 l
352.56 477.6 l
356.4 476.64 l
360.48 475.44 l
364.32 474.48 l
368.16 473.28 l
372.24 472.32 l
376.08 471.36 l
380.16 470.4 l
384 469.2 l
388.08 468.24 l
391.92 467.28 l
396 466.32 l
399.84 465.36 l
403.92 464.4 l
407.76 463.44 l
411.84 462.48 l
415.68 461.52 l
419.76 460.56 l
423.6 459.6 l
427.68 458.64 l
431.52 457.68 l
435.6 456.72 l
439.44 456 l
443.52 455.04 l
447.36 454.08 l
451.44 453.12 l
S
[0 0 0] SC
52.56 297.12 m
52.56 291.84 l
53.04 290.4 l
54.48 289.2 l
56.16 288.72 l
57.6 288.72 l
58.8 289.2 l
59.28 289.68 l
59.76 290.88 l
59.76 291.84 l
59.28 293.52 l
57.6 294.48 l
56.16 294.96 l
54.48 294.96 l
53.52 294.48 l
53.04 294 l
52.56 292.8 l
52.56 291.84 m
53.04 290.88 l
54.48 289.68 l
56.16 289.2 l
58.32 289.2 l
59.28 289.68 l
59.76 291.84 m
59.28 292.8 l
57.6 294 l
56.16 294.48 l
54 294.48 l
53.04 294 l
53.04 297.12 l
56.64 300.48 m
63.84 300.48 l
56.64 300.96 m
63.84 300.96 l
56.64 305.04 m
63.84 305.04 l
56.64 305.28 m
63.84 305.28 l
56.64 299.52 m
56.64 301.92 l
56.64 304.08 m
56.64 306.48 l
60.24 300.96 m
60.24 305.04 l
63.84 299.52 m
63.84 301.92 l
63.84 304.08 m
63.84 306.48 l
63.84 308.88 m
63.6 308.4 l
63.36 308.88 l
63.6 309.12 l
64.32 309.12 l
65.04 308.88 l
65.28 308.4 l
56.64 312.24 m
57.12 312 l
57.36 312.24 l
57.12 312.72 l
56.64 312.24 l
59.04 312.24 m
63.84 312.24 l
59.04 312.72 m
63.84 312.72 l
59.04 311.28 m
59.04 312.72 l
63.84 311.28 m
63.84 313.68 l
46.8 325.44 m
63.36 316.08 l
52.56 336.48 m
52.56 331.2 l
53.04 329.52 l
54.48 328.56 l
56.16 328.08 l
57.6 328.08 l
58.8 328.56 l
59.28 329.04 l
59.76 330.24 l
59.76 331.2 l
59.28 332.64 l
57.6 333.84 l
56.16 334.32 l
54.48 334.32 l
53.52 333.84 l
53.04 333.36 l
52.56 332.16 l
52.56 331.2 m
53.04 330.24 l
54.48 329.04 l
56.16 328.56 l
58.32 328.56 l
59.28 329.04 l
59.76 331.2 m
59.28 332.16 l
57.6 333.36 l
56.16 333.84 l
54 333.84 l
53.04 333.36 l
53.04 336.48 l
56.64 339.84 m
63.84 339.84 l
56.64 340.32 m
63.84 340.32 l
56.64 344.4 m
63.84 344.4 l
56.64 344.64 m
63.84 344.64 l
56.64 338.88 m
56.64 341.28 l
56.64 343.2 m
56.64 345.84 l
60.24 340.32 m
60.24 344.4 l
63.84 338.88 m
63.84 341.28 l
63.84 343.2 m
63.84 345.84 l
246.96 222.72 m
246.96 215.28 l
247.44 222.72 m
247.44 215.28 l
247.44 221.04 m
248.4 222.24 l
250.08 222.72 l
251.04 222.72 l
252.72 222.24 l
253.2 221.04 l
253.2 215.28 l
S
251.04 222.72 m
252 222.24 l
252.72 221.04 l
252.72 215.28 l
253.2 221.04 m
254.16 222.24 l
255.84 222.72 l
256.8 222.72 l
258.24 222.24 l
258.96 221.04 l
258.96 215.28 l
256.8 222.72 m
257.76 222.24 l
258.24 221.04 l
258.24 215.28 l
245.28 222.72 m
247.44 222.72 l
245.28 215.28 m
248.88 215.28 l
251.04 215.28 m
254.64 215.28 l
256.8 215.28 m
260.4 215.28 l
264 218.4 m
264 211.2 l
264.24 218.4 m
264.24 211.2 l
268.32 218.4 m
268.32 211.2 l
268.8 218.4 m
268.8 211.2 l
262.8 218.4 m
265.2 218.4 l
267.36 218.4 m
269.76 218.4 l
264.24 215.04 m
268.32 215.04 l
262.8 211.2 m
265.2 211.2 l
267.36 211.2 m
269.76 211.2 l
281.52 228.48 m
281.52 211.68 l
282 228.48 m
282 211.68 l
281.52 228.48 m
285.12 228.48 l
281.52 211.68 m
285.12 211.68 l
295.68 224.64 m
296.16 223.2 l
296.16 226.32 l
295.68 224.64 l
294.48 225.84 l
293.04 226.32 l
292.08 226.32 l
290.4 225.84 l
289.44 224.64 l
288.24 222.24 l
288.24 219.6 l
288.96 217.92 l
289.44 216.96 l
290.4 216 l
292.08 215.28 l
293.04 215.28 l
294.48 216 l
295.68 216.96 l
292.08 226.32 m
290.88 225.84 l
289.92 224.64 l
289.44 223.68 l
288.96 222.24 l
288.96 219.6 l
289.44 217.92 l
289.92 216.96 l
290.88 216 l
292.08 215.28 l
295.68 219.6 m
295.68 215.28 l
296.16 219.6 m
296.16 215.28 l
294 219.6 m
297.6 219.6 l
300.72 219.6 m
306.96 219.6 l
306.96 220.56 l
306.48 221.52 l
306 222.24 l
305.04 222.72 l
303.36 222.72 l
301.92 222.24 l
300.72 221.04 l
300.24 219.6 l
300.24 218.4 l
300.72 216.96 l
301.92 216 l
303.36 215.28 l
304.32 215.28 l
306 216 l
306.96 216.96 l
306.48 219.6 m
306.48 221.04 l
306 222.24 l
303.36 222.72 m
302.4 222.24 l
301.2 221.04 l
300.72 219.6 l
300.72 218.4 l
301.2 216.96 l
302.4 216 l
303.36 215.28 l
310.08 226.32 m
313.68 215.28 l
310.56 226.32 m
313.68 216.96 l
317.52 226.32 m
313.68 215.28 l
309.12 226.32 m
312.24 226.32 l
315.36 226.32 m
318.48 226.32 l
323.76 228.48 m
323.76 211.68 l
324.24 228.48 m
324.24 211.68 l
320.64 228.48 m
324.24 228.48 l
320.64 211.68 m
324.24 211.68 l
S
119.04 250.56 332.4 124.56 re
S
[1 0 0] SC
119.04 255.36 m
123.12 255.12 l
126.96 255.12 l
131.04 254.88 l
142.8 254.88 l
146.88 255.12 l
150.72 255.12 l
154.8 255.36 l
158.64 255.6 l
162.72 255.84 l
166.56 256.08 l
170.64 256.32 l
174.48 256.56 l
178.56 256.8 l
182.4 257.04 l
186.48 257.28 l
190.32 257.76 l
194.4 258 l
198.24 258.48 l
202.32 258.72 l
206.16 258.96 l
210 259.44 l
214.08 259.92 l
217.92 260.16 l
222 260.64 l
225.84 261.12 l
229.92 261.6 l
233.76 262.08 l
237.84 262.56 l
241.68 263.04 l
245.76 263.52 l
249.6 264 l
253.68 264.48 l
257.52 265.2 l
261.6 265.68 l
265.44 266.4 l
269.52 266.88 l
273.36 267.6 l
277.44 268.32 l
281.28 269.04 l
285.36 269.76 l
289.2 270.48 l
293.28 271.2 l
297.12 272.16 l
300.96 272.88 l
305.04 273.84 l
308.88 274.56 l
312.96 275.52 l
316.8 276.48 l
320.88 277.44 l
324.72 278.64 l
328.8 279.6 l
332.64 280.56 l
336.72 281.76 l
340.56 282.96 l
344.64 284.16 l
348.48 285.36 l
352.56 286.56 l
356.4 288 l
360.48 289.2 l
364.32 290.64 l
368.4 292.08 l
372.24 293.52 l
376.32 295.2 l
380.16 296.64 l
384.24 298.32 l
388.08 300 l
392.16 301.68 l
396 303.6 l
400.08 305.28 l
403.92 307.2 l
408 309.12 l
411.84 311.28 l
415.92 313.2 l
423.6 317.52 l
427.68 319.68 l
431.52 322.08 l
439.68 326.88 l
447.36 331.68 l
451.44 334.32 l
S
[0 0 0] SC
128.64 250.56 m
128.64 254.88 l
147.6 254.88 m
147.6 250.56 l
166.56 250.56 m
166.56 263.04 l
185.52 254.88 m
185.52 250.56 l
204.48 250.56 m
204.48 254.88 l
223.44 254.88 m
223.44 250.56 l
242.64 250.56 m
242.64 254.88 l
261.6 263.04 m
261.6 250.56 l
280.56 250.56 m
280.56 254.88 l
299.52 254.88 m
299.52 250.56 l
318.48 250.56 m
318.48 254.88 l
337.44 254.88 m
337.44 250.56 l
356.4 250.56 m
356.4 263.04 l
375.36 254.88 m
375.36 250.56 l
394.32 250.56 m
394.32 254.88 l
413.28 254.88 m
413.28 250.56 l
432.24 250.56 m
432.24 254.88 l
160.32 243.12 m
160.32 236.64 l
160.8 243.84 m
160.8 236.64 l
160.8 243.84 m
156.96 238.56 l
162.48 238.56 l
159.36 236.64 m
161.76 236.64 l
166.32 243.84 m
165.12 243.6 l
164.64 242.4 l
164.16 240.72 l
164.16 239.76 l
164.64 237.84 l
165.12 236.88 l
166.32 236.64 l
167.04 236.64 l
168 236.88 l
168.72 237.84 l
168.96 239.76 l
168.96 240.72 l
168.72 242.4 l
168 243.6 l
167.04 243.84 l
166.32 243.84 l
165.6 243.6 l
165.12 243.12 l
164.88 242.4 l
164.64 240.72 l
164.64 239.76 l
164.88 237.84 l
165.12 237.36 l
165.6 236.88 l
166.32 236.64 l
167.04 236.64 m
167.76 236.88 l
168.24 237.84 l
168.72 239.76 l
168.72 240.72 l
168.24 242.4 l
168 243.12 l
167.76 243.6 l
167.04 243.84 l
173.28 243.84 m
172.08 243.6 l
171.36 242.4 l
171.12 240.72 l
171.12 239.76 l
171.36 237.84 l
172.08 236.88 l
173.28 236.64 l
174 236.64 l
174.96 236.88 l
175.68 237.84 l
175.92 239.76 l
175.92 240.72 l
175.68 242.4 l
174.96 243.6 l
174 243.84 l
173.28 243.84 l
172.56 243.6 l
172.08 243.12 l
171.84 242.4 l
171.36 240.72 l
171.36 239.76 l
171.84 237.84 l
172.08 237.36 l
172.56 236.88 l
173.28 236.64 l
174 236.64 m
174.48 236.88 l
174.96 237.36 l
175.2 237.84 l
175.68 239.76 l
175.68 240.72 l
175.2 242.4 l
174.96 243.12 l
174.48 243.6 l
174 243.84 l
256.32 242.88 m
256.08 242.4 l
256.32 242.16 l
256.56 242.4 l
256.56 242.88 l
256.32 243.6 l
255.6 243.84 l
254.64 243.84 l
253.44 243.6 l
252.48 242.16 l
252.24 240.72 l
252.24 238.56 l
252.48 237.6 l
253.2 236.88 l
254.16 236.64 l
254.88 236.64 l
256.08 236.88 l
256.56 237.6 l
257.04 238.56 l
257.04 239.04 l
256.56 240 l
256.08 240.72 l
254.88 240.96 l
254.64 240.96 l
253.44 240.72 l
252.96 240 l
252.48 239.04 l
S
254.64 243.84 m
253.92 243.6 l
253.2 242.88 l
252.48 240.72 l
252.48 238.56 l
252.96 237.6 l
253.44 236.88 l
254.16 236.64 l
254.88 236.64 m
255.6 236.88 l
256.32 237.6 l
256.56 238.56 l
256.56 239.04 l
256.32 240 l
255.6 240.72 l
254.88 240.96 l
261.12 243.84 m
260.16 243.6 l
259.44 242.4 l
259.2 240.72 l
259.2 239.76 l
259.44 237.84 l
260.16 236.88 l
261.12 236.64 l
261.84 236.64 l
262.8 236.88 l
263.52 237.84 l
264 239.76 l
264 240.72 l
263.52 242.4 l
262.8 243.6 l
261.84 243.84 l
261.12 243.84 l
260.4 243.6 l
260.16 243.12 l
259.68 242.4 l
259.44 240.72 l
259.44 239.76 l
259.68 237.84 l
260.16 237.36 l
260.4 236.88 l
261.12 236.64 l
261.84 236.64 m
262.56 236.88 l
262.8 237.36 l
263.28 237.84 l
263.52 239.76 l
263.52 240.72 l
263.28 242.4 l
262.8 243.12 l
262.56 243.6 l
261.84 243.84 l
268.08 243.84 m
267.12 243.6 l
266.4 242.4 l
265.92 240.72 l
265.92 239.76 l
266.4 237.84 l
267.12 236.88 l
268.08 236.64 l
268.8 236.64 l
269.76 236.88 l
270.48 237.84 l
270.96 239.76 l
270.96 240.72 l
270.48 242.4 l
269.76 243.6 l
268.8 243.84 l
268.08 243.84 l
267.36 243.6 l
267.12 243.12 l
266.64 242.4 l
266.4 240.72 l
266.4 239.76 l
266.64 237.84 l
267.12 237.36 l
267.36 236.88 l
268.08 236.64 l
268.8 236.64 m
269.52 236.88 l
269.76 237.36 l
270.24 237.84 l
270.48 239.76 l
270.48 240.72 l
270.24 242.4 l
269.76 243.12 l
269.52 243.6 l
268.8 243.84 l
348.72 243.84 m
347.76 243.6 l
347.52 242.88 l
347.52 241.68 l
347.76 240.96 l
348.72 240.72 l
350.16 240.72 l
351.12 240.96 l
351.6 241.68 l
351.6 242.88 l
351.12 243.6 l
350.16 243.84 l
348.72 243.84 l
348 243.6 l
347.76 242.88 l
347.76 241.68 l
348 240.96 l
348.72 240.72 l
350.16 240.72 m
350.88 240.96 l
351.12 241.68 l
351.12 242.88 l
350.88 243.6 l
350.16 243.84 l
348.72 240.72 m
347.76 240.48 l
347.52 240 l
347.04 239.28 l
347.04 237.84 l
347.52 237.36 l
347.76 236.88 l
348.72 236.64 l
350.16 236.64 l
351.12 236.88 l
351.6 237.36 l
351.84 237.84 l
351.84 239.28 l
351.6 240 l
351.12 240.48 l
350.16 240.72 l
S
348.72 240.72 m
348 240.48 l
347.76 240 l
347.52 239.28 l
347.52 237.84 l
348 236.88 l
348.72 236.64 l
350.16 236.64 m
350.88 236.88 l
351.12 237.36 l
351.6 237.84 l
351.6 239.28 l
351.12 240 l
350.88 240.48 l
350.16 240.72 l
356.16 243.84 m
354.96 243.6 l
354.24 242.4 l
354 240.72 l
354 239.76 l
354.24 237.84 l
354.96 236.88 l
356.16 236.64 l
356.88 236.64 l
357.84 236.88 l
358.56 237.84 l
358.8 239.76 l
358.8 240.72 l
358.56 242.4 l
357.84 243.6 l
356.88 243.84 l
356.16 243.84 l
355.44 243.6 l
354.96 243.12 l
354.72 242.4 l
354.24 240.72 l
354.24 239.76 l
354.72 237.84 l
354.96 237.36 l
355.44 236.88 l
356.16 236.64 l
356.88 236.64 m
357.36 236.88 l
357.84 237.36 l
358.08 237.84 l
358.56 239.76 l
358.56 240.72 l
358.08 242.4 l
357.84 243.12 l
357.36 243.6 l
356.88 243.84 l
363.12 243.84 m
361.92 243.6 l
361.2 242.4 l
360.96 240.72 l
360.96 239.76 l
361.2 237.84 l
361.92 236.88 l
363.12 236.64 l
363.6 236.64 l
364.8 236.88 l
365.52 237.84 l
365.76 239.76 l
365.76 240.72 l
365.52 242.4 l
364.8 243.6 l
363.6 243.84 l
363.12 243.84 l
362.4 243.6 l
361.92 243.12 l
361.68 242.4 l
361.2 240.72 l
361.2 239.76 l
361.68 237.84 l
361.92 237.36 l
362.4 236.88 l
363.12 236.64 l
363.6 236.64 m
364.32 236.88 l
364.8 237.36 l
365.04 237.84 l
365.52 239.76 l
365.52 240.72 l
365.04 242.4 l
364.8 243.12 l
364.32 243.6 l
363.6 243.84 l
439.44 242.4 m
440.16 242.88 l
441.36 243.84 l
441.36 236.64 l
440.88 243.6 m
440.88 236.64 l
439.44 236.64 m
442.56 236.64 l
447.6 243.84 m
446.4 243.6 l
445.68 242.4 l
445.44 240.72 l
445.44 239.76 l
445.68 237.84 l
446.4 236.88 l
447.6 236.64 l
448.32 236.64 l
449.28 236.88 l
450 237.84 l
450.24 239.76 l
450.24 240.72 l
450 242.4 l
449.28 243.6 l
448.32 243.84 l
447.6 243.84 l
446.88 243.6 l
446.4 243.12 l
446.16 242.4 l
445.68 240.72 l
445.68 239.76 l
446.16 237.84 l
446.4 237.36 l
446.88 236.88 l
447.6 236.64 l
448.32 236.64 m
448.8 236.88 l
449.28 237.36 l
449.52 237.84 l
450 239.76 l
450 240.72 l
449.52 242.4 l
449.28 243.12 l
448.8 243.6 l
448.32 243.84 l
S
454.56 243.84 m
453.36 243.6 l
452.64 242.4 l
452.4 240.72 l
452.4 239.76 l
452.64 237.84 l
453.36 236.88 l
454.56 236.64 l
455.04 236.64 l
456.24 236.88 l
456.96 237.84 l
457.2 239.76 l
457.2 240.72 l
456.96 242.4 l
456.24 243.6 l
455.04 243.84 l
454.56 243.84 l
453.84 243.6 l
453.36 243.12 l
453.12 242.4 l
452.64 240.72 l
452.64 239.76 l
453.12 237.84 l
453.36 237.36 l
453.84 236.88 l
454.56 236.64 l
455.04 236.64 m
455.76 236.88 l
456.24 237.36 l
456.48 237.84 l
456.96 239.76 l
456.96 240.72 l
456.48 242.4 l
456.24 243.12 l
455.76 243.6 l
455.04 243.84 l
461.28 243.84 m
460.32 243.6 l
459.6 242.4 l
459.36 240.72 l
459.36 239.76 l
459.6 237.84 l
460.32 236.88 l
461.28 236.64 l
462 236.64 l
463.2 236.88 l
463.92 237.84 l
464.16 239.76 l
464.16 240.72 l
463.92 242.4 l
463.2 243.6 l
462 243.84 l
461.28 243.84 l
460.8 243.6 l
460.32 243.12 l
460.08 242.4 l
459.6 240.72 l
459.6 239.76 l
460.08 237.84 l
460.32 237.36 l
460.8 236.88 l
461.28 236.64 l
462 236.64 m
462.72 236.88 l
463.2 237.36 l
463.44 237.84 l
463.92 239.76 l
463.92 240.72 l
463.44 242.4 l
463.2 243.12 l
462.72 243.6 l
462 243.84 l
128.64 371.04 m
128.64 375.12 l
147.6 375.12 m
147.6 371.04 l
166.56 362.88 m
166.56 375.12 l
185.52 375.12 m
185.52 371.04 l
204.48 371.04 m
204.48 375.12 l
223.44 375.12 m
223.44 371.04 l
242.64 371.04 m
242.64 375.12 l
261.6 375.12 m
261.6 362.88 l
280.56 371.04 m
280.56 375.12 l
299.52 375.12 m
299.52 371.04 l
318.48 371.04 m
318.48 375.12 l
337.44 375.12 m
337.44 371.04 l
356.4 362.88 m
356.4 375.12 l
375.36 375.12 m
375.36 371.04 l
394.32 371.04 m
394.32 375.12 l
413.28 375.12 m
413.28 371.04 l
432.24 371.04 m
432.24 375.12 l
119.04 250.56 m
123.36 250.56 l
131.52 256.56 m
119.04 256.56 l
119.04 262.56 m
123.36 262.56 l
123.36 268.56 m
119.04 268.56 l
119.04 274.32 m
123.36 274.32 l
123.36 280.32 m
119.04 280.32 l
119.04 286.32 m
131.52 286.32 l
123.36 292.08 m
119.04 292.08 l
119.04 298.08 m
123.36 298.08 l
123.36 304.08 m
119.04 304.08 l
119.04 310.08 m
123.36 310.08 l
S
131.52 315.84 m
119.04 315.84 l
119.04 321.84 m
123.36 321.84 l
123.36 327.84 m
119.04 327.84 l
119.04 333.6 m
123.36 333.6 l
123.36 339.6 m
119.04 339.6 l
119.04 345.6 m
131.52 345.6 l
123.36 351.6 m
119.04 351.6 l
119.04 357.36 m
123.36 357.36 l
123.36 363.36 m
119.04 363.36 l
119.04 369.36 m
123.36 369.36 l
110.16 258.24 m
110.88 258.72 l
111.84 259.68 l
111.84 252.48 l
111.6 259.44 m
111.6 252.48 l
110.16 252.48 m
113.28 252.48 l
109.44 288 m
109.92 287.76 l
109.44 287.28 l
109.2 287.76 l
109.2 288 l
109.44 288.72 l
110.88 289.44 l
112.32 289.44 l
113.28 288.96 l
113.52 288.72 l
114 288 l
114 287.28 l
113.52 286.56 l
112.56 285.84 l
110.88 285.12 l
110.16 284.88 l
109.44 284.16 l
109.2 283.2 l
109.2 282 l
112.32 289.44 m
113.04 288.96 l
113.28 288.72 l
113.52 288 l
113.52 287.28 l
113.28 286.56 l
112.32 285.84 l
110.88 285.12 l
109.2 282.72 m
109.44 283.2 l
110.16 283.2 l
111.84 282.48 l
113.04 282.48 l
113.52 282.72 l
114 283.2 l
110.16 283.2 m
111.84 282 l
113.28 282 l
113.52 282.48 l
114 283.2 l
114 283.92 l
109.44 317.76 m
109.92 317.28 l
109.44 317.04 l
109.2 317.28 l
109.2 317.76 l
109.44 318.24 l
109.92 318.72 l
110.88 318.96 l
112.32 318.96 l
113.28 318.72 l
113.52 318 l
113.52 317.04 l
113.28 316.32 l
112.32 315.84 l
111.12 315.84 l
112.32 318.96 m
113.04 318.72 l
113.28 318 l
113.28 317.04 l
113.04 316.32 l
112.32 315.84 l
113.04 315.6 l
114 314.16 l
114 313.2 l
113.52 312.48 l
113.28 312 l
112.32 311.76 l
110.88 311.76 l
109.92 312 l
109.44 312.48 l
109.2 313.2 l
109.2 313.44 l
109.44 313.92 l
109.92 313.44 l
109.44 313.2 l
113.28 315.12 m
113.52 314.16 l
113.52 313.2 l
113.28 312.48 l
113.04 312 l
112.32 311.76 l
112.32 348 m
112.32 341.52 l
112.56 348.72 m
112.56 341.52 l
112.56 348.72 m
108.72 343.44 l
114.24 343.44 l
111.12 341.52 m
113.52 341.52 l
109.92 378.24 m
109.2 374.88 l
109.92 375.6 l
110.88 375.84 l
111.84 375.84 l
113.04 375.6 l
113.52 374.88 l
114 373.92 l
114 373.2 l
113.52 372.24 l
113.04 371.52 l
111.84 371.04 l
110.88 371.04 l
109.44 371.76 l
109.2 372.48 l
109.2 372.72 l
109.44 373.2 l
109.92 372.72 l
109.44 372.48 l
S
111.84 375.84 m
112.56 375.6 l
113.28 374.88 l
113.52 373.92 l
113.52 373.2 l
113.28 372.24 l
112.56 371.52 l
111.84 371.04 l
109.92 378.24 m
113.28 378.24 l
109.92 378 m
111.6 378 l
113.28 378.24 l
447.12 250.56 m
451.44 250.56 l
451.44 256.56 m
438.96 256.56 l
447.12 262.56 m
451.44 262.56 l
451.44 268.56 m
447.12 268.56 l
447.12 274.32 m
451.44 274.32 l
451.44 280.32 m
447.12 280.32 l
438.96 286.32 m
451.44 286.32 l
451.44 292.08 m
447.12 292.08 l
447.12 298.08 m
451.44 298.08 l
451.44 304.08 m
447.12 304.08 l
447.12 310.08 m
451.44 310.08 l
451.44 315.84 m
438.96 315.84 l
447.12 321.84 m
451.44 321.84 l
451.44 327.84 m
447.12 327.84 l
447.12 333.6 m
451.44 333.6 l
451.44 339.6 m
447.12 339.6 l
438.96 345.6 m
451.44 345.6 l
451.44 351.6 m
447.12 351.6 l
447.12 357.36 m
451.44 357.36 l
451.44 363.36 m
447.12 363.36 l
447.12 369.36 m
451.44 369.36 l
S
[9.36] 0 d
[1 0 1] SC
119.04 256.56 m
451.44 256.56 l
S
Q
Q
showpage
%%PageTrailer
pdfEndPage
%%Trailer
end
%%DocumentSuppliedResources:
%%EOF
