%!PS-Adobe-2.0 EPSF-2.0
%%BoundingBox: 81 198 464 390
%%HiResBoundingBox: 81.500000 198.500000 464.000000 389.500000
%...................................
%%Creator: GPL Ghostscript 870 (pswrite)
%%CreationDate: 2013/02/14 17:37:42
%%DocumentData: Clean7Bit
%%LanguageLevel: 2
%%EndComments
% EPSF created by ps2eps 1.64
%%BeginProlog
save
countdictstack
mark
newpath
/showpage {} def
/setpagedevice {pop} def
%%EndProlog
%%Page 1 1
%%BeginProlog
% This copyright applies to everything between here and the %%EndProlog:
% Copyright (C) 2009 Artifex Software, Inc.  All rights reserved.
%%BeginResource: procset GS_pswrite_2_0_1001 1.001 0
/GS_pswrite_2_0_1001 80 dict dup begin
/PageSize 2 array def/setpagesize{ PageSize aload pop 3 index eq exch
4 index eq and{ pop pop pop}{ PageSize dup  1
5 -1 roll put 0 4 -1 roll put dup null eq {false} {dup where} ifelse{ exch get exec}
{ pop/setpagedevice where
{ pop 1 dict dup /PageSize PageSize put setpagedevice}
{ /setpage where{ pop PageSize aload pop pageparams 3 {exch pop} repeat
setpage}if}ifelse}ifelse}ifelse} bind def
/!{bind def}bind def/#{load def}!/N/counttomark #
/rG{3{3 -1 roll 255 div}repeat setrgbcolor}!/G{255 div setgray}!/K{0 G}!
/r6{dup 3 -1 roll rG}!/r5{dup 3 1 roll rG}!/r3{dup rG}!
/w/setlinewidth #/J/setlinecap #
/j/setlinejoin #/M/setmiterlimit #/d/setdash #/i/setflat #
/m/moveto #/l/lineto #/c/rcurveto #
/p{N 2 idiv{N -2 roll rlineto}repeat}!
/P{N 0 gt{N -2 roll moveto p}if}!
/h{p closepath}!/H{P closepath}!
/lx{0 rlineto}!/ly{0 exch rlineto}!/v{0 0 6 2 roll c}!/y{2 copy c}!
/re{4 -2 roll m exch dup lx exch ly neg lx h}!
/^{3 index neg 3 index neg}!
/f{P fill}!/f*{P eofill}!/s{H stroke}!/S{P stroke}!
/q/gsave #/Q/grestore #/rf{re fill}!
/Y{P clip newpath}!/Y*{P eoclip newpath}!/rY{re Y}!
/|={pop exch 4 1 roll 1 array astore cvx 3 array astore cvx exch 1 index def exec}!
/|{exch string readstring |=}!
/+{dup type/nametype eq{2 index 7 add -3 bitshift 2 index mul}if}!
/@/currentfile #/${+ @ |}!
/B{{2 copy string{readstring pop}aload pop 4 array astore cvx
3 1 roll}repeat pop pop true}!
/Ix{[1 0 0 1 11 -2 roll exch neg exch neg]exch}!
/,{true exch Ix imagemask}!/If{false exch Ix imagemask}!/I{exch Ix image}!
/Ic{exch Ix false 3 colorimage}!
/F{/Columns counttomark 3 add -2 roll/Rows exch/K -1/BlackIs1 true>>
/CCITTFaxDecode filter}!/FX{<</EndOfBlock false F}!
/X{/ASCII85Decode filter}!/@X{@ X}!/&2{2 index 2 index}!
/@F{@ &2<<F}!/@C{@X &2 FX}!
/$X{+ @X |}!/&4{4 index 4 index}!/$F{+ @ &4<<F |}!/$C{+ @X &4 FX |}!
/IC{3 1 roll 10 dict begin 1{/ImageType/Interpolate/Decode/DataSource
/ImageMatrix/BitsPerComponent/Height/Width}{exch def}forall
currentdict end image}!
/~{@ read {pop} if}!
end def
%%EndResource
/pagesave null def
%%EndProlog
%%Page: 1 1
%%PageBoundingBox: 0 0 612 792
%%BeginPageSetup
GS_pswrite_2_0_1001 begin
612 792 /letter setpagesize
/pagesave save store 197 dict begin
0.1 0.1 scale
%%EndPageSetup
gsave mark
Q q
0 0 6120 7920 re
Y
4.8 w
1 J
1 j
K
2323.2 5863.2 -9.6 -12 -12 -14.4 -9.6 -21.6 -4.8 -26.4 0 -19.2 4.8 -26.4 9.6 -21.6 
12 -14.4 9.6 -9.6 P
2313.6 5851.2 -12 -19.2 -4.8 -16.8 -4.8 -26.4 0 -19.2 4.8 -26.4 4.8 -14.4 12 -21.6 P
2536.8 5841.6 -4.8 -4.8 4.8 -4.8 ^ ^ P
2541.6 5805.6 0 -93.6 -4.8 -9.6 -12 -4.8 -9.6 0 -4.8 4.8 0 4.8 4.8 4.8 
4.8 -4.8 ^ P
2536.8 5805.6 0 -93.6 -4.8 -9.6 -7.2 -4.8 P
2520 5805.6 21.6 0 P
2594.4 5820 9.6 7.2 14.4 14.4 0 -108 P
2613.6 5836.8 0 -103.2 P
2594.4 5733.6 45.6 0 P
2774.4 5805.6 0 -108 P
2781.6 5805.6 0 -108 P
2781.6 5788.8 9.6 12 9.6 4.8 12 0 14.4 -4.8 9.6 -12 7.2 -14.4 0 -9.6 
-7.2 -16.8 -9.6 -9.6 -14.4 -4.8 -12 0 -9.6 4.8 -9.6 9.6 P
2812.8 5805.6 9.6 -4.8 9.6 -12 4.8 -14.4 0 -9.6 -4.8 -16.8 -9.6 -9.6 -9.6 -4.8 P
2760 5805.6 21.6 0 P
2760 5697.6 36 0 P
2906.4 5841.6 0 -108 P
2911.2 5841.6 0 -108 P
2875.2 5841.6 -7.2 -31.2 0 31.2 79.2 0 ^ -4.8 31.2 P
2889.6 5733.6 36 0 P
3722.4 5805.6 31.2 -72 P
3727.2 5805.6 26.4 -62.4 P
3784.8 5805.6 -31.2 -72 P
3710.4 5805.6 31.2 0 P
3763.2 5805.6 31.2 0 P
3825.6 5841.6 0 -108 P
3830.4 5841.6 0 -108 P
3830.4 5788.8 9.6 12 12 4.8 9.6 0 14.4 -4.8 12 -12 4.8 -14.4 0 -9.6 
-4.8 -16.8 -12 -9.6 -14.4 -4.8 -9.6 0 -12 4.8 -9.6 9.6 P
3861.6 5805.6 9.6 -4.8 12 -12 4.8 -14.4 0 -9.6 -4.8 -16.8 -12 -9.6 -9.6 -4.8 P
3808.8 5841.6 21.6 0 P
3960 5836.8 -4.8 -4.8 4.8 -4.8 ^ 0 4.8 -4.8 4.8 -9.6 0 -12 -4.8 
-4.8 -9.6 0 -93.6 S
3950.4 5841.6 -4.8 -4.8 -7.2 -9.6 0 -93.6 P
3919.2 5805.6 40.8 0 P
3919.2 5733.6 36 0 P
4053.6 5788.8 -4.8 -4.8 4.8 -4.8 4.8 4.8 0 4.8 -9.6 12 -9.6 4.8 -16.8 0 
-14.4 -4.8 -12 -12 -4.8 -14.4 0 -9.6 4.8 -16.8 12 -9.6 14.4 -4.8 9.6 0 
16.8 4.8 9.6 9.6 P
4022.4 5805.6 -9.6 -4.8 -12 -12 -4.8 -14.4 0 -9.6 4.8 -16.8 12 -9.6 9.6 -4.8 P
4101.6 5805.6 0 -57.6 4.8 -9.6 14.4 -4.8 12 0 14.4 4.8 9.6 9.6 P
4106.4 5805.6 0 -57.6 4.8 -9.6 9.6 -4.8 P
4156.8 5805.6 0 -72 P
4164 5805.6 0 -72 P
4084.8 5805.6 21.6 0 P
4142.4 5805.6 21.6 0 P
4156.8 5733.6 21.6 0 P
4214.4 5841.6 0 -88.8 4.8 -14.4 12 -4.8 9.6 0 9.6 4.8 7.2 9.6 P
4219.2 5841.6 0 -88.8 7.2 -14.4 4.8 -4.8 P
4200 5805.6 40.8 0 P
4334.4 5796 4.8 9.6 0 -21.6 -4.8 12 -4.8 4.8 -9.6 4.8 -21.6 0 -9.6 -4.8 
-7.2 -4.8 0 -12 7.2 -4.8 9.6 -4.8 26.4 -9.6 9.6 -4.8 4.8 -7.2 P
4281.6 5788.8 7.2 -4.8 9.6 -4.8 26.4 -9.6 9.6 -4.8 4.8 -4.8 0 -16.8 -4.8 -4.8 
-9.6 -4.8 -21.6 0 -9.6 4.8 -4.8 4.8 -7.2 9.6 0 -19.2 7.2 9.6 P
1190.4 3544.8 4154.4 0 0 2076 ^ H
1190.4 3544.8 0 0 P
1358.4 3544.8 0 1291.2 165.6 0 0 408 165.6 0 0 105.6 165.6 0 0 14.4 
165.6 0 0 -36 168 0 0 -52.8 165.6 0 0 -93.6 165.6 0 0 -88.8 
165.6 0 0 -72 168 0 0 -81.6 165.6 0 0 -81.6 165.6 0 0 -72 
165.6 0 0 -76.8 165.6 0 0 -64.8 165.6 0 0 -134.4 168 0 0 -12 
165.6 0 0 -79.2 165.6 0 0 2.4 165.6 0 0 -220.8 168 0 0 103.2 
165.6 0 0 -21.6 165.6 0 0 -211.2 165.6 0 0 69.6 165.6 0 0 -180 
165.6 0 0 -415.2 S
1190.4 3544.8 0 124.8 P
1399.2 3585.6 0 -40.8 P
1605.6 3544.8 0 40.8 P
1814.4 3585.6 0 -40.8 P
2020.8 3544.8 0 40.8 P
2229.6 3669.6 0 -124.8 P
2436 3544.8 0 40.8 P
2644.8 3585.6 0 -40.8 P
2853.6 3544.8 0 40.8 P
3060 3585.6 0 -40.8 P
3266.4 3544.8 0 124.8 P
3475.2 3585.6 0 -40.8 P
3681.6 3544.8 0 40.8 P
3890.4 3585.6 0 -40.8 P
4099.2 3544.8 0 40.8 P
4305.6 3669.6 0 -124.8 P
4514.4 3544.8 0 40.8 P
4720.8 3585.6 0 -40.8 P
4929.6 3544.8 0 40.8 P
5136 3585.6 0 -40.8 P
5344.8 3544.8 0 124.8 P
1190.4 5496 0 124.8 P
1399.2 5620.8 0 -40.8 P
1605.6 5580 0 40.8 P
1814.4 5620.8 0 -40.8 P
2020.8 5580 0 40.8 P
2229.6 5620.8 0 -124.8 P
2436 5580 0 40.8 P
2644.8 5620.8 0 -40.8 P
2853.6 5580 0 40.8 P
3060 5620.8 0 -40.8 P
3266.4 5496 0 124.8 P
3475.2 5620.8 0 -40.8 P
3681.6 5580 0 40.8 P
3890.4 5620.8 0 -40.8 P
4099.2 5580 0 40.8 P
4305.6 5620.8 0 -124.8 P
4514.4 5580 0 40.8 P
4720.8 5620.8 0 -40.8 P
4929.6 5580 0 40.8 P
5136 5620.8 0 -40.8 P
5344.8 5496 0 124.8 P
1233.6 3636 -43.2 0 P
1190.4 3700.8 43.2 0 P
1233.6 3751.2 -43.2 0 P
1190.4 3792 43.2 0 P
1233.6 3828 -43.2 0 P
1190.4 3856.8 43.2 0 P
1233.6 3883.2 -43.2 0 P
1190.4 3907.2 124.8 0 P
1233.6 4063.2 -43.2 0 P
1190.4 4154.4 43.2 0 P
1233.6 4219.2 -43.2 0 P
1190.4 4269.6 43.2 0 P
1233.6 4310.4 -43.2 0 P
1190.4 4346.4 43.2 0 P
1233.6 4375.2 -43.2 0 P
1190.4 4404 43.2 0 P
1315.2 4425.6 -124.8 0 P
1190.4 4581.6 43.2 0 P
1233.6 4675.2 -43.2 0 P
1190.4 4740 43.2 0 P
1233.6 4790.4 -43.2 0 P
1190.4 4831.2 43.2 0 S
1233.6 4864.8 -43.2 0 P
1190.4 4896 43.2 0 P
1233.6 4922.4 -43.2 0 P
1190.4 4946.4 124.8 0 P
1233.6 5102.4 -43.2 0 P
1190.4 5193.6 43.2 0 P
1233.6 5258.4 -43.2 0 P
1190.4 5308.8 43.2 0 P
1233.6 5349.6 -43.2 0 P
1190.4 5383.2 43.2 0 P
1233.6 5414.4 -43.2 0 P
1190.4 5440.8 43.2 0 P
1315.2 5464.8 -124.8 0 P
1190.4 5620.8 43.2 0 P
818.4 3924 7.2 4.8 9.6 9.6 0 -72 P
832.8 3936 0 -69.6 P
818.4 3866.4 31.2 0 P
897.6 3938.4 -9.6 -2.4 -7.2 -12 -4.8 -16.8 0 -9.6 4.8 -16.8 7.2 -12 9.6 -2.4 
7.2 0 9.6 2.4 7.2 12 4.8 16.8 0 9.6 -4.8 16.8 -7.2 12 -9.6 2.4 
-7.2 0 -7.2 -2.4 -2.4 -4.8 -4.8 -7.2 -2.4 -16.8 0 -9.6 2.4 -16.8 4.8 -7.2 
2.4 -4.8 7.2 -2.4 P
904.8 3866.4 7.2 2.4 2.4 4.8 4.8 7.2 2.4 16.8 0 9.6 -2.4 16.8 -4.8 7.2 
-2.4 4.8 -7.2 2.4 P
950.4 3938.4 62.4 0 P
1068 3974.4 0 -67.2 P
1070.4 3979.2 0 -72 P
1070.4 3979.2 -38.4 -50.4 55.2 0 P
1056 3907.2 26.4 0 P
818.4 4444.8 7.2 2.4 9.6 9.6 0 -72 P
832.8 4454.4 0 -69.6 P
818.4 4384.8 31.2 0 P
897.6 4456.8 -9.6 -2.4 -7.2 -9.6 -4.8 -19.2 0 -9.6 4.8 -16.8 7.2 -9.6 9.6 -4.8 
7.2 0 9.6 4.8 7.2 9.6 4.8 16.8 0 9.6 -4.8 19.2 -7.2 9.6 -9.6 2.4 
-7.2 0 -7.2 -2.4 -2.4 -2.4 -4.8 -7.2 -2.4 -19.2 0 -9.6 2.4 -16.8 4.8 -7.2 
2.4 -2.4 7.2 -4.8 P
904.8 4384.8 7.2 4.8 2.4 2.4 4.8 7.2 2.4 16.8 0 9.6 -2.4 19.2 -4.8 7.2 
-2.4 2.4 -7.2 2.4 P
950.4 4456.8 62.4 0 S
1039.2 4485.6 4.8 -2.4 -4.8 -4.8 -2.4 4.8 0 2.4 2.4 7.2 14.4 7.2 14.4 0 
9.6 -4.8 4.8 -7.2 0 -9.6 -4.8 -7.2 -9.6 -2.4 -12 0 P
1068 4500 7.2 -4.8 2.4 -7.2 0 -9.6 -2.4 -7.2 -7.2 -2.4 7.2 -4.8 7.2 -7.2 
2.4 -4.8 0 -12 -2.4 -7.2 -14.4 -7.2 -14.4 0 -14.4 7.2 -2.4 7.2 0 4.8 
2.4 2.4 4.8 -2.4 -4.8 -4.8 P
1077.6 4461.6 4.8 -9.6 0 -12 -4.8 -7.2 -2.4 -2.4 -7.2 -4.8 P
818.4 4963.2 7.2 2.4 9.6 12 0 -74.4 P
832.8 4972.8 0 -69.6 P
818.4 4903.2 31.2 0 P
897.6 4977.6 -9.6 -4.8 -7.2 -9.6 -4.8 -16.8 0 -12 4.8 -16.8 7.2 -9.6 9.6 -4.8 
7.2 0 9.6 4.8 7.2 9.6 4.8 16.8 0 12 -4.8 16.8 -7.2 9.6 -9.6 4.8 
-7.2 0 -7.2 -4.8 -2.4 -2.4 -4.8 -7.2 -2.4 -16.8 0 -12 2.4 -16.8 4.8 -7.2 
2.4 -2.4 7.2 -4.8 P
904.8 4903.2 7.2 4.8 2.4 2.4 4.8 7.2 2.4 16.8 0 12 -2.4 16.8 -4.8 7.2 
-2.4 2.4 -7.2 4.8 P
950.4 4977.6 62.4 0 P
1039.2 5004 4.8 -2.4 -4.8 -4.8 -2.4 4.8 0 2.4 2.4 7.2 4.8 4.8 9.6 2.4 
14.4 0 9.6 -2.4 4.8 -4.8 2.4 -7.2 0 -7.2 -2.4 -7.2 -12 -4.8 -16.8 -7.2 
-7.2 -4.8 -7.2 -7.2 -2.4 -9.6 0 -9.6 P
1068 5018.4 7.2 -2.4 2.4 -4.8 4.8 -7.2 0 -7.2 -4.8 -7.2 -24 -12 P
1036.8 4953.6 2.4 2.4 7.2 0 16.8 -7.2 12 0 7.2 4.8 2.4 2.4 P
1046.4 4956 16.8 -9.6 14.4 0 4.8 2.4 2.4 7.2 0 7.2 P
818.4 5481.6 7.2 4.8 9.6 9.6 0 -72 S
832.8 5491.2 0 -67.2 P
818.4 5424 31.2 0 P
897.6 5496 -9.6 -4.8 -7.2 -9.6 -4.8 -16.8 0 -9.6 4.8 -19.2 7.2 -9.6 9.6 -2.4 
7.2 0 9.6 2.4 7.2 9.6 4.8 19.2 0 9.6 -4.8 16.8 -7.2 9.6 -9.6 4.8 
-7.2 0 -7.2 -4.8 -2.4 -2.4 -4.8 -7.2 -2.4 -16.8 0 -9.6 2.4 -19.2 4.8 -7.2 
2.4 -2.4 7.2 -2.4 P
904.8 5424 7.2 2.4 2.4 2.4 4.8 7.2 2.4 19.2 0 9.6 -2.4 16.8 -4.8 7.2 
-2.4 2.4 -7.2 4.8 P
950.4 5496 62.4 0 P
1046.4 5522.4 7.2 4.8 9.6 9.6 0 -72 P
1060.8 5534.4 0 -69.6 P
1046.4 5464.8 31.2 0 P
5344.8 3636 -43.2 0 P
5301.6 3700.8 43.2 0 P
5344.8 3751.2 -43.2 0 P
5301.6 3792 43.2 0 P
5344.8 3828 -43.2 0 P
5301.6 3856.8 43.2 0 P
5344.8 3883.2 -43.2 0 P
5220 3907.2 124.8 0 P
5344.8 4063.2 -43.2 0 P
5301.6 4154.4 43.2 0 P
5344.8 4219.2 -43.2 0 P
5301.6 4269.6 43.2 0 P
5344.8 4310.4 -43.2 0 P
5301.6 4346.4 43.2 0 P
5344.8 4375.2 -43.2 0 P
5301.6 4404 43.2 0 P
5344.8 4425.6 -124.8 0 P
5301.6 4581.6 43.2 0 P
5344.8 4675.2 -43.2 0 P
5301.6 4740 43.2 0 P
5344.8 4790.4 -43.2 0 P
5301.6 4831.2 43.2 0 P
5344.8 4864.8 -43.2 0 P
5301.6 4896 43.2 0 P
5344.8 4922.4 -43.2 0 S
5220 4946.4 124.8 0 P
5344.8 5102.4 -43.2 0 P
5301.6 5193.6 43.2 0 P
5344.8 5258.4 -43.2 0 P
5301.6 5308.8 43.2 0 P
5344.8 5349.6 -43.2 0 P
5301.6 5383.2 43.2 0 P
5344.8 5414.4 -43.2 0 P
5301.6 5440.8 43.2 0 P
5344.8 5464.8 -124.8 0 P
5301.6 5620.8 43.2 0 S
255 0 r3
1190.4 3544.8 0 0 P
1358.4 3544.8 0 1322.4 165.6 0 0 360 165.6 0 0 100.8 165.6 0 0 21.6 
165.6 0 0 -45.6 168 0 0 -62.4 165.6 0 0 -74.4 165.6 0 0 -79.2 
165.6 0 0 -93.6 168 0 0 -62.4 165.6 0 0 -74.4 165.6 0 0 -76.8 
165.6 0 0 -103.2 165.6 0 0 -105.6 165.6 0 0 -36 168 0 0 -100.8 
165.6 0 0 9.6 165.6 0 0 -81.6 165.6 0 0 -120 168 0 0 -52.8 
165.6 0 0 -31.2 165.6 0 0 -108 165.6 0 0 -72 165.6 0 0 64.8 
165.6 0 0 -499.2 S
K
2805.6 2080.8 -2.4 -2.4 2.4 -4.8 2.4 4.8 -2.4 2.4 P
2808 2056.8 0 -62.4 -2.4 -7.2 -7.2 -2.4 -7.2 0 -2.4 2.4 0 4.8 2.4 2.4 
4.8 -2.4 -4.8 -4.8 P
2805.6 2056.8 0 -62.4 -2.4 -7.2 -4.8 -2.4 P
2796 2056.8 12 0 P
2844 2066.4 7.2 4.8 9.6 9.6 0 -72 P
2858.4 2078.4 0 -69.6 P
2844 2008.8 31.2 0 P
2964 2056.8 0 -72 P
2968.8 2056.8 0 -72 P
2968.8 2047.2 7.2 7.2 7.2 2.4 7.2 0 9.6 -2.4 7.2 -7.2 2.4 -12 0 -4.8 
-2.4 -12 -7.2 -7.2 -9.6 -2.4 -7.2 0 -7.2 2.4 -7.2 7.2 P
2990.4 2056.8 4.8 -2.4 7.2 -7.2 4.8 -12 0 -4.8 -4.8 -12 -7.2 -7.2 -4.8 -2.4 P
2954.4 2056.8 14.4 0 P
2954.4 1984.8 24 0 P
3052.8 2080.8 0 -72 P
3055.2 2080.8 0 -72 P
3031.2 2080.8 -4.8 -19.2 0 19.2 52.8 0 ^ -2.4 19.2 P
3040.8 2008.8 24 0 P
1190.4 2299.2 4154.4 0 0 1245.6 ^ H
1190.4 2299.2 0 21.6 P
1190.4 2340 0 21.6 P
1190.4 2383.2 0 19.2 P
1190.4 2424 0 21.6 P
1190.4 2464.8 0 21.6 P
1190.4 2505.6 0 21.6 P
1190.4 2548.8 0 19.2 P
1190.4 2589.6 0 21.6 P
1190.4 2630.4 0 21.6 P
1190.4 2673.6 0 19.2 P
1190.4 2714.4 0 21.6 P
1190.4 2755.2 0 21.6 P
1190.4 2798.4 0 19.2 P
1190.4 2839.2 0 21.6 P
1190.4 2880 0 21.6 P
1190.4 2920.8 21.6 0 P
1233.6 2920.8 19.2 0 P
1274.4 2920.8 21.6 0 P
1315.2 2920.8 21.6 0 P
1358.4 2920.8 0 21.6 P
1358.4 2964 0 19.2 P
1358.4 3004.8 0 21.6 P
1375.2 3031.2 19.2 0 P
1416 3031.2 21.6 0 P
1456.8 3031.2 21.6 0 P
1497.6 3031.2 21.6 0 S
1524 3014.4 0 -21.6 P
1524 2971.2 0 -19.2 P
1524 2930.4 0 -21.6 P
1533.6 2899.2 21.6 0 P
1576.8 2899.2 19.2 0 P
1617.6 2899.2 19.2 0 P
1658.4 2899.2 21.6 0 P
1699.2 2899.2 21.6 0 P
1742.4 2899.2 19.2 0 P
1783.2 2899.2 19.2 0 P
1824 2899.2 21.6 0 P
1855.2 2889.6 0 -2.4 19.2 0 P
1893.6 2887.2 21.6 0 P
1936.8 2887.2 19.2 0 P
1977.6 2887.2 21.6 0 P
2018.4 2887.2 2.4 0 0 7.2 12 0 P
2054.4 2894.4 19.2 0 P
2095.2 2894.4 21.6 0 P
2136 2894.4 21.6 0 P
2179.2 2894.4 9.6 0 0 -12 P
2208 2882.4 21.6 0 P
2251.2 2882.4 19.2 0 P
2292 2882.4 21.6 0 P
2332.8 2882.4 21.6 0 P
2354.4 2904 0 19.2 P
2354.4 2944.8 0 21.6 P
2354.4 2985.6 21.6 0 P
2395.2 2985.6 21.6 0 P
2438.4 2985.6 19.2 0 P
2479.2 2985.6 21.6 0 P
2520 2985.6 0 21.6 P
2536.8 3012 21.6 0 P
2577.6 3012 21.6 0 P
2620.8 3012 19.2 0 P
2661.6 3012 21.6 0 P
2685.6 2995.2 0 -19.2 2.4 0 P
2709.6 2976 21.6 0 P
2750.4 2976 21.6 0 P
2793.6 2976 19.2 0 P
2834.4 2976 19.2 0 0 -2.4 P
2853.6 2954.4 0 -2.4 19.2 0 P
2892 2952 21.6 0 P
2935.2 2952 19.2 0 P
2976 2952 21.6 0 P
3016.8 2952 2.4 0 0 -2.4 14.4 0 P
3055.2 2949.6 21.6 0 P
3096 2949.6 21.6 0 P
3139.2 2949.6 19.2 0 P
3180 2949.6 4.8 0 0 -2.4 14.4 0 P
3220.8 2947.2 19.2 0 P
3261.6 2947.2 21.6 0 P
3302.4 2947.2 21.6 0 P
3345.6 2947.2 4.8 0 0 -14.4 P
3364.8 2925.6 19.2 0 P
3405.6 2925.6 21.6 0 P
3446.4 2925.6 21.6 0 P
3489.6 2925.6 19.2 0 P
3516 2911.2 0 -19.2 S
3532.8 2884.8 19.2 0 P
3573.6 2884.8 21.6 0 P
3614.4 2884.8 21.6 0 P
3657.6 2884.8 19.2 0 P
3681.6 2901.6 0 19.2 P
3681.6 2942.4 0 21.6 P
3681.6 2983.2 0 21.6 P
3681.6 3024 0 4.8 19.2 0 P
3722.4 3028.8 19.2 0 P
3763.2 3028.8 21.6 0 P
3804 3028.8 21.6 0 P
3847.2 3028.8 2.4 0 0 -19.2 P
3849.6 2990.4 0 -21.6 P
3849.6 2947.2 0 -19.2 P
3849.6 2906.4 0 -21.6 P
3849.6 2865.6 0 -21.6 P
3849.6 2822.4 0 -9.6 9.6 0 P
3878.4 2812.8 21.6 0 P
3921.6 2812.8 19.2 0 P
3962.4 2812.8 21.6 0 P
4003.2 2812.8 12 0 0 9.6 P
4015.2 2841.6 0 21.6 P
4015.2 2884.8 0 19.2 P
4015.2 2925.6 0 14.4 4.8 0 P
4041.6 2940 19.2 0 P
4082.4 2940 21.6 0 P
4123.2 2940 21.6 0 P
4166.4 2940 14.4 0 0 -4.8 P
4180.8 2913.6 0 -19.2 P
4180.8 2872.8 0 -21.6 P
4180.8 2832 0 -21.6 P
4180.8 2791.2 0 -21.6 P
4180.8 2748 0 -19.2 P
4188 2714.4 21.6 0 P
4231.2 2714.4 19.2 0 P
4272 2714.4 21.6 0 P
4312.8 2714.4 21.6 0 P
4346.4 2721.6 0 21.6 P
4346.4 2764.8 0 19.2 P
4346.4 2805.6 0 21.6 P
4346.4 2846.4 0 21.6 P
4346.4 2889.6 0 19.2 P
4346.4 2930.4 0 21.6 P
4346.4 2971.2 0 21.6 P
4346.4 3014.4 0 19.2 P
4346.4 3055.2 0 21.6 P
4346.4 3096 0 21.6 P
4346.4 3136.8 0 21.6 P
4346.4 3180 0 19.2 P
4346.4 3220.8 0 21.6 P
4346.4 3261.6 0 21.6 P
4346.4 3304.8 0 7.2 14.4 0 P
4380 3312 21.6 0 P
4423.2 3312 19.2 0 P
4464 3312 21.6 0 P
4504.8 3312 9.6 0 0 -14.4 P
4514.4 3278.4 0 -21.6 P
4514.4 3235.2 0 -19.2 P
4514.4 3194.4 0 -21.6 P
4514.4 3153.6 0 -21.6 S
4514.4 3112.8 0 -21.6 P
4514.4 3069.6 0 -19.2 P
4514.4 3028.8 0 -21.6 P
4514.4 2988 0 -21.6 P
4514.4 2944.8 0 -19.2 P
4514.4 2904 0 -21.6 P
4514.4 2863.2 0 -21.6 P
4514.4 2820 0 -19.2 P
4514.4 2779.2 0 -21.6 P
4514.4 2738.4 0 -21.6 P
4514.4 2697.6 0 -21.6 P
4514.4 2654.4 0 -19.2 P
4519.2 2620.8 21.6 0 P
4560 2620.8 21.6 0 P
4603.2 2620.8 19.2 0 P
4644 2620.8 21.6 0 P
4680 2613.6 0 -21.6 P
4680 2572.8 0 -21.6 P
4680 2529.6 0 -19.2 P
4680 2488.8 0 -21.6 P
4680 2448 0 -21.6 P
4680 2404.8 0 -19.2 P
4680 2364 0 -9.6 9.6 0 P
4711.2 2354.4 21.6 0 P
4752 2354.4 21.6 0 P
4792.8 2354.4 21.6 0 P
4836 2354.4 9.6 0 0 12 P
4845.6 2385.6 0 21.6 P
4845.6 2428.8 0 19.2 P
4845.6 2469.6 0 19.2 P
4845.6 2510.4 0 21.6 P
4845.6 2551.2 0 21.6 S
4845.6 2594.4 0 19.2 P
4845.6 2635.2 0 21.6 P
4845.6 2676 0 21.6 P
4845.6 2719.2 0 19.2 P
4845.6 2760 0 21.6 P
4845.6 2800.8 0 21.6 P
4845.6 2844 0 19.2 P
4845.6 2884.8 0 19.2 P
4845.6 2925.6 0 21.6 P
4845.6 2966.4 0 21.6 P
4845.6 3009.6 0 19.2 P
4845.6 3050.4 0 21.6 P
4857.6 3079.2 21.6 0 P
4898.4 3079.2 21.6 0 P
4941.6 3079.2 19.2 0 P
4982.4 3079.2 19.2 0 P
5011.2 3067.2 0 -19.2 P
5011.2 3026.4 0 -21.6 P
5011.2 2985.6 0 -21.6 P
5011.2 2942.4 0 -19.2 P
5011.2 2901.6 0 -21.6 P
5011.2 2860.8 0 -21.6 P
5011.2 2817.6 0 -19.2 P
5011.2 2776.8 0 -19.2 P
5011.2 2736 0 -21.6 P
5011.2 2695.2 0 -21.6 P
5011.2 2652 0 -19.2 P
5011.2 2611.2 0 -21.6 P
5011.2 2570.4 0 -21.6 P
5011.2 2527.2 0 -19.2 P
5011.2 2486.4 0 -21.6 P
5011.2 2445.6 0 -21.6 P
5011.2 2402.4 0 -19.2 P
5018.4 2368.8 19.2 0 P
5059.2 2368.8 21.6 0 P
5100 2368.8 21.6 0 P
5143.2 2368.8 19.2 0 P
5176.8 2376 0 19.2 P
5176.8 2416.8 0 19.2 P
5176.8 2457.6 0 21.6 P
5176.8 2498.4 0 21.6 P
5176.8 2541.6 0 19.2 P
5176.8 2582.4 0 21.6 P
5176.8 2623.2 0 21.6 P
5176.8 2666.4 0 19.2 P
5176.8 2707.2 0 21.6 P
5176.8 2748 0 21.6 P
5176.8 2791.2 0 19.2 P
5176.8 2832 0 19.2 P
5176.8 2872.8 0 21.6 P
5176.8 2913.6 0 21.6 P
5176.8 2956.8 0 19.2 P
5176.8 2997.6 0 21.6 P
5176.8 3038.4 0 21.6 P
5176.8 3081.6 21.6 0 P
5217.6 3081.6 21.6 0 P
5260.8 3081.6 19.2 0 P
5301.6 3081.6 21.6 0 P
5342.4 3081.6 0 -21.6 P
5342.4 3040.8 0 -21.6 P
5342.4 2997.6 0 -19.2 P
5342.4 2956.8 0 -19.2 P
5342.4 2916 0 -21.6 P
5342.4 2875.2 0 -21.6 S
5342.4 2832 0 -19.2 P
5342.4 2791.2 0 -21.6 P
5342.4 2750.4 0 -21.6 P
5342.4 2707.2 0 -19.2 P
5342.4 2666.4 0 -21.6 P
5342.4 2625.6 0 -21.6 P
5342.4 2582.4 0 -19.2 P
5342.4 2541.6 0 -19.2 P
5342.4 2500.8 0 -21.6 P
5342.4 2460 0 -21.6 P
5342.4 2416.8 0 -19.2 P
5342.4 2376 0 -21.6 P
5342.4 2335.2 0 -21.6 P
1190.4 2299.2 0 124.8 P
1399.2 2340 0 -40.8 P
1605.6 2299.2 0 40.8 P
1814.4 2340 0 -40.8 P
2020.8 2299.2 0 40.8 P
2229.6 2424 0 -124.8 P
2436 2299.2 0 40.8 P
2644.8 2340 0 -40.8 P
2853.6 2299.2 0 40.8 P
3060 2340 0 -40.8 P
3266.4 2299.2 0 124.8 P
3475.2 2340 0 -40.8 P
3681.6 2299.2 0 40.8 P
3890.4 2340 0 -40.8 P
4099.2 2299.2 0 40.8 P
4305.6 2424 0 -124.8 P
4514.4 2299.2 0 40.8 P
4720.8 2340 0 -40.8 P
4929.6 2299.2 0 40.8 P
5136 2340 0 -40.8 P
5344.8 2299.2 0 124.8 P
1188 2229.6 -9.6 -2.4 -7.2 -9.6 -4.8 -19.2 0 -9.6 4.8 -16.8 7.2 -9.6 9.6 -4.8 
7.2 0 9.6 4.8 7.2 9.6 4.8 16.8 0 9.6 -4.8 19.2 -7.2 9.6 -9.6 2.4 
-7.2 0 -7.2 -2.4 -2.4 -2.4 -4.8 -7.2 -2.4 -19.2 0 -9.6 2.4 -16.8 4.8 -7.2 
2.4 -2.4 7.2 -4.8 P
1195.2 2157.6 7.2 4.8 2.4 2.4 4.8 7.2 2.4 16.8 0 9.6 -2.4 19.2 -4.8 7.2 
-2.4 2.4 -7.2 2.4 P
2145.6 2217.6 7.2 2.4 12 9.6 0 -72 P
2160 2227.2 0 -69.6 P
2145.6 2157.6 31.2 0 P
2227.2 2229.6 -12 -2.4 -7.2 -9.6 -2.4 -19.2 0 -9.6 2.4 -16.8 7.2 -9.6 12 -4.8 
4.8 0 12 4.8 7.2 9.6 2.4 16.8 0 9.6 -2.4 19.2 -7.2 9.6 -12 2.4 
-4.8 0 S
2227.2 2229.6 -7.2 -2.4 -4.8 -2.4 -2.4 -7.2 -4.8 -19.2 0 -9.6 4.8 -16.8 2.4 -7.2 
4.8 -2.4 7.2 -4.8 P
2232 2157.6 7.2 4.8 4.8 2.4 2.4 7.2 4.8 16.8 0 9.6 -4.8 19.2 -2.4 7.2 
-4.8 2.4 -7.2 2.4 P
2294.4 2229.6 -9.6 -2.4 -7.2 -9.6 -2.4 -19.2 0 -9.6 2.4 -16.8 7.2 -9.6 9.6 -4.8 
7.2 0 12 4.8 7.2 9.6 2.4 16.8 0 9.6 -2.4 19.2 -7.2 9.6 -12 2.4 
-7.2 0 -9.6 -4.8 -2.4 -7.2 -4.8 -19.2 0 -9.6 4.8 -16.8 2.4 -7.2 4.8 -2.4 
4.8 -4.8 P
2301.6 2157.6 7.2 4.8 4.8 2.4 2.4 7.2 4.8 16.8 0 9.6 -4.8 19.2 -2.4 7.2 
-4.8 2.4 -7.2 2.4 P
3177.6 2217.6 2.4 -4.8 -2.4 -2.4 -2.4 2.4 0 4.8 2.4 7.2 2.4 2.4 12 2.4 
14.4 0 9.6 -2.4 2.4 -2.4 4.8 -7.2 0 -7.2 -4.8 -7.2 -9.6 -7.2 -16.8 -7.2 
-7.2 -2.4 -7.2 -7.2 -2.4 -12 0 -9.6 P
3206.4 2229.6 9.6 -4.8 2.4 -7.2 0 -7.2 -2.4 -7.2 -9.6 -7.2 -14.4 -7.2 P
3175.2 2164.8 2.4 2.4 7.2 0 16.8 -4.8 9.6 0 7.2 2.4 4.8 2.4 P
3184.8 2167.2 16.8 -9.6 14.4 0 2.4 4.8 4.8 4.8 0 7.2 P
3264 2229.6 -9.6 -2.4 -7.2 -9.6 -4.8 -19.2 0 -9.6 4.8 -16.8 7.2 -9.6 9.6 -4.8 
7.2 0 9.6 4.8 7.2 9.6 4.8 16.8 0 9.6 -4.8 19.2 -7.2 9.6 -9.6 2.4 
-7.2 0 -7.2 -2.4 -2.4 -2.4 -4.8 -7.2 -2.4 -19.2 0 -9.6 2.4 -16.8 4.8 -7.2 
2.4 -2.4 7.2 -4.8 P
3271.2 2157.6 7.2 4.8 2.4 2.4 4.8 7.2 2.4 16.8 0 9.6 -2.4 19.2 -4.8 7.2 
-2.4 2.4 -7.2 2.4 S
3333.6 2229.6 -9.6 -2.4 -7.2 -9.6 -4.8 -19.2 0 -9.6 4.8 -16.8 7.2 -9.6 9.6 -4.8 
7.2 0 9.6 4.8 7.2 9.6 4.8 16.8 0 9.6 -4.8 19.2 -7.2 9.6 -9.6 2.4 
-7.2 0 -7.2 -2.4 -2.4 -2.4 -4.8 -7.2 -2.4 -19.2 0 -9.6 2.4 -16.8 4.8 -7.2 
2.4 -2.4 7.2 -4.8 P
3340.8 2157.6 7.2 4.8 2.4 2.4 4.8 7.2 2.4 16.8 0 9.6 -2.4 19.2 -4.8 7.2 
-2.4 2.4 -7.2 2.4 P
4216.8 2217.6 2.4 -4.8 -2.4 -2.4 -4.8 2.4 0 4.8 4.8 7.2 2.4 2.4 9.6 2.4 
14.4 0 9.6 -2.4 4.8 -7.2 0 -9.6 -4.8 -7.2 -9.6 -4.8 -9.6 0 P
4243.2 2229.6 7.2 -2.4 2.4 -7.2 0 -9.6 -2.4 -7.2 -7.2 -4.8 7.2 -2.4 7.2 -7.2 
2.4 -7.2 0 -9.6 -2.4 -7.2 -14.4 -7.2 -14.4 0 -9.6 4.8 -2.4 2.4 -4.8 7.2 
0 2.4 4.8 4.8 2.4 -4.8 -2.4 -2.4 P
4252.8 2193.6 4.8 -12 0 -9.6 -4.8 -7.2 -2.4 -2.4 -7.2 -4.8 P
4303.2 2229.6 -12 -2.4 -7.2 -9.6 -2.4 -19.2 0 -9.6 2.4 -16.8 7.2 -9.6 12 -4.8 
4.8 0 12 4.8 7.2 9.6 2.4 16.8 0 9.6 -2.4 19.2 -7.2 9.6 -12 2.4 
-4.8 0 -7.2 -2.4 -4.8 -2.4 -2.4 -7.2 -4.8 -19.2 0 -9.6 4.8 -16.8 2.4 -7.2 
4.8 -2.4 7.2 -4.8 P
4308 2157.6 7.2 4.8 4.8 2.4 2.4 7.2 4.8 16.8 0 9.6 -4.8 19.2 -2.4 7.2 
-4.8 2.4 -7.2 2.4 P
4370.4 2229.6 -9.6 -2.4 -7.2 -9.6 -2.4 -19.2 0 -9.6 2.4 -16.8 7.2 -9.6 9.6 -4.8 
7.2 0 12 4.8 7.2 9.6 2.4 16.8 0 9.6 -2.4 19.2 -7.2 9.6 -12 2.4 
-7.2 0 S
4370.4 2229.6 -9.6 -4.8 -2.4 -7.2 -4.8 -19.2 0 -9.6 4.8 -16.8 2.4 -7.2 4.8 -2.4 
4.8 -4.8 P
4377.6 2157.6 7.2 4.8 4.8 2.4 2.4 7.2 4.8 16.8 0 9.6 -4.8 19.2 -2.4 7.2 
-4.8 2.4 -7.2 2.4 P
5282.4 2224.8 0 -67.2 P
5284.8 2229.6 0 -72 P
5284.8 2229.6 -38.4 -50.4 55.2 0 P
5270.4 2157.6 24 0 P
5340 2229.6 -9.6 -2.4 -7.2 -9.6 -4.8 -19.2 0 -9.6 4.8 -16.8 7.2 -9.6 9.6 -4.8 
7.2 0 9.6 4.8 7.2 9.6 4.8 16.8 0 9.6 -4.8 19.2 -7.2 9.6 -9.6 2.4 
-7.2 0 -7.2 -2.4 -2.4 -2.4 -4.8 -7.2 -2.4 -19.2 0 -9.6 2.4 -16.8 4.8 -7.2 
2.4 -2.4 7.2 -4.8 P
5347.2 2157.6 7.2 4.8 2.4 2.4 4.8 7.2 2.4 16.8 0 9.6 -2.4 19.2 -4.8 7.2 
-2.4 2.4 -7.2 2.4 P
5409.6 2229.6 -9.6 -2.4 -7.2 -9.6 -4.8 -19.2 0 -9.6 4.8 -16.8 7.2 -9.6 9.6 -4.8 
7.2 0 9.6 4.8 7.2 9.6 4.8 16.8 0 9.6 -4.8 19.2 -7.2 9.6 -9.6 2.4 
-7.2 0 -7.2 -2.4 -2.4 -2.4 -4.8 -7.2 -2.4 -19.2 0 -9.6 2.4 -16.8 4.8 -7.2 
2.4 -2.4 7.2 -4.8 P
5416.8 2157.6 7.2 4.8 2.4 2.4 4.8 7.2 2.4 16.8 0 9.6 -2.4 19.2 -4.8 7.2 
-2.4 2.4 -7.2 2.4 P
1190.4 3420 0 124.8 P
1399.2 3544.8 0 -40.8 P
1605.6 3504 0 40.8 P
1814.4 3544.8 0 -40.8 P
2020.8 3504 0 40.8 P
2229.6 3544.8 0 -124.8 P
2436 3504 0 40.8 P
2644.8 3544.8 0 -40.8 P
2853.6 3504 0 40.8 P
3060 3544.8 0 -40.8 P
3266.4 3420 0 124.8 P
3475.2 3544.8 0 -40.8 P
3681.6 3504 0 40.8 P
3890.4 3544.8 0 -40.8 S
4099.2 3504 0 40.8 P
4305.6 3544.8 0 -124.8 P
4514.4 3504 0 40.8 P
4720.8 3544.8 0 -40.8 P
4929.6 3504 0 40.8 P
5136 3544.8 0 -40.8 P
5344.8 3420 0 124.8 P
1190.4 2299.2 124.8 0 P
1233.6 2335.2 -43.2 0 P
1190.4 2368.8 43.2 0 P
1233.6 2400 -43.2 0 P
1190.4 2433.6 43.2 0 P
1315.2 2462.4 -124.8 0 P
1190.4 2493.6 43.2 0 P
1233.6 2520 -43.2 0 P
1190.4 2548.8 43.2 0 P
1233.6 2575.2 -43.2 0 P
1190.4 2601.6 124.8 0 P
1233.6 2628 -43.2 0 P
1190.4 2652 43.2 0 P
1233.6 2676 -43.2 0 P
1190.4 2697.6 43.2 0 P
1315.2 2721.6 -124.8 0 P
1190.4 2743.2 43.2 0 P
1233.6 2764.8 -43.2 0 P
1190.4 2786.4 43.2 0 P
1233.6 2808 -43.2 0 P
1190.4 2827.2 124.8 0 P
1233.6 2846.4 -43.2 0 P
1190.4 2865.6 43.2 0 P
1233.6 2884.8 -43.2 0 P
1190.4 2904 43.2 0 P
1315.2 2920.8 -124.8 0 P
1190.4 3086.4 43.2 0 P
1233.6 3223.2 -43.2 0 P
1190.4 3343.2 43.2 0 P
1233.6 3451.2 -43.2 0 P
1190.4 3544.8 124.8 0 P
1008 2330.4 -9.6 -2.4 -7.2 -12 -4.8 -16.8 0 -9.6 4.8 -19.2 7.2 -9.6 9.6 -2.4 
7.2 0 9.6 2.4 7.2 9.6 4.8 19.2 0 9.6 -4.8 16.8 -7.2 12 -9.6 2.4 
-7.2 0 -7.2 -2.4 -2.4 -4.8 -4.8 -7.2 -2.4 -16.8 0 -9.6 2.4 -19.2 4.8 -4.8 
2.4 -4.8 7.2 -2.4 P
1015.2 2258.4 7.2 2.4 2.4 4.8 4.8 4.8 2.4 19.2 0 9.6 -2.4 16.8 -4.8 7.2 
-2.4 4.8 -7.2 2.4 P
1063.2 2265.6 -2.4 -4.8 2.4 -2.4 4.8 2.4 -4.8 4.8 P
1099.2 2330.4 -7.2 -33.6 7.2 4.8 9.6 4.8 9.6 0 12 -4.8 7.2 -4.8 2.4 -12 
0 -7.2 -2.4 -9.6 -7.2 -7.2 -12 -2.4 -9.6 0 -9.6 2.4 -4.8 4.8 -2.4 4.8 
0 4.8 2.4 2.4 4.8 -2.4 -4.8 -4.8 S
1118.4 2306.4 14.4 -9.6 4.8 -12 0 -7.2 -4.8 -9.6 -7.2 -7.2 -7.2 -2.4 P
1099.2 2330.4 33.6 0 S
1099.2 2328 16.8 0 16.8 2.4 P
1008 2632.8 -9.6 -2.4 -7.2 -12 -4.8 -16.8 0 -9.6 4.8 -19.2 7.2 -9.6 9.6 -2.4 
7.2 0 9.6 2.4 7.2 9.6 4.8 19.2 0 9.6 -4.8 16.8 -7.2 12 -9.6 2.4 
-7.2 0 -7.2 -2.4 -2.4 -4.8 -4.8 -7.2 -2.4 -16.8 0 -9.6 2.4 -19.2 4.8 -4.8 
2.4 -4.8 7.2 -2.4 P
1015.2 2560.8 7.2 2.4 2.4 4.8 4.8 4.8 2.4 19.2 0 9.6 -2.4 16.8 -4.8 7.2 
-2.4 4.8 -7.2 2.4 P
1063.2 2568 -2.4 -4.8 2.4 -2.4 4.8 2.4 -4.8 4.8 P
1092 2632.8 0 -21.6 P
1092 2618.4 2.4 7.2 7.2 7.2 7.2 0 16.8 -9.6 7.2 0 4.8 2.4 2.4 7.2 P
1094.4 2625.6 7.2 4.8 7.2 0 16.8 -7.2 P
1140 2632.8 0 -9.6 -2.4 -12 -14.4 -16.8 -4.8 -7.2 -2.4 -9.6 0 -16.8 P
1137.6 2611.2 -19.2 -16.8 -2.4 -7.2 -4.8 -9.6 0 -16.8 P
998.4 2940 7.2 2.4 9.6 9.6 0 -72 P
1012.8 2949.6 0 -69.6 P
998.4 2880 31.2 0 P
1063.2 2887.2 -2.4 -2.4 2.4 -4.8 4.8 4.8 -4.8 2.4 P
1111.2 2952 -9.6 -2.4 -7.2 -9.6 -2.4 -16.8 0 -12 2.4 -16.8 7.2 -9.6 9.6 -4.8 
7.2 0 12 4.8 7.2 9.6 2.4 16.8 0 12 -2.4 16.8 -7.2 9.6 -12 2.4 
-7.2 0 -9.6 -4.8 -2.4 -7.2 -4.8 -16.8 0 -12 4.8 -16.8 2.4 -7.2 4.8 -2.4 
4.8 -4.8 P
1118.4 2880 7.2 4.8 4.8 2.4 2.4 7.2 4.8 16.8 0 12 -4.8 16.8 -2.4 7.2 
-4.8 2.4 -7.2 2.4 P
991.2 3561.6 2.4 -2.4 -2.4 -4.8 -4.8 4.8 0 2.4 4.8 7.2 2.4 4.8 12 2.4 
12 0 12 -2.4 2.4 -4.8 4.8 -7.2 0 -7.2 -4.8 -7.2 -9.6 -4.8 -16.8 -7.2 
-7.2 -4.8 -7.2 -7.2 -4.8 -9.6 0 -9.6 S
1017.6 3576 7.2 -2.4 4.8 -4.8 2.4 -7.2 0 -7.2 -2.4 -7.2 -12 -4.8 -12 -7.2 P
986.4 3511.2 4.8 2.4 7.2 0 16.8 -7.2 9.6 0 7.2 4.8 4.8 2.4 P
998.4 3513.6 16.8 -9.6 14.4 0 2.4 2.4 4.8 7.2 0 7.2 P
1063.2 3511.2 -2.4 -4.8 2.4 -2.4 4.8 2.4 -4.8 4.8 P
1111.2 3576 -9.6 -2.4 -7.2 -12 -2.4 -16.8 0 -9.6 2.4 -19.2 7.2 -9.6 9.6 -2.4 
7.2 0 12 2.4 7.2 9.6 2.4 19.2 0 9.6 -2.4 16.8 -7.2 12 -12 2.4 
-7.2 0 -4.8 -2.4 -4.8 -4.8 -2.4 -7.2 -4.8 -16.8 0 -9.6 4.8 -19.2 2.4 -4.8 
4.8 -4.8 4.8 -2.4 P
1118.4 3504 7.2 2.4 4.8 4.8 2.4 4.8 4.8 19.2 0 9.6 -4.8 16.8 -2.4 7.2 
-4.8 4.8 -7.2 2.4 P
5220 2299.2 124.8 0 P
5344.8 2335.2 -43.2 0 P
5301.6 2368.8 43.2 0 P
5344.8 2400 -43.2 0 P
5301.6 2433.6 43.2 0 P
5344.8 2462.4 -124.8 0 P
5301.6 2493.6 43.2 0 P
5344.8 2520 -43.2 0 P
5301.6 2548.8 43.2 0 P
5344.8 2575.2 -43.2 0 P
5220 2601.6 124.8 0 P
5344.8 2628 -43.2 0 P
5301.6 2652 43.2 0 P
5344.8 2676 -43.2 0 P
5301.6 2697.6 43.2 0 P
5344.8 2721.6 -124.8 0 P
5301.6 2743.2 43.2 0 P
5344.8 2764.8 -43.2 0 P
5301.6 2786.4 43.2 0 P
5344.8 2808 -43.2 0 P
5220 2827.2 124.8 0 P
5344.8 2846.4 -43.2 0 P
5301.6 2865.6 43.2 0 P
5344.8 2884.8 -43.2 0 P
5301.6 2904 43.2 0 P
5344.8 2920.8 -124.8 0 P
5301.6 3086.4 43.2 0 P
5344.8 3223.2 -43.2 0 P
5301.6 3343.2 43.2 0 P
5344.8 3451.2 -43.2 0 P
5220 3544.8 124.8 0 S
255 0 r3
1190.4 2299.2 0 21.6 P
1190.4 2340 0 21.6 P
1190.4 2383.2 0 19.2 P
1190.4 2424 0 21.6 P
1190.4 2464.8 0 21.6 P
1190.4 2505.6 0 21.6 P
1190.4 2548.8 0 19.2 P
1190.4 2589.6 0 21.6 P
1190.4 2630.4 0 21.6 P
1190.4 2673.6 0 19.2 P
1190.4 2714.4 0 21.6 P
1190.4 2755.2 0 21.6 P
1190.4 2798.4 0 19.2 P
1190.4 2839.2 0 21.6 P
1190.4 2880 0 21.6 P
1190.4 2920.8 21.6 0 P
1233.6 2920.8 19.2 0 P
1274.4 2920.8 21.6 0 P
1315.2 2920.8 21.6 0 P
1358.4 2920.8 0 -19.2 P
1358.4 2880 0 -9.6 9.6 0 P
1389.6 2870.4 19.2 0 P
1430.4 2870.4 21.6 0 P
1471.2 2870.4 21.6 0 P
1514.4 2870.4 9.6 0 0 9.6 P
1524 2901.6 0 16.8 2.4 0 P
1548 2918.4 21.6 0 P
1588.8 2918.4 21.6 0 P
1632 2918.4 19.2 0 P
1672.8 2918.4 16.8 0 0 4.8 P
1689.6 2942.4 0 19.2 2.4 0 P
1713.6 2961.6 21.6 0 P
1754.4 2961.6 21.6 0 P
1797.6 2961.6 19.2 0 P
1838.4 2961.6 16.8 0 0 -4.8 P
1855.2 2935.2 0 -19.2 P
1874.4 2911.2 19.2 0 P
1915.2 2911.2 21.6 0 P
1956 2911.2 21.6 0 P
1996.8 2911.2 21.6 0 P
2020.8 2930.4 0 19.2 P
2020.8 2971.2 0 7.2 14.4 0 P
2054.4 2978.4 21.6 0 P
2097.6 2978.4 19.2 0 P
2138.4 2978.4 21.6 0 P
2179.2 2978.4 9.6 0 0 14.4 P
2200.8 3000 19.2 0 P
2241.6 3000 21.6 0 P
2282.4 3000 21.6 0 P
2325.6 3000 19.2 0 P
2354.4 3012 0 19.2 2.4 0 P
2376 3031.2 21.6 0 P
2419.2 3031.2 19.2 0 P
2460 3031.2 21.6 0 P
2500.8 3031.2 19.2 0 0 -2.4 P
2532 3021.6 21.6 0 P
2572.8 3021.6 21.6 0 P
2616 3021.6 19.2 0 P
2656.8 3021.6 21.6 0 S
2685.6 3033.6 0 19.2 P
2685.6 3074.4 0 12 9.6 0 P
2716.8 3086.4 21.6 0 P
2757.6 3086.4 21.6 0 P
2800.8 3086.4 19.2 0 P
2841.6 3086.4 12 0 0 -9.6 P
2853.6 3055.2 0 -21.6 P
2853.6 3014.4 0 -21.6 P
2853.6 2973.6 0 -21.6 P
2860.8 2937.6 19.2 0 P
2901.6 2937.6 19.2 0 P
2942.4 2937.6 21.6 0 P
2983.2 2937.6 21.6 0 P
3019.2 2944.8 0 12 7.2 0 P
3048 2956.8 19.2 0 P
3088.8 2956.8 21.6 0 P
3129.6 2956.8 21.6 0 P
3172.8 2956.8 12 0 0 9.6 P
3184.8 2988 0 12 7.2 0 P
3211.2 3000 21.6 0 P
3254.4 3000 19.2 0 P
3295.2 3000 21.6 0 P
3336 3000 14.4 0 0 7.2 P
3350.4 3028.8 0 19.2 P
3350.4 3069.6 0 21.6 P
3372 3091.2 19.2 0 P
3412.8 3091.2 21.6 0 P
3453.6 3091.2 21.6 0 P
3496.8 3091.2 19.2 0 P
3516 3110.4 0 21.6 P
3523.2 3146.4 21.6 0 P
3566.4 3146.4 19.2 0 P
3607.2 3146.4 21.6 0 P
3648 3146.4 21.6 0 P
3681.6 3139.2 0 -21.6 P
3681.6 3096 0 -19.2 P
3681.6 3055.2 0 -21.6 P
3681.6 3014.4 0 -21.6 P
3681.6 2971.2 0 -19.2 P
3698.4 2944.8 19.2 0 P
3739.2 2944.8 21.6 0 P
3780 2944.8 21.6 0 P
3823.2 2944.8 19.2 0 P
3849.6 2959.2 0 21.6 P
3849.6 3002.4 0 19.2 P
3849.6 3043.2 0 21.6 P
3849.6 3084 0 14.4 4.8 0 P
3876 3098.4 21.6 0 P
3916.8 3098.4 21.6 0 P
3960 3098.4 19.2 0 P
4000.8 3098.4 14.4 0 0 -4.8 P
4015.2 3072 0 -21.6 P
4015.2 3031.2 0 -21.6 P
4015.2 2988 0 -19.2 P
4015.2 2947.2 0 -19.2 P
4015.2 2906.4 0 -21.6 P
4015.2 2865.6 0 -21.6 P
4015.2 2822.4 0 -19.2 P
4015.2 2781.6 0 -12 9.6 0 P
4046.4 2769.6 19.2 0 S
4087.2 2769.6 19.2 0 P
4128 2769.6 21.6 0 P
4168.8 2769.6 12 0 0 9.6 P
4180.8 2800.8 0 21.6 P
4180.8 2841.6 0 21.6 P
4180.8 2884.8 0 19.2 P
4180.8 2925.6 0 19.2 P
4183.2 2964 21.6 0 P
4224 2964 21.6 0 P
4267.2 2964 19.2 0 P
4308 2964 21.6 0 P
4346.4 2966.4 0 21.6 P
4346.4 3007.2 0 21.6 P
4346.4 3050.4 0 19.2 P
4346.4 3091.2 0 21.6 P
4346.4 3132 0 4.8 19.2 0 P
4384.8 3136.8 21.6 0 P
4428 3136.8 19.2 0 P
4468.8 3136.8 19.2 0 P
4509.6 3136.8 4.8 0 0 -19.2 P
4514.4 3098.4 0 -21.6 P
4514.4 3055.2 0 -4.8 12 0 P
4548 3050.4 21.6 0 P
4588.8 3050.4 21.6 0 P
4632 3050.4 19.2 0 P
4672.8 3050.4 7.2 0 0 -14.4 P
4680 3014.4 0 -19.2 P
4687.2 2980.8 21.6 0 P
4728 2980.8 21.6 0 P
4768.8 2980.8 21.6 0 P
4812 2980.8 19.2 0 P
4845.6 2973.6 0 -21.6 P
4845.6 2932.8 0 -9.6 12 0 P
4879.2 2923.2 19.2 0 P
4920 2923.2 21.6 0 P
4960.8 2923.2 21.6 0 P
5001.6 2923.2 9.6 0 0 12 P
5011.2 2956.8 0 19.2 P
5011.2 2997.6 0 21.6 P
5011.2 3038.4 0 4.8 16.8 0 P
5047.2 3043.2 21.6 0 P
5090.4 3043.2 19.2 0 P
5131.2 3043.2 21.6 0 P
5172 3043.2 4.8 0 0 -14.4 P
5176.8 3007.2 0 -21.6 P
5176.8 2966.4 0 -21.6 P
5176.8 2925.6 0 -19.2 2.4 0 P
5200.8 2906.4 19.2 0 P
5241.6 2906.4 21.6 0 P
5282.4 2906.4 21.6 0 P
5325.6 2906.4 16.8 0 0 -2.4 P
5342.4 2882.4 0 -19.2 P
5342.4 2841.6 0 -21.6 P
5342.4 2800.8 0 -21.6 P
5342.4 2757.6 0 -19.2 P
5342.4 2716.8 0 -21.6 P
5342.4 2676 0 -21.6 P
5342.4 2632.8 0 -19.2 P
5342.4 2592 0 -21.6 S
5342.4 2551.2 0 -21.6 P
5342.4 2510.4 0 -21.6 P
5342.4 2467.2 0 -19.2 P
5342.4 2426.4 0 -21.6 P
5342.4 2385.6 0 -21.6 P
5342.4 2342.4 0 -19.2 P
5342.4 2301.6 0 -2.4 S
cleartomark end end pagesave restore
 showpage
%%PageTrailer
%%Trailer
%%Pages: 1
%%Trailer
cleartomark
countdictstack
exch sub { end } repeat
restore
%%EOF
