%!PS-Adobe-2.0 EPSF-2.0
%%BoundingBox:  0 0 567 544
%%Title: ./gravimela_LD_8TeV.eps: gravimela_LD_8TeV
%%Creator: ROOT Version 5.32/00
%%CreationDate: Wed Mar 27 17:34:12 2013
%%EndComments
%%BeginProlog
80 dict begin
/s {stroke} def /l {lineto} def /m {moveto} def /t {translate} def
/r {rotate} def /rl {roll}  def /R {repeat} def
/d {rlineto} def /rm {rmoveto} def /gr {grestore} def /f {eofill} def
/c {setrgbcolor} def /black {0 setgray} def /sd {setdash} def
/cl {closepath} def /sf {scalefont setfont} def /lw {setlinewidth} def
/box {m dup 0 exch d exch 0 d 0 exch neg d cl} def
/NC{systemdict begin initclip end}def/C{NC box clip newpath}def
/bl {box s} def /bf {box f} def /Y { 0 exch d} def /X { 0 d} def 
/K {{pop pop 0 moveto} exch kshow} bind def
/ita {/ang 15 def gsave [1 0 ang dup sin exch cos div 1 0 0] concat} def 
/mp {newpath /y exch def /x exch def} def
/side {[w .77 mul w .23 mul] .385 w mul sd w 0 l currentpoint t -144 r} def
/mr {mp x y w2 0 360 arc} def /m24 {mr s} def /m20 {mr f} def
/mb {mp x y w2 add m w2 neg 0 d 0 w neg d w 0 d 0 w d cl} def
/mt {mp x y w2 add m w2 neg w neg d w 0 d cl} def
/m21 {mb f} def /m25 {mb s} def /m22 {mt f} def /m26{mt s} def
/m23 {mp x y w2 sub m w2 w d w neg 0 d cl f} def
/m27 {mp x y w2 add m w3 neg w2 neg d w3 w2 neg d w3 w2 d cl s} def
/m28 {mp x w2 sub y w2 sub w3 add m w3 0 d  0 w3 neg d w3 0 d 0 w3 d w3 0 d  0 w3 d w3 neg 0 d 0 w3 d w3 neg 0 d 0 w3 neg d w3 neg 0 d cl s } def
/m29 {mp gsave x w2 sub y w2 add w3 sub m currentpoint t 4 {side} repeat cl fill gr} def
/m30 {mp gsave x w2 sub y w2 add w3 sub m currentpoint t 4 {side} repeat cl s gr} def
/m31 {mp x y w2 sub m 0 w d x w2 sub y m w 0 d x w2 sub y w2 add m w w neg d x w2 sub y w2 sub m w w d s} def
/m32 {mp x y w2 sub m w2 w d w neg 0 d cl s} def
/m33 {mp x y w2 add m w3 neg w2 neg d w3 w2 neg d w3 w2 d cl f} def
/m34 {mp x w2 sub y w2 sub w3 add m w3 0 d  0 w3 neg d w3 0 d 0 w3 d w3 0 d  0 w3 d w3 neg 0 d 0 w3 d w3 neg 0 d 0 w3 neg d w3 neg 0 d cl f } def
/m2 {mp x y w2 sub m 0 w d x w2 sub y m w 0 d s} def
/m5 {mp x w2 sub y w2 sub m w w d x w2 sub y w2 add m w w neg d s} def
/reEncode {exch findfont dup length dict begin {1 index /FID eq  {pop pop} {def} ifelse } forall /Encoding exch def currentdict end dup /FontName get exch definefont pop } def [/Times-Bold /Times-Italic /Times-BoldItalic /Helvetica /Helvetica-Oblique
 /Helvetica-Bold /Helvetica-BoldOblique /Courier /Courier-Oblique /Courier-Bold /Courier-BoldOblique /Times-Roman /AvantGarde-Book /AvantGarde-BookOblique /AvantGarde-Demi /AvantGarde-DemiOblique /Bookman-Demi /Bookman-DemiItalic /Bookman-Light
 /Bookman-LightItalic /Helvetica-Narrow /Helvetica-Narrow-Bold /Helvetica-Narrow-BoldOblique /Helvetica-Narrow-Oblique /NewCenturySchlbk-Roman /NewCenturySchlbk-Bold /NewCenturySchlbk-BoldItalic /NewCenturySchlbk-Italic /Palatino-Bold
 /Palatino-BoldItalic /Palatino-Italic /Palatino-Roman ] {ISOLatin1Encoding reEncode } forall%%EndProlog
%%BeginSetup
%%EndSetup
newpath  gsave  .25 .25 scale  gsave  0 0 t black[  ] 0 sd 3 lw 1 1 1 c 2268 2176 0 0 bf black 1 1 1 c black 1860 1785 317 283 bl 1860 1785 317 283 bl 1 1 1 c black 1860 1785 317 283 bl 1860 1785 317 283 bl 1 0 0 c 6 lw 1 1 1 c black 1 0 0 c 317 283
 m 186 X 5 Y 62 X 100 Y 62 X 377 Y 62 X 307 Y 62 X 88 Y 62 X 2 Y 62 X -3 Y 62 X -53 Y 62 X -55 Y 62 X -57 Y 62 X -102 Y 62 X -102 Y 62 X -138 Y 62 X -90 Y 62 X -62 Y 62 X -57 Y 62 X -38 Y 62 X -25 Y 62 X -27 Y 62 X -17 Y 62 X -16 Y 62 X -9 Y 62 X -8
 Y 62 X -1 Y 62 X -9 Y 62 X -4 Y 62 X -3 Y 62 X s black 3 lw 317 283 m 1860 X s
 gsave  2268 2176 0 0 C 2058.45 22.8294 t 0 r /Helvetica findfont 53.2685 sf 0 0 m (m gg) show NC gr 
 gsave  2268 2176 0 0 C 2058.45 83.7077 t 0 r /Helvetica findfont 53.2685 sf 0 0 m (+) show NC gr 
 gsave  2268 2176 0 0 C 2016.59 41.8538 t 0 r /Helvetica findfont 79.9028 sf 0 0 m (2) show NC gr 
 gsave  2268 2176 0 0 C 1932.89 87.5126 t 0 r /Helvetica findfont 121.757 sf 0 0 m (D) show NC gr  317 336 m -53 Y s 410 310 m -27 Y s 503 310 m -27 Y s 596 310 m -27 Y s 689 336 m -53 Y s 782 310 m -27 Y s 875 310 m -27 Y s 968 310 m -27 Y s 1061
 336 m -53 Y s 1154 310 m -27 Y s 1247 310 m -27 Y s 1340 310 m -27 Y s 1433 336 m -53 Y s 1526 310 m -27 Y s 1619 310 m -27 Y s 1712 310 m -27 Y s 1805 336 m -53 Y s 1898 310 m -27 Y s 1991 310 m -27 Y s 2084 310 m -27 Y s 2177 336 m -53 Y s 2177
 336 m -53 Y s
 gsave  2268 2176 0 0 C 289.172 182.635 t 0 r /Helvetica findfont 102.732 sf 0 0 m (0) show NC gr 
 gsave  2268 2176 0 0 C 616.393 182.635 t 0 r /Helvetica findfont 102.732 sf 0 0 m (0.2) show NC gr 
 gsave  2268 2176 0 0 C 985.467 182.635 t 0 r /Helvetica findfont 102.732 sf 0 0 m (0.4) show NC gr 
 gsave  2268 2176 0 0 C 1358.35 182.635 t 0 r /Helvetica findfont 102.732 sf 0 0 m (0.6) show NC gr 
 gsave  2268 2176 0 0 C 1731.23 182.635 t 0 r /Helvetica findfont 102.732 sf 0 0 m (0.8) show NC gr 
 gsave  2268 2176 0 0 C 2153.57 182.635 t 0 r /Helvetica findfont 102.732 sf 0 0 m (1) show NC gr  317 2068 m 1860 X s 317 2014 m 54 Y s 410 2041 m 27 Y s 503 2041 m 27 Y s 596 2041 m 27 Y s 689 2014 m 54 Y s 782 2041 m 27 Y s 875 2041 m 27 Y s 968
 2041 m 27 Y s 1061 2014 m 54 Y s 1154 2041 m 27 Y s 1247 2041 m 27 Y s 1340 2041 m 27 Y s 1433 2014 m 54 Y s 1526 2041 m 27 Y s 1619 2041 m 27 Y s 1712 2041 m 27 Y s 1805 2014 m 54 Y s 1898 2041 m 27 Y s 1991 2041 m 27 Y s 2084 2041 m 27 Y s 2177
 2014 m 54 Y s 2177 2014 m 54 Y s 317 283 m 1785 Y s 373 283 m -56 X s 345 372 m -28 X s 345 461 m -28 X s 345 551 m -28 X s 345 640 m -28 X s 373 729 m -56 X s 345 818 m -28 X s 345 908 m -28 X s 345 997 m -28 X s 345 1086 m -28 X s 373 1175 m -56 X
 s 345 1264 m -28 X s 345 1354 m -28 X s 345 1443 m -28 X s 345 1532 m -28 X s 373 1621 m -56 X s 345 1711 m -28 X s 345 1800 m -28 X s 345 1889 m -28 X s 345 1978 m -28 X s 373 2068 m -56 X s
 gsave  2268 2176 0 0 C 247.318 247.318 t 0 r /Helvetica findfont 102.732 sf 0 0 m (0) show NC gr 
 gsave  2268 2176 0 0 C 102.732 692.491 t 0 r /Helvetica findfont 102.732 sf 0 0 m (0.05) show NC gr 
 gsave  2268 2176 0 0 C 175.025 1137.66 t 0 r /Helvetica findfont 102.732 sf 0 0 m (0.1) show NC gr 
 gsave  2268 2176 0 0 C 102.732 1586.64 t 0 r /Helvetica findfont 102.732 sf 0 0 m (0.15) show NC gr 
 gsave  2268 2176 0 0 C 159.806 2031.81 t 0 r /Helvetica findfont 102.732 sf 0 0 m (0.2) show NC gr  2177 283 m 1785 Y s 2121 283 m 56 X s 2149 372 m 28 X s 2149 461 m 28 X s 2149 551 m 28 X s 2149 640 m 28 X s 2121 729 m 56 X s 2149 818 m 28 X s
 2149 908 m 28 X s 2149 997 m 28 X s 2149 1086 m 28 X s 2121 1175 m 56 X s 2149 1264 m 28 X s 2149 1354 m 28 X s 2149 1443 m 28 X s 2149 1532 m 28 X s 2121 1621 m 56 X s 2149 1711 m 28 X s 2149 1800 m 28 X s 2149 1889 m 28 X s 2149 1978 m 28 X s 2121
 2068 m 56 X s 0 0 1 c 6 lw 1 1 1 c black 0 0 1 c 317 284 m 124 X 2 Y 62 X 7 Y 62 X 93 Y 62 X 484 Y 62 X 406 Y 62 X 122 Y 62 X -12 Y 62 X -98 Y 62 X -129 Y 62 X -121 Y 62 X -122 Y 62 X -120 Y 62 X -136 Y 62 X -121 Y 62 X -76 Y 62 X -61 Y 62 X -33 Y
 62 X -27 Y 62 X -14 Y 62 X -13 Y 62 X -10 Y 62 X -6 Y 62 X -5 Y 62 X -1 Y 62 X -5 Y 62 X -1 Y 62 X -2 Y 62 X -1 Y 62 X s black 1 1 1 c black 317 283 m 62 X 2 Y 62 X 2 Y 62 X 12 Y 62 X 210 Y 62 X 777 Y 62 X 380 Y 62 X -95 Y 62 X -202 Y 62 X -154 Y 62
 X -181 Y 62 X -143 Y 62 X -133 Y 62 X -110 Y 62 X -105 Y 62 X -83 Y 62 X -60 Y 62 X -40 Y 62 X -28 Y 62 X -14 Y 62 X -12 Y 62 X -6 Y 62 X -6 Y 62 X -5 Y 62 X -2 Y 62 X -2 Y 124 X -1 Y 62 X -1 Y 124 X s 3 lw 1 1 1 c 453 438 1465 1541 bf black
 gsave  2268 2176 0 0 C 1693.18 1868.2 t 0 r /Helvetica-Bold findfont 106.537 sf 0 0 m ( \(gg\)) show NC gr 
 gsave  2268 2176 0 0 C 1632.3 1841.57 t 0 r /Helvetica-Bold findfont 72.293 sf 0 0 m (m) show NC gr 
 gsave  2268 2176 0 0 C 1632.3 1921.47 t 0 r /Helvetica-Bold findfont 72.293 sf 0 0 m (+) show NC gr 
 gsave  2268 2176 0 0 C 1575.23 1868.2 t 0 r /Helvetica-Bold findfont 106.537 sf 0 0 m (2) show NC gr  6 lw 1482 1906 m 79 X s
 gsave  2268 2176 0 0 C 1879.62 1723.62 t 0 r /Helvetica-Bold findfont 106.537 sf 0 0 m (\)) show NC gr 
 gsave  2268 2176 0 0 C 1818.74 1723.62 t 0 r /Helvetica-Bold findfont 106.537 sf 0 0 m (q) show NC gr  1819 1788 m 61 X s
 gsave  2268 2176 0 0 C 1693.18 1723.62 t 0 r /Helvetica-Bold findfont 106.537 sf 0 0 m ( \(q) show NC gr 
 gsave  2268 2176 0 0 C 1632.3 1696.98 t 0 r /Helvetica-Bold findfont 72.293 sf 0 0 m (m) show NC gr 
 gsave  2268 2176 0 0 C 1632.3 1776.89 t 0 r /Helvetica-Bold findfont 72.293 sf 0 0 m (+) show NC gr 
 gsave  2268 2176 0 0 C 1575.23 1723.62 t 0 r /Helvetica-Bold findfont 106.537 sf 0 0 m (2) show NC gr  0 0 1 c 1482 1760 m 79 X s black
 gsave  2268 2176 0 0 C 1818.74 1620.88 t 0 r /Helvetica-Bold findfont 72.293 sf 0 0 m (+) show NC gr 
 gsave  2268 2176 0 0 C 1575.23 1571.42 t 0 r /Helvetica-Bold findfont 106.537 sf 0 0 m (SM 0) show NC gr  1 0 0 c 1482 1614 m 79 X s black
 gsave  2268 2176 0 0 C 2222.06 1579.03 t 90 r /Helvetica-BoldOblique findfont 41.8538 sf 0 0 m (LHC HIGGS XS WG 2013) show NC gr 
 gr  gr showpage
end
%%EOF
