%!PS-Adobe-3.0 EPSF-3.0
%%BoundingBox: 215 445 505 611
%%Creator: giovanni with JaxoDraw-2.1-0
%%Title: 
%%CreationDate: 26/2/2013
%%BeginProlog
/imStr 0 def /imageSrc {currentfile /ASCII85Decode filter /RunLengthDecode filter  imStr readstring pop } def
/BD {bind def} bind def
/D {def} BD
/C {curveto} BD
/L {lineto} BD
/M {moveto} BD
/R {grestore} BD
/G {gsave} BD
/N {newpath} BD
/P {closepath} BD
/EC {eoclip} BD
/WC {clip} BD
/EF {eofill} BD
/WF {fill} BD
/SG {setgray} BD
/SC {setrgbcolor} BD
/ISOF {
     dup findfont dup length 1 add dict begin {
             1 index /FID eq {pop pop} {D} ifelse
     } forall /Encoding ISOLatin1Encoding D
     currentdict end definefont
} BD
/NZ {dup 1 lt {pop 1} if} BD
/S {
     moveto 1 index stringwidth pop NZ sub
     1 index length 1 sub NZ div 0
     3 2 roll ashow newpath} BD
/FL [
    /AvantGarde-Book ISOF
    /AvantGarde-BookOblique ISOF
    /AvantGarde-Demi ISOF
    /AvantGarde-DemiOblique ISOF
    /Bookman-Demi ISOF
    /Bookman-DemiItalic ISOF
    /Bookman-Light ISOF
    /Bookman-LightItalic ISOF
    /Courier ISOF
    /Courier-Bold ISOF
    /Courier-BoldOblique ISOF
    /Courier-Oblique ISOF
    /Helvetica ISOF
    /Helvetica-Bold ISOF
    /Helvetica-BoldOblique ISOF
    /Helvetica-Narrow ISOF
    /Helvetica-Narrow-Bold ISOF
    /Helvetica-Narrow-BoldOblique ISOF
    /Helvetica-Narrow-Oblique ISOF
    /Helvetica-Oblique ISOF
    /NewCenturySchlbk-Bold ISOF
    /NewCenturySchlbk-BoldItalic ISOF
    /NewCenturySchlbk-Italic ISOF
    /NewCenturySchlbk-Roman ISOF
    /Palatino-Bold ISOF
    /Palatino-BoldItalic ISOF
    /Palatino-Italic ISOF
    /Palatino-Roman ISOF
    /Symbol findfont
    /Times-Bold ISOF
    /Times-BoldItalic ISOF
    /Times-Italic ISOF
    /Times-Roman ISOF
    /ZapfDingbats findfont
    /ZapfChancery-MediumItalic ISOF
] D
/F {
     FL exch get exch scalefont
     [1 0 0 -1 0 0] makefont setfont} BD
%%EndProlog
%%BeginSetup
<< /PageSize [612.0 792.0] /DeferredMediaSelection true /ImagingBBox null /ManualFeed false /NumCopies 1 >> pop 
%%EndSetup
%%Page: 1 1
/pgSave save def
792.0 0 exch translate 1 -1 scale[72 300 div 0 0 72 300 div 0 0]concat
G
[4.1666665 0.0 0.0 4.1666665 300.0 300.0] concat
N
0.0 0.0 M
468.0 0.0 L
468.0 648.0 L
0.0 648.0 L
0.0 0.0 L
P
WC
N
240.095 271.509 M
236.58 270.828 233.0 268.124 233.0 261.818 C
233.0 256.51 236.568 253.942 240.072 253.432 C
241.839 253.175 243.604 253.441 244.914 254.164 C
246.161 254.851 247.0 255.949 247.0 257.455 C
247.0 258.955 246.166 260.05 244.926 260.694 C
243.627 261.368 241.875 261.548 240.118 261.122 C
236.592 260.267 233.0 256.962 233.0 250.182 C
233.0 243.401 236.592 240.096 240.118 239.242 C
241.875 238.816 243.627 238.995 244.926 239.67 C
246.166 240.314 247.0 241.408 247.0 242.909 C
247.0 244.41 246.166 245.504 244.926 246.149 C
243.627 246.823 241.875 247.003 240.118 246.577 C
236.592 245.722 233.0 242.417 233.0 235.636 C
233.0 228.856 236.592 225.551 240.118 224.696 C
241.875 224.27 243.627 224.45 244.926 225.124 C
246.166 225.768 247.0 226.863 247.0 228.364 C
247.0 229.864 246.166 230.959 244.926 231.603 C
243.627 232.277 241.875 232.457 240.118 232.031 C
236.592 231.176 233.0 227.871 233.0 221.091 C
233.0 214.31 236.592 211.005 240.118 210.151 C
241.875 209.725 243.627 209.904 244.926 210.579 C
246.166 211.223 247.0 212.317 247.0 213.818 C
247.0 215.319 246.166 216.413 244.926 217.058 C
243.627 217.732 241.875 217.912 240.118 217.486 C
236.592 216.631 233.0 213.326 233.0 206.545 C
233.0 199.765 236.592 196.46 240.118 195.605 C
241.875 195.179 243.627 195.359 244.926 196.033 C
246.166 196.677 247.0 197.772 247.0 199.273 C
247.0 200.774 246.166 201.868 244.926 202.512 C
243.627 203.186 241.875 203.366 240.118 202.94 C
236.592 202.086 233.0 198.78 233.0 192.0 C
233.0 185.22 236.592 181.914 240.118 181.06 C
241.875 180.634 243.627 180.814 244.926 181.488 C
246.166 182.132 247.0 183.226 247.0 184.727 C
247.0 186.228 246.166 187.323 244.926 187.967 C
243.627 188.641 241.875 188.821 240.118 188.395 C
236.592 187.54 233.0 184.235 233.0 177.455 C
233.0 170.674 236.592 167.369 240.118 166.514 C
241.875 166.088 243.627 166.268 244.926 166.942 C
246.166 167.587 247.0 168.681 247.0 170.182 C
247.0 171.683 246.166 172.777 244.926 173.421 C
243.627 174.096 241.875 174.275 240.118 173.849 C
236.592 172.995 233.0 169.69 233.0 162.909 C
233.0 156.129 236.592 152.824 240.118 151.969 C
241.875 151.543 243.627 151.723 244.926 152.397 C
246.166 153.041 247.0 154.136 247.0 155.636 C
247.0 157.137 246.166 158.232 244.926 158.876 C
243.627 159.55 241.875 159.73 240.118 159.304 C
236.592 158.449 233.0 155.144 233.0 148.364 C
233.0 141.583 236.592 138.278 240.118 137.423 C
241.875 136.997 243.627 137.177 244.926 137.851 C
246.166 138.496 247.0 139.59 247.0 141.091 C
247.0 142.592 246.166 143.686 244.926 144.33 C
243.627 145.005 241.875 145.184 240.118 144.758 C
236.592 143.904 233.0 140.599 233.0 133.818 C
233.0 127.038 236.592 123.733 240.118 122.878 C
241.875 122.452 243.627 122.632 244.926 123.306 C
246.166 123.95 247.0 125.045 247.0 126.545 C
247.0 128.051 246.161 129.149 244.914 129.836 C
243.604 130.559 241.839 130.825 240.072 130.568 C
236.568 130.058 233.0 127.49 233.0 122.182 C
233.0 115.876 236.58 113.173 240.095 112.491 C
240.586 112.396 L
240.396 111.414 L
239.905 111.509 L
235.92 112.282 232.0 115.397 232.0 122.182 C
232.0 127.987 235.932 130.976 239.928 131.557 C
241.911 131.846 243.896 131.54 245.398 130.712 C
246.964 129.848 248.0 128.415 248.0 126.545 C
248.0 124.671 246.959 123.235 245.387 122.418 C
243.873 121.632 241.875 121.423 239.882 121.906 C
235.908 122.87 232.0 126.576 232.0 133.818 C
232.0 141.06 235.908 144.767 239.882 145.73 C
241.875 146.213 243.873 146.004 245.387 145.218 C
246.959 144.402 248.0 142.965 248.0 141.091 C
248.0 139.217 246.959 137.78 245.387 136.964 C
243.873 136.178 241.875 135.968 239.882 136.452 C
235.908 137.415 232.0 141.121 232.0 148.364 C
232.0 155.606 235.908 159.312 239.882 160.276 C
241.875 160.759 243.873 160.549 245.387 159.763 C
246.959 158.947 248.0 157.511 248.0 155.636 C
248.0 153.762 246.959 152.325 245.387 151.509 C
243.873 150.723 241.875 150.514 239.882 150.997 C
235.908 151.96 232.0 155.667 232.0 162.909 C
232.0 170.151 235.908 173.858 239.882 174.821 C
241.875 175.304 243.873 175.095 245.387 174.309 C
246.959 173.493 248.0 172.056 248.0 170.182 C
248.0 168.308 246.959 166.871 245.387 166.055 C
243.873 165.269 241.875 165.059 239.882 165.542 C
235.908 166.506 232.0 170.212 232.0 177.455 C
232.0 184.697 235.908 188.403 239.882 189.367 C
241.875 189.85 243.873 189.64 245.387 188.854 C
246.959 188.038 248.0 186.601 248.0 184.727 C
248.0 182.853 246.959 181.416 245.387 180.6 C
243.873 179.814 241.875 179.605 239.882 180.088 C
235.908 181.051 232.0 184.758 232.0 192.0 C
232.0 199.242 235.908 202.949 239.882 203.912 C
241.875 204.395 243.873 204.186 245.387 203.4 C
246.959 202.584 248.0 201.147 248.0 199.273 C
248.0 197.399 246.959 195.962 245.387 195.146 C
243.873 194.36 241.875 194.15 239.882 194.633 C
235.908 195.597 232.0 199.303 232.0 206.545 C
232.0 213.788 235.908 217.494 239.882 218.458 C
241.875 218.941 243.873 218.731 245.387 217.945 C
246.959 217.129 248.0 215.692 248.0 213.818 C
248.0 211.944 246.959 210.507 245.387 209.691 C
243.873 208.905 241.875 208.696 239.882 209.179 C
235.908 210.142 232.0 213.849 232.0 221.091 C
232.0 228.333 235.908 232.039 239.882 233.003 C
241.875 233.486 243.873 233.277 245.387 232.491 C
246.959 231.675 248.0 230.238 248.0 228.364 C
248.0 226.489 246.959 225.053 245.387 224.237 C
243.873 223.451 241.875 223.241 239.882 223.724 C
235.908 224.688 232.0 228.394 232.0 235.636 C
232.0 242.879 235.908 246.585 239.882 247.548 C
241.875 248.032 243.873 247.822 245.387 247.036 C
246.959 246.22 248.0 244.783 248.0 242.909 C
248.0 241.035 246.959 239.598 245.387 238.782 C
243.873 237.996 241.875 237.787 239.882 238.27 C
235.908 239.233 232.0 242.94 232.0 250.182 C
232.0 257.424 235.908 261.13 239.882 262.094 C
241.875 262.577 243.873 262.368 245.387 261.582 C
246.959 260.766 248.0 259.329 248.0 257.455 C
248.0 255.585 246.964 254.152 245.398 253.288 C
243.896 252.46 241.911 252.154 239.928 252.443 C
235.932 253.024 232.0 256.013 232.0 261.818 C
232.0 268.603 235.92 271.718 239.905 272.491 C
240.396 272.586 L
240.586 271.604 L
240.095 271.509 L
P
G
WC
WF
R N
N
336.095 272.491 M
340.08 271.718 344.0 268.603 344.0 261.818 C
344.0 256.013 340.068 253.024 336.072 252.443 C
334.089 252.154 332.104 252.46 330.602 253.288 C
329.036 254.152 328.0 255.585 328.0 257.455 C
328.0 259.329 329.041 260.766 330.614 261.582 C
332.127 262.368 334.125 262.577 336.118 262.094 C
340.092 261.13 344.0 257.424 344.0 250.182 C
344.0 242.94 340.092 239.233 336.118 238.27 C
334.125 237.787 332.127 237.996 330.614 238.782 C
329.041 239.598 328.0 241.035 328.0 242.909 C
328.0 244.783 329.041 246.22 330.614 247.036 C
332.127 247.822 334.125 248.032 336.118 247.548 C
340.092 246.585 344.0 242.879 344.0 235.636 C
344.0 228.394 340.092 224.688 336.118 223.724 C
334.125 223.241 332.127 223.451 330.614 224.237 C
329.041 225.053 328.0 226.489 328.0 228.364 C
328.0 230.238 329.041 231.675 330.614 232.491 C
332.127 233.277 334.125 233.486 336.118 233.003 C
340.092 232.039 344.0 228.333 344.0 221.091 C
344.0 213.849 340.092 210.142 336.118 209.179 C
334.125 208.696 332.127 208.905 330.614 209.691 C
329.041 210.507 328.0 211.944 328.0 213.818 C
328.0 215.692 329.041 217.129 330.614 217.945 C
332.127 218.731 334.125 218.941 336.118 218.458 C
340.092 217.494 344.0 213.788 344.0 206.545 C
344.0 199.303 340.092 195.597 336.118 194.633 C
334.125 194.15 332.127 194.36 330.614 195.146 C
329.041 195.962 328.0 197.399 328.0 199.273 C
328.0 201.147 329.041 202.584 330.614 203.4 C
332.127 204.186 334.125 204.395 336.118 203.912 C
340.092 202.949 344.0 199.242 344.0 192.0 C
344.0 184.758 340.092 181.051 336.118 180.088 C
334.125 179.605 332.127 179.814 330.614 180.6 C
329.041 181.416 328.0 182.853 328.0 184.727 C
328.0 186.601 329.041 188.038 330.614 188.854 C
332.127 189.64 334.125 189.85 336.118 189.367 C
340.092 188.403 344.0 184.697 344.0 177.455 C
344.0 170.212 340.092 166.506 336.118 165.542 C
334.125 165.059 332.127 165.269 330.614 166.055 C
329.041 166.871 328.0 168.308 328.0 170.182 C
328.0 172.056 329.041 173.493 330.614 174.309 C
332.127 175.095 334.125 175.304 336.118 174.821 C
340.092 173.858 344.0 170.151 344.0 162.909 C
344.0 155.667 340.092 151.96 336.118 150.997 C
334.125 150.514 332.127 150.723 330.614 151.509 C
329.041 152.325 328.0 153.762 328.0 155.636 C
328.0 157.511 329.041 158.947 330.614 159.763 C
332.127 160.549 334.125 160.759 336.118 160.276 C
340.092 159.312 344.0 155.606 344.0 148.364 C
344.0 141.121 340.092 137.415 336.118 136.452 C
334.125 135.968 332.127 136.178 330.614 136.964 C
329.041 137.78 328.0 139.217 328.0 141.091 C
328.0 142.965 329.041 144.402 330.614 145.218 C
332.127 146.004 334.125 146.213 336.118 145.73 C
340.092 144.767 344.0 141.06 344.0 133.818 C
344.0 126.576 340.092 122.87 336.118 121.906 C
334.125 121.423 332.127 121.632 330.614 122.418 C
329.041 123.235 328.0 124.671 328.0 126.545 C
328.0 128.415 329.036 129.848 330.602 130.712 C
332.104 131.54 334.089 131.846 336.072 131.557 C
340.068 130.976 344.0 127.987 344.0 122.182 C
344.0 115.397 340.08 112.282 336.095 111.509 C
335.604 111.414 L
335.414 112.396 L
335.905 112.491 L
339.42 113.173 343.0 115.876 343.0 122.182 C
343.0 127.49 339.432 130.058 335.928 130.568 C
334.161 130.825 332.396 130.559 331.086 129.836 C
329.839 129.149 329.0 128.051 329.0 126.545 C
329.0 125.045 329.834 123.95 331.074 123.306 C
332.373 122.632 334.125 122.452 335.882 122.878 C
339.408 123.733 343.0 127.038 343.0 133.818 C
343.0 140.599 339.408 143.904 335.882 144.758 C
334.125 145.184 332.373 145.005 331.074 144.33 C
329.834 143.686 329.0 142.592 329.0 141.091 C
329.0 139.59 329.834 138.496 331.074 137.851 C
332.373 137.177 334.125 136.997 335.882 137.423 C
339.408 138.278 343.0 141.583 343.0 148.364 C
343.0 155.144 339.408 158.449 335.882 159.304 C
334.125 159.73 332.373 159.55 331.074 158.876 C
329.834 158.232 329.0 157.137 329.0 155.636 C
329.0 154.136 329.834 153.041 331.074 152.397 C
332.373 151.723 334.125 151.543 335.882 151.969 C
339.408 152.824 343.0 156.129 343.0 162.909 C
343.0 169.69 339.408 172.995 335.882 173.849 C
334.125 174.275 332.373 174.096 331.074 173.421 C
329.834 172.777 329.0 171.683 329.0 170.182 C
329.0 168.681 329.834 167.587 331.074 166.942 C
332.373 166.268 334.125 166.088 335.882 166.514 C
339.408 167.369 343.0 170.674 343.0 177.455 C
343.0 184.235 339.408 187.54 335.882 188.395 C
334.125 188.821 332.373 188.641 331.074 187.967 C
329.834 187.323 329.0 186.228 329.0 184.727 C
329.0 183.226 329.834 182.132 331.074 181.488 C
332.373 180.814 334.125 180.634 335.882 181.06 C
339.408 181.914 343.0 185.22 343.0 192.0 C
343.0 198.78 339.408 202.086 335.882 202.94 C
334.125 203.366 332.373 203.186 331.074 202.512 C
329.834 201.868 329.0 200.774 329.0 199.273 C
329.0 197.772 329.834 196.677 331.074 196.033 C
332.373 195.359 334.125 195.179 335.882 195.605 C
339.408 196.46 343.0 199.765 343.0 206.545 C
343.0 213.326 339.408 216.631 335.882 217.486 C
334.125 217.912 332.373 217.732 331.074 217.058 C
329.834 216.413 329.0 215.319 329.0 213.818 C
329.0 212.317 329.834 211.223 331.074 210.579 C
332.373 209.904 334.125 209.725 335.882 210.151 C
339.408 211.005 343.0 214.31 343.0 221.091 C
343.0 227.871 339.408 231.176 335.882 232.031 C
334.125 232.457 332.373 232.277 331.074 231.603 C
329.834 230.959 329.0 229.864 329.0 228.364 C
329.0 226.863 329.834 225.768 331.074 225.124 C
332.373 224.45 334.125 224.27 335.882 224.696 C
339.408 225.551 343.0 228.856 343.0 235.636 C
343.0 242.417 339.408 245.722 335.882 246.577 C
334.125 247.003 332.373 246.823 331.074 246.149 C
329.834 245.504 329.0 244.41 329.0 242.909 C
329.0 241.408 329.834 240.314 331.074 239.67 C
332.373 238.995 334.125 238.816 335.882 239.242 C
339.408 240.096 343.0 243.401 343.0 250.182 C
343.0 256.962 339.408 260.267 335.882 261.122 C
334.125 261.548 332.373 261.368 331.074 260.694 C
329.834 260.05 329.0 258.955 329.0 257.455 C
329.0 255.949 329.839 254.851 331.086 254.164 C
332.396 253.441 334.161 253.175 335.928 253.432 C
339.432 253.942 343.0 256.51 343.0 261.818 C
343.0 268.124 339.42 270.828 335.905 271.509 C
335.414 271.604 L
335.604 272.586 L
336.095 272.491 L
P
G
WC
WF
R N
N
343.492 171.092 M
344.147 167.568 346.869 163.956 353.305 163.884 C
358.657 163.824 361.287 167.363 361.846 170.862 C
362.127 172.625 361.884 174.393 361.178 175.711 C
360.506 176.965 359.416 177.816 357.911 177.833 C
356.411 177.85 355.308 177.029 354.652 175.796 C
353.966 174.505 353.77 172.756 354.185 170.995 C
355.017 167.458 358.319 163.827 365.172 163.75 C
372.024 163.674 375.406 167.23 376.318 170.745 C
376.772 172.497 376.616 174.251 375.959 175.556 C
375.331 176.804 374.246 177.65 372.745 177.666 C
371.244 177.683 370.141 176.862 369.485 175.629 C
368.799 174.339 368.604 172.589 369.018 170.828 C
369.85 167.292 373.152 163.661 380.005 163.584 C
386.857 163.507 390.24 167.063 391.151 170.579 C
391.605 172.33 391.449 174.084 390.792 175.39 C
390.164 176.637 389.079 177.483 387.578 177.5 C
386.077 177.516 384.974 176.695 384.319 175.462 C
383.632 174.172 383.437 172.423 383.852 170.661 C
384.684 167.125 387.985 163.494 394.839 163.417 C
401.691 163.34 405.073 166.896 405.984 170.412 C
406.438 172.164 406.283 173.918 405.625 175.223 C
404.997 176.471 403.912 177.316 402.411 177.333 C
400.911 177.35 399.808 176.529 399.152 175.296 C
398.466 174.005 398.27 172.256 398.685 170.495 C
399.517 166.958 402.819 163.327 409.672 163.25 C
416.524 163.174 419.906 166.73 420.818 170.245 C
421.272 171.997 421.116 173.751 420.459 175.056 C
419.831 176.304 418.746 177.15 417.245 177.166 C
415.74 177.183 414.633 176.357 413.933 175.119 C
413.197 173.816 412.914 172.055 413.156 170.285 C
413.636 166.775 416.187 163.177 421.539 163.117 C
427.974 163.045 430.776 166.596 431.511 170.103 C
431.614 170.592 L
432.592 170.387 L
432.489 169.897 L
431.656 165.922 428.441 162.039 421.526 162.117 C
415.679 162.183 412.713 166.148 412.165 170.149 C
411.894 172.135 412.219 174.118 413.062 175.61 C
413.942 177.167 415.387 178.187 417.257 178.166 C
419.131 178.145 420.556 177.087 421.352 175.506 C
422.119 173.983 422.301 171.983 421.786 169.995 C
420.759 166.032 416.974 162.168 409.66 162.251 C
402.347 162.333 398.649 166.281 397.712 170.265 C
397.241 172.264 397.468 174.26 398.269 175.766 C
399.101 177.328 400.55 178.354 402.424 178.333 C
404.298 178.312 405.723 177.254 406.519 175.673 C
407.286 174.149 407.468 172.149 406.953 170.162 C
405.925 166.199 402.14 162.335 394.826 162.417 C
387.513 162.5 383.816 166.448 382.878 170.432 C
382.408 172.431 382.635 174.427 383.436 175.932 C
384.267 177.495 385.716 178.521 387.59 178.5 C
389.465 178.478 390.889 177.421 391.685 175.839 C
392.452 174.316 392.634 172.316 392.119 170.328 C
391.092 166.365 387.307 162.501 379.993 162.584 C
372.68 162.666 368.983 166.614 368.045 170.598 C
367.574 172.597 367.802 174.593 368.603 176.099 C
369.434 177.662 370.883 178.687 372.757 178.666 C
374.631 178.645 376.056 177.587 376.852 176.006 C
377.619 174.483 377.801 172.483 377.286 170.495 C
376.259 166.532 372.474 162.668 365.16 162.751 C
357.847 162.833 354.149 166.781 353.212 170.765 C
352.741 172.764 352.968 174.76 353.769 176.266 C
354.601 177.828 356.05 178.854 357.924 178.833 C
359.794 178.812 361.214 177.759 362.059 176.184 C
362.869 174.672 363.15 172.683 362.833 170.703 C
362.195 166.715 359.141 162.818 353.293 162.884 C
346.38 162.962 343.252 166.916 342.508 170.908 C
342.417 171.4 L
343.4 171.583 L
343.492 171.092 L
P
G
WC
WF
R N
N
363.0 219.65 M
371.0 219.65 L
371.359 219.65 371.65 219.359 371.65 219.0 C
371.65 218.641 371.359 218.35 371.0 218.35 C
363.0 218.35 L
362.641 218.35 362.35 218.641 362.35 219.0 C
362.35 219.359 362.641 219.65 363.0 219.65 C
P
379.0 219.65 M
387.0 219.65 L
387.359 219.65 387.65 219.359 387.65 219.0 C
387.65 218.641 387.359 218.35 387.0 218.35 C
379.0 218.35 L
378.641 218.35 378.35 218.641 378.35 219.0 C
378.35 219.359 378.641 219.65 379.0 219.65 C
P
395.0 219.65 M
403.0 219.65 L
403.359 219.65 403.65 219.359 403.65 219.0 C
403.65 218.641 403.359 218.35 403.0 218.35 C
395.0 218.35 L
394.641 218.35 394.35 218.641 394.35 219.0 C
394.35 219.359 394.641 219.65 395.0 219.65 C
P
411.0 219.65 M
419.0 219.65 L
419.359 219.65 419.65 219.359 419.65 219.0 C
419.65 218.641 419.359 218.35 419.0 218.35 C
411.0 218.35 L
410.641 218.35 410.35 218.641 410.35 219.0 C
410.35 219.359 410.641 219.65 411.0 219.65 C
P
427.0 219.65 M
432.0 219.65 L
432.359 219.65 432.65 219.359 432.65 219.0 C
432.65 218.641 432.359 218.35 432.0 218.35 C
427.0 218.35 L
426.641 218.35 426.35 218.641 426.35 219.0 C
426.35 219.359 426.641 219.65 427.0 219.65 C
P
347.0 219.65 M
355.0 219.65 L
355.359 219.65 355.65 219.359 355.65 219.0 C
355.65 218.641 355.359 218.35 355.0 218.35 C
347.0 218.35 L
346.641 218.35 346.35 218.641 346.35 219.0 C
346.35 219.359 346.641 219.65 347.0 219.65 C
P
G
WC
WF
R N
N
347.0 219.0 M
347.0 221.209 345.209 223.0 343.0 223.0 C
340.791 223.0 339.0 221.209 339.0 219.0 C
339.0 216.791 340.791 215.0 343.0 215.0 C
345.209 215.0 347.0 216.791 347.0 219.0 C
P
G
WC
WF
R N
N
346.5 219.0 M
346.5 220.933 344.933 222.5 343.0 222.5 C
341.067 222.5 339.5 220.933 339.5 219.0 C
339.5 217.067 341.067 215.5 343.0 215.5 C
344.933 215.5 346.5 217.067 346.5 219.0 C
P
347.5 219.0 M
347.5 216.515 345.485 214.5 343.0 214.5 C
340.515 214.5 338.5 216.515 338.5 219.0 C
338.5 221.485 340.515 223.5 343.0 223.5 C
345.485 223.5 347.5 221.485 347.5 219.0 C
P
G
WC
WF
R N
N
144.0 112.5 M
240.0 112.5 L
240.5 112.5 L
240.5 111.5 L
240.0 111.5 L
144.0 111.5 L
143.5 111.5 L
143.5 112.5 L
144.0 112.5 L
P
G
WC
WF
R N
N
194.5 112.0 M
189.5 114.0 L
190.5 112.0 L
189.5 110.0 L
P
G
WC
WF
R N
N
194.314 111.536 M
189.314 113.536 L
189.5 114.0 L
189.947 114.223 L
190.947 112.223 L
191.059 112.0 L
190.947 111.777 L
189.947 109.777 L
189.5 110.0 L
189.314 110.464 L
194.314 112.464 L
194.5 112.0 L
194.314 111.536 L
P
194.686 111.536 M
189.686 109.536 L
188.465 109.048 L
189.053 110.223 L
190.053 112.223 L
190.5 112.0 L
190.053 111.777 L
189.053 113.777 L
188.465 114.952 L
189.686 114.464 L
194.686 112.464 L
195.847 112.0 L
194.686 111.536 L
P
G
WC
WF
R N
N
240.0 112.5 M
336.0 112.5 L
336.5 112.5 L
336.5 111.5 L
336.0 111.5 L
240.0 111.5 L
239.5 111.5 L
239.5 112.5 L
240.0 112.5 L
P
G
WC
WF
R N
N
290.5 112.0 M
285.5 114.0 L
286.5 112.0 L
285.5 110.0 L
P
G
WC
WF
R N
N
290.314 111.536 M
285.314 113.536 L
285.5 114.0 L
285.947 114.223 L
286.947 112.223 L
287.059 112.0 L
286.947 111.777 L
285.947 109.777 L
285.5 110.0 L
285.314 110.464 L
290.314 112.464 L
290.5 112.0 L
290.314 111.536 L
P
290.686 111.536 M
285.686 109.536 L
284.465 109.048 L
285.053 110.223 L
286.053 112.223 L
286.5 112.0 L
286.053 111.777 L
285.053 113.777 L
284.465 114.952 L
285.686 114.464 L
290.686 112.464 L
291.847 112.0 L
290.686 111.536 L
P
G
WC
WF
R N
N
336.0 112.5 M
432.0 112.5 L
432.5 112.5 L
432.5 111.5 L
432.0 111.5 L
336.0 111.5 L
335.5 111.5 L
335.5 112.5 L
336.0 112.5 L
P
G
WC
WF
R N
N
386.5 112.0 M
381.5 114.0 L
382.5 112.0 L
381.5 110.0 L
P
G
WC
WF
R N
N
386.314 111.536 M
381.314 113.536 L
381.5 114.0 L
381.947 114.223 L
382.947 112.223 L
383.059 112.0 L
382.947 111.777 L
381.947 109.777 L
381.5 110.0 L
381.314 110.464 L
386.314 112.464 L
386.5 112.0 L
386.314 111.536 L
P
386.686 111.536 M
381.686 109.536 L
380.465 109.048 L
381.053 110.223 L
382.053 112.223 L
382.5 112.0 L
382.053 111.777 L
381.053 113.777 L
380.465 114.952 L
381.686 114.464 L
386.686 112.464 L
387.847 112.0 L
386.686 111.536 L
P
G
WC
WF
R N
N
432.0 271.5 M
336.0 271.5 L
335.5 271.5 L
335.5 272.5 L
336.0 272.5 L
432.0 272.5 L
432.5 272.5 L
432.5 271.5 L
432.0 271.5 L
P
G
WC
WF
R N
N
381.5 272.0 M
386.5 270.0 L
385.5 272.0 L
386.5 274.0 L
P
G
WC
WF
R N
N
381.686 272.464 M
386.686 270.464 L
386.5 270.0 L
386.053 269.777 L
385.053 271.777 L
384.941 272.0 L
385.053 272.223 L
386.053 274.223 L
386.5 274.0 L
386.686 273.536 L
381.686 271.536 L
381.5 272.0 L
381.686 272.464 L
P
381.314 272.464 M
386.314 274.464 L
387.535 274.952 L
386.947 273.777 L
385.947 271.777 L
385.5 272.0 L
385.947 272.223 L
386.947 270.223 L
387.535 269.048 L
386.314 269.536 L
381.314 271.536 L
380.153 272.0 L
381.314 272.464 L
P
G
WC
WF
R N
N
336.0 271.5 M
240.0 271.5 L
239.5 271.5 L
239.5 272.5 L
240.0 272.5 L
336.0 272.5 L
336.5 272.5 L
336.5 271.5 L
336.0 271.5 L
P
G
WC
WF
R N
N
285.5 272.0 M
290.5 270.0 L
289.5 272.0 L
290.5 274.0 L
P
G
WC
WF
R N
N
285.686 272.464 M
290.686 270.464 L
290.5 270.0 L
290.053 269.777 L
289.053 271.777 L
288.941 272.0 L
289.053 272.223 L
290.053 274.223 L
290.5 274.0 L
290.686 273.536 L
285.686 271.536 L
285.5 272.0 L
285.686 272.464 L
P
285.314 272.464 M
290.314 274.464 L
291.535 274.952 L
290.947 273.777 L
289.947 271.777 L
289.5 272.0 L
289.947 272.223 L
290.947 270.223 L
291.535 269.048 L
290.314 269.536 L
285.314 271.536 L
284.153 272.0 L
285.314 272.464 L
P
G
WC
WF
R N
N
240.0 271.5 M
144.0 271.5 L
143.5 271.5 L
143.5 272.5 L
144.0 272.5 L
240.0 272.5 L
240.5 272.5 L
240.5 271.5 L
240.0 271.5 L
P
G
WC
WF
R N
N
189.5 272.0 M
194.5 270.0 L
193.5 272.0 L
194.5 274.0 L
P
G
WC
WF
R N
N
189.686 272.464 M
194.686 270.464 L
194.5 270.0 L
194.053 269.777 L
193.053 271.777 L
192.941 272.0 L
193.053 272.223 L
194.053 274.223 L
194.5 274.0 L
194.686 273.536 L
189.686 271.536 L
189.5 272.0 L
189.686 272.464 L
P
189.314 272.464 M
194.314 274.464 L
195.535 274.952 L
194.947 273.777 L
193.947 271.777 L
193.5 272.0 L
193.947 272.223 L
194.947 270.223 L
195.535 269.048 L
194.314 269.536 L
189.314 271.536 L
188.153 272.0 L
189.314 272.464 L
P
G
WC
WF
R N
pgSave restore
showpage
%%EOF
