%!PS-Adobe-3.0 EPSF-3.0
%%BoundingBox: (atend)
%%LanguageLevel: 2
%%Creator: Grace-5.1.22
%%CreationDate: Wed Mar 27 23:08:47 2013
%%DocumentData: Clean8Bit
%%Orientation: Portrait
%%Title: /Users/spmartin/tex/papers/hint2/summary/shift_8TeV.agr
%%For: spmartin
%%DocumentNeededResources: (atend)
%%EndComments
%%BeginProlog
/m {moveto} def
/l {lineto} def
/s {stroke} def
/n {newpath} def
/c {closepath} def
/RL {rlineto} def
/SLW {setlinewidth} def
/GS {gsave} def
/GR {grestore} def
/SC {setcolor} def
/SGRY {setgray} def
/SRGB {setrgbcolor} def
/SD {setdash} def
/SLC {setlinecap} def
/SLJ {setlinejoin} def
/SCS {setcolorspace} def
/FFSF {findfont setfont} def
/CC {concat} def
/PXL {n m 0 0 RL s} def
/Color0 {1.0000 1.0000 1.0000} def
/Color1 {0.0000 0.0000 0.0000} def
/Color2 {1.0000 0.0000 0.0000} def
/Color3 {0.0000 1.0000 0.0000} def
/Color4 {0.0000 0.0000 1.0000} def
/Color5 {1.0000 1.0000 0.0000} def
/Color6 {0.7373 0.5608 0.5608} def
/Color7 {0.8627 0.8627 0.8627} def
/Color8 {0.5804 0.0000 0.8275} def
/Color9 {0.0000 1.0000 1.0000} def
/Color10 {1.0000 0.0000 1.0000} def
/Color11 {1.0000 0.6471 0.0000} def
/Color12 {0.4471 0.1294 0.7373} def
/Color13 {0.4039 0.0275 0.2824} def
/Color14 {0.2510 0.8784 0.8157} def
/Color15 {0.0000 0.5451 0.0000} def
/Color16 {0.7529 0.7529 0.7529} def
/Color17 {0.5059 0.5059 0.5059} def
/Color18 {0.2588 0.2588 0.2588} def
/Color19 {0.7529 0.8863 0.7529} def
/Color20 {0.5059 0.7725 0.5059} def
/Color21 {0.2588 0.6588 0.2588} def
/Color22 {0.7529 0.7529 1.0000} def
/Color23 {0.5059 0.5059 1.0000} def
/Color24 {0.2588 0.2588 1.0000} def
/Color25 {1.0000 0.7529 0.7529} def
/Color26 {1.0000 0.5059 0.5059} def
/Color27 {1.0000 0.2588 0.2588} def
/PTRN {
 /pat_bits exch def 
 <<
  /PaintType 2
  /PatternType 1 /TilingType 1
  /BBox[0 0 16 16]
  /XStep 16 /YStep 16
  /PaintProc {
   pop
   16 16 true [-1 0 0 -1 16 16] pat_bits imagemask
  }
 >>
 [0.0016 0 0 0.0016 0 0]
 makepattern
} def
/Pattern0 {<0000000000000000000000000000000000000000000000000000000000000000> PTRN} bind def
/Pattern1 {<ffffffffffffffffffffffffffffffffffffffffffffffffffffffffffffffff> PTRN} bind def
/Pattern2 {<eeeeffffbbbbffffeeeeffffbbbbffffeeeeffffbbbbffffeeeeffffbbbbffff> PTRN} bind def
/Pattern3 {<eeeebbbbeeeebbbbeeeebbbbeeeebbbbeeeebbbbeeeebbbbeeeebbbbeeeebbbb> PTRN} bind def
/Pattern4 {<5555aaaa5555aaaa5555aaaa5555aaaa5555aaaa5555aaaa5555aaaa5555aaaa> PTRN} bind def
/Pattern5 {<1111444411114444111144441111444411114444111144441111444411114444> PTRN} bind def
/Pattern6 {<1111000044440000111100004444000011110000444400001111000044440000> PTRN} bind def
/Pattern7 {<1010000000000000010100000000000010100000000000000101000000000000> PTRN} bind def
/Pattern8 {<0000000000000000000000000000000000000000000000000000000000000000> PTRN} bind def
/Pattern9 {<1e1e0f0f8787c3c3e1e1f0f078783c3c1e1e0f0f8787c3c3e1e1f0f078783c3c> PTRN} bind def
/Pattern10 {<7878f0f0e1e1c3c387870f0f1e1e3c3c7878f0f0e1e1c3c387870f0f1e1e3c3c> PTRN} bind def
/Pattern11 {<3333333333333333333333333333333333333333333333333333333333333333> PTRN} bind def
/Pattern12 {<ffffffff00000000ffffffff00000000ffffffff00000000ffffffff00000000> PTRN} bind def
/Pattern13 {<8181424224241818181824244242818181814242242418181818242442428181> PTRN} bind def
/Pattern14 {<8080404020201010080804040202010180804040202010100808040402020101> PTRN} bind def
/Pattern15 {<0101020204040808101020204040808001010202040408081010202040408080> PTRN} bind def
/Pattern16 {<2222222222222222222222222222222222222222222222222222222222222222> PTRN} bind def
/Pattern17 {<0000ffff000000000000ffff000000000000ffff000000000000ffff00000000> PTRN} bind def
/Pattern18 {<2222ffff222222222222ffff222222222222ffff222222222222ffff22222222> PTRN} bind def
/Pattern19 {<ffffffff33333333ffffffff33333333ffffffff33333333ffffffff33333333> PTRN} bind def
/Pattern20 {<0f0f0f0f0f0f0f0ff0f0f0f0f0f0f0f00f0f0f0f0f0f0f0ff0f0f0f0f0f0f0f0> PTRN} bind def
/Pattern21 {<ff00ff00ff00ff00ff00ff00ff00ff0000ff00ff00ff00ff00ff00ff00ff00ff> PTRN} bind def
/Pattern22 {<8001800180018001800180018001ffffffff8001800180018001800180018001> PTRN} bind def
/Pattern23 {<c003c003c003c003c003c003ffffffffffffffffc003c003c003c003c003c003> PTRN} bind def
/Pattern24 {<040404040404ffff404040404040ffff040404040404ffff404040404040ffff> PTRN} bind def
/Pattern25 {<180018001800180018001800ffffffff001800180018001800180018ffffffff> PTRN} bind def
/Pattern26 {<1111b8b87c7c3a3a1111a3a3c7c78b8b1111b8b87c7c3a3a1111a3a3c7c78b8b> PTRN} bind def
/Pattern27 {<101010102828c7c70101010182827c7c101010102828c7c70101010182827c7c> PTRN} bind def
/Pattern28 {<1c1c121211112121c1c12121111112121c1c121211112121c1c1212111111212> PTRN} bind def
/Pattern29 {<3e3e414180808080e3e31414080808083e3e414180808080e3e3141408080808> PTRN} bind def
/Pattern30 {<4848888884848383848488884848383848488888848483838484888848483838> PTRN} bind def
/Pattern31 {<03030404080808080c0c12122121c0c003030404080808080c0c12122121c0c0> PTRN} bind def
/ellipsedict 8 dict def
ellipsedict /mtrx matrix put
/EARC {
 ellipsedict begin
  /endangle exch def
  /startangle exch def
  /yrad exch def
  /xrad exch def
  /y exch def
  /x exch def
  /savematrix mtrx currentmatrix def
  x y translate
  xrad yrad scale
  0 0 1 startangle endangle arc
  savematrix setmatrix
 end
} def
/TL {
  /kcomp exch def
  /linewidth exch def
  /offset exch def
  GS
  0 offset rmoveto
  linewidth SLW
  dup stringwidth exch kcomp add exch RL s
  GR
} def
/KINIT
{
 /kvector exch def
 /kid 0 def
} def
/KPROC
{
 pop pop
 kvector kid get
 0 rmoveto
 /kid 1 kid add def
} def
/DefEncoding [
 /.notdef
 /.notdef
 /.notdef
 /.notdef
 /.notdef
 /.notdef
 /.notdef
 /.notdef
 /.notdef
 /.notdef
 /.notdef
 /.notdef
 /.notdef
 /.notdef
 /.notdef
 /.notdef
 /.notdef
 /.notdef
 /.notdef
 /.notdef
 /.notdef
 /.notdef
 /.notdef
 /.notdef
 /.notdef
 /.notdef
 /.notdef
 /.notdef
 /.notdef
 /.notdef
 /.notdef
 /.notdef
 /space
 /exclam
 /quotedbl
 /numbersign
 /dollar
 /percent
 /ampersand
 /quoteright
 /parenleft
 /parenright
 /asterisk
 /plus
 /comma
 /hyphen
 /period
 /slash
 /zero
 /one
 /two
 /three
 /four
 /five
 /six
 /seven
 /eight
 /nine
 /colon
 /semicolon
 /less
 /equal
 /greater
 /question
 /at
 /A
 /B
 /C
 /D
 /E
 /F
 /G
 /H
 /I
 /J
 /K
 /L
 /M
 /N
 /O
 /P
 /Q
 /R
 /S
 /T
 /U
 /V
 /W
 /X
 /Y
 /Z
 /bracketleft
 /backslash
 /bracketright
 /asciicircum
 /underscore
 /grave
 /a
 /b
 /c
 /d
 /e
 /f
 /g
 /h
 /i
 /j
 /k
 /l
 /m
 /n
 /o
 /p
 /q
 /r
 /s
 /t
 /u
 /v
 /w
 /x
 /y
 /z
 /braceleft
 /bar
 /braceright
 /asciitilde
 /.notdef
 /.notdef
 /.notdef
 /.notdef
 /.notdef
 /.notdef
 /.notdef
 /.notdef
 /.notdef
 /.notdef
 /.notdef
 /.notdef
 /.notdef
 /.notdef
 /.notdef
 /.notdef
 /.notdef
 /.notdef
 /.notdef
 /.notdef
 /.notdef
 /.notdef
 /.notdef
 /.notdef
 /.notdef
 /.notdef
 /.notdef
 /.notdef
 /.notdef
 /.notdef
 /.notdef
 /.notdef
 /.notdef
 /space
 /exclamdown
 /cent
 /sterling
 /currency
 /yen
 /brokenbar
 /section
 /dieresis
 /copyright
 /ordfeminine
 /guillemotleft
 /logicalnot
 /hyphen
 /registered
 /macron
 /degree
 /plusminus
 /twosuperior
 /threesuperior
 /acute
 /mu
 /paragraph
 /periodcentered
 /cedilla
 /onesuperior
 /ordmasculine
 /guillemotright
 /onequarter
 /onehalf
 /threequarters
 /questiondown
 /Agrave
 /Aacute
 /Acircumflex
 /Atilde
 /Adieresis
 /Aring
 /AE
 /Ccedilla
 /Egrave
 /Eacute
 /Ecircumflex
 /Edieresis
 /Igrave
 /Iacute
 /Icircumflex
 /Idieresis
 /Eth
 /Ntilde
 /Ograve
 /Oacute
 /Ocircumflex
 /Otilde
 /Odieresis
 /multiply
 /Oslash
 /Ugrave
 /Uacute
 /Ucircumflex
 /Udieresis
 /Yacute
 /Thorn
 /germandbls
 /agrave
 /aacute
 /acircumflex
 /atilde
 /adieresis
 /aring
 /ae
 /ccedilla
 /egrave
 /eacute
 /ecircumflex
 /edieresis
 /igrave
 /iacute
 /icircumflex
 /idieresis
 /eth
 /ntilde
 /ograve
 /oacute
 /ocircumflex
 /otilde
 /odieresis
 /divide
 /oslash
 /ugrave
 /uacute
 /ucircumflex
 /udieresis
 /yacute
 /thorn
 /ydieresis
] def
%%EndProlog
%%BeginSetup
%%EndSetup
613.92 613.92 scale
n
0.0000 0.0000 m
0.0000 1.0000 l
1.1419 1.0000 l
1.1419 0.0000 l
c
[/DeviceRGB] SCS
Color0 SC
eofill
[/DeviceRGB] SCS
Color4 SC
[] 0 SD
0.0045 SLW
0 SLC
0 SLJ
n
0.2189 0.4352 m
0.2206 0.4541 l
0.2267 0.4896 l
0.2355 0.5214 l
0.2617 0.5841 l
0.3055 0.6534 l
0.3492 0.7028 l
0.3930 0.7394 l
0.4367 0.7679 l
0.4805 0.7888 l
0.5242 0.8048 l
0.5680 0.8166 l
0.6555 0.8304 l
0.7430 0.8345 l
0.8305 0.8332 l
0.8742 0.8312 l
0.9180 0.8291 l
1.0930 0.8184 l
s
[0.0225 0.0135 ] 0 SD
0.0045 SLW
n
0.2180 0.3689 m
1.0931 0.3689 l
s
[/DeviceRGB] SCS
Color15 SC
[] 0 SD
0.0045 SLW
n
0.2189 0.5141 m
0.2206 0.5287 l
0.2267 0.5558 l
0.2355 0.5801 l
0.2617 0.6281 l
0.3055 0.6811 l
0.3492 0.7189 l
0.3930 0.7469 l
0.4367 0.7687 l
0.4805 0.7847 l
0.5242 0.7969 l
0.5680 0.8059 l
0.6555 0.8165 l
0.7430 0.8196 l
0.8305 0.8186 l
0.8742 0.8171 l
0.9180 0.8155 l
1.0930 0.8072 l
s
[0.0225 0.0135 ] 0 SD
0.0045 SLW
n
0.2180 0.4635 m
1.0931 0.4635 l
s
[/DeviceRGB] SCS
Color2 SC
[] 0 SD
0.0045 SLW
n
0.2189 0.3564 m
0.2206 0.3795 l
0.2267 0.4234 l
0.2355 0.4627 l
0.2617 0.5401 l
0.3055 0.6256 l
0.3492 0.6867 l
0.3930 0.7320 l
0.4367 0.7670 l
0.4805 0.7930 l
0.5242 0.8127 l
0.5680 0.8272 l
0.6555 0.8443 l
0.7430 0.8494 l
0.8305 0.8477 l
0.8742 0.8453 l
0.9180 0.8427 l
1.0930 0.8295 l
s
[0.0225 0.0135 ] 0 SD
0.0045 SLW
n
0.2180 0.2743 m
1.0931 0.2743 l
s
[/DeviceRGB] SCS
Color1 SC
[] 0 SD
0.0015 SLW
n
0.2180 0.1290 m
1.0930 0.1290 l
s
n
0.2180 0.9960 m
1.0930 0.9960 l
s
[] 0 SD
0.0030 SLW
n
0.2355 0.1290 m
0.2355 0.1390 l
s
n
0.2355 0.9960 m
0.2355 0.9860 l
s
n
0.2530 0.1290 m
0.2530 0.1390 l
s
n
0.2530 0.9960 m
0.2530 0.9860 l
s
n
0.2705 0.1290 m
0.2705 0.1390 l
s
n
0.2705 0.9960 m
0.2705 0.9860 l
s
n
0.2880 0.1290 m
0.2880 0.1390 l
s
n
0.2880 0.9960 m
0.2880 0.9860 l
s
n
0.3230 0.1290 m
0.3230 0.1390 l
s
n
0.3230 0.9960 m
0.3230 0.9860 l
s
n
0.3405 0.1290 m
0.3405 0.1390 l
s
n
0.3405 0.9960 m
0.3405 0.9860 l
s
n
0.3580 0.1290 m
0.3580 0.1390 l
s
n
0.3580 0.9960 m
0.3580 0.9860 l
s
n
0.3755 0.1290 m
0.3755 0.1390 l
s
n
0.3755 0.9960 m
0.3755 0.9860 l
s
n
0.4105 0.1290 m
0.4105 0.1390 l
s
n
0.4105 0.9960 m
0.4105 0.9860 l
s
n
0.4280 0.1290 m
0.4280 0.1390 l
s
n
0.4280 0.9960 m
0.4280 0.9860 l
s
n
0.4455 0.1290 m
0.4455 0.1390 l
s
n
0.4455 0.9960 m
0.4455 0.9860 l
s
n
0.4630 0.1290 m
0.4630 0.1390 l
s
n
0.4630 0.9960 m
0.4630 0.9860 l
s
n
0.4980 0.1290 m
0.4980 0.1390 l
s
n
0.4980 0.9960 m
0.4980 0.9860 l
s
n
0.5155 0.1290 m
0.5155 0.1390 l
s
n
0.5155 0.9960 m
0.5155 0.9860 l
s
n
0.5330 0.1290 m
0.5330 0.1390 l
s
n
0.5330 0.9960 m
0.5330 0.9860 l
s
n
0.5505 0.1290 m
0.5505 0.1390 l
s
n
0.5505 0.9960 m
0.5505 0.9860 l
s
n
0.5855 0.1290 m
0.5855 0.1390 l
s
n
0.5855 0.9960 m
0.5855 0.9860 l
s
n
0.6030 0.1290 m
0.6030 0.1390 l
s
n
0.6030 0.9960 m
0.6030 0.9860 l
s
n
0.6205 0.1290 m
0.6205 0.1390 l
s
n
0.6205 0.9960 m
0.6205 0.9860 l
s
n
0.6380 0.1290 m
0.6380 0.1390 l
s
n
0.6380 0.9960 m
0.6380 0.9860 l
s
n
0.6730 0.1290 m
0.6730 0.1390 l
s
n
0.6730 0.9960 m
0.6730 0.9860 l
s
n
0.6905 0.1290 m
0.6905 0.1390 l
s
n
0.6905 0.9960 m
0.6905 0.9860 l
s
n
0.7080 0.1290 m
0.7080 0.1390 l
s
n
0.7080 0.9960 m
0.7080 0.9860 l
s
n
0.7255 0.1290 m
0.7255 0.1390 l
s
n
0.7255 0.9960 m
0.7255 0.9860 l
s
n
0.7605 0.1290 m
0.7605 0.1390 l
s
n
0.7605 0.9960 m
0.7605 0.9860 l
s
n
0.7780 0.1290 m
0.7780 0.1390 l
s
n
0.7780 0.9960 m
0.7780 0.9860 l
s
n
0.7955 0.1290 m
0.7955 0.1390 l
s
n
0.7955 0.9960 m
0.7955 0.9860 l
s
n
0.8130 0.1290 m
0.8130 0.1390 l
s
n
0.8130 0.9960 m
0.8130 0.9860 l
s
n
0.8480 0.1290 m
0.8480 0.1390 l
s
n
0.8480 0.9960 m
0.8480 0.9860 l
s
n
0.8655 0.1290 m
0.8655 0.1390 l
s
n
0.8655 0.9960 m
0.8655 0.9860 l
s
n
0.8830 0.1290 m
0.8830 0.1390 l
s
n
0.8830 0.9960 m
0.8830 0.9860 l
s
n
0.9005 0.1290 m
0.9005 0.1390 l
s
n
0.9005 0.9960 m
0.9005 0.9860 l
s
n
0.9355 0.1290 m
0.9355 0.1390 l
s
n
0.9355 0.9960 m
0.9355 0.9860 l
s
n
0.9530 0.1290 m
0.9530 0.1390 l
s
n
0.9530 0.9960 m
0.9530 0.9860 l
s
n
0.9705 0.1290 m
0.9705 0.1390 l
s
n
0.9705 0.9960 m
0.9705 0.9860 l
s
n
0.9880 0.1290 m
0.9880 0.1390 l
s
n
0.9880 0.9960 m
0.9880 0.9860 l
s
n
1.0230 0.1290 m
1.0230 0.1390 l
s
n
1.0230 0.9960 m
1.0230 0.9860 l
s
n
1.0405 0.1290 m
1.0405 0.1390 l
s
n
1.0405 0.9960 m
1.0405 0.9860 l
s
n
1.0580 0.1290 m
1.0580 0.1390 l
s
n
1.0580 0.9960 m
1.0580 0.9860 l
s
n
1.0755 0.1290 m
1.0755 0.1390 l
s
n
1.0755 0.9960 m
1.0755 0.9860 l
s
n
0.2180 0.1290 m
0.2180 0.1490 l
s
n
0.2180 0.9960 m
0.2180 0.9760 l
s
n
0.3055 0.1290 m
0.3055 0.1490 l
s
n
0.3055 0.9960 m
0.3055 0.9760 l
s
n
0.3930 0.1290 m
0.3930 0.1490 l
s
n
0.3930 0.9960 m
0.3930 0.9760 l
s
n
0.4805 0.1290 m
0.4805 0.1490 l
s
n
0.4805 0.9960 m
0.4805 0.9760 l
s
n
0.5680 0.1290 m
0.5680 0.1490 l
s
n
0.5680 0.9960 m
0.5680 0.9760 l
s
n
0.6555 0.1290 m
0.6555 0.1490 l
s
n
0.6555 0.9960 m
0.6555 0.9760 l
s
n
0.7430 0.1290 m
0.7430 0.1490 l
s
n
0.7430 0.9960 m
0.7430 0.9760 l
s
n
0.8305 0.1290 m
0.8305 0.1490 l
s
n
0.8305 0.9960 m
0.8305 0.9760 l
s
n
0.9180 0.1290 m
0.9180 0.1490 l
s
n
0.9180 0.9960 m
0.9180 0.9760 l
s
n
1.0055 0.1290 m
1.0055 0.1490 l
s
n
1.0055 0.9960 m
1.0055 0.9760 l
s
n
1.0930 0.1290 m
1.0930 0.1490 l
s
n
1.0930 0.9960 m
1.0930 0.9760 l
s
/Helvetica findfont
dup length dict begin
 {1 index /FID ne {def} {pop pop} ifelse} forall
 /Encoding DefEncoding def
 currentdict
end
/Font4 exch definefont pop
/Font4 FFSF
0.2039 0.0799 m
GS
[0.0554 0.0000 0.0000 0.0554 0 0] CC
(0) show
GR
/Font4 FFSF
0.2760 0.0795 m
GS
[0.0554 0.0000 0.0000 0.0554 0 0] CC
(10) show
GR
/Font4 FFSF
0.3635 0.0799 m
GS
[0.0554 0.0000 0.0000 0.0554 0 0] CC
(20) show
GR
/Font4 FFSF
0.4510 0.0799 m
GS
[0.0554 0.0000 0.0000 0.0554 0 0] CC
(30) show
GR
/Font4 FFSF
0.5385 0.0795 m
GS
[0.0554 0.0000 0.0000 0.0554 0 0] CC
(40) show
GR
/Font4 FFSF
0.6260 0.0799 m
GS
[0.0554 0.0000 0.0000 0.0554 0 0] CC
(50) show
GR
/Font4 FFSF
0.7135 0.0799 m
GS
[0.0554 0.0000 0.0000 0.0554 0 0] CC
(60) show
GR
/Font4 FFSF
0.8010 0.0799 m
GS
[0.0554 0.0000 0.0000 0.0554 0 0] CC
(70) show
GR
/Font4 FFSF
0.8885 0.0799 m
GS
[0.0554 0.0000 0.0000 0.0554 0 0] CC
(80) show
GR
/Font4 FFSF
0.9760 0.0799 m
GS
[0.0554 0.0000 0.0000 0.0554 0 0] CC
(90) show
GR
/Font4 FFSF
1.0480 0.0795 m
GS
[0.0554 0.0000 0.0000 0.0554 0 0] CC
(100) show
GR
/Font4 FFSF
0.3877 0.0242 m
GS
[0.0596 0.0000 0.0000 0.0596 0 0] CC
(Cut on p) show
GR
/Font4 FFSF
0.6133 0.0003 m
GS
[0.0422 0.0000 0.0000 0.0422 0 0] CC
(T) show
GR
/Font4 FFSF
0.6391 0.0242 m
GS
[0.0596 0.0000 0.0000 0.0596 0 0] CC
(\(jet\)  [GeV]) show
GR
[] 0 SD
0.0015 SLW
n
0.2180 0.1290 m
0.2180 0.9960 l
s
n
1.0930 0.1290 m
1.0930 0.9960 l
s
[] 0 SD
0.0030 SLW
n
0.2180 0.1611 m
0.2280 0.1611 l
s
n
1.0930 0.1611 m
1.0830 0.1611 l
s
n
0.2180 0.1932 m
0.2280 0.1932 l
s
n
1.0930 0.1932 m
1.0830 0.1932 l
s
n
0.2180 0.2253 m
0.2280 0.2253 l
s
n
1.0930 0.2253 m
1.0830 0.2253 l
s
n
0.2180 0.2574 m
0.2280 0.2574 l
s
n
1.0930 0.2574 m
1.0830 0.2574 l
s
n
0.2180 0.3217 m
0.2280 0.3217 l
s
n
1.0930 0.3217 m
1.0830 0.3217 l
s
n
0.2180 0.3538 m
0.2280 0.3538 l
s
n
1.0930 0.3538 m
1.0830 0.3538 l
s
n
0.2180 0.3859 m
0.2280 0.3859 l
s
n
1.0930 0.3859 m
1.0830 0.3859 l
s
n
0.2180 0.4180 m
0.2280 0.4180 l
s
n
1.0930 0.4180 m
1.0830 0.4180 l
s
n
0.2180 0.4822 m
0.2280 0.4822 l
s
n
1.0930 0.4822 m
1.0830 0.4822 l
s
n
0.2180 0.5143 m
0.2280 0.5143 l
s
n
1.0930 0.5143 m
1.0830 0.5143 l
s
n
0.2180 0.5464 m
0.2280 0.5464 l
s
n
1.0930 0.5464 m
1.0830 0.5464 l
s
n
0.2180 0.5786 m
0.2280 0.5786 l
s
n
1.0930 0.5786 m
1.0830 0.5786 l
s
n
0.2180 0.6428 m
0.2280 0.6428 l
s
n
1.0930 0.6428 m
1.0830 0.6428 l
s
n
0.2180 0.6749 m
0.2280 0.6749 l
s
n
1.0930 0.6749 m
1.0830 0.6749 l
s
n
0.2180 0.7070 m
0.2280 0.7070 l
s
n
1.0930 0.7070 m
1.0830 0.7070 l
s
n
0.2180 0.7391 m
0.2280 0.7391 l
s
n
1.0930 0.7391 m
1.0830 0.7391 l
s
n
0.2180 0.8033 m
0.2280 0.8033 l
s
n
1.0930 0.8033 m
1.0830 0.8033 l
s
n
0.2180 0.8354 m
0.2280 0.8354 l
s
n
1.0930 0.8354 m
1.0830 0.8354 l
s
n
0.2180 0.8676 m
0.2280 0.8676 l
s
n
1.0930 0.8676 m
1.0830 0.8676 l
s
n
0.2180 0.8997 m
0.2280 0.8997 l
s
n
1.0930 0.8997 m
1.0830 0.8997 l
s
n
0.2180 0.9639 m
0.2280 0.9639 l
s
n
1.0930 0.9639 m
1.0830 0.9639 l
s
n
0.2180 0.9960 m
0.2280 0.9960 l
s
n
1.0930 0.9960 m
1.0830 0.9960 l
s
n
0.2180 0.1290 m
0.2380 0.1290 l
s
n
1.0930 0.1290 m
1.0730 0.1290 l
s
n
0.2180 0.2896 m
0.2380 0.2896 l
s
n
1.0930 0.2896 m
1.0730 0.2896 l
s
n
0.2180 0.4501 m
0.2380 0.4501 l
s
n
1.0930 0.4501 m
1.0730 0.4501 l
s
n
0.2180 0.6107 m
0.2380 0.6107 l
s
n
1.0930 0.6107 m
1.0730 0.6107 l
s
n
0.2180 0.7712 m
0.2380 0.7712 l
s
n
1.0930 0.7712 m
1.0730 0.7712 l
s
n
0.2180 0.9318 m
0.2380 0.9318 l
s
n
1.0930 0.9318 m
1.0730 0.9318 l
s
/Font4 FFSF
0.1032 0.1106 m
GS
[0.0535 0.0000 0.0000 0.0535 0 0] CC
(-200) show
GR
/Font4 FFSF
0.1032 0.2712 m
GS
[0.0535 0.0000 0.0000 0.0535 0 0] CC
(-150) show
GR
/Font4 FFSF
0.1032 0.4317 m
GS
[0.0535 0.0000 0.0000 0.0535 0 0] CC
(-100) show
GR
/Font4 FFSF
0.1329 0.5923 m
GS
[0.0535 0.0000 0.0000 0.0535 0 0] CC
(-50) show
GR
/Font4 FFSF
0.1806 0.7528 m
GS
[0.0535 0.0000 0.0000 0.0535 0 0] CC
(0) show
GR
/Font4 FFSF
0.1509 0.9134 m
GS
[0.0535 0.0000 0.0000 0.0535 0 0] CC
(50) show
GR
/Symbol findfont
/Font12 exch definefont pop
/Font12 FFSF
0.0551 0.3764 m
GS
[0.0000 0.0689 -0.0689 0.0000 0 0] CC
(D) show
GR
/Font4 FFSF
0.0551 0.4186 m
GS
[0.0000 0.0689 -0.0689 0.0000 0 0] CC
(M) show
GR
/Font12 FFSF
0.0827 0.4761 m
GS
[0.0000 0.0487 -0.0487 0.0000 0 0] CC
(gg) show
GR
/Font4 FFSF
0.0551 0.5160 m
GS
[0.0000 0.0689 -0.0689 0.0000 0 0] CC
(   [MeV]) show
GR
n
0.2180 0.1290 m
0.2180 0.9960 l
1.0930 0.9960 l
1.0930 0.1290 l
0.2180 0.1290 l
c
s
/Font4 FFSF
0.7773 0.3900 m
GS
[0.0496 0.0000 0.0000 0.0496 0 0] CC
(pp > ) show
GR
/Font12 FFSF
0.8887 0.3900 m
GS
[0.0496 0.0000 0.0000 0.0496 0 0] CC
(gg) show
GR
/Font4 FFSF
0.9293 0.3900 m
GS
[0.0496 0.0000 0.0000 0.0496 0 0] CC
(  \(LO\)) show
GR
/Font4 FFSF
0.7863 0.7658 m
GS
[0.0496 0.0000 0.0000 0.0496 0 0] CC
(pp > j) show
GR
/Font12 FFSF
0.9091 0.7658 m
GS
[0.0496 0.0000 0.0000 0.0496 0 0] CC
(gg) show
GR
/Font4 FFSF
0.2477 0.9300 m
GS
[0.0496 0.0000 0.0000 0.0496 0 0] CC
(8 TeV LHC) show
GR
/Font12 FFSF
0.5600 0.9300 m
GS
[0.0496 0.0000 0.0000 0.0496 0 0] CC
(s) show
GR
/Font4 FFSF
0.5897 0.9102 m
GS
[0.0350 0.0000 0.0000 0.0350 0 0] CC
(MR) show
GR
/Font4 FFSF
0.6441 0.9300 m
GS
[0.0496 0.0000 0.0000 0.0496 0 0] CC
( = ) show
GR
/Font4 FFSF
[/DeviceRGB] SCS
Color15 SC
0.7050 0.9300 m
GS
[0.0496 0.0000 0.0000 0.0496 0 0] CC
(1.3,) show
GR
/Font4 FFSF
[/DeviceRGB] SCS
Color4 SC
0.8000 0.9300 m
GS
[0.0496 0.0000 0.0000 0.0496 0 0] CC
(1.7,) show
GR
/Font4 FFSF
[/DeviceRGB] SCS
Color2 SC
0.8950 0.9300 m
GS
[0.0496 0.0000 0.0000 0.0496 0 0] CC
(2.1) show
GR
/Font4 FFSF
[/DeviceRGB] SCS
Color1 SC
0.9780 0.9300 m
GS
[0.0496 0.0000 0.0000 0.0496 0 0] CC
(GeV) show
GR
/Font4 FFSF
1.1400 0.5400 m
GS
[-0.0006 0.0367 -0.0367 -0.0006 0 0] CC
(LHC HIGGS XS WG 2013) show
GR
%%Trailer
%%BoundingBox: 2 -1 701 614
%%DocumentNeededResources: font Helvetica
%%+ font Symbol
%%EOF
