%!PS-Adobe-2.0 EPSF-2.0
%%BoundingBox:  0 0 567 615
%%Title: Results/HiggspT.eps: VBF
%%Creator: ROOT Version 5.24/00
%%CreationDate: Tue Mar 19 09:55:24 2013
%%EndComments
%%BeginProlog
80 dict begin
/s {stroke} def /l {lineto} def /m {moveto} def /t {translate} def
/sw {stringwidth} def /r {rotate} def /rl {roll}  def /R {repeat} def
/d {rlineto} def /rm {rmoveto} def /gr {grestore} def /f {eofill} def
/c {setrgbcolor} def /black {0 setgray} def /sd {setdash} def
/cl {closepath} def /sf {scalefont setfont} def /lw {setlinewidth} def
/box {m dup 0 exch d exch 0 d 0 exch neg d cl} def
/NC{systemdict begin initclip end}def/C{NC box clip newpath}def
/bl {box s} def /bf {box f} def /Y { 0 exch d} def /X { 0 d} def 
/mp {newpath /y exch def /x exch def} def
/side {[w .77 mul w .23 mul] .385 w mul sd w 0 l currentpoint t -144 r} def
/mr {mp x y w2 0 360 arc} def /m24 {mr s} def /m20 {mr f} def
/mb {mp x y w2 add m w2 neg 0 d 0 w neg d w 0 d 0 w d cl} def
/mt {mp x y w2 add m w2 neg w neg d w 0 d cl} def
/m21 {mb f} def /m25 {mb s} def /m22 {mt f} def /m26{mt s} def
/m23 {mp x y w2 sub m w2 w d w neg 0 d cl f} def
/m27 {mp x y w2 add m w3 neg w2 neg d w3 w2 neg d w3 w2 d cl s} def
/m28 {mp x w2 sub y w2 sub w3 add m w3 0 d  0 w3 neg d w3 0 d 0 w3 d w3 0 d  0 w3 d w3 neg 0 d 0 w3 d w3 neg 0 d
 0 w3 neg d w3 neg 0 d cl s } def
/m29 {mp gsave x w2 sub y w2 add w3 sub m currentpoint t
 4 {side} repeat cl fill gr} def
/m30 {mp gsave x w2 sub y w2 add w3 sub m currentpoint t
 4 {side} repeat cl s gr} def
/m31 {mp x y w2 sub m 0 w d x w2 sub y m w 0 d x w2 sub y w2 add m w w neg d x w2 sub y w2
 sub m w w d s} def
/m2 {mp x y w2 sub m 0 w d x w2 sub y m w 0 d s} def
/m5 {mp x w2 sub y w2 sub m w w d x w2 sub y w2 add m w w neg d s} def
/reEncode {exch findfont dup length dict begin {1 index /FID eq  {pop pop} {def} ifelse } forall /Encoding exch def currentdict end dup /FontName get exch definefont pop } def [/Times-Bold /Times-Italic /Times-BoldItalic /Helvetica
 /Helvetica-Oblique /Helvetica-Bold /Helvetica-BoldOblique /Courier /Courier-Oblique /Courier-Bold /Courier-BoldOblique /Times-Roman /AvantGarde-Book /AvantGarde-BookOblique /AvantGarde-Demi /AvantGarde-DemiOblique /Bookman-Demi
 /Bookman-DemiItalic /Bookman-Light /Bookman-LightItalic /Helvetica-Narrow /Helvetica-Narrow-Bold /Helvetica-Narrow-BoldOblique /Helvetica-Narrow-Oblique /NewCenturySchlbk-Roman /NewCenturySchlbk-Bold
 /NewCenturySchlbk-BoldItalic /NewCenturySchlbk-Italic /Palatino-Bold /Palatino-BoldItalic /Palatino-Italic /Palatino-Roman ] {ISOLatin1Encoding reEncode } forall
/oshow {gsave [] 0 sd true charpath stroke gr} def
/stwn { /fs exch def /fn exch def /text exch def fn findfont fs sf
 text sw pop xs add /xs exch def} def
/stwb { /fs exch def /fn exch def /nbas exch def /textf exch deftextf length /tlen exch def nbas tlen gt {/nbas tlendef} iffn findfont fs sf textf dup length nbas sub nbas getinterval sw
pop neg xs add /xs exch def} def
%%EndProlog
%%BeginSetup
%%EndSetup
newpath  gsave  .25 .25 scale  gsave  0 0 t black[  ] 0 sd 3 lw 1 1 1 c 2268 2460 0 0 bf black 1 1 1 c 2177 1058 45 1353 bf black 1 1 1 c 1677 846 328 1459 bf black 1677 846 328 1459 bl 1 1 1 c 1677 846 328 1459 bf black 1677 846 328 1459 bl 0.8 0 0
 c[  12 12 ] 0 sd 6 lw 1 1 1 c black 0.8 0 0 c 328 1926 m 34 X 141 Y 33 X 52 Y 34 X 40 Y 33 X 23 Y 34 X 11 Y 34 X 12 Y 33 X 10 Y 34 X 6 Y 33 X 5 Y 34 X -4 Y 33 X -3 Y 34 X -5 Y 33 X -13 Y 34 X -10 Y 33 X -10 Y 34 X -15 Y 33 X -17 Y 34 X -13 Y 33 X
 -18 Y 34 X -12 Y 33 X -24 Y 34 X -17 Y 33 X -19 Y 34 X -22 Y 34 X -18 Y 33 X -18 Y 34 X -28 Y 33 X -13 Y 34 X -29 Y 33 X -14 Y 34 X -8 Y 33 X -36 Y 34 X -9 Y 33 X -35 Y 34 X -7 Y 33 X -18 Y 34 X -14 Y 33 X -43 Y 34 X 3 Y 33 X -46 Y 34 X 5 Y 33 X
 -17 Y 34 X -29 Y 34 X -1 Y 33 X -54 Y 34 X 3 Y 33 X -30 Y 67 X -23 Y 34 X s black[  ] 0 sd 3 lw 328 1459 m 1677 X s 328 1483 m -24 Y s 370 1471 m -12 Y s 412 1471 m -12 Y s 454 1471 m -12 Y s 496 1471 m -12 Y s 538 1483 m -24 Y s 580 1471 m -12 Y s
 622 1471 m -12 Y s 664 1471 m -12 Y s 706 1471 m -12 Y s 747 1483 m -24 Y s 789 1471 m -12 Y s 831 1471 m -12 Y s 873 1471 m -12 Y s 915 1471 m -12 Y s 957 1483 m -24 Y s 999 1471 m -12 Y s 1041 1471 m -12 Y s 1083 1471 m -12 Y s 1125 1471 m -12 Y
 s 1167 1483 m -24 Y s 1208 1471 m -12 Y s 1250 1471 m -12 Y s 1292 1471 m -12 Y s 1334 1471 m -12 Y s 1376 1483 m -24 Y s 1418 1471 m -12 Y s 1460 1471 m -12 Y s 1502 1471 m -12 Y s 1544 1471 m -12 Y s 1586 1483 m -24 Y s 1627 1471 m -12 Y s 1669
 1471 m -12 Y s 1711 1471 m -12 Y s 1753 1471 m -12 Y s 1795 1483 m -24 Y s 1837 1471 m -12 Y s 1879 1471 m -12 Y s 1921 1471 m -12 Y s 1963 1471 m -12 Y s 2005 1483 m -24 Y s
 gsave  2177 1058 45 1353 C 324 1453 t 0 r /Helvetica findfont 2.53676 sf 0 0 m (0) show NC gr 
 gsave  2177 1058 45 1353 C 534 1453 t 0 r /Helvetica findfont 2.53676 sf 0 0 m (50) show NC gr 
 gsave  2177 1058 45 1353 C 744 1453 t 0 r /Helvetica findfont 2.53676 sf 0 0 m (100) show NC gr 
 gsave  2177 1058 45 1353 C 954 1453 t 0 r /Helvetica findfont 2.53676 sf 0 0 m (150) show NC gr 
 gsave  2177 1058 45 1353 C 1162 1453 t 0 r /Helvetica findfont 2.53676 sf 0 0 m (200) show NC gr 
 gsave  2177 1058 45 1353 C 1372 1453 t 0 r /Helvetica findfont 2.53676 sf 0 0 m (250) show NC gr 
 gsave  2177 1058 45 1353 C 1582 1453 t 0 r /Helvetica findfont 2.53676 sf 0 0 m (300) show NC gr 
 gsave  2177 1058 45 1353 C 1792 1453 t 0 r /Helvetica findfont 2.53676 sf 0 0 m (350) show NC gr 
 gsave  2177 1058 45 1353 C 2002 1453 t 0 r /Helvetica findfont 2.53676 sf 0 0 m (400) show NC gr  328 1459 m 846 Y s
 gsave  2177 1058 45 1353 C 223 2149 t 90 r /Helvetica findfont 48.1984 sf 0 0 m ([pb/bin]) show NC gr  354 1473 m -26 X s 354 1496 m -26 X s 354 1515 m -26 X s 354 1532 m -26 X s 354 1546 m -26 X s 381 1559 m -53 X s
 gsave  2177 1058 45 1353 C 286 1559 t 0 r /Helvetica findfont 30.4411 sf 0 0 m (\2554) show NC gr 
 gsave  2177 1058 45 1353 C 235 1541 t 0 r /Helvetica findfont 45.6617 sf 0 0 m (10) show NC gr  354 1646 m -26 X s 354 1696 m -26 X s 354 1732 m -26 X s 354 1760 m -26 X s 354 1782 m -26 X s 354 1801 m -26 X s 354 1818 m -26 X s 354 1833 m -26 X s
 381 1846 m -53 X s
 gsave  2177 1058 45 1353 C 286 1848 t 0 r /Helvetica findfont 30.4411 sf 0 0 m (\2553) show NC gr 
 gsave  2177 1058 45 1353 C 235 1827 t 0 r /Helvetica findfont 45.6617 sf 0 0 m (10) show NC gr  354 1932 m -26 X s 354 1982 m -26 X s 354 2018 m -26 X s 354 2046 m -26 X s 354 2069 m -26 X s 354 2088 m -26 X s 354 2104 m -26 X s 354 2119 m -26 X s
 381 2132 m -53 X s
 gsave  2177 1058 45 1353 C 286 2131 t 0 r /Helvetica findfont 30.4411 sf 0 0 m (\2552) show NC gr 
 gsave  2177 1058 45 1353 C 235 2113 t 0 r /Helvetica findfont 45.6617 sf 0 0 m (10) show NC gr  354 2218 m -26 X s 354 2269 m -26 X s 354 2305 m -26 X s 6 lw 1 1 1 c black 328 1932 m 34 X 143 Y 33 X 58 Y 34 X 33 Y 33 X 18 Y 34 X 20 Y 34 X 10 Y 33 X
 12 Y 34 X 1 Y 33 X 6 Y 34 X -6 Y 33 X -2 Y 34 X -8 Y 33 X -10 Y 34 X -13 Y 33 X -11 Y 34 X -17 Y 33 X -10 Y 34 X -17 Y 33 X -19 Y 34 X -22 Y 33 X -19 Y 34 X -14 Y 33 X -17 Y 34 X -17 Y 34 X -17 Y 33 X -33 Y 34 X -10 Y 33 X -27 Y 34 X -14 Y 33 X -30
 Y 34 X -1 Y 33 X -31 Y 34 X -20 Y 33 X -33 Y 34 X 3 Y 33 X -20 Y 34 X -25 Y 33 X -2 Y 34 X -45 Y 33 X -10 Y 34 X -39 Y 33 X -3 Y 34 X -12 Y 34 X -22 Y 33 X 16 Y 34 X -9 Y 33 X -47 Y 34 X -23 Y 33 X -16 Y 34 X s 0.2 0.2 0.8 c[ 20 12 4 12] 0 sd 1 1 1
 c black 0.2 0.2 0.8 c 328 1928 m 34 X 129 Y 33 X 58 Y 34 X 34 Y 33 X 21 Y 34 X 19 Y 34 X 10 Y 33 X 2 Y 34 X 13 Y 67 X 1 Y 33 X -9 Y 34 X -5 Y 33 X -8 Y 34 X -9 Y 33 X -12 Y 34 X -16 Y 33 X -11 Y 34 X -14 Y 33 X -20 Y 34 X -18 Y 33 X -21 Y 34 X -10
 Y 33 X -27 Y 34 X -9 Y 34 X -19 Y 33 X -25 Y 34 X -25 Y 33 X -8 Y 34 X -30 Y 33 X -17 Y 34 X -29 Y 67 X -34 Y 33 X -26 Y 34 X -16 Y 33 X -23 Y 34 X 4 Y 33 X -16 Y 34 X -46 Y 33 X 16 Y 34 X -52 Y 33 X -4 Y 34 X -24 Y 34 X 2 Y 33 X -32 Y 34 X -5 Y 33
 X 5 Y 34 X -35 Y 33 X -3 Y 34 X s black
 gsave  2177 1058 45 1353 C 410 1562 t 0 r /Helvetica findfont 58.3455 sf 0 0 m (VBF Higgs \(125 GeV\) @ LHC 8 TeV) show NC gr 
 gsave  2177 1058 45 1353 C 2048 1946 t 90 r /Helvetica-BoldOblique findfont 30.4411 sf 0 0 m (LHC HIGGS XS WG 2013) show NC gr  1 1 1 c[  ] 0 sd 3 lw 588 243 1417 2041 bf black
 gsave  2177 1058 45 1353 C 1562 2230 t 0 r /Helvetica findfont 45.6617 sf 0 0 m (aMC@NLO+HW6) show NC gr  1 1 1 c 1439 2215 m 103 X 57 Y -103 X f black 6 lw 1439 2243 m 103 X s 3 lw /w 29 def /w2 {w 2 div} def /w3 {w 3 div} def 1490 2243 m20 6 lw
 gsave  2177 1058 45 1353 C 1562 2149 t 0 r /Helvetica findfont 45.6617 sf 0 0 m (aMC@NLO+PY6) show NC gr  1 1 1 c 3 lw 1439 2134 m 103 X 57 Y -103 X f 6 lw 0.8 0 0 c[  12 12 ] 0 sd 1439 2162 m 103 X s black[  ] 0 sd 3 lw 1490 2162 m20[  12 12 
] 0 sd 6 lw
 gsave  2177 1058 45 1353 C 1562 2068 t 0 r /Helvetica findfont 45.6617 sf 0 0 m (aMC@NLO+HWPP) show NC gr  1 1 1 c[  ] 0 sd 3 lw 1439 2053 m 103 X 57 Y -103 X f[  12 12 ] 0 sd 6 lw 0.2 0.2 0.8 c[ 20 12 4 12] 0 sd 1439 2081 m 103 X s black[  ] 0 sd
 3 lw 1490 2081 m20[ 20 12 4 12] 0 sd 6 lw[  ] 0 sd 3 lw 1 1 1 c black 1 1 1 c 1677 267 328 1184 bf black 1677 267 328 1184 bl 1 1 1 c 1677 267 328 1184 bf black 1677 267 328 1184 bl 328 1184 m 1677 X s 328 1211 m -27 Y s 370 1197 m -13 Y s 412 1197
 m -13 Y s 454 1197 m -13 Y s 496 1197 m -13 Y s 538 1211 m -27 Y s 580 1197 m -13 Y s 622 1197 m -13 Y s 664 1197 m -13 Y s 706 1197 m -13 Y s 747 1211 m -27 Y s 789 1197 m -13 Y s 831 1197 m -13 Y s 873 1197 m -13 Y s 915 1197 m -13 Y s 957 1211 m
 -27 Y s 999 1197 m -13 Y s 1041 1197 m -13 Y s 1083 1197 m -13 Y s 1125 1197 m -13 Y s 1167 1211 m -27 Y s 1208 1197 m -13 Y s 1250 1197 m -13 Y s 1292 1197 m -13 Y s 1334 1197 m -13 Y s 1376 1211 m -27 Y s 1418 1197 m -13 Y s 1460 1197 m -13 Y s
 1502 1197 m -13 Y s 1544 1197 m -13 Y s 1586 1211 m -27 Y s 1627 1197 m -13 Y s 1669 1197 m -13 Y s 1711 1197 m -13 Y s 1753 1197 m -13 Y s 1795 1211 m -27 Y s 1837 1197 m -13 Y s 1879 1197 m -13 Y s 1921 1197 m -13 Y s 1963 1197 m -13 Y s 2005
 1211 m -27 Y s
 gsave  2177 270 45 1181 C 314 1144 t 0 r /Helvetica findfont 45.9522 sf 0 0 m (0) show NC gr 
 gsave  2177 270 45 1181 C 511 1144 t 0 r /Helvetica findfont 45.9522 sf 0 0 m (50) show NC gr 
 gsave  2177 270 45 1181 C 709 1144 t 0 r /Helvetica findfont 45.9522 sf 0 0 m (100) show NC gr 
 gsave  2177 270 45 1181 C 919 1144 t 0 r /Helvetica findfont 45.9522 sf 0 0 m (150) show NC gr 
 gsave  2177 270 45 1181 C 1126 1144 t 0 r /Helvetica findfont 45.9522 sf 0 0 m (200) show NC gr 
 gsave  2177 270 45 1181 C 1336 1144 t 0 r /Helvetica findfont 45.9522 sf 0 0 m (250) show NC gr 
 gsave  2177 270 45 1181 C 1546 1144 t 0 r /Helvetica findfont 45.9522 sf 0 0 m (300) show NC gr 
 gsave  2177 270 45 1181 C 1756 1144 t 0 r /Helvetica findfont 45.9522 sf 0 0 m (350) show NC gr 
 gsave  2177 270 45 1181 C 1967 1144 t 0 r /Helvetica findfont 45.9522 sf 0 0 m (400) show NC gr  328 1184 m 267 Y s 393 1228 m -65 X s 361 1251 m -33 X s 361 1273 m -33 X s 361 1295 m -33 X s 393 1317 m -65 X s 361 1340 m -33 X s 361 1362 m -33 X s
 361 1384 m -33 X s 393 1407 m -65 X s 393 1228 m -65 X s 361 1206 m -33 X s 361 1184 m -33 X s 393 1407 m -65 X s 361 1429 m -33 X s
 gsave  2177 270 45 1181 C 253 1212 t 0 r /Helvetica findfont 45.9522 sf 0 0 m (0.8) show NC gr 
 gsave  2177 270 45 1181 C 299 1301 t 0 r /Helvetica findfont 45.9522 sf 0 0 m (1) show NC gr 
 gsave  2177 270 45 1181 C 253 1389 t 0 r /Helvetica findfont 45.9522 sf 0 0 m (1.2) show NC gr 
 gsave  2177 270 45 1181 C 370 1372 t 0 r /Helvetica findfont 38.2935 sf 0 0 m (aMC@NLO \255 Ratio over aMC@NLO+HW6) show NC gr  0.8 0 0 c[  12 12 ] 0 sd 6 lw 1 1 1 c black 0.8 0 0 c 328 1317 m 34 X -27 Y 33 X -18 Y 34 X 23 Y 33 X 13 Y 34 X -29 Y 34
 X 8 Y 33 X -10 Y 34 X 20 Y 33 X -4 Y 34 X 9 Y 33 X -5 Y 34 X 11 Y 33 X -12 Y 34 X 8 Y 33 X 6 Y 34 X 7 Y 33 X -26 Y 34 X 17 Y 33 X 3 Y 34 X 37 Y 33 X -19 Y 34 X -13 Y 33 X -5 Y 34 X -20 Y 34 X 1 Y 33 X 50 Y 34 X -63 Y 33 X 50 Y 34 X -54 Y 33 X 57 Y
 34 X -25 Y 33 X -19 Y 34 X 39 Y 33 X -3 Y 34 X -38 Y 33 X 8 Y 34 X 38 Y 33 X -129 Y 34 X 156 Y 33 X -123 Y 34 X 157 Y 33 X -57 Y 34 X -59 Y 34 X 71 Y 33 X -164 Y 67 X 33 Y 34 X 67 Y 33 X -21 Y 34 X s black[  ] 0 sd 1 1 1 c black 328 1317 m 1677 X s
 0.2 0.2 0.8 c[ 20 12 4 12] 0 sd 1 1 1 c black 0.2 0.2 0.8 c 328 1317 m 34 X -59 Y 33 X -1 Y 34 X 5 Y 33 X 6 Y 34 X -2 Y 34 X -1 Y 33 X -29 Y 34 X 38 Y 33 X -19 Y 34 X 21 Y 33 X -21 Y 34 X 10 Y 33 X 6 Y 34 X 12 Y 33 X -2 Y 34 X 4 Y 33 X -7 Y 34 X 12
 Y 33 X -5 Y 34 X 15 Y 33 X -6 Y 34 X 12 Y 33 X -33 Y 34 X 25 Y 34 X -4 Y 33 X 28 Y 34 X -51 Y 33 X 65 Y 34 X -57 Y 33 X 45 Y 34 X -91 Y 33 X 101 Y 34 X -49 Y 33 X 26 Y 34 X -64 Y 33 X -6 Y 34 X 96 Y 33 X -48 Y 34 X -5 Y 33 X 95 Y 34 X -48 Y 33 X -5
 Y 34 X -44 Y 34 X 85 Y 33 X -157 Y 34 X 11 Y 33 X 183 Y 34 X -50 Y 33 X 55 Y 34 X s black[  ] 0 sd 3 lw 1 1 1 c black 1 1 1 c 1677 292 328 889 bf black 1677 292 328 889 bl 1 1 1 c 1677 292 328 889 bf black 1677 292 328 889 bl 328 889 m 1677 X s 328
 918 m -29 Y s 370 903 m -14 Y s 412 903 m -14 Y s 454 903 m -14 Y s 496 903 m -14 Y s 538 918 m -29 Y s 580 903 m -14 Y s 622 903 m -14 Y s 664 903 m -14 Y s 706 903 m -14 Y s 747 918 m -29 Y s 789 903 m -14 Y s 831 903 m -14 Y s 873 903 m -14 Y s
 915 903 m -14 Y s 957 918 m -29 Y s 999 903 m -14 Y s 1041 903 m -14 Y s 1083 903 m -14 Y s 1125 903 m -14 Y s 1167 918 m -29 Y s 1208 903 m -14 Y s 1250 903 m -14 Y s 1292 903 m -14 Y s 1334 903 m -14 Y s 1376 918 m -29 Y s 1418 903 m -14 Y s 1460
 903 m -14 Y s 1502 903 m -14 Y s 1544 903 m -14 Y s 1586 918 m -29 Y s 1627 903 m -14 Y s 1669 903 m -14 Y s 1711 903 m -14 Y s 1753 903 m -14 Y s 1795 918 m -29 Y s 1837 903 m -14 Y s 1879 903 m -14 Y s 1921 903 m -14 Y s 1963 903 m -14 Y s 2005
 918 m -29 Y s
 gsave  2177 295 45 886 C 314 850 t 0 r /Helvetica findfont 45.8082 sf 0 0 m (0) show NC gr 
 gsave  2177 295 45 886 C 511 850 t 0 r /Helvetica findfont 45.8082 sf 0 0 m (50) show NC gr 
 gsave  2177 295 45 886 C 709 850 t 0 r /Helvetica findfont 45.8082 sf 0 0 m (100) show NC gr 
 gsave  2177 295 45 886 C 919 850 t 0 r /Helvetica findfont 45.8082 sf 0 0 m (150) show NC gr 
 gsave  2177 295 45 886 C 1126 850 t 0 r /Helvetica findfont 45.8082 sf 0 0 m (200) show NC gr 
 gsave  2177 295 45 886 C 1336 850 t 0 r /Helvetica findfont 45.8082 sf 0 0 m (250) show NC gr 
 gsave  2177 295 45 886 C 1546 850 t 0 r /Helvetica findfont 45.8082 sf 0 0 m (300) show NC gr 
 gsave  2177 295 45 886 C 1756 850 t 0 r /Helvetica findfont 45.8082 sf 0 0 m (350) show NC gr 
 gsave  2177 295 45 886 C 1967 850 t 0 r /Helvetica findfont 45.8082 sf 0 0 m (400) show NC gr  328 889 m 292 Y s 393 937 m -65 X s 361 962 m -33 X s 361 986 m -33 X s 361 1010 m -33 X s 393 1035 m -65 X s 361 1059 m -33 X s 361 1083 m -33 X s 361
 1108 m -33 X s 393 1132 m -65 X s 393 937 m -65 X s 361 913 m -33 X s 361 889 m -33 X s 393 1132 m -65 X s 361 1156 m -33 X s
 gsave  2177 295 45 886 C 253 921 t 0 r /Helvetica findfont 45.8082 sf 0 0 m (0.8) show NC gr 
 gsave  2177 295 45 886 C 299 1017 t 0 r /Helvetica findfont 45.8082 sf 0 0 m (1) show NC gr 
 gsave  2177 295 45 886 C 253 1116 t 0 r /Helvetica findfont 45.8082 sf 0 0 m (1.2) show NC gr 
 gsave  2177 295 45 886 C 370 1093 t 0 r /Helvetica findfont 38.1735 sf 0 0 m (POWHEG \255 Ratio over aMC@NLO+HW6) show NC gr  0.8 0 0 c[  12 12 ] 0 sd 6 lw 1 1 1 c black 0.8 0 0 c 328 1035 m 34 X -26 Y 33 X -18 Y 34 X 2 Y 33 X 2 Y 34 X -1 Y 34 X -3
 Y 33 X -7 Y 34 X 20 Y 33 X -19 Y 34 X 26 Y 33 X -17 Y 34 X -1 Y 33 X 15 Y 34 X -1 Y 33 X -3 Y 34 X 1 Y 33 X 9 Y 34 X -10 Y 33 X 12 Y 34 X 16 Y 33 X -18 Y 34 X -24 Y 33 X 12 Y 34 X -34 Y 34 X -12 Y 33 X 48 Y 34 X -26 Y 33 X 12 Y 34 X -13 Y 33 X 16 Y
 34 X -51 Y 33 X 44 Y 34 X -24 Y 33 X 59 Y 34 X -58 Y 33 X -6 Y 34 X 36 Y 33 X -93 Y 34 X 50 Y 33 X 51 Y 34 X -43 Y 33 X 35 Y 34 X 111 Y 34 X -145 Y 33 X -68 Y 34 X 13 Y 33 X 40 Y 34 X -55 Y 33 X 47 Y 34 X s black[  ] 0 sd 1 1 1 c black 328 1035 m
 34 X -6 Y 33 X -1 Y 34 X -5 Y 33 X 9 Y 34 X -12 Y 34 X 9 Y 33 X -12 Y 34 X 22 Y 33 X -17 Y 34 X 23 Y 33 X -21 Y 67 X 21 Y 34 X -10 Y 33 X -5 Y 34 X 7 Y 33 X 5 Y 34 X -9 Y 33 X 23 Y 34 X 8 Y 33 X -17 Y 34 X -30 Y 33 X 11 Y 34 X -38 Y 34 X 1 Y 33 X
 45 Y 34 X -33 Y 33 X 42 Y 34 X -26 Y 33 X -9 Y 34 X -90 Y 33 X 105 Y 34 X -31 Y 33 X 80 Y 34 X -87 Y 33 X -6 Y 34 X 30 Y 33 X -89 Y 34 X 123 Y 33 X -60 Y 67 X 62 Y 34 X 117 Y 34 X -100 Y 33 X -175 Y 67 X 57 Y 34 X -56 Y 33 X 48 Y 34 X s 0.2 0.2 0.8
 c[ 20 12 4 12] 0 sd 1 1 1 c black 0.2 0.2 0.8 c 328 1035 m 34 X -54 Y 33 X -1 Y 34 X -7 Y 33 X 6 Y 34 X -17 Y 34 X 19 Y 33 X -19 Y 34 X 19 Y 33 X -11 Y 34 X 24 Y 33 X -13 Y 34 X 5 Y 33 X 16 Y 34 X -9 Y 67 X 5 Y 33 X 3 Y 34 X -13 Y 33 X 44 Y 34 X
 -13 Y 67 X -34 Y 33 X 11 Y 34 X -19 Y 34 X 10 Y 33 X 8 Y 34 X -13 Y 33 X 39 Y 34 X -19 Y 33 X -2 Y 34 X -77 Y 33 X 63 Y 34 X -37 Y 33 X 122 Y 34 X -73 Y 33 X -35 Y 34 X 34 Y 33 X -58 Y 34 X 45 Y 33 X 35 Y 34 X -79 Y 33 X 26 Y 34 X 118 Y 34 X -68 Y
 33 X -127 Y 67 X 23 Y 34 X 14 Y 33 X 10 Y 34 X s black[ 20 20] 0 sd 3 lw 328 1035 m 1677 X s[  ] 0 sd 1 1 1 c black 1 1 1 c 1677 276 328 610 bf black 1677 276 328 610 bl 1 1 1 c 1677 276 328 610 bf black 1677 276 328 610 bl 328 610 m 1677 X s
 gsave  2177 394 45 492 C 1878 511 t 0 r /Helvetica findfont 45.7096 sf 0 0 m ( [GeV]) show NC gr 
 gsave  2177 394 45 492 C 1858 488 t 0 r /Helvetica findfont 30.4731 sf 0 0 m (T) show NC gr 
 gsave  2177 394 45 492 C 1691 511 t 0 r /Helvetica findfont 45.7096 sf 0 0 m ( Higgs p) show NC gr  328 634 m -24 Y s 370 622 m -12 Y s 412 622 m -12 Y s 454 622 m -12 Y s 496 622 m -12 Y s 538 634 m -24 Y s 580 622 m -12 Y s 622 622 m -12 Y s 664
 622 m -12 Y s 706 622 m -12 Y s 747 634 m -24 Y s 789 622 m -12 Y s 831 622 m -12 Y s 873 622 m -12 Y s 915 622 m -12 Y s 957 634 m -24 Y s 999 622 m -12 Y s 1041 622 m -12 Y s 1083 622 m -12 Y s 1125 622 m -12 Y s 1167 634 m -24 Y s 1208 622 m -12
 Y s 1250 622 m -12 Y s 1292 622 m -12 Y s 1334 622 m -12 Y s 1376 634 m -24 Y s 1418 622 m -12 Y s 1460 622 m -12 Y s 1502 622 m -12 Y s 1544 622 m -12 Y s 1586 634 m -24 Y s 1627 622 m -12 Y s 1669 622 m -12 Y s 1711 622 m -12 Y s 1753 622 m -12 Y
 s 1795 634 m -24 Y s 1837 622 m -12 Y s 1879 622 m -12 Y s 1921 622 m -12 Y s 1963 622 m -12 Y s 2005 634 m -24 Y s
 gsave  2177 394 45 492 C 314 564 t 0 r /Helvetica findfont 45.7096 sf 0 0 m (0) show NC gr 
 gsave  2177 394 45 492 C 511 564 t 0 r /Helvetica findfont 45.7096 sf 0 0 m (50) show NC gr 
 gsave  2177 394 45 492 C 709 564 t 0 r /Helvetica findfont 45.7096 sf 0 0 m (100) show NC gr 
 gsave  2177 394 45 492 C 919 564 t 0 r /Helvetica findfont 45.7096 sf 0 0 m (150) show NC gr 
 gsave  2177 394 45 492 C 1126 564 t 0 r /Helvetica findfont 45.7096 sf 0 0 m (200) show NC gr 
 gsave  2177 394 45 492 C 1336 564 t 0 r /Helvetica findfont 45.7096 sf 0 0 m (250) show NC gr 
 gsave  2177 394 45 492 C 1546 564 t 0 r /Helvetica findfont 45.7096 sf 0 0 m (300) show NC gr 
 gsave  2177 394 45 492 C 1756 564 t 0 r /Helvetica findfont 45.7096 sf 0 0 m (350) show NC gr 
 gsave  2177 394 45 492 C 1967 564 t 0 r /Helvetica findfont 45.7096 sf 0 0 m (400) show NC gr  328 610 m 276 Y s 374 656 m -46 X s 351 679 m -23 X s 351 702 m -23 X s 351 725 m -23 X s 374 748 m -46 X s 351 771 m -23 X s 351 794 m -23 X s 351 817 m
 -23 X s 374 840 m -46 X s 374 656 m -46 X s 351 633 m -23 X s 351 610 m -23 X s 374 840 m -46 X s 351 863 m -23 X s
 gsave  2177 394 45 492 C 253 640 t 0 r /Helvetica findfont 45.7096 sf 0 0 m (0.8) show NC gr 
 gsave  2177 394 45 492 C 299 731 t 0 r /Helvetica findfont 45.7096 sf 0 0 m (1) show NC gr 
 gsave  2177 394 45 492 C 253 823 t 0 r /Helvetica findfont 45.7096 sf 0 0 m (1.2) show NC gr  0.8 0 0 c
 gsave  2177 394 45 492 C 370 795 t 0 r /Helvetica findfont 43.1702 sf 0 0 m (Scale uncert) show NC gr  black
 gsave  2177 394 45 492 C 370 681 t 0 r /Helvetica findfont 43.1702 sf 0 0 m (PDF uncert) show NC gr  0.8 0 0 c[  12 12 ] 0 sd 6 lw 1 1 1 c black 0.8 0 0 c 328 748 m 34 X 8 Y 33 X -2 Y 34 X 2 Y 101 X -1 Y 33 X 2 Y 34 X -2 Y 33 X -1 Y 67 X 1 Y 34 X
 15 Y 33 X -16 Y 67 X 7 Y 34 X 2 Y 33 X -5 Y 34 X 2 Y 33 X -4 Y 34 X -1 Y 33 X 7 Y 34 X -6 Y 33 X -2 Y 34 X 2 Y 34 X 4 Y 33 X 6 Y 34 X 2 Y 33 X -9 Y 34 X 4 Y 33 X -1 Y 34 X 4 Y 33 X 1 Y 34 X -7 Y 33 X 5 Y 34 X 18 Y 33 X -22 Y 34 X -5 Y 33 X -1 Y 34
 X 19 Y 33 X -17 Y 34 X 57 Y 33 X -42 Y 34 X 15 Y 34 X -8 Y 67 X 41 Y 33 X 24 Y 34 X -58 Y 33 X 10 Y 34 X s 1 1 1 c black 0.8 0 0 c 328 748 m 34 X -8 Y 33 X -1 Y 34 X -2 Y 33 X 1 Y 34 X -2 Y 34 X 2 Y 33 X -2 Y 34 X 3 Y 33 X -2 Y 34 X 2 Y 33 X 1 Y 34
 X -14 Y 33 X 12 Y 34 X 3 Y 33 X -8 Y 34 X -3 Y 33 X 7 Y 34 X -1 Y 33 X 5 Y 67 X -2 Y 34 X 2 Y 33 X 1 Y 34 X -5 Y 34 X -4 Y 33 X -16 Y 34 X 13 Y 33 X 6 Y 34 X 4 Y 33 X -2 Y 34 X -11 Y 33 X 5 Y 34 X 8 Y 33 X -2 Y 34 X -47 Y 33 X 38 Y 34 X 12 Y 33 X
 -4 Y 34 X -5 Y 33 X -1 Y 34 X -100 Y 33 X 88 Y 68 X 11 Y 33 X -14 Y 34 X -19 Y 33 X -87 Y 34 X 54 Y 33 X 32 Y 34 X s black[ 12 16 4 16] 0 sd 1 1 1 c black 328 748 m 34 X -9 Y 100 X -1 Y 34 X 1 Y 168 X -1 Y 33 X 1 Y 34 X -3 Y 33 X 3 Y 34 X -1 Y 33 X
 1 Y 34 X -1 Y 67 X 1 Y 33 X -1 Y 134 X 1 Y 34 X -1 Y 34 X 1 Y 33 X -8 Y 34 X 7 Y 67 X 1 Y 33 X -1 Y 268 X -2 Y 34 X 2 Y 67 X -1 Y 101 X -1 Y 33 X 1 Y 67 X -1 Y 34 X -2 Y 33 X 1 Y 34 X s 1 1 1 c black 328 748 m 34 X 13 Y 67 X -1 Y 67 X 1 Y 101 X -1
 Y 67 X 1 Y 67 X 3 Y 33 X -4 Y 67 X 1 Y 67 X -1 Y 67 X 1 Y 235 X 8 Y 34 X -8 Y 33 X 1 Y 34 X -1 Y 100 X 1 Y 34 X 2 Y 33 X -2 Y 134 X 3 Y 34 X -3 Y 33 X -2 Y 34 X 5 Y 33 X -3 Y 34 X 1 Y 67 X -1 Y 67 X 3 Y 67 X -3 Y 34 X s[ 20 20] 0 sd 3 lw 328 748 m
 1677 X s
 gr  gr 
showpage
end
%%EOF
