%!PS-Adobe-2.0 EPSF-2.0
%%BoundingBox:  0 0 567 639
%%Title: PlotsForYR3/HResPowhegOthersInclusive_pT_125_lin.eps: Canvas
%%Creator: ROOT Version 5.28/00c
%%CreationDate: Wed Mar 13 15:38:08 2013
%%EndComments
%%BeginProlog
80 dict begin
/s {stroke} def /l {lineto} def /m {moveto} def /t {translate} def
/r {rotate} def /rl {roll}  def /R {repeat} def
/d {rlineto} def /rm {rmoveto} def /gr {grestore} def /f {eofill} def
/c {setrgbcolor} def /black {0 setgray} def /sd {setdash} def
/cl {closepath} def /sf {scalefont setfont} def /lw {setlinewidth} def
/box {m dup 0 exch d exch 0 d 0 exch neg d cl} def
/NC{systemdict begin initclip end}def/C{NC box clip newpath}def
/bl {box s} def /bf {box f} def /Y { 0 exch d} def /X { 0 d} def 
/K {{pop pop 0 moveto} exch kshow} bind def
/ita {/ang 15 def gsave [1 0 ang dup sin exch cos div 1 0 0] concat} def 
/mp {newpath /y exch def /x exch def} def
/side {[w .77 mul w .23 mul] .385 w mul sd w 0 l currentpoint t -144 r} def
/mr {mp x y w2 0 360 arc} def /m24 {mr s} def /m20 {mr f} def
/mb {mp x y w2 add m w2 neg 0 d 0 w neg d w 0 d 0 w d cl} def
/mt {mp x y w2 add m w2 neg w neg d w 0 d cl} def
/m21 {mb f} def /m25 {mb s} def /m22 {mt f} def /m26{mt s} def
/m23 {mp x y w2 sub m w2 w d w neg 0 d cl f} def
/m27 {mp x y w2 add m w3 neg w2 neg d w3 w2 neg d w3 w2 d cl s} def
/m28 {mp x w2 sub y w2 sub w3 add m w3 0 d  0 w3 neg d w3 0 d 0 w3 d w3 0 d  0 w3 d w3 neg 0 d 0 w3 d w3 neg 0 d 0 w3 neg d w3 neg 0 d cl s } def
/m29 {mp gsave x w2 sub y w2 add w3 sub m currentpoint t 4 {side} repeat cl fill gr} def
/m30 {mp gsave x w2 sub y w2 add w3 sub m currentpoint t 4 {side} repeat cl s gr} def
/m31 {mp x y w2 sub m 0 w d x w2 sub y m w 0 d x w2 sub y w2 add m w w neg d x w2 sub y w2 sub m w w d s} def
/m32 {mp x y w2 sub m w2 w d w neg 0 d cl s} def
/m33 {mp x y w2 add m w3 neg w2 neg d w3 w2 neg d w3 w2 d cl f} def
/m34 {mp x w2 sub y w2 sub w3 add m w3 0 d  0 w3 neg d w3 0 d 0 w3 d w3 0 d  0 w3 d w3 neg 0 d 0 w3 d w3 neg 0 d 0 w3 neg d w3 neg 0 d cl f } def
/m2 {mp x y w2 sub m 0 w d x w2 sub y m w 0 d s} def
/m5 {mp x w2 sub y w2 sub m w w d x w2 sub y w2 add m w w neg d s} def
/reEncode {exch findfont dup length dict begin {1 index /FID eq  {pop pop} {def} ifelse } forall /Encoding exch def currentdict end dup /FontName get exch definefont pop } def [/Times-Bold /Times-Italic /Times-BoldItalic /Helvetica /Helvetica-Oblique
 /Helvetica-Bold /Helvetica-BoldOblique /Courier /Courier-Oblique /Courier-Bold /Courier-BoldOblique /Times-Roman /AvantGarde-Book /AvantGarde-BookOblique /AvantGarde-Demi /AvantGarde-DemiOblique /Bookman-Demi /Bookman-DemiItalic /Bookman-Light
 /Bookman-LightItalic /Helvetica-Narrow /Helvetica-Narrow-Bold /Helvetica-Narrow-BoldOblique /Helvetica-Narrow-Oblique /NewCenturySchlbk-Roman /NewCenturySchlbk-Bold /NewCenturySchlbk-BoldItalic /NewCenturySchlbk-Italic /Palatino-Bold
 /Palatino-BoldItalic /Palatino-Italic /Palatino-Roman ] {ISOLatin1Encoding reEncode } forall%%EndProlog
%%BeginSetup
%%EndSetup
newpath  gsave  .25 .25 scale  gsave  0 0 t black[  ] 0 sd 3 lw 1 1 1 c 2268 2557 0 0 bf black 1 1 1 c 2268 2557 0 0 bf black 1 1 1 c 1791 1790 363 639 bf black 1791 1790 363 639 bl 6 lw 1 1 1 c black 363 639 m 1791 X s 3 lw 363 639 m 1791 X s
 gsave  2268 2557 0 0 C 1841.57 452.782 t 0 r /Helvetica findfont 106.537 sf 0 0 m ( \(GeV\)) show NC gr 
 gsave  2268 2557 0 0 C 1803.52 395.709 t 0 r /Symbol findfont 72.293 sf 0 0 m (g) show NC gr 
 gsave  2268 2557 0 0 C 1757.86 395.709 t 0 r /Helvetica findfont 72.293 sf 0 0 m (T) show NC gr 
 gsave  2268 2557 0 0 C 1700.79 452.782 t 0 r /Helvetica findfont 106.537 sf 0 0 m (p) show NC gr  363 700 m -61 Y s 408 670 m -31 Y s 452 670 m -31 Y s 497 670 m -31 Y s 542 700 m -61 Y s 587 670 m -31 Y s 632 670 m -31 Y s 676 670 m -31 Y s 721 700
 m -61 Y s 766 670 m -31 Y s 811 670 m -31 Y s 855 670 m -31 Y s 900 700 m -61 Y s 945 670 m -31 Y s 990 670 m -31 Y s 1035 670 m -31 Y s 1079 700 m -61 Y s 1124 670 m -31 Y s 1169 670 m -31 Y s 1214 670 m -31 Y s 1259 700 m -61 Y s 1303 670 m -31 Y
 s 1348 670 m -31 Y s 1393 670 m -31 Y s 1438 700 m -61 Y s 1483 670 m -31 Y s 1527 670 m -31 Y s 1572 670 m -31 Y s 1617 700 m -61 Y s 1662 670 m -31 Y s 1706 670 m -31 Y s 1751 670 m -31 Y s 1796 700 m -61 Y s 1841 670 m -31 Y s 1886 670 m -31 Y s
 1930 670 m -31 Y s 1975 700 m -61 Y s 2020 670 m -31 Y s 2065 670 m -31 Y s 2110 670 m -31 Y s 2154 700 m -61 Y s
 gsave  2268 2557 0 0 C 331.026 525.075 t 0 r /Helvetica findfont 106.537 sf 0 0 m (0) show NC gr 
 gsave  2268 2557 0 0 C 483.221 525.075 t 0 r /Helvetica findfont 106.537 sf 0 0 m (20) show NC gr 
 gsave  2268 2557 0 0 C 662.051 525.075 t 0 r /Helvetica findfont 106.537 sf 0 0 m (40) show NC gr 
 gsave  2268 2557 0 0 C 840.881 525.075 t 0 r /Helvetica findfont 106.537 sf 0 0 m (60) show NC gr 
 gsave  2268 2557 0 0 C 1019.71 525.075 t 0 r /Helvetica findfont 106.537 sf 0 0 m (80) show NC gr 
 gsave  2268 2557 0 0 C 1168.1 525.075 t 0 r /Helvetica findfont 106.537 sf 0 0 m (100) show NC gr 
 gsave  2268 2557 0 0 C 1346.93 525.075 t 0 r /Helvetica findfont 106.537 sf 0 0 m (120) show NC gr 
 gsave  2268 2557 0 0 C 1525.76 525.075 t 0 r /Helvetica findfont 106.537 sf 0 0 m (140) show NC gr 
 gsave  2268 2557 0 0 C 1708.4 525.075 t 0 r /Helvetica findfont 106.537 sf 0 0 m (160) show NC gr 
 gsave  2268 2557 0 0 C 1887.23 525.075 t 0 r /Helvetica findfont 106.537 sf 0 0 m (180) show NC gr 
 gsave  2268 2557 0 0 C 2066.06 525.075 t 0 r /Helvetica findfont 106.537 sf 0 0 m (200) show NC gr  363 2429 m 1791 X s 363 2368 m 61 Y s 408 2399 m 30 Y s 452 2399 m 30 Y s 497 2399 m 30 Y s 542 2368 m 61 Y s 587 2399 m 30 Y s 632 2399 m 30 Y s 676
 2399 m 30 Y s 721 2368 m 61 Y s 766 2399 m 30 Y s 811 2399 m 30 Y s 855 2399 m 30 Y s 900 2368 m 61 Y s 945 2399 m 30 Y s 990 2399 m 30 Y s 1035 2399 m 30 Y s 1079 2368 m 61 Y s 1124 2399 m 30 Y s 1169 2399 m 30 Y s 1214 2399 m 30 Y s 1259 2368 m 61
 Y s 1303 2399 m 30 Y s 1348 2399 m 30 Y s 1393 2399 m 30 Y s 1438 2368 m 61 Y s 1483 2399 m 30 Y s 1527 2399 m 30 Y s 1572 2399 m 30 Y s 1617 2368 m 61 Y s 1662 2399 m 30 Y s 1706 2399 m 30 Y s 1751 2399 m 30 Y s 1796 2368 m 61 Y s 1841 2399 m 30 Y
 s 1886 2399 m 30 Y s 1930 2399 m 30 Y s 1975 2368 m 61 Y s 2020 2399 m 30 Y s 2065 2399 m 30 Y s 2110 2399 m 30 Y s 2154 2368 m 61 Y s 363 639 m 1790 Y s
 gsave  2268 2557 0 0 C 182.635 2001.37 t 90 r /Helvetica findfont 106.537 sf 0 0 m ( \(fb/GeV\)) show NC gr 
 gsave  2268 2557 0 0 C 239.708 1963.32 t 90 r /Symbol findfont 72.293 sf 0 0 m (g) show NC gr 
 gsave  2268 2557 0 0 C 239.708 1917.67 t 90 r /Helvetica findfont 72.293 sf 0 0 m (T) show NC gr 
 gsave  2268 2557 0 0 C 182.635 1773.08 t 90 r /Helvetica findfont 106.537 sf 0 0 m (/dp) show NC gr 
 gsave  2268 2557 0 0 C 182.635 1708.4 t 90 r /Symbol findfont 106.537 sf 0 0 m (s) show NC gr 
 gsave  2268 2557 0 0 C 182.635 1655.13 t 90 r /Helvetica findfont 106.537 sf 0 0 m (d) show NC gr  410 901 m -47 X s 387 966 m -24 X s 387 1032 m -24 X s 387 1097 m -24 X s 410 1163 m -47 X s 387 1229 m -24 X s 387 1294 m -24 X s 387 1360 m -24 X s
 410 1426 m -47 X s 387 1491 m -24 X s 387 1557 m -24 X s 387 1623 m -24 X s 410 1688 m -47 X s 387 1754 m -24 X s 387 1820 m -24 X s 387 1885 m -24 X s 410 1951 m -47 X s 387 2017 m -24 X s 387 2082 m -24 X s 387 2148 m -24 X s 410 2213 m -47 X s
 410 901 m -47 X s 387 835 m -24 X s 387 769 m -24 X s 387 704 m -24 X s 410 2213 m -47 X s 387 2279 m -24 X s 387 2345 m -24 X s 387 2410 m -24 X s
 gsave  2268 2557 0 0 C 205.464 859.906 t 0 r /Helvetica findfont 106.537 sf 0 0 m (0.2) show NC gr 
 gsave  2268 2557 0 0 C 205.464 1122.44 t 0 r /Helvetica findfont 106.537 sf 0 0 m (0.4) show NC gr 
 gsave  2268 2557 0 0 C 205.464 1384.98 t 0 r /Helvetica findfont 106.537 sf 0 0 m (0.6) show NC gr 
 gsave  2268 2557 0 0 C 205.464 1647.52 t 0 r /Helvetica findfont 106.537 sf 0 0 m (0.8) show NC gr 
 gsave  2268 2557 0 0 C 308.196 1910.06 t 0 r /Helvetica findfont 106.537 sf 0 0 m (1) show NC gr 
 gsave  2268 2557 0 0 C 205.464 2172.59 t 0 r /Helvetica findfont 106.537 sf 0 0 m (1.2) show NC gr  2154 639 m 1790 Y s 2107 901 m 47 X s 2131 966 m 23 X s 2131 1032 m 23 X s 2131 1097 m 23 X s 2107 1163 m 47 X s 2131 1229 m 23 X s 2131 1294 m 23 X
 s 2131 1360 m 23 X s 2107 1426 m 47 X s 2131 1491 m 23 X s 2131 1557 m 23 X s 2131 1623 m 23 X s 2107 1688 m 47 X s 2131 1754 m 23 X s 2131 1820 m 23 X s 2131 1885 m 23 X s 2107 1951 m 47 X s 2131 2017 m 23 X s 2131 2082 m 23 X s 2131 2148 m 23 X s
 2107 2213 m 47 X s 2107 901 m 47 X s 2131 835 m 23 X s 2131 769 m 23 X s 2131 704 m 23 X s 2107 2213 m 47 X s 2131 2279 m 23 X s 2131 2345 m 23 X s 2131 2410 m 23 X s 6 lw 1 0 0 c black 3 lw 1 0 0 c 1 lw << /PatternType 1 /PaintType 2 /TilingType 1
 /BBox [ 0 0 100 100 ] /XStep 100 /YStep 100 /PaintProc { begin gsave 0 100 m 100 0 l s gr end } >> [ 0.24 0 0 0.24 0 0 ] makepattern /P05 exch def /cs {[/Pattern /DeviceRGB] setcolorspace} def /FA {f [/DeviceRGB] setcolorspace} def cs 1 0 0 P05
 setcolor 363 646 m 18 X 20 Y 18 X 24 Y 18 X 29 Y 17 X 30 Y 18 X 21 Y 18 X 29 Y 18 X 9 Y 18 X 47 Y 18 X 36 Y 18 X 29 Y 18 X 33 Y 18 X 26 Y 18 X -1 Y 18 X 74 Y 18 X 27 Y 17 X 63 Y 18 X 37 Y 18 X 28 Y 18 X 70 Y 18 X 73 Y 18 X 53 Y 18 X 65 Y 18 X 103 Y
 18 X 9 Y 18 X 84 Y 18 X 90 Y 18 X 9 Y 17 X 81 Y 18 X 92 Y 18 X -33 Y 18 X -278 Y 18 X -57 Y 18 X -173 Y 18 X -156 Y 18 X -121 Y 18 X -91 Y 18 X -68 Y 18 X -49 Y 18 X -51 Y 17 X -20 Y 18 X -77 Y 18 X 18 Y 18 X -15 Y 18 X -18 Y 18 X -11 Y 18 X -14 Y
 18 X -12 Y 18 X -4 Y 18 X -5 Y 18 X -11 Y 17 X -2 Y 18 X -8 Y 18 X 1 Y 18 X -7 Y 18 X -1 Y 18 X -3 Y 18 X -12 Y 18 X 7 Y 18 X -4 Y 18 X -1 Y 18 X -2 Y 35 X -4 Y 18 X 1 Y 18 X -2 Y 18 X -2 Y 54 X -4 Y 18 X 3 Y 18 X -4 Y 18 X -1 Y 36 X 2 Y 17 X -1 Y
 18 X -1 Y 18 X -1 Y 18 X 1 Y 36 X -1 Y 54 X -1 Y 18 X -1 Y 53 X -1 Y 18 X 1 Y 36 X -1 Y 36 X -1 Y 36 X -1 Y 18 X 2 Y 36 X -1 Y 18 X 1 Y 35 X 1 Y -107 X 3 Y -18 X -1 Y -36 X -1 Y -36 X 1 Y -18 X -1 Y -18 X 1 Y -53 X 3 Y -18 X -2 Y -36 X 1 Y -18 X 1 Y
 -18 X 1 Y -18 X -1 Y -18 X 1 Y -18 X 4 Y -18 X -2 Y -17 X 1 Y -36 X 1 Y -36 X 1 Y -18 X 2 Y -18 X 1 Y -18 X 1 Y -18 X 1 Y -18 X 7 Y -18 X -5 Y -18 X 3 Y -17 X 1 Y -18 X 3 Y -18 X 5 Y -18 X -2 Y -18 X 7 Y -18 X 4 Y -18 X -1 Y -18 X 5 Y -18 X 4 Y -18
 X 6 Y -18 X 7 Y -18 X 8 Y -35 X 13 Y -18 X 12 Y -18 X 3 Y -18 X 20 Y -18 X 14 Y -18 X 11 Y -18 X 26 Y -18 X 23 Y -18 X 69 Y -18 X 11 Y -17 X 37 Y -18 X 50 Y -18 X 70 Y -18 X 81 Y -18 X 111 Y -18 X 173 Y -18 X 209 Y -18 X 163 Y -18 X 243 Y -18 X -34
 Y -18 X -6 Y -18 X -91 Y -17 X -24 Y -18 X -124 Y -18 X -76 Y -18 X -79 Y -18 X -99 Y -18 X -65 Y -18 X -39 Y -18 X -68 Y -18 X -66 Y -18 X -50 Y -18 X -45 Y -18 X -26 Y -17 X -56 Y -18 X -44 Y -18 X 2 Y -18 X -71 Y -18 X -28 Y -18 X -35 Y -18 X -20
 Y -18 X -60 Y -18 X -5 Y -18 X -34 Y -18 X -40 Y -18 X -15 Y -17 X -36 Y -18 X -31 Y -18 X -31 Y -18 X FA 6 lw 1 0 0 c 1 1 1 c 1 0 0 c 363 649 m 1 X s 379 649 m 2 X s 3 lw /w 21 def /w2 {w 2 div} def /w3 {w 3 div} def 372 649 m20 6 lw 390 655 m 3 Y
 s 390 673 m 4 Y s 381 666 m 1 X s 397 666 m 2 X s 3 lw 390 666 m20 6 lw 399 713 m 1 X s 415 713 m 2 X s 3 lw 408 713 m20 6 lw 426 734 m s 426 750 m s 417 742 m 1 X s 433 742 m 1 X s 3 lw 426 742 m20 6 lw 443 737 m 4 Y s 443 756 m 4 Y s 434 749 m 2 X
 s 451 749 m 1 X s 3 lw 443 749 m20 6 lw 461 796 m 3 Y s 461 814 m 2 Y s 452 806 m 2 X s 469 806 m 1 X s 3 lw 461 806 m20 6 lw 479 830 m 2 Y s 479 847 m 2 Y s 470 840 m 2 X s 487 840 m 1 X s 3 lw 479 840 m20 6 lw 497 828 m 3 Y s 497 846 m 3 Y s 488
 838 m 2 X s 505 838 m 1 X s 3 lw 497 838 m20 6 lw 515 844 m 3 Y s 515 863 m 3 Y s 506 855 m 2 X s 523 855 m 1 X s 3 lw 515 855 m20 6 lw 533 892 m 5 Y s 533 912 m 5 Y s 524 904 m 1 X s 541 904 m 1 X s 3 lw 533 904 m20 6 lw 551 924 m 4 Y s 551 943 m 5
 Y s 542 936 m 1 X s 559 936 m 1 X s 3 lw 551 936 m20 6 lw 569 945 m 6 Y s 569 966 m 6 Y s 560 958 m 1 X s 576 958 m 2 X s 3 lw 569 958 m20 6 lw 587 990 m 4 Y s 587 1010 m 4 Y s 578 1002 m 1 X s 594 1002 m 2 X s 3 lw 587 1002 m20 6 lw 605 963 m 7 Y s
 605 986 m 7 Y s 596 978 m 1 X s 612 978 m 2 X s 3 lw 605 978 m20 6 lw 623 1084 m 10 Y s 623 1109 m 10 Y s 614 1101 m 1 X s 630 1101 m 2 X s 3 lw 623 1101 m20 6 lw 641 1118 m 7 Y s 641 1140 m 7 Y s 632 1133 m 1 X s 648 1133 m 1 X s 3 lw 641 1133 m20
 6 lw 658 1158 m 11 Y s 658 1184 m 11 Y s 649 1176 m 2 X s 666 1176 m 1 X s 3 lw 658 1176 m20 6 lw 676 1163 m 13 Y s 676 1192 m 14 Y s 667 1184 m 2 X s 684 1184 m 1 X s 3 lw 676 1184 m20 6 lw 694 1242 m 12 Y s 694 1269 m 12 Y s 685 1262 m 2 X s 702
 1262 m 1 X s 3 lw 694 1262 m20 6 lw 712 1274 m 20 Y s 712 1310 m 20 Y s 703 1302 m 2 X s 720 1302 m 1 X s 3 lw 712 1302 m20 6 lw 730 1345 m 15 Y s 730 1376 m 15 Y s 721 1368 m 1 X s 738 1368 m 1 X s 3 lw 730 1368 m20 6 lw 748 1416 m 10 Y s 748 1441
 m 11 Y s 739 1434 m 1 X s 756 1434 m 1 X s 3 lw 748 1434 m20 6 lw 766 1466 m 15 Y s 766 1496 m 15 Y s 757 1489 m 1 X s 774 1489 m 1 X s 3 lw 766 1489 m20 6 lw 784 1557 m 16 Y s 784 1589 m 16 Y s 775 1581 m 1 X s 791 1581 m 2 X s 3 lw 784 1581 m20 6
 lw 802 1634 m 23 Y s 802 1672 m 23 Y s 793 1665 m 1 X s 809 1665 m 2 X s 3 lw 802 1665 m20 6 lw 820 1676 m 15 Y s 820 1706 m 14 Y s 811 1698 m 1 X s 827 1698 m 2 X s 3 lw 820 1698 m20 6 lw 838 1751 m 29 Y s 838 1796 m 28 Y s 829 1788 m 1 X s 845
 1788 m 2 X s 3 lw 838 1788 m20 6 lw 855 1870 m 27 Y s 855 1913 m 27 Y s 847 1905 m 1 X s 863 1905 m 1 X s 3 lw 855 1905 m20 6 lw 873 1902 m 32 Y s 873 1949 m 33 Y s 864 1942 m 2 X s 881 1942 m 1 X s 3 lw 873 1942 m20 6 lw 891 1943 m 31 Y s 891 1989
 m 30 Y s 882 1981 m 2 X s 899 1981 m 1 X s 3 lw 891 1981 m20 6 lw 909 1904 m 35 Y s 909 1954 m 35 Y s 900 1947 m 2 X s 917 1947 m 1 X s 3 lw 909 1947 m20 6 lw 927 1677 m 28 Y s 927 1720 m 28 Y s 918 1713 m 2 X s 935 1713 m 1 X s 3 lw 927 1713 m20 6
 lw 945 1605 m 15 Y s 945 1635 m 15 Y s 936 1628 m 1 X s 953 1628 m 1 X s 3 lw 945 1628 m20 6 lw 963 1389 m 5 Y s 963 1410 m 5 Y s 954 1402 m 1 X s 971 1402 m 1 X s 3 lw 963 1402 m20 6 lw 981 1247 m 2 Y s 981 1264 m 2 Y s 972 1257 m 1 X s 989 1257 m
 1 X s 3 lw 981 1257 m20 6 lw 999 1127 m 1 Y s 999 1143 m 1 Y s 990 1136 m 1 X s 1006 1136 m 2 X s 3 lw 999 1136 m20 6 lw 1017 1011 m 9 Y s 1017 1035 m 9 Y s 1008 1027 m 1 X s 1024 1027 m 2 X s 3 lw 1017 1027 m20 6 lw 1035 980 m 7 Y s 1035 1002 m 7 Y
 s 1026 995 m 1 X s 1042 995 m 2 X s 3 lw 1035 995 m20 6 lw 1044 922 m 1 X s 1060 922 m 2 X s 3 lw 1053 922 m20 6 lw 1062 884 m 1 X s 1078 884 m 1 X s 3 lw 1070 884 m20 6 lw 1079 844 m 2 X s 1096 844 m 1 X s 3 lw 1088 844 m20 6 lw 1097 809 m 2 X s
 1114 809 m 1 X s 3 lw 1106 809 m20 6 lw 1115 801 m 2 X s 1132 801 m 1 X s 3 lw 1124 801 m20 6 lw 1133 772 m 2 X s 1150 772 m 1 X s 3 lw 1142 772 m20 6 lw 1151 760 m 1 X s 1168 760 m 1 X s 3 lw 1160 760 m20 6 lw 1169 748 m 1 X s 1186 748 m 1 X s 3 lw
 1178 748 m20 6 lw 1187 735 m 1 X s 1203 735 m 2 X s 3 lw 1196 735 m20 6 lw 1205 716 m 1 X s 1221 716 m 2 X s 3 lw 1214 716 m20 6 lw 1223 709 m 1 X s 1239 709 m 2 X s 3 lw 1232 709 m20 6 lw 1241 710 m 1 X s 1257 710 m 2 X s 3 lw 1250 710 m20 6 lw
 1259 696 m 1 X s 1275 696 m 1 X s 3 lw 1268 696 m20 6 lw 1276 695 m 2 X s 1293 695 m 1 X s 3 lw 1285 695 m20 6 lw 1294 688 m 2 X s 1311 688 m 1 X s 3 lw 1303 688 m20 6 lw 1312 682 m 2 X s 1329 682 m 1 X s 3 lw 1321 682 m20 6 lw 1330 682 m 2 X s 1347
 682 m 1 X s 3 lw 1339 682 m20 6 lw 1348 676 m 2 X s 1365 676 m 1 X s 3 lw 1357 676 m20 6 lw 1366 673 m 1 X s 1383 673 m 1 X s 3 lw 1375 673 m20 6 lw 1384 671 m 1 X s 1401 671 m 1 X s 3 lw 1393 671 m20 6 lw 1402 668 m 1 X s 1418 668 m 2 X s 3 lw 1411
 668 m20 6 lw 1420 666 m 1 X s 1436 666 m 2 X s 3 lw 1429 666 m20 6 lw 1438 663 m 1 X s 1454 663 m 2 X s 3 lw 1447 663 m20 6 lw 1456 661 m 1 X s 1472 661 m 2 X s 3 lw 1465 661 m20 6 lw 1474 663 m 1 X s 1490 663 m 1 X s 3 lw 1483 663 m20 6 lw 1491 654
 m 2 X s 1508 654 m 1 X s 3 lw 1500 654 m20 6 lw 1509 657 m 2 X s 1526 657 m 1 X s 3 lw 1518 657 m20 6 lw 1527 656 m 2 X s 1544 656 m 1 X s 3 lw 1536 656 m20 6 lw 1545 656 m 2 X s 1562 656 m 1 X s 3 lw 1554 656 m20 6 lw 1563 653 m 1 X s 1580 653 m 1
 X s 3 lw 1572 653 m20 6 lw 1581 651 m 1 X s 1598 651 m 1 X s 3 lw 1590 651 m20 6 lw 1599 651 m 1 X s 1616 651 m 1 X s 3 lw 1608 651 m20 6 lw 1617 651 m 1 X s 1633 651 m 2 X s 3 lw 1626 651 m20 6 lw 1635 650 m 1 X s 1651 650 m 2 X s 3 lw 1644 650 m20
 6 lw 1653 649 m 1 X s 1669 649 m 2 X s 3 lw 1662 649 m20 6 lw 1671 649 m 1 X s 1687 649 m 2 X s 3 lw 1680 649 m20 6 lw 1689 647 m 1 X s 1705 647 m 1 X s 3 lw 1697 647 m20 6 lw 1706 649 m 2 X s 1723 649 m 1 X s 3 lw 1715 649 m20 6 lw 1724 645 m 2 X s
 1741 645 m 1 X s 3 lw 1733 645 m20 6 lw 1742 647 m 2 X s 1759 647 m 1 X s 3 lw 1751 647 m20 6 lw 1760 646 m 2 X s 1777 646 m 1 X s 3 lw 1769 646 m20 6 lw 1778 645 m 1 X s 1795 645 m 1 X s 3 lw 1787 645 m20 6 lw 1796 646 m 1 X s 1813 646 m 1 X s 3 lw
 1805 646 m20 6 lw 1814 644 m 1 X s 1831 644 m 1 X s 3 lw 1823 644 m20 6 lw 1832 645 m 1 X s 1848 645 m 2 X s 3 lw 1841 645 m20 6 lw 1850 644 m 1 X s 1866 644 m 2 X s 3 lw 1859 644 m20 6 lw 1868 644 m 1 X s 1884 644 m 2 X s 3 lw 1877 644 m20 6 lw
 1886 643 m 1 X s 1902 643 m 2 X s 3 lw 1895 643 m20 6 lw 1904 644 m 1 X s 1920 644 m 1 X s 3 lw 1912 644 m20 6 lw 1921 641 m 2 X s 1938 641 m 1 X s 3 lw 1930 641 m20 6 lw 1939 644 m 2 X s 1956 644 m 1 X s 3 lw 1948 644 m20 6 lw 1957 643 m 2 X s 1974
 643 m 1 X s 3 lw 1966 643 m20 6 lw 1975 642 m 2 X s 1992 642 m 1 X s 3 lw 1984 642 m20 6 lw 1993 643 m 1 X s 2010 643 m 1 X s 3 lw 2002 643 m20 6 lw 2011 641 m 1 X s 2028 641 m 1 X s 3 lw 2020 641 m20 6 lw 2029 642 m 1 X s 2045 642 m 2 X s 3 lw 2038
 642 m20 6 lw 2047 642 m 1 X s 2063 642 m 2 X s 3 lw 2056 642 m20 6 lw 2065 641 m 1 X s 2081 641 m 2 X s 3 lw 2074 641 m20 6 lw 2083 641 m 1 X s 2099 641 m 2 X s 3 lw 2092 641 m20 6 lw 2101 642 m 1 X s 2117 642 m 2 X s 3 lw 2110 642 m20 6 lw 2119 641
 m 1 X s 2135 641 m 1 X s 3 lw 2127 641 m20 6 lw 2136 641 m 2 X s 2153 641 m 1 X s 3 lw 2145 641 m20 6 lw black 3 lw 1 lw << /PatternType 1 /PaintType 2 /TilingType 1 /BBox [ 0 0 100 100 ] /XStep 100 /YStep 100 /PaintProc { begin gsave 0 0 m 100 100
 l s gr end } >> [ 0.24 0 0 0.24 0 0 ] makepattern /P04 exch def cs 0 0 0 P04 setcolor 363 647 m 18 X 28 Y 18 X 18 Y 18 X 31 Y 17 X 26 Y 18 X 29 Y 18 X 26 Y 18 X 21 Y 18 X 35 Y 18 X 33 Y 18 X 31 Y 18 X 37 Y 18 X 23 Y 18 X 42 Y 18 X 32 Y 18 X 28 Y 17
 X 62 Y 18 X 54 Y 18 X 38 Y 18 X 55 Y 18 X 64 Y 18 X 46 Y 18 X 82 Y 18 X 52 Y 18 X 81 Y 18 X 72 Y 18 X 67 Y 18 X 68 Y 17 X 42 Y 18 X 49 Y 18 X -55 Y 18 X -153 Y 18 X -152 Y 18 X -160 Y 18 X -151 Y 18 X -124 Y 18 X -75 Y 18 X -72 Y 18 X -56 Y 18 X -30
 Y 17 X -50 Y 18 X -15 Y 18 X -23 Y 18 X -28 Y 18 X -21 Y 18 X -4 Y 18 X -18 Y 18 X -14 Y 36 X -11 Y 18 X -6 Y 17 X -7 Y 18 X -9 Y 36 X -8 Y 18 X -2 Y 18 X -2 Y 18 X -4 Y 18 X -1 Y 18 X -3 Y 18 X -1 Y 18 X -3 Y 18 X -3 Y 17 X -1 Y 36 X -4 Y 36 X -1 Y
 18 X -1 Y 18 X 1 Y 18 X -3 Y 18 X -1 Y 18 X -1 Y 36 X -2 Y 17 X 1 Y 18 X -2 Y 18 X 1 Y 18 X -1 Y 18 X 1 Y 18 X -1 Y 36 X -2 Y 54 X -1 Y 18 X 1 Y 17 X -1 Y 36 X 1 Y 18 X -1 Y 18 X -1 Y 54 X 1 Y 18 X -1 Y 36 X -1 Y 18 X 1 Y 17 X -1 Y 18 X 4 Y -18 X -1
 Y -17 X 1 Y -72 X -1 Y -18 X 1 Y -18 X 2 Y -36 X -1 Y -36 X 2 Y -35 X -2 Y -18 X 1 Y -18 X 1 Y -54 X 4 Y -18 X -1 Y -18 X 1 Y -18 X -2 Y -18 X 2 Y -18 X -1 Y -18 X 2 Y -35 X 2 Y -18 X 1 Y -18 X 2 Y -36 X -1 Y -18 X 4 Y -18 X 1 Y -18 X 1 Y -18 X 1 Y
 -18 X 1 Y -18 X 1 Y -17 X 4 Y -18 X 2 Y -18 X 1 Y -18 X 2 Y -18 X 7 Y -18 X 2 Y -18 X -2 Y -18 X 9 Y -18 X 6 Y -36 X 8 Y -18 X 12 Y -17 X -1 Y -18 X 16 Y -18 X 2 Y -18 X 19 Y -18 X 11 Y -18 X 13 Y -18 X 23 Y -18 X 13 Y -18 X 33 Y -18 X 28 Y -18 X 39
 Y -17 X 48 Y -18 X 49 Y -18 X 70 Y -18 X 93 Y -18 X 120 Y -18 X 141 Y -18 X 166 Y -18 X 169 Y -18 X 129 Y -18 X 63 Y -18 X -24 Y -18 X -45 Y -17 X -78 Y -18 X -69 Y -18 X -93 Y -18 X -59 Y -18 X -73 Y -18 X -66 Y -18 X -61 Y -18 X -64 Y -18 X -46 Y
 -18 X -48 Y -18 X -65 Y -18 X -40 Y -17 X -45 Y -18 X -37 Y -18 X -29 Y -18 X -21 Y -18 X -55 Y -18 X -29 Y -18 X -26 Y -18 X -42 Y -18 X -25 Y -18 X -30 Y -18 X -36 Y -18 X -20 Y -17 X -24 Y -18 X -28 Y -18 X -27 Y -18 X FA 6 lw black 1 1 1 c black
 363 654 m 1 X s 379 654 m 2 X s 3 lw 372 654 m20 6 lw 381 675 m 1 X s 397 675 m 2 X s 3 lw 390 675 m20 6 lw 399 702 m 1 X s 415 702 m 2 X s 3 lw 408 702 m20 6 lw 417 724 m 1 X s 433 724 m 1 X s 3 lw 426 724 m20 6 lw 434 752 m 2 X s 451 752 m 1 X s 3
 lw 443 752 m20 6 lw 452 787 m 2 X s 469 787 m 1 X s 3 lw 461 787 m20 6 lw 470 816 m 2 X s 487 816 m 1 X s 3 lw 479 816 m20 6 lw 488 835 m 2 X s 505 835 m 1 X s 3 lw 497 835 m20 6 lw 506 868 m 2 X s 523 868 m 1 X s 3 lw 515 868 m20 6 lw 533 903 m 1 Y
 s 533 919 m 1 Y s 524 912 m 1 X s 541 912 m 1 X s 3 lw 533 912 m20 6 lw 551 927 m 1 Y s 551 944 m 1 Y s 542 936 m 1 X s 559 936 m 1 X s 3 lw 551 936 m20 6 lw 569 964 m 1 Y s 569 981 m 1 Y s 560 973 m 1 X s 576 973 m 2 X s 3 lw 569 973 m20 6 lw 587
 981 m 2 Y s 587 998 m 2 Y s 578 990 m 1 X s 594 990 m 2 X s 3 lw 587 990 m20 6 lw 605 1028 m 2 Y s 605 1045 m 3 Y s 596 1038 m 1 X s 612 1038 m 2 X s 3 lw 605 1038 m20 6 lw 623 1060 m 3 Y s 623 1078 m 3 Y s 614 1070 m 1 X s 630 1070 m 2 X s 3 lw 623
 1070 m20 6 lw 641 1099 m 3 Y s 641 1117 m 3 Y s 632 1109 m 1 X s 648 1109 m 1 X s 3 lw 641 1109 m20 6 lw 658 1147 m 3 Y s 658 1166 m 4 Y s 649 1158 m 2 X s 666 1158 m 1 X s 3 lw 658 1158 m20 6 lw 676 1195 m 4 Y s 676 1215 m 4 Y s 667 1207 m 2 X s
 684 1207 m 1 X s 3 lw 676 1207 m20 6 lw 694 1243 m 5 Y s 694 1263 m 5 Y s 685 1255 m 2 X s 702 1255 m 1 X s 3 lw 694 1255 m20 6 lw 712 1286 m 5 Y s 712 1306 m 6 Y s 703 1299 m 2 X s 720 1299 m 1 X s 3 lw 712 1299 m20 6 lw 730 1353 m 6 Y s 730 1374 m
 6 Y s 721 1366 m 1 X s 738 1366 m 1 X s 3 lw 730 1366 m20 6 lw 748 1414 m 6 Y s 748 1435 m 7 Y s 739 1428 m 1 X s 756 1428 m 1 X s 3 lw 748 1428 m20 6 lw 766 1473 m 7 Y s 766 1495 m 7 Y s 757 1488 m 1 X s 774 1488 m 1 X s 3 lw 766 1488 m20 6 lw 784
 1552 m 8 Y s 784 1575 m 8 Y s 775 1568 m 1 X s 791 1568 m 2 X s 3 lw 784 1568 m20 6 lw 802 1620 m 8 Y s 802 1643 m 8 Y s 793 1635 m 1 X s 809 1635 m 2 X s 3 lw 802 1635 m20 6 lw 820 1726 m 9 Y s 820 1751 m 9 Y s 811 1743 m 1 X s 827 1743 m 2 X s 3
 lw 820 1743 m20 6 lw 838 1768 m 9 Y s 838 1793 m 9 Y s 829 1785 m 1 X s 845 1785 m 2 X s 3 lw 838 1785 m20 6 lw 855 1872 m 11 Y s 855 1898 m 10 Y s 847 1890 m 1 X s 863 1890 m 1 X s 3 lw 855 1890 m20 6 lw 873 1883 m 10 Y s 873 1909 m 10 Y s 864 1901
 m 2 X s 881 1901 m 1 X s 3 lw 873 1901 m20 6 lw 891 1904 m 10 Y s 891 1929 m 11 Y s 882 1922 m 2 X s 899 1922 m 1 X s 3 lw 891 1922 m20 6 lw 909 1859 m 10 Y s 909 1884 m 10 Y s 900 1876 m 2 X s 917 1876 m 1 X s 3 lw 909 1876 m20 6 lw 927 1750 m 10 Y
 s 927 1775 m 9 Y s 918 1767 m 2 X s 935 1767 m 1 X s 3 lw 927 1767 m20 6 lw 945 1568 m 8 Y s 945 1591 m 8 Y s 936 1584 m 1 X s 953 1584 m 1 X s 3 lw 945 1584 m20 6 lw 963 1385 m 7 Y s 963 1407 m 6 Y s 954 1399 m 1 X s 971 1399 m 1 X s 3 lw 963 1399
 m20 6 lw 981 1244 m 5 Y s 981 1264 m 5 Y s 972 1256 m 1 X s 989 1256 m 1 X s 3 lw 981 1256 m20 6 lw 999 1150 m 4 Y s 999 1169 m 4 Y s 990 1161 m 1 X s 1006 1161 m 2 X s 3 lw 999 1161 m20 6 lw 1017 1049 m 3 Y s 1017 1067 m 3 Y s 1008 1059 m 1 X s
 1024 1059 m 2 X s 3 lw 1017 1059 m20 6 lw 1035 983 m 2 Y s 1035 1000 m 2 Y s 1026 993 m 1 X s 1042 993 m 2 X s 3 lw 1035 993 m20 6 lw 1053 950 m 2 Y s 1053 967 m 1 Y s 1044 959 m 1 X s 1060 959 m 2 X s 3 lw 1053 959 m20 6 lw 1070 896 m s 1070 911 m
 1 Y s 1062 904 m 1 X s 1078 904 m 1 X s 3 lw 1070 904 m20 6 lw 1088 864 m s 1088 880 m s 1079 872 m 2 X s 1096 872 m 1 X s 3 lw 1088 872 m20 6 lw 1097 831 m 2 X s 1114 831 m 1 X s 3 lw 1106 831 m20 6 lw 1115 806 m 2 X s 1132 806 m 1 X s 3 lw 1124
 806 m20 6 lw 1133 775 m 2 X s 1150 775 m 1 X s 3 lw 1142 775 m20 6 lw 1151 768 m 1 X s 1168 768 m 1 X s 3 lw 1160 768 m20 6 lw 1169 753 m 1 X s 1186 753 m 1 X s 3 lw 1178 753 m20 6 lw 1187 739 m 1 X s 1203 739 m 2 X s 3 lw 1196 739 m20 6 lw 1205 730
 m 1 X s 1221 730 m 2 X s 3 lw 1214 730 m20 6 lw 1223 728 m 1 X s 1239 728 m 2 X s 3 lw 1232 728 m20 6 lw 1241 710 m 1 X s 1257 710 m 2 X s 3 lw 1250 710 m20 6 lw 1259 706 m 1 X s 1275 706 m 1 X s 3 lw 1268 706 m20 6 lw 1276 696 m 2 X s 1293 696 m 1
 X s 3 lw 1285 696 m20 6 lw 1294 685 m 2 X s 1311 685 m 1 X s 3 lw 1303 685 m20 6 lw 1312 693 m 2 X s 1329 693 m 1 X s 3 lw 1321 693 m20 6 lw 1330 677 m 2 X s 1347 677 m 1 X s 3 lw 1339 677 m20 6 lw 1348 679 m 2 X s 1365 679 m 1 X s 3 lw 1357 679 m20
 6 lw 1366 673 m 1 X s 1383 673 m 1 X s 3 lw 1375 673 m20 6 lw 1384 671 m 1 X s 1401 671 m 1 X s 3 lw 1393 671 m20 6 lw 1402 671 m 1 X s 1418 671 m 2 X s 3 lw 1411 671 m20 6 lw 1420 669 m 1 X s 1436 669 m 2 X s 3 lw 1429 669 m20 6 lw 1438 666 m 1 X s
 1454 666 m 2 X s 3 lw 1447 666 m20 6 lw 1456 665 m 1 X s 1472 665 m 2 X s 3 lw 1465 665 m20 6 lw 1474 659 m 1 X s 1490 659 m 1 X s 3 lw 1483 659 m20 6 lw 1491 661 m 2 X s 1508 661 m 1 X s 3 lw 1500 661 m20 6 lw 1509 660 m 2 X s 1526 660 m 1 X s 3 lw
 1518 660 m20 6 lw 1527 654 m 2 X s 1544 654 m 1 X s 3 lw 1536 654 m20 6 lw 1545 654 m 2 X s 1562 654 m 1 X s 3 lw 1554 654 m20 6 lw 1563 655 m 1 X s 1580 655 m 1 X s 3 lw 1572 655 m20 6 lw 1581 654 m 1 X s 1598 654 m 1 X s 3 lw 1590 654 m20 6 lw
 1599 653 m 1 X s 1616 653 m 1 X s 3 lw 1608 653 m20 6 lw 1617 651 m 1 X s 1633 651 m 2 X s 3 lw 1626 651 m20 6 lw 1635 652 m 1 X s 1651 652 m 2 X s 3 lw 1644 652 m20 6 lw 1653 649 m 1 X s 1669 649 m 2 X s 3 lw 1662 649 m20 6 lw 1671 648 m 1 X s 1687
 648 m 2 X s 3 lw 1680 648 m20 6 lw 1689 651 m 1 X s 1705 651 m 1 X s 3 lw 1697 651 m20 6 lw 1706 647 m 2 X s 1723 647 m 1 X s 3 lw 1715 647 m20 6 lw 1724 647 m 2 X s 1741 647 m 1 X s 3 lw 1733 647 m20 6 lw 1742 648 m 2 X s 1759 648 m 1 X s 3 lw 1751
 648 m20 6 lw 1760 650 m 2 X s 1777 650 m 1 X s 3 lw 1769 650 m20 6 lw 1778 647 m 1 X s 1795 647 m 1 X s 3 lw 1787 647 m20 6 lw 1796 645 m 1 X s 1813 645 m 1 X s 3 lw 1805 645 m20 6 lw 1814 645 m 1 X s 1831 645 m 1 X s 3 lw 1823 645 m20 6 lw 1832 646
 m 1 X s 1848 646 m 2 X s 3 lw 1841 646 m20 6 lw 1850 645 m 1 X s 1866 645 m 2 X s 3 lw 1859 645 m20 6 lw 1868 643 m 1 X s 1884 643 m 2 X s 3 lw 1877 643 m20 6 lw 1886 644 m 1 X s 1902 644 m 2 X s 3 lw 1895 644 m20 6 lw 1904 642 m 1 X s 1920 642 m 1
 X s 3 lw 1912 642 m20 6 lw 1921 646 m 2 X s 1938 646 m 1 X s 3 lw 1930 646 m20 6 lw 1939 642 m 2 X s 1956 642 m 1 X s 3 lw 1948 642 m20 6 lw 1957 642 m 2 X s 1974 642 m 1 X s 3 lw 1966 642 m20 6 lw 1975 642 m 2 X s 1992 642 m 1 X s 3 lw 1984 642 m20
 6 lw 1993 644 m 1 X s 2010 644 m 1 X s 3 lw 2002 644 m20 6 lw 2011 641 m 1 X s 2028 641 m 1 X s 3 lw 2020 641 m20 6 lw 2029 641 m 1 X s 2045 641 m 2 X s 3 lw 2038 641 m20 6 lw 2047 641 m 1 X s 2063 641 m 2 X s 3 lw 2056 641 m20 6 lw 2065 643 m 1 X s
 2081 643 m 2 X s 3 lw 2074 643 m20 6 lw 2083 640 m 1 X s 2099 640 m 2 X s 3 lw 2092 640 m20 6 lw 2101 642 m 1 X s 2117 642 m 2 X s 3 lw 2110 642 m20 6 lw 2119 641 m 1 X s 2135 641 m 1 X s 3 lw 2127 641 m20 6 lw 1 0.8 0 c 1 1 1 c 1 0.8 0 c 363 653 m
 1 X s 379 653 m 2 X s 3 lw 372 653 m20 6 lw 381 676 m 1 X s 397 676 m 2 X s 3 lw 390 676 m20 6 lw 399 702 m 1 X s 415 702 m 2 X s 3 lw 408 702 m20 6 lw 417 728 m 1 X s 433 728 m 1 X s 3 lw 426 728 m20 6 lw 434 756 m 2 X s 451 756 m 1 X s 3 lw 443
 756 m20 6 lw 452 783 m 2 X s 469 783 m 1 X s 3 lw 461 783 m20 6 lw 470 812 m 2 X s 487 812 m 1 X s 3 lw 479 812 m20 6 lw 488 842 m 2 X s 505 842 m 1 X s 3 lw 497 842 m20 6 lw 506 871 m 2 X s 523 871 m 1 X s 3 lw 515 871 m20 6 lw 524 903 m 1 X s 541
 903 m 1 X s 3 lw 533 903 m20 6 lw 542 931 m 1 X s 559 931 m 1 X s 3 lw 551 931 m20 6 lw 560 968 m 1 X s 576 968 m 2 X s 3 lw 569 968 m20 6 lw 578 995 m 1 X s 594 995 m 2 X s 3 lw 587 995 m20 6 lw 596 1042 m 1 X s 612 1042 m 2 X s 3 lw 605 1042 m20 6
 lw 614 1078 m 1 X s 630 1078 m 2 X s 3 lw 623 1078 m20 6 lw 632 1126 m 1 X s 648 1126 m 1 X s 3 lw 641 1126 m20 6 lw 649 1169 m 2 X s 666 1169 m 1 X s 3 lw 658 1169 m20 6 lw 667 1211 m 2 X s 684 1211 m 1 X s 3 lw 676 1211 m20 6 lw 685 1264 m 2 X s
 702 1264 m 1 X s 3 lw 694 1264 m20 6 lw 703 1320 m 2 X s 720 1320 m 1 X s 3 lw 712 1320 m20 6 lw 721 1381 m 1 X s 738 1381 m 1 X s 3 lw 730 1381 m20 6 lw 739 1431 m 1 X s 756 1431 m 1 X s 3 lw 748 1431 m20 6 lw 757 1503 m 1 X s 774 1503 m 1 X s 3 lw
 766 1503 m20 6 lw 775 1566 m 1 X s 791 1566 m 2 X s 3 lw 784 1566 m20 6 lw 793 1632 m 1 X s 809 1632 m 2 X s 3 lw 802 1632 m20 6 lw 811 1708 m 1 X s 827 1708 m 2 X s 3 lw 820 1708 m20 6 lw 829 1770 m 1 X s 845 1770 m 2 X s 3 lw 838 1770 m20 6 lw 847
 1825 m 1 X s 863 1825 m 1 X s 3 lw 855 1825 m20 6 lw 864 1887 m 2 X s 881 1887 m 1 X s 3 lw 873 1887 m20 6 lw 882 1899 m 2 X s 899 1899 m 1 X s 3 lw 891 1899 m20 6 lw 900 1842 m 2 X s 917 1842 m 1 X s 3 lw 909 1842 m20 6 lw 918 1714 m 2 X s 935 1714
 m 1 X s 3 lw 927 1714 m20 6 lw 936 1550 m 1 X s 953 1550 m 1 X s 3 lw 945 1550 m20 6 lw 954 1408 m 1 X s 971 1408 m 1 X s 3 lw 963 1408 m20 6 lw 972 1274 m 1 X s 989 1274 m 1 X s 3 lw 981 1274 m20 6 lw 990 1163 m 1 X s 1006 1163 m 2 X s 3 lw 999
 1163 m20 6 lw 1008 1091 m 1 X s 1024 1091 m 2 X s 3 lw 1017 1091 m20 6 lw 1026 1010 m 1 X s 1042 1010 m 2 X s 3 lw 1035 1010 m20 6 lw 1044 956 m 1 X s 1060 956 m 2 X s 3 lw 1053 956 m20 6 lw 1062 922 m 1 X s 1078 922 m 1 X s 3 lw 1070 922 m20 6 lw
 1079 861 m 2 X s 1096 861 m 1 X s 3 lw 1088 861 m20 6 lw 1097 850 m 2 X s 1114 850 m 1 X s 3 lw 1106 850 m20 6 lw 1115 811 m 2 X s 1132 811 m 1 X s 3 lw 1124 811 m20 6 lw 1133 795 m 2 X s 1150 795 m 1 X s 3 lw 1142 795 m20 6 lw 1151 774 m 1 X s 1168
 774 m 1 X s 3 lw 1160 774 m20 6 lw 1169 762 m 1 X s 1186 762 m 1 X s 3 lw 1178 762 m20 6 lw 1187 745 m 1 X s 1203 745 m 2 X s 3 lw 1196 745 m20 6 lw 1205 728 m 1 X s 1221 728 m 2 X s 3 lw 1214 728 m20 6 lw 1223 728 m 1 X s 1239 728 m 2 X s 3 lw 1232
 728 m20 6 lw 1241 717 m 1 X s 1257 717 m 2 X s 3 lw 1250 717 m20 6 lw 1259 708 m 1 X s 1275 708 m 1 X s 3 lw 1268 708 m20 6 lw 1276 700 m 2 X s 1293 700 m 1 X s 3 lw 1285 700 m20 6 lw 1294 697 m 2 X s 1311 697 m 1 X s 3 lw 1303 697 m20 6 lw 1312 688
 m 2 X s 1329 688 m 1 X s 3 lw 1321 688 m20 6 lw 1330 687 m 2 X s 1347 687 m 1 X s 3 lw 1339 687 m20 6 lw 1348 684 m 2 X s 1365 684 m 1 X s 3 lw 1357 684 m20 6 lw 1366 679 m 1 X s 1383 679 m 1 X s 3 lw 1375 679 m20 6 lw 1384 674 m 1 X s 1401 674 m 1
 X s 3 lw 1393 674 m20 6 lw 1402 672 m 1 X s 1418 672 m 2 X s 3 lw 1411 672 m20 6 lw 1420 669 m 1 X s 1436 669 m 2 X s 3 lw 1429 669 m20 6 lw 1438 668 m 1 X s 1454 668 m 2 X s 3 lw 1447 668 m20 6 lw 1456 664 m 1 X s 1472 664 m 2 X s 3 lw 1465 664 m20
 6 lw 1474 668 m 1 X s 1490 668 m 1 X s 3 lw 1483 668 m20 6 lw 1491 663 m 2 X s 1508 663 m 1 X s 3 lw 1500 663 m20 6 lw 1509 662 m 2 X s 1526 662 m 1 X s 3 lw 1518 662 m20 6 lw 1527 657 m 2 X s 1544 657 m 1 X s 3 lw 1536 657 m20 6 lw 1545 657 m 2 X s
 1562 657 m 1 X s 3 lw 1554 657 m20 6 lw 1563 655 m 1 X s 1580 655 m 1 X s 3 lw 1572 655 m20 6 lw 1581 656 m 1 X s 1598 656 m 1 X s 3 lw 1590 656 m20 6 lw 1599 653 m 1 X s 1616 653 m 1 X s 3 lw 1608 653 m20 6 lw 1617 653 m 1 X s 1633 653 m 2 X s 3 lw
 1626 653 m20 6 lw 1635 650 m 1 X s 1651 650 m 2 X s 3 lw 1644 650 m20 6 lw 1653 653 m 1 X s 1669 653 m 2 X s 3 lw 1662 653 m20 6 lw 1671 653 m 1 X s 1687 653 m 2 X s 3 lw 1680 653 m20 6 lw 1689 650 m 1 X s 1705 650 m 1 X s 3 lw 1697 650 m20 6 lw
 1706 649 m 2 X s 1723 649 m 1 X s 3 lw 1715 649 m20 6 lw 1724 648 m 2 X s 1741 648 m 1 X s 3 lw 1733 648 m20 6 lw 1742 647 m 2 X s 1759 647 m 1 X s 3 lw 1751 647 m20 6 lw 1760 648 m 2 X s 1777 648 m 1 X s 3 lw 1769 648 m20 6 lw 1778 648 m 1 X s 1795
 648 m 1 X s 3 lw 1787 648 m20 6 lw 1796 645 m 1 X s 1813 645 m 1 X s 3 lw 1805 645 m20 6 lw 1814 648 m 1 X s 1831 648 m 1 X s 3 lw 1823 648 m20 6 lw 1832 644 m 1 X s 1848 644 m 2 X s 3 lw 1841 644 m20 6 lw 1850 643 m 1 X s 1866 643 m 2 X s 3 lw 1859
 643 m20 6 lw 1868 643 m 1 X s 1884 643 m 2 X s 3 lw 1877 643 m20 6 lw 1886 644 m 1 X s 1902 644 m 2 X s 3 lw 1895 644 m20 6 lw 1904 646 m 1 X s 1920 646 m 1 X s 3 lw 1912 646 m20 6 lw 1921 645 m 2 X s 1938 645 m 1 X s 3 lw 1930 645 m20 6 lw 1939 643
 m 2 X s 1956 643 m 1 X s 3 lw 1948 643 m20 6 lw 1957 644 m 2 X s 1974 644 m 1 X s 3 lw 1966 644 m20 6 lw 1975 643 m 2 X s 1992 643 m 1 X s 3 lw 1984 643 m20 6 lw 1993 643 m 1 X s 2010 643 m 1 X s 3 lw 2002 643 m20 6 lw 2011 643 m 1 X s 2028 643 m 1
 X s 3 lw 2020 643 m20 6 lw 2029 641 m 1 X s 2045 641 m 2 X s 3 lw 2038 641 m20 6 lw 2047 641 m 1 X s 2063 641 m 2 X s 3 lw 2056 641 m20 6 lw 2065 642 m 1 X s 2081 642 m 2 X s 3 lw 2074 642 m20 6 lw 2083 642 m 1 X s 2099 642 m 2 X s 3 lw 2092 642 m20
 6 lw 2101 643 m 1 X s 2117 643 m 2 X s 3 lw 2110 643 m20 6 lw 2119 641 m 1 X s 2135 641 m 1 X s 3 lw 2127 641 m20 6 lw 2136 641 m 2 X s 2153 641 m 1 X s 3 lw 2145 641 m20 6 lw 0.35 0.83 0.33 c 1 1 1 c 0.35 0.83 0.33 c 363 651 m 1 X s 379 651 m 2 X s
 3 lw 372 651 m20 6 lw 381 677 m 1 X s 397 677 m 2 X s 3 lw 390 677 m20 6 lw 399 703 m 1 X s 415 703 m 2 X s 3 lw 408 703 m20 6 lw 417 728 m 1 X s 433 728 m 1 X s 3 lw 426 728 m20 6 lw 434 756 m 2 X s 451 756 m 1 X s 3 lw 443 756 m20 6 lw 452 782 m 2
 X s 469 782 m 1 X s 3 lw 461 782 m20 6 lw 470 811 m 2 X s 487 811 m 1 X s 3 lw 479 811 m20 6 lw 488 839 m 2 X s 505 839 m 1 X s 3 lw 497 839 m20 6 lw 506 871 m 2 X s 523 871 m 1 X s 3 lw 515 871 m20 6 lw 524 904 m 1 X s 541 904 m 1 X s 3 lw 533 904
 m20 6 lw 542 927 m 1 X s 559 927 m 1 X s 3 lw 551 927 m20 6 lw 560 963 m 1 X s 576 963 m 2 X s 3 lw 569 963 m20 6 lw 578 1001 m 1 X s 594 1001 m 2 X s 3 lw 587 1001 m20 6 lw 596 1038 m 1 X s 612 1038 m 2 X s 3 lw 605 1038 m20 6 lw 614 1078 m 1 X s
 630 1078 m 2 X s 3 lw 623 1078 m20 6 lw 632 1118 m 1 X s 648 1118 m 1 X s 3 lw 641 1118 m20 6 lw 649 1163 m 2 X s 666 1163 m 1 X s 3 lw 658 1163 m20 6 lw 667 1206 m 2 X s 684 1206 m 1 X s 3 lw 676 1206 m20 6 lw 685 1259 m 2 X s 702 1259 m 1 X s 3 lw
 694 1259 m20 6 lw 703 1313 m 2 X s 720 1313 m 1 X s 3 lw 712 1313 m20 6 lw 721 1367 m 1 X s 738 1367 m 1 X s 3 lw 730 1367 m20 6 lw 739 1426 m 1 X s 756 1426 m 1 X s 3 lw 748 1426 m20 6 lw 757 1497 m 1 X s 774 1497 m 1 X s 3 lw 766 1497 m20 6 lw 775
 1569 m 1 X s 791 1569 m 2 X s 3 lw 784 1569 m20 6 lw 793 1636 m 1 X s 809 1636 m 2 X s 3 lw 802 1636 m20 6 lw 811 1731 m 1 X s 827 1731 m 2 X s 3 lw 820 1731 m20 6 lw 829 1805 m 1 X s 845 1805 m 2 X s 3 lw 838 1805 m20 6 lw 847 1899 m 1 X s 863 1899
 m 1 X s 3 lw 855 1899 m20 6 lw 864 1966 m 2 X s 881 1966 m 1 X s 3 lw 873 1966 m20 6 lw 882 2004 m 2 X s 899 2004 m 1 X s 3 lw 891 2004 m20 6 lw 900 1961 m 2 X s 917 1961 m 1 X s 3 lw 909 1961 m20 6 lw 918 1807 m 2 X s 935 1807 m 1 X s 3 lw 927 1807
 m20 6 lw 936 1593 m 1 X s 953 1593 m 1 X s 3 lw 945 1593 m20 6 lw 954 1395 m 1 X s 971 1395 m 1 X s 3 lw 963 1395 m20 6 lw 972 1233 m 1 X s 989 1233 m 1 X s 3 lw 981 1233 m20 6 lw 990 1117 m 1 X s 1006 1117 m 2 X s 3 lw 999 1117 m20 6 lw 1008 1034 m
 1 X s 1024 1034 m 2 X s 3 lw 1017 1034 m20 6 lw 1026 965 m 1 X s 1042 965 m 2 X s 3 lw 1035 965 m20 6 lw 1044 913 m 1 X s 1060 913 m 2 X s 3 lw 1053 913 m20 6 lw 1062 872 m 1 X s 1078 872 m 1 X s 3 lw 1070 872 m20 6 lw 1079 841 m 2 X s 1096 841 m 1
 X s 3 lw 1088 841 m20 6 lw 1097 813 m 2 X s 1114 813 m 1 X s 3 lw 1106 813 m20 6 lw 1115 790 m 2 X s 1132 790 m 1 X s 3 lw 1124 790 m20 6 lw 1133 770 m 2 X s 1150 770 m 1 X s 3 lw 1142 770 m20 6 lw 1151 757 m 1 X s 1168 757 m 1 X s 3 lw 1160 757 m20
 6 lw 1169 743 m 1 X s 1186 743 m 1 X s 3 lw 1178 743 m20 6 lw 1187 733 m 1 X s 1203 733 m 2 X s 3 lw 1196 733 m20 6 lw 1205 724 m 1 X s 1221 724 m 2 X s 3 lw 1214 724 m20 6 lw 1223 715 m 1 X s 1239 715 m 2 X s 3 lw 1232 715 m20 6 lw 1241 707 m 1 X s
 1257 707 m 2 X s 3 lw 1250 707 m20 6 lw 1259 702 m 1 X s 1275 702 m 1 X s 3 lw 1268 702 m20 6 lw 1276 696 m 2 X s 1293 696 m 1 X s 3 lw 1285 696 m20 6 lw 1294 691 m 2 X s 1311 691 m 1 X s 3 lw 1303 691 m20 6 lw 1312 685 m 2 X s 1329 685 m 1 X s 3 lw
 1321 685 m20 6 lw 1330 682 m 2 X s 1347 682 m 1 X s 3 lw 1339 682 m20 6 lw 1348 678 m 2 X s 1365 678 m 1 X s 3 lw 1357 678 m20 6 lw 1366 674 m 1 X s 1383 674 m 1 X s 3 lw 1375 674 m20 6 lw 1384 672 m 1 X s 1401 672 m 1 X s 3 lw 1393 672 m20 6 lw
 1402 670 m 1 X s 1418 670 m 2 X s 3 lw 1411 670 m20 6 lw 1420 668 m 1 X s 1436 668 m 2 X s 3 lw 1429 668 m20 6 lw 1438 665 m 1 X s 1454 665 m 2 X s 3 lw 1447 665 m20 6 lw 1456 664 m 1 X s 1472 664 m 2 X s 3 lw 1465 664 m20 6 lw 1474 662 m 1 X s 1490
 662 m 1 X s 3 lw 1483 662 m20 6 lw 1491 660 m 2 X s 1508 660 m 1 X s 3 lw 1500 660 m20 6 lw 1509 658 m 2 X s 1526 658 m 1 X s 3 lw 1518 658 m20 6 lw 1527 657 m 2 X s 1544 657 m 1 X s 3 lw 1536 657 m20 6 lw 1545 656 m 2 X s 1562 656 m 1 X s 3 lw 1554
 656 m20 6 lw 1563 654 m 1 X s 1580 654 m 1 X s 3 lw 1572 654 m20 6 lw 1581 654 m 1 X s 1598 654 m 1 X s 3 lw 1590 654 m20 6 lw 1599 653 m 1 X s 1616 653 m 1 X s 3 lw 1608 653 m20 6 lw 1617 651 m 1 X s 1633 651 m 2 X s 3 lw 1626 651 m20 6 lw 1635 651
 m 1 X s 1651 651 m 2 X s 3 lw 1644 651 m20 6 lw 1653 649 m 1 X s 1669 649 m 2 X s 3 lw 1662 649 m20 6 lw 1671 649 m 1 X s 1687 649 m 2 X s 3 lw 1680 649 m20 6 lw 1689 648 m 1 X s 1705 648 m 1 X s 3 lw 1697 648 m20 6 lw 1706 648 m 2 X s 1723 648 m 1
 X s 3 lw 1715 648 m20 6 lw 1724 648 m 2 X s 1741 648 m 1 X s 3 lw 1733 648 m20 6 lw 1742 647 m 2 X s 1759 647 m 1 X s 3 lw 1751 647 m20 6 lw 1760 646 m 2 X s 1777 646 m 1 X s 3 lw 1769 646 m20 6 lw 1778 646 m 1 X s 1795 646 m 1 X s 3 lw 1787 646 m20
 6 lw 1796 645 m 1 X s 1813 645 m 1 X s 3 lw 1805 645 m20 6 lw 1814 645 m 1 X s 1831 645 m 1 X s 3 lw 1823 645 m20 6 lw 1832 645 m 1 X s 1848 645 m 2 X s 3 lw 1841 645 m20 6 lw 1850 644 m 1 X s 1866 644 m 2 X s 3 lw 1859 644 m20 6 lw 1868 644 m 1 X s
 1884 644 m 2 X s 3 lw 1877 644 m20 6 lw 1886 643 m 1 X s 1902 643 m 2 X s 3 lw 1895 643 m20 6 lw 1904 643 m 1 X s 1920 643 m 1 X s 3 lw 1912 643 m20 6 lw 1921 643 m 2 X s 1938 643 m 1 X s 3 lw 1930 643 m20 6 lw 1939 643 m 2 X s 1956 643 m 1 X s 3 lw
 1948 643 m20 6 lw 1957 643 m 2 X s 1974 643 m 1 X s 3 lw 1966 643 m20 6 lw 1975 642 m 2 X s 1992 642 m 1 X s 3 lw 1984 642 m20 6 lw 1993 642 m 1 X s 2010 642 m 1 X s 3 lw 2002 642 m20 6 lw 2011 643 m 1 X s 2028 643 m 1 X s 3 lw 2020 643 m20 6 lw
 2029 642 m 1 X s 2045 642 m 2 X s 3 lw 2038 642 m20 6 lw 2047 642 m 1 X s 2063 642 m 2 X s 3 lw 2056 642 m20 6 lw 2065 641 m 1 X s 2081 641 m 2 X s 3 lw 2074 641 m20 6 lw 2083 641 m 1 X s 2099 641 m 2 X s 3 lw 2092 641 m20 6 lw 2101 641 m 1 X s 2117
 641 m 2 X s 3 lw 2110 641 m20 6 lw 2119 641 m 1 X s 2135 641 m 1 X s 3 lw 2127 641 m20 6 lw 2136 641 m 2 X s 2153 641 m 1 X s 3 lw 2145 641 m20 6 lw black
 gsave  2268 2557 0 0 C 2222.06 1856.79 t 90 r /Helvetica-BoldOblique findfont 41.8538 sf 0 0 m (LHC HIGGS XS WG 2013) show NC gr  3 lw 1 1 1 c 839 639 1247 1662 bf black 1270 1662 m -15 Y 832 X 631 Y -16 X -616 Y f 1247 1662 m 639 Y 839 X -639 Y
 -839 X cl s
 gsave  2268 2557 0 0 C 1632.3 2225.86 t 0 r /Helvetica-Bold findfont 60.8783 sf 0 0 m (=125 GeV) show NC gr 
 gsave  2268 2557 0 0 C 1605.67 2195.42 t 0 r /Helvetica-Bold findfont 38.0489 sf 0 0 m (H) show NC gr 
 gsave  2268 2557 0 0 C 1331.71 2225.86 t 0 r /Helvetica-Bold findfont 60.8783 sf 0 0 m 
 218 202 185 150 117 85 68 35
(=8 TeV, m) K NC gr 
 gsave  2268 2557 0 0 C 1297.47 2225.86 t 0 r /Helvetica-Bold findfont 60.8783 sf 0 0 m (s) show NC gr  6 lw 1259 2260 m 23 -38 d s 0 lw 1282 2222 m 8 53 d s 1290 2275 m 42 X s
 gsave  2268 2557 0 0 C 1453.47 2088.89 t 0 r /Helvetica findfont 60.8783 sf 0 0 m (HRes) show NC gr  1 0 0 c 6 lw 1279 2109 m 147 X s black
 gsave  2268 2557 0 0 C 1453.47 1959.52 t 0 r /Helvetica findfont 60.8783 sf 0 0 m (POWHEG) show NC gr  1279 1982 m 147 X s
 gsave  2268 2557 0 0 C 1453.47 1837.76 t 0 r /Helvetica findfont 60.8783 sf 0 0 m (Madgraph) show NC gr  0.35 0.83 0.33 c 1279 1854 m 147 X s black
 gsave  2268 2557 0 0 C 1453.47 1704.59 t 0 r /Helvetica findfont 60.8783 sf 0 0 m (aMCatNLO) show NC gr  1 0.8 0 c 1279 1726 m 147 X s black 3 lw 1 1 1 c 2268 614 0 0 bf black 1 1 1 c 1791 369 363 245 bf black 1791 369 363 245 bl 363 245 m 1791 X s[
 4 8] 0 sd 363 614 m -369 Y s 542 614 m -369 Y s 721 614 m -369 Y s 900 614 m -369 Y s 1079 614 m -369 Y s 1259 614 m -369 Y s 1438 614 m -369 Y s 1617 614 m -369 Y s 1796 614 m -369 Y s 1975 614 m -369 Y s 2154 614 m -369 Y s[  ] 0 sd 363 614 m 1791
 X s 363 245 m 369 Y s[ 4 8] 0 sd 2154 270 m -1791 X s 2154 319 m -1791 X s 2154 368 m -1791 X s 2154 417 m -1791 X s 2154 466 m -1791 X s 2154 515 m -1791 X s 2154 565 m -1791 X s 2154 614 m -1791 X s 2154 270 m -1791 X s[  ] 0 sd 2154 245 m 369 Y s
 1 0 0 c 6 lw 372 249 m 42 Y s 372 306 m 43 Y s 363 299 m 1 X s 379 299 m 2 X s 3 lw 372 299 m20 6 lw 390 245 m 55 Y s 390 315 m 67 Y s 381 308 m 1 X s 397 308 m 2 X s 3 lw 390 308 m20 6 lw 408 377 m 22 Y s 408 414 m 22 Y s 399 407 m 1 X s 415 407 m
 2 X s 3 lw 408 407 m20 6 lw 426 391 m 20 Y s 426 426 m 19 Y s 417 418 m 1 X s 433 418 m 1 X s 3 lw 426 418 m20 6 lw 443 333 m 20 Y s 443 368 m 20 Y s 434 360 m 2 X s 451 360 m 1 X s 3 lw 443 360 m20 6 lw 461 380 m 13 Y s 461 408 m 12 Y s 452 400 m 2
 X s 469 400 m 1 X s 3 lw 461 400 m20 6 lw 479 385 m 9 Y s 479 409 m 9 Y s 470 401 m 2 X s 487 401 m 1 X s 3 lw 479 401 m20 6 lw 497 357 m 8 Y s 497 380 m 8 Y s 488 372 m 2 X s 505 372 m 1 X s 3 lw 497 372 m20 6 lw 515 341 m 6 Y s 515 362 m 7 Y s 506
 355 m 2 X s 523 355 m 1 X s 3 lw 515 355 m20 6 lw 533 348 m 6 Y s 533 369 m 6 Y s 524 362 m 1 X s 541 362 m 1 X s 3 lw 533 362 m20 6 lw 551 356 m 4 Y s 551 376 m 4 Y s 542 368 m 1 X s 559 368 m 1 X s 3 lw 551 368 m20 6 lw 569 346 m 4 Y s 569 365 m 4
 Y s 560 357 m 1 X s 576 357 m 2 X s 3 lw 569 357 m20 6 lw 587 365 m 4 Y s 587 384 m 3 Y s 578 376 m 1 X s 594 376 m 2 X s 3 lw 587 376 m20 6 lw 605 321 m 3 Y s 605 339 m 3 Y s 596 331 m 1 X s 612 331 m 2 X s 3 lw 605 331 m20 6 lw 623 374 m 4 Y s 623
 394 m 4 Y s 614 386 m 1 X s 630 386 m 2 X s 3 lw 623 386 m20 6 lw 641 371 m 2 Y s 641 388 m 2 Y s 632 380 m 1 X s 648 380 m 1 X s 3 lw 641 380 m20 6 lw 658 366 m 3 Y s 658 384 m 3 Y s 649 377 m 2 X s 666 377 m 1 X s 3 lw 658 377 m20 6 lw 676 348 m 3
 Y s 676 366 m 3 Y s 667 358 m 2 X s 684 358 m 1 X s 3 lw 676 358 m20 6 lw 694 361 m 2 Y s 694 378 m 2 Y s 685 371 m 2 X s 702 371 m 1 X s 3 lw 694 371 m20 6 lw 712 358 m 4 Y s 712 377 m 4 Y s 703 369 m 2 X s 720 369 m 1 X s 3 lw 712 369 m20 6 lw 730
 360 m 1 Y s 730 376 m 2 Y s 721 369 m 1 X s 738 369 m 1 X s 3 lw 730 369 m20 6 lw 739 370 m 1 X s 756 370 m 1 X s 3 lw 748 370 m20 6 lw 766 361 m s 766 376 m s 757 368 m 1 X s 774 368 m 1 X s 3 lw 766 368 m20 6 lw 775 372 m 1 X s 791 372 m 2 X s 3
 lw 784 372 m20 6 lw 802 367 m 1 Y s 802 383 m 1 Y s 793 375 m 1 X s 809 375 m 2 X s 3 lw 802 375 m20 6 lw 811 358 m 1 X s 827 358 m 2 X s 3 lw 820 358 m20 6 lw 838 360 m 1 Y s 838 376 m 1 Y s 829 369 m 1 X s 845 369 m 2 X s 3 lw 838 369 m20 6 lw 855
 363 m s 855 379 m s 847 371 m 1 X s 863 371 m 1 X s 3 lw 855 371 m20 6 lw 873 368 m s 873 384 m 1 Y s 864 376 m 2 X s 881 376 m 1 X s 3 lw 873 376 m20 6 lw 891 371 m 1 Y s 891 387 m 1 Y s 882 380 m 2 X s 899 380 m 1 X s 3 lw 891 380 m20 6 lw 909 373
 m 1 Y s 909 390 m 1 Y s 900 382 m 2 X s 917 382 m 1 X s 3 lw 909 382 m20 6 lw 927 348 m 1 Y s 927 364 m 1 Y s 918 356 m 2 X s 935 356 m 1 X s 3 lw 927 356 m20 6 lw 936 380 m 1 X s 953 380 m 1 X s 3 lw 945 380 m20 6 lw 954 369 m 1 X s 971 369 m 1 X s
 3 lw 963 369 m20 6 lw 972 368 m 1 X s 989 368 m 1 X s 3 lw 981 368 m20 6 lw 990 356 m 1 X s 1006 356 m 2 X s 3 lw 999 356 m20 6 lw 1017 338 m 4 Y s 1017 357 m 4 Y s 1008 349 m 1 X s 1024 349 m 2 X s 3 lw 1017 349 m20 6 lw 1035 358 m 4 Y s 1035 377 m
 5 Y s 1026 370 m 1 X s 1042 370 m 2 X s 3 lw 1035 370 m20 6 lw 1053 332 m s 1053 347 m 1 Y s 1044 340 m 1 X s 1060 340 m 2 X s 3 lw 1053 340 m20 6 lw 1070 341 m 1 Y s 1070 357 m 2 Y s 1062 350 m 1 X s 1078 350 m 1 X s 3 lw 1070 350 m20 6 lw 1088 330
 m 1 Y s 1088 346 m 2 Y s 1079 339 m 2 X s 1096 339 m 1 X s 3 lw 1088 339 m20 6 lw 1106 328 m 4 Y s 1106 348 m 4 Y s 1097 340 m 2 X s 1114 340 m 1 X s 3 lw 1106 340 m20 6 lw 1124 347 m 7 Y s 1124 369 m 7 Y s 1115 362 m 2 X s 1132 362 m 1 X s 3 lw
 1124 362 m20 6 lw 1142 347 m 8 Y s 1142 370 m 8 Y s 1133 362 m 2 X s 1150 362 m 1 X s 3 lw 1142 362 m20 6 lw 1160 337 m 8 Y s 1160 360 m 7 Y s 1151 352 m 1 X s 1168 352 m 1 X s 3 lw 1160 352 m20 6 lw 1178 343 m 7 Y s 1178 365 m 8 Y s 1169 358 m 1 X
 s 1186 358 m 1 X s 3 lw 1178 358 m20 6 lw 1196 340 m 10 Y s 1196 365 m 10 Y s 1187 357 m 1 X s 1203 357 m 2 X s 3 lw 1196 357 m20 6 lw 1214 315 m 9 Y s 1214 340 m 9 Y s 1205 332 m 1 X s 1221 332 m 2 X s 3 lw 1214 332 m20 6 lw 1232 300 m 8 Y s 1232
 324 m 8 Y s 1223 316 m 1 X s 1239 316 m 2 X s 3 lw 1232 316 m20 6 lw 1250 348 m 15 Y s 1250 378 m 14 Y s 1241 370 m 1 X s 1257 370 m 2 X s 3 lw 1250 370 m20 6 lw 1268 314 m 11 Y s 1268 341 m 11 Y s 1259 333 m 1 X s 1275 333 m 1 X s 3 lw 1268 333 m20
 6 lw 1285 344 m 16 Y s 1285 375 m 15 Y s 1276 367 m 2 X s 1293 367 m 1 X s 3 lw 1285 367 m20 6 lw 1303 361 m 20 Y s 1303 396 m 20 Y s 1294 388 m 2 X s 1311 388 m 1 X s 3 lw 1303 388 m20 6 lw 1321 301 m 12 Y s 1321 328 m 13 Y s 1312 321 m 2 X s 1329
 321 m 1 X s 3 lw 1321 321 m20 6 lw 1339 371 m 22 Y s 1339 408 m 23 Y s 1330 401 m 2 X s 1347 401 m 1 X s 3 lw 1339 401 m20 6 lw 1357 322 m 19 Y s 1357 356 m 18 Y s 1348 348 m 2 X s 1365 348 m 1 X s 3 lw 1357 348 m20 6 lw 1375 335 m 21 Y s 1375 372 m
 21 Y s 1366 364 m 1 X s 1383 364 m 1 X s 3 lw 1375 364 m20 6 lw 1393 339 m 23 Y s 1393 377 m 23 Y s 1384 370 m 1 X s 1401 370 m 1 X s 3 lw 1393 370 m20 6 lw 1411 314 m 21 Y s 1411 351 m 21 Y s 1402 343 m 1 X s 1418 343 m 2 X s 3 lw 1411 343 m20 6 lw
 1429 319 m 22 Y s 1429 356 m 22 Y s 1420 348 m 1 X s 1436 348 m 2 X s 3 lw 1429 348 m20 6 lw 1447 309 m 21 Y s 1447 345 m 21 Y s 1438 338 m 1 X s 1454 338 m 2 X s 3 lw 1447 338 m20 6 lw 1465 306 m 21 Y s 1465 342 m 21 Y s 1456 335 m 1 X s 1472 335 m
 2 X s 3 lw 1465 335 m20 6 lw 1483 365 m 43 Y s 1483 423 m 43 Y s 1474 415 m 1 X s 1490 415 m 1 X s 3 lw 1483 415 m20 6 lw 1500 256 m 32 Y s 1500 303 m 31 Y s 1491 295 m 2 X s 1508 295 m 1 X s 3 lw 1500 295 m20 6 lw 1518 310 m 21 Y s 1518 346 m 21 Y
 s 1509 338 m 2 X s 1526 338 m 1 X s 3 lw 1518 338 m20 6 lw 1536 358 m 32 Y s 1536 405 m 32 Y s 1527 397 m 2 X s 1544 397 m 1 X s 3 lw 1536 397 m20 6 lw 1554 349 m 35 Y s 1554 400 m 35 Y s 1545 392 m 2 X s 1562 392 m 1 X s 3 lw 1554 392 m20 6 lw 1572
 310 m 34 Y s 1572 359 m 35 Y s 1563 352 m 1 X s 1580 352 m 1 X s 3 lw 1572 352 m20 6 lw 1590 284 m 30 Y s 1590 330 m 30 Y s 1581 322 m 1 X s 1598 322 m 1 X s 3 lw 1590 322 m20 6 lw 1608 292 m 26 Y s 1608 333 m 26 Y s 1599 326 m 1 X s 1616 326 m 1 X
 s 3 lw 1608 326 m20 6 lw 1626 321 m 30 Y s 1626 367 m 29 Y s 1617 359 m 1 X s 1633 359 m 2 X s 3 lw 1626 359 m20 6 lw 1644 301 m 25 Y s 1644 341 m 25 Y s 1635 333 m 1 X s 1651 333 m 2 X s 3 lw 1644 333 m20 6 lw 1662 336 m 34 Y s 1662 386 m 34 Y s
 1653 378 m 1 X s 1669 378 m 2 X s 3 lw 1662 378 m20 6 lw 1680 330 m 35 Y s 1680 380 m 34 Y s 1671 372 m 1 X s 1687 372 m 2 X s 3 lw 1680 372 m20 6 lw 1697 268 m 21 Y s 1697 305 m 21 Y s 1689 297 m 1 X s 1705 297 m 1 X s 3 lw 1697 297 m20 6 lw 1715
 362 m 46 Y s 1715 424 m 46 Y s 1706 416 m 2 X s 1723 416 m 1 X s 3 lw 1715 416 m20 6 lw 1733 265 m 37 Y s 1733 317 m 38 Y s 1724 310 m 2 X s 1741 310 m 1 X s 3 lw 1733 310 m20 6 lw 1751 313 m 37 Y s 1751 366 m 37 Y s 1742 358 m 2 X s 1759 358 m 1 X
 s 3 lw 1751 358 m20 6 lw 1769 262 m 21 Y s 1769 298 m 21 Y s 1760 291 m 2 X s 1777 291 m 1 X s 3 lw 1769 291 m20 6 lw 1787 277 m 29 Y s 1787 321 m 29 Y s 1778 314 m 1 X s 1795 314 m 1 X s 3 lw 1787 314 m20 6 lw 1805 326 m 42 Y s 1805 383 m 42 Y s
 1796 376 m 1 X s 1813 376 m 1 X s 3 lw 1805 376 m20 6 lw 1823 289 m 36 Y s 1823 340 m 36 Y s 1814 332 m 1 X s 1831 332 m 1 X s 3 lw 1823 332 m20 6 lw 1841 293 m 31 Y s 1841 339 m 31 Y s 1832 331 m 1 X s 1848 331 m 2 X s 3 lw 1841 331 m20 6 lw 1859
 308 m 39 Y s 1859 362 m 39 Y s 1850 354 m 1 X s 1866 354 m 2 X s 3 lw 1859 354 m20 6 lw 1877 353 m 67 Y s 1877 435 m 66 Y s 1868 427 m 1 X s 1884 427 m 2 X s 3 lw 1877 427 m20 6 lw 1895 305 m 45 Y s 1895 365 m 45 Y s 1886 357 m 1 X s 1902 357 m 2 X
 s 3 lw 1895 357 m20 6 lw 1912 378 m 86 Y s 1912 479 m 85 Y s 1904 471 m 1 X s 1920 471 m 1 X s 3 lw 1912 471 m20 6 lw 1948 382 m 90 Y s 1948 487 m 90 Y s 1939 479 m 2 X s 1956 479 m 1 X s 3 lw 1948 479 m20 6 lw 1966 338 m 64 Y s 1966 418 m 64 Y s
 1957 410 m 2 X s 1974 410 m 1 X s 3 lw 1966 410 m20 6 lw 1984 319 m 65 Y s 1984 400 m 66 Y s 1975 392 m 2 X s 1992 392 m 1 X s 3 lw 1984 392 m20 6 lw 2002 287 m 46 Y s 2002 348 m 46 Y s 1993 341 m 1 X s 2010 341 m 1 X s 3 lw 2002 341 m20 6 lw 2020
 267 m 72 Y s 2020 354 m 72 Y s 2011 346 m 1 X s 2028 346 m 1 X s 3 lw 2020 346 m20 6 lw 2038 336 m 83 Y s 2038 435 m 83 Y s 2029 427 m 1 X s 2045 427 m 2 X s 3 lw 2038 427 m20 6 lw 2056 334 m 73 Y s 2056 422 m 73 Y s 2047 414 m 1 X s 2063 414 m 2 X
 s 3 lw 2056 414 m20 6 lw 2074 245 m 24 Y s 2074 285 m 30 Y s 2065 277 m 1 X s 2081 277 m 2 X s 3 lw 2074 277 m20 6 lw 2092 370 m 157 Y s 2092 543 m 71 Y s 2083 535 m 1 X s 2099 535 m 2 X s 3 lw 2092 535 m20 6 lw 2110 270 m 44 Y s 2110 330 m 44 Y s
 2101 322 m 1 X s 2117 322 m 2 X s 3 lw 2110 322 m20 6 lw 2127 266 m 49 Y s 2127 331 m 49 Y s 2119 323 m 1 X s 2135 323 m 1 X s 3 lw 2127 323 m20 6 lw black 3 lw 363 245 m 1791 X s
 gsave  2268 614 0 0 C 1944.3 98.9272 t 0 r /Helvetica-Bold findfont 72.4187 sf 0 0 m ( \(GeV\)) show NC gr 
 gsave  2268 614 0 0 C 1921.47 60.8783 t 0 r /Symbol findfont 45.7381 sf 0 0 m (g) show NC gr 
 gsave  2268 614 0 0 C 1891.03 60.8783 t 0 r /Helvetica-Bold findfont 45.7381 sf 0 0 m (T) show NC gr 
 gsave  2268 614 0 0 C 1849.18 98.9272 t 0 r /Helvetica-Bold findfont 72.4187 sf 0 0 m (p) show NC gr  363 260 m -15 Y s 408 253 m -8 Y s 452 253 m -8 Y s 497 253 m -8 Y s 542 260 m -15 Y s 587 253 m -8 Y s 632 253 m -8 Y s 676 253 m -8 Y s 721 260 m
 -15 Y s 766 253 m -8 Y s 811 253 m -8 Y s 855 253 m -8 Y s 900 260 m -15 Y s 945 253 m -8 Y s 990 253 m -8 Y s 1035 253 m -8 Y s 1079 260 m -15 Y s 1124 253 m -8 Y s 1169 253 m -8 Y s 1214 253 m -8 Y s 1259 260 m -15 Y s 1303 253 m -8 Y s 1348 253 m
 -8 Y s 1393 253 m -8 Y s 1438 260 m -15 Y s 1483 253 m -8 Y s 1527 253 m -8 Y s 1572 253 m -8 Y s 1617 260 m -15 Y s 1662 253 m -8 Y s 1706 253 m -8 Y s 1751 253 m -8 Y s 1796 260 m -15 Y s 1841 253 m -8 Y s 1886 253 m -8 Y s 1930 253 m -8 Y s 1975
 260 m -15 Y s 2020 253 m -8 Y s 2065 253 m -8 Y s 2110 253 m -8 Y s 2154 260 m -15 Y s
 gsave  2268 614 0 0 C 342.44 182.635 t 0 r /Helvetica-Bold findfont 72.4187 sf 0 0 m (0) show NC gr 
 gsave  2268 614 0 0 C 498.441 182.635 t 0 r /Helvetica-Bold findfont 72.4187 sf 0 0 m (20) show NC gr 
 gsave  2268 614 0 0 C 677.271 182.635 t 0 r /Helvetica-Bold findfont 72.4187 sf 0 0 m (40) show NC gr 
 gsave  2268 614 0 0 C 856.101 182.635 t 0 r /Helvetica-Bold findfont 72.4187 sf 0 0 m (60) show NC gr 
 gsave  2268 614 0 0 C 1034.93 182.635 t 0 r /Helvetica-Bold findfont 72.4187 sf 0 0 m (80) show NC gr 
 gsave  2268 614 0 0 C 1194.74 182.635 t 0 r /Helvetica-Bold findfont 72.4187 sf 0 0 m (100) show NC gr 
 gsave  2268 614 0 0 C 1373.57 182.635 t 0 r /Helvetica-Bold findfont 72.4187 sf 0 0 m (120) show NC gr 
 gsave  2268 614 0 0 C 1552.4 182.635 t 0 r /Helvetica-Bold findfont 72.4187 sf 0 0 m (140) show NC gr 
 gsave  2268 614 0 0 C 1735.03 182.635 t 0 r /Helvetica-Bold findfont 72.4187 sf 0 0 m (160) show NC gr 
 gsave  2268 614 0 0 C 1913.86 182.635 t 0 r /Helvetica-Bold findfont 72.4187 sf 0 0 m (180) show NC gr 
 gsave  2268 614 0 0 C 2092.69 182.635 t 0 r /Helvetica-Bold findfont 72.4187 sf 0 0 m (200) show NC gr  363 614 m 1791 X s 363 599 m 15 Y s 408 606 m 8 Y s 452 606 m 8 Y s 497 606 m 8 Y s 542 599 m 15 Y s 587 606 m 8 Y s 632 606 m 8 Y s 676 606 m 8
 Y s 721 599 m 15 Y s 766 606 m 8 Y s 811 606 m 8 Y s 855 606 m 8 Y s 900 599 m 15 Y s 945 606 m 8 Y s 990 606 m 8 Y s 1035 606 m 8 Y s 1079 599 m 15 Y s 1124 606 m 8 Y s 1169 606 m 8 Y s 1214 606 m 8 Y s 1259 599 m 15 Y s 1303 606 m 8 Y s 1348 606 m
 8 Y s 1393 606 m 8 Y s 1438 599 m 15 Y s 1483 606 m 8 Y s 1527 606 m 8 Y s 1572 606 m 8 Y s 1617 599 m 15 Y s 1662 606 m 8 Y s 1706 606 m 8 Y s 1751 606 m 8 Y s 1796 599 m 15 Y s 1841 606 m 8 Y s 1886 606 m 8 Y s 1930 606 m 8 Y s 1975 599 m 15 Y s
 2020 606 m 8 Y s 2065 606 m 8 Y s 2110 606 m 8 Y s 2154 599 m 15 Y s 363 245 m 369 Y s
 gsave  2268 614 0 0 C 228.294 53.2685 t 90 r /Helvetica-Bold findfont 72.4187 sf 0 0 m (Ratio to Powheg) show NC gr  404 270 m -41 X s 383 282 m -20 X s 383 295 m -20 X s 383 307 m -20 X s 404 319 m -41 X s 383 331 m -20 X s 383 344 m -20 X s 383
 356 m -20 X s 404 368 m -41 X s 383 380 m -20 X s 383 393 m -20 X s 383 405 m -20 X s 404 417 m -41 X s 383 430 m -20 X s 383 442 m -20 X s 383 454 m -20 X s 404 466 m -41 X s 383 479 m -20 X s 383 491 m -20 X s 383 503 m -20 X s 404 515 m -41 X s
 383 528 m -20 X s 383 540 m -20 X s 383 552 m -20 X s 404 565 m -41 X s 383 577 m -20 X s 383 589 m -20 X s 383 601 m -20 X s 404 614 m -41 X s 404 270 m -41 X s 383 258 m -20 X s 383 245 m -20 X s
 gsave  2268 614 0 0 C 292.977 254.928 t 0 r /Helvetica-Bold findfont 41.9266 sf 0 0 m (0.6) show NC gr 
 gsave  2268 614 0 0 C 292.977 304.391 t 0 r /Helvetica-Bold findfont 41.9266 sf 0 0 m (0.8) show NC gr 
 gsave  2268 614 0 0 C 331.026 350.05 t 0 r /Helvetica-Bold findfont 41.9266 sf 0 0 m (1) show NC gr 
 gsave  2268 614 0 0 C 292.977 399.514 t 0 r /Helvetica-Bold findfont 41.9266 sf 0 0 m (1.2) show NC gr 
 gsave  2268 614 0 0 C 289.172 448.977 t 0 r /Helvetica-Bold findfont 41.9266 sf 0 0 m (1.4) show NC gr 
 gsave  2268 614 0 0 C 292.977 502.246 t 0 r /Helvetica-Bold findfont 41.9266 sf 0 0 m (1.6) show NC gr 
 gsave  2268 614 0 0 C 292.977 551.71 t 0 r /Helvetica-Bold findfont 41.9266 sf 0 0 m (1.8) show NC gr 
 gsave  2268 614 0 0 C 327.221 597.368 t 0 r /Helvetica-Bold findfont 41.9266 sf 0 0 m (2) show NC gr  2154 245 m 369 Y s 2114 270 m 40 X s 2134 282 m 20 X s 2134 295 m 20 X s 2134 307 m 20 X s 2114 319 m 40 X s 2134 331 m 20 X s 2134 344 m 20 X s
 2134 356 m 20 X s 2114 368 m 40 X s 2134 380 m 20 X s 2134 393 m 20 X s 2134 405 m 20 X s 2114 417 m 40 X s 2134 430 m 20 X s 2134 442 m 20 X s 2134 454 m 20 X s 2114 466 m 40 X s 2134 479 m 20 X s 2134 491 m 20 X s 2134 503 m 20 X s 2114 515 m 40 X
 s 2134 528 m 20 X s 2134 540 m 20 X s 2134 552 m 20 X s 2114 565 m 40 X s 2134 577 m 20 X s 2134 589 m 20 X s 2134 601 m 20 X s 2114 614 m 40 X s 2114 270 m 40 X s 2134 258 m 20 X s 2134 245 m 20 X s 1 0.8 0 c 6 lw 1 1 1 c 1 0.8 0 c 372 321 m 23 Y s
 372 359 m 23 Y s 363 352 m 1 X s 379 352 m 2 X s 3 lw 372 352 m20 6 lw 390 354 m 14 Y s 390 384 m 14 Y s 381 376 m 1 X s 397 376 m 2 X s 3 lw 390 376 m20 6 lw 408 352 m 9 Y s 408 376 m 8 Y s 399 368 m 1 X s 415 368 m 2 X s 3 lw 408 368 m20 6 lw 426
 365 m 7 Y s 426 387 m 7 Y s 417 380 m 1 X s 433 380 m 1 X s 3 lw 426 380 m20 6 lw 443 364 m 5 Y s 443 384 m 5 Y s 434 376 m 2 X s 451 376 m 1 X s 3 lw 443 376 m20 6 lw 461 352 m 3 Y s 461 370 m 3 Y s 452 363 m 2 X s 469 363 m 1 X s 3 lw 461 363 m20
 6 lw 479 354 m 2 Y s 479 371 m 2 Y s 470 364 m 2 X s 487 364 m 1 X s 3 lw 479 364 m20 6 lw 497 368 m 2 Y s 497 385 m 2 Y s 488 377 m 2 X s 505 377 m 1 X s 3 lw 497 377 m20 6 lw 515 363 m 1 Y s 515 379 m 1 Y s 506 372 m 2 X s 523 372 m 1 X s 3 lw 515
 372 m20 6 lw 524 360 m 1 X s 541 360 m 1 X s 3 lw 533 360 m20 6 lw 542 364 m 1 X s 559 364 m 1 X s 3 lw 551 364 m20 6 lw 560 365 m 1 X s 576 365 m 2 X s 3 lw 569 365 m20 6 lw 578 371 m 1 X s 594 371 m 2 X s 3 lw 587 371 m20 6 lw 596 371 m 1 X s 612
 371 m 2 X s 3 lw 605 371 m20 6 lw 614 373 m 1 X s 630 373 m 2 X s 3 lw 623 373 m20 6 lw 632 377 m 1 X s 648 377 m 1 X s 3 lw 641 377 m20 6 lw 649 373 m 2 X s 666 373 m 1 X s 3 lw 658 373 m20 6 lw 667 370 m 2 X s 684 370 m 1 X s 3 lw 676 370 m20 6 lw
 685 372 m 2 X s 702 372 m 1 X s 3 lw 694 372 m20 6 lw 703 376 m 2 X s 720 376 m 1 X s 3 lw 712 376 m20 6 lw 721 373 m 1 X s 738 373 m 1 X s 3 lw 730 373 m20 6 lw 739 369 m 1 X s 756 369 m 1 X s 3 lw 748 369 m20 6 lw 757 373 m 1 X s 774 373 m 1 X s 3
 lw 766 373 m20 6 lw 775 368 m 1 X s 791 368 m 2 X s 3 lw 784 368 m20 6 lw 793 367 m 1 X s 809 367 m 2 X s 3 lw 802 367 m20 6 lw 811 361 m 1 X s 827 361 m 2 X s 3 lw 820 361 m20 6 lw 829 365 m 1 X s 845 365 m 2 X s 3 lw 838 365 m20 6 lw 847 355 m 1 X
 s 863 355 m 1 X s 3 lw 855 355 m20 6 lw 864 365 m 2 X s 881 365 m 1 X s 3 lw 873 365 m20 6 lw 882 364 m 2 X s 899 364 m 1 X s 3 lw 891 364 m20 6 lw 900 361 m 2 X s 917 361 m 1 X s 3 lw 909 361 m20 6 lw 918 357 m 2 X s 935 357 m 1 X s 3 lw 927 357
 m20 6 lw 936 360 m 1 X s 953 360 m 1 X s 3 lw 945 360 m20 6 lw 954 371 m 1 X s 971 371 m 1 X s 3 lw 963 371 m20 6 lw 972 375 m 1 X s 989 375 m 1 X s 3 lw 981 375 m20 6 lw 990 369 m 1 X s 1006 369 m 2 X s 3 lw 999 369 m20 6 lw 1008 387 m 1 X s 1024
 387 m 2 X s 3 lw 1017 387 m20 6 lw 1026 381 m 1 X s 1042 381 m 2 X s 3 lw 1035 381 m20 6 lw 1044 366 m 1 X s 1060 366 m 2 X s 3 lw 1053 366 m20 6 lw 1070 377 m 1 Y s 1070 393 m 1 Y s 1062 385 m 1 X s 1078 385 m 1 X s 3 lw 1070 385 m20 6 lw 1088 349
 m s 1088 365 m s 1079 357 m 2 X s 1096 357 m 1 X s 3 lw 1088 357 m20 6 lw 1106 382 m 2 Y s 1106 399 m 3 Y s 1097 392 m 2 X s 1114 392 m 1 X s 3 lw 1106 392 m20 6 lw 1124 366 m 2 Y s 1124 383 m 3 Y s 1115 376 m 2 X s 1132 376 m 1 X s 3 lw 1124 376
 m20 6 lw 1142 392 m 5 Y s 1142 412 m 5 Y s 1133 404 m 2 X s 1150 404 m 1 X s 3 lw 1142 404 m20 6 lw 1160 368 m 4 Y s 1160 387 m 5 Y s 1151 380 m 1 X s 1168 380 m 1 X s 3 lw 1160 380 m20 6 lw 1178 375 m 5 Y s 1178 396 m 5 Y s 1169 388 m 1 X s 1186
 388 m 1 X s 3 lw 1178 388 m20 6 lw 1196 369 m 5 Y s 1196 390 m 6 Y s 1187 382 m 1 X s 1203 382 m 2 X s 3 lw 1196 382 m20 6 lw 1214 349 m 6 Y s 1214 370 m 5 Y s 1205 362 m 1 X s 1221 362 m 2 X s 3 lw 1214 362 m20 6 lw 1232 355 m 6 Y s 1232 376 m 6 Y
 s 1223 368 m 1 X s 1239 368 m 2 X s 3 lw 1232 368 m20 6 lw 1250 377 m 10 Y s 1250 402 m 9 Y s 1241 394 m 1 X s 1257 394 m 2 X s 3 lw 1250 394 m20 6 lw 1268 358 m 8 Y s 1268 381 m 9 Y s 1259 374 m 1 X s 1275 374 m 1 X s 3 lw 1268 374 m20 6 lw 1285
 370 m 11 Y s 1285 396 m 11 Y s 1276 388 m 2 X s 1293 388 m 1 X s 3 lw 1285 388 m20 6 lw 1303 412 m 16 Y s 1303 443 m 17 Y s 1294 436 m 2 X s 1311 436 m 1 X s 3 lw 1303 436 m20 6 lw 1321 328 m 8 Y s 1321 351 m 8 Y s 1312 343 m 2 X s 1329 343 m 1 X s
 3 lw 1321 343 m20 6 lw 1339 405 m 18 Y s 1339 438 m 18 Y s 1330 430 m 2 X s 1347 430 m 1 X s 3 lw 1339 430 m20 6 lw 1357 372 m 15 Y s 1357 402 m 15 Y s 1348 395 m 2 X s 1365 395 m 1 X s 3 lw 1357 395 m20 6 lw 1375 384 m 18 Y s 1375 417 m 18 Y s 1366
 409 m 1 X s 1383 409 m 1 X s 3 lw 1375 409 m20 6 lw 1393 365 m 17 Y s 1393 398 m 17 Y s 1384 390 m 1 X s 1401 390 m 1 X s 3 lw 1393 390 m20 6 lw 1411 352 m 15 Y s 1411 382 m 16 Y s 1402 375 m 1 X s 1418 375 m 2 X s 3 lw 1411 375 m20 6 lw 1429 343 m
 16 Y s 1429 374 m 15 Y s 1420 366 m 1 X s 1436 366 m 2 X s 3 lw 1429 366 m20 6 lw 1447 357 m 18 Y s 1447 390 m 19 Y s 1438 383 m 1 X s 1454 383 m 2 X s 3 lw 1447 383 m20 6 lw 1465 334 m 17 Y s 1465 366 m 17 Y s 1456 358 m 1 X s 1472 358 m 2 X s 3 lw
 1465 358 m20 6 lw 1483 431 m 32 Y s 1483 478 m 32 Y s 1474 471 m 1 X s 1490 471 m 1 X s 3 lw 1483 471 m20 6 lw 1500 353 m 21 Y s 1500 389 m 21 Y s 1491 381 m 2 X s 1508 381 m 1 X s 3 lw 1500 381 m20 6 lw 1518 361 m 23 Y s 1518 399 m 23 Y s 1509 392
 m 2 X s 1526 392 m 1 X s 3 lw 1518 392 m20 6 lw 1536 377 m 30 Y s 1536 423 m 30 Y s 1527 415 m 2 X s 1544 415 m 1 X s 3 lw 1536 415 m20 6 lw 1554 379 m 31 Y s 1554 425 m 31 Y s 1545 417 m 2 X s 1562 417 m 1 X s 3 lw 1554 417 m20 6 lw 1572 347 m 26 Y
 s 1572 388 m 26 Y s 1563 380 m 1 X s 1580 380 m 1 X s 3 lw 1572 380 m20 6 lw 1590 361 m 28 Y s 1590 404 m 28 Y s 1581 397 m 1 X s 1598 397 m 1 X s 3 lw 1590 397 m20 6 lw 1608 337 m 26 Y s 1608 378 m 26 Y s 1599 370 m 1 X s 1616 370 m 1 X s 3 lw 1608
 370 m20 6 lw 1626 362 m 33 Y s 1626 410 m 33 Y s 1617 403 m 1 X s 1633 403 m 2 X s 3 lw 1626 403 m20 6 lw 1644 300 m 21 Y s 1644 336 m 22 Y s 1635 329 m 1 X s 1651 329 m 2 X s 3 lw 1644 329 m20 6 lw 1662 403 m 45 Y s 1662 463 m 46 Y s 1653 456 m 1 X
 s 1669 456 m 2 X s 3 lw 1662 456 m20 6 lw 1680 410 m 48 Y s 1680 473 m 48 Y s 1671 465 m 1 X s 1687 465 m 2 X s 3 lw 1680 465 m20 6 lw 1697 319 m 26 Y s 1697 360 m 27 Y s 1689 353 m 1 X s 1705 353 m 1 X s 3 lw 1697 353 m20 6 lw 1715 354 m 40 Y s
 1715 409 m 40 Y s 1706 402 m 2 X s 1723 402 m 1 X s 3 lw 1715 402 m20 6 lw 1733 332 m 35 Y s 1733 383 m 35 Y s 1724 375 m 2 X s 1741 375 m 1 X s 3 lw 1733 375 m20 6 lw 1751 321 m 33 Y s 1751 369 m 32 Y s 1742 361 m 2 X s 1759 361 m 1 X s 3 lw 1751
 361 m20 6 lw 1769 295 m 24 Y s 1769 334 m 24 Y s 1760 326 m 2 X s 1777 326 m 1 X s 3 lw 1769 326 m20 6 lw 1787 342 m 39 Y s 1787 396 m 39 Y s 1778 389 m 1 X s 1795 389 m 1 X s 3 lw 1787 389 m20 6 lw 1805 316 m 38 Y s 1805 369 m 38 Y s 1796 361 m 1 X
 s 1813 361 m 1 X s 3 lw 1805 361 m20 6 lw 1823 406 m 62 Y s 1823 483 m 63 Y s 1814 476 m 1 X s 1831 476 m 1 X s 3 lw 1823 476 m20 6 lw 1841 275 m 27 Y s 1841 318 m 27 Y s 1832 310 m 1 X s 1848 310 m 2 X s 3 lw 1841 310 m20 6 lw 1859 271 m 30 Y s
 1859 317 m 30 Y s 1850 309 m 1 X s 1866 309 m 2 X s 3 lw 1859 309 m20 6 lw 1877 319 m 54 Y s 1877 389 m 54 Y s 1868 381 m 1 X s 1884 381 m 2 X s 3 lw 1877 381 m20 6 lw 1895 316 m 47 Y s 1895 378 m 47 Y s 1886 370 m 1 X s 1902 370 m 2 X s 3 lw 1895
 370 m20 6 lw 1912 454 m 101 Y s 1912 570 m 44 Y s 1904 562 m 1 X s 1920 562 m 1 X s 3 lw 1912 562 m20 6 lw 1930 295 m 33 Y s 1930 343 m 33 Y s 1921 335 m 2 X s 1938 335 m 1 X s 3 lw 1930 335 m20 6 lw 1948 345 m 71 Y s 1948 431 m 71 Y s 1939 424 m 2
 X s 1956 424 m 1 X s 3 lw 1948 424 m20 6 lw 1966 377 m 79 Y s 1966 471 m 79 Y s 1957 463 m 2 X s 1974 463 m 1 X s 3 lw 1966 463 m20 6 lw 1984 350 m 76 Y s 1984 442 m 76 Y s 1975 434 m 2 X s 1992 434 m 1 X s 3 lw 1984 434 m20 6 lw 2002 275 m 36 Y s
 2002 326 m 37 Y s 1993 319 m 1 X s 2010 319 m 1 X s 3 lw 2002 319 m20 6 lw 2020 417 m 113 Y s 2020 545 m 69 Y s 2011 537 m 1 X s 2028 537 m 1 X s 3 lw 2020 537 m20 6 lw 2038 300 m 69 Y s 2038 384 m 69 Y s 2029 376 m 1 X s 2045 376 m 2 X s 3 lw 2038
 376 m20 6 lw 2056 271 m 50 Y s 2056 336 m 50 Y s 2047 329 m 1 X s 2063 329 m 2 X s 3 lw 2056 329 m20 6 lw 2074 277 m 42 Y s 2074 334 m 41 Y s 2065 326 m 1 X s 2081 326 m 2 X s 3 lw 2074 326 m20 6 lw 2110 336 m 63 Y s 2110 414 m 63 Y s 2101 406 m 1 X
 s 2117 406 m 2 X s 3 lw 2110 406 m20 6 lw 2127 269 m 50 Y s 2127 335 m 50 Y s 2119 327 m 1 X s 2135 327 m 1 X s 3 lw 2127 327 m20 6 lw 0.35 0.83 0.33 c 1 1 1 c 0.35 0.83 0.33 c 372 296 m 18 Y s 372 330 m 18 Y s 363 322 m 1 X s 379 322 m 2 X s 3 lw
 372 322 m20 6 lw 390 359 m 14 Y s 390 389 m 14 Y s 381 381 m 1 X s 397 381 m 2 X s 3 lw 390 381 m20 6 lw 408 355 m 9 Y s 408 379 m 8 Y s 399 371 m 1 X s 415 371 m 2 X s 3 lw 408 371 m20 6 lw 426 364 m 7 Y s 426 386 m 7 Y s 417 378 m 1 X s 433 378 m
 1 X s 3 lw 426 378 m20 6 lw 443 364 m 4 Y s 443 384 m 4 Y s 434 376 m 2 X s 451 376 m 1 X s 3 lw 443 376 m20 6 lw 461 350 m 3 Y s 461 368 m 2 Y s 452 360 m 2 X s 469 360 m 1 X s 3 lw 461 360 m20 6 lw 479 352 m 2 Y s 479 369 m 2 Y s 470 361 m 2 X s
 487 361 m 1 X s 3 lw 479 361 m20 6 lw 497 364 m 2 Y s 497 381 m 2 Y s 488 373 m 2 X s 505 373 m 1 X s 3 lw 497 373 m20 6 lw 515 363 m 1 Y s 515 379 m 1 Y s 506 372 m 2 X s 523 372 m 1 X s 3 lw 515 372 m20 6 lw 524 362 m 1 X s 541 362 m 1 X s 3 lw
 533 362 m20 6 lw 542 361 m 1 X s 559 361 m 1 X s 3 lw 551 361 m20 6 lw 560 360 m 1 X s 576 360 m 2 X s 3 lw 569 360 m20 6 lw 578 376 m 1 X s 594 376 m 2 X s 3 lw 587 376 m20 6 lw 596 368 m 1 X s 612 368 m 2 X s 3 lw 605 368 m20 6 lw 614 373 m 1 X s
 630 373 m 2 X s 3 lw 623 373 m20 6 lw 632 373 m 1 X s 648 373 m 1 X s 3 lw 641 373 m20 6 lw 649 371 m 2 X s 666 371 m 1 X s 3 lw 658 371 m20 6 lw 667 368 m 2 X s 684 368 m 1 X s 3 lw 676 368 m20 6 lw 685 370 m 2 X s 702 370 m 1 X s 3 lw 694 370 m20
 6 lw 703 373 m 2 X s 720 373 m 1 X s 3 lw 712 373 m20 6 lw 721 369 m 1 X s 738 369 m 1 X s 3 lw 730 369 m20 6 lw 739 368 m 1 X s 756 368 m 1 X s 3 lw 748 368 m20 6 lw 757 371 m 1 X s 774 371 m 1 X s 3 lw 766 371 m20 6 lw 775 369 m 1 X s 791 369 m 2
 X s 3 lw 784 369 m20 6 lw 793 368 m 1 X s 809 368 m 2 X s 3 lw 802 368 m20 6 lw 811 366 m 1 X s 827 366 m 2 X s 3 lw 820 366 m20 6 lw 829 372 m 1 X s 845 372 m 2 X s 3 lw 838 372 m20 6 lw 847 370 m 1 X s 863 370 m 1 X s 3 lw 855 370 m20 6 lw 864 381
 m 2 X s 881 381 m 1 X s 3 lw 873 381 m20 6 lw 882 384 m 2 X s 899 384 m 1 X s 3 lw 891 384 m20 6 lw 900 385 m 2 X s 917 385 m 1 X s 3 lw 909 385 m20 6 lw 918 377 m 2 X s 935 377 m 1 X s 3 lw 927 377 m20 6 lw 936 370 m 1 X s 953 370 m 1 X s 3 lw 945
 370 m20 6 lw 954 367 m 1 X s 971 367 m 1 X s 3 lw 963 367 m20 6 lw 972 359 m 1 X s 989 359 m 1 X s 3 lw 981 359 m20 6 lw 990 347 m 1 X s 1006 347 m 2 X s 3 lw 999 347 m20 6 lw 1008 354 m 1 X s 1024 354 m 2 X s 3 lw 1017 354 m20 6 lw 1026 349 m 1 X s
 1042 349 m 2 X s 3 lw 1035 349 m20 6 lw 1044 333 m 1 X s 1060 333 m 2 X s 3 lw 1053 333 m20 6 lw 1062 339 m 1 X s 1078 339 m 1 X s 3 lw 1070 339 m20 6 lw 1079 336 m 2 X s 1096 336 m 1 X s 3 lw 1088 336 m20 6 lw 1106 337 m s 1106 352 m 1 Y s 1097 345
 m 2 X s 1114 345 m 1 X s 3 lw 1106 345 m20 6 lw 1124 336 m 2 Y s 1124 353 m 1 Y s 1115 345 m 2 X s 1132 345 m 1 X s 3 lw 1124 345 m20 6 lw 1142 349 m 3 Y s 1142 367 m 3 Y s 1133 359 m 2 X s 1150 359 m 1 X s 3 lw 1142 359 m20 6 lw 1160 336 m 3 Y s
 1160 354 m 2 Y s 1151 346 m 1 X s 1168 346 m 1 X s 3 lw 1160 346 m20 6 lw 1178 337 m 3 Y s 1178 356 m 3 Y s 1169 348 m 1 X s 1186 348 m 1 X s 3 lw 1178 348 m20 6 lw 1196 341 m 5 Y s 1196 361 m 4 Y s 1187 353 m 1 X s 1203 353 m 2 X s 3 lw 1196 353
 m20 6 lw 1214 339 m 5 Y s 1214 359 m 5 Y s 1205 351 m 1 X s 1221 351 m 2 X s 3 lw 1214 351 m20 6 lw 1232 322 m 4 Y s 1232 341 m 4 Y s 1223 333 m 1 X s 1239 333 m 2 X s 3 lw 1232 333 m20 6 lw 1250 346 m 6 Y s 1250 368 m 6 Y s 1241 360 m 1 X s 1257
 360 m 2 X s 3 lw 1250 360 m20 6 lw 1268 340 m 7 Y s 1268 362 m 7 Y s 1259 354 m 1 X s 1275 354 m 1 X s 3 lw 1268 354 m20 6 lw 1285 354 m 9 Y s 1285 378 m 9 Y s 1276 370 m 2 X s 1293 370 m 1 X s 3 lw 1285 370 m20 6 lw 1303 379 m 13 Y s 1303 407 m 14
 Y s 1294 400 m 2 X s 1311 400 m 1 X s 3 lw 1303 400 m20 6 lw 1321 319 m 7 Y s 1321 341 m 7 Y s 1312 334 m 2 X s 1329 334 m 1 X s 3 lw 1321 334 m20 6 lw 1339 378 m 16 Y s 1339 409 m 15 Y s 1330 401 m 2 X s 1347 401 m 1 X s 3 lw 1339 401 m20 6 lw 1357
 343 m 11 Y s 1357 369 m 12 Y s 1348 362 m 2 X s 1365 362 m 1 X s 3 lw 1357 362 m20 6 lw 1375 350 m 14 Y s 1375 379 m 14 Y s 1366 371 m 1 X s 1383 371 m 1 X s 3 lw 1375 371 m20 6 lw 1393 354 m 15 Y s 1393 384 m 16 Y s 1384 377 m 1 X s 1401 377 m 1 X
 s 3 lw 1393 377 m20 6 lw 1411 338 m 14 Y s 1411 367 m 13 Y s 1402 359 m 1 X s 1418 359 m 2 X s 3 lw 1411 359 m20 6 lw 1429 336 m 14 Y s 1429 365 m 14 Y s 1420 357 m 1 X s 1436 357 m 2 X s 3 lw 1429 357 m20 6 lw 1447 336 m 15 Y s 1447 367 m 15 Y s
 1438 359 m 1 X s 1454 359 m 2 X s 3 lw 1447 359 m20 6 lw 1465 338 m 17 Y s 1465 370 m 16 Y s 1456 362 m 1 X s 1472 362 m 2 X s 3 lw 1465 362 m20 6 lw 1483 369 m 24 Y s 1483 408 m 23 Y s 1474 400 m 1 X s 1490 400 m 1 X s 3 lw 1483 400 m20 6 lw 1500
 331 m 17 Y s 1500 363 m 18 Y s 1491 356 m 2 X s 1508 356 m 1 X s 3 lw 1500 356 m20 6 lw 1518 326 m 18 Y s 1518 359 m 18 Y s 1509 352 m 2 X s 1526 352 m 1 X s 3 lw 1518 352 m20 6 lw 1536 373 m 29 Y s 1536 417 m 29 Y s 1527 409 m 2 X s 1544 409 m 1 X
 s 3 lw 1536 409 m20 6 lw 1554 368 m 28 Y s 1554 411 m 29 Y s 1545 404 m 2 X s 1562 404 m 1 X s 3 lw 1554 404 m20 6 lw 1572 336 m 23 Y s 1572 374 m 23 Y s 1563 366 m 1 X s 1580 366 m 1 X s 3 lw 1572 366 m20 6 lw 1590 332 m 23 Y s 1590 370 m 23 Y s
 1581 362 m 1 X s 1598 362 m 1 X s 3 lw 1590 362 m20 6 lw 1608 332 m 24 Y s 1608 372 m 24 Y s 1599 364 m 1 X s 1616 364 m 1 X s 3 lw 1608 364 m20 6 lw 1626 337 m 27 Y s 1626 380 m 27 Y s 1617 372 m 1 X s 1633 372 m 2 X s 3 lw 1626 372 m20 6 lw 1644
 326 m 25 Y s 1644 366 m 25 Y s 1635 359 m 1 X s 1651 359 m 2 X s 3 lw 1644 359 m20 6 lw 1662 343 m 33 Y s 1662 392 m 33 Y s 1653 384 m 1 X s 1669 384 m 2 X s 3 lw 1662 384 m20 6 lw 1680 348 m 34 Y s 1680 398 m 34 Y s 1671 390 m 1 X s 1687 390 m 2 X
 s 3 lw 1680 390 m20 6 lw 1697 294 m 21 Y s 1697 330 m 22 Y s 1689 323 m 1 X s 1705 323 m 1 X s 3 lw 1697 323 m20 6 lw 1715 338 m 35 Y s 1715 389 m 35 Y s 1706 381 m 2 X s 1723 381 m 1 X s 3 lw 1715 381 m20 6 lw 1733 328 m 33 Y s 1733 377 m 33 Y s
 1724 369 m 2 X s 1741 369 m 1 X s 3 lw 1733 369 m20 6 lw 1751 320 m 31 Y s 1751 366 m 31 Y s 1742 358 m 2 X s 1759 358 m 1 X s 3 lw 1751 358 m20 6 lw 1769 263 m 17 Y s 1769 295 m 18 Y s 1760 288 m 2 X s 1777 288 m 1 X s 3 lw 1769 288 m20 6 lw 1787
 306 m 30 Y s 1787 351 m 30 Y s 1778 343 m 1 X s 1795 343 m 1 X s 3 lw 1787 343 m20 6 lw 1805 322 m 38 Y s 1805 375 m 38 Y s 1796 367 m 1 X s 1813 367 m 1 X s 3 lw 1805 367 m20 6 lw 1823 329 m 42 Y s 1823 386 m 42 Y s 1814 379 m 1 X s 1831 379 m 1 X
 s 3 lw 1823 379 m20 6 lw 1841 293 m 30 Y s 1841 338 m 30 Y s 1832 330 m 1 X s 1848 330 m 2 X s 3 lw 1841 330 m20 6 lw 1859 313 m 40 Y s 1859 368 m 39 Y s 1850 360 m 1 X s 1866 360 m 2 X s 3 lw 1859 360 m20 6 lw 1877 363 m 66 Y s 1877 444 m 66 Y s
 1868 436 m 1 X s 1884 436 m 2 X s 3 lw 1877 436 m20 6 lw 1895 306 m 43 Y s 1895 364 m 42 Y s 1886 356 m 1 X s 1902 356 m 2 X s 3 lw 1895 356 m20 6 lw 1912 352 m 65 Y s 1912 432 m 65 Y s 1904 424 m 1 X s 1920 424 m 1 X s 3 lw 1912 424 m20 6 lw 1930
 264 m 25 Y s 1930 304 m 25 Y s 1921 297 m 2 X s 1938 297 m 1 X s 3 lw 1930 297 m20 6 lw 1948 352 m 71 Y s 1948 438 m 71 Y s 1939 431 m 2 X s 1956 431 m 1 X s 3 lw 1948 431 m20 6 lw 1966 324 m 58 Y s 1966 398 m 58 Y s 1957 390 m 2 X s 1974 390 m 1 X
 s 3 lw 1966 390 m20 6 lw 1984 325 m 65 Y s 1984 405 m 65 Y s 1975 397 m 2 X s 1992 397 m 1 X s 3 lw 1984 397 m20 6 lw 2002 270 m 33 Y s 2002 318 m 33 Y s 1993 310 m 1 X s 2010 310 m 1 X s 3 lw 2002 310 m20 6 lw 2020 371 m 90 Y s 2020 477 m 90 Y s
 2011 469 m 1 X s 2028 469 m 1 X s 3 lw 2020 469 m20 6 lw 2038 344 m 85 Y s 2038 444 m 85 Y s 2029 436 m 1 X s 2045 436 m 2 X s 3 lw 2038 436 m20 6 lw 2056 308 m 62 Y s 2056 385 m 62 Y s 2047 377 m 1 X s 2063 377 m 2 X s 3 lw 2056 377 m20 6 lw 2074
 257 m 32 Y s 2074 305 m 32 Y s 2065 297 m 1 X s 2081 297 m 2 X s 3 lw 2074 297 m20 6 lw 2092 414 m 173 Y s 2092 602 m 12 Y s 2083 594 m 1 X s 2099 594 m 2 X s 3 lw 2092 594 m20 6 lw 2110 259 m 37 Y s 2110 311 m 36 Y s 2101 303 m 1 X s 2117 303 m 2 X
 s 3 lw 2110 303 m20 6 lw 2127 292 m 56 Y s 2127 363 m 57 Y s 2119 356 m 1 X s 2135 356 m 1 X s 3 lw 2127 356 m20 6 lw black 363 368 m 1791 X s
 gr  gr showpage
end
%%EOF
