%!PS-Adobe-3.0 EPSF-3.0
%%BoundingBox: (atend)
%%LanguageLevel: 2
%%Creator: Grace-5.1.22
%%CreationDate: Tue Mar 26 12:47:28 2013
%%DocumentData: Clean8Bit
%%Orientation: Portrait
%%Title: /home/pcl302a/heinemey/plot/grace/2012/lhc-higgs-br/mhmodm_tb10_BR-A0.grace
%%For: heinemey
%%DocumentNeededResources: (atend)
%%EndComments
%%BeginProlog
/m {moveto} def
/l {lineto} def
/s {stroke} def
/n {newpath} def
/c {closepath} def
/RL {rlineto} def
/SLW {setlinewidth} def
/GS {gsave} def
/GR {grestore} def
/SC {setcolor} def
/SGRY {setgray} def
/SRGB {setrgbcolor} def
/SD {setdash} def
/SLC {setlinecap} def
/SLJ {setlinejoin} def
/SCS {setcolorspace} def
/FFSF {findfont setfont} def
/CC {concat} def
/PXL {n m 0 0 RL s} def
/Color0 {1.0000 1.0000 1.0000} def
/Color1 {0.0000 0.0000 0.0000} def
/Color2 {1.0000 0.0000 0.0000} def
/Color3 {0.0000 1.0000 0.0000} def
/Color4 {0.0000 0.0000 1.0000} def
/Color5 {1.0000 1.0000 0.0000} def
/Color6 {0.7373 0.5608 0.5608} def
/Color7 {0.8627 0.8627 0.8627} def
/Color8 {0.5804 0.0000 0.8275} def
/Color9 {0.0000 1.0000 1.0000} def
/Color10 {1.0000 0.0000 1.0000} def
/Color11 {1.0000 0.6471 0.0000} def
/Color12 {0.4471 0.1294 0.7373} def
/Color13 {0.4039 0.0275 0.2824} def
/Color14 {0.2510 0.8784 0.8157} def
/Color15 {0.0000 0.5451 0.0000} def
/Color16 {0.7529 0.7529 0.7529} def
/Color17 {0.5059 0.5059 0.5059} def
/Color18 {0.2588 0.2588 0.2588} def
/PTRN {
 /pat_bits exch def 
 <<
  /PaintType 2
  /PatternType 1 /TilingType 1
  /BBox[0 0 16 16]
  /XStep 16 /YStep 16
  /PaintProc {
   pop
   16 16 true [-1 0 0 -1 16 16] pat_bits imagemask
  }
 >>
 [0.0016 0 0 0.0016 0 0]
 makepattern
} def
/Pattern0 {<0000000000000000000000000000000000000000000000000000000000000000> PTRN} bind def
/Pattern1 {<ffffffffffffffffffffffffffffffffffffffffffffffffffffffffffffffff> PTRN} bind def
/Pattern2 {<eeeeffffbbbbffffeeeeffffbbbbffffeeeeffffbbbbffffeeeeffffbbbbffff> PTRN} bind def
/Pattern3 {<eeeebbbbeeeebbbbeeeebbbbeeeebbbbeeeebbbbeeeebbbbeeeebbbbeeeebbbb> PTRN} bind def
/Pattern4 {<5555aaaa5555aaaa5555aaaa5555aaaa5555aaaa5555aaaa5555aaaa5555aaaa> PTRN} bind def
/Pattern5 {<1111444411114444111144441111444411114444111144441111444411114444> PTRN} bind def
/Pattern6 {<1111000044440000111100004444000011110000444400001111000044440000> PTRN} bind def
/Pattern7 {<1010000000000000010100000000000010100000000000000101000000000000> PTRN} bind def
/Pattern8 {<0000000000000000000000000000000000000000000000000000000000000000> PTRN} bind def
/Pattern9 {<1e1e0f0f8787c3c3e1e1f0f078783c3c1e1e0f0f8787c3c3e1e1f0f078783c3c> PTRN} bind def
/Pattern10 {<7878f0f0e1e1c3c387870f0f1e1e3c3c7878f0f0e1e1c3c387870f0f1e1e3c3c> PTRN} bind def
/Pattern11 {<3333333333333333333333333333333333333333333333333333333333333333> PTRN} bind def
/Pattern12 {<ffffffff00000000ffffffff00000000ffffffff00000000ffffffff00000000> PTRN} bind def
/Pattern13 {<8181424224241818181824244242818181814242242418181818242442428181> PTRN} bind def
/Pattern14 {<8080404020201010080804040202010180804040202010100808040402020101> PTRN} bind def
/Pattern15 {<0101020204040808101020204040808001010202040408081010202040408080> PTRN} bind def
/Pattern16 {<2222222222222222222222222222222222222222222222222222222222222222> PTRN} bind def
/Pattern17 {<0000ffff000000000000ffff000000000000ffff000000000000ffff00000000> PTRN} bind def
/Pattern18 {<2222ffff222222222222ffff222222222222ffff222222222222ffff22222222> PTRN} bind def
/Pattern19 {<ffffffff33333333ffffffff33333333ffffffff33333333ffffffff33333333> PTRN} bind def
/Pattern20 {<0f0f0f0f0f0f0f0ff0f0f0f0f0f0f0f00f0f0f0f0f0f0f0ff0f0f0f0f0f0f0f0> PTRN} bind def
/Pattern21 {<ff00ff00ff00ff00ff00ff00ff00ff0000ff00ff00ff00ff00ff00ff00ff00ff> PTRN} bind def
/Pattern22 {<8001800180018001800180018001ffffffff8001800180018001800180018001> PTRN} bind def
/Pattern23 {<c003c003c003c003c003c003ffffffffffffffffc003c003c003c003c003c003> PTRN} bind def
/Pattern24 {<040404040404ffff404040404040ffff040404040404ffff404040404040ffff> PTRN} bind def
/Pattern25 {<180018001800180018001800ffffffff001800180018001800180018ffffffff> PTRN} bind def
/Pattern26 {<1111b8b87c7c3a3a1111a3a3c7c78b8b1111b8b87c7c3a3a1111a3a3c7c78b8b> PTRN} bind def
/Pattern27 {<101010102828c7c70101010182827c7c101010102828c7c70101010182827c7c> PTRN} bind def
/Pattern28 {<1c1c121211112121c1c12121111112121c1c121211112121c1c1212111111212> PTRN} bind def
/Pattern29 {<3e3e414180808080e3e31414080808083e3e414180808080e3e3141408080808> PTRN} bind def
/Pattern30 {<4848888884848383848488884848383848488888848483838484888848483838> PTRN} bind def
/Pattern31 {<03030404080808080c0c12122121c0c003030404080808080c0c12122121c0c0> PTRN} bind def
/ellipsedict 8 dict def
ellipsedict /mtrx matrix put
/EARC {
 ellipsedict begin
  /endangle exch def
  /startangle exch def
  /yrad exch def
  /xrad exch def
  /y exch def
  /x exch def
  /savematrix mtrx currentmatrix def
  x y translate
  xrad yrad scale
  0 0 1 startangle endangle arc
  savematrix setmatrix
 end
} def
/TL {
  /kcomp exch def
  /linewidth exch def
  /offset exch def
  GS
  0 offset rmoveto
  linewidth SLW
  dup stringwidth exch kcomp add exch RL s
  GR
} def
/KINIT
{
 /kvector exch def
 /kid 0 def
} def
/KPROC
{
 pop pop
 kvector kid get
 0 rmoveto
 /kid 1 kid add def
} def
/DefEncoding [
 /.notdef
 /.notdef
 /.notdef
 /.notdef
 /.notdef
 /.notdef
 /.notdef
 /.notdef
 /.notdef
 /.notdef
 /.notdef
 /.notdef
 /.notdef
 /.notdef
 /.notdef
 /.notdef
 /.notdef
 /.notdef
 /.notdef
 /.notdef
 /.notdef
 /.notdef
 /.notdef
 /.notdef
 /.notdef
 /.notdef
 /.notdef
 /.notdef
 /.notdef
 /.notdef
 /.notdef
 /.notdef
 /space
 /exclam
 /quotedbl
 /numbersign
 /dollar
 /percent
 /ampersand
 /quoteright
 /parenleft
 /parenright
 /asterisk
 /plus
 /comma
 /hyphen
 /period
 /slash
 /zero
 /one
 /two
 /three
 /four
 /five
 /six
 /seven
 /eight
 /nine
 /colon
 /semicolon
 /less
 /equal
 /greater
 /question
 /at
 /A
 /B
 /C
 /D
 /E
 /F
 /G
 /H
 /I
 /J
 /K
 /L
 /M
 /N
 /O
 /P
 /Q
 /R
 /S
 /T
 /U
 /V
 /W
 /X
 /Y
 /Z
 /bracketleft
 /backslash
 /bracketright
 /asciicircum
 /underscore
 /grave
 /a
 /b
 /c
 /d
 /e
 /f
 /g
 /h
 /i
 /j
 /k
 /l
 /m
 /n
 /o
 /p
 /q
 /r
 /s
 /t
 /u
 /v
 /w
 /x
 /y
 /z
 /braceleft
 /bar
 /braceright
 /asciitilde
 /.notdef
 /.notdef
 /.notdef
 /.notdef
 /.notdef
 /.notdef
 /.notdef
 /.notdef
 /.notdef
 /.notdef
 /.notdef
 /.notdef
 /.notdef
 /.notdef
 /.notdef
 /.notdef
 /.notdef
 /.notdef
 /.notdef
 /.notdef
 /.notdef
 /.notdef
 /.notdef
 /.notdef
 /.notdef
 /.notdef
 /.notdef
 /.notdef
 /.notdef
 /.notdef
 /.notdef
 /.notdef
 /.notdef
 /space
 /exclamdown
 /cent
 /sterling
 /currency
 /yen
 /brokenbar
 /section
 /dieresis
 /copyright
 /ordfeminine
 /guillemotleft
 /logicalnot
 /hyphen
 /registered
 /macron
 /degree
 /plusminus
 /twosuperior
 /threesuperior
 /acute
 /mu
 /paragraph
 /periodcentered
 /cedilla
 /onesuperior
 /ordmasculine
 /guillemotright
 /onequarter
 /onehalf
 /threequarters
 /questiondown
 /Agrave
 /Aacute
 /Acircumflex
 /Atilde
 /Adieresis
 /Aring
 /AE
 /Ccedilla
 /Egrave
 /Eacute
 /Ecircumflex
 /Edieresis
 /Igrave
 /Iacute
 /Icircumflex
 /Idieresis
 /Eth
 /Ntilde
 /Ograve
 /Oacute
 /Ocircumflex
 /Otilde
 /Odieresis
 /multiply
 /Oslash
 /Ugrave
 /Uacute
 /Ucircumflex
 /Udieresis
 /Yacute
 /Thorn
 /germandbls
 /agrave
 /aacute
 /acircumflex
 /atilde
 /adieresis
 /aring
 /ae
 /ccedilla
 /egrave
 /eacute
 /ecircumflex
 /edieresis
 /igrave
 /iacute
 /icircumflex
 /idieresis
 /eth
 /ntilde
 /ograve
 /oacute
 /ocircumflex
 /otilde
 /odieresis
 /divide
 /oslash
 /ugrave
 /uacute
 /ucircumflex
 /udieresis
 /yacute
 /thorn
 /ydieresis
] def
%%EndProlog
%%BeginSetup
%%EndSetup
612.00 612.00 scale
[/DeviceRGB] SCS
Color2 SC
[] 0 SD
0.0045 SLW
0 SLC
0 SLJ
n
0.5075 0.1499 m
0.5076 0.1506 l
0.5092 0.1574 l
0.5108 0.1643 l
0.5124 0.1712 l
0.5139 0.1782 l
0.5155 0.1853 l
0.5171 0.1926 l
0.5186 0.1999 l
0.5202 0.2074 l
0.5218 0.2151 l
0.5233 0.2229 l
0.5249 0.2310 l
0.5265 0.2392 l
0.5280 0.2478 l
0.5296 0.2566 l
0.5312 0.2659 l
0.5327 0.2755 l
0.5343 0.2857 l
0.5359 0.2964 l
0.5375 0.3079 l
0.5390 0.3204 l
0.5406 0.3340 l
0.5422 0.3492 l
0.5437 0.3666 l
0.5453 0.3874 l
0.5469 0.4199 l
0.5484 0.4598 l
0.5502 0.5060 l
0.5516 0.5440 l
0.5531 0.5820 l
0.5547 0.6119 l
0.5563 0.6301 l
0.5578 0.6332 l
0.5594 0.6359 l
0.5610 0.6382 l
0.5625 0.6402 l
0.5641 0.6420 l
0.5657 0.6436 l
0.5673 0.6451 l
0.5688 0.6464 l
0.5704 0.6476 l
0.5720 0.6488 l
0.5735 0.6498 l
0.5751 0.6508 l
0.5767 0.6517 l
0.5782 0.6526 l
0.5798 0.6534 l
0.5814 0.6541 l
0.5829 0.6548 l
0.5845 0.6555 l
0.5861 0.6561 l
0.5876 0.6567 l
0.5892 0.6573 l
0.5908 0.6578 l
0.5924 0.6583 l
0.5939 0.6588 l
0.5955 0.6593 l
0.5971 0.6597 l
0.5986 0.6602 l
0.6002 0.6606 l
0.6018 0.6610 l
0.6033 0.6613 l
0.6049 0.6617 l
0.6065 0.6620 l
0.6080 0.6624 l
0.6096 0.6627 l
0.6112 0.6630 l
0.6127 0.6633 l
0.6143 0.6635 l
0.6159 0.6638 l
0.6175 0.6641 l
0.6190 0.6643 l
0.6206 0.6646 l
0.6222 0.6648 l
0.6237 0.6650 l
0.6253 0.6652 l
0.6269 0.6654 l
0.6284 0.6656 l
0.6300 0.6658 l
0.6316 0.6660 l
0.6331 0.6662 l
0.6347 0.6664 l
0.6363 0.6666 l
0.6378 0.6667 l
0.6394 0.6669 l
0.6410 0.6670 l
0.6425 0.6672 l
0.6441 0.6673 l
0.6457 0.6675 l
0.6473 0.6676 l
0.6488 0.6677 l
0.6504 0.6679 l
0.6520 0.6680 l
0.6535 0.6681 l
0.6551 0.6682 l
0.6567 0.6683 l
0.6582 0.6684 l
0.6598 0.6685 l
0.6614 0.6686 l
0.6629 0.6686 l
0.6645 0.6687 l
0.6661 0.6686 l
0.6676 0.6686 l
0.6692 0.6686 l
0.6708 0.6686 l
0.6724 0.6686 l
0.6739 0.6686 l
0.6755 0.6686 l
0.6771 0.6686 l
0.6786 0.6686 l
0.6802 0.6685 l
0.6818 0.6685 l
0.6833 0.6685 l
0.6849 0.6685 l
0.6865 0.6685 l
0.6880 0.6685 l
0.6896 0.6684 l
0.6912 0.6684 l
0.6927 0.6684 l
0.6943 0.6684 l
0.6959 0.6683 l
0.6975 0.6683 l
0.6990 0.6683 l
0.7006 0.6683 l
0.7022 0.6682 l
0.7037 0.6682 l
0.7053 0.6681 l
0.7069 0.6681 l
0.7084 0.6681 l
0.7100 0.6680 l
0.7116 0.6680 l
0.7131 0.6679 l
0.7147 0.6679 l
0.7163 0.6679 l
0.7178 0.6678 l
0.7194 0.6678 l
0.7210 0.6677 l
0.7225 0.6677 l
0.7241 0.6676 l
0.7257 0.6676 l
0.7273 0.6675 l
0.7288 0.6675 l
0.7304 0.6674 l
0.7320 0.6673 l
0.7335 0.6673 l
0.7351 0.6672 l
0.7367 0.6672 l
0.7382 0.6671 l
0.7398 0.6671 l
0.7414 0.6670 l
0.7429 0.6670 l
0.7445 0.6669 l
0.7461 0.6668 l
0.7476 0.6668 l
0.7492 0.6667 l
0.7508 0.6667 l
0.7524 0.6666 l
0.7539 0.6665 l
0.7555 0.6665 l
0.7571 0.6664 l
0.7586 0.6663 l
0.7602 0.6663 l
0.7618 0.6662 l
0.7633 0.6661 l
0.7649 0.6661 l
0.7665 0.6660 l
0.7680 0.6659 l
0.7696 0.6658 l
0.7712 0.6658 l
0.7727 0.6657 l
0.7743 0.6656 l
0.7759 0.6655 l
0.7775 0.6654 l
0.7790 0.6654 l
0.7806 0.6653 l
0.7822 0.6652 l
0.7837 0.6651 l
0.7853 0.6650 l
0.7869 0.6649 l
0.7884 0.6649 l
0.7900 0.6648 l
0.7916 0.6647 l
0.7931 0.6646 l
0.7947 0.6645 l
0.7963 0.6644 l
0.7978 0.6644 l
0.7994 0.6643 l
0.8010 0.6642 l
0.8025 0.6641 l
0.8041 0.6640 l
0.8057 0.6639 l
0.8073 0.6638 l
0.8088 0.6637 l
0.8104 0.6637 l
0.8120 0.6636 l
0.8135 0.6635 l
0.8151 0.6634 l
0.8167 0.6633 l
0.8182 0.6632 l
0.8198 0.6631 l
0.8214 0.6630 l
0.8229 0.6630 l
0.8245 0.6629 l
0.8261 0.6628 l
0.8276 0.6627 l
0.8292 0.6626 l
0.8308 0.6625 l
0.8324 0.6624 l
0.8339 0.6623 l
0.8355 0.6623 l
0.8371 0.6622 l
0.8386 0.6621 l
0.8402 0.6620 l
0.8418 0.6619 l
0.8433 0.6618 l
0.8449 0.6617 l
0.8465 0.6617 l
0.8480 0.6616 l
0.8496 0.6615 l
0.8512 0.6614 l
0.8527 0.6602 l
0.8543 0.6593 l
0.8559 0.6587 l
0.8575 0.6582 l
0.8590 0.6578 l
0.8606 0.6574 l
0.8622 0.6570 l
0.8637 0.6566 l
0.8653 0.6563 l
0.8669 0.6560 l
0.8684 0.6557 l
0.8700 0.6554 l
0.8716 0.6551 l
0.8731 0.6549 l
0.8747 0.6546 l
0.8763 0.6543 l
0.8778 0.6541 l
0.8794 0.6539 l
0.8810 0.6536 l
0.8825 0.6534 l
0.8841 0.6532 l
0.8857 0.6530 l
0.8873 0.6528 l
0.8888 0.6525 l
0.8904 0.6523 l
0.8920 0.6521 l
0.8935 0.6519 l
0.8951 0.6518 l
0.8967 0.6516 l
0.8982 0.6514 l
0.8998 0.6512 l
0.9014 0.6510 l
0.9029 0.6508 l
0.9045 0.6507 l
0.9061 0.6505 l
0.9076 0.6503 l
0.9092 0.6501 l
0.9108 0.6500 l
0.9124 0.6498 l
0.9139 0.6497 l
0.9155 0.6495 l
0.9171 0.6493 l
0.9186 0.6492 l
0.9202 0.6490 l
0.9218 0.6489 l
0.9233 0.6487 l
0.9249 0.6486 l
0.9265 0.6484 l
0.9280 0.6483 l
0.9296 0.6481 l
0.9312 0.6480 l
0.9327 0.6478 l
0.9343 0.6477 l
0.9359 0.6476 l
0.9375 0.6474 l
0.9390 0.6473 l
0.9406 0.6472 l
0.9422 0.6470 l
0.9437 0.6469 l
0.9453 0.6468 l
0.9469 0.6466 l
0.9484 0.6465 l
0.9500 0.6464 l
s
[/DeviceRGB] SCS
Color3 SC
n
0.1500 0.8919 m
0.1516 0.8919 l
0.1531 0.8918 l
0.1547 0.8918 l
0.1563 0.8918 l
0.1578 0.8918 l
0.1594 0.8918 l
0.1610 0.8918 l
0.1625 0.8918 l
0.1641 0.8917 l
0.1657 0.8917 l
0.1673 0.8917 l
0.1688 0.8917 l
0.1704 0.8917 l
0.1720 0.8917 l
0.1735 0.8917 l
0.1751 0.8917 l
0.1767 0.8916 l
0.1782 0.8916 l
0.1798 0.8916 l
0.1814 0.8916 l
0.1829 0.8916 l
0.1845 0.8916 l
0.1861 0.8916 l
0.1876 0.8916 l
0.1892 0.8915 l
0.1908 0.8915 l
0.1924 0.8915 l
0.1939 0.8915 l
0.1955 0.8915 l
0.1971 0.8915 l
0.1986 0.8915 l
0.2002 0.8915 l
0.2018 0.8914 l
0.2033 0.8914 l
0.2049 0.8914 l
0.2065 0.8914 l
0.2080 0.8914 l
0.2096 0.8914 l
0.2112 0.8914 l
0.2127 0.8914 l
0.2143 0.8914 l
0.2159 0.8914 l
0.2175 0.8913 l
0.2190 0.8913 l
0.2206 0.8913 l
0.2222 0.8913 l
0.2237 0.8913 l
0.2253 0.8913 l
0.2269 0.8913 l
0.2284 0.8913 l
0.2300 0.8913 l
0.2316 0.8913 l
0.2331 0.8912 l
0.2347 0.8912 l
0.2363 0.8912 l
0.2378 0.8912 l
0.2394 0.8912 l
0.2410 0.8912 l
0.2425 0.8912 l
0.2441 0.8912 l
0.2457 0.8912 l
0.2473 0.8912 l
0.2488 0.8912 l
0.2504 0.8911 l
0.2520 0.8911 l
0.2535 0.8911 l
0.2551 0.8911 l
0.2567 0.8911 l
0.2582 0.8911 l
0.2598 0.8911 l
0.2614 0.8911 l
0.2629 0.8911 l
0.2645 0.8911 l
0.2661 0.8911 l
0.2676 0.8910 l
0.2692 0.8910 l
0.2708 0.8910 l
0.2724 0.8910 l
0.2739 0.8910 l
0.2755 0.8910 l
0.2771 0.8910 l
0.2786 0.8910 l
0.2802 0.8899 l
0.2818 0.8890 l
0.2833 0.8884 l
0.2849 0.8879 l
0.2865 0.8875 l
0.2880 0.8872 l
0.2896 0.8868 l
0.2912 0.8865 l
0.2927 0.8863 l
0.2943 0.8860 l
0.2959 0.8858 l
0.2975 0.8856 l
0.2990 0.8853 l
0.3006 0.8851 l
0.3022 0.8850 l
0.3037 0.8848 l
0.3053 0.8846 l
0.3069 0.8844 l
0.3084 0.8843 l
0.3100 0.8841 l
0.3116 0.8839 l
0.3131 0.8838 l
0.3147 0.8837 l
0.3163 0.8835 l
0.3178 0.8834 l
0.3194 0.8832 l
0.3210 0.8831 l
0.3225 0.8830 l
0.3241 0.8829 l
0.3257 0.8828 l
0.3273 0.8826 l
0.3288 0.8825 l
0.3304 0.8824 l
0.3320 0.8823 l
0.3335 0.8822 l
0.3351 0.8821 l
0.3367 0.8820 l
0.3382 0.8819 l
0.3398 0.8818 l
0.3414 0.8817 l
0.3429 0.8816 l
0.3445 0.8815 l
0.3461 0.8814 l
0.3476 0.8814 l
0.3492 0.8813 l
0.3508 0.8812 l
0.3524 0.8811 l
0.3539 0.8810 l
0.3555 0.8809 l
0.3571 0.8808 l
0.3586 0.8808 l
0.3602 0.8807 l
0.3618 0.8806 l
0.3633 0.8805 l
0.3649 0.8804 l
0.3665 0.8803 l
0.3680 0.8803 l
0.3696 0.8802 l
0.3712 0.8801 l
0.3727 0.8800 l
0.3743 0.8800 l
0.3759 0.8799 l
0.3775 0.8798 l
0.3790 0.8780 l
0.3806 0.8760 l
0.3822 0.8747 l
0.3837 0.8737 l
0.3853 0.8729 l
0.3869 0.8721 l
0.3884 0.8714 l
0.3900 0.8708 l
0.3916 0.8702 l
0.3931 0.8697 l
0.3947 0.8692 l
0.3963 0.8687 l
0.3978 0.8682 l
0.3994 0.8678 l
0.4010 0.8674 l
0.4025 0.8670 l
0.4041 0.8666 l
0.4057 0.8662 l
0.4073 0.8659 l
0.4088 0.8655 l
0.4104 0.8652 l
0.4120 0.8649 l
0.4135 0.8645 l
0.4151 0.8642 l
0.4167 0.8639 l
0.4182 0.8636 l
0.4198 0.8634 l
0.4214 0.8631 l
0.4229 0.8628 l
0.4245 0.8625 l
0.4261 0.8623 l
0.4276 0.8620 l
0.4292 0.8618 l
0.4308 0.8615 l
0.4324 0.8613 l
0.4339 0.8611 l
0.4355 0.8608 l
0.4371 0.8606 l
0.4386 0.8604 l
0.4402 0.8602 l
0.4418 0.8600 l
0.4433 0.8598 l
0.4449 0.8596 l
0.4465 0.8594 l
0.4480 0.8592 l
0.4496 0.8590 l
0.4512 0.8588 l
0.4527 0.8586 l
0.4543 0.8584 l
0.4559 0.8582 l
0.4575 0.8581 l
0.4590 0.8579 l
0.4606 0.8577 l
0.4622 0.8504 l
0.4637 0.8465 l
0.4653 0.8437 l
0.4669 0.8415 l
0.4684 0.8396 l
0.4700 0.8380 l
0.4716 0.8365 l
0.4731 0.8351 l
0.4747 0.8339 l
0.4763 0.8327 l
0.4778 0.8312 l
0.4794 0.8294 l
0.4810 0.8280 l
0.4825 0.8268 l
0.4841 0.8257 l
0.4857 0.8246 l
0.4873 0.8236 l
0.4888 0.8227 l
0.4904 0.8218 l
0.4920 0.8209 l
0.4935 0.8201 l
0.4951 0.8193 l
0.4967 0.8186 l
0.4982 0.8178 l
0.4998 0.8171 l
0.5014 0.8164 l
0.5029 0.8158 l
0.5045 0.8151 l
0.5061 0.8145 l
0.5076 0.8139 l
0.5092 0.8133 l
0.5108 0.8128 l
0.5124 0.8122 l
0.5139 0.8117 l
0.5155 0.8111 l
0.5171 0.8106 l
0.5186 0.8101 l
0.5202 0.8096 l
0.5218 0.8091 l
0.5233 0.8087 l
0.5249 0.8082 l
0.5265 0.8077 l
0.5280 0.8073 l
0.5296 0.8069 l
0.5312 0.8064 l
0.5327 0.8060 l
0.5343 0.8056 l
0.5359 0.8052 l
0.5375 0.8048 l
0.5390 0.8044 l
0.5406 0.8040 l
0.5422 0.8036 l
0.5437 0.8032 l
0.5453 0.8028 l
0.5469 0.8024 l
0.5484 0.8019 l
0.5502 0.7996 l
0.5516 0.7985 l
0.5531 0.7974 l
0.5547 0.7961 l
0.5563 0.7950 l
0.5578 0.7945 l
0.5594 0.7940 l
0.5610 0.7935 l
0.5625 0.7930 l
0.5641 0.7925 l
0.5657 0.7921 l
0.5673 0.7917 l
0.5688 0.7913 l
0.5704 0.7909 l
0.5720 0.7905 l
0.5735 0.7901 l
0.5751 0.7897 l
0.5767 0.7894 l
0.5782 0.7890 l
0.5798 0.7886 l
0.5814 0.7883 l
0.5829 0.7880 l
0.5845 0.7876 l
0.5861 0.7873 l
0.5876 0.7870 l
0.5892 0.7867 l
0.5908 0.7864 l
0.5924 0.7861 l
0.5939 0.7858 l
0.5955 0.7855 l
0.5971 0.7852 l
0.5986 0.7850 l
0.6002 0.7847 l
0.6018 0.7844 l
0.6033 0.7841 l
0.6049 0.7839 l
0.6065 0.7836 l
0.6080 0.7834 l
0.6096 0.7831 l
0.6112 0.7829 l
0.6127 0.7826 l
0.6143 0.7824 l
0.6159 0.7821 l
0.6175 0.7819 l
0.6190 0.7817 l
0.6206 0.7814 l
0.6222 0.7812 l
0.6237 0.7810 l
0.6253 0.7808 l
0.6269 0.7805 l
0.6284 0.7803 l
0.6300 0.7801 l
0.6316 0.7799 l
0.6331 0.7797 l
0.6347 0.7795 l
0.6363 0.7793 l
0.6378 0.7791 l
0.6394 0.7789 l
0.6410 0.7787 l
0.6425 0.7785 l
0.6441 0.7783 l
0.6457 0.7781 l
0.6473 0.7779 l
0.6488 0.7777 l
0.6504 0.7775 l
0.6520 0.7774 l
0.6535 0.7772 l
0.6551 0.7770 l
0.6567 0.7768 l
0.6582 0.7766 l
0.6598 0.7764 l
0.6614 0.7762 l
0.6629 0.7760 l
0.6645 0.7758 l
0.6661 0.7755 l
0.6676 0.7752 l
0.6692 0.7749 l
0.6708 0.7747 l
0.6724 0.7744 l
0.6739 0.7742 l
0.6755 0.7740 l
0.6771 0.7737 l
0.6786 0.7735 l
0.6802 0.7732 l
0.6818 0.7730 l
0.6833 0.7728 l
0.6849 0.7725 l
0.6865 0.7723 l
0.6880 0.7721 l
0.6896 0.7719 l
0.6912 0.7716 l
0.6927 0.7714 l
0.6943 0.7712 l
0.6959 0.7710 l
0.6975 0.7708 l
0.6990 0.7705 l
0.7006 0.7703 l
0.7022 0.7701 l
0.7037 0.7699 l
0.7053 0.7697 l
0.7069 0.7695 l
0.7084 0.7692 l
0.7100 0.7690 l
0.7116 0.7688 l
0.7131 0.7686 l
0.7147 0.7684 l
0.7163 0.7682 l
0.7178 0.7680 l
0.7194 0.7678 l
0.7210 0.7676 l
0.7225 0.7674 l
0.7241 0.7672 l
0.7257 0.7670 l
0.7273 0.7668 l
0.7288 0.7666 l
0.7304 0.7664 l
0.7320 0.7662 l
0.7335 0.7660 l
0.7351 0.7658 l
0.7367 0.7656 l
0.7382 0.7654 l
0.7398 0.7652 l
0.7414 0.7650 l
0.7429 0.7648 l
0.7445 0.7646 l
0.7461 0.7645 l
0.7476 0.7643 l
0.7492 0.7641 l
0.7508 0.7639 l
0.7524 0.7637 l
0.7539 0.7635 l
0.7555 0.7634 l
0.7571 0.7632 l
0.7586 0.7630 l
0.7602 0.7628 l
0.7618 0.7626 l
0.7633 0.7624 l
0.7649 0.7623 l
0.7665 0.7621 l
0.7680 0.7619 l
0.7696 0.7617 l
0.7712 0.7615 l
0.7727 0.7613 l
0.7743 0.7612 l
0.7759 0.7610 l
0.7775 0.7608 l
0.7790 0.7606 l
0.7806 0.7604 l
0.7822 0.7602 l
0.7837 0.7601 l
0.7853 0.7599 l
0.7869 0.7597 l
0.7884 0.7595 l
0.7900 0.7593 l
0.7916 0.7592 l
0.7931 0.7590 l
0.7947 0.7588 l
0.7963 0.7586 l
0.7978 0.7584 l
0.7994 0.7583 l
0.8010 0.7581 l
0.8025 0.7579 l
0.8041 0.7577 l
0.8057 0.7576 l
0.8073 0.7574 l
0.8088 0.7572 l
0.8104 0.7571 l
0.8120 0.7569 l
0.8135 0.7567 l
0.8151 0.7565 l
0.8167 0.7564 l
0.8182 0.7562 l
0.8198 0.7560 l
0.8214 0.7559 l
0.8229 0.7557 l
0.8245 0.7556 l
0.8261 0.7554 l
0.8276 0.7552 l
0.8292 0.7551 l
0.8308 0.7549 l
0.8324 0.7547 l
0.8339 0.7546 l
0.8355 0.7544 l
0.8371 0.7543 l
0.8386 0.7541 l
0.8402 0.7540 l
0.8418 0.7538 l
0.8433 0.7536 l
0.8449 0.7535 l
0.8465 0.7533 l
0.8480 0.7532 l
0.8496 0.7530 l
0.8512 0.7529 l
0.8527 0.7516 l
0.8543 0.7507 l
0.8559 0.7500 l
0.8575 0.7494 l
0.8590 0.7489 l
0.8606 0.7485 l
0.8622 0.7480 l
0.8637 0.7476 l
0.8653 0.7472 l
0.8669 0.7468 l
0.8684 0.7465 l
0.8700 0.7461 l
0.8716 0.7458 l
0.8731 0.7455 l
0.8747 0.7451 l
0.8763 0.7448 l
0.8778 0.7445 l
0.8794 0.7442 l
0.8810 0.7440 l
0.8825 0.7437 l
0.8841 0.7434 l
0.8857 0.7431 l
0.8873 0.7429 l
0.8888 0.7426 l
0.8904 0.7423 l
0.8920 0.7421 l
0.8935 0.7418 l
0.8951 0.7416 l
0.8967 0.7413 l
0.8982 0.7411 l
0.8998 0.7409 l
0.9014 0.7406 l
0.9029 0.7404 l
0.9045 0.7402 l
0.9061 0.7400 l
0.9076 0.7397 l
0.9092 0.7395 l
0.9108 0.7393 l
0.9124 0.7391 l
0.9139 0.7389 l
0.9155 0.7387 l
0.9171 0.7385 l
0.9186 0.7383 l
0.9202 0.7381 l
0.9218 0.7379 l
0.9233 0.7377 l
0.9249 0.7375 l
0.9265 0.7373 l
0.9280 0.7371 l
0.9296 0.7369 l
0.9312 0.7367 l
0.9327 0.7365 l
0.9343 0.7363 l
0.9359 0.7362 l
0.9375 0.7360 l
0.9390 0.7358 l
0.9406 0.7356 l
0.9422 0.7354 l
0.9437 0.7353 l
0.9453 0.7351 l
0.9469 0.7349 l
0.9484 0.7348 l
0.9500 0.7346 l
s
[/DeviceRGB] SCS
Color4 SC
n
0.1500 0.7060 m
0.1516 0.7061 l
0.1531 0.7063 l
0.1547 0.7065 l
0.1563 0.7066 l
0.1578 0.7068 l
0.1594 0.7070 l
0.1610 0.7071 l
0.1625 0.7073 l
0.1641 0.7074 l
0.1657 0.7076 l
0.1673 0.7077 l
0.1688 0.7079 l
0.1704 0.7080 l
0.1720 0.7082 l
0.1735 0.7083 l
0.1751 0.7084 l
0.1767 0.7086 l
0.1782 0.7087 l
0.1798 0.7089 l
0.1814 0.7090 l
0.1829 0.7091 l
0.1845 0.7092 l
0.1861 0.7094 l
0.1876 0.7095 l
0.1892 0.7096 l
0.1908 0.7098 l
0.1924 0.7099 l
0.1939 0.7100 l
0.1955 0.7101 l
0.1971 0.7102 l
0.1986 0.7104 l
0.2002 0.7105 l
0.2018 0.7106 l
0.2033 0.7107 l
0.2049 0.7108 l
0.2065 0.7109 l
0.2080 0.7110 l
0.2096 0.7112 l
0.2112 0.7113 l
0.2127 0.7114 l
0.2143 0.7115 l
0.2159 0.7116 l
0.2175 0.7117 l
0.2190 0.7118 l
0.2206 0.7119 l
0.2222 0.7120 l
0.2237 0.7121 l
0.2253 0.7122 l
0.2269 0.7123 l
0.2284 0.7124 l
0.2300 0.7125 l
0.2316 0.7126 l
0.2331 0.7127 l
0.2347 0.7128 l
0.2363 0.7129 l
0.2378 0.7130 l
0.2394 0.7131 l
0.2410 0.7131 l
0.2425 0.7132 l
0.2441 0.7133 l
0.2457 0.7134 l
0.2473 0.7135 l
0.2488 0.7136 l
0.2504 0.7137 l
0.2520 0.7138 l
0.2535 0.7138 l
0.2551 0.7139 l
0.2567 0.7140 l
0.2582 0.7141 l
0.2598 0.7142 l
0.2614 0.7143 l
0.2629 0.7143 l
0.2645 0.7144 l
0.2661 0.7145 l
0.2676 0.7146 l
0.2692 0.7147 l
0.2708 0.7147 l
0.2724 0.7148 l
0.2739 0.7149 l
0.2755 0.7150 l
0.2771 0.7150 l
0.2786 0.7151 l
0.2802 0.7141 l
0.2818 0.7133 l
0.2833 0.7128 l
0.2849 0.7124 l
0.2865 0.7121 l
0.2880 0.7118 l
0.2896 0.7116 l
0.2912 0.7114 l
0.2927 0.7112 l
0.2943 0.7110 l
0.2959 0.7109 l
0.2975 0.7107 l
0.2990 0.7106 l
0.3006 0.7105 l
0.3022 0.7104 l
0.3037 0.7103 l
0.3053 0.7102 l
0.3069 0.7101 l
0.3084 0.7100 l
0.3100 0.7099 l
0.3116 0.7098 l
0.3131 0.7098 l
0.3147 0.7097 l
0.3163 0.7096 l
0.3178 0.7096 l
0.3194 0.7095 l
0.3210 0.7095 l
0.3225 0.7094 l
0.3241 0.7094 l
0.3257 0.7093 l
0.3273 0.7093 l
0.3288 0.7093 l
0.3304 0.7092 l
0.3320 0.7092 l
0.3335 0.7092 l
0.3351 0.7091 l
0.3367 0.7091 l
0.3382 0.7091 l
0.3398 0.7090 l
0.3414 0.7090 l
0.3429 0.7090 l
0.3445 0.7090 l
0.3461 0.7090 l
0.3476 0.7089 l
0.3492 0.7089 l
0.3508 0.7089 l
0.3524 0.7089 l
0.3539 0.7089 l
0.3555 0.7088 l
0.3571 0.7088 l
0.3586 0.7088 l
0.3602 0.7088 l
0.3618 0.7088 l
0.3633 0.7087 l
0.3649 0.7087 l
0.3665 0.7087 l
0.3680 0.7087 l
0.3696 0.7087 l
0.3712 0.7087 l
0.3727 0.7087 l
0.3743 0.7086 l
0.3759 0.7086 l
0.3775 0.7086 l
0.3790 0.7069 l
0.3806 0.7049 l
0.3822 0.7037 l
0.3837 0.7028 l
0.3853 0.7020 l
0.3869 0.7013 l
0.3884 0.7007 l
0.3900 0.7001 l
0.3916 0.6996 l
0.3931 0.6991 l
0.3947 0.6986 l
0.3963 0.6982 l
0.3978 0.6978 l
0.3994 0.6974 l
0.4010 0.6971 l
0.4025 0.6967 l
0.4041 0.6964 l
0.4057 0.6961 l
0.4073 0.6958 l
0.4088 0.6955 l
0.4104 0.6952 l
0.4120 0.6949 l
0.4135 0.6947 l
0.4151 0.6944 l
0.4167 0.6942 l
0.4182 0.6939 l
0.4198 0.6937 l
0.4214 0.6935 l
0.4229 0.6933 l
0.4245 0.6931 l
0.4261 0.6929 l
0.4276 0.6927 l
0.4292 0.6925 l
0.4308 0.6923 l
0.4324 0.6921 l
0.4339 0.6919 l
0.4355 0.6917 l
0.4371 0.6916 l
0.4386 0.6914 l
0.4402 0.6912 l
0.4418 0.6911 l
0.4433 0.6909 l
0.4449 0.6908 l
0.4465 0.6906 l
0.4480 0.6905 l
0.4496 0.6903 l
0.4512 0.6902 l
0.4527 0.6901 l
0.4543 0.6899 l
0.4559 0.6898 l
0.4575 0.6897 l
0.4590 0.6895 l
0.4606 0.6894 l
0.4622 0.6821 l
0.4637 0.6782 l
0.4653 0.6755 l
0.4669 0.6734 l
0.4684 0.6716 l
0.4700 0.6699 l
0.4716 0.6685 l
0.4731 0.6672 l
0.4747 0.6660 l
0.4763 0.6649 l
0.4778 0.6634 l
0.4794 0.6617 l
0.4810 0.6603 l
0.4825 0.6591 l
0.4841 0.6581 l
0.4857 0.6571 l
0.4873 0.6561 l
0.4888 0.6552 l
0.4904 0.6544 l
0.4920 0.6535 l
0.4935 0.6528 l
0.4951 0.6520 l
0.4967 0.6513 l
0.4982 0.6506 l
0.4998 0.6500 l
0.5014 0.6493 l
0.5029 0.6487 l
0.5045 0.6481 l
0.5061 0.6475 l
0.5076 0.6470 l
0.5092 0.6464 l
0.5108 0.6459 l
0.5124 0.6454 l
0.5139 0.6449 l
0.5155 0.6444 l
0.5171 0.6439 l
0.5186 0.6434 l
0.5202 0.6430 l
0.5218 0.6425 l
0.5233 0.6421 l
0.5249 0.6417 l
0.5265 0.6413 l
0.5280 0.6409 l
0.5296 0.6405 l
0.5312 0.6401 l
0.5327 0.6397 l
0.5343 0.6393 l
0.5359 0.6390 l
0.5375 0.6386 l
0.5390 0.6382 l
0.5406 0.6379 l
0.5422 0.6375 l
0.5437 0.6372 l
0.5453 0.6368 l
0.5469 0.6364 l
0.5484 0.6360 l
0.5502 0.6337 l
0.5516 0.6327 l
0.5531 0.6316 l
0.5547 0.6303 l
0.5563 0.6293 l
0.5578 0.6288 l
0.5594 0.6283 l
0.5610 0.6278 l
0.5625 0.6274 l
0.5641 0.6270 l
0.5657 0.6266 l
0.5673 0.6262 l
0.5688 0.6258 l
0.5704 0.6254 l
0.5720 0.6251 l
0.5735 0.6247 l
0.5751 0.6244 l
0.5767 0.6241 l
0.5782 0.6238 l
0.5798 0.6235 l
0.5814 0.6231 l
0.5829 0.6228 l
0.5845 0.6226 l
0.5861 0.6223 l
0.5876 0.6220 l
0.5892 0.6217 l
0.5908 0.6214 l
0.5924 0.6212 l
0.5939 0.6209 l
0.5955 0.6207 l
0.5971 0.6204 l
0.5986 0.6202 l
0.6002 0.6199 l
0.6018 0.6197 l
0.6033 0.6194 l
0.6049 0.6192 l
0.6065 0.6190 l
0.6080 0.6188 l
0.6096 0.6185 l
0.6112 0.6183 l
0.6127 0.6181 l
0.6143 0.6179 l
0.6159 0.6177 l
0.6175 0.6175 l
0.6190 0.6173 l
0.6206 0.6171 l
0.6222 0.6169 l
0.6237 0.6167 l
0.6253 0.6165 l
0.6269 0.6163 l
0.6284 0.6162 l
0.6300 0.6160 l
0.6316 0.6158 l
0.6331 0.6156 l
0.6347 0.6154 l
0.6363 0.6153 l
0.6378 0.6151 l
0.6394 0.6149 l
0.6410 0.6148 l
0.6425 0.6146 l
0.6441 0.6144 l
0.6457 0.6143 l
0.6473 0.6141 l
0.6488 0.6140 l
0.6504 0.6138 l
0.6520 0.6137 l
0.6535 0.6135 l
0.6551 0.6134 l
0.6567 0.6132 l
0.6582 0.6130 l
0.6598 0.6129 l
0.6614 0.6127 l
0.6629 0.6125 l
0.6645 0.6124 l
0.6661 0.6120 l
0.6676 0.6118 l
0.6692 0.6116 l
0.6708 0.6113 l
0.6724 0.6111 l
0.6739 0.6109 l
0.6755 0.6107 l
0.6771 0.6105 l
0.6786 0.6103 l
0.6802 0.6101 l
0.6818 0.6099 l
0.6833 0.6097 l
0.6849 0.6095 l
0.6865 0.6093 l
0.6880 0.6091 l
0.6896 0.6089 l
0.6912 0.6087 l
0.6927 0.6085 l
0.6943 0.6083 l
0.6959 0.6081 l
0.6975 0.6079 l
0.6990 0.6077 l
0.7006 0.6075 l
0.7022 0.6073 l
0.7037 0.6071 l
0.7053 0.6069 l
0.7069 0.6068 l
0.7084 0.6066 l
0.7100 0.6064 l
0.7116 0.6062 l
0.7131 0.6060 l
0.7147 0.6058 l
0.7163 0.6057 l
0.7178 0.6055 l
0.7194 0.6053 l
0.7210 0.6051 l
0.7225 0.6049 l
0.7241 0.6048 l
0.7257 0.6046 l
0.7273 0.6044 l
0.7288 0.6043 l
0.7304 0.6041 l
0.7320 0.6039 l
0.7335 0.6037 l
0.7351 0.6036 l
0.7367 0.6034 l
0.7382 0.6032 l
0.7398 0.6031 l
0.7414 0.6029 l
0.7429 0.6028 l
0.7445 0.6026 l
0.7461 0.6024 l
0.7476 0.6023 l
0.7492 0.6021 l
0.7508 0.6019 l
0.7524 0.6018 l
0.7539 0.6016 l
0.7555 0.6015 l
0.7571 0.6013 l
0.7586 0.6012 l
0.7602 0.6010 l
0.7618 0.6009 l
0.7633 0.6007 l
0.7649 0.6005 l
0.7665 0.6004 l
0.7680 0.6002 l
0.7696 0.6001 l
0.7712 0.5999 l
0.7727 0.5997 l
0.7743 0.5996 l
0.7759 0.5994 l
0.7775 0.5993 l
0.7790 0.5991 l
0.7806 0.5989 l
0.7822 0.5988 l
0.7837 0.5986 l
0.7853 0.5985 l
0.7869 0.5983 l
0.7884 0.5982 l
0.7900 0.5980 l
0.7916 0.5978 l
0.7931 0.5977 l
0.7947 0.5975 l
0.7963 0.5974 l
0.7978 0.5972 l
0.7994 0.5971 l
0.8010 0.5969 l
0.8025 0.5968 l
0.8041 0.5966 l
0.8057 0.5965 l
0.8073 0.5963 l
0.8088 0.5962 l
0.8104 0.5960 l
0.8120 0.5959 l
0.8135 0.5957 l
0.8151 0.5956 l
0.8167 0.5954 l
0.8182 0.5953 l
0.8198 0.5952 l
0.8214 0.5950 l
0.8229 0.5949 l
0.8245 0.5947 l
0.8261 0.5946 l
0.8276 0.5945 l
0.8292 0.5943 l
0.8308 0.5942 l
0.8324 0.5940 l
0.8339 0.5939 l
0.8355 0.5938 l
0.8371 0.5936 l
0.8386 0.5935 l
0.8402 0.5934 l
0.8418 0.5932 l
0.8433 0.5931 l
0.8449 0.5930 l
0.8465 0.5928 l
0.8480 0.5927 l
0.8496 0.5926 l
0.8512 0.5925 l
0.8527 0.5912 l
0.8543 0.5903 l
0.8559 0.5897 l
0.8575 0.5891 l
0.8590 0.5886 l
0.8606 0.5882 l
0.8622 0.5877 l
0.8637 0.5874 l
0.8653 0.5870 l
0.8669 0.5866 l
0.8684 0.5863 l
0.8700 0.5860 l
0.8716 0.5856 l
0.8731 0.5853 l
0.8747 0.5850 l
0.8763 0.5848 l
0.8778 0.5845 l
0.8794 0.5842 l
0.8810 0.5839 l
0.8825 0.5837 l
0.8841 0.5834 l
0.8857 0.5832 l
0.8873 0.5829 l
0.8888 0.5827 l
0.8904 0.5824 l
0.8920 0.5822 l
0.8935 0.5820 l
0.8951 0.5817 l
0.8967 0.5815 l
0.8982 0.5813 l
0.8998 0.5811 l
0.9014 0.5809 l
0.9029 0.5807 l
0.9045 0.5805 l
0.9061 0.5803 l
0.9076 0.5801 l
0.9092 0.5799 l
0.9108 0.5797 l
0.9124 0.5795 l
0.9139 0.5793 l
0.9155 0.5791 l
0.9171 0.5789 l
0.9186 0.5787 l
0.9202 0.5785 l
0.9218 0.5784 l
0.9233 0.5782 l
0.9249 0.5780 l
0.9265 0.5778 l
0.9280 0.5777 l
0.9296 0.5775 l
0.9312 0.5773 l
0.9327 0.5772 l
0.9343 0.5770 l
0.9359 0.5768 l
0.9375 0.5767 l
0.9390 0.5765 l
0.9406 0.5763 l
0.9422 0.5762 l
0.9437 0.5760 l
0.9453 0.5759 l
0.9469 0.5757 l
0.9484 0.5756 l
0.9500 0.5754 l
s
[/DeviceRGB] SCS
Color5 SC
n
0.1500 0.2455 m
0.1516 0.2457 l
0.1531 0.2459 l
0.1547 0.2460 l
0.1563 0.2462 l
0.1578 0.2464 l
0.1594 0.2465 l
0.1610 0.2467 l
0.1625 0.2468 l
0.1641 0.2470 l
0.1657 0.2471 l
0.1673 0.2473 l
0.1688 0.2474 l
0.1704 0.2476 l
0.1720 0.2477 l
0.1735 0.2478 l
0.1751 0.2480 l
0.1767 0.2481 l
0.1782 0.2483 l
0.1798 0.2484 l
0.1814 0.2485 l
0.1829 0.2487 l
0.1845 0.2488 l
0.1861 0.2489 l
0.1876 0.2490 l
0.1892 0.2492 l
0.1908 0.2493 l
0.1924 0.2494 l
0.1939 0.2495 l
0.1955 0.2497 l
0.1971 0.2498 l
0.1986 0.2499 l
0.2002 0.2500 l
0.2018 0.2501 l
0.2033 0.2502 l
0.2049 0.2504 l
0.2065 0.2505 l
0.2080 0.2506 l
0.2096 0.2507 l
0.2112 0.2508 l
0.2127 0.2509 l
0.2143 0.2510 l
0.2159 0.2511 l
0.2175 0.2512 l
0.2190 0.2513 l
0.2206 0.2514 l
0.2222 0.2515 l
0.2237 0.2516 l
0.2253 0.2517 l
0.2269 0.2518 l
0.2284 0.2519 l
0.2300 0.2520 l
0.2316 0.2521 l
0.2331 0.2522 l
0.2347 0.2523 l
0.2363 0.2524 l
0.2378 0.2525 l
0.2394 0.2526 l
0.2410 0.2527 l
0.2425 0.2528 l
0.2441 0.2529 l
0.2457 0.2529 l
0.2473 0.2530 l
0.2488 0.2531 l
0.2504 0.2532 l
0.2520 0.2533 l
0.2535 0.2534 l
0.2551 0.2535 l
0.2567 0.2535 l
0.2582 0.2536 l
0.2598 0.2537 l
0.2614 0.2538 l
0.2629 0.2539 l
0.2645 0.2540 l
0.2661 0.2540 l
0.2676 0.2541 l
0.2692 0.2542 l
0.2708 0.2543 l
0.2724 0.2544 l
0.2739 0.2544 l
0.2755 0.2545 l
0.2771 0.2546 l
0.2786 0.2547 l
0.2802 0.2537 l
0.2818 0.2528 l
0.2833 0.2523 l
0.2849 0.2519 l
0.2865 0.2516 l
0.2880 0.2514 l
0.2896 0.2511 l
0.2912 0.2509 l
0.2927 0.2507 l
0.2943 0.2506 l
0.2959 0.2504 l
0.2975 0.2503 l
0.2990 0.2501 l
0.3006 0.2500 l
0.3022 0.2499 l
0.3037 0.2498 l
0.3053 0.2497 l
0.3069 0.2496 l
0.3084 0.2495 l
0.3100 0.2495 l
0.3116 0.2494 l
0.3131 0.2493 l
0.3147 0.2492 l
0.3163 0.2492 l
0.3178 0.2491 l
0.3194 0.2491 l
0.3210 0.2490 l
0.3225 0.2490 l
0.3241 0.2489 l
0.3257 0.2489 l
0.3273 0.2488 l
0.3288 0.2488 l
0.3304 0.2488 l
0.3320 0.2487 l
0.3335 0.2487 l
0.3351 0.2487 l
0.3367 0.2486 l
0.3382 0.2486 l
0.3398 0.2486 l
0.3414 0.2486 l
0.3429 0.2485 l
0.3445 0.2485 l
0.3461 0.2485 l
0.3476 0.2485 l
0.3492 0.2485 l
0.3508 0.2484 l
0.3524 0.2484 l
0.3539 0.2484 l
0.3555 0.2484 l
0.3571 0.2484 l
0.3586 0.2483 l
0.3602 0.2483 l
0.3618 0.2483 l
0.3633 0.2483 l
0.3649 0.2483 l
0.3665 0.2483 l
0.3680 0.2483 l
0.3696 0.2482 l
0.3712 0.2482 l
0.3727 0.2482 l
0.3743 0.2482 l
0.3759 0.2482 l
0.3775 0.2482 l
0.3790 0.2464 l
0.3806 0.2445 l
0.3822 0.2433 l
0.3837 0.2423 l
0.3853 0.2415 l
0.3869 0.2408 l
0.3884 0.2402 l
0.3900 0.2397 l
0.3916 0.2391 l
0.3931 0.2387 l
0.3947 0.2382 l
0.3963 0.2378 l
0.3978 0.2374 l
0.3994 0.2370 l
0.4010 0.2366 l
0.4025 0.2363 l
0.4041 0.2360 l
0.4057 0.2357 l
0.4073 0.2354 l
0.4088 0.2351 l
0.4104 0.2348 l
0.4120 0.2345 l
0.4135 0.2342 l
0.4151 0.2340 l
0.4167 0.2338 l
0.4182 0.2335 l
0.4198 0.2333 l
0.4214 0.2331 l
0.4229 0.2328 l
0.4245 0.2326 l
0.4261 0.2324 l
0.4276 0.2322 l
0.4292 0.2320 l
0.4308 0.2319 l
0.4324 0.2317 l
0.4339 0.2315 l
0.4355 0.2313 l
0.4371 0.2311 l
0.4386 0.2310 l
0.4402 0.2308 l
0.4418 0.2307 l
0.4433 0.2305 l
0.4449 0.2304 l
0.4465 0.2302 l
0.4480 0.2301 l
0.4496 0.2299 l
0.4512 0.2298 l
0.4527 0.2296 l
0.4543 0.2295 l
0.4559 0.2294 l
0.4575 0.2293 l
0.4590 0.2291 l
0.4606 0.2290 l
0.4622 0.2217 l
0.4637 0.2179 l
0.4653 0.2152 l
0.4669 0.2130 l
0.4684 0.2112 l
0.4700 0.2096 l
0.4716 0.2081 l
0.4731 0.2068 l
0.4747 0.2056 l
0.4763 0.2045 l
0.4778 0.2030 l
0.4794 0.2013 l
0.4810 0.1999 l
0.4825 0.1988 l
0.4841 0.1977 l
0.4857 0.1967 l
0.4873 0.1957 l
0.4888 0.1948 l
0.4904 0.1940 l
0.4920 0.1932 l
0.4935 0.1924 l
0.4951 0.1916 l
0.4967 0.1909 l
0.4982 0.1902 l
0.4998 0.1896 l
0.5014 0.1889 l
0.5029 0.1883 l
0.5045 0.1877 l
0.5061 0.1872 l
0.5076 0.1866 l
0.5092 0.1860 l
0.5108 0.1855 l
0.5124 0.1850 l
0.5139 0.1845 l
0.5155 0.1840 l
0.5171 0.1835 l
0.5186 0.1831 l
0.5202 0.1826 l
0.5218 0.1822 l
0.5233 0.1817 l
0.5249 0.1813 l
0.5265 0.1809 l
0.5280 0.1805 l
0.5296 0.1801 l
0.5312 0.1797 l
0.5327 0.1793 l
0.5343 0.1790 l
0.5359 0.1786 l
0.5375 0.1782 l
0.5390 0.1779 l
0.5406 0.1775 l
0.5422 0.1772 l
0.5437 0.1768 l
0.5453 0.1765 l
0.5469 0.1761 l
0.5484 0.1756 l
0.5502 0.1734 l
0.5516 0.1723 l
0.5531 0.1712 l
0.5547 0.1700 l
0.5563 0.1689 l
0.5578 0.1684 l
0.5594 0.1679 l
0.5610 0.1675 l
0.5625 0.1670 l
0.5641 0.1666 l
0.5657 0.1662 l
0.5673 0.1658 l
0.5688 0.1654 l
0.5704 0.1651 l
0.5720 0.1647 l
0.5735 0.1644 l
0.5751 0.1640 l
0.5767 0.1637 l
0.5782 0.1634 l
0.5798 0.1631 l
0.5814 0.1628 l
0.5829 0.1625 l
0.5845 0.1622 l
0.5861 0.1619 l
0.5876 0.1616 l
0.5892 0.1613 l
0.5908 0.1611 l
0.5924 0.1608 l
0.5939 0.1605 l
0.5955 0.1603 l
0.5971 0.1600 l
0.5986 0.1598 l
0.6002 0.1596 l
0.6018 0.1593 l
0.6033 0.1591 l
0.6049 0.1589 l
0.6065 0.1586 l
0.6080 0.1584 l
0.6096 0.1582 l
0.6112 0.1580 l
0.6127 0.1578 l
0.6143 0.1575 l
0.6159 0.1573 l
0.6175 0.1571 l
0.6190 0.1569 l
0.6206 0.1567 l
0.6222 0.1565 l
0.6237 0.1563 l
0.6253 0.1562 l
0.6269 0.1560 l
0.6284 0.1558 l
0.6300 0.1556 l
0.6316 0.1554 l
0.6331 0.1553 l
0.6347 0.1551 l
0.6363 0.1549 l
0.6378 0.1547 l
0.6394 0.1546 l
0.6410 0.1544 l
0.6425 0.1542 l
0.6441 0.1541 l
0.6457 0.1539 l
0.6473 0.1538 l
0.6488 0.1536 l
0.6504 0.1534 l
0.6520 0.1533 l
0.6535 0.1531 l
0.6551 0.1530 l
0.6567 0.1528 l
0.6582 0.1527 l
0.6598 0.1525 l
0.6614 0.1523 l
0.6629 0.1522 l
0.6645 0.1520 l
0.6661 0.1517 l
0.6676 0.1514 l
0.6692 0.1512 l
0.6708 0.1510 l
0.6724 0.1508 l
0.6739 0.1506 l
0.6755 0.1503 l
0.6771 0.1501 l
0.6786 0.1499 l
0.6788 0.1499 l
s
[/DeviceRGB] SCS
Color1 SC
[] 0 SD
0.0015 SLW
n
0.1971 0.1500 m
0.1971 0.1600 l
s
n
0.1971 0.9000 m
0.1971 0.8900 l
s
n
0.2284 0.1500 m
0.2284 0.1600 l
s
n
0.2284 0.9000 m
0.2284 0.8900 l
s
n
0.2598 0.1500 m
0.2598 0.1600 l
s
n
0.2598 0.9000 m
0.2598 0.8900 l
s
n
0.2912 0.1500 m
0.2912 0.1600 l
s
n
0.2912 0.9000 m
0.2912 0.8900 l
s
n
0.3539 0.1500 m
0.3539 0.1600 l
s
n
0.3539 0.9000 m
0.3539 0.8900 l
s
n
0.3853 0.1500 m
0.3853 0.1600 l
s
n
0.3853 0.9000 m
0.3853 0.8900 l
s
n
0.4167 0.1500 m
0.4167 0.1600 l
s
n
0.4167 0.9000 m
0.4167 0.8900 l
s
n
0.4480 0.1500 m
0.4480 0.1600 l
s
n
0.4480 0.9000 m
0.4480 0.8900 l
s
n
0.5108 0.1500 m
0.5108 0.1600 l
s
n
0.5108 0.9000 m
0.5108 0.8900 l
s
n
0.5422 0.1500 m
0.5422 0.1600 l
s
n
0.5422 0.9000 m
0.5422 0.8900 l
s
n
0.5735 0.1500 m
0.5735 0.1600 l
s
n
0.5735 0.9000 m
0.5735 0.8900 l
s
n
0.6049 0.1500 m
0.6049 0.1600 l
s
n
0.6049 0.9000 m
0.6049 0.8900 l
s
n
0.6676 0.1500 m
0.6676 0.1600 l
s
n
0.6676 0.9000 m
0.6676 0.8900 l
s
n
0.6990 0.1500 m
0.6990 0.1600 l
s
n
0.6990 0.9000 m
0.6990 0.8900 l
s
n
0.7304 0.1500 m
0.7304 0.1600 l
s
n
0.7304 0.9000 m
0.7304 0.8900 l
s
n
0.7618 0.1500 m
0.7618 0.1600 l
s
n
0.7618 0.9000 m
0.7618 0.8900 l
s
n
0.8245 0.1500 m
0.8245 0.1600 l
s
n
0.8245 0.9000 m
0.8245 0.8900 l
s
n
0.8559 0.1500 m
0.8559 0.1600 l
s
n
0.8559 0.9000 m
0.8559 0.8900 l
s
n
0.8873 0.1500 m
0.8873 0.1600 l
s
n
0.8873 0.9000 m
0.8873 0.8900 l
s
n
0.9186 0.1500 m
0.9186 0.1600 l
s
n
0.9186 0.9000 m
0.9186 0.8900 l
s
n
0.1657 0.1500 m
0.1657 0.1700 l
s
n
0.1657 0.9000 m
0.1657 0.8800 l
s
n
0.3225 0.1500 m
0.3225 0.1700 l
s
n
0.3225 0.9000 m
0.3225 0.8800 l
s
n
0.4794 0.1500 m
0.4794 0.1700 l
s
n
0.4794 0.9000 m
0.4794 0.8800 l
s
n
0.6363 0.1500 m
0.6363 0.1700 l
s
n
0.6363 0.9000 m
0.6363 0.8800 l
s
n
0.7931 0.1500 m
0.7931 0.1700 l
s
n
0.7931 0.9000 m
0.7931 0.8800 l
s
n
0.9500 0.1500 m
0.9500 0.1700 l
s
n
0.9500 0.9000 m
0.9500 0.8800 l
s
/Helvetica findfont
dup length dict begin
 {1 index /FID ne {def} {pop pop} ifelse} forall
 /Encoding DefEncoding def
 currentdict
end
/Font4 exch definefont pop
/Font4 FFSF
0.1431 0.1200 m
GS
[0.0280 0.0000 0.0000 0.0280 0 0] CC
(100) show
GR
/Font4 FFSF
0.3000 0.1200 m
GS
[0.0280 0.0000 0.0000 0.0280 0 0] CC
(200) show
GR
/Font4 FFSF
0.4569 0.1200 m
GS
[0.0280 0.0000 0.0000 0.0280 0 0] CC
(300) show
GR
/Font4 FFSF
0.6137 0.1200 m
GS
[0.0280 0.0000 0.0000 0.0280 0 0] CC
(400) show
GR
/Font4 FFSF
0.7706 0.1200 m
GS
[0.0280 0.0000 0.0000 0.0280 0 0] CC
(500) show
GR
/Font4 FFSF
0.9275 0.1200 m
GS
[0.0280 0.0000 0.0000 0.0280 0 0] CC
(600) show
GR
/Font4 FFSF
0.4818 0.0845 m
GS
[0.0336 0.0000 0.0000 0.0336 0 0] CC
(M) show
GR
/Font4 FFSF
0.5096 0.0711 m
GS
[0.0238 0.0000 0.0000 0.0238 0 0] CC
(A) show
GR
/Font4 FFSF
0.5253 0.0845 m
GS
[0.0336 0.0000 0.0000 0.0336 0 0] CC
( [GeV]) show
GR
n
0.1500 0.2064 m
0.1600 0.2064 l
s
n
0.9500 0.2064 m
0.9400 0.2064 l
s
n
0.1500 0.2395 m
0.1600 0.2395 l
s
n
0.9500 0.2395 m
0.9400 0.2395 l
s
n
0.1500 0.2629 m
0.1600 0.2629 l
s
n
0.9500 0.2629 m
0.9400 0.2629 l
s
n
0.1500 0.2811 m
0.1600 0.2811 l
s
n
0.9500 0.2811 m
0.9400 0.2811 l
s
n
0.1500 0.2959 m
0.1600 0.2959 l
s
n
0.9500 0.2959 m
0.9400 0.2959 l
s
n
0.1500 0.3085 m
0.1600 0.3085 l
s
n
0.9500 0.3085 m
0.9400 0.3085 l
s
n
0.1500 0.3193 m
0.1600 0.3193 l
s
n
0.9500 0.3193 m
0.9400 0.3193 l
s
n
0.1500 0.3289 m
0.1600 0.3289 l
s
n
0.9500 0.3289 m
0.9400 0.3289 l
s
n
0.1500 0.3375 m
0.1600 0.3375 l
s
n
0.9500 0.3375 m
0.9400 0.3375 l
s
n
0.1500 0.3939 m
0.1600 0.3939 l
s
n
0.9500 0.3939 m
0.9400 0.3939 l
s
n
0.1500 0.4270 m
0.1600 0.4270 l
s
n
0.9500 0.4270 m
0.9400 0.4270 l
s
n
0.1500 0.4504 m
0.1600 0.4504 l
s
n
0.9500 0.4504 m
0.9400 0.4504 l
s
n
0.1500 0.4686 m
0.1600 0.4686 l
s
n
0.9500 0.4686 m
0.9400 0.4686 l
s
n
0.1500 0.4834 m
0.1600 0.4834 l
s
n
0.9500 0.4834 m
0.9400 0.4834 l
s
n
0.1500 0.4960 m
0.1600 0.4960 l
s
n
0.9500 0.4960 m
0.9400 0.4960 l
s
n
0.1500 0.5068 m
0.1600 0.5068 l
s
n
0.9500 0.5068 m
0.9400 0.5068 l
s
n
0.1500 0.5164 m
0.1600 0.5164 l
s
n
0.9500 0.5164 m
0.9400 0.5164 l
s
n
0.1500 0.5250 m
0.1600 0.5250 l
s
n
0.9500 0.5250 m
0.9400 0.5250 l
s
n
0.1500 0.5814 m
0.1600 0.5814 l
s
n
0.9500 0.5814 m
0.9400 0.5814 l
s
n
0.1500 0.6145 m
0.1600 0.6145 l
s
n
0.9500 0.6145 m
0.9400 0.6145 l
s
n
0.1500 0.6379 m
0.1600 0.6379 l
s
n
0.9500 0.6379 m
0.9400 0.6379 l
s
n
0.1500 0.6561 m
0.1600 0.6561 l
s
n
0.9500 0.6561 m
0.9400 0.6561 l
s
n
0.1500 0.6709 m
0.1600 0.6709 l
s
n
0.9500 0.6709 m
0.9400 0.6709 l
s
n
0.1500 0.6835 m
0.1600 0.6835 l
s
n
0.9500 0.6835 m
0.9400 0.6835 l
s
n
0.1500 0.6943 m
0.1600 0.6943 l
s
n
0.9500 0.6943 m
0.9400 0.6943 l
s
n
0.1500 0.7039 m
0.1600 0.7039 l
s
n
0.9500 0.7039 m
0.9400 0.7039 l
s
n
0.1500 0.7125 m
0.1600 0.7125 l
s
n
0.9500 0.7125 m
0.9400 0.7125 l
s
n
0.1500 0.7689 m
0.1600 0.7689 l
s
n
0.9500 0.7689 m
0.9400 0.7689 l
s
n
0.1500 0.8020 m
0.1600 0.8020 l
s
n
0.9500 0.8020 m
0.9400 0.8020 l
s
n
0.1500 0.8254 m
0.1600 0.8254 l
s
n
0.9500 0.8254 m
0.9400 0.8254 l
s
n
0.1500 0.8436 m
0.1600 0.8436 l
s
n
0.9500 0.8436 m
0.9400 0.8436 l
s
n
0.1500 0.8584 m
0.1600 0.8584 l
s
n
0.9500 0.8584 m
0.9400 0.8584 l
s
n
0.1500 0.8710 m
0.1600 0.8710 l
s
n
0.9500 0.8710 m
0.9400 0.8710 l
s
n
0.1500 0.8818 m
0.1600 0.8818 l
s
n
0.9500 0.8818 m
0.9400 0.8818 l
s
n
0.1500 0.8914 m
0.1600 0.8914 l
s
n
0.9500 0.8914 m
0.9400 0.8914 l
s
n
0.1500 0.9000 m
0.1600 0.9000 l
s
n
0.9500 0.9000 m
0.9400 0.9000 l
s
n
0.1500 0.1500 m
0.1700 0.1500 l
s
n
0.9500 0.1500 m
0.9300 0.1500 l
s
n
0.1500 0.3375 m
0.1700 0.3375 l
s
n
0.9500 0.3375 m
0.9300 0.3375 l
s
n
0.1500 0.5250 m
0.1700 0.5250 l
s
n
0.9500 0.5250 m
0.9300 0.5250 l
s
n
0.1500 0.7125 m
0.1700 0.7125 l
s
n
0.9500 0.7125 m
0.9300 0.7125 l
s
n
0.1500 0.9000 m
0.1700 0.9000 l
s
n
0.9500 0.9000 m
0.9300 0.9000 l
s
/Font4 FFSF
0.0922 0.1349 m
GS
[0.0280 0.0000 0.0000 0.0280 0 0] CC
(10) show
GR
/Font4 FFSF
0.1231 0.1517 m
GS
[0.0198 0.0000 0.0000 0.0198 0 0] CC
(-4) show
GR
/Font4 FFSF
0.0922 0.3224 m
GS
[0.0280 0.0000 0.0000 0.0280 0 0] CC
(10) show
GR
/Font4 FFSF
0.1231 0.3392 m
GS
[0.0198 0.0000 0.0000 0.0198 0 0] CC
(-3) show
GR
/Font4 FFSF
0.0922 0.5099 m
GS
[0.0280 0.0000 0.0000 0.0280 0 0] CC
(10) show
GR
/Font4 FFSF
0.1231 0.5267 m
GS
[0.0198 0.0000 0.0000 0.0198 0 0] CC
(-2) show
GR
/Font4 FFSF
0.0957 0.6974 m
GS
[0.0280 0.0000 0.0000 0.0280 0 0] CC
(10) show
GR
/Font4 FFSF
0.1267 0.7142 m
GS
[0.0198 0.0000 0.0000 0.0198 0 0] CC
(-1) show
GR
/Font4 FFSF
0.0988 0.8849 m
GS
[0.0280 0.0000 0.0000 0.0280 0 0] CC
(10) show
GR
/Font4 FFSF
0.1298 0.9017 m
GS
[0.0198 0.0000 0.0000 0.0198 0 0] CC
(0) show
GR
/Font4 FFSF
0.0751 0.4805 m
GS
[0.0000 0.0336 -0.0336 0.0000 0 0] CC
(BR\(A\)) show
GR
n
0.1500 0.1500 m
0.1500 0.9000 l
0.9500 0.9000 l
0.9500 0.1500 l
0.1500 0.1500 l
c
s
n
0.7000 0.5500 m
0.7000 0.3449 l
0.9143 0.3449 l
0.9143 0.5500 l
c
[/DeviceRGB] SCS
Color0 SC
fill
[/DeviceRGB] SCS
Color1 SC
n
0.7000 0.5500 m
0.7000 0.3449 l
0.9143 0.3449 l
0.9143 0.5500 l
0.7000 0.5500 l
c
s
/Font4 FFSF
0.7862 0.4935 m
GS
[0.0224 0.0000 0.0000 0.0224 0 0] CC
(BR\(A -> tt\)) show
GR
[/DeviceRGB] SCS
Color2 SC
[] 0 SD
0.0045 SLW
n
0.7122 0.4994 m
0.7722 0.4994 l
s
/Font4 FFSF
[/DeviceRGB] SCS
Color1 SC
0.7862 0.4524 m
GS
[0.0224 0.0000 0.0000 0.0224 0 0] CC
(BR\(A -> bb\)) show
GR
[/DeviceRGB] SCS
Color3 SC
n
0.7122 0.4582 m
0.7722 0.4582 l
s
/Font4 FFSF
[/DeviceRGB] SCS
Color1 SC
0.7862 0.4112 m
GS
[0.0224 0.0000 0.0000 0.0224 0 0] CC
(BR\(A -> ) show
GR
/Symbol findfont
/Font12 exch definefont pop
/Font12 FFSF
0.8729 0.4112 m
GS
[0.0224 0.0000 0.0000 0.0224 0 0] CC
(tt) show
GR
/Font4 FFSF
0.8925 0.4112 m
GS
[0.0224 0.0000 0.0000 0.0224 0 0] CC
(\)) show
GR
[/DeviceRGB] SCS
Color4 SC
n
0.7122 0.4171 m
0.7722 0.4171 l
s
/Font4 FFSF
[/DeviceRGB] SCS
Color1 SC
0.7862 0.3700 m
GS
[0.0224 0.0000 0.0000 0.0224 0 0] CC
(BR\(A -> ) show
GR
/Font12 FFSF
0.8729 0.3700 m
GS
[0.0224 0.0000 0.0000 0.0224 0 0] CC
(mm) show
GR
/Font4 FFSF
0.8988 0.3700 m
GS
[0.0224 0.0000 0.0000 0.0224 0 0] CC
(\)) show
GR
[/DeviceRGB] SCS
Color5 SC
n
0.7122 0.3757 m
0.7722 0.3757 l
s
/Font4 FFSF
[/DeviceRGB] SCS
Color1 SC
0.9700 0.7000 m
GS
[0.0000 0.0168 -0.0168 0.0000 0 0] CC
(LHC Higgs XS WG 2013) show
GR
/Font4 FFSF
0.7150 0.5250 m
GS
[0.0224 0.0000 0.0000 0.0224 0 0] CC
(m) show
GR
/Font4 FFSF
0.7338 0.5160 m
GS
[0.0158 0.0000 0.0000 0.0158 0 0] CC
(h) show
GR
/Font4 FFSF
0.7425 0.5384 m
GS
[0.0158 0.0000 0.0000 0.0158 0 0] CC
(mod-) show
GR
/Font4 FFSF
0.7785 0.5250 m
GS
[0.0224 0.0000 0.0000 0.0224 0 0] CC
(, tan) show
GR
/Font12 FFSF
0.8221 0.5250 m
GS
[0.0224 0.0000 0.0000 0.0224 0 0] CC
(b) show
GR
/Font4 FFSF
0.8342 0.5250 m
GS
[0.0224 0.0000 0.0000 0.0224 0 0] CC
( = 10) show
GR
%%Trailer
%%BoundingBox: 30 42 597 562
%%DocumentNeededResources: font Helvetica
%%+ font Symbol
%%EOF
