%!PS-Adobe-2.0 EPSF-2.0
%%BoundingBox:  0 0 567 544
%%Title: HWW_400_ptll_reweighting_cut_YR3.eps: HWW 400Gev ptll reweighting for interference with cuts
%%Creator: ROOT Version 5.34/05
%%CreationDate: Fri Jun 14 02:56:50 2013
%%EndComments
%%BeginProlog
80 dict begin
/s {stroke} def /l {lineto} def /m {moveto} def /t {translate} def
/r {rotate} def /rl {roll}  def /R {repeat} def
/d {rlineto} def /rm {rmoveto} def /gr {grestore} def /f {eofill} def
/c {setrgbcolor} def /black {0 setgray} def /sd {setdash} def
/cl {closepath} def /sf {scalefont setfont} def /lw {setlinewidth} def
/box {m dup 0 exch d exch 0 d 0 exch neg d cl} def
/NC{systemdict begin initclip end}def/C{NC box clip newpath}def
/bl {box s} def /bf {box f} def /Y { 0 exch d} def /X { 0 d} def 
/K {{pop pop 0 moveto} exch kshow} bind def
/ita {/ang 15 def gsave [1 0 ang dup sin exch cos div 1 0 0] concat} def 
/mp {newpath /y exch def /x exch def} def
/side {[w .77 mul w .23 mul] .385 w mul sd w 0 l currentpoint t -144 r} def
/mr {mp x y w2 0 360 arc} def /m24 {mr s} def /m20 {mr f} def
/mb {mp x y w2 add m w2 neg 0 d 0 w neg d w 0 d 0 w d cl} def
/mt {mp x y w2 add m w2 neg w neg d w 0 d cl} def
/m21 {mb f} def /m25 {mb s} def /m22 {mt f} def /m26{mt s} def
/m23 {mp x y w2 sub m w2 w d w neg 0 d cl f} def
/m27 {mp x y w2 add m w3 neg w2 neg d w3 w2 neg d w3 w2 d cl s} def
/m28 {mp x w2 sub y w2 sub w3 add m w3 0 d  0 w3 neg d w3 0 d 0 w3 d w3 0 d  0 w3 d w3 neg 0 d 0 w3 d w3 neg 0 d 0 w3 neg d w3 neg 0 d cl s } def
/m29 {mp gsave x w2 sub y w2 add w3 sub m currentpoint t 4 {side} repeat cl fill gr} def
/m30 {mp gsave x w2 sub y w2 add w3 sub m currentpoint t 4 {side} repeat cl s gr} def
/m31 {mp x y w2 sub m 0 w d x w2 sub y m w 0 d x w2 sub y w2 add m w w neg d x w2 sub y w2 sub m w w d s} def
/m32 {mp x y w2 sub m w2 w d w neg 0 d cl s} def
/m33 {mp x y w2 add m w3 neg w2 neg d w3 w2 neg d w3 w2 d cl f} def
/m34 {mp x w2 sub y w2 sub w3 add m w3 0 d  0 w3 neg d w3 0 d 0 w3 d w3 0 d  0 w3 d w3 neg 0 d 0 w3 d w3 neg 0 d 0 w3 neg d w3 neg 0 d cl f } def
/m2 {mp x y w2 sub m 0 w d x w2 sub y m w 0 d s} def
/m5 {mp x w2 sub y w2 sub m w w d x w2 sub y w2 add m w w neg d s} def
/reEncode {exch findfont dup length dict begin {1 index /FID eq  {pop pop} {def} ifelse } forall /Encoding exch def currentdict end dup /FontName get exch definefont pop } def [/Times-Bold /Times-Italic /Times-BoldItalic /Helvetica /Helvetica-Oblique
 /Helvetica-Bold /Helvetica-BoldOblique /Courier /Courier-Oblique /Courier-Bold /Courier-BoldOblique /Times-Roman /AvantGarde-Book /AvantGarde-BookOblique /AvantGarde-Demi /AvantGarde-DemiOblique /Bookman-Demi /Bookman-DemiItalic /Bookman-Light
 /Bookman-LightItalic /Helvetica-Narrow /Helvetica-Narrow-Bold /Helvetica-Narrow-BoldOblique /Helvetica-Narrow-Oblique /NewCenturySchlbk-Roman /NewCenturySchlbk-Bold /NewCenturySchlbk-BoldItalic /NewCenturySchlbk-Italic /Palatino-Bold
 /Palatino-BoldItalic /Palatino-Italic /Palatino-Roman ] {ISOLatin1Encoding reEncode } forall
%%EndProlog
%%BeginSetup
%%EndSetup
newpath  gsave  .25 .25 scale  gsave  0 0 t black[  ] 0 sd 3 lw 1 1 1 c 2268 2177 0 0 bf black 1 1 1 c 2268 1568 0 609 bf black 1 1 1 c 1814 1411 227 609 bf black 1814 1411 227 609 bl 0 0 1 c 1 1 1 c 0 0 1 c 227 675 m 199 X 816 Y 18 X 321 Y 19 X 42 Y
 18 X 51 Y 18 X 26 Y 18 X 22 Y 18 X -13 Y 18 X -33 Y 18 X -107 Y 19 X -202 Y 18 X -165 Y 18 X -121 Y 18 X -93 Y 18 X -81 Y 18 X -67 Y 18 X -58 Y 19 X -53 Y 18 X -41 Y 18 X -39 Y 18 X -34 Y 18 X -30 Y 18 X -25 Y 18 X -23 Y 19 X -19 Y 18 X -15 Y 18 X
 -14 Y 18 X -12 Y 18 X -8 Y 18 X -7 Y 18 X -6 Y 19 X -5 Y 18 X -3 Y 18 X -2 Y 18 X -2 Y 18 X -1 Y 55 X -1 Y 18 X 1 Y 254 X 1 Y 671 X s black 227 609 m 1814 X s 227 647 m -38 Y s 272 628 m -19 Y s 317 628 m -19 Y s 363 628 m -19 Y s 408 628 m -19 Y s
 454 647 m -38 Y s 499 628 m -19 Y s 544 628 m -19 Y s 590 628 m -19 Y s 635 628 m -19 Y s 680 647 m -38 Y s 726 628 m -19 Y s 771 628 m -19 Y s 816 628 m -19 Y s 862 628 m -19 Y s 907 647 m -38 Y s 952 628 m -19 Y s 998 628 m -19 Y s 1043 628 m -19
 Y s 1089 628 m -19 Y s 1134 647 m -38 Y s 1179 628 m -19 Y s 1225 628 m -19 Y s 1270 628 m -19 Y s 1315 628 m -19 Y s 1361 647 m -38 Y s 1406 628 m -19 Y s 1451 628 m -19 Y s 1497 628 m -19 Y s 1542 628 m -19 Y s 1587 647 m -38 Y s 1633 628 m -19 Y
 s 1678 628 m -19 Y s 1723 628 m -19 Y s 1769 628 m -19 Y s 1814 647 m -38 Y s 1860 628 m -19 Y s 1905 628 m -19 Y s 1950 628 m -19 Y s 1996 628 m -19 Y s 2041 647 m -38 Y s
 gsave  2268 1568 0 609 C 208.919 558.382 t 0 r /Helvetica findfont 49.4479 sf 0 0 m (0) show NC gr 
 gsave  2268 1568 0 609 C 425.434 558.382 t 0 r /Helvetica findfont 49.4479 sf 0 0 m (50) show NC gr 
 gsave  2268 1568 0 609 C 638.151 558.382 t 0 r /Helvetica findfont 49.4479 sf 0 0 m (100) show NC gr 
 gsave  2268 1568 0 609 C 862.264 558.382 t 0 r /Helvetica findfont 49.4479 sf 0 0 m (150) show NC gr 
 gsave  2268 1568 0 609 C 1090.18 558.382 t 0 r /Helvetica findfont 49.4479 sf 0 0 m (200) show NC gr 
 gsave  2268 1568 0 609 C 1318.09 558.382 t 0 r /Helvetica findfont 49.4479 sf 0 0 m (250) show NC gr 
 gsave  2268 1568 0 609 C 1542.2 558.382 t 0 r /Helvetica findfont 49.4479 sf 0 0 m (300) show NC gr 
 gsave  2268 1568 0 609 C 1770.11 558.382 t 0 r /Helvetica findfont 49.4479 sf 0 0 m (350) show NC gr 
 gsave  2268 1568 0 609 C 1998.02 558.382 t 0 r /Helvetica findfont 49.4479 sf 0 0 m (400) show NC gr  227 609 m 1411 Y s
 gsave  2268 1568 0 609 C 75.9704 1371.27 t 90 r /Helvetica findfont 34.2332 sf 0 0 m (ll) show NC gr 
 gsave  2268 1568 0 609 C 22.7911 1371.27 t 90 r /Helvetica findfont 34.2332 sf 0 0 m (T) show NC gr 
 gsave  2268 1568 0 609 C 45.5822 1299.09 t 90 r /Helvetica findfont 49.4479 sf 0 0 m (/dp) show NC gr 
 gsave  2268 1568 0 609 C 45.5822 1268.71 t 90 r /Symbol findfont 49.4479 sf 0 0 m (s) show NC gr 
 gsave  2268 1568 0 609 C 45.5822 1242.12 t 90 r /Helvetica findfont 49.4479 sf 0 0 m (d) show NC gr  288 675 m -61 X s 257 724 m -30 X s 257 773 m -30 X s 257 822 m -30 X s 257 871 m -30 X s 288 920 m -61 X s 257 969 m -30 X s 257 1019 m -30 X s 257
 1068 m -30 X s 257 1117 m -30 X s 288 1166 m -61 X s 257 1215 m -30 X s 257 1264 m -30 X s 257 1313 m -30 X s 257 1362 m -30 X s 288 1411 m -61 X s 257 1460 m -30 X s 257 1509 m -30 X s 257 1558 m -30 X s 257 1608 m -30 X s 288 1657 m -61 X s 257
 1706 m -30 X s 257 1755 m -30 X s 257 1804 m -30 X s 257 1853 m -30 X s 288 1902 m -61 X s 288 675 m -61 X s 257 626 m -30 X s 288 1902 m -61 X s 257 1951 m -30 X s 257 2000 m -30 X s
 gsave  2268 1568 0 609 C 186.127 657.144 t 0 r /Helvetica findfont 49.4479 sf 0 0 m (0) show NC gr 
 gsave  2268 1568 0 609 C 117.754 904.048 t 0 r /Helvetica findfont 49.4479 sf 0 0 m (0.05) show NC gr 
 gsave  2268 1568 0 609 C 151.941 1147.15 t 0 r /Helvetica findfont 49.4479 sf 0 0 m (0.1) show NC gr 
 gsave  2268 1568 0 609 C 117.754 1394.06 t 0 r /Helvetica findfont 49.4479 sf 0 0 m (0.15) show NC gr 
 gsave  2268 1568 0 609 C 144.344 1640.96 t 0 r /Helvetica findfont 49.4479 sf 0 0 m (0.2) show NC gr 
 gsave  2268 1568 0 609 C 117.754 1884.07 t 0 r /Helvetica findfont 49.4479 sf 0 0 m (0.25) show NC gr  0 0 1 c /w 2 def /w2 {w 2 div} def /w3 {w 3 div} def 236 675 m20 254 675 m20 272 675 m20 290 675 m20 308 675 m20 327 675 m20 345 675 m20 363 675
 m20 381 675 m20 399 675 m20 417 675 m20 435 1491 m20 454 1812 m20 472 1854 m20 490 1905 m20 508 1931 m20 526 1953 m20 544 1940 m20 562 1907 m20 581 1800 m20 599 1598 m20 617 1433 m20 635 1312 m20 653 1219 m20 671 1138 m20 689 1071 m20 708 1013 m20
 726 960 m20 744 919 m20 762 880 m20 780 846 m20 798 816 m20 816 791 m20 835 768 m20 853 749 m20 871 734 m20 889 720 m20 907 708 m20 925 700 m20 943 693 m20 962 687 m20 980 682 m20 998 679 m20 1016 677 m20 1034 675 m20 1052 674 m20 1070 674 m20 1089
 674 m20 1107 673 m20 1125 674 m20 1143 674 m20 1161 674 m20 1179 674 m20 1197 674 m20 1215 674 m20 1234 674 m20 1252 674 m20 1270 674 m20 1288 674 m20 1306 674 m20 1324 674 m20 1342 674 m20 1361 674 m20 1379 675 m20 1397 675 m20 1415 675 m20 1433
 675 m20 1451 675 m20 1469 675 m20 1488 675 m20 1506 675 m20 1524 675 m20 1542 675 m20 1560 675 m20 1578 675 m20 1596 675 m20 1615 675 m20 1633 675 m20 1651 675 m20 1669 675 m20 1687 675 m20 1705 675 m20 1723 675 m20 1742 675 m20 1760 675 m20 1778
 675 m20 1796 675 m20 1814 675 m20 1832 675 m20 1850 675 m20 1869 675 m20 1887 675 m20 1905 675 m20 1923 675 m20 1941 675 m20 1959 675 m20 1977 675 m20 1996 675 m20 2014 675 m20 2032 675 m20 black 0 0 1 c 1 lw << /PatternType 1 /PaintType 2
 /TilingType 1 /BBox [ 0 0 100 100 ] /XStep 100 /YStep 100 /PaintProc { begin gsave 0 0 m 100 100 l 0 100 m 100 0 l s gr end } >> [ 0.24 0 0 0.24 0 0 ] makepattern /P13 exch def /cs {[/Pattern /DeviceRGB] setcolorspace} def /FA {f [/DeviceRGB]
 setcolorspace} def cs 0 0 1 P13 setcolor 236 675 m 181 X 18 819 d 19 321 d 18 43 d 18 50 d 18 27 d 18 21 d 18 -13 d 18 -32 d 19 -108 d 18 -202 d 18 -165 d 18 -122 d 18 -93 d 18 -81 d 18 -67 d 19 -58 d 18 -53 d 18 -42 d 18 -39 d 18 -34 d 18 -30 d 18
 -25 d 19 -23 d 18 -19 d 18 -16 d 18 -14 d 18 -12 d 18 -8 d 18 -7 d 19 -6 d 18 -5 d 18 -3 d 18 -2 d 18 -2 d 18 -1 d 254 X 18 1 d 18 -1 d 19 X 18 1 d 653 X -635 X -18 -1 d -218 X -18 -1 d -36 X -18 1 d -37 X -18 1 d -18 2 d -18 2 d -18 3 d -18 4 d -19
 6 d -18 7 d -18 8 d -18 12 d -18 14 d -18 15 d -18 19 d -19 23 d -18 25 d -18 29 d -18 35 d -18 39 d -18 41 d -18 52 d -19 58 d -18 67 d -18 81 d -18 92 d -18 121 d -18 165 d -18 201 d -19 107 d -18 33 d -18 13 d -18 -22 d -18 -26 d -18 -50 d -18
 -43 d -19 -320 d -18 -813 d -181 X FA 3 lw 0.8 0 0 c 1 0 0 c 0.8 0 0 c 227 675 m 199 X 833 Y 18 X 324 Y 19 X 25 Y 18 X 42 Y 18 X 16 Y 18 X 9 Y 18 X -21 Y 18 X -35 Y 18 X -100 Y 19 X -181 Y 18 X -146 Y 18 X -113 Y 18 X -87 Y 18 X -76 Y 18 X -69 Y 18
 X -54 Y 19 X -48 Y 18 X -46 Y 18 X -39 Y 18 X -34 Y 18 X -32 Y 18 X -25 Y 18 X -24 Y 19 X -21 Y 18 X -17 Y 18 X -15 Y 18 X -13 Y 18 X -11 Y 18 X -8 Y 18 X -7 Y 19 X -7 Y 18 X -5 Y 18 X -2 Y 18 X -3 Y 18 X -2 Y 18 X -2 Y 18 X -1 Y 19 X -1 Y 18 X -1 Y
 36 X -1 Y 73 X -1 Y 199 X -1 Y 617 X s 1 0 0 c 236 675 m20 254 675 m20 272 675 m20 290 675 m20 308 675 m20 327 675 m20 345 675 m20 363 675 m20 381 675 m20 399 675 m20 417 675 m20 435 1508 m20 454 1832 m20 472 1857 m20 490 1899 m20 508 1915 m20 526
 1924 m20 544 1903 m20 562 1868 m20 581 1768 m20 599 1587 m20 617 1441 m20 635 1328 m20 653 1241 m20 671 1165 m20 689 1096 m20 708 1042 m20 726 994 m20 744 948 m20 762 909 m20 780 875 m20 798 843 m20 816 818 m20 835 794 m20 853 773 m20 871 756 m20
 889 741 m20 907 728 m20 925 717 m20 943 709 m20 962 702 m20 980 695 m20 998 690 m20 1016 688 m20 1034 685 m20 1052 683 m20 1070 681 m20 1089 680 m20 1107 679 m20 1125 678 m20 1143 678 m20 1161 677 m20 1179 677 m20 1197 677 m20 1215 677 m20 1234 676
 m20 1252 676 m20 1270 676 m20 1288 676 m20 1306 676 m20 1324 676 m20 1342 676 m20 1361 676 m20 1379 676 m20 1397 676 m20 1415 676 m20 1433 675 m20 1451 675 m20 1469 675 m20 1488 675 m20 1506 675 m20 1524 675 m20 1542 675 m20 1560 675 m20 1578 675
 m20 1596 675 m20 1615 675 m20 1633 675 m20 1651 675 m20 1669 675 m20 1687 675 m20 1705 675 m20 1723 675 m20 1742 675 m20 1760 675 m20 1778 675 m20 1796 675 m20 1814 675 m20 1832 675 m20 1850 675 m20 1869 675 m20 1887 675 m20 1905 675 m20 1923 675
 m20 1941 675 m20 1959 675 m20 1977 675 m20 1996 675 m20 2014 675 m20 2032 675 m20 0.8 0 0 c black 0.8 0 0 c cs 0.8 0 0 P13 setcolor 236 675 m 181 X 18 836 d 19 324 d 18 26 d 18 41 d 18 16 d 18 9 d 18 -20 d 18 -35 d 19 -100 d 18 -182 d 18 -146 d 18
 -114 d 18 -87 d 18 -76 d 18 -69 d 19 -54 d 18 -49 d 18 -46 d 18 -39 d 18 -34 d 18 -32 d 18 -25 d 19 -24 d 18 -21 d 18 -17 d 18 -15 d 18 -14 d 18 -10 d 18 -9 d 19 -7 d 18 -7 d 18 -4 d 18 -3 d 18 -3 d 18 -2 d 18 -2 d 19 -1 d 18 -1 d 18 X 18 -1 d 18 X
 18 -1 d 73 X 18 -1 d 145 X 18 -1 d 599 X -635 X -18 1 d -145 X -19 1 d -54 X -18 1 d -18 X -18 1 d -18 1 d -19 1 d -18 2 d -18 2 d -18 3 d -18 2 d -18 5 d -18 6 d -19 7 d -18 9 d -18 11 d -18 13 d -18 14 d -18 18 d -18 20 d -19 24 d -18 25 d -18 31
 d -18 34 d -18 39 d -18 46 d -18 48 d -19 54 d -18 69 d -18 76 d -18 87 d -18 112 d -18 146 d -18 181 d -19 100 d -18 35 d -18 20 d -18 -9 d -18 -15 d -18 -42 d -18 -26 d -19 -323 d -18 -830 d -181 X FA 0 0.4 0 c 1 1 1 c 0.35 0.83 0.33 c 0 0.4 0 c
 227 675 m 199 X 825 Y 18 X 326 Y 19 X 29 Y 18 X 39 Y 18 X 19 Y 18 X 7 Y 18 X -21 Y 18 X -35 Y 18 X -101 Y 19 X -194 Y 18 X -159 Y 18 X -113 Y 18 X -93 Y 18 X -76 Y 18 X -68 Y 18 X -55 Y 19 X -48 Y 18 X -45 Y 18 X -36 Y 18 X -33 Y 18 X -30 Y 18 X -22
 Y 18 X -22 Y 19 X -19 Y 18 X -16 Y 18 X -13 Y 18 X -11 Y 18 X -9 Y 18 X -7 Y 18 X -6 Y 19 X -4 Y 18 X -3 Y 18 X -3 Y 18 X -1 Y 18 X -2 Y 55 X -1 Y 235 X 1 Y 19 X -1 Y 18 X 1 Y 671 X s 0.35 0.83 0.33 c 236 675 m20 254 675 m20 272 675 m20 290 675 m20
 308 675 m20 327 675 m20 345 675 m20 363 675 m20 381 675 m20 399 675 m20 417 675 m20 435 1500 m20 454 1826 m20 472 1855 m20 490 1894 m20 508 1913 m20 526 1920 m20 544 1899 m20 562 1864 m20 581 1763 m20 599 1569 m20 617 1410 m20 635 1297 m20 653 1204
 m20 671 1128 m20 689 1060 m20 708 1005 m20 726 957 m20 744 912 m20 762 876 m20 780 843 m20 798 813 m20 816 791 m20 835 769 m20 853 750 m20 871 734 m20 889 721 m20 907 710 m20 925 701 m20 943 694 m20 962 688 m20 980 684 m20 998 681 m20 1016 678 m20
 1034 677 m20 1052 675 m20 1070 675 m20 1089 675 m20 1107 674 m20 1125 674 m20 1143 674 m20 1161 674 m20 1179 674 m20 1197 674 m20 1215 674 m20 1234 674 m20 1252 674 m20 1270 674 m20 1288 674 m20 1306 674 m20 1324 674 m20 1342 675 m20 1361 674 m20
 1379 675 m20 1397 675 m20 1415 675 m20 1433 675 m20 1451 675 m20 1469 675 m20 1488 675 m20 1506 675 m20 1524 675 m20 1542 675 m20 1560 675 m20 1578 675 m20 1596 675 m20 1615 675 m20 1633 675 m20 1651 675 m20 1669 675 m20 1687 675 m20 1705 675 m20
 1723 675 m20 1742 675 m20 1760 675 m20 1778 675 m20 1796 675 m20 1814 675 m20 1832 675 m20 1850 675 m20 1869 675 m20 1887 675 m20 1905 675 m20 1923 675 m20 1941 675 m20 1959 675 m20 1977 675 m20 1996 675 m20 2014 675 m20 2032 675 m20 0 0.4 0 c black
 0 0.4 0 c cs 0 0.4 0 P13 setcolor 236 675 m 181 X 18 828 d 19 327 d 18 29 d 18 39 d 18 19 d 18 7 d 18 -21 d 18 -35 d 19 -101 d 18 -195 d 18 -159 d 18 -114 d 18 -93 d 18 -76 d 18 -68 d 19 -55 d 18 -48 d 18 -45 d 18 -37 d 18 -33 d 18 -30 d 18 -23 d 19
 -21 d 18 -20 d 18 -15 d 18 -14 d 18 -10 d 18 -10 d 18 -6 d 19 -6 d 18 -5 d 18 -3 d 18 -3 d 18 -1 d 18 -2 d 37 X 18 -1 d 217 X 18 1 d 690 X -653 X -18 -1 d -272 X -19 1 d -18 X -18 1 d -18 2 d -18 3 d -18 2 d -18 5 d -19 6 d -18 6 d -18 10 d -18 11 d
 -18 13 d -18 15 d -18 19 d -19 22 d -18 22 d -18 30 d -18 33 d -18 36 d -18 45 d -18 47 d -19 55 d -18 68 d -18 76 d -18 92 d -18 114 d -18 158 d -18 193 d -19 101 d -18 35 d -18 21 d -18 -7 d -18 -19 d -18 -39 d -18 -28 d -19 -326 d -18 -822 d -181
 X FA black 1 1 1 c 567 470 1587 1550 bf black 1587 1550 m 567 X s 2154 1550 m 470 Y s 2154 2020 m -567 X s 1587 2020 m -470 Y s
 gsave  2268 1568 0 609 C 1728.33 1918.25 t 0 r /Helvetica findfont 72.27 sf 0 0 m (No Int) show NC gr  0.8 0 0 c 1609 1941 m 99 X s black
 gsave  2268 1568 0 609 C 1728.33 1758.71 t 0 r /Helvetica findfont 72.27 sf 0 0 m (With Int) show NC gr  0 0 1 c 1609 1785 m 99 X s black
 gsave  2268 1568 0 609 C 1728.33 1610.57 t 0 r /Helvetica findfont 72.27 sf 0 0 m (Reweighted) show NC gr  0 0.4 0 c 1609 1628 m 99 X s black
 gsave  2268 1568 0 609 C 2222.13 1747.32 t 90 r /Helvetica-BoldOblique findfont 30.4295 sf 0 0 m (LHC HIGGS XS WG 2013) show NC gr  1 1 1 c 2268 609 0 0 bf black 1 1 1 c 1814 457 227 152 bf black 1814 457 227 152 bl 1 1 1 c black 227 152 m 199 X 226
 Y 37 X 3 Y 18 X 2 Y 18 X 1 Y 18 X 3 Y 18 X 1 Y 18 X 1 Y 37 X -1 Y 36 X -2 Y 18 X 1 Y 18 X -1 Y 18 X 2 Y 18 X -2 Y 19 X -3 Y 18 X 4 Y 18 X -2 Y 36 X 1 Y 18 X -4 Y 18 X -4 Y 19 X 1 Y 36 X -4 Y 18 X -10 Y 18 X 5 Y 18 X -9 Y 18 X -11 Y 19 X -10 Y 18 X
 -43 Y 18 X -9 Y 18 X -133 Y 18 X -3 Y 18 X 457 Y 37 X -25 Y 18 X -38 Y 18 X -90 Y 18 X 26 Y 18 X -73 Y 18 X 4 Y 18 X 41 Y 19 X -61 Y 18 X 19 Y 18 X 25 Y 18 X -61 Y 18 X 105 Y 18 X -130 Y 18 X 138 Y 19 X -61 Y 18 X -34 Y 18 X -26 Y 18 X 30 Y 18 X 28
 Y 18 X 4 Y 18 X -62 Y 19 X -36 Y 18 X 99 Y 18 X -6 Y 18 X -57 Y 18 X 72 Y 18 X -58 Y 18 X 65 Y 19 X -87 Y 18 X 121 Y 18 X -93 Y 18 X -64 Y 18 X 31 Y 18 X -19 Y 18 X 59 Y 19 X -9 Y 18 X -21 Y 18 X 15 Y 18 X 38 Y 18 X -31 Y 18 X 43 Y 18 X -58 Y 19 X
 -53 Y 18 X -29 Y 18 X 189 Y 18 X -105 Y 18 X 111 Y 18 X -95 Y 18 X -46 Y 19 X 18 Y 18 X 3 Y 18 X -53 Y 18 X s 227 152 m 1814 X s
 gsave  2268 609 0 0 C 2017.01 11.3956 t 0 r /Helvetica findfont 38.0897 sf 0 0 m (ll) show NC gr 
 gsave  2268 609 0 0 C 2017.01 68.3734 t 0 r /Helvetica findfont 38.0897 sf 0 0 m (T) show NC gr 
 gsave  2268 609 0 0 C 1986.63 45.5822 t 0 r /Helvetica findfont 57.1345 sf 0 0 m (p) show NC gr  227 167 m -15 Y s 272 160 m -8 Y s 317 160 m -8 Y s 363 160 m -8 Y s 408 160 m -8 Y s 454 167 m -15 Y s 499 160 m -8 Y s 544 160 m -8 Y s 590 160 m -8 Y
 s 635 160 m -8 Y s 680 167 m -15 Y s 726 160 m -8 Y s 771 160 m -8 Y s 816 160 m -8 Y s 862 160 m -8 Y s 907 167 m -15 Y s 952 160 m -8 Y s 998 160 m -8 Y s 1043 160 m -8 Y s 1089 160 m -8 Y s 1134 167 m -15 Y s 1179 160 m -8 Y s 1225 160 m -8 Y s
 1270 160 m -8 Y s 1315 160 m -8 Y s 1361 167 m -15 Y s 1406 160 m -8 Y s 1451 160 m -8 Y s 1497 160 m -8 Y s 1542 160 m -8 Y s 1587 167 m -15 Y s 1633 160 m -8 Y s 1678 160 m -8 Y s 1723 160 m -8 Y s 1769 160 m -8 Y s 1814 167 m -15 Y s 1860 160 m
 -8 Y s 1905 160 m -8 Y s 1950 160 m -8 Y s 1996 160 m -8 Y s 2041 167 m -15 Y s
 gsave  2268 609 0 0 C 208.919 113.956 t 0 r /Helvetica findfont 45.7076 sf 0 0 m (0) show NC gr 
 gsave  2268 609 0 0 C 425.434 113.956 t 0 r /Helvetica findfont 45.7076 sf 0 0 m (50) show NC gr 
 gsave  2268 609 0 0 C 641.95 113.956 t 0 r /Helvetica findfont 45.7076 sf 0 0 m (100) show NC gr 
 gsave  2268 609 0 0 C 866.063 113.956 t 0 r /Helvetica findfont 45.7076 sf 0 0 m (150) show NC gr 
 gsave  2268 609 0 0 C 1093.97 113.956 t 0 r /Helvetica findfont 45.7076 sf 0 0 m (200) show NC gr 
 gsave  2268 609 0 0 C 1321.89 113.956 t 0 r /Helvetica findfont 45.7076 sf 0 0 m (250) show NC gr 
 gsave  2268 609 0 0 C 1546 113.956 t 0 r /Helvetica findfont 45.7076 sf 0 0 m (300) show NC gr 
 gsave  2268 609 0 0 C 1773.91 113.956 t 0 r /Helvetica findfont 45.7076 sf 0 0 m (350) show NC gr 
 gsave  2268 609 0 0 C 2001.82 113.956 t 0 r /Helvetica findfont 45.7076 sf 0 0 m (400) show NC gr  227 152 m 457 Y s
 gsave  2268 609 0 0 C 91.1645 170.933 t 90 r /Helvetica findfont 45.7076 sf 0 0 m (\(S+I\)/\(Reweighted S\)) show NC gr  278 152 m -51 X s 252 164 m -25 X s 252 175 m -25 X s 252 187 m -25 X s 278 198 m -51 X s 252 209 m -25 X s 252 221 m -25 X s
 252 232 m -25 X s 278 244 m -51 X s 252 255 m -25 X s 252 267 m -25 X s 252 278 m -25 X s 278 289 m -51 X s 252 301 m -25 X s 252 312 m -25 X s 252 324 m -25 X s 278 335 m -51 X s 252 347 m -25 X s 252 358 m -25 X s 252 369 m -25 X s 278 381 m -51 X
 s 252 392 m -25 X s 252 404 m -25 X s 252 415 m -25 X s 278 427 m -51 X s 252 438 m -25 X s 252 449 m -25 X s 252 461 m -25 X s 278 472 m -51 X s 252 484 m -25 X s 252 495 m -25 X s 252 507 m -25 X s 278 518 m -51 X s 252 529 m -25 X s 252 541 m -25
 X s 252 552 m -25 X s 278 564 m -51 X s 252 575 m -25 X s 252 587 m -25 X s 252 598 m -25 X s 278 609 m -51 X s
 gsave  2268 609 0 0 C 186.127 136.747 t 0 r /Helvetica findfont 45.7076 sf 0 0 m (0) show NC gr 
 gsave  2268 609 0 0 C 148.142 182.329 t 0 r /Helvetica findfont 45.7076 sf 0 0 m (0.2) show NC gr 
 gsave  2268 609 0 0 C 148.142 227.911 t 0 r /Helvetica findfont 45.7076 sf 0 0 m (0.4) show NC gr 
 gsave  2268 609 0 0 C 148.142 273.493 t 0 r /Helvetica findfont 45.7076 sf 0 0 m (0.6) show NC gr 
 gsave  2268 609 0 0 C 148.142 319.076 t 0 r /Helvetica findfont 45.7076 sf 0 0 m (0.8) show NC gr 
 gsave  2268 609 0 0 C 193.725 364.658 t 0 r /Helvetica findfont 45.7076 sf 0 0 m (1) show NC gr 
 gsave  2268 609 0 0 C 148.142 410.24 t 0 r /Helvetica findfont 45.7076 sf 0 0 m (1.2) show NC gr 
 gsave  2268 609 0 0 C 148.142 455.822 t 0 r /Helvetica findfont 45.7076 sf 0 0 m (1.4) show NC gr 
 gsave  2268 609 0 0 C 148.142 501.405 t 0 r /Helvetica findfont 45.7076 sf 0 0 m (1.6) show NC gr 
 gsave  2268 609 0 0 C 148.142 546.987 t 0 r /Helvetica findfont 45.7076 sf 0 0 m (1.8) show NC gr 
 gsave  2268 609 0 0 C 186.127 592.569 t 0 r /Helvetica findfont 45.7076 sf 0 0 m (2) show NC gr  236 152 m20 254 152 m20 272 152 m20 290 152 m20 308 152 m20 327 152 m20 345 152 m20 363 152 m20 381 152 m20 399 152 m20 417 152 m20 435 378 m20 454 378
 m20 472 381 m20 490 383 m20 508 384 m20 526 387 m20 544 388 m20 562 389 m20 581 389 m20 599 388 m20 617 388 m20 635 386 m20 653 387 m20 671 386 m20 689 388 m20 708 386 m20 726 383 m20 744 387 m20 762 385 m20 780 385 m20 798 386 m20 816 382 m20 835
 378 m20 853 379 m20 871 379 m20 889 375 m20 907 365 m20 925 370 m20 943 361 m20 962 350 m20 980 340 m20 998 297 m20 1016 288 m20 1034 155 m20 1107 584 m20 1125 546 m20 1143 456 m20 1161 482 m20 1179 409 m20 1197 413 m20 1215 454 m20 1234 393 m20
 1252 412 m20 1270 437 m20 1288 376 m20 1306 481 m20 1324 351 m20 1342 489 m20 1361 428 m20 1379 394 m20 1397 368 m20 1415 398 m20 1433 426 m20 1451 430 m20 1469 368 m20 1488 332 m20 1506 431 m20 1524 425 m20 1542 368 m20 1560 440 m20 1578 382 m20
 1596 447 m20 1615 360 m20 1633 481 m20 1651 388 m20 1669 324 m20 1687 355 m20 1705 336 m20 1723 395 m20 1742 386 m20 1760 365 m20 1778 380 m20 1796 418 m20 1814 387 m20 1832 430 m20 1850 372 m20 1869 319 m20 1887 290 m20 1905 479 m20 1923 374 m20
 1941 485 m20 1959 390 m20 1977 344 m20 1996 362 m20 2014 365 m20 2032 312 m20 cs 0 0 0 P13 setcolor 236 152 m 181 X 18 228 d 19 -1 d 18 3 d 18 2 d 18 1 d 18 3 d 18 1 d 18 1 d 37 X 18 -1 d 18 -1 d 18 1 d 18 -2 d 18 2 d 19 -1 d 18 -3 d 18 4 d 18 -2 d
 18 X 18 1 d 18 -4 d 19 -3 d 18 X 18 1 d 18 -4 d 18 -10 d 18 7 d 18 -9 d 19 -10 d 18 -9 d 18 -41 d 18 -3 d 18 -121 d 2 -30 d 23 X 11 457 d 37 X 18 -19 d 18 -102 d 18 31 d 18 -79 d 18 4 d 18 45 d 19 -66 d 18 22 d 18 27 d 18 -63 d 18 115 d 18 -145 d 18
 154 d 19 -69 d 18 -35 d 18 -26 d 18 32 d 18 34 d 18 5 d 18 -69 d 19 -39 d 18 111 d 18 -2 d 18 -65 d 18 84 d 18 -66 d 18 86 d 19 -109 d 18 141 d 18 -112 d 18 -68 d 18 35 d 18 -22 d 18 77 d 19 -20 d 18 -22 d 18 19 d 18 46 d 18 -33 d 18 59 d 18 -45 d
 19 -97 d 18 -32 d 18 241 d 18 -136 d 18 144 d 18 -115 d 18 -62 d 19 25 d 18 2 d 18 -56 d -125 Y -18 51 d -18 -4 d -19 -10 d -18 29 d -18 76 d -18 -80 d -18 75 d -18 -137 d -18 27 d -19 8 d -18 71 d -18 -26 d -18 28 d -18 -30 d -18 -11 d -18 20 d -19
 -3 d -18 -39 d -18 16 d -18 -27 d -18 59 d -18 74 d -18 -101 d -19 64 d -18 -43 d -18 51 d -18 -60 d -18 49 d -18 9 d -18 -88 d -19 34 d -18 55 d -18 -2 d -18 -22 d -18 -30 d -18 27 d -18 33 d -19 52 d -18 -122 d -18 115 d -18 -94 d -18 60 d -18 -23
 d -18 -17 d -19 56 d -18 -37 d -18 -3 d -18 66 d -18 -22 d -18 79 d -18 31 d -10 76 d -34 X -11 -457 d -18 X -18 121 d -18 16 d -18 44 d -18 12 d -19 12 d -18 9 d -18 -5 d -18 11 d -18 5 d -18 -1 d -18 X -19 3 d -18 4 d -18 X -18 1 d -18 2 d -18 -5
 d -18 4 d -19 1 d -18 -2 d -18 2 d -18 -1 d -18 2 d -18 X -18 1 d -19 X -18 -1 d -18 -1 d -18 -3 d -18 -1 d -18 -2 d -18 -3 d -19 X -18 -225 d -181 X FA
 gr  gr showpage
end
%%EOF
