%!PS-Adobe-2.0 EPSF-2.0
%%BoundingBox:  0 0 567 615
%%Title: Results/jvetopT.eps: VBF
%%Creator: ROOT Version 5.24/00
%%CreationDate: Tue Mar 19 15:31:11 2013
%%EndComments
%%BeginProlog
80 dict begin
/s {stroke} def /l {lineto} def /m {moveto} def /t {translate} def
/sw {stringwidth} def /r {rotate} def /rl {roll}  def /R {repeat} def
/d {rlineto} def /rm {rmoveto} def /gr {grestore} def /f {eofill} def
/c {setrgbcolor} def /black {0 setgray} def /sd {setdash} def
/cl {closepath} def /sf {scalefont setfont} def /lw {setlinewidth} def
/box {m dup 0 exch d exch 0 d 0 exch neg d cl} def
/NC{systemdict begin initclip end}def/C{NC box clip newpath}def
/bl {box s} def /bf {box f} def /Y { 0 exch d} def /X { 0 d} def 
/mp {newpath /y exch def /x exch def} def
/side {[w .77 mul w .23 mul] .385 w mul sd w 0 l currentpoint t -144 r} def
/mr {mp x y w2 0 360 arc} def /m24 {mr s} def /m20 {mr f} def
/mb {mp x y w2 add m w2 neg 0 d 0 w neg d w 0 d 0 w d cl} def
/mt {mp x y w2 add m w2 neg w neg d w 0 d cl} def
/m21 {mb f} def /m25 {mb s} def /m22 {mt f} def /m26{mt s} def
/m23 {mp x y w2 sub m w2 w d w neg 0 d cl f} def
/m27 {mp x y w2 add m w3 neg w2 neg d w3 w2 neg d w3 w2 d cl s} def
/m28 {mp x w2 sub y w2 sub w3 add m w3 0 d  0 w3 neg d w3 0 d 0 w3 d w3 0 d  0 w3 d w3 neg 0 d 0 w3 d w3 neg 0 d
 0 w3 neg d w3 neg 0 d cl s } def
/m29 {mp gsave x w2 sub y w2 add w3 sub m currentpoint t
 4 {side} repeat cl fill gr} def
/m30 {mp gsave x w2 sub y w2 add w3 sub m currentpoint t
 4 {side} repeat cl s gr} def
/m31 {mp x y w2 sub m 0 w d x w2 sub y m w 0 d x w2 sub y w2 add m w w neg d x w2 sub y w2
 sub m w w d s} def
/m2 {mp x y w2 sub m 0 w d x w2 sub y m w 0 d s} def
/m5 {mp x w2 sub y w2 sub m w w d x w2 sub y w2 add m w w neg d s} def
/reEncode {exch findfont dup length dict begin {1 index /FID eq  {pop pop} {def} ifelse } forall /Encoding exch def currentdict end dup /FontName get exch definefont pop } def [/Times-Bold /Times-Italic /Times-BoldItalic /Helvetica
 /Helvetica-Oblique /Helvetica-Bold /Helvetica-BoldOblique /Courier /Courier-Oblique /Courier-Bold /Courier-BoldOblique /Times-Roman /AvantGarde-Book /AvantGarde-BookOblique /AvantGarde-Demi /AvantGarde-DemiOblique /Bookman-Demi
 /Bookman-DemiItalic /Bookman-Light /Bookman-LightItalic /Helvetica-Narrow /Helvetica-Narrow-Bold /Helvetica-Narrow-BoldOblique /Helvetica-Narrow-Oblique /NewCenturySchlbk-Roman /NewCenturySchlbk-Bold
 /NewCenturySchlbk-BoldItalic /NewCenturySchlbk-Italic /Palatino-Bold /Palatino-BoldItalic /Palatino-Italic /Palatino-Roman ] {ISOLatin1Encoding reEncode } forall
/oshow {gsave [] 0 sd true charpath stroke gr} def
/stwn { /fs exch def /fn exch def /text exch def fn findfont fs sf
 text sw pop xs add /xs exch def} def
/stwb { /fs exch def /fn exch def /nbas exch def /textf exch deftextf length /tlen exch def nbas tlen gt {/nbas tlendef} iffn findfont fs sf textf dup length nbas sub nbas getinterval sw
pop neg xs add /xs exch def} def
%%EndProlog
%%BeginSetup
%%EndSetup
newpath  gsave  .25 .25 scale  gsave  0 0 t black[  ] 0 sd 3 lw 1 1 1 c 2268 2460 0 0 bf black 1 1 1 c 2177 1058 45 1353 bf black 1 1 1 c 1677 846 328 1459 bf black 1677 846 328 1459 bl 1 1 1 c 1677 846 328 1459 bf black 1677 846 328 1459 bl 0.8 0 0
 c[  12 12 ] 0 sd 6 lw 1 1 1 c black 0.8 0 0 c 328 1459 m 80 X 772 Y 40 X -28 Y 40 X -23 Y 40 X -18 Y 40 X -18 Y 40 X -14 Y 40 X -15 Y 40 X -34 Y 39 X -19 Y 40 X -12 Y 40 X -34 Y 40 X 1 Y 40 X -33 Y 40 X -25 Y 40 X -17 Y 40 X -35 Y 40 X -2 Y 40 X
 -14 Y 40 X -38 Y 40 X 10 Y 39 X -16 Y 40 X 10 Y 40 X -65 Y 40 X -2 Y 40 X -11 Y 40 X -59 Y 40 X 18 Y 80 X -89 Y 40 X 38 Y 40 X -109 Y 39 X 80 Y 40 X -9 Y 40 X -71 Y 40 X 52 Y 40 X -91 Y 40 X 80 Y 40 X -59 Y 40 X -21 Y 40 X -80 Y 40 X s black[  
] 0 sd 3 lw 328 1459 m 1677 X s 427 1483 m -24 Y s 466 1471 m -12 Y s 506 1471 m -12 Y s 545 1471 m -12 Y s 585 1471 m -12 Y s 624 1483 m -24 Y s 664 1471 m -12 Y s 703 1471 m -12 Y s 743 1471 m -12 Y s 782 1471 m -12 Y s 821 1483 m -24 Y s 861 1471
 m -12 Y s 900 1471 m -12 Y s 940 1471 m -12 Y s 979 1471 m -12 Y s 1019 1483 m -24 Y s 1058 1471 m -12 Y s 1097 1471 m -12 Y s 1137 1471 m -12 Y s 1176 1471 m -12 Y s 1216 1483 m -24 Y s 1255 1471 m -12 Y s 1295 1471 m -12 Y s 1334 1471 m -12 Y s
 1374 1471 m -12 Y s 1413 1483 m -24 Y s 1452 1471 m -12 Y s 1492 1471 m -12 Y s 1531 1471 m -12 Y s 1571 1471 m -12 Y s 1610 1483 m -24 Y s 1650 1471 m -12 Y s 1689 1471 m -12 Y s 1729 1471 m -12 Y s 1768 1471 m -12 Y s 1807 1483 m -24 Y s 1847
 1471 m -12 Y s 1886 1471 m -12 Y s 1926 1471 m -12 Y s 1965 1471 m -12 Y s 2005 1483 m -24 Y s 427 1483 m -24 Y s 388 1471 m -12 Y s 348 1471 m -12 Y s 2005 1483 m -24 Y s
 gsave  2177 1058 45 1353 C 423 1453 t 0 r /Helvetica findfont 2.53676 sf 0 0 m (20) show NC gr 
 gsave  2177 1058 45 1353 C 620 1453 t 0 r /Helvetica findfont 2.53676 sf 0 0 m (30) show NC gr 
 gsave  2177 1058 45 1353 C 817 1453 t 0 r /Helvetica findfont 2.53676 sf 0 0 m (40) show NC gr 
 gsave  2177 1058 45 1353 C 1015 1453 t 0 r /Helvetica findfont 2.53676 sf 0 0 m (50) show NC gr 
 gsave  2177 1058 45 1353 C 1212 1453 t 0 r /Helvetica findfont 2.53676 sf 0 0 m (60) show NC gr 
 gsave  2177 1058 45 1353 C 1410 1453 t 0 r /Helvetica findfont 2.53676 sf 0 0 m (70) show NC gr 
 gsave  2177 1058 45 1353 C 1607 1453 t 0 r /Helvetica findfont 2.53676 sf 0 0 m (80) show NC gr 
 gsave  2177 1058 45 1353 C 1805 1453 t 0 r /Helvetica findfont 2.53676 sf 0 0 m (90) show NC gr 
 gsave  2177 1058 45 1353 C 2002 1453 t 0 r /Helvetica findfont 2.53676 sf 0 0 m (100) show NC gr  328 1459 m 846 Y s
 gsave  2177 1058 45 1353 C 223 2149 t 90 r /Helvetica findfont 48.1984 sf 0 0 m ([pb/bin]) show NC gr  354 1468 m -26 X s 354 1481 m -26 X s 381 1493 m -53 X s
 gsave  2177 1058 45 1353 C 286 1496 t 0 r /Helvetica findfont 30.4411 sf 0 0 m (\2555) show NC gr 
 gsave  2177 1058 45 1353 C 235 1476 t 0 r /Helvetica findfont 45.6617 sf 0 0 m (10) show NC gr  354 1573 m -26 X s 354 1620 m -26 X s 354 1653 m -26 X s 354 1679 m -26 X s 354 1700 m -26 X s 354 1718 m -26 X s 354 1733 m -26 X s 354 1747 m -26 X s
 381 1759 m -53 X s
 gsave  2177 1058 45 1353 C 286 1756 t 0 r /Helvetica findfont 30.4411 sf 0 0 m (\2554) show NC gr 
 gsave  2177 1058 45 1353 C 235 1739 t 0 r /Helvetica findfont 45.6617 sf 0 0 m (10) show NC gr  354 1839 m -26 X s 354 1886 m -26 X s 354 1919 m -26 X s 354 1945 m -26 X s 354 1966 m -26 X s 354 1984 m -26 X s 354 1999 m -26 X s 354 2013 m -26 X s
 381 2025 m -53 X s
 gsave  2177 1058 45 1353 C 286 2025 t 0 r /Helvetica findfont 30.4411 sf 0 0 m (\2553) show NC gr 
 gsave  2177 1058 45 1353 C 235 2004 t 0 r /Helvetica findfont 45.6617 sf 0 0 m (10) show NC gr  354 2105 m -26 X s 354 2152 m -26 X s 354 2185 m -26 X s 354 2210 m -26 X s 354 2232 m -26 X s 354 2249 m -26 X s 354 2265 m -26 X s 354 2278 m -26 X s
 381 2290 m -53 X s
 gsave  2177 1058 45 1353 C 286 2288 t 0 r /Helvetica findfont 30.4411 sf 0 0 m (\2552) show NC gr 
 gsave  2177 1058 45 1353 C 235 2270 t 0 r /Helvetica findfont 45.6617 sf 0 0 m (10) show NC gr  6 lw 1 1 1 c black 328 1459 m 80 X 739 Y 40 X -29 Y 40 X -16 Y 40 X -16 Y 40 X -9 Y 40 X -24 Y 40 X -26 Y 40 X -7 Y 39 X -18 Y 40 X -26 Y 40 X -10 Y 40
 X -14 Y 40 X -15 Y 40 X -24 Y 40 X 4 Y 40 X -24 Y 40 X -37 Y 40 X -14 Y 40 X -6 Y 40 X -73 Y 39 X 23 Y 40 X 14 Y 40 X -100 Y 40 X 40 Y 40 X -40 Y 40 X -15 Y 40 X -32 Y 40 X 47 Y 40 X -11 Y 40 X -80 Y 40 X -73 Y 39 X 47 Y 40 X -33 Y 40 X 12 Y 40 X
 -41 Y 80 X -39 Y 40 X -26 Y 40 X 47 Y 40 X -95 Y 40 X s 0.2 0.2 0.8 c[ 20 12 4 12] 0 sd 1 1 1 c black 0.2 0.2 0.8 c 328 1459 m 80 X 749 Y 40 X -17 Y 40 X -25 Y 40 X -8 Y 40 X -34 Y 40 X -4 Y 40 X -20 Y 40 X -13 Y 39 X -28 Y 40 X -34 Y 40 X 10 Y 40
 X -37 Y 40 X 1 Y 40 X -52 Y 40 X 17 Y 40 X -40 Y 40 X -21 Y 40 X -2 Y 40 X -15 Y 40 X -19 Y 39 X 5 Y 40 X -80 Y 40 X 3 Y 80 X -27 Y 40 X -86 Y 40 X 55 Y 40 X -13 Y 80 X -136 Y 40 X 14 Y 39 X 113 Y 40 X -101 Y 40 X -26 Y 40 X -54 Y 40 X 21 Y 40 X 59
 Y 40 X -59 Y 40 X -21 Y 40 X 21 Y 40 X -96 Y s black
 gsave  2177 1058 45 1353 C 445 1516 t 0 r /Helvetica findfont 58.3455 sf 0 0 m (VBF Higgs \(125 GeV\) @ LHC 8 TeV) show NC gr 
 gsave  2177 1058 45 1353 C 2048 1946 t 90 r /Helvetica-BoldOblique findfont 30.4411 sf 0 0 m (LHC HIGGS XS WG 2013) show NC gr  1 1 1 c[  ] 0 sd 3 lw 588 243 1417 2041 bf black
 gsave  2177 1058 45 1353 C 1562 2230 t 0 r /Helvetica findfont 45.6617 sf 0 0 m (aMC@NLO+HW6) show NC gr  1 1 1 c 1439 2215 m 103 X 57 Y -103 X f black 6 lw 1439 2243 m 103 X s 3 lw /w 29 def /w2 {w 2 div} def /w3 {w 3 div} def 1490 2243 m20 6 lw
 gsave  2177 1058 45 1353 C 1562 2149 t 0 r /Helvetica findfont 45.6617 sf 0 0 m (aMC@NLO+PY6) show NC gr  1 1 1 c 3 lw 1439 2134 m 103 X 57 Y -103 X f 6 lw 0.8 0 0 c[  12 12 ] 0 sd 1439 2162 m 103 X s black[  ] 0 sd 3 lw 1490 2162 m20[  12 12 
] 0 sd 6 lw
 gsave  2177 1058 45 1353 C 1562 2068 t 0 r /Helvetica findfont 45.6617 sf 0 0 m (aMC@NLO+HWPP) show NC gr  1 1 1 c[  ] 0 sd 3 lw 1439 2053 m 103 X 57 Y -103 X f[  12 12 ] 0 sd 6 lw 0.2 0.2 0.8 c[ 20 12 4 12] 0 sd 1439 2081 m 103 X s black[  ] 0 sd
 3 lw 1490 2081 m20[ 20 12 4 12] 0 sd 6 lw[  ] 0 sd 3 lw 1 1 1 c black 1 1 1 c 1677 267 328 1184 bf black 1677 267 328 1184 bl 1 1 1 c 1677 267 328 1184 bf black 1677 267 328 1184 bl 328 1184 m 1677 X s 427 1211 m -27 Y s 466 1197 m -13 Y s 506 1197
 m -13 Y s 545 1197 m -13 Y s 585 1197 m -13 Y s 624 1211 m -27 Y s 664 1197 m -13 Y s 703 1197 m -13 Y s 743 1197 m -13 Y s 782 1197 m -13 Y s 821 1211 m -27 Y s 861 1197 m -13 Y s 900 1197 m -13 Y s 940 1197 m -13 Y s 979 1197 m -13 Y s 1019 1211
 m -27 Y s 1058 1197 m -13 Y s 1097 1197 m -13 Y s 1137 1197 m -13 Y s 1176 1197 m -13 Y s 1216 1211 m -27 Y s 1255 1197 m -13 Y s 1295 1197 m -13 Y s 1334 1197 m -13 Y s 1374 1197 m -13 Y s 1413 1211 m -27 Y s 1452 1197 m -13 Y s 1492 1197 m -13 Y
 s 1531 1197 m -13 Y s 1571 1197 m -13 Y s 1610 1211 m -27 Y s 1650 1197 m -13 Y s 1689 1197 m -13 Y s 1729 1197 m -13 Y s 1768 1197 m -13 Y s 1807 1211 m -27 Y s 1847 1197 m -13 Y s 1886 1197 m -13 Y s 1926 1197 m -13 Y s 1965 1197 m -13 Y s 2005
 1211 m -27 Y s 427 1211 m -27 Y s 388 1197 m -13 Y s 348 1197 m -13 Y s
 gsave  2177 270 45 1181 C 400 1144 t 0 r /Helvetica findfont 45.9522 sf 0 0 m (20) show NC gr 
 gsave  2177 270 45 1181 C 597 1144 t 0 r /Helvetica findfont 45.9522 sf 0 0 m (30) show NC gr 
 gsave  2177 270 45 1181 C 795 1144 t 0 r /Helvetica findfont 45.9522 sf 0 0 m (40) show NC gr 
 gsave  2177 270 45 1181 C 992 1144 t 0 r /Helvetica findfont 45.9522 sf 0 0 m (50) show NC gr 
 gsave  2177 270 45 1181 C 1190 1144 t 0 r /Helvetica findfont 45.9522 sf 0 0 m (60) show NC gr 
 gsave  2177 270 45 1181 C 1387 1144 t 0 r /Helvetica findfont 45.9522 sf 0 0 m (70) show NC gr 
 gsave  2177 270 45 1181 C 1584 1144 t 0 r /Helvetica findfont 45.9522 sf 0 0 m (80) show NC gr 
 gsave  2177 270 45 1181 C 1782 1144 t 0 r /Helvetica findfont 45.9522 sf 0 0 m (90) show NC gr 
 gsave  2177 270 45 1181 C 1967 1144 t 0 r /Helvetica findfont 45.9522 sf 0 0 m (100) show NC gr  328 1184 m 267 Y s 393 1228 m -65 X s 361 1251 m -33 X s 361 1273 m -33 X s 361 1295 m -33 X s 393 1317 m -65 X s 361 1340 m -33 X s 361 1362 m -33 X s
 361 1384 m -33 X s 393 1407 m -65 X s 393 1228 m -65 X s 361 1206 m -33 X s 361 1184 m -33 X s 393 1407 m -65 X s 361 1429 m -33 X s
 gsave  2177 270 45 1181 C 253 1212 t 0 r /Helvetica findfont 45.9522 sf 0 0 m (0.8) show NC gr 
 gsave  2177 270 45 1181 C 299 1301 t 0 r /Helvetica findfont 45.9522 sf 0 0 m (1) show NC gr 
 gsave  2177 270 45 1181 C 253 1389 t 0 r /Helvetica findfont 45.9522 sf 0 0 m (1.2) show NC gr 
 gsave  2177 270 45 1181 C 425 1389 t 0 r /Helvetica findfont 38.2935 sf 0 0 m (aMC@NLO \255 Ratio over aMC@NLO+HW6) show NC gr  0.8 0 0 c[  12 12 ] 0 sd 6 lw 1 1 1 c black 0.8 0 0 c 328 1184 m 80 X 267 Y s 488 1451 m -15 Y s 488 1436 m 40 X -12 Y
 40 X -40 Y 40 X 45 Y 40 X 22 Y s 688 1451 m -93 Y s 688 1358 m 39 X -4 Y 40 X 63 Y 40 X -103 Y 40 X 62 Y 40 X -77 Y 80 X -73 Y 40 X -29 Y 40 X 111 Y 40 X 4 Y 40 X -110 Y 40 X 249 Y s 1206 1451 m -96 Y s 1206 1355 m 40 X -14 Y 40 X 110 Y s 1326 1451
 m -140 Y s 1326 1311 m 40 X 130 Y 40 X -181 Y 40 X 191 Y s 1486 1451 m -181 Y s 1486 1270 m 40 X -86 Y 40 X 251 Y 40 X -153 Y 39 X 138 Y 40 X 31 Y s 1725 1451 m -251 Y s 1725 1200 m 40 X 251 Y s 1805 1451 m -244 Y s 1805 1207 m 40 X 244 Y s 1925
 1451 m -188 Y s 1925 1263 m 40 X -79 Y 40 X s black[  ] 0 sd 1 1 1 c black 328 1184 m 80 X 133 Y 1597 X -133 Y s 0.2 0.2 0.8 c[ 20 12 4 12] 0 sd 1 1 1 c black 0.2 0.2 0.8 c 328 1184 m 80 X 173 Y 40 X 54 Y 40 X -41 Y 40 X 33 Y 40 X -102 Y 40 X 83 Y
 40 X 28 Y 40 X -28 Y 39 X -45 Y 40 X -30 Y 40 X 83 Y 40 X -92 Y 40 X 59 Y 40 X -102 Y 40 X 43 Y 40 X -53 Y 40 X 57 Y 40 X 45 Y 40 X -36 Y 40 X 138 Y s 1246 1451 m -267 Y s 1246 1184 m 40 X 267 Y s 1326 1451 m -120 Y s 1326 1331 m 40 X 58 Y 40 X
 -205 Y 40 X 267 Y s 1486 1451 m -225 Y s 1486 1226 m 40 X 35 Y 40 X -77 Y 40 X 193 Y 39 X 74 Y s 1685 1451 m -80 Y s 1685 1371 m 40 X -140 Y 40 X -38 Y 40 X 64 Y 40 X 194 Y s 1925 1451 m -205 Y s 1925 1246 m 40 X 205 Y s 2005 1451 m -267 Y s black[
 20 20] 0 sd 3 lw 328 1317 m 1677 X s[  ] 0 sd 1 1 1 c black 1 1 1 c 1677 292 328 889 bf black 1677 292 328 889 bl 1 1 1 c 1677 292 328 889 bf black 1677 292 328 889 bl 328 889 m 1677 X s 427 918 m -29 Y s 466 903 m -14 Y s 506 903 m -14 Y s 545 903
 m -14 Y s 585 903 m -14 Y s 624 918 m -29 Y s 664 903 m -14 Y s 703 903 m -14 Y s 743 903 m -14 Y s 782 903 m -14 Y s 821 918 m -29 Y s 861 903 m -14 Y s 900 903 m -14 Y s 940 903 m -14 Y s 979 903 m -14 Y s 1019 918 m -29 Y s 1058 903 m -14 Y s
 1097 903 m -14 Y s 1137 903 m -14 Y s 1176 903 m -14 Y s 1216 918 m -29 Y s 1255 903 m -14 Y s 1295 903 m -14 Y s 1334 903 m -14 Y s 1374 903 m -14 Y s 1413 918 m -29 Y s 1452 903 m -14 Y s 1492 903 m -14 Y s 1531 903 m -14 Y s 1571 903 m -14 Y s
 1610 918 m -29 Y s 1650 903 m -14 Y s 1689 903 m -14 Y s 1729 903 m -14 Y s 1768 903 m -14 Y s 1807 918 m -29 Y s 1847 903 m -14 Y s 1886 903 m -14 Y s 1926 903 m -14 Y s 1965 903 m -14 Y s 2005 918 m -29 Y s 427 918 m -29 Y s 388 903 m -14 Y s 348
 903 m -14 Y s
 gsave  2177 295 45 886 C 400 850 t 0 r /Helvetica findfont 45.8082 sf 0 0 m (20) show NC gr 
 gsave  2177 295 45 886 C 597 850 t 0 r /Helvetica findfont 45.8082 sf 0 0 m (30) show NC gr 
 gsave  2177 295 45 886 C 795 850 t 0 r /Helvetica findfont 45.8082 sf 0 0 m (40) show NC gr 
 gsave  2177 295 45 886 C 992 850 t 0 r /Helvetica findfont 45.8082 sf 0 0 m (50) show NC gr 
 gsave  2177 295 45 886 C 1190 850 t 0 r /Helvetica findfont 45.8082 sf 0 0 m (60) show NC gr 
 gsave  2177 295 45 886 C 1387 850 t 0 r /Helvetica findfont 45.8082 sf 0 0 m (70) show NC gr 
 gsave  2177 295 45 886 C 1584 850 t 0 r /Helvetica findfont 45.8082 sf 0 0 m (80) show NC gr 
 gsave  2177 295 45 886 C 1782 850 t 0 r /Helvetica findfont 45.8082 sf 0 0 m (90) show NC gr 
 gsave  2177 295 45 886 C 1967 850 t 0 r /Helvetica findfont 45.8082 sf 0 0 m (100) show NC gr  328 889 m 292 Y s 393 937 m -65 X s 361 962 m -33 X s 361 986 m -33 X s 361 1010 m -33 X s 393 1035 m -65 X s 361 1059 m -33 X s 361 1083 m -33 X s 361
 1108 m -33 X s 393 1132 m -65 X s 393 937 m -65 X s 361 913 m -33 X s 361 889 m -33 X s 393 1132 m -65 X s 361 1156 m -33 X s
 gsave  2177 295 45 886 C 253 921 t 0 r /Helvetica findfont 45.8082 sf 0 0 m (0.8) show NC gr 
 gsave  2177 295 45 886 C 299 1017 t 0 r /Helvetica findfont 45.8082 sf 0 0 m (1) show NC gr 
 gsave  2177 295 45 886 C 253 1116 t 0 r /Helvetica findfont 45.8082 sf 0 0 m (1.2) show NC gr 
 gsave  2177 295 45 886 C 425 1114 t 0 r /Helvetica findfont 38.1735 sf 0 0 m (POWHEG \255 Ratio over aMC@NLO+HW6) show NC gr  0.8 0 0 c[  12 12 ] 0 sd 6 lw 1 1 1 c black 0.8 0 0 c 328 889 m 84 X 151 Y 42 X 55 Y 42 X -28 Y 42 X -91 Y 42 X 40 Y 42 X
 -3 Y 42 X 33 Y 42 X -54 Y 41 X -23 Y 42 X 24 Y 42 X -51 Y 42 X 28 Y 42 X 70 Y 42 X -122 Y 42 X 263 Y s 1041 1181 m -166 Y s 1041 1015 m 42 X -62 Y 42 X -60 Y 42 X 288 Y s 1208 1181 m -178 Y s 1208 1003 m 42 X -114 Y 42 X 271 Y 42 X -232 Y 42 X 253
 Y s 1418 1181 m -285 Y s 1418 896 m 42 X 146 Y 42 X -118 Y 42 X -35 Y 83 X 292 Y s 1711 1181 m -12 Y s 1711 1169 m 42 X -280 Y 84 X 125 Y 42 X -125 Y 126 X s black[  ] 0 sd 1 1 1 c black 328 889 m 84 X 89 Y 42 X 48 Y 42 X -52 Y 42 X -33 Y 42 X -30
 Y 42 X 21 Y 42 X 41 Y 42 X -58 Y 41 X -10 Y 42 X 43 Y 42 X -18 Y 42 X -21 Y 42 X -20 Y 84 X 292 Y s 1041 1181 m -292 Y s 1041 889 m 42 X 66 Y 42 X -66 Y 42 X 193 Y 41 X -144 Y 42 X -49 Y 42 X 61 Y 42 X -61 Y 84 X 197 Y 42 X -113 Y 42 X -84 Y 125 X
 49 Y 42 X 243 Y s 1711 1181 m -243 Y s 1711 938 m 42 X 243 Y s 1795 1181 m -292 Y s 1795 889 m 84 X 49 Y 42 X -49 Y 84 X s 0.2 0.2 0.8 c[ 20 12 4 12] 0 sd 1 1 1 c black 0.2 0.2 0.8 c 328 889 m 84 X 101 Y 42 X 23 Y 42 X 33 Y 42 X -73 Y 42 X -39 Y 42
 X 4 Y 42 X 34 Y 42 X -83 Y 41 X 2 Y 42 X 52 Y 42 X -18 Y 42 X -5 Y 42 X -7 Y 42 X -24 Y 42 X 233 Y 42 X -233 Y 126 X 217 Y 41 X -217 Y 84 X 129 Y 42 X -129 Y 84 X 87 Y 42 X -40 Y 42 X -47 Y 84 X 176 Y 41 X -176 Y 42 X 292 Y s 1711 1181 m -292 Y s
 1711 889 m 126 X 124 Y 42 X -78 Y 42 X -46 Y 42 X 292 Y s black[ 20 20] 0 sd 3 lw 328 1035 m 1677 X s[  ] 0 sd 1 1 1 c black 1 1 1 c 1677 276 328 610 bf black 1677 276 328 610 bl 1 1 1 c 1677 276 328 610 bf black 1677 276 328 610 bl 328 610 m 1677
 X s
 gsave  2177 394 45 492 C 1878 511 t 0 r /Helvetica findfont 45.7096 sf 0 0 m ( [GeV]) show NC gr 
 gsave  2177 394 45 492 C 1858 488 t 0 r /Helvetica findfont 30.4731 sf 0 0 m (T) show NC gr 
 gsave  2177 394 45 492 C 1721 511 t 0 r /Helvetica findfont 45.7096 sf 0 0 m (jveto p) show NC gr  427 634 m -24 Y s 466 622 m -12 Y s 506 622 m -12 Y s 545 622 m -12 Y s 585 622 m -12 Y s 624 634 m -24 Y s 664 622 m -12 Y s 703 622 m -12 Y s 743
 622 m -12 Y s 782 622 m -12 Y s 821 634 m -24 Y s 861 622 m -12 Y s 900 622 m -12 Y s 940 622 m -12 Y s 979 622 m -12 Y s 1019 634 m -24 Y s 1058 622 m -12 Y s 1097 622 m -12 Y s 1137 622 m -12 Y s 1176 622 m -12 Y s 1216 634 m -24 Y s 1255 622 m
 -12 Y s 1295 622 m -12 Y s 1334 622 m -12 Y s 1374 622 m -12 Y s 1413 634 m -24 Y s 1452 622 m -12 Y s 1492 622 m -12 Y s 1531 622 m -12 Y s 1571 622 m -12 Y s 1610 634 m -24 Y s 1650 622 m -12 Y s 1689 622 m -12 Y s 1729 622 m -12 Y s 1768 622 m
 -12 Y s 1807 634 m -24 Y s 1847 622 m -12 Y s 1886 622 m -12 Y s 1926 622 m -12 Y s 1965 622 m -12 Y s 2005 634 m -24 Y s 427 634 m -24 Y s 388 622 m -12 Y s 348 622 m -12 Y s
 gsave  2177 394 45 492 C 400 564 t 0 r /Helvetica findfont 45.7096 sf 0 0 m (20) show NC gr 
 gsave  2177 394 45 492 C 597 564 t 0 r /Helvetica findfont 45.7096 sf 0 0 m (30) show NC gr 
 gsave  2177 394 45 492 C 795 564 t 0 r /Helvetica findfont 45.7096 sf 0 0 m (40) show NC gr 
 gsave  2177 394 45 492 C 992 564 t 0 r /Helvetica findfont 45.7096 sf 0 0 m (50) show NC gr 
 gsave  2177 394 45 492 C 1190 564 t 0 r /Helvetica findfont 45.7096 sf 0 0 m (60) show NC gr 
 gsave  2177 394 45 492 C 1387 564 t 0 r /Helvetica findfont 45.7096 sf 0 0 m (70) show NC gr 
 gsave  2177 394 45 492 C 1584 564 t 0 r /Helvetica findfont 45.7096 sf 0 0 m (80) show NC gr 
 gsave  2177 394 45 492 C 1782 564 t 0 r /Helvetica findfont 45.7096 sf 0 0 m (90) show NC gr 
 gsave  2177 394 45 492 C 1967 564 t 0 r /Helvetica findfont 45.7096 sf 0 0 m (100) show NC gr  328 610 m 276 Y s 374 656 m -46 X s 351 679 m -23 X s 351 702 m -23 X s 351 725 m -23 X s 374 748 m -46 X s 351 771 m -23 X s 351 794 m -23 X s 351 817 m
 -23 X s 374 840 m -46 X s 374 656 m -46 X s 351 633 m -23 X s 351 610 m -23 X s 374 840 m -46 X s 351 863 m -23 X s
 gsave  2177 394 45 492 C 253 640 t 0 r /Helvetica findfont 45.7096 sf 0 0 m (0.8) show NC gr 
 gsave  2177 394 45 492 C 299 731 t 0 r /Helvetica findfont 45.7096 sf 0 0 m (1) show NC gr 
 gsave  2177 394 45 492 C 253 823 t 0 r /Helvetica findfont 45.7096 sf 0 0 m (1.2) show NC gr  0.8 0 0 c
 gsave  2177 394 45 492 C 425 833 t 0 r /Helvetica findfont 43.1702 sf 0 0 m (Scale uncert) show NC gr  black
 gsave  2177 394 45 492 C 425 658 t 0 r /Helvetica findfont 43.1702 sf 0 0 m (PDF uncert) show NC gr  0.8 0 0 c[  12 12 ] 0 sd 6 lw 1 1 1 c black 0.8 0 0 c 328 610 m 80 X 209 Y 40 X -12 Y 40 X 20 Y 40 X -4 Y 40 X -40 Y 40 X 42 Y 40 X -5 Y 40 X -6 Y
 39 X -13 Y 40 X 16 Y 40 X 17 Y 40 X -34 Y 40 X 28 Y 40 X 12 Y 40 X 8 Y 40 X -15 Y 40 X 12 Y 40 X 3 Y 80 X -40 Y 39 X 3 Y 40 X 24 Y 40 X -20 Y 40 X 8 Y 40 X -29 Y 40 X 8 Y 40 X 40 Y 40 X -15 Y 40 X 26 Y 40 X 24 Y 40 X -8 Y 39 X 4 Y 40 X 13 Y s 1725
 886 m -92 Y s 1725 794 m 40 X 3 Y 40 X 21 Y 40 X -10 Y 40 X 73 Y 40 X -32 Y 40 X -35 Y 40 X -204 Y s 1 1 1 c black 0.8 0 0 c 328 610 m 80 X 83 Y 40 X 8 Y 40 X -13 Y 40 X 2 Y 40 X 28 Y 40 X -28 Y 40 X 3 Y 40 X 3 Y 39 X 11 Y 40 X -12 Y 40 X -12 Y 40
 X 24 Y 40 X -19 Y 40 X -7 Y 40 X -6 Y 40 X 9 Y 40 X -7 Y 40 X -1 Y 40 X -1 Y 40 X 25 Y 39 X -1 Y 40 X -17 Y 40 X 13 Y 40 X -7 Y 40 X 25 Y 40 X -10 Y 40 X -23 Y 40 X 13 Y 40 X -21 Y 40 X -15 Y 40 X 10 Y 39 X 1 Y 40 X -23 Y 40 X 63 Y 40 X 12 Y 40 X
 -21 Y 40 X -25 Y 40 X -14 Y 40 X 15 Y 40 X 12 Y 40 X -77 Y s black[ 12 16 4 16] 0 sd 1 1 1 c black 328 610 m 80 X 130 Y 120 X -1 Y 40 X -7 Y 40 X 8 Y 119 X -1 Y 40 X 1 Y 40 X -1 Y 40 X -35 Y 40 X 35 Y 40 X 1 Y 80 X -1 Y 40 X 1 Y 40 X -1 Y 80 X 1 Y
 39 X -1 Y 40 X 1 Y 40 X -4 Y 40 X 3 Y 80 X -3 Y 40 X 2 Y 40 X 1 Y 40 X -2 Y 40 X 2 Y 40 X -4 Y 79 X 2 Y 40 X -3 Y 40 X 1 Y 40 X 2 Y 40 X -4 Y 40 X -7 Y 40 X 13 Y 40 X -79 Y 40 X -50 Y s 1 1 1 c black 328 610 m 80 X 149 Y 160 X 9 Y 40 X -9 Y 119 X 1
 Y 120 X 33 Y 40 X -33 Y 40 X -1 Y 40 X 1 Y 80 X -1 Y 40 X 1 Y 80 X -2 Y 39 X 2 Y 40 X -1 Y 120 X 2 Y 40 X 1 Y 40 X -1 Y 40 X -1 Y 40 X 1 Y 40 X -1 Y 40 X 4 Y 39 X -1 Y 40 X -2 Y 40 X 7 Y 40 X -2 Y 40 X -3 Y 40 X 4 Y 40 X 4 Y 40 X -9 Y 40 X 93 Y 40
 X -245 Y s[ 20 20] 0 sd 3 lw 328 748 m 1677 X s
 gr  gr 
showpage
end
%%EOF
