%!PS-Adobe-1.0
%%Creator: Unified Graphics System
%%Pages: (atend)
%%DocumentFonts: Helvetica
%%BoundingBox:   39   84  469  416
%%EndComments
/Sw{setlinewidth}def
/Sg{setgray}def
/Sd{setdash}def
/P {newpath
    moveto
0 0 rlineto
    stroke}def
/M {moveto}def
/D {lineto}def
/N {newpath}def
/S {stroke}def
/T {/Helvetica findfont
    exch
    scalefont
    setfont}def
/R {rotate}def
/W {show}def
/F {fill}def
/X {gsave}def
/Y {grestore}def
%%EndProlog
%%Page: 1 1
0.12000 0.12000 scale
1 setlinecap
1 setlinejoin
4 Sw
0.00 0.00 0.00 setrgbcolor
[] 0 Sd
N
2105 822 M
2105 730 D
S
N
2159 782 M
2156 779 D
2159 776 D
2162 779 D
2162 782 D
2156 787 D
2151 790 D
2142 790 D
2133 787 D
2128 782 D
2125 773 D
2125 767 D
2128 758 D
2133 753 D
2142 750 D
2148 750 D
2156 753 D
2162 758 D
S
N
2142 790 M
2136 787 D
2130 782 D
2128 773 D
2128 767 D
2130 758 D
2136 753 D
2142 750 D
S
N
2197 790 M
2188 787 D
2182 782 D
2179 773 D
2179 767 D
2182 758 D
2188 753 D
2197 750 D
2203 750 D
2211 753 D
2217 758 D
2220 767 D
2220 773 D
2217 782 D
2211 787 D
2203 790 D
2197 790 D
S
N
2197 790 M
2191 787 D
2185 782 D
2182 773 D
2182 767 D
2185 758 D
2191 753 D
2197 750 D
S
N
2203 750 M
2208 753 D
2214 758 D
2217 767 D
2217 773 D
2214 782 D
2208 787 D
2203 790 D
S
N
2266 784 M
2269 790 D
2269 779 D
2266 784 D
2263 787 D
2257 790 D
2246 790 D
2240 787 D
2237 784 D
2237 779 D
2240 776 D
2246 773 D
2260 767 D
2266 764 D
2269 761 D
S
N
2237 782 M
2240 779 D
2246 776 D
2260 770 D
2266 767 D
2269 764 D
2269 756 D
2266 753 D
2260 750 D
2249 750 D
2243 753 D
2240 756 D
2237 761 D
2237 750 D
2240 756 D
S
N
2309 810 M
2301 807 D
2295 799 D
2292 793 D
2289 784 D
2286 770 D
2286 758 D
2289 753 D
2295 750 D
2301 750 D
2309 753 D
2315 761 D
2318 767 D
2321 776 D
2324 790 D
2324 802 D
2321 807 D
2315 810 D
2309 810 D
S
N
2309 810 M
2303 807 D
2298 799 D
2295 793 D
2292 784 D
2289 770 D
2289 758 D
2292 753 D
2295 750 D
S
N
2301 750 M
2306 753 D
2312 761 D
2315 767 D
2318 776 D
2321 790 D
2321 802 D
2318 807 D
2315 810 D
S
N
2292 782 M
2318 782 D
S
N
2368 854 M
2394 793 D
S
N
2394 854 M
2368 793 D
S
N
2351 836 M
2412 810 D
S
N
2412 836 M
2351 810 D
S
N
2442 822 M
2442 730 D
S
N
402 1647 M
463 1647 D
S
N
402 1649 M
463 1649 D
S
N
431 1647 M
425 1641 D
423 1635 D
423 1629 D
425 1621 D
431 1615 D
440 1612 D
446 1612 D
454 1615 D
460 1621 D
463 1629 D
463 1635 D
460 1641 D
454 1647 D
S
N
423 1629 M
425 1623 D
431 1618 D
440 1615 D
446 1615 D
454 1618 D
460 1623 D
463 1629 D
S
N
402 1638 M
402 1649 D
S
N
463 1647 M
463 1658 D
S
N
423 1719 M
423 1690 D
425 1681 D
434 1675 D
443 1672 D
451 1672 D
457 1675 D
460 1678 D
463 1684 D
463 1690 D
460 1698 D
451 1704 D
443 1707 D
434 1707 D
428 1704 D
425 1701 D
423 1696 D
S
N
423 1690 M
425 1684 D
434 1678 D
443 1675 D
454 1675 D
460 1678 D
S
N
463 1690 M
460 1696 D
451 1701 D
443 1704 D
431 1704 D
425 1701 D
S
N
425 1701 M
425 1719 D
S
N
391 1782 M
483 1730 D
S
N
402 1831 M
463 1831 D
S
N
402 1834 M
463 1834 D
S
N
431 1831 M
425 1825 D
423 1820 D
423 1814 D
425 1805 D
431 1799 D
440 1796 D
446 1796 D
454 1799 D
460 1805 D
463 1814 D
463 1820 D
460 1825 D
454 1831 D
S
N
423 1814 M
425 1808 D
431 1802 D
440 1799 D
446 1799 D
454 1802 D
460 1808 D
463 1814 D
S
N
402 1822 M
402 1834 D
S
N
463 1831 M
463 1843 D
S
N
391 1906 M
483 1906 D
S
N
431 1961 M
434 1958 D
437 1961 D
434 1964 D
431 1964 D
425 1958 D
423 1952 D
423 1944 D
425 1935 D
431 1929 D
440 1926 D
446 1926 D
454 1929 D
460 1935 D
463 1944 D
463 1949 D
460 1958 D
454 1964 D
S
N
423 1944 M
425 1938 D
431 1932 D
440 1929 D
446 1929 D
454 1932 D
460 1938 D
463 1944 D
S
N
423 1998 M
425 1990 D
431 1984 D
440 1981 D
446 1981 D
454 1984 D
460 1990 D
463 1998 D
463 2004 D
460 2013 D
454 2018 D
446 2021 D
440 2021 D
431 2018 D
425 2013 D
423 2004 D
423 1998 D
S
N
423 1998 M
425 1993 D
431 1987 D
440 1984 D
446 1984 D
454 1987 D
460 1993 D
463 1998 D
S
N
463 2004 M
460 2010 D
454 2016 D
446 2018 D
440 2018 D
431 2016 D
425 2010 D
423 2004 D
S
N
428 2067 M
423 2070 D
434 2070 D
428 2067 D
425 2065 D
423 2059 D
423 2047 D
425 2042 D
428 2039 D
434 2039 D
437 2042 D
440 2047 D
446 2062 D
449 2067 D
451 2070 D
S
N
431 2039 M
434 2042 D
437 2047 D
443 2062 D
446 2067 D
449 2070 D
457 2070 D
460 2067 D
463 2062 D
463 2050 D
460 2044 D
457 2042 D
451 2039 D
463 2039 D
457 2042 D
S
N
402 2111 M
405 2102 D
414 2096 D
420 2093 D
428 2091 D
443 2088 D
454 2088 D
460 2091 D
463 2096 D
463 2102 D
460 2111 D
451 2117 D
446 2119 D
437 2122 D
423 2125 D
411 2125 D
405 2122 D
402 2117 D
402 2111 D
S
N
402 2111 M
405 2105 D
414 2099 D
420 2096 D
428 2093 D
443 2091 D
454 2091 D
460 2093 D
463 2096 D
S
N
463 2102 M
460 2108 D
451 2114 D
446 2117 D
437 2119 D
423 2122 D
411 2122 D
405 2119 D
402 2117 D
S
N
431 2093 M
431 2119 D
S
N
359 2170 M
420 2196 D
S
N
359 2196 M
420 2170 D
S
N
376 2153 M
402 2213 D
S
N
376 2213 M
402 2153 D
S
N
391 2243 M
483 2243 D
S
N
391 2333 M
397 2327 D
405 2321 D
417 2315 D
431 2313 D
443 2313 D
457 2315 D
469 2321 D
477 2327 D
483 2333 D
S
N
397 2327 M
408 2321 D
417 2318 D
431 2315 D
443 2315 D
457 2318 D
466 2321 D
477 2327 D
S
N
405 2370 M
408 2367 D
411 2370 D
408 2373 D
405 2373 D
402 2370 D
402 2364 D
405 2359 D
411 2356 D
463 2356 D
S
N
402 2364 M
405 2362 D
411 2359 D
463 2359 D
S
N
423 2347 M
423 2370 D
S
N
463 2347 M
463 2367 D
S
N
402 2393 M
463 2393 D
S
N
402 2396 M
463 2396 D
S
N
431 2396 M
425 2402 D
423 2408 D
423 2413 D
425 2422 D
431 2428 D
440 2431 D
446 2431 D
454 2428 D
460 2422 D
463 2413 D
463 2408 D
460 2402 D
454 2396 D
S
N
423 2413 M
425 2419 D
431 2425 D
440 2428 D
446 2428 D
454 2425 D
460 2419 D
463 2413 D
S
N
402 2385 M
402 2396 D
S
N
391 2448 M
397 2454 D
405 2460 D
417 2465 D
431 2468 D
443 2468 D
457 2465 D
469 2460 D
477 2454 D
483 2448 D
S
N
397 2454 M
408 2460 D
417 2462 D
431 2465 D
443 2465 D
457 2462 D
466 2460 D
477 2454 D
S
N
3824 2264 M
3885 2264 D
S
N
3824 2266 M
3885 2266 D
S
N
3824 2255 M
3824 2275 D
S
N
3885 2255 M
3885 2298 D
3868 2298 D
3885 2295 D
S
N
3824 2315 M
3885 2315 D
S
N
3824 2318 M
3885 2318 D
S
N
3824 2353 M
3885 2353 D
S
N
3824 2356 M
3885 2356 D
S
N
3824 2307 M
3824 2327 D
S
N
3824 2344 M
3824 2364 D
S
N
3853 2318 M
3853 2353 D
S
N
3885 2307 M
3885 2327 D
S
N
3885 2344 M
3885 2364 D
S
N
3833 2419 M
3842 2422 D
3824 2422 D
3833 2419 D
3827 2413 D
3824 2405 D
3824 2399 D
3827 2390 D
3833 2385 D
3839 2382 D
3847 2379 D
3862 2379 D
3870 2382 D
3876 2385 D
3882 2390 D
3885 2399 D
3885 2405 D
3882 2413 D
3876 2419 D
3870 2422 D
S
N
3824 2399 M
3827 2393 D
3833 2388 D
3839 2385 D
3847 2382 D
3862 2382 D
3870 2385 D
3876 2388 D
3882 2393 D
3885 2399 D
S
N
3824 2491 M
3885 2491 D
S
N
3824 2494 M
3885 2494 D
S
N
3824 2529 M
3885 2529 D
S
N
3824 2532 M
3885 2532 D
S
N
3824 2483 M
3824 2503 D
S
N
3824 2520 M
3824 2540 D
S
N
3853 2494 M
3853 2529 D
S
N
3885 2483 M
3885 2503 D
S
N
3885 2520 M
3885 2540 D
S
N
3824 2561 M
3885 2561 D
S
N
3824 2563 M
3885 2563 D
S
N
3824 2552 M
3824 2572 D
S
N
3885 2552 M
3885 2572 D
S
N
3833 2627 M
3842 2630 D
3824 2630 D
3833 2627 D
3827 2621 D
3824 2612 D
3824 2607 D
3827 2598 D
3833 2592 D
3839 2589 D
3847 2586 D
3862 2586 D
3870 2589 D
3876 2592 D
3882 2598 D
3885 2607 D
3885 2612 D
3882 2621 D
3876 2627 D
S
N
3824 2607 M
3827 2601 D
3833 2595 D
3839 2592 D
3847 2589 D
3862 2589 D
3870 2592 D
3876 2595 D
3882 2601 D
3885 2607 D
S
N
3862 2627 M
3885 2627 D
S
N
3862 2630 M
3885 2630 D
S
N
3862 2618 M
3862 2638 D
S
N
3833 2693 M
3842 2696 D
3824 2696 D
3833 2693 D
3827 2687 D
3824 2679 D
3824 2673 D
3827 2664 D
3833 2659 D
3839 2656 D
3847 2653 D
3862 2653 D
3870 2656 D
3876 2659 D
3882 2664 D
3885 2673 D
3885 2679 D
3882 2687 D
3876 2693 D
S
N
3824 2673 M
3827 2667 D
3833 2661 D
3839 2659 D
3847 2656 D
3862 2656 D
3870 2659 D
3876 2661 D
3882 2667 D
3885 2673 D
S
N
3862 2693 M
3885 2693 D
S
N
3862 2696 M
3885 2696 D
S
N
3862 2685 M
3862 2705 D
S
N
3833 2757 M
3824 2759 D
3842 2759 D
3833 2757 D
3827 2751 D
3824 2742 D
3824 2734 D
3827 2725 D
3833 2719 D
3839 2719 D
3845 2722 D
3847 2725 D
3850 2731 D
3856 2748 D
3859 2754 D
3865 2759 D
S
N
3839 2719 M
3845 2725 D
3847 2731 D
3853 2748 D
3856 2754 D
3859 2757 D
3865 2759 D
3876 2759 D
3882 2754 D
3885 2745 D
3885 2736 D
3882 2728 D
3876 2722 D
3868 2719 D
3885 2719 D
3876 2722 D
S
N
3824 2823 M
3885 2860 D
S
N
3824 2826 M
3885 2863 D
S
N
3824 2863 M
3885 2823 D
S
N
3824 2817 M
3824 2834 D
S
N
3824 2852 M
3824 2869 D
S
N
3885 2817 M
3885 2834 D
S
N
3885 2852 M
3885 2869 D
S
N
3833 2918 M
3824 2921 D
3842 2921 D
3833 2918 D
3827 2912 D
3824 2904 D
3824 2895 D
3827 2886 D
3833 2881 D
3839 2881 D
3845 2883 D
3847 2886 D
3850 2892 D
3856 2909 D
3859 2915 D
3865 2921 D
S
N
3839 2881 M
3845 2886 D
3847 2892 D
3853 2909 D
3856 2915 D
3859 2918 D
3865 2921 D
3876 2921 D
3882 2915 D
3885 2907 D
3885 2898 D
3882 2889 D
3876 2883 D
3868 2881 D
3885 2881 D
3876 2883 D
S
N
3824 2987 M
3885 2999 D
S
N
3824 2990 M
3870 2999 D
S
N
3824 3010 M
3885 2999 D
S
N
3824 3010 M
3885 3022 D
S
N
3824 3013 M
3870 3022 D
S
N
3824 3033 M
3885 3022 D
S
N
3824 2979 M
3824 2999 D
S
N
3824 3025 M
3824 3042 D
S
N
3833 3094 M
3842 3097 D
3824 3097 D
3833 3094 D
3827 3088 D
3824 3080 D
3824 3074 D
3827 3065 D
3833 3059 D
3839 3056 D
3847 3054 D
3862 3054 D
3870 3056 D
3876 3059 D
3882 3065 D
3885 3074 D
3885 3080 D
3882 3088 D
3876 3094 D
S
N
3824 3074 M
3827 3068 D
3833 3062 D
3839 3059 D
3847 3056 D
3862 3056 D
3870 3059 D
3876 3062 D
3882 3068 D
3885 3074 D
S
N
3862 3094 M
3885 3094 D
S
N
3862 3097 M
3885 3097 D
S
N
3862 3085 M
3862 3105 D
S
N
3836 3169 M
3839 3172 D
3842 3169 D
3839 3166 D
3836 3166 D
3830 3169 D
3827 3172 D
3824 3180 D
3824 3192 D
3827 3201 D
3830 3204 D
3836 3206 D
3842 3206 D
3847 3204 D
3853 3195 D
3859 3180 D
3862 3175 D
3868 3169 D
3876 3166 D
3885 3166 D
S
N
3824 3192 M
3827 3198 D
3830 3201 D
3836 3204 D
3842 3204 D
3847 3201 D
3853 3192 D
3859 3180 D
S
N
3879 3166 M
3876 3169 D
3876 3175 D
3882 3189 D
3882 3198 D
3879 3204 D
3876 3206 D
S
N
3876 3175 M
3885 3189 D
3885 3201 D
3882 3204 D
3876 3206 D
3870 3206 D
S
N
3824 3241 M
3827 3232 D
3836 3227 D
3850 3224 D
3859 3224 D
3873 3227 D
3882 3232 D
3885 3241 D
3885 3247 D
3882 3255 D
3873 3261 D
3859 3264 D
3850 3264 D
3836 3261 D
3827 3255 D
3824 3247 D
3824 3241 D
S
N
3824 3241 M
3827 3235 D
3830 3232 D
3836 3229 D
3850 3227 D
3859 3227 D
3873 3229 D
3879 3232 D
3882 3235 D
3885 3241 D
S
N
3885 3247 M
3882 3253 D
3879 3255 D
3873 3258 D
3859 3261 D
3850 3261 D
3836 3258 D
3830 3255 D
3827 3253 D
3824 3247 D
S
N
3836 3290 M
3833 3296 D
3824 3304 D
3885 3304 D
S
N
3827 3302 M
3885 3302 D
S
N
3885 3290 M
3885 3316 D
S
N
3836 3342 M
3839 3345 D
3842 3342 D
3839 3339 D
3836 3339 D
3830 3342 D
3827 3345 D
3824 3353 D
3824 3365 D
3827 3374 D
3833 3377 D
3842 3377 D
3847 3374 D
3850 3365 D
3850 3356 D
S
N
3824 3365 M
3827 3371 D
3833 3374 D
3842 3374 D
3847 3371 D
3850 3365 D
S
N
3850 3365 M
3853 3371 D
3859 3377 D
3865 3379 D
3873 3379 D
3879 3377 D
3882 3374 D
3885 3365 D
3885 3353 D
3882 3345 D
3879 3342 D
3873 3339 D
3870 3339 D
3868 3342 D
3870 3345 D
3873 3342 D
S
N
3856 3374 M
3865 3377 D
3873 3377 D
3879 3374 D
3882 3371 D
3885 3365 D
S
N
1063 1563 M
1063 1502 D
S
N
1066 1563 M
1066 1502 D
S
N
1066 1554 M
1071 1560 D
1077 1563 D
1083 1563 D
1092 1560 D
1097 1554 D
1100 1546 D
1100 1540 D
1097 1531 D
1092 1525 D
1083 1523 D
1077 1523 D
1071 1525 D
1066 1531 D
S
N
1083 1563 M
1089 1560 D
1094 1554 D
1097 1546 D
1097 1540 D
1094 1531 D
1089 1525 D
1083 1523 D
S
N
1054 1563 M
1066 1563 D
S
N
1054 1502 M
1074 1502 D
S
N
1123 1563 M
1123 1502 D
S
N
1126 1563 M
1126 1502 D
S
N
1126 1554 M
1132 1560 D
1138 1563 D
1144 1563 D
1152 1560 D
1158 1554 D
1161 1546 D
1161 1540 D
1158 1531 D
1152 1525 D
1144 1523 D
1138 1523 D
1132 1525 D
1126 1531 D
S
N
1144 1563 M
1149 1560 D
1155 1554 D
1158 1546 D
1158 1540 D
1155 1531 D
1149 1525 D
1144 1523 D
S
N
1115 1563 M
1126 1563 D
S
N
1115 1502 M
1135 1502 D
S
N
1224 1554 M
1233 1548 D
1224 1543 D
S
N
1216 1563 M
1230 1548 D
1216 1534 D
S
N
1181 1548 M
1230 1548 D
S
N
1259 1583 M
1259 1523 D
S
N
1262 1583 M
1262 1523 D
S
N
1296 1583 M
1296 1523 D
S
N
1299 1583 M
1299 1523 D
S
N
1250 1583 M
1270 1583 D
S
N
1288 1583 M
1308 1583 D
S
N
1262 1554 M
1296 1554 D
S
N
1250 1523 M
1270 1523 D
S
N
1288 1523 M
1308 1523 D
S
N
1351 1574 M
1351 1523 D
S
N
1325 1548 M
1377 1548 D
S
N
1397 1583 M
1435 1523 D
S
N
1400 1583 M
1438 1523 D
S
N
1438 1583 M
1397 1523 D
S
N
1391 1583 M
1409 1583 D
S
N
1426 1583 M
1443 1583 D
S
N
1391 1523 M
1409 1523 D
S
N
1426 1523 M
1443 1523 D
S
N
1501 1554 M
1510 1548 D
1501 1543 D
S
N
1492 1563 M
1507 1548 D
1492 1534 D
S
N
1458 1548 M
1507 1548 D
S
N
1524 1554 M
1530 1560 D
1536 1563 D
1541 1563 D
1547 1560 D
1550 1557 D
1553 1548 D
1553 1537 D
1550 1525 D
1541 1502 D
S
N
1527 1557 M
1533 1560 D
1544 1560 D
1550 1557 D
S
N
1573 1563 M
1570 1554 D
1567 1548 D
1553 1528 D
1544 1514 D
1539 1502 D
S
N
1570 1563 M
1567 1554 D
1564 1548 D
1553 1528 D
S
N
1582 1554 M
1588 1560 D
1593 1563 D
1599 1563 D
1605 1560 D
1608 1557 D
1611 1548 D
1611 1537 D
1608 1525 D
1599 1502 D
S
N
1585 1557 M
1590 1560 D
1602 1560 D
1608 1557 D
S
N
1631 1563 M
1628 1554 D
1625 1548 D
1611 1528 D
1602 1514 D
1596 1502 D
S
N
1628 1563 M
1625 1554 D
1622 1548 D
1611 1528 D
S
N
1674 1574 M
1674 1523 D
S
N
1648 1548 M
1700 1548 D
S
N
1720 1583 M
1758 1523 D
S
N
1723 1583 M
1761 1523 D
S
N
1761 1583 M
1720 1523 D
S
N
1714 1583 M
1732 1583 D
S
N
1749 1583 M
1766 1583 D
S
N
1714 1523 M
1732 1523 D
S
N
1749 1523 M
1766 1523 D
S
N
1057 1401 M
1069 1401 D
1086 1367 D
S
N
1066 1401 M
1086 1361 D
1112 1439 D
S
N
1149 1396 M
1152 1401 D
1152 1390 D
1149 1396 D
1146 1399 D
1141 1401 D
1129 1401 D
1123 1399 D
1120 1396 D
1120 1390 D
1123 1387 D
1129 1384 D
1144 1378 D
1149 1375 D
1152 1373 D
S
N
1120 1393 M
1123 1390 D
1129 1387 D
1144 1381 D
1149 1378 D
1152 1375 D
1152 1367 D
1149 1364 D
1144 1361 D
1132 1361 D
1126 1364 D
1123 1367 D
1120 1373 D
1120 1361 D
1123 1367 D
S
N
1172 1396 M
1224 1396 D
S
N
1172 1378 M
1224 1378 D
S
N
1259 1422 M
1250 1419 D
1247 1413 D
1247 1404 D
1250 1399 D
1259 1396 D
1270 1396 D
1279 1399 D
1282 1404 D
1282 1413 D
1279 1419 D
1270 1422 D
1259 1422 D
S
N
1259 1422 M
1253 1419 D
1250 1413 D
1250 1404 D
1253 1399 D
1259 1396 D
S
N
1270 1396 M
1276 1399 D
1279 1404 D
1279 1413 D
1276 1419 D
1270 1422 D
S
N
1259 1396 M
1250 1393 D
1247 1390 D
1244 1384 D
1244 1373 D
1247 1367 D
1250 1364 D
1259 1361 D
1270 1361 D
1279 1364 D
1282 1367 D
1285 1373 D
1285 1384 D
1282 1390 D
1279 1393 D
1270 1396 D
S
N
1259 1396 M
1253 1393 D
1250 1390 D
1247 1384 D
1247 1373 D
1250 1367 D
1253 1364 D
1259 1361 D
S
N
1270 1361 M
1276 1364 D
1279 1367 D
1282 1373 D
1282 1384 D
1279 1390 D
1276 1393 D
1270 1396 D
S
N
1366 1422 M
1366 1361 D
S
N
1368 1422 M
1368 1361 D
S
N
1348 1422 M
1345 1404 D
1345 1422 D
1389 1422 D
1389 1404 D
1386 1422 D
S
N
1357 1361 M
1377 1361 D
S
N
1406 1384 M
1440 1384 D
1440 1390 D
1438 1396 D
1435 1399 D
1429 1401 D
1420 1401 D
1412 1399 D
1406 1393 D
1403 1384 D
1403 1378 D
1406 1370 D
1412 1364 D
1420 1361 D
1426 1361 D
1435 1364 D
1440 1370 D
S
N
1438 1384 M
1438 1393 D
1435 1399 D
S
N
1420 1401 M
1415 1399 D
1409 1393 D
1406 1384 D
1406 1378 D
1409 1370 D
1415 1364 D
1420 1361 D
S
N
1458 1422 M
1478 1361 D
S
N
1461 1422 M
1478 1370 D
S
N
1498 1422 M
1478 1361 D
S
N
1452 1422 M
1469 1422 D
S
N
1487 1422 M
1504 1422 D
S
N
1521 1361 M
1518 1364 D
1521 1367 D
1524 1364 D
1524 1358 D
1521 1352 D
1518 1350 D
S
N
1596 1422 M
1596 1361 D
S
N
1599 1422 M
1616 1370 D
S
N
1596 1422 M
1616 1361 D
S
N
1637 1422 M
1616 1361 D
S
N
1637 1422 M
1637 1361 D
S
N
1639 1422 M
1639 1361 D
S
N
1588 1422 M
1599 1422 D
S
N
1637 1422 M
1648 1422 D
S
N
1588 1361 M
1605 1361 D
S
N
1628 1361 M
1648 1361 D
S
N
1700 1413 M
1703 1422 D
1703 1404 D
1700 1413 D
1694 1419 D
1686 1422 D
1677 1422 D
1668 1419 D
1663 1413 D
1663 1407 D
1665 1401 D
1668 1399 D
1674 1396 D
1691 1390 D
1697 1387 D
1703 1381 D
S
N
1663 1407 M
1668 1401 D
1674 1399 D
1691 1393 D
1697 1390 D
1700 1387 D
1703 1381 D
1703 1370 D
1697 1364 D
1688 1361 D
1680 1361 D
1671 1364 D
1665 1370 D
1663 1378 D
1663 1361 D
1665 1370 D
S
N
1737 1422 M
1737 1361 D
S
N
1740 1422 M
1740 1361 D
S
N
1720 1422 M
1717 1404 D
1717 1422 D
1761 1422 D
1761 1404 D
1758 1422 D
S
N
1729 1361 M
1749 1361 D
S
N
1778 1422 M
1789 1361 D
S
N
1781 1422 M
1789 1375 D
S
N
1801 1422 M
1789 1361 D
S
N
1801 1422 M
1812 1361 D
S
N
1804 1422 M
1812 1375 D
S
N
1824 1422 M
1812 1361 D
S
N
1769 1422 M
1789 1422 D
S
N
1815 1422 M
1833 1422 D
S
N
1847 1410 M
1850 1407 D
1847 1404 D
1844 1407 D
1844 1410 D
1847 1416 D
1850 1419 D
1859 1422 D
1870 1422 D
1879 1419 D
1882 1416 D
1885 1410 D
1885 1404 D
1882 1399 D
1873 1393 D
1859 1387 D
1853 1384 D
1847 1378 D
1844 1370 D
1844 1361 D
S
N
1870 1422 M
1876 1419 D
1879 1416 D
1882 1410 D
1882 1404 D
1879 1399 D
1870 1393 D
1859 1387 D
S
N
1844 1367 M
1847 1370 D
1853 1370 D
1867 1364 D
1876 1364 D
1882 1367 D
1885 1370 D
S
N
1853 1370 M
1867 1361 D
1879 1361 D
1882 1364 D
1885 1370 D
1885 1375 D
S
N
1919 1422 M
1910 1419 D
1905 1410 D
1902 1396 D
1902 1387 D
1905 1373 D
1910 1364 D
1919 1361 D
1925 1361 D
1934 1364 D
1939 1373 D
1942 1387 D
1942 1396 D
1939 1410 D
1934 1419 D
1925 1422 D
1919 1422 D
S
N
1919 1422 M
1913 1419 D
1910 1416 D
1908 1410 D
1905 1396 D
1905 1387 D
1908 1373 D
1910 1367 D
1913 1364 D
1919 1361 D
S
N
1925 1361 M
1931 1364 D
1934 1367 D
1936 1373 D
1939 1387 D
1939 1396 D
1936 1410 D
1934 1416 D
1931 1419 D
1925 1422 D
S
N
1977 1422 M
1968 1419 D
1962 1410 D
1959 1396 D
1959 1387 D
1962 1373 D
1968 1364 D
1977 1361 D
1983 1361 D
1991 1364 D
1997 1373 D
2000 1387 D
2000 1396 D
1997 1410 D
1991 1419 D
1983 1422 D
1977 1422 D
S
N
1977 1422 M
1971 1419 D
1968 1416 D
1965 1410 D
1962 1396 D
1962 1387 D
1965 1373 D
1968 1367 D
1971 1364 D
1977 1361 D
S
N
1983 1361 M
1988 1364 D
1991 1367 D
1994 1373 D
1997 1387 D
1997 1396 D
1994 1410 D
1991 1416 D
1988 1419 D
1983 1422 D
S
N
2032 1422 M
2023 1419 D
2020 1413 D
2020 1404 D
2023 1399 D
2032 1396 D
2043 1396 D
2052 1399 D
2055 1404 D
2055 1413 D
2052 1419 D
2043 1422 D
2032 1422 D
S
N
2032 1422 M
2026 1419 D
2023 1413 D
2023 1404 D
2026 1399 D
2032 1396 D
S
N
2043 1396 M
2049 1399 D
2052 1404 D
2052 1413 D
2049 1419 D
2043 1422 D
S
N
2032 1396 M
2023 1393 D
2020 1390 D
2017 1384 D
2017 1373 D
2020 1367 D
2023 1364 D
2032 1361 D
2043 1361 D
2052 1364 D
2055 1367 D
2058 1373 D
2058 1384 D
2055 1390 D
2052 1393 D
2043 1396 D
S
N
2032 1396 M
2026 1393 D
2023 1390 D
2020 1384 D
2020 1373 D
2023 1367 D
2026 1364 D
2032 1361 D
S
N
2043 1361 M
2049 1364 D
2052 1367 D
2055 1373 D
2055 1384 D
2052 1390 D
2049 1393 D
2043 1396 D
S
N
1069 1240 M
1051 1179 D
S
N
1071 1240 M
1054 1179 D
S
N
1069 1231 M
1066 1214 D
1066 1205 D
1071 1200 D
1077 1200 D
1083 1202 D
1089 1208 D
1094 1217 D
S
N
1100 1240 M
1092 1208 D
1092 1202 D
1094 1200 D
1103 1200 D
1109 1205 D
1112 1211 D
S
N
1103 1240 M
1094 1208 D
1094 1202 D
1097 1200 D
S
N
1128 1217 M
1128 1177 D
S
N
1130 1217 M
1130 1177 D
S
N
1142 1205 M
1142 1190 D
S
N
1122 1217 M
1153 1217 D
1153 1205 D
1151 1217 D
S
N
1130 1198 M
1142 1198 D
S
N
1122 1177 M
1136 1177 D
S
N
1172 1234 M
1224 1234 D
S
N
1172 1217 M
1224 1217 D
S
N
1256 1240 M
1239 1179 D
S
N
1259 1240 M
1242 1179 D
S
N
1256 1231 M
1253 1214 D
1253 1205 D
1259 1200 D
1265 1200 D
1270 1202 D
1276 1208 D
1282 1217 D
S
N
1288 1240 M
1279 1208 D
1279 1202 D
1282 1200 D
1291 1200 D
1296 1205 D
1299 1211 D
S
N
1291 1240 M
1282 1208 D
1282 1202 D
1285 1200 D
S
N
1316 1217 M
1316 1177 D
S
N
1317 1217 M
1317 1177 D
S
N
1310 1217 M
1333 1217 D
1339 1215 D
1341 1213 D
1342 1209 D
1342 1205 D
1341 1202 D
1339 1200 D
1333 1198 D
1317 1198 D
S
N
1333 1217 M
1337 1215 D
1339 1213 D
1341 1209 D
1341 1205 D
1339 1202 D
1337 1200 D
1333 1198 D
S
N
1310 1177 M
1323 1177 D
S
N
1327 1198 M
1331 1196 D
1333 1194 D
1339 1180 D
1341 1178 D
1342 1178 D
1344 1180 D
S
N
1331 1196 M
1333 1192 D
1337 1178 D
1339 1177 D
1342 1177 D
1344 1180 D
1344 1182 D
S
N
1364 1234 M
1416 1234 D
S
N
1364 1217 M
1416 1217 D
S
N
1439 1249 M
1441 1246 D
1439 1243 D
1436 1246 D
1436 1249 D
1439 1254 D
1441 1257 D
1450 1260 D
1462 1260 D
1470 1257 D
1473 1254 D
1476 1249 D
1476 1243 D
1473 1237 D
1465 1231 D
1450 1226 D
1444 1223 D
1439 1217 D
1436 1208 D
1436 1200 D
S
N
1462 1260 M
1467 1257 D
1470 1254 D
1473 1249 D
1473 1243 D
1470 1237 D
1462 1231 D
1450 1226 D
S
N
1436 1205 M
1439 1208 D
1444 1208 D
1459 1202 D
1467 1202 D
1473 1205 D
1476 1208 D
S
N
1444 1208 M
1459 1200 D
1470 1200 D
1473 1202 D
1476 1208 D
1476 1214 D
S
N
1514 1260 M
1505 1257 D
1499 1252 D
1496 1246 D
1493 1234 D
1493 1226 D
1496 1214 D
1499 1208 D
1505 1202 D
1514 1200 D
1519 1200 D
1528 1202 D
1534 1208 D
1537 1214 D
1539 1226 D
1539 1234 D
1537 1246 D
1534 1252 D
1528 1257 D
1519 1260 D
1514 1260 D
S
N
1514 1260 M
1508 1257 D
1502 1252 D
1499 1246 D
1496 1234 D
1496 1226 D
1499 1214 D
1502 1208 D
1508 1202 D
1514 1200 D
S
N
1519 1200 M
1525 1202 D
1531 1208 D
1534 1214 D
1537 1226 D
1537 1234 D
1534 1246 D
1531 1252 D
1525 1257 D
1519 1260 D
S
N
1505 1205 M
1505 1208 D
1508 1214 D
1514 1217 D
1516 1217 D
1522 1214 D
1525 1208 D
1528 1188 D
1531 1185 D
1537 1185 D
1539 1191 D
1539 1194 D
S
N
1525 1208 M
1528 1197 D
1531 1191 D
1534 1188 D
1537 1188 D
1539 1191 D
S
N
1560 1234 M
1612 1234 D
S
N
1560 1217 M
1612 1217 D
S
N
1638 1240 M
1638 1200 D
S
N
1640 1240 M
1640 1200 D
S
N
1640 1231 M
1646 1237 D
1655 1240 D
1661 1240 D
1669 1237 D
1672 1231 D
1672 1200 D
S
N
1661 1240 M
1666 1237 D
1669 1231 D
1669 1200 D
S
N
1672 1231 M
1678 1237 D
1687 1240 D
1692 1240 D
1701 1237 D
1704 1231 D
1704 1200 D
S
N
1692 1240 M
1698 1237 D
1701 1231 D
1701 1200 D
S
N
1629 1240 M
1640 1240 D
S
N
1629 1200 M
1649 1200 D
S
N
1661 1200 M
1681 1200 D
S
N
1692 1200 M
1712 1200 D
S
N
1732 1217 M
1732 1177 D
S
N
1734 1217 M
1734 1177 D
S
N
1757 1217 M
1757 1177 D
S
N
1759 1217 M
1759 1177 D
S
N
1726 1217 M
1739 1217 D
S
N
1751 1217 M
1764 1217 D
S
N
1734 1198 M
1757 1198 D
S
N
1726 1177 M
1739 1177 D
S
N
1751 1177 M
1764 1177 D
S
N
1784 1234 M
1836 1234 D
S
N
1784 1217 M
1836 1217 D
S
N
1864 1249 M
1870 1252 D
1879 1260 D
1879 1200 D
S
N
1876 1257 M
1876 1200 D
S
N
1864 1200 M
1890 1200 D
S
N
1916 1249 M
1919 1246 D
1916 1243 D
1913 1246 D
1913 1249 D
1916 1254 D
1919 1257 D
1928 1260 D
1939 1260 D
1948 1257 D
1951 1254 D
1954 1249 D
1954 1243 D
1951 1237 D
1942 1231 D
1928 1226 D
1922 1223 D
1916 1217 D
1913 1208 D
1913 1200 D
S
N
1939 1260 M
1945 1257 D
1948 1254 D
1951 1249 D
1951 1243 D
1948 1237 D
1939 1231 D
1928 1226 D
S
N
1913 1205 M
1916 1208 D
1922 1208 D
1936 1202 D
1945 1202 D
1951 1205 D
1954 1208 D
S
N
1922 1208 M
1936 1200 D
1948 1200 D
1951 1202 D
1954 1208 D
1954 1214 D
S
N
1977 1260 M
1971 1231 D
S
N
1971 1231 M
1977 1237 D
1985 1240 D
1994 1240 D
2003 1237 D
2009 1231 D
2011 1223 D
2011 1217 D
2009 1208 D
2003 1202 D
1994 1200 D
1985 1200 D
1977 1202 D
1974 1205 D
1971 1211 D
1971 1214 D
1974 1217 D
1977 1214 D
1974 1211 D
S
N
1994 1240 M
2000 1237 D
2006 1231 D
2009 1223 D
2009 1217 D
2006 1208 D
2000 1202 D
1994 1200 D
S
N
1977 1260 M
2006 1260 D
S
N
1977 1257 M
1991 1257 D
2006 1260 D
S
N
2115 1252 M
2118 1243 D
2118 1260 D
2115 1252 D
2109 1257 D
2101 1260 D
2095 1260 D
2086 1257 D
2081 1252 D
2078 1246 D
2075 1237 D
2075 1223 D
2078 1214 D
2081 1208 D
2086 1202 D
2095 1200 D
2101 1200 D
2109 1202 D
2115 1208 D
S
N
2095 1260 M
2089 1257 D
2083 1251 D
2081 1246 D
2078 1237 D
2078 1223 D
2081 1214 D
2083 1208 D
2089 1202 D
2095 1200 D
S
N
2115 1223 M
2115 1200 D
S
N
2118 1223 M
2118 1200 D
S
N
2107 1223 M
2127 1223 D
S
N
2144 1223 M
2179 1223 D
2179 1228 D
2176 1234 D
2173 1237 D
2167 1240 D
2158 1240 D
2150 1237 D
2144 1231 D
2141 1223 D
2141 1217 D
2144 1208 D
2150 1202 D
2158 1200 D
2164 1200 D
2173 1202 D
2179 1208 D
S
N
2176 1223 M
2176 1231 D
2173 1237 D
S
N
2158 1240 M
2153 1237 D
2147 1231 D
2144 1223 D
2144 1217 D
2147 1208 D
2153 1202 D
2158 1200 D
S
N
2196 1260 M
2216 1200 D
S
N
2199 1260 M
2216 1208 D
S
N
2236 1260 M
2216 1200 D
S
N
2190 1260 M
2207 1260 D
S
N
2225 1260 M
2242 1260 D
S
N
785 3414 M
785 992 D
S
N
785 992 M
3761 992 D
S
N
3761 992 M
3761 3414 D
S
N
3761 3414 M
785 3414 D
S
785 992 P
[4 30] 0 Sd
N
785 992 M
785 3315 D
815 3315 D
815 3313 D
845 3313 D
845 3312 D
875 3312 D
875 3306 D
904 3306 D
904 3301 D
934 3301 D
934 3302 D
964 3302 D
964 3294 D
994 3294 D
994 3289 D
1023 3289 D
1023 3286 D
1053 3286 D
1053 3278 D
1083 3278 D
1083 3274 D
1113 3274 D
1113 3277 D
1142 3277 D
1142 3263 D
1172 3263 D
1172 3268 D
1202 3268 D
1202 3254 D
1232 3254 D
1232 3253 D
1261 3253 D
1261 3247 D
1291 3247 D
1291 3241 D
1321 3241 D
1321 3245 D
1351 3245 D
1351 3231 D
1381 3231 D
1381 3236 D
1410 3236 D
1410 3232 D
1440 3232 D
1440 3230 D
1470 3230 D
1470 3215 D
1500 3215 D
1500 3220 D
1529 3220 D
1529 3208 D
1559 3208 D
1559 3200 D
1589 3200 D
1589 3193 D
1619 3193 D
1619 3186 D
1648 3186 D
1648 3188 D
1678 3188 D
1678 3182 D
1708 3182 D
1708 3174 D
1738 3174 D
1738 3169 D
1767 3169 D
1767 3168 D
1797 3168 D
1797 3162 D
1827 3162 D
1827 3151 D
1857 3151 D
1857 3148 D
1886 3148 D
1886 3133 D
1916 3133 D
1916 3127 D
1946 3127 D
1946 3123 D
1976 3123 D
1976 3120 D
2005 3120 D
2005 3108 D
2035 3108 D
2035 3106 D
2065 3106 D
2065 3091 D
2095 3091 D
2095 3087 D
2124 3087 D
2124 3082 D
2154 3082 D
2154 3070 D
2184 3070 D
2184 3068 D
2214 3068 D
2214 3056 D
2243 3056 D
2243 3050 D
2273 3050 D
2273 3041 D
2303 3041 D
2303 3031 D
2333 3031 D
2333 3024 D
2362 3024 D
2362 3018 D
2392 3018 D
2392 3005 D
2422 3005 D
2422 2998 D
2452 2998 D
2452 2983 D
2481 2983 D
2481 2969 D
2511 2969 D
2511 2962 D
2541 2962 D
2541 2956 D
2571 2956 D
2571 2942 D
2601 2942 D
2601 2933 D
2630 2933 D
2630 2920 D
2660 2920 D
2660 2908 D
2660 2908 D
2660 2908 D
2690 2908 D
2690 2892 D
2720 2892 D
2720 2872 D
2749 2872 D
2749 2865 D
2779 2865 D
2779 2854 D
2809 2854 D
2809 2843 D
2839 2843 D
2839 2821 D
2868 2821 D
2868 2800 D
2898 2800 D
2898 2787 D
2928 2787 D
2928 2770 D
2958 2770 D
2958 2753 D
2987 2753 D
2987 2735 D
3017 2735 D
3017 2719 D
3047 2719 D
3047 2412 D
3077 2412 D
3077 992 D
3761 992 D
S
[] 0 Sd
N
785 992 M
785 1096 D
S
N
904 1027 M
904 992 D
S
N
1023 992 M
1023 1027 D
S
N
1142 1027 M
1142 992 D
S
N
1261 992 M
1261 1027 D
S
N
1381 1096 M
1381 992 D
S
N
1500 992 M
1500 1027 D
S
N
1619 1027 M
1619 992 D
S
N
1738 992 M
1738 1027 D
S
N
1857 1027 M
1857 992 D
S
N
1976 992 M
1976 1096 D
S
N
2095 1027 M
2095 992 D
S
N
2214 992 M
2214 1027 D
S
N
2333 1027 M
2333 992 D
S
N
2452 992 M
2452 1027 D
S
N
2571 1096 M
2571 992 D
S
N
2690 992 M
2690 1027 D
S
N
2809 1027 M
2809 992 D
S
N
2928 992 M
2928 1027 D
S
N
3047 1027 M
3047 992 D
S
N
3166 992 M
3166 1096 D
S
N
3285 1027 M
3285 992 D
S
N
3404 992 M
3404 1027 D
S
N
3523 1027 M
3523 992 D
S
N
3642 992 M
3642 1027 D
S
N
3761 1096 M
3761 992 D
S
N
739 935 M
731 932 D
725 923 D
722 909 D
722 900 D
725 886 D
731 877 D
739 874 D
745 874 D
754 877 D
759 886 D
762 900 D
762 909 D
759 923 D
754 932 D
745 935 D
739 935 D
S
N
739 935 M
733 932 D
731 929 D
728 923 D
725 909 D
725 900 D
728 886 D
731 880 D
733 877 D
739 874 D
S
N
745 874 M
751 877 D
754 880 D
757 886 D
759 900 D
759 909 D
757 923 D
754 929 D
751 932 D
745 935 D
S
N
785 880 M
783 877 D
785 874 D
788 877 D
785 880 D
S
N
826 935 M
817 932 D
811 923 D
808 909 D
808 900 D
811 886 D
817 877 D
826 874 D
832 874 D
840 877 D
846 886 D
849 900 D
849 909 D
846 923 D
840 932 D
832 935 D
826 935 D
S
N
826 935 M
820 932 D
817 929 D
814 923 D
811 909 D
811 900 D
814 886 D
817 880 D
820 877 D
826 874 D
S
N
832 874 M
837 877 D
840 880 D
843 886 D
846 900 D
846 909 D
843 923 D
840 929 D
837 932 D
832 935 D
S
N
1334 935 M
1326 932 D
1320 923 D
1317 909 D
1317 900 D
1320 886 D
1326 877 D
1334 874 D
1340 874 D
1349 877 D
1355 886 D
1357 900 D
1357 909 D
1355 923 D
1349 932 D
1340 935 D
1334 935 D
S
N
1334 935 M
1329 932 D
1326 929 D
1323 923 D
1320 909 D
1320 900 D
1323 886 D
1326 880 D
1329 877 D
1334 874 D
S
N
1340 874 M
1346 877 D
1349 880 D
1352 886 D
1355 900 D
1355 909 D
1352 923 D
1349 929 D
1346 932 D
1340 935 D
S
N
1381 880 M
1378 877 D
1381 874 D
1383 877 D
1381 880 D
S
N
1406 923 M
1409 920 D
1406 918 D
1404 920 D
1404 923 D
1406 929 D
1409 932 D
1418 935 D
1430 935 D
1438 932 D
1441 929 D
1444 923 D
1444 918 D
1441 912 D
1432 906 D
1418 900 D
1412 897 D
1406 892 D
1404 883 D
1404 874 D
S
N
1430 935 M
1435 932 D
1438 929 D
1441 923 D
1441 918 D
1438 912 D
1430 906 D
1418 900 D
S
N
1404 880 M
1406 883 D
1412 883 D
1427 877 D
1435 877 D
1441 880 D
1444 883 D
S
N
1412 883 M
1427 874 D
1438 874 D
1441 877 D
1444 883 D
1444 889 D
S
N
1930 935 M
1921 932 D
1915 923 D
1912 909 D
1912 900 D
1915 886 D
1921 877 D
1930 874 D
1935 874 D
1944 877 D
1950 886 D
1953 900 D
1953 909 D
1950 923 D
1944 932 D
1935 935 D
1930 935 D
S
N
1930 935 M
1924 932 D
1921 929 D
1918 923 D
1915 909 D
1915 900 D
1918 886 D
1921 880 D
1924 877 D
1930 874 D
S
N
1935 874 M
1941 877 D
1944 880 D
1947 886 D
1950 900 D
1950 909 D
1947 923 D
1944 929 D
1941 932 D
1935 935 D
S
N
1976 880 M
1973 877 D
1976 874 D
1979 877 D
1976 880 D
S
N
2025 929 M
2025 874 D
S
N
2028 935 M
2028 874 D
S
N
2028 935 M
1996 892 D
2042 892 D
S
N
2016 874 M
2036 874 D
S
N
2525 935 M
2516 932 D
2510 923 D
2507 909 D
2507 900 D
2510 886 D
2516 877 D
2525 874 D
2530 874 D
2539 877 D
2545 886 D
2548 900 D
2548 909 D
2545 923 D
2539 932 D
2530 935 D
2525 935 D
S
N
2525 935 M
2519 932 D
2516 929 D
2513 923 D
2510 909 D
2510 900 D
2513 886 D
2516 880 D
2519 877 D
2525 874 D
S
N
2530 874 M
2536 877 D
2539 880 D
2542 886 D
2545 900 D
2545 909 D
2542 923 D
2539 929 D
2536 932 D
2530 935 D
S
N
2571 880 M
2568 877 D
2571 874 D
2574 877 D
2571 880 D
S
N
2628 926 M
2626 923 D
2628 920 D
2631 923 D
2631 926 D
2628 932 D
2623 935 D
2614 935 D
2605 932 D
2600 926 D
2597 920 D
2594 909 D
2594 892 D
2597 883 D
2602 877 D
2611 874 D
2617 874 D
2626 877 D
2631 883 D
2634 892 D
2634 895 D
2631 903 D
2626 909 D
2617 912 D
2614 912 D
2605 909 D
2600 903 D
2597 895 D
S
N
2614 935 M
2608 932 D
2602 926 D
2600 920 D
2597 909 D
2597 892 D
2600 883 D
2605 877 D
2611 874 D
S
N
2617 874 M
2623 877 D
2628 883 D
2631 892 D
2631 895 D
2628 903 D
2623 909 D
2617 912 D
S
N
3120 935 M
3111 932 D
3105 923 D
3102 909 D
3102 900 D
3105 886 D
3111 877 D
3120 874 D
3126 874 D
3134 877 D
3140 886 D
3143 900 D
3143 909 D
3140 923 D
3134 932 D
3126 935 D
3120 935 D
S
N
3120 935 M
3114 932 D
3111 929 D
3108 923 D
3105 909 D
3105 900 D
3108 886 D
3111 880 D
3114 877 D
3120 874 D
S
N
3126 874 M
3131 877 D
3134 880 D
3137 886 D
3140 900 D
3140 909 D
3137 923 D
3134 929 D
3131 932 D
3126 935 D
S
N
3166 880 M
3163 877 D
3166 874 D
3169 877 D
3166 880 D
S
N
3203 935 M
3195 932 D
3192 926 D
3192 918 D
3195 912 D
3203 909 D
3215 909 D
3224 912 D
3226 918 D
3226 926 D
3224 932 D
3215 935 D
3203 935 D
S
N
3203 935 M
3198 932 D
3195 926 D
3195 918 D
3198 912 D
3203 909 D
S
N
3215 909 M
3221 912 D
3224 918 D
3224 926 D
3221 932 D
3215 935 D
S
N
3203 909 M
3195 906 D
3192 903 D
3189 897 D
3189 886 D
3192 880 D
3195 877 D
3203 874 D
3215 874 D
3224 877 D
3226 880 D
3229 886 D
3229 897 D
3226 903 D
3224 906 D
3215 909 D
S
N
3203 909 M
3198 906 D
3195 903 D
3192 897 D
3192 886 D
3195 880 D
3198 877 D
3203 874 D
S
N
3215 874 M
3221 877 D
3224 880 D
3226 886 D
3226 897 D
3224 903 D
3221 906 D
3215 909 D
S
N
3706 923 M
3712 926 D
3721 935 D
3721 874 D
S
N
3718 932 M
3718 874 D
S
N
3706 874 M
3732 874 D
S
N
3761 880 M
3758 877 D
3761 874 D
3764 877 D
3761 880 D
S
N
3801 935 M
3793 932 D
3787 923 D
3784 909 D
3784 900 D
3787 886 D
3793 877 D
3801 874 D
3807 874 D
3816 877 D
3822 886 D
3824 900 D
3824 909 D
3822 923 D
3816 932 D
3807 935 D
3801 935 D
S
N
3801 935 M
3796 932 D
3793 929 D
3790 923 D
3787 909 D
3787 900 D
3790 886 D
3793 880 D
3796 877 D
3801 874 D
S
N
3807 874 M
3813 877 D
3816 880 D
3819 886 D
3822 900 D
3822 909 D
3819 923 D
3816 929 D
3813 932 D
3807 935 D
S
N
785 3310 M
785 3414 D
S
N
904 3414 M
904 3379 D
S
N
1023 3379 M
1023 3414 D
S
N
1142 3414 M
1142 3379 D
S
N
1261 3379 M
1261 3414 D
S
N
1381 3414 M
1381 3310 D
S
N
1500 3379 M
1500 3414 D
S
N
1619 3414 M
1619 3379 D
S
N
1738 3379 M
1738 3414 D
S
N
1857 3414 M
1857 3379 D
S
N
1976 3310 M
1976 3414 D
S
N
2095 3414 M
2095 3379 D
S
N
2214 3379 M
2214 3414 D
S
N
2333 3414 M
2333 3379 D
S
N
2452 3379 M
2452 3414 D
S
N
2571 3414 M
2571 3310 D
S
N
2690 3379 M
2690 3414 D
S
N
2809 3414 M
2809 3379 D
S
N
2928 3379 M
2928 3414 D
S
N
3047 3414 M
3047 3379 D
S
N
3166 3310 M
3166 3414 D
S
N
3285 3414 M
3285 3379 D
S
N
3404 3379 M
3404 3414 D
S
N
3523 3414 M
3523 3379 D
S
N
3642 3379 M
3642 3414 D
S
N
3761 3414 M
3761 3310 D
S
N
785 992 M
889 992 D
S
N
820 1073 M
785 1073 D
S
N
785 1153 M
820 1153 D
S
N
820 1234 M
785 1234 D
S
N
785 1315 M
820 1315 D
S
N
889 1396 M
785 1396 D
S
N
785 1476 M
820 1476 D
S
N
820 1557 M
785 1557 D
S
N
785 1638 M
820 1638 D
S
N
820 1719 M
785 1719 D
S
N
785 1799 M
889 1799 D
S
N
820 1880 M
785 1880 D
S
N
785 1961 M
820 1961 D
S
N
820 2042 M
785 2042 D
S
N
785 2122 M
820 2122 D
S
N
889 2203 M
785 2203 D
S
N
785 2284 M
820 2284 D
S
N
820 2364 M
785 2364 D
S
N
785 2445 M
820 2445 D
S
N
820 2526 M
785 2526 D
S
N
785 2607 M
889 2607 D
S
N
820 2687 M
785 2687 D
S
N
785 2768 M
820 2768 D
S
N
820 2849 M
785 2849 D
S
N
785 2930 M
820 2930 D
S
N
889 3010 M
785 3010 D
S
N
785 3091 M
820 3091 D
S
N
820 3172 M
785 3172 D
S
N
785 3253 M
820 3253 D
S
N
820 3333 M
785 3333 D
S
N
785 3414 M
889 3414 D
S
N
575 1018 M
566 1015 D
561 1006 D
558 992 D
558 983 D
561 969 D
566 960 D
575 957 D
581 957 D
589 960 D
595 969 D
598 983 D
598 992 D
595 1006 D
589 1015 D
581 1018 D
575 1018 D
S
N
575 1018 M
569 1015 D
566 1012 D
563 1006 D
561 992 D
561 983 D
563 969 D
566 963 D
569 960 D
575 957 D
S
N
581 957 M
586 960 D
589 963 D
592 969 D
595 983 D
595 992 D
592 1006 D
589 1012 D
586 1015 D
581 1018 D
S
N
621 963 M
618 960 D
621 957 D
624 960 D
621 963 D
S
N
661 1018 M
653 1015 D
647 1006 D
644 992 D
644 983 D
647 969 D
653 960 D
661 957 D
667 957 D
676 960 D
682 969 D
684 983 D
684 992 D
682 1006 D
676 1015 D
667 1018 D
661 1018 D
S
N
661 1018 M
656 1015 D
653 1012 D
650 1006 D
647 992 D
647 983 D
650 969 D
653 963 D
656 960 D
661 957 D
S
N
667 957 M
673 960 D
676 963 D
679 969 D
682 983 D
682 992 D
679 1006 D
676 1012 D
673 1015 D
667 1018 D
S
N
719 1018 M
710 1015 D
705 1006 D
702 992 D
702 983 D
705 969 D
710 960 D
719 957 D
725 957 D
733 960 D
739 969 D
742 983 D
742 992 D
739 1006 D
733 1015 D
725 1018 D
719 1018 D
S
N
719 1018 M
713 1015 D
710 1012 D
708 1006 D
705 992 D
705 983 D
708 969 D
710 963 D
713 960 D
719 957 D
S
N
725 957 M
731 960 D
733 963 D
736 969 D
739 983 D
739 992 D
736 1006 D
733 1012 D
731 1015 D
725 1018 D
S
N
575 1422 M
566 1419 D
561 1410 D
558 1396 D
558 1387 D
561 1373 D
566 1364 D
575 1361 D
581 1361 D
589 1364 D
595 1373 D
598 1387 D
598 1396 D
595 1410 D
589 1419 D
581 1422 D
575 1422 D
S
N
575 1422 M
569 1419 D
566 1416 D
563 1410 D
561 1396 D
561 1387 D
563 1373 D
566 1367 D
569 1364 D
575 1361 D
S
N
581 1361 M
586 1364 D
589 1367 D
592 1373 D
595 1387 D
595 1396 D
592 1410 D
589 1416 D
586 1419 D
581 1422 D
S
N
621 1367 M
618 1364 D
621 1361 D
624 1364 D
621 1367 D
S
N
647 1410 M
650 1407 D
647 1404 D
644 1407 D
644 1410 D
647 1416 D
650 1419 D
659 1422 D
670 1422 D
679 1419 D
682 1416 D
684 1410 D
684 1404 D
682 1399 D
673 1393 D
659 1387 D
653 1384 D
647 1378 D
644 1370 D
644 1361 D
S
N
670 1422 M
676 1419 D
679 1416 D
682 1410 D
682 1404 D
679 1399 D
670 1393 D
659 1387 D
S
N
644 1367 M
647 1370 D
653 1370 D
667 1364 D
676 1364 D
682 1367 D
684 1370 D
S
N
653 1370 M
667 1361 D
679 1361 D
682 1364 D
684 1370 D
684 1375 D
S
N
708 1422 M
702 1393 D
S
N
702 1393 M
708 1399 D
716 1401 D
725 1401 D
734 1399 D
739 1393 D
742 1384 D
742 1378 D
739 1370 D
734 1364 D
725 1361 D
716 1361 D
708 1364 D
705 1367 D
702 1373 D
702 1375 D
705 1378 D
708 1375 D
705 1373 D
S
N
725 1401 M
731 1399 D
736 1393 D
739 1384 D
739 1378 D
736 1370 D
731 1364 D
725 1361 D
S
N
708 1422 M
736 1422 D
S
N
708 1419 M
722 1419 D
736 1422 D
S
N
575 1825 M
566 1822 D
561 1814 D
558 1799 D
558 1791 D
561 1776 D
566 1768 D
575 1765 D
581 1765 D
589 1768 D
595 1776 D
598 1791 D
598 1799 D
595 1814 D
589 1822 D
581 1825 D
575 1825 D
S
N
575 1825 M
569 1822 D
566 1820 D
563 1814 D
561 1799 D
561 1791 D
563 1776 D
566 1771 D
569 1768 D
575 1765 D
S
N
581 1765 M
586 1768 D
589 1771 D
592 1776 D
595 1791 D
595 1799 D
592 1814 D
589 1820 D
586 1822 D
581 1825 D
S
N
621 1771 M
618 1768 D
621 1765 D
624 1768 D
621 1771 D
S
N
650 1825 M
644 1796 D
S
N
644 1796 M
650 1802 D
659 1805 D
667 1805 D
676 1802 D
682 1796 D
684 1788 D
684 1782 D
682 1773 D
676 1768 D
667 1765 D
659 1765 D
650 1768 D
647 1771 D
644 1776 D
644 1779 D
647 1782 D
650 1779 D
647 1776 D
S
N
667 1805 M
673 1802 D
679 1796 D
682 1788 D
682 1782 D
679 1773 D
673 1768 D
667 1765 D
S
N
650 1825 M
679 1825 D
S
N
650 1822 M
664 1822 D
679 1825 D
S
N
719 1825 M
710 1822 D
705 1814 D
702 1799 D
702 1791 D
705 1776 D
710 1768 D
719 1765 D
725 1765 D
733 1768 D
739 1776 D
742 1791 D
742 1799 D
739 1814 D
733 1822 D
725 1825 D
719 1825 D
S
N
719 1825 M
713 1822 D
710 1820 D
708 1814 D
705 1799 D
705 1791 D
708 1776 D
710 1771 D
713 1768 D
719 1765 D
S
N
725 1765 M
731 1768 D
733 1771 D
736 1776 D
739 1791 D
739 1799 D
736 1814 D
733 1820 D
731 1822 D
725 1825 D
S
N
575 2229 M
566 2226 D
561 2217 D
558 2203 D
558 2194 D
561 2180 D
566 2171 D
575 2168 D
581 2168 D
589 2171 D
595 2180 D
598 2194 D
598 2203 D
595 2217 D
589 2226 D
581 2229 D
575 2229 D
S
N
575 2229 M
569 2226 D
566 2223 D
563 2217 D
560 2203 D
560 2194 D
563 2180 D
566 2174 D
569 2171 D
575 2168 D
S
N
581 2168 M
586 2171 D
589 2174 D
592 2180 D
595 2194 D
595 2203 D
592 2217 D
589 2223 D
586 2226 D
581 2229 D
S
N
621 2174 M
618 2171 D
621 2168 D
624 2171 D
621 2174 D
S
N
644 2229 M
644 2212 D
S
N
644 2217 M
647 2223 D
653 2229 D
659 2229 D
673 2220 D
679 2220 D
682 2223 D
684 2229 D
S
N
647 2223 M
653 2226 D
659 2226 D
673 2220 D
S
N
684 2229 M
684 2220 D
682 2212 D
670 2197 D
667 2191 D
664 2183 D
664 2168 D
S
N
682 2212 M
667 2197 D
664 2191 D
661 2183 D
661 2168 D
S
N
708 2229 M
702 2200 D
S
N
702 2200 M
708 2206 D
716 2209 D
725 2209 D
734 2206 D
739 2200 D
742 2191 D
742 2186 D
739 2177 D
734 2171 D
725 2168 D
716 2168 D
708 2171 D
705 2174 D
702 2180 D
702 2183 D
705 2186 D
708 2183 D
705 2180 D
S
N
725 2209 M
731 2206 D
736 2200 D
739 2191 D
739 2186 D
736 2177 D
731 2171 D
725 2168 D
S
N
708 2229 M
736 2229 D
S
N
708 2226 M
722 2226 D
736 2229 D
S
N
566 2621 M
572 2624 D
581 2633 D
581 2572 D
S
N
578 2630 M
578 2572 D
S
N
566 2572 M
592 2572 D
S
N
621 2578 M
618 2575 D
621 2572 D
624 2575 D
621 2578 D
S
N
661 2633 M
653 2630 D
647 2621 D
644 2607 D
644 2598 D
647 2584 D
653 2575 D
661 2572 D
667 2572 D
676 2575 D
682 2584 D
684 2598 D
684 2607 D
682 2621 D
676 2630 D
667 2633 D
661 2633 D
S
N
661 2633 M
656 2630 D
653 2627 D
650 2621 D
647 2607 D
647 2598 D
650 2584 D
653 2578 D
656 2575 D
661 2572 D
S
N
667 2572 M
673 2575 D
676 2578 D
679 2584 D
682 2598 D
682 2607 D
679 2621 D
676 2627 D
673 2630 D
667 2633 D
S
N
719 2633 M
710 2630 D
705 2621 D
702 2607 D
702 2598 D
705 2584 D
710 2575 D
719 2572 D
725 2572 D
733 2575 D
739 2584 D
742 2598 D
742 2607 D
739 2621 D
733 2630 D
725 2633 D
719 2633 D
S
N
719 2633 M
713 2630 D
710 2627 D
708 2621 D
705 2607 D
705 2598 D
708 2584 D
710 2578 D
713 2575 D
719 2572 D
S
N
725 2572 M
731 2575 D
733 2578 D
736 2584 D
739 2598 D
739 2607 D
736 2621 D
733 2627 D
731 2630 D
725 2633 D
S
N
566 3025 M
572 3028 D
581 3036 D
581 2976 D
S
N
578 3033 M
578 2976 D
S
N
566 2976 M
592 2976 D
S
N
621 2982 M
618 2979 D
621 2976 D
624 2979 D
621 2982 D
S
N
647 3025 M
650 3022 D
647 3019 D
644 3022 D
644 3025 D
647 3031 D
650 3033 D
659 3036 D
670 3036 D
679 3033 D
682 3031 D
684 3025 D
684 3019 D
682 3013 D
673 3007 D
659 3002 D
653 2999 D
647 2993 D
644 2984 D
644 2976 D
S
N
670 3036 M
676 3033 D
679 3031 D
682 3025 D
682 3019 D
679 3013 D
670 3007 D
659 3002 D
S
N
644 2982 M
647 2984 D
653 2984 D
667 2979 D
676 2979 D
682 2982 D
684 2984 D
S
N
653 2984 M
667 2976 D
679 2976 D
682 2979 D
684 2984 D
684 2990 D
S
N
708 3036 M
702 3007 D
S
N
702 3007 M
708 3013 D
716 3016 D
725 3016 D
734 3013 D
739 3007 D
742 2999 D
742 2993 D
739 2984 D
734 2979 D
725 2976 D
716 2976 D
708 2979 D
705 2982 D
702 2987 D
702 2990 D
705 2993 D
708 2990 D
705 2987 D
S
N
725 3016 M
731 3013 D
736 3007 D
739 2999 D
739 2993 D
736 2984 D
731 2979 D
725 2976 D
S
N
708 3036 M
736 3036 D
S
N
708 3033 M
722 3033 D
736 3036 D
S
N
566 3428 M
572 3431 D
581 3440 D
581 3379 D
S
N
578 3437 M
578 3379 D
S
N
566 3379 M
592 3379 D
S
N
621 3385 M
618 3382 D
621 3379 D
624 3382 D
621 3385 D
S
N
650 3440 M
644 3411 D
S
N
644 3411 M
650 3417 D
659 3420 D
667 3420 D
676 3417 D
682 3411 D
684 3402 D
684 3397 D
682 3388 D
676 3382 D
667 3379 D
659 3379 D
650 3382 D
647 3385 D
644 3391 D
644 3394 D
647 3397 D
650 3394 D
647 3391 D
S
N
667 3420 M
673 3417 D
679 3411 D
682 3402 D
682 3397 D
679 3388 D
673 3382 D
667 3379 D
S
N
650 3440 M
679 3440 D
S
N
650 3437 M
664 3437 D
679 3440 D
S
N
719 3440 M
710 3437 D
705 3428 D
702 3414 D
702 3405 D
705 3391 D
710 3382 D
719 3379 D
725 3379 D
733 3382 D
739 3391 D
742 3405 D
742 3414 D
739 3428 D
733 3437 D
725 3440 D
719 3440 D
S
N
719 3440 M
713 3437 D
710 3434 D
708 3428 D
705 3414 D
705 3405 D
708 3391 D
710 3385 D
713 3382 D
719 3379 D
S
N
725 3379 M
731 3382 D
733 3385 D
736 3391 D
739 3405 D
739 3414 D
736 3428 D
733 3434 D
731 3437 D
725 3440 D
S
N
3657 992 M
3761 992 D
S
N
3761 1073 M
3726 1073 D
S
N
3726 1153 M
3761 1153 D
S
N
3761 1234 M
3726 1234 D
S
N
3726 1315 M
3761 1315 D
S
N
3761 1396 M
3657 1396 D
S
N
3726 1476 M
3761 1476 D
S
N
3761 1557 M
3726 1557 D
S
N
3726 1638 M
3761 1638 D
S
N
3761 1719 M
3726 1719 D
S
N
3657 1799 M
3761 1799 D
S
N
3761 1880 M
3726 1880 D
S
N
3726 1961 M
3761 1961 D
S
N
3761 2042 M
3726 2042 D
S
N
3726 2122 M
3761 2122 D
S
N
3761 2203 M
3657 2203 D
S
N
3726 2284 M
3761 2284 D
S
N
3761 2364 M
3726 2364 D
S
N
3726 2445 M
3761 2445 D
S
N
3761 2526 M
3726 2526 D
S
N
3657 2607 M
3761 2607 D
S
N
3761 2687 M
3726 2687 D
S
N
3726 2768 M
3761 2768 D
S
N
3761 2849 M
3726 2849 D
S
N
3726 2930 M
3761 2930 D
S
N
3761 3010 M
3657 3010 D
S
N
3726 3091 M
3761 3091 D
S
N
3761 3172 M
3726 3172 D
S
N
3726 3253 M
3761 3253 D
S
N
3761 3333 M
3726 3333 D
S
N
3657 3414 M
3761 3414 D
S
[4 30] 0 Sd
N
1083 1799 M
1529 1799 D
S
[] 0 Sd
N
1658 1825 M
1658 1765 D
S
N
1661 1825 M
1661 1765 D
S
N
1649 1825 M
1669 1825 D
S
N
1649 1765 M
1692 1765 D
1692 1782 D
1690 1765 D
S
N
1724 1825 M
1716 1822 D
1710 1817 D
1707 1811 D
1704 1799 D
1704 1791 D
1707 1779 D
1710 1773 D
1716 1768 D
1724 1765 D
1730 1765 D
1739 1768 D
1744 1773 D
1747 1779 D
1750 1791 D
1750 1799 D
1747 1811 D
1744 1817 D
1739 1822 D
1730 1825 D
1724 1825 D
S
N
1724 1825 M
1718 1822 D
1713 1817 D
1710 1811 D
1707 1799 D
1707 1791 D
1710 1779 D
1713 1773 D
1718 1768 D
1724 1765 D
S
N
1730 1765 M
1736 1768 D
1742 1773 D
1744 1779 D
1747 1791 D
1747 1799 D
1744 1811 D
1742 1817 D
1736 1822 D
1730 1825 D
S
1.00 0.00 0.00 setrgbcolor
785 992 P
N
785 992 M
785 3120 D
815 3120 D
815 3119 D
845 3119 D
845 3119 D
875 3119 D
875 3124 D
904 3124 D
904 3123 D
934 3123 D
934 3113 D
964 3113 D
964 3119 D
994 3119 D
994 3120 D
1023 3120 D
1023 3110 D
1053 3110 D
1053 3101 D
1083 3101 D
1083 3105 D
1113 3105 D
1113 3100 D
1142 3100 D
1142 3097 D
1172 3097 D
1172 3096 D
1202 3096 D
1202 3095 D
1232 3095 D
1232 3090 D
1261 3090 D
1261 3088 D
1291 3088 D
1291 3088 D
1321 3088 D
1321 3078 D
1351 3078 D
1351 3077 D
1381 3077 D
1381 3075 D
1410 3075 D
1410 3073 D
1440 3073 D
1440 3063 D
1470 3063 D
1470 3062 D
1500 3062 D
1500 3064 D
1529 3064 D
1529 3056 D
1559 3056 D
1559 3050 D
1589 3050 D
1589 3039 D
1619 3039 D
1619 3038 D
1648 3038 D
1648 3039 D
1678 3039 D
1678 3038 D
1708 3038 D
1708 3020 D
1738 3020 D
1738 3015 D
1767 3015 D
1767 3014 D
1797 3014 D
1797 3021 D
1827 3021 D
1827 3005 D
1857 3005 D
1857 2997 D
1886 2997 D
1886 2994 D
1916 2994 D
1916 2995 D
1946 2995 D
1946 2971 D
1976 2971 D
1976 2981 D
2005 2981 D
2005 2969 D
2035 2969 D
2035 2965 D
2065 2965 D
2065 2959 D
2095 2959 D
2095 2960 D
2124 2960 D
2124 2955 D
2154 2955 D
2154 2936 D
2184 2936 D
2184 2933 D
2214 2933 D
2214 2935 D
2243 2935 D
2243 2913 D
2273 2913 D
2273 2912 D
2303 2912 D
2303 2908 D
2333 2908 D
2333 2894 D
2362 2894 D
2362 2880 D
2392 2880 D
2392 2867 D
2422 2867 D
2422 2860 D
2452 2860 D
2452 2861 D
2481 2861 D
2481 2848 D
2511 2848 D
2511 2828 D
2541 2828 D
2541 2827 D
2571 2827 D
2571 2817 D
2601 2817 D
2601 2809 D
2630 2809 D
2630 2799 D
2660 2799 D
2660 2783 D
2660 2783 D
2660 2783 D
2690 2783 D
2690 2769 D
2720 2769 D
2720 2752 D
2749 2752 D
2749 2744 D
2779 2744 D
2779 2728 D
2809 2728 D
2809 2722 D
2839 2722 D
2839 2698 D
2868 2698 D
2868 2686 D
2898 2686 D
2898 2661 D
2928 2661 D
2928 2652 D
2958 2652 D
2958 2640 D
2987 2640 D
2987 2614 D
3017 2614 D
3017 2611 D
3047 2611 D
3047 3006 D
3077 3006 D
3077 3414 D
S
N
3106 3414 M
3106 2453 D
3136 2453 D
3136 2081 D
3166 2081 D
3166 1851 D
3196 1851 D
3196 1694 D
3225 1694 D
3225 1572 D
3255 1572 D
3255 1475 D
3285 1475 D
3285 1391 D
3315 1391 D
3315 1323 D
3344 1323 D
3344 1266 D
3374 1266 D
3374 1214 D
3404 1214 D
3404 1176 D
3434 1176 D
3434 1149 D
3463 1149 D
3463 1136 D
3493 1136 D
3493 1127 D
3523 1127 D
3523 1123 D
3553 1123 D
3553 1117 D
3582 1117 D
3582 1112 D
3612 1112 D
3612 1110 D
3642 1110 D
3642 1107 D
3672 1107 D
3672 1106 D
3701 1106 D
3701 1104 D
3731 1104 D
3731 1098 D
3761 1098 D
S
N
1083 1961 M
1529 1961 D
S
N
1658 1987 M
1658 1926 D
S
N
1661 1987 M
1695 1932 D
S
N
1661 1981 M
1695 1926 D
S
N
1695 1987 M
1695 1926 D
S
N
1649 1987 M
1661 1987 D
S
N
1687 1987 M
1704 1987 D
S
N
1649 1926 M
1667 1926 D
S
N
1724 1987 M
1724 1926 D
S
N
1727 1987 M
1727 1926 D
S
N
1716 1987 M
1736 1987 D
S
N
1716 1926 M
1759 1926 D
1759 1944 D
1756 1926 D
S
N
1791 1987 M
1782 1984 D
1776 1978 D
1773 1972 D
1770 1961 D
1770 1952 D
1773 1941 D
1776 1935 D
1782 1929 D
1791 1926 D
1796 1926 D
1805 1929 D
1811 1935 D
1814 1941 D
1816 1952 D
1816 1961 D
1814 1972 D
1811 1978 D
1805 1984 D
1796 1987 D
1791 1987 D
S
N
1791 1987 M
1785 1984 D
1779 1978 D
1776 1972 D
1773 1961 D
1773 1952 D
1776 1941 D
1779 1935 D
1785 1929 D
1791 1926 D
S
N
1796 1926 M
1802 1929 D
1808 1935 D
1811 1941 D
1814 1952 D
1814 1961 D
1811 1972 D
1808 1978 D
1802 1984 D
1796 1987 D
S
0.00 0.00 1.00 setrgbcolor
N
835 3179 M
785 3179 D
S
N
800 3179 M
800 3123 D
S
N
835 3123 M
785 3123 D
S
N
865 3192 M
795 3192 D
S
N
830 3192 M
830 3130 D
S
N
865 3130 M
795 3130 D
S
N
894 3069 M
825 3069 D
S
N
860 3069 M
860 3016 D
S
N
894 3016 M
825 3016 D
S
N
924 3116 M
855 3116 D
S
N
890 3116 M
890 3052 D
S
N
924 3052 M
855 3052 D
S
N
954 3149 M
885 3149 D
S
N
919 3149 M
919 3095 D
S
N
954 3095 M
885 3095 D
S
N
984 3144 M
914 3144 D
S
N
949 3144 M
949 3089 D
S
N
984 3089 M
914 3089 D
S
N
1013 3190 M
944 3190 D
S
N
979 3190 M
979 3129 D
S
N
1013 3129 M
944 3129 D
S
N
1043 3148 M
974 3148 D
S
N
1009 3148 M
1009 3095 D
S
N
1043 3095 M
974 3095 D
S
N
1073 3122 M
1004 3122 D
S
N
1038 3122 M
1038 3064 D
S
N
1073 3064 M
1004 3064 D
S
N
1103 3188 M
1033 3188 D
S
N
1068 3188 M
1068 3127 D
S
N
1103 3127 M
1033 3127 D
S
N
1132 3101 M
1063 3101 D
S
N
1098 3101 M
1098 3040 D
S
N
1132 3040 M
1063 3040 D
S
N
1162 3138 M
1093 3138 D
S
N
1128 3138 M
1128 3087 D
S
N
1162 3087 M
1093 3087 D
S
N
1192 3096 M
1123 3096 D
S
N
1157 3096 M
1157 3047 D
S
N
1192 3047 M
1123 3047 D
S
N
1222 3110 M
1153 3110 D
S
N
1187 3110 M
1187 3048 D
S
N
1222 3048 M
1153 3048 D
S
N
1251 3172 M
1182 3172 D
S
N
1217 3172 M
1217 3117 D
S
N
1251 3117 M
1182 3117 D
S
N
1281 3119 M
1212 3119 D
S
N
1247 3119 M
1247 3056 D
S
N
1281 3056 M
1212 3056 D
S
N
1311 3127 M
1242 3127 D
S
N
1276 3127 M
1276 3067 D
S
N
1311 3067 M
1242 3067 D
S
N
1341 3120 M
1272 3120 D
S
N
1306 3120 M
1306 3060 D
S
N
1341 3060 M
1272 3060 D
S
N
1370 3095 M
1301 3095 D
S
N
1336 3095 M
1336 3039 D
S
N
1370 3039 M
1301 3039 D
S
N
1400 3110 M
1331 3110 D
S
N
1366 3110 M
1366 3054 D
S
N
1400 3054 M
1331 3054 D
S
N
1430 3082 M
1361 3082 D
S
N
1395 3082 M
1395 3029 D
S
N
1430 3029 M
1361 3029 D
S
N
1460 3085 M
1391 3085 D
S
N
1425 3085 M
1425 3028 D
S
N
1460 3028 M
1391 3028 D
S
N
1490 3092 M
1420 3092 D
S
N
1455 3092 M
1455 3035 D
S
N
1490 3035 M
1420 3035 D
S
N
1519 3070 M
1450 3070 D
S
N
1485 3070 M
1485 3015 D
S
N
1519 3015 M
1450 3015 D
S
N
1549 3100 M
1480 3100 D
S
N
1514 3100 M
1514 3047 D
S
N
1549 3047 M
1480 3047 D
S
N
1579 3057 M
1510 3057 D
S
N
1544 3057 M
1544 3004 D
S
N
1579 3004 M
1510 3004 D
S
N
1609 3037 M
1539 3037 D
S
N
1574 3037 M
1574 2987 D
S
N
1609 2987 M
1539 2987 D
S
N
1638 3061 M
1569 3061 D
S
N
1604 3061 M
1604 3004 D
S
N
1638 3004 M
1569 3004 D
S
N
1668 3058 M
1599 3058 D
S
N
1633 3058 M
1633 3007 D
S
N
1668 3007 M
1599 3007 D
S
N
1698 2988 M
1629 2988 D
S
N
1663 2988 M
1663 2934 D
S
N
1698 2934 M
1629 2934 D
S
N
1728 3039 M
1658 3039 D
S
N
1693 3039 M
1693 2983 D
S
N
1728 2983 M
1658 2983 D
S
N
1757 3028 M
1688 3028 D
S
N
1723 3028 M
1723 2975 D
S
N
1757 2975 M
1688 2975 D
S
N
1787 3062 M
1718 3062 D
S
N
1752 3062 M
1752 3006 D
S
N
1787 3006 M
1718 3006 D
S
N
1817 3035 M
1748 3035 D
S
N
1782 3035 M
1782 2976 D
S
N
1817 2976 M
1748 2976 D
S
N
1847 3017 M
1777 3017 D
S
N
1812 3017 M
1812 2964 D
S
N
1847 2964 M
1777 2964 D
S
N
1876 3033 M
1807 3033 D
S
N
1842 3033 M
1842 2973 D
S
N
1876 2973 M
1807 2973 D
S
N
1906 2963 M
1837 2963 D
S
N
1871 2963 M
1871 2912 D
S
N
1906 2912 M
1837 2912 D
S
N
1936 3005 M
1867 3005 D
S
N
1901 3005 M
1901 2951 D
S
N
1936 2951 M
1867 2951 D
S
N
1966 2955 M
1896 2955 D
S
N
1931 2955 M
1931 2905 D
S
N
1966 2905 M
1896 2905 D
S
N
1995 2980 M
1926 2980 D
S
N
1961 2980 M
1961 2924 D
S
N
1995 2924 M
1926 2924 D
S
N
2025 2998 M
1956 2998 D
S
N
1991 2998 M
1991 2942 D
S
N
2025 2942 M
1956 2942 D
S
N
2055 2933 M
1986 2933 D
S
N
2020 2933 M
2020 2878 D
S
N
2055 2878 M
1986 2878 D
S
N
2085 3038 M
2015 3038 D
S
N
2050 3038 M
2050 2974 D
S
N
2085 2974 M
2015 2974 D
S
N
2114 3011 M
2045 3011 D
S
N
2080 3011 M
2080 2951 D
S
N
2114 2951 M
2045 2951 D
S
N
2144 2940 M
2075 2940 D
S
N
2110 2940 M
2110 2885 D
S
N
2144 2885 M
2075 2885 D
S
N
2174 2958 M
2105 2958 D
S
N
2139 2958 M
2139 2910 D
S
N
2174 2910 M
2105 2910 D
S
N
2204 2981 M
2134 2981 D
S
N
2169 2981 M
2169 2928 D
S
N
2204 2928 M
2134 2928 D
S
N
2233 2887 M
2164 2887 D
S
N
2199 2887 M
2199 2838 D
S
N
2233 2838 M
2164 2838 D
S
N
2263 2988 M
2194 2988 D
S
N
2229 2988 M
2229 2932 D
S
N
2263 2932 M
2194 2932 D
S
N
2293 2905 M
2224 2905 D
S
N
2258 2905 M
2258 2851 D
S
N
2293 2851 M
2224 2851 D
S
N
2323 2957 M
2253 2957 D
S
N
2288 2957 M
2288 2902 D
S
N
2323 2902 M
2253 2902 D
S
N
2352 2925 M
2283 2925 D
S
N
2318 2925 M
2318 2864 D
S
N
2352 2864 M
2283 2864 D
S
N
2382 2941 M
2313 2941 D
S
N
2348 2941 M
2348 2887 D
S
N
2382 2887 M
2313 2887 D
S
N
2412 2880 M
2343 2880 D
S
N
2377 2880 M
2377 2832 D
S
N
2412 2832 M
2343 2832 D
S
N
2442 2908 M
2373 2908 D
S
N
2407 2908 M
2407 2858 D
S
N
2442 2858 M
2373 2858 D
S
N
2471 2895 M
2402 2895 D
S
N
2437 2895 M
2437 2844 D
S
N
2471 2844 M
2402 2844 D
S
N
2501 2872 M
2432 2872 D
S
N
2467 2872 M
2467 2816 D
S
N
2501 2816 M
2432 2816 D
S
N
2531 2821 M
2462 2821 D
S
N
2496 2821 M
2496 2758 D
S
N
2531 2758 M
2462 2758 D
S
N
2561 2855 M
2492 2855 D
S
N
2526 2855 M
2526 2806 D
S
N
2561 2806 M
2492 2806 D
S
N
2590 2861 M
2521 2861 D
S
N
2556 2861 M
2556 2814 D
S
N
2590 2814 M
2521 2814 D
S
N
2620 2878 M
2551 2878 D
S
N
2586 2878 M
2586 2832 D
S
N
2620 2832 M
2551 2832 D
S
N
2650 2769 M
2581 2769 D
S
N
2615 2769 M
2615 2723 D
S
N
2650 2723 M
2581 2723 D
S
N
2680 2827 M
2611 2827 D
S
N
2645 2827 M
2645 2779 D
S
N
2680 2779 M
2611 2779 D
S
N
2710 2826 M
2640 2826 D
S
N
2675 2826 M
2675 2775 D
S
N
2710 2775 M
2640 2775 D
S
N
2739 2803 M
2670 2803 D
S
N
2705 2803 M
2705 2756 D
S
N
2739 2756 M
2670 2756 D
S
N
2769 2771 M
2700 2771 D
S
N
2734 2771 M
2734 2722 D
S
N
2769 2722 M
2700 2722 D
S
N
2799 2755 M
2730 2755 D
S
N
2764 2755 M
2764 2702 D
S
N
2799 2702 M
2730 2702 D
S
N
2829 2749 M
2759 2749 D
S
N
2794 2749 M
2794 2703 D
S
N
2829 2703 M
2759 2703 D
S
N
2858 2721 M
2789 2721 D
S
N
2824 2721 M
2824 2678 D
S
N
2858 2678 M
2789 2678 D
S
N
2888 2712 M
2819 2712 D
S
N
2853 2712 M
2853 2665 D
S
N
2888 2665 M
2819 2665 D
S
N
2918 2717 M
2849 2717 D
S
N
2883 2717 M
2883 2668 D
S
N
2918 2668 M
2849 2668 D
S
N
2948 2670 M
2878 2670 D
S
N
2913 2670 M
2913 2618 D
S
N
2948 2618 M
2878 2618 D
S
N
2977 2672 M
2908 2672 D
S
N
2943 2672 M
2943 2625 D
S
N
2977 2625 M
2908 2625 D
S
N
3007 2607 M
2938 2607 D
S
N
2972 2607 M
2972 2555 D
S
N
3007 2555 M
2938 2555 D
S
N
3037 2606 M
2968 2606 D
S
N
3002 2606 M
3002 2544 D
S
N
3037 2544 M
2968 2544 D
S
N
3067 2632 M
2997 2632 D
S
N
3032 2632 M
3032 2570 D
S
N
3067 2570 M
2997 2570 D
S
N
3096 2254 M
3027 2254 D
S
N
3062 2254 M
3062 2189 D
S
N
3096 2189 M
3027 2189 D
S
N
3126 2446 M
3057 2446 D
S
N
3091 2446 M
3091 2405 D
S
N
3126 2405 M
3057 2405 D
S
N
3156 2582 M
3087 2582 D
S
N
3121 2582 M
3121 2552 D
S
N
3156 2552 M
3087 2552 D
S
N
3186 2346 M
3116 2346 D
S
N
3151 2346 M
3151 2328 D
S
N
3186 2328 M
3116 2328 D
S
N
3215 2147 M
3146 2147 D
S
N
3181 2147 M
3181 2130 D
S
N
3215 2130 M
3146 2130 D
S
N
3245 1960 M
3176 1960 D
S
N
3211 1960 M
3211 1946 D
S
N
3245 1946 M
3176 1946 D
S
N
3275 1825 M
3206 1825 D
S
N
3240 1825 M
3240 1811 D
S
N
3275 1811 M
3206 1811 D
S
N
3305 1684 M
3235 1684 D
S
N
3270 1684 M
3270 1672 D
S
N
3305 1672 M
3235 1672 D
S
N
3334 1598 M
3265 1598 D
S
N
3300 1598 M
3300 1586 D
S
N
3334 1586 M
3265 1586 D
S
N
3364 1477 M
3295 1477 D
S
N
3330 1477 M
3330 1468 D
S
N
3364 1468 M
3295 1468 D
S
N
3394 1402 M
3325 1402 D
S
N
3359 1402 M
3359 1395 D
S
N
3394 1395 M
3325 1395 D
S
N
3424 1329 M
3354 1329 D
S
N
3389 1329 M
3389 1319 D
S
N
3424 1319 M
3354 1319 D
S
N
3453 1271 M
3384 1271 D
S
N
3419 1271 M
3419 1261 D
S
N
3453 1261 M
3384 1261 D
S
N
3483 1230 M
3414 1230 D
S
N
3449 1230 M
3449 1226 D
S
N
3483 1226 M
3414 1226 D
S
N
3513 1204 M
3444 1204 D
S
N
3478 1204 M
3478 1200 D
S
N
3513 1200 M
3444 1200 D
S
N
3543 1194 M
3473 1194 D
S
N
3508 1194 M
3508 1190 D
S
N
3543 1190 M
3473 1190 D
S
N
3572 1183 M
3503 1183 D
S
N
3538 1183 M
3538 1179 D
S
N
3572 1179 M
3503 1179 D
S
N
3602 1173 M
3533 1173 D
S
N
3568 1173 M
3568 1170 D
S
N
3602 1170 M
3533 1170 D
S
N
3632 1168 M
3563 1168 D
S
N
3597 1168 M
3597 1165 D
S
N
3632 1165 M
3563 1165 D
S
N
3662 1165 M
3592 1165 D
S
N
3627 1165 M
3627 1162 D
S
N
3662 1162 M
3592 1162 D
S
N
3691 1161 M
3622 1161 D
S
N
3657 1161 M
3657 1158 D
S
N
3691 1158 M
3622 1158 D
S
N
3721 1157 M
3652 1157 D
S
N
3687 1157 M
3687 1154 D
S
N
3721 1154 M
3652 1154 D
S
N
3751 1155 M
3682 1155 D
S
N
3716 1155 M
3716 1152 D
S
N
3751 1152 M
3682 1152 D
S
N
3761 1147 M
3712 1147 D
S
N
3746 1147 M
3746 1145 D
S
N
3761 1145 M
3712 1145 D
S
N
1326 2155 M
1257 2155 D
S
N
1291 2155 M
1291 2090 D
S
N
1326 2090 M
1257 2090 D
S
N
1658 2148 M
1658 2088 D
S
N
1661 2148 M
1695 2093 D
S
N
1661 2142 M
1695 2088 D
S
N
1695 2148 M
1695 2088 D
S
N
1649 2148 M
1661 2148 D
S
N
1687 2148 M
1704 2148 D
S
N
1649 2088 M
1667 2088 D
S
N
1724 2148 M
1724 2088 D
S
N
1727 2148 M
1762 2093 D
S
N
1727 2142 M
1762 2088 D
S
N
1762 2148 M
1762 2088 D
S
N
1716 2148 M
1727 2148 D
S
N
1753 2148 M
1770 2148 D
S
N
1716 2088 M
1733 2088 D
S
N
1791 2148 M
1791 2088 D
S
N
1793 2148 M
1793 2088 D
S
N
1782 2148 M
1802 2148 D
S
N
1782 2088 M
1825 2088 D
1825 2105 D
1822 2088 D
S
N
1857 2148 M
1848 2145 D
1842 2140 D
1840 2134 D
1837 2122 D
1837 2114 D
1840 2102 D
1842 2096 D
1848 2091 D
1857 2088 D
1863 2088 D
1871 2091 D
1877 2096 D
1880 2102 D
1883 2114 D
1883 2122 D
1880 2134 D
1877 2140 D
1871 2145 D
1863 2148 D
1857 2148 D
S
N
1857 2148 M
1851 2145 D
1845 2140 D
1842 2134 D
1840 2122 D
1840 2114 D
1842 2102 D
1845 2096 D
1851 2091 D
1857 2088 D
S
N
1863 2088 M
1868 2091 D
1874 2096 D
1877 2102 D
1880 2114 D
1880 2122 D
1877 2134 D
1874 2140 D
1868 2145 D
1863 2148 D
S
0.00 0.00 0.00 setrgbcolor
N
785 3414 M
785 992 D
S
N
785 992 M
3761 992 D
S
N
3761 992 M
3761 3414 D
S
N
3761 3414 M
785 3414 D
S
N
785 992 M
3761 992 D
S
N
785 992 M
785 1096 D
S
N
904 1027 M
904 992 D
S
N
1023 992 M
1023 1027 D
S
N
1142 1027 M
1142 992 D
S
N
1261 992 M
1261 1027 D
S
N
1381 1096 M
1381 992 D
S
N
1500 992 M
1500 1027 D
S
N
1619 1027 M
1619 992 D
S
N
1738 992 M
1738 1027 D
S
N
1857 1027 M
1857 992 D
S
N
1976 992 M
1976 1096 D
S
N
2095 1027 M
2095 992 D
S
N
2214 992 M
2214 1027 D
S
N
2333 1027 M
2333 992 D
S
N
2452 992 M
2452 1027 D
S
N
2571 1096 M
2571 992 D
S
N
2690 992 M
2690 1027 D
S
N
2809 1027 M
2809 992 D
S
N
2928 992 M
2928 1027 D
S
N
3047 1027 M
3047 992 D
S
N
3166 992 M
3166 1096 D
S
N
3285 1027 M
3285 992 D
S
N
3404 992 M
3404 1027 D
S
N
3523 1027 M
3523 992 D
S
N
3642 992 M
3642 1027 D
S
N
3761 1096 M
3761 992 D
S
N
739 935 M
731 932 D
725 923 D
722 909 D
722 900 D
725 886 D
731 877 D
739 874 D
745 874 D
754 877 D
759 886 D
762 900 D
762 909 D
759 923 D
754 932 D
745 935 D
739 935 D
S
N
739 935 M
733 932 D
731 929 D
728 923 D
725 909 D
725 900 D
728 886 D
731 880 D
733 877 D
739 874 D
S
N
745 874 M
751 877 D
754 880 D
757 886 D
759 900 D
759 909 D
757 923 D
754 929 D
751 932 D
745 935 D
S
N
785 880 M
783 877 D
785 874 D
788 877 D
785 880 D
S
N
826 935 M
817 932 D
811 923 D
808 909 D
808 900 D
811 886 D
817 877 D
826 874 D
832 874 D
840 877 D
846 886 D
849 900 D
849 909 D
846 923 D
840 932 D
832 935 D
826 935 D
S
N
826 935 M
820 932 D
817 929 D
814 923 D
811 909 D
811 900 D
814 886 D
817 880 D
820 877 D
826 874 D
S
N
832 874 M
837 877 D
840 880 D
843 886 D
846 900 D
846 909 D
843 923 D
840 929 D
837 932 D
832 935 D
S
N
1334 935 M
1326 932 D
1320 923 D
1317 909 D
1317 900 D
1320 886 D
1326 877 D
1334 874 D
1340 874 D
1349 877 D
1355 886 D
1357 900 D
1357 909 D
1355 923 D
1349 932 D
1340 935 D
1334 935 D
S
N
1334 935 M
1329 932 D
1326 929 D
1323 923 D
1320 909 D
1320 900 D
1323 886 D
1326 880 D
1329 877 D
1334 874 D
S
N
1340 874 M
1346 877 D
1349 880 D
1352 886 D
1355 900 D
1355 909 D
1352 923 D
1349 929 D
1346 932 D
1340 935 D
S
N
1381 880 M
1378 877 D
1381 874 D
1383 877 D
1381 880 D
S
N
1406 923 M
1409 920 D
1406 918 D
1404 920 D
1404 923 D
1406 929 D
1409 932 D
1418 935 D
1430 935 D
1438 932 D
1441 929 D
1444 923 D
1444 918 D
1441 912 D
1432 906 D
1418 900 D
1412 897 D
1406 892 D
1404 883 D
1404 874 D
S
N
1430 935 M
1435 932 D
1438 929 D
1441 923 D
1441 918 D
1438 912 D
1430 906 D
1418 900 D
S
N
1404 880 M
1406 883 D
1412 883 D
1427 877 D
1435 877 D
1441 880 D
1444 883 D
S
N
1412 883 M
1427 874 D
1438 874 D
1441 877 D
1444 883 D
1444 889 D
S
N
1930 935 M
1921 932 D
1915 923 D
1912 909 D
1912 900 D
1915 886 D
1921 877 D
1930 874 D
1935 874 D
1944 877 D
1950 886 D
1953 900 D
1953 909 D
1950 923 D
1944 932 D
1935 935 D
1930 935 D
S
N
1930 935 M
1924 932 D
1921 929 D
1918 923 D
1915 909 D
1915 900 D
1918 886 D
1921 880 D
1924 877 D
1930 874 D
S
N
1935 874 M
1941 877 D
1944 880 D
1947 886 D
1950 900 D
1950 909 D
1947 923 D
1944 929 D
1941 932 D
1935 935 D
S
N
1976 880 M
1973 877 D
1976 874 D
1979 877 D
1976 880 D
S
N
2025 929 M
2025 874 D
S
N
2028 935 M
2028 874 D
S
N
2028 935 M
1996 892 D
2042 892 D
S
N
2016 874 M
2036 874 D
S
N
2525 935 M
2516 932 D
2510 923 D
2507 909 D
2507 900 D
2510 886 D
2516 877 D
2525 874 D
2530 874 D
2539 877 D
2545 886 D
2548 900 D
2548 909 D
2545 923 D
2539 932 D
2530 935 D
2525 935 D
S
N
2525 935 M
2519 932 D
2516 929 D
2513 923 D
2510 909 D
2510 900 D
2513 886 D
2516 880 D
2519 877 D
2525 874 D
S
N
2530 874 M
2536 877 D
2539 880 D
2542 886 D
2545 900 D
2545 909 D
2542 923 D
2539 929 D
2536 932 D
2530 935 D
S
N
2571 880 M
2568 877 D
2571 874 D
2574 877 D
2571 880 D
S
N
2628 926 M
2626 923 D
2628 920 D
2631 923 D
2631 926 D
2628 932 D
2623 935 D
2614 935 D
2605 932 D
2600 926 D
2597 920 D
2594 909 D
2594 892 D
2597 883 D
2602 877 D
2611 874 D
2617 874 D
2626 877 D
2631 883 D
2634 892 D
2634 895 D
2631 903 D
2626 909 D
2617 912 D
2614 912 D
2605 909 D
2600 903 D
2597 895 D
S
N
2614 935 M
2608 932 D
2602 926 D
2600 920 D
2597 909 D
2597 892 D
2600 883 D
2605 877 D
2611 874 D
S
N
2617 874 M
2623 877 D
2628 883 D
2631 892 D
2631 895 D
2628 903 D
2623 909 D
2617 912 D
S
N
3120 935 M
3111 932 D
3105 923 D
3102 909 D
3102 900 D
3105 886 D
3111 877 D
3120 874 D
3126 874 D
3134 877 D
3140 886 D
3143 900 D
3143 909 D
3140 923 D
3134 932 D
3126 935 D
3120 935 D
S
N
3120 935 M
3114 932 D
3111 929 D
3108 923 D
3105 909 D
3105 900 D
3108 886 D
3111 880 D
3114 877 D
3120 874 D
S
N
3126 874 M
3131 877 D
3134 880 D
3137 886 D
3140 900 D
3140 909 D
3137 923 D
3134 929 D
3131 932 D
3126 935 D
S
N
3166 880 M
3163 877 D
3166 874 D
3169 877 D
3166 880 D
S
N
3203 935 M
3195 932 D
3192 926 D
3192 918 D
3195 912 D
3203 909 D
3215 909 D
3224 912 D
3226 918 D
3226 926 D
3224 932 D
3215 935 D
3203 935 D
S
N
3203 935 M
3198 932 D
3195 926 D
3195 918 D
3198 912 D
3203 909 D
S
N
3215 909 M
3221 912 D
3224 918 D
3224 926 D
3221 932 D
3215 935 D
S
N
3203 909 M
3195 906 D
3192 903 D
3189 897 D
3189 886 D
3192 880 D
3195 877 D
3203 874 D
3215 874 D
3224 877 D
3226 880 D
3229 886 D
3229 897 D
3226 903 D
3224 906 D
3215 909 D
S
N
3203 909 M
3198 906 D
3195 903 D
3192 897 D
3192 886 D
3195 880 D
3198 877 D
3203 874 D
S
N
3215 874 M
3221 877 D
3224 880 D
3226 886 D
3226 897 D
3224 903 D
3221 906 D
3215 909 D
S
N
3706 923 M
3712 926 D
3721 935 D
3721 874 D
S
N
3718 932 M
3718 874 D
S
N
3706 874 M
3732 874 D
S
N
3761 880 M
3758 877 D
3761 874 D
3764 877 D
3761 880 D
S
N
3801 935 M
3793 932 D
3787 923 D
3784 909 D
3784 900 D
3787 886 D
3793 877 D
3801 874 D
3807 874 D
3816 877 D
3822 886 D
3824 900 D
3824 909 D
3822 923 D
3816 932 D
3807 935 D
3801 935 D
S
N
3801 935 M
3796 932 D
3793 929 D
3790 923 D
3787 909 D
3787 900 D
3790 886 D
3793 880 D
3796 877 D
3801 874 D
S
N
3807 874 M
3813 877 D
3816 880 D
3819 886 D
3822 900 D
3822 909 D
3819 923 D
3816 929 D
3813 932 D
3807 935 D
S
N
785 3414 M
3761 3414 D
S
N
785 3310 M
785 3414 D
S
N
904 3414 M
904 3379 D
S
N
1023 3379 M
1023 3414 D
S
N
1142 3414 M
1142 3379 D
S
N
1261 3379 M
1261 3414 D
S
N
1381 3414 M
1381 3310 D
S
N
1500 3379 M
1500 3414 D
S
N
1619 3414 M
1619 3379 D
S
N
1738 3379 M
1738 3414 D
S
N
1857 3414 M
1857 3379 D
S
N
1976 3310 M
1976 3414 D
S
N
2095 3414 M
2095 3379 D
S
N
2214 3379 M
2214 3414 D
S
N
2333 3414 M
2333 3379 D
S
N
2452 3379 M
2452 3414 D
S
N
2571 3414 M
2571 3310 D
S
N
2690 3379 M
2690 3414 D
S
N
2809 3414 M
2809 3379 D
S
N
2928 3379 M
2928 3414 D
S
N
3047 3414 M
3047 3379 D
S
N
3166 3310 M
3166 3414 D
S
N
3285 3414 M
3285 3379 D
S
N
3404 3379 M
3404 3414 D
S
N
3523 3414 M
3523 3379 D
S
N
3642 3379 M
3642 3414 D
S
N
3761 3414 M
3761 3310 D
S
N
785 992 M
785 3414 D
S
N
785 992 M
889 992 D
S
N
820 1073 M
785 1073 D
S
N
785 1153 M
820 1153 D
S
N
820 1234 M
785 1234 D
S
N
785 1315 M
820 1315 D
S
N
889 1396 M
785 1396 D
S
N
785 1476 M
820 1476 D
S
N
820 1557 M
785 1557 D
S
N
785 1638 M
820 1638 D
S
N
820 1719 M
785 1719 D
S
N
785 1799 M
889 1799 D
S
N
820 1880 M
785 1880 D
S
N
785 1961 M
820 1961 D
S
N
820 2042 M
785 2042 D
S
N
785 2122 M
820 2122 D
S
N
889 2203 M
785 2203 D
S
N
785 2284 M
820 2284 D
S
N
820 2364 M
785 2364 D
S
N
785 2445 M
820 2445 D
S
N
820 2526 M
785 2526 D
S
N
785 2607 M
889 2607 D
S
N
820 2687 M
785 2687 D
S
N
785 2768 M
820 2768 D
S
N
820 2849 M
785 2849 D
S
N
785 2930 M
820 2930 D
S
N
889 3010 M
785 3010 D
S
N
785 3091 M
820 3091 D
S
N
820 3172 M
785 3172 D
S
N
785 3253 M
820 3253 D
S
N
820 3333 M
785 3333 D
S
N
785 3414 M
889 3414 D
S
N
575 1018 M
566 1015 D
561 1006 D
558 992 D
558 983 D
561 969 D
566 960 D
575 957 D
581 957 D
589 960 D
595 969 D
598 983 D
598 992 D
595 1006 D
589 1015 D
581 1018 D
575 1018 D
S
N
575 1018 M
569 1015 D
566 1012 D
563 1006 D
561 992 D
561 983 D
563 969 D
566 963 D
569 960 D
575 957 D
S
N
581 957 M
586 960 D
589 963 D
592 969 D
595 983 D
595 992 D
592 1006 D
589 1012 D
586 1015 D
581 1018 D
S
N
621 963 M
618 960 D
621 957 D
624 960 D
621 963 D
S
N
661 1018 M
653 1015 D
647 1006 D
644 992 D
644 983 D
647 969 D
653 960 D
661 957 D
667 957 D
676 960 D
682 969 D
684 983 D
684 992 D
682 1006 D
676 1015 D
667 1018 D
661 1018 D
S
N
661 1018 M
656 1015 D
653 1012 D
650 1006 D
647 992 D
647 983 D
650 969 D
653 963 D
656 960 D
661 957 D
S
N
667 957 M
673 960 D
676 963 D
679 969 D
682 983 D
682 992 D
679 1006 D
676 1012 D
673 1015 D
667 1018 D
S
N
719 1018 M
710 1015 D
705 1006 D
702 992 D
702 983 D
705 969 D
710 960 D
719 957 D
725 957 D
733 960 D
739 969 D
742 983 D
742 992 D
739 1006 D
733 1015 D
725 1018 D
719 1018 D
S
N
719 1018 M
713 1015 D
710 1012 D
708 1006 D
705 992 D
705 983 D
708 969 D
710 963 D
713 960 D
719 957 D
S
N
725 957 M
731 960 D
733 963 D
736 969 D
739 983 D
739 992 D
736 1006 D
733 1012 D
731 1015 D
725 1018 D
S
N
575 1422 M
566 1419 D
561 1410 D
558 1396 D
558 1387 D
561 1373 D
566 1364 D
575 1361 D
581 1361 D
589 1364 D
595 1373 D
598 1387 D
598 1396 D
595 1410 D
589 1419 D
581 1422 D
575 1422 D
S
N
575 1422 M
569 1419 D
566 1416 D
563 1410 D
561 1396 D
561 1387 D
563 1373 D
566 1367 D
569 1364 D
575 1361 D
S
N
581 1361 M
586 1364 D
589 1367 D
592 1373 D
595 1387 D
595 1396 D
592 1410 D
589 1416 D
586 1419 D
581 1422 D
S
N
621 1367 M
618 1364 D
621 1361 D
624 1364 D
621 1367 D
S
N
647 1410 M
650 1407 D
647 1404 D
644 1407 D
644 1410 D
647 1416 D
650 1419 D
659 1422 D
670 1422 D
679 1419 D
682 1416 D
684 1410 D
684 1404 D
682 1399 D
673 1393 D
659 1387 D
653 1384 D
647 1378 D
644 1370 D
644 1361 D
S
N
670 1422 M
676 1419 D
679 1416 D
682 1410 D
682 1404 D
679 1399 D
670 1393 D
659 1387 D
S
N
644 1367 M
647 1370 D
653 1370 D
667 1364 D
676 1364 D
682 1367 D
684 1370 D
S
N
653 1370 M
667 1361 D
679 1361 D
682 1364 D
684 1370 D
684 1375 D
S
N
708 1422 M
702 1393 D
S
N
702 1393 M
708 1399 D
716 1401 D
725 1401 D
734 1399 D
739 1393 D
742 1384 D
742 1378 D
739 1370 D
734 1364 D
725 1361 D
716 1361 D
708 1364 D
705 1367 D
702 1373 D
702 1375 D
705 1378 D
708 1375 D
705 1373 D
S
N
725 1401 M
731 1399 D
736 1393 D
739 1384 D
739 1378 D
736 1370 D
731 1364 D
725 1361 D
S
N
708 1422 M
736 1422 D
S
N
708 1419 M
722 1419 D
736 1422 D
S
N
575 1825 M
566 1822 D
561 1814 D
558 1799 D
558 1791 D
561 1776 D
566 1768 D
575 1765 D
581 1765 D
589 1768 D
595 1776 D
598 1791 D
598 1799 D
595 1814 D
589 1822 D
581 1825 D
575 1825 D
S
N
575 1825 M
569 1822 D
566 1820 D
563 1814 D
561 1799 D
561 1791 D
563 1776 D
566 1771 D
569 1768 D
575 1765 D
S
N
581 1765 M
586 1768 D
589 1771 D
592 1776 D
595 1791 D
595 1799 D
592 1814 D
589 1820 D
586 1822 D
581 1825 D
S
N
621 1771 M
618 1768 D
621 1765 D
624 1768 D
621 1771 D
S
N
650 1825 M
644 1796 D
S
N
644 1796 M
650 1802 D
659 1805 D
667 1805 D
676 1802 D
682 1796 D
684 1788 D
684 1782 D
682 1773 D
676 1768 D
667 1765 D
659 1765 D
650 1768 D
647 1771 D
644 1776 D
644 1779 D
647 1782 D
650 1779 D
647 1776 D
S
N
667 1805 M
673 1802 D
679 1796 D
682 1788 D
682 1782 D
679 1773 D
673 1768 D
667 1765 D
S
N
650 1825 M
679 1825 D
S
N
650 1822 M
664 1822 D
679 1825 D
S
N
719 1825 M
710 1822 D
705 1814 D
702 1799 D
702 1791 D
705 1776 D
710 1768 D
719 1765 D
725 1765 D
733 1768 D
739 1776 D
742 1791 D
742 1799 D
739 1814 D
733 1822 D
725 1825 D
719 1825 D
S
N
719 1825 M
713 1822 D
710 1820 D
708 1814 D
705 1799 D
705 1791 D
708 1776 D
710 1771 D
713 1768 D
719 1765 D
S
N
725 1765 M
731 1768 D
733 1771 D
736 1776 D
739 1791 D
739 1799 D
736 1814 D
733 1820 D
731 1822 D
725 1825 D
S
N
575 2229 M
566 2226 D
561 2217 D
558 2203 D
558 2194 D
561 2180 D
566 2171 D
575 2168 D
581 2168 D
589 2171 D
595 2180 D
598 2194 D
598 2203 D
595 2217 D
589 2226 D
581 2229 D
575 2229 D
S
N
575 2229 M
569 2226 D
566 2223 D
563 2217 D
560 2203 D
560 2194 D
563 2180 D
566 2174 D
569 2171 D
575 2168 D
S
N
581 2168 M
586 2171 D
589 2174 D
592 2180 D
595 2194 D
595 2203 D
592 2217 D
589 2223 D
586 2226 D
581 2229 D
S
N
621 2174 M
618 2171 D
621 2168 D
624 2171 D
621 2174 D
S
N
644 2229 M
644 2212 D
S
N
644 2217 M
647 2223 D
653 2229 D
659 2229 D
673 2220 D
679 2220 D
682 2223 D
684 2229 D
S
N
647 2223 M
653 2226 D
659 2226 D
673 2220 D
S
N
684 2229 M
684 2220 D
682 2212 D
670 2197 D
667 2191 D
664 2183 D
664 2168 D
S
N
682 2212 M
667 2197 D
664 2191 D
661 2183 D
661 2168 D
S
N
708 2229 M
702 2200 D
S
N
702 2200 M
708 2206 D
716 2209 D
725 2209 D
734 2206 D
739 2200 D
742 2191 D
742 2186 D
739 2177 D
734 2171 D
725 2168 D
716 2168 D
708 2171 D
705 2174 D
702 2180 D
702 2183 D
705 2186 D
708 2183 D
705 2180 D
S
N
725 2209 M
731 2206 D
736 2200 D
739 2191 D
739 2186 D
736 2177 D
731 2171 D
725 2168 D
S
N
708 2229 M
736 2229 D
S
N
708 2226 M
722 2226 D
736 2229 D
S
N
566 2621 M
572 2624 D
581 2633 D
581 2572 D
S
N
578 2630 M
578 2572 D
S
N
566 2572 M
592 2572 D
S
N
621 2578 M
618 2575 D
621 2572 D
624 2575 D
621 2578 D
S
N
661 2633 M
653 2630 D
647 2621 D
644 2607 D
644 2598 D
647 2584 D
653 2575 D
661 2572 D
667 2572 D
676 2575 D
682 2584 D
684 2598 D
684 2607 D
682 2621 D
676 2630 D
667 2633 D
661 2633 D
S
N
661 2633 M
656 2630 D
653 2627 D
650 2621 D
647 2607 D
647 2598 D
650 2584 D
653 2578 D
656 2575 D
661 2572 D
S
N
667 2572 M
673 2575 D
676 2578 D
679 2584 D
682 2598 D
682 2607 D
679 2621 D
676 2627 D
673 2630 D
667 2633 D
S
N
719 2633 M
710 2630 D
705 2621 D
702 2607 D
702 2598 D
705 2584 D
710 2575 D
719 2572 D
725 2572 D
733 2575 D
739 2584 D
742 2598 D
742 2607 D
739 2621 D
733 2630 D
725 2633 D
719 2633 D
S
N
719 2633 M
713 2630 D
710 2627 D
708 2621 D
705 2607 D
705 2598 D
708 2584 D
710 2578 D
713 2575 D
719 2572 D
S
N
725 2572 M
731 2575 D
733 2578 D
736 2584 D
739 2598 D
739 2607 D
736 2621 D
733 2627 D
731 2630 D
725 2633 D
S
N
566 3025 M
572 3028 D
581 3036 D
581 2976 D
S
N
578 3033 M
578 2976 D
S
N
566 2976 M
592 2976 D
S
N
621 2982 M
618 2979 D
621 2976 D
624 2979 D
621 2982 D
S
N
647 3025 M
650 3022 D
647 3019 D
644 3022 D
644 3025 D
647 3031 D
650 3033 D
659 3036 D
670 3036 D
679 3033 D
682 3031 D
684 3025 D
684 3019 D
682 3013 D
673 3007 D
659 3002 D
653 2999 D
647 2993 D
644 2984 D
644 2976 D
S
N
670 3036 M
676 3033 D
679 3031 D
682 3025 D
682 3019 D
679 3013 D
670 3007 D
659 3002 D
S
N
644 2982 M
647 2984 D
653 2984 D
667 2979 D
676 2979 D
682 2982 D
684 2984 D
S
N
653 2984 M
667 2976 D
679 2976 D
682 2979 D
684 2984 D
684 2990 D
S
N
708 3036 M
702 3007 D
S
N
702 3007 M
708 3013 D
716 3016 D
725 3016 D
734 3013 D
739 3007 D
742 2999 D
742 2993 D
739 2984 D
734 2979 D
725 2976 D
716 2976 D
708 2979 D
705 2982 D
702 2987 D
702 2990 D
705 2993 D
708 2990 D
705 2987 D
S
N
725 3016 M
731 3013 D
736 3007 D
739 2999 D
739 2993 D
736 2984 D
731 2979 D
725 2976 D
S
N
708 3036 M
736 3036 D
S
N
708 3033 M
722 3033 D
736 3036 D
S
N
566 3428 M
572 3431 D
581 3440 D
581 3379 D
S
N
578 3437 M
578 3379 D
S
N
566 3379 M
592 3379 D
S
N
621 3385 M
618 3382 D
621 3379 D
624 3382 D
621 3385 D
S
N
650 3440 M
644 3411 D
S
N
644 3411 M
650 3417 D
659 3420 D
667 3420 D
676 3417 D
682 3411 D
684 3402 D
684 3397 D
682 3388 D
676 3382 D
667 3379 D
659 3379 D
650 3382 D
647 3385 D
644 3391 D
644 3394 D
647 3397 D
650 3394 D
647 3391 D
S
N
667 3420 M
673 3417 D
679 3411 D
682 3402 D
682 3397 D
679 3388 D
673 3382 D
667 3379 D
S
N
650 3440 M
679 3440 D
S
N
650 3437 M
664 3437 D
679 3440 D
S
N
719 3440 M
710 3437 D
705 3428 D
702 3414 D
702 3405 D
705 3391 D
710 3382 D
719 3379 D
725 3379 D
733 3382 D
739 3391 D
742 3405 D
742 3414 D
739 3428 D
733 3437 D
725 3440 D
719 3440 D
S
N
719 3440 M
713 3437 D
710 3434 D
708 3428 D
705 3414 D
705 3405 D
708 3391 D
710 3385 D
713 3382 D
719 3379 D
S
N
725 3379 M
731 3382 D
733 3385 D
736 3391 D
739 3405 D
739 3414 D
736 3428 D
733 3434 D
731 3437 D
725 3440 D
S
N
3761 992 M
3761 3414 D
S
N
3657 992 M
3761 992 D
S
N
3761 1073 M
3726 1073 D
S
N
3726 1153 M
3761 1153 D
S
N
3761 1234 M
3726 1234 D
S
N
3726 1315 M
3761 1315 D
S
N
3761 1396 M
3657 1396 D
S
N
3726 1476 M
3761 1476 D
S
N
3761 1557 M
3726 1557 D
S
N
3726 1638 M
3761 1638 D
S
N
3761 1719 M
3726 1719 D
S
N
3657 1799 M
3761 1799 D
S
N
3761 1880 M
3726 1880 D
S
N
3726 1961 M
3761 1961 D
S
N
3761 2042 M
3726 2042 D
S
N
3726 2122 M
3761 2122 D
S
N
3761 2203 M
3657 2203 D
S
N
3726 2284 M
3761 2284 D
S
N
3761 2364 M
3726 2364 D
S
N
3726 2445 M
3761 2445 D
S
N
3761 2526 M
3726 2526 D
S
N
3657 2607 M
3761 2607 D
S
N
3761 2687 M
3726 2687 D
S
N
3726 2768 M
3761 2768 D
S
N
3761 2849 M
3726 2849 D
S
N
3726 2930 M
3761 2930 D
S
N
3761 3010 M
3657 3010 D
S
N
3726 3091 M
3761 3091 D
S
N
3761 3172 M
3726 3172 D
S
N
3726 3253 M
3761 3253 D
S
N
3761 3333 M
3726 3333 D
S
N
3657 3414 M
3761 3414 D
S
showpage
%%Trailer
%%Pages: 1
%%BoundingBox:
