%!PS-Adobe-2.0 EPSF-2.0
%%BoundingBox:  0 0 567 544
%%Title: HWW_900_DeltaPhi_ll_reweighting_cut_YR3.eps: HWW 900Gev dPhi reweighting for interference with cuts
%%Creator: ROOT Version 5.34/05
%%CreationDate: Fri Jun 14 04:49:37 2013
%%EndComments
%%BeginProlog
80 dict begin
/s {stroke} def /l {lineto} def /m {moveto} def /t {translate} def
/r {rotate} def /rl {roll}  def /R {repeat} def
/d {rlineto} def /rm {rmoveto} def /gr {grestore} def /f {eofill} def
/c {setrgbcolor} def /black {0 setgray} def /sd {setdash} def
/cl {closepath} def /sf {scalefont setfont} def /lw {setlinewidth} def
/box {m dup 0 exch d exch 0 d 0 exch neg d cl} def
/NC{systemdict begin initclip end}def/C{NC box clip newpath}def
/bl {box s} def /bf {box f} def /Y { 0 exch d} def /X { 0 d} def 
/K {{pop pop 0 moveto} exch kshow} bind def
/ita {/ang 15 def gsave [1 0 ang dup sin exch cos div 1 0 0] concat} def 
/mp {newpath /y exch def /x exch def} def
/side {[w .77 mul w .23 mul] .385 w mul sd w 0 l currentpoint t -144 r} def
/mr {mp x y w2 0 360 arc} def /m24 {mr s} def /m20 {mr f} def
/mb {mp x y w2 add m w2 neg 0 d 0 w neg d w 0 d 0 w d cl} def
/mt {mp x y w2 add m w2 neg w neg d w 0 d cl} def
/m21 {mb f} def /m25 {mb s} def /m22 {mt f} def /m26{mt s} def
/m23 {mp x y w2 sub m w2 w d w neg 0 d cl f} def
/m27 {mp x y w2 add m w3 neg w2 neg d w3 w2 neg d w3 w2 d cl s} def
/m28 {mp x w2 sub y w2 sub w3 add m w3 0 d  0 w3 neg d w3 0 d 0 w3 d w3 0 d  0 w3 d w3 neg 0 d 0 w3 d w3 neg 0 d 0 w3 neg d w3 neg 0 d cl s } def
/m29 {mp gsave x w2 sub y w2 add w3 sub m currentpoint t 4 {side} repeat cl fill gr} def
/m30 {mp gsave x w2 sub y w2 add w3 sub m currentpoint t 4 {side} repeat cl s gr} def
/m31 {mp x y w2 sub m 0 w d x w2 sub y m w 0 d x w2 sub y w2 add m w w neg d x w2 sub y w2 sub m w w d s} def
/m32 {mp x y w2 sub m w2 w d w neg 0 d cl s} def
/m33 {mp x y w2 add m w3 neg w2 neg d w3 w2 neg d w3 w2 d cl f} def
/m34 {mp x w2 sub y w2 sub w3 add m w3 0 d  0 w3 neg d w3 0 d 0 w3 d w3 0 d  0 w3 d w3 neg 0 d 0 w3 d w3 neg 0 d 0 w3 neg d w3 neg 0 d cl f } def
/m2 {mp x y w2 sub m 0 w d x w2 sub y m w 0 d s} def
/m5 {mp x w2 sub y w2 sub m w w d x w2 sub y w2 add m w w neg d s} def
/reEncode {exch findfont dup length dict begin {1 index /FID eq  {pop pop} {def} ifelse } forall /Encoding exch def currentdict end dup /FontName get exch definefont pop } def [/Times-Bold /Times-Italic /Times-BoldItalic /Helvetica /Helvetica-Oblique
 /Helvetica-Bold /Helvetica-BoldOblique /Courier /Courier-Oblique /Courier-Bold /Courier-BoldOblique /Times-Roman /AvantGarde-Book /AvantGarde-BookOblique /AvantGarde-Demi /AvantGarde-DemiOblique /Bookman-Demi /Bookman-DemiItalic /Bookman-Light
 /Bookman-LightItalic /Helvetica-Narrow /Helvetica-Narrow-Bold /Helvetica-Narrow-BoldOblique /Helvetica-Narrow-Oblique /NewCenturySchlbk-Roman /NewCenturySchlbk-Bold /NewCenturySchlbk-BoldItalic /NewCenturySchlbk-Italic /Palatino-Bold
 /Palatino-BoldItalic /Palatino-Italic /Palatino-Roman ] {ISOLatin1Encoding reEncode } forall
%%EndProlog
%%BeginSetup
%%EndSetup
newpath  gsave  .25 .25 scale  gsave  0 0 t black[  ] 0 sd 3 lw 1 1 1 c 2268 2177 0 0 bf black 1 1 1 c 2268 1568 0 609 bf black 1 1 1 c 1814 1411 227 609 bf black 1814 1411 227 609 bl 0 0 1 c 1 1 1 c 0 0 1 c 227 609 m 90 X 883 Y 10 X 346 Y 9 X 70 Y 9
 X 21 Y 9 X 24 Y 9 X -5 Y 9 X -33 Y 9 X -35 Y 9 X -67 Y 9 X -60 Y 9 X -78 Y 9 X -70 Y 9 X -71 Y 9 X -69 Y 9 X -66 Y 10 X -60 Y 9 X -57 Y 9 X -58 Y 9 X -44 Y 9 X -42 Y 9 X -38 Y 9 X -45 Y 9 X -36 Y 9 X -25 Y 9 X -28 Y 9 X -17 Y 9 X -30 Y 9 X -16 Y 9 X
 -26 Y 10 X -14 Y 9 X -11 Y 9 X -16 Y 9 X -14 Y 9 X -15 Y 9 X -3 Y 9 X -13 Y 9 X -8 Y 9 X -9 Y 9 X -12 Y 9 X -2 Y 9 X -11 Y 9 X -4 Y 9 X -5 Y 10 X -7 Y 9 X -3 Y 9 X -1 Y 9 X -8 Y 9 X -2 Y 9 X -4 Y 9 X -5 Y 9 X -1 Y 9 X -6 Y 9 X -1 Y 9 X 2 Y 9 X -3 Y
 9 X -8 Y 9 X 3 Y 10 X -2 Y 9 X -3 Y 9 X -4 Y 9 X 3 Y 9 X -5 Y 9 X -1 Y 9 X -1 Y 9 X -2 Y 9 X 1 Y 9 X -2 Y 9 X -1 Y 9 X -3 Y 18 X -2 Y 10 X 1 Y 9 X -3 Y 9 X 4 Y 9 X -5 Y 9 X 3 Y 9 X -2 Y 9 X -1 Y 9 X -1 Y 9 X -2 Y 9 X 3 Y 9 X -2 Y 18 X 1 Y 9 X -2 Y
 10 X 4 Y 9 X -9 Y 9 X 3 Y 9 X 1 Y 9 X 1 Y 9 X 2 Y 9 X -2 Y 9 X 2 Y 9 X -3 Y 9 X 5 Y 9 X -3 Y 18 X 3 Y 9 X -2 Y 9 X -1 Y 10 X 2 Y 9 X 1 Y 9 X -3 Y 9 X 2 Y 9 X 1 Y 9 X 2 Y 9 X -1 Y 9 X 2 Y 9 X 1 Y 18 X 1 Y 18 X 2 Y 19 X 2 Y 9 X 3 Y 9 X -2 Y 9 X 3 Y 9
 X 3 Y 9 X -3 Y 9 X 3 Y 9 X 1 Y 9 X 1 Y 9 X 3 Y 9 X 7 Y 18 X 5 Y 9 X -1 Y 10 X -1 Y 9 X 4 Y 9 X 4 Y 9 X 2 Y 9 X 9 Y 9 X 1 Y 9 X 5 Y 9 X 4 Y 9 X 2 Y 9 X 8 Y 9 X 6 Y 9 X 4 Y 9 X 4 Y 9 X 10 Y 10 X 8 Y 9 X 6 Y 9 X 9 Y 9 X 10 Y 9 X 12 Y 9 X 12 Y 9 X 15 Y
 9 X 10 Y 9 X 14 Y 9 X 16 Y 9 X 25 Y 9 X 24 Y 9 X 8 Y 9 X 38 Y 10 X 23 Y 9 X 29 Y 9 X 33 Y 9 X 36 Y 9 X 42 Y 9 X 35 Y 9 X 53 Y 9 X 51 Y 9 X 64 Y 9 X 65 Y 9 X 59 Y 9 X 70 Y 9 X 77 Y 9 X 63 Y 10 X 87 Y 9 X 67 Y 9 X 51 Y 9 X 46 Y 9 X 22 Y 9 X 1 Y 9 X
 -16 Y 9 X -26 Y 9 X -71 Y 9 X -338 Y 9 X -887 Y 91 X s black 227 609 m 1814 X s 356 647 m -38 Y s 408 628 m -19 Y s 460 628 m -19 Y s 512 628 m -19 Y s 564 628 m -19 Y s 616 647 m -38 Y s 667 628 m -19 Y s 719 628 m -19 Y s 771 628 m -19 Y s 823 628
 m -19 Y s 875 647 m -38 Y s 927 628 m -19 Y s 978 628 m -19 Y s 1030 628 m -19 Y s 1082 628 m -19 Y s 1134 647 m -38 Y s 1186 628 m -19 Y s 1238 628 m -19 Y s 1289 628 m -19 Y s 1341 628 m -19 Y s 1393 647 m -38 Y s 1445 628 m -19 Y s 1497 628 m -19
 Y s 1549 628 m -19 Y s 1600 628 m -19 Y s 1652 647 m -38 Y s 1704 628 m -19 Y s 1756 628 m -19 Y s 1808 628 m -19 Y s 1860 628 m -19 Y s 1911 647 m -38 Y s 356 647 m -38 Y s 305 628 m -19 Y s 253 628 m -19 Y s 1911 647 m -38 Y s 1963 628 m -19 Y s
 2015 628 m -19 Y s
 gsave  2268 1568 0 609 C 330.471 558.382 t 0 r /Helvetica findfont 49.4479 sf 0 0 m (\2553) show NC gr 
 gsave  2268 1568 0 609 C 592.569 558.382 t 0 r /Helvetica findfont 49.4479 sf 0 0 m (\2552) show NC gr 
 gsave  2268 1568 0 609 C 854.667 558.382 t 0 r /Helvetica findfont 49.4479 sf 0 0 m (\2551) show NC gr 
 gsave  2268 1568 0 609 C 1116.76 558.382 t 0 r /Helvetica findfont 49.4479 sf 0 0 m (0) show NC gr 
 gsave  2268 1568 0 609 C 1378.86 558.382 t 0 r /Helvetica findfont 49.4479 sf 0 0 m (1) show NC gr 
 gsave  2268 1568 0 609 C 1633.36 558.382 t 0 r /Helvetica findfont 49.4479 sf 0 0 m (2) show NC gr 
 gsave  2268 1568 0 609 C 1895.46 558.382 t 0 r /Helvetica findfont 49.4479 sf 0 0 m (3) show NC gr  227 609 m 1411 Y s
 gsave  2268 1568 0 609 C 49.3808 1371.27 t 90 r /Symbol findfont 49.4479 sf 0 0 m (f) show NC gr 
 gsave  2268 1568 0 609 C 49.3808 1340.88 t 90 r /Symbol findfont 49.4479 sf 0 0 m (D) show NC gr 
 gsave  2268 1568 0 609 C 49.3808 1295.3 t 90 r /Helvetica findfont 49.4479 sf 0 0 m (/d) show NC gr 
 gsave  2268 1568 0 609 C 49.3808 1264.91 t 90 r /Symbol findfont 49.4479 sf 0 0 m (s) show NC gr 
 gsave  2268 1568 0 609 C 49.3808 1238.32 t 90 r /Helvetica findfont 49.4479 sf 0 0 m (d) show NC gr  288 609 m -61 X s 257 655 m -30 X s 257 700 m -30 X s 257 746 m -30 X s 257 791 m -30 X s 288 837 m -61 X s 257 882 m -30 X s 257 928 m -30 X s 257
 973 m -30 X s 257 1019 m -30 X s 288 1064 m -61 X s 257 1110 m -30 X s 257 1155 m -30 X s 257 1201 m -30 X s 257 1246 m -30 X s 288 1292 m -61 X s 257 1337 m -30 X s 257 1383 m -30 X s 257 1428 m -30 X s 257 1474 m -30 X s 288 1519 m -61 X s 257
 1565 m -30 X s 257 1610 m -30 X s 257 1656 m -30 X s 257 1701 m -30 X s 288 1747 m -61 X s 257 1792 m -30 X s 257 1838 m -30 X s 257 1883 m -30 X s 257 1929 m -30 X s 288 1974 m -61 X s 288 1974 m -61 X s
 gsave  2268 1568 0 609 C 186.127 592.569 t 0 r /Helvetica findfont 49.4479 sf 0 0 m (0) show NC gr 
 gsave  2268 1568 0 609 C 60.7763 820.48 t 0 r /Helvetica findfont 49.4479 sf 0 0 m (0.0005) show NC gr 
 gsave  2268 1568 0 609 C 98.7615 1048.39 t 0 r /Helvetica findfont 49.4479 sf 0 0 m (0.001) show NC gr 
 gsave  2268 1568 0 609 C 60.7763 1276.3 t 0 r /Helvetica findfont 49.4479 sf 0 0 m (0.0015) show NC gr 
 gsave  2268 1568 0 609 C 91.1645 1504.21 t 0 r /Helvetica findfont 49.4479 sf 0 0 m (0.002) show NC gr 
 gsave  2268 1568 0 609 C 60.7763 1728.33 t 0 r /Helvetica findfont 49.4479 sf 0 0 m (0.0025) show NC gr 
 gsave  2268 1568 0 609 C 91.1645 1956.24 t 0 r /Helvetica findfont 49.4479 sf 0 0 m (0.003) show NC gr  0 0 1 c /w 2 def /w2 {w 2 div} def /w3 {w 3 div} def 231 609 m20 240 609 m20 249 609 m20 259 609 m20 268 609 m20 277 609 m20 286 609 m20 295 609
 m20 304 609 m20 313 609 m20 322 1492 m20 331 1838 m20 340 1908 m20 349 1929 m20 358 1953 m20 367 1948 m20 376 1915 m20 386 1880 m20 395 1813 m20 404 1753 m20 413 1675 m20 422 1605 m20 431 1534 m20 440 1465 m20 449 1399 m20 458 1339 m20 467 1282 m20
 476 1224 m20 485 1180 m20 494 1138 m20 503 1100 m20 513 1055 m20 522 1019 m20 531 994 m20 540 966 m20 549 949 m20 558 919 m20 567 903 m20 576 877 m20 585 863 m20 594 852 m20 603 836 m20 612 822 m20 621 807 m20 630 804 m20 639 791 m20 649 783 m20 658
 774 m20 667 762 m20 676 760 m20 685 749 m20 694 745 m20 703 740 m20 712 733 m20 721 730 m20 730 729 m20 739 721 m20 748 719 m20 757 715 m20 766 710 m20 776 709 m20 785 703 m20 794 702 m20 803 704 m20 812 701 m20 821 693 m20 830 696 m20 839 694 m20
 848 691 m20 857 687 m20 866 690 m20 875 685 m20 884 684 m20 893 683 m20 903 681 m20 912 682 m20 921 680 m20 930 679 m20 939 676 m20 948 676 m20 957 674 m20 966 675 m20 975 672 m20 984 676 m20 993 671 m20 1002 674 m20 1011 672 m20 1020 671 m20 1030
 670 m20 1039 668 m20 1048 671 m20 1057 669 m20 1066 669 m20 1075 670 m20 1084 668 m20 1093 672 m20 1102 663 m20 1111 666 m20 1120 667 m20 1129 668 m20 1138 670 m20 1147 668 m20 1157 670 m20 1166 667 m20 1175 672 m20 1184 669 m20 1193 669 m20 1202
 672 m20 1211 670 m20 1220 669 m20 1229 671 m20 1238 672 m20 1247 669 m20 1256 671 m20 1265 672 m20 1274 674 m20 1284 673 m20 1293 675 m20 1302 676 m20 1311 676 m20 1320 677 m20 1329 677 m20 1338 679 m20 1347 679 m20 1356 681 m20 1365 684 m20 1374
 682 m20 1383 685 m20 1392 688 m20 1401 685 m20 1411 688 m20 1420 689 m20 1429 690 m20 1438 693 m20 1447 700 m20 1456 700 m20 1465 705 m20 1474 704 m20 1483 703 m20 1492 707 m20 1501 711 m20 1510 713 m20 1519 722 m20 1528 723 m20 1538 728 m20 1547
 732 m20 1556 734 m20 1565 742 m20 1574 748 m20 1583 752 m20 1592 756 m20 1601 766 m20 1610 774 m20 1619 780 m20 1628 789 m20 1637 799 m20 1646 811 m20 1655 823 m20 1665 838 m20 1674 848 m20 1683 862 m20 1692 878 m20 1701 903 m20 1710 927 m20 1719
 935 m20 1728 973 m20 1737 996 m20 1746 1025 m20 1755 1058 m20 1764 1094 m20 1773 1136 m20 1782 1171 m20 1791 1224 m20 1801 1275 m20 1810 1339 m20 1819 1404 m20 1828 1463 m20 1837 1533 m20 1846 1610 m20 1855 1673 m20 1864 1760 m20 1873 1827 m20 1882
 1878 m20 1891 1924 m20 1900 1946 m20 1909 1947 m20 1918 1931 m20 1928 1905 m20 1937 1834 m20 1946 1496 m20 1955 609 m20 1964 609 m20 1973 609 m20 1982 609 m20 1991 609 m20 2000 609 m20 2009 609 m20 2018 609 m20 2027 609 m20 2036 609 m20 black 0 0 1
 c 1 lw << /PatternType 1 /PaintType 2 /TilingType 1 /BBox [ 0 0 100 100 ] /XStep 100 /YStep 100 /PaintProc { begin gsave 0 0 m 100 100 l 0 100 m 100 0 l s gr end } >> [ 0.24 0 0 0.24 0 0 ] makepattern /P13 exch def /cs {[/Pattern /DeviceRGB]
 setcolorspace} def /FA {f [/DeviceRGB] setcolorspace} def cs 0 0 1 P13 setcolor 231 609 m 82 X 9 889 d 9 346 d 9 70 d 9 21 d 9 24 d 9 -4 d 9 -33 d 10 -36 d 9 -67 d 9 -60 d 9 -78 d 9 -71 d 9 -70 d 9 -70 d 9 -66 d 9 -60 d 9 -57 d 9 -58 d 9 -45 d 9 -42
 d 9 -38 d 10 -45 d 9 -37 d 9 -25 d 9 -28 d 9 -17 d 9 -29 d 9 -17 d 9 -26 d 9 -14 d 9 -11 d 9 -16 d 9 -14 d 9 -15 d 9 -4 d 9 -13 d 10 -7 d 9 -10 d 9 -11 d 9 -3 d 9 -11 d 9 -4 d 9 -4 d 9 -8 d 9 -3 d 9 -1 d 9 -8 d 9 -2 d 9 -4 d 9 -5 d 10 -1 d 9 -7 d 9
 X 9 2 d 9 -3 d 9 -8 d 9 3 d 9 -2 d 9 -4 d 9 -3 d 9 3 d 9 -5 d 9 -2 d 9 X 10 -2 d 9 1 d 9 -2 d 9 -1 d 9 -3 d 9 X 9 -2 d 9 X 9 -2 d 9 4 d 9 -5 d 9 2 d 9 -1 d 9 -1 d 10 -1 d 9 -3 d 9 4 d 9 -2 d 9 -1 d 9 1 d 9 -2 d 9 4 d 9 -8 d 9 3 d 9 1 d 9 1 d 9 1 d 9
 -1 d 10 2 d 9 -3 d 9 5 d 9 -4 d 9 1 d 9 2 d 9 -1 d 9 -1 d 9 2 d 9 1 d 9 -4 d 9 3 d 9 X 9 3 d 10 -1 d 9 1 d 9 2 d 18 X 9 1 d 9 2 d 9 X 9 2 d 9 2 d 9 -1 d 9 3 d 9 2 d 9 -3 d 10 4 d 9 X 9 2 d 9 3 d 9 7 d 9 X 9 5 d 9 -1 d 9 -1 d 9 4 d 9 4 d 9 2 d 9 9 d
 9 1 d 10 5 d 9 4 d 9 2 d 9 9 d 9 5 d 9 4 d 9 5 d 9 9 d 9 9 d 9 6 d 9 8 d 9 10 d 9 12 d 9 12 d 10 15 d 9 11 d 9 14 d 9 16 d 9 26 d 9 23 d 9 8 d 9 39 d 9 22 d 9 30 d 9 33 d 9 36 d 9 43 d 9 34 d 9 53 d 10 52 d 9 64 d 9 65 d 9 59 d 9 71 d 9 77 d 9 62 d
 9 88 d 9 67 d 9 52 d 9 45 d 9 22 d 9 2 d 9 -17 d 10 -26 d 9 -71 d 9 -338 d 9 -893 d 81 X -81 X -9 882 d -9 336 d -9 71 d -10 26 d -9 17 d -9 -2 d -9 -22 d -9 -45 d -9 -52 d -9 -66 d -9 -87 d -9 -63 d -9 -76 d -9 -71 d -9 -58 d -9 -65 d -9 -64 d -10
 -51 d -9 -53 d -9 -34 d -9 -42 d -9 -35 d -9 -33 d -9 -30 d -9 -22 d -9 -38 d -9 -8 d -9 -24 d -9 -25 d -9 -15 d -9 -15 d -9 -10 d -10 -15 d -9 -12 d -9 -12 d -9 -10 d -9 -8 d -9 -6 d -9 -9 d -9 -9 d -9 -4 d -9 -4 d -9 -6 d -9 -8 d -9 -2 d -9 -4 d
 -10 -5 d -9 -2 d -9 -8 d -9 -2 d -9 -4 d -9 -4 d -9 2 d -9 X -9 -5 d -9 X -9 -7 d -9 -3 d -9 -1 d -9 -1 d -10 -3 d -9 3 d -9 -2 d -9 -4 d -9 2 d -9 -3 d -9 -1 d -9 -1 d -9 -2 d -9 X -9 -1 d -9 1 d -9 -2 d -9 -1 d -10 X -9 -2 d -9 X -9 -3 d -9 3 d -9
 -1 d -9 -1 d -9 1 d -9 1 d -9 -3 d -9 X -9 3 d -9 -4 d -9 2 d -10 -2 d -9 2 d -9 -1 d -9 -1 d -9 -1 d -9 -3 d -9 8 d -9 -4 d -9 2 d -9 -1 d -9 1 d -9 1 d -9 -3 d -9 3 d -10 1 d -9 1 d -9 1 d -9 -2 d -9 4 d -9 -4 d -9 3 d -9 X -9 1 d -9 X -9 3 d -9 2
 d -9 1 d -9 -1 d -10 2 d -9 1 d -9 1 d -9 6 d -9 -4 d -9 4 d -9 3 d -9 2 d -9 -2 d -9 8 d -9 2 d -9 -2 d -9 1 d -9 6 d -10 1 d -9 5 d -9 3 d -9 3 d -9 8 d -9 1 d -9 3 d -9 7 d -9 4 d -9 5 d -9 10 d -9 3 d -9 11 d -9 10 d -10 7 d -9 13 d -9 3 d -9 15
 d -9 14 d -9 16 d -9 11 d -9 14 d -9 25 d -9 17 d -9 29 d -9 18 d -9 27 d -9 25 d -9 36 d -10 45 d -9 38 d -9 42 d -9 44 d -9 58 d -9 56 d -9 60 d -9 65 d -9 70 d -9 70 d -9 70 d -9 78 d -9 60 d -9 67 d -10 35 d -9 33 d -9 4 d -9 -24 d -9 -21 d -9
 -69 d -9 -345 d -9 -878 d -82 X FA 3 lw 0.8 0 0 c 1 0 0 c 0.8 0 0 c 227 609 m 90 X 599 Y 10 X 233 Y 9 X 34 Y 9 X 14 Y 9 X -9 Y 9 X -29 Y 9 X -47 Y 9 X -71 Y 9 X -66 Y 9 X -75 Y 9 X -68 Y 9 X -66 Y 9 X -59 Y 9 X -50 Y 9 X -46 Y 10 X -38 Y 9 X -34 Y 9
 X -29 Y 9 X -24 Y 9 X -24 Y 9 X -17 Y 9 X -15 Y 9 X -14 Y 9 X -10 Y 9 X -11 Y 9 X -9 Y 9 X -8 Y 9 X -7 Y 9 X -7 Y 10 X -4 Y 9 X -5 Y 9 X -3 Y 9 X -4 Y 9 X -3 Y 9 X -2 Y 9 X -4 Y 9 X -1 Y 9 X -2 Y 9 X -2 Y 9 X -2 Y 9 X -2 Y 18 X -2 Y 19 X -1 Y 9 X -1
 Y 18 X -1 Y 18 X -1 Y 9 X -1 Y 27 X -1 Y 27 X -1 Y 46 X -1 Y 91 X -1 Y 326 X 1 Y 9 X -1 Y 27 X 1 Y 73 X 1 Y 36 X 1 Y 46 X 1 Y 27 X 2 Y 18 X 1 Y 18 X 1 Y 9 X 1 Y 9 X 1 Y 9 X 1 Y 9 X 1 Y 9 X 1 Y 9 X 2 Y 10 X 2 Y 9 X 2 Y 9 X 1 Y 9 X 3 Y 9 X 3 Y 9 X 4 Y
 9 X 2 Y 9 X 4 Y 9 X 5 Y 9 X 4 Y 9 X 7 Y 9 X 6 Y 9 X 7 Y 9 X 11 Y 10 X 11 Y 9 X 11 Y 9 X 12 Y 9 X 18 Y 9 X 17 Y 9 X 23 Y 9 X 25 Y 9 X 26 Y 9 X 35 Y 9 X 38 Y 9 X 44 Y 9 X 55 Y 9 X 54 Y 9 X 68 Y 10 X 69 Y 9 X 72 Y 9 X 71 Y 9 X 67 Y 9 X 49 Y 9 X 29 Y 9
 X 11 Y 9 X -18 Y 9 X -34 Y 9 X -233 Y 9 X -598 Y 91 X s 1 0 0 c 231 609 m20 240 609 m20 249 609 m20 259 609 m20 268 609 m20 277 609 m20 286 609 m20 295 609 m20 304 609 m20 313 609 m20 322 1208 m20 331 1441 m20 340 1475 m20 349 1489 m20 358 1480 m20
 367 1451 m20 376 1404 m20 386 1333 m20 395 1267 m20 404 1192 m20 413 1124 m20 422 1058 m20 431 999 m20 440 949 m20 449 903 m20 458 865 m20 467 831 m20 476 802 m20 485 778 m20 494 754 m20 503 737 m20 513 722 m20 522 708 m20 531 698 m20 540 687 m20
 549 678 m20 558 670 m20 567 663 m20 576 656 m20 585 652 m20 594 647 m20 603 644 m20 612 640 m20 621 637 m20 630 635 m20 639 631 m20 649 630 m20 658 628 m20 667 626 m20 676 624 m20 685 622 m20 694 622 m20 703 620 m20 712 620 m20 721 619 m20 730 618
 m20 739 618 m20 748 617 m20 757 617 m20 766 616 m20 776 615 m20 785 615 m20 794 615 m20 803 614 m20 812 614 m20 821 614 m20 830 613 m20 839 613 m20 848 613 m20 857 613 m20 866 613 m20 875 612 m20 884 612 m20 893 612 m20 903 612 m20 912 612 m20 921
 612 m20 930 612 m20 939 612 m20 948 612 m20 957 612 m20 966 611 m20 975 611 m20 984 611 m20 993 611 m20 1002 611 m20 1011 611 m20 1020 611 m20 1030 611 m20 1039 611 m20 1048 611 m20 1057 611 m20 1066 611 m20 1075 611 m20 1084 611 m20 1093 611 m20
 1102 611 m20 1111 611 m20 1120 611 m20 1129 611 m20 1138 611 m20 1147 611 m20 1157 611 m20 1166 611 m20 1175 611 m20 1184 611 m20 1193 611 m20 1202 611 m20 1211 611 m20 1220 611 m20 1229 611 m20 1238 611 m20 1247 611 m20 1256 611 m20 1265 611 m20
 1274 611 m20 1284 611 m20 1293 612 m20 1302 611 m20 1311 611 m20 1320 611 m20 1329 612 m20 1338 612 m20 1347 612 m20 1356 612 m20 1365 612 m20 1374 612 m20 1383 612 m20 1392 612 m20 1401 613 m20 1411 613 m20 1420 613 m20 1429 613 m20 1438 614 m20
 1447 614 m20 1456 614 m20 1465 614 m20 1474 614 m20 1483 615 m20 1492 615 m20 1501 615 m20 1510 617 m20 1519 617 m20 1528 618 m20 1538 618 m20 1547 619 m20 1556 620 m20 1565 621 m20 1574 622 m20 1583 623 m20 1592 624 m20 1601 626 m20 1610 628 m20
 1619 630 m20 1628 631 m20 1637 634 m20 1646 637 m20 1655 641 m20 1665 643 m20 1674 647 m20 1683 652 m20 1692 656 m20 1701 663 m20 1710 669 m20 1719 676 m20 1728 687 m20 1737 698 m20 1746 709 m20 1755 721 m20 1764 739 m20 1773 756 m20 1782 779 m20
 1791 804 m20 1801 830 m20 1810 865 m20 1819 903 m20 1828 947 m20 1837 1002 m20 1846 1056 m20 1855 1124 m20 1864 1193 m20 1873 1265 m20 1882 1336 m20 1891 1403 m20 1900 1452 m20 1909 1481 m20 1918 1492 m20 1928 1474 m20 1937 1440 m20 1946 1207 m20
 1955 609 m20 1964 609 m20 1973 609 m20 1982 609 m20 1991 609 m20 2000 609 m20 2009 609 m20 2018 609 m20 2027 609 m20 2036 609 m20 0.8 0 0 c black 0.8 0 0 c cs 0.8 0 0 P13 setcolor 231 609 m 82 X 9 602 d 9 233 d 9 34 d 9 14 d 9 -9 d 9 -29 d 9 -47 d
 10 -71 d 9 -67 d 9 -74 d 9 -68 d 9 -67 d 9 -59 d 9 -50 d 9 -46 d 9 -38 d 9 -34 d 9 -30 d 9 -24 d 9 -23 d 9 -18 d 10 -15 d 9 -14 d 9 -10 d 9 -12 d 9 -8 d 9 -9 d 9 -7 d 9 -6 d 9 -5 d 9 -5 d 9 -3 d 9 -4 d 9 -2 d 9 -3 d 9 -3 d 10 -2 d 9 -1 d 9 -3 d 9 -1
 d 9 -2 d 9 -1 d 9 -1 d 9 -1 d 9 X 9 -2 d 9 X 9 -1 d 9 X 9 -1 d 19 X 9 -1 d 9 X 9 -1 d 18 X 9 -1 d 45 X 9 -1 d 73 X 9 -1 d 309 X 9 1 d 9 -1 d 9 1 d 72 X 9 1 d 37 X 9 1 d 27 X 9 1 d 27 X 9 2 d 9 X 9 1 d 10 1 d 9 X 9 1 d 9 1 d 9 1 d 9 1 d 9 1 d 9 3 d 9
 1 d 9 3 d 9 1 d 9 3 d 9 2 d 9 5 d 10 2 d 9 4 d 9 5 d 9 4 d 9 7 d 9 6 d 9 7 d 9 11 d 9 11 d 9 11 d 9 12 d 9 18 d 9 18 d 9 22 d 9 25 d 10 27 d 9 34 d 9 39 d 9 44 d 9 55 d 9 55 d 9 67 d 9 70 d 9 71 d 9 71 d 9 68 d 9 49 d 9 29 d 9 11 d 10 -18 d 9 -34 d
 9 -234 d 9 -600 d 81 X -81 X -9 595 d -9 233 d -9 34 d -10 18 d -9 -11 d -9 -28 d -9 -49 d -9 -68 d -9 -71 d -9 -71 d -9 -70 d -9 -67 d -9 -54 d -9 -54 d -9 -45 d -9 -38 d -9 -34 d -10 -26 d -9 -26 d -9 -22 d -9 -17 d -9 -18 d -9 -12 d -9 -11 d -9
 -11 d -9 -10 d -9 -7 d -9 -6 d -9 -7 d -9 -4 d -9 -5 d -9 -4 d -10 -3 d -9 -4 d -9 -2 d -9 -3 d -9 -1 d -9 -3 d -9 -1 d -9 -3 d -9 X -9 -2 d -9 -1 d -9 X -9 -1 d -9 -1 d -10 X -9 -2 d -9 X -9 -1 d -18 X -9 -1 d -18 X -9 -1 d -27 X -9 -1 d -73 X -9
 -1 d -390 X -9 1 d -64 X -9 1 d -36 X -9 1 d -18 X -9 1 d -19 X -9 1 d -9 1 d -9 1 d -9 X -9 1 d -9 1 d -9 X -9 2 d -9 X -9 2 d -9 1 d -9 3 d -9 1 d -10 2 d -9 3 d -9 3 d -9 2 d -9 4 d -9 3 d -9 5 d -9 5 d -9 6 d -9 7 d -9 9 d -9 8 d -9 11 d -9 10 d
 -9 14 d -10 15 d -9 17 d -9 24 d -9 24 d -9 29 d -9 34 d -9 37 d -9 46 d -9 50 d -9 59 d -9 66 d -9 68 d -9 74 d -9 66 d -10 71 d -9 47 d -9 29 d -9 9 d -9 -14 d -9 -34 d -9 -232 d -9 -597 d -82 X FA 0 0.4 0 c 1 1 1 c 0.35 0.83 0.33 c 0 0.4 0 c 227
 609 m 90 X 851 Y 10 X 324 Y 9 X 63 Y 9 X 60 Y 9 X 33 Y 9 X 26 Y 9 X 3 Y 9 X -43 Y 9 X -32 Y 9 X -81 Y 9 X -71 Y 9 X -93 Y 9 X -69 Y 9 X -70 Y 9 X -84 Y 10 X -78 Y 9 X -59 Y 9 X -57 Y 9 X -54 Y 9 X -60 Y 9 X -37 Y 9 X -36 Y 9 X -32 Y 9 X -44 Y 9 X
 -27 Y 9 X -20 Y 9 X -36 Y 9 X -26 Y 9 X -18 Y 10 X -9 Y 9 X -26 Y 9 X -5 Y 9 X -15 Y 9 X -10 Y 9 X -17 Y 9 X -12 Y 9 X 6 Y 9 X -14 Y 9 X -10 Y 9 X -7 Y 9 X -17 Y 9 X 8 Y 9 X -4 Y 10 X -2 Y 9 X -9 Y 9 X -14 Y 18 X -3 Y 9 X 9 Y 9 X -15 Y 9 X 2 Y 9 X
 -2 Y 18 X -9 Y 9 X 1 Y 9 X -4 Y 9 X 1 Y 10 X 1 Y 9 X -10 Y 9 X -3 Y 9 X 1 Y 9 X -2 Y 9 X 4 Y 9 X 1 Y 9 X -9 Y 9 X 1 Y 9 X 5 Y 9 X -3 Y 9 X -2 Y 9 X -4 Y 9 X 4 Y 10 X 4 Y 9 X -4 Y 27 X 10 Y 9 X -14 Y 9 X 1 Y 9 X -1 Y 9 X -1 Y 9 X 8 Y 9 X -3 Y 9 X -5
 Y 18 X -2 Y 10 X 8 Y 9 X -6 Y 9 X -3 Y 9 X -1 Y 9 X 1 Y 9 X 3 Y 9 X 2 Y 9 X 1 Y 9 X 5 Y 9 X -2 Y 9 X -8 Y 9 X 1 Y 9 X 1 Y 18 X 3 Y 10 X 2 Y 9 X 3 Y 9 X -3 Y 18 X -2 Y 9 X 3 Y 9 X -4 Y 9 X 4 Y 9 X -5 Y 9 X 12 Y 9 X -12 Y 18 X 6 Y 9 X -1 Y 10 X 3 Y 9
 X -4 Y 9 X 8 Y 18 X -2 Y 9 X 9 Y 9 X 2 Y 9 X -3 Y 18 X 3 Y 9 X -2 Y 9 X 16 Y 9 X -11 Y 9 X 5 Y 10 X 2 Y 9 X -9 Y 9 X 7 Y 9 X 7 Y 9 X -1 Y 9 X 20 Y 9 X -8 Y 9 X 6 Y 9 X 5 Y 9 X -3 Y 9 X 10 Y 18 X 3 Y 9 X 20 Y 10 X 5 Y 9 X 15 Y 9 X -8 Y 9 X 16 Y 9 X
 16 Y 9 X 27 Y 9 X -7 Y 9 X 16 Y 9 X 21 Y 9 X 15 Y 9 X 24 Y 9 X 22 Y 9 X 15 Y 9 X 36 Y 10 X 39 Y 9 X 23 Y 9 X 20 Y 9 X 60 Y 9 X 37 Y 9 X 58 Y 9 X 55 Y 9 X 48 Y 9 X 69 Y 9 X 70 Y 9 X 70 Y 9 X 83 Y 9 X 82 Y 9 X 74 Y 10 X 79 Y 9 X 72 Y 9 X 54 Y 9 X 23 Y
 9 X 6 Y 9 X -20 Y 9 X -38 Y 9 X -65 Y 9 X -63 Y 9 X -325 Y 9 X -848 Y 91 X s 0.35 0.83 0.33 c 231 609 m20 240 609 m20 249 609 m20 259 609 m20 268 609 m20 277 609 m20 286 609 m20 295 609 m20 304 609 m20 313 609 m20 322 1460 m20 331 1784 m20 340 1847
 m20 349 1907 m20 358 1940 m20 367 1966 m20 376 1969 m20 386 1926 m20 395 1894 m20 404 1813 m20 413 1742 m20 422 1649 m20 431 1580 m20 440 1510 m20 449 1426 m20 458 1348 m20 467 1289 m20 476 1232 m20 485 1178 m20 494 1118 m20 503 1081 m20 513 1045
 m20 522 1013 m20 531 969 m20 540 942 m20 549 922 m20 558 886 m20 567 860 m20 576 842 m20 585 833 m20 594 807 m20 603 802 m20 612 787 m20 621 777 m20 630 760 m20 639 748 m20 649 754 m20 658 740 m20 667 730 m20 676 723 m20 685 706 m20 694 714 m20 703
 710 m20 712 708 m20 721 699 m20 730 685 m20 739 685 m20 748 682 m20 757 691 m20 766 676 m20 776 678 m20 785 676 m20 794 676 m20 803 667 m20 812 668 m20 821 664 m20 830 665 m20 839 666 m20 848 656 m20 857 653 m20 866 654 m20 875 652 m20 884 656 m20
 893 657 m20 903 648 m20 912 649 m20 921 654 m20 930 651 m20 939 649 m20 948 645 m20 957 649 m20 966 653 m20 975 649 m20 984 649 m20 993 649 m20 1002 659 m20 1011 645 m20 1020 646 m20 1030 645 m20 1039 644 m20 1048 652 m20 1057 649 m20 1066 644 m20
 1075 644 m20 1084 642 m20 1093 650 m20 1102 644 m20 1111 641 m20 1120 640 m20 1129 641 m20 1138 644 m20 1147 646 m20 1157 647 m20 1166 652 m20 1175 650 m20 1184 642 m20 1193 643 m20 1202 644 m20 1211 644 m20 1220 647 m20 1229 649 m20 1238 652 m20
 1247 649 m20 1256 649 m20 1265 647 m20 1274 650 m20 1284 646 m20 1293 650 m20 1302 645 m20 1311 657 m20 1320 645 m20 1329 645 m20 1338 651 m20 1347 650 m20 1356 653 m20 1365 649 m20 1374 657 m20 1383 657 m20 1392 655 m20 1401 664 m20 1411 666 m20
 1420 663 m20 1429 663 m20 1438 666 m20 1447 664 m20 1456 680 m20 1465 669 m20 1474 674 m20 1483 676 m20 1492 667 m20 1501 674 m20 1510 681 m20 1519 680 m20 1528 700 m20 1538 692 m20 1547 698 m20 1556 703 m20 1565 700 m20 1574 710 m20 1583 710 m20
 1592 713 m20 1601 733 m20 1610 738 m20 1619 753 m20 1628 745 m20 1637 761 m20 1646 777 m20 1655 804 m20 1665 797 m20 1674 813 m20 1683 834 m20 1692 849 m20 1701 873 m20 1710 895 m20 1719 910 m20 1728 946 m20 1737 985 m20 1746 1008 m20 1755 1028 m20
 1764 1088 m20 1773 1125 m20 1782 1183 m20 1791 1238 m20 1801 1286 m20 1810 1355 m20 1819 1425 m20 1828 1495 m20 1837 1578 m20 1846 1660 m20 1855 1734 m20 1864 1813 m20 1873 1885 m20 1882 1939 m20 1891 1962 m20 1900 1968 m20 1909 1948 m20 1918 1910
 m20 1928 1845 m20 1937 1782 m20 1946 1457 m20 1955 609 m20 1964 609 m20 1973 609 m20 1982 609 m20 1991 609 m20 2000 609 m20 2009 609 m20 2018 609 m20 2027 609 m20 2036 609 m20 0 0.4 0 c black 0 0.4 0 c cs 0 0.4 0 P13 setcolor 231 609 m 82 X 9 856 d
 9 325 d 9 64 d 9 59 d 9 34 d 9 26 d 9 3 d 10 -43 d 9 -31 d 9 -82 d 9 -70 d 9 -94 d 9 -68 d 9 -71 d 9 -84 d 9 -78 d 9 -59 d 9 -57 d 9 -54 d 9 -60 d 9 -38 d 10 -36 d 9 -32 d 9 -44 d 9 -26 d 9 -21 d 9 -37 d 9 -25 d 9 -18 d 9 -9 d 9 -26 d 9 -5 d 9 -15 d
 9 -10 d 9 -18 d 9 -11 d 10 6 d 9 -14 d 9 -11 d 9 -6 d 9 -18 d 9 9 d 9 -5 d 9 -2 d 9 -8 d 9 -15 d 9 X 9 -3 d 9 9 d 9 -15 d 10 3 d 9 -3 d 9 1 d 9 -11 d 9 2 d 9 -4 d 9 1 d 9 1 d 9 -10 d 9 -4 d 9 1 d 9 -1 d 9 4 d 9 1 d 10 -10 d 9 1 d 9 6 d 9 -3 d 9 -2 d
 9 -5 d 9 4 d 9 5 d 9 -4 d 9 -1 d 9 X 9 12 d 9 -15 d 19 X 9 -2 d 9 9 d 9 -3 d 9 -5 d 9 -1 d 9 -2 d 9 9 d 9 -7 d 9 -3 d 9 -1 d 9 1 d 9 3 d 9 3 d 10 1 d 9 5 d 9 -2 d 9 -9 d 9 2 d 18 X 9 3 d 9 3 d 9 3 d 9 -3 d 9 -1 d 9 -1 d 9 3 d 10 -4 d 9 4 d 9 -6 d 9
 13 d 9 -13 d 9 X 9 7 d 9 -2 d 9 4 d 9 -5 d 9 8 d 9 1 d 9 -3 d 9 10 d 10 3 d 9 -4 d 9 -1 d 9 4 d 9 -2 d 9 16 d 9 -11 d 9 5 d 9 2 d 9 -9 d 9 7 d 9 7 d 9 -2 d 9 21 d 10 -8 d 9 7 d 9 5 d 9 -4 d 9 11 d 9 -1 d 9 3 d 9 21 d 9 5 d 9 14 d 9 -9 d 9 18 d 9 16
 d 9 27 d 10 -8 d 9 16 d 9 22 d 9 16 d 9 23 d 9 23 d 9 14 d 9 36 d 9 39 d 9 23 d 9 20 d 9 60 d 9 38 d 9 57 d 9 56 d 10 48 d 9 69 d 9 71 d 9 69 d 9 83 d 9 82 d 9 74 d 9 79 d 9 72 d 9 54 d 9 23 d 9 6 d 9 -20 d 9 -39 d 10 -65 d 9 -63 d 9 -326 d 9 -853 d
 81 X -81 X -9 843 d -9 324 d -9 62 d -10 65 d -9 38 d -9 21 d -9 -7 d -9 -23 d -9 -55 d -9 -71 d -9 -79 d -9 -74 d -9 -82 d -9 -83 d -9 -70 d -9 -70 d -9 -69 d -10 -48 d -9 -55 d -9 -58 d -9 -37 d -9 -59 d -9 -20 d -9 -23 d -9 -39 d -9 -36 d -9 -15
 d -9 -22 d -9 -24 d -9 -14 d -9 -22 d -9 -16 d -10 6 d -9 -26 d -9 -15 d -9 -16 d -9 7 d -9 -14 d -9 -6 d -9 -19 d -9 -3 d -9 X -9 -10 d -9 3 d -9 -5 d -9 -5 d -10 6 d -9 -19 d -9 2 d -9 -9 d -9 -6 d -9 9 d -9 -2 d -9 -5 d -9 10 d -9 -14 d -9 1 d -9
 -3 d -9 1 d -9 2 d -10 -2 d -9 -9 d -9 2 d -9 X -9 -7 d -9 4 d -9 -4 d -9 1 d -9 -5 d -9 X -9 10 d -9 -11 d -9 6 d -9 -4 d -10 4 d -9 -3 d -9 1 d -9 X -9 3 d -9 -3 d -9 -2 d -9 -3 d -18 X -9 -1 d -9 7 d -9 2 d -9 -4 d -10 -1 d -9 -2 d -9 -3 d -9 -1
 d -9 1 d -9 2 d -9 6 d -9 -7 d -9 1 d -9 1 d -9 4 d -9 2 d -9 -7 d -9 2 d -19 X -9 12 d -9 -9 d -18 X -9 4 d -9 -4 d -9 -4 d -9 5 d -9 2 d -9 2 d -9 -4 d -9 -2 d -10 9 d -9 X -9 -4 d -9 1 d -9 X -9 2 d -9 10 d -9 X -9 -1 d -9 3 d -9 -1 d -9 9 d -9 X
 -9 2 d -10 -2 d -9 15 d -9 -9 d -9 3 d -9 X -9 14 d -9 8 d -9 2 d -9 5 d -9 -8 d -9 17 d -9 7 d -9 10 d -9 13 d -10 -5 d -9 11 d -9 18 d -9 9 d -9 16 d -9 5 d -9 25 d -9 9 d -9 19 d -9 25 d -9 35 d -9 21 d -9 27 d -9 43 d -9 32 d -10 36 d -9 38 d -9
 59 d -9 54 d -9 57 d -9 60 d -9 76 d -9 85 d -9 70 d -9 69 d -9 93 d -9 71 d -9 81 d -9 32 d -10 43 d -9 -3 d -9 -25 d -9 -34 d -9 -59 d -9 -63 d -9 -324 d -9 -845 d -82 X FA black 1 1 1 c 680 392 794 1628 bf black 794 1628 m 680 X s 1474 1628 m 392
 Y s 1474 2020 m -680 X s 794 2020 m -392 Y s
 gsave  2268 1568 0 609 C 961.026 1922.05 t 0 r /Helvetica findfont 91.2884 sf 0 0 m (No Int) show NC gr  0.8 0 0 c 819 1955 m 119 X s black
 gsave  2268 1568 0 609 C 961.026 1792.9 t 0 r /Helvetica findfont 91.2884 sf 0 0 m (With Int) show NC gr  0 0 1 c 819 1824 m 119 X s black
 gsave  2268 1568 0 609 C 961.026 1667.55 t 0 r /Helvetica findfont 91.2884 sf 0 0 m (Reweighted) show NC gr  0 0.4 0 c 819 1693 m 119 X s black
 gsave  2268 1568 0 609 C 2222.13 1747.32 t 90 r /Helvetica-BoldOblique findfont 30.4295 sf 0 0 m (LHC HIGGS XS WG 2013) show NC gr  1 1 1 c 2268 609 0 0 bf black 1 1 1 c 1814 457 227 152 bf black 1814 457 227 152 bl 1 1 1 c black 227 152 m 90 X 238
 Y 10 X 1 Y 9 X 1 Y 9 X -7 Y 9 X -2 Y 9 X -5 Y 9 X -6 Y 9 X 1 Y 9 X -7 Y 9 X 4 Y 9 X -3 Y 9 X 4 Y 9 X -1 Y 9 X -1 Y 9 X 4 Y 10 X 5 Y 9 X 1 Y 9 X -1 Y 9 X 4 Y 9 X 8 Y 18 X -4 Y 9 X -2 Y 9 X 13 Y 18 X 4 Y 9 X 8 Y 9 X 10 Y 9 X -4 Y 10 X -3 Y 9 X 20 Y 9
 X -12 Y 9 X 6 Y 9 X -5 Y 9 X 27 Y 9 X 3 Y 9 X -24 Y 9 X 12 Y 9 X 3 Y 9 X 12 Y 9 X 29 Y 9 X -37 Y 9 X 5 Y 10 X -11 Y 9 X 20 Y 9 X 56 Y 9 X -26 Y 9 X 5 Y 9 X -46 Y 9 X 47 Y 9 X -15 Y 9 X -9 Y 9 X -2 Y 9 X 60 Y 9 X -17 Y 9 X -12 Y 9 X 5 Y 10 X -10 Y 9
 X 54 Y 9 X 8 Y 9 X 12 Y 9 X -18 Y 9 X -38 Y 9 X -10 Y 9 X 77 Y 9 X -12 Y 9 X -54 Y 9 X 19 Y 9 X 1 Y 9 X 50 Y 9 X -56 Y 10 X -35 Y 9 X 20 Y 9 X 25 Y 9 X -26 Y 9 X -67 Y 9 X 106 Y 9 X -11 Y 9 X 3 Y 9 X -3 Y 9 X -55 Y 9 X 11 Y 9 X 43 Y 9 X 14 Y 9 X 11
 Y 10 X -64 Y 9 X 9 Y 9 X 56 Y 9 X 25 Y 9 X -7 Y 9 X -34 Y 9 X -36 Y 9 X 3 Y 9 X -52 Y 9 X 40 Y 9 X 64 Y 9 X -14 Y 9 X 13 Y 9 X -7 Y 9 X -42 Y 10 X -12 Y 9 X -19 Y 9 X 4 Y 9 X 21 Y 9 X 14 Y 9 X -13 Y 9 X 35 Y 9 X -32 Y 9 X 69 Y 9 X -111 Y 9 X 113 Y 9
 X 1 Y 9 X -58 Y 9 X 15 Y 10 X -22 Y 9 X 55 Y 9 X -76 Y 9 X 14 Y 9 X 28 Y 9 X -77 Y 9 X -1 Y 9 X 20 Y 9 X 12 Y 9 X -8 Y 9 X 37 Y 9 X -82 Y 9 X 72 Y 9 X -30 Y 10 X -13 Y 9 X 64 Y 9 X -23 Y 9 X -33 Y 9 X 34 Y 9 X -78 Y 9 X 40 Y 9 X -11 Y 9 X -13 Y 9 X
 33 Y 9 X -22 Y 9 X 11 Y 9 X -1 Y 9 X -35 Y 10 X 4 Y 9 X -20 Y 9 X 31 Y 9 X -19 Y 9 X -10 Y 9 X -24 Y 9 X 27 Y 9 X -10 Y 9 X -11 Y 9 X -1 Y 18 X -2 Y 9 X -6 Y 19 X -13 Y 9 X 4 Y 9 X 6 Y 9 X -13 Y 9 X 2 Y 9 X -10 Y 18 X 1 Y 9 X -1 Y 9 X -1 Y 9 X -3 Y
 9 X -2 Y 18 X -1 Y 10 X 2 Y 27 X 3 Y 9 X 3 Y 9 X 4 Y 9 X 4 Y 9 X 7 Y 9 X -1 Y 9 X 1 Y 9 X -240 Y 91 X s 227 152 m 1814 X s
 gsave  2268 609 0 0 C 2009.42 41.7837 t 0 r /Symbol findfont 57.1345 sf 0 0 m (f) show NC gr 
 gsave  2268 609 0 0 C 1971.43 41.7837 t 0 r /Symbol findfont 57.1345 sf 0 0 m (D) show NC gr  356 167 m -15 Y s 408 160 m -8 Y s 460 160 m -8 Y s 512 160 m -8 Y s 564 160 m -8 Y s 616 167 m -15 Y s 667 160 m -8 Y s 719 160 m -8 Y s 771 160 m -8 Y s
 823 160 m -8 Y s 875 167 m -15 Y s 927 160 m -8 Y s 978 160 m -8 Y s 1030 160 m -8 Y s 1082 160 m -8 Y s 1134 167 m -15 Y s 1186 160 m -8 Y s 1238 160 m -8 Y s 1289 160 m -8 Y s 1341 160 m -8 Y s 1393 167 m -15 Y s 1445 160 m -8 Y s 1497 160 m -8 Y
 s 1549 160 m -8 Y s 1600 160 m -8 Y s 1652 167 m -15 Y s 1704 160 m -8 Y s 1756 160 m -8 Y s 1808 160 m -8 Y s 1860 160 m -8 Y s 1911 167 m -15 Y s 356 167 m -15 Y s 305 160 m -8 Y s 253 160 m -8 Y s 1911 167 m -15 Y s 1963 160 m -8 Y s 2015 160 m
 -8 Y s
 gsave  2268 609 0 0 C 330.471 113.956 t 0 r /Helvetica findfont 45.7076 sf 0 0 m (\2553) show NC gr 
 gsave  2268 609 0 0 C 592.569 113.956 t 0 r /Helvetica findfont 45.7076 sf 0 0 m (\2552) show NC gr 
 gsave  2268 609 0 0 C 854.667 113.956 t 0 r /Helvetica findfont 45.7076 sf 0 0 m (\2551) show NC gr 
 gsave  2268 609 0 0 C 1116.76 113.956 t 0 r /Helvetica findfont 45.7076 sf 0 0 m (0) show NC gr 
 gsave  2268 609 0 0 C 1378.86 113.956 t 0 r /Helvetica findfont 45.7076 sf 0 0 m (1) show NC gr 
 gsave  2268 609 0 0 C 1633.36 113.956 t 0 r /Helvetica findfont 45.7076 sf 0 0 m (2) show NC gr 
 gsave  2268 609 0 0 C 1895.46 113.956 t 0 r /Helvetica findfont 45.7076 sf 0 0 m (3) show NC gr  227 152 m 457 Y s
 gsave  2268 609 0 0 C 91.1645 170.933 t 90 r /Helvetica findfont 45.7076 sf 0 0 m (\(S+I\)/\(Reweighted S\)) show NC gr  278 152 m -51 X s 252 164 m -25 X s 252 175 m -25 X s 252 187 m -25 X s 278 198 m -51 X s 252 209 m -25 X s 252 221 m -25 X s
 252 232 m -25 X s 278 244 m -51 X s 252 255 m -25 X s 252 267 m -25 X s 252 278 m -25 X s 278 289 m -51 X s 252 301 m -25 X s 252 312 m -25 X s 252 324 m -25 X s 278 335 m -51 X s 252 347 m -25 X s 252 358 m -25 X s 252 369 m -25 X s 278 381 m -51 X
 s 252 392 m -25 X s 252 404 m -25 X s 252 415 m -25 X s 278 427 m -51 X s 252 438 m -25 X s 252 449 m -25 X s 252 461 m -25 X s 278 472 m -51 X s 252 484 m -25 X s 252 495 m -25 X s 252 507 m -25 X s 278 518 m -51 X s 252 529 m -25 X s 252 541 m -25
 X s 252 552 m -25 X s 278 564 m -51 X s 252 575 m -25 X s 252 587 m -25 X s 252 598 m -25 X s 278 609 m -51 X s
 gsave  2268 609 0 0 C 186.127 136.747 t 0 r /Helvetica findfont 45.7076 sf 0 0 m (0) show NC gr 
 gsave  2268 609 0 0 C 148.142 182.329 t 0 r /Helvetica findfont 45.7076 sf 0 0 m (0.2) show NC gr 
 gsave  2268 609 0 0 C 148.142 227.911 t 0 r /Helvetica findfont 45.7076 sf 0 0 m (0.4) show NC gr 
 gsave  2268 609 0 0 C 148.142 273.493 t 0 r /Helvetica findfont 45.7076 sf 0 0 m (0.6) show NC gr 
 gsave  2268 609 0 0 C 148.142 319.076 t 0 r /Helvetica findfont 45.7076 sf 0 0 m (0.8) show NC gr 
 gsave  2268 609 0 0 C 193.725 364.658 t 0 r /Helvetica findfont 45.7076 sf 0 0 m (1) show NC gr 
 gsave  2268 609 0 0 C 148.142 410.24 t 0 r /Helvetica findfont 45.7076 sf 0 0 m (1.2) show NC gr 
 gsave  2268 609 0 0 C 148.142 455.822 t 0 r /Helvetica findfont 45.7076 sf 0 0 m (1.4) show NC gr 
 gsave  2268 609 0 0 C 148.142 501.405 t 0 r /Helvetica findfont 45.7076 sf 0 0 m (1.6) show NC gr 
 gsave  2268 609 0 0 C 148.142 546.987 t 0 r /Helvetica findfont 45.7076 sf 0 0 m (1.8) show NC gr 
 gsave  2268 609 0 0 C 186.127 592.569 t 0 r /Helvetica findfont 45.7076 sf 0 0 m (2) show NC gr  231 152 m20 240 152 m20 249 152 m20 259 152 m20 268 152 m20 277 152 m20 286 152 m20 295 152 m20 304 152 m20 313 152 m20 322 390 m20 331 391 m20 340 392
 m20 349 385 m20 358 383 m20 367 378 m20 376 372 m20 386 373 m20 395 366 m20 404 370 m20 413 367 m20 422 371 m20 431 370 m20 440 369 m20 449 373 m20 458 378 m20 467 379 m20 476 378 m20 485 382 m20 494 390 m20 503 390 m20 513 386 m20 522 384 m20 531
 397 m20 540 397 m20 549 401 m20 558 409 m20 567 419 m20 576 415 m20 585 412 m20 594 432 m20 603 420 m20 612 426 m20 621 421 m20 630 448 m20 639 451 m20 649 427 m20 658 439 m20 667 442 m20 676 454 m20 685 483 m20 694 446 m20 703 451 m20 712 440 m20
 721 460 m20 730 516 m20 739 490 m20 748 495 m20 757 449 m20 766 496 m20 776 481 m20 785 472 m20 794 470 m20 803 530 m20 812 513 m20 821 501 m20 830 506 m20 839 496 m20 848 550 m20 857 558 m20 866 570 m20 875 552 m20 884 514 m20 893 504 m20 903 581
 m20 912 569 m20 921 515 m20 930 534 m20 939 535 m20 948 585 m20 957 529 m20 966 494 m20 975 514 m20 984 539 m20 993 513 m20 1002 446 m20 1011 552 m20 1020 541 m20 1030 544 m20 1039 541 m20 1048 486 m20 1057 497 m20 1066 540 m20 1075 554 m20 1084 565
 m20 1093 501 m20 1102 510 m20 1111 566 m20 1120 591 m20 1129 584 m20 1138 550 m20 1147 514 m20 1157 517 m20 1166 465 m20 1175 505 m20 1184 569 m20 1193 555 m20 1202 568 m20 1211 561 m20 1220 519 m20 1229 507 m20 1238 488 m20 1247 492 m20 1256 513
 m20 1265 527 m20 1274 514 m20 1284 549 m20 1293 517 m20 1302 586 m20 1311 475 m20 1320 588 m20 1329 589 m20 1338 531 m20 1347 546 m20 1356 524 m20 1365 579 m20 1374 503 m20 1383 517 m20 1392 545 m20 1401 468 m20 1411 467 m20 1420 487 m20 1429 499
 m20 1438 491 m20 1447 528 m20 1456 446 m20 1465 518 m20 1474 488 m20 1483 475 m20 1492 539 m20 1501 516 m20 1510 483 m20 1519 517 m20 1528 439 m20 1538 479 m20 1547 468 m20 1556 455 m20 1565 488 m20 1574 466 m20 1583 477 m20 1592 476 m20 1601 441
 m20 1610 445 m20 1619 425 m20 1628 456 m20 1637 437 m20 1646 427 m20 1655 403 m20 1665 430 m20 1674 420 m20 1683 409 m20 1692 408 m20 1701 408 m20 1710 406 m20 1719 400 m20 1728 400 m20 1737 387 m20 1746 391 m20 1755 397 m20 1764 384 m20 1773 386
 m20 1782 376 m20 1791 376 m20 1801 377 m20 1810 376 m20 1819 375 m20 1828 372 m20 1837 370 m20 1846 370 m20 1855 369 m20 1864 371 m20 1873 371 m20 1882 371 m20 1891 374 m20 1900 377 m20 1909 381 m20 1918 385 m20 1928 392 m20 1937 391 m20 1946 392
 m20 1955 152 m20 1964 152 m20 1973 152 m20 1982 152 m20 1991 152 m20 2000 152 m20 2009 152 m20 2018 152 m20 2027 152 m20 2036 152 m20 cs 0 0 0 P13 setcolor 231 152 m 82 X 9 240 d 9 1 d 9 1 d 9 -8 d 9 -1 d 9 -6 d 9 -6 d 10 1 d 9 -6 d 9 3 d 9 -2 d 9 4
 d 9 -1 d 9 X 9 4 d 9 4 d 9 2 d 9 -1 d 9 4 d 9 8 d 9 1 d 10 -4 d 9 -1 d 9 12 d 9 1 d 9 4 d 9 9 d 9 11 d 9 -4 d 9 -3 d 9 22 d 9 -12 d 9 7 d 9 -6 d 9 29 d 9 4 d 10 -24 d 9 13 d 9 4 d 9 14 d 9 30 d 9 -38 d 9 7 d 9 -11 d 9 21 d 9 61 d 9 -29 d 9 8 d 9 -50
 d 9 54 d 10 -17 d 9 -9 d 9 -2 d 9 65 d 9 -15 d 9 -12 d 9 3 d 9 -7 d 9 61 d 9 8 d 9 11 d 9 -15 d 9 -43 d 9 -10 d 10 68 d 9 X 9 -54 d 9 21 d 9 3 d 9 30 d 9 -35 d 9 -43 d 9 28 d 9 26 d 9 -26 d 9 -78 d 9 122 d 9 -11 d 10 1 d 9 -1 d 9 -65 d 9 13 d 9 51 d
 9 14 d 9 4 d 9 -64 d 9 11 d 9 53 d 18 X 9 -8 d 9 -39 d 10 1 d 9 -58 d 9 45 d 9 59 d 9 -2 d 9 2 d 9 X 9 -43 d 9 -15 d 9 -21 d 9 5 d 9 21 d 9 17 d 9 -18 d 10 44 d 9 -41 d 9 51 d 9 -96 d 9 96 d 9 X 9 -33 d 9 15 d 9 -28 d 9 46 d 9 -71 d 9 18 d 9 29 d 9
 -85 d 10 -2 d 9 19 d 9 12 d 9 -8 d 9 40 d 9 -91 d 9 80 d 9 -34 d 9 -16 d 9 71 d 9 -25 d 9 -41 d 9 37 d 9 -85 d 10 42 d 9 -12 d 9 -14 d 9 34 d 9 -24 d 9 10 d 9 X 9 -37 d 9 2 d 9 -21 d 9 30 d 9 -19 d 9 -10 d 9 -26 d 10 27 d 9 -11 d 9 -11 d 9 -2 d 9 -1
 d 9 -2 d 9 -6 d 9 -1 d 9 -13 d 9 3 d 9 7 d 9 -14 d 9 2 d 9 -11 d 9 X 10 1 d 9 -1 d 9 -2 d 9 -2 d 9 -3 d 9 X 9 -2 d 9 2 d 18 X 9 4 d 9 3 d 9 3 d 9 4 d 10 8 d 9 -1 d 9 1 d 9 -242 d 81 X -81 X -9 238 d -9 -1 d -9 1 d -10 -7 d -9 -4 d -9 -3 d -9 -3 d -9
 -4 d -18 X -9 -2 d -9 1 d -9 X -9 2 d -9 2 d -9 2 d -9 X -10 -1 d -9 X -9 9 d -9 -2 d -9 13 d -9 -6 d -9 -4 d -9 11 d -9 X -9 6 d -9 1 d -9 X -9 1 d -9 11 d -9 9 d -10 -27 d -9 22 d -9 9 d -9 18 d -9 -30 d -9 18 d -9 -5 d -9 33 d -9 X -9 -11 d -9 20
 d -9 -31 d -9 10 d -9 11 d -10 -39 d -9 72 d -9 -32 d -9 26 d -9 22 d -9 -58 d -9 10 d -9 26 d -9 -64 d -9 74 d -9 -36 d -9 8 d -9 -12 d -9 -20 d -10 X -9 70 d -9 -28 d -9 -9 d -9 64 d -9 -49 d -9 17 d -9 -15 d -9 51 d -9 1 d -9 -101 d -9 94 d -9
 -55 d -9 22 d -10 -26 d -9 8 d -9 -10 d -9 -21 d -9 -2 d -9 17 d -9 9 d -9 37 d -9 4 d -9 -11 d -9 11 d -9 -54 d -9 -35 d -9 45 d -10 -4 d -9 33 d -9 27 d -9 8 d -9 -21 d -9 -49 d -9 -8 d -9 56 d -9 -9 d -9 -13 d -9 -35 d -9 -10 d -9 45 d -9 4 d -10
 -4 d -9 10 d -9 -90 d -9 58 d -9 25 d -9 -23 d -9 -13 d -9 27 d -9 47 d -9 -39 d -9 X -9 -18 d -9 48 d -9 9 d -10 -63 d -9 9 d -9 34 d -9 18 d -9 -11 d -9 -9 d -9 -46 d -9 13 d -9 -7 d -9 12 d -9 19 d -9 -56 d -9 2 d -9 10 d -10 14 d -9 -41 d -9 42
 d -9 -3 d -9 24 d -9 -52 d -9 -17 d -9 10 d -9 -2 d -9 34 d -9 -26 d -9 -10 d -9 -3 d -9 -11 d -10 24 d -9 -2 d -9 -25 d -9 4 d -9 -4 d -9 12 d -9 -20 d -9 4 d -9 5 d -9 -10 d -9 -8 d -9 -3 d -9 X -9 -12 d -9 2 d -10 5 d -9 -1 d -9 -8 d -9 -3 d -9 1
 d -9 -1 d -9 -4 d -9 -4 d -9 1 d -9 1 d -9 -4 d -9 3 d -9 -3 d -9 6 d -10 -1 d -9 6 d -9 5 d -9 2 d -9 7 d -9 X -9 -2 d -9 -236 d -82 X FA
 gr  gr showpage
end
%%EOF
