%!PS-Adobe-3.0 EPSF-3.0
%%BoundingBox: (atend)
%%LanguageLevel: 2
%%Creator: Grace-5.1.22
%%CreationDate: Mon Jun  3 12:33:32 2013
%%DocumentData: Clean8Bit
%%Orientation: Portrait
%%Title: /home/pcl321b/heinemey/plot/grace/2012/lhc-higgs-br/mhmodm_tb50_BR-HH.grace
%%For: heinemey
%%DocumentNeededResources: (atend)
%%EndComments
%%BeginProlog
/m {moveto} def
/l {lineto} def
/s {stroke} def
/n {newpath} def
/c {closepath} def
/RL {rlineto} def
/SLW {setlinewidth} def
/GS {gsave} def
/GR {grestore} def
/SC {setcolor} def
/SGRY {setgray} def
/SRGB {setrgbcolor} def
/SD {setdash} def
/SLC {setlinecap} def
/SLJ {setlinejoin} def
/SCS {setcolorspace} def
/FFSF {findfont setfont} def
/CC {concat} def
/PXL {n m 0 0 RL s} def
/Color0 {1.0000 1.0000 1.0000} def
/Color1 {0.0000 0.0000 0.0000} def
/Color2 {1.0000 0.0000 0.0000} def
/Color3 {0.0000 1.0000 0.0000} def
/Color4 {0.0000 0.0000 1.0000} def
/Color5 {1.0000 1.0000 0.0000} def
/Color6 {0.7373 0.5608 0.5608} def
/Color7 {0.8627 0.8627 0.8627} def
/Color8 {0.5804 0.0000 0.8275} def
/Color9 {0.0000 1.0000 1.0000} def
/Color10 {1.0000 0.0000 1.0000} def
/Color11 {1.0000 0.6471 0.0000} def
/Color12 {0.4471 0.1294 0.7373} def
/Color13 {0.4039 0.0275 0.2824} def
/Color14 {0.2510 0.8784 0.8157} def
/Color15 {0.0000 0.5451 0.0000} def
/Color16 {0.7529 0.7529 0.7529} def
/Color17 {0.5059 0.5059 0.5059} def
/Color18 {0.2588 0.2588 0.2588} def
/PTRN {
 /pat_bits exch def 
 <<
  /PaintType 2
  /PatternType 1 /TilingType 1
  /BBox[0 0 16 16]
  /XStep 16 /YStep 16
  /PaintProc {
   pop
   16 16 true [-1 0 0 -1 16 16] pat_bits imagemask
  }
 >>
 [0.0016 0 0 0.0016 0 0]
 makepattern
} def
/Pattern0 {<0000000000000000000000000000000000000000000000000000000000000000> PTRN} bind def
/Pattern1 {<ffffffffffffffffffffffffffffffffffffffffffffffffffffffffffffffff> PTRN} bind def
/Pattern2 {<eeeeffffbbbbffffeeeeffffbbbbffffeeeeffffbbbbffffeeeeffffbbbbffff> PTRN} bind def
/Pattern3 {<eeeebbbbeeeebbbbeeeebbbbeeeebbbbeeeebbbbeeeebbbbeeeebbbbeeeebbbb> PTRN} bind def
/Pattern4 {<5555aaaa5555aaaa5555aaaa5555aaaa5555aaaa5555aaaa5555aaaa5555aaaa> PTRN} bind def
/Pattern5 {<1111444411114444111144441111444411114444111144441111444411114444> PTRN} bind def
/Pattern6 {<1111000044440000111100004444000011110000444400001111000044440000> PTRN} bind def
/Pattern7 {<1010000000000000010100000000000010100000000000000101000000000000> PTRN} bind def
/Pattern8 {<0000000000000000000000000000000000000000000000000000000000000000> PTRN} bind def
/Pattern9 {<1e1e0f0f8787c3c3e1e1f0f078783c3c1e1e0f0f8787c3c3e1e1f0f078783c3c> PTRN} bind def
/Pattern10 {<7878f0f0e1e1c3c387870f0f1e1e3c3c7878f0f0e1e1c3c387870f0f1e1e3c3c> PTRN} bind def
/Pattern11 {<3333333333333333333333333333333333333333333333333333333333333333> PTRN} bind def
/Pattern12 {<ffffffff00000000ffffffff00000000ffffffff00000000ffffffff00000000> PTRN} bind def
/Pattern13 {<8181424224241818181824244242818181814242242418181818242442428181> PTRN} bind def
/Pattern14 {<8080404020201010080804040202010180804040202010100808040402020101> PTRN} bind def
/Pattern15 {<0101020204040808101020204040808001010202040408081010202040408080> PTRN} bind def
/Pattern16 {<2222222222222222222222222222222222222222222222222222222222222222> PTRN} bind def
/Pattern17 {<0000ffff000000000000ffff000000000000ffff000000000000ffff00000000> PTRN} bind def
/Pattern18 {<2222ffff222222222222ffff222222222222ffff222222222222ffff22222222> PTRN} bind def
/Pattern19 {<ffffffff33333333ffffffff33333333ffffffff33333333ffffffff33333333> PTRN} bind def
/Pattern20 {<0f0f0f0f0f0f0f0ff0f0f0f0f0f0f0f00f0f0f0f0f0f0f0ff0f0f0f0f0f0f0f0> PTRN} bind def
/Pattern21 {<ff00ff00ff00ff00ff00ff00ff00ff0000ff00ff00ff00ff00ff00ff00ff00ff> PTRN} bind def
/Pattern22 {<8001800180018001800180018001ffffffff8001800180018001800180018001> PTRN} bind def
/Pattern23 {<c003c003c003c003c003c003ffffffffffffffffc003c003c003c003c003c003> PTRN} bind def
/Pattern24 {<040404040404ffff404040404040ffff040404040404ffff404040404040ffff> PTRN} bind def
/Pattern25 {<180018001800180018001800ffffffff001800180018001800180018ffffffff> PTRN} bind def
/Pattern26 {<1111b8b87c7c3a3a1111a3a3c7c78b8b1111b8b87c7c3a3a1111a3a3c7c78b8b> PTRN} bind def
/Pattern27 {<101010102828c7c70101010182827c7c101010102828c7c70101010182827c7c> PTRN} bind def
/Pattern28 {<1c1c121211112121c1c12121111112121c1c121211112121c1c1212111111212> PTRN} bind def
/Pattern29 {<3e3e414180808080e3e31414080808083e3e414180808080e3e3141408080808> PTRN} bind def
/Pattern30 {<4848888884848383848488884848383848488888848483838484888848483838> PTRN} bind def
/Pattern31 {<03030404080808080c0c12122121c0c003030404080808080c0c12122121c0c0> PTRN} bind def
/ellipsedict 8 dict def
ellipsedict /mtrx matrix put
/EARC {
 ellipsedict begin
  /endangle exch def
  /startangle exch def
  /yrad exch def
  /xrad exch def
  /y exch def
  /x exch def
  /savematrix mtrx currentmatrix def
  x y translate
  xrad yrad scale
  0 0 1 startangle endangle arc
  savematrix setmatrix
 end
} def
/TL {
  /kcomp exch def
  /linewidth exch def
  /offset exch def
  GS
  0 offset rmoveto
  linewidth SLW
  dup stringwidth exch kcomp add exch RL s
  GR
} def
/KINIT
{
 /kvector exch def
 /kid 0 def
} def
/KPROC
{
 pop pop
 kvector kid get
 0 rmoveto
 /kid 1 kid add def
} def
/DefEncoding [
 /.notdef
 /.notdef
 /.notdef
 /.notdef
 /.notdef
 /.notdef
 /.notdef
 /.notdef
 /.notdef
 /.notdef
 /.notdef
 /.notdef
 /.notdef
 /.notdef
 /.notdef
 /.notdef
 /.notdef
 /.notdef
 /.notdef
 /.notdef
 /.notdef
 /.notdef
 /.notdef
 /.notdef
 /.notdef
 /.notdef
 /.notdef
 /.notdef
 /.notdef
 /.notdef
 /.notdef
 /.notdef
 /space
 /exclam
 /quotedbl
 /numbersign
 /dollar
 /percent
 /ampersand
 /quoteright
 /parenleft
 /parenright
 /asterisk
 /plus
 /comma
 /hyphen
 /period
 /slash
 /zero
 /one
 /two
 /three
 /four
 /five
 /six
 /seven
 /eight
 /nine
 /colon
 /semicolon
 /less
 /equal
 /greater
 /question
 /at
 /A
 /B
 /C
 /D
 /E
 /F
 /G
 /H
 /I
 /J
 /K
 /L
 /M
 /N
 /O
 /P
 /Q
 /R
 /S
 /T
 /U
 /V
 /W
 /X
 /Y
 /Z
 /bracketleft
 /backslash
 /bracketright
 /asciicircum
 /underscore
 /grave
 /a
 /b
 /c
 /d
 /e
 /f
 /g
 /h
 /i
 /j
 /k
 /l
 /m
 /n
 /o
 /p
 /q
 /r
 /s
 /t
 /u
 /v
 /w
 /x
 /y
 /z
 /braceleft
 /bar
 /braceright
 /asciitilde
 /.notdef
 /.notdef
 /.notdef
 /.notdef
 /.notdef
 /.notdef
 /.notdef
 /.notdef
 /.notdef
 /.notdef
 /.notdef
 /.notdef
 /.notdef
 /.notdef
 /.notdef
 /.notdef
 /.notdef
 /.notdef
 /.notdef
 /.notdef
 /.notdef
 /.notdef
 /.notdef
 /.notdef
 /.notdef
 /.notdef
 /.notdef
 /.notdef
 /.notdef
 /.notdef
 /.notdef
 /.notdef
 /.notdef
 /space
 /exclamdown
 /cent
 /sterling
 /currency
 /yen
 /brokenbar
 /section
 /dieresis
 /copyright
 /ordfeminine
 /guillemotleft
 /logicalnot
 /hyphen
 /registered
 /macron
 /degree
 /plusminus
 /twosuperior
 /threesuperior
 /acute
 /mu
 /paragraph
 /periodcentered
 /cedilla
 /onesuperior
 /ordmasculine
 /guillemotright
 /onequarter
 /onehalf
 /threequarters
 /questiondown
 /Agrave
 /Aacute
 /Acircumflex
 /Atilde
 /Adieresis
 /Aring
 /AE
 /Ccedilla
 /Egrave
 /Eacute
 /Ecircumflex
 /Edieresis
 /Igrave
 /Iacute
 /Icircumflex
 /Idieresis
 /Eth
 /Ntilde
 /Ograve
 /Oacute
 /Ocircumflex
 /Otilde
 /Odieresis
 /multiply
 /Oslash
 /Ugrave
 /Uacute
 /Ucircumflex
 /Udieresis
 /Yacute
 /Thorn
 /germandbls
 /agrave
 /aacute
 /acircumflex
 /atilde
 /adieresis
 /aring
 /ae
 /ccedilla
 /egrave
 /eacute
 /ecircumflex
 /edieresis
 /igrave
 /iacute
 /icircumflex
 /idieresis
 /eth
 /ntilde
 /ograve
 /oacute
 /ocircumflex
 /otilde
 /odieresis
 /divide
 /oslash
 /ugrave
 /uacute
 /ucircumflex
 /udieresis
 /yacute
 /thorn
 /ydieresis
] def
%%EndProlog
%%BeginSetup
%%EndSetup
612.00 612.00 scale
[/DeviceRGB] SCS
Color2 SC
[] 0 SD
0.0045 SLW
0 SLC
0 SLJ
n
0.6124 0.1499 m
0.6127 0.1504 l
0.6143 0.1524 l
0.6159 0.1544 l
0.6175 0.1563 l
0.6190 0.1581 l
0.6206 0.1599 l
0.6222 0.1617 l
0.6237 0.1634 l
0.6253 0.1650 l
0.6269 0.1666 l
0.6284 0.1682 l
0.6300 0.1697 l
0.6316 0.1712 l
0.6331 0.1726 l
0.6347 0.1741 l
0.6363 0.1754 l
0.6378 0.1768 l
0.6394 0.1781 l
0.6410 0.1794 l
0.6425 0.1806 l
0.6441 0.1819 l
0.6457 0.1831 l
0.6473 0.1843 l
0.6488 0.1854 l
0.6504 0.1865 l
0.6520 0.1876 l
0.6535 0.1887 l
0.6551 0.1898 l
0.6567 0.1909 l
0.6582 0.1919 l
0.6598 0.1930 l
0.6629 0.1939 l
0.6645 0.1946 l
0.6661 0.1954 l
0.6676 0.1962 l
0.6692 0.1970 l
0.6708 0.1978 l
0.6724 0.1986 l
0.6739 0.1994 l
0.6755 0.2001 l
0.6771 0.2008 l
0.6786 0.2016 l
0.6802 0.2023 l
0.6818 0.2030 l
0.6833 0.2037 l
0.6849 0.2044 l
0.6865 0.2051 l
0.6880 0.2057 l
0.6896 0.2064 l
0.6912 0.2070 l
0.6927 0.2076 l
0.6943 0.2083 l
0.6959 0.2089 l
0.6975 0.2095 l
0.6990 0.2101 l
0.7006 0.2107 l
0.7022 0.2112 l
0.7037 0.2118 l
0.7053 0.2123 l
0.7069 0.2129 l
0.7084 0.2134 l
0.7100 0.2140 l
0.7116 0.2145 l
0.7131 0.2150 l
0.7147 0.2155 l
0.7163 0.2160 l
0.7178 0.2165 l
0.7194 0.2170 l
0.7210 0.2175 l
0.7225 0.2180 l
0.7241 0.2184 l
0.7257 0.2189 l
0.7273 0.2193 l
0.7288 0.2198 l
0.7304 0.2202 l
0.7320 0.2207 l
0.7335 0.2211 l
0.7351 0.2215 l
0.7367 0.2219 l
0.7382 0.2223 l
0.7398 0.2227 l
0.7414 0.2231 l
0.7429 0.2235 l
0.7445 0.2239 l
0.7461 0.2243 l
0.7476 0.2247 l
0.7492 0.2251 l
0.7508 0.2255 l
0.7524 0.2259 l
0.7539 0.2263 l
0.7555 0.2269 l
0.7571 0.2266 l
0.7586 0.2268 l
0.7602 0.2271 l
0.7618 0.2274 l
0.7633 0.2277 l
0.7649 0.2280 l
0.7665 0.2283 l
0.7680 0.2286 l
0.7696 0.2289 l
0.7712 0.2291 l
0.7727 0.2294 l
0.7743 0.2297 l
0.7759 0.2300 l
0.7775 0.2303 l
0.7790 0.2305 l
0.7806 0.2308 l
0.7822 0.2311 l
0.7837 0.2313 l
0.7853 0.2316 l
0.7869 0.2318 l
0.7884 0.2321 l
0.7900 0.2324 l
0.7916 0.2326 l
0.7931 0.2328 l
0.7947 0.2331 l
0.7963 0.2333 l
0.7978 0.2336 l
0.7994 0.2338 l
0.8010 0.2340 l
0.8025 0.2343 l
0.8041 0.2345 l
0.8057 0.2347 l
0.8073 0.2350 l
0.8088 0.2352 l
0.8104 0.2354 l
0.8120 0.2356 l
0.8135 0.2358 l
0.8151 0.2360 l
0.8167 0.2362 l
0.8182 0.2365 l
0.8198 0.2367 l
0.8214 0.2369 l
0.8229 0.2371 l
0.8245 0.2373 l
0.8261 0.2375 l
0.8276 0.2377 l
0.8292 0.2379 l
0.8308 0.2380 l
0.8324 0.2382 l
0.8339 0.2384 l
0.8355 0.2386 l
0.8371 0.2388 l
0.8386 0.2390 l
0.8402 0.2392 l
0.8418 0.2393 l
0.8433 0.2408 l
0.8449 0.2409 l
0.8465 0.2411 l
0.8480 0.2413 l
0.8496 0.2415 l
0.8512 0.2416 l
0.8527 0.2418 l
0.8543 0.2420 l
0.8559 0.2422 l
0.8575 0.2423 l
0.8590 0.2425 l
0.8606 0.2426 l
0.8622 0.2428 l
0.8637 0.2430 l
0.8653 0.2431 l
0.8669 0.2433 l
0.8684 0.2434 l
0.8700 0.2436 l
0.8716 0.2437 l
0.8731 0.2439 l
0.8747 0.2440 l
0.8763 0.2442 l
0.8778 0.2443 l
0.8794 0.2445 l
0.8810 0.2446 l
0.8825 0.2447 l
0.8841 0.2449 l
0.8857 0.2450 l
0.8873 0.2452 l
0.8888 0.2453 l
0.8904 0.2454 l
0.8920 0.2456 l
0.8935 0.2457 l
0.8951 0.2458 l
0.8967 0.2459 l
0.8982 0.2461 l
0.8998 0.2462 l
0.9014 0.2463 l
0.9029 0.2464 l
0.9045 0.2466 l
0.9061 0.2467 l
0.9076 0.2468 l
0.9092 0.2469 l
0.9108 0.2470 l
0.9124 0.2472 l
0.9139 0.2473 l
0.9155 0.2474 l
0.9171 0.2475 l
0.9186 0.2476 l
0.9202 0.2477 l
0.9218 0.2478 l
0.9233 0.2480 l
0.9249 0.2481 l
0.9265 0.2482 l
0.9280 0.2483 l
0.9296 0.2484 l
0.9312 0.2485 l
0.9327 0.2486 l
0.9343 0.2487 l
0.9359 0.2488 l
0.9375 0.2489 l
0.9390 0.2490 l
0.9406 0.2491 l
0.9422 0.2492 l
0.9437 0.2493 l
0.9453 0.2494 l
0.9469 0.2495 l
0.9484 0.2496 l
0.9500 0.2497 l
s
[/DeviceRGB] SCS
Color3 SC
n
0.1500 0.8810 m
0.1516 0.8817 l
0.1531 0.8823 l
0.1547 0.8829 l
0.1563 0.8834 l
0.1578 0.8840 l
0.1594 0.8845 l
0.1610 0.8850 l
0.1625 0.8855 l
0.1641 0.8860 l
0.1657 0.8865 l
0.1673 0.8869 l
0.1688 0.8873 l
0.1704 0.8877 l
0.1720 0.8881 l
0.1735 0.8885 l
0.1751 0.8889 l
0.1767 0.8893 l
0.1782 0.8896 l
0.1798 0.8899 l
0.1814 0.8903 l
0.1829 0.8906 l
0.1845 0.8909 l
0.1861 0.8912 l
0.1876 0.8915 l
0.1892 0.8918 l
0.1908 0.8922 l
0.1924 0.8925 l
0.1939 0.8928 l
0.1955 0.8931 l
0.1971 0.8935 l
0.1986 0.8938 l
0.2002 0.8941 l
0.2018 0.8942 l
0.2033 0.8942 l
0.2049 0.8939 l
0.2065 0.8932 l
0.2080 0.8924 l
0.2096 0.8918 l
0.2112 0.8914 l
0.2127 0.8912 l
0.2143 0.8911 l
0.2159 0.8910 l
0.2175 0.8909 l
0.2190 0.8909 l
0.2206 0.8909 l
0.2222 0.8908 l
0.2237 0.8908 l
0.2253 0.8908 l
0.2269 0.8908 l
0.2284 0.8907 l
0.2300 0.8907 l
0.2316 0.8907 l
0.2331 0.8907 l
0.2347 0.8907 l
0.2363 0.8907 l
0.2378 0.8906 l
0.2394 0.8906 l
0.2410 0.8906 l
0.2425 0.8906 l
0.2441 0.8906 l
0.2457 0.8906 l
0.2473 0.8906 l
0.2488 0.8906 l
0.2504 0.8905 l
0.2520 0.8905 l
0.2535 0.8905 l
0.2551 0.8905 l
0.2567 0.8905 l
0.2582 0.8905 l
0.2598 0.8905 l
0.2614 0.8905 l
0.2629 0.8905 l
0.2645 0.8904 l
0.2661 0.8904 l
0.2676 0.8904 l
0.2692 0.8904 l
0.2708 0.8904 l
0.2724 0.8904 l
0.2739 0.8904 l
0.2755 0.8904 l
0.2771 0.8904 l
0.2786 0.8904 l
0.2802 0.8904 l
0.2818 0.8903 l
0.2833 0.8903 l
0.2849 0.8903 l
0.2865 0.8903 l
0.2880 0.8903 l
0.2896 0.8903 l
0.2912 0.8903 l
0.2927 0.8903 l
0.2943 0.8903 l
0.2959 0.8903 l
0.2975 0.8902 l
0.2990 0.8902 l
0.3006 0.8902 l
0.3022 0.8902 l
0.3037 0.8902 l
0.3053 0.8902 l
0.3069 0.8902 l
0.3084 0.8902 l
0.3100 0.8901 l
0.3116 0.8901 l
0.3131 0.8901 l
0.3147 0.8901 l
0.3163 0.8901 l
0.3178 0.8901 l
0.3194 0.8901 l
0.3210 0.8901 l
0.3225 0.8901 l
0.3241 0.8900 l
0.3257 0.8900 l
0.3273 0.8900 l
0.3288 0.8900 l
0.3304 0.8900 l
0.3320 0.8900 l
0.3335 0.8900 l
0.3351 0.8900 l
0.3367 0.8900 l
0.3382 0.8899 l
0.3398 0.8899 l
0.3414 0.8899 l
0.3429 0.8899 l
0.3445 0.8899 l
0.3461 0.8899 l
0.3476 0.8899 l
0.3492 0.8899 l
0.3508 0.8899 l
0.3524 0.8899 l
0.3539 0.8898 l
0.3555 0.8898 l
0.3571 0.8898 l
0.3586 0.8898 l
0.3602 0.8898 l
0.3618 0.8898 l
0.3633 0.8898 l
0.3649 0.8898 l
0.3665 0.8898 l
0.3680 0.8898 l
0.3696 0.8897 l
0.3712 0.8897 l
0.3727 0.8897 l
0.3743 0.8897 l
0.3759 0.8897 l
0.3775 0.8897 l
0.3790 0.8897 l
0.3806 0.8897 l
0.3822 0.8897 l
0.3837 0.8897 l
0.3853 0.8896 l
0.3869 0.8896 l
0.3884 0.8896 l
0.3900 0.8896 l
0.3916 0.8896 l
0.3931 0.8896 l
0.3947 0.8896 l
0.3963 0.8896 l
0.3978 0.8896 l
0.3994 0.8895 l
0.4010 0.8895 l
0.4025 0.8895 l
0.4041 0.8895 l
0.4057 0.8895 l
0.4073 0.8895 l
0.4088 0.8895 l
0.4104 0.8894 l
0.4120 0.8894 l
0.4135 0.8894 l
0.4151 0.8894 l
0.4167 0.8894 l
0.4182 0.8894 l
0.4198 0.8894 l
0.4214 0.8893 l
0.4229 0.8893 l
0.4245 0.8893 l
0.4261 0.8893 l
0.4276 0.8893 l
0.4292 0.8893 l
0.4308 0.8892 l
0.4324 0.8892 l
0.4339 0.8892 l
0.4355 0.8892 l
0.4371 0.8892 l
0.4386 0.8892 l
0.4402 0.8892 l
0.4418 0.8891 l
0.4433 0.8891 l
0.4449 0.8891 l
0.4465 0.8891 l
0.4480 0.8891 l
0.4496 0.8891 l
0.4512 0.8891 l
0.4527 0.8890 l
0.4543 0.8890 l
0.4559 0.8890 l
0.4575 0.8890 l
0.4590 0.8890 l
0.4606 0.8890 l
0.4622 0.8890 l
0.4637 0.8889 l
0.4653 0.8889 l
0.4669 0.8889 l
0.4684 0.8889 l
0.4700 0.8889 l
0.4716 0.8889 l
0.4731 0.8889 l
0.4747 0.8889 l
0.4763 0.8889 l
0.4778 0.8889 l
0.4794 0.8888 l
0.4810 0.8887 l
0.4825 0.8887 l
0.4841 0.8886 l
0.4857 0.8886 l
0.4873 0.8885 l
0.4888 0.8885 l
0.4904 0.8885 l
0.4920 0.8884 l
0.4935 0.8884 l
0.4951 0.8883 l
0.4967 0.8883 l
0.4982 0.8883 l
0.4998 0.8882 l
0.5014 0.8882 l
0.5029 0.8881 l
0.5045 0.8881 l
0.5061 0.8881 l
0.5076 0.8880 l
0.5092 0.8880 l
0.5108 0.8879 l
0.5124 0.8879 l
0.5139 0.8879 l
0.5155 0.8878 l
0.5171 0.8878 l
0.5186 0.8877 l
0.5202 0.8877 l
0.5218 0.8877 l
0.5233 0.8876 l
0.5249 0.8876 l
0.5265 0.8875 l
0.5280 0.8875 l
0.5296 0.8875 l
0.5312 0.8874 l
0.5327 0.8874 l
0.5343 0.8873 l
0.5359 0.8873 l
0.5375 0.8873 l
0.5390 0.8872 l
0.5406 0.8872 l
0.5422 0.8871 l
0.5437 0.8871 l
0.5453 0.8871 l
0.5469 0.8870 l
0.5484 0.8870 l
0.5502 0.8869 l
0.5516 0.8869 l
0.5531 0.8869 l
0.5547 0.8868 l
0.5563 0.8868 l
0.5578 0.8867 l
0.5594 0.8867 l
0.5610 0.8867 l
0.5625 0.8866 l
0.5641 0.8866 l
0.5657 0.8866 l
0.5673 0.8865 l
0.5688 0.8865 l
0.5704 0.8864 l
0.5720 0.8864 l
0.5735 0.8864 l
0.5751 0.8863 l
0.5767 0.8863 l
0.5782 0.8863 l
0.5798 0.8862 l
0.5814 0.8861 l
0.5829 0.8861 l
0.5845 0.8860 l
0.5861 0.8860 l
0.5876 0.8859 l
0.5892 0.8859 l
0.5908 0.8858 l
0.5924 0.8858 l
0.5939 0.8857 l
0.5955 0.8857 l
0.5971 0.8857 l
0.5986 0.8856 l
0.6002 0.8856 l
0.6018 0.8855 l
0.6033 0.8855 l
0.6049 0.8855 l
0.6065 0.8854 l
0.6080 0.8854 l
0.6096 0.8853 l
0.6112 0.8853 l
0.6127 0.8853 l
0.6143 0.8852 l
0.6159 0.8852 l
0.6175 0.8852 l
0.6190 0.8851 l
0.6206 0.8851 l
0.6222 0.8850 l
0.6237 0.8850 l
0.6253 0.8850 l
0.6269 0.8849 l
0.6284 0.8849 l
0.6300 0.8849 l
0.6316 0.8848 l
0.6331 0.8848 l
0.6347 0.8848 l
0.6363 0.8847 l
0.6378 0.8847 l
0.6394 0.8847 l
0.6410 0.8846 l
0.6425 0.8846 l
0.6441 0.8846 l
0.6457 0.8845 l
0.6473 0.8845 l
0.6488 0.8845 l
0.6504 0.8845 l
0.6520 0.8844 l
0.6535 0.8844 l
0.6551 0.8844 l
0.6567 0.8844 l
0.6582 0.8844 l
0.6598 0.8846 l
0.6629 0.8836 l
0.6645 0.8834 l
0.6661 0.8832 l
0.6676 0.8830 l
0.6692 0.8829 l
0.6708 0.8828 l
0.6724 0.8826 l
0.6739 0.8825 l
0.6755 0.8824 l
0.6771 0.8823 l
0.6786 0.8822 l
0.6802 0.8821 l
0.6818 0.8820 l
0.6833 0.8819 l
0.6849 0.8819 l
0.6865 0.8818 l
0.6880 0.8817 l
0.6896 0.8816 l
0.6912 0.8815 l
0.6927 0.8814 l
0.6943 0.8814 l
0.6959 0.8813 l
0.6975 0.8812 l
0.6990 0.8811 l
0.7006 0.8811 l
0.7022 0.8810 l
0.7037 0.8809 l
0.7053 0.8809 l
0.7069 0.8808 l
0.7084 0.8807 l
0.7100 0.8807 l
0.7116 0.8806 l
0.7131 0.8805 l
0.7147 0.8805 l
0.7163 0.8804 l
0.7178 0.8803 l
0.7194 0.8803 l
0.7210 0.8802 l
0.7225 0.8802 l
0.7241 0.8801 l
0.7257 0.8800 l
0.7273 0.8800 l
0.7288 0.8799 l
0.7304 0.8799 l
0.7320 0.8798 l
0.7335 0.8798 l
0.7351 0.8797 l
0.7367 0.8797 l
0.7382 0.8796 l
0.7398 0.8795 l
0.7414 0.8795 l
0.7429 0.8794 l
0.7445 0.8794 l
0.7461 0.8794 l
0.7476 0.8793 l
0.7492 0.8793 l
0.7508 0.8792 l
0.7524 0.8792 l
0.7539 0.8792 l
0.7555 0.8794 l
0.7571 0.8788 l
0.7586 0.8786 l
0.7602 0.8785 l
0.7618 0.8784 l
0.7633 0.8783 l
0.7649 0.8782 l
0.7665 0.8782 l
0.7680 0.8781 l
0.7696 0.8780 l
0.7712 0.8779 l
0.7727 0.8779 l
0.7743 0.8778 l
0.7759 0.8777 l
0.7775 0.8776 l
0.7790 0.8776 l
0.7806 0.8775 l
0.7822 0.8774 l
0.7837 0.8774 l
0.7853 0.8773 l
0.7869 0.8773 l
0.7884 0.8772 l
0.7900 0.8771 l
0.7916 0.8771 l
0.7931 0.8770 l
0.7947 0.8769 l
0.7963 0.8769 l
0.7978 0.8768 l
0.7994 0.8768 l
0.8010 0.8767 l
0.8025 0.8767 l
0.8041 0.8766 l
0.8057 0.8766 l
0.8073 0.8765 l
0.8088 0.8764 l
0.8104 0.8764 l
0.8120 0.8763 l
0.8135 0.8763 l
0.8151 0.8762 l
0.8167 0.8762 l
0.8182 0.8761 l
0.8198 0.8761 l
0.8214 0.8760 l
0.8229 0.8760 l
0.8245 0.8759 l
0.8261 0.8759 l
0.8276 0.8758 l
0.8292 0.8758 l
0.8308 0.8757 l
0.8324 0.8757 l
0.8339 0.8756 l
0.8355 0.8756 l
0.8371 0.8756 l
0.8386 0.8755 l
0.8402 0.8755 l
0.8418 0.8754 l
0.8433 0.8766 l
0.8449 0.8766 l
0.8465 0.8765 l
0.8480 0.8765 l
0.8496 0.8765 l
0.8512 0.8764 l
0.8527 0.8764 l
0.8543 0.8764 l
0.8559 0.8763 l
0.8575 0.8763 l
0.8590 0.8763 l
0.8606 0.8762 l
0.8622 0.8762 l
0.8637 0.8761 l
0.8653 0.8761 l
0.8669 0.8761 l
0.8684 0.8760 l
0.8700 0.8760 l
0.8716 0.8760 l
0.8731 0.8759 l
0.8747 0.8759 l
0.8763 0.8759 l
0.8778 0.8758 l
0.8794 0.8758 l
0.8810 0.8758 l
0.8825 0.8757 l
0.8841 0.8757 l
0.8857 0.8757 l
0.8873 0.8756 l
0.8888 0.8756 l
0.8904 0.8756 l
0.8920 0.8755 l
0.8935 0.8755 l
0.8951 0.8755 l
0.8967 0.8754 l
0.8982 0.8754 l
0.8998 0.8754 l
0.9014 0.8753 l
0.9029 0.8753 l
0.9045 0.8753 l
0.9061 0.8752 l
0.9076 0.8752 l
0.9092 0.8752 l
0.9108 0.8751 l
0.9124 0.8751 l
0.9139 0.8751 l
0.9155 0.8750 l
0.9171 0.8750 l
0.9186 0.8750 l
0.9202 0.8749 l
0.9218 0.8749 l
0.9233 0.8749 l
0.9249 0.8748 l
0.9265 0.8748 l
0.9280 0.8748 l
0.9296 0.8747 l
0.9312 0.8747 l
0.9327 0.8747 l
0.9343 0.8747 l
0.9359 0.8746 l
0.9375 0.8746 l
0.9390 0.8746 l
0.9406 0.8745 l
0.9422 0.8745 l
0.9437 0.8745 l
0.9453 0.8744 l
0.9469 0.8744 l
0.9484 0.8744 l
0.9500 0.8744 l
s
[/DeviceRGB] SCS
Color4 SC
n
0.1500 0.7074 m
0.1516 0.7076 l
0.1531 0.7078 l
0.1547 0.7079 l
0.1563 0.7081 l
0.1578 0.7082 l
0.1594 0.7083 l
0.1610 0.7083 l
0.1625 0.7083 l
0.1641 0.7082 l
0.1657 0.7081 l
0.1673 0.7080 l
0.1688 0.7078 l
0.1704 0.7076 l
0.1720 0.7073 l
0.1735 0.7069 l
0.1751 0.7065 l
0.1767 0.7060 l
0.1782 0.7054 l
0.1798 0.7047 l
0.1814 0.7039 l
0.1829 0.7030 l
0.1845 0.7020 l
0.1861 0.7008 l
0.1876 0.6994 l
0.1892 0.6978 l
0.1908 0.6959 l
0.1924 0.6937 l
0.1939 0.6913 l
0.1955 0.6884 l
0.1971 0.6853 l
0.1986 0.6820 l
0.2002 0.6791 l
0.2018 0.6773 l
0.2033 0.6783 l
0.2049 0.6833 l
0.2065 0.6920 l
0.2080 0.7010 l
0.2096 0.7071 l
0.2112 0.7105 l
0.2127 0.7124 l
0.2143 0.7136 l
0.2159 0.7144 l
0.2175 0.7150 l
0.2190 0.7154 l
0.2206 0.7158 l
0.2222 0.7161 l
0.2237 0.7163 l
0.2253 0.7165 l
0.2269 0.7167 l
0.2284 0.7169 l
0.2300 0.7171 l
0.2316 0.7172 l
0.2331 0.7173 l
0.2347 0.7175 l
0.2363 0.7176 l
0.2378 0.7177 l
0.2394 0.7178 l
0.2410 0.7179 l
0.2425 0.7181 l
0.2441 0.7182 l
0.2457 0.7183 l
0.2473 0.7184 l
0.2488 0.7185 l
0.2504 0.7186 l
0.2520 0.7187 l
0.2535 0.7188 l
0.2551 0.7189 l
0.2567 0.7189 l
0.2582 0.7190 l
0.2598 0.7191 l
0.2614 0.7192 l
0.2629 0.7193 l
0.2645 0.7194 l
0.2661 0.7195 l
0.2676 0.7196 l
0.2692 0.7197 l
0.2708 0.7197 l
0.2724 0.7198 l
0.2739 0.7199 l
0.2755 0.7200 l
0.2771 0.7200 l
0.2786 0.7201 l
0.2802 0.7202 l
0.2818 0.7203 l
0.2833 0.7204 l
0.2849 0.7204 l
0.2865 0.7205 l
0.2880 0.7206 l
0.2896 0.7207 l
0.2912 0.7208 l
0.2927 0.7208 l
0.2943 0.7209 l
0.2959 0.7210 l
0.2975 0.7211 l
0.2990 0.7212 l
0.3006 0.7212 l
0.3022 0.7213 l
0.3037 0.7214 l
0.3053 0.7215 l
0.3069 0.7215 l
0.3084 0.7216 l
0.3100 0.7217 l
0.3116 0.7217 l
0.3131 0.7218 l
0.3147 0.7219 l
0.3163 0.7220 l
0.3178 0.7220 l
0.3194 0.7221 l
0.3210 0.7222 l
0.3225 0.7222 l
0.3241 0.7223 l
0.3257 0.7224 l
0.3273 0.7224 l
0.3288 0.7225 l
0.3304 0.7226 l
0.3320 0.7226 l
0.3335 0.7227 l
0.3351 0.7228 l
0.3367 0.7228 l
0.3382 0.7229 l
0.3398 0.7229 l
0.3414 0.7230 l
0.3429 0.7231 l
0.3445 0.7231 l
0.3461 0.7232 l
0.3476 0.7233 l
0.3492 0.7233 l
0.3508 0.7234 l
0.3524 0.7234 l
0.3539 0.7235 l
0.3555 0.7236 l
0.3571 0.7236 l
0.3586 0.7237 l
0.3602 0.7237 l
0.3618 0.7238 l
0.3633 0.7238 l
0.3649 0.7239 l
0.3665 0.7240 l
0.3680 0.7240 l
0.3696 0.7241 l
0.3712 0.7241 l
0.3727 0.7242 l
0.3743 0.7242 l
0.3759 0.7243 l
0.3775 0.7243 l
0.3790 0.7244 l
0.3806 0.7245 l
0.3822 0.7245 l
0.3837 0.7246 l
0.3853 0.7246 l
0.3869 0.7247 l
0.3884 0.7247 l
0.3900 0.7248 l
0.3916 0.7248 l
0.3931 0.7249 l
0.3947 0.7249 l
0.3963 0.7250 l
0.3978 0.7250 l
0.3994 0.7250 l
0.4010 0.7251 l
0.4025 0.7251 l
0.4041 0.7252 l
0.4057 0.7252 l
0.4073 0.7253 l
0.4088 0.7253 l
0.4104 0.7254 l
0.4120 0.7254 l
0.4135 0.7254 l
0.4151 0.7255 l
0.4167 0.7255 l
0.4182 0.7256 l
0.4198 0.7256 l
0.4214 0.7257 l
0.4229 0.7257 l
0.4245 0.7257 l
0.4261 0.7258 l
0.4276 0.7258 l
0.4292 0.7259 l
0.4308 0.7259 l
0.4324 0.7259 l
0.4339 0.7260 l
0.4355 0.7260 l
0.4371 0.7260 l
0.4386 0.7261 l
0.4402 0.7261 l
0.4418 0.7262 l
0.4433 0.7262 l
0.4449 0.7262 l
0.4465 0.7263 l
0.4480 0.7263 l
0.4496 0.7263 l
0.4512 0.7264 l
0.4527 0.7264 l
0.4543 0.7264 l
0.4559 0.7265 l
0.4575 0.7265 l
0.4590 0.7265 l
0.4606 0.7266 l
0.4622 0.7266 l
0.4637 0.7266 l
0.4653 0.7267 l
0.4669 0.7267 l
0.4684 0.7267 l
0.4700 0.7267 l
0.4716 0.7268 l
0.4731 0.7268 l
0.4747 0.7268 l
0.4763 0.7268 l
0.4778 0.7266 l
0.4794 0.7269 l
0.4810 0.7269 l
0.4825 0.7269 l
0.4841 0.7269 l
0.4857 0.7269 l
0.4873 0.7269 l
0.4888 0.7269 l
0.4904 0.7270 l
0.4920 0.7270 l
0.4935 0.7270 l
0.4951 0.7270 l
0.4967 0.7270 l
0.4982 0.7270 l
0.4998 0.7270 l
0.5014 0.7270 l
0.5029 0.7270 l
0.5045 0.7270 l
0.5061 0.7270 l
0.5076 0.7270 l
0.5092 0.7270 l
0.5108 0.7271 l
0.5124 0.7271 l
0.5139 0.7271 l
0.5155 0.7271 l
0.5171 0.7271 l
0.5186 0.7271 l
0.5202 0.7271 l
0.5218 0.7271 l
0.5233 0.7271 l
0.5249 0.7271 l
0.5265 0.7271 l
0.5280 0.7271 l
0.5296 0.7271 l
0.5312 0.7271 l
0.5327 0.7271 l
0.5343 0.7271 l
0.5359 0.7271 l
0.5375 0.7271 l
0.5390 0.7271 l
0.5406 0.7271 l
0.5422 0.7271 l
0.5437 0.7271 l
0.5453 0.7271 l
0.5469 0.7271 l
0.5484 0.7271 l
0.5502 0.7271 l
0.5516 0.7271 l
0.5531 0.7271 l
0.5547 0.7271 l
0.5563 0.7271 l
0.5578 0.7271 l
0.5594 0.7271 l
0.5610 0.7271 l
0.5625 0.7271 l
0.5641 0.7271 l
0.5657 0.7271 l
0.5673 0.7271 l
0.5688 0.7271 l
0.5704 0.7271 l
0.5720 0.7271 l
0.5735 0.7271 l
0.5751 0.7271 l
0.5767 0.7271 l
0.5782 0.7270 l
0.5798 0.7271 l
0.5814 0.7271 l
0.5829 0.7271 l
0.5845 0.7271 l
0.5861 0.7271 l
0.5876 0.7271 l
0.5892 0.7271 l
0.5908 0.7270 l
0.5924 0.7270 l
0.5939 0.7270 l
0.5955 0.7270 l
0.5971 0.7270 l
0.5986 0.7270 l
0.6002 0.7270 l
0.6018 0.7270 l
0.6033 0.7270 l
0.6049 0.7270 l
0.6065 0.7270 l
0.6080 0.7270 l
0.6096 0.7270 l
0.6112 0.7270 l
0.6127 0.7269 l
0.6143 0.7269 l
0.6159 0.7269 l
0.6175 0.7269 l
0.6190 0.7269 l
0.6206 0.7269 l
0.6222 0.7269 l
0.6237 0.7269 l
0.6253 0.7269 l
0.6269 0.7269 l
0.6284 0.7269 l
0.6300 0.7268 l
0.6316 0.7268 l
0.6331 0.7268 l
0.6347 0.7268 l
0.6363 0.7268 l
0.6378 0.7268 l
0.6394 0.7268 l
0.6410 0.7267 l
0.6425 0.7267 l
0.6441 0.7267 l
0.6457 0.7267 l
0.6473 0.7266 l
0.6488 0.7266 l
0.6504 0.7265 l
0.6520 0.7265 l
0.6535 0.7264 l
0.6551 0.7263 l
0.6567 0.7261 l
0.6582 0.7259 l
0.6598 0.7251 l
0.6629 0.7266 l
0.6645 0.7265 l
0.6661 0.7263 l
0.6676 0.7262 l
0.6692 0.7261 l
0.6708 0.7260 l
0.6724 0.7259 l
0.6739 0.7259 l
0.6755 0.7258 l
0.6771 0.7257 l
0.6786 0.7257 l
0.6802 0.7256 l
0.6818 0.7255 l
0.6833 0.7255 l
0.6849 0.7254 l
0.6865 0.7254 l
0.6880 0.7253 l
0.6896 0.7253 l
0.6912 0.7252 l
0.6927 0.7252 l
0.6943 0.7251 l
0.6959 0.7251 l
0.6975 0.7250 l
0.6990 0.7250 l
0.7006 0.7250 l
0.7022 0.7249 l
0.7037 0.7249 l
0.7053 0.7248 l
0.7069 0.7248 l
0.7084 0.7248 l
0.7100 0.7247 l
0.7116 0.7247 l
0.7131 0.7247 l
0.7147 0.7246 l
0.7163 0.7246 l
0.7178 0.7245 l
0.7194 0.7245 l
0.7210 0.7245 l
0.7225 0.7244 l
0.7241 0.7244 l
0.7257 0.7244 l
0.7273 0.7244 l
0.7288 0.7243 l
0.7304 0.7243 l
0.7320 0.7243 l
0.7335 0.7242 l
0.7351 0.7242 l
0.7367 0.7242 l
0.7382 0.7241 l
0.7398 0.7241 l
0.7414 0.7240 l
0.7429 0.7240 l
0.7445 0.7240 l
0.7461 0.7239 l
0.7476 0.7239 l
0.7492 0.7238 l
0.7508 0.7237 l
0.7524 0.7236 l
0.7539 0.7234 l
0.7555 0.7225 l
0.7571 0.7239 l
0.7586 0.7238 l
0.7602 0.7237 l
0.7618 0.7237 l
0.7633 0.7236 l
0.7649 0.7235 l
0.7665 0.7235 l
0.7680 0.7234 l
0.7696 0.7234 l
0.7712 0.7233 l
0.7727 0.7233 l
0.7743 0.7233 l
0.7759 0.7232 l
0.7775 0.7232 l
0.7790 0.7231 l
0.7806 0.7231 l
0.7822 0.7231 l
0.7837 0.7230 l
0.7853 0.7230 l
0.7869 0.7230 l
0.7884 0.7229 l
0.7900 0.7229 l
0.7916 0.7229 l
0.7931 0.7228 l
0.7947 0.7228 l
0.7963 0.7228 l
0.7978 0.7227 l
0.7994 0.7227 l
0.8010 0.7227 l
0.8025 0.7227 l
0.8041 0.7226 l
0.8057 0.7226 l
0.8073 0.7226 l
0.8088 0.7225 l
0.8104 0.7225 l
0.8120 0.7225 l
0.8135 0.7225 l
0.8151 0.7224 l
0.8167 0.7224 l
0.8182 0.7224 l
0.8198 0.7224 l
0.8214 0.7223 l
0.8229 0.7223 l
0.8245 0.7223 l
0.8261 0.7223 l
0.8276 0.7222 l
0.8292 0.7222 l
0.8308 0.7222 l
0.8324 0.7222 l
0.8339 0.7222 l
0.8355 0.7221 l
0.8371 0.7221 l
0.8386 0.7221 l
0.8402 0.7221 l
0.8418 0.7220 l
0.8433 0.7233 l
0.8449 0.7232 l
0.8465 0.7232 l
0.8480 0.7232 l
0.8496 0.7232 l
0.8512 0.7232 l
0.8527 0.7232 l
0.8543 0.7232 l
0.8559 0.7232 l
0.8575 0.7232 l
0.8590 0.7232 l
0.8606 0.7232 l
0.8622 0.7231 l
0.8637 0.7231 l
0.8653 0.7231 l
0.8669 0.7231 l
0.8684 0.7231 l
0.8700 0.7231 l
0.8716 0.7231 l
0.8731 0.7231 l
0.8747 0.7231 l
0.8763 0.7231 l
0.8778 0.7231 l
0.8794 0.7230 l
0.8810 0.7230 l
0.8825 0.7230 l
0.8841 0.7230 l
0.8857 0.7230 l
0.8873 0.7230 l
0.8888 0.7230 l
0.8904 0.7230 l
0.8920 0.7230 l
0.8935 0.7230 l
0.8951 0.7230 l
0.8967 0.7229 l
0.8982 0.7229 l
0.8998 0.7229 l
0.9014 0.7229 l
0.9029 0.7229 l
0.9045 0.7229 l
0.9061 0.7229 l
0.9076 0.7229 l
0.9092 0.7229 l
0.9108 0.7229 l
0.9124 0.7229 l
0.9139 0.7229 l
0.9155 0.7229 l
0.9171 0.7228 l
0.9186 0.7228 l
0.9202 0.7228 l
0.9218 0.7228 l
0.9233 0.7228 l
0.9249 0.7228 l
0.9265 0.7228 l
0.9280 0.7228 l
0.9296 0.7228 l
0.9312 0.7228 l
0.9327 0.7228 l
0.9343 0.7228 l
0.9359 0.7228 l
0.9375 0.7227 l
0.9390 0.7227 l
0.9406 0.7227 l
0.9422 0.7227 l
0.9437 0.7227 l
0.9453 0.7227 l
0.9469 0.7227 l
0.9484 0.7227 l
0.9500 0.7227 l
s
[/DeviceRGB] SCS
Color5 SC
n
0.1500 0.2514 m
0.1516 0.2516 l
0.1531 0.2518 l
0.1547 0.2519 l
0.1563 0.2520 l
0.1578 0.2521 l
0.1594 0.2521 l
0.1610 0.2521 l
0.1625 0.2520 l
0.1641 0.2519 l
0.1657 0.2518 l
0.1673 0.2516 l
0.1688 0.2514 l
0.1704 0.2511 l
0.1720 0.2508 l
0.1735 0.2504 l
0.1751 0.2499 l
0.1767 0.2494 l
0.1782 0.2488 l
0.1798 0.2481 l
0.1814 0.2472 l
0.1829 0.2463 l
0.1845 0.2452 l
0.1861 0.2440 l
0.1876 0.2425 l
0.1892 0.2409 l
0.1908 0.2390 l
0.1924 0.2368 l
0.1939 0.2343 l
0.1955 0.2314 l
0.1971 0.2282 l
0.1986 0.2249 l
0.2002 0.2219 l
0.2018 0.2202 l
0.2033 0.2211 l
0.2049 0.2261 l
0.2065 0.2348 l
0.2080 0.2437 l
0.2096 0.2499 l
0.2112 0.2533 l
0.2127 0.2552 l
0.2143 0.2563 l
0.2159 0.2571 l
0.2175 0.2577 l
0.2190 0.2582 l
0.2206 0.2585 l
0.2222 0.2588 l
0.2237 0.2590 l
0.2253 0.2593 l
0.2269 0.2594 l
0.2284 0.2596 l
0.2300 0.2598 l
0.2316 0.2599 l
0.2331 0.2600 l
0.2347 0.2602 l
0.2363 0.2603 l
0.2378 0.2604 l
0.2394 0.2605 l
0.2410 0.2606 l
0.2425 0.2608 l
0.2441 0.2609 l
0.2457 0.2610 l
0.2473 0.2611 l
0.2488 0.2612 l
0.2504 0.2613 l
0.2520 0.2614 l
0.2535 0.2615 l
0.2551 0.2615 l
0.2567 0.2616 l
0.2582 0.2617 l
0.2598 0.2618 l
0.2614 0.2619 l
0.2629 0.2620 l
0.2645 0.2621 l
0.2661 0.2622 l
0.2676 0.2623 l
0.2692 0.2623 l
0.2708 0.2624 l
0.2724 0.2625 l
0.2739 0.2626 l
0.2755 0.2627 l
0.2771 0.2627 l
0.2786 0.2628 l
0.2802 0.2629 l
0.2818 0.2630 l
0.2833 0.2630 l
0.2849 0.2631 l
0.2865 0.2632 l
0.2880 0.2633 l
0.2896 0.2634 l
0.2912 0.2634 l
0.2927 0.2635 l
0.2943 0.2636 l
0.2959 0.2637 l
0.2975 0.2638 l
0.2990 0.2638 l
0.3006 0.2639 l
0.3022 0.2640 l
0.3037 0.2641 l
0.3053 0.2641 l
0.3069 0.2642 l
0.3084 0.2643 l
0.3100 0.2643 l
0.3116 0.2644 l
0.3131 0.2645 l
0.3147 0.2646 l
0.3163 0.2646 l
0.3178 0.2647 l
0.3194 0.2648 l
0.3210 0.2648 l
0.3225 0.2649 l
0.3241 0.2650 l
0.3257 0.2650 l
0.3273 0.2651 l
0.3288 0.2652 l
0.3304 0.2652 l
0.3320 0.2653 l
0.3335 0.2654 l
0.3351 0.2654 l
0.3367 0.2655 l
0.3382 0.2656 l
0.3398 0.2656 l
0.3414 0.2657 l
0.3429 0.2658 l
0.3445 0.2658 l
0.3461 0.2659 l
0.3476 0.2659 l
0.3492 0.2660 l
0.3508 0.2661 l
0.3524 0.2661 l
0.3539 0.2662 l
0.3555 0.2662 l
0.3571 0.2663 l
0.3586 0.2664 l
0.3602 0.2664 l
0.3618 0.2665 l
0.3633 0.2665 l
0.3649 0.2666 l
0.3665 0.2666 l
0.3680 0.2667 l
0.3696 0.2668 l
0.3712 0.2668 l
0.3727 0.2669 l
0.3743 0.2669 l
0.3759 0.2670 l
0.3775 0.2670 l
0.3790 0.2671 l
0.3806 0.2671 l
0.3822 0.2672 l
0.3837 0.2672 l
0.3853 0.2673 l
0.3869 0.2673 l
0.3884 0.2674 l
0.3900 0.2674 l
0.3916 0.2675 l
0.3931 0.2675 l
0.3947 0.2676 l
0.3963 0.2676 l
0.3978 0.2677 l
0.3994 0.2677 l
0.4010 0.2678 l
0.4025 0.2678 l
0.4041 0.2679 l
0.4057 0.2679 l
0.4073 0.2680 l
0.4088 0.2680 l
0.4104 0.2681 l
0.4120 0.2681 l
0.4135 0.2681 l
0.4151 0.2682 l
0.4167 0.2682 l
0.4182 0.2683 l
0.4198 0.2683 l
0.4214 0.2683 l
0.4229 0.2684 l
0.4245 0.2684 l
0.4261 0.2685 l
0.4276 0.2685 l
0.4292 0.2685 l
0.4308 0.2686 l
0.4324 0.2686 l
0.4339 0.2687 l
0.4355 0.2687 l
0.4371 0.2687 l
0.4386 0.2688 l
0.4402 0.2688 l
0.4418 0.2689 l
0.4433 0.2689 l
0.4449 0.2689 l
0.4465 0.2690 l
0.4480 0.2690 l
0.4496 0.2690 l
0.4512 0.2691 l
0.4527 0.2691 l
0.4543 0.2691 l
0.4559 0.2692 l
0.4575 0.2692 l
0.4590 0.2692 l
0.4606 0.2693 l
0.4622 0.2693 l
0.4637 0.2693 l
0.4653 0.2694 l
0.4669 0.2694 l
0.4684 0.2694 l
0.4700 0.2694 l
0.4716 0.2695 l
0.4731 0.2695 l
0.4747 0.2695 l
0.4763 0.2695 l
0.4778 0.2693 l
0.4794 0.2696 l
0.4810 0.2696 l
0.4825 0.2696 l
0.4841 0.2696 l
0.4857 0.2696 l
0.4873 0.2697 l
0.4888 0.2697 l
0.4904 0.2697 l
0.4920 0.2697 l
0.4935 0.2697 l
0.4951 0.2697 l
0.4967 0.2697 l
0.4982 0.2697 l
0.4998 0.2697 l
0.5014 0.2697 l
0.5029 0.2697 l
0.5045 0.2698 l
0.5061 0.2698 l
0.5076 0.2698 l
0.5092 0.2698 l
0.5108 0.2698 l
0.5124 0.2698 l
0.5139 0.2698 l
0.5155 0.2698 l
0.5171 0.2698 l
0.5186 0.2698 l
0.5202 0.2698 l
0.5218 0.2698 l
0.5233 0.2698 l
0.5249 0.2698 l
0.5265 0.2698 l
0.5280 0.2698 l
0.5296 0.2698 l
0.5312 0.2698 l
0.5327 0.2699 l
0.5343 0.2699 l
0.5359 0.2699 l
0.5375 0.2699 l
0.5390 0.2699 l
0.5406 0.2699 l
0.5422 0.2699 l
0.5437 0.2699 l
0.5453 0.2699 l
0.5469 0.2699 l
0.5484 0.2699 l
0.5502 0.2699 l
0.5516 0.2699 l
0.5531 0.2699 l
0.5547 0.2699 l
0.5563 0.2699 l
0.5578 0.2699 l
0.5594 0.2699 l
0.5610 0.2699 l
0.5625 0.2699 l
0.5641 0.2699 l
0.5657 0.2699 l
0.5673 0.2699 l
0.5688 0.2699 l
0.5704 0.2699 l
0.5720 0.2699 l
0.5735 0.2699 l
0.5751 0.2698 l
0.5767 0.2698 l
0.5782 0.2697 l
0.5798 0.2699 l
0.5814 0.2699 l
0.5829 0.2699 l
0.5845 0.2699 l
0.5861 0.2698 l
0.5876 0.2698 l
0.5892 0.2698 l
0.5908 0.2698 l
0.5924 0.2698 l
0.5939 0.2698 l
0.5955 0.2698 l
0.5971 0.2698 l
0.5986 0.2698 l
0.6002 0.2698 l
0.6018 0.2698 l
0.6033 0.2698 l
0.6049 0.2698 l
0.6065 0.2698 l
0.6080 0.2697 l
0.6096 0.2697 l
0.6112 0.2697 l
0.6127 0.2697 l
0.6143 0.2697 l
0.6159 0.2697 l
0.6175 0.2697 l
0.6190 0.2697 l
0.6206 0.2697 l
0.6222 0.2697 l
0.6237 0.2697 l
0.6253 0.2697 l
0.6269 0.2697 l
0.6284 0.2696 l
0.6300 0.2696 l
0.6316 0.2696 l
0.6331 0.2696 l
0.6347 0.2696 l
0.6363 0.2696 l
0.6378 0.2696 l
0.6394 0.2696 l
0.6410 0.2695 l
0.6425 0.2695 l
0.6441 0.2695 l
0.6457 0.2695 l
0.6473 0.2694 l
0.6488 0.2694 l
0.6504 0.2693 l
0.6520 0.2693 l
0.6535 0.2692 l
0.6551 0.2691 l
0.6567 0.2690 l
0.6582 0.2687 l
0.6598 0.2680 l
0.6629 0.2695 l
0.6645 0.2693 l
0.6661 0.2692 l
0.6676 0.2691 l
0.6692 0.2690 l
0.6708 0.2689 l
0.6724 0.2688 l
0.6739 0.2687 l
0.6755 0.2686 l
0.6771 0.2686 l
0.6786 0.2685 l
0.6802 0.2684 l
0.6818 0.2684 l
0.6833 0.2683 l
0.6849 0.2683 l
0.6865 0.2682 l
0.6880 0.2682 l
0.6896 0.2681 l
0.6912 0.2681 l
0.6927 0.2680 l
0.6943 0.2680 l
0.6959 0.2679 l
0.6975 0.2679 l
0.6990 0.2678 l
0.7006 0.2678 l
0.7022 0.2678 l
0.7037 0.2677 l
0.7053 0.2677 l
0.7069 0.2676 l
0.7084 0.2676 l
0.7100 0.2676 l
0.7116 0.2675 l
0.7131 0.2675 l
0.7147 0.2675 l
0.7163 0.2674 l
0.7178 0.2674 l
0.7194 0.2674 l
0.7210 0.2673 l
0.7225 0.2673 l
0.7241 0.2673 l
0.7257 0.2672 l
0.7273 0.2672 l
0.7288 0.2672 l
0.7304 0.2671 l
0.7320 0.2671 l
0.7335 0.2671 l
0.7351 0.2670 l
0.7367 0.2670 l
0.7382 0.2670 l
0.7398 0.2669 l
0.7414 0.2669 l
0.7429 0.2669 l
0.7445 0.2668 l
0.7461 0.2668 l
0.7476 0.2667 l
0.7492 0.2667 l
0.7508 0.2666 l
0.7524 0.2665 l
0.7539 0.2663 l
0.7555 0.2654 l
0.7571 0.2668 l
0.7586 0.2667 l
0.7602 0.2666 l
0.7618 0.2665 l
0.7633 0.2665 l
0.7649 0.2664 l
0.7665 0.2663 l
0.7680 0.2663 l
0.7696 0.2662 l
0.7712 0.2662 l
0.7727 0.2662 l
0.7743 0.2661 l
0.7759 0.2661 l
0.7775 0.2660 l
0.7790 0.2660 l
0.7806 0.2660 l
0.7822 0.2659 l
0.7837 0.2659 l
0.7853 0.2658 l
0.7869 0.2658 l
0.7884 0.2658 l
0.7900 0.2657 l
0.7916 0.2657 l
0.7931 0.2657 l
0.7947 0.2656 l
0.7963 0.2656 l
0.7978 0.2656 l
0.7994 0.2656 l
0.8010 0.2655 l
0.8025 0.2655 l
0.8041 0.2655 l
0.8057 0.2654 l
0.8073 0.2654 l
0.8088 0.2654 l
0.8104 0.2654 l
0.8120 0.2653 l
0.8135 0.2653 l
0.8151 0.2653 l
0.8167 0.2653 l
0.8182 0.2652 l
0.8198 0.2652 l
0.8214 0.2652 l
0.8229 0.2652 l
0.8245 0.2651 l
0.8261 0.2651 l
0.8276 0.2651 l
0.8292 0.2651 l
0.8308 0.2650 l
0.8324 0.2650 l
0.8339 0.2650 l
0.8355 0.2650 l
0.8371 0.2650 l
0.8386 0.2649 l
0.8402 0.2649 l
0.8418 0.2649 l
0.8433 0.2661 l
0.8449 0.2661 l
0.8465 0.2661 l
0.8480 0.2661 l
0.8496 0.2661 l
0.8512 0.2660 l
0.8527 0.2660 l
0.8543 0.2660 l
0.8559 0.2660 l
0.8575 0.2660 l
0.8590 0.2660 l
0.8606 0.2660 l
0.8622 0.2660 l
0.8637 0.2660 l
0.8653 0.2660 l
0.8669 0.2659 l
0.8684 0.2659 l
0.8700 0.2659 l
0.8716 0.2659 l
0.8731 0.2659 l
0.8747 0.2659 l
0.8763 0.2659 l
0.8778 0.2659 l
0.8794 0.2659 l
0.8810 0.2659 l
0.8825 0.2659 l
0.8841 0.2658 l
0.8857 0.2658 l
0.8873 0.2658 l
0.8888 0.2658 l
0.8904 0.2658 l
0.8920 0.2658 l
0.8935 0.2658 l
0.8951 0.2658 l
0.8967 0.2658 l
0.8982 0.2658 l
0.8998 0.2658 l
0.9014 0.2657 l
0.9029 0.2657 l
0.9045 0.2657 l
0.9061 0.2657 l
0.9076 0.2657 l
0.9092 0.2657 l
0.9108 0.2657 l
0.9124 0.2657 l
0.9139 0.2657 l
0.9155 0.2657 l
0.9171 0.2657 l
0.9186 0.2657 l
0.9202 0.2656 l
0.9218 0.2656 l
0.9233 0.2656 l
0.9249 0.2656 l
0.9265 0.2656 l
0.9280 0.2656 l
0.9296 0.2656 l
0.9312 0.2656 l
0.9327 0.2656 l
0.9343 0.2656 l
0.9359 0.2656 l
0.9375 0.2656 l
0.9390 0.2655 l
0.9406 0.2655 l
0.9422 0.2655 l
0.9437 0.2655 l
0.9453 0.2655 l
0.9469 0.2655 l
0.9484 0.2655 l
0.9500 0.2655 l
s
[/DeviceRGB] SCS
Color6 SC
n
0.1500 0.6791 m
0.1516 0.6742 l
0.1531 0.6691 l
0.1547 0.6638 l
0.1563 0.6583 l
0.1578 0.6526 l
0.1594 0.6468 l
0.1610 0.6407 l
0.1625 0.6345 l
0.1641 0.6279 l
0.1657 0.6212 l
0.1673 0.6142 l
0.1688 0.6068 l
0.1704 0.5992 l
0.1720 0.5913 l
0.1735 0.5830 l
0.1751 0.5743 l
0.1767 0.5652 l
0.1782 0.5556 l
0.1798 0.5455 l
0.1814 0.5348 l
0.1829 0.5235 l
0.1845 0.5115 l
0.1861 0.4988 l
0.1876 0.4851 l
0.1892 0.4703 l
0.1908 0.4544 l
0.1924 0.4372 l
0.1939 0.4184 l
0.1955 0.3978 l
0.1971 0.3753 l
0.1986 0.3506 l
0.2002 0.3239 l
0.2018 0.2957 l
0.2033 0.2668 l
0.2049 0.2384 l
0.2065 0.2103 l
0.2080 0.1811 l
0.2096 0.1513 l
0.2097 0.1499 l
s
[/DeviceRGB] SCS
Color1 SC
[] 0 SD
0.0015 SLW
n
0.1971 0.1500 m
0.1971 0.1600 l
s
n
0.1971 0.9000 m
0.1971 0.8900 l
s
n
0.2284 0.1500 m
0.2284 0.1600 l
s
n
0.2284 0.9000 m
0.2284 0.8900 l
s
n
0.2598 0.1500 m
0.2598 0.1600 l
s
n
0.2598 0.9000 m
0.2598 0.8900 l
s
n
0.2912 0.1500 m
0.2912 0.1600 l
s
n
0.2912 0.9000 m
0.2912 0.8900 l
s
n
0.3539 0.1500 m
0.3539 0.1600 l
s
n
0.3539 0.9000 m
0.3539 0.8900 l
s
n
0.3853 0.1500 m
0.3853 0.1600 l
s
n
0.3853 0.9000 m
0.3853 0.8900 l
s
n
0.4167 0.1500 m
0.4167 0.1600 l
s
n
0.4167 0.9000 m
0.4167 0.8900 l
s
n
0.4480 0.1500 m
0.4480 0.1600 l
s
n
0.4480 0.9000 m
0.4480 0.8900 l
s
n
0.5108 0.1500 m
0.5108 0.1600 l
s
n
0.5108 0.9000 m
0.5108 0.8900 l
s
n
0.5422 0.1500 m
0.5422 0.1600 l
s
n
0.5422 0.9000 m
0.5422 0.8900 l
s
n
0.5735 0.1500 m
0.5735 0.1600 l
s
n
0.5735 0.9000 m
0.5735 0.8900 l
s
n
0.6049 0.1500 m
0.6049 0.1600 l
s
n
0.6049 0.9000 m
0.6049 0.8900 l
s
n
0.6676 0.1500 m
0.6676 0.1600 l
s
n
0.6676 0.9000 m
0.6676 0.8900 l
s
n
0.6990 0.1500 m
0.6990 0.1600 l
s
n
0.6990 0.9000 m
0.6990 0.8900 l
s
n
0.7304 0.1500 m
0.7304 0.1600 l
s
n
0.7304 0.9000 m
0.7304 0.8900 l
s
n
0.7618 0.1500 m
0.7618 0.1600 l
s
n
0.7618 0.9000 m
0.7618 0.8900 l
s
n
0.8245 0.1500 m
0.8245 0.1600 l
s
n
0.8245 0.9000 m
0.8245 0.8900 l
s
n
0.8559 0.1500 m
0.8559 0.1600 l
s
n
0.8559 0.9000 m
0.8559 0.8900 l
s
n
0.8873 0.1500 m
0.8873 0.1600 l
s
n
0.8873 0.9000 m
0.8873 0.8900 l
s
n
0.9186 0.1500 m
0.9186 0.1600 l
s
n
0.9186 0.9000 m
0.9186 0.8900 l
s
n
0.1657 0.1500 m
0.1657 0.1700 l
s
n
0.1657 0.9000 m
0.1657 0.8800 l
s
n
0.3225 0.1500 m
0.3225 0.1700 l
s
n
0.3225 0.9000 m
0.3225 0.8800 l
s
n
0.4794 0.1500 m
0.4794 0.1700 l
s
n
0.4794 0.9000 m
0.4794 0.8800 l
s
n
0.6363 0.1500 m
0.6363 0.1700 l
s
n
0.6363 0.9000 m
0.6363 0.8800 l
s
n
0.7931 0.1500 m
0.7931 0.1700 l
s
n
0.7931 0.9000 m
0.7931 0.8800 l
s
n
0.9500 0.1500 m
0.9500 0.1700 l
s
n
0.9500 0.9000 m
0.9500 0.8800 l
s
/Helvetica findfont
dup length dict begin
 {1 index /FID ne {def} {pop pop} ifelse} forall
 /Encoding DefEncoding def
 currentdict
end
/Font4 exch definefont pop
/Font4 FFSF
0.1431 0.1200 m
GS
[0.0280 0.0000 0.0000 0.0280 0 0] CC
(100) show
GR
/Font4 FFSF
0.3000 0.1200 m
GS
[0.0280 0.0000 0.0000 0.0280 0 0] CC
(200) show
GR
/Font4 FFSF
0.4569 0.1200 m
GS
[0.0280 0.0000 0.0000 0.0280 0 0] CC
(300) show
GR
/Font4 FFSF
0.6137 0.1200 m
GS
[0.0280 0.0000 0.0000 0.0280 0 0] CC
(400) show
GR
/Font4 FFSF
0.7706 0.1200 m
GS
[0.0280 0.0000 0.0000 0.0280 0 0] CC
(500) show
GR
/Font4 FFSF
0.9275 0.1200 m
GS
[0.0280 0.0000 0.0000 0.0280 0 0] CC
(600) show
GR
/Font4 FFSF
0.4818 0.0845 m
GS
[0.0336 0.0000 0.0000 0.0336 0 0] CC
(M) show
GR
/Font4 FFSF
0.5096 0.0711 m
GS
[0.0238 0.0000 0.0000 0.0238 0 0] CC
(A) show
GR
/Font4 FFSF
0.5253 0.0845 m
GS
[0.0336 0.0000 0.0000 0.0336 0 0] CC
( [GeV]) show
GR
n
0.1500 0.2064 m
0.1600 0.2064 l
s
n
0.9500 0.2064 m
0.9400 0.2064 l
s
n
0.1500 0.2395 m
0.1600 0.2395 l
s
n
0.9500 0.2395 m
0.9400 0.2395 l
s
n
0.1500 0.2629 m
0.1600 0.2629 l
s
n
0.9500 0.2629 m
0.9400 0.2629 l
s
n
0.1500 0.2811 m
0.1600 0.2811 l
s
n
0.9500 0.2811 m
0.9400 0.2811 l
s
n
0.1500 0.2959 m
0.1600 0.2959 l
s
n
0.9500 0.2959 m
0.9400 0.2959 l
s
n
0.1500 0.3085 m
0.1600 0.3085 l
s
n
0.9500 0.3085 m
0.9400 0.3085 l
s
n
0.1500 0.3193 m
0.1600 0.3193 l
s
n
0.9500 0.3193 m
0.9400 0.3193 l
s
n
0.1500 0.3289 m
0.1600 0.3289 l
s
n
0.9500 0.3289 m
0.9400 0.3289 l
s
n
0.1500 0.3375 m
0.1600 0.3375 l
s
n
0.9500 0.3375 m
0.9400 0.3375 l
s
n
0.1500 0.3939 m
0.1600 0.3939 l
s
n
0.9500 0.3939 m
0.9400 0.3939 l
s
n
0.1500 0.4270 m
0.1600 0.4270 l
s
n
0.9500 0.4270 m
0.9400 0.4270 l
s
n
0.1500 0.4504 m
0.1600 0.4504 l
s
n
0.9500 0.4504 m
0.9400 0.4504 l
s
n
0.1500 0.4686 m
0.1600 0.4686 l
s
n
0.9500 0.4686 m
0.9400 0.4686 l
s
n
0.1500 0.4834 m
0.1600 0.4834 l
s
n
0.9500 0.4834 m
0.9400 0.4834 l
s
n
0.1500 0.4960 m
0.1600 0.4960 l
s
n
0.9500 0.4960 m
0.9400 0.4960 l
s
n
0.1500 0.5068 m
0.1600 0.5068 l
s
n
0.9500 0.5068 m
0.9400 0.5068 l
s
n
0.1500 0.5164 m
0.1600 0.5164 l
s
n
0.9500 0.5164 m
0.9400 0.5164 l
s
n
0.1500 0.5250 m
0.1600 0.5250 l
s
n
0.9500 0.5250 m
0.9400 0.5250 l
s
n
0.1500 0.5814 m
0.1600 0.5814 l
s
n
0.9500 0.5814 m
0.9400 0.5814 l
s
n
0.1500 0.6145 m
0.1600 0.6145 l
s
n
0.9500 0.6145 m
0.9400 0.6145 l
s
n
0.1500 0.6379 m
0.1600 0.6379 l
s
n
0.9500 0.6379 m
0.9400 0.6379 l
s
n
0.1500 0.6561 m
0.1600 0.6561 l
s
n
0.9500 0.6561 m
0.9400 0.6561 l
s
n
0.1500 0.6709 m
0.1600 0.6709 l
s
n
0.9500 0.6709 m
0.9400 0.6709 l
s
n
0.1500 0.6835 m
0.1600 0.6835 l
s
n
0.9500 0.6835 m
0.9400 0.6835 l
s
n
0.1500 0.6943 m
0.1600 0.6943 l
s
n
0.9500 0.6943 m
0.9400 0.6943 l
s
n
0.1500 0.7039 m
0.1600 0.7039 l
s
n
0.9500 0.7039 m
0.9400 0.7039 l
s
n
0.1500 0.7125 m
0.1600 0.7125 l
s
n
0.9500 0.7125 m
0.9400 0.7125 l
s
n
0.1500 0.7689 m
0.1600 0.7689 l
s
n
0.9500 0.7689 m
0.9400 0.7689 l
s
n
0.1500 0.8020 m
0.1600 0.8020 l
s
n
0.9500 0.8020 m
0.9400 0.8020 l
s
n
0.1500 0.8254 m
0.1600 0.8254 l
s
n
0.9500 0.8254 m
0.9400 0.8254 l
s
n
0.1500 0.8436 m
0.1600 0.8436 l
s
n
0.9500 0.8436 m
0.9400 0.8436 l
s
n
0.1500 0.8584 m
0.1600 0.8584 l
s
n
0.9500 0.8584 m
0.9400 0.8584 l
s
n
0.1500 0.8710 m
0.1600 0.8710 l
s
n
0.9500 0.8710 m
0.9400 0.8710 l
s
n
0.1500 0.8818 m
0.1600 0.8818 l
s
n
0.9500 0.8818 m
0.9400 0.8818 l
s
n
0.1500 0.8914 m
0.1600 0.8914 l
s
n
0.9500 0.8914 m
0.9400 0.8914 l
s
n
0.1500 0.9000 m
0.1600 0.9000 l
s
n
0.9500 0.9000 m
0.9400 0.9000 l
s
n
0.1500 0.1500 m
0.1700 0.1500 l
s
n
0.9500 0.1500 m
0.9300 0.1500 l
s
n
0.1500 0.3375 m
0.1700 0.3375 l
s
n
0.9500 0.3375 m
0.9300 0.3375 l
s
n
0.1500 0.5250 m
0.1700 0.5250 l
s
n
0.9500 0.5250 m
0.9300 0.5250 l
s
n
0.1500 0.7125 m
0.1700 0.7125 l
s
n
0.9500 0.7125 m
0.9300 0.7125 l
s
n
0.1500 0.9000 m
0.1700 0.9000 l
s
n
0.9500 0.9000 m
0.9300 0.9000 l
s
/Font4 FFSF
0.0922 0.1349 m
GS
[0.0280 0.0000 0.0000 0.0280 0 0] CC
(10) show
GR
/Font4 FFSF
0.1231 0.1517 m
GS
[0.0198 0.0000 0.0000 0.0198 0 0] CC
(-4) show
GR
/Font4 FFSF
0.0922 0.3224 m
GS
[0.0280 0.0000 0.0000 0.0280 0 0] CC
(10) show
GR
/Font4 FFSF
0.1231 0.3392 m
GS
[0.0198 0.0000 0.0000 0.0198 0 0] CC
(-3) show
GR
/Font4 FFSF
0.0922 0.5099 m
GS
[0.0280 0.0000 0.0000 0.0280 0 0] CC
(10) show
GR
/Font4 FFSF
0.1231 0.5267 m
GS
[0.0198 0.0000 0.0000 0.0198 0 0] CC
(-2) show
GR
/Font4 FFSF
0.0957 0.6974 m
GS
[0.0280 0.0000 0.0000 0.0280 0 0] CC
(10) show
GR
/Font4 FFSF
0.1267 0.7142 m
GS
[0.0198 0.0000 0.0000 0.0198 0 0] CC
(-1) show
GR
/Font4 FFSF
0.0988 0.8849 m
GS
[0.0280 0.0000 0.0000 0.0280 0 0] CC
(10) show
GR
/Font4 FFSF
0.1298 0.9017 m
GS
[0.0198 0.0000 0.0000 0.0198 0 0] CC
(0) show
GR
/Font4 FFSF
0.0751 0.4797 m
GS
[0.0000 0.0336 -0.0336 0.0000 0 0] CC
(BR\(H\)) show
GR
n
0.1500 0.1500 m
0.1500 0.9000 l
0.9500 0.9000 l
0.9500 0.1500 l
0.1500 0.1500 l
c
s
n
0.7000 0.5500 m
0.7000 0.3037 l
0.9319 0.3037 l
0.9319 0.5500 l
c
[/DeviceRGB] SCS
Color0 SC
fill
[/DeviceRGB] SCS
Color1 SC
n
0.7000 0.5500 m
0.7000 0.3037 l
0.9319 0.3037 l
0.9319 0.5500 l
0.7000 0.5500 l
c
s
/Font4 FFSF
0.7862 0.4935 m
GS
[0.0224 0.0000 0.0000 0.0224 0 0] CC
(BR\(H -> tt\)) show
GR
[/DeviceRGB] SCS
Color2 SC
[] 0 SD
0.0045 SLW
n
0.7122 0.4994 m
0.7722 0.4994 l
s
/Font4 FFSF
[/DeviceRGB] SCS
Color1 SC
0.7862 0.4524 m
GS
[0.0224 0.0000 0.0000 0.0224 0 0] CC
(BR\(H -> bb\)) show
GR
[/DeviceRGB] SCS
Color3 SC
n
0.7122 0.4582 m
0.7722 0.4582 l
s
/Font4 FFSF
[/DeviceRGB] SCS
Color1 SC
0.7862 0.4112 m
GS
[0.0224 0.0000 0.0000 0.0224 0 0] CC
(BR\(H -> ) show
GR
/Symbol findfont
/Font12 exch definefont pop
/Font12 FFSF
0.8741 0.4112 m
GS
[0.0224 0.0000 0.0000 0.0224 0 0] CC
(tt) show
GR
/Font4 FFSF
0.8937 0.4112 m
GS
[0.0224 0.0000 0.0000 0.0224 0 0] CC
(\)) show
GR
[/DeviceRGB] SCS
Color4 SC
n
0.7122 0.4171 m
0.7722 0.4171 l
s
/Font4 FFSF
[/DeviceRGB] SCS
Color1 SC
0.7862 0.3700 m
GS
[0.0224 0.0000 0.0000 0.0224 0 0] CC
(BR\(H -> ) show
GR
/Font12 FFSF
0.8741 0.3700 m
GS
[0.0224 0.0000 0.0000 0.0224 0 0] CC
(mm) show
GR
/Font4 FFSF
0.9000 0.3700 m
GS
[0.0224 0.0000 0.0000 0.0224 0 0] CC
(\)) show
GR
[/DeviceRGB] SCS
Color5 SC
n
0.7122 0.3757 m
0.7722 0.3757 l
s
/Font4 FFSF
[/DeviceRGB] SCS
Color1 SC
0.7862 0.3284 m
GS
[0.0224 0.0000 0.0000 0.0224 0 0] CC
(BR\(H -> WW\)) show
GR
[/DeviceRGB] SCS
Color6 SC
n
0.7122 0.3343 m
0.7722 0.3343 l
s
/Font4 FFSF
[/DeviceRGB] SCS
Color1 SC
0.9700 0.7000 m
GS
[0.0000 0.0168 -0.0168 0.0000 0 0] CC
(LHC Higgs XS WG 2013) show
GR
/Font4 FFSF
0.7150 0.5250 m
GS
[0.0224 0.0000 0.0000 0.0224 0 0] CC
(m) show
GR
/Font4 FFSF
0.7338 0.5160 m
GS
[0.0158 0.0000 0.0000 0.0158 0 0] CC
(h) show
GR
/Font4 FFSF
0.7425 0.5384 m
GS
[0.0158 0.0000 0.0000 0.0158 0 0] CC
(mod-) show
GR
/Font4 FFSF
0.7785 0.5250 m
GS
[0.0224 0.0000 0.0000 0.0224 0 0] CC
(, tan) show
GR
/Font12 FFSF
0.8221 0.5250 m
GS
[0.0224 0.0000 0.0000 0.0224 0 0] CC
(b) show
GR
/Font4 FFSF
0.8342 0.5250 m
GS
[0.0224 0.0000 0.0000 0.0224 0 0] CC
( = 50) show
GR
%%Trailer
%%BoundingBox: 30 42 597 562
%%DocumentNeededResources: font Helvetica
%%+ font Symbol
%%EOF
