%!PS-Adobe-2.0 EPSF-2.0
%%BoundingBox: 81 198 460 390
%%HiResBoundingBox: 81.500000 198.500000 460.000000 389.500000
%...................................
%%Creator: GPL Ghostscript 870 (pswrite)
%%CreationDate: 2013/02/14 17:56:06
%%DocumentData: Clean7Bit
%%LanguageLevel: 2
%%EndComments
% EPSF created by ps2eps 1.64
%%BeginProlog
save
countdictstack
mark
newpath
/showpage {} def
/setpagedevice {pop} def
%%EndProlog
%%Page 1 1
%%BeginProlog
% This copyright applies to everything between here and the %%EndProlog:
% Copyright (C) 2009 Artifex Software, Inc.  All rights reserved.
%%BeginResource: procset GS_pswrite_2_0_1001 1.001 0
/GS_pswrite_2_0_1001 80 dict dup begin
/PageSize 2 array def/setpagesize{ PageSize aload pop 3 index eq exch
4 index eq and{ pop pop pop}{ PageSize dup  1
5 -1 roll put 0 4 -1 roll put dup null eq {false} {dup where} ifelse{ exch get exec}
{ pop/setpagedevice where
{ pop 1 dict dup /PageSize PageSize put setpagedevice}
{ /setpage where{ pop PageSize aload pop pageparams 3 {exch pop} repeat
setpage}if}ifelse}ifelse}ifelse} bind def
/!{bind def}bind def/#{load def}!/N/counttomark #
/rG{3{3 -1 roll 255 div}repeat setrgbcolor}!/G{255 div setgray}!/K{0 G}!
/r6{dup 3 -1 roll rG}!/r5{dup 3 1 roll rG}!/r3{dup rG}!
/w/setlinewidth #/J/setlinecap #
/j/setlinejoin #/M/setmiterlimit #/d/setdash #/i/setflat #
/m/moveto #/l/lineto #/c/rcurveto #
/p{N 2 idiv{N -2 roll rlineto}repeat}!
/P{N 0 gt{N -2 roll moveto p}if}!
/h{p closepath}!/H{P closepath}!
/lx{0 rlineto}!/ly{0 exch rlineto}!/v{0 0 6 2 roll c}!/y{2 copy c}!
/re{4 -2 roll m exch dup lx exch ly neg lx h}!
/^{3 index neg 3 index neg}!
/f{P fill}!/f*{P eofill}!/s{H stroke}!/S{P stroke}!
/q/gsave #/Q/grestore #/rf{re fill}!
/Y{P clip newpath}!/Y*{P eoclip newpath}!/rY{re Y}!
/|={pop exch 4 1 roll 1 array astore cvx 3 array astore cvx exch 1 index def exec}!
/|{exch string readstring |=}!
/+{dup type/nametype eq{2 index 7 add -3 bitshift 2 index mul}if}!
/@/currentfile #/${+ @ |}!
/B{{2 copy string{readstring pop}aload pop 4 array astore cvx
3 1 roll}repeat pop pop true}!
/Ix{[1 0 0 1 11 -2 roll exch neg exch neg]exch}!
/,{true exch Ix imagemask}!/If{false exch Ix imagemask}!/I{exch Ix image}!
/Ic{exch Ix false 3 colorimage}!
/F{/Columns counttomark 3 add -2 roll/Rows exch/K -1/BlackIs1 true>>
/CCITTFaxDecode filter}!/FX{<</EndOfBlock false F}!
/X{/ASCII85Decode filter}!/@X{@ X}!/&2{2 index 2 index}!
/@F{@ &2<<F}!/@C{@X &2 FX}!
/$X{+ @X |}!/&4{4 index 4 index}!/$F{+ @ &4<<F |}!/$C{+ @X &4 FX |}!
/IC{3 1 roll 10 dict begin 1{/ImageType/Interpolate/Decode/DataSource
/ImageMatrix/BitsPerComponent/Height/Width}{exch def}forall
currentdict end image}!
/~{@ read {pop} if}!
end def
%%EndResource
/pagesave null def
%%EndProlog
%%Page: 1 1
%%PageBoundingBox: 0 0 612 792
%%BeginPageSetup
GS_pswrite_2_0_1001 begin
612 792 /letter setpagesize
/pagesave save store 197 dict begin
0.1 0.1 scale
%%EndPageSetup
gsave mark
Q q
0 0 6120 7920 re
Y
4.8 w
1 J
1 j
K
2347.2 5863.2 -12 -12 -9.6 -14.4 -9.6 -21.6 -4.8 -26.4 0 -19.2 4.8 -26.4 9.6 -21.6 
9.6 -14.4 12 -9.6 P
2335.2 5851.2 -9.6 -19.2 -4.8 -16.8 -4.8 -26.4 0 -19.2 4.8 -26.4 4.8 -14.4 9.6 -21.6 P
2548.8 5863.2 0 -165.6 P
2589.6 5805.6 31.2 -72 P
2596.8 5805.6 24 -62.4 P
2652 5805.6 -31.2 -72 -9.6 -21.6 -9.6 -9.6 -12 -4.8 -4.8 0 -4.8 4.8 4.8 4.8 
4.8 -4.8 P
2580 5805.6 31.2 0 P
2632.8 5805.6 31.2 0 P
2700 5841.6 -4.8 -4.8 4.8 -4.8 ^ ^ P
2704.8 5805.6 0 -93.6 -4.8 -9.6 -9.6 -4.8 -12 0 -4.8 4.8 0 4.8 4.8 4.8 
4.8 -4.8 -4.8 -4.8 P
2700 5805.6 0 -93.6 -4.8 -9.6 -4.8 -4.8 P
2683.2 5805.6 21.6 0 P
2757.6 5820 9.6 7.2 16.8 14.4 0 -108 P
2776.8 5836.8 0 -103.2 P
2757.6 5733.6 45.6 0 P
2851.2 5779.2 93.6 0 P
2985.6 5805.6 31.2 -72 P
2990.4 5805.6 26.4 -62.4 P
3048 5805.6 -31.2 -72 -9.6 -21.6 -12 -9.6 -9.6 -4.8 -4.8 0 -4.8 4.8 4.8 4.8 
4.8 -4.8 P
2976 5805.6 31.2 0 P
3026.4 5805.6 31.2 0 P
3096 5841.6 -7.2 -4.8 7.2 -4.8 4.8 4.8 -4.8 4.8 P
3100.8 5805.6 0 -93.6 -4.8 -9.6 -12 -4.8 -9.6 0 -4.8 4.8 0 4.8 4.8 4.8 
4.8 -4.8 -4.8 -4.8 P
3096 5805.6 0 -93.6 -7.2 -9.6 -4.8 -4.8 P
3079.2 5805.6 21.6 0 P
3141.6 5820 4.8 -4.8 -4.8 -4.8 -4.8 4.8 0 4.8 4.8 12 4.8 4.8 16.8 4.8 
19.2 0 16.8 -4.8 4.8 -4.8 4.8 -12 0 -9.6 -4.8 -9.6 -14.4 -12 -26.4 -9.6 
-12 -4.8 -9.6 -9.6 -4.8 -16.8 0 -14.4 P
3182.4 5841.6 12 -4.8 4.8 -4.8 4.8 -12 0 -9.6 -4.8 -9.6 -16.8 -12 -19.2 -9.6 S
3136.8 5743.2 4.8 4.8 9.6 0 26.4 -9.6 16.8 0 9.6 4.8 4.8 4.8 P
3151.2 5748 26.4 -14.4 21.6 0 4.8 4.8 4.8 9.6 0 12 P
3244.8 5863.2 0 -165.6 P
3698.4 5805.6 31.2 -72 P
3703.2 5805.6 26.4 -62.4 P
3760.8 5805.6 -31.2 -72 P
3686.4 5805.6 31.2 0 P
3739.2 5805.6 31.2 0 P
3801.6 5841.6 0 -108 P
3806.4 5841.6 0 -108 P
3806.4 5788.8 12 12 9.6 4.8 9.6 0 16.8 -4.8 9.6 -12 4.8 -14.4 0 -9.6 
-4.8 -16.8 -9.6 -9.6 -16.8 -4.8 -9.6 0 -9.6 4.8 -12 9.6 P
3837.6 5805.6 12 -4.8 9.6 -12 4.8 -14.4 0 -9.6 -4.8 -16.8 -9.6 -9.6 -12 -4.8 P
3787.2 5841.6 19.2 0 P
3936 5836.8 -4.8 -4.8 4.8 -4.8 7.2 4.8 0 4.8 -7.2 4.8 -9.6 0 -9.6 -4.8 
-4.8 -9.6 0 -93.6 P
3926.4 5841.6 -4.8 -4.8 -4.8 -9.6 0 -93.6 P
3895.2 5805.6 40.8 0 P
3895.2 5733.6 36 0 P
4029.6 5788.8 -4.8 -4.8 4.8 -4.8 7.2 4.8 0 4.8 -12 12 -9.6 4.8 -16.8 0 
-14.4 -4.8 -9.6 -12 -7.2 -14.4 0 -9.6 7.2 -16.8 9.6 -9.6 14.4 -4.8 12 0 
14.4 4.8 12 9.6 P
3998.4 5805.6 -9.6 -4.8 -9.6 -12 -4.8 -14.4 0 -9.6 4.8 -16.8 9.6 -9.6 9.6 -4.8 P
4077.6 5805.6 0 -57.6 4.8 -9.6 16.8 -4.8 9.6 0 14.4 4.8 12 9.6 P
4082.4 5805.6 0 -57.6 4.8 -9.6 12 -4.8 P
4135.2 5805.6 0 -72 P
4140 5805.6 0 -72 P
4060.8 5805.6 21.6 0 P
4118.4 5805.6 21.6 0 P
4135.2 5733.6 19.2 0 P
4192.8 5841.6 0 -88.8 4.8 -14.4 9.6 -4.8 9.6 0 12 4.8 4.8 9.6 P
4197.6 5841.6 0 -88.8 4.8 -14.4 4.8 -4.8 S
4176 5805.6 40.8 0 P
4310.4 5796 4.8 9.6 0 -21.6 -4.8 12 -4.8 4.8 -9.6 4.8 -21.6 0 -9.6 -4.8 
-4.8 -4.8 0 -12 4.8 -4.8 9.6 -4.8 26.4 -9.6 9.6 -4.8 4.8 -7.2 P
4260 5788.8 4.8 -4.8 9.6 -4.8 26.4 -9.6 9.6 -4.8 4.8 -4.8 0 -16.8 -4.8 -4.8 
-9.6 -4.8 -21.6 0 -9.6 4.8 -4.8 4.8 -4.8 9.6 0 -19.2 4.8 9.6 P
1190.4 3544.8 4154.4 0 0 2076 ^ H
1190.4 3544.8 0 0 P
2853.6 3544.8 0 1819.2 165.6 0 0 84 165.6 0 0 36 165.6 0 0 26.4 
165.6 0 0 -19.2 165.6 0 0 -60 168 0 0 -76.8 165.6 0 0 -88.8 
165.6 0 0 -175.2 165.6 0 0 -160.8 168 0 0 -220.8 165.6 0 0 -235.2 
165.6 0 0 -552 165.6 0 0 -376.8 P
5344.8 3544.8 0 0 P
1190.4 3544.8 0 124.8 P
1358.4 3585.6 0 -40.8 P
1524 3544.8 0 40.8 P
1689.6 3585.6 0 -40.8 P
1855.2 3544.8 0 40.8 P
2020.8 3669.6 0 -124.8 P
2188.8 3544.8 0 40.8 P
2354.4 3585.6 0 -40.8 P
2520 3544.8 0 40.8 P
2685.6 3585.6 0 -40.8 P
2853.6 3544.8 0 124.8 P
3019.2 3585.6 0 -40.8 P
3184.8 3544.8 0 40.8 P
3350.4 3585.6 0 -40.8 P
3516 3544.8 0 40.8 P
3681.6 3669.6 0 -124.8 P
3849.6 3544.8 0 40.8 P
4015.2 3585.6 0 -40.8 P
4180.8 3544.8 0 40.8 P
4346.4 3585.6 0 -40.8 P
4514.4 3544.8 0 124.8 P
4680 3585.6 0 -40.8 P
4845.6 3544.8 0 40.8 P
5011.2 3585.6 0 -40.8 P
5176.8 3544.8 0 40.8 P
5344.8 3669.6 0 -124.8 P
1190.4 5496 0 124.8 P
1358.4 5620.8 0 -40.8 P
1524 5580 0 40.8 P
1689.6 5620.8 0 -40.8 S
1855.2 5580 0 40.8 P
2020.8 5620.8 0 -124.8 P
2188.8 5580 0 40.8 P
2354.4 5620.8 0 -40.8 P
2520 5580 0 40.8 P
2685.6 5620.8 0 -40.8 P
2853.6 5496 0 124.8 P
3019.2 5620.8 0 -40.8 P
3184.8 5580 0 40.8 P
3350.4 5620.8 0 -40.8 P
3516 5580 0 40.8 P
3681.6 5620.8 0 -124.8 P
3849.6 5580 0 40.8 P
4015.2 5620.8 0 -40.8 P
4180.8 5580 0 40.8 P
4346.4 5620.8 0 -40.8 P
4514.4 5496 0 124.8 P
4680 5620.8 0 -40.8 P
4845.6 5580 0 40.8 P
5011.2 5620.8 0 -40.8 P
5176.8 5580 0 40.8 P
5344.8 5620.8 0 -124.8 P
1190.4 3544.8 124.8 0 P
1233.6 3700.8 -43.2 0 P
1190.4 3792 43.2 0 P
1233.6 3856.8 -43.2 0 P
1190.4 3907.2 43.2 0 P
1233.6 3948 -43.2 0 P
1190.4 3984 43.2 0 P
1233.6 4012.8 -43.2 0 P
1190.4 4039.2 43.2 0 P
1315.2 4063.2 -124.8 0 P
1190.4 4219.2 43.2 0 P
1233.6 4310.4 -43.2 0 P
1190.4 4375.2 43.2 0 P
1233.6 4425.6 -43.2 0 P
1190.4 4468.8 43.2 0 P
1233.6 4502.4 -43.2 0 P
1190.4 4533.6 43.2 0 P
1233.6 4560 -43.2 0 P
1190.4 4581.6 124.8 0 P
1233.6 4740 -43.2 0 P
1190.4 4831.2 43.2 0 P
1233.6 4896 -43.2 0 P
1190.4 4946.4 43.2 0 P
1233.6 4987.2 -43.2 0 P
1190.4 5020.8 43.2 0 P
1233.6 5052 -43.2 0 P
1190.4 5078.4 43.2 0 P
1315.2 5102.4 -124.8 0 P
1190.4 5258.4 43.2 0 P
1233.6 5349.6 -43.2 0 P
1190.4 5414.4 43.2 0 P
1233.6 5464.8 -43.2 0 P
1190.4 5505.6 43.2 0 P
1233.6 5541.6 -43.2 0 P
1190.4 5570.4 43.2 0 P
1233.6 5596.8 -43.2 0 P
1190.4 5620.8 124.8 0 P
818.4 3561.6 7.2 4.8 9.6 9.6 0 -72 P
832.8 3573.6 0 -69.6 P
818.4 3504 31.2 0 P
897.6 3576 -9.6 -2.4 -7.2 -12 -4.8 -16.8 0 -9.6 4.8 -19.2 7.2 -9.6 9.6 -2.4 
7.2 0 9.6 2.4 7.2 9.6 4.8 19.2 0 9.6 -4.8 16.8 -7.2 12 -9.6 2.4 
-7.2 0 S
897.6 3576 -7.2 -2.4 -2.4 -4.8 -4.8 -7.2 -2.4 -16.8 0 -9.6 2.4 -19.2 4.8 -4.8 
2.4 -4.8 7.2 -2.4 P
904.8 3504 7.2 2.4 2.4 4.8 4.8 4.8 2.4 19.2 0 9.6 -2.4 16.8 -4.8 7.2 
-2.4 4.8 -7.2 2.4 P
950.4 3576 62.4 0 P
1044 3616.8 -7.2 -33.6 7.2 7.2 9.6 2.4 9.6 0 12 -2.4 7.2 -7.2 2.4 -9.6 
0 -7.2 -2.4 -12 -7.2 -7.2 -12 -2.4 -9.6 0 -9.6 2.4 -4.8 4.8 -2.4 7.2 
0 2.4 2.4 4.8 4.8 -4.8 -4.8 -2.4 P
1063.2 3592.8 7.2 -2.4 7.2 -7.2 4.8 -9.6 0 -7.2 -4.8 -12 -7.2 -7.2 -7.2 -2.4 P
1044 3616.8 33.6 0 P
1044 3614.4 16.8 0 16.8 2.4 P
818.4 4080 7.2 4.8 9.6 9.6 0 -72 P
832.8 4092 0 -69.6 P
818.4 4022.4 31.2 0 P
897.6 4094.4 -9.6 -2.4 -7.2 -12 -4.8 -16.8 0 -9.6 4.8 -16.8 7.2 -12 9.6 -2.4 
7.2 0 9.6 2.4 7.2 12 4.8 16.8 0 9.6 -4.8 16.8 -7.2 12 -9.6 2.4 
-7.2 0 -7.2 -2.4 -2.4 -4.8 -4.8 -7.2 -2.4 -16.8 0 -9.6 2.4 -16.8 4.8 -7.2 
2.4 -4.8 7.2 -2.4 P
904.8 4022.4 7.2 2.4 2.4 4.8 4.8 7.2 2.4 16.8 0 9.6 -2.4 16.8 -4.8 7.2 
-2.4 4.8 -7.2 2.4 P
950.4 4094.4 62.4 0 P
1068 4130.4 0 -67.2 P
1070.4 4137.6 0 -74.4 P
1070.4 4137.6 -38.4 -52.8 55.2 0 P
1056 4063.2 26.4 0 P
818.4 4600.8 7.2 2.4 9.6 9.6 0 -72 P
832.8 4610.4 0 -69.6 P
818.4 4540.8 31.2 0 P
897.6 4612.8 -9.6 -2.4 -7.2 -9.6 -4.8 -19.2 0 -9.6 4.8 -16.8 7.2 -9.6 9.6 -4.8 
7.2 0 9.6 4.8 7.2 9.6 4.8 16.8 0 9.6 -4.8 19.2 -7.2 9.6 -9.6 2.4 
-7.2 0 S
897.6 4612.8 -7.2 -2.4 -2.4 -2.4 -4.8 -7.2 -2.4 -16.8 0 -12 2.4 -16.8 4.8 -7.2 
2.4 -2.4 7.2 -4.8 P
904.8 4540.8 7.2 4.8 2.4 2.4 4.8 7.2 2.4 16.8 0 12 -2.4 16.8 -4.8 7.2 
-2.4 2.4 -7.2 2.4 P
950.4 4612.8 62.4 0 P
1039.2 4641.6 4.8 -2.4 -4.8 -4.8 -2.4 4.8 0 2.4 2.4 7.2 14.4 7.2 14.4 0 
9.6 -4.8 4.8 -7.2 0 -9.6 -4.8 -7.2 -9.6 -2.4 -12 0 P
1068 4656 7.2 -4.8 2.4 -7.2 0 -9.6 -2.4 -7.2 -7.2 -2.4 7.2 -4.8 7.2 -7.2 
2.4 -4.8 0 -12 -2.4 -7.2 -4.8 -2.4 -9.6 -2.4 -14.4 0 -9.6 2.4 -4.8 2.4 
-2.4 7.2 0 4.8 2.4 2.4 4.8 -2.4 -4.8 -4.8 P
1077.6 4617.6 4.8 -9.6 0 -12 -4.8 -7.2 -2.4 -2.4 -7.2 -2.4 P
818.4 5119.2 7.2 2.4 9.6 12 0 -74.4 P
832.8 5128.8 0 -69.6 P
818.4 5059.2 31.2 0 P
897.6 5133.6 -9.6 -4.8 -7.2 -9.6 -4.8 -16.8 0 -12 4.8 -16.8 7.2 -9.6 9.6 -4.8 
7.2 0 9.6 4.8 7.2 9.6 4.8 16.8 0 12 -4.8 16.8 -7.2 9.6 -9.6 4.8 
-7.2 0 -7.2 -4.8 -2.4 -2.4 -4.8 -7.2 -2.4 -16.8 0 -12 2.4 -16.8 4.8 -7.2 
2.4 -2.4 7.2 -4.8 P
904.8 5059.2 7.2 4.8 2.4 2.4 4.8 7.2 2.4 16.8 0 12 -2.4 16.8 -4.8 7.2 
-2.4 2.4 -7.2 4.8 P
950.4 5133.6 62.4 0 P
1039.2 5160 4.8 -2.4 -4.8 -4.8 -2.4 4.8 0 2.4 2.4 7.2 4.8 4.8 9.6 2.4 
14.4 0 9.6 -2.4 4.8 -4.8 2.4 -7.2 0 -7.2 -2.4 -4.8 -12 -7.2 -16.8 -7.2 
-7.2 -4.8 -7.2 -7.2 -2.4 -9.6 0 -9.6 S
1068 5174.4 7.2 -2.4 2.4 -4.8 4.8 -7.2 0 -7.2 -4.8 -4.8 -9.6 -7.2 -14.4 -7.2 P
1036.8 5109.6 2.4 2.4 7.2 0 16.8 -7.2 12 0 7.2 4.8 2.4 2.4 P
1046.4 5112 16.8 -9.6 14.4 0 4.8 2.4 2.4 7.2 0 7.2 S
818.4 5637.6 7.2 4.8 9.6 9.6 0 -72 P
832.8 5649.6 0 -69.6 P
818.4 5580 31.2 0 P
897.6 5652 -9.6 -2.4 -7.2 -12 -4.8 -16.8 0 -9.6 4.8 -19.2 7.2 -9.6 9.6 -2.4 
7.2 0 9.6 2.4 7.2 9.6 4.8 19.2 0 9.6 -4.8 16.8 -7.2 12 -9.6 2.4 
-7.2 0 -7.2 -2.4 -2.4 -4.8 -4.8 -7.2 -2.4 -16.8 0 -9.6 2.4 -19.2 4.8 -4.8 
2.4 -4.8 7.2 -2.4 P
904.8 5580 7.2 2.4 2.4 4.8 4.8 4.8 2.4 19.2 0 9.6 -2.4 16.8 -4.8 7.2 
-2.4 4.8 -7.2 2.4 P
950.4 5652 62.4 0 P
1046.4 5680.8 7.2 2.4 9.6 9.6 0 -72 P
1060.8 5690.4 0 -69.6 P
1046.4 5620.8 31.2 0 P
5220 3544.8 124.8 0 P
5344.8 3700.8 -43.2 0 P
5301.6 3792 43.2 0 P
5344.8 3856.8 -43.2 0 P
5301.6 3907.2 43.2 0 P
5344.8 3948 -43.2 0 P
5301.6 3984 43.2 0 P
5344.8 4012.8 -43.2 0 P
5301.6 4039.2 43.2 0 P
5344.8 4063.2 -124.8 0 P
5301.6 4219.2 43.2 0 P
5344.8 4310.4 -43.2 0 P
5301.6 4375.2 43.2 0 P
5344.8 4425.6 -43.2 0 P
5301.6 4468.8 43.2 0 P
5344.8 4502.4 -43.2 0 P
5301.6 4533.6 43.2 0 P
5344.8 4560 -43.2 0 P
5220 4581.6 124.8 0 P
5344.8 4740 -43.2 0 P
5301.6 4831.2 43.2 0 P
5344.8 4896 -43.2 0 P
5301.6 4946.4 43.2 0 P
5344.8 4987.2 -43.2 0 P
5301.6 5020.8 43.2 0 P
5344.8 5052 -43.2 0 P
5301.6 5078.4 43.2 0 P
5344.8 5102.4 -124.8 0 P
5301.6 5258.4 43.2 0 P
5344.8 5349.6 -43.2 0 P
5301.6 5414.4 43.2 0 P
5344.8 5464.8 -43.2 0 P
5301.6 5505.6 43.2 0 P
5344.8 5541.6 -43.2 0 P
5301.6 5570.4 43.2 0 P
5344.8 5596.8 -43.2 0 P
5220 5620.8 124.8 0 S
255 0 r3
1190.4 3544.8 0 0 P
2853.6 3544.8 0 1790.4 165.6 0 0 81.6 165.6 0 0 50.4 165.6 0 0 16.8 
165.6 0 0 -4.8 165.6 0 0 -52.8 168 0 0 -86.4 165.6 0 0 -103.2 
165.6 0 0 -146.4 165.6 0 0 -156 168 0 0 -268.8 165.6 0 0 -271.2 
165.6 0 0 -849.6 P
5344.8 3544.8 0 0 S
K
2815.2 2095.2 0 -110.4 P
2841.6 2056.8 21.6 -48 P
2846.4 2056.8 16.8 -40.8 P
2884.8 2056.8 -21.6 -48 -7.2 -14.4 -7.2 -7.2 -7.2 -2.4 -2.4 0 -4.8 2.4 4.8 4.8 
2.4 -4.8 P
2834.4 2056.8 21.6 0 P
2870.4 2056.8 19.2 0 P
2913.6 2080.8 -2.4 -2.4 2.4 -4.8 4.8 4.8 -4.8 2.4 P
2918.4 2056.8 0 -62.4 -4.8 -7.2 -4.8 -2.4 -7.2 0 -4.8 2.4 0 4.8 4.8 2.4 
2.4 -2.4 -2.4 -4.8 P
2913.6 2056.8 0 -62.4 -2.4 -7.2 -2.4 -2.4 P
2904 2056.8 14.4 0 P
2952 2066.4 7.2 4.8 12 9.6 0 -72 P
2966.4 2078.4 0 -69.6 P
2952 2008.8 31.2 0 P
3014.4 2040 62.4 0 P
3105.6 2056.8 21.6 -48 P
3108 2056.8 19.2 -40.8 P
3146.4 2056.8 -19.2 -48 -7.2 -14.4 -7.2 -7.2 -7.2 -2.4 -4.8 0 -2.4 2.4 2.4 4.8 
4.8 -4.8 P
3098.4 2056.8 21.6 0 P
3132 2056.8 21.6 0 P
3177.6 2080.8 -2.4 -2.4 2.4 -4.8 4.8 4.8 -4.8 2.4 P
3182.4 2056.8 0 -62.4 -4.8 -7.2 -7.2 -2.4 -7.2 0 -2.4 2.4 0 4.8 2.4 2.4 
4.8 -2.4 -4.8 -4.8 P
3177.6 2056.8 0 -62.4 -2.4 -7.2 -4.8 -2.4 P
3168 2056.8 14.4 0 P
3208.8 2066.4 4.8 -2.4 -4.8 -2.4 -2.4 2.4 0 2.4 2.4 7.2 4.8 4.8 9.6 2.4 
14.4 0 9.6 -2.4 4.8 -4.8 2.4 -7.2 0 -4.8 -2.4 -7.2 -12 -7.2 -16.8 -7.2 
-14.4 -9.6 -2.4 -12 0 -9.6 P
3237.6 2080.8 7.2 -2.4 2.4 -4.8 4.8 -7.2 0 -4.8 -4.8 -7.2 -9.6 -7.2 -14.4 -7.2 P
3206.4 2016 2.4 2.4 7.2 0 16.8 -7.2 12 0 7.2 4.8 2.4 2.4 P
3216 2018.4 16.8 -9.6 14.4 0 4.8 2.4 2.4 7.2 0 7.2 S
3278.4 2095.2 0 -110.4 P
1190.4 2299.2 4154.4 0 0 1245.6 ^ H
1190.4 2299.2 0 21.6 P
1190.4 2340 0 21.6 P
1190.4 2383.2 0 19.2 P
1190.4 2424 0 21.6 P
1190.4 2464.8 0 21.6 P
1190.4 2505.6 0 21.6 P
1190.4 2548.8 0 19.2 P
1190.4 2589.6 0 21.6 P
1190.4 2630.4 0 21.6 P
1190.4 2673.6 0 19.2 P
1190.4 2714.4 0 21.6 P
1190.4 2755.2 0 21.6 P
1190.4 2798.4 0 19.2 P
1190.4 2839.2 0 21.6 P
1190.4 2880 0 21.6 P
1190.4 2920.8 21.6 0 P
1233.6 2920.8 19.2 0 P
1274.4 2920.8 21.6 0 P
1315.2 2920.8 21.6 0 P
1358.4 2920.8 19.2 0 P
1399.2 2920.8 21.6 0 P
1440 2920.8 21.6 0 P
1483.2 2920.8 19.2 0 P
1524 2920.8 21.6 0 P
1564.8 2920.8 21.6 0 P
1608 2920.8 19.2 0 P
1648.8 2920.8 19.2 0 P
1689.6 2920.8 21.6 0 P
1730.4 2920.8 21.6 0 P
1773.6 2920.8 19.2 0 P
1814.4 2920.8 21.6 0 P
1855.2 2920.8 21.6 0 P
1898.4 2920.8 19.2 0 P
1939.2 2920.8 21.6 0 P
1980 2920.8 21.6 0 P
2023.2 2920.8 19.2 0 P
2064 2920.8 19.2 0 P
2104.8 2920.8 21.6 0 P
2145.6 2920.8 21.6 0 P
2188.8 2920.8 19.2 0 P
2229.6 2920.8 21.6 0 P
2270.4 2920.8 21.6 0 P
2313.6 2920.8 19.2 0 P
2354.4 2920.8 21.6 0 P
2395.2 2920.8 21.6 0 P
2438.4 2920.8 19.2 0 P
2479.2 2920.8 19.2 0 P
2520 2920.8 21.6 0 P
2560.8 2920.8 21.6 0 P
2604 2920.8 19.2 0 P
2644.8 2920.8 21.6 0 P
2685.6 2920.8 21.6 0 P
2728.8 2920.8 19.2 0 P
2769.6 2920.8 21.6 0 P
2810.4 2920.8 21.6 0 P
2853.6 2920.8 0 -19.2 P
2858.4 2887.2 21.6 0 P
2901.6 2887.2 19.2 0 P
2942.4 2887.2 21.6 0 P
2983.2 2887.2 21.6 0 P
3019.2 2894.4 0 9.6 9.6 0 S
3050.4 2904 19.2 0 P
3091.2 2904 21.6 0 P
3132 2904 21.6 0 P
3175.2 2904 9.6 0 0 12 P
3189.6 2930.4 19.2 0 P
3230.4 2930.4 21.6 0 P
3271.2 2930.4 21.6 0 P
3314.4 2930.4 19.2 0 P
3350.4 2928 0 -9.6 12 0 P
3384 2918.4 21.6 0 P
3424.8 2918.4 21.6 0 P
3468 2918.4 19.2 0 P
3508.8 2918.4 7.2 0 0 -12 P
3537.6 2906.4 19.2 0 P
3578.4 2906.4 21.6 0 P
3619.2 2906.4 21.6 0 P
3662.4 2906.4 19.2 0 P
3681.6 2925.6 0 21.6 P
3691.2 2959.2 19.2 0 P
3732 2959.2 21.6 0 P
3772.8 2959.2 21.6 0 P
3816 2959.2 19.2 0 P
3852 2954.4 21.6 0 P
3892.8 2954.4 21.6 0 P
3936 2954.4 19.2 0 P
3976.8 2954.4 21.6 0 P
4015.2 2952 0 -21.6 P
4015.2 2911.2 0 -21.6 P
4024.8 2877.6 19.2 0 P
4065.6 2877.6 19.2 0 P
4106.4 2877.6 21.6 0 P
4147.2 2877.6 21.6 0 P
4180.8 2884.8 0 21.6 P
4183.2 2925.6 19.2 0 P
4224 2925.6 21.6 0 P
4264.8 2925.6 21.6 0 P
4305.6 2925.6 21.6 0 P
4346.4 2925.6 0 -21.6 P
4346.4 2882.4 0 -19.2 P
4346.4 2841.6 0 -19.2 P
4346.4 2800.8 0 -9.6 12 0 P
4380 2791.2 19.2 0 P
4420.8 2791.2 21.6 0 P
4461.6 2791.2 21.6 0 P
4502.4 2791.2 12 0 0 -12 P
4514.4 2760 0 -21.6 P
4514.4 2716.8 0 -19.2 P
4516.8 2678.4 19.2 0 P
4557.6 2678.4 21.6 0 P
4598.4 2678.4 21.6 0 P
4641.6 2678.4 19.2 0 P
4680 2676 0 -21.6 P
4680 2635.2 0 -21.6 P
4680 2592 0 -19.2 P
4680 2551.2 0 -21.6 P
4680 2510.4 0 -21.6 P
4680 2467.2 0 -19.2 P
4680 2426.4 0 -19.2 P
4680 2385.6 0 -21.6 P
4680 2344.8 0 -21.6 P
4696.8 2318.4 21.6 0 P
4737.6 2318.4 21.6 0 S
4778.4 2318.4 21.6 0 P
4821.6 2318.4 19.2 0 P
4845.6 2337.6 0 19.2 P
4845.6 2378.4 0 21.6 P
4845.6 2419.2 0 21.6 P
4845.6 2462.4 0 19.2 P
4845.6 2503.2 0 19.2 P
4845.6 2544 0 21.6 P
4845.6 2584.8 0 21.6 P
4845.6 2628 0 16.8 2.4 0 P
4869.6 2644.8 19.2 0 P
4910.4 2644.8 21.6 0 P
4951.2 2644.8 21.6 0 P
4994.4 2644.8 16.8 0 0 2.4 P
5011.2 2668.8 0 21.6 P
5011.2 2709.6 0 21.6 P
5011.2 2752.8 0 19.2 P
5011.2 2793.6 0 21.6 P
5011.2 2834.4 0 21.6 P
5011.2 2877.6 0 19.2 P
5011.2 2918.4 0 2.4 16.8 0 P
5049.6 2920.8 19.2 0 P
5090.4 2920.8 21.6 0 P
5131.2 2920.8 21.6 0 P
5174.4 2920.8 19.2 0 P
5215.2 2920.8 21.6 0 P
5256 2920.8 21.6 0 P
5299.2 2920.8 19.2 0 P
5340 2920.8 4.8 0 P
5344.8 2299.2 0 0 P
1190.4 2299.2 0 124.8 P
1358.4 2340 0 -40.8 P
1524 2299.2 0 40.8 P
1689.6 2340 0 -40.8 P
1855.2 2299.2 0 40.8 P
2020.8 2424 0 -124.8 P
2188.8 2299.2 0 40.8 P
2354.4 2340 0 -40.8 P
2520 2299.2 0 40.8 P
2685.6 2340 0 -40.8 P
2853.6 2299.2 0 124.8 P
3019.2 2340 0 -40.8 P
3184.8 2299.2 0 40.8 S
3350.4 2340 0 -40.8 P
3516 2299.2 0 40.8 P
3681.6 2424 0 -124.8 P
3849.6 2299.2 0 40.8 P
4015.2 2340 0 -40.8 P
4180.8 2299.2 0 40.8 P
4346.4 2340 0 -40.8 P
4514.4 2299.2 0 124.8 P
4680 2340 0 -40.8 P
4845.6 2299.2 0 40.8 P
5011.2 2340 0 -40.8 P
5176.8 2299.2 0 40.8 P
5344.8 2424 0 -124.8 P
1188 2229.6 -9.6 -2.4 -7.2 -9.6 -4.8 -19.2 0 -9.6 4.8 -16.8 7.2 -9.6 9.6 -4.8 
7.2 0 9.6 4.8 7.2 9.6 4.8 16.8 0 9.6 -4.8 19.2 -7.2 9.6 -9.6 2.4 
-7.2 0 -7.2 -2.4 -2.4 -2.4 -4.8 -7.2 -2.4 -19.2 0 -9.6 2.4 -16.8 4.8 -7.2 
2.4 -2.4 7.2 -4.8 P
1195.2 2157.6 7.2 4.8 2.4 2.4 4.8 7.2 2.4 16.8 0 9.6 -2.4 19.2 -4.8 7.2 
-2.4 2.4 -7.2 2.4 P
2001.6 2217.6 2.4 -4.8 -2.4 -2.4 -4.8 2.4 0 4.8 4.8 7.2 2.4 2.4 12 2.4 
12 0 12 -2.4 2.4 -2.4 4.8 -7.2 0 -7.2 -4.8 -7.2 -9.6 -7.2 -16.8 -7.2 
-7.2 -2.4 -7.2 -7.2 -4.8 -12 0 -9.6 P
2028 2229.6 7.2 -2.4 4.8 -2.4 2.4 -7.2 0 -7.2 -2.4 -7.2 -24 -14.4 P
1996.8 2164.8 4.8 2.4 7.2 0 16.8 -4.8 9.6 0 7.2 2.4 4.8 2.4 P
2008.8 2167.2 16.8 -9.6 14.4 0 2.4 4.8 4.8 4.8 0 7.2 P
2858.4 2224.8 0 -67.2 P
2863.2 2229.6 0 -72 P
2863.2 2229.6 -38.4 -50.4 55.2 0 P
2848.8 2157.6 24 0 P
3700.8 2220 -4.8 -2.4 4.8 -4.8 2.4 4.8 0 2.4 -2.4 7.2 -7.2 2.4 -12 0 
-9.6 -2.4 -7.2 -7.2 -7.2 -21.6 0 -19.2 4.8 -12 7.2 -4.8 9.6 -4.8 7.2 0 
9.6 4.8 7.2 4.8 4.8 12 0 2.4 -4.8 12 -7.2 4.8 -9.6 4.8 -4.8 0 
-9.6 -4.8 -7.2 -4.8 -2.4 -12 S
3681.6 2229.6 -4.8 -2.4 -7.2 -7.2 -4.8 -7.2 -2.4 -14.4 0 -19.2 2.4 -12 14.4 -9.6 P
3686.4 2157.6 14.4 9.6 2.4 12 0 2.4 -2.4 12 -14.4 9.6 P
4507.2 2229.6 -12 -2.4 -2.4 -7.2 0 -9.6 2.4 -7.2 12 -4.8 12 0 12 4.8 
2.4 7.2 0 9.6 -2.4 7.2 -12 2.4 -12 0 -7.2 -2.4 -4.8 -7.2 0 -9.6 
4.8 -7.2 7.2 -4.8 P
4519.2 2198.4 7.2 4.8 4.8 7.2 0 9.6 -4.8 7.2 -7.2 2.4 P
4507.2 2198.4 -12 -2.4 -2.4 -2.4 -4.8 -7.2 0 -14.4 4.8 -7.2 2.4 -2.4 12 -4.8 
12 0 12 4.8 2.4 2.4 4.8 7.2 0 14.4 -4.8 7.2 -2.4 2.4 -12 2.4 P
4507.2 2198.4 -7.2 -2.4 -4.8 -2.4 -2.4 -7.2 0 -14.4 2.4 -7.2 4.8 -2.4 7.2 -4.8 P
4519.2 2157.6 7.2 4.8 4.8 2.4 2.4 7.2 0 14.4 -2.4 7.2 -4.8 2.4 -7.2 2.4 P
5294.4 2217.6 7.2 2.4 12 9.6 0 -72 P
5308.8 2227.2 0 -69.6 P
5294.4 2157.6 31.2 0 P
5376 2229.6 -12 -2.4 -7.2 -9.6 -2.4 -19.2 0 -9.6 2.4 -16.8 7.2 -9.6 12 -4.8 
4.8 0 12 4.8 7.2 9.6 2.4 16.8 0 9.6 -2.4 19.2 -7.2 9.6 -12 2.4 
-4.8 0 -7.2 -2.4 -4.8 -2.4 -2.4 -7.2 -4.8 -19.2 0 -9.6 4.8 -16.8 2.4 -7.2 
4.8 -2.4 7.2 -4.8 P
5380.8 2157.6 7.2 4.8 4.8 2.4 2.4 7.2 4.8 16.8 0 9.6 -4.8 19.2 -2.4 7.2 
-4.8 2.4 -7.2 2.4 P
1190.4 3420 0 124.8 P
1358.4 3544.8 0 -40.8 P
1524 3504 0 40.8 P
1689.6 3544.8 0 -40.8 P
1855.2 3504 0 40.8 P
2020.8 3544.8 0 -124.8 P
2188.8 3504 0 40.8 S
2354.4 3544.8 0 -40.8 P
2520 3504 0 40.8 P
2685.6 3544.8 0 -40.8 P
2853.6 3420 0 124.8 P
3019.2 3544.8 0 -40.8 P
3184.8 3504 0 40.8 P
3350.4 3544.8 0 -40.8 P
3516 3504 0 40.8 P
3681.6 3544.8 0 -124.8 P
3849.6 3504 0 40.8 P
4015.2 3544.8 0 -40.8 P
4180.8 3504 0 40.8 P
4346.4 3544.8 0 -40.8 P
4514.4 3420 0 124.8 P
4680 3544.8 0 -40.8 P
4845.6 3504 0 40.8 P
5011.2 3544.8 0 -40.8 P
5176.8 3504 0 40.8 P
5344.8 3544.8 0 -124.8 P
1190.4 2299.2 124.8 0 P
1233.6 2335.2 -43.2 0 P
1190.4 2368.8 43.2 0 P
1233.6 2400 -43.2 0 P
1190.4 2433.6 43.2 0 P
1315.2 2462.4 -124.8 0 P
1190.4 2493.6 43.2 0 P
1233.6 2520 -43.2 0 P
1190.4 2548.8 43.2 0 P
1233.6 2575.2 -43.2 0 P
1190.4 2601.6 124.8 0 P
1233.6 2628 -43.2 0 P
1190.4 2652 43.2 0 P
1233.6 2676 -43.2 0 P
1190.4 2697.6 43.2 0 P
1315.2 2721.6 -124.8 0 P
1190.4 2743.2 43.2 0 P
1233.6 2764.8 -43.2 0 P
1190.4 2786.4 43.2 0 P
1233.6 2808 -43.2 0 P
1190.4 2827.2 124.8 0 P
1233.6 2846.4 -43.2 0 P
1190.4 2865.6 43.2 0 P
1233.6 2884.8 -43.2 0 P
1190.4 2904 43.2 0 P
1315.2 2920.8 -124.8 0 P
1190.4 3086.4 43.2 0 P
1233.6 3223.2 -43.2 0 P
1190.4 3343.2 43.2 0 P
1233.6 3451.2 -43.2 0 P
1190.4 3544.8 124.8 0 P
1008 2330.4 -9.6 -2.4 -7.2 -12 -4.8 -16.8 0 -9.6 4.8 -19.2 7.2 -9.6 9.6 -2.4 
7.2 0 9.6 2.4 7.2 9.6 4.8 19.2 0 9.6 -4.8 16.8 -7.2 12 -9.6 2.4 
-7.2 0 -7.2 -2.4 -2.4 -4.8 -4.8 -7.2 -2.4 -16.8 0 -9.6 2.4 -19.2 4.8 -4.8 
2.4 -4.8 7.2 -2.4 P
1015.2 2258.4 7.2 2.4 2.4 4.8 4.8 4.8 2.4 19.2 0 9.6 -2.4 16.8 -4.8 7.2 
-2.4 4.8 -7.2 2.4 S
1063.2 2265.6 -2.4 -4.8 2.4 -2.4 4.8 2.4 -4.8 4.8 P
1099.2 2330.4 -7.2 -33.6 7.2 4.8 9.6 4.8 9.6 0 12 -4.8 7.2 -4.8 2.4 -12 
0 -7.2 -2.4 -9.6 -7.2 -7.2 -12 -2.4 -9.6 0 -9.6 2.4 -4.8 4.8 -2.4 4.8 
0 4.8 2.4 2.4 4.8 -2.4 -4.8 -4.8 P
1118.4 2306.4 14.4 -9.6 4.8 -12 0 -7.2 -4.8 -9.6 -7.2 -7.2 -7.2 -2.4 P
1099.2 2330.4 33.6 0 P
1099.2 2328 16.8 0 16.8 2.4 P
1008 2632.8 -9.6 -2.4 -7.2 -12 -4.8 -16.8 0 -9.6 4.8 -19.2 7.2 -9.6 9.6 -2.4 
7.2 0 9.6 2.4 7.2 9.6 4.8 19.2 0 9.6 -4.8 16.8 -7.2 12 -9.6 2.4 
-7.2 0 -7.2 -2.4 -2.4 -4.8 -4.8 -7.2 -2.4 -16.8 0 -9.6 2.4 -19.2 4.8 -4.8 
2.4 -4.8 7.2 -2.4 P
1015.2 2560.8 7.2 2.4 2.4 4.8 4.8 4.8 2.4 19.2 0 9.6 -2.4 16.8 -4.8 7.2 
-2.4 4.8 -7.2 2.4 P
1063.2 2568 -2.4 -4.8 2.4 -2.4 4.8 2.4 -4.8 4.8 P
1092 2632.8 0 -21.6 P
1092 2618.4 2.4 7.2 7.2 7.2 7.2 0 16.8 -9.6 7.2 0 4.8 2.4 2.4 7.2 P
1094.4 2625.6 7.2 4.8 7.2 0 16.8 -7.2 P
1140 2632.8 0 -9.6 -2.4 -12 -14.4 -16.8 -4.8 -7.2 -2.4 -9.6 0 -16.8 P
1137.6 2611.2 -19.2 -16.8 -2.4 -7.2 -4.8 -9.6 0 -16.8 P
998.4 2940 7.2 2.4 9.6 9.6 0 -72 P
1012.8 2949.6 0 -69.6 P
998.4 2880 31.2 0 P
1063.2 2887.2 -2.4 -2.4 2.4 -4.8 4.8 4.8 -4.8 2.4 P
1111.2 2952 -9.6 -2.4 -7.2 -9.6 -2.4 -16.8 0 -12 2.4 -16.8 7.2 -9.6 9.6 -4.8 
7.2 0 12 4.8 7.2 9.6 2.4 16.8 0 12 -2.4 16.8 -7.2 9.6 -12 2.4 
-7.2 0 S
1111.2 2952 -9.6 -4.8 -2.4 -7.2 -4.8 -16.8 0 -12 4.8 -16.8 2.4 -7.2 4.8 -2.4 
4.8 -4.8 P
1118.4 2880 7.2 4.8 4.8 2.4 2.4 7.2 4.8 16.8 0 12 -4.8 16.8 -2.4 7.2 
-4.8 2.4 -7.2 2.4 P
991.2 3561.6 2.4 -2.4 -2.4 -4.8 -4.8 4.8 0 2.4 4.8 7.2 2.4 4.8 12 2.4 
12 0 12 -2.4 2.4 -4.8 4.8 -7.2 0 -7.2 -4.8 -7.2 -9.6 -4.8 -16.8 -7.2 
-7.2 -4.8 -7.2 -7.2 -4.8 -9.6 0 -9.6 P
1017.6 3576 7.2 -2.4 4.8 -4.8 2.4 -7.2 0 -7.2 -2.4 -7.2 -12 -4.8 -12 -7.2 P
986.4 3511.2 4.8 2.4 7.2 0 16.8 -7.2 9.6 0 7.2 4.8 4.8 2.4 P
998.4 3513.6 16.8 -9.6 14.4 0 2.4 2.4 4.8 7.2 0 7.2 P
1063.2 3511.2 -2.4 -4.8 2.4 -2.4 4.8 2.4 -4.8 4.8 P
1111.2 3576 -9.6 -2.4 -7.2 -12 -2.4 -16.8 0 -9.6 2.4 -19.2 7.2 -9.6 9.6 -2.4 
7.2 0 12 2.4 7.2 9.6 2.4 19.2 0 9.6 -2.4 16.8 -7.2 12 -12 2.4 
-7.2 0 -4.8 -2.4 -4.8 -4.8 -2.4 -7.2 -4.8 -16.8 0 -9.6 4.8 -19.2 2.4 -4.8 
4.8 -4.8 4.8 -2.4 P
1118.4 3504 7.2 2.4 4.8 4.8 2.4 4.8 4.8 19.2 0 9.6 -4.8 16.8 -2.4 7.2 
-4.8 4.8 -7.2 2.4 P
5220 2299.2 124.8 0 P
5344.8 2335.2 -43.2 0 P
5301.6 2368.8 43.2 0 P
5344.8 2400 -43.2 0 P
5301.6 2433.6 43.2 0 P
5344.8 2462.4 -124.8 0 P
5301.6 2493.6 43.2 0 P
5344.8 2520 -43.2 0 P
5301.6 2548.8 43.2 0 P
5344.8 2575.2 -43.2 0 P
5220 2601.6 124.8 0 P
5344.8 2628 -43.2 0 P
5301.6 2652 43.2 0 P
5344.8 2676 -43.2 0 S
5301.6 2697.6 43.2 0 P
5344.8 2721.6 -124.8 0 P
5301.6 2743.2 43.2 0 P
5344.8 2764.8 -43.2 0 P
5301.6 2786.4 43.2 0 P
5344.8 2808 -43.2 0 P
5220 2827.2 124.8 0 P
5344.8 2846.4 -43.2 0 P
5301.6 2865.6 43.2 0 P
5344.8 2884.8 -43.2 0 P
5301.6 2904 43.2 0 P
5344.8 2920.8 -124.8 0 P
5301.6 3086.4 43.2 0 P
5344.8 3223.2 -43.2 0 P
5301.6 3343.2 43.2 0 P
5344.8 3451.2 -43.2 0 P
5220 3544.8 124.8 0 S
255 0 r3
1190.4 2299.2 0 21.6 P
1190.4 2340 0 21.6 P
1190.4 2383.2 0 19.2 P
1190.4 2424 0 21.6 P
1190.4 2464.8 0 21.6 P
1190.4 2505.6 0 21.6 P
1190.4 2548.8 0 19.2 P
1190.4 2589.6 0 21.6 P
1190.4 2630.4 0 21.6 P
1190.4 2673.6 0 19.2 P
1190.4 2714.4 0 21.6 P
1190.4 2755.2 0 21.6 P
1190.4 2798.4 0 19.2 P
1190.4 2839.2 0 21.6 P
1190.4 2880 0 21.6 P
1190.4 2920.8 21.6 0 P
1233.6 2920.8 19.2 0 P
1274.4 2920.8 21.6 0 P
1315.2 2920.8 21.6 0 P
1358.4 2920.8 19.2 0 P
1399.2 2920.8 21.6 0 P
1440 2920.8 21.6 0 P
1483.2 2920.8 19.2 0 P
1524 2920.8 21.6 0 P
1564.8 2920.8 21.6 0 P
1608 2920.8 19.2 0 P
1648.8 2920.8 19.2 0 P
1689.6 2920.8 21.6 0 P
1730.4 2920.8 21.6 0 P
1773.6 2920.8 19.2 0 P
1814.4 2920.8 21.6 0 P
1855.2 2920.8 21.6 0 P
1898.4 2920.8 19.2 0 P
1939.2 2920.8 21.6 0 P
1980 2920.8 21.6 0 P
2023.2 2920.8 19.2 0 P
2064 2920.8 19.2 0 P
2104.8 2920.8 21.6 0 P
2145.6 2920.8 21.6 0 P
2188.8 2920.8 19.2 0 P
2229.6 2920.8 21.6 0 P
2270.4 2920.8 21.6 0 P
2313.6 2920.8 19.2 0 P
2354.4 2920.8 21.6 0 P
2395.2 2920.8 21.6 0 P
2438.4 2920.8 19.2 0 P
2479.2 2920.8 19.2 0 P
2520 2920.8 21.6 0 P
2560.8 2920.8 21.6 0 P
2604 2920.8 19.2 0 P
2644.8 2920.8 21.6 0 P
2685.6 2920.8 21.6 0 P
2728.8 2920.8 19.2 0 P
2769.6 2920.8 21.6 0 P
2810.4 2920.8 21.6 0 P
2853.6 2923.2 0 19.2 P
2853.6 2964 0 19.2 P
2856 3002.4 19.2 0 P
2896.8 3002.4 21.6 0 P
2937.6 3002.4 21.6 0 P
2980.8 3002.4 19.2 0 P
3019.2 3004.8 0 19.2 2.4 0 P
3040.8 3024 21.6 0 P
3084 3024 19.2 0 S
3124.8 3024 21.6 0 P
3165.6 3024 19.2 0 0 -2.4 P
3184.8 3000 0 -16.8 4.8 0 P
3211.2 2983.2 19.2 0 P
3252 2983.2 21.6 0 P
3292.8 2983.2 21.6 0 P
3336 2983.2 14.4 0 0 4.8 P
3350.4 3009.6 0 2.4 19.2 0 P
3388.8 3012 21.6 0 P
3432 3012 19.2 0 P
3472.8 3012 21.6 0 P
3513.6 3012 2.4 0 0 -19.2 P
3516 2973.6 0 -21.6 P
3516 2930.4 0 -12 7.2 0 P
3544.8 2918.4 21.6 0 P
3585.6 2918.4 21.6 0 P
3628.8 2918.4 19.2 0 P
3669.6 2918.4 12 0 0 7.2 P
3691.2 2940 19.2 0 P
3732 2940 21.6 0 P
3772.8 2940 21.6 0 P
3816 2940 19.2 0 P
3849.6 2947.2 0 19.2 P
3856.8 2980.8 21.6 0 P
3897.6 2980.8 21.6 0 P
3940.8 2980.8 19.2 0 P
3981.6 2980.8 21.6 0 P
4015.2 2971.2 0 -19.2 P
4034.4 2949.6 19.2 0 P
4075.2 2949.6 21.6 0 P
4116 2949.6 21.6 0 P
4159.2 2949.6 19.2 0 P
4180.8 2930.4 0 -21.6 P
4197.6 2904 19.2 0 P
4238.4 2904 21.6 0 P
4279.2 2904 21.6 0 P
4322.4 2904 19.2 0 P
4346.4 2889.6 0 -21.6 P
4346.4 2846.4 0 -19.2 P
4346.4 2805.6 0 -21.6 P
4346.4 2764.8 0 -21.6 P
4356 2731.2 21.6 0 P
4399.2 2731.2 19.2 0 P
4440 2731.2 19.2 0 P
4480.8 2731.2 21.6 0 P
4514.4 2740.8 0 21.6 P
4514.4 2784 0 19.2 P
4519.2 2817.6 21.6 0 P
4560 2817.6 21.6 0 P
4603.2 2817.6 19.2 0 P
4644 2817.6 21.6 0 P
4680 2812.8 0 -21.6 P
4680 2772 0 -21.6 P
4680 2728.8 0 -19.2 P
4680 2688 0 -21.6 P
4680 2647.2 0 -21.6 P
4689.6 2616 21.6 0 P
4730.4 2616 21.6 0 P
4771.2 2616 21.6 0 P
4814.4 2616 19.2 0 P
4845.6 2604 0 -19.2 S
4845.6 2563.2 0 -21.6 P
4845.6 2522.4 0 -21.6 P
4845.6 2479.2 0 -19.2 P
4845.6 2438.4 0 -19.2 P
4845.6 2397.6 0 -21.6 P
4845.6 2356.8 0 -21.6 P
4845.6 2313.6 0 -14.4 P
5011.2 2299.2 0 4.8 P
5011.2 2325.6 0 21.6 P
5011.2 2366.4 0 21.6 P
5011.2 2409.6 0 19.2 P
5011.2 2450.4 0 19.2 P
5011.2 2491.2 0 21.6 P
5011.2 2532 0 21.6 P
5011.2 2575.2 0 19.2 P
5011.2 2616 0 21.6 P
5011.2 2656.8 0 21.6 P
5011.2 2700 0 19.2 P
5011.2 2740.8 0 21.6 P
5011.2 2781.6 0 21.6 P
5011.2 2824.8 0 19.2 P
5011.2 2865.6 0 19.2 P
5011.2 2906.4 0 14.4 4.8 0 P
5037.6 2920.8 21.6 0 P
5078.4 2920.8 21.6 0 P
5121.6 2920.8 19.2 0 P
5162.4 2920.8 21.6 0 P
5203.2 2920.8 21.6 0 P
5246.4 2920.8 19.2 0 P
5287.2 2920.8 19.2 0 P
5328 2920.8 16.8 0 P
5344.8 2299.2 0 0 S
cleartomark end end pagesave restore
 showpage
%%PageTrailer
%%Trailer
%%Pages: 1
%%Trailer
cleartomark
countdictstack
exch sub { end } repeat
restore
%%EOF
