%!PS-Adobe-3.0 EPSF-3.0
%%BoundingBox: (atend)
%%LanguageLevel: 2
%%Creator: Grace-5.1.22
%%CreationDate: Wed Apr  3 18:45:24 2013
%%DocumentData: Clean8Bit
%%Orientation: Portrait
%%Title: /home/pcl302a/heinemey/plot/grace/2012/lhc-higgs-br/mhmaxup_tb50_BR-h0.grace
%%For: heinemey
%%DocumentNeededResources: (atend)
%%EndComments
%%BeginProlog
/m {moveto} def
/l {lineto} def
/s {stroke} def
/n {newpath} def
/c {closepath} def
/RL {rlineto} def
/SLW {setlinewidth} def
/GS {gsave} def
/GR {grestore} def
/SC {setcolor} def
/SGRY {setgray} def
/SRGB {setrgbcolor} def
/SD {setdash} def
/SLC {setlinecap} def
/SLJ {setlinejoin} def
/SCS {setcolorspace} def
/FFSF {findfont setfont} def
/CC {concat} def
/PXL {n m 0 0 RL s} def
/Color0 {1.0000 1.0000 1.0000} def
/Color1 {0.0000 0.0000 0.0000} def
/Color2 {1.0000 0.0000 0.0000} def
/Color3 {0.0000 1.0000 0.0000} def
/Color4 {0.0000 0.0000 1.0000} def
/Color5 {1.0000 1.0000 0.0000} def
/Color6 {0.7373 0.5608 0.5608} def
/Color7 {0.8627 0.8627 0.8627} def
/Color8 {0.5804 0.0000 0.8275} def
/Color9 {0.0000 1.0000 1.0000} def
/Color10 {1.0000 0.0000 1.0000} def
/Color11 {1.0000 0.6471 0.0000} def
/Color12 {0.4471 0.1294 0.7373} def
/Color13 {0.4039 0.0275 0.2824} def
/Color14 {0.2510 0.8784 0.8157} def
/Color15 {0.0000 0.5451 0.0000} def
/Color16 {0.7529 0.7529 0.7529} def
/Color17 {0.5059 0.5059 0.5059} def
/Color18 {0.2588 0.2588 0.2588} def
/PTRN {
 /pat_bits exch def 
 <<
  /PaintType 2
  /PatternType 1 /TilingType 1
  /BBox[0 0 16 16]
  /XStep 16 /YStep 16
  /PaintProc {
   pop
   16 16 true [-1 0 0 -1 16 16] pat_bits imagemask
  }
 >>
 [0.0016 0 0 0.0016 0 0]
 makepattern
} def
/Pattern0 {<0000000000000000000000000000000000000000000000000000000000000000> PTRN} bind def
/Pattern1 {<ffffffffffffffffffffffffffffffffffffffffffffffffffffffffffffffff> PTRN} bind def
/Pattern2 {<eeeeffffbbbbffffeeeeffffbbbbffffeeeeffffbbbbffffeeeeffffbbbbffff> PTRN} bind def
/Pattern3 {<eeeebbbbeeeebbbbeeeebbbbeeeebbbbeeeebbbbeeeebbbbeeeebbbbeeeebbbb> PTRN} bind def
/Pattern4 {<5555aaaa5555aaaa5555aaaa5555aaaa5555aaaa5555aaaa5555aaaa5555aaaa> PTRN} bind def
/Pattern5 {<1111444411114444111144441111444411114444111144441111444411114444> PTRN} bind def
/Pattern6 {<1111000044440000111100004444000011110000444400001111000044440000> PTRN} bind def
/Pattern7 {<1010000000000000010100000000000010100000000000000101000000000000> PTRN} bind def
/Pattern8 {<0000000000000000000000000000000000000000000000000000000000000000> PTRN} bind def
/Pattern9 {<1e1e0f0f8787c3c3e1e1f0f078783c3c1e1e0f0f8787c3c3e1e1f0f078783c3c> PTRN} bind def
/Pattern10 {<7878f0f0e1e1c3c387870f0f1e1e3c3c7878f0f0e1e1c3c387870f0f1e1e3c3c> PTRN} bind def
/Pattern11 {<3333333333333333333333333333333333333333333333333333333333333333> PTRN} bind def
/Pattern12 {<ffffffff00000000ffffffff00000000ffffffff00000000ffffffff00000000> PTRN} bind def
/Pattern13 {<8181424224241818181824244242818181814242242418181818242442428181> PTRN} bind def
/Pattern14 {<8080404020201010080804040202010180804040202010100808040402020101> PTRN} bind def
/Pattern15 {<0101020204040808101020204040808001010202040408081010202040408080> PTRN} bind def
/Pattern16 {<2222222222222222222222222222222222222222222222222222222222222222> PTRN} bind def
/Pattern17 {<0000ffff000000000000ffff000000000000ffff000000000000ffff00000000> PTRN} bind def
/Pattern18 {<2222ffff222222222222ffff222222222222ffff222222222222ffff22222222> PTRN} bind def
/Pattern19 {<ffffffff33333333ffffffff33333333ffffffff33333333ffffffff33333333> PTRN} bind def
/Pattern20 {<0f0f0f0f0f0f0f0ff0f0f0f0f0f0f0f00f0f0f0f0f0f0f0ff0f0f0f0f0f0f0f0> PTRN} bind def
/Pattern21 {<ff00ff00ff00ff00ff00ff00ff00ff0000ff00ff00ff00ff00ff00ff00ff00ff> PTRN} bind def
/Pattern22 {<8001800180018001800180018001ffffffff8001800180018001800180018001> PTRN} bind def
/Pattern23 {<c003c003c003c003c003c003ffffffffffffffffc003c003c003c003c003c003> PTRN} bind def
/Pattern24 {<040404040404ffff404040404040ffff040404040404ffff404040404040ffff> PTRN} bind def
/Pattern25 {<180018001800180018001800ffffffff001800180018001800180018ffffffff> PTRN} bind def
/Pattern26 {<1111b8b87c7c3a3a1111a3a3c7c78b8b1111b8b87c7c3a3a1111a3a3c7c78b8b> PTRN} bind def
/Pattern27 {<101010102828c7c70101010182827c7c101010102828c7c70101010182827c7c> PTRN} bind def
/Pattern28 {<1c1c121211112121c1c12121111112121c1c121211112121c1c1212111111212> PTRN} bind def
/Pattern29 {<3e3e414180808080e3e31414080808083e3e414180808080e3e3141408080808> PTRN} bind def
/Pattern30 {<4848888884848383848488884848383848488888848483838484888848483838> PTRN} bind def
/Pattern31 {<03030404080808080c0c12122121c0c003030404080808080c0c12122121c0c0> PTRN} bind def
/ellipsedict 8 dict def
ellipsedict /mtrx matrix put
/EARC {
 ellipsedict begin
  /endangle exch def
  /startangle exch def
  /yrad exch def
  /xrad exch def
  /y exch def
  /x exch def
  /savematrix mtrx currentmatrix def
  x y translate
  xrad yrad scale
  0 0 1 startangle endangle arc
  savematrix setmatrix
 end
} def
/TL {
  /kcomp exch def
  /linewidth exch def
  /offset exch def
  GS
  0 offset rmoveto
  linewidth SLW
  dup stringwidth exch kcomp add exch RL s
  GR
} def
/KINIT
{
 /kvector exch def
 /kid 0 def
} def
/KPROC
{
 pop pop
 kvector kid get
 0 rmoveto
 /kid 1 kid add def
} def
/DefEncoding [
 /.notdef
 /.notdef
 /.notdef
 /.notdef
 /.notdef
 /.notdef
 /.notdef
 /.notdef
 /.notdef
 /.notdef
 /.notdef
 /.notdef
 /.notdef
 /.notdef
 /.notdef
 /.notdef
 /.notdef
 /.notdef
 /.notdef
 /.notdef
 /.notdef
 /.notdef
 /.notdef
 /.notdef
 /.notdef
 /.notdef
 /.notdef
 /.notdef
 /.notdef
 /.notdef
 /.notdef
 /.notdef
 /space
 /exclam
 /quotedbl
 /numbersign
 /dollar
 /percent
 /ampersand
 /quoteright
 /parenleft
 /parenright
 /asterisk
 /plus
 /comma
 /hyphen
 /period
 /slash
 /zero
 /one
 /two
 /three
 /four
 /five
 /six
 /seven
 /eight
 /nine
 /colon
 /semicolon
 /less
 /equal
 /greater
 /question
 /at
 /A
 /B
 /C
 /D
 /E
 /F
 /G
 /H
 /I
 /J
 /K
 /L
 /M
 /N
 /O
 /P
 /Q
 /R
 /S
 /T
 /U
 /V
 /W
 /X
 /Y
 /Z
 /bracketleft
 /backslash
 /bracketright
 /asciicircum
 /underscore
 /grave
 /a
 /b
 /c
 /d
 /e
 /f
 /g
 /h
 /i
 /j
 /k
 /l
 /m
 /n
 /o
 /p
 /q
 /r
 /s
 /t
 /u
 /v
 /w
 /x
 /y
 /z
 /braceleft
 /bar
 /braceright
 /asciitilde
 /.notdef
 /.notdef
 /.notdef
 /.notdef
 /.notdef
 /.notdef
 /.notdef
 /.notdef
 /.notdef
 /.notdef
 /.notdef
 /.notdef
 /.notdef
 /.notdef
 /.notdef
 /.notdef
 /.notdef
 /.notdef
 /.notdef
 /.notdef
 /.notdef
 /.notdef
 /.notdef
 /.notdef
 /.notdef
 /.notdef
 /.notdef
 /.notdef
 /.notdef
 /.notdef
 /.notdef
 /.notdef
 /.notdef
 /space
 /exclamdown
 /cent
 /sterling
 /currency
 /yen
 /brokenbar
 /section
 /dieresis
 /copyright
 /ordfeminine
 /guillemotleft
 /logicalnot
 /hyphen
 /registered
 /macron
 /degree
 /plusminus
 /twosuperior
 /threesuperior
 /acute
 /mu
 /paragraph
 /periodcentered
 /cedilla
 /onesuperior
 /ordmasculine
 /guillemotright
 /onequarter
 /onehalf
 /threequarters
 /questiondown
 /Agrave
 /Aacute
 /Acircumflex
 /Atilde
 /Adieresis
 /Aring
 /AE
 /Ccedilla
 /Egrave
 /Eacute
 /Ecircumflex
 /Edieresis
 /Igrave
 /Iacute
 /Icircumflex
 /Idieresis
 /Eth
 /Ntilde
 /Ograve
 /Oacute
 /Ocircumflex
 /Otilde
 /Odieresis
 /multiply
 /Oslash
 /Ugrave
 /Uacute
 /Ucircumflex
 /Udieresis
 /Yacute
 /Thorn
 /germandbls
 /agrave
 /aacute
 /acircumflex
 /atilde
 /adieresis
 /aring
 /ae
 /ccedilla
 /egrave
 /eacute
 /ecircumflex
 /edieresis
 /igrave
 /iacute
 /icircumflex
 /idieresis
 /eth
 /ntilde
 /ograve
 /oacute
 /ocircumflex
 /otilde
 /odieresis
 /divide
 /oslash
 /ugrave
 /uacute
 /ucircumflex
 /udieresis
 /yacute
 /thorn
 /ydieresis
] def
%%EndProlog
%%BeginSetup
%%EndSetup
612.00 612.00 scale
[/DeviceRGB] SCS
Color2 SC
[] 0 SD
0.0045 SLW
0 SLC
0 SLJ
n
0.1500 0.8885 m
0.1516 0.8885 l
0.1531 0.8885 l
0.1547 0.8885 l
0.1563 0.8884 l
0.1578 0.8884 l
0.1594 0.8884 l
0.1610 0.8884 l
0.1625 0.8884 l
0.1641 0.8883 l
0.1657 0.8883 l
0.1673 0.8883 l
0.1688 0.8883 l
0.1704 0.8883 l
0.1720 0.8882 l
0.1735 0.8882 l
0.1751 0.8882 l
0.1767 0.8882 l
0.1782 0.8881 l
0.1798 0.8881 l
0.1814 0.8881 l
0.1829 0.8881 l
0.1845 0.8881 l
0.1861 0.8880 l
0.1876 0.8880 l
0.1892 0.8880 l
0.1908 0.8880 l
0.1924 0.8879 l
0.1939 0.8879 l
0.1955 0.8878 l
0.1971 0.8878 l
0.1986 0.8877 l
0.2002 0.8876 l
0.2018 0.8874 l
0.2033 0.8872 l
0.2049 0.8868 l
0.2065 0.8862 l
0.2080 0.8853 l
0.2096 0.8842 l
0.2112 0.8831 l
0.2127 0.8827 l
0.2143 0.8832 l
0.2159 0.8839 l
0.2175 0.8847 l
0.2190 0.8853 l
0.2206 0.8857 l
0.2222 0.8861 l
0.2237 0.8864 l
0.2253 0.8866 l
0.2269 0.8867 l
0.2284 0.8868 l
0.2300 0.8869 l
0.2316 0.8869 l
0.2331 0.8869 l
0.2347 0.8869 l
0.2363 0.8868 l
0.2378 0.8868 l
0.2394 0.8867 l
0.2410 0.8866 l
0.2425 0.8865 l
0.2441 0.8864 l
0.2457 0.8863 l
0.2473 0.8861 l
0.2488 0.8860 l
0.2504 0.8858 l
0.2520 0.8857 l
0.2535 0.8855 l
0.2551 0.8853 l
0.2567 0.8851 l
0.2582 0.8850 l
0.2598 0.8848 l
0.2614 0.8846 l
0.2629 0.8844 l
0.2645 0.8842 l
0.2661 0.8840 l
0.2676 0.8838 l
0.2692 0.8836 l
0.2708 0.8834 l
0.2724 0.8831 l
0.2739 0.8829 l
0.2755 0.8827 l
0.2771 0.8825 l
0.2786 0.8823 l
0.2802 0.8820 l
0.2818 0.8818 l
0.2833 0.8816 l
0.2849 0.8814 l
0.2865 0.8812 l
0.2880 0.8809 l
0.2896 0.8807 l
0.2912 0.8805 l
0.2927 0.8803 l
0.2943 0.8800 l
0.2959 0.8798 l
0.2975 0.8796 l
0.2990 0.8794 l
0.3006 0.8791 l
0.3022 0.8789 l
0.3037 0.8787 l
0.3053 0.8785 l
0.3069 0.8782 l
0.3084 0.8780 l
0.3100 0.8778 l
0.3116 0.8776 l
0.3131 0.8774 l
0.3147 0.8771 l
0.3163 0.8769 l
0.3178 0.8767 l
0.3194 0.8765 l
0.3210 0.8763 l
0.3225 0.8761 l
0.3241 0.8759 l
0.3257 0.8757 l
0.3273 0.8754 l
0.3288 0.8752 l
0.3304 0.8750 l
0.3320 0.8748 l
0.3335 0.8746 l
0.3351 0.8744 l
0.3367 0.8742 l
0.3382 0.8740 l
0.3398 0.8738 l
0.3414 0.8736 l
0.3429 0.8734 l
0.3445 0.8733 l
0.3461 0.8731 l
0.3476 0.8729 l
0.3492 0.8727 l
0.3508 0.8725 l
0.3524 0.8723 l
0.3539 0.8721 l
0.3555 0.8719 l
0.3571 0.8718 l
0.3586 0.8716 l
0.3602 0.8714 l
0.3618 0.8712 l
0.3633 0.8710 l
0.3649 0.8709 l
0.3665 0.8707 l
0.3680 0.8705 l
0.3696 0.8704 l
0.3712 0.8702 l
0.3727 0.8700 l
0.3743 0.8699 l
0.3759 0.8697 l
0.3775 0.8695 l
0.3790 0.8694 l
0.3806 0.8692 l
0.3822 0.8690 l
0.3837 0.8689 l
0.3853 0.8687 l
0.3869 0.8686 l
0.3884 0.8684 l
0.3900 0.8683 l
0.3916 0.8681 l
0.3931 0.8680 l
0.3947 0.8678 l
0.3963 0.8677 l
0.3978 0.8675 l
0.3994 0.8674 l
0.4010 0.8672 l
0.4025 0.8671 l
0.4041 0.8669 l
0.4057 0.8668 l
0.4073 0.8667 l
0.4088 0.8665 l
0.4104 0.8664 l
0.4120 0.8663 l
0.4135 0.8661 l
0.4151 0.8660 l
0.4167 0.8659 l
0.4182 0.8657 l
0.4198 0.8656 l
0.4214 0.8655 l
0.4229 0.8653 l
0.4245 0.8652 l
0.4261 0.8651 l
0.4276 0.8650 l
0.4292 0.8648 l
0.4308 0.8647 l
0.4324 0.8646 l
0.4339 0.8645 l
0.4355 0.8644 l
0.4371 0.8642 l
0.4386 0.8641 l
0.4402 0.8640 l
0.4418 0.8639 l
0.4433 0.8638 l
0.4449 0.8637 l
0.4465 0.8635 l
0.4480 0.8634 l
0.4496 0.8633 l
0.4512 0.8632 l
0.4527 0.8631 l
0.4543 0.8630 l
0.4559 0.8629 l
0.4575 0.8628 l
0.4590 0.8627 l
0.4606 0.8626 l
0.4622 0.8625 l
0.4637 0.8624 l
0.4653 0.8623 l
0.4669 0.8622 l
0.4684 0.8621 l
0.4700 0.8620 l
0.4716 0.8619 l
0.4731 0.8618 l
0.4747 0.8617 l
0.4763 0.8616 l
0.4778 0.8615 l
0.4794 0.8614 l
0.4810 0.8613 l
0.4825 0.8612 l
0.4841 0.8611 l
0.4857 0.8610 l
0.4873 0.8609 l
0.4888 0.8608 l
0.4904 0.8607 l
0.4920 0.8607 l
0.4935 0.8606 l
0.4951 0.8605 l
0.4967 0.8604 l
0.4982 0.8603 l
0.4998 0.8602 l
0.5014 0.8601 l
0.5029 0.8601 l
0.5045 0.8600 l
0.5061 0.8599 l
0.5076 0.8598 l
0.5092 0.8597 l
0.5108 0.8597 l
0.5124 0.8596 l
0.5139 0.8595 l
0.5155 0.8594 l
0.5171 0.8593 l
0.5186 0.8593 l
0.5202 0.8592 l
0.5218 0.8591 l
0.5233 0.8590 l
0.5249 0.8590 l
0.5265 0.8589 l
0.5280 0.8588 l
0.5296 0.8588 l
0.5312 0.8587 l
0.5327 0.8586 l
0.5343 0.8585 l
0.5359 0.8585 l
0.5375 0.8584 l
0.5390 0.8583 l
0.5406 0.8583 l
0.5422 0.8582 l
0.5437 0.8581 l
0.5453 0.8581 l
0.5469 0.8580 l
0.5484 0.8579 l
0.5502 0.8579 l
0.5516 0.8578 l
0.5531 0.8577 l
0.5547 0.8577 l
0.5563 0.8576 l
0.5578 0.8575 l
0.5594 0.8575 l
0.5610 0.8574 l
0.5625 0.8574 l
0.5641 0.8573 l
0.5657 0.8572 l
0.5673 0.8572 l
0.5688 0.8571 l
0.5704 0.8571 l
0.5720 0.8570 l
0.5735 0.8569 l
0.5751 0.8569 l
0.5767 0.8568 l
0.5782 0.8568 l
0.5798 0.8567 l
0.5814 0.8567 l
0.5829 0.8566 l
0.5845 0.8566 l
0.5861 0.8565 l
0.5876 0.8564 l
0.5892 0.8564 l
0.5908 0.8563 l
0.5924 0.8563 l
0.5939 0.8562 l
0.5955 0.8562 l
0.5971 0.8561 l
0.5986 0.8561 l
0.6002 0.8560 l
0.6018 0.8560 l
0.6033 0.8559 l
0.6049 0.8559 l
0.6065 0.8558 l
0.6080 0.8558 l
0.6096 0.8557 l
0.6112 0.8557 l
0.6127 0.8556 l
0.6143 0.8556 l
0.6159 0.8555 l
0.6175 0.8555 l
0.6190 0.8554 l
0.6206 0.8554 l
0.6222 0.8553 l
0.6237 0.8553 l
0.6253 0.8552 l
0.6269 0.8552 l
0.6284 0.8552 l
0.6300 0.8551 l
0.6316 0.8551 l
0.6331 0.8550 l
0.6347 0.8550 l
0.6363 0.8549 l
0.6378 0.8549 l
0.6394 0.8548 l
0.6410 0.8548 l
0.6425 0.8548 l
0.6441 0.8547 l
0.6457 0.8547 l
0.6473 0.8546 l
0.6488 0.8546 l
0.6504 0.8546 l
0.6520 0.8545 l
0.6535 0.8545 l
0.6551 0.8544 l
0.6567 0.8544 l
0.6582 0.8544 l
0.6598 0.8543 l
0.6614 0.8543 l
0.6629 0.8542 l
0.6645 0.8542 l
0.6661 0.8542 l
0.6676 0.8541 l
0.6692 0.8541 l
0.6708 0.8540 l
0.6724 0.8540 l
0.6739 0.8540 l
0.6755 0.8539 l
0.6771 0.8539 l
0.6786 0.8539 l
0.6802 0.8538 l
0.6818 0.8538 l
0.6833 0.8537 l
0.6849 0.8537 l
0.6865 0.8537 l
0.6880 0.8536 l
0.6896 0.8536 l
0.6912 0.8536 l
0.6927 0.8535 l
0.6943 0.8535 l
0.6959 0.8535 l
0.6975 0.8534 l
0.6990 0.8534 l
0.7006 0.8534 l
0.7022 0.8533 l
0.7037 0.8533 l
0.7053 0.8533 l
0.7069 0.8532 l
0.7084 0.8532 l
0.7100 0.8532 l
0.7116 0.8531 l
0.7131 0.8531 l
0.7147 0.8531 l
0.7163 0.8530 l
0.7178 0.8530 l
0.7194 0.8530 l
0.7210 0.8530 l
0.7225 0.8529 l
0.7241 0.8529 l
0.7257 0.8529 l
0.7273 0.8528 l
0.7288 0.8528 l
0.7304 0.8528 l
0.7320 0.8527 l
0.7335 0.8527 l
0.7351 0.8527 l
0.7367 0.8527 l
0.7382 0.8526 l
0.7398 0.8526 l
0.7414 0.8526 l
0.7429 0.8525 l
0.7445 0.8525 l
0.7461 0.8525 l
0.7476 0.8525 l
0.7492 0.8524 l
0.7508 0.8524 l
0.7524 0.8524 l
0.7539 0.8524 l
0.7555 0.8523 l
0.7571 0.8523 l
0.7586 0.8523 l
0.7602 0.8522 l
0.7618 0.8522 l
0.7633 0.8522 l
0.7649 0.8522 l
0.7665 0.8521 l
0.7680 0.8521 l
0.7696 0.8521 l
0.7712 0.8521 l
0.7727 0.8520 l
0.7743 0.8520 l
0.7759 0.8520 l
0.7775 0.8520 l
0.7790 0.8519 l
0.7806 0.8519 l
0.7822 0.8519 l
0.7837 0.8519 l
0.7853 0.8518 l
0.7869 0.8518 l
0.7884 0.8518 l
0.7900 0.8518 l
0.7916 0.8518 l
0.7931 0.8517 l
0.7947 0.8517 l
0.7963 0.8517 l
0.7978 0.8517 l
0.7994 0.8516 l
0.8010 0.8516 l
0.8025 0.8516 l
0.8041 0.8516 l
0.8057 0.8515 l
0.8073 0.8515 l
0.8088 0.8515 l
0.8104 0.8515 l
0.8120 0.8515 l
0.8135 0.8514 l
0.8151 0.8514 l
0.8167 0.8514 l
0.8182 0.8514 l
0.8198 0.8514 l
0.8214 0.8513 l
0.8229 0.8513 l
0.8245 0.8513 l
0.8261 0.8513 l
0.8276 0.8513 l
0.8292 0.8512 l
0.8308 0.8512 l
0.8324 0.8512 l
0.8339 0.8512 l
0.8355 0.8511 l
0.8371 0.8511 l
0.8386 0.8511 l
0.8402 0.8511 l
0.8418 0.8511 l
0.8433 0.8510 l
0.8449 0.8510 l
0.8465 0.8510 l
0.8480 0.8510 l
0.8496 0.8510 l
0.8512 0.8510 l
0.8527 0.8509 l
0.8543 0.8509 l
0.8559 0.8509 l
0.8575 0.8509 l
0.8590 0.8509 l
0.8606 0.8508 l
0.8622 0.8508 l
0.8637 0.8508 l
0.8653 0.8508 l
0.8669 0.8508 l
0.8684 0.8508 l
0.8700 0.8507 l
0.8716 0.8507 l
0.8731 0.8507 l
0.8747 0.8507 l
0.8763 0.8507 l
0.8778 0.8506 l
0.8794 0.8506 l
0.8810 0.8506 l
0.8825 0.8506 l
0.8841 0.8506 l
0.8857 0.8506 l
0.8873 0.8505 l
0.8888 0.8505 l
0.8904 0.8505 l
0.8920 0.8505 l
0.8935 0.8505 l
0.8951 0.8505 l
0.8967 0.8504 l
0.8982 0.8504 l
0.8998 0.8504 l
0.9014 0.8504 l
0.9029 0.8504 l
0.9045 0.8504 l
0.9061 0.8504 l
0.9076 0.8503 l
0.9092 0.8503 l
0.9108 0.8503 l
0.9124 0.8503 l
0.9139 0.8503 l
0.9155 0.8503 l
0.9171 0.8502 l
0.9186 0.8502 l
0.9202 0.8502 l
0.9218 0.8502 l
0.9233 0.8502 l
0.9249 0.8502 l
0.9265 0.8502 l
0.9280 0.8501 l
0.9296 0.8501 l
0.9312 0.8501 l
0.9327 0.8501 l
0.9343 0.8501 l
0.9359 0.8501 l
0.9375 0.8501 l
0.9390 0.8500 l
0.9406 0.8500 l
0.9422 0.8500 l
0.9437 0.8500 l
0.9453 0.8500 l
0.9469 0.8500 l
0.9484 0.8500 l
0.9500 0.8499 l
s
[/DeviceRGB] SCS
Color3 SC
n
0.2157 0.1499 m
0.2159 0.1543 l
0.2175 0.1814 l
0.2190 0.2052 l
0.2206 0.2263 l
0.2222 0.2451 l
0.2237 0.2620 l
0.2253 0.2772 l
0.2269 0.2910 l
0.2284 0.3036 l
0.2300 0.3151 l
0.2316 0.3258 l
0.2331 0.3357 l
0.2347 0.3449 l
0.2363 0.3534 l
0.2378 0.3615 l
0.2394 0.3690 l
0.2410 0.3761 l
0.2425 0.3827 l
0.2441 0.3891 l
0.2457 0.3950 l
0.2473 0.4007 l
0.2488 0.4061 l
0.2504 0.4112 l
0.2520 0.4161 l
0.2535 0.4208 l
0.2551 0.4252 l
0.2567 0.4295 l
0.2582 0.4335 l
0.2598 0.4375 l
0.2614 0.4412 l
0.2629 0.4448 l
0.2645 0.4483 l
0.2661 0.4516 l
0.2676 0.4548 l
0.2692 0.4579 l
0.2708 0.4609 l
0.2724 0.4638 l
0.2739 0.4666 l
0.2755 0.4693 l
0.2771 0.4719 l
0.2786 0.4744 l
0.2802 0.4768 l
0.2818 0.4792 l
0.2833 0.4814 l
0.2849 0.4836 l
0.2865 0.4858 l
0.2880 0.4879 l
0.2896 0.4899 l
0.2912 0.4918 l
0.2927 0.4937 l
0.2943 0.4956 l
0.2959 0.4974 l
0.2975 0.4991 l
0.2990 0.5008 l
0.3006 0.5025 l
0.3022 0.5041 l
0.3037 0.5057 l
0.3053 0.5072 l
0.3069 0.5087 l
0.3084 0.5101 l
0.3100 0.5115 l
0.3116 0.5129 l
0.3131 0.5142 l
0.3147 0.5155 l
0.3163 0.5168 l
0.3178 0.5181 l
0.3194 0.5193 l
0.3210 0.5205 l
0.3225 0.5216 l
0.3241 0.5227 l
0.3257 0.5238 l
0.3273 0.5249 l
0.3288 0.5260 l
0.3304 0.5270 l
0.3320 0.5280 l
0.3335 0.5290 l
0.3351 0.5300 l
0.3367 0.5309 l
0.3382 0.5318 l
0.3398 0.5328 l
0.3414 0.5336 l
0.3429 0.5345 l
0.3445 0.5354 l
0.3461 0.5362 l
0.3476 0.5370 l
0.3492 0.5378 l
0.3508 0.5386 l
0.3524 0.5394 l
0.3539 0.5401 l
0.3555 0.5409 l
0.3571 0.5416 l
0.3586 0.5423 l
0.3602 0.5430 l
0.3618 0.5437 l
0.3633 0.5443 l
0.3649 0.5450 l
0.3665 0.5456 l
0.3680 0.5463 l
0.3696 0.5469 l
0.3712 0.5475 l
0.3727 0.5481 l
0.3743 0.5487 l
0.3759 0.5493 l
0.3775 0.5499 l
0.3790 0.5504 l
0.3806 0.5510 l
0.3822 0.5515 l
0.3837 0.5520 l
0.3853 0.5526 l
0.3869 0.5531 l
0.3884 0.5536 l
0.3900 0.5541 l
0.3916 0.5546 l
0.3931 0.5551 l
0.3947 0.5555 l
0.3963 0.5560 l
0.3978 0.5564 l
0.3994 0.5569 l
0.4010 0.5573 l
0.4025 0.5578 l
0.4041 0.5582 l
0.4057 0.5586 l
0.4073 0.5590 l
0.4088 0.5595 l
0.4104 0.5599 l
0.4120 0.5602 l
0.4135 0.5606 l
0.4151 0.5610 l
0.4167 0.5614 l
0.4182 0.5618 l
0.4198 0.5621 l
0.4214 0.5625 l
0.4229 0.5629 l
0.4245 0.5632 l
0.4261 0.5636 l
0.4276 0.5639 l
0.4292 0.5642 l
0.4308 0.5646 l
0.4324 0.5649 l
0.4339 0.5652 l
0.4355 0.5655 l
0.4371 0.5659 l
0.4386 0.5662 l
0.4402 0.5665 l
0.4418 0.5668 l
0.4433 0.5671 l
0.4449 0.5674 l
0.4465 0.5677 l
0.4480 0.5679 l
0.4496 0.5682 l
0.4512 0.5685 l
0.4527 0.5688 l
0.4543 0.5690 l
0.4559 0.5693 l
0.4575 0.5696 l
0.4590 0.5698 l
0.4606 0.5701 l
0.4622 0.5703 l
0.4637 0.5706 l
0.4653 0.5708 l
0.4669 0.5711 l
0.4684 0.5713 l
0.4700 0.5716 l
0.4716 0.5718 l
0.4731 0.5720 l
0.4747 0.5723 l
0.4763 0.5725 l
0.4778 0.5727 l
0.4794 0.5729 l
0.4810 0.5732 l
0.4825 0.5734 l
0.4841 0.5736 l
0.4857 0.5738 l
0.4873 0.5740 l
0.4888 0.5742 l
0.4904 0.5744 l
0.4920 0.5746 l
0.4935 0.5748 l
0.4951 0.5750 l
0.4967 0.5752 l
0.4982 0.5754 l
0.4998 0.5756 l
0.5014 0.5758 l
0.5029 0.5759 l
0.5045 0.5761 l
0.5061 0.5763 l
0.5076 0.5765 l
0.5092 0.5767 l
0.5108 0.5768 l
0.5124 0.5770 l
0.5139 0.5772 l
0.5155 0.5773 l
0.5171 0.5775 l
0.5186 0.5777 l
0.5202 0.5778 l
0.5218 0.5780 l
0.5233 0.5782 l
0.5249 0.5783 l
0.5265 0.5785 l
0.5280 0.5786 l
0.5296 0.5788 l
0.5312 0.5789 l
0.5327 0.5791 l
0.5343 0.5792 l
0.5359 0.5794 l
0.5375 0.5795 l
0.5390 0.5797 l
0.5406 0.5798 l
0.5422 0.5799 l
0.5437 0.5801 l
0.5453 0.5802 l
0.5469 0.5803 l
0.5484 0.5805 l
0.5502 0.5806 l
0.5516 0.5807 l
0.5531 0.5809 l
0.5547 0.5810 l
0.5563 0.5811 l
0.5578 0.5813 l
0.5594 0.5814 l
0.5610 0.5815 l
0.5625 0.5816 l
0.5641 0.5818 l
0.5657 0.5819 l
0.5673 0.5820 l
0.5688 0.5821 l
0.5704 0.5822 l
0.5720 0.5823 l
0.5735 0.5825 l
0.5751 0.5826 l
0.5767 0.5827 l
0.5782 0.5828 l
0.5798 0.5829 l
0.5814 0.5830 l
0.5829 0.5831 l
0.5845 0.5832 l
0.5861 0.5833 l
0.5876 0.5834 l
0.5892 0.5836 l
0.5908 0.5837 l
0.5924 0.5838 l
0.5939 0.5839 l
0.5955 0.5840 l
0.5971 0.5841 l
0.5986 0.5842 l
0.6002 0.5843 l
0.6018 0.5844 l
0.6033 0.5844 l
0.6049 0.5845 l
0.6065 0.5846 l
0.6080 0.5847 l
0.6096 0.5848 l
0.6112 0.5849 l
0.6127 0.5850 l
0.6143 0.5851 l
0.6159 0.5852 l
0.6175 0.5853 l
0.6190 0.5854 l
0.6206 0.5855 l
0.6222 0.5855 l
0.6237 0.5856 l
0.6253 0.5857 l
0.6269 0.5858 l
0.6284 0.5859 l
0.6300 0.5860 l
0.6316 0.5860 l
0.6331 0.5861 l
0.6347 0.5862 l
0.6363 0.5863 l
0.6378 0.5864 l
0.6394 0.5864 l
0.6410 0.5865 l
0.6425 0.5866 l
0.6441 0.5867 l
0.6457 0.5868 l
0.6473 0.5868 l
0.6488 0.5869 l
0.6504 0.5870 l
0.6520 0.5871 l
0.6535 0.5871 l
0.6551 0.5872 l
0.6567 0.5873 l
0.6582 0.5873 l
0.6598 0.5874 l
0.6614 0.5875 l
0.6629 0.5876 l
0.6645 0.5876 l
0.6661 0.5877 l
0.6676 0.5878 l
0.6692 0.5878 l
0.6708 0.5879 l
0.6724 0.5880 l
0.6739 0.5880 l
0.6755 0.5881 l
0.6771 0.5882 l
0.6786 0.5882 l
0.6802 0.5883 l
0.6818 0.5884 l
0.6833 0.5884 l
0.6849 0.5885 l
0.6865 0.5885 l
0.6880 0.5886 l
0.6896 0.5887 l
0.6912 0.5887 l
0.6927 0.5888 l
0.6943 0.5888 l
0.6959 0.5889 l
0.6975 0.5890 l
0.6990 0.5890 l
0.7006 0.5891 l
0.7022 0.5891 l
0.7037 0.5892 l
0.7053 0.5893 l
0.7069 0.5893 l
0.7084 0.5894 l
0.7100 0.5894 l
0.7116 0.5895 l
0.7131 0.5895 l
0.7147 0.5896 l
0.7163 0.5896 l
0.7178 0.5897 l
0.7194 0.5897 l
0.7210 0.5898 l
0.7225 0.5899 l
0.7241 0.5899 l
0.7257 0.5900 l
0.7273 0.5900 l
0.7288 0.5901 l
0.7304 0.5901 l
0.7320 0.5902 l
0.7335 0.5902 l
0.7351 0.5903 l
0.7367 0.5903 l
0.7382 0.5904 l
0.7398 0.5904 l
0.7414 0.5905 l
0.7429 0.5905 l
0.7445 0.5905 l
0.7461 0.5906 l
0.7476 0.5906 l
0.7492 0.5907 l
0.7508 0.5907 l
0.7524 0.5908 l
0.7539 0.5908 l
0.7555 0.5909 l
0.7571 0.5909 l
0.7586 0.5910 l
0.7602 0.5910 l
0.7618 0.5910 l
0.7633 0.5911 l
0.7649 0.5911 l
0.7665 0.5912 l
0.7680 0.5912 l
0.7696 0.5913 l
0.7712 0.5913 l
0.7727 0.5913 l
0.7743 0.5914 l
0.7759 0.5914 l
0.7775 0.5915 l
0.7790 0.5915 l
0.7806 0.5916 l
0.7822 0.5916 l
0.7837 0.5916 l
0.7853 0.5917 l
0.7869 0.5917 l
0.7884 0.5918 l
0.7900 0.5918 l
0.7916 0.5918 l
0.7931 0.5919 l
0.7947 0.5919 l
0.7963 0.5919 l
0.7978 0.5920 l
0.7994 0.5920 l
0.8010 0.5921 l
0.8025 0.5921 l
0.8041 0.5921 l
0.8057 0.5922 l
0.8073 0.5922 l
0.8088 0.5922 l
0.8104 0.5923 l
0.8120 0.5923 l
0.8135 0.5923 l
0.8151 0.5924 l
0.8167 0.5924 l
0.8182 0.5925 l
0.8198 0.5925 l
0.8214 0.5925 l
0.8229 0.5926 l
0.8245 0.5926 l
0.8261 0.5926 l
0.8276 0.5927 l
0.8292 0.5927 l
0.8308 0.5927 l
0.8324 0.5928 l
0.8339 0.5928 l
0.8355 0.5928 l
0.8371 0.5929 l
0.8386 0.5929 l
0.8402 0.5929 l
0.8418 0.5930 l
0.8433 0.5930 l
0.8449 0.5930 l
0.8465 0.5930 l
0.8480 0.5931 l
0.8496 0.5931 l
0.8512 0.5931 l
0.8527 0.5932 l
0.8543 0.5932 l
0.8559 0.5932 l
0.8575 0.5933 l
0.8590 0.5933 l
0.8606 0.5933 l
0.8622 0.5933 l
0.8637 0.5934 l
0.8653 0.5934 l
0.8669 0.5934 l
0.8684 0.5935 l
0.8700 0.5935 l
0.8716 0.5935 l
0.8731 0.5936 l
0.8747 0.5936 l
0.8763 0.5936 l
0.8778 0.5936 l
0.8794 0.5937 l
0.8810 0.5937 l
0.8825 0.5937 l
0.8841 0.5937 l
0.8857 0.5938 l
0.8873 0.5938 l
0.8888 0.5938 l
0.8904 0.5938 l
0.8920 0.5939 l
0.8935 0.5939 l
0.8951 0.5939 l
0.8967 0.5940 l
0.8982 0.5940 l
0.8998 0.5940 l
0.9014 0.5940 l
0.9029 0.5941 l
0.9045 0.5941 l
0.9061 0.5941 l
0.9076 0.5941 l
0.9092 0.5942 l
0.9108 0.5942 l
0.9124 0.5942 l
0.9139 0.5942 l
0.9155 0.5943 l
0.9171 0.5943 l
0.9186 0.5943 l
0.9202 0.5943 l
0.9218 0.5943 l
0.9233 0.5944 l
0.9249 0.5944 l
0.9265 0.5944 l
0.9280 0.5944 l
0.9296 0.5945 l
0.9312 0.5945 l
0.9327 0.5945 l
0.9343 0.5945 l
0.9359 0.5946 l
0.9375 0.5946 l
0.9390 0.5946 l
0.9406 0.5946 l
0.9422 0.5946 l
0.9437 0.5947 l
0.9453 0.5947 l
0.9469 0.5947 l
0.9484 0.5947 l
0.9500 0.5948 l
s
[/DeviceRGB] SCS
Color4 SC
n
0.1500 0.7325 m
0.1516 0.7327 l
0.1531 0.7329 l
0.1547 0.7330 l
0.1563 0.7332 l
0.1578 0.7334 l
0.1594 0.7335 l
0.1610 0.7337 l
0.1625 0.7338 l
0.1641 0.7340 l
0.1657 0.7342 l
0.1673 0.7343 l
0.1688 0.7345 l
0.1704 0.7346 l
0.1720 0.7348 l
0.1735 0.7349 l
0.1751 0.7351 l
0.1767 0.7352 l
0.1782 0.7354 l
0.1798 0.7355 l
0.1814 0.7357 l
0.1829 0.7358 l
0.1845 0.7360 l
0.1861 0.7362 l
0.1876 0.7363 l
0.1892 0.7365 l
0.1908 0.7367 l
0.1924 0.7370 l
0.1939 0.7372 l
0.1955 0.7375 l
0.1971 0.7379 l
0.1986 0.7385 l
0.2002 0.7392 l
0.2018 0.7401 l
0.2033 0.7416 l
0.2049 0.7438 l
0.2065 0.7471 l
0.2080 0.7518 l
0.2096 0.7576 l
0.2112 0.7625 l
0.2127 0.7641 l
0.2143 0.7621 l
0.2159 0.7583 l
0.2175 0.7545 l
0.2190 0.7511 l
0.2206 0.7482 l
0.2222 0.7457 l
0.2237 0.7435 l
0.2253 0.7416 l
0.2269 0.7400 l
0.2284 0.7385 l
0.2300 0.7372 l
0.2316 0.7360 l
0.2331 0.7349 l
0.2347 0.7338 l
0.2363 0.7329 l
0.2378 0.7320 l
0.2394 0.7312 l
0.2410 0.7304 l
0.2425 0.7296 l
0.2441 0.7289 l
0.2457 0.7282 l
0.2473 0.7276 l
0.2488 0.7269 l
0.2504 0.7263 l
0.2520 0.7257 l
0.2535 0.7251 l
0.2551 0.7245 l
0.2567 0.7239 l
0.2582 0.7234 l
0.2598 0.7228 l
0.2614 0.7223 l
0.2629 0.7218 l
0.2645 0.7213 l
0.2661 0.7208 l
0.2676 0.7203 l
0.2692 0.7198 l
0.2708 0.7193 l
0.2724 0.7188 l
0.2739 0.7184 l
0.2755 0.7179 l
0.2771 0.7175 l
0.2786 0.7170 l
0.2802 0.7166 l
0.2818 0.7162 l
0.2833 0.7157 l
0.2849 0.7153 l
0.2865 0.7149 l
0.2880 0.7145 l
0.2896 0.7141 l
0.2912 0.7137 l
0.2927 0.7133 l
0.2943 0.7129 l
0.2959 0.7125 l
0.2975 0.7121 l
0.2990 0.7118 l
0.3006 0.7114 l
0.3022 0.7110 l
0.3037 0.7106 l
0.3053 0.7103 l
0.3069 0.7099 l
0.3084 0.7095 l
0.3100 0.7092 l
0.3116 0.7088 l
0.3131 0.7085 l
0.3147 0.7081 l
0.3163 0.7078 l
0.3178 0.7075 l
0.3194 0.7071 l
0.3210 0.7068 l
0.3225 0.7065 l
0.3241 0.7061 l
0.3257 0.7058 l
0.3273 0.7055 l
0.3288 0.7052 l
0.3304 0.7048 l
0.3320 0.7045 l
0.3335 0.7042 l
0.3351 0.7039 l
0.3367 0.7036 l
0.3382 0.7033 l
0.3398 0.7030 l
0.3414 0.7027 l
0.3429 0.7024 l
0.3445 0.7021 l
0.3461 0.7019 l
0.3476 0.7016 l
0.3492 0.7013 l
0.3508 0.7010 l
0.3524 0.7007 l
0.3539 0.7005 l
0.3555 0.7002 l
0.3571 0.6999 l
0.3586 0.6997 l
0.3602 0.6994 l
0.3618 0.6991 l
0.3633 0.6989 l
0.3649 0.6986 l
0.3665 0.6984 l
0.3680 0.6981 l
0.3696 0.6979 l
0.3712 0.6976 l
0.3727 0.6974 l
0.3743 0.6972 l
0.3759 0.6969 l
0.3775 0.6967 l
0.3790 0.6965 l
0.3806 0.6962 l
0.3822 0.6960 l
0.3837 0.6958 l
0.3853 0.6955 l
0.3869 0.6953 l
0.3884 0.6951 l
0.3900 0.6949 l
0.3916 0.6947 l
0.3931 0.6945 l
0.3947 0.6942 l
0.3963 0.6940 l
0.3978 0.6938 l
0.3994 0.6936 l
0.4010 0.6934 l
0.4025 0.6932 l
0.4041 0.6930 l
0.4057 0.6928 l
0.4073 0.6926 l
0.4088 0.6924 l
0.4104 0.6922 l
0.4120 0.6920 l
0.4135 0.6919 l
0.4151 0.6917 l
0.4167 0.6915 l
0.4182 0.6913 l
0.4198 0.6911 l
0.4214 0.6909 l
0.4229 0.6908 l
0.4245 0.6906 l
0.4261 0.6904 l
0.4276 0.6902 l
0.4292 0.6901 l
0.4308 0.6899 l
0.4324 0.6897 l
0.4339 0.6896 l
0.4355 0.6894 l
0.4371 0.6892 l
0.4386 0.6891 l
0.4402 0.6889 l
0.4418 0.6887 l
0.4433 0.6886 l
0.4449 0.6884 l
0.4465 0.6883 l
0.4480 0.6881 l
0.4496 0.6880 l
0.4512 0.6878 l
0.4527 0.6877 l
0.4543 0.6875 l
0.4559 0.6874 l
0.4575 0.6872 l
0.4590 0.6871 l
0.4606 0.6869 l
0.4622 0.6868 l
0.4637 0.6866 l
0.4653 0.6865 l
0.4669 0.6864 l
0.4684 0.6862 l
0.4700 0.6861 l
0.4716 0.6860 l
0.4731 0.6858 l
0.4747 0.6857 l
0.4763 0.6856 l
0.4778 0.6854 l
0.4794 0.6853 l
0.4810 0.6852 l
0.4825 0.6850 l
0.4841 0.6849 l
0.4857 0.6848 l
0.4873 0.6847 l
0.4888 0.6845 l
0.4904 0.6844 l
0.4920 0.6843 l
0.4935 0.6842 l
0.4951 0.6841 l
0.4967 0.6839 l
0.4982 0.6838 l
0.4998 0.6837 l
0.5014 0.6836 l
0.5029 0.6835 l
0.5045 0.6834 l
0.5061 0.6833 l
0.5076 0.6832 l
0.5092 0.6830 l
0.5108 0.6829 l
0.5124 0.6828 l
0.5139 0.6827 l
0.5155 0.6826 l
0.5171 0.6825 l
0.5186 0.6824 l
0.5202 0.6823 l
0.5218 0.6822 l
0.5233 0.6821 l
0.5249 0.6820 l
0.5265 0.6819 l
0.5280 0.6818 l
0.5296 0.6817 l
0.5312 0.6816 l
0.5327 0.6815 l
0.5343 0.6814 l
0.5359 0.6813 l
0.5375 0.6812 l
0.5390 0.6811 l
0.5406 0.6810 l
0.5422 0.6810 l
0.5437 0.6809 l
0.5453 0.6808 l
0.5469 0.6807 l
0.5484 0.6806 l
0.5502 0.6805 l
0.5516 0.6804 l
0.5531 0.6803 l
0.5547 0.6802 l
0.5563 0.6802 l
0.5578 0.6801 l
0.5594 0.6800 l
0.5610 0.6799 l
0.5625 0.6798 l
0.5641 0.6797 l
0.5657 0.6797 l
0.5673 0.6796 l
0.5688 0.6795 l
0.5704 0.6794 l
0.5720 0.6793 l
0.5735 0.6793 l
0.5751 0.6792 l
0.5767 0.6791 l
0.5782 0.6790 l
0.5798 0.6790 l
0.5814 0.6789 l
0.5829 0.6788 l
0.5845 0.6787 l
0.5861 0.6787 l
0.5876 0.6786 l
0.5892 0.6785 l
0.5908 0.6784 l
0.5924 0.6784 l
0.5939 0.6783 l
0.5955 0.6782 l
0.5971 0.6782 l
0.5986 0.6781 l
0.6002 0.6780 l
0.6018 0.6779 l
0.6033 0.6779 l
0.6049 0.6778 l
0.6065 0.6777 l
0.6080 0.6777 l
0.6096 0.6776 l
0.6112 0.6775 l
0.6127 0.6775 l
0.6143 0.6774 l
0.6159 0.6773 l
0.6175 0.6773 l
0.6190 0.6772 l
0.6206 0.6772 l
0.6222 0.6771 l
0.6237 0.6770 l
0.6253 0.6770 l
0.6269 0.6769 l
0.6284 0.6769 l
0.6300 0.6768 l
0.6316 0.6767 l
0.6331 0.6767 l
0.6347 0.6766 l
0.6363 0.6766 l
0.6378 0.6765 l
0.6394 0.6764 l
0.6410 0.6764 l
0.6425 0.6763 l
0.6441 0.6763 l
0.6457 0.6762 l
0.6473 0.6762 l
0.6488 0.6761 l
0.6504 0.6760 l
0.6520 0.6760 l
0.6535 0.6759 l
0.6551 0.6759 l
0.6567 0.6758 l
0.6582 0.6758 l
0.6598 0.6757 l
0.6614 0.6757 l
0.6629 0.6756 l
0.6645 0.6756 l
0.6661 0.6755 l
0.6676 0.6755 l
0.6692 0.6754 l
0.6708 0.6754 l
0.6724 0.6753 l
0.6739 0.6753 l
0.6755 0.6752 l
0.6771 0.6752 l
0.6786 0.6751 l
0.6802 0.6751 l
0.6818 0.6750 l
0.6833 0.6750 l
0.6849 0.6749 l
0.6865 0.6749 l
0.6880 0.6748 l
0.6896 0.6748 l
0.6912 0.6747 l
0.6927 0.6747 l
0.6943 0.6746 l
0.6959 0.6746 l
0.6975 0.6746 l
0.6990 0.6745 l
0.7006 0.6745 l
0.7022 0.6744 l
0.7037 0.6744 l
0.7053 0.6743 l
0.7069 0.6743 l
0.7084 0.6742 l
0.7100 0.6742 l
0.7116 0.6742 l
0.7131 0.6741 l
0.7147 0.6741 l
0.7163 0.6740 l
0.7178 0.6740 l
0.7194 0.6740 l
0.7210 0.6739 l
0.7225 0.6739 l
0.7241 0.6738 l
0.7257 0.6738 l
0.7273 0.6737 l
0.7288 0.6737 l
0.7304 0.6737 l
0.7320 0.6736 l
0.7335 0.6736 l
0.7351 0.6736 l
0.7367 0.6735 l
0.7382 0.6735 l
0.7398 0.6734 l
0.7414 0.6734 l
0.7429 0.6734 l
0.7445 0.6733 l
0.7461 0.6733 l
0.7476 0.6733 l
0.7492 0.6732 l
0.7508 0.6732 l
0.7524 0.6731 l
0.7539 0.6731 l
0.7555 0.6731 l
0.7571 0.6730 l
0.7586 0.6730 l
0.7602 0.6730 l
0.7618 0.6729 l
0.7633 0.6729 l
0.7649 0.6729 l
0.7665 0.6728 l
0.7680 0.6728 l
0.7696 0.6728 l
0.7712 0.6727 l
0.7727 0.6727 l
0.7743 0.6727 l
0.7759 0.6726 l
0.7775 0.6726 l
0.7790 0.6726 l
0.7806 0.6725 l
0.7822 0.6725 l
0.7837 0.6725 l
0.7853 0.6724 l
0.7869 0.6724 l
0.7884 0.6724 l
0.7900 0.6723 l
0.7916 0.6723 l
0.7931 0.6723 l
0.7947 0.6722 l
0.7963 0.6722 l
0.7978 0.6722 l
0.7994 0.6722 l
0.8010 0.6721 l
0.8025 0.6721 l
0.8041 0.6721 l
0.8057 0.6720 l
0.8073 0.6720 l
0.8088 0.6720 l
0.8104 0.6719 l
0.8120 0.6719 l
0.8135 0.6719 l
0.8151 0.6719 l
0.8167 0.6718 l
0.8182 0.6718 l
0.8198 0.6718 l
0.8214 0.6717 l
0.8229 0.6717 l
0.8245 0.6717 l
0.8261 0.6717 l
0.8276 0.6716 l
0.8292 0.6716 l
0.8308 0.6716 l
0.8324 0.6716 l
0.8339 0.6715 l
0.8355 0.6715 l
0.8371 0.6715 l
0.8386 0.6714 l
0.8402 0.6714 l
0.8418 0.6714 l
0.8433 0.6714 l
0.8449 0.6713 l
0.8465 0.6713 l
0.8480 0.6713 l
0.8496 0.6713 l
0.8512 0.6712 l
0.8527 0.6712 l
0.8543 0.6712 l
0.8559 0.6712 l
0.8575 0.6711 l
0.8590 0.6711 l
0.8606 0.6711 l
0.8622 0.6711 l
0.8637 0.6710 l
0.8653 0.6710 l
0.8669 0.6710 l
0.8684 0.6710 l
0.8700 0.6709 l
0.8716 0.6709 l
0.8731 0.6709 l
0.8747 0.6709 l
0.8763 0.6709 l
0.8778 0.6708 l
0.8794 0.6708 l
0.8810 0.6708 l
0.8825 0.6708 l
0.8841 0.6707 l
0.8857 0.6707 l
0.8873 0.6707 l
0.8888 0.6707 l
0.8904 0.6707 l
0.8920 0.6706 l
0.8935 0.6706 l
0.8951 0.6706 l
0.8967 0.6706 l
0.8982 0.6705 l
0.8998 0.6705 l
0.9014 0.6705 l
0.9029 0.6705 l
0.9045 0.6705 l
0.9061 0.6704 l
0.9076 0.6704 l
0.9092 0.6704 l
0.9108 0.6704 l
0.9124 0.6704 l
0.9139 0.6703 l
0.9155 0.6703 l
0.9171 0.6703 l
0.9186 0.6703 l
0.9202 0.6703 l
0.9218 0.6702 l
0.9233 0.6702 l
0.9249 0.6702 l
0.9265 0.6702 l
0.9280 0.6702 l
0.9296 0.6701 l
0.9312 0.6701 l
0.9327 0.6701 l
0.9343 0.6701 l
0.9359 0.6701 l
0.9375 0.6700 l
0.9390 0.6700 l
0.9406 0.6700 l
0.9422 0.6700 l
0.9437 0.6700 l
0.9453 0.6700 l
0.9469 0.6699 l
0.9484 0.6699 l
0.9500 0.6699 l
s
[/DeviceRGB] SCS
Color5 SC
n
0.1500 0.2753 m
0.1516 0.2755 l
0.1531 0.2757 l
0.1547 0.2758 l
0.1563 0.2760 l
0.1578 0.2761 l
0.1594 0.2763 l
0.1610 0.2765 l
0.1625 0.2766 l
0.1641 0.2768 l
0.1657 0.2769 l
0.1673 0.2771 l
0.1688 0.2772 l
0.1704 0.2774 l
0.1720 0.2775 l
0.1735 0.2777 l
0.1751 0.2778 l
0.1767 0.2779 l
0.1782 0.2781 l
0.1798 0.2782 l
0.1814 0.2784 l
0.1829 0.2786 l
0.1845 0.2787 l
0.1861 0.2789 l
0.1876 0.2791 l
0.1892 0.2792 l
0.1908 0.2794 l
0.1924 0.2797 l
0.1939 0.2799 l
0.1955 0.2803 l
0.1971 0.2807 l
0.1986 0.2812 l
0.2002 0.2819 l
0.2018 0.2828 l
0.2033 0.2843 l
0.2049 0.2865 l
0.2065 0.2898 l
0.2080 0.2945 l
0.2096 0.3002 l
0.2112 0.3052 l
0.2127 0.3067 l
0.2143 0.3047 l
0.2159 0.3009 l
0.2175 0.2971 l
0.2190 0.2937 l
0.2206 0.2907 l
0.2222 0.2882 l
0.2237 0.2860 l
0.2253 0.2840 l
0.2269 0.2824 l
0.2284 0.2809 l
0.2300 0.2795 l
0.2316 0.2783 l
0.2331 0.2771 l
0.2347 0.2761 l
0.2363 0.2751 l
0.2378 0.2742 l
0.2394 0.2733 l
0.2410 0.2725 l
0.2425 0.2717 l
0.2441 0.2710 l
0.2457 0.2703 l
0.2473 0.2696 l
0.2488 0.2689 l
0.2504 0.2682 l
0.2520 0.2676 l
0.2535 0.2670 l
0.2551 0.2664 l
0.2567 0.2658 l
0.2582 0.2652 l
0.2598 0.2646 l
0.2614 0.2641 l
0.2629 0.2635 l
0.2645 0.2630 l
0.2661 0.2625 l
0.2676 0.2620 l
0.2692 0.2615 l
0.2708 0.2610 l
0.2724 0.2605 l
0.2739 0.2600 l
0.2755 0.2595 l
0.2771 0.2590 l
0.2786 0.2586 l
0.2802 0.2581 l
0.2818 0.2577 l
0.2833 0.2572 l
0.2849 0.2568 l
0.2865 0.2563 l
0.2880 0.2559 l
0.2896 0.2555 l
0.2912 0.2551 l
0.2927 0.2547 l
0.2943 0.2543 l
0.2959 0.2539 l
0.2975 0.2534 l
0.2990 0.2531 l
0.3006 0.2527 l
0.3022 0.2523 l
0.3037 0.2519 l
0.3053 0.2515 l
0.3069 0.2511 l
0.3084 0.2507 l
0.3100 0.2504 l
0.3116 0.2500 l
0.3131 0.2496 l
0.3147 0.2493 l
0.3163 0.2489 l
0.3178 0.2485 l
0.3194 0.2482 l
0.3210 0.2478 l
0.3225 0.2475 l
0.3241 0.2472 l
0.3257 0.2468 l
0.3273 0.2465 l
0.3288 0.2461 l
0.3304 0.2458 l
0.3320 0.2455 l
0.3335 0.2452 l
0.3351 0.2448 l
0.3367 0.2445 l
0.3382 0.2442 l
0.3398 0.2439 l
0.3414 0.2436 l
0.3429 0.2433 l
0.3445 0.2430 l
0.3461 0.2427 l
0.3476 0.2424 l
0.3492 0.2421 l
0.3508 0.2418 l
0.3524 0.2415 l
0.3539 0.2412 l
0.3555 0.2410 l
0.3571 0.2407 l
0.3586 0.2404 l
0.3602 0.2401 l
0.3618 0.2399 l
0.3633 0.2396 l
0.3649 0.2393 l
0.3665 0.2391 l
0.3680 0.2388 l
0.3696 0.2385 l
0.3712 0.2383 l
0.3727 0.2380 l
0.3743 0.2378 l
0.3759 0.2375 l
0.3775 0.2373 l
0.3790 0.2370 l
0.3806 0.2368 l
0.3822 0.2366 l
0.3837 0.2363 l
0.3853 0.2361 l
0.3869 0.2359 l
0.3884 0.2356 l
0.3900 0.2354 l
0.3916 0.2352 l
0.3931 0.2349 l
0.3947 0.2347 l
0.3963 0.2345 l
0.3978 0.2343 l
0.3994 0.2341 l
0.4010 0.2339 l
0.4025 0.2337 l
0.4041 0.2334 l
0.4057 0.2332 l
0.4073 0.2330 l
0.4088 0.2328 l
0.4104 0.2326 l
0.4120 0.2324 l
0.4135 0.2322 l
0.4151 0.2320 l
0.4167 0.2318 l
0.4182 0.2317 l
0.4198 0.2315 l
0.4214 0.2313 l
0.4229 0.2311 l
0.4245 0.2309 l
0.4261 0.2307 l
0.4276 0.2305 l
0.4292 0.2304 l
0.4308 0.2302 l
0.4324 0.2300 l
0.4339 0.2298 l
0.4355 0.2297 l
0.4371 0.2295 l
0.4386 0.2293 l
0.4402 0.2291 l
0.4418 0.2290 l
0.4433 0.2288 l
0.4449 0.2287 l
0.4465 0.2285 l
0.4480 0.2283 l
0.4496 0.2282 l
0.4512 0.2280 l
0.4527 0.2279 l
0.4543 0.2277 l
0.4559 0.2275 l
0.4575 0.2274 l
0.4590 0.2272 l
0.4606 0.2271 l
0.4622 0.2269 l
0.4637 0.2268 l
0.4653 0.2266 l
0.4669 0.2265 l
0.4684 0.2264 l
0.4700 0.2262 l
0.4716 0.2261 l
0.4731 0.2259 l
0.4747 0.2258 l
0.4763 0.2257 l
0.4778 0.2255 l
0.4794 0.2254 l
0.4810 0.2252 l
0.4825 0.2251 l
0.4841 0.2250 l
0.4857 0.2249 l
0.4873 0.2247 l
0.4888 0.2246 l
0.4904 0.2245 l
0.4920 0.2243 l
0.4935 0.2242 l
0.4951 0.2241 l
0.4967 0.2240 l
0.4982 0.2239 l
0.4998 0.2237 l
0.5014 0.2236 l
0.5029 0.2235 l
0.5045 0.2234 l
0.5061 0.2233 l
0.5076 0.2232 l
0.5092 0.2230 l
0.5108 0.2229 l
0.5124 0.2228 l
0.5139 0.2227 l
0.5155 0.2226 l
0.5171 0.2225 l
0.5186 0.2224 l
0.5202 0.2223 l
0.5218 0.2222 l
0.5233 0.2221 l
0.5249 0.2219 l
0.5265 0.2218 l
0.5280 0.2217 l
0.5296 0.2216 l
0.5312 0.2215 l
0.5327 0.2214 l
0.5343 0.2213 l
0.5359 0.2212 l
0.5375 0.2211 l
0.5390 0.2210 l
0.5406 0.2209 l
0.5422 0.2209 l
0.5437 0.2208 l
0.5453 0.2207 l
0.5469 0.2206 l
0.5484 0.2205 l
0.5502 0.2204 l
0.5516 0.2203 l
0.5531 0.2202 l
0.5547 0.2201 l
0.5563 0.2200 l
0.5578 0.2199 l
0.5594 0.2198 l
0.5610 0.2198 l
0.5625 0.2197 l
0.5641 0.2196 l
0.5657 0.2195 l
0.5673 0.2194 l
0.5688 0.2193 l
0.5704 0.2192 l
0.5720 0.2192 l
0.5735 0.2191 l
0.5751 0.2190 l
0.5767 0.2189 l
0.5782 0.2188 l
0.5798 0.2188 l
0.5814 0.2187 l
0.5829 0.2186 l
0.5845 0.2185 l
0.5861 0.2185 l
0.5876 0.2184 l
0.5892 0.2183 l
0.5908 0.2182 l
0.5924 0.2181 l
0.5939 0.2181 l
0.5955 0.2180 l
0.5971 0.2179 l
0.5986 0.2179 l
0.6002 0.2178 l
0.6018 0.2177 l
0.6033 0.2176 l
0.6049 0.2176 l
0.6065 0.2175 l
0.6080 0.2174 l
0.6096 0.2174 l
0.6112 0.2173 l
0.6127 0.2172 l
0.6143 0.2172 l
0.6159 0.2171 l
0.6175 0.2170 l
0.6190 0.2170 l
0.6206 0.2169 l
0.6222 0.2168 l
0.6237 0.2168 l
0.6253 0.2167 l
0.6269 0.2166 l
0.6284 0.2166 l
0.6300 0.2165 l
0.6316 0.2164 l
0.6331 0.2164 l
0.6347 0.2163 l
0.6363 0.2163 l
0.6378 0.2162 l
0.6394 0.2161 l
0.6410 0.2161 l
0.6425 0.2160 l
0.6441 0.2160 l
0.6457 0.2159 l
0.6473 0.2158 l
0.6488 0.2158 l
0.6504 0.2157 l
0.6520 0.2157 l
0.6535 0.2156 l
0.6551 0.2156 l
0.6567 0.2155 l
0.6582 0.2154 l
0.6598 0.2154 l
0.6614 0.2153 l
0.6629 0.2153 l
0.6645 0.2152 l
0.6661 0.2152 l
0.6676 0.2151 l
0.6692 0.2151 l
0.6708 0.2150 l
0.6724 0.2150 l
0.6739 0.2149 l
0.6755 0.2149 l
0.6771 0.2148 l
0.6786 0.2148 l
0.6802 0.2147 l
0.6818 0.2146 l
0.6833 0.2146 l
0.6849 0.2145 l
0.6865 0.2145 l
0.6880 0.2145 l
0.6896 0.2144 l
0.6912 0.2144 l
0.6927 0.2143 l
0.6943 0.2143 l
0.6959 0.2142 l
0.6975 0.2142 l
0.6990 0.2141 l
0.7006 0.2141 l
0.7022 0.2140 l
0.7037 0.2140 l
0.7053 0.2139 l
0.7069 0.2139 l
0.7084 0.2138 l
0.7100 0.2138 l
0.7116 0.2138 l
0.7131 0.2137 l
0.7147 0.2137 l
0.7163 0.2136 l
0.7178 0.2136 l
0.7194 0.2135 l
0.7210 0.2135 l
0.7225 0.2135 l
0.7241 0.2134 l
0.7257 0.2134 l
0.7273 0.2133 l
0.7288 0.2133 l
0.7304 0.2132 l
0.7320 0.2132 l
0.7335 0.2132 l
0.7351 0.2131 l
0.7367 0.2131 l
0.7382 0.2130 l
0.7398 0.2130 l
0.7414 0.2130 l
0.7429 0.2129 l
0.7445 0.2129 l
0.7461 0.2128 l
0.7476 0.2128 l
0.7492 0.2128 l
0.7508 0.2127 l
0.7524 0.2127 l
0.7539 0.2127 l
0.7555 0.2126 l
0.7571 0.2126 l
0.7586 0.2125 l
0.7602 0.2125 l
0.7618 0.2125 l
0.7633 0.2124 l
0.7649 0.2124 l
0.7665 0.2124 l
0.7680 0.2123 l
0.7696 0.2123 l
0.7712 0.2123 l
0.7727 0.2122 l
0.7743 0.2122 l
0.7759 0.2122 l
0.7775 0.2121 l
0.7790 0.2121 l
0.7806 0.2120 l
0.7822 0.2120 l
0.7837 0.2120 l
0.7853 0.2119 l
0.7869 0.2119 l
0.7884 0.2119 l
0.7900 0.2118 l
0.7916 0.2118 l
0.7931 0.2118 l
0.7947 0.2118 l
0.7963 0.2117 l
0.7978 0.2117 l
0.7994 0.2117 l
0.8010 0.2116 l
0.8025 0.2116 l
0.8041 0.2116 l
0.8057 0.2115 l
0.8073 0.2115 l
0.8088 0.2115 l
0.8104 0.2114 l
0.8120 0.2114 l
0.8135 0.2114 l
0.8151 0.2113 l
0.8167 0.2113 l
0.8182 0.2113 l
0.8198 0.2113 l
0.8214 0.2112 l
0.8229 0.2112 l
0.8245 0.2112 l
0.8261 0.2111 l
0.8276 0.2111 l
0.8292 0.2111 l
0.8308 0.2111 l
0.8324 0.2110 l
0.8339 0.2110 l
0.8355 0.2110 l
0.8371 0.2109 l
0.8386 0.2109 l
0.8402 0.2109 l
0.8418 0.2109 l
0.8433 0.2108 l
0.8449 0.2108 l
0.8465 0.2108 l
0.8480 0.2108 l
0.8496 0.2107 l
0.8512 0.2107 l
0.8527 0.2107 l
0.8543 0.2107 l
0.8559 0.2106 l
0.8575 0.2106 l
0.8590 0.2106 l
0.8606 0.2105 l
0.8622 0.2105 l
0.8637 0.2105 l
0.8653 0.2105 l
0.8669 0.2104 l
0.8684 0.2104 l
0.8700 0.2104 l
0.8716 0.2104 l
0.8731 0.2104 l
0.8747 0.2103 l
0.8763 0.2103 l
0.8778 0.2103 l
0.8794 0.2103 l
0.8810 0.2102 l
0.8825 0.2102 l
0.8841 0.2102 l
0.8857 0.2102 l
0.8873 0.2101 l
0.8888 0.2101 l
0.8904 0.2101 l
0.8920 0.2101 l
0.8935 0.2100 l
0.8951 0.2100 l
0.8967 0.2100 l
0.8982 0.2100 l
0.8998 0.2100 l
0.9014 0.2099 l
0.9029 0.2099 l
0.9045 0.2099 l
0.9061 0.2099 l
0.9076 0.2098 l
0.9092 0.2098 l
0.9108 0.2098 l
0.9124 0.2098 l
0.9139 0.2098 l
0.9155 0.2097 l
0.9171 0.2097 l
0.9186 0.2097 l
0.9202 0.2097 l
0.9218 0.2097 l
0.9233 0.2096 l
0.9249 0.2096 l
0.9265 0.2096 l
0.9280 0.2096 l
0.9296 0.2096 l
0.9312 0.2095 l
0.9327 0.2095 l
0.9343 0.2095 l
0.9359 0.2095 l
0.9375 0.2095 l
0.9390 0.2094 l
0.9406 0.2094 l
0.9422 0.2094 l
0.9437 0.2094 l
0.9453 0.2094 l
0.9469 0.2093 l
0.9484 0.2093 l
0.9500 0.2093 l
s
[/DeviceRGB] SCS
Color6 SC
n
0.2090 0.1499 m
0.2096 0.1696 l
0.2112 0.2200 l
0.2127 0.2681 l
0.2143 0.3100 l
0.2159 0.3450 l
0.2175 0.3746 l
0.2190 0.4000 l
0.2206 0.4222 l
0.2222 0.4417 l
0.2237 0.4591 l
0.2253 0.4747 l
0.2269 0.4888 l
0.2284 0.5016 l
0.2300 0.5134 l
0.2316 0.5242 l
0.2331 0.5342 l
0.2347 0.5435 l
0.2363 0.5522 l
0.2378 0.5603 l
0.2394 0.5679 l
0.2410 0.5750 l
0.2425 0.5818 l
0.2441 0.5881 l
0.2457 0.5941 l
0.2473 0.5999 l
0.2488 0.6053 l
0.2504 0.6104 l
0.2520 0.6153 l
0.2535 0.6199 l
0.2551 0.6244 l
0.2567 0.6286 l
0.2582 0.6327 l
0.2598 0.6366 l
0.2614 0.6404 l
0.2629 0.6440 l
0.2645 0.6475 l
0.2661 0.6508 l
0.2676 0.6540 l
0.2692 0.6571 l
0.2708 0.6601 l
0.2724 0.6630 l
0.2739 0.6658 l
0.2755 0.6685 l
0.2771 0.6711 l
0.2786 0.6736 l
0.2802 0.6760 l
0.2818 0.6783 l
0.2833 0.6805 l
0.2849 0.6827 l
0.2865 0.6848 l
0.2880 0.6869 l
0.2896 0.6889 l
0.2912 0.6908 l
0.2927 0.6928 l
0.2943 0.6947 l
0.2959 0.6965 l
0.2975 0.6983 l
0.2990 0.7000 l
0.3006 0.7016 l
0.3022 0.7032 l
0.3037 0.7048 l
0.3053 0.7063 l
0.3069 0.7078 l
0.3084 0.7093 l
0.3100 0.7107 l
0.3116 0.7120 l
0.3131 0.7134 l
0.3147 0.7147 l
0.3163 0.7160 l
0.3178 0.7172 l
0.3194 0.7184 l
0.3210 0.7196 l
0.3225 0.7208 l
0.3241 0.7219 l
0.3257 0.7230 l
0.3273 0.7241 l
0.3288 0.7251 l
0.3304 0.7262 l
0.3320 0.7272 l
0.3335 0.7281 l
0.3351 0.7291 l
0.3367 0.7301 l
0.3382 0.7310 l
0.3398 0.7319 l
0.3414 0.7328 l
0.3429 0.7336 l
0.3445 0.7345 l
0.3461 0.7353 l
0.3476 0.7361 l
0.3492 0.7369 l
0.3508 0.7377 l
0.3524 0.7385 l
0.3539 0.7392 l
0.3555 0.7400 l
0.3571 0.7407 l
0.3586 0.7414 l
0.3602 0.7421 l
0.3618 0.7428 l
0.3633 0.7434 l
0.3649 0.7441 l
0.3665 0.7447 l
0.3680 0.7454 l
0.3696 0.7460 l
0.3712 0.7466 l
0.3727 0.7472 l
0.3743 0.7478 l
0.3759 0.7484 l
0.3775 0.7489 l
0.3790 0.7495 l
0.3806 0.7501 l
0.3822 0.7506 l
0.3837 0.7511 l
0.3853 0.7516 l
0.3869 0.7522 l
0.3884 0.7527 l
0.3900 0.7532 l
0.3916 0.7536 l
0.3931 0.7541 l
0.3947 0.7546 l
0.3963 0.7551 l
0.3978 0.7555 l
0.3994 0.7560 l
0.4010 0.7564 l
0.4025 0.7568 l
0.4041 0.7573 l
0.4057 0.7577 l
0.4073 0.7581 l
0.4088 0.7585 l
0.4104 0.7589 l
0.4120 0.7593 l
0.4135 0.7597 l
0.4151 0.7601 l
0.4167 0.7604 l
0.4182 0.7608 l
0.4198 0.7612 l
0.4214 0.7615 l
0.4229 0.7619 l
0.4245 0.7622 l
0.4261 0.7626 l
0.4276 0.7629 l
0.4292 0.7633 l
0.4308 0.7636 l
0.4324 0.7639 l
0.4339 0.7642 l
0.4355 0.7646 l
0.4371 0.7649 l
0.4386 0.7652 l
0.4402 0.7655 l
0.4418 0.7658 l
0.4433 0.7661 l
0.4449 0.7664 l
0.4465 0.7666 l
0.4480 0.7669 l
0.4496 0.7672 l
0.4512 0.7675 l
0.4527 0.7678 l
0.4543 0.7680 l
0.4559 0.7683 l
0.4575 0.7686 l
0.4590 0.7688 l
0.4606 0.7691 l
0.4622 0.7693 l
0.4637 0.7696 l
0.4653 0.7698 l
0.4669 0.7701 l
0.4684 0.7703 l
0.4700 0.7705 l
0.4716 0.7708 l
0.4731 0.7710 l
0.4747 0.7712 l
0.4763 0.7715 l
0.4778 0.7717 l
0.4794 0.7719 l
0.4810 0.7721 l
0.4825 0.7723 l
0.4841 0.7725 l
0.4857 0.7727 l
0.4873 0.7730 l
0.4888 0.7732 l
0.4904 0.7734 l
0.4920 0.7736 l
0.4935 0.7737 l
0.4951 0.7739 l
0.4967 0.7741 l
0.4982 0.7743 l
0.4998 0.7745 l
0.5014 0.7747 l
0.5029 0.7749 l
0.5045 0.7750 l
0.5061 0.7752 l
0.5076 0.7754 l
0.5092 0.7756 l
0.5108 0.7757 l
0.5124 0.7759 l
0.5139 0.7761 l
0.5155 0.7762 l
0.5171 0.7764 l
0.5186 0.7766 l
0.5202 0.7767 l
0.5218 0.7769 l
0.5233 0.7771 l
0.5249 0.7772 l
0.5265 0.7774 l
0.5280 0.7775 l
0.5296 0.7777 l
0.5312 0.7778 l
0.5327 0.7780 l
0.5343 0.7781 l
0.5359 0.7782 l
0.5375 0.7784 l
0.5390 0.7785 l
0.5406 0.7787 l
0.5422 0.7788 l
0.5437 0.7789 l
0.5453 0.7791 l
0.5469 0.7792 l
0.5484 0.7793 l
0.5502 0.7795 l
0.5516 0.7796 l
0.5531 0.7797 l
0.5547 0.7799 l
0.5563 0.7800 l
0.5578 0.7801 l
0.5594 0.7802 l
0.5610 0.7804 l
0.5625 0.7805 l
0.5641 0.7806 l
0.5657 0.7807 l
0.5673 0.7808 l
0.5688 0.7809 l
0.5704 0.7811 l
0.5720 0.7812 l
0.5735 0.7813 l
0.5751 0.7814 l
0.5767 0.7815 l
0.5782 0.7816 l
0.5798 0.7817 l
0.5814 0.7818 l
0.5829 0.7819 l
0.5845 0.7820 l
0.5861 0.7821 l
0.5876 0.7823 l
0.5892 0.7824 l
0.5908 0.7825 l
0.5924 0.7826 l
0.5939 0.7827 l
0.5955 0.7828 l
0.5971 0.7829 l
0.5986 0.7830 l
0.6002 0.7830 l
0.6018 0.7831 l
0.6033 0.7832 l
0.6049 0.7833 l
0.6065 0.7834 l
0.6080 0.7835 l
0.6096 0.7836 l
0.6112 0.7837 l
0.6127 0.7838 l
0.6143 0.7839 l
0.6159 0.7840 l
0.6175 0.7841 l
0.6190 0.7841 l
0.6206 0.7842 l
0.6222 0.7843 l
0.6237 0.7844 l
0.6253 0.7845 l
0.6269 0.7846 l
0.6284 0.7846 l
0.6300 0.7847 l
0.6316 0.7848 l
0.6331 0.7849 l
0.6347 0.7850 l
0.6363 0.7850 l
0.6378 0.7851 l
0.6394 0.7852 l
0.6410 0.7853 l
0.6425 0.7853 l
0.6441 0.7854 l
0.6457 0.7855 l
0.6473 0.7856 l
0.6488 0.7856 l
0.6504 0.7857 l
0.6520 0.7858 l
0.6535 0.7859 l
0.6551 0.7859 l
0.6567 0.7860 l
0.6582 0.7861 l
0.6598 0.7861 l
0.6614 0.7862 l
0.6629 0.7863 l
0.6645 0.7863 l
0.6661 0.7864 l
0.6676 0.7865 l
0.6692 0.7865 l
0.6708 0.7866 l
0.6724 0.7867 l
0.6739 0.7867 l
0.6755 0.7868 l
0.6771 0.7869 l
0.6786 0.7869 l
0.6802 0.7870 l
0.6818 0.7871 l
0.6833 0.7871 l
0.6849 0.7872 l
0.6865 0.7872 l
0.6880 0.7873 l
0.6896 0.7874 l
0.6912 0.7874 l
0.6927 0.7875 l
0.6943 0.7875 l
0.6959 0.7876 l
0.6975 0.7877 l
0.6990 0.7877 l
0.7006 0.7878 l
0.7022 0.7878 l
0.7037 0.7879 l
0.7053 0.7879 l
0.7069 0.7880 l
0.7084 0.7880 l
0.7100 0.7881 l
0.7116 0.7882 l
0.7131 0.7882 l
0.7147 0.7883 l
0.7163 0.7883 l
0.7178 0.7884 l
0.7194 0.7884 l
0.7210 0.7885 l
0.7225 0.7885 l
0.7241 0.7886 l
0.7257 0.7886 l
0.7273 0.7887 l
0.7288 0.7887 l
0.7304 0.7888 l
0.7320 0.7888 l
0.7335 0.7889 l
0.7351 0.7889 l
0.7367 0.7890 l
0.7382 0.7890 l
0.7398 0.7891 l
0.7414 0.7891 l
0.7429 0.7891 l
0.7445 0.7892 l
0.7461 0.7892 l
0.7476 0.7893 l
0.7492 0.7893 l
0.7508 0.7894 l
0.7524 0.7894 l
0.7539 0.7895 l
0.7555 0.7895 l
0.7571 0.7896 l
0.7586 0.7896 l
0.7602 0.7896 l
0.7618 0.7897 l
0.7633 0.7897 l
0.7649 0.7898 l
0.7665 0.7898 l
0.7680 0.7899 l
0.7696 0.7899 l
0.7712 0.7899 l
0.7727 0.7900 l
0.7743 0.7900 l
0.7759 0.7901 l
0.7775 0.7901 l
0.7790 0.7901 l
0.7806 0.7902 l
0.7822 0.7902 l
0.7837 0.7903 l
0.7853 0.7903 l
0.7869 0.7903 l
0.7884 0.7904 l
0.7900 0.7904 l
0.7916 0.7904 l
0.7931 0.7905 l
0.7947 0.7905 l
0.7963 0.7906 l
0.7978 0.7906 l
0.7994 0.7906 l
0.8010 0.7907 l
0.8025 0.7907 l
0.8041 0.7907 l
0.8057 0.7908 l
0.8073 0.7908 l
0.8088 0.7908 l
0.8104 0.7909 l
0.8120 0.7909 l
0.8135 0.7909 l
0.8151 0.7910 l
0.8167 0.7910 l
0.8182 0.7910 l
0.8198 0.7911 l
0.8214 0.7911 l
0.8229 0.7911 l
0.8245 0.7912 l
0.8261 0.7912 l
0.8276 0.7912 l
0.8292 0.7913 l
0.8308 0.7913 l
0.8324 0.7913 l
0.8339 0.7914 l
0.8355 0.7914 l
0.8371 0.7914 l
0.8386 0.7915 l
0.8402 0.7915 l
0.8418 0.7915 l
0.8433 0.7916 l
0.8449 0.7916 l
0.8465 0.7916 l
0.8480 0.7917 l
0.8496 0.7917 l
0.8512 0.7917 l
0.8527 0.7917 l
0.8543 0.7918 l
0.8559 0.7918 l
0.8575 0.7918 l
0.8590 0.7919 l
0.8606 0.7919 l
0.8622 0.7919 l
0.8637 0.7919 l
0.8653 0.7920 l
0.8669 0.7920 l
0.8684 0.7920 l
0.8700 0.7921 l
0.8716 0.7921 l
0.8731 0.7921 l
0.8747 0.7921 l
0.8763 0.7922 l
0.8778 0.7922 l
0.8794 0.7922 l
0.8810 0.7922 l
0.8825 0.7923 l
0.8841 0.7923 l
0.8857 0.7923 l
0.8873 0.7923 l
0.8888 0.7924 l
0.8904 0.7924 l
0.8920 0.7924 l
0.8935 0.7924 l
0.8951 0.7925 l
0.8967 0.7925 l
0.8982 0.7925 l
0.8998 0.7925 l
0.9014 0.7926 l
0.9029 0.7926 l
0.9045 0.7926 l
0.9061 0.7926 l
0.9076 0.7927 l
0.9092 0.7927 l
0.9108 0.7927 l
0.9124 0.7927 l
0.9139 0.7928 l
0.9155 0.7928 l
0.9171 0.7928 l
0.9186 0.7928 l
0.9202 0.7929 l
0.9218 0.7929 l
0.9233 0.7929 l
0.9249 0.7929 l
0.9265 0.7929 l
0.9280 0.7930 l
0.9296 0.7930 l
0.9312 0.7930 l
0.9327 0.7930 l
0.9343 0.7931 l
0.9359 0.7931 l
0.9375 0.7931 l
0.9390 0.7931 l
0.9406 0.7931 l
0.9422 0.7932 l
0.9437 0.7932 l
0.9453 0.7932 l
0.9469 0.7932 l
0.9484 0.7932 l
0.9500 0.7933 l
s
[/DeviceRGB] SCS
Color7 SC
n
0.2146 0.1499 m
0.2159 0.1785 l
0.2175 0.2083 l
0.2190 0.2340 l
0.2206 0.2562 l
0.2222 0.2759 l
0.2237 0.2933 l
0.2253 0.3090 l
0.2269 0.3231 l
0.2284 0.3360 l
0.2300 0.3478 l
0.2316 0.3587 l
0.2331 0.3687 l
0.2347 0.3780 l
0.2363 0.3867 l
0.2378 0.3948 l
0.2394 0.4025 l
0.2410 0.4096 l
0.2425 0.4164 l
0.2441 0.4227 l
0.2457 0.4288 l
0.2473 0.4345 l
0.2488 0.4399 l
0.2504 0.4450 l
0.2520 0.4499 l
0.2535 0.4546 l
0.2551 0.4590 l
0.2567 0.4633 l
0.2582 0.4674 l
0.2598 0.4713 l
0.2614 0.4751 l
0.2629 0.4787 l
0.2645 0.4821 l
0.2661 0.4855 l
0.2676 0.4887 l
0.2692 0.4918 l
0.2708 0.4948 l
0.2724 0.4977 l
0.2739 0.5004 l
0.2755 0.5031 l
0.2771 0.5057 l
0.2786 0.5082 l
0.2802 0.5106 l
0.2818 0.5129 l
0.2833 0.5152 l
0.2849 0.5174 l
0.2865 0.5195 l
0.2880 0.5216 l
0.2896 0.5236 l
0.2912 0.5255 l
0.2927 0.5275 l
0.2943 0.5293 l
0.2959 0.5312 l
0.2975 0.5329 l
0.2990 0.5346 l
0.3006 0.5363 l
0.3022 0.5379 l
0.3037 0.5395 l
0.3053 0.5410 l
0.3069 0.5425 l
0.3084 0.5439 l
0.3100 0.5453 l
0.3116 0.5467 l
0.3131 0.5480 l
0.3147 0.5494 l
0.3163 0.5506 l
0.3178 0.5519 l
0.3194 0.5531 l
0.3210 0.5543 l
0.3225 0.5554 l
0.3241 0.5566 l
0.3257 0.5577 l
0.3273 0.5587 l
0.3288 0.5598 l
0.3304 0.5608 l
0.3320 0.5618 l
0.3335 0.5628 l
0.3351 0.5638 l
0.3367 0.5647 l
0.3382 0.5657 l
0.3398 0.5666 l
0.3414 0.5674 l
0.3429 0.5683 l
0.3445 0.5692 l
0.3461 0.5700 l
0.3476 0.5708 l
0.3492 0.5716 l
0.3508 0.5724 l
0.3524 0.5732 l
0.3539 0.5739 l
0.3555 0.5746 l
0.3571 0.5754 l
0.3586 0.5761 l
0.3602 0.5768 l
0.3618 0.5774 l
0.3633 0.5781 l
0.3649 0.5788 l
0.3665 0.5794 l
0.3680 0.5801 l
0.3696 0.5807 l
0.3712 0.5813 l
0.3727 0.5819 l
0.3743 0.5825 l
0.3759 0.5831 l
0.3775 0.5836 l
0.3790 0.5842 l
0.3806 0.5847 l
0.3822 0.5853 l
0.3837 0.5858 l
0.3853 0.5863 l
0.3869 0.5868 l
0.3884 0.5873 l
0.3900 0.5878 l
0.3916 0.5883 l
0.3931 0.5888 l
0.3947 0.5893 l
0.3963 0.5897 l
0.3978 0.5902 l
0.3994 0.5906 l
0.4010 0.5911 l
0.4025 0.5915 l
0.4041 0.5919 l
0.4057 0.5923 l
0.4073 0.5928 l
0.4088 0.5932 l
0.4104 0.5936 l
0.4120 0.5940 l
0.4135 0.5943 l
0.4151 0.5947 l
0.4167 0.5951 l
0.4182 0.5955 l
0.4198 0.5958 l
0.4214 0.5962 l
0.4229 0.5966 l
0.4245 0.5969 l
0.4261 0.5972 l
0.4276 0.5976 l
0.4292 0.5979 l
0.4308 0.5983 l
0.4324 0.5986 l
0.4339 0.5989 l
0.4355 0.5992 l
0.4371 0.5995 l
0.4386 0.5998 l
0.4402 0.6001 l
0.4418 0.6004 l
0.4433 0.6007 l
0.4449 0.6010 l
0.4465 0.6013 l
0.4480 0.6016 l
0.4496 0.6019 l
0.4512 0.6021 l
0.4527 0.6024 l
0.4543 0.6027 l
0.4559 0.6029 l
0.4575 0.6032 l
0.4590 0.6035 l
0.4606 0.6037 l
0.4622 0.6040 l
0.4637 0.6042 l
0.4653 0.6045 l
0.4669 0.6047 l
0.4684 0.6049 l
0.4700 0.6052 l
0.4716 0.6054 l
0.4731 0.6056 l
0.4747 0.6059 l
0.4763 0.6061 l
0.4778 0.6063 l
0.4794 0.6066 l
0.4810 0.6068 l
0.4825 0.6070 l
0.4841 0.6072 l
0.4857 0.6074 l
0.4873 0.6076 l
0.4888 0.6078 l
0.4904 0.6080 l
0.4920 0.6082 l
0.4935 0.6084 l
0.4951 0.6086 l
0.4967 0.6088 l
0.4982 0.6090 l
0.4998 0.6091 l
0.5014 0.6093 l
0.5029 0.6095 l
0.5045 0.6097 l
0.5061 0.6099 l
0.5076 0.6100 l
0.5092 0.6102 l
0.5108 0.6104 l
0.5124 0.6106 l
0.5139 0.6107 l
0.5155 0.6109 l
0.5171 0.6111 l
0.5186 0.6112 l
0.5202 0.6114 l
0.5218 0.6115 l
0.5233 0.6117 l
0.5249 0.6118 l
0.5265 0.6120 l
0.5280 0.6122 l
0.5296 0.6123 l
0.5312 0.6125 l
0.5327 0.6126 l
0.5343 0.6127 l
0.5359 0.6129 l
0.5375 0.6130 l
0.5390 0.6132 l
0.5406 0.6133 l
0.5422 0.6134 l
0.5437 0.6136 l
0.5453 0.6137 l
0.5469 0.6138 l
0.5484 0.6140 l
0.5502 0.6141 l
0.5516 0.6142 l
0.5531 0.6144 l
0.5547 0.6145 l
0.5563 0.6146 l
0.5578 0.6147 l
0.5594 0.6149 l
0.5610 0.6150 l
0.5625 0.6151 l
0.5641 0.6152 l
0.5657 0.6153 l
0.5673 0.6155 l
0.5688 0.6156 l
0.5704 0.6157 l
0.5720 0.6158 l
0.5735 0.6159 l
0.5751 0.6160 l
0.5767 0.6161 l
0.5782 0.6162 l
0.5798 0.6164 l
0.5814 0.6165 l
0.5829 0.6166 l
0.5845 0.6167 l
0.5861 0.6168 l
0.5876 0.6169 l
0.5892 0.6170 l
0.5908 0.6171 l
0.5924 0.6172 l
0.5939 0.6173 l
0.5955 0.6174 l
0.5971 0.6175 l
0.5986 0.6176 l
0.6002 0.6177 l
0.6018 0.6178 l
0.6033 0.6179 l
0.6049 0.6180 l
0.6065 0.6180 l
0.6080 0.6181 l
0.6096 0.6182 l
0.6112 0.6183 l
0.6127 0.6184 l
0.6143 0.6185 l
0.6159 0.6186 l
0.6175 0.6187 l
0.6190 0.6188 l
0.6206 0.6188 l
0.6222 0.6189 l
0.6237 0.6190 l
0.6253 0.6191 l
0.6269 0.6192 l
0.6284 0.6193 l
0.6300 0.6193 l
0.6316 0.6194 l
0.6331 0.6195 l
0.6347 0.6196 l
0.6363 0.6197 l
0.6378 0.6197 l
0.6394 0.6198 l
0.6410 0.6199 l
0.6425 0.6200 l
0.6441 0.6200 l
0.6457 0.6201 l
0.6473 0.6202 l
0.6488 0.6203 l
0.6504 0.6203 l
0.6520 0.6204 l
0.6535 0.6205 l
0.6551 0.6205 l
0.6567 0.6206 l
0.6582 0.6207 l
0.6598 0.6208 l
0.6614 0.6208 l
0.6629 0.6209 l
0.6645 0.6210 l
0.6661 0.6210 l
0.6676 0.6211 l
0.6692 0.6212 l
0.6708 0.6212 l
0.6724 0.6213 l
0.6739 0.6214 l
0.6755 0.6214 l
0.6771 0.6215 l
0.6786 0.6215 l
0.6802 0.6216 l
0.6818 0.6217 l
0.6833 0.6217 l
0.6849 0.6218 l
0.6865 0.6219 l
0.6880 0.6219 l
0.6896 0.6220 l
0.6912 0.6220 l
0.6927 0.6221 l
0.6943 0.6221 l
0.6959 0.6222 l
0.6975 0.6223 l
0.6990 0.6223 l
0.7006 0.6224 l
0.7022 0.6224 l
0.7037 0.6225 l
0.7053 0.6225 l
0.7069 0.6226 l
0.7084 0.6226 l
0.7100 0.6227 l
0.7116 0.6228 l
0.7131 0.6228 l
0.7147 0.6229 l
0.7163 0.6229 l
0.7178 0.6230 l
0.7194 0.6230 l
0.7210 0.6231 l
0.7225 0.6231 l
0.7241 0.6232 l
0.7257 0.6232 l
0.7273 0.6233 l
0.7288 0.6233 l
0.7304 0.6234 l
0.7320 0.6234 l
0.7335 0.6235 l
0.7351 0.6235 l
0.7367 0.6236 l
0.7382 0.6236 l
0.7398 0.6237 l
0.7414 0.6237 l
0.7429 0.6237 l
0.7445 0.6238 l
0.7461 0.6238 l
0.7476 0.6239 l
0.7492 0.6239 l
0.7508 0.6240 l
0.7524 0.6240 l
0.7539 0.6241 l
0.7555 0.6241 l
0.7571 0.6242 l
0.7586 0.6242 l
0.7602 0.6242 l
0.7618 0.6243 l
0.7633 0.6243 l
0.7649 0.6244 l
0.7665 0.6244 l
0.7680 0.6244 l
0.7696 0.6245 l
0.7712 0.6245 l
0.7727 0.6246 l
0.7743 0.6246 l
0.7759 0.6246 l
0.7775 0.6247 l
0.7790 0.6247 l
0.7806 0.6248 l
0.7822 0.6248 l
0.7837 0.6248 l
0.7853 0.6249 l
0.7869 0.6249 l
0.7884 0.6250 l
0.7900 0.6250 l
0.7916 0.6250 l
0.7931 0.6251 l
0.7947 0.6251 l
0.7963 0.6251 l
0.7978 0.6252 l
0.7994 0.6252 l
0.8010 0.6253 l
0.8025 0.6253 l
0.8041 0.6253 l
0.8057 0.6254 l
0.8073 0.6254 l
0.8088 0.6254 l
0.8104 0.6255 l
0.8120 0.6255 l
0.8135 0.6255 l
0.8151 0.6256 l
0.8167 0.6256 l
0.8182 0.6256 l
0.8198 0.6257 l
0.8214 0.6257 l
0.8229 0.6257 l
0.8245 0.6258 l
0.8261 0.6258 l
0.8276 0.6258 l
0.8292 0.6259 l
0.8308 0.6259 l
0.8324 0.6259 l
0.8339 0.6260 l
0.8355 0.6260 l
0.8371 0.6260 l
0.8386 0.6261 l
0.8402 0.6261 l
0.8418 0.6261 l
0.8433 0.6261 l
0.8449 0.6262 l
0.8465 0.6262 l
0.8480 0.6262 l
0.8496 0.6263 l
0.8512 0.6263 l
0.8527 0.6263 l
0.8543 0.6264 l
0.8559 0.6264 l
0.8575 0.6264 l
0.8590 0.6264 l
0.8606 0.6265 l
0.8622 0.6265 l
0.8637 0.6265 l
0.8653 0.6266 l
0.8669 0.6266 l
0.8684 0.6266 l
0.8700 0.6266 l
0.8716 0.6267 l
0.8731 0.6267 l
0.8747 0.6267 l
0.8763 0.6267 l
0.8778 0.6268 l
0.8794 0.6268 l
0.8810 0.6268 l
0.8825 0.6268 l
0.8841 0.6269 l
0.8857 0.6269 l
0.8873 0.6269 l
0.8888 0.6269 l
0.8904 0.6270 l
0.8920 0.6270 l
0.8935 0.6270 l
0.8951 0.6270 l
0.8967 0.6271 l
0.8982 0.6271 l
0.8998 0.6271 l
0.9014 0.6271 l
0.9029 0.6272 l
0.9045 0.6272 l
0.9061 0.6272 l
0.9076 0.6272 l
0.9092 0.6273 l
0.9108 0.6273 l
0.9124 0.6273 l
0.9139 0.6273 l
0.9155 0.6274 l
0.9171 0.6274 l
0.9186 0.6274 l
0.9202 0.6274 l
0.9218 0.6275 l
0.9233 0.6275 l
0.9249 0.6275 l
0.9265 0.6275 l
0.9280 0.6275 l
0.9296 0.6276 l
0.9312 0.6276 l
0.9327 0.6276 l
0.9343 0.6276 l
0.9359 0.6276 l
0.9375 0.6277 l
0.9390 0.6277 l
0.9406 0.6277 l
0.9422 0.6277 l
0.9437 0.6278 l
0.9453 0.6278 l
0.9469 0.6278 l
0.9484 0.6278 l
0.9500 0.6278 l
s
[/DeviceRGB] SCS
Color8 SC
n
0.2334 0.1499 m
0.2347 0.1573 l
0.2363 0.1655 l
0.2378 0.1731 l
0.2394 0.1802 l
0.2410 0.1870 l
0.2425 0.1934 l
0.2441 0.1994 l
0.2457 0.2052 l
0.2473 0.2106 l
0.2488 0.2158 l
0.2504 0.2207 l
0.2520 0.2254 l
0.2535 0.2299 l
0.2551 0.2342 l
0.2567 0.2383 l
0.2582 0.2423 l
0.2598 0.2460 l
0.2614 0.2497 l
0.2629 0.2532 l
0.2645 0.2565 l
0.2661 0.2598 l
0.2676 0.2629 l
0.2692 0.2659 l
0.2708 0.2688 l
0.2724 0.2716 l
0.2739 0.2743 l
0.2755 0.2769 l
0.2771 0.2794 l
0.2786 0.2819 l
0.2802 0.2842 l
0.2818 0.2865 l
0.2833 0.2887 l
0.2849 0.2909 l
0.2865 0.2930 l
0.2880 0.2950 l
0.2896 0.2970 l
0.2912 0.2989 l
0.2927 0.3007 l
0.2943 0.3026 l
0.2959 0.3043 l
0.2975 0.3060 l
0.2990 0.3077 l
0.3006 0.3093 l
0.3022 0.3109 l
0.3037 0.3124 l
0.3053 0.3139 l
0.3069 0.3154 l
0.3084 0.3168 l
0.3100 0.3182 l
0.3116 0.3195 l
0.3131 0.3208 l
0.3147 0.3221 l
0.3163 0.3233 l
0.3178 0.3246 l
0.3194 0.3257 l
0.3210 0.3269 l
0.3225 0.3280 l
0.3241 0.3292 l
0.3257 0.3302 l
0.3273 0.3313 l
0.3288 0.3323 l
0.3304 0.3333 l
0.3320 0.3343 l
0.3335 0.3353 l
0.3351 0.3362 l
0.3367 0.3372 l
0.3382 0.3381 l
0.3398 0.3390 l
0.3414 0.3398 l
0.3429 0.3407 l
0.3445 0.3415 l
0.3461 0.3424 l
0.3476 0.3432 l
0.3492 0.3439 l
0.3508 0.3447 l
0.3524 0.3455 l
0.3539 0.3462 l
0.3555 0.3469 l
0.3571 0.3476 l
0.3586 0.3483 l
0.3602 0.3490 l
0.3618 0.3497 l
0.3633 0.3504 l
0.3649 0.3510 l
0.3665 0.3516 l
0.3680 0.3523 l
0.3696 0.3529 l
0.3712 0.3535 l
0.3727 0.3541 l
0.3743 0.3547 l
0.3759 0.3552 l
0.3775 0.3558 l
0.3790 0.3563 l
0.3806 0.3569 l
0.3822 0.3574 l
0.3837 0.3579 l
0.3853 0.3584 l
0.3869 0.3590 l
0.3884 0.3595 l
0.3900 0.3599 l
0.3916 0.3604 l
0.3931 0.3609 l
0.3947 0.3614 l
0.3963 0.3618 l
0.3978 0.3623 l
0.3994 0.3627 l
0.4010 0.3631 l
0.4025 0.3636 l
0.4041 0.3640 l
0.4057 0.3644 l
0.4073 0.3648 l
0.4088 0.3652 l
0.4104 0.3656 l
0.4120 0.3660 l
0.4135 0.3664 l
0.4151 0.3668 l
0.4167 0.3671 l
0.4182 0.3675 l
0.4198 0.3679 l
0.4214 0.3682 l
0.4229 0.3686 l
0.4245 0.3689 l
0.4261 0.3693 l
0.4276 0.3696 l
0.4292 0.3699 l
0.4308 0.3703 l
0.4324 0.3706 l
0.4339 0.3709 l
0.4355 0.3712 l
0.4371 0.3715 l
0.4386 0.3718 l
0.4402 0.3721 l
0.4418 0.3724 l
0.4433 0.3727 l
0.4449 0.3730 l
0.4465 0.3733 l
0.4480 0.3736 l
0.4496 0.3739 l
0.4512 0.3741 l
0.4527 0.3744 l
0.4543 0.3747 l
0.4559 0.3749 l
0.4575 0.3752 l
0.4590 0.3754 l
0.4606 0.3757 l
0.4622 0.3759 l
0.4637 0.3762 l
0.4653 0.3764 l
0.4669 0.3767 l
0.4684 0.3769 l
0.4700 0.3771 l
0.4716 0.3774 l
0.4731 0.3776 l
0.4747 0.3778 l
0.4763 0.3781 l
0.4778 0.3783 l
0.4794 0.3785 l
0.4810 0.3787 l
0.4825 0.3789 l
0.4841 0.3791 l
0.4857 0.3793 l
0.4873 0.3795 l
0.4888 0.3798 l
0.4904 0.3799 l
0.4920 0.3801 l
0.4935 0.3803 l
0.4951 0.3805 l
0.4967 0.3807 l
0.4982 0.3809 l
0.4998 0.3811 l
0.5014 0.3813 l
0.5029 0.3815 l
0.5045 0.3816 l
0.5061 0.3818 l
0.5076 0.3820 l
0.5092 0.3822 l
0.5108 0.3823 l
0.5124 0.3825 l
0.5139 0.3827 l
0.5155 0.3828 l
0.5171 0.3830 l
0.5186 0.3832 l
0.5202 0.3833 l
0.5218 0.3835 l
0.5233 0.3836 l
0.5249 0.3838 l
0.5265 0.3839 l
0.5280 0.3841 l
0.5296 0.3842 l
0.5312 0.3844 l
0.5327 0.3845 l
0.5343 0.3847 l
0.5359 0.3848 l
0.5375 0.3850 l
0.5390 0.3851 l
0.5406 0.3852 l
0.5422 0.3854 l
0.5437 0.3855 l
0.5453 0.3857 l
0.5469 0.3858 l
0.5484 0.3859 l
0.5502 0.3861 l
0.5516 0.3862 l
0.5531 0.3863 l
0.5547 0.3864 l
0.5563 0.3866 l
0.5578 0.3867 l
0.5594 0.3868 l
0.5610 0.3869 l
0.5625 0.3870 l
0.5641 0.3872 l
0.5657 0.3873 l
0.5673 0.3874 l
0.5688 0.3875 l
0.5704 0.3876 l
0.5720 0.3877 l
0.5735 0.3879 l
0.5751 0.3880 l
0.5767 0.3881 l
0.5782 0.3882 l
0.5798 0.3883 l
0.5814 0.3884 l
0.5829 0.3885 l
0.5845 0.3886 l
0.5861 0.3887 l
0.5876 0.3888 l
0.5892 0.3889 l
0.5908 0.3890 l
0.5924 0.3891 l
0.5939 0.3892 l
0.5955 0.3893 l
0.5971 0.3894 l
0.5986 0.3895 l
0.6002 0.3896 l
0.6018 0.3897 l
0.6033 0.3898 l
0.6049 0.3899 l
0.6065 0.3900 l
0.6080 0.3901 l
0.6096 0.3902 l
0.6112 0.3903 l
0.6127 0.3904 l
0.6143 0.3905 l
0.6159 0.3905 l
0.6175 0.3906 l
0.6190 0.3907 l
0.6206 0.3908 l
0.6222 0.3909 l
0.6237 0.3910 l
0.6253 0.3911 l
0.6269 0.3911 l
0.6284 0.3912 l
0.6300 0.3913 l
0.6316 0.3914 l
0.6331 0.3915 l
0.6347 0.3915 l
0.6363 0.3916 l
0.6378 0.3917 l
0.6394 0.3918 l
0.6410 0.3919 l
0.6425 0.3919 l
0.6441 0.3920 l
0.6457 0.3921 l
0.6473 0.3922 l
0.6488 0.3922 l
0.6504 0.3923 l
0.6520 0.3924 l
0.6535 0.3925 l
0.6551 0.3925 l
0.6567 0.3926 l
0.6582 0.3927 l
0.6598 0.3927 l
0.6614 0.3928 l
0.6629 0.3929 l
0.6645 0.3929 l
0.6661 0.3930 l
0.6676 0.3931 l
0.6692 0.3931 l
0.6708 0.3932 l
0.6724 0.3933 l
0.6739 0.3933 l
0.6755 0.3934 l
0.6771 0.3935 l
0.6786 0.3935 l
0.6802 0.3936 l
0.6818 0.3937 l
0.6833 0.3937 l
0.6849 0.3938 l
0.6865 0.3938 l
0.6880 0.3939 l
0.6896 0.3940 l
0.6912 0.3940 l
0.6927 0.3941 l
0.6943 0.3941 l
0.6959 0.3942 l
0.6975 0.3943 l
0.6990 0.3943 l
0.7006 0.3944 l
0.7022 0.3944 l
0.7037 0.3945 l
0.7053 0.3945 l
0.7069 0.3946 l
0.7084 0.3946 l
0.7100 0.3947 l
0.7116 0.3948 l
0.7131 0.3948 l
0.7147 0.3949 l
0.7163 0.3949 l
0.7178 0.3950 l
0.7194 0.3950 l
0.7210 0.3951 l
0.7225 0.3951 l
0.7241 0.3952 l
0.7257 0.3952 l
0.7273 0.3953 l
0.7288 0.3953 l
0.7304 0.3954 l
0.7320 0.3954 l
0.7335 0.3955 l
0.7351 0.3955 l
0.7367 0.3956 l
0.7382 0.3956 l
0.7398 0.3957 l
0.7414 0.3957 l
0.7429 0.3958 l
0.7445 0.3958 l
0.7461 0.3959 l
0.7476 0.3959 l
0.7492 0.3959 l
0.7508 0.3960 l
0.7524 0.3960 l
0.7539 0.3961 l
0.7555 0.3961 l
0.7571 0.3962 l
0.7586 0.3962 l
0.7602 0.3963 l
0.7618 0.3963 l
0.7633 0.3963 l
0.7649 0.3964 l
0.7665 0.3964 l
0.7680 0.3965 l
0.7696 0.3965 l
0.7712 0.3966 l
0.7727 0.3966 l
0.7743 0.3966 l
0.7759 0.3967 l
0.7775 0.3967 l
0.7790 0.3968 l
0.7806 0.3968 l
0.7822 0.3968 l
0.7837 0.3969 l
0.7853 0.3969 l
0.7869 0.3970 l
0.7884 0.3970 l
0.7900 0.3970 l
0.7916 0.3971 l
0.7931 0.3971 l
0.7947 0.3971 l
0.7963 0.3972 l
0.7978 0.3972 l
0.7994 0.3973 l
0.8010 0.3973 l
0.8025 0.3973 l
0.8041 0.3974 l
0.8057 0.3974 l
0.8073 0.3974 l
0.8088 0.3975 l
0.8104 0.3975 l
0.8120 0.3975 l
0.8135 0.3976 l
0.8151 0.3976 l
0.8167 0.3976 l
0.8182 0.3977 l
0.8198 0.3977 l
0.8214 0.3977 l
0.8229 0.3978 l
0.8245 0.3978 l
0.8261 0.3978 l
0.8276 0.3979 l
0.8292 0.3979 l
0.8308 0.3979 l
0.8324 0.3980 l
0.8339 0.3980 l
0.8355 0.3980 l
0.8371 0.3981 l
0.8386 0.3981 l
0.8402 0.3981 l
0.8418 0.3982 l
0.8433 0.3982 l
0.8449 0.3982 l
0.8465 0.3983 l
0.8480 0.3983 l
0.8496 0.3983 l
0.8512 0.3984 l
0.8527 0.3984 l
0.8543 0.3984 l
0.8559 0.3984 l
0.8575 0.3985 l
0.8590 0.3985 l
0.8606 0.3985 l
0.8622 0.3986 l
0.8637 0.3986 l
0.8653 0.3986 l
0.8669 0.3986 l
0.8684 0.3987 l
0.8700 0.3987 l
0.8716 0.3987 l
0.8731 0.3988 l
0.8747 0.3988 l
0.8763 0.3988 l
0.8778 0.3988 l
0.8794 0.3989 l
0.8810 0.3989 l
0.8825 0.3989 l
0.8841 0.3989 l
0.8857 0.3990 l
0.8873 0.3990 l
0.8888 0.3990 l
0.8904 0.3990 l
0.8920 0.3991 l
0.8935 0.3991 l
0.8951 0.3991 l
0.8967 0.3992 l
0.8982 0.3992 l
0.8998 0.3992 l
0.9014 0.3992 l
0.9029 0.3993 l
0.9045 0.3993 l
0.9061 0.3993 l
0.9076 0.3993 l
0.9092 0.3993 l
0.9108 0.3994 l
0.9124 0.3994 l
0.9139 0.3994 l
0.9155 0.3994 l
0.9171 0.3995 l
0.9186 0.3995 l
0.9202 0.3995 l
0.9218 0.3995 l
0.9233 0.3996 l
0.9249 0.3996 l
0.9265 0.3996 l
0.9280 0.3996 l
0.9296 0.3997 l
0.9312 0.3997 l
0.9327 0.3997 l
0.9343 0.3997 l
0.9359 0.3997 l
0.9375 0.3998 l
0.9390 0.3998 l
0.9406 0.3998 l
0.9422 0.3998 l
0.9437 0.3998 l
0.9453 0.3999 l
0.9469 0.3999 l
0.9484 0.3999 l
0.9500 0.3999 l
s
[/DeviceRGB] SCS
Color9 SC
n
0.2376 0.1499 m
0.2378 0.1512 l
0.2394 0.1588 l
0.2410 0.1658 l
0.2425 0.1725 l
0.2441 0.1788 l
0.2457 0.1848 l
0.2473 0.1904 l
0.2488 0.1958 l
0.2504 0.2009 l
0.2520 0.2057 l
0.2535 0.2104 l
0.2551 0.2148 l
0.2567 0.2190 l
0.2582 0.2231 l
0.2598 0.2270 l
0.2614 0.2307 l
0.2629 0.2343 l
0.2645 0.2378 l
0.2661 0.2411 l
0.2676 0.2443 l
0.2692 0.2474 l
0.2708 0.2504 l
0.2724 0.2532 l
0.2739 0.2560 l
0.2755 0.2587 l
0.2771 0.2613 l
0.2786 0.2638 l
0.2802 0.2662 l
0.2818 0.2685 l
0.2833 0.2707 l
0.2849 0.2729 l
0.2865 0.2750 l
0.2880 0.2771 l
0.2896 0.2791 l
0.2912 0.2810 l
0.2927 0.2830 l
0.2943 0.2848 l
0.2959 0.2866 l
0.2975 0.2884 l
0.2990 0.2901 l
0.3006 0.2917 l
0.3022 0.2933 l
0.3037 0.2949 l
0.3053 0.2964 l
0.3069 0.2979 l
0.3084 0.2993 l
0.3100 0.3007 l
0.3116 0.3021 l
0.3131 0.3034 l
0.3147 0.3047 l
0.3163 0.3060 l
0.3178 0.3072 l
0.3194 0.3085 l
0.3210 0.3096 l
0.3225 0.3108 l
0.3241 0.3119 l
0.3257 0.3130 l
0.3273 0.3141 l
0.3288 0.3152 l
0.3304 0.3162 l
0.3320 0.3172 l
0.3335 0.3182 l
0.3351 0.3191 l
0.3367 0.3201 l
0.3382 0.3210 l
0.3398 0.3219 l
0.3414 0.3228 l
0.3429 0.3236 l
0.3445 0.3245 l
0.3461 0.3253 l
0.3476 0.3261 l
0.3492 0.3269 l
0.3508 0.3277 l
0.3524 0.3285 l
0.3539 0.3292 l
0.3555 0.3300 l
0.3571 0.3307 l
0.3586 0.3314 l
0.3602 0.3321 l
0.3618 0.3328 l
0.3633 0.3334 l
0.3649 0.3341 l
0.3665 0.3347 l
0.3680 0.3354 l
0.3696 0.3360 l
0.3712 0.3366 l
0.3727 0.3372 l
0.3743 0.3378 l
0.3759 0.3384 l
0.3775 0.3389 l
0.3790 0.3395 l
0.3806 0.3400 l
0.3822 0.3406 l
0.3837 0.3411 l
0.3853 0.3416 l
0.3869 0.3421 l
0.3884 0.3426 l
0.3900 0.3431 l
0.3916 0.3436 l
0.3931 0.3441 l
0.3947 0.3446 l
0.3963 0.3450 l
0.3978 0.3455 l
0.3994 0.3459 l
0.4010 0.3464 l
0.4025 0.3468 l
0.4041 0.3472 l
0.4057 0.3477 l
0.4073 0.3481 l
0.4088 0.3485 l
0.4104 0.3489 l
0.4120 0.3493 l
0.4135 0.3497 l
0.4151 0.3500 l
0.4167 0.3504 l
0.4182 0.3508 l
0.4198 0.3512 l
0.4214 0.3515 l
0.4229 0.3519 l
0.4245 0.3522 l
0.4261 0.3526 l
0.4276 0.3529 l
0.4292 0.3532 l
0.4308 0.3536 l
0.4324 0.3539 l
0.4339 0.3542 l
0.4355 0.3545 l
0.4371 0.3548 l
0.4386 0.3551 l
0.4402 0.3554 l
0.4418 0.3557 l
0.4433 0.3560 l
0.4449 0.3563 l
0.4465 0.3566 l
0.4480 0.3569 l
0.4496 0.3572 l
0.4512 0.3575 l
0.4527 0.3577 l
0.4543 0.3580 l
0.4559 0.3583 l
0.4575 0.3585 l
0.4590 0.3588 l
0.4606 0.3590 l
0.4622 0.3593 l
0.4637 0.3595 l
0.4653 0.3598 l
0.4669 0.3600 l
0.4684 0.3603 l
0.4700 0.3605 l
0.4716 0.3607 l
0.4731 0.3610 l
0.4747 0.3612 l
0.4763 0.3614 l
0.4778 0.3617 l
0.4794 0.3619 l
0.4810 0.3621 l
0.4825 0.3623 l
0.4841 0.3625 l
0.4857 0.3627 l
0.4873 0.3629 l
0.4888 0.3631 l
0.4904 0.3633 l
0.4920 0.3635 l
0.4935 0.3637 l
0.4951 0.3639 l
0.4967 0.3641 l
0.4982 0.3643 l
0.4998 0.3645 l
0.5014 0.3647 l
0.5029 0.3648 l
0.5045 0.3650 l
0.5061 0.3652 l
0.5076 0.3654 l
0.5092 0.3656 l
0.5108 0.3657 l
0.5124 0.3659 l
0.5139 0.3661 l
0.5155 0.3662 l
0.5171 0.3664 l
0.5186 0.3666 l
0.5202 0.3667 l
0.5218 0.3669 l
0.5233 0.3670 l
0.5249 0.3672 l
0.5265 0.3673 l
0.5280 0.3675 l
0.5296 0.3676 l
0.5312 0.3678 l
0.5327 0.3679 l
0.5343 0.3681 l
0.5359 0.3682 l
0.5375 0.3684 l
0.5390 0.3685 l
0.5406 0.3686 l
0.5422 0.3688 l
0.5437 0.3689 l
0.5453 0.3691 l
0.5469 0.3692 l
0.5484 0.3693 l
0.5502 0.3695 l
0.5516 0.3696 l
0.5531 0.3697 l
0.5547 0.3698 l
0.5563 0.3700 l
0.5578 0.3701 l
0.5594 0.3702 l
0.5610 0.3703 l
0.5625 0.3705 l
0.5641 0.3706 l
0.5657 0.3707 l
0.5673 0.3708 l
0.5688 0.3709 l
0.5704 0.3710 l
0.5720 0.3712 l
0.5735 0.3713 l
0.5751 0.3714 l
0.5767 0.3715 l
0.5782 0.3716 l
0.5798 0.3717 l
0.5814 0.3718 l
0.5829 0.3719 l
0.5845 0.3720 l
0.5861 0.3721 l
0.5876 0.3722 l
0.5892 0.3723 l
0.5908 0.3724 l
0.5924 0.3726 l
0.5939 0.3727 l
0.5955 0.3727 l
0.5971 0.3728 l
0.5986 0.3729 l
0.6002 0.3730 l
0.6018 0.3731 l
0.6033 0.3732 l
0.6049 0.3733 l
0.6065 0.3734 l
0.6080 0.3735 l
0.6096 0.3736 l
0.6112 0.3737 l
0.6127 0.3738 l
0.6143 0.3739 l
0.6159 0.3740 l
0.6175 0.3740 l
0.6190 0.3741 l
0.6206 0.3742 l
0.6222 0.3743 l
0.6237 0.3744 l
0.6253 0.3745 l
0.6269 0.3746 l
0.6284 0.3746 l
0.6300 0.3747 l
0.6316 0.3748 l
0.6331 0.3749 l
0.6347 0.3750 l
0.6363 0.3750 l
0.6378 0.3751 l
0.6394 0.3752 l
0.6410 0.3753 l
0.6425 0.3753 l
0.6441 0.3754 l
0.6457 0.3755 l
0.6473 0.3756 l
0.6488 0.3756 l
0.6504 0.3757 l
0.6520 0.3758 l
0.6535 0.3759 l
0.6551 0.3759 l
0.6567 0.3760 l
0.6582 0.3761 l
0.6598 0.3761 l
0.6614 0.3762 l
0.6629 0.3763 l
0.6645 0.3764 l
0.6661 0.3764 l
0.6676 0.3765 l
0.6692 0.3766 l
0.6708 0.3766 l
0.6724 0.3767 l
0.6739 0.3768 l
0.6755 0.3768 l
0.6771 0.3769 l
0.6786 0.3769 l
0.6802 0.3770 l
0.6818 0.3771 l
0.6833 0.3771 l
0.6849 0.3772 l
0.6865 0.3773 l
0.6880 0.3773 l
0.6896 0.3774 l
0.6912 0.3774 l
0.6927 0.3775 l
0.6943 0.3775 l
0.6959 0.3776 l
0.6975 0.3777 l
0.6990 0.3777 l
0.7006 0.3778 l
0.7022 0.3778 l
0.7037 0.3779 l
0.7053 0.3779 l
0.7069 0.3780 l
0.7084 0.3781 l
0.7100 0.3781 l
0.7116 0.3782 l
0.7131 0.3782 l
0.7147 0.3783 l
0.7163 0.3783 l
0.7178 0.3784 l
0.7194 0.3784 l
0.7210 0.3785 l
0.7225 0.3785 l
0.7241 0.3786 l
0.7257 0.3786 l
0.7273 0.3787 l
0.7288 0.3787 l
0.7304 0.3788 l
0.7320 0.3788 l
0.7335 0.3789 l
0.7351 0.3789 l
0.7367 0.3790 l
0.7382 0.3790 l
0.7398 0.3791 l
0.7414 0.3791 l
0.7429 0.3792 l
0.7445 0.3792 l
0.7461 0.3793 l
0.7476 0.3793 l
0.7492 0.3793 l
0.7508 0.3794 l
0.7524 0.3794 l
0.7539 0.3795 l
0.7555 0.3795 l
0.7571 0.3796 l
0.7586 0.3796 l
0.7602 0.3797 l
0.7618 0.3797 l
0.7633 0.3797 l
0.7649 0.3798 l
0.7665 0.3798 l
0.7680 0.3799 l
0.7696 0.3799 l
0.7712 0.3800 l
0.7727 0.3800 l
0.7743 0.3800 l
0.7759 0.3801 l
0.7775 0.3801 l
0.7790 0.3802 l
0.7806 0.3802 l
0.7822 0.3802 l
0.7837 0.3803 l
0.7853 0.3803 l
0.7869 0.3804 l
0.7884 0.3804 l
0.7900 0.3804 l
0.7916 0.3805 l
0.7931 0.3805 l
0.7947 0.3805 l
0.7963 0.3806 l
0.7978 0.3806 l
0.7994 0.3807 l
0.8010 0.3807 l
0.8025 0.3807 l
0.8041 0.3808 l
0.8057 0.3808 l
0.8073 0.3808 l
0.8088 0.3809 l
0.8104 0.3809 l
0.8120 0.3809 l
0.8135 0.3810 l
0.8151 0.3810 l
0.8167 0.3810 l
0.8182 0.3811 l
0.8198 0.3811 l
0.8214 0.3811 l
0.8229 0.3812 l
0.8245 0.3812 l
0.8261 0.3812 l
0.8276 0.3813 l
0.8292 0.3813 l
0.8308 0.3813 l
0.8324 0.3814 l
0.8339 0.3814 l
0.8355 0.3814 l
0.8371 0.3815 l
0.8386 0.3815 l
0.8402 0.3815 l
0.8418 0.3816 l
0.8433 0.3816 l
0.8449 0.3816 l
0.8465 0.3817 l
0.8480 0.3817 l
0.8496 0.3817 l
0.8512 0.3817 l
0.8527 0.3818 l
0.8543 0.3818 l
0.8559 0.3818 l
0.8575 0.3819 l
0.8590 0.3819 l
0.8606 0.3819 l
0.8622 0.3819 l
0.8637 0.3820 l
0.8653 0.3820 l
0.8669 0.3820 l
0.8684 0.3821 l
0.8700 0.3821 l
0.8716 0.3821 l
0.8731 0.3821 l
0.8747 0.3822 l
0.8763 0.3822 l
0.8778 0.3822 l
0.8794 0.3822 l
0.8810 0.3823 l
0.8825 0.3823 l
0.8841 0.3823 l
0.8857 0.3824 l
0.8873 0.3824 l
0.8888 0.3824 l
0.8904 0.3824 l
0.8920 0.3825 l
0.8935 0.3825 l
0.8951 0.3825 l
0.8967 0.3825 l
0.8982 0.3826 l
0.8998 0.3826 l
0.9014 0.3826 l
0.9029 0.3826 l
0.9045 0.3827 l
0.9061 0.3827 l
0.9076 0.3827 l
0.9092 0.3827 l
0.9108 0.3828 l
0.9124 0.3828 l
0.9139 0.3828 l
0.9155 0.3828 l
0.9171 0.3828 l
0.9186 0.3829 l
0.9202 0.3829 l
0.9218 0.3829 l
0.9233 0.3829 l
0.9249 0.3830 l
0.9265 0.3830 l
0.9280 0.3830 l
0.9296 0.3830 l
0.9312 0.3830 l
0.9327 0.3831 l
0.9343 0.3831 l
0.9359 0.3831 l
0.9375 0.3831 l
0.9390 0.3832 l
0.9406 0.3832 l
0.9422 0.3832 l
0.9437 0.3832 l
0.9453 0.3832 l
0.9469 0.3833 l
0.9484 0.3833 l
0.9500 0.3833 l
s
[/DeviceRGB] SCS
Color10 SC
n
0.1500 0.4153 m
0.1516 0.4142 l
0.1531 0.4132 l
0.1547 0.4122 l
0.1563 0.4112 l
0.1578 0.4102 l
0.1594 0.4092 l
0.1610 0.4083 l
0.1625 0.4073 l
0.1641 0.4063 l
0.1657 0.4053 l
0.1673 0.4044 l
0.1688 0.4034 l
0.1704 0.4024 l
0.1720 0.4015 l
0.1735 0.4005 l
0.1751 0.3996 l
0.1767 0.3986 l
0.1782 0.3977 l
0.1798 0.3967 l
0.1814 0.3957 l
0.1829 0.3948 l
0.1845 0.3938 l
0.1861 0.3928 l
0.1876 0.3918 l
0.1892 0.3908 l
0.1908 0.3897 l
0.1924 0.3886 l
0.1939 0.3875 l
0.1955 0.3863 l
0.1971 0.3850 l
0.1986 0.3836 l
0.2002 0.3820 l
0.2018 0.3803 l
0.2033 0.3781 l
0.2049 0.3755 l
0.2065 0.3723 l
0.2080 0.3681 l
0.2096 0.3629 l
0.2112 0.3572 l
0.2127 0.3520 l
0.2143 0.3480 l
0.2159 0.3451 l
0.2175 0.3436 l
0.2190 0.3436 l
0.2206 0.3453 l
0.2222 0.3485 l
0.2237 0.3533 l
0.2253 0.3593 l
0.2269 0.3662 l
0.2284 0.3738 l
0.2300 0.3817 l
0.2316 0.3898 l
0.2331 0.3980 l
0.2347 0.4060 l
0.2363 0.4140 l
0.2378 0.4217 l
0.2394 0.4292 l
0.2410 0.4364 l
0.2425 0.4433 l
0.2441 0.4500 l
0.2457 0.4564 l
0.2473 0.4625 l
0.2488 0.4684 l
0.2504 0.4740 l
0.2520 0.4794 l
0.2535 0.4846 l
0.2551 0.4895 l
0.2567 0.4943 l
0.2582 0.4989 l
0.2598 0.5033 l
0.2614 0.5075 l
0.2629 0.5116 l
0.2645 0.5155 l
0.2661 0.5193 l
0.2676 0.5229 l
0.2692 0.5264 l
0.2708 0.5298 l
0.2724 0.5331 l
0.2739 0.5362 l
0.2755 0.5393 l
0.2771 0.5422 l
0.2786 0.5451 l
0.2802 0.5478 l
0.2818 0.5505 l
0.2833 0.5531 l
0.2849 0.5556 l
0.2865 0.5580 l
0.2880 0.5604 l
0.2896 0.5626 l
0.2912 0.5649 l
0.2927 0.5670 l
0.2943 0.5691 l
0.2959 0.5712 l
0.2975 0.5731 l
0.2990 0.5751 l
0.3006 0.5769 l
0.3022 0.5787 l
0.3037 0.5805 l
0.3053 0.5822 l
0.3069 0.5839 l
0.3084 0.5855 l
0.3100 0.5871 l
0.3116 0.5887 l
0.3131 0.5902 l
0.3147 0.5917 l
0.3163 0.5931 l
0.3178 0.5945 l
0.3194 0.5959 l
0.3210 0.5972 l
0.3225 0.5985 l
0.3241 0.5998 l
0.3257 0.6010 l
0.3273 0.6022 l
0.3288 0.6034 l
0.3304 0.6046 l
0.3320 0.6057 l
0.3335 0.6068 l
0.3351 0.6079 l
0.3367 0.6090 l
0.3382 0.6100 l
0.3398 0.6110 l
0.3414 0.6120 l
0.3429 0.6130 l
0.3445 0.6139 l
0.3461 0.6149 l
0.3476 0.6158 l
0.3492 0.6167 l
0.3508 0.6176 l
0.3524 0.6184 l
0.3539 0.6193 l
0.3555 0.6201 l
0.3571 0.6209 l
0.3586 0.6217 l
0.3602 0.6225 l
0.3618 0.6233 l
0.3633 0.6240 l
0.3649 0.6247 l
0.3665 0.6255 l
0.3680 0.6262 l
0.3696 0.6269 l
0.3712 0.6276 l
0.3727 0.6282 l
0.3743 0.6289 l
0.3759 0.6295 l
0.3775 0.6302 l
0.3790 0.6308 l
0.3806 0.6314 l
0.3822 0.6320 l
0.3837 0.6326 l
0.3853 0.6332 l
0.3869 0.6338 l
0.3884 0.6343 l
0.3900 0.6349 l
0.3916 0.6354 l
0.3931 0.6360 l
0.3947 0.6365 l
0.3963 0.6370 l
0.3978 0.6375 l
0.3994 0.6380 l
0.4010 0.6385 l
0.4025 0.6390 l
0.4041 0.6395 l
0.4057 0.6399 l
0.4073 0.6404 l
0.4088 0.6409 l
0.4104 0.6413 l
0.4120 0.6418 l
0.4135 0.6422 l
0.4151 0.6426 l
0.4167 0.6430 l
0.4182 0.6435 l
0.4198 0.6439 l
0.4214 0.6443 l
0.4229 0.6447 l
0.4245 0.6451 l
0.4261 0.6454 l
0.4276 0.6458 l
0.4292 0.6462 l
0.4308 0.6466 l
0.4324 0.6469 l
0.4339 0.6473 l
0.4355 0.6476 l
0.4371 0.6480 l
0.4386 0.6483 l
0.4402 0.6487 l
0.4418 0.6490 l
0.4433 0.6493 l
0.4449 0.6497 l
0.4465 0.6500 l
0.4480 0.6503 l
0.4496 0.6506 l
0.4512 0.6509 l
0.4527 0.6512 l
0.4543 0.6515 l
0.4559 0.6518 l
0.4575 0.6521 l
0.4590 0.6524 l
0.4606 0.6527 l
0.4622 0.6530 l
0.4637 0.6533 l
0.4653 0.6535 l
0.4669 0.6538 l
0.4684 0.6541 l
0.4700 0.6543 l
0.4716 0.6546 l
0.4731 0.6549 l
0.4747 0.6551 l
0.4763 0.6554 l
0.4778 0.6556 l
0.4794 0.6559 l
0.4810 0.6561 l
0.4825 0.6564 l
0.4841 0.6566 l
0.4857 0.6568 l
0.4873 0.6571 l
0.4888 0.6573 l
0.4904 0.6575 l
0.4920 0.6577 l
0.4935 0.6579 l
0.4951 0.6582 l
0.4967 0.6584 l
0.4982 0.6586 l
0.4998 0.6588 l
0.5014 0.6590 l
0.5029 0.6592 l
0.5045 0.6594 l
0.5061 0.6596 l
0.5076 0.6598 l
0.5092 0.6600 l
0.5108 0.6602 l
0.5124 0.6604 l
0.5139 0.6606 l
0.5155 0.6607 l
0.5171 0.6609 l
0.5186 0.6611 l
0.5202 0.6613 l
0.5218 0.6615 l
0.5233 0.6616 l
0.5249 0.6618 l
0.5265 0.6620 l
0.5280 0.6622 l
0.5296 0.6623 l
0.5312 0.6625 l
0.5327 0.6627 l
0.5343 0.6628 l
0.5359 0.6630 l
0.5375 0.6631 l
0.5390 0.6633 l
0.5406 0.6635 l
0.5422 0.6636 l
0.5437 0.6638 l
0.5453 0.6639 l
0.5469 0.6641 l
0.5484 0.6642 l
0.5502 0.6644 l
0.5516 0.6645 l
0.5531 0.6647 l
0.5547 0.6648 l
0.5563 0.6649 l
0.5578 0.6651 l
0.5594 0.6652 l
0.5610 0.6654 l
0.5625 0.6655 l
0.5641 0.6656 l
0.5657 0.6658 l
0.5673 0.6659 l
0.5688 0.6660 l
0.5704 0.6662 l
0.5720 0.6663 l
0.5735 0.6664 l
0.5751 0.6665 l
0.5767 0.6667 l
0.5782 0.6668 l
0.5798 0.6669 l
0.5814 0.6670 l
0.5829 0.6671 l
0.5845 0.6673 l
0.5861 0.6674 l
0.5876 0.6675 l
0.5892 0.6676 l
0.5908 0.6677 l
0.5924 0.6678 l
0.5939 0.6680 l
0.5955 0.6681 l
0.5971 0.6682 l
0.5986 0.6683 l
0.6002 0.6684 l
0.6018 0.6685 l
0.6033 0.6686 l
0.6049 0.6687 l
0.6065 0.6688 l
0.6080 0.6689 l
0.6096 0.6690 l
0.6112 0.6691 l
0.6127 0.6692 l
0.6143 0.6693 l
0.6159 0.6694 l
0.6175 0.6695 l
0.6190 0.6696 l
0.6206 0.6697 l
0.6222 0.6698 l
0.6237 0.6699 l
0.6253 0.6700 l
0.6269 0.6701 l
0.6284 0.6702 l
0.6300 0.6703 l
0.6316 0.6704 l
0.6331 0.6705 l
0.6347 0.6706 l
0.6363 0.6706 l
0.6378 0.6707 l
0.6394 0.6708 l
0.6410 0.6709 l
0.6425 0.6710 l
0.6441 0.6711 l
0.6457 0.6712 l
0.6473 0.6712 l
0.6488 0.6713 l
0.6504 0.6714 l
0.6520 0.6715 l
0.6535 0.6716 l
0.6551 0.6717 l
0.6567 0.6717 l
0.6582 0.6718 l
0.6598 0.6719 l
0.6614 0.6720 l
0.6629 0.6720 l
0.6645 0.6721 l
0.6661 0.6722 l
0.6676 0.6723 l
0.6692 0.6724 l
0.6708 0.6724 l
0.6724 0.6725 l
0.6739 0.6726 l
0.6755 0.6726 l
0.6771 0.6727 l
0.6786 0.6728 l
0.6802 0.6729 l
0.6818 0.6729 l
0.6833 0.6730 l
0.6849 0.6731 l
0.6865 0.6731 l
0.6880 0.6732 l
0.6896 0.6733 l
0.6912 0.6733 l
0.6927 0.6734 l
0.6943 0.6735 l
0.6959 0.6735 l
0.6975 0.6736 l
0.6990 0.6737 l
0.7006 0.6737 l
0.7022 0.6738 l
0.7037 0.6739 l
0.7053 0.6739 l
0.7069 0.6740 l
0.7084 0.6740 l
0.7100 0.6741 l
0.7116 0.6742 l
0.7131 0.6742 l
0.7147 0.6743 l
0.7163 0.6743 l
0.7178 0.6744 l
0.7194 0.6745 l
0.7210 0.6745 l
0.7225 0.6746 l
0.7241 0.6746 l
0.7257 0.6747 l
0.7273 0.6747 l
0.7288 0.6748 l
0.7304 0.6749 l
0.7320 0.6749 l
0.7335 0.6750 l
0.7351 0.6750 l
0.7367 0.6751 l
0.7382 0.6751 l
0.7398 0.6752 l
0.7414 0.6752 l
0.7429 0.6753 l
0.7445 0.6753 l
0.7461 0.6754 l
0.7476 0.6754 l
0.7492 0.6755 l
0.7508 0.6756 l
0.7524 0.6756 l
0.7539 0.6757 l
0.7555 0.6757 l
0.7571 0.6758 l
0.7586 0.6758 l
0.7602 0.6759 l
0.7618 0.6759 l
0.7633 0.6759 l
0.7649 0.6760 l
0.7665 0.6760 l
0.7680 0.6761 l
0.7696 0.6761 l
0.7712 0.6762 l
0.7727 0.6762 l
0.7743 0.6763 l
0.7759 0.6763 l
0.7775 0.6764 l
0.7790 0.6764 l
0.7806 0.6765 l
0.7822 0.6765 l
0.7837 0.6765 l
0.7853 0.6766 l
0.7869 0.6766 l
0.7884 0.6767 l
0.7900 0.6767 l
0.7916 0.6768 l
0.7931 0.6768 l
0.7947 0.6768 l
0.7963 0.6769 l
0.7978 0.6769 l
0.7994 0.6770 l
0.8010 0.6770 l
0.8025 0.6771 l
0.8041 0.6771 l
0.8057 0.6771 l
0.8073 0.6772 l
0.8088 0.6772 l
0.8104 0.6773 l
0.8120 0.6773 l
0.8135 0.6773 l
0.8151 0.6774 l
0.8167 0.6774 l
0.8182 0.6774 l
0.8198 0.6775 l
0.8214 0.6775 l
0.8229 0.6776 l
0.8245 0.6776 l
0.8261 0.6776 l
0.8276 0.6777 l
0.8292 0.6777 l
0.8308 0.6777 l
0.8324 0.6778 l
0.8339 0.6778 l
0.8355 0.6779 l
0.8371 0.6779 l
0.8386 0.6779 l
0.8402 0.6780 l
0.8418 0.6780 l
0.8433 0.6780 l
0.8449 0.6781 l
0.8465 0.6781 l
0.8480 0.6781 l
0.8496 0.6782 l
0.8512 0.6782 l
0.8527 0.6782 l
0.8543 0.6783 l
0.8559 0.6783 l
0.8575 0.6783 l
0.8590 0.6784 l
0.8606 0.6784 l
0.8622 0.6784 l
0.8637 0.6785 l
0.8653 0.6785 l
0.8669 0.6785 l
0.8684 0.6786 l
0.8700 0.6786 l
0.8716 0.6786 l
0.8731 0.6787 l
0.8747 0.6787 l
0.8763 0.6787 l
0.8778 0.6787 l
0.8794 0.6788 l
0.8810 0.6788 l
0.8825 0.6788 l
0.8841 0.6789 l
0.8857 0.6789 l
0.8873 0.6789 l
0.8888 0.6790 l
0.8904 0.6790 l
0.8920 0.6790 l
0.8935 0.6790 l
0.8951 0.6791 l
0.8967 0.6791 l
0.8982 0.6791 l
0.8998 0.6792 l
0.9014 0.6792 l
0.9029 0.6792 l
0.9045 0.6792 l
0.9061 0.6793 l
0.9076 0.6793 l
0.9092 0.6793 l
0.9108 0.6794 l
0.9124 0.6794 l
0.9139 0.6794 l
0.9155 0.6794 l
0.9171 0.6795 l
0.9186 0.6795 l
0.9202 0.6795 l
0.9218 0.6795 l
0.9233 0.6796 l
0.9249 0.6796 l
0.9265 0.6796 l
0.9280 0.6796 l
0.9296 0.6797 l
0.9312 0.6797 l
0.9327 0.6797 l
0.9343 0.6797 l
0.9359 0.6798 l
0.9375 0.6798 l
0.9390 0.6798 l
0.9406 0.6798 l
0.9422 0.6799 l
0.9437 0.6799 l
0.9453 0.6799 l
0.9469 0.6799 l
0.9484 0.6800 l
0.9500 0.6800 l
s
[/DeviceRGB] SCS
Color1 SC
[] 0 SD
0.0015 SLW
n
0.1971 0.1500 m
0.1971 0.1600 l
s
n
0.1971 0.9000 m
0.1971 0.8900 l
s
n
0.2284 0.1500 m
0.2284 0.1600 l
s
n
0.2284 0.9000 m
0.2284 0.8900 l
s
n
0.2598 0.1500 m
0.2598 0.1600 l
s
n
0.2598 0.9000 m
0.2598 0.8900 l
s
n
0.2912 0.1500 m
0.2912 0.1600 l
s
n
0.2912 0.9000 m
0.2912 0.8900 l
s
n
0.3539 0.1500 m
0.3539 0.1600 l
s
n
0.3539 0.9000 m
0.3539 0.8900 l
s
n
0.3853 0.1500 m
0.3853 0.1600 l
s
n
0.3853 0.9000 m
0.3853 0.8900 l
s
n
0.4167 0.1500 m
0.4167 0.1600 l
s
n
0.4167 0.9000 m
0.4167 0.8900 l
s
n
0.4480 0.1500 m
0.4480 0.1600 l
s
n
0.4480 0.9000 m
0.4480 0.8900 l
s
n
0.5108 0.1500 m
0.5108 0.1600 l
s
n
0.5108 0.9000 m
0.5108 0.8900 l
s
n
0.5422 0.1500 m
0.5422 0.1600 l
s
n
0.5422 0.9000 m
0.5422 0.8900 l
s
n
0.5735 0.1500 m
0.5735 0.1600 l
s
n
0.5735 0.9000 m
0.5735 0.8900 l
s
n
0.6049 0.1500 m
0.6049 0.1600 l
s
n
0.6049 0.9000 m
0.6049 0.8900 l
s
n
0.6676 0.1500 m
0.6676 0.1600 l
s
n
0.6676 0.9000 m
0.6676 0.8900 l
s
n
0.6990 0.1500 m
0.6990 0.1600 l
s
n
0.6990 0.9000 m
0.6990 0.8900 l
s
n
0.7304 0.1500 m
0.7304 0.1600 l
s
n
0.7304 0.9000 m
0.7304 0.8900 l
s
n
0.7618 0.1500 m
0.7618 0.1600 l
s
n
0.7618 0.9000 m
0.7618 0.8900 l
s
n
0.8245 0.1500 m
0.8245 0.1600 l
s
n
0.8245 0.9000 m
0.8245 0.8900 l
s
n
0.8559 0.1500 m
0.8559 0.1600 l
s
n
0.8559 0.9000 m
0.8559 0.8900 l
s
n
0.8873 0.1500 m
0.8873 0.1600 l
s
n
0.8873 0.9000 m
0.8873 0.8900 l
s
n
0.9186 0.1500 m
0.9186 0.1600 l
s
n
0.9186 0.9000 m
0.9186 0.8900 l
s
n
0.1657 0.1500 m
0.1657 0.1700 l
s
n
0.1657 0.9000 m
0.1657 0.8800 l
s
n
0.3225 0.1500 m
0.3225 0.1700 l
s
n
0.3225 0.9000 m
0.3225 0.8800 l
s
n
0.4794 0.1500 m
0.4794 0.1700 l
s
n
0.4794 0.9000 m
0.4794 0.8800 l
s
n
0.6363 0.1500 m
0.6363 0.1700 l
s
n
0.6363 0.9000 m
0.6363 0.8800 l
s
n
0.7931 0.1500 m
0.7931 0.1700 l
s
n
0.7931 0.9000 m
0.7931 0.8800 l
s
n
0.9500 0.1500 m
0.9500 0.1700 l
s
n
0.9500 0.9000 m
0.9500 0.8800 l
s
/Helvetica findfont
dup length dict begin
 {1 index /FID ne {def} {pop pop} ifelse} forall
 /Encoding DefEncoding def
 currentdict
end
/Font4 exch definefont pop
/Font4 FFSF
0.1431 0.1200 m
GS
[0.0280 0.0000 0.0000 0.0280 0 0] CC
(100) show
GR
/Font4 FFSF
0.3000 0.1200 m
GS
[0.0280 0.0000 0.0000 0.0280 0 0] CC
(200) show
GR
/Font4 FFSF
0.4569 0.1200 m
GS
[0.0280 0.0000 0.0000 0.0280 0 0] CC
(300) show
GR
/Font4 FFSF
0.6137 0.1200 m
GS
[0.0280 0.0000 0.0000 0.0280 0 0] CC
(400) show
GR
/Font4 FFSF
0.7706 0.1200 m
GS
[0.0280 0.0000 0.0000 0.0280 0 0] CC
(500) show
GR
/Font4 FFSF
0.9275 0.1200 m
GS
[0.0280 0.0000 0.0000 0.0280 0 0] CC
(600) show
GR
/Font4 FFSF
0.4818 0.0845 m
GS
[0.0336 0.0000 0.0000 0.0336 0 0] CC
(M) show
GR
/Font4 FFSF
0.5096 0.0711 m
GS
[0.0238 0.0000 0.0000 0.0238 0 0] CC
(A) show
GR
/Font4 FFSF
0.5253 0.0845 m
GS
[0.0336 0.0000 0.0000 0.0336 0 0] CC
( [GeV]) show
GR
n
0.1500 0.2064 m
0.1600 0.2064 l
s
n
0.9500 0.2064 m
0.9400 0.2064 l
s
n
0.1500 0.2395 m
0.1600 0.2395 l
s
n
0.9500 0.2395 m
0.9400 0.2395 l
s
n
0.1500 0.2629 m
0.1600 0.2629 l
s
n
0.9500 0.2629 m
0.9400 0.2629 l
s
n
0.1500 0.2811 m
0.1600 0.2811 l
s
n
0.9500 0.2811 m
0.9400 0.2811 l
s
n
0.1500 0.2959 m
0.1600 0.2959 l
s
n
0.9500 0.2959 m
0.9400 0.2959 l
s
n
0.1500 0.3085 m
0.1600 0.3085 l
s
n
0.9500 0.3085 m
0.9400 0.3085 l
s
n
0.1500 0.3193 m
0.1600 0.3193 l
s
n
0.9500 0.3193 m
0.9400 0.3193 l
s
n
0.1500 0.3289 m
0.1600 0.3289 l
s
n
0.9500 0.3289 m
0.9400 0.3289 l
s
n
0.1500 0.3375 m
0.1600 0.3375 l
s
n
0.9500 0.3375 m
0.9400 0.3375 l
s
n
0.1500 0.3939 m
0.1600 0.3939 l
s
n
0.9500 0.3939 m
0.9400 0.3939 l
s
n
0.1500 0.4270 m
0.1600 0.4270 l
s
n
0.9500 0.4270 m
0.9400 0.4270 l
s
n
0.1500 0.4504 m
0.1600 0.4504 l
s
n
0.9500 0.4504 m
0.9400 0.4504 l
s
n
0.1500 0.4686 m
0.1600 0.4686 l
s
n
0.9500 0.4686 m
0.9400 0.4686 l
s
n
0.1500 0.4834 m
0.1600 0.4834 l
s
n
0.9500 0.4834 m
0.9400 0.4834 l
s
n
0.1500 0.4960 m
0.1600 0.4960 l
s
n
0.9500 0.4960 m
0.9400 0.4960 l
s
n
0.1500 0.5068 m
0.1600 0.5068 l
s
n
0.9500 0.5068 m
0.9400 0.5068 l
s
n
0.1500 0.5164 m
0.1600 0.5164 l
s
n
0.9500 0.5164 m
0.9400 0.5164 l
s
n
0.1500 0.5250 m
0.1600 0.5250 l
s
n
0.9500 0.5250 m
0.9400 0.5250 l
s
n
0.1500 0.5814 m
0.1600 0.5814 l
s
n
0.9500 0.5814 m
0.9400 0.5814 l
s
n
0.1500 0.6145 m
0.1600 0.6145 l
s
n
0.9500 0.6145 m
0.9400 0.6145 l
s
n
0.1500 0.6379 m
0.1600 0.6379 l
s
n
0.9500 0.6379 m
0.9400 0.6379 l
s
n
0.1500 0.6561 m
0.1600 0.6561 l
s
n
0.9500 0.6561 m
0.9400 0.6561 l
s
n
0.1500 0.6709 m
0.1600 0.6709 l
s
n
0.9500 0.6709 m
0.9400 0.6709 l
s
n
0.1500 0.6835 m
0.1600 0.6835 l
s
n
0.9500 0.6835 m
0.9400 0.6835 l
s
n
0.1500 0.6943 m
0.1600 0.6943 l
s
n
0.9500 0.6943 m
0.9400 0.6943 l
s
n
0.1500 0.7039 m
0.1600 0.7039 l
s
n
0.9500 0.7039 m
0.9400 0.7039 l
s
n
0.1500 0.7125 m
0.1600 0.7125 l
s
n
0.9500 0.7125 m
0.9400 0.7125 l
s
n
0.1500 0.7689 m
0.1600 0.7689 l
s
n
0.9500 0.7689 m
0.9400 0.7689 l
s
n
0.1500 0.8020 m
0.1600 0.8020 l
s
n
0.9500 0.8020 m
0.9400 0.8020 l
s
n
0.1500 0.8254 m
0.1600 0.8254 l
s
n
0.9500 0.8254 m
0.9400 0.8254 l
s
n
0.1500 0.8436 m
0.1600 0.8436 l
s
n
0.9500 0.8436 m
0.9400 0.8436 l
s
n
0.1500 0.8584 m
0.1600 0.8584 l
s
n
0.9500 0.8584 m
0.9400 0.8584 l
s
n
0.1500 0.8710 m
0.1600 0.8710 l
s
n
0.9500 0.8710 m
0.9400 0.8710 l
s
n
0.1500 0.8818 m
0.1600 0.8818 l
s
n
0.9500 0.8818 m
0.9400 0.8818 l
s
n
0.1500 0.8914 m
0.1600 0.8914 l
s
n
0.9500 0.8914 m
0.9400 0.8914 l
s
n
0.1500 0.9000 m
0.1600 0.9000 l
s
n
0.9500 0.9000 m
0.9400 0.9000 l
s
n
0.1500 0.1500 m
0.1700 0.1500 l
s
n
0.9500 0.1500 m
0.9300 0.1500 l
s
n
0.1500 0.3375 m
0.1700 0.3375 l
s
n
0.9500 0.3375 m
0.9300 0.3375 l
s
n
0.1500 0.5250 m
0.1700 0.5250 l
s
n
0.9500 0.5250 m
0.9300 0.5250 l
s
n
0.1500 0.7125 m
0.1700 0.7125 l
s
n
0.9500 0.7125 m
0.9300 0.7125 l
s
n
0.1500 0.9000 m
0.1700 0.9000 l
s
n
0.9500 0.9000 m
0.9300 0.9000 l
s
/Font4 FFSF
0.0922 0.1349 m
GS
[0.0280 0.0000 0.0000 0.0280 0 0] CC
(10) show
GR
/Font4 FFSF
0.1231 0.1517 m
GS
[0.0198 0.0000 0.0000 0.0198 0 0] CC
(-4) show
GR
/Font4 FFSF
0.0922 0.3224 m
GS
[0.0280 0.0000 0.0000 0.0280 0 0] CC
(10) show
GR
/Font4 FFSF
0.1231 0.3392 m
GS
[0.0198 0.0000 0.0000 0.0198 0 0] CC
(-3) show
GR
/Font4 FFSF
0.0922 0.5099 m
GS
[0.0280 0.0000 0.0000 0.0280 0 0] CC
(10) show
GR
/Font4 FFSF
0.1231 0.5267 m
GS
[0.0198 0.0000 0.0000 0.0198 0 0] CC
(-2) show
GR
/Font4 FFSF
0.0957 0.6974 m
GS
[0.0280 0.0000 0.0000 0.0280 0 0] CC
(10) show
GR
/Font4 FFSF
0.1267 0.7142 m
GS
[0.0198 0.0000 0.0000 0.0198 0 0] CC
(-1) show
GR
/Font4 FFSF
0.0988 0.8849 m
GS
[0.0280 0.0000 0.0000 0.0280 0 0] CC
(10) show
GR
/Font4 FFSF
0.1298 0.9017 m
GS
[0.0198 0.0000 0.0000 0.0198 0 0] CC
(0) show
GR
/Font4 FFSF
0.0747 0.4825 m
GS
[0.0000 0.0336 -0.0336 0.0000 0 0] CC
(BR\(h\)) show
GR
n
0.1500 0.1500 m
0.1500 0.9000 l
0.9500 0.9000 l
0.9500 0.1500 l
0.1500 0.1500 l
c
s
n
0.7000 0.6300 m
0.7000 0.2182 l
0.9290 0.2182 l
0.9290 0.6300 l
c
[/DeviceRGB] SCS
Color0 SC
fill
[/DeviceRGB] SCS
Color1 SC
n
0.7000 0.6300 m
0.7000 0.2182 l
0.9290 0.2182 l
0.9290 0.6300 l
0.7000 0.6300 l
c
s
/Font4 FFSF
0.7872 0.5735 m
GS
[0.0224 0.0000 0.0000 0.0224 0 0] CC
(BR\(h -> bb\)) show
GR
[/DeviceRGB] SCS
Color2 SC
[] 0 SD
0.0045 SLW
n
0.7122 0.5794 m
0.7722 0.5794 l
s
/Font4 FFSF
[/DeviceRGB] SCS
Color1 SC
0.7872 0.5324 m
GS
[0.0224 0.0000 0.0000 0.0224 0 0] CC
(BR\(h -> cc\)) show
GR
[/DeviceRGB] SCS
Color3 SC
n
0.7122 0.5382 m
0.7722 0.5382 l
s
/Font4 FFSF
[/DeviceRGB] SCS
Color1 SC
0.7872 0.4912 m
GS
[0.0224 0.0000 0.0000 0.0224 0 0] CC
(BR\(h -> ) show
GR
/Symbol findfont
/Font12 exch definefont pop
/Font12 FFSF
0.8712 0.4912 m
GS
[0.0224 0.0000 0.0000 0.0224 0 0] CC
(tt) show
GR
/Font4 FFSF
0.8908 0.4912 m
GS
[0.0224 0.0000 0.0000 0.0224 0 0] CC
(\)) show
GR
[/DeviceRGB] SCS
Color4 SC
n
0.7122 0.4971 m
0.7722 0.4971 l
s
/Font4 FFSF
[/DeviceRGB] SCS
Color1 SC
0.7872 0.4500 m
GS
[0.0224 0.0000 0.0000 0.0224 0 0] CC
(BR\(h -> ) show
GR
/Font12 FFSF
0.8712 0.4500 m
GS
[0.0224 0.0000 0.0000 0.0224 0 0] CC
(mm) show
GR
/Font4 FFSF
0.8971 0.4500 m
GS
[0.0224 0.0000 0.0000 0.0224 0 0] CC
(\)) show
GR
[/DeviceRGB] SCS
Color5 SC
n
0.7122 0.4557 m
0.7722 0.4557 l
s
/Font4 FFSF
[/DeviceRGB] SCS
Color1 SC
0.7872 0.4084 m
GS
[0.0224 0.0000 0.0000 0.0224 0 0] CC
(BR\(h -> WW\)) show
GR
[/DeviceRGB] SCS
Color6 SC
n
0.7122 0.4143 m
0.7722 0.4143 l
s
/Font4 FFSF
[/DeviceRGB] SCS
Color1 SC
0.7872 0.3673 m
GS
[0.0224 0.0000 0.0000 0.0224 0 0] CC
(BR\(h -> ZZ\)) show
GR
[/DeviceRGB] SCS
Color7 SC
n
0.7122 0.3731 m
0.7722 0.3731 l
s
/Font4 FFSF
[/DeviceRGB] SCS
Color1 SC
0.7872 0.3261 m
GS
[0.0224 0.0000 0.0000 0.0224 0 0] CC
(BR\(h -> ) show
GR
/Font12 FFSF
0.8712 0.3261 m
GS
[0.0224 0.0000 0.0000 0.0224 0 0] CC
(gg) show
GR
/Font4 FFSF
0.8896 0.3261 m
GS
[0.0224 0.0000 0.0000 0.0224 0 0] CC
(\)) show
GR
[/DeviceRGB] SCS
Color8 SC
n
0.7122 0.3318 m
0.7722 0.3318 l
s
/Font4 FFSF
[/DeviceRGB] SCS
Color1 SC
0.7872 0.2845 m
GS
[0.0224 0.0000 0.0000 0.0224 0 0] CC
(BR\(h -> Z) show
GR
/Font12 FFSF
0.8849 0.2845 m
GS
[0.0224 0.0000 0.0000 0.0224 0 0] CC
(g) show
GR
/Font4 FFSF
0.8939 0.2845 m
GS
[0.0224 0.0000 0.0000 0.0224 0 0] CC
(\)) show
GR
[/DeviceRGB] SCS
Color9 SC
n
0.7122 0.2902 m
0.7722 0.2902 l
s
/Font4 FFSF
[/DeviceRGB] SCS
Color1 SC
0.7872 0.2429 m
GS
[0.0224 0.0000 0.0000 0.0224 0 0] CC
(BR\(h -> gg\)) show
GR
[/DeviceRGB] SCS
Color10 SC
n
0.7122 0.2488 m
0.7722 0.2488 l
s
/Font4 FFSF
[/DeviceRGB] SCS
Color1 SC
0.9700 0.7000 m
GS
[0.0000 0.0168 -0.0168 0.0000 0 0] CC
(LHC Higgs XS WG 2013) show
GR
/Font4 FFSF
0.7150 0.6050 m
GS
[0.0224 0.0000 0.0000 0.0224 0 0] CC
(m) show
GR
/Font4 FFSF
0.7338 0.5960 m
GS
[0.0158 0.0000 0.0000 0.0158 0 0] CC
(h) show
GR
/Font4 FFSF
0.7425 0.6184 m
GS
[0.0158 0.0000 0.0000 0.0158 0 0] CC
(max) show
GR
/Font4 FFSF
0.7723 0.6050 m
GS
[0.0224 0.0000 0.0000 0.0224 0 0] CC
(, tan) show
GR
/Font12 FFSF
0.8158 0.6050 m
GS
[0.0224 0.0000 0.0000 0.0224 0 0] CC
(b) show
GR
/Font4 FFSF
0.8279 0.6050 m
GS
[0.0224 0.0000 0.0000 0.0224 0 0] CC
( = 50) show
GR
%%Trailer
%%BoundingBox: 29 42 597 562
%%DocumentNeededResources: font Helvetica
%%+ font Symbol
%%EOF
