%!PS-Adobe-3.0 EPSF-3.0
%%BoundingBox: (atend)
%%LanguageLevel: 2
%%Creator: Grace-5.1.22
%%CreationDate: Wed Mar 27 23:05:35 2013
%%DocumentData: Clean8Bit
%%Orientation: Portrait
%%Title: /Users/spmartin/tex/papers/hint2/summary/shiftLO.agr
%%For: spmartin
%%DocumentNeededResources: (atend)
%%EndComments
%%BeginProlog
/m {moveto} def
/l {lineto} def
/s {stroke} def
/n {newpath} def
/c {closepath} def
/RL {rlineto} def
/SLW {setlinewidth} def
/GS {gsave} def
/GR {grestore} def
/SC {setcolor} def
/SGRY {setgray} def
/SRGB {setrgbcolor} def
/SD {setdash} def
/SLC {setlinecap} def
/SLJ {setlinejoin} def
/SCS {setcolorspace} def
/FFSF {findfont setfont} def
/CC {concat} def
/PXL {n m 0 0 RL s} def
/Color0 {1.0000 1.0000 1.0000} def
/Color1 {0.0000 0.0000 0.0000} def
/Color2 {1.0000 0.0000 0.0000} def
/Color3 {0.0000 1.0000 0.0000} def
/Color4 {0.0000 0.0000 1.0000} def
/Color5 {1.0000 1.0000 0.0000} def
/Color6 {0.7373 0.5608 0.5608} def
/Color7 {0.8627 0.8627 0.8627} def
/Color8 {0.5804 0.0000 0.8275} def
/Color9 {0.0000 1.0000 1.0000} def
/Color10 {1.0000 0.0000 1.0000} def
/Color11 {1.0000 0.6471 0.0000} def
/Color12 {0.4471 0.1294 0.7373} def
/Color13 {0.4039 0.0275 0.2824} def
/Color14 {0.2510 0.8784 0.8157} def
/Color15 {0.0000 0.5451 0.0000} def
/Color16 {0.7529 0.7529 0.7529} def
/Color17 {0.5059 0.5059 0.5059} def
/Color18 {0.2588 0.2588 0.2588} def
/Color19 {0.7529 0.8863 0.7529} def
/Color20 {0.5059 0.7725 0.5059} def
/Color21 {0.2588 0.6588 0.2588} def
/Color22 {0.7529 0.7529 1.0000} def
/Color23 {0.5059 0.5059 1.0000} def
/Color24 {0.2588 0.2588 1.0000} def
/Color25 {1.0000 0.7529 0.7529} def
/Color26 {1.0000 0.5059 0.5059} def
/Color27 {1.0000 0.2588 0.2588} def
/PTRN {
 /pat_bits exch def 
 <<
  /PaintType 2
  /PatternType 1 /TilingType 1
  /BBox[0 0 16 16]
  /XStep 16 /YStep 16
  /PaintProc {
   pop
   16 16 true [-1 0 0 -1 16 16] pat_bits imagemask
  }
 >>
 [0.0016 0 0 0.0016 0 0]
 makepattern
} def
/Pattern0 {<0000000000000000000000000000000000000000000000000000000000000000> PTRN} bind def
/Pattern1 {<ffffffffffffffffffffffffffffffffffffffffffffffffffffffffffffffff> PTRN} bind def
/Pattern2 {<eeeeffffbbbbffffeeeeffffbbbbffffeeeeffffbbbbffffeeeeffffbbbbffff> PTRN} bind def
/Pattern3 {<eeeebbbbeeeebbbbeeeebbbbeeeebbbbeeeebbbbeeeebbbbeeeebbbbeeeebbbb> PTRN} bind def
/Pattern4 {<5555aaaa5555aaaa5555aaaa5555aaaa5555aaaa5555aaaa5555aaaa5555aaaa> PTRN} bind def
/Pattern5 {<1111444411114444111144441111444411114444111144441111444411114444> PTRN} bind def
/Pattern6 {<1111000044440000111100004444000011110000444400001111000044440000> PTRN} bind def
/Pattern7 {<1010000000000000010100000000000010100000000000000101000000000000> PTRN} bind def
/Pattern8 {<0000000000000000000000000000000000000000000000000000000000000000> PTRN} bind def
/Pattern9 {<1e1e0f0f8787c3c3e1e1f0f078783c3c1e1e0f0f8787c3c3e1e1f0f078783c3c> PTRN} bind def
/Pattern10 {<7878f0f0e1e1c3c387870f0f1e1e3c3c7878f0f0e1e1c3c387870f0f1e1e3c3c> PTRN} bind def
/Pattern11 {<3333333333333333333333333333333333333333333333333333333333333333> PTRN} bind def
/Pattern12 {<ffffffff00000000ffffffff00000000ffffffff00000000ffffffff00000000> PTRN} bind def
/Pattern13 {<8181424224241818181824244242818181814242242418181818242442428181> PTRN} bind def
/Pattern14 {<8080404020201010080804040202010180804040202010100808040402020101> PTRN} bind def
/Pattern15 {<0101020204040808101020204040808001010202040408081010202040408080> PTRN} bind def
/Pattern16 {<2222222222222222222222222222222222222222222222222222222222222222> PTRN} bind def
/Pattern17 {<0000ffff000000000000ffff000000000000ffff000000000000ffff00000000> PTRN} bind def
/Pattern18 {<2222ffff222222222222ffff222222222222ffff222222222222ffff22222222> PTRN} bind def
/Pattern19 {<ffffffff33333333ffffffff33333333ffffffff33333333ffffffff33333333> PTRN} bind def
/Pattern20 {<0f0f0f0f0f0f0f0ff0f0f0f0f0f0f0f00f0f0f0f0f0f0f0ff0f0f0f0f0f0f0f0> PTRN} bind def
/Pattern21 {<ff00ff00ff00ff00ff00ff00ff00ff0000ff00ff00ff00ff00ff00ff00ff00ff> PTRN} bind def
/Pattern22 {<8001800180018001800180018001ffffffff8001800180018001800180018001> PTRN} bind def
/Pattern23 {<c003c003c003c003c003c003ffffffffffffffffc003c003c003c003c003c003> PTRN} bind def
/Pattern24 {<040404040404ffff404040404040ffff040404040404ffff404040404040ffff> PTRN} bind def
/Pattern25 {<180018001800180018001800ffffffff001800180018001800180018ffffffff> PTRN} bind def
/Pattern26 {<1111b8b87c7c3a3a1111a3a3c7c78b8b1111b8b87c7c3a3a1111a3a3c7c78b8b> PTRN} bind def
/Pattern27 {<101010102828c7c70101010182827c7c101010102828c7c70101010182827c7c> PTRN} bind def
/Pattern28 {<1c1c121211112121c1c12121111112121c1c121211112121c1c1212111111212> PTRN} bind def
/Pattern29 {<3e3e414180808080e3e31414080808083e3e414180808080e3e3141408080808> PTRN} bind def
/Pattern30 {<4848888884848383848488884848383848488888848483838484888848483838> PTRN} bind def
/Pattern31 {<03030404080808080c0c12122121c0c003030404080808080c0c12122121c0c0> PTRN} bind def
/ellipsedict 8 dict def
ellipsedict /mtrx matrix put
/EARC {
 ellipsedict begin
  /endangle exch def
  /startangle exch def
  /yrad exch def
  /xrad exch def
  /y exch def
  /x exch def
  /savematrix mtrx currentmatrix def
  x y translate
  xrad yrad scale
  0 0 1 startangle endangle arc
  savematrix setmatrix
 end
} def
/TL {
  /kcomp exch def
  /linewidth exch def
  /offset exch def
  GS
  0 offset rmoveto
  linewidth SLW
  dup stringwidth exch kcomp add exch RL s
  GR
} def
/KINIT
{
 /kvector exch def
 /kid 0 def
} def
/KPROC
{
 pop pop
 kvector kid get
 0 rmoveto
 /kid 1 kid add def
} def
/DefEncoding [
 /.notdef
 /.notdef
 /.notdef
 /.notdef
 /.notdef
 /.notdef
 /.notdef
 /.notdef
 /.notdef
 /.notdef
 /.notdef
 /.notdef
 /.notdef
 /.notdef
 /.notdef
 /.notdef
 /.notdef
 /.notdef
 /.notdef
 /.notdef
 /.notdef
 /.notdef
 /.notdef
 /.notdef
 /.notdef
 /.notdef
 /.notdef
 /.notdef
 /.notdef
 /.notdef
 /.notdef
 /.notdef
 /space
 /exclam
 /quotedbl
 /numbersign
 /dollar
 /percent
 /ampersand
 /quoteright
 /parenleft
 /parenright
 /asterisk
 /plus
 /comma
 /hyphen
 /period
 /slash
 /zero
 /one
 /two
 /three
 /four
 /five
 /six
 /seven
 /eight
 /nine
 /colon
 /semicolon
 /less
 /equal
 /greater
 /question
 /at
 /A
 /B
 /C
 /D
 /E
 /F
 /G
 /H
 /I
 /J
 /K
 /L
 /M
 /N
 /O
 /P
 /Q
 /R
 /S
 /T
 /U
 /V
 /W
 /X
 /Y
 /Z
 /bracketleft
 /backslash
 /bracketright
 /asciicircum
 /underscore
 /grave
 /a
 /b
 /c
 /d
 /e
 /f
 /g
 /h
 /i
 /j
 /k
 /l
 /m
 /n
 /o
 /p
 /q
 /r
 /s
 /t
 /u
 /v
 /w
 /x
 /y
 /z
 /braceleft
 /bar
 /braceright
 /asciitilde
 /.notdef
 /.notdef
 /.notdef
 /.notdef
 /.notdef
 /.notdef
 /.notdef
 /.notdef
 /.notdef
 /.notdef
 /.notdef
 /.notdef
 /.notdef
 /.notdef
 /.notdef
 /.notdef
 /.notdef
 /.notdef
 /.notdef
 /.notdef
 /.notdef
 /.notdef
 /.notdef
 /.notdef
 /.notdef
 /.notdef
 /.notdef
 /.notdef
 /.notdef
 /.notdef
 /.notdef
 /.notdef
 /.notdef
 /space
 /exclamdown
 /cent
 /sterling
 /currency
 /yen
 /brokenbar
 /section
 /dieresis
 /copyright
 /ordfeminine
 /guillemotleft
 /logicalnot
 /hyphen
 /registered
 /macron
 /degree
 /plusminus
 /twosuperior
 /threesuperior
 /acute
 /mu
 /paragraph
 /periodcentered
 /cedilla
 /onesuperior
 /ordmasculine
 /guillemotright
 /onequarter
 /onehalf
 /threequarters
 /questiondown
 /Agrave
 /Aacute
 /Acircumflex
 /Atilde
 /Adieresis
 /Aring
 /AE
 /Ccedilla
 /Egrave
 /Eacute
 /Ecircumflex
 /Edieresis
 /Igrave
 /Iacute
 /Icircumflex
 /Idieresis
 /Eth
 /Ntilde
 /Ograve
 /Oacute
 /Ocircumflex
 /Otilde
 /Odieresis
 /multiply
 /Oslash
 /Ugrave
 /Uacute
 /Ucircumflex
 /Udieresis
 /Yacute
 /Thorn
 /germandbls
 /agrave
 /aacute
 /acircumflex
 /atilde
 /adieresis
 /aring
 /ae
 /ccedilla
 /egrave
 /eacute
 /ecircumflex
 /edieresis
 /igrave
 /iacute
 /icircumflex
 /idieresis
 /eth
 /ntilde
 /ograve
 /oacute
 /ocircumflex
 /otilde
 /odieresis
 /divide
 /oslash
 /ugrave
 /uacute
 /ucircumflex
 /udieresis
 /yacute
 /thorn
 /ydieresis
] def
%%EndProlog
%%BeginSetup
%%EndSetup
613.92 613.92 scale
n
0.0000 0.0000 m
0.0000 1.0000 l
1.0993 1.0000 l
1.0993 0.0000 l
c
[/DeviceRGB] SCS
Color0 SC
eofill
[/DeviceRGB] SCS
Color4 SC
[] 0 SD
0.0045 SLW
0 SLC
0 SLJ
n
0.2049 0.7273 m
0.2050 0.7272 l
0.2613 0.7064 l
0.3177 0.6856 l
0.3740 0.6649 l
0.4303 0.6441 l
0.4867 0.6233 l
0.5430 0.6025 l
0.5993 0.5817 l
0.6557 0.5609 l
0.7120 0.5401 l
0.7683 0.5193 l
0.8247 0.4985 l
0.8810 0.4777 l
0.9373 0.4570 l
0.9937 0.4363 l
1.0500 0.4156 l
1.0501 0.4156 l
s
[/DeviceRGB] SCS
Color2 SC
[0.0225 0.0135 ] 0 SD
0.0045 SLW
n
0.2049 0.6494 m
0.2050 0.6494 l
0.2613 0.6221 l
0.3177 0.5948 l
0.3740 0.5674 l
0.4303 0.5401 l
0.4867 0.5128 l
0.5430 0.4855 l
0.5993 0.4581 l
0.6557 0.4308 l
0.7120 0.4034 l
0.7683 0.3761 l
0.8247 0.3487 l
0.8810 0.3214 l
0.9373 0.2941 l
0.9937 0.2668 l
1.0500 0.2395 l
1.0501 0.2395 l
s
[/DeviceRGB] SCS
Color1 SC
[] 0 SD
0.0015 SLW
n
0.2050 0.1300 m
1.0500 0.1300 l
s
n
0.2050 0.9770 m
1.0500 0.9770 l
s
[] 0 SD
0.0030 SLW
n
0.2050 0.1300 m
0.2050 0.1400 l
s
n
0.2050 0.9770 m
0.2050 0.9670 l
s
n
0.2613 0.1300 m
0.2613 0.1400 l
s
n
0.2613 0.9770 m
0.2613 0.9670 l
s
n
0.3177 0.1300 m
0.3177 0.1400 l
s
n
0.3177 0.9770 m
0.3177 0.9670 l
s
n
0.4303 0.1300 m
0.4303 0.1400 l
s
n
0.4303 0.9770 m
0.4303 0.9670 l
s
n
0.4867 0.1300 m
0.4867 0.1400 l
s
n
0.4867 0.9770 m
0.4867 0.9670 l
s
n
0.5430 0.1300 m
0.5430 0.1400 l
s
n
0.5430 0.9770 m
0.5430 0.9670 l
s
n
0.5993 0.1300 m
0.5993 0.1400 l
s
n
0.5993 0.9770 m
0.5993 0.9670 l
s
n
0.7120 0.1300 m
0.7120 0.1400 l
s
n
0.7120 0.9770 m
0.7120 0.9670 l
s
n
0.7683 0.1300 m
0.7683 0.1400 l
s
n
0.7683 0.9770 m
0.7683 0.9670 l
s
n
0.8247 0.1300 m
0.8247 0.1400 l
s
n
0.8247 0.9770 m
0.8247 0.9670 l
s
n
0.8810 0.1300 m
0.8810 0.1400 l
s
n
0.8810 0.9770 m
0.8810 0.9670 l
s
n
0.9937 0.1300 m
0.9937 0.1400 l
s
n
0.9937 0.9770 m
0.9937 0.9670 l
s
n
1.0500 0.1300 m
1.0500 0.1400 l
s
n
1.0500 0.9770 m
1.0500 0.9670 l
s
n
0.3740 0.1300 m
0.3740 0.1500 l
s
n
0.3740 0.9770 m
0.3740 0.9570 l
s
n
0.6557 0.1300 m
0.6557 0.1500 l
s
n
0.6557 0.9770 m
0.6557 0.9570 l
s
n
0.9373 0.1300 m
0.9373 0.1500 l
s
n
0.9373 0.9770 m
0.9373 0.9570 l
s
/Helvetica findfont
dup length dict begin
 {1 index /FID ne {def} {pop pop} ifelse} forall
 /Encoding DefEncoding def
 currentdict
end
/Font4 exch definefont pop
/Font4 FFSF
0.3367 0.0805 m
GS
[0.0554 0.0000 0.0000 0.0554 0 0] CC
(1.5) show
GR
/Font4 FFSF
0.6185 0.0809 m
GS
[0.0554 0.0000 0.0000 0.0554 0 0] CC
(2.0) show
GR
/Font4 FFSF
0.9000 0.0809 m
GS
[0.0554 0.0000 0.0000 0.0554 0 0] CC
(2.5) show
GR
/Symbol findfont
/Font12 exch definefont pop
/Font12 FFSF
0.4858 0.0252 m
GS
[0.0596 0.0000 0.0000 0.0596 0 0] CC
(s) show
GR
/Font4 FFSF
0.5218 0.0013 m
GS
[0.0422 0.0000 0.0000 0.0422 0 0] CC
(MR) show
GR
/Font4 FFSF
0.5874 0.0252 m
GS
[0.0596 0.0000 0.0000 0.0596 0 0] CC
(  [GeV]) show
GR
[] 0 SD
0.0015 SLW
n
0.2050 0.1300 m
0.2050 0.9770 l
s
n
1.0500 0.1300 m
1.0500 0.9770 l
s
[] 0 SD
0.0030 SLW
n
0.2050 0.1582 m
0.2150 0.1582 l
s
n
1.0500 0.1582 m
1.0400 0.1582 l
s
n
0.2050 0.1865 m
0.2150 0.1865 l
s
n
1.0500 0.1865 m
1.0400 0.1865 l
s
n
0.2050 0.2147 m
0.2150 0.2147 l
s
n
1.0500 0.2147 m
1.0400 0.2147 l
s
n
0.2050 0.2429 m
0.2150 0.2429 l
s
n
1.0500 0.2429 m
1.0400 0.2429 l
s
n
0.2050 0.2994 m
0.2150 0.2994 l
s
n
1.0500 0.2994 m
1.0400 0.2994 l
s
n
0.2050 0.3276 m
0.2150 0.3276 l
s
n
1.0500 0.3276 m
1.0400 0.3276 l
s
n
0.2050 0.3559 m
0.2150 0.3559 l
s
n
1.0500 0.3559 m
1.0400 0.3559 l
s
n
0.2050 0.3841 m
0.2150 0.3841 l
s
n
1.0500 0.3841 m
1.0400 0.3841 l
s
n
0.2050 0.4406 m
0.2150 0.4406 l
s
n
1.0500 0.4406 m
1.0400 0.4406 l
s
n
0.2050 0.4688 m
0.2150 0.4688 l
s
n
1.0500 0.4688 m
1.0400 0.4688 l
s
n
0.2050 0.4970 m
0.2150 0.4970 l
s
n
1.0500 0.4970 m
1.0400 0.4970 l
s
n
0.2050 0.5253 m
0.2150 0.5253 l
s
n
1.0500 0.5253 m
1.0400 0.5253 l
s
n
0.2050 0.5817 m
0.2150 0.5817 l
s
n
1.0500 0.5817 m
1.0400 0.5817 l
s
n
0.2050 0.6100 m
0.2150 0.6100 l
s
n
1.0500 0.6100 m
1.0400 0.6100 l
s
n
0.2050 0.6382 m
0.2150 0.6382 l
s
n
1.0500 0.6382 m
1.0400 0.6382 l
s
n
0.2050 0.6664 m
0.2150 0.6664 l
s
n
1.0500 0.6664 m
1.0400 0.6664 l
s
n
0.2050 0.7229 m
0.2150 0.7229 l
s
n
1.0500 0.7229 m
1.0400 0.7229 l
s
n
0.2050 0.7511 m
0.2150 0.7511 l
s
n
1.0500 0.7511 m
1.0400 0.7511 l
s
n
0.2050 0.7794 m
0.2150 0.7794 l
s
n
1.0500 0.7794 m
1.0400 0.7794 l
s
n
0.2050 0.8076 m
0.2150 0.8076 l
s
n
1.0500 0.8076 m
1.0400 0.8076 l
s
n
0.2050 0.8641 m
0.2150 0.8641 l
s
n
1.0500 0.8641 m
1.0400 0.8641 l
s
n
0.2050 0.8923 m
0.2150 0.8923 l
s
n
1.0500 0.8923 m
1.0400 0.8923 l
s
n
0.2050 0.9205 m
0.2150 0.9205 l
s
n
1.0500 0.9205 m
1.0400 0.9205 l
s
n
0.2050 0.9488 m
0.2150 0.9488 l
s
n
1.0500 0.9488 m
1.0400 0.9488 l
s
n
0.2050 0.1300 m
0.2250 0.1300 l
s
n
1.0500 0.1300 m
1.0300 0.1300 l
s
n
0.2050 0.2712 m
0.2250 0.2712 l
s
n
1.0500 0.2712 m
1.0300 0.2712 l
s
n
0.2050 0.4123 m
0.2250 0.4123 l
s
n
1.0500 0.4123 m
1.0300 0.4123 l
s
n
0.2050 0.5535 m
0.2250 0.5535 l
s
n
1.0500 0.5535 m
1.0300 0.5535 l
s
n
0.2050 0.6947 m
0.2250 0.6947 l
s
n
1.0500 0.6947 m
1.0300 0.6947 l
s
n
0.2050 0.8358 m
0.2250 0.8358 l
s
n
1.0500 0.8358 m
1.0300 0.8358 l
s
n
0.2050 0.9770 m
0.2250 0.9770 l
s
n
1.0500 0.9770 m
1.0300 0.9770 l
s
/Font4 FFSF
0.0902 0.1116 m
GS
[0.0535 0.0000 0.0000 0.0535 0 0] CC
(-300) show
GR
/Font4 FFSF
0.0902 0.2528 m
GS
[0.0535 0.0000 0.0000 0.0535 0 0] CC
(-250) show
GR
/Font4 FFSF
0.0902 0.3940 m
GS
[0.0535 0.0000 0.0000 0.0535 0 0] CC
(-200) show
GR
/Font4 FFSF
0.0902 0.5351 m
GS
[0.0535 0.0000 0.0000 0.0535 0 0] CC
(-150) show
GR
/Font4 FFSF
0.0902 0.6763 m
GS
[0.0535 0.0000 0.0000 0.0535 0 0] CC
(-100) show
GR
/Font4 FFSF
0.1199 0.8175 m
GS
[0.0535 0.0000 0.0000 0.0535 0 0] CC
(-50) show
GR
/Font4 FFSF
0.1676 0.9586 m
GS
[0.0535 0.0000 0.0000 0.0535 0 0] CC
(0) show
GR
/Font12 FFSF
0.0470 0.3924 m
GS
[0.0000 0.0596 -0.0596 0.0000 0 0] CC
(D) show
GR
/Font4 FFSF
0.0470 0.4288 m
GS
[0.0000 0.0596 -0.0596 0.0000 0 0] CC
(M) show
GR
/Font12 FFSF
0.0708 0.4784 m
GS
[0.0000 0.0422 -0.0422 0.0000 0 0] CC
(gg) show
GR
/Font4 FFSF
0.0470 0.5132 m
GS
[0.0000 0.0596 -0.0596 0.0000 0 0] CC
(   [MeV]) show
GR
n
0.2050 0.1300 m
0.2050 0.9770 l
1.0500 0.9770 l
1.0500 0.1300 l
0.2050 0.1300 l
c
s
n
0.4000 0.9500 m
0.4000 0.8446 l
0.9678 0.8446 l
0.9678 0.9500 l
c
[/DeviceRGB] SCS
Color0 SC
eofill
[/DeviceRGB] SCS
Color1 SC
[] 0 SD
0.0015 SLW
n
0.4000 0.9500 m
0.4000 0.8446 l
0.9678 0.8446 l
0.9678 0.9500 l
0.4000 0.9500 l
c
s
/Font4 FFSF
0.5372 0.9119 m
GS
[0.0381 0.0000 0.0000 0.0381 0 0] CC
(p) show
GR
/Font4 FFSF
0.5583 0.8966 m
GS
[0.0269 0.0000 0.0000 0.0269 0 0] CC
(T) show
GR
/Font4 FFSF
0.5747 0.9119 m
GS
[0.0381 0.0000 0.0000 0.0381 0 0] CC
(\() show
GR
/Font12 FFSF
0.5872 0.9119 m
GS
[0.0381 0.0000 0.0000 0.0381 0 0] CC
(g) show
GR
/Font4 FFSF
0.6028 0.9119 m
GS
[0.0381 0.0000 0.0000 0.0381 0 0] CC
(\) > 40 GeV, |) show
GR
/Font12 FFSF
0.8190 0.9119 m
GS
[0.0381 0.0000 0.0000 0.0381 0 0] CC
(h) show
GR
/Font12 FFSF
0.8421 0.8966 m
GS
[0.0269 0.0000 0.0000 0.0269 0 0] CC
(g) show
GR
/Font4 FFSF
0.8530 0.9119 m
GS
[0.0381 0.0000 0.0000 0.0381 0 0] CC
(| < 2.5) show
GR
[/DeviceRGB] SCS
Color4 SC
[] 0 SD
0.0045 SLW
n
0.4123 0.9154 m
0.5222 0.9154 l
s
/Font4 FFSF
[/DeviceRGB] SCS
Color1 SC
0.5372 0.8553 m
GS
[0.0381 0.0000 0.0000 0.0381 0 0] CC
(no cuts) show
GR
[/DeviceRGB] SCS
Color2 SC
[0.0225 0.0135 ] 0 SD
0.0045 SLW
n
0.4123 0.8677 m
0.5222 0.8677 l
s
/Font4 FFSF
[/DeviceRGB] SCS
Color1 SC
1.0960 0.5201 m
GS
[-0.0006 0.0367 -0.0367 -0.0006 0 0] CC
(LHC HIGGS XS WG 2013) show
GR
%%Trailer
%%BoundingBox: 1 -1 674 613
%%DocumentNeededResources: font Helvetica
%%+ font Symbol
%%EOF
