%!PS-Adobe-2.0 EPSF-2.0
%%BoundingBox:  0 0 567 547
%%Title: mzz_m1000.eps: Compare
%%Creator: ROOT Version 5.32/02
%%CreationDate: Thu Mar 28 14:59:04 2013
%%EndComments
%%BeginProlog
80 dict begin
/s {stroke} def /l {lineto} def /m {moveto} def /t {translate} def
/r {rotate} def /rl {roll}  def /R {repeat} def
/d {rlineto} def /rm {rmoveto} def /gr {grestore} def /f {eofill} def
/c {setrgbcolor} def /black {0 setgray} def /sd {setdash} def
/cl {closepath} def /sf {scalefont setfont} def /lw {setlinewidth} def
/box {m dup 0 exch d exch 0 d 0 exch neg d cl} def
/NC{systemdict begin initclip end}def/C{NC box clip newpath}def
/bl {box s} def /bf {box f} def /Y { 0 exch d} def /X { 0 d} def 
/K {{pop pop 0 moveto} exch kshow} bind def
/ita {/ang 15 def gsave [1 0 ang dup sin exch cos div 1 0 0] concat} def 
/mp {newpath /y exch def /x exch def} def
/side {[w .77 mul w .23 mul] .385 w mul sd w 0 l currentpoint t -144 r} def
/mr {mp x y w2 0 360 arc} def /m24 {mr s} def /m20 {mr f} def
/mb {mp x y w2 add m w2 neg 0 d 0 w neg d w 0 d 0 w d cl} def
/mt {mp x y w2 add m w2 neg w neg d w 0 d cl} def
/m21 {mb f} def /m25 {mb s} def /m22 {mt f} def /m26{mt s} def
/m23 {mp x y w2 sub m w2 w d w neg 0 d cl f} def
/m27 {mp x y w2 add m w3 neg w2 neg d w3 w2 neg d w3 w2 d cl s} def
/m28 {mp x w2 sub y w2 sub w3 add m w3 0 d  0 w3 neg d w3 0 d 0 w3 d w3 0 d  0 w3 d w3 neg 0 d 0 w3 d w3 neg 0 d 0 w3 neg d w3 neg 0 d cl s } def
/m29 {mp gsave x w2 sub y w2 add w3 sub m currentpoint t 4 {side} repeat cl fill gr} def
/m30 {mp gsave x w2 sub y w2 add w3 sub m currentpoint t 4 {side} repeat cl s gr} def
/m31 {mp x y w2 sub m 0 w d x w2 sub y m w 0 d x w2 sub y w2 add m w w neg d x w2 sub y w2 sub m w w d s} def
/m32 {mp x y w2 sub m w2 w d w neg 0 d cl s} def
/m33 {mp x y w2 add m w3 neg w2 neg d w3 w2 neg d w3 w2 d cl f} def
/m34 {mp x w2 sub y w2 sub w3 add m w3 0 d  0 w3 neg d w3 0 d 0 w3 d w3 0 d  0 w3 d w3 neg 0 d 0 w3 d w3 neg 0 d 0 w3 neg d w3 neg 0 d cl f } def
/m2 {mp x y w2 sub m 0 w d x w2 sub y m w 0 d s} def
/m5 {mp x w2 sub y w2 sub m w w d x w2 sub y w2 add m w w neg d s} def
/reEncode {exch findfont dup length dict begin {1 index /FID eq  {pop pop} {def} ifelse } forall /Encoding exch def currentdict end dup /FontName get exch definefont pop } def [/Times-Bold /Times-Italic /Times-BoldItalic /Helvetica /Helvetica-Oblique
 /Helvetica-Bold /Helvetica-BoldOblique /Courier /Courier-Oblique /Courier-Bold /Courier-BoldOblique /Times-Roman /AvantGarde-Book /AvantGarde-BookOblique /AvantGarde-Demi /AvantGarde-DemiOblique /Bookman-Demi /Bookman-DemiItalic /Bookman-Light
 /Bookman-LightItalic /Helvetica-Narrow /Helvetica-Narrow-Bold /Helvetica-Narrow-BoldOblique /Helvetica-Narrow-Oblique /NewCenturySchlbk-Roman /NewCenturySchlbk-Bold /NewCenturySchlbk-BoldItalic /NewCenturySchlbk-Italic /Palatino-Bold
 /Palatino-BoldItalic /Palatino-Italic /Palatino-Roman ] {ISOLatin1Encoding reEncode } forall%%EndProlog
%%BeginSetup
%%EndSetup
newpath  gsave  .25 .25 scale  gsave  0 0 t black[  ] 0 sd 3 lw 1 1 1 c 2268 2190 0 0 bf black 1 1 1 c 2222 1511 23 657 bf black 1 1 1 c 1756 1405 378 687 bf black 1756 1405 378 687 bl 0 1 0 c 6 lw 1 1 1 c black 0 1 0 c 378 1989 m 176 X -165 Y 175 X
 -147 Y 176 X -139 Y 176 X -129 Y 175 X -134 Y 176 X -105 Y 175 X -140 Y 176 X -100 Y 175 X -131 Y 176 X s black 3 lw 378 687 m 1756 X s
 gsave  2222 1511 23 657 C 1847.41 589.737 t 0 r /Helvetica findfont 48.945 sf 0 0 m ( M\(ZZ\) [GeV]) show NC gr  378 723 m -36 Y s 422 705 m -18 Y s 466 705 m -18 Y s 510 705 m -18 Y s 554 723 m -36 Y s 598 705 m -18 Y s 642 705 m -18 Y s 685 705 m
 -18 Y s 729 723 m -36 Y s 773 705 m -18 Y s 817 705 m -18 Y s 861 705 m -18 Y s 905 723 m -36 Y s 949 705 m -18 Y s 993 705 m -18 Y s 1037 705 m -18 Y s 1081 723 m -36 Y s 1124 705 m -18 Y s 1168 705 m -18 Y s 1212 705 m -18 Y s 1256 723 m -36 Y s
 1300 705 m -18 Y s 1344 705 m -18 Y s 1388 705 m -18 Y s 1432 723 m -36 Y s 1476 705 m -18 Y s 1519 705 m -18 Y s 1563 705 m -18 Y s 1607 723 m -36 Y s 1651 705 m -18 Y s 1695 705 m -18 Y s 1739 705 m -18 Y s 1783 723 m -36 Y s 1827 705 m -18 Y s
 1871 705 m -18 Y s 1914 705 m -18 Y s 1958 723 m -36 Y s 2002 705 m -18 Y s 2046 705 m -18 Y s 2090 705 m -18 Y s 2134 723 m -36 Y s 378 2092 m 1756 X s 378 2056 m 36 Y s 422 2074 m 18 Y s 466 2074 m 18 Y s 510 2074 m 18 Y s 554 2056 m 36 Y s 598
 2074 m 18 Y s 642 2074 m 18 Y s 685 2074 m 18 Y s 729 2056 m 36 Y s 773 2074 m 18 Y s 817 2074 m 18 Y s 861 2074 m 18 Y s 905 2056 m 36 Y s 949 2074 m 18 Y s 993 2074 m 18 Y s 1037 2074 m 18 Y s 1081 2056 m 36 Y s 1124 2074 m 18 Y s 1168 2074 m 18 Y
 s 1212 2074 m 18 Y s 1256 2056 m 36 Y s 1300 2074 m 18 Y s 1344 2074 m 18 Y s 1388 2074 m 18 Y s 1432 2056 m 36 Y s 1476 2074 m 18 Y s 1519 2074 m 18 Y s 1563 2074 m 18 Y s 1607 2056 m 36 Y s 1651 2074 m 18 Y s 1695 2074 m 18 Y s 1739 2074 m 18 Y s
 1783 2056 m 36 Y s 1827 2074 m 18 Y s 1871 2074 m 18 Y s 1914 2074 m 18 Y s 1958 2056 m 36 Y s 2002 2074 m 18 Y s 2046 2074 m 18 Y s 2090 2074 m 18 Y s 2134 2056 m 36 Y s 378 687 m 1405 Y s
 gsave  2222 1511 23 657 C 267.173 1808.31 t 90 r /Helvetica findfont 48.945 sf 0 0 m (/dM [pb/GeV]) show NC gr 
 gsave  2222 1511 23 657 C 267.173 1778.98 t 90 r /Symbol findfont 48.945 sf 0 0 m (s) show NC gr 
 gsave  2222 1511 23 657 C 267.173 1752.92 t 90 r /Helvetica findfont 48.945 sf 0 0 m (d) show NC gr  409 706 m -31 X s 409 753 m -31 X s 409 789 m -31 X s 409 819 m -31 X s 409 844 m -31 X s 409 865 m -31 X s 409 884 m -31 X s 440 901 m -62 X s
 gsave  2222 1511 23 657 C 319.305 899.267 t 0 r /Helvetica findfont 32.63 sf 0 0 m 
 26 10
(\25511) K NC gr 
 gsave  2222 1511 23 657 C 267.173 879.718 t 0 r /Helvetica findfont 48.945 sf 0 0 m (10) show NC gr  409 1014 m -31 X s 409 1079 m -31 X s 409 1126 m -31 X s 409 1162 m -31 X s 409 1192 m -31 X s 409 1216 m -31 X s 409 1238 m -31 X s 409 1257 m -31
 X s 440 1274 m -62 X s
 gsave  2222 1511 23 657 C 312.788 1277.22 t 0 r /Helvetica findfont 32.63 sf 0 0 m (\25510) show NC gr 
 gsave  2222 1511 23 657 C 260.657 1254.41 t 0 r /Helvetica findfont 48.945 sf 0 0 m (10) show NC gr  409 1387 m -31 X s 409 1452 m -31 X s 409 1499 m -31 X s 409 1535 m -31 X s 409 1564 m -31 X s 409 1589 m -31 X s 409 1611 m -31 X s 409 1630 m -31
 X s 440 1647 m -62 X s
 gsave  2222 1511 23 657 C 329.08 1648.66 t 0 r /Helvetica findfont 32.63 sf 0 0 m (\2559) show NC gr 
 gsave  2222 1511 23 657 C 276.948 1625.85 t 0 r /Helvetica findfont 48.945 sf 0 0 m (10) show NC gr  409 1759 m -31 X s 409 1825 m -31 X s 409 1872 m -31 X s 409 1908 m -31 X s 409 1937 m -31 X s 409 1962 m -31 X s 409 1984 m -31 X s 409 2003 m -31
 X s 440 2020 m -62 X s
 gsave  2222 1511 23 657 C 329.08 2023.35 t 0 r /Helvetica findfont 32.63 sf 0 0 m (\2558) show NC gr 
 gsave  2222 1511 23 657 C 276.948 2000.54 t 0 r /Helvetica findfont 48.945 sf 0 0 m (10) show NC gr  2134 687 m 1405 Y s 2103 706 m 31 X s 2103 753 m 31 X s 2103 789 m 31 X s 2103 819 m 31 X s 2103 844 m 31 X s 2103 865 m 31 X s 2103 884 m 31 X s
 2072 901 m 62 X s 2103 1014 m 31 X s 2103 1079 m 31 X s 2103 1126 m 31 X s 2103 1162 m 31 X s 2103 1192 m 31 X s 2103 1216 m 31 X s 2103 1238 m 31 X s 2103 1257 m 31 X s 2072 1274 m 62 X s 2103 1387 m 31 X s 2103 1452 m 31 X s 2103 1499 m 31 X s
 2103 1535 m 31 X s 2103 1564 m 31 X s 2103 1589 m 31 X s 2103 1611 m 31 X s 2103 1630 m 31 X s 2072 1647 m 62 X s 2103 1759 m 31 X s 2103 1825 m 31 X s 2103 1872 m 31 X s 2103 1908 m 31 X s 2103 1937 m 31 X s 2103 1962 m 31 X s 2103 1984 m 31 X s
 2103 2003 m 31 X s 2072 2020 m 62 X s 1 0 0 c[ 4 8] 0 sd 6 lw 1 1 1 c black 1 0 0 c 378 1975 m 176 X -165 Y 175 X -146 Y 176 X -136 Y 176 X -123 Y 175 X -128 Y 176 X -101 Y 175 X -135 Y 176 X -96 Y 175 X -126 Y 176 X s 0 0 1 c[ 20 20] 0 sd 1 1 1 c
 black 0 0 1 c 378 1975 m 176 X -165 Y 175 X -146 Y 176 X -142 Y 176 X -130 Y 175 X -133 Y 176 X -105 Y 175 X -139 Y 176 X -100 Y 175 X -130 Y 176 X s black[  ] 0 sd 3 lw 0.95 0.95 0.95 c 444 302 1534 1684 bf black 1534 1684 m 444 X s 1978 1684 m 302
 Y s 1978 1986 m -444 X s 1534 1986 m -302 Y s
 gsave  2222 1511 23 657 C 1642.14 1922.35 t 0 r /Helvetica-Bold findfont 42.419 sf 0 0 m (Fixed width) show NC gr  0 1 0 c 6 lw 1551 1936 m 77 X s black
 gsave  2222 1511 23 657 C 1642.14 1824.6 t 0 r /Helvetica-Bold findfont 42.419 sf 0 0 m (Naive prop.) show NC gr  1 0 0 c[ 4 8] 0 sd 1551 1835 m 77 X s black
 gsave  2222 1511 23 657 C 1642.14 1720.34 t 0 r /Helvetica-Bold findfont 42.419 sf 0 0 m 
 290 276 254 231 208 183 171 148 126 114 100 78 55 41 27
(Effective descr.) K NC gr  0 0 1 c[ 20 20] 0 sd 1551 1735 m 77 X s black
 gsave  2222 1511 23 657 C 2199.29 1752.92 t 90 r /Helvetica-BoldOblique findfont 29.367 sf 0 0 m (LHC HIGGS XS WG 2013) show NC gr [  ] 0 sd 3 lw 1 1 1 c 2222 613 23 22 bf black 1 1 1 c 1756 497 378 126 bf black 1756 497 378 126 bl 1 1 1 c 1756 497
 378 126 bf black 1756 497 378 126 bl 1 0 0 c[ 4 8] 0 sd 6 lw 1 1 1 c black 1 0 0 c 378 210 m 176 X 2 Y 175 X 3 Y 176 X 26 Y 176 X 70 Y 175 X 69 Y 176 X 49 Y 175 X 60 Y 176 X 51 Y 175 X 71 Y 176 X s black[  ] 0 sd 3 lw 378 126 m 1756 X s
 gsave  2222 613 23 22 C 1886.51 42.3568 t 0 r /Helvetica findfont 42.3928 sf 0 0 m ( M\(ZZ\) [GeV]) show NC gr  378 141 m -15 Y s 422 133 m -7 Y s 466 133 m -7 Y s 510 133 m -7 Y s 554 141 m -15 Y s 598 133 m -7 Y s 642 133 m -7 Y s 685 133 m -7 Y s
 729 141 m -15 Y s 773 133 m -7 Y s 817 133 m -7 Y s 861 133 m -7 Y s 905 141 m -15 Y s 949 133 m -7 Y s 993 133 m -7 Y s 1037 133 m -7 Y s 1081 141 m -15 Y s 1124 133 m -7 Y s 1168 133 m -7 Y s 1212 133 m -7 Y s 1256 141 m -15 Y s 1300 133 m -7 Y s
 1344 133 m -7 Y s 1388 133 m -7 Y s 1432 141 m -15 Y s 1476 133 m -7 Y s 1519 133 m -7 Y s 1563 133 m -7 Y s 1607 141 m -15 Y s 1651 133 m -7 Y s 1695 133 m -7 Y s 1739 133 m -7 Y s 1783 141 m -15 Y s 1827 133 m -7 Y s 1871 133 m -7 Y s 1914 133 m
 -7 Y s 1958 141 m -15 Y s 2002 133 m -7 Y s 2046 133 m -7 Y s 2090 133 m -7 Y s 2134 141 m -15 Y s
 gsave  2222 613 23 22 C 329.08 87.9718 t 0 r /Helvetica findfont 42.3928 sf 0 0 m (1000) show NC gr 
 gsave  2222 613 23 22 C 501.765 87.9718 t 0 r /Helvetica findfont 42.3928 sf 0 0 m (1200) show NC gr 
 gsave  2222 613 23 22 C 677.708 87.9718 t 0 r /Helvetica findfont 42.3928 sf 0 0 m (1400) show NC gr 
 gsave  2222 613 23 22 C 853.652 87.9718 t 0 r /Helvetica findfont 42.3928 sf 0 0 m (1600) show NC gr 
 gsave  2222 613 23 22 C 1029.6 87.9718 t 0 r /Helvetica findfont 42.3928 sf 0 0 m (1800) show NC gr 
 gsave  2222 613 23 22 C 1205.54 87.9718 t 0 r /Helvetica findfont 42.3928 sf 0 0 m (2000) show NC gr 
 gsave  2222 613 23 22 C 1381.48 87.9718 t 0 r /Helvetica findfont 42.3928 sf 0 0 m (2200) show NC gr 
 gsave  2222 613 23 22 C 1557.43 87.9718 t 0 r /Helvetica findfont 42.3928 sf 0 0 m (2400) show NC gr 
 gsave  2222 613 23 22 C 1733.37 87.9718 t 0 r /Helvetica findfont 42.3928 sf 0 0 m (2600) show NC gr 
 gsave  2222 613 23 22 C 1909.31 87.9718 t 0 r /Helvetica findfont 42.3928 sf 0 0 m (2800) show NC gr 
 gsave  2222 613 23 22 C 2082 87.9718 t 0 r /Helvetica findfont 42.3928 sf 0 0 m (3000) show NC gr  378 623 m 1756 X s 378 608 m 15 Y s 422 615 m 8 Y s 466 615 m 8 Y s 510 615 m 8 Y s 554 608 m 15 Y s 598 615 m 8 Y s 642 615 m 8 Y s 685 615 m 8 Y s
 729 608 m 15 Y s 773 615 m 8 Y s 817 615 m 8 Y s 861 615 m 8 Y s 905 608 m 15 Y s 949 615 m 8 Y s 993 615 m 8 Y s 1037 615 m 8 Y s 1081 608 m 15 Y s 1124 615 m 8 Y s 1168 615 m 8 Y s 1212 615 m 8 Y s 1256 608 m 15 Y s 1300 615 m 8 Y s 1344 615 m 8 Y
 s 1388 615 m 8 Y s 1432 608 m 15 Y s 1476 615 m 8 Y s 1519 615 m 8 Y s 1563 615 m 8 Y s 1607 608 m 15 Y s 1651 615 m 8 Y s 1695 615 m 8 Y s 1739 615 m 8 Y s 1783 608 m 15 Y s 1827 615 m 8 Y s 1871 615 m 8 Y s 1914 615 m 8 Y s 1958 608 m 15 Y s 2002
 615 m 8 Y s 2046 615 m 8 Y s 2090 615 m 8 Y s 2134 608 m 15 Y s 378 126 m 497 Y s 432 171 m -54 X s 405 190 m -27 X s 405 209 m -27 X s 405 228 m -27 X s 405 247 m -27 X s 432 266 m -54 X s 405 285 m -27 X s 405 304 m -27 X s 405 323 m -27 X s 405
 342 m -27 X s 432 361 m -54 X s 405 380 m -27 X s 405 398 m -27 X s 405 417 m -27 X s 405 436 m -27 X s 432 455 m -54 X s 405 474 m -27 X s 405 493 m -27 X s 405 512 m -27 X s 405 531 m -27 X s 432 550 m -54 X s 432 171 m -54 X s 405 152 m -27 X s
 405 133 m -27 X s 432 550 m -54 X s 405 569 m -27 X s 405 588 m -27 X s 405 607 m -27 X s
 gsave  2222 613 23 22 C 296.497 156.394 t 0 r /Helvetica findfont 42.3928 sf 0 0 m (\2550.1) show NC gr 
 gsave  2222 613 23 22 C 267.173 250.882 t 0 r /Helvetica findfont 42.3928 sf 0 0 m (\2550.05) show NC gr 
 gsave  2222 613 23 22 C 342.112 345.371 t 0 r /Helvetica findfont 42.3928 sf 0 0 m (0) show NC gr 
 gsave  2222 613 23 22 C 283.465 439.859 t 0 r /Helvetica findfont 42.3928 sf 0 0 m (0.05) show NC gr 
 gsave  2222 613 23 22 C 312.788 534.347 t 0 r /Helvetica findfont 42.3928 sf 0 0 m (0.1) show NC gr  2134 126 m 497 Y s 2080 171 m 54 X s 2107 190 m 27 X s 2107 209 m 27 X s 2107 228 m 27 X s 2107 247 m 27 X s 2080 266 m 54 X s 2107 285 m 27 X s
 2107 304 m 27 X s 2107 323 m 27 X s 2107 342 m 27 X s 2080 361 m 54 X s 2107 380 m 27 X s 2107 398 m 27 X s 2107 417 m 27 X s 2107 436 m 27 X s 2080 455 m 54 X s 2107 474 m 27 X s 2107 493 m 27 X s 2107 512 m 27 X s 2107 531 m 27 X s 2080 550 m 54 X
 s 2080 171 m 54 X s 2107 152 m 27 X s 2107 133 m 27 X s 2080 550 m 54 X s 2107 569 m 27 X s 2107 588 m 27 X s 2107 607 m 27 X s 0 0 1 c[ 20 20] 0 sd 6 lw 1 1 1 c black 0 0 1 c 378 210 m 176 X 2 Y 351 X -30 Y 176 X -6 Y 175 X 4 Y 176 X -3 Y 175 X 11
 Y 176 X 6 Y 175 X 6 Y 176 X s black[  12 12 ] 0 sd 0.95 0.95 0.95 c black 387 361 m 860 X s 1247 361 m 861 X s 2108 361 m 17 X s 1 1 1 c black
 gsave  2222 613 23 22 C 485.474 475.699 t 0 r /Helvetica findfont 71.7417 sf 0 0 m ([O\255O\(fixw\)]/O\(fixw\)) show NC gr 
 gr  gr showpage
end
%%EOF
