name,keyword,s,l,angle,x,y,z,theta,phi,psi,globaltilt,tilt,slot_id,assembly_id,mech_sep,v_pos,comments
short_injection$start,marker,0.0,0.0,0.0,-181.0263690293108,-31.491725701995655,1102.5766100412795,-6.420636736742941,-9.731142382241384e-06,-12.566292421797986,-9.424699768208193,0.0,0.0,0.0,0.0,0.0,
start_point,marker,0.0,0.0,0.0,-181.0263690293108,-31.491725701995655,1102.5766100412795,-6.420636736742941,-9.731142382241384e-06,-12.566292421797986,-12.566292421797986,0.0,0.0,0.0,0.0,0.0,
qid.102900,quadrupole,0.5,0.5,0.0,-181.09487854379836,-31.491730567566847,1103.0718942489837,-6.420636736742941,-9.731142382241384e-06,-12.566292421797986,-12.566292421797986,0.0,0.0,0.0,0.0,0.0,
drift_0,drift,1.100500000000102,0.600500000000102,0.0,-181.1771584706979,-31.49173641111785,1103.6667305824362,-6.420636736742941,-9.731142382241384e-06,-12.566292421797986,-12.566292421797986,0.0,0.0,0.0,0.0,0.0,
mdcv.102902,rbend,1.400500000000102,0.3,0.0001972,-181.21826417679344,-31.49176891046033,1103.9639011051643,-6.420636721323368,-0.00020693114177939342,-12.566292421796314,-10.995496095003089,1.5707963267948966,0.0,0.0,0.0,0.0,
drift_1,drift,1.813000000000011,0.41249999999990905,0.0,-181.27478451873762,-31.491854269555706,1104.3725105686624,-6.420636721323368,-0.00020693114177939342,-12.566292421796314,-12.566292421796314,0.0,0.0,0.0,0.0,0.0,
bspv.102904,monitor,2.263000000000011,0.45,0.0,-181.33644307358583,-31.491947388568843,1104.818266347024,-6.420636721323368,-0.00020693114177939342,-12.566292421796314,-12.566292421796314,0.0,0.0,0.0,0.0,0.0,
drift_2,drift,4.428000000000011,2.1649999999999996,0.0,-181.63308923191113,-31.4923953944876,1106.9628469251422,-6.420636721323368,-0.00020693114177939342,-12.566292421796314,-12.566292421796314,0.0,0.0,0.0,0.0,0.0,
bpcl.102911,monitor,5.14800000000001,0.72,0.0,-181.73174291966828,-31.492544384908616,1107.676056170521,-6.420636721323368,-0.00020693114177939342,-12.566292421796314,-12.566292421796314,0.0,0.0,0.0,0.0,0.0,
drift_3,drift,8.571120000000128,3.423120000000117,0.0,-182.20077543582832,-31.493252735033607,1111.066890659467,-6.420636721323368,-0.00020693114177939342,-12.566292421796314,-12.566292421796314,0.0,0.0,0.0,0.0,0.0,
bct.102921,monitor,9.431120000000128,0.86,0.0,-182.3186117850938,-31.49343069581427,1111.918779480336,-6.420636721323368,-0.00020693114177939342,-12.566292421796314,-12.566292421796314,0.0,0.0,0.0,0.0,0.0,
drift_4,drift,9.681120000000101,0.24999999999997335,0.0,-182.35286653778724,-31.493482428599343,1112.1664215794258,-6.420636721323368,-0.00020693114177939342,-12.566292421796314,-12.566292421796314,0.0,0.0,0.0,0.0,0.0,
btv.102924,monitor,10.1311200000001,0.45,0.0,-182.41452509263544,-31.49357554761248,1112.6121773577875,-6.420636721323368,-0.00020693114177939342,-12.566292421796314,-12.566292421796314,0.0,0.0,0.0,0.0,0.0,
drift_5,drift,10.381120000000147,0.2500000000000462,0.0,-182.44877984532891,-31.493627280397554,1112.8598194568774,-6.420636721323368,-0.00020693114177939342,-12.566292421796314,-12.566292421796314,0.0,0.0,0.0,0.0,0.0,
bsph.102925,monitor,10.831120000000146,0.45,0.0,-182.51043840017712,-31.49372039941069,1113.305575235239,-6.420636721323368,-0.00020693114177939342,-12.566292421796314,-12.566292421796314,0.0,0.0,0.0,0.0,0.0,
drift_6,drift,11.352120000000287,0.5210000000001411,0.0,-182.5818253047903,-31.49382821053479,1113.8216613697425,-6.420636721323368,-0.00020693114177939342,-12.566292421796314,-12.566292421796314,0.0,0.0,0.0,0.0,0.0,
mal.102928,rbend,14.752120000000287,3.4,0.0,-183.04768994142123,-31.49453177641182,1117.1895939173646,-6.420636721323368,-0.00020693114177939342,-12.566292421796314,-12.566292421796314,0.0,0.0,0.0,0.0,0.0,
drift_7,drift,15.158120000000192,0.40599999999990466,0.0,-183.10331965979537,-31.49461579045478,1117.5917646862865,-6.420636721323368,-0.00020693114177939342,-12.566292421796314,-12.566292421796314,0.0,0.0,0.0,0.0,0.0,
bsg.102937,monitor,15.608120000000191,0.45,0.0,-183.16497821464358,-31.494708909467917,1118.0375204646482,-6.420636721323368,-0.00020693114177939342,-12.566292421796314,-12.566292421796314,0.0,0.0,0.0,0.0,0.0,
drift_8,drift,25.084120000000112,9.475999999999923,0.0,-184.46337036073615,-31.496669788953426,1127.42414658855,-6.420636721323368,-0.00020693114177939342,-12.566292421796314,-12.566292421796314,0.0,0.0,0.0,0.0,0.0,
bpcl.102963,monitor,25.80412000000011,0.72,0.0,-184.5620240484933,-31.496818779374443,1128.1373558339287,-6.420636721323368,-0.00020693114177939342,-12.566292421796314,-12.566292421796314,0.0,0.0,0.0,0.0,0.0,
drift_9,drift,30.272120000000086,4.467999999999975,0.0,-185.17422498863067,-31.497743347709314,1132.5632154288626,-6.420636721323368,-0.00020693114177939342,-12.566292421796314,-12.566292421796314,0.0,0.0,0.0,0.0,0.0,
qif.103000,quadrupole,30.772120000000086,0.5,0.0,-185.24273449401758,-31.497846813279466,1133.0584996270422,-6.420636721323368,-0.00020693114177939342,-12.566292421796314,-12.566292421796314,0.0,0.0,0.0,0.0,0.0,
drift_10,drift,31.47412000000022,0.7020000000001332,0.0,-185.33892183958082,-31.49799207893996,1133.7538786412867,-6.420636721323368,-0.00020693114177939342,-12.566292421796314,-12.566292421796314,0.0,0.0,0.0,0.0,0.0,
bspv.103002,monitor,31.92412000000022,0.45,0.0,-185.40058039442903,-31.498085197953095,1134.1996344196484,-6.420636721323368,-0.00020693114177939342,-12.566292421796314,-12.566292421796314,0.0,0.0,0.0,0.0,0.0,
drift_11,drift,32.144120000000015,0.2199999999997999,0.0,-185.43072457679924,-31.49813072280396,1134.4175594668473,-6.420636721323368,-0.00020693114177939342,-12.566292421796314,-12.566292421796314,0.0,0.0,0.0,0.0,0.0,
mdca.103004,rbend,32.44412000000001,0.3,-0.0004156,-185.47183028544416,-31.49813046214665,1134.7147299893109,-6.4206367538201965,0.00020866885695010147,-12.566292421796287,-10.995496095001418,1.5707963267948966,0.0,0.0,0.0,0.0,
drift_12,drift,32.809120000000114,0.36500000000010147,0.0,-185.52184223610803,-31.498054298014416,1135.0762874522263,-6.4206367538201965,0.00020866885695010147,-12.566292421796287,-12.566292421796287,0.0,0.0,0.0,0.0,0.0,
msi.118350,hkicker,34.809120000000114,2.0,0.0,-185.79588032193735,-31.497636960303545,1137.0574242353243,-6.4206367538201965,0.00020866885695010147,-12.566292421796287,-12.566292421796287,0.0,0.0,0.0,0.0,0.0,
drift_13,drift,35.169120000000014,0.35999999999989996,0.0,-185.8452071773866,-31.497561839515587,1137.414028856282,-6.4206367538201965,0.00020866885695010147,-12.566292421796287,-12.566292421796287,0.0,0.0,0.0,0.0,0.0,
msi.118380,hkicker,37.169120000000014,2.0,0.0,-186.11924526321593,-31.497144501804716,1139.39516563938,-6.4206367538201965,0.00020866885695010147,-12.566292421796287,-12.566292421796287,0.0,0.0,0.0,0.0,0.0,
drift_14,drift,37.52912000000014,0.36000000000012733,0.0,-186.16857211866522,-31.497069381016757,1139.7517702603377,-6.4206367538201965,0.00020866885695010147,-12.566292421796287,-12.566292421796287,0.0,0.0,0.0,0.0,0.0,
msi.118520,hkicker,39.52912000000014,2.0,0.0,-186.44261020449454,-31.496652043305886,1141.7329070434357,-6.4206367538201965,0.00020866885695010147,-12.566292421796287,-12.566292421796287,0.0,0.0,0.0,0.0,0.0,
drift_15,drift,39.88912000000027,0.36000000000012733,0.0,-186.49193705994384,-31.496576922517928,1142.0895116643935,-6.4206367538201965,0.00020866885695010147,-12.566292421796287,-12.566292421796287,0.0,0.0,0.0,0.0,0.0,
msi.118550,hkicker,41.88912000000027,2.0,0.0,-186.76597514577315,-31.496159584807057,1144.0706484474915,-6.4206367538201965,0.00020866885695010147,-12.566292421796287,-12.566292421796287,0.0,0.0,0.0,0.0,0.0,
drift_16,drift,42.0635500000003,0.1744300000000294,0.0,-186.78987537742876,-31.496123186698604,1144.2434332920295,-6.4206367538201965,0.00020866885695010147,-12.566292421796287,-12.566292421796287,0.0,0.0,0.0,0.0,0.0,
ptd,marker,42.0635500000003,0.0,0.0,-186.78987537742876,-31.496123186698604,1144.2434332920295,-6.4206367538201965,0.00020866885695010147,-12.566292421796287,-12.566292421796287,0.0,0.0,0.0,0.0,0.0,
drift_17,drift,42.23905000000013,0.17549999999982901,0.0,-186.81392221946027,-31.496086565314474,1144.4172780447461,-6.4206367538201965,0.00020866885695010147,-12.566292421796287,-12.566292421796287,0.0,0.0,0.0,0.0,0.0,
endvknv11839,marker,42.23905000000013,0.0,0.0,-186.81392221946027,-31.496086565314474,1144.4172780447461,-6.4206367538201965,0.00020866885695010147,-12.566292421796287,-12.566292421796287,0.0,0.0,0.0,0.0,0.0,
endvknv,marker,42.23905000000013,0.0,0.0,-186.81392221946027,-31.496086565314474,1144.4172780447461,-6.4206367538201965,0.00020866885695010147,-12.566292421796287,-12.566292421796287,0.0,0.0,0.0,0.0,0.0,
drift_18,drift,42.329050000000564,0.09000000000043684,0.0,-186.82625393332265,-31.496067785117486,1144.5064291999859,-6.4206367538201965,0.00020866885695010147,-12.566292421796287,-12.566292421796287,0.0,0.0,0.0,0.0,0.0,
bsmh.11859,instrument,42.93905000000056,0.61,0.0,-186.9098355495006,-31.49594049711567,1145.1106759188308,-6.4206367538201965,0.00020866885695010147,-12.566292421796287,-12.566292421796287,0.0,2362117.0,0.0,0.0,0.0,
btv.11860,instrument,43.389050000000566,0.45,0.0,-186.9714941188122,-31.495846596130722,1145.5564316950279,-6.4206367538201965,0.00020866885695010147,-12.566292421796287,-12.566292421796287,0.0,2362118.0,0.0,0.0,0.0,
drift_19,drift,55.758050000000615,12.36900000000005,0.0,-188.6662826606236,-31.493265571057837,1157.808772130098,-6.4206367538201965,0.00020866885695010147,-12.566292421796287,-12.566292421796287,0.0,0.0,0.0,0.0,0.0,
tmasc.11897,collimator,55.758050000000615,0.0,0.0,-188.6662826606236,-31.493265571057837,1157.808772130098,-6.4206367538201965,0.00020866885695010147,-12.566292421796287,-12.566292421796287,0.0,53455365.0,0.0,0.0,0.0,
drift_20,drift,56.74505000000033,0.9869999999997177,0.0,-188.80152045598035,-31.493059614897522,1158.7864631325567,-6.4206367538201965,0.00020866885695010147,-12.566292421796287,-12.566292421796287,0.0,0.0,0.0,0.0,0.0,
vvsb.11903,instrument,56.92005000000033,0.175,0.0,-188.82549878849042,-31.49302309784782,1158.9598126010778,-6.4206367538201965,0.00020866885695010147,-12.566292421796287,-12.566292421796287,0.0,2362122.0,0.0,0.0,0.0,
drift_21,drift,57.04675000000021,0.1266999999998788,0.0,-188.8428591012277,-31.492996659503838,1159.085317616287,-6.4206367538201965,0.00020866885695010147,-12.566292421796287,-12.566292421796287,0.0,0.0,0.0,0.0,0.0,
mdva.11904,vkicker,57.47075000000021,0.424,0.0,-188.90095517542352,-31.492908183909133,1159.5053186143039,-6.4206367538201965,0.00020866885695010147,-12.566292421796287,-12.566292421796287,0.0,2362123.0,0.0,0.0,0.0,
drift_22,drift,57.499750000000006,0.02899999999979741,0.0,-188.90492872766802,-31.492902132512327,1159.5340450976587,-6.4206367538201965,0.00020866885695010147,-12.566292421796287,-12.566292421796287,0.0,0.0,0.0,0.0,0.0,
bpce.11906,monitor,57.899750000000004,0.4,0.0,-188.95973634483389,-31.49281866497015,1159.9302724542783,-6.4206367538201965,0.00020866885695010147,-12.566292421796287,-12.566292421796287,0.0,13005739.0,0.0,0.0,0.0,
drift_23,drift,58.2387500000003,0.33900000000029706,0.0,-189.00618580038199,-31.49274792622816,1160.2660751390138,-6.4206367538201965,0.00020866885695010147,-12.566292421796287,-12.566292421796287,0.0,0.0,0.0,0.0,0.0,
qda.11910,quadrupole,62.0297500000003,3.791,0.0,-189.52562499207147,-31.491956862597203,1164.0213199113762,-6.4206367538201965,0.00020866885695010147,-12.566292421796287,-12.566292421796287,0.0,2362125.0,0.0,0.0,0.0,
drift_24,drift,62.30775000000052,0.27800000000021896,0.0,-189.56371628600178,-31.491898852655392,1164.296697924227,-6.4206367538201965,0.00020866885695010147,-12.566292421796287,-12.566292421796287,0.0,0.0,0.0,0.0,0.0,
mkpa.11931,hkicker,65.73075000000051,3.423,0.0,-190.03273246989866,-31.491184579163235,1167.6874135284993,-6.4206367538201965,0.00020866885695010147,-12.566292421796287,-12.566292421796287,0.0,2362126.0,0.0,0.0,0.0,
drift_25,drift,65.92975000000081,0.1990000000002965,0.0,-190.0599992594387,-31.491143054061002,1167.8845366384178,-6.4206367538201965,0.00020866885695010147,-12.566292421796287,-12.566292421796287,0.0,0.0,0.0,0.0,0.0,
mkpa.11936,hkicker,69.35275000000081,3.423,0.0,-190.5290154433356,-31.490428780568845,1171.2752522426902,-6.4206367538201965,0.00020866885695010147,-12.566292421796287,-12.566292421796287,0.0,2362127.0,0.0,0.0,0.0,
drift_26,drift,69.55175000000018,0.1989999999993728,0.0,-190.55628223287553,-31.49038725546661,1171.4723753526077,-6.4206367538201965,0.00020866885695010147,-12.566292421796287,-12.566292421796287,0.0,0.0,0.0,0.0,0.0,
mkpc.11952,hkicker,71.33175000000018,1.78,0.0,-190.80017612926363,-31.490015824903935,1173.2355870895651,-6.4206367538201965,0.00020866885695010147,-12.566292421796287,-12.566292421796287,0.0,2362128.0,0.0,0.0,0.0,
drift_27,drift,71.53075000000047,0.19900000000028228,0.0,-190.82744291880368,-31.489974299801702,1173.4327101994836,-6.4206367538201965,0.00020866885695010147,-12.566292421796287,-12.566292421796287,0.0,0.0,0.0,0.0,0.0,
mkp.11955,hkicker,74.95375000000047,3.423,0.0,-191.29645910270057,-31.489260026309545,1176.823425803756,-6.4206367538201965,0.00020866885695010147,-12.566292421796287,-12.566292421796287,0.0,2362129.0,0.0,0.0,0.0,
drift_28,drift,75.1217500000001,0.16799999999963688,0.0,-191.31947830191018,-31.48922496994183,1176.9898412935358,-6.4206367538201965,0.00020866885695010147,-12.566292421796287,-12.566292421796287,0.0,0.0,0.0,0.0,0.0,
vvsb.11960,instrument,75.2967500000001,0.175,0.0,-191.34345663442025,-31.48918845289213,1177.163190762057,-6.4206367538201965,0.00020866885695010147,-12.566292421796287,-12.566292421796287,0.0,2362130.0,0.0,0.0,0.0,
drift_29,drift,75.72175000000028,0.4250000000001819,0.0,-191.401689727659,-31.48909976862857,1177.5841823284654,-6.4206367538201965,0.00020866885695010147,-12.566292421796287,-12.566292421796287,0.0,0.0,0.0,0.0,0.0,
mdsh.11971,hkicker,76.42175000000029,0.7,0.0,-191.49760305769928,-31.488953700429764,1178.2775802025499,-6.4206367538201965,0.00020866885695010147,-12.566292421796287,-12.566292421796287,0.0,2362131.0,0.0,0.0,0.0,
drift_30,drift,76.80575000000013,0.383999999999844,0.0,-191.5502183701785,-31.488873571589277,1178.6579584649046,-6.4206367538201965,0.00020866885695010147,-12.566292421796287,-12.566292421796287,0.0,0.0,0.0,0.0,0.0,
btv.11973,instrument,77.25575000000013,0.45,0.0,-191.6118769394901,-31.48877967060433,1179.1037142411017,-6.4206367538201965,0.00020866885695010147,-12.566292421796287,-12.566292421796287,0.0,2362132.0,0.0,0.0,0.0,
drift_31,drift,84.26075000000003,7.004999999999896,0.0,-192.57169533510728,-31.487317945272004,1186.0426458239026,-6.4206367538201965,0.00020866885695010147,-12.566292421796287,-12.566292421796287,0.0,0.0,0.0,0.0,0.0,
btvs.11994,instrument,84.79075000000003,0.53,0.0,-192.64431542785204,-31.487207350778622,1186.5676470714236,-6.4206367538201965,0.00020866885695010147,-12.566292421796287,-12.566292421796287,0.0,2362135.0,0.0,0.0,0.0,
drift_32,drift,85.05075000000076,0.26000000000072987,0.0,-192.67994037900993,-31.48715309687621,1186.825194853227,-6.4206367538201965,0.00020866885695010147,-12.566292421796287,-12.566292421796287,0.0,0.0,0.0,0.0,0.0,
tbsj.11995,collimator,87.15075000000076,2.1,0.0,-192.96768036913073,-31.486714892279796,1188.90538847548,-6.4206367538201965,0.00020866885695010147,-12.566292421796287,-12.566292421796287,0.0,2362136.0,0.0,0.0,0.0,
drift_33,drift,88.55575000000057,1.4049999999998164,0.0,-193.1601921244258,-31.486421712537908,1190.2971370656064,-6.4206367538201965,0.00020866885695010147,-12.566292421796287,-12.566292421796287,0.0,0.0,0.0,0.0,0.0,
loe.12002,octupole,89.29575000000057,0.74,0.0,-193.26158621618265,-31.486267297584885,1191.0301576753527,-6.4206367538201965,0.00020866885695010147,-12.566292421796287,-12.566292421796287,0.0,2362137.0,0.0,0.0,0.0,
drift_34,drift,89.38295000000073,0.08720000000016626,0.0,-193.27353427672483,-31.48624910166069,1191.116535239096,-6.4206367538201965,0.00020866885695010147,-12.566292421796287,-12.566292421796287,0.0,0.0,0.0,0.0,0.0,
lsf.12005,sextupole,89.80595000000073,0.423,0.0,-193.33149333187774,-31.48616083473484,1191.5355456687212,-6.4206367538201965,0.00020866885695010147,-12.566292421796287,-12.566292421796287,0.0,2362138.0,0.0,0.0,0.0,
drift_35,drift,89.94445000000019,0.1384999999994534,0.0,-193.35047046932135,-31.486131934098363,1191.6727393909503,-6.4206367538201965,0.00020866885695010147,-12.566292421796287,-12.566292421796287,0.0,0.0,0.0,0.0,0.0,
mdh.12007,hkicker,90.19445000000019,0.25,0.0,-193.38472523005,-31.486079766884504,1191.9203814888376,-6.4206367538201965,0.00020866885695010147,-12.566292421796287,-12.566292421796287,0.0,2362139.0,0.0,0.0,0.0,
drift_36,drift,90.21945000000055,0.025000000000360956,0.0,-193.38815070612293,-31.486074550163117,1191.9451456986267,-6.4206367538201965,0.00020866885695010147,-12.566292421796287,-12.566292421796287,0.0,0.0,0.0,0.0,0.0,
bph.12008,hmonitor,90.49445000000055,0.275,0.0,-193.42583094292445,-31.48601716622787,1192.2175520063026,-6.4206367538201965,0.00020866885695010147,-12.566292421796287,-12.566292421796287,0.0,2362140.0,0.0,0.0,0.0,
drift_37,drift,90.58945000000018,0.09499999999962938,0.0,-193.4388477520013,-31.485997342686606,1192.3116560034994,-6.4206367538201965,0.00020866885695010147,-12.566292421796287,-12.566292421796287,0.0,0.0,0.0,0.0,0.0,
qf.12010,quadrupole,93.67445000000018,3.085,0.0,-193.86155149939302,-31.485353599267587,1195.3675594914282,-6.4206367538201965,0.00020866885695010147,-12.566292421796287,-12.566292421796287,0.0,2362141.0,0.0,0.0,0.0,
end_point,marker,93.67445000000018,0.0,0.0,-193.86155149939302,-31.485353599267587,1195.3675594914282,-6.4206367538201965,0.00020866885695010147,-12.566292421796287,-12.566292421796287,0.0,0.0,0.0,0.0,0.0,
short_injection$end,marker,93.67445000000018,0.0,0.0,-193.86155149939302,-31.485353599267587,1195.3675594914282,-6.4206367538201965,0.00020866885695010147,-12.566292421796287,-12.566292421796287,0.0,0.0,0.0,0.0,0.0,
