G04 #@! TF.FileFunction,Profile,NP*
%FSLAX46Y46*%
G04 Gerber Fmt 4.6, Leading zero omitted, Abs format (unit mm)*
G04 Created by KiCad (PCBNEW 4.0.6) date Thursday, 08 November 2018 'PMt' 12:02:13*
%MOMM*%
%LPD*%
G01*
G04 APERTURE LIST*
%ADD10C,0.100000*%
%ADD11C,0.150000*%
G04 APERTURE END LIST*
D10*
D11*
X104140000Y-153670000D02*
X104140000Y-52070000D01*
X180340000Y-153670000D02*
X104140000Y-153670000D01*
X180340000Y-52070000D02*
X180340000Y-153670000D01*
X104140000Y-52070000D02*
X180340000Y-52070000D01*
M02*
