G04 #@! TF.FileFunction,Paste,Bot*
%FSLAX46Y46*%
G04 Gerber Fmt 4.6, Leading zero omitted, Abs format (unit mm)*
G04 Created by KiCad (PCBNEW 4.0.6) date Thursday, 08 November 2018 'PMt' 12:02:13*
%MOMM*%
%LPD*%
G01*
G04 APERTURE LIST*
%ADD10C,0.100000*%
%ADD11R,0.600000X0.500000*%
%ADD12R,0.330200X2.750000*%
G04 APERTURE END LIST*
D10*
D11*
X152379500Y-53911500D03*
X153479500Y-53911500D03*
D12*
X142240000Y-66100000D03*
X142740000Y-66100000D03*
X143240000Y-66100000D03*
X143740000Y-66100000D03*
X144240000Y-66100000D03*
X144740000Y-66100000D03*
X145240000Y-66100000D03*
X145740000Y-66100000D03*
X146240000Y-66100000D03*
X146740000Y-66100000D03*
X141740000Y-66100000D03*
X141240000Y-66100000D03*
X140740000Y-66100000D03*
X140240000Y-66100000D03*
X139740000Y-66100000D03*
X139240000Y-66100000D03*
X138740000Y-66100000D03*
X138240000Y-66100000D03*
X147240000Y-66100000D03*
X147740000Y-66100000D03*
M02*
