G04 #@! TF.FileFunction,Legend,Bot*
%FSLAX46Y46*%
G04 Gerber Fmt 4.6, Leading zero omitted, Abs format (unit mm)*
G04 Created by KiCad (PCBNEW 4.0.6) date Thursday, 08 November 2018 'PMt' 12:02:13*
%MOMM*%
%LPD*%
G01*
G04 APERTURE LIST*
%ADD10C,0.100000*%
%ADD11C,0.150000*%
%ADD12C,0.254000*%
G04 APERTURE END LIST*
D10*
D11*
X133740000Y-66500000D02*
X133740000Y-65000000D01*
X150740000Y-65000000D02*
X150740000Y-66500000D01*
X150740000Y-58000000D02*
X150740000Y-62000000D01*
X150740000Y-55000000D02*
X150740000Y-55500000D01*
X133740000Y-55000000D02*
X133740000Y-55500000D01*
X133740000Y-62000000D02*
X133740000Y-58000000D01*
X133740000Y-66500000D02*
X137740000Y-66500000D01*
X148240000Y-66500000D02*
X150740000Y-66500000D01*
X133740000Y-52540000D02*
X133740000Y-55000000D01*
X150740000Y-52540000D02*
X150740000Y-55000000D01*
X150690000Y-52540000D02*
X133790000Y-52540000D01*
X153096166Y-55538643D02*
X153143785Y-55586262D01*
X153286642Y-55633881D01*
X153381880Y-55633881D01*
X153524738Y-55586262D01*
X153619976Y-55491024D01*
X153667595Y-55395786D01*
X153715214Y-55205310D01*
X153715214Y-55062452D01*
X153667595Y-54871976D01*
X153619976Y-54776738D01*
X153524738Y-54681500D01*
X153381880Y-54633881D01*
X153286642Y-54633881D01*
X153143785Y-54681500D01*
X153096166Y-54729119D01*
X152715214Y-54729119D02*
X152667595Y-54681500D01*
X152572357Y-54633881D01*
X152334261Y-54633881D01*
X152239023Y-54681500D01*
X152191404Y-54729119D01*
X152143785Y-54824357D01*
X152143785Y-54919595D01*
X152191404Y-55062452D01*
X152762833Y-55633881D01*
X152143785Y-55633881D01*
D12*
X152642147Y-58910099D02*
X152642147Y-59635813D01*
X152690527Y-59780956D01*
X152787289Y-59877718D01*
X152932432Y-59926099D01*
X153029194Y-59926099D01*
X151626147Y-59926099D02*
X152206718Y-59926099D01*
X151916432Y-59926099D02*
X151916432Y-58910099D01*
X152013194Y-59055242D01*
X152109956Y-59152004D01*
X152206718Y-59200385D01*
M02*
