M48
;DRILL file {KiCad (5.0.0-3-g5ebb6b6)} date Thursday, 06 June 2019 at 13:48:47
;FORMAT={-:-/ absolute / inch / decimal}
FMAT,2
INCH,TZ
T1C0.0571
T2C0.1260
%
G90
G05
M72
T1
X5.6Y-2.1976
T2
X6.6Y-5.3
X4.6Y-5.3
X4.25Y-5.9
X4.25Y-3.2
X4.6Y-4.7
X4.6Y-5.9
X4.25Y-2.2
X6.6Y-4.7
X6.95Y-5.9
X6.95Y-2.2
X6.6Y-5.9
X6.95Y-3.2
T0
M30
