(module unplatedHole_1mm (layer F.Cu) (tedit 59F4FCB1)
  (fp_text reference REF** (at 0 1.45) (layer F.SilkS) hide
    (effects (font (size 1 1) (thickness 0.15)))
  )
  (fp_text value unplatedHole_1mm (at 0 -1.7) (layer F.Fab) hide
    (effects (font (size 1 1) (thickness 0.15)))
  )
  (pad 1 thru_hole circle (at 0 0) (size 1 1) (drill 1) (layers *.Cu *.Mask))
)
