G04 #@! TF.GenerationSoftware,KiCad,Pcbnew,(5.0.0-3-g5ebb6b6)*
G04 #@! TF.CreationDate,2019-06-06T13:48:45-07:00*
G04 #@! TF.ProjectId,connector_rd53a_hybrid_quad,636F6E6E6563746F725F72643533615F,rev?*
G04 #@! TF.SameCoordinates,Original*
G04 #@! TF.FileFunction,Legend,Top*
G04 #@! TF.FilePolarity,Positive*
%FSLAX46Y46*%
G04 Gerber Fmt 4.6, Leading zero omitted, Abs format (unit mm)*
G04 Created by KiCad (PCBNEW (5.0.0-3-g5ebb6b6)) date Thursday, 06 June 2019 at 13:48:45*
%MOMM*%
%LPD*%
G01*
G04 APERTURE LIST*
%ADD10C,0.152400*%
%ADD11C,0.254000*%
%ADD12C,0.050000*%
%ADD13C,0.010000*%
%ADD14C,0.120000*%
%ADD15C,0.150000*%
G04 APERTURE END LIST*
D10*
X153924380Y-106129314D02*
X154255047Y-107134914D01*
X154585714Y-106129314D01*
X154916380Y-107134914D02*
X154916380Y-106464514D01*
X154916380Y-106129314D02*
X154869142Y-106177200D01*
X154916380Y-106225085D01*
X154963619Y-106177200D01*
X154916380Y-106129314D01*
X154916380Y-106225085D01*
X155388761Y-106464514D02*
X155388761Y-107134914D01*
X155388761Y-106560285D02*
X155436000Y-106512400D01*
X155530476Y-106464514D01*
X155672190Y-106464514D01*
X155766666Y-106512400D01*
X155813904Y-106608171D01*
X155813904Y-107134914D01*
X128524380Y-106136761D02*
X128855047Y-107128761D01*
X129185714Y-106136761D01*
X129516380Y-107128761D02*
X129516380Y-106467428D01*
X129516380Y-106136761D02*
X129469142Y-106184000D01*
X129516380Y-106231238D01*
X129563619Y-106184000D01*
X129516380Y-106136761D01*
X129516380Y-106231238D01*
X129988761Y-106467428D02*
X129988761Y-107128761D01*
X129988761Y-106561904D02*
X130036000Y-106514666D01*
X130130476Y-106467428D01*
X130272190Y-106467428D01*
X130366666Y-106514666D01*
X130413904Y-106609142D01*
X130413904Y-107128761D01*
X154185257Y-109994700D02*
X154090914Y-109947528D01*
X153949400Y-109947528D01*
X153807885Y-109994700D01*
X153713542Y-110089042D01*
X153666371Y-110183385D01*
X153619200Y-110372071D01*
X153619200Y-110513585D01*
X153666371Y-110702271D01*
X153713542Y-110796614D01*
X153807885Y-110890957D01*
X153949400Y-110938128D01*
X154043742Y-110938128D01*
X154185257Y-110890957D01*
X154232428Y-110843785D01*
X154232428Y-110513585D01*
X154043742Y-110513585D01*
X154656971Y-110938128D02*
X154656971Y-109947528D01*
X155223028Y-110938128D01*
X155223028Y-109947528D01*
X155694742Y-110938128D02*
X155694742Y-109947528D01*
X155930600Y-109947528D01*
X156072114Y-109994700D01*
X156166457Y-110089042D01*
X156213628Y-110183385D01*
X156260800Y-110372071D01*
X156260800Y-110513585D01*
X156213628Y-110702271D01*
X156166457Y-110796614D01*
X156072114Y-110890957D01*
X155930600Y-110938128D01*
X155694742Y-110938128D01*
X128785257Y-109994700D02*
X128690914Y-109947528D01*
X128549400Y-109947528D01*
X128407885Y-109994700D01*
X128313542Y-110089042D01*
X128266371Y-110183385D01*
X128219200Y-110372071D01*
X128219200Y-110513585D01*
X128266371Y-110702271D01*
X128313542Y-110796614D01*
X128407885Y-110890957D01*
X128549400Y-110938128D01*
X128643742Y-110938128D01*
X128785257Y-110890957D01*
X128832428Y-110843785D01*
X128832428Y-110513585D01*
X128643742Y-110513585D01*
X129256971Y-110938128D02*
X129256971Y-109947528D01*
X129823028Y-110938128D01*
X129823028Y-109947528D01*
X130294742Y-110938128D02*
X130294742Y-109947528D01*
X130530600Y-109947528D01*
X130672114Y-109994700D01*
X130766457Y-110089042D01*
X130813628Y-110183385D01*
X130860800Y-110372071D01*
X130860800Y-110513585D01*
X130813628Y-110702271D01*
X130766457Y-110796614D01*
X130672114Y-110890957D01*
X130530600Y-110938128D01*
X130294742Y-110938128D01*
D11*
X176941238Y-139149666D02*
X176457428Y-139149666D01*
X177038000Y-138859380D02*
X176699333Y-139875380D01*
X176360666Y-138859380D01*
X176022000Y-138956142D02*
X175973619Y-138907761D01*
X176022000Y-138859380D01*
X176070380Y-138907761D01*
X176022000Y-138956142D01*
X176022000Y-138859380D01*
X174764095Y-138859380D02*
X174764095Y-139875380D01*
X174522190Y-139875380D01*
X174377047Y-139827000D01*
X174280285Y-139730238D01*
X174231904Y-139633476D01*
X174183523Y-139439952D01*
X174183523Y-139294809D01*
X174231904Y-139101285D01*
X174280285Y-139004523D01*
X174377047Y-138907761D01*
X174522190Y-138859380D01*
X174764095Y-138859380D01*
X173748095Y-138859380D02*
X173748095Y-139536714D01*
X173748095Y-139875380D02*
X173796476Y-139827000D01*
X173748095Y-139778619D01*
X173699714Y-139827000D01*
X173748095Y-139875380D01*
X173748095Y-139778619D01*
X173264285Y-138859380D02*
X173264285Y-139536714D01*
X173264285Y-139439952D02*
X173215904Y-139488333D01*
X173119142Y-139536714D01*
X172974000Y-139536714D01*
X172877238Y-139488333D01*
X172828857Y-139391571D01*
X172828857Y-138859380D01*
X172828857Y-139391571D02*
X172780476Y-139488333D01*
X172683714Y-139536714D01*
X172538571Y-139536714D01*
X172441809Y-139488333D01*
X172393428Y-139391571D01*
X172393428Y-138859380D01*
X171909619Y-138859380D02*
X171909619Y-139536714D01*
X171909619Y-139875380D02*
X171958000Y-139827000D01*
X171909619Y-139778619D01*
X171861238Y-139827000D01*
X171909619Y-139875380D01*
X171909619Y-139778619D01*
X171570952Y-139536714D02*
X171183904Y-139536714D01*
X171425809Y-139875380D02*
X171425809Y-139004523D01*
X171377428Y-138907761D01*
X171280666Y-138859380D01*
X171183904Y-138859380D01*
X170845238Y-138859380D02*
X170845238Y-139536714D01*
X170845238Y-139343190D02*
X170796857Y-139439952D01*
X170748476Y-139488333D01*
X170651714Y-139536714D01*
X170554952Y-139536714D01*
X170216285Y-138859380D02*
X170216285Y-139536714D01*
X170216285Y-139875380D02*
X170264666Y-139827000D01*
X170216285Y-139778619D01*
X170167904Y-139827000D01*
X170216285Y-139875380D01*
X170216285Y-139778619D01*
X169345428Y-138907761D02*
X169442190Y-138859380D01*
X169635714Y-138859380D01*
X169732476Y-138907761D01*
X169780857Y-139004523D01*
X169780857Y-139391571D01*
X169732476Y-139488333D01*
X169635714Y-139536714D01*
X169442190Y-139536714D01*
X169345428Y-139488333D01*
X169297047Y-139391571D01*
X169297047Y-139294809D01*
X169780857Y-139198047D01*
X168958380Y-139536714D02*
X168716476Y-138859380D01*
X168474571Y-139536714D01*
X168135904Y-138907761D02*
X168039142Y-138859380D01*
X167845619Y-138859380D01*
X167748857Y-138907761D01*
X167700476Y-139004523D01*
X167700476Y-139052904D01*
X167748857Y-139149666D01*
X167845619Y-139198047D01*
X167990761Y-139198047D01*
X168087523Y-139246428D01*
X168135904Y-139343190D01*
X168135904Y-139391571D01*
X168087523Y-139488333D01*
X167990761Y-139536714D01*
X167845619Y-139536714D01*
X167748857Y-139488333D01*
X167265047Y-138859380D02*
X167265047Y-139875380D01*
X167168285Y-139246428D02*
X166878000Y-138859380D01*
X166878000Y-139536714D02*
X167265047Y-139149666D01*
X166007142Y-138859380D02*
X166007142Y-139391571D01*
X166055523Y-139488333D01*
X166152285Y-139536714D01*
X166345809Y-139536714D01*
X166442571Y-139488333D01*
X166007142Y-138907761D02*
X166103904Y-138859380D01*
X166345809Y-138859380D01*
X166442571Y-138907761D01*
X166490952Y-139004523D01*
X166490952Y-139101285D01*
X166442571Y-139198047D01*
X166345809Y-139246428D01*
X166103904Y-139246428D01*
X166007142Y-139294809D01*
X174546380Y-138097380D02*
X174546380Y-137371666D01*
X174594761Y-137226523D01*
X174691523Y-137129761D01*
X174836666Y-137081380D01*
X174933428Y-137081380D01*
X173627142Y-137758714D02*
X173627142Y-137081380D01*
X174062571Y-137758714D02*
X174062571Y-137226523D01*
X174014190Y-137129761D01*
X173917428Y-137081380D01*
X173772285Y-137081380D01*
X173675523Y-137129761D01*
X173627142Y-137178142D01*
X173143333Y-137758714D02*
X173143333Y-137081380D01*
X173143333Y-137661952D02*
X173094952Y-137710333D01*
X172998190Y-137758714D01*
X172853047Y-137758714D01*
X172756285Y-137710333D01*
X172707904Y-137613571D01*
X172707904Y-137081380D01*
X171498380Y-138000619D02*
X171450000Y-138049000D01*
X171353238Y-138097380D01*
X171111333Y-138097380D01*
X171014571Y-138049000D01*
X170966190Y-138000619D01*
X170917809Y-137903857D01*
X170917809Y-137807095D01*
X170966190Y-137661952D01*
X171546761Y-137081380D01*
X170917809Y-137081380D01*
X170288857Y-138097380D02*
X170192095Y-138097380D01*
X170095333Y-138049000D01*
X170046952Y-138000619D01*
X169998571Y-137903857D01*
X169950190Y-137710333D01*
X169950190Y-137468428D01*
X169998571Y-137274904D01*
X170046952Y-137178142D01*
X170095333Y-137129761D01*
X170192095Y-137081380D01*
X170288857Y-137081380D01*
X170385619Y-137129761D01*
X170434000Y-137178142D01*
X170482380Y-137274904D01*
X170530761Y-137468428D01*
X170530761Y-137710333D01*
X170482380Y-137903857D01*
X170434000Y-138000619D01*
X170385619Y-138049000D01*
X170288857Y-138097380D01*
X168982571Y-137081380D02*
X169563142Y-137081380D01*
X169272857Y-137081380D02*
X169272857Y-138097380D01*
X169369619Y-137952238D01*
X169466380Y-137855476D01*
X169563142Y-137807095D01*
X168498761Y-137081380D02*
X168305238Y-137081380D01*
X168208476Y-137129761D01*
X168160095Y-137178142D01*
X168063333Y-137323285D01*
X168014952Y-137516809D01*
X168014952Y-137903857D01*
X168063333Y-138000619D01*
X168111714Y-138049000D01*
X168208476Y-138097380D01*
X168402000Y-138097380D01*
X168498761Y-138049000D01*
X168547142Y-138000619D01*
X168595523Y-137903857D01*
X168595523Y-137661952D01*
X168547142Y-137565190D01*
X168498761Y-137516809D01*
X168402000Y-137468428D01*
X168208476Y-137468428D01*
X168111714Y-137516809D01*
X168063333Y-137565190D01*
X168014952Y-137661952D01*
X177739523Y-146364476D02*
X177013809Y-146364476D01*
X177376666Y-145094476D02*
X177376666Y-146364476D01*
X176106666Y-145154952D02*
X176227619Y-145094476D01*
X176469523Y-145094476D01*
X176590476Y-145154952D01*
X176650952Y-145275904D01*
X176650952Y-145759714D01*
X176590476Y-145880666D01*
X176469523Y-145941142D01*
X176227619Y-145941142D01*
X176106666Y-145880666D01*
X176046190Y-145759714D01*
X176046190Y-145638761D01*
X176650952Y-145517809D01*
X175562380Y-145154952D02*
X175441428Y-145094476D01*
X175199523Y-145094476D01*
X175078571Y-145154952D01*
X175018095Y-145275904D01*
X175018095Y-145336380D01*
X175078571Y-145457333D01*
X175199523Y-145517809D01*
X175380952Y-145517809D01*
X175501904Y-145578285D01*
X175562380Y-145699238D01*
X175562380Y-145759714D01*
X175501904Y-145880666D01*
X175380952Y-145941142D01*
X175199523Y-145941142D01*
X175078571Y-145880666D01*
X174655238Y-145941142D02*
X174171428Y-145941142D01*
X174473809Y-146364476D02*
X174473809Y-145275904D01*
X174413333Y-145154952D01*
X174292380Y-145094476D01*
X174171428Y-145094476D01*
X173748095Y-145094476D02*
X173748095Y-146364476D01*
X173748095Y-145880666D02*
X173627142Y-145941142D01*
X173385238Y-145941142D01*
X173264285Y-145880666D01*
X173203809Y-145820190D01*
X173143333Y-145699238D01*
X173143333Y-145336380D01*
X173203809Y-145215428D01*
X173264285Y-145154952D01*
X173385238Y-145094476D01*
X173627142Y-145094476D01*
X173748095Y-145154952D01*
X172417619Y-145094476D02*
X172538571Y-145154952D01*
X172599047Y-145215428D01*
X172659523Y-145336380D01*
X172659523Y-145699238D01*
X172599047Y-145820190D01*
X172538571Y-145880666D01*
X172417619Y-145941142D01*
X172236190Y-145941142D01*
X172115238Y-145880666D01*
X172054761Y-145820190D01*
X171994285Y-145699238D01*
X171994285Y-145336380D01*
X172054761Y-145215428D01*
X172115238Y-145154952D01*
X172236190Y-145094476D01*
X172417619Y-145094476D01*
X170905714Y-145094476D02*
X170905714Y-145759714D01*
X170966190Y-145880666D01*
X171087142Y-145941142D01*
X171329047Y-145941142D01*
X171450000Y-145880666D01*
X170905714Y-145154952D02*
X171026666Y-145094476D01*
X171329047Y-145094476D01*
X171450000Y-145154952D01*
X171510476Y-145275904D01*
X171510476Y-145396857D01*
X171450000Y-145517809D01*
X171329047Y-145578285D01*
X171026666Y-145578285D01*
X170905714Y-145638761D01*
X170300952Y-145094476D02*
X170300952Y-145941142D01*
X170300952Y-145699238D02*
X170240476Y-145820190D01*
X170180000Y-145880666D01*
X170059047Y-145941142D01*
X169938095Y-145941142D01*
X168970476Y-145094476D02*
X168970476Y-146364476D01*
X168970476Y-145154952D02*
X169091428Y-145094476D01*
X169333333Y-145094476D01*
X169454285Y-145154952D01*
X169514761Y-145215428D01*
X169575238Y-145336380D01*
X169575238Y-145699238D01*
X169514761Y-145820190D01*
X169454285Y-145880666D01*
X169333333Y-145941142D01*
X169091428Y-145941142D01*
X168970476Y-145880666D01*
X167579523Y-145941142D02*
X167095714Y-145941142D01*
X167398095Y-145094476D02*
X167398095Y-146183047D01*
X167337619Y-146304000D01*
X167216666Y-146364476D01*
X167095714Y-146364476D01*
X166490952Y-145094476D02*
X166611904Y-145154952D01*
X166672380Y-145215428D01*
X166732857Y-145336380D01*
X166732857Y-145699238D01*
X166672380Y-145820190D01*
X166611904Y-145880666D01*
X166490952Y-145941142D01*
X166309523Y-145941142D01*
X166188571Y-145880666D01*
X166128095Y-145820190D01*
X166067619Y-145699238D01*
X166067619Y-145336380D01*
X166128095Y-145215428D01*
X166188571Y-145154952D01*
X166309523Y-145094476D01*
X166490952Y-145094476D01*
X165523333Y-145094476D02*
X165523333Y-145941142D01*
X165523333Y-145699238D02*
X165462857Y-145820190D01*
X165402380Y-145880666D01*
X165281428Y-145941142D01*
X165160476Y-145941142D01*
X173445714Y-142935476D02*
X173869047Y-143540238D01*
X174171428Y-142935476D02*
X174171428Y-144205476D01*
X173687619Y-144205476D01*
X173566666Y-144145000D01*
X173506190Y-144084523D01*
X173445714Y-143963571D01*
X173445714Y-143782142D01*
X173506190Y-143661190D01*
X173566666Y-143600714D01*
X173687619Y-143540238D01*
X174171428Y-143540238D01*
X172901428Y-142935476D02*
X172901428Y-144205476D01*
X172599047Y-144205476D01*
X172417619Y-144145000D01*
X172296666Y-144024047D01*
X172236190Y-143903095D01*
X172175714Y-143661190D01*
X172175714Y-143479761D01*
X172236190Y-143237857D01*
X172296666Y-143116904D01*
X172417619Y-142995952D01*
X172599047Y-142935476D01*
X172901428Y-142935476D01*
X171026666Y-144205476D02*
X171631428Y-144205476D01*
X171691904Y-143600714D01*
X171631428Y-143661190D01*
X171510476Y-143721666D01*
X171208095Y-143721666D01*
X171087142Y-143661190D01*
X171026666Y-143600714D01*
X170966190Y-143479761D01*
X170966190Y-143177380D01*
X171026666Y-143056428D01*
X171087142Y-142995952D01*
X171208095Y-142935476D01*
X171510476Y-142935476D01*
X171631428Y-142995952D01*
X171691904Y-143056428D01*
X170542857Y-144205476D02*
X169756666Y-144205476D01*
X170180000Y-143721666D01*
X169998571Y-143721666D01*
X169877619Y-143661190D01*
X169817142Y-143600714D01*
X169756666Y-143479761D01*
X169756666Y-143177380D01*
X169817142Y-143056428D01*
X169877619Y-142995952D01*
X169998571Y-142935476D01*
X170361428Y-142935476D01*
X170482380Y-142995952D01*
X170542857Y-143056428D01*
X169272857Y-143298333D02*
X168668095Y-143298333D01*
X169393809Y-142935476D02*
X168970476Y-144205476D01*
X168547142Y-142935476D01*
X176167142Y-140655523D02*
X176288095Y-140716000D01*
X176409047Y-140836952D01*
X176590476Y-141018380D01*
X176711428Y-141078857D01*
X176832380Y-141078857D01*
X176771904Y-140776476D02*
X176892857Y-140836952D01*
X177013809Y-140957904D01*
X177074285Y-141199809D01*
X177074285Y-141623142D01*
X177013809Y-141865047D01*
X176892857Y-141986000D01*
X176771904Y-142046476D01*
X176530000Y-142046476D01*
X176409047Y-141986000D01*
X176288095Y-141865047D01*
X176227619Y-141623142D01*
X176227619Y-141199809D01*
X176288095Y-140957904D01*
X176409047Y-140836952D01*
X176530000Y-140776476D01*
X176771904Y-140776476D01*
X175139047Y-141623142D02*
X175139047Y-140776476D01*
X175683333Y-141623142D02*
X175683333Y-140957904D01*
X175622857Y-140836952D01*
X175501904Y-140776476D01*
X175320476Y-140776476D01*
X175199523Y-140836952D01*
X175139047Y-140897428D01*
X173990000Y-140776476D02*
X173990000Y-141441714D01*
X174050476Y-141562666D01*
X174171428Y-141623142D01*
X174413333Y-141623142D01*
X174534285Y-141562666D01*
X173990000Y-140836952D02*
X174110952Y-140776476D01*
X174413333Y-140776476D01*
X174534285Y-140836952D01*
X174594761Y-140957904D01*
X174594761Y-141078857D01*
X174534285Y-141199809D01*
X174413333Y-141260285D01*
X174110952Y-141260285D01*
X173990000Y-141320761D01*
X172840952Y-140776476D02*
X172840952Y-142046476D01*
X172840952Y-140836952D02*
X172961904Y-140776476D01*
X173203809Y-140776476D01*
X173324761Y-140836952D01*
X173385238Y-140897428D01*
X173445714Y-141018380D01*
X173445714Y-141381238D01*
X173385238Y-141502190D01*
X173324761Y-141562666D01*
X173203809Y-141623142D01*
X172961904Y-141623142D01*
X172840952Y-141562666D01*
X171268571Y-140776476D02*
X171268571Y-142046476D01*
X171268571Y-141441714D02*
X170542857Y-141441714D01*
X170542857Y-140776476D02*
X170542857Y-142046476D01*
X170059047Y-141623142D02*
X169756666Y-140776476D01*
X169454285Y-141623142D02*
X169756666Y-140776476D01*
X169877619Y-140474095D01*
X169938095Y-140413619D01*
X170059047Y-140353142D01*
X168970476Y-140776476D02*
X168970476Y-142046476D01*
X168970476Y-141562666D02*
X168849523Y-141623142D01*
X168607619Y-141623142D01*
X168486666Y-141562666D01*
X168426190Y-141502190D01*
X168365714Y-141381238D01*
X168365714Y-141018380D01*
X168426190Y-140897428D01*
X168486666Y-140836952D01*
X168607619Y-140776476D01*
X168849523Y-140776476D01*
X168970476Y-140836952D01*
X167821428Y-140776476D02*
X167821428Y-141623142D01*
X167821428Y-141381238D02*
X167760952Y-141502190D01*
X167700476Y-141562666D01*
X167579523Y-141623142D01*
X167458571Y-141623142D01*
X167035238Y-140776476D02*
X167035238Y-141623142D01*
X167035238Y-142046476D02*
X167095714Y-141986000D01*
X167035238Y-141925523D01*
X166974761Y-141986000D01*
X167035238Y-142046476D01*
X167035238Y-141925523D01*
X165886190Y-140776476D02*
X165886190Y-142046476D01*
X165886190Y-140836952D02*
X166007142Y-140776476D01*
X166249047Y-140776476D01*
X166370000Y-140836952D01*
X166430476Y-140897428D01*
X166490952Y-141018380D01*
X166490952Y-141381238D01*
X166430476Y-141502190D01*
X166370000Y-141562666D01*
X166249047Y-141623142D01*
X166007142Y-141623142D01*
X165886190Y-141562666D01*
D12*
G04 #@! TO.C,M1*
X115258151Y-54627520D02*
G75*
G03X115258151Y-54627520I-1662891J0D01*
G01*
X128473955Y-54627520D02*
G75*
G03X128473955Y-54627520I-1670695J0D01*
G01*
D13*
G04 #@! TO.C,G\002A\002A\002A*
G36*
X105892600Y-136880600D02*
X118618000Y-136880600D01*
X118618000Y-141855628D01*
X118392162Y-141855628D01*
X118392118Y-141437066D01*
X118391825Y-141020602D01*
X118391282Y-140609348D01*
X118390490Y-140206416D01*
X118389449Y-139814917D01*
X118388157Y-139437963D01*
X118386617Y-139078666D01*
X118384826Y-138740138D01*
X118382787Y-138425489D01*
X118380497Y-138137831D01*
X118377958Y-137880277D01*
X118375170Y-137655938D01*
X118372132Y-137467925D01*
X118368844Y-137319350D01*
X118365307Y-137213326D01*
X118361521Y-137152962D01*
X118358921Y-137139680D01*
X118344571Y-137136231D01*
X118307669Y-137133029D01*
X118246708Y-137130068D01*
X118160181Y-137127340D01*
X118046581Y-137124836D01*
X117904402Y-137122551D01*
X117732137Y-137120475D01*
X117528278Y-137118603D01*
X117291319Y-137116925D01*
X117019753Y-137115435D01*
X116712074Y-137114126D01*
X116366774Y-137112989D01*
X115982347Y-137112017D01*
X115557285Y-137111202D01*
X115090083Y-137110538D01*
X114579232Y-137110016D01*
X114023227Y-137109629D01*
X113420560Y-137109370D01*
X112769725Y-137109231D01*
X112251661Y-137109200D01*
X106174881Y-137109200D01*
X106135341Y-137165652D01*
X106130380Y-137176436D01*
X106125847Y-137195449D01*
X106121723Y-137224872D01*
X106117988Y-137266888D01*
X106114624Y-137323677D01*
X106111613Y-137397421D01*
X106108933Y-137490301D01*
X106106569Y-137604499D01*
X106104499Y-137742195D01*
X106102705Y-137905573D01*
X106101169Y-138096812D01*
X106099872Y-138318094D01*
X106098794Y-138571601D01*
X106097916Y-138859514D01*
X106097221Y-139184014D01*
X106096688Y-139547283D01*
X106096300Y-139951502D01*
X106096036Y-140398853D01*
X106095879Y-140891517D01*
X106095809Y-141431676D01*
X106095800Y-141729302D01*
X106095826Y-142292665D01*
X106095914Y-142807428D01*
X106096087Y-143275794D01*
X106096365Y-143699963D01*
X106096767Y-144082137D01*
X106097314Y-144424516D01*
X106098026Y-144729302D01*
X106098924Y-144998696D01*
X106100028Y-145234899D01*
X106101358Y-145440112D01*
X106102935Y-145616536D01*
X106104779Y-145766372D01*
X106106910Y-145891822D01*
X106109349Y-145995087D01*
X106112116Y-146078367D01*
X106115231Y-146143864D01*
X106118714Y-146193779D01*
X106122586Y-146230312D01*
X106126868Y-146255666D01*
X106131579Y-146272042D01*
X106136739Y-146281640D01*
X106137837Y-146282950D01*
X106143692Y-146287966D01*
X106153105Y-146292607D01*
X106167980Y-146296888D01*
X106190224Y-146300824D01*
X106221744Y-146304430D01*
X106264445Y-146307719D01*
X106320234Y-146310707D01*
X106391016Y-146313407D01*
X106478698Y-146315835D01*
X106585187Y-146318004D01*
X106712388Y-146319930D01*
X106862207Y-146321626D01*
X107036550Y-146323108D01*
X107237325Y-146324389D01*
X107466436Y-146325484D01*
X107725790Y-146326407D01*
X108017293Y-146327174D01*
X108342852Y-146327798D01*
X108704372Y-146328295D01*
X109103760Y-146328677D01*
X109542921Y-146328961D01*
X110023763Y-146329160D01*
X110548190Y-146329289D01*
X111118110Y-146329362D01*
X111735428Y-146329395D01*
X112254157Y-146329400D01*
X112941781Y-146329346D01*
X113580113Y-146329177D01*
X114170658Y-146328886D01*
X114714925Y-146328465D01*
X115214421Y-146327908D01*
X115670653Y-146327206D01*
X116085127Y-146326352D01*
X116459352Y-146325338D01*
X116794834Y-146324157D01*
X117093080Y-146322802D01*
X117355597Y-146321265D01*
X117583894Y-146319538D01*
X117779475Y-146317613D01*
X117943850Y-146315484D01*
X118078525Y-146313143D01*
X118185007Y-146310582D01*
X118264803Y-146307794D01*
X118319420Y-146304771D01*
X118350366Y-146301505D01*
X118358921Y-146298920D01*
X118362870Y-146269966D01*
X118366569Y-146193323D01*
X118370019Y-146072104D01*
X118373220Y-145909421D01*
X118376171Y-145708385D01*
X118378872Y-145472107D01*
X118381324Y-145203700D01*
X118383526Y-144906275D01*
X118385479Y-144582944D01*
X118387182Y-144236819D01*
X118388636Y-143871010D01*
X118389840Y-143488630D01*
X118390795Y-143092790D01*
X118391500Y-142686602D01*
X118391956Y-142273178D01*
X118392162Y-141855628D01*
X118618000Y-141855628D01*
X118618000Y-146558000D01*
X105892600Y-146558000D01*
X105892600Y-136880600D01*
X105892600Y-136880600D01*
G37*
X105892600Y-136880600D02*
X118618000Y-136880600D01*
X118618000Y-141855628D01*
X118392162Y-141855628D01*
X118392118Y-141437066D01*
X118391825Y-141020602D01*
X118391282Y-140609348D01*
X118390490Y-140206416D01*
X118389449Y-139814917D01*
X118388157Y-139437963D01*
X118386617Y-139078666D01*
X118384826Y-138740138D01*
X118382787Y-138425489D01*
X118380497Y-138137831D01*
X118377958Y-137880277D01*
X118375170Y-137655938D01*
X118372132Y-137467925D01*
X118368844Y-137319350D01*
X118365307Y-137213326D01*
X118361521Y-137152962D01*
X118358921Y-137139680D01*
X118344571Y-137136231D01*
X118307669Y-137133029D01*
X118246708Y-137130068D01*
X118160181Y-137127340D01*
X118046581Y-137124836D01*
X117904402Y-137122551D01*
X117732137Y-137120475D01*
X117528278Y-137118603D01*
X117291319Y-137116925D01*
X117019753Y-137115435D01*
X116712074Y-137114126D01*
X116366774Y-137112989D01*
X115982347Y-137112017D01*
X115557285Y-137111202D01*
X115090083Y-137110538D01*
X114579232Y-137110016D01*
X114023227Y-137109629D01*
X113420560Y-137109370D01*
X112769725Y-137109231D01*
X112251661Y-137109200D01*
X106174881Y-137109200D01*
X106135341Y-137165652D01*
X106130380Y-137176436D01*
X106125847Y-137195449D01*
X106121723Y-137224872D01*
X106117988Y-137266888D01*
X106114624Y-137323677D01*
X106111613Y-137397421D01*
X106108933Y-137490301D01*
X106106569Y-137604499D01*
X106104499Y-137742195D01*
X106102705Y-137905573D01*
X106101169Y-138096812D01*
X106099872Y-138318094D01*
X106098794Y-138571601D01*
X106097916Y-138859514D01*
X106097221Y-139184014D01*
X106096688Y-139547283D01*
X106096300Y-139951502D01*
X106096036Y-140398853D01*
X106095879Y-140891517D01*
X106095809Y-141431676D01*
X106095800Y-141729302D01*
X106095826Y-142292665D01*
X106095914Y-142807428D01*
X106096087Y-143275794D01*
X106096365Y-143699963D01*
X106096767Y-144082137D01*
X106097314Y-144424516D01*
X106098026Y-144729302D01*
X106098924Y-144998696D01*
X106100028Y-145234899D01*
X106101358Y-145440112D01*
X106102935Y-145616536D01*
X106104779Y-145766372D01*
X106106910Y-145891822D01*
X106109349Y-145995087D01*
X106112116Y-146078367D01*
X106115231Y-146143864D01*
X106118714Y-146193779D01*
X106122586Y-146230312D01*
X106126868Y-146255666D01*
X106131579Y-146272042D01*
X106136739Y-146281640D01*
X106137837Y-146282950D01*
X106143692Y-146287966D01*
X106153105Y-146292607D01*
X106167980Y-146296888D01*
X106190224Y-146300824D01*
X106221744Y-146304430D01*
X106264445Y-146307719D01*
X106320234Y-146310707D01*
X106391016Y-146313407D01*
X106478698Y-146315835D01*
X106585187Y-146318004D01*
X106712388Y-146319930D01*
X106862207Y-146321626D01*
X107036550Y-146323108D01*
X107237325Y-146324389D01*
X107466436Y-146325484D01*
X107725790Y-146326407D01*
X108017293Y-146327174D01*
X108342852Y-146327798D01*
X108704372Y-146328295D01*
X109103760Y-146328677D01*
X109542921Y-146328961D01*
X110023763Y-146329160D01*
X110548190Y-146329289D01*
X111118110Y-146329362D01*
X111735428Y-146329395D01*
X112254157Y-146329400D01*
X112941781Y-146329346D01*
X113580113Y-146329177D01*
X114170658Y-146328886D01*
X114714925Y-146328465D01*
X115214421Y-146327908D01*
X115670653Y-146327206D01*
X116085127Y-146326352D01*
X116459352Y-146325338D01*
X116794834Y-146324157D01*
X117093080Y-146322802D01*
X117355597Y-146321265D01*
X117583894Y-146319538D01*
X117779475Y-146317613D01*
X117943850Y-146315484D01*
X118078525Y-146313143D01*
X118185007Y-146310582D01*
X118264803Y-146307794D01*
X118319420Y-146304771D01*
X118350366Y-146301505D01*
X118358921Y-146298920D01*
X118362870Y-146269966D01*
X118366569Y-146193323D01*
X118370019Y-146072104D01*
X118373220Y-145909421D01*
X118376171Y-145708385D01*
X118378872Y-145472107D01*
X118381324Y-145203700D01*
X118383526Y-144906275D01*
X118385479Y-144582944D01*
X118387182Y-144236819D01*
X118388636Y-143871010D01*
X118389840Y-143488630D01*
X118390795Y-143092790D01*
X118391500Y-142686602D01*
X118391956Y-142273178D01*
X118392162Y-141855628D01*
X118618000Y-141855628D01*
X118618000Y-146558000D01*
X105892600Y-146558000D01*
X105892600Y-136880600D01*
G36*
X117214650Y-139186551D02*
X117042089Y-139175348D01*
X116912687Y-139156236D01*
X116819071Y-139126520D01*
X116753871Y-139083505D01*
X116709712Y-139024496D01*
X116696897Y-138997273D01*
X116670109Y-138880843D01*
X116683157Y-138768578D01*
X116734091Y-138675990D01*
X116737789Y-138671952D01*
X116789989Y-138616387D01*
X116738688Y-138569960D01*
X116679935Y-138485262D01*
X116654125Y-138378193D01*
X116661046Y-138264877D01*
X116700491Y-138161433D01*
X116744712Y-138105956D01*
X116803267Y-138060497D01*
X116871872Y-138029338D01*
X116960923Y-138010137D01*
X117080817Y-138000548D01*
X117222654Y-137998200D01*
X117500400Y-137998200D01*
X117500400Y-138506200D01*
X117246400Y-138506200D01*
X117246400Y-138201400D01*
X117137752Y-138201400D01*
X117055067Y-138210616D01*
X116985222Y-138233498D01*
X116972652Y-138240941D01*
X116926867Y-138300459D01*
X116919001Y-138376447D01*
X116950283Y-138450236D01*
X116958237Y-138459750D01*
X117012302Y-138493164D01*
X117100846Y-138505867D01*
X117123337Y-138506200D01*
X117246400Y-138506200D01*
X117500400Y-138506200D01*
X117500400Y-138963400D01*
X117246400Y-138963400D01*
X117246400Y-138709400D01*
X117150452Y-138709400D01*
X117070494Y-138719905D01*
X117003265Y-138745538D01*
X116998052Y-138748941D01*
X116953145Y-138805222D01*
X116943679Y-138873723D01*
X116972080Y-138932920D01*
X117014234Y-138951038D01*
X117086017Y-138961956D01*
X117124480Y-138963400D01*
X117246400Y-138963400D01*
X117500400Y-138963400D01*
X117500400Y-139198393D01*
X117214650Y-139186551D01*
X117214650Y-139186551D01*
G37*
X117214650Y-139186551D02*
X117042089Y-139175348D01*
X116912687Y-139156236D01*
X116819071Y-139126520D01*
X116753871Y-139083505D01*
X116709712Y-139024496D01*
X116696897Y-138997273D01*
X116670109Y-138880843D01*
X116683157Y-138768578D01*
X116734091Y-138675990D01*
X116737789Y-138671952D01*
X116789989Y-138616387D01*
X116738688Y-138569960D01*
X116679935Y-138485262D01*
X116654125Y-138378193D01*
X116661046Y-138264877D01*
X116700491Y-138161433D01*
X116744712Y-138105956D01*
X116803267Y-138060497D01*
X116871872Y-138029338D01*
X116960923Y-138010137D01*
X117080817Y-138000548D01*
X117222654Y-137998200D01*
X117500400Y-137998200D01*
X117500400Y-138506200D01*
X117246400Y-138506200D01*
X117246400Y-138201400D01*
X117137752Y-138201400D01*
X117055067Y-138210616D01*
X116985222Y-138233498D01*
X116972652Y-138240941D01*
X116926867Y-138300459D01*
X116919001Y-138376447D01*
X116950283Y-138450236D01*
X116958237Y-138459750D01*
X117012302Y-138493164D01*
X117100846Y-138505867D01*
X117123337Y-138506200D01*
X117246400Y-138506200D01*
X117500400Y-138506200D01*
X117500400Y-138963400D01*
X117246400Y-138963400D01*
X117246400Y-138709400D01*
X117150452Y-138709400D01*
X117070494Y-138719905D01*
X117003265Y-138745538D01*
X116998052Y-138748941D01*
X116953145Y-138805222D01*
X116943679Y-138873723D01*
X116972080Y-138932920D01*
X117014234Y-138951038D01*
X117086017Y-138961956D01*
X117124480Y-138963400D01*
X117246400Y-138963400D01*
X117500400Y-138963400D01*
X117500400Y-139198393D01*
X117214650Y-139186551D01*
G36*
X115849400Y-138963400D02*
X116332000Y-138963400D01*
X116332000Y-138709400D01*
X115925600Y-138709400D01*
X115925600Y-138480800D01*
X116332000Y-138480800D01*
X116332000Y-138226800D01*
X115824000Y-138226800D01*
X115824000Y-137998200D01*
X116586000Y-137998200D01*
X116586000Y-139192000D01*
X115849400Y-139192000D01*
X115849400Y-138963400D01*
X115849400Y-138963400D01*
G37*
X115849400Y-138963400D02*
X116332000Y-138963400D01*
X116332000Y-138709400D01*
X115925600Y-138709400D01*
X115925600Y-138480800D01*
X116332000Y-138480800D01*
X116332000Y-138226800D01*
X115824000Y-138226800D01*
X115824000Y-137998200D01*
X116586000Y-137998200D01*
X116586000Y-139192000D01*
X115849400Y-139192000D01*
X115849400Y-138963400D01*
G36*
X115512850Y-139191859D02*
X115348258Y-139188301D01*
X115224276Y-139176203D01*
X115131080Y-139153119D01*
X115058846Y-139116606D01*
X114997752Y-139064218D01*
X114997057Y-139063493D01*
X114953469Y-139011172D01*
X114930984Y-138958386D01*
X114922963Y-138884943D01*
X114922300Y-138836143D01*
X114925451Y-138746673D01*
X114939777Y-138687124D01*
X114972588Y-138636764D01*
X115005078Y-138601417D01*
X115087856Y-138516012D01*
X114986028Y-138281236D01*
X114943028Y-138179697D01*
X114909008Y-138094805D01*
X114888364Y-138037794D01*
X114884200Y-138021003D01*
X114907350Y-138007397D01*
X114968647Y-138001980D01*
X115016603Y-138003223D01*
X115149005Y-138010900D01*
X115249298Y-138245850D01*
X115296112Y-138353026D01*
X115330309Y-138421574D01*
X115358152Y-138460029D01*
X115385904Y-138476925D01*
X115419826Y-138480796D01*
X115421696Y-138480800D01*
X115493800Y-138480800D01*
X115493800Y-137998200D01*
X115773200Y-137998200D01*
X115773200Y-138963400D01*
X115493800Y-138963400D01*
X115493800Y-138709400D01*
X115368241Y-138709400D01*
X115284705Y-138714433D01*
X115233959Y-138733490D01*
X115203141Y-138765852D01*
X115170145Y-138821767D01*
X115172211Y-138862013D01*
X115211079Y-138909266D01*
X115214400Y-138912600D01*
X115278972Y-138951026D01*
X115375839Y-138963390D01*
X115379500Y-138963400D01*
X115493800Y-138963400D01*
X115773200Y-138963400D01*
X115773200Y-139192000D01*
X115512850Y-139191859D01*
X115512850Y-139191859D01*
G37*
X115512850Y-139191859D02*
X115348258Y-139188301D01*
X115224276Y-139176203D01*
X115131080Y-139153119D01*
X115058846Y-139116606D01*
X114997752Y-139064218D01*
X114997057Y-139063493D01*
X114953469Y-139011172D01*
X114930984Y-138958386D01*
X114922963Y-138884943D01*
X114922300Y-138836143D01*
X114925451Y-138746673D01*
X114939777Y-138687124D01*
X114972588Y-138636764D01*
X115005078Y-138601417D01*
X115087856Y-138516012D01*
X114986028Y-138281236D01*
X114943028Y-138179697D01*
X114909008Y-138094805D01*
X114888364Y-138037794D01*
X114884200Y-138021003D01*
X114907350Y-138007397D01*
X114968647Y-138001980D01*
X115016603Y-138003223D01*
X115149005Y-138010900D01*
X115249298Y-138245850D01*
X115296112Y-138353026D01*
X115330309Y-138421574D01*
X115358152Y-138460029D01*
X115385904Y-138476925D01*
X115419826Y-138480796D01*
X115421696Y-138480800D01*
X115493800Y-138480800D01*
X115493800Y-137998200D01*
X115773200Y-137998200D01*
X115773200Y-138963400D01*
X115493800Y-138963400D01*
X115493800Y-138709400D01*
X115368241Y-138709400D01*
X115284705Y-138714433D01*
X115233959Y-138733490D01*
X115203141Y-138765852D01*
X115170145Y-138821767D01*
X115172211Y-138862013D01*
X115211079Y-138909266D01*
X115214400Y-138912600D01*
X115278972Y-138951026D01*
X115375839Y-138963390D01*
X115379500Y-138963400D01*
X115493800Y-138963400D01*
X115773200Y-138963400D01*
X115773200Y-139192000D01*
X115512850Y-139191859D01*
G36*
X113957294Y-139188456D02*
X113940268Y-139173988D01*
X113949628Y-139142135D01*
X113986265Y-139086206D01*
X114051071Y-138999508D01*
X114101416Y-138933150D01*
X114165047Y-138846433D01*
X114214934Y-138773486D01*
X114244275Y-138724523D01*
X114249200Y-138711217D01*
X114237475Y-138680532D01*
X114205244Y-138614233D01*
X114156923Y-138520972D01*
X114096930Y-138409399D01*
X114071400Y-138362933D01*
X114008121Y-138246939D01*
X113954772Y-138146289D01*
X113915757Y-138069517D01*
X113895479Y-138025152D01*
X113893600Y-138018448D01*
X113916553Y-138007417D01*
X113976005Y-138002252D01*
X114039464Y-138003283D01*
X114185328Y-138010900D01*
X114315586Y-138247674D01*
X114445845Y-138484448D01*
X114499923Y-138415699D01*
X114531012Y-138364500D01*
X114547735Y-138300369D01*
X114553742Y-138206890D01*
X114554000Y-138172575D01*
X114554000Y-137998200D01*
X114808000Y-137998200D01*
X114808000Y-139192000D01*
X114555978Y-139192000D01*
X114541300Y-138747500D01*
X114379589Y-138969750D01*
X114217877Y-139192000D01*
X114066940Y-139192000D01*
X113999815Y-139192230D01*
X113957294Y-139188456D01*
X113957294Y-139188456D01*
G37*
X113957294Y-139188456D02*
X113940268Y-139173988D01*
X113949628Y-139142135D01*
X113986265Y-139086206D01*
X114051071Y-138999508D01*
X114101416Y-138933150D01*
X114165047Y-138846433D01*
X114214934Y-138773486D01*
X114244275Y-138724523D01*
X114249200Y-138711217D01*
X114237475Y-138680532D01*
X114205244Y-138614233D01*
X114156923Y-138520972D01*
X114096930Y-138409399D01*
X114071400Y-138362933D01*
X114008121Y-138246939D01*
X113954772Y-138146289D01*
X113915757Y-138069517D01*
X113895479Y-138025152D01*
X113893600Y-138018448D01*
X113916553Y-138007417D01*
X113976005Y-138002252D01*
X114039464Y-138003283D01*
X114185328Y-138010900D01*
X114315586Y-138247674D01*
X114445845Y-138484448D01*
X114499923Y-138415699D01*
X114531012Y-138364500D01*
X114547735Y-138300369D01*
X114553742Y-138206890D01*
X114554000Y-138172575D01*
X114554000Y-137998200D01*
X114808000Y-137998200D01*
X114808000Y-139192000D01*
X114555978Y-139192000D01*
X114541300Y-138747500D01*
X114379589Y-138969750D01*
X114217877Y-139192000D01*
X114066940Y-139192000D01*
X113999815Y-139192230D01*
X113957294Y-139188456D01*
G36*
X113106200Y-138963400D02*
X113588800Y-138963400D01*
X113588800Y-138709400D01*
X113182400Y-138709400D01*
X113182400Y-138480800D01*
X113588800Y-138480800D01*
X113588800Y-138226800D01*
X113080800Y-138226800D01*
X113080800Y-137998200D01*
X113842800Y-137998200D01*
X113842800Y-139192000D01*
X113106200Y-139192000D01*
X113106200Y-138963400D01*
X113106200Y-138963400D01*
G37*
X113106200Y-138963400D02*
X113588800Y-138963400D01*
X113588800Y-138709400D01*
X113182400Y-138709400D01*
X113182400Y-138480800D01*
X113588800Y-138480800D01*
X113588800Y-138226800D01*
X113080800Y-138226800D01*
X113080800Y-137998200D01*
X113842800Y-137998200D01*
X113842800Y-139192000D01*
X113106200Y-139192000D01*
X113106200Y-138963400D01*
G36*
X112725200Y-138226800D02*
X112242600Y-138226800D01*
X112242600Y-137998200D01*
X112979200Y-137998200D01*
X112979200Y-139192000D01*
X112725200Y-139192000D01*
X112725200Y-138226800D01*
X112725200Y-138226800D01*
G37*
X112725200Y-138226800D02*
X112242600Y-138226800D01*
X112242600Y-137998200D01*
X112979200Y-137998200D01*
X112979200Y-139192000D01*
X112725200Y-139192000D01*
X112725200Y-138226800D01*
G36*
X111404400Y-138963400D02*
X111887000Y-138963400D01*
X111887000Y-138709400D01*
X111480600Y-138709400D01*
X111480600Y-138480800D01*
X111887000Y-138480800D01*
X111887000Y-138226800D01*
X111379000Y-138226800D01*
X111379000Y-137998200D01*
X112141000Y-137998200D01*
X112141000Y-139192000D01*
X111404400Y-139192000D01*
X111404400Y-138963400D01*
X111404400Y-138963400D01*
G37*
X111404400Y-138963400D02*
X111887000Y-138963400D01*
X111887000Y-138709400D01*
X111480600Y-138709400D01*
X111480600Y-138480800D01*
X111887000Y-138480800D01*
X111887000Y-138226800D01*
X111379000Y-138226800D01*
X111379000Y-137998200D01*
X112141000Y-137998200D01*
X112141000Y-139192000D01*
X111404400Y-139192000D01*
X111404400Y-138963400D01*
G36*
X110839689Y-138696828D02*
X110715398Y-138944414D01*
X110591106Y-139192000D01*
X110464353Y-139192000D01*
X110391988Y-139187440D01*
X110346100Y-139175781D01*
X110337600Y-139166692D01*
X110349437Y-139136767D01*
X110382071Y-139070972D01*
X110431185Y-138977599D01*
X110492464Y-138864936D01*
X110528100Y-138800771D01*
X110718600Y-138460159D01*
X110718600Y-137998200D01*
X110972600Y-137998200D01*
X110972600Y-138466300D01*
X111163100Y-138814264D01*
X111228379Y-138934407D01*
X111284019Y-139038537D01*
X111325842Y-139118698D01*
X111349671Y-139166931D01*
X111353600Y-139177114D01*
X111330675Y-139185417D01*
X111271765Y-139190820D01*
X111219633Y-139192000D01*
X111085665Y-139192000D01*
X110839689Y-138696828D01*
X110839689Y-138696828D01*
G37*
X110839689Y-138696828D02*
X110715398Y-138944414D01*
X110591106Y-139192000D01*
X110464353Y-139192000D01*
X110391988Y-139187440D01*
X110346100Y-139175781D01*
X110337600Y-139166692D01*
X110349437Y-139136767D01*
X110382071Y-139070972D01*
X110431185Y-138977599D01*
X110492464Y-138864936D01*
X110528100Y-138800771D01*
X110718600Y-138460159D01*
X110718600Y-137998200D01*
X110972600Y-137998200D01*
X110972600Y-138466300D01*
X111163100Y-138814264D01*
X111228379Y-138934407D01*
X111284019Y-139038537D01*
X111325842Y-139118698D01*
X111349671Y-139166931D01*
X111353600Y-139177114D01*
X111330675Y-139185417D01*
X111271765Y-139190820D01*
X111219633Y-139192000D01*
X111085665Y-139192000D01*
X110839689Y-138696828D01*
G36*
X109575600Y-138226800D02*
X109093000Y-138226800D01*
X109093000Y-137998200D01*
X109829600Y-137998200D01*
X109829600Y-139192000D01*
X109575600Y-139192000D01*
X109575600Y-138226800D01*
X109575600Y-138226800D01*
G37*
X109575600Y-138226800D02*
X109093000Y-138226800D01*
X109093000Y-137998200D01*
X109829600Y-137998200D01*
X109829600Y-139192000D01*
X109575600Y-139192000D01*
X109575600Y-138226800D01*
G36*
X108206558Y-138639550D02*
X108160487Y-138477877D01*
X108118556Y-138330891D01*
X108082947Y-138206228D01*
X108055842Y-138111523D01*
X108039422Y-138054411D01*
X108035994Y-138042650D01*
X108034857Y-138016891D01*
X108058231Y-138003472D01*
X108116689Y-137998608D01*
X108160147Y-137998200D01*
X108297517Y-137998200D01*
X108328780Y-138137900D01*
X108360044Y-138277600D01*
X108685181Y-138277600D01*
X108766405Y-137998200D01*
X108891603Y-137998200D01*
X108963738Y-138001682D01*
X109009540Y-138010568D01*
X109017934Y-138017250D01*
X109011749Y-138046129D01*
X108993779Y-138116899D01*
X108965895Y-138222520D01*
X108929968Y-138355954D01*
X108888953Y-138506200D01*
X108631706Y-138506200D01*
X108532153Y-138506200D01*
X108469438Y-138510504D01*
X108435302Y-138521232D01*
X108433181Y-138525250D01*
X108439489Y-138557627D01*
X108455559Y-138625071D01*
X108478041Y-138713573D01*
X108480266Y-138722100D01*
X108526772Y-138899900D01*
X108557512Y-138785600D01*
X108581874Y-138694616D01*
X108604775Y-138608468D01*
X108609979Y-138588750D01*
X108631706Y-138506200D01*
X108888953Y-138506200D01*
X108887871Y-138510163D01*
X108859207Y-138614150D01*
X108699346Y-139192000D01*
X108363905Y-139192000D01*
X108206558Y-138639550D01*
X108206558Y-138639550D01*
G37*
X108206558Y-138639550D02*
X108160487Y-138477877D01*
X108118556Y-138330891D01*
X108082947Y-138206228D01*
X108055842Y-138111523D01*
X108039422Y-138054411D01*
X108035994Y-138042650D01*
X108034857Y-138016891D01*
X108058231Y-138003472D01*
X108116689Y-137998608D01*
X108160147Y-137998200D01*
X108297517Y-137998200D01*
X108328780Y-138137900D01*
X108360044Y-138277600D01*
X108685181Y-138277600D01*
X108766405Y-137998200D01*
X108891603Y-137998200D01*
X108963738Y-138001682D01*
X109009540Y-138010568D01*
X109017934Y-138017250D01*
X109011749Y-138046129D01*
X108993779Y-138116899D01*
X108965895Y-138222520D01*
X108929968Y-138355954D01*
X108888953Y-138506200D01*
X108631706Y-138506200D01*
X108532153Y-138506200D01*
X108469438Y-138510504D01*
X108435302Y-138521232D01*
X108433181Y-138525250D01*
X108439489Y-138557627D01*
X108455559Y-138625071D01*
X108478041Y-138713573D01*
X108480266Y-138722100D01*
X108526772Y-138899900D01*
X108557512Y-138785600D01*
X108581874Y-138694616D01*
X108604775Y-138608468D01*
X108609979Y-138588750D01*
X108631706Y-138506200D01*
X108888953Y-138506200D01*
X108887871Y-138510163D01*
X108859207Y-138614150D01*
X108699346Y-139192000D01*
X108363905Y-139192000D01*
X108206558Y-138639550D01*
G36*
X107547454Y-139184446D02*
X107389720Y-139160492D01*
X107273446Y-139118204D01*
X107195015Y-139055648D01*
X107150807Y-138970889D01*
X107137200Y-138864214D01*
X107151870Y-138746369D01*
X107184216Y-138682366D01*
X107212242Y-138643287D01*
X107215390Y-138611374D01*
X107191939Y-138566829D01*
X107171516Y-138536308D01*
X107122768Y-138425302D01*
X107114651Y-138307258D01*
X107143940Y-138194573D01*
X107207408Y-138099642D01*
X107301829Y-138034861D01*
X107302041Y-138034772D01*
X107389512Y-138013287D01*
X107526494Y-138001151D01*
X107669785Y-137998200D01*
X107950000Y-137998200D01*
X107950000Y-138506200D01*
X107696000Y-138506200D01*
X107696000Y-138201400D01*
X107581700Y-138201400D01*
X107483623Y-138213021D01*
X107418247Y-138250578D01*
X107416600Y-138252200D01*
X107371747Y-138323198D01*
X107371900Y-138392372D01*
X107411676Y-138451440D01*
X107485694Y-138492122D01*
X107581700Y-138506200D01*
X107696000Y-138506200D01*
X107950000Y-138506200D01*
X107950000Y-138963400D01*
X107696000Y-138963400D01*
X107696000Y-138709400D01*
X107600052Y-138709400D01*
X107520094Y-138719905D01*
X107452865Y-138745538D01*
X107447652Y-138748941D01*
X107397389Y-138804712D01*
X107391553Y-138862425D01*
X107424834Y-138913697D01*
X107491920Y-138950143D01*
X107583515Y-138963400D01*
X107696000Y-138963400D01*
X107950000Y-138963400D01*
X107950000Y-139192000D01*
X107750267Y-139192000D01*
X107547454Y-139184446D01*
X107547454Y-139184446D01*
G37*
X107547454Y-139184446D02*
X107389720Y-139160492D01*
X107273446Y-139118204D01*
X107195015Y-139055648D01*
X107150807Y-138970889D01*
X107137200Y-138864214D01*
X107151870Y-138746369D01*
X107184216Y-138682366D01*
X107212242Y-138643287D01*
X107215390Y-138611374D01*
X107191939Y-138566829D01*
X107171516Y-138536308D01*
X107122768Y-138425302D01*
X107114651Y-138307258D01*
X107143940Y-138194573D01*
X107207408Y-138099642D01*
X107301829Y-138034861D01*
X107302041Y-138034772D01*
X107389512Y-138013287D01*
X107526494Y-138001151D01*
X107669785Y-137998200D01*
X107950000Y-137998200D01*
X107950000Y-138506200D01*
X107696000Y-138506200D01*
X107696000Y-138201400D01*
X107581700Y-138201400D01*
X107483623Y-138213021D01*
X107418247Y-138250578D01*
X107416600Y-138252200D01*
X107371747Y-138323198D01*
X107371900Y-138392372D01*
X107411676Y-138451440D01*
X107485694Y-138492122D01*
X107581700Y-138506200D01*
X107696000Y-138506200D01*
X107950000Y-138506200D01*
X107950000Y-138963400D01*
X107696000Y-138963400D01*
X107696000Y-138709400D01*
X107600052Y-138709400D01*
X107520094Y-138719905D01*
X107452865Y-138745538D01*
X107447652Y-138748941D01*
X107397389Y-138804712D01*
X107391553Y-138862425D01*
X107424834Y-138913697D01*
X107491920Y-138950143D01*
X107583515Y-138963400D01*
X107696000Y-138963400D01*
X107950000Y-138963400D01*
X107950000Y-139192000D01*
X107750267Y-139192000D01*
X107547454Y-139184446D01*
G36*
X113362641Y-144589923D02*
X112894196Y-144520887D01*
X112777793Y-144497252D01*
X112388822Y-144395921D01*
X111993382Y-144259900D01*
X111600044Y-144093717D01*
X111217379Y-143901897D01*
X110853957Y-143688969D01*
X110518348Y-143459458D01*
X110219124Y-143217891D01*
X110046182Y-143054510D01*
X109869063Y-142875000D01*
X109296200Y-142875000D01*
X109296200Y-139700000D01*
X109550200Y-139700000D01*
X109550200Y-142646400D01*
X110063303Y-142646400D01*
X110244902Y-142807024D01*
X110644918Y-143136265D01*
X111062466Y-143433174D01*
X111491616Y-143694467D01*
X111926440Y-143916858D01*
X112361008Y-144097064D01*
X112789391Y-144231800D01*
X112840582Y-144244877D01*
X113354593Y-144348581D01*
X113873930Y-144404727D01*
X114401069Y-144413264D01*
X114938486Y-144374145D01*
X115488657Y-144287319D01*
X115939911Y-144183407D01*
X116236466Y-144099244D01*
X116529814Y-144003397D01*
X116803813Y-143901468D01*
X117028176Y-143805640D01*
X117119583Y-143765402D01*
X117192427Y-143737113D01*
X117235474Y-143724972D01*
X117241960Y-143725693D01*
X117248004Y-143733281D01*
X117245597Y-143742056D01*
X117228522Y-143755635D01*
X117190566Y-143777636D01*
X117125514Y-143811676D01*
X117027152Y-143861371D01*
X116896940Y-143926504D01*
X116575714Y-144078124D01*
X116249581Y-144215375D01*
X115929348Y-144334296D01*
X115625820Y-144430921D01*
X115349804Y-144501289D01*
X115303300Y-144510976D01*
X114834488Y-144584119D01*
X114345979Y-144621610D01*
X113850966Y-144623521D01*
X113362641Y-144589923D01*
X113362641Y-144589923D01*
G37*
X113362641Y-144589923D02*
X112894196Y-144520887D01*
X112777793Y-144497252D01*
X112388822Y-144395921D01*
X111993382Y-144259900D01*
X111600044Y-144093717D01*
X111217379Y-143901897D01*
X110853957Y-143688969D01*
X110518348Y-143459458D01*
X110219124Y-143217891D01*
X110046182Y-143054510D01*
X109869063Y-142875000D01*
X109296200Y-142875000D01*
X109296200Y-139700000D01*
X109550200Y-139700000D01*
X109550200Y-142646400D01*
X110063303Y-142646400D01*
X110244902Y-142807024D01*
X110644918Y-143136265D01*
X111062466Y-143433174D01*
X111491616Y-143694467D01*
X111926440Y-143916858D01*
X112361008Y-144097064D01*
X112789391Y-144231800D01*
X112840582Y-144244877D01*
X113354593Y-144348581D01*
X113873930Y-144404727D01*
X114401069Y-144413264D01*
X114938486Y-144374145D01*
X115488657Y-144287319D01*
X115939911Y-144183407D01*
X116236466Y-144099244D01*
X116529814Y-144003397D01*
X116803813Y-143901468D01*
X117028176Y-143805640D01*
X117119583Y-143765402D01*
X117192427Y-143737113D01*
X117235474Y-143724972D01*
X117241960Y-143725693D01*
X117248004Y-143733281D01*
X117245597Y-143742056D01*
X117228522Y-143755635D01*
X117190566Y-143777636D01*
X117125514Y-143811676D01*
X117027152Y-143861371D01*
X116896940Y-143926504D01*
X116575714Y-144078124D01*
X116249581Y-144215375D01*
X115929348Y-144334296D01*
X115625820Y-144430921D01*
X115349804Y-144501289D01*
X115303300Y-144510976D01*
X114834488Y-144584119D01*
X114345979Y-144621610D01*
X113850966Y-144623521D01*
X113362641Y-144589923D01*
G36*
X108508258Y-143545536D02*
X108494528Y-143497300D01*
X108487783Y-143456179D01*
X108481913Y-143388737D01*
X108476867Y-143292205D01*
X108472595Y-143163809D01*
X108469044Y-143000777D01*
X108466165Y-142800337D01*
X108463908Y-142559717D01*
X108462220Y-142276144D01*
X108461051Y-141946847D01*
X108460439Y-141636750D01*
X108458000Y-139903200D01*
X108610400Y-139903200D01*
X108610400Y-141591050D01*
X108610197Y-141946688D01*
X108609500Y-142255249D01*
X108608181Y-142520457D01*
X108606110Y-142746035D01*
X108603158Y-142935705D01*
X108599197Y-143093190D01*
X108594097Y-143222212D01*
X108587730Y-143326494D01*
X108579965Y-143409760D01*
X108570674Y-143475731D01*
X108559728Y-143528131D01*
X108546997Y-143570682D01*
X108541210Y-143586200D01*
X108527368Y-143587886D01*
X108508258Y-143545536D01*
X108508258Y-143545536D01*
G37*
X108508258Y-143545536D02*
X108494528Y-143497300D01*
X108487783Y-143456179D01*
X108481913Y-143388737D01*
X108476867Y-143292205D01*
X108472595Y-143163809D01*
X108469044Y-143000777D01*
X108466165Y-142800337D01*
X108463908Y-142559717D01*
X108462220Y-142276144D01*
X108461051Y-141946847D01*
X108460439Y-141636750D01*
X108458000Y-139903200D01*
X108610400Y-139903200D01*
X108610400Y-141591050D01*
X108610197Y-141946688D01*
X108609500Y-142255249D01*
X108608181Y-142520457D01*
X108606110Y-142746035D01*
X108603158Y-142935705D01*
X108599197Y-143093190D01*
X108594097Y-143222212D01*
X108587730Y-143326494D01*
X108579965Y-143409760D01*
X108570674Y-143475731D01*
X108559728Y-143528131D01*
X108546997Y-143570682D01*
X108541210Y-143586200D01*
X108527368Y-143587886D01*
X108508258Y-143545536D01*
G36*
X107328379Y-143571312D02*
X107300265Y-143506408D01*
X107280277Y-143448326D01*
X107272007Y-143418957D01*
X107264897Y-143381920D01*
X107258863Y-143333434D01*
X107253817Y-143269717D01*
X107249676Y-143186988D01*
X107246353Y-143081467D01*
X107243763Y-142949371D01*
X107241820Y-142786920D01*
X107240440Y-142590333D01*
X107239536Y-142355828D01*
X107239024Y-142079624D01*
X107238817Y-141757940D01*
X107238800Y-141613176D01*
X107238800Y-139903200D01*
X107442000Y-139903200D01*
X107442000Y-141638576D01*
X107441894Y-141982585D01*
X107441521Y-142279529D01*
X107440797Y-142533143D01*
X107439639Y-142747162D01*
X107437966Y-142925320D01*
X107435694Y-143071353D01*
X107432740Y-143188995D01*
X107429021Y-143281981D01*
X107424455Y-143354045D01*
X107418959Y-143408924D01*
X107412450Y-143450350D01*
X107404844Y-143482060D01*
X107400829Y-143494784D01*
X107373967Y-143563691D01*
X107351382Y-143589803D01*
X107328379Y-143571312D01*
X107328379Y-143571312D01*
G37*
X107328379Y-143571312D02*
X107300265Y-143506408D01*
X107280277Y-143448326D01*
X107272007Y-143418957D01*
X107264897Y-143381920D01*
X107258863Y-143333434D01*
X107253817Y-143269717D01*
X107249676Y-143186988D01*
X107246353Y-143081467D01*
X107243763Y-142949371D01*
X107241820Y-142786920D01*
X107240440Y-142590333D01*
X107239536Y-142355828D01*
X107239024Y-142079624D01*
X107238817Y-141757940D01*
X107238800Y-141613176D01*
X107238800Y-139903200D01*
X107442000Y-139903200D01*
X107442000Y-141638576D01*
X107441894Y-141982585D01*
X107441521Y-142279529D01*
X107440797Y-142533143D01*
X107439639Y-142747162D01*
X107437966Y-142925320D01*
X107435694Y-143071353D01*
X107432740Y-143188995D01*
X107429021Y-143281981D01*
X107424455Y-143354045D01*
X107418959Y-143408924D01*
X107412450Y-143450350D01*
X107404844Y-143482060D01*
X107400829Y-143494784D01*
X107373967Y-143563691D01*
X107351382Y-143589803D01*
X107328379Y-143571312D01*
G36*
X116880496Y-142384623D02*
X116774942Y-142374337D01*
X116696180Y-142357322D01*
X116675439Y-142348504D01*
X116656284Y-142332346D01*
X116669861Y-142318687D01*
X116722885Y-142303873D01*
X116778237Y-142292559D01*
X116869088Y-142274827D01*
X116946320Y-142259495D01*
X116982463Y-142252117D01*
X117016064Y-142235527D01*
X117036795Y-142194979D01*
X117050780Y-142117715D01*
X117052092Y-142107067D01*
X117061293Y-142002596D01*
X117067212Y-141882045D01*
X117068380Y-141816351D01*
X117068600Y-141659402D01*
X117214650Y-141631201D01*
X117305447Y-141613470D01*
X117383596Y-141597866D01*
X117418408Y-141590677D01*
X117469901Y-141593380D01*
X117488784Y-141611364D01*
X117491831Y-141648970D01*
X117490285Y-141725262D01*
X117484584Y-141828375D01*
X117477258Y-141922997D01*
X117465803Y-142046280D01*
X117454753Y-142130075D01*
X117440855Y-142185560D01*
X117420852Y-142223916D01*
X117391491Y-142256321D01*
X117376127Y-142270363D01*
X117299833Y-142322145D01*
X117208890Y-142362895D01*
X117190245Y-142368568D01*
X117104913Y-142382392D01*
X116996075Y-142387526D01*
X116880496Y-142384623D01*
X116880496Y-142384623D01*
G37*
X116880496Y-142384623D02*
X116774942Y-142374337D01*
X116696180Y-142357322D01*
X116675439Y-142348504D01*
X116656284Y-142332346D01*
X116669861Y-142318687D01*
X116722885Y-142303873D01*
X116778237Y-142292559D01*
X116869088Y-142274827D01*
X116946320Y-142259495D01*
X116982463Y-142252117D01*
X117016064Y-142235527D01*
X117036795Y-142194979D01*
X117050780Y-142117715D01*
X117052092Y-142107067D01*
X117061293Y-142002596D01*
X117067212Y-141882045D01*
X117068380Y-141816351D01*
X117068600Y-141659402D01*
X117214650Y-141631201D01*
X117305447Y-141613470D01*
X117383596Y-141597866D01*
X117418408Y-141590677D01*
X117469901Y-141593380D01*
X117488784Y-141611364D01*
X117491831Y-141648970D01*
X117490285Y-141725262D01*
X117484584Y-141828375D01*
X117477258Y-141922997D01*
X117465803Y-142046280D01*
X117454753Y-142130075D01*
X117440855Y-142185560D01*
X117420852Y-142223916D01*
X117391491Y-142256321D01*
X117376127Y-142270363D01*
X117299833Y-142322145D01*
X117208890Y-142362895D01*
X117190245Y-142368568D01*
X117104913Y-142382392D01*
X116996075Y-142387526D01*
X116880496Y-142384623D01*
G36*
X114667861Y-142375044D02*
X114563573Y-142365127D01*
X114482263Y-142349893D01*
X114434777Y-142331111D01*
X114427000Y-142319603D01*
X114450160Y-142306724D01*
X114511568Y-142290251D01*
X114599113Y-142273288D01*
X114622113Y-142269575D01*
X114715061Y-142254448D01*
X114785871Y-142241645D01*
X114821913Y-142233486D01*
X114823943Y-142232525D01*
X114828011Y-142206066D01*
X114834035Y-142139179D01*
X114841183Y-142042159D01*
X114848184Y-141932683D01*
X114865708Y-141639556D01*
X115040526Y-141609578D01*
X115132097Y-141594546D01*
X115205089Y-141583788D01*
X115243903Y-141579602D01*
X115244150Y-141579600D01*
X115256534Y-141596439D01*
X115262766Y-141650008D01*
X115263044Y-141744884D01*
X115257568Y-141885647D01*
X115257511Y-141886783D01*
X115249236Y-142009038D01*
X115238150Y-142114274D01*
X115225710Y-142191203D01*
X115213478Y-142228412D01*
X115140403Y-142286028D01*
X115032434Y-142333798D01*
X114905288Y-142366249D01*
X114784282Y-142377876D01*
X114667861Y-142375044D01*
X114667861Y-142375044D01*
G37*
X114667861Y-142375044D02*
X114563573Y-142365127D01*
X114482263Y-142349893D01*
X114434777Y-142331111D01*
X114427000Y-142319603D01*
X114450160Y-142306724D01*
X114511568Y-142290251D01*
X114599113Y-142273288D01*
X114622113Y-142269575D01*
X114715061Y-142254448D01*
X114785871Y-142241645D01*
X114821913Y-142233486D01*
X114823943Y-142232525D01*
X114828011Y-142206066D01*
X114834035Y-142139179D01*
X114841183Y-142042159D01*
X114848184Y-141932683D01*
X114865708Y-141639556D01*
X115040526Y-141609578D01*
X115132097Y-141594546D01*
X115205089Y-141583788D01*
X115243903Y-141579602D01*
X115244150Y-141579600D01*
X115256534Y-141596439D01*
X115262766Y-141650008D01*
X115263044Y-141744884D01*
X115257568Y-141885647D01*
X115257511Y-141886783D01*
X115249236Y-142009038D01*
X115238150Y-142114274D01*
X115225710Y-142191203D01*
X115213478Y-142228412D01*
X115140403Y-142286028D01*
X115032434Y-142333798D01*
X114905288Y-142366249D01*
X114784282Y-142377876D01*
X114667861Y-142375044D01*
G36*
X110120705Y-142380365D02*
X110059289Y-142367433D01*
X109994303Y-142344794D01*
X109977484Y-142324449D01*
X110009582Y-142305673D01*
X110091351Y-142287746D01*
X110151486Y-142278822D01*
X110236990Y-142265106D01*
X110295694Y-142245072D01*
X110333424Y-142209754D01*
X110356011Y-142150184D01*
X110369282Y-142057395D01*
X110378630Y-141929386D01*
X110387997Y-141803616D01*
X110398329Y-141720393D01*
X110411305Y-141671469D01*
X110428607Y-141648597D01*
X110436557Y-141645052D01*
X110478318Y-141635485D01*
X110549688Y-141621235D01*
X110633698Y-141605438D01*
X110713379Y-141591230D01*
X110771763Y-141581748D01*
X110790643Y-141579600D01*
X110794029Y-141603331D01*
X110794540Y-141668021D01*
X110792288Y-141763916D01*
X110787386Y-141881264D01*
X110787111Y-141886783D01*
X110777761Y-142023940D01*
X110765384Y-142133288D01*
X110751125Y-142206344D01*
X110740482Y-142231540D01*
X110660683Y-142294562D01*
X110545064Y-142343698D01*
X110407366Y-142376204D01*
X110261333Y-142389340D01*
X110120705Y-142380365D01*
X110120705Y-142380365D01*
G37*
X110120705Y-142380365D02*
X110059289Y-142367433D01*
X109994303Y-142344794D01*
X109977484Y-142324449D01*
X110009582Y-142305673D01*
X110091351Y-142287746D01*
X110151486Y-142278822D01*
X110236990Y-142265106D01*
X110295694Y-142245072D01*
X110333424Y-142209754D01*
X110356011Y-142150184D01*
X110369282Y-142057395D01*
X110378630Y-141929386D01*
X110387997Y-141803616D01*
X110398329Y-141720393D01*
X110411305Y-141671469D01*
X110428607Y-141648597D01*
X110436557Y-141645052D01*
X110478318Y-141635485D01*
X110549688Y-141621235D01*
X110633698Y-141605438D01*
X110713379Y-141591230D01*
X110771763Y-141581748D01*
X110790643Y-141579600D01*
X110794029Y-141603331D01*
X110794540Y-141668021D01*
X110792288Y-141763916D01*
X110787386Y-141881264D01*
X110787111Y-141886783D01*
X110777761Y-142023940D01*
X110765384Y-142133288D01*
X110751125Y-142206344D01*
X110740482Y-142231540D01*
X110660683Y-142294562D01*
X110545064Y-142343698D01*
X110407366Y-142376204D01*
X110261333Y-142389340D01*
X110120705Y-142380365D01*
G36*
X115814555Y-142388739D02*
X115685095Y-142379668D01*
X115601893Y-142365917D01*
X115565882Y-142348620D01*
X115577991Y-142328910D01*
X115639151Y-142307922D01*
X115733043Y-142289494D01*
X115826342Y-142272638D01*
X115898043Y-142256290D01*
X115935159Y-142243498D01*
X115937337Y-142241560D01*
X115942986Y-142210906D01*
X115950437Y-142140517D01*
X115958657Y-142041378D01*
X115965498Y-141942362D01*
X115983378Y-141659800D01*
X116140720Y-141632400D01*
X116246118Y-141613611D01*
X116316828Y-141605556D01*
X116359161Y-141615480D01*
X116379426Y-141650629D01*
X116383934Y-141718246D01*
X116378996Y-141825578D01*
X116374706Y-141901047D01*
X116366573Y-142032227D01*
X116357380Y-142123013D01*
X116345041Y-142183802D01*
X116327470Y-142224990D01*
X116303493Y-142256008D01*
X116206859Y-142328621D01*
X116077756Y-142372835D01*
X115911525Y-142389915D01*
X115814555Y-142388739D01*
X115814555Y-142388739D01*
G37*
X115814555Y-142388739D02*
X115685095Y-142379668D01*
X115601893Y-142365917D01*
X115565882Y-142348620D01*
X115577991Y-142328910D01*
X115639151Y-142307922D01*
X115733043Y-142289494D01*
X115826342Y-142272638D01*
X115898043Y-142256290D01*
X115935159Y-142243498D01*
X115937337Y-142241560D01*
X115942986Y-142210906D01*
X115950437Y-142140517D01*
X115958657Y-142041378D01*
X115965498Y-141942362D01*
X115983378Y-141659800D01*
X116140720Y-141632400D01*
X116246118Y-141613611D01*
X116316828Y-141605556D01*
X116359161Y-141615480D01*
X116379426Y-141650629D01*
X116383934Y-141718246D01*
X116378996Y-141825578D01*
X116374706Y-141901047D01*
X116366573Y-142032227D01*
X116357380Y-142123013D01*
X116345041Y-142183802D01*
X116327470Y-142224990D01*
X116303493Y-142256008D01*
X116206859Y-142328621D01*
X116077756Y-142372835D01*
X115911525Y-142389915D01*
X115814555Y-142388739D01*
G36*
X113576156Y-142387442D02*
X113448482Y-142377252D01*
X113366493Y-142363086D01*
X113331297Y-142345904D01*
X113344004Y-142326668D01*
X113405721Y-142306339D01*
X113468125Y-142293775D01*
X113558689Y-142278996D01*
X113632480Y-142268733D01*
X113669758Y-142265400D01*
X113693416Y-142241132D01*
X113713356Y-142172709D01*
X113728589Y-142066701D01*
X113738126Y-141929680D01*
X113741020Y-141791758D01*
X113741200Y-141661015D01*
X113902031Y-141633008D01*
X114008977Y-141613942D01*
X114080672Y-141605709D01*
X114123594Y-141615554D01*
X114144222Y-141650716D01*
X114149035Y-141718439D01*
X114144512Y-141825965D01*
X114140634Y-141899728D01*
X114133171Y-142030027D01*
X114124541Y-142120047D01*
X114112638Y-142180301D01*
X114095356Y-142221300D01*
X114070590Y-142253558D01*
X114069533Y-142254689D01*
X113972578Y-142328345D01*
X113844939Y-142372819D01*
X113681432Y-142389506D01*
X113576156Y-142387442D01*
X113576156Y-142387442D01*
G37*
X113576156Y-142387442D02*
X113448482Y-142377252D01*
X113366493Y-142363086D01*
X113331297Y-142345904D01*
X113344004Y-142326668D01*
X113405721Y-142306339D01*
X113468125Y-142293775D01*
X113558689Y-142278996D01*
X113632480Y-142268733D01*
X113669758Y-142265400D01*
X113693416Y-142241132D01*
X113713356Y-142172709D01*
X113728589Y-142066701D01*
X113738126Y-141929680D01*
X113741020Y-141791758D01*
X113741200Y-141661015D01*
X113902031Y-141633008D01*
X114008977Y-141613942D01*
X114080672Y-141605709D01*
X114123594Y-141615554D01*
X114144222Y-141650716D01*
X114149035Y-141718439D01*
X114144512Y-141825965D01*
X114140634Y-141899728D01*
X114133171Y-142030027D01*
X114124541Y-142120047D01*
X114112638Y-142180301D01*
X114095356Y-142221300D01*
X114070590Y-142253558D01*
X114069533Y-142254689D01*
X113972578Y-142328345D01*
X113844939Y-142372819D01*
X113681432Y-142389506D01*
X113576156Y-142387442D01*
G36*
X112452251Y-142387215D02*
X112319940Y-142378298D01*
X112232118Y-142365127D01*
X112190104Y-142348671D01*
X112195218Y-142329901D01*
X112248780Y-142309787D01*
X112325125Y-142293775D01*
X112415700Y-142278996D01*
X112489513Y-142268733D01*
X112526813Y-142265400D01*
X112551897Y-142241038D01*
X112572451Y-142171841D01*
X112587565Y-142063645D01*
X112596329Y-141922288D01*
X112598200Y-141807082D01*
X112598200Y-141661015D01*
X112759031Y-141633008D01*
X112872164Y-141614612D01*
X112944546Y-141607359D01*
X112985118Y-141611841D01*
X113002821Y-141628654D01*
X113006459Y-141649450D01*
X113007431Y-141743579D01*
X113004556Y-141860512D01*
X112998726Y-141981162D01*
X112990829Y-142086439D01*
X112983105Y-142149895D01*
X112968522Y-142208930D01*
X112941091Y-142250904D01*
X112888495Y-142289492D01*
X112826566Y-142323679D01*
X112756248Y-142358587D01*
X112697190Y-142379516D01*
X112633122Y-142389228D01*
X112547774Y-142390484D01*
X112452251Y-142387215D01*
X112452251Y-142387215D01*
G37*
X112452251Y-142387215D02*
X112319940Y-142378298D01*
X112232118Y-142365127D01*
X112190104Y-142348671D01*
X112195218Y-142329901D01*
X112248780Y-142309787D01*
X112325125Y-142293775D01*
X112415700Y-142278996D01*
X112489513Y-142268733D01*
X112526813Y-142265400D01*
X112551897Y-142241038D01*
X112572451Y-142171841D01*
X112587565Y-142063645D01*
X112596329Y-141922288D01*
X112598200Y-141807082D01*
X112598200Y-141661015D01*
X112759031Y-141633008D01*
X112872164Y-141614612D01*
X112944546Y-141607359D01*
X112985118Y-141611841D01*
X113002821Y-141628654D01*
X113006459Y-141649450D01*
X113007431Y-141743579D01*
X113004556Y-141860512D01*
X112998726Y-141981162D01*
X112990829Y-142086439D01*
X112983105Y-142149895D01*
X112968522Y-142208930D01*
X112941091Y-142250904D01*
X112888495Y-142289492D01*
X112826566Y-142323679D01*
X112756248Y-142358587D01*
X112697190Y-142379516D01*
X112633122Y-142389228D01*
X112547774Y-142390484D01*
X112452251Y-142387215D01*
G36*
X111220250Y-142394198D02*
X111142317Y-142374799D01*
X111089330Y-142355937D01*
X111074200Y-142344311D01*
X111097283Y-142331415D01*
X111158120Y-142315199D01*
X111244102Y-142298954D01*
X111254181Y-142297365D01*
X111344858Y-142281605D01*
X111414492Y-142266288D01*
X111448991Y-142254548D01*
X111449789Y-142253879D01*
X111462622Y-142218610D01*
X111475967Y-142145563D01*
X111488255Y-142047718D01*
X111497914Y-141938052D01*
X111503374Y-141829547D01*
X111503857Y-141807021D01*
X111506000Y-141666141D01*
X111684272Y-141635571D01*
X111776704Y-141620378D01*
X111850605Y-141609434D01*
X111890587Y-141605010D01*
X111891357Y-141605000D01*
X111904077Y-141622070D01*
X111910199Y-141676362D01*
X111909941Y-141772504D01*
X111904798Y-141891864D01*
X111897400Y-142010377D01*
X111889110Y-142112099D01*
X111881019Y-142185116D01*
X111875115Y-142215714D01*
X111825523Y-142279842D01*
X111736853Y-142334275D01*
X111620391Y-142375937D01*
X111487427Y-142401752D01*
X111349247Y-142408643D01*
X111220250Y-142394198D01*
X111220250Y-142394198D01*
G37*
X111220250Y-142394198D02*
X111142317Y-142374799D01*
X111089330Y-142355937D01*
X111074200Y-142344311D01*
X111097283Y-142331415D01*
X111158120Y-142315199D01*
X111244102Y-142298954D01*
X111254181Y-142297365D01*
X111344858Y-142281605D01*
X111414492Y-142266288D01*
X111448991Y-142254548D01*
X111449789Y-142253879D01*
X111462622Y-142218610D01*
X111475967Y-142145563D01*
X111488255Y-142047718D01*
X111497914Y-141938052D01*
X111503374Y-141829547D01*
X111503857Y-141807021D01*
X111506000Y-141666141D01*
X111684272Y-141635571D01*
X111776704Y-141620378D01*
X111850605Y-141609434D01*
X111890587Y-141605010D01*
X111891357Y-141605000D01*
X111904077Y-141622070D01*
X111910199Y-141676362D01*
X111909941Y-141772504D01*
X111904798Y-141891864D01*
X111897400Y-142010377D01*
X111889110Y-142112099D01*
X111881019Y-142185116D01*
X111875115Y-142215714D01*
X111825523Y-142279842D01*
X111736853Y-142334275D01*
X111620391Y-142375937D01*
X111487427Y-142401752D01*
X111349247Y-142408643D01*
X111220250Y-142394198D01*
G36*
X108225244Y-143216581D02*
X108208118Y-143208132D01*
X108195837Y-143190538D01*
X108187768Y-143156620D01*
X108183280Y-143099194D01*
X108181739Y-143011082D01*
X108182514Y-142885100D01*
X108184372Y-142752455D01*
X108191300Y-142303500D01*
X108255751Y-142295984D01*
X108311234Y-142296662D01*
X108338301Y-142306568D01*
X108344229Y-142336746D01*
X108349343Y-142409072D01*
X108353298Y-142514894D01*
X108355751Y-142645562D01*
X108356400Y-142762216D01*
X108355879Y-142923107D01*
X108353881Y-143040308D01*
X108349753Y-143120925D01*
X108342841Y-143172061D01*
X108332494Y-143200820D01*
X108318058Y-143214307D01*
X108314722Y-143215759D01*
X108255419Y-143222062D01*
X108225244Y-143216581D01*
X108225244Y-143216581D01*
G37*
X108225244Y-143216581D02*
X108208118Y-143208132D01*
X108195837Y-143190538D01*
X108187768Y-143156620D01*
X108183280Y-143099194D01*
X108181739Y-143011082D01*
X108182514Y-142885100D01*
X108184372Y-142752455D01*
X108191300Y-142303500D01*
X108255751Y-142295984D01*
X108311234Y-142296662D01*
X108338301Y-142306568D01*
X108344229Y-142336746D01*
X108349343Y-142409072D01*
X108353298Y-142514894D01*
X108355751Y-142645562D01*
X108356400Y-142762216D01*
X108355879Y-142923107D01*
X108353881Y-143040308D01*
X108349753Y-143120925D01*
X108342841Y-143172061D01*
X108332494Y-143200820D01*
X108318058Y-143214307D01*
X108314722Y-143215759D01*
X108255419Y-143222062D01*
X108225244Y-143216581D01*
G36*
X107905550Y-143215036D02*
X107888690Y-143198967D01*
X107876327Y-143170147D01*
X107867576Y-143120976D01*
X107861551Y-143043857D01*
X107857364Y-142931191D01*
X107854130Y-142775380D01*
X107854107Y-142774044D01*
X107852310Y-142604846D01*
X107854333Y-142479889D01*
X107861463Y-142392675D01*
X107874991Y-142336707D01*
X107896205Y-142305488D01*
X107926395Y-142292522D01*
X107950000Y-142290800D01*
X108004311Y-142309118D01*
X108023734Y-142325928D01*
X108036046Y-142364776D01*
X108043828Y-142447543D01*
X108047185Y-142576394D01*
X108046225Y-142753490D01*
X108045894Y-142774044D01*
X108042663Y-142930203D01*
X108038487Y-143043161D01*
X108032478Y-143120516D01*
X108023751Y-143169866D01*
X108011418Y-143198810D01*
X107994594Y-143214945D01*
X107994450Y-143215036D01*
X107939791Y-143229458D01*
X107905550Y-143215036D01*
X107905550Y-143215036D01*
G37*
X107905550Y-143215036D02*
X107888690Y-143198967D01*
X107876327Y-143170147D01*
X107867576Y-143120976D01*
X107861551Y-143043857D01*
X107857364Y-142931191D01*
X107854130Y-142775380D01*
X107854107Y-142774044D01*
X107852310Y-142604846D01*
X107854333Y-142479889D01*
X107861463Y-142392675D01*
X107874991Y-142336707D01*
X107896205Y-142305488D01*
X107926395Y-142292522D01*
X107950000Y-142290800D01*
X108004311Y-142309118D01*
X108023734Y-142325928D01*
X108036046Y-142364776D01*
X108043828Y-142447543D01*
X108047185Y-142576394D01*
X108046225Y-142753490D01*
X108045894Y-142774044D01*
X108042663Y-142930203D01*
X108038487Y-143043161D01*
X108032478Y-143120516D01*
X108023751Y-143169866D01*
X108011418Y-143198810D01*
X107994594Y-143214945D01*
X107994450Y-143215036D01*
X107939791Y-143229458D01*
X107905550Y-143215036D01*
G36*
X107602013Y-143207104D02*
X107583515Y-143190686D01*
X107567562Y-143166201D01*
X107556346Y-143124647D01*
X107549123Y-143058164D01*
X107545145Y-142958892D01*
X107543668Y-142818971D01*
X107543600Y-142769916D01*
X107545320Y-142628321D01*
X107550079Y-142504591D01*
X107557278Y-142408530D01*
X107566317Y-142349939D01*
X107569894Y-142339931D01*
X107611722Y-142304184D01*
X107671787Y-142290002D01*
X107723840Y-142302668D01*
X107729867Y-142307734D01*
X107738337Y-142341213D01*
X107744132Y-142414963D01*
X107747411Y-142518536D01*
X107748332Y-142641483D01*
X107747054Y-142773354D01*
X107743737Y-142903700D01*
X107738538Y-143022073D01*
X107731615Y-143118022D01*
X107723129Y-143181099D01*
X107716321Y-143200120D01*
X107660896Y-143228868D01*
X107602013Y-143207104D01*
X107602013Y-143207104D01*
G37*
X107602013Y-143207104D02*
X107583515Y-143190686D01*
X107567562Y-143166201D01*
X107556346Y-143124647D01*
X107549123Y-143058164D01*
X107545145Y-142958892D01*
X107543668Y-142818971D01*
X107543600Y-142769916D01*
X107545320Y-142628321D01*
X107550079Y-142504591D01*
X107557278Y-142408530D01*
X107566317Y-142349939D01*
X107569894Y-142339931D01*
X107611722Y-142304184D01*
X107671787Y-142290002D01*
X107723840Y-142302668D01*
X107729867Y-142307734D01*
X107738337Y-142341213D01*
X107744132Y-142414963D01*
X107747411Y-142518536D01*
X107748332Y-142641483D01*
X107747054Y-142773354D01*
X107743737Y-142903700D01*
X107738538Y-143022073D01*
X107731615Y-143118022D01*
X107723129Y-143181099D01*
X107716321Y-143200120D01*
X107660896Y-143228868D01*
X107602013Y-143207104D01*
G36*
X107938716Y-144692461D02*
X107908496Y-144634350D01*
X107864817Y-144541440D01*
X107810503Y-144419866D01*
X107748375Y-144275763D01*
X107699655Y-144159737D01*
X107625295Y-143979892D01*
X107568695Y-143840082D01*
X107527715Y-143733603D01*
X107500218Y-143653751D01*
X107484064Y-143593820D01*
X107477115Y-143547106D01*
X107477232Y-143506905D01*
X107481046Y-143474451D01*
X107495742Y-143405538D01*
X107513101Y-143363569D01*
X107521085Y-143357600D01*
X107543328Y-143375832D01*
X107543600Y-143379183D01*
X107552901Y-143408026D01*
X107578930Y-143476677D01*
X107618882Y-143578051D01*
X107669952Y-143705063D01*
X107729331Y-143850628D01*
X107755712Y-143914716D01*
X107967823Y-144428667D01*
X108143062Y-144032884D01*
X108215528Y-143871849D01*
X108270967Y-143755181D01*
X108311077Y-143680021D01*
X108337554Y-143643514D01*
X108352095Y-143642802D01*
X108356400Y-143673636D01*
X108347399Y-143706782D01*
X108322659Y-143778277D01*
X108285574Y-143879411D01*
X108239538Y-144001474D01*
X108187945Y-144135758D01*
X108134191Y-144273551D01*
X108081670Y-144406144D01*
X108033775Y-144524827D01*
X107993902Y-144620891D01*
X107965444Y-144685625D01*
X107952654Y-144709637D01*
X107938716Y-144692461D01*
X107938716Y-144692461D01*
G37*
X107938716Y-144692461D02*
X107908496Y-144634350D01*
X107864817Y-144541440D01*
X107810503Y-144419866D01*
X107748375Y-144275763D01*
X107699655Y-144159737D01*
X107625295Y-143979892D01*
X107568695Y-143840082D01*
X107527715Y-143733603D01*
X107500218Y-143653751D01*
X107484064Y-143593820D01*
X107477115Y-143547106D01*
X107477232Y-143506905D01*
X107481046Y-143474451D01*
X107495742Y-143405538D01*
X107513101Y-143363569D01*
X107521085Y-143357600D01*
X107543328Y-143375832D01*
X107543600Y-143379183D01*
X107552901Y-143408026D01*
X107578930Y-143476677D01*
X107618882Y-143578051D01*
X107669952Y-143705063D01*
X107729331Y-143850628D01*
X107755712Y-143914716D01*
X107967823Y-144428667D01*
X108143062Y-144032884D01*
X108215528Y-143871849D01*
X108270967Y-143755181D01*
X108311077Y-143680021D01*
X108337554Y-143643514D01*
X108352095Y-143642802D01*
X108356400Y-143673636D01*
X108347399Y-143706782D01*
X108322659Y-143778277D01*
X108285574Y-143879411D01*
X108239538Y-144001474D01*
X108187945Y-144135758D01*
X108134191Y-144273551D01*
X108081670Y-144406144D01*
X108033775Y-144524827D01*
X107993902Y-144620891D01*
X107965444Y-144685625D01*
X107952654Y-144709637D01*
X107938716Y-144692461D01*
G36*
X113906252Y-145326978D02*
X113840245Y-145294446D01*
X113747091Y-145245605D01*
X113635297Y-145184857D01*
X113582741Y-145155684D01*
X113254942Y-144972568D01*
X113271577Y-144883895D01*
X113288220Y-144824178D01*
X113319222Y-144778183D01*
X113376106Y-144732899D01*
X113441023Y-144692561D01*
X113488607Y-144667359D01*
X113508761Y-144674226D01*
X113517223Y-144718307D01*
X113526327Y-144747442D01*
X113550647Y-144777724D01*
X113596740Y-144813877D01*
X113671162Y-144860625D01*
X113780468Y-144922694D01*
X113865208Y-144969083D01*
X114205115Y-145153722D01*
X114562969Y-144993639D01*
X114686733Y-144939279D01*
X114793440Y-144894316D01*
X114874900Y-144862050D01*
X114922922Y-144845781D01*
X114932145Y-144844878D01*
X114932884Y-144865171D01*
X114903744Y-144881677D01*
X114837510Y-144915287D01*
X114742453Y-144962069D01*
X114626840Y-145018093D01*
X114498943Y-145079428D01*
X114367030Y-145142141D01*
X114239371Y-145202303D01*
X114124235Y-145255981D01*
X114029892Y-145299243D01*
X113964611Y-145328160D01*
X113936662Y-145338800D01*
X113936607Y-145338800D01*
X113906252Y-145326978D01*
X113906252Y-145326978D01*
G37*
X113906252Y-145326978D02*
X113840245Y-145294446D01*
X113747091Y-145245605D01*
X113635297Y-145184857D01*
X113582741Y-145155684D01*
X113254942Y-144972568D01*
X113271577Y-144883895D01*
X113288220Y-144824178D01*
X113319222Y-144778183D01*
X113376106Y-144732899D01*
X113441023Y-144692561D01*
X113488607Y-144667359D01*
X113508761Y-144674226D01*
X113517223Y-144718307D01*
X113526327Y-144747442D01*
X113550647Y-144777724D01*
X113596740Y-144813877D01*
X113671162Y-144860625D01*
X113780468Y-144922694D01*
X113865208Y-144969083D01*
X114205115Y-145153722D01*
X114562969Y-144993639D01*
X114686733Y-144939279D01*
X114793440Y-144894316D01*
X114874900Y-144862050D01*
X114922922Y-144845781D01*
X114932145Y-144844878D01*
X114932884Y-144865171D01*
X114903744Y-144881677D01*
X114837510Y-144915287D01*
X114742453Y-144962069D01*
X114626840Y-145018093D01*
X114498943Y-145079428D01*
X114367030Y-145142141D01*
X114239371Y-145202303D01*
X114124235Y-145255981D01*
X114029892Y-145299243D01*
X113964611Y-145328160D01*
X113936662Y-145338800D01*
X113936607Y-145338800D01*
X113906252Y-145326978D01*
D14*
G04 #@! TO.C,CMD*
X130750000Y-74870000D02*
X132080000Y-74870000D01*
X130750000Y-76200000D02*
X130750000Y-74870000D01*
X133350000Y-74870000D02*
X135950000Y-74870000D01*
X133350000Y-77470000D02*
X133350000Y-74870000D01*
X130750000Y-77470000D02*
X133350000Y-77470000D01*
X135950000Y-74870000D02*
X135950000Y-77530000D01*
X130750000Y-77470000D02*
X130750000Y-77530000D01*
X130750000Y-77530000D02*
X135950000Y-77530000D01*
G04 #@! TO.C,D11*
X151070000Y-77530000D02*
X156270000Y-77530000D01*
X151070000Y-77470000D02*
X151070000Y-77530000D01*
X156270000Y-74870000D02*
X156270000Y-77530000D01*
X151070000Y-77470000D02*
X153670000Y-77470000D01*
X153670000Y-77470000D02*
X153670000Y-74870000D01*
X153670000Y-74870000D02*
X156270000Y-74870000D01*
X151070000Y-76200000D02*
X151070000Y-74870000D01*
X151070000Y-74870000D02*
X152400000Y-74870000D01*
G04 #@! TO.C,D21*
X145990000Y-74870000D02*
X147320000Y-74870000D01*
X145990000Y-76200000D02*
X145990000Y-74870000D01*
X148590000Y-74870000D02*
X151190000Y-74870000D01*
X148590000Y-77470000D02*
X148590000Y-74870000D01*
X145990000Y-77470000D02*
X148590000Y-77470000D01*
X151190000Y-74870000D02*
X151190000Y-77530000D01*
X145990000Y-77470000D02*
X145990000Y-77530000D01*
X145990000Y-77530000D02*
X151190000Y-77530000D01*
G04 #@! TO.C,D31*
X140910000Y-77530000D02*
X146110000Y-77530000D01*
X140910000Y-77470000D02*
X140910000Y-77530000D01*
X146110000Y-74870000D02*
X146110000Y-77530000D01*
X140910000Y-77470000D02*
X143510000Y-77470000D01*
X143510000Y-77470000D02*
X143510000Y-74870000D01*
X143510000Y-74870000D02*
X146110000Y-74870000D01*
X140910000Y-76200000D02*
X140910000Y-74870000D01*
X140910000Y-74870000D02*
X142240000Y-74870000D01*
G04 #@! TO.C,D41*
X135830000Y-74870000D02*
X137160000Y-74870000D01*
X135830000Y-76200000D02*
X135830000Y-74870000D01*
X138430000Y-74870000D02*
X141030000Y-74870000D01*
X138430000Y-77470000D02*
X138430000Y-74870000D01*
X135830000Y-77470000D02*
X138430000Y-77470000D01*
X141030000Y-74870000D02*
X141030000Y-77530000D01*
X135830000Y-77470000D02*
X135830000Y-77530000D01*
X135830000Y-77530000D02*
X141030000Y-77530000D01*
G04 #@! TO.C,D12*
X125670000Y-85030000D02*
X125670000Y-90230000D01*
X125730000Y-85030000D02*
X125670000Y-85030000D01*
X128330000Y-90230000D02*
X125670000Y-90230000D01*
X125730000Y-85030000D02*
X125730000Y-87630000D01*
X125730000Y-87630000D02*
X128330000Y-87630000D01*
X128330000Y-87630000D02*
X128330000Y-90230000D01*
X127000000Y-85030000D02*
X128330000Y-85030000D01*
X128330000Y-85030000D02*
X128330000Y-86360000D01*
G04 #@! TO.C,D13*
X128330000Y-90110000D02*
X128330000Y-91440000D01*
X127000000Y-90110000D02*
X128330000Y-90110000D01*
X128330000Y-92710000D02*
X128330000Y-95310000D01*
X125730000Y-92710000D02*
X128330000Y-92710000D01*
X125730000Y-90110000D02*
X125730000Y-92710000D01*
X128330000Y-95310000D02*
X125670000Y-95310000D01*
X125730000Y-90110000D02*
X125670000Y-90110000D01*
X125670000Y-90110000D02*
X125670000Y-95310000D01*
G04 #@! TO.C,D22*
X128330000Y-85150000D02*
X128330000Y-79950000D01*
X128270000Y-85150000D02*
X128330000Y-85150000D01*
X125670000Y-79950000D02*
X128330000Y-79950000D01*
X128270000Y-85150000D02*
X128270000Y-82550000D01*
X128270000Y-82550000D02*
X125670000Y-82550000D01*
X125670000Y-82550000D02*
X125670000Y-79950000D01*
X127000000Y-85150000D02*
X125670000Y-85150000D01*
X125670000Y-85150000D02*
X125670000Y-83820000D01*
G04 #@! TO.C,D23*
X125670000Y-80070000D02*
X125670000Y-78740000D01*
X127000000Y-80070000D02*
X125670000Y-80070000D01*
X125670000Y-77470000D02*
X125670000Y-74870000D01*
X128270000Y-77470000D02*
X125670000Y-77470000D01*
X128270000Y-80070000D02*
X128270000Y-77470000D01*
X125670000Y-74870000D02*
X128330000Y-74870000D01*
X128270000Y-80070000D02*
X128330000Y-80070000D01*
X128330000Y-80070000D02*
X128330000Y-74870000D01*
G04 #@! TO.C,D32*
X158690000Y-79950000D02*
X158690000Y-85150000D01*
X158750000Y-79950000D02*
X158690000Y-79950000D01*
X161350000Y-85150000D02*
X158690000Y-85150000D01*
X158750000Y-79950000D02*
X158750000Y-82550000D01*
X158750000Y-82550000D02*
X161350000Y-82550000D01*
X161350000Y-82550000D02*
X161350000Y-85150000D01*
X160020000Y-79950000D02*
X161350000Y-79950000D01*
X161350000Y-79950000D02*
X161350000Y-81280000D01*
G04 #@! TO.C,D33*
X161350000Y-90110000D02*
X161350000Y-91440000D01*
X160020000Y-90110000D02*
X161350000Y-90110000D01*
X161350000Y-92710000D02*
X161350000Y-95310000D01*
X158750000Y-92710000D02*
X161350000Y-92710000D01*
X158750000Y-90110000D02*
X158750000Y-92710000D01*
X161350000Y-95310000D02*
X158690000Y-95310000D01*
X158750000Y-90110000D02*
X158690000Y-90110000D01*
X158690000Y-90110000D02*
X158690000Y-95310000D01*
G04 #@! TO.C,D42*
X161350000Y-90230000D02*
X161350000Y-85030000D01*
X161290000Y-90230000D02*
X161350000Y-90230000D01*
X158690000Y-85030000D02*
X161350000Y-85030000D01*
X161290000Y-90230000D02*
X161290000Y-87630000D01*
X161290000Y-87630000D02*
X158690000Y-87630000D01*
X158690000Y-87630000D02*
X158690000Y-85030000D01*
X160020000Y-90230000D02*
X158690000Y-90230000D01*
X158690000Y-90230000D02*
X158690000Y-88900000D01*
G04 #@! TO.C,D43*
X158690000Y-80070000D02*
X158690000Y-78740000D01*
X160020000Y-80070000D02*
X158690000Y-80070000D01*
X158690000Y-77470000D02*
X158690000Y-74870000D01*
X161290000Y-77470000D02*
X158690000Y-77470000D01*
X161290000Y-80070000D02*
X161290000Y-77470000D01*
X158690000Y-74870000D02*
X161350000Y-74870000D01*
X161290000Y-80070000D02*
X161350000Y-80070000D01*
X161350000Y-80070000D02*
X161350000Y-74870000D01*
G04 #@! TO.C,C1*
D15*
X152741333Y-65190642D02*
X152693714Y-65238261D01*
X152550857Y-65285880D01*
X152455619Y-65285880D01*
X152312761Y-65238261D01*
X152217523Y-65143023D01*
X152169904Y-65047785D01*
X152122285Y-64857309D01*
X152122285Y-64714452D01*
X152169904Y-64523976D01*
X152217523Y-64428738D01*
X152312761Y-64333500D01*
X152455619Y-64285880D01*
X152550857Y-64285880D01*
X152693714Y-64333500D01*
X152741333Y-64381119D01*
X153693714Y-65285880D02*
X153122285Y-65285880D01*
X153408000Y-65285880D02*
X153408000Y-64285880D01*
X153312761Y-64428738D01*
X153217523Y-64523976D01*
X153122285Y-64571595D01*
G04 #@! TO.C,C3*
X151471333Y-87987142D02*
X151423714Y-88034761D01*
X151280857Y-88082380D01*
X151185619Y-88082380D01*
X151042761Y-88034761D01*
X150947523Y-87939523D01*
X150899904Y-87844285D01*
X150852285Y-87653809D01*
X150852285Y-87510952D01*
X150899904Y-87320476D01*
X150947523Y-87225238D01*
X151042761Y-87130000D01*
X151185619Y-87082380D01*
X151280857Y-87082380D01*
X151423714Y-87130000D01*
X151471333Y-87177619D01*
X151804666Y-87082380D02*
X152423714Y-87082380D01*
X152090380Y-87463333D01*
X152233238Y-87463333D01*
X152328476Y-87510952D01*
X152376095Y-87558571D01*
X152423714Y-87653809D01*
X152423714Y-87891904D01*
X152376095Y-87987142D01*
X152328476Y-88034761D01*
X152233238Y-88082380D01*
X151947523Y-88082380D01*
X151852285Y-88034761D01*
X151804666Y-87987142D01*
G04 #@! TO.C,CMD*
X132588095Y-74227142D02*
X132540476Y-74274761D01*
X132397619Y-74322380D01*
X132302380Y-74322380D01*
X132159523Y-74274761D01*
X132064285Y-74179523D01*
X132016666Y-74084285D01*
X131969047Y-73893809D01*
X131969047Y-73750952D01*
X132016666Y-73560476D01*
X132064285Y-73465238D01*
X132159523Y-73370000D01*
X132302380Y-73322380D01*
X132397619Y-73322380D01*
X132540476Y-73370000D01*
X132588095Y-73417619D01*
X133016666Y-74322380D02*
X133016666Y-73322380D01*
X133350000Y-74036666D01*
X133683333Y-73322380D01*
X133683333Y-74322380D01*
X134159523Y-74322380D02*
X134159523Y-73322380D01*
X134397619Y-73322380D01*
X134540476Y-73370000D01*
X134635714Y-73465238D01*
X134683333Y-73560476D01*
X134730952Y-73750952D01*
X134730952Y-73893809D01*
X134683333Y-74084285D01*
X134635714Y-74179523D01*
X134540476Y-74274761D01*
X134397619Y-74322380D01*
X134159523Y-74322380D01*
G04 #@! TO.C,D11*
X152455714Y-74322380D02*
X152455714Y-73322380D01*
X152693809Y-73322380D01*
X152836666Y-73370000D01*
X152931904Y-73465238D01*
X152979523Y-73560476D01*
X153027142Y-73750952D01*
X153027142Y-73893809D01*
X152979523Y-74084285D01*
X152931904Y-74179523D01*
X152836666Y-74274761D01*
X152693809Y-74322380D01*
X152455714Y-74322380D01*
X153979523Y-74322380D02*
X153408095Y-74322380D01*
X153693809Y-74322380D02*
X153693809Y-73322380D01*
X153598571Y-73465238D01*
X153503333Y-73560476D01*
X153408095Y-73608095D01*
X154931904Y-74322380D02*
X154360476Y-74322380D01*
X154646190Y-74322380D02*
X154646190Y-73322380D01*
X154550952Y-73465238D01*
X154455714Y-73560476D01*
X154360476Y-73608095D01*
G04 #@! TO.C,D21*
X147375714Y-74322380D02*
X147375714Y-73322380D01*
X147613809Y-73322380D01*
X147756666Y-73370000D01*
X147851904Y-73465238D01*
X147899523Y-73560476D01*
X147947142Y-73750952D01*
X147947142Y-73893809D01*
X147899523Y-74084285D01*
X147851904Y-74179523D01*
X147756666Y-74274761D01*
X147613809Y-74322380D01*
X147375714Y-74322380D01*
X148328095Y-73417619D02*
X148375714Y-73370000D01*
X148470952Y-73322380D01*
X148709047Y-73322380D01*
X148804285Y-73370000D01*
X148851904Y-73417619D01*
X148899523Y-73512857D01*
X148899523Y-73608095D01*
X148851904Y-73750952D01*
X148280476Y-74322380D01*
X148899523Y-74322380D01*
X149851904Y-74322380D02*
X149280476Y-74322380D01*
X149566190Y-74322380D02*
X149566190Y-73322380D01*
X149470952Y-73465238D01*
X149375714Y-73560476D01*
X149280476Y-73608095D01*
G04 #@! TO.C,D31*
X142295714Y-74322380D02*
X142295714Y-73322380D01*
X142533809Y-73322380D01*
X142676666Y-73370000D01*
X142771904Y-73465238D01*
X142819523Y-73560476D01*
X142867142Y-73750952D01*
X142867142Y-73893809D01*
X142819523Y-74084285D01*
X142771904Y-74179523D01*
X142676666Y-74274761D01*
X142533809Y-74322380D01*
X142295714Y-74322380D01*
X143200476Y-73322380D02*
X143819523Y-73322380D01*
X143486190Y-73703333D01*
X143629047Y-73703333D01*
X143724285Y-73750952D01*
X143771904Y-73798571D01*
X143819523Y-73893809D01*
X143819523Y-74131904D01*
X143771904Y-74227142D01*
X143724285Y-74274761D01*
X143629047Y-74322380D01*
X143343333Y-74322380D01*
X143248095Y-74274761D01*
X143200476Y-74227142D01*
X144771904Y-74322380D02*
X144200476Y-74322380D01*
X144486190Y-74322380D02*
X144486190Y-73322380D01*
X144390952Y-73465238D01*
X144295714Y-73560476D01*
X144200476Y-73608095D01*
G04 #@! TO.C,D41*
X137215714Y-74322380D02*
X137215714Y-73322380D01*
X137453809Y-73322380D01*
X137596666Y-73370000D01*
X137691904Y-73465238D01*
X137739523Y-73560476D01*
X137787142Y-73750952D01*
X137787142Y-73893809D01*
X137739523Y-74084285D01*
X137691904Y-74179523D01*
X137596666Y-74274761D01*
X137453809Y-74322380D01*
X137215714Y-74322380D01*
X138644285Y-73655714D02*
X138644285Y-74322380D01*
X138406190Y-73274761D02*
X138168095Y-73989047D01*
X138787142Y-73989047D01*
X139691904Y-74322380D02*
X139120476Y-74322380D01*
X139406190Y-74322380D02*
X139406190Y-73322380D01*
X139310952Y-73465238D01*
X139215714Y-73560476D01*
X139120476Y-73608095D01*
G04 #@! TO.C,D12*
X124912380Y-88844285D02*
X123912380Y-88844285D01*
X123912380Y-88606190D01*
X123960000Y-88463333D01*
X124055238Y-88368095D01*
X124150476Y-88320476D01*
X124340952Y-88272857D01*
X124483809Y-88272857D01*
X124674285Y-88320476D01*
X124769523Y-88368095D01*
X124864761Y-88463333D01*
X124912380Y-88606190D01*
X124912380Y-88844285D01*
X124912380Y-87320476D02*
X124912380Y-87891904D01*
X124912380Y-87606190D02*
X123912380Y-87606190D01*
X124055238Y-87701428D01*
X124150476Y-87796666D01*
X124198095Y-87891904D01*
X124007619Y-86939523D02*
X123960000Y-86891904D01*
X123912380Y-86796666D01*
X123912380Y-86558571D01*
X123960000Y-86463333D01*
X124007619Y-86415714D01*
X124102857Y-86368095D01*
X124198095Y-86368095D01*
X124340952Y-86415714D01*
X124912380Y-86987142D01*
X124912380Y-86368095D01*
G04 #@! TO.C,D13*
X124912380Y-93924285D02*
X123912380Y-93924285D01*
X123912380Y-93686190D01*
X123960000Y-93543333D01*
X124055238Y-93448095D01*
X124150476Y-93400476D01*
X124340952Y-93352857D01*
X124483809Y-93352857D01*
X124674285Y-93400476D01*
X124769523Y-93448095D01*
X124864761Y-93543333D01*
X124912380Y-93686190D01*
X124912380Y-93924285D01*
X124912380Y-92400476D02*
X124912380Y-92971904D01*
X124912380Y-92686190D02*
X123912380Y-92686190D01*
X124055238Y-92781428D01*
X124150476Y-92876666D01*
X124198095Y-92971904D01*
X123912380Y-92067142D02*
X123912380Y-91448095D01*
X124293333Y-91781428D01*
X124293333Y-91638571D01*
X124340952Y-91543333D01*
X124388571Y-91495714D01*
X124483809Y-91448095D01*
X124721904Y-91448095D01*
X124817142Y-91495714D01*
X124864761Y-91543333D01*
X124912380Y-91638571D01*
X124912380Y-91924285D01*
X124864761Y-92019523D01*
X124817142Y-92067142D01*
G04 #@! TO.C,D22*
X125122380Y-83764285D02*
X124122380Y-83764285D01*
X124122380Y-83526190D01*
X124170000Y-83383333D01*
X124265238Y-83288095D01*
X124360476Y-83240476D01*
X124550952Y-83192857D01*
X124693809Y-83192857D01*
X124884285Y-83240476D01*
X124979523Y-83288095D01*
X125074761Y-83383333D01*
X125122380Y-83526190D01*
X125122380Y-83764285D01*
X124217619Y-82811904D02*
X124170000Y-82764285D01*
X124122380Y-82669047D01*
X124122380Y-82430952D01*
X124170000Y-82335714D01*
X124217619Y-82288095D01*
X124312857Y-82240476D01*
X124408095Y-82240476D01*
X124550952Y-82288095D01*
X125122380Y-82859523D01*
X125122380Y-82240476D01*
X124217619Y-81859523D02*
X124170000Y-81811904D01*
X124122380Y-81716666D01*
X124122380Y-81478571D01*
X124170000Y-81383333D01*
X124217619Y-81335714D01*
X124312857Y-81288095D01*
X124408095Y-81288095D01*
X124550952Y-81335714D01*
X125122380Y-81907142D01*
X125122380Y-81288095D01*
G04 #@! TO.C,D23*
X125122380Y-78684285D02*
X124122380Y-78684285D01*
X124122380Y-78446190D01*
X124170000Y-78303333D01*
X124265238Y-78208095D01*
X124360476Y-78160476D01*
X124550952Y-78112857D01*
X124693809Y-78112857D01*
X124884285Y-78160476D01*
X124979523Y-78208095D01*
X125074761Y-78303333D01*
X125122380Y-78446190D01*
X125122380Y-78684285D01*
X124217619Y-77731904D02*
X124170000Y-77684285D01*
X124122380Y-77589047D01*
X124122380Y-77350952D01*
X124170000Y-77255714D01*
X124217619Y-77208095D01*
X124312857Y-77160476D01*
X124408095Y-77160476D01*
X124550952Y-77208095D01*
X125122380Y-77779523D01*
X125122380Y-77160476D01*
X124122380Y-76827142D02*
X124122380Y-76208095D01*
X124503333Y-76541428D01*
X124503333Y-76398571D01*
X124550952Y-76303333D01*
X124598571Y-76255714D01*
X124693809Y-76208095D01*
X124931904Y-76208095D01*
X125027142Y-76255714D01*
X125074761Y-76303333D01*
X125122380Y-76398571D01*
X125122380Y-76684285D01*
X125074761Y-76779523D01*
X125027142Y-76827142D01*
G04 #@! TO.C,D32*
X162802380Y-83764285D02*
X161802380Y-83764285D01*
X161802380Y-83526190D01*
X161850000Y-83383333D01*
X161945238Y-83288095D01*
X162040476Y-83240476D01*
X162230952Y-83192857D01*
X162373809Y-83192857D01*
X162564285Y-83240476D01*
X162659523Y-83288095D01*
X162754761Y-83383333D01*
X162802380Y-83526190D01*
X162802380Y-83764285D01*
X161802380Y-82859523D02*
X161802380Y-82240476D01*
X162183333Y-82573809D01*
X162183333Y-82430952D01*
X162230952Y-82335714D01*
X162278571Y-82288095D01*
X162373809Y-82240476D01*
X162611904Y-82240476D01*
X162707142Y-82288095D01*
X162754761Y-82335714D01*
X162802380Y-82430952D01*
X162802380Y-82716666D01*
X162754761Y-82811904D01*
X162707142Y-82859523D01*
X161897619Y-81859523D02*
X161850000Y-81811904D01*
X161802380Y-81716666D01*
X161802380Y-81478571D01*
X161850000Y-81383333D01*
X161897619Y-81335714D01*
X161992857Y-81288095D01*
X162088095Y-81288095D01*
X162230952Y-81335714D01*
X162802380Y-81907142D01*
X162802380Y-81288095D01*
G04 #@! TO.C,D33*
X162802380Y-93924285D02*
X161802380Y-93924285D01*
X161802380Y-93686190D01*
X161850000Y-93543333D01*
X161945238Y-93448095D01*
X162040476Y-93400476D01*
X162230952Y-93352857D01*
X162373809Y-93352857D01*
X162564285Y-93400476D01*
X162659523Y-93448095D01*
X162754761Y-93543333D01*
X162802380Y-93686190D01*
X162802380Y-93924285D01*
X161802380Y-93019523D02*
X161802380Y-92400476D01*
X162183333Y-92733809D01*
X162183333Y-92590952D01*
X162230952Y-92495714D01*
X162278571Y-92448095D01*
X162373809Y-92400476D01*
X162611904Y-92400476D01*
X162707142Y-92448095D01*
X162754761Y-92495714D01*
X162802380Y-92590952D01*
X162802380Y-92876666D01*
X162754761Y-92971904D01*
X162707142Y-93019523D01*
X161802380Y-92067142D02*
X161802380Y-91448095D01*
X162183333Y-91781428D01*
X162183333Y-91638571D01*
X162230952Y-91543333D01*
X162278571Y-91495714D01*
X162373809Y-91448095D01*
X162611904Y-91448095D01*
X162707142Y-91495714D01*
X162754761Y-91543333D01*
X162802380Y-91638571D01*
X162802380Y-91924285D01*
X162754761Y-92019523D01*
X162707142Y-92067142D01*
G04 #@! TO.C,D42*
X163012380Y-88844285D02*
X162012380Y-88844285D01*
X162012380Y-88606190D01*
X162060000Y-88463333D01*
X162155238Y-88368095D01*
X162250476Y-88320476D01*
X162440952Y-88272857D01*
X162583809Y-88272857D01*
X162774285Y-88320476D01*
X162869523Y-88368095D01*
X162964761Y-88463333D01*
X163012380Y-88606190D01*
X163012380Y-88844285D01*
X162345714Y-87415714D02*
X163012380Y-87415714D01*
X161964761Y-87653809D02*
X162679047Y-87891904D01*
X162679047Y-87272857D01*
X162107619Y-86939523D02*
X162060000Y-86891904D01*
X162012380Y-86796666D01*
X162012380Y-86558571D01*
X162060000Y-86463333D01*
X162107619Y-86415714D01*
X162202857Y-86368095D01*
X162298095Y-86368095D01*
X162440952Y-86415714D01*
X163012380Y-86987142D01*
X163012380Y-86368095D01*
G04 #@! TO.C,D43*
X163012380Y-78684285D02*
X162012380Y-78684285D01*
X162012380Y-78446190D01*
X162060000Y-78303333D01*
X162155238Y-78208095D01*
X162250476Y-78160476D01*
X162440952Y-78112857D01*
X162583809Y-78112857D01*
X162774285Y-78160476D01*
X162869523Y-78208095D01*
X162964761Y-78303333D01*
X163012380Y-78446190D01*
X163012380Y-78684285D01*
X162345714Y-77255714D02*
X163012380Y-77255714D01*
X161964761Y-77493809D02*
X162679047Y-77731904D01*
X162679047Y-77112857D01*
X162012380Y-76827142D02*
X162012380Y-76208095D01*
X162393333Y-76541428D01*
X162393333Y-76398571D01*
X162440952Y-76303333D01*
X162488571Y-76255714D01*
X162583809Y-76208095D01*
X162821904Y-76208095D01*
X162917142Y-76255714D01*
X162964761Y-76303333D01*
X163012380Y-76398571D01*
X163012380Y-76684285D01*
X162964761Y-76779523D01*
X162917142Y-76827142D01*
G04 #@! TD*
M02*
