(module LOGO (layer F.Cu)
  (at 0 0)
 (fp_text reference "G***" (at 0 0) (layer F.SilkS) hide
  (effects (font (thickness 0.3)))
  )
  (fp_text value "LOGO" (at 0.75 0) (layer F.SilkS) hide
  (effects (font (thickness 0.3)))
  )
  (fp_poly (pts (xy 1.921933 1.460500) (xy -1.921933 1.460500) (xy -1.921933 0.818345) (xy -1.887609 0.818345) (xy -1.887582 0.889880) (xy -1.887516 0.955372) (xy -1.887407 1.015088) (xy -1.887251 1.069299)
     (xy -1.887042 1.118273) (xy -1.886775 1.162279) (xy -1.886447 1.201587) (xy -1.886052 1.236465) (xy -1.885585 1.267184) (xy -1.885042 1.294011) (xy -1.884417 1.317217) (xy -1.883707 1.337070)
     (xy -1.882905 1.353840) (xy -1.882009 1.367795) (xy -1.881011 1.379205) (xy -1.879909 1.388339) (xy -1.878697 1.395467) (xy -1.877370 1.400856) (xy -1.875924 1.404778) (xy -1.874354 1.407499)
     (xy -1.872655 1.409291) (xy -1.870822 1.410422) (xy -1.868850 1.411160) (xy -1.866735 1.411776) (xy -1.864472 1.412539) (xy -1.862056 1.413717) (xy -1.861863 1.413833) (xy -1.860695 1.414522)
     (xy -1.859354 1.415172) (xy -1.857604 1.415786) (xy -1.855210 1.416363) (xy -1.851937 1.416904) (xy -1.847550 1.417412) (xy -1.841812 1.417886) (xy -1.834488 1.418327) (xy -1.825344 1.418737)
     (xy -1.814143 1.419117) (xy -1.800650 1.419467) (xy -1.784631 1.419788) (xy -1.765848 1.420081) (xy -1.744068 1.420348) (xy -1.719054 1.420589) (xy -1.690572 1.420805) (xy -1.658385 1.420997)
     (xy -1.622259 1.421166) (xy -1.581957 1.421313) (xy -1.537245 1.421439) (xy -1.487887 1.421544) (xy -1.433648 1.421631) (xy -1.374293 1.421699) (xy -1.309585 1.421750) (xy -1.239290 1.421785)
     (xy -1.163172 1.421804) (xy -1.080995 1.421808) (xy -0.992525 1.421799) (xy -0.897526 1.421778) (xy -0.795762 1.421745) (xy -0.686998 1.421701) (xy -0.570999 1.421647) (xy -0.447530 1.421585)
     (xy -0.316354 1.421515) (xy -0.177236 1.421437) (xy -0.029942 1.421354) (xy 0.005210 1.421334) (xy 1.858270 1.420284) (xy 1.885950 1.392604) (xy 1.887003 0.005211) (xy 1.887100 -0.123405)
     (xy 1.887188 -0.243826) (xy 1.887265 -0.356325) (xy 1.887330 -0.461175) (xy 1.887383 -0.558647) (xy 1.887420 -0.649015) (xy 1.887442 -0.732550) (xy 1.887447 -0.809525) (xy 1.887434 -0.880212)
     (xy 1.887400 -0.944884) (xy 1.887346 -1.003813) (xy 1.887268 -1.057271) (xy 1.887167 -1.105531) (xy 1.887041 -1.148865) (xy 1.886888 -1.187545) (xy 1.886707 -1.221844) (xy 1.886497 -1.252035)
     (xy 1.886257 -1.278388) (xy 1.885984 -1.301178) (xy 1.885678 -1.320676) (xy 1.885338 -1.337154) (xy 1.884962 -1.350886) (xy 1.884548 -1.362143) (xy 1.884095 -1.371197) (xy 1.883603 -1.378322)
     (xy 1.883069 -1.383789) (xy 1.882493 -1.387871) (xy 1.881872 -1.390840) (xy 1.881207 -1.392968) (xy 1.880494 -1.394528) (xy 1.880095 -1.395222) (xy 1.870661 -1.406004) (xy 1.858372 -1.414765)
     (xy 1.857235 -1.415330) (xy 1.855640 -1.415903) (xy 1.853183 -1.416445) (xy 1.849629 -1.416955) (xy 1.844744 -1.417436) (xy 1.838293 -1.417888) (xy 1.830043 -1.418311) (xy 1.819758 -1.418708)
     (xy 1.807206 -1.419078) (xy 1.792151 -1.419423) (xy 1.774359 -1.419743) (xy 1.753597 -1.420040) (xy 1.729629 -1.420313) (xy 1.702221 -1.420565) (xy 1.671140 -1.420797) (xy 1.636150 -1.421008)
     (xy 1.597019 -1.421199) (xy 1.553510 -1.421373) (xy 1.505391 -1.421529) (xy 1.452427 -1.421669) (xy 1.394383 -1.421793) (xy 1.331026 -1.421903) (xy 1.262120 -1.421998) (xy 1.187433 -1.422081)
     (xy 1.106729 -1.422152) (xy 1.019774 -1.422211) (xy 0.926334 -1.422260) (xy 0.826175 -1.422300) (xy 0.719063 -1.422332) (xy 0.604762 -1.422356) (xy 0.483040 -1.422373) (xy 0.353661 -1.422384)
     (xy 0.216392 -1.422391) (xy 0.070998 -1.422393) (xy 0.001477 -1.422393) (xy -0.147502 -1.422392) (xy -0.288248 -1.422387) (xy -0.420999 -1.422379) (xy -0.545989 -1.422365) (xy -0.663453 -1.422346)
     (xy -0.773627 -1.422321) (xy -0.876745 -1.422288) (xy -0.973044 -1.422246) (xy -1.062758 -1.422195) (xy -1.146122 -1.422133) (xy -1.223373 -1.422060) (xy -1.294744 -1.421974) (xy -1.360472 -1.421876)
     (xy -1.420791 -1.421763) (xy -1.475937 -1.421635) (xy -1.526146 -1.421491) (xy -1.571651 -1.421330) (xy -1.612690 -1.421152) (xy -1.649496 -1.420954) (xy -1.682305 -1.420736) (xy -1.711352 -1.420498)
     (xy -1.736873 -1.420238) (xy -1.759103 -1.419955) (xy -1.778277 -1.419649) (xy -1.794631 -1.419319) (xy -1.808399 -1.418962) (xy -1.819817 -1.418580) (xy -1.829120 -1.418170) (xy -1.836543 -1.417732)
     (xy -1.842322 -1.417264) (xy -1.846691 -1.416767) (xy -1.849887 -1.416238) (xy -1.852144 -1.415678) (xy -1.853698 -1.415084) (xy -1.853899 -1.414985) (xy -1.866298 -1.406600) (xy -1.876676 -1.396303)
     (xy -1.877183 -1.395631) (xy -1.885950 -1.383679) (xy -1.887028 -0.003833) (xy -1.887134 0.125747) (xy -1.887240 0.247128) (xy -1.887341 0.360582) (xy -1.887433 0.466376) (xy -1.887510 0.564780)
     (xy -1.887569 0.656064) (xy -1.887603 0.740495) (xy -1.887609 0.818345) (xy -1.921933 0.818345) (xy -1.921933 -1.456266) (xy 1.921933 -1.456266) (xy 1.921933 1.460500) )(layer F.SilkS) (width  0.010000)
  )
  (fp_poly (pts (xy -1.535642 0.774831) (xy -1.489014 0.776025) (xy -1.450125 0.779447) (xy -1.418516 0.785204) (xy -1.393728 0.793408) (xy -1.375301 0.804169) (xy -1.363869 0.816001) (xy -1.352673 0.838350)
     (xy -1.348012 0.863217) (xy -1.349741 0.888463) (xy -1.357718 0.911948) (xy -1.371567 0.931300) (xy -1.387356 0.947089) (xy -1.372680 0.958799) (xy -1.356223 0.977001) (xy -1.346004 0.999245)
     (xy -1.342027 1.023838) (xy -1.344300 1.049088) (xy -1.352830 1.073305) (xy -1.367623 1.094796) (xy -1.372142 1.099394) (xy -1.382186 1.108318) (xy -1.392008 1.115188) (xy -1.402912 1.120298)
     (xy -1.416204 1.123941) (xy -1.433192 1.126411) (xy -1.455179 1.128000) (xy -1.483473 1.129004) (xy -1.506009 1.129484) (xy -1.591733 1.131053) (xy -1.591733 1.021645) (xy -1.524000 1.021645)
     (xy -1.523765 1.041012) (xy -1.523126 1.057160) (xy -1.522184 1.068270) (xy -1.521178 1.072445) (xy -1.515109 1.074237) (xy -1.503106 1.075099) (xy -1.487642 1.075086) (xy -1.471191 1.074256)
     (xy -1.456228 1.072663) (xy -1.446522 1.070750) (xy -1.430659 1.062244) (xy -1.419452 1.047842) (xy -1.414228 1.029434) (xy -1.414012 1.024467) (xy -1.416763 1.005220) (xy -1.425212 0.990857)
     (xy -1.439862 0.981038) (xy -1.461215 0.975424) (xy -1.489075 0.973673) (xy -1.524000 0.973667) (xy -1.524000 1.021645) (xy -1.591733 1.021645) (xy -1.591733 0.833967) (xy -1.524000 0.833967)
     (xy -1.524000 0.919451) (xy -1.484117 0.917984) (xy -1.464821 0.917043) (xy -1.451898 0.915602) (xy -1.443255 0.913179) (xy -1.436798 0.909290) (xy -1.433317 0.906254) (xy -1.424993 0.895031)
     (xy -1.422410 0.880718) (xy -1.422400 0.879517) (xy -1.424496 0.861759) (xy -1.431328 0.848876) (xy -1.443713 0.840318) (xy -1.462467 0.835532) (xy -1.488406 0.833970) (xy -1.489923 0.833967)
     (xy -1.524000 0.833967) (xy -1.591733 0.833967) (xy -1.591733 0.774700) (xy -1.535642 0.774831) )(layer F.SilkS) (width  0.010000)
  )
  (fp_poly (pts (xy -1.096434 0.838200) (xy -1.248833 0.838200) (xy -1.248833 0.918634) (xy -1.121833 0.918634) (xy -1.121833 0.982134) (xy -1.249130 0.982134) (xy -1.247923 1.025525) (xy -1.246717 1.068917)
     (xy -1.167342 1.070069) (xy -1.087967 1.071220) (xy -1.087967 1.130300) (xy -1.316567 1.130300) (xy -1.316567 0.774700) (xy -1.096434 0.774700) (xy -1.096434 0.838200) )(layer F.SilkS) (width  0.010000)
  )
  (fp_poly (pts (xy -0.976842 0.775540) (xy -0.945908 0.776283) (xy -0.922179 0.777190) (xy -0.904390 0.778376) (xy -0.891280 0.779951) (xy -0.881585 0.782027) (xy -0.874184 0.784656) (xy -0.851762 0.798328)
     (xy -0.832641 0.817317) (xy -0.820843 0.836084) (xy -0.814829 0.856652) (xy -0.813073 0.880726) (xy -0.815581 0.904489) (xy -0.820695 0.920786) (xy -0.827400 0.931942) (xy -0.837087 0.943995)
     (xy -0.847779 0.954908) (xy -0.857502 0.962642) (xy -0.863747 0.965200) (xy -0.866685 0.966389) (xy -0.867277 0.970629) (xy -0.865227 0.978932) (xy -0.860239 0.992309) (xy -0.852018 1.011772)
     (xy -0.846356 1.024658) (xy -0.836634 1.046697) (xy -0.826793 1.069156) (xy -0.818090 1.089159) (xy -0.812611 1.101882) (xy -0.800344 1.130615) (xy -0.838565 1.129399) (xy -0.876786 1.128184)
     (xy -0.907876 1.056217) (xy -0.938965 0.984250) (xy -0.992717 0.984250) (xy -0.995033 1.130300) (xy -1.062567 1.130300) (xy -1.062567 0.922867) (xy -0.994834 0.922867) (xy -0.963613 0.922867)
     (xy -0.946106 0.922507) (xy -0.930173 0.921563) (xy -0.919253 0.920239) (xy -0.919223 0.920233) (xy -0.902200 0.913187) (xy -0.890502 0.901089) (xy -0.884801 0.885819) (xy -0.885765 0.869257)
     (xy -0.894066 0.853284) (xy -0.894976 0.852195) (xy -0.899961 0.846888) (xy -0.905229 0.843383) (xy -0.912648 0.841228) (xy -0.924082 0.839971) (xy -0.941399 0.839161) (xy -0.950009 0.838873)
     (xy -0.994834 0.837429) (xy -0.994834 0.922867) (xy -1.062567 0.922867) (xy -1.062567 0.773831) (xy -0.976842 0.775540) )(layer F.SilkS) (width  0.010000)
  )
  (fp_poly (pts (xy -0.700617 0.919696) (xy -0.647832 0.847198) (xy -0.595046 0.774700) (xy -0.555304 0.774700) (xy -0.536347 0.774933) (xy -0.524588 0.775760) (xy -0.518764 0.777375) (xy -0.517617 0.779971)
     (xy -0.517775 0.780469) (xy -0.520950 0.785515) (xy -0.528462 0.796107) (xy -0.539467 0.811096) (xy -0.553119 0.829331) (xy -0.568575 0.849663) (xy -0.569170 0.850441) (xy -0.618352 0.914644)
     (xy -0.571148 1.000247) (xy -0.556813 1.026222) (xy -0.543081 1.051068) (xy -0.530738 1.073362) (xy -0.520573 1.091682) (xy -0.513374 1.104605) (xy -0.511428 1.108075) (xy -0.498912 1.130300)
     (xy -0.540498 1.130240) (xy -0.582083 1.130180) (xy -0.624152 1.053987) (xy -0.636874 1.031321) (xy -0.648314 1.011650) (xy -0.657832 0.996016) (xy -0.664790 0.985461) (xy -0.668547 0.981026)
     (xy -0.668937 0.981022) (xy -0.672892 0.985884) (xy -0.680307 0.995117) (xy -0.687194 1.003736) (xy -0.702733 1.023222) (xy -0.702733 1.130300) (xy -0.774700 1.130300) (xy -0.774700 0.774700)
     (xy -0.702933 0.774700) (xy -0.700617 0.919696) )(layer F.SilkS) (width  0.010000)
  )
  (fp_poly (pts (xy -0.262467 0.838200) (xy -0.410633 0.838200) (xy -0.410633 0.918634) (xy -0.287867 0.918634) (xy -0.287867 0.982134) (xy -0.410633 0.982134) (xy -0.410633 1.071034) (xy -0.254000 1.071034)
     (xy -0.254000 1.130300) (xy -0.482600 1.130300) (xy -0.482600 0.774700) (xy -0.262467 0.774700) (xy -0.262467 0.838200) )(layer F.SilkS) (width  0.010000)
  )
  (fp_poly (pts (xy -0.147163 0.921809) (xy -0.146050 1.068917) (xy 0.000000 1.071233) (xy 0.000000 1.130300) (xy -0.220134 1.130300) (xy -0.220134 0.774700) (xy -0.148277 0.774700) (xy -0.147163 0.921809) )(layer F.SilkS) (width  0.010000)
  )
  (fp_poly (pts (xy 0.254000 0.838200) (xy 0.105833 0.838200) (xy 0.105833 0.918634) (xy 0.228600 0.918634) (xy 0.228600 0.982134) (xy 0.105833 0.982134) (xy 0.105833 1.071034) (xy 0.262467 1.071034)
     (xy 0.262467 1.130300) (xy 0.033866 1.130300) (xy 0.033866 0.774700) (xy 0.254000 0.774700) (xy 0.254000 0.838200) )(layer F.SilkS) (width  0.010000)
  )
  (fp_poly (pts (xy 0.389589 0.849041) (xy 0.400696 0.872133) (xy 0.410717 0.892515) (xy 0.419041 0.908978) (xy 0.425055 0.920314) (xy 0.428149 0.925315) (xy 0.428275 0.925422) (xy 0.431073 0.922444)
     (xy 0.436971 0.912955) (xy 0.445358 0.898050) (xy 0.455621 0.878826) (xy 0.467146 0.856380) (xy 0.469810 0.851080) (xy 0.508044 0.774700) (xy 0.544458 0.774700) (xy 0.562120 0.774898)
     (xy 0.572758 0.775676) (xy 0.577807 0.777316) (xy 0.578706 0.780095) (xy 0.578344 0.781288) (xy 0.575674 0.786630) (xy 0.569440 0.798319) (xy 0.560211 0.815313) (xy 0.548557 0.836568)
     (xy 0.535047 0.861042) (xy 0.520741 0.886809) (xy 0.465667 0.985742) (xy 0.465667 1.130300) (xy 0.393700 1.130300) (xy 0.393700 0.987801) (xy 0.338544 0.887628) (xy 0.323835 0.860844)
     (xy 0.310422 0.836289) (xy 0.298866 0.814997) (xy 0.289727 0.798007) (xy 0.283565 0.786355) (xy 0.280941 0.781078) (xy 0.280950 0.778009) (xy 0.284769 0.776094) (xy 0.293793 0.775081)
     (xy 0.309417 0.774719) (xy 0.316348 0.774700) (xy 0.354202 0.774700) (xy 0.389589 0.849041) )(layer F.SilkS) (width  0.010000)
  )
  (fp_poly (pts (xy 0.813803 0.921809) (xy 0.814917 1.068917) (xy 0.960967 1.071233) (xy 0.960967 1.130300) (xy 0.745067 1.130300) (xy 0.745067 0.774700) (xy 0.812690 0.774700) (xy 0.813803 0.921809) )(layer F.SilkS) (width  0.010000)
  )
  (fp_poly (pts (xy 1.185106 0.790575) (xy 1.187203 0.798099) (xy 1.191335 0.812785) (xy 1.197226 0.833654) (xy 1.204598 0.859723) (xy 1.213173 0.890012) (xy 1.222674 0.923539) (xy 1.232823 0.959324)
     (xy 1.235391 0.968375) (xy 1.281344 1.130300) (xy 1.208270 1.130300) (xy 1.200785 1.101725) (xy 1.196252 1.084416) (xy 1.191937 1.067926) (xy 1.189153 1.057275) (xy 1.185007 1.041400)
     (xy 1.080954 1.041400) (xy 1.075900 1.063297) (xy 1.071507 1.081132) (xy 1.066329 1.100547) (xy 1.064289 1.107747) (xy 1.057732 1.130300) (xy 1.022049 1.130300) (xy 1.005863 1.130005)
     (xy 0.993509 1.129218) (xy 0.986940 1.128086) (xy 0.986367 1.127604) (xy 0.987477 1.123084) (xy 0.990650 1.111269) (xy 0.995649 1.093015) (xy 1.002237 1.069174) (xy 1.010179 1.040602)
     (xy 1.019238 1.008153) (xy 1.026230 0.983192) (xy 1.096549 0.983192) (xy 1.100403 0.984626) (xy 1.110786 0.985723) (xy 1.125765 0.986312) (xy 1.132417 0.986367) (xy 1.150289 0.986115)
     (xy 1.161227 0.985175) (xy 1.166754 0.983267) (xy 1.168391 0.980112) (xy 1.168400 0.979769) (xy 1.167400 0.973494) (xy 1.164669 0.960696) (xy 1.160607 0.943049) (xy 1.155619 0.922223)
     (xy 1.150104 0.899891) (xy 1.144467 0.877724) (xy 1.139107 0.857394) (xy 1.137919 0.853017) (xy 1.136200 0.847164) (xy 1.134630 0.844174) (xy 1.132850 0.844910) (xy 1.130498 0.850233)
     (xy 1.127217 0.861007) (xy 1.122647 0.878093) (xy 1.116427 0.902355) (xy 1.114978 0.908050) (xy 1.109024 0.931597) (xy 1.103866 0.952279) (xy 1.099843 0.968710) (xy 1.097298 0.979500)
     (xy 1.096549 0.983192) (xy 1.026230 0.983192) (xy 1.029176 0.972680) (xy 1.035050 0.951772) (xy 1.045374 0.915009) (xy 1.054952 0.880819) (xy 1.063547 0.850050) (xy 1.070923 0.823552)
     (xy 1.076844 0.802175) (xy 1.081073 0.786769) (xy 1.083374 0.778183) (xy 1.083733 0.776668) (xy 1.087687 0.775892) (xy 1.098434 0.775260) (xy 1.114299 0.774841) (xy 1.132253 0.774700)
     (xy 1.180773 0.774700) (xy 1.185106 0.790575) )(layer F.SilkS) (width  0.010000)
  )
  (fp_poly (pts (xy 1.368425 0.774831) (xy 1.413473 0.775878) (xy 1.450917 0.778917) (xy 1.481422 0.784135) (xy 1.505657 0.791720) (xy 1.524289 0.801861) (xy 1.537984 0.814745) (xy 1.544425 0.824441)
     (xy 1.552366 0.845805) (xy 1.554945 0.869232) (xy 1.552509 0.892602) (xy 1.545401 0.913797) (xy 1.533968 0.930698) (xy 1.526010 0.937364) (xy 1.514833 0.944688) (xy 1.532026 0.960560)
     (xy 1.549386 0.980906) (xy 1.559116 1.003570) (xy 1.562007 1.029623) (xy 1.557989 1.057642) (xy 1.546302 1.082176) (xy 1.530264 1.100174) (xy 1.519809 1.108930) (xy 1.510050 1.115639)
     (xy 1.499639 1.120598) (xy 1.487229 1.124107) (xy 1.471472 1.126465) (xy 1.451023 1.127970) (xy 1.424533 1.128921) (xy 1.398058 1.129484) (xy 1.312333 1.131053) (xy 1.312333 0.973667)
     (xy 1.380066 0.973667) (xy 1.380066 1.021645) (xy 1.380332 1.041071) (xy 1.381052 1.057336) (xy 1.382114 1.068599) (xy 1.383241 1.072913) (xy 1.389113 1.074465) (xy 1.401022 1.074927)
     (xy 1.416630 1.074461) (xy 1.433601 1.073227) (xy 1.449599 1.071387) (xy 1.462285 1.069101) (xy 1.468525 1.067037) (xy 1.477690 1.058314) (xy 1.485264 1.044456) (xy 1.489637 1.028793)
     (xy 1.490133 1.022276) (xy 1.486390 1.004814) (xy 1.476443 0.989593) (xy 1.462471 0.979683) (xy 1.450071 0.976473) (xy 1.432242 0.974346) (xy 1.414069 0.973667) (xy 1.380066 0.973667)
     (xy 1.312333 0.973667) (xy 1.312333 0.833967) (xy 1.380066 0.833967) (xy 1.380066 0.919451) (xy 1.420655 0.917984) (xy 1.439673 0.917146) (xy 1.452236 0.915939) (xy 1.460356 0.913832)
     (xy 1.466043 0.910298) (xy 1.471308 0.904810) (xy 1.471455 0.904639) (xy 1.479554 0.889370) (xy 1.481640 0.871549) (xy 1.477297 0.854885) (xy 1.477092 0.854497) (xy 1.467080 0.844545)
     (xy 1.449704 0.837775) (xy 1.425513 0.834362) (xy 1.411952 0.833967) (xy 1.380066 0.833967) (xy 1.312333 0.833967) (xy 1.312333 0.774700) (xy 1.368425 0.774831) )(layer F.SilkS) (width  0.010000)
  )
  (fp_poly (pts (xy -0.491875 -0.877766) (xy -0.431544 -0.875960) (xy -0.376005 -0.872653) (xy -0.323455 -0.867641) (xy -0.272093 -0.860720) (xy -0.220117 -0.851685) (xy -0.165724 -0.840332) (xy -0.111569 -0.827558)
     (xy -0.009220 -0.798524) (xy 0.093862 -0.761890) (xy 0.196369 -0.718272) (xy 0.296993 -0.668286) (xy 0.394426 -0.612547) (xy 0.487359 -0.551674) (xy 0.512820 -0.533483) (xy 0.543986 -0.510011)
     (xy 0.576194 -0.484375) (xy 0.607985 -0.457837) (xy 0.637897 -0.431659) (xy 0.664470 -0.407106) (xy 0.686243 -0.385439) (xy 0.694852 -0.376106) (xy 0.720538 -0.347133) (xy 0.897467 -0.347133)
     (xy 0.897467 0.613833) (xy 0.829772 0.613833) (xy 0.828694 0.164042) (xy 0.827617 -0.285750) (xy 0.745615 -0.286901) (xy 0.663614 -0.288053) (xy 0.622848 -0.325560) (xy 0.546691 -0.391574)
     (xy 0.464164 -0.455641) (xy 0.376927 -0.516693) (xy 0.286639 -0.573661) (xy 0.194959 -0.625477) (xy 0.103547 -0.671071) (xy 0.048683 -0.695348) (xy -0.060332 -0.736566) (xy -0.171998 -0.769775)
     (xy -0.286205 -0.794970) (xy -0.402842 -0.812145) (xy -0.521800 -0.821296) (xy -0.642968 -0.822417) (xy -0.766236 -0.815503) (xy -0.891493 -0.800549) (xy -1.018629 -0.777550) (xy -1.130300 -0.751092)
     (xy -1.167822 -0.740682) (xy -1.208951 -0.728297) (xy -1.252238 -0.714447) (xy -1.296233 -0.699646) (xy -1.339486 -0.684406) (xy -1.380549 -0.669238) (xy -1.417971 -0.654655) (xy -1.450304 -0.641170)
     (xy -1.476097 -0.629295) (xy -1.478920 -0.627883) (xy -1.489667 -0.622868) (xy -1.496139 -0.620688) (xy -1.497083 -0.621330) (xy -1.492283 -0.624831) (xy -1.480879 -0.631314) (xy -1.463970 -0.640245)
     (xy -1.442656 -0.651090) (xy -1.418034 -0.663316) (xy -1.391204 -0.676387) (xy -1.363264 -0.689771) (xy -1.335313 -0.702934) (xy -1.308450 -0.715340) (xy -1.283774 -0.726458) (xy -1.262383 -0.735753)
     (xy -1.256680 -0.738143) (xy -1.185047 -0.766418) (xy -1.113433 -0.791939) (xy -1.043555 -0.814162) (xy -0.977129 -0.832538) (xy -0.916183 -0.846461) (xy -0.898196 -0.849763) (xy -0.874011 -0.853779)
     (xy -0.845834 -0.858163) (xy -0.815867 -0.862574) (xy -0.787066 -0.866566) (xy -0.762326 -0.869798) (xy -0.740715 -0.872370) (xy -0.720761 -0.874360) (xy -0.700994 -0.875842) (xy -0.679941 -0.876892)
     (xy -0.656131 -0.877585) (xy -0.628092 -0.877997) (xy -0.594352 -0.878204) (xy -0.558800 -0.878276) (xy -0.491875 -0.877766) )(layer F.SilkS) (width  0.010000)
  )
  (fp_poly (pts (xy 1.141113 -0.537633) (xy 1.142328 -0.532697) (xy 1.143420 -0.527448) (xy 1.144395 -0.521421) (xy 1.145263 -0.514152) (xy 1.146029 -0.505176) (xy 1.146703 -0.494028) (xy 1.147292 -0.480245)
     (xy 1.147804 -0.463361) (xy 1.148246 -0.442912) (xy 1.148626 -0.418434) (xy 1.148952 -0.389461) (xy 1.149232 -0.355530) (xy 1.149474 -0.316176) (xy 1.149685 -0.270934) (xy 1.149873 -0.219340)
     (xy 1.150046 -0.160930) (xy 1.150212 -0.095238) (xy 1.150378 -0.021801) (xy 1.150473 0.022225) (xy 1.151595 0.550333) (xy 1.117442 0.550333) (xy 1.118743 0.013759) (xy 1.118947 -0.066017)
     (xy 1.119155 -0.137762) (xy 1.119374 -0.201916) (xy 1.119609 -0.258913) (xy 1.119866 -0.309192) (xy 1.120153 -0.353189) (xy 1.120473 -0.391342) (xy 1.120834 -0.424087) (xy 1.121242 -0.451862)
     (xy 1.121702 -0.475104) (xy 1.122221 -0.494249) (xy 1.122805 -0.509734) (xy 1.123459 -0.521997) (xy 1.124190 -0.531475) (xy 1.125004 -0.538605) (xy 1.125906 -0.543823) (xy 1.126460 -0.546100)
     (xy 1.132875 -0.569383) (xy 1.141113 -0.537633) )(layer F.SilkS) (width  0.010000)
  )
  (fp_poly (pts (xy 1.505640 -0.531410) (xy 1.519766 -0.489274) (xy 1.519766 0.550333) (xy 1.464733 0.550333) (xy 1.464733 -0.493162) (xy 1.478123 -0.533355) (xy 1.491513 -0.573547) (xy 1.505640 -0.531410) )(layer F.SilkS) (width  0.010000)
  )
  (fp_poly (pts (xy -0.740833 -0.196721) (xy -0.722149 -0.194260) (xy -0.703818 -0.191145) (xy -0.687847 -0.187799) (xy -0.676246 -0.184641) (xy -0.671022 -0.182094) (xy -0.671010 -0.182076) (xy -0.674299 -0.180393)
     (xy -0.684498 -0.177659) (xy -0.700166 -0.174210) (xy -0.719859 -0.170379) (xy -0.727295 -0.169035) (xy -0.785283 -0.158750) (xy -0.790177 -0.114300) (xy -0.792442 -0.089133) (xy -0.794253 -0.060432)
     (xy -0.795320 -0.033128) (xy -0.795469 -0.024341) (xy -0.795750 -0.005860) (xy -0.796203 0.009012) (xy -0.796761 0.018545) (xy -0.797243 0.021167) (xy -0.802049 0.021871) (xy -0.813222 0.023750)
     (xy -0.828801 0.026456) (xy -0.846823 0.029639) (xy -0.865328 0.032950) (xy -0.882354 0.036041) (xy -0.895939 0.038560) (xy -0.904123 0.040161) (xy -0.904875 0.040325) (xy -0.909652 0.040991)
     (xy -0.912487 0.039205) (xy -0.913889 0.033338) (xy -0.914362 0.021759) (xy -0.914413 0.009606) (xy -0.914042 -0.007696) (xy -0.913025 -0.030462) (xy -0.911516 -0.055729) (xy -0.909680 -0.080433)
     (xy -0.907717 -0.103401) (xy -0.905996 -0.119616) (xy -0.904060 -0.130764) (xy -0.901457 -0.138530) (xy -0.897732 -0.144600) (xy -0.892431 -0.150658) (xy -0.890093 -0.153115) (xy -0.870253 -0.168771)
     (xy -0.844308 -0.181645) (xy -0.814337 -0.191131) (xy -0.782417 -0.196621) (xy -0.750627 -0.197507) (xy -0.740833 -0.196721) )(layer F.SilkS) (width  0.010000)
  )
  (fp_poly (pts (xy -1.432984 -0.196573) (xy -1.404090 -0.196084) (xy -1.382415 -0.194803) (xy -1.366737 -0.192621) (xy -1.356894 -0.189858) (xy -1.340071 -0.183374) (xy -1.380177 -0.176233) (xy -1.400243 -0.172685)
     (xy -1.419529 -0.169315) (xy -1.434899 -0.166671) (xy -1.439334 -0.165924) (xy -1.451091 -0.163508) (xy -1.457113 -0.159653) (xy -1.460043 -0.151713) (xy -1.461428 -0.143819) (xy -1.462635 -0.133140)
     (xy -1.463997 -0.115918) (xy -1.465387 -0.094074) (xy -1.466677 -0.069528) (xy -1.467367 -0.053893) (xy -1.468483 -0.027839) (xy -1.469509 -0.009025) (xy -1.470642 0.003774) (xy -1.472080 0.011778)
     (xy -1.474020 0.016211) (xy -1.476658 0.018296) (xy -1.479140 0.019038) (xy -1.488438 0.020921) (xy -1.502819 0.023666) (xy -1.520293 0.026913) (xy -1.538868 0.030299) (xy -1.556553 0.033466)
     (xy -1.571358 0.036051) (xy -1.581291 0.037695) (xy -1.584325 0.038094) (xy -1.585672 0.034166) (xy -1.586732 0.023588) (xy -1.587367 0.008173) (xy -1.587486 -0.003175) (xy -1.587052 -0.025814)
     (xy -1.585901 -0.052684) (xy -1.584232 -0.079598) (xy -1.583147 -0.093133) (xy -1.578822 -0.141816) (xy -1.559752 -0.159551) (xy -1.544360 -0.171531) (xy -1.526156 -0.182501) (xy -1.516466 -0.187045)
     (xy -1.505629 -0.191041) (xy -1.495153 -0.193770) (xy -1.483078 -0.195456) (xy -1.467445 -0.196322) (xy -1.446293 -0.196592) (xy -1.432984 -0.196573) )(layer F.SilkS) (width  0.010000)
  )
  (fp_poly (pts (xy 0.613833 -0.197692) (xy 0.634791 -0.196109) (xy 0.654778 -0.193771) (xy 0.670890 -0.191054) (xy 0.677333 -0.189447) (xy 0.696383 -0.183544) (xy 0.643467 -0.173965) (xy 0.618536 -0.169457)
     (xy 0.600682 -0.166041) (xy 0.588669 -0.163200) (xy 0.581262 -0.160415) (xy 0.577224 -0.157169) (xy 0.575321 -0.152943) (xy 0.574317 -0.147220) (xy 0.573957 -0.144815) (xy 0.571600 -0.126839)
     (xy 0.569166 -0.103382) (xy 0.566875 -0.077180) (xy 0.564944 -0.050968) (xy 0.563592 -0.027480) (xy 0.563040 -0.009451) (xy 0.563037 -0.008374) (xy 0.563033 0.019235) (xy 0.506942 0.028749)
     (xy 0.486053 0.032248) (xy 0.468204 0.035156) (xy 0.455035 0.037210) (xy 0.448188 0.038150) (xy 0.447675 0.038182) (xy 0.445727 0.034356) (xy 0.444584 0.024832) (xy 0.444462 0.020109)
     (xy 0.444757 0.009812) (xy 0.445595 -0.007053) (xy 0.446869 -0.028614) (xy 0.448470 -0.052998) (xy 0.449630 -0.069400) (xy 0.451581 -0.095574) (xy 0.453235 -0.114694) (xy 0.454880 -0.128153)
     (xy 0.456806 -0.137344) (xy 0.459301 -0.143659) (xy 0.462653 -0.148491) (xy 0.466956 -0.153038) (xy 0.492993 -0.173592) (xy 0.523907 -0.187884) (xy 0.560064 -0.196026) (xy 0.601833 -0.198129)
     (xy 0.613833 -0.197692) )(layer F.SilkS) (width  0.010000)
  )
  (fp_poly (pts (xy -1.069848 -0.200532) (xy -1.044955 -0.197231) (xy -1.028700 -0.193394) (xy -1.020093 -0.190479) (xy -1.015669 -0.188063) (xy -1.016159 -0.185818) (xy -1.022294 -0.183418) (xy -1.034804 -0.180535)
     (xy -1.054422 -0.176841) (xy -1.072995 -0.173559) (xy -1.092509 -0.170089) (xy -1.108630 -0.167110) (xy -1.119730 -0.164931) (xy -1.124182 -0.163861) (xy -1.124200 -0.163844) (xy -1.125433 -0.158297)
     (xy -1.126948 -0.146043) (xy -1.128611 -0.128830) (xy -1.130291 -0.108407) (xy -1.131855 -0.086524) (xy -1.133171 -0.064930) (xy -1.134106 -0.045373) (xy -1.134528 -0.029603) (xy -1.134540 -0.027210)
     (xy -1.134533 0.015430) (xy -1.188508 0.024692) (xy -1.209225 0.028177) (xy -1.227123 0.031056) (xy -1.240440 0.033054) (xy -1.247416 0.033900) (xy -1.247775 0.033911) (xy -1.250494 0.031173)
     (xy -1.252182 0.022382) (xy -1.252970 0.006591) (xy -1.253067 -0.004626) (xy -1.252635 -0.025334) (xy -1.251468 -0.050760) (xy -1.249762 -0.077206) (xy -1.248329 -0.094584) (xy -1.246137 -0.116734)
     (xy -1.244070 -0.132195) (xy -1.241689 -0.142723) (xy -1.238554 -0.150078) (xy -1.234225 -0.156016) (xy -1.232495 -0.157927) (xy -1.218369 -0.169396) (xy -1.198553 -0.180725) (xy -1.175749 -0.190630)
     (xy -1.152655 -0.197829) (xy -1.145117 -0.199451) (xy -1.123254 -0.201816) (xy -1.097056 -0.202118) (xy -1.069848 -0.200532) )(layer F.SilkS) (width  0.010000)
  )
  (fp_poly (pts (xy -0.396912 -0.201511) (xy -0.359586 -0.195791) (xy -0.349250 -0.193182) (xy -0.339837 -0.190391) (xy -0.334792 -0.188078) (xy -0.334813 -0.185921) (xy -0.340595 -0.183602) (xy -0.352835 -0.180798)
     (xy -0.372230 -0.177189) (xy -0.391187 -0.173883) (xy -0.410845 -0.170355) (xy -0.427279 -0.167149) (xy -0.438791 -0.164613) (xy -0.443678 -0.163099) (xy -0.443694 -0.163083) (xy -0.445249 -0.157806)
     (xy -0.447147 -0.145756) (xy -0.449231 -0.128609) (xy -0.451345 -0.108045) (xy -0.453331 -0.085741) (xy -0.455032 -0.063375) (xy -0.456292 -0.042626) (xy -0.456953 -0.025172) (xy -0.457011 -0.020747)
     (xy -0.457200 0.015656) (xy -0.509307 0.024761) (xy -0.534260 0.029140) (xy -0.552050 0.032005) (xy -0.563882 0.033117) (xy -0.570964 0.032239) (xy -0.574502 0.029132) (xy -0.575702 0.023558)
     (xy -0.575772 0.015278) (xy -0.575752 0.011642) (xy -0.575438 -0.000541) (xy -0.574563 -0.019007) (xy -0.573246 -0.041599) (xy -0.571606 -0.066159) (xy -0.570876 -0.076200) (xy -0.568968 -0.101112)
     (xy -0.567323 -0.119090) (xy -0.565602 -0.131645) (xy -0.563463 -0.140286) (xy -0.560564 -0.146524) (xy -0.556566 -0.151870) (xy -0.552866 -0.155958) (xy -0.530715 -0.174051) (xy -0.502560 -0.187924)
     (xy -0.469884 -0.197306) (xy -0.434174 -0.201925) (xy -0.396912 -0.201511) )(layer F.SilkS) (width  0.010000)
  )
  (fp_poly (pts (xy -0.042000 -0.200802) (xy -0.004410 -0.193802) (xy -0.002117 -0.193182) (xy 0.007296 -0.190391) (xy 0.012341 -0.188078) (xy 0.012321 -0.185921) (xy 0.006539 -0.183602) (xy -0.005701 -0.180798)
     (xy -0.025096 -0.177189) (xy -0.044054 -0.173883) (xy -0.063700 -0.170363) (xy -0.080113 -0.167177) (xy -0.091596 -0.164670) (xy -0.096453 -0.163190) (xy -0.096470 -0.163175) (xy -0.098101 -0.157821)
     (xy -0.100066 -0.145703) (xy -0.102205 -0.128511) (xy -0.104357 -0.107932) (xy -0.106359 -0.085655) (xy -0.108051 -0.063368) (xy -0.109270 -0.042761) (xy -0.109856 -0.025522) (xy -0.109882 -0.022864)
     (xy -0.110067 0.015656) (xy -0.162174 0.024761) (xy -0.187159 0.029166) (xy -0.204971 0.032044) (xy -0.216817 0.033080) (xy -0.223902 0.031959) (xy -0.227434 0.028367) (xy -0.228619 0.021987)
     (xy -0.228662 0.012506) (xy -0.228631 0.007409) (xy -0.228285 -0.006606) (xy -0.227315 -0.026656) (xy -0.225857 -0.050342) (xy -0.224051 -0.075267) (xy -0.223500 -0.082160) (xy -0.218338 -0.145270)
     (xy -0.203770 -0.159418) (xy -0.180030 -0.177021) (xy -0.150446 -0.190219) (xy -0.116555 -0.198753) (xy -0.079894 -0.202367) (xy -0.042000 -0.200802) )(layer F.SilkS) (width  0.010000)
  )
  (fp_poly (pts (xy 0.272642 -0.202119) (xy 0.294914 -0.200736) (xy 0.315235 -0.198585) (xy 0.332207 -0.195917) (xy 0.344430 -0.192982) (xy 0.350506 -0.190028) (xy 0.350492 -0.188214) (xy 0.346069 -0.187054)
     (xy 0.334885 -0.184798) (xy 0.318529 -0.181751) (xy 0.298591 -0.178218) (xy 0.294185 -0.177457) (xy 0.273698 -0.173877) (xy 0.256458 -0.170750) (xy 0.244056 -0.168375) (xy 0.238084 -0.167047)
     (xy 0.237798 -0.166931) (xy 0.236536 -0.162202) (xy 0.234866 -0.150682) (xy 0.232938 -0.134028) (xy 0.230904 -0.113895) (xy 0.228914 -0.091942) (xy 0.227119 -0.069824) (xy 0.225671 -0.049199)
     (xy 0.224721 -0.031723) (xy 0.224416 -0.020189) (xy 0.224572 -0.006818) (xy 0.224244 0.002533) (xy 0.222168 0.008824) (xy 0.217082 0.013016) (xy 0.207720 0.016068) (xy 0.192821 0.018941)
     (xy 0.171119 0.022594) (xy 0.167216 0.023265) (xy 0.148744 0.026501) (xy 0.132208 0.029458) (xy 0.120290 0.031656) (xy 0.117475 0.032203) (xy 0.110961 0.033170) (xy 0.107485 0.031498)
     (xy 0.106089 0.025353) (xy 0.105818 0.012903) (xy 0.105815 0.009862) (xy 0.106132 -0.003266) (xy 0.107016 -0.022586) (xy 0.108345 -0.045851) (xy 0.109998 -0.070813) (xy 0.110698 -0.080433)
     (xy 0.112951 -0.107969) (xy 0.115442 -0.128552) (xy 0.118835 -0.143685) (xy 0.123791 -0.154871) (xy 0.130975 -0.163615) (xy 0.141049 -0.171418) (xy 0.154439 -0.179647) (xy 0.176282 -0.190560)
     (xy 0.199153 -0.197755) (xy 0.225108 -0.201626) (xy 0.256200 -0.202561) (xy 0.272642 -0.202119) )(layer F.SilkS) (width  0.010000)
  )
  (fp_poly (pts (xy 1.230176 -0.446103) (xy 1.231900 -0.444500) (xy 1.234376 -0.441649) (xy 1.236317 -0.437970) (xy 1.237787 -0.432479) (xy 1.238851 -0.424189) (xy 1.239575 -0.412114) (xy 1.240023 -0.395268)
     (xy 1.240261 -0.372667) (xy 1.240353 -0.343323) (xy 1.240367 -0.316325) (xy 1.240312 -0.278453) (xy 1.240037 -0.248194) (xy 1.239374 -0.224696) (xy 1.238155 -0.207104) (xy 1.236211 -0.194565)
     (xy 1.233376 -0.186227) (xy 1.229482 -0.181236) (xy 1.224360 -0.178738) (xy 1.217844 -0.177881) (xy 1.213128 -0.177800) (xy 1.201318 -0.179871) (xy 1.193260 -0.184792) (xy 1.191414 -0.188815)
     (xy 1.189922 -0.196536) (xy 1.188734 -0.208796) (xy 1.187802 -0.226434) (xy 1.187076 -0.250292) (xy 1.186509 -0.281209) (xy 1.186192 -0.306474) (xy 1.185941 -0.337236) (xy 1.185876 -0.365570)
     (xy 1.185986 -0.390265) (xy 1.186260 -0.410114) (xy 1.186689 -0.423907) (xy 1.187256 -0.430419) (xy 1.194048 -0.443784) (xy 1.204915 -0.451310) (xy 1.217682 -0.452311) (xy 1.230176 -0.446103) )(layer F.SilkS) (width  0.010000)
  )
  (fp_poly (pts (xy 1.315730 -0.451704) (xy 1.326494 -0.445225) (xy 1.328543 -0.442153) (xy 1.330155 -0.437355) (xy 1.331381 -0.429884) (xy 1.332272 -0.418791) (xy 1.332878 -0.403132) (xy 1.333251 -0.381958)
     (xy 1.333441 -0.354323) (xy 1.333499 -0.319279) (xy 1.333500 -0.314648) (xy 1.333467 -0.278994) (xy 1.333329 -0.250852) (xy 1.333030 -0.229264) (xy 1.332513 -0.213276) (xy 1.331721 -0.201931)
     (xy 1.330597 -0.194273) (xy 1.329083 -0.189347) (xy 1.327123 -0.186197) (xy 1.325758 -0.184806) (xy 1.313708 -0.178721) (xy 1.300469 -0.179062) (xy 1.289706 -0.185542) (xy 1.287657 -0.188613)
     (xy 1.286045 -0.193411) (xy 1.284819 -0.200883) (xy 1.283928 -0.211975) (xy 1.283322 -0.227634) (xy 1.282949 -0.248808) (xy 1.282759 -0.276444) (xy 1.282700 -0.311488) (xy 1.282700 -0.316119)
     (xy 1.282733 -0.351772) (xy 1.282870 -0.379914) (xy 1.283169 -0.401502) (xy 1.283686 -0.417490) (xy 1.284478 -0.428836) (xy 1.285603 -0.436493) (xy 1.287117 -0.441419) (xy 1.289077 -0.444569)
     (xy 1.290442 -0.445960) (xy 1.302492 -0.452046) (xy 1.315730 -0.451704) )(layer F.SilkS) (width  0.010000)
  )
  (fp_poly (pts (xy 1.412241 -0.449727) (xy 1.416371 -0.446234) (xy 1.419636 -0.441260) (xy 1.422136 -0.433860) (xy 1.423969 -0.423088) (xy 1.425235 -0.407995) (xy 1.426033 -0.387638) (xy 1.426463 -0.361069)
     (xy 1.426623 -0.327342) (xy 1.426633 -0.312370) (xy 1.426574 -0.275097) (xy 1.426280 -0.245425) (xy 1.425573 -0.222488) (xy 1.424277 -0.205421) (xy 1.422214 -0.193358) (xy 1.419208 -0.185435)
     (xy 1.415081 -0.180784) (xy 1.409657 -0.178542) (xy 1.402758 -0.177842) (xy 1.399116 -0.177800) (xy 1.385627 -0.180521) (xy 1.378190 -0.187208) (xy 1.376197 -0.191157) (xy 1.374639 -0.197287)
     (xy 1.373466 -0.206562) (xy 1.372627 -0.219947) (xy 1.372073 -0.238408) (xy 1.371752 -0.262909) (xy 1.371615 -0.294416) (xy 1.371600 -0.313638) (xy 1.371627 -0.348251) (xy 1.371753 -0.375421)
     (xy 1.372050 -0.396167) (xy 1.372587 -0.411513) (xy 1.373433 -0.422480) (xy 1.374660 -0.430089) (xy 1.376336 -0.435364) (xy 1.378532 -0.439326) (xy 1.380374 -0.441812) (xy 1.391294 -0.450567)
     (xy 1.403653 -0.452790) (xy 1.412241 -0.449727) )(layer F.SilkS) (width  0.010000)
  )
  (fp_poly (pts (xy 1.312359 -0.903114) (xy 1.314629 -0.898573) (xy 1.319785 -0.887028) (xy 1.327476 -0.869302) (xy 1.337351 -0.846215) (xy 1.349060 -0.818589) (xy 1.362254 -0.787245) (xy 1.376581 -0.753005)
     (xy 1.385590 -0.731379) (xy 1.455543 -0.563176) (xy 1.448087 -0.532413) (xy 1.440630 -0.501650) (xy 1.432236 -0.520700) (xy 1.428702 -0.528996) (xy 1.422392 -0.544099) (xy 1.413732 -0.564980)
     (xy 1.403147 -0.590608) (xy 1.391063 -0.619953) (xy 1.377906 -0.651985) (xy 1.365349 -0.682625) (xy 1.351925 -0.715232) (xy 1.339432 -0.745224) (xy 1.328244 -0.771731) (xy 1.318735 -0.793883)
     (xy 1.311278 -0.810809) (xy 1.306248 -0.821638) (xy 1.304018 -0.825499) (xy 1.304010 -0.825500) (xy 1.301646 -0.821781) (xy 1.296316 -0.811255) (xy 1.288464 -0.794862) (xy 1.278531 -0.773545)
     (xy 1.266960 -0.748247) (xy 1.254192 -0.719911) (xy 1.248888 -0.708025) (xy 1.235703 -0.678518) (xy 1.223507 -0.651463) (xy 1.212754 -0.627844) (xy 1.203895 -0.608647) (xy 1.197382 -0.594856)
     (xy 1.193669 -0.587455) (xy 1.193090 -0.586528) (xy 1.190530 -0.586948) (xy 1.189567 -0.593625) (xy 1.191048 -0.600125) (xy 1.195225 -0.613028) (xy 1.201695 -0.631321) (xy 1.210059 -0.653995)
     (xy 1.219913 -0.680036) (xy 1.230858 -0.708434) (xy 1.242491 -0.738177) (xy 1.254412 -0.768254) (xy 1.266218 -0.797652) (xy 1.277509 -0.825361) (xy 1.287884 -0.850368) (xy 1.296940 -0.871663)
     (xy 1.304277 -0.888233) (xy 1.309493 -0.899068) (xy 1.312188 -0.903155) (xy 1.312359 -0.903114) )(layer F.SilkS) (width  0.010000)
  )
  (fp_poly (pts (xy -1.502834 -0.615950) (xy -1.504950 -0.613833) (xy -1.507067 -0.615950) (xy -1.504950 -0.618067) (xy -1.502834 -0.615950) )(layer F.SilkS) (width  0.010000)
  )
  (fp_poly (pts (xy -0.506462 -1.094341) (xy -0.495079 -1.088646) (xy -0.478441 -1.079848) (xy -0.457591 -1.068507) (xy -0.433570 -1.055181) (xy -0.410633 -1.042254) (xy -0.315383 -0.988192) (xy -0.314031 -0.971808)
     (xy -0.313504 -0.959335) (xy -0.314892 -0.949240) (xy -0.319166 -0.940393) (xy -0.327297 -0.931664) (xy -0.340258 -0.921923) (xy -0.359019 -0.910040) (xy -0.375708 -0.900088) (xy -0.379458 -0.900401)
     (xy -0.380936 -0.907868) (xy -0.381000 -0.911224) (xy -0.382527 -0.923196) (xy -0.386208 -0.932224) (xy -0.386292 -0.932335) (xy -0.391309 -0.936110) (xy -0.402766 -0.943275) (xy -0.419632 -0.953230)
     (xy -0.440879 -0.965379) (xy -0.465476 -0.979125) (xy -0.492393 -0.993870) (xy -0.492575 -0.993968) (xy -0.593566 -1.048749) (xy -0.686985 -1.007004) (xy -0.712988 -0.995443) (xy -0.736291 -0.985194)
     (xy -0.755826 -0.976719) (xy -0.770529 -0.970475) (xy -0.779334 -0.966924) (xy -0.781420 -0.966288) (xy -0.778154 -0.968404) (xy -0.768273 -0.973630) (xy -0.752818 -0.981462) (xy -0.732832 -0.991397)
     (xy -0.709356 -1.002934) (xy -0.683432 -1.015571) (xy -0.656103 -1.028804) (xy -0.628411 -1.042132) (xy -0.601399 -1.055052) (xy -0.576107 -1.067062) (xy -0.553578 -1.077659) (xy -0.534855 -1.086342)
     (xy -0.520979 -1.092607) (xy -0.512993 -1.095953) (xy -0.511547 -1.096375) (xy -0.506462 -1.094341) )(layer F.SilkS) (width  0.010000)
  )
  (fp_poly (pts (xy -0.795867 -0.958850) (xy -0.797983 -0.956733) (xy -0.800100 -0.958850) (xy -0.797983 -0.960967) (xy -0.795867 -0.958850) )(layer F.SilkS) (width  0.010000)
  )
)
