(module stitch_10_6 (layer F.Cu) (tedit 59F0317F)
  (fp_text reference REF** (at 0 1.397) (layer F.SilkS) hide
    (effects (font (size 1 1) (thickness 0.15)))
  )
  (fp_text value stitch (at 0 -1.778) (layer F.Fab) hide
    (effects (font (size 1 1) (thickness 0.15)))
  )
  (pad 1 thru_hole circle (at 0 0) (size 0.254 0.254) (drill 0.1524) (layers *.Cu))
)
