(module fiducial (layer F.Cu) (tedit 5A789495)
  (fp_text reference REF** (at 0 2.54) (layer F.SilkS) hide
    (effects (font (size 1 1) (thickness 0.15)))
  )
  (fp_text value fiducial (at 0 -2.794) (layer F.Fab) hide
    (effects (font (size 1 1) (thickness 0.15)))
  )
  (pad "" smd rect (at -0.127 -0.127) (size 0.254 0.254) (layers F.Cu))
  (pad "" smd rect (at 0.127 0.127) (size 0.254 0.254) (layers F.Cu))
)
