(module Pigtail_39Pos (layer F.Cu) (tedit 5F8E36CB)
  (fp_text reference REF** (at -7.999999 -2.624501) (layer F.SilkS)
    (effects (font (size 1 1) (thickness 0.15)) (justify left))
  )
  (fp_text value Val** (at 0 0) (layer F.SilkS)
    (effects (font (size 1.27 1.27) (thickness 0.15)))
  )
  (fp_circle (center -5.699996 2.417498) (end -5.574995 2.417498) (layer F.SilkS) (width 0.249999))
  (fp_line (start -6.400066 1.667497) (end 6.400002 1.667497) (layer F.Fab) (width 0.1))
  (fp_line (start -6.900101 0.825) (end -6.400066 0.825) (layer F.Fab) (width 0.1))
  (fp_line (start -6.400066 1.667497) (end -6.400066 0.825) (layer F.Fab) (width 0.1))
  (fp_line (start -6.900101 0.825) (end -6.900101 -1.775) (layer F.Fab) (width 0.1))
  (fp_line (start -6.900101 -1.775) (end -6.27 -1.775) (layer F.Fab) (width 0.1))
  (fp_line (start -6.370074 -2.025) (end 6.369916 -2.025) (layer F.Fab) (width 0.1))
  (fp_line (start -6.370074 -1.775) (end -6.370074 -2.025) (layer F.Fab) (width 0.1))
  (fp_line (start 6.369916 -1.774502) (end 6.369916 -2.025) (layer F.Fab) (width 0.1))
  (fp_line (start 6.27 -1.774502) (end 6.899854 -1.774502) (layer F.Fab) (width 0.1))
  (fp_line (start 6.899943 0.825) (end 6.899943 -1.775) (layer F.Fab) (width 0.1))
  (fp_line (start 6.399908 0.825) (end 6.899943 0.825) (layer F.Fab) (width 0.1))
  (fp_line (start 6.399908 1.667403) (end 6.399908 0.825) (layer F.Fab) (width 0.1))
  (fp_line (start -6.270102 -1.575001) (end 6.269939 -1.575001) (layer F.Fab) (width 0.1))
  (fp_line (start -6.270102 -1.575001) (end -6.270102 -1.775) (layer F.Fab) (width 0.1))
  (fp_line (start 6.269939 -1.575001) (end 6.269939 -1.774911) (layer F.Fab) (width 0.1))
  (fp_line (start -6.899996 -1.774502) (end -5.950001 -1.774502) (layer F.SilkS) (width 0.15))
  (fp_line (start -6.899996 0.370497) (end -6.899996 -1.774502) (layer F.SilkS) (width 0.15))
  (fp_line (start 6.900001 0.370497) (end 6.900001 -1.774502) (layer F.SilkS) (width 0.15))
  (fp_line (start 5.950001 -1.774502) (end 6.900001 -1.774502) (layer F.SilkS) (width 0.15))
  (fp_line (start 6.925004 -2.0495) (end 6.925004 -2.0495) (layer F.CrtYd) (width 0.15))
  (fp_line (start 6.925004 -2.0495) (end -6.924998 -2.0495) (layer F.CrtYd) (width 0.15))
  (fp_line (start -6.924998 -2.0495) (end -6.924998 1.892498) (layer F.CrtYd) (width 0.15))
  (fp_line (start -6.924998 1.892498) (end 6.925004 1.892498) (layer F.CrtYd) (width 0.15))
  (fp_line (start 6.925004 1.892498) (end 6.925004 -2.0495) (layer F.CrtYd) (width 0.15))
  (pad 1 smd custom (at -5.7 -1.3) (size 0.3 0.8) (layers F.Cu F.Paste F.Mask)
    (zone_connect 2)
    (options (clearance outline) (anchor rect))
    (primitives
      (gr_poly (pts
         (xy -0.15 0.4) (xy -0.1 0.5) (xy 0.1 0.5) (xy 0.15 0.4)) (width 0))
      (gr_poly (pts
         (xy -0.15 -0.4) (xy -0.1 -0.5) (xy 0.1 -0.5) (xy 0.15 -0.4)) (width 0))
      (gr_poly (pts
         (xy -0.05 0.5) (xy -0.05 2.5) (xy 0.05 2.5) (xy 0.05 0.5)) (width 0))
    ))
  (pad 2 smd custom (at -5.4 -0.3) (size 0.3 0.8) (layers F.Cu F.Paste F.Mask)
    (zone_connect 2)
    (options (clearance outline) (anchor rect))
    (primitives
      (gr_poly (pts
         (xy -0.15 0.4) (xy -0.1 0.5) (xy 0.1 0.5) (xy 0.15 0.4)) (width 0))
      (gr_poly (pts
         (xy -0.15 -0.4) (xy -0.1 -0.5) (xy 0.1 -0.5) (xy 0.15 -0.4)) (width 0))
      (gr_poly (pts
         (xy -0.05 0.5) (xy 0.05 0.5) (xy 0.05 1.5) (xy -0.05 1.5)) (width 0))
      (gr_poly (pts
         (xy -0.05 -1.5) (xy 0.05 -1.5) (xy 0.05 -0.5) (xy -0.05 -0.5)) (width 0))
    ))
  (pad 3 smd custom (at -5.1 -1.3) (size 0.3 0.8) (layers F.Cu F.Paste F.Mask)
    (zone_connect 2)
    (options (clearance outline) (anchor rect))
    (primitives
      (gr_poly (pts
         (xy -0.15 0.4) (xy -0.1 0.5) (xy 0.1 0.5) (xy 0.15 0.4)) (width 0))
      (gr_poly (pts
         (xy -0.15 -0.4) (xy -0.1 -0.5) (xy 0.1 -0.5) (xy 0.15 -0.4)) (width 0))
      (gr_poly (pts
         (xy -0.05 0.5) (xy -0.05 2.5) (xy 0.05 2.5) (xy 0.05 0.5)) (width 0))
    ))
  (pad 4 smd custom (at -4.8 -0.3) (size 0.3 0.8) (layers F.Cu F.Paste F.Mask)
    (zone_connect 2)
    (options (clearance outline) (anchor rect))
    (primitives
      (gr_poly (pts
         (xy -0.15 0.4) (xy -0.1 0.5) (xy 0.1 0.5) (xy 0.15 0.4)) (width 0))
      (gr_poly (pts
         (xy -0.15 -0.4) (xy -0.1 -0.5) (xy 0.1 -0.5) (xy 0.15 -0.4)) (width 0))
      (gr_poly (pts
         (xy -0.05 0.5) (xy 0.05 0.5) (xy 0.05 1.5) (xy -0.05 1.5)) (width 0))
      (gr_poly (pts
         (xy -0.05 -1.5) (xy 0.05 -1.5) (xy 0.05 -0.5) (xy -0.05 -0.5)) (width 0))
    ))
  (pad 8 smd custom (at -3.6 -0.3) (size 0.3 0.8) (layers F.Cu F.Paste F.Mask)
    (zone_connect 2)
    (options (clearance outline) (anchor rect))
    (primitives
      (gr_poly (pts
         (xy -0.15 0.4) (xy -0.1 0.5) (xy 0.1 0.5) (xy 0.15 0.4)) (width 0))
      (gr_poly (pts
         (xy -0.15 -0.4) (xy -0.1 -0.5) (xy 0.1 -0.5) (xy 0.15 -0.4)) (width 0))
      (gr_poly (pts
         (xy -0.05 0.5) (xy 0.05 0.5) (xy 0.05 1.5) (xy -0.05 1.5)) (width 0))
      (gr_poly (pts
         (xy -0.05 -1.5) (xy 0.05 -1.5) (xy 0.05 -0.5) (xy -0.05 -0.5)) (width 0))
    ))
  (pad 7 smd custom (at -3.9 -1.3) (size 0.3 0.8) (layers F.Cu F.Paste F.Mask)
    (zone_connect 2)
    (options (clearance outline) (anchor rect))
    (primitives
      (gr_poly (pts
         (xy -0.15 0.4) (xy -0.1 0.5) (xy 0.1 0.5) (xy 0.15 0.4)) (width 0))
      (gr_poly (pts
         (xy -0.15 -0.4) (xy -0.1 -0.5) (xy 0.1 -0.5) (xy 0.15 -0.4)) (width 0))
      (gr_poly (pts
         (xy -0.05 0.5) (xy -0.05 2.5) (xy 0.05 2.5) (xy 0.05 0.5)) (width 0))
    ))
  (pad 6 smd custom (at -4.2 -0.3) (size 0.3 0.8) (layers F.Cu F.Paste F.Mask)
    (zone_connect 2)
    (options (clearance outline) (anchor rect))
    (primitives
      (gr_poly (pts
         (xy -0.15 0.4) (xy -0.1 0.5) (xy 0.1 0.5) (xy 0.15 0.4)) (width 0))
      (gr_poly (pts
         (xy -0.15 -0.4) (xy -0.1 -0.5) (xy 0.1 -0.5) (xy 0.15 -0.4)) (width 0))
      (gr_poly (pts
         (xy -0.05 0.5) (xy 0.05 0.5) (xy 0.05 1.5) (xy -0.05 1.5)) (width 0))
      (gr_poly (pts
         (xy -0.05 -1.5) (xy 0.05 -1.5) (xy 0.05 -0.5) (xy -0.05 -0.5)) (width 0))
    ))
  (pad 5 smd custom (at -4.5 -1.3) (size 0.3 0.8) (layers F.Cu F.Paste F.Mask)
    (zone_connect 2)
    (options (clearance outline) (anchor rect))
    (primitives
      (gr_poly (pts
         (xy -0.15 0.4) (xy -0.1 0.5) (xy 0.1 0.5) (xy 0.15 0.4)) (width 0))
      (gr_poly (pts
         (xy -0.15 -0.4) (xy -0.1 -0.5) (xy 0.1 -0.5) (xy 0.15 -0.4)) (width 0))
      (gr_poly (pts
         (xy -0.05 0.5) (xy -0.05 2.5) (xy 0.05 2.5) (xy 0.05 0.5)) (width 0))
    ))
  (pad 12 smd custom (at -2.4 -0.3) (size 0.3 0.8) (layers F.Cu F.Paste F.Mask)
    (zone_connect 2)
    (options (clearance outline) (anchor rect))
    (primitives
      (gr_poly (pts
         (xy -0.15 0.4) (xy -0.1 0.5) (xy 0.1 0.5) (xy 0.15 0.4)) (width 0))
      (gr_poly (pts
         (xy -0.15 -0.4) (xy -0.1 -0.5) (xy 0.1 -0.5) (xy 0.15 -0.4)) (width 0))
      (gr_poly (pts
         (xy -0.05 0.5) (xy 0.05 0.5) (xy 0.05 1.5) (xy -0.05 1.5)) (width 0))
      (gr_poly (pts
         (xy -0.05 -1.5) (xy 0.05 -1.5) (xy 0.05 -0.5) (xy -0.05 -0.5)) (width 0))
    ))
  (pad 11 smd custom (at -2.7 -1.3) (size 0.3 0.8) (layers F.Cu F.Paste F.Mask)
    (zone_connect 2)
    (options (clearance outline) (anchor rect))
    (primitives
      (gr_poly (pts
         (xy -0.15 0.4) (xy -0.1 0.5) (xy 0.1 0.5) (xy 0.15 0.4)) (width 0))
      (gr_poly (pts
         (xy -0.15 -0.4) (xy -0.1 -0.5) (xy 0.1 -0.5) (xy 0.15 -0.4)) (width 0))
      (gr_poly (pts
         (xy -0.05 0.5) (xy -0.05 2.5) (xy 0.05 2.5) (xy 0.05 0.5)) (width 0))
    ))
  (pad 10 smd custom (at -3 -0.3) (size 0.3 0.8) (layers F.Cu F.Paste F.Mask)
    (zone_connect 2)
    (options (clearance outline) (anchor rect))
    (primitives
      (gr_poly (pts
         (xy -0.15 0.4) (xy -0.1 0.5) (xy 0.1 0.5) (xy 0.15 0.4)) (width 0))
      (gr_poly (pts
         (xy -0.15 -0.4) (xy -0.1 -0.5) (xy 0.1 -0.5) (xy 0.15 -0.4)) (width 0))
      (gr_poly (pts
         (xy -0.05 0.5) (xy 0.05 0.5) (xy 0.05 1.5) (xy -0.05 1.5)) (width 0))
      (gr_poly (pts
         (xy -0.05 -1.5) (xy 0.05 -1.5) (xy 0.05 -0.5) (xy -0.05 -0.5)) (width 0))
    ))
  (pad 9 smd custom (at -3.3 -1.3) (size 0.3 0.8) (layers F.Cu F.Paste F.Mask)
    (zone_connect 2)
    (options (clearance outline) (anchor rect))
    (primitives
      (gr_poly (pts
         (xy -0.15 0.4) (xy -0.1 0.5) (xy 0.1 0.5) (xy 0.15 0.4)) (width 0))
      (gr_poly (pts
         (xy -0.15 -0.4) (xy -0.1 -0.5) (xy 0.1 -0.5) (xy 0.15 -0.4)) (width 0))
      (gr_poly (pts
         (xy -0.05 0.5) (xy -0.05 2.5) (xy 0.05 2.5) (xy 0.05 0.5)) (width 0))
    ))
  (pad 15 smd custom (at -1.5 -1.3) (size 0.3 0.8) (layers F.Cu F.Paste F.Mask)
    (zone_connect 2)
    (options (clearance outline) (anchor rect))
    (primitives
      (gr_poly (pts
         (xy -0.15 0.4) (xy -0.1 0.5) (xy 0.1 0.5) (xy 0.15 0.4)) (width 0))
      (gr_poly (pts
         (xy -0.15 -0.4) (xy -0.1 -0.5) (xy 0.1 -0.5) (xy 0.15 -0.4)) (width 0))
      (gr_poly (pts
         (xy -0.05 0.5) (xy -0.05 2.5) (xy 0.05 2.5) (xy 0.05 0.5)) (width 0))
    ))
  (pad 14 smd custom (at -1.8 -0.3) (size 0.3 0.8) (layers F.Cu F.Paste F.Mask)
    (zone_connect 2)
    (options (clearance outline) (anchor rect))
    (primitives
      (gr_poly (pts
         (xy -0.15 0.4) (xy -0.1 0.5) (xy 0.1 0.5) (xy 0.15 0.4)) (width 0))
      (gr_poly (pts
         (xy -0.15 -0.4) (xy -0.1 -0.5) (xy 0.1 -0.5) (xy 0.15 -0.4)) (width 0))
      (gr_poly (pts
         (xy -0.05 0.5) (xy 0.05 0.5) (xy 0.05 1.5) (xy -0.05 1.5)) (width 0))
      (gr_poly (pts
         (xy -0.05 -1.5) (xy 0.05 -1.5) (xy 0.05 -0.5) (xy -0.05 -0.5)) (width 0))
    ))
  (pad 13 smd custom (at -2.1 -1.3) (size 0.3 0.8) (layers F.Cu F.Paste F.Mask)
    (zone_connect 2)
    (options (clearance outline) (anchor rect))
    (primitives
      (gr_poly (pts
         (xy -0.15 0.4) (xy -0.1 0.5) (xy 0.1 0.5) (xy 0.15 0.4)) (width 0))
      (gr_poly (pts
         (xy -0.15 -0.4) (xy -0.1 -0.5) (xy 0.1 -0.5) (xy 0.15 -0.4)) (width 0))
      (gr_poly (pts
         (xy -0.05 0.5) (xy -0.05 2.5) (xy 0.05 2.5) (xy 0.05 0.5)) (width 0))
    ))
  (pad 16 smd custom (at -1.2 -0.3) (size 0.3 0.8) (layers F.Cu F.Paste F.Mask)
    (zone_connect 2)
    (options (clearance outline) (anchor rect))
    (primitives
      (gr_poly (pts
         (xy -0.15 0.4) (xy -0.1 0.5) (xy 0.1 0.5) (xy 0.15 0.4)) (width 0))
      (gr_poly (pts
         (xy -0.15 -0.4) (xy -0.1 -0.5) (xy 0.1 -0.5) (xy 0.15 -0.4)) (width 0))
      (gr_poly (pts
         (xy -0.05 0.5) (xy 0.05 0.5) (xy 0.05 1.5) (xy -0.05 1.5)) (width 0))
      (gr_poly (pts
         (xy -0.05 -1.5) (xy 0.05 -1.5) (xy 0.05 -0.5) (xy -0.05 -0.5)) (width 0))
    ))
  (pad 27 smd custom (at 2.1 -1.3) (size 0.3 0.8) (layers F.Cu F.Paste F.Mask)
    (zone_connect 2)
    (options (clearance outline) (anchor rect))
    (primitives
      (gr_poly (pts
         (xy -0.15 0.4) (xy -0.1 0.5) (xy 0.1 0.5) (xy 0.15 0.4)) (width 0))
      (gr_poly (pts
         (xy -0.15 -0.4) (xy -0.1 -0.5) (xy 0.1 -0.5) (xy 0.15 -0.4)) (width 0))
      (gr_poly (pts
         (xy -0.05 0.5) (xy -0.05 2.5) (xy 0.05 2.5) (xy 0.05 0.5)) (width 0))
    ))
  (pad 26 smd custom (at 1.8 -0.3) (size 0.3 0.8) (layers F.Cu F.Paste F.Mask)
    (zone_connect 2)
    (options (clearance outline) (anchor rect))
    (primitives
      (gr_poly (pts
         (xy -0.15 0.4) (xy -0.1 0.5) (xy 0.1 0.5) (xy 0.15 0.4)) (width 0))
      (gr_poly (pts
         (xy -0.15 -0.4) (xy -0.1 -0.5) (xy 0.1 -0.5) (xy 0.15 -0.4)) (width 0))
      (gr_poly (pts
         (xy -0.05 0.5) (xy 0.05 0.5) (xy 0.05 1.5) (xy -0.05 1.5)) (width 0))
      (gr_poly (pts
         (xy -0.05 -1.5) (xy 0.05 -1.5) (xy 0.05 -0.5) (xy -0.05 -0.5)) (width 0))
    ))
  (pad 25 smd custom (at 1.5 -1.3) (size 0.3 0.8) (layers F.Cu F.Paste F.Mask)
    (zone_connect 2)
    (options (clearance outline) (anchor rect))
    (primitives
      (gr_poly (pts
         (xy -0.15 0.4) (xy -0.1 0.5) (xy 0.1 0.5) (xy 0.15 0.4)) (width 0))
      (gr_poly (pts
         (xy -0.15 -0.4) (xy -0.1 -0.5) (xy 0.1 -0.5) (xy 0.15 -0.4)) (width 0))
      (gr_poly (pts
         (xy -0.05 0.5) (xy -0.05 2.5) (xy 0.05 2.5) (xy 0.05 0.5)) (width 0))
    ))
  (pad 28 smd custom (at 2.4 -0.3) (size 0.3 0.8) (layers F.Cu F.Paste F.Mask)
    (zone_connect 2)
    (options (clearance outline) (anchor rect))
    (primitives
      (gr_poly (pts
         (xy -0.15 0.4) (xy -0.1 0.5) (xy 0.1 0.5) (xy 0.15 0.4)) (width 0))
      (gr_poly (pts
         (xy -0.15 -0.4) (xy -0.1 -0.5) (xy 0.1 -0.5) (xy 0.15 -0.4)) (width 0))
      (gr_poly (pts
         (xy -0.05 0.5) (xy 0.05 0.5) (xy 0.05 1.5) (xy -0.05 1.5)) (width 0))
      (gr_poly (pts
         (xy -0.05 -1.5) (xy 0.05 -1.5) (xy 0.05 -0.5) (xy -0.05 -0.5)) (width 0))
    ))
  (pad 20 smd custom (at 0 -0.3) (size 0.3 0.8) (layers F.Cu F.Paste F.Mask)
    (zone_connect 2)
    (options (clearance outline) (anchor rect))
    (primitives
      (gr_poly (pts
         (xy -0.15 0.4) (xy -0.1 0.5) (xy 0.1 0.5) (xy 0.15 0.4)) (width 0))
      (gr_poly (pts
         (xy -0.15 -0.4) (xy -0.1 -0.5) (xy 0.1 -0.5) (xy 0.15 -0.4)) (width 0))
      (gr_poly (pts
         (xy -0.05 0.5) (xy 0.05 0.5) (xy 0.05 1.5) (xy -0.05 1.5)) (width 0))
      (gr_poly (pts
         (xy -0.05 -1.5) (xy 0.05 -1.5) (xy 0.05 -0.5) (xy -0.05 -0.5)) (width 0))
    ))
  (pad 19 smd custom (at -0.3 -1.3) (size 0.3 0.8) (layers F.Cu F.Paste F.Mask)
    (zone_connect 2)
    (options (clearance outline) (anchor rect))
    (primitives
      (gr_poly (pts
         (xy -0.15 0.4) (xy -0.1 0.5) (xy 0.1 0.5) (xy 0.15 0.4)) (width 0))
      (gr_poly (pts
         (xy -0.15 -0.4) (xy -0.1 -0.5) (xy 0.1 -0.5) (xy 0.15 -0.4)) (width 0))
      (gr_poly (pts
         (xy -0.05 0.5) (xy -0.05 2.5) (xy 0.05 2.5) (xy 0.05 0.5)) (width 0))
    ))
  (pad 24 smd custom (at 1.2 -0.3) (size 0.3 0.8) (layers F.Cu F.Paste F.Mask)
    (zone_connect 2)
    (options (clearance outline) (anchor rect))
    (primitives
      (gr_poly (pts
         (xy -0.15 0.4) (xy -0.1 0.5) (xy 0.1 0.5) (xy 0.15 0.4)) (width 0))
      (gr_poly (pts
         (xy -0.15 -0.4) (xy -0.1 -0.5) (xy 0.1 -0.5) (xy 0.15 -0.4)) (width 0))
      (gr_poly (pts
         (xy -0.05 0.5) (xy 0.05 0.5) (xy 0.05 1.5) (xy -0.05 1.5)) (width 0))
      (gr_poly (pts
         (xy -0.05 -1.5) (xy 0.05 -1.5) (xy 0.05 -0.5) (xy -0.05 -0.5)) (width 0))
    ))
  (pad 23 smd custom (at 0.9 -1.3) (size 0.3 0.8) (layers F.Cu F.Paste F.Mask)
    (zone_connect 2)
    (options (clearance outline) (anchor rect))
    (primitives
      (gr_poly (pts
         (xy -0.15 0.4) (xy -0.1 0.5) (xy 0.1 0.5) (xy 0.15 0.4)) (width 0))
      (gr_poly (pts
         (xy -0.15 -0.4) (xy -0.1 -0.5) (xy 0.1 -0.5) (xy 0.15 -0.4)) (width 0))
      (gr_poly (pts
         (xy -0.05 0.5) (xy -0.05 2.5) (xy 0.05 2.5) (xy 0.05 0.5)) (width 0))
    ))
  (pad 22 smd custom (at 0.6 -0.3) (size 0.3 0.8) (layers F.Cu F.Paste F.Mask)
    (zone_connect 2)
    (options (clearance outline) (anchor rect))
    (primitives
      (gr_poly (pts
         (xy -0.15 0.4) (xy -0.1 0.5) (xy 0.1 0.5) (xy 0.15 0.4)) (width 0))
      (gr_poly (pts
         (xy -0.15 -0.4) (xy -0.1 -0.5) (xy 0.1 -0.5) (xy 0.15 -0.4)) (width 0))
      (gr_poly (pts
         (xy -0.05 0.5) (xy 0.05 0.5) (xy 0.05 1.5) (xy -0.05 1.5)) (width 0))
      (gr_poly (pts
         (xy -0.05 -1.5) (xy 0.05 -1.5) (xy 0.05 -0.5) (xy -0.05 -0.5)) (width 0))
    ))
  (pad 21 smd custom (at 0.3 -1.3) (size 0.3 0.8) (layers F.Cu F.Paste F.Mask)
    (zone_connect 2)
    (options (clearance outline) (anchor rect))
    (primitives
      (gr_poly (pts
         (xy -0.15 0.4) (xy -0.1 0.5) (xy 0.1 0.5) (xy 0.15 0.4)) (width 0))
      (gr_poly (pts
         (xy -0.15 -0.4) (xy -0.1 -0.5) (xy 0.1 -0.5) (xy 0.15 -0.4)) (width 0))
      (gr_poly (pts
         (xy -0.05 0.5) (xy -0.05 2.5) (xy 0.05 2.5) (xy 0.05 0.5)) (width 0))
    ))
  (pad 30 smd custom (at 3 -0.3) (size 0.3 0.8) (layers F.Cu F.Paste F.Mask)
    (zone_connect 2)
    (options (clearance outline) (anchor rect))
    (primitives
      (gr_poly (pts
         (xy -0.15 0.4) (xy -0.1 0.5) (xy 0.1 0.5) (xy 0.15 0.4)) (width 0))
      (gr_poly (pts
         (xy -0.15 -0.4) (xy -0.1 -0.5) (xy 0.1 -0.5) (xy 0.15 -0.4)) (width 0))
      (gr_poly (pts
         (xy -0.05 0.5) (xy 0.05 0.5) (xy 0.05 1.5) (xy -0.05 1.5)) (width 0))
      (gr_poly (pts
         (xy -0.05 -1.5) (xy 0.05 -1.5) (xy 0.05 -0.5) (xy -0.05 -0.5)) (width 0))
    ))
  (pad 29 smd custom (at 2.7 -1.3) (size 0.3 0.8) (layers F.Cu F.Paste F.Mask)
    (zone_connect 2)
    (options (clearance outline) (anchor rect))
    (primitives
      (gr_poly (pts
         (xy -0.15 0.4) (xy -0.1 0.5) (xy 0.1 0.5) (xy 0.15 0.4)) (width 0))
      (gr_poly (pts
         (xy -0.15 -0.4) (xy -0.1 -0.5) (xy 0.1 -0.5) (xy 0.15 -0.4)) (width 0))
      (gr_poly (pts
         (xy -0.05 0.5) (xy -0.05 2.5) (xy 0.05 2.5) (xy 0.05 0.5)) (width 0))
    ))
  (pad 18 smd custom (at -0.6 -0.3) (size 0.3 0.8) (layers F.Cu F.Paste F.Mask)
    (zone_connect 2)
    (options (clearance outline) (anchor rect))
    (primitives
      (gr_poly (pts
         (xy -0.15 0.4) (xy -0.1 0.5) (xy 0.1 0.5) (xy 0.15 0.4)) (width 0))
      (gr_poly (pts
         (xy -0.15 -0.4) (xy -0.1 -0.5) (xy 0.1 -0.5) (xy 0.15 -0.4)) (width 0))
      (gr_poly (pts
         (xy -0.05 0.5) (xy 0.05 0.5) (xy 0.05 1.5) (xy -0.05 1.5)) (width 0))
      (gr_poly (pts
         (xy -0.05 -1.5) (xy 0.05 -1.5) (xy 0.05 -0.5) (xy -0.05 -0.5)) (width 0))
    ))
  (pad 17 smd custom (at -0.9 -1.3) (size 0.3 0.8) (layers F.Cu F.Paste F.Mask)
    (zone_connect 2)
    (options (clearance outline) (anchor rect))
    (primitives
      (gr_poly (pts
         (xy -0.15 0.4) (xy -0.1 0.5) (xy 0.1 0.5) (xy 0.15 0.4)) (width 0))
      (gr_poly (pts
         (xy -0.15 -0.4) (xy -0.1 -0.5) (xy 0.1 -0.5) (xy 0.15 -0.4)) (width 0))
      (gr_poly (pts
         (xy -0.05 0.5) (xy -0.05 2.5) (xy 0.05 2.5) (xy 0.05 0.5)) (width 0))
    ))
  (pad 31 smd custom (at 3.3 -1.3) (size 0.3 0.8) (layers F.Cu F.Paste F.Mask)
    (zone_connect 2)
    (options (clearance outline) (anchor rect))
    (primitives
      (gr_poly (pts
         (xy -0.15 0.4) (xy -0.1 0.5) (xy 0.1 0.5) (xy 0.15 0.4)) (width 0))
      (gr_poly (pts
         (xy -0.15 -0.4) (xy -0.1 -0.5) (xy 0.1 -0.5) (xy 0.15 -0.4)) (width 0))
      (gr_poly (pts
         (xy -0.05 0.5) (xy -0.05 2.5) (xy 0.05 2.5) (xy 0.05 0.5)) (width 0))
    ))
  (pad 32 smd custom (at 3.6 -0.3) (size 0.3 0.8) (layers F.Cu F.Paste F.Mask)
    (zone_connect 2)
    (options (clearance outline) (anchor rect))
    (primitives
      (gr_poly (pts
         (xy -0.15 0.4) (xy -0.1 0.5) (xy 0.1 0.5) (xy 0.15 0.4)) (width 0))
      (gr_poly (pts
         (xy -0.15 -0.4) (xy -0.1 -0.5) (xy 0.1 -0.5) (xy 0.15 -0.4)) (width 0))
      (gr_poly (pts
         (xy -0.05 0.5) (xy 0.05 0.5) (xy 0.05 1.5) (xy -0.05 1.5)) (width 0))
      (gr_poly (pts
         (xy -0.05 -1.5) (xy 0.05 -1.5) (xy 0.05 -0.5) (xy -0.05 -0.5)) (width 0))
    ))
  (pad 34 smd custom (at 4.2 -0.3) (size 0.3 0.8) (layers F.Cu F.Paste F.Mask)
    (zone_connect 2)
    (options (clearance outline) (anchor rect))
    (primitives
      (gr_poly (pts
         (xy -0.15 0.4) (xy -0.1 0.5) (xy 0.1 0.5) (xy 0.15 0.4)) (width 0))
      (gr_poly (pts
         (xy -0.15 -0.4) (xy -0.1 -0.5) (xy 0.1 -0.5) (xy 0.15 -0.4)) (width 0))
      (gr_poly (pts
         (xy -0.05 0.5) (xy 0.05 0.5) (xy 0.05 1.5) (xy -0.05 1.5)) (width 0))
      (gr_poly (pts
         (xy -0.05 -1.5) (xy 0.05 -1.5) (xy 0.05 -0.5) (xy -0.05 -0.5)) (width 0))
    ))
  (pad 33 smd custom (at 3.9 -1.3) (size 0.3 0.8) (layers F.Cu F.Paste F.Mask)
    (zone_connect 2)
    (options (clearance outline) (anchor rect))
    (primitives
      (gr_poly (pts
         (xy -0.15 0.4) (xy -0.1 0.5) (xy 0.1 0.5) (xy 0.15 0.4)) (width 0))
      (gr_poly (pts
         (xy -0.15 -0.4) (xy -0.1 -0.5) (xy 0.1 -0.5) (xy 0.15 -0.4)) (width 0))
      (gr_poly (pts
         (xy -0.05 0.5) (xy -0.05 2.5) (xy 0.05 2.5) (xy 0.05 0.5)) (width 0))
    ))
  (pad 36 smd custom (at 4.8 -0.3) (size 0.3 0.8) (layers F.Cu F.Paste F.Mask)
    (zone_connect 2)
    (options (clearance outline) (anchor rect))
    (primitives
      (gr_poly (pts
         (xy -0.15 0.4) (xy -0.1 0.5) (xy 0.1 0.5) (xy 0.15 0.4)) (width 0))
      (gr_poly (pts
         (xy -0.15 -0.4) (xy -0.1 -0.5) (xy 0.1 -0.5) (xy 0.15 -0.4)) (width 0))
      (gr_poly (pts
         (xy -0.05 0.5) (xy 0.05 0.5) (xy 0.05 1.5) (xy -0.05 1.5)) (width 0))
      (gr_poly (pts
         (xy -0.05 -1.5) (xy 0.05 -1.5) (xy 0.05 -0.5) (xy -0.05 -0.5)) (width 0))
    ))
  (pad 35 smd custom (at 4.5 -1.3) (size 0.3 0.8) (layers F.Cu F.Paste F.Mask)
    (zone_connect 2)
    (options (clearance outline) (anchor rect))
    (primitives
      (gr_poly (pts
         (xy -0.15 0.4) (xy -0.1 0.5) (xy 0.1 0.5) (xy 0.15 0.4)) (width 0))
      (gr_poly (pts
         (xy -0.15 -0.4) (xy -0.1 -0.5) (xy 0.1 -0.5) (xy 0.15 -0.4)) (width 0))
      (gr_poly (pts
         (xy -0.05 0.5) (xy -0.05 2.5) (xy 0.05 2.5) (xy 0.05 0.5)) (width 0))
    ))
  (pad 38 smd custom (at 5.4 -0.3) (size 0.3 0.8) (layers F.Cu F.Paste F.Mask)
    (zone_connect 2)
    (options (clearance outline) (anchor rect))
    (primitives
      (gr_poly (pts
         (xy -0.15 0.4) (xy -0.1 0.5) (xy 0.1 0.5) (xy 0.15 0.4)) (width 0))
      (gr_poly (pts
         (xy -0.15 -0.4) (xy -0.1 -0.5) (xy 0.1 -0.5) (xy 0.15 -0.4)) (width 0))
      (gr_poly (pts
         (xy -0.05 0.5) (xy 0.05 0.5) (xy 0.05 1.5) (xy -0.05 1.5)) (width 0))
      (gr_poly (pts
         (xy -0.05 -1.5) (xy 0.05 -1.5) (xy 0.05 -0.5) (xy -0.05 -0.5)) (width 0))
    ))
  (pad 37 smd custom (at 5.1 -1.3) (size 0.3 0.8) (layers F.Cu F.Paste F.Mask)
    (zone_connect 2)
    (options (clearance outline) (anchor rect))
    (primitives
      (gr_poly (pts
         (xy -0.15 0.4) (xy -0.1 0.5) (xy 0.1 0.5) (xy 0.15 0.4)) (width 0))
      (gr_poly (pts
         (xy -0.15 -0.4) (xy -0.1 -0.5) (xy 0.1 -0.5) (xy 0.15 -0.4)) (width 0))
      (gr_poly (pts
         (xy -0.05 0.5) (xy -0.05 2.5) (xy 0.05 2.5) (xy 0.05 0.5)) (width 0))
    ))
  (pad 39 smd custom (at 5.7 -1.3) (size 0.3 0.8) (layers F.Cu F.Paste F.Mask)
    (zone_connect 2)
    (options (clearance outline) (anchor rect))
    (primitives
      (gr_poly (pts
         (xy -0.15 0.4) (xy -0.1 0.5) (xy 0.1 0.5) (xy 0.15 0.4)) (width 0))
      (gr_poly (pts
         (xy -0.15 -0.4) (xy -0.1 -0.5) (xy 0.1 -0.5) (xy 0.15 -0.4)) (width 0))
      (gr_poly (pts
         (xy -0.05 0.5) (xy -0.05 2.5) (xy 0.05 2.5) (xy 0.05 0.5)) (width 0))
    ))
)
