%TF.GenerationSoftware,KiCad,Pcbnew,(5.1.10-1-10_14)*%
%TF.CreationDate,2022-03-14T21:26:53-07:00*%
%TF.ProjectId,rd53b_datapigtail_39pos,72643533-625f-4646-9174-617069677461,1.1*%
%TF.SameCoordinates,Original*%
%TF.FileFunction,Paste,Top*%
%TF.FilePolarity,Positive*%
%FSLAX46Y46*%
G04 Gerber Fmt 4.6, Leading zero omitted, Abs format (unit mm)*
G04 Created by KiCad (PCBNEW (5.1.10-1-10_14)) date 2022-03-14 21:26:53*
%MOMM*%
%LPD*%
G01*
G04 APERTURE LIST*
%ADD10C,0.100000*%
G04 APERTURE END LIST*
D10*
%TO.C,U2*%
G36*
X60150000Y-179700000D02*
G01*
X60150000Y-178900000D01*
X60200000Y-178800000D01*
X60250000Y-178800000D01*
X60250000Y-176800000D01*
X60350000Y-176800000D01*
X60350000Y-178800000D01*
X60400000Y-178800000D01*
X60450000Y-178900000D01*
X60450000Y-179700000D01*
X60400000Y-179800000D01*
X60200000Y-179800000D01*
X60150000Y-179700000D01*
G37*
G36*
X60750000Y-179700000D02*
G01*
X60750000Y-178900000D01*
X60800000Y-178800000D01*
X60850000Y-178800000D01*
X60850000Y-176800000D01*
X60950000Y-176800000D01*
X60950000Y-178800000D01*
X61000000Y-178800000D01*
X61050000Y-178900000D01*
X61050000Y-179700000D01*
X61000000Y-179800000D01*
X60800000Y-179800000D01*
X60750000Y-179700000D01*
G37*
G36*
X60550000Y-178800000D02*
G01*
X60500000Y-178800000D01*
X60450000Y-178700000D01*
X60450000Y-177900000D01*
X60500000Y-177800000D01*
X60550000Y-177800000D01*
X60550000Y-176800000D01*
X60650000Y-176800000D01*
X60650000Y-177800000D01*
X60700000Y-177800000D01*
X60750000Y-177900000D01*
X60750000Y-178700000D01*
X60700000Y-178800000D01*
X60650000Y-178800000D01*
X60650000Y-179800000D01*
X60550000Y-179800000D01*
X60550000Y-178800000D01*
G37*
G36*
X61350000Y-179700000D02*
G01*
X61350000Y-178900000D01*
X61400000Y-178800000D01*
X61450000Y-178800000D01*
X61450000Y-176800000D01*
X61550000Y-176800000D01*
X61550000Y-178800000D01*
X61600000Y-178800000D01*
X61650000Y-178900000D01*
X61650000Y-179700000D01*
X61600000Y-179800000D01*
X61400000Y-179800000D01*
X61350000Y-179700000D01*
G37*
G36*
X61150000Y-178800000D02*
G01*
X61100000Y-178800000D01*
X61050000Y-178700000D01*
X61050000Y-177900000D01*
X61100000Y-177800000D01*
X61150000Y-177800000D01*
X61150000Y-176800000D01*
X61250000Y-176800000D01*
X61250000Y-177800000D01*
X61300000Y-177800000D01*
X61350000Y-177900000D01*
X61350000Y-178700000D01*
X61300000Y-178800000D01*
X61250000Y-178800000D01*
X61250000Y-179800000D01*
X61150000Y-179800000D01*
X61150000Y-178800000D01*
G37*
G36*
X61950000Y-179700000D02*
G01*
X61950000Y-178900000D01*
X62000000Y-178800000D01*
X62050000Y-178800000D01*
X62050000Y-176800000D01*
X62150000Y-176800000D01*
X62150000Y-178800000D01*
X62200000Y-178800000D01*
X62250000Y-178900000D01*
X62250000Y-179700000D01*
X62200000Y-179800000D01*
X62000000Y-179800000D01*
X61950000Y-179700000D01*
G37*
G36*
X61750000Y-178800000D02*
G01*
X61700000Y-178800000D01*
X61650000Y-178700000D01*
X61650000Y-177900000D01*
X61700000Y-177800000D01*
X61750000Y-177800000D01*
X61750000Y-176800000D01*
X61850000Y-176800000D01*
X61850000Y-177800000D01*
X61900000Y-177800000D01*
X61950000Y-177900000D01*
X61950000Y-178700000D01*
X61900000Y-178800000D01*
X61850000Y-178800000D01*
X61850000Y-179800000D01*
X61750000Y-179800000D01*
X61750000Y-178800000D01*
G37*
G36*
X62350000Y-178800000D02*
G01*
X62300000Y-178800000D01*
X62250000Y-178700000D01*
X62250000Y-177900000D01*
X62300000Y-177800000D01*
X62350000Y-177800000D01*
X62350000Y-176800000D01*
X62450000Y-176800000D01*
X62450000Y-177800000D01*
X62500000Y-177800000D01*
X62550000Y-177900000D01*
X62550000Y-178700000D01*
X62500000Y-178800000D01*
X62450000Y-178800000D01*
X62450000Y-179800000D01*
X62350000Y-179800000D01*
X62350000Y-178800000D01*
G37*
G36*
X62550000Y-179700000D02*
G01*
X62550000Y-178900000D01*
X62600000Y-178800000D01*
X62650000Y-178800000D01*
X62650000Y-176800000D01*
X62750000Y-176800000D01*
X62750000Y-178800000D01*
X62800000Y-178800000D01*
X62850000Y-178900000D01*
X62850000Y-179700000D01*
X62800000Y-179800000D01*
X62600000Y-179800000D01*
X62550000Y-179700000D01*
G37*
G36*
X66750000Y-179700000D02*
G01*
X66750000Y-178900000D01*
X66800000Y-178800000D01*
X66850000Y-178800000D01*
X66850000Y-176800000D01*
X66950000Y-176800000D01*
X66950000Y-178800000D01*
X67000000Y-178800000D01*
X67050000Y-178900000D01*
X67050000Y-179700000D01*
X67000000Y-179800000D01*
X66800000Y-179800000D01*
X66750000Y-179700000D01*
G37*
G36*
X66550000Y-178800000D02*
G01*
X66500000Y-178800000D01*
X66450000Y-178700000D01*
X66450000Y-177900000D01*
X66500000Y-177800000D01*
X66550000Y-177800000D01*
X66550000Y-176800000D01*
X66650000Y-176800000D01*
X66650000Y-177800000D01*
X66700000Y-177800000D01*
X66750000Y-177900000D01*
X66750000Y-178700000D01*
X66700000Y-178800000D01*
X66650000Y-178800000D01*
X66650000Y-179800000D01*
X66550000Y-179800000D01*
X66550000Y-178800000D01*
G37*
G36*
X63150000Y-179700000D02*
G01*
X63150000Y-178900000D01*
X63200000Y-178800000D01*
X63250000Y-178800000D01*
X63250000Y-176800000D01*
X63350000Y-176800000D01*
X63350000Y-178800000D01*
X63400000Y-178800000D01*
X63450000Y-178900000D01*
X63450000Y-179700000D01*
X63400000Y-179800000D01*
X63200000Y-179800000D01*
X63150000Y-179700000D01*
G37*
G36*
X62950000Y-178800000D02*
G01*
X62900000Y-178800000D01*
X62850000Y-178700000D01*
X62850000Y-177900000D01*
X62900000Y-177800000D01*
X62950000Y-177800000D01*
X62950000Y-176800000D01*
X63050000Y-176800000D01*
X63050000Y-177800000D01*
X63100000Y-177800000D01*
X63150000Y-177900000D01*
X63150000Y-178700000D01*
X63100000Y-178800000D01*
X63050000Y-178800000D01*
X63050000Y-179800000D01*
X62950000Y-179800000D01*
X62950000Y-178800000D01*
G37*
G36*
X65550000Y-179700000D02*
G01*
X65550000Y-178900000D01*
X65600000Y-178800000D01*
X65650000Y-178800000D01*
X65650000Y-176800000D01*
X65750000Y-176800000D01*
X65750000Y-178800000D01*
X65800000Y-178800000D01*
X65850000Y-178900000D01*
X65850000Y-179700000D01*
X65800000Y-179800000D01*
X65600000Y-179800000D01*
X65550000Y-179700000D01*
G37*
G36*
X65350000Y-178800000D02*
G01*
X65300000Y-178800000D01*
X65250000Y-178700000D01*
X65250000Y-177900000D01*
X65300000Y-177800000D01*
X65350000Y-177800000D01*
X65350000Y-176800000D01*
X65450000Y-176800000D01*
X65450000Y-177800000D01*
X65500000Y-177800000D01*
X65550000Y-177900000D01*
X65550000Y-178700000D01*
X65500000Y-178800000D01*
X65450000Y-178800000D01*
X65450000Y-179800000D01*
X65350000Y-179800000D01*
X65350000Y-178800000D01*
G37*
G36*
X64950000Y-179700000D02*
G01*
X64950000Y-178900000D01*
X65000000Y-178800000D01*
X65050000Y-178800000D01*
X65050000Y-176800000D01*
X65150000Y-176800000D01*
X65150000Y-178800000D01*
X65200000Y-178800000D01*
X65250000Y-178900000D01*
X65250000Y-179700000D01*
X65200000Y-179800000D01*
X65000000Y-179800000D01*
X64950000Y-179700000D01*
G37*
G36*
X64750000Y-178800000D02*
G01*
X64700000Y-178800000D01*
X64650000Y-178700000D01*
X64650000Y-177900000D01*
X64700000Y-177800000D01*
X64750000Y-177800000D01*
X64750000Y-176800000D01*
X64850000Y-176800000D01*
X64850000Y-177800000D01*
X64900000Y-177800000D01*
X64950000Y-177900000D01*
X64950000Y-178700000D01*
X64900000Y-178800000D01*
X64850000Y-178800000D01*
X64850000Y-179800000D01*
X64750000Y-179800000D01*
X64750000Y-178800000D01*
G37*
G36*
X66150000Y-179700000D02*
G01*
X66150000Y-178900000D01*
X66200000Y-178800000D01*
X66250000Y-178800000D01*
X66250000Y-176800000D01*
X66350000Y-176800000D01*
X66350000Y-178800000D01*
X66400000Y-178800000D01*
X66450000Y-178900000D01*
X66450000Y-179700000D01*
X66400000Y-179800000D01*
X66200000Y-179800000D01*
X66150000Y-179700000D01*
G37*
G36*
X65950000Y-178800000D02*
G01*
X65900000Y-178800000D01*
X65850000Y-178700000D01*
X65850000Y-177900000D01*
X65900000Y-177800000D01*
X65950000Y-177800000D01*
X65950000Y-176800000D01*
X66050000Y-176800000D01*
X66050000Y-177800000D01*
X66100000Y-177800000D01*
X66150000Y-177900000D01*
X66150000Y-178700000D01*
X66100000Y-178800000D01*
X66050000Y-178800000D01*
X66050000Y-179800000D01*
X65950000Y-179800000D01*
X65950000Y-178800000D01*
G37*
G36*
X63550000Y-178800000D02*
G01*
X63500000Y-178800000D01*
X63450000Y-178700000D01*
X63450000Y-177900000D01*
X63500000Y-177800000D01*
X63550000Y-177800000D01*
X63550000Y-176800000D01*
X63650000Y-176800000D01*
X63650000Y-177800000D01*
X63700000Y-177800000D01*
X63750000Y-177900000D01*
X63750000Y-178700000D01*
X63700000Y-178800000D01*
X63650000Y-178800000D01*
X63650000Y-179800000D01*
X63550000Y-179800000D01*
X63550000Y-178800000D01*
G37*
G36*
X64350000Y-179700000D02*
G01*
X64350000Y-178900000D01*
X64400000Y-178800000D01*
X64450000Y-178800000D01*
X64450000Y-176800000D01*
X64550000Y-176800000D01*
X64550000Y-178800000D01*
X64600000Y-178800000D01*
X64650000Y-178900000D01*
X64650000Y-179700000D01*
X64600000Y-179800000D01*
X64400000Y-179800000D01*
X64350000Y-179700000D01*
G37*
G36*
X64150000Y-178800000D02*
G01*
X64100000Y-178800000D01*
X64050000Y-178700000D01*
X64050000Y-177900000D01*
X64100000Y-177800000D01*
X64150000Y-177800000D01*
X64150000Y-176800000D01*
X64250000Y-176800000D01*
X64250000Y-177800000D01*
X64300000Y-177800000D01*
X64350000Y-177900000D01*
X64350000Y-178700000D01*
X64300000Y-178800000D01*
X64250000Y-178800000D01*
X64250000Y-179800000D01*
X64150000Y-179800000D01*
X64150000Y-178800000D01*
G37*
G36*
X63750000Y-179700000D02*
G01*
X63750000Y-178900000D01*
X63800000Y-178800000D01*
X63850000Y-178800000D01*
X63850000Y-176800000D01*
X63950000Y-176800000D01*
X63950000Y-178800000D01*
X64000000Y-178800000D01*
X64050000Y-178900000D01*
X64050000Y-179700000D01*
X64000000Y-179800000D01*
X63800000Y-179800000D01*
X63750000Y-179700000D01*
G37*
G36*
X67150000Y-178800000D02*
G01*
X67100000Y-178800000D01*
X67050000Y-178700000D01*
X67050000Y-177900000D01*
X67100000Y-177800000D01*
X67150000Y-177800000D01*
X67150000Y-176800000D01*
X67250000Y-176800000D01*
X67250000Y-177800000D01*
X67300000Y-177800000D01*
X67350000Y-177900000D01*
X67350000Y-178700000D01*
X67300000Y-178800000D01*
X67250000Y-178800000D01*
X67250000Y-179800000D01*
X67150000Y-179800000D01*
X67150000Y-178800000D01*
G37*
G36*
X67950000Y-179700000D02*
G01*
X67950000Y-178900000D01*
X68000000Y-178800000D01*
X68050000Y-178800000D01*
X68050000Y-176800000D01*
X68150000Y-176800000D01*
X68150000Y-178800000D01*
X68200000Y-178800000D01*
X68250000Y-178900000D01*
X68250000Y-179700000D01*
X68200000Y-179800000D01*
X68000000Y-179800000D01*
X67950000Y-179700000D01*
G37*
G36*
X67750000Y-178800000D02*
G01*
X67700000Y-178800000D01*
X67650000Y-178700000D01*
X67650000Y-177900000D01*
X67700000Y-177800000D01*
X67750000Y-177800000D01*
X67750000Y-176800000D01*
X67850000Y-176800000D01*
X67850000Y-177800000D01*
X67900000Y-177800000D01*
X67950000Y-177900000D01*
X67950000Y-178700000D01*
X67900000Y-178800000D01*
X67850000Y-178800000D01*
X67850000Y-179800000D01*
X67750000Y-179800000D01*
X67750000Y-178800000D01*
G37*
G36*
X67350000Y-179700000D02*
G01*
X67350000Y-178900000D01*
X67400000Y-178800000D01*
X67450000Y-178800000D01*
X67450000Y-176800000D01*
X67550000Y-176800000D01*
X67550000Y-178800000D01*
X67600000Y-178800000D01*
X67650000Y-178900000D01*
X67650000Y-179700000D01*
X67600000Y-179800000D01*
X67400000Y-179800000D01*
X67350000Y-179700000D01*
G37*
G36*
X69150000Y-179700000D02*
G01*
X69150000Y-178900000D01*
X69200000Y-178800000D01*
X69250000Y-178800000D01*
X69250000Y-176800000D01*
X69350000Y-176800000D01*
X69350000Y-178800000D01*
X69400000Y-178800000D01*
X69450000Y-178900000D01*
X69450000Y-179700000D01*
X69400000Y-179800000D01*
X69200000Y-179800000D01*
X69150000Y-179700000D01*
G37*
G36*
X68950000Y-178800000D02*
G01*
X68900000Y-178800000D01*
X68850000Y-178700000D01*
X68850000Y-177900000D01*
X68900000Y-177800000D01*
X68950000Y-177800000D01*
X68950000Y-176800000D01*
X69050000Y-176800000D01*
X69050000Y-177800000D01*
X69100000Y-177800000D01*
X69150000Y-177900000D01*
X69150000Y-178700000D01*
X69100000Y-178800000D01*
X69050000Y-178800000D01*
X69050000Y-179800000D01*
X68950000Y-179800000D01*
X68950000Y-178800000D01*
G37*
G36*
X68550000Y-179700000D02*
G01*
X68550000Y-178900000D01*
X68600000Y-178800000D01*
X68650000Y-178800000D01*
X68650000Y-176800000D01*
X68750000Y-176800000D01*
X68750000Y-178800000D01*
X68800000Y-178800000D01*
X68850000Y-178900000D01*
X68850000Y-179700000D01*
X68800000Y-179800000D01*
X68600000Y-179800000D01*
X68550000Y-179700000D01*
G37*
G36*
X68350000Y-178800000D02*
G01*
X68300000Y-178800000D01*
X68250000Y-178700000D01*
X68250000Y-177900000D01*
X68300000Y-177800000D01*
X68350000Y-177800000D01*
X68350000Y-176800000D01*
X68450000Y-176800000D01*
X68450000Y-177800000D01*
X68500000Y-177800000D01*
X68550000Y-177900000D01*
X68550000Y-178700000D01*
X68500000Y-178800000D01*
X68450000Y-178800000D01*
X68450000Y-179800000D01*
X68350000Y-179800000D01*
X68350000Y-178800000D01*
G37*
G36*
X70350000Y-179700000D02*
G01*
X70350000Y-178900000D01*
X70400000Y-178800000D01*
X70450000Y-178800000D01*
X70450000Y-176800000D01*
X70550000Y-176800000D01*
X70550000Y-178800000D01*
X70600000Y-178800000D01*
X70650000Y-178900000D01*
X70650000Y-179700000D01*
X70600000Y-179800000D01*
X70400000Y-179800000D01*
X70350000Y-179700000D01*
G37*
G36*
X70150000Y-178800000D02*
G01*
X70100000Y-178800000D01*
X70050000Y-178700000D01*
X70050000Y-177900000D01*
X70100000Y-177800000D01*
X70150000Y-177800000D01*
X70150000Y-176800000D01*
X70250000Y-176800000D01*
X70250000Y-177800000D01*
X70300000Y-177800000D01*
X70350000Y-177900000D01*
X70350000Y-178700000D01*
X70300000Y-178800000D01*
X70250000Y-178800000D01*
X70250000Y-179800000D01*
X70150000Y-179800000D01*
X70150000Y-178800000D01*
G37*
G36*
X69750000Y-179700000D02*
G01*
X69750000Y-178900000D01*
X69800000Y-178800000D01*
X69850000Y-178800000D01*
X69850000Y-176800000D01*
X69950000Y-176800000D01*
X69950000Y-178800000D01*
X70000000Y-178800000D01*
X70050000Y-178900000D01*
X70050000Y-179700000D01*
X70000000Y-179800000D01*
X69800000Y-179800000D01*
X69750000Y-179700000D01*
G37*
G36*
X69550000Y-178800000D02*
G01*
X69500000Y-178800000D01*
X69450000Y-178700000D01*
X69450000Y-177900000D01*
X69500000Y-177800000D01*
X69550000Y-177800000D01*
X69550000Y-176800000D01*
X69650000Y-176800000D01*
X69650000Y-177800000D01*
X69700000Y-177800000D01*
X69750000Y-177900000D01*
X69750000Y-178700000D01*
X69700000Y-178800000D01*
X69650000Y-178800000D01*
X69650000Y-179800000D01*
X69550000Y-179800000D01*
X69550000Y-178800000D01*
G37*
G36*
X70750000Y-178800000D02*
G01*
X70700000Y-178800000D01*
X70650000Y-178700000D01*
X70650000Y-177900000D01*
X70700000Y-177800000D01*
X70750000Y-177800000D01*
X70750000Y-176800000D01*
X70850000Y-176800000D01*
X70850000Y-177800000D01*
X70900000Y-177800000D01*
X70950000Y-177900000D01*
X70950000Y-178700000D01*
X70900000Y-178800000D01*
X70850000Y-178800000D01*
X70850000Y-179800000D01*
X70750000Y-179800000D01*
X70750000Y-178800000D01*
G37*
G36*
X70950000Y-179700000D02*
G01*
X70950000Y-178900000D01*
X71000000Y-178800000D01*
X71050000Y-178800000D01*
X71050000Y-176800000D01*
X71150000Y-176800000D01*
X71150000Y-178800000D01*
X71200000Y-178800000D01*
X71250000Y-178900000D01*
X71250000Y-179700000D01*
X71200000Y-179800000D01*
X71000000Y-179800000D01*
X70950000Y-179700000D01*
G37*
G36*
X71350000Y-178800000D02*
G01*
X71300000Y-178800000D01*
X71250000Y-178700000D01*
X71250000Y-177900000D01*
X71300000Y-177800000D01*
X71350000Y-177800000D01*
X71350000Y-176800000D01*
X71450000Y-176800000D01*
X71450000Y-177800000D01*
X71500000Y-177800000D01*
X71550000Y-177900000D01*
X71550000Y-178700000D01*
X71500000Y-178800000D01*
X71450000Y-178800000D01*
X71450000Y-179800000D01*
X71350000Y-179800000D01*
X71350000Y-178800000D01*
G37*
G36*
X71550000Y-179700000D02*
G01*
X71550000Y-178900000D01*
X71600000Y-178800000D01*
X71650000Y-178800000D01*
X71650000Y-176800000D01*
X71750000Y-176800000D01*
X71750000Y-178800000D01*
X71800000Y-178800000D01*
X71850000Y-178900000D01*
X71850000Y-179700000D01*
X71800000Y-179800000D01*
X71600000Y-179800000D01*
X71550000Y-179700000D01*
G37*
%TD*%
%TO.C,U1*%
G36*
X71850000Y-30300000D02*
G01*
X71850000Y-31100000D01*
X71800000Y-31200000D01*
X71750000Y-31200000D01*
X71750000Y-33200000D01*
X71650000Y-33200000D01*
X71650000Y-31200000D01*
X71600000Y-31200000D01*
X71550000Y-31100000D01*
X71550000Y-30300000D01*
X71600000Y-30200000D01*
X71800000Y-30200000D01*
X71850000Y-30300000D01*
G37*
G36*
X71250000Y-30300000D02*
G01*
X71250000Y-31100000D01*
X71200000Y-31200000D01*
X71150000Y-31200000D01*
X71150000Y-33200000D01*
X71050000Y-33200000D01*
X71050000Y-31200000D01*
X71000000Y-31200000D01*
X70950000Y-31100000D01*
X70950000Y-30300000D01*
X71000000Y-30200000D01*
X71200000Y-30200000D01*
X71250000Y-30300000D01*
G37*
G36*
X71450000Y-31200000D02*
G01*
X71500000Y-31200000D01*
X71550000Y-31300000D01*
X71550000Y-32100000D01*
X71500000Y-32200000D01*
X71450000Y-32200000D01*
X71450000Y-33200000D01*
X71350000Y-33200000D01*
X71350000Y-32200000D01*
X71300000Y-32200000D01*
X71250000Y-32100000D01*
X71250000Y-31300000D01*
X71300000Y-31200000D01*
X71350000Y-31200000D01*
X71350000Y-30200000D01*
X71450000Y-30200000D01*
X71450000Y-31200000D01*
G37*
G36*
X70650000Y-30300000D02*
G01*
X70650000Y-31100000D01*
X70600000Y-31200000D01*
X70550000Y-31200000D01*
X70550000Y-33200000D01*
X70450000Y-33200000D01*
X70450000Y-31200000D01*
X70400000Y-31200000D01*
X70350000Y-31100000D01*
X70350000Y-30300000D01*
X70400000Y-30200000D01*
X70600000Y-30200000D01*
X70650000Y-30300000D01*
G37*
G36*
X70850000Y-31200000D02*
G01*
X70900000Y-31200000D01*
X70950000Y-31300000D01*
X70950000Y-32100000D01*
X70900000Y-32200000D01*
X70850000Y-32200000D01*
X70850000Y-33200000D01*
X70750000Y-33200000D01*
X70750000Y-32200000D01*
X70700000Y-32200000D01*
X70650000Y-32100000D01*
X70650000Y-31300000D01*
X70700000Y-31200000D01*
X70750000Y-31200000D01*
X70750000Y-30200000D01*
X70850000Y-30200000D01*
X70850000Y-31200000D01*
G37*
G36*
X70050000Y-30300000D02*
G01*
X70050000Y-31100000D01*
X70000000Y-31200000D01*
X69950000Y-31200000D01*
X69950000Y-33200000D01*
X69850000Y-33200000D01*
X69850000Y-31200000D01*
X69800000Y-31200000D01*
X69750000Y-31100000D01*
X69750000Y-30300000D01*
X69800000Y-30200000D01*
X70000000Y-30200000D01*
X70050000Y-30300000D01*
G37*
G36*
X70250000Y-31200000D02*
G01*
X70300000Y-31200000D01*
X70350000Y-31300000D01*
X70350000Y-32100000D01*
X70300000Y-32200000D01*
X70250000Y-32200000D01*
X70250000Y-33200000D01*
X70150000Y-33200000D01*
X70150000Y-32200000D01*
X70100000Y-32200000D01*
X70050000Y-32100000D01*
X70050000Y-31300000D01*
X70100000Y-31200000D01*
X70150000Y-31200000D01*
X70150000Y-30200000D01*
X70250000Y-30200000D01*
X70250000Y-31200000D01*
G37*
G36*
X69650000Y-31200000D02*
G01*
X69700000Y-31200000D01*
X69750000Y-31300000D01*
X69750000Y-32100000D01*
X69700000Y-32200000D01*
X69650000Y-32200000D01*
X69650000Y-33200000D01*
X69550000Y-33200000D01*
X69550000Y-32200000D01*
X69500000Y-32200000D01*
X69450000Y-32100000D01*
X69450000Y-31300000D01*
X69500000Y-31200000D01*
X69550000Y-31200000D01*
X69550000Y-30200000D01*
X69650000Y-30200000D01*
X69650000Y-31200000D01*
G37*
G36*
X69450000Y-30300000D02*
G01*
X69450000Y-31100000D01*
X69400000Y-31200000D01*
X69350000Y-31200000D01*
X69350000Y-33200000D01*
X69250000Y-33200000D01*
X69250000Y-31200000D01*
X69200000Y-31200000D01*
X69150000Y-31100000D01*
X69150000Y-30300000D01*
X69200000Y-30200000D01*
X69400000Y-30200000D01*
X69450000Y-30300000D01*
G37*
G36*
X65250000Y-30300000D02*
G01*
X65250000Y-31100000D01*
X65200000Y-31200000D01*
X65150000Y-31200000D01*
X65150000Y-33200000D01*
X65050000Y-33200000D01*
X65050000Y-31200000D01*
X65000000Y-31200000D01*
X64950000Y-31100000D01*
X64950000Y-30300000D01*
X65000000Y-30200000D01*
X65200000Y-30200000D01*
X65250000Y-30300000D01*
G37*
G36*
X65450000Y-31200000D02*
G01*
X65500000Y-31200000D01*
X65550000Y-31300000D01*
X65550000Y-32100000D01*
X65500000Y-32200000D01*
X65450000Y-32200000D01*
X65450000Y-33200000D01*
X65350000Y-33200000D01*
X65350000Y-32200000D01*
X65300000Y-32200000D01*
X65250000Y-32100000D01*
X65250000Y-31300000D01*
X65300000Y-31200000D01*
X65350000Y-31200000D01*
X65350000Y-30200000D01*
X65450000Y-30200000D01*
X65450000Y-31200000D01*
G37*
G36*
X68850000Y-30300000D02*
G01*
X68850000Y-31100000D01*
X68800000Y-31200000D01*
X68750000Y-31200000D01*
X68750000Y-33200000D01*
X68650000Y-33200000D01*
X68650000Y-31200000D01*
X68600000Y-31200000D01*
X68550000Y-31100000D01*
X68550000Y-30300000D01*
X68600000Y-30200000D01*
X68800000Y-30200000D01*
X68850000Y-30300000D01*
G37*
G36*
X69050000Y-31200000D02*
G01*
X69100000Y-31200000D01*
X69150000Y-31300000D01*
X69150000Y-32100000D01*
X69100000Y-32200000D01*
X69050000Y-32200000D01*
X69050000Y-33200000D01*
X68950000Y-33200000D01*
X68950000Y-32200000D01*
X68900000Y-32200000D01*
X68850000Y-32100000D01*
X68850000Y-31300000D01*
X68900000Y-31200000D01*
X68950000Y-31200000D01*
X68950000Y-30200000D01*
X69050000Y-30200000D01*
X69050000Y-31200000D01*
G37*
G36*
X66450000Y-30300000D02*
G01*
X66450000Y-31100000D01*
X66400000Y-31200000D01*
X66350000Y-31200000D01*
X66350000Y-33200000D01*
X66250000Y-33200000D01*
X66250000Y-31200000D01*
X66200000Y-31200000D01*
X66150000Y-31100000D01*
X66150000Y-30300000D01*
X66200000Y-30200000D01*
X66400000Y-30200000D01*
X66450000Y-30300000D01*
G37*
G36*
X66650000Y-31200000D02*
G01*
X66700000Y-31200000D01*
X66750000Y-31300000D01*
X66750000Y-32100000D01*
X66700000Y-32200000D01*
X66650000Y-32200000D01*
X66650000Y-33200000D01*
X66550000Y-33200000D01*
X66550000Y-32200000D01*
X66500000Y-32200000D01*
X66450000Y-32100000D01*
X66450000Y-31300000D01*
X66500000Y-31200000D01*
X66550000Y-31200000D01*
X66550000Y-30200000D01*
X66650000Y-30200000D01*
X66650000Y-31200000D01*
G37*
G36*
X67050000Y-30300000D02*
G01*
X67050000Y-31100000D01*
X67000000Y-31200000D01*
X66950000Y-31200000D01*
X66950000Y-33200000D01*
X66850000Y-33200000D01*
X66850000Y-31200000D01*
X66800000Y-31200000D01*
X66750000Y-31100000D01*
X66750000Y-30300000D01*
X66800000Y-30200000D01*
X67000000Y-30200000D01*
X67050000Y-30300000D01*
G37*
G36*
X67250000Y-31200000D02*
G01*
X67300000Y-31200000D01*
X67350000Y-31300000D01*
X67350000Y-32100000D01*
X67300000Y-32200000D01*
X67250000Y-32200000D01*
X67250000Y-33200000D01*
X67150000Y-33200000D01*
X67150000Y-32200000D01*
X67100000Y-32200000D01*
X67050000Y-32100000D01*
X67050000Y-31300000D01*
X67100000Y-31200000D01*
X67150000Y-31200000D01*
X67150000Y-30200000D01*
X67250000Y-30200000D01*
X67250000Y-31200000D01*
G37*
G36*
X65850000Y-30300000D02*
G01*
X65850000Y-31100000D01*
X65800000Y-31200000D01*
X65750000Y-31200000D01*
X65750000Y-33200000D01*
X65650000Y-33200000D01*
X65650000Y-31200000D01*
X65600000Y-31200000D01*
X65550000Y-31100000D01*
X65550000Y-30300000D01*
X65600000Y-30200000D01*
X65800000Y-30200000D01*
X65850000Y-30300000D01*
G37*
G36*
X66050000Y-31200000D02*
G01*
X66100000Y-31200000D01*
X66150000Y-31300000D01*
X66150000Y-32100000D01*
X66100000Y-32200000D01*
X66050000Y-32200000D01*
X66050000Y-33200000D01*
X65950000Y-33200000D01*
X65950000Y-32200000D01*
X65900000Y-32200000D01*
X65850000Y-32100000D01*
X65850000Y-31300000D01*
X65900000Y-31200000D01*
X65950000Y-31200000D01*
X65950000Y-30200000D01*
X66050000Y-30200000D01*
X66050000Y-31200000D01*
G37*
G36*
X68450000Y-31200000D02*
G01*
X68500000Y-31200000D01*
X68550000Y-31300000D01*
X68550000Y-32100000D01*
X68500000Y-32200000D01*
X68450000Y-32200000D01*
X68450000Y-33200000D01*
X68350000Y-33200000D01*
X68350000Y-32200000D01*
X68300000Y-32200000D01*
X68250000Y-32100000D01*
X68250000Y-31300000D01*
X68300000Y-31200000D01*
X68350000Y-31200000D01*
X68350000Y-30200000D01*
X68450000Y-30200000D01*
X68450000Y-31200000D01*
G37*
G36*
X67650000Y-30300000D02*
G01*
X67650000Y-31100000D01*
X67600000Y-31200000D01*
X67550000Y-31200000D01*
X67550000Y-33200000D01*
X67450000Y-33200000D01*
X67450000Y-31200000D01*
X67400000Y-31200000D01*
X67350000Y-31100000D01*
X67350000Y-30300000D01*
X67400000Y-30200000D01*
X67600000Y-30200000D01*
X67650000Y-30300000D01*
G37*
G36*
X67850000Y-31200000D02*
G01*
X67900000Y-31200000D01*
X67950000Y-31300000D01*
X67950000Y-32100000D01*
X67900000Y-32200000D01*
X67850000Y-32200000D01*
X67850000Y-33200000D01*
X67750000Y-33200000D01*
X67750000Y-32200000D01*
X67700000Y-32200000D01*
X67650000Y-32100000D01*
X67650000Y-31300000D01*
X67700000Y-31200000D01*
X67750000Y-31200000D01*
X67750000Y-30200000D01*
X67850000Y-30200000D01*
X67850000Y-31200000D01*
G37*
G36*
X68250000Y-30300000D02*
G01*
X68250000Y-31100000D01*
X68200000Y-31200000D01*
X68150000Y-31200000D01*
X68150000Y-33200000D01*
X68050000Y-33200000D01*
X68050000Y-31200000D01*
X68000000Y-31200000D01*
X67950000Y-31100000D01*
X67950000Y-30300000D01*
X68000000Y-30200000D01*
X68200000Y-30200000D01*
X68250000Y-30300000D01*
G37*
G36*
X64850000Y-31200000D02*
G01*
X64900000Y-31200000D01*
X64950000Y-31300000D01*
X64950000Y-32100000D01*
X64900000Y-32200000D01*
X64850000Y-32200000D01*
X64850000Y-33200000D01*
X64750000Y-33200000D01*
X64750000Y-32200000D01*
X64700000Y-32200000D01*
X64650000Y-32100000D01*
X64650000Y-31300000D01*
X64700000Y-31200000D01*
X64750000Y-31200000D01*
X64750000Y-30200000D01*
X64850000Y-30200000D01*
X64850000Y-31200000D01*
G37*
G36*
X64050000Y-30300000D02*
G01*
X64050000Y-31100000D01*
X64000000Y-31200000D01*
X63950000Y-31200000D01*
X63950000Y-33200000D01*
X63850000Y-33200000D01*
X63850000Y-31200000D01*
X63800000Y-31200000D01*
X63750000Y-31100000D01*
X63750000Y-30300000D01*
X63800000Y-30200000D01*
X64000000Y-30200000D01*
X64050000Y-30300000D01*
G37*
G36*
X64250000Y-31200000D02*
G01*
X64300000Y-31200000D01*
X64350000Y-31300000D01*
X64350000Y-32100000D01*
X64300000Y-32200000D01*
X64250000Y-32200000D01*
X64250000Y-33200000D01*
X64150000Y-33200000D01*
X64150000Y-32200000D01*
X64100000Y-32200000D01*
X64050000Y-32100000D01*
X64050000Y-31300000D01*
X64100000Y-31200000D01*
X64150000Y-31200000D01*
X64150000Y-30200000D01*
X64250000Y-30200000D01*
X64250000Y-31200000D01*
G37*
G36*
X64650000Y-30300000D02*
G01*
X64650000Y-31100000D01*
X64600000Y-31200000D01*
X64550000Y-31200000D01*
X64550000Y-33200000D01*
X64450000Y-33200000D01*
X64450000Y-31200000D01*
X64400000Y-31200000D01*
X64350000Y-31100000D01*
X64350000Y-30300000D01*
X64400000Y-30200000D01*
X64600000Y-30200000D01*
X64650000Y-30300000D01*
G37*
G36*
X62850000Y-30300000D02*
G01*
X62850000Y-31100000D01*
X62800000Y-31200000D01*
X62750000Y-31200000D01*
X62750000Y-33200000D01*
X62650000Y-33200000D01*
X62650000Y-31200000D01*
X62600000Y-31200000D01*
X62550000Y-31100000D01*
X62550000Y-30300000D01*
X62600000Y-30200000D01*
X62800000Y-30200000D01*
X62850000Y-30300000D01*
G37*
G36*
X63050000Y-31200000D02*
G01*
X63100000Y-31200000D01*
X63150000Y-31300000D01*
X63150000Y-32100000D01*
X63100000Y-32200000D01*
X63050000Y-32200000D01*
X63050000Y-33200000D01*
X62950000Y-33200000D01*
X62950000Y-32200000D01*
X62900000Y-32200000D01*
X62850000Y-32100000D01*
X62850000Y-31300000D01*
X62900000Y-31200000D01*
X62950000Y-31200000D01*
X62950000Y-30200000D01*
X63050000Y-30200000D01*
X63050000Y-31200000D01*
G37*
G36*
X63450000Y-30300000D02*
G01*
X63450000Y-31100000D01*
X63400000Y-31200000D01*
X63350000Y-31200000D01*
X63350000Y-33200000D01*
X63250000Y-33200000D01*
X63250000Y-31200000D01*
X63200000Y-31200000D01*
X63150000Y-31100000D01*
X63150000Y-30300000D01*
X63200000Y-30200000D01*
X63400000Y-30200000D01*
X63450000Y-30300000D01*
G37*
G36*
X63650000Y-31200000D02*
G01*
X63700000Y-31200000D01*
X63750000Y-31300000D01*
X63750000Y-32100000D01*
X63700000Y-32200000D01*
X63650000Y-32200000D01*
X63650000Y-33200000D01*
X63550000Y-33200000D01*
X63550000Y-32200000D01*
X63500000Y-32200000D01*
X63450000Y-32100000D01*
X63450000Y-31300000D01*
X63500000Y-31200000D01*
X63550000Y-31200000D01*
X63550000Y-30200000D01*
X63650000Y-30200000D01*
X63650000Y-31200000D01*
G37*
G36*
X61650000Y-30300000D02*
G01*
X61650000Y-31100000D01*
X61600000Y-31200000D01*
X61550000Y-31200000D01*
X61550000Y-33200000D01*
X61450000Y-33200000D01*
X61450000Y-31200000D01*
X61400000Y-31200000D01*
X61350000Y-31100000D01*
X61350000Y-30300000D01*
X61400000Y-30200000D01*
X61600000Y-30200000D01*
X61650000Y-30300000D01*
G37*
G36*
X61850000Y-31200000D02*
G01*
X61900000Y-31200000D01*
X61950000Y-31300000D01*
X61950000Y-32100000D01*
X61900000Y-32200000D01*
X61850000Y-32200000D01*
X61850000Y-33200000D01*
X61750000Y-33200000D01*
X61750000Y-32200000D01*
X61700000Y-32200000D01*
X61650000Y-32100000D01*
X61650000Y-31300000D01*
X61700000Y-31200000D01*
X61750000Y-31200000D01*
X61750000Y-30200000D01*
X61850000Y-30200000D01*
X61850000Y-31200000D01*
G37*
G36*
X62250000Y-30300000D02*
G01*
X62250000Y-31100000D01*
X62200000Y-31200000D01*
X62150000Y-31200000D01*
X62150000Y-33200000D01*
X62050000Y-33200000D01*
X62050000Y-31200000D01*
X62000000Y-31200000D01*
X61950000Y-31100000D01*
X61950000Y-30300000D01*
X62000000Y-30200000D01*
X62200000Y-30200000D01*
X62250000Y-30300000D01*
G37*
G36*
X62450000Y-31200000D02*
G01*
X62500000Y-31200000D01*
X62550000Y-31300000D01*
X62550000Y-32100000D01*
X62500000Y-32200000D01*
X62450000Y-32200000D01*
X62450000Y-33200000D01*
X62350000Y-33200000D01*
X62350000Y-32200000D01*
X62300000Y-32200000D01*
X62250000Y-32100000D01*
X62250000Y-31300000D01*
X62300000Y-31200000D01*
X62350000Y-31200000D01*
X62350000Y-30200000D01*
X62450000Y-30200000D01*
X62450000Y-31200000D01*
G37*
G36*
X61250000Y-31200000D02*
G01*
X61300000Y-31200000D01*
X61350000Y-31300000D01*
X61350000Y-32100000D01*
X61300000Y-32200000D01*
X61250000Y-32200000D01*
X61250000Y-33200000D01*
X61150000Y-33200000D01*
X61150000Y-32200000D01*
X61100000Y-32200000D01*
X61050000Y-32100000D01*
X61050000Y-31300000D01*
X61100000Y-31200000D01*
X61150000Y-31200000D01*
X61150000Y-30200000D01*
X61250000Y-30200000D01*
X61250000Y-31200000D01*
G37*
G36*
X61050000Y-30300000D02*
G01*
X61050000Y-31100000D01*
X61000000Y-31200000D01*
X60950000Y-31200000D01*
X60950000Y-33200000D01*
X60850000Y-33200000D01*
X60850000Y-31200000D01*
X60800000Y-31200000D01*
X60750000Y-31100000D01*
X60750000Y-30300000D01*
X60800000Y-30200000D01*
X61000000Y-30200000D01*
X61050000Y-30300000D01*
G37*
G36*
X60650000Y-31200000D02*
G01*
X60700000Y-31200000D01*
X60750000Y-31300000D01*
X60750000Y-32100000D01*
X60700000Y-32200000D01*
X60650000Y-32200000D01*
X60650000Y-33200000D01*
X60550000Y-33200000D01*
X60550000Y-32200000D01*
X60500000Y-32200000D01*
X60450000Y-32100000D01*
X60450000Y-31300000D01*
X60500000Y-31200000D01*
X60550000Y-31200000D01*
X60550000Y-30200000D01*
X60650000Y-30200000D01*
X60650000Y-31200000D01*
G37*
G36*
X60450000Y-30300000D02*
G01*
X60450000Y-31100000D01*
X60400000Y-31200000D01*
X60350000Y-31200000D01*
X60350000Y-33200000D01*
X60250000Y-33200000D01*
X60250000Y-31200000D01*
X60200000Y-31200000D01*
X60150000Y-31100000D01*
X60150000Y-30300000D01*
X60200000Y-30200000D01*
X60400000Y-30200000D01*
X60450000Y-30300000D01*
G37*
%TD*%
M02*
