%TF.GenerationSoftware,KiCad,Pcbnew,(5.1.10-1-10_14)*%
%TF.CreationDate,2022-03-14T21:26:53-07:00*%
%TF.ProjectId,rd53b_datapigtail_39pos,72643533-625f-4646-9174-617069677461,1.1*%
%TF.SameCoordinates,Original*%
%TF.FileFunction,Copper,L1,Top*%
%TF.FilePolarity,Positive*%
%FSLAX46Y46*%
G04 Gerber Fmt 4.6, Leading zero omitted, Abs format (unit mm)*
G04 Created by KiCad (PCBNEW (5.1.10-1-10_14)) date 2022-03-14 21:26:53*
%MOMM*%
%LPD*%
G01*
G04 APERTURE LIST*
%TA.AperFunction,SMDPad,CuDef*%
%ADD10C,0.100000*%
%TD*%
%TA.AperFunction,ViaPad*%
%ADD11C,0.350000*%
%TD*%
%TA.AperFunction,Conductor*%
%ADD12C,0.100000*%
%TD*%
G04 APERTURE END LIST*
%TA.AperFunction,SMDPad,CuDef*%
D10*
%TO.P,U2,39*%
%TO.N,/MUX_Chip2*%
G36*
X60150000Y-179700000D02*
G01*
X60150000Y-178900000D01*
X60200000Y-178800000D01*
X60250000Y-178800000D01*
X60250000Y-176800000D01*
X60350000Y-176800000D01*
X60350000Y-178800000D01*
X60400000Y-178800000D01*
X60450000Y-178900000D01*
X60450000Y-179700000D01*
X60400000Y-179800000D01*
X60200000Y-179800000D01*
X60150000Y-179700000D01*
G37*
%TD.AperFunction*%
%TA.AperFunction,SMDPad,CuDef*%
%TO.P,U2,37*%
%TO.N,/LVDS0_Chip1_P*%
G36*
X60750000Y-179700000D02*
G01*
X60750000Y-178900000D01*
X60800000Y-178800000D01*
X60850000Y-178800000D01*
X60850000Y-176800000D01*
X60950000Y-176800000D01*
X60950000Y-178800000D01*
X61000000Y-178800000D01*
X61050000Y-178900000D01*
X61050000Y-179700000D01*
X61000000Y-179800000D01*
X60800000Y-179800000D01*
X60750000Y-179700000D01*
G37*
%TD.AperFunction*%
%TA.AperFunction,SMDPad,CuDef*%
%TO.P,U2,38*%
%TO.N,/LVDS0_Chip1_N*%
G36*
X60550000Y-178800000D02*
G01*
X60500000Y-178800000D01*
X60450000Y-178700000D01*
X60450000Y-177900000D01*
X60500000Y-177800000D01*
X60550000Y-177800000D01*
X60550000Y-176800000D01*
X60650000Y-176800000D01*
X60650000Y-177800000D01*
X60700000Y-177800000D01*
X60750000Y-177900000D01*
X60750000Y-178700000D01*
X60700000Y-178800000D01*
X60650000Y-178800000D01*
X60650000Y-179800000D01*
X60550000Y-179800000D01*
X60550000Y-178800000D01*
G37*
%TD.AperFunction*%
%TA.AperFunction,SMDPad,CuDef*%
%TO.P,U2,35*%
%TO.N,/GTX0_Chip2_N*%
G36*
X61350000Y-179700000D02*
G01*
X61350000Y-178900000D01*
X61400000Y-178800000D01*
X61450000Y-178800000D01*
X61450000Y-176800000D01*
X61550000Y-176800000D01*
X61550000Y-178800000D01*
X61600000Y-178800000D01*
X61650000Y-178900000D01*
X61650000Y-179700000D01*
X61600000Y-179800000D01*
X61400000Y-179800000D01*
X61350000Y-179700000D01*
G37*
%TD.AperFunction*%
%TA.AperFunction,SMDPad,CuDef*%
%TO.P,U2,36*%
%TO.N,/GND*%
G36*
X61150000Y-178800000D02*
G01*
X61100000Y-178800000D01*
X61050000Y-178700000D01*
X61050000Y-177900000D01*
X61100000Y-177800000D01*
X61150000Y-177800000D01*
X61150000Y-176800000D01*
X61250000Y-176800000D01*
X61250000Y-177800000D01*
X61300000Y-177800000D01*
X61350000Y-177900000D01*
X61350000Y-178700000D01*
X61300000Y-178800000D01*
X61250000Y-178800000D01*
X61250000Y-179800000D01*
X61150000Y-179800000D01*
X61150000Y-178800000D01*
G37*
%TD.AperFunction*%
%TA.AperFunction,SMDPad,CuDef*%
%TO.P,U2,33*%
G36*
X61950000Y-179700000D02*
G01*
X61950000Y-178900000D01*
X62000000Y-178800000D01*
X62050000Y-178800000D01*
X62050000Y-176800000D01*
X62150000Y-176800000D01*
X62150000Y-178800000D01*
X62200000Y-178800000D01*
X62250000Y-178900000D01*
X62250000Y-179700000D01*
X62200000Y-179800000D01*
X62000000Y-179800000D01*
X61950000Y-179700000D01*
G37*
%TD.AperFunction*%
%TA.AperFunction,SMDPad,CuDef*%
%TO.P,U2,34*%
%TO.N,/GTX0_Chip2_P*%
G36*
X61750000Y-178800000D02*
G01*
X61700000Y-178800000D01*
X61650000Y-178700000D01*
X61650000Y-177900000D01*
X61700000Y-177800000D01*
X61750000Y-177800000D01*
X61750000Y-176800000D01*
X61850000Y-176800000D01*
X61850000Y-177800000D01*
X61900000Y-177800000D01*
X61950000Y-177900000D01*
X61950000Y-178700000D01*
X61900000Y-178800000D01*
X61850000Y-178800000D01*
X61850000Y-179800000D01*
X61750000Y-179800000D01*
X61750000Y-178800000D01*
G37*
%TD.AperFunction*%
%TA.AperFunction,SMDPad,CuDef*%
%TO.P,U2,32*%
%TO.N,/GTX3_Chip1_P*%
G36*
X62350000Y-178800000D02*
G01*
X62300000Y-178800000D01*
X62250000Y-178700000D01*
X62250000Y-177900000D01*
X62300000Y-177800000D01*
X62350000Y-177800000D01*
X62350000Y-176800000D01*
X62450000Y-176800000D01*
X62450000Y-177800000D01*
X62500000Y-177800000D01*
X62550000Y-177900000D01*
X62550000Y-178700000D01*
X62500000Y-178800000D01*
X62450000Y-178800000D01*
X62450000Y-179800000D01*
X62350000Y-179800000D01*
X62350000Y-178800000D01*
G37*
%TD.AperFunction*%
%TA.AperFunction,SMDPad,CuDef*%
%TO.P,U2,31*%
%TO.N,/GTX3_Chip1_N*%
G36*
X62550000Y-179700000D02*
G01*
X62550000Y-178900000D01*
X62600000Y-178800000D01*
X62650000Y-178800000D01*
X62650000Y-176800000D01*
X62750000Y-176800000D01*
X62750000Y-178800000D01*
X62800000Y-178800000D01*
X62850000Y-178900000D01*
X62850000Y-179700000D01*
X62800000Y-179800000D01*
X62600000Y-179800000D01*
X62550000Y-179700000D01*
G37*
%TD.AperFunction*%
%TA.AperFunction,SMDPad,CuDef*%
%TO.P,U2,17*%
%TO.N,/GTX2_Chip3_P*%
G36*
X66750000Y-179700000D02*
G01*
X66750000Y-178900000D01*
X66800000Y-178800000D01*
X66850000Y-178800000D01*
X66850000Y-176800000D01*
X66950000Y-176800000D01*
X66950000Y-178800000D01*
X67000000Y-178800000D01*
X67050000Y-178900000D01*
X67050000Y-179700000D01*
X67000000Y-179800000D01*
X66800000Y-179800000D01*
X66750000Y-179700000D01*
G37*
%TD.AperFunction*%
%TA.AperFunction,SMDPad,CuDef*%
%TO.P,U2,18*%
%TO.N,/GTX2_Chip3_N*%
G36*
X66550000Y-178800000D02*
G01*
X66500000Y-178800000D01*
X66450000Y-178700000D01*
X66450000Y-177900000D01*
X66500000Y-177800000D01*
X66550000Y-177800000D01*
X66550000Y-176800000D01*
X66650000Y-176800000D01*
X66650000Y-177800000D01*
X66700000Y-177800000D01*
X66750000Y-177900000D01*
X66750000Y-178700000D01*
X66700000Y-178800000D01*
X66650000Y-178800000D01*
X66650000Y-179800000D01*
X66550000Y-179800000D01*
X66550000Y-178800000D01*
G37*
%TD.AperFunction*%
%TA.AperFunction,SMDPad,CuDef*%
%TO.P,U2,29*%
%TO.N,/GTX1_Chip2_N*%
G36*
X63150000Y-179700000D02*
G01*
X63150000Y-178900000D01*
X63200000Y-178800000D01*
X63250000Y-178800000D01*
X63250000Y-176800000D01*
X63350000Y-176800000D01*
X63350000Y-178800000D01*
X63400000Y-178800000D01*
X63450000Y-178900000D01*
X63450000Y-179700000D01*
X63400000Y-179800000D01*
X63200000Y-179800000D01*
X63150000Y-179700000D01*
G37*
%TD.AperFunction*%
%TA.AperFunction,SMDPad,CuDef*%
%TO.P,U2,30*%
%TO.N,/GND*%
G36*
X62950000Y-178800000D02*
G01*
X62900000Y-178800000D01*
X62850000Y-178700000D01*
X62850000Y-177900000D01*
X62900000Y-177800000D01*
X62950000Y-177800000D01*
X62950000Y-176800000D01*
X63050000Y-176800000D01*
X63050000Y-177800000D01*
X63100000Y-177800000D01*
X63150000Y-177900000D01*
X63150000Y-178700000D01*
X63100000Y-178800000D01*
X63050000Y-178800000D01*
X63050000Y-179800000D01*
X62950000Y-179800000D01*
X62950000Y-178800000D01*
G37*
%TD.AperFunction*%
%TA.AperFunction,SMDPad,CuDef*%
%TO.P,U2,21*%
%TO.N,/LP_EN*%
G36*
X65550000Y-179700000D02*
G01*
X65550000Y-178900000D01*
X65600000Y-178800000D01*
X65650000Y-178800000D01*
X65650000Y-176800000D01*
X65750000Y-176800000D01*
X65750000Y-178800000D01*
X65800000Y-178800000D01*
X65850000Y-178900000D01*
X65850000Y-179700000D01*
X65800000Y-179800000D01*
X65600000Y-179800000D01*
X65550000Y-179700000D01*
G37*
%TD.AperFunction*%
%TA.AperFunction,SMDPad,CuDef*%
%TO.P,U2,22*%
%TO.N,/CHIP_ID_N*%
G36*
X65350000Y-178800000D02*
G01*
X65300000Y-178800000D01*
X65250000Y-178700000D01*
X65250000Y-177900000D01*
X65300000Y-177800000D01*
X65350000Y-177800000D01*
X65350000Y-176800000D01*
X65450000Y-176800000D01*
X65450000Y-177800000D01*
X65500000Y-177800000D01*
X65550000Y-177900000D01*
X65550000Y-178700000D01*
X65500000Y-178800000D01*
X65450000Y-178800000D01*
X65450000Y-179800000D01*
X65350000Y-179800000D01*
X65350000Y-178800000D01*
G37*
%TD.AperFunction*%
%TA.AperFunction,SMDPad,CuDef*%
%TO.P,U2,23*%
%TO.N,/CHIP_ID_P*%
G36*
X64950000Y-179700000D02*
G01*
X64950000Y-178900000D01*
X65000000Y-178800000D01*
X65050000Y-178800000D01*
X65050000Y-176800000D01*
X65150000Y-176800000D01*
X65150000Y-178800000D01*
X65200000Y-178800000D01*
X65250000Y-178900000D01*
X65250000Y-179700000D01*
X65200000Y-179800000D01*
X65000000Y-179800000D01*
X64950000Y-179700000D01*
G37*
%TD.AperFunction*%
%TA.AperFunction,SMDPad,CuDef*%
%TO.P,U2,24*%
%TO.N,/GND_C*%
G36*
X64750000Y-178800000D02*
G01*
X64700000Y-178800000D01*
X64650000Y-178700000D01*
X64650000Y-177900000D01*
X64700000Y-177800000D01*
X64750000Y-177800000D01*
X64750000Y-176800000D01*
X64850000Y-176800000D01*
X64850000Y-177800000D01*
X64900000Y-177800000D01*
X64950000Y-177900000D01*
X64950000Y-178700000D01*
X64900000Y-178800000D01*
X64850000Y-178800000D01*
X64850000Y-179800000D01*
X64750000Y-179800000D01*
X64750000Y-178800000D01*
G37*
%TD.AperFunction*%
%TA.AperFunction,SMDPad,CuDef*%
%TO.P,U2,19*%
%TO.N,/MUX_Chip3*%
G36*
X66150000Y-179700000D02*
G01*
X66150000Y-178900000D01*
X66200000Y-178800000D01*
X66250000Y-178800000D01*
X66250000Y-176800000D01*
X66350000Y-176800000D01*
X66350000Y-178800000D01*
X66400000Y-178800000D01*
X66450000Y-178900000D01*
X66450000Y-179700000D01*
X66400000Y-179800000D01*
X66200000Y-179800000D01*
X66150000Y-179700000D01*
G37*
%TD.AperFunction*%
%TA.AperFunction,SMDPad,CuDef*%
%TO.P,U2,20*%
%TO.N,/MUX_Chip1*%
G36*
X65950000Y-178800000D02*
G01*
X65900000Y-178800000D01*
X65850000Y-178700000D01*
X65850000Y-177900000D01*
X65900000Y-177800000D01*
X65950000Y-177800000D01*
X65950000Y-176800000D01*
X66050000Y-176800000D01*
X66050000Y-177800000D01*
X66100000Y-177800000D01*
X66150000Y-177900000D01*
X66150000Y-178700000D01*
X66100000Y-178800000D01*
X66050000Y-178800000D01*
X66050000Y-179800000D01*
X65950000Y-179800000D01*
X65950000Y-178800000D01*
G37*
%TD.AperFunction*%
%TA.AperFunction,SMDPad,CuDef*%
%TO.P,U2,28*%
%TO.N,/GTX1_Chip2_P*%
G36*
X63550000Y-178800000D02*
G01*
X63500000Y-178800000D01*
X63450000Y-178700000D01*
X63450000Y-177900000D01*
X63500000Y-177800000D01*
X63550000Y-177800000D01*
X63550000Y-176800000D01*
X63650000Y-176800000D01*
X63650000Y-177800000D01*
X63700000Y-177800000D01*
X63750000Y-177900000D01*
X63750000Y-178700000D01*
X63700000Y-178800000D01*
X63650000Y-178800000D01*
X63650000Y-179800000D01*
X63550000Y-179800000D01*
X63550000Y-178800000D01*
G37*
%TD.AperFunction*%
%TA.AperFunction,SMDPad,CuDef*%
%TO.P,U2,25*%
%TO.N,/GTX2_Chip1_N*%
G36*
X64350000Y-179700000D02*
G01*
X64350000Y-178900000D01*
X64400000Y-178800000D01*
X64450000Y-178800000D01*
X64450000Y-176800000D01*
X64550000Y-176800000D01*
X64550000Y-178800000D01*
X64600000Y-178800000D01*
X64650000Y-178900000D01*
X64650000Y-179700000D01*
X64600000Y-179800000D01*
X64400000Y-179800000D01*
X64350000Y-179700000D01*
G37*
%TD.AperFunction*%
%TA.AperFunction,SMDPad,CuDef*%
%TO.P,U2,26*%
%TO.N,/GTX2_Chip1_P*%
G36*
X64150000Y-178800000D02*
G01*
X64100000Y-178800000D01*
X64050000Y-178700000D01*
X64050000Y-177900000D01*
X64100000Y-177800000D01*
X64150000Y-177800000D01*
X64150000Y-176800000D01*
X64250000Y-176800000D01*
X64250000Y-177800000D01*
X64300000Y-177800000D01*
X64350000Y-177900000D01*
X64350000Y-178700000D01*
X64300000Y-178800000D01*
X64250000Y-178800000D01*
X64250000Y-179800000D01*
X64150000Y-179800000D01*
X64150000Y-178800000D01*
G37*
%TD.AperFunction*%
%TA.AperFunction,SMDPad,CuDef*%
%TO.P,U2,27*%
%TO.N,/GND*%
G36*
X63750000Y-179700000D02*
G01*
X63750000Y-178900000D01*
X63800000Y-178800000D01*
X63850000Y-178800000D01*
X63850000Y-176800000D01*
X63950000Y-176800000D01*
X63950000Y-178800000D01*
X64000000Y-178800000D01*
X64050000Y-178900000D01*
X64050000Y-179700000D01*
X64000000Y-179800000D01*
X63800000Y-179800000D01*
X63750000Y-179700000D01*
G37*
%TD.AperFunction*%
%TA.AperFunction,SMDPad,CuDef*%
%TO.P,U2,16*%
%TO.N,/GND_S*%
G36*
X67150000Y-178800000D02*
G01*
X67100000Y-178800000D01*
X67050000Y-178700000D01*
X67050000Y-177900000D01*
X67100000Y-177800000D01*
X67150000Y-177800000D01*
X67150000Y-176800000D01*
X67250000Y-176800000D01*
X67250000Y-177800000D01*
X67300000Y-177800000D01*
X67350000Y-177900000D01*
X67350000Y-178700000D01*
X67300000Y-178800000D01*
X67250000Y-178800000D01*
X67250000Y-179800000D01*
X67150000Y-179800000D01*
X67150000Y-178800000D01*
G37*
%TD.AperFunction*%
%TA.AperFunction,SMDPad,CuDef*%
%TO.P,U2,13*%
%TO.N,/GND*%
G36*
X67950000Y-179700000D02*
G01*
X67950000Y-178900000D01*
X68000000Y-178800000D01*
X68050000Y-178800000D01*
X68050000Y-176800000D01*
X68150000Y-176800000D01*
X68150000Y-178800000D01*
X68200000Y-178800000D01*
X68250000Y-178900000D01*
X68250000Y-179700000D01*
X68200000Y-179800000D01*
X68000000Y-179800000D01*
X67950000Y-179700000D01*
G37*
%TD.AperFunction*%
%TA.AperFunction,SMDPad,CuDef*%
%TO.P,U2,14*%
%TO.N,/GTX1_Chip4_N*%
G36*
X67750000Y-178800000D02*
G01*
X67700000Y-178800000D01*
X67650000Y-178700000D01*
X67650000Y-177900000D01*
X67700000Y-177800000D01*
X67750000Y-177800000D01*
X67750000Y-176800000D01*
X67850000Y-176800000D01*
X67850000Y-177800000D01*
X67900000Y-177800000D01*
X67950000Y-177900000D01*
X67950000Y-178700000D01*
X67900000Y-178800000D01*
X67850000Y-178800000D01*
X67850000Y-179800000D01*
X67750000Y-179800000D01*
X67750000Y-178800000D01*
G37*
%TD.AperFunction*%
%TA.AperFunction,SMDPad,CuDef*%
%TO.P,U2,15*%
%TO.N,/GTX1_Chip4_P*%
G36*
X67350000Y-179700000D02*
G01*
X67350000Y-178900000D01*
X67400000Y-178800000D01*
X67450000Y-178800000D01*
X67450000Y-176800000D01*
X67550000Y-176800000D01*
X67550000Y-178800000D01*
X67600000Y-178800000D01*
X67650000Y-178900000D01*
X67650000Y-179700000D01*
X67600000Y-179800000D01*
X67400000Y-179800000D01*
X67350000Y-179700000D01*
G37*
%TD.AperFunction*%
%TA.AperFunction,SMDPad,CuDef*%
%TO.P,U2,9*%
%TO.N,/GTX0_Chip4_P*%
G36*
X69150000Y-179700000D02*
G01*
X69150000Y-178900000D01*
X69200000Y-178800000D01*
X69250000Y-178800000D01*
X69250000Y-176800000D01*
X69350000Y-176800000D01*
X69350000Y-178800000D01*
X69400000Y-178800000D01*
X69450000Y-178900000D01*
X69450000Y-179700000D01*
X69400000Y-179800000D01*
X69200000Y-179800000D01*
X69150000Y-179700000D01*
G37*
%TD.AperFunction*%
%TA.AperFunction,SMDPad,CuDef*%
%TO.P,U2,10*%
%TO.N,/GND*%
G36*
X68950000Y-178800000D02*
G01*
X68900000Y-178800000D01*
X68850000Y-178700000D01*
X68850000Y-177900000D01*
X68900000Y-177800000D01*
X68950000Y-177800000D01*
X68950000Y-176800000D01*
X69050000Y-176800000D01*
X69050000Y-177800000D01*
X69100000Y-177800000D01*
X69150000Y-177900000D01*
X69150000Y-178700000D01*
X69100000Y-178800000D01*
X69050000Y-178800000D01*
X69050000Y-179800000D01*
X68950000Y-179800000D01*
X68950000Y-178800000D01*
G37*
%TD.AperFunction*%
%TA.AperFunction,SMDPad,CuDef*%
%TO.P,U2,11*%
%TO.N,/GTX3_Chip3_P*%
G36*
X68550000Y-179700000D02*
G01*
X68550000Y-178900000D01*
X68600000Y-178800000D01*
X68650000Y-178800000D01*
X68650000Y-176800000D01*
X68750000Y-176800000D01*
X68750000Y-178800000D01*
X68800000Y-178800000D01*
X68850000Y-178900000D01*
X68850000Y-179700000D01*
X68800000Y-179800000D01*
X68600000Y-179800000D01*
X68550000Y-179700000D01*
G37*
%TD.AperFunction*%
%TA.AperFunction,SMDPad,CuDef*%
%TO.P,U2,12*%
%TO.N,/GTX3_Chip3_N*%
G36*
X68350000Y-178800000D02*
G01*
X68300000Y-178800000D01*
X68250000Y-178700000D01*
X68250000Y-177900000D01*
X68300000Y-177800000D01*
X68350000Y-177800000D01*
X68350000Y-176800000D01*
X68450000Y-176800000D01*
X68450000Y-177800000D01*
X68500000Y-177800000D01*
X68550000Y-177900000D01*
X68550000Y-178700000D01*
X68500000Y-178800000D01*
X68450000Y-178800000D01*
X68450000Y-179800000D01*
X68350000Y-179800000D01*
X68350000Y-178800000D01*
G37*
%TD.AperFunction*%
%TA.AperFunction,SMDPad,CuDef*%
%TO.P,U2,5*%
%TO.N,/CMD_P*%
G36*
X70350000Y-179700000D02*
G01*
X70350000Y-178900000D01*
X70400000Y-178800000D01*
X70450000Y-178800000D01*
X70450000Y-176800000D01*
X70550000Y-176800000D01*
X70550000Y-178800000D01*
X70600000Y-178800000D01*
X70650000Y-178900000D01*
X70650000Y-179700000D01*
X70600000Y-179800000D01*
X70400000Y-179800000D01*
X70350000Y-179700000D01*
G37*
%TD.AperFunction*%
%TA.AperFunction,SMDPad,CuDef*%
%TO.P,U2,6*%
%TO.N,/CMD_N*%
G36*
X70150000Y-178800000D02*
G01*
X70100000Y-178800000D01*
X70050000Y-178700000D01*
X70050000Y-177900000D01*
X70100000Y-177800000D01*
X70150000Y-177800000D01*
X70150000Y-176800000D01*
X70250000Y-176800000D01*
X70250000Y-177800000D01*
X70300000Y-177800000D01*
X70350000Y-177900000D01*
X70350000Y-178700000D01*
X70300000Y-178800000D01*
X70250000Y-178800000D01*
X70250000Y-179800000D01*
X70150000Y-179800000D01*
X70150000Y-178800000D01*
G37*
%TD.AperFunction*%
%TA.AperFunction,SMDPad,CuDef*%
%TO.P,U2,7*%
%TO.N,/GND*%
G36*
X69750000Y-179700000D02*
G01*
X69750000Y-178900000D01*
X69800000Y-178800000D01*
X69850000Y-178800000D01*
X69850000Y-176800000D01*
X69950000Y-176800000D01*
X69950000Y-178800000D01*
X70000000Y-178800000D01*
X70050000Y-178900000D01*
X70050000Y-179700000D01*
X70000000Y-179800000D01*
X69800000Y-179800000D01*
X69750000Y-179700000D01*
G37*
%TD.AperFunction*%
%TA.AperFunction,SMDPad,CuDef*%
%TO.P,U2,8*%
%TO.N,/GTX0_Chip4_N*%
G36*
X69550000Y-178800000D02*
G01*
X69500000Y-178800000D01*
X69450000Y-178700000D01*
X69450000Y-177900000D01*
X69500000Y-177800000D01*
X69550000Y-177800000D01*
X69550000Y-176800000D01*
X69650000Y-176800000D01*
X69650000Y-177800000D01*
X69700000Y-177800000D01*
X69750000Y-177900000D01*
X69750000Y-178700000D01*
X69700000Y-178800000D01*
X69650000Y-178800000D01*
X69650000Y-179800000D01*
X69550000Y-179800000D01*
X69550000Y-178800000D01*
G37*
%TD.AperFunction*%
%TA.AperFunction,SMDPad,CuDef*%
%TO.P,U2,4*%
%TO.N,/GND*%
G36*
X70750000Y-178800000D02*
G01*
X70700000Y-178800000D01*
X70650000Y-178700000D01*
X70650000Y-177900000D01*
X70700000Y-177800000D01*
X70750000Y-177800000D01*
X70750000Y-176800000D01*
X70850000Y-176800000D01*
X70850000Y-177800000D01*
X70900000Y-177800000D01*
X70950000Y-177900000D01*
X70950000Y-178700000D01*
X70900000Y-178800000D01*
X70850000Y-178800000D01*
X70850000Y-179800000D01*
X70750000Y-179800000D01*
X70750000Y-178800000D01*
G37*
%TD.AperFunction*%
%TA.AperFunction,SMDPad,CuDef*%
%TO.P,U2,3*%
%TO.N,/LVDS0_Chip3_P*%
G36*
X70950000Y-179700000D02*
G01*
X70950000Y-178900000D01*
X71000000Y-178800000D01*
X71050000Y-178800000D01*
X71050000Y-176800000D01*
X71150000Y-176800000D01*
X71150000Y-178800000D01*
X71200000Y-178800000D01*
X71250000Y-178900000D01*
X71250000Y-179700000D01*
X71200000Y-179800000D01*
X71000000Y-179800000D01*
X70950000Y-179700000D01*
G37*
%TD.AperFunction*%
%TA.AperFunction,SMDPad,CuDef*%
%TO.P,U2,2*%
%TO.N,/LVDS0_Chip3_N*%
G36*
X71350000Y-178800000D02*
G01*
X71300000Y-178800000D01*
X71250000Y-178700000D01*
X71250000Y-177900000D01*
X71300000Y-177800000D01*
X71350000Y-177800000D01*
X71350000Y-176800000D01*
X71450000Y-176800000D01*
X71450000Y-177800000D01*
X71500000Y-177800000D01*
X71550000Y-177900000D01*
X71550000Y-178700000D01*
X71500000Y-178800000D01*
X71450000Y-178800000D01*
X71450000Y-179800000D01*
X71350000Y-179800000D01*
X71350000Y-178800000D01*
G37*
%TD.AperFunction*%
%TA.AperFunction,SMDPad,CuDef*%
%TO.P,U2,1*%
%TO.N,/MUX_Chip4*%
G36*
X71550000Y-179700000D02*
G01*
X71550000Y-178900000D01*
X71600000Y-178800000D01*
X71650000Y-178800000D01*
X71650000Y-176800000D01*
X71750000Y-176800000D01*
X71750000Y-178800000D01*
X71800000Y-178800000D01*
X71850000Y-178900000D01*
X71850000Y-179700000D01*
X71800000Y-179800000D01*
X71600000Y-179800000D01*
X71550000Y-179700000D01*
G37*
%TD.AperFunction*%
%TD*%
%TA.AperFunction,SMDPad,CuDef*%
%TO.P,U1,39*%
%TO.N,/MUX_Chip4*%
G36*
X71850000Y-30300000D02*
G01*
X71850000Y-31100000D01*
X71800000Y-31200000D01*
X71750000Y-31200000D01*
X71750000Y-33200000D01*
X71650000Y-33200000D01*
X71650000Y-31200000D01*
X71600000Y-31200000D01*
X71550000Y-31100000D01*
X71550000Y-30300000D01*
X71600000Y-30200000D01*
X71800000Y-30200000D01*
X71850000Y-30300000D01*
G37*
%TD.AperFunction*%
%TA.AperFunction,SMDPad,CuDef*%
%TO.P,U1,37*%
%TO.N,/LVDS0_Chip3_P*%
G36*
X71250000Y-30300000D02*
G01*
X71250000Y-31100000D01*
X71200000Y-31200000D01*
X71150000Y-31200000D01*
X71150000Y-33200000D01*
X71050000Y-33200000D01*
X71050000Y-31200000D01*
X71000000Y-31200000D01*
X70950000Y-31100000D01*
X70950000Y-30300000D01*
X71000000Y-30200000D01*
X71200000Y-30200000D01*
X71250000Y-30300000D01*
G37*
%TD.AperFunction*%
%TA.AperFunction,SMDPad,CuDef*%
%TO.P,U1,38*%
%TO.N,/LVDS0_Chip3_N*%
G36*
X71450000Y-31200000D02*
G01*
X71500000Y-31200000D01*
X71550000Y-31300000D01*
X71550000Y-32100000D01*
X71500000Y-32200000D01*
X71450000Y-32200000D01*
X71450000Y-33200000D01*
X71350000Y-33200000D01*
X71350000Y-32200000D01*
X71300000Y-32200000D01*
X71250000Y-32100000D01*
X71250000Y-31300000D01*
X71300000Y-31200000D01*
X71350000Y-31200000D01*
X71350000Y-30200000D01*
X71450000Y-30200000D01*
X71450000Y-31200000D01*
G37*
%TD.AperFunction*%
%TA.AperFunction,SMDPad,CuDef*%
%TO.P,U1,35*%
%TO.N,/CMD_P*%
G36*
X70650000Y-30300000D02*
G01*
X70650000Y-31100000D01*
X70600000Y-31200000D01*
X70550000Y-31200000D01*
X70550000Y-33200000D01*
X70450000Y-33200000D01*
X70450000Y-31200000D01*
X70400000Y-31200000D01*
X70350000Y-31100000D01*
X70350000Y-30300000D01*
X70400000Y-30200000D01*
X70600000Y-30200000D01*
X70650000Y-30300000D01*
G37*
%TD.AperFunction*%
%TA.AperFunction,SMDPad,CuDef*%
%TO.P,U1,36*%
%TO.N,/GND*%
G36*
X70850000Y-31200000D02*
G01*
X70900000Y-31200000D01*
X70950000Y-31300000D01*
X70950000Y-32100000D01*
X70900000Y-32200000D01*
X70850000Y-32200000D01*
X70850000Y-33200000D01*
X70750000Y-33200000D01*
X70750000Y-32200000D01*
X70700000Y-32200000D01*
X70650000Y-32100000D01*
X70650000Y-31300000D01*
X70700000Y-31200000D01*
X70750000Y-31200000D01*
X70750000Y-30200000D01*
X70850000Y-30200000D01*
X70850000Y-31200000D01*
G37*
%TD.AperFunction*%
%TA.AperFunction,SMDPad,CuDef*%
%TO.P,U1,33*%
G36*
X70050000Y-30300000D02*
G01*
X70050000Y-31100000D01*
X70000000Y-31200000D01*
X69950000Y-31200000D01*
X69950000Y-33200000D01*
X69850000Y-33200000D01*
X69850000Y-31200000D01*
X69800000Y-31200000D01*
X69750000Y-31100000D01*
X69750000Y-30300000D01*
X69800000Y-30200000D01*
X70000000Y-30200000D01*
X70050000Y-30300000D01*
G37*
%TD.AperFunction*%
%TA.AperFunction,SMDPad,CuDef*%
%TO.P,U1,34*%
%TO.N,/CMD_N*%
G36*
X70250000Y-31200000D02*
G01*
X70300000Y-31200000D01*
X70350000Y-31300000D01*
X70350000Y-32100000D01*
X70300000Y-32200000D01*
X70250000Y-32200000D01*
X70250000Y-33200000D01*
X70150000Y-33200000D01*
X70150000Y-32200000D01*
X70100000Y-32200000D01*
X70050000Y-32100000D01*
X70050000Y-31300000D01*
X70100000Y-31200000D01*
X70150000Y-31200000D01*
X70150000Y-30200000D01*
X70250000Y-30200000D01*
X70250000Y-31200000D01*
G37*
%TD.AperFunction*%
%TA.AperFunction,SMDPad,CuDef*%
%TO.P,U1,32*%
%TO.N,/GTX0_Chip4_N*%
G36*
X69650000Y-31200000D02*
G01*
X69700000Y-31200000D01*
X69750000Y-31300000D01*
X69750000Y-32100000D01*
X69700000Y-32200000D01*
X69650000Y-32200000D01*
X69650000Y-33200000D01*
X69550000Y-33200000D01*
X69550000Y-32200000D01*
X69500000Y-32200000D01*
X69450000Y-32100000D01*
X69450000Y-31300000D01*
X69500000Y-31200000D01*
X69550000Y-31200000D01*
X69550000Y-30200000D01*
X69650000Y-30200000D01*
X69650000Y-31200000D01*
G37*
%TD.AperFunction*%
%TA.AperFunction,SMDPad,CuDef*%
%TO.P,U1,31*%
%TO.N,/GTX0_Chip4_P*%
G36*
X69450000Y-30300000D02*
G01*
X69450000Y-31100000D01*
X69400000Y-31200000D01*
X69350000Y-31200000D01*
X69350000Y-33200000D01*
X69250000Y-33200000D01*
X69250000Y-31200000D01*
X69200000Y-31200000D01*
X69150000Y-31100000D01*
X69150000Y-30300000D01*
X69200000Y-30200000D01*
X69400000Y-30200000D01*
X69450000Y-30300000D01*
G37*
%TD.AperFunction*%
%TA.AperFunction,SMDPad,CuDef*%
%TO.P,U1,17*%
%TO.N,/CHIP_ID_P*%
G36*
X65250000Y-30300000D02*
G01*
X65250000Y-31100000D01*
X65200000Y-31200000D01*
X65150000Y-31200000D01*
X65150000Y-33200000D01*
X65050000Y-33200000D01*
X65050000Y-31200000D01*
X65000000Y-31200000D01*
X64950000Y-31100000D01*
X64950000Y-30300000D01*
X65000000Y-30200000D01*
X65200000Y-30200000D01*
X65250000Y-30300000D01*
G37*
%TD.AperFunction*%
%TA.AperFunction,SMDPad,CuDef*%
%TO.P,U1,18*%
%TO.N,/CHIP_ID_N*%
G36*
X65450000Y-31200000D02*
G01*
X65500000Y-31200000D01*
X65550000Y-31300000D01*
X65550000Y-32100000D01*
X65500000Y-32200000D01*
X65450000Y-32200000D01*
X65450000Y-33200000D01*
X65350000Y-33200000D01*
X65350000Y-32200000D01*
X65300000Y-32200000D01*
X65250000Y-32100000D01*
X65250000Y-31300000D01*
X65300000Y-31200000D01*
X65350000Y-31200000D01*
X65350000Y-30200000D01*
X65450000Y-30200000D01*
X65450000Y-31200000D01*
G37*
%TD.AperFunction*%
%TA.AperFunction,SMDPad,CuDef*%
%TO.P,U1,29*%
%TO.N,/GTX3_Chip3_P*%
G36*
X68850000Y-30300000D02*
G01*
X68850000Y-31100000D01*
X68800000Y-31200000D01*
X68750000Y-31200000D01*
X68750000Y-33200000D01*
X68650000Y-33200000D01*
X68650000Y-31200000D01*
X68600000Y-31200000D01*
X68550000Y-31100000D01*
X68550000Y-30300000D01*
X68600000Y-30200000D01*
X68800000Y-30200000D01*
X68850000Y-30300000D01*
G37*
%TD.AperFunction*%
%TA.AperFunction,SMDPad,CuDef*%
%TO.P,U1,30*%
%TO.N,/GND*%
G36*
X69050000Y-31200000D02*
G01*
X69100000Y-31200000D01*
X69150000Y-31300000D01*
X69150000Y-32100000D01*
X69100000Y-32200000D01*
X69050000Y-32200000D01*
X69050000Y-33200000D01*
X68950000Y-33200000D01*
X68950000Y-32200000D01*
X68900000Y-32200000D01*
X68850000Y-32100000D01*
X68850000Y-31300000D01*
X68900000Y-31200000D01*
X68950000Y-31200000D01*
X68950000Y-30200000D01*
X69050000Y-30200000D01*
X69050000Y-31200000D01*
G37*
%TD.AperFunction*%
%TA.AperFunction,SMDPad,CuDef*%
%TO.P,U1,21*%
%TO.N,/MUX_Chip3*%
G36*
X66450000Y-30300000D02*
G01*
X66450000Y-31100000D01*
X66400000Y-31200000D01*
X66350000Y-31200000D01*
X66350000Y-33200000D01*
X66250000Y-33200000D01*
X66250000Y-31200000D01*
X66200000Y-31200000D01*
X66150000Y-31100000D01*
X66150000Y-30300000D01*
X66200000Y-30200000D01*
X66400000Y-30200000D01*
X66450000Y-30300000D01*
G37*
%TD.AperFunction*%
%TA.AperFunction,SMDPad,CuDef*%
%TO.P,U1,22*%
%TO.N,/GTX2_Chip3_N*%
G36*
X66650000Y-31200000D02*
G01*
X66700000Y-31200000D01*
X66750000Y-31300000D01*
X66750000Y-32100000D01*
X66700000Y-32200000D01*
X66650000Y-32200000D01*
X66650000Y-33200000D01*
X66550000Y-33200000D01*
X66550000Y-32200000D01*
X66500000Y-32200000D01*
X66450000Y-32100000D01*
X66450000Y-31300000D01*
X66500000Y-31200000D01*
X66550000Y-31200000D01*
X66550000Y-30200000D01*
X66650000Y-30200000D01*
X66650000Y-31200000D01*
G37*
%TD.AperFunction*%
%TA.AperFunction,SMDPad,CuDef*%
%TO.P,U1,23*%
%TO.N,/GTX2_Chip3_P*%
G36*
X67050000Y-30300000D02*
G01*
X67050000Y-31100000D01*
X67000000Y-31200000D01*
X66950000Y-31200000D01*
X66950000Y-33200000D01*
X66850000Y-33200000D01*
X66850000Y-31200000D01*
X66800000Y-31200000D01*
X66750000Y-31100000D01*
X66750000Y-30300000D01*
X66800000Y-30200000D01*
X67000000Y-30200000D01*
X67050000Y-30300000D01*
G37*
%TD.AperFunction*%
%TA.AperFunction,SMDPad,CuDef*%
%TO.P,U1,24*%
%TO.N,/GND_S*%
G36*
X67250000Y-31200000D02*
G01*
X67300000Y-31200000D01*
X67350000Y-31300000D01*
X67350000Y-32100000D01*
X67300000Y-32200000D01*
X67250000Y-32200000D01*
X67250000Y-33200000D01*
X67150000Y-33200000D01*
X67150000Y-32200000D01*
X67100000Y-32200000D01*
X67050000Y-32100000D01*
X67050000Y-31300000D01*
X67100000Y-31200000D01*
X67150000Y-31200000D01*
X67150000Y-30200000D01*
X67250000Y-30200000D01*
X67250000Y-31200000D01*
G37*
%TD.AperFunction*%
%TA.AperFunction,SMDPad,CuDef*%
%TO.P,U1,19*%
%TO.N,/LP_EN*%
G36*
X65850000Y-30300000D02*
G01*
X65850000Y-31100000D01*
X65800000Y-31200000D01*
X65750000Y-31200000D01*
X65750000Y-33200000D01*
X65650000Y-33200000D01*
X65650000Y-31200000D01*
X65600000Y-31200000D01*
X65550000Y-31100000D01*
X65550000Y-30300000D01*
X65600000Y-30200000D01*
X65800000Y-30200000D01*
X65850000Y-30300000D01*
G37*
%TD.AperFunction*%
%TA.AperFunction,SMDPad,CuDef*%
%TO.P,U1,20*%
%TO.N,/MUX_Chip1*%
G36*
X66050000Y-31200000D02*
G01*
X66100000Y-31200000D01*
X66150000Y-31300000D01*
X66150000Y-32100000D01*
X66100000Y-32200000D01*
X66050000Y-32200000D01*
X66050000Y-33200000D01*
X65950000Y-33200000D01*
X65950000Y-32200000D01*
X65900000Y-32200000D01*
X65850000Y-32100000D01*
X65850000Y-31300000D01*
X65900000Y-31200000D01*
X65950000Y-31200000D01*
X65950000Y-30200000D01*
X66050000Y-30200000D01*
X66050000Y-31200000D01*
G37*
%TD.AperFunction*%
%TA.AperFunction,SMDPad,CuDef*%
%TO.P,U1,28*%
%TO.N,/GTX3_Chip3_N*%
G36*
X68450000Y-31200000D02*
G01*
X68500000Y-31200000D01*
X68550000Y-31300000D01*
X68550000Y-32100000D01*
X68500000Y-32200000D01*
X68450000Y-32200000D01*
X68450000Y-33200000D01*
X68350000Y-33200000D01*
X68350000Y-32200000D01*
X68300000Y-32200000D01*
X68250000Y-32100000D01*
X68250000Y-31300000D01*
X68300000Y-31200000D01*
X68350000Y-31200000D01*
X68350000Y-30200000D01*
X68450000Y-30200000D01*
X68450000Y-31200000D01*
G37*
%TD.AperFunction*%
%TA.AperFunction,SMDPad,CuDef*%
%TO.P,U1,25*%
%TO.N,/GTX1_Chip4_P*%
G36*
X67650000Y-30300000D02*
G01*
X67650000Y-31100000D01*
X67600000Y-31200000D01*
X67550000Y-31200000D01*
X67550000Y-33200000D01*
X67450000Y-33200000D01*
X67450000Y-31200000D01*
X67400000Y-31200000D01*
X67350000Y-31100000D01*
X67350000Y-30300000D01*
X67400000Y-30200000D01*
X67600000Y-30200000D01*
X67650000Y-30300000D01*
G37*
%TD.AperFunction*%
%TA.AperFunction,SMDPad,CuDef*%
%TO.P,U1,26*%
%TO.N,/GTX1_Chip4_N*%
G36*
X67850000Y-31200000D02*
G01*
X67900000Y-31200000D01*
X67950000Y-31300000D01*
X67950000Y-32100000D01*
X67900000Y-32200000D01*
X67850000Y-32200000D01*
X67850000Y-33200000D01*
X67750000Y-33200000D01*
X67750000Y-32200000D01*
X67700000Y-32200000D01*
X67650000Y-32100000D01*
X67650000Y-31300000D01*
X67700000Y-31200000D01*
X67750000Y-31200000D01*
X67750000Y-30200000D01*
X67850000Y-30200000D01*
X67850000Y-31200000D01*
G37*
%TD.AperFunction*%
%TA.AperFunction,SMDPad,CuDef*%
%TO.P,U1,27*%
%TO.N,/GND*%
G36*
X68250000Y-30300000D02*
G01*
X68250000Y-31100000D01*
X68200000Y-31200000D01*
X68150000Y-31200000D01*
X68150000Y-33200000D01*
X68050000Y-33200000D01*
X68050000Y-31200000D01*
X68000000Y-31200000D01*
X67950000Y-31100000D01*
X67950000Y-30300000D01*
X68000000Y-30200000D01*
X68200000Y-30200000D01*
X68250000Y-30300000D01*
G37*
%TD.AperFunction*%
%TA.AperFunction,SMDPad,CuDef*%
%TO.P,U1,16*%
%TO.N,/GND_C*%
G36*
X64850000Y-31200000D02*
G01*
X64900000Y-31200000D01*
X64950000Y-31300000D01*
X64950000Y-32100000D01*
X64900000Y-32200000D01*
X64850000Y-32200000D01*
X64850000Y-33200000D01*
X64750000Y-33200000D01*
X64750000Y-32200000D01*
X64700000Y-32200000D01*
X64650000Y-32100000D01*
X64650000Y-31300000D01*
X64700000Y-31200000D01*
X64750000Y-31200000D01*
X64750000Y-30200000D01*
X64850000Y-30200000D01*
X64850000Y-31200000D01*
G37*
%TD.AperFunction*%
%TA.AperFunction,SMDPad,CuDef*%
%TO.P,U1,13*%
%TO.N,/GND*%
G36*
X64050000Y-30300000D02*
G01*
X64050000Y-31100000D01*
X64000000Y-31200000D01*
X63950000Y-31200000D01*
X63950000Y-33200000D01*
X63850000Y-33200000D01*
X63850000Y-31200000D01*
X63800000Y-31200000D01*
X63750000Y-31100000D01*
X63750000Y-30300000D01*
X63800000Y-30200000D01*
X64000000Y-30200000D01*
X64050000Y-30300000D01*
G37*
%TD.AperFunction*%
%TA.AperFunction,SMDPad,CuDef*%
%TO.P,U1,14*%
%TO.N,/GTX2_Chip1_P*%
G36*
X64250000Y-31200000D02*
G01*
X64300000Y-31200000D01*
X64350000Y-31300000D01*
X64350000Y-32100000D01*
X64300000Y-32200000D01*
X64250000Y-32200000D01*
X64250000Y-33200000D01*
X64150000Y-33200000D01*
X64150000Y-32200000D01*
X64100000Y-32200000D01*
X64050000Y-32100000D01*
X64050000Y-31300000D01*
X64100000Y-31200000D01*
X64150000Y-31200000D01*
X64150000Y-30200000D01*
X64250000Y-30200000D01*
X64250000Y-31200000D01*
G37*
%TD.AperFunction*%
%TA.AperFunction,SMDPad,CuDef*%
%TO.P,U1,15*%
%TO.N,/GTX2_Chip1_N*%
G36*
X64650000Y-30300000D02*
G01*
X64650000Y-31100000D01*
X64600000Y-31200000D01*
X64550000Y-31200000D01*
X64550000Y-33200000D01*
X64450000Y-33200000D01*
X64450000Y-31200000D01*
X64400000Y-31200000D01*
X64350000Y-31100000D01*
X64350000Y-30300000D01*
X64400000Y-30200000D01*
X64600000Y-30200000D01*
X64650000Y-30300000D01*
G37*
%TD.AperFunction*%
%TA.AperFunction,SMDPad,CuDef*%
%TO.P,U1,9*%
%TO.N,/GTX3_Chip1_N*%
G36*
X62850000Y-30300000D02*
G01*
X62850000Y-31100000D01*
X62800000Y-31200000D01*
X62750000Y-31200000D01*
X62750000Y-33200000D01*
X62650000Y-33200000D01*
X62650000Y-31200000D01*
X62600000Y-31200000D01*
X62550000Y-31100000D01*
X62550000Y-30300000D01*
X62600000Y-30200000D01*
X62800000Y-30200000D01*
X62850000Y-30300000D01*
G37*
%TD.AperFunction*%
%TA.AperFunction,SMDPad,CuDef*%
%TO.P,U1,10*%
%TO.N,/GND*%
G36*
X63050000Y-31200000D02*
G01*
X63100000Y-31200000D01*
X63150000Y-31300000D01*
X63150000Y-32100000D01*
X63100000Y-32200000D01*
X63050000Y-32200000D01*
X63050000Y-33200000D01*
X62950000Y-33200000D01*
X62950000Y-32200000D01*
X62900000Y-32200000D01*
X62850000Y-32100000D01*
X62850000Y-31300000D01*
X62900000Y-31200000D01*
X62950000Y-31200000D01*
X62950000Y-30200000D01*
X63050000Y-30200000D01*
X63050000Y-31200000D01*
G37*
%TD.AperFunction*%
%TA.AperFunction,SMDPad,CuDef*%
%TO.P,U1,11*%
%TO.N,/GTX1_Chip2_N*%
G36*
X63450000Y-30300000D02*
G01*
X63450000Y-31100000D01*
X63400000Y-31200000D01*
X63350000Y-31200000D01*
X63350000Y-33200000D01*
X63250000Y-33200000D01*
X63250000Y-31200000D01*
X63200000Y-31200000D01*
X63150000Y-31100000D01*
X63150000Y-30300000D01*
X63200000Y-30200000D01*
X63400000Y-30200000D01*
X63450000Y-30300000D01*
G37*
%TD.AperFunction*%
%TA.AperFunction,SMDPad,CuDef*%
%TO.P,U1,12*%
%TO.N,/GTX1_Chip2_P*%
G36*
X63650000Y-31200000D02*
G01*
X63700000Y-31200000D01*
X63750000Y-31300000D01*
X63750000Y-32100000D01*
X63700000Y-32200000D01*
X63650000Y-32200000D01*
X63650000Y-33200000D01*
X63550000Y-33200000D01*
X63550000Y-32200000D01*
X63500000Y-32200000D01*
X63450000Y-32100000D01*
X63450000Y-31300000D01*
X63500000Y-31200000D01*
X63550000Y-31200000D01*
X63550000Y-30200000D01*
X63650000Y-30200000D01*
X63650000Y-31200000D01*
G37*
%TD.AperFunction*%
%TA.AperFunction,SMDPad,CuDef*%
%TO.P,U1,5*%
%TO.N,/GTX0_Chip2_N*%
G36*
X61650000Y-30300000D02*
G01*
X61650000Y-31100000D01*
X61600000Y-31200000D01*
X61550000Y-31200000D01*
X61550000Y-33200000D01*
X61450000Y-33200000D01*
X61450000Y-31200000D01*
X61400000Y-31200000D01*
X61350000Y-31100000D01*
X61350000Y-30300000D01*
X61400000Y-30200000D01*
X61600000Y-30200000D01*
X61650000Y-30300000D01*
G37*
%TD.AperFunction*%
%TA.AperFunction,SMDPad,CuDef*%
%TO.P,U1,6*%
%TO.N,/GTX0_Chip2_P*%
G36*
X61850000Y-31200000D02*
G01*
X61900000Y-31200000D01*
X61950000Y-31300000D01*
X61950000Y-32100000D01*
X61900000Y-32200000D01*
X61850000Y-32200000D01*
X61850000Y-33200000D01*
X61750000Y-33200000D01*
X61750000Y-32200000D01*
X61700000Y-32200000D01*
X61650000Y-32100000D01*
X61650000Y-31300000D01*
X61700000Y-31200000D01*
X61750000Y-31200000D01*
X61750000Y-30200000D01*
X61850000Y-30200000D01*
X61850000Y-31200000D01*
G37*
%TD.AperFunction*%
%TA.AperFunction,SMDPad,CuDef*%
%TO.P,U1,7*%
%TO.N,/GND*%
G36*
X62250000Y-30300000D02*
G01*
X62250000Y-31100000D01*
X62200000Y-31200000D01*
X62150000Y-31200000D01*
X62150000Y-33200000D01*
X62050000Y-33200000D01*
X62050000Y-31200000D01*
X62000000Y-31200000D01*
X61950000Y-31100000D01*
X61950000Y-30300000D01*
X62000000Y-30200000D01*
X62200000Y-30200000D01*
X62250000Y-30300000D01*
G37*
%TD.AperFunction*%
%TA.AperFunction,SMDPad,CuDef*%
%TO.P,U1,8*%
%TO.N,/GTX3_Chip1_P*%
G36*
X62450000Y-31200000D02*
G01*
X62500000Y-31200000D01*
X62550000Y-31300000D01*
X62550000Y-32100000D01*
X62500000Y-32200000D01*
X62450000Y-32200000D01*
X62450000Y-33200000D01*
X62350000Y-33200000D01*
X62350000Y-32200000D01*
X62300000Y-32200000D01*
X62250000Y-32100000D01*
X62250000Y-31300000D01*
X62300000Y-31200000D01*
X62350000Y-31200000D01*
X62350000Y-30200000D01*
X62450000Y-30200000D01*
X62450000Y-31200000D01*
G37*
%TD.AperFunction*%
%TA.AperFunction,SMDPad,CuDef*%
%TO.P,U1,4*%
%TO.N,/GND*%
G36*
X61250000Y-31200000D02*
G01*
X61300000Y-31200000D01*
X61350000Y-31300000D01*
X61350000Y-32100000D01*
X61300000Y-32200000D01*
X61250000Y-32200000D01*
X61250000Y-33200000D01*
X61150000Y-33200000D01*
X61150000Y-32200000D01*
X61100000Y-32200000D01*
X61050000Y-32100000D01*
X61050000Y-31300000D01*
X61100000Y-31200000D01*
X61150000Y-31200000D01*
X61150000Y-30200000D01*
X61250000Y-30200000D01*
X61250000Y-31200000D01*
G37*
%TD.AperFunction*%
%TA.AperFunction,SMDPad,CuDef*%
%TO.P,U1,3*%
%TO.N,/LVDS0_Chip1_P*%
G36*
X61050000Y-30300000D02*
G01*
X61050000Y-31100000D01*
X61000000Y-31200000D01*
X60950000Y-31200000D01*
X60950000Y-33200000D01*
X60850000Y-33200000D01*
X60850000Y-31200000D01*
X60800000Y-31200000D01*
X60750000Y-31100000D01*
X60750000Y-30300000D01*
X60800000Y-30200000D01*
X61000000Y-30200000D01*
X61050000Y-30300000D01*
G37*
%TD.AperFunction*%
%TA.AperFunction,SMDPad,CuDef*%
%TO.P,U1,2*%
%TO.N,/LVDS0_Chip1_N*%
G36*
X60650000Y-31200000D02*
G01*
X60700000Y-31200000D01*
X60750000Y-31300000D01*
X60750000Y-32100000D01*
X60700000Y-32200000D01*
X60650000Y-32200000D01*
X60650000Y-33200000D01*
X60550000Y-33200000D01*
X60550000Y-32200000D01*
X60500000Y-32200000D01*
X60450000Y-32100000D01*
X60450000Y-31300000D01*
X60500000Y-31200000D01*
X60550000Y-31200000D01*
X60550000Y-30200000D01*
X60650000Y-30200000D01*
X60650000Y-31200000D01*
G37*
%TD.AperFunction*%
%TA.AperFunction,SMDPad,CuDef*%
%TO.P,U1,1*%
%TO.N,/MUX_Chip2*%
G36*
X60450000Y-30300000D02*
G01*
X60450000Y-31100000D01*
X60400000Y-31200000D01*
X60350000Y-31200000D01*
X60350000Y-33200000D01*
X60250000Y-33200000D01*
X60250000Y-31200000D01*
X60200000Y-31200000D01*
X60150000Y-31100000D01*
X60150000Y-30300000D01*
X60200000Y-30200000D01*
X60400000Y-30200000D01*
X60450000Y-30300000D01*
G37*
%TD.AperFunction*%
%TD*%
D11*
%TO.N,/GND*%
X61200000Y-175800000D03*
X62100000Y-175800000D03*
X63000000Y-175800000D03*
X63900000Y-175800000D03*
X68100000Y-175800000D03*
X69000000Y-175800000D03*
X69900000Y-175800000D03*
X70800000Y-175800000D03*
X61200000Y-34200000D03*
X62100000Y-34200000D03*
X63000000Y-34200000D03*
X63900000Y-34200000D03*
X68100000Y-34200000D03*
X69000000Y-34200000D03*
X69900000Y-34200000D03*
X70800000Y-34200000D03*
%TD*%
D12*
%TO.N,/MUX_Chip4*%
X71700000Y-30700000D02*
X71700000Y-179300000D01*
%TO.N,/LVDS0_Chip3_P*%
X71125000Y-33700000D02*
X71100000Y-33675000D01*
X71100000Y-176325000D02*
X71125000Y-176300000D01*
X71125000Y-176300000D02*
X71125000Y-33700000D01*
X71100000Y-33675000D02*
X71100000Y-30700000D01*
X71100000Y-179300000D02*
X71100000Y-176325000D01*
%TO.N,/CMD_P*%
X70475000Y-176300000D02*
X70500000Y-176325000D01*
X70500000Y-30700000D02*
X70500000Y-33675000D01*
X70500000Y-176325000D02*
X70500000Y-179300000D01*
X70500000Y-33675000D02*
X70475000Y-33700000D01*
X70475000Y-33700000D02*
X70475000Y-176300000D01*
%TO.N,/LVDS0_Chip3_N*%
X71400000Y-33675000D02*
X71400000Y-31700000D01*
X71375000Y-33700000D02*
X71400000Y-33675000D01*
X71400000Y-176325000D02*
X71375000Y-176300000D01*
X71400000Y-178300000D02*
X71400000Y-176325000D01*
X71375000Y-176300000D02*
X71375000Y-33700000D01*
%TO.N,/GND*%
X69000000Y-33600000D02*
X69000000Y-31700000D01*
X68100000Y-30700000D02*
X68100000Y-33600000D01*
X69900000Y-30700000D02*
X69900000Y-33600000D01*
X70800000Y-31700000D02*
X70800000Y-33600000D01*
X63900000Y-30700000D02*
X63900000Y-33600000D01*
X63000000Y-31700000D02*
X63000000Y-33600000D01*
X62100000Y-30700000D02*
X62100000Y-33600000D01*
X61200000Y-31700000D02*
X61200000Y-33600000D01*
X62100000Y-179300000D02*
X62100000Y-176400000D01*
X63000000Y-178300000D02*
X63000000Y-176400000D01*
X63900000Y-179300000D02*
X63900000Y-176400000D01*
X68100000Y-176400000D02*
X68100000Y-179300000D01*
X69000000Y-178300000D02*
X69000000Y-176400000D01*
X69900000Y-179300000D02*
X69900000Y-176400000D01*
X70800000Y-178300000D02*
X70800000Y-176400000D01*
X61200000Y-178300000D02*
X61200000Y-176400000D01*
X61200000Y-176400000D02*
X61200000Y-175800000D01*
X62100000Y-176400000D02*
X62100000Y-175800000D01*
X63000000Y-176400000D02*
X63000000Y-175800000D01*
X63900000Y-176400000D02*
X63900000Y-175800000D01*
X68100000Y-176400000D02*
X68100000Y-175800000D01*
X69000000Y-176400000D02*
X69000000Y-175800000D01*
X69900000Y-176400000D02*
X69900000Y-175800000D01*
X70800000Y-176400000D02*
X70800000Y-175800000D01*
X61200000Y-33600000D02*
X61200000Y-34200000D01*
X62100000Y-33600000D02*
X62100000Y-34200000D01*
X63000000Y-33600000D02*
X63000000Y-34200000D01*
X63900000Y-33600000D02*
X63900000Y-34200000D01*
X68100000Y-33600000D02*
X68100000Y-34200000D01*
X69000000Y-33600000D02*
X69000000Y-34200000D01*
X69900000Y-33600000D02*
X69900000Y-34200000D01*
X70800000Y-33600000D02*
X70800000Y-34200000D01*
%TO.N,/CMD_N*%
X70200000Y-176325000D02*
X70200000Y-178300000D01*
X70225000Y-33700000D02*
X70225000Y-176300000D01*
X70200000Y-33675000D02*
X70225000Y-33700000D01*
X70200000Y-31700000D02*
X70200000Y-33675000D01*
X70225000Y-176300000D02*
X70200000Y-176325000D01*
%TO.N,/GTX3_Chip3_P*%
X68675000Y-176300000D02*
X68700000Y-176325000D01*
X68700000Y-30700000D02*
X68700000Y-33675000D01*
X68675000Y-33700000D02*
X68675000Y-176300000D01*
X68700000Y-33675000D02*
X68675000Y-33700000D01*
X68700000Y-176325000D02*
X68700000Y-179300000D01*
%TO.N,/GTX3_Chip3_N*%
X68425000Y-176300000D02*
X68400000Y-176325000D01*
X68425000Y-33700000D02*
X68425000Y-176300000D01*
X68400000Y-33675000D02*
X68425000Y-33700000D01*
X68400000Y-31700000D02*
X68400000Y-33675000D01*
X68400000Y-176325000D02*
X68400000Y-178300000D01*
%TO.N,/GTX1_Chip2_P*%
X63600000Y-176325000D02*
X63600000Y-178300000D01*
X63575000Y-176300000D02*
X63600000Y-176325000D01*
X63575000Y-33700000D02*
X63575000Y-176300000D01*
X63600000Y-33675000D02*
X63575000Y-33700000D01*
X63600000Y-31700000D02*
X63600000Y-33675000D01*
%TO.N,/GTX2_Chip1_P*%
X64225000Y-33700000D02*
X64200000Y-33675000D01*
X64200000Y-33675000D02*
X64200000Y-31700000D01*
X64225000Y-176300000D02*
X64225000Y-33700000D01*
X64200000Y-176325000D02*
X64225000Y-176300000D01*
X64200000Y-178300000D02*
X64200000Y-176325000D01*
%TO.N,/MUX_Chip1*%
X66000000Y-178300000D02*
X66000000Y-31700000D01*
%TO.N,/GTX2_Chip3_P*%
X66900000Y-176325000D02*
X66900000Y-179300000D01*
X66900000Y-30700000D02*
X66900000Y-33675000D01*
X66900000Y-33675000D02*
X66875000Y-33700000D01*
X66875000Y-33700000D02*
X66875000Y-176300000D01*
X66875000Y-176300000D02*
X66900000Y-176325000D01*
%TO.N,/GTX1_Chip4_P*%
X67500000Y-33675000D02*
X67500000Y-30700000D01*
X67500000Y-176325000D02*
X67525000Y-176300000D01*
X67500000Y-179300000D02*
X67500000Y-176325000D01*
X67525000Y-176300000D02*
X67525000Y-33700000D01*
X67525000Y-33700000D02*
X67500000Y-33675000D01*
%TO.N,/GTX3_Chip1_P*%
X62400000Y-178300000D02*
X62400000Y-176325000D01*
X62425000Y-33700000D02*
X62400000Y-33675000D01*
X62400000Y-33675000D02*
X62400000Y-31700000D01*
X62400000Y-176325000D02*
X62425000Y-176300000D01*
X62425000Y-176300000D02*
X62425000Y-33700000D01*
%TO.N,/GTX0_Chip2_P*%
X61800000Y-33675000D02*
X61775000Y-33700000D01*
X61800000Y-31700000D02*
X61800000Y-33675000D01*
X61800000Y-176325000D02*
X61800000Y-178300000D01*
X61775000Y-33700000D02*
X61775000Y-176300000D01*
X61775000Y-176300000D02*
X61800000Y-176325000D01*
%TO.N,/LVDS0_Chip1_N*%
X60625000Y-33700000D02*
X60600000Y-33675000D01*
X60600000Y-33675000D02*
X60600000Y-31700000D01*
X60625000Y-176300000D02*
X60625000Y-33700000D01*
X60600000Y-176325000D02*
X60625000Y-176300000D01*
X60600000Y-178300000D02*
X60600000Y-176325000D01*
%TO.N,/GTX1_Chip2_N*%
X63300000Y-176325000D02*
X63300000Y-179300000D01*
X63325000Y-176300000D02*
X63300000Y-176325000D01*
X63300000Y-33675000D02*
X63325000Y-33700000D01*
X63300000Y-30700000D02*
X63300000Y-33675000D01*
X63325000Y-33700000D02*
X63325000Y-176300000D01*
%TO.N,/GTX3_Chip1_N*%
X62675000Y-33700000D02*
X62700000Y-33675000D01*
X62675000Y-176300000D02*
X62675000Y-33700000D01*
X62700000Y-176325000D02*
X62675000Y-176300000D01*
X62700000Y-179300000D02*
X62700000Y-176325000D01*
X62700000Y-33675000D02*
X62700000Y-30700000D01*
%TO.N,/GTX0_Chip2_N*%
X61525000Y-176300000D02*
X61500000Y-176325000D01*
X61525000Y-33700000D02*
X61525000Y-176300000D01*
X61500000Y-176325000D02*
X61500000Y-179300000D01*
X61500000Y-33675000D02*
X61525000Y-33700000D01*
X61500000Y-30700000D02*
X61500000Y-33675000D01*
%TO.N,/LVDS0_Chip1_P*%
X60900000Y-176325000D02*
X60875000Y-176300000D01*
X60875000Y-33700000D02*
X60900000Y-33675000D01*
X60875000Y-176300000D02*
X60875000Y-33700000D01*
X60900000Y-179300000D02*
X60900000Y-176325000D01*
X60900000Y-33675000D02*
X60900000Y-30700000D01*
%TO.N,/MUX_Chip2*%
X60300000Y-30700000D02*
X60300000Y-179300000D01*
%TO.N,/GTX2_Chip1_N*%
X64475000Y-33700000D02*
X64500000Y-33675000D01*
X64475000Y-176300000D02*
X64475000Y-33700000D01*
X64500000Y-176325000D02*
X64475000Y-176300000D01*
X64500000Y-179300000D02*
X64500000Y-176325000D01*
X64500000Y-33675000D02*
X64500000Y-30700000D01*
%TO.N,/LP_EN*%
X65700000Y-176400000D02*
X65700000Y-179300000D01*
X65700000Y-30700000D02*
X65700000Y-176400000D01*
%TO.N,/GTX2_Chip3_N*%
X66600000Y-176325000D02*
X66600000Y-178300000D01*
X66625000Y-33700000D02*
X66625000Y-176300000D01*
X66600000Y-33675000D02*
X66625000Y-33700000D01*
X66625000Y-176300000D02*
X66600000Y-176325000D01*
X66600000Y-31700000D02*
X66600000Y-33675000D01*
%TO.N,/GTX1_Chip4_N*%
X67800000Y-33675000D02*
X67800000Y-31700000D01*
X67800000Y-176325000D02*
X67775000Y-176300000D01*
X67775000Y-33700000D02*
X67800000Y-33675000D01*
X67775000Y-176300000D02*
X67775000Y-33700000D01*
X67800000Y-178300000D02*
X67800000Y-176325000D01*
%TO.N,/GTX0_Chip4_P*%
X69300000Y-33675000D02*
X69300000Y-30700000D01*
X69325000Y-33700000D02*
X69300000Y-33675000D01*
X69300000Y-179300000D02*
X69300000Y-176325000D01*
X69325000Y-176300000D02*
X69325000Y-33700000D01*
X69300000Y-176325000D02*
X69325000Y-176300000D01*
%TO.N,/MUX_Chip3*%
X66300000Y-33600000D02*
X66300000Y-30700000D01*
X66300000Y-179300000D02*
X66300000Y-33600000D01*
%TO.N,/GTX0_Chip4_N*%
X69600000Y-33675000D02*
X69600000Y-31700000D01*
X69575000Y-33700000D02*
X69600000Y-33675000D01*
X69575000Y-176300000D02*
X69575000Y-33700000D01*
X69600000Y-176325000D02*
X69575000Y-176300000D01*
X69600000Y-178300000D02*
X69600000Y-176325000D01*
%TO.N,/GND_C*%
X64800000Y-31700000D02*
X64800000Y-178300000D01*
%TO.N,/CHIP_ID_P*%
X65100000Y-176325000D02*
X65100000Y-179300000D01*
X65125000Y-176300000D02*
X65100000Y-176325000D01*
X65125000Y-33700000D02*
X65125000Y-176300000D01*
X65100000Y-30700000D02*
X65100000Y-33675000D01*
X65100000Y-33675000D02*
X65125000Y-33700000D01*
%TO.N,/CHIP_ID_N*%
X65400000Y-176325000D02*
X65400000Y-178300000D01*
X65375000Y-33700000D02*
X65375000Y-176300000D01*
X65400000Y-33675000D02*
X65375000Y-33700000D01*
X65400000Y-31700000D02*
X65400000Y-33675000D01*
X65375000Y-176300000D02*
X65400000Y-176325000D01*
%TO.N,/GND_S*%
X67200000Y-178300000D02*
X67200000Y-176400000D01*
X67200000Y-176400000D02*
X67200000Y-175800000D01*
X67200000Y-34200000D02*
X67200000Y-175800000D01*
X67200000Y-31700000D02*
X67200000Y-34200000D01*
%TD*%
M02*
