%TF.GenerationSoftware,KiCad,Pcbnew,(5.1.10-1-10_14)*%
%TF.CreationDate,2022-03-14T21:57:54-07:00*%
%TF.ProjectId,rd53b_powerpigtail_16pos,72643533-625f-4706-9f77-657270696774,1.1*%
%TF.SameCoordinates,Original*%
%TF.FileFunction,Paste,Top*%
%TF.FilePolarity,Positive*%
%FSLAX46Y46*%
G04 Gerber Fmt 4.6, Leading zero omitted, Abs format (unit mm)*
G04 Created by KiCad (PCBNEW (5.1.10-1-10_14)) date 2022-03-14 21:57:54*
%MOMM*%
%LPD*%
G01*
G04 APERTURE LIST*
%ADD10R,0.610000X1.370000*%
G04 APERTURE END LIST*
D10*
%TO.C,J2*%
X129400000Y-187000000D03*
X129400000Y-190202000D03*
X130400000Y-187000000D03*
X130400000Y-190202000D03*
X131400000Y-187000000D03*
X131400000Y-190202000D03*
X132400000Y-187000000D03*
X132400000Y-190202000D03*
X133400000Y-187000000D03*
X133400000Y-190202000D03*
X134400000Y-187000000D03*
X134400000Y-190202000D03*
X135400000Y-187000000D03*
X135400000Y-190202000D03*
X136400000Y-187000000D03*
X136400000Y-190202000D03*
%TD*%
%TO.C,J1*%
X129400000Y-42198000D03*
X129400000Y-45400000D03*
X130400000Y-42198000D03*
X130400000Y-45400000D03*
X131400000Y-42198000D03*
X131400000Y-45400000D03*
X132400000Y-42198000D03*
X132400000Y-45400000D03*
X133400000Y-42198000D03*
X133400000Y-45400000D03*
X134400000Y-42198000D03*
X134400000Y-45400000D03*
X135400000Y-42198000D03*
X135400000Y-45400000D03*
X136400000Y-42198000D03*
X136400000Y-45400000D03*
%TD*%
M02*
