%TF.GenerationSoftware,KiCad,Pcbnew,(5.1.6-0)*%
%TF.CreationDate,2020-12-23T18:13:49-08:00*%
%TF.ProjectId,rd53b_quad_data_adaptercard,72643533-625f-4717-9561-645f64617461,rev?*%
%TF.SameCoordinates,Original*%
%TF.FileFunction,Copper,L4,Bot*%
%TF.FilePolarity,Positive*%
%FSLAX46Y46*%
G04 Gerber Fmt 4.6, Leading zero omitted, Abs format (unit mm)*
G04 Created by KiCad (PCBNEW (5.1.6-0)) date 2020-12-23 18:13:49*
%MOMM*%
%LPD*%
G01*
G04 APERTURE LIST*
%TA.AperFunction,ComponentPad*%
%ADD10R,1.700000X1.700000*%
%TD*%
%TA.AperFunction,ComponentPad*%
%ADD11O,1.700000X1.700000*%
%TD*%
%TA.AperFunction,ComponentPad*%
%ADD12O,1.900000X1.300000*%
%TD*%
%TA.AperFunction,ComponentPad*%
%ADD13O,2.300000X1.300000*%
%TD*%
%TA.AperFunction,ComponentPad*%
%ADD14O,1.300000X1.900000*%
%TD*%
%TA.AperFunction,ComponentPad*%
%ADD15O,1.300000X2.300000*%
%TD*%
%TA.AperFunction,ViaPad*%
%ADD16C,0.500000*%
%TD*%
%TA.AperFunction,Conductor*%
%ADD17C,0.150000*%
%TD*%
G04 APERTURE END LIST*
D10*
%TO.P,J1,1*%
%TO.N,/GND*%
X159800000Y-87100000D03*
D11*
%TO.P,J1,2*%
X162340000Y-87100000D03*
%TD*%
D10*
%TO.P,J2,1*%
%TO.N,/LP_Enable*%
X159800000Y-89700000D03*
D11*
%TO.P,J2,2*%
%TO.N,/LP_Enable_Module*%
X162340000Y-89700000D03*
%TD*%
D10*
%TO.P,J3,1*%
%TO.N,/CHIP_ID2*%
X162400000Y-94800000D03*
D11*
%TO.P,J3,2*%
%TO.N,/GND_Module*%
X159860000Y-94800000D03*
%TO.P,J3,3*%
%TO.N,/CHIP_ID3*%
X162400000Y-92260000D03*
%TO.P,J3,4*%
%TO.N,/GND_Module*%
X159860000Y-92260000D03*
%TD*%
D10*
%TO.P,J4,1*%
%TO.N,/MUX_Chip1*%
X131400000Y-108300000D03*
D11*
%TO.P,J4,2*%
%TO.N,/GND_Module*%
X133940000Y-108300000D03*
%TO.P,J4,3*%
%TO.N,/MUX_Chip2*%
X131400000Y-110840000D03*
%TO.P,J4,4*%
%TO.N,/GND_Module*%
X133940000Y-110840000D03*
%TO.P,J4,5*%
%TO.N,/MUX_Chip3*%
X131400000Y-113380000D03*
%TO.P,J4,6*%
%TO.N,/GND_Module*%
X133940000Y-113380000D03*
%TO.P,J4,7*%
%TO.N,/MUX_Chip4*%
X131400000Y-115920000D03*
%TO.P,J4,8*%
%TO.N,/GND_Module*%
X133940000Y-115920000D03*
%TD*%
D12*
%TO.P,DP6,21*%
%TO.N,/GND_D6*%
X114702800Y-108624600D03*
X114702800Y-92124600D03*
D13*
X121482800Y-108624600D03*
X121482800Y-92124600D03*
%TD*%
D12*
%TO.P,DP5,21*%
%TO.N,/GND_D5*%
X207897200Y-92099800D03*
X207897200Y-108599800D03*
D13*
X201117200Y-92099800D03*
X201117200Y-108599800D03*
%TD*%
D14*
%TO.P,DP4,21*%
%TO.N,/GND_D4*%
X163550000Y-73520000D03*
X180050000Y-73520000D03*
D15*
X163550000Y-80300000D03*
X180050000Y-80300000D03*
%TD*%
D14*
%TO.P,DP3,21*%
%TO.N,/GND_D3*%
X184307000Y-73534800D03*
X200807000Y-73534800D03*
D15*
X184307000Y-80314800D03*
X200807000Y-80314800D03*
%TD*%
D14*
%TO.P,DP2,21*%
%TO.N,/GND_D2*%
X121850000Y-73520000D03*
X138350000Y-73520000D03*
D15*
X121850000Y-80300000D03*
X138350000Y-80300000D03*
%TD*%
D14*
%TO.P,DP1,21*%
%TO.N,/GND_D1*%
X142676400Y-73534800D03*
X159176400Y-73534800D03*
D15*
X142676400Y-80314800D03*
X159176400Y-80314800D03*
%TD*%
D16*
%TO.N,/LVDS0_Chip1_N*%
X153137867Y-105662133D03*
X128700000Y-101174600D03*
%TO.N,/LVDS0_Chip1_P*%
X153562133Y-105237867D03*
X128700000Y-100574600D03*
%TO.N,/LVDS0_Chip3_N*%
X166850000Y-116100000D03*
X186200000Y-114200000D03*
%TO.N,/LVDS0_Chip3_P*%
X166250000Y-116100000D03*
X186800000Y-114200000D03*
%TO.N,/MUX_Chip4*%
X167400000Y-114800000D03*
%TO.N,/GND*%
X156700000Y-109300000D03*
X142200000Y-105300000D03*
X137300000Y-105300000D03*
X130700000Y-103700000D03*
X135600000Y-103800000D03*
X148000000Y-100200000D03*
X152500000Y-99500000D03*
X153200000Y-101500000D03*
X158200000Y-101600000D03*
X171100000Y-99000000D03*
X167100000Y-97600000D03*
X157700000Y-114100000D03*
X159500000Y-114200000D03*
X163200000Y-114200000D03*
X165000000Y-114200000D03*
X166400000Y-109200000D03*
X164100000Y-109200000D03*
X162300000Y-109200000D03*
X158500000Y-109300000D03*
X167000000Y-99400000D03*
X183500000Y-108300000D03*
X178500000Y-108100000D03*
X177100000Y-111200000D03*
X118600000Y-77400000D03*
X140500000Y-76700000D03*
X161300000Y-76600000D03*
X182100000Y-76700000D03*
X206300000Y-89100000D03*
X117600000Y-89000000D03*
X122000000Y-98400000D03*
X122000000Y-100900000D03*
X122000000Y-102400000D03*
X122000000Y-103900000D03*
X122000000Y-105400000D03*
X125100000Y-80800000D03*
X126600000Y-80800000D03*
X128100000Y-80800000D03*
X129600000Y-80800000D03*
X132100000Y-80800000D03*
X200800000Y-95300000D03*
X200800000Y-96800000D03*
X200800000Y-98300000D03*
X200800000Y-99900000D03*
X200800000Y-102200000D03*
X192100000Y-80800000D03*
X194500000Y-80800000D03*
X190600000Y-80800000D03*
X189100000Y-80800000D03*
X187600000Y-80800000D03*
X171300000Y-80800000D03*
X173800000Y-80800000D03*
X169800000Y-80800000D03*
X168300000Y-80800000D03*
X166800000Y-80800000D03*
X147400000Y-80800000D03*
X145900000Y-80800000D03*
X148900000Y-80800000D03*
X150400000Y-80800000D03*
X152900000Y-80800000D03*
X172700000Y-110500000D03*
X162800000Y-98400000D03*
%TO.N,/GND_Module*%
X160300000Y-106000000D03*
%TO.N,/MUX_Chip1*%
X161200000Y-111100000D03*
%TO.N,/MUX_Chip2*%
X155400000Y-112300000D03*
%TO.N,/MUX_Chip3*%
X161300000Y-114600000D03*
%TO.N,/LP_Enable_Module*%
X161500000Y-112000000D03*
%TD*%
D17*
%TO.N,/LVDS0_Chip1_N*%
X153137867Y-105414644D02*
X153137867Y-105662133D01*
X128700000Y-101174600D02*
X128875000Y-100999600D01*
X152258356Y-104535133D02*
X153137867Y-105414644D01*
X152258356Y-104535133D02*
X151829255Y-104126595D01*
X151829255Y-104126595D02*
X151380626Y-103739605D01*
X151380626Y-103739605D02*
X150913548Y-103375094D01*
X150913548Y-103375094D02*
X150429147Y-103033941D01*
X150429147Y-103033941D02*
X149928590Y-102716967D01*
X149928590Y-102716967D02*
X149413083Y-102424935D01*
X149413083Y-102424935D02*
X148883868Y-102158551D01*
X148883868Y-102158551D02*
X148342219Y-101918454D01*
X148342219Y-101918454D02*
X147789442Y-101705225D01*
X147789442Y-101705225D02*
X147226867Y-101519375D01*
X147226867Y-101519375D02*
X146655852Y-101361354D01*
X146655852Y-101361354D02*
X146077770Y-101231541D01*
X146077770Y-101231541D02*
X145494015Y-101130250D01*
X145494015Y-101130250D02*
X144905993Y-101057724D01*
X144905993Y-101057724D02*
X144315121Y-101014139D01*
X144315121Y-101014139D02*
X143722822Y-100999600D01*
X143722822Y-100999600D02*
X128875000Y-100999600D01*
%TO.N,/LVDS0_Chip1_P*%
X153314644Y-105237867D02*
X153562133Y-105237867D01*
X128700000Y-100574600D02*
X128875000Y-100749600D01*
X152361911Y-104285134D02*
X153314644Y-105237867D01*
X152361911Y-104285134D02*
X151932811Y-103876596D01*
X151932811Y-103876596D02*
X151484181Y-103489605D01*
X151484181Y-103489605D02*
X151017104Y-103125094D01*
X151017104Y-103125094D02*
X150532703Y-102783941D01*
X150532703Y-102783941D02*
X150032146Y-102466967D01*
X150032146Y-102466967D02*
X149516639Y-102174935D01*
X149516639Y-102174935D02*
X148987424Y-101908551D01*
X148987424Y-101908551D02*
X148445775Y-101668454D01*
X148445775Y-101668454D02*
X147892998Y-101455224D01*
X147892998Y-101455224D02*
X147330423Y-101269375D01*
X147330423Y-101269375D02*
X146759408Y-101111354D01*
X146759408Y-101111354D02*
X146181326Y-100981541D01*
X146181326Y-100981541D02*
X145597571Y-100880250D01*
X145597571Y-100880250D02*
X145009549Y-100807724D01*
X145009549Y-100807724D02*
X144418677Y-100764139D01*
X144418677Y-100764139D02*
X143826378Y-100749600D01*
X143826378Y-100749600D02*
X128875000Y-100749600D01*
%TO.N,/LVDS0_Chip3_N*%
X166850000Y-116100000D02*
X166675000Y-116275000D01*
X166675000Y-116275000D02*
X166675000Y-116598222D01*
X186375000Y-114748222D02*
X186375000Y-114375000D01*
X186375000Y-114375000D02*
X186200000Y-114200000D01*
X166898224Y-116821446D02*
X166675000Y-116598222D01*
X166898224Y-116821446D02*
X166941133Y-116862300D01*
X166941133Y-116862300D02*
X166985996Y-116900999D01*
X166985996Y-116900999D02*
X167032704Y-116937450D01*
X167032704Y-116937450D02*
X167081144Y-116971565D01*
X167081144Y-116971565D02*
X167131200Y-117003263D01*
X167131200Y-117003263D02*
X167182751Y-117032466D01*
X167182751Y-117032466D02*
X167235672Y-117059104D01*
X167235672Y-117059104D02*
X167289837Y-117083114D01*
X167289837Y-117083114D02*
X167345115Y-117104437D01*
X167345115Y-117104437D02*
X167401373Y-117123022D01*
X167401373Y-117123022D02*
X167458474Y-117138824D01*
X167458474Y-117138824D02*
X167516282Y-117151805D01*
X167516282Y-117151805D02*
X167574658Y-117161934D01*
X167574658Y-117161934D02*
X167633460Y-117169187D01*
X167633460Y-117169187D02*
X167692548Y-117173545D01*
X167692548Y-117173545D02*
X167751778Y-117175000D01*
X184655328Y-116467893D02*
X186375000Y-114748222D01*
X184655328Y-116467893D02*
X184569507Y-116549600D01*
X184569507Y-116549600D02*
X184479782Y-116626998D01*
X184479782Y-116626998D02*
X184386366Y-116699900D01*
X184386366Y-116699900D02*
X184289486Y-116768131D01*
X184289486Y-116768131D02*
X184189375Y-116831526D01*
X184189375Y-116831526D02*
X184086273Y-116889932D01*
X184086273Y-116889932D02*
X183980430Y-116943209D01*
X183980430Y-116943209D02*
X183872101Y-116991228D01*
X183872101Y-116991228D02*
X183761545Y-117033874D01*
X183761545Y-117033874D02*
X183649030Y-117071044D01*
X183649030Y-117071044D02*
X183534827Y-117102648D01*
X183534827Y-117102648D02*
X183419211Y-117128611D01*
X183419211Y-117128611D02*
X183302460Y-117148869D01*
X183302460Y-117148869D02*
X183184856Y-117163374D01*
X183184856Y-117163374D02*
X183066681Y-117172091D01*
X183066681Y-117172091D02*
X182948222Y-117175000D01*
X182948222Y-117175000D02*
X167751778Y-117175000D01*
%TO.N,/LVDS0_Chip3_P*%
X166250000Y-116100000D02*
X166425000Y-116275000D01*
X166425000Y-116275000D02*
X166425000Y-116701778D01*
X186625000Y-114375000D02*
X186800000Y-114200000D01*
X186625000Y-114851778D02*
X186625000Y-114375000D01*
X166794668Y-117071446D02*
X166425000Y-116701778D01*
X166794668Y-117071446D02*
X166837578Y-117112299D01*
X166837578Y-117112299D02*
X166882441Y-117150998D01*
X166882441Y-117150998D02*
X166929149Y-117187449D01*
X166929149Y-117187449D02*
X166977589Y-117221564D01*
X166977589Y-117221564D02*
X167027645Y-117253262D01*
X167027645Y-117253262D02*
X167079195Y-117282465D01*
X167079195Y-117282465D02*
X167132117Y-117309103D01*
X167132117Y-117309103D02*
X167186282Y-117333113D01*
X167186282Y-117333113D02*
X167241559Y-117354436D01*
X167241559Y-117354436D02*
X167297817Y-117373021D01*
X167297817Y-117373021D02*
X167354918Y-117388823D01*
X167354918Y-117388823D02*
X167412727Y-117401804D01*
X167412727Y-117401804D02*
X167471102Y-117411933D01*
X167471102Y-117411933D02*
X167529904Y-117419186D01*
X167529904Y-117419186D02*
X167588992Y-117423544D01*
X167588992Y-117423544D02*
X167648222Y-117425000D01*
X183051778Y-117425000D02*
X167648222Y-117425000D01*
X183051778Y-117425000D02*
X183170237Y-117422091D01*
X183170237Y-117422091D02*
X183288412Y-117413374D01*
X183288412Y-117413374D02*
X183406016Y-117398869D01*
X183406016Y-117398869D02*
X183522767Y-117378611D01*
X183522767Y-117378611D02*
X183638383Y-117352648D01*
X183638383Y-117352648D02*
X183752586Y-117321044D01*
X183752586Y-117321044D02*
X183865101Y-117283874D01*
X183865101Y-117283874D02*
X183975657Y-117241228D01*
X183975657Y-117241228D02*
X184083986Y-117193209D01*
X184083986Y-117193209D02*
X184189829Y-117139932D01*
X184189829Y-117139932D02*
X184292931Y-117081525D01*
X184292931Y-117081525D02*
X184393042Y-117018131D01*
X184393042Y-117018131D02*
X184489922Y-116949900D01*
X184489922Y-116949900D02*
X184583337Y-116876998D01*
X184583337Y-116876998D02*
X184673063Y-116799600D01*
X184673063Y-116799600D02*
X184758884Y-116717893D01*
X184758884Y-116717893D02*
X186625000Y-114851778D01*
%TO.N,/MUX_Chip4*%
X131420000Y-115920000D02*
X131400000Y-115920000D01*
X132800000Y-117300000D02*
X131420000Y-115920000D01*
X161300000Y-117300000D02*
X132800000Y-117300000D01*
X163800000Y-114800000D02*
X161300000Y-117300000D01*
X167400000Y-114800000D02*
X163800000Y-114800000D01*
%TO.N,/GND_Module*%
X133940000Y-108300000D02*
X143400000Y-108300000D01*
X144100000Y-108300000D02*
X144000000Y-108300000D01*
X143400000Y-108300000D02*
X144100000Y-108300000D01*
X158000000Y-108300000D02*
X160300000Y-106000000D01*
X144100000Y-108300000D02*
X158000000Y-108300000D01*
%TO.N,/MUX_Chip1*%
X155100000Y-109600000D02*
X156600000Y-111100000D01*
X156600000Y-111100000D02*
X161200000Y-111100000D01*
X132700000Y-109600000D02*
X155100000Y-109600000D01*
X131400000Y-108300000D02*
X132700000Y-109600000D01*
%TO.N,/MUX_Chip2*%
X131400000Y-110900000D02*
X132600000Y-112100000D01*
X132600000Y-112100000D02*
X152500000Y-112100000D01*
X131400000Y-110840000D02*
X131400000Y-110900000D01*
X155200000Y-112100000D02*
X155400000Y-112300000D01*
X152500000Y-112100000D02*
X155200000Y-112100000D01*
%TO.N,/MUX_Chip3*%
X132600000Y-114600000D02*
X154100000Y-114600000D01*
X131400000Y-113400000D02*
X132600000Y-114600000D01*
X131400000Y-113380000D02*
X131400000Y-113400000D01*
X154100000Y-114600000D02*
X158800000Y-114600000D01*
X158800000Y-114600000D02*
X159100000Y-114900000D01*
X161000000Y-114900000D02*
X161300000Y-114600000D01*
X159100000Y-114900000D02*
X161000000Y-114900000D01*
%TO.N,/LP_Enable_Module*%
X164500000Y-95100000D02*
X164500000Y-91860000D01*
X164500000Y-91860000D02*
X162340000Y-89700000D01*
X161800000Y-97800000D02*
X164500000Y-95100000D01*
X161800000Y-111700000D02*
X161800000Y-97800000D01*
X161500000Y-112000000D02*
X161800000Y-111700000D01*
%TD*%
M02*
