%TF.GenerationSoftware,KiCad,Pcbnew,(5.1.6-0)*%
%TF.CreationDate,2020-12-23T08:40:41-08:00*%
%TF.ProjectId,rd53b_quad_power_adaptercard,72643533-625f-4717-9561-645f706f7765,rev?*%
%TF.SameCoordinates,Original*%
%TF.FileFunction,Copper,L3,Inr*%
%TF.FilePolarity,Positive*%
%FSLAX46Y46*%
G04 Gerber Fmt 4.6, Leading zero omitted, Abs format (unit mm)*
G04 Created by KiCad (PCBNEW (5.1.6-0)) date 2020-12-23 08:40:41*
%MOMM*%
%LPD*%
G01*
G04 APERTURE LIST*
%TA.AperFunction,ViaPad*%
%ADD10C,3.200000*%
%TD*%
%TA.AperFunction,ViaPad*%
%ADD11R,2.000000X2.000000*%
%TD*%
%TA.AperFunction,ViaPad*%
%ADD12C,2.100000*%
%TD*%
%TA.AperFunction,ViaPad*%
%ADD13R,1.700000X1.700000*%
%TD*%
%TA.AperFunction,ViaPad*%
%ADD14O,1.700000X1.700000*%
%TD*%
%TA.AperFunction,ViaPad*%
%ADD15C,1.795780*%
%TD*%
%TA.AperFunction,ViaPad*%
%ADD16C,1.798320*%
%TD*%
%TA.AperFunction,ViaPad*%
%ADD17C,0.800000*%
%TD*%
%TA.AperFunction,Conductor*%
%ADD18C,0.254000*%
%TD*%
G04 APERTURE END LIST*
D10*
%TO.N,N/C*%
%TO.C,J2*%
X75200000Y-112900000D03*
X88400000Y-112900000D03*
D11*
%TO.N,/GND*%
X79700000Y-117100000D03*
X83900000Y-117100000D03*
%TO.N,/VIN*%
X79700000Y-122600000D03*
X83900000Y-122600000D03*
%TD*%
D12*
%TO.N,/VIN*%
%TO.C,J7*%
X53560000Y-118400000D03*
X53560000Y-127100000D03*
X58640000Y-118400000D03*
X58640000Y-127100000D03*
%TO.N,/GND*%
X63720000Y-118400000D03*
X63720000Y-127100000D03*
X68800000Y-118400000D03*
X68800000Y-127100000D03*
%TD*%
D13*
%TO.N,/NTC*%
%TO.C,J8*%
X45000000Y-131300000D03*
D14*
%TO.N,/NTC_RET*%
X45000000Y-133840000D03*
%TO.N,Net-(J8-Pad3)*%
X45000000Y-136380000D03*
%TD*%
D15*
%TO.N,/HV_RET*%
%TO.C,J6*%
X99340000Y-116740000D03*
X94260000Y-116740000D03*
X94260000Y-111660000D03*
X99340000Y-111660000D03*
D16*
%TO.N,/HV*%
X96800000Y-114200000D03*
%TD*%
D13*
%TO.N,/GND*%
%TO.C,J5*%
X90700000Y-140240000D03*
D14*
X90700000Y-137700000D03*
%TD*%
D13*
%TO.N,/HV_RET*%
%TO.C,J4*%
X94300000Y-129200000D03*
D14*
%TO.N,/GND*%
X91760000Y-129200000D03*
%TD*%
D13*
%TO.N,/LP_Enable*%
%TO.C,J3*%
X87900000Y-140200000D03*
D14*
%TO.N,/LP_Enable_M*%
X87900000Y-137660000D03*
%TD*%
D17*
%TO.N,/GND*%
X81000000Y-139400000D03*
X81000000Y-140600000D03*
X81000000Y-141800000D03*
X81000000Y-143000000D03*
X81000000Y-144200000D03*
X82000000Y-143600000D03*
X82000000Y-140000000D03*
X82000000Y-142400000D03*
X82000000Y-141200000D03*
X83000000Y-142900000D03*
X83000000Y-139300000D03*
X83000000Y-141700000D03*
X83000000Y-144100000D03*
X83000000Y-140500000D03*
X84000000Y-143500000D03*
X84000000Y-139900000D03*
X84000000Y-141100000D03*
X84000000Y-142300000D03*
X91500000Y-131600000D03*
%TO.N,/VIN*%
X71200000Y-139300000D03*
X71200000Y-140500000D03*
X71200000Y-141700000D03*
X71200000Y-142900000D03*
X71200000Y-144100000D03*
X70200000Y-141100000D03*
X70200000Y-142300000D03*
X70200000Y-139900000D03*
X70200000Y-143500000D03*
X69200000Y-141700000D03*
X69200000Y-144100000D03*
X69200000Y-142900000D03*
X69200000Y-140500000D03*
X69200000Y-139300000D03*
X68200000Y-141100000D03*
X68200000Y-139900000D03*
X68200000Y-142300000D03*
X68200000Y-143500000D03*
%TD*%
D18*
%TO.N,/VIN*%
G36*
X73775271Y-111163962D02*
G01*
X73463962Y-111475271D01*
X73219369Y-111841331D01*
X73050890Y-112248075D01*
X72965000Y-112679872D01*
X72965000Y-113120128D01*
X73050890Y-113551925D01*
X73219369Y-113958669D01*
X73463962Y-114324729D01*
X73775271Y-114636038D01*
X74141331Y-114880631D01*
X74548075Y-115049110D01*
X74979872Y-115135000D01*
X75420128Y-115135000D01*
X75851925Y-115049110D01*
X76258669Y-114880631D01*
X76624729Y-114636038D01*
X76936038Y-114324729D01*
X77180631Y-113958669D01*
X77349110Y-113551925D01*
X77435000Y-113120128D01*
X77435000Y-112679872D01*
X77349110Y-112248075D01*
X77180631Y-111841331D01*
X76936038Y-111475271D01*
X76624729Y-111163962D01*
X76319478Y-110960000D01*
X87280522Y-110960000D01*
X86975271Y-111163962D01*
X86663962Y-111475271D01*
X86419369Y-111841331D01*
X86250890Y-112248075D01*
X86165000Y-112679872D01*
X86165000Y-113120128D01*
X86250890Y-113551925D01*
X86419369Y-113958669D01*
X86663962Y-114324729D01*
X86975271Y-114636038D01*
X87341331Y-114880631D01*
X87748075Y-115049110D01*
X88179872Y-115135000D01*
X88620128Y-115135000D01*
X89051925Y-115049110D01*
X89458669Y-114880631D01*
X89824729Y-114636038D01*
X90136038Y-114324729D01*
X90380631Y-113958669D01*
X90549110Y-113551925D01*
X90635000Y-113120128D01*
X90635000Y-112679872D01*
X90549110Y-112248075D01*
X90380631Y-111841331D01*
X90136038Y-111475271D01*
X89824729Y-111163962D01*
X89519478Y-110960000D01*
X92873000Y-110960000D01*
X92873000Y-111002881D01*
X92786018Y-111212872D01*
X92727110Y-111509024D01*
X92727110Y-111810976D01*
X92786018Y-112107128D01*
X92873000Y-112317120D01*
X92873000Y-116082880D01*
X92786018Y-116292872D01*
X92727110Y-116589024D01*
X92727110Y-116890976D01*
X92786018Y-117187128D01*
X92873000Y-117397120D01*
X92873000Y-128082431D01*
X92860498Y-128105820D01*
X92838487Y-128178380D01*
X92706632Y-128046525D01*
X92463411Y-127884010D01*
X92193158Y-127772068D01*
X91906260Y-127715000D01*
X91613740Y-127715000D01*
X91326842Y-127772068D01*
X91056589Y-127884010D01*
X90813368Y-128046525D01*
X90606525Y-128253368D01*
X90444010Y-128496589D01*
X90332068Y-128766842D01*
X90275000Y-129053740D01*
X90275000Y-129346260D01*
X90332068Y-129633158D01*
X90444010Y-129903411D01*
X90606525Y-130146632D01*
X90813368Y-130353475D01*
X91056589Y-130515990D01*
X91247305Y-130594987D01*
X91198102Y-130604774D01*
X91009744Y-130682795D01*
X90840226Y-130796063D01*
X90696063Y-130940226D01*
X90582795Y-131109744D01*
X90504774Y-131298102D01*
X90465000Y-131498061D01*
X90465000Y-131701939D01*
X90504774Y-131901898D01*
X90582795Y-132090256D01*
X90696063Y-132259774D01*
X90840226Y-132403937D01*
X91009744Y-132517205D01*
X91198102Y-132595226D01*
X91398061Y-132635000D01*
X91601939Y-132635000D01*
X91801898Y-132595226D01*
X91990256Y-132517205D01*
X92159774Y-132403937D01*
X92303937Y-132259774D01*
X92417205Y-132090256D01*
X92495226Y-131901898D01*
X92535000Y-131701939D01*
X92535000Y-131498061D01*
X92495226Y-131298102D01*
X92417205Y-131109744D01*
X92303937Y-130940226D01*
X92159774Y-130796063D01*
X91990256Y-130682795D01*
X91966602Y-130672997D01*
X92193158Y-130627932D01*
X92463411Y-130515990D01*
X92706632Y-130353475D01*
X92838487Y-130221620D01*
X92860498Y-130294180D01*
X92873000Y-130317569D01*
X92873000Y-146640000D01*
X49727000Y-146640000D01*
X49727000Y-139298061D01*
X79965000Y-139298061D01*
X79965000Y-139501939D01*
X80004774Y-139701898D01*
X80082795Y-139890256D01*
X80156123Y-140000000D01*
X80082795Y-140109744D01*
X80004774Y-140298102D01*
X79965000Y-140498061D01*
X79965000Y-140701939D01*
X80004774Y-140901898D01*
X80082795Y-141090256D01*
X80156123Y-141200000D01*
X80082795Y-141309744D01*
X80004774Y-141498102D01*
X79965000Y-141698061D01*
X79965000Y-141901939D01*
X80004774Y-142101898D01*
X80082795Y-142290256D01*
X80156123Y-142400000D01*
X80082795Y-142509744D01*
X80004774Y-142698102D01*
X79965000Y-142898061D01*
X79965000Y-143101939D01*
X80004774Y-143301898D01*
X80082795Y-143490256D01*
X80156123Y-143600000D01*
X80082795Y-143709744D01*
X80004774Y-143898102D01*
X79965000Y-144098061D01*
X79965000Y-144301939D01*
X80004774Y-144501898D01*
X80082795Y-144690256D01*
X80196063Y-144859774D01*
X80340226Y-145003937D01*
X80509744Y-145117205D01*
X80698102Y-145195226D01*
X80898061Y-145235000D01*
X81101939Y-145235000D01*
X81301898Y-145195226D01*
X81490256Y-145117205D01*
X81659774Y-145003937D01*
X81803937Y-144859774D01*
X81917205Y-144690256D01*
X81940093Y-144635000D01*
X82101939Y-144635000D01*
X82111430Y-144633112D01*
X82196063Y-144759774D01*
X82340226Y-144903937D01*
X82509744Y-145017205D01*
X82698102Y-145095226D01*
X82898061Y-145135000D01*
X83101939Y-145135000D01*
X83301898Y-145095226D01*
X83490256Y-145017205D01*
X83659774Y-144903937D01*
X83803937Y-144759774D01*
X83917205Y-144590256D01*
X83940093Y-144535000D01*
X84101939Y-144535000D01*
X84301898Y-144495226D01*
X84490256Y-144417205D01*
X84659774Y-144303937D01*
X84803937Y-144159774D01*
X84917205Y-143990256D01*
X84995226Y-143801898D01*
X85035000Y-143601939D01*
X85035000Y-143398061D01*
X84995226Y-143198102D01*
X84917205Y-143009744D01*
X84843877Y-142900000D01*
X84917205Y-142790256D01*
X84995226Y-142601898D01*
X85035000Y-142401939D01*
X85035000Y-142198061D01*
X84995226Y-141998102D01*
X84917205Y-141809744D01*
X84843877Y-141700000D01*
X84917205Y-141590256D01*
X84995226Y-141401898D01*
X85035000Y-141201939D01*
X85035000Y-140998061D01*
X84995226Y-140798102D01*
X84917205Y-140609744D01*
X84843877Y-140500000D01*
X84917205Y-140390256D01*
X84995226Y-140201898D01*
X85035000Y-140001939D01*
X85035000Y-139798061D01*
X84995226Y-139598102D01*
X84917205Y-139409744D01*
X84877286Y-139350000D01*
X86411928Y-139350000D01*
X86411928Y-141050000D01*
X86424188Y-141174482D01*
X86460498Y-141294180D01*
X86519463Y-141404494D01*
X86598815Y-141501185D01*
X86695506Y-141580537D01*
X86805820Y-141639502D01*
X86925518Y-141675812D01*
X87050000Y-141688072D01*
X88750000Y-141688072D01*
X88874482Y-141675812D01*
X88994180Y-141639502D01*
X89104494Y-141580537D01*
X89201185Y-141501185D01*
X89280537Y-141404494D01*
X89289310Y-141388082D01*
X89319463Y-141444494D01*
X89398815Y-141541185D01*
X89495506Y-141620537D01*
X89605820Y-141679502D01*
X89725518Y-141715812D01*
X89850000Y-141728072D01*
X91550000Y-141728072D01*
X91674482Y-141715812D01*
X91794180Y-141679502D01*
X91904494Y-141620537D01*
X92001185Y-141541185D01*
X92080537Y-141444494D01*
X92139502Y-141334180D01*
X92175812Y-141214482D01*
X92188072Y-141090000D01*
X92188072Y-139390000D01*
X92175812Y-139265518D01*
X92139502Y-139145820D01*
X92080537Y-139035506D01*
X92001185Y-138938815D01*
X91904494Y-138859463D01*
X91794180Y-138800498D01*
X91721620Y-138778487D01*
X91853475Y-138646632D01*
X92015990Y-138403411D01*
X92127932Y-138133158D01*
X92185000Y-137846260D01*
X92185000Y-137553740D01*
X92127932Y-137266842D01*
X92015990Y-136996589D01*
X91853475Y-136753368D01*
X91646632Y-136546525D01*
X91403411Y-136384010D01*
X91133158Y-136272068D01*
X90846260Y-136215000D01*
X90553740Y-136215000D01*
X90266842Y-136272068D01*
X89996589Y-136384010D01*
X89753368Y-136546525D01*
X89546525Y-136753368D01*
X89384010Y-136996589D01*
X89308284Y-137179408D01*
X89215990Y-136956589D01*
X89053475Y-136713368D01*
X88846632Y-136506525D01*
X88603411Y-136344010D01*
X88333158Y-136232068D01*
X88046260Y-136175000D01*
X87753740Y-136175000D01*
X87466842Y-136232068D01*
X87196589Y-136344010D01*
X86953368Y-136506525D01*
X86746525Y-136713368D01*
X86584010Y-136956589D01*
X86472068Y-137226842D01*
X86415000Y-137513740D01*
X86415000Y-137806260D01*
X86472068Y-138093158D01*
X86584010Y-138363411D01*
X86746525Y-138606632D01*
X86878380Y-138738487D01*
X86805820Y-138760498D01*
X86695506Y-138819463D01*
X86598815Y-138898815D01*
X86519463Y-138995506D01*
X86460498Y-139105820D01*
X86424188Y-139225518D01*
X86411928Y-139350000D01*
X84877286Y-139350000D01*
X84803937Y-139240226D01*
X84659774Y-139096063D01*
X84490256Y-138982795D01*
X84301898Y-138904774D01*
X84101939Y-138865000D01*
X83940093Y-138865000D01*
X83917205Y-138809744D01*
X83803937Y-138640226D01*
X83659774Y-138496063D01*
X83490256Y-138382795D01*
X83301898Y-138304774D01*
X83101939Y-138265000D01*
X82898061Y-138265000D01*
X82698102Y-138304774D01*
X82509744Y-138382795D01*
X82340226Y-138496063D01*
X82196063Y-138640226D01*
X82082795Y-138809744D01*
X82018485Y-138965000D01*
X81940093Y-138965000D01*
X81917205Y-138909744D01*
X81803937Y-138740226D01*
X81659774Y-138596063D01*
X81490256Y-138482795D01*
X81301898Y-138404774D01*
X81101939Y-138365000D01*
X80898061Y-138365000D01*
X80698102Y-138404774D01*
X80509744Y-138482795D01*
X80340226Y-138596063D01*
X80196063Y-138740226D01*
X80082795Y-138909744D01*
X80004774Y-139098102D01*
X79965000Y-139298061D01*
X49727000Y-139298061D01*
X49727000Y-126934042D01*
X62035000Y-126934042D01*
X62035000Y-127265958D01*
X62099754Y-127591496D01*
X62226772Y-127898147D01*
X62411175Y-128174125D01*
X62645875Y-128408825D01*
X62921853Y-128593228D01*
X63228504Y-128720246D01*
X63554042Y-128785000D01*
X63885958Y-128785000D01*
X64211496Y-128720246D01*
X64518147Y-128593228D01*
X64794125Y-128408825D01*
X65028825Y-128174125D01*
X65213228Y-127898147D01*
X65340246Y-127591496D01*
X65405000Y-127265958D01*
X65405000Y-126934042D01*
X67115000Y-126934042D01*
X67115000Y-127265958D01*
X67179754Y-127591496D01*
X67306772Y-127898147D01*
X67491175Y-128174125D01*
X67725875Y-128408825D01*
X68001853Y-128593228D01*
X68308504Y-128720246D01*
X68634042Y-128785000D01*
X68965958Y-128785000D01*
X69291496Y-128720246D01*
X69598147Y-128593228D01*
X69874125Y-128408825D01*
X70108825Y-128174125D01*
X70293228Y-127898147D01*
X70420246Y-127591496D01*
X70485000Y-127265958D01*
X70485000Y-126934042D01*
X70420246Y-126608504D01*
X70293228Y-126301853D01*
X70108825Y-126025875D01*
X69874125Y-125791175D01*
X69598147Y-125606772D01*
X69291496Y-125479754D01*
X68965958Y-125415000D01*
X68634042Y-125415000D01*
X68308504Y-125479754D01*
X68001853Y-125606772D01*
X67725875Y-125791175D01*
X67491175Y-126025875D01*
X67306772Y-126301853D01*
X67179754Y-126608504D01*
X67115000Y-126934042D01*
X65405000Y-126934042D01*
X65340246Y-126608504D01*
X65213228Y-126301853D01*
X65028825Y-126025875D01*
X64794125Y-125791175D01*
X64518147Y-125606772D01*
X64211496Y-125479754D01*
X63885958Y-125415000D01*
X63554042Y-125415000D01*
X63228504Y-125479754D01*
X62921853Y-125606772D01*
X62645875Y-125791175D01*
X62411175Y-126025875D01*
X62226772Y-126301853D01*
X62099754Y-126608504D01*
X62035000Y-126934042D01*
X49727000Y-126934042D01*
X49727000Y-118234042D01*
X62035000Y-118234042D01*
X62035000Y-118565958D01*
X62099754Y-118891496D01*
X62226772Y-119198147D01*
X62411175Y-119474125D01*
X62645875Y-119708825D01*
X62921853Y-119893228D01*
X63228504Y-120020246D01*
X63554042Y-120085000D01*
X63885958Y-120085000D01*
X64211496Y-120020246D01*
X64518147Y-119893228D01*
X64794125Y-119708825D01*
X65028825Y-119474125D01*
X65213228Y-119198147D01*
X65340246Y-118891496D01*
X65405000Y-118565958D01*
X65405000Y-118234042D01*
X67115000Y-118234042D01*
X67115000Y-118565958D01*
X67179754Y-118891496D01*
X67306772Y-119198147D01*
X67491175Y-119474125D01*
X67725875Y-119708825D01*
X68001853Y-119893228D01*
X68308504Y-120020246D01*
X68634042Y-120085000D01*
X68965958Y-120085000D01*
X69291496Y-120020246D01*
X69598147Y-119893228D01*
X69874125Y-119708825D01*
X70108825Y-119474125D01*
X70293228Y-119198147D01*
X70420246Y-118891496D01*
X70485000Y-118565958D01*
X70485000Y-118234042D01*
X70420246Y-117908504D01*
X70293228Y-117601853D01*
X70108825Y-117325875D01*
X69874125Y-117091175D01*
X69598147Y-116906772D01*
X69291496Y-116779754D01*
X68965958Y-116715000D01*
X68634042Y-116715000D01*
X68308504Y-116779754D01*
X68001853Y-116906772D01*
X67725875Y-117091175D01*
X67491175Y-117325875D01*
X67306772Y-117601853D01*
X67179754Y-117908504D01*
X67115000Y-118234042D01*
X65405000Y-118234042D01*
X65340246Y-117908504D01*
X65213228Y-117601853D01*
X65028825Y-117325875D01*
X64794125Y-117091175D01*
X64518147Y-116906772D01*
X64211496Y-116779754D01*
X63885958Y-116715000D01*
X63554042Y-116715000D01*
X63228504Y-116779754D01*
X62921853Y-116906772D01*
X62645875Y-117091175D01*
X62411175Y-117325875D01*
X62226772Y-117601853D01*
X62099754Y-117908504D01*
X62035000Y-118234042D01*
X49727000Y-118234042D01*
X49727000Y-116100000D01*
X78061928Y-116100000D01*
X78061928Y-118100000D01*
X78074188Y-118224482D01*
X78110498Y-118344180D01*
X78169463Y-118454494D01*
X78248815Y-118551185D01*
X78345506Y-118630537D01*
X78455820Y-118689502D01*
X78575518Y-118725812D01*
X78700000Y-118738072D01*
X80700000Y-118738072D01*
X80824482Y-118725812D01*
X80944180Y-118689502D01*
X81054494Y-118630537D01*
X81151185Y-118551185D01*
X81230537Y-118454494D01*
X81289502Y-118344180D01*
X81325812Y-118224482D01*
X81338072Y-118100000D01*
X81338072Y-116100000D01*
X82261928Y-116100000D01*
X82261928Y-118100000D01*
X82274188Y-118224482D01*
X82310498Y-118344180D01*
X82369463Y-118454494D01*
X82448815Y-118551185D01*
X82545506Y-118630537D01*
X82655820Y-118689502D01*
X82775518Y-118725812D01*
X82900000Y-118738072D01*
X84900000Y-118738072D01*
X85024482Y-118725812D01*
X85144180Y-118689502D01*
X85254494Y-118630537D01*
X85351185Y-118551185D01*
X85430537Y-118454494D01*
X85489502Y-118344180D01*
X85525812Y-118224482D01*
X85538072Y-118100000D01*
X85538072Y-116100000D01*
X85525812Y-115975518D01*
X85489502Y-115855820D01*
X85430537Y-115745506D01*
X85351185Y-115648815D01*
X85254494Y-115569463D01*
X85144180Y-115510498D01*
X85024482Y-115474188D01*
X84900000Y-115461928D01*
X82900000Y-115461928D01*
X82775518Y-115474188D01*
X82655820Y-115510498D01*
X82545506Y-115569463D01*
X82448815Y-115648815D01*
X82369463Y-115745506D01*
X82310498Y-115855820D01*
X82274188Y-115975518D01*
X82261928Y-116100000D01*
X81338072Y-116100000D01*
X81325812Y-115975518D01*
X81289502Y-115855820D01*
X81230537Y-115745506D01*
X81151185Y-115648815D01*
X81054494Y-115569463D01*
X80944180Y-115510498D01*
X80824482Y-115474188D01*
X80700000Y-115461928D01*
X78700000Y-115461928D01*
X78575518Y-115474188D01*
X78455820Y-115510498D01*
X78345506Y-115569463D01*
X78248815Y-115648815D01*
X78169463Y-115745506D01*
X78110498Y-115855820D01*
X78074188Y-115975518D01*
X78061928Y-116100000D01*
X49727000Y-116100000D01*
X49727000Y-110960000D01*
X74080522Y-110960000D01*
X73775271Y-111163962D01*
G37*
X73775271Y-111163962D02*
X73463962Y-111475271D01*
X73219369Y-111841331D01*
X73050890Y-112248075D01*
X72965000Y-112679872D01*
X72965000Y-113120128D01*
X73050890Y-113551925D01*
X73219369Y-113958669D01*
X73463962Y-114324729D01*
X73775271Y-114636038D01*
X74141331Y-114880631D01*
X74548075Y-115049110D01*
X74979872Y-115135000D01*
X75420128Y-115135000D01*
X75851925Y-115049110D01*
X76258669Y-114880631D01*
X76624729Y-114636038D01*
X76936038Y-114324729D01*
X77180631Y-113958669D01*
X77349110Y-113551925D01*
X77435000Y-113120128D01*
X77435000Y-112679872D01*
X77349110Y-112248075D01*
X77180631Y-111841331D01*
X76936038Y-111475271D01*
X76624729Y-111163962D01*
X76319478Y-110960000D01*
X87280522Y-110960000D01*
X86975271Y-111163962D01*
X86663962Y-111475271D01*
X86419369Y-111841331D01*
X86250890Y-112248075D01*
X86165000Y-112679872D01*
X86165000Y-113120128D01*
X86250890Y-113551925D01*
X86419369Y-113958669D01*
X86663962Y-114324729D01*
X86975271Y-114636038D01*
X87341331Y-114880631D01*
X87748075Y-115049110D01*
X88179872Y-115135000D01*
X88620128Y-115135000D01*
X89051925Y-115049110D01*
X89458669Y-114880631D01*
X89824729Y-114636038D01*
X90136038Y-114324729D01*
X90380631Y-113958669D01*
X90549110Y-113551925D01*
X90635000Y-113120128D01*
X90635000Y-112679872D01*
X90549110Y-112248075D01*
X90380631Y-111841331D01*
X90136038Y-111475271D01*
X89824729Y-111163962D01*
X89519478Y-110960000D01*
X92873000Y-110960000D01*
X92873000Y-111002881D01*
X92786018Y-111212872D01*
X92727110Y-111509024D01*
X92727110Y-111810976D01*
X92786018Y-112107128D01*
X92873000Y-112317120D01*
X92873000Y-116082880D01*
X92786018Y-116292872D01*
X92727110Y-116589024D01*
X92727110Y-116890976D01*
X92786018Y-117187128D01*
X92873000Y-117397120D01*
X92873000Y-128082431D01*
X92860498Y-128105820D01*
X92838487Y-128178380D01*
X92706632Y-128046525D01*
X92463411Y-127884010D01*
X92193158Y-127772068D01*
X91906260Y-127715000D01*
X91613740Y-127715000D01*
X91326842Y-127772068D01*
X91056589Y-127884010D01*
X90813368Y-128046525D01*
X90606525Y-128253368D01*
X90444010Y-128496589D01*
X90332068Y-128766842D01*
X90275000Y-129053740D01*
X90275000Y-129346260D01*
X90332068Y-129633158D01*
X90444010Y-129903411D01*
X90606525Y-130146632D01*
X90813368Y-130353475D01*
X91056589Y-130515990D01*
X91247305Y-130594987D01*
X91198102Y-130604774D01*
X91009744Y-130682795D01*
X90840226Y-130796063D01*
X90696063Y-130940226D01*
X90582795Y-131109744D01*
X90504774Y-131298102D01*
X90465000Y-131498061D01*
X90465000Y-131701939D01*
X90504774Y-131901898D01*
X90582795Y-132090256D01*
X90696063Y-132259774D01*
X90840226Y-132403937D01*
X91009744Y-132517205D01*
X91198102Y-132595226D01*
X91398061Y-132635000D01*
X91601939Y-132635000D01*
X91801898Y-132595226D01*
X91990256Y-132517205D01*
X92159774Y-132403937D01*
X92303937Y-132259774D01*
X92417205Y-132090256D01*
X92495226Y-131901898D01*
X92535000Y-131701939D01*
X92535000Y-131498061D01*
X92495226Y-131298102D01*
X92417205Y-131109744D01*
X92303937Y-130940226D01*
X92159774Y-130796063D01*
X91990256Y-130682795D01*
X91966602Y-130672997D01*
X92193158Y-130627932D01*
X92463411Y-130515990D01*
X92706632Y-130353475D01*
X92838487Y-130221620D01*
X92860498Y-130294180D01*
X92873000Y-130317569D01*
X92873000Y-146640000D01*
X49727000Y-146640000D01*
X49727000Y-139298061D01*
X79965000Y-139298061D01*
X79965000Y-139501939D01*
X80004774Y-139701898D01*
X80082795Y-139890256D01*
X80156123Y-140000000D01*
X80082795Y-140109744D01*
X80004774Y-140298102D01*
X79965000Y-140498061D01*
X79965000Y-140701939D01*
X80004774Y-140901898D01*
X80082795Y-141090256D01*
X80156123Y-141200000D01*
X80082795Y-141309744D01*
X80004774Y-141498102D01*
X79965000Y-141698061D01*
X79965000Y-141901939D01*
X80004774Y-142101898D01*
X80082795Y-142290256D01*
X80156123Y-142400000D01*
X80082795Y-142509744D01*
X80004774Y-142698102D01*
X79965000Y-142898061D01*
X79965000Y-143101939D01*
X80004774Y-143301898D01*
X80082795Y-143490256D01*
X80156123Y-143600000D01*
X80082795Y-143709744D01*
X80004774Y-143898102D01*
X79965000Y-144098061D01*
X79965000Y-144301939D01*
X80004774Y-144501898D01*
X80082795Y-144690256D01*
X80196063Y-144859774D01*
X80340226Y-145003937D01*
X80509744Y-145117205D01*
X80698102Y-145195226D01*
X80898061Y-145235000D01*
X81101939Y-145235000D01*
X81301898Y-145195226D01*
X81490256Y-145117205D01*
X81659774Y-145003937D01*
X81803937Y-144859774D01*
X81917205Y-144690256D01*
X81940093Y-144635000D01*
X82101939Y-144635000D01*
X82111430Y-144633112D01*
X82196063Y-144759774D01*
X82340226Y-144903937D01*
X82509744Y-145017205D01*
X82698102Y-145095226D01*
X82898061Y-145135000D01*
X83101939Y-145135000D01*
X83301898Y-145095226D01*
X83490256Y-145017205D01*
X83659774Y-144903937D01*
X83803937Y-144759774D01*
X83917205Y-144590256D01*
X83940093Y-144535000D01*
X84101939Y-144535000D01*
X84301898Y-144495226D01*
X84490256Y-144417205D01*
X84659774Y-144303937D01*
X84803937Y-144159774D01*
X84917205Y-143990256D01*
X84995226Y-143801898D01*
X85035000Y-143601939D01*
X85035000Y-143398061D01*
X84995226Y-143198102D01*
X84917205Y-143009744D01*
X84843877Y-142900000D01*
X84917205Y-142790256D01*
X84995226Y-142601898D01*
X85035000Y-142401939D01*
X85035000Y-142198061D01*
X84995226Y-141998102D01*
X84917205Y-141809744D01*
X84843877Y-141700000D01*
X84917205Y-141590256D01*
X84995226Y-141401898D01*
X85035000Y-141201939D01*
X85035000Y-140998061D01*
X84995226Y-140798102D01*
X84917205Y-140609744D01*
X84843877Y-140500000D01*
X84917205Y-140390256D01*
X84995226Y-140201898D01*
X85035000Y-140001939D01*
X85035000Y-139798061D01*
X84995226Y-139598102D01*
X84917205Y-139409744D01*
X84877286Y-139350000D01*
X86411928Y-139350000D01*
X86411928Y-141050000D01*
X86424188Y-141174482D01*
X86460498Y-141294180D01*
X86519463Y-141404494D01*
X86598815Y-141501185D01*
X86695506Y-141580537D01*
X86805820Y-141639502D01*
X86925518Y-141675812D01*
X87050000Y-141688072D01*
X88750000Y-141688072D01*
X88874482Y-141675812D01*
X88994180Y-141639502D01*
X89104494Y-141580537D01*
X89201185Y-141501185D01*
X89280537Y-141404494D01*
X89289310Y-141388082D01*
X89319463Y-141444494D01*
X89398815Y-141541185D01*
X89495506Y-141620537D01*
X89605820Y-141679502D01*
X89725518Y-141715812D01*
X89850000Y-141728072D01*
X91550000Y-141728072D01*
X91674482Y-141715812D01*
X91794180Y-141679502D01*
X91904494Y-141620537D01*
X92001185Y-141541185D01*
X92080537Y-141444494D01*
X92139502Y-141334180D01*
X92175812Y-141214482D01*
X92188072Y-141090000D01*
X92188072Y-139390000D01*
X92175812Y-139265518D01*
X92139502Y-139145820D01*
X92080537Y-139035506D01*
X92001185Y-138938815D01*
X91904494Y-138859463D01*
X91794180Y-138800498D01*
X91721620Y-138778487D01*
X91853475Y-138646632D01*
X92015990Y-138403411D01*
X92127932Y-138133158D01*
X92185000Y-137846260D01*
X92185000Y-137553740D01*
X92127932Y-137266842D01*
X92015990Y-136996589D01*
X91853475Y-136753368D01*
X91646632Y-136546525D01*
X91403411Y-136384010D01*
X91133158Y-136272068D01*
X90846260Y-136215000D01*
X90553740Y-136215000D01*
X90266842Y-136272068D01*
X89996589Y-136384010D01*
X89753368Y-136546525D01*
X89546525Y-136753368D01*
X89384010Y-136996589D01*
X89308284Y-137179408D01*
X89215990Y-136956589D01*
X89053475Y-136713368D01*
X88846632Y-136506525D01*
X88603411Y-136344010D01*
X88333158Y-136232068D01*
X88046260Y-136175000D01*
X87753740Y-136175000D01*
X87466842Y-136232068D01*
X87196589Y-136344010D01*
X86953368Y-136506525D01*
X86746525Y-136713368D01*
X86584010Y-136956589D01*
X86472068Y-137226842D01*
X86415000Y-137513740D01*
X86415000Y-137806260D01*
X86472068Y-138093158D01*
X86584010Y-138363411D01*
X86746525Y-138606632D01*
X86878380Y-138738487D01*
X86805820Y-138760498D01*
X86695506Y-138819463D01*
X86598815Y-138898815D01*
X86519463Y-138995506D01*
X86460498Y-139105820D01*
X86424188Y-139225518D01*
X86411928Y-139350000D01*
X84877286Y-139350000D01*
X84803937Y-139240226D01*
X84659774Y-139096063D01*
X84490256Y-138982795D01*
X84301898Y-138904774D01*
X84101939Y-138865000D01*
X83940093Y-138865000D01*
X83917205Y-138809744D01*
X83803937Y-138640226D01*
X83659774Y-138496063D01*
X83490256Y-138382795D01*
X83301898Y-138304774D01*
X83101939Y-138265000D01*
X82898061Y-138265000D01*
X82698102Y-138304774D01*
X82509744Y-138382795D01*
X82340226Y-138496063D01*
X82196063Y-138640226D01*
X82082795Y-138809744D01*
X82018485Y-138965000D01*
X81940093Y-138965000D01*
X81917205Y-138909744D01*
X81803937Y-138740226D01*
X81659774Y-138596063D01*
X81490256Y-138482795D01*
X81301898Y-138404774D01*
X81101939Y-138365000D01*
X80898061Y-138365000D01*
X80698102Y-138404774D01*
X80509744Y-138482795D01*
X80340226Y-138596063D01*
X80196063Y-138740226D01*
X80082795Y-138909744D01*
X80004774Y-139098102D01*
X79965000Y-139298061D01*
X49727000Y-139298061D01*
X49727000Y-126934042D01*
X62035000Y-126934042D01*
X62035000Y-127265958D01*
X62099754Y-127591496D01*
X62226772Y-127898147D01*
X62411175Y-128174125D01*
X62645875Y-128408825D01*
X62921853Y-128593228D01*
X63228504Y-128720246D01*
X63554042Y-128785000D01*
X63885958Y-128785000D01*
X64211496Y-128720246D01*
X64518147Y-128593228D01*
X64794125Y-128408825D01*
X65028825Y-128174125D01*
X65213228Y-127898147D01*
X65340246Y-127591496D01*
X65405000Y-127265958D01*
X65405000Y-126934042D01*
X67115000Y-126934042D01*
X67115000Y-127265958D01*
X67179754Y-127591496D01*
X67306772Y-127898147D01*
X67491175Y-128174125D01*
X67725875Y-128408825D01*
X68001853Y-128593228D01*
X68308504Y-128720246D01*
X68634042Y-128785000D01*
X68965958Y-128785000D01*
X69291496Y-128720246D01*
X69598147Y-128593228D01*
X69874125Y-128408825D01*
X70108825Y-128174125D01*
X70293228Y-127898147D01*
X70420246Y-127591496D01*
X70485000Y-127265958D01*
X70485000Y-126934042D01*
X70420246Y-126608504D01*
X70293228Y-126301853D01*
X70108825Y-126025875D01*
X69874125Y-125791175D01*
X69598147Y-125606772D01*
X69291496Y-125479754D01*
X68965958Y-125415000D01*
X68634042Y-125415000D01*
X68308504Y-125479754D01*
X68001853Y-125606772D01*
X67725875Y-125791175D01*
X67491175Y-126025875D01*
X67306772Y-126301853D01*
X67179754Y-126608504D01*
X67115000Y-126934042D01*
X65405000Y-126934042D01*
X65340246Y-126608504D01*
X65213228Y-126301853D01*
X65028825Y-126025875D01*
X64794125Y-125791175D01*
X64518147Y-125606772D01*
X64211496Y-125479754D01*
X63885958Y-125415000D01*
X63554042Y-125415000D01*
X63228504Y-125479754D01*
X62921853Y-125606772D01*
X62645875Y-125791175D01*
X62411175Y-126025875D01*
X62226772Y-126301853D01*
X62099754Y-126608504D01*
X62035000Y-126934042D01*
X49727000Y-126934042D01*
X49727000Y-118234042D01*
X62035000Y-118234042D01*
X62035000Y-118565958D01*
X62099754Y-118891496D01*
X62226772Y-119198147D01*
X62411175Y-119474125D01*
X62645875Y-119708825D01*
X62921853Y-119893228D01*
X63228504Y-120020246D01*
X63554042Y-120085000D01*
X63885958Y-120085000D01*
X64211496Y-120020246D01*
X64518147Y-119893228D01*
X64794125Y-119708825D01*
X65028825Y-119474125D01*
X65213228Y-119198147D01*
X65340246Y-118891496D01*
X65405000Y-118565958D01*
X65405000Y-118234042D01*
X67115000Y-118234042D01*
X67115000Y-118565958D01*
X67179754Y-118891496D01*
X67306772Y-119198147D01*
X67491175Y-119474125D01*
X67725875Y-119708825D01*
X68001853Y-119893228D01*
X68308504Y-120020246D01*
X68634042Y-120085000D01*
X68965958Y-120085000D01*
X69291496Y-120020246D01*
X69598147Y-119893228D01*
X69874125Y-119708825D01*
X70108825Y-119474125D01*
X70293228Y-119198147D01*
X70420246Y-118891496D01*
X70485000Y-118565958D01*
X70485000Y-118234042D01*
X70420246Y-117908504D01*
X70293228Y-117601853D01*
X70108825Y-117325875D01*
X69874125Y-117091175D01*
X69598147Y-116906772D01*
X69291496Y-116779754D01*
X68965958Y-116715000D01*
X68634042Y-116715000D01*
X68308504Y-116779754D01*
X68001853Y-116906772D01*
X67725875Y-117091175D01*
X67491175Y-117325875D01*
X67306772Y-117601853D01*
X67179754Y-117908504D01*
X67115000Y-118234042D01*
X65405000Y-118234042D01*
X65340246Y-117908504D01*
X65213228Y-117601853D01*
X65028825Y-117325875D01*
X64794125Y-117091175D01*
X64518147Y-116906772D01*
X64211496Y-116779754D01*
X63885958Y-116715000D01*
X63554042Y-116715000D01*
X63228504Y-116779754D01*
X62921853Y-116906772D01*
X62645875Y-117091175D01*
X62411175Y-117325875D01*
X62226772Y-117601853D01*
X62099754Y-117908504D01*
X62035000Y-118234042D01*
X49727000Y-118234042D01*
X49727000Y-116100000D01*
X78061928Y-116100000D01*
X78061928Y-118100000D01*
X78074188Y-118224482D01*
X78110498Y-118344180D01*
X78169463Y-118454494D01*
X78248815Y-118551185D01*
X78345506Y-118630537D01*
X78455820Y-118689502D01*
X78575518Y-118725812D01*
X78700000Y-118738072D01*
X80700000Y-118738072D01*
X80824482Y-118725812D01*
X80944180Y-118689502D01*
X81054494Y-118630537D01*
X81151185Y-118551185D01*
X81230537Y-118454494D01*
X81289502Y-118344180D01*
X81325812Y-118224482D01*
X81338072Y-118100000D01*
X81338072Y-116100000D01*
X82261928Y-116100000D01*
X82261928Y-118100000D01*
X82274188Y-118224482D01*
X82310498Y-118344180D01*
X82369463Y-118454494D01*
X82448815Y-118551185D01*
X82545506Y-118630537D01*
X82655820Y-118689502D01*
X82775518Y-118725812D01*
X82900000Y-118738072D01*
X84900000Y-118738072D01*
X85024482Y-118725812D01*
X85144180Y-118689502D01*
X85254494Y-118630537D01*
X85351185Y-118551185D01*
X85430537Y-118454494D01*
X85489502Y-118344180D01*
X85525812Y-118224482D01*
X85538072Y-118100000D01*
X85538072Y-116100000D01*
X85525812Y-115975518D01*
X85489502Y-115855820D01*
X85430537Y-115745506D01*
X85351185Y-115648815D01*
X85254494Y-115569463D01*
X85144180Y-115510498D01*
X85024482Y-115474188D01*
X84900000Y-115461928D01*
X82900000Y-115461928D01*
X82775518Y-115474188D01*
X82655820Y-115510498D01*
X82545506Y-115569463D01*
X82448815Y-115648815D01*
X82369463Y-115745506D01*
X82310498Y-115855820D01*
X82274188Y-115975518D01*
X82261928Y-116100000D01*
X81338072Y-116100000D01*
X81325812Y-115975518D01*
X81289502Y-115855820D01*
X81230537Y-115745506D01*
X81151185Y-115648815D01*
X81054494Y-115569463D01*
X80944180Y-115510498D01*
X80824482Y-115474188D01*
X80700000Y-115461928D01*
X78700000Y-115461928D01*
X78575518Y-115474188D01*
X78455820Y-115510498D01*
X78345506Y-115569463D01*
X78248815Y-115648815D01*
X78169463Y-115745506D01*
X78110498Y-115855820D01*
X78074188Y-115975518D01*
X78061928Y-116100000D01*
X49727000Y-116100000D01*
X49727000Y-110960000D01*
X74080522Y-110960000D01*
X73775271Y-111163962D01*
%TD*%
M02*
