(module "1017505" (layer F.Cu)
  (descr "1017505-1")
  (tags "Connector")
  (fp_text reference J** (at 7.620 6.65) (layer F.SilkS)
    (effects (font (size 1.27 1.27) (thickness 0.254)))
  )
  (fp_text user %R (at 7.620 6.65) (layer F.Fab)
    (effects (font (size 1.27 1.27) (thickness 0.254)))
  )
  (fp_text value "1017505" (at 7.620 6.65) (layer F.SilkS) hide
    (effects (font (size 1.27 1.27) (thickness 0.254)))
  )
  (fp_line (start -2.94 -2.45) (end 18.18 -2.45) (layer F.Fab) (width 0.2))
  (fp_line (start 18.18 -2.45) (end 18.18 15.75) (layer F.Fab) (width 0.2))
  (fp_line (start 18.18 15.75) (end -2.94 15.75) (layer F.Fab) (width 0.2))
  (fp_line (start -2.94 15.75) (end -2.94 -2.45) (layer F.Fab) (width 0.2))
  (fp_line (start -2.94 -2.45) (end 18.18 -2.45) (layer F.SilkS) (width 0.1))
  (fp_line (start 18.18 -2.45) (end 18.18 15.75) (layer F.SilkS) (width 0.1))
  (fp_line (start 18.18 15.75) (end -2.94 15.75) (layer F.SilkS) (width 0.1))
  (fp_line (start -2.94 15.75) (end -2.94 -2.45) (layer F.SilkS) (width 0.1))
  (fp_line (start -3.94 -3.45) (end 19.18 -3.45) (layer F.CrtYd) (width 0.1))
  (fp_line (start 19.18 -3.45) (end 19.18 16.75) (layer F.CrtYd) (width 0.1))
  (fp_line (start 19.18 16.75) (end -3.94 16.75) (layer F.CrtYd) (width 0.1))
  (fp_line (start -3.94 16.75) (end -3.94 -3.45) (layer F.CrtYd) (width 0.1))
  (pad 1 thru_hole circle (at 0.000 -0) (size 2.100 2.100) (drill 1.4) (layers *.Cu *.Mask))
  (pad 2 thru_hole circle (at 0.000 8.7) (size 2.100 2.100) (drill 1.4) (layers *.Cu *.Mask))
  (pad 3 thru_hole circle (at 5.080 -0) (size 2.100 2.100) (drill 1.4) (layers *.Cu *.Mask))
  (pad 4 thru_hole circle (at 5.080 8.7) (size 2.100 2.100) (drill 1.4) (layers *.Cu *.Mask))
  (pad 5 thru_hole circle (at 10.160 -0) (size 2.100 2.100) (drill 1.4) (layers *.Cu *.Mask))
  (pad 6 thru_hole circle (at 10.160 8.7) (size 2.100 2.100) (drill 1.4) (layers *.Cu *.Mask))
  (pad 7 thru_hole circle (at 15.240 -0) (size 2.100 2.100) (drill 1.4) (layers *.Cu *.Mask))
  (pad 8 thru_hole circle (at 15.240 8.7) (size 2.100 2.100) (drill 1.4) (layers *.Cu *.Mask))
  (model 1017505.stp
    (at (xyz 0 0 0))
    (scale (xyz 1 1 1))
    (rotate (xyz 0 0 0))
  )
)
