%TF.GenerationSoftware,KiCad,Pcbnew,(5.1.6-0)*%
%TF.CreationDate,2020-12-23T08:40:41-08:00*%
%TF.ProjectId,rd53b_quad_power_adaptercard,72643533-625f-4717-9561-645f706f7765,rev?*%
%TF.SameCoordinates,Original*%
%TF.FileFunction,Soldermask,Bot*%
%TF.FilePolarity,Negative*%
%FSLAX46Y46*%
G04 Gerber Fmt 4.6, Leading zero omitted, Abs format (unit mm)*
G04 Created by KiCad (PCBNEW (5.1.6-0)) date 2020-12-23 08:40:41*
%MOMM*%
%LPD*%
G01*
G04 APERTURE LIST*
%ADD10C,3.300000*%
%ADD11R,2.100000X2.100000*%
%ADD12C,2.200000*%
%ADD13R,1.800000X1.800000*%
%ADD14O,1.800000X1.800000*%
%ADD15C,1.895780*%
%ADD16C,1.898320*%
G04 APERTURE END LIST*
D10*
%TO.C,REF\u002A\u002A*%
X45500000Y-113800000D03*
%TD*%
%TO.C,REF\u002A\u002A*%
X45500000Y-143800000D03*
%TD*%
%TO.C,REF\u002A\u002A*%
X106500000Y-143800000D03*
%TD*%
%TO.C,REF\u002A\u002A*%
X106500000Y-113800000D03*
%TD*%
%TO.C,J2*%
X75200000Y-112900000D03*
X88400000Y-112900000D03*
D11*
X79700000Y-117100000D03*
X83900000Y-117100000D03*
X79700000Y-122600000D03*
X83900000Y-122600000D03*
%TD*%
D12*
%TO.C,J7*%
X53560000Y-118400000D03*
X53560000Y-127100000D03*
X58640000Y-118400000D03*
X58640000Y-127100000D03*
X63720000Y-118400000D03*
X63720000Y-127100000D03*
X68800000Y-118400000D03*
X68800000Y-127100000D03*
%TD*%
D13*
%TO.C,J8*%
X45000000Y-131300000D03*
D14*
X45000000Y-133840000D03*
X45000000Y-136380000D03*
%TD*%
D15*
%TO.C,J6*%
X99340000Y-116740000D03*
X94260000Y-116740000D03*
X94260000Y-111660000D03*
X99340000Y-111660000D03*
D16*
X96800000Y-114200000D03*
%TD*%
D13*
%TO.C,J5*%
X90700000Y-140240000D03*
D14*
X90700000Y-137700000D03*
%TD*%
D13*
%TO.C,J4*%
X94300000Y-129200000D03*
D14*
X91760000Y-129200000D03*
%TD*%
D13*
%TO.C,J3*%
X87900000Y-140200000D03*
D14*
X87900000Y-137660000D03*
%TD*%
M02*
