(kicad_pcb (version 20171130) (host pcbnew "(5.1.6-0)")

  (general
    (thickness 1.6)
    (drawings 18)
    (tracks 76)
    (zones 0)
    (modules 17)
    (nets 11)
  )

  (page A4)
  (layers
    (0 F.Cu signal)
    (1 In1.Cu signal)
    (2 In2.Cu signal)
    (31 B.Cu signal)
    (32 B.Adhes user)
    (33 F.Adhes user)
    (34 B.Paste user)
    (35 F.Paste user)
    (36 B.SilkS user)
    (37 F.SilkS user)
    (38 B.Mask user)
    (39 F.Mask user)
    (40 Dwgs.User user)
    (41 Cmts.User user)
    (42 Eco1.User user)
    (43 Eco2.User user)
    (44 Edge.Cuts user)
    (45 Margin user)
    (46 B.CrtYd user)
    (47 F.CrtYd user)
    (48 B.Fab user)
    (49 F.Fab user)
  )

  (setup
    (last_trace_width 0.25)
    (trace_clearance 0.2)
    (zone_clearance 1)
    (zone_45_only no)
    (trace_min 0.2)
    (via_size 0.8)
    (via_drill 0.4)
    (via_min_size 0.4)
    (via_min_drill 0.3)
    (uvia_size 0.3)
    (uvia_drill 0.1)
    (uvias_allowed no)
    (uvia_min_size 0.2)
    (uvia_min_drill 0.1)
    (edge_width 0.05)
    (segment_width 0.2)
    (pcb_text_width 0.3)
    (pcb_text_size 1.5 1.5)
    (mod_edge_width 0.12)
    (mod_text_size 1 1)
    (mod_text_width 0.15)
    (pad_size 1.524 1.524)
    (pad_drill 0.762)
    (pad_to_mask_clearance 0.05)
    (aux_axis_origin 0 0)
    (visible_elements FFFFFF7F)
    (pcbplotparams
      (layerselection 0x010fc_ffffffff)
      (usegerberextensions false)
      (usegerberattributes true)
      (usegerberadvancedattributes true)
      (creategerberjobfile true)
      (excludeedgelayer true)
      (linewidth 0.100000)
      (plotframeref false)
      (viasonmask false)
      (mode 1)
      (useauxorigin false)
      (hpglpennumber 1)
      (hpglpenspeed 20)
      (hpglpendiameter 15.000000)
      (psnegative false)
      (psa4output false)
      (plotreference true)
      (plotvalue true)
      (plotinvisibletext false)
      (padsonsilk false)
      (subtractmaskfromsilk false)
      (outputformat 1)
      (mirror false)
      (drillshape 0)
      (scaleselection 1)
      (outputdirectory "Gerber/"))
  )

  (net 0 "")
  (net 1 "Net-(C1-Pad1)")
  (net 2 /GND)
  (net 3 /HV_RET)
  (net 4 /VIN)
  (net 5 /LP_Enable_M)
  (net 6 /HV)
  (net 7 /NTC_RET)
  (net 8 /NTC)
  (net 9 /LP_Enable)
  (net 10 "Net-(J8-Pad3)")

  (net_class Default "This is the default net class."
    (clearance 0.2)
    (trace_width 0.25)
    (via_dia 0.8)
    (via_drill 0.4)
    (uvia_dia 0.3)
    (uvia_drill 0.1)
    (add_net /GND)
    (add_net /HV)
    (add_net /HV_RET)
    (add_net /LP_Enable)
    (add_net /LP_Enable_M)
    (add_net /NTC)
    (add_net /NTC_RET)
    (add_net /VIN)
    (add_net "Net-(C1-Pad1)")
    (add_net "Net-(J8-Pad3)")
  )

  (module Library:lbl_logo (layer F.Cu) (tedit 0) (tstamp 5FE6FA99)
    (at 58.4 137.2)
    (fp_text reference G*** (at 0 0) (layer F.SilkS) hide
      (effects (font (size 1.524 1.524) (thickness 0.3)))
    )
    (fp_text value LOGO (at 0.75 0) (layer F.SilkS) hide
      (effects (font (size 1.524 1.524) (thickness 0.3)))
    )
    (fp_poly (pts (xy 3.1877 2.4257) (xy -3.175 2.4257) (xy -3.175 -0.061814) (xy -3.062081 -0.061814)
      (xy -3.062059 0.147467) (xy -3.061913 0.355699) (xy -3.061641 0.561326) (xy -3.061245 0.762792)
      (xy -3.060725 0.958541) (xy -3.060079 1.147018) (xy -3.059309 1.326667) (xy -3.058413 1.495931)
      (xy -3.057394 1.653255) (xy -3.056249 1.797084) (xy -3.054979 1.925861) (xy -3.053585 2.038031)
      (xy -3.052066 2.132037) (xy -3.050422 2.206325) (xy -3.048654 2.259337) (xy -3.046761 2.289519)
      (xy -3.045461 2.29616) (xy -3.038286 2.297884) (xy -3.019835 2.299485) (xy -2.989354 2.300966)
      (xy -2.946091 2.30233) (xy -2.889291 2.303582) (xy -2.818201 2.304724) (xy -2.732069 2.305762)
      (xy -2.630139 2.306698) (xy -2.51166 2.307537) (xy -2.375877 2.308282) (xy -2.222037 2.308937)
      (xy -2.049387 2.309505) (xy -1.857174 2.309991) (xy -1.644643 2.310399) (xy -1.411042 2.310731)
      (xy -1.155616 2.310992) (xy -0.877614 2.311185) (xy -0.57628 2.311315) (xy -0.250863 2.311384)
      (xy 0.008169 2.3114) (xy 3.046559 2.3114) (xy 3.066329 2.283174) (xy 3.06881 2.277782)
      (xy 3.071076 2.268275) (xy 3.073138 2.253564) (xy 3.075006 2.232556) (xy 3.076688 2.204161)
      (xy 3.078193 2.167289) (xy 3.079533 2.120849) (xy 3.080715 2.06375) (xy 3.08175 1.994902)
      (xy 3.082647 1.913213) (xy 3.083415 1.817594) (xy 3.084064 1.706953) (xy 3.084603 1.580199)
      (xy 3.085042 1.436243) (xy 3.085389 1.273993) (xy 3.085656 1.092358) (xy 3.08585 0.890249)
      (xy 3.085982 0.666573) (xy 3.08606 0.420241) (xy 3.086095 0.150162) (xy 3.0861 0.001349)
      (xy 3.086087 -0.280333) (xy 3.086043 -0.537714) (xy 3.085956 -0.771897) (xy 3.085817 -0.983982)
      (xy 3.085616 -1.175069) (xy 3.085343 -1.346258) (xy 3.084987 -1.498651) (xy 3.084538 -1.633348)
      (xy 3.083986 -1.75145) (xy 3.083321 -1.854056) (xy 3.082532 -1.942268) (xy 3.08161 -2.017186)
      (xy 3.080545 -2.079911) (xy 3.079325 -2.131544) (xy 3.077942 -2.173184) (xy 3.076384 -2.205932)
      (xy 3.074643 -2.23089) (xy 3.072707 -2.249156) (xy 3.070566 -2.261833) (xy 3.06821 -2.270021)
      (xy 3.06563 -2.27482) (xy 3.065081 -2.275475) (xy 3.062154 -2.277983) (xy 3.057447 -2.280304)
      (xy 3.05001 -2.282444) (xy 3.038888 -2.284412) (xy 3.023128 -2.286215) (xy 3.001777 -2.28786)
      (xy 2.973883 -2.289354) (xy 2.938492 -2.290704) (xy 2.894651 -2.291918) (xy 2.841406 -2.293002)
      (xy 2.777806 -2.293965) (xy 2.702896 -2.294813) (xy 2.615725 -2.295554) (xy 2.515337 -2.296195)
      (xy 2.400782 -2.296742) (xy 2.271105 -2.297204) (xy 2.125353 -2.297587) (xy 1.962574 -2.297899)
      (xy 1.781814 -2.298148) (xy 1.58212 -2.298339) (xy 1.362539 -2.298481) (xy 1.122118 -2.29858)
      (xy 0.859905 -2.298645) (xy 0.574945 -2.298681) (xy 0.266286 -2.298698) (xy 0.006921 -2.2987)
      (xy -0.336891 -2.298673) (xy -0.656057 -2.298589) (xy -0.951329 -2.298443) (xy -1.223463 -2.298233)
      (xy -1.473211 -2.297954) (xy -1.701327 -2.297603) (xy -1.908564 -2.297176) (xy -2.095676 -2.296669)
      (xy -2.263417 -2.296079) (xy -2.41254 -2.295401) (xy -2.543799 -2.294633) (xy -2.657947 -2.293769)
      (xy -2.755738 -2.292807) (xy -2.837925 -2.291742) (xy -2.905263 -2.290572) (xy -2.958504 -2.289291)
      (xy -2.998402 -2.287897) (xy -3.02571 -2.286386) (xy -3.041183 -2.284753) (xy -3.045461 -2.28346)
      (xy -3.047435 -2.268983) (xy -3.049285 -2.230662) (xy -3.05101 -2.170052) (xy -3.05261 -2.088711)
      (xy -3.054086 -1.988193) (xy -3.055436 -1.870054) (xy -3.056662 -1.73585) (xy -3.057763 -1.587138)
      (xy -3.05874 -1.425472) (xy -3.059591 -1.25241) (xy -3.060318 -1.069505) (xy -3.06092 -0.878315)
      (xy -3.061398 -0.680395) (xy -3.06175 -0.477301) (xy -3.061978 -0.270589) (xy -3.062081 -0.061814)
      (xy -3.175 -0.061814) (xy -3.175 -2.413) (xy 3.1877 -2.413) (xy 3.1877 2.4257)) (layer F.SilkS) (width 0.01))
    (fp_poly (pts (xy -2.473325 1.272724) (xy -2.387045 1.278326) (xy -2.322344 1.287882) (xy -2.275536 1.30274)
      (xy -2.242936 1.324247) (xy -2.220856 1.353752) (xy -2.214449 1.367363) (xy -2.201055 1.425578)
      (xy -2.207579 1.481711) (xy -2.233046 1.528005) (xy -2.234895 1.530024) (xy -2.260995 1.557806)
      (xy -2.235344 1.58102) (xy -2.205968 1.623369) (xy -2.193063 1.676903) (xy -2.196523 1.733561)
      (xy -2.216246 1.785283) (xy -2.238356 1.813022) (xy -2.267634 1.835751) (xy -2.301936 1.851331)
      (xy -2.346462 1.860931) (xy -2.406409 1.865726) (xy -2.477327 1.8669) (xy -2.6162 1.8669)
      (xy -2.6162 1.6129) (xy -2.4892 1.6129) (xy -2.4892 1.7653) (xy -2.434876 1.7653)
      (xy -2.393534 1.760692) (xy -2.358611 1.749251) (xy -2.352326 1.745529) (xy -2.329434 1.71577)
      (xy -2.325501 1.677776) (xy -2.341142 1.640882) (xy -2.345119 1.636125) (xy -2.372151 1.619418)
      (xy -2.416423 1.613066) (xy -2.427669 1.6129) (xy -2.4892 1.6129) (xy -2.6162 1.6129)
      (xy -2.6162 1.3843) (xy -2.4892 1.3843) (xy -2.4892 1.5113) (xy -2.441226 1.5113)
      (xy -2.401247 1.506047) (xy -2.367633 1.493231) (xy -2.365026 1.491529) (xy -2.342573 1.463389)
      (xy -2.33784 1.429138) (xy -2.35204 1.39954) (xy -2.373117 1.390481) (xy -2.409009 1.385022)
      (xy -2.42824 1.3843) (xy -2.4892 1.3843) (xy -2.6162 1.3843) (xy -2.6162 1.266803)
      (xy -2.473325 1.272724)) (layer F.SilkS) (width 0.01))
    (fp_poly (pts (xy -1.7907 1.3843) (xy -2.032 1.3843) (xy -2.032 1.5113) (xy -1.8288 1.5113)
      (xy -1.8288 1.6256) (xy -2.032 1.6256) (xy -2.032 1.7526) (xy -1.778 1.7526)
      (xy -1.778 1.8669) (xy -2.159 1.8669) (xy -2.159 1.27) (xy -1.7907 1.27)
      (xy -1.7907 1.3843)) (layer F.SilkS) (width 0.01))
    (fp_poly (pts (xy -1.622425 1.27007) (xy -1.540129 1.271849) (xy -1.478138 1.277898) (xy -1.43154 1.28944)
      (xy -1.395423 1.307697) (xy -1.364876 1.333891) (xy -1.364529 1.334253) (xy -1.342735 1.360414)
      (xy -1.331492 1.386807) (xy -1.327482 1.423528) (xy -1.32715 1.447928) (xy -1.328726 1.492663)
      (xy -1.335889 1.522438) (xy -1.352294 1.547618) (xy -1.368539 1.565291) (xy -1.409928 1.607994)
      (xy -1.359014 1.725382) (xy -1.337514 1.776151) (xy -1.320504 1.818597) (xy -1.310182 1.847103)
      (xy -1.3081 1.855498) (xy -1.319675 1.862301) (xy -1.350324 1.86501) (xy -1.374302 1.864388)
      (xy -1.440503 1.86055) (xy -1.490649 1.743075) (xy -1.514056 1.689487) (xy -1.531155 1.655213)
      (xy -1.545076 1.635985) (xy -1.558952 1.627537) (xy -1.575913 1.625602) (xy -1.576848 1.6256)
      (xy -1.6129 1.6256) (xy -1.6129 1.8669) (xy -1.7526 1.8669) (xy -1.7526 1.3843)
      (xy -1.6129 1.3843) (xy -1.6129 1.5113) (xy -1.550121 1.5113) (xy -1.508353 1.508783)
      (xy -1.48298 1.499255) (xy -1.467571 1.483074) (xy -1.451073 1.455116) (xy -1.452106 1.434993)
      (xy -1.47154 1.411367) (xy -1.4732 1.4097) (xy -1.505486 1.390487) (xy -1.55392 1.384305)
      (xy -1.55575 1.3843) (xy -1.6129 1.3843) (xy -1.7526 1.3843) (xy -1.7526 1.27)
      (xy -1.622425 1.27007)) (layer F.SilkS) (width 0.01))
    (fp_poly (pts (xy -0.844647 1.271772) (xy -0.836134 1.279006) (xy -0.840814 1.294932) (xy -0.859133 1.322897)
      (xy -0.891536 1.366246) (xy -0.916708 1.399425) (xy -0.948524 1.442783) (xy -0.973467 1.479257)
      (xy -0.988138 1.503738) (xy -0.9906 1.510391) (xy -0.984738 1.525734) (xy -0.968622 1.558883)
      (xy -0.944462 1.605514) (xy -0.914465 1.6613) (xy -0.9017 1.684533) (xy -0.870061 1.74253)
      (xy -0.843386 1.792855) (xy -0.823879 1.831241) (xy -0.81374 1.853424) (xy -0.8128 1.856776)
      (xy -0.824277 1.862291) (xy -0.854003 1.864874) (xy -0.885732 1.864358) (xy -0.958664 1.86055)
      (xy -1.023793 1.742163) (xy -1.088923 1.623776) (xy -1.115962 1.65815) (xy -1.131506 1.68375)
      (xy -1.139868 1.715815) (xy -1.142871 1.762555) (xy -1.143 1.779712) (xy -1.143 1.8669)
      (xy -1.27 1.8669) (xy -1.27 1.27) (xy -1.143989 1.27) (xy -1.14032 1.381125)
      (xy -1.13665 1.49225) (xy -1.055795 1.381125) (xy -0.974939 1.27) (xy -0.89947 1.27)
      (xy -0.865908 1.269885) (xy -0.844647 1.271772)) (layer F.SilkS) (width 0.01))
    (fp_poly (pts (xy -0.4191 1.3843) (xy -0.6604 1.3843) (xy -0.6604 1.5113) (xy -0.4572 1.5113)
      (xy -0.4572 1.6256) (xy -0.6604 1.6256) (xy -0.6604 1.7526) (xy -0.4064 1.7526)
      (xy -0.4064 1.8669) (xy -0.7874 1.8669) (xy -0.7874 1.27) (xy -0.4191 1.27)
      (xy -0.4191 1.3843)) (layer F.SilkS) (width 0.01))
    (fp_poly (pts (xy -0.2286 1.7526) (xy 0.0127 1.7526) (xy 0.0127 1.8669) (xy -0.3556 1.8669)
      (xy -0.3556 1.27) (xy -0.2286 1.27) (xy -0.2286 1.7526)) (layer F.SilkS) (width 0.01))
    (fp_poly (pts (xy 0.4318 1.3843) (xy 0.1905 1.3843) (xy 0.1905 1.5113) (xy 0.3937 1.5113)
      (xy 0.3937 1.6256) (xy 0.1905 1.6256) (xy 0.1905 1.7526) (xy 0.4445 1.7526)
      (xy 0.4445 1.8669) (xy 0.0635 1.8669) (xy 0.0635 1.27) (xy 0.4318 1.27)
      (xy 0.4318 1.3843)) (layer F.SilkS) (width 0.01))
    (fp_poly (pts (xy 0.714155 1.517586) (xy 0.838447 1.27) (xy 0.901823 1.27) (xy 0.938006 1.27228)
      (xy 0.96095 1.278109) (xy 0.9652 1.282654) (xy 0.959281 1.297616) (xy 0.942964 1.330514)
      (xy 0.918407 1.3772) (xy 0.887768 1.433532) (xy 0.86995 1.465614) (xy 0.7747 1.63592)
      (xy 0.7747 1.8669) (xy 0.6477 1.8669) (xy 0.6477 1.63285) (xy 0.55245 1.458868)
      (xy 0.51981 1.398796) (xy 0.49199 1.346731) (xy 0.471079 1.306651) (xy 0.459164 1.282534)
      (xy 0.4572 1.277443) (xy 0.468662 1.273291) (xy 0.498117 1.27059) (xy 0.524183 1.27)
      (xy 0.591167 1.27) (xy 0.714155 1.517586)) (layer F.SilkS) (width 0.01))
    (fp_poly (pts (xy 1.3462 1.7526) (xy 1.5875 1.7526) (xy 1.5875 1.8669) (xy 1.2192 1.8669)
      (xy 1.2192 1.27) (xy 1.3462 1.27) (xy 1.3462 1.7526)) (layer F.SilkS) (width 0.01))
    (fp_poly (pts (xy 2.030721 1.546225) (xy 2.053756 1.627061) (xy 2.074722 1.700554) (xy 2.092526 1.762886)
      (xy 2.106079 1.810238) (xy 2.114289 1.838794) (xy 2.116003 1.844675) (xy 2.116571 1.857554)
      (xy 2.104884 1.864264) (xy 2.075655 1.866696) (xy 2.053926 1.8669) (xy 1.985241 1.8669)
      (xy 1.96961 1.79705) (xy 1.953978 1.7272) (xy 1.791409 1.7272) (xy 1.750797 1.8669)
      (xy 1.688198 1.8669) (xy 1.652131 1.865159) (xy 1.62923 1.860716) (xy 1.625033 1.857375)
      (xy 1.628125 1.842935) (xy 1.63711 1.80755) (xy 1.651052 1.75474) (xy 1.669016 1.688023)
      (xy 1.689522 1.6129) (xy 1.818147 1.6129) (xy 1.867923 1.6129) (xy 1.899281 1.610748)
      (xy 1.916349 1.605384) (xy 1.917409 1.603375) (xy 1.914255 1.587186) (xy 1.90622 1.553464)
      (xy 1.894979 1.509213) (xy 1.893867 1.50495) (xy 1.870614 1.41605) (xy 1.855244 1.4732)
      (xy 1.843063 1.518692) (xy 1.831612 1.561766) (xy 1.82901 1.571625) (xy 1.818147 1.6129)
      (xy 1.689522 1.6129) (xy 1.690064 1.610918) (xy 1.704396 1.558925) (xy 1.784327 1.27)
      (xy 1.952047 1.27) (xy 2.030721 1.546225)) (layer F.SilkS) (width 0.01))
    (fp_poly (pts (xy 2.360273 1.273777) (xy 2.43914 1.285754) (xy 2.497277 1.306898) (xy 2.536492 1.338176)
      (xy 2.558596 1.380555) (xy 2.5654 1.433893) (xy 2.558065 1.492815) (xy 2.541892 1.524817)
      (xy 2.527879 1.544356) (xy 2.526305 1.560313) (xy 2.53803 1.582585) (xy 2.548242 1.597846)
      (xy 2.572616 1.653349) (xy 2.576674 1.712371) (xy 2.56203 1.768713) (xy 2.530296 1.816179)
      (xy 2.483085 1.848569) (xy 2.482979 1.848614) (xy 2.439244 1.859356) (xy 2.370753 1.865424)
      (xy 2.299107 1.8669) (xy 2.159 1.8669) (xy 2.159 1.6129) (xy 2.286 1.6129)
      (xy 2.286 1.7653) (xy 2.34315 1.7653) (xy 2.392188 1.759489) (xy 2.424876 1.740711)
      (xy 2.4257 1.7399) (xy 2.448126 1.704401) (xy 2.44805 1.669814) (xy 2.428162 1.64028)
      (xy 2.391153 1.619939) (xy 2.34315 1.6129) (xy 2.286 1.6129) (xy 2.159 1.6129)
      (xy 2.159 1.3843) (xy 2.286 1.3843) (xy 2.286 1.5113) (xy 2.333974 1.5113)
      (xy 2.373953 1.506047) (xy 2.407567 1.493231) (xy 2.410174 1.491529) (xy 2.435305 1.463644)
      (xy 2.438223 1.434787) (xy 2.421583 1.409151) (xy 2.38804 1.390928) (xy 2.342242 1.3843)
      (xy 2.286 1.3843) (xy 2.159 1.3843) (xy 2.159 1.27) (xy 2.258866 1.27)
      (xy 2.360273 1.273777)) (layer F.SilkS) (width 0.01))
    (fp_poly (pts (xy -0.547321 -1.428962) (xy -0.313098 -1.394444) (xy -0.254897 -1.382626) (xy -0.060411 -1.331961)
      (xy 0.137309 -1.26395) (xy 0.333978 -1.180859) (xy 0.52531 -1.084949) (xy 0.707021 -0.978485)
      (xy 0.874826 -0.863729) (xy 1.024438 -0.742946) (xy 1.110909 -0.661255) (xy 1.199468 -0.5715)
      (xy 1.4859 -0.5715) (xy 1.4859 1.016) (xy 1.3589 1.016) (xy 1.3589 -0.4572)
      (xy 1.102348 -0.4572) (xy 1.011549 -0.537512) (xy 0.811541 -0.702133) (xy 0.602767 -0.850587)
      (xy 0.388192 -0.981234) (xy 0.17078 -1.092429) (xy -0.046504 -1.182532) (xy -0.260696 -1.2499)
      (xy -0.286291 -1.256439) (xy -0.543297 -1.308291) (xy -0.802965 -1.336364) (xy -1.066535 -1.340632)
      (xy -1.335243 -1.321073) (xy -1.610329 -1.27766) (xy -1.835956 -1.225704) (xy -1.984233 -1.183622)
      (xy -2.130907 -1.135699) (xy -2.267907 -1.084734) (xy -2.380088 -1.03682) (xy -2.425792 -1.016701)
      (xy -2.462214 -1.002557) (xy -2.483737 -0.996486) (xy -2.48698 -0.996847) (xy -2.490002 -1.000641)
      (xy -2.488799 -1.005028) (xy -2.480261 -1.011818) (xy -2.461283 -1.022818) (xy -2.428757 -1.039838)
      (xy -2.379576 -1.064686) (xy -2.31447 -1.097252) (xy -2.153857 -1.173062) (xy -1.990791 -1.241688)
      (xy -1.830674 -1.301148) (xy -1.67891 -1.349461) (xy -1.540902 -1.384645) (xy -1.51765 -1.389488)
      (xy -1.283244 -1.42606) (xy -1.03899 -1.444805) (xy -0.791483 -1.445761) (xy -0.547321 -1.428962)) (layer F.SilkS) (width 0.01))
    (fp_poly (pts (xy 1.879871 -0.906768) (xy 1.886736 -0.88265) (xy 1.890108 -0.86209) (xy 1.893043 -0.828369)
      (xy 1.895566 -0.780103) (xy 1.897702 -0.715905) (xy 1.899478 -0.634389) (xy 1.900917 -0.534169)
      (xy 1.902046 -0.413859) (xy 1.90289 -0.272072) (xy 1.903474 -0.107424) (xy 1.90378 0.047625)
      (xy 1.905 0.9144) (xy 1.8288 0.9144) (xy 1.8288 0.070475) (xy 1.828901 -0.107344)
      (xy 1.82925 -0.261625) (xy 1.829909 -0.394229) (xy 1.830945 -0.507018) (xy 1.832421 -0.601853)
      (xy 1.834401 -0.680595) (xy 1.836951 -0.745106) (xy 1.840135 -0.797247) (xy 1.844017 -0.83888)
      (xy 1.848663 -0.871866) (xy 1.854136 -0.898066) (xy 1.860501 -0.919341) (xy 1.863395 -0.9271)
      (xy 1.870316 -0.927943) (xy 1.879871 -0.906768)) (layer F.SilkS) (width 0.01))
    (fp_poly (pts (xy 2.46981 -0.919656) (xy 2.483867 -0.887204) (xy 2.493861 -0.858163) (xy 2.497996 -0.843479)
      (xy 2.501551 -0.82496) (xy 2.504568 -0.800717) (xy 2.507091 -0.768859) (xy 2.509162 -0.727494)
      (xy 2.510823 -0.674734) (xy 2.512118 -0.608686) (xy 2.51309 -0.52746) (xy 2.51378 -0.429167)
      (xy 2.514232 -0.311914) (xy 2.514488 -0.173812) (xy 2.514591 -0.01297) (xy 2.5146 0.059412)
      (xy 2.5146 0.9144) (xy 2.413 0.9144) (xy 2.413 0.046712) (xy 2.413053 -0.125293)
      (xy 2.413239 -0.273765) (xy 2.413601 -0.400572) (xy 2.41418 -0.507581) (xy 2.415017 -0.59666)
      (xy 2.416153 -0.669677) (xy 2.41763 -0.728498) (xy 2.419489 -0.774991) (xy 2.421772 -0.811023)
      (xy 2.42452 -0.838462) (xy 2.427775 -0.859175) (xy 2.431578 -0.87503) (xy 2.433585 -0.881392)
      (xy 2.447016 -0.915846) (xy 2.458309 -0.928902) (xy 2.46981 -0.919656)) (layer F.SilkS) (width 0.01))
    (fp_poly (pts (xy -2.306248 -0.326312) (xy -2.253471 -0.321169) (xy -2.21409 -0.312661) (xy -2.20372 -0.308252)
      (xy -2.194142 -0.300173) (xy -2.200931 -0.293344) (xy -2.227443 -0.285937) (xy -2.255119 -0.28028)
      (xy -2.300544 -0.271414) (xy -2.33916 -0.263748) (xy -2.357232 -0.260059) (xy -2.374032 -0.251764)
      (xy -2.384398 -0.23149) (xy -2.39139 -0.192858) (xy -2.392046 -0.187534) (xy -2.396647 -0.135298)
      (xy -2.399606 -0.075023) (xy -2.40019 -0.042176) (xy -2.4003 0.036299) (xy -2.473325 0.050399)
      (xy -2.518724 0.059265) (xy -2.557798 0.067067) (xy -2.575204 0.070661) (xy -2.600951 0.06931)
      (xy -2.610392 0.060318) (xy -2.611916 0.041515) (xy -2.611143 0.003369) (xy -2.608292 -0.048188)
      (xy -2.604629 -0.095499) (xy -2.598902 -0.15714) (xy -2.593377 -0.199038) (xy -2.586428 -0.22678)
      (xy -2.576426 -0.245958) (xy -2.561746 -0.262161) (xy -2.554064 -0.269182) (xy -2.515917 -0.295073)
      (xy -2.470445 -0.315448) (xy -2.461123 -0.318284) (xy -2.418457 -0.325196) (xy -2.364038 -0.327763)
      (xy -2.306248 -0.326312)) (layer F.SilkS) (width 0.01))
    (fp_poly (pts (xy -1.199931 -0.321522) (xy -1.147787 -0.316564) (xy -1.107132 -0.308947) (xy -1.083389 -0.299556)
      (xy -1.0795 -0.293802) (xy -1.09108 -0.287362) (xy -1.121784 -0.279126) (xy -1.165557 -0.270644)
      (xy -1.177057 -0.268788) (xy -1.223531 -0.261224) (xy -1.258936 -0.254823) (xy -1.276957 -0.250743)
      (xy -1.277972 -0.250263) (xy -1.280006 -0.237033) (xy -1.283018 -0.20359) (xy -1.286592 -0.15508)
      (xy -1.290092 -0.100342) (xy -1.298854 0.046222) (xy -1.386263 0.061211) (xy -1.432049 0.068727)
      (xy -1.468545 0.074106) (xy -1.487952 0.076199) (xy -1.488075 0.0762) (xy -1.494267 0.06778)
      (xy -1.497383 0.040996) (xy -1.497522 -0.006442) (xy -1.494784 -0.076824) (xy -1.494756 -0.077392)
      (xy -1.490618 -0.138519) (xy -1.485075 -0.191137) (xy -1.478855 -0.229602) (xy -1.472739 -0.248206)
      (xy -1.436202 -0.277014) (xy -1.382217 -0.300899) (xy -1.318644 -0.317125) (xy -1.258141 -0.322938)
      (xy -1.199931 -0.321522)) (layer F.SilkS) (width 0.01))
    (fp_poly (pts (xy 1.073647 -0.324183) (xy 1.104355 -0.317717) (xy 1.136848 -0.306397) (xy 1.145258 -0.296225)
      (xy 1.129209 -0.286837) (xy 1.088324 -0.277873) (xy 1.058257 -0.273411) (xy 1.015505 -0.266553)
      (xy 0.986153 -0.256536) (xy 0.967288 -0.238877) (xy 0.955994 -0.209092) (xy 0.949359 -0.162698)
      (xy 0.944685 -0.098693) (xy 0.940001 -0.035808) (xy 0.934835 0.005803) (xy 0.928347 0.030265)
      (xy 0.919696 0.041701) (xy 0.915721 0.043474) (xy 0.894841 0.048257) (xy 0.859156 0.055382)
      (xy 0.817151 0.063281) (xy 0.77731 0.070385) (xy 0.748118 0.075126) (xy 0.738678 0.0762)
      (xy 0.736985 0.064334) (xy 0.73673 0.031989) (xy 0.737856 -0.015958) (xy 0.740307 -0.074632)
      (xy 0.740444 -0.077392) (xy 0.745119 -0.14597) (xy 0.751308 -0.200644) (xy 0.758437 -0.237172)
      (xy 0.763759 -0.24977) (xy 0.803658 -0.281281) (xy 0.861468 -0.305849) (xy 0.930317 -0.322102)
      (xy 1.003333 -0.32867) (xy 1.073647 -0.324183)) (layer F.SilkS) (width 0.01))
    (fp_poly (pts (xy -1.773278 -0.32837) (xy -1.708548 -0.323834) (xy -1.666947 -0.316959) (xy -1.648941 -0.30831)
      (xy -1.654996 -0.298455) (xy -1.685576 -0.287961) (xy -1.732522 -0.278747) (xy -1.779171 -0.270319)
      (xy -1.815022 -0.262145) (xy -1.83358 -0.255749) (xy -1.834669 -0.25478) (xy -1.837493 -0.239453)
      (xy -1.841219 -0.204259) (xy -1.845329 -0.154689) (xy -1.848749 -0.105181) (xy -1.857689 0.0361)
      (xy -1.93636 0.0498) (xy -1.989059 0.059194) (xy -2.024414 0.063222) (xy -2.045581 0.05826)
      (xy -2.055713 0.040685) (xy -2.057967 0.006877) (xy -2.055498 -0.046789) (xy -2.053353 -0.084524)
      (xy -2.049287 -0.150114) (xy -2.04469 -0.195507) (xy -2.038521 -0.225901) (xy -2.029735 -0.246495)
      (xy -2.017747 -0.262004) (xy -1.96943 -0.298311) (xy -1.904878 -0.320418) (xy -1.821763 -0.328958)
      (xy -1.773278 -0.32837)) (layer F.SilkS) (width 0.01))
    (fp_poly (pts (xy -0.654078 -0.327721) (xy -0.590241 -0.322626) (xy -0.549247 -0.315543) (xy -0.531649 -0.306952)
      (xy -0.538002 -0.297334) (xy -0.568861 -0.28717) (xy -0.600063 -0.280888) (xy -0.645345 -0.273498)
      (xy -0.68224 -0.268367) (xy -0.700879 -0.2667) (xy -0.712708 -0.254566) (xy -0.722678 -0.220355)
      (xy -0.730295 -0.167351) (xy -0.735063 -0.09884) (xy -0.73651 -0.029879) (xy -0.7366 0.035492)
      (xy -0.817016 0.049496) (xy -0.870489 0.059029) (xy -0.906336 0.063145) (xy -0.927797 0.058223)
      (xy -0.938111 0.040642) (xy -0.940518 0.00678) (xy -0.938256 -0.046983) (xy -0.936317 -0.083864)
      (xy -0.932586 -0.149014) (xy -0.928271 -0.194024) (xy -0.922319 -0.224151) (xy -0.913678 -0.24465)
      (xy -0.901295 -0.260779) (xy -0.900767 -0.261345) (xy -0.852289 -0.298173) (xy -0.78847 -0.32041)
      (xy -0.706716 -0.328753) (xy -0.654078 -0.327721)) (layer F.SilkS) (width 0.01))
    (fp_poly (pts (xy -0.092126 -0.327608) (xy -0.02597 -0.323149) (xy 0.017941 -0.316564) (xy 0.038948 -0.308336)
      (xy 0.036391 -0.298951) (xy 0.00961 -0.288894) (xy -0.028563 -0.280888) (xy -0.07385 -0.273498)
      (xy -0.110757 -0.268367) (xy -0.129407 -0.2667) (xy -0.141949 -0.254519) (xy -0.152226 -0.219921)
      (xy -0.159783 -0.165823) (xy -0.164165 -0.095144) (xy -0.1651 -0.037541) (xy -0.1651 0.035492)
      (xy -0.245516 0.049496) (xy -0.302082 0.058694) (xy -0.338273 0.06232) (xy -0.358559 0.060079)
      (xy -0.367411 0.051673) (xy -0.36923 0.041275) (xy -0.369716 -0.00579) (xy -0.368278 -0.064256)
      (xy -0.365363 -0.124581) (xy -0.361415 -0.17722) (xy -0.357553 -0.208948) (xy -0.350261 -0.238465)
      (xy -0.336546 -0.259452) (xy -0.310248 -0.278746) (xy -0.279283 -0.29584) (xy -0.244124 -0.313294)
      (xy -0.214595 -0.323758) (xy -0.182561 -0.328614) (xy -0.139887 -0.329242) (xy -0.092126 -0.327608)) (layer F.SilkS) (width 0.01))
    (fp_poly (pts (xy 0.523875 -0.331099) (xy 0.562841 -0.3214) (xy 0.589335 -0.311969) (xy 0.5969 -0.306156)
      (xy 0.585358 -0.299708) (xy 0.55494 -0.2916) (xy 0.511949 -0.283477) (xy 0.506909 -0.282683)
      (xy 0.461571 -0.274803) (xy 0.426754 -0.267144) (xy 0.409504 -0.261274) (xy 0.409105 -0.26094)
      (xy 0.402689 -0.243305) (xy 0.396016 -0.206782) (xy 0.389872 -0.157859) (xy 0.385043 -0.103026)
      (xy 0.382313 -0.048774) (xy 0.382071 -0.037511) (xy 0.381 0.032929) (xy 0.291864 0.048214)
      (xy 0.245648 0.055811) (xy 0.208697 0.061283) (xy 0.188706 0.063495) (xy 0.188321 0.0635)
      (xy 0.181961 0.054965) (xy 0.1789 0.027819) (xy 0.179029 -0.020252) (xy 0.181601 -0.079932)
      (xy 0.1853 -0.139189) (xy 0.189445 -0.19005) (xy 0.19349 -0.226558) (xy 0.196442 -0.241857)
      (xy 0.221238 -0.273921) (xy 0.265573 -0.301138) (xy 0.323804 -0.321969) (xy 0.390286 -0.334876)
      (xy 0.459376 -0.338322) (xy 0.523875 -0.331099)) (layer F.SilkS) (width 0.01))
    (fp_poly (pts (xy 2.021378 -0.742291) (xy 2.029941 -0.738066) (xy 2.036081 -0.729269) (xy 2.040116 -0.71231)
      (xy 2.04236 -0.683597) (xy 2.04313 -0.639541) (xy 2.042743 -0.57655) (xy 2.041814 -0.510228)
      (xy 2.03835 -0.28575) (xy 2.006124 -0.281992) (xy 1.978383 -0.282331) (xy 1.964849 -0.287284)
      (xy 1.961885 -0.302373) (xy 1.959328 -0.338536) (xy 1.957351 -0.391447) (xy 1.956124 -0.456781)
      (xy 1.9558 -0.515108) (xy 1.95606 -0.595554) (xy 1.957059 -0.654154) (xy 1.959123 -0.694463)
      (xy 1.962579 -0.720031) (xy 1.967753 -0.73441) (xy 1.974971 -0.741154) (xy 1.976639 -0.74188)
      (xy 2.00629 -0.745031) (xy 2.021378 -0.742291)) (layer F.SilkS) (width 0.01))
    (fp_poly (pts (xy 2.181225 -0.741518) (xy 2.189655 -0.733484) (xy 2.195836 -0.719074) (xy 2.200212 -0.694488)
      (xy 2.203224 -0.655929) (xy 2.205318 -0.599596) (xy 2.206935 -0.52169) (xy 2.206946 -0.521022)
      (xy 2.207845 -0.436423) (xy 2.206833 -0.373945) (xy 2.203268 -0.330338) (xy 2.196504 -0.302354)
      (xy 2.185897 -0.286744) (xy 2.170802 -0.280261) (xy 2.159 -0.2794) (xy 2.131844 -0.288559)
      (xy 2.122133 -0.296964) (xy 2.115977 -0.316388) (xy 2.112086 -0.357772) (xy 2.110407 -0.422197)
      (xy 2.110887 -0.510745) (xy 2.111053 -0.521022) (xy 2.112668 -0.599102) (xy 2.114756 -0.655581)
      (xy 2.117761 -0.694258) (xy 2.122124 -0.718933) (xy 2.128291 -0.733405) (xy 2.136703 -0.741473)
      (xy 2.136775 -0.741518) (xy 2.164104 -0.748729) (xy 2.181225 -0.741518)) (layer F.SilkS) (width 0.01))
    (fp_poly (pts (xy 2.332993 -0.737552) (xy 2.342242 -0.729343) (xy 2.350219 -0.717101) (xy 2.355827 -0.696324)
      (xy 2.359438 -0.663082) (xy 2.361427 -0.613446) (xy 2.362166 -0.543486) (xy 2.3622 -0.518958)
      (xy 2.36134 -0.448161) (xy 2.35896 -0.386296) (xy 2.355361 -0.338265) (xy 2.350841 -0.30897)
      (xy 2.349053 -0.303966) (xy 2.328139 -0.286092) (xy 2.298106 -0.279001) (xy 2.27208 -0.285334)
      (xy 2.269066 -0.287867) (xy 2.264831 -0.304607) (xy 2.261934 -0.341482) (xy 2.260294 -0.393268)
      (xy 2.259834 -0.454742) (xy 2.260473 -0.520677) (xy 2.262131 -0.58585) (xy 2.264731 -0.645037)
      (xy 2.268192 -0.693011) (xy 2.272435 -0.72455) (xy 2.275839 -0.73406) (xy 2.303552 -0.748434)
      (xy 2.332993 -0.737552)) (layer F.SilkS) (width 0.01))
    (fp_poly (pts (xy 2.164642 -1.480231) (xy 2.179752 -1.451175) (xy 2.201591 -1.40472) (xy 2.228748 -1.343933)
      (xy 2.259812 -1.271882) (xy 2.284172 -1.213869) (xy 2.321352 -1.123946) (xy 2.349652 -1.054041)
      (xy 2.370142 -1.000802) (xy 2.383891 -0.960876) (xy 2.391968 -0.93091) (xy 2.395442 -0.907553)
      (xy 2.395384 -0.887453) (xy 2.393477 -0.871226) (xy 2.386129 -0.836769) (xy 2.377449 -0.815785)
      (xy 2.373457 -0.8128) (xy 2.362336 -0.821916) (xy 2.3622 -0.823592) (xy 2.357549 -0.838013)
      (xy 2.344535 -0.872339) (xy 2.324559 -0.923026) (xy 2.299024 -0.986532) (xy 2.269334 -1.059314)
      (xy 2.256144 -1.091358) (xy 2.150088 -1.348334) (xy 2.062469 -1.150442) (xy 2.026236 -1.069925)
      (xy 1.998516 -1.011591) (xy 1.978461 -0.974011) (xy 1.965223 -0.955757) (xy 1.957952 -0.955401)
      (xy 1.9558 -0.970818) (xy 1.9603 -0.987391) (xy 1.97267 -1.023139) (xy 1.991213 -1.073706)
      (xy 2.014231 -1.134737) (xy 2.040027 -1.201879) (xy 2.066904 -1.270776) (xy 2.093165 -1.337072)
      (xy 2.117112 -1.396414) (xy 2.137049 -1.444446) (xy 2.151278 -1.476813) (xy 2.157673 -1.488819)
      (xy 2.164642 -1.480231)) (layer F.SilkS) (width 0.01))
    (fp_poly (pts (xy -0.819126 -1.797489) (xy -0.786123 -1.781223) (xy -0.739546 -1.756803) (xy -0.683649 -1.726429)
      (xy -0.657371 -1.711842) (xy -0.493471 -1.620284) (xy -0.501789 -1.575948) (xy -0.51011 -1.546089)
      (xy -0.525611 -1.523092) (xy -0.554053 -1.50045) (xy -0.586512 -1.480281) (xy -0.610304 -1.46768)
      (xy -0.620381 -1.471113) (xy -0.624612 -1.493154) (xy -0.629164 -1.507721) (xy -0.641324 -1.522862)
      (xy -0.66437 -1.540939) (xy -0.701581 -1.564313) (xy -0.756234 -1.595347) (xy -0.798604 -1.618542)
      (xy -0.968558 -1.710861) (xy -1.147485 -1.63082) (xy -1.209367 -1.60364) (xy -1.26272 -1.581158)
      (xy -1.30345 -1.565025) (xy -1.327461 -1.556891) (xy -1.332073 -1.556439) (xy -1.332442 -1.566586)
      (xy -1.317872 -1.574839) (xy -1.284755 -1.591644) (xy -1.237227 -1.615035) (xy -1.17942 -1.643047)
      (xy -1.115472 -1.673714) (xy -1.049515 -1.705071) (xy -0.985686 -1.735152) (xy -0.928118 -1.761991)
      (xy -0.880946 -1.783622) (xy -0.848306 -1.79808) (xy -0.834331 -1.8034) (xy -0.834304 -1.8034)
      (xy -0.819126 -1.797489)) (layer F.SilkS) (width 0.01))
  )

  (module Mounting_Holes:MountingHole_3.2mm_M3 (layer F.Cu) (tedit 56D1B4CB) (tstamp 5FE6ED14)
    (at 45.5 113.8)
    (descr "Mounting Hole 3.2mm, no annular, M3")
    (tags "mounting hole 3.2mm no annular m3")
    (attr virtual)
    (fp_text reference REF** (at 0 -4.2) (layer F.SilkS)
      (effects (font (size 1 1) (thickness 0.15)))
    )
    (fp_text value MountingHole_3.2mm_M3 (at 0 4.2) (layer F.Fab)
      (effects (font (size 1 1) (thickness 0.15)))
    )
    (fp_circle (center 0 0) (end 3.2 0) (layer Cmts.User) (width 0.15))
    (fp_circle (center 0 0) (end 3.45 0) (layer F.CrtYd) (width 0.05))
    (fp_text user %R (at 0.3 0) (layer F.Fab)
      (effects (font (size 1 1) (thickness 0.15)))
    )
    (pad 1 np_thru_hole circle (at 0 0) (size 3.2 3.2) (drill 3.2) (layers *.Cu *.Mask))
  )

  (module Mounting_Holes:MountingHole_3.2mm_M3 (layer F.Cu) (tedit 56D1B4CB) (tstamp 5FE6ED09)
    (at 45.5 143.8)
    (descr "Mounting Hole 3.2mm, no annular, M3")
    (tags "mounting hole 3.2mm no annular m3")
    (attr virtual)
    (fp_text reference REF** (at 0 -4.2) (layer F.SilkS)
      (effects (font (size 1 1) (thickness 0.15)))
    )
    (fp_text value MountingHole_3.2mm_M3 (at 0 4.2) (layer F.Fab)
      (effects (font (size 1 1) (thickness 0.15)))
    )
    (fp_circle (center 0 0) (end 3.2 0) (layer Cmts.User) (width 0.15))
    (fp_circle (center 0 0) (end 3.45 0) (layer F.CrtYd) (width 0.05))
    (fp_text user %R (at 0.3 0) (layer F.Fab)
      (effects (font (size 1 1) (thickness 0.15)))
    )
    (pad 1 np_thru_hole circle (at 0 0) (size 3.2 3.2) (drill 3.2) (layers *.Cu *.Mask))
  )

  (module Mounting_Holes:MountingHole_3.2mm_M3 (layer F.Cu) (tedit 56D1B4CB) (tstamp 5FE6ECFE)
    (at 106.5 143.8)
    (descr "Mounting Hole 3.2mm, no annular, M3")
    (tags "mounting hole 3.2mm no annular m3")
    (attr virtual)
    (fp_text reference REF** (at 0 -4.2) (layer F.SilkS)
      (effects (font (size 1 1) (thickness 0.15)))
    )
    (fp_text value MountingHole_3.2mm_M3 (at 0 4.2) (layer F.Fab)
      (effects (font (size 1 1) (thickness 0.15)))
    )
    (fp_circle (center 0 0) (end 3.2 0) (layer Cmts.User) (width 0.15))
    (fp_circle (center 0 0) (end 3.45 0) (layer F.CrtYd) (width 0.05))
    (fp_text user %R (at 0.3 0) (layer F.Fab)
      (effects (font (size 1 1) (thickness 0.15)))
    )
    (pad 1 np_thru_hole circle (at 0 0) (size 3.2 3.2) (drill 3.2) (layers *.Cu *.Mask))
  )

  (module Mounting_Holes:MountingHole_3.2mm_M3 (layer F.Cu) (tedit 56D1B4CB) (tstamp 5FE6ECF3)
    (at 106.5 113.8)
    (descr "Mounting Hole 3.2mm, no annular, M3")
    (tags "mounting hole 3.2mm no annular m3")
    (attr virtual)
    (fp_text reference REF** (at 0 -4.2) (layer F.SilkS)
      (effects (font (size 1 1) (thickness 0.15)))
    )
    (fp_text value MountingHole_3.2mm_M3 (at 0 4.2) (layer F.Fab)
      (effects (font (size 1 1) (thickness 0.15)))
    )
    (fp_circle (center 0 0) (end 3.2 0) (layer Cmts.User) (width 0.15))
    (fp_circle (center 0 0) (end 3.45 0) (layer F.CrtYd) (width 0.05))
    (fp_text user %R (at 0.3 0) (layer F.Fab)
      (effects (font (size 1 1) (thickness 0.15)))
    )
    (pad 1 np_thru_hole circle (at 0 0) (size 3.2 3.2) (drill 3.2) (layers *.Cu *.Mask))
  )

  (module Library:molex (layer F.Cu) (tedit 58EE6EA2) (tstamp 5FE6BB37)
    (at 83.9 122.6 180)
    (path /600D56DA)
    (fp_text reference J2 (at 0.0127 -3.79476) (layer F.SilkS)
      (effects (font (size 1 1) (thickness 0.15)))
    )
    (fp_text value Conn_02x02_Top_Bottom (at 0.04318 -5.37972) (layer F.Fab)
      (effects (font (size 1 1) (thickness 0.15)))
    )
    (fp_circle (center 8.71474 9.68248) (end 9.75106 8.382) (layer F.SilkS) (width 0.05))
    (fp_circle (center -4.49326 9.68248) (end -3.39598 8.42264) (layer F.SilkS) (width 0.05))
    (pad 6 thru_hole circle (at 8.7 9.7 180) (size 3.2 3.2) (drill 3.2) (layers *.Cu *.Mask))
    (pad 5 thru_hole circle (at -4.5 9.7 180) (size 3.2 3.2) (drill 3.2) (layers *.Cu *.Mask))
    (pad 4 thru_hole rect (at 4.2 5.5 180) (size 2 2) (drill 1.8) (layers *.Cu *.Mask)
      (net 2 /GND))
    (pad 3 thru_hole rect (at 0 5.5 180) (size 2 2) (drill 1.8) (layers *.Cu *.Mask)
      (net 2 /GND))
    (pad 2 thru_hole rect (at 4.2 0 180) (size 2 2) (drill 1.8) (layers *.Cu *.Mask)
      (net 4 /VIN))
    (pad 1 thru_hole rect (at 0 0 180) (size 2 2) (drill 1.8) (layers *.Cu *.Mask)
      (net 4 /VIN))
  )

  (module Library:1017505 (layer F.Cu) (tedit 0) (tstamp 5FE6CB75)
    (at 68.8 127.1 180)
    (descr 1017505-1)
    (tags Connector)
    (path /600EA42D)
    (fp_text reference J7 (at 7.62 6.65) (layer F.SilkS)
      (effects (font (size 1.27 1.27) (thickness 0.254)))
    )
    (fp_text value 1017505 (at 7.62 6.65) (layer F.SilkS) hide
      (effects (font (size 1.27 1.27) (thickness 0.254)))
    )
    (fp_line (start -2.94 -2.45) (end 18.18 -2.45) (layer F.Fab) (width 0.2))
    (fp_line (start 18.18 -2.45) (end 18.18 15.75) (layer F.Fab) (width 0.2))
    (fp_line (start 18.18 15.75) (end -2.94 15.75) (layer F.Fab) (width 0.2))
    (fp_line (start -2.94 15.75) (end -2.94 -2.45) (layer F.Fab) (width 0.2))
    (fp_line (start -2.94 -2.45) (end 18.18 -2.45) (layer F.SilkS) (width 0.1))
    (fp_line (start 18.18 -2.45) (end 18.18 15.75) (layer F.SilkS) (width 0.1))
    (fp_line (start 18.18 15.75) (end -2.94 15.75) (layer F.SilkS) (width 0.1))
    (fp_line (start -2.94 15.75) (end -2.94 -2.45) (layer F.SilkS) (width 0.1))
    (fp_line (start -3.94 -3.45) (end 19.18 -3.45) (layer F.CrtYd) (width 0.1))
    (fp_line (start 19.18 -3.45) (end 19.18 16.75) (layer F.CrtYd) (width 0.1))
    (fp_line (start 19.18 16.75) (end -3.94 16.75) (layer F.CrtYd) (width 0.1))
    (fp_line (start -3.94 16.75) (end -3.94 -3.45) (layer F.CrtYd) (width 0.1))
    (fp_text user %R (at 7.62 6.65) (layer F.Fab)
      (effects (font (size 1.27 1.27) (thickness 0.254)))
    )
    (pad 8 thru_hole circle (at 15.24 8.7 180) (size 2.1 2.1) (drill 1.4) (layers *.Cu *.Mask)
      (net 4 /VIN))
    (pad 7 thru_hole circle (at 15.24 0 180) (size 2.1 2.1) (drill 1.4) (layers *.Cu *.Mask)
      (net 4 /VIN))
    (pad 6 thru_hole circle (at 10.16 8.7 180) (size 2.1 2.1) (drill 1.4) (layers *.Cu *.Mask)
      (net 4 /VIN))
    (pad 5 thru_hole circle (at 10.16 0 180) (size 2.1 2.1) (drill 1.4) (layers *.Cu *.Mask)
      (net 4 /VIN))
    (pad 4 thru_hole circle (at 5.08 8.7 180) (size 2.1 2.1) (drill 1.4) (layers *.Cu *.Mask)
      (net 2 /GND))
    (pad 3 thru_hole circle (at 5.08 0 180) (size 2.1 2.1) (drill 1.4) (layers *.Cu *.Mask)
      (net 2 /GND))
    (pad 2 thru_hole circle (at 0 8.7 180) (size 2.1 2.1) (drill 1.4) (layers *.Cu *.Mask)
      (net 2 /GND))
    (pad 1 thru_hole circle (at 0 0 180) (size 2.1 2.1) (drill 1.4) (layers *.Cu *.Mask)
      (net 2 /GND))
    (model 1017505.stp
      (at (xyz 0 0 0))
      (scale (xyz 1 1 1))
      (rotate (xyz 0 0 0))
    )
  )

  (module Resistors_SMD:R_0805_HandSoldering (layer F.Cu) (tedit 58E0A804) (tstamp 5FE6BB6E)
    (at 98.6 145.6)
    (descr "Resistor SMD 0805, hand soldering")
    (tags "resistor 0805")
    (path /600DEB3B)
    (attr smd)
    (fp_text reference R2 (at 3.4 0) (layer F.SilkS)
      (effects (font (size 1 1) (thickness 0.15)))
    )
    (fp_text value R (at 0 1.75) (layer F.Fab)
      (effects (font (size 1 1) (thickness 0.15)))
    )
    (fp_line (start 2.35 0.9) (end -2.35 0.9) (layer F.CrtYd) (width 0.05))
    (fp_line (start 2.35 0.9) (end 2.35 -0.9) (layer F.CrtYd) (width 0.05))
    (fp_line (start -2.35 -0.9) (end -2.35 0.9) (layer F.CrtYd) (width 0.05))
    (fp_line (start -2.35 -0.9) (end 2.35 -0.9) (layer F.CrtYd) (width 0.05))
    (fp_line (start -0.6 -0.88) (end 0.6 -0.88) (layer F.SilkS) (width 0.12))
    (fp_line (start 0.6 0.88) (end -0.6 0.88) (layer F.SilkS) (width 0.12))
    (fp_line (start -1 -0.62) (end 1 -0.62) (layer F.Fab) (width 0.1))
    (fp_line (start 1 -0.62) (end 1 0.62) (layer F.Fab) (width 0.1))
    (fp_line (start 1 0.62) (end -1 0.62) (layer F.Fab) (width 0.1))
    (fp_line (start -1 0.62) (end -1 -0.62) (layer F.Fab) (width 0.1))
    (fp_text user %R (at 0 0) (layer F.Fab)
      (effects (font (size 0.5 0.5) (thickness 0.075)))
    )
    (pad 1 smd rect (at -1.35 0) (size 1.5 1.3) (layers F.Cu F.Paste F.Mask)
      (net 6 /HV))
    (pad 2 smd rect (at 1.35 0) (size 1.5 1.3) (layers F.Cu F.Paste F.Mask)
      (net 1 "Net-(C1-Pad1)"))
    (model ${KISYS3DMOD}/Resistors_SMD.3dshapes/R_0805.wrl
      (at (xyz 0 0 0))
      (scale (xyz 1 1 1))
      (rotate (xyz 0 0 0))
    )
  )

  (module Resistors_SMD:R_0402_NoSilk (layer F.Cu) (tedit 58E0A804) (tstamp 5FE6BB6B)
    (at 48.6 134.8 90)
    (descr "Resistor SMD 0402, reflow soldering, Vishay (see dcrcw.pdf)")
    (tags "resistor 0402")
    (path /600D9B0F)
    (attr smd)
    (fp_text reference R1 (at 0 -1.2 90) (layer F.SilkS)
      (effects (font (size 1 1) (thickness 0.15)))
    )
    (fp_text value 10k (at 0 1.25 90) (layer F.Fab)
      (effects (font (size 1 1) (thickness 0.15)))
    )
    (fp_line (start 0.8 0.45) (end -0.8 0.45) (layer F.CrtYd) (width 0.05))
    (fp_line (start 0.8 0.45) (end 0.8 -0.45) (layer F.CrtYd) (width 0.05))
    (fp_line (start -0.8 -0.45) (end -0.8 0.45) (layer F.CrtYd) (width 0.05))
    (fp_line (start -0.8 -0.45) (end 0.8 -0.45) (layer F.CrtYd) (width 0.05))
    (fp_line (start -0.5 -0.25) (end 0.5 -0.25) (layer F.Fab) (width 0.1))
    (fp_line (start 0.5 -0.25) (end 0.5 0.25) (layer F.Fab) (width 0.1))
    (fp_line (start 0.5 0.25) (end -0.5 0.25) (layer F.Fab) (width 0.1))
    (fp_line (start -0.5 0.25) (end -0.5 -0.25) (layer F.Fab) (width 0.1))
    (fp_text user %R (at 0 -1.2 90) (layer F.Fab)
      (effects (font (size 1 1) (thickness 0.15)))
    )
    (pad 1 smd rect (at -0.45 0 90) (size 0.4 0.6) (layers F.Cu F.Paste F.Mask)
      (net 10 "Net-(J8-Pad3)"))
    (pad 2 smd rect (at 0.45 0 90) (size 0.4 0.6) (layers F.Cu F.Paste F.Mask)
      (net 7 /NTC_RET))
    (model ${KISYS3DMOD}/Resistors_SMD.3dshapes/R_0402.wrl
      (at (xyz 0 0 0))
      (scale (xyz 1 1 1))
      (rotate (xyz 0 0 0))
    )
  )

  (module Pin_Headers:Pin_Header_Straight_1x03_Pitch2.54mm (layer F.Cu) (tedit 59650532) (tstamp 5FE6BB68)
    (at 45 131.3)
    (descr "Through hole straight pin header, 1x03, 2.54mm pitch, single row")
    (tags "Through hole pin header THT 1x03 2.54mm single row")
    (path /600D4842)
    (fp_text reference J8 (at 0 -2.33) (layer F.SilkS)
      (effects (font (size 1 1) (thickness 0.15)))
    )
    (fp_text value Conn_01x03 (at 0 7.41) (layer F.Fab)
      (effects (font (size 1 1) (thickness 0.15)))
    )
    (fp_line (start 1.8 -1.8) (end -1.8 -1.8) (layer F.CrtYd) (width 0.05))
    (fp_line (start 1.8 6.85) (end 1.8 -1.8) (layer F.CrtYd) (width 0.05))
    (fp_line (start -1.8 6.85) (end 1.8 6.85) (layer F.CrtYd) (width 0.05))
    (fp_line (start -1.8 -1.8) (end -1.8 6.85) (layer F.CrtYd) (width 0.05))
    (fp_line (start -1.33 -1.33) (end 0 -1.33) (layer F.SilkS) (width 0.12))
    (fp_line (start -1.33 0) (end -1.33 -1.33) (layer F.SilkS) (width 0.12))
    (fp_line (start -1.33 1.27) (end 1.33 1.27) (layer F.SilkS) (width 0.12))
    (fp_line (start 1.33 1.27) (end 1.33 6.41) (layer F.SilkS) (width 0.12))
    (fp_line (start -1.33 1.27) (end -1.33 6.41) (layer F.SilkS) (width 0.12))
    (fp_line (start -1.33 6.41) (end 1.33 6.41) (layer F.SilkS) (width 0.12))
    (fp_line (start -1.27 -0.635) (end -0.635 -1.27) (layer F.Fab) (width 0.1))
    (fp_line (start -1.27 6.35) (end -1.27 -0.635) (layer F.Fab) (width 0.1))
    (fp_line (start 1.27 6.35) (end -1.27 6.35) (layer F.Fab) (width 0.1))
    (fp_line (start 1.27 -1.27) (end 1.27 6.35) (layer F.Fab) (width 0.1))
    (fp_line (start -0.635 -1.27) (end 1.27 -1.27) (layer F.Fab) (width 0.1))
    (fp_text user %R (at 0 2.54 90) (layer F.Fab)
      (effects (font (size 1 1) (thickness 0.15)))
    )
    (pad 1 thru_hole rect (at 0 0) (size 1.7 1.7) (drill 1) (layers *.Cu *.Mask)
      (net 8 /NTC))
    (pad 2 thru_hole oval (at 0 2.54) (size 1.7 1.7) (drill 1) (layers *.Cu *.Mask)
      (net 7 /NTC_RET))
    (pad 3 thru_hole oval (at 0 5.08) (size 1.7 1.7) (drill 1) (layers *.Cu *.Mask)
      (net 10 "Net-(J8-Pad3)"))
    (model ${KISYS3DMOD}/Pin_Headers.3dshapes/Pin_Header_Straight_1x03_Pitch2.54mm.wrl
      (at (xyz 0 0 0))
      (scale (xyz 1 1 1))
      (rotate (xyz 0 0 0))
    )
  )

  (module Library:lemo_epb00250ntn (layer F.Cu) (tedit 5907999A) (tstamp 5FE6BB4F)
    (at 96.8 114.2)
    (descr "LEMO connector, EPB.00.250.NTN")
    (path /600D2696)
    (fp_text reference J6 (at 0 5.10032) (layer F.SilkS) hide
      (effects (font (size 1.524 1.524) (thickness 0.3048)))
    )
    (fp_text value LEMO2 (at 0 -4.8006) (layer F.SilkS) hide
      (effects (font (size 1.524 1.524) (thickness 0.3048)))
    )
    (fp_circle (center 0 0) (end -1.30048 0) (layer F.SilkS) (width 0.381))
    (fp_circle (center 0 0) (end -3.50012 0) (layer F.SilkS) (width 0.381))
    (fp_line (start -3.59918 -3.59918) (end 3.59918 -3.59918) (layer F.SilkS) (width 0.381))
    (fp_line (start 3.59918 -3.59918) (end 3.59918 3.59918) (layer F.SilkS) (width 0.381))
    (fp_line (start 3.59918 3.59918) (end -3.59918 3.59918) (layer F.SilkS) (width 0.381))
    (fp_line (start -3.59918 3.59918) (end -3.59918 -3.59918) (layer F.SilkS) (width 0.381))
    (pad 2 thru_hole circle (at 2.54 2.54) (size 1.79578 1.79578) (drill 0.89916) (layers *.Cu *.Mask F.SilkS)
      (net 3 /HV_RET))
    (pad 2 thru_hole circle (at -2.54 2.54) (size 1.79578 1.79578) (drill 0.89916) (layers *.Cu *.Mask F.SilkS)
      (net 3 /HV_RET))
    (pad 2 thru_hole circle (at -2.54 -2.54) (size 1.79578 1.79578) (drill 0.89916) (layers *.Cu *.Mask F.SilkS)
      (net 3 /HV_RET))
    (pad 2 thru_hole circle (at 2.54 -2.54) (size 1.79578 1.79578) (drill 0.89916) (layers *.Cu *.Mask F.SilkS)
      (net 3 /HV_RET))
    (pad 1 thru_hole circle (at 0 0) (size 1.79832 1.79832) (drill 0.89916) (layers *.Cu *.Mask F.SilkS)
      (net 6 /HV))
    (model walter/conn_rf/lemo_epb00250ntn.wrl
      (at (xyz 0 0 0))
      (scale (xyz 1 1 1))
      (rotate (xyz 0 0 0))
    )
  )

  (module Pin_Headers:Pin_Header_Straight_1x02_Pitch2.54mm (layer F.Cu) (tedit 59650532) (tstamp 5FE6BB40)
    (at 90.7 140.24 180)
    (descr "Through hole straight pin header, 1x02, 2.54mm pitch, single row")
    (tags "Through hole pin header THT 1x02 2.54mm single row")
    (path /600DCBCC)
    (fp_text reference J5 (at 0 4.64) (layer F.SilkS)
      (effects (font (size 1 1) (thickness 0.15)))
    )
    (fp_text value Conn_02x01 (at 0 4.87) (layer F.Fab)
      (effects (font (size 1 1) (thickness 0.15)))
    )
    (fp_line (start 1.8 -1.8) (end -1.8 -1.8) (layer F.CrtYd) (width 0.05))
    (fp_line (start 1.8 4.35) (end 1.8 -1.8) (layer F.CrtYd) (width 0.05))
    (fp_line (start -1.8 4.35) (end 1.8 4.35) (layer F.CrtYd) (width 0.05))
    (fp_line (start -1.8 -1.8) (end -1.8 4.35) (layer F.CrtYd) (width 0.05))
    (fp_line (start -1.33 -1.33) (end 0 -1.33) (layer F.SilkS) (width 0.12))
    (fp_line (start -1.33 0) (end -1.33 -1.33) (layer F.SilkS) (width 0.12))
    (fp_line (start -1.33 1.27) (end 1.33 1.27) (layer F.SilkS) (width 0.12))
    (fp_line (start 1.33 1.27) (end 1.33 3.87) (layer F.SilkS) (width 0.12))
    (fp_line (start -1.33 1.27) (end -1.33 3.87) (layer F.SilkS) (width 0.12))
    (fp_line (start -1.33 3.87) (end 1.33 3.87) (layer F.SilkS) (width 0.12))
    (fp_line (start -1.27 -0.635) (end -0.635 -1.27) (layer F.Fab) (width 0.1))
    (fp_line (start -1.27 3.81) (end -1.27 -0.635) (layer F.Fab) (width 0.1))
    (fp_line (start 1.27 3.81) (end -1.27 3.81) (layer F.Fab) (width 0.1))
    (fp_line (start 1.27 -1.27) (end 1.27 3.81) (layer F.Fab) (width 0.1))
    (fp_line (start -0.635 -1.27) (end 1.27 -1.27) (layer F.Fab) (width 0.1))
    (fp_text user %R (at -3 0.44 90) (layer F.Fab)
      (effects (font (size 1 1) (thickness 0.15)))
    )
    (pad 1 thru_hole rect (at 0 0 180) (size 1.7 1.7) (drill 1) (layers *.Cu *.Mask)
      (net 2 /GND))
    (pad 2 thru_hole oval (at 0 2.54 180) (size 1.7 1.7) (drill 1) (layers *.Cu *.Mask)
      (net 2 /GND))
    (model ${KISYS3DMOD}/Pin_Headers.3dshapes/Pin_Header_Straight_1x02_Pitch2.54mm.wrl
      (at (xyz 0 0 0))
      (scale (xyz 1 1 1))
      (rotate (xyz 0 0 0))
    )
  )

  (module Pin_Headers:Pin_Header_Straight_1x02_Pitch2.54mm (layer F.Cu) (tedit 59650532) (tstamp 5FE6BB3D)
    (at 94.3 129.2 270)
    (descr "Through hole straight pin header, 1x02, 2.54mm pitch, single row")
    (tags "Through hole pin header THT 1x02 2.54mm single row")
    (path /600DA6D2)
    (fp_text reference J4 (at -2.3 1.3 180) (layer F.SilkS)
      (effects (font (size 1 1) (thickness 0.15)))
    )
    (fp_text value Conn_02x01 (at 0 4.87 90) (layer F.Fab)
      (effects (font (size 1 1) (thickness 0.15)))
    )
    (fp_line (start 1.8 -1.8) (end -1.8 -1.8) (layer F.CrtYd) (width 0.05))
    (fp_line (start 1.8 4.35) (end 1.8 -1.8) (layer F.CrtYd) (width 0.05))
    (fp_line (start -1.8 4.35) (end 1.8 4.35) (layer F.CrtYd) (width 0.05))
    (fp_line (start -1.8 -1.8) (end -1.8 4.35) (layer F.CrtYd) (width 0.05))
    (fp_line (start -1.33 -1.33) (end 0 -1.33) (layer F.SilkS) (width 0.12))
    (fp_line (start -1.33 0) (end -1.33 -1.33) (layer F.SilkS) (width 0.12))
    (fp_line (start -1.33 1.27) (end 1.33 1.27) (layer F.SilkS) (width 0.12))
    (fp_line (start 1.33 1.27) (end 1.33 3.87) (layer F.SilkS) (width 0.12))
    (fp_line (start -1.33 1.27) (end -1.33 3.87) (layer F.SilkS) (width 0.12))
    (fp_line (start -1.33 3.87) (end 1.33 3.87) (layer F.SilkS) (width 0.12))
    (fp_line (start -1.27 -0.635) (end -0.635 -1.27) (layer F.Fab) (width 0.1))
    (fp_line (start -1.27 3.81) (end -1.27 -0.635) (layer F.Fab) (width 0.1))
    (fp_line (start 1.27 3.81) (end -1.27 3.81) (layer F.Fab) (width 0.1))
    (fp_line (start 1.27 -1.27) (end 1.27 3.81) (layer F.Fab) (width 0.1))
    (fp_line (start -0.635 -1.27) (end 1.27 -1.27) (layer F.Fab) (width 0.1))
    (fp_text user %R (at 0 1.27) (layer F.Fab)
      (effects (font (size 1 1) (thickness 0.15)))
    )
    (pad 1 thru_hole rect (at 0 0 270) (size 1.7 1.7) (drill 1) (layers *.Cu *.Mask)
      (net 3 /HV_RET))
    (pad 2 thru_hole oval (at 0 2.54 270) (size 1.7 1.7) (drill 1) (layers *.Cu *.Mask)
      (net 2 /GND))
    (model ${KISYS3DMOD}/Pin_Headers.3dshapes/Pin_Header_Straight_1x02_Pitch2.54mm.wrl
      (at (xyz 0 0 0))
      (scale (xyz 1 1 1))
      (rotate (xyz 0 0 0))
    )
  )

  (module Pin_Headers:Pin_Header_Straight_1x02_Pitch2.54mm (layer F.Cu) (tedit 59650532) (tstamp 5FE6BB3A)
    (at 87.9 140.2 180)
    (descr "Through hole straight pin header, 1x02, 2.54mm pitch, single row")
    (tags "Through hole pin header THT 1x02 2.54mm single row")
    (path /600D4038)
    (fp_text reference J3 (at 2.1 -0.3) (layer F.SilkS)
      (effects (font (size 1 1) (thickness 0.15)))
    )
    (fp_text value Conn_02x01 (at 0 4.87) (layer F.Fab)
      (effects (font (size 1 1) (thickness 0.15)))
    )
    (fp_line (start 1.8 -1.8) (end -1.8 -1.8) (layer F.CrtYd) (width 0.05))
    (fp_line (start 1.8 4.35) (end 1.8 -1.8) (layer F.CrtYd) (width 0.05))
    (fp_line (start -1.8 4.35) (end 1.8 4.35) (layer F.CrtYd) (width 0.05))
    (fp_line (start -1.8 -1.8) (end -1.8 4.35) (layer F.CrtYd) (width 0.05))
    (fp_line (start -1.33 -1.33) (end 0 -1.33) (layer F.SilkS) (width 0.12))
    (fp_line (start -1.33 0) (end -1.33 -1.33) (layer F.SilkS) (width 0.12))
    (fp_line (start -1.33 1.27) (end 1.33 1.27) (layer F.SilkS) (width 0.12))
    (fp_line (start 1.33 1.27) (end 1.33 3.87) (layer F.SilkS) (width 0.12))
    (fp_line (start -1.33 1.27) (end -1.33 3.87) (layer F.SilkS) (width 0.12))
    (fp_line (start -1.33 3.87) (end 1.33 3.87) (layer F.SilkS) (width 0.12))
    (fp_line (start -1.27 -0.635) (end -0.635 -1.27) (layer F.Fab) (width 0.1))
    (fp_line (start -1.27 3.81) (end -1.27 -0.635) (layer F.Fab) (width 0.1))
    (fp_line (start 1.27 3.81) (end -1.27 3.81) (layer F.Fab) (width 0.1))
    (fp_line (start 1.27 -1.27) (end 1.27 3.81) (layer F.Fab) (width 0.1))
    (fp_line (start -0.635 -1.27) (end 1.27 -1.27) (layer F.Fab) (width 0.1))
    (fp_text user %R (at 0 1.27 90) (layer F.Fab)
      (effects (font (size 1 1) (thickness 0.15)))
    )
    (pad 1 thru_hole rect (at 0 0 180) (size 1.7 1.7) (drill 1) (layers *.Cu *.Mask)
      (net 9 /LP_Enable))
    (pad 2 thru_hole oval (at 0 2.54 180) (size 1.7 1.7) (drill 1) (layers *.Cu *.Mask)
      (net 5 /LP_Enable_M))
    (model ${KISYS3DMOD}/Pin_Headers.3dshapes/Pin_Header_Straight_1x02_Pitch2.54mm.wrl
      (at (xyz 0 0 0))
      (scale (xyz 1 1 1))
      (rotate (xyz 0 0 0))
    )
  )

  (module Library:SAMTEC_FTM-108-02-L-DV (layer F.Cu) (tedit 5F43F5E5) (tstamp 5FE6BB34)
    (at 76 141.8)
    (path /600C66C4)
    (fp_text reference J1 (at -0.825 -4.87) (layer F.SilkS)
      (effects (font (size 1 1) (thickness 0.015)))
    )
    (fp_text value FTM-108-02-L-DV (at 9.97 4.615) (layer F.Fab)
      (effects (font (size 1 1) (thickness 0.015)))
    )
    (fp_line (start -4 1.59) (end -4 -1.59) (layer F.Fab) (width 0.1))
    (fp_line (start -4 -1.59) (end 4 -1.59) (layer F.Fab) (width 0.1))
    (fp_line (start 4 -1.59) (end 4 1.59) (layer F.Fab) (width 0.1))
    (fp_line (start 4 1.59) (end -4 1.59) (layer F.Fab) (width 0.1))
    (fp_line (start -4.13 1.59) (end -4.13 -1.59) (layer F.SilkS) (width 0.2))
    (fp_line (start 4.13 1.59) (end 4.13 -1.59) (layer F.SilkS) (width 0.2))
    (fp_line (start -4.25 3.235) (end -4.25 -3.235) (layer F.CrtYd) (width 0.05))
    (fp_line (start -4.25 -3.235) (end 4.25 -3.235) (layer F.CrtYd) (width 0.05))
    (fp_line (start 4.25 -3.235) (end 4.25 3.235) (layer F.CrtYd) (width 0.05))
    (fp_line (start 4.25 3.235) (end -4.25 3.235) (layer F.CrtYd) (width 0.05))
    (fp_circle (center -3.5 3.585) (end -3.4 3.585) (layer F.SilkS) (width 0.2))
    (fp_circle (center -3.5 3.585) (end -3.4 3.585) (layer F.Fab) (width 0.2))
    (pad 16 smd rect (at 3.5 -1.6075) (size 0.56 2.755) (layers F.Cu F.Paste F.Mask)
      (net 2 /GND))
    (pad 14 smd rect (at 2.5 -1.6075) (size 0.56 2.755) (layers F.Cu F.Paste F.Mask)
      (net 2 /GND))
    (pad 12 smd rect (at 1.5 -1.6075) (size 0.56 2.755) (layers F.Cu F.Paste F.Mask)
      (net 2 /GND))
    (pad 10 smd rect (at 0.5 -1.6075) (size 0.56 2.755) (layers F.Cu F.Paste F.Mask)
      (net 5 /LP_Enable_M))
    (pad 08 smd rect (at -0.5 -1.6075) (size 0.56 2.755) (layers F.Cu F.Paste F.Mask)
      (net 4 /VIN))
    (pad 06 smd rect (at -1.5 -1.6075) (size 0.56 2.755) (layers F.Cu F.Paste F.Mask)
      (net 4 /VIN))
    (pad 04 smd rect (at -2.5 -1.6075) (size 0.56 2.755) (layers F.Cu F.Paste F.Mask)
      (net 4 /VIN))
    (pad 02 smd rect (at -3.5 -1.6075) (size 0.56 2.755) (layers F.Cu F.Paste F.Mask)
      (net 4 /VIN))
    (pad 15 smd rect (at 3.5 1.6075) (size 0.56 2.755) (layers F.Cu F.Paste F.Mask)
      (net 2 /GND))
    (pad 13 smd rect (at 2.5 1.6075) (size 0.56 2.755) (layers F.Cu F.Paste F.Mask)
      (net 2 /GND))
    (pad 11 smd rect (at 1.5 1.6075) (size 0.56 2.755) (layers F.Cu F.Paste F.Mask)
      (net 2 /GND))
    (pad 09 smd rect (at 0.5 1.6075) (size 0.56 2.755) (layers F.Cu F.Paste F.Mask)
      (net 6 /HV))
    (pad 07 smd rect (at -0.5 1.6075) (size 0.56 2.755) (layers F.Cu F.Paste F.Mask)
      (net 7 /NTC_RET))
    (pad 05 smd rect (at -1.5 1.6075) (size 0.56 2.755) (layers F.Cu F.Paste F.Mask)
      (net 8 /NTC))
    (pad 03 smd rect (at -2.5 1.6075) (size 0.56 2.755) (layers F.Cu F.Paste F.Mask)
      (net 4 /VIN))
    (pad 01 smd rect (at -3.5 1.6075) (size 0.56 2.755) (layers F.Cu F.Paste F.Mask)
      (net 4 /VIN))
  )

  (module Capacitors_SMD:C_0402_NoSilk (layer F.Cu) (tedit 58AA8408) (tstamp 5FE6BB14)
    (at 93.1 131.6)
    (descr "Capacitor SMD 0402, reflow soldering, AVX (see smccp.pdf)")
    (tags "capacitor 0402")
    (path /600DB769)
    (attr smd)
    (fp_text reference C2 (at 0 1.1) (layer F.SilkS)
      (effects (font (size 1 1) (thickness 0.15)))
    )
    (fp_text value C (at 0 1.27) (layer F.Fab)
      (effects (font (size 1 1) (thickness 0.15)))
    )
    (fp_line (start 1 0.4) (end -1 0.4) (layer F.CrtYd) (width 0.05))
    (fp_line (start 1 0.4) (end 1 -0.4) (layer F.CrtYd) (width 0.05))
    (fp_line (start -1 -0.4) (end -1 0.4) (layer F.CrtYd) (width 0.05))
    (fp_line (start -1 -0.4) (end 1 -0.4) (layer F.CrtYd) (width 0.05))
    (fp_line (start -0.5 -0.25) (end 0.5 -0.25) (layer F.Fab) (width 0.1))
    (fp_line (start 0.5 -0.25) (end 0.5 0.25) (layer F.Fab) (width 0.1))
    (fp_line (start 0.5 0.25) (end -0.5 0.25) (layer F.Fab) (width 0.1))
    (fp_line (start -0.5 0.25) (end -0.5 -0.25) (layer F.Fab) (width 0.1))
    (fp_text user %R (at 0 -1.27) (layer F.Fab)
      (effects (font (size 1 1) (thickness 0.15)))
    )
    (pad 1 smd rect (at -0.55 0) (size 0.6 0.5) (layers F.Cu F.Paste F.Mask)
      (net 2 /GND))
    (pad 2 smd rect (at 0.55 0) (size 0.6 0.5) (layers F.Cu F.Paste F.Mask)
      (net 3 /HV_RET))
    (model Capacitors_SMD.3dshapes/C_0402.wrl
      (at (xyz 0 0 0))
      (scale (xyz 1 1 1))
      (rotate (xyz 0 0 0))
    )
  )

  (module Capacitors_SMD:C_1210_HandSoldering (layer F.Cu) (tedit 58AA84FB) (tstamp 5FE6BB11)
    (at 99.6 140.9 90)
    (descr "Capacitor SMD 1210, hand soldering")
    (tags "capacitor 1210")
    (path /600DE169)
    (attr smd)
    (fp_text reference C1 (at 0 -2.25 90) (layer F.SilkS)
      (effects (font (size 1 1) (thickness 0.15)))
    )
    (fp_text value C (at 0 2.5 90) (layer F.Fab)
      (effects (font (size 1 1) (thickness 0.15)))
    )
    (fp_line (start 3.25 1.5) (end -3.25 1.5) (layer F.CrtYd) (width 0.05))
    (fp_line (start 3.25 1.5) (end 3.25 -1.5) (layer F.CrtYd) (width 0.05))
    (fp_line (start -3.25 -1.5) (end -3.25 1.5) (layer F.CrtYd) (width 0.05))
    (fp_line (start -3.25 -1.5) (end 3.25 -1.5) (layer F.CrtYd) (width 0.05))
    (fp_line (start -1 1.48) (end 1 1.48) (layer F.SilkS) (width 0.12))
    (fp_line (start 1 -1.48) (end -1 -1.48) (layer F.SilkS) (width 0.12))
    (fp_line (start -1.6 -1.25) (end 1.6 -1.25) (layer F.Fab) (width 0.1))
    (fp_line (start 1.6 -1.25) (end 1.6 1.25) (layer F.Fab) (width 0.1))
    (fp_line (start 1.6 1.25) (end -1.6 1.25) (layer F.Fab) (width 0.1))
    (fp_line (start -1.6 1.25) (end -1.6 -1.25) (layer F.Fab) (width 0.1))
    (fp_text user %R (at 0 -2.25 90) (layer F.Fab)
      (effects (font (size 1 1) (thickness 0.15)))
    )
    (pad 1 smd rect (at -2 0 90) (size 2 2.5) (layers F.Cu F.Paste F.Mask)
      (net 1 "Net-(C1-Pad1)"))
    (pad 2 smd rect (at 2 0 90) (size 2 2.5) (layers F.Cu F.Paste F.Mask)
      (net 3 /HV_RET))
    (model Capacitors_SMD.3dshapes/C_1210.wrl
      (at (xyz 0 0 0))
      (scale (xyz 1 1 1))
      (rotate (xyz 0 0 0))
    )
  )

  (gr_text "Power Adapter Card 1.0\n(RD53B Quad v1.5)\nDecember 2020\nA. Dimitrievska" (at 58.5 143.1) (layer F.SilkS)
    (effects (font (size 1 1) (thickness 0.15)))
  )
  (gr_text "LPEnable\nExt" (at 90.9 144.4) (layer F.SilkS) (tstamp 5FE6F374)
    (effects (font (size 1.5 1.5) (thickness 0.3)))
  )
  (gr_text HV (at 77.8 146.1) (layer F.SilkS) (tstamp 5FE6F365)
    (effects (font (size 1.5 1.5) (thickness 0.3) italic))
  )
  (gr_text HV_RET (at 99.8 129.1) (layer F.SilkS) (tstamp 5FE6F358)
    (effects (font (size 1.5 1.5) (thickness 0.3)))
  )
  (gr_text GND (at 88.1 129.2) (layer F.SilkS) (tstamp 5FE6F355)
    (effects (font (size 1.5 1.5) (thickness 0.3)))
  )
  (gr_text GND (at 94.5 137.6) (layer F.SilkS) (tstamp 5FE6F345)
    (effects (font (size 1.5 1.5) (thickness 0.3)))
  )
  (gr_text GND (at 94.6 140.3) (layer F.SilkS) (tstamp 5FE6F343)
    (effects (font (size 1.5 1.5) (thickness 0.3)))
  )
  (gr_text "LPEnable\n" (at 83.8 134.9) (layer F.SilkS) (tstamp 5FE6F33D)
    (effects (font (size 1.5 1.5) (thickness 0.3)))
  )
  (gr_text VIN (at 88.6 122.8) (layer F.SilkS) (tstamp 5FE6F32F)
    (effects (font (size 1.5 1.5) (thickness 0.3)))
  )
  (gr_text GND (at 88.5 117.2) (layer F.SilkS) (tstamp 5FE6F32C)
    (effects (font (size 1.5 1.5) (thickness 0.3)))
  )
  (gr_text GND (at 66.3 131.1) (layer F.SilkS) (tstamp 5FE6F327)
    (effects (font (size 1.5 1.5) (thickness 0.3)))
  )
  (gr_text VIN (at 55.9 131.1) (layer F.SilkS)
    (effects (font (size 1.5 1.5) (thickness 0.3)))
  )
  (dimension 37 (width 0.15) (layer Dwgs.User)
    (gr_text "37.000 mm" (at 116.2 128.8 90) (layer Dwgs.User)
      (effects (font (size 1 1) (thickness 0.15)))
    )
    (feature1 (pts (xy 110 110.3) (xy 115.486421 110.3)))
    (feature2 (pts (xy 110 147.3) (xy 115.486421 147.3)))
    (crossbar (pts (xy 114.9 147.3) (xy 114.9 110.3)))
    (arrow1a (pts (xy 114.9 110.3) (xy 115.486421 111.426504)))
    (arrow1b (pts (xy 114.9 110.3) (xy 114.313579 111.426504)))
    (arrow2a (pts (xy 114.9 147.3) (xy 115.486421 146.173496)))
    (arrow2b (pts (xy 114.9 147.3) (xy 114.313579 146.173496)))
  )
  (dimension 68 (width 0.15) (layer Dwgs.User)
    (gr_text "68.000 mm" (at 76 102.1) (layer Dwgs.User)
      (effects (font (size 1 1) (thickness 0.15)))
    )
    (feature1 (pts (xy 110 110.3) (xy 110 102.813579)))
    (feature2 (pts (xy 42 110.3) (xy 42 102.813579)))
    (crossbar (pts (xy 42 103.4) (xy 110 103.4)))
    (arrow1a (pts (xy 110 103.4) (xy 108.873496 103.986421)))
    (arrow1b (pts (xy 110 103.4) (xy 108.873496 102.813579)))
    (arrow2a (pts (xy 42 103.4) (xy 43.126504 103.986421)))
    (arrow2b (pts (xy 42 103.4) (xy 43.126504 102.813579)))
  )
  (gr_line (start 42 110.3) (end 110 110.3) (layer Edge.Cuts) (width 0.05))
  (gr_line (start 42 147.3) (end 42 110.3) (layer Edge.Cuts) (width 0.05))
  (gr_line (start 110 147.3) (end 42 147.3) (layer Edge.Cuts) (width 0.05))
  (gr_line (start 110 110.3) (end 110 147.3) (layer Edge.Cuts) (width 0.05))

  (segment (start 99.95 143.25) (end 99.6 142.9) (width 0.25) (layer F.Cu) (net 1))
  (segment (start 99.95 145.6) (end 99.95 143.25) (width 0.25) (layer F.Cu) (net 1))
  (via (at 81 139.4) (size 0.8) (drill 0.4) (layers F.Cu B.Cu) (net 2))
  (via (at 81 140.6) (size 0.8) (drill 0.4) (layers F.Cu B.Cu) (net 2))
  (via (at 81 141.8) (size 0.8) (drill 0.4) (layers F.Cu B.Cu) (net 2) (tstamp 5FE6ED18))
  (via (at 81 143) (size 0.8) (drill 0.4) (layers F.Cu B.Cu) (net 2) (tstamp 5FE6ED19))
  (via (at 81 144.2) (size 0.8) (drill 0.4) (layers F.Cu B.Cu) (net 2) (tstamp 5FE6ED1D))
  (via (at 82 143.6) (size 0.8) (drill 0.4) (layers F.Cu B.Cu) (net 2) (tstamp 5FE6ED25))
  (via (at 82 140) (size 0.8) (drill 0.4) (layers F.Cu B.Cu) (net 2) (tstamp 5FE6ED26))
  (via (at 82 142.4) (size 0.8) (drill 0.4) (layers F.Cu B.Cu) (net 2) (tstamp 5FE6ED27))
  (via (at 82 141.2) (size 0.8) (drill 0.4) (layers F.Cu B.Cu) (net 2) (tstamp 5FE6ED28))
  (via (at 83 142.9) (size 0.8) (drill 0.4) (layers F.Cu B.Cu) (net 2) (tstamp 5FE6ED32))
  (via (at 83 139.3) (size 0.8) (drill 0.4) (layers F.Cu B.Cu) (net 2) (tstamp 5FE6ED33))
  (via (at 83 141.7) (size 0.8) (drill 0.4) (layers F.Cu B.Cu) (net 2) (tstamp 5FE6ED34))
  (via (at 83 144.1) (size 0.8) (drill 0.4) (layers F.Cu B.Cu) (net 2) (tstamp 5FE6ED35))
  (via (at 83 140.5) (size 0.8) (drill 0.4) (layers F.Cu B.Cu) (net 2) (tstamp 5FE6ED36))
  (via (at 84 143.5) (size 0.8) (drill 0.4) (layers F.Cu B.Cu) (net 2) (tstamp 5FE6ED40))
  (via (at 84 139.9) (size 0.8) (drill 0.4) (layers F.Cu B.Cu) (net 2) (tstamp 5FE6ED41))
  (via (at 84 141.1) (size 0.8) (drill 0.4) (layers F.Cu B.Cu) (net 2) (tstamp 5FE6ED42))
  (via (at 84 142.3) (size 0.8) (drill 0.4) (layers F.Cu B.Cu) (net 2) (tstamp 5FE6ED43))
  (via (at 91.5 131.6) (size 0.8) (drill 0.4) (layers F.Cu B.Cu) (net 2))
  (segment (start 92.55 131.6) (end 91.5 131.6) (width 0.25) (layer F.Cu) (net 2))
  (segment (start 93.65 131.6) (end 94.2 131.6) (width 0.25) (layer F.Cu) (net 3))
  (via (at 71.2 139.3) (size 0.8) (drill 0.4) (layers F.Cu B.Cu) (net 4))
  (via (at 71.2 140.5) (size 0.8) (drill 0.4) (layers F.Cu B.Cu) (net 4))
  (via (at 71.2 141.7) (size 0.8) (drill 0.4) (layers F.Cu B.Cu) (net 4))
  (via (at 71.2 142.9) (size 0.8) (drill 0.4) (layers F.Cu B.Cu) (net 4))
  (via (at 71.2 144.1) (size 0.8) (drill 0.4) (layers F.Cu B.Cu) (net 4))
  (via (at 70.2 141.1) (size 0.8) (drill 0.4) (layers F.Cu B.Cu) (net 4) (tstamp 5FE6EE20))
  (via (at 70.2 142.3) (size 0.8) (drill 0.4) (layers F.Cu B.Cu) (net 4) (tstamp 5FE6EE21))
  (via (at 70.2 139.9) (size 0.8) (drill 0.4) (layers F.Cu B.Cu) (net 4) (tstamp 5FE6EE22))
  (via (at 70.2 143.5) (size 0.8) (drill 0.4) (layers F.Cu B.Cu) (net 4) (tstamp 5FE6EE27))
  (via (at 69.2 141.7) (size 0.8) (drill 0.4) (layers F.Cu B.Cu) (net 4) (tstamp 5FE6EE2E))
  (via (at 69.2 144.1) (size 0.8) (drill 0.4) (layers F.Cu B.Cu) (net 4) (tstamp 5FE6EE2F))
  (via (at 69.2 142.9) (size 0.8) (drill 0.4) (layers F.Cu B.Cu) (net 4) (tstamp 5FE6EE30))
  (via (at 69.2 140.5) (size 0.8) (drill 0.4) (layers F.Cu B.Cu) (net 4) (tstamp 5FE6EE31))
  (via (at 69.2 139.3) (size 0.8) (drill 0.4) (layers F.Cu B.Cu) (net 4) (tstamp 5FE6EE32))
  (via (at 68.2 141.1) (size 0.8) (drill 0.4) (layers F.Cu B.Cu) (net 4) (tstamp 5FE6EE3C))
  (via (at 68.2 139.9) (size 0.8) (drill 0.4) (layers F.Cu B.Cu) (net 4) (tstamp 5FE6EE3D))
  (via (at 68.2 142.3) (size 0.8) (drill 0.4) (layers F.Cu B.Cu) (net 4) (tstamp 5FE6EE3E))
  (via (at 68.2 143.5) (size 0.8) (drill 0.4) (layers F.Cu B.Cu) (net 4) (tstamp 5FE6EE3F))
  (segment (start 53.56 127.1) (end 53.56 128.16) (width 0.25) (layer F.Cu) (net 4))
  (segment (start 76.64 137.66) (end 86.4 137.66) (width 0.25) (layer F.Cu) (net 5))
  (segment (start 76.5 137.8) (end 76.64 137.66) (width 0.25) (layer F.Cu) (net 5))
  (segment (start 76.5 140.1925) (end 76.5 137.8) (width 0.25) (layer F.Cu) (net 5))
  (segment (start 86.4 137.66) (end 87.9 137.66) (width 0.25) (layer F.Cu) (net 5))
  (segment (start 76.5 143.4075) (end 76.5 145.3) (width 0.25) (layer F.Cu) (net 6))
  (segment (start 76.5 145.3) (end 77.5 146.3) (width 0.25) (layer F.Cu) (net 6))
  (segment (start 77.5 146.3) (end 94.1 146.3) (width 0.25) (layer F.Cu) (net 6))
  (segment (start 96.8 143.6) (end 96.8 114.2) (width 0.25) (layer F.Cu) (net 6))
  (segment (start 94.1 146.3) (end 95.05 145.35) (width 0.25) (layer F.Cu) (net 6))
  (segment (start 95.3 145.2) (end 95.7 145.6) (width 0.25) (layer F.Cu) (net 6))
  (segment (start 95.3 145.1) (end 95.3 145.2) (width 0.25) (layer F.Cu) (net 6))
  (segment (start 95.3 145.1) (end 96.8 143.6) (width 0.25) (layer F.Cu) (net 6))
  (segment (start 97.25 145.6) (end 95.7 145.6) (width 0.25) (layer F.Cu) (net 6))
  (segment (start 95.05 145.35) (end 95.3 145.1) (width 0.25) (layer F.Cu) (net 6))
  (segment (start 75.5 143.4075) (end 75.5 145.2) (width 0.25) (layer F.Cu) (net 7))
  (segment (start 75.5 145.2) (end 74 146.7) (width 0.25) (layer F.Cu) (net 7))
  (segment (start 74 146.7) (end 69.6 146.7) (width 0.25) (layer F.Cu) (net 7))
  (segment (start 69.6 146.7) (end 69.5 146.7) (width 0.25) (layer F.Cu) (net 7))
  (segment (start 48.6 134.35) (end 48.6 134) (width 0.25) (layer F.Cu) (net 7))
  (segment (start 48.44 133.84) (end 45 133.84) (width 0.25) (layer F.Cu) (net 7))
  (segment (start 48.6 134) (end 48.44 133.84) (width 0.25) (layer F.Cu) (net 7))
  (segment (start 69.6 146.7) (end 66 146.7) (width 0.25) (layer F.Cu) (net 7))
  (segment (start 66 146.7) (end 53.65 134.35) (width 0.25) (layer F.Cu) (net 7))
  (segment (start 53.65 134.35) (end 52.85 134.35) (width 0.25) (layer F.Cu) (net 7))
  (segment (start 48.6 134.35) (end 52.85 134.35) (width 0.25) (layer F.Cu) (net 7))
  (segment (start 51.5 131.3) (end 50.9 131.3) (width 0.25) (layer F.Cu) (net 8))
  (segment (start 73.7 146.1) (end 66.3 146.1) (width 0.25) (layer F.Cu) (net 8))
  (segment (start 74.5 145.3) (end 73.7 146.1) (width 0.25) (layer F.Cu) (net 8))
  (segment (start 74.5 143.4075) (end 74.5 145.3) (width 0.25) (layer F.Cu) (net 8))
  (segment (start 66.3 146.1) (end 51.5 131.3) (width 0.25) (layer F.Cu) (net 8))
  (segment (start 45 131.3) (end 50.9 131.3) (width 0.25) (layer F.Cu) (net 8))
  (segment (start 45 136.38) (end 47.92 136.38) (width 0.25) (layer F.Cu) (net 10))
  (segment (start 48.6 135.7) (end 48.6 135.25) (width 0.25) (layer F.Cu) (net 10))
  (segment (start 47.92 136.38) (end 48.6 135.7) (width 0.25) (layer F.Cu) (net 10))

  (zone (net 2) (net_name /GND) (layer F.Cu) (tstamp 5FE6FDAE) (hatch edge 0.508)
    (connect_pads yes (clearance 0.508))
    (min_thickness 0.254)
    (fill yes (arc_segments 32) (thermal_gap 0.508) (thermal_bridge_width 0.508))
    (polygon
      (pts
        (xy 84.7 144.8) (xy 77.2 144.8) (xy 77.2 138.8) (xy 84.6 138.8)
      )
    )
    (filled_polygon
      (pts
        (xy 84.570866 144.673) (xy 77.418072 144.673) (xy 77.418072 142.03) (xy 77.405812 141.905518) (xy 77.373803 141.8)
        (xy 77.405812 141.694482) (xy 77.418072 141.57) (xy 77.418072 138.927) (xy 84.475099 138.927)
      )
    )
  )
  (zone (net 2) (net_name /GND) (layer In1.Cu) (tstamp 5FE6FDAB) (hatch edge 0.508)
    (connect_pads yes (clearance 0.508))
    (min_thickness 0.254)
    (fill yes (arc_segments 32) (thermal_gap 0.508) (thermal_bridge_width 0.508))
    (polygon
      (pts
        (xy 93 147.3) (xy 49.6 147.3) (xy 49.6 110.3) (xy 93 110.3)
      )
    )
    (filled_polygon
      (pts
        (xy 73.775271 111.163962) (xy 73.463962 111.475271) (xy 73.219369 111.841331) (xy 73.05089 112.248075) (xy 72.965 112.679872)
        (xy 72.965 113.120128) (xy 73.05089 113.551925) (xy 73.219369 113.958669) (xy 73.463962 114.324729) (xy 73.775271 114.636038)
        (xy 74.141331 114.880631) (xy 74.548075 115.04911) (xy 74.979872 115.135) (xy 75.420128 115.135) (xy 75.851925 115.04911)
        (xy 76.258669 114.880631) (xy 76.624729 114.636038) (xy 76.936038 114.324729) (xy 77.180631 113.958669) (xy 77.34911 113.551925)
        (xy 77.435 113.120128) (xy 77.435 112.679872) (xy 77.34911 112.248075) (xy 77.180631 111.841331) (xy 76.936038 111.475271)
        (xy 76.624729 111.163962) (xy 76.319478 110.96) (xy 87.280522 110.96) (xy 86.975271 111.163962) (xy 86.663962 111.475271)
        (xy 86.419369 111.841331) (xy 86.25089 112.248075) (xy 86.165 112.679872) (xy 86.165 113.120128) (xy 86.25089 113.551925)
        (xy 86.419369 113.958669) (xy 86.663962 114.324729) (xy 86.975271 114.636038) (xy 87.341331 114.880631) (xy 87.748075 115.04911)
        (xy 88.179872 115.135) (xy 88.620128 115.135) (xy 89.051925 115.04911) (xy 89.458669 114.880631) (xy 89.824729 114.636038)
        (xy 90.136038 114.324729) (xy 90.380631 113.958669) (xy 90.54911 113.551925) (xy 90.635 113.120128) (xy 90.635 112.679872)
        (xy 90.54911 112.248075) (xy 90.380631 111.841331) (xy 90.136038 111.475271) (xy 89.824729 111.163962) (xy 89.519478 110.96)
        (xy 92.873 110.96) (xy 92.873 111.002881) (xy 92.786018 111.212872) (xy 92.72711 111.509024) (xy 92.72711 111.810976)
        (xy 92.786018 112.107128) (xy 92.873 112.31712) (xy 92.873 116.08288) (xy 92.786018 116.292872) (xy 92.72711 116.589024)
        (xy 92.72711 116.890976) (xy 92.786018 117.187128) (xy 92.873 117.39712) (xy 92.873 128.082431) (xy 92.860498 128.10582)
        (xy 92.824188 128.225518) (xy 92.811928 128.35) (xy 92.811928 130.05) (xy 92.824188 130.174482) (xy 92.860498 130.29418)
        (xy 92.873 130.317569) (xy 92.873 146.64) (xy 49.727 146.64) (xy 49.727 139.798061) (xy 67.165 139.798061)
        (xy 67.165 140.001939) (xy 67.204774 140.201898) (xy 67.282795 140.390256) (xy 67.356123 140.5) (xy 67.282795 140.609744)
        (xy 67.204774 140.798102) (xy 67.165 140.998061) (xy 67.165 141.201939) (xy 67.204774 141.401898) (xy 67.282795 141.590256)
        (xy 67.356123 141.7) (xy 67.282795 141.809744) (xy 67.204774 141.998102) (xy 67.165 142.198061) (xy 67.165 142.401939)
        (xy 67.204774 142.601898) (xy 67.282795 142.790256) (xy 67.356123 142.9) (xy 67.282795 143.009744) (xy 67.204774 143.198102)
        (xy 67.165 143.398061) (xy 67.165 143.601939) (xy 67.204774 143.801898) (xy 67.282795 143.990256) (xy 67.396063 144.159774)
        (xy 67.540226 144.303937) (xy 67.709744 144.417205) (xy 67.898102 144.495226) (xy 68.098061 144.535) (xy 68.259907 144.535)
        (xy 68.282795 144.590256) (xy 68.396063 144.759774) (xy 68.540226 144.903937) (xy 68.709744 145.017205) (xy 68.898102 145.095226)
        (xy 69.098061 145.135) (xy 69.301939 145.135) (xy 69.501898 145.095226) (xy 69.690256 145.017205) (xy 69.859774 144.903937)
        (xy 70.003937 144.759774) (xy 70.117205 144.590256) (xy 70.140093 144.535) (xy 70.259907 144.535) (xy 70.282795 144.590256)
        (xy 70.396063 144.759774) (xy 70.540226 144.903937) (xy 70.709744 145.017205) (xy 70.898102 145.095226) (xy 71.098061 145.135)
        (xy 71.301939 145.135) (xy 71.501898 145.095226) (xy 71.690256 145.017205) (xy 71.859774 144.903937) (xy 72.003937 144.759774)
        (xy 72.117205 144.590256) (xy 72.195226 144.401898) (xy 72.235 144.201939) (xy 72.235 143.998061) (xy 72.195226 143.798102)
        (xy 72.117205 143.609744) (xy 72.043877 143.5) (xy 72.117205 143.390256) (xy 72.195226 143.201898) (xy 72.235 143.001939)
        (xy 72.235 142.798061) (xy 72.195226 142.598102) (xy 72.117205 142.409744) (xy 72.043877 142.3) (xy 72.117205 142.190256)
        (xy 72.195226 142.001898) (xy 72.235 141.801939) (xy 72.235 141.598061) (xy 72.195226 141.398102) (xy 72.117205 141.209744)
        (xy 72.043877 141.1) (xy 72.117205 140.990256) (xy 72.195226 140.801898) (xy 72.235 140.601939) (xy 72.235 140.398061)
        (xy 72.195226 140.198102) (xy 72.117205 140.009744) (xy 72.043877 139.9) (xy 72.117205 139.790256) (xy 72.195226 139.601898)
        (xy 72.235 139.401939) (xy 72.235 139.35) (xy 86.411928 139.35) (xy 86.411928 141.05) (xy 86.424188 141.174482)
        (xy 86.460498 141.29418) (xy 86.519463 141.404494) (xy 86.598815 141.501185) (xy 86.695506 141.580537) (xy 86.80582 141.639502)
        (xy 86.925518 141.675812) (xy 87.05 141.688072) (xy 88.75 141.688072) (xy 88.874482 141.675812) (xy 88.99418 141.639502)
        (xy 89.104494 141.580537) (xy 89.201185 141.501185) (xy 89.280537 141.404494) (xy 89.339502 141.29418) (xy 89.375812 141.174482)
        (xy 89.388072 141.05) (xy 89.388072 139.35) (xy 89.375812 139.225518) (xy 89.339502 139.10582) (xy 89.280537 138.995506)
        (xy 89.201185 138.898815) (xy 89.104494 138.819463) (xy 88.99418 138.760498) (xy 88.92162 138.738487) (xy 89.053475 138.606632)
        (xy 89.21599 138.363411) (xy 89.327932 138.093158) (xy 89.385 137.80626) (xy 89.385 137.51374) (xy 89.327932 137.226842)
        (xy 89.21599 136.956589) (xy 89.053475 136.713368) (xy 88.846632 136.506525) (xy 88.603411 136.34401) (xy 88.333158 136.232068)
        (xy 88.04626 136.175) (xy 87.75374 136.175) (xy 87.466842 136.232068) (xy 87.196589 136.34401) (xy 86.953368 136.506525)
        (xy 86.746525 136.713368) (xy 86.58401 136.956589) (xy 86.472068 137.226842) (xy 86.415 137.51374) (xy 86.415 137.80626)
        (xy 86.472068 138.093158) (xy 86.58401 138.363411) (xy 86.746525 138.606632) (xy 86.87838 138.738487) (xy 86.80582 138.760498)
        (xy 86.695506 138.819463) (xy 86.598815 138.898815) (xy 86.519463 138.995506) (xy 86.460498 139.10582) (xy 86.424188 139.225518)
        (xy 86.411928 139.35) (xy 72.235 139.35) (xy 72.235 139.198061) (xy 72.195226 138.998102) (xy 72.117205 138.809744)
        (xy 72.003937 138.640226) (xy 71.859774 138.496063) (xy 71.690256 138.382795) (xy 71.501898 138.304774) (xy 71.301939 138.265)
        (xy 71.098061 138.265) (xy 70.898102 138.304774) (xy 70.709744 138.382795) (xy 70.540226 138.496063) (xy 70.396063 138.640226)
        (xy 70.282795 138.809744) (xy 70.259907 138.865) (xy 70.140093 138.865) (xy 70.117205 138.809744) (xy 70.003937 138.640226)
        (xy 69.859774 138.496063) (xy 69.690256 138.382795) (xy 69.501898 138.304774) (xy 69.301939 138.265) (xy 69.098061 138.265)
        (xy 68.898102 138.304774) (xy 68.709744 138.382795) (xy 68.540226 138.496063) (xy 68.396063 138.640226) (xy 68.282795 138.809744)
        (xy 68.259907 138.865) (xy 68.098061 138.865) (xy 67.898102 138.904774) (xy 67.709744 138.982795) (xy 67.540226 139.096063)
        (xy 67.396063 139.240226) (xy 67.282795 139.409744) (xy 67.204774 139.598102) (xy 67.165 139.798061) (xy 49.727 139.798061)
        (xy 49.727 126.934042) (xy 51.875 126.934042) (xy 51.875 127.265958) (xy 51.939754 127.591496) (xy 52.066772 127.898147)
        (xy 52.251175 128.174125) (xy 52.485875 128.408825) (xy 52.761853 128.593228) (xy 53.068504 128.720246) (xy 53.394042 128.785)
        (xy 53.725958 128.785) (xy 54.051496 128.720246) (xy 54.358147 128.593228) (xy 54.634125 128.408825) (xy 54.868825 128.174125)
        (xy 55.053228 127.898147) (xy 55.180246 127.591496) (xy 55.245 127.265958) (xy 55.245 126.934042) (xy 56.955 126.934042)
        (xy 56.955 127.265958) (xy 57.019754 127.591496) (xy 57.146772 127.898147) (xy 57.331175 128.174125) (xy 57.565875 128.408825)
        (xy 57.841853 128.593228) (xy 58.148504 128.720246) (xy 58.474042 128.785) (xy 58.805958 128.785) (xy 59.131496 128.720246)
        (xy 59.438147 128.593228) (xy 59.714125 128.408825) (xy 59.948825 128.174125) (xy 60.133228 127.898147) (xy 60.260246 127.591496)
        (xy 60.325 127.265958) (xy 60.325 126.934042) (xy 60.260246 126.608504) (xy 60.133228 126.301853) (xy 59.948825 126.025875)
        (xy 59.714125 125.791175) (xy 59.438147 125.606772) (xy 59.131496 125.479754) (xy 58.805958 125.415) (xy 58.474042 125.415)
        (xy 58.148504 125.479754) (xy 57.841853 125.606772) (xy 57.565875 125.791175) (xy 57.331175 126.025875) (xy 57.146772 126.301853)
        (xy 57.019754 126.608504) (xy 56.955 126.934042) (xy 55.245 126.934042) (xy 55.180246 126.608504) (xy 55.053228 126.301853)
        (xy 54.868825 126.025875) (xy 54.634125 125.791175) (xy 54.358147 125.606772) (xy 54.051496 125.479754) (xy 53.725958 125.415)
        (xy 53.394042 125.415) (xy 53.068504 125.479754) (xy 52.761853 125.606772) (xy 52.485875 125.791175) (xy 52.251175 126.025875)
        (xy 52.066772 126.301853) (xy 51.939754 126.608504) (xy 51.875 126.934042) (xy 49.727 126.934042) (xy 49.727 121.6)
        (xy 78.061928 121.6) (xy 78.061928 123.6) (xy 78.074188 123.724482) (xy 78.110498 123.84418) (xy 78.169463 123.954494)
        (xy 78.248815 124.051185) (xy 78.345506 124.130537) (xy 78.45582 124.189502) (xy 78.575518 124.225812) (xy 78.7 124.238072)
        (xy 80.7 124.238072) (xy 80.824482 124.225812) (xy 80.94418 124.189502) (xy 81.054494 124.130537) (xy 81.151185 124.051185)
        (xy 81.230537 123.954494) (xy 81.289502 123.84418) (xy 81.325812 123.724482) (xy 81.338072 123.6) (xy 81.338072 121.6)
        (xy 82.261928 121.6) (xy 82.261928 123.6) (xy 82.274188 123.724482) (xy 82.310498 123.84418) (xy 82.369463 123.954494)
        (xy 82.448815 124.051185) (xy 82.545506 124.130537) (xy 82.65582 124.189502) (xy 82.775518 124.225812) (xy 82.9 124.238072)
        (xy 84.9 124.238072) (xy 85.024482 124.225812) (xy 85.14418 124.189502) (xy 85.254494 124.130537) (xy 85.351185 124.051185)
        (xy 85.430537 123.954494) (xy 85.489502 123.84418) (xy 85.525812 123.724482) (xy 85.538072 123.6) (xy 85.538072 121.6)
        (xy 85.525812 121.475518) (xy 85.489502 121.35582) (xy 85.430537 121.245506) (xy 85.351185 121.148815) (xy 85.254494 121.069463)
        (xy 85.14418 121.010498) (xy 85.024482 120.974188) (xy 84.9 120.961928) (xy 82.9 120.961928) (xy 82.775518 120.974188)
        (xy 82.65582 121.010498) (xy 82.545506 121.069463) (xy 82.448815 121.148815) (xy 82.369463 121.245506) (xy 82.310498 121.35582)
        (xy 82.274188 121.475518) (xy 82.261928 121.6) (xy 81.338072 121.6) (xy 81.325812 121.475518) (xy 81.289502 121.35582)
        (xy 81.230537 121.245506) (xy 81.151185 121.148815) (xy 81.054494 121.069463) (xy 80.94418 121.010498) (xy 80.824482 120.974188)
        (xy 80.7 120.961928) (xy 78.7 120.961928) (xy 78.575518 120.974188) (xy 78.45582 121.010498) (xy 78.345506 121.069463)
        (xy 78.248815 121.148815) (xy 78.169463 121.245506) (xy 78.110498 121.35582) (xy 78.074188 121.475518) (xy 78.061928 121.6)
        (xy 49.727 121.6) (xy 49.727 118.234042) (xy 51.875 118.234042) (xy 51.875 118.565958) (xy 51.939754 118.891496)
        (xy 52.066772 119.198147) (xy 52.251175 119.474125) (xy 52.485875 119.708825) (xy 52.761853 119.893228) (xy 53.068504 120.020246)
        (xy 53.394042 120.085) (xy 53.725958 120.085) (xy 54.051496 120.020246) (xy 54.358147 119.893228) (xy 54.634125 119.708825)
        (xy 54.868825 119.474125) (xy 55.053228 119.198147) (xy 55.180246 118.891496) (xy 55.245 118.565958) (xy 55.245 118.234042)
        (xy 56.955 118.234042) (xy 56.955 118.565958) (xy 57.019754 118.891496) (xy 57.146772 119.198147) (xy 57.331175 119.474125)
        (xy 57.565875 119.708825) (xy 57.841853 119.893228) (xy 58.148504 120.020246) (xy 58.474042 120.085) (xy 58.805958 120.085)
        (xy 59.131496 120.020246) (xy 59.438147 119.893228) (xy 59.714125 119.708825) (xy 59.948825 119.474125) (xy 60.133228 119.198147)
        (xy 60.260246 118.891496) (xy 60.325 118.565958) (xy 60.325 118.234042) (xy 60.260246 117.908504) (xy 60.133228 117.601853)
        (xy 59.948825 117.325875) (xy 59.714125 117.091175) (xy 59.438147 116.906772) (xy 59.131496 116.779754) (xy 58.805958 116.715)
        (xy 58.474042 116.715) (xy 58.148504 116.779754) (xy 57.841853 116.906772) (xy 57.565875 117.091175) (xy 57.331175 117.325875)
        (xy 57.146772 117.601853) (xy 57.019754 117.908504) (xy 56.955 118.234042) (xy 55.245 118.234042) (xy 55.180246 117.908504)
        (xy 55.053228 117.601853) (xy 54.868825 117.325875) (xy 54.634125 117.091175) (xy 54.358147 116.906772) (xy 54.051496 116.779754)
        (xy 53.725958 116.715) (xy 53.394042 116.715) (xy 53.068504 116.779754) (xy 52.761853 116.906772) (xy 52.485875 117.091175)
        (xy 52.251175 117.325875) (xy 52.066772 117.601853) (xy 51.939754 117.908504) (xy 51.875 118.234042) (xy 49.727 118.234042)
        (xy 49.727 110.96) (xy 74.080522 110.96)
      )
    )
  )
  (zone (net 4) (net_name /VIN) (layer F.Cu) (tstamp 5FE6FDA8) (hatch edge 0.508)
    (connect_pads yes (clearance 0.508))
    (min_thickness 0.254)
    (fill yes (arc_segments 32) (thermal_gap 0.508) (thermal_bridge_width 0.508))
    (polygon
      (pts
        (xy 75.8 141.7) (xy 73.8 141.7) (xy 73.8 144.8) (xy 67.5 144.8) (xy 67.5 138.8)
        (xy 75.8 138.8)
      )
    )
    (filled_polygon
      (pts
        (xy 75.581928 141.391928) (xy 75.22 141.391928) (xy 75.095518 141.404188) (xy 75 141.433163) (xy 74.904482 141.404188)
        (xy 74.78 141.391928) (xy 74.22 141.391928) (xy 74.095518 141.404188) (xy 73.97582 141.440498) (xy 73.865506 141.499463)
        (xy 73.771581 141.576545) (xy 73.751399 141.582667) (xy 73.729443 141.594403) (xy 73.710197 141.610197) (xy 73.694403 141.629443)
        (xy 73.682667 141.651399) (xy 73.67544 141.675224) (xy 73.673 141.7) (xy 73.673 141.706306) (xy 73.630498 141.78582)
        (xy 73.594188 141.905518) (xy 73.581928 142.03) (xy 73.581928 144.673) (xy 67.627 144.673) (xy 67.627 138.927)
        (xy 75.581928 138.927)
      )
    )
  )
  (zone (net 4) (net_name /VIN) (layer In2.Cu) (tstamp 5FE6FDA5) (hatch edge 0.508)
    (connect_pads yes (clearance 0.508))
    (min_thickness 0.254)
    (fill yes (arc_segments 32) (thermal_gap 0.508) (thermal_bridge_width 0.508))
    (polygon
      (pts
        (xy 93 147.3) (xy 49.6 147.3) (xy 49.6 110.3) (xy 93 110.3)
      )
    )
    (filled_polygon
      (pts
        (xy 73.775271 111.163962) (xy 73.463962 111.475271) (xy 73.219369 111.841331) (xy 73.05089 112.248075) (xy 72.965 112.679872)
        (xy 72.965 113.120128) (xy 73.05089 113.551925) (xy 73.219369 113.958669) (xy 73.463962 114.324729) (xy 73.775271 114.636038)
        (xy 74.141331 114.880631) (xy 74.548075 115.04911) (xy 74.979872 115.135) (xy 75.420128 115.135) (xy 75.851925 115.04911)
        (xy 76.258669 114.880631) (xy 76.624729 114.636038) (xy 76.936038 114.324729) (xy 77.180631 113.958669) (xy 77.34911 113.551925)
        (xy 77.435 113.120128) (xy 77.435 112.679872) (xy 77.34911 112.248075) (xy 77.180631 111.841331) (xy 76.936038 111.475271)
        (xy 76.624729 111.163962) (xy 76.319478 110.96) (xy 87.280522 110.96) (xy 86.975271 111.163962) (xy 86.663962 111.475271)
        (xy 86.419369 111.841331) (xy 86.25089 112.248075) (xy 86.165 112.679872) (xy 86.165 113.120128) (xy 86.25089 113.551925)
        (xy 86.419369 113.958669) (xy 86.663962 114.324729) (xy 86.975271 114.636038) (xy 87.341331 114.880631) (xy 87.748075 115.04911)
        (xy 88.179872 115.135) (xy 88.620128 115.135) (xy 89.051925 115.04911) (xy 89.458669 114.880631) (xy 89.824729 114.636038)
        (xy 90.136038 114.324729) (xy 90.380631 113.958669) (xy 90.54911 113.551925) (xy 90.635 113.120128) (xy 90.635 112.679872)
        (xy 90.54911 112.248075) (xy 90.380631 111.841331) (xy 90.136038 111.475271) (xy 89.824729 111.163962) (xy 89.519478 110.96)
        (xy 92.873 110.96) (xy 92.873 111.002881) (xy 92.786018 111.212872) (xy 92.72711 111.509024) (xy 92.72711 111.810976)
        (xy 92.786018 112.107128) (xy 92.873 112.31712) (xy 92.873 116.08288) (xy 92.786018 116.292872) (xy 92.72711 116.589024)
        (xy 92.72711 116.890976) (xy 92.786018 117.187128) (xy 92.873 117.39712) (xy 92.873 128.082431) (xy 92.860498 128.10582)
        (xy 92.838487 128.17838) (xy 92.706632 128.046525) (xy 92.463411 127.88401) (xy 92.193158 127.772068) (xy 91.90626 127.715)
        (xy 91.61374 127.715) (xy 91.326842 127.772068) (xy 91.056589 127.88401) (xy 90.813368 128.046525) (xy 90.606525 128.253368)
        (xy 90.44401 128.496589) (xy 90.332068 128.766842) (xy 90.275 129.05374) (xy 90.275 129.34626) (xy 90.332068 129.633158)
        (xy 90.44401 129.903411) (xy 90.606525 130.146632) (xy 90.813368 130.353475) (xy 91.056589 130.51599) (xy 91.247305 130.594987)
        (xy 91.198102 130.604774) (xy 91.009744 130.682795) (xy 90.840226 130.796063) (xy 90.696063 130.940226) (xy 90.582795 131.109744)
        (xy 90.504774 131.298102) (xy 90.465 131.498061) (xy 90.465 131.701939) (xy 90.504774 131.901898) (xy 90.582795 132.090256)
        (xy 90.696063 132.259774) (xy 90.840226 132.403937) (xy 91.009744 132.517205) (xy 91.198102 132.595226) (xy 91.398061 132.635)
        (xy 91.601939 132.635) (xy 91.801898 132.595226) (xy 91.990256 132.517205) (xy 92.159774 132.403937) (xy 92.303937 132.259774)
        (xy 92.417205 132.090256) (xy 92.495226 131.901898) (xy 92.535 131.701939) (xy 92.535 131.498061) (xy 92.495226 131.298102)
        (xy 92.417205 131.109744) (xy 92.303937 130.940226) (xy 92.159774 130.796063) (xy 91.990256 130.682795) (xy 91.966602 130.672997)
        (xy 92.193158 130.627932) (xy 92.463411 130.51599) (xy 92.706632 130.353475) (xy 92.838487 130.22162) (xy 92.860498 130.29418)
        (xy 92.873 130.317569) (xy 92.873 146.64) (xy 49.727 146.64) (xy 49.727 139.298061) (xy 79.965 139.298061)
        (xy 79.965 139.501939) (xy 80.004774 139.701898) (xy 80.082795 139.890256) (xy 80.156123 140) (xy 80.082795 140.109744)
        (xy 80.004774 140.298102) (xy 79.965 140.498061) (xy 79.965 140.701939) (xy 80.004774 140.901898) (xy 80.082795 141.090256)
        (xy 80.156123 141.2) (xy 80.082795 141.309744) (xy 80.004774 141.498102) (xy 79.965 141.698061) (xy 79.965 141.901939)
        (xy 80.004774 142.101898) (xy 80.082795 142.290256) (xy 80.156123 142.4) (xy 80.082795 142.509744) (xy 80.004774 142.698102)
        (xy 79.965 142.898061) (xy 79.965 143.101939) (xy 80.004774 143.301898) (xy 80.082795 143.490256) (xy 80.156123 143.6)
        (xy 80.082795 143.709744) (xy 80.004774 143.898102) (xy 79.965 144.098061) (xy 79.965 144.301939) (xy 80.004774 144.501898)
        (xy 80.082795 144.690256) (xy 80.196063 144.859774) (xy 80.340226 145.003937) (xy 80.509744 145.117205) (xy 80.698102 145.195226)
        (xy 80.898061 145.235) (xy 81.101939 145.235) (xy 81.301898 145.195226) (xy 81.490256 145.117205) (xy 81.659774 145.003937)
        (xy 81.803937 144.859774) (xy 81.917205 144.690256) (xy 81.940093 144.635) (xy 82.101939 144.635) (xy 82.11143 144.633112)
        (xy 82.196063 144.759774) (xy 82.340226 144.903937) (xy 82.509744 145.017205) (xy 82.698102 145.095226) (xy 82.898061 145.135)
        (xy 83.101939 145.135) (xy 83.301898 145.095226) (xy 83.490256 145.017205) (xy 83.659774 144.903937) (xy 83.803937 144.759774)
        (xy 83.917205 144.590256) (xy 83.940093 144.535) (xy 84.101939 144.535) (xy 84.301898 144.495226) (xy 84.490256 144.417205)
        (xy 84.659774 144.303937) (xy 84.803937 144.159774) (xy 84.917205 143.990256) (xy 84.995226 143.801898) (xy 85.035 143.601939)
        (xy 85.035 143.398061) (xy 84.995226 143.198102) (xy 84.917205 143.009744) (xy 84.843877 142.9) (xy 84.917205 142.790256)
        (xy 84.995226 142.601898) (xy 85.035 142.401939) (xy 85.035 142.198061) (xy 84.995226 141.998102) (xy 84.917205 141.809744)
        (xy 84.843877 141.7) (xy 84.917205 141.590256) (xy 84.995226 141.401898) (xy 85.035 141.201939) (xy 85.035 140.998061)
        (xy 84.995226 140.798102) (xy 84.917205 140.609744) (xy 84.843877 140.5) (xy 84.917205 140.390256) (xy 84.995226 140.201898)
        (xy 85.035 140.001939) (xy 85.035 139.798061) (xy 84.995226 139.598102) (xy 84.917205 139.409744) (xy 84.877286 139.35)
        (xy 86.411928 139.35) (xy 86.411928 141.05) (xy 86.424188 141.174482) (xy 86.460498 141.29418) (xy 86.519463 141.404494)
        (xy 86.598815 141.501185) (xy 86.695506 141.580537) (xy 86.80582 141.639502) (xy 86.925518 141.675812) (xy 87.05 141.688072)
        (xy 88.75 141.688072) (xy 88.874482 141.675812) (xy 88.99418 141.639502) (xy 89.104494 141.580537) (xy 89.201185 141.501185)
        (xy 89.280537 141.404494) (xy 89.28931 141.388082) (xy 89.319463 141.444494) (xy 89.398815 141.541185) (xy 89.495506 141.620537)
        (xy 89.60582 141.679502) (xy 89.725518 141.715812) (xy 89.85 141.728072) (xy 91.55 141.728072) (xy 91.674482 141.715812)
        (xy 91.79418 141.679502) (xy 91.904494 141.620537) (xy 92.001185 141.541185) (xy 92.080537 141.444494) (xy 92.139502 141.33418)
        (xy 92.175812 141.214482) (xy 92.188072 141.09) (xy 92.188072 139.39) (xy 92.175812 139.265518) (xy 92.139502 139.14582)
        (xy 92.080537 139.035506) (xy 92.001185 138.938815) (xy 91.904494 138.859463) (xy 91.79418 138.800498) (xy 91.72162 138.778487)
        (xy 91.853475 138.646632) (xy 92.01599 138.403411) (xy 92.127932 138.133158) (xy 92.185 137.84626) (xy 92.185 137.55374)
        (xy 92.127932 137.266842) (xy 92.01599 136.996589) (xy 91.853475 136.753368) (xy 91.646632 136.546525) (xy 91.403411 136.38401)
        (xy 91.133158 136.272068) (xy 90.84626 136.215) (xy 90.55374 136.215) (xy 90.266842 136.272068) (xy 89.996589 136.38401)
        (xy 89.753368 136.546525) (xy 89.546525 136.753368) (xy 89.38401 136.996589) (xy 89.308284 137.179408) (xy 89.21599 136.956589)
        (xy 89.053475 136.713368) (xy 88.846632 136.506525) (xy 88.603411 136.34401) (xy 88.333158 136.232068) (xy 88.04626 136.175)
        (xy 87.75374 136.175) (xy 87.466842 136.232068) (xy 87.196589 136.34401) (xy 86.953368 136.506525) (xy 86.746525 136.713368)
        (xy 86.58401 136.956589) (xy 86.472068 137.226842) (xy 86.415 137.51374) (xy 86.415 137.80626) (xy 86.472068 138.093158)
        (xy 86.58401 138.363411) (xy 86.746525 138.606632) (xy 86.87838 138.738487) (xy 86.80582 138.760498) (xy 86.695506 138.819463)
        (xy 86.598815 138.898815) (xy 86.519463 138.995506) (xy 86.460498 139.10582) (xy 86.424188 139.225518) (xy 86.411928 139.35)
        (xy 84.877286 139.35) (xy 84.803937 139.240226) (xy 84.659774 139.096063) (xy 84.490256 138.982795) (xy 84.301898 138.904774)
        (xy 84.101939 138.865) (xy 83.940093 138.865) (xy 83.917205 138.809744) (xy 83.803937 138.640226) (xy 83.659774 138.496063)
        (xy 83.490256 138.382795) (xy 83.301898 138.304774) (xy 83.101939 138.265) (xy 82.898061 138.265) (xy 82.698102 138.304774)
        (xy 82.509744 138.382795) (xy 82.340226 138.496063) (xy 82.196063 138.640226) (xy 82.082795 138.809744) (xy 82.018485 138.965)
        (xy 81.940093 138.965) (xy 81.917205 138.909744) (xy 81.803937 138.740226) (xy 81.659774 138.596063) (xy 81.490256 138.482795)
        (xy 81.301898 138.404774) (xy 81.101939 138.365) (xy 80.898061 138.365) (xy 80.698102 138.404774) (xy 80.509744 138.482795)
        (xy 80.340226 138.596063) (xy 80.196063 138.740226) (xy 80.082795 138.909744) (xy 80.004774 139.098102) (xy 79.965 139.298061)
        (xy 49.727 139.298061) (xy 49.727 126.934042) (xy 62.035 126.934042) (xy 62.035 127.265958) (xy 62.099754 127.591496)
        (xy 62.226772 127.898147) (xy 62.411175 128.174125) (xy 62.645875 128.408825) (xy 62.921853 128.593228) (xy 63.228504 128.720246)
        (xy 63.554042 128.785) (xy 63.885958 128.785) (xy 64.211496 128.720246) (xy 64.518147 128.593228) (xy 64.794125 128.408825)
        (xy 65.028825 128.174125) (xy 65.213228 127.898147) (xy 65.340246 127.591496) (xy 65.405 127.265958) (xy 65.405 126.934042)
        (xy 67.115 126.934042) (xy 67.115 127.265958) (xy 67.179754 127.591496) (xy 67.306772 127.898147) (xy 67.491175 128.174125)
        (xy 67.725875 128.408825) (xy 68.001853 128.593228) (xy 68.308504 128.720246) (xy 68.634042 128.785) (xy 68.965958 128.785)
        (xy 69.291496 128.720246) (xy 69.598147 128.593228) (xy 69.874125 128.408825) (xy 70.108825 128.174125) (xy 70.293228 127.898147)
        (xy 70.420246 127.591496) (xy 70.485 127.265958) (xy 70.485 126.934042) (xy 70.420246 126.608504) (xy 70.293228 126.301853)
        (xy 70.108825 126.025875) (xy 69.874125 125.791175) (xy 69.598147 125.606772) (xy 69.291496 125.479754) (xy 68.965958 125.415)
        (xy 68.634042 125.415) (xy 68.308504 125.479754) (xy 68.001853 125.606772) (xy 67.725875 125.791175) (xy 67.491175 126.025875)
        (xy 67.306772 126.301853) (xy 67.179754 126.608504) (xy 67.115 126.934042) (xy 65.405 126.934042) (xy 65.340246 126.608504)
        (xy 65.213228 126.301853) (xy 65.028825 126.025875) (xy 64.794125 125.791175) (xy 64.518147 125.606772) (xy 64.211496 125.479754)
        (xy 63.885958 125.415) (xy 63.554042 125.415) (xy 63.228504 125.479754) (xy 62.921853 125.606772) (xy 62.645875 125.791175)
        (xy 62.411175 126.025875) (xy 62.226772 126.301853) (xy 62.099754 126.608504) (xy 62.035 126.934042) (xy 49.727 126.934042)
        (xy 49.727 118.234042) (xy 62.035 118.234042) (xy 62.035 118.565958) (xy 62.099754 118.891496) (xy 62.226772 119.198147)
        (xy 62.411175 119.474125) (xy 62.645875 119.708825) (xy 62.921853 119.893228) (xy 63.228504 120.020246) (xy 63.554042 120.085)
        (xy 63.885958 120.085) (xy 64.211496 120.020246) (xy 64.518147 119.893228) (xy 64.794125 119.708825) (xy 65.028825 119.474125)
        (xy 65.213228 119.198147) (xy 65.340246 118.891496) (xy 65.405 118.565958) (xy 65.405 118.234042) (xy 67.115 118.234042)
        (xy 67.115 118.565958) (xy 67.179754 118.891496) (xy 67.306772 119.198147) (xy 67.491175 119.474125) (xy 67.725875 119.708825)
        (xy 68.001853 119.893228) (xy 68.308504 120.020246) (xy 68.634042 120.085) (xy 68.965958 120.085) (xy 69.291496 120.020246)
        (xy 69.598147 119.893228) (xy 69.874125 119.708825) (xy 70.108825 119.474125) (xy 70.293228 119.198147) (xy 70.420246 118.891496)
        (xy 70.485 118.565958) (xy 70.485 118.234042) (xy 70.420246 117.908504) (xy 70.293228 117.601853) (xy 70.108825 117.325875)
        (xy 69.874125 117.091175) (xy 69.598147 116.906772) (xy 69.291496 116.779754) (xy 68.965958 116.715) (xy 68.634042 116.715)
        (xy 68.308504 116.779754) (xy 68.001853 116.906772) (xy 67.725875 117.091175) (xy 67.491175 117.325875) (xy 67.306772 117.601853)
        (xy 67.179754 117.908504) (xy 67.115 118.234042) (xy 65.405 118.234042) (xy 65.340246 117.908504) (xy 65.213228 117.601853)
        (xy 65.028825 117.325875) (xy 64.794125 117.091175) (xy 64.518147 116.906772) (xy 64.211496 116.779754) (xy 63.885958 116.715)
        (xy 63.554042 116.715) (xy 63.228504 116.779754) (xy 62.921853 116.906772) (xy 62.645875 117.091175) (xy 62.411175 117.325875)
        (xy 62.226772 117.601853) (xy 62.099754 117.908504) (xy 62.035 118.234042) (xy 49.727 118.234042) (xy 49.727 116.1)
        (xy 78.061928 116.1) (xy 78.061928 118.1) (xy 78.074188 118.224482) (xy 78.110498 118.34418) (xy 78.169463 118.454494)
        (xy 78.248815 118.551185) (xy 78.345506 118.630537) (xy 78.45582 118.689502) (xy 78.575518 118.725812) (xy 78.7 118.738072)
        (xy 80.7 118.738072) (xy 80.824482 118.725812) (xy 80.94418 118.689502) (xy 81.054494 118.630537) (xy 81.151185 118.551185)
        (xy 81.230537 118.454494) (xy 81.289502 118.34418) (xy 81.325812 118.224482) (xy 81.338072 118.1) (xy 81.338072 116.1)
        (xy 82.261928 116.1) (xy 82.261928 118.1) (xy 82.274188 118.224482) (xy 82.310498 118.34418) (xy 82.369463 118.454494)
        (xy 82.448815 118.551185) (xy 82.545506 118.630537) (xy 82.65582 118.689502) (xy 82.775518 118.725812) (xy 82.9 118.738072)
        (xy 84.9 118.738072) (xy 85.024482 118.725812) (xy 85.14418 118.689502) (xy 85.254494 118.630537) (xy 85.351185 118.551185)
        (xy 85.430537 118.454494) (xy 85.489502 118.34418) (xy 85.525812 118.224482) (xy 85.538072 118.1) (xy 85.538072 116.1)
        (xy 85.525812 115.975518) (xy 85.489502 115.85582) (xy 85.430537 115.745506) (xy 85.351185 115.648815) (xy 85.254494 115.569463)
        (xy 85.14418 115.510498) (xy 85.024482 115.474188) (xy 84.9 115.461928) (xy 82.9 115.461928) (xy 82.775518 115.474188)
        (xy 82.65582 115.510498) (xy 82.545506 115.569463) (xy 82.448815 115.648815) (xy 82.369463 115.745506) (xy 82.310498 115.85582)
        (xy 82.274188 115.975518) (xy 82.261928 116.1) (xy 81.338072 116.1) (xy 81.325812 115.975518) (xy 81.289502 115.85582)
        (xy 81.230537 115.745506) (xy 81.151185 115.648815) (xy 81.054494 115.569463) (xy 80.94418 115.510498) (xy 80.824482 115.474188)
        (xy 80.7 115.461928) (xy 78.7 115.461928) (xy 78.575518 115.474188) (xy 78.45582 115.510498) (xy 78.345506 115.569463)
        (xy 78.248815 115.648815) (xy 78.169463 115.745506) (xy 78.110498 115.85582) (xy 78.074188 115.975518) (xy 78.061928 116.1)
        (xy 49.727 116.1) (xy 49.727 110.96) (xy 74.080522 110.96)
      )
    )
  )
  (zone (net 3) (net_name /HV_RET) (layer F.Cu) (tstamp 5FE6FDA2) (hatch edge 0.508)
    (connect_pads yes (clearance 1))
    (min_thickness 0.5)
    (fill yes (arc_segments 32) (thermal_gap 0.508) (thermal_bridge_width 0.508))
    (polygon
      (pts
        (xy 100.8 147.3) (xy 93.3 147.3) (xy 93.3 110.3) (xy 100.7 110.3)
      )
    )
    (filled_polygon
      (pts
        (xy 100.532009 140.643952) (xy 98.35 140.643952) (xy 98.175 140.661188) (xy 98.175 115.864372) (xy 98.469362 115.57001)
        (xy 98.704561 115.218009) (xy 98.866569 114.826887) (xy 98.94916 114.411674) (xy 98.94916 113.988326) (xy 98.866569 113.573113)
        (xy 98.704561 113.181991) (xy 98.469362 112.82999) (xy 98.17001 112.530638) (xy 97.818009 112.295439) (xy 97.426887 112.133431)
        (xy 97.011674 112.05084) (xy 96.588326 112.05084) (xy 96.173113 112.133431) (xy 95.781991 112.295439) (xy 95.42999 112.530638)
        (xy 95.130638 112.82999) (xy 94.895439 113.181991) (xy 94.733431 113.573113) (xy 94.65084 113.988326) (xy 94.65084 114.411674)
        (xy 94.733431 114.826887) (xy 94.895439 115.218009) (xy 95.130638 115.57001) (xy 95.425001 115.864373) (xy 95.425 143.030457)
        (xy 94.375489 144.079968) (xy 94.323024 144.123025) (xy 94.279968 144.175489) (xy 94.279964 144.175493) (xy 94.279961 144.175497)
        (xy 94.125499 144.329958) (xy 94.125492 144.329964) (xy 93.55 144.905457) (xy 93.55 132.892579) (xy 93.73816 132.73816)
        (xy 93.894366 132.547823) (xy 94.010437 132.330669) (xy 94.081913 132.095043) (xy 94.106048 131.85) (xy 94.106048 131.35)
        (xy 94.081913 131.104957) (xy 94.010437 130.869331) (xy 93.894366 130.652177) (xy 93.73816 130.46184) (xy 93.55 130.307421)
        (xy 93.55 130.300977) (xy 93.620996 130.194723) (xy 93.779298 129.812547) (xy 93.86 129.406832) (xy 93.86 128.993168)
        (xy 93.779298 128.587453) (xy 93.620996 128.205277) (xy 93.55 128.099024) (xy 93.55 111.575) (xy 100.453445 111.575)
      )
    )
  )
)
