EESchema Schematic File Version 4
EELAYER 30 0
EELAYER END
$Descr User 17000 11000
encoding utf-8
Sheet 1 4
Title "ITkPixV1 Triplet Hybrid"
Date "2020-11-12"
Rev "1.4"
Comp "LBNL"
Comment1 "cross-check: Timon Heim, Maurice Garcia-Sciveres"
Comment2 "design: Aleksandra Dimitrievska"
Comment3 ""
Comment4 ""
$EndDescr
$Sheet
S 8350 6800 2000 2000
U 5F1A7666
F0 "RD53B_Chip2" 50
F1 "rd53b_chip.sch" 50
F2 "CMD_P" I L 8350 6950 50 
F3 "CMD_N" I L 8350 7050 50 
F4 "MUX" I L 8350 8350 50 
F5 "VIN" I L 8350 8100 50 
F6 "LP_EN" I L 8350 8200 50 
F7 "GTX0_N" I L 8350 7250 50 
F8 "GTX0_P" I L 8350 7350 50 
F9 "GTX1_N" I L 8350 7450 50 
F10 "GTX1_P" I L 8350 7550 50 
F11 "GTX2_N" I L 8350 7650 50 
F12 "GTX2_P" I L 8350 7750 50 
F13 "GTX3_N" I L 8350 7850 50 
F14 "GTX3_P" I L 8350 7950 50 
F15 "DATA_IN0_P" I R 10350 6950 50 
F16 "DATA_IN0_N" I R 10350 7050 50 
F17 "DATA_IN1_P" I R 10350 7150 50 
F18 "DATA_IN2_P" I R 10350 7350 50 
F19 "DATA_IN3_P" I R 10350 7550 50 
F20 "DATA_IN1_N" I R 10350 7250 50 
F21 "DATA_IN2_N" I R 10350 7450 50 
F22 "DATA_IN3_N" I R 10350 7650 50 
F23 "LVDS0_P" I R 10350 7900 50 
F24 "LVDS1_P" I R 10350 8100 50 
F25 "LVDS0_N" I R 10350 8000 50 
F26 "LVDS1_N" I R 10350 8200 50 
F27 "VOFS_LP" I L 8350 8500 50 
F28 "VOFS_IN" I L 8350 8600 50 
F29 "VOFS_OUT" I L 8350 8700 50 
F30 "CHIP_ID2" I R 10350 8450 50 
F31 "CHIP_ID3" I R 10350 8550 50 
$EndSheet
$Sheet
S 13400 6800 2000 2000
U 5F1A7749
F0 "RD53B_Chip3" 50
F1 "rd53b_chip.sch" 50
F2 "CMD_P" I L 13400 6950 50 
F3 "CMD_N" I L 13400 7050 50 
F4 "MUX" I L 13400 8350 50 
F5 "VIN" I L 13400 8100 50 
F6 "LP_EN" I L 13400 8200 50 
F7 "GTX0_N" I L 13400 7250 50 
F8 "GTX0_P" I L 13400 7350 50 
F9 "GTX1_N" I L 13400 7450 50 
F10 "GTX1_P" I L 13400 7550 50 
F11 "GTX2_N" I L 13400 7650 50 
F12 "GTX2_P" I L 13400 7750 50 
F13 "GTX3_N" I L 13400 7850 50 
F14 "GTX3_P" I L 13400 7950 50 
F15 "DATA_IN0_P" I R 15400 6950 50 
F16 "DATA_IN0_N" I R 15400 7050 50 
F17 "DATA_IN1_P" I R 15400 7150 50 
F18 "DATA_IN2_P" I R 15400 7350 50 
F19 "DATA_IN3_P" I R 15400 7550 50 
F20 "DATA_IN1_N" I R 15400 7250 50 
F21 "DATA_IN2_N" I R 15400 7450 50 
F22 "DATA_IN3_N" I R 15400 7650 50 
F23 "LVDS0_P" I R 15400 7900 50 
F24 "LVDS1_P" I R 15400 8100 50 
F25 "LVDS0_N" I R 15400 8000 50 
F26 "LVDS1_N" I R 15400 8200 50 
F27 "VOFS_LP" I L 13400 8500 50 
F28 "VOFS_IN" I L 13400 8600 50 
F29 "VOFS_OUT" I L 13400 8700 50 
F30 "CHIP_ID2" I R 15400 8450 50 
F31 "CHIP_ID3" I R 15400 8550 50 
$EndSheet
Text Notes 650  1000 0    50   ~ 0
Triplet: no data sharing, no cmd forwarding:\n- data_in lines have internal termination\n- lvds_out lines: not connected\n- AC coupling of data lines - not final\n- data connector pinout - not final\n- LV: solder pads
$Sheet
S 3250 6800 2000 2000
U 5F1A7631
F0 "RD53B_Chip1" 50
F1 "rd53b_chip.sch" 50
F2 "CMD_P" I L 3250 6950 50 
F3 "CMD_N" I L 3250 7050 50 
F4 "MUX" I L 3250 8350 50 
F5 "VIN" I L 3250 8100 50 
F6 "LP_EN" I L 3250 8200 50 
F7 "GTX0_N" I L 3250 7250 50 
F8 "GTX0_P" I L 3250 7350 50 
F9 "GTX1_N" I L 3250 7450 50 
F10 "GTX1_P" I L 3250 7550 50 
F11 "GTX2_N" I L 3250 7650 50 
F12 "GTX2_P" I L 3250 7750 50 
F13 "GTX3_N" I L 3250 7850 50 
F14 "GTX3_P" I L 3250 7950 50 
F15 "DATA_IN0_P" I R 5250 6950 50 
F16 "DATA_IN0_N" I R 5250 7050 50 
F17 "DATA_IN1_P" I R 5250 7150 50 
F18 "DATA_IN2_P" I R 5250 7350 50 
F19 "DATA_IN3_P" I R 5250 7550 50 
F20 "DATA_IN1_N" I R 5250 7250 50 
F21 "DATA_IN2_N" I R 5250 7450 50 
F22 "DATA_IN3_N" I R 5250 7650 50 
F23 "LVDS0_P" I R 5250 7900 50 
F24 "LVDS1_P" I R 5250 8100 50 
F25 "LVDS0_N" I R 5250 8000 50 
F26 "LVDS1_N" I R 5250 8200 50 
F27 "VOFS_LP" I L 3250 8500 50 
F28 "VOFS_IN" I L 3250 8600 50 
F29 "VOFS_OUT" I L 3250 8700 50 
F30 "CHIP_ID2" I R 5250 8450 50 
F31 "CHIP_ID3" I R 5250 8550 50 
$EndSheet
Wire Wire Line
	5250 6950 5950 6950
Wire Wire Line
	5250 7050 5950 7050
Wire Wire Line
	5250 7150 5950 7150
Wire Wire Line
	5250 7250 5950 7250
Wire Wire Line
	5250 7350 5950 7350
Wire Wire Line
	5250 7450 5950 7450
Wire Wire Line
	5250 7550 5950 7550
Wire Wire Line
	5250 7650 5950 7650
Wire Wire Line
	5250 7900 5950 7900
Wire Wire Line
	5250 8000 5950 8000
Wire Wire Line
	5250 8100 5950 8100
Wire Wire Line
	5250 8200 5950 8200
Wire Wire Line
	5250 8450 5950 8450
Wire Wire Line
	5250 8550 5950 8550
Text Label 5950 8450 2    50   ~ 0
GND
Text Label 5950 8550 2    50   ~ 0
GND
NoConn ~ 5950 6950
NoConn ~ 5950 7050
NoConn ~ 5950 7150
NoConn ~ 5950 7250
NoConn ~ 5950 7350
NoConn ~ 5950 7450
NoConn ~ 5950 7550
NoConn ~ 5950 7650
NoConn ~ 5950 7900
NoConn ~ 5950 8000
NoConn ~ 5950 8100
NoConn ~ 5950 8200
Text Label 5950 6950 2    50   ~ 0
DATA_IN0_Chip1_P
Text Notes 5350 8750 0    50   ~ 0
ChipID for Chip1\n(3rd and 4th bit)\n
Text Label 5950 7050 2    50   ~ 0
DATA_IN0_Chip1_N
Text Label 5950 7250 2    50   ~ 0
DATA_IN1_Chip1_N
Text Label 5950 7150 2    50   ~ 0
DATA_IN1_Chip1_P
Text Label 5950 7350 2    50   ~ 0
DATA_IN2_Chip1_P
Text Label 5950 7450 2    50   ~ 0
DATA_IN2_Chip1_N
Text Label 5950 7550 2    50   ~ 0
DATA_IN3_Chip1_P
Text Label 5950 7650 2    50   ~ 0
DATA_IN3_Chip1_N
Text Label 5950 7900 2    50   ~ 0
LVDS0_Chip1_P
Text Label 5950 8000 2    50   ~ 0
LVDS0_Chip1_N
Text Label 5950 8100 2    50   ~ 0
LVDS1_Chip1_P
Text Label 5950 8200 2    50   ~ 0
LVDS1_Chip1_N
Wire Wire Line
	10350 6950 11050 6950
Wire Wire Line
	10350 7050 11050 7050
Wire Wire Line
	10350 7150 11050 7150
Wire Wire Line
	10350 7250 11050 7250
Wire Wire Line
	10350 7350 11050 7350
Wire Wire Line
	10350 7450 11050 7450
Wire Wire Line
	10350 7550 11050 7550
Wire Wire Line
	10350 7650 11050 7650
Wire Wire Line
	10350 7900 11050 7900
Wire Wire Line
	10350 8000 11050 8000
Wire Wire Line
	10350 8100 11050 8100
Wire Wire Line
	10350 8200 11050 8200
Wire Wire Line
	10350 8450 11050 8450
Wire Wire Line
	10350 8550 11050 8550
Text Label 11050 8450 2    50   ~ 0
GND
Text Label 11050 8550 2    50   ~ 0
GND
NoConn ~ 11050 6950
NoConn ~ 11050 7050
NoConn ~ 11050 7150
NoConn ~ 11050 7250
NoConn ~ 11050 7350
NoConn ~ 11050 7450
NoConn ~ 11050 7550
NoConn ~ 11050 7650
NoConn ~ 11050 7900
NoConn ~ 11050 8000
NoConn ~ 11050 8100
NoConn ~ 11050 8200
Text Label 11050 6950 2    50   ~ 0
DATA_IN0_Chip2_P
Text Notes 10450 8750 0    50   ~ 0
ChipID for Chip2\n(3rd and 4th bit)
Text Label 11050 7050 2    50   ~ 0
DATA_IN0_Chip2_N
Text Label 11050 7250 2    50   ~ 0
DATA_IN1_Chip2_N
Text Label 11050 7150 2    50   ~ 0
DATA_IN1_Chip2_P
Text Label 11050 7350 2    50   ~ 0
DATA_IN2_Chip2_P
Text Label 11050 7450 2    50   ~ 0
DATA_IN2_Chip2_N
Text Label 11050 7550 2    50   ~ 0
DATA_IN3_Chip2_P
Text Label 11050 7650 2    50   ~ 0
DATA_IN3_Chip2_N
Text Label 11050 7900 2    50   ~ 0
LVDS0_Chip2_P
Text Label 11050 8000 2    50   ~ 0
LVDS0_Chip2_N
Text Label 11050 8100 2    50   ~ 0
LVDS1_Chip2_P
Text Label 11050 8200 2    50   ~ 0
LVDS1_Chip2_N
Wire Wire Line
	15400 6950 16100 6950
Wire Wire Line
	15400 7050 16100 7050
Wire Wire Line
	15400 7150 16100 7150
Wire Wire Line
	15400 7250 16100 7250
Wire Wire Line
	15400 7350 16100 7350
Wire Wire Line
	15400 7450 16100 7450
Wire Wire Line
	15400 7550 16100 7550
Wire Wire Line
	15400 7650 16100 7650
Wire Wire Line
	15400 7900 16100 7900
Wire Wire Line
	15400 8000 16100 8000
Wire Wire Line
	15400 8100 16100 8100
Wire Wire Line
	15400 8200 16100 8200
Wire Wire Line
	15400 8450 16100 8450
Wire Wire Line
	15400 8550 16100 8550
Text Label 16100 8450 2    50   ~ 0
GND
Text Label 16100 8550 2    50   ~ 0
GND
NoConn ~ 16100 6950
NoConn ~ 16100 7050
NoConn ~ 16100 7150
NoConn ~ 16100 7250
NoConn ~ 16100 7350
NoConn ~ 16100 7450
NoConn ~ 16100 7550
NoConn ~ 16100 7650
NoConn ~ 16100 7900
NoConn ~ 16100 8000
NoConn ~ 16100 8100
NoConn ~ 16100 8200
Text Label 16100 6950 2    50   ~ 0
DATA_IN0_Chip3_P
Text Notes 15500 8750 0    50   ~ 0
ChipID for Chip3\n(3rd and 4th bit)
Text Label 16100 7050 2    50   ~ 0
DATA_IN0_Chip3_N
Text Label 16100 7250 2    50   ~ 0
DATA_IN1_Chip3_N
Text Label 16100 7150 2    50   ~ 0
DATA_IN1_Chip3_P
Text Label 16100 7350 2    50   ~ 0
DATA_IN2_Chip3_P
Text Label 16100 7450 2    50   ~ 0
DATA_IN2_Chip3_N
Text Label 16100 7550 2    50   ~ 0
DATA_IN3_Chip3_P
Text Label 16100 7650 2    50   ~ 0
DATA_IN3_Chip3_N
Text Label 16100 7900 2    50   ~ 0
LVDS0_Chip3_P
Text Label 16100 8000 2    50   ~ 0
LVDS0_Chip3_N
Text Label 16100 8100 2    50   ~ 0
LVDS1_Chip3_P
Text Label 16100 8200 2    50   ~ 0
LVDS1_Chip3_N
Wire Wire Line
	3250 7050 2550 7050
Wire Wire Line
	3250 8100 2550 8100
Wire Wire Line
	3250 8200 2550 8200
Wire Wire Line
	3250 8350 2550 8350
Wire Wire Line
	3250 8500 2550 8500
Wire Wire Line
	3250 8600 2550 8600
Wire Wire Line
	3250 8700 2550 8700
Text Label 2550 6950 0    50   ~ 0
CMD_Chip1_P
Text Label 2550 7050 0    50   ~ 0
CMD_Chip1_N
Text Label 2550 7250 0    50   ~ 0
GTX0_AC_Chip1_N
Text Label 2550 7350 0    50   ~ 0
GTX0_AC_Chip1_P
Text Label 2550 7550 0    50   ~ 0
GTX1_AC_Chip1_P
Text Label 2550 7750 0    50   ~ 0
GTX2_AC_Chip1_P
Text Label 2550 7950 0    50   ~ 0
GTX3_AC_Chip1_P
Text Label 2550 7450 0    50   ~ 0
GTX1_AC_Chip1_N
Text Label 2550 7650 0    50   ~ 0
GTX2_AC_Chip1_N
Text Label 2550 7850 0    50   ~ 0
GTX3_AC_Chip1_N
Text Label 2550 8100 0    50   ~ 0
VIN
Text Label 2550 8200 0    50   ~ 0
LP_EN_Chip1
Text Label 2550 8350 0    50   ~ 0
MUX_Chip1
Text Label 2550 8500 0    50   ~ 0
VOFS_LP_Chip1
Text Label 2550 8600 0    50   ~ 0
VOFS_IN_Chip1
Text Label 2550 8700 0    50   ~ 0
VOFS_OUT_Chip1
Wire Wire Line
	8350 6950 7650 6950
Wire Wire Line
	8350 7050 7650 7050
Wire Wire Line
	8350 7250 7650 7250
Wire Wire Line
	8350 7450 7650 7450
Wire Wire Line
	8350 7650 7650 7650
Wire Wire Line
	8350 7850 7650 7850
Wire Wire Line
	8350 8100 7650 8100
Wire Wire Line
	8350 8200 7650 8200
Wire Wire Line
	8350 8350 7650 8350
Wire Wire Line
	8350 8500 7650 8500
Wire Wire Line
	8350 8600 7650 8600
Wire Wire Line
	8350 8700 7650 8700
Text Label 7650 6950 0    50   ~ 0
CMD_Chip2_P
Text Label 7650 7050 0    50   ~ 0
CMD_Chip2_N
Text Label 7650 7250 0    50   ~ 0
GTX0_AC_Chip2_N
Text Label 7650 7350 0    50   ~ 0
GTX0_AC_Chip2_P
Text Label 7650 7550 0    50   ~ 0
GTX1_AC_Chip2_P
Text Label 7650 7750 0    50   ~ 0
GTX2_AC_Chip2_P
Text Label 7650 7950 0    50   ~ 0
GTX3_AC_Chip2_P
Text Label 7650 7450 0    50   ~ 0
GTX1_AC_Chip2_N
Text Label 7650 7650 0    50   ~ 0
GTX2_AC_Chip2_N
Text Label 7650 7850 0    50   ~ 0
GTX3_AC_Chip2_N
Text Label 7650 8100 0    50   ~ 0
VIN
Text Label 7650 8200 0    50   ~ 0
LP_EN_Chip2
Text Label 7650 8350 0    50   ~ 0
MUX_Chip2
Text Label 7650 8500 0    50   ~ 0
VOFS_LP_Chip2
Text Label 7650 8600 0    50   ~ 0
VOFS_IN_Chip2
Text Label 7650 8700 0    50   ~ 0
VOFS_OUT_Chip2
Wire Wire Line
	13400 6950 12700 6950
Wire Wire Line
	13400 7050 12700 7050
Wire Wire Line
	13400 7250 12700 7250
Wire Wire Line
	13400 7450 12700 7450
Wire Wire Line
	13400 7650 12700 7650
Wire Wire Line
	13400 7850 12700 7850
Wire Wire Line
	13400 8100 12700 8100
Wire Wire Line
	13400 8200 12700 8200
Wire Wire Line
	13400 8350 12700 8350
Wire Wire Line
	13400 8500 12700 8500
Wire Wire Line
	13400 8600 12700 8600
Wire Wire Line
	13400 8700 12700 8700
Text Label 12700 6950 0    50   ~ 0
CMD_Chip3_P
Text Label 12700 7050 0    50   ~ 0
CMD_Chip3_N
Text Label 12700 7250 0    50   ~ 0
GTX0_AC_Chip3_N
Text Label 12700 7350 0    50   ~ 0
GTX0_AC_Chip3_P
Text Label 12700 7550 0    50   ~ 0
GTX1_AC_Chip3_P
Text Label 12700 7750 0    50   ~ 0
GTX2_AC_Chip3_P
Text Label 12700 7950 0    50   ~ 0
GTX3_AC_Chip3_P
Text Label 12700 7450 0    50   ~ 0
GTX1_AC_Chip3_N
Text Label 12700 7650 0    50   ~ 0
GTX2_AC_Chip3_N
Text Label 12700 7850 0    50   ~ 0
GTX3_AC_Chip3_N
Text Label 12700 8100 0    50   ~ 0
VIN
Text Label 12700 8200 0    50   ~ 0
LP_EN_Chip3
Text Label 12700 8350 0    50   ~ 0
MUX_Chip3
Text Label 12700 8500 0    50   ~ 0
VOFS_LP_Chip3
Text Label 12700 8600 0    50   ~ 0
VOFS_IN_Chip3
Text Label 12700 8700 0    50   ~ 0
VOFS_OUT_Chip3
$Comp
L solder_pad:Solder_Pad U1
U 1 1 5F1AC576
P 1300 2150
F 0 "U1" H 1292 1864 59  0000 C CNN
F 1 "Solder_Pad" H 1292 1969 59  0000 C CNN
F 2 "" H 2150 2550 59  0001 C CNN
F 3 "" H 2150 2550 59  0001 C CNN
	1    1300 2150
	-1   0    0    1   
$EndComp
Text Notes 1100 1750 0    50   ~ 0
Power\n(solder pad)
Wire Wire Line
	1500 2150 1750 2150
Text Label 2000 2150 2    50   ~ 0
VIN
$Comp
L solder_pad:Solder_Pad U2
U 1 1 5F1B91DD
P 1300 2600
F 0 "U2" H 1292 2314 59  0000 C CNN
F 1 "Solder_Pad" H 1292 2419 59  0000 C CNN
F 2 "" H 2150 3000 59  0001 C CNN
F 3 "" H 2150 3000 59  0001 C CNN
	1    1300 2600
	-1   0    0    1   
$EndComp
Wire Wire Line
	1500 2600 2000 2600
Text Label 2000 2600 2    50   ~ 0
GND
$Comp
L power:GND #PWR01
U 1 1 5F1BDB00
P 2000 2600
F 0 "#PWR01" H 2000 2350 50  0001 C CNN
F 1 "GND" H 2005 2427 50  0000 C CNN
F 2 "" H 2000 2600 50  0001 C CNN
F 3 "" H 2000 2600 50  0001 C CNN
	1    2000 2600
	1    0    0    -1  
$EndComp
Text Notes 3900 1000 0    50   ~ 0
NTC
$Comp
L Device:Thermistor_NTC TH1
U 1 1 5F1BDE93
P 4500 1200
F 0 "TH1" V 4210 1200 50  0000 C CNN
F 1 "10k" V 4301 1200 50  0000 C CNN
F 2 "" H 4500 1250 50  0001 C CNN
F 3 "~" H 4500 1250 50  0001 C CNN
	1    4500 1200
	0    1    1    0   
$EndComp
Wire Wire Line
	4650 1200 5150 1200
Wire Wire Line
	4350 1200 3850 1200
Text Label 3850 1200 0    50   ~ 0
NTC
Text Label 5150 1200 2    50   ~ 0
NTC_RET
Text Notes 3800 1550 0    50   ~ 0
MUX\n
Wire Wire Line
	3850 1750 4500 1750
Wire Wire Line
	4500 1750 4500 1600
Wire Wire Line
	4500 1600 5150 1600
Connection ~ 4500 1750
Wire Wire Line
	4500 1750 5150 1750
Wire Wire Line
	4500 1750 4500 1900
Wire Wire Line
	4500 1900 5150 1900
Text Label 3850 1750 0    50   ~ 0
MUX
Text Label 5150 1600 2    50   ~ 0
MUX_Chip1
Text Label 5150 1750 2    50   ~ 0
MUX_Chip2
Text Label 5150 1900 2    50   ~ 0
MUX_Chip3
Text Notes 6400 1350 0    50   ~ 0
LowPower Mode Enable\n(AC coupled at the module)
$Comp
L Device:C C16
U 1 1 5F2153C6
P 7350 1700
F 0 "C16" V 7098 1700 50  0000 C CNN
F 1 "100n" V 7189 1700 50  0000 C CNN
F 2 "" H 7388 1550 50  0001 C CNN
F 3 "~" H 7350 1700 50  0001 C CNN
	1    7350 1700
	0    1    1    0   
$EndComp
Wire Wire Line
	7500 1700 8150 1700
Connection ~ 7100 2050
Wire Wire Line
	7500 2050 8150 2050
Wire Wire Line
	7500 2400 8150 2400
Text Label 6300 2050 0    50   ~ 0
LP_EN
Text Label 8150 1700 2    50   ~ 0
LP_EN_Chip1
Text Label 8150 2050 2    50   ~ 0
LP_EN_Chip2
Text Label 8150 2400 2    50   ~ 0
LP_EN_Chip3
Text Notes 8600 900  0    50   ~ 0
Voffset sharing
Text Label 9300 2650 1    50   ~ 0
VOFS_LP_Chip1
Text Label 10350 2650 1    50   ~ 0
VOFS_LP_Chip2
$Comp
L Device:R R7
U 1 1 5F264406
P 10200 1650
F 0 "R7" H 10270 1696 50  0000 L CNN
F 1 "24.9k" H 10270 1605 50  0000 L CNN
F 2 "" V 10130 1650 50  0001 C CNN
F 3 "~" H 10200 1650 50  0001 C CNN
	1    10200 1650
	0    1    1    0   
$EndComp
$Comp
L Device:R R9
U 1 1 5F264697
P 11100 1650
F 0 "R9" H 11170 1696 50  0000 L CNN
F 1 "24.9k" H 11170 1605 50  0000 L CNN
F 2 "" V 11030 1650 50  0001 C CNN
F 3 "~" H 11100 1650 50  0001 C CNN
	1    11100 1650
	0    1    1    0   
$EndComp
Text Label 11250 2650 1    50   ~ 0
VOFS_LP_Chip3
$Comp
L Device:R R5
U 1 1 5F263DC5
P 9150 1650
F 0 "R5" H 9220 1696 50  0000 L CNN
F 1 "24.9k" H 9220 1605 50  0000 L CNN
F 2 "" V 9080 1650 50  0001 C CNN
F 3 "~" H 9150 1650 50  0001 C CNN
	1    9150 1650
	0    1    1    0   
$EndComp
Wire Wire Line
	9300 2650 9300 1650
Text Label 9000 2650 1    50   ~ 0
VOFS_OUT_Chip1
Text Label 9500 2650 1    50   ~ 0
VOFS_IN_Chip1
$Comp
L Device:R R3
U 1 1 5F2C864D
P 9000 1350
F 0 "R3" H 8900 1400 50  0000 C CNN
F 1 "10k" H 8900 1250 50  0000 C CNN
F 2 "" V 8930 1350 50  0001 C CNN
F 3 "~" H 9000 1350 50  0001 C CNN
	1    9000 1350
	1    0    0    -1  
$EndComp
Wire Wire Line
	9000 1200 9000 1000
Text Label 10050 2650 1    50   ~ 0
VOFS_OUT_Chip2
Text Label 10950 2650 1    50   ~ 0
VOFS_OUT_Chip3
Text Label 11500 2650 1    50   ~ 0
VOFS_IN_Chip3
Text Label 10550 2650 1    50   ~ 0
VOFS_IN_Chip2
Text Notes 6200 3950 0    50   ~ 0
CLK/CMD (multi-drop)
$Comp
L Device:R R4
U 1 1 5F39141E
P 9050 4300
F 0 "R4" H 9120 4346 50  0000 L CNN
F 1 "100" H 9120 4255 50  0000 L CNN
F 2 "" V 8980 4300 50  0001 C CNN
F 3 "~" H 9050 4300 50  0001 C CNN
	1    9050 4300
	1    0    0    -1  
$EndComp
Text Label 6300 4150 0    50   ~ 0
CMD_P
Text Label 6300 4450 0    50   ~ 0
CMD_N
Text Label 7100 5550 1    50   ~ 0
CMD_Chip1_N
Text Label 6900 5550 1    50   ~ 0
CMD_Chip1_P
$Comp
L Device:C C10
U 1 1 5F3BE8A2
P 6900 4650
F 0 "C10" H 7015 4696 50  0000 L CNN
F 1 "100n" H 7015 4605 50  0000 L CNN
F 2 "" H 6938 4500 50  0001 C CNN
F 3 "~" H 6900 4650 50  0001 C CNN
	1    6900 4650
	1    0    0    -1  
$EndComp
Wire Wire Line
	7100 5550 7100 5000
Wire Wire Line
	6300 4450 7100 4450
Wire Wire Line
	6300 4150 6900 4150
$Comp
L Device:C C11
U 1 1 5F3BF534
P 7100 4850
F 0 "C11" H 7215 4896 50  0000 L CNN
F 1 "100n" H 7215 4805 50  0000 L CNN
F 2 "" H 7138 4700 50  0001 C CNN
F 3 "~" H 7100 4850 50  0001 C CNN
	1    7100 4850
	1    0    0    -1  
$EndComp
Wire Wire Line
	6900 4500 6900 4150
Connection ~ 6900 4150
Wire Wire Line
	6900 4150 7700 4150
Wire Wire Line
	6900 4800 6900 5550
Wire Wire Line
	7100 4700 7100 4450
Connection ~ 7100 4450
Wire Wire Line
	7100 4450 7900 4450
Text Label 7900 5550 1    50   ~ 0
CMD_Chip2_N
Text Label 7700 5550 1    50   ~ 0
CMD_Chip2_P
$Comp
L Device:C C23
U 1 1 5F3EF0D3
P 7700 4650
F 0 "C23" H 7815 4696 50  0000 L CNN
F 1 "100n" H 7815 4605 50  0000 L CNN
F 2 "" H 7738 4500 50  0001 C CNN
F 3 "~" H 7700 4650 50  0001 C CNN
	1    7700 4650
	1    0    0    -1  
$EndComp
Wire Wire Line
	7900 5550 7900 5000
$Comp
L Device:C C24
U 1 1 5F3EF0DE
P 7900 4850
F 0 "C24" H 8015 4896 50  0000 L CNN
F 1 "100n" H 8015 4805 50  0000 L CNN
F 2 "" H 7938 4700 50  0001 C CNN
F 3 "~" H 7900 4850 50  0001 C CNN
	1    7900 4850
	1    0    0    -1  
$EndComp
Wire Wire Line
	7700 4800 7700 5550
Wire Wire Line
	7900 4700 7900 4450
Connection ~ 7900 4450
Wire Wire Line
	7900 4450 8700 4450
Text Label 8700 5550 1    50   ~ 0
CMD_Chip3_N
Text Label 8500 5550 1    50   ~ 0
CMD_Chip3_P
$Comp
L Device:C C25
U 1 1 5F3F78BA
P 8500 4650
F 0 "C25" H 8615 4696 50  0000 L CNN
F 1 "100n" H 8615 4605 50  0000 L CNN
F 2 "" H 8538 4500 50  0001 C CNN
F 3 "~" H 8500 4650 50  0001 C CNN
	1    8500 4650
	1    0    0    -1  
$EndComp
Wire Wire Line
	8700 5550 8700 5000
$Comp
L Device:C C26
U 1 1 5F3F78C5
P 8700 4850
F 0 "C26" H 8815 4896 50  0000 L CNN
F 1 "100n" H 8815 4805 50  0000 L CNN
F 2 "" H 8738 4700 50  0001 C CNN
F 3 "~" H 8700 4850 50  0001 C CNN
	1    8700 4850
	1    0    0    -1  
$EndComp
Wire Wire Line
	8500 4800 8500 5550
Wire Wire Line
	8700 4700 8700 4450
Connection ~ 8700 4450
Wire Wire Line
	8700 4450 9050 4450
Wire Wire Line
	7700 4500 7700 4150
Connection ~ 7700 4150
Wire Wire Line
	7700 4150 8500 4150
Wire Wire Line
	8500 4500 8500 4150
Connection ~ 8500 4150
Wire Wire Line
	8500 4150 9050 4150
$Comp
L Device:C C1
U 1 1 5F41223C
P 2050 7350
F 0 "C1" V 2000 7250 50  0000 C CNN
F 1 "1n" V 2000 7450 50  0000 C CNN
F 2 "" H 2088 7200 50  0001 C CNN
F 3 "~" H 2050 7350 50  0001 C CNN
	1    2050 7350
	0    1    1    0   
$EndComp
$Comp
L Device:C C5
U 1 1 5F411895
P 2300 7250
F 0 "C5" V 2250 7150 50  0000 C CNN
F 1 "1n" V 2250 7350 50  0000 C CNN
F 2 "" H 2338 7100 50  0001 C CNN
F 3 "~" H 2300 7250 50  0001 C CNN
	1    2300 7250
	0    1    1    0   
$EndComp
Wire Wire Line
	2450 7250 3250 7250
Wire Wire Line
	1900 7350 1350 7350
Wire Wire Line
	1350 7250 2150 7250
Text Label 1350 7250 0    50   ~ 0
GTX0_Chip1_N
Text Label 1350 7350 0    50   ~ 0
GTX0_Chip1_P
$Comp
L Device:C C2
U 1 1 5F46F9DD
P 2050 7550
F 0 "C2" V 2000 7450 50  0000 C CNN
F 1 "1n" V 2000 7650 50  0000 C CNN
F 2 "" H 2088 7400 50  0001 C CNN
F 3 "~" H 2050 7550 50  0001 C CNN
	1    2050 7550
	0    1    1    0   
$EndComp
$Comp
L Device:C C6
U 1 1 5F46F9E7
P 2300 7450
F 0 "C6" V 2250 7350 50  0000 C CNN
F 1 "1n" V 2250 7550 50  0000 C CNN
F 2 "" H 2338 7300 50  0001 C CNN
F 3 "~" H 2300 7450 50  0001 C CNN
	1    2300 7450
	0    1    1    0   
$EndComp
Wire Wire Line
	1900 7550 1350 7550
Wire Wire Line
	1350 7450 2150 7450
Text Label 1350 7450 0    50   ~ 0
GTX1_Chip1_N
Text Label 1350 7550 0    50   ~ 0
GTX1_Chip1_P
$Comp
L Device:C C3
U 1 1 5F479709
P 2050 7750
F 0 "C3" V 2000 7650 50  0000 C CNN
F 1 "1n" V 2000 7850 50  0000 C CNN
F 2 "" H 2088 7600 50  0001 C CNN
F 3 "~" H 2050 7750 50  0001 C CNN
	1    2050 7750
	0    1    1    0   
$EndComp
$Comp
L Device:C C7
U 1 1 5F479713
P 2300 7650
F 0 "C7" V 2250 7550 50  0000 C CNN
F 1 "1n" V 2250 7750 50  0000 C CNN
F 2 "" H 2338 7500 50  0001 C CNN
F 3 "~" H 2300 7650 50  0001 C CNN
	1    2300 7650
	0    1    1    0   
$EndComp
Wire Wire Line
	1900 7750 1350 7750
Wire Wire Line
	1350 7650 2150 7650
Text Label 1350 7650 0    50   ~ 0
GTX2_Chip1_N
Text Label 1350 7750 0    50   ~ 0
GTX2_Chip1_P
$Comp
L Device:C C4
U 1 1 5F479721
P 2050 7950
F 0 "C4" V 2000 7850 50  0000 C CNN
F 1 "1n" V 2000 8050 50  0000 C CNN
F 2 "" H 2088 7800 50  0001 C CNN
F 3 "~" H 2050 7950 50  0001 C CNN
	1    2050 7950
	0    1    1    0   
$EndComp
$Comp
L Device:C C8
U 1 1 5F47972B
P 2300 7850
F 0 "C8" V 2250 7750 50  0000 C CNN
F 1 "1n" V 2250 7950 50  0000 C CNN
F 2 "" H 2338 7700 50  0001 C CNN
F 3 "~" H 2300 7850 50  0001 C CNN
	1    2300 7850
	0    1    1    0   
$EndComp
Wire Wire Line
	1900 7950 1350 7950
Wire Wire Line
	1350 7850 2150 7850
Text Label 1350 7850 0    50   ~ 0
GTX3_Chip1_N
Text Label 1350 7950 0    50   ~ 0
GTX3_Chip1_P
Text Notes 950  7100 0    50   ~ 0
AC coupling of the data lines not final
$Comp
L Device:C C12
U 1 1 5F49DDE7
P 7250 7350
F 0 "C12" V 7200 7250 50  0000 C CNN
F 1 "1n" V 7200 7450 50  0000 C CNN
F 2 "" H 7288 7200 50  0001 C CNN
F 3 "~" H 7250 7350 50  0001 C CNN
	1    7250 7350
	0    1    1    0   
$EndComp
$Comp
L Device:C C19
U 1 1 5F49DDF1
P 7500 7250
F 0 "C19" V 7450 7150 50  0000 C CNN
F 1 "1n" V 7450 7350 50  0000 C CNN
F 2 "" H 7538 7100 50  0001 C CNN
F 3 "~" H 7500 7250 50  0001 C CNN
	1    7500 7250
	0    1    1    0   
$EndComp
Wire Wire Line
	7100 7350 6550 7350
Wire Wire Line
	6550 7250 7350 7250
Text Label 6550 7250 0    50   ~ 0
GTX0_Chip2_N
Text Label 6550 7350 0    50   ~ 0
GTX0_Chip2_P
$Comp
L Device:C C13
U 1 1 5F49DDFF
P 7250 7550
F 0 "C13" V 7200 7450 50  0000 C CNN
F 1 "1n" V 7200 7650 50  0000 C CNN
F 2 "" H 7288 7400 50  0001 C CNN
F 3 "~" H 7250 7550 50  0001 C CNN
	1    7250 7550
	0    1    1    0   
$EndComp
$Comp
L Device:C C20
U 1 1 5F49DE09
P 7500 7450
F 0 "C20" V 7450 7350 50  0000 C CNN
F 1 "1n" V 7450 7550 50  0000 C CNN
F 2 "" H 7538 7300 50  0001 C CNN
F 3 "~" H 7500 7450 50  0001 C CNN
	1    7500 7450
	0    1    1    0   
$EndComp
Wire Wire Line
	7100 7550 6550 7550
Wire Wire Line
	6550 7450 7350 7450
Text Label 6550 7450 0    50   ~ 0
GTX1_Chip2_N
Text Label 6550 7550 0    50   ~ 0
GTX1_Chip2_P
$Comp
L Device:C C14
U 1 1 5F49DE17
P 7250 7750
F 0 "C14" V 7200 7650 50  0000 C CNN
F 1 "1n" V 7200 7850 50  0000 C CNN
F 2 "" H 7288 7600 50  0001 C CNN
F 3 "~" H 7250 7750 50  0001 C CNN
	1    7250 7750
	0    1    1    0   
$EndComp
$Comp
L Device:C C21
U 1 1 5F49DE21
P 7500 7650
F 0 "C21" V 7450 7550 50  0000 C CNN
F 1 "1n" V 7450 7750 50  0000 C CNN
F 2 "" H 7538 7500 50  0001 C CNN
F 3 "~" H 7500 7650 50  0001 C CNN
	1    7500 7650
	0    1    1    0   
$EndComp
Wire Wire Line
	7100 7750 6550 7750
Wire Wire Line
	6550 7650 7350 7650
Text Label 6550 7650 0    50   ~ 0
GTX2_Chip2_N
Text Label 6550 7750 0    50   ~ 0
GTX2_Chip2_P
$Comp
L Device:C C15
U 1 1 5F49DE2F
P 7250 7950
F 0 "C15" V 7200 7850 50  0000 C CNN
F 1 "1n" V 7200 8050 50  0000 C CNN
F 2 "" H 7288 7800 50  0001 C CNN
F 3 "~" H 7250 7950 50  0001 C CNN
	1    7250 7950
	0    1    1    0   
$EndComp
$Comp
L Device:C C22
U 1 1 5F49DE39
P 7500 7850
F 0 "C22" V 7450 7750 50  0000 C CNN
F 1 "1n" V 7450 7950 50  0000 C CNN
F 2 "" H 7538 7700 50  0001 C CNN
F 3 "~" H 7500 7850 50  0001 C CNN
	1    7500 7850
	0    1    1    0   
$EndComp
Wire Wire Line
	7100 7950 6550 7950
Wire Wire Line
	6550 7850 7350 7850
Text Label 6550 7850 0    50   ~ 0
GTX3_Chip2_N
Text Label 6550 7950 0    50   ~ 0
GTX3_Chip2_P
Text Notes 6150 7100 0    50   ~ 0
AC coupling of the data lines not final
$Comp
L Device:C C27
U 1 1 5F4AE746
P 12300 7350
F 0 "C27" V 12250 7250 50  0000 C CNN
F 1 "1n" V 12250 7450 50  0000 C CNN
F 2 "" H 12338 7200 50  0001 C CNN
F 3 "~" H 12300 7350 50  0001 C CNN
	1    12300 7350
	0    1    1    0   
$EndComp
$Comp
L Device:C C31
U 1 1 5F4AE750
P 12550 7250
F 0 "C31" V 12500 7150 50  0000 C CNN
F 1 "1n" V 12500 7350 50  0000 C CNN
F 2 "" H 12588 7100 50  0001 C CNN
F 3 "~" H 12550 7250 50  0001 C CNN
	1    12550 7250
	0    1    1    0   
$EndComp
Wire Wire Line
	12150 7350 11600 7350
Wire Wire Line
	11600 7250 12400 7250
Text Label 11600 7250 0    50   ~ 0
GTX0_Chip3_N
Text Label 11600 7350 0    50   ~ 0
GTX0_Chip3_P
$Comp
L Device:C C28
U 1 1 5F4AE75E
P 12300 7550
F 0 "C28" V 12250 7450 50  0000 C CNN
F 1 "1n" V 12250 7650 50  0000 C CNN
F 2 "" H 12338 7400 50  0001 C CNN
F 3 "~" H 12300 7550 50  0001 C CNN
	1    12300 7550
	0    1    1    0   
$EndComp
$Comp
L Device:C C32
U 1 1 5F4AE768
P 12550 7450
F 0 "C32" V 12500 7350 50  0000 C CNN
F 1 "1n" V 12500 7550 50  0000 C CNN
F 2 "" H 12588 7300 50  0001 C CNN
F 3 "~" H 12550 7450 50  0001 C CNN
	1    12550 7450
	0    1    1    0   
$EndComp
Wire Wire Line
	12150 7550 11600 7550
Wire Wire Line
	11600 7450 12400 7450
Text Label 11600 7450 0    50   ~ 0
GTX1_Chip3_N
Text Label 11600 7550 0    50   ~ 0
GTX1_Chip3_P
$Comp
L Device:C C29
U 1 1 5F4AE776
P 12300 7750
F 0 "C29" V 12250 7650 50  0000 C CNN
F 1 "1n" V 12250 7850 50  0000 C CNN
F 2 "" H 12338 7600 50  0001 C CNN
F 3 "~" H 12300 7750 50  0001 C CNN
	1    12300 7750
	0    1    1    0   
$EndComp
$Comp
L Device:C C33
U 1 1 5F4AE780
P 12550 7650
F 0 "C33" V 12500 7550 50  0000 C CNN
F 1 "1n" V 12500 7750 50  0000 C CNN
F 2 "" H 12588 7500 50  0001 C CNN
F 3 "~" H 12550 7650 50  0001 C CNN
	1    12550 7650
	0    1    1    0   
$EndComp
Wire Wire Line
	12150 7750 11600 7750
Wire Wire Line
	11600 7650 12400 7650
Text Label 11600 7650 0    50   ~ 0
GTX2_Chip3_N
Text Label 11600 7750 0    50   ~ 0
GTX2_Chip3_P
$Comp
L Device:C C30
U 1 1 5F4AE78E
P 12300 7950
F 0 "C30" V 12250 7850 50  0000 C CNN
F 1 "1n" V 12250 8050 50  0000 C CNN
F 2 "" H 12338 7800 50  0001 C CNN
F 3 "~" H 12300 7950 50  0001 C CNN
	1    12300 7950
	0    1    1    0   
$EndComp
$Comp
L Device:C C34
U 1 1 5F4AE798
P 12550 7850
F 0 "C34" V 12500 7750 50  0000 C CNN
F 1 "1n" V 12500 7950 50  0000 C CNN
F 2 "" H 12588 7700 50  0001 C CNN
F 3 "~" H 12550 7850 50  0001 C CNN
	1    12550 7850
	0    1    1    0   
$EndComp
Wire Wire Line
	12150 7950 11600 7950
Wire Wire Line
	11600 7850 12400 7850
Text Label 11600 7850 0    50   ~ 0
GTX3_Chip3_N
Text Label 11600 7950 0    50   ~ 0
GTX3_Chip3_P
Text Notes 11200 7100 0    50   ~ 0
AC coupling of the data lines not final
Wire Wire Line
	2550 6950 3250 6950
$Comp
L conn_5025985193:ConnSingle J_conn1
U 1 1 5F4EF2E7
P 14200 3050
F 0 "J_conn1" H 14300 5537 60  0000 C CNN
F 1 "ConnSingle" H 14300 5431 60  0000 C CNN
F 2 "Library:Molex-5025985193-MFG" H 14200 2550 60  0001 C CNN
F 3 "" H 14200 2550 60  0001 C CNN
	1    14200 3050
	1    0    0    -1  
$EndComp
Wire Wire Line
	15000 950  16000 950 
Wire Wire Line
	15000 1150 16000 1150
Wire Wire Line
	15000 1350 16000 1350
Wire Wire Line
	15000 1550 16000 1550
Wire Wire Line
	15000 1750 16000 1750
Wire Wire Line
	15000 1950 16000 1950
Wire Wire Line
	15000 2150 16000 2150
Wire Wire Line
	15000 2350 16000 2350
Wire Wire Line
	15000 2550 16000 2550
Wire Wire Line
	15000 2750 16000 2750
Wire Wire Line
	15000 2950 16000 2950
Wire Wire Line
	15000 3150 16000 3150
Wire Wire Line
	15000 3350 16000 3350
Wire Wire Line
	15000 3550 16000 3550
Wire Wire Line
	15000 3750 16000 3750
Wire Wire Line
	15000 3950 16000 3950
Wire Wire Line
	15000 4150 16000 4150
Wire Wire Line
	15000 4350 16000 4350
Wire Wire Line
	15000 4550 16000 4550
Wire Wire Line
	15000 4750 16000 4750
Wire Wire Line
	15000 4950 16000 4950
Wire Wire Line
	15000 5150 16000 5150
Wire Wire Line
	15000 5350 16000 5350
Wire Wire Line
	15000 5550 16000 5550
Wire Wire Line
	15000 5750 16000 5750
Wire Wire Line
	13600 1250 12600 1250
Wire Wire Line
	13600 1450 12600 1450
Wire Wire Line
	13600 1650 12600 1650
Wire Wire Line
	13600 1850 12600 1850
Wire Wire Line
	13600 2050 12600 2050
Wire Wire Line
	13600 2250 12600 2250
Wire Wire Line
	13600 2450 12600 2450
Wire Wire Line
	13600 2650 12600 2650
Wire Wire Line
	13600 2850 12600 2850
Wire Wire Line
	13600 3050 12600 3050
Wire Wire Line
	13600 3250 12600 3250
Wire Wire Line
	13600 3450 12600 3450
Wire Wire Line
	13600 3650 12600 3650
Wire Wire Line
	13600 3850 12600 3850
Wire Wire Line
	13600 4050 12600 4050
Wire Wire Line
	13600 4250 12600 4250
Wire Wire Line
	13600 4450 12600 4450
Wire Wire Line
	13600 4650 12600 4650
Wire Wire Line
	13600 4850 12600 4850
Wire Wire Line
	13600 5050 12600 5050
Wire Wire Line
	13600 5250 12600 5250
Wire Wire Line
	13600 5450 12600 5450
Wire Wire Line
	13600 5650 12600 5650
Wire Wire Line
	13600 5850 12600 5850
Text Label 16000 950  2    50   ~ 0
CMD_N
Text Label 12600 1250 0    50   ~ 0
GTX0_Chip1_P
Text Label 16000 1150 2    50   ~ 0
GTX0_Chip1_N
Text Label 16000 1350 2    50   ~ 0
GND_C
Text Label 12600 1450 0    50   ~ 0
GTX1_Chip1_N
Text Label 16000 1550 2    50   ~ 0
GTX1_Chip1_P
Text Label 12600 1650 0    50   ~ 0
GND_C
Text Label 12600 1050 0    50   ~ 0
GND_C
Wire Wire Line
	13600 1050 12600 1050
Text Label 12600 850  0    50   ~ 0
CMD_P
Wire Wire Line
	13600 850  12600 850 
Text Label 16000 1750 2    50   ~ 0
GTX2_Chip1_N
Text Label 12600 1850 0    50   ~ 0
GTX2_Chip1_P
Text Label 12600 2050 0    50   ~ 0
GTX3_Chip1_N
Text Label 16000 2150 2    50   ~ 0
GTX3_Chip1_P
Text Label 16000 2350 2    50   ~ 0
MUX
Text Label 12600 2450 0    50   ~ 0
LP_EN
Text Label 16000 2550 2    50   ~ 0
Vsense
Text Label 16000 2750 2    50   ~ 0
GTX0_Chip2_N
Text Label 12600 2850 0    50   ~ 0
GTX0_Chip2_P
Text Label 16000 3150 2    50   ~ 0
GTX1_Chip2_P
Text Label 12600 3050 0    50   ~ 0
GTX1_Chip2_N
Text Label 16000 3350 2    50   ~ 0
GTX2_Chip2_N
Text Label 12600 3450 0    50   ~ 0
GTX2_Chip2_P
Text Label 12600 3650 0    50   ~ 0
GTX3_Chip2_N
Text Label 16000 3750 2    50   ~ 0
GTX3_Chip2_P
Text Label 12600 4050 0    50   ~ 0
NTC
Text Label 16000 3950 2    50   ~ 0
NTC_RET
Text Label 12600 4250 0    50   ~ 0
GTX0_Chip3_N
Text Label 16000 4350 2    50   ~ 0
GTX0_Chip3_P
Text Label 16000 4550 2    50   ~ 0
GTX1_Chip3_N
Text Label 12600 4650 0    50   ~ 0
GTX1_Chip3_P
Text Label 12600 4850 0    50   ~ 0
GTX2_Chip3_N
Text Label 16000 4950 2    50   ~ 0
GTX2_Chip3_P
Text Label 16000 5150 2    50   ~ 0
GTX3_Chip3_N
Text Label 12600 5250 0    50   ~ 0
GTX3_Chip3_P
Text Label 12600 5850 0    50   ~ 0
HV
NoConn ~ 16000 5750
NoConn ~ 12600 5650
Text Label 16000 5550 2    50   ~ 0
HV_RET
NoConn ~ 12600 5450
Text Label 16000 2950 2    50   ~ 0
GND_C
Text Label 12600 3250 0    50   ~ 0
GND_C
Text Label 12600 3850 0    50   ~ 0
GND_C
Text Label 16000 4750 2    50   ~ 0
GND_C
Text Label 16000 5350 2    50   ~ 0
GND_C
Text Label 12600 5050 0    50   ~ 0
GND_C
Text Label 12600 4450 0    50   ~ 0
GND_C
Text Label 16000 4150 2    50   ~ 0
GND_C
Text Label 16000 3550 2    50   ~ 0
GND_C
Text Label 12600 2650 0    50   ~ 0
GND_C
Text Label 12600 2250 0    50   ~ 0
GND
Text Label 16000 1950 2    50   ~ 0
GND_C
$Comp
L Device:C C35
U 1 1 5F8141BF
P 14300 6250
F 0 "C35" V 14048 6250 50  0000 C CNN
F 1 "100n" V 14139 6250 50  0000 C CNN
F 2 "" H 14338 6100 50  0001 C CNN
F 3 "~" H 14300 6250 50  0001 C CNN
	1    14300 6250
	0    1    1    0   
$EndComp
Wire Wire Line
	14450 6250 15000 6250
Wire Wire Line
	14150 6250 13650 6250
Text Label 13650 6250 0    50   ~ 0
GND_C
Text Label 15000 6250 2    50   ~ 0
GND
Wire Wire Line
	2200 7350 3250 7350
Wire Wire Line
	2200 7550 3250 7550
Wire Wire Line
	2450 7450 3250 7450
Wire Wire Line
	2450 7650 3250 7650
Wire Wire Line
	2200 7750 3250 7750
Wire Wire Line
	2450 7850 3250 7850
Wire Wire Line
	2200 7950 3250 7950
Wire Wire Line
	7400 7350 8350 7350
Wire Wire Line
	7400 7550 8350 7550
Wire Wire Line
	7400 7750 8350 7750
Wire Wire Line
	7400 7950 8350 7950
Wire Wire Line
	12450 7350 13400 7350
Wire Wire Line
	12450 7550 13400 7550
Wire Wire Line
	12450 7750 13400 7750
Wire Wire Line
	12450 7950 13400 7950
Wire Wire Line
	1750 2150 1750 1900
Wire Wire Line
	1750 1900 2300 1900
Connection ~ 1750 2150
Wire Wire Line
	1750 2150 2000 2150
Text Label 2300 1900 2    50   ~ 0
Vsense
Wire Wire Line
	6300 2050 7100 2050
$Comp
L Device:C C17
U 1 1 5F2547AD
P 7350 2050
F 0 "C17" V 7098 2050 50  0000 C CNN
F 1 "100n" V 7189 2050 50  0000 C CNN
F 2 "" H 7388 1900 50  0001 C CNN
F 3 "~" H 7350 2050 50  0001 C CNN
	1    7350 2050
	0    1    1    0   
$EndComp
$Comp
L Device:C C18
U 1 1 5F254CA4
P 7350 2400
F 0 "C18" V 7098 2400 50  0000 C CNN
F 1 "100n" V 7189 2400 50  0000 C CNN
F 2 "" H 7388 2250 50  0001 C CNN
F 3 "~" H 7350 2400 50  0001 C CNN
	1    7350 2400
	0    1    1    0   
$EndComp
Wire Wire Line
	7100 1700 7200 1700
Wire Wire Line
	7100 1700 7100 2050
Wire Wire Line
	7100 2050 7200 2050
Wire Wire Line
	7100 2400 7200 2400
Wire Wire Line
	7100 2050 7100 2400
Wire Wire Line
	9000 1650 9000 2650
$Comp
L Device:R R6
U 1 1 5F53CD98
P 10050 1350
F 0 "R6" H 9950 1400 50  0000 C CNN
F 1 "10k" H 9950 1250 50  0000 C CNN
F 2 "" V 9980 1350 50  0001 C CNN
F 3 "~" H 10050 1350 50  0001 C CNN
	1    10050 1350
	1    0    0    -1  
$EndComp
$Comp
L Device:R R8
U 1 1 5F599473
P 10950 1350
F 0 "R8" H 10850 1400 50  0000 C CNN
F 1 "10k" H 10850 1250 50  0000 C CNN
F 2 "" V 10880 1350 50  0001 C CNN
F 3 "~" H 10950 1350 50  0001 C CNN
	1    10950 1350
	1    0    0    -1  
$EndComp
Connection ~ 9500 1000
Wire Wire Line
	9500 1000 10050 1000
Connection ~ 10550 1000
Wire Wire Line
	10550 1000 10950 1000
Wire Wire Line
	10050 1200 10050 1000
Connection ~ 10050 1000
Wire Wire Line
	10950 1200 10950 1000
Connection ~ 10950 1000
Text Label 10050 1000 0    50   ~ 0
VOFS_Half
Text Notes 9350 3050 1    50   ~ 0
10k to\nREF_GNDA
Text Notes 10400 3050 1    50   ~ 0
10k to\nREF_GNDA
Text Notes 11300 3050 1    50   ~ 0
10k to\nREF_GNDA
Wire Wire Line
	9000 1500 9000 1650
Connection ~ 9000 1650
Wire Wire Line
	9500 1000 9500 2650
Wire Wire Line
	9000 1000 9500 1000
Wire Wire Line
	10050 1000 10550 1000
Wire Wire Line
	10950 1000 11500 1000
Wire Wire Line
	10050 1650 10050 2650
Wire Wire Line
	10050 1650 10050 1500
Connection ~ 10050 1650
Wire Wire Line
	10350 1650 10350 2650
Wire Wire Line
	10950 1650 10950 1500
Wire Wire Line
	10950 1650 10950 2650
Connection ~ 10950 1650
Wire Wire Line
	11250 1650 11250 2650
Wire Wire Line
	10550 1000 10550 2650
Wire Wire Line
	11500 1000 11500 2650
Connection ~ 2100 5050
Wire Wire Line
	2100 4650 2250 4650
Wire Wire Line
	2100 5050 2100 4650
Wire Wire Line
	2250 4650 2250 4300
Connection ~ 2250 4650
Wire Wire Line
	2550 4650 2250 4650
Wire Wire Line
	2250 5050 2550 5050
Wire Wire Line
	2250 4300 2550 4300
Wire Wire Line
	2250 5050 2250 4650
$Comp
L solder_pad:Solder_Pad U7
U 1 1 5FB868DC
P 2750 4300
F 0 "U7" H 2978 4353 59  0000 L CNN
F 1 "Solder_Pad" H 2978 4248 59  0000 L CNN
F 2 "" H 3600 4700 59  0001 C CNN
F 3 "" H 3600 4700 59  0001 C CNN
	1    2750 4300
	1    0    0    -1  
$EndComp
$Comp
L solder_pad:Solder_Pad U8
U 1 1 5FB86663
P 2750 4650
F 0 "U8" H 2978 4703 59  0000 L CNN
F 1 "Solder_Pad" H 2978 4598 59  0000 L CNN
F 2 "" H 3600 5050 59  0001 C CNN
F 3 "" H 3600 5050 59  0001 C CNN
	1    2750 4650
	1    0    0    -1  
$EndComp
Text Label 2850 5550 0    50   ~ 0
GND
Wire Wire Line
	2100 5550 2850 5550
$Comp
L power:GND #PWR02
U 1 1 5F1F9090
P 2850 5550
F 0 "#PWR02" H 2850 5300 50  0001 C CNN
F 1 "GND" H 2855 5377 50  0000 C CNN
F 2 "" H 2850 5550 50  0001 C CNN
F 3 "" H 2850 5550 50  0001 C CNN
	1    2850 5550
	1    0    0    -1  
$EndComp
$Comp
L solder_pad:Solder_Pad U3
U 1 1 5F1F8A30
P 2750 5050
F 0 "U3" H 2978 5103 59  0000 L CNN
F 1 "Solder_Pad" H 2978 4998 59  0000 L CNN
F 2 "" H 3600 5450 59  0001 C CNN
F 3 "" H 3600 5450 59  0001 C CNN
	1    2750 5050
	1    0    0    -1  
$EndComp
Text Label 1050 5550 0    50   ~ 0
HV_RET
Text Label 1050 5050 0    50   ~ 0
HV
Connection ~ 2100 5550
Wire Wire Line
	2100 5550 2100 5450
Wire Wire Line
	1750 5550 2100 5550
Wire Wire Line
	2100 5050 2100 5150
Wire Wire Line
	1750 5050 2100 5050
Wire Wire Line
	1450 5550 1050 5550
Wire Wire Line
	1450 5050 1050 5050
$Comp
L Device:C C9
U 1 1 5F1CCC75
P 2100 5300
F 0 "C9" H 2215 5346 50  0000 L CNN
F 1 "1n" H 2215 5255 50  0000 L CNN
F 2 "" H 2138 5150 50  0001 C CNN
F 3 "~" H 2100 5300 50  0001 C CNN
	1    2100 5300
	1    0    0    -1  
$EndComp
$Comp
L Device:R R2
U 1 1 5F1CC577
P 1600 5550
F 0 "R2" V 1393 5550 50  0000 C CNN
F 1 "10k" V 1484 5550 50  0000 C CNN
F 2 "" V 1530 5550 50  0001 C CNN
F 3 "~" H 1600 5550 50  0001 C CNN
	1    1600 5550
	0    1    1    0   
$EndComp
$Comp
L Device:R R1
U 1 1 5F1CC11E
P 1600 5050
F 0 "R1" V 1393 5050 50  0000 C CNN
F 1 "10k" V 1484 5050 50  0000 C CNN
F 2 "" V 1530 5050 50  0001 C CNN
F 3 "~" H 1600 5050 50  0001 C CNN
	1    1600 5050
	0    1    1    0   
$EndComp
Text Notes 900  4900 0    50   ~ 0
HV
$EndSCHEMATC
