Id,Designator,Package,Quantity,Designation,
1,"C79,C89,C41,C51,C60,C70",,6,100n,"25V, 10%, Det_GRD"
2,"C69,C62,C55,C50,C43,C36,C88,C81,C74",,9,100n,"10V, 10%"
3,"C10,C11,C23,C24,C25,C26,C35,C18,C17,C16",,10,100n,"50V, 10%, AC cap on CMD, AC cap GND, AC cap LPEnable"
4,"C1,C2,C3,C4,C5,C6,C7,C8,C12,C13,C14,C15,C19,C20,C21,C22,C27,C28,C29,C30,C31,C32,C33,C34",,24,1n,"50V, 2%, AC cap on data lines"
5,"C37,C56,C75",,3,22n,"25V, 5%, MUX"
6,"C38,C40,C44,C46,C47,C49,C52,C54,C57,C59,C63,C65,C66,C68,C71,C73,C76,C78,C82,C84,C85,C87,C90,C92",,24,560n,"10V, 10%"
7,"C91,C86,C83,C77,C72,C67,C64,C58,C53,C48,C45,C39",,12,4.7u,"10V, 10%"
8,"C80,C61,C42",,3,2.2u,"10V, 10%"
9,C18,,1,1n,HV cap
,,,,,
10,R4,,1,100,"1%, CMD termination"
11,"R8,R6,R3",,3,10k,"0.1%, Voffset protection"
12,"R34,R32,R25,R23,R16,R14",,6,30k,"0.1%, Vref analog and digital"
13,"R36,R27,R18",,3,0,"jumper, to enable SLDO powering"
14,"R31,R22,R13",,3,681,"0.1%, Rexta"
15,"R35,R26,R17",,3,750,"0.1%, Rextd"
16,"R30,R21,R12,R9,R7,R5",,6,24.9k,"0.1%, Rioffset, R_Iref"
17,"R29,R20,R11",,3,10k,"0.05%, MUX_Iref"
18,"R28,R19,R10",,3,84.5k,"0.1%, Vref_ADC"
19,"R1, R2",,1,10k,HV filter
20,"TH4,TH3,TH2",,3,10k,NTC for internal Chip ADC
21,TH1,,1,10k,NTC for MoPS
,,,,,
22,J_conn1,Molex-5025985193,1,5025985193,