M48
;DRILL file {KiCad (5.0.0-3-g5ebb6b6)} date Friday, 10 May 2019 at 08:33:50
;FORMAT={-:-/ absolute / inch / decimal}
FMAT,2
INCH,TZ
T1C0.0571
T2C0.1260
%
G90
G05
M72
T1
X8.3324Y-5.7148
X4.14Y-1.6476
X8.3374Y-4.815
X5.04Y-1.6476
X8.3324Y-3.93
X5.94Y-1.6526
X8.3324Y-3.03
X6.84Y-1.6526
T2
X2.7Y-6.395
X7.5Y-5.9
X8.3Y-6.395
X7.27Y-4.48
X3.535Y-4.48
X7.27Y-5.335
X3.5Y-5.9
X3.2Y-6.4
X8.3Y-6.8
X7.8Y-6.4
X2.7Y-6.8
X2.7Y-1.7
X3.535Y-5.335
X8.3Y-1.7
T0
M30
