G04 #@! TF.GenerationSoftware,KiCad,Pcbnew,(5.0.0-3-g5ebb6b6)*
G04 #@! TF.CreationDate,2019-05-10T08:33:44-07:00*
G04 #@! TF.ProjectId,testboard_rd53a_hybrid_pseudoquad,74657374626F6172645F72643533615F,rev?*
G04 #@! TF.SameCoordinates,Original*
G04 #@! TF.FileFunction,Legend,Bot*
G04 #@! TF.FilePolarity,Positive*
%FSLAX46Y46*%
G04 Gerber Fmt 4.6, Leading zero omitted, Abs format (unit mm)*
G04 Created by KiCad (PCBNEW (5.0.0-3-g5ebb6b6)) date Friday, 10 May 2019 at 08:33:44*
%MOMM*%
%LPD*%
G01*
G04 APERTURE LIST*
%ADD10C,0.150000*%
%ADD11C,0.254000*%
G04 APERTURE END LIST*
D10*
G04 #@! TO.C,DP1*
X96656000Y-52530000D02*
X96656000Y-51030000D01*
X113656000Y-51030000D02*
X113656000Y-52530000D01*
X113656000Y-44030000D02*
X113656000Y-48030000D01*
X113656000Y-41030000D02*
X113656000Y-41530000D01*
X96656000Y-41030000D02*
X96656000Y-41530000D01*
X96656000Y-48030000D02*
X96656000Y-44030000D01*
X96656000Y-52530000D02*
X100656000Y-52530000D01*
X111156000Y-52530000D02*
X113656000Y-52530000D01*
X96656000Y-38570000D02*
X96656000Y-41030000D01*
X113656000Y-38570000D02*
X113656000Y-41030000D01*
X113606000Y-38570000D02*
X96706000Y-38570000D01*
G04 #@! TO.C,DP2*
X136466000Y-38570000D02*
X119566000Y-38570000D01*
X136516000Y-38570000D02*
X136516000Y-41030000D01*
X119516000Y-38570000D02*
X119516000Y-41030000D01*
X134016000Y-52530000D02*
X136516000Y-52530000D01*
X119516000Y-52530000D02*
X123516000Y-52530000D01*
X119516000Y-48030000D02*
X119516000Y-44030000D01*
X119516000Y-41030000D02*
X119516000Y-41530000D01*
X136516000Y-41030000D02*
X136516000Y-41530000D01*
X136516000Y-44030000D02*
X136516000Y-48030000D01*
X136516000Y-51030000D02*
X136516000Y-52530000D01*
X119516000Y-52530000D02*
X119516000Y-51030000D01*
G04 #@! TO.C,DP3*
X159326000Y-38697000D02*
X142426000Y-38697000D01*
X159376000Y-38697000D02*
X159376000Y-41157000D01*
X142376000Y-38697000D02*
X142376000Y-41157000D01*
X156876000Y-52657000D02*
X159376000Y-52657000D01*
X142376000Y-52657000D02*
X146376000Y-52657000D01*
X142376000Y-48157000D02*
X142376000Y-44157000D01*
X142376000Y-41157000D02*
X142376000Y-41657000D01*
X159376000Y-41157000D02*
X159376000Y-41657000D01*
X159376000Y-44157000D02*
X159376000Y-48157000D01*
X159376000Y-51157000D02*
X159376000Y-52657000D01*
X142376000Y-52657000D02*
X142376000Y-51157000D01*
G04 #@! TO.C,DP4*
X182186000Y-38697000D02*
X165286000Y-38697000D01*
X182236000Y-38697000D02*
X182236000Y-41157000D01*
X165236000Y-38697000D02*
X165236000Y-41157000D01*
X179736000Y-52657000D02*
X182236000Y-52657000D01*
X165236000Y-52657000D02*
X169236000Y-52657000D01*
X165236000Y-48157000D02*
X165236000Y-44157000D01*
X165236000Y-41157000D02*
X165236000Y-41657000D01*
X182236000Y-41157000D02*
X182236000Y-41657000D01*
X182236000Y-44157000D02*
X182236000Y-48157000D01*
X182236000Y-51157000D02*
X182236000Y-52657000D01*
X165236000Y-52657000D02*
X165236000Y-51157000D01*
G04 #@! TO.C,C2*
X115186666Y-41378142D02*
X115234285Y-41425761D01*
X115377142Y-41473380D01*
X115472380Y-41473380D01*
X115615238Y-41425761D01*
X115710476Y-41330523D01*
X115758095Y-41235285D01*
X115805714Y-41044809D01*
X115805714Y-40901952D01*
X115758095Y-40711476D01*
X115710476Y-40616238D01*
X115615238Y-40521000D01*
X115472380Y-40473380D01*
X115377142Y-40473380D01*
X115234285Y-40521000D01*
X115186666Y-40568619D01*
X114805714Y-40568619D02*
X114758095Y-40521000D01*
X114662857Y-40473380D01*
X114424761Y-40473380D01*
X114329523Y-40521000D01*
X114281904Y-40568619D01*
X114234285Y-40663857D01*
X114234285Y-40759095D01*
X114281904Y-40901952D01*
X114853333Y-41473380D01*
X114234285Y-41473380D01*
G04 #@! TO.C,C3*
X202668142Y-134961333D02*
X202715761Y-134913714D01*
X202763380Y-134770857D01*
X202763380Y-134675619D01*
X202715761Y-134532761D01*
X202620523Y-134437523D01*
X202525285Y-134389904D01*
X202334809Y-134342285D01*
X202191952Y-134342285D01*
X202001476Y-134389904D01*
X201906238Y-134437523D01*
X201811000Y-134532761D01*
X201763380Y-134675619D01*
X201763380Y-134770857D01*
X201811000Y-134913714D01*
X201858619Y-134961333D01*
X201763380Y-135294666D02*
X201763380Y-135913714D01*
X202144333Y-135580380D01*
X202144333Y-135723238D01*
X202191952Y-135818476D01*
X202239571Y-135866095D01*
X202334809Y-135913714D01*
X202572904Y-135913714D01*
X202668142Y-135866095D01*
X202715761Y-135818476D01*
X202763380Y-135723238D01*
X202763380Y-135437523D01*
X202715761Y-135342285D01*
X202668142Y-135294666D01*
G04 #@! TO.C,C6*
X138088666Y-41378142D02*
X138136285Y-41425761D01*
X138279142Y-41473380D01*
X138374380Y-41473380D01*
X138517238Y-41425761D01*
X138612476Y-41330523D01*
X138660095Y-41235285D01*
X138707714Y-41044809D01*
X138707714Y-40901952D01*
X138660095Y-40711476D01*
X138612476Y-40616238D01*
X138517238Y-40521000D01*
X138374380Y-40473380D01*
X138279142Y-40473380D01*
X138136285Y-40521000D01*
X138088666Y-40568619D01*
X137231523Y-40473380D02*
X137422000Y-40473380D01*
X137517238Y-40521000D01*
X137564857Y-40568619D01*
X137660095Y-40711476D01*
X137707714Y-40901952D01*
X137707714Y-41282904D01*
X137660095Y-41378142D01*
X137612476Y-41425761D01*
X137517238Y-41473380D01*
X137326761Y-41473380D01*
X137231523Y-41425761D01*
X137183904Y-41378142D01*
X137136285Y-41282904D01*
X137136285Y-41044809D01*
X137183904Y-40949571D01*
X137231523Y-40901952D01*
X137326761Y-40854333D01*
X137517238Y-40854333D01*
X137612476Y-40901952D01*
X137660095Y-40949571D01*
X137707714Y-41044809D01*
G04 #@! TO.C,C7*
X202668142Y-112101333D02*
X202715761Y-112053714D01*
X202763380Y-111910857D01*
X202763380Y-111815619D01*
X202715761Y-111672761D01*
X202620523Y-111577523D01*
X202525285Y-111529904D01*
X202334809Y-111482285D01*
X202191952Y-111482285D01*
X202001476Y-111529904D01*
X201906238Y-111577523D01*
X201811000Y-111672761D01*
X201763380Y-111815619D01*
X201763380Y-111910857D01*
X201811000Y-112053714D01*
X201858619Y-112101333D01*
X201763380Y-112434666D02*
X201763380Y-113101333D01*
X202763380Y-112672761D01*
G04 #@! TO.C,C10*
X161424857Y-41378142D02*
X161472476Y-41425761D01*
X161615333Y-41473380D01*
X161710571Y-41473380D01*
X161853428Y-41425761D01*
X161948666Y-41330523D01*
X161996285Y-41235285D01*
X162043904Y-41044809D01*
X162043904Y-40901952D01*
X161996285Y-40711476D01*
X161948666Y-40616238D01*
X161853428Y-40521000D01*
X161710571Y-40473380D01*
X161615333Y-40473380D01*
X161472476Y-40521000D01*
X161424857Y-40568619D01*
X160472476Y-41473380D02*
X161043904Y-41473380D01*
X160758190Y-41473380D02*
X160758190Y-40473380D01*
X160853428Y-40616238D01*
X160948666Y-40711476D01*
X161043904Y-40759095D01*
X159853428Y-40473380D02*
X159758190Y-40473380D01*
X159662952Y-40521000D01*
X159615333Y-40568619D01*
X159567714Y-40663857D01*
X159520095Y-40854333D01*
X159520095Y-41092428D01*
X159567714Y-41282904D01*
X159615333Y-41378142D01*
X159662952Y-41425761D01*
X159758190Y-41473380D01*
X159853428Y-41473380D01*
X159948666Y-41425761D01*
X159996285Y-41378142D01*
X160043904Y-41282904D01*
X160091523Y-41092428D01*
X160091523Y-40854333D01*
X160043904Y-40663857D01*
X159996285Y-40568619D01*
X159948666Y-40521000D01*
X159853428Y-40473380D01*
G04 #@! TO.C,C11*
X202668142Y-89146142D02*
X202715761Y-89098523D01*
X202763380Y-88955666D01*
X202763380Y-88860428D01*
X202715761Y-88717571D01*
X202620523Y-88622333D01*
X202525285Y-88574714D01*
X202334809Y-88527095D01*
X202191952Y-88527095D01*
X202001476Y-88574714D01*
X201906238Y-88622333D01*
X201811000Y-88717571D01*
X201763380Y-88860428D01*
X201763380Y-88955666D01*
X201811000Y-89098523D01*
X201858619Y-89146142D01*
X202763380Y-90098523D02*
X202763380Y-89527095D01*
X202763380Y-89812809D02*
X201763380Y-89812809D01*
X201906238Y-89717571D01*
X202001476Y-89622333D01*
X202049095Y-89527095D01*
X202763380Y-91050904D02*
X202763380Y-90479476D01*
X202763380Y-90765190D02*
X201763380Y-90765190D01*
X201906238Y-90669952D01*
X202001476Y-90574714D01*
X202049095Y-90479476D01*
G04 #@! TO.C,C14*
X184326857Y-41378142D02*
X184374476Y-41425761D01*
X184517333Y-41473380D01*
X184612571Y-41473380D01*
X184755428Y-41425761D01*
X184850666Y-41330523D01*
X184898285Y-41235285D01*
X184945904Y-41044809D01*
X184945904Y-40901952D01*
X184898285Y-40711476D01*
X184850666Y-40616238D01*
X184755428Y-40521000D01*
X184612571Y-40473380D01*
X184517333Y-40473380D01*
X184374476Y-40521000D01*
X184326857Y-40568619D01*
X183374476Y-41473380D02*
X183945904Y-41473380D01*
X183660190Y-41473380D02*
X183660190Y-40473380D01*
X183755428Y-40616238D01*
X183850666Y-40711476D01*
X183945904Y-40759095D01*
X182517333Y-40806714D02*
X182517333Y-41473380D01*
X182755428Y-40425761D02*
X182993523Y-41140047D01*
X182374476Y-41140047D01*
G04 #@! TO.C,C15*
X202668142Y-66286142D02*
X202715761Y-66238523D01*
X202763380Y-66095666D01*
X202763380Y-66000428D01*
X202715761Y-65857571D01*
X202620523Y-65762333D01*
X202525285Y-65714714D01*
X202334809Y-65667095D01*
X202191952Y-65667095D01*
X202001476Y-65714714D01*
X201906238Y-65762333D01*
X201811000Y-65857571D01*
X201763380Y-66000428D01*
X201763380Y-66095666D01*
X201811000Y-66238523D01*
X201858619Y-66286142D01*
X202763380Y-67238523D02*
X202763380Y-66667095D01*
X202763380Y-66952809D02*
X201763380Y-66952809D01*
X201906238Y-66857571D01*
X202001476Y-66762333D01*
X202049095Y-66667095D01*
X201763380Y-68143285D02*
X201763380Y-67667095D01*
X202239571Y-67619476D01*
X202191952Y-67667095D01*
X202144333Y-67762333D01*
X202144333Y-68000428D01*
X202191952Y-68095666D01*
X202239571Y-68143285D01*
X202334809Y-68190904D01*
X202572904Y-68190904D01*
X202668142Y-68143285D01*
X202715761Y-68095666D01*
X202763380Y-68000428D01*
X202763380Y-67762333D01*
X202715761Y-67667095D01*
X202668142Y-67619476D01*
G04 #@! TO.C,DP1*
D11*
X116477384Y-45956099D02*
X116477384Y-44940099D01*
X116235480Y-44940099D01*
X116090337Y-44988480D01*
X115993575Y-45085241D01*
X115945194Y-45182003D01*
X115896813Y-45375527D01*
X115896813Y-45520670D01*
X115945194Y-45714194D01*
X115993575Y-45810956D01*
X116090337Y-45907718D01*
X116235480Y-45956099D01*
X116477384Y-45956099D01*
X115461384Y-45956099D02*
X115461384Y-44940099D01*
X115074337Y-44940099D01*
X114977575Y-44988480D01*
X114929194Y-45036860D01*
X114880813Y-45133622D01*
X114880813Y-45278765D01*
X114929194Y-45375527D01*
X114977575Y-45423908D01*
X115074337Y-45472289D01*
X115461384Y-45472289D01*
X113913194Y-45956099D02*
X114493765Y-45956099D01*
X114203480Y-45956099D02*
X114203480Y-44940099D01*
X114300241Y-45085241D01*
X114397003Y-45182003D01*
X114493765Y-45230384D01*
G04 #@! TO.C,DP2*
X139337384Y-45956099D02*
X139337384Y-44940099D01*
X139095480Y-44940099D01*
X138950337Y-44988480D01*
X138853575Y-45085241D01*
X138805194Y-45182003D01*
X138756813Y-45375527D01*
X138756813Y-45520670D01*
X138805194Y-45714194D01*
X138853575Y-45810956D01*
X138950337Y-45907718D01*
X139095480Y-45956099D01*
X139337384Y-45956099D01*
X138321384Y-45956099D02*
X138321384Y-44940099D01*
X137934337Y-44940099D01*
X137837575Y-44988480D01*
X137789194Y-45036860D01*
X137740813Y-45133622D01*
X137740813Y-45278765D01*
X137789194Y-45375527D01*
X137837575Y-45423908D01*
X137934337Y-45472289D01*
X138321384Y-45472289D01*
X137353765Y-45036860D02*
X137305384Y-44988480D01*
X137208622Y-44940099D01*
X136966718Y-44940099D01*
X136869956Y-44988480D01*
X136821575Y-45036860D01*
X136773194Y-45133622D01*
X136773194Y-45230384D01*
X136821575Y-45375527D01*
X137402146Y-45956099D01*
X136773194Y-45956099D01*
G04 #@! TO.C,DP3*
X162197384Y-46083099D02*
X162197384Y-45067099D01*
X161955480Y-45067099D01*
X161810337Y-45115480D01*
X161713575Y-45212241D01*
X161665194Y-45309003D01*
X161616813Y-45502527D01*
X161616813Y-45647670D01*
X161665194Y-45841194D01*
X161713575Y-45937956D01*
X161810337Y-46034718D01*
X161955480Y-46083099D01*
X162197384Y-46083099D01*
X161181384Y-46083099D02*
X161181384Y-45067099D01*
X160794337Y-45067099D01*
X160697575Y-45115480D01*
X160649194Y-45163860D01*
X160600813Y-45260622D01*
X160600813Y-45405765D01*
X160649194Y-45502527D01*
X160697575Y-45550908D01*
X160794337Y-45599289D01*
X161181384Y-45599289D01*
X160262146Y-45067099D02*
X159633194Y-45067099D01*
X159971860Y-45454146D01*
X159826718Y-45454146D01*
X159729956Y-45502527D01*
X159681575Y-45550908D01*
X159633194Y-45647670D01*
X159633194Y-45889575D01*
X159681575Y-45986337D01*
X159729956Y-46034718D01*
X159826718Y-46083099D01*
X160117003Y-46083099D01*
X160213765Y-46034718D01*
X160262146Y-45986337D01*
G04 #@! TO.C,DP4*
X185057384Y-46083099D02*
X185057384Y-45067099D01*
X184815480Y-45067099D01*
X184670337Y-45115480D01*
X184573575Y-45212241D01*
X184525194Y-45309003D01*
X184476813Y-45502527D01*
X184476813Y-45647670D01*
X184525194Y-45841194D01*
X184573575Y-45937956D01*
X184670337Y-46034718D01*
X184815480Y-46083099D01*
X185057384Y-46083099D01*
X184041384Y-46083099D02*
X184041384Y-45067099D01*
X183654337Y-45067099D01*
X183557575Y-45115480D01*
X183509194Y-45163860D01*
X183460813Y-45260622D01*
X183460813Y-45405765D01*
X183509194Y-45502527D01*
X183557575Y-45550908D01*
X183654337Y-45599289D01*
X184041384Y-45599289D01*
X182589956Y-45405765D02*
X182589956Y-46083099D01*
X182831860Y-45018718D02*
X183073765Y-45744432D01*
X182444813Y-45744432D01*
G04 #@! TD*
M02*
