(module stitch_10_6 (layer F.Cu) (tedit 5BEF1D7D)
  (fp_text reference REF** (at 0 1.397) (layer F.SilkS) hide
    (effects (font (size 1 1) (thickness 0.15)))
  )
  (fp_text value stitch (at 0 -1.778) (layer F.Fab) hide
    (effects (font (size 1 1) (thickness 0.15)))
  )
  (pad 1 thru_hole circle (at 0 0) (size 0.6858 0.6858) (drill 0.381) (layers *.Cu))
)
