EESchema Schematic File Version 4
LIBS:testboard_rd53a_hybrid_pseudoquad-cache
EELAYER 26 0
EELAYER END
$Descr USLedger 17000 11000
encoding utf-8
Sheet 1 1
Title "Testboard for RD53a pseudoquad hybrid"
Date ""
Rev ""
Comp "LBNL"
Comment1 ""
Comment2 ""
Comment3 ""
Comment4 ""
$EndDescr
$Comp
L display_port:DISPLAY_PORT DP1
U 1 1 5BDC8CFD
P 5150 900
F 0 "DP1" H 4550 2000 60  0000 C CNN
F 1 "DISPLAY_PORT" V 5300 900 60  0000 C CNN
F 2 "Library:DP1RD20JQ1R400" H 5100 900 60  0001 C CNN
F 3 "" H 5100 900 60  0000 C CNN
	1    5150 900 
	0    -1   -1   0   
$EndComp
$Comp
L molex:molex M1
U 1 1 5BDC9BDF
P 2400 1250
F 0 "M1" H 2390 1420 60  0000 C CNN
F 1 "molex" H 2399 1085 60  0000 C CNN
F 2 "Library:molex" H 2700 1600 60  0001 C CNN
F 3 "" H 2700 1600 60  0001 C CNN
	1    2400 1250
	1    0    0    -1  
$EndComp
NoConn ~ 5850 4750
NoConn ~ 4550 4850
Text Label 6600 1100 0    60   ~ 0
DPH1_SGND
Text Label 6350 4950 2    60   ~ 0
FE1_HV_RET
Text Label 4050 4650 0    60   ~ 0
FE1_HV
Text Label 4050 5050 0    60   ~ 0
GND
Text Label 4050 6450 0    60   ~ 0
GND
Text Label 4050 7050 0    60   ~ 0
GND
Text Label 4050 7650 0    60   ~ 0
GND
Text Label 6350 7350 2    60   ~ 0
GND
Text Label 6350 6750 2    60   ~ 0
GND
Text Label 6350 5950 2    60   ~ 0
GND
Text Label 6350 6350 2    60   ~ 0
FE1_VIN
Text Label 4050 6250 0    60   ~ 0
FE1_MUX
Text Label 4050 6050 0    60   ~ 0
FE1_NTC_RET
Text Label 4050 6650 0    60   ~ 0
FE1_DO_0_P
Text Label 4050 6850 0    60   ~ 0
FE1_DO_1_P
Text Label 4050 7250 0    60   ~ 0
FE1_DO_2_P
Text Label 4050 7450 0    60   ~ 0
FE1_DO_3_P
Text Label 4050 7850 0    60   ~ 0
FE1_CMD_P
Text Label 4050 5850 0    60   ~ 0
FE1_HITOR_0_N
Text Label 4050 5650 0    60   ~ 0
FE1_HITOR_1_N
Text Label 4050 5450 0    60   ~ 0
FE1_HITOR_2_N
Text Label 4050 5250 0    60   ~ 0
FE1_HITOR_3_N
Text Label 6350 5150 2    60   ~ 0
FE1_HITOR_3_P
Text Label 6350 5350 2    60   ~ 0
FE1_HITOR_2_P
Text Label 6350 5550 2    60   ~ 0
FE1_HITOR_1_P
Text Label 6350 5750 2    60   ~ 0
FE1_HITOR_0_P
Text Label 6350 6150 2    60   ~ 0
FE1_NTC
Text Label 6350 6550 2    60   ~ 0
FE1_DO_0_N
Text Label 6350 6950 2    60   ~ 0
FE1_DO_1_N
Text Label 6350 7150 2    60   ~ 0
FE1_DO_2_N
Text Label 6350 7550 2    60   ~ 0
FE1_DO_3_N
Text Label 6350 7750 2    60   ~ 0
FE1_CMD_N
Text Label 4350 2400 1    60   ~ 0
DPH1_FGND
Text Label 4650 2400 1    60   ~ 0
DPH1_FGND
Text Label 4950 2400 1    60   ~ 0
DPH1_FGND
Text Label 5250 2400 1    60   ~ 0
DPH1_FGND
Text Label 5750 2250 1    60   ~ 0
DPH1_FGND
Text Label 4350 4200 1    60   ~ 0
DP1_FGND
Text Label 4650 4200 1    60   ~ 0
DP1_FGND
Text Label 4950 4200 1    60   ~ 0
DP1_FGND
Text Label 5250 4200 1    60   ~ 0
DP1_FGND
Text Label 5750 4200 1    60   ~ 0
DP1_FGND
$Comp
L Device:C C4
U 1 1 5BDCE896
P 6750 3650
F 0 "C4" H 6775 3750 50  0000 L CNN
F 1 "100n" H 6775 3550 50  0000 L CNN
F 2 "Capacitors_SMD:C_0402_NoSilk" H 6788 3500 50  0001 C CNN
F 3 "" H 6750 3650 50  0001 C CNN
	1    6750 3650
	1    0    0    -1  
$EndComp
Text Label 6750 3350 0    60   ~ 0
DP1_FGND
$Comp
L Device:C C2
U 1 1 5BDCED0D
P 6500 3450
F 0 "C2" H 6525 3550 50  0000 L CNN
F 1 "100n" H 6525 3350 50  0000 L CNN
F 2 "Capacitors_SMD:C_0402_NoSilk" H 6538 3300 50  0001 C CNN
F 3 "" H 6500 3450 50  0001 C CNN
	1    6500 3450
	1    0    0    -1  
$EndComp
Text Label 6500 3150 0    60   ~ 0
DP1_SGND
Text Label 6600 3000 0    60   ~ 0
DP1_SGND
$Comp
L Connector:LEMO2 J1
U 1 1 5BDCF343
P 900 3700
F 0 "J1" H 900 3950 50  0000 C CNN
F 1 "LEMO2" H 900 3550 50  0000 C CNN
F 2 "Library:lemo_epb00250ntn" H 900 3750 50  0001 C CNN
F 3 "" H 900 3750 50  0001 C CNN
	1    900  3700
	-1   0    0    1   
$EndComp
Text Label 1700 3800 2    60   ~ 0
L1_HV
Text Label 1700 3700 2    60   ~ 0
L1_HV_RET
$Comp
L connsingle:ConnSingle J_conn1
U 1 1 5BDCD40D
P 5100 6850
F 0 "J_conn1" H 5200 9250 60  0000 C CNN
F 1 "ConnSingle" H 5150 5650 60  0000 C CNN
F 2 "Library:connector" H 5100 6350 60  0001 C CNN
F 3 "" H 5100 6350 60  0001 C CNN
	1    5100 6850
	1    0    0    -1  
$EndComp
$Comp
L solder_pad:Solder_Pad U6
U 1 1 5BDCD94F
P 3500 1050
F 0 "U6" H 3550 1200 59  0000 C CNN
F 1 "Solder_Pad" H 3550 1300 59  0000 C CNN
F 2 "Library:Power_Pad" H 4350 1450 59  0001 C CNN
F 3 "" H 4350 1450 59  0001 C CNN
	1    3500 1050
	1    0    0    -1  
$EndComp
$Comp
L solder_pad:Solder_Pad U7
U 1 1 5BDCD9B0
P 3500 1450
F 0 "U7" H 3550 1600 59  0000 C CNN
F 1 "Solder_Pad" H 3550 1700 59  0000 C CNN
F 2 "Library:Power_Pad" H 4350 1850 59  0001 C CNN
F 3 "" H 4350 1850 59  0001 C CNN
	1    3500 1450
	1    0    0    -1  
$EndComp
$Comp
L solder_pad:Solder_Pad U1
U 1 1 5BDCDA1A
P 1350 1050
F 0 "U1" H 1400 1200 59  0000 C CNN
F 1 "Solder_Pad" H 1400 1300 59  0000 C CNN
F 2 "Library:Power_Pad" H 2200 1450 59  0001 C CNN
F 3 "" H 2200 1450 59  0001 C CNN
	1    1350 1050
	-1   0    0    1   
$EndComp
$Comp
L solder_pad:Solder_Pad U2
U 1 1 5BDCDAFE
P 1350 1450
F 0 "U2" H 1400 1600 59  0000 C CNN
F 1 "Solder_Pad" H 1400 1700 59  0000 C CNN
F 2 "Library:Power_Pad" H 2200 1850 59  0001 C CNN
F 3 "" H 2200 1850 59  0001 C CNN
	1    1350 1450
	-1   0    0    1   
$EndComp
$Comp
L power:GND #PWR01
U 1 1 5BDCDF94
P 750 1300
F 0 "#PWR01" H 750 1050 50  0001 C CNN
F 1 "GND" H 750 1150 50  0000 C CNN
F 2 "" H 750 1300 50  0001 C CNN
F 3 "" H 750 1300 50  0001 C CNN
	1    750  1300
	1    0    0    -1  
$EndComp
Text Label 1850 1200 0    60   ~ 0
VIN_RAW
Text Label 1850 1300 0    60   ~ 0
VIN_RAW
Text Label 2950 1200 2    60   ~ 0
GND
Text Label 2950 1300 2    60   ~ 0
GND
Text Label 1800 1050 2    60   ~ 0
GND
Text Label 1800 1450 2    60   ~ 0
GND
Text Label 3050 1050 0    60   ~ 0
VIN_RAW
Text Label 3050 1450 0    60   ~ 0
VIN_RAW
NoConn ~ 9150 4750
NoConn ~ 7850 4850
Text Label 9650 4950 2    60   ~ 0
FE2_HV_RET
Text Label 7350 4650 0    60   ~ 0
FE2_HV
Text Label 7350 5050 0    60   ~ 0
GND
Text Label 7350 6450 0    60   ~ 0
GND
Text Label 7350 7050 0    60   ~ 0
GND
Text Label 7350 7650 0    60   ~ 0
GND
Text Label 9650 7350 2    60   ~ 0
GND
Text Label 9650 6750 2    60   ~ 0
GND
Text Label 9650 5950 2    60   ~ 0
GND
Text Label 9650 6350 2    60   ~ 0
FE2_VIN
Text Label 7350 6250 0    60   ~ 0
FE2_MUX
Text Label 7350 6050 0    60   ~ 0
FE2_NTC_RET
Text Label 7350 6650 0    60   ~ 0
FE2_DO_0_P
Text Label 7350 6850 0    60   ~ 0
FE2_DO_1_P
Text Label 7350 7250 0    60   ~ 0
FE2_DO_2_P
Text Label 7350 7450 0    60   ~ 0
FE2_DO_3_P
Text Label 7350 7850 0    60   ~ 0
FE2_CMD_P
Text Label 7350 5850 0    60   ~ 0
FE2_HITOR_0_N
Text Label 7350 5650 0    60   ~ 0
FE2_HITOR_1_N
Text Label 7350 5450 0    60   ~ 0
FE2_HITOR_2_N
Text Label 7350 5250 0    60   ~ 0
FE2_HITOR_3_N
Text Label 9650 5150 2    60   ~ 0
FE2_HITOR_3_P
Text Label 9650 5350 2    60   ~ 0
FE2_HITOR_2_P
Text Label 9650 5550 2    60   ~ 0
FE2_HITOR_1_P
Text Label 9650 5750 2    60   ~ 0
FE2_HITOR_0_P
Text Label 9650 6150 2    60   ~ 0
FE2_NTC
Text Label 9650 6550 2    60   ~ 0
FE2_DO_0_N
Text Label 9650 6950 2    60   ~ 0
FE2_DO_1_N
Text Label 9650 7150 2    60   ~ 0
FE2_DO_2_N
Text Label 9650 7550 2    60   ~ 0
FE2_DO_3_N
Text Label 9650 7750 2    60   ~ 0
FE2_CMD_N
$Comp
L connsingle:ConnSingle J_conn2
U 1 1 5BDCFA30
P 8400 6850
F 0 "J_conn2" H 8500 9250 60  0000 C CNN
F 1 "ConnSingle" H 8450 5650 60  0000 C CNN
F 2 "Library:connector" H 8400 6350 60  0001 C CNN
F 3 "" H 8400 6350 60  0001 C CNN
	1    8400 6850
	1    0    0    -1  
$EndComp
NoConn ~ 12250 4750
NoConn ~ 10950 4850
Text Label 12750 4950 2    60   ~ 0
FE3_HV_RET
Text Label 10450 4650 0    60   ~ 0
FE3_HV
Text Label 10450 5050 0    60   ~ 0
GND
Text Label 10450 6450 0    60   ~ 0
GND
Text Label 10450 7050 0    60   ~ 0
GND
Text Label 10450 7650 0    60   ~ 0
GND
Text Label 12750 7350 2    60   ~ 0
GND
Text Label 12750 6750 2    60   ~ 0
GND
Text Label 12750 5950 2    60   ~ 0
GND
Text Label 12750 6350 2    60   ~ 0
FE3_VIN
Text Label 10450 6250 0    60   ~ 0
FE3_MUX
Text Label 10450 6050 0    60   ~ 0
FE3_NTC_RET
Text Label 10450 6650 0    60   ~ 0
FE3_DO_0_P
Text Label 10450 6850 0    60   ~ 0
FE3_DO_1_P
Text Label 10450 7250 0    60   ~ 0
FE3_DO_2_P
Text Label 10450 7450 0    60   ~ 0
FE3_DO_3_P
Text Label 10450 7850 0    60   ~ 0
FE3_CMD_P
Text Label 10450 5850 0    60   ~ 0
FE3_HITOR_0_N
Text Label 10450 5650 0    60   ~ 0
FE3_HITOR_1_N
Text Label 10450 5450 0    60   ~ 0
FE3_HITOR_2_N
Text Label 10450 5250 0    60   ~ 0
FE3_HITOR_3_N
Text Label 12750 5150 2    60   ~ 0
FE3_HITOR_3_P
Text Label 12750 5350 2    60   ~ 0
FE3_HITOR_2_P
Text Label 12750 5550 2    60   ~ 0
FE3_HITOR_1_P
Text Label 12750 5750 2    60   ~ 0
FE3_HITOR_0_P
Text Label 12750 6150 2    60   ~ 0
FE3_NTC
Text Label 12750 6550 2    60   ~ 0
FE3_DO_0_N
Text Label 12750 6950 2    60   ~ 0
FE3_DO_1_N
Text Label 12750 7150 2    60   ~ 0
FE3_DO_2_N
Text Label 12750 7550 2    60   ~ 0
FE3_DO_3_N
Text Label 12750 7750 2    60   ~ 0
FE3_CMD_N
$Comp
L connsingle:ConnSingle J_conn3
U 1 1 5BDD0041
P 11500 6850
F 0 "J_conn3" H 11600 9250 60  0000 C CNN
F 1 "ConnSingle" H 11550 5650 60  0000 C CNN
F 2 "Library:connector" H 11500 6350 60  0001 C CNN
F 3 "" H 11500 6350 60  0001 C CNN
	1    11500 6850
	1    0    0    -1  
$EndComp
NoConn ~ 15350 4750
NoConn ~ 14050 4850
Text Label 15850 4950 2    60   ~ 0
FE4_HV_RET
Text Label 13550 4650 0    60   ~ 0
FE4_HV
Text Label 13550 5050 0    60   ~ 0
GND
Text Label 13550 6450 0    60   ~ 0
GND
Text Label 13550 7050 0    60   ~ 0
GND
Text Label 13550 7650 0    60   ~ 0
GND
Text Label 15850 7350 2    60   ~ 0
GND
Text Label 15850 6750 2    60   ~ 0
GND
Text Label 15850 5950 2    60   ~ 0
GND
Text Label 15850 6350 2    60   ~ 0
FE4_VIN
Text Label 13550 6250 0    60   ~ 0
FE4_MUX
Text Label 13550 6050 0    60   ~ 0
FE4_NTC_RET
Text Label 13550 6650 0    60   ~ 0
FE4_DO_0_P
Text Label 13550 6850 0    60   ~ 0
FE4_DO_1_P
Text Label 13550 7250 0    60   ~ 0
FE4_DO_2_P
Text Label 13550 7450 0    60   ~ 0
FE4_DO_3_P
Text Label 13550 7850 0    60   ~ 0
FE4_CMD_P
Text Label 13550 5850 0    60   ~ 0
FE4_HITOR_0_N
Text Label 13550 5650 0    60   ~ 0
FE4_HITOR_1_N
Text Label 13550 5450 0    60   ~ 0
FE4_HITOR_2_N
Text Label 13550 5250 0    60   ~ 0
FE4_HITOR_3_N
Text Label 15850 5150 2    60   ~ 0
FE4_HITOR_3_P
Text Label 15850 5350 2    60   ~ 0
FE4_HITOR_2_P
Text Label 15850 5550 2    60   ~ 0
FE4_HITOR_1_P
Text Label 15850 5750 2    60   ~ 0
FE4_HITOR_0_P
Text Label 15850 6150 2    60   ~ 0
FE4_NTC
Text Label 15850 6550 2    60   ~ 0
FE4_DO_0_N
Text Label 15850 6950 2    60   ~ 0
FE4_DO_1_N
Text Label 15850 7150 2    60   ~ 0
FE4_DO_2_N
Text Label 15850 7550 2    60   ~ 0
FE4_DO_3_N
Text Label 15850 7750 2    60   ~ 0
FE4_CMD_N
$Comp
L connsingle:ConnSingle J_conn4
U 1 1 5BDD008D
P 14600 6850
F 0 "J_conn4" H 14700 9250 60  0000 C CNN
F 1 "ConnSingle" H 14650 5650 60  0000 C CNN
F 2 "Library:connector" H 14600 6350 60  0001 C CNN
F 3 "" H 14600 6350 60  0001 C CNN
	1    14600 6850
	1    0    0    -1  
$EndComp
Text Label 4250 2400 1    60   ~ 0
FE1_HITOR_3_N
Text Label 4450 2400 1    60   ~ 0
FE1_HITOR_3_P
Text Label 4550 2400 1    60   ~ 0
FE1_HITOR_2_N
Text Label 4750 2400 1    60   ~ 0
FE1_HITOR_2_P
Text Label 4850 2400 1    60   ~ 0
FE1_HITOR_1_N
Text Label 5050 2400 1    60   ~ 0
FE1_HITOR_1_P
Text Label 5150 2400 1    60   ~ 0
FE1_HITOR_0_N
Text Label 5350 2400 1    60   ~ 0
FE1_HITOR_0_P
NoConn ~ 5450 1750
NoConn ~ 5550 1750
NoConn ~ 5950 1750
NoConn ~ 6050 1750
NoConn ~ 6150 1750
$Comp
L Device:Jumper_NO_Small JP1
U 1 1 5BDD7159
P 5750 2400
F 0 "JP1" H 5750 2480 50  0000 C CNN
F 1 "Jumper_NO_Small" H 5760 2340 50  0000 C CNN
F 2 "Pin_Headers:Pin_Header_Straight_1x02_Pitch2.54mm" H 5750 2400 50  0001 C CNN
F 3 "" H 5750 2400 50  0001 C CNN
	1    5750 2400
	1    0    0    -1  
$EndComp
Text Label 5650 2400 1    60   ~ 0
DPH1_AUX_N
Text Label 5850 2400 1    60   ~ 0
DPH1_AUX_P
Text Label 4250 4200 1    60   ~ 0
DP1_DO_0_N
Text Label 4450 4200 1    60   ~ 0
DP1_DO_0_P
Text Label 4550 4200 1    60   ~ 0
DP1_DO_1_N
Text Label 4850 4200 1    60   ~ 0
DP1_DO_2_N
Text Label 5150 4200 1    60   ~ 0
DP1_DO_3_N
Text Label 4750 4200 1    60   ~ 0
DP1_DO_1_P
Text Label 5050 4200 1    60   ~ 0
DP1_DO_2_P
Text Label 5350 4200 1    60   ~ 0
DP1_DO_3_P
Text Label 5650 4200 1    60   ~ 0
DP1_CMD_N
Text Label 5850 4200 1    60   ~ 0
DP1_CMD_P
Text Label 5450 4200 1    60   ~ 0
FE1_NTC
Text Label 5550 4200 1    60   ~ 0
FE1_NTC_RET
NoConn ~ 5950 3650
NoConn ~ 6050 3650
NoConn ~ 6150 3650
$Comp
L display_port:DISPLAY_PORT DP3
U 1 1 5BDD9BEF
P 8450 900
F 0 "DP3" H 7850 2000 60  0000 C CNN
F 1 "DISPLAY_PORT" V 8600 900 60  0000 C CNN
F 2 "Library:DP1RD20JQ1R400" H 8400 900 60  0001 C CNN
F 3 "" H 8400 900 60  0000 C CNN
	1    8450 900 
	0    -1   -1   0   
$EndComp
$Comp
L display_port:DISPLAY_PORT DP4
U 1 1 5BDD9BF5
P 8450 2800
F 0 "DP4" H 7850 3900 60  0000 C CNN
F 1 "DISPLAY_PORT" V 8600 2800 60  0000 C CNN
F 2 "Library:DP1RD20JQ1R400" H 8400 2800 60  0001 C CNN
F 3 "" H 8400 2800 60  0000 C CNN
	1    8450 2800
	0    -1   -1   0   
$EndComp
Text Label 9900 1100 0    60   ~ 0
DPH2_SGND
Text Label 9050 2250 1    60   ~ 0
DPH2_FGND
Text Label 7650 4200 1    60   ~ 0
DP2_FGND
Text Label 7950 4200 1    60   ~ 0
DP2_FGND
Text Label 8250 4200 1    60   ~ 0
DP2_FGND
Text Label 8550 4200 1    60   ~ 0
DP2_FGND
Text Label 9050 4200 1    60   ~ 0
DP2_FGND
Text Label 9900 3000 0    60   ~ 0
DP2_SGND
Text Label 7550 2400 1    60   ~ 0
FE2_HITOR_3_N
Text Label 7750 2400 1    60   ~ 0
FE2_HITOR_3_P
Text Label 7850 2400 1    60   ~ 0
FE2_HITOR_2_N
Text Label 8050 2400 1    60   ~ 0
FE2_HITOR_2_P
Text Label 8150 2400 1    60   ~ 0
FE2_HITOR_1_N
Text Label 8350 2400 1    60   ~ 0
FE2_HITOR_1_P
Text Label 8450 2400 1    60   ~ 0
FE2_HITOR_0_N
Text Label 8650 2400 1    60   ~ 0
FE2_HITOR_0_P
NoConn ~ 8750 1750
NoConn ~ 8850 1750
NoConn ~ 9250 1750
NoConn ~ 9350 1750
NoConn ~ 9450 1750
$Comp
L Device:Jumper_NO_Small JP2
U 1 1 5BDD9C36
P 9050 2400
F 0 "JP2" H 9050 2480 50  0000 C CNN
F 1 "Jumper_NO_Small" H 9060 2340 50  0000 C CNN
F 2 "Pin_Headers:Pin_Header_Straight_1x02_Pitch2.54mm" H 9050 2400 50  0001 C CNN
F 3 "" H 9050 2400 50  0001 C CNN
	1    9050 2400
	1    0    0    -1  
$EndComp
Text Label 8950 2400 1    60   ~ 0
DPH2_AUX_N
Text Label 9150 2400 1    60   ~ 0
DPH2_AUX_P
Text Label 7550 4200 1    60   ~ 0
DP2_DO_0_N
Text Label 7750 4200 1    60   ~ 0
DP2_DO_0_P
Text Label 7850 4200 1    60   ~ 0
DP2_DO_1_N
Text Label 8150 4200 1    60   ~ 0
DP2_DO_2_N
Text Label 8450 4200 1    60   ~ 0
DP2_DO_3_N
Text Label 8050 4200 1    60   ~ 0
DP2_DO_1_P
Text Label 8350 4200 1    60   ~ 0
DP2_DO_2_P
Text Label 8650 4200 1    60   ~ 0
DP2_DO_3_P
Text Label 8950 4200 1    60   ~ 0
DP2_CMD_N
Text Label 9150 4200 1    60   ~ 0
DP2_CMD_P
Text Label 8750 4200 1    60   ~ 0
FE2_NTC
Text Label 8850 4200 1    60   ~ 0
FE2_NTC_RET
NoConn ~ 9250 3650
NoConn ~ 9350 3650
NoConn ~ 9450 3650
$Comp
L display_port:DISPLAY_PORT DP5
U 1 1 5BDDB2B0
P 11550 900
F 0 "DP5" H 10950 2000 60  0000 C CNN
F 1 "DISPLAY_PORT" V 11700 900 60  0000 C CNN
F 2 "Library:DP1RD20JQ1R400" H 11500 900 60  0001 C CNN
F 3 "" H 11500 900 60  0000 C CNN
	1    11550 900 
	0    -1   -1   0   
$EndComp
$Comp
L display_port:DISPLAY_PORT DP6
U 1 1 5BDDB2B6
P 11550 2800
F 0 "DP6" H 10950 3900 60  0000 C CNN
F 1 "DISPLAY_PORT" V 11700 2800 60  0000 C CNN
F 2 "Library:DP1RD20JQ1R400" H 11500 2800 60  0001 C CNN
F 3 "" H 11500 2800 60  0000 C CNN
	1    11550 2800
	0    -1   -1   0   
$EndComp
Text Label 13000 1100 0    60   ~ 0
DPH3_SGND
Text Label 10750 2400 1    60   ~ 0
DPH3_FGND
Text Label 11050 2400 1    60   ~ 0
DPH3_FGND
Text Label 11350 2400 1    60   ~ 0
DPH3_FGND
Text Label 11650 2400 1    60   ~ 0
DPH3_FGND
Text Label 12150 2250 1    60   ~ 0
DPH3_FGND
Text Label 10750 4200 1    60   ~ 0
DP3_FGND
Text Label 11050 4200 1    60   ~ 0
DP3_FGND
Text Label 11350 4200 1    60   ~ 0
DP3_FGND
Text Label 11650 4200 1    60   ~ 0
DP3_FGND
Text Label 12150 4200 1    60   ~ 0
DP3_FGND
Text Label 13000 3000 0    60   ~ 0
DP3_SGND
Text Label 10650 2400 1    60   ~ 0
FE3_HITOR_3_N
Text Label 10850 2400 1    60   ~ 0
FE3_HITOR_3_P
Text Label 10950 2400 1    60   ~ 0
FE3_HITOR_2_N
Text Label 11150 2400 1    60   ~ 0
FE3_HITOR_2_P
Text Label 11250 2400 1    60   ~ 0
FE3_HITOR_1_N
Text Label 11450 2400 1    60   ~ 0
FE3_HITOR_1_P
Text Label 11550 2400 1    60   ~ 0
FE3_HITOR_0_N
Text Label 11750 2400 1    60   ~ 0
FE3_HITOR_0_P
NoConn ~ 11850 1750
NoConn ~ 11950 1750
NoConn ~ 12350 1750
NoConn ~ 12450 1750
NoConn ~ 12550 1750
$Comp
L Device:Jumper_NO_Small JP3
U 1 1 5BDDB2F7
P 12150 2400
F 0 "JP3" H 12150 2480 50  0000 C CNN
F 1 "Jumper_NO_Small" H 12160 2340 50  0000 C CNN
F 2 "Pin_Headers:Pin_Header_Straight_1x02_Pitch2.54mm" H 12150 2400 50  0001 C CNN
F 3 "" H 12150 2400 50  0001 C CNN
	1    12150 2400
	1    0    0    -1  
$EndComp
Text Label 12050 2400 1    60   ~ 0
DPH3_AUX_N
Text Label 12250 2400 1    60   ~ 0
DPH3_AUX_P
Text Label 10650 4200 1    60   ~ 0
DP3_DO_0_N
Text Label 10850 4200 1    60   ~ 0
DP3_DO_0_P
Text Label 10950 4200 1    60   ~ 0
DP3_DO_1_N
Text Label 11250 4200 1    60   ~ 0
DP3_DO_2_N
Text Label 11550 4200 1    60   ~ 0
DP3_DO_3_N
Text Label 11150 4200 1    60   ~ 0
DP3_DO_1_P
Text Label 11450 4200 1    60   ~ 0
DP3_DO_2_P
Text Label 11750 4200 1    60   ~ 0
DP3_DO_3_P
Text Label 12050 4200 1    60   ~ 0
DP3_CMD_N
Text Label 12250 4200 1    60   ~ 0
DP3_CMD_P
Text Label 11850 4200 1    60   ~ 0
FE3_NTC
Text Label 11950 4200 1    60   ~ 0
FE3_NTC_RET
NoConn ~ 12350 3650
NoConn ~ 12450 3650
NoConn ~ 12550 3650
$Comp
L display_port:DISPLAY_PORT DP7
U 1 1 5BDDB30E
P 14650 900
F 0 "DP7" H 14050 2000 60  0000 C CNN
F 1 "DISPLAY_PORT" V 14800 900 60  0000 C CNN
F 2 "Library:DP1RD20JQ1R400" H 14600 900 60  0001 C CNN
F 3 "" H 14600 900 60  0000 C CNN
	1    14650 900 
	0    -1   -1   0   
$EndComp
$Comp
L display_port:DISPLAY_PORT DP8
U 1 1 5BDDB314
P 14650 2800
F 0 "DP8" H 14050 3900 60  0000 C CNN
F 1 "DISPLAY_PORT" V 14800 2800 60  0000 C CNN
F 2 "Library:DP1RD20JQ1R400" H 14600 2800 60  0001 C CNN
F 3 "" H 14600 2800 60  0000 C CNN
	1    14650 2800
	0    -1   -1   0   
$EndComp
Text Label 16100 1100 0    60   ~ 0
DPH4_SGND
Text Label 13850 2400 1    60   ~ 0
DPH4_FGND
Text Label 14150 2400 1    60   ~ 0
DPH4_FGND
Text Label 14450 2400 1    60   ~ 0
DPH4_FGND
Text Label 14750 2400 1    60   ~ 0
DPH4_FGND
Text Label 15250 2250 1    60   ~ 0
DPH4_FGND
Text Label 13850 4200 1    60   ~ 0
DP4_FGND
Text Label 14150 4200 1    60   ~ 0
DP4_FGND
Text Label 14450 4200 1    60   ~ 0
DP4_FGND
Text Label 14750 4200 1    60   ~ 0
DP4_FGND
Text Label 15250 4200 1    60   ~ 0
DP4_FGND
Text Label 16100 3000 0    60   ~ 0
DP4_SGND
Text Label 13750 2400 1    60   ~ 0
FE4_HITOR_3_N
Text Label 13950 2400 1    60   ~ 0
FE4_HITOR_3_P
Text Label 14050 2400 1    60   ~ 0
FE4_HITOR_2_N
Text Label 14250 2400 1    60   ~ 0
FE4_HITOR_2_P
Text Label 14350 2400 1    60   ~ 0
FE4_HITOR_1_N
Text Label 14550 2400 1    60   ~ 0
FE4_HITOR_1_P
Text Label 14650 2400 1    60   ~ 0
FE4_HITOR_0_N
Text Label 14850 2400 1    60   ~ 0
FE4_HITOR_0_P
NoConn ~ 14950 1750
NoConn ~ 15050 1750
NoConn ~ 15450 1750
NoConn ~ 15550 1750
NoConn ~ 15650 1750
$Comp
L Device:Jumper_NO_Small JP4
U 1 1 5BDDB355
P 15250 2400
F 0 "JP4" H 15250 2480 50  0000 C CNN
F 1 "Jumper_NO_Small" H 15260 2340 50  0000 C CNN
F 2 "Pin_Headers:Pin_Header_Straight_1x02_Pitch2.54mm" H 15250 2400 50  0001 C CNN
F 3 "" H 15250 2400 50  0001 C CNN
	1    15250 2400
	1    0    0    -1  
$EndComp
Text Label 15150 2400 1    60   ~ 0
DPH4_AUX_N
Text Label 15350 2400 1    60   ~ 0
DPH4_AUX_P
Text Label 13750 4200 1    60   ~ 0
DP4_DO_0_N
Text Label 13950 4200 1    60   ~ 0
DP4_DO_0_P
Text Label 14050 4200 1    60   ~ 0
DP4_DO_1_N
Text Label 14350 4200 1    60   ~ 0
DP4_DO_2_N
Text Label 14650 4200 1    60   ~ 0
DP4_DO_3_N
Text Label 14250 4200 1    60   ~ 0
DP4_DO_1_P
Text Label 14550 4200 1    60   ~ 0
DP4_DO_2_P
Text Label 14850 4200 1    60   ~ 0
DP4_DO_3_P
Text Label 15150 4200 1    60   ~ 0
DP4_CMD_N
Text Label 15350 4200 1    60   ~ 0
DP4_CMD_P
Text Label 14950 4200 1    60   ~ 0
FE4_NTC
Text Label 15050 4200 1    60   ~ 0
FE4_NTC_RET
NoConn ~ 15450 3650
NoConn ~ 15550 3650
NoConn ~ 15650 3650
$Comp
L Device:C C3
U 1 1 5BE15EBF
P 6750 1750
F 0 "C3" H 6775 1850 50  0000 L CNN
F 1 "100n" H 6775 1650 50  0000 L CNN
F 2 "Capacitors_SMD:C_0402_NoSilk" H 6788 1600 50  0001 C CNN
F 3 "" H 6750 1750 50  0001 C CNN
	1    6750 1750
	1    0    0    -1  
$EndComp
Text Label 6750 1450 0    60   ~ 0
DPH1_FGND
$Comp
L Device:C C1
U 1 1 5BE15ECD
P 6500 1550
F 0 "C1" H 6525 1650 50  0000 L CNN
F 1 "100n" H 6525 1450 50  0000 L CNN
F 2 "Capacitors_SMD:C_0402_NoSilk" H 6538 1400 50  0001 C CNN
F 3 "" H 6500 1550 50  0001 C CNN
	1    6500 1550
	1    0    0    -1  
$EndComp
Text Label 6500 1250 0    60   ~ 0
DPH1_SGND
$Comp
L Device:C C7
U 1 1 5BE162B9
P 9950 1750
F 0 "C7" H 9975 1850 50  0000 L CNN
F 1 "100n" H 9975 1650 50  0000 L CNN
F 2 "Capacitors_SMD:C_0402_NoSilk" H 9988 1600 50  0001 C CNN
F 3 "" H 9950 1750 50  0001 C CNN
	1    9950 1750
	1    0    0    -1  
$EndComp
Text Label 9950 1450 0    60   ~ 0
DPH2_FGND
$Comp
L Device:C C5
U 1 1 5BE162C7
P 9700 1550
F 0 "C5" H 9725 1650 50  0000 L CNN
F 1 "100n" H 9725 1450 50  0000 L CNN
F 2 "Capacitors_SMD:C_0402_NoSilk" H 9738 1400 50  0001 C CNN
F 3 "" H 9700 1550 50  0001 C CNN
	1    9700 1550
	1    0    0    -1  
$EndComp
Text Label 9700 1250 0    60   ~ 0
DPH2_SGND
$Comp
L Device:C C8
U 1 1 5BE1646E
P 9950 3650
F 0 "C8" H 9975 3750 50  0000 L CNN
F 1 "100n" H 9975 3550 50  0000 L CNN
F 2 "Capacitors_SMD:C_0402_NoSilk" H 9988 3500 50  0001 C CNN
F 3 "" H 9950 3650 50  0001 C CNN
	1    9950 3650
	1    0    0    -1  
$EndComp
Text Label 9950 3350 0    60   ~ 0
DP2_FGND
$Comp
L Device:C C6
U 1 1 5BE1647C
P 9700 3450
F 0 "C6" H 9725 3550 50  0000 L CNN
F 1 "100n" H 9725 3350 50  0000 L CNN
F 2 "Capacitors_SMD:C_0402_NoSilk" H 9738 3300 50  0001 C CNN
F 3 "" H 9700 3450 50  0001 C CNN
	1    9700 3450
	1    0    0    -1  
$EndComp
Text Label 9700 3150 0    60   ~ 0
DP2_SGND
$Comp
L Device:C C12
U 1 1 5BE1676D
P 13050 3650
F 0 "C12" H 13075 3750 50  0000 L CNN
F 1 "100n" H 13075 3550 50  0000 L CNN
F 2 "Capacitors_SMD:C_0402_NoSilk" H 13088 3500 50  0001 C CNN
F 3 "" H 13050 3650 50  0001 C CNN
	1    13050 3650
	1    0    0    -1  
$EndComp
Text Label 13050 3350 0    60   ~ 0
DP3_FGND
$Comp
L Device:C C10
U 1 1 5BE1677B
P 12800 3450
F 0 "C10" H 12825 3550 50  0000 L CNN
F 1 "100n" H 12825 3350 50  0000 L CNN
F 2 "Capacitors_SMD:C_0402_NoSilk" H 12838 3300 50  0001 C CNN
F 3 "" H 12800 3450 50  0001 C CNN
	1    12800 3450
	1    0    0    -1  
$EndComp
Text Label 12800 3150 0    60   ~ 0
DP3_SGND
$Comp
L Device:C C16
U 1 1 5BE16C79
P 16150 3650
F 0 "C16" H 16175 3750 50  0000 L CNN
F 1 "100n" H 16175 3550 50  0000 L CNN
F 2 "Capacitors_SMD:C_0402_NoSilk" H 16188 3500 50  0001 C CNN
F 3 "" H 16150 3650 50  0001 C CNN
	1    16150 3650
	1    0    0    -1  
$EndComp
Text Label 16150 3350 0    60   ~ 0
DP4_FGND
$Comp
L Device:C C14
U 1 1 5BE16C87
P 15900 3450
F 0 "C14" H 15925 3550 50  0000 L CNN
F 1 "100n" H 15925 3350 50  0000 L CNN
F 2 "Capacitors_SMD:C_0402_NoSilk" H 15938 3300 50  0001 C CNN
F 3 "" H 15900 3450 50  0001 C CNN
	1    15900 3450
	1    0    0    -1  
$EndComp
Text Label 15900 3150 0    60   ~ 0
DP4_SGND
$Comp
L Device:C C15
U 1 1 5BE16D64
P 16150 1750
F 0 "C15" H 16175 1850 50  0000 L CNN
F 1 "100n" H 16175 1650 50  0000 L CNN
F 2 "Capacitors_SMD:C_0402_NoSilk" H 16188 1600 50  0001 C CNN
F 3 "" H 16150 1750 50  0001 C CNN
	1    16150 1750
	1    0    0    -1  
$EndComp
Text Label 16150 1450 0    60   ~ 0
DPH4_FGND
$Comp
L Device:C C13
U 1 1 5BE16D72
P 15900 1550
F 0 "C13" H 15925 1650 50  0000 L CNN
F 1 "100n" H 15925 1450 50  0000 L CNN
F 2 "Capacitors_SMD:C_0402_NoSilk" H 15938 1400 50  0001 C CNN
F 3 "" H 15900 1550 50  0001 C CNN
	1    15900 1550
	1    0    0    -1  
$EndComp
Text Label 15900 1250 0    60   ~ 0
DPH4_SGND
$Comp
L Device:C C11
U 1 1 5BE16E76
P 13050 1750
F 0 "C11" H 13075 1850 50  0000 L CNN
F 1 "100n" H 13075 1650 50  0000 L CNN
F 2 "Capacitors_SMD:C_0402_NoSilk" H 13088 1600 50  0001 C CNN
F 3 "" H 13050 1750 50  0001 C CNN
	1    13050 1750
	1    0    0    -1  
$EndComp
Text Label 13050 1450 0    60   ~ 0
DPH3_FGND
$Comp
L Device:C C9
U 1 1 5BE16E84
P 12800 1550
F 0 "C9" H 12825 1650 50  0000 L CNN
F 1 "100n" H 12825 1450 50  0000 L CNN
F 2 "Capacitors_SMD:C_0402_NoSilk" H 12838 1400 50  0001 C CNN
F 3 "" H 12800 1550 50  0001 C CNN
	1    12800 1550
	1    0    0    -1  
$EndComp
Text Label 12800 1250 0    60   ~ 0
DPH3_SGND
$Comp
L solder_pad:Solder_Pad U3
U 1 1 5BE2A0E9
P 1350 1900
F 0 "U3" H 1400 2050 59  0000 C CNN
F 1 "Solder_Pad" H 1400 2150 59  0000 C CNN
F 2 "Library:Power_Pad" H 2200 2300 59  0001 C CNN
F 3 "" H 2200 2300 59  0001 C CNN
	1    1350 1900
	-1   0    0    1   
$EndComp
Text Label 1800 1900 2    60   ~ 0
GND
$Comp
L solder_pad:Solder_Pad U4
U 1 1 5BE2A156
P 1350 2400
F 0 "U4" H 1400 2550 59  0000 C CNN
F 1 "Solder_Pad" H 1400 2650 59  0000 C CNN
F 2 "Library:Power_Pad" H 2200 2800 59  0001 C CNN
F 3 "" H 2200 2800 59  0001 C CNN
	1    1350 2400
	-1   0    0    1   
$EndComp
Text Label 1800 2400 2    60   ~ 0
GND
$Comp
L solder_pad:Solder_Pad U5
U 1 1 5BE2A278
P 1350 2850
F 0 "U5" H 1400 3000 59  0000 C CNN
F 1 "Solder_Pad" H 1400 3100 59  0000 C CNN
F 2 "Library:Power_Pad" H 2200 3250 59  0001 C CNN
F 3 "" H 2200 3250 59  0001 C CNN
	1    1350 2850
	-1   0    0    1   
$EndComp
Text Label 1800 2850 2    60   ~ 0
GND
$Comp
L solder_pad:Solder_Pad U8
U 1 1 5BE2A2E9
P 3500 1900
F 0 "U8" H 3550 2050 59  0000 C CNN
F 1 "Solder_Pad" H 3550 2150 59  0000 C CNN
F 2 "Library:Power_Pad" H 4350 2300 59  0001 C CNN
F 3 "" H 4350 2300 59  0001 C CNN
	1    3500 1900
	1    0    0    -1  
$EndComp
Text Label 3050 1900 0    60   ~ 0
VIN_RAW
$Comp
L solder_pad:Solder_Pad U9
U 1 1 5BE2A35E
P 3500 2400
F 0 "U9" H 3550 2550 59  0000 C CNN
F 1 "Solder_Pad" H 3550 2650 59  0000 C CNN
F 2 "Library:Power_Pad" H 4350 2800 59  0001 C CNN
F 3 "" H 4350 2800 59  0001 C CNN
	1    3500 2400
	1    0    0    -1  
$EndComp
Text Label 3050 2400 0    60   ~ 0
VIN_RAW
$Comp
L solder_pad:Solder_Pad U10
U 1 1 5BE2A3D2
P 3500 2850
F 0 "U10" H 3550 3000 59  0000 C CNN
F 1 "Solder_Pad" H 3550 3100 59  0000 C CNN
F 2 "Library:Power_Pad" H 4350 3250 59  0001 C CNN
F 3 "" H 4350 3250 59  0001 C CNN
	1    3500 2850
	1    0    0    -1  
$EndComp
Text Label 3050 2850 0    60   ~ 0
VIN_RAW
Text Label 1950 4350 0    60   ~ 0
L1_HV
Text Label 2000 4000 0    60   ~ 0
L1_HV
Text Label 2000 3700 0    60   ~ 0
L1_HV_RET
Text Label 2150 4500 0    60   ~ 0
FE2_HV
Text Label 3550 4000 2    60   ~ 0
FE1_HV
Text Label 3550 3700 2    60   ~ 0
FE1_HV_RET
Text Label 1950 7250 0    60   ~ 0
FE1_NTC
Text Label 3700 7250 2    60   ~ 0
FE1_NTC_RET
$Comp
L pinheader_1x4:PinHeader_1x4 PH1
U 1 1 5BE0CF84
P 1650 6200
F 0 "PH1" H 1650 6700 60  0000 C CNN
F 1 "PinHeader_1x4" H 1650 5850 60  0000 C CNN
F 2 "Pin_Headers:Pin_Header_Straight_1x04_Pitch2.54mm" H 1650 6200 60  0001 C CNN
F 3 "" H 1650 6200 60  0001 C CNN
	1    1650 6200
	1    0    0    -1  
$EndComp
Text Label 700  5900 0    60   ~ 0
FE1_MUX
Text Label 700  6050 0    60   ~ 0
FE1_VIN
Text Label 700  6200 0    60   ~ 0
FE2_MUX
Text Label 700  6350 0    60   ~ 0
FE2_VIN
$Comp
L pinheader_1x4:PinHeader_1x4 PH2
U 1 1 5BE0DA9E
P 1650 7150
F 0 "PH2" H 1650 7650 60  0000 C CNN
F 1 "PinHeader_1x4" H 1650 6800 60  0000 C CNN
F 2 "Pin_Headers:Pin_Header_Straight_1x04_Pitch2.54mm" H 1650 7150 60  0001 C CNN
F 3 "" H 1650 7150 60  0001 C CNN
	1    1650 7150
	1    0    0    -1  
$EndComp
Text Label 700  6850 0    60   ~ 0
FE3_MUX
Text Label 700  7000 0    60   ~ 0
FE3_VIN
Text Label 700  7150 0    60   ~ 0
FE4_MUX
Text Label 700  7300 0    60   ~ 0
FE4_VIN
Text Label 6000 8150 2    60   ~ 0
FE1_DO_0_N
Text Label 4350 8150 0    60   ~ 0
DP1_DO_0_N
Text Label 6000 8250 2    60   ~ 0
FE1_DO_0_P
Text Label 4350 8250 0    60   ~ 0
DP1_DO_0_P
Text Label 9300 8150 2    60   ~ 0
FE2_DO_1_N
Text Label 7650 8150 0    60   ~ 0
DP2_DO_1_N
Text Label 9300 8250 2    60   ~ 0
FE2_DO_1_P
Text Label 7650 8250 0    60   ~ 0
DP2_DO_1_P
Text Label 9300 8350 2    60   ~ 0
FE2_DO_2_N
Text Label 7650 8350 0    60   ~ 0
DP2_DO_2_N
Text Label 9300 8450 2    60   ~ 0
FE2_DO_2_P
Text Label 7650 8450 0    60   ~ 0
DP2_DO_2_P
Text Label 9300 8550 2    60   ~ 0
FE2_DO_3_N
Text Label 7650 8550 0    60   ~ 0
DP2_DO_3_N
Text Label 9300 8650 2    60   ~ 0
FE2_DO_3_P
Text Label 7650 8650 0    60   ~ 0
DP2_DO_3_P
Text Label 12400 8150 2    60   ~ 0
FE3_DO_1_N
Text Label 10750 8150 0    60   ~ 0
DP3_DO_1_N
Text Label 12400 8250 2    60   ~ 0
FE3_DO_1_P
Text Label 10750 8250 0    60   ~ 0
DP3_DO_1_P
Text Label 12400 8350 2    60   ~ 0
FE3_DO_2_N
Text Label 10750 8350 0    60   ~ 0
DP3_DO_2_N
Text Label 12400 8450 2    60   ~ 0
FE3_DO_2_P
Text Label 10750 8450 0    60   ~ 0
DP3_DO_2_P
Text Label 12400 8550 2    60   ~ 0
FE3_DO_3_N
Text Label 10750 8550 0    60   ~ 0
DP3_DO_3_N
Text Label 12400 8650 2    60   ~ 0
FE3_DO_3_P
Text Label 10750 8650 0    60   ~ 0
DP3_DO_3_P
Text Label 15500 8150 2    60   ~ 0
FE4_DO_1_N
Text Label 13850 8150 0    60   ~ 0
DP4_DO_1_N
Text Label 15500 8250 2    60   ~ 0
FE4_DO_1_P
Text Label 13850 8250 0    60   ~ 0
DP4_DO_1_P
Text Label 15500 8350 2    60   ~ 0
FE4_DO_2_N
Text Label 13850 8350 0    60   ~ 0
DP4_DO_2_N
Text Label 15500 8450 2    60   ~ 0
FE4_DO_2_P
Text Label 13850 8450 0    60   ~ 0
DP4_DO_2_P
Text Label 15500 8550 2    60   ~ 0
FE4_DO_3_N
Text Label 13850 8550 0    60   ~ 0
DP4_DO_3_N
Text Label 15500 8650 2    60   ~ 0
FE4_DO_3_P
Text Label 13850 8650 0    60   ~ 0
DP4_DO_3_P
Text Label 7650 2400 1    60   ~ 0
DPH2_FGND
Text Label 7950 2400 1    60   ~ 0
DPH2_FGND
Text Label 8250 2400 1    60   ~ 0
DPH2_FGND
Text Label 8550 2400 1    60   ~ 0
DPH2_FGND
Wire Wire Line
	5850 4950 6350 4950
Wire Wire Line
	5850 5150 6350 5150
Wire Wire Line
	5850 5350 6350 5350
Wire Wire Line
	5850 5550 6350 5550
Wire Wire Line
	5850 5750 6350 5750
Wire Wire Line
	5850 5950 6350 5950
Wire Wire Line
	5850 6150 6350 6150
Wire Wire Line
	5850 6350 6350 6350
Wire Wire Line
	5850 6550 6350 6550
Wire Wire Line
	5850 6750 6350 6750
Wire Wire Line
	5850 6950 6350 6950
Wire Wire Line
	5850 7150 6350 7150
Wire Wire Line
	5850 7350 6350 7350
Wire Wire Line
	5850 7550 6350 7550
Wire Wire Line
	5850 7750 6350 7750
Wire Wire Line
	4050 4650 4550 4650
Wire Wire Line
	4050 5050 4550 5050
Wire Wire Line
	4050 5250 4550 5250
Wire Wire Line
	4050 5450 4550 5450
Wire Wire Line
	4050 5650 4550 5650
Wire Wire Line
	4050 5850 4550 5850
Wire Wire Line
	4050 6050 4550 6050
Wire Wire Line
	4050 6250 4550 6250
Wire Wire Line
	4050 6450 4550 6450
Wire Wire Line
	4050 6650 4550 6650
Wire Wire Line
	4050 6850 4550 6850
Wire Wire Line
	4050 7050 4550 7050
Wire Wire Line
	4050 7250 4550 7250
Wire Wire Line
	4050 7450 4550 7450
Wire Wire Line
	4050 7650 4550 7650
Wire Wire Line
	4050 7850 4550 7850
Wire Wire Line
	4250 1750 4250 2400
Wire Wire Line
	4450 1750 4450 2400
Wire Wire Line
	4550 1750 4550 2400
Wire Wire Line
	4750 1750 4750 2400
Wire Wire Line
	4850 1750 4850 2400
Wire Wire Line
	4950 1750 4950 2400
Wire Wire Line
	5050 1750 5050 2400
Wire Wire Line
	5150 1750 5150 2400
Wire Wire Line
	5250 1750 5250 2400
Wire Wire Line
	5350 1750 5350 2400
Wire Wire Line
	5750 1750 5750 2250
Wire Wire Line
	5850 1750 5850 2400
Wire Wire Line
	4250 3650 4250 4200
Wire Wire Line
	4350 3650 4350 4200
Wire Wire Line
	4450 3650 4450 4200
Wire Wire Line
	4550 3650 4550 4200
Wire Wire Line
	4650 3650 4650 4200
Wire Wire Line
	4750 3650 4750 4200
Wire Wire Line
	4850 3650 4850 4200
Wire Wire Line
	4950 3650 4950 4200
Wire Wire Line
	5050 3650 5050 4200
Wire Wire Line
	5150 3650 5150 4200
Wire Wire Line
	5250 3650 5250 4200
Wire Wire Line
	5350 3650 5350 4200
Wire Wire Line
	5450 3650 5450 4200
Wire Wire Line
	5550 3650 5550 4200
Wire Wire Line
	5650 3650 5650 4200
Wire Wire Line
	5750 3650 5750 4200
Wire Wire Line
	5850 3650 5850 4200
Wire Wire Line
	6750 3950 6750 3800
Wire Wire Line
	6500 1100 6600 1100
Wire Wire Line
	6500 3000 6600 3000
Wire Wire Line
	1200 3800 1700 3800
Wire Wire Line
	1200 3700 1700 3700
Wire Wire Line
	2700 1200 2950 1200
Wire Wire Line
	2700 1300 2950 1300
Wire Wire Line
	1850 1200 2100 1200
Wire Wire Line
	1850 1300 2100 1300
Wire Wire Line
	1550 1050 1800 1050
Wire Wire Line
	1550 1450 1800 1450
Wire Wire Line
	3050 1050 3300 1050
Wire Wire Line
	3050 1450 3300 1450
Wire Wire Line
	9150 4950 9650 4950
Wire Wire Line
	9150 5150 9650 5150
Wire Wire Line
	9150 5350 9650 5350
Wire Wire Line
	9150 5550 9650 5550
Wire Wire Line
	9150 5750 9650 5750
Wire Wire Line
	9150 5950 9650 5950
Wire Wire Line
	9150 6150 9650 6150
Wire Wire Line
	9150 6350 9650 6350
Wire Wire Line
	9150 6550 9650 6550
Wire Wire Line
	9150 6750 9650 6750
Wire Wire Line
	9150 6950 9650 6950
Wire Wire Line
	9150 7150 9650 7150
Wire Wire Line
	9150 7350 9650 7350
Wire Wire Line
	9150 7550 9650 7550
Wire Wire Line
	9150 7750 9650 7750
Wire Wire Line
	7350 4650 7850 4650
Wire Wire Line
	7350 5050 7850 5050
Wire Wire Line
	7350 5250 7850 5250
Wire Wire Line
	7350 5450 7850 5450
Wire Wire Line
	7350 5650 7850 5650
Wire Wire Line
	7350 5850 7850 5850
Wire Wire Line
	7350 6050 7850 6050
Wire Wire Line
	7350 6250 7850 6250
Wire Wire Line
	7350 6450 7850 6450
Wire Wire Line
	7350 6650 7850 6650
Wire Wire Line
	7350 6850 7850 6850
Wire Wire Line
	7350 7050 7850 7050
Wire Wire Line
	7350 7250 7850 7250
Wire Wire Line
	7350 7450 7850 7450
Wire Wire Line
	7350 7650 7850 7650
Wire Wire Line
	7350 7850 7850 7850
Wire Wire Line
	12250 4950 12750 4950
Wire Wire Line
	12250 5150 12750 5150
Wire Wire Line
	12250 5350 12750 5350
Wire Wire Line
	12250 5550 12750 5550
Wire Wire Line
	12250 5750 12750 5750
Wire Wire Line
	12250 5950 12750 5950
Wire Wire Line
	12250 6150 12750 6150
Wire Wire Line
	12250 6350 12750 6350
Wire Wire Line
	12250 6550 12750 6550
Wire Wire Line
	12250 6750 12750 6750
Wire Wire Line
	12250 6950 12750 6950
Wire Wire Line
	12250 7150 12750 7150
Wire Wire Line
	12250 7350 12750 7350
Wire Wire Line
	12250 7550 12750 7550
Wire Wire Line
	12250 7750 12750 7750
Wire Wire Line
	10450 4650 10950 4650
Wire Wire Line
	10450 5050 10950 5050
Wire Wire Line
	10450 5250 10950 5250
Wire Wire Line
	10450 5450 10950 5450
Wire Wire Line
	10450 5650 10950 5650
Wire Wire Line
	10450 5850 10950 5850
Wire Wire Line
	10450 6050 10950 6050
Wire Wire Line
	10450 6250 10950 6250
Wire Wire Line
	10450 6450 10950 6450
Wire Wire Line
	10450 6650 10950 6650
Wire Wire Line
	10450 6850 10950 6850
Wire Wire Line
	10450 7050 10950 7050
Wire Wire Line
	10450 7250 10950 7250
Wire Wire Line
	10450 7450 10950 7450
Wire Wire Line
	10450 7650 10950 7650
Wire Wire Line
	10450 7850 10950 7850
Wire Wire Line
	15350 4950 15850 4950
Wire Wire Line
	15350 5150 15850 5150
Wire Wire Line
	15350 5350 15850 5350
Wire Wire Line
	15350 5550 15850 5550
Wire Wire Line
	15350 5750 15850 5750
Wire Wire Line
	15350 5950 15850 5950
Wire Wire Line
	15350 6150 15850 6150
Wire Wire Line
	15350 6350 15850 6350
Wire Wire Line
	15350 6550 15850 6550
Wire Wire Line
	15350 6750 15850 6750
Wire Wire Line
	15350 6950 15850 6950
Wire Wire Line
	15350 7150 15850 7150
Wire Wire Line
	15350 7350 15850 7350
Wire Wire Line
	15350 7550 15850 7550
Wire Wire Line
	15350 7750 15850 7750
Wire Wire Line
	13550 4650 14050 4650
Wire Wire Line
	13550 5050 14050 5050
Wire Wire Line
	13550 5250 14050 5250
Wire Wire Line
	13550 5450 14050 5450
Wire Wire Line
	13550 5650 14050 5650
Wire Wire Line
	13550 5850 14050 5850
Wire Wire Line
	13550 6050 14050 6050
Wire Wire Line
	13550 6250 14050 6250
Wire Wire Line
	13550 6450 14050 6450
Wire Wire Line
	13550 6650 14050 6650
Wire Wire Line
	13550 6850 14050 6850
Wire Wire Line
	13550 7050 14050 7050
Wire Wire Line
	13550 7250 14050 7250
Wire Wire Line
	13550 7450 14050 7450
Wire Wire Line
	13550 7650 14050 7650
Wire Wire Line
	13550 7850 14050 7850
Wire Wire Line
	5650 1750 5650 2400
Wire Wire Line
	7550 1750 7550 2400
Wire Wire Line
	7750 1750 7750 2400
Wire Wire Line
	7850 1750 7850 2400
Wire Wire Line
	8050 1750 8050 2400
Wire Wire Line
	8150 1750 8150 2400
Wire Wire Line
	8350 1750 8350 2400
Wire Wire Line
	8450 1750 8450 2400
Wire Wire Line
	8650 1750 8650 2400
Wire Wire Line
	9050 1750 9050 2250
Wire Wire Line
	9150 1750 9150 2400
Wire Wire Line
	7550 3650 7550 4200
Wire Wire Line
	7650 3650 7650 4200
Wire Wire Line
	7750 3650 7750 4200
Wire Wire Line
	7850 3650 7850 4200
Wire Wire Line
	7950 3650 7950 4200
Wire Wire Line
	8050 3650 8050 4200
Wire Wire Line
	8150 3650 8150 4200
Wire Wire Line
	8250 3650 8250 4200
Wire Wire Line
	8350 3650 8350 4200
Wire Wire Line
	8450 3650 8450 4200
Wire Wire Line
	8550 3650 8550 4200
Wire Wire Line
	8650 3650 8650 4200
Wire Wire Line
	8750 3650 8750 4200
Wire Wire Line
	8850 3650 8850 4200
Wire Wire Line
	8950 3650 8950 4200
Wire Wire Line
	9050 3650 9050 4200
Wire Wire Line
	9150 3650 9150 4200
Wire Wire Line
	9800 1100 9900 1100
Wire Wire Line
	9800 3000 9900 3000
Wire Wire Line
	8950 1750 8950 2400
Wire Wire Line
	10650 1750 10650 2400
Wire Wire Line
	10750 1750 10750 2400
Wire Wire Line
	10850 1750 10850 2400
Wire Wire Line
	10950 1750 10950 2400
Wire Wire Line
	11050 1750 11050 2400
Wire Wire Line
	11150 1750 11150 2400
Wire Wire Line
	11250 1750 11250 2400
Wire Wire Line
	11350 1750 11350 2400
Wire Wire Line
	11450 1750 11450 2400
Wire Wire Line
	11550 1750 11550 2400
Wire Wire Line
	11650 1750 11650 2400
Wire Wire Line
	11750 1750 11750 2400
Wire Wire Line
	12150 1750 12150 2250
Wire Wire Line
	12250 1750 12250 2400
Wire Wire Line
	10650 3650 10650 4200
Wire Wire Line
	10750 3650 10750 4200
Wire Wire Line
	10850 3650 10850 4200
Wire Wire Line
	10950 3650 10950 4200
Wire Wire Line
	11050 3650 11050 4200
Wire Wire Line
	11150 3650 11150 4200
Wire Wire Line
	11250 3650 11250 4200
Wire Wire Line
	11350 3650 11350 4200
Wire Wire Line
	11450 3650 11450 4200
Wire Wire Line
	11550 3650 11550 4200
Wire Wire Line
	11650 3650 11650 4200
Wire Wire Line
	11750 3650 11750 4200
Wire Wire Line
	11850 3650 11850 4200
Wire Wire Line
	11950 3650 11950 4200
Wire Wire Line
	12050 3650 12050 4200
Wire Wire Line
	12150 3650 12150 4200
Wire Wire Line
	12250 3650 12250 4200
Wire Wire Line
	12900 1100 13000 1100
Wire Wire Line
	12900 3000 13000 3000
Wire Wire Line
	12050 1750 12050 2400
Wire Wire Line
	13750 1750 13750 2400
Wire Wire Line
	13850 1750 13850 2400
Wire Wire Line
	13950 1750 13950 2400
Wire Wire Line
	14050 1750 14050 2400
Wire Wire Line
	14150 1750 14150 2400
Wire Wire Line
	14250 1750 14250 2400
Wire Wire Line
	14350 1750 14350 2400
Wire Wire Line
	14450 1750 14450 2400
Wire Wire Line
	14550 1750 14550 2400
Wire Wire Line
	14650 1750 14650 2400
Wire Wire Line
	14750 1750 14750 2400
Wire Wire Line
	14850 1750 14850 2400
Wire Wire Line
	15250 1750 15250 2250
Wire Wire Line
	15350 1750 15350 2400
Wire Wire Line
	13750 3650 13750 4200
Wire Wire Line
	13850 3650 13850 4200
Wire Wire Line
	13950 3650 13950 4200
Wire Wire Line
	14050 3650 14050 4200
Wire Wire Line
	14150 3650 14150 4200
Wire Wire Line
	14250 3650 14250 4200
Wire Wire Line
	14350 3650 14350 4200
Wire Wire Line
	14450 3650 14450 4200
Wire Wire Line
	14550 3650 14550 4200
Wire Wire Line
	14650 3650 14650 4200
Wire Wire Line
	14750 3650 14750 4200
Wire Wire Line
	14850 3650 14850 4200
Wire Wire Line
	14950 3650 14950 4200
Wire Wire Line
	15050 3650 15050 4200
Wire Wire Line
	15150 3650 15150 4200
Wire Wire Line
	15250 3650 15250 4200
Wire Wire Line
	15350 3650 15350 4200
Wire Wire Line
	16000 1100 16100 1100
Wire Wire Line
	16000 3000 16100 3000
Wire Wire Line
	15150 1750 15150 2400
Wire Wire Line
	6750 3500 6750 3350
Wire Wire Line
	6500 3300 6500 3150
Wire Wire Line
	6750 2050 6750 1900
Wire Wire Line
	6750 1600 6750 1450
Wire Wire Line
	9950 1600 9950 1450
Wire Wire Line
	9950 3950 9950 3800
Wire Wire Line
	9950 3500 9950 3350
Wire Wire Line
	13050 3950 13050 3800
Wire Wire Line
	13050 3500 13050 3350
Wire Wire Line
	16150 3950 16150 3800
Wire Wire Line
	16150 3500 16150 3350
Wire Wire Line
	16150 2050 16150 1900
Wire Wire Line
	16150 1600 16150 1450
Wire Wire Line
	13050 2050 13050 1900
Wire Wire Line
	13050 1600 13050 1450
Wire Wire Line
	6500 1850 6500 1700
Wire Wire Line
	9700 3750 9700 3600
Wire Wire Line
	9700 3300 9700 3150
Wire Wire Line
	9700 1400 9700 1250
Wire Wire Line
	9700 1850 9700 1700
Wire Wire Line
	12800 1400 12800 1250
Wire Wire Line
	12800 1700 12800 1850
Wire Wire Line
	12800 3300 12800 3150
Wire Wire Line
	12800 3600 12800 3750
Wire Wire Line
	15900 1400 15900 1250
Wire Wire Line
	15900 1700 15900 1850
Wire Wire Line
	15900 3750 15900 3600
Wire Wire Line
	15900 3300 15900 3150
Wire Wire Line
	1550 1900 1800 1900
Wire Wire Line
	1550 2400 1800 2400
Wire Wire Line
	1550 2850 1800 2850
Wire Wire Line
	3050 1900 3300 1900
Wire Wire Line
	3050 2400 3300 2400
Wire Wire Line
	3050 2850 3300 2850
Wire Wire Line
	2550 4000 2000 4000
Wire Wire Line
	2550 3700 2000 3700
Wire Wire Line
	2750 4500 2150 4500
Wire Wire Line
	2950 4000 3550 4000
Wire Wire Line
	2950 3700 3550 3700
Wire Wire Line
	2500 7250 1950 7250
Wire Wire Line
	3100 7250 3700 7250
Wire Wire Line
	4650 1750 4650 2400
Wire Wire Line
	4350 1750 4350 2400
Wire Wire Line
	6500 1250 6500 1400
Wire Wire Line
	2500 4350 1950 4350
Wire Wire Line
	1250 5900 700  5900
Wire Wire Line
	1250 6050 700  6050
Wire Wire Line
	1250 6200 700  6200
Wire Wire Line
	1250 6350 700  6350
Wire Wire Line
	1250 6850 700  6850
Wire Wire Line
	1250 7000 700  7000
Wire Wire Line
	1250 7150 700  7150
Wire Wire Line
	1250 7300 700  7300
Wire Wire Line
	4350 8150 6000 8150
Wire Wire Line
	4350 8250 6000 8250
Wire Wire Line
	7650 8150 9300 8150
Wire Wire Line
	7650 8250 9300 8250
Wire Wire Line
	7650 8350 9300 8350
Wire Wire Line
	7650 8450 9300 8450
Wire Wire Line
	7650 8550 9300 8550
Wire Wire Line
	7650 8650 9300 8650
Wire Wire Line
	10750 8150 12400 8150
Wire Wire Line
	10750 8250 12400 8250
Wire Wire Line
	10750 8350 12400 8350
Wire Wire Line
	10750 8450 12400 8450
Wire Wire Line
	10750 8550 12400 8550
Wire Wire Line
	10750 8650 12400 8650
Wire Wire Line
	13850 8150 15500 8150
Wire Wire Line
	13850 8250 15500 8250
Wire Wire Line
	13850 8350 15500 8350
Wire Wire Line
	13850 8450 15500 8450
Wire Wire Line
	13850 8550 15500 8550
Wire Wire Line
	13850 8650 15500 8650
Wire Wire Line
	7650 1750 7650 2400
Wire Wire Line
	7950 1750 7950 2400
Wire Wire Line
	8250 1750 8250 2400
Wire Wire Line
	8550 1750 8550 2400
$Comp
L pinheader_1x4:PinHeader_1x4 PH3
U 1 1 5BE446A7
P 1650 8100
F 0 "PH3" H 1650 8600 60  0000 C CNN
F 1 "PinHeader_1x4" H 1650 7750 60  0000 C CNN
F 2 "Pin_Headers:Pin_Header_Straight_1x04_Pitch2.54mm" H 1650 8100 60  0001 C CNN
F 3 "" H 1650 8100 60  0001 C CNN
	1    1650 8100
	1    0    0    -1  
$EndComp
Text Label 700  7800 0    60   ~ 0
GND
Text Label 700  7950 0    60   ~ 0
GND
Text Label 700  8100 0    60   ~ 0
GND
Text Label 700  8250 0    60   ~ 0
GND
Wire Wire Line
	1250 7800 700  7800
Wire Wire Line
	1250 7950 700  7950
Wire Wire Line
	1250 8100 700  8100
Wire Wire Line
	1250 8250 700  8250
$Comp
L pinheader_1x4:PinHeader_1x4 PH4
U 1 1 5BE4D171
P 1650 9050
F 0 "PH4" H 1650 9550 60  0000 C CNN
F 1 "PinHeader_1x4" H 1650 8700 60  0000 C CNN
F 2 "Pin_Headers:Pin_Header_Straight_1x04_Pitch2.54mm" H 1650 9050 60  0001 C CNN
F 3 "" H 1650 9050 60  0001 C CNN
	1    1650 9050
	1    0    0    -1  
$EndComp
Text Label 700  8750 0    60   ~ 0
GND
Text Label 700  8900 0    60   ~ 0
GND
Text Label 700  9050 0    60   ~ 0
GND
Text Label 700  9200 0    60   ~ 0
GND
Wire Wire Line
	1250 8750 700  8750
Wire Wire Line
	1250 8900 700  8900
Wire Wire Line
	1250 9050 700  9050
Wire Wire Line
	1250 9200 700  9200
$Comp
L pinheader_2x1:PinHeader_2x1 PH13
U 1 1 5BE4D649
P 2800 7200
F 0 "PH13" H 2800 7350 60  0000 C CNN
F 1 "PinHeader_2x1" H 2800 7000 60  0000 C CNN
F 2 "Pin_Headers:Pin_Header_Straight_2x01_Pitch2.54mm" H 2800 7200 60  0001 C CNN
F 3 "" H 2800 7200 60  0001 C CNN
	1    2800 7200
	1    0    0    -1  
$EndComp
Text Label 1950 7700 0    60   ~ 0
FE2_NTC
Text Label 3700 7700 2    60   ~ 0
FE2_NTC_RET
Wire Wire Line
	2500 7700 1950 7700
Wire Wire Line
	3100 7700 3700 7700
$Comp
L pinheader_2x1:PinHeader_2x1 PH14
U 1 1 5BE4E257
P 2800 7650
F 0 "PH14" H 2800 7800 60  0000 C CNN
F 1 "PinHeader_2x1" H 2800 7450 60  0000 C CNN
F 2 "Pin_Headers:Pin_Header_Straight_2x01_Pitch2.54mm" H 2800 7650 60  0001 C CNN
F 3 "" H 2800 7650 60  0001 C CNN
	1    2800 7650
	1    0    0    -1  
$EndComp
Text Label 1950 8150 0    60   ~ 0
FE3_NTC
Text Label 3700 8150 2    60   ~ 0
FE3_NTC_RET
Wire Wire Line
	2500 8150 1950 8150
Wire Wire Line
	3100 8150 3700 8150
$Comp
L pinheader_2x1:PinHeader_2x1 PH15
U 1 1 5BE4E526
P 2800 8100
F 0 "PH15" H 2800 8250 60  0000 C CNN
F 1 "PinHeader_2x1" H 2800 7900 60  0000 C CNN
F 2 "Pin_Headers:Pin_Header_Straight_2x01_Pitch2.54mm" H 2800 8100 60  0001 C CNN
F 3 "" H 2800 8100 60  0001 C CNN
	1    2800 8100
	1    0    0    -1  
$EndComp
Text Label 1950 8600 0    60   ~ 0
FE4_NTC
Text Label 3700 8600 2    60   ~ 0
FE4_NTC_RET
Wire Wire Line
	2500 8600 1950 8600
Wire Wire Line
	3100 8600 3700 8600
$Comp
L pinheader_2x1:PinHeader_2x1 PH16
U 1 1 5BE4E530
P 2800 8550
F 0 "PH16" H 2800 8700 60  0000 C CNN
F 1 "PinHeader_2x1" H 2800 8350 60  0000 C CNN
F 2 "Pin_Headers:Pin_Header_Straight_2x01_Pitch2.54mm" H 2800 8550 60  0001 C CNN
F 3 "" H 2800 8550 60  0001 C CNN
	1    2800 8550
	1    0    0    -1  
$EndComp
$Comp
L Connector:LEMO2 J2
U 1 1 5CCDA143
P 900 4200
F 0 "J2" H 900 4450 50  0000 C CNN
F 1 "LEMO2" H 900 4050 50  0000 C CNN
F 2 "Library:lemo_epb00250ntn" H 900 4250 50  0001 C CNN
F 3 "" H 900 4250 50  0001 C CNN
	1    900  4200
	-1   0    0    1   
$EndComp
Text Label 1700 4300 2    60   ~ 0
L2_HV
Text Label 1700 4200 2    60   ~ 0
L2_HV_RET
Wire Wire Line
	1200 4300 1700 4300
Wire Wire Line
	1200 4200 1700 4200
$Comp
L Connector:LEMO2 J3
U 1 1 5CD29688
P 900 4700
F 0 "J3" H 900 4950 50  0000 C CNN
F 1 "LEMO2" H 900 4550 50  0000 C CNN
F 2 "Library:lemo_epb00250ntn" H 900 4750 50  0001 C CNN
F 3 "" H 900 4750 50  0001 C CNN
	1    900  4700
	-1   0    0    1   
$EndComp
Text Label 1700 4800 2    60   ~ 0
L3_HV
Text Label 1700 4700 2    60   ~ 0
L3_HV_RET
Wire Wire Line
	1200 4800 1700 4800
Wire Wire Line
	1200 4700 1700 4700
$Comp
L Connector:LEMO2 J4
U 1 1 5CD29692
P 900 5200
F 0 "J4" H 900 5450 50  0000 C CNN
F 1 "LEMO2" H 900 5050 50  0000 C CNN
F 2 "Library:lemo_epb00250ntn" H 900 5250 50  0001 C CNN
F 3 "" H 900 5250 50  0001 C CNN
	1    900  5200
	-1   0    0    1   
$EndComp
Text Label 1700 5300 2    60   ~ 0
L4_HV
Text Label 1700 5200 2    60   ~ 0
L4_HV_RET
Wire Wire Line
	1200 5300 1700 5300
Wire Wire Line
	1200 5200 1700 5200
Text Label 3550 4350 2    60   ~ 0
L2_HV
Wire Wire Line
	3000 4350 3550 4350
Wire Wire Line
	9950 2050 9950 1900
$Comp
L display_port:DISPLAY_PORT DP2
U 1 1 5BDC8D47
P 5150 2800
F 0 "DP2" H 4550 3900 60  0000 C CNN
F 1 "DISPLAY_PORT" V 5300 2800 60  0000 C CNN
F 2 "Library:DP1RD20JQ1R400" H 5100 2800 60  0001 C CNN
F 3 "" H 5100 2800 60  0000 C CNN
	1    5150 2800
	0    -1   -1   0   
$EndComp
Wire Wire Line
	6500 3750 6500 3600
Text Label 6500 3750 1    60   ~ 0
GND
Text Label 6750 3950 1    60   ~ 0
GND
Text Label 6500 1850 1    60   ~ 0
GND
Text Label 6750 2050 1    60   ~ 0
GND
Text Label 9700 1850 1    60   ~ 0
GND
Text Label 9950 2050 1    60   ~ 0
GND
Text Label 9700 3750 1    60   ~ 0
GND
Text Label 9950 3950 1    60   ~ 0
GND
Text Label 12800 3750 1    60   ~ 0
GND
Text Label 13050 3950 1    60   ~ 0
GND
Text Label 12800 1850 1    60   ~ 0
GND
Text Label 13050 2050 1    60   ~ 0
GND
Text Label 16150 2050 1    60   ~ 0
GND
Text Label 15900 1850 1    60   ~ 0
GND
Text Label 15900 3750 1    60   ~ 0
GND
Text Label 16150 3950 1    60   ~ 0
GND
Wire Wire Line
	750  1300 750  1050
Text Label 750  1050 3    60   ~ 0
GND
$Comp
L Jumper:Jumper_3_Open JP7
U 1 1 5D5F05DF
P 2750 4350
F 0 "JP7" H 2750 4574 50  0000 C CNN
F 1 "Jumper_3_Open" H 2750 4483 50  0000 C CNN
F 2 "Pin_Headers:Pin_Header_Straight_1x03_Pitch2.54mm" H 2750 4350 50  0001 C CNN
F 3 "~" H 2750 4350 50  0001 C CNN
	1    2750 4350
	1    0    0    -1  
$EndComp
$Comp
L Jumper:Jumper_2_Open JP5
U 1 1 5D6200C6
P 2750 3700
F 0 "JP5" H 2750 3935 50  0000 C CNN
F 1 "Jumper_2_Open" H 2750 3844 50  0000 C CNN
F 2 "Pin_Headers:Pin_Header_Straight_1x02_Pitch2.54mm" H 2750 3700 50  0001 C CNN
F 3 "~" H 2750 3700 50  0001 C CNN
	1    2750 3700
	1    0    0    -1  
$EndComp
$Comp
L Jumper:Jumper_2_Open JP6
U 1 1 5D620362
P 2750 4000
F 0 "JP6" H 2750 4235 50  0000 C CNN
F 1 "Jumper_2_Open" H 2750 4144 50  0000 C CNN
F 2 "Pin_Headers:Pin_Header_Straight_1x02_Pitch2.54mm" H 2750 4000 50  0001 C CNN
F 3 "~" H 2750 4000 50  0001 C CNN
	1    2750 4000
	1    0    0    -1  
$EndComp
Text Label 1950 4800 0    60   ~ 0
L1_HV_RET
Text Label 2150 4950 0    60   ~ 0
FE2_HV_RET
Wire Wire Line
	2750 4950 2150 4950
Wire Wire Line
	2500 4800 1950 4800
Text Label 3550 4800 2    60   ~ 0
L2_HV_RET
Wire Wire Line
	3000 4800 3550 4800
$Comp
L Jumper:Jumper_3_Open JP8
U 1 1 5D871CBE
P 2750 4800
F 0 "JP8" H 2750 5024 50  0000 C CNN
F 1 "Jumper_3_Open" H 2750 4933 50  0000 C CNN
F 2 "Pin_Headers:Pin_Header_Straight_1x03_Pitch2.54mm" H 2750 4800 50  0001 C CNN
F 3 "~" H 2750 4800 50  0001 C CNN
	1    2750 4800
	1    0    0    -1  
$EndComp
Text Label 1950 5250 0    60   ~ 0
L1_HV
Text Label 2150 5400 0    60   ~ 0
FE3_HV
Wire Wire Line
	2750 5400 2150 5400
Wire Wire Line
	2500 5250 1950 5250
Text Label 3550 5250 2    60   ~ 0
L3_HV
Wire Wire Line
	3000 5250 3550 5250
$Comp
L Jumper:Jumper_3_Open JP9
U 1 1 5DB0DD0F
P 2750 5250
F 0 "JP9" H 2750 5474 50  0000 C CNN
F 1 "Jumper_3_Open" H 2750 5383 50  0000 C CNN
F 2 "Pin_Headers:Pin_Header_Straight_1x03_Pitch2.54mm" H 2750 5250 50  0001 C CNN
F 3 "~" H 2750 5250 50  0001 C CNN
	1    2750 5250
	1    0    0    -1  
$EndComp
Text Label 1950 5700 0    60   ~ 0
L1_HV_RET
Text Label 2150 5850 0    60   ~ 0
FE3_HV_RET
Wire Wire Line
	2750 5850 2150 5850
Wire Wire Line
	2500 5700 1950 5700
Text Label 3550 5700 2    60   ~ 0
L3_HV_RET
Wire Wire Line
	3000 5700 3550 5700
$Comp
L Jumper:Jumper_3_Open JP10
U 1 1 5DB0DD1B
P 2750 5700
F 0 "JP10" H 2750 5924 50  0000 C CNN
F 1 "Jumper_3_Open" H 2750 5833 50  0000 C CNN
F 2 "Pin_Headers:Pin_Header_Straight_1x03_Pitch2.54mm" H 2750 5700 50  0001 C CNN
F 3 "~" H 2750 5700 50  0001 C CNN
	1    2750 5700
	1    0    0    -1  
$EndComp
Text Label 1950 6150 0    60   ~ 0
L1_HV
Text Label 2150 6300 0    60   ~ 0
FE4_HV
Wire Wire Line
	2750 6300 2150 6300
Wire Wire Line
	2500 6150 1950 6150
Text Label 3550 6150 2    60   ~ 0
L4_HV
Wire Wire Line
	3000 6150 3550 6150
$Comp
L Jumper:Jumper_3_Open JP11
U 1 1 5DB371ED
P 2750 6150
F 0 "JP11" H 2750 6374 50  0000 C CNN
F 1 "Jumper_3_Open" H 2750 6283 50  0000 C CNN
F 2 "Pin_Headers:Pin_Header_Straight_1x03_Pitch2.54mm" H 2750 6150 50  0001 C CNN
F 3 "~" H 2750 6150 50  0001 C CNN
	1    2750 6150
	1    0    0    -1  
$EndComp
Text Label 1950 6600 0    60   ~ 0
L1_HV_RET
Text Label 2150 6750 0    60   ~ 0
FE4_HV_RET
Wire Wire Line
	2750 6750 2150 6750
Wire Wire Line
	2500 6600 1950 6600
Text Label 3550 6600 2    60   ~ 0
L4_HV_RET
Wire Wire Line
	3000 6600 3550 6600
$Comp
L Jumper:Jumper_3_Open JP12
U 1 1 5DB371F9
P 2750 6600
F 0 "JP12" H 2750 6824 50  0000 C CNN
F 1 "Jumper_3_Open" H 2750 6733 50  0000 C CNN
F 2 "Pin_Headers:Pin_Header_Straight_1x03_Pitch2.54mm" H 2750 6600 50  0001 C CNN
F 3 "~" H 2750 6600 50  0001 C CNN
	1    2750 6600
	1    0    0    -1  
$EndComp
Wire Notes Line
	950  650  3900 650 
Wire Notes Line
	3900 650  3900 3200
Wire Notes Line
	3900 3200 950  3200
Wire Notes Line
	950  3200 950  650 
Text Notes 1000 750  0    60   ~ 0
Power\n
Wire Notes Line
	600  3400 3700 3400
Wire Notes Line
	3700 3400 3700 6900
Wire Notes Line
	3700 6900 1800 6900
Wire Notes Line
	1800 6900 1800 5600
Wire Notes Line
	1800 5600 600  5600
Wire Notes Line
	600  5600 600  3400
Text Notes 1150 5550 0    60   ~ 0
High Voltage
$Comp
L Jumper:Jumper_3_Open JP19
U 1 1 5DC3F23D
P 8400 9550
F 0 "JP19" H 8400 9774 50  0000 C CNN
F 1 "Jumper_3_Open" H 8400 9683 50  0000 C CNN
F 2 "Pin_Headers:Pin_Header_Straight_1x03_Pitch2.54mm" H 8400 9550 50  0001 C CNN
F 3 "~" H 8400 9550 50  0001 C CNN
	1    8400 9550
	1    0    0    -1  
$EndComp
Wire Wire Line
	9200 9550 8650 9550
Wire Wire Line
	8300 9300 7800 9300
Wire Wire Line
	8400 9700 7800 9700
Text Label 7800 9700 0    60   ~ 0
FE2_DO_0_N
Text Label 9200 9550 2    60   ~ 0
DP2_DO_0_N
$Comp
L Jumper:Jumper_3_Open JP20
U 1 1 5DD9FCC9
P 8400 10250
F 0 "JP20" H 8400 10474 50  0000 C CNN
F 1 "Jumper_3_Open" H 8400 10383 50  0000 C CNN
F 2 "Pin_Headers:Pin_Header_Straight_1x03_Pitch2.54mm" H 8400 10250 50  0001 C CNN
F 3 "~" H 8400 10250 50  0001 C CNN
	1    8400 10250
	1    0    0    -1  
$EndComp
Wire Wire Line
	9200 10250 8650 10250
Wire Wire Line
	8150 10250 7650 10250
Wire Wire Line
	8400 10400 7800 10400
Text Label 7800 10400 0    60   ~ 0
FE2_DO_0_P
Text Label 9200 10250 2    60   ~ 0
DP2_DO_0_P
$Comp
L Jumper:Jumper_3_Open JP17
U 1 1 5DDCF35C
P 2800 9800
F 0 "JP17" H 2800 10024 50  0000 C CNN
F 1 "Jumper_3_Open" H 2800 9933 50  0000 C CNN
F 2 "Pin_Headers:Pin_Header_Straight_1x03_Pitch2.54mm" H 2800 9800 50  0001 C CNN
F 3 "~" H 2800 9800 50  0001 C CNN
	1    2800 9800
	1    0    0    -1  
$EndComp
Wire Wire Line
	3600 9800 3050 9800
Wire Wire Line
	2550 9800 2050 9800
Wire Wire Line
	2800 9950 2200 9950
Text Label 2200 9950 0    60   ~ 0
FE2_CMD_N
Text Label 2050 9800 0    60   ~ 0
FE_CMD_N
Text Label 3600 9800 2    60   ~ 0
DP2_CMD_N
$Comp
L Jumper:Jumper_3_Open JP18
U 1 1 5DDCF368
P 2800 10250
F 0 "JP18" H 2800 10474 50  0000 C CNN
F 1 "Jumper_3_Open" H 2800 10383 50  0000 C CNN
F 2 "Pin_Headers:Pin_Header_Straight_1x03_Pitch2.54mm" H 2800 10250 50  0001 C CNN
F 3 "~" H 2800 10250 50  0001 C CNN
	1    2800 10250
	1    0    0    -1  
$EndComp
Wire Wire Line
	3600 10250 3050 10250
Wire Wire Line
	2550 10250 2050 10250
Wire Wire Line
	2800 10400 2200 10400
Text Label 2200 10400 0    60   ~ 0
FE2_CMD_P
Text Label 2050 10250 0    60   ~ 0
FE_CMD_P
Text Label 3600 10250 2    60   ~ 0
DP2_CMD_P
$Comp
L Jumper:Jumper_3_Open JP23
U 1 1 5DE8C398
P 4400 9800
F 0 "JP23" H 4400 10024 50  0000 C CNN
F 1 "Jumper_3_Open" H 4400 9933 50  0000 C CNN
F 2 "Pin_Headers:Pin_Header_Straight_1x03_Pitch2.54mm" H 4400 9800 50  0001 C CNN
F 3 "~" H 4400 9800 50  0001 C CNN
	1    4400 9800
	1    0    0    -1  
$EndComp
Wire Wire Line
	5200 9800 4650 9800
Wire Wire Line
	4150 9800 3650 9800
Wire Wire Line
	4400 9950 3800 9950
Text Label 3800 9950 0    60   ~ 0
FE3_CMD_N
Text Label 3650 9800 0    60   ~ 0
FE_CMD_N
Text Label 5200 9800 2    60   ~ 0
DP3_CMD_N
$Comp
L Jumper:Jumper_3_Open JP24
U 1 1 5DE8C3A4
P 4400 10250
F 0 "JP24" H 4400 10474 50  0000 C CNN
F 1 "Jumper_3_Open" H 4400 10383 50  0000 C CNN
F 2 "Pin_Headers:Pin_Header_Straight_1x03_Pitch2.54mm" H 4400 10250 50  0001 C CNN
F 3 "~" H 4400 10250 50  0001 C CNN
	1    4400 10250
	1    0    0    -1  
$EndComp
Wire Wire Line
	5200 10250 4650 10250
Wire Wire Line
	4150 10250 3650 10250
Wire Wire Line
	4400 10400 3800 10400
Text Label 3800 10400 0    60   ~ 0
FE3_CMD_P
Text Label 3650 10250 0    60   ~ 0
FE_CMD_P
Text Label 5200 10250 2    60   ~ 0
DP3_CMD_P
$Comp
L Jumper:Jumper_3_Open JP29
U 1 1 5DEBD373
P 6000 9800
F 0 "JP29" H 6000 10024 50  0000 C CNN
F 1 "Jumper_3_Open" H 6000 9933 50  0000 C CNN
F 2 "Pin_Headers:Pin_Header_Straight_1x03_Pitch2.54mm" H 6000 9800 50  0001 C CNN
F 3 "~" H 6000 9800 50  0001 C CNN
	1    6000 9800
	1    0    0    -1  
$EndComp
Wire Wire Line
	6800 9800 6250 9800
Wire Wire Line
	5750 9800 5250 9800
Wire Wire Line
	6000 9950 5400 9950
Text Label 5400 9950 0    60   ~ 0
FE4_CMD_N
Text Label 5250 9800 0    60   ~ 0
FE_CMD_N
Text Label 6800 9800 2    60   ~ 0
DP4_CMD_N
$Comp
L Jumper:Jumper_3_Open JP30
U 1 1 5DEBD37F
P 6000 10250
F 0 "JP30" H 6000 10474 50  0000 C CNN
F 1 "Jumper_3_Open" H 6000 10383 50  0000 C CNN
F 2 "Pin_Headers:Pin_Header_Straight_1x03_Pitch2.54mm" H 6000 10250 50  0001 C CNN
F 3 "~" H 6000 10250 50  0001 C CNN
	1    6000 10250
	1    0    0    -1  
$EndComp
Wire Wire Line
	6800 10250 6250 10250
Wire Wire Line
	5750 10250 5250 10250
Wire Wire Line
	6000 10400 5400 10400
Text Label 5400 10400 0    60   ~ 0
FE4_CMD_P
Text Label 5250 10250 0    60   ~ 0
FE_CMD_P
Text Label 6800 10250 2    60   ~ 0
DP4_CMD_P
$Comp
L Jumper:Jumper_2_Open JP13
U 1 1 5DEF30A7
P 1250 9800
F 0 "JP13" H 1250 10035 50  0000 C CNN
F 1 "Jumper_2_Open" H 1250 9944 50  0000 C CNN
F 2 "Pin_Headers:Pin_Header_Straight_1x02_Pitch2.54mm" H 1250 9800 50  0001 C CNN
F 3 "~" H 1250 9800 50  0001 C CNN
	1    1250 9800
	1    0    0    -1  
$EndComp
Wire Wire Line
	1050 9800 550  9800
Text Label 550  9800 0    60   ~ 0
DP1_CMD_N
Wire Wire Line
	2000 9800 1450 9800
Text Label 2000 9800 2    60   ~ 0
FE_CMD_N
$Comp
L Jumper:Jumper_2_Open JP14
U 1 1 5DF5A046
P 1250 10100
F 0 "JP14" H 1250 10335 50  0000 C CNN
F 1 "Jumper_2_Open" H 1250 10244 50  0000 C CNN
F 2 "Pin_Headers:Pin_Header_Straight_1x02_Pitch2.54mm" H 1250 10100 50  0001 C CNN
F 3 "~" H 1250 10100 50  0001 C CNN
	1    1250 10100
	1    0    0    -1  
$EndComp
Wire Wire Line
	1050 10100 550  10100
Text Label 550  10100 0    60   ~ 0
DP1_CMD_P
Wire Wire Line
	2000 10100 1450 10100
Text Label 2000 10100 2    60   ~ 0
FE_CMD_P
Text Notes 550  10450 0    60   ~ 0
CMD Jumpers
$Comp
L Jumper:Jumper_3_Open JP25
U 1 1 5E02C81C
P 10000 9550
F 0 "JP25" H 10000 9774 50  0000 C CNN
F 1 "Jumper_3_Open" H 10000 9683 50  0000 C CNN
F 2 "Pin_Headers:Pin_Header_Straight_1x03_Pitch2.54mm" H 10000 9550 50  0001 C CNN
F 3 "~" H 10000 9550 50  0001 C CNN
	1    10000 9550
	1    0    0    -1  
$EndComp
Wire Wire Line
	10800 9550 10250 9550
Wire Wire Line
	9750 9550 9250 9550
Wire Wire Line
	10000 9700 9400 9700
Text Label 9400 9700 0    60   ~ 0
FE3_DO_0_N
Text Label 10800 9550 2    60   ~ 0
DP3_DO_0_N
$Comp
L Jumper:Jumper_3_Open JP26
U 1 1 5E02C828
P 10000 10250
F 0 "JP26" H 10000 10474 50  0000 C CNN
F 1 "Jumper_3_Open" H 10000 10383 50  0000 C CNN
F 2 "Pin_Headers:Pin_Header_Straight_1x03_Pitch2.54mm" H 10000 10250 50  0001 C CNN
F 3 "~" H 10000 10250 50  0001 C CNN
	1    10000 10250
	1    0    0    -1  
$EndComp
Wire Wire Line
	10800 10250 10250 10250
Wire Wire Line
	9750 10250 9250 10250
Wire Wire Line
	10000 10400 9400 10400
Text Label 9400 10400 0    60   ~ 0
FE3_DO_0_P
Text Label 10800 10250 2    60   ~ 0
DP3_DO_0_P
$Comp
L Jumper:Jumper_3_Open JP31
U 1 1 5E062B04
P 11600 9550
F 0 "JP31" H 11600 9774 50  0000 C CNN
F 1 "Jumper_3_Open" H 11600 9683 50  0000 C CNN
F 2 "Pin_Headers:Pin_Header_Straight_1x03_Pitch2.54mm" H 11600 9550 50  0001 C CNN
F 3 "~" H 11600 9550 50  0001 C CNN
	1    11600 9550
	1    0    0    -1  
$EndComp
Wire Wire Line
	12400 9550 11850 9550
Wire Wire Line
	11350 9550 10850 9550
Text Label 12400 9550 2    60   ~ 0
DP4_DO_0_N
$Comp
L Jumper:Jumper_3_Open JP32
U 1 1 5E062B10
P 11600 10250
F 0 "JP32" H 11600 10474 50  0000 C CNN
F 1 "Jumper_3_Open" H 11600 10383 50  0000 C CNN
F 2 "Pin_Headers:Pin_Header_Straight_1x03_Pitch2.54mm" H 11600 10250 50  0001 C CNN
F 3 "~" H 11600 10250 50  0001 C CNN
	1    11600 10250
	1    0    0    -1  
$EndComp
Wire Wire Line
	12400 10250 11850 10250
Wire Wire Line
	11350 10250 10850 10250
Wire Wire Line
	11600 10400 11000 10400
Text Label 11000 10400 0    60   ~ 0
FE4_DO_0_P
Text Label 12400 10250 2    60   ~ 0
DP4_DO_0_P
$Comp
L Jumper:Jumper_3_Open JP15
U 1 1 5E09D942
P 7650 9300
F 0 "JP15" V 7696 9386 50  0000 L CNN
F 1 "Jumper_3_Open" V 7605 9386 50  0000 L CNN
F 2 "Pin_Headers:Pin_Header_Straight_1x03_Pitch2.54mm" H 7650 9300 50  0001 C CNN
F 3 "~" H 7650 9300 50  0001 C CNN
	1    7650 9300
	0    -1   -1   0   
$EndComp
Text Label 7800 9300 0    60   ~ 0
DP1_DO_1_N
Wire Wire Line
	7650 9050 7050 9050
Text Label 7050 9050 0    60   ~ 0
FE1_DO_1_N
Wire Wire Line
	7650 9550 8150 9550
Wire Wire Line
	8300 10000 7800 10000
$Comp
L Jumper:Jumper_3_Open JP16
U 1 1 5E3BBBAC
P 7650 10000
F 0 "JP16" V 7696 10086 50  0000 L CNN
F 1 "Jumper_3_Open" V 7605 10086 50  0000 L CNN
F 2 "Pin_Headers:Pin_Header_Straight_1x03_Pitch2.54mm" H 7650 10000 50  0001 C CNN
F 3 "~" H 7650 10000 50  0001 C CNN
	1    7650 10000
	0    -1   -1   0   
$EndComp
Text Label 7800 10000 0    60   ~ 0
DP1_DO_1_P
Wire Wire Line
	7650 9750 7050 9750
Text Label 7050 9750 0    60   ~ 0
FE1_DO_1_P
Wire Wire Line
	9900 10000 9400 10000
$Comp
L Jumper:Jumper_3_Open JP22
U 1 1 5E42F19A
P 9250 10000
F 0 "JP22" V 9296 10086 50  0000 L CNN
F 1 "Jumper_3_Open" V 9205 10086 50  0000 L CNN
F 2 "Pin_Headers:Pin_Header_Straight_1x03_Pitch2.54mm" H 9250 10000 50  0001 C CNN
F 3 "~" H 9250 10000 50  0001 C CNN
	1    9250 10000
	0    -1   -1   0   
$EndComp
Text Label 9400 10000 0    60   ~ 0
DP1_DO_2_P
Wire Wire Line
	9250 9750 8650 9750
Text Label 8650 9750 0    60   ~ 0
FE1_DO_2_P
Wire Wire Line
	9900 9300 9400 9300
$Comp
L Jumper:Jumper_3_Open JP21
U 1 1 5E4A3B6D
P 9250 9300
F 0 "JP21" V 9296 9386 50  0000 L CNN
F 1 "Jumper_3_Open" V 9205 9386 50  0000 L CNN
F 2 "Pin_Headers:Pin_Header_Straight_1x03_Pitch2.54mm" H 9250 9300 50  0001 C CNN
F 3 "~" H 9250 9300 50  0001 C CNN
	1    9250 9300
	0    -1   -1   0   
$EndComp
Text Label 9400 9300 0    60   ~ 0
DP1_DO_2_N
Wire Wire Line
	9250 9050 8650 9050
Text Label 8650 9050 0    60   ~ 0
FE1_DO_2_N
Wire Wire Line
	11500 9300 11000 9300
$Comp
L Jumper:Jumper_3_Open JP27
U 1 1 5E519DC3
P 10850 9300
F 0 "JP27" V 10896 9386 50  0000 L CNN
F 1 "Jumper_3_Open" V 10805 9386 50  0000 L CNN
F 2 "Pin_Headers:Pin_Header_Straight_1x03_Pitch2.54mm" H 10850 9300 50  0001 C CNN
F 3 "~" H 10850 9300 50  0001 C CNN
	1    10850 9300
	0    -1   -1   0   
$EndComp
Text Label 11000 9300 0    60   ~ 0
DP1_DO_3_N
Wire Wire Line
	10850 9050 10250 9050
Text Label 10250 9050 0    60   ~ 0
FE1_DO_3_N
Wire Wire Line
	11500 10000 11000 10000
Text Label 11000 10000 0    60   ~ 0
DP1_DO_3_P
Wire Wire Line
	10850 9750 10250 9750
Text Label 10250 9750 0    60   ~ 0
FE1_DO_3_P
Text Notes 6950 10450 0    60   ~ 0
Data Jumpers
Wire Notes Line
	6900 8950 6900 10500
Wire Notes Line
	6900 10500 12450 10500
Wire Notes Line
	12450 10500 12450 8950
Wire Notes Line
	12450 8950 6900 8950
Text Label 4350 8450 0    60   ~ 0
DP1_CMD_N
Text Label 4350 8550 0    60   ~ 0
DP1_CMD_P
Wire Wire Line
	4350 8450 6000 8450
Wire Wire Line
	4350 8550 6000 8550
Text Label 6000 8450 2    60   ~ 0
FE1_CMD_N
Text Label 6000 8550 2    60   ~ 0
FE1_CMD_P
$Comp
L Jumper:Jumper_3_Open JP28
U 1 1 5E5912F5
P 10850 10000
F 0 "JP28" V 10896 10086 50  0000 L CNN
F 1 "Jumper_3_Open" V 10805 10086 50  0000 L CNN
F 2 "Pin_Headers:Pin_Header_Straight_1x03_Pitch2.54mm" H 10850 10000 50  0001 C CNN
F 3 "~" H 10850 10000 50  0001 C CNN
	1    10850 10000
	0    -1   -1   0   
$EndComp
Wire Wire Line
	11600 9700 11000 9700
Text Label 11000 9700 0    60   ~ 0
FE4_DO_0_N
Wire Notes Line
	500  9500 6850 9500
Wire Notes Line
	500  10500 6850 10500
Wire Notes Line
	6850 9500 6850 10500
Wire Notes Line
	500  9500 500  10500
$EndSCHEMATC
