<?xml version="1.0" encoding="UTF-8"?>
<!DOCTYPE svg PUBLIC '-//W3C//DTD SVG 1.0//EN'
          'http://www.w3.org/TR/2001/REC-SVG-20010904/DTD/svg10.dtd'>
<svg fill-opacity="1" xmlns:xlink="http://www.w3.org/1999/xlink" color-rendering="auto" color-interpolation="auto" text-rendering="auto" stroke="black" stroke-linecap="square" width="1510" stroke-miterlimit="10" shape-rendering="auto" stroke-opacity="1" fill="black" stroke-dasharray="none" font-weight="normal" stroke-width="1" viewBox="30 300 1510 670" height="670" xmlns="http://www.w3.org/2000/svg" font-family="'Dialog'" font-style="normal" stroke-linejoin="miter" font-size="12px" stroke-dashoffset="0" image-rendering="auto"
><!--Generated by the Batik Graphics2D SVG Generator--><defs id="genericDefs"
  /><g
  ><defs id="defs1"
    ><clipPath clipPathUnits="userSpaceOnUse" id="clipPath1"
      ><path d="M0 0 L2147483647 0 L2147483647 2147483647 L0 2147483647 L0 0 Z"
      /></clipPath
      ><clipPath clipPathUnits="userSpaceOnUse" id="clipPath2"
      ><path d="M0 0 L0 630 L960 630 L960 0 Z"
      /></clipPath
      ><clipPath clipPathUnits="userSpaceOnUse" id="clipPath3"
      ><path d="M0 0 L0 270 L900 270 L900 0 Z"
      /></clipPath
      ><clipPath clipPathUnits="userSpaceOnUse" id="clipPath4"
      ><path d="M0 0 L0 260 L220 260 L220 0 Z"
      /></clipPath
      ><clipPath clipPathUnits="userSpaceOnUse" id="clipPath5"
      ><path d="M0 0 L0 310 L700 310 L700 0 Z"
      /></clipPath
      ><clipPath clipPathUnits="userSpaceOnUse" id="clipPath6"
      ><path d="M0 0 L0 130 L350 130 L350 0 Z"
      /></clipPath
      ><clipPath clipPathUnits="userSpaceOnUse" id="clipPath7"
      ><path d="M0 0 L0 40 L130 40 L130 0 Z"
      /></clipPath
      ><clipPath clipPathUnits="userSpaceOnUse" id="clipPath8"
      ><path d="M0 0 L0 40 L120 40 L120 0 Z"
      /></clipPath
      ><clipPath clipPathUnits="userSpaceOnUse" id="clipPath9"
      ><path d="M0 0 L0 40 L110 40 L110 0 Z"
      /></clipPath
      ><clipPath clipPathUnits="userSpaceOnUse" id="clipPath10"
      ><path d="M0 0 L0 80 L130 80 L130 0 Z"
      /></clipPath
      ><clipPath clipPathUnits="userSpaceOnUse" id="clipPath11"
      ><path d="M0 0 L0 40 L170 40 L170 0 Z"
      /></clipPath
      ><clipPath clipPathUnits="userSpaceOnUse" id="clipPath12"
      ><path d="M0 0 L0 40 L100 40 L100 0 Z"
      /></clipPath
      ><clipPath clipPathUnits="userSpaceOnUse" id="clipPath13"
      ><path d="M0 0 L0 60 L110 60 L110 0 Z"
      /></clipPath
      ><clipPath clipPathUnits="userSpaceOnUse" id="clipPath14"
      ><path d="M0 0 L0 90 L130 90 L130 0 Z"
      /></clipPath
      ><clipPath clipPathUnits="userSpaceOnUse" id="clipPath15"
      ><path d="M0 0 L0 40 L160 40 L160 0 Z"
      /></clipPath
      ><clipPath clipPathUnits="userSpaceOnUse" id="clipPath16"
      ><path d="M0 0 L0 40 L200 40 L200 0 Z"
      /></clipPath
      ><clipPath clipPathUnits="userSpaceOnUse" id="clipPath17"
      ><path d="M0 0 L0 40 L140 40 L140 0 Z"
      /></clipPath
      ><clipPath clipPathUnits="userSpaceOnUse" id="clipPath18"
      ><path d="M0 0 L0 90 L160 90 L160 0 Z"
      /></clipPath
      ><clipPath clipPathUnits="userSpaceOnUse" id="clipPath19"
      ><path d="M0 0 L0 70 L110 70 L110 0 Z"
      /></clipPath
      ><clipPath clipPathUnits="userSpaceOnUse" id="clipPath20"
      ><path d="M0 0 L0 60 L140 60 L140 0 Z"
      /></clipPath
      ><clipPath clipPathUnits="userSpaceOnUse" id="clipPath21"
      ><path d="M0 0 L0 110 L170 110 L170 0 Z"
      /></clipPath
      ><clipPath clipPathUnits="userSpaceOnUse" id="clipPath22"
      ><path d="M0 0 L0 150 L160 150 L160 0 Z"
      /></clipPath
      ><clipPath clipPathUnits="userSpaceOnUse" id="clipPath23"
      ><path d="M0 0 L0 60 L30 60 L30 0 Z"
      /></clipPath
      ><clipPath clipPathUnits="userSpaceOnUse" id="clipPath24"
      ><path d="M0 0 L0 100 L100 100 L100 0 Z"
      /></clipPath
      ><clipPath clipPathUnits="userSpaceOnUse" id="clipPath25"
      ><path d="M0 0 L0 70 L50 70 L50 0 Z"
      /></clipPath
      ><clipPath clipPathUnits="userSpaceOnUse" id="clipPath26"
      ><path d="M0 0 L0 70 L160 70 L160 0 Z"
      /></clipPath
      ><clipPath clipPathUnits="userSpaceOnUse" id="clipPath27"
      ><path d="M0 0 L0 100 L90 100 L90 0 Z"
      /></clipPath
      ><clipPath clipPathUnits="userSpaceOnUse" id="clipPath28"
      ><path d="M0 0 L0 150 L30 150 L30 0 Z"
      /></clipPath
      ><clipPath clipPathUnits="userSpaceOnUse" id="clipPath29"
      ><path d="M0 0 L0 30 L80 30 L80 0 Z"
      /></clipPath
      ><clipPath clipPathUnits="userSpaceOnUse" id="clipPath30"
      ><path d="M0 0 L0 120 L60 120 L60 0 Z"
      /></clipPath
      ><clipPath clipPathUnits="userSpaceOnUse" id="clipPath31"
      ><path d="M0 0 L0 30 L140 30 L140 0 Z"
      /></clipPath
      ><clipPath clipPathUnits="userSpaceOnUse" id="clipPath32"
      ><path d="M0 0 L0 210 L30 210 L30 0 Z"
      /></clipPath
      ><clipPath clipPathUnits="userSpaceOnUse" id="clipPath33"
      ><path d="M0 0 L0 90 L750 90 L750 0 Z"
      /></clipPath
      ><clipPath clipPathUnits="userSpaceOnUse" id="clipPath34"
      ><path d="M0 0 L0 100 L30 100 L30 0 Z"
      /></clipPath
      ><clipPath clipPathUnits="userSpaceOnUse" id="clipPath35"
      ><path d="M0 0 L0 50 L110 50 L110 0 Z"
      /></clipPath
      ><clipPath clipPathUnits="userSpaceOnUse" id="clipPath36"
      ><path d="M0 0 L0 260 L30 260 L30 0 Z"
      /></clipPath
      ><clipPath clipPathUnits="userSpaceOnUse" id="clipPath37"
      ><path d="M0 0 L0 240 L200 240 L200 0 Z"
      /></clipPath
      ><clipPath clipPathUnits="userSpaceOnUse" id="clipPath38"
      ><path d="M0 0 L0 30 L160 30 L160 0 Z"
      /></clipPath
      ><clipPath clipPathUnits="userSpaceOnUse" id="clipPath39"
      ><path d="M0 0 L0 240 L30 240 L30 0 Z"
      /></clipPath
      ><clipPath clipPathUnits="userSpaceOnUse" id="clipPath40"
      ><path d="M0 0 L0 130 L90 130 L90 0 Z"
      /></clipPath
      ><clipPath clipPathUnits="userSpaceOnUse" id="clipPath41"
      ><path d="M0 0 L0 70 L90 70 L90 0 Z"
      /></clipPath
      ><clipPath clipPathUnits="userSpaceOnUse" id="clipPath42"
      ><path d="M0 0 L0 50 L90 50 L90 0 Z"
      /></clipPath
      ><clipPath clipPathUnits="userSpaceOnUse" id="clipPath43"
      ><path d="M0 0 L0 110 L90 110 L90 0 Z"
      /></clipPath
      ><clipPath clipPathUnits="userSpaceOnUse" id="clipPath44"
      ><path d="M0 0 L0 30 L50 30 L50 0 Z"
      /></clipPath
      ><clipPath clipPathUnits="userSpaceOnUse" id="clipPath45"
      ><path d="M0 0 L0 60 L80 60 L80 0 Z"
      /></clipPath
      ><clipPath clipPathUnits="userSpaceOnUse" id="clipPath46"
      ><path d="M0 0 L0 60 L280 60 L280 0 Z"
      /></clipPath
      ><clipPath clipPathUnits="userSpaceOnUse" id="clipPath47"
      ><path d="M0 0 L0 60 L270 60 L270 0 Z"
      /></clipPath
      ><clipPath clipPathUnits="userSpaceOnUse" id="clipPath48"
      ><path d="M0 0 L0 30 L170 30 L170 0 Z"
      /></clipPath
      ><clipPath clipPathUnits="userSpaceOnUse" id="clipPath49"
      ><path d="M0 0 L0 60 L100 60 L100 0 Z"
      /></clipPath
    ></defs
    ><g fill="rgb(255,255,0)" fill-opacity="0.4902" transform="translate(190,320)" stroke-opacity="0.4902" stroke="rgb(255,255,0)"
    ><path d="M0.5 0.5 L384.5 0.5 L384.5 21.4688 L959 21.4688 L959 629 L0.5 629 Z" stroke="none" clip-path="url(#clipPath2)"
    /></g
    ><g transform="translate(190,320)"
    ><path fill="none" d="M0.5 0.5 L384.5 0.5 L384.5 21.4688 L959 21.4688 L959 629 L0.5 629 Z" clip-path="url(#clipPath2)"
      /><path fill="none" d="M0.5 21.4688 L384.5 21.4688" clip-path="url(#clipPath2)"
      /><text x="5" font-size="14px" y="15.9688" clip-path="url(#clipPath2)" font-family="sans-serif" stroke="none" xml:space="preserve"
      >UIPlugins</text
    ></g
    ><g fill="rgb(255,0,255)" fill-opacity="0.4902" transform="translate(210,670)" stroke-opacity="0.4902" stroke="rgb(255,0,255)"
    ><path d="M0.5 0.5 L360.5 0.5 L360.5 21.4688 L899 21.4688 L899 269 L0.5 269 Z" stroke="none" clip-path="url(#clipPath3)"
    /></g
    ><g transform="translate(210,670)"
    ><path fill="none" d="M0.5 0.5 L360.5 0.5 L360.5 21.4688 L899 21.4688 L899 269 L0.5 269 Z" clip-path="url(#clipPath3)"
      /><path fill="none" d="M0.5 21.4688 L360.5 21.4688" clip-path="url(#clipPath3)"
      /><text x="5" font-size="14px" y="15.9688" clip-path="url(#clipPath3)" font-family="sans-serif" stroke="none" xml:space="preserve"
      >utils</text
    ></g
    ><g fill="rgb(255,0,0)" fill-opacity="0.4902" transform="translate(920,350)" stroke-opacity="0.4902" stroke="rgb(255,0,0)"
    ><path d="M0.5 0.5 L88.5 0.5 L88.5 21.4688 L219 21.4688 L219 259 L0.5 259 Z" stroke="none" clip-path="url(#clipPath4)"
    /></g
    ><g transform="translate(920,350)"
    ><path fill="none" d="M0.5 0.5 L88.5 0.5 L88.5 21.4688 L219 21.4688 L219 259 L0.5 259 Z" clip-path="url(#clipPath4)"
      /><path fill="none" d="M0.5 21.4688 L88.5 21.4688" clip-path="url(#clipPath4)"
      /><text x="5" font-size="14px" y="15.9688" clip-path="url(#clipPath4)" font-family="sans-serif" stroke="none" xml:space="preserve"
      >io</text
    ></g
    ><g fill="rgb(255,165,0)" fill-opacity="0.4902" transform="translate(210,350)" stroke-opacity="0.4902" stroke="rgb(255,165,0)"
    ><path d="M0.5 0.5 L280.5 0.5 L280.5 21.4688 L699 21.4688 L699 309 L0.5 309 Z" stroke="none" clip-path="url(#clipPath5)"
    /></g
    ><g transform="translate(210,350)"
    ><path fill="none" d="M0.5 0.5 L280.5 0.5 L280.5 21.4688 L699 21.4688 L699 309 L0.5 309 Z" clip-path="url(#clipPath5)"
      /><path fill="none" d="M0.5 21.4688 L280.5 21.4688" clip-path="url(#clipPath5)"
      /><text x="5" font-size="14px" y="15.9688" clip-path="url(#clipPath5)" font-family="sans-serif" stroke="none" xml:space="preserve"
      >interface</text
    ></g
    ><g fill="rgb(0,255,0)" fill-opacity="0.4902" transform="translate(1170,410)" stroke-opacity="0.4902" stroke="rgb(0,255,0)"
    ><path d="M0.5 0.5 L140.5 0.5 L140.5 21.4688 L349 21.4688 L349 129 L0.5 129 Z" stroke="none" clip-path="url(#clipPath6)"
    /></g
    ><g transform="translate(1170,410)"
    ><path fill="none" d="M0.5 0.5 L140.5 0.5 L140.5 21.4688 L349 21.4688 L349 129 L0.5 129 Z" clip-path="url(#clipPath6)"
      /><path fill="none" d="M0.5 21.4688 L140.5 21.4688" clip-path="url(#clipPath6)"
      /><text x="5" font-size="14px" y="15.9688" clip-path="url(#clipPath6)" font-family="sans-serif" stroke="none" xml:space="preserve"
      >SurveyLib</text
    ></g
    ><g fill="rgb(255,0,255)" fill-opacity="0.4902" transform="translate(220,810)" stroke-opacity="0.4902" stroke="rgb(255,0,255)"
    ><rect x="0.5" width="128.5" height="38.5" y="0.5" clip-path="url(#clipPath7)" stroke="none"
    /></g
    ><g transform="translate(220,810)"
    ><rect fill="none" x="0.5" width="128.5" height="38.5" y="0.5" clip-path="url(#clipPath7)"
      /><text x="17" font-size="14px" y="17.9688" clip-path="url(#clipPath7)" font-family="sans-serif" stroke="none" font-weight="bold" xml:space="preserve"
      >TextStatusBar</text
      ><path fill="none" d="M1 23.9688 L129 23.9688" clip-path="url(#clipPath7)"
      /><path fill="none" d="M1 28.9688 L129 28.9688" clip-path="url(#clipPath7)"
    /></g
    ><g fill="rgb(255,0,255)" fill-opacity="0.4902" transform="translate(360,890)" stroke-opacity="0.4902" stroke="rgb(255,0,255)"
    ><rect x="0.5" width="128.5" height="38.5" y="0.5" clip-path="url(#clipPath7)" stroke="none"
    /></g
    ><g transform="translate(360,890)"
    ><rect fill="none" x="0.5" width="128.5" height="38.5" y="0.5" clip-path="url(#clipPath7)"
      /><text x="27" font-size="14px" y="17.9688" clip-path="url(#clipPath7)" font-family="sans-serif" stroke="none" font-weight="bold" xml:space="preserve"
      >TextSearch</text
      ><path fill="none" d="M1 23.9688 L129 23.9688" clip-path="url(#clipPath7)"
      /><path fill="none" d="M1 28.9688 L129 28.9688" clip-path="url(#clipPath7)"
    /></g
    ><g fill="rgb(255,0,255)" fill-opacity="0.4902" transform="translate(220,890)" stroke-opacity="0.4902" stroke="rgb(255,0,255)"
    ><rect x="0.5" width="128.5" height="38.5" y="0.5" clip-path="url(#clipPath7)" stroke="none"
    /></g
    ><g transform="translate(220,890)"
    ><rect fill="none" x="0.5" width="128.5" height="38.5" y="0.5" clip-path="url(#clipPath7)"
      /><text x="17" font-size="14px" y="17.9688" clip-path="url(#clipPath7)" font-family="sans-serif" stroke="none" font-weight="bold" xml:space="preserve"
      >TextGoToLine</text
      ><path fill="none" d="M1 23.9688 L129 23.9688" clip-path="url(#clipPath7)"
      /><path fill="none" d="M1 28.9688 L129 28.9688" clip-path="url(#clipPath7)"
    /></g
    ><g fill="rgb(255,0,255)" fill-opacity="0.4902" transform="translate(290,700)" stroke-opacity="0.4902" stroke="rgb(255,0,255)"
    ><rect x="0.5" width="118.5" height="38.5" y="0.5" clip-path="url(#clipPath8)" stroke="none"
    /></g
    ><g transform="translate(290,700)"
    ><rect fill="none" x="0.5" width="118.5" height="38.5" y="0.5" clip-path="url(#clipPath8)"
      /><text x="6" font-size="14px" y="17.9688" clip-path="url(#clipPath8)" font-family="sans-serif" font-style="italic" stroke="none" xml:space="preserve"
      >TextEditorWidget</text
      ><path fill="none" d="M1 23.9688 L119 23.9688" clip-path="url(#clipPath8)"
      /><path fill="none" d="M1 28.9688 L119 28.9688" clip-path="url(#clipPath8)"
    /></g
    ><g fill="rgb(255,255,255)" fill-opacity="0" transform="translate(60,610)" stroke-opacity="0" stroke="rgb(255,255,255)"
    ><rect x="0.5" width="108.5" height="38.5" y="0.5" clip-path="url(#clipPath9)" stroke="none"
    /></g
    ><g transform="translate(60,610)"
    ><rect fill="none" x="0.5" width="108.5" height="38.5" y="0.5" clip-path="url(#clipPath9)"
      /><text x="13" font-size="14px" y="17.9688" clip-path="url(#clipPath9)" font-family="sans-serif" stroke="none" font-weight="bold" xml:space="preserve"
      >QTabWidget</text
      ><path fill="none" d="M1 23.9688 L109 23.9688" clip-path="url(#clipPath9)"
      /><path fill="none" d="M1 28.9688 L109 28.9688" clip-path="url(#clipPath9)"
    /></g
    ><g fill="rgb(255,255,255)" fill-opacity="0" transform="translate(50,580)" stroke-opacity="0" stroke="rgb(255,255,255)"
    ><path d="M0.5 0.5 L52.5 0.5 L52.5 21.4688 L129 21.4688 L129 79 L0.5 79 Z" stroke="none" clip-path="url(#clipPath10)"
    /></g
    ><g transform="translate(50,580)"
    ><path fill="none" d="M0.5 0.5 L52.5 0.5 L52.5 21.4688 L129 21.4688 L129 79 L0.5 79 Z" clip-path="url(#clipPath10)"
      /><path fill="none" d="M0.5 21.4688 L52.5 21.4688" clip-path="url(#clipPath10)"
      /><text x="5" font-size="14px" y="15.9688" clip-path="url(#clipPath10)" font-family="sans-serif" stroke="none" xml:space="preserve"
      >Qt</text
    ></g
    ><g fill="rgb(255,0,255)" fill-opacity="0.4902" transform="translate(470,700)" stroke-opacity="0.4902" stroke="rgb(255,0,255)"
    ><rect x="0.5" width="128.5" height="38.5" y="0.5" clip-path="url(#clipPath7)" stroke="none"
    /></g
    ><g transform="translate(470,700)"
    ><rect fill="none" x="0.5" width="128.5" height="38.5" y="0.5" clip-path="url(#clipPath7)"
      /><text x="8" font-size="14px" y="17.9688" clip-path="url(#clipPath7)" font-family="sans-serif" stroke="none" font-weight="bold" xml:space="preserve"
      >TextEditorConfig</text
      ><path fill="none" d="M1 23.9688 L129 23.9688" clip-path="url(#clipPath7)"
      /><path fill="none" d="M1 28.9688 L129 28.9688" clip-path="url(#clipPath7)"
    /></g
    ><g fill="rgb(255,0,255)" fill-opacity="0.4902" transform="translate(570,810)" stroke-opacity="0.4902" stroke="rgb(255,0,255)"
    ><rect x="0.5" width="168.5" height="38.5" y="0.5" clip-path="url(#clipPath11)" stroke="none"
    /></g
    ><g transform="translate(570,810)"
    ><rect fill="none" x="0.5" width="168.5" height="38.5" y="0.5" clip-path="url(#clipPath11)"
      /><text x="6" font-size="14px" y="17.9688" clip-path="url(#clipPath11)" font-family="sans-serif" stroke="none" font-weight="bold" xml:space="preserve"
      >TextEditorConfigObject</text
      ><path fill="none" d="M1 23.9688 L169 23.9688" clip-path="url(#clipPath11)"
      /><path fill="none" d="M1 28.9688 L169 28.9688" clip-path="url(#clipPath11)"
    /></g
    ><g fill="rgb(255,255,255)" fill-opacity="0" transform="translate(1180,880)" stroke-opacity="0" stroke="rgb(255,255,255)"
    ><rect x="0.5" width="128.5" height="38.5" y="0.5" clip-path="url(#clipPath7)" stroke="none"
    /></g
    ><g transform="translate(1180,880)"
    ><rect fill="none" x="0.5" width="128.5" height="38.5" y="0.5" clip-path="url(#clipPath7)"
      /><text x="22" font-size="14px" y="17.9688" clip-path="url(#clipPath7)" font-family="sans-serif" stroke="none" font-weight="bold" xml:space="preserve"
      >QsciScintilla</text
      ><path fill="none" d="M1 23.9688 L129 23.9688" clip-path="url(#clipPath7)"
      /><path fill="none" d="M1 28.9688 L129 28.9688" clip-path="url(#clipPath7)"
    /></g
    ><g fill="rgb(255,0,255)" fill-opacity="0.4902" transform="translate(360,810)" stroke-opacity="0.4902" stroke="rgb(255,0,255)"
    ><rect x="0.5" width="98.5" height="38.5" y="0.5" clip-path="url(#clipPath12)" stroke="none"
    /></g
    ><g transform="translate(360,810)"
    ><rect fill="none" x="0.5" width="98.5" height="38.5" y="0.5" clip-path="url(#clipPath12)"
      /><text x="15" font-size="14px" y="17.9688" clip-path="url(#clipPath12)" font-family="sans-serif" stroke="none" font-weight="bold" xml:space="preserve"
      >TextEditor</text
      ><path fill="none" d="M1 23.9688 L99 23.9688" clip-path="url(#clipPath12)"
      /><path fill="none" d="M1 28.9688 L99 28.9688" clip-path="url(#clipPath12)"
    /></g
    ><g fill="rgb(255,165,0)" fill-opacity="0.4902" transform="translate(630,570)" stroke-opacity="0.4902" stroke="rgb(255,165,0)"
    ><rect x="0.5" width="108.5" height="58.5" y="0.5" clip-path="url(#clipPath13)" stroke="none"
    /></g
    ><g transform="translate(630,570)"
    ><rect fill="none" x="0.5" width="108.5" height="58.5" y="0.5" clip-path="url(#clipPath13)"
      /><text x="20" font-size="14px" y="17.9688" clip-path="url(#clipPath13)" font-family="sans-serif" stroke="none" xml:space="preserve"
      >«interface»</text
    ></g
    ><g font-style="italic" font-size="14px" font-weight="bold" font-family="sans-serif" transform="translate(630,570)"
    ><text x="6" xml:space="preserve" y="33.9375" clip-path="url(#clipPath13)" stroke="none"
      >SConfigObject</text
      ><path fill="none" d="M1 39.9375 L109 39.9375" clip-path="url(#clipPath13)"
      /><path fill="none" d="M1 44.9375 L109 44.9375" clip-path="url(#clipPath13)"
    /></g
    ><g fill="rgb(255,0,255)" fill-opacity="0.4902" transform="translate(670,700)" stroke-opacity="0.4902" stroke="rgb(255,0,255)"
    ><rect x="0.5" width="128.5" height="88.5" y="0.5" clip-path="url(#clipPath14)" stroke="none"
    /></g
    ><g transform="translate(670,700)"
    ><rect fill="none" x="0.5" width="128.5" height="88.5" y="0.5" clip-path="url(#clipPath14)"
      /><text x="29" font-size="14px" y="17.9688" clip-path="url(#clipPath14)" font-family="sans-serif" stroke="none" xml:space="preserve"
      >«singleton»</text
      ><text x="8" font-size="14px" y="33.9375" clip-path="url(#clipPath14)" font-family="sans-serif" stroke="none" font-weight="bold" xml:space="preserve"
      >SettingsManager</text
      ><path fill="none" d="M1 39.9375 L129 39.9375" clip-path="url(#clipPath14)"
      /><text x="5" font-size="14px" y="54.9062" clip-path="url(#clipPath14)" font-family="sans-serif" stroke="none" xml:space="preserve"
      >+ copy()</text
      ><text x="5" font-size="14px" y="70.875" clip-path="url(#clipPath14)" font-family="sans-serif" stroke="none" xml:space="preserve"
      >+ paste()</text
      ><path fill="none" d="M1 76.875 L129 76.875" clip-path="url(#clipPath14)"
    /></g
    ><g fill="rgb(255,0,255)" fill-opacity="0.4902" transform="translate(750,810)" stroke-opacity="0.4902" stroke="rgb(255,0,255)"
    ><rect x="0.5" width="158.5" height="38.5" y="0.5" clip-path="url(#clipPath15)" stroke="none"
    /></g
    ><g transform="translate(750,810)"
    ><rect fill="none" x="0.5" width="158.5" height="38.5" y="0.5" clip-path="url(#clipPath15)"
      /><text x="5" font-size="14px" y="17.9688" clip-path="url(#clipPath15)" font-family="sans-serif" font-style="italic" stroke="none" xml:space="preserve"
      >ProcessLauncherObject</text
      ><path fill="none" d="M1 23.9688 L159 23.9688" clip-path="url(#clipPath15)"
      /><path fill="none" d="M1 28.9688 L159 28.9688" clip-path="url(#clipPath15)"
    /></g
    ><g fill="rgb(255,0,255)" fill-opacity="0.4902" transform="translate(970,700)" stroke-opacity="0.4902" stroke="rgb(255,0,255)"
    ><rect x="0.5" width="128.5" height="88.5" y="0.5" clip-path="url(#clipPath14)" stroke="none"
    /></g
    ><g transform="translate(970,700)"
    ><rect fill="none" x="0.5" width="128.5" height="88.5" y="0.5" clip-path="url(#clipPath14)"
      /><text x="29" font-size="14px" y="17.9688" clip-path="url(#clipPath14)" font-family="sans-serif" stroke="none" xml:space="preserve"
      >«singleton»</text
      ><text x="3" font-size="14px" y="33.9375" clip-path="url(#clipPath14)" font-family="sans-serif" stroke="none" font-weight="bold" xml:space="preserve"
      >ClipboardManager</text
      ><path fill="none" d="M1 39.9375 L129 39.9375" clip-path="url(#clipPath14)"
      /><text x="5" font-size="14px" y="54.9062" clip-path="url(#clipPath14)" font-family="sans-serif" stroke="none" xml:space="preserve"
      >+ copy()</text
      ><text x="5" font-size="14px" y="70.875" clip-path="url(#clipPath14)" font-family="sans-serif" stroke="none" xml:space="preserve"
      >+ paste()</text
      ><path fill="none" d="M1 76.875 L129 76.875" clip-path="url(#clipPath14)"
    /></g
    ><g fill="rgb(255,0,255)" fill-opacity="0.4902" transform="translate(920,810)" stroke-opacity="0.4902" stroke="rgb(255,0,255)"
    ><rect x="0.5" width="128.5" height="38.5" y="0.5" clip-path="url(#clipPath7)" stroke="none"
    /></g
    ><g transform="translate(920,810)"
    ><rect fill="none" x="0.5" width="128.5" height="38.5" y="0.5" clip-path="url(#clipPath7)"
      /><text x="33" font-size="14px" y="17.9688" clip-path="url(#clipPath7)" font-family="sans-serif" font-style="italic" stroke="none" xml:space="preserve"
      >TextLexer</text
      ><path fill="none" d="M1 23.9688 L129 23.9688" clip-path="url(#clipPath7)"
      /><path fill="none" d="M1 28.9688 L129 28.9688" clip-path="url(#clipPath7)"
    /></g
    ><g fill="rgb(255,255,255)" fill-opacity="0" transform="translate(1180,810)" stroke-opacity="0" stroke="rgb(255,255,255)"
    ><rect x="0.5" width="128.5" height="38.5" y="0.5" clip-path="url(#clipPath7)" stroke="none"
    /></g
    ><g transform="translate(1180,810)"
    ><rect fill="none" x="0.5" width="128.5" height="38.5" y="0.5" clip-path="url(#clipPath7)"
      /><text x="5" font-size="14px" y="17.9688" clip-path="url(#clipPath7)" font-family="sans-serif" stroke="none" font-weight="bold" xml:space="preserve"
      >QsciLexerCustom</text
      ><path fill="none" d="M1 23.9688 L129 23.9688" clip-path="url(#clipPath7)"
      /><path fill="none" d="M1 28.9688 L129 28.9688" clip-path="url(#clipPath7)"
    /></g
    ><g fill="rgb(255,0,0)" fill-opacity="0.4902" transform="translate(930,560)" stroke-opacity="0.4902" stroke="rgb(255,0,0)"
    ><rect x="0.5" width="198.5" height="38.5" y="0.5" clip-path="url(#clipPath16)" stroke="none"
    /></g
    ><g transform="translate(930,560)"
    ><rect fill="none" x="0.5" width="198.5" height="38.5" y="0.5" clip-path="url(#clipPath16)"
      /><text x="12" font-size="14px" y="17.9688" clip-path="url(#clipPath16)" font-family="sans-serif" font-style="italic" stroke="none" xml:space="preserve"
      >ShareablePointsListIOLexer</text
      ><path fill="none" d="M1 23.9688 L199 23.9688" clip-path="url(#clipPath16)"
      /><path fill="none" d="M1 28.9688 L199 28.9688" clip-path="url(#clipPath16)"
    /></g
    ><g fill="rgb(255,0,0)" fill-opacity="0.4902" transform="translate(930,500)" stroke-opacity="0.4902" stroke="rgb(255,0,0)"
    ><rect x="0.5" width="198.5" height="38.5" y="0.5" clip-path="url(#clipPath16)" stroke="none"
    /></g
    ><g transform="translate(930,500)"
    ><rect fill="none" x="0.5" width="198.5" height="38.5" y="0.5" clip-path="url(#clipPath16)"
      /><text x="10" font-size="14px" y="17.9688" clip-path="url(#clipPath16)" font-family="sans-serif" stroke="none" font-weight="bold" xml:space="preserve"
      >ShareablePointsListIOCSV</text
      ><path fill="none" d="M1 23.9688 L199 23.9688" clip-path="url(#clipPath16)"
      /><path fill="none" d="M1 28.9688 L199 28.9688" clip-path="url(#clipPath16)"
    /></g
    ><g fill="rgb(255,0,0)" fill-opacity="0.4902" transform="translate(930,440)" stroke-opacity="0.4902" stroke="rgb(255,0,0)"
    ><rect x="0.5" width="198.5" height="38.5" y="0.5" clip-path="url(#clipPath16)" stroke="none"
    /></g
    ><g transform="translate(930,440)"
    ><rect fill="none" x="0.5" width="198.5" height="38.5" y="0.5" clip-path="url(#clipPath16)"
      /><text x="5" font-size="14px" y="17.9688" clip-path="url(#clipPath16)" font-family="sans-serif" stroke="none" font-weight="bold" xml:space="preserve"
      >ShareablePointsListIOHTML</text
      ><path fill="none" d="M1 23.9688 L199 23.9688" clip-path="url(#clipPath16)"
      /><path fill="none" d="M1 28.9688 L199 28.9688" clip-path="url(#clipPath16)"
    /></g
    ><g fill="rgb(255,0,0)" fill-opacity="0.4902" transform="translate(930,380)" stroke-opacity="0.4902" stroke="rgb(255,0,0)"
    ><rect x="0.5" width="198.5" height="38.5" y="0.5" clip-path="url(#clipPath16)" stroke="none"
    /></g
    ><g transform="translate(930,380)"
    ><rect fill="none" x="0.5" width="198.5" height="38.5" y="0.5" clip-path="url(#clipPath16)"
      /><text x="8" font-size="14px" y="17.9688" clip-path="url(#clipPath16)" font-family="sans-serif" stroke="none" font-weight="bold" xml:space="preserve"
      >ShareablePointsListIOJson</text
      ><path fill="none" d="M1 23.9688 L199 23.9688" clip-path="url(#clipPath16)"
      /><path fill="none" d="M1 28.9688 L199 28.9688" clip-path="url(#clipPath16)"
    /></g
    ><g fill="rgb(0,255,0)" fill-opacity="0.4902" transform="translate(1370,460)" stroke-opacity="0.4902" stroke="rgb(0,255,0)"
    ><rect x="0.5" width="138.5" height="38.5" y="0.5" clip-path="url(#clipPath17)" stroke="none"
    /></g
    ><g transform="translate(1370,460)"
    ><rect fill="none" x="0.5" width="138.5" height="38.5" y="0.5" clip-path="url(#clipPath17)"
      /><text x="7" font-size="14px" y="17.9688" clip-path="url(#clipPath17)" font-family="sans-serif" font-style="italic" stroke="none" xml:space="preserve"
      >ShareablePointsList</text
      ><path fill="none" d="M1 23.9688 L139 23.9688" clip-path="url(#clipPath17)"
      /><path fill="none" d="M1 28.9688 L139 28.9688" clip-path="url(#clipPath17)"
    /></g
    ><g fill="rgb(0,255,0)" fill-opacity="0.4902" transform="translate(1190,440)" stroke-opacity="0.4902" stroke="rgb(0,255,0)"
    ><rect x="0.5" width="158.5" height="88.5" y="0.5" clip-path="url(#clipPath18)" stroke="none"
    /></g
    ><g transform="translate(1190,440)"
    ><rect fill="none" x="0.5" width="158.5" height="88.5" y="0.5" clip-path="url(#clipPath18)"
      /><text x="45" font-size="14px" y="17.9688" clip-path="url(#clipPath18)" font-family="sans-serif" stroke="none" xml:space="preserve"
      >«interface»</text
    ></g
    ><g font-style="italic" font-size="14px" font-weight="bold" font-family="sans-serif" transform="translate(1190,440)"
    ><text x="3" xml:space="preserve" y="33.9375" clip-path="url(#clipPath18)" stroke="none"
      >IShareablePointsListIO</text
      ><path fill="none" d="M1 39.9375 L159 39.9375" clip-path="url(#clipPath18)"
      /><text x="5" xml:space="preserve" y="54.9062" clip-path="url(#clipPath18)" font-weight="normal" stroke="none"
      >+ read() = 0</text
      ><text x="5" xml:space="preserve" y="70.875" clip-path="url(#clipPath18)" font-weight="normal" stroke="none"
      >+ write() = 0</text
      ><path fill="none" d="M1 76.875 L159 76.875" clip-path="url(#clipPath18)"
    /></g
    ><g fill="rgb(255,165,0)" fill-opacity="0.4902" transform="translate(260,400)" stroke-opacity="0.4902" stroke="rgb(255,165,0)"
    ><rect x="0.5" width="108.5" height="68.5" y="0.5" clip-path="url(#clipPath19)" stroke="none"
    /></g
    ><g transform="translate(260,400)"
    ><rect fill="none" x="0.5" width="108.5" height="68.5" y="0.5" clip-path="url(#clipPath19)"
      /><text x="5" font-size="14px" y="17.9688" clip-path="url(#clipPath19)" font-family="sans-serif" stroke="none" font-weight="bold" xml:space="preserve"
      >SPluginLoader</text
      ><path fill="none" d="M1 23.9688 L109 23.9688" clip-path="url(#clipPath19)"
      /><text x="5" font-size="14px" y="38.9375" clip-path="url(#clipPath19)" font-family="sans-serif" stroke="none" xml:space="preserve"
      >+ load()</text
      ><text x="5" font-size="14px" y="54.9062" clip-path="url(#clipPath19)" font-family="sans-serif" stroke="none" xml:space="preserve"
      >+ plugins()</text
      ><path fill="none" d="M1 60.9062 L109 60.9062" clip-path="url(#clipPath19)"
    /></g
    ><g fill="rgb(255,165,0)" fill-opacity="0.4902" transform="translate(220,610)" stroke-opacity="0.4902" stroke="rgb(255,165,0)"
    ><rect x="0.5" width="108.5" height="38.5" y="0.5" clip-path="url(#clipPath9)" stroke="none"
    /></g
    ><g transform="translate(220,610)"
    ><rect fill="none" x="0.5" width="108.5" height="38.5" y="0.5" clip-path="url(#clipPath9)"
      /><text x="11" font-size="14px" y="17.9688" clip-path="url(#clipPath9)" font-family="sans-serif" font-style="italic" stroke="none" xml:space="preserve"
      >STabInterface</text
      ><path fill="none" d="M1 23.9688 L109 23.9688" clip-path="url(#clipPath9)"
      /><path fill="none" d="M1 28.9688 L109 28.9688" clip-path="url(#clipPath9)"
    /></g
    ><g fill="rgb(255,165,0)" fill-opacity="0.4902" transform="translate(470,520)" stroke-opacity="0.4902" stroke="rgb(255,165,0)"
    ><rect x="0.5" width="138.5" height="58.5" y="0.5" clip-path="url(#clipPath20)" stroke="none"
    /></g
    ><g transform="translate(470,520)"
    ><rect fill="none" x="0.5" width="138.5" height="58.5" y="0.5" clip-path="url(#clipPath20)"
      /><text x="35" font-size="14px" y="17.9688" clip-path="url(#clipPath20)" font-family="sans-serif" stroke="none" xml:space="preserve"
      >«interface»</text
    ></g
    ><g font-style="italic" font-size="14px" font-weight="bold" font-family="sans-serif" transform="translate(470,520)"
    ><text x="19" xml:space="preserve" y="33.9375" clip-path="url(#clipPath20)" stroke="none"
      >SConfigWidget</text
      ><path fill="none" d="M1 39.9375 L139 39.9375" clip-path="url(#clipPath20)"
      /><path fill="none" d="M1 44.9375 L139 44.9375" clip-path="url(#clipPath20)"
    /></g
    ><g fill="rgb(255,165,0)" fill-opacity="0.4902" transform="translate(280,520)" stroke-opacity="0.4902" stroke="rgb(255,165,0)"
    ><rect x="0.5" width="138.5" height="58.5" y="0.5" clip-path="url(#clipPath20)" stroke="none"
    /></g
    ><g transform="translate(280,520)"
    ><rect fill="none" x="0.5" width="138.5" height="58.5" y="0.5" clip-path="url(#clipPath20)"
      /><text x="35" font-size="14px" y="17.9688" clip-path="url(#clipPath20)" font-family="sans-serif" stroke="none" xml:space="preserve"
      >«interface»</text
    ></g
    ><g font-style="italic" font-size="14px" font-weight="bold" font-family="sans-serif" transform="translate(280,520)"
    ><text x="9" xml:space="preserve" y="33.9375" clip-path="url(#clipPath20)" stroke="none"
      >SGraphicalWidget</text
      ><path fill="none" d="M1 39.9375 L139 39.9375" clip-path="url(#clipPath20)"
      /><path fill="none" d="M1 44.9375 L139 44.9375" clip-path="url(#clipPath20)"
    /></g
    ><g fill="rgb(255,165,0)" fill-opacity="0.4902" transform="translate(760,520)" stroke-opacity="0.4902" stroke="rgb(255,165,0)"
    ><rect x="0.5" width="138.5" height="58.5" y="0.5" clip-path="url(#clipPath20)" stroke="none"
    /></g
    ><g transform="translate(760,520)"
    ><rect fill="none" x="0.5" width="138.5" height="58.5" y="0.5" clip-path="url(#clipPath20)"
      /><text x="35" font-size="14px" y="17.9688" clip-path="url(#clipPath20)" font-family="sans-serif" stroke="none" xml:space="preserve"
      >«interface»</text
    ></g
    ><g font-style="italic" font-size="14px" font-weight="bold" font-family="sans-serif" transform="translate(760,520)"
    ><text x="18" xml:space="preserve" y="33.9375" clip-path="url(#clipPath20)" stroke="none"
      >SLaunchObject</text
      ><path fill="none" d="M1 39.9375 L139 39.9375" clip-path="url(#clipPath20)"
      /><path fill="none" d="M1 44.9375 L139 44.9375" clip-path="url(#clipPath20)"
    /></g
    ><g fill="rgb(255,165,0)" fill-opacity="0.4902" transform="translate(510,380)" stroke-opacity="0.4902" stroke="rgb(255,165,0)"
    ><rect x="0.5" width="168.5" height="108.5" y="0.5" clip-path="url(#clipPath21)" stroke="none"
    /></g
    ><g transform="translate(510,380)"
    ><rect fill="none" x="0.5" width="168.5" height="108.5" y="0.5" clip-path="url(#clipPath21)"
      /><text x="50" font-size="14px" y="17.9688" clip-path="url(#clipPath21)" font-family="sans-serif" stroke="none" xml:space="preserve"
      >«interface»</text
    ></g
    ><g font-style="italic" font-size="14px" font-weight="bold" font-family="sans-serif" transform="translate(510,380)"
    ><text x="30" xml:space="preserve" y="33.9375" clip-path="url(#clipPath21)" stroke="none"
      >SpluginInterface</text
      ><path fill="none" d="M1 39.9375 L169 39.9375" clip-path="url(#clipPath21)"
      /><text x="5" xml:space="preserve" y="54.9062" clip-path="url(#clipPath21)" font-weight="normal" stroke="none"
      >+ configInterface() = 0</text
      ><text x="5" xml:space="preserve" y="70.875" clip-path="url(#clipPath21)" font-weight="normal" stroke="none"
      >+ graphicalInterface() = 0</text
      ><text x="5" xml:space="preserve" y="86.8438" clip-path="url(#clipPath21)" font-weight="normal" stroke="none"
      >+ launchInterface() = 0</text
      ><path fill="none" d="M1 92.8438 L169 92.8438" clip-path="url(#clipPath21)"
    /></g
    ><g fill="rgb(255,255,255)" fill-opacity="0" transform="translate(1160,780)" stroke-opacity="0" stroke="rgb(255,255,255)"
    ><path d="M0.5 0.5 L86.7412 0.5 L86.7412 21.4688 L159 21.4688 L159 149 L0.5 149 Z" stroke="none" clip-path="url(#clipPath22)"
    /></g
    ><g transform="translate(1160,780)"
    ><path fill="none" d="M0.5 0.5 L86.7412 0.5 L86.7412 21.4688 L159 21.4688 L159 149 L0.5 149 Z" clip-path="url(#clipPath22)"
      /><path fill="none" d="M0.5 21.4688 L86.7412 21.4688" clip-path="url(#clipPath22)"
      /><text x="5" font-size="14px" y="15.9688" clip-path="url(#clipPath22)" font-family="sans-serif" stroke="none" xml:space="preserve"
      >QsciScintilla</text
    ></g
    ><g transform="translate(1230,840)"
    ><path fill="none" d="M10.5 11.5 L10.5 40.5" clip-path="url(#clipPath23)"
      /><path fill="none" d="M4 22.2583 L10.5 11 L17 22.2583" clip-path="url(#clipPath23)"
    /></g
    ><g transform="translate(270,730)"
    ><path fill="none" d="M80.5 11.5 L80.5 50.5" clip-path="url(#clipPath24)"
      /><path fill="none" d="M80.5 50.5 L10.5 50.5" clip-path="url(#clipPath24)"
      /><path fill="none" d="M10.5 50.5 L10.5 80.5" clip-path="url(#clipPath24)"
      /><path d="M74 22.2583 L80.5 11 L87 22.2583 L80.5 33.0167 Z" clip-path="url(#clipPath24)" stroke="none"
      /><path fill="none" d="M74 22.2583 L80.5 11 L87 22.2583 L80.5 33.0167 Z" clip-path="url(#clipPath24)"
    /></g
    ><g transform="translate(400,840)"
    ><path fill="none" d="M10.5 11.5 L10.5 40.5" clip-path="url(#clipPath25)"
      /><path fill="none" d="M10.5 40.5 L30.5 40.5" clip-path="url(#clipPath25)"
      /><path fill="none" d="M30.5 40.5 L30.5 50.5" clip-path="url(#clipPath25)"
      /><path d="M4 22.2583 L10.5 11 L17 22.2583 L10.5 33.0167 Z" clip-path="url(#clipPath25)" stroke="none"
      /><path fill="none" d="M4 22.2583 L10.5 11 L17 22.2583 L10.5 33.0167 Z" clip-path="url(#clipPath25)"
    /></g
    ><g transform="translate(270,840)"
    ><path fill="none" d="M140.5 11.5 L140.5 40.5" clip-path="url(#clipPath26)"
      /><path fill="none" d="M140.5 40.5 L10.5 40.5" clip-path="url(#clipPath26)"
      /><path fill="none" d="M10.5 40.5 L10.5 50.5" clip-path="url(#clipPath26)"
      /><path d="M134 22.2583 L140.5 11 L147 22.2583 L140.5 33.0167 Z" clip-path="url(#clipPath26)" stroke="none"
      /><path fill="none" d="M134 22.2583 L140.5 11 L147 22.2583 L140.5 33.0167 Z" clip-path="url(#clipPath26)"
    /></g
    ><g transform="translate(340,730)"
    ><path fill="none" d="M10.5 11.5 L10.5 50.5" clip-path="url(#clipPath27)"
      /><path fill="none" d="M10.5 50.5 L70.5 50.5" clip-path="url(#clipPath27)"
      /><path fill="none" d="M70.5 50.5 L70.5 80.5" clip-path="url(#clipPath27)"
      /><path d="M4 22.2583 L10.5 11 L17 22.2583 L10.5 33.0167 Z" clip-path="url(#clipPath27)" stroke="none"
      /><path fill="none" d="M4 22.2583 L10.5 11 L17 22.2583 L10.5 33.0167 Z" clip-path="url(#clipPath27)"
    /></g
    ><g stroke-dasharray="8,5" stroke-miterlimit="5" transform="translate(340,570)" stroke-linecap="butt"
    ><path fill="none" d="M10.5 11.5 L10.5 130.5" clip-path="url(#clipPath28)"
      /><path fill="white" d="M4 22.2583 L10.5 11 L17 22.2583 Z" clip-path="url(#clipPath28)" stroke="none"
      /><path fill="none" stroke-miterlimit="10" stroke-dasharray="none" d="M4 22.2583 L10.5 11 L17 22.2583 Z" clip-path="url(#clipPath28)" stroke-linecap="square"
    /></g
    ><g transform="translate(160,620)"
    ><path fill="none" d="M59.5 10.5 L10.5 10.5" clip-path="url(#clipPath29)"
      /><path d="M48.7417 4 L60 10.5 L48.7417 17 L37.9833 10.5 Z" clip-path="url(#clipPath29)" stroke="none"
      /><path fill="none" d="M48.7417 4 L60 10.5 L48.7417 17 L37.9833 10.5 Z" clip-path="url(#clipPath29)"
    /></g
    ><g transform="translate(530,730)"
    ><path fill="none" d="M39.5 100.5 L10.5 100.5" clip-path="url(#clipPath30)"
      /><path fill="none" d="M10.5 100.5 L10.5 10.5" clip-path="url(#clipPath30)"
      /><path fill="none" d="M28.7417 94 L40 100.5 L28.7417 107" clip-path="url(#clipPath30)"
    /></g
    ><g transform="translate(450,820)"
    ><path fill="none" d="M119.5 10.5 L10.5 10.5" clip-path="url(#clipPath31)"
      /><path fill="none" d="M108.7417 4 L120 10.5 L108.7417 17" clip-path="url(#clipPath31)"
    /></g
    ><g transform="translate(530,570)"
    ><path fill="none" d="M10.5 11.5 L10.5 130.5" clip-path="url(#clipPath28)"
      /><path fill="white" d="M4 22.2583 L10.5 11 L17 22.2583 Z" clip-path="url(#clipPath28)" stroke="none"
      /><path fill="none" d="M4 22.2583 L10.5 11 L17 22.2583 Z" clip-path="url(#clipPath28)"
    /></g
    ><g transform="translate(650,620)"
    ><path fill="none" d="M10.5 11.5 L10.5 190.5" clip-path="url(#clipPath32)"
      /><path fill="white" d="M4 22.2583 L10.5 11 L17 22.2583 Z" clip-path="url(#clipPath32)" stroke="none"
      /><path fill="none" d="M4 22.2583 L10.5 11 L17 22.2583 Z" clip-path="url(#clipPath32)"
    /></g
    ><g transform="translate(450,830)"
    ><path fill="none" d="M729.5 70.5 L70.5 70.5" clip-path="url(#clipPath33)"
      /><path fill="none" d="M70.5 70.5 L70.5 10.5" clip-path="url(#clipPath33)"
      /><path fill="none" d="M70.5 10.5 L10.5 10.5" clip-path="url(#clipPath33)"
      /><path fill="white" d="M718.7417 64 L730 70.5 L718.7417 77 Z" clip-path="url(#clipPath33)" stroke="none"
      /><path fill="none" d="M718.7417 64 L730 70.5 L718.7417 77 Z" clip-path="url(#clipPath33)"
    /></g
    ><g transform="translate(720,620)"
    ><path fill="none" d="M10.5 11.5 L10.5 80.5" clip-path="url(#clipPath34)"
      /><path fill="none" d="M4 22.2583 L10.5 11 L17 22.2583" clip-path="url(#clipPath34)"
    /></g
    ><g transform="translate(600,540)"
    ><path fill="none" d="M90.5 29.5 L90.5 10.5" clip-path="url(#clipPath35)"
      /><path fill="none" d="M90.5 10.5 L10.5 10.5" clip-path="url(#clipPath35)"
      /><path fill="none" d="M97 18.7417 L90.5 30 L84 18.7417" clip-path="url(#clipPath35)"
    /></g
    ><g stroke-dasharray="8,5" stroke-miterlimit="5" transform="translate(820,570)" stroke-linecap="butt"
    ><path fill="none" d="M10.5 11.5 L10.5 240.5" clip-path="url(#clipPath36)"
      /><path fill="white" d="M4 22.2583 L10.5 11 L17 22.2583 Z" clip-path="url(#clipPath36)" stroke="none"
      /><path fill="none" stroke-miterlimit="10" stroke-dasharray="none" d="M4 22.2583 L10.5 11 L17 22.2583 Z" clip-path="url(#clipPath36)" stroke-linecap="square"
    /></g
    ><g transform="translate(1090,520)"
    ><path fill="none" d="M11.1292 219.7227 L180.5 10.5" clip-path="url(#clipPath37)"
      /><path fill="white" d="M22.9504 215.4507 L10.8146 220.1114 L12.8462 207.2711 L24.6674 202.999 Z" clip-path="url(#clipPath37)" stroke="none"
      /><path fill="none" d="M22.9504 215.4507 L10.8146 220.1114 L12.8462 207.2711 L24.6674 202.999 Z" clip-path="url(#clipPath37)"
    /></g
    ><g transform="translate(1040,820)"
    ><path fill="none" d="M139.5 10.5 L10.5 10.5" clip-path="url(#clipPath38)"
      /><path fill="white" d="M128.7417 4 L140 10.5 L128.7417 17 Z" clip-path="url(#clipPath38)" stroke="none"
      /><path fill="none" d="M128.7417 4 L140 10.5 L128.7417 17 Z" clip-path="url(#clipPath38)"
    /></g
    ><g transform="translate(950,590)"
    ><path fill="none" d="M10.5 219.5 L10.5 10.5" clip-path="url(#clipPath39)"
      /><path fill="white" d="M17 208.7417 L10.5 220 L4 208.7417 Z" clip-path="url(#clipPath39)" stroke="none"
      /><path fill="none" d="M17 208.7417 L10.5 220 L4 208.7417 Z" clip-path="url(#clipPath39)"
    /></g
    ><g stroke-dasharray="8,5" stroke-miterlimit="5" transform="translate(1120,470)" stroke-linecap="butt"
    ><path fill="none" d="M69.5 10.5 L40.5 10.5" clip-path="url(#clipPath40)"
      /><path fill="none" d="M40.5 10.5 L40.5 110.5" clip-path="url(#clipPath40)"
      /><path fill="none" d="M40.5 110.5 L10.5 110.5" clip-path="url(#clipPath40)"
      /><path fill="white" d="M58.7417 4 L70 10.5 L58.7417 17 Z" clip-path="url(#clipPath40)" stroke="none"
      /><path fill="none" stroke-miterlimit="10" stroke-dasharray="none" d="M58.7417 4 L70 10.5 L58.7417 17 Z" clip-path="url(#clipPath40)" stroke-linecap="square"
    /></g
    ><g stroke-dasharray="8,5" stroke-miterlimit="5" transform="translate(1120,470)" stroke-linecap="butt"
    ><path fill="none" d="M69.5 10.5 L40.5 10.5" clip-path="url(#clipPath41)"
      /><path fill="none" d="M40.5 10.5 L40.5 50.5" clip-path="url(#clipPath41)"
      /><path fill="none" d="M40.5 50.5 L10.5 50.5" clip-path="url(#clipPath41)"
      /><path fill="white" d="M58.7417 4 L70 10.5 L58.7417 17 Z" clip-path="url(#clipPath41)" stroke="none"
      /><path fill="none" stroke-miterlimit="10" stroke-dasharray="none" d="M58.7417 4 L70 10.5 L58.7417 17 Z" clip-path="url(#clipPath41)" stroke-linecap="square"
    /></g
    ><g stroke-dasharray="8,5" stroke-miterlimit="5" transform="translate(1120,450)" stroke-linecap="butt"
    ><path fill="none" d="M69.5 30.5 L40.5 30.5" clip-path="url(#clipPath42)"
      /><path fill="none" d="M40.5 30.5 L40.5 10.5" clip-path="url(#clipPath42)"
      /><path fill="none" d="M40.5 10.5 L10.5 10.5" clip-path="url(#clipPath42)"
      /><path fill="white" d="M58.7417 24 L70 30.5 L58.7417 37 Z" clip-path="url(#clipPath42)" stroke="none"
      /><path fill="none" stroke-miterlimit="10" stroke-dasharray="none" d="M58.7417 24 L70 30.5 L58.7417 37 Z" clip-path="url(#clipPath42)" stroke-linecap="square"
    /></g
    ><g stroke-dasharray="8,5" stroke-miterlimit="5" transform="translate(1120,390)" stroke-linecap="butt"
    ><path fill="none" d="M69.5 90.5 L40.5 90.5" clip-path="url(#clipPath43)"
      /><path fill="none" d="M40.5 90.5 L40.5 10.5" clip-path="url(#clipPath43)"
      /><path fill="none" d="M40.5 10.5 L10.5 10.5" clip-path="url(#clipPath43)"
      /><path fill="white" d="M58.7417 84 L70 90.5 L58.7417 97 Z" clip-path="url(#clipPath43)" stroke="none"
      /><path fill="none" stroke-miterlimit="10" stroke-dasharray="none" d="M58.7417 84 L70 90.5 L58.7417 97 Z" clip-path="url(#clipPath43)" stroke-linecap="square"
    /></g
    ><g transform="translate(1340,470)"
    ><path fill="none" d="M29.5 10.5 L10.5 10.5" clip-path="url(#clipPath44)"
      /><path fill="none" d="M18.7417 4 L30 10.5 L18.7417 17" clip-path="url(#clipPath44)"
    /></g
    ><g transform="translate(530,480)"
    ><path fill="none" d="M10.5 39.5 L10.5 20.5" clip-path="url(#clipPath45)"
      /><path fill="none" d="M10.5 20.5 L60.5 20.5" clip-path="url(#clipPath45)"
      /><path fill="none" d="M60.5 20.5 L60.5 10.5" clip-path="url(#clipPath45)"
      /><path fill="none" d="M17 28.7417 L10.5 40 L4 28.7417" clip-path="url(#clipPath45)"
    /></g
    ><g transform="translate(330,480)"
    ><path fill="none" d="M10.5 39.5 L10.5 20.5" clip-path="url(#clipPath46)"
      /><path fill="none" d="M10.5 20.5 L260.5 20.5" clip-path="url(#clipPath46)"
      /><path fill="none" d="M260.5 20.5 L260.5 10.5" clip-path="url(#clipPath46)"
      /><path fill="none" d="M17 28.7417 L10.5 40 L4 28.7417" clip-path="url(#clipPath46)"
    /></g
    ><g transform="translate(580,480)"
    ><path fill="none" d="M250.5 39.5 L250.5 20.5" clip-path="url(#clipPath47)"
      /><path fill="none" d="M250.5 20.5 L10.5 20.5" clip-path="url(#clipPath47)"
      /><path fill="none" d="M10.5 20.5 L10.5 10.5" clip-path="url(#clipPath47)"
      /><path fill="none" d="M257 28.7417 L250.5 40 L244 28.7417" clip-path="url(#clipPath47)"
    /></g
    ><g transform="translate(360,420)"
    ><path fill="none" d="M11.5 10.5 L150.5 10.5" clip-path="url(#clipPath48)"
      /><path fill="white" d="M22.2583 17 L11 10.5 L22.2583 4 L33.0167 10.5 Z" clip-path="url(#clipPath48)" stroke="none"
      /><path fill="none" d="M22.2583 17 L11 10.5 L22.2583 4 L33.0167 10.5 Z" clip-path="url(#clipPath48)"
    /></g
    ><g stroke-dasharray="8,5" stroke-miterlimit="5" transform="translate(270,570)" stroke-linecap="butt"
    ><path fill="none" d="M80.5 11.5 L80.5 30.5" clip-path="url(#clipPath49)"
      /><path fill="none" d="M80.5 30.5 L10.5 30.5" clip-path="url(#clipPath49)"
      /><path fill="none" d="M10.5 30.5 L10.5 40.5" clip-path="url(#clipPath49)"
      /><path fill="white" d="M74 22.2583 L80.5 11 L87 22.2583 Z" clip-path="url(#clipPath49)" stroke="none"
      /><path fill="none" stroke-miterlimit="10" stroke-dasharray="none" d="M74 22.2583 L80.5 11 L87 22.2583 Z" clip-path="url(#clipPath49)" stroke-linecap="square"
    /></g
  ></g
></svg
>
