<svg xmlns="http://www.w3.org/2000/svg">
  <defs id="defs3051">
    <style type="text/css" id="current-color-scheme">
      .ColorScheme-Text {
        color:#4d4d4d;
      }
      </style>
  </defs>
 <path 
    style="fill:currentColor;fill-opacity:1;stroke:none" 
	d="m7.01172 3c-.57735 1-.878131 1-.300781 2l3.541016 6.140625-2.058594 3.527344c-.445257-.411453-1.036498-.667969-1.693359-.667969-1.385 0-2.5 1.115-2.5 2.5 0 1.385 1.115 2.5 2.5 2.5 1.385 0 2.5-1.115 2.5-2.5 0-.167103-.01785-.330523-.048828-.488281l1.162109-2.01367c.780419-.001.878798-.774603 1.333985-.785156l1.603515 2.78125c-.033193.163037-.050781.332734-.050781.505859 0 1.385 1.115 2.5 2.5 2.5 1.385 0 2.5-1.115 2.5-2.5 0-1.385-1.115-2.5-2.5-2.5-.653333 0-1.241072.254586-1.685547.662109l-2.054687-3.521484 3.541015-6.140625c.57735-1 .276569-1-.300781-2l-3.994141 6.847656-3.99414-6.847656m3.988281 8c.277 0 .5.223.5.5 0 .277-.223.5-.5.5-.277 0-.5-.223-.5-.5 0-.277.223-.5.5-.5zm-4.5 4c.831 0 1.5.669 1.5 1.5 0 .831-.669 1.5-1.5 1.5-.831 0-1.5-.669-1.5-1.5 0-.831.669-1.5 1.5-1.5m9 0c.831 0 1.5.669 1.5 1.5 0 .831-.669 1.5-1.5 1.5-.831 0-1.5-.669-1.5-1.5 0-.831.669-1.5 1.5-1.5"
    class="ColorScheme-Text"
     transform="translate(1,1)"
    />  
</svg>
