<?xml version="1.0" encoding="UTF-8" standalone="no"?>
<svg
   version="1.1"
   id="svg18"
   sodipodi:docname="go-to-line.svg"
   inkscape:version="1.1.2 (b8e25be833, 2022-02-05)"
   xmlns:inkscape="http://www.inkscape.org/namespaces/inkscape"
   xmlns:sodipodi="http://sodipodi.sourceforge.net/DTD/sodipodi-0.dtd"
   xmlns="http://www.w3.org/2000/svg"
   xmlns:svg="http://www.w3.org/2000/svg">
  <defs
     id="defs22" />
  <sodipodi:namedview
     id="namedview20"
     pagecolor="#ffffff"
     bordercolor="#666666"
     borderopacity="1.0"
     inkscape:pageshadow="2"
     inkscape:pageopacity="0.0"
     inkscape:pagecheckerboard="0"
     showgrid="false"
     inkscape:zoom="4.1733333"
     inkscape:cx="149.88019"
     inkscape:cy="74.880192"
     inkscape:window-width="1826"
     inkscape:window-height="1051"
     inkscape:window-x="85"
     inkscape:window-y="-9"
     inkscape:window-maximized="1"
     inkscape:current-layer="g16" />
  <g
     id="g5">
    <title
       id="title2">background</title>
    <rect
       fill="none"
       id="canvas_background"
       height="66"
       width="66"
       y="-1"
       x="-1" />
  </g>
  <g
     id="g16">
    <title
       id="title7">Layer 1</title>
    <line
       stroke-linecap="null"
       stroke-linejoin="null"
       id="svg_1"
       y2="11.932387"
       x2="50.090898"
       y1="11.932387"
       x1="13.909103"
       fill-opacity="null"
       stroke-width="2"
       stroke="#282828"
       fill="none"
       style="fill:#4d4d4d;fill-opacity:1" />
    <line
       stroke-linecap="null"
       stroke-linejoin="null"
       id="svg_3"
       y2="24.932387"
       x2="53.468051"
       y1="24.932387"
       x1="24.794839"
       fill-opacity="null"
       stroke-width="2"
       stroke="#282828"
       fill="none"
       style="fill:#4d4d4d;fill-opacity:1" />
    <line
       stroke-linecap="null"
       stroke-linejoin="null"
       id="svg_4"
       y2="37.932387"
       x2="47.183527"
       y1="37.932387"
       x1="18.033511"
       fill-opacity="null"
       stroke-width="2"
       stroke="#282828"
       fill="none"
       style="fill:#4d4d4d;fill-opacity:1" />
    <line
       stroke-linecap="null"
       stroke-linejoin="null"
       id="svg_5"
       y2="50.932387"
       x2="50.090898"
       y1="50.932387"
       x1="13.909102"
       fill-opacity="null"
       stroke-width="2"
       stroke="#282828"
       fill="none"
       style="fill:#4d4d4d;fill-opacity:1" />
    <g
       id="svg_11">
      <line
         transform="rotate(45, 15.715, 21.0867)"
         stroke-linecap="null"
         stroke-linejoin="null"
         id="svg_6"
         y2="21.086718"
         x2="22.358845"
         y1="21.086718"
         x1="9.071197"
         fill-opacity="null"
         stroke-width="2"
         stroke="#6D97AB"
         fill="none" />
      <line
         transform="rotate(-45, 15.6931, 29.1657)"
         stroke-linecap="null"
         stroke-linejoin="null"
         id="svg_7"
         y2="29.165664"
         x2="22.336958"
         y1="29.165664"
         x1="9.04931"
         fill-opacity="null"
         stroke-width="2"
         stroke="#6D97AB"
         fill="none" />
    </g>
  </g>
</svg>
