<?xml version="1.0" encoding="UTF-8" standalone="no"?>
<svg
   viewBox="0 0 24 24"
   version="1.1"
   id="svg8"
   sodipodi:docname="table-delete-row.svg"
   inkscape:version="1.1.2 (b8e25be833, 2022-02-05)"
   xmlns:inkscape="http://www.inkscape.org/namespaces/inkscape"
   xmlns:sodipodi="http://sodipodi.sourceforge.net/DTD/sodipodi-0.dtd"
   xmlns="http://www.w3.org/2000/svg"
   xmlns:svg="http://www.w3.org/2000/svg">
  <sodipodi:namedview
     id="namedview10"
     pagecolor="#ffffff"
     bordercolor="#666666"
     borderopacity="1.0"
     inkscape:pageshadow="2"
     inkscape:pageopacity="0.0"
     inkscape:pagecheckerboard="0"
     showgrid="false"
     inkscape:zoom="35.75"
     inkscape:cx="11.986014"
     inkscape:cy="12.013986"
     inkscape:window-width="1826"
     inkscape:window-height="1051"
     inkscape:window-x="85"
     inkscape:window-y="-9"
     inkscape:window-maximized="1"
     inkscape:current-layer="svg8" />
  <defs
     id="defs3051">
    <style
       type="text/css"
       id="current-color-scheme">
      .ColorScheme-Text {
        color:#282828;
      }
      .ColorScheme-NegativeText {
        color:#da4453;
      }
      </style>
  </defs>
  <path
     style="fill:#4d4d4d;fill-opacity:1;stroke:none"
     d="M 4 4 L 4 19 L 4 20 L 20 20 L 20 19 L 20 4 L 19 4 L 5 4 L 4 4 z M 5 5 L 9 5 L 9 7 L 5 7 L 5 5 z M 10 5 L 14 5 L 14 7 L 10 7 L 10 5 z M 15 5 L 19 5 L 19 7 L 16 7 L 15 7 L 15 5.9003906 L 15 5 z M 5 8 L 9 8 L 9 9 L 10 9 L 10 8 L 14 8 L 14 9 L 15 9 L 15 8 L 16 8 L 19 8 L 19 9 L 19 10 L 19 11 L 19 13 L 19 14 L 19 15 L 19 16 L 16 16 L 15 16 L 15 15 L 14 15 L 14 16 L 10 16 L 10 15 L 9 15 L 9 16 L 5 16 L 5 15 L 5 14 L 5 13 L 5 11 L 5 10 L 5 9 L 5 8 z M 5 17 L 8 17 L 9 17 L 9 18 L 9 19 L 5 19 L 5 17 z M 10 17 L 14 17 L 14 18 L 14 19 L 10 19 L 10 18 L 10 17 z M 15 17 L 16 17 L 19 17 L 19 19 L 15 19 L 15 18 L 15 17 z "
     class="ColorScheme-Text"
     id="path4" />
  <path
     style="fill:currentColor;fill-opacity:1;stroke:none"
     d="M 5 9 L 5 10 L 5.2929688 10 L 9.2929688 14 L 5 14 L 5 15 L 10.292969 15 L 14.292969 15 L 18.292969 15 L 19 15 L 19 14.292969 L 19 14 L 18.707031 14 L 14.707031 10 L 19 10 L 19 9 L 5 9 z M 6.7070312 10 L 9.2929688 10 L 13.292969 14 L 10.707031 14 L 6.7070312 10 z M 10.707031 10 L 13.292969 10 L 17.292969 14 L 14.707031 14 L 10.707031 10 z "
     class="ColorScheme-NegativeText"
     id="path6" />
</svg>
