<?xml version="1.0" encoding="UTF-8" standalone="no"?>
<svg
   version="1.1"
   id="svg3754"
   sodipodi:docname="special-copy.svg"
   inkscape:version="1.1.2 (b8e25be833, 2022-02-05)"
   xmlns:inkscape="http://www.inkscape.org/namespaces/inkscape"
   xmlns:sodipodi="http://sodipodi.sourceforge.net/DTD/sodipodi-0.dtd"
   xmlns="http://www.w3.org/2000/svg"
   xmlns:svg="http://www.w3.org/2000/svg"
   xmlns:rdf="http://www.w3.org/1999/02/22-rdf-syntax-ns#"
   xmlns:cc="http://creativecommons.org/ns#"
   xmlns:dc="http://purl.org/dc/elements/1.1/">
  <metadata
     id="metadata3758">
    <rdf:RDF>
      <cc:Work
         rdf:about="">
        <dc:format>image/svg+xml</dc:format>
        <dc:type
           rdf:resource="http://purl.org/dc/dcmitype/StillImage" />
        <dc:title />
      </cc:Work>
    </rdf:RDF>
  </metadata>
  <sodipodi:namedview
     pagecolor="#ffffff"
     bordercolor="#666666"
     borderopacity="1"
     objecttolerance="10"
     gridtolerance="10"
     guidetolerance="10"
     inkscape:pageopacity="0"
     inkscape:pageshadow="2"
     inkscape:window-width="1826"
     inkscape:window-height="1051"
     id="namedview3756"
     showgrid="false"
     inkscape:zoom="22.627417"
     inkscape:cx="1.4363106"
     inkscape:cy="13.722291"
     inkscape:window-x="85"
     inkscape:window-y="-9"
     inkscape:window-maximized="1"
     inkscape:current-layer="svg3754"
     inkscape:pagecheckerboard="0" />
  <defs
     id="defs3051">
    <style
       type="text/css"
       id="current-color-scheme">
      .ColorScheme-Text {
        color:#282828;
      }
      </style>
  </defs>
  <path
     id="path3752"
     style="fill:#4d4d4d;fill-opacity:1;stroke:none"
     d="m 5,4 v 1 13 h 1 2 1 v 1 1 h 5.007812 c -0.0031,-0.34966 -0.008,-0.703315 -0.0077,-1 H 10 V 8 h 8 v 6.960938 c 0.347489,0 0.679499,0.0098 1.000004,0.0098 V 8 7 H 17 V 4 H 16 6 Z M 6,5 H 16 V 7 H 9 v 1 9 H 8 6 Z"
     inkscape:connector-curvature="0"
     sodipodi:nodetypes="ccccccccccccccccccccccccccccccc" />
  <path
     sodipodi:type="star"
     style="fill:#4d4d4d;stroke-width:0.89170378;fill-opacity:1"
     id="path3810"
     sodipodi:sides="6"
     sodipodi:cx="16.132731"
     sodipodi:cy="17.180117"
     sodipodi:r1="3.5672505"
     sodipodi:r2="1.4269"
     sodipodi:arg1="0.80102189"
     sodipodi:arg2="1.3246207"
     inkscape:flatsided="false"
     inkscape:rounded="0"
     inkscape:randomized="0"
     d="m 18.615442,19.741644 -2.134981,-1.177646 -1.324723,2.046973 -0.04762,-2.43777 -2.435093,-0.123757 2.087362,-1.260124 -1.11037,-2.170731 2.134981,1.177647 1.324723,-2.046974 0.04762,2.43777 2.435093,0.123757 -2.087362,1.260125 z" />
</svg>
