[
    {
        "scale": 0.6331908252578619,
        "default": 0.9186988775801513,
        "shift": 0.9186988775801513,
        "name": "abs_eta_uncalib"
    },
    {
        "scale": 1030183.8427389456,
        "default": 600192.1278563326,
        "shift": 600192.1278563326,
        "name": "pt_uncalib"
    },
    {
        "scale": 1982.1923316458692,
        "default": 2630.2194468340126,
        "shift": 2630.2194592661467,
        "name": "JetFitter_mass"
    },
    {
        "scale": 1.0,
        "default": null,
        "shift": 0.0,
        "name": "JetFitter_isDefaults"
    },
    {
        "scale": 0.3386999568656678,
        "default": 0,
        "shift": 0.30403325602559766,
        "name": "JetFitter_energyFraction"
    },
    {
        "scale": 16.26272890374302,
        "default": 0,
        "shift": 10.152334383028197,
        "name": "JetFitter_significance3d"
    },
    {
        "scale": 0.9949091032920229,
        "default": -1,
        "shift": 0.1732949096982467,
        "name": "JetFitter_nVTX"
    },
    {
        "scale": 1.195766648587875,
        "default": -1,
        "shift": 0.1889907001353426,
        "name": "JetFitter_nSingleTracks"
    },
    {
        "scale": 2.0717553276697296,
        "default": -1,
        "shift": 1.0193055154439306,
        "name": "JetFitter_nTracksAtVtx"
    },
    {
        "scale": 7.34008506278385,
        "default": -1,
        "shift": 2.85025961814304,
        "name": "JetFitter_N2Tpair"
    },
    {
        "scale": 0.05099190668601156,
        "default": 0.05892228473630911,
        "shift": 0.05892228425251749,
        "name": "JetFitter_deltaR"
    },
    {
        "scale": 2.5887925367315963,
        "default": -1,
        "shift": 0.7775167443502575,
        "name": "SV1_NGTinSvx"
    },
    {
        "scale": 753.760756347663,
        "default": 2007.7199966033322,
        "shift": 2007.7199800732844,
        "name": "SV1_masssvx"
    },
    {
        "scale": 1.0,
        "default": null,
        "shift": 0.0,
        "name": "SV1_isDefaults"
    },
    {
        "scale": 3.911271213080252,
        "default": -1,
        "shift": 0.9781559674907906,
        "name": "SV1_N2Tpair"
    },
    {
        "scale": 0.30811738659924015,
        "default": 0,
        "shift": 0.19802865653963214,
        "name": "SV1_efracsvx"
    },
    {
        "scale": 0.10150792671388575,
        "default": 0.06229004503628599,
        "shift": 0.062290045883704584,
        "name": "SV1_deltaR"
    },
    {
        "scale": 13.907507902712654,
        "default": 14.739976704671067,
        "shift": 14.739976818442527,
        "name": "SV1_Lxy"
    },
    {
        "scale": 26.084427010575574,
        "default": 24.619848665272414,
        "shift": 24.61984840109394,
        "name": "SV1_L3d"
    },
    {
        "scale": 23.66469691441165,
        "default": 29.762977915917393,
        "shift": 29.762977714354722,
        "name": "SV1_significance3d"
    },
    {
        "scale": 5.1201964290922275,
        "default": 0.10079391293366943,
        "shift": 0.10079391293464174,
        "name": "IP2D_bu"
    },
    {
        "scale": 1.0,
        "default": null,
        "shift": 0.0,
        "name": "IP2D_isDefaults"
    },
    {
        "scale": 2.6696134539606198,
        "default": -1.1324702309243833,
        "shift": -1.1324702312613535,
        "name": "IP2D_bc"
    },
    {
        "scale": 2.7503709764544557,
        "default": 1.2256730386233887,
        "shift": 1.2256730394369832,
        "name": "IP2D_cu"
    },
    {
        "scale": 5.758020203581368,
        "default": 0.28888046641602555,
        "shift": 0.28888046642369414,
        "name": "IP3D_bu"
    },
    {
        "scale": 1.0,
        "default": null,
        "shift": 0.0,
        "name": "IP3D_isDefaults"
    },
    {
        "scale": 3.126065798928013,
        "default": -1.1840821721796386,
        "shift": -1.1840821719379084,
        "name": "IP3D_bc"
    },
    {
        "scale": 3.07052844040616,
        "default": 1.4705990092494015,
        "shift": 1.470599009843075,
        "name": "IP3D_cu"
    },
    {
        "scale": 1.2714758747442445,
        "default": 0,
        "shift": 1.226559596201669,
        "name": "secondaryVtx_nTrks"
    },
    {
        "scale": 1.0,
        "default": null,
        "shift": 0.0,
        "name": "secondaryVtx_isDefaults"
    },
    {
        "scale": 759.5900741731422,
        "default": 691.8603318760225,
        "shift": 691.8603387532246,
        "name": "secondaryVtx_m"
    },
    {
        "scale": 7511556.173902728,
        "default": 157096.18615788335,
        "shift": 157096.18662673363,
        "name": "secondaryVtx_E"
    },
    {
        "scale": 0.2147504536791879,
        "default": 0,
        "shift": 0.15188066350807353,
        "name": "secondaryVtx_EFrac"
    },
    {
        "scale": 36.633840061264294,
        "default": 22.701455799279657,
        "shift": 22.701455893833344,
        "name": "secondaryVtx_L3d"
    },
    {
        "scale": 18.588054399095338,
        "default": 12.889260524218399,
        "shift": 12.889260443114678,
        "name": "secondaryVtx_Lxy"
    },
    {
        "scale": 1.0407997252939847,
        "default": 4.318573594506093,
        "shift": 4.318573552717759,
        "name": "secondaryVtx_max_trk_flightDirRelEta"
    },
    {
        "scale": 0.9361074152093871,
        "default": 3.788893924035021,
        "shift": 3.788893928936054,
        "name": "secondaryVtx_min_trk_flightDirRelEta"
    },
    {
        "scale": 0.9447463669708839,
        "default": 4.051663230485672,
        "shift": 4.051663289263958,
        "name": "secondaryVtx_avg_trk_flightDirRelEta"
    },
    {
        "scale": 1.2240773430089398,
        "default": 5.192268308311343,
        "shift": 5.1922683083162315,
        "name": "max_trk_flightDirRelEta"
    },
    {
        "scale": 0.5239303627461532,
        "default": 2.338589430090103,
        "shift": 2.3385894300900847,
        "name": "min_trk_flightDirRelEta"
    },
    {
        "scale": 0.7051581077494041,
        "default": 3.373045857951103,
        "shift": 3.373045857955999,
        "name": "avg_trk_flightDirRelEta"
    },
    {
        "scale": 0.31179418133156017,
        "default": 0.3058306839561739,
        "shift": 0.30583068396958407,
        "name": "rnnip_pb"
    },
    {
        "scale": 0.08922251891266479,
        "default": 0.17326973270816706,
        "shift": 0.1732697327125121,
        "name": "rnnip_pc"
    },
    {
        "scale": 0.3008387718082485,
        "default": 0.5020281256718728,
        "shift": 0.5020281255992329,
        "name": "rnnip_pu"
    },
    {
        "scale": 0.07156368483030356,
        "default": 0.01887145765547587,
        "shift": 0.01887145765786043,
        "name": "rnnip_ptau"
    },
    {
        "scale": 1.0,
        "default": null,
        "shift": 0.0,
        "name": "rnnip_isDefaults"
    },
    {
        "scale": 0.03215024467615,
        "default": 0.08860603206753742,
        "shift": 0.08860603011591721,
        "name": "SMT_dR"
    },
    {
        "scale": 0.47736165069449404,
        "default": -0.0214664406428979,
        "shift": -0.021466441324355625,
        "name": "SMT_mu_d0"
    },
    {
        "scale": 731.330775064661,
        "default": 22.852146185960862,
        "shift": 22.852146154582385,
        "name": "SMT_qOverPratio"
    },
    {
        "scale": 69932.05625193194,
        "default": 109010.31018157683,
        "shift": 109010.31213303065,
        "name": "SMT_pTrel"
    },
    {
        "scale": 1.4603249272811396,
        "default": 0.5021715718731398,
        "shift": 0.502171575366229,
        "name": "SMT_scatneighsignif"
    },
    {
        "scale": 0.6815036561408483,
        "default": 0.8594757209110973,
        "shift": 0.859475730118269,
        "name": "SMT_mombalsignif"
    },
    {
        "scale": 1.0,
        "default": null,
        "shift": 0.0,
        "name": "SMT_isDefaults"
    },
    {
        "scale": 0.3453701547605766,
        "default": 0.38787230361077996,
        "shift": 0.38787230361077996,
        "name": "iprnn_pb"
    },
    {
        "scale": 0.11951147471785163,
        "default": 0.16499837546639493,
        "shift": 0.16499837546639493,
        "name": "iprnn_pc"
    },
    {
        "scale": 0.34301783406070857,
        "default": 0.44712929100941323,
        "shift": 0.44712929100941323,
        "name": "iprnn_pu"
    },
    {
        "scale": 196321.37926408128,
        "default": 41016.95270604268,
        "shift": 41016.95306781943,
        "name": "softMuon_pt"
    },
    {
        "scale": 0.028484217759573095,
        "default": 0.08230867532181169,
        "shift": 0.0823086727715998,
        "name": "softMuon_dR"
    },
    {
        "scale": 0.33905735429124156,
        "default": -0.001892467288684504,
        "shift": -0.0018924672658348597,
        "name": "softMuon_eta"
    },
    {
        "scale": 0.6665896507123419,
        "default": 0.04997536301044365,
        "shift": 0.049975361857286175,
        "name": "softMuon_phi"
    },
    {
        "scale": 463.42182450949554,
        "default": 10.216596705746916,
        "shift": 10.216596617363054,
        "name": "softMuon_qOverPratio"
    },
    {
        "scale": 0.6494427962678764,
        "default": 0.9069141787073219,
        "shift": 0.9069141751232181,
        "name": "softMuon_momentumBalanceSignificance"
    },
    {
        "scale": 1.3558794325540948,
        "default": 0.5213184518740609,
        "shift": 0.5213184378806687,
        "name": "softMuon_scatteringNeighbourSignificance"
    },
    {
        "scale": 64286.90718401621,
        "default": 106507.65150769669,
        "shift": 106507.64885652991,
        "name": "softMuon_pTrel"
    },
    {
        "scale": 0.3727264206268324,
        "default": 0.22850861620826873,
        "shift": 0.22850862073825315,
        "name": "softMuon_ip3dD0"
    },
    {
        "scale": 4.218436837144475,
        "default": 0.9304338766997868,
        "shift": 0.9304338703633772,
        "name": "softMuon_ip3dZ0"
    },
    {
        "scale": 8.68332425622643,
        "default": 7.069373130770927,
        "shift": 7.0693731307946015,
        "name": "softMuon_ip3dD0Significance"
    },
    {
        "scale": 40.41573493502112,
        "default": 8.045411811257075,
        "shift": 8.0454120291583,
        "name": "softMuon_ip3dZ0Significance"
    },
    {
        "scale": 0.0072986391699673015,
        "default": 0.024049823000630664,
        "shift": 0.024049822344735322,
        "name": "softMuon_ip3dD0Uncertainty"
    },
    {
        "scale": 4.232412686813929,
        "default": 0.01851362763468308,
        "shift": 0.01851362738913967,
        "name": "softMuon_ip3dZ0Uncertainty"
    },
    {
        "scale": 1.0,
        "default": null,
        "shift": 0.0,
        "name": "softMuon_isDefaults"
    },
    {
        "scale": 0.07414872774972714,
        "default": 0.8216248124695914,
        "shift": 0.8216248150553311,
        "name": "smt_b"
    },
    {
        "scale": 0.023035390822978563,
        "default": 0.13819573603787055,
        "shift": 0.138195737901774,
        "name": "smt_c"
    },
    {
        "scale": 0.05951046173106108,
        "default": 0.1377166733706302,
        "shift": 0.13771667975592522,
        "name": "smt_u"
    },
    {
        "scale": 13.501875624629728,
        "default": 38.92458297366161,
        "shift": 38.92458297366161,
        "name": "averageInteractionsPerCrossing"
    },
    {
        "scale": 13.501875624629728,
        "default": 38.92458297366161,
        "shift": 38.92458297366161,
        "name": "actualInteractionsPerCrossing"
    }
]
