0X01 	 0X112416 	 1768 
0X02 	 0X112416 	 1769 
0X03 	 0X112416 	 1770 
0X10 	 0X112416 	 1771 
0X11 	 0X112416 	 1772 
0X12 	 0X112416 	 1773 
0X13 	 0X112416 	 1774 
0X21 	 0X112416 	 1761 
0X22 	 0X112416 	 1760 
0X23 	 0X112416 	 1759 
0X30 	 0X112416 	 1758 
0X31 	 0X112416 	 1757 
0X32 	 0X112416 	 1756 
0X41 	 0X112416 	 1742 
0X42 	 0X112416 	 1743 
0X43 	 0X112416 	 1744 
0X50 	 0X112416 	 1745 
0X51 	 0X112416 	 1746 
0X52 	 0X112416 	 1747 
0X53 	 0X112416 	 1748 
0X61 	 0X112416 	 1735 
0X62 	 0X112416 	 1734 
0X63 	 0X112416 	 1733 
0X70 	 0X112416 	 1732 
0X71 	 0X112416 	 1731 
0X72 	 0X112416 	 1730 
