0X20 	 0X23010a 	 8060 
0X21 	 0X23010a 	 8061 
0X22 	 0X23010a 	 8022 
0X23 	 0X23010a 	 8023 
0X24 	 0X23010a 	 8018 
0X25 	 0X23010a 	 8019 
0X26 	 0X23010a 	 8014 
0X27 	 0X23010a 	 8015 
0X28 	 0X23010a 	 8010 
0X29 	 0X23010a 	 8011 
0X30 	 0X23010a 	 8046 
0X31 	 0X23010a 	 8047 
0X32 	 0X23010a 	 8042 
0X33 	 0X23010a 	 8043 
0X34 	 0X23010a 	 8038 
0X35 	 0X23010a 	 8039 
0X36 	 0X23010a 	 8034 
0X37 	 0X23010a 	 8035 
0X38 	 0X23010a 	 8030 
0X39 	 0X23010a 	 8031 
0X3a 	 0X23010a 	 8026 
0X3b 	 0X23010a 	 8027 
0X40 	 0X23010a 	 7876 
0X41 	 0X23010a 	 7877 
0X42 	 0X23010a 	 7838 
0X43 	 0X23010a 	 7839 
0X44 	 0X23010a 	 7834 
0X45 	 0X23010a 	 7835 
0X46 	 0X23010a 	 7830 
0X47 	 0X23010a 	 7831 
0X48 	 0X23010a 	 7826 
0X49 	 0X23010a 	 7827 
0X50 	 0X23010a 	 7862 
0X51 	 0X23010a 	 7863 
0X52 	 0X23010a 	 7858 
0X53 	 0X23010a 	 7859 
0X54 	 0X23010a 	 7854 
0X55 	 0X23010a 	 7855 
0X56 	 0X23010a 	 7850 
0X57 	 0X23010a 	 7851 
0X58 	 0X23010a 	 7846 
0X59 	 0X23010a 	 7847 
0X5a 	 0X23010a 	 7842 
0X5b 	 0X23010a 	 7843 
0X60 	 0X23010a 	 7132 
0X61 	 0X23010a 	 7133 
0X62 	 0X23010a 	 7144 
0X63 	 0X23010a 	 7145 
0X64 	 0X23010a 	 6916 
0X65 	 0X23010a 	 6917 
0X66 	 0X23010a 	 7138 
0X67 	 0X23010a 	 7139 
0X68 	 0X23010a 	 7150 
0X69 	 0X23010a 	 7151 
0X70 	 0X23010a 	 7120 
0X71 	 0X23010a 	 7121 
0X72 	 0X23010a 	 7126 
0X73 	 0X23010a 	 7127 
0X74 	 0X23010a 	 7114 
0X75 	 0X23010a 	 7115 
0X76 	 0X23010a 	 7102 
0X77 	 0X23010a 	 7103 
0X78 	 0X23010a 	 7108 
0X79 	 0X23010a 	 7109 
