0Xee1234ee
0X00000009
0X03010000
0X00112516
0X0000face
0X01000000
0X00000337
0X00000088
0X00000000
0x20010000
0x810f0101
0x40000000
0x20020000
0x810f0101
0x40000000
0x20030000
0x810f0101
0x40000000
0x20100000
0x810f0101
0x40000000
0x20110000
0x810f0101
0x40000000
0x20120000
0x810f0101
0x40000000
0x20130000
0x810f0101
0x40000000
0x20210000
0x810f0101
0x40000000
0x20220000
0x810f0101
0x40000000
0x20230000
0x810f0101
0x40000000
0x20300000
0x810f0101
0x40000000
0x20310000
0x810f0101
0x40000000
0x20320000
0x810f0101
0x40000000
0x20410000
0x810f0101
0x40000000
0x20420000
0x810f0101
0x40000000
0x20430000
0x810f0101
0x40000000
0x20500000
0x810f0101
0x40000000
0x20510000
0x810f0101
0x40000000
0x20520000
0x810f0101
0x40000000
0x20530000
0x810f0101
0x40000000
0x20610000
0x810f0101
0x40000000
0x20620000
0x810f0101
0x40000000
0x20630000
0x810f0101
0x40000000
0x20700000
0x810f0101
0x40000000
0x20710000
0x810f0101
0x40000000
0x20720000
0x810f0101
0x40000000
0X00000000
0X00000000
0X00000002
0X0000000c
0X00000001
