0X20 	 0X24010b 	 1764 
0X21 	 0X24010b 	 1765 
0X22 	 0X24010b 	 1754 
0X23 	 0X24010b 	 1755 
0X24 	 0X24010b 	 1758 
0X25 	 0X24010b 	 1759 
0X26 	 0X24010b 	 1762 
0X27 	 0X24010b 	 1763 
0X28 	 0X24010b 	 1766 
0X29 	 0X24010b 	 1767 
0X30 	 0X24010b 	 1730 
0X31 	 0X24010b 	 1731 
0X32 	 0X24010b 	 1734 
0X33 	 0X24010b 	 1735 
0X34 	 0X24010b 	 1738 
0X35 	 0X24010b 	 1739 
0X36 	 0X24010b 	 1742 
0X37 	 0X24010b 	 1743 
0X38 	 0X24010b 	 1746 
0X39 	 0X24010b 	 1747 
0X3a 	 0X24010b 	 1750 
0X3b 	 0X24010b 	 1751 
0X40 	 0X24010b 	 1328 
0X41 	 0X24010b 	 1329 
0X42 	 0X24010b 	 1316 
0X43 	 0X24010b 	 1317 
0X44 	 0X24010b 	 1304 
0X45 	 0X24010b 	 1305 
0X46 	 0X24010b 	 1322 
0X47 	 0X24010b 	 1323 
0X48 	 0X24010b 	 1310 
0X49 	 0X24010b 	 1311 
0X50 	 0X24010b 	 1340 
0X51 	 0X24010b 	 1341 
0X52 	 0X24010b 	 1334 
0X53 	 0X24010b 	 1335 
0X54 	 0X24010b 	 1346 
0X55 	 0X24010b 	 1347 
0X56 	 0X24010b 	 1358 
0X57 	 0X24010b 	 1359 
0X58 	 0X24010b 	 1352 
0X59 	 0X24010b 	 1353 
0X60 	 0X24010b 	 1604 
0X61 	 0X24010b 	 1605 
0X62 	 0X24010b 	 1600 
0X63 	 0X24010b 	 1601 
0X64 	 0X24010b 	 1596 
0X65 	 0X24010b 	 1597 
0X66 	 0X24010b 	 1592 
0X67 	 0X24010b 	 1593 
0X68 	 0X24010b 	 1588 
0X69 	 0X24010b 	 1589 
0X6a 	 0X24010b 	 1584 
0X6b 	 0X24010b 	 1585 
0X70 	 0X24010b 	 1576 
0X71 	 0X24010b 	 1577 
0X72 	 0X24010b 	 1572 
0X73 	 0X24010b 	 1573 
0X74 	 0X24010b 	 1568 
0X75 	 0X24010b 	 1569 
0X76 	 0X24010b 	 1564 
0X77 	 0X24010b 	 1565 
0X78 	 0X24010b 	 1560 
0X79 	 0X24010b 	 1561 
0X7a 	 0X24010b 	 1556 
0X7b 	 0X24010b 	 1557 
