0Xee1234ee
0X00000009
0X03010000
0X00130116
0X0000face
0X01000000
0X00000337
0X00000088
0X00000000
0x20000000
0x810f0101
0x40000000
0x20100000
0x810f0101
0x40000000
0x20200000
0x810f0101
0x40000000
0x20300000
0x810f0101
0x40000000
0x20500000
0x810f0101
0x40000000
0x20600000
0x810f0101
0x40000000
0x20700000
0x810f0101
0x40000000
0X00000000
0X00000000
0X00000002
0X0000000c
0X00000001
