0X20 	 0X21000e 	 2132 
0X21 	 0X21000e 	 2133 
0X22 	 0X21000e 	 2134 
0X23 	 0X21000e 	 2135 
0X24 	 0X21000e 	 2136 
0X25 	 0X21000e 	 2137 
0X26 	 0X21000e 	 2138 
0X27 	 0X21000e 	 2139 
0X28 	 0X21000e 	 2140 
0X29 	 0X21000e 	 2141 
0X2a 	 0X21000e 	 2142 
0X2b 	 0X21000e 	 2143 
0X30 	 0X21000e 	 2156 
0X31 	 0X21000e 	 2157 
0X32 	 0X21000e 	 2158 
0X33 	 0X21000e 	 2159 
0X34 	 0X21000e 	 2160 
0X35 	 0X21000e 	 2161 
0X36 	 0X21000e 	 2162 
0X37 	 0X21000e 	 2163 
0X38 	 0X21000e 	 2164 
0X39 	 0X21000e 	 2165 
0X3a 	 0X21000e 	 2166 
0X3b 	 0X21000e 	 2167 
0X60 	 0X21000e 	 2948 
0X61 	 0X21000e 	 2949 
0X62 	 0X21000e 	 2950 
0X63 	 0X21000e 	 2951 
0X64 	 0X21000e 	 2952 
0X65 	 0X21000e 	 2953 
0X66 	 0X21000e 	 2954 
0X67 	 0X21000e 	 2955 
0X68 	 0X21000e 	 2956 
0X69 	 0X21000e 	 2957 
0X6a 	 0X21000e 	 2958 
0X6b 	 0X21000e 	 2959 
0X70 	 0X21000e 	 2972 
0X71 	 0X21000e 	 2973 
0X72 	 0X21000e 	 2974 
0X73 	 0X21000e 	 2975 
0X74 	 0X21000e 	 2976 
0X75 	 0X21000e 	 2977 
0X76 	 0X21000e 	 2978 
0X77 	 0X21000e 	 2979 
0X78 	 0X21000e 	 2980 
0X79 	 0X21000e 	 2981 
0X7a 	 0X21000e 	 2982 
0X7b 	 0X21000e 	 2983 
