####################################
#Number of FTK Towers
####################################
NumberOfFTKTowers 32
####################################
#Mapping between Board Number to Physical Location (ShelfAndSlot)
#Key Board Shelf Slot
####################################
BoardNToShelfAndSlot   0  1   3
BoardNToShelfAndSlot   1  2   3
BoardNToShelfAndSlot   2  3   3
BoardNToShelfAndSlot   3  4   3
BoardNToShelfAndSlot   4  1   4
BoardNToShelfAndSlot   5  2   4
BoardNToShelfAndSlot   6  3   4
BoardNToShelfAndSlot   7  4   4
BoardNToShelfAndSlot   8  1   5
BoardNToShelfAndSlot   9  2   5
BoardNToShelfAndSlot  10  3   5
BoardNToShelfAndSlot  11  4   5
BoardNToShelfAndSlot  12  1   6
BoardNToShelfAndSlot  13  2   6
BoardNToShelfAndSlot  14  3   6
BoardNToShelfAndSlot  15  4   6
BoardNToShelfAndSlot  16  1   7
BoardNToShelfAndSlot  17  2   7
BoardNToShelfAndSlot  18  3   7
BoardNToShelfAndSlot  19  4   7
BoardNToShelfAndSlot  20  1   8
BoardNToShelfAndSlot  21  2   8
BoardNToShelfAndSlot  22  3   8
BoardNToShelfAndSlot  23  4   8
BoardNToShelfAndSlot  24  1   9
BoardNToShelfAndSlot  25  2   9
BoardNToShelfAndSlot  26  3   9
BoardNToShelfAndSlot  27  4   9
BoardNToShelfAndSlot  28  1  10
BoardNToShelfAndSlot  29  2  10
BoardNToShelfAndSlot  30  3  10
BoardNToShelfAndSlot  31  4  10
####################################
#=========================================
# Mapping between FTK plane and output bit
#=========================================
#Key Plane OutBit
####################################
PlaneToOutBit  0 8
PlaneToOutBit  1 0
PlaneToOutBit  2 1
PlaneToOutBit  3 2
PlaneToOutBit  4 3
PlaneToOutBit  5 8
PlaneToOutBit  6 4
PlaneToOutBit  7 5
PlaneToOutBit  8 6
PlaneToOutBit  9 8
PlaneToOutBit 10 7
PlaneToOutBit 11 8
####################################
#======================================================================
# Mapping between DF board ID and tower assignment
#======================================================================
# Key BoardN TowerN
####################################
BoardNToTopTower 0 1
BoardNToTopTower 1 3
BoardNToTopTower 2 5
BoardNToTopTower 3 7
BoardNToTopTower 4 9
BoardNToTopTower 5 11
BoardNToTopTower 6 13
BoardNToTopTower 7 15
BoardNToTopTower 8 17
BoardNToTopTower 9 19
BoardNToTopTower 10 21
BoardNToTopTower 11 23
BoardNToTopTower 12 25
BoardNToTopTower 13 27
BoardNToTopTower 14 29
BoardNToTopTower 15 31
BoardNToTopTower 16 2
BoardNToTopTower 17 4
BoardNToTopTower 18 6
BoardNToTopTower 19 0
BoardNToTopTower 20 10
BoardNToTopTower 21 12
BoardNToTopTower 22 14
BoardNToTopTower 23 8
BoardNToTopTower 24 18
BoardNToTopTower 25 20
BoardNToTopTower 26 22
BoardNToTopTower 27 16
BoardNToTopTower 28 26
BoardNToTopTower 29 28
BoardNToTopTower 30 30
BoardNToTopTower 31 24
####################################
#======================================================================
# Mapping between ATCA Fabric Channel and Output bit
#======================================================================
# Key Channel Bit
####################################
ChanToOutBit  3  0
ChanToOutBit  4  8
ChanToOutBit  5  4
ChanToOutBit  6 12
ChanToOutBit  7  2
ChanToOutBit  8 10
ChanToOutBit  9  6
ChanToOutBit 10  3
ChanToOutBit 11  5
ChanToOutBit 12  7
####################################
#======================================================================
# Mapping between DF DF Fiber Connection
#======================================================================
####################################
# Key Board1 Board2
DFFiberConnection 0 14
DFFiberConnection 2 17
DFFiberConnection 3 18
DFFiberConnection 4 23
DFFiberConnection 6 21
DFFiberConnection 7 22
DFFiberConnection 8 27
DFFiberConnection 9 24
DFFiberConnection 10 25
DFFiberConnection 11 26
DFFiberConnection 12 31
DFFiberConnection 13 28
DFFiberConnection 19 29
DFFiberConnection 15 30
DFFiberConnection 1 16
DFFiberConnection 5 20
