0X10 	 0X121617 	 1945 
0X11 	 0X121617 	 1940 
0X20 	 0X121617 	 1941 
0X21 	 0X121617 	 1944 
0X30 	 0X121617 	 1943 
0X31 	 0X121617 	 1942 
0X50 	 0X121617 	 1951 
0X51 	 0X121617 	 1946 
0X60 	 0X121617 	 1947 
0X61 	 0X121617 	 1950 
0X70 	 0X121617 	 1949 
0X71 	 0X121617 	 1948 
