0X01 	 0X111706 	 728 
0X10 	 0X111706 	 727 
0X11 	 0X111706 	 726 
0X20 	 0X111706 	 725 
0X21 	 0X111706 	 724 
0X30 	 0X111706 	 723 
0X31 	 0X111706 	 722 
0X50 	 0X111706 	 740 
0X51 	 0X111706 	 739 
0X60 	 0X111706 	 738 
0X61 	 0X111706 	 737 
0X70 	 0X111706 	 736 
0X71 	 0X111706 	 735 
