0X01 	 0X111721 	 1196 
0X10 	 0X111721 	 1195 
0X11 	 0X111721 	 1194 
0X20 	 0X111721 	 1193 
0X21 	 0X111721 	 1192 
0X30 	 0X111721 	 1191 
0X31 	 0X111721 	 1190 
0X50 	 0X111721 	 1208 
0X51 	 0X111721 	 1207 
0X60 	 0X111721 	 1206 
0X61 	 0X111721 	 1205 
0X70 	 0X111721 	 1204 
0X71 	 0X111721 	 1203 
