0X00 	 0X230009 	 7912 
0X01 	 0X230009 	 7913 
0X02 	 0X230009 	 7908 
0X03 	 0X230009 	 7909 
0X04 	 0X230009 	 7904 
0X05 	 0X230009 	 7905 
0X06 	 0X230009 	 7900 
0X07 	 0X230009 	 7901 
0X08 	 0X230009 	 7896 
0X09 	 0X230009 	 7897 
0X0a 	 0X230009 	 7892 
0X0b 	 0X230009 	 7893 
0X10 	 0X230009 	 7940 
0X11 	 0X230009 	 7941 
0X12 	 0X230009 	 7936 
0X13 	 0X230009 	 7937 
0X14 	 0X230009 	 7932 
0X15 	 0X230009 	 7933 
0X16 	 0X230009 	 7928 
0X17 	 0X230009 	 7929 
0X18 	 0X230009 	 7924 
0X19 	 0X230009 	 7925 
0X1a 	 0X230009 	 7920 
0X1b 	 0X230009 	 7921 
0X60 	 0X230009 	 7476 
0X61 	 0X230009 	 7477 
0X62 	 0X230009 	 7470 
0X63 	 0X230009 	 7471 
0X64 	 0X230009 	 7464 
0X65 	 0X230009 	 7465 
0X66 	 0X230009 	 7458 
0X67 	 0X230009 	 7459 
0X68 	 0X230009 	 7452 
0X69 	 0X230009 	 7453 
0X6a 	 0X230009 	 7446 
0X6b 	 0X230009 	 7447 
0X70 	 0X230009 	 7518 
0X71 	 0X230009 	 7519 
0X72 	 0X230009 	 7512 
0X73 	 0X230009 	 7513 
0X74 	 0X230009 	 7506 
0X75 	 0X230009 	 7507 
0X76 	 0X230009 	 7500 
0X77 	 0X230009 	 7501 
0X78 	 0X230009 	 7494 
0X79 	 0X230009 	 7495 
0X7a 	 0X230009 	 7488 
0X7b 	 0X230009 	 7489 
