0X20 	 0X22000a 	 4914 
0X21 	 0X22000a 	 4915 
0X22 	 0X22000a 	 4912 
0X23 	 0X22000a 	 4913 
0X24 	 0X22000a 	 4910 
0X25 	 0X22000a 	 4911 
0X26 	 0X22000a 	 4908 
0X27 	 0X22000a 	 4909 
0X28 	 0X22000a 	 4906 
0X29 	 0X22000a 	 4907 
0X2a 	 0X22000a 	 4904 
0X2b 	 0X22000a 	 4905 
0X30 	 0X22000a 	 4938 
0X31 	 0X22000a 	 4939 
0X32 	 0X22000a 	 4936 
0X33 	 0X22000a 	 4937 
0X34 	 0X22000a 	 4934 
0X35 	 0X22000a 	 4935 
0X36 	 0X22000a 	 4932 
0X37 	 0X22000a 	 4933 
0X38 	 0X22000a 	 4930 
0X39 	 0X22000a 	 4931 
0X3a 	 0X22000a 	 4928 
0X3b 	 0X22000a 	 4929 
0X40 	 0X22000a 	 2034 
0X41 	 0X22000a 	 2035 
0X42 	 0X22000a 	 2032 
0X43 	 0X22000a 	 2033 
0X44 	 0X22000a 	 2030 
0X45 	 0X22000a 	 2031 
0X46 	 0X22000a 	 2028 
0X47 	 0X22000a 	 2029 
0X48 	 0X22000a 	 2026 
0X49 	 0X22000a 	 2027 
0X4a 	 0X22000a 	 2024 
0X4b 	 0X22000a 	 2025 
0X50 	 0X22000a 	 2058 
0X51 	 0X22000a 	 2059 
0X52 	 0X22000a 	 2056 
0X53 	 0X22000a 	 2057 
0X54 	 0X22000a 	 2054 
0X55 	 0X22000a 	 2055 
0X56 	 0X22000a 	 2052 
0X57 	 0X22000a 	 2053 
0X58 	 0X22000a 	 2050 
0X59 	 0X22000a 	 2051 
0X5a 	 0X22000a 	 2048 
0X5b 	 0X22000a 	 2049 
0X60 	 0X22000a 	 4962 
0X61 	 0X22000a 	 4963 
0X62 	 0X22000a 	 4960 
0X63 	 0X22000a 	 4961 
0X64 	 0X22000a 	 4958 
0X65 	 0X22000a 	 4959 
0X66 	 0X22000a 	 4956 
0X67 	 0X22000a 	 4957 
0X68 	 0X22000a 	 4954 
0X69 	 0X22000a 	 4955 
0X6a 	 0X22000a 	 4952 
0X6b 	 0X22000a 	 4953 
0X70 	 0X22000a 	 4986 
0X71 	 0X22000a 	 4987 
0X72 	 0X22000a 	 4984 
0X73 	 0X22000a 	 4985 
0X74 	 0X22000a 	 4982 
0X75 	 0X22000a 	 4983 
0X76 	 0X22000a 	 4980 
0X77 	 0X22000a 	 4981 
0X78 	 0X22000a 	 4978 
0X79 	 0X22000a 	 4979 
0X7a 	 0X22000a 	 4976 
0X7b 	 0X22000a 	 4977 
