0X10 	 0X111807 	 807 
0X11 	 0X111807 	 808 
0X20 	 0X111807 	 809 
0X21 	 0X111807 	 810 
0X30 	 0X111807 	 811 
0X31 	 0X111807 	 812 
0X41 	 0X111807 	 767 
0X50 	 0X111807 	 768 
0X51 	 0X111807 	 769 
0X60 	 0X111807 	 770 
0X61 	 0X111807 	 771 
0X70 	 0X111807 	 772 
0X71 	 0X111807 	 773 
