0X01 	 0X120218 	 21 
0X10 	 0X120218 	 20 
0X11 	 0X120218 	 19 
0X20 	 0X120218 	 22 
0X21 	 0X120218 	 23 
0X30 	 0X120218 	 18 
0X50 	 0X120218 	 114 
0X51 	 0X120218 	 119 
0X60 	 0X120218 	 118 
0X61 	 0X120218 	 115 
0X70 	 0X120218 	 116 
0X71 	 0X120218 	 117 
