0X20 	 0X23010f 	 6636 
0X21 	 0X23010f 	 6637 
0X22 	 0X23010f 	 6584 
0X23 	 0X23010f 	 6585 
0X24 	 0X23010f 	 6578 
0X25 	 0X23010f 	 6579 
0X26 	 0X23010f 	 6572 
0X27 	 0X23010f 	 6573 
0X28 	 0X23010f 	 6566 
0X29 	 0X23010f 	 6567 
0X30 	 0X23010f 	 6620 
0X31 	 0X23010f 	 6621 
0X32 	 0X23010f 	 6614 
0X33 	 0X23010f 	 6615 
0X34 	 0X23010f 	 6608 
0X35 	 0X23010f 	 6609 
0X36 	 0X23010f 	 6602 
0X37 	 0X23010f 	 6603 
0X38 	 0X23010f 	 6596 
0X39 	 0X23010f 	 6597 
0X3a 	 0X23010f 	 6590 
0X3b 	 0X23010f 	 6591 
0X40 	 0X23010f 	 6634 
0X41 	 0X23010f 	 6635 
0X42 	 0X23010f 	 6632 
0X43 	 0X23010f 	 6633 
0X44 	 0X23010f 	 6630 
0X45 	 0X23010f 	 6631 
0X46 	 0X23010f 	 6628 
0X47 	 0X23010f 	 6629 
0X48 	 0X23010f 	 6626 
0X49 	 0X23010f 	 6627 
0X4a 	 0X23010f 	 6624 
0X4b 	 0X23010f 	 6625 
0X50 	 0X23010f 	 6384 
0X51 	 0X23010f 	 6385 
0X52 	 0X23010f 	 6646 
0X53 	 0X23010f 	 6647 
0X54 	 0X23010f 	 6644 
0X55 	 0X23010f 	 6645 
0X56 	 0X23010f 	 6642 
0X57 	 0X23010f 	 6643 
0X58 	 0X23010f 	 6640 
0X59 	 0X23010f 	 6641 
0X5a 	 0X23010f 	 6638 
0X5b 	 0X23010f 	 6639 
0X60 	 0X23010f 	 6898 
0X61 	 0X23010f 	 6899 
0X62 	 0X23010f 	 6896 
0X63 	 0X23010f 	 6897 
0X64 	 0X23010f 	 6894 
0X65 	 0X23010f 	 6895 
0X66 	 0X23010f 	 6892 
0X67 	 0X23010f 	 6893 
0X68 	 0X23010f 	 6890 
0X69 	 0X23010f 	 6891 
0X6a 	 0X23010f 	 6888 
0X6b 	 0X23010f 	 6889 
0X70 	 0X23010f 	 6648 
0X71 	 0X23010f 	 6649 
0X72 	 0X23010f 	 6910 
0X73 	 0X23010f 	 6911 
0X74 	 0X23010f 	 6908 
0X75 	 0X23010f 	 6909 
0X76 	 0X23010f 	 6906 
0X77 	 0X23010f 	 6907 
0X78 	 0X23010f 	 6904 
0X79 	 0X23010f 	 6905 
0X7a 	 0X23010f 	 6902 
0X7b 	 0X23010f 	 6903 
