0X10 	 0X111717 	 1104 
0X11 	 0X111717 	 1103 
0X20 	 0X111717 	 1102 
0X21 	 0X111717 	 1101 
0X30 	 0X111717 	 1100 
0X31 	 0X111717 	 1099 
0X41 	 0X111717 	 962 
0X50 	 0X111717 	 961 
0X51 	 0X111717 	 960 
0X60 	 0X111717 	 959 
0X61 	 0X111717 	 958 
0X70 	 0X111717 	 957 
0X71 	 0X111717 	 956 
