0X01 	 0X112520 	 1456 
0X02 	 0X112520 	 1457 
0X03 	 0X112520 	 1458 
0X10 	 0X112520 	 1459 
0X11 	 0X112520 	 1460 
0X12 	 0X112520 	 1461 
0X13 	 0X112520 	 1462 
0X21 	 0X112520 	 1449 
0X22 	 0X112520 	 1448 
0X23 	 0X112520 	 1447 
0X30 	 0X112520 	 1446 
0X31 	 0X112520 	 1445 
0X32 	 0X112520 	 1444 
0X41 	 0X112520 	 1430 
0X42 	 0X112520 	 1431 
0X43 	 0X112520 	 1432 
0X50 	 0X112520 	 1433 
0X51 	 0X112520 	 1434 
0X52 	 0X112520 	 1435 
0X53 	 0X112520 	 1436 
0X61 	 0X112520 	 1423 
0X62 	 0X112520 	 1422 
0X63 	 0X112520 	 1421 
0X70 	 0X112520 	 1420 
0X71 	 0X112520 	 1419 
0X72 	 0X112520 	 1418 
