0X01 	 0X111810 	 910 
0X10 	 0X111810 	 909 
0X11 	 0X111810 	 908 
0X20 	 0X111810 	 907 
0X21 	 0X111810 	 906 
0X30 	 0X111810 	 905 
0X31 	 0X111810 	 904 
0X50 	 0X111810 	 792 
0X51 	 0X111810 	 791 
0X60 	 0X111810 	 790 
0X61 	 0X111810 	 789 
0X70 	 0X111810 	 788 
0X71 	 0X111810 	 787 
