0X00 	 0X210003 	 3572 
0X01 	 0X210003 	 3573 
0X02 	 0X210003 	 3574 
0X03 	 0X210003 	 3575 
0X04 	 0X210003 	 3576 
0X05 	 0X210003 	 3577 
0X06 	 0X210003 	 3578 
0X07 	 0X210003 	 3579 
0X08 	 0X210003 	 3580 
0X09 	 0X210003 	 3581 
0X0a 	 0X210003 	 3582 
0X0b 	 0X210003 	 3583 
0X10 	 0X210003 	 6020 
0X11 	 0X210003 	 6021 
0X12 	 0X210003 	 6022 
0X13 	 0X210003 	 6023 
0X14 	 0X210003 	 6024 
0X15 	 0X210003 	 6025 
0X16 	 0X210003 	 6026 
0X17 	 0X210003 	 6027 
0X18 	 0X210003 	 6028 
0X19 	 0X210003 	 6029 
0X1a 	 0X210003 	 6030 
0X1b 	 0X210003 	 6031 
0X40 	 0X210003 	 4676 
0X41 	 0X210003 	 4677 
0X42 	 0X210003 	 4678 
0X43 	 0X210003 	 4679 
0X44 	 0X210003 	 4680 
0X45 	 0X210003 	 4681 
0X46 	 0X210003 	 4682 
0X47 	 0X210003 	 4683 
0X48 	 0X210003 	 4684 
0X49 	 0X210003 	 4685 
0X4a 	 0X210003 	 4686 
0X4b 	 0X210003 	 4687 
0X50 	 0X210003 	 4700 
0X51 	 0X210003 	 4701 
0X52 	 0X210003 	 4702 
0X53 	 0X210003 	 4703 
0X54 	 0X210003 	 4704 
0X55 	 0X210003 	 4705 
0X56 	 0X210003 	 4706 
0X57 	 0X210003 	 4707 
0X58 	 0X210003 	 4708 
0X59 	 0X210003 	 4709 
0X5a 	 0X210003 	 4710 
0X5b 	 0X210003 	 4711 
0X60 	 0X210003 	 5972 
0X61 	 0X210003 	 5973 
0X62 	 0X210003 	 5974 
0X63 	 0X210003 	 5975 
0X64 	 0X210003 	 5976 
0X65 	 0X210003 	 5977 
0X66 	 0X210003 	 5978 
0X67 	 0X210003 	 5979 
0X68 	 0X210003 	 5980 
0X69 	 0X210003 	 5981 
0X6a 	 0X210003 	 5982 
0X6b 	 0X210003 	 5983 
0X70 	 0X210003 	 5996 
0X71 	 0X210003 	 5997 
0X72 	 0X210003 	 5998 
0X73 	 0X210003 	 5999 
0X74 	 0X210003 	 6000 
0X75 	 0X210003 	 6001 
0X76 	 0X210003 	 6002 
0X77 	 0X210003 	 6003 
0X78 	 0X210003 	 6004 
0X79 	 0X210003 	 6005 
0X7a 	 0X210003 	 6006 
0X7b 	 0X210003 	 6007 
