800000000
Db0f00000
Cee1234ee
C00000009
C03010000
C00140101
C0000face
E01000000
C00000337
C00000088
C00000000
C20070000
C810f0101
C40000000
C20060000
C810f0101
C40000000
C20050000
C810f0101
C40000000
C20040000
C810f0101
C40000000
C20020000
C810f0101
C40000000
C20000000
C810f0101
C40000000
C00000000
C00000000
C00000002
C0000000c
C00000001
De0f00000
800000000
800000000
800000000
000000000
000000000
