0X10 	 0X112509 	 974 
0X11 	 0X112509 	 973 
0X20 	 0X112509 	 972 
0X21 	 0X112509 	 971 
0X30 	 0X112509 	 970 
0X31 	 0X112509 	 969 
0X41 	 0X112509 	 1092 
0X50 	 0X112509 	 1091 
0X51 	 0X112509 	 1090 
0X60 	 0X112509 	 1089 
0X61 	 0X112509 	 1088 
0X70 	 0X112509 	 1087 
0X71 	 0X112509 	 1086 
