0X20 	 0X21010f 	 4484 
0X21 	 0X21010f 	 4485 
0X22 	 0X21010f 	 4486 
0X23 	 0X21010f 	 4487 
0X24 	 0X21010f 	 4488 
0X25 	 0X21010f 	 4489 
0X26 	 0X21010f 	 4490 
0X27 	 0X21010f 	 4491 
0X28 	 0X21010f 	 4492 
0X29 	 0X21010f 	 4493 
0X2a 	 0X21010f 	 4494 
0X2b 	 0X21010f 	 4495 
0X30 	 0X21010f 	 4508 
0X31 	 0X21010f 	 4509 
0X32 	 0X21010f 	 4510 
0X33 	 0X21010f 	 4511 
0X34 	 0X21010f 	 4512 
0X35 	 0X21010f 	 4513 
0X36 	 0X21010f 	 4514 
0X37 	 0X21010f 	 4515 
0X38 	 0X21010f 	 4516 
0X39 	 0X21010f 	 4517 
0X3a 	 0X21010f 	 4518 
0X3b 	 0X21010f 	 4519 
0X40 	 0X21010f 	 4532 
0X41 	 0X21010f 	 4533 
0X42 	 0X21010f 	 4534 
0X43 	 0X21010f 	 4535 
0X44 	 0X21010f 	 4536 
0X45 	 0X21010f 	 4537 
0X46 	 0X21010f 	 4538 
0X47 	 0X21010f 	 4539 
0X48 	 0X21010f 	 4540 
0X49 	 0X21010f 	 4541 
0X4a 	 0X21010f 	 4542 
0X4b 	 0X21010f 	 4543 
0X50 	 0X21010f 	 4556 
0X51 	 0X21010f 	 4557 
0X52 	 0X21010f 	 4558 
0X53 	 0X21010f 	 4559 
0X54 	 0X21010f 	 4560 
0X55 	 0X21010f 	 4561 
0X56 	 0X21010f 	 4562 
0X57 	 0X21010f 	 4563 
0X58 	 0X21010f 	 4564 
0X59 	 0X21010f 	 4565 
0X5a 	 0X21010f 	 4566 
0X5b 	 0X21010f 	 4567 
0X60 	 0X21010f 	 5828 
0X61 	 0X21010f 	 5829 
0X62 	 0X21010f 	 5830 
0X63 	 0X21010f 	 5831 
0X64 	 0X21010f 	 5832 
0X65 	 0X21010f 	 5833 
0X66 	 0X21010f 	 5834 
0X67 	 0X21010f 	 5835 
0X68 	 0X21010f 	 5836 
0X69 	 0X21010f 	 5837 
0X6a 	 0X21010f 	 5838 
0X6b 	 0X21010f 	 5839 
0X70 	 0X21010f 	 5852 
0X71 	 0X21010f 	 5853 
0X72 	 0X21010f 	 5854 
0X73 	 0X21010f 	 5855 
0X74 	 0X21010f 	 5856 
0X75 	 0X21010f 	 5857 
0X76 	 0X21010f 	 5858 
0X77 	 0X21010f 	 5859 
0X78 	 0X21010f 	 5860 
0X79 	 0X21010f 	 5861 
0X7a 	 0X21010f 	 5862 
0X7b 	 0X21010f 	 5863 
