0X20 	 0X240003 	 656 
0X21 	 0X240003 	 657 
0X22 	 0X240003 	 644 
0X23 	 0X240003 	 645 
0X24 	 0X240003 	 632 
0X25 	 0X240003 	 633 
0X26 	 0X240003 	 650 
0X27 	 0X240003 	 651 
0X28 	 0X240003 	 638 
0X29 	 0X240003 	 639 
0X30 	 0X240003 	 668 
0X31 	 0X240003 	 669 
0X32 	 0X240003 	 662 
0X33 	 0X240003 	 663 
0X34 	 0X240003 	 674 
0X35 	 0X240003 	 675 
0X36 	 0X240003 	 686 
0X37 	 0X240003 	 687 
0X38 	 0X240003 	 680 
0X39 	 0X240003 	 681 
0X40 	 0X240003 	 1184 
0X41 	 0X240003 	 1185 
0X42 	 0X240003 	 1172 
0X43 	 0X240003 	 1173 
0X44 	 0X240003 	 1160 
0X45 	 0X240003 	 1161 
0X46 	 0X240003 	 1178 
0X47 	 0X240003 	 1179 
0X48 	 0X240003 	 1166 
0X49 	 0X240003 	 1167 
0X50 	 0X240003 	 1196 
0X51 	 0X240003 	 1197 
0X52 	 0X240003 	 1190 
0X53 	 0X240003 	 1191 
0X54 	 0X240003 	 1202 
0X55 	 0X240003 	 1203 
0X56 	 0X240003 	 1214 
0X57 	 0X240003 	 1215 
0X58 	 0X240003 	 1208 
0X59 	 0X240003 	 1209 
0X62 	 0X240003 	 1662 
0X63 	 0X240003 	 1663 
0X64 	 0X240003 	 1658 
0X65 	 0X240003 	 1659 
0X66 	 0X240003 	 1654 
0X67 	 0X240003 	 1655 
0X68 	 0X240003 	 1650 
0X69 	 0X240003 	 1651 
0X6a 	 0X240003 	 1674 
0X6b 	 0X240003 	 1675 
0X70 	 0X240003 	 1646 
0X71 	 0X240003 	 1647 
0X72 	 0X240003 	 1642 
0X73 	 0X240003 	 1643 
0X74 	 0X240003 	 1638 
0X75 	 0X240003 	 1639 
0X76 	 0X240003 	 1634 
0X77 	 0X240003 	 1635 
0X78 	 0X240003 	 1630 
0X79 	 0X240003 	 1631 
0X7a 	 0X240003 	 1626 
0X7b 	 0X240003 	 1627 
