0X20 	 0X210004 	 3596 
0X21 	 0X210004 	 3597 
0X22 	 0X210004 	 3598 
0X23 	 0X210004 	 3599 
0X24 	 0X210004 	 3600 
0X25 	 0X210004 	 3601 
0X26 	 0X210004 	 3602 
0X27 	 0X210004 	 3603 
0X28 	 0X210004 	 3604 
0X29 	 0X210004 	 3605 
0X2a 	 0X210004 	 3606 
0X2b 	 0X210004 	 3607 
0X30 	 0X210004 	 6044 
0X31 	 0X210004 	 6045 
0X32 	 0X210004 	 6046 
0X33 	 0X210004 	 6047 
0X34 	 0X210004 	 6048 
0X35 	 0X210004 	 6049 
0X36 	 0X210004 	 6050 
0X37 	 0X210004 	 6051 
0X38 	 0X210004 	 6052 
0X39 	 0X210004 	 6053 
0X3a 	 0X210004 	 6054 
0X3b 	 0X210004 	 6055 
0X60 	 0X210004 	 2660 
0X61 	 0X210004 	 2661 
0X62 	 0X210004 	 2662 
0X63 	 0X210004 	 2663 
0X64 	 0X210004 	 2664 
0X65 	 0X210004 	 2665 
0X66 	 0X210004 	 2666 
0X67 	 0X210004 	 2667 
0X68 	 0X210004 	 2668 
0X69 	 0X210004 	 2669 
0X6a 	 0X210004 	 2670 
0X6b 	 0X210004 	 2671 
0X70 	 0X210004 	 2684 
0X71 	 0X210004 	 2685 
0X72 	 0X210004 	 2686 
0X73 	 0X210004 	 2687 
0X74 	 0X210004 	 2688 
0X75 	 0X210004 	 2689 
0X76 	 0X210004 	 2690 
0X77 	 0X210004 	 2691 
0X78 	 0X210004 	 2692 
0X79 	 0X210004 	 2693 
0X7a 	 0X210004 	 2694 
0X7b 	 0X210004 	 2695 
