0	0x0000000d
1	0x00000001
0	0x00000026
1	0x00000002
0	0x00000029
1	0x00000003
0	0x00000016
1	0x00000004
0	0x00000012
1	0x00000005
0	0x00000009
1	0x00000006
0	0x00000023
1	0x00000007
0	0x00000021
1	0x00000008
0	0x00000025
1	0x00000009
0	0x0000001c
1	0x0000000a
