f7800000
fb480343
fb480363
fb4803b0
ff4803c6
f7800001
bf240449
ff24044a
f7800002
fe3804f5
ff3a01e8
fb3a0203
fd4a0736
fd4a07d3
fb4c008c
bf4c00a2
ff4c00a3
fd4c00d4
fe4e02db
ff5c0263
7f5c0264
fe5c07df
fe720702
ff7400cd
bf7400ce
fd740166
fd7c07eb
ff7e0074
fb7e008e
fb7e00be
fb7e00f9
f7800003
fd0e0646
ff1000fb
bf1000fd
fb1001a6
fe10054b
fe2c002c
fb2c066b
df2c06a7
ff2c06a8
ff4405be
bf4405c0
fb4405d3
bf500094
ff500095
fe50074a
f75202c5
ff5202cb
f7800004
fd4802da
fd48038a
bf4804b8
ff4804ba
f74804bc
fe4a037e
f7800005
f7800006
fb1c06c8
df1c0710
bf1c0711
ff1c0713
f7800007
fb0a0146
fb0a0164
bf0a01d1
ff0a01d3
7f160119
ff16011a
fe160385
fd2a076f
ff2a07d4
fb30053b
fb30058c
ff3005fa
7f3005fb
fb300633
fd3007e2
fb6c056c
ff6c0582
f76c0588
fe6c05fa
f7800008
fe0a0608
fe0a0763
bf0e05eb
ff0e05ec
fb1a05f2
bf1a0646
ff1a0647
fe1a0769
f7800009
fe2807fe
f72a037b
ff2a0386
fb2a03c3
ff6a04c3
f76a04c9
fe6a0733
f780000a
fe4807a7
fb4a0401
7f4a0413
ff4a0414
bf4a0416
f780000b
f780000c
fe000471
fe000670
fe0404d3
ff060351
bf060353
ff2802fa
f780000d
f780000e
fb220272
ff2202b2
fd220309
df2a03a6
ff2a03a8
bf2a03aa
fb340339
7f340363
ff340364
bf340366
df340367
fe6a03a2
ff6a0675
f780000f
fb50061b
ef500679
df50067a
ff50067b
ff50067c
fb5006d1
ff5e037c
bf5e037d
fe660244
fe660248
fb6603dc
ef660405
ef660407
ff66040b
ff66040c
ff660410
7f660411
bf660413
fd6604a8
fd6604ac
f7800010
fb080501
bf080544
ff080545
ff380135
f7380138
fe580031
fb58017b
f7580194
ff580196
ef580198
fb5801b6
fb5801f3
fb5801f4
fb580213
fb580214
ff58025b
bf58025d
bf58025f
bf580269
bf58026b
ff58026c
fd5803c6
fe6a02ad
fb6a040c
fb6a0437
ff6a0477
7f6a0478
fb6a0498
fd6a063d
f7800011
7f1e0498
ff1e0499
bf1e049b
ef1e049f
fe1e065b
f72a02cf
ff2a02d3
7f4e04d1
ff4e04d2
f7800012
f73c046d
ff3c0471
ef3c0472
ff720171
fb7201dd
fe7e0163
ef7e025d
bf7e025f
7f7e0260
ff7e0261
df7e0265
f7800013
ff6a02e9
f7800014
bf5e017a
ff5e017c
f7800015
bf16074c
ff16074d
df160750
df50020b
7f50020f
ff500210
bf500212
ef500215
fe5e0619
ff600401
f7800016
fe180352
fd18057b
df18076f
ff180770
7f180771
fb1a0004
bf3407f4
ff3407f6
f7800017
f7800018
fd7a0026
bf7a00d1
ff7a00d2
fe7a0295
fe7a0723
fe7c003c
fb7e03a8
fb7e03b8
fb7e03cd
7f7e03dc
ff7e03dd
ef7e03df
fd7e0425
f7800019
fd3e0467
ff3e0488
fe3e0501
f780001a
fd04036a
ff0405eb
f70405f2
fb04064c
fb040691
fd36048e
ff3604f3
fb36050a
fe38019e
fe3c058b
fb6a04ff
bf6a0528
ff6a052a
ef6a052c
bf7c0304
ff7c0306
7f7c0307
f780001b
f780001c
f780001d
fe0c02c8
fe0c02d6
fb0c0487
ff0c04a5
fd0c051f
fe10040b
fd12055c
7f12064d
ff12064e
f73806ca
ff3806ce
fb380704
fb6c00ea
ff6c010d
f76c0113
fe6c030a
fe760066
ff760376
fb7603e0
f780001e
fb2a0048
ff2a007b
ef2a007c
fe2a0432
f780001f
fd04069c
fb04070a
bf0407e0
ff0407e1
fb060064
fd060702
fd060703
df080013
ff080016
fe080017
bf080018
fd2a00f1
ff2a02b6
ef2a02ba
fe2a0795
fb36004a
fb36004d
fb36004e
ff360094
fe360095
bf360096
ff360097
fd360128
fd360129
fd36012b
f7800020
ef380349
ff38034b
7f5806fd
ff5806fe
f7800021
fd5e0526
ff5e0586
bf5e0588
f7800022
df2806a2
ff2806a4
7f2806a5
fb2806ea
fb2807a7
fe2a02f6
f7800023
bf000485
ff000487
7f000488
fb0004ce
fd04006b
fb0400b2
fb040102
bf040182
ff040183
fb0401f5
f70604df
ff0801ca
fe0806bf
fe240440
ff260061
7f260062
fd2600cf
fe2e0170
ff2e061e
fb2e0636
fd2e0728
fd2e07ac
fe30014b
f7800024
fe0204b0
fe02056c
fe0807e1
ff0a0261
fd0a0276
ef0a0551
ff0a0553
f70a055f
fd7007d0
7f72007c
ff72007d
bf72007f
fe720242
7f7802ee
ff7802ef
bf7802f1
f7800025
f7800026
fe320041
ff32076e
fe34027a
f7800027
fd040033
fb0400d0
df040159
ff04015c
fb0401b0
fe04065e
f7800028
f7800029
fe0a03f7
fe0a04af
fd0c0708
7f0c072a
ff0c072b
bf0c072d
fd0c07b1
fd0e0014
fe0e012b
fe240459
fe240503
ff26006f
fd26011b
fe260216
fd7c0361
ff7c03e2
bf7c03e5
fe7c0506
f780002a
fb4e0646
ff4e065e
fe56009b
fb5606aa
ff5606bf
bf5a004e
ff5a004f
fe5c03f0
fe5c04ae
f780002b
fe020065
f7020229
bf020232
ff020233
df020236
fb020262
fb5e04e1
7f5e0534
ff5e0535
f780002c
ff500049
f750004f
fe50014f
ef500672
ff500674
fb5006bf
fd5200b2
f780002d
bf1c0061
ff1c0062
fb1c0079
fe2e0080
bf2e0115
ff2e0116
bf2e0117
ff2e0119
7f2e011a
f72e011d
fb3a0532
ff3a053d
bf3a053e
ef3e05ff
fd3e061e
fd400484
ef4004ab
ff4004ac
f74004b3
7f520410
ff520411
fe540015
f780002e
bf2402fd
ff2402ff
7f240300
fd240346
fe300405
fe300406
fb32069a
fb32069b
f732070f
f7320711
ff320719
ff32071a
ff32071b
7f32071c
ff32071d
7f32071e
7f320720
df320721
fd32075b
fd32075c
fe34016b
fe6e0004
fe6e00ab
fe6e0475
ff6e065a
bf6e065b
fd6e06a0
f780002f
ff3e01e2
bf3e01e3
fe50061e
ff520246
f7800030
f7800031
fb14057c
bf1405c2
7f1405c3
ff1405c4
f71405cd
fe1806b1
7f76016b
ff76016c
ef76016f
fd780540
7f780573
ff780574
fe78060e
f7800032
