0	0x000000e2
1	0x00000001
0	0x00000184
1	0x00000002
0	0x00000895
1	0x00000003
0	0x000005c8
1	0x00000004
0	0x00000335
1	0x00000005
0	0x00000388
1	0x00000006
0	0x00000ac4
1	0x00000007
0	0x000000ed
1	0x00000008
0	0x000005cc
1	0x00000009
0	0x000000ec
1	0x0000000a
0	0x00000342
1	0x0000000b
0	0x00000826
1	0x0000000c
0	0x0000034f
1	0x0000000d
0	0x00000367
1	0x0000000e
0	0x00000403
1	0x0000000f
0	0x00000615
1	0x00000010
0	0x000000b2
1	0x00000011
0	0x000008ca
1	0x00000012
0	0x0000085f
1	0x00000013
0	0x000007bf
1	0x00000014
0	0x0000038d
1	0x00000015
0	0x0000061a
1	0x00000016
0	0x000008e4
1	0x00000017
0	0x000002d8
1	0x00000018
0	0x00000812
1	0x00000019
0	0x000003cb
1	0x0000001a
0	0x0000087a
1	0x0000001b
0	0x000007e0
1	0x0000001c
0	0x000008af
1	0x0000001d
0	0x0000038d
1	0x0000001e
0	0x0000059e
1	0x0000001f
0	0x00000624
1	0x00000020
0	0x00000349
1	0x00000021
0	0x00000830
1	0x00000022
0	0x0000034c
1	0x00000023
0	0x0000088a
1	0x00000024
0	0x00000112
1	0x00000025
0	0x000005c4
1	0x00000026
0	0x000005c7
1	0x00000027
0	0x00000322
1	0x00000028
0	0x000008fd
1	0x00000029
0	0x0000093c
1	0x0000002a
0	0x00000b04
1	0x0000002b
0	0x00000907
1	0x0000002c
0	0x00000383
1	0x0000002d
0	0x000007ea
1	0x0000002e
0	0x00000352
1	0x0000002f
0	0x0000038a
1	0x00000030
0	0x000005f8
1	0x00000031
0	0x000000ed
1	0x00000032
0	0x0000039a
1	0x00000033
0	0x000006f6
1	0x00000034
0	0x00000588
1	0x00000035
0	0x00000630
1	0x00000036
0	0x0000080b
1	0x00000037
0	0x000000c9
1	0x00000038
0	0x0000085c
1	0x00000039
0	0x000005f7
1	0x0000003a
0	0x0000055e
1	0x0000003b
0	0x000005cd
1	0x0000003c
0	0x00000a81
1	0x0000003d
0	0x00000408
1	0x0000003e
0	0x000003d7
1	0x0000003f
0	0x00000374
1	0x00000040
