ROAD SPY STATUS: LAMB0
OSPY : 0000(- f) OSPY : 0000(- f) OSPY : 0000(- f) OSPY : 0000(- f) 
ROAD SPY STATUS: LAMB1
OSPY : 0000(- f) OSPY : 0000(- f) OSPY : 0000(- f) OSPY : 0000(- f) 
ROAD SPY STATUS: LAMB2
OSPY : 0000(- f) OSPY : 0000(- f) OSPY : 0000(- f) OSPY : 0000(- f) 
ROAD SPY STATUS: LAMB3
OSPY : 0000(- f) OSPY : 0000(- f) OSPY : 0000(- f) OSPY : 0000(- f) 
ROAD SPY STATUS: LAMB0
OSPY : 0001(- f) OSPY : 0001(- f) OSPY : 0001(- f) OSPY : 0001(- f) 
ROAD SPY STATUS: LAMB1
OSPY : 0001(- f) OSPY : 0001(- f) OSPY : 0001(- f) OSPY : 0001(- f) 
ROAD SPY STATUS: LAMB2
OSPY : 0001(- f) OSPY : 0001(- f) OSPY : 0001(- f) OSPY : 0001(- f) 
ROAD SPY STATUS: LAMB3
OSPY : 0001(- f) OSPY : 0001(- f) OSPY : 0001(- f) OSPY : 0001(- f) 
