0	0x000000e1
1	0x00000001
0	0x00000355
1	0x00000002
0	0x000000ed
1	0x00000003
0	0x000000ed
1	0x00000004
0	0x0000035b
1	0x00000005
0	0x000000cc
1	0x00000006
0	0x00000608
1	0x00000007
0	0x000005a5
1	0x00000008
0	0x00000582
1	0x00000009
0	0x000005ce
1	0x0000000a
