0	0x000000e2
1	0x00000001
0	0x000005b4
1	0x00000002
0	0x00000345
1	0x00000003
0	0x000000f1
1	0x00000004
0	0x00000362
1	0x00000005
0	0x000000cd
1	0x00000006
0	0x00000615
1	0x00000007
0	0x0000080b
1	0x00000008
0	0x00000591
1	0x00000009
0	0x00000833
1	0x0000000a
