0	0x000000e1
1	0x00000001
0	0x0000016c
1	0x00000002
0	0x0000062d
1	0x00000003
0	0x0000036a
1	0x00000004
0	0x0000032e
1	0x00000005
0	0x00000130
1	0x00000006
0	0x0000085b
1	0x00000007
0	0x000000eb
1	0x00000008
0	0x0000036c
1	0x00000009
0	0x000000e9
1	0x0000000a
0	0x00000337
1	0x0000000b
0	0x000005be
1	0x0000000c
0	0x0000031b
1	0x0000000d
0	0x0000035f
1	0x0000000e
0	0x000003d0
1	0x0000000f
0	0x000005da
1	0x00000010
0	0x000000b2
1	0x00000011
0	0x0000064f
1	0x00000012
0	0x000005fa
1	0x00000013
0	0x00000545
1	0x00000014
0	0x00000386
1	0x00000015
0	0x000003bc
1	0x00000016
0	0x0000066a
1	0x00000017
0	0x0000007f
1	0x00000018
0	0x000007ff
1	0x00000019
0	0x00000174
1	0x0000001a
0	0x00000614
1	0x0000001b
0	0x00000563
1	0x0000001c
0	0x00000636
1	0x0000001d
0	0x0000039c
1	0x0000001e
0	0x0000033f
1	0x0000001f
0	0x000003b0
1	0x00000020
0	0x000000ef
1	0x00000021
0	0x000005b5
1	0x00000022
0	0x00000347
1	0x00000023
0	0x000005fb
1	0x00000024
0	0x000000e3
1	0x00000025
0	0x00000367
1	0x00000026
0	0x0000036a
1	0x00000027
0	0x0000031c
1	0x00000028
0	0x0000066a
1	0x00000029
0	0x000006ab
1	0x0000002a
0	0x0000089d
1	0x0000002b
0	0x00000678
1	0x0000002c
0	0x0000037a
1	0x0000002d
0	0x0000059c
1	0x0000002e
0	0x0000034b
1	0x0000002f
0	0x00000387
1	0x00000030
0	0x00000399
1	0x00000031
0	0x000000ea
1	0x00000032
0	0x000003a7
1	0x00000033
0	0x0000046e
1	0x00000034
0	0x00000329
1	0x00000035
0	0x000003a5
1	0x00000036
0	0x000005a5
1	0x00000037
0	0x000000c8
1	0x00000038
0	0x000005cb
1	0x00000039
0	0x00000397
1	0x0000003a
0	0x000002e8
1	0x0000003b
0	0x0000036e
1	0x0000003c
0	0x00000819
1	0x0000003d
0	0x000003d4
1	0x0000003e
0	0x000003cf
1	0x0000003f
0	0x0000011b
1	0x00000040
