0	0x0000000b
1	0x00000001
0	0x00000007
1	0x00000002
0	0x00000015
1	0x00000003
0	0x00000019
1	0x00000004
0	0x0000001a
1	0x00000005
0	0x00000025
1	0x00000006
0	0x00000005
1	0x00000007
0	0x00000004
1	0x00000008
0	0x00000004
1	0x00000009
0	0x00000003
1	0x0000000a
0	0x00000029
1	0x0000000b
0	0x00000007
1	0x0000000c
0	0x0000001a
1	0x0000000d
0	0x0000001e
1	0x0000000e
0	0x00000022
1	0x0000000f
0	0x00000022
1	0x00000010
0	0x00000013
1	0x00000011
0	0x00000006
1	0x00000012
0	0x0000001b
1	0x00000013
0	0x0000001a
1	0x00000014
0	0x00000019
1	0x00000015
0	0x00000004
1	0x00000016
0	0x00000014
1	0x00000017
0	0x0000000c
1	0x00000018
0	0x0000000f
1	0x00000019
0	0x0000001e
1	0x0000001a
0	0x00000008
1	0x0000001b
0	0x00000012
1	0x0000001c
0	0x00000011
1	0x0000001d
0	0x00000011
1	0x0000001e
0	0x00000009
1	0x0000001f
0	0x00000008
1	0x00000020
0	0x00000012
1	0x00000021
0	0x0000002a
1	0x00000022
0	0x0000000e
1	0x00000023
0	0x00000008
1	0x00000024
0	0x00000019
1	0x00000025
0	0x00000016
1	0x00000026
0	0x0000002a
1	0x00000027
0	0x00000017
1	0x00000028
0	0x00000006
1	0x00000029
0	0x0000002b
1	0x0000002a
0	0x00000018
1	0x0000002b
0	0x0000001d
1	0x0000002c
0	0x0000000d
1	0x0000002d
0	0x00000021
1	0x0000002e
0	0x0000002e
1	0x0000002f
0	0x00000006
1	0x00000030
0	0x00000005
1	0x00000031
0	0x00000003
1	0x00000032
0	0x0000001f
1	0x00000033
0	0x00000003
1	0x00000034
0	0x00000009
1	0x00000035
0	0x0000000e
1	0x00000036
0	0x00000002
1	0x00000037
0	0x00000005
1	0x00000038
0	0x0000002b
1	0x00000039
0	0x00000019
1	0x0000003a
0	0x00000026
1	0x0000003b
0	0x00000020
1	0x0000003c
0	0x00000029
1	0x0000003d
0	0x00000023
1	0x0000003e
0	0x00000027
1	0x0000003f
0	0x0000000e
1	0x00000040
