0	0x00000026
1	0x00000001
0	0x0000001a
1	0x00000002
0	0x00000019
1	0x00000003
0	0x0000002c
1	0x00000004
0	0x00000009
1	0x00000005
0	0x00000020
1	0x00000006
0	0x00000013
1	0x00000007
0	0x00000017
1	0x00000008
0	0x00000026
1	0x00000009
0	0x00000014
1	0x0000000a
