0X800000000	0X800000000	0X800000000	0X800000000	0X800000000	0X800000000	0X800000000	0X800000000	0X800000000	0X800000000	0X800000000	0X800000000
0X005930593	0X008B708B7	0X00CA80CA8	0X0032D032D	0X004720472	0X400000000	0X005BC05BC	0X400000000	0X005BC05BC	0X400000000	0X007070707	0X400000000
0X800000001	0X800000001	0X800000001	0X800000001	0X800000001	0X800000001	0X800000001	0X800000001	0X800000001	0X800000001	0X800000001	0X800000001
0X0073B073B	0X00AC80AC8	0X0118A118A	0X0043C043C	0X005820582	0X400000000	0X006CB06CB	0X400000000	0X006CE06CE	0X400000000	0X008100810	0X400000000
0X800000002	0X800000002	0X800000002	0X800000002	0X800000002	0X800000002	0X800000002	0X800000002	0X800000002	0X800000002	0X800000002	0X800000002
0X000A8007A	0X000D308D5	0X00E6C00F6	0X005740068	0X000400066	0X400000000	0X006DC0045	0X400000000	0X000480093	0X400000000	0X00476082A	0X400000000
0X0058E04A3	0X00A400075	0X013F30C94	0X00440003D	0X0059C0328	0X400000000	0X0009406E8	0X400000000	0X006DF0461	0X400000000	0X0004B0091	0X400000000
0X007250725	0X00CFC0CFC	0X0006B006B	0X003130313	0X0058F058F	0X400000000	0X004610461	0X400000000	0X006EB06EB	0X400000000	0X008300830	0X400000000
0X800000003	0X800000003	0X800000003	0X800000003	0X800000003	0X800000003	0X800000003	0X800000003	0X800000003	0X800000003	0X800000003	0X800000003
0X002800575	0X007F20D53	0X012360939	0X004360575	0X00581059E	0X400000000	0X006E606CE	0X400000000	0X0084302EA	0X400000000	0X0081A02F8	0X400000000
0X0077B07CD	0X00AE50DA5	0X005E41474	0X001AE05A7	0X0018E06F5	0X400000000	0X002ED0844	0X400000000	0X006EB0198	0X400000000	0X0082E0990	0X400000000
0X004D904D9	0X0052D052D	0X00EE30EE3	0X001880188	0X002DE02DE	0X400000000	0X001970197	0X400000000	0X006CC06CC	0X400000000	0X001980198	0X400000000
0X800000004	0X800000004	0X800000004	0X800000004	0X800000004	0X800000004	0X800000004	0X800000004	0X800000004	0X800000004	0X800000004	0X800000004
0X005930593	0X008E008E0	0X00CA10CA1	0X0032B032B	0X004720472	0X400000000	0X005BC05BC	0X400000000	0X005BC05BC	0X400000000	0X007090709	0X400000000
0X800000005	0X800000005	0X800000005	0X800000005	0X800000005	0X800000005	0X800000005	0X800000005	0X800000005	0X800000005	0X800000005	0X800000005
0X800000006	0X800000006	0X800000006	0X800000006	0X800000006	0X800000006	0X800000006	0X800000006	0X800000006	0X800000006	0X800000006	0X800000006
0X0055C055C	0X0087C087C	0X00C3C0C3C	0X002F602F6	0X0043B043B	0X400000000	0X005840584	0X400000000	0X005840584	0X400000000	0X006CF06CF	0X400000000
0X800000007	0X800000007	0X800000007	0X800000007	0X800000007	0X800000007	0X800000007	0X800000007	0X800000007	0X800000007	0X800000007	0X800000007
0X00354076B	0X007EF03BD	0X00938072A	0X005AA01D2	0X0030C06FE	0X400000000	0X006E50325	0X400000000	0X008520420	0X400000000	0X004620052	0X400000000
0X007A303B5	0X00D3C0668	0X004181197	0X002D60449	0X005970056	0X400000000	0X008550054	0X400000000	0X003240058	0X400000000	0X009AC0432	0X400000000
0X004D704D7	0X00DA40DA4	0X0122F122F	0X000550055	0X002EA02EA	0X400000000	0X004200420	0X400000000	0X006E806E8	0X400000000	0X008340834	0X400000000
0X800000008	0X800000008	0X800000008	0X800000008	0X800000008	0X800000008	0X800000008	0X800000008	0X800000008	0X800000008	0X800000008	0X800000008
0X0077B0574	0X00AB70D51	0X011DC0EDD	0X0044B043B	0X005910589	0X400000000	0X006DA06D6	0X400000000	0X006E006D8	0X400000000	0X00817082E	0X400000000
0X800000009	0X800000009	0X800000009	0X800000009	0X800000009	0X800000009	0X800000009	0X800000009	0X800000009	0X800000009	0X800000009	0X800000009
0X007A00389	0X0063C0D74	0X006F911FF	0X001CE05A4	0X0030706F2	0X400000000	0X0031F0842	0X400000000	0X008420320	0X400000000	0X004590992	0X400000000
0X80000000A	0X80000000A	0X80000000A	0X80000000A	0X80000000A	0X80000000A	0X80000000A	0X80000000A	0X80000000A	0X80000000A	0X80000000A	0X80000000A
0X005C105C1	0X008E408E4	0X00CAA0CAA	0X0032A032A	0X0046F046F	0X400000000	0X005B405B4	0X400000000	0X005B205B2	0X400000000	0X006FC06FC	0X400000000
0X80000000B	0X80000000B	0X80000000B	0X80000000B	0X80000000B	0X80000000B	0X80000000B	0X80000000B	0X80000000B	0X80000000B	0X80000000B	0X80000000B
0X80000000C	0X80000000C	0X80000000C	0X80000000C	0X80000000C	0X80000000C	0X80000000C	0X80000000C	0X80000000C	0X80000000C	0X80000000C	0X80000000C
0X0034D079A	0X003820D6E	0X003D411F4	0X0004A05A3	0X006F4004A	0X400000000	0X0004B0846	0X400000000	0X00049084B	0X400000000	0X0099A0046	0X400000000
0X80000000D	0X80000000D	0X80000000D	0X80000000D	0X80000000D	0X80000000D	0X80000000D	0X80000000D	0X80000000D	0X80000000D	0X80000000D	0X80000000D
0X80000000E	0X80000000E	0X80000000E	0X80000000E	0X80000000E	0X80000000E	0X80000000E	0X80000000E	0X80000000E	0X80000000E	0X80000000E	0X80000000E
0X005010359	0X00665081D	0X007250946	0X001D40195	0X0030C06FD	0X400000000	0X00854042B	0X400000000	0X003290853	0X400000000	0X002DF09AB	0X400000000
0X007A0038A	0X006090D74	0X011FF06CA	0X002DE05A9	0X001A202F4	0X400000000	0X0032802D3	0X400000000	0X002D0042B	0X400000000	0X004400466	0X400000000
0X80000000F	0X80000000F	0X80000000F	0X80000000F	0X80000000F	0X80000000F	0X80000000F	0X80000000F	0X80000000F	0X80000000F	0X80000000F	0X80000000F
0X002CC027C	0X003560335	0X006090396	0X001840078	0X000750192	0X400000000	0X0019E00A1	0X400000000	0X0019E019B	0X400000000	0X001A401A9	0X400000000
0X002C402C4	0X0052A052A	0X003D703D7	0X001880188	0X001900190	0X400000000	0X0019A019A	0X400000000	0X0009F009F	0X400000000	0X000990099	0X400000000
0X800000010	0X800000010	0X800000010	0X800000010	0X800000010	0X800000010	0X800000010	0X800000010	0X800000010	0X800000010	0X800000010	0X800000010
0X00497038B	0X0009403B7	0X000870E49	0X0004A0434	0X0057B0046	0X400000000	0X006CD0323	0X400000000	0X0004406D0	0X400000000	0X000400039	0X400000000
0X000720353	0X009FE063A	0X0040C0721	0X001D10033	0X0057E0037	0X400000000	0X0003A06CA	0X400000000	0X006C90038	0X400000000	0X0081B045D	0X400000000
0X004940494	0X00A030A03	0X00E510E51	0X004300430	0X003080308	0X400000000	0X000430043	0X400000000	0X003210321	0X400000000	0X0081C081C	0X400000000
0X800000011	0X800000011	0X800000011	0X800000011	0X800000011	0X800000011	0X800000011	0X800000011	0X800000011	0X800000011	0X800000011	0X800000011
0X0056405C4	0X00DA1088B	0X012310C4C	0X005B00318	0X00704032E	0X400000000	0X005870466	0X400000000	0X0085A0584	0X400000000	0X006D0047C	0X400000000
0X0079F079F	0X008E608E6	0X00CA30CA3	0X002FB02FB	0X0043F043F	0X400000000	0X0085A085A	0X400000000	0X004650465	0X400000000	0X009B309B3	0X400000000
0X800000012	0X800000012	0X800000012	0X800000012	0X800000012	0X800000012	0X800000012	0X800000012	0X800000012	0X800000012	0X800000012	0X800000012
0X00099009D	0X00D0000C8	0X014260089	0X000340574	0X00033059C	0X400000000	0X000B206E3	0X400000000	0X000B506E4	0X400000000	0X0003400BD	0X400000000
0X007280728	0X000970097	0X000BF00BF	0X000710071	0X000780078	0X400000000	0X000340034	0X400000000	0X000350035	0X400000000	0X008280828	0X400000000
0X800000013	0X800000013	0X800000013	0X800000013	0X800000013	0X800000013	0X800000013	0X800000013	0X800000013	0X800000013	0X800000013	0X800000013
0X003850385	0X0063B063B	0X007280728	0X001D501D5	0X0030E030E	0X400000000	0X003280328	0X400000000	0X003260326	0X400000000	0X004650465	0X400000000
0X800000014	0X800000014	0X800000014	0X800000014	0X800000014	0X800000014	0X800000014	0X800000014	0X800000014	0X800000014	0X800000014	0X800000014
0X002C102C1	0X003500350	0X003D103D1	0X0007A007A	0X0007D007D	0X400000000	0X000AC00AC	0X400000000	0X000B100B1	0X400000000	0X000AC00AC	0X400000000
0X800000015	0X800000015	0X800000015	0X800000015	0X800000015	0X800000015	0X800000015	0X800000015	0X800000015	0X800000015	0X800000015	0X800000015
0X00770077D	0X0035B0D54	0X0119C03E0	0X004470573	0X00591059A	0X400000000	0X006E400B9	0X400000000	0X006E000BC	0X400000000	0X0082C00BB	0X400000000
0X002F502F5	0X00D170D17	0X014751475	0X000820082	0X000870087	0X400000000	0X006DB06DB	0X400000000	0X006E206E2	0X400000000	0X008240824	0X400000000
0X800000016	0X800000016	0X800000016	0X800000016	0X800000016	0X800000016	0X800000016	0X800000016	0X800000016	0X800000016	0X800000016	0X800000016
0X007740508	0X00D440823	0X00946119F	0X0044602DD	0X0058F02F6	0X400000000	0X0042C06D8	0X400000000	0X0043306D8	0X400000000	0X0081E0447	0X400000000
0X800000017	0X800000017	0X800000017	0X800000017	0X800000017	0X800000017	0X800000017	0X800000017	0X800000017	0X800000017	0X800000017	0X800000017
0X800000018	0X800000018	0X800000018	0X800000018	0X800000018	0X800000018	0X800000018	0X800000018	0X800000018	0X800000018	0X800000018	0X800000018
0X004EB00CE	0X000FD0A56	0X00EA400F5	0X00046042C	0X00573004F	0X400000000	0X0059A0057	0X400000000	0X00058059B	0X400000000	0X006E40184	0X400000000
0X800000019	0X800000019	0X800000019	0X800000019	0X800000019	0X800000019	0X800000019	0X800000019	0X800000019	0X800000019	0X800000019	0X800000019
0X003190319	0X0037C037C	0X003D303D3	0X000520052	0X000580058	0X400000000	0X001860186	0X400000000	0X001850185	0X400000000	0X0018F018F	0X400000000
0X80000001A	0X80000001A	0X80000001A	0X80000001A	0X80000001A	0X80000001A	0X80000001A	0X80000001A	0X80000001A	0X80000001A	0X80000001A	0X80000001A
0X0034806FA	0X0063F03A5	0X013F003CE	0X001D40037	0X00039059B	0X400000000	0X006E4003D	0X400000000	0X006E80040	0X400000000	0X0082A045F	0X400000000
0X0006F038A	0X000980CCD	0X00700008B	0X005700042	0X0030B0043	0X400000000	0X003220040	0X400000000	0X0003C0325	0X400000000	0X0003C0043	0X400000000
0X80000001B	0X80000001B	0X80000001B	0X80000001B	0X80000001B	0X80000001B	0X80000001B	0X80000001B	0X80000001B	0X80000001B	0X80000001B	0X80000001B
0X80000001C	0X80000001C	0X80000001C	0X80000001C	0X80000001C	0X80000001C	0X80000001C	0X80000001C	0X80000001C	0X80000001C	0X80000001C	0X80000001C
0X80000001D	0X80000001D	0X80000001D	0X80000001D	0X80000001D	0X80000001D	0X80000001D	0X80000001D	0X80000001D	0X80000001D	0X80000001D	0X80000001D
0X000750550	0X0032A0ABF	0X00EE8037F	0X0004F0040	0X00081030E	0X400000000	0X0004606D8	0X400000000	0X006D20326	0X400000000	0X00820045C	0X400000000
0X002C8057F	0X00AF2007A	0X007080F1A	0X0043C01D6	0X005890042	0X400000000	0X000840324	0X400000000	0X006DB0086	0X400000000	0X0082A0087	0X400000000
0X0038C038C	0X006440644	0X000990099	0X0043C043C	0X005860586	0X400000000	0X006D206D2	0X400000000	0X000470047	0X400000000	0X0004A004A	0X400000000
0X80000001E	0X80000001E	0X80000001E	0X80000001E	0X80000001E	0X80000001E	0X80000001E	0X80000001E	0X80000001E	0X80000001E	0X80000001E	0X80000001E
0X0079D079D	0X00D770D77	0X012041204	0X005AC05AC	0X006FF06FF	0X400000000	0X008540854	0X400000000	0X008570857	0X400000000	0X009A909A9	0X400000000
0X80000001F	0X80000001F	0X80000001F	0X80000001F	0X80000001F	0X80000001F	0X80000001F	0X80000001F	0X80000001F	0X80000001F	0X80000001F	0X80000001F
0X0079F034E	0X00DA003B0	0X000850406	0X0004C0045	0X000430706	0X400000000	0X000460050	0X400000000	0X000440049	0X400000000	0X00050004E	0X400000000
0X0034B006A	0X0006603A8	0X0122D03F9	0X0003805B0	0X0003E004E	0X400000000	0X008610041	0X400000000	0X0004E0862	0X400000000	0X009BC003E	0X400000000
0X800000020	0X800000020	0X800000020	0X800000020	0X800000020	0X800000020	0X800000020	0X800000020	0X800000020	0X800000020	0X800000020	0X800000020
0X004990073	0X00A0A00A0	0X0009B0E5C	0X0043D0042	0X00048058C	0X400000000	0X006DF004E	0X400000000	0X006DF004C	0X400000000	0X000570834	0X400000000
0X800000021	0X800000021	0X800000021	0X800000021	0X800000021	0X800000021	0X800000021	0X800000021	0X800000021	0X800000021	0X800000021	0X800000021
0X002C902C9	0X0035A035A	0X003DB03DB	0X0007E007E	0X0007F007F	0X400000000	0X000B100B1	0X400000000	0X000AE00AE	0X400000000	0X000B000B0	0X400000000
0X800000022	0X800000022	0X800000022	0X800000022	0X800000022	0X800000022	0X800000022	0X800000022	0X800000022	0X800000022	0X800000022	0X800000022
0X0079C079C	0X00D730D73	0X011F911F9	0X005A405A4	0X006F506F5	0X400000000	0X008480848	0X400000000	0X0084A084A	0X400000000	0X0099B099B	0X400000000
0X800000023	0X800000023	0X800000023	0X800000023	0X800000023	0X800000023	0X800000023	0X800000023	0X800000023	0X800000023	0X800000023	0X800000023
0X0031E0764	0X003800AC7	0X003F5118A	0X0004C0446	0X001970597	0X400000000	0X0005806E8	0X400000000	0X0005A01A9	0X400000000	0X0083A0048	0X400000000
0X00347034D	0X0038B03A4	0X003D503E6	0X0004C0059	0X0004E0051	0X400000000	0X0005E004F	0X400000000	0X0005E06EB	0X400000000	0X002DF005E	0X400000000
0X0034C034C	0X003B803B8	0X004160416	0X001880188	0X0005C005C	0X400000000	0X001A801A8	0X400000000	0X000500050	0X400000000	0X0005E005E	0X400000000
0X800000024	0X800000024	0X800000024	0X800000024	0X800000024	0X800000024	0X800000024	0X800000024	0X800000024	0X800000024	0X800000024	0X800000024
0X0009F02D0	0X000C60337	0X000E003EC	0X000540433	0X000840063	0X400000000	0X006CF0092	0X400000000	0X006D10054	0X400000000	0X000800094	0X400000000
0X005440358	0X00AB00393	0X00ED403BC	0X000600054	0X000540580	0X400000000	0X000820053	0X400000000	0X000920082	0X400000000	0X0004F0821	0X400000000
0X800000025	0X800000025	0X800000025	0X800000025	0X800000025	0X800000025	0X800000025	0X800000025	0X800000025	0X800000025	0X800000025	0X800000025
0X800000026	0X800000026	0X800000026	0X800000026	0X800000026	0X800000026	0X800000026	0X800000026	0X800000026	0X800000026	0X800000026	0X800000026
0X004FD04FD	0X008180818	0X0093E093E	0X002DD02DD	0X002F502F5	0X400000000	0X0042C042C	0X400000000	0X0042D042D	0X400000000	0X004440444	0X400000000
0X800000027	0X800000027	0X800000027	0X800000027	0X800000027	0X800000027	0X800000027	0X800000027	0X800000027	0X800000027	0X800000027	0X800000027
0X003440344	0X003A403A4	0X003F503F5	0X000470047	0X000460046	0X400000000	0X000480048	0X400000000	0X000480048	0X400000000	0X000460046	0X400000000
0X800000028	0X800000028	0X800000028	0X800000028	0X800000028	0X800000028	0X800000028	0X800000028	0X800000028	0X800000028	0X800000028	0X800000028
0X800000029	0X800000029	0X800000029	0X800000029	0X800000029	0X800000029	0X800000029	0X800000029	0X800000029	0X800000029	0X800000029	0X800000029
0X00765056D	0X00CD40ACA	0X013F7118B	0X0043E042E	0X005990589	0X400000000	0X006C506D3	0X400000000	0X006D406C6	0X400000000	0X008150825	0X400000000
0X006FB06FB	0X00AAE0AAE	0X00ECF0ECF	0X005720572	0X005780578	0X400000000	0X006E206E2	0X400000000	0X006E306E3	0X400000000	0X0081D081D	0X400000000
0X80000002A	0X80000002A	0X80000002A	0X80000002A	0X80000002A	0X80000002A	0X80000002A	0X80000002A	0X80000002A	0X80000002A	0X80000002A	0X80000002A
0X0049A02B8	0X00D2E0A31	0X0147C0E59	0X005740192	0X0058A059B	0X400000000	0X006E001A1	0X400000000	0X006E001A2	0X400000000	0X001A60824	0X400000000
0X007530753	0X005690569	0X0062A062A	0X0043C043C	0X0019A019A	0X400000000	0X006DF06DF	0X400000000	0X006E006E0	0X400000000	0X008330833	0X400000000
0X80000002B	0X80000002B	0X80000002B	0X80000002B	0X80000002B	0X80000002B	0X80000002B	0X80000002B	0X80000002B	0X80000002B	0X80000002B	0X80000002B
0X002C80326	0X003890354	0X003D803E3	0X0007F0054	0X000830056	0X400000000	0X000B80056	0X400000000	0X000B9005A	0X400000000	0X0005700BC	0X400000000
0X80000002C	0X80000002C	0X80000002C	0X80000002C	0X80000002C	0X80000002C	0X80000002C	0X80000002C	0X80000002C	0X80000002C	0X80000002C	0X80000002C
0X0027F0779	0X00D2A052A	0X0144C0609	0X001870573	0X00190059C	0X400000000	0X0019806E4	0X400000000	0X006E8019A	0X400000000	0X001A00829	0X400000000
0X80000002D	0X80000002D	0X80000002D	0X80000002D	0X80000002D	0X80000002D	0X80000002D	0X80000002D	0X80000002D	0X80000002D	0X80000002D	0X80000002D
0X003200353	0X005300387	0X003E10412	0X0018702F6	0X0005C004C	0X400000000	0X00051019C	0X400000000	0X001A10053	0X400000000	0X0005602E2	0X400000000
0X000790533	0X008530080	0X00C1005E9	0X0018D0057	0X001960198	0X400000000	0X005870180	0X400000000	0X001810589	0X400000000	0X001A40184	0X400000000
0X002800280	0X003BA03BA	0X0007E007E	0X000480048	0X0043C043C	0X400000000	0X001AA01AA	0X400000000	0X001AC01AC	0X400000000	0X006D006D0	0X400000000
0X80000002E	0X80000002E	0X80000002E	0X80000002E	0X80000002E	0X80000002E	0X80000002E	0X80000002E	0X80000002E	0X80000002E	0X80000002E	0X80000002E
0X004FD0364	0X0061905F7	0X0095406DE	0X002D702DC	0X001AA02F2	0X400000000	0X0042F0430	0X400000000	0X0042C02D9	0X400000000	0X002E2044D	0X400000000
0X003690369	0X008150815	0X009390939	0X0019D019D	0X002F402F4	0X400000000	0X002D902D9	0X400000000	0X004310431	0X400000000	0X004460446	0X400000000
0X80000002F	0X80000002F	0X80000002F	0X80000002F	0X80000002F	0X80000002F	0X80000002F	0X80000002F	0X80000002F	0X80000002F	0X80000002F	0X80000002F
0X0028000A5	0X000AA0529	0X005E0009F	0X00189003A	0X000370193	0X400000000	0X00034019D	0X400000000	0X0003301A1	0X400000000	0X001A60030	0X400000000
0X800000030	0X800000030	0X800000030	0X800000030	0X800000030	0X800000030	0X800000030	0X800000030	0X800000030	0X800000030	0X800000030	0X800000030
0X800000031	0X800000031	0X800000031	0X800000031	0X800000031	0X800000031	0X800000031	0X800000031	0X800000031	0X800000031	0X800000031	0X800000031
0X002C600C5	0X000C8034D	0X000C003A2	0X000450046	0X000730594	0X400000000	0X006DD0073	0X400000000	0X0005E0073	0X400000000	0X008250070	0X400000000
0X0074B074B	0X00D1F0D1F	0X011A811A8	0X0044A044A	0X0004F004F	0X400000000	0X0005A005A	0X400000000	0X006E006E0	0X400000000	0X0018C018C	0X400000000
0X800000032	0X800000032	0X800000032	0X800000032	0X800000032	0X800000032	0X800000032	0X800000032	0X800000032	0X800000032	0X800000032	0X800000032
